[
 {
  "address": "0x1013B1B83A305e6108c6e2eE4dB7Ea087C8cC846",
  "products": [
   53
  ]
 },
 {
  "address": "0x46b5190Cd713B5F3b8b6cf8E1c9A9cD1Ca86B6C4",
  "products": [
   53
  ]
 },
 {
  "address": "0x2d566f4Fcd73c9d8B47bE56F7218Dce472217227",
  "products": [
   53
  ]
 },
 {
  "address": "0x53300914bD9328A022EF4A841DE04cB8eB911C10",
  "products": [
   53,
   50,
   50
  ]
 },
 {
  "address": "0xA3447da1B58de4D7fE32d75de5DA6be21Ea0b14a",
  "products": [
   53
  ]
 },
 {
  "address": "0x985012eF731441B8C37CbBda6B2D3a788A0A49a3",
  "products": [
   53
  ]
 },
 {
  "address": "0x8fb93daC632fd750485de873691107dcDf42fCc2",
  "products": [
   53,
   51
  ]
 },
 {
  "address": "0x5A6bdC17B9F89Cb52b38dad319dF293b037a43d4",
  "products": [
   53
  ]
 },
 {
  "address": "0xAF82128406612dC3035121012a83D8aeB831F8Be",
  "products": [
   53
  ]
 },
 {
  "address": "0x0Eb0332Ca73Cd4aE313814F252413a8bE0CFa61b",
  "products": [
   53,
   51
  ]
 },
 {
  "address": "0x8f068ad90b10f937784CA1a21607AEa3db256283",
  "products": [
   53
  ]
 },
 {
  "address": "0xAC7D21178064c1863ACc5Dc49D7B53866dd735c8",
  "products": [
   53
  ]
 },
 {
  "address": "0x65EF9B19a74a6F86c1f0122ecF7381F6E7F85c8F",
  "products": [
   53
  ]
 },
 {
  "address": "0x8ccEE15f308d0Dc3B6c33E843F0DdAc48a2651f0",
  "products": [
   53
  ]
 },
 {
  "address": "0x0aA833F9c35Bc7cdE9D44e446e5e74D3A30127C8",
  "products": [
   53
  ]
 },
 {
  "address": "0x9868A8085065C0a64A98F0dB90630fB8e2319807",
  "products": [
   53
  ]
 },
 {
  "address": "0x7fd7F10B74fbe818e3a4fDfC203D22770999F29e",
  "products": [
   53
  ]
 },
 {
  "address": "0x157a0A3C1598c112f44Ee7F5549454917CE755BC",
  "products": [
   53
  ]
 },
 {
  "address": "0x23Ef14C07f2Bb9cFb4e9bA929409e4f824b340eD",
  "products": [
   53,
   51,
   50
  ]
 },
 {
  "address": "0x745eE90554c66D2B96eE59ce165A83b96af43582",
  "products": [
   53,
   53
  ]
 },
 {
  "address": "0x5Be228c6988249C669b835f261F5E4eaAd977A56",
  "products": [
   53,
   52
  ]
 },
 {
  "address": "0x083578AcDA99E03B2E716676366577269943C980",
  "products": [
   53
  ]
 },
 {
  "address": "0xFD7De6AE185E637ED8b1DF9D407cC5BD9DAee6e3",
  "products": [
   53
  ]
 },
 {
  "address": "0x1D1F53053B122C7E46470Cc2097b73AE93eA9517",
  "products": [
   53
  ]
 },
 {
  "address": "0x94bdEf3293400923Dcb3B920991a6c0A336451e4",
  "products": [
   53
  ]
 },
 {
  "address": "0xC243e84cE5a99a19C984c4B936b4F9535A3FE74d",
  "products": [
   53
  ]
 },
 {
  "address": "0xE0DB20a58E523DcB0c9995BCBCd4D1CA55bDE4Cf",
  "products": [
   53
  ]
 },
 {
  "address": "0x703D2Bd7A0455beB48407e2C64801b752e84F003",
  "products": [
   53,
   51,
   51
  ]
 },
 {
  "address": "0x916E899605F8aD61cd81D0A72412DC190A311529",
  "products": [
   52
  ]
 },
 {
  "address": "0xe7B4C3E92C4e6167248fB28cb8C94d016235Ef7C",
  "products": [
   52
  ]
 },
 {
  "address": "0x7a1d9C3156734E2811D67042c77D82265eF754Fa",
  "products": [
   52
  ]
 },
 {
  "address": "0x3c46D1a3F921db9b0da1046DFfd85953ca2436e1",
  "products": [
   52
  ]
 },
 {
  "address": "0x094AD945b6dd107B9B348D33DB6A693556973F2F",
  "products": [
   52
  ]
 },
 {
  "address": "0x4FA7eC6C3AdF668598908c339C4AC229Cb03B56c",
  "products": [
   52
  ]
 },
 {
  "address": "0x6FBa1e533DD90ffc2ac859D2e2CD1FaB8ec7E2e3",
  "products": [
   52,
   51
  ]
 },
 {
  "address": "0x656b7535f6928ba2Ac8b39a6b7AAb270905cFB5E",
  "products": [
   52
  ]
 },
 {
  "address": "0x0F941499dd42a77F5B3afAd04594Bf3765038c6C",
  "products": [
   52
  ]
 },
 {
  "address": "0x554b544283ACCE10D4092Cf96fACFCAF1A844BCA",
  "products": [
   52
  ]
 },
 {
  "address": "0x0a184D4931dA04c3D5B9b2B329cAAB3F1D0C2916",
  "products": [
   52
  ]
 },
 {
  "address": "0xBd618EBC4d53aCA230708061D2daD5AA7534DDe5",
  "products": [
   52
  ]
 },
 {
  "address": "0x3E4dA3c08A8C6B3103CA96DDD0f960e33600805a",
  "products": [
   52
  ]
 },
 {
  "address": "0xDfB2f356A7B0ee69bC671c12A20aa38cFdaA623D",
  "products": [
   52
  ]
 },
 {
  "address": "0x581f9E46DE26A49f4ea5CD338a8DDd364959448F",
  "products": [
   52
  ]
 },
 {
  "address": "0xa1C970AF1709B5b16E10FF632a314fE929986035",
  "products": [
   52
  ]
 },
 {
  "address": "0x9C6B8eC6B26348D4F4Bf768Ef2814906E390372d",
  "products": [
   52
  ]
 },
 {
  "address": "0x5D393EcE709B325F8000a704a2BCE8926661957E",
  "products": [
   52
  ]
 },
 {
  "address": "0xD20A5Ed671A97C3FD026E0bBBFC819D770bEa89f",
  "products": [
   52
  ]
 },
 {
  "address": "0x823C43deD49E7C9739530E342169dAd8E0f12010",
  "products": [
   52
  ]
 },
 {
  "address": "0xffce232cCA484CE566FB3982D416eCDE2a5F25Fa",
  "products": [
   52
  ]
 },
 {
  "address": "0xB7e7bCCE16D5081e10F187aE571F863DA9DBf790",
  "products": [
   52
  ]
 },
 {
  "address": "0x35Fa4937c0112b2D6e700FFA859F5eEA3cAD3845",
  "products": [
   52,
   51
  ]
 },
 {
  "address": "0x55664c7a8086b25505EC61635124D7E9AC946b90",
  "products": [
   52
  ]
 },
 {
  "address": "0x9f4E3e81F16682Ba4D63a882C3A81d9c96aB030d",
  "products": [
   52
  ]
 },
 {
  "address": "0x70D1F573C07354aD8aD0C111E62a4bdb0c56e805",
  "products": [
   52,
   51
  ]
 },
 {
  "address": "0x32F69c006EAaf26FafC2Ae8d30521E03b8b1221E",
  "products": [
   52
  ]
 },
 {
  "address": "0x9233F82C8a7f58296c8Ec69939Ec5d08ddB070a0",
  "products": [
   52
  ]
 },
 {
  "address": "0xdC2752A33079eDAd0f83Bc821ba2e7dB9dEC9813",
  "products": [
   52
  ]
 },
 {
  "address": "0xD4D595799305065BFf70Da7b4A50729cfa07353D",
  "products": [
   52
  ]
 },
 {
  "address": "0xC2E6e5bE2559FFA6EE740c84afb6f62AB66Cf6f6",
  "products": [
   52
  ]
 },
 {
  "address": "0x82204c4c4Fe420FA664d4c0a33ad7360b716DC0F",
  "products": [
   52
  ]
 },
 {
  "address": "0x0FFB75Fd5C2e56176aE29116dBa9bE8229fa4d1e",
  "products": [
   52
  ]
 },
 {
  "address": "0x90D546aBE1978CD69eD54Ea975648fe455A83766",
  "products": [
   51,
   51
  ]
 },
 {
  "address": "0xECf0C63b559427ff5e75E1eE3C3e82D2a77c2C3C",
  "products": [
   51
  ]
 },
 {
  "address": "0xb95754EE79B9D472755B79c7a6747Bf87e8D8294",
  "products": [
   51
  ]
 },
 {
  "address": "0xe888D99e19eE49f733F1cA350071f0A80bC0c77b",
  "products": [
   51
  ]
 },
 {
  "address": "0x6dE38A4331B8B2c14D6AAee1dB593a092c3eC5F4",
  "products": [
   51,
   51,
   51
  ]
 },
 {
  "address": "0xA082d5314fa1A1f804EE58563C7cE04667F1C6A1",
  "products": [
   51
  ]
 },
 {
  "address": "0x24C9281e8fA7fB8636fdaf8CED888ea533B20807",
  "products": [
   51
  ]
 },
 {
  "address": "0x288Fb6Be537B8f2dBa6AfF9eD64FE4AA8d2255c1",
  "products": [
   51
  ]
 },
 {
  "address": "0xa6eC16279D7E7674448B3699A2210134957A7C98",
  "products": [
   51
  ]
 },
 {
  "address": "0xFf6F0C4396c12c487fC2F1998040736e6D6FE91A",
  "products": [
   51,
   51
  ]
 },
 {
  "address": "0xea4BBd1EF0439E9d762396ff3767A0B7e87141a4",
  "products": [
   51
  ]
 },
 {
  "address": "0x8e8B949c5AF4c70feF1cCbA076ca92b9e5d6B995",
  "products": [
   51,
   51
  ]
 },
 {
  "address": "0x27C91AEEd9951f6A249331b1137F12233dC6F7d8",
  "products": [
   51
  ]
 },
 {
  "address": "0x0f0Fbc8C1Ae0eFd4B430b0180a56E7D61134659a",
  "products": [
   51
  ]
 },
 {
  "address": "0x85c46d52Faa943C8af622dFd246E16bFe4B8059A",
  "products": [
   51
  ]
 },
 {
  "address": "0x378d3394B03ee2a72FBfa0aBa9BB2931De9B09a5",
  "products": [
   51
  ]
 },
 {
  "address": "0x2058E4f68Bf5d22e3Da6aCE4A411e1bbE0001516",
  "products": [
   51
  ]
 },
 {
  "address": "0x7012b04EfBd965343A6071e531C33eC57e949d90",
  "products": [
   51
  ]
 },
 {
  "address": "0x20645b5a8fB7ED914cb5fc0bA2C8732044A8ca64",
  "products": [
   51
  ]
 },
 {
  "address": "0xec70429f129BF805503cB6bba4cF0Fed33dfc908",
  "products": [
   51
  ]
 },
 {
  "address": "0x1Cf17c75D1412156FBbffE1E60641433AC81E084",
  "products": [
   51
  ]
 },
 {
  "address": "0x28C12F487F5DD1b27583670157553ddB10ACBc9F",
  "products": [
   51
  ]
 },
 {
  "address": "0x548A9eefc5337598d303E62F38c06c9d90a9D570",
  "products": [
   51
  ]
 },
 {
  "address": "0x1Aae29303E00ca5cc6Ea555b1cf50d18e10bD77c",
  "products": [
   51
  ]
 },
 {
  "address": "0x49a7025C61B2EDa725F51759fc154BbAf1041DEE",
  "products": [
   51
  ]
 },
 {
  "address": "0x551195F13875b6b18200769407aeC59d83E17823",
  "products": [
   51
  ]
 },
 {
  "address": "0x3B55630a0103a6b5ae805771CEd4C0dDa25EbA14",
  "products": [
   51
  ]
 },
 {
  "address": "0xc538c567D20cE1DEf158D99eD33a877dfb200a92",
  "products": [
   51
  ]
 },
 {
  "address": "0x8C04B466AC0E30CA236992500b6B10a6CeB6fa63",
  "products": [
   51
  ]
 },
 {
  "address": "0x1d404ECb104984829322DCB9614cDA2B7761da73",
  "products": [
   51
  ]
 },
 {
  "address": "0x4A9Da67E0C064eAd02d70F4440f783FcFD096Cf5",
  "products": [
   51,
   50
  ]
 },
 {
  "address": "0xA0AAfD7580dB8aeE6b77e944cd6736c9d16F57E6",
  "products": [
   51
  ]
 },
 {
  "address": "0x3E6A3a83F42e753c4A053f3d4850B117DEe82b62",
  "products": [
   51
  ]
 },
 {
  "address": "0x7DE920233609900BCbe5583F241371D2Ed2e7916",
  "products": [
   51
  ]
 },
 {
  "address": "0x80555e43ddA0D8575Cd93CFD8D03060063901656",
  "products": [
   51
  ]
 },
 {
  "address": "0xB70c080FE1BE3dfD092cF970c541c90dd1Cb59Dc",
  "products": [
   51
  ]
 },
 {
  "address": "0xf7C7760413C0F7a8dE0a34DC2413cCD172444ee6",
  "products": [
   51
  ]
 },
 {
  "address": "0x5b6EcBcFF5Ab608F7d3cfe73b5607283Da177cc6",
  "products": [
   51
  ]
 },
 {
  "address": "0xa87975A36ea63B4D0C1346F7b9d596F694934577",
  "products": [
   51
  ]
 },
 {
  "address": "0xCDA646C9f168f8F76875F8f156CA0Ea51691E3DB",
  "products": [
   51
  ]
 },
 {
  "address": "0x0137Ef492d39EfE82F540569769ea846612dfCA9",
  "products": [
   51
  ]
 },
 {
  "address": "0x7F7b868964ac33B2d67Fe89043D00d3b0cD02Df8",
  "products": [
   51
  ]
 },
 {
  "address": "0x15090d06D7Cfcb8DbFcB2051D103A9f17dae04F8",
  "products": [
   51
  ]
 },
 {
  "address": "0x34b8B6dF3814af85829107E2c33D32379F24f771",
  "products": [
   51
  ]
 },
 {
  "address": "0xE138AbB7a7370DaD933266431c285A73942AcEd9",
  "products": [
   51
  ]
 },
 {
  "address": "0x2DCdDEc03662c28752040127966Aa565FF1c7844",
  "products": [
   50
  ]
 },
 {
  "address": "0xcFdf55A70919AA63fF22f27ECBd05F0203D83e3A",
  "products": [
   50
  ]
 },
 {
  "address": "0xe9f07aD433E44d154D7665aFac585dC60dE0FcD4",
  "products": [
   50
  ]
 },
 {
  "address": "0x35A300d4B94eD5F52E765f305970748Ce9e10d68",
  "products": [
   50
  ]
 },
 {
  "address": "0xFfe5211886e8Ea7e84a2d904f5e16D800F6a8Ee5",
  "products": [
   50
  ]
 },
 {
  "address": "0x59D25e475c1A8E64b19e4720fD5147B8D3B63bC4",
  "products": [
   50
  ]
 },
 {
  "address": "0x35a75514529C076aaCA3441c271EDe2B992eB0e5",
  "products": [
   50
  ]
 },
 {
  "address": "0xAB2c4B8DBF877eB76B0260B7A4aa48781b1fA6a0",
  "products": [
   50
  ]
 },
 {
  "address": "0x0869a6ec0374341655A18aE98AAa3CF4c0a46776",
  "products": [
   50
  ]
 },
 {
  "address": "0x33cf30c5728F0A29991fb4650c18810fc1B2D957",
  "products": [
   50
  ]
 },
 {
  "address": "0x3405b61aFF8d6a392d199f9709B7197F3007C8F2",
  "products": [
   50
  ]
 },
 {
  "address": "0x52321511FC4dDFB8862877BdfbFB3e9d837F1C54",
  "products": [
   50
  ]
 },
 {
  "address": "0xBbAf06B1d6F39cbB5E723628edA5D7110AEd22cA",
  "products": [
   50
  ]
 },
 {
  "address": "0x50485b9604d28d93dC1E8cf738cE5cf4586Cac4c",
  "products": [
   50
  ]
 },
 {
  "address": "0xdAE19b87A092789C1Db4536F7215D7641C2c21b7",
  "products": [
   50
  ]
 },
 {
  "address": "0x729Cbfa695193f15b463714DC822266276A0Dc6d",
  "products": [
   50
  ]
 }
]