{
    "proxy_address": "0x46Ec5F3b5d965072023E98f98A02ce46AEe473c6",
    "csf_address": "0xba5b7e64bae1f953816b9f3a7de6b5b5378f9fb8",
    "storage_at_result": "0xba5b7e64bae1f953816b9f3a7de6b5b5378f9fb8"
}