{
	"trailingSlash": false,
	"headers": [
		{
			"source": "/service-worker.js",
			"headers" : [
				{
					"key" : "Cache-Control",
					"value" : "public, max-age=0, must-revalidate"
				}
			]
		},
		{
			"source": "/manifest.json",
			"headers" : [
				{
					"key" : "Cache-Control",
					"value" : "public, max-age=0, must-revalidate"
				}
			]
		},
		{
			"source": "/static/config.json",
			"headers" : [
				{
					"key" : "Cache-Control",
					"value" : "public, max-age=0, must-revalidate"
				}
			]
		}
	],
	"rewrites": [
		{ "source": "/favicon.ico", "destination": "/img/icons/favicon.ico" },
		{ "source": "/favicon-16x16.ico", "destination": "/img/icons/favicon-16x16.ico" },
		{ "source": "/favicon-32x32.ico", "destination": "/img/icons/favicon-32x32.ico" },
		{ "source": "/service-worker.js", "destination": "/js/service-worker.js" },
		{ "source": "/manifest.json", "destination": "/static/manifest.json" },
		{ "source": "/robots.txt", "destination": "/static/robots.txt" },

		{ "source": "/static/:match*", "destination": "/html/:match*" },
		{ "source": "/js/:match*", "destination": "/js/:match*" },
		{ "source": "/css/:match*", "destination": "/css/:match*" },
		{ "source": "/img/:match*", "destination": "/img/:match*" },
		{
			"source": "/((?!js/)(?!css/)(?!img/)(?!static/)(?!html/).*)",
			"destination": "/html/index.html"
		}
	]
}
