{
  "images" : [
    {
      "idiom" : "universal",
      "filename" : "logo-inverse-1bc7ea97315b854f03127163ff280b1023b58468a8bfd524a0ff60d2a9dcb10e.png",
      "scale" : "1x"
    },
    {
      "idiom" : "universal",
      "scale" : "2x"
    },
    {
      "idiom" : "universal",
      "scale" : "3x"
    }
  ],
  "info" : {
    "version" : 1,
    "author" : "xcode"
  }
}