{
  "ABIRoot": {
    "kind": "Root",
    "name": "TopLevel",
    "printedName": "TopLevel",
    "children": [
      {
        "kind": "Import",
        "name": "Foundation",
        "printedName": "Foundation",
        "declKind": "Import",
        "moduleName": "DZDemoApplicationCommonIMA",
        "declAttributes": [
          "RawDocComment"
        ]
      },
      {
        "kind": "Import",
        "name": "UIKit",
        "printedName": "UIKit",
        "declKind": "Import",
        "moduleName": "DZDemoApplicationCommonIMA"
      },
      {
        "kind": "Import",
        "name": "AVKit",
        "printedName": "AVKit",
        "declKind": "Import",
        "moduleName": "DZDemoApplicationCommonIMA"
      },
      {
        "kind": "Import",
        "name": "AVFoundation",
        "printedName": "AVFoundation",
        "declKind": "Import",
        "moduleName": "DZDemoApplicationCommonIMA"
      },
      {
        "kind": "Import",
        "name": "os",
        "printedName": "os",
        "declKind": "Import",
        "moduleName": "DZDemoApplicationCommonIMA"
      },
      {
        "kind": "Import",
        "name": "GoogleInteractiveMediaAds",
        "printedName": "GoogleInteractiveMediaAds",
        "declKind": "Import",
        "moduleName": "DZDemoApplicationCommonIMA"
      },
      {
        "kind": "TypeDecl",
        "name": "DZAdDataIMA",
        "printedName": "DZAdDataIMA",
        "children": [
          {
            "kind": "Var",
            "name": "delegate",
            "printedName": "delegate",
            "children": [
              {
                "kind": "TypeNominal",
                "name": "Optional",
                "printedName": "DZDemoApplicationCommonIMA.PlayersViewControllerAdProtocol?",
                "children": [
                  {
                    "kind": "TypeNominal",
                    "name": "PlayersViewControllerAdProtocol",
                    "printedName": "DZDemoApplicationCommonIMA.PlayersViewControllerAdProtocol",
                    "usr": "s:26DZDemoApplicationCommonIMA31PlayersViewControllerAdProtocolP"
                  }
                ],
                "usr": "s:Sq"
              }
            ],
            "declKind": "Var",
            "usr": "s:26DZDemoApplicationCommonIMA08DZAdDataD0C8delegateAA31PlayersViewControllerAdProtocol_pSgvp",
            "mangledName": "$s26DZDemoApplicationCommonIMA08DZAdDataD0C8delegateAA31PlayersViewControllerAdProtocol_pSgvp",
            "moduleName": "DZDemoApplicationCommonIMA",
            "declAttributes": [
              "HasInitialValue",
              "HasStorage",
              "AccessControl"
            ],
            "hasStorage": true,
            "accessors": [
              {
                "kind": "Accessor",
                "name": "Get",
                "printedName": "Get()",
                "children": [
                  {
                    "kind": "TypeNominal",
                    "name": "Optional",
                    "printedName": "DZDemoApplicationCommonIMA.PlayersViewControllerAdProtocol?",
                    "children": [
                      {
                        "kind": "TypeNominal",
                        "name": "PlayersViewControllerAdProtocol",
                        "printedName": "DZDemoApplicationCommonIMA.PlayersViewControllerAdProtocol",
                        "usr": "s:26DZDemoApplicationCommonIMA31PlayersViewControllerAdProtocolP"
                      }
                    ],
                    "usr": "s:Sq"
                  }
                ],
                "declKind": "Accessor",
                "usr": "s:26DZDemoApplicationCommonIMA08DZAdDataD0C8delegateAA31PlayersViewControllerAdProtocol_pSgvg",
                "mangledName": "$s26DZDemoApplicationCommonIMA08DZAdDataD0C8delegateAA31PlayersViewControllerAdProtocol_pSgvg",
                "moduleName": "DZDemoApplicationCommonIMA",
                "implicit": true,
                "accessorKind": "get"
              },
              {
                "kind": "Accessor",
                "name": "Set",
                "printedName": "Set()",
                "children": [
                  {
                    "kind": "TypeNominal",
                    "name": "Void",
                    "printedName": "()"
                  },
                  {
                    "kind": "TypeNominal",
                    "name": "Optional",
                    "printedName": "DZDemoApplicationCommonIMA.PlayersViewControllerAdProtocol?",
                    "children": [
                      {
                        "kind": "TypeNominal",
                        "name": "PlayersViewControllerAdProtocol",
                        "printedName": "DZDemoApplicationCommonIMA.PlayersViewControllerAdProtocol",
                        "usr": "s:26DZDemoApplicationCommonIMA31PlayersViewControllerAdProtocolP"
                      }
                    ],
                    "usr": "s:Sq"
                  }
                ],
                "declKind": "Accessor",
                "usr": "s:26DZDemoApplicationCommonIMA08DZAdDataD0C8delegateAA31PlayersViewControllerAdProtocol_pSgvs",
                "mangledName": "$s26DZDemoApplicationCommonIMA08DZAdDataD0C8delegateAA31PlayersViewControllerAdProtocol_pSgvs",
                "moduleName": "DZDemoApplicationCommonIMA",
                "implicit": true,
                "accessorKind": "set"
              },
              {
                "kind": "Accessor",
                "name": "Modify",
                "printedName": "Modify()",
                "children": [
                  {
                    "kind": "TypeNominal",
                    "name": "Void",
                    "printedName": "()"
                  }
                ],
                "declKind": "Accessor",
                "usr": "s:26DZDemoApplicationCommonIMA08DZAdDataD0C8delegateAA31PlayersViewControllerAdProtocol_pSgvM",
                "mangledName": "$s26DZDemoApplicationCommonIMA08DZAdDataD0C8delegateAA31PlayersViewControllerAdProtocol_pSgvM",
                "moduleName": "DZDemoApplicationCommonIMA",
                "implicit": true,
                "accessorKind": "_modify"
              }
            ]
          },
          {
            "kind": "Var",
            "name": "playerId",
            "printedName": "playerId",
            "children": [
              {
                "kind": "TypeNominal",
                "name": "String",
                "printedName": "Swift.String",
                "usr": "s:SS"
              }
            ],
            "declKind": "Var",
            "usr": "s:26DZDemoApplicationCommonIMA08DZAdDataD0C8playerIdSSvp",
            "mangledName": "$s26DZDemoApplicationCommonIMA08DZAdDataD0C8playerIdSSvp",
            "moduleName": "DZDemoApplicationCommonIMA",
            "declAttributes": [
              "HasInitialValue",
              "HasStorage",
              "AccessControl"
            ],
            "hasStorage": true,
            "accessors": [
              {
                "kind": "Accessor",
                "name": "Get",
                "printedName": "Get()",
                "children": [
                  {
                    "kind": "TypeNominal",
                    "name": "String",
                    "printedName": "Swift.String",
                    "usr": "s:SS"
                  }
                ],
                "declKind": "Accessor",
                "usr": "s:26DZDemoApplicationCommonIMA08DZAdDataD0C8playerIdSSvg",
                "mangledName": "$s26DZDemoApplicationCommonIMA08DZAdDataD0C8playerIdSSvg",
                "moduleName": "DZDemoApplicationCommonIMA",
                "implicit": true,
                "accessorKind": "get"
              },
              {
                "kind": "Accessor",
                "name": "Set",
                "printedName": "Set()",
                "children": [
                  {
                    "kind": "TypeNominal",
                    "name": "Void",
                    "printedName": "()"
                  },
                  {
                    "kind": "TypeNominal",
                    "name": "String",
                    "printedName": "Swift.String",
                    "usr": "s:SS"
                  }
                ],
                "declKind": "Accessor",
                "usr": "s:26DZDemoApplicationCommonIMA08DZAdDataD0C8playerIdSSvs",
                "mangledName": "$s26DZDemoApplicationCommonIMA08DZAdDataD0C8playerIdSSvs",
                "moduleName": "DZDemoApplicationCommonIMA",
                "implicit": true,
                "accessorKind": "set"
              },
              {
                "kind": "Accessor",
                "name": "Modify",
                "printedName": "Modify()",
                "children": [
                  {
                    "kind": "TypeNominal",
                    "name": "Void",
                    "printedName": "()"
                  }
                ],
                "declKind": "Accessor",
                "usr": "s:26DZDemoApplicationCommonIMA08DZAdDataD0C8playerIdSSvM",
                "mangledName": "$s26DZDemoApplicationCommonIMA08DZAdDataD0C8playerIdSSvM",
                "moduleName": "DZDemoApplicationCommonIMA",
                "implicit": true,
                "accessorKind": "_modify"
              }
            ]
          },
          {
            "kind": "Var",
            "name": "adUrlString",
            "printedName": "adUrlString",
            "children": [
              {
                "kind": "TypeNominal",
                "name": "String",
                "printedName": "Swift.String",
                "usr": "s:SS"
              }
            ],
            "declKind": "Var",
            "usr": "s:26DZDemoApplicationCommonIMA08DZAdDataD0C11adUrlStringSSvp",
            "mangledName": "$s26DZDemoApplicationCommonIMA08DZAdDataD0C11adUrlStringSSvp",
            "moduleName": "DZDemoApplicationCommonIMA",
            "declAttributes": [
              "HasInitialValue",
              "HasStorage",
              "AccessControl"
            ],
            "hasStorage": true,
            "accessors": [
              {
                "kind": "Accessor",
                "name": "Get",
                "printedName": "Get()",
                "children": [
                  {
                    "kind": "TypeNominal",
                    "name": "String",
                    "printedName": "Swift.String",
                    "usr": "s:SS"
                  }
                ],
                "declKind": "Accessor",
                "usr": "s:26DZDemoApplicationCommonIMA08DZAdDataD0C11adUrlStringSSvg",
                "mangledName": "$s26DZDemoApplicationCommonIMA08DZAdDataD0C11adUrlStringSSvg",
                "moduleName": "DZDemoApplicationCommonIMA",
                "implicit": true,
                "accessorKind": "get"
              },
              {
                "kind": "Accessor",
                "name": "Set",
                "printedName": "Set()",
                "children": [
                  {
                    "kind": "TypeNominal",
                    "name": "Void",
                    "printedName": "()"
                  },
                  {
                    "kind": "TypeNominal",
                    "name": "String",
                    "printedName": "Swift.String",
                    "usr": "s:SS"
                  }
                ],
                "declKind": "Accessor",
                "usr": "s:26DZDemoApplicationCommonIMA08DZAdDataD0C11adUrlStringSSvs",
                "mangledName": "$s26DZDemoApplicationCommonIMA08DZAdDataD0C11adUrlStringSSvs",
                "moduleName": "DZDemoApplicationCommonIMA",
                "implicit": true,
                "accessorKind": "set"
              },
              {
                "kind": "Accessor",
                "name": "Modify",
                "printedName": "Modify()",
                "children": [
                  {
                    "kind": "TypeNominal",
                    "name": "Void",
                    "printedName": "()"
                  }
                ],
                "declKind": "Accessor",
                "usr": "s:26DZDemoApplicationCommonIMA08DZAdDataD0C11adUrlStringSSvM",
                "mangledName": "$s26DZDemoApplicationCommonIMA08DZAdDataD0C11adUrlStringSSvM",
                "moduleName": "DZDemoApplicationCommonIMA",
                "implicit": true,
                "accessorKind": "_modify"
              }
            ]
          },
          {
            "kind": "Var",
            "name": "controller",
            "printedName": "controller",
            "children": [
              {
                "kind": "TypeNominal",
                "name": "Optional",
                "printedName": "AVKit.AVPlayerViewController?",
                "children": [
                  {
                    "kind": "TypeNominal",
                    "name": "AVPlayerViewController",
                    "printedName": "AVKit.AVPlayerViewController",
                    "usr": "c:objc(cs)AVPlayerViewController"
                  }
                ],
                "usr": "s:Sq"
              }
            ],
            "declKind": "Var",
            "usr": "s:26DZDemoApplicationCommonIMA08DZAdDataD0C10controllerSo22AVPlayerViewControllerCSgvp",
            "mangledName": "$s26DZDemoApplicationCommonIMA08DZAdDataD0C10controllerSo22AVPlayerViewControllerCSgvp",
            "moduleName": "DZDemoApplicationCommonIMA",
            "declAttributes": [
              "HasInitialValue",
              "HasStorage",
              "AccessControl"
            ],
            "hasStorage": true,
            "accessors": [
              {
                "kind": "Accessor",
                "name": "Get",
                "printedName": "Get()",
                "children": [
                  {
                    "kind": "TypeNominal",
                    "name": "Optional",
                    "printedName": "AVKit.AVPlayerViewController?",
                    "children": [
                      {
                        "kind": "TypeNominal",
                        "name": "AVPlayerViewController",
                        "printedName": "AVKit.AVPlayerViewController",
                        "usr": "c:objc(cs)AVPlayerViewController"
                      }
                    ],
                    "usr": "s:Sq"
                  }
                ],
                "declKind": "Accessor",
                "usr": "s:26DZDemoApplicationCommonIMA08DZAdDataD0C10controllerSo22AVPlayerViewControllerCSgvg",
                "mangledName": "$s26DZDemoApplicationCommonIMA08DZAdDataD0C10controllerSo22AVPlayerViewControllerCSgvg",
                "moduleName": "DZDemoApplicationCommonIMA",
                "implicit": true,
                "accessorKind": "get"
              },
              {
                "kind": "Accessor",
                "name": "Set",
                "printedName": "Set()",
                "children": [
                  {
                    "kind": "TypeNominal",
                    "name": "Void",
                    "printedName": "()"
                  },
                  {
                    "kind": "TypeNominal",
                    "name": "Optional",
                    "printedName": "AVKit.AVPlayerViewController?",
                    "children": [
                      {
                        "kind": "TypeNominal",
                        "name": "AVPlayerViewController",
                        "printedName": "AVKit.AVPlayerViewController",
                        "usr": "c:objc(cs)AVPlayerViewController"
                      }
                    ],
                    "usr": "s:Sq"
                  }
                ],
                "declKind": "Accessor",
                "usr": "s:26DZDemoApplicationCommonIMA08DZAdDataD0C10controllerSo22AVPlayerViewControllerCSgvs",
                "mangledName": "$s26DZDemoApplicationCommonIMA08DZAdDataD0C10controllerSo22AVPlayerViewControllerCSgvs",
                "moduleName": "DZDemoApplicationCommonIMA",
                "implicit": true,
                "accessorKind": "set"
              },
              {
                "kind": "Accessor",
                "name": "Modify",
                "printedName": "Modify()",
                "children": [
                  {
                    "kind": "TypeNominal",
                    "name": "Void",
                    "printedName": "()"
                  }
                ],
                "declKind": "Accessor",
                "usr": "s:26DZDemoApplicationCommonIMA08DZAdDataD0C10controllerSo22AVPlayerViewControllerCSgvM",
                "mangledName": "$s26DZDemoApplicationCommonIMA08DZAdDataD0C10controllerSo22AVPlayerViewControllerCSgvM",
                "moduleName": "DZDemoApplicationCommonIMA",
                "implicit": true,
                "accessorKind": "_modify"
              }
            ]
          },
          {
            "kind": "Var",
            "name": "adEvent",
            "printedName": "adEvent",
            "children": [
              {
                "kind": "TypeNominal",
                "name": "Dictionary",
                "printedName": "[Swift.String : Any]",
                "children": [
                  {
                    "kind": "TypeNominal",
                    "name": "String",
                    "printedName": "Swift.String",
                    "usr": "s:SS"
                  },
                  {
                    "kind": "TypeNominal",
                    "name": "ProtocolComposition",
                    "printedName": "Any"
                  }
                ],
                "usr": "s:SD"
              }
            ],
            "declKind": "Var",
            "usr": "c:@M@DZDemoApplicationCommonIMA@objc(cs)DZAdDataIMA(py)adEvent",
            "mangledName": "$s26DZDemoApplicationCommonIMA08DZAdDataD0C7adEventSDySSypGvp",
            "moduleName": "DZDemoApplicationCommonIMA",
            "declAttributes": [
              "HasInitialValue",
              "HasStorage",
              "Dynamic",
              "AccessControl",
              "ObjC"
            ],
            "hasStorage": true,
            "accessors": [
              {
                "kind": "Accessor",
                "name": "Get",
                "printedName": "Get()",
                "children": [
                  {
                    "kind": "TypeNominal",
                    "name": "Dictionary",
                    "printedName": "[Swift.String : Any]",
                    "children": [
                      {
                        "kind": "TypeNominal",
                        "name": "String",
                        "printedName": "Swift.String",
                        "usr": "s:SS"
                      },
                      {
                        "kind": "TypeNominal",
                        "name": "ProtocolComposition",
                        "printedName": "Any"
                      }
                    ],
                    "usr": "s:SD"
                  }
                ],
                "declKind": "Accessor",
                "usr": "c:@M@DZDemoApplicationCommonIMA@objc(cs)DZAdDataIMA(im)adEvent",
                "mangledName": "$s26DZDemoApplicationCommonIMA08DZAdDataD0C7adEventSDySSypGvg",
                "moduleName": "DZDemoApplicationCommonIMA",
                "implicit": true,
                "declAttributes": [
                  "Dynamic",
                  "ObjC"
                ],
                "accessorKind": "get"
              },
              {
                "kind": "Accessor",
                "name": "Set",
                "printedName": "Set()",
                "children": [
                  {
                    "kind": "TypeNominal",
                    "name": "Void",
                    "printedName": "()"
                  },
                  {
                    "kind": "TypeNominal",
                    "name": "Dictionary",
                    "printedName": "[Swift.String : Any]",
                    "children": [
                      {
                        "kind": "TypeNominal",
                        "name": "String",
                        "printedName": "Swift.String",
                        "usr": "s:SS"
                      },
                      {
                        "kind": "TypeNominal",
                        "name": "ProtocolComposition",
                        "printedName": "Any"
                      }
                    ],
                    "usr": "s:SD"
                  }
                ],
                "declKind": "Accessor",
                "usr": "c:@M@DZDemoApplicationCommonIMA@objc(cs)DZAdDataIMA(im)setAdEvent:",
                "mangledName": "$s26DZDemoApplicationCommonIMA08DZAdDataD0C7adEventSDySSypGvs",
                "moduleName": "DZDemoApplicationCommonIMA",
                "implicit": true,
                "declAttributes": [
                  "Dynamic",
                  "ObjC"
                ],
                "accessorKind": "set"
              }
            ]
          },
          {
            "kind": "Constructor",
            "name": "init",
            "printedName": "init()",
            "children": [
              {
                "kind": "TypeNominal",
                "name": "DZAdDataIMA",
                "printedName": "DZDemoApplicationCommonIMA.DZAdDataIMA",
                "usr": "c:@M@DZDemoApplicationCommonIMA@objc(cs)DZAdDataIMA"
              }
            ],
            "declKind": "Constructor",
            "usr": "c:@M@DZDemoApplicationCommonIMA@objc(cs)DZAdDataIMA(im)init",
            "mangledName": "$s26DZDemoApplicationCommonIMA08DZAdDataD0CACycfc",
            "moduleName": "DZDemoApplicationCommonIMA",
            "overriding": true,
            "objc_name": "init",
            "declAttributes": [
              "Dynamic",
              "ObjC",
              "Override",
              "AccessControl"
            ],
            "init_kind": "Designated"
          },
          {
            "kind": "Constructor",
            "name": "init",
            "printedName": "init(playerContext:)",
            "children": [
              {
                "kind": "TypeNominal",
                "name": "DZAdDataIMA",
                "printedName": "DZDemoApplicationCommonIMA.DZAdDataIMA",
                "usr": "c:@M@DZDemoApplicationCommonIMA@objc(cs)DZAdDataIMA"
              },
              {
                "kind": "TypeNominal",
                "name": "String",
                "printedName": "Swift.String",
                "usr": "s:SS"
              }
            ],
            "declKind": "Constructor",
            "usr": "s:26DZDemoApplicationCommonIMA08DZAdDataD0C13playerContextACSS_tcfc",
            "mangledName": "$s26DZDemoApplicationCommonIMA08DZAdDataD0C13playerContextACSS_tcfc",
            "moduleName": "DZDemoApplicationCommonIMA",
            "declAttributes": [
              "Convenience",
              "AccessControl"
            ],
            "init_kind": "Convenience"
          },
          {
            "kind": "Function",
            "name": "requestAds",
            "printedName": "requestAds(url:controller:contentDuration:)",
            "children": [
              {
                "kind": "TypeNominal",
                "name": "Void",
                "printedName": "()"
              },
              {
                "kind": "TypeNominal",
                "name": "String",
                "printedName": "Swift.String",
                "usr": "s:SS"
              },
              {
                "kind": "TypeNominal",
                "name": "AVPlayerViewController",
                "printedName": "AVKit.AVPlayerViewController",
                "usr": "c:objc(cs)AVPlayerViewController"
              },
              {
                "kind": "TypeNominal",
                "name": "Float",
                "printedName": "Swift.Float",
                "hasDefaultArg": true,
                "usr": "s:Sf"
              }
            ],
            "declKind": "Func",
            "usr": "c:@M@DZDemoApplicationCommonIMA@objc(cs)DZAdDataIMA(im)requestAdsWithUrl:controller:contentDuration:",
            "mangledName": "$s26DZDemoApplicationCommonIMA08DZAdDataD0C10requestAds3url10controller15contentDurationySS_So22AVPlayerViewControllerCSftF",
            "moduleName": "DZDemoApplicationCommonIMA",
            "objc_name": "requestAdsWithUrl:controller:contentDuration:",
            "declAttributes": [
              "AccessControl",
              "ObjC"
            ],
            "funcSelfKind": "NonMutating"
          },
          {
            "kind": "Function",
            "name": "adsLoader",
            "printedName": "adsLoader(_:adsLoadedWith:)",
            "children": [
              {
                "kind": "TypeNominal",
                "name": "Void",
                "printedName": "()"
              },
              {
                "kind": "TypeNominal",
                "name": "IMAAdsLoader",
                "printedName": "GoogleInteractiveMediaAds.IMAAdsLoader",
                "usr": "c:objc(cs)IMAAdsLoader"
              },
              {
                "kind": "TypeNominal",
                "name": "IMAAdsLoadedData",
                "printedName": "GoogleInteractiveMediaAds.IMAAdsLoadedData",
                "usr": "c:objc(cs)IMAAdsLoadedData"
              }
            ],
            "declKind": "Func",
            "usr": "c:@CM@DZDemoApplicationCommonIMA@objc(cs)DZAdDataIMA(im)adsLoader:adsLoadedWithData:",
            "mangledName": "$s26DZDemoApplicationCommonIMA08DZAdDataD0C9adsLoader_0G10LoadedWithySo06IMAAdsH0C_So0kiF0CtF",
            "moduleName": "DZDemoApplicationCommonIMA",
            "objc_name": "adsLoader:adsLoadedWithData:",
            "declAttributes": [
              "Dynamic",
              "ObjC",
              "AccessControl"
            ],
            "isFromExtension": true,
            "funcSelfKind": "NonMutating"
          },
          {
            "kind": "Function",
            "name": "adsLoader",
            "printedName": "adsLoader(_:failedWith:)",
            "children": [
              {
                "kind": "TypeNominal",
                "name": "Void",
                "printedName": "()"
              },
              {
                "kind": "TypeNominal",
                "name": "IMAAdsLoader",
                "printedName": "GoogleInteractiveMediaAds.IMAAdsLoader",
                "usr": "c:objc(cs)IMAAdsLoader"
              },
              {
                "kind": "TypeNominal",
                "name": "IMAAdLoadingErrorData",
                "printedName": "GoogleInteractiveMediaAds.IMAAdLoadingErrorData",
                "usr": "c:objc(cs)IMAAdLoadingErrorData"
              }
            ],
            "declKind": "Func",
            "usr": "c:@CM@DZDemoApplicationCommonIMA@objc(cs)DZAdDataIMA(im)adsLoader:failedWithErrorData:",
            "mangledName": "$s26DZDemoApplicationCommonIMA08DZAdDataD0C9adsLoader_10failedWithySo06IMAAdsH0C_So017IMAAdLoadingErrorF0CtF",
            "moduleName": "DZDemoApplicationCommonIMA",
            "objc_name": "adsLoader:failedWithErrorData:",
            "declAttributes": [
              "Dynamic",
              "ObjC",
              "AccessControl"
            ],
            "isFromExtension": true,
            "funcSelfKind": "NonMutating"
          },
          {
            "kind": "Function",
            "name": "adsManager",
            "printedName": "adsManager(_:didReceive:)",
            "children": [
              {
                "kind": "TypeNominal",
                "name": "Void",
                "printedName": "()"
              },
              {
                "kind": "TypeNominal",
                "name": "IMAAdsManager",
                "printedName": "GoogleInteractiveMediaAds.IMAAdsManager",
                "usr": "c:objc(cs)IMAAdsManager"
              },
              {
                "kind": "TypeNominal",
                "name": "IMAAdEvent",
                "printedName": "GoogleInteractiveMediaAds.IMAAdEvent",
                "usr": "c:objc(cs)IMAAdEvent"
              }
            ],
            "declKind": "Func",
            "usr": "c:@CM@DZDemoApplicationCommonIMA@objc(cs)DZAdDataIMA(im)adsManager:didReceiveAdEvent:",
            "mangledName": "$s26DZDemoApplicationCommonIMA08DZAdDataD0C10adsManager_10didReceiveySo06IMAAdsH0C_So10IMAAdEventCtF",
            "moduleName": "DZDemoApplicationCommonIMA",
            "objc_name": "adsManager:didReceiveAdEvent:",
            "declAttributes": [
              "Dynamic",
              "ObjC",
              "AccessControl"
            ],
            "isFromExtension": true,
            "funcSelfKind": "NonMutating"
          },
          {
            "kind": "Function",
            "name": "adsManager",
            "printedName": "adsManager(_:didReceive:)",
            "children": [
              {
                "kind": "TypeNominal",
                "name": "Void",
                "printedName": "()"
              },
              {
                "kind": "TypeNominal",
                "name": "IMAAdsManager",
                "printedName": "GoogleInteractiveMediaAds.IMAAdsManager",
                "usr": "c:objc(cs)IMAAdsManager"
              },
              {
                "kind": "TypeNominal",
                "name": "IMAAdError",
                "printedName": "GoogleInteractiveMediaAds.IMAAdError",
                "usr": "c:objc(cs)IMAAdError"
              }
            ],
            "declKind": "Func",
            "usr": "c:@CM@DZDemoApplicationCommonIMA@objc(cs)DZAdDataIMA(im)adsManager:didReceiveAdError:",
            "mangledName": "$s26DZDemoApplicationCommonIMA08DZAdDataD0C10adsManager_10didReceiveySo06IMAAdsH0C_So10IMAAdErrorCtF",
            "moduleName": "DZDemoApplicationCommonIMA",
            "objc_name": "adsManager:didReceiveAdError:",
            "declAttributes": [
              "Dynamic",
              "ObjC",
              "AccessControl"
            ],
            "isFromExtension": true,
            "funcSelfKind": "NonMutating"
          },
          {
            "kind": "Function",
            "name": "adsManager",
            "printedName": "adsManager(_:adDidProgressToTime:totalTime:)",
            "children": [
              {
                "kind": "TypeNominal",
                "name": "Void",
                "printedName": "()"
              },
              {
                "kind": "TypeNominal",
                "name": "IMAAdsManager",
                "printedName": "GoogleInteractiveMediaAds.IMAAdsManager",
                "usr": "c:objc(cs)IMAAdsManager"
              },
              {
                "kind": "TypeNominal",
                "name": "Double",
                "printedName": "Swift.Double",
                "usr": "s:Sd"
              },
              {
                "kind": "TypeNominal",
                "name": "Double",
                "printedName": "Swift.Double",
                "usr": "s:Sd"
              }
            ],
            "declKind": "Func",
            "usr": "c:@CM@DZDemoApplicationCommonIMA@objc(cs)DZAdDataIMA(im)adsManager:adDidProgressToTime:totalTime:",
            "mangledName": "$s26DZDemoApplicationCommonIMA08DZAdDataD0C10adsManager_19adDidProgressToTime05totalM0ySo06IMAAdsH0C_S2dtF",
            "moduleName": "DZDemoApplicationCommonIMA",
            "objc_name": "adsManager:adDidProgressToTime:totalTime:",
            "declAttributes": [
              "Dynamic",
              "ObjC",
              "AccessControl"
            ],
            "isFromExtension": true,
            "funcSelfKind": "NonMutating"
          },
          {
            "kind": "Function",
            "name": "adsManager",
            "printedName": "adsManager(_:adDidBufferToMediaTime:)",
            "children": [
              {
                "kind": "TypeNominal",
                "name": "Void",
                "printedName": "()"
              },
              {
                "kind": "TypeNominal",
                "name": "IMAAdsManager",
                "printedName": "GoogleInteractiveMediaAds.IMAAdsManager",
                "usr": "c:objc(cs)IMAAdsManager"
              },
              {
                "kind": "TypeNominal",
                "name": "Double",
                "printedName": "Swift.Double",
                "usr": "s:Sd"
              }
            ],
            "declKind": "Func",
            "usr": "c:@CM@DZDemoApplicationCommonIMA@objc(cs)DZAdDataIMA(im)adsManager:adDidBufferToMediaTime:",
            "mangledName": "$s26DZDemoApplicationCommonIMA08DZAdDataD0C10adsManager_22adDidBufferToMediaTimeySo06IMAAdsH0C_SdtF",
            "moduleName": "DZDemoApplicationCommonIMA",
            "objc_name": "adsManager:adDidBufferToMediaTime:",
            "declAttributes": [
              "Dynamic",
              "ObjC",
              "AccessControl"
            ],
            "isFromExtension": true,
            "funcSelfKind": "NonMutating"
          },
          {
            "kind": "Function",
            "name": "adsManagerAdPlaybackReady",
            "printedName": "adsManagerAdPlaybackReady(_:)",
            "children": [
              {
                "kind": "TypeNominal",
                "name": "Void",
                "printedName": "()"
              },
              {
                "kind": "TypeNominal",
                "name": "IMAAdsManager",
                "printedName": "GoogleInteractiveMediaAds.IMAAdsManager",
                "usr": "c:objc(cs)IMAAdsManager"
              }
            ],
            "declKind": "Func",
            "usr": "c:@CM@DZDemoApplicationCommonIMA@objc(cs)DZAdDataIMA(im)adsManagerAdPlaybackReady:",
            "mangledName": "$s26DZDemoApplicationCommonIMA08DZAdDataD0C25adsManagerAdPlaybackReadyyySo06IMAAdsH0CF",
            "moduleName": "DZDemoApplicationCommonIMA",
            "objc_name": "adsManagerAdPlaybackReady:",
            "declAttributes": [
              "Dynamic",
              "ObjC",
              "AccessControl"
            ],
            "isFromExtension": true,
            "funcSelfKind": "NonMutating"
          },
          {
            "kind": "Function",
            "name": "adsManagerAdDidStartBuffering",
            "printedName": "adsManagerAdDidStartBuffering(_:)",
            "children": [
              {
                "kind": "TypeNominal",
                "name": "Void",
                "printedName": "()"
              },
              {
                "kind": "TypeNominal",
                "name": "IMAAdsManager",
                "printedName": "GoogleInteractiveMediaAds.IMAAdsManager",
                "usr": "c:objc(cs)IMAAdsManager"
              }
            ],
            "declKind": "Func",
            "usr": "c:@CM@DZDemoApplicationCommonIMA@objc(cs)DZAdDataIMA(im)adsManagerAdDidStartBuffering:",
            "mangledName": "$s26DZDemoApplicationCommonIMA08DZAdDataD0C29adsManagerAdDidStartBufferingyySo06IMAAdsH0CF",
            "moduleName": "DZDemoApplicationCommonIMA",
            "objc_name": "adsManagerAdDidStartBuffering:",
            "declAttributes": [
              "Dynamic",
              "ObjC",
              "AccessControl"
            ],
            "isFromExtension": true,
            "funcSelfKind": "NonMutating"
          },
          {
            "kind": "Function",
            "name": "adsManagerDidRequestContentPause",
            "printedName": "adsManagerDidRequestContentPause(_:)",
            "children": [
              {
                "kind": "TypeNominal",
                "name": "Void",
                "printedName": "()"
              },
              {
                "kind": "TypeNominal",
                "name": "IMAAdsManager",
                "printedName": "GoogleInteractiveMediaAds.IMAAdsManager",
                "usr": "c:objc(cs)IMAAdsManager"
              }
            ],
            "declKind": "Func",
            "usr": "c:@CM@DZDemoApplicationCommonIMA@objc(cs)DZAdDataIMA(im)adsManagerDidRequestContentPause:",
            "mangledName": "$s26DZDemoApplicationCommonIMA08DZAdDataD0C32adsManagerDidRequestContentPauseyySo06IMAAdsH0CF",
            "moduleName": "DZDemoApplicationCommonIMA",
            "objc_name": "adsManagerDidRequestContentPause:",
            "declAttributes": [
              "Dynamic",
              "ObjC",
              "AccessControl",
              "RawDocComment"
            ],
            "isFromExtension": true,
            "funcSelfKind": "NonMutating"
          },
          {
            "kind": "Function",
            "name": "adsManagerDidRequestContentResume",
            "printedName": "adsManagerDidRequestContentResume(_:)",
            "children": [
              {
                "kind": "TypeNominal",
                "name": "Void",
                "printedName": "()"
              },
              {
                "kind": "TypeNominal",
                "name": "IMAAdsManager",
                "printedName": "GoogleInteractiveMediaAds.IMAAdsManager",
                "usr": "c:objc(cs)IMAAdsManager"
              }
            ],
            "declKind": "Func",
            "usr": "c:@CM@DZDemoApplicationCommonIMA@objc(cs)DZAdDataIMA(im)adsManagerDidRequestContentResume:",
            "mangledName": "$s26DZDemoApplicationCommonIMA08DZAdDataD0C33adsManagerDidRequestContentResumeyySo06IMAAdsH0CF",
            "moduleName": "DZDemoApplicationCommonIMA",
            "objc_name": "adsManagerDidRequestContentResume:",
            "declAttributes": [
              "Dynamic",
              "ObjC",
              "AccessControl"
            ],
            "isFromExtension": true,
            "funcSelfKind": "NonMutating"
          }
        ],
        "declKind": "Class",
        "usr": "c:@M@DZDemoApplicationCommonIMA@objc(cs)DZAdDataIMA",
        "mangledName": "$s26DZDemoApplicationCommonIMA08DZAdDataD0C",
        "moduleName": "DZDemoApplicationCommonIMA",
        "declAttributes": [
          "AccessControl",
          "ObjC"
        ],
        "superclassUsr": "c:objc(cs)NSObject",
        "inheritsConvenienceInitializers": true,
        "superclassNames": [
          "ObjectiveC.NSObject"
        ],
        "conformances": [
          {
            "kind": "Conformance",
            "name": "Equatable",
            "printedName": "Equatable",
            "usr": "s:SQ",
            "mangledName": "$sSQ"
          },
          {
            "kind": "Conformance",
            "name": "Hashable",
            "printedName": "Hashable",
            "usr": "s:SH",
            "mangledName": "$sSH"
          },
          {
            "kind": "Conformance",
            "name": "CVarArg",
            "printedName": "CVarArg",
            "usr": "s:s7CVarArgP",
            "mangledName": "$ss7CVarArgP"
          },
          {
            "kind": "Conformance",
            "name": "_KeyValueCodingAndObservingPublishing",
            "printedName": "_KeyValueCodingAndObservingPublishing",
            "usr": "s:10Foundation37_KeyValueCodingAndObservingPublishingP",
            "mangledName": "$s10Foundation37_KeyValueCodingAndObservingPublishingP"
          },
          {
            "kind": "Conformance",
            "name": "_KeyValueCodingAndObserving",
            "printedName": "_KeyValueCodingAndObserving",
            "usr": "s:10Foundation27_KeyValueCodingAndObservingP",
            "mangledName": "$s10Foundation27_KeyValueCodingAndObservingP"
          },
          {
            "kind": "Conformance",
            "name": "CustomStringConvertible",
            "printedName": "CustomStringConvertible",
            "usr": "s:s23CustomStringConvertibleP",
            "mangledName": "$ss23CustomStringConvertibleP"
          },
          {
            "kind": "Conformance",
            "name": "CustomDebugStringConvertible",
            "printedName": "CustomDebugStringConvertible",
            "usr": "s:s28CustomDebugStringConvertibleP",
            "mangledName": "$ss28CustomDebugStringConvertibleP"
          }
        ]
      },
      {
        "kind": "Import",
        "name": "Foundation",
        "printedName": "Foundation",
        "declKind": "Import",
        "moduleName": "DZDemoApplicationCommonIMA",
        "declAttributes": [
          "RawDocComment"
        ]
      },
      {
        "kind": "TypeDecl",
        "name": "PlayersViewControllerAdProtocol",
        "printedName": "PlayersViewControllerAdProtocol",
        "children": [
          {
            "kind": "Function",
            "name": "sendAdEvent",
            "printedName": "sendAdEvent(playerContext:event:adData:)",
            "children": [
              {
                "kind": "TypeNominal",
                "name": "Void",
                "printedName": "()"
              },
              {
                "kind": "TypeNominal",
                "name": "String",
                "printedName": "Swift.String",
                "usr": "s:SS"
              },
              {
                "kind": "TypeNominal",
                "name": "String",
                "printedName": "Swift.String",
                "usr": "s:SS"
              },
              {
                "kind": "TypeNominal",
                "name": "Optional",
                "printedName": "[Swift.String : Any]?",
                "children": [
                  {
                    "kind": "TypeNominal",
                    "name": "Dictionary",
                    "printedName": "[Swift.String : Any]",
                    "children": [
                      {
                        "kind": "TypeNominal",
                        "name": "String",
                        "printedName": "Swift.String",
                        "usr": "s:SS"
                      },
                      {
                        "kind": "TypeNominal",
                        "name": "ProtocolComposition",
                        "printedName": "Any"
                      }
                    ],
                    "usr": "s:SD"
                  }
                ],
                "usr": "s:Sq"
              }
            ],
            "declKind": "Func",
            "usr": "s:26DZDemoApplicationCommonIMA31PlayersViewControllerAdProtocolP04sendH5Event13playerContext5event6adDataySS_SSSDySSypGSgtF",
            "mangledName": "$s26DZDemoApplicationCommonIMA31PlayersViewControllerAdProtocolP04sendH5Event13playerContext5event6adDataySS_SSSDySSypGSgtF",
            "moduleName": "DZDemoApplicationCommonIMA",
            "genericSig": "<τ_0_0 where τ_0_0 : DZDemoApplicationCommonIMA.PlayersViewControllerAdProtocol>",
            "sugared_genericSig": "<Self where Self : DZDemoApplicationCommonIMA.PlayersViewControllerAdProtocol>",
            "protocolReq": true,
            "reqNewWitnessTableEntry": true,
            "funcSelfKind": "NonMutating"
          }
        ],
        "declKind": "Protocol",
        "usr": "s:26DZDemoApplicationCommonIMA31PlayersViewControllerAdProtocolP",
        "mangledName": "$s26DZDemoApplicationCommonIMA31PlayersViewControllerAdProtocolP",
        "moduleName": "DZDemoApplicationCommonIMA",
        "declAttributes": [
          "AccessControl"
        ]
      },
      {
        "kind": "Import",
        "name": "Foundation",
        "printedName": "Foundation",
        "declKind": "Import",
        "moduleName": "DZDemoApplicationCommonIMA",
        "declAttributes": [
          "RawDocComment"
        ]
      },
      {
        "kind": "Import",
        "name": "GoogleInteractiveMediaAds",
        "printedName": "GoogleInteractiveMediaAds",
        "declKind": "Import",
        "moduleName": "DZDemoApplicationCommonIMA"
      },
      {
        "kind": "TypeDecl",
        "name": "IMAAdEvent",
        "printedName": "IMAAdEvent",
        "children": [
          {
            "kind": "Function",
            "name": "encode",
            "printedName": "encode(to:)",
            "children": [
              {
                "kind": "TypeNominal",
                "name": "Void",
                "printedName": "()"
              },
              {
                "kind": "TypeNominal",
                "name": "Encoder",
                "printedName": "Swift.Encoder",
                "usr": "s:s7EncoderP"
              }
            ],
            "declKind": "Func",
            "usr": "s:So10IMAAdEventC26DZDemoApplicationCommonIMAE6encode2toys7Encoder_p_tKF",
            "mangledName": "$sSo10IMAAdEventC26DZDemoApplicationCommonIMAE6encode2toys7Encoder_p_tKF",
            "moduleName": "DZDemoApplicationCommonIMA",
            "declAttributes": [
              "AccessControl"
            ],
            "isFromExtension": true,
            "throwing": true,
            "funcSelfKind": "NonMutating"
          }
        ],
        "declKind": "Class",
        "usr": "c:objc(cs)IMAAdEvent",
        "moduleName": "GoogleInteractiveMediaAds",
        "isOpen": true,
        "objc_name": "IMAAdEvent",
        "declAttributes": [
          "ObjC",
          "Dynamic"
        ],
        "superclassUsr": "c:objc(cs)NSObject",
        "isExternal": true,
        "inheritsConvenienceInitializers": true,
        "superclassNames": [
          "ObjectiveC.NSObject"
        ],
        "conformances": [
          {
            "kind": "Conformance",
            "name": "Equatable",
            "printedName": "Equatable",
            "usr": "s:SQ",
            "mangledName": "$sSQ"
          },
          {
            "kind": "Conformance",
            "name": "Hashable",
            "printedName": "Hashable",
            "usr": "s:SH",
            "mangledName": "$sSH"
          },
          {
            "kind": "Conformance",
            "name": "CVarArg",
            "printedName": "CVarArg",
            "usr": "s:s7CVarArgP",
            "mangledName": "$ss7CVarArgP"
          },
          {
            "kind": "Conformance",
            "name": "_KeyValueCodingAndObservingPublishing",
            "printedName": "_KeyValueCodingAndObservingPublishing",
            "usr": "s:10Foundation37_KeyValueCodingAndObservingPublishingP",
            "mangledName": "$s10Foundation37_KeyValueCodingAndObservingPublishingP"
          },
          {
            "kind": "Conformance",
            "name": "_KeyValueCodingAndObserving",
            "printedName": "_KeyValueCodingAndObserving",
            "usr": "s:10Foundation27_KeyValueCodingAndObservingP",
            "mangledName": "$s10Foundation27_KeyValueCodingAndObservingP"
          },
          {
            "kind": "Conformance",
            "name": "CustomStringConvertible",
            "printedName": "CustomStringConvertible",
            "usr": "s:s23CustomStringConvertibleP",
            "mangledName": "$ss23CustomStringConvertibleP"
          },
          {
            "kind": "Conformance",
            "name": "CustomDebugStringConvertible",
            "printedName": "CustomDebugStringConvertible",
            "usr": "s:s28CustomDebugStringConvertibleP",
            "mangledName": "$ss28CustomDebugStringConvertibleP"
          },
          {
            "kind": "Conformance",
            "name": "Encodable",
            "printedName": "Encodable",
            "usr": "s:SE",
            "mangledName": "$sSE"
          }
        ]
      },
      {
        "kind": "TypeDecl",
        "name": "IMAAd",
        "printedName": "IMAAd",
        "children": [
          {
            "kind": "Function",
            "name": "encode",
            "printedName": "encode(to:)",
            "children": [
              {
                "kind": "TypeNominal",
                "name": "Void",
                "printedName": "()"
              },
              {
                "kind": "TypeNominal",
                "name": "Encoder",
                "printedName": "Swift.Encoder",
                "usr": "s:s7EncoderP"
              }
            ],
            "declKind": "Func",
            "usr": "s:So5IMAAdC26DZDemoApplicationCommonIMAE6encode2toys7Encoder_p_tKF",
            "mangledName": "$sSo5IMAAdC26DZDemoApplicationCommonIMAE6encode2toys7Encoder_p_tKF",
            "moduleName": "DZDemoApplicationCommonIMA",
            "declAttributes": [
              "AccessControl"
            ],
            "isFromExtension": true,
            "throwing": true,
            "funcSelfKind": "NonMutating"
          }
        ],
        "declKind": "Class",
        "usr": "c:objc(cs)IMAAd",
        "moduleName": "GoogleInteractiveMediaAds",
        "isOpen": true,
        "objc_name": "IMAAd",
        "declAttributes": [
          "ObjC",
          "Dynamic"
        ],
        "superclassUsr": "c:objc(cs)NSObject",
        "isExternal": true,
        "inheritsConvenienceInitializers": true,
        "superclassNames": [
          "ObjectiveC.NSObject"
        ],
        "conformances": [
          {
            "kind": "Conformance",
            "name": "Equatable",
            "printedName": "Equatable",
            "usr": "s:SQ",
            "mangledName": "$sSQ"
          },
          {
            "kind": "Conformance",
            "name": "Hashable",
            "printedName": "Hashable",
            "usr": "s:SH",
            "mangledName": "$sSH"
          },
          {
            "kind": "Conformance",
            "name": "CVarArg",
            "printedName": "CVarArg",
            "usr": "s:s7CVarArgP",
            "mangledName": "$ss7CVarArgP"
          },
          {
            "kind": "Conformance",
            "name": "_KeyValueCodingAndObservingPublishing",
            "printedName": "_KeyValueCodingAndObservingPublishing",
            "usr": "s:10Foundation37_KeyValueCodingAndObservingPublishingP",
            "mangledName": "$s10Foundation37_KeyValueCodingAndObservingPublishingP"
          },
          {
            "kind": "Conformance",
            "name": "_KeyValueCodingAndObserving",
            "printedName": "_KeyValueCodingAndObserving",
            "usr": "s:10Foundation27_KeyValueCodingAndObservingP",
            "mangledName": "$s10Foundation27_KeyValueCodingAndObservingP"
          },
          {
            "kind": "Conformance",
            "name": "CustomStringConvertible",
            "printedName": "CustomStringConvertible",
            "usr": "s:s23CustomStringConvertibleP",
            "mangledName": "$ss23CustomStringConvertibleP"
          },
          {
            "kind": "Conformance",
            "name": "CustomDebugStringConvertible",
            "printedName": "CustomDebugStringConvertible",
            "usr": "s:s28CustomDebugStringConvertibleP",
            "mangledName": "$ss28CustomDebugStringConvertibleP"
          },
          {
            "kind": "Conformance",
            "name": "Encodable",
            "printedName": "Encodable",
            "usr": "s:SE",
            "mangledName": "$sSE"
          }
        ]
      },
      {
        "kind": "TypeDecl",
        "name": "IMAAdPodInfo",
        "printedName": "IMAAdPodInfo",
        "children": [
          {
            "kind": "Function",
            "name": "encode",
            "printedName": "encode(to:)",
            "children": [
              {
                "kind": "TypeNominal",
                "name": "Void",
                "printedName": "()"
              },
              {
                "kind": "TypeNominal",
                "name": "Encoder",
                "printedName": "Swift.Encoder",
                "usr": "s:s7EncoderP"
              }
            ],
            "declKind": "Func",
            "usr": "s:So12IMAAdPodInfoC26DZDemoApplicationCommonIMAE6encode2toys7Encoder_p_tKF",
            "mangledName": "$sSo12IMAAdPodInfoC26DZDemoApplicationCommonIMAE6encode2toys7Encoder_p_tKF",
            "moduleName": "DZDemoApplicationCommonIMA",
            "declAttributes": [
              "AccessControl"
            ],
            "isFromExtension": true,
            "throwing": true,
            "funcSelfKind": "NonMutating"
          }
        ],
        "declKind": "Class",
        "usr": "c:objc(cs)IMAAdPodInfo",
        "moduleName": "GoogleInteractiveMediaAds",
        "isOpen": true,
        "objc_name": "IMAAdPodInfo",
        "declAttributes": [
          "ObjC",
          "Dynamic"
        ],
        "superclassUsr": "c:objc(cs)NSObject",
        "isExternal": true,
        "inheritsConvenienceInitializers": true,
        "superclassNames": [
          "ObjectiveC.NSObject"
        ],
        "conformances": [
          {
            "kind": "Conformance",
            "name": "Equatable",
            "printedName": "Equatable",
            "usr": "s:SQ",
            "mangledName": "$sSQ"
          },
          {
            "kind": "Conformance",
            "name": "Hashable",
            "printedName": "Hashable",
            "usr": "s:SH",
            "mangledName": "$sSH"
          },
          {
            "kind": "Conformance",
            "name": "CVarArg",
            "printedName": "CVarArg",
            "usr": "s:s7CVarArgP",
            "mangledName": "$ss7CVarArgP"
          },
          {
            "kind": "Conformance",
            "name": "_KeyValueCodingAndObservingPublishing",
            "printedName": "_KeyValueCodingAndObservingPublishing",
            "usr": "s:10Foundation37_KeyValueCodingAndObservingPublishingP",
            "mangledName": "$s10Foundation37_KeyValueCodingAndObservingPublishingP"
          },
          {
            "kind": "Conformance",
            "name": "_KeyValueCodingAndObserving",
            "printedName": "_KeyValueCodingAndObserving",
            "usr": "s:10Foundation27_KeyValueCodingAndObservingP",
            "mangledName": "$s10Foundation27_KeyValueCodingAndObservingP"
          },
          {
            "kind": "Conformance",
            "name": "CustomStringConvertible",
            "printedName": "CustomStringConvertible",
            "usr": "s:s23CustomStringConvertibleP",
            "mangledName": "$ss23CustomStringConvertibleP"
          },
          {
            "kind": "Conformance",
            "name": "CustomDebugStringConvertible",
            "printedName": "CustomDebugStringConvertible",
            "usr": "s:s28CustomDebugStringConvertibleP",
            "mangledName": "$ss28CustomDebugStringConvertibleP"
          },
          {
            "kind": "Conformance",
            "name": "Encodable",
            "printedName": "Encodable",
            "usr": "s:SE",
            "mangledName": "$sSE"
          }
        ]
      },
      {
        "kind": "TypeDecl",
        "name": "IMAUniversalAdID",
        "printedName": "IMAUniversalAdID",
        "children": [
          {
            "kind": "Function",
            "name": "encode",
            "printedName": "encode(to:)",
            "children": [
              {
                "kind": "TypeNominal",
                "name": "Void",
                "printedName": "()"
              },
              {
                "kind": "TypeNominal",
                "name": "Encoder",
                "printedName": "Swift.Encoder",
                "usr": "s:s7EncoderP"
              }
            ],
            "declKind": "Func",
            "usr": "s:So16IMAUniversalAdIDC26DZDemoApplicationCommonIMAE6encode2toys7Encoder_p_tKF",
            "mangledName": "$sSo16IMAUniversalAdIDC26DZDemoApplicationCommonIMAE6encode2toys7Encoder_p_tKF",
            "moduleName": "DZDemoApplicationCommonIMA",
            "declAttributes": [
              "AccessControl"
            ],
            "isFromExtension": true,
            "throwing": true,
            "funcSelfKind": "NonMutating"
          }
        ],
        "declKind": "Class",
        "usr": "c:objc(cs)IMAUniversalAdID",
        "moduleName": "GoogleInteractiveMediaAds",
        "isOpen": true,
        "objc_name": "IMAUniversalAdID",
        "declAttributes": [
          "ObjC",
          "Dynamic"
        ],
        "superclassUsr": "c:objc(cs)NSObject",
        "isExternal": true,
        "inheritsConvenienceInitializers": true,
        "superclassNames": [
          "ObjectiveC.NSObject"
        ],
        "conformances": [
          {
            "kind": "Conformance",
            "name": "Equatable",
            "printedName": "Equatable",
            "usr": "s:SQ",
            "mangledName": "$sSQ"
          },
          {
            "kind": "Conformance",
            "name": "Hashable",
            "printedName": "Hashable",
            "usr": "s:SH",
            "mangledName": "$sSH"
          },
          {
            "kind": "Conformance",
            "name": "CVarArg",
            "printedName": "CVarArg",
            "usr": "s:s7CVarArgP",
            "mangledName": "$ss7CVarArgP"
          },
          {
            "kind": "Conformance",
            "name": "_KeyValueCodingAndObservingPublishing",
            "printedName": "_KeyValueCodingAndObservingPublishing",
            "usr": "s:10Foundation37_KeyValueCodingAndObservingPublishingP",
            "mangledName": "$s10Foundation37_KeyValueCodingAndObservingPublishingP"
          },
          {
            "kind": "Conformance",
            "name": "_KeyValueCodingAndObserving",
            "printedName": "_KeyValueCodingAndObserving",
            "usr": "s:10Foundation27_KeyValueCodingAndObservingP",
            "mangledName": "$s10Foundation27_KeyValueCodingAndObservingP"
          },
          {
            "kind": "Conformance",
            "name": "CustomStringConvertible",
            "printedName": "CustomStringConvertible",
            "usr": "s:s23CustomStringConvertibleP",
            "mangledName": "$ss23CustomStringConvertibleP"
          },
          {
            "kind": "Conformance",
            "name": "CustomDebugStringConvertible",
            "printedName": "CustomDebugStringConvertible",
            "usr": "s:s28CustomDebugStringConvertibleP",
            "mangledName": "$ss28CustomDebugStringConvertibleP"
          },
          {
            "kind": "Conformance",
            "name": "Encodable",
            "printedName": "Encodable",
            "usr": "s:SE",
            "mangledName": "$sSE"
          }
        ]
      },
      {
        "kind": "TypeDecl",
        "name": "IMAAdError",
        "printedName": "IMAAdError",
        "children": [
          {
            "kind": "Function",
            "name": "encode",
            "printedName": "encode(to:)",
            "children": [
              {
                "kind": "TypeNominal",
                "name": "Void",
                "printedName": "()"
              },
              {
                "kind": "TypeNominal",
                "name": "Encoder",
                "printedName": "Swift.Encoder",
                "usr": "s:s7EncoderP"
              }
            ],
            "declKind": "Func",
            "usr": "s:So10IMAAdErrorC26DZDemoApplicationCommonIMAE6encode2toys7Encoder_p_tKF",
            "mangledName": "$sSo10IMAAdErrorC26DZDemoApplicationCommonIMAE6encode2toys7Encoder_p_tKF",
            "moduleName": "DZDemoApplicationCommonIMA",
            "declAttributes": [
              "AccessControl"
            ],
            "isFromExtension": true,
            "throwing": true,
            "funcSelfKind": "NonMutating"
          }
        ],
        "declKind": "Class",
        "usr": "c:objc(cs)IMAAdError",
        "moduleName": "GoogleInteractiveMediaAds",
        "isOpen": true,
        "objc_name": "IMAAdError",
        "declAttributes": [
          "ObjC",
          "Dynamic"
        ],
        "superclassUsr": "c:objc(cs)NSObject",
        "isExternal": true,
        "inheritsConvenienceInitializers": true,
        "superclassNames": [
          "ObjectiveC.NSObject"
        ],
        "conformances": [
          {
            "kind": "Conformance",
            "name": "Equatable",
            "printedName": "Equatable",
            "usr": "s:SQ",
            "mangledName": "$sSQ"
          },
          {
            "kind": "Conformance",
            "name": "Hashable",
            "printedName": "Hashable",
            "usr": "s:SH",
            "mangledName": "$sSH"
          },
          {
            "kind": "Conformance",
            "name": "CVarArg",
            "printedName": "CVarArg",
            "usr": "s:s7CVarArgP",
            "mangledName": "$ss7CVarArgP"
          },
          {
            "kind": "Conformance",
            "name": "_KeyValueCodingAndObservingPublishing",
            "printedName": "_KeyValueCodingAndObservingPublishing",
            "usr": "s:10Foundation37_KeyValueCodingAndObservingPublishingP",
            "mangledName": "$s10Foundation37_KeyValueCodingAndObservingPublishingP"
          },
          {
            "kind": "Conformance",
            "name": "_KeyValueCodingAndObserving",
            "printedName": "_KeyValueCodingAndObserving",
            "usr": "s:10Foundation27_KeyValueCodingAndObservingP",
            "mangledName": "$s10Foundation27_KeyValueCodingAndObservingP"
          },
          {
            "kind": "Conformance",
            "name": "CustomStringConvertible",
            "printedName": "CustomStringConvertible",
            "usr": "s:s23CustomStringConvertibleP",
            "mangledName": "$ss23CustomStringConvertibleP"
          },
          {
            "kind": "Conformance",
            "name": "CustomDebugStringConvertible",
            "printedName": "CustomDebugStringConvertible",
            "usr": "s:s28CustomDebugStringConvertibleP",
            "mangledName": "$ss28CustomDebugStringConvertibleP"
          },
          {
            "kind": "Conformance",
            "name": "Encodable",
            "printedName": "Encodable",
            "usr": "s:SE",
            "mangledName": "$sSE"
          }
        ]
      }
    ],
    "json_format_version": 8
  },
  "ConstValues": [
    {
      "filePath": "\/Users\/ugljesha\/Projects\/rca\/dz-repo\/unified\/apps_dev\/common\/DZDemoApplicationCommonIMA\/Model\/GoogleIMA\/DZAdDataIMA.swift",
      "kind": "StringLiteral",
      "offset": 267,
      "length": 28,
      "value": "\"io.datazoom.DZFrameworkAds\""
    },
    {
      "filePath": "\/Users\/ugljesha\/Projects\/rca\/dz-repo\/unified\/apps_dev\/common\/DZDemoApplicationCommonIMA\/Model\/GoogleIMA\/DZAdDataIMA.swift",
      "kind": "StringLiteral",
      "offset": 379,
      "length": 7,
      "value": "\"adIMA\""
    },
    {
      "filePath": "\/Users\/ugljesha\/Projects\/rca\/dz-repo\/unified\/apps_dev\/common\/DZDemoApplicationCommonIMA\/Model\/GoogleIMA\/DZAdDataIMA.swift",
      "kind": "StringLiteral",
      "offset": 756,
      "length": 2,
      "value": "\"\""
    },
    {
      "filePath": "\/Users\/ugljesha\/Projects\/rca\/dz-repo\/unified\/apps_dev\/common\/DZDemoApplicationCommonIMA\/Model\/GoogleIMA\/DZAdDataIMA.swift",
      "kind": "StringLiteral",
      "offset": 796,
      "length": 2,
      "value": "\"\""
    },
    {
      "filePath": "\/Users\/ugljesha\/Projects\/rca\/dz-repo\/unified\/apps_dev\/common\/DZDemoApplicationCommonIMA\/Model\/GoogleIMA\/DZAdDataIMA.swift",
      "kind": "Dictionary",
      "offset": 904,
      "length": 3,
      "value": "[]"
    },
    {
      "filePath": "\/Users\/ugljesha\/Projects\/rca\/dz-repo\/unified\/apps_dev\/common\/DZDemoApplicationCommonIMA\/Model\/GoogleIMA\/DZAdDataIMA.swift",
      "kind": "IntegerLiteral",
      "offset": 1644,
      "length": 1,
      "value": "0"
    },
    {
      "filePath": "\/Users\/ugljesha\/Projects\/rca\/dz-repo\/unified\/apps_dev\/common\/DZDemoApplicationCommonIMA\/Model\/GoogleIMA\/IMAAdEventExtension.swift",
      "kind": "StringLiteral",
      "offset": 298,
      "length": 6,
      "value": "\"type\""
    },
    {
      "filePath": "\/Users\/ugljesha\/Projects\/rca\/dz-repo\/unified\/apps_dev\/common\/DZDemoApplicationCommonIMA\/Model\/GoogleIMA\/IMAAdEventExtension.swift",
      "kind": "StringLiteral",
      "offset": 323,
      "length": 4,
      "value": "\"ad\""
    },
    {
      "filePath": "\/Users\/ugljesha\/Projects\/rca\/dz-repo\/unified\/apps_dev\/common\/DZDemoApplicationCommonIMA\/Model\/GoogleIMA\/IMAAdEventExtension.swift",
      "kind": "StringLiteral",
      "offset": 350,
      "length": 9,
      "value": "\"ad_data\""
    },
    {
      "filePath": "\/Users\/ugljesha\/Projects\/rca\/dz-repo\/unified\/apps_dev\/common\/DZDemoApplicationCommonIMA\/Model\/GoogleIMA\/IMAAdEventExtension.swift",
      "kind": "StringLiteral",
      "offset": 298,
      "length": 6,
      "value": "\"type\""
    },
    {
      "filePath": "\/Users\/ugljesha\/Projects\/rca\/dz-repo\/unified\/apps_dev\/common\/DZDemoApplicationCommonIMA\/Model\/GoogleIMA\/IMAAdEventExtension.swift",
      "kind": "StringLiteral",
      "offset": 323,
      "length": 4,
      "value": "\"ad\""
    },
    {
      "filePath": "\/Users\/ugljesha\/Projects\/rca\/dz-repo\/unified\/apps_dev\/common\/DZDemoApplicationCommonIMA\/Model\/GoogleIMA\/IMAAdEventExtension.swift",
      "kind": "StringLiteral",
      "offset": 350,
      "length": 9,
      "value": "\"ad_data\""
    },
    {
      "filePath": "\/Users\/ugljesha\/Projects\/rca\/dz-repo\/unified\/apps_dev\/common\/DZDemoApplicationCommonIMA\/Model\/GoogleIMA\/IMAAdEventExtension.swift",
      "kind": "StringLiteral",
      "offset": 773,
      "length": 4,
      "value": "\"id\""
    },
    {
      "filePath": "\/Users\/ugljesha\/Projects\/rca\/dz-repo\/unified\/apps_dev\/common\/DZDemoApplicationCommonIMA\/Model\/GoogleIMA\/IMAAdEventExtension.swift",
      "kind": "StringLiteral",
      "offset": 801,
      "length": 7,
      "value": "\"title\""
    },
    {
      "filePath": "\/Users\/ugljesha\/Projects\/rca\/dz-repo\/unified\/apps_dev\/common\/DZDemoApplicationCommonIMA\/Model\/GoogleIMA\/IMAAdEventExtension.swift",
      "kind": "StringLiteral",
      "offset": 838,
      "length": 13,
      "value": "\"description\""
    },
    {
      "filePath": "\/Users\/ugljesha\/Projects\/rca\/dz-repo\/unified\/apps_dev\/common\/DZDemoApplicationCommonIMA\/Model\/GoogleIMA\/IMAAdEventExtension.swift",
      "kind": "StringLiteral",
      "offset": 876,
      "length": 8,
      "value": "\"system\""
    },
    {
      "filePath": "\/Users\/ugljesha\/Projects\/rca\/dz-repo\/unified\/apps_dev\/common\/DZDemoApplicationCommonIMA\/Model\/GoogleIMA\/IMAAdEventExtension.swift",
      "kind": "StringLiteral",
      "offset": 912,
      "length": 14,
      "value": "\"content_type\""
    },
    {
      "filePath": "\/Users\/ugljesha\/Projects\/rca\/dz-repo\/unified\/apps_dev\/common\/DZDemoApplicationCommonIMA\/Model\/GoogleIMA\/IMAAdEventExtension.swift",
      "kind": "StringLiteral",
      "offset": 951,
      "length": 10,
      "value": "\"duration\""
    },
    {
      "filePath": "\/Users\/ugljesha\/Projects\/rca\/dz-repo\/unified\/apps_dev\/common\/DZDemoApplicationCommonIMA\/Model\/GoogleIMA\/IMAAdEventExtension.swift",
      "kind": "StringLiteral",
      "offset": 983,
      "length": 7,
      "value": "\"width\""
    },
    {
      "filePath": "\/Users\/ugljesha\/Projects\/rca\/dz-repo\/unified\/apps_dev\/common\/DZDemoApplicationCommonIMA\/Model\/GoogleIMA\/IMAAdEventExtension.swift",
      "kind": "StringLiteral",
      "offset": 1013,
      "length": 8,
      "value": "\"height\""
    },
    {
      "filePath": "\/Users\/ugljesha\/Projects\/rca\/dz-repo\/unified\/apps_dev\/common\/DZDemoApplicationCommonIMA\/Model\/GoogleIMA\/IMAAdEventExtension.swift",
      "kind": "StringLiteral",
      "offset": 1052,
      "length": 18,
      "value": "\"vast_media_width\""
    },
    {
      "filePath": "\/Users\/ugljesha\/Projects\/rca\/dz-repo\/unified\/apps_dev\/common\/DZDemoApplicationCommonIMA\/Model\/GoogleIMA\/IMAAdEventExtension.swift",
      "kind": "StringLiteral",
      "offset": 1102,
      "length": 19,
      "value": "\"vast_media_height\""
    },
    {
      "filePath": "\/Users\/ugljesha\/Projects\/rca\/dz-repo\/unified\/apps_dev\/common\/DZDemoApplicationCommonIMA\/Model\/GoogleIMA\/IMAAdEventExtension.swift",
      "kind": "StringLiteral",
      "offset": 1144,
      "length": 8,
      "value": "\"linear\""
    },
    {
      "filePath": "\/Users\/ugljesha\/Projects\/rca\/dz-repo\/unified\/apps_dev\/common\/DZDemoApplicationCommonIMA\/Model\/GoogleIMA\/IMAAdEventExtension.swift",
      "kind": "StringLiteral",
      "offset": 1178,
      "length": 10,
      "value": "\"skipable\""
    },
    {
      "filePath": "\/Users\/ugljesha\/Projects\/rca\/dz-repo\/unified\/apps_dev\/common\/DZDemoApplicationCommonIMA\/Model\/GoogleIMA\/IMAAdEventExtension.swift",
      "kind": "StringLiteral",
      "offset": 1219,
      "length": 18,
      "value": "\"skip_time_offset\""
    },
    {
      "filePath": "\/Users\/ugljesha\/Projects\/rca\/dz-repo\/unified\/apps_dev\/common\/DZDemoApplicationCommonIMA\/Model\/GoogleIMA\/IMAAdEventExtension.swift",
      "kind": "StringLiteral",
      "offset": 1272,
      "length": 13,
      "value": "\"ad_pod_info\""
    },
    {
      "filePath": "\/Users\/ugljesha\/Projects\/rca\/dz-repo\/unified\/apps_dev\/common\/DZDemoApplicationCommonIMA\/Model\/GoogleIMA\/IMAAdEventExtension.swift",
      "kind": "StringLiteral",
      "offset": 1332,
      "length": 24,
      "value": "\"trafficking_parameters\""
    },
    {
      "filePath": "\/Users\/ugljesha\/Projects\/rca\/dz-repo\/unified\/apps_dev\/common\/DZDemoApplicationCommonIMA\/Model\/GoogleIMA\/IMAAdEventExtension.swift",
      "kind": "StringLiteral",
      "offset": 1383,
      "length": 13,
      "value": "\"creative_id\""
    },
    {
      "filePath": "\/Users\/ugljesha\/Projects\/rca\/dz-repo\/unified\/apps_dev\/common\/DZDemoApplicationCommonIMA\/Model\/GoogleIMA\/IMAAdEventExtension.swift",
      "kind": "StringLiteral",
      "offset": 1425,
      "length": 16,
      "value": "\"creative_ad_id\""
    },
    {
      "filePath": "\/Users\/ugljesha\/Projects\/rca\/dz-repo\/unified\/apps_dev\/common\/DZDemoApplicationCommonIMA\/Model\/GoogleIMA\/IMAAdEventExtension.swift",
      "kind": "StringLiteral",
      "offset": 1472,
      "length": 18,
      "value": "\"universal_ad_ids\""
    },
    {
      "filePath": "\/Users\/ugljesha\/Projects\/rca\/dz-repo\/unified\/apps_dev\/common\/DZDemoApplicationCommonIMA\/Model\/GoogleIMA\/IMAAdEventExtension.swift",
      "kind": "StringLiteral",
      "offset": 1525,
      "length": 23,
      "value": "\"universal_ad_id_value\""
    },
    {
      "filePath": "\/Users\/ugljesha\/Projects\/rca\/dz-repo\/unified\/apps_dev\/common\/DZDemoApplicationCommonIMA\/Model\/GoogleIMA\/IMAAdEventExtension.swift",
      "kind": "StringLiteral",
      "offset": 1586,
      "length": 26,
      "value": "\"universal_ad_id_registry\""
    },
    {
      "filePath": "\/Users\/ugljesha\/Projects\/rca\/dz-repo\/unified\/apps_dev\/common\/DZDemoApplicationCommonIMA\/Model\/GoogleIMA\/IMAAdEventExtension.swift",
      "kind": "StringLiteral",
      "offset": 1643,
      "length": 17,
      "value": "\"advertiser_name\""
    },
    {
      "filePath": "\/Users\/ugljesha\/Projects\/rca\/dz-repo\/unified\/apps_dev\/common\/DZDemoApplicationCommonIMA\/Model\/GoogleIMA\/IMAAdEventExtension.swift",
      "kind": "StringLiteral",
      "offset": 1686,
      "length": 12,
      "value": "\"survey_url\""
    },
    {
      "filePath": "\/Users\/ugljesha\/Projects\/rca\/dz-repo\/unified\/apps_dev\/common\/DZDemoApplicationCommonIMA\/Model\/GoogleIMA\/IMAAdEventExtension.swift",
      "kind": "StringLiteral",
      "offset": 1721,
      "length": 9,
      "value": "\"deal_id\""
    },
    {
      "filePath": "\/Users\/ugljesha\/Projects\/rca\/dz-repo\/unified\/apps_dev\/common\/DZDemoApplicationCommonIMA\/Model\/GoogleIMA\/IMAAdEventExtension.swift",
      "kind": "StringLiteral",
      "offset": 1759,
      "length": 16,
      "value": "\"wrapper_ad_ids\""
    },
    {
      "filePath": "\/Users\/ugljesha\/Projects\/rca\/dz-repo\/unified\/apps_dev\/common\/DZDemoApplicationCommonIMA\/Model\/GoogleIMA\/IMAAdEventExtension.swift",
      "kind": "StringLiteral",
      "offset": 1810,
      "length": 22,
      "value": "\"wrapper_creative_ids\""
    },
    {
      "filePath": "\/Users\/ugljesha\/Projects\/rca\/dz-repo\/unified\/apps_dev\/common\/DZDemoApplicationCommonIMA\/Model\/GoogleIMA\/IMAAdEventExtension.swift",
      "kind": "StringLiteral",
      "offset": 1863,
      "length": 17,
      "value": "\"wrapper_systems\""
    },
    {
      "filePath": "\/Users\/ugljesha\/Projects\/rca\/dz-repo\/unified\/apps_dev\/common\/DZDemoApplicationCommonIMA\/Model\/GoogleIMA\/IMAAdEventExtension.swift",
      "kind": "StringLiteral",
      "offset": 773,
      "length": 4,
      "value": "\"id\""
    },
    {
      "filePath": "\/Users\/ugljesha\/Projects\/rca\/dz-repo\/unified\/apps_dev\/common\/DZDemoApplicationCommonIMA\/Model\/GoogleIMA\/IMAAdEventExtension.swift",
      "kind": "StringLiteral",
      "offset": 801,
      "length": 7,
      "value": "\"title\""
    },
    {
      "filePath": "\/Users\/ugljesha\/Projects\/rca\/dz-repo\/unified\/apps_dev\/common\/DZDemoApplicationCommonIMA\/Model\/GoogleIMA\/IMAAdEventExtension.swift",
      "kind": "StringLiteral",
      "offset": 838,
      "length": 13,
      "value": "\"description\""
    },
    {
      "filePath": "\/Users\/ugljesha\/Projects\/rca\/dz-repo\/unified\/apps_dev\/common\/DZDemoApplicationCommonIMA\/Model\/GoogleIMA\/IMAAdEventExtension.swift",
      "kind": "StringLiteral",
      "offset": 876,
      "length": 8,
      "value": "\"system\""
    },
    {
      "filePath": "\/Users\/ugljesha\/Projects\/rca\/dz-repo\/unified\/apps_dev\/common\/DZDemoApplicationCommonIMA\/Model\/GoogleIMA\/IMAAdEventExtension.swift",
      "kind": "StringLiteral",
      "offset": 912,
      "length": 14,
      "value": "\"content_type\""
    },
    {
      "filePath": "\/Users\/ugljesha\/Projects\/rca\/dz-repo\/unified\/apps_dev\/common\/DZDemoApplicationCommonIMA\/Model\/GoogleIMA\/IMAAdEventExtension.swift",
      "kind": "StringLiteral",
      "offset": 951,
      "length": 10,
      "value": "\"duration\""
    },
    {
      "filePath": "\/Users\/ugljesha\/Projects\/rca\/dz-repo\/unified\/apps_dev\/common\/DZDemoApplicationCommonIMA\/Model\/GoogleIMA\/IMAAdEventExtension.swift",
      "kind": "StringLiteral",
      "offset": 983,
      "length": 7,
      "value": "\"width\""
    },
    {
      "filePath": "\/Users\/ugljesha\/Projects\/rca\/dz-repo\/unified\/apps_dev\/common\/DZDemoApplicationCommonIMA\/Model\/GoogleIMA\/IMAAdEventExtension.swift",
      "kind": "StringLiteral",
      "offset": 1013,
      "length": 8,
      "value": "\"height\""
    },
    {
      "filePath": "\/Users\/ugljesha\/Projects\/rca\/dz-repo\/unified\/apps_dev\/common\/DZDemoApplicationCommonIMA\/Model\/GoogleIMA\/IMAAdEventExtension.swift",
      "kind": "StringLiteral",
      "offset": 1052,
      "length": 18,
      "value": "\"vast_media_width\""
    },
    {
      "filePath": "\/Users\/ugljesha\/Projects\/rca\/dz-repo\/unified\/apps_dev\/common\/DZDemoApplicationCommonIMA\/Model\/GoogleIMA\/IMAAdEventExtension.swift",
      "kind": "StringLiteral",
      "offset": 1102,
      "length": 19,
      "value": "\"vast_media_height\""
    },
    {
      "filePath": "\/Users\/ugljesha\/Projects\/rca\/dz-repo\/unified\/apps_dev\/common\/DZDemoApplicationCommonIMA\/Model\/GoogleIMA\/IMAAdEventExtension.swift",
      "kind": "StringLiteral",
      "offset": 1144,
      "length": 8,
      "value": "\"linear\""
    },
    {
      "filePath": "\/Users\/ugljesha\/Projects\/rca\/dz-repo\/unified\/apps_dev\/common\/DZDemoApplicationCommonIMA\/Model\/GoogleIMA\/IMAAdEventExtension.swift",
      "kind": "StringLiteral",
      "offset": 1178,
      "length": 10,
      "value": "\"skipable\""
    },
    {
      "filePath": "\/Users\/ugljesha\/Projects\/rca\/dz-repo\/unified\/apps_dev\/common\/DZDemoApplicationCommonIMA\/Model\/GoogleIMA\/IMAAdEventExtension.swift",
      "kind": "StringLiteral",
      "offset": 1219,
      "length": 18,
      "value": "\"skip_time_offset\""
    },
    {
      "filePath": "\/Users\/ugljesha\/Projects\/rca\/dz-repo\/unified\/apps_dev\/common\/DZDemoApplicationCommonIMA\/Model\/GoogleIMA\/IMAAdEventExtension.swift",
      "kind": "StringLiteral",
      "offset": 1272,
      "length": 13,
      "value": "\"ad_pod_info\""
    },
    {
      "filePath": "\/Users\/ugljesha\/Projects\/rca\/dz-repo\/unified\/apps_dev\/common\/DZDemoApplicationCommonIMA\/Model\/GoogleIMA\/IMAAdEventExtension.swift",
      "kind": "StringLiteral",
      "offset": 1332,
      "length": 24,
      "value": "\"trafficking_parameters\""
    },
    {
      "filePath": "\/Users\/ugljesha\/Projects\/rca\/dz-repo\/unified\/apps_dev\/common\/DZDemoApplicationCommonIMA\/Model\/GoogleIMA\/IMAAdEventExtension.swift",
      "kind": "StringLiteral",
      "offset": 1383,
      "length": 13,
      "value": "\"creative_id\""
    },
    {
      "filePath": "\/Users\/ugljesha\/Projects\/rca\/dz-repo\/unified\/apps_dev\/common\/DZDemoApplicationCommonIMA\/Model\/GoogleIMA\/IMAAdEventExtension.swift",
      "kind": "StringLiteral",
      "offset": 1425,
      "length": 16,
      "value": "\"creative_ad_id\""
    },
    {
      "filePath": "\/Users\/ugljesha\/Projects\/rca\/dz-repo\/unified\/apps_dev\/common\/DZDemoApplicationCommonIMA\/Model\/GoogleIMA\/IMAAdEventExtension.swift",
      "kind": "StringLiteral",
      "offset": 1472,
      "length": 18,
      "value": "\"universal_ad_ids\""
    },
    {
      "filePath": "\/Users\/ugljesha\/Projects\/rca\/dz-repo\/unified\/apps_dev\/common\/DZDemoApplicationCommonIMA\/Model\/GoogleIMA\/IMAAdEventExtension.swift",
      "kind": "StringLiteral",
      "offset": 1525,
      "length": 23,
      "value": "\"universal_ad_id_value\""
    },
    {
      "filePath": "\/Users\/ugljesha\/Projects\/rca\/dz-repo\/unified\/apps_dev\/common\/DZDemoApplicationCommonIMA\/Model\/GoogleIMA\/IMAAdEventExtension.swift",
      "kind": "StringLiteral",
      "offset": 1586,
      "length": 26,
      "value": "\"universal_ad_id_registry\""
    },
    {
      "filePath": "\/Users\/ugljesha\/Projects\/rca\/dz-repo\/unified\/apps_dev\/common\/DZDemoApplicationCommonIMA\/Model\/GoogleIMA\/IMAAdEventExtension.swift",
      "kind": "StringLiteral",
      "offset": 1643,
      "length": 17,
      "value": "\"advertiser_name\""
    },
    {
      "filePath": "\/Users\/ugljesha\/Projects\/rca\/dz-repo\/unified\/apps_dev\/common\/DZDemoApplicationCommonIMA\/Model\/GoogleIMA\/IMAAdEventExtension.swift",
      "kind": "StringLiteral",
      "offset": 1686,
      "length": 12,
      "value": "\"survey_url\""
    },
    {
      "filePath": "\/Users\/ugljesha\/Projects\/rca\/dz-repo\/unified\/apps_dev\/common\/DZDemoApplicationCommonIMA\/Model\/GoogleIMA\/IMAAdEventExtension.swift",
      "kind": "StringLiteral",
      "offset": 1721,
      "length": 9,
      "value": "\"deal_id\""
    },
    {
      "filePath": "\/Users\/ugljesha\/Projects\/rca\/dz-repo\/unified\/apps_dev\/common\/DZDemoApplicationCommonIMA\/Model\/GoogleIMA\/IMAAdEventExtension.swift",
      "kind": "StringLiteral",
      "offset": 1759,
      "length": 16,
      "value": "\"wrapper_ad_ids\""
    },
    {
      "filePath": "\/Users\/ugljesha\/Projects\/rca\/dz-repo\/unified\/apps_dev\/common\/DZDemoApplicationCommonIMA\/Model\/GoogleIMA\/IMAAdEventExtension.swift",
      "kind": "StringLiteral",
      "offset": 1810,
      "length": 22,
      "value": "\"wrapper_creative_ids\""
    },
    {
      "filePath": "\/Users\/ugljesha\/Projects\/rca\/dz-repo\/unified\/apps_dev\/common\/DZDemoApplicationCommonIMA\/Model\/GoogleIMA\/IMAAdEventExtension.swift",
      "kind": "StringLiteral",
      "offset": 1863,
      "length": 17,
      "value": "\"wrapper_systems\""
    },
    {
      "filePath": "\/Users\/ugljesha\/Projects\/rca\/dz-repo\/unified\/apps_dev\/common\/DZDemoApplicationCommonIMA\/Model\/GoogleIMA\/IMAAdEventExtension.swift",
      "kind": "StringLiteral",
      "offset": 3842,
      "length": 11,
      "value": "\"total_ads\""
    },
    {
      "filePath": "\/Users\/ugljesha\/Projects\/rca\/dz-repo\/unified\/apps_dev\/common\/DZDemoApplicationCommonIMA\/Model\/GoogleIMA\/IMAAdEventExtension.swift",
      "kind": "StringLiteral",
      "offset": 3880,
      "length": 13,
      "value": "\"ad_position\""
    },
    {
      "filePath": "\/Users\/ugljesha\/Projects\/rca\/dz-repo\/unified\/apps_dev\/common\/DZDemoApplicationCommonIMA\/Model\/GoogleIMA\/IMAAdEventExtension.swift",
      "kind": "StringLiteral",
      "offset": 3918,
      "length": 11,
      "value": "\"is_bumper\""
    },
    {
      "filePath": "\/Users\/ugljesha\/Projects\/rca\/dz-repo\/unified\/apps_dev\/common\/DZDemoApplicationCommonIMA\/Model\/GoogleIMA\/IMAAdEventExtension.swift",
      "kind": "StringLiteral",
      "offset": 3954,
      "length": 11,
      "value": "\"pod_index\""
    },
    {
      "filePath": "\/Users\/ugljesha\/Projects\/rca\/dz-repo\/unified\/apps_dev\/common\/DZDemoApplicationCommonIMA\/Model\/GoogleIMA\/IMAAdEventExtension.swift",
      "kind": "StringLiteral",
      "offset": 3992,
      "length": 13,
      "value": "\"time_offset\""
    },
    {
      "filePath": "\/Users\/ugljesha\/Projects\/rca\/dz-repo\/unified\/apps_dev\/common\/DZDemoApplicationCommonIMA\/Model\/GoogleIMA\/IMAAdEventExtension.swift",
      "kind": "StringLiteral",
      "offset": 4033,
      "length": 14,
      "value": "\"max_duration\""
    },
    {
      "filePath": "\/Users\/ugljesha\/Projects\/rca\/dz-repo\/unified\/apps_dev\/common\/DZDemoApplicationCommonIMA\/Model\/GoogleIMA\/IMAAdEventExtension.swift",
      "kind": "StringLiteral",
      "offset": 3842,
      "length": 11,
      "value": "\"total_ads\""
    },
    {
      "filePath": "\/Users\/ugljesha\/Projects\/rca\/dz-repo\/unified\/apps_dev\/common\/DZDemoApplicationCommonIMA\/Model\/GoogleIMA\/IMAAdEventExtension.swift",
      "kind": "StringLiteral",
      "offset": 3880,
      "length": 13,
      "value": "\"ad_position\""
    },
    {
      "filePath": "\/Users\/ugljesha\/Projects\/rca\/dz-repo\/unified\/apps_dev\/common\/DZDemoApplicationCommonIMA\/Model\/GoogleIMA\/IMAAdEventExtension.swift",
      "kind": "StringLiteral",
      "offset": 3918,
      "length": 11,
      "value": "\"is_bumper\""
    },
    {
      "filePath": "\/Users\/ugljesha\/Projects\/rca\/dz-repo\/unified\/apps_dev\/common\/DZDemoApplicationCommonIMA\/Model\/GoogleIMA\/IMAAdEventExtension.swift",
      "kind": "StringLiteral",
      "offset": 3954,
      "length": 11,
      "value": "\"pod_index\""
    },
    {
      "filePath": "\/Users\/ugljesha\/Projects\/rca\/dz-repo\/unified\/apps_dev\/common\/DZDemoApplicationCommonIMA\/Model\/GoogleIMA\/IMAAdEventExtension.swift",
      "kind": "StringLiteral",
      "offset": 3992,
      "length": 13,
      "value": "\"time_offset\""
    },
    {
      "filePath": "\/Users\/ugljesha\/Projects\/rca\/dz-repo\/unified\/apps_dev\/common\/DZDemoApplicationCommonIMA\/Model\/GoogleIMA\/IMAAdEventExtension.swift",
      "kind": "StringLiteral",
      "offset": 4033,
      "length": 14,
      "value": "\"max_duration\""
    },
    {
      "filePath": "\/Users\/ugljesha\/Projects\/rca\/dz-repo\/unified\/apps_dev\/common\/DZDemoApplicationCommonIMA\/Model\/GoogleIMA\/IMAAdEventExtension.swift",
      "kind": "StringLiteral",
      "offset": 4666,
      "length": 13,
      "value": "\"ad_id_value\""
    },
    {
      "filePath": "\/Users\/ugljesha\/Projects\/rca\/dz-repo\/unified\/apps_dev\/common\/DZDemoApplicationCommonIMA\/Model\/GoogleIMA\/IMAAdEventExtension.swift",
      "kind": "StringLiteral",
      "offset": 4708,
      "length": 17,
      "value": "\"ad_id__registry\""
    },
    {
      "filePath": "\/Users\/ugljesha\/Projects\/rca\/dz-repo\/unified\/apps_dev\/common\/DZDemoApplicationCommonIMA\/Model\/GoogleIMA\/IMAAdEventExtension.swift",
      "kind": "StringLiteral",
      "offset": 4666,
      "length": 13,
      "value": "\"ad_id_value\""
    },
    {
      "filePath": "\/Users\/ugljesha\/Projects\/rca\/dz-repo\/unified\/apps_dev\/common\/DZDemoApplicationCommonIMA\/Model\/GoogleIMA\/IMAAdEventExtension.swift",
      "kind": "StringLiteral",
      "offset": 4708,
      "length": 17,
      "value": "\"ad_id__registry\""
    },
    {
      "filePath": "\/Users\/ugljesha\/Projects\/rca\/dz-repo\/unified\/apps_dev\/common\/DZDemoApplicationCommonIMA\/Model\/GoogleIMA\/IMAAdEventExtension.swift",
      "kind": "StringLiteral",
      "offset": 5098,
      "length": 6,
      "value": "\"type\""
    },
    {
      "filePath": "\/Users\/ugljesha\/Projects\/rca\/dz-repo\/unified\/apps_dev\/common\/DZDemoApplicationCommonIMA\/Model\/GoogleIMA\/IMAAdEventExtension.swift",
      "kind": "StringLiteral",
      "offset": 5125,
      "length": 6,
      "value": "\"code\""
    },
    {
      "filePath": "\/Users\/ugljesha\/Projects\/rca\/dz-repo\/unified\/apps_dev\/common\/DZDemoApplicationCommonIMA\/Model\/GoogleIMA\/IMAAdEventExtension.swift",
      "kind": "StringLiteral",
      "offset": 5098,
      "length": 6,
      "value": "\"type\""
    },
    {
      "filePath": "\/Users\/ugljesha\/Projects\/rca\/dz-repo\/unified\/apps_dev\/common\/DZDemoApplicationCommonIMA\/Model\/GoogleIMA\/IMAAdEventExtension.swift",
      "kind": "StringLiteral",
      "offset": 5125,
      "length": 6,
      "value": "\"code\""
    }
  ]
}