[
    {
        "@id": "http://federatief.datastelsel.nl/deelnemers/3e512d/#deelnemer"
    },
    {
        "@id": "http://federatief.datastelsel.nl/deelnemers/3e512d/dcat/"
    },
    {
        "@id": "http://federatief.datastelsel.nl/deelnemers/3e512d/dcat/#brp-dataset",
        "http://purl.org/dc/terms/title": [
            {
                "@value": "Basisregistratie Personen",
                "@language": "nl"
            }
        ],
        "http://purl.org/dc/terms/creator": [
            {
                "@id": "https://identifier.overheid.nl/tooi/id/oorg/oorg10103"
            },
            {
                "@id": "http://federatief.datastelsel.nl/deelnemers/3e512d/#deelnemer"
            }
        ],
        "http://purl.org/dc/terms/publisher": [
            {
                "@id": "https://identifier.overheid.nl/tooi/id/oorg/oorg10103"
            },
            {
                "@id": "http://federatief.datastelsel.nl/deelnemers/3e512d/#deelnemer"
            }
        ],
        "http://purl.org/dc/terms/accessRights": [
            {
                "@id": "http://publications.europa.eu/resource/authority/access-right/NON_PUBLIC"
            }
        ],
        "http://www.w3.org/ns/dcat#theme": [
            {
                "@id": "http://standaarden.overheid.nl/owms/terms/Bestuur"
            }
        ],
        "http://purl.org/dc/terms/description": [
            {
                "@value": "\nDe Nederlandse overheid registreert persoonsgegevens in de Basisregistratie Personen (BRP). Alle overheidsinstellingen en bestuursorganen zoals de Belastingdienst, zijn verplicht voor hun taken gebruik te maken van deze gegevens.\nHergebruik: De BRP is GEEN open data, zie ook de site van rvig.\n",
                "@language": "nl"
            }
        ]
    },
    {
        "@id": "http://federatief.datastelsel.nl/deelnemers/3e512d/dcat/#cat",
        "http://purl.org/dc/terms/title": [
            {
                "@value": "Het FDS aanbod van de Rijksdienst voor Identiteitsgegevens",
                "@language": "nl"
            }
        ],
        "http://purl.org/dc/terms/creator": [
            {
                "@id": "https://identifier.overheid.nl/tooi/id/oorg/oorg10103"
            },
            {
                "@id": "http://federatief.datastelsel.nl/deelnemers/3e512d/#deelnemer"
            }
        ],
        "http://purl.org/dc/terms/publisher": [
            {
                "@id": "https://identifier.overheid.nl/tooi/id/oorg/oorg10103"
            },
            {
                "@id": "http://federatief.datastelsel.nl/deelnemers/3e512d/#deelnemer"
            }
        ],
        "http://purl.org/dc/terms/modified": [
            {
                "@value": "2024-12-11",
                "@type": "http://www.w3.org/2001/XMLSchema#date"
            }
        ],
        "http://xmlns.com/foaf/0.1/homepage": [
            {
                "@id": "http://federatief.datastelsel.nl/deelnemers/3e512d/dcat/"
            }
        ],
        "http://www.w3.org/ns/dcat#dataset": [
            {
                "@id": "http://federatief.datastelsel.nl/deelnemers/3e512d/dcat/#brp-dataset"
            }
        ]
    },
    {
        "@id": "http://publications.europa.eu/resource/authority/access-right/NON_PUBLIC"
    },
    {
        "@id": "http://standaarden.overheid.nl/owms/terms/Bestuur"
    },
    {
        "@id": "https://identifier.overheid.nl/tooi/id/oorg/oorg10103"
    }
]