[
    {
        "@id": "http://federatief.datastelsel.nl/deelnemers/12416e/#deelnemer"
    },
    {
        "@id": "http://federatief.datastelsel.nl/deelnemers/3e512d/#deelnemer",
        "http://www.w3.org/2000/01/rdf-schema#label": [
            {
                "@value": "Rijksdienst voor Identiteitsgegevens",
                "@language": "nl"
            }
        ],
        "http://federatief.datastelsel.nl/deelnemers/ontology/#kvk": [
            {
                "@value": "27373207",
                "@language": "nl"
            }
        ],
        "http://federatief.datastelsel.nl/deelnemers/ontology/#oin": [
            {
                "@value": "00000003273732070000",
                "@language": "nl"
            }
        ],
        "http://federatief.datastelsel.nl/deelnemers/ontology/#tooi": [
            {
                "@id": "https://identifier.overheid.nl/tooi/id/oorg/oorg10103"
            }
        ],
        "http://federatief.datastelsel.nl/deelnemers/ontology/#admitted-by": [
            {
                "@id": "http://federatief.datastelsel.nl/deelnemers/12416e/#deelnemer"
            }
        ],
        "http://federatief.datastelsel.nl/deelnemers/ontology/#catalog": [
            {
                "@id": "http://federatief.datastelsel.nl/deelnemers/3e512d/dcat/#cat"
            }
        ]
    },
    {
        "@id": "http://federatief.datastelsel.nl/deelnemers/3e512d/dcat/#cat"
    },
    {
        "@id": "https://identifier.overheid.nl/tooi/id/oorg/oorg10103"
    }
]