0.55272424,-0.08579278,0.19829881,-0.36153477,-0.5335224,-0.40795836,-0.5228375,-0.1690191,-0.35451913,0.4581065,-0.34044155,-0.11738302
-0.3692887,0.5644927,0.5622717,-0.22231396,0.54453164,-1.0890002,0.5870272,-0.15474053,0.29557848,-0.5723291,0.28378138,-0.102426946
0.3525196,0.41592926,0.3022284,0.45389372,-0.47153375,0.89791197,-0.1488512,0.30044857,0.15442863,-0.010475804,-0.40023467,0.13231046
0.08544259,0.33430684,0.3782646,0.4454999,-0.47254628,-0.18038598,0.11282654,-0.4036302,0.472766,0.5434402,0.61414057,0.46930736
-0.38421395,0.43200672,0.49088526,-0.46053225,0.17629068,-1.091619,0.513027,-0.16553555,-0.4146294,0.03485311,0.54525363,0.4781517
0.4402393,-0.20346776,-0.2520996,0.68714964,0.25923795,-0.18701471,0.30502385,-0.24493708,-0.48655248,-0.04488553,0.30268982,0.081753045
