<svg width="17" height="10" viewBox="0 0 17 10" fill="none" xmlns="http://www.w3.org/2000/svg">
<path d="M15.9365 1.12109L15.2334 0.417969C15.1631 0.347656 15.0693 0.3125 14.9521 0.3125C14.835 0.3125 14.7295 0.347656 14.6357 0.417969L8.27246 6.78125L1.90918 0.417969C1.81543 0.347656 1.70996 0.3125 1.59277 0.3125C1.47559 0.3125 1.38184 0.347656 1.31152 0.417969L0.608398 1.12109C0.538086 1.21484 0.50293 1.32031 0.50293 1.4375C0.50293 1.55469 0.538086 1.64844 0.608398 1.71875L7.99121 9.10156C8.06152 9.17188 8.15527 9.20703 8.27246 9.20703C8.38965 9.20703 8.49512 9.17188 8.58887 9.10156L15.9365 1.71875C16.0068 1.64844 16.042 1.55469 16.042 1.4375C16.042 1.32031 16.0068 1.21484 15.9365 1.12109Z" fill="#4D4F5C"/>
</svg>
