"module name","license","repository"
"@babel/helper-string-parser@7.24.8","MIT","https://github.com/babel/babel"
"@babel/helper-validator-identifier@7.24.7","MIT","https://github.com/babel/babel"
"@babel/parser@7.25.6","MIT","https://github.com/babel/babel"
"@babel/polyfill@7.12.1","MIT","https://github.com/babel/babel"
"@babel/types@7.25.6","MIT","https://github.com/babel/babel"
"@deu/deu-cookie-consent@3.0.9","Apache-2.0",""
"@deu/deu-header-footer@6.5.21","Apache*","https://gitlab.fokus.fraunhofer.de/data.europa.eu/utilities/deu-header-footer"
"@ecl/preset-ec@3.13.0","EUPL-1.2",""
"@fortawesome/fontawesome-common-types@0.1.7","Custom: https://img.shields.io/npm/v/","https://github.com/FortAwesome/Font-Awesome"
"@fortawesome/fontawesome-common-types@0.2.36","MIT","https://github.com/FortAwesome/Font-Awesome"
"@fortawesome/fontawesome-common-types@6.6.0","MIT","https://github.com/FortAwesome/Font-Awesome"
"@fortawesome/fontawesome-free-brands@5.0.13","MIT*","https://github.com/FortAwesome/Font-Awesome"
"@fortawesome/fontawesome-free-solid@5.0.13","(CC-BY-4.0 AND MIT)","https://github.com/FortAwesome/Font-Awesome"
"@fortawesome/fontawesome-svg-core@1.2.36","MIT","https://github.com/FortAwesome/Font-Awesome"
"@fortawesome/fontawesome-svg-core@6.6.0","MIT","https://github.com/FortAwesome/Font-Awesome"
"@fortawesome/fontawesome@1.1.8","MIT","https://github.com/FortAwesome/Font-Awesome"
"@fortawesome/free-brands-svg-icons@5.15.4","(CC-BY-4.0 AND MIT)","https://github.com/FortAwesome/Font-Awesome"
"@fortawesome/free-brands-svg-icons@6.6.0","(CC-BY-4.0 AND MIT)","https://github.com/FortAwesome/Font-Awesome"
"@fortawesome/free-regular-svg-icons@5.15.4","(CC-BY-4.0 AND MIT)","https://github.com/FortAwesome/Font-Awesome"
"@fortawesome/free-regular-svg-icons@6.6.0","(CC-BY-4.0 AND MIT)","https://github.com/FortAwesome/Font-Awesome"
"@fortawesome/free-solid-svg-icons@5.15.4","(CC-BY-4.0 AND MIT)","https://github.com/FortAwesome/Font-Awesome"
"@fortawesome/free-solid-svg-icons@6.6.0","(CC-BY-4.0 AND MIT)","https://github.com/FortAwesome/Font-Awesome"
"@fortawesome/vue-fontawesome@3.0.8","MIT","https://github.com/FortAwesome/vue-fontawesome"
"@intlify/core-base@9.14.1","MIT","https://github.com/intlify/vue-i18n-next"
"@intlify/message-compiler@9.14.1","MIT","https://github.com/intlify/vue-i18n-next"
"@intlify/shared@9.14.1","MIT","https://github.com/intlify/vue-i18n-next"
"@jridgewell/sourcemap-codec@1.5.0","MIT","https://github.com/jridgewell/sourcemap-codec"
"@kurkle/color@0.3.2","MIT","https://github.com/kurkle/color"
"@piveau/piveau-cookie-consent@1.1.3","Apache-2.0","https://gitlab.fokus.fraunhofer.de/piveau/utilities/piveau-cookie-consent"
"@piveau/piveau-universal-piwik@3.3.0","Apache-2.0",""
"@unhead/dom@1.11.10","MIT","https://github.com/unjs/unhead"
"@unhead/schema@1.11.10","MIT","https://github.com/unjs/unhead"
"@unhead/shared@1.11.10","MIT","https://github.com/unjs/unhead"
"@unhead/vue@1.11.10","MIT","https://github.com/unjs/unhead"
"@vue/compiler-core@3.5.10","MIT","https://github.com/vuejs/core"
"@vue/compiler-dom@3.5.10","MIT","https://github.com/vuejs/core"
"@vue/compiler-sfc@2.7.16","MIT*",""
"@vue/compiler-sfc@3.5.10","MIT","https://github.com/vuejs/core"
"@vue/compiler-ssr@3.5.10","MIT","https://github.com/vuejs/core"
"@vue/devtools-api@6.6.4","MIT","https://github.com/vuejs/vue-devtools"
"@vue/reactivity@3.5.10","MIT","https://github.com/vuejs/core"
"@vue/runtime-core@3.5.10","MIT","https://github.com/vuejs/core"
"@vue/runtime-dom@3.5.10","MIT","https://github.com/vuejs/core"
"@vue/server-renderer@3.5.10","MIT","https://github.com/vuejs/core"
"@vue/shared@3.5.10","MIT","https://github.com/vuejs/core"
"axios@0.21.4","MIT","https://github.com/axios/axios"
"bootstrap@4.6.2","MIT","https://github.com/twbs/bootstrap"
"chart.js@4.4.4","MIT","https://github.com/chartjs/Chart.js"
"ci@2.3.0","MIT","https://github.com/privatenumber/ci"
"core-js@2.6.12","MIT","https://github.com/zloirock/core-js"
"core-js@3.38.1","MIT","https://github.com/zloirock/core-js"
"csstype@3.1.3","MIT","https://github.com/frenic/csstype"
"defu@6.1.4","MIT","https://github.com/unjs/defu"
"entities@4.5.0","BSD-2-Clause","https://github.com/fb55/entities"
"estree-walker@2.0.2","MIT","https://github.com/Rich-Harris/estree-walker"
"follow-redirects@1.15.9","MIT","https://github.com/follow-redirects/follow-redirects"
"hookable@5.5.3","MIT","https://github.com/unjs/hookable"
"is-what@3.14.1","MIT","https://github.com/mesqueeb/is-what"
"jquery@3.7.1","MIT","https://github.com/jquery/jquery"
"lodash-es@4.17.21","MIT","https://github.com/lodash/lodash"
"magic-string@0.30.11","MIT","https://github.com/rich-harris/magic-string"
"material-icons@0.3.1","Apache-2.0","https://github.com/marella/material-icons"
"merge-anything@2.4.4","MIT","https://github.com/mesqueeb/merge-anything"
"nanoid@3.3.7","MIT","https://github.com/ai/nanoid"
"picocolors@1.1.0","ISC","https://github.com/alexeyraspopov/picocolors"
"popper.js@1.16.1","MIT","https://github.com/FezVrasta/popper.js"
"postcss@8.4.47","MIT","https://github.com/postcss/postcss"
"prettier@2.8.8","MIT","https://github.com/prettier/prettier"
"regenerator-runtime@0.13.11","MIT","https://github.com/facebook/regenerator/tree/main/packages/runtime"
"source-map-js@1.2.1","BSD-3-Clause","https://github.com/7rulnik/source-map-js"
"source-map@0.6.1","BSD-3-Clause","https://github.com/mozilla/source-map"
"statistics-ui@1.0.0","UNLICENSED",""
"tiny-cookie@2.5.1","MIT","https://github.com/Alex1990/tiny-cookie"
"to-fast-properties@2.0.0","MIT","https://github.com/sindresorhus/to-fast-properties"
"typescript@4.9.5","Apache-2.0","https://github.com/Microsoft/TypeScript"
"unhead@1.11.10","MIT","https://github.com/unjs/unhead"
"vue-chartjs@5.3.1","MIT","https://github.com/apertureless/vue-chartjs"
"vue-demi@0.14.10","MIT","https://github.com/antfu/vue-demi"
"vue-i18n@9.14.1","MIT","https://github.com/intlify/vue-i18n-next"
"vue-router@4.4.5","MIT","https://github.com/vuejs/router"
"vue-sticky-directive@0.0.10","MIT","https://github.com/mehwww/vue-sticky-directive"
"vue@2.7.16","MIT","https://github.com/vuejs/vue"
"vue@3.5.10","MIT","https://github.com/vuejs/core"
"vuex@4.1.0","MIT","https://github.com/vuejs/vuex"
"yui-lint@0.2.0","BSD","https://github.com/yui/yui-lint"
"zhead@2.2.4","MIT","https://github.com/harlan-zw/zhead"