<svg version="1.0" xmlns="http://www.w3.org/2000/svg"
 width="2501.000000pt" height="2501.000000pt" viewBox="0 0 2501.000000 2501.000000"
 preserveAspectRatio="xMidYMid meet">

<g transform="translate(0.000000,2501.000000) scale(0.100000,-0.100000)"
fill="#0e47cb" stroke="none">
<path d="M10016 19154 c-95 -18 -158 -40 -251 -86 -268 -133 -455 -363 -532
-657 -22 -82 -26 -117 -26 -246 0 -130 4 -163 27 -249 77 -294 275 -532 547
-660 155 -73 236 -90 429 -90 140 0 178 3 250 23 357 96 633 371 726 727 23
86 27 119 27 249 0 129 -4 164 -26 246 -102 386 -404 671 -789 744 -98 18
-288 18 -382 -1z"/>
<path d="M14450 19159 c-87 -15 -242 -72 -323 -118 -166 -95 -317 -255 -400
-424 -83 -169 -113 -312 -104 -502 22 -464 348 -842 807 -937 123 -26 325 -21
442 10 187 50 352 146 479 279 123 129 204 273 251 443 20 74 23 107 22 260 0
207 -15 275 -93 435 -105 215 -267 374 -484 475 -134 63 -220 81 -392 85 -82
2 -175 -1 -205 -6z"/>
<path d="M6294 17966 c-153 -35 -300 -124 -397 -240 -55 -67 -127 -210 -148
-296 -20 -78 -17 -260 5 -340 65 -238 239 -420 476 -500 100 -34 270 -39 380
-11 324 80 544 358 543 686 -1 123 -21 214 -73 320 -84 173 -247 310 -440 370
-75 23 -266 29 -346 11z"/>
<path d="M18345 17834 c-231 -59 -390 -181 -480 -369 -55 -116 -70 -177 -70
-300 0 -124 15 -184 71 -302 104 -218 321 -359 570 -371 301 -14 568 163 670
444 74 202 45 426 -77 609 -81 121 -189 204 -333 258 -71 26 -96 30 -206 33
-69 2 -134 1 -145 -2z"/>
<path d="M9954 16845 c-541 -79 -1025 -420 -1287 -905 -97 -179 -187 -464
-187 -590 0 -106 67 -196 168 -226 67 -21 3057 -21 3124 0 101 30 168 120 168
226 0 126 -90 411 -187 590 -231 428 -642 750 -1111 869 -194 50 -487 65 -688
36z"/>
<path d="M14369 16845 c-752 -118 -1340 -692 -1470 -1439 -20 -115 28 -217
125 -269 l41 -22 1560 0 1560 0 41 22 c80 43 134 130 134 214 0 45 -42 226
-75 324 -40 120 -156 348 -232 455 -83 116 -268 304 -383 389 -232 171 -503
282 -793 325 -127 19 -387 20 -508 1z"/>
<path d="M6320 16344 c-14 -2 -56 -9 -95 -15 -360 -58 -705 -312 -877 -645
-132 -254 -141 -422 -29 -515 74 -61 39 -59 1126 -59 1103 0 1058 -3 1130 67
105 102 97 238 -26 488 -167 338 -484 581 -864 660 -76 16 -311 28 -365 19z"/>
<path d="M18307 16280 c-275 -44 -497 -158 -686 -355 -131 -137 -217 -282
-276 -467 -48 -149 -9 -258 115 -324 33 -18 78 -19 1010 -19 l975 0 41 22 c87
47 144 155 129 246 -11 65 -52 172 -106 277 -152 296 -431 514 -763 596 -113
28 -335 40 -439 24z"/>
<path d="M4725 14146 c-116 -37 -207 -116 -258 -224 l-32 -67 1 -295 c3 -904
203 -1897 564 -2799 294 -737 716 -1460 1205 -2066 254 -315 680 -761 960
-1006 994 -871 2130 -1468 3393 -1784 873 -218 1823 -288 2737 -200 2754 266
5196 1949 6443 4441 457 914 734 1904 822 2940 20 247 32 654 20 723 -24 142
-101 245 -228 308 l-76 38 -7755 2 c-6245 1 -7764 -1 -7796 -11z m2999 -1001
c33 -894 182 -1898 405 -2730 22 -82 37 -153 33 -156 -4 -3 -95 -29 -202 -59
-445 -121 -1019 -324 -1382 -488 l-67 -31 -89 137 c-459 705 -798 1509 -986
2342 -64 284 -122 659 -146 940 -5 69 -12 149 -15 178 l-5 52 1223 0 1224 0 7
-185z m4366 -1094 l0 -1279 -72 -6 c-40 -3 -161 -8 -268 -11 -758 -22 -1716
-121 -2460 -255 -124 -22 -243 -43 -266 -46 l-41 -6 -26 93 c-174 621 -307
1381 -366 2099 -19 226 -41 581 -41 658 l0 32 1770 0 1770 0 0 -1279z m4366
1102 c-30 -761 -149 -1611 -326 -2328 -76 -307 -95 -370 -112 -373 -9 -2 -76
8 -149 22 -465 88 -1031 166 -1569 215 -393 36 -965 71 -1174 71 -56 0 -125 3
-153 6 l-53 7 0 1278 0 1279 1771 0 1772 0 -7 -177z m3280 90 c-49 -638 -156
-1178 -348 -1763 -196 -596 -492 -1209 -819 -1697 l-69 -102 -117 53 c-395
176 -1049 400 -1503 514 -41 10 -43 -8 16 210 203 763 355 1775 389 2587 3 77
8 173 11 213 l6 72 1220 0 1220 0 -6 -87z m-7646 -5009 c0 -1610 -1 -1695 -17
-1690 -10 2 -58 14 -108 26 -193 47 -465 163 -664 282 -387 231 -774 594
-1111 1043 -329 440 -631 986 -876 1586 -36 89 -64 163 -62 165 2 1 80 17 173
33 638 114 1373 196 2060 231 322 16 321 16 468 18 l137 2 0 -1696z m1545
1670 c523 -31 970 -76 1446 -144 278 -40 669 -106 677 -115 14 -13 -183 -466
-326 -752 -443 -885 -984 -1553 -1582 -1952 -158 -106 -296 -183 -442 -246
-170 -73 -466 -164 -482 -147 -3 3 -6 766 -6 1695 l0 1690 233 -7 c127 -3 345
-13 482 -22z m-5117 -673 c334 -837 759 -1570 1226 -2115 42 -49 75 -91 72
-93 -13 -13 -552 238 -779 364 -489 270 -948 595 -1362 965 -210 188 -649 639
-634 652 11 9 357 142 521 200 247 86 798 252 849 255 11 1 40 -61 107 -228z
m8308 168 c391 -108 1144 -372 1144 -401 0 -4 -42 -54 -92 -110 -566 -624
-1250 -1157 -1987 -1547 -220 -117 -590 -288 -681 -316 l-25 -7 21 23 c500
562 1008 1437 1330 2292 26 70 53 127 59 127 7 0 111 -27 231 -61z"/>
</g>
</svg>
