{
  "about": {
    "problemID": "uu3_world_development_indicators_problem",
    "problemName": "Life expectancy prediction problem",
    "problemDescription": "Life expectancy prediction problem from world development indicators data. The World Development Indicators from the World Bank contain over a thousand annual indicators of economic development from hundreds of countries around the world.",
    "problemSchemaVersion": "4.0.0",
    "problemVersion": "4.0.0",
    "taskKeywords": [
      "regression",
      "univariate",
      "relational"
    ]
  },
  "inputs": {
    "data": [
      {
        "datasetID": "uu3_world_development_indicators_dataset",
        "targets": [
          {
            "targetIndex": 0,
            "resID": "learningData",
            "colIndex": 6,
            "colName": "Value"
          }
        ]
      }
    ],
    "dataSplits": {
      "method": "holdOut",
      "testSize": 0.002175,
      "numRepeats": 0,
      "splitsFile": "dataSplits.csv",
      "splitScript": "splitData.py",
      "datasetViewMaps": {
        "train": [
          {
            "from": "uu3_world_development_indicators_dataset",
            "to": "uu3_world_development_indicators_dataset_TRAIN"
          }
        ],
        "test": [
          {
            "from": "uu3_world_development_indicators_dataset",
            "to": "uu3_world_development_indicators_dataset_TEST"
          }
        ],
        "score": [
          {
            "from": "uu3_world_development_indicators_dataset",
            "to": "uu3_world_development_indicators_dataset_SCORE"
          }
        ]
      }
    },
    "performanceMetrics": [
      {
        "metric": "rootMeanSquaredError"
      }
    ]
  },
  "expectedOutputs": {
    "predictionsFile": "predictions.csv"
  }
}