time,value
0,-0.16910999999999998
1,-0.16910999999999998
2,-0.16910999999999998
3,-0.16910999999999998
4,-0.16910999999999998
5,-0.16910999999999998
6,-0.16910999999999998
7,-0.16910999999999998
8,-0.16910999999999998
9,-0.16910999999999998
10,-0.16910999999999998
11,-0.16910999999999998
12,-0.16910999999999998
13,-0.16910999999999998
14,-0.16910999999999998
15,-0.16910999999999998
16,-0.16910999999999998
17,-0.16910999999999998
18,-0.16910999999999998
19,-0.16910999999999998
20,-0.16910999999999998
21,-0.16910999999999998
22,-0.16910999999999998
23,-0.16910999999999998
24,-0.16910999999999998
25,-0.16910999999999998
26,-0.16910999999999998
27,-0.16910999999999998
28,-0.16910999999999998
29,-0.16910999999999998
30,-0.16910999999999998
31,-0.16910999999999998
32,-0.16910999999999998
33,-0.16910999999999998
34,-0.16910999999999998
35,-0.16910999999999998
36,-0.16910999999999998
37,-0.16910999999999998
38,-0.16910999999999998
39,-0.16910999999999998
40,-0.16910999999999998
41,-0.16910999999999998
42,-0.16910999999999998
43,-0.16910999999999998
44,-0.16910999999999998
45,-0.16910999999999998
46,-0.16910999999999998
47,-0.16910999999999998
48,-0.16910999999999998
49,-0.16910999999999998
50,-0.16910999999999998
51,-0.16910999999999998
52,-0.16910999999999998
53,-0.16910999999999998
54,-0.16910999999999998
55,-0.16910999999999998
56,-0.16910999999999998
57,-0.16910999999999998
58,-0.16910999999999998
59,-0.16910999999999998
60,-0.16910999999999998
61,-0.16910999999999998
62,-0.16910999999999998
63,-0.16910999999999998
64,-0.16910999999999998
65,-0.16910999999999998
66,-0.16910999999999998
67,-0.16910999999999998
68,-0.16910999999999998
69,-0.16910999999999998
70,-0.16910999999999998
71,-0.16910999999999998
72,-0.16910999999999998
73,-0.16910999999999998
74,-0.16910999999999998
75,-0.16910999999999998
76,-0.16910999999999998
77,-0.16910999999999998
78,-0.16910999999999998
79,-0.16910999999999998
80,-0.16910999999999998
81,-0.16910999999999998
82,-0.16910999999999998
83,-0.085751
84,0.18517999999999998
85,6.1665
86,0.20601999999999998
87,0.20601999999999998
88,0.1435
89,7.3336
90,0.7270399999999999
91,-0.16910999999999998
92,-0.16910999999999998
93,-0.16910999999999998
94,-0.16910999999999998
95,-0.16910999999999998
