time,value
0,-0.2167
1,-0.2167
2,-0.2167
3,-0.2167
4,-0.2167
5,-0.2167
6,-0.2167
7,-0.2167
8,-0.2167
9,-0.2167
10,-0.2167
11,-0.2167
12,-0.2167
13,-0.2167
14,-0.2167
15,-0.2167
16,-0.2167
17,-0.2167
18,-0.2167
19,-0.2167
20,-0.2167
21,-0.2167
22,-0.2167
23,-0.2167
24,-0.2167
25,-0.2167
26,-0.2167
27,-0.2167
28,-0.2167
29,-0.2167
30,-0.2167
31,-0.2167
32,-0.2167
33,-0.2167
34,-0.2167
35,-0.2167
36,-0.2167
37,-0.2167
38,-0.2167
39,-0.2167
40,-0.2167
41,-0.2167
42,-0.2167
43,-0.2167
44,-0.2167
45,-0.2167
46,-0.2167
47,-0.2167
48,-0.2167
49,-0.2167
50,-0.2167
51,-0.2167
52,-0.2167
53,-0.2167
54,-0.2167
55,-0.2167
56,-0.2167
57,-0.2167
58,-0.2167
59,-0.2167
60,-0.2167
61,-0.2167
62,-0.2167
63,-0.2167
64,-0.2167
65,-0.2167
66,-0.2167
67,-0.2167
68,-0.2167
69,-0.2167
70,-0.2167
71,-0.2167
72,-0.2167
73,-0.2167
74,-0.2167
75,-0.2167
76,-0.2167
77,-0.2167
78,-0.2167
79,-0.2167
80,-0.2167
81,-0.2167
82,-0.2167
83,-0.2167
84,0.17429
85,4.3133
86,3.7875
87,4.0976
88,0.30911
89,0.012499
90,-0.027948
91,6.4031
92,-0.2167
93,-0.2167
94,-0.2167
95,-0.2167
