time,value
0,-0.29885
1,-0.2883
2,-0.30280999999999997
3,-0.34822
4,-0.36116
5,-0.12440999999999999
6,-0.32647
7,-0.32442
8,-0.315
9,-0.31493000000000004
10,-0.30575
11,-0.29046
12,-0.24866999999999997
13,-0.21541999999999997
14,-0.3613
15,-0.70822
16,-0.69162
17,-1.5887
18,-1.9583
19,-2.9851
20,-2.6079
21,-3.3211
22,-2.8465
23,-3.1999
24,-3.5107
25,-3.4939999999999998
26,-3.1046
27,-3.0004
28,-2.2653
29,-2.0094
30,-1.5171
31,-0.80558
32,-0.046029
33,0.50202
34,0.8622200000000001
35,1.0923
36,1.4876
37,1.7674
38,1.9439
39,1.9897
40,1.9372
41,1.9957
42,2.1115
43,1.9941
44,2.1657
45,2.2105
46,2.1575
47,1.9315
48,2.0325
49,2.2477
50,2.0382
51,2.0192
52,2.1205
53,2.0977
54,2.099
55,2.1551
56,1.9912
57,1.8882
58,1.7464
59,1.8479
60,1.7691
61,1.7188
62,1.6308
63,1.6049
64,1.6381
65,1.4399
66,1.5022
67,1.2609
68,1.2819999999999998
69,1.2807
70,1.1941
71,1.1919
72,1.1402
73,1.2477
74,1.2481
75,1.4356
76,1.5135
77,1.3667
78,1.5763
79,1.3184
80,1.1822
81,0.9769100000000001
82,0.79856
83,0.64041
84,0.8943
85,0.76083
86,1.0822
87,1.6299
88,1.1515
89,0.88281
90,0.96034
91,0.5403899999999999
92,0.24577
93,0.17231
94,0.08042
95,-0.21356
96,-0.5075
97,-1.2682
98,-1.2869
99,-1.2864
100,-1.3995
101,-1.6102
102,-1.528
103,-1.6619
104,-1.7184
105,-1.4956
106,-1.4114
107,-1.3465
108,-1.1382
109,-1.1267
110,-1.1385
111,-1.1441
112,-1.0116
113,-0.9431799999999999
114,-0.8642200000000001
115,-0.40464
116,-0.44781000000000004
117,-0.36202
118,-0.55704
119,-0.52628
120,-0.48936
121,-0.30019
122,-0.30148
123,-0.25337
124,-0.12855
125,-0.097474
126,-0.1171
127,-0.093917
128,-0.071511
129,-0.037088
130,-0.040713
131,-0.073614
132,-0.004524800000000001
133,0.063198
134,0.097268
135,0.066982
136,0.058926
137,-0.014676
138,-0.061256
139,-0.046844
140,-0.048612
141,-0.044018
142,-0.05065
143,-0.067675
144,-0.054366
145,-0.13304000000000002
146,-0.06414
147,-0.10343
148,-0.10495
149,-0.10052
150,-0.094448
151,-0.053037
152,-0.10248
153,-0.082607
154,-0.068623
155,-0.069493
156,-0.016138
157,-0.024844
158,0.00066052
159,0.10658
160,0.13894
161,0.128
162,0.14300000000000002
163,0.19372999999999999
164,0.12315999999999999
165,0.14654
166,0.057509000000000005
167,0.069087
168,0.042724
169,-0.0362
170,0.027254
171,-0.033911000000000004
172,-0.064773
173,-0.044063
174,-0.017308
175,0.056435
176,0.14902
177,0.043914
178,0.012927000000000001
179,-0.11477000000000001
180,-0.08958200000000001
181,-0.046104
182,-0.033125
183,-0.048551
184,0.080337
185,-0.05245
186,0.05525700000000001
187,0.029763
188,-0.0077535
189,-0.063139
190,0.078227
191,0.023675
192,-0.0052158000000000005
193,0.030876999999999998
194,0.046722
195,0.036948
196,0.053342999999999995
197,0.050615
198,-0.047358
199,-0.10564000000000001
200,-0.10597000000000001
201,-0.066243
202,-0.059187000000000003
203,0.0021709
204,-0.016753
205,-0.044220999999999996
206,-0.08061499999999999
207,-0.0052928
208,-0.06641799999999999
209,-0.066289
210,-0.071988
211,-0.048227
212,-0.051085000000000005
213,-0.06224
214,-0.12817
215,-0.1289
216,-0.1343
217,-0.12952
218,-0.012206
219,-0.15467999999999998
220,-0.13061
221,-0.32553000000000004
222,-0.13505
223,-0.2912
224,-0.15913
225,-0.091154
226,-0.086522
227,-0.09259400000000001
228,-0.093378
229,-0.10403
230,-0.10572999999999999
231,-0.11965
232,-0.19286
233,-0.11974000000000001
234,-0.12190999999999999
235,-0.1254
236,-0.15295
237,-0.31255
238,-0.4121
239,-0.43733
240,-0.45666999999999996
241,-0.44978
242,-0.36341999999999997
243,-0.1881
244,-0.17559
245,-0.18600000000000003
246,-0.18775999999999998
247,-0.19122
248,-0.18899000000000002
249,-0.20119
250,-0.083426
251,-0.20549
252,-0.19426
253,-0.19055999999999998
254,-0.20409000000000002
255,-0.21391999999999997
256,-0.20431
257,-0.08340499999999999
258,-0.18900999999999998
259,0.035487
260,-0.19523
261,-0.040699
262,-0.19475
263,-0.042743
264,0.040596
265,-0.21678000000000003
266,-0.23271999999999998
267,-0.29714
268,-0.21534
269,-0.21195
270,-0.20792
271,-0.27666
272,-0.37099
273,-0.20798000000000003
274,-0.20285
275,-0.20496
276,-0.21095
277,-0.217
278,-0.22804000000000002
279,-0.23920999999999998
280,-0.23143000000000002
281,-0.038585
282,-0.24026999999999998
283,-0.24495
284,-0.23905
285,-0.45951000000000003
286,-0.4318
287,-0.20240999999999998
288,-0.2365
289,-0.25285
290,-0.26243
291,-0.26815
292,-0.26644
293,-0.25189
294,-0.2439
295,-0.24481
296,-0.25266
297,-0.26002
298,-0.26589
299,-0.26495
