time,value
0,-0.94909
1,0.45156
2,1.5021
3,-0.31879
4,-0.94909
5,-0.38883
6,1.5721
7,0.38153000000000004
8,-0.94909
9,-0.94909
10,1.5721
11,0.66166
12,-0.94909
13,-0.94909
14,1.2219
15,1.0118
16,-0.94909
17,-0.94909
18,0.73169
19,1.2219
20,-0.94909
21,-0.94909
22,0.59163
23,1.2919999999999998
24,-0.94909
25,-0.94909
26,0.5216
27,1.2219
28,-0.94909
29,-0.94909
30,0.38153000000000004
31,1.2919999999999998
32,-0.94909
33,-0.94909
34,0.3115
35,1.2919999999999998
36,-0.94909
37,-0.94909
38,-0.038664
39,1.5021
40,-0.7389899999999999
41,-0.94909
42,-0.31879
43,1.5721
44,-0.38883
45,-0.94909
46,-0.7389899999999999
47,1.5721
48,-0.038664
49,-0.94909
50,-0.94909
51,1.7121
52,-0.038664
53,-0.94909
54,-0.94909
55,1.5021
56,0.24147
57,-0.94909
58,-0.94909
59,1.6421
60,0.66166
61,-0.94909
62,-0.94909
63,1.2219
64,1.1519
65,-0.94909
66,-0.94909
67,0.73169
68,1.432
69,-0.94909
70,-0.94909
71,0.45156
72,1.5021
73,-0.80902
74,-0.94909
75,0.17143
76,1.5021
77,-0.52889
78,-0.94909
79,0.031369
80,1.5721
81,-0.59892
82,-0.94909
83,-0.038664
84,1.5721
85,-0.52889
86,-0.94909
87,0.1014
88,1.5021
89,-0.7389899999999999
90,-0.94909
91,0.17143
92,1.5021
93,-0.94909
94,-0.94909
95,1.0118
