[<text>
<title>alexander's &lt;alx&gt; 2nd qtr feb 7</title>
<dateline>    new york, march 24 -     </dateline>shr 57 cts vs 72 cts
    net 2.7 mln vs 3.3 mln
    six months
    shr 45 cts vs 84 cts
    net 2.1 mln vs 3.8 mln
    note:1987 six months includes 790,000 dlr charge. 1986 six
months includes 679,000 net gain.
 reuter
</text>]