time,value
0,-0.5230199999999999
1,-0.31556
2,-0.57595
3,-0.78922
4,-0.69699
5,-0.65447
6,-0.7209800000000001
7,-0.75466
8,-0.65772
9,-0.56824
10,-0.61424
11,-0.41797
12,-0.26384
13,-0.16735
14,-0.14833
15,-0.0031941999999999995
16,0.18145
17,0.31496
18,0.43144
19,0.59468
20,0.69248
21,0.7113
22,0.78375
23,0.8076300000000001
24,0.8238700000000001
25,0.84139
26,0.8780100000000001
27,0.89444
28,0.97262
29,1.1056
30,1.2028
31,1.4796
32,2.4059
33,3.0983
34,3.5201
35,3.4755
36,2.8760000000000003
37,2.5454
38,2.3156
39,1.9156
40,1.4381
41,1.1579
42,0.8363
43,0.70087
44,0.48478999999999994
45,0.15536
46,0.247
47,0.042779000000000005
48,0.08644099999999999
49,0.10275
50,0.076572
51,0.032704000000000004
52,0.33371
53,0.5240100000000001
54,0.53697
55,0.58178
56,0.70289
57,0.70563
58,0.72496
59,0.67188
60,0.59417
61,0.7290399999999999
62,0.6563399999999999
63,0.56776
64,0.45242
65,0.47503
66,0.35962
67,0.47442
68,0.2974
69,0.20715
70,0.17443
71,0.21506
72,0.30781
73,0.1418
74,0.17978
75,0.040593000000000004
76,-0.004769300000000001
77,0.12057999999999999
78,-0.067534
79,-0.031121
80,0.1803
81,0.036877
82,0.027908999999999996
83,-3.6499000000000004e-05
84,0.054284000000000006
85,0.08215700000000001
86,-0.017283
87,-0.054105999999999994
88,0.0044109
89,0.17559
90,0.1635
91,0.25751
92,0.24547
93,0.28313
94,0.38433
95,0.21547
96,0.31223
97,0.2991
98,0.28655
99,0.27778
100,0.36727
101,0.38144
102,0.28596
103,0.31148000000000003
104,0.35352
105,0.45855
106,0.55975
107,0.59925
108,0.90099
109,1.0491
110,1.385
111,1.5096
112,1.4203
113,1.2828
114,1.2467
115,1.1706
116,1.2565
117,1.4154
118,0.83604
119,0.36312
120,0.44425
121,0.48253999999999997
122,0.0053556
123,0.09929199999999999
124,0.11804
125,0.066026
126,0.0080896
127,0.44653000000000004
128,0.73921
129,0.9388299999999999
130,1.2161
131,1.4417
132,1.5827
133,1.8967
134,2.2168
135,2.3803
136,2.5372
137,2.6618
138,5.7415
139,3.2956
140,0.098807
141,-0.18144000000000002
142,-0.80776
143,0.019790000000000002
144,0.62074
145,0.92986
146,0.52583
147,0.51618
148,0.6070399999999999
149,0.2918
150,-0.16000999999999999
151,-0.11212000000000001
152,0.24475
153,0.46256
154,0.53259
155,0.46246000000000004
156,0.38054
157,0.41777
158,0.43132
159,0.53708
160,0.53036
161,0.35327
162,0.32086
163,0.31245
164,0.30801999999999996
165,0.33099
166,0.32013
167,0.46597
168,0.36711
169,0.31533
170,0.15157
171,0.082149
172,-0.035982
173,0.0047226
174,0.12152
175,0.18312
176,0.12084
177,0.06757300000000001
178,0.34749
179,0.42006000000000004
180,0.22376999999999997
181,0.0040577
182,-0.13739
183,-0.18728
184,-0.14632
185,-0.17528
186,-0.17029
187,-0.24286999999999997
188,-0.059401999999999996
189,-0.10497999999999999
190,-0.013097999999999999
191,-0.1912
192,-0.39576999999999996
193,-0.3567
194,-0.32347
195,-0.30892
196,-0.31146
197,-0.36586
198,-0.5551
199,-0.43898000000000004
200,-0.42591
201,-0.57512
202,-0.61954
203,-0.45418000000000003
204,-0.6931
205,-0.5412600000000001
206,-0.48765
207,-0.49335
208,-0.5504399999999999
209,-0.85135
210,-0.8750700000000001
211,-0.88084
212,-0.9096
213,-0.7803100000000001
214,-0.8400200000000001
215,-0.90169
216,-0.8478
217,-0.90854
218,-0.7834899999999999
219,-0.8217200000000001
220,-0.93668
221,-0.75693
222,-0.6885399999999999
223,-0.83547
224,-0.80129
225,-0.72531
226,-0.66237
227,-0.63593
228,-0.7521
229,-0.67487
230,-0.6613100000000001
231,-0.83331
232,-0.97635
233,-0.9058200000000001
234,-0.90951
235,-0.9371700000000001
236,-1.0118
237,-1.1953
238,-1.0067
239,-0.9211299999999999
240,-0.89733
241,-1.167
242,-0.9856799999999999
243,-1.0476
244,-1.1575
245,-1.022
246,-0.99087
247,-1.0536
248,-1.0558
249,-1.1519
250,-1.1637
251,-1.0928
252,-1.0868
253,-1.077
254,-1.0882
255,-1.0416
256,-1.0972
257,-1.0925
258,-1.0835
259,-1.0971
260,-1.1072
261,-1.0926
262,-1.0927
263,-1.088
264,-1.043
265,-1.1136
266,-1.0664
267,-1.1195
268,-1.2646
269,-1.2577
270,-1.1983
271,-0.97235
272,-0.97862
273,-1.1166
274,-1.1234
275,-1.1255
276,-1.2426
277,-1.1404
278,-1.1526
279,-1.2609
280,-1.146
281,-1.1193
282,-1.016
283,-1.158
284,-1.1827
285,-1.2839
286,-1.1468
287,-1.1221
288,-1.3991
289,-1.1566
290,-0.9998600000000001
291,-1.14
292,-1.3093
293,-1.3118
294,-1.1542
295,-1.1505
296,-1.162
297,-1.1618
298,-1.1603
299,-1.0103
