time,value
0,-0.2019
1,-0.2019
2,-0.2019
3,-0.2019
4,-0.2019
5,-0.2019
6,-0.2019
7,-0.2019
8,-0.2019
9,-0.2019
10,-0.2019
11,-0.2019
12,-0.2019
13,-0.2019
14,-0.2019
15,-0.2019
16,-0.2019
17,-0.2019
18,-0.2019
19,-0.2019
20,-0.2019
21,-0.2019
22,-0.2019
23,-0.2019
24,-0.2019
25,-0.2019
26,-0.2019
27,-0.2019
28,-0.2019
29,3.6348
30,-0.2019
31,-0.2019
32,-0.2019
33,-0.2019
34,-0.2019
35,-0.2019
36,-0.2019
37,-0.2019
38,-0.2019
39,-0.2019
40,-0.2019
41,-0.2019
42,-0.2019
43,-0.2019
44,-0.2019
45,-0.2019
46,-0.2019
47,-0.2019
48,-0.2019
49,-0.2019
50,-0.2019
51,-0.2019
52,-0.2019
53,-0.2019
54,-0.2019
55,-0.2019
56,-0.2019
57,-0.2019
58,-0.2019
59,-0.2019
60,-0.2019
61,-0.2019
62,-0.2019
63,-0.2019
64,-0.2019
65,-0.2019
66,-0.2019
67,-0.2019
68,-0.2019
69,-0.2019
70,-0.2019
71,-0.2019
72,5.0797
73,-0.2019
74,-0.2019
75,-0.2019
76,-0.2019
77,-0.2019
78,-0.2019
79,-0.2019
80,-0.2019
81,-0.2019
82,-0.2019
83,-0.2019
84,-0.2019
85,-0.2019
86,6.2756
87,-0.2019
88,-0.2019
89,-0.2019
90,-0.2019
91,-0.2019
92,3.5849
93,-0.2019
94,-0.2019
95,-0.2019
