time,value
0,-0.21606
1,-0.21606
2,-0.21606
3,-0.21606
4,-0.21606
5,-0.21606
6,-0.21606
7,-0.21606
8,-0.21606
9,-0.21606
10,-0.21606
11,-0.21606
12,-0.21606
13,-0.21606
14,-0.21606
15,-0.21606
16,-0.21606
17,-0.21606
18,-0.21606
19,-0.21606
20,-0.21606
21,-0.21606
22,-0.21606
23,-0.21606
24,0.83765
25,0.11669000000000002
26,-0.21606
27,-0.21606
28,-0.21606
29,-0.21606
30,-0.21606
31,-0.21606
32,-0.21606
33,-0.21606
34,-0.21606
35,-0.21606
36,-0.21606
37,2.6955
38,-0.21606
39,-0.21606
40,1.6973
41,-0.21606
42,-0.21606
43,4.2483
44,-0.21606
45,-0.21606
46,-0.21606
47,-0.21606
48,-0.21606
49,-0.21606
50,-0.21606
51,-0.21606
52,-0.21606
53,-0.21606
54,-0.21606
55,-0.21606
56,2.03
57,7.6036
58,-0.21606
59,-0.21606
60,-0.21606
61,-0.21606
62,-0.21606
63,-0.21606
64,-0.21606
65,-0.21606
66,-0.21606
67,-0.21606
68,-0.21606
69,-0.21606
70,-0.21606
71,-0.21606
72,-0.21606
73,-0.21606
74,-0.21606
75,-0.21606
76,-0.21606
77,-0.21606
78,-0.21606
79,-0.21606
80,-0.21606
81,-0.21606
82,-0.21606
83,-0.21606
84,-0.21606
85,-0.21606
86,-0.21606
87,-0.21606
88,-0.21606
89,-0.21606
90,-0.21606
91,-0.21606
92,-0.21606
93,-0.21606
94,-0.21606
95,-0.21606
