time,value
0,-0.19158
1,-0.19158
2,-0.19158
3,-0.19158
4,-0.19158
5,-0.19158
6,-0.19158
7,-0.19158
8,-0.19158
9,-0.19158
10,-0.19158
11,-0.19158
12,-0.19158
13,-0.19158
14,-0.19158
15,-0.19158
16,-0.19158
17,-0.19158
18,-0.19158
19,-0.19158
20,-0.19158
21,-0.19158
22,-0.19158
23,-0.19158
24,-0.19158
25,-0.19158
26,-0.19158
27,-0.19158
28,-0.19158
29,-0.19158
30,-0.19158
31,-0.19158
32,-0.19158
33,-0.19158
34,-0.19158
35,-0.19158
36,-0.19158
37,-0.19158
38,-0.19158
39,-0.19158
40,-0.19158
41,-0.19158
42,-0.19158
43,-0.19158
44,-0.19158
45,-0.19158
46,-0.19158
47,-0.19158
48,-0.19158
49,1.2548
50,6.4447
51,0.26218
52,0.248
53,0.063663
54,-0.19158
55,-0.19158
56,-0.19158
57,-0.19158
58,-0.19158
59,-0.19158
60,-0.19158
61,-0.19158
62,-0.19158
63,-0.19158
64,-0.19158
65,-0.19158
66,-0.19158
67,-0.19158
68,-0.19158
69,-0.19158
70,-0.19158
71,-0.063958
72,6.8843
73,1.0705
74,0.21964
75,0.09202300000000001
76,-0.19158
77,-0.19158
78,-0.19158
79,-0.19158
80,-0.19158
81,-0.19158
82,-0.19158
83,-0.19158
84,-0.19158
85,-0.19158
86,-0.19158
87,-0.19158
88,-0.19158
89,-0.19158
90,-0.19158
91,-0.19158
92,-0.19158
93,-0.19158
94,-0.19158
95,-0.19158
