time,value
0,1.8263
1,1.8285
2,1.8016
3,1.7623
4,1.6623
5,1.5558
6,1.4477
7,1.3441
8,1.239
9,1.1332
10,1.0279
11,0.92169
12,0.81274
13,0.70838
14,0.6117
15,0.5091899999999999
16,0.40781
17,0.30908
18,0.21574000000000002
19,0.12536
20,0.030639999999999997
21,-0.061051999999999995
22,-0.14611
23,-0.2401
24,-0.32741
25,-0.39975
26,-0.46771999999999997
27,-0.5486
28,-0.6078
29,-0.68111
30,-0.73841
31,-0.79773
32,-0.8541799999999999
33,-0.92468
34,-0.9681700000000001
35,-1.0318
36,-1.0903
37,-1.1431
38,-1.1607
39,-1.1701
40,-1.2018
41,-1.2139
42,-1.2421
43,-1.2506
44,-1.2515
45,-1.2771
46,-1.2629
47,-1.2408
48,-1.2107
49,-1.2028
50,-1.1579
51,-1.1345
52,-1.0767
53,-1.0136
54,-0.9459799999999999
55,-0.9029
56,-0.9068299999999999
57,-0.85025
58,-0.78476
59,-0.71487
60,-0.63747
61,-0.57209
62,-0.48700000000000004
63,-0.41358
64,-0.32574000000000003
65,-0.24266
66,-0.14795999999999998
67,-0.06216699999999999
68,0.026656
69,0.12239000000000001
70,0.22724
71,0.33651
72,0.43133
73,0.5312899999999999
74,0.63831
75,0.7426699999999999
76,0.8463299999999999
77,0.95314
78,1.0602
79,1.1653
80,1.2721
81,1.3791
82,1.4831
83,1.5855
84,1.6339
85,1.6695
86,1.6676
87,1.6685
88,1.5951
89,1.5229
90,1.4183
91,1.3104
92,1.1979
93,1.1197
94,1.0149
95,0.9086
96,0.8801200000000001
97,0.86774
98,0.76295
99,0.75341
100,0.84188
101,0.76525
102,0.65459
103,0.5352100000000001
104,0.46928000000000003
105,0.36374
106,0.26397
107,0.16459000000000001
108,0.068025
109,-0.027906
110,-0.12229000000000001
111,-0.2161
112,-0.29746999999999996
113,-0.38067
114,-0.46383
115,-0.5343399999999999
116,-0.61692
117,-0.6855600000000001
118,-0.75651
119,-0.8257200000000001
120,-0.8930299999999999
121,-0.9642200000000001
122,-1.0163
123,-1.0656
124,-1.1271
125,-1.1598
126,-1.2132
127,-1.2352
128,-1.2874
129,-1.3012
130,-1.3249
131,-1.34
132,-1.3464
133,-1.3441
134,-1.3333
135,-1.3137
136,-1.2858
137,-1.2504
138,-1.2096
139,-1.1864
140,-1.13
141,-1.0684
142,-1.0019
143,-0.9495899999999999
144,-0.89086
145,-0.8427100000000001
146,-0.77905
147,-0.70644
148,-0.62973
149,-0.54995
150,-0.48286999999999997
151,-0.39693
152,-0.31535
153,-0.22788000000000003
154,-0.13824
155,-0.052052
156,0.0315
157,0.1206
158,0.22046
159,0.31367
160,0.41594
161,0.51889
162,0.61635
163,0.72105
164,0.8287100000000001
165,0.93191
166,1.0378
167,1.1131
168,1.2179
169,1.3272
170,1.4379
171,1.508
172,1.6163
173,1.6823
174,1.7321
175,1.785
