time,value
0,-2.3201
1,-2.3201
2,-2.3201
3,-2.3201
4,-2.3223
5,-2.3223
6,-2.3223
7,-2.3223
8,-2.3245
9,-2.3242
10,-2.3239
11,-2.3282
12,-2.3348
13,-2.3365
14,-2.3358
15,-2.3349
16,-2.3342
17,-2.3331
18,-2.3319
19,-2.3306
20,-2.3295
21,-2.3279
22,-2.3262
23,-2.3266
24,-2.3246
25,-2.3231
26,-2.3209
27,-2.3186
28,-2.3161
29,-2.3169999999999997
30,-2.3249
31,-2.3278
32,-2.325
33,-2.3221
34,-2.3199
35,-2.3168
36,-2.3136
37,-2.3123
38,-2.3097
39,-2.3062
40,-2.3025
41,-2.2988
42,-2.2949
43,-2.2919
44,-2.2879
45,-2.2838
46,-2.2795
47,-2.2763
48,-2.2719
49,-2.2674
50,-2.272
51,-2.2765
52,-2.2749
53,-2.2701
54,-2.2652
55,-2.2603
56,-2.2565
57,-2.2514
58,-2.2462
59,-2.2427
60,-2.2387
61,-2.2333
62,-2.2278
63,-2.2222
64,-2.2149
65,-2.2106
66,-2.2049
67,-2.1991
68,-2.1933
69,-2.1888
70,-2.1829
71,-2.1768
72,-2.1707
73,-2.1646
74,-2.16
75,-2.1537
76,-2.1474
77,-2.1411
78,-2.1363
79,-2.1299
80,-2.1234
81,-2.1169
82,-2.112
83,-2.1054
84,-2.0987
85,-2.092
86,-2.0853
87,-2.0802
88,-2.0734
89,-2.0666
90,-2.0597
91,-2.0545
92,-2.0476
93,-2.0406
94,-2.0336
95,-2.0283
96,-2.0252
97,-2.0203
98,-2.0119
99,-2.0038
100,-2.0007
101,-1.994
102,-1.9905
103,-1.9887
104,-1.9816
105,-1.9762
106,-1.969
107,-1.9618
108,-1.9546
109,-1.9491
110,-1.9418
111,-1.9345
112,-1.9271
113,-1.9216
114,-1.9142
115,-1.9068
116,-1.8994
117,-1.8919
118,-1.8863
119,-1.8788
120,-1.8713
121,-1.8637
122,-1.858
123,-1.8505
124,-1.8429
125,-1.8341
126,-1.8264
127,-1.8207
128,-1.8130000000000002
129,-1.8053
130,-1.7976
131,-1.7918
132,-1.7841
133,-1.7769
134,-1.7705
135,-1.7628
136,-1.757
137,-1.7493
138,-1.7415
139,-1.7326
140,-1.7268
141,-1.719
142,-1.7112
143,-1.703
144,-1.6997
145,-1.6919
146,-1.6841
147,-1.6763
148,-1.6685
149,-1.6615
150,-1.6537
151,-1.6458
152,-1.6379
153,-1.6348
154,-1.6277
155,-1.6188
156,-1.6109
157,-1.6030000000000002
158,-1.5961
159,-1.5882
160,-1.5802
161,-1.5723
162,-1.5664
163,-1.5613
164,-1.5572
165,-1.5493
166,-1.5434
167,-1.5354
168,-1.5265
169,-1.5185
170,-1.5106
171,-1.5075
172,-1.5015
173,-1.4936
174,-1.4856
175,-1.4796
176,-1.4707
177,-1.4627
178,-1.4547
179,-1.4467
180,-1.4407
181,-1.4327
182,-1.4247
183,-1.4168
184,-1.4118
185,-1.4038
186,-1.3958
187,-1.3878
188,-1.3798
189,-1.3737
190,-1.3647
191,-1.3567
192,-1.3486
193,-1.3425
194,-1.3345
195,-1.3287
196,-1.3218
197,-1.3157
198,-1.3077
199,-1.2996
200,-1.2915
201,-1.2825
202,-1.2764
203,-1.2683
204,-1.2602
205,-1.252
206,-1.2459
207,-1.2378
208,-1.2297
209,-1.226
210,-1.2192
211,-1.2131
212,-1.205
213,-1.1968
214,-1.1887
215,-1.1826
216,-1.1735
217,-1.1653
218,-1.1572
219,-1.149
220,-1.1429
221,-1.1361
222,-1.1334
223,-1.1253
224,-1.1191
225,-1.1109
226,-1.1028
227,-1.0937
228,-1.0875
229,-1.0814
230,-1.0793
231,-1.0732
232,-1.0691
233,-1.067
234,-1.0629
235,-1.0547
236,-1.0464
237,-1.0403
238,-1.032
239,-1.0238
240,-1.0155
241,-1.0073
242,-1.0002
243,-0.99197
244,-0.9837
245,-0.9754200000000001
246,-0.9683799999999999
247,-0.96298
248,-0.9571700000000001
249,-0.9489
250,-0.94063
251,-0.9344299999999999
252,-0.92614
253,-0.91786
254,-0.90874
255,-0.9033399999999999
256,-0.89504
257,-0.88592
258,-0.87761
259,-0.8713700000000001
260,-0.86306
261,-0.8555299999999999
262,-0.84641
263,-0.8388700000000001
264,-0.8326100000000001
265,-0.8242700000000001
266,-0.81592
267,-0.80678
268,-0.80051
269,-0.7921600000000001
270,-0.78379
271,-0.77542
272,-0.76705
273,-0.76077
274,-0.75315
275,-0.7447600000000001
276,-0.73637
277,-0.72932
278,-0.72168
279,-0.71327
280,-0.70487
281,-0.69571
282,-0.6894100000000001
283,-0.68099
284,-0.67257
285,-0.66415
286,-0.66057
287,-0.65551
288,-0.64846
289,-0.64005
290,-0.63374
291,-0.62532
292,-0.6169
293,-0.60847
294,-0.60004
295,-0.59372
296,-0.58528
297,-0.5768399999999999
298,-0.56911
299,-0.56913
300,-0.56702
301,-0.5585600000000001
302,-0.55008
303,-0.54161
304,-0.53525
305,-0.52677
306,-0.5182899999999999
307,-0.5098
308,-0.50344
309,-0.49494
310,-0.48645
311,-0.47795
312,-0.46945
313,-0.46307
314,-0.45524
315,-0.44673
316,-0.43821000000000004
317,-0.43183
318,-0.42331
319,-0.41478000000000004
320,-0.40626
321,-0.40543
322,-0.40589000000000003
323,-0.39799
324,-0.38944
325,-0.38089
326,-0.37448000000000004
327,-0.36593000000000003
328,-0.35736999999999997
329,-0.34881
330,-0.34239
331,-0.33383
332,-0.32526
333,-0.3167
334,-0.30965
335,-0.30564
336,-0.30162
337,-0.29306
338,-0.2845
339,-0.27808
340,-0.26950999999999997
341,-0.26095
342,-0.25238
343,-0.24319000000000002
344,-0.23676
345,-0.22818000000000002
346,-0.21899999999999997
347,-0.21439
348,-0.21100000000000002
349,-0.20243
350,-0.19387000000000001
351,-0.1853
352,-0.17825
353,-0.16968
354,-0.1611
355,-0.15253
356,-0.14487
357,-0.14088
358,-0.13535999999999998
359,-0.12679
360,-0.11822
361,-0.11117
362,-0.1026
363,-0.094024
364,-0.08544500000000001
365,-0.07686599999999999
366,-0.07135599999999999
367,-0.06675299999999999
368,-0.059709000000000005
369,-0.051137
370,-0.044706
371,-0.035516000000000006
372,-0.026942
373,-0.018364
374,-0.009783
375,-0.0033469999999999997
376,0.0027719999999999997
377,0.009515000000000001
378,0.018087
379,0.024518
380,0.033095
381,0.042283999999999995
382,0.050863
383,0.057299
384,0.059745000000000006
385,0.06588
386,0.074452
387,0.083023
388,0.08945499999999999
389,0.09803300000000001
390,0.10661
391,0.1158
392,0.12222999999999999
393,0.13082
394,0.1394
395,0.14799
396,0.15658
397,0.16302
398,0.16912
399,0.17369
400,0.18288
401,0.18778
402,0.19238
403,0.19727999999999998
404,0.20585
405,0.21504
406,0.22146999999999997
407,0.23005
408,0.23863
409,0.24720999999999999
410,0.25365
411,0.26223
412,0.27142
413,0.28001
414,0.28645
415,0.29504
416,0.30363
417,0.31282
418,0.31737
419,0.32288
420,0.33146
421,0.34005
422,0.34864
423,0.35508
424,0.36367
425,0.37226
426,0.38086
427,0.39005
428,0.3965
429,0.4051
430,0.4137
431,0.4223
432,0.42875
433,0.43793999999999994
434,0.44246
435,0.45009
436,0.45869
437,0.46573000000000003
438,0.47433000000000003
439,0.47826
440,0.48041000000000006
441,0.48686
442,0.49546
443,0.5040600000000001
444,0.51266
445,0.51755
446,0.52088
447,0.52577
448,0.53437
449,0.54297
450,0.54942
451,0.54942
452,0.55588
453,0.56448
454,0.57093
455,0.5795399999999999
456,0.58815
457,0.5967600000000001
458,0.60537
459,0.61183
460,0.62045
461,0.62088
462,0.62075
463,0.62722
464,0.63585
465,0.64448
466,0.6531100000000001
467,0.65958
468,0.66765
469,0.67629
470,0.68493
471,0.69357
472,0.70005
473,0.7086899999999999
474,0.71733
475,0.72597
476,0.73246
477,0.7411
478,0.74975
479,0.7584
480,0.76705
481,0.77353
482,0.78165
483,0.7811100000000001
484,0.78003
485,0.7784300000000001
486,0.7763100000000001
487,0.7742100000000001
488,0.7731600000000001
489,0.76831
490,0.7651
491,0.7608699999999999
492,0.75385
493,0.74465
494,0.73815
495,0.72946
496,0.7257600000000001
497,0.71938
498,0.71287
499,0.70418
500,0.6955
501,0.6863
502,0.67762
503,0.67111
504,0.6669
505,0.66372
506,0.6545300000000001
507,0.6480100000000001
508,0.63932
509,0.63013
510,0.62144
511,0.61442
512,0.61073
513,0.60706
514,0.59836
515,0.58967
516,0.58315
517,0.57396
518,0.5652699999999999
519,0.55658
520,0.5479
521,0.54138
522,0.53719
523,0.53352
524,0.52482
525,0.5178
526,0.5091100000000001
527,0.5020899999999999
528,0.49942
529,0.49506999999999995
530,0.48638000000000003
531,0.47768999999999995
532,0.469
533,0.46248
534,0.46031000000000005
535,0.45546000000000003
536,0.44677
537,0.43809
538,0.43157
539,0.42289
540,0.4142
541,0.41152
542,0.40833
543,0.40131
544,0.39263000000000003
545,0.38394
546,0.37475
547,0.36823
548,0.35955
549,0.35535
550,0.35166
551,0.34297
552,0.33646
553,0.32726
554,0.31856999999999996
555,0.30989
556,0.30337
557,0.29968
558,0.29551
559,0.28681
560,0.28029
561,0.2711
562,0.26408000000000004
563,0.25992
564,0.25458000000000003
565,0.24756
566,0.24223000000000003
567,0.23811
568,0.2311
569,0.22457
570,0.21586
571,0.20715
572,0.19796
573,0.18925999999999998
574,0.18273
575,0.17403
576,0.1687
577,0.16458
578,0.15974000000000002
579,0.15104
580,0.14185
581,0.13314
582,0.12904000000000002
583,0.12542999999999999
584,0.11671
585,0.10800000000000001
586,0.099286
587,0.092753
588,0.08404
589,0.07533200000000001
590,0.066622
591,0.060092999999999994
592,0.051385
593,0.042681000000000004
594,0.033977999999999994
595,0.024786000000000002
596,0.018259
597,0.009558
598,0.00085601
599,-0.007843000000000001
600,-0.012686
601,-0.016819999999999998
602,-0.024322
603,-0.033027999999999995
604,-0.041731
605,-0.048257999999999995
606,-0.05745
607,-0.06615399999999999
608,-0.07485499999999999
609,-0.08138
610,-0.086712
611,-0.090837
612,-0.09785
613,-0.10655999999999999
614,-0.11309000000000001
615,-0.12179000000000001
616,-0.13097999999999999
617,-0.13969
618,-0.14620999999999998
619,-0.15491
620,-0.16072999999999998
621,-0.16485
622,-0.17138
623,-0.18057
624,-0.18928
625,-0.19799
626,-0.20209000000000002
627,-0.20351
628,-0.21223000000000003
629,-0.22095
630,-0.23014
631,-0.23667
632,-0.24538000000000001
633,-0.25456999999999996
634,-0.25865
635,-0.26613000000000003
636,-0.27314
637,-0.27936
638,-0.28292
639,-0.29211
640,-0.29693
641,-0.30091999999999997
642,-0.30619
643,-0.31537
644,-0.31889
645,-0.32238
646,-0.32500999999999997
647,-0.32544
648,-0.32715
649,-0.32841
650,-0.33008000000000004
651,-0.33089
652,-0.3313
653,-0.32950999999999997
654,-0.32892
655,-0.32750999999999997
656,-0.31873
657,-0.30994
658,-0.30336
659,-0.29496
660,-0.28617
661,-0.27738
662,-0.27079000000000003
663,-0.262
664,-0.26350999999999997
665,-0.26022
666,-0.25179
667,-0.24775
668,-0.24698
669,-0.24328000000000002
670,-0.23481999999999997
671,-0.23364000000000001
672,-0.23279
673,-0.22396999999999997
674,-0.21548
675,-0.20665
676,-0.20035999999999998
677,-0.19945
678,-0.19566
679,-0.18683
680,-0.18052
681,-0.17169
682,-0.16788
683,-0.16688
684,-0.16276
685,-0.15392
686,-0.14508
687,-0.13624
688,-0.12739
689,-0.12075999999999999
690,-0.11192
691,-0.10307000000000001
692,-0.094229
693,-0.087595
694,-0.078751
695,-0.069904
696,-0.061058
697,-0.05249500000000001
698,-0.045859
699,-0.03701
700,-0.028162
701,-0.019313
702,-0.012675
703,-0.003827
704,0.005024
705,0.013875
706,0.022726
707,0.029363999999999998
708,0.038217
709,0.047344
710,0.056195
711,0.062836
712,0.071686
713,0.080539
714,0.089394
715,0.092153
716,0.095475
717,0.10239
718,0.11124
719,0.12009
720,0.12673
721,0.13558
722,0.14470999999999998
723,0.15355
724,0.16019
725,0.16904
726,0.17789000000000002
727,0.18675
728,0.19532
729,0.20196
730,0.21081999999999998
731,0.21966999999999998
732,0.22851999999999997
733,0.23543000000000003
734,0.24429
735,0.25314000000000003
736,0.262
737,0.27085
738,0.27749
739,0.28635
740,0.29185
741,0.29711
742,0.30374
743,0.31259000000000003
744,0.32172
745,0.33057
746,0.33721
747,0.34413
748,0.34745
749,0.35244000000000003
750,0.36129
751,0.36793000000000003
752,0.37677
753,0.38561999999999996
754,0.39447
755,0.40110999999999997
756,0.40996000000000005
757,0.41881
758,0.42102
759,0.42323
760,0.42987
761,0.43428999999999995
762,0.43651
763,0.44315
764,0.44951
765,0.45836000000000005
766,0.46721
767,0.47607
768,0.4827
769,0.49183000000000004
770,0.49377
771,0.50041
772,0.50927
773,0.5159100000000001
774,0.52255
775,0.52476
776,0.53167
777,0.5385800000000001
778,0.54161
779,0.54494
780,0.55378
781,0.56263
782,0.5692699999999999
783,0.57812
784,0.58697
785,0.59582
786,0.5999800000000001
787,0.6011
788,0.605
789,0.61385
790,0.62271
791,0.62935
792,0.63795
793,0.64681
794,0.65515
795,0.66179
796,0.67065
797,0.6795100000000001
798,0.68838
799,0.69502
800,0.7038800000000001
801,0.7127399999999999
802,0.72211
803,0.73098
804,0.7376199999999999
805,0.74674
806,0.7556
807,0.76446
808,0.7711100000000001
809,0.7799699999999999
810,0.78883
811,0.7977
812,0.80656
813,0.81321
814,0.8220700000000001
815,0.83093
816,0.8398
817,0.84645
818,0.85531
819,0.86393
820,0.87279
821,0.8819
822,0.88855
823,0.8974200000000001
824,0.9062899999999999
825,0.91515
826,0.9218
827,0.9306700000000001
828,0.93953
829,0.9484
830,0.95135
831,0.95431
832,0.9631700000000001
833,0.97204
834,0.9809
835,0.98755
836,0.99641
837,1.0053
838,1.0090000000000001
839,1.0105
840,1.0193
841,1.028
842,1.0368
843,1.0413
844,1.0435
845,1.0502
846,1.0546
847,1.0548
848,1.0575
849,1.0585
850,1.0673
851,1.0762
852,1.0851
853,1.0917
854,1.1006
855,1.1095
856,1.1134
857,1.1149
858,1.1214
859,1.1302
860,1.1391
861,1.1458
862,1.1544
863,1.1633
864,1.1721
865,1.181
866,1.1828
867,1.1841
868,1.1906
869,1.1994
870,1.2061
871,1.215
872,1.2238
873,1.2327
874,1.2416
875,1.2483
876,1.2571
877,1.266
878,1.2749
879,1.2816
880,1.2904
881,1.2993
882,1.3082
883,1.3171
884,1.3197
885,1.3244
886,1.3288
887,1.3377
888,1.3443
889,1.3532
890,1.3599
891,1.3597
892,1.359
893,1.3604
894,1.3643
895,1.3728
896,1.3722
897,1.3716
898,1.3709
899,1.3701
900,1.3694
901,1.3689
902,1.3684
903,1.3595
904,1.3504
905,1.3415
906,1.3371
907,1.3342
908,1.3315
909,1.3226
910,1.3159
911,1.3068
912,1.2979
913,1.2890000000000001
914,1.2801
915,1.2735
916,1.2644
917,1.2616
918,1.2568
919,1.2501
920,1.2412
921,1.2323
922,1.2234
923,1.2168
924,1.2077
925,1.1988
926,1.1899
927,1.181
928,1.1743
929,1.1715
930,1.1688
931,1.1599
932,1.1532
933,1.1442
934,1.1353
935,1.1264
936,1.1196
937,1.1169
938,1.112
939,1.1031
940,1.0942
941,1.0875
942,1.0786
943,1.0697
944,1.0607
945,1.0518
946,1.0451
947,1.0362
948,1.0273
949,1.0184
950,1.0117
951,1.0090000000000001
952,1.0063
953,0.9974200000000001
954,0.99074
955,0.98183
956,0.97293
957,0.9640299999999999
958,0.9551200000000001
959,0.94845
960,0.9395399999999999
961,0.9355100000000001
962,0.93385
963,0.9271799999999999
964,0.91843
965,0.90953
966,0.9006299999999999
967,0.8917299999999999
968,0.88505
969,0.87615
970,0.86725
971,0.85835
972,0.8516799999999999
973,0.8426299999999999
974,0.83373
975,0.83373
976,0.82676
977,0.8199299999999999
978,0.81089
979,0.80852
980,0.8017
981,0.79711
982,0.79488
983,0.7882
984,0.7793
985,0.77262
986,0.76372
987,0.75468
988,0.74578
989,0.73688
990,0.7302
991,0.72547
992,0.7226899999999999
993,0.7158800000000001
994,0.7092
995,0.70029
996,0.69139
997,0.6824899999999999
998,0.67345
999,0.66677
1000,0.65787
1001,0.6489699999999999
1002,0.6400600000000001
1003,0.63338
1004,0.62448
1005,0.61753
1006,0.61478
1007,0.60798
1008,0.60117
1009,0.5987
1010,0.5959899999999999
1011,0.58931
1012,0.58263
1013,0.57372
1014,0.56481
1015,0.55591
1016,0.54923
1017,0.54032
1018,0.53809
1019,0.53364
1020,0.52473
1021,0.51805
1022,0.5091399999999999
1023,0.50692
1024,0.5068
1025,0.50012
1026,0.49121000000000004
1027,0.48231
1028,0.47328000000000003
1029,0.46437
1030,0.45769
1031,0.45288999999999996
1032,0.45032
1033,0.44364
1034,0.43696
1035,0.42805
1036,0.41913999999999996
1037,0.41023000000000004
1038,0.40131999999999995
1039,0.3971
1040,0.3951
1041,0.3862
1042,0.37729
1043,0.37061
1044,0.3617
1045,0.35279
1046,0.34834
1047,0.34576
1048,0.34119
1049,0.33228
1050,0.32337
1051,0.31446999999999997
1052,0.30779
1053,0.29888000000000003
1054,0.28997
1055,0.28774
1056,0.28774
1057,0.27884000000000003
1058,0.26993
1059,0.26102
1060,0.25656999999999996
1061,0.25656999999999996
1062,0.24754
1063,0.23864000000000002
1064,0.22973000000000002
1065,0.22305
1066,0.21414
1067,0.20523000000000002
1068,0.19633
1069,0.18964
1070,0.18308
1071,0.18086
1072,0.17418
1073,0.16539
1074,0.15884
1075,0.15228
1076,0.15018
1077,0.14573
1078,0.13905
1079,0.12989
1080,0.12754000000000001
1081,0.12295999999999999
1082,0.11615999999999999
1083,0.11615999999999999
1084,0.11170999999999999
1085,0.1028
1086,0.094019
1087,0.087341
1088,0.078434
1089,0.06952799999999999
1090,0.060621
1091,0.058779
1092,0.056685
1093,0.047781
1094,0.038876999999999995
1095,0.029973000000000003
1096,0.023294
1097,0.01439
1098,0.009939
1099,0.007319
1100,0.00038401
1101,-0.008523000000000001
1102,-0.017427
1103,-0.026333
1104,-0.035238
1105,-0.041916
1106,-0.05095
1107,-0.059854
1108,-0.06876
1109,-0.07543899999999999
1110,-0.080144
1111,-0.08508099999999999
1112,-0.089651
1113,-0.098675
1114,-0.099012
1115,-0.10166
1116,-0.10176
1117,-0.10409000000000002
1118,-0.10865
1119,-0.11765
1120,-0.1222
1121,-0.12462000000000001
1122,-0.13362000000000002
1123,-0.13585
1124,-0.13594
1125,-0.13834000000000002
1126,-0.13865999999999998
1127,-0.14096
1128,-0.14104
1129,-0.14125
1130,-0.14151
1131,-0.14168
1132,-0.14184000000000002
1133,-0.14189000000000002
1134,-0.13975
1135,-0.13769
1136,-0.13327
1137,-0.12435
1138,-0.11546
1139,-0.10654000000000001
1140,-0.10440999999999999
1141,-0.10228
1142,-0.09335700000000001
1143,-0.084437
1144,-0.075539
1145,-0.06885
1146,-0.068912
1147,-0.066716
1148,-0.066724
1149,-0.066711
1150,-0.05778200000000001
1151,-0.051084
1152,-0.048798
1153,-0.0443
1154,-0.037610000000000005
1155,-0.028669999999999998
1156,-0.019750999999999998
1157,-0.015216999999999998
1158,-0.012896000000000001
1159,-0.003945000000000001
1160,0.002817
1161,0.005209
1162,0.009761
1163,0.018678
1164,0.027596
1165,0.03656
1166,0.045478
1167,0.05216799999999999
1168,0.056778999999999996
1169,0.059234
1170,0.068152
1171,0.07484
1172,0.083757
1173,0.092672
1174,0.10159
1175,0.11051
1176,0.11725
1177,0.12617
1178,0.13509000000000002
1179,0.14400000000000002
1180,0.15069000000000002
1181,0.15961
1182,0.16852
1183,0.17744000000000001
1184,0.18636
1185,0.19304000000000002
1186,0.20196
1187,0.21088
1188,0.2198
1189,0.22648000000000001
1190,0.2354
1191,0.24425999999999998
1192,0.25318
1193,0.25986
1194,0.26884
1195,0.27775
1196,0.28667
1197,0.29559
1198,0.30222
1199,0.31114
1200,0.32005
1201,0.32897
1202,0.33566
1203,0.34457
1204,0.35355
1205,0.36246
1206,0.37138000000000004
1207,0.37806999999999996
1208,0.38699
1209,0.3959
1210,0.40481999999999996
1211,0.41151000000000004
1212,0.42041999999999996
1213,0.42933999999999994
1214,0.43826000000000004
1215,0.44718
1216,0.45386000000000004
1217,0.46278
1218,0.4717
1219,0.48061000000000004
1220,0.4873
1221,0.49622
1222,0.5051399999999999
1223,0.5140600000000001
1224,0.52074
1225,0.52966
1226,0.5385800000000001
1227,0.5475
1228,0.5564100000000001
1229,0.5586399999999999
1230,0.56087
1231,0.56979
1232,0.5787100000000001
1233,0.58545
1234,0.58996
1235,0.59453
1236,0.60351
1237,0.61242
1238,0.61911
1239,0.62803
1240,0.63026
1241,0.63261
1242,0.6392899999999999
1243,0.64827
1244,0.6571899999999999
1245,0.6661
1246,0.67502
1247,0.68171
1248,0.68394
1249,0.6884
1250,0.69508
1251,0.69731
1252,0.70177
1253,0.7106899999999999
1254,0.7196
1255,0.72629
1256,0.73521
1257,0.74412
1258,0.7530399999999999
1259,0.7619600000000001
1260,0.76864
1261,0.7710600000000001
1262,0.77579
1263,0.7847
1264,0.7913899999999999
1265,0.8003100000000001
1266,0.80929
1267,0.81821
1268,0.8271200000000001
1269,0.83381
1270,0.84272
1271,0.85164
1272,0.86055
1273,0.86724
1274,0.87616
1275,0.88507
1276,0.89399
1277,0.8987299999999999
1278,0.9011899999999999
1279,0.9101
1280,0.9190200000000001
1281,0.9279299999999999
1282,0.9346200000000001
1283,0.94353
1284,0.95252
1285,0.96144
1286,0.9681200000000001
1287,0.9770399999999999
1288,0.98595
1289,0.99487
1290,1.0038
1291,1.0105
1292,1.0194
1293,1.0283
1294,1.0372
1295,1.0439
1296,1.0528
1297,1.0617
1298,1.0706
1299,1.0796
1300,1.0862
1301,1.0952
1302,1.1041
1303,1.113
1304,1.1197
1305,1.1286
1306,1.1375
1307,1.1464
1308,1.1553
1309,1.162
1310,1.1709
1311,1.1798
1312,1.1888
1313,1.1954
1314,1.2044
1315,1.2133
1316,1.2222
1317,1.2289
1318,1.2356
1319,1.2378
1320,1.2445
1321,1.2534
1322,1.2601
1323,1.2668
1324,1.2712
1325,1.2801
1326,1.2845
1327,1.2868
1328,1.2890000000000001
1329,1.2957
1330,1.3046
1331,1.3068
1332,1.3090000000000002
1333,1.3135
1334,1.3224
1335,1.3292
1336,1.3381
1337,1.345
1338,1.3453
1339,1.3542
1340,1.3609
1341,1.3698
1342,1.3788
1343,1.3877
1344,1.3944
1345,1.4033
1346,1.4122
1347,1.4212
1348,1.4278
1349,1.4368
1350,1.4457
1351,1.4501
1352,1.4524
1353,1.459
1354,1.4657
1355,1.4680000000000002
1356,1.4746
1357,1.4813
1358,1.4902
1359,1.4992
1360,1.5081
1361,1.517
1362,1.5237
1363,1.5326
1364,1.5393
1365,1.5419
1366,1.5443
1367,1.5532
1368,1.5622
1369,1.5711
1370,1.5778
1371,1.5867
1372,1.5935
1373,1.5938
1374,1.5964
1375,1.5967
1376,1.597
1377,1.5971
1378,1.5973
1379,1.5977
1380,1.5981
1381,1.5982
1382,1.5985
1383,1.5968
1384,1.5902
1385,1.5815
1386,1.5797
1387,1.5755
1388,1.569
1389,1.5647
1390,1.5626
1391,1.5559
1392,1.547
1393,1.5403
1394,1.5316
1395,1.525
1396,1.5229
1397,1.5186
1398,1.5097
1399,1.5008
1400,1.4943
1401,1.4921
1402,1.4876
1403,1.4787
1404,1.4698
1405,1.4609
1406,1.4542
1407,1.4455
1408,1.4366
1409,1.4277
1410,1.421
1411,1.4121
1412,1.4056
1413,1.4039
1414,1.3976
1415,1.3909
1416,1.3821
1417,1.3732
1418,1.3693
1419,1.3698
1420,1.3633
1421,1.3545
1422,1.3530000000000002
1423,1.3513
1424,1.3446
1425,1.3357
1426,1.3268
1427,1.3179
1428,1.3113
1429,1.3024
1430,1.2976
1431,1.2948
1432,1.2904
1433,1.2815
1434,1.2726
1435,1.2637
1436,1.2548
1437,1.2481
1438,1.2463
1439,1.2446
1440,1.2357
1441,1.229
1442,1.2201
1443,1.2112
1444,1.2023
1445,1.1934
1446,1.1868
1447,1.1779
1448,1.169
1449,1.1601
1450,1.1534
1451,1.1446
1452,1.1399
1453,1.137
1454,1.1341
1455,1.1272
1456,1.1183
1457,1.1094
1458,1.1005
1459,1.0939
1460,1.085
1461,1.0761
1462,1.0674
1463,1.0609
1464,1.0522
1465,1.0499
1466,1.0457
1467,1.0371
1468,1.0307
1469,1.0286
1470,1.0244
1471,1.0179
1472,1.0157
1473,1.0134
1474,1.0046
1475,0.99567
1476,0.98679
1477,0.9801200000000001
1478,0.97124
1479,0.96235
1480,0.9534600000000001
1481,0.9468
1482,0.93791
1483,0.9290200000000001
1484,0.92014
1485,0.91125
1486,0.90479
1487,0.8959
1488,0.8870100000000001
1489,0.87813
1490,0.8714700000000001
1491,0.8625799999999999
1492,0.85854
1493,0.8549200000000001
1494,0.84846
1495,0.8395799999999999
1496,0.8307
1497,0.8220299999999999
1498,0.81315
1499,0.8064899999999999
1500,0.80492
1501,0.80357
1502,0.7947
1503,0.78804
1504,0.77917
1505,0.7702899999999999
1506,0.76142
1507,0.75254
1508,0.7458899999999999
1509,0.73701
1510,0.72814
1511,0.71927
1512,0.7126100000000001
1513,0.7126100000000001
1514,0.7037399999999999
1515,0.6993
1516,0.69708
1517,0.69043
1518,0.68156
1519,0.67291
1520,0.6662600000000001
1521,0.66404
1522,0.66183
1523,0.65295
1524,0.64408
1525,0.64408
1526,0.64186
1527,0.6329899999999999
1528,0.62412
1529,0.61525
1530,0.6086
1531,0.59973
1532,0.59086
1533,0.58199
1534,0.5775600000000001
1535,0.57534
1536,0.57091
1537,0.56204
1538,0.5553899999999999
1539,0.5553899999999999
1540,0.55095
1541,0.54208
1542,0.53322
1543,0.52657
1544,0.5177
1545,0.50883
1546,0.49972
1547,0.49085
1548,0.4842
1549,0.47534
1550,0.46647
1551,0.4576
1552,0.45095
1553,0.44209
1554,0.43322
1555,0.43101000000000006
1556,0.42878999999999995
1557,0.41993
1558,0.41548999999999997
1559,0.41548999999999997
1560,0.40663
1561,0.39998
1562,0.39111999999999997
1563,0.38225
1564,0.37339
1565,0.36674
1566,0.35985
1567,0.35664
1568,0.35172
1569,0.34285
1570,0.3362
1571,0.32733
1572,0.31847
1573,0.30935999999999997
1574,0.30271
1575,0.29384
1576,0.28498
1577,0.27610999999999997
1578,0.26725
1579,0.2606
1580,0.25173
1581,0.24286999999999997
1582,0.23376
1583,0.23326
1584,0.23008
1585,0.22121
1586,0.21235
1587,0.20569
1588,0.19683
1589,0.18796
1590,0.17885
1591,0.16998
1592,0.16333
1593,0.15446
1594,0.1456
1595,0.1402
1596,0.1402
1597,0.13133
1598,0.12245999999999999
1599,0.1136
1600,0.10449000000000001
1601,0.097598
1602,0.09071
1603,0.08872999999999999
1604,0.082319
1605,0.07591
1606,0.071965
1607,0.06777899999999999
1608,0.059164999999999995
1609,0.056949
1610,0.056949
1611,0.048087
1612,0.039223
1613,0.030614999999999996
1614,0.023969999999999998
1615,0.015108000000000002
1616,0.006248
1617,0.005072999999999999
1618,0.005872
1619,-0.002712
1620,-0.008804000000000001
1621,-0.012115
1622,-0.016253999999999998
1623,-0.02289
1624,-0.031449
1625,-0.040295
1626,-0.041631
1627,-0.040741
1628,-0.04174
1629,-0.042712
1630,-0.048704000000000004
1631,-0.05500599999999999
1632,-0.056246000000000004
1633,-0.05747000000000001
1634,-0.06629
1635,-0.074777
1636,-0.08139099999999999
1637,-0.08733099999999999
1638,-0.088163
1639,-0.087818
1640,-0.08746799999999999
1641,-0.086411
1642,-0.085699
1643,-0.08534
1644,-0.083886
1645,-0.080579
1646,-0.07398300000000001
1647,-0.064816
1648,-0.056021
1649,-0.049422
1650,-0.046109
1651,-0.042401999999999995
1652,-0.040868
1653,-0.037111
1654,-0.030131
1655,-0.022757
1656,-0.018963
1657,-0.009384
1658,-0.002803
1659,-0.001173
1660,0.0026739999999999997
1661,0.0043549999999999995
1662,0.01001
1663,0.017006
1664,0.022241999999999998
1665,0.026166000000000002
1666,0.035349
1667,0.04191
1668,0.050658
1669,0.059405999999999994
1670,0.068156
1671,0.07471900000000001
1672,0.083469
1673,0.092222
1674,0.10097
1675,0.10973
1676,0.1163
1677,0.12505
1678,0.13380999999999998
1679,0.14257
1680,0.14912999999999998
1681,0.15789
1682,0.16707
1683,0.17583
1684,0.18417999999999998
1685,0.19117
1686,0.19993
1687,0.20869000000000001
1688,0.21746
1689,0.22403
1690,0.2328
1691,0.24156
1692,0.25033
1693,0.2591
1694,0.26568
1695,0.27129000000000003
1696,0.27514
1697,0.2839
1698,0.29047
1699,0.29924
1700,0.30841999999999997
1701,0.31718
1702,0.32376
1703,0.33252
1704,0.34129
1705,0.35006
1706,0.35883000000000004
1707,0.3654
1708,0.37417
1709,0.37937
1710,0.38321
1711,0.38800999999999997
1712,0.39676999999999996
1713,0.40554
1714,0.4143
1715,0.42348
1716,0.43006000000000005
1717,0.43882
1718,0.44759
1719,0.45636000000000004
1720,0.46293999999999996
1721,0.46773000000000003
1722,0.47376
1723,0.48116000000000003
1724,0.48991999999999997
1725,0.49649
1726,0.50526
1727,0.51403
1728,0.52279
1729,0.52937
1730,0.53814
1731,0.54691
1732,0.5556800000000001
1733,0.56226
1734,0.57143
1735,0.5802
1736,0.58897
1737,0.59775
1738,0.60433
1739,0.6131
1740,0.6169100000000001
1741,0.62033
1742,0.6269
1743,0.63608
1744,0.64485
1745,0.64964
1746,0.65568
1747,0.66089
1748,0.66965
1749,0.6784100000000001
1750,0.6875899999999999
1751,0.69417
1752,0.70293
1753,0.7085600000000001
1754,0.71243
1755,0.72118
1756,0.72818
1757,0.73693
1758,0.7457
1759,0.74738
1760,0.75085
1761,0.75961
1762,0.76836
1763,0.77712
1764,0.7841100000000001
1765,0.79287
1766,0.80162
1767,0.81038
1768,0.8195600000000001
1769,0.8230200000000001
1770,0.8286899999999999
1771,0.83744
1772,0.84619
1773,0.8527600000000001
1774,0.86151
1775,0.87069
1776,0.87945
1777,0.88821
1778,0.8930100000000001
1779,0.8947700000000001
1780,0.9035299999999999
1781,0.9122899999999999
1782,0.91886
1783,0.92324
1784,0.92543
1785,0.93242
1786,0.9411799999999999
1787,0.94775
1788,0.9565100000000001
1789,0.9652700000000001
1790,0.97403
1791,0.98061
1792,0.9844700000000001
1793,0.98969
1794,0.99845
1795,1.005
1796,1.0138
1797,1.0225
1798,1.0313
1799,1.0405
1800,1.0471
1801,1.0558
1802,1.0646
1803,1.0733
1804,1.0799
1805,1.0887
1806,1.0925
1807,1.0959999999999999
1808,1.1047
1809,1.1113
1810,1.1205
1811,1.1275
1812,1.1314
1813,1.1322
1814,1.141
1815,1.1497
1816,1.1589
1817,1.1677
1818,1.1742
1819,1.1808
1820,1.1847
1821,1.1925
1822,1.1991
1823,1.2079
1824,1.2166
1825,1.2254
1826,1.2319
1827,1.2407
1828,1.2499
1829,1.2586
1830,1.2674
1831,1.274
1832,1.2827
1833,1.2915
1834,1.3002
1835,1.3068
1836,1.3156
1837,1.3243
1838,1.3331
1839,1.3423
1840,1.3449
1841,1.3466
1842,1.3483
1843,1.3522
1844,1.357
1845,1.3657
1846,1.3749
1847,1.3771
1848,1.3784
1849,1.3797
1850,1.3815
1851,1.3832
1852,1.3846
1853,1.3846
1854,1.3785
1855,1.3803
1856,1.3773
1857,1.3708
1858,1.3647
1859,1.3644
1860,1.3636
1861,1.3549
1862,1.3484
1863,1.3396
1864,1.3309
1865,1.3222
1866,1.3157
1867,1.307
1868,1.2982
1869,1.2895
1870,1.2808
1871,1.2743
1872,1.2656
1873,1.2569
1874,1.2482
1875,1.2416
1876,1.2329
1877,1.2242
1878,1.2155
1879,1.2068
1880,1.2003
1881,1.1921
1882,1.1834
1883,1.1747
1884,1.1682
1885,1.1595
1886,1.1593
1887,1.1586
1888,1.1521
1889,1.1434
1890,1.1352
1891,1.1292
1892,1.1291
1893,1.128
1894,1.1193
1895,1.1106
1896,1.102
1897,1.0955
1898,1.0868
1899,1.0781
1900,1.0695
1901,1.0608
1902,1.0543
1903,1.0456
1904,1.0413
1905,1.0391
1906,1.0326
1907,1.0283
1908,1.0261
1909,1.0175
1910,1.0083
1911,1.0018
1912,0.99313
1913,0.9844700000000001
1914,0.9758100000000001
1915,0.97095
1916,0.9666399999999999
1917,0.95745
1918,0.9487899999999999
1919,0.94229
1920,0.93363
1921,0.9249799999999999
1922,0.91632
1923,0.90766
1924,0.9006299999999999
1925,0.8925200000000001
1926,0.88387
1927,0.8746700000000001
1928,0.86818
1929,0.8595299999999999
1930,0.8508899999999999
1931,0.84224
1932,0.8335899999999999
1933,0.82711
1934,0.81902
1935,0.81038
1936,0.80173
1937,0.7952600000000001
1938,0.78662
1939,0.78342
1940,0.78351
1941,0.77761
1942,0.7711399999999999
1943,0.76252
1944,0.75389
1945,0.74527
1946,0.7388100000000001
1947,0.73019
1948,0.7280300000000001
1949,0.72588
1950,0.71942
1951,0.71511
1952,0.7108
1953,0.70219
1954,0.69358
1955,0.68712
1956,0.6785100000000001
1957,0.6699
1958,0.6612899999999999
1959,0.65484
1960,0.6462399999999999
1961,0.63763
1962,0.62903
1963,0.62043
1964,0.61398
1965,0.60539
1966,0.5967899999999999
1967,0.5882
1968,0.58175
1969,0.57316
1970,0.56458
1971,0.55599
1972,0.54955
1973,0.54097
1974,0.53238
1975,0.52595
1976,0.52137
1977,0.51527
1978,0.50608
1979,0.5011899999999999
1980,0.49904
1981,0.49688999999999994
1982,0.4877
1983,0.47851000000000005
1984,0.46871999999999997
1985,0.46657
1986,0.46228
1987,0.45369
1988,0.44846
1989,0.44692
1990,0.4411
1991,0.43681000000000003
1992,0.43466000000000005
1993,0.42762
1994,0.41843
1995,0.41200000000000003
1996,0.40404
1997,0.39823000000000003
1998,0.39671
1999,0.39457
2000,0.386
2001,0.38386
2002,0.38172
2003,0.3753
2004,0.36674
2005,0.35818
2006,0.34962
2007,0.34106
2008,0.33465
2009,0.3261
2010,0.31755
2011,0.30923
2012,0.30733
2013,0.30029
2014,0.29173000000000004
2015,0.28318000000000004
2016,0.27462
2017,0.26821
2018,0.25966
2019,0.25111
2020,0.24256999999999998
2021,0.23551999999999998
2022,0.22698000000000002
2023,0.21844
2024,0.2099
2025,0.20434000000000002
2026,0.20027999999999999
2027,0.19685999999999998
2028,0.18832000000000002
2029,0.17977
2030,0.17337
2031,0.16418
2032,0.15564
2033,0.1471
2034,0.1407
2035,0.13216
2036,0.12362999999999999
2037,0.1151
2038,0.10657
2039,0.10017999999999999
2040,0.095917
2041,0.095917
2042,0.08673600000000001
2043,0.083949
2044,0.078374
2045,0.071325
2046,0.062144000000000005
2047,0.059359
2048,0.057225
2049,0.055092999999999996
2050,0.046568
2051,0.037387000000000004
2052,0.030994
2053,0.022471
2054,0.013953
2055,0.005435
2056,-0.0030789999999999997
2057,-0.009464
2058,-0.012258
2059,-0.014385
2060,-0.022897
2061,-0.029279000000000003
2062,-0.037786
2063,-0.039912
2064,-0.043491
2065,-0.049866
2066,-0.058364
2067,-0.066861
2068,-0.07535399999999999
2069,-0.083844
2070,-0.09021
2071,-0.098008
2072,-0.10649000000000002
2073,-0.11497
2074,-0.12132000000000001
2075,-0.1298
2076,-0.13827
2077,-0.14674
2078,-0.1552
2079,-0.15591
2080,-0.15517999999999998
2081,-0.1608
2082,-0.16924
2083,-0.17557
2084,-0.18400999999999998
2085,-0.19244
2086,-0.20087
2087,-0.20856999999999998
2088,-0.21489
2089,-0.22330999999999998
2090,-0.23173000000000002
2091,-0.24014000000000002
2092,-0.24645
2093,-0.25486
2094,-0.26327
2095,-0.27166999999999997
2096,-0.27797
2097,-0.28636
2098,-0.29475999999999997
2099,-0.3039
2100,-0.31153000000000003
2101,-0.31782
2102,-0.3262
2103,-0.33457
2104,-0.34295
2105,-0.34922
2106,-0.35759
2107,-0.36595
2108,-0.36857
2109,-0.36751
2110,-0.37089
2111,-0.37923
2112,-0.38756
2113,-0.39588
2114,-0.40213000000000004
2115,-0.41045
2116,-0.41876
2117,-0.42707
2118,-0.43456999999999996
2119,-0.44078999999999996
2120,-0.44909
2121,-0.45738
2122,-0.4636
2123,-0.4636
2124,-0.46567
2125,-0.46236000000000005
2126,-0.46152
2127,-0.46275
2128,-0.4623
2129,-0.46098
2130,-0.45757
2131,-0.45001
2132,-0.44828
2133,-0.44536000000000003
2134,-0.44275
2135,-0.44101
2136,-0.43896
2137,-0.43896
2138,-0.43075
2139,-0.42253999999999997
2140,-0.41345
2141,-0.40729
2142,-0.39907
2143,-0.38998
2144,-0.38533
2145,-0.38272
2146,-0.37451
2147,-0.36629
2148,-0.35807
2149,-0.34898
2150,-0.34281
2151,-0.33371999999999996
2152,-0.32821999999999996
2153,-0.32238
2154,-0.31621
2155,-0.30799
2156,-0.29975
2157,-0.29152
2158,-0.28534
2159,-0.27625
2160,-0.268
2161,-0.25975
2162,-0.2515
2163,-0.24447
2164,-0.23986
2165,-0.23319
2166,-0.22494
2167,-0.21791
2168,-0.20965999999999999
2169,-0.20299
2170,-0.19752
2171,-0.18928
2172,-0.1831
2173,-0.174
2174,-0.16575
2175,-0.16029000000000002
2176,-0.15567
2177,-0.14743
2178,-0.13919
2179,-0.13094
2180,-0.12184
2181,-0.11565999999999999
2182,-0.1074
2183,-0.09914400000000001
2184,-0.090882
2185,-0.08468200000000001
2186,-0.077645
2187,-0.070156
2188,-0.064341
2189,-0.058148000000000005
2190,-0.049886
2191,-0.04162
2192,-0.032514999999999995
2193,-0.024243999999999998
2194,-0.019273
2195,-0.013859
2196,-0.008048
2197,0.00021401
2198,0.006416
2199,0.015521
2200,0.023791
2201,0.032067
2202,0.037869
2203,0.042441
2204,0.04825
2205,0.057352
2206,0.061937
2207,0.06653099999999999
2208,0.071504
2209,0.080602
2210,0.087267
2211,0.09272799999999999
2212,0.09891
2213,0.10715999999999999
2214,0.11540999999999998
2215,0.12451
2216,0.1307
2217,0.13896
2218,0.1444
2219,0.149
2220,0.15519000000000002
2221,0.16344
2222,0.17254
2223,0.17958
2224,0.18503
2225,0.18879
2226,0.19789
2227,0.20371
2228,0.20919000000000001
2229,0.21416
2230,0.22326
2231,0.22875
2232,0.23545
2233,0.24454
2234,0.24950999999999998
2235,0.25503000000000003
2236,0.26088
2237,0.26909
2238,0.27612
2239,0.28434
2240,0.29105
2241,0.29658
2242,0.30361
2243,0.30977
2244,0.31444
2245,0.32
2246,0.32907
2247,0.33316999999999997
2248,0.33669
2249,0.34023000000000003
2250,0.34379
2251,0.34647
2252,0.35006
2253,0.35367
2254,0.35549000000000003
2255,0.3564
2256,0.35913
2257,0.36075999999999997
2258,0.36241999999999996
2259,0.36224
2260,0.36115
2261,0.35989
2262,0.36364
2263,0.36551999999999996
2264,0.36646
2265,0.36241999999999996
2266,0.35435
2267,0.35316
2268,0.35295
2269,0.3469
2270,0.33886
2271,0.33178
2272,0.32671
2273,0.32568
2274,0.32166
2275,0.31364000000000003
2276,0.30561
2277,0.2976
2278,0.29159
2279,0.28959
2280,0.28362
2281,0.27560999999999997
2282,0.26961
2283,0.26061999999999996
2284,0.25261999999999996
2285,0.24463000000000001
2286,0.23865
2287,0.23369
2288,0.22971999999999998
2289,0.22171999999999997
2290,0.21372
2291,0.20772
2292,0.19974
2293,0.19075999999999999
2294,0.18278
2295,0.1748
2296,0.16883
2297,0.16086
2298,0.1529
2299,0.15091
2300,0.14892
2301,0.14097
2302,0.13797
2303,0.13201
2304,0.12504
2305,0.11506
2306,0.1061
2307,0.10213
2308,0.098165
2309,0.092162
2310,0.084223
2311,0.076291
2312,0.067342
2313,0.0614
2314,0.053480999999999994
2315,0.045567
2316,0.03766
2317,0.029757
2318,0.023834
2319,0.015941999999999998
2320,0.009101
2321,0.001224
2322,-0.004678
2323,-0.012546
2324,-0.020406
2325,-0.022216999999999997
2326,-0.019927
2327,-0.025802999999999996
2328,-0.03363
2329,-0.04145
2330,-0.049266000000000004
2331,-0.054042999999999994
2332,-0.061842999999999995
2333,-0.06769
2334,-0.069637
2335,-0.07267
2336,-0.08154700000000001
2337,-0.08457999999999999
2338,-0.091508
2339,-0.10147
2340,-0.10645
2341,-0.1084
2342,-0.11424000000000001
2343,-0.12201
2344,-0.12784
2345,-0.1367
2346,-0.14445999999999998
2347,-0.15222
2348,-0.15609
2349,-0.15609
2350,-0.16494
2351,-0.16798
2352,-0.17213
2353,-0.17905
2354,-0.1879
2355,-0.19288
2356,-0.19480999999999998
2357,-0.20255
2358,-0.20834
2359,-0.21606999999999998
2360,-0.22378
2361,-0.23262
2362,-0.23839000000000002
2363,-0.24609
2364,-0.25378
2365,-0.25909
2366,-0.2644
2367,-0.2713
2368,-0.27899999999999997
2369,-0.28668000000000005
2370,-0.2955
2371,-0.30126
2372,-0.30893000000000004
2373,-0.31659
2374,-0.32424000000000003
2375,-0.32845
2376,-0.33493
2377,-0.34181999999999996
2378,-0.34948
2379,-0.35828000000000004
2380,-0.36401999999999995
2381,-0.37166
2382,-0.37929
2383,-0.38466
2384,-0.39002
2385,-0.3969
2386,-0.40454
2387,-0.41333000000000003
2388,-0.42095
2389,-0.42667
2390,-0.43427
2391,-0.43967
2392,-0.44621000000000005
2393,-0.45193
2394,-0.45953999999999995
2395,-0.46715
2396,-0.47473999999999994
2397,-0.48044
2398,-0.48918999999999996
2399,-0.49677
2400,-0.5043300000000001
2401,-0.51189
2402,-0.51755
2403,-0.5237
2404,-0.5303399999999999
2405,-0.53719
2406,-0.54285
2407,-0.5504
2408,-0.55794
2409,-0.5654600000000001
2410,-0.57418
2411,-0.57982
2412,-0.58732
2413,-0.5948100000000001
2414,-0.6010800000000001
2415,-0.60668
2416,-0.61537
2417,-0.6228199999999999
2418,-0.63026
2419,-0.6377
2420,-0.64327
2421,-0.6519199999999999
2422,-0.65749
2423,-0.6612
2424,-0.66676
2425,-0.6741699999999999
2426,-0.68156
2427,-0.69019
2428,-0.69698
2429,-0.70008
2430,-0.70192
2431,-0.70929
2432,-0.71665
2433,-0.71849
2434,-0.72032
2435,-0.72583
2436,-0.73316
2437,-0.73993
2438,-0.74724
2439,-0.75454
2440,-0.76183
2441,-0.7691100000000001
2442,-0.77456
2443,-0.7820699999999999
2444,-0.78905
2445,-0.79451
2446,-0.8012600000000001
2447,-0.80852
2448,-0.81577
2449,-0.82278
2450,-0.8284799999999999
2451,-0.8339200000000001
2452,-0.8411799999999999
2453,-0.84972
2454,-0.85695
2455,-0.86087
2456,-0.8697
2457,-0.8769399999999999
2458,-0.8854799999999999
2459,-0.89089
2460,-0.8976200000000001
2461,-0.90466
2462,-0.91269
2463,-0.92122
2464,-0.92663
2465,-0.9338299999999999
2466,-0.93958
2467,-0.9466399999999999
2468,-0.95024
2469,-0.9587700000000001
2470,-0.96596
2471,-0.97315
2472,-0.9789100000000001
2473,-0.9846600000000001
2474,-0.9913799999999999
2475,-0.99856
2476,-1.0071
2477,-1.0124
2478,-1.0182
2479,-1.0253
2480,-1.0325
2481,-1.0396
2482,-1.0463
2483,-1.0548
2484,-1.0606
2485,-1.0646
2486,-1.07
2487,-1.0785
2488,-1.0856
2489,-1.0927
2490,-1.0985
2491,-1.1039
2492,-1.111
2493,-1.1181
2494,-1.1266
2495,-1.1319
2496,-1.1391
2497,-1.1449
2498,-1.1520000000000001
2499,-1.1587
2500,-1.1658
2501,-1.1751
2502,-1.1841
2503,-1.1912
2504,-1.1965
2505,-1.2049
2506,-1.2129
2507,-1.2202
2508,-1.2251
2509,-1.2321
2510,-1.2405
2511,-1.2476
2512,-1.2534
2513,-1.2593
2514,-1.2659
2515,-1.2757
2516,-1.2830000000000001
2517,-1.2875
2518,-1.2945
2519,-1.3029
2520,-1.3099
2521,-1.3152
2522,-1.3222
2523,-1.3288
2524,-1.3361
2525,-1.3424
2526,-1.349
2527,-1.3552
2528,-1.3625
2529,-1.3674
2530,-1.3727
2531,-1.381
2532,-1.3880000000000001
2533,-1.3943
2534,-1.4016
2535,-1.4047
2536,-1.4117
2537,-1.42
2538,-1.4269
2539,-1.4332
2540,-1.4406
2541,-1.4472
2542,-1.4555
2543,-1.4624
2544,-1.4676
2545,-1.4735
2546,-1.4809
2547,-1.4892
2548,-1.4944
2549,-1.5018
2550,-1.5095
2551,-1.5178
2552,-1.5237
2553,-1.5311
2554,-1.538
2555,-1.5463
2556,-1.5532
2557,-1.5598
2558,-1.5641
2559,-1.5718
2560,-1.5801
2561,-1.5863
2562,-1.5937
2563,-1.6019999999999999
2564,-1.61
2565,-1.6174
2566,-1.6237
2567,-1.632
2568,-1.6380000000000001
2569,-1.6453
2570,-1.6505
2571,-1.6603
2572,-1.6676
2573,-1.6756
2574,-1.6822
2575,-1.6882
2576,-1.6955
2577,-1.7038
2578,-1.7104
2579,-1.7147
2580,-1.7223
2581,-1.7307
2582,-1.7369
2583,-1.7429
2584,-1.7491
2585,-1.7575
2586,-1.7665
2587,-1.7725
2588,-1.7777
2589,-1.786
2590,-1.7930000000000001
2591,-1.7996
2592,-1.8055
2593,-1.8132
2594,-1.8201
2595,-1.8284
2596,-1.8353
2597,-1.8405
2598,-1.8473
2599,-1.855
2600,-1.8625
2601,-1.8676
2602,-1.8744
2603,-1.8812
2604,-1.8879
2605,-1.893
2606,-1.9011
2607,-1.9078
2608,-1.9144
2609,-1.921
2610,-1.9259
2611,-1.9338
2612,-1.9414
2613,-1.9464
2614,-1.9513
2615,-1.9578
2616,-1.9643
2617,-1.9707
2618,-1.9787
2619,-1.9834
2620,-1.9898
2621,-1.9961
2622,-2.0023
2623,-2.0069999999999997
2624,-2.0131
2625,-2.0192
2626,-2.0253
2627,-2.0315
2628,-2.0379
2629,-2.0444
2630,-2.0504
2631,-2.0564
2632,-2.0609
2633,-2.0668
2634,-2.0726
2635,-2.0784
2636,-2.0827
2637,-2.0884
2638,-2.0941
2639,-2.0997
2640,-2.1052
2641,-2.1109999999999998
2642,-2.1165
2643,-2.1218
2644,-2.1271
2645,-2.1311
2646,-2.1363
2647,-2.1414
2648,-2.1464
2649,-2.1514
2650,-2.1557
2651,-2.1644
2652,-2.1718
2653,-2.1767
2654,-2.1803
2655,-2.1851
2656,-2.1897
2657,-2.1943
2658,-2.1988
2659,-2.2041
2660,-2.2085
2661,-2.2128
2662,-2.217
2663,-2.2201
2664,-2.2241
2665,-2.2281
2666,-2.2319
2667,-2.2348
2668,-2.2385
2669,-2.2421
2670,-2.2456
2671,-2.249
2672,-2.2514
2673,-2.2526
2674,-2.2578
2675,-2.2608
2676,-2.263
2677,-2.2636
2678,-2.2663
2679,-2.2689
2680,-2.2714
2681,-2.2753
2682,-2.2776
2683,-2.2798
2684,-2.2818
2685,-2.2833
2686,-2.2851
2687,-2.289
2688,-2.2982
2689,-2.3034
2690,-2.3046
2691,-2.3082
2692,-2.3095
2693,-2.3107
2694,-2.3115
2695,-2.3125
2696,-2.3134
2697,-2.3141
2698,-2.3145
2699,-2.315
2700,-2.3131
2701,-2.3133
2702,-2.3134
2703,-2.3134
2704,-2.3134
2705,-2.3134
2706,-2.3156
2707,-2.3156
2708,-2.3201
