track_id,artist_id
0,0
1,0
2,0
3,0
4,1
5,1
6,1
7,2
8,2
9,3
10,3
11,4
12,4
13,5
14,6
15,6
16,6
17,7
18,7
19,7
20,8
21,9
23,9
24,10
25,10
26,10
27,10
28,11
29,11
30,12
31,13
32,14
33,15
34,12
35,16
36,17
37,18
38,18
39,18
40,19
41,15
42,15
43,15
44,20
45,20
46,20
47,21
48,21
49,21
50,21
51,21
52,22
53,22
54,22
55,22
56,23
57,23
58,24
59,25
60,21
61,26
62,26
63,26
64,26
65,26
66,26
67,26
68,2
69,2
70,2
71,27
72,28
73,28
74,29
75,29
76,30
77,30
78,30
79,31
80,31
81,32
82,32
83,32
84,32
85,33
86,34
87,34
88,35
89,35
90,35
91,35
92,35
93,36
94,14
95,14
96,14
97,37
98,37
99,37
100,37
101,37
102,38
103,39
104,39
105,39
106,39
107,22
108,22
109,22
110,22
111,22
112,22
113,22
114,22
115,22
116,22
117,22
118,22
119,22
120,22
121,22
122,22
123,22
124,22
125,22
126,22
127,22
128,22
129,22
130,22
131,22
132,22
133,22
134,16
135,16
136,16
137,16
138,16
139,16
140,10
141,10
142,10
143,10
144,10
145,10
146,40
147,40
148,6
149,6
150,0
151,0
152,11
153,11
154,11
155,41
156,41
157,42
158,42
159,43
160,43
161,44
162,44
163,45
164,45
165,46
166,46
167,46
168,46
169,46
170,47
171,47
172,48
173,2
174,2
175,2
176,40
177,40
178,40
179,40
180,40
181,40
182,49
183,49
