time,value
0,-0.23824
1,-0.23824
2,-0.23824
3,-0.23824
4,-0.23824
5,-0.23824
6,-0.23824
7,-0.23824
8,-0.23824
9,-0.23824
10,-0.23824
11,-0.23824
12,-0.23824
13,-0.23824
14,-0.23824
15,-0.23824
16,-0.23824
17,-0.23824
18,-0.23824
19,-0.23824
20,-0.23824
21,-0.23824
22,-0.23824
23,-0.23824
24,-0.23824
25,-0.23824
26,-0.23824
27,-0.23824
28,-0.23824
29,-0.23824
30,-0.23824
31,-0.23824
32,-0.23824
33,-0.23824
34,-0.23824
35,-0.23824
36,-0.23824
37,0.43308
38,1.3243
39,-0.23824
40,-0.23824
41,-0.23824
42,-0.23824
43,-0.23824
44,-0.23824
45,-0.23824
46,-0.23824
47,-0.23824
48,-0.23824
49,-0.23824
50,1.9262
51,-0.0067518
52,-0.23824
53,-0.23824
54,-0.23824
55,-0.23824
56,-0.23824
57,-0.23824
58,-0.23824
59,-0.23824
60,-0.23824
61,-0.23824
62,-0.23824
63,-0.23824
64,-0.23824
65,-0.23824
66,-0.23824
67,-0.23824
68,-0.23824
69,-0.23824
70,-0.23824
71,-0.23824
72,-0.23824
73,-0.23824
74,-0.23824
75,-0.23824
76,5.2828
77,3.2341
78,6.3245
79,2.447
80,-0.23824
81,-0.23824
82,-0.23824
83,-0.23824
84,-0.23824
85,-0.23824
86,-0.23824
87,-0.23824
88,-0.23824
89,-0.23824
90,-0.23824
91,-0.23824
92,-0.23824
93,-0.23824
94,-0.23824
95,-0.23824
