time,value
0,-0.23083
1,-0.23083
2,-0.23083
3,-0.23083
4,-0.23083
5,-0.23083
6,-0.23083
7,-0.23083
8,-0.23083
9,-0.23083
10,-0.23083
11,-0.23083
12,-0.23083
13,-0.23083
14,-0.23083
15,-0.23083
16,-0.23083
17,-0.23083
18,-0.23083
19,-0.23083
20,-0.23083
21,-0.23083
22,-0.23083
23,-0.23083
24,-0.23083
25,-0.23083
26,-0.23083
27,-0.23083
28,-0.23083
29,-0.23083
30,-0.23083
31,-0.23083
32,-0.23083
33,-0.23083
34,-0.23083
35,-0.23083
36,-0.23083
37,6.6226
38,0.18037999999999998
39,-0.23083
40,-0.23083
41,-0.23083
42,-0.23083
43,-0.23083
44,-0.23083
45,-0.23083
46,-0.23083
47,-0.23083
48,-0.23083
49,-0.23083
50,-0.23083
51,-0.23083
52,-0.23083
53,-0.23083
54,-0.23083
55,3.5157
56,-0.23083
57,-0.23083
58,4.5209
59,0.59158
60,-0.23083
61,-0.23083
62,-0.23083
63,-0.23083
64,-0.23083
65,-0.23083
66,-0.23083
67,-0.23083
68,-0.23083
69,-0.23083
70,-0.23083
71,-0.23083
72,-0.23083
73,-0.23083
74,-0.23083
75,-0.23083
76,-0.23083
77,-0.23083
78,-0.23083
79,-0.23083
80,-0.23083
81,-0.23083
82,-0.23083
83,-0.23083
84,-0.23083
85,2.8304
86,2.2821
87,-0.23083
88,-0.23083
89,-0.23083
90,-0.23083
91,-0.23083
92,-0.23083
93,-0.23083
94,-0.23083
95,-0.23083
