time,value
0,-0.8206
1,-0.69568
2,-0.50532
3,-0.28681999999999996
4,-0.067804
5,0.13259
6,0.2995
7,0.43568
8,0.5505399999999999
9,0.6502100000000001
10,0.73187
11,0.78837
12,0.81871
13,0.8219200000000001
14,0.79819
15,0.75335
16,0.69457
17,0.63161
18,0.57012
19,0.5089899999999999
20,0.44596
21,0.37742
22,0.30385
23,0.23165
24,0.16495
25,0.11185999999999999
26,0.068625
27,0.026786
28,-0.0058097
29,-0.021809000000000002
30,-0.014933000000000002
31,0.0094709
32,0.032473
33,0.043314
34,0.040445999999999996
35,0.041594
36,0.06428099999999999
37,0.10944000000000001
38,0.1755
39,0.24849000000000002
40,0.31338
41,0.36741999999999997
42,0.41268999999999995
43,0.45018
44,0.47453
45,0.48646000000000006
46,0.4927
47,0.47931999999999997
48,0.42606000000000005
49,0.33776
50,0.23603000000000002
51,0.13229000000000002
52,0.020432
53,-0.09926900000000001
54,-0.21743
55,-0.32631
56,-0.41336000000000006
57,-0.47523999999999994
58,-0.5179199999999999
59,-0.54194
60,-0.54776
61,-0.5381100000000001
62,-0.52355
63,-0.51288
64,-0.50254
65,-0.4941
66,-0.49188999999999994
67,-0.49413
68,-0.49556000000000006
69,-0.49105
70,-0.48502
71,-0.4833
72,-0.48885
73,-0.50268
74,-0.51908
75,-0.53552
76,-0.55578
77,-0.5836399999999999
78,-0.61792
79,-0.65295
80,-0.68657
81,-0.7177899999999999
82,-0.74141
83,-0.7563
84,-0.76686
85,-0.77554
86,-0.77747
87,-0.7659
88,-0.74716
89,-0.7287
90,-0.70887
91,-0.68947
92,-0.67435
93,-0.67024
94,-0.67288
95,-0.67806
96,-0.6846300000000001
97,-0.68001
98,-0.65671
99,-0.61379
100,-0.55291
101,-0.47903
102,-0.39197
103,-0.28376
104,-0.14102
105,0.041005
106,0.24573000000000003
107,0.43487
108,0.56121
109,0.6060300000000001
110,0.59223
111,0.54397
112,0.46998
113,0.38156999999999996
114,0.29119
115,0.19897
116,0.10035
117,0.00043212
118,-0.091667
119,-0.17149
120,-0.23604
121,-0.28779
122,-0.33697
123,-0.38654
124,-0.43478
125,-0.47762
126,-0.51079
127,-0.5411199999999999
128,-0.5676800000000001
129,-0.5894699999999999
130,-0.60605
131,-0.6191800000000001
132,-0.63094
133,-0.62958
134,-0.6117600000000001
135,-0.58105
136,-0.5353399999999999
137,-0.4786
138,-0.41728999999999994
139,-0.35086999999999996
140,-0.273
141,-0.1854
142,-0.10157999999999999
143,-0.029049000000000002
144,0.031381
145,0.077331
146,0.10515999999999999
147,0.10672999999999999
148,0.07791100000000001
149,0.025968
150,-0.036968
151,-0.10184
152,-0.16705
153,-0.23526999999999998
154,-0.30678
155,-0.37604
156,-0.43415
157,-0.47912
158,-0.51546
159,-0.54342
160,-0.56579
161,-0.58637
162,-0.60126
163,-0.61026
164,-0.61797
165,-0.62905
166,-0.6399699999999999
167,-0.64569
168,-0.65061
169,-0.65673
170,-0.6632
171,-0.6715800000000001
172,-0.68282
173,-0.70009
174,-0.71901
175,-0.73343
176,-0.74188
177,-0.74515
178,-0.75079
179,-0.75895
180,-0.76713
181,-0.77647
182,-0.78232
183,-0.77756
184,-0.74264
185,-0.65955
186,-0.5280199999999999
187,-0.36263
188,-0.19352
189,-0.041995
190,0.092431
191,0.21836999999999998
192,0.34094
193,0.45023
194,0.5294
195,0.5716100000000001
196,0.58536
197,0.58839
198,0.5852
199,0.56667
200,0.5392899999999999
201,0.5002300000000001
202,0.44813000000000003
203,0.3885
204,0.32045
205,0.25784
206,0.20064
207,0.15516
208,0.13151
209,0.12426
210,0.14962999999999999
211,0.22985
212,0.40752
213,0.73992
214,1.2286
215,1.8135
216,2.4139
217,2.9938
218,3.553
219,4.039
220,4.3729
221,4.5411
222,4.5828
223,4.5053
224,4.2645
225,3.8569999999999998
226,3.3722
227,2.9135
228,2.5111
229,2.1222
230,1.6994
231,1.2503
232,0.82158
233,0.45516999999999996
234,0.17121
235,-0.047267
236,-0.21095
237,-0.33345
238,-0.43162
239,-0.49995
240,-0.55095
241,-0.59325
242,-0.63369
243,-0.6771699999999999
244,-0.71087
245,-0.73883
246,-0.76175
247,-0.7752600000000001
248,-0.78267
249,-0.78233
250,-0.77673
251,-0.76394
252,-0.74451
253,-0.72693
254,-0.71359
255,-0.70113
256,-0.6859999999999999
257,-0.6699
258,-0.6592
259,-0.65695
260,-0.6625800000000001
261,-0.67485
262,-0.69377
263,-0.7216100000000001
264,-0.75658
265,-0.79096
266,-0.8216
267,-0.8511799999999999
268,-0.87471
269,-0.88266
