time,value
0,-0.43662
1,0.31523
2,1.255
3,-1.1885
4,0.69115
5,0.31523
6,-1.3764
7,1.0671
8,-0.8125399999999999
9,-0.24866
10,0.8791100000000001
11,-1.5644
12,0.5031899999999999
13,-0.06069600000000001
14,-1.3764
15,0.8791100000000001
16,-1.0005
17,-0.43662
18,0.69115
19,-1.9403
20,0.69115
21,-0.24866
22,-1.5644
23,1.255
24,-1.0005
25,0.12727
26,1.255
27,-1.7523
28,1.0671
29,0.31523
30,-1.0005
31,2.5708
32,0.31523
33,0.31523
34,2.0069
35,-0.62458
36,1.255
37,1.0671
38,-0.8125399999999999
39,1.443
40,-0.43662
41,-0.24866
42,1.443
43,-1.3764
44,0.12727
45,0.5031899999999999
46,-1.3764
47,0.5031899999999999
48,0.12727
49,-1.0005
50,1.0671
51,-0.43662
52,0.12727
53,0.69115
54,-1.3764
55,0.31523
56,0.31523
57,-1.0005
58,0.5031899999999999
59,-0.43662
60,-0.62458
61,1.0671
62,-0.62458
63,-0.06069600000000001
64,1.255
65,-1.3764
66,0.31523
67,1.0671
68,-1.5644
69,0.5031899999999999
70,0.69115
71,-1.5644
72,0.69115
73,0.12727
74,-0.8125399999999999
75,2.1948
76,-0.62458
77,0.12727
78,0.8791100000000001
79,-1.0005
80,0.8791100000000001
81,0.12727
82,-0.62458
83,0.8791100000000001
84,-0.06069600000000001
85,0.31523
86,1.0671
87,-1.3764
88,1.255
89,-1.0005
90,-1.0005
91,0.5031899999999999
92,-1.0005
93,-0.62458
94,0.69115
95,-1.5644
