time,value
0,-1.1591
1,-0.24293
2,-2.1114
3,-0.72304
4,-1.365
5,-1.3949
6,-1.0748
7,-1.4196
8,-1.2168
9,-1.255
10,-1.2982
11,-1.2439
12,-1.2689
13,-1.2633
14,-1.2735
15,-1.2819
16,-1.2855
17,-1.2828
18,-1.2845
19,-1.2936
20,-1.2951
21,-1.288
22,-1.2754
23,-1.278
24,-1.2748
25,-1.2646
26,-1.2467
27,-1.2402
28,-1.2365
29,-1.2257
30,-1.2081
31,-1.1936
32,-1.1916
33,-1.1836
34,-1.1702
35,-1.1515
36,-1.1503
37,-1.1487
38,-1.1401
39,-1.1238
40,-1.1174
41,-1.117
42,-1.1092
43,-1.0968
44,-1.0832
45,-1.0838
46,-1.0786
47,-1.068
48,-1.0521
49,-1.0494
50,-1.0479
51,-1.0408
52,-1.0278
53,-1.0193
54,-1.0222
55,-1.0184
56,-1.0072
57,-0.99013
58,-0.9910700000000001
59,-0.9863299999999999
60,-0.97431
61,-0.95542
62,-0.94634
63,-0.9414100000000001
64,-0.92863
65,-0.9079
66,-0.8870100000000001
67,-0.8800899999999999
68,-0.8662
69,-0.84662
70,-0.8242
71,-0.81799
72,-0.81119
73,-0.80071
74,-0.78583
75,-0.7771899999999999
76,-0.7791100000000001
77,-0.77713
78,-0.77044
79,-0.76056
80,-0.7693300000000001
81,-0.77637
82,-0.77946
83,-0.78138
84,-0.7979999999999999
85,-0.81906
86,-0.84626
87,-0.8671
88,-0.87836
89,-0.9083399999999999
90,-0.9363799999999999
91,-0.9541200000000001
92,-0.9685299999999999
93,-0.99911
94,-1.0256
95,-1.0468
96,-1.0623
97,-1.0861
98,-1.1159
99,-1.1378
100,-1.1546
101,-1.1687
102,-1.1964
103,-1.2205
104,-1.2354
105,-1.242
106,-1.2659
107,-1.2906
108,-1.3082
109,-1.321
110,-1.3345
111,-1.3565
112,-1.3718
113,-1.3793
114,-1.3806
115,-1.3994
116,-1.4144
117,-1.4243
118,-1.4277
119,-1.4399
120,-1.4566
121,-1.4666
122,-1.4713
123,-1.4766
124,-1.4946
125,-1.5071
126,-1.5123
127,-1.511
128,-1.5251
129,-1.5362
130,-1.5383
131,-1.5342
132,-1.5344
133,-1.5424
134,-1.5457
135,-1.5425
136,-1.5342
137,-1.5429
138,-1.545
139,-1.5405
140,-1.5321
141,-1.5339
142,-1.5366
143,-1.5334
144,-1.5244
145,-1.5165
146,-1.521
147,-1.5190000000000001
148,-1.5089
149,-1.4925
150,-1.4913
151,-1.4869999999999999
152,-1.4768
153,-1.4615
154,-1.4539
155,-1.4536
156,-1.4478
157,-1.4366
158,-1.4237
159,-1.4265
160,-1.4243
161,-1.4152
162,-1.3997
163,-1.3954
164,-1.3904
165,-1.3813
166,-1.3659999999999999
167,-1.3518
168,-1.3495
169,-1.3406
170,-1.3259
171,-1.3083
172,-1.3061
173,-1.2996
174,-1.288
175,-1.2685
176,-1.2567
177,-1.2505
178,-1.2392
179,-1.2227
180,-1.2073
181,-1.2079
182,-1.2021
183,-1.187
184,-1.1663
185,-1.1622
186,-1.1582
187,-1.1487
188,-1.1351
189,-1.1281
190,-1.131
191,-1.1273
192,-1.1177
193,-1.1042
194,-1.1077
195,-1.1062
196,-1.0991
197,-1.0861
198,-1.0845
199,-1.0874
200,-1.0851
201,-1.0775
202,-1.071
203,-1.077
204,-1.0768
205,-1.0699
206,-1.0571
207,-1.0596
208,-1.0584
209,-1.0499
210,-1.0356
211,-1.0291
212,-1.0308
213,-1.028
214,-1.0184
215,-1.0042
216,-1.006
217,-1.0022
218,-0.9910200000000001
219,-0.9727399999999999
220,-0.9671299999999999
221,-0.9642200000000001
222,-0.95442
223,-0.9390000000000001
224,-0.92927
225,-0.9312600000000001
226,-0.9280200000000001
227,-0.9198299999999999
228,-0.90623
229,-0.9114200000000001
230,-0.9142899999999999
231,-0.9107700000000001
232,-0.9023100000000001
233,-0.90681
234,-0.9192600000000001
235,-0.92576
236,-0.92869
237,-0.93391
238,-0.9537
239,-0.96657
240,-0.97165
241,-0.9692200000000001
242,-0.98015
243,-0.99045
244,-0.9940100000000001
245,-0.99155
246,-0.9956299999999999
247,-1.0113
248,-1.0217
249,-1.0277
250,-1.0312
251,-1.053
252,-1.0696
253,-1.0803
254,-1.0856
255,-1.1026
256,-1.123
257,-1.1371
258,-1.1468
259,-1.1583
260,-1.1824
261,-1.2014
262,-1.2134
263,-1.2177
264,-1.2355
265,-1.2476
266,-1.2517
267,-1.2474
268,-1.2469
269,-1.254
270,-1.2526
271,-1.2429
272,-1.2308
273,-1.2341
274,-1.2323
275,-1.224
276,-1.21
277,-1.2095
278,-1.2093
279,-1.2028
280,-1.1911
281,-1.1804
282,-1.1802
283,-1.1740000000000002
284,-1.1614
285,-1.1432
286,-1.1412
287,-1.135
288,-1.1217
289,-1.1016
290,-1.09
291,-1.0834
292,-1.07
293,-1.0513
294,-1.032
295,-1.0289
296,-1.0228
297,-1.0112
298,-0.99351
299,-0.9897600000000001
300,-0.98401
301,-0.96857
302,-0.94325
303,-0.92066
304,-0.90848
305,-0.8899299999999999
306,-0.8655200000000001
307,-0.83741
308,-0.8276899999999999
309,-0.81343
310,-0.7933899999999999
311,-0.76694
312,-0.75126
313,-0.73993
314,-0.72496
315,-0.70712
316,-0.69158
317,-0.69199
318,-0.6877800000000001
319,-0.67389
320,-0.65053
321,-0.6423300000000001
322,-0.6313
323,-0.6118600000000001
324,-0.5878899999999999
325,-0.5736100000000001
326,-0.56886
327,-0.5614100000000001
328,-0.5506
329,-0.5379999999999999
330,-0.54486
331,-0.5459
332,-0.54079
333,-0.53091
334,-0.5331899999999999
335,-0.5393899999999999
336,-0.54028
337,-0.53389
338,-0.53023
339,-0.53951
340,-0.54328
341,-0.53938
342,-0.5283399999999999
343,-0.5355800000000001
344,-0.5394899999999999
345,-0.5362
346,-0.52723
347,-0.52577
348,-0.52803
349,-0.52487
350,-0.5151100000000001
351,-0.50148
352,-0.50444
353,-0.5029100000000001
354,-0.49677
355,-0.48753
356,-0.49291999999999997
357,-0.49878
358,-0.49833999999999995
359,-0.49057
360,-0.4878
361,-0.49517
362,-0.49291999999999997
363,-0.48358999999999996
364,-0.4692
365,-0.47156000000000003
366,-0.46795
367,-0.45751000000000003
368,-0.43775
369,-0.42696999999999996
370,-0.42013
371,-0.4055
372,-0.38436
373,-0.3625
374,-0.35385
375,-0.34034000000000003
376,-0.31651
377,-0.28945
378,-0.27891
379,-0.2601
380,-0.24695
381,-0.20998000000000003
382,-0.14636
383,-0.12546
384,-0.13164
385,-0.11339
386,-0.07936599999999999
387,-0.06717200000000001
388,-0.050838
389,-0.025712
390,0.0078451
391,0.027469
392,0.043269999999999996
393,0.067357
394,0.097012
395,0.12105
396,0.13092
397,0.14322000000000001
398,0.16011
399,0.18229
400,0.18356
401,0.18959
402,0.20285
403,0.21994
404,0.22746
405,0.22651
406,0.23126999999999998
407,0.24276999999999999
408,0.2562
409,0.25351
410,0.25690999999999997
411,0.26848
412,0.28702
413,0.28995
414,0.29413
415,0.3067
416,0.32626
417,0.34345
418,0.35036
419,0.36369
420,0.38497
421,0.413
422,0.42023999999999995
423,0.43295
424,0.45337
425,0.47936999999999996
426,0.49368
427,0.50421
428,0.52091
429,0.54193
430,0.56033
431,0.55992
432,0.5636399999999999
433,0.5734100000000001
434,0.58868
435,0.58953
436,0.59583
437,0.61088
438,0.63541
439,0.65578
440,0.6654100000000001
441,0.6814
442,0.70202
443,0.72346
444,0.72413
445,0.72723
446,0.73732
447,0.7562
448,0.7620899999999999
449,0.76813
450,0.78246
451,0.80453
452,0.82524
453,0.82895
454,0.8397399999999999
455,0.8556600000000001
456,0.87082
457,0.8655200000000001
458,0.86172
459,0.86124
460,0.8678799999999999
461,0.86656
462,0.8558100000000001
463,0.85154
464,0.8552200000000001
465,0.86011
466,0.8440799999999999
467,0.8299
468,0.81805
469,0.8067300000000001
470,0.77575
471,0.74166
472,0.71222
473,0.69153
474,0.67043
475,0.63734
476,0.61536
477,0.60582
478,0.60053
479,0.57447
480,0.55635
481,0.54496
482,0.54202
483,0.52973
484,0.50958
485,0.49964
486,0.49556000000000006
487,0.48541999999999996
488,0.45943999999999996
489,0.43677
490,0.42131
491,0.41818
492,0.39864
493,0.38019000000000003
494,0.37121
495,0.37215
496,0.36962
497,0.35569
498,0.3485
499,0.34986999999999996
500,0.3533
501,0.33433
502,0.32008000000000003
503,0.31208
504,0.31201999999999996
505,0.29961
506,0.2797
507,0.26681
508,0.2621
509,0.25032
510,0.21916999999999998
511,0.19174000000000002
512,0.16680999999999999
513,0.14021
514,0.089025
515,0.038310000000000004
516,-0.0040479
517,-0.036536
518,-0.07295900000000001
519,-0.11115
520,-0.13685999999999998
521,-0.15596
522,-0.17157999999999998
523,-0.19672
524,-0.21263
525,-0.22304000000000002
526,-0.22541
527,-0.23943000000000003
528,-0.25461999999999996
529,-0.26281
530,-0.26304
531,-0.26586
532,-0.2798
533,-0.28605
534,-0.28479
535,-0.2774
536,-0.28635
537,-0.28757
538,-0.28148
539,-0.27014
540,-0.26884
541,-0.27305
542,-0.27245
543,-0.26576
544,-0.25816
545,-0.26554
546,-0.26353000000000004
547,-0.25674
548,-0.24181
549,-0.2416
550,-0.24511999999999998
551,-0.23071
552,-0.22401
553,-0.21375999999999998
554,-0.15222
555,-0.10737000000000001
556,-0.10216
557,-0.074008
558,-0.066209
559,-0.058263
560,-0.036761
561,-0.013588
562,-0.0010548
563,0.009298700000000002
564,0.02623
565,0.050259
566,0.072643
567,0.08354400000000001
568,0.1027
569,0.13371
570,0.17449
571,0.19287
572,0.20931999999999998
573,0.23371999999999998
574,0.26300999999999997
575,0.2821
576,0.29479
577,0.31439
578,0.34199
579,0.37445
580,0.38744
581,0.40765
582,0.43649
583,0.46826
584,0.48552
585,0.50371
586,0.52587
587,0.55092
588,0.5727399999999999
589,0.58318
590,0.6007100000000001
591,0.62232
592,0.64691
593,0.65259
594,0.6612399999999999
595,0.67475
596,0.6943199999999999
597,0.70345
598,0.70791
599,0.71868
600,0.73397
601,0.7481300000000001
602,0.74283
603,0.7427699999999999
604,0.75012
605,0.76359
606,0.76113
607,0.75866
608,0.7632899999999999
609,0.7761399999999999
610,0.78447
611,0.78176
612,0.78537
613,0.79795
614,0.81609
615,0.8124100000000001
616,0.8163100000000001
617,0.82605
618,0.84183
619,0.84925
620,0.85278
621,0.8637799999999999
622,0.88525
623,0.90635
624,0.91132
625,0.92166
626,0.9384899999999999
627,0.9602799999999999
628,0.96247
629,0.9679200000000001
630,0.98136
631,1.0023
632,1.0165
633,1.0223
634,1.0359
635,1.0558
636,1.0807
637,1.0905
638,1.1048
639,1.1283
640,1.1599
641,1.1715
642,1.1797
643,1.1934
644,1.2126
645,1.2302
646,1.2334
647,1.2451
648,1.2661
649,1.2929
650,1.3003
651,1.3095
652,1.3293
653,1.351
654,1.3651
655,1.3806
656,1.3854
657,1.4261
658,1.4517
659,1.4369999999999998
660,1.5748
661,1.7138
662,1.7095
663,1.7122
664,1.7324
665,1.7366
666,1.7661
667,1.7790000000000001
668,1.7783
669,1.7858
670,1.7926
671,1.8088
672,1.8021
673,1.8027
674,1.8123
675,1.8298
676,1.8377
677,1.8429
678,1.8577
679,1.8813
680,1.906
681,1.9169
682,1.933
683,1.9574
684,1.992
685,2.0063
686,2.0203
687,2.0407
688,2.0701
689,2.0918
690,2.0999
691,2.1163
692,2.1395
693,2.1634
694,2.167
695,2.1743
696,2.1882
697,2.2091
698,2.2137
699,2.2208
700,2.2353
701,2.2563
702,2.2792
703,2.2881
704,2.3066
705,2.3349
706,2.371
707,2.3913
708,2.4151
709,2.4418
710,2.4745
711,2.4921
712,2.4948
713,2.4995
714,2.5041
715,2.5029
716,2.4807
717,2.4646
718,2.4587
719,2.459
720,2.4388
721,2.4173
722,2.392
723,2.367
724,2.3387
725,2.2917
726,2.2528
727,2.2247
728,2.2014
729,2.1542
730,2.1038
731,2.0598
732,2.0294
733,1.9865
734,1.9439
735,1.9123
736,1.8897
737,1.8719
738,1.8364
739,1.8075
740,1.7918
741,1.7822
742,1.7575
743,1.7411
744,1.725
745,1.7269999999999999
746,1.7168
747,1.6540000000000001
748,1.6132
749,1.6119
750,1.6037
751,1.5762
752,1.5568
753,1.5419999999999998
754,1.5387
755,1.5204
756,1.5028
757,1.4922
758,1.485
759,1.474
760,1.4384
761,1.3999
762,1.3671
763,1.3443
764,1.3081
765,1.2788
766,1.2570000000000001
767,1.2422
768,1.2197
769,1.1917
770,1.169
771,1.1543
772,1.1443
773,1.1146
774,1.0904
775,1.0723
776,1.0617
777,1.0392
778,1.0142
779,0.99841
780,0.99508
781,0.9874700000000001
782,0.96819
783,0.95494
784,0.9454100000000001
785,0.9384899999999999
786,0.9092899999999999
787,0.88975
788,0.8820899999999999
789,0.8835200000000001
790,0.8750600000000001
791,0.8610899999999999
792,0.8536600000000001
793,0.8532
794,0.85072
795,0.83016
796,0.81611
797,0.8083199999999999
798,0.80666
799,0.78889
800,0.77123
801,0.7621399999999999
802,0.76158
803,0.7552800000000001
804,0.74255
805,0.73473
806,0.7319100000000001
807,0.7350800000000001
808,0.71604
809,0.7003699999999999
810,0.69172
811,0.69006
812,0.67672
813,0.66015
814,0.65081
815,0.65069
816,0.64864
817,0.62944
818,0.61539
819,0.61185
820,0.61666
821,0.60393
822,0.5944699999999999
823,0.5977
824,0.5995199999999999
825,0.59448
826,0.58713
827,0.55718
828,0.56872
829,0.55766
830,0.51117
831,0.57012
832,0.39491
833,0.066387
834,0.031679
835,0.047464
836,-0.014434
837,-0.0042123
838,-0.024874
839,-0.060508000000000006
840,-0.074272
841,-0.098722
842,-0.10507999999999999
843,-0.12933
844,-0.14937999999999999
845,-0.1605
846,-0.16465
847,-0.1777
848,-0.19785
849,-0.21035
850,-0.21645999999999999
851,-0.22512
852,-0.24753000000000003
853,-0.26299
854,-0.2717
855,-0.27402
856,-0.29289
857,-0.30901
858,-0.31521
859,-0.31324
860,-0.3141
861,-0.32118
862,-0.3213
863,-0.31442
864,-0.30268
865,-0.31034
866,-0.31293000000000004
867,-0.31038000000000004
868,-0.30538000000000004
869,-0.31472
870,-0.32786
871,-0.33558000000000004
872,-0.3384
873,-0.34339000000000003
874,-0.36239
875,-0.3775
876,-0.38694
877,-0.39042
878,-0.41162
879,-0.43075
880,-0.44346
881,-0.45101
882,-0.46703
883,-0.48991999999999997
884,-0.5056
885,-0.51151
886,-0.51263
887,-0.53225
888,-0.54598
889,-0.55064
890,-0.54856
891,-0.55555
892,-0.55675
893,-0.5498
894,-0.5350199999999999
895,-0.52246
896,-0.52718
897,-0.53169
898,-0.53384
899,-0.53608
900,-0.56006
901,-0.57817
902,-0.59383
903,-0.5979800000000001
904,-0.6124
905,-0.6369100000000001
906,-0.6329100000000001
907,-0.6461
908,-0.6372899999999999
909,-0.62073
910,-0.6688
911,-0.5321100000000001
912,-0.26093
913,-0.23346999999999998
914,-0.25079
915,-0.19434
916,-0.17720999999999998
917,-0.1465
918,-0.12265
919,-0.10676
920,-0.072155
921,-0.03909
922,-0.024117
923,-0.0040885
924,0.01815
925,0.043045
926,0.051017
927,0.05483
928,0.06613200000000001
929,0.083493
930,0.098121
931,0.09626599999999999
932,0.09887699999999999
933,0.10672999999999999
934,0.11935
935,0.11482
936,0.11166
937,0.11408
938,0.12202
939,0.12219000000000001
940,0.11572
941,0.11422
942,0.11907999999999999
943,0.12844
944,0.11932999999999999
945,0.11657999999999999
946,0.1213
947,0.13416
948,0.13675
949,0.1376
950,0.14601
951,0.16285
952,0.1778
953,0.18474000000000002
954,0.19968
955,0.22283000000000003
956,0.25506
957,0.27043
958,0.29669
959,0.32435
960,0.36409
961,0.39449
962,0.41025
963,0.4612
964,0.49158
965,0.5374899999999999
966,0.5885199999999999
967,0.5587
968,0.72368
969,1.0236
970,1.0351
971,0.9929100000000001
972,1.0329
973,1.0195
974,1.0162
975,1.0063
976,0.98505
977,0.98354
978,0.9785799999999999
979,0.9495399999999999
980,0.93014
981,0.91812
982,0.91401
983,0.9007200000000001
984,0.8828600000000001
985,0.87255
986,0.8717600000000001
987,0.8700700000000001
988,0.8529399999999999
989,0.8393799999999999
990,0.8304799999999999
991,0.8282299999999999
992,0.8093899999999999
993,0.79499
994,0.7871199999999999
995,0.7841
996,0.77145
997,0.74715
998,0.72834
999,0.7134
1000,0.7007899999999999
1001,0.67442
1002,0.65496
1003,0.64186
1004,0.63448
1005,0.6101800000000001
1006,0.58411
1007,0.5654899999999999
1008,0.55461
1009,0.54194
1010,0.51265
1011,0.48896999999999996
1012,0.47581999999999997
1013,0.46824
1014,0.43604
1015,0.40326999999999996
1016,0.37699
1017,0.36025999999999997
1018,0.33634000000000003
1019,0.30735999999999997
1020,0.28763
1021,0.26753000000000005
1022,0.26049
1023,0.24191
1024,0.21049
1025,0.22423
1026,0.20538
1027,0.071176
1028,0.0045138999999999995
1029,0.0019675
1030,-0.029407
1031,-0.048937
1032,-0.075302
1033,-0.10490999999999999
1034,-0.1205
1035,-0.1365
1036,-0.17357999999999998
1037,-0.20692
1038,-0.23358
1039,-0.24906
1040,-0.27669
1041,-0.30863
1042,-0.33013000000000003
1043,-0.34163000000000004
1044,-0.34926
1045,-0.36532
1046,-0.37115
1047,-0.36406
1048,-0.34531
1049,-0.34054
1050,-0.3302
1051,-0.3133
1052,-0.29346
1053,-0.27981
1054,-0.27395
1055,-0.2624
1056,-0.24220999999999998
1057,-0.21849000000000002
1058,-0.21644000000000002
1059,-0.20905
1060,-0.1934
1061,-0.17753
1062,-0.18061
1063,-0.18517999999999998
1064,-0.18462
1065,-0.17962
1066,-0.17645
1067,-0.18722
1068,-0.19134
1069,-0.18692999999999999
1070,-0.17722000000000002
1071,-0.18565
1072,-0.18957000000000002
1073,-0.18379
1074,-0.17022
1075,-0.16635
1076,-0.16866
1077,-0.16702999999999998
1078,-0.15730999999999998
1079,-0.14515
1080,-0.12261
1081,-0.19013
1082,-0.077234
1083,-0.14594000000000001
1084,-0.19376
1085,0.15911
1086,-0.42722
1087,0.14397000000000001
1088,0.13825
1089,-0.9877799999999999
1090,1.785
1091,-2.9049
