time,value
0,1.6338
1,1.6183
2,1.5806
3,1.5090000000000001
4,1.4295
5,1.347
6,1.2633
7,1.1796
8,1.0959999999999999
9,1.018
10,0.9387700000000001
11,0.8569
12,0.7751100000000001
13,0.6934
14,0.6201
15,0.53942
16,0.45808000000000004
17,0.37687
18,0.29581
19,0.2138
20,0.14126
21,0.059425
22,-0.022338999999999998
23,-0.10402
24,-0.18559
25,-0.26705
26,-0.34838
27,-0.42955
28,-0.51053
29,-0.59311
30,-0.67372
31,-0.75403
32,-0.83395
33,-0.91575
34,-0.9947799999999999
35,-1.073
36,-1.1503
37,-1.226
38,-1.2998
39,-1.3705
40,-1.4366
41,-1.4954
42,-1.5425
43,-1.5715
44,-1.5759
45,-1.5481
46,-1.5078
47,-1.4651
48,-1.3957
49,-1.3299
50,-1.2536
51,-1.1785
52,-1.1018
53,-1.0239
54,-0.94266
55,-0.86344
56,-0.78369
57,-0.70352
58,-0.6230100000000001
59,-0.5404800000000001
60,-0.46941000000000005
61,-0.38666999999999996
62,-0.30541
63,-0.22401
64,-0.14249
65,-0.061025
66,0.012619
67,0.09324500000000001
68,0.17515
69,0.24886999999999998
70,0.32997
71,0.4037
72,0.48494
73,0.56648
74,0.64857
75,0.72958
76,0.8112699999999999
77,0.89344
78,0.9758600000000001
79,1.0589
80,1.1427
81,1.2265
82,1.3103
83,1.3851
84,1.4665
85,1.5458
86,1.6057
87,1.6347
88,1.6338
89,1.6175
90,1.554
91,1.4816
92,1.3996
93,1.3249
94,1.2418
95,1.1583
96,1.0753
97,0.99223
98,0.9101799999999999
99,0.83652
100,0.7546
101,0.67409
102,0.59243
103,0.5117
104,0.43032
105,0.34813
106,0.26796
107,0.18592999999999998
108,0.10509
109,0.023232
110,-0.05728099999999999
111,-0.13892000000000002
112,-0.22045
113,-0.30185
114,-0.38311
115,-0.46421
116,-0.5451
117,-0.62575
118,-0.70611
119,-0.7783800000000001
120,-0.8552700000000001
121,-0.9341
122,-1.0122
123,-1.0893
124,-1.1631
125,-1.2389
126,-1.3057
127,-1.3699
128,-1.4275
129,-1.4804
130,-1.5203
131,-1.5418
132,-1.5409
133,-1.5177
134,-1.4745
135,-1.4227
136,-1.3619999999999999
137,-1.2955
138,-1.229
139,-1.1518
140,-1.0843
141,-1.0108
142,-0.9329799999999999
143,-0.8543799999999999
144,-0.77515
145,-0.69544
146,-0.61533
147,-0.5349
148,-0.4542
149,-0.37328
150,-0.30193000000000003
151,-0.2206
152,-0.13915
153,-0.057575
154,0.024093
155,0.10585
156,0.18652
157,0.26739
158,0.34842
159,0.42871000000000004
160,0.50183
161,0.58406
162,0.6584899999999999
163,0.73824
164,0.81363
165,0.8929799999999999
166,0.9754700000000001
167,1.058
168,1.1416
169,1.2252
170,1.3095
171,1.3932
172,1.475
173,1.547
174,1.6059
175,1.6342
