time,value
0,0.7685
1,0.7685
2,0.8694200000000001
3,0.7685
4,0.7685
5,0.8694200000000001
6,0.7685
7,0.7685
8,0.7685
9,0.8694200000000001
10,0.7685
11,0.7685
12,0.7685
13,0.8694200000000001
14,0.7685
15,0.7685
16,0.8694200000000001
17,0.7685
18,0.7685
19,0.7685
20,0.8694200000000001
21,0.7685
22,0.7685
23,0.7685
24,0.8694200000000001
25,0.7685
26,0.7685
27,0.8694200000000001
28,0.7685
29,0.7685
30,0.7685
31,0.8694200000000001
32,0.7685
33,0.7685
34,0.8694200000000001
35,-0.64445
36,-0.74537
37,-0.64445
38,-0.74537
39,-0.64445
40,-0.74537
41,-0.64445
42,-0.74537
43,-0.64445
44,-0.74537
45,-0.64445
46,-0.74537
47,-0.64445
48,-0.74537
49,-0.64445
50,-0.74537
51,-0.64445
52,-0.74537
53,-0.64445
54,-0.74537
55,-0.64445
56,-0.74537
57,-0.74537
58,-0.64445
59,-0.74537
60,-0.64445
61,-0.74537
62,-0.64445
63,-0.74537
64,-0.64445
65,-0.74537
66,-0.64445
67,-0.74537
68,-0.64445
69,-0.74537
70,-0.64445
71,-0.74537
72,1.9796
73,2.4842
74,2.4842
75,2.3833
76,2.3833
77,2.4842
78,1.475
79,-1.0481
80,-1.0481
81,-1.0481
82,-1.0481
83,-1.0481
84,-1.0481
85,-1.0481
86,-1.0481
87,-1.0481
88,-1.0481
89,-1.0481
90,-1.0481
91,-1.0481
92,-1.0481
93,-1.0481
94,-1.0481
95,-1.0481
