time,value
0,-0.16126
1,-0.16126
2,-0.16126
3,-0.16126
4,-0.16126
5,-0.16126
6,-0.16126
7,-0.16126
8,-0.16126
9,-0.16126
10,-0.16126
11,-0.16126
12,-0.16126
13,-0.16126
14,-0.16126
15,-0.16126
16,-0.16126
17,-0.16126
18,-0.16126
19,-0.16126
20,-0.16126
21,-0.16126
22,-0.16126
23,-0.16126
24,-0.16126
25,-0.16126
26,-0.16126
27,-0.16126
28,-0.16126
29,0.065565
30,0.91614
31,-0.16126
32,-0.16126
33,-0.16126
34,-0.16126
35,-0.16126
36,-0.16126
37,-0.16126
38,-0.16126
39,3.0709
40,-0.16126
41,-0.16126
42,-0.16126
43,-0.16126
44,-0.16126
45,-0.16126
46,-0.16126
47,-0.16126
48,-0.16126
49,-0.16126
50,-0.16126
51,-0.16126
52,-0.16126
53,-0.16126
54,-0.16126
55,0.0088602
56,9.025
57,0.91614
58,0.34909
59,-0.16126
60,-0.16126
61,-0.16126
62,-0.16126
63,-0.16126
64,-0.16126
65,-0.16126
66,-0.16126
67,-0.16126
68,-0.16126
69,-0.16126
70,-0.16126
71,-0.16126
72,-0.16126
73,-0.16126
74,-0.16126
75,-0.16126
76,-0.16126
77,-0.16126
78,-0.16126
79,-0.16126
80,-0.16126
81,-0.16126
82,-0.16126
83,-0.16126
84,-0.16126
85,-0.16126
86,-0.16126
87,-0.16126
88,-0.16126
89,-0.16126
90,-0.16126
91,-0.16126
92,-0.16126
93,-0.16126
94,-0.16126
95,-0.16126
