time,value
0,-0.26432
1,-0.26432
2,-0.26432
3,-0.26432
4,-0.26432
5,-0.26432
6,-0.26432
7,-0.26432
8,-0.26432
9,-0.26432
10,-0.26432
11,-0.26432
12,-0.26432
13,-0.26432
14,-0.26432
15,-0.26432
16,-0.26432
17,-0.26432
18,-0.26432
19,-0.26432
20,-0.26432
21,-0.26432
22,-0.26432
23,-0.26432
24,-0.26432
25,-0.26432
26,-0.26432
27,-0.26432
28,-0.26432
29,-0.26432
30,-0.26432
31,-0.26432
32,-0.26432
33,-0.26432
34,-0.26432
35,-0.26432
36,-0.26432
37,3.7777
38,-0.26432
39,-0.26432
40,-0.26432
41,-0.26432
42,-0.26432
43,3.6093
44,-0.26432
45,-0.26432
46,-0.26432
47,-0.26432
48,-0.26432
49,-0.26432
50,-0.26432
51,-0.26432
52,-0.26432
53,-0.26432
54,-0.26432
55,-0.26432
56,-0.26432
57,-0.26432
58,-0.26432
59,-0.26432
60,-0.26432
61,-0.26432
62,-0.26432
63,-0.26432
64,-0.26432
65,-0.26432
66,-0.26432
67,-0.26432
68,-0.26432
69,-0.26432
70,-0.26432
71,-0.26432
72,-0.26432
73,4.3952
74,0.18479
75,-0.26432
76,-0.26432
77,2.9356
78,-0.26432
79,-0.26432
80,1.5321
81,-0.26432
82,-0.26432
83,-0.26432
84,-0.26432
85,-0.26432
86,-0.26432
87,-0.26432
88,-0.26432
89,-0.26432
90,-0.26432
91,5.4057
92,-0.26432
93,1.4198
94,-0.26432
95,-0.26432
