time,value
0,-0.29218
1,-0.9565100000000001
2,0.1507
3,1.4794
4,-0.9565100000000001
5,-0.9565100000000001
6,0.74122
7,0.88885
8,-0.9565100000000001
9,-0.9565100000000001
10,1.3317
11,0.29833000000000004
12,-0.9565100000000001
13,-0.51362
14,1.7008
15,-0.58744
16,-0.9565100000000001
17,0.07689
18,1.5532
19,-0.9565100000000001
20,-0.9565100000000001
21,0.6674
22,0.9626600000000001
23,-0.9565100000000001
24,-0.9565100000000001
25,1.2579
26,0.29833000000000004
27,-0.9565100000000001
28,-0.80888
29,1.7008
30,-0.29218
31,-0.9565100000000001
32,0.22451999999999997
33,1.1841
34,-0.9565100000000001
35,-0.9565100000000001
36,1.1841
37,0.29833000000000004
38,-0.9565100000000001
39,-0.9565100000000001
40,1.7746
41,-0.29218
42,-0.9565100000000001
43,-0.21836999999999998
44,1.6269999999999998
45,-0.80888
46,-0.9565100000000001
47,0.44596
48,1.1103
49,-0.9565100000000001
50,-0.9565100000000001
51,1.1103
52,0.51978
53,-0.9565100000000001
54,-0.66125
55,1.7008
56,-0.366
57,-0.9565100000000001
58,0.0030756
59,1.5532
60,-0.9565100000000001
61,-0.9565100000000001
62,1.0365
63,0.74122
64,-0.9565100000000001
65,-0.9565100000000001
66,1.7746
67,0.22451999999999997
68,-0.9565100000000001
69,-0.14455
70,1.6269999999999998
71,-0.366
72,-0.9565100000000001
73,0.44596
74,1.5532
75,-0.9565100000000001
76,-0.9565100000000001
77,0.9626600000000001
78,1.1103
79,-0.9565100000000001
80,-0.9565100000000001
81,1.3317
82,0.81503
83,-0.9565100000000001
84,-0.9565100000000001
85,1.7746
86,0.29833000000000004
87,-0.9565100000000001
88,-0.070739
89,1.6269999999999998
90,-0.366
91,-0.9565100000000001
92,0.6674
93,1.2579
94,-0.9565100000000001
95,-0.9565100000000001
