time,value
0,-0.97191
1,-0.97191
2,1.8656
3,-0.97191
4,0.19647
5,0.6972
6,-0.97191
7,1.3648
8,-0.47118000000000004
9,-0.97191
10,1.8656
11,-0.97191
12,-0.30427
13,1.031
14,-0.97191
15,0.86411
16,0.029557
17,-0.97191
18,1.6987
19,-0.97191
20,-0.97191
21,1.6987
22,-0.97191
23,-0.30427
24,1.1979
25,-0.97191
26,0.36338000000000004
27,0.36338000000000004
28,-0.97191
29,1.1979
30,-0.30427
31,-0.97191
32,1.6987
33,-0.97191
34,-0.97191
35,1.6987
36,-0.97191
37,-0.97191
38,1.8656
39,-0.97191
40,-0.6380899999999999
41,1.5318
42,-0.97191
43,0.86411
44,-0.13735
45,-0.97191
46,1.1979
47,-0.30427
48,-0.97191
49,1.1979
50,-0.30427
51,-0.97191
52,1.031
53,-0.13735
54,-0.97191
55,1.031
56,-0.13735
57,-0.97191
58,1.031
59,-0.30427
60,-0.97191
61,1.031
62,-0.13735
63,-0.97191
64,0.6972
65,0.19647
66,-0.97191
67,0.19647
68,0.6972
69,-0.97191
70,0.029557
71,0.86411
72,-0.97191
73,0.19647
74,0.6972
75,-0.97191
76,-0.30427
77,1.3648
78,-0.97191
79,-0.97191
80,1.8656
81,-0.97191
82,-0.97191
83,1.8656
84,-0.97191
85,-0.47118000000000004
86,1.5318
87,-0.97191
88,-0.13735
89,1.3648
90,-0.97191
91,0.029557
92,1.031
93,-0.97191
94,0.36338000000000004
95,0.6972
