time,value
0,0.64863
1,0.64863
2,0.54433
3,0.64863
4,0.64863
5,0.64863
6,0.54433
7,0.64863
8,0.64863
9,0.64863
10,0.54433
11,0.64863
12,0.54433
13,-1.4374
14,-1.4374
15,-1.4374
16,-1.4374
17,-1.4374
18,-1.4374
19,-1.4374
20,-1.4374
21,-1.4374
22,-1.4374
23,-1.4374
24,0.96154
25,1.1701
26,0.96154
27,0.75293
28,0.75293
29,0.75293
30,0.64863
31,0.75293
32,0.64863
33,0.64863
34,0.64863
35,0.54433
36,0.64863
37,0.64863
38,0.64863
39,0.54433
40,0.64863
41,0.64863
42,0.54433
43,0.64863
44,-0.081486
45,-1.4374
46,-1.4374
47,-1.4374
48,-1.4374
49,-1.4374
50,-1.4374
51,-1.4374
52,-1.4374
53,-1.4374
54,-1.4374
55,0.33571999999999996
56,1.1701
57,0.96154
58,0.85724
59,0.75293
60,0.75293
61,0.64863
62,0.64863
63,0.64863
64,0.64863
65,0.64863
66,0.64863
67,0.64863
68,0.64863
69,0.54433
70,0.64863
71,0.54433
72,0.64863
73,0.54433
74,0.64863
75,0.54433
76,0.64863
77,0.54433
78,0.64863
79,0.44003000000000003
80,-1.4374
81,-1.4374
82,-1.4374
83,-1.4374
84,-1.4374
85,-1.4374
86,-1.4374
87,-1.4374
88,-1.4374
89,-0.91591
90,1.2744
91,1.0658
92,0.85724
93,0.75293
94,0.75293
95,0.75293
