time,value
0,-0.22315
1,-0.22315
2,-0.22315
3,-0.22315
4,-0.22315
5,-0.22315
6,-0.22315
7,-0.22315
8,-0.22315
9,-0.22315
10,-0.22315
11,-0.22315
12,-0.22315
13,-0.22315
14,-0.22315
15,-0.22315
16,-0.22315
17,-0.22315
18,-0.22315
19,-0.22315
20,-0.22315
21,-0.22315
22,-0.22315
23,-0.22315
24,-0.22315
25,-0.22315
26,-0.22315
27,-0.22315
28,-0.22315
29,-0.22315
30,-0.22315
31,-0.22315
32,-0.22315
33,-0.22315
34,-0.22315
35,-0.22315
36,-0.22315
37,-0.22315
38,-0.22315
39,-0.22315
40,-0.22315
41,-0.22315
42,-0.22315
43,-0.22315
44,-0.22315
45,-0.22315
46,-0.22315
47,-0.22315
48,-0.22315
49,-0.22315
50,-0.22315
51,-0.22315
52,-0.22315
53,-0.22315
54,-0.22315
55,-0.22315
56,-0.22315
57,-0.22315
58,-0.22315
59,-0.22315
60,-0.22315
61,-0.22315
62,-0.22315
63,-0.22315
64,-0.22315
65,-0.22315
66,-0.22315
67,-0.22315
68,-0.22315
69,-0.22315
70,-0.22315
71,-0.22315
72,-0.22315
73,-0.22315
74,-0.22315
75,-0.22315
76,-0.22315
77,-0.22315
78,-0.22315
79,-0.22315
80,-0.22315
81,-0.22315
82,1.122
83,5.5444
84,0.56715
85,4.4514
86,0.096335
87,0.096335
88,0.045891
89,6.032
90,1.4583
91,-0.22315
92,-0.22315
93,-0.22315
94,-0.22315
95,-0.22315
