[<text>
<title>wheat by class breakdown</title>
<dateline>    washington, april 9 - </dateline>the u.s. agriculture department gave
the 1986/87 breakdown of supply and distribution for wheats by
classes, in mln bushels, with comparisons, as follows.
    hard winter --
                1986/87           1985/86
           04/09/87 03/09/87  04/09/87 03/09/87
 start stocks 1,009   1,009      717     717
 production   1,018   1,018    1,230   1,230
 ttl supply-x 2,027   2,027    1,947   1,947
 domestic use   599     579      543     543
 exports        450     475      395     395
 total use    1,049   1,054      938     938
 end stocks     978     973    1,009   1,009
 note - season begins june 1. x-includes imports
    hard spring --
                1986/87           1985/86
           04/09/87 03/09/87  04/09/87 03/09/87
 start stocks   498     498      371     371
 production     451     451      460     460
 ttl supply-x   956     956      838     838
 domestic use   218     192      174     174
 exports        200     190      166     166
 total use      418     382      340     340
 end stocks     538     574      498     498
 note - season begins june 1. x-includes imports.
    soft red --
               1986/87           1985/86
          04/09/87 03/09/87  04/09/87 03/09/87
 start stocks   79     79       64     64
 production    290    290      368    368
 ttl supply-x  369    369      432    432
 domestic use  181    193      204    204
 exports       120    120      149    149
 total use     301    313      353    353
 end stocks     68     56       79     79
 note - season begins june 1. x-includes imports
    white --
               1986/87           1985/86
          04/09/87 03/09/87  04/09/87 03/09/87
 start stocks  198    198      173    173
 production    232    232      254    254
 ttl supply-x  433    433      430    430
 domestic use   82     83       80     80
 exports       170    160      152    152
 total use     252    243      232    232
 end stocks    181    190      198    198
 note - season begins june 1. x-includes imports.
    durum --
                1986/87            1985/86
           04/09/87 03/09/87  04/09/87 03/09/87
 start stocks   121    121      100    100
 production      95     95      113    113
 ttl supply-x   221    221      218    218
 domestic use    54     58       44     44
 exports         85     80       53     53
 total use      139    138       97     97
 end stocks      82     83      121    121
 note - season begins june 1. x-includes imports.

 reuter
</text>]