time,value
0,-1.9975
1,-1.9975
2,-1.9975
3,-1.9975
4,-1.9975
5,0.59217
6,1.0854
7,0.8388
8,0.71549
9,0.71549
10,0.59217
11,0.46886000000000005
12,0.59217
13,0.46886000000000005
14,0.59217
15,0.46886000000000005
16,0.46886000000000005
17,0.59217
18,0.46886000000000005
19,0.46886000000000005
20,0.46886000000000005
21,0.46886000000000005
22,0.46886000000000005
23,0.46886000000000005
24,0.46886000000000005
25,0.46886000000000005
26,0.46886000000000005
27,0.34554
28,0.46886000000000005
29,0.46886000000000005
30,0.34554
31,0.46886000000000005
32,0.34554
33,0.46886000000000005
34,0.46886000000000005
35,0.34554
36,0.46886000000000005
37,0.34554
38,0.46886000000000005
39,0.46886000000000005
40,0.34554
41,0.46886000000000005
42,0.46886000000000005
43,0.34554
44,0.46886000000000005
45,0.098909
46,-1.9975
47,-1.9975
48,-1.9975
49,-1.9975
50,-1.9975
51,-1.9975
52,-1.9975
53,-1.9975
54,-1.9975
55,-1.9975
56,1.2087
57,1.0854
58,0.71549
59,0.71549
60,0.59217
61,0.46886000000000005
62,0.46886000000000005
63,0.59217
64,0.46886000000000005
65,0.46886000000000005
66,0.46886000000000005
67,0.34554
68,0.46886000000000005
69,0.46886000000000005
70,0.34554
71,0.46886000000000005
72,0.34554
73,0.46886000000000005
74,0.46886000000000005
75,0.34554
76,0.46886000000000005
77,0.46886000000000005
78,0.34554
79,0.46886000000000005
80,0.46886000000000005
81,0.34554
82,0.46886000000000005
83,0.34554
84,0.46886000000000005
85,0.34554
86,0.46886000000000005
87,0.34554
88,0.34554
89,0.34554
90,0.46886000000000005
91,0.34554
92,-1.6275
93,-1.9975
94,-1.9975
95,-1.9975
