time,value
0,-0.14223
1,-0.14223
2,-0.14223
3,-0.14223
4,-0.14223
5,-0.14223
6,-0.14223
7,-0.14223
8,-0.14223
9,-0.14223
10,-0.14223
11,-0.14223
12,-0.14223
13,-0.14223
14,-0.14223
15,-0.14223
16,-0.14223
17,-0.14223
18,-0.14223
19,-0.14223
20,-0.14223
21,-0.14223
22,-0.14223
23,-0.14223
24,-0.14223
25,-0.14223
26,-0.14223
27,-0.14223
28,-0.14223
29,-0.14223
30,-0.14223
31,-0.14223
32,-0.14223
33,-0.14223
34,-0.14223
35,8.0501
36,-0.14223
37,-0.14223
38,-0.14223
39,-0.14223
40,-0.14223
41,-0.14223
42,-0.14223
43,-0.14223
44,-0.14223
45,-0.14223
46,-0.14223
47,-0.14223
48,-0.14223
49,-0.14223
50,-0.14223
51,-0.14223
52,-0.14223
53,-0.14223
54,-0.14223
55,-0.14223
56,-0.14223
57,-0.14223
58,-0.14223
59,-0.14223
60,-0.14223
61,-0.14223
62,-0.14223
63,-0.14223
64,-0.14223
65,-0.14223
66,-0.14223
67,-0.14223
68,-0.14223
69,-0.14223
70,-0.14223
71,-0.14223
72,5.3193
73,-0.14223
74,-0.14223
75,-0.14223
76,-0.14223
77,-0.14223
78,-0.14223
79,-0.14223
80,-0.14223
81,-0.14223
82,-0.14223
83,-0.14223
84,-0.14223
85,-0.14223
86,-0.14223
87,-0.14223
88,-0.14223
89,-0.14223
90,-0.14223
91,-0.14223
92,-0.14223
93,-0.14223
94,-0.14223
95,-0.14223
