time,value
0,-0.1229
1,-0.1229
2,-0.1229
3,-0.1229
4,-0.1229
5,-0.1229
6,-0.1229
7,-0.1229
8,-0.1229
9,-0.1229
10,-0.1229
11,-0.1229
12,-0.1229
13,-0.1229
14,-0.1229
15,-0.1229
16,-0.1229
17,-0.1229
18,-0.1229
19,-0.1229
20,-0.1229
21,-0.1229
22,-0.1229
23,-0.1229
24,-0.1229
25,-0.1229
26,-0.1229
27,-0.1229
28,-0.1229
29,-0.1229
30,-0.1229
31,-0.1229
32,-0.1229
33,-0.1229
34,-0.1229
35,9.4402
36,2.1126
37,-0.1229
38,-0.1229
39,-0.1229
40,-0.1229
41,-0.1229
42,-0.1229
43,-0.1229
44,-0.1229
45,-0.1229
46,-0.1229
47,-0.1229
48,-0.1229
49,-0.1229
50,-0.1229
51,-0.1229
52,-0.1229
53,-0.1229
54,-0.1229
55,-0.1229
56,-0.1229
57,-0.1229
58,-0.1229
59,-0.1229
60,-0.1229
61,-0.1229
62,-0.1229
63,-0.1229
64,-0.1229
65,-0.1229
66,-0.1229
67,-0.1229
68,-0.1229
69,-0.1229
70,-0.1229
71,-0.1229
72,-0.1229
73,-0.1229
74,-0.1229
75,-0.1229
76,-0.1229
77,-0.1229
78,-0.1229
79,-0.1229
80,-0.1229
81,-0.1229
82,-0.1229
83,-0.1229
84,-0.1229
85,-0.1229
86,-0.1229
87,-0.1229
88,-0.1229
89,-0.1229
90,-0.1229
91,-0.1229
92,-0.1229
93,-0.1229
94,-0.1229
95,-0.1229
