time,value
0,-0.8794200000000001
1,-0.8794200000000001
2,-0.8794200000000001
3,-0.8794200000000001
4,0.43531000000000003
5,1.3744
6,1.2805
7,0.059672
8,-0.8794200000000001
9,-0.8794200000000001
10,-0.8794200000000001
11,-0.8794200000000001
12,-0.8794200000000001
13,-0.5976899999999999
14,1.4683
15,1.3744
16,1.2805
17,-0.50378
18,-0.8794200000000001
19,-0.8794200000000001
20,-0.8794200000000001
21,-0.8794200000000001
22,-0.8794200000000001
23,-0.8794200000000001
24,1.3744
25,1.3744
26,1.2805
27,0.43531000000000003
28,-0.8794200000000001
29,-0.8794200000000001
30,-0.8794200000000001
31,0.6231300000000001
32,1.3744
33,1.3744
34,0.90486
35,-0.8794200000000001
36,-0.8794200000000001
37,-0.8794200000000001
38,0.15358
39,1.4683
40,1.4683
41,-0.31597
42,-0.8794200000000001
43,-0.8794200000000001
44,-0.8794200000000001
45,0.3414
46,1.4683
47,1.3744
48,-0.50378
49,-0.8794200000000001
50,-0.8794200000000001
51,-0.8794200000000001
52,-0.8794200000000001
53,0.3414
54,1.3744
55,1.3744
56,-0.22205999999999998
57,-0.8794200000000001
58,-0.8794200000000001
59,-0.8794200000000001
60,0.059672
61,1.4683
62,1.3744
63,-0.22205999999999998
64,-0.8794200000000001
65,-0.8794200000000001
66,-0.8794200000000001
67,1.3744
68,1.3744
69,0.81095
70,-0.8794200000000001
71,-0.8794200000000001
72,-0.8794200000000001
73,1.5622
74,1.3744
75,0.24749000000000002
76,-0.8794200000000001
77,-0.8794200000000001
78,0.71704
79,1.4683
80,1.0927
81,-0.8794200000000001
82,-0.8794200000000001
83,-0.8794200000000001
84,1.2805
85,1.4683
86,0.3414
87,-0.8794200000000001
88,-0.8794200000000001
89,-0.40988
90,1.5622
91,1.3744
92,-0.22205999999999998
93,-0.8794200000000001
94,-0.8794200000000001
95,-0.8794200000000001
