time,value
0,-0.21315
1,-0.21315
2,-0.21315
3,-0.21315
4,-0.21315
5,-0.21315
6,-0.21315
7,-0.21315
8,-0.21315
9,-0.21315
10,-0.21315
11,-0.21315
12,-0.21315
13,-0.21315
14,-0.21315
15,-0.21315
16,-0.21315
17,-0.21315
18,-0.21315
19,-0.21315
20,-0.21315
21,-0.21315
22,-0.21315
23,-0.21315
24,-0.21315
25,-0.21315
26,-0.21315
27,3.0904
28,-0.21315
29,-0.21315
30,-0.21315
31,-0.21315
32,-0.21315
33,4.7668
34,-0.21315
35,0.8222799999999999
36,-0.21315
37,-0.21315
38,-0.21315
39,-0.21315
40,-0.21315
41,-0.21315
42,-0.21315
43,-0.21315
44,6.7883
45,0.27992
46,-0.21315
47,-0.21315
48,-0.21315
49,-0.21315
50,-0.21315
51,-0.21315
52,-0.21315
53,-0.21315
54,-0.21315
55,-0.21315
56,-0.21315
57,-0.21315
58,-0.21315
59,-0.21315
60,-0.21315
61,-0.21315
62,-0.21315
63,-0.21315
64,-0.21315
65,-0.21315
66,-0.21315
67,-0.21315
68,-0.21315
69,-0.21315
70,-0.21315
71,-0.21315
72,-0.21315
73,-0.21315
74,-0.21315
75,-0.21315
76,-0.21315
77,-0.21315
78,-0.21315
79,-0.21315
80,-0.21315
81,-0.21315
82,-0.21315
83,-0.21315
84,3.4355
85,-0.21315
86,-0.21315
87,-0.21315
88,-0.21315
89,-0.21315
90,-0.21315
91,-0.21315
92,-0.21315
93,-0.21315
94,-0.21315
95,-0.21315
