time,value
0,1.7280000000000002
1,1.3935
2,1.3935
3,-0.11148
4,-0.78037
5,-0.78037
6,-0.78037
7,-0.78037
8,-0.78037
9,-0.78037
10,1.0591
11,1.3935
12,1.3935
13,0.39018
14,-0.78037
15,-0.78037
16,-0.78037
17,-0.78037
18,-0.78037
19,-0.78037
20,0.39018
21,1.5607
22,1.3935
23,1.2263
24,-0.78037
25,-0.78037
26,-0.78037
27,-0.78037
28,-0.78037
29,-0.78037
30,-0.78037
31,1.7280000000000002
32,1.3935
33,1.3935
34,0.22296
35,-0.78037
36,-0.78037
37,-0.78037
38,-0.78037
39,-0.78037
40,-0.44592
41,1.7280000000000002
42,1.3935
43,1.3935
44,-0.78037
45,-0.78037
46,-0.78037
47,-0.78037
48,-0.78037
49,-0.78037
50,-0.78037
51,1.3935
52,1.5607
53,1.2263
54,0.22296
55,-0.78037
56,-0.78037
57,-0.78037
58,-0.78037
59,-0.78037
60,-0.78037
61,1.0591
62,1.5607
63,1.3935
64,0.5574100000000001
65,-0.78037
66,-0.78037
67,-0.78037
68,-0.78037
69,-0.78037
70,-0.78037
71,-0.11148
72,1.5607
73,1.3935
74,1.3935
75,-0.78037
76,-0.78037
77,-0.78037
78,-0.78037
79,-0.78037
80,-0.78037
81,-0.78037
82,1.0591
83,1.5607
84,1.3935
85,0.22296
86,-0.78037
87,-0.78037
88,-0.78037
89,-0.78037
90,-0.78037
91,-0.78037
92,0.5574100000000001
93,1.5607
94,1.3935
95,0.72463
