time,value
0,-0.69818
1,-0.69818
2,-0.69818
3,-0.69818
4,-0.69818
5,-0.69818
6,1.1778
7,1.6895
8,1.5189
9,1.5189
10,0.15456
11,-0.69818
12,-0.69818
13,-0.69818
14,-0.69818
15,-0.69818
16,-0.69818
17,-0.69818
18,-0.69818
19,0.3251
20,1.6895
21,1.6895
22,1.5189
23,1.0073
24,-0.69818
25,-0.69818
26,-0.69818
27,-0.69818
28,-0.69818
29,-0.69818
30,-0.69818
31,-0.69818
32,-0.69818
33,1.86
34,1.5189
35,1.5189
36,1.5189
37,-0.69818
38,-0.69818
39,-0.69818
40,-0.69818
41,-0.69818
42,-0.69818
43,-0.69818
44,-0.69818
45,-0.69818
46,1.3484
47,1.5189
48,1.5189
49,1.5189
50,-0.35708
51,-0.69818
52,-0.69818
53,-0.69818
54,-0.69818
55,-0.69818
56,-0.69818
57,-0.69818
58,-0.69818
59,0.8367399999999999
60,1.6895
61,1.5189
62,1.5189
63,-0.18654
64,-0.69818
65,-0.69818
66,-0.69818
67,-0.69818
68,-0.69818
69,-0.69818
70,-0.69818
71,-0.69818
72,-0.35708
73,1.6895
74,1.6895
75,1.5189
76,1.5189
77,0.49565
78,-0.69818
79,-0.69818
80,-0.69818
81,-0.69818
82,-0.69818
83,-0.69818
84,-0.69818
85,-0.69818
86,-0.69818
87,0.49565
88,1.6895
89,1.5189
90,1.5189
91,1.1778
92,-0.69818
93,-0.69818
94,-0.69818
95,-0.69818
