time,value
0,-0.21611
1,-0.21611
2,-0.21611
3,-0.21611
4,-0.21611
5,-0.21611
6,-0.21611
7,-0.21611
8,-0.21611
9,-0.21611
10,-0.21611
11,-0.21611
12,-0.21611
13,-0.21611
14,-0.21611
15,-0.21611
16,-0.21611
17,-0.21611
18,-0.21611
19,-0.21611
20,-0.21611
21,-0.21611
22,-0.21611
23,-0.21611
24,-0.21611
25,-0.21611
26,-0.21611
27,-0.21611
28,-0.21611
29,-0.21611
30,-0.21611
31,-0.21611
32,-0.21611
33,-0.21611
34,-0.21611
35,-0.21611
36,-0.21611
37,-0.21611
38,-0.21611
39,-0.21611
40,-0.21611
41,-0.21611
42,-0.21611
43,-0.21611
44,-0.21611
45,-0.21611
46,-0.21611
47,-0.21611
48,-0.21611
49,-0.21611
50,-0.21611
51,1.3925
52,1.2422
53,-0.21611
54,-0.21611
55,-0.21611
56,-0.21611
57,-0.21611
58,-0.21611
59,-0.21611
60,-0.21611
61,-0.21611
62,-0.21611
63,-0.21611
64,-0.21611
65,-0.21611
66,-0.21611
67,3.3619
68,7.4661
69,-0.21611
70,-0.21611
71,1.7683
72,4.1436
73,-0.14094
74,-0.21611
75,-0.21611
76,-0.21611
77,-0.21611
78,-0.21611
79,-0.21611
80,-0.21611
81,-0.21611
82,-0.21611
83,-0.21611
84,-0.21611
85,-0.21611
86,-0.21611
87,-0.21611
88,-0.21611
89,-0.21611
90,-0.21611
91,-0.21611
92,-0.21611
93,-0.21611
94,-0.21611
95,-0.21611
