time,value
0,-0.63455
1,-0.63455
2,-0.63455
3,-0.63455
4,-0.63455
5,-0.63455
6,1.0168
7,1.9342
8,1.7507
9,-0.084096
10,-0.63455
11,-0.63455
12,-0.63455
13,-0.63455
14,-0.63455
15,-0.63455
16,-0.63455
17,-0.63455
18,0.28286999999999995
19,1.9342
20,1.9342
21,0.28286999999999995
22,-0.63455
23,-0.63455
24,-0.63455
25,-0.63455
26,-0.63455
27,-0.63455
28,-0.63455
29,-0.63455
30,1.2003
31,1.9342
32,1.7507
33,0.28286999999999995
34,-0.63455
35,-0.63455
36,-0.63455
37,-0.63455
38,-0.63455
39,-0.63455
40,-0.63455
41,-0.63455
42,1.2003
43,1.9342
44,1.7507
45,0.28286999999999995
46,-0.63455
47,-0.63455
48,-0.63455
49,-0.63455
50,-0.63455
51,-0.63455
52,-0.63455
53,-0.63455
54,1.2003
55,1.9342
56,1.7507
57,0.64984
58,-0.63455
59,-0.63455
60,-0.63455
61,-0.63455
62,-0.63455
63,-0.63455
64,-0.63455
65,-0.63455
66,1.0168
67,1.9342
68,1.7507
69,0.64984
70,-0.63455
71,-0.63455
72,-0.63455
73,-0.63455
74,-0.63455
75,-0.63455
76,-0.63455
77,-0.63455
78,1.7507
79,1.9342
80,1.7507
81,0.099387
82,-0.63455
83,-0.63455
84,-0.63455
85,-0.63455
86,-0.63455
87,-0.63455
88,-0.63455
89,-0.63455
90,1.9342
91,1.7507
92,1.7507
93,-0.63455
94,-0.63455
95,-0.63455
