time,value
0,2.6124
1,2.7439
2,0.11500999999999999
3,-0.41076
4,-0.41076
5,-0.41076
6,-0.41076
7,-0.41076
8,-0.41076
9,-0.41076
10,-0.41076
11,-0.41076
12,-0.01643
13,-0.41076
14,-0.41076
15,-0.41076
16,-0.41076
17,-0.41076
18,-0.41076
19,-0.41076
20,-0.01643
21,-0.41076
22,-0.41076
23,-0.41076
24,-0.41076
25,-0.41076
26,-0.41076
27,-0.41076
28,-0.41076
29,-0.41076
30,-0.41076
31,-0.41076
32,-0.41076
33,-0.41076
34,-0.41076
35,-0.41076
36,-0.41076
37,-0.41076
38,-0.41076
39,-0.41076
40,-0.01643
41,-0.41076
42,-0.41076
43,-0.41076
44,-0.41076
45,-0.41076
46,-0.41076
47,-0.41076
48,-0.41076
49,-0.41076
50,-0.41076
51,-0.41076
52,-0.41076
53,-0.41076
54,-0.41076
55,-0.41076
56,-0.14787
57,-0.41076
58,-0.41076
59,-0.41076
60,-0.41076
61,-0.41076
62,-0.41076
63,-0.41076
64,-0.41076
65,-0.41076
66,-0.41076
67,-0.41076
68,-0.41076
69,-0.41076
70,-0.41076
71,-0.41076
72,-0.41076
73,-0.41076
74,-0.41076
75,-0.41076
76,-0.41076
77,-0.41076
78,-0.41076
79,-0.41076
80,-0.41076
81,-0.41076
82,-0.41076
83,-0.41076
84,0.11500999999999999
85,2.3496
86,2.7439
87,2.7439
88,2.6124
89,2.7439
90,2.6124
91,2.7439
92,2.7439
93,2.6124
94,1.9552
95,0.3779
