time,value
0,-0.11912
1,-0.11912
2,-0.11912
3,-0.11912
4,-0.11912
5,-0.11912
6,-0.11912
7,-0.11912
8,-0.11912
9,-0.11912
10,-0.11912
11,-0.11912
12,-0.11912
13,-0.11912
14,-0.11912
15,-0.11912
16,-0.11912
17,-0.11912
18,-0.11912
19,-0.11912
20,-0.11912
21,-0.11912
22,-0.11912
23,-0.11912
24,-0.11912
25,-0.11912
26,-0.11912
27,-0.11912
28,-0.11912
29,-0.11912
30,-0.11912
31,-0.11912
32,-0.11912
33,-0.11912
34,-0.11912
35,-0.11912
36,-0.11912
37,-0.11912
38,-0.11912
39,-0.11912
40,-0.11912
41,-0.11912
42,-0.11912
43,-0.11912
44,-0.11912
45,-0.11912
46,-0.11912
47,-0.11912
48,-0.11912
49,-0.11912
50,0.30234
51,1.1734
52,-0.11912
53,-0.11912
54,-0.11912
55,-0.11912
56,-0.11912
57,-0.11912
58,-0.11912
59,-0.11912
60,-0.11912
61,-0.11912
62,-0.11912
63,-0.11912
64,-0.11912
65,-0.11912
66,-0.11912
67,-0.11912
68,-0.11912
69,-0.11912
70,-0.11912
71,-0.11912
72,-0.11912
73,-0.11912
74,-0.11912
75,-0.11912
76,-0.11912
77,-0.11912
78,-0.11912
79,9.6027
80,-0.11912
81,-0.11912
82,-0.11912
83,-0.11912
84,-0.11912
85,-0.11912
86,-0.11912
87,-0.11912
88,-0.11912
89,-0.11912
90,-0.11912
91,-0.11912
92,-0.11912
93,-0.11912
94,-0.11912
95,-0.11912
