time,value
0,0.8185
1,-0.54804
2,-0.2064
3,0.30605
4,-1.0605
5,1.3309
6,-1.0605
7,1.5018
8,-1.0605
9,-0.2064
10,0.47686000000000006
11,-1.0605
12,1.3309
13,-1.0605
14,1.1601
15,-1.0605
16,-0.37722
17,0.64768
18,-1.0605
19,1.3309
20,-1.0605
21,0.64768
22,-0.37722
23,-1.0605
24,1.5018
25,-1.0605
26,0.98931
27,-0.71885
28,-0.71885
29,0.98931
30,-1.0605
31,1.3309
32,-1.0605
33,0.47686000000000006
34,-0.035587
35,-1.0605
36,1.3309
37,-1.0605
38,0.8185
39,-0.37722
40,-1.0605
41,1.1601
42,-1.0605
43,1.5018
44,-1.0605
45,-0.54804
46,0.8185
47,-1.0605
48,1.3309
49,-1.0605
50,0.47686000000000006
51,-0.2064
52,-1.0605
53,1.5018
54,-1.0605
55,1.5018
56,-1.0605
57,1.3309
58,-1.0605
59,1.1601
60,-1.0605
61,1.3309
62,-1.0605
63,1.1601
64,-1.0605
65,0.8185
66,-0.54804
67,0.13523
68,0.13523
69,-0.71885
70,0.8185
71,-1.0605
72,1.3309
73,-1.0605
74,1.3309
75,-1.0605
76,1.1601
77,-1.0605
78,1.1601
79,-1.0605
80,0.8185
81,-0.54804
82,1.1601
83,-1.0605
84,1.1601
85,-1.0605
86,1.3309
87,-1.0605
88,1.1601
89,-1.0605
90,0.8185
91,-0.71885
92,0.47686000000000006
93,-0.2064
94,-0.37722
95,0.47686000000000006
