time,value
0,-0.24336999999999998
1,-0.24336999999999998
2,-0.24336999999999998
3,-0.24336999999999998
4,-0.24336999999999998
5,-0.24336999999999998
6,-0.24336999999999998
7,-0.24336999999999998
8,-0.24336999999999998
9,-0.24336999999999998
10,-0.24336999999999998
11,-0.24336999999999998
12,-0.24336999999999998
13,-0.24336999999999998
14,-0.24336999999999998
15,-0.24336999999999998
16,-0.24336999999999998
17,-0.24336999999999998
18,-0.24336999999999998
19,-0.24336999999999998
20,-0.24336999999999998
21,-0.24336999999999998
22,-0.24336999999999998
23,-0.24336999999999998
24,-0.24336999999999998
25,-0.24336999999999998
26,-0.24336999999999998
27,-0.24336999999999998
28,-0.24336999999999998
29,-0.24336999999999998
30,-0.24336999999999998
31,-0.24336999999999998
32,-0.24336999999999998
33,-0.24336999999999998
34,-0.24336999999999998
35,-0.24336999999999998
36,-0.24336999999999998
37,-0.24336999999999998
38,-0.24336999999999998
39,-0.24336999999999998
40,-0.24336999999999998
41,-0.24336999999999998
42,-0.24336999999999998
43,-0.24336999999999998
44,-0.24336999999999998
45,-0.24336999999999998
46,-0.24336999999999998
47,4.4432
48,-0.24336999999999998
49,-0.24336999999999998
50,-0.24336999999999998
51,-0.24336999999999998
52,1.8575
53,-0.12794
54,-0.24336999999999998
55,-0.24336999999999998
56,-0.24336999999999998
57,-0.24336999999999998
58,-0.24336999999999998
59,-0.24336999999999998
60,-0.24336999999999998
61,-0.24336999999999998
62,-0.24336999999999998
63,-0.24336999999999998
64,-0.24336999999999998
65,-0.24336999999999998
66,-0.24336999999999998
67,-0.24336999999999998
68,-0.24336999999999998
69,-0.24336999999999998
70,-0.24336999999999998
71,-0.24336999999999998
72,0.72627
73,5.459
74,2.8041
75,5.2282
76,1.0264
77,-0.24336999999999998
78,-0.24336999999999998
79,-0.24336999999999998
80,-0.24336999999999998
81,-0.24336999999999998
82,-0.24336999999999998
83,-0.24336999999999998
84,-0.24336999999999998
85,-0.24336999999999998
86,-0.24336999999999998
87,-0.24336999999999998
88,-0.24336999999999998
89,-0.24336999999999998
90,-0.24336999999999998
91,-0.24336999999999998
92,-0.24336999999999998
93,-0.24336999999999998
94,-0.24336999999999998
95,-0.24336999999999998
