time,value
0,-0.25993
1,-0.25993
2,-0.25993
3,-0.25993
4,-0.25993
5,-0.25993
6,-0.25993
7,-0.25993
8,-0.25993
9,-0.25993
10,-0.25993
11,-0.25993
12,-0.25993
13,-0.25993
14,-0.25993
15,-0.25993
16,-0.25993
17,-0.25993
18,-0.25993
19,-0.25993
20,-0.25993
21,-0.25993
22,-0.25993
23,-0.25993
24,-0.25993
25,-0.25993
26,-0.25993
27,-0.25993
28,-0.25993
29,3.3048
30,-0.25993
31,-0.25993
32,-0.25993
33,1.6445
34,-0.25993
35,-0.25993
36,-0.25993
37,-0.25993
38,-0.25993
39,-0.25993
40,-0.25993
41,-0.25993
42,-0.25993
43,-0.25993
44,-0.25993
45,-0.25993
46,-0.25993
47,-0.25993
48,-0.25993
49,-0.25993
50,-0.25993
51,-0.25993
52,-0.25993
53,-0.25993
54,-0.25993
55,-0.25993
56,-0.25993
57,-0.25993
58,-0.25993
59,-0.25993
60,-0.25993
61,-0.25993
62,-0.25993
63,-0.25993
64,-0.25993
65,-0.25993
66,-0.25993
67,-0.25993
68,-0.25993
69,-0.25993
70,5.7464
71,-0.25993
72,-0.25993
73,2.0352
74,-0.064601
75,-0.11342999999999999
76,-0.16227
77,-0.25993
78,-0.25993
79,-0.25993
80,-0.25993
81,-0.25993
82,-0.25993
83,4.1838
84,-0.25993
85,1.4492
86,-0.25993
87,-0.25993
88,-0.25993
89,4.3303
90,-0.25993
91,-0.25993
92,-0.25993
93,-0.25993
94,-0.25993
95,-0.25993
