time,value
0,-0.00047208
1,0.0034641999999999997
2,0.010024
3,-0.0038867
4,0.007276100000000001
5,0.098195
6,0.24925
7,0.25856
8,0.24308000000000002
9,0.22666999999999998
10,0.22783
11,0.24755
12,0.26875
13,0.27358000000000005
14,0.27165
15,0.27844
16,0.27634000000000003
17,0.24861999999999998
18,0.22163000000000002
19,0.22028000000000003
20,0.22691
21,0.22480999999999998
22,0.23071999999999998
23,0.25133
24,0.2585
25,0.23953000000000002
26,0.22451999999999997
27,0.22905999999999999
28,0.22399999999999998
29,0.20263
30,0.20568000000000003
31,0.2391
32,0.25748000000000004
33,0.24959
34,0.2463
35,0.24903000000000003
36,0.23493000000000003
37,0.21064000000000002
38,0.19988
39,0.20826
40,0.22989
41,0.25956
42,0.28651
43,0.29817
44,0.29753
45,0.29911
46,0.30185
47,0.29275999999999996
48,0.27699
49,0.2657
50,0.24745999999999999
51,0.21586999999999998
52,0.19495
53,0.19738
54,0.20297
55,0.19995
56,0.19827
57,0.20060999999999998
58,0.2005
59,0.19935
60,0.1999
61,0.19991
62,0.2
63,0.20027
64,0.19914
65,0.19960999999999998
66,0.20165
67,0.19914
68,0.19665
69,0.20614000000000002
70,0.22179000000000001
71,0.23417
72,0.25142
73,0.27098
74,0.27038
75,0.25298000000000004
76,0.24600999999999998
77,0.24931
78,0.24816999999999997
79,0.2523
80,0.26858000000000004
81,0.27895
82,0.27425
83,0.26173
84,0.24393
85,0.22753
86,0.22451
87,0.22519
88,0.21288
89,0.19769
90,0.19671
91,0.20260999999999998
92,0.20093
93,0.19632
94,0.20128
95,0.21491999999999997
96,0.23421
97,0.26516
98,0.29614
99,0.29755
100,0.27795
101,0.27595
102,0.27898
103,0.25193000000000004
104,0.22462
105,0.23534000000000002
106,0.25218
107,0.24941
108,0.25611
109,0.27334
110,0.26626
111,0.24525999999999998
112,0.24438000000000001
113,0.25361999999999996
114,0.25038
115,0.24503000000000003
116,0.25056999999999996
117,0.2536
118,0.24214000000000002
119,0.22698000000000002
120,0.2164
121,0.19724
122,0.16565
123,0.145
124,0.1475
125,0.16017
126,0.17584
127,0.1924
128,0.20296
129,0.2166
130,0.24098000000000003
131,0.24957
132,0.23171999999999998
133,0.22635
134,0.24456
135,0.24638000000000002
136,0.22643000000000002
137,0.21929
138,0.22576
139,0.22576999999999997
140,0.22476
141,0.22546
142,0.21436
143,0.19835999999999998
144,0.19637000000000002
145,0.20224
146,0.20108
147,0.19760999999999998
148,0.20024
149,0.20290999999999998
150,0.19587000000000002
151,0.18006
152,0.16899
153,0.17525
154,0.19203
155,0.20140999999999998
156,0.20068
157,0.19941
158,0.1998
159,0.20734
160,0.23137
161,0.25137
162,0.23617
163,0.20332
164,0.19247999999999998
165,0.20199
166,0.21518
167,0.23481999999999997
168,0.24925999999999998
169,0.23938
170,0.22371
171,0.22391
172,0.22163000000000002
173,0.20452
174,0.19464
175,0.20016
176,0.20218
177,0.20014
178,0.215
179,0.24201999999999999
180,0.24956
181,0.23363
182,0.22361
183,0.22523
184,0.22157
185,0.2232
186,0.24209
187,0.24731999999999998
188,0.21785
189,0.18582
190,0.17576
191,0.17334000000000002
192,0.17687
193,0.20337
194,0.23940999999999998
195,0.25125
196,0.23686
197,0.22424000000000002
198,0.22483000000000003
199,0.22175
200,0.20535
201,0.19345
202,0.1999
203,0.20667
204,0.19438
205,0.17765999999999998
206,0.17609
207,0.17590999999999998
208,0.16095
209,0.15009
210,0.16405
211,0.18775999999999998
212,0.19942000000000001
213,0.20039
214,0.1999
215,0.19983
216,0.20019
217,0.2002
218,0.19858
219,0.20054
220,0.21295999999999998
221,0.23298000000000002
222,0.24781999999999998
223,0.24553000000000003
224,0.22373
225,0.19236
226,0.16974
227,0.17001
228,0.18804
229,0.19992000000000001
230,0.1898
231,0.17085
232,0.16852
233,0.19053
234,0.22158000000000003
235,0.24288
236,0.24974000000000002
237,0.24954
238,0.24915
239,0.24925999999999998
240,0.24891999999999997
241,0.2494
242,0.2506
243,0.24566999999999997
244,0.2292
245,0.21577
246,0.22591999999999998
247,0.24666
248,0.24523000000000003
249,0.22735999999999998
250,0.2288
251,0.24915
252,0.25595
253,0.24598000000000003
254,0.24527
255,0.25568
256,0.25072
257,0.22205999999999998
258,0.19547
259,0.19359
260,0.20954
261,0.22344
262,0.22687
263,0.22401999999999997
264,0.22291999999999998
265,0.22659
266,0.22623000000000001
267,0.21379
268,0.19884000000000002
269,0.19552
270,0.20473
271,0.2199
272,0.23615
273,0.24959
274,0.2623
275,0.28067
276,0.29681
277,0.29425999999999997
278,0.27476999999999996
279,0.2564
280,0.24779
281,0.2471
282,0.25506999999999996
283,0.27178
284,0.29031999999999997
285,0.29878000000000005
286,0.28636999999999996
287,0.26045
288,0.2484
289,0.26158000000000003
290,0.27434000000000003
291,0.26261
292,0.23933000000000001
293,0.22637
294,0.2176
295,0.19849
296,0.17912999999999998
297,0.17574
298,0.17690999999999998
299,0.17009000000000002
300,0.17518
301,0.20459000000000002
302,0.22944
303,0.22823000000000002
304,0.22091999999999998
305,0.22415
306,0.22759000000000001
307,0.2226
308,0.20886999999999997
309,0.18847
310,0.17548
311,0.18355
312,0.20314000000000002
313,0.21828000000000003
314,0.23099
315,0.24641
316,0.25447
317,0.24838000000000002
318,0.24455
319,0.25367
320,0.25375
321,0.23331
322,0.22479000000000002
323,0.24191
324,0.24779
325,0.23006999999999997
326,0.22132
327,0.22464
328,0.21424
329,0.19525
330,0.1816
331,0.16459000000000001
332,0.15087
333,0.15999000000000002
334,0.17797000000000002
335,0.17923
336,0.17185999999999998
337,0.17375
338,0.18549000000000002
339,0.20227
340,0.21825999999999998
341,0.22899
342,0.24384
343,0.26669
344,0.27331
345,0.24686999999999998
346,0.2153
347,0.21670999999999999
348,0.24720999999999999
349,0.27378
350,0.27938
351,0.27052
352,0.2565
353,0.2348
354,0.20265999999999998
355,0.16933
356,0.14645
357,0.13239
358,0.11789000000000001
359,0.10330999999999999
360,0.090284
361,0.073728
362,0.057626
363,0.0482
364,0.033072000000000004
365,0.0021998
366,-0.02333
367,-0.025286000000000003
368,-0.020576
369,-0.021899000000000002
370,-0.0161
371,0.0033457
372,0.021718
373,0.029057
374,0.029782
375,0.016954
376,-0.019962999999999998
377,-0.059458000000000004
378,-0.071134
379,-0.067608
380,-0.080923
381,-0.095478
382,-0.090362
383,-0.10106
384,-0.14711
385,-0.182
386,-0.1734
387,-0.15845
388,-0.17305
389,-0.20282999999999998
390,-0.23041999999999999
391,-0.25936
392,-0.2989
393,-0.34496
394,-0.37947
395,-0.39576999999999996
396,-0.40903
397,-0.43543000000000004
398,-0.46538
399,-0.48222
400,-0.49368
401,-0.50879
402,-0.52052
403,-0.51607
404,-0.49111000000000005
405,-0.45815
406,-0.44018999999999997
407,-0.44492
408,-0.44348000000000004
409,-0.41533000000000003
410,-0.38874000000000003
411,-0.38725
412,-0.3934
413,-0.39197
414,-0.3917
415,-0.39074000000000003
416,-0.36775
417,-0.32025
418,-0.26052
419,-0.204
420,-0.16915999999999998
421,-0.15365
422,-0.1377
423,-0.10745999999999999
424,-0.07413
425,-0.047514
426,-0.026875
427,-0.022165999999999998
428,-0.036177999999999995
429,-0.060877
430,-0.09155
431,-0.13768
432,-0.21039000000000002
433,-0.29867
434,-0.38342
435,-0.45398
436,-0.5140100000000001
437,-0.57118
438,-0.61943
439,-0.64571
440,-0.64226
441,-0.62303
442,-0.61333
443,-0.6153
444,-0.60795
445,-0.57725
446,-0.53397
447,-0.49063
448,-0.44697
449,-0.40267
450,-0.35854
451,-0.31864000000000003
452,-0.29406
453,-0.2887
454,-0.29393
455,-0.29503
456,-0.28701
457,-0.27108000000000004
458,-0.25244
459,-0.24228000000000002
460,-0.23143000000000002
461,-0.20129
462,-0.15486
463,-0.11542999999999999
464,-0.094177
465,-0.07888300000000001
466,-0.066763
467,-0.067334
468,-0.087013
469,-0.12137
470,-0.15417
471,-0.17513
472,-0.18885
473,-0.20513
474,-0.21881
475,-0.2132
476,-0.18459
477,-0.14015999999999998
478,-0.096108
479,-0.072216
480,-0.07027699999999999
481,-0.070053
482,-0.056052
483,-0.036998
484,-0.023559
485,-0.017534
486,-0.023287000000000002
487,-0.03877
488,-0.049504
489,-0.047846
490,-0.043844
491,-0.046783
492,-0.049369
493,-0.042628
494,-0.02743
495,-0.010612
496,0.0026276999999999997
497,0.015266
498,0.034214999999999995
499,0.063306
500,0.097898
501,0.12462000000000001
502,0.13198
503,0.12374
504,0.12059
505,0.13838
506,0.17034000000000002
507,0.20165999999999998
508,0.22910999999999998
509,0.25845
510,0.28562
511,0.29796
512,0.29769
513,0.29889
514,0.30103
515,0.29575999999999997
516,0.29517
517,0.31168
518,0.32318
519,0.31037
520,0.29502
521,0.29623
522,0.30023
523,0.2985
524,0.30632
525,0.33053
526,0.35984
527,0.38931
528,0.41863999999999996
529,0.44048999999999994
530,0.44583999999999996
531,0.43237
532,0.41055
533,0.39744
534,0.40343
535,0.42499
536,0.45338999999999996
537,0.48457
538,0.51348
539,0.54069
540,0.57143
541,0.5934699999999999
542,0.58992
543,0.57338
544,0.5634399999999999
545,0.5453600000000001
546,0.5113
547,0.49338999999999994
548,0.49638000000000004
549,0.48754
550,0.4715
551,0.47958
552,0.49896
553,0.49948000000000004
554,0.49249
555,0.49499
556,0.49718
557,0.49531000000000003
558,0.49504
559,0.49545
560,0.4954
561,0.49643000000000004
562,0.49538999999999994
563,0.49311000000000005
564,0.49831000000000003
565,0.49928
566,0.47753999999999996
567,0.4458
568,0.42726000000000003
569,0.41833000000000004
570,0.40299999999999997
571,0.38955
572,0.39624000000000004
573,0.42286
574,0.4534
575,0.46881000000000006
576,0.47391000000000005
577,0.49245
578,0.51812
579,0.51735
580,0.49706999999999996
581,0.5047
582,0.53957
583,0.55432
584,0.54335
585,0.53973
586,0.54894
587,0.54788
588,0.5332600000000001
589,0.51971
590,0.5068699999999999
591,0.48816000000000004
592,0.47276
593,0.47134
594,0.47117
595,0.45795
596,0.44178
597,0.42749
598,0.4144
599,0.42016000000000003
600,0.44225
601,0.44347
602,0.42408999999999997
603,0.42778
604,0.44564
605,0.43626000000000004
606,0.4209
607,0.43445
608,0.45228999999999997
609,0.44837
610,0.44311999999999996
611,0.44646
612,0.43609
613,0.41151000000000004
614,0.39709
615,0.40379
616,0.4222
617,0.43896
618,0.44848000000000005
619,0.4487
620,0.43903000000000003
621,0.42263
622,0.40573000000000004
623,0.39502
624,0.39394
625,0.4041
626,0.42012
627,0.42828999999999995
628,0.41801000000000005
629,0.38900999999999997
630,0.35778000000000004
631,0.34676999999999997
632,0.35956
633,0.37311
634,0.36324
635,0.3333
636,0.30362
637,0.29091
638,0.29936999999999997
639,0.31594
640,0.32448
641,0.32298000000000004
642,0.32716
643,0.34747
644,0.37668
645,0.40413000000000004
646,0.41934
647,0.42168
648,0.42143
649,0.43028
650,0.45206999999999997
651,0.48086
652,0.5121
653,0.54081
654,0.56735
655,0.6001
656,0.64256
657,0.6904100000000001
658,0.73364
659,0.76832
660,0.79311
661,0.79881
662,0.78361
663,0.7678699999999999
664,0.7719600000000001
665,0.7920699999999999
666,0.8283299999999999
667,0.8861399999999999
668,0.93414
669,0.93516
670,0.91555
671,0.9078200000000001
672,0.8791100000000001
673,0.81901
674,0.76445
675,0.7238899999999999
676,0.6622399999999999
677,0.57916
678,0.50945
679,0.42798
680,0.3036
681,0.14204
682,-0.046445
683,-0.27591
684,-0.57534
685,-0.8991399999999999
686,-1.2136
687,-1.5442
688,-1.8940000000000001
689,-2.2337
690,-2.5331
691,-2.8462
692,-3.1963
693,-3.5533
694,-3.9279
695,-4.3053
696,-4.6845
697,-5.0665
698,-5.4426
699,-5.7888
700,-6.1003
701,-6.452000000000001
702,-6.8585
703,-7.2672
704,-7.6446
705,-7.9637
706,-8.2075
707,-8.3722
708,-8.4913
709,-8.5803
710,-8.5936
711,-8.4948
712,-8.2838
713,-7.9892
714,-7.6562
715,-7.2878
716,-6.8827
717,-6.4595
718,-6.0341
719,-5.6138
720,-5.1852
721,-4.7641
722,-4.2992
723,-3.7011
724,-2.9737
725,-2.1711
726,-1.3719
727,-0.63421
728,-0.033374
729,0.40276999999999996
730,0.7407199999999999
731,0.99125
732,1.1254
733,1.1273
734,1.0579
735,0.98888
736,0.9111
737,0.8412200000000001
738,0.81835
739,0.85178
740,0.89056
741,0.89041
742,0.86169
743,0.79199
744,0.68714
745,0.58691
746,0.52428
747,0.48366000000000003
748,0.43313
749,0.36261
750,0.27281
751,0.16804000000000002
752,0.051546
753,-0.064367
754,-0.16935999999999998
755,-0.25933
756,-0.32995
757,-0.37517
758,-0.39242
759,-0.39365
760,-0.39136
761,-0.39155
762,-0.39255999999999996
763,-0.39164
764,-0.39193
765,-0.39111
766,-0.37859
767,-0.33425
768,-0.24891
769,-0.14354
770,-0.048076
771,0.037139
772,0.13375
773,0.23734
774,0.33021
775,0.41265
776,0.48845
777,0.5472199999999999
778,0.58757
779,0.62198
780,0.64559
781,0.64868
782,0.6388699999999999
783,0.62408
784,0.59993
785,0.56819
786,0.54848
787,0.54399
788,0.52999
789,0.49649
790,0.47128000000000003
791,0.47034
792,0.46875
793,0.45238999999999996
794,0.44197
795,0.44593999999999995
796,0.44846
797,0.44501
798,0.43288000000000004
799,0.40457
800,0.37524
801,0.36801999999999996
802,0.37246
803,0.36045
804,0.33666999999999997
805,0.32382
806,0.32327
807,0.32295
808,0.32127
809,0.32488
810,0.32544
811,0.3128
812,0.29836999999999997
813,0.29573
814,0.29938000000000003
815,0.29912
816,0.29741999999999996
817,0.29836
818,0.30662
819,0.33084
820,0.36212
821,0.38145
822,0.39479000000000003
823,0.42126
824,0.45065
825,0.45453999999999994
826,0.43578
827,0.42235
828,0.42302
829,0.42075
830,0.40574
831,0.39329000000000003
832,0.3956
833,0.39548
834,0.37064
835,0.33526
836,0.32106999999999997
837,0.32325
838,0.32006
839,0.32293
840,0.34881999999999996
841,0.38026
842,0.39487
843,0.39883
844,0.39775
845,0.38413
846,0.37096999999999997
847,0.38309
848,0.41278000000000004
849,0.42307
850,0.40714
851,0.39665
852,0.39845
853,0.3934
854,0.3932
855,0.42062
856,0.44743
857,0.43773
858,0.4122
859,0.39894
860,0.39388
861,0.39731
862,0.41263999999999995
863,0.4234
864,0.42145
865,0.42731
866,0.44556
867,0.45231000000000005
868,0.44378
869,0.44218999999999997
870,0.45192
871,0.44837
872,0.42877
873,0.42201000000000005
874,0.42568999999999996
875,0.41208999999999996
876,0.39653
877,0.41491999999999996
878,0.44991000000000003
879,0.46636000000000005
880,0.47585
881,0.49222
882,0.49928999999999996
883,0.49554
884,0.49556999999999995
885,0.49323999999999996
886,0.47706000000000004
887,0.46333
888,0.47078000000000003
889,0.48808999999999997
890,0.49683999999999995
891,0.49658
892,0.49193000000000003
893,0.47355
894,0.44138
895,0.41795
896,0.40554
897,0.38234
898,0.35141
899,0.33952
900,0.35
901,0.36453
902,0.37949
903,0.39466999999999997
904,0.39964
905,0.39705
906,0.40659
907,0.43211000000000005
908,0.44666000000000006
909,0.44161000000000006
910,0.44669
911,0.46653
912,0.46801000000000004
913,0.45026000000000005
914,0.44597
915,0.44688
916,0.43033000000000005
917,0.42243
918,0.43923
919,0.44943
920,0.4462
921,0.45687
922,0.47242
923,0.46045
924,0.43301999999999996
925,0.42163999999999996
926,0.42413
927,0.42065
928,0.40647
929,0.38997
930,0.37546
931,0.36715
932,0.37311
933,0.38908000000000004
934,0.39891
935,0.39734
936,0.40116999999999997
937,0.42131
938,0.44123999999999997
939,0.44643
940,0.44585
941,0.44485
942,0.42481
943,0.38743
944,0.37253000000000003
945,0.38904
946,0.40066999999999997
947,0.39749
948,0.3984
949,0.39554
950,0.3785
951,0.37332
952,0.39192
953,0.41143
954,0.42246000000000006
955,0.42631
956,0.41568999999999995
957,0.39988
958,0.39232
959,0.37196999999999997
960,0.32550999999999997
961,0.29145
962,0.29378000000000004
963,0.30309
964,0.29889
965,0.29619
966,0.29825999999999997
967,0.28496
968,0.25908000000000003
969,0.24861999999999998
970,0.26134
971,0.27545
972,0.27584000000000003
973,0.2725
974,0.27357
975,0.27352
976,0.27437
977,0.28651
978,0.30733
979,0.32108000000000003
980,0.3296
981,0.34903
982,0.37035999999999997
983,0.36862
984,0.35148
985,0.34598
986,0.34786
987,0.34467
988,0.35175
989,0.3693
990,0.36848000000000003
991,0.34931999999999996
992,0.3421
993,0.34943
994,0.35011
995,0.34585
996,0.34755
997,0.34257
998,0.31885
999,0.29805
1000,0.30480999999999997
1001,0.32137
1002,0.32268
1003,0.32387
1004,0.33941
1005,0.3497
1006,0.3474
1007,0.35491999999999996
1008,0.37268
1009,0.37687
1010,0.37056999999999995
1011,0.37134
1012,0.36996
1013,0.34939000000000003
1014,0.3253
1015,0.32591
1016,0.34283
1017,0.34951
1018,0.34774
1019,0.35024
1020,0.34563
1021,0.32837
1022,0.32461
1023,0.34376999999999996
1024,0.35641
1025,0.34575
1026,0.32858000000000004
1027,0.32145999999999997
1028,0.32252
1029,0.32413000000000003
1030,0.32308000000000003
1031,0.32187
1032,0.3241
1033,0.32428
1034,0.3206
1035,0.32305
1036,0.32804
1037,0.31859
1038,0.30162
1039,0.2987
1040,0.29921
1041,0.28486999999999996
1042,0.27244
1043,0.27342
1044,0.27232
1045,0.27243
1046,0.28731999999999996
1047,0.29913
1048,0.29683000000000004
1049,0.30451999999999996
1050,0.32159
1051,0.317
1052,0.29723
1053,0.29341
1054,0.30121
1055,0.30016
1056,0.29636
1057,0.29856
1058,0.29119
1059,0.26311999999999997
1060,0.23179
1061,0.21964
1062,0.22424000000000002
1063,0.22721999999999998
1064,0.22348
1065,0.2229
1066,0.22676999999999997
1067,0.22528
1068,0.22104000000000001
1069,0.22612
1070,0.22985
1071,0.21554
1072,0.20073
1073,0.2023
1074,0.19847
1075,0.18083
1076,0.17561
1077,0.17776
1078,0.16163
1079,0.15085
1080,0.1682
1081,0.17182999999999998
1082,0.1381
1083,0.11365
1084,0.12555
1085,0.13681
1086,0.11795
1087,0.08644199999999999
1088,0.069221
1089,0.075272
1090,0.093489
1091,0.10132000000000001
1092,0.087903
1093,0.064885
1094,0.05259
1095,0.053485000000000005
1096,0.050956
1097,0.037089
1098,0.020079
1099,0.0061269
1100,-0.008910799999999998
1101,-0.022658
1102,-0.025178
1103,-0.019115
1104,-0.018596
1105,-0.03637
1106,-0.071634
1107,-0.10662
1108,-0.12303
1109,-0.12119
1110,-0.1235
1111,-0.14362
1112,-0.16565
1113,-0.16783
1114,-0.15162
1115,-0.14037
1116,-0.14411
1117,-0.14853
1118,-0.14367
1119,-0.14051
1120,-0.1524
1121,-0.16785
1122,-0.17143
1123,-0.16957
1124,-0.16963
1125,-0.16856
1126,-0.16809000000000002
1127,-0.17793
1128,-0.19514
1129,-0.2092
1130,-0.22464
1131,-0.24019000000000001
1132,-0.24516
1133,-0.24369000000000002
1134,-0.25258
1135,-0.27474
1136,-0.29062
1137,-0.29225999999999996
1138,-0.29246
1139,-0.30298
1140,-0.32145
1141,-0.33626999999999996
1142,-0.3484
1143,-0.36396999999999996
1144,-0.38087
1145,-0.39253000000000005
1146,-0.39321999999999996
1147,-0.3896
1148,-0.39042
1149,-0.39359
1150,-0.39107
1151,-0.38678
1152,-0.39692
1153,-0.41303
1154,-0.41727
1155,-0.41628000000000004
1156,-0.4178
1157,-0.41233000000000003
1158,-0.39539
1159,-0.39165
1160,-0.41436999999999996
1161,-0.44538
1162,-0.47048999999999996
1163,-0.48508999999999997
1164,-0.49553
1165,-0.5120399999999999
1166,-0.5313899999999999
1167,-0.53932
1168,-0.53591
1169,-0.54798
1170,-0.58122
1171,-0.6148899999999999
1172,-0.6404
1173,-0.65691
1174,-0.66354
1175,-0.66254
1176,-0.6625800000000001
1177,-0.66259
1178,-0.6591199999999999
1179,-0.66625
1180,-0.68193
1181,-0.69513
1182,-0.71155
1183,-0.72975
1184,-0.73617
1185,-0.73342
1186,-0.74522
1187,-0.76084
1188,-0.75131
1189,-0.7333
1190,-0.7319399999999999
1191,-0.7390000000000001
1192,-0.73702
1193,-0.73925
1194,-0.76612
1195,-0.79828
1196,-0.81618
1197,-0.83025
1198,-0.85103
1199,-0.85941
1200,-0.84325
1201,-0.83245
1202,-0.83455
1203,-0.83225
1204,-0.83541
1205,-0.8511200000000001
1206,-0.8597899999999999
1207,-0.85644
1208,-0.87354
1209,-0.90759
1210,-0.9174700000000001
1211,-0.90466
1212,-0.88975
1213,-0.87526
1214,-0.86105
1215,-0.85587
1216,-0.8602299999999999
1217,-0.86011
1218,-0.85851
1219,-0.8594299999999999
1220,-0.8589399999999999
1221,-0.8598100000000001
1222,-0.8596600000000001
1223,-0.8583799999999999
1224,-0.85861
1225,-0.86167
1226,-0.8594700000000001
1227,-0.8443700000000001
1228,-0.82989
1229,-0.8161
1230,-0.7965899999999999
1231,-0.7859999999999999
1232,-0.7954399999999999
1233,-0.8155100000000001
1234,-0.83015
1235,-0.8391299999999999
1236,-0.83641
1237,-0.8186
1238,-0.8096800000000001
1239,-0.8115100000000001
1240,-0.80375
1241,-0.78791
1242,-0.77642
1243,-0.75651
1244,-0.71227
1245,-0.66892
1246,-0.64307
1247,-0.61646
1248,-0.58673
1249,-0.5775399999999999
1250,-0.5976
1251,-0.6130899999999999
1252,-0.60838
1253,-0.6136
1254,-0.63285
1255,-0.63479
1256,-0.61707
1257,-0.6127
1258,-0.6140899999999999
1259,-0.58877
1260,-0.55728
1261,-0.5433100000000001
1262,-0.53077
1263,-0.51558
1264,-0.52132
1265,-0.54199
1266,-0.53385
1267,-0.49055
1268,-0.44722
1269,-0.41884
1270,-0.38704
1271,-0.341
1272,-0.30468
1273,-0.29313
1274,-0.29278000000000004
1275,-0.29295
1276,-0.29241999999999996
1277,-0.29244000000000003
1278,-0.29225
1279,-0.29413
1280,-0.29320999999999997
1281,-0.27955
1282,-0.26482
1283,-0.26449
1284,-0.2727
1285,-0.26959
1286,-0.25251999999999997
1287,-0.24261999999999997
1288,-0.24383000000000002
1289,-0.23919
1290,-0.22219
1291,-0.20462
1292,-0.19254000000000002
1293,-0.17782
1294,-0.16443
1295,-0.16649
1296,-0.18312
1297,-0.19455
1298,-0.1844
1299,-0.15838
1300,-0.12861
1301,-0.10487
1302,-0.095823
1303,-0.096097
1304,-0.094738
1305,-0.09399
1306,-0.099412
1307,-0.096649
1308,-0.07824199999999999
1309,-0.072185
1310,-0.089581
1311,-0.093057
1312,-0.05391
1313,0.0013472000000000002
1314,0.030026999999999998
1315,0.030267000000000002
1316,0.026373
1317,0.027277
1318,0.026957
1319,0.028056
1320,0.040791
1321,0.060551
1322,0.07478
1323,0.078659
1324,0.076717
1325,0.084976
1326,0.11334000000000001
1327,0.1446
1328,0.15483
1329,0.15075
1330,0.15048
1331,0.15032
1332,0.14929
1333,0.15431
1334,0.15209
1335,0.12707000000000002
1336,0.09576
1337,0.08053300000000001
1338,0.071392
1339,0.054789
1340,0.045274
1341,0.053894000000000004
1342,0.059065999999999994
1343,0.042604
1344,0.027438999999999998
1345,0.036458
1346,0.05304
1347,0.064374
1348,0.088306
1349,0.12046
1350,0.12492
1351,0.1012
1352,0.091112
1353,0.1084
1354,0.12454000000000001
1355,0.12513
1356,0.12571
1357,0.12976
1358,0.12365
1359,0.11978
1360,0.14134000000000002
1361,0.17226
1362,0.18837
1363,0.20355
1364,0.22341
1365,0.21595999999999999
1366,0.18133
1367,0.16529000000000002
1368,0.17685
1369,0.18108
1370,0.17082999999999998
1371,0.17159000000000002
1372,0.18892
1373,0.19999
1374,0.1889
1375,0.16949
1376,0.16953
1377,0.18941
1378,0.19995
1379,0.19619
1380,0.20428
1381,0.22216
1382,0.21969
1383,0.20134000000000002
1384,0.19582
1385,0.20083
1386,0.2007
1387,0.20012
1388,0.2004
1389,0.19660999999999998
1390,0.20178
1391,0.21936
1392,0.22286
1393,0.20452
1394,0.19239
1395,0.20107
1396,0.21719000000000002
1397,0.22733000000000003
1398,0.22659
1399,0.22015
1400,0.22466999999999998
1401,0.24226
1402,0.24849000000000002
1403,0.23203000000000001
1404,0.21739
1405,0.22375
1406,0.23275
1407,0.21865
1408,0.18717
1409,0.16709000000000002
1410,0.17310999999999999
1411,0.19021
1412,0.20154
1413,0.21389
1414,0.23593000000000003
1415,0.24952
1416,0.23913
1417,0.22349000000000002
1418,0.22208000000000003
1419,0.22546999999999998
1420,0.22461
1421,0.22588000000000003
1422,0.22429000000000002
1423,0.20974
1424,0.19792
1425,0.21279
1426,0.25328
1427,0.29741999999999996
1428,0.3226
1429,0.32024
1430,0.30448000000000003
1431,0.2911
1432,0.27581999999999995
1433,0.25603000000000004
1434,0.24999000000000002
1435,0.26521999999999996
1436,0.27933
1437,0.27549
1438,0.26897
1439,0.27525
1440,0.27936
1441,0.2662
1442,0.25119
1443,0.24378000000000002
1444,0.22219
1445,0.18658
1446,0.17589000000000002
1447,0.19459
1448,0.20407
1449,0.19994
1450,0.20965
1451,0.23119
1452,0.24588000000000002
1453,0.2528
1454,0.24994
1455,0.2345
1456,0.2231
1457,0.22391999999999998
1458,0.22373
1459,0.22371
1460,0.23631999999999997
1461,0.25099
1462,0.25189
1463,0.24756
1464,0.24869000000000002
1465,0.25028
1466,0.24911
1467,0.2489
1468,0.24925
1469,0.24904
1470,0.2503
1471,0.24903000000000003
1472,0.23717
1473,0.21761999999999998
1474,0.20254
1475,0.19824
1476,0.19989
1477,0.20058
1478,0.19967000000000001
1479,0.19969
1480,0.19985
1481,0.1997
1482,0.20778000000000002
1483,0.22985
1484,0.24849000000000002
1485,0.24358000000000002
1486,0.22665
1487,0.22125999999999998
1488,0.22505
1489,0.22528
1490,0.22455999999999998
1491,0.22494
1492,0.22249000000000002
1493,0.22524
1494,0.23997
1495,0.25251
1496,0.25108
1497,0.24652
1498,0.24925999999999998
1499,0.25221
1500,0.24616999999999997
1501,0.23124
1502,0.21361
1503,0.20051
1504,0.1964
1505,0.20215999999999998
1506,0.21633000000000002
1507,0.23485999999999999
1508,0.24825
1509,0.25111
1510,0.2488
1511,0.24781999999999998
1512,0.25274
1513,0.26929000000000003
1514,0.29073000000000004
1515,0.29849000000000003
1516,0.29549000000000003
1517,0.30424
1518,0.32066
1519,0.32379
1520,0.32342
1521,0.33786
1522,0.34939000000000003
1523,0.33366999999999997
1524,0.30141999999999997
1525,0.27458
1526,0.25708000000000003
1527,0.24741999999999997
1528,0.2473
1529,0.25148000000000004
1530,0.24977
1531,0.24529
1532,0.25175
1533,0.26773
1534,0.27687
1535,0.27459
1536,0.27218000000000003
1537,0.27416999999999997
1538,0.27455999999999997
1539,0.27335
1540,0.27374
1541,0.27347
1542,0.27415
1543,0.28514
1544,0.30746999999999997
1545,0.32283
1546,0.31603000000000003
1547,0.29852
1548,0.29313
1549,0.30141
1550,0.3026
1551,0.28823000000000004
1552,0.27438
1553,0.27239
1554,0.27399
1555,0.27346
1556,0.27494
1557,0.27444
1558,0.27011999999999997
1559,0.27605999999999997
1560,0.29257
1561,0.30035
1562,0.2986
1563,0.30023
1564,0.29755
1565,0.28201
1566,0.27133
1567,0.27364
1568,0.26808000000000004
1569,0.24855
1570,0.2405
1571,0.25634
1572,0.27235
1573,0.27263000000000004
1574,0.27368000000000003
1575,0.28015999999999996
1576,0.26739
1577,0.23510999999999999
1578,0.21802
1579,0.22376999999999997
1580,0.22726
1581,0.22399999999999998
1582,0.22424000000000002
1583,0.22391
1584,0.22371
1585,0.23426
1586,0.2516
1587,0.26664
1588,0.27871
1589,0.27778
1590,0.25347
1591,0.22280999999999998
1592,0.20613
1593,0.1954
1594,0.17972
1595,0.17033
1596,0.17531
1597,0.17937
1598,0.17282999999999998
1599,0.17187
1600,0.18188
1601,0.17676
1602,0.1464
1603,0.12277
1604,0.12414000000000001
1605,0.12320999999999999
1606,0.10418
1607,0.09233200000000001
1608,0.10467
1609,0.12212
1610,0.12668
1611,0.1258
1612,0.12808
1613,0.12513
1614,0.11066
1615,0.09730599999999999
1616,0.099047
1617,0.10640999999999999
1618,0.10089
1619,0.084797
1620,0.074793
1621,0.075759
1622,0.07772899999999999
1623,0.076734
1624,0.077395
1625,0.075308
1626,0.061252999999999995
1627,0.039126
1628,0.027410000000000004
1629,0.036771
1630,0.055478999999999994
1631,0.058976
1632,0.041569999999999996
1633,0.027833
1634,0.030054
1635,0.025726
1636,0.0087376
1637,0.0018084
1638,0.0033139000000000003
