time,value
0,-0.6894100000000001
1,1.4006
2,1.7489
3,0.18142
4,-0.6894100000000001
5,-0.6894100000000001
6,-0.6894100000000001
7,-0.6894100000000001
8,-0.34107
9,1.9231
10,1.7489
11,0.18142
12,-0.6894100000000001
13,-0.6894100000000001
14,-0.6894100000000001
15,-0.6894100000000001
16,-0.6894100000000001
17,1.4006
18,1.7489
19,0.52975
20,-0.6894100000000001
21,-0.6894100000000001
22,-0.6894100000000001
23,-0.6894100000000001
24,-0.6894100000000001
25,1.4006
26,1.7489
27,0.35559
28,-0.6894100000000001
29,-0.6894100000000001
30,-0.6894100000000001
31,-0.6894100000000001
32,-0.6894100000000001
33,0.52975
34,1.7489
35,1.4006
36,-0.6894100000000001
37,-0.6894100000000001
38,-0.6894100000000001
39,-0.6894100000000001
40,-0.6894100000000001
41,-0.6894100000000001
42,1.2264
43,1.7489
44,0.70392
45,-0.6894100000000001
46,-0.6894100000000001
47,-0.6894100000000001
48,-0.6894100000000001
49,-0.6894100000000001
50,-0.6894100000000001
51,1.5747
52,1.7489
53,0.0072569
54,-0.6894100000000001
55,-0.6894100000000001
56,-0.6894100000000001
57,-0.6894100000000001
58,-0.6894100000000001
59,-0.6894100000000001
60,1.9231
61,1.5747
62,-0.16691
63,-0.6894100000000001
64,-0.6894100000000001
65,-0.6894100000000001
66,1.9231
67,1.7489
68,0.0072569
69,-0.6894100000000001
70,-0.6894100000000001
71,-0.6894100000000001
72,-0.6894100000000001
73,-0.6894100000000001
74,1.7489
75,1.7489
76,-0.6894100000000001
77,-0.6894100000000001
78,-0.6894100000000001
79,-0.6894100000000001
80,-0.6894100000000001
81,-0.6894100000000001
82,1.2264
83,1.7489
84,0.18142
85,-0.6894100000000001
86,-0.6894100000000001
87,-0.6894100000000001
88,-0.6894100000000001
89,-0.6894100000000001
90,0.18142
91,1.9231
92,0.8780899999999999
93,-0.6894100000000001
94,-0.6894100000000001
95,-0.6894100000000001
