time,value
0,1.2614
1,1.235
2,1.1862
3,1.1433
4,1.0595
5,1.0003
6,0.9220200000000001
7,0.84964
8,0.74731
9,0.67748
10,0.61895
11,0.5506300000000001
12,0.47495
13,0.41962
14,0.33335
15,0.24413
16,0.15698
17,0.048056
18,-0.10572999999999999
19,-0.25642
20,-0.40979
21,-0.5546300000000001
22,-0.68393
23,-0.77045
24,-0.8644200000000001
25,-0.8851700000000001
26,-0.9641
27,-0.96631
28,-0.92258
29,-0.91025
30,-0.80513
31,-0.6886399999999999
32,-0.5826
33,-0.47052
34,-0.36501
35,-0.25901
36,-0.15548
37,-0.052079999999999994
38,0.044745
39,0.080111
40,0.042598000000000004
41,-0.022591999999999998
42,-0.08830299999999999
43,-0.15642
44,-0.24795
45,-0.32135
46,-0.38611999999999996
47,-0.47136999999999996
48,-0.54251
49,-0.62957
50,-0.72
51,-0.7924899999999999
52,-0.8623700000000001
53,-0.9416399999999999
54,-1.0193
55,-1.1043
56,-1.1745
57,-1.2615
58,-1.3515
59,-1.4081
60,-1.4565
61,-1.5505
62,-1.5949
63,-1.6175
64,-1.5375
65,-1.4958
66,-1.5562
67,-1.514
68,-1.4509999999999998
69,-1.4546
70,-1.3327
71,-1.2113
72,-1.1081
73,-0.9923
74,-0.8720600000000001
75,-0.75617
76,-0.63261
77,-0.50868
78,-0.38436
79,-0.25968
80,-0.13555
81,-0.058436
82,0.039422000000000006
83,0.12991
84,0.25153000000000003
85,0.2708
86,0.35731999999999997
87,0.48241999999999996
88,0.60819
89,0.7331
90,0.85962
91,0.9958299999999999
92,1.1449
93,1.2697
94,1.3942
95,1.5151
96,1.6396
97,1.7988
98,1.9217
99,2.0823
100,2.2042
101,2.3005
102,2.3934
103,2.4695
104,2.4904
105,2.5097
106,2.4699
107,2.359
108,2.251
109,2.1601
110,2.1427
111,2.0568
112,2.0472
113,1.9701
114,1.8732
115,1.7671
116,1.6592
117,1.5527
118,1.4032
119,1.2951
120,1.1801
121,1.0301
122,0.89866
123,0.77015
124,0.63955
125,0.5185
126,0.39169
127,0.26633
128,0.13499
129,0.012962000000000001
130,0.0067061
131,-0.08909500000000001
132,-0.21391
133,-0.36202
134,-0.49858
135,-0.58519
136,-0.65536
137,-0.727
138,-0.88277
139,-0.93029
140,-0.88245
141,-0.84349
142,-0.78796
143,-0.74902
144,-0.73072
145,-0.66951
146,-0.64175
147,-0.60627
148,-0.55465
149,-0.4604
150,-0.38916
151,-0.33705999999999997
152,-0.25579
153,-0.22096999999999997
154,-0.2212
155,-0.29295
156,-0.31121
157,-0.36541
158,-0.40963999999999995
159,-0.46443
160,-0.57796
161,-0.67957
162,-0.6882699999999999
163,-0.74354
164,-0.79743
165,-0.82239
166,-0.93255
167,-0.8674799999999999
168,-0.83415
169,-0.83262
170,-0.7854300000000001
171,-0.74155
172,-0.6985600000000001
173,-0.72313
174,-0.62205
175,-0.6189100000000001
176,-0.5354399999999999
177,-0.46116999999999997
178,-0.34057
179,-0.28841
180,-0.2448
181,-0.15108
182,-0.15783
183,-0.073176
184,-0.050716000000000004
185,-0.0063463
186,0.045939999999999995
187,0.080718
188,0.086437
189,0.064291
190,0.06514199999999999
191,0.12297000000000001
192,0.12727
193,0.13856
194,0.21141999999999997
195,0.20479
196,0.25465
197,0.27944
198,0.29415
199,0.32516999999999996
200,0.38526
201,0.47866000000000003
202,0.45555
203,0.52315
204,0.5998899999999999
205,0.64928
206,0.72217
207,0.76982
208,0.84721
209,0.90297
210,0.9501
211,0.9975299999999999
212,1.0859
213,1.1398
214,1.1196
215,1.0076
216,0.85362
217,0.73406
218,0.5839
219,0.45933999999999997
220,0.34805
221,0.23528000000000002
222,0.085451
223,-0.064161
224,-0.17786
225,-0.27991
226,-0.34824
227,-0.46458
228,-0.54905
229,-0.67198
230,-0.81328
231,-0.95421
232,-1.079
233,-1.2076
234,-1.3184
235,-1.4124
236,-1.4494
237,-1.5789
238,-1.709
239,-1.8365
240,-1.9432
241,-2.0651
242,-2.1496
243,-2.2569
244,-2.1793
245,-2.198
246,-2.1328
247,-2.0604
248,-1.9843
249,-1.8819
250,-1.7659
251,-1.6573
252,-1.5384
253,-1.5688
254,-1.5179
255,-1.4739
256,-1.3978
257,-1.3067
258,-1.1829
259,-1.0857
260,-0.98183
261,-0.85357
262,-0.7350899999999999
263,-0.62402
264,-0.5201899999999999
265,-0.42787
266,-0.34692
267,-0.32737
268,-0.27604
269,-0.38834
270,-0.29268
271,-0.19066
272,-0.31283
273,-0.28405
274,-0.25611999999999996
275,-0.25492
276,-0.26661999999999997
277,-0.24547
278,-0.19361
279,-0.24140999999999999
280,-0.16677999999999998
281,-0.2327
282,-0.15261
283,-0.042324
284,0.040533
285,0.13165
286,0.085383
287,0.19617
288,0.30077
289,0.26597
290,0.36745
291,0.5148699999999999
292,0.62222
293,0.72214
294,0.75415
295,0.83185
296,0.87835
297,0.98061
298,1.1302
299,1.2453
300,1.3497
301,1.4085
302,1.5046
303,1.5877
304,1.7037
305,1.807
306,1.7862
307,1.7223
308,1.6438
309,1.5863
310,1.5046
311,1.4288
312,1.379
313,1.2995
314,1.2058
315,1.1103
316,1.044
317,1.0317
318,0.98429
319,0.91658
320,0.8282799999999999
321,0.72864
322,0.6406
323,0.55637
324,0.44782
325,0.36471
326,0.30669
327,0.27908
328,0.26188
329,0.30351
330,0.31931
331,0.27576
332,0.20619
333,0.15116
334,0.08785
335,-0.01431
336,-0.06698899999999999
337,-0.14961
338,-0.29069
339,-0.32486
340,-0.3932
341,-0.47028000000000003
342,-0.53843
343,-0.59306
344,-0.6986100000000001
345,-0.79327
346,-0.79043
347,-0.87611
348,-1.0132
349,-1.1412
350,-1.2674
351,-1.3958
352,-1.5268
353,-1.6023
354,-1.6421
355,-1.7458
356,-1.6775
357,-1.5834
358,-1.4727
359,-1.3474
360,-1.3403
361,-1.2224
362,-1.1222
363,-1.1723
364,-1.248
365,-1.1394
366,-1.0541
367,-0.9628399999999999
368,-0.83705
369,-0.75536
370,-0.67587
371,-0.55633
372,-0.44715
373,-0.33179000000000003
374,-0.23573000000000002
375,-0.10730999999999999
376,-0.038963
377,0.06121
378,0.09665499999999999
379,0.14238
380,0.19007000000000002
381,0.24974000000000002
382,0.36861
383,0.48551000000000005
384,0.56019
385,0.65681
386,0.75889
387,0.8871899999999999
388,0.86634
389,0.8593200000000001
390,0.87241
391,0.8277100000000001
392,0.7712600000000001
393,0.84547
394,0.8692200000000001
395,0.8481799999999999
396,0.79819
397,0.77258
398,0.79642
399,0.7641899999999999
400,0.73912
401,0.74438
402,0.72012
403,0.73597
404,0.7105
405,0.65423
406,0.65749
407,0.68582
408,0.67783
409,0.6331600000000001
410,0.66873
411,0.72025
412,0.68479
413,0.6837300000000001
414,0.73698
415,0.7036899999999999
416,0.71385
417,0.7092
418,0.7437
419,0.75495
420,0.80738
421,0.87702
422,0.96615
423,1.0497
424,1.1318
425,1.2027
426,1.263
