time,value
0,-0.12455
1,-0.12455
2,-0.12455
3,-0.12455
4,-0.12455
5,-0.12455
6,-0.12455
7,-0.12455
8,-0.12455
9,-0.12455
10,-0.12455
11,-0.12455
12,-0.12455
13,-0.12455
14,-0.12455
15,-0.12455
16,-0.12455
17,-0.12455
18,-0.12455
19,-0.12455
20,-0.12455
21,-0.12455
22,-0.12455
23,-0.12455
24,-0.12455
25,-0.12455
26,-0.12455
27,-0.12455
28,-0.12455
29,-0.12455
30,-0.12455
31,-0.12455
32,-0.12455
33,-0.12455
34,-0.12455
35,-0.12455
36,-0.12455
37,-0.12455
38,-0.12455
39,-0.12455
40,-0.12455
41,-0.12455
42,-0.12455
43,-0.12455
44,-0.12455
45,-0.12455
46,-0.12455
47,-0.12455
48,-0.12455
49,-0.12455
50,-0.12455
51,-0.12455
52,-0.12455
53,-0.12455
54,-0.12455
55,-0.12455
56,-0.12455
57,-0.12455
58,-0.12455
59,-0.12455
60,-0.12455
61,-0.12455
62,-0.12455
63,-0.12455
64,-0.12455
65,-0.12455
66,-0.12455
67,-0.12455
68,-0.12455
69,-0.12455
70,-0.12455
71,-0.12455
72,-0.12455
73,-0.12455
74,-0.12455
75,-0.12455
76,-0.12455
77,-0.12455
78,-0.12455
79,-0.12455
80,-0.12455
81,9.3897
82,2.3183
83,-0.12455
84,-0.12455
85,-0.12455
86,-0.12455
87,-0.12455
88,-0.12455
89,-0.12455
90,-0.12455
91,-0.12455
92,-0.12455
93,-0.12455
94,-0.12455
95,-0.12455
