time,value
0,-0.24738000000000002
1,-0.24697
2,-0.24723
3,-0.24744000000000002
4,-0.24683000000000002
5,-0.24725999999999998
6,-0.24773
7,-0.24625999999999998
8,-0.24739
9,-0.25196
10,-0.25318
11,-0.25342
12,-0.25778
13,-0.25865
14,-0.25231
15,-0.24750999999999998
16,-0.24733000000000002
17,-0.24706999999999998
18,-0.24670999999999998
19,-0.24939
20,-0.25424
21,-0.25838
22,-0.26022
23,-0.25828
24,-0.25394
25,-0.2525
26,-0.25342
27,-0.25331
28,-0.25311999999999996
29,-0.25359
30,-0.25833
31,-0.26236
32,-0.25627
33,-0.2583
34,-0.26565
35,-0.25101
36,-0.25226
37,-0.2705
38,-0.21431999999999998
39,-0.20534000000000002
40,-0.20942
41,-0.19277
42,-0.19982
43,-0.20238
44,-0.19635999999999998
45,-0.19992000000000001
46,-0.20469
47,-0.20569
48,-0.20504
49,-0.2008
50,-0.19804000000000002
51,-0.19972
52,-0.19992000000000001
53,-0.19804000000000002
54,-0.20026
55,-0.20477
56,-0.20506999999999997
57,-0.20606
58,-0.2107
59,-0.20992
60,-0.2031
61,-0.19941
62,-0.19952999999999999
63,-0.19892
64,-0.19906
65,-0.20265999999999998
66,-0.20636
67,-0.20559000000000002
68,-0.20135999999999998
69,-0.19838
70,-0.19927
71,-0.2002
72,-0.19809000000000002
73,-0.19938
74,-0.20461
75,-0.20365999999999998
76,-0.1992
77,-0.19924
78,-0.19772
79,-0.19297999999999998
80,-0.19251
81,-0.19403
82,-0.19314
83,-0.19296
84,-0.19376
85,-0.19313
86,-0.19297
87,-0.1941
88,-0.19255999999999998
89,-0.18817
90,-0.18642999999999998
91,-0.18765
92,-0.18755
93,-0.18665
94,-0.18817
95,-0.1926
96,-0.19515
97,-0.19136
98,-0.18744
99,-0.18797
100,-0.18564
101,-0.18143
102,-0.18425
103,-0.1887
104,-0.18742999999999999
105,-0.18638
106,-0.18825
107,-0.18731
108,-0.18295
109,-0.18045999999999998
110,-0.18145
111,-0.18188
112,-0.18043
113,-0.18170999999999998
114,-0.18607
115,-0.18804
116,-0.1872
117,-0.18711
118,-0.18755
119,-0.18725
120,-0.18721
121,-0.18748
122,-0.18724000000000002
123,-0.18723
124,-0.18753
125,-0.18716
126,-0.18717
127,-0.18796
128,-0.18634
129,-0.18193
130,-0.18016
131,-0.18207
132,-0.18162
133,-0.17985
134,-0.18348
135,-0.18736
136,-0.18395
137,-0.18023
138,-0.18134
139,-0.18182
140,-0.18095
141,-0.18137999999999999
142,-0.18152000000000001
143,-0.18114
144,-0.18137999999999999
145,-0.18139
146,-0.18137
147,-0.18124
148,-0.17767
149,-0.17127
150,-0.16964
151,-0.17402
152,-0.17637
153,-0.17507
154,-0.17506
155,-0.17575
156,-0.17515999999999998
157,-0.17515999999999998
158,-0.1759
159,-0.17459000000000002
160,-0.17021
161,-0.16755
162,-0.17102
163,-0.17514000000000002
164,-0.17524
165,-0.17579
166,-0.17567
167,-0.17106
168,-0.16985
169,-0.17509
170,-0.17682
171,-0.17406
172,-0.17532999999999999
173,-0.17993
174,-0.18174
175,-0.18136
176,-0.18156
177,-0.18001
178,-0.17492
179,-0.17021
180,-0.16904
181,-0.1694
182,-0.16935999999999998
183,-0.1694
184,-0.16933
185,-0.16925
186,-0.1696
187,-0.16921
188,-0.16907
189,-0.1702
190,-0.16846
191,-0.16404000000000002
192,-0.16277
193,-0.16345
194,-0.16323
195,-0.16595
196,-0.17071
197,-0.16999
198,-0.16495
199,-0.16326
200,-0.16347
201,-0.1625
202,-0.16509000000000001
203,-0.16927999999999999
204,-0.16949
205,-0.16973
206,-0.1694
207,-0.16492
208,-0.16314
209,-0.16332
210,-0.15913
211,-0.1566
212,-0.15744
213,-0.15723
214,-0.15807000000000002
215,-0.15694
216,-0.15228
217,-0.15149
218,-0.15089
219,-0.14614000000000002
220,-0.14693
221,-0.15229
222,-0.15211
223,-0.15031
224,-0.15194000000000002
225,-0.15198
226,-0.14819000000000002
227,-0.14465999999999998
228,-0.14506
229,-0.14645999999999998
230,-0.14448
231,-0.14487
232,-0.15023
233,-0.15037999999999999
234,-0.14567
235,-0.14525
236,-0.14437
237,-0.13959000000000002
238,-0.13844
239,-0.14007
240,-0.13943
241,-0.13905
242,-0.13976
243,-0.1394
244,-0.13915
245,-0.13987
246,-0.13924
247,-0.13544
248,-0.13033
249,-0.12721
250,-0.1271
251,-0.12791
252,-0.12725
253,-0.12705
254,-0.12843
255,-0.12659
256,-0.12214000000000001
257,-0.12109
258,-0.12137
259,-0.12112
260,-0.12447000000000001
261,-0.12819
262,-0.1277
263,-0.12697999999999998
264,-0.12774000000000002
265,-0.12761
266,-0.12489000000000001
267,-0.11882999999999999
268,-0.11540999999999998
269,-0.11905
270,-0.12232
271,-0.1215
272,-0.12122000000000001
273,-0.12152
274,-0.12147000000000001
275,-0.12194
276,-0.11977
277,-0.11527000000000001
278,-0.11454
279,-0.11652
280,-0.11520999999999999
281,-0.11425999999999999
282,-0.11880999999999999
283,-0.12134
284,-0.11704
285,-0.11423
286,-0.11582
287,-0.11588
288,-0.11487
289,-0.11575999999999999
290,-0.1158
291,-0.11475
292,-0.11602
293,-0.11610999999999999
294,-0.11174
295,-0.10928
296,-0.1097
297,-0.10639000000000001
298,-0.10264000000000001
299,-0.10334000000000002
300,-0.10397
301,-0.1034
302,-0.10355
303,-0.10102
304,-0.093955
305,-0.08569600000000001
306,-0.08067
307,-0.078688
308,-0.07337
309,-0.064623
310,-0.059588
311,-0.055096000000000006
312,-0.043686
313,-0.029776999999999998
314,-0.018456
315,-0.0066431
316,0.0063792
317,0.017998
318,0.029830000000000002
319,0.043167000000000004
320,0.054013
321,0.061841999999999994
322,0.07013899999999999
323,0.07789299999999999
324,0.085792
325,0.095446
326,0.10103999999999999
327,0.10461
328,0.11533
329,0.12737
330,0.13482
331,0.14542
332,0.15828
333,0.16549
334,0.17163
335,0.18314
336,0.19539
337,0.20376
338,0.21135
339,0.21986999999999998
340,0.22769
341,0.2359
342,0.24418
343,0.25175
344,0.26055
345,0.26838
346,0.27559
347,0.2858
348,0.29216
349,0.29493
350,0.30416
351,0.30969
352,0.3046
353,0.30507
354,0.31034
355,0.30975
356,0.31156999999999996
357,0.31647
358,0.31606999999999996
359,0.31503000000000003
360,0.31561999999999996
361,0.31547
362,0.31822
363,0.32304
364,0.3271
365,0.33153
366,0.33387
367,0.33374000000000004
368,0.33402
369,0.33215
370,0.32799999999999996
371,0.32427
372,0.31792
373,0.30992
374,0.3051
375,0.30153
376,0.29773
377,0.29402
378,0.28724
379,0.27925
380,0.27178
381,0.25888
382,0.24179
383,0.22891999999999998
384,0.22048
385,0.21245
386,0.20431
387,0.19601
388,0.18843
389,0.18441
390,0.18194000000000002
391,0.17607
392,0.17187
393,0.17345
394,0.16927
395,0.15622
396,0.1464
397,0.13876
398,0.12597
399,0.1126
400,0.10209
401,0.094613
402,0.09060399999999999
403,0.08491900000000001
404,0.076537
405,0.071378
406,0.068601
407,0.064248
408,0.059579999999999994
409,0.057127
410,0.058374
411,0.062502
412,0.065046
413,0.06405599999999999
414,0.063546
415,0.06514199999999999
416,0.063601
417,0.055784
418,0.044588
419,0.031872000000000004
420,0.019362
421,0.010175
422,0.0024721
423,-0.0057522
424,-0.013187
425,-0.022658
426,-0.035131
427,-0.045311000000000004
428,-0.050927
429,-0.050468
430,-0.043005
431,-0.035601999999999995
432,-0.032026
433,-0.028044
434,-0.02487
435,-0.025455000000000002
436,-0.028562
437,-0.034989
438,-0.043305
439,-0.051108
440,-0.060225
441,-0.067592
442,-0.07136100000000001
443,-0.076625
444,-0.079519
445,-0.078348
446,-0.083923
447,-0.091987
448,-0.092034
449,-0.092675
450,-0.098339
451,-0.10240999999999999
452,-0.10609
453,-0.11018
454,-0.11397
455,-0.11936
456,-0.1214
457,-0.12072000000000001
458,-0.12679
459,-0.13535999999999998
460,-0.13890999999999998
461,-0.14226
462,-0.14670999999999998
463,-0.15054
464,-0.15771
465,-0.16596
466,-0.16922
467,-0.1714
468,-0.17948
469,-0.19242
470,-0.20257999999999998
471,-0.20665
472,-0.21115
473,-0.21664
474,-0.21648
475,-0.2174
476,-0.22562
477,-0.23174
478,-0.23565
479,-0.24405
480,-0.24899000000000002
481,-0.24699000000000002
482,-0.24663000000000002
483,-0.24761
484,-0.2473
485,-0.25095
486,-0.25735
487,-0.25911
488,-0.25856999999999997
489,-0.26229
490,-0.26525
491,-0.26071
492,-0.25661
493,-0.261
494,-0.26529
495,-0.262
496,-0.25851999999999997
497,-0.25906999999999997
498,-0.25922
499,-0.25932
500,-0.25941
501,-0.25573
502,-0.25214000000000003
503,-0.25311999999999996
504,-0.2539
505,-0.25237
506,-0.2532
507,-0.25727
508,-0.26004
509,-0.2592
510,-0.25849
511,-0.26003000000000004
512,-0.25899
513,-0.25448000000000004
514,-0.25249
515,-0.2533
516,-0.25325
517,-0.25318
518,-0.25315
519,-0.25293000000000004
520,-0.25389
521,-0.25253000000000003
522,-0.24806999999999998
523,-0.24656
524,-0.24729
525,-0.24716
526,-0.24755
527,-0.24678000000000003
528,-0.24678000000000003
529,-0.24909
530,-0.24455
531,-0.23593000000000003
532,-0.23484000000000002
533,-0.23423000000000002
534,-0.22958
535,-0.22901
536,-0.22816
537,-0.22349000000000002
538,-0.22266999999999998
539,-0.22261
540,-0.21738000000000002
541,-0.21251
542,-0.20976999999999998
543,-0.20517
544,-0.20340999999999998
545,-0.20876
546,-0.21116
547,-0.20667
548,-0.20495
549,-0.20521999999999999
550,-0.20464000000000002
551,-0.20719
552,-0.20401
553,-0.19475
554,-0.19396
555,-0.19179000000000002
556,-0.17867
557,-0.17132
558,-0.16762
559,-0.15077000000000002
560,-0.12828
561,-0.11067
562,-0.09449199999999999
563,-0.080343
564,-0.07046799999999999
565,-0.058045000000000006
566,-0.03646
567,-0.0090176
568,0.019362
569,0.057525
570,0.11432
571,0.17540999999999998
572,0.22355999999999998
573,0.259
574,0.27989
575,0.28486
576,0.28609
577,0.2858
578,0.28562
579,0.30728
580,0.35652
581,0.41043999999999997
582,0.45198
583,0.47289
584,0.47566
585,0.48522
586,0.52145
587,0.57733
588,0.64571
589,0.73045
590,0.81353
591,0.8669600000000001
592,0.9101100000000001
593,0.9920200000000001
594,1.1222
595,1.2608
596,1.3596
597,1.4039
598,1.4128
599,1.3936
600,1.3456
601,1.2887
602,1.2171
603,1.0889
604,0.89984
605,0.67886
606,0.41408999999999996
607,0.067637
608,-0.35151
609,-0.80013
610,-1.2389
611,-1.6248
612,-1.9545
613,-2.2681
614,-2.5616
615,-2.8134
616,-3.0511
617,-3.3026
618,-3.5857
619,-3.9292
620,-4.322
621,-4.717
622,-5.0667
623,-5.3307
624,-5.5361
625,-5.7566
626,-5.9812
627,-6.132999999999999
628,-6.1891
629,-6.1792
630,-6.1365
631,-6.0845
632,-6.0269
633,-5.9582
634,-5.8756
635,-5.7817
636,-5.6923
637,-5.6086
638,-5.5071
639,-5.3905
640,-5.2951
641,-5.2382
642,-5.2072
643,-5.1979999999999995
644,-5.2101
645,-5.2121
646,-5.1814
647,-5.1273
648,-5.0468
649,-4.9393
650,-4.8353
651,-4.7429
652,-4.6423
653,-4.5249
654,-4.3774
655,-4.1945
656,-4.0037
657,-3.8203
658,-3.638
659,-3.4648
660,-3.3023
661,-3.1327
662,-2.9592
663,-2.8007
664,-2.6489999999999996
665,-2.4933
666,-2.3513
667,-2.2256
668,-2.101
669,-1.9816
670,-1.8665
671,-1.7483
672,-1.6437
673,-1.5552
674,-1.4616
675,-1.3678
676,-1.2879
677,-1.2142
678,-1.1401
679,-1.0691
680,-1.0032
681,-0.93981
682,-0.8744200000000001
683,-0.8056399999999999
684,-0.73449
685,-0.6605300000000001
686,-0.5871
687,-0.51817
688,-0.44805
689,-0.37465
690,-0.30796
691,-0.2519
692,-0.20348
693,-0.16349
694,-0.12955
695,-0.097479
696,-0.066215
697,-0.030635000000000003
698,0.01038
699,0.046707
700,0.073911
701,0.097745
702,0.11977
703,0.13632
704,0.14748
705,0.15888
706,0.17163
707,0.17804
708,0.18016
709,0.1901
710,0.20229
711,0.20636999999999997
712,0.21128000000000002
713,0.22059
714,0.22509
715,0.22705
716,0.23275
717,0.24058000000000002
718,0.24915
719,0.257
720,0.26466
721,0.27433
722,0.2803
723,0.27976999999999996
724,0.28112
725,0.28751
726,0.29561
727,0.30443000000000003
728,0.31106
729,0.31478
730,0.32132
731,0.33023
732,0.33371999999999996
733,0.33247
734,0.33535
735,0.34463
736,0.35641999999999996
737,0.3679
738,0.37544
739,0.38153000000000004
740,0.3937
741,0.40568000000000004
742,0.40952
743,0.41457
744,0.42396999999999996
745,0.42851999999999996
746,0.43049
747,0.4361
748,0.44047
749,0.44233
750,0.44861
751,0.4573
752,0.46018000000000003
753,0.45931000000000005
754,0.45943
755,0.45711999999999997
756,0.45253000000000004
757,0.45248
758,0.45486000000000004
759,0.45198
760,0.44761999999999996
761,0.44786000000000004
762,0.44571000000000005
763,0.43696999999999997
764,0.43053
765,0.42843000000000003
766,0.42416000000000004
767,0.42123
768,0.4253
769,0.42946999999999996
770,0.42885
771,0.43041999999999997
772,0.43546
773,0.43628
774,0.4341
775,0.43568999999999997
776,0.43945
777,0.44269
778,0.44792
779,0.45578
780,0.46226000000000006
781,0.46579
782,0.46948
783,0.47252
784,0.47102
785,0.46976999999999997
786,0.47618
787,0.48433000000000004
788,0.4843
789,0.48125
790,0.48446000000000006
791,0.48886999999999997
792,0.48881
793,0.48966000000000004
794,0.48998
795,0.48496999999999996
796,0.48368
797,0.48867
798,0.48995
799,0.48882
800,0.48938000000000004
801,0.48886999999999997
802,0.48951999999999996
803,0.4897
804,0.48482
805,0.48346999999999996
806,0.48936
807,0.49086
808,0.48723
809,0.48965
810,0.49491
811,0.49276000000000003
812,0.48951999999999996
813,0.49306000000000005
814,0.49604
815,0.49535
816,0.4951
817,0.4945
818,0.49583
819,0.50027
820,0.49978
821,0.4944
822,0.49409
823,0.49687
824,0.49425
825,0.4938
826,0.50043
827,0.4997
828,0.49483
829,0.50185
830,0.50729
831,0.50203
832,0.5009399999999999
833,0.49923999999999996
834,0.49018
835,0.49004
836,0.49763999999999997
837,0.49596999999999997
838,0.48966000000000004
839,0.48957
840,0.48963999999999996
841,0.48481
842,0.48244
843,0.4836
844,0.48308999999999996
845,0.48323
846,0.48346000000000006
847,0.48249
848,0.48425
849,0.48294
850,0.47756000000000004
851,0.47818
852,0.47636000000000006
853,0.46681000000000006
854,0.46637
855,0.47196000000000005
856,0.4713
857,0.47331999999999996
858,0.47788
859,0.47741999999999996
860,0.47753999999999996
861,0.47613999999999995
862,0.47158
863,0.47363
864,0.47791000000000006
865,0.4774
866,0.47955
867,0.48491999999999996
868,0.48899
869,0.49318999999999996
870,0.49533
871,0.49541
872,0.49853000000000003
873,0.50203
874,0.50158
875,0.5032
876,0.51166
877,0.51966
878,0.5233399999999999
879,0.5263
880,0.52518
881,0.52299
882,0.53033
883,0.53764
884,0.53652
885,0.54092
886,0.55042
887,0.55392
888,0.5593199999999999
889,0.5687800000000001
890,0.5725899999999999
891,0.5747800000000001
892,0.5804699999999999
893,0.5844600000000001
894,0.5870000000000001
895,0.59306
896,0.60149
897,0.60939
898,0.61762
899,0.62605
900,0.63146
901,0.63272
902,0.63297
903,0.63823
904,0.64955
905,0.6570699999999999
906,0.65904
907,0.66784
908,0.68119
909,0.68606
910,0.68737
911,0.6934899999999999
912,0.70105
913,0.70878
914,0.7177899999999999
915,0.72556
916,0.7328
917,0.74216
918,0.75042
919,0.75485
920,0.75989
921,0.76779
922,0.77591
923,0.7845300000000001
924,0.79265
925,0.79924
926,0.80966
927,0.82225
928,0.8304299999999999
929,0.8396299999999999
930,0.8524799999999999
931,0.8617100000000001
932,0.86869
933,0.87745
934,0.88538
935,0.8931399999999999
936,0.90195
937,0.9095799999999999
938,0.9174700000000001
939,0.92645
940,0.9312
941,0.93234
942,0.9389
943,0.95063
944,0.96005
945,0.9692299999999999
946,0.98129
947,0.9890399999999999
948,0.99311
949,1.0038
950,1.0175
951,1.0226
952,1.0249
953,1.0356
954,1.048
955,1.0555
956,1.0638
957,1.0712
958,1.0746
959,1.0811
960,1.09
961,1.0978
962,1.1095
963,1.12
964,1.1234
965,1.1311
966,1.1474
967,1.1594
968,1.1629
969,1.1679
970,1.1775
971,1.1856
972,1.1921
973,1.2019
974,1.2136
975,1.2233
976,1.2325
977,1.2434
978,1.2545
979,1.2626
980,1.2696
981,1.2767
982,1.2803
983,1.2861
984,1.3003
985,1.3106
986,1.3130000000000002
987,1.3225
988,1.3354
989,1.3387
990,1.3428
991,1.3538
992,1.3577
993,1.3569
994,1.3671
995,1.38
996,1.3836
997,1.3898
998,1.3989
999,1.3988
1000,1.4007
1001,1.4107
1002,1.4155
1003,1.4181
1004,1.4236
1005,1.4261
1006,1.432
1007,1.4418
1008,1.4455
1009,1.4482
1010,1.4542
1011,1.4572
1012,1.4606
1013,1.4662
1014,1.4693
1015,1.4727
1016,1.4782
1017,1.4818
1018,1.4832
1019,1.4834
1020,1.4827
1021,1.4829
1022,1.4832
1023,1.4826
1024,1.4851
1025,1.49
1026,1.49
1027,1.4852
1028,1.4825
1029,1.483
1030,1.4835
1031,1.4818
1032,1.4780000000000002
1033,1.4757
1034,1.4774
1035,1.4779
1036,1.4737
1037,1.4680000000000002
1038,1.4605
1039,1.4506
1040,1.4443
1041,1.4421
1042,1.4376
1043,1.431
1044,1.4239
1045,1.4147
1046,1.4061
1047,1.3995
1048,1.3911
1049,1.3798
1050,1.3686
1051,1.3561
1052,1.3421
1053,1.3326
1054,1.325
1055,1.3105
1056,1.2948
1057,1.2830000000000001
1058,1.2681
1059,1.2516
1060,1.2358
1061,1.2178
1062,1.2042
1063,1.1928
1064,1.1756
1065,1.1616
1066,1.1505
1067,1.1305
1068,1.1109
1069,1.0962
1070,1.0757
1071,1.056
1072,1.0415
1073,1.0244
1074,1.0087
1075,0.9930700000000001
1076,0.9713299999999999
1077,0.95367
1078,0.9382299999999999
1079,0.9136
1080,0.88925
1081,0.8715200000000001
1082,0.85431
1083,0.8404299999999999
1084,0.8292
1085,0.81291
1086,0.79508
1087,0.78032
1088,0.76412
1089,0.74638
1090,0.7319899999999999
1091,0.71997
1092,0.70755
1093,0.6957300000000001
1094,0.68376
1095,0.6708
1096,0.65947
1097,0.64765
1098,0.6315
1099,0.6158100000000001
1100,0.6046100000000001
1101,0.59313
1102,0.57938
1103,0.56816
1104,0.56
1105,0.55004
1106,0.53806
1107,0.52574
1108,0.51249
1109,0.50163
1110,0.49363999999999997
1111,0.48257
1112,0.47123000000000004
1113,0.46636000000000005
1114,0.46192
1115,0.45268
1116,0.44405
1117,0.43551000000000006
1118,0.42148
1119,0.40795
1120,0.4026
1121,0.39836
1122,0.38974000000000003
1123,0.38383
1124,0.38044
1125,0.3722
1126,0.36245
1127,0.3558
1128,0.34773000000000004
1129,0.33797
1130,0.33213000000000004
1131,0.32846
1132,0.3234
1133,0.32122
1134,0.32182
1135,0.31890999999999997
1136,0.31281
1137,0.30463
1138,0.29507
1139,0.28975
1140,0.2861
1141,0.28053
1142,0.28002
1143,0.27991
1144,0.27157
1145,0.26482
1146,0.26166
1147,0.25344
1148,0.24609
1149,0.24366999999999997
1150,0.23965
1151,0.23471
1152,0.23151999999999998
1153,0.23094
1154,0.2333
1155,0.23063000000000003
1156,0.2217
1157,0.21841999999999998
1158,0.21984
1159,0.21561999999999998
1160,0.20928000000000002
1161,0.20776999999999998
1162,0.20795999999999998
1163,0.20739000000000002
1164,0.20809
1165,0.20820999999999998
1166,0.20481999999999997
1167,0.20009000000000002
1168,0.19630999999999998
1169,0.19476
1170,0.19676
1171,0.19637000000000002
1172,0.18832000000000002
1173,0.1819
1174,0.18392
1175,0.18564
1176,0.18023
1177,0.17201
1178,0.16990999999999998
1179,0.17398
1180,0.17167000000000002
1181,0.16543
1182,0.16918
1183,0.17164000000000001
1184,0.16269
1185,0.15878
1186,0.15967
1187,0.15129
1188,0.14461
1189,0.14927
1190,0.15372
1191,0.15356
1192,0.15422
1193,0.15442999999999998
1194,0.15122
1195,0.14672000000000002
1196,0.14279
1197,0.13869
1198,0.13468
1199,0.13075
1200,0.12614
1201,0.12329000000000001
1202,0.12392
1203,0.12475
1204,0.12269000000000001
1205,0.11846
1206,0.11384000000000001
1207,0.11105
1208,0.11210999999999999
1209,0.11322
1210,0.10959
1211,0.10615999999999999
1212,0.10637
1213,0.1041
1214,0.099997
1215,0.099781
1216,0.09890399999999999
1217,0.093475
1218,0.08879
1219,0.087529
1220,0.088423
1221,0.09235700000000001
1222,0.09626900000000001
1223,0.092711
1224,0.08406799999999999
1225,0.07875
1226,0.075059
1227,0.070699
1228,0.069979
1229,0.069512
1230,0.065009
1231,0.062802
1232,0.064807
1233,0.064594
1234,0.060826
1235,0.056523000000000004
1236,0.052629999999999996
1237,0.048641000000000004
1238,0.044181
1239,0.040418
1240,0.039464
1241,0.040744
1242,0.040326
1243,0.036257
1244,0.032927
1245,0.034361
1246,0.035496
1247,0.031287999999999996
1248,0.028299
1249,0.032108
1250,0.035601
1251,0.033957999999999995
1252,0.033352
1253,0.035619
1254,0.033333999999999996
1255,0.024908
1256,0.018019999999999998
1257,0.016121
1258,0.016156
1259,0.016328
1260,0.016133
1261,0.016103
1262,0.016606
1263,0.015874
1264,0.015921
1265,0.017509
1266,0.014519999999999998
1267,0.010311
1268,0.013297
1269,0.016916999999999998
1270,0.016276
1271,0.019015
1272,0.023693000000000002
1273,0.022479
1274,0.020547
1275,0.024606
1276,0.028295999999999998
1277,0.02777
1278,0.029744
1279,0.034433
1280,0.03809
1281,0.043082
1282,0.046303
1283,0.045613
1284,0.048501
1285,0.052435
1286,0.051957
1287,0.05411900000000001
1288,0.058849
1289,0.062347
1290,0.06966599999999999
1291,0.077362
1292,0.081026
1293,0.085664
1294,0.088197
1295,0.08768
1296,0.091435
1297,0.09424500000000001
1298,0.093675
1299,0.099741
1300,0.1085
1301,0.1118
1302,0.11517999999999999
1303,0.11905
1304,0.11832000000000001
1305,0.11696
1306,0.11942
1307,0.12393
1308,0.12800999999999998
1309,0.13171
1310,0.13614
1311,0.13756
1312,0.13298
1313,0.13016
1314,0.13401
1315,0.1369
1316,0.13599
1317,0.13576
1318,0.1358
1319,0.1363
1320,0.14025
1321,0.14364000000000002
1322,0.14123
1323,0.13672
1324,0.13547
1325,0.13606
1326,0.13585
1327,0.13779
1328,0.14362
1329,0.14774
1330,0.14775
1331,0.14826
1332,0.1484
1333,0.14449
1334,0.14124
1335,0.1419
1336,0.14226
1337,0.14173
1338,0.14205
1339,0.142
1340,0.14188
1341,0.14211
1342,0.14182
1343,0.14213
1344,0.14212
1345,0.13849
1346,0.13304000000000002
1347,0.13005
1348,0.12976
1349,0.12997999999999998
1350,0.13011
1351,0.13022999999999998
1352,0.12836
1353,0.12325
1354,0.1186
1355,0.11795
1356,0.11774000000000001
1357,0.11350999999999999
1358,0.10999
1359,0.11325999999999999
1360,0.11782000000000001
1361,0.11590999999999999
1362,0.11062999999999999
1363,0.10679000000000001
1364,0.10280999999999998
1365,0.09916900000000001
1366,0.099713
1367,0.10138
1368,0.098384
1369,0.09436599999999999
1370,0.094083
1371,0.09312999999999999
1372,0.08856499999999999
1373,0.084003
1374,0.08028300000000001
1375,0.076313
1376,0.07534099999999999
1377,0.075931
1378,0.070102
1379,0.063664
1380,0.066151
1381,0.06364199999999999
1382,0.050092000000000005
1383,0.044876
1384,0.045989999999999996
1385,0.037771
1386,0.031426
1387,0.034871
1388,0.035443999999999996
1389,0.031069
1390,0.027611
1391,0.023612
1392,0.018903
1393,0.015463999999999999
1394,0.011473
1395,0.0064308
1396,0.0039177
1397,0.004215600000000001
1398,0.0041773
1399,0.004435000000000001
1400,0.0045574
1401,0.0012794
1402,-0.0033986
1403,-0.0072333
1404,-0.0114
1405,-0.015315
1406,-0.019371
1407,-0.021475
1408,-0.016998
1409,-0.013594
1410,-0.020644
1411,-0.029416
1412,-0.031627999999999996
1413,-0.034679
1414,-0.041306
1415,-0.043559
1416,-0.042773
1417,-0.046335
1418,-0.049727999999999994
1419,-0.04929
1420,-0.051924
1421,-0.055963
1422,-0.055730999999999996
1423,-0.057145
1424,-0.062792
1425,-0.066998
1426,-0.06819
1427,-0.067247
1428,-0.067022
1429,-0.07080800000000001
1430,-0.07406900000000001
1431,-0.07358200000000001
1432,-0.075567
1433,-0.081698
1434,-0.085411
1435,-0.08521000000000001
1436,-0.08655800000000001
1437,-0.091089
1438,-0.092947
1439,-0.090314
1440,-0.091249
1441,-0.096467
1442,-0.097059
1443,-0.097444
1444,-0.10547000000000001
1445,-0.11152999999999999
1446,-0.10935
1447,-0.10513
1448,-0.10213
1449,-0.10384000000000002
1450,-0.10882
1451,-0.1088
1452,-0.11012999999999999
1453,-0.11886
1454,-0.12305999999999999
1455,-0.12120999999999998
1456,-0.12132000000000001
1457,-0.12125
1458,-0.12179000000000001
1459,-0.12232
1460,-0.11749000000000001
1461,-0.11599999999999999
1462,-0.1208
1463,-0.12138
1464,-0.12247000000000001
1465,-0.12717
1466,-0.12495
1467,-0.12054000000000001
1468,-0.1213
1469,-0.12133
1470,-0.12247999999999999
1471,-0.12712
1472,-0.12805999999999998
1473,-0.12794
1474,-0.13315
1475,-0.13575
1476,-0.13033
1477,-0.12745
1478,-0.1317
1479,-0.13384000000000001
1480,-0.1335
1481,-0.13735999999999998
1482,-0.14071
1483,-0.13926
1484,-0.1388
1485,-0.14028
1486,-0.13907
1487,-0.13505
1488,-0.13047999999999998
1489,-0.12702
1490,-0.12671
1491,-0.13016
1492,-0.13404000000000002
1493,-0.13398
1494,-0.13239
1495,-0.13409000000000001
1496,-0.13425
1497,-0.12921
1498,-0.12797
1499,-0.13276
1500,-0.13416
1501,-0.13368
1502,-0.13855
1503,-0.14423
1504,-0.14545999999999998
1505,-0.14538
1506,-0.14592
1507,-0.14417
1508,-0.13960999999999998
1509,-0.1378
1510,-0.14182999999999998
1511,-0.14543
1512,-0.14515999999999998
1513,-0.1469
1514,-0.15161
1515,-0.15267
1516,-0.14887
1517,-0.1452
1518,-0.14467
1519,-0.14740999999999999
1520,-0.15206
1521,-0.15621
1522,-0.15965
1523,-0.16432
1524,-0.16869
1525,-0.1697
1526,-0.16935
1527,-0.16945
1528,-0.16885
1529,-0.17007
1530,-0.17439000000000002
1531,-0.17852
1532,-0.18279
1533,-0.18692999999999999
1534,-0.18792999999999999
1535,-0.18664
1536,-0.18216
1537,-0.17595999999999998
1538,-0.1766
1539,-0.18112
1540,-0.18378
1541,-0.19166
1542,-0.19927999999999998
1543,-0.19571
1544,-0.19343
1545,-0.19941
1546,-0.20082
1547,-0.19783
1548,-0.19956
1549,-0.20374
1550,-0.20726999999999998
1551,-0.21181
1552,-0.21623
1553,-0.21781999999999999
1554,-0.21716999999999997
1555,-0.21703000000000003
1556,-0.21755
1557,-0.21711999999999998
1558,-0.21686
1559,-0.21941
1560,-0.2245
1561,-0.22868000000000002
1562,-0.22969
1563,-0.22905999999999999
1564,-0.22913000000000003
1565,-0.2295
1566,-0.22896999999999998
1567,-0.22901
1568,-0.23198000000000002
1569,-0.23709000000000002
1570,-0.24098000000000003
1571,-0.24195999999999998
1572,-0.23999
1573,-0.23556999999999997
1574,-0.23344
1575,-0.23769
1576,-0.24128000000000002
1577,-0.23765999999999998
1578,-0.23385
1579,-0.23535
1580,-0.23909
1581,-0.24379
1582,-0.24736999999999998
1583,-0.24743
1584,-0.24709
1585,-0.24720999999999999
1586,-0.24691999999999997
1587,-0.24774000000000002
1588,-0.24691999999999997
1589,-0.24616999999999997
1590,-0.25064000000000003
1591,-0.25318
1592,-0.25246
1593,-0.2569
1594,-0.25874
1595,-0.25390999999999997
1596,-0.25325
1597,-0.25214000000000003
1598,-0.24731
1599,-0.25214000000000003
1600,-0.26143
1601,-0.26011999999999996
1602,-0.25442
1603,-0.25308
1604,-0.25325
1605,-0.25304
1606,-0.25324
1607,-0.25326
1608,-0.25301999999999997
1609,-0.25327
1610,-0.25326
1611,-0.25290999999999997
1612,-0.25346
1613,-0.25322
1614,-0.25256
1615,-0.25414000000000003
1616,-0.25294
1617,-0.24789
1618,-0.24863000000000002
1619,-0.25365
1620,-0.25388
1621,-0.25244
1622,-0.25339
1623,-0.25343000000000004
1624,-0.2528
1625,-0.25332
1626,-0.25333
1627,-0.25287
1628,-0.25334
1629,-0.25336
1630,-0.25269
1631,-0.25356
1632,-0.25365
1633,-0.24978000000000003
1634,-0.2465
1635,-0.24705
1636,-0.24754
1637,-0.24694000000000002
1638,-0.24719000000000002
