time,value
0,-0.6727
1,-0.6727
2,0.69302
3,1.8636
4,-0.6727
5,-0.6727
6,-0.6727
7,-0.6727
8,-0.6727
9,2.0587
10,0.49792
11,-0.6727
12,-0.6727
13,-0.6727
14,-0.6727
15,1.0832
16,1.6685
17,-0.6727
18,-0.6727
19,-0.6727
20,-0.6727
21,-0.28249
22,2.2538
23,-0.08739
24,-0.6727
25,-0.6727
26,-0.6727
27,-0.6727
28,1.4734
29,1.2783
30,-0.6727
31,-0.6727
32,-0.6727
33,-0.6727
34,0.10770999999999999
35,2.0587
36,-0.08739
37,-0.6727
38,-0.6727
39,-0.6727
40,-0.6727
41,1.6685
42,0.88812
43,-0.6727
44,-0.6727
45,-0.6727
46,-0.6727
47,0.49792
48,2.0587
49,-0.6727
50,-0.6727
51,-0.6727
52,-0.6727
53,-0.6727
54,2.0587
55,0.30280999999999997
56,-0.6727
57,-0.6727
58,-0.6727
59,-0.6727
60,1.2783
61,1.4734
62,-0.6727
63,-0.6727
64,-0.6727
65,-0.6727
66,0.30280999999999997
67,2.0587
68,-0.28249
69,-0.6727
70,-0.6727
71,-0.28249
72,2.0587
73,0.69302
74,-0.6727
75,-0.6727
76,-0.6727
77,0.88812
78,2.0587
79,-0.6727
80,-0.6727
81,-0.6727
82,-0.6727
83,1.6685
84,1.0832
85,-0.6727
86,-0.6727
87,-0.6727
88,0.10770999999999999
89,2.0587
90,-0.28249
91,-0.6727
92,-0.6727
93,-0.6727
94,1.0832
95,1.6685
