time,value
0,-0.5836
1,-0.5836
2,-0.5836
3,-0.5836
4,-0.5836
5,-0.5836
6,-0.5836
7,-0.5836
8,-0.5836
9,-0.5836
10,-0.5836
11,-0.5836
12,-0.5836
13,-0.5836
14,-0.5836
15,-0.5836
16,-0.5836
17,-0.5836
18,-0.5836
19,-0.5836
20,-0.5836
21,-0.5836
22,-0.5836
23,-0.5836
24,-0.5836
25,-0.5836
26,-0.5836
27,-0.5836
28,-0.5836
29,-0.5836
30,-0.5836
31,-0.5836
32,-0.5836
33,-0.5836
34,-0.5836
35,-0.5836
36,-0.5836
37,-0.5836
38,-0.5836
39,-0.004524
40,-0.14929
41,-0.004524
42,-0.14929
43,-0.004524
44,-0.14929
45,-0.004524
46,-0.14929
47,-0.004524
48,-0.14929
49,-0.004524
50,-0.14929
51,-0.004524
52,-0.14929
53,-0.004524
54,-0.14929
55,-0.004524
56,-0.14929
57,-0.004524
58,0.14024
59,-0.14929
60,-0.004524
61,-0.14929
62,-0.004524
63,-0.14929
64,-0.004524
65,-0.14929
66,-0.004524
67,-0.14929
68,-0.004524
69,-0.14929
70,-0.004524
71,-0.14929
72,-0.004524
73,-0.14929
74,-0.004524
75,-0.14929
76,-0.004524
77,-0.14929
78,-0.004524
79,1.4432
80,2.8908
81,2.8908
82,2.7461
83,2.7461
84,2.8908
85,2.7461
86,3.0356
87,2.8908
88,2.8908
89,1.8775
90,-0.5836
91,-0.5836
92,-0.5836
93,-0.5836
94,-0.5836
95,-0.5836
