time,value
0,2.0428
1,2.0477
2,2.0531
3,2.0304
4,1.9982
5,1.9652
6,1.9284
7,1.8955
8,1.8591
9,1.8228
10,1.7867
11,1.7514
12,1.7151
13,1.6795
14,1.6423
15,1.6048
16,1.5656
17,1.5265
18,1.4874
19,1.4485
20,1.4097
21,1.3709
22,1.3279
23,1.2893
24,1.2509
25,1.2125
26,1.1743
27,1.1409
28,1.103
29,1.0701
30,1.0325
31,0.9951399999999999
32,0.9627700000000001
33,0.92585
34,0.89412
35,0.86272
36,0.82632
37,0.7954899999999999
38,0.75953
39,0.72932
40,0.69385
41,0.65859
42,0.6178100000000001
43,0.58295
44,0.54833
45,0.51395
46,0.47381999999999996
47,0.43383
48,0.39726999999999996
49,0.36048
50,0.32101
51,0.2944
52,0.26184
53,0.22962
54,0.19775
55,0.17298
56,0.13388
57,0.07953099999999999
58,0.032692
59,-0.0091874
60,-0.049349000000000004
61,-0.083423
62,-0.12354000000000001
63,-0.16018
64,-0.19652
65,-0.23559000000000002
66,-0.27555999999999997
67,-0.31838
68,-0.35343
69,-0.3957
70,-0.43
71,-0.47163
72,-0.51056
73,-0.54728
74,-0.5916
75,-0.63478
76,-0.66637
77,-0.7059300000000001
78,-0.7444
79,-0.78263
80,-0.82405
81,-0.85729
82,-0.89692
83,-0.9292
84,-0.96398
85,-0.9867799999999999
86,-1.0055
87,-1.0189
88,-1.0068
89,-0.98834
90,-0.9585899999999999
91,-0.9351299999999999
92,-0.90196
93,-0.88135
94,-0.8496600000000001
95,-0.81704
96,-0.78277
97,-0.74273
98,-0.70348
99,-0.6665300000000001
100,-0.6188899999999999
101,-0.5729
102,-0.5391
103,-0.50481
104,-0.47768999999999995
105,-0.44231000000000004
106,-0.42318
107,-0.39376
108,-0.37290999999999996
109,-0.35123000000000004
110,-0.34714
111,-0.342
112,-0.34485
113,-0.36513
114,-0.40521
115,-0.44514
116,-0.4849
117,-0.52449
118,-0.56387
119,-0.59882
120,-0.63767
121,-0.6762699999999999
122,-0.70999
123,-0.74792
124,-0.78554
125,-0.82281
126,-0.8547
127,-0.8908799999999999
128,-0.9212600000000001
129,-0.95078
130,-0.97939
131,-1.0132
132,-1.035
133,-1.037
134,-1.0508
135,-1.0711
136,-1.092
137,-1.1039
138,-1.1217
139,-1.1461
140,-1.1735
141,-1.2079
142,-1.2372
143,-1.2607
144,-1.3039
145,-1.3424
146,-1.3691
147,-1.3973
148,-1.4202
149,-1.444
150,-1.4638
151,-1.4902
152,-1.5244
153,-1.5168
154,-1.5108
155,-1.4914
156,-1.4776
157,-1.4632
158,-1.4387
159,-1.411
160,-1.3872
161,-1.3545
162,-1.3199
163,-1.2829
164,-1.2534
165,-1.2248
166,-1.1911
167,-1.1496
168,-1.1166
169,-1.0731
170,-1.0286
171,-0.9833299999999999
172,-0.9478
173,-0.90125
174,-0.85405
175,-0.81588
176,-0.7681899999999999
177,-0.73016
178,-0.6954199999999999
179,-0.65474
180,-0.60515
181,-0.5662699999999999
182,-0.51679
183,-0.46636000000000005
184,-0.41595
185,-0.36741
186,-0.3191
187,-0.27071999999999996
188,-0.22503
189,-0.17944000000000002
190,-0.13358
191,-0.089246
192,-0.044908
193,-0.00056511
194,0.041059
195,0.088132
196,0.13249
197,0.17684
198,0.2212
199,0.26557
200,0.30728
201,0.35165
202,0.39343
203,0.43782
204,0.48086
205,0.5240600000000001
206,0.56595
207,0.61036
208,0.6523100000000001
209,0.69429
210,0.73632
211,0.7783800000000001
212,0.8209799999999999
213,0.86492
214,0.9070600000000001
215,0.9492299999999999
216,0.9936799999999999
217,1.0359
218,1.0803
219,1.1226
220,1.1648
221,1.2115
222,1.2557
223,1.2990000000000002
224,1.3448
225,1.3921
226,1.4309
227,1.4688
228,1.4916
229,1.4906
230,1.4962
231,1.4853
232,1.4641
233,1.4438
234,1.4226
235,1.4018
236,1.3742
237,1.3436
238,1.3154
239,1.2847
240,1.2446
241,1.2046
242,1.1647
243,1.1248
244,1.0851
245,1.0455
246,1.0019
247,0.96241
248,0.92301
249,0.8837200000000001
250,0.84455
251,0.81174
252,0.80115
253,0.8155399999999999
254,0.85367
255,0.90286
256,0.94485
257,0.9954799999999999
258,1.0379
259,1.0703
260,1.1066
261,1.1484
262,1.1713
263,1.1946
264,1.2183
265,1.2424
266,1.2589
267,1.2838
268,1.2877
269,1.2753
270,1.2652
271,1.2482
272,1.2217
273,1.1883
274,1.1551
275,1.1285
276,1.0767
277,1.0318
278,0.9867100000000001
279,0.93855
280,0.87734
281,0.8267
282,0.77598
283,0.72216
284,0.67469
285,0.62092
286,0.55979
287,0.5060899999999999
288,0.45703999999999995
289,0.40565999999999997
290,0.35015999999999997
291,0.28908
292,0.22801999999999997
293,0.16698
294,0.10595
295,0.044939
296,-0.0024046
297,-0.0573
298,-0.10463
299,-0.15953
300,-0.20444
301,-0.25649
302,-0.31056999999999996
303,-0.35441
304,-0.40641
305,-0.45676000000000005
306,-0.5041100000000001
307,-0.54973
308,-0.6016
309,-0.64455
310,-0.69238
311,-0.73756
312,-0.78259
313,-0.82745
314,-0.8653200000000001
315,-0.88584
316,-0.8764799999999999
317,-0.87244
318,-0.8667100000000001
319,-0.85929
320,-0.8368
321,-0.80782
322,-0.78281
323,-0.7650899999999999
324,-0.74207
325,-0.71738
326,-0.70375
327,-0.6973600000000001
328,-0.69395
329,-0.69831
330,-0.71015
331,-0.72109
332,-0.74031
333,-0.74887
334,-0.75617
335,-0.78894
336,-0.80794
337,-0.84457
338,-0.8783
339,-0.91469
340,-0.9587399999999999
341,-1.0021
342,-1.0454
343,-1.0885
344,-1.1316
345,-1.1737
346,-1.2166
347,-1.2579
348,-1.3004
349,-1.3428
350,-1.3737
351,-1.4137
352,-1.453
353,-1.4907
354,-1.5253
355,-1.5554
356,-1.5375
357,-1.49
358,-1.4385
359,-1.3957
360,-1.355
361,-1.3055
362,-1.2647
363,-1.2195
364,-1.1740000000000002
365,-1.1268
366,-1.0765
367,-1.0282
368,-0.98401
369,-0.93925
370,-0.90528
371,-0.8811399999999999
372,-0.8560200000000001
373,-0.8376600000000001
374,-0.82558
375,-0.81877
376,-0.8176
377,-0.82442
378,-0.82316
379,-0.8275899999999999
380,-0.85077
381,-0.8753700000000001
382,-0.88807
383,-0.9128700000000001
384,-0.9284600000000001
385,-0.94266
386,-0.96396
387,-0.9667100000000001
388,-0.98016
389,-0.9932
390,-0.99565
391,-0.99639
392,-0.9996
393,-0.9831700000000001
394,-0.9473799999999999
395,-0.90855
396,-0.86755
397,-0.82781
398,-0.7876
399,-0.74547
400,-0.70489
401,-0.6627
402,-0.6212
403,-0.5787
404,-0.53669
405,-0.49417
406,-0.45147
407,-0.40888
408,-0.36582
409,-0.32265
410,-0.27928000000000003
411,-0.23571999999999999
412,-0.19197
413,-0.14795999999999998
414,-0.10399000000000001
415,-0.059257000000000004
416,-0.014822
417,0.030441000000000003
418,0.075697
419,0.12194
420,0.16963
421,0.21433000000000002
422,0.25911999999999996
423,0.30395
424,0.35129
425,0.38936
426,0.43678
427,0.48266000000000003
428,0.52909
429,0.57423
430,0.6115
431,0.65842
432,0.70335
433,0.74954
434,0.7941600000000001
435,0.8412700000000001
436,0.8883700000000001
437,0.9337799999999999
438,0.97915
439,1.0236
440,1.0718
441,1.1172
442,1.1628
443,1.2049
444,1.2407
445,1.2788
446,1.3265
447,1.367
448,1.4172
449,1.4648
450,1.5036
451,1.5514
452,1.5996
453,1.6477
454,1.6864
455,1.7397
456,1.7802
457,1.8285
458,1.8825
459,1.9263
460,1.9697
461,2.0151
462,2.0403
