time,value
0,-0.14398
1,-0.14398
2,-0.14398
3,-0.14398
4,-0.14398
5,-0.14398
6,-0.14398
7,-0.14398
8,-0.14398
9,-0.14398
10,-0.14398
11,-0.14398
12,-0.14398
13,-0.14398
14,-0.14398
15,-0.14398
16,-0.14398
17,-0.14398
18,-0.14398
19,-0.14398
20,-0.14398
21,-0.14398
22,-0.14398
23,-0.14398
24,-0.14398
25,-0.14398
26,-0.14398
27,-0.14398
28,-0.14398
29,-0.14398
30,-0.14398
31,-0.14398
32,-0.14398
33,5.9114
34,-0.14398
35,-0.14398
36,-0.14398
37,-0.14398
38,-0.14398
39,-0.14398
40,-0.14398
41,-0.14398
42,-0.14398
43,-0.14398
44,-0.14398
45,-0.14398
46,-0.14398
47,-0.14398
48,-0.14398
49,-0.14398
50,-0.14398
51,-0.14398
52,-0.14398
53,-0.14398
54,-0.14398
55,-0.14398
56,-0.14398
57,-0.14398
58,-0.14398
59,-0.14398
60,-0.14398
61,-0.14398
62,-0.14398
63,-0.14398
64,-0.14398
65,-0.14398
66,-0.14398
67,-0.14398
68,-0.14398
69,-0.14398
70,-0.14398
71,-0.14398
72,-0.14398
73,-0.14398
74,-0.14398
75,-0.14398
76,-0.14398
77,-0.14398
78,-0.14398
79,-0.14398
80,-0.14398
81,-0.14398
82,-0.14398
83,7.6227
84,-0.14398
85,-0.14398
86,-0.14398
87,-0.14398
88,-0.14398
89,-0.14398
90,-0.14398
91,-0.14398
92,-0.14398
93,-0.14398
94,-0.14398
95,-0.14398
