time,value
0,0.9049799999999999
1,-0.66747
2,-0.66747
3,-0.66747
4,-0.27436
5,2.0843
6,0.31531
7,-0.66747
8,-0.66747
9,-0.66747
10,-0.27436
11,2.0843
12,0.31531
13,-0.66747
14,-0.66747
15,-0.66747
16,-0.66747
17,2.2809
18,0.31531
19,-0.66747
20,-0.66747
21,-0.66747
22,-0.66747
23,1.8878
24,0.9049799999999999
25,-0.66747
26,-0.66747
27,-0.66747
28,-0.66747
29,1.1015
30,1.4946
31,-0.66747
32,-0.66747
33,-0.66747
34,-0.66747
35,0.7084199999999999
36,1.8878
37,-0.66747
38,-0.66747
39,-0.66747
40,-0.66747
41,-0.077803
42,2.0843
43,-0.077803
44,-0.66747
45,-0.66747
46,-0.66747
47,-0.66747
48,2.0843
49,0.7084199999999999
50,-0.66747
51,-0.66747
52,-0.66747
53,-0.66747
54,1.4946
55,1.2981
56,-0.66747
57,-0.66747
58,-0.66747
59,-0.66747
60,1.1015
61,1.6912
62,-0.66747
63,-0.66747
64,-0.66747
65,-0.66747
66,0.51186
67,2.0843
68,-0.66747
69,-0.66747
70,-0.66747
71,-0.66747
72,0.11875
73,2.0843
74,-0.077803
75,-0.66747
76,-0.66747
77,-0.66747
78,-0.66747
79,2.0843
80,0.7084199999999999
81,-0.66747
82,-0.66747
83,-0.66747
84,2.2809
85,0.51186
86,-0.66747
87,-0.66747
88,-0.66747
89,0.11875
90,2.0843
91,-0.077803
92,-0.66747
93,-0.66747
94,-0.66747
95,0.9049799999999999
