time,value
0,-0.14712
1,-0.14712
2,-0.14712
3,-0.14712
4,-0.14712
5,-0.14712
6,-0.14712
7,-0.14712
8,-0.14712
9,-0.14712
10,-0.14712
11,-0.14712
12,-0.14712
13,-0.14712
14,-0.14712
15,-0.14712
16,-0.14712
17,-0.14712
18,-0.14712
19,-0.14712
20,-0.14712
21,-0.14712
22,-0.14712
23,-0.14712
24,-0.14712
25,-0.14712
26,-0.14712
27,-0.14712
28,-0.14712
29,-0.14712
30,-0.14712
31,-0.14712
32,-0.14712
33,-0.14712
34,9.2551
35,2.3335
36,1.0532
37,0.89313
38,-0.14712
39,-0.14712
40,-0.14712
41,-0.14712
42,-0.14712
43,-0.14712
44,-0.14712
45,-0.14712
46,-0.14712
47,-0.14712
48,-0.14712
49,-0.14712
50,-0.14712
51,-0.14712
52,-0.14712
53,-0.14712
54,-0.14712
55,-0.14712
56,-0.14712
57,-0.14712
58,-0.14712
59,-0.14712
60,-0.14712
61,-0.14712
62,-0.14712
63,-0.14712
64,-0.14712
65,-0.14712
66,-0.14712
67,-0.14712
68,-0.14712
69,-0.14712
70,-0.14712
71,-0.14712
72,-0.14712
73,-0.14712
74,-0.14712
75,-0.14712
76,-0.14712
77,-0.14712
78,-0.14712
79,-0.14712
80,-0.14712
81,-0.14712
82,-0.14712
83,-0.14712
84,-0.14712
85,-0.14712
86,-0.14712
87,-0.14712
88,-0.14712
89,-0.14712
90,-0.14712
91,-0.14712
92,-0.14712
93,-0.14712
94,-0.14712
95,-0.14712
