time,value
0,0.5512
1,-0.8625700000000001
2,0.34924
3,-0.25667
4,-1.0645
5,0.75317
6,-1.6704
7,0.95514
8,-1.2665
9,0.5512
10,-1.2665
11,0.14727
12,-0.054699
13,-0.8625700000000001
14,0.75317
15,-1.0645
16,1.3591
17,-1.2665
18,1.7630000000000001
19,-0.6606
20,-0.25667
21,0.14727
22,-1.0645
23,0.5512
24,-1.2665
25,2.3689
26,-1.2665
27,1.1571
28,-0.054699
29,1.561
30,1.561
31,0.34924
32,1.7630000000000001
33,-0.6606
34,1.3591
35,-0.45863000000000004
36,0.75317
37,-0.45863000000000004
38,0.5512
39,0.34924
40,-0.45863000000000004
41,0.5512
42,-0.8625700000000001
43,0.5512
44,-1.4685
45,0.95514
46,-1.0645
47,0.14727
48,-0.8625700000000001
49,0.14727
50,-0.25667
51,-0.6606
52,0.5512
53,-1.0645
54,0.34924
55,-1.2665
56,1.3591
57,-1.4685
58,0.5512
59,-0.45863000000000004
60,0.34924
61,-0.25667
62,-0.45863000000000004
63,0.5512
64,-1.0645
65,0.34924
66,1.3591
67,1.965
68,-0.45863000000000004
69,1.3591
70,-0.25667
71,0.14727
72,-0.25667
73,0.14727
74,-0.054699
75,-0.45863000000000004
76,1.1571
77,-1.0645
78,0.75317
79,-1.2665
80,1.3591
81,-1.0645
82,2.3689
83,1.1571
84,-0.45863000000000004
85,0.5512
86,-1.0645
87,0.75317
88,-1.6704
89,1.1571
90,-0.8625700000000001
91,-0.8625700000000001
92,-0.45863000000000004
93,-1.4685
94,0.34924
95,-1.4685
