time,value
0,1.6774
1,1.6487
2,1.584
3,1.5016
4,1.4188
5,1.3355
6,1.253
7,1.1702
8,1.0877
9,1.0052
10,0.92209
11,0.83986
12,0.7567
13,0.68639
14,0.60329
15,0.52147
16,0.43945
17,0.35693
18,0.27559
19,0.19285
20,0.11188
21,0.030163
22,-0.053108
23,-0.13635999999999998
24,-0.21556
25,-0.29523
26,-0.37693000000000004
27,-0.45842
28,-0.53682
29,-0.61759
30,-0.69798
31,-0.77791
32,-0.8534
33,-0.9317200000000001
34,-1.0091
35,-1.0852
36,-1.1597
37,-1.2309
38,-1.2941
39,-1.3582
40,-1.4161
41,-1.4651
42,-1.5018
43,-1.5107
44,-1.5124
45,-1.4953
46,-1.4621
47,-1.4159
48,-1.3603
49,-1.298
50,-1.2309999999999999
51,-1.1604
52,-1.0874
53,-1.0124
54,-0.94055
55,-0.86272
56,-0.78405
57,-0.7047100000000001
58,-0.62483
59,-0.54452
60,-0.46581000000000006
61,-0.38556999999999997
62,-0.30417
63,-0.22257
64,-0.14079
65,-0.061017999999999996
66,0.02115
67,0.10247
68,0.18395999999999998
69,0.26649
70,0.34745
71,0.43018
72,0.5129600000000001
73,0.59436
74,0.67595
75,0.75894
76,0.84077
77,0.92386
78,0.9941700000000001
79,1.0773
80,1.1595
81,1.2418
82,1.3251
83,1.4076
84,1.4901
85,1.5719
86,1.6528
87,1.6895
88,1.6782
89,1.6206
90,1.5387
91,1.463
92,1.3855
93,1.3022
94,1.2196
95,1.1371
96,1.0538
97,0.98124
98,0.89995
99,0.8177399999999999
100,0.73457
101,0.65256
102,0.57017
103,0.48768
104,0.40608
105,0.3232
106,0.25356999999999996
107,0.1725
108,0.089909
109,0.0073967
110,-0.073068
111,-0.14159000000000002
112,-0.2236
113,-0.30545
114,-0.38713000000000003
115,-0.46588999999999997
116,-0.54694
117,-0.62766
118,-0.70463
119,-0.7842399999999999
120,-0.8632299999999999
121,-0.94145
122,-1.0139
123,-1.0894
124,-1.1631
125,-1.2344
126,-1.2951
127,-1.3658
128,-1.4062
129,-1.4543
130,-1.4903
131,-1.5087
132,-1.5134
133,-1.4991
134,-1.4683
135,-1.4238
136,-1.3696
137,-1.3082
138,-1.2418
139,-1.176
140,-1.1044
141,-1.0293
142,-0.9526899999999999
143,-0.87871
144,-0.80024
145,-0.7207399999999999
146,-0.64071
147,-0.56326
148,-0.48501000000000005
149,-0.40101
150,-0.32127
151,-0.24013
152,-0.15988
153,-0.078069
154,0.0042613
155,0.08669099999999999
156,0.16748
157,0.25014000000000003
158,0.33286
159,0.41415
160,0.49566000000000004
161,0.57863
162,0.6604
163,0.74347
164,0.82619
165,0.9086200000000001
166,0.99136
167,1.074
168,1.1564
169,1.2396
170,1.3221
171,1.4053
172,1.4880000000000002
173,1.5706
174,1.6398
175,1.6818
