time,value
0,-0.45592
1,-0.45592
2,-0.45592
3,-0.45592
4,-0.45592
5,-0.45592
6,-0.45592
7,-0.45592
8,-0.45592
9,-0.45592
10,-0.45592
11,-0.45592
12,-0.45592
13,-0.45592
14,-0.45592
15,-0.45592
16,-0.45592
17,-0.45592
18,-0.45592
19,-0.45592
20,-0.45592
21,-0.45592
22,-0.45592
23,-0.45592
24,-0.45592
25,-0.45592
26,-0.45592
27,-0.45592
28,-0.45592
29,-0.45592
30,-0.45592
31,-0.45592
32,-0.45592
33,-0.45592
34,-0.45592
35,-0.45592
36,-0.45592
37,-0.45592
38,-0.45592
39,-0.45592
40,-0.45592
41,-0.45592
42,-0.45592
43,-0.45592
44,-0.45592
45,-0.45592
46,-0.45592
47,-0.45592
48,-0.45592
49,-0.45592
50,-0.45592
51,-0.45592
52,-0.45592
53,1.5494
54,0.1544
55,-0.45592
56,-0.45592
57,-0.45592
58,-0.45592
59,-0.28155
60,2.5957
61,2.6829
62,2.5957
63,0.24159
64,1.5494
65,2.5957
66,2.5957
67,2.5957
68,1.2007
69,-0.10717
70,-0.019981
71,-0.10717
72,-0.10717
73,-0.19435999999999998
74,-0.45592
75,-0.45592
76,-0.45592
77,-0.45592
78,-0.45592
79,-0.45592
80,-0.45592
81,-0.45592
82,-0.45592
83,-0.45592
84,-0.45592
85,-0.45592
86,1.5494
87,2.6829
88,2.5957
89,2.5957
90,2.3341
91,1.9854
92,-0.45592
93,-0.45592
94,-0.45592
95,-0.45592
