time,value
0,-1.2472
1,0.17702
2,-1.609
3,-1.8475
4,-0.86175
5,-0.9895799999999999
6,-1.528
7,-1.2897
8,-1.0338
9,-1.2517
10,-1.3524
11,-1.1995
12,-1.2071
13,-1.2998
14,-1.2929
15,-1.2745
16,-1.3041
17,-1.3317
18,-1.3376
19,-1.3583
20,-1.3709
21,-1.3874
22,-1.4013
23,-1.4040000000000001
24,-1.4214
25,-1.4216
26,-1.4422
27,-1.4442
28,-1.4574
29,-1.4635
30,-1.4666
31,-1.4754
32,-1.4716
33,-1.4837
34,-1.4762
35,-1.4872
36,-1.4853
37,-1.49
38,-1.494
39,-1.4945
40,-1.5061
41,-1.5022
42,-1.5205
43,-1.5213
44,-1.5368
45,-1.5441
46,-1.555
47,-1.569
48,-1.5737
49,-1.5924
50,-1.5928
51,-1.6136
52,-1.6162
53,-1.6268
54,-1.6309
55,-1.6312
56,-1.6349
57,-1.6217
58,-1.6242
59,-1.6064
60,-1.6043
61,-1.5886
62,-1.5793
63,-1.5703
64,-1.5552
65,-1.5497
66,-1.5269
67,-1.5269
68,-1.5077
69,-1.4998
70,-1.4833
71,-1.4694
72,-1.4594
73,-1.4395
74,-1.4359
75,-1.4143
76,-1.413
77,-1.3968
78,-1.391
79,-1.381
80,-1.3684
81,-1.3641
82,-1.3453
83,-1.3447
84,-1.3249
85,-1.3216
86,-1.3054
87,-1.2927
88,-1.28
89,-1.261
90,-1.2546
91,-1.23
92,-1.2298
93,-1.2109999999999999
94,-1.2046
95,-1.1917
96,-1.1805
97,-1.1742
98,-1.1559
99,-1.1540000000000001
100,-1.1325
101,-1.1299
102,-1.1124
103,-1.1039
104,-1.0923
105,-1.0765
106,-1.0695
107,-1.0464
108,-1.0444
109,-1.0241
110,-1.0203
111,-1.0051
112,-0.9943200000000001
113,-0.98655
114,-0.97019
115,-0.9661700000000001
116,-0.9439799999999999
117,-0.9444
118,-0.92058
119,-0.90427
120,-0.88639
121,-0.87445
122,-0.86697
123,-0.8425299999999999
124,-0.8373700000000001
125,-0.8163
126,-0.81517
127,-0.7999
128,-0.79366
129,-0.78669
130,-0.7744300000000001
131,-0.77245
132,-0.75367
133,-0.7572
134,-0.74121
135,-0.74025
136,-0.7297899999999999
137,-0.72242
138,-0.7184699999999999
139,-0.7064199999999999
140,-0.71133
141,-0.6985600000000001
142,-0.70939
143,-0.70508
144,-0.7137600000000001
145,-0.71922
146,-0.7238
147,-0.73679
148,-0.73755
149,-0.75954
150,-0.76381
151,-0.7873399999999999
152,-0.7993399999999999
153,-0.81839
154,-0.8377399999999999
155,-0.8511299999999999
156,-0.87654
157,-0.88339
158,-0.91254
159,-0.92204
160,-0.94483
161,-0.95916
162,-0.97482
163,-0.9947799999999999
164,-1.0035
165,-1.0274
166,-1.0323
167,-1.0592
168,-1.0714
169,-1.0933
170,-1.1125
171,-1.129
172,-1.1539
173,-1.1641
174,-1.1949
175,-1.2064
176,-1.2329
177,-1.2468
178,-1.2651
179,-1.2838
180,-1.294
181,-1.3162
182,-1.3193
183,-1.3456
184,-1.3529
185,-1.3721
186,-1.3843
187,-1.3971
188,-1.4148
189,-1.4199
190,-1.4404
191,-1.4408
192,-1.4593
193,-1.4611
194,-1.4684
195,-1.4709
196,-1.4682
197,-1.4743
198,-1.4643
199,-1.4736
200,-1.4627
201,-1.4667
202,-1.4612
203,-1.4597
204,-1.4584
205,-1.4475
206,-1.4499
207,-1.4339
208,-1.4392
209,-1.425
210,-1.4207
211,-1.4094
212,-1.3972
213,-1.3897
214,-1.3691
215,-1.3656
216,-1.3436
217,-1.3398
218,-1.3213
219,-1.3093
220,-1.2954
221,-1.2768
222,-1.2683
223,-1.2433
224,-1.2399
225,-1.2163
226,-1.2062
227,-1.1868
228,-1.1701
229,-1.1548
230,-1.1305
231,-1.1225
232,-1.0959999999999999
233,-1.0912
234,-1.072
235,-1.067
236,-1.0571
237,-1.0439
238,-1.0374
239,-1.0188
240,-1.0191
241,-0.9981700000000001
242,-0.99334
243,-0.9747
244,-0.9616299999999999
245,-0.94714
246,-0.92727
247,-0.9204700000000001
248,-0.89641
249,-0.89559
250,-0.8769
251,-0.87449
252,-0.86454
253,-0.85645
254,-0.8523299999999999
255,-0.83757
256,-0.8379700000000001
257,-0.81842
258,-0.81986
259,-0.80372
260,-0.79578
261,-0.78372
262,-0.76991
263,-0.76466
264,-0.7442
265,-0.74473
266,-0.7268899999999999
267,-0.72715
268,-0.7158399999999999
269,-0.71015
270,-0.70508
271,-0.69202
272,-0.69104
273,-0.67082
274,-0.67569
275,-0.66147
276,-0.66085
277,-0.65446
278,-0.6504800000000001
279,-0.65288
280,-0.6450899999999999
281,-0.65659
282,-0.6494
283,-0.6631100000000001
284,-0.66356
285,-0.67484
286,-0.6831
287,-0.68499
288,-0.6955399999999999
289,-0.69091
290,-0.7077600000000001
291,-0.70239
292,-0.71128
293,-0.71124
294,-0.71801
295,-0.72717
296,-0.7269899999999999
297,-0.74117
298,-0.73635
299,-0.7548699999999999
300,-0.75569
301,-0.7693800000000001
302,-0.7770600000000001
303,-0.7832
304,-0.79586
305,-0.79693
306,-0.81713
307,-0.81757
308,-0.8382200000000001
309,-0.84744
310,-0.8647100000000001
311,-0.87954
312,-0.8908799999999999
313,-0.91617
314,-0.92151
315,-0.94114
316,-0.9365100000000001
317,-0.9474100000000001
318,-0.9486600000000001
319,-0.95062
320,-0.95534
321,-0.9518399999999999
322,-0.96341
323,-0.95462
324,-0.9685600000000001
325,-0.96565
326,-0.9720799999999999
327,-0.9708
328,-0.9658700000000001
329,-0.9670700000000001
330,-0.95273
331,-0.95519
332,-0.93511
333,-0.93109
334,-0.91275
335,-0.90096
336,-0.88926
337,-0.87169
338,-0.86516
339,-0.8397700000000001
340,-0.83795
341,-0.81609
342,-0.80724
343,-0.78796
344,-0.76895
345,-0.75179
346,-0.72253
347,-0.70894
348,-0.67562
349,-0.66406
350,-0.6362399999999999
351,-0.61892
352,-0.5978600000000001
353,-0.57521
354,-0.56228
355,-0.53489
356,-0.52825
357,-0.5019399999999999
358,-0.49421000000000004
359,-0.47478000000000004
360,-0.46105
361,-0.44782
362,-0.42766000000000004
363,-0.42103
364,-0.3949
365,-0.3937
366,-0.37187
367,-0.36349000000000004
368,-0.34792
369,-0.33345
370,-0.32338
371,-0.30074
372,-0.29609
373,-0.27102
374,-0.26746
375,-0.24918
376,-0.24113
377,-0.22931999999999997
378,-0.2126
379,-0.20551
380,-0.18078
381,-0.17687
382,-0.15198
383,-0.14598
384,-0.12893
385,-0.11295999999999999
386,-0.094034
387,-0.065717
388,-0.055376
389,-0.026882
390,-0.023052
391,0.00023161
392,0.0087907
393,0.022474
394,0.036021
395,0.043404000000000005
396,0.06555
397,0.069751
398,0.095443
399,0.09979099999999999
400,0.11896
401,0.12944
402,0.14079
403,0.15671
404,0.16158
405,0.18513
406,0.18454
407,0.20623000000000002
408,0.2126
409,0.22941999999999999
410,0.24272
411,0.25436
412,0.27671
413,0.28079
414,0.30388000000000004
415,0.30151999999999995
416,0.31773
417,0.32256
418,0.33499
419,0.34983000000000003
420,0.3561
421,0.37884
422,0.38406
423,0.41334
424,0.42236999999999997
425,0.44608000000000003
426,0.46316
427,0.47947
428,0.49892
429,0.5030100000000001
430,0.52728
431,0.5262399999999999
432,0.5468
433,0.55109
434,0.5657399999999999
435,0.58068
436,0.59455
437,0.62221
438,0.63238
439,0.6641
440,0.67168
441,0.69677
442,0.70911
443,0.72433
444,0.74239
445,0.7518600000000001
446,0.77784
447,0.77956
448,0.80233
449,0.80515
450,0.8194299999999999
451,0.82485
452,0.8279
453,0.8386600000000001
454,0.83391
455,0.8487100000000001
456,0.83426
457,0.8412299999999999
458,0.8336
459,0.8335799999999999
460,0.8318200000000001
461,0.8237
462,0.8285799999999999
463,0.81382
464,0.82153
465,0.8075100000000001
466,0.81111
467,0.8052
468,0.8024899999999999
469,0.80496
470,0.79678
471,0.80638
472,0.79084
473,0.79565
474,0.7803399999999999
475,0.77383
476,0.75921
477,0.7386699999999999
478,0.72502
479,0.69384
480,0.68337
481,0.6462600000000001
482,0.62939
483,0.60054
484,0.57997
485,0.56155
486,0.53668
487,0.5274300000000001
488,0.49856000000000006
489,0.49081
490,0.46058000000000004
491,0.445
492,0.42073999999999995
493,0.39643
494,0.37744
495,0.34764
496,0.33845
497,0.30511
498,0.29407
499,0.26883
500,0.2557
501,0.24040999999999998
502,0.22196999999999997
503,0.21466999999999997
504,0.19105
505,0.18888
506,0.16227
507,0.15366
508,0.1328
509,0.11696
510,0.10335
511,0.08142
512,0.075032
513,0.048302
514,0.042955
515,0.019534
516,0.012579
517,-2.696e-05
518,-0.012204000000000001
519,-0.013512
520,-0.024797
521,-0.021429
522,-0.045016
523,-0.039449
524,-0.050709
525,-0.07787000000000001
526,-0.12232
527,-0.15274000000000001
528,-0.14684
529,-0.1579
530,-0.15777
531,-0.17855
532,-0.17714000000000002
533,-0.18783
534,-0.19708
535,-0.20304
536,-0.21864
537,-0.21836999999999998
538,-0.23817
539,-0.23671999999999999
540,-0.25334
541,-0.25385
542,-0.25559
543,-0.25593
544,-0.24519000000000002
545,-0.24286
546,-0.21728000000000003
547,-0.21696999999999997
548,-0.19372999999999999
549,-0.1834
550,-0.16982
551,-0.16111
552,-0.15465
553,-0.13119
554,-0.12722
555,-0.10553
556,-0.1047
557,-0.085392
558,-0.076679
559,-0.067751
560,-0.055215999999999994
561,-0.050886
562,-0.028364999999999998
563,-0.027413
564,-0.00085356
565,0.014577000000000001
566,0.044606
567,0.069172
568,0.091132
569,0.12155999999999999
570,0.13542
571,0.16769
572,0.1725
573,0.19467
574,0.20096
575,0.21279
576,0.22551
577,0.23331999999999997
578,0.2566
579,0.26099
580,0.28688
581,0.29228000000000004
582,0.31464000000000003
583,0.32949
584,0.34615
585,0.36822
586,0.37958000000000003
587,0.40976
588,0.41426999999999997
589,0.43943000000000004
590,0.44693
591,0.46313000000000004
592,0.47413
593,0.48293
594,0.50415
595,0.5092
596,0.53479
597,0.53484
598,0.5545
599,0.5624
600,0.5760000000000001
601,0.58991
602,0.59445
603,0.6146199999999999
604,0.61417
605,0.63612
606,0.63857
607,0.6583399999999999
608,0.6726300000000001
609,0.68829
610,0.71323
611,0.7286100000000001
612,0.7640399999999999
613,0.769
614,0.79484
615,0.8065100000000001
616,0.82731
617,0.84215
618,0.85015
619,0.8693
620,0.8694200000000001
621,0.89205
622,0.8924
623,0.91317
624,0.92368
625,0.94024
626,0.9611
627,0.97229
628,0.99928
629,1.0014
630,1.0244
631,1.026
632,1.0402
633,1.0469
634,1.0513
635,1.0624
636,1.0586
637,1.078
638,1.0704
639,1.0865
640,1.089
641,1.1017
642,1.1137
643,1.1184
644,1.1349
645,1.131
646,1.1512
647,1.1483
648,1.1629
649,1.1678
650,1.1781
651,1.1938
652,1.1976
653,1.2205
654,1.22
655,1.2427
656,1.2454
657,1.2622
658,1.2771
659,1.2921
660,1.3175
661,1.3276
662,1.3615
663,1.3674
664,1.395
665,1.4087
666,1.4305
667,1.454
668,1.4722
669,1.5067
670,1.5197
671,1.5573
672,1.5723
673,1.6033
674,1.6245
675,1.6492
676,1.6792
677,1.6924
678,1.7224
679,1.7245
680,1.7501
681,1.7564
682,1.7747
683,1.7901
684,1.8023
685,1.825
686,1.8301
687,1.8605
688,1.8647
689,1.8897
690,1.9008
691,1.9182
692,1.9366
693,1.9446
694,1.9682
695,1.9674
696,1.9894
697,1.9876
698,2.0013
699,2.0067
700,2.012
701,2.0253
702,2.0268
703,2.0527
704,2.0495
705,2.0706
706,2.0752
707,2.0909999999999997
708,2.1035
709,2.1105
710,2.1301
711,2.128
712,2.1477
713,2.1396
714,2.1513
715,2.1497
716,2.1514
717,2.1574
718,2.1567
719,2.1777
720,2.1743
721,2.1971
722,2.2016
723,2.2214
724,2.2318
725,2.2382
726,2.2512
727,2.2454
728,2.2597
729,2.2393
730,2.2381
731,2.2167
732,2.2014
733,2.1839
734,2.1596
735,2.151
736,2.1219
737,2.1165
738,2.0854
739,2.0741
740,2.0535
741,2.0363
742,2.0258
743,2.0059
744,2.0056
745,1.9759
746,1.9698
747,1.9459
748,1.9338
749,1.9155
750,1.8961
751,1.8875
752,1.8589
753,1.8545
754,1.8216
755,1.8055
756,1.7765
757,1.7623
758,1.7426
759,1.7053
760,1.7025
761,1.6915
762,1.659
763,1.5472
764,1.4732
765,1.4573
766,1.4614
767,1.4476
768,1.4172
769,1.4231
770,1.4007
771,1.392
772,1.3675
773,1.357
774,1.3396
775,1.3163
776,1.3058
777,1.2765
778,1.2695
779,1.2371
780,1.2249
781,1.2016
782,1.1864
783,1.1726
784,1.1459
785,1.1352
786,1.1059999999999999
787,1.1005
788,1.0703
789,1.0518
790,1.0254
791,0.99798
792,0.97746
793,0.94509
794,0.93561
795,0.89815
796,0.8821899999999999
797,0.85282
798,0.8367100000000001
799,0.82135
800,0.80187
801,0.7952899999999999
802,0.77182
803,0.77381
804,0.75326
805,0.7497
806,0.73347
807,0.72164
808,0.7139800000000001
809,0.6957800000000001
810,0.69384
811,0.6689
812,0.6663399999999999
813,0.64389
814,0.6346
815,0.62102
816,0.60852
817,0.60578
818,0.5898
819,0.59787
820,0.58109
821,0.5873
822,0.57972
823,0.58118
824,0.58302
825,0.5788
826,0.5866899999999999
827,0.5738
828,0.58116
829,0.5647800000000001
830,0.56447
831,0.55392
832,0.5445800000000001
833,0.5382
834,0.52068
835,0.5214
836,0.49813
837,0.49568999999999996
838,0.47568999999999995
839,0.4675
840,0.45285
841,0.43277
842,0.42181
843,0.39771
844,0.39602
845,0.36824
846,0.36171
847,0.34364
848,0.33066
849,0.31745
850,0.29964
851,0.29849000000000003
852,0.27699999999999997
853,0.27716
854,0.25778
855,0.25266
856,0.23781999999999998
857,0.22524
858,0.21983000000000003
859,0.20134000000000002
860,0.19957
861,0.17294
862,0.16682
863,0.1436
864,0.13013
865,0.11342
866,0.09209400000000001
867,0.08089099999999999
868,0.055095000000000005
869,0.051973
870,0.024607
871,0.014333000000000002
872,-0.0070486
873,-0.021953999999999998
874,-0.034179
875,-0.055519000000000006
876,-0.06313300000000001
877,-0.091027
878,-0.095964
879,-0.11832000000000001
880,-0.1275
881,-0.14428
882,-0.16157
883,-0.17288
884,-0.1977
885,-0.20274
886,-0.23167
887,-0.24125
888,-0.26681
889,-0.28357
890,-0.30139
891,-0.32419000000000003
892,-0.33532
893,-0.36118
894,-0.36505
895,-0.39145
896,-0.40059
897,-0.41736
898,-0.4285
899,-0.43559
900,-0.45046
901,-0.44815
902,-0.46576000000000006
903,-0.46273000000000003
904,-0.48152
905,-0.49203
906,-0.5026
907,-0.50653
908,-0.51172
909,-0.5477
910,-0.55911
911,-0.56979
912,-0.54442
913,-0.53697
914,-0.52522
915,-0.5086
916,-0.49438000000000004
917,-0.47086999999999996
918,-0.46693999999999997
919,-0.44193999999999994
920,-0.43717
921,-0.41493
922,-0.40199
923,-0.38754
924,-0.36569
925,-0.34529
926,-0.30491
927,-0.29148
928,-0.26056999999999997
929,-0.24508000000000002
930,-0.21859
931,-0.20204
932,-0.19117
933,-0.17101
934,-0.16354000000000002
935,-0.13573
936,-0.13285
937,-0.10875
938,-0.095264
939,-0.074171
940,-0.052166
941,-0.033698
942,0.0017789000000000001
943,0.019042
944,0.05536900000000001
945,0.068022
946,0.09281299999999999
947,0.10709
948,0.12230999999999999
949,0.14274
950,0.15283
951,0.18295
952,0.18968
953,0.21509
954,0.21946999999999997
955,0.23065
956,0.2376
957,0.2419
958,0.2555
959,0.25228
960,0.27262
961,0.27258000000000004
962,0.29275
963,0.29963
964,0.3106
965,0.32156
966,0.3223
967,0.33707
968,0.33175
969,0.34911
970,0.34652
971,0.35882
972,0.3659
973,0.37569
974,0.39347
975,0.3993
976,0.42618
977,0.42766000000000004
978,0.45021000000000005
979,0.45578
980,0.46934
981,0.4795
982,0.48475
983,0.50184
984,0.50162
985,0.52386
986,0.5229199999999999
987,0.54069
988,0.54742
989,0.55923
990,0.57633
991,0.58692
992,0.6144
993,0.6179399999999999
994,0.64455
995,0.65389
996,0.67614
997,0.69093
998,0.70624
999,0.73141
1000,0.74237
1001,0.77517
1002,0.7813
1003,0.80771
1004,0.8167800000000001
1005,0.8328200000000001
1006,0.84664
1007,0.85091
1008,0.86449
1009,0.85729
1010,0.87077
1011,0.85959
1012,0.8637100000000001
1013,0.85688
1014,0.84852
1015,0.8433700000000001
1016,0.82824
1017,0.8250200000000001
1018,0.7931
1019,0.78913
1020,0.76599
1021,0.7383
1022,0.71196
1023,0.70063
1024,0.67611
1025,0.6141800000000001
1026,0.62238
1027,0.6232
1028,0.5172100000000001
1029,0.27768000000000004
1030,0.12062
1031,0.11922999999999999
1032,0.13315
1033,0.10385
1034,0.056988
1035,0.060648
1036,0.029723000000000003
1037,-0.0016695
1038,-0.027663
1039,-0.050057
1040,-0.078956
1041,-0.11750999999999999
1042,-0.12752
1043,-0.16378
1044,-0.1831
1045,-0.21656
1046,-0.24065999999999999
1047,-0.26881
1048,-0.2968
1049,-0.31108
1050,-0.34163000000000004
1051,-0.3495
1052,-0.37433
1053,-0.37640999999999997
1054,-0.38966
1055,-0.39836
1056,-0.40437
1057,-0.41841999999999996
1058,-0.41884
1059,-0.4402
1060,-0.44033999999999995
1061,-0.45756
1062,-0.45802
1063,-0.46143999999999996
1064,-0.46207
1065,-0.4552
1066,-0.45955
1067,-0.44287
1068,-0.44961999999999996
1069,-0.43677
1070,-0.43781000000000003
1071,-0.42626000000000003
1072,-0.41393
1073,-0.40704
1074,-0.39111
1075,-0.36628
1076,-0.3745
1077,-0.41103
1078,-0.32854
1079,-0.28017
1080,-0.43813
1081,-0.41271
1082,-0.13393
1083,-0.2734
1084,-0.6424300000000001
1085,-0.18650999999999998
1086,0.22759000000000001
1087,-0.69508
1088,-0.94026
1089,0.97105
1090,0.6572600000000001
1091,-5.6033
