time,value
0,-0.20504
1,-0.20504
2,-0.20504
3,-0.20504
4,-0.20504
5,-0.20504
6,-0.20504
7,-0.20504
8,-0.20504
9,-0.20504
10,-0.20504
11,-0.20504
12,-0.20504
13,-0.20504
14,-0.20504
15,-0.20504
16,-0.20504
17,-0.20504
18,-0.20504
19,-0.20504
20,-0.20504
21,-0.20504
22,-0.20504
23,-0.20504
24,-0.20504
25,-0.20504
26,-0.20504
27,-0.20504
28,-0.20504
29,-0.20504
30,-0.20504
31,-0.20504
32,-0.20504
33,-0.20504
34,-0.20504
35,-0.20504
36,-0.20504
37,5.2628
38,-0.20504
39,-0.20504
40,-0.20504
41,3.8710000000000004
42,-0.20504
43,4.1195
44,-0.20504
45,-0.20504
46,-0.20504
47,5.6107
48,-0.20504
49,-0.20504
50,-0.20504
51,-0.20504
52,-0.20504
53,-0.20504
54,-0.20504
55,-0.20504
56,-0.20504
57,-0.20504
58,-0.20504
59,-0.20504
60,-0.20504
61,-0.20504
62,-0.20504
63,-0.20504
64,-0.20504
65,-0.20504
66,-0.20504
67,-0.20504
68,-0.20504
69,-0.20504
70,-0.20504
71,-0.20504
72,-0.20504
73,-0.20504
74,-0.20504
75,-0.20504
76,-0.20504
77,-0.20504
78,-0.20504
79,-0.20504
80,-0.20504
81,-0.20504
82,-0.20504
83,-0.20504
84,-0.20504
85,-0.20504
86,-0.20504
87,-0.20504
88,-0.20504
89,-0.20504
90,-0.20504
91,-0.20504
92,-0.20504
93,-0.20504
94,-0.20504
95,-0.20504
