time,value
0,0.45238
1,-0.61728
2,-0.61728
3,-0.61728
4,-0.61728
5,0.8802399999999999
6,1.9499
7,-0.61728
8,-0.61728
9,-0.61728
10,-0.61728
11,-0.61728
12,2.1638
13,0.8802399999999999
14,-0.61728
15,-0.61728
16,-0.61728
17,-0.61728
18,0.024513
19,2.3778
20,0.024513
21,-0.61728
22,-0.61728
23,-0.61728
24,-0.61728
25,0.8802399999999999
26,1.9499
27,-0.61728
28,-0.61728
29,-0.61728
30,-0.61728
31,-0.61728
32,1.9499
33,0.8802399999999999
34,-0.61728
35,-0.61728
36,-0.61728
37,-0.61728
38,-0.18942
39,2.3778
40,0.23844
41,-0.61728
42,-0.61728
43,-0.61728
44,-0.61728
45,1.9499
46,0.8802399999999999
47,-0.61728
48,-0.61728
49,-0.61728
50,-0.61728
51,0.024513
52,2.3778
53,-0.18942
54,-0.61728
55,-0.61728
56,-0.61728
57,-0.61728
58,1.0942
59,1.9499
60,-0.61728
61,-0.61728
62,-0.61728
63,-0.61728
64,-0.61728
65,1.5219999999999998
66,1.3081
67,-0.61728
68,-0.61728
69,-0.61728
70,-0.61728
71,-0.61728
72,1.9499
73,0.8802399999999999
74,-0.61728
75,-0.61728
76,-0.61728
77,-0.61728
78,-0.18942
79,2.3778
80,0.23844
81,-0.61728
82,-0.61728
83,-0.61728
84,-0.61728
85,0.45238
86,2.3778
87,-0.61728
88,-0.61728
89,-0.61728
90,-0.61728
91,-0.61728
92,1.3081
93,1.736
94,-0.61728
95,-0.61728
