time,value
0,-0.22221999999999997
1,-0.22221999999999997
2,-0.22221999999999997
3,-0.22221999999999997
4,-0.22221999999999997
5,-0.22221999999999997
6,-0.22221999999999997
7,-0.22221999999999997
8,-0.22221999999999997
9,-0.22221999999999997
10,-0.22221999999999997
11,-0.22221999999999997
12,-0.22221999999999997
13,-0.22221999999999997
14,-0.22221999999999997
15,-0.22221999999999997
16,-0.22221999999999997
17,-0.22221999999999997
18,-0.22221999999999997
19,-0.22221999999999997
20,-0.22221999999999997
21,-0.22221999999999997
22,-0.22221999999999997
23,-0.22221999999999997
24,-0.22221999999999997
25,-0.22221999999999997
26,4.9679
27,-0.22221999999999997
28,-0.22221999999999997
29,-0.22221999999999997
30,-0.22221999999999997
31,-0.22221999999999997
32,-0.22221999999999997
33,-0.22221999999999997
34,-0.22221999999999997
35,-0.22221999999999997
36,-0.22221999999999997
37,-0.22221999999999997
38,-0.22221999999999997
39,-0.22221999999999997
40,-0.22221999999999997
41,-0.058747
42,-0.22221999999999997
43,-0.22221999999999997
44,-0.22221999999999997
45,-0.22221999999999997
46,-0.22221999999999997
47,-0.22221999999999997
48,-0.22221999999999997
49,-0.22221999999999997
50,-0.22221999999999997
51,-0.22221999999999997
52,-0.22221999999999997
53,-0.22221999999999997
54,-0.22221999999999997
55,-0.22221999999999997
56,-0.22221999999999997
57,-0.22221999999999997
58,-0.22221999999999997
59,-0.22221999999999997
60,-0.22221999999999997
61,-0.22221999999999997
62,-0.22221999999999997
63,-0.22221999999999997
64,-0.22221999999999997
65,-0.22221999999999997
66,-0.22221999999999997
67,-0.22221999999999997
68,-0.22221999999999997
69,6.1122
70,-0.22221999999999997
71,-0.22221999999999997
72,-0.22221999999999997
73,2.189
74,-0.017879
75,-0.099614
76,-0.22221999999999997
77,-0.099614
78,-0.14048
79,-0.22221999999999997
80,-0.14048
81,-0.14048
82,-0.14048
83,-0.22221999999999997
84,-0.22221999999999997
85,-0.22221999999999997
86,-0.22221999999999997
87,4.7227
88,1.2899
89,-0.22221999999999997
90,-0.22221999999999997
91,-0.22221999999999997
92,-0.22221999999999997
93,-0.22221999999999997
94,-0.22221999999999997
95,-0.22221999999999997
