time,value
0,0.028648000000000003
1,0.028648000000000003
2,0.028648000000000003
3,0.028648000000000003
4,0.028648000000000003
5,0.028648000000000003
6,0.028648000000000003
7,0.028648000000000003
8,0.028648000000000003
9,0.028648000000000003
10,0.028648000000000003
11,0.028648000000000003
12,0.028648000000000003
13,0.028648000000000003
14,0.028648000000000003
15,0.028648000000000003
16,0.028648000000000003
17,0.028648000000000003
18,0.028648000000000003
19,0.028648000000000003
20,0.27867
21,0.028648000000000003
22,0.028648000000000003
23,0.028648000000000003
24,0.028648000000000003
25,0.028648000000000003
26,0.028648000000000003
27,0.028648000000000003
28,0.028648000000000003
29,0.028648000000000003
30,0.028648000000000003
31,0.028648000000000003
32,0.028648000000000003
33,0.028648000000000003
34,0.028648000000000003
35,0.028648000000000003
36,0.028648000000000003
37,0.028648000000000003
38,0.028648000000000003
39,0.028648000000000003
40,0.028648000000000003
41,0.028648000000000003
42,0.028648000000000003
43,0.028648000000000003
44,0.028648000000000003
45,0.028648000000000003
46,0.028648000000000003
47,0.028648000000000003
48,0.028648000000000003
49,0.028648000000000003
50,0.028648000000000003
51,0.028648000000000003
52,0.028648000000000003
53,0.028648000000000003
54,0.028648000000000003
55,0.028648000000000003
56,0.028648000000000003
57,0.028648000000000003
58,0.028648000000000003
59,0.028648000000000003
60,0.028648000000000003
61,0.028648000000000003
62,0.028648000000000003
63,0.028648000000000003
64,0.028648000000000003
65,0.028648000000000003
66,0.028648000000000003
67,0.028648000000000003
68,0.028648000000000003
69,0.028648000000000003
70,0.028648000000000003
71,-1.4715
72,-1.4715
73,-1.4715
74,-1.4715
75,-1.4715
76,0.52869
77,-1.4715
78,-1.4715
79,-1.4715
80,-1.4715
81,-1.4715
82,-1.4715
83,-1.4715
84,-1.4715
85,0.27867
86,3.0289
87,3.0289
88,2.7789
89,2.7789
90,3.0289
91,2.7789
92,3.0289
93,-1.4715
94,-1.4715
95,-1.4715
