time,value
0,-0.4875
1,-0.23723000000000002
2,-0.4875
3,-0.4875
4,-0.4875
5,-0.23723000000000002
6,-0.4875
7,-0.4875
8,-0.4875
9,-0.23723000000000002
10,-0.4875
11,-0.4875
12,-0.4875
13,-0.23723000000000002
14,-0.4875
15,-0.4875
16,-0.23723000000000002
17,-0.4875
18,-0.4875
19,-0.4875
20,-0.23723000000000002
21,-0.4875
22,-0.4875
23,-0.4875
24,-0.23723000000000002
25,-0.4875
26,-0.4875
27,-0.4875
28,-0.23723000000000002
29,-0.4875
30,-0.4875
31,-0.4875
32,-0.23723000000000002
33,-0.4875
34,-0.4875
35,-0.4875
36,-0.23723000000000002
37,-0.4875
38,-0.4875
39,-0.4875
40,-0.23723000000000002
41,-0.4875
42,-0.4875
43,-0.4875
44,-0.23723000000000002
45,-0.4875
46,-0.4875
47,-0.4875
48,-0.23723000000000002
49,-0.4875
50,-0.4875
51,-0.4875
52,-0.23723000000000002
53,-0.4875
54,-0.4875
55,-0.4875
56,-0.23723000000000002
57,-0.4875
58,-0.4875
59,-0.4875
60,-0.23723000000000002
61,-0.4875
62,-0.4875
63,-0.4875
64,-0.23723000000000002
65,-0.4875
66,-0.4875
67,-0.4875
68,-0.23723000000000002
69,-0.4875
70,-0.4875
71,-0.4875
72,-0.23723000000000002
73,-0.4875
74,-0.4875
75,-0.23723000000000002
76,-0.4875
77,-0.4875
78,-0.4875
79,1.0141
80,2.766
81,2.5157
82,2.5157
83,2.766
84,2.2655
85,2.766
86,2.5157
87,2.0152
88,2.2655
89,2.0152
90,2.0152
91,2.2655
92,2.0152
93,2.2655
94,-0.23723000000000002
95,-0.23723000000000002
