time,value
0,-0.23376
1,-0.23376
2,-0.23376
3,-0.23376
4,-0.23376
5,-0.23376
6,-0.23376
7,-0.23376
8,-0.23376
9,-0.23376
10,-0.23376
11,-0.23376
12,-0.23376
13,-0.23376
14,-0.23376
15,-0.23376
16,-0.23376
17,-0.23376
18,-0.23376
19,-0.23376
20,-0.23376
21,-0.23376
22,-0.23376
23,-0.23376
24,-0.23376
25,-0.23376
26,-0.23376
27,-0.23376
28,-0.23376
29,-0.23376
30,-0.23376
31,-0.23376
32,-0.23376
33,-0.23376
34,-0.23376
35,-0.23376
36,-0.23376
37,-0.23376
38,-0.23376
39,-0.23376
40,-0.23376
41,-0.23376
42,-0.23376
43,-0.23376
44,-0.23376
45,-0.23376
46,-0.23376
47,-0.23376
48,-0.23376
49,-0.23376
50,-0.23376
51,-0.23376
52,-0.23376
53,-0.23376
54,-0.23376
55,-0.23376
56,-0.23376
57,-0.23376
58,-0.23376
59,-0.23376
60,-0.23376
61,-0.23376
62,-0.23376
63,-0.23376
64,-0.23376
65,-0.23376
66,-0.23376
67,-0.23376
68,-0.23376
69,-0.23376
70,-0.23376
71,-0.23376
72,-0.23376
73,-0.23376
74,-0.23376
75,-0.23376
76,-0.23376
77,-0.23376
78,-0.23376
79,-0.23376
80,-0.23376
81,-0.23376
82,-0.23376
83,-0.23376
84,-0.23376
85,-0.23376
86,-0.23376
87,-0.23376
88,4.2868
89,4.8758
90,2.8438
91,1.651
92,0.016566
93,-0.012884
94,6.0391
95,0.87061
