time,value
0,-0.9007299999999999
1,-0.8961
2,-0.8898299999999999
3,-0.88289
4,-0.87634
5,-0.8709600000000001
6,-0.8670100000000001
7,-0.8642200000000001
8,-0.86201
9,-0.85987
10,-0.85755
11,-0.85516
12,-0.85308
13,-0.85177
14,-0.85146
15,-0.85206
16,-0.8532299999999999
17,-0.85454
18,-0.85567
19,-0.85646
20,-0.8570200000000001
21,-0.85756
22,-0.85834
23,-0.85936
24,-0.8604700000000001
25,-0.8614200000000001
26,-0.8620200000000001
27,-0.8620899999999999
28,-0.86165
29,-0.8608600000000001
30,-0.86015
31,-0.8597100000000001
32,-0.85967
33,-0.86008
34,-0.8612
35,-0.86282
36,-0.8645200000000001
37,-0.86597
38,-0.8676200000000001
39,-0.86955
40,-0.8711
41,-0.87192
42,-0.87282
43,-0.87471
44,-0.8764299999999999
45,-0.8772700000000001
46,-0.8776299999999999
47,-0.87939
48,-0.8805700000000001
49,-0.8801700000000001
50,-0.8782
51,-0.8780899999999999
52,-0.87771
53,-0.87626
54,-0.8731700000000001
55,-0.87284
56,-0.87259
57,-0.8712
58,-0.86771
59,-0.86565
60,-0.86393
61,-0.86126
62,-0.85688
63,-0.85339
64,-0.85083
65,-0.8472799999999999
66,-0.84144
67,-0.8342700000000001
68,-0.82604
69,-0.8137
70,-0.7945300000000001
71,-0.76676
72,-0.7292
73,-0.67705
74,-0.60683
75,-0.51679
76,-0.40824
77,-0.27998
78,-0.13267
79,0.032139
80,0.21034
81,0.40104
82,0.60229
83,0.81158
84,1.0239
85,1.2357
86,1.443
87,1.6416
88,1.827
89,1.9968
90,2.1501
91,2.2868
92,2.4065
93,2.5093
94,2.5959
95,2.6662
96,2.7196
97,2.7557
98,2.7746
99,2.7767
100,2.7625
101,2.7323
102,2.6875
103,2.6296
104,2.5604
105,2.4816
106,2.396
107,2.3061
108,2.214
109,2.1208
110,2.0276
111,1.9345
112,1.8414
113,1.7471
114,1.6513
115,1.5534
116,1.4529
117,1.3489
118,1.2412
119,1.1301
120,1.0158
121,0.89918
122,0.7824300000000001
123,0.66837
124,0.55908
125,0.45552
126,0.35899000000000003
127,0.27089
128,0.19029000000000001
129,0.11545
130,0.045168
131,-0.018632
132,-0.07677
133,-0.13030999999999998
134,-0.18131
135,-0.22651
136,-0.26721999999999996
137,-0.30501
138,-0.3431
139,-0.37748000000000004
140,-0.40828000000000003
141,-0.43618999999999997
142,-0.46374
143,-0.48744
144,-0.5069600000000001
145,-0.52359
146,-0.5403100000000001
147,-0.55521
148,-0.56699
149,-0.57636
150,-0.58549
151,-0.5937600000000001
152,-0.5992
153,-0.6026199999999999
154,-0.6059100000000001
155,-0.61001
156,-0.61221
157,-0.6127199999999999
158,-0.61246
159,-0.61347
160,-0.61277
161,-0.61077
162,-0.60822
163,-0.6085699999999999
164,-0.60885
165,-0.60906
166,-0.60929
167,-0.6119
168,-0.61479
169,-0.61719
170,-0.619
171,-0.62208
172,-0.62567
173,-0.62864
174,-0.63044
175,-0.63168
176,-0.63158
177,-0.6278100000000001
178,-0.61893
179,-0.6047
180,-0.58527
181,-0.55886
182,-0.52505
183,-0.48432
184,-0.43848000000000004
185,-0.38668
186,-0.32936
187,-0.26763000000000003
188,-0.20478
189,-0.14098
190,-0.077486
191,-0.015484999999999999
192,0.042214
193,0.096174
194,0.14678
195,0.19454000000000002
196,0.23856999999999998
197,0.27971
198,0.31892
199,0.35681999999999997
200,0.39303
201,0.42791999999999997
202,0.46243
203,0.4968
204,0.53018
205,0.5614399999999999
206,0.59011
207,0.61516
208,0.63545
209,0.65009
210,0.65989
211,0.66567
212,0.66833
213,0.66827
214,0.66684
215,0.6644899999999999
216,0.66141
217,0.65713
218,0.6522600000000001
219,0.6470600000000001
220,0.6419199999999999
221,0.63697
222,0.6329899999999999
223,0.63022
224,0.62857
225,0.62736
226,0.62627
227,0.62455
228,0.62112
229,0.6146699999999999
230,0.60459
231,0.59024
232,0.57065
233,0.54483
234,0.51269
235,0.47479
236,0.43125
237,0.38236
238,0.3291
239,0.27375
240,0.21752
241,0.16147
242,0.10622999999999999
243,0.054003999999999996
244,0.004782
245,-0.042144
246,-0.088563
247,-0.13395
248,-0.17945
249,-0.22601
250,-0.27462
251,-0.32334
252,-0.37121
253,-0.41791000000000006
254,-0.46393999999999996
255,-0.5081399999999999
256,-0.55011
257,-0.59021
258,-0.6289100000000001
259,-0.66484
260,-0.6963600000000001
261,-0.72342
262,-0.7470399999999999
263,-0.7682899999999999
264,-0.78771
265,-0.8072600000000001
266,-0.8282799999999999
267,-0.8507600000000001
268,-0.8715299999999999
269,-0.8887
