time,value
0,-0.2741
1,-0.2741
2,-0.2741
3,-0.2741
4,-0.2741
5,-0.2741
6,-0.2741
7,-0.2741
8,-0.2741
9,-0.2741
10,-0.2741
11,-0.2741
12,-0.2741
13,-0.2741
14,-0.2741
15,-0.2741
16,-0.2741
17,-0.2741
18,-0.2741
19,-0.2741
20,-0.2741
21,-0.2741
22,-0.2741
23,-0.2741
24,-0.2741
25,-0.2741
26,4.7081
27,-0.2741
28,-0.2741
29,-0.2741
30,-0.2741
31,-0.2741
32,-0.2741
33,-0.2741
34,-0.2741
35,2.6045
36,0.16876
37,-0.2741
38,-0.2741
39,2.8997
40,-0.2741
41,-0.2741
42,-0.2741
43,-0.2741
44,4.8926
45,-0.2741
46,-0.2741
47,-0.2741
48,-0.2741
49,-0.2741
50,-0.2741
51,-0.2741
52,-0.2741
53,-0.2741
54,-0.2741
55,2.4569
56,-0.2741
57,-0.2741
58,-0.2741
59,-0.2741
60,-0.2741
61,-0.2741
62,-0.2741
63,-0.2741
64,-0.2741
65,-0.2741
66,-0.2741
67,-0.2741
68,-0.2741
69,-0.2741
70,-0.2741
71,3.7485
72,-0.2741
73,-0.2741
74,-0.2741
75,2.6414
76,-0.2741
77,-0.2741
78,-0.2741
79,-0.2741
80,-0.2741
81,-0.2741
82,-0.2741
83,-0.2741
84,-0.2741
85,-0.2741
86,-0.2741
87,-0.2741
88,-0.2741
89,-0.2741
90,-0.2741
91,-0.2741
92,-0.2741
93,-0.2741
94,-0.2741
95,-0.2741
