time,value
0,-0.15638
1,-0.15638
2,-0.15638
3,-0.15638
4,-0.15638
5,-0.15638
6,-0.15638
7,-0.15638
8,-0.15638
9,-0.15638
10,-0.15638
11,-0.15638
12,-0.15638
13,-0.15638
14,-0.15638
15,-0.15638
16,-0.15638
17,-0.15638
18,-0.15638
19,-0.15638
20,-0.15638
21,-0.15638
22,-0.15638
23,-0.15638
24,-0.15638
25,-0.15638
26,-0.15638
27,-0.15638
28,-0.15638
29,-0.15638
30,-0.15638
31,-0.15638
32,-0.15638
33,-0.15638
34,-0.15638
35,-0.15638
36,-0.15638
37,-0.15638
38,-0.15638
39,-0.15638
40,-0.15638
41,-0.15638
42,-0.15638
43,-0.15638
44,-0.15638
45,-0.15638
46,-0.15638
47,-0.15638
48,-0.15638
49,-0.15638
50,-0.15638
51,-0.15638
52,-0.15638
53,-0.15638
54,-0.15638
55,-0.15638
56,-0.15638
57,-0.15638
58,-0.15638
59,-0.15638
60,-0.15638
61,-0.15638
62,-0.15638
63,-0.15638
64,-0.15638
65,-0.15638
66,-0.15638
67,-0.15638
68,-0.15638
69,-0.15638
70,-0.15638
71,-0.15638
72,-0.15638
73,-0.15638
74,-0.15638
75,-0.15638
76,1.2222
77,7.7788
78,5.5428
79,-0.15638
80,-0.15638
81,-0.15638
82,-0.15638
83,-0.15638
84,-0.15638
85,-0.15638
86,-0.15638
87,-0.15638
88,-0.15638
89,-0.15638
90,-0.15638
91,-0.15638
92,-0.15638
93,-0.15638
94,-0.15638
95,-0.15638
