time,value
0,-0.27381
1,-0.27381
2,2.536
3,-0.27381
4,-0.27381
5,-0.27381
6,-0.27381
7,-0.27381
8,-0.27381
9,-0.27381
10,-0.27381
11,-0.27381
12,-0.27381
13,-0.27381
14,-0.27381
15,-0.27381
16,-0.27381
17,-0.27381
18,-0.27381
19,-0.27381
20,-0.27381
21,-0.27381
22,-0.27381
23,-0.27381
24,-0.27381
25,-0.27381
26,-0.27381
27,-0.27381
28,-0.27381
29,-0.27381
30,-0.27381
31,-0.27381
32,-0.27381
33,-0.27381
34,-0.27381
35,-0.27381
36,-0.27381
37,-0.27381
38,2.5622
39,-0.27381
40,4.2954
41,-0.27381
42,-0.27381
43,-0.27381
44,-0.27381
45,-0.27381
46,-0.27381
47,-0.27381
48,-0.27381
49,-0.27381
50,-0.27381
51,-0.27381
52,-0.27381
53,6.5275
54,0.041304
55,-0.27381
56,-0.27381
57,-0.27381
58,-0.27381
59,-0.27381
60,-0.27381
61,-0.27381
62,-0.27381
63,-0.27381
64,-0.27381
65,-0.27381
66,-0.27381
67,-0.27381
68,-0.27381
69,-0.27381
70,-0.27381
71,-0.27381
72,-0.27381
73,2.7986
74,-0.27381
75,-0.27381
76,-0.27381
77,-0.27381
78,1.6432
79,0.38268
80,-0.27381
81,-0.27381
82,-0.27381
83,-0.27381
84,-0.27381
85,-0.27381
86,-0.27381
87,-0.27381
88,-0.27381
89,-0.27381
90,-0.27381
91,1.328
92,-0.27381
93,-0.27381
94,-0.27381
95,1.4331
