[<text>
<title>ultrasystems inc &lt;uls&gt; 4th qtr jan 31 net</title>
<dateline>    new york, march 18 -
    </dateline>shr 26 cts vs 18 ctsd
    net 2,102,000 vs 1,415,000
    revs 44.1 mln vs 42.2 mln
    year
    shr 21 cts vs 91 cts
    net 1,678,000 vs 7,105,000
    revs 155.1 mln vs 149.2 mln
    avg shrs 7,960,000 vs 7,808,000
    note: latest year net includes writeoff of investment in
dawn enterprises ethanol refinery of 79 cts shr.
 reuter
</text>]