time,value
0,-0.1349
1,-0.1349
2,-0.1349
3,-0.1349
4,-0.1349
5,-0.1349
6,-0.1349
7,-0.1349
8,-0.1349
9,-0.1349
10,-0.1349
11,-0.1349
12,-0.1349
13,-0.1349
14,-0.1349
15,-0.1349
16,-0.1349
17,-0.1349
18,-0.1349
19,-0.1349
20,-0.1349
21,-0.1349
22,-0.1349
23,-0.1349
24,-0.1349
25,-0.1349
26,-0.1349
27,-0.1349
28,-0.1349
29,-0.1349
30,-0.1349
31,-0.1349
32,-0.1349
33,-0.1349
34,-0.1349
35,-0.1349
36,-0.1349
37,-0.1349
38,-0.1349
39,-0.1349
40,-0.1349
41,-0.1349
42,-0.1349
43,-0.1349
44,-0.1349
45,-0.1349
46,-0.1349
47,-0.1349
48,-0.1349
49,-0.1349
50,-0.1349
51,-0.1349
52,-0.1349
53,-0.1349
54,-0.1349
55,-0.1349
56,-0.1349
57,-0.1349
58,-0.1349
59,-0.1349
60,-0.1349
61,-0.1349
62,-0.1349
63,-0.1349
64,-0.1349
65,-0.1349
66,-0.1349
67,-0.1349
68,-0.1349
69,-0.1349
70,8.879
71,3.8017
72,-0.1349
73,-0.1349
74,-0.1349
75,-0.1349
76,-0.1349
77,-0.1349
78,-0.1349
79,-0.1349
80,-0.1349
81,-0.1349
82,-0.1349
83,-0.1349
84,-0.1349
85,-0.1349
86,-0.1349
87,-0.1349
88,-0.1349
89,-0.1349
90,-0.1349
91,-0.1349
92,-0.1349
93,-0.1349
94,-0.1349
95,-0.1349
