time,value
0,-2.3369
1,-2.3369
2,-2.3369
3,-2.3369
4,-2.3369
5,-2.3369
6,-2.3369
7,-2.3369
8,-2.3369
9,-2.3367
10,-2.3365
11,-2.3384
12,-2.3379
13,-2.3348
14,-2.3342
15,-2.3332
16,-2.3323
17,-2.331
18,-2.33
19,-2.3284
20,-2.3272
21,-2.3253
22,-2.3239
23,-2.3218
24,-2.3201
25,-2.3178
26,-2.316
27,-2.3134
28,-2.3105
29,-2.3002
30,-2.295
31,-2.2922
32,-2.29
33,-2.287
34,-2.2847
35,-2.2814
36,-2.2789
37,-2.2754
38,-2.2727
39,-2.2691
40,-2.2662
41,-2.2623
42,-2.2583
43,-2.2553
44,-2.2511
45,-2.2478
46,-2.2434
47,-2.2401
48,-2.2355
49,-2.2319999999999998
50,-2.2273
51,-2.2236
52,-2.2167
53,-2.213
54,-2.2079
55,-2.204
56,-2.1988
57,-2.1948
58,-2.1895
59,-2.1854
60,-2.1799
61,-2.1757
62,-2.17
63,-2.1657
64,-2.1599
65,-2.1555
66,-2.1496
67,-2.1451
68,-2.1391
69,-2.1345
70,-2.1283
71,-2.1236
72,-2.1174
73,-2.1126
74,-2.1062
75,-2.1014
76,-2.0949
77,-2.09
78,-2.0834
79,-2.0785
80,-2.0734
81,-2.0667
82,-2.0616
83,-2.0547
84,-2.0496
85,-2.0427
86,-2.0374
87,-2.0304
88,-2.0252
89,-2.0181
90,-2.0127
91,-2.0041
92,-1.9987
93,-1.9915
94,-1.9861
95,-1.9788
96,-1.9733
97,-1.9659
98,-1.9618
99,-1.9544
100,-1.9488
101,-1.9414
102,-1.9357
103,-1.9282
104,-1.9225
105,-1.9149
106,-1.9092
107,-1.9016
108,-1.8958
109,-1.8868
110,-1.881
111,-1.8733
112,-1.8674
113,-1.8596
114,-1.8538
115,-1.8459999999999999
116,-1.8388
117,-1.8337
118,-1.8272
119,-1.8194
120,-1.8135
121,-1.8056
122,-1.7965
123,-1.7906
124,-1.7826
125,-1.7767
126,-1.7687
127,-1.7628
128,-1.7548
129,-1.7515
130,-1.7427
131,-1.7362
132,-1.7282
133,-1.7222
134,-1.7142
135,-1.7082
136,-1.699
137,-1.6929
138,-1.6848
139,-1.6788
140,-1.6732
141,-1.6676
142,-1.6604
143,-1.6543
144,-1.6451
145,-1.639
146,-1.6326
147,-1.6269999999999998
148,-1.6206
149,-1.6146
150,-1.6065
151,-1.5992
152,-1.5911
153,-1.585
154,-1.5789
155,-1.5734
156,-1.5667
157,-1.5606
158,-1.5525
159,-1.5464
160,-1.5371
161,-1.531
162,-1.5228
163,-1.5153
164,-1.5098
165,-1.5025
166,-1.4964
167,-1.4882
168,-1.4809999999999999
169,-1.4728
170,-1.4666
171,-1.4593
172,-1.4539
173,-1.4484
174,-1.4423
175,-1.4341
176,-1.4268
177,-1.4175
178,-1.4132
179,-1.4066
180,-1.4005
181,-1.3922
182,-1.385
183,-1.3767
184,-1.3706
185,-1.3623
186,-1.358
187,-1.3515
188,-1.3483
189,-1.3401
190,-1.3339
191,-1.3246
192,-1.3184
193,-1.3119
194,-1.3065
195,-1.2983
196,-1.2921
197,-1.2838
198,-1.2776
199,-1.2693
200,-1.2631
201,-1.2537
202,-1.2475
203,-1.2392
204,-1.2309
205,-1.2246
206,-1.2163
207,-1.209
208,-1.2026
209,-1.1984
210,-1.1901
211,-1.1838
212,-1.1744
213,-1.1681
214,-1.1598
215,-1.1535
216,-1.1451
217,-1.1399
218,-1.1315
219,-1.1252
220,-1.1169
221,-1.1106
222,-1.1022
223,-1.0959
224,-1.0865
225,-1.0802
226,-1.0717
227,-1.0654
228,-1.0571
229,-1.0519
230,-1.0456
231,-1.0393
232,-1.0309
233,-1.0246
234,-1.0161
235,-1.0098
236,-1.0003
237,-0.9940000000000001
238,-0.98554
239,-0.97919
240,-0.97072
241,-0.96435
242,-0.95586
243,-0.94752
244,-0.9424299999999999
245,-0.93409
246,-0.9277299999999999
247,-0.91924
248,-0.9128700000000001
249,-0.9033899999999999
250,-0.8970100000000001
251,-0.8885
252,-0.8821100000000001
253,-0.8726200000000001
254,-0.8706799999999999
255,-0.86464
256,-0.85826
257,-0.84975
258,-0.84239
259,-0.8338700000000001
260,-0.8298
261,-0.8237700000000001
262,-0.8185399999999999
263,-0.81003
264,-0.80365
265,-0.7941600000000001
266,-0.78777
267,-0.7792399999999999
268,-0.77188
269,-0.76685
270,-0.76393
271,-0.75542
272,-0.74902
273,-0.7405
274,-0.7331300000000001
275,-0.7246
276,-0.71819
277,-0.71392
278,-0.71392
279,-0.70965
280,-0.70228
281,-0.69919
282,-0.6961
283,-0.6877800000000001
284,-0.6782699999999999
285,-0.67304
286,-0.67091
287,-0.66877
288,-0.6592600000000001
289,-0.65308
290,-0.64712
291,-0.64189
292,-0.63335
293,-0.6269399999999999
294,-0.61839
295,-0.61102
296,-0.60246
297,-0.59509
298,-0.58915
299,-0.58297
300,-0.5744199999999999
301,-0.568
302,-0.5584899999999999
303,-0.5532699999999999
304,-0.54732
305,-0.54113
306,-0.53259
307,-0.52617
308,-0.51762
309,-0.5111899999999999
310,-0.50263
311,-0.4962
312,-0.48762
313,-0.48118
314,-0.47258999999999995
315,-0.46615
316,-0.45755
317,-0.45109
318,-0.44248999999999994
319,-0.43601999999999996
320,-0.42741
321,-0.42094
322,-0.41231
323,-0.40584000000000003
324,-0.3972
325,-0.38856
326,-0.38208000000000003
327,-0.37342
328,-0.36693000000000003
329,-0.35827
330,-0.35089000000000004
331,-0.34221999999999997
332,-0.33571999999999996
333,-0.32705
334,-0.32054
335,-0.31185
336,-0.30534
337,-0.29665
338,-0.29013
339,-0.28317
340,-0.2823
341,-0.27360999999999996
342,-0.26709
343,-0.25839
344,-0.25187
345,-0.24316
346,-0.23663
347,-0.23359000000000002
348,-0.23142
349,-0.2227
350,-0.21616
351,-0.20744
352,-0.2009
353,-0.19654000000000002
354,-0.19435999999999998
355,-0.1883
356,-0.1809
357,-0.17399
358,-0.16925
359,-0.16403
360,-0.1575
361,-0.14793
362,-0.14139000000000002
363,-0.134
364,-0.1284
365,-0.1245
366,-0.11579
367,-0.10926
368,-0.099689
369,-0.093151
370,-0.087547
371,-0.084963
372,-0.07626000000000001
373,-0.06973
374,-0.060161
375,-0.053626
376,-0.044910000000000005
377,-0.03837
378,-0.032305
379,-0.027558999999999997
380,-0.019308000000000002
381,-0.012775
382,-0.0032064999999999997
383,0.0033296
384,0.0093986
385,0.011976
386,0.01761
387,0.020222
388,0.027188
389,0.0337
390,0.042387
391,0.048906
392,0.05847
393,0.064991
394,0.073689
395,0.07629
396,0.081949
397,0.088464
398,0.097152
399,0.10367
400,0.11237
401,0.11975999999999999
402,0.12846
403,0.13499
404,0.1437
405,0.15195
406,0.15671
407,0.16279000000000002
408,0.16932
409,0.17802
410,0.18541
411,0.19412000000000001
412,0.20065
413,0.20936999999999997
414,0.2159
415,0.22463000000000002
416,0.22851
417,0.23410999999999998
418,0.23933000000000001
419,0.24803000000000003
420,0.25456999999999996
421,0.26414
422,0.27068000000000003
423,0.27941
424,0.28595
425,0.29468
426,0.30123
427,0.30595
428,0.31068
429,0.32025
430,0.32679
431,0.33637
432,0.34291
433,0.35164
434,0.3582
435,0.36509
436,0.36982
437,0.37721
438,0.38376
439,0.39333
440,0.39988
441,0.40594
442,0.41066
443,0.41891000000000006
444,0.42545
445,0.43418
446,0.4429
447,0.44945
448,0.45819
449,0.46474
450,0.47348
451,0.48003999999999997
452,0.48878
453,0.49233000000000005
454,0.4912
455,0.49173999999999995
456,0.49968999999999997
457,0.50408
458,0.5008199999999999
459,0.50059
460,0.49737
461,0.49496999999999997
462,0.49338000000000004
463,0.49338000000000004
464,0.49022
465,0.48943000000000003
466,0.48863999999999996
467,0.48486999999999997
468,0.48175
469,0.47435
470,0.46474
471,0.4602
472,0.45711999999999997
473,0.45048
474,0.44164
475,0.43501999999999996
476,0.4254
477,0.41878000000000004
478,0.40995
479,0.40475
480,0.39945
481,0.39569
482,0.38685
483,0.38022
484,0.37061
485,0.36399000000000004
486,0.35516
487,0.34555
488,0.34399
489,0.33869
490,0.33205999999999997
491,0.32245
492,0.31582
493,0.30699
494,0.30323
495,0.29794
496,0.29275
497,0.28314
498,0.27863000000000004
499,0.27116
500,0.26376
501,0.2556
502,0.25111999999999995
503,0.24518
504,0.23853000000000002
505,0.22891
506,0.22225999999999999
507,0.21486
508,0.21039000000000002
509,0.20371
510,0.19630999999999998
511,0.19038
512,0.18592999999999998
513,0.17779
514,0.17113
515,0.16151
516,0.15484
517,0.14818
518,0.14375
519,0.13635
520,0.12968
521,0.12005999999999999
522,0.11339
523,0.10674000000000002
524,0.10232999999999999
525,0.094922
526,0.084569
527,0.08238999999999999
528,0.075772
529,0.069092
530,0.059462
531,0.052784000000000005
532,0.04388
533,0.039484
534,0.036614999999999995
535,0.029927
536,0.021016
537,0.014331
538,0.0054246
539,-0.0012564
540,-0.010883
541,-0.017561
542,-0.026461000000000002
543,-0.033134
544,-0.038265
545,-0.040425
546,-0.050056
547,-0.05745700000000001
548,-0.062546
549,-0.068428
550,-0.077351
551,-0.084039
552,-0.092954
553,-0.099639
554,-0.10855
555,-0.11595
556,-0.12485999999999998
557,-0.13154000000000002
558,-0.14044
559,-0.14712
560,-0.15302000000000002
561,-0.15519000000000002
562,-0.16028
563,-0.16241
564,-0.16899
565,-0.1764
566,-0.18297
567,-0.19022
568,-0.19693
569,-0.20586
570,-0.21327
571,-0.2222
572,-0.22429000000000002
573,-0.22705
574,-0.2291
575,-0.23405
576,-0.23606
577,-0.23870999999999998
578,-0.24452
579,-0.25417
580,-0.25613
581,-0.25872
582,-0.26065
583,-0.26318
584,-0.26507
585,-0.26755
586,-0.26939
587,-0.26322
588,-0.25644
589,-0.248
590,-0.24120999999999998
591,-0.23848000000000003
592,-0.24025
593,-0.23176999999999998
594,-0.22496999999999998
595,-0.2159
596,-0.2091
597,-0.20002
598,-0.19322
599,-0.18472
600,-0.1779
601,-0.16882
602,-0.16201
603,-0.15349000000000002
604,-0.1529
605,-0.15173
606,-0.14545999999999998
607,-0.13635999999999998
608,-0.1278
609,-0.12150999999999999
610,-0.12365999999999999
611,-0.11788
612,-0.10929000000000001
613,-0.10805
614,-0.10555
615,-0.10377
616,-0.09514500000000001
617,-0.092081
618,-0.091285
619,-0.087201
620,-0.078046
621,-0.07117899999999999
622,-0.062022
623,-0.055152
624,-0.045993
625,-0.039122000000000004
626,-0.029960000000000004
627,-0.023088
628,-0.013922
629,-0.0070495
630,0.0021186
631,0.0085206
632,0.01769
633,0.024569
634,0.033742
635,0.040622000000000005
636,0.049795
637,0.057145
638,0.06631799999999999
639,0.073202
640,0.08237799999999999
641,0.089262
642,0.098442
643,0.10533
644,0.11084000000000001
645,0.11452999999999999
646,0.12234
647,0.13152
648,0.1384
649,0.14804
650,0.15492
651,0.16409
652,0.16915
653,0.17332
654,0.17656
655,0.18573
656,0.1926
657,0.20225
658,0.20913
659,0.21141999999999997
660,0.21370999999999998
661,0.22335
662,0.22612
663,0.23165
664,0.239
665,0.24865
666,0.24911999999999998
667,0.25140999999999997
668,0.25829
669,0.26746
670,0.27433
671,0.28398
672,0.29085
673,0.30002
674,0.30508
675,0.30928
676,0.31253000000000003
677,0.32169000000000003
678,0.32857
679,0.33821
680,0.34279
681,0.34701
682,0.35076999999999997
683,0.35764
684,0.3645
685,0.37415
686,0.38101999999999997
687,0.39016999999999996
688,0.39933
689,0.4062
690,0.41536000000000006
691,0.42223999999999995
692,0.4314
693,0.43827
694,0.44743999999999995
695,0.45431000000000005
696,0.46348
697,0.47035
698,0.47952
699,0.4864
700,0.49556999999999995
701,0.50245
702,0.51162
703,0.5185
704,0.52767
705,0.5332
706,0.53738
707,0.54473
708,0.5539
709,0.5607800000000001
710,0.56994
711,0.57682
712,0.58599
713,0.59287
714,0.60205
715,0.60893
716,0.6181
717,0.62498
718,0.6341600000000001
719,0.64105
720,0.65022
721,0.6571100000000001
722,0.6662899999999999
723,0.6731699999999999
724,0.68235
725,0.68924
726,0.69843
727,0.70531
728,0.7145
729,0.72368
730,0.7310300000000001
731,0.74021
732,0.7471
733,0.75629
734,0.76318
735,0.77237
736,0.77927
737,0.78846
738,0.7935
739,0.7975899999999999
740,0.80309
741,0.81228
742,0.81917
743,0.82835
744,0.83525
745,0.8444299999999999
746,0.85178
747,0.8609600000000001
748,0.8678600000000001
749,0.87705
750,0.88394
751,0.8894299999999999
752,0.8930799999999999
753,0.8985799999999999
754,0.90546
755,0.91465
756,0.9215399999999999
757,0.93073
758,0.9376200000000001
759,0.94681
760,0.9537
761,0.96015
762,0.96111
763,0.9621
764,0.96899
765,0.9777600000000001
766,0.9846600000000001
767,0.9934299999999999
768,0.9953
769,0.9999
770,1.0091
771,1.016
772,1.0252
773,1.0321
774,1.0344
775,1.0376
776,1.0384
777,1.0384
778,1.0453
779,1.0527
780,1.0627
781,1.0701
782,1.0728
783,1.0732
784,1.0824
785,1.0893
786,1.0944
787,1.0944
788,1.0979999999999999
789,1.0993
790,1.1066
791,1.1135
792,1.1227
793,1.1296
794,1.1388
795,1.1457
796,1.1549
797,1.1618
798,1.1664
799,1.1687
800,1.1756
801,1.1825
802,1.1894
803,1.1917
804,1.1963
805,1.2032
806,1.2124
807,1.2193
808,1.2285
809,1.2377
810,1.2446
811,1.2543
812,1.2612
813,1.2704
814,1.2773
815,1.2865
816,1.2934
817,1.3003
818,1.3003
819,1.3049
820,1.3118
821,1.3141
822,1.3164
823,1.3229
824,1.3298
825,1.3309
826,1.3319
827,1.3384
828,1.345
829,1.3459999999999999
830,1.3471
831,1.3537
832,1.3559999999999999
833,1.3556
834,1.3556
835,1.3544
836,1.3536
837,1.3536
838,1.3532
839,1.3486
840,1.3432
841,1.3394
842,1.3344
843,1.3248
844,1.3217
845,1.3179
846,1.3129
847,1.3036
848,1.2967
849,1.2875
850,1.2782
851,1.2713
852,1.2621
853,1.2551
854,1.2455
855,1.2386
856,1.2293
857,1.2224
858,1.2132
859,1.2062
860,1.197
861,1.1897
862,1.1862
863,1.1851
864,1.1759
865,1.1689
866,1.1593
867,1.1524
868,1.149
869,1.1456
870,1.1383
871,1.1313
872,1.1221
873,1.1151
874,1.1059
875,1.099
876,1.0897
877,1.0828
878,1.0735
879,1.0666
880,1.0574
881,1.0504
882,1.0412
883,1.0419
884,1.0396
885,1.0327
886,1.0235
887,1.0165
888,1.0073
889,1.0027
890,1.0004
891,0.99884
892,0.99541
893,0.9919899999999999
894,0.98505
895,0.97544
896,0.9685
897,0.9612
898,0.95815
899,0.9520799999999999
900,0.94478
901,0.93748
902,0.93409
903,0.9330299999999999
904,0.92609
905,0.9168299999999999
906,0.90989
907,0.90064
908,0.8937
909,0.88444
910,0.8775
911,0.86825
912,0.86131
913,0.85205
914,0.8451200000000001
915,0.83586
916,0.82893
917,0.81931
918,0.81238
919,0.80313
920,0.79619
921,0.78657
922,0.78585
923,0.7798
924,0.77286
925,0.76361
926,0.75666
927,0.74741
928,0.74047
929,0.7308600000000001
930,0.7216100000000001
931,0.71467
932,0.70897
933,0.7056
934,0.6983
935,0.6913600000000001
936,0.68175
937,0.67481
938,0.66948
939,0.66613
940,0.6585
941,0.65155
942,0.6422899999999999
943,0.635
944,0.62574
945,0.61879
946,0.61116
947,0.60783
948,0.60252
949,0.5955699999999999
950,0.58631
951,0.57936
952,0.57009
953,0.5628
954,0.5535399999999999
955,0.5465899999999999
956,0.53733
957,0.534
958,0.53036
959,0.5234
960,0.51413
961,0.50718
962,0.49791
963,0.49096000000000006
964,0.48136
965,0.4764
966,0.47276999999999997
967,0.46748999999999996
968,0.45821000000000006
969,0.45126000000000005
970,0.44166000000000005
971,0.43638000000000005
972,0.43311000000000005
973,0.42552
974,0.41856000000000004
975,0.40928000000000003
976,0.40233
977,0.39274000000000003
978,0.38578
979,0.3765
980,0.36954000000000004
981,0.36025999999999997
982,0.35795
983,0.35563
984,0.34867
985,0.34635
986,0.34371
987,0.33412
988,0.32684
989,0.31725
990,0.30998000000000003
991,0.30301999999999996
992,0.3007
993,0.29544000000000004
994,0.28848
995,0.2792
996,0.27224
997,0.26295999999999997
998,0.256
999,0.24673
1000,0.23976999999999998
1001,0.23049
1002,0.22321999999999997
1003,0.21394000000000002
1004,0.2073
1005,0.19771
1006,0.19075
1007,0.18148
1008,0.17452
1009,0.16525
1010,0.15829000000000001
1011,0.14902
1012,0.13975
1013,0.1328
1014,0.12353
1015,0.11657000000000001
1016,0.1073
1017,0.10035
1018,0.091081
1019,0.084129
1020,0.078834
1021,0.075538
1022,0.072575
1023,0.065621
1024,0.056344000000000005
1025,0.049389999999999996
1026,0.039793
1027,0.032839
1028,0.023565
1029,0.016611
1030,0.007338600000000001
1031,0.0023786
1032,0.0010965999999999999
1033,-0.0021674
1034,-0.0033985
1035,-0.0043015
1036,-0.011564
1037,-0.018528
1038,-0.021737
1039,-0.024928
1040,-0.032184
1041,-0.039154
1042,-0.048734
1043,-0.055704
1044,-0.06091900000000001
1045,-0.064084
1046,-0.065179
1047,-0.06598
1048,-0.069091
1049,-0.071675
1050,-0.072185
1051,-0.072934
1052,-0.073908
1053,-0.074851
1054,-0.075537
1055,-0.075764
1056,-0.073433
1057,-0.064334
1058,-0.05734500000000001
1059,-0.048024000000000004
1060,-0.041032
1061,-0.034258
1062,-0.03257
1063,-0.02853
1064,-0.02174
1065,-0.012412000000000001
1066,-0.0054155
1067,0.0011825999999999998
1068,0.0029316
1069,0.0072196
1070,0.014218999999999999
1071,0.023551
1072,0.030367
1073,0.0397
1074,0.046701
1075,0.055853
1076,0.055321
1077,0.054636000000000004
1078,0.056475
1079,0.058179999999999996
1080,0.065185
1081,0.074375
1082,0.08138300000000001
1083,0.090575
1084,0.092473
1085,0.096724
1086,0.1036
1087,0.10800000000000001
1088,0.10995999999999999
1089,0.11438
1090,0.1214
1091,0.13074000000000002
1092,0.13997
1093,0.14699
1094,0.15634
1095,0.16335
1096,0.1727
1097,0.17970999999999998
1098,0.18439
1099,0.18439
1100,0.19374
1101,0.20075
1102,0.20543000000000003
1103,0.20543000000000003
1104,0.21244000000000002
1105,0.21946
1106,0.22880999999999999
1107,0.23581999999999997
1108,0.24516999999999997
1109,0.25219
1110,0.26154
1111,0.26855
1112,0.27557
1113,0.2779
1114,0.28024
1115,0.28726
1116,0.29661
1117,0.29895
1118,0.30128
1119,0.30585
1120,0.31509000000000004
1121,0.3221
1122,0.33146
1123,0.33847
1124,0.34781999999999996
1125,0.35015999999999997
1126,0.35473000000000005
1127,0.35707
1128,0.36641999999999997
1129,0.37344
1130,0.38279
1131,0.3898
1132,0.39214
1133,0.3948
1134,0.40181999999999995
1135,0.41117
1136,0.41818999999999995
1137,0.42754
1138,0.43455
1139,0.44391
1140,0.45092
1141,0.46026999999999996
1142,0.46729
1143,0.47675
1144,0.48376
1145,0.49312
1146,0.50013
1147,0.50949
1148,0.5165
1149,0.52362
1150,0.5262899999999999
1151,0.52898
1152,0.53599
1153,0.54535
1154,0.5523600000000001
1155,0.56171
1156,0.56872
1157,0.57808
1158,0.58509
1159,0.59444
1160,0.60145
1161,0.6108
1162,0.61782
1163,0.62717
1164,0.63184
1165,0.63418
1166,0.63641
1167,0.64565
1168,0.65255
1169,0.65467
1170,0.6569
1171,0.66381
1172,0.6684899999999999
1173,0.67083
1174,0.67551
1175,0.68252
1176,0.69188
1177,0.69889
1178,0.70825
1179,0.71526
1180,0.7246100000000001
1181,0.73163
1182,0.74098
1183,0.748
1184,0.75735
1185,0.76437
1186,0.77372
1187,0.78064
1188,0.78999
1189,0.79701
1190,0.80637
1191,0.81338
1192,0.8227399999999999
1193,0.82975
1194,0.83667
1195,0.83639
1196,0.8408
1197,0.84782
1198,0.8571799999999999
1199,0.86419
1200,0.87355
1201,0.8805700000000001
1202,0.88992
1203,0.89686
1204,0.9062100000000001
1205,0.9132299999999999
1206,0.9225899999999999
1207,0.92969
1208,0.93896
1209,0.94606
1210,0.95542
1211,0.96244
1212,0.9718
1213,0.98115
1214,0.9881700000000001
1215,0.9975299999999999
1216,1.0045
1217,1.0139
1218,1.0209
1219,1.0303
1220,1.0373
1221,1.0467
1222,1.0537
1223,1.063
1224,1.07
1225,1.0794
1226,1.0841
1227,1.0864
1228,1.0864
1229,1.0958
1230,1.0981
1231,1.1005
1232,1.1028
1233,1.1122
1234,1.1192
1235,1.1285
1236,1.1355
1237,1.1449
1238,1.1518
1239,1.1612
1240,1.1682
1241,1.1776
1242,1.1846
1243,1.1916
1244,1.1937
1245,1.1958
1246,1.2027
1247,1.2097
1248,1.2121
1249,1.2144
1250,1.2214
1251,1.2308
1252,1.2331
1253,1.2355
1254,1.2448
1255,1.2519
1256,1.2613
1257,1.2683
1258,1.2706
1259,1.273
1260,1.2777
1261,1.2848
1262,1.2872
1263,1.2896
1264,1.2989
1265,1.306
1266,1.3106
1267,1.3128
1268,1.3221
1269,1.3245
1270,1.3268
1271,1.3338
1272,1.3432
1273,1.3502
1274,1.3596
1275,1.3665
1276,1.3759
1277,1.3829
1278,1.3923
1279,1.3968
1280,1.3989
1281,1.4035
1282,1.4129
1283,1.4199
1284,1.4293
1285,1.4363
1286,1.4457
1287,1.4527
1288,1.462
1289,1.4691
1290,1.4784
1291,1.4854
1292,1.4948
1293,1.5018
1294,1.5112
1295,1.5159
1296,1.5205
1297,1.5276
1298,1.53
1299,1.5347
1300,1.5417
1301,1.5511
1302,1.5534
1303,1.558
1304,1.565
1305,1.5673
1306,1.5673
1307,1.5767
1308,1.5837
1309,1.5858
1310,1.5857
1311,1.588
1312,1.5879
1313,1.5878
1314,1.5877
1315,1.5876
1316,1.5875
1317,1.5875
1318,1.5852
1319,1.5851
1320,1.5827
1321,1.5826
1322,1.5826
1323,1.5732
1324,1.5662
1325,1.5569
1326,1.5498
1327,1.5475
1328,1.5451
1329,1.5405
1330,1.5334
1331,1.5311
1332,1.5288
1333,1.5241
1334,1.5171
1335,1.5077
1336,1.4983
1337,1.4913
1338,1.4819
1339,1.4749
1340,1.4656
1341,1.4585
1342,1.4492
1343,1.4422
1344,1.4328
1345,1.4258
1346,1.4164
1347,1.4141
1348,1.4117
1349,1.4047
1350,1.3953
1351,1.3883
1352,1.379
1353,1.3719
1354,1.3626
1355,1.3556
1356,1.3462
1357,1.3415
1358,1.3392
1359,1.3322
1360,1.3228
1361,1.3158
1362,1.3088
1363,1.3064
1364,1.3018
1365,1.2947
1366,1.2854
1367,1.2830000000000001
1368,1.2783
1369,1.2713
1370,1.2689
1371,1.2643
1372,1.2549
1373,1.2479
1374,1.2385
1375,1.2292
1376,1.2221
1377,1.2128
1378,1.2057
1379,1.1964
1380,1.1917
1381,1.1894
1382,1.1871
1383,1.1777
1384,1.1707
1385,1.1614
1386,1.1543
1387,1.145
1388,1.138
1389,1.1357
1390,1.1334
1391,1.1264
1392,1.1194
1393,1.11
1394,1.103
1395,1.0936
1396,1.0866
1397,1.0772
1398,1.0703
1399,1.0609
1400,1.0539
1401,1.0445
1402,1.0375
1403,1.0281
1404,1.0211
1405,1.0117
1406,1.0047
1407,0.99535
1408,0.9883299999999999
1409,0.9789700000000001
1410,0.97195
1411,0.9625600000000001
1412,0.95557
1413,0.9462
1414,0.9391799999999999
1415,0.9298200000000001
1416,0.9204600000000001
1417,0.91343
1418,0.90407
1419,0.89705
1420,0.89246
1421,0.89023
1422,0.88325
1423,0.87623
1424,0.8668600000000001
1425,0.85988
1426,0.85052
1427,0.8435
1428,0.83652
1429,0.8366600000000001
1430,0.8344600000000001
1431,0.82744
1432,0.81808
1433,0.81106
1434,0.8017
1435,0.79473
1436,0.78537
1437,0.77835
1438,0.76899
1439,0.76203
1440,0.7599199999999999
1441,0.75771
1442,0.74835
1443,0.74133
1444,0.7320399999999999
1445,0.72502
1446,0.7156600000000001
1447,0.7086399999999999
1448,0.69928
1449,0.69226
1450,0.6829
1451,0.67588
1452,0.66659
1453,0.65957
1454,0.6502100000000001
1455,0.6431899999999999
1456,0.63384
1457,0.6293
1458,0.62953
1459,0.62025
1460,0.61323
1461,0.60387
1462,0.5968600000000001
1463,0.5875
1464,0.58048
1465,0.57112
1466,0.5641
1467,0.55475
1468,0.54773
1469,0.54289
1470,0.54032
1471,0.5355
1472,0.5284800000000001
1473,0.51912
1474,0.5121
1475,0.50275
1476,0.49573
1477,0.4863
1478,0.47928000000000004
1479,0.46992
1480,0.4629
1481,0.45353999999999994
1482,0.44873
1483,0.44613
1484,0.44138999999999995
1485,0.43203
1486,0.42501000000000005
1487,0.41565
1488,0.40863
1489,0.39926999999999996
1490,0.39225
1491,0.38283
1492,0.37581
1493,0.36645
1494,0.35943
1495,0.35475
1496,0.35241
1497,0.34539000000000003
1498,0.33603
1499,0.33135
1500,0.32900999999999997
1501,0.32427
1502,0.3148
1503,0.30778
1504,0.29841999999999996
1505,0.2914
1506,0.28204
1507,0.2797
1508,0.2772
1509,0.27247
1510,0.26311
1511,0.25609
1512,0.24673
1513,0.23970999999999998
1514,0.23035
1515,0.22333000000000003
1516,0.21397
1517,0.20695
1518,0.19758
1519,0.19055999999999998
1520,0.1812
1521,0.17418
1522,0.16482
1523,0.1578
1524,0.14844000000000002
1525,0.14142000000000002
1526,0.13205999999999998
1527,0.12504
1528,0.11567999999999999
1529,0.10865999999999999
1530,0.10647999999999999
1531,0.10432000000000001
1532,0.097361
1533,0.09034299999999999
1534,0.080983
1535,0.074028
1536,0.069488
1537,0.067444
1538,0.062845
1539,0.053486
1540,0.046551
1541,0.037193000000000004
1542,0.032598
1543,0.030611000000000003
1544,0.028462
1545,0.019202
1546,0.014625999999999998
1547,0.015040000000000001
1548,0.012922
1549,0.0036805999999999996
1550,-0.00099445
1551,-0.0028624
1552,-0.0048265
1553,-0.011706999999999999
1554,-0.01872
1555,-0.020658000000000003
1556,-0.022580000000000003
1557,-0.029445
1558,-0.036453
1559,-0.045801
1560,-0.052663999999999996
1561,-0.06200800000000001
1562,-0.06667999999999999
1563,-0.06652999999999999
1564,-0.06607400000000001
1565,-0.065437
1566,-0.064938
1567,-0.064248
1568,-0.06389
1569,-0.061376
1570,-0.056340999999999995
1571,-0.053249
1572,-0.048389999999999996
1573,-0.038862
1574,-0.036135
1575,-0.032987
1576,-0.025783999999999998
1577,-0.016250999999999998
1578,-0.013065
1579,-0.010296
1580,-0.0030844
1581,0.0039046
1582,0.013226
1583,0.02044
1584,0.029761000000000003
1585,0.03675
1586,0.042082
1587,0.045097000000000005
1588,0.052317999999999996
1589,0.059539
1590,0.062819
1591,0.063551
1592,0.06688
1593,0.067652
1594,0.06870599999999999
1595,0.069513
1596,0.074712
1597,0.08168500000000001
1598,0.09098200000000001
1599,0.097958
1600,0.10753
1601,0.1145
1602,0.1238
1603,0.13078
1604,0.14007999999999998
1605,0.14322000000000001
1606,0.14899
1607,0.15596
1608,0.16526
1609,0.17223
1610,0.18152000000000001
1611,0.18849000000000002
1612,0.19779000000000002
1613,0.20476
1614,0.21406
1615,0.22103000000000003
1616,0.23033
1617,0.2373
1618,0.2466
1619,0.2559
1620,0.26287
1621,0.27216999999999997
1622,0.27915
1623,0.28844000000000003
1624,0.29541999999999996
1625,0.30472
1626,0.3117
1627,0.321
1628,0.32797
1629,0.33726999999999996
1630,0.34425
1631,0.35355
1632,0.36053
1633,0.36983
1634,0.37681
1635,0.38638
1636,0.39336
1637,0.40266
1638,0.40963999999999995
1639,0.41894
1640,0.42591999999999997
1641,0.43522
1642,0.44246
1643,0.44585
1644,0.44871000000000005
1645,0.45801000000000003
1646,0.46498999999999996
1647,0.47429
1648,0.48126
1649,0.49057
1650,0.49754
1651,0.5071100000000001
1652,0.5140899999999999
1653,0.5233899999999999
1654,0.53036
1655,0.53967
1656,0.54664
1657,0.55595
1658,0.56525
1659,0.57223
1660,0.58153
1661,0.5885100000000001
1662,0.5936899999999999
1663,0.5968100000000001
1664,0.60433
1665,0.6113
1666,0.6206
1667,0.62758
1668,0.63688
1669,0.64412
1670,0.6534300000000001
1671,0.6604
1672,0.6697
1673,0.67284
1674,0.67366
1675,0.68091
1676,0.69021
1677,0.69718
1678,0.70675
1679,0.71373
1680,0.72302
1681,0.72795
1682,0.73139
1683,0.73429
1684,0.74358
1685,0.75055
1686,0.75984
1687,0.76681
1688,0.7761100000000001
1689,0.78308
1690,0.79266
1691,0.7996300000000001
1692,0.80892
1693,0.81589
1694,0.82519
1695,0.83216
1696,0.84146
1697,0.8484299999999999
1698,0.8577299999999999
1699,0.8623700000000001
1700,0.8623700000000001
1701,0.87195
1702,0.8792
1703,0.88441
1704,0.8870100000000001
1705,0.89194
1706,0.8992
1707,0.9015200000000001
1708,0.9012399999999999
1709,0.91025
1710,0.91694
1711,0.92596
1712,0.9329299999999999
1713,0.9401799999999999
1714,0.9404600000000001
1715,0.94306
1716,0.95004
1717,0.9593299999999999
1718,0.9663
1719,0.9732700000000001
1720,0.9756
1721,0.9805299999999999
1722,0.9875
1723,0.99679
1724,1.0038
1725,1.0131
1726,1.02
1727,1.0296
1728,1.0366
1729,1.0459
1730,1.0529
1731,1.0622
1732,1.0691
1733,1.0784
1734,1.0854
1735,1.0888
1736,1.092
1737,1.1013
1738,1.1083
1739,1.1176
1740,1.1268
1741,1.1338
1742,1.1431
1743,1.1501
1744,1.1594
1745,1.1666
1746,1.1759
1747,1.1829
1748,1.1922
1749,1.1992
1750,1.2085
1751,1.2154
1752,1.2209
1753,1.2218
1754,1.2313
1755,1.2386
1756,1.2421
1757,1.2429
1758,1.2522
1759,1.2592
1760,1.2685
1761,1.2755
1762,1.2847
1763,1.2917
1764,1.3013
1765,1.3083
1766,1.3176
1767,1.3245
1768,1.3338
1769,1.3408
1770,1.3501
1771,1.3530000000000002
1772,1.3565
1773,1.3614
1774,1.371
1775,1.3739
1776,1.3751
1777,1.376
1778,1.3773
1779,1.3782
1780,1.3795
1781,1.3808
1782,1.3818
1783,1.3778
1784,1.3708
1785,1.3619
1786,1.355
1787,1.3507
1788,1.3494
1789,1.3458
1790,1.3388
1791,1.3296
1792,1.3226
1793,1.3134
1794,1.3064
1795,1.2975
1796,1.2906
1797,1.2813
1798,1.2744
1799,1.2651
1800,1.2582
1801,1.2596
1802,1.2584
1803,1.2491
1804,1.2422
1805,1.2333
1806,1.2264
1807,1.2252
1808,1.224
1809,1.2174
1810,1.2105
1811,1.2012
1812,1.1943
1813,1.1851
1814,1.1781
1815,1.1689
1816,1.162
1817,1.1527
1818,1.1458
1819,1.1366
1820,1.1273
1821,1.1204
1822,1.1112
1823,1.1047
1824,1.0954
1825,1.0885
1826,1.0793
1827,1.0723
1828,1.0631
1829,1.0562
1830,1.047
1831,1.04
1832,1.0308
1833,1.0239
1834,1.0147
1835,1.0077
1836,0.9985200000000001
1837,0.99161
1838,0.9874
1839,0.9850899999999999
1840,0.9781700000000001
1841,0.97126
1842,0.9620299999999999
1843,0.9551200000000001
1844,0.9551200000000001
1845,0.95281
1846,0.9454899999999999
1847,0.93858
1848,0.9293600000000001
1849,0.9224399999999999
1850,0.91322
1851,0.9063100000000001
1852,0.8970899999999999
1853,0.89018
1854,0.8809600000000001
1855,0.87405
1856,0.8648399999999999
1857,0.8579200000000001
1858,0.8487100000000001
1859,0.8418
1860,0.8325899999999999
1861,0.8233799999999999
1862,0.81647
1863,0.8072600000000001
1864,0.80308
1865,0.80077
1866,0.79847
1867,0.78969
1868,0.7832100000000001
1869,0.77444
1870,0.77257
1871,0.7707
1872,0.7642399999999999
1873,0.7546
1874,0.74957
1875,0.74683
1876,0.7395
1877,0.7298600000000001
1878,0.72253
1879,0.71607
1880,0.7142
1881,0.70544
1882,0.69899
1883,0.68891
1884,0.68157
1885,0.67423
1886,0.6738
1887,0.6692
1888,0.6623
1889,0.6577
1890,0.6577
1891,0.64851
1892,0.64161
1893,0.63241
1894,0.62552
1895,0.61633
1896,0.60943
1897,0.60024
1898,0.59335
1899,0.58415
1900,0.57726
1901,0.56808
1902,0.55889
1903,0.552
1904,0.54511
1905,0.54281
1906,0.54052
1907,0.53363
1908,0.52904
1909,0.52904
1910,0.51985
1911,0.5129600000000001
1912,0.50378
1913,0.4969
1914,0.48772
1915,0.48036999999999996
1916,0.47118999999999994
1917,0.46431000000000006
1918,0.4556
1919,0.44871000000000005
1920,0.43954
1921,0.43266000000000004
1922,0.42349
1923,0.41661000000000004
1924,0.40744
1925,0.40055999999999997
1926,0.39139
1927,0.38451
1928,0.37535
1929,0.36846999999999996
1930,0.35931
1931,0.35196
1932,0.34279
1933,0.33592
1934,0.32676
1935,0.31989
1936,0.31073
1937,0.30385999999999996
1938,0.2947
1939,0.29144000000000003
1940,0.28722
1941,0.27987
1942,0.27299
1943,0.26383
1944,0.25648000000000004
1945,0.24731
1946,0.24044000000000001
1947,0.23356999999999997
1948,0.23128
1949,0.2267
1950,0.21983000000000003
1951,0.21066999999999997
1952,0.21066999999999997
1953,0.20838
1954,0.20151
1955,0.19235
1956,0.18549000000000002
1957,0.17633
1958,0.16947
1959,0.16032000000000002
1960,0.15345
1961,0.1443
1962,0.14053
1963,0.13629000000000002
1964,0.12942
1965,0.12025999999999999
1966,0.11339
1967,0.10424000000000001
1968,0.097372
1969,0.08821799999999999
1970,0.081355
1971,0.076779
1972,0.076779
1973,0.067629
1974,0.065342
1975,0.063055
1976,0.056195
1977,0.047047000000000005
1978,0.040186
1979,0.031044
1980,0.024184999999999998
1981,0.015041999999999998
1982,0.005901600000000001
1983,-0.00095245
1984,-0.01009
1985,-0.016943
1986,-0.026079
1987,-0.030131
1988,-0.030335
1989,-0.031563
1990,-0.040685
1991,-0.047526
1992,-0.05664500000000001
1993,-0.06348200000000001
1994,-0.07259700000000001
1995,-0.079434
1996,-0.088547
1997,-0.09537899999999999
1998,-0.10395
1999,-0.11077999999999999
2000,-0.11988
2001,-0.12671
2002,-0.13581
2003,-0.14264000000000002
2004,-0.15229
2005,-0.15911
2006,-0.16821
2007,-0.17447000000000001
2008,-0.18357
2009,-0.19038
2010,-0.19947
2011,-0.20629
2012,-0.21538000000000002
2013,-0.22219
2014,-0.23126999999999998
2015,-0.23808
2016,-0.24716
2017,-0.25397
2018,-0.26304
2019,-0.26985
2020,-0.27892
2021,-0.28573000000000004
2022,-0.29479
2023,-0.30385999999999996
2024,-0.31066
2025,-0.31972
2026,-0.32711
2027,-0.33616999999999997
2028,-0.34237
2029,-0.35141999999999995
2030,-0.35821
2031,-0.36726
2032,-0.37405
2033,-0.3831
2034,-0.38927
2035,-0.38909
2036,-0.39236
2037,-0.40139
2038,-0.40753
2039,-0.41655
2040,-0.42041999999999996
2041,-0.42013
2042,-0.42333999999999994
2043,-0.43233
2044,-0.43908
2045,-0.44742
2046,-0.45416000000000006
2047,-0.46313999999999994
2048,-0.46921
2049,-0.46879
2050,-0.46743999999999997
2051,-0.4764
2052,-0.48243
2053,-0.49138999999999994
2054,-0.4981
2055,-0.49756000000000006
2056,-0.49546
2057,-0.49486
2058,-0.49272
2059,-0.49868
2060,-0.50463
2061,-0.50689
2062,-0.50467
2063,-0.50837
2064,-0.5165
2065,-0.52315
2066,-0.52758
2067,-0.52683
2068,-0.5238
2069,-0.5215
2070,-0.51841
2071,-0.51607
2072,-0.5145
2073,-0.5115
2074,-0.50552
2075,-0.50093
2076,-0.49273
2077,-0.48533000000000004
2078,-0.47934
2079,-0.47691999999999996
2080,-0.46871999999999997
2081,-0.46132
2082,-0.45448999999999995
2083,-0.45203999999999994
2084,-0.44245
2085,-0.43588000000000005
2086,-0.4271
2087,-0.4197
2088,-0.41092
2089,-0.40433
2090,-0.39913000000000004
2091,-0.3945
2092,-0.38986
2093,-0.38245999999999997
2094,-0.37424
2095,-0.36958
2096,-0.36136
2097,-0.35479
2098,-0.3452
2099,-0.33863000000000004
2100,-0.3326
2101,-0.32793
2102,-0.31971
2103,-0.31012
2104,-0.30544
2105,-0.30209
2106,-0.29554
2107,-0.28679
2108,-0.28023000000000003
2109,-0.27148
2110,-0.26409
2111,-0.25533
2112,-0.24875999999999998
2113,-0.24
2114,-0.23343000000000003
2115,-0.22794
2116,-0.22628
2117,-0.21669000000000002
2118,-0.21013
2119,-0.20137
2120,-0.1948
2121,-0.18520999999999999
2122,-0.17864000000000002
2123,-0.16987
2124,-0.16329000000000002
2125,-0.15507
2126,-0.15042
2127,-0.14439000000000002
2128,-0.13782
2129,-0.12822999999999998
2130,-0.12165
2131,-0.11425
2132,-0.1096
2133,-0.10055
2134,-0.09398
2135,-0.085216
2136,-0.077819
2137,-0.07178999999999999
2138,-0.067118
2139,-0.061078999999999994
2140,-0.054515
2141,-0.045758999999999994
2142,-0.038361
2143,-0.0296
2144,-0.020836
2145,-0.013437000000000001
2146,-0.0079485
2147,-0.0019114000000000002
2148,0.0068446
2149,0.014240000000000001
2150,0.023001
2151,0.028207
2152,0.033710000000000004
2153,0.03756
2154,0.046312
2155,0.052877999999999994
2156,0.062463
2157,0.069031
2158,0.074539
2159,0.077043
2160,0.085788
2161,0.092349
2162,0.10192999999999999
2163,0.1085
2164,0.11402000000000001
2165,0.11872
2166,0.12746
2167,0.13402
2168,0.1436
2169,0.15016
2170,0.15891
2171,0.16548
2172,0.17453
2173,0.17704
2174,0.18662
2175,0.19401
2176,0.19955
2177,0.20427
2178,0.213
2179,0.22039
2180,0.22913000000000003
2181,0.23651999999999998
2182,0.24208000000000002
2183,0.24814
2184,0.25687
2185,0.26644
2186,0.27299
2187,0.27989
2188,0.28462
2189,0.29201
2190,0.29855
2191,0.30813
2192,0.31468
2193,0.32074
2194,0.32545999999999997
2195,0.33153
2196,0.33807
2197,0.34498
2198,0.34973000000000004
2199,0.35581
2200,0.3632
2201,0.36927
2202,0.37404
2203,0.38011999999999996
2204,0.38664
2205,0.39621
2206,0.40274
2207,0.40926
2208,0.41403
2209,0.4175
2210,0.42402
2211,0.43358
2212,0.43836
2213,0.44403000000000004
2214,0.45053999999999994
2215,0.45881000000000005
2216,0.46143999999999996
2217,0.46713999999999994
2218,0.4698
2219,0.47336999999999996
2220,0.47986
2221,0.48941
2222,0.4912
2223,0.49695
2224,0.50649
2225,0.5138699999999999
2226,0.51748
2227,0.5202
2228,0.52385
2229,0.52659
2230,0.53028
2231,0.53305
2232,0.53678
2233,0.5395800000000001
2234,0.5433399999999999
2235,0.5461699999999999
2236,0.54997
2237,0.55283
2238,0.55666
2239,0.55955
2240,0.56342
2241,0.56634
2242,0.57025
2243,0.56698
2244,0.55848
2245,0.55211
2246,0.54461
2247,0.5413600000000001
2248,0.54322
2249,0.54099
2250,0.5325300000000001
2251,0.5261899999999999
2252,0.51774
2253,0.51242
2254,0.50398
2255,0.49765
2256,0.48922
2257,0.4829
2258,0.47345
2259,0.46713999999999994
2260,0.45871999999999996
2261,0.45241000000000003
2262,0.44723
2263,0.44205
2264,0.4326
2265,0.42316000000000004
2266,0.41685
2267,0.40844
2268,0.40536
2269,0.39916
2270,0.39284
2271,0.38442
2272,0.37811
2273,0.36867
2274,0.36236
2275,0.35396
2276,0.34873000000000004
2277,0.3425
2278,0.33624
2279,0.32783
2280,0.32152
2281,0.31209000000000003
2282,0.30579
2283,0.29739
2284,0.2911
2285,0.28589000000000003
2286,0.28279
2287,0.27545
2288,0.26915
2289,0.26075
2290,0.25445999999999996
2291,0.24503000000000003
2292,0.23874
2293,0.23035999999999998
2294,0.22408000000000003
2295,0.21570999999999999
2296,0.20944000000000002
2297,0.20108
2298,0.19583
2299,0.18954000000000001
2300,0.18325999999999998
2301,0.17489000000000002
2302,0.16862
2303,0.16027
2304,0.154
2305,0.1446
2306,0.13625
2307,0.13
2308,0.12167
2309,0.11542000000000001
2310,0.1071
2311,0.10086
2312,0.092551
2313,0.08831900000000001
2314,0.08194
2315,0.076706
2316,0.068385
2317,0.062149
2318,0.053841999999999994
2319,0.047614
2320,0.039316000000000004
2321,0.032010000000000004
2322,0.023722
2323,0.017509999999999998
2324,0.0092306
2325,0.0030276
2326,-0.0052405
2327,-0.011436
2328,-0.019834
2329,-0.025200999999999998
2330,-0.0336
2331,-0.0398
2332,-0.049164
2333,-0.055355999999999995
2334,-0.062794
2335,-0.068162
2336,-0.077527
2337,-0.083723
2338,-0.093083
2339,-0.099274
2340,-0.10670999999999999
2341,-0.11002
2342,-0.11732000000000001
2343,-0.12351
2344,-0.13177
2345,-0.13907
2346,-0.14731
2347,-0.15555
2348,-0.16078
2349,-0.16729000000000002
2350,-0.17156
2351,-0.17981
2352,-0.18599000000000002
2353,-0.19534
2354,-0.20152
2355,-0.20975
2356,-0.21591
2357,-0.22338000000000002
2358,-0.22673000000000001
2359,-0.23608
2360,-0.24225
2361,-0.25159000000000004
2362,-0.25775
2363,-0.26597
2364,-0.27212
2365,-0.27848
2366,-0.28391
2367,-0.29231
2368,-0.29846999999999996
2369,-0.30667
2370,-0.31282
2371,-0.32215
2372,-0.32829
2373,-0.33555999999999997
2374,-0.33897
2375,-0.34646
2376,-0.35261
2377,-0.3608
2378,-0.36694
2379,-0.37625
2380,-0.38238
2381,-0.39055
2382,-0.39488
2383,-0.40149
2384,-0.40876999999999997
2385,-0.41694
2386,-0.4251
2387,-0.43122
2388,-0.44051999999999997
2389,-0.44663
2390,-0.45476000000000005
2391,-0.46086000000000005
2392,-0.46812
2393,-0.47363999999999995
2394,-0.47913999999999995
2395,-0.48525
2396,-0.49338000000000004
2397,-0.49946999999999997
2398,-0.50759
2399,-0.51366
2400,-0.52176
2401,-0.52783
2402,-0.53591
2403,-0.54197
2404,-0.5512199999999999
2405,-0.5572699999999999
2406,-0.5653199999999999
2407,-0.57135
2408,-0.57576
2409,-0.58136
2410,-0.58777
2411,-0.5938100000000001
2412,-0.6018600000000001
2413,-0.6078899999999999
2414,-0.61592
2415,-0.62193
2416,-0.63116
2417,-0.6371600000000001
2418,-0.6451600000000001
2419,-0.65281
2420,-0.65966
2421,-0.66367
2422,-0.67167
2423,-0.67767
2424,-0.68688
2425,-0.69286
2426,-0.7008300000000001
2427,-0.70728
2428,-0.71295
2429,-0.72338
2430,-0.72936
2431,-0.73855
2432,-0.74452
2433,-0.7522
2434,-0.75589
2435,-0.7650899999999999
2436,-0.7710600000000001
2437,-0.78025
2438,-0.7862100000000001
2439,-0.79191
2440,-0.7975899999999999
2441,-0.8048
2442,-0.81077
2443,-0.81995
2444,-0.82591
2445,-0.83236
2446,-0.83806
2447,-0.84451
2448,-0.8504700000000001
2449,-0.85965
2450,-0.86561
2451,-0.8728
2452,-0.87851
2453,-0.88421
2454,-0.89141
2455,-0.89861
2456,-0.9043100000000001
2457,-0.91
2458,-0.9159700000000001
2459,-0.9239200000000001
2460,-0.9298700000000001
2461,-0.93904
2462,-0.9449799999999999
2463,-0.95289
2464,-0.9606100000000001
2465,-0.9675799999999999
2466,-0.97352
2467,-0.9807100000000001
2468,-0.9876799999999999
2469,-0.99339
2470,-1.0013
2471,-1.0085
2472,-1.0164
2473,-1.0224
2474,-1.0294
2475,-1.0351
2476,-1.043
2477,-1.0489
2478,-1.0581
2479,-1.064
2480,-1.071
2481,-1.0748
2482,-1.0839
2483,-1.0899
2484,-1.0968
2485,-1.1006
2486,-1.1085
2487,-1.1157
2488,-1.1236
2489,-1.1295
2490,-1.1373
2491,-1.141
2492,-1.1482
2493,-1.1541
2494,-1.1633
2495,-1.1692
2496,-1.1757
2497,-1.1814
2498,-1.1879
2499,-1.1938
2500,-1.2017
2501,-1.2076
2502,-1.2168
2503,-1.2227
2504,-1.2305
2505,-1.2343
2506,-1.2401
2507,-1.2492
2508,-1.2551
2509,-1.2643
2510,-1.2701
2511,-1.2772
2512,-1.2830000000000001
2513,-1.2921
2514,-1.298
2515,-1.3051
2516,-1.3089
2517,-1.3168
2518,-1.3226
2519,-1.3318
2520,-1.3377
2521,-1.3447
2522,-1.3525
2523,-1.3603
2524,-1.3662
2525,-1.3753
2526,-1.3812
2527,-1.3869999999999998
2528,-1.3908
2529,-1.4012
2530,-1.4084
2531,-1.4155
2532,-1.4187
2533,-1.4278
2534,-1.4337
2535,-1.4428
2536,-1.4487
2537,-1.4558
2538,-1.4596
2539,-1.4675
2540,-1.4746
2541,-1.4804
2542,-1.4843
2543,-1.4934
2544,-1.5006
2545,-1.5056
2546,-1.5114
2547,-1.5205
2548,-1.5290000000000001
2549,-1.5347
2550,-1.5412
2551,-1.5484
2552,-1.5548
2553,-1.5606
2554,-1.569
2555,-1.5762
2556,-1.5839
2557,-1.5896
2558,-1.5988
2559,-1.604
2560,-1.6109
2561,-1.6146
2562,-1.6238
2563,-1.631
2564,-1.6379
2565,-1.6424
2566,-1.6516
2567,-1.6568
2568,-1.6636
2569,-1.6669
2570,-1.6761
2571,-1.6821
2572,-1.6901
2573,-1.6973
2574,-1.7052
2575,-1.7112
2576,-1.7201
2577,-1.7246
2578,-1.7338
2579,-1.7397
2580,-1.7476
2581,-1.7536
2582,-1.7615
2583,-1.7674
2584,-1.7765
2585,-1.7824
2586,-1.7902
2587,-1.796
2588,-1.8038
2589,-1.8115
2590,-1.8173
2591,-1.825
2592,-1.8308
2593,-1.8384
2594,-1.8442
2595,-1.8518
2596,-1.8575
2597,-1.8659
2598,-1.8719
2599,-1.8784
2600,-1.8841
2601,-1.8917
2602,-1.8973
2603,-1.9048
2604,-1.9104
2605,-1.9179
2606,-1.9235
2607,-1.9308
2608,-1.9364
2609,-1.9437
2610,-1.9492
2611,-1.9564
2612,-1.9618
2613,-1.969
2614,-1.9744
2615,-1.9815
2616,-1.9868
2617,-1.9954
2618,-2.0007
2619,-2.0077
2620,-2.0129
2621,-2.0198
2622,-2.025
2623,-2.0318
2624,-2.0367
2625,-2.0448
2626,-2.0498
2627,-2.0567
2628,-2.0617
2629,-2.0685
2630,-2.0751
2631,-2.0801
2632,-2.0867
2633,-2.0916
2634,-2.0998
2635,-2.1029
2636,-2.1093
2637,-2.1141
2638,-2.1203
2639,-2.125
2640,-2.1312
2641,-2.1358
2642,-2.1418
2643,-2.1463
2644,-2.1522
2645,-2.1566
2646,-2.1624
2647,-2.1667
2648,-2.1724
2649,-2.1766
2650,-2.184
2651,-2.1881
2652,-2.1935
2653,-2.1975
2654,-2.2027
2655,-2.2066
2656,-2.2117
2657,-2.2155
2658,-2.2204
2659,-2.224
2660,-2.2288
2661,-2.2323
2662,-2.2407
2663,-2.248
2664,-2.2535
2665,-2.2569
2666,-2.2613
2667,-2.2646
2668,-2.2689
2669,-2.273
2670,-2.2782
2671,-2.2821
2672,-2.285
2673,-2.2887
2674,-2.2915
2675,-2.295
2676,-2.2976
2677,-2.3009
2678,-2.3032
2679,-2.3063
2680,-2.3063
2681,-2.3091
2682,-2.3111
2683,-2.3137
2684,-2.3156
2685,-2.3179
2686,-2.3195
2687,-2.3216
2688,-2.3231
2689,-2.3272
2690,-2.3284
2691,-2.33
2692,-2.331
2693,-2.3323
2694,-2.3332
2695,-2.3342
2696,-2.3348
2697,-2.3356
2698,-2.336
2699,-2.3365
2700,-2.3367
2701,-2.3369
2702,-2.3369
2703,-2.3369
2704,-2.3369
2705,-2.3369
2706,-2.3369
2707,-2.3369
2708,-2.3369
