time,value
0,2.7981
1,2.7173
2,2.6253
3,2.5303
4,2.4424
5,2.3506
6,2.2517
7,2.1661
8,2.0561
9,1.9796
10,1.8797
11,1.7815
12,1.6984
13,1.6081
14,1.5077
15,1.4105
16,1.3176
17,1.2254
18,1.1388
19,1.0396
20,0.94189
21,0.8518399999999999
22,0.76965
23,0.6723100000000001
24,0.57307
25,0.47441000000000005
26,0.37608
27,0.27826999999999996
28,0.1951
29,0.10926
30,-0.0023889
31,-0.085117
32,-0.18636
33,-0.29727
34,-0.40210999999999997
35,-0.49943999999999994
36,-0.59628
37,-0.69312
38,-0.7884899999999999
39,-0.91053
40,-1.0063
41,-1.1086
42,-1.2245
43,-1.3233
44,-1.4409999999999998
45,-1.5621
46,-1.6562
47,-1.7769
48,-1.8616
49,-1.8893
50,-1.8679
51,-1.8468
52,-1.8043
53,-1.7576
54,-1.7162
55,-1.6697
56,-1.6439
57,-1.5672
58,-1.4902
59,-1.4159
60,-1.3314
61,-1.2644
62,-1.1764
63,-1.1168
64,-1.0634
65,-0.9713700000000001
66,-0.9227200000000001
67,-0.87734
68,-0.82406
69,-0.75362
70,-0.76364
71,-0.80861
72,-0.7823399999999999
73,-0.7095199999999999
74,-0.6351899999999999
75,-0.56906
76,-0.49506000000000006
77,-0.42311000000000004
78,-0.37649
79,-0.4025
80,-0.38173
81,-0.34576999999999997
82,-0.31899
83,-0.27305
84,-0.2565
85,-0.27593
86,-0.37182
87,-0.44969
88,-0.51461
89,-0.59627
90,-0.67672
91,-0.7433
92,-0.81716
93,-0.81171
94,-0.8377399999999999
95,-0.77937
96,-0.71812
97,-0.6552600000000001
98,-0.5916899999999999
99,-0.53846
100,-0.48633999999999994
101,-0.42168
102,-0.3558
103,-0.36707
104,-0.41276
105,-0.40556
106,-0.37069
107,-0.28502
108,-0.24427
109,-0.16287000000000001
110,-0.091465
111,-0.035167000000000004
112,0.026907
113,0.080065
114,0.065201
115,0.0028088
116,-0.045074
117,-0.021588
118,0.035646
119,0.092514
120,0.16875
121,0.22573000000000001
122,0.30346999999999996
123,0.38256999999999997
124,0.4536
125,0.48378999999999994
126,0.48698
127,0.5602
128,0.63461
129,0.70548
130,0.77264
131,0.8355
132,0.8976200000000001
133,0.91466
134,0.9759700000000001
135,1.0454
136,1.0936
137,1.1338
138,1.1256
139,1.0746
140,0.9936299999999999
141,0.90425
142,0.81845
143,0.73169
144,0.64304
145,0.56033
146,0.5029600000000001
147,0.46074
148,0.37753000000000003
149,0.29234
150,0.20478
151,0.11367000000000001
152,0.028098
153,-0.044828
154,-0.05570800000000001
155,-0.094346
156,-0.15389
157,-0.23986
158,-0.3305
159,-0.41341999999999995
160,-0.49283000000000005
161,-0.58297
162,-0.6661
163,-0.74455
164,-0.83678
165,-0.9074399999999999
166,-0.9830899999999999
167,-1.0319
168,-1.0742
169,-1.0475
170,-0.98936
171,-0.89544
172,-0.8264299999999999
173,-0.7166
174,-0.6081300000000001
175,-0.5098199999999999
176,-0.48345
177,-0.5332899999999999
178,-0.49027
179,-0.41202
180,-0.31943
181,-0.23262
182,-0.15106
183,-0.11342999999999999
184,-0.058047
185,0.016474000000000003
186,0.05256
187,0.14109000000000002
188,0.22418000000000002
189,0.22601
190,0.18355
191,0.13765
192,0.081798
193,0.045582
194,0.072045
195,0.15058
196,0.24341999999999997
197,0.30512
198,0.38051
199,0.4119
200,0.39074000000000003
201,0.4573
202,0.53988
203,0.61027
204,0.67218
205,0.68174
206,0.6913600000000001
207,0.76793
208,0.8385
209,0.9150799999999999
210,0.98855
211,1.0505
212,1.1066
213,1.1821
214,1.2486
215,1.3265
216,1.4125
217,1.4326
218,1.4331
219,1.4098
220,1.2957
221,1.2361
222,1.1668
223,1.1054
224,1.0016
225,0.9202100000000001
226,0.80857
227,0.7367100000000001
228,0.74417
229,0.7444
230,0.66914
231,0.55883
232,0.44341
233,0.35497
234,0.29971
235,0.21652
236,0.12124000000000001
237,0.057377
238,0.045732999999999996
239,0.10485
240,0.046766
241,0.11215
242,0.19462000000000002
243,0.23304
244,0.20898000000000003
245,0.16622
246,0.098784
247,0.044229000000000004
248,-0.060679
249,-0.087001
250,-0.17632
251,-0.27482
252,-0.35853
253,-0.46296000000000004
254,-0.47884
255,-0.48568
256,-0.53874
257,-0.63842
258,-0.6807300000000001
259,-0.76335
260,-0.8481299999999999
261,-0.9291299999999999
262,-0.9994299999999999
263,-0.9308799999999999
264,-0.84399
265,-0.76061
266,-0.66341
267,-0.5769
268,-0.46947
269,-0.38031
270,-0.28185
271,-0.18199
272,-0.084799
273,-0.0009298
274,-0.006233
275,0.020199
276,0.10046000000000001
277,0.18912
278,0.27976
279,0.35801
280,0.44316000000000005
281,0.53745
282,0.63574
283,0.69202
284,0.75741
285,0.8422799999999999
286,0.91094
287,0.9948100000000001
288,1.0947
289,1.1404
290,1.0833
291,1.0116
292,0.95011
293,0.88294
294,0.8383700000000001
295,0.7965300000000001
296,0.72075
297,0.64188
298,0.5587
299,0.50466
300,0.51307
301,0.45502
302,0.38602
303,0.31351999999999997
304,0.2481
305,0.24416
306,0.27760999999999997
307,0.2177
308,0.15688
309,0.088042
310,0.024856
311,0.075671
312,0.13405
313,0.20004
314,0.16252
315,0.11054000000000001
316,0.06593500000000001
317,0.0053381
318,-0.017991999999999998
319,-0.073535
320,-0.13365
321,-0.20488
322,-0.27418000000000003
323,-0.35070999999999997
324,-0.36915
325,-0.29545
326,-0.32654
327,-0.41207
328,-0.49891
329,-0.55785
330,-0.64412
331,-0.72443
332,-0.78268
333,-0.82115
334,-0.74382
335,-0.67387
336,-0.5837399999999999
337,-0.50178
338,-0.42643000000000003
339,-0.34652
340,-0.32003000000000004
341,-0.36772
342,-0.41689
343,-0.45876999999999996
344,-0.44373999999999997
345,-0.48981
346,-0.54584
347,-0.6279600000000001
348,-0.61282
349,-0.6239899999999999
350,-0.68599
351,-0.75253
352,-0.8320299999999999
353,-0.92717
354,-1.0208
355,-1.1027
356,-1.0993
357,-1.1397
358,-1.1763
359,-1.2285
360,-1.2719
361,-1.3413
362,-1.4251
363,-1.5012
364,-1.5831
365,-1.6585
366,-1.6957
367,-1.7512
368,-1.787
369,-1.75
370,-1.8151
371,-1.8334
372,-1.8784
373,-1.9046
374,-1.9080000000000001
375,-1.9578
376,-1.9436
377,-1.8609
378,-1.758
379,-1.6367
380,-1.5155
381,-1.3947
382,-1.3005
383,-1.1794
384,-1.0851
385,-0.96925
386,-0.86934
387,-0.7746
388,-0.67538
389,-0.55793
390,-0.46279
391,-0.36748000000000003
392,-0.27198
393,-0.17624
394,-0.080403
395,0.015775
396,0.11208
397,0.2087
398,0.30554000000000003
399,0.39327
400,0.47279
401,0.57011
402,0.66746
403,0.7651399999999999
404,0.8558399999999999
405,0.93794
406,1.032
407,1.1299
408,1.2221
409,1.3042
410,1.3980000000000001
411,1.4969999999999999
412,1.5944
413,1.6872
414,1.7689
415,1.8646
416,1.963
417,2.0614
418,2.1526
419,2.2359
420,2.3316
421,2.431
422,2.5256
423,2.6139
424,2.7016
425,2.7769
426,2.7975
