time,value
0,1.383
1,1.2807
2,1.0805
3,0.86621
4,0.6825100000000001
5,0.57396
6,0.39703
7,0.27326999999999996
8,0.1745
9,0.077855
10,-0.025602
11,-0.17545
12,-0.30162
13,-0.4505
14,-0.653
15,-0.81113
16,-0.88595
17,-0.9647899999999999
18,-0.83606
19,-0.70011
20,-0.57099
21,-0.4346
22,-0.28805
23,-0.20539000000000002
24,-0.062811
25,0.039708
26,0.1514
27,0.27648
28,0.214
29,0.2709
30,0.35108
31,0.49799
32,0.56598
33,0.64842
34,0.8288200000000001
35,0.9214700000000001
36,0.8839899999999999
37,1.0211
38,1.2115
39,1.3672
40,1.5145
41,1.5684
42,1.7331
43,1.906
44,2.0896
45,2.0812
46,1.9388
47,1.7936
48,1.6303
49,1.4838
50,1.3468
51,1.2032
52,1.0643
53,0.92538
54,0.79671
55,0.66835
56,0.51581
57,0.38723
58,0.2367
59,0.10819000000000001
60,-0.00012289
61,-0.12136
62,-0.18014000000000002
63,-0.31024
64,-0.43821000000000004
65,-0.58932
66,-0.73575
67,-0.8610200000000001
68,-0.9793799999999999
69,-1.0759999999999998
70,-1.1263
71,-1.2537
72,-1.4111
73,-1.4608
74,-1.3731
75,-1.3713
76,-1.307
77,-1.247
78,-1.0916
79,-0.951
80,-0.88613
81,-0.7216
82,-0.7246199999999999
83,-0.62793
84,-0.50352
85,-0.42715
86,-0.32608000000000004
87,-0.23215
88,-0.16177
89,-0.077224
90,0.031039999999999998
91,0.15717
92,0.19515
93,0.30714
94,0.40205
95,0.27208000000000004
96,0.18085
97,0.11325999999999999
98,0.065236
99,0.068224
100,-0.03775
101,-0.18253
102,-0.11499000000000001
103,-0.29922
104,-0.27086
105,-0.37055
106,-0.43512
107,-0.5239199999999999
108,-0.62271
109,-0.6182
110,-0.71792
111,-0.8325799999999999
112,-0.9171299999999999
113,-1.0884
114,-1.2301
115,-1.3255
116,-1.4651
117,-1.4323
118,-1.32
119,-1.1527
120,-1.0288
121,-0.9829200000000001
122,-0.87679
123,-0.8164899999999999
124,-0.6364
125,-0.50856
126,-0.34868000000000005
127,-0.20669
128,-0.054453999999999995
129,0.098223
130,0.25008
131,0.40719
132,0.54702
133,0.7059
134,0.7397100000000001
135,0.86805
136,1.0198
137,1.1612
138,1.3329
139,1.4808
140,1.6207
141,1.7819999999999998
142,1.9479
143,2.0576
144,1.9603
145,1.8036
146,1.6269
147,1.4824
148,1.3551
149,1.3051
150,1.1483
151,1.0121
152,0.9655600000000001
153,0.9034399999999999
154,0.7736
155,0.68337
156,0.56796
157,0.52859
158,0.40935
159,0.34804
160,0.24364
161,0.2229
162,0.26344
163,0.11719
164,0.009475299999999999
165,-0.12535
166,-0.25925
167,-0.36664
168,-0.4944
169,-0.62958
170,-0.73822
171,-0.8779
172,-0.8513200000000001
173,-0.9792
174,-0.86715
175,-0.73988
176,-0.5279699999999999
177,-0.36383000000000004
178,-0.21420999999999998
179,-0.032175999999999996
180,0.13374
181,0.2343
182,0.18566
183,0.37799999999999995
184,0.60307
185,0.78209
186,0.94704
187,1.1685
188,1.369
189,1.3379
190,1.2158
191,1.0925
192,1.0291
193,0.9142899999999999
194,0.77764
195,0.65933
196,0.68406
197,0.58231
198,0.46353
199,0.35983000000000004
200,0.35709
201,0.35833000000000004
202,0.30108
203,0.20268
204,0.11955999999999999
205,0.017778
206,-0.090987
207,-0.0308
208,0.087523
209,-0.010874
210,-0.10313
211,-0.18112999999999999
212,-0.27992
213,-0.30123
214,-0.31285
215,-0.41246000000000005
216,-0.50425
217,-0.6149899999999999
218,-0.75246
219,-0.88149
220,-0.93099
221,-1.0157
222,-0.9384100000000001
223,-0.8311799999999999
224,-0.69817
225,-0.63079
226,-0.45987
227,-0.35802
228,-0.29865
229,-0.15350999999999998
230,-0.0098662
231,-0.042341000000000004
232,0.073385
233,0.22491999999999998
234,0.35389
235,0.47586999999999996
236,0.64754
237,0.69797
238,0.5716600000000001
239,0.47239
240,0.36516
241,0.21506999999999998
242,0.34734
243,0.27155
244,0.12673
245,0.055675
246,0.11389
247,0.052329999999999995
248,-0.023341999999999998
249,-0.14775
250,-0.2357
251,-0.16613
252,-0.28169
253,-0.4111
254,-0.54262
255,-0.69206
256,-0.82339
257,-0.9560200000000001
258,-0.80835
259,-0.63331
260,-0.5158
261,-0.40610999999999997
262,-0.32191
263,-0.39933
264,-0.51441
265,-0.62688
266,-0.7418600000000001
267,-0.82031
268,-0.93068
269,-1.0432
270,-1.1709
271,-1.2895
272,-1.4079
273,-1.3145
274,-1.3667
275,-1.446
276,-1.5262
277,-1.6399
278,-1.7482
279,-1.8614
280,-1.8416
281,-1.7278
282,-1.5996
283,-1.3734
284,-1.1471
285,-0.92829
286,-0.7964899999999999
287,-0.6210600000000001
288,-0.39475
289,-0.1686
290,0.057524
291,0.23263000000000003
292,0.45883999999999997
293,0.68503
294,0.9111899999999999
295,1.1374
296,1.3635
297,1.5898
298,1.8161
299,2.0025
300,2.2178
301,2.3934
302,2.6196
303,2.7956
304,2.9567
305,2.9514
306,2.9646
307,2.8176
308,2.6984
309,2.4763
310,2.2843
311,2.117
312,1.9874
313,1.786
314,1.5828
315,1.4052
316,1.1786
317,0.95395
318,0.7278100000000001
319,0.50237
320,0.29281999999999997
321,0.10273
322,-0.07284700000000001
323,-0.29841999999999996
324,-0.47213
325,-0.6979
326,-0.9220700000000001
327,-1.1461
328,-1.3697
329,-1.5631
330,-1.4079
331,-1.4287
332,-1.656
333,-1.6774
334,-1.8974
335,-2.1127
336,-2.1814
337,-2.2111
338,-2.0704
339,-1.9298
340,-1.8416
341,-1.7169
342,-1.5787
343,-1.5276
344,-1.4105
345,-1.291
346,-1.1747
347,-1.1279
348,-1.0339
349,-0.89705
350,-0.79806
351,-0.6714600000000001
352,-0.70939
353,-0.7931699999999999
354,-0.9754200000000001
355,-0.9828600000000001
356,-0.8206700000000001
357,-0.66491
358,-0.57803
359,-0.45031000000000004
360,-0.34302
361,-0.25369
362,-0.21333000000000002
363,-0.076576
364,0.014891
365,0.10583
366,0.047619999999999996
367,-0.06904199999999999
368,0.089985
369,0.18024
370,0.24155
371,0.29851
372,0.37445
373,0.45088999999999996
374,0.3707
375,0.42595
376,0.5004
377,0.6077199999999999
378,0.68129
379,0.73975
380,0.84603
381,0.93674
382,0.80019
383,0.6249600000000001
384,0.45498999999999995
385,0.31545
386,0.12805
387,-0.011004
388,-0.074139
389,-0.2234
390,-0.4056
391,-0.59039
392,-0.73773
393,-0.91605
394,-1.0222
395,-1.1843
396,-1.2861
397,-1.1932
398,-1.0719
399,-0.94591
400,-0.8722
401,-0.80821
402,-0.72137
403,-0.59495
404,-0.47865
405,-0.37853000000000003
406,-0.26719
407,-0.18464
408,-0.2727
409,-0.19024000000000002
410,-0.17331
411,-0.065635
412,0.019187
413,0.0084744
414,0.12029000000000001
415,0.22393000000000002
416,0.34515
417,0.34959
418,0.46915
419,0.57093
420,0.6764600000000001
421,0.75666
422,0.8875
423,1.0249
424,1.1108
425,1.2415
426,1.3555
