time,value
0,1.0292
1,1.0292
2,1.0292
3,1.0292
4,0.87534
5,1.0292
6,-0.9715299999999999
7,-0.9715299999999999
8,-0.9715299999999999
9,-0.9715299999999999
10,-0.9715299999999999
11,-0.9715299999999999
12,1.1832
13,1.3371
14,1.0292
15,1.0292
16,0.25972
17,-0.9715299999999999
18,-0.9715299999999999
19,-0.9715299999999999
20,-0.9715299999999999
21,-0.9715299999999999
22,0.25972
23,1.3371
24,1.0292
25,1.0292
26,-0.048096
27,-0.9715299999999999
28,-0.9715299999999999
29,-0.9715299999999999
30,-0.9715299999999999
31,-0.9715299999999999
32,0.56753
33,1.3371
34,1.0292
35,1.0292
36,1.0292
37,-0.9715299999999999
38,-0.9715299999999999
39,-0.9715299999999999
40,-0.9715299999999999
41,-0.9715299999999999
42,-0.048096
43,1.4909999999999999
44,1.0292
45,1.1832
46,1.0292
47,0.87534
48,-0.50981
49,-0.9715299999999999
50,-0.9715299999999999
51,-0.9715299999999999
52,-0.9715299999999999
53,-0.9715299999999999
54,1.3371
55,1.1832
56,1.0292
57,1.0292
58,0.25972
59,-0.9715299999999999
60,-0.9715299999999999
61,-0.9715299999999999
62,-0.9715299999999999
63,-0.9715299999999999
64,1.0292
65,1.3371
66,1.0292
67,1.0292
68,0.41362
69,-0.9715299999999999
70,-0.9715299999999999
71,-0.9715299999999999
72,-0.9715299999999999
73,-0.9715299999999999
74,-0.9715299999999999
75,1.3371
76,1.3371
77,1.0292
78,1.0292
79,1.0292
80,0.41362
81,-0.9715299999999999
82,-0.9715299999999999
83,-0.9715299999999999
84,-0.9715299999999999
85,-0.9715299999999999
86,0.87534
87,1.3371
88,1.0292
89,1.0292
90,1.0292
91,-0.9715299999999999
92,-0.9715299999999999
93,-0.9715299999999999
94,-0.9715299999999999
95,-0.9715299999999999
