[<text>
<title>oecd europe zinc stocks rise in january</title>
<dateline>    london, march 19 - </dateline>producers zinc stocks in organization
for economic co-operation and development (oecd) european
countries rose to 159,732 tonnes in january from 151,171 in
december and 127,725 in january 1986, latest international lead
and zinc study group (ilzsg) figures show. other figures were -
                      jan'87  dec'86   jan'86
 refined production   155,980 164,243 166,968
 refined deliveries   131,910 122,364 136,727
 mine output (metal
 content)              77,120 70,560  81,356
 reuter
</text>]