time,value
0,1.3081
1,0.63348
2,-1.0049
3,-1.0049
4,0.055215999999999994
5,1.3081
6,0.055215999999999994
7,-1.0049
8,-1.0049
9,0.055215999999999994
10,1.3081
11,0.15159
12,-1.0049
13,-1.0049
14,-0.7158100000000001
15,1.4045
16,0.9226200000000001
17,-1.0049
18,-1.0049
19,-1.0049
20,-0.13754
21,1.3081
22,0.82624
23,-1.0049
24,-1.0049
25,-1.0049
26,-1.0049
27,0.34435
28,1.3081
29,0.9226200000000001
30,-1.0049
31,-1.0049
32,-1.0049
33,-1.0049
34,0.055215999999999994
35,1.3081
36,1.3081
37,-0.7158100000000001
38,-1.0049
39,-1.0049
40,-1.0049
41,1.2118
42,1.3081
43,0.15159
44,-1.0049
45,-1.0049
46,-1.0049
47,-1.0049
48,0.055215999999999994
49,1.3081
50,1.3081
51,-0.61943
52,-1.0049
53,-1.0049
54,-1.0049
55,0.15159
56,1.3081
57,1.3081
58,0.15159
59,-1.0049
60,-1.0049
61,-1.0049
62,-1.0049
63,0.24796999999999997
64,1.3081
65,1.3081
66,0.63348
67,-1.0049
68,-1.0049
69,-1.0049
70,-0.041161
71,1.3081
72,1.3081
73,0.5371100000000001
74,-1.0049
75,-1.0049
76,-1.0049
77,1.5009
78,1.3081
79,1.2118
80,0.24796999999999997
81,-1.0049
82,-1.0049
83,0.9226200000000001
84,1.3081
85,1.2118
86,1.2118
87,1.2118
88,1.1154
89,-0.61943
90,-1.0049
91,-1.0049
92,0.15159
93,1.2118
94,1.2118
95,0.7298600000000001
