time,value
0,-0.31611999999999996
1,-0.46636000000000005
2,-0.31611999999999996
3,-0.31611999999999996
4,-0.31611999999999996
5,-0.46636000000000005
6,-0.31611999999999996
7,-0.31611999999999996
8,-0.31611999999999996
9,-0.46636000000000005
10,-0.31611999999999996
11,-0.31611999999999996
12,-0.31611999999999996
13,-0.46636000000000005
14,-0.31611999999999996
15,-0.31611999999999996
16,-0.31611999999999996
17,-0.31611999999999996
18,-0.46636000000000005
19,-0.31611999999999996
20,-0.31611999999999996
21,-0.31611999999999996
22,-0.46636000000000005
23,-0.31611999999999996
24,-0.31611999999999996
25,-0.31611999999999996
26,-0.46636000000000005
27,-0.31611999999999996
28,-0.31611999999999996
29,-0.31611999999999996
30,-0.46636000000000005
31,-0.31611999999999996
32,-0.31611999999999996
33,-0.31611999999999996
34,-0.46636000000000005
35,-0.31611999999999996
36,-0.31611999999999996
37,-0.31611999999999996
38,-0.46636000000000005
39,-0.31611999999999996
40,-0.31611999999999996
41,-0.31611999999999996
42,-0.46636000000000005
43,-0.31611999999999996
44,-0.31611999999999996
45,-0.31611999999999996
46,-0.31611999999999996
47,-0.46636000000000005
48,-0.31611999999999996
49,-0.31611999999999996
50,-0.31611999999999996
51,-0.46636000000000005
52,-0.31611999999999996
53,-0.31611999999999996
54,-0.31611999999999996
55,-0.46636000000000005
56,-0.31611999999999996
57,-0.31611999999999996
58,-0.31611999999999996
59,-0.46636000000000005
60,-0.31611999999999996
61,-0.31611999999999996
62,-0.31611999999999996
63,-0.46636000000000005
64,-0.31611999999999996
65,-0.31611999999999996
66,-0.31611999999999996
67,-0.46636000000000005
68,-0.31611999999999996
69,-0.31611999999999996
70,-0.31611999999999996
71,-0.46636000000000005
72,-0.31611999999999996
73,-0.31611999999999996
74,-0.31611999999999996
75,-0.31611999999999996
76,-0.31611999999999996
77,-0.31611999999999996
78,-0.31611999999999996
79,-0.31611999999999996
80,1.1862
81,2.8388
82,2.6886
83,2.8388
84,2.9891
85,2.8388
86,2.8388
87,2.6886
88,3.1393
89,3.2895
90,2.5384
91,-0.46636000000000005
92,-0.31611999999999996
93,-0.31611999999999996
94,-0.31611999999999996
95,-0.46636000000000005
