time,value
0,-0.18635
1,-0.18635
2,-0.18635
3,-0.18635
4,-0.18635
5,-0.18635
6,-0.18635
7,-0.18635
8,-0.18635
9,-0.18635
10,-0.18635
11,-0.18635
12,-0.18635
13,-0.18635
14,-0.18635
15,-0.18635
16,-0.18635
17,-0.18635
18,-0.18635
19,-0.18635
20,-0.18635
21,-0.18635
22,-0.18635
23,-0.18635
24,-0.18635
25,-0.18635
26,-0.18635
27,-0.18635
28,-0.18635
29,-0.18635
30,-0.18635
31,-0.18635
32,-0.18635
33,-0.18635
34,-0.18635
35,-0.18635
36,-0.18635
37,-0.18635
38,-0.18635
39,-0.18635
40,-0.18635
41,-0.18635
42,-0.18635
43,-0.18635
44,-0.18635
45,-0.18635
46,-0.18635
47,-0.18635
48,-0.18635
49,-0.18635
50,-0.18635
51,-0.18635
52,-0.18635
53,-0.18635
54,-0.18635
55,-0.18635
56,-0.18635
57,-0.18635
58,-0.18635
59,-0.18635
60,-0.18635
61,-0.18635
62,-0.18635
63,-0.18635
64,-0.18635
65,-0.18635
66,-0.18635
67,-0.18635
68,-0.18635
69,-0.18635
70,-0.18635
71,-0.18635
72,-0.18635
73,-0.18635
74,-0.18635
75,-0.18635
76,-0.18635
77,-0.18635
78,-0.18635
79,-0.18635
80,-0.18635
81,6.5762
82,6.0651
83,3.1556
84,1.347
85,-0.18635
86,-0.18635
87,-0.18635
88,-0.18635
89,-0.18635
90,-0.18635
91,-0.18635
92,-0.18635
93,-0.18635
94,-0.18635
95,-0.18635
