time,value
0,-2.2771
1,-2.2771
2,-2.2771
3,-2.2771
4,-2.2771
5,-2.2788
6,-2.2788
7,-2.2788
8,-2.2785
9,-2.2783
10,-2.2779
11,-2.2773
12,-2.2767
13,-2.2815
14,-2.2880000000000003
15,-2.287
16,-2.2861
17,-2.2851
18,-2.2838
19,-2.2826
20,-2.2812
21,-2.2795
22,-2.278
23,-2.2764
24,-2.2742
25,-2.2724
26,-2.2705
27,-2.2680000000000002
28,-2.2675
29,-2.2653
30,-2.2624
31,-2.2601
32,-2.2576
33,-2.2544
34,-2.2533
35,-2.2572
36,-2.2604
37,-2.2568
38,-2.2539
39,-2.2509
40,-2.2485
41,-2.2453
42,-2.242
43,-2.2379
44,-2.233
45,-2.2296
46,-2.2251
47,-2.2215
48,-2.2179
49,-2.2146
50,-2.2108
51,-2.2069
52,-2.2043
53,-2.2087
54,-2.2083
55,-2.2032
56,-2.199
57,-2.1948
58,-2.1905
59,-2.1851
60,-2.1807
61,-2.1763
62,-2.1707
63,-2.1661
64,-2.1616
65,-2.157
66,-2.1523
67,-2.1476
68,-2.1417
69,-2.1369
70,-2.1321
71,-2.126
72,-2.1269
73,-2.1302
74,-2.1239
75,-2.1189
76,-2.1138
77,-2.1074
78,-2.1023
79,-2.0971
80,-2.0919
81,-2.0854
82,-2.0801
83,-2.0759
84,-2.0692
85,-2.0639
86,-2.0585
87,-2.0518
88,-2.051
89,-2.0535
90,-2.0476
91,-2.0421
92,-2.0365
93,-2.0296
94,-2.024
95,-2.0193
96,-2.0123
97,-2.0066
98,-2.0009
99,-1.9938
100,-1.9881
101,-1.9824
102,-1.9798
103,-1.9826
104,-1.9768
105,-1.9709999999999999
106,-1.9637
107,-1.9578
108,-1.952
109,-1.9446
110,-1.9387
111,-1.9328
112,-1.9262
113,-1.9203
114,-1.9143
115,-1.9069
116,-1.9046
117,-1.9046
118,-1.9016
119,-1.8956
120,-1.8895
121,-1.882
122,-1.8766
123,-1.8705
124,-1.8629
125,-1.8568
126,-1.8514
127,-1.849
128,-1.8493
129,-1.8432
130,-1.837
131,-1.8293
132,-1.8231
133,-1.8169
134,-1.8092
135,-1.8030000000000002
136,-1.7968
137,-1.7896
138,-1.7834
139,-1.7771
140,-1.7693
141,-1.7674
142,-1.7682
143,-1.7625
144,-1.7562
145,-1.75
146,-1.7421
147,-1.7358
148,-1.7295
149,-1.7232
150,-1.7153
151,-1.7089
152,-1.7026
153,-1.6947
154,-1.6884
155,-1.682
156,-1.6741
157,-1.6677
158,-1.6614
159,-1.6534
160,-1.6471
161,-1.6407
162,-1.6332
163,-1.6269
164,-1.6205
165,-1.6125
166,-1.6066
167,-1.6069
168,-1.6031
169,-1.5967
170,-1.5903
171,-1.5838
172,-1.5758
173,-1.5694
174,-1.5629
175,-1.5549
176,-1.5484
177,-1.5419999999999998
178,-1.5339
179,-1.5275
180,-1.521
181,-1.5130000000000001
182,-1.5065
183,-1.5
184,-1.492
185,-1.4855
186,-1.479
187,-1.4709
188,-1.4649
189,-1.4584
190,-1.4503
191,-1.4438
192,-1.4373
193,-1.4309
194,-1.4296
195,-1.4272
196,-1.4207
197,-1.4125
198,-1.406
199,-1.3995
200,-1.3918
201,-1.3852
202,-1.3787
203,-1.3702
204,-1.3637
205,-1.3572
206,-1.349
207,-1.3425
208,-1.3359
209,-1.3278
210,-1.3212
211,-1.3147
212,-1.3065
213,-1.3
214,-1.2935
215,-1.2869
216,-1.2787
217,-1.2757
218,-1.2729
219,-1.2648
220,-1.2582
221,-1.2517
222,-1.2435
223,-1.2366
224,-1.2301
225,-1.2219
226,-1.2154
227,-1.2088
228,-1.2007
229,-1.1967
230,-1.1936
231,-1.1867
232,-1.1802
233,-1.1736
234,-1.1651
235,-1.1585
236,-1.1520000000000001
237,-1.1438
238,-1.1408
239,-1.1348
240,-1.1282
241,-1.1201
242,-1.1132
243,-1.1066
244,-1.0985
245,-1.0919
246,-1.0866
247,-1.0832
248,-1.0779
249,-1.0714
250,-1.0632
251,-1.0563
252,-1.0498
253,-1.0416
254,-1.0351
255,-1.0311
256,-1.028
257,-1.0211
258,-1.0146
259,-1.0064
260,-0.9998600000000001
261,-0.9929600000000001
262,-0.9864299999999999
263,-0.97825
264,-0.9739
265,-0.9691700000000001
266,-0.961
267,-0.9541
268,-0.94757
269,-0.94409
270,-0.9400799999999999
271,-0.9335600000000001
272,-0.9253899999999999
273,-0.9184899999999999
274,-0.9119700000000001
275,-0.90507
276,-0.90194
277,-0.89792
278,-0.8897700000000001
279,-0.8832399999999999
280,-0.87672
281,-0.86819
282,-0.86166
283,-0.85513
284,-0.84949
285,-0.84434
286,-0.8378200000000001
287,-0.8313
288,-0.82314
289,-0.81662
290,-0.81009
291,-0.80156
292,-0.79503
293,-0.7885
294,-0.78033
295,-0.7738
296,-0.76817
297,-0.7630399999999999
298,-0.75815
299,-0.75162
300,-0.74346
301,-0.73693
302,-0.7304
303,-0.72223
304,-0.7157
305,-0.7088
306,-0.70227
307,-0.6944600000000001
308,-0.68792
309,-0.68102
310,-0.67285
311,-0.6663100000000001
312,-0.65977
313,-0.65159
314,-0.64541
315,-0.63886
316,-0.63068
317,-0.6241300000000001
318,-0.61758
319,-0.6094
320,-0.60285
321,-0.5963
322,-0.58811
323,-0.58155
324,-0.575
325,-0.56681
326,-0.56025
327,-0.55369
328,-0.54714
329,-0.53894
330,-0.53238
331,-0.52582
332,-0.51762
333,-0.5110600000000001
334,-0.50449
335,-0.49628999999999995
336,-0.48972
337,-0.48316000000000003
338,-0.47495
339,-0.46838
340,-0.46182
341,-0.4536
342,-0.44703999999999994
343,-0.44046
344,-0.43225
345,-0.42536
346,-0.41878999999999994
347,-0.41057
348,-0.40399999999999997
349,-0.39742
350,-0.39085
351,-0.38263
352,-0.37605
353,-0.36948000000000003
354,-0.36157
355,-0.35499
356,-0.34841
357,-0.34018000000000004
358,-0.3336
359,-0.32928
360,-0.32824000000000003
361,-0.32165
362,-0.31506999999999996
363,-0.30683
364,-0.30025
365,-0.29531
366,-0.29111
367,-0.28752
368,-0.28093
369,-0.2727
370,-0.26611
371,-0.25952
372,-0.25129
373,-0.24964
374,-0.24634
375,-0.2414
376,-0.23975
377,-0.23481
378,-0.22821999999999998
379,-0.21969
380,-0.21309
381,-0.2065
382,-0.20097
383,-0.19902999999999998
384,-0.19408
385,-0.18584
386,-0.17925
387,-0.17265999999999998
388,-0.17101
389,-0.16859000000000002
390,-0.16199000000000002
391,-0.15375
392,-0.14715
393,-0.14055
394,-0.13230999999999998
395,-0.12571
396,-0.12240999999999999
397,-0.11911
398,-0.11416
399,-0.10755999999999999
400,-0.10425999999999999
401,-0.10096000000000001
402,-0.094361
403,-0.08776
404,-0.07950700000000001
405,-0.073184
406,-0.066581
407,-0.058325999999999996
408,-0.051722000000000004
409,-0.044842
410,-0.036586
411,-0.02998
412,-0.023375999999999997
413,-0.016769
414,-0.014016999999999998
415,-0.011531
416,-0.003278
417,0.003324
418,0.009927
419,0.016808
420,0.025063
421,0.031665
422,0.038271
423,0.041313
424,0.045176
425,0.051777
426,0.060309
427,0.06691
428,0.06940700000000001
429,0.0722
430,0.078795
431,0.08567999999999999
432,0.093927
433,0.098376
434,0.10255
435,0.11079000000000001
436,0.11767000000000001
437,0.12455999999999999
438,0.12933
439,0.13292
440,0.13951
441,0.14639000000000002
442,0.15299000000000001
443,0.15582000000000001
444,0.15837
445,0.16660999999999998
446,0.17349
447,0.18008
448,0.18458
449,0.18879
450,0.19538
451,0.20390999999999998
452,0.21049
453,0.21336999999999998
454,0.21759
455,0.22448
456,0.23106
457,0.2396
458,0.24249
459,0.24641
460,0.25494
461,0.26152
462,0.2681
463,0.271
464,0.27525
465,0.28181999999999996
466,0.2884
467,0.29661
468,0.3035
469,0.31008
470,0.3183
471,0.32355
472,0.32482
473,0.32808000000000004
474,0.32938
475,0.33464
476,0.34317
477,0.34974
478,0.35499
479,0.35828000000000004
480,0.36354000000000003
481,0.3701
482,0.37831
483,0.38487
484,0.39176
485,0.39997
486,0.40653
487,0.4131
488,0.41967
489,0.42427
490,0.42821000000000004
491,0.43511000000000005
492,0.44331000000000004
493,0.45021000000000005
494,0.45677
495,0.46497
496,0.46793999999999997
497,0.47058999999999995
498,0.47878999999999994
499,0.48535
500,0.49223999999999996
501,0.50044
502,0.5070100000000001
503,0.50998
504,0.51427
505,0.52083
506,0.52773
507,0.53593
508,0.5385800000000001
509,0.5415800000000001
510,0.5465
511,0.55504
512,0.5615899999999999
513,0.56555
514,0.5685600000000001
515,0.5754600000000001
516,0.58236
517,0.59055
518,0.59486
519,0.59918
520,0.60737
521,0.61392
522,0.62047
523,0.62866
524,0.63521
525,0.6378
526,0.63971
527,0.64593
528,0.6482
529,0.64653
530,0.64685
531,0.64751
532,0.65375
533,0.6560699999999999
534,0.65808
535,0.66433
536,0.66668
537,0.66543
538,0.66419
539,0.66266
540,0.66146
541,0.6602600000000001
542,0.65878
543,0.65762
544,0.65073
545,0.6449199999999999
546,0.64076
547,0.63388
548,0.62563
549,0.61903
550,0.61244
551,0.6039
552,0.59731
553,0.5907100000000001
554,0.58411
555,0.57694
556,0.57415
557,0.56891
558,0.56067
559,0.55378
560,0.54718
561,0.53894
562,0.53313
563,0.53036
564,0.52375
565,0.5168699999999999
566,0.51027
567,0.5042
568,0.5000600000000001
569,0.49346
570,0.48493
571,0.47805
572,0.4753
573,0.46815
574,0.46126999999999996
575,0.45466000000000006
576,0.44943
577,0.44643
578,0.43955
579,0.43433
580,0.43135
581,0.42586999999999997
582,0.41899
583,0.41603999999999997
584,0.41222
585,0.40535
586,0.40102
587,0.39860999999999996
588,0.39199
589,0.38372
590,0.37685
591,0.37023
592,0.36195
593,0.36095
594,0.3569
595,0.34836999999999996
596,0.34623000000000004
597,0.3436
598,0.33508000000000004
599,0.32845
600,0.32159
601,0.31779
602,0.31495
603,0.30833
604,0.30169
605,0.29341
606,0.28678000000000003
607,0.27991
608,0.27163000000000004
609,0.265
610,0.25837
611,0.25009000000000003
612,0.24748
613,0.24511999999999998
614,0.23683
615,0.2302
616,0.22357
617,0.21505
618,0.20842
619,0.20179
620,0.19469
621,0.19211
622,0.18525
623,0.17861
624,0.17009000000000002
625,0.16632
626,0.16375
627,0.1569
628,0.15026
629,0.1434
630,0.13510999999999998
631,0.12847
632,0.1247
633,0.12194
634,0.1153
635,0.10865999999999999
636,0.10013999999999999
637,0.096387
638,0.093865
639,0.08701
640,0.080367
641,0.073512
642,0.068107
643,0.065604
644,0.060413
645,0.053769000000000004
646,0.045257
647,0.040064999999999996
648,0.039245
649,0.031993
650,0.025344
651,0.022887
652,0.018975
653,0.01213
654,0.009888
655,0.004143
656,-0.002699
657,-0.004734
658,-0.007309
659,-0.014147
660,-0.019318000000000002
661,-0.021863999999999998
662,-0.02887
663,-0.034207
664,-0.038377
665,-0.045205
666,-0.048865
667,-0.049507
668,-0.051954999999999994
669,-0.054228
670,-0.061048000000000005
671,-0.061489999999999996
672,-0.062064
673,-0.06262100000000001
674,-0.063296
675,-0.063817
676,-0.063944
677,-0.055597
678,-0.049047
679,-0.042369
680,-0.034023000000000005
681,-0.030808999999999996
682,-0.029623000000000003
683,-0.024849
684,-0.01817
685,-0.011491
686,-0.003141
687,0.0035399999999999997
688,0.01022
689,0.016901
690,0.02525
691,0.03193
692,0.038497
693,0.046849
694,0.049966
695,0.051200999999999997
696,0.057777999999999996
697,0.064461
698,0.071143
699,0.07939299999999999
700,0.086076
701,0.089112
702,0.092062
703,0.098746
704,0.10543
705,0.11379
706,0.12047000000000001
707,0.12716
708,0.13552
709,0.1422
710,0.14889000000000002
711,0.15724000000000002
712,0.16393
713,0.16756
714,0.16795
715,0.1763
716,0.18299
717,0.18967
718,0.19802999999999998
719,0.20471
720,0.2115
721,0.21985
722,0.22654000000000002
723,0.23321999999999998
724,0.24158000000000002
725,0.24825999999999998
726,0.25494
727,0.26016
728,0.26223
729,0.26735
730,0.27571
731,0.28239000000000003
732,0.28918
733,0.29753
734,0.30421
735,0.31089
736,0.31445
737,0.31666
738,0.32334
739,0.33002
740,0.33837
741,0.34505
742,0.35184
743,0.3602
744,0.36688000000000004
745,0.37356
746,0.38190999999999997
747,0.38235
748,0.38771
749,0.39605999999999997
750,0.40285
751,0.40953
752,0.41788000000000003
753,0.42312
754,0.42694
755,0.43206000000000006
756,0.43873999999999996
757,0.44542
758,0.45221999999999996
759,0.46057
760,0.46415
761,0.46631000000000006
762,0.47312
763,0.47978999999999994
764,0.48646999999999996
765,0.49482
766,0.5015
767,0.5083
768,0.51664
769,0.52332
770,0.53
771,0.53835
772,0.54515
773,0.54694
774,0.55195
775,0.55875
776,0.5655600000000001
777,0.57416
778,0.57595
779,0.57762
780,0.5843
781,0.5876399999999999
782,0.58931
783,0.59611
784,0.59997
785,0.6037100000000001
786,0.61038
787,0.6187199999999999
788,0.6254
789,0.63207
790,0.64042
791,0.6470899999999999
792,0.65377
793,0.6621100000000001
794,0.66879
795,0.67173
796,0.67456
797,0.68124
798,0.68792
799,0.69626
800,0.70294
801,0.70962
802,0.71629
803,0.7218
804,0.7238600000000001
805,0.73054
806,0.73888
807,0.74556
808,0.7522300000000001
809,0.76058
810,0.76726
811,0.7740600000000001
812,0.78241
813,0.78908
814,0.79576
815,0.8041
816,0.8107800000000001
817,0.8174600000000001
818,0.8258
819,0.8324799999999999
820,0.83916
821,0.8475
822,0.85431
823,0.85649
824,0.86175
825,0.8701
826,0.87677
827,0.88345
828,0.8919299999999999
829,0.8986
830,0.90528
831,0.90901
832,0.9112100000000001
833,0.91789
834,0.9262299999999999
835,0.93304
836,0.93971
837,0.94806
838,0.9518
839,0.9518
840,0.96014
841,0.9668200000000001
842,0.97349
843,0.98016
844,0.9817
845,0.98503
846,0.9933799999999999
847,1.0
848,1.0067
849,1.0134
850,1.0169
851,1.0191
852,1.0258
853,1.0341
854,1.0408
855,1.0474
856,1.0558
857,1.0626
858,1.0693
859,1.0775
860,1.0842
861,1.0908
862,1.0993
863,1.1059999999999999
864,1.1127
865,1.121
866,1.1277
867,1.1342
868,1.1426
869,1.1494
870,1.156
871,1.1627
872,1.1711
873,1.1777
874,1.1783
875,1.1837
876,1.1904
877,1.197
878,1.2054
879,1.212
880,1.2187
881,1.2221
882,1.2237
883,1.2303
884,1.2333
885,1.2349
886,1.2414
887,1.2478
888,1.2495
889,1.2544
890,1.2591
891,1.2586
892,1.2581
893,1.2576
894,1.2570000000000001
895,1.2566
896,1.253
897,1.2462
898,1.2458
899,1.2437
900,1.2432
901,1.2396
902,1.2328
903,1.2245
904,1.2177
905,1.2156
906,1.2104
907,1.2037
908,1.1971
909,1.1887
910,1.182
911,1.1752
912,1.1669
913,1.1602
914,1.1535
915,1.15
916,1.1478
917,1.1412
918,1.1344
919,1.126
920,1.1225
921,1.1205
922,1.112
923,1.1053
924,1.0986
925,1.095
926,1.093
927,1.0926
928,1.0907
929,1.084
930,1.0773
931,1.0689
932,1.0622
933,1.0555
934,1.0472
935,1.0405
936,1.0372
937,1.0355
938,1.0288
939,1.0254
940,1.0254
941,1.0187
942,1.0135
943,1.0115
944,1.0048
945,0.9980899999999999
946,0.9913299999999999
947,0.98625
948,0.9843
949,0.98082
950,0.97246
951,0.96577
952,0.9590799999999999
953,0.95071
954,0.9440200000000001
955,0.94255
956,0.9394899999999999
957,0.9328
958,0.92611
959,0.91774
960,0.91105
961,0.9043700000000001
962,0.8976700000000001
963,0.88931
964,0.8826200000000001
965,0.8759299999999999
966,0.8675700000000001
967,0.8656799999999999
968,0.8638
969,0.8553700000000001
970,0.8486799999999999
971,0.84199
972,0.8335600000000001
973,0.8268700000000001
974,0.8201799999999999
975,0.81181
976,0.80994
977,0.80801
978,0.80132
979,0.7946300000000001
980,0.78794
981,0.77951
982,0.77282
983,0.76613
984,0.75944
985,0.75579
986,0.75065
987,0.7439600000000001
988,0.7356
989,0.72885
990,0.72215
991,0.71708
992,0.71519
993,0.7117399999999999
994,0.7033699999999999
995,0.69668
996,0.68993
997,0.68157
998,0.67645
999,0.6745800000000001
1000,0.66613
1001,0.66098
1002,0.65914
1003,0.65245
1004,0.64575
1005,0.6390600000000001
1006,0.63236
1007,0.624
1008,0.62065
1009,0.6173
1010,0.61061
1011,0.60893
1012,0.60726
1013,0.5988899999999999
1014,0.59216
1015,0.5854699999999999
1016,0.58201
1017,0.58019
1018,0.5735
1019,0.56513
1020,0.5584
1021,0.55171
1022,0.5433399999999999
1023,0.53665
1024,0.52995
1025,0.5266
1026,0.52158
1027,0.51489
1028,0.51154
1029,0.5081899999999999
1030,0.5015
1031,0.4948
1032,0.48643000000000003
1033,0.47973999999999994
1034,0.47305
1035,0.46471
1036,0.45798
1037,0.45128999999999997
1038,0.44292
1039,0.43622
1040,0.42953
1041,0.42116000000000003
1042,0.42103
1043,0.4176
1044,0.40923000000000004
1045,0.40253
1046,0.39584
1047,0.38747
1048,0.38078
1049,0.37408
1050,0.36739
1051,0.36407
1052,0.36239
1053,0.3557
1054,0.34733
1055,0.34064
1056,0.33896
1057,0.33391
1058,0.32721999999999996
1059,0.32051999999999997
1060,0.31215
1061,0.30546
1062,0.29875999999999997
1063,0.29039
1064,0.28367
1065,0.27697
1066,0.26863000000000004
1067,0.26191
1068,0.25522
1069,0.24685
1070,0.24015
1071,0.23346
1072,0.22509
1073,0.22004
1074,0.21825999999999998
1075,0.21319000000000002
1076,0.20483
1077,0.19813
1078,0.19143
1079,0.18304
1080,0.17635
1081,0.16965
1082,0.16457
1083,0.16283
1084,0.15614
1085,0.14775
1086,0.14106
1087,0.13935
1088,0.1343
1089,0.12759
1090,0.1209
1091,0.11252000000000001
1092,0.10583
1093,0.099123
1094,0.097437
1095,0.090741
1096,0.085724
1097,0.08407
1098,0.079063
1099,0.072387
1100,0.070765
1101,0.065775
1102,0.064138
1103,0.064221
1104,0.06435
1105,0.064469
1106,0.064606
1107,0.064719
1108,0.069739
1109,0.076433
1110,0.08484
1111,0.091534
1112,0.098229
1113,0.1066
1114,0.11166
1115,0.1135
1116,0.11861
1117,0.1253
1118,0.13204000000000002
1119,0.13874
1120,0.1471
1121,0.15222
1122,0.15409
1123,0.16257
1124,0.16602
1125,0.16793
1126,0.17468
1127,0.18137
1128,0.18812
1129,0.19327
1130,0.1952
1131,0.20196
1132,0.21031999999999998
1133,0.21708000000000002
1134,0.22055999999999998
1135,0.2226
1136,0.22929000000000002
1137,0.23598000000000002
1138,0.24434
1139,0.2511
1140,0.25779
1141,0.26448
1142,0.27284
1143,0.27953
1144,0.28622
1145,0.2882
1146,0.29178000000000004
1147,0.29846999999999996
1148,0.30683
1149,0.3136
1150,0.32029
1151,0.32865
1152,0.33534
1153,0.34202
1154,0.35038
1155,0.35707
1156,0.36376
1157,0.37212
1158,0.37881
1159,0.3855
1160,0.39386
1161,0.40055
1162,0.40724
1163,0.41391999999999995
1164,0.42228999999999994
1165,0.42896999999999996
1166,0.43566000000000005
1167,0.44403000000000004
1168,0.45071000000000006
1169,0.4574
1170,0.46576000000000006
1171,0.47245
1172,0.47913999999999995
1173,0.4875
1174,0.49418999999999996
1175,0.50088
1176,0.50917
1177,0.51585
1178,0.52254
1179,0.52756
1180,0.5291600000000001
1181,0.5357
1182,0.54232
1183,0.544
1184,0.5506800000000001
1185,0.55403
1186,0.55745
1187,0.56421
1188,0.56923
1189,0.5708300000000001
1190,0.57745
1191,0.584
1192,0.59229
1193,0.59396
1194,0.5989800000000001
1195,0.60735
1196,0.6140399999999999
1197,0.62073
1198,0.6290899999999999
1199,0.63572
1200,0.64241
1201,0.65077
1202,0.65746
1203,0.66415
1204,0.67252
1205,0.6792100000000001
1206,0.6859
1207,0.69426
1208,0.70095
1209,0.7077100000000001
1210,0.7144
1211,0.7227600000000001
1212,0.72945
1213,0.73614
1214,0.7429
1215,0.74457
1216,0.74792
1217,0.7562800000000001
1218,0.76297
1219,0.76632
1220,0.76966
1221,0.77636
1222,0.78305
1223,0.7914100000000001
1224,0.7981
1225,0.80479
1226,0.80994
1227,0.81188
1228,0.81857
1229,0.82694
1230,0.83362
1231,0.8403799999999999
1232,0.8470799999999999
1233,0.85544
1234,0.86213
1235,0.8640100000000001
1236,0.86764
1237,0.8743299999999999
1238,0.88102
1239,0.88939
1240,0.8960799999999999
1241,0.90276
1242,0.9111299999999999
1243,0.91789
1244,0.92458
1245,0.93294
1246,0.93963
1247,0.9447200000000001
1248,0.9467700000000001
1249,0.9518700000000001
1250,0.9585600000000001
1251,0.9669200000000001
1252,0.9736799999999999
1253,0.9803700000000001
1254,0.98706
1255,0.9954200000000001
1256,1.0021
1257,1.0087
1258,1.0171
1259,1.0238
1260,1.0305
1261,1.0388
1262,1.0455
1263,1.0522
1264,1.0606
1265,1.0673
1266,1.0739
1267,1.0823
1268,1.089
1269,1.0957
1270,1.1022
1271,1.1036
1272,1.1086
1273,1.1169
1274,1.1236
1275,1.1303
1276,1.137
1277,1.1453
1278,1.1520000000000001
1279,1.1587
1280,1.1671
1281,1.1722
1282,1.1741
1283,1.181
1284,1.1877
1285,1.1943
1286,1.2027
1287,1.2094
1288,1.2161
1289,1.2227
1290,1.2241
1291,1.2273
1292,1.2357
1293,1.2424
1294,1.249
1295,1.2574
1296,1.2641
1297,1.266
1298,1.2696
1299,1.2764
1300,1.2799
1301,1.2836
1302,1.2919
1303,1.2986
1304,1.3054
1305,1.3138
1306,1.3205
1307,1.3224
1308,1.3277
1309,1.3344
1310,1.3411
1311,1.3494
1312,1.3561
1313,1.3628
1314,1.3712
1315,1.3709
1316,1.374
1317,1.3823
1318,1.389
1319,1.3957
1320,1.4041
1321,1.4108
1322,1.4174
1323,1.4241
1324,1.4325
1325,1.4392
1326,1.4428
1327,1.4447
1328,1.4515
1329,1.455
1330,1.4571
1331,1.4639
1332,1.4691
1333,1.4712
1334,1.4713
1335,1.4714
1336,1.4718
1337,1.4721
1338,1.4722
1339,1.4725
1340,1.4729
1341,1.4733
1342,1.4722
1343,1.4726
1344,1.4713
1345,1.4647
1346,1.46
1347,1.4605
1348,1.4538
1349,1.4455
1350,1.4388
1351,1.4321
1352,1.4238
1353,1.4172
1354,1.4105
1355,1.4021
1356,1.3954
1357,1.3887
1358,1.3804
1359,1.3737
1360,1.367
1361,1.3587
1362,1.3519999999999999
1363,1.3453
1364,1.337
1365,1.3304
1366,1.3237
1367,1.317
1368,1.3087
1369,1.3021
1370,1.301
1371,1.2947
1372,1.2899
1373,1.2871
1374,1.2823
1375,1.2756
1376,1.2689
1377,1.2606
1378,1.2539
1379,1.2472
1380,1.2389
1381,1.2339
1382,1.2322
1383,1.2272
1384,1.2239
1385,1.2222
1386,1.2138
1387,1.2072
1388,1.2006
1389,1.194
1390,1.1856
1391,1.1827
1392,1.1831
1393,1.1748
1394,1.1681
1395,1.1615
1396,1.1531
1397,1.1464
1398,1.1413
1399,1.1372
1400,1.1306
1401,1.1239
1402,1.1154
1403,1.1087
1404,1.1021
1405,1.0999
1406,1.0961
1407,1.0894
1408,1.0811
1409,1.0744
1410,1.0677
1411,1.0609
1412,1.0526
1413,1.0459
1414,1.0392
1415,1.0309
1416,1.0242
1417,1.0176
1418,1.0092
1419,1.0025
1420,0.9958600000000001
1421,0.9875200000000001
1422,0.98085
1423,0.9741799999999999
1424,0.96598
1425,0.95931
1426,0.95263
1427,0.94429
1428,0.94139
1429,0.94016
1430,0.93196
1431,0.92529
1432,0.9186200000000001
1433,0.9102899999999999
1434,0.9036200000000001
1435,0.89695
1436,0.89028
1437,0.8820899999999999
1438,0.8754200000000001
1439,0.86875
1440,0.86406
1441,0.86301
1442,0.85816
1443,0.84983
1444,0.84316
1445,0.83665
1446,0.8283200000000001
1447,0.8216600000000001
1448,0.81499
1449,0.80666
1450,0.79999
1451,0.79333
1452,0.785
1453,0.77833
1454,0.77151
1455,0.76318
1456,0.75651
1457,0.74985
1458,0.7431800000000001
1459,0.73485
1460,0.72835
1461,0.7216899999999999
1462,0.71336
1463,0.7066899999999999
1464,0.7056899999999999
1465,0.6993699999999999
1466,0.69271
1467,0.68604
1468,0.67772
1469,0.67106
1470,0.6643899999999999
1471,0.66222
1472,0.65838
1473,0.65172
1474,0.64339
1475,0.63673
1476,0.6299
1477,0.62157
1478,0.6149100000000001
1479,0.60825
1480,0.6059100000000001
1481,0.60042
1482,0.5937600000000001
1483,0.5871
1484,0.5786
1485,0.57194
1486,0.56528
1487,0.55695
1488,0.55312
1489,0.55082
1490,0.5424800000000001
1491,0.53582
1492,0.52915
1493,0.52082
1494,0.514
1495,0.5073300000000001
1496,0.499
1497,0.49233000000000005
1498,0.48567
1499,0.47734
1500,0.47067
1501,0.46401000000000003
1502,0.45733999999999997
1503,0.44901
1504,0.44235
1505,0.43568999999999997
1506,0.43187
1507,0.4279
1508,0.42123
1509,0.4129
1510,0.40623000000000004
1511,0.39941
1512,0.39107
1513,0.38441
1514,0.37774
1515,0.36941
1516,0.36275
1517,0.35608
1518,0.34775
1519,0.34108
1520,0.33442
1521,0.32609
1522,0.31942
1523,0.31276
1524,0.30626
1525,0.29793000000000003
1526,0.29127
1527,0.2846
1528,0.27626999999999996
1529,0.27460999999999997
1530,0.27310999999999996
1531,0.26511999999999997
1532,0.26029
1533,0.25879
1534,0.25248000000000004
1535,0.24915
1536,0.24748
1537,0.23933000000000001
1538,0.23636
1539,0.23706999999999998
1540,0.23633
1541,0.23708
1542,0.23043000000000002
1543,0.22211
1544,0.21545999999999998
1545,0.209
1546,0.20068
1547,0.19403
1548,0.18738
1549,0.1865
1550,0.18231
1551,0.17567
1552,0.17482
1553,0.17046
1554,0.16403
1555,0.163
1556,0.16409
1557,0.16497
1558,0.16585999999999998
1559,0.16701
1560,0.16794
1561,0.16888
1562,0.17740999999999998
1563,0.18144000000000002
1564,0.18407
1565,0.19259
1566,0.19665
1567,0.1993
1568,0.20756999999999998
1569,0.21445
1570,0.22107
1571,0.22513000000000002
1572,0.22641
1573,0.2291
1574,0.23154
1575,0.2398
1576,0.24668
1577,0.25329
1578,0.2566
1579,0.2599
1580,0.26486
1581,0.26652
1582,0.27174
1583,0.27888
1584,0.28741
1585,0.28906
1586,0.28906
1587,0.29012
1588,0.2945
1589,0.29724
1590,0.29944
1591,0.29972
1592,0.30083000000000004
1593,0.30248
1594,0.30413
1595,0.31073
1596,0.31733
1597,0.32559
1598,0.33219
1599,0.3388
1600,0.34733
1601,0.35393
1602,0.36054
1603,0.36879
1604,0.3754
1605,0.382
1606,0.39026
1607,0.39439
1608,0.39714
1609,0.40375
1610,0.41035
1611,0.41695
1612,0.42521000000000003
1613,0.43181
1614,0.43842
1615,0.44501999999999997
1616,0.45356
1617,0.46016
1618,0.46676999999999996
1619,0.4753
1620,0.47805
1621,0.48356000000000005
1622,0.49181
1623,0.49868999999999997
1624,0.50529
1625,0.51355
1626,0.52015
1627,0.52676
1628,0.53117
1629,0.5353100000000001
1630,0.54191
1631,0.55016
1632,0.55676
1633,0.5633600000000001
1634,0.57162
1635,0.5785
1636,0.5851
1637,0.5917100000000001
1638,0.59996
1639,0.6065699999999999
1640,0.6118
1641,0.6148399999999999
1642,0.6217199999999999
1643,0.62832
1644,0.63657
1645,0.64345
1646,0.6500600000000001
1647,0.6583100000000001
1648,0.66519
1649,0.66933
1650,0.6751199999999999
1651,0.68172
1652,0.6883199999999999
1653,0.69658
1654,0.7034600000000001
1655,0.7086899999999999
1656,0.71175
1657,0.71699
1658,0.72358
1659,0.73212
1660,0.7387199999999999
1661,0.74532
1662,0.75055
1663,0.75363
1664,0.7588600000000001
1665,0.7660399999999999
1666,0.7691399999999999
1667,0.7743800000000001
1668,0.7809699999999999
1669,0.7892100000000001
1670,0.7961
1671,0.80269
1672,0.8082199999999999
1673,0.81104
1674,0.81493
1675,0.8234600000000001
1676,0.8263
1677,0.83185
1678,0.8400799999999999
1679,0.84667
1680,0.85326
1681,0.86149
1682,0.8683799999999999
1683,0.87497
1684,0.88156
1685,0.88979
1686,0.8939799999999999
1687,0.8945799999999999
1688,0.9028200000000001
1689,0.9094
1690,0.91599
1691,0.92453
1692,0.9297700000000001
1693,0.9314100000000001
1694,0.9363600000000001
1695,0.94294
1696,0.94624
1697,0.94789
1698,0.9547700000000001
1699,0.96001
1700,0.96316
1701,0.97005
1702,0.9766299999999999
1703,0.98487
1704,0.99146
1705,0.99834
1706,1.0049
1707,1.0132
1708,1.0198
1709,1.0263
1710,1.0308
1711,1.035
1712,1.0419
1713,1.0451
1714,1.0506
1715,1.0572
1716,1.0654
1717,1.072
1718,1.0786
1719,1.0872
1720,1.0937
1721,1.1003
1722,1.1086
1723,1.1128
1724,1.1156
1725,1.1239
1726,1.1307
1727,1.1373
1728,1.1412
1729,1.1444
1730,1.151
1731,1.1579
1732,1.1661
1733,1.17
1734,1.1729
1735,1.1798
1736,1.1854
1737,1.1883
1738,1.1955
1739,1.2021
1740,1.2087
1741,1.2169
1742,1.2234
1743,1.2303
1744,1.2386
1745,1.2451
1746,1.2517
1747,1.2599
1748,1.2668
1749,1.2697
1750,1.2737
1751,1.2825
1752,1.2854
1753,1.291
1754,1.2982
1755,1.2995
1756,1.3008
1757,1.3025
1758,1.3038
1759,1.3051
1760,1.3068
1761,1.3082
1762,1.3096
1763,1.3113
1764,1.3051
1765,1.2989
1766,1.2907
1767,1.2882
1768,1.288
1769,1.2818
1770,1.2752
1771,1.2687
1772,1.2605
1773,1.254
1774,1.2474
1775,1.2409
1776,1.2327
1777,1.2262
1778,1.2213
1779,1.2197
1780,1.2197
1781,1.2131
1782,1.2111
1783,1.2088
1784,1.2019
1785,1.1941
1786,1.1879
1787,1.1817
1788,1.1805
1789,1.1739
1790,1.1723
1791,1.1687
1792,1.1618
1793,1.1549
1794,1.1474
1795,1.1445
1796,1.1413
1797,1.1364
1798,1.1331
1799,1.1282
1800,1.1217
1801,1.1128
1802,1.1063
1803,1.0997
1804,1.0916
1805,1.0876
1806,1.0832
1807,1.0763
1808,1.0746
1809,1.0697
1810,1.0648
1811,1.0632
1812,1.0583
1813,1.0502
1814,1.0436
1815,1.0371
1816,1.0290000000000001
1817,1.0224
1818,1.0208
1819,1.0192
1820,1.0119
1821,1.0115
1822,1.0042
1823,0.9957
1824,0.9937
1825,0.9904299999999999
1826,0.9822799999999999
1827,0.97575
1828,0.96885
1829,0.9607
1830,0.9541700000000001
1831,0.94765
1832,0.9423799999999999
1833,0.93924
1834,0.93774
1835,0.9342600000000001
1836,0.9306200000000001
1837,0.92409
1838,0.9159299999999999
1839,0.9090299999999999
1840,0.9025
1841,0.89597
1842,0.88781
1843,0.8829100000000001
1844,0.88128
1845,0.8763799999999999
1846,0.8731200000000001
1847,0.87111
1848,0.8625799999999999
1849,0.8556799999999999
1850,0.84878
1851,0.84388
1852,0.84025
1853,0.8346100000000001
1854,0.82645
1855,0.8199200000000001
1856,0.81339
1857,0.80524
1858,0.79871
1859,0.79218
1860,0.78403
1861,0.77751
1862,0.77099
1863,0.76446
1864,0.75631
1865,0.74979
1866,0.7428899999999999
1867,0.73474
1868,0.72822
1869,0.7217
1870,0.7135600000000001
1871,0.70704
1872,0.70091
1873,0.69238
1874,0.68587
1875,0.67935
1876,0.6712100000000001
1877,0.6647
1878,0.6581899999999999
1879,0.65656
1880,0.6533
1881,0.64764
1882,0.64562
1883,0.6383300000000001
1884,0.63143
1885,0.62778
1886,0.62616
1887,0.61964
1888,0.6131300000000001
1889,0.6046
1890,0.59809
1891,0.59158
1892,0.58839
1893,0.5856
1894,0.57908
1895,0.57055
1896,0.56404
1897,0.5576
1898,0.55319
1899,0.54668
1900,0.53977
1901,0.53163
1902,0.5251100000000001
1903,0.5182100000000001
1904,0.51658
1905,0.51332
1906,0.50642
1907,0.49788999999999994
1908,0.49386
1909,0.49185
1910,0.48495
1911,0.4768
1912,0.47517
1913,0.47353999999999996
1914,0.46501000000000003
1915,0.46184
1916,0.45743999999999996
1917,0.44928999999999997
1918,0.44277
1919,0.43625
1920,0.42772
1921,0.4212
1922,0.41468999999999995
1923,0.40941
1924,0.40462
1925,0.4006
1926,0.39245
1927,0.38593
1928,0.37903000000000003
1929,0.37088000000000004
1930,0.36561
1931,0.36245
1932,0.35843
1933,0.35028000000000004
1934,0.34376
1935,0.33686
1936,0.32871
1937,0.32219000000000003
1938,0.31567
1939,0.308
1940,0.30485
1941,0.29833000000000004
1942,0.29018
1943,0.28328000000000003
1944,0.27676
1945,0.26861
1946,0.26861
1947,0.26698
1948,0.25883
1949,0.2572
1950,0.2572
1951,0.24905
1952,0.24253000000000002
1953,0.23601999999999998
1954,0.2295
1955,0.22136
1956,0.21771
1957,0.2133
1958,0.20678000000000002
1959,0.20027
1960,0.19375
1961,0.18561
1962,0.1791
1963,0.17786
1964,0.17578
1965,0.16927999999999999
1966,0.16277
1967,0.15464
1968,0.14812999999999998
1969,0.14163
1970,0.1335
1971,0.127
1972,0.1205
1973,0.11237
1974,0.10587
1975,0.099374
1976,0.092877
1977,0.084756
1978,0.078261
1979,0.071768
1980,0.063651
1981,0.057159
1982,0.050669
1983,0.042556000000000004
1984,0.036066
1985,0.029579
1986,0.021471
1987,0.014985
1988,0.0085
1989,0.00039603
1990,-0.006085
1991,-0.012567
1992,-0.020668000000000002
1993,-0.027145999999999997
1994,-0.033624
1995,-0.04172
1996,-0.048195
1997,-0.054667999999999994
1998,-0.061141999999999995
1999,-0.069232
2000,-0.07570199999999999
2001,-0.08217200000000001
2002,-0.090258
2003,-0.096724
2004,-0.10319
2005,-0.10804000000000001
2006,-0.10966
2007,-0.11612
2008,-0.11935
2009,-0.12258
2010,-0.12904000000000002
2011,-0.13668
2012,-0.14313
2013,-0.14959
2014,-0.15515
2015,-0.15335
2016,-0.15315
2017,-0.15247
2018,-0.1589
2019,-0.16534000000000001
2020,-0.17338
2021,-0.17934
2022,-0.18577
2023,-0.1922
2024,-0.20023
2025,-0.19995
2026,-0.20172
2027,-0.20926
2028,-0.20731999999999998
2029,-0.20697
2030,-0.20451
2031,-0.20781
2032,-0.2142
2033,-0.21329
2034,-0.21545999999999998
2035,-0.22184
2036,-0.22981
2037,-0.23568000000000003
2038,-0.24205
2039,-0.2479
2040,-0.24741
2041,-0.24902
2042,-0.25697
2043,-0.25644
2044,-0.25484
2045,-0.2543
2046,-0.25269
2047,-0.25161
2048,-0.25106999999999996
2049,-0.24731
2050,-0.24409
2051,-0.23776
2052,-0.22985
2053,-0.22298
2054,-0.21664
2055,-0.20872
2056,-0.20655
2057,-0.20278
2058,-0.20002
2059,-0.19417
2060,-0.1873
2061,-0.18294000000000002
2062,-0.17865999999999999
2063,-0.17235
2064,-0.1639
2065,-0.15703
2066,-0.15322
2067,-0.14894000000000002
2068,-0.14106
2069,-0.13474
2070,-0.12787
2071,-0.11997999999999999
2072,-0.11469000000000001
2073,-0.11087999999999999
2074,-0.1066
2075,-0.099729
2076,-0.093422
2077,-0.08553200000000001
2078,-0.081714
2079,-0.078448
2080,-0.070566
2081,-0.063696
2082,-0.057388999999999996
2083,-0.051421
2084,-0.047139
2085,-0.040836000000000004
2086,-0.032392000000000004
2087,-0.026086
2088,-0.019780000000000002
2089,-0.012348
2090,-0.006375
2091,-7.1968e-05
2092,0.006795000000000001
2093,0.01524
2094,0.020086
2095,0.023362
2096,0.031237
2097,0.037538
2098,0.043842
2099,0.051725
2100,0.058033
2101,0.064342
2102,0.07223099999999999
2103,0.07910299999999999
2104,0.085418
2105,0.093312
2106,0.09963
2107,0.10595
2108,0.1129
2109,0.11615
2110,0.12247000000000001
2111,0.12878
2112,0.13723
2113,0.14355
2114,0.14987999999999999
2115,0.1558
2116,0.16007000000000002
2117,0.16695
2118,0.17484
2119,0.18170999999999998
2120,0.18552000000000002
2121,0.19137
2122,0.19768
2123,0.20455
2124,0.21141999999999997
2125,0.21524000000000001
2126,0.22109
2127,0.22953
2128,0.23585
2129,0.2417
2130,0.24608000000000002
2131,0.25239
2132,0.25926
2133,0.26714
2134,0.27198
2135,0.27581
2136,0.28212
2137,0.29
2138,0.29686999999999997
2139,0.30318
2140,0.31106
2141,0.31432
2142,0.31815
2143,0.32445999999999997
2144,0.33076
2145,0.33707
2146,0.34496
2147,0.35183000000000003
2148,0.35814
2149,0.36603
2150,0.36928
2151,0.3731
2152,0.37592
2153,0.3792
2154,0.3855
2155,0.39394
2156,0.40024
2157,0.40352
2158,0.40736
2159,0.41523999999999994
2160,0.4221
2161,0.4284
2162,0.43382
2163,0.43611000000000005
2164,0.43998000000000004
2165,0.44485
2166,0.45171000000000006
2167,0.45658999999999994
2168,0.46048
2169,0.46734
2170,0.47223000000000004
2171,0.47672
2172,0.47907
2173,0.48398
2174,0.49181
2175,0.49806999999999996
2176,0.50336
2177,0.50788
2178,0.51026
2179,0.51264
2180,0.5150399999999999
2181,0.5180600000000001
2182,0.52048
2183,0.5229199999999999
2184,0.52598
2185,0.52845
2186,0.53092
2187,0.53403
2188,0.53654
2189,0.53905
2190,0.5422100000000001
2191,0.54166
2192,0.53547
2193,0.52837
2194,0.5221899999999999
2195,0.52412
2196,0.5258
2197,0.5284
2198,0.52882
2199,0.5211100000000001
2200,0.51495
2201,0.50879
2202,0.50264
2203,0.49494
2204,0.48945
2205,0.48263999999999996
2206,0.47496000000000005
2207,0.46881000000000006
2208,0.46266999999999997
2209,0.45498999999999995
2210,0.44886000000000004
2211,0.44272
2212,0.43783999999999995
2213,0.43343999999999994
2214,0.42728999999999995
2215,0.41895
2216,0.41215
2217,0.40794
2218,0.402
2219,0.39586
2220,0.38905
2221,0.38224
2222,0.37804
2223,0.37363
2224,0.36749
2225,0.35980999999999996
2226,0.35301
2227,0.34686999999999996
2228,0.3392
2229,0.33307
2230,0.32713000000000003
2231,0.32224
2232,0.31763
2233,0.3115
2234,0.30383000000000004
2235,0.29703
2236,0.2909
2237,0.28325
2238,0.27645
2239,0.27271
2240,0.2678
2241,0.26166999999999996
2242,0.25554
2243,0.24789
2244,0.24176999999999998
2245,0.23565
2246,0.22732
2247,0.22121
2248,0.2151
2249,0.20899
2250,0.20135999999999998
2251,0.19526
2252,0.18916
2253,0.18168
2254,0.17739000000000002
2255,0.17213
2256,0.1645
2257,0.1584
2258,0.1523
2259,0.14399
2260,0.1379
2261,0.13180999999999998
2262,0.1242
2263,0.11812
2264,0.11227999999999999
2265,0.10715
2266,0.10106
2267,0.094275
2268,0.08667000000000001
2269,0.08515
2270,0.08211
2271,0.076848
2272,0.073926
2273,0.068664
2274,0.06118099999999999
2275,0.05744
2276,0.055920000000000004
2277,0.049138999999999995
2278,0.043176
2279,0.038857
2280,0.032895999999999995
2281,0.024716
2282,0.018889
2283,0.012798
2284,0.005186
2285,-0.00089897
2286,-0.007682
2287,-0.015281999999999999
2288,-0.021361
2289,-0.027436000000000002
2290,-0.032469
2291,-0.036912
2292,-0.042992
2293,-0.049773000000000005
2294,-0.057367999999999995
2295,-0.06344
2296,-0.070216
2297,-0.074557
2298,-0.079002
2299,-0.085077
2300,-0.093373
2301,-0.099445
2302,-0.10096000000000001
2303,-0.10774
2304,-0.11148
2305,-0.11441
2306,-0.1227
2307,-0.12867
2308,-0.13019
2309,-0.13625
2310,-0.14232
2311,-0.14909
2312,-0.15666
2313,-0.16343
2314,-0.16789
2315,-0.17225
2316,-0.17831
2317,-0.18437
2318,-0.19043
2319,-0.19799
2320,-0.20475
2321,-0.2108
2322,-0.21835
2323,-0.22439
2324,-0.23041999999999999
2325,-0.23634000000000002
2326,-0.24153000000000002
2327,-0.24756999999999998
2328,-0.25511999999999996
2329,-0.26115
2330,-0.26718000000000003
2331,-0.27471
2332,-0.28073000000000004
2333,-0.28748
2334,-0.295
2335,-0.30101
2336,-0.30701999999999996
2337,-0.31301999999999996
2338,-0.32051999999999997
2339,-0.325
2340,-0.33021999999999996
2341,-0.33771999999999996
2342,-0.34373000000000004
2343,-0.34973000000000004
2344,-0.35796
2345,-0.36396
2346,-0.36994
2347,-0.37668
2348,-0.38117
2349,-0.38566
2350,-0.3939
2351,-0.39989
2352,-0.40662
2353,-0.41112
2354,-0.41561000000000003
2355,-0.4216
2356,-0.42983000000000005
2357,-0.43656999999999996
2358,-0.44106999999999996
2359,-0.44705
2360,-0.45303999999999994
2361,-0.45978
2362,-0.46576000000000006
2363,-0.47101000000000004
2364,-0.4755
2365,-0.48223999999999995
2366,-0.48973
2367,-0.49571000000000004
2368,-0.50021
2369,-0.50545
2370,-0.5121899999999999
2371,-0.51667
2372,-0.5219
2373,-0.5279
2374,-0.53464
2375,-0.54213
2376,-0.54587
2377,-0.55184
2378,-0.56009
2379,-0.5645600000000001
2380,-0.5697800000000001
2381,-0.57803
2382,-0.58398
2383,-0.5876899999999999
2384,-0.5937100000000001
2385,-0.60196
2386,-0.60797
2387,-0.61398
2388,-0.62148
2389,-0.62595
2390,-0.63117
2391,-0.6401600000000001
2392,-0.64461
2393,-0.64908
2394,-0.6566
2395,-0.66335
2396,-0.6693600000000001
2397,-0.67455
2398,-0.68053
2399,-0.68802
2400,-0.69318
2401,-0.69843
2402,-0.70519
2403,-0.71272
2404,-0.71796
2405,-0.7224
2406,-0.72687
2407,-0.7358600000000001
2408,-0.74028
2409,-0.74475
2410,-0.75302
2411,-0.75905
2412,-0.76507
2413,-0.77022
2414,-0.77469
2415,-0.78145
2416,-0.78808
2417,-0.79103
2418,-0.7978
2419,-0.8052
2420,-0.81038
2421,-0.81643
2422,-0.82471
2423,-0.83076
2424,-0.83514
2425,-0.84031
2426,-0.8470799999999999
2427,-0.85314
2428,-0.85919
2429,-0.86508
2430,-0.86874
2431,-0.87551
2432,-0.8806700000000001
2433,-0.88502
2434,-0.8910899999999999
2435,-0.89938
2436,-0.90545
2437,-0.9099
2438,-0.91496
2439,-0.92022
2440,-0.92629
2441,-0.9313299999999999
2442,-0.9373
2443,-0.94478
2444,-0.9497899999999999
2445,-0.95506
2446,-0.96114
2447,-0.96945
2448,-0.9747100000000001
2449,-0.9775
2450,-0.9802700000000001
2451,-0.98524
2452,-0.9889700000000001
2453,-0.99577
2454,-1.0016
2455,-1.0051
2456,-1.0119
2457,-1.0192
2458,-1.0228
2459,-1.0296
2460,-1.0347
2461,-1.0389
2462,-1.0441
2463,-1.051
2464,-1.0536
2465,-1.0578
2466,-1.061
2467,-1.0685
2468,-1.0744
2469,-1.0807
2470,-1.0876
2471,-1.0919
2472,-1.0945
2473,-1.0992
2474,-1.1032
2475,-1.1101
2476,-1.1157
2477,-1.1197
2478,-1.1221
2479,-1.1277
2480,-1.1345
2481,-1.1394
2482,-1.1459
2483,-1.1534
2484,-1.1573
2485,-1.1616
2486,-1.1685
2487,-1.1748
2488,-1.1826
2489,-1.1849
2490,-1.1898
2491,-1.1977
2492,-1.2039
2493,-1.2108
2494,-1.2186
2495,-1.2249
2496,-1.2311
2497,-1.2364
2498,-1.242
2499,-1.2463
2500,-1.2525
2501,-1.2604
2502,-1.2666
2503,-1.2729
2504,-1.2813
2505,-1.2875
2506,-1.2937
2507,-1.3009
2508,-1.3072
2509,-1.3134
2510,-1.3212
2511,-1.3274
2512,-1.3336
2513,-1.3413
2514,-1.3475
2515,-1.3537
2516,-1.3621
2517,-1.3683
2518,-1.3745
2519,-1.3804
2520,-1.3851
2521,-1.3913
2522,-1.3975
2523,-1.4052
2524,-1.4114
2525,-1.4176
2526,-1.4253
2527,-1.4315
2528,-1.4376
2529,-1.446
2530,-1.4521
2531,-1.4582
2532,-1.4659
2533,-1.472
2534,-1.4782
2535,-1.4858
2536,-1.4919
2537,-1.495
2538,-1.4965
2539,-1.5033
2540,-1.5055
2541,-1.5084
2542,-1.5167
2543,-1.5242
2544,-1.5242
2545,-1.5288
2546,-1.5349
2547,-1.5409
2548,-1.5492
2549,-1.5553
2550,-1.5614
2551,-1.569
2552,-1.575
2553,-1.5811
2554,-1.5893
2555,-1.5936
2556,-1.5997
2557,-1.6073
2558,-1.6133
2559,-1.6193
2560,-1.6269
2561,-1.6329
2562,-1.6389
2563,-1.6449
2564,-1.6524
2565,-1.6591
2566,-1.6651
2567,-1.6725
2568,-1.6785
2569,-1.6844
2570,-1.6905
2571,-1.6943
2572,-1.7002
2573,-1.7077
2574,-1.7136
2575,-1.7195
2576,-1.7269
2577,-1.7328
2578,-1.7395
2579,-1.7469
2580,-1.7528
2581,-1.7587
2582,-1.766
2583,-1.7718
2584,-1.7777
2585,-1.7835
2586,-1.7908
2587,-1.7966
2588,-1.8023
2589,-1.8104
2590,-1.8118
2591,-1.8147
2592,-1.8219
2593,-1.8294
2594,-1.8345
2595,-1.8377
2596,-1.8429
2597,-1.8486
2598,-1.8515
2599,-1.8529
2600,-1.8586
2601,-1.8657
2602,-1.8714
2603,-1.8771
2604,-1.8841
2605,-1.8898
2606,-1.8954
2607,-1.9024
2608,-1.9079
2609,-1.9135
2610,-1.92
2611,-1.9269
2612,-1.9324
2613,-1.9379
2614,-1.9448
2615,-1.9502
2616,-1.9556
2617,-1.9624
2618,-1.9678
2619,-1.9731
2620,-1.9798
2621,-1.9851
2622,-1.9904
2623,-1.9969999999999999
2624,-2.0023
2625,-2.0075
2626,-2.0140000000000002
2627,-2.0191
2628,-2.0243
2629,-2.0306
2630,-2.0357
2631,-2.0397
2632,-2.0447
2633,-2.0509
2634,-2.0559
2635,-2.0608
2636,-2.0669
2637,-2.0717
2638,-2.0765
2639,-2.0825
2640,-2.0873
2641,-2.092
2642,-2.0978
2643,-2.1024
2644,-2.1069999999999998
2645,-2.1139
2646,-2.1184
2647,-2.1229
2648,-2.1284
2649,-2.1328
2650,-2.1371
2651,-2.1425
2652,-2.1467
2653,-2.1509
2654,-2.155
2655,-2.1601
2656,-2.1641
2657,-2.1681
2658,-2.173
2659,-2.1769
2660,-2.1807
2661,-2.1854
2662,-2.189
2663,-2.1927
2664,-2.1971
2665,-2.2006
2666,-2.204
2667,-2.2082
2668,-2.21
2669,-2.2132
2670,-2.2171
2671,-2.2202
2672,-2.2247
2673,-2.2283
2674,-2.2312
2675,-2.2339
2676,-2.2366
2677,-2.2399
2678,-2.2424
2679,-2.2448
2680,-2.2477
2681,-2.25
2682,-2.2522
2683,-2.2547
2684,-2.2567
2685,-2.2586
2686,-2.2609
2687,-2.2626
2688,-2.2642
2689,-2.2661
2690,-2.2675
2691,-2.2688
2692,-2.2719
2693,-2.273
2694,-2.274
2695,-2.2752
2696,-2.2776
2697,-2.2767
2698,-2.2756
2699,-2.2762
2700,-2.2766
2701,-2.2769
2702,-2.2771
2703,-2.2771
2704,-2.2771
2705,-2.2771
2706,-2.2771
2707,-2.2771
2708,-2.2771
