time,value
0,-2.2449
1,-2.2449
2,-2.2475
3,-2.2475
4,-2.2475
5,-2.2475
6,-2.2475
7,-2.2553
8,-2.2631
9,-2.2657
10,-2.2657
11,-2.2656
12,-2.2654
13,-2.2651
14,-2.2673
15,-2.2668
16,-2.2661
17,-2.2651
18,-2.2643
19,-2.2633
20,-2.2622
21,-2.2636
22,-2.2683
23,-2.2755
24,-2.2766
25,-2.2751
26,-2.2735
27,-2.2712
28,-2.2693
29,-2.2673
30,-2.2653
31,-2.2656
32,-2.2633
33,-2.261
34,-2.2585
35,-2.2559
36,-2.2533
37,-2.2505
38,-2.2467
39,-2.2438
40,-2.2407
41,-2.242
42,-2.2481
43,-2.2541
44,-2.2508
45,-2.2474
46,-2.2439
47,-2.2403
48,-2.2367
49,-2.2317
50,-2.2279
51,-2.2262
52,-2.2222
53,-2.2182
54,-2.214
55,-2.2098
56,-2.2113
57,-2.2163
58,-2.2176
59,-2.2116
60,-2.207
61,-2.2024
62,-2.1977
63,-2.1929
64,-2.1881
65,-2.1832
66,-2.1783
67,-2.1733
68,-2.1682
69,-2.1631
70,-2.1581
71,-2.1529
72,-2.1476
73,-2.1423
74,-2.1369
75,-2.1315
76,-2.137
77,-2.1407
78,-2.1388
79,-2.1332
80,-2.1275
81,-2.1199
82,-2.1142
83,-2.1084
84,-2.1025
85,-2.0967
86,-2.0908
87,-2.0849
88,-2.0805
89,-2.0745
90,-2.0685
91,-2.0624
92,-2.0543
93,-2.0481
94,-2.0419
95,-2.0373
96,-2.0419
97,-2.0444
98,-2.0381
99,-2.0318
100,-2.0254
101,-2.019
102,-2.0104
103,-2.004
104,-1.9975
105,-1.9909999999999999
106,-1.9845
107,-1.9793
108,-1.9727
109,-1.9661
110,-1.9595
111,-1.9529
112,-1.9462
113,-1.9373
114,-1.9306
115,-1.9239
116,-1.9172
117,-1.9105
118,-1.9108
119,-1.9123
120,-1.9125
121,-1.9057
122,-1.8988
123,-1.8919
124,-1.8828
125,-1.8759
126,-1.8689
127,-1.8632
128,-1.8562
129,-1.8493
130,-1.8423
131,-1.8353
132,-1.8283
133,-1.8282
134,-1.8303
135,-1.8266
136,-1.8196
137,-1.8125
138,-1.8054
139,-1.7982
140,-1.7911
141,-1.784
142,-1.7768
143,-1.7707
144,-1.7635
145,-1.754
146,-1.7468
147,-1.7396
148,-1.7396
149,-1.7372
150,-1.7334
151,-1.7271
152,-1.7281
153,-1.7266
154,-1.7203
155,-1.714
156,-1.7077
157,-1.7052
158,-1.7004
159,-1.6931
160,-1.6858
161,-1.6785
162,-1.6712
163,-1.6638
164,-1.6565
165,-1.6492
166,-1.6394
167,-1.6337
168,-1.6286
169,-1.6259
170,-1.6186
171,-1.6113
172,-1.604
173,-1.5958
174,-1.5884
175,-1.5811
176,-1.5738
177,-1.5671
178,-1.5621
179,-1.5578
180,-1.5505
181,-1.5432
182,-1.5359
183,-1.5277
184,-1.5203
185,-1.5130000000000001
186,-1.5057
187,-1.5015
188,-1.4955
189,-1.4898
190,-1.4824
191,-1.4751
192,-1.4669
193,-1.4596
194,-1.4522
195,-1.4449
196,-1.4376
197,-1.435
198,-1.4299
199,-1.4217
200,-1.4144
201,-1.4069999999999998
202,-1.3988
203,-1.3915
204,-1.3841
205,-1.3768
206,-1.371
207,-1.3659999999999999
208,-1.3634
209,-1.3536
210,-1.3454
211,-1.3381
212,-1.3307
213,-1.3241
214,-1.319
215,-1.3148
216,-1.3075
217,-1.3002
218,-1.2928
219,-1.2855
220,-1.2749
221,-1.2675
222,-1.2602
223,-1.2576
224,-1.2525
225,-1.2443
226,-1.237
227,-1.2296
228,-1.2223
229,-1.215
230,-1.2068
231,-1.197
232,-1.1896
233,-1.1823
234,-1.1749
235,-1.1723
236,-1.1673
237,-1.1591
238,-1.1518
239,-1.1444
240,-1.1371
241,-1.1273
242,-1.1199
243,-1.1117
244,-1.1044
245,-1.097
246,-1.0888
247,-1.0838
248,-1.0788
249,-1.0714
250,-1.0641
251,-1.0567
252,-1.0469
253,-1.0395
254,-1.0322
255,-1.024
256,-1.0166
257,-1.0092
258,-1.0018
259,-0.9944700000000001
260,-0.98708
261,-0.9797
262,-0.97231
263,-0.9632799999999999
264,-0.95835
265,-0.9542299999999999
266,-0.94685
267,-0.93947
268,-0.93209
269,-0.9247
270,-0.9173100000000001
271,-0.9099200000000001
272,-0.9025299999999999
273,-0.89513
274,-0.88526
275,-0.8778600000000001
276,-0.87045
277,-0.8630399999999999
278,-0.85562
279,-0.84821
280,-0.8407899999999999
281,-0.83336
282,-0.82594
283,-0.8177300000000001
284,-0.80783
285,-0.8004
286,-0.79296
287,-0.78552
288,-0.77809
289,-0.77064
290,-0.7632
291,-0.7591899999999999
292,-0.75441
293,-0.75038
294,-0.74295
295,-0.7330399999999999
296,-0.7256
297,-0.71816
298,-0.71072
299,-0.70328
300,-0.69507
301,-0.68763
302,-0.68018
303,-0.67273
304,-0.66528
305,-0.65782
306,-0.64788
307,-0.64041
308,-0.63295
309,-0.62549
310,-0.61802
311,-0.61055
312,-0.6030800000000001
313,-0.5956
314,-0.59165
315,-0.59165
316,-0.58418
317,-0.57598
318,-0.5677800000000001
319,-0.55957
320,-0.55137
321,-0.5463899999999999
322,-0.5431699999999999
323,-0.53819
324,-0.53071
325,-0.52822
326,-0.52822
327,-0.51825
328,-0.51077
329,-0.50329
330,-0.49581000000000003
331,-0.48832
332,-0.48083000000000004
333,-0.47334
334,-0.46585
335,-0.45836000000000005
336,-0.45086000000000004
337,-0.44337
338,-0.43337
339,-0.42586999999999997
340,-0.41836
341,-0.41086000000000006
342,-0.40335
343,-0.39584
344,-0.38833
345,-0.38082
346,-0.37263
347,-0.36511
348,-0.35509
349,-0.34758
350,-0.34073000000000003
351,-0.33254
352,-0.32500999999999997
353,-0.31749
354,-0.31063
355,-0.3031
356,-0.29557
357,-0.28804
358,-0.2805
359,-0.2698
360,-0.26227
361,-0.25473
362,-0.24719000000000002
363,-0.23965
364,-0.23210999999999998
365,-0.22895
366,-0.22449000000000002
367,-0.22
368,-0.21247
369,-0.20494
370,-0.19489
371,-0.18671
372,-0.17917
373,-0.17163
374,-0.16409
375,-0.16214
376,-0.15764
377,-0.15195999999999998
378,-0.14443
379,-0.13624
380,-0.12871
381,-0.11867
382,-0.11667999999999999
383,-0.11217
384,-0.10397999999999999
385,-0.096456
386,-0.08826200000000001
387,-0.08073999999999999
388,-0.073215
389,-0.071876
390,-0.067344
391,-0.060974
392,-0.052779999999999994
393,-0.047088
394,-0.042526999999999995
395,-0.040448000000000005
396,-0.032947000000000004
397,-0.025443
398,-0.017937
399,-0.0097399
400,-0.0022329
401,0.005276100000000001
402,0.01529
403,0.019165
404,0.023740999999999998
405,0.027634
406,0.035133
407,0.042637
408,0.050141000000000005
409,0.058338
410,0.065841
411,0.073348
412,0.080857
413,0.08542999999999999
414,0.090019
415,0.098216
416,0.10572000000000001
417,0.11322
418,0.12072000000000001
419,0.12892
420,0.13642
421,0.14392
422,0.14962
423,0.1549
424,0.16130999999999998
425,0.1695
426,0.1745
427,0.17662
428,0.18125
429,0.18695
430,0.19515
431,0.20085999999999998
432,0.20302
433,0.20768000000000003
434,0.21838000000000002
435,0.22658000000000003
436,0.23126
437,0.23596
438,0.24094000000000002
439,0.2484
440,0.25587
441,0.26334
442,0.27081
443,0.27828
444,0.28576
445,0.29645
446,0.30393000000000003
447,0.31140999999999996
448,0.31889
449,0.32637
450,0.33207
451,0.33424
452,0.33892
453,0.34639000000000003
454,0.35386999999999996
455,0.36134
456,0.37204
457,0.37951
458,0.38699
459,0.39447
460,0.39841
461,0.40308
462,0.40704
463,0.41451000000000005
464,0.42198
465,0.43018
466,0.44014
467,0.44761999999999996
468,0.4551
469,0.4633
470,0.46548
471,0.47193
472,0.4794
473,0.48686999999999997
474,0.49433999999999995
475,0.5018199999999999
476,0.5092899999999999
477,0.51926
478,0.52674
479,0.53173
480,0.53208
481,0.5324399999999999
482,0.53993
483,0.54602
484,0.54393
485,0.54435
486,0.5493600000000001
487,0.55618
488,0.55983
489,0.5578
490,0.55578
491,0.55378
492,0.5518
493,0.54984
494,0.54789
495,0.54596
496,0.54404
497,0.54215
498,0.53964
499,0.53209
500,0.5239
501,0.517
502,0.51263
503,0.5095
504,0.50193
505,0.49436
506,0.48618999999999996
507,0.47862
508,0.47426
509,0.46931000000000006
510,0.46174
511,0.45416000000000006
512,0.44659
513,0.43842
514,0.43083999999999995
515,0.42903
516,0.42471000000000003
517,0.41906000000000004
518,0.41148
519,0.4039
520,0.3932
521,0.38561999999999996
522,0.38443
523,0.38011999999999996
524,0.37642
525,0.36884
526,0.36008
527,0.3558
528,0.35154
529,0.34395
530,0.33635
531,0.32565
532,0.31806
533,0.31438
534,0.31013
535,0.30393000000000003
536,0.29577
537,0.29013
538,0.28592
539,0.28171999999999997
540,0.27410999999999996
541,0.26397
542,0.25636
543,0.24875999999999998
544,0.24059
545,0.23299
546,0.22539
547,0.21778000000000003
548,0.21018
549,0.20455
550,0.20034000000000002
551,0.19868
552,0.18798
553,0.17982
554,0.17565
555,0.17403
556,0.16641
557,0.15879000000000001
558,0.15064
559,0.14302
560,0.13541
561,0.13379000000000002
562,0.12966
563,0.12097999999999999
564,0.11335
565,0.10976
566,0.10565999999999999
567,0.09954500000000001
568,0.091912
569,0.08427799999999999
570,0.076133
571,0.068499
572,0.060871
573,0.050696
574,0.044573
575,0.040493
576,0.034385
577,0.026749000000000002
578,0.019112999999999998
579,0.010968
580,0.0033320999999999997
581,-0.00022688
582,-0.0042788999999999995
583,-0.0078189
584,-0.018012
585,-0.025653
586,-0.033793000000000004
587,-0.041437
588,-0.049079000000000005
589,-0.056720000000000007
590,-0.064359
591,-0.06840299999999999
592,-0.072429
593,-0.078014
594,-0.085664
595,-0.096347
596,-0.10400000000000001
597,-0.10958
598,-0.11359000000000001
599,-0.11502000000000001
600,-0.12267
601,-0.13080999999999998
602,-0.13846
603,-0.14612
604,-0.15425
605,-0.15613
606,-0.15752
607,-0.16144
608,-0.16279000000000002
609,-0.16834000000000002
610,-0.17645999999999998
611,-0.18202000000000002
612,-0.18333
613,-0.18717999999999999
614,-0.18844
615,-0.18968
616,-0.19563
617,-0.20373
618,-0.20926
619,-0.21302
620,-0.21638000000000002
621,-0.22446999999999998
622,-0.23256
623,-0.23371
624,-0.23485
625,-0.23521999999999998
626,-0.23559000000000002
627,-0.23668000000000003
628,-0.2374
629,-0.2374
630,-0.2374
631,-0.23004000000000002
632,-0.22268000000000002
633,-0.21821999999999997
634,-0.21924000000000002
635,-0.21185
636,-0.20413
637,-0.19641
638,-0.18611
639,-0.17837999999999998
640,-0.17065999999999998
641,-0.16293
642,-0.15521
643,-0.14748
644,-0.13976
645,-0.13203
646,-0.1243
647,-0.11657999999999999
648,-0.10659
649,-0.098865
650,-0.09113500000000001
651,-0.083406
652,-0.075676
653,-0.067946
654,-0.060214
655,-0.058257
656,-0.056585
657,-0.0546
658,-0.047155
659,-0.039992
660,-0.038255000000000004
661,-0.036225
662,-0.028752999999999997
663,-0.021275
664,-0.022064
665,-0.020247
666,-0.012496
667,-0.0047459
668,0.0030050999999999997
669,0.010754999999999999
670,0.021091
671,0.028841000000000002
672,0.036594
673,0.044344999999999996
674,0.052095
675,0.055428
676,0.058776
677,0.06678400000000001
678,0.074531
679,0.08227899999999999
680,0.09286900000000001
681,0.10062
682,0.10837000000000001
683,0.11610999999999999
684,0.11896
685,0.12233
686,0.12314000000000001
687,0.13088
688,0.13863
689,0.14637
690,0.15439
691,0.16213
692,0.16554000000000002
693,0.16896
694,0.17182999999999998
695,0.17957
696,0.18731
697,0.19505
698,0.20279
699,0.21081
700,0.21855
701,0.22629000000000002
702,0.23661
703,0.24435
704,0.2475
705,0.25095
706,0.25411999999999996
707,0.26186
708,0.26959
709,0.27733
710,0.28507
711,0.2931
712,0.30083000000000004
713,0.31115
714,0.31889
715,0.32661999999999997
716,0.33237
717,0.33585
718,0.33903
719,0.34676999999999997
720,0.3545
721,0.36223
722,0.36996
723,0.38027
724,0.38800999999999997
725,0.39574000000000004
726,0.40348
727,0.41121
728,0.41925
729,0.42698
730,0.43472
731,0.44245
732,0.45019
733,0.45792
734,0.46824
735,0.47597
736,0.48371000000000003
737,0.49144
738,0.49918
739,0.50692
740,0.51466
741,0.5201100000000001
742,0.52358
743,0.52675
744,0.53479
745,0.5451
746,0.55314
747,0.56087
748,0.5686100000000001
749,0.57634
750,0.58408
751,0.58499
752,0.5885
753,0.59397
754,0.6017
755,0.612
756,0.61973
757,0.62746
758,0.6351899999999999
759,0.6429199999999999
760,0.65065
761,0.6583899999999999
762,0.6661199999999999
763,0.67385
764,0.68158
765,0.6893100000000001
766,0.69962
767,0.70736
768,0.71509
769,0.72282
770,0.73056
771,0.73829
772,0.74602
773,0.75376
774,0.76149
775,0.76923
776,0.77696
777,0.78728
778,0.79501
779,0.80274
780,0.81048
781,0.81822
782,0.82595
783,0.8336899999999999
784,0.84172
785,0.84946
786,0.8572
787,0.86493
788,0.87495
789,0.88269
790,0.8904299999999999
791,0.89817
792,0.90591
793,0.91365
794,0.92138
795,0.9291200000000001
796,0.93686
797,0.9446
798,0.9549200000000001
799,0.9626600000000001
800,0.9704
801,0.97814
802,0.98588
803,0.9936200000000001
804,1.0014
805,1.0037
806,1.0062
807,1.0114
808,1.0191
809,1.0295
810,1.0372
811,1.0398
812,1.0398
813,1.0429
814,1.0438
815,1.0472
816,1.0553
817,1.063
818,1.071
819,1.0788
820,1.0848
821,1.0874
822,1.0925
823,1.1003
824,1.1079999999999999
825,1.1157
826,1.1235
827,1.1312
828,1.1338
829,1.1332
830,1.1432
831,1.151
832,1.1587
833,1.1665
834,1.1742
835,1.1819
836,1.1897
837,1.1974
838,1.2052
839,1.2129
840,1.2206
841,1.2309999999999999
842,1.2387
843,1.2464
844,1.2499
845,1.2533
846,1.2588
847,1.2665
848,1.2742
849,1.2819999999999998
850,1.2897
851,1.2975
852,1.3081
853,1.3158
854,1.3235
855,1.3313
856,1.339
857,1.3465
858,1.3542
859,1.3619
860,1.3697
861,1.3774
862,1.3878
863,1.3955
864,1.4001
865,1.4019
866,1.4039
867,1.4091
868,1.4088
869,1.4080000000000001
870,1.4072
871,1.4064
872,1.4057
873,1.4047
874,1.4045
875,1.4017
876,1.396
877,1.3953
878,1.3946
879,1.3914
880,1.3907
881,1.3827
882,1.375
883,1.367
884,1.3566
885,1.3513
886,1.348
887,1.345
888,1.3371
889,1.3293
890,1.3215
891,1.3138
892,1.306
893,1.2983
894,1.2905
895,1.2799
896,1.2722
897,1.2644
898,1.2566
899,1.2489
900,1.2411
901,1.2334
902,1.2256
903,1.225
904,1.2218
905,1.2138
906,1.2061
907,1.1983
908,1.1905
909,1.1826
910,1.1748
911,1.167
912,1.1615
913,1.1583
914,1.1527
915,1.145
916,1.1346
917,1.1269
918,1.1191
919,1.1113
920,1.1036
921,1.0956
922,1.0878
923,1.0803
924,1.0725
925,1.0647
926,1.057
927,1.0466
928,1.0388
929,1.0311
930,1.0311
931,1.0285
932,1.0259
933,1.0181
934,1.0154
935,1.0154
936,1.0128
937,1.012
938,1.0115
939,1.0035
940,0.99575
941,0.9926200000000001
942,0.9895200000000001
943,0.9841700000000001
944,0.9764
945,0.96846
946,0.9606899999999999
947,0.9529200000000001
948,0.95
949,0.9469200000000001
950,0.9441700000000001
951,0.9364
952,0.92863
953,0.9207
954,0.9129299999999999
955,0.90515
956,0.89738
957,0.88961
958,0.88184
959,0.8714700000000001
960,0.86354
961,0.85577
962,0.848
963,0.8402299999999999
964,0.83245
965,0.82452
966,0.82406
967,0.81843
968,0.81066
969,0.80289
970,0.79237
971,0.7846
972,0.77682
973,0.76905
974,0.7612800000000001
975,0.7535
976,0.74573
977,0.74025
978,0.73724
979,0.73437
980,0.72401
981,0.71623
982,0.70832
983,0.7005399999999999
984,0.6976899999999999
985,0.69471
986,0.69188
987,0.6841
988,0.67632
989,0.6685399999999999
990,0.66064
991,0.65027
992,0.64249
993,0.63471
994,0.6317699999999999
995,0.63143
996,0.6261399999999999
997,0.61836
998,0.61058
999,0.6028
1000,0.59502
1001,0.58724
1002,0.57676
1003,0.56897
1004,0.5612
1005,0.5534100000000001
1006,0.54564
1007,0.53786
1008,0.5300699999999999
1009,0.52717
1010,0.52687
1011,0.51899
1012,0.50861
1013,0.50083
1014,0.49305
1015,0.48518
1016,0.47739
1017,0.46961
1018,0.46183
1019,0.45405
1020,0.44627
1021,0.4434
1022,0.44314
1023,0.43528
1024,0.42749
1025,0.41971
1026,0.41193
1027,0.40415
1028,0.39636
1029,0.3885
1030,0.38072
1031,0.37293000000000004
1032,0.36515
1033,0.35736999999999997
1034,0.34699
1035,0.34171999999999997
1036,0.33905
1037,0.33645
1038,0.32866999999999996
1039,0.32081
1040,0.31296
1041,0.3051
1042,0.29724
1043,0.29206
1044,0.28939000000000004
1045,0.28160999999999997
1046,0.27901
1047,0.27642
1048,0.26864
1049,0.26085
1050,0.25306999999999996
1051,0.24528000000000003
1052,0.23743000000000003
1053,0.22965
1054,0.22186
1055,0.21666999999999997
1056,0.21408000000000002
1057,0.20889000000000002
1058,0.20110999999999998
1059,0.19332
1060,0.19072999999999998
1061,0.18813
1062,0.18294000000000002
1063,0.17515999999999998
1064,0.16737
1065,0.15959
1066,0.14920999999999998
1067,0.14143
1068,0.13364
1069,0.12586
1070,0.11807000000000001
1071,0.11029000000000001
1072,0.10250999999999999
1073,0.094723
1074,0.086938
1075,0.079154
1076,0.07137
1077,0.06851499999999999
1078,0.065748
1079,0.057964
1080,0.050125
1081,0.042341000000000004
1082,0.034554
1083,0.029314
1084,0.02658
1085,0.023868
1086,0.018678999999999998
1087,0.0082971
1088,0.00047612
1089,-0.007309899999999999
1090,-0.012564
1091,-0.015235
1092,-0.017866999999999997
1093,-0.025653
1094,-0.033456
1095,-0.041243
1096,-0.049029
1097,-0.054234000000000004
1098,-0.054265
1099,-0.054265
1100,-0.05426
1101,-0.054254
1102,-0.054221000000000005
1103,-0.054204999999999996
1104,-0.054204999999999996
1105,-0.054204999999999996
1106,-0.0464
1107,-0.038613
1108,-0.035976
1109,-0.033264
1110,-0.028038999999999998
1111,-0.020216
1112,-0.01239
1113,-0.012258
1114,-0.012102
1115,-0.0042609
1116,0.0035241
1117,0.0063011000000000005
1118,0.0090991
1119,0.016953
1120,0.024737000000000002
1121,0.032522
1122,0.040379000000000005
1123,0.048163
1124,0.055947000000000004
1125,0.063731
1126,0.066399
1127,0.069234
1128,0.074685
1129,0.082557
1130,0.090435
1131,0.093321
1132,0.093635
1133,0.10142000000000001
1134,0.1092
1135,0.11698
1136,0.12487000000000001
1137,0.13264
1138,0.14042000000000002
1139,0.14831
1140,0.15361
1141,0.15667
1142,0.16197999999999999
1143,0.16976
1144,0.17765999999999998
1145,0.18544000000000002
1146,0.19322
1147,0.19619
1148,0.19919
1149,0.20451
1150,0.21229
1151,0.22007
1152,0.23043000000000002
1153,0.23820999999999998
1154,0.24598000000000003
1155,0.25376
1156,0.26154
1157,0.26931
1158,0.27709
1159,0.28486
1160,0.29264
1161,0.30041999999999996
1162,0.31079
1163,0.31583
1164,0.31816
1165,0.31816
1166,0.32594
1167,0.33371999999999996
1168,0.3415
1169,0.34928000000000003
1170,0.35705
1171,0.36224
1172,0.36224
1173,0.36780999999999997
1174,0.37559000000000003
1175,0.38337
1176,0.39114
1177,0.39892
1178,0.4067
1179,0.41447
1180,0.42225
1181,0.43003
1182,0.4378
1183,0.44558000000000003
1184,0.45595
1185,0.46373000000000003
1186,0.4715
1187,0.47928000000000004
1188,0.48162
1189,0.48385
1190,0.48621000000000003
1191,0.49399
1192,0.5017699999999999
1193,0.50955
1194,0.5199199999999999
1195,0.5277
1196,0.5354800000000001
1197,0.5432600000000001
1198,0.55104
1199,0.55882
1200,0.5666
1201,0.56942
1202,0.5723699999999999
1203,0.5778
1204,0.58557
1205,0.59595
1206,0.60385
1207,0.61163
1208,0.6194
1209,0.6271800000000001
1210,0.63237
1211,0.63237
1212,0.63768
1213,0.64545
1214,0.64817
1215,0.65089
1216,0.6615300000000001
1217,0.6694399999999999
1218,0.67476
1219,0.67735
1220,0.67994
1221,0.68772
1222,0.6954899999999999
1223,0.70327
1224,0.71105
1225,0.71882
1226,0.7266
1227,0.73697
1228,0.74474
1229,0.75252
1230,0.7603
1231,0.76807
1232,0.77585
1233,0.78376
1234,0.7915300000000001
1235,0.7993100000000001
1236,0.80709
1237,0.8174600000000001
1238,0.8252299999999999
1239,0.83301
1240,0.8409200000000001
1241,0.8413299999999999
1242,0.84435
1243,0.8521200000000001
1244,0.8599
1245,0.86767
1246,0.87545
1247,0.8832200000000001
1248,0.89359
1249,0.90136
1250,0.90914
1251,0.91706
1252,0.9248299999999999
1253,0.93261
1254,0.9403799999999999
1255,0.94816
1256,0.95593
1257,0.9637100000000001
1258,0.9714799999999999
1259,0.98185
1260,0.9896299999999999
1261,0.9974
1262,1.005
1263,1.013
1264,1.0207
1265,1.0285
1266,1.0363
1267,1.0441
1268,1.0518
1269,1.0622
1270,1.07
1271,1.0777
1272,1.0855
1273,1.0908
1274,1.0939
1275,1.0969
1276,1.1047
1277,1.1124
1278,1.1202
1279,1.128
1280,1.1384
1281,1.1461
1282,1.1541
1283,1.1618
1284,1.1696
1285,1.1774
1286,1.1851
1287,1.1929
1288,1.1957
1289,1.1983
1290,1.2034
1291,1.2138
1292,1.2216
1293,1.2293
1294,1.2319
1295,1.2345
1296,1.237
1297,1.2448
1298,1.2525
1299,1.2603
1300,1.2681
1301,1.2784
1302,1.2862
1303,1.294
1304,1.3018
1305,1.3095
1306,1.3173
1307,1.3251
1308,1.3329
1309,1.3406
1310,1.3484
1311,1.3562
1312,1.3666
1313,1.3743
1314,1.3823
1315,1.3851
1316,1.3856
1317,1.3935
1318,1.4013
1319,1.4092
1320,1.4169999999999998
1321,1.4247
1322,1.4325
1323,1.4429
1324,1.4507
1325,1.4584
1326,1.4662
1327,1.474
1328,1.4818
1329,1.4895
1330,1.4972
1331,1.5049
1332,1.5127
1333,1.5205
1334,1.531
1335,1.5388
1336,1.5465
1337,1.5543
1338,1.5621
1339,1.57
1340,1.5730000000000002
1341,1.5761
1342,1.584
1343,1.5892
1344,1.5899
1345,1.5904
1346,1.5909
1347,1.5914
1348,1.5919
1349,1.5925
1350,1.5931
1351,1.5937
1352,1.5861
1353,1.5783
1354,1.5789
1355,1.5798
1356,1.5778
1357,1.5785
1358,1.5737
1359,1.5659999999999998
1360,1.5582
1361,1.5504
1362,1.5427
1363,1.5349
1364,1.5272
1365,1.5196
1366,1.5093
1367,1.5013
1368,1.4936
1369,1.4858
1370,1.4780000000000002
1371,1.4705
1372,1.4628
1373,1.455
1374,1.4472
1375,1.4395
1376,1.4291
1377,1.4214
1378,1.4167
1379,1.4148
1380,1.4127
1381,1.405
1382,1.3972
1383,1.3895
1384,1.3817
1385,1.3742
1386,1.3664
1387,1.3561
1388,1.3484
1389,1.3406
1390,1.3354
1391,1.3362
1392,1.3344
1393,1.3269
1394,1.3191
1395,1.3114
1396,1.3037
1397,1.2959
1398,1.2856
1399,1.2778
1400,1.2701
1401,1.2623
1402,1.2546
1403,1.2468
1404,1.2391
1405,1.2314
1406,1.2288
1407,1.2262
1408,1.2209999999999999
1409,1.2133
1410,1.2107
1411,1.2081
1412,1.2004
1413,1.1926
1414,1.1852
1415,1.1774
1416,1.1722
1417,1.1731
1418,1.1713
1419,1.1699
1420,1.1702
1421,1.1702
1422,1.1625
1423,1.1547
1424,1.147
1425,1.1392
1426,1.1315
1427,1.1289
1428,1.1286
1429,1.1255
1430,1.1252
1431,1.1252
1432,1.1174
1433,1.1123
1434,1.1123
1435,1.1097
1436,1.102
1437,1.0939
1438,1.0862
1439,1.0785
1440,1.0707
1441,1.0607
1442,1.053
1443,1.0452
1444,1.0426
1445,1.0401
1446,1.0323
1447,1.0298
1448,1.0272
1449,1.0197
1450,1.012
1451,1.0017
1452,0.99395
1453,0.98879
1454,0.9862200000000001
1455,0.9862200000000001
1456,0.9784799999999999
1457,0.97075
1458,0.9630200000000001
1459,0.96044
1460,0.96044
1461,0.9527
1462,0.94239
1463,0.93466
1464,0.9269299999999999
1465,0.91919
1466,0.91146
1467,0.9037299999999999
1468,0.8959999999999999
1469,0.88826
1470,0.8859999999999999
1471,0.88436
1472,0.88531
1473,0.8750100000000001
1474,0.8672799999999999
1475,0.85956
1476,0.85183
1477,0.84411
1478,0.8363799999999999
1479,0.82865
1480,0.8209299999999999
1481,0.81321
1482,0.80548
1483,0.79518
1484,0.78746
1485,0.77973
1486,0.7720100000000001
1487,0.7642899999999999
1488,0.75657
1489,0.74884
1490,0.74112
1491,0.7334
1492,0.72568
1493,0.71829
1494,0.7076600000000001
1495,0.69994
1496,0.69222
1497,0.6845
1498,0.67678
1499,0.66906
1500,0.6613399999999999
1501,0.65362
1502,0.6459
1503,0.6381899999999999
1504,0.63047
1505,0.6201800000000001
1506,0.61246
1507,0.60509
1508,0.5970300000000001
1509,0.58931
1510,0.5815899999999999
1511,0.5738800000000001
1512,0.56616
1513,0.5588
1514,0.55109
1515,0.54337
1516,0.53309
1517,0.5253800000000001
1518,0.51767
1519,0.50995
1520,0.5022399999999999
1521,0.49453
1522,0.48646000000000006
1523,0.47875
1524,0.47103999999999996
1525,0.46331999999999995
1526,0.45305
1527,0.44533
1528,0.43762
1529,0.42991999999999997
1530,0.42883000000000004
1531,0.42518
1532,0.42226
1533,0.41455
1534,0.40683
1535,0.39912
1536,0.3914
1537,0.38111999999999996
1538,0.37305
1539,0.36534
1540,0.35763
1541,0.34991
1542,0.3422
1543,0.33449
1544,0.32678
1545,0.32349
1546,0.31985
1547,0.31659
1548,0.3063
1549,0.29858
1550,0.29086
1551,0.28315
1552,0.27543
1553,0.26771999999999996
1554,0.26000999999999996
1555,0.25229
1556,0.24422
1557,0.23651
1558,0.22621999999999998
1559,0.21850999999999998
1560,0.2108
1561,0.20307999999999998
1562,0.19723
1563,0.1936
1564,0.19103
1565,0.18332
1566,0.1756
1567,0.16788
1568,0.16017
1569,0.14987999999999999
1570,0.14217
1571,0.13702999999999999
1572,0.1381
1573,0.13369
1574,0.12598
1575,0.11864000000000001
1576,0.11093
1577,0.10323
1578,0.10178999999999999
1579,0.10037
1580,0.090489
1581,0.082791
1582,0.07509199999999999
1583,0.067396
1584,0.060095
1585,0.052399
1586,0.044705
1587,0.042943
1588,0.044163
1589,0.039865
1590,0.032597
1591,0.025332
1592,0.02405
1593,0.02535
1594,0.017675
1595,0.01
1596,0.0023250999999999996
1597,-0.004903899999999999
1598,-0.012577
1599,-0.017693
1600,-0.017693
1601,-0.016794999999999997
1602,-0.015434999999999999
1603,-0.014051
1604,-0.012647
1605,-0.0117
1606,-0.0117
1607,-0.0091479
1608,-0.0010189
1609,0.006636100000000001
1610,0.014293
1611,0.021947
1612,0.032631
1613,0.033581
1614,0.037575
1615,0.043157999999999995
1616,0.050808
1617,0.058941999999999994
1618,0.066594
1619,0.07424299999999999
1620,0.078251
1621,0.082277
1622,0.087868
1623,0.098554
1624,0.1021
1625,0.10615999999999999
1626,0.11227000000000001
1627,0.12040999999999999
1628,0.12653
1629,0.12808
1630,0.1322
1631,0.13379000000000002
1632,0.13541
1633,0.1461
1634,0.15372
1635,0.16133
1636,0.16895
1637,0.17657
1638,0.18473
1639,0.19235
1640,0.19996
1641,0.20758000000000001
1642,0.21574000000000002
1643,0.21681
1644,0.22152
1645,0.22659
1646,0.2342
1647,0.24181999999999998
1648,0.24943
1649,0.25705
1650,0.26466999999999996
1651,0.27229000000000003
1652,0.27991
1653,0.28753
1654,0.29568
1655,0.30584
1656,0.31346
1657,0.32108000000000003
1658,0.32268
1659,0.32684
1660,0.33246
1661,0.34007
1662,0.34769
1663,0.35585
1664,0.36346
1665,0.37108
1666,0.38124
1667,0.38739
1668,0.39155999999999996
1669,0.39519
1670,0.4028
1671,0.41041000000000005
1672,0.41803
1673,0.42563999999999996
1674,0.4338
1675,0.44141
1676,0.45156999999999997
1677,0.45918000000000003
1678,0.4668
1679,0.47241000000000005
1680,0.47658
1681,0.48077
1682,0.48838000000000004
1683,0.49654
1684,0.5041399999999999
1685,0.51176
1686,0.51793
1687,0.52269
1688,0.5283100000000001
1689,0.53592
1690,0.54352
1691,0.55113
1692,0.55929
1693,0.5669
1694,0.5745
1695,0.58211
1696,0.58378
1697,0.588
1698,0.59616
1699,0.6037600000000001
1700,0.61136
1701,0.61953
1702,0.62713
1703,0.63473
1704,0.6423399999999999
1705,0.6479699999999999
1706,0.6521899999999999
1707,0.65389
1708,0.6640199999999999
1709,0.67219
1710,0.67978
1711,0.68738
1712,0.69048
1713,0.6947300000000001
1714,0.70152
1715,0.70911
1716,0.71786
1717,0.7196
1718,0.7238899999999999
1719,0.7340000000000001
1720,0.74159
1721,0.74917
1722,0.75676
1723,0.76435
1724,0.77252
1725,0.7801100000000001
1726,0.7877
1727,0.7952899999999999
1728,0.80287
1729,0.80715
1730,0.8095
1731,0.81708
1732,0.8246600000000001
1733,0.83225
1734,0.83983
1735,0.8474200000000001
1736,0.85559
1737,0.86318
1738,0.87077
1739,0.87835
1740,0.88905
1741,0.8902200000000001
1742,0.89451
1743,0.90269
1744,0.91086
1745,0.91517
1746,0.91948
1747,0.92514
1748,0.93271
1749,0.94029
1750,0.94786
1751,0.9579700000000001
1752,0.96555
1753,0.9731299999999999
1754,0.9813
1755,0.98888
1756,0.99646
1757,1.004
1758,1.0116
1759,1.0198
1760,1.0216
1761,1.0259
1762,1.036
1763,1.0436
1764,1.0512
1765,1.0593
1766,1.0669
1767,1.0745
1768,1.0821
1769,1.0858
1770,1.0901
1771,1.0964
1772,1.1045
1773,1.1114
1774,1.1157
1775,1.1214
1776,1.129
1777,1.1365
1778,1.1447
1779,1.1523
1780,1.156
1781,1.1604
1782,1.1642
1783,1.1742
1784,1.1818
1785,1.1894
1786,1.1969
1787,1.2045
1788,1.2121
1789,1.2196
1790,1.2272
1791,1.2354
1792,1.2429
1793,1.2505
1794,1.2606
1795,1.2682
1796,1.2758
1797,1.2814
1798,1.2832
1799,1.2851
1800,1.2869
1801,1.2888
1802,1.2907
1803,1.2925
1804,1.2945
1805,1.297
1806,1.2989
1807,1.3009
1808,1.3029
1809,1.3048
1810,1.3043
1811,1.2993
1812,1.2918
1813,1.2849
1814,1.2774
1815,1.2706
1816,1.2701
1817,1.2690000000000001
1818,1.2614
1819,1.2539
1820,1.2464
1821,1.2389
1822,1.2314
1823,1.2246
1824,1.2171
1825,1.2096
1826,1.2071
1827,1.2071
1828,1.1996
1829,1.1946
1830,1.1921
1831,1.1889
1832,1.1832
1833,1.175
1834,1.1675
1835,1.1607
1836,1.1539
1837,1.1496
1838,1.1471
1839,1.1446
1840,1.1371
1841,1.1346
1842,1.1321
1843,1.1296
1844,1.1221
1845,1.1147
1846,1.1072
1847,1.0997
1848,1.0904
1849,1.0829
1850,1.0755
1851,1.068
1852,1.0605
1853,1.0555
1854,1.053
1855,1.0505
1856,1.0431
1857,1.0356
1858,1.0306
1859,1.0281
1860,1.0206
1861,1.0132
1862,1.0057
1863,0.9982200000000001
1864,0.9900200000000001
1865,0.98256
1866,0.97509
1867,0.9676299999999999
1868,0.96016
1869,0.94947
1870,0.94476
1871,0.9425600000000001
1872,0.93509
1873,0.9276200000000001
1874,0.92015
1875,0.91195
1876,0.90448
1877,0.89702
1878,0.88955
1879,0.8845799999999999
1880,0.8821
1881,0.8771200000000001
1882,0.86966
1883,0.86966
1884,0.8664299999999999
1885,0.8589700000000001
1886,0.85077
1887,0.8425600000000001
1888,0.83436
1889,0.82615
1890,0.8226700000000001
1891,0.82094
1892,0.8216899999999999
1893,0.81424
1894,0.80679
1895,0.7993399999999999
1896,0.7919
1897,0.78866
1898,0.78541
1899,0.78217
1900,0.77473
1901,0.7648
1902,0.75735
1903,0.7499100000000001
1904,0.74246
1905,0.7399899999999999
1906,0.73846
1907,0.73522
1908,0.72777
1909,0.72033
1910,0.7128899999999999
1911,0.70545
1912,0.69476
1913,0.6873199999999999
1914,0.67988
1915,0.67245
1916,0.66501
1917,0.6592899999999999
1918,0.6545
1919,0.6522
1920,0.64476
1921,0.63732
1922,0.6274
1923,0.6199600000000001
1924,0.61253
1925,0.60509
1926,0.5968899999999999
1927,0.58945
1928,0.58202
1929,0.5745899999999999
1930,0.56716
1931,0.55974
1932,0.5523100000000001
1933,0.5424100000000001
1934,0.53499
1935,0.53264
1936,0.52783
1937,0.5221
1938,0.51467
1939,0.50646
1940,0.49903000000000003
1941,0.49161000000000005
1942,0.48757
1943,0.48277
1944,0.47379
1945,0.46636000000000005
1946,0.45892
1947,0.45148999999999995
1948,0.44406
1949,0.43585
1950,0.42843000000000003
1951,0.42100000000000004
1952,0.41358
1953,0.40615
1954,0.39873000000000003
1955,0.38884
1956,0.38142
1957,0.37401
1958,0.36659
1959,0.35918
1960,0.35176999999999997
1961,0.34436
1962,0.34189
1963,0.33943
1964,0.33121999999999996
1965,0.32795
1966,0.32468
1967,0.32141
1968,0.3132
1969,0.30499
1970,0.29925999999999997
1971,0.29679
1972,0.29431999999999997
1973,0.28691
1974,0.2795
1975,0.2721
1976,0.26142
1977,0.25401999999999997
1978,0.24661999999999998
1979,0.23840999999999998
1980,0.23353000000000002
1981,0.23113000000000003
1982,0.22619
1983,0.21878000000000003
1984,0.21136999999999997
1985,0.20397
1986,0.19576
1987,0.18589
1988,0.17849
1989,0.17109000000000002
1990,0.1637
1991,0.1563
1992,0.15220999999999998
1993,0.14732
1994,0.14324
1995,0.13584000000000002
1996,0.12843
1997,0.11775999999999999
1998,0.11035999999999999
1999,0.10547000000000001
2000,0.1006
2001,0.09486499999999999
2002,0.08745499999999999
2003,0.079248
2004,0.07184
2005,0.064435
2006,0.059498
2007,0.059498
2008,0.048822000000000004
2009,0.040615
2010,0.032407
2011,0.0242
2012,0.020927
2013,0.017657
2014,0.0094491
2015,0.0020441
2016,-0.0020849
2017,-0.0037408999999999997
2018,-0.0078579
2019,-0.016896
2020,-0.024286000000000002
2021,-0.032493
2022,-0.035776
2023,-0.039057
2024,-0.042341000000000004
2025,-0.04973
2026,-0.057116999999999994
2027,-0.062041
2028,-0.064502
2029,-0.066962
2030,-0.076805
2031,-0.084187
2032,-0.09156399999999999
2033,-0.098938
2034,-0.10714000000000001
2035,-0.11452000000000001
2036,-0.12189000000000001
2037,-0.12925999999999999
2038,-0.13662
2039,-0.14237
2040,-0.14818
2041,-0.15231
2042,-0.15969
2043,-0.16706
2044,-0.17443
2045,-0.1818
2046,-0.18917
2047,-0.19652999999999998
2048,-0.20389000000000002
2049,-0.21125
2050,-0.21861
2051,-0.22841
2052,-0.23576
2053,-0.24311
2054,-0.25046
2055,-0.2578
2056,-0.25851
2057,-0.25834
2058,-0.25902
2059,-0.26634
2060,-0.27365
2061,-0.28097
2062,-0.29072
2063,-0.29713
2064,-0.30443000000000003
2065,-0.31173
2066,-0.31903000000000004
2067,-0.32632
2068,-0.33027
2069,-0.32994
2070,-0.32716999999999996
2071,-0.33444
2072,-0.34412
2073,-0.35045
2074,-0.3577
2075,-0.36254000000000003
2076,-0.35969
2077,-0.35924
2078,-0.3631
2079,-0.37032
2080,-0.37755
2081,-0.38379
2082,-0.39100999999999997
2083,-0.39287
2084,-0.38989
2085,-0.39369
2086,-0.40087
2087,-0.40806
2088,-0.41523000000000004
2089,-0.42241000000000006
2090,-0.42856000000000005
2091,-0.43573
2092,-0.44288999999999995
2093,-0.44766000000000006
2094,-0.44766000000000006
2095,-0.44561000000000006
2096,-0.44251
2097,-0.43938999999999995
2098,-0.43625
2099,-0.43413999999999997
2100,-0.43309
2101,-0.43072
2102,-0.42754
2103,-0.42196999999999996
2104,-0.41617
2105,-0.40671
2106,-0.39960999999999997
2107,-0.39144
2108,-0.38433
2109,-0.37722
2110,-0.3701
2111,-0.36325
2112,-0.35771
2113,-0.35320999999999997
2114,-0.34505
2115,-0.33688
2116,-0.33132
2117,-0.32574000000000003
2118,-0.31865
2119,-0.31155
2120,-0.30339
2121,-0.29629
2122,-0.29049
2123,-0.28492
2124,-0.27934000000000003
2125,-0.27225
2126,-0.26172
2127,-0.25463
2128,-0.24753000000000003
2129,-0.24303000000000002
2130,-0.23745
2131,-0.23294
2132,-0.22478
2133,-0.21769000000000002
2134,-0.21445999999999998
2135,-0.20885
2136,-0.2007
2137,-0.19125999999999999
2138,-0.18417999999999998
2139,-0.17601
2140,-0.16893
2141,-0.16184
2142,-0.15474000000000002
2143,-0.15024
2144,-0.14465
2145,-0.13777
2146,-0.13069
2147,-0.12124000000000001
2148,-0.11307
2149,-0.10597999999999999
2150,-0.098883
2151,-0.091782
2152,-0.085983
2153,-0.08041799999999999
2154,-0.074837
2155,-0.067749
2156,-0.060653
2157,-0.053554
2158,-0.044085
2159,-0.036978
2160,-0.028810000000000002
2161,-0.021698
2162,-0.014583
2163,-0.0074639
2164,-0.0016679000000000002
2165,0.0038661000000000004
2166,0.0070431
2167,0.01415
2168,0.021259
2169,0.0318
2170,0.038917
2171,0.044716000000000006
2172,0.050252
2173,0.055802
2174,0.062908
2175,0.070018
2176,0.078186
2177,0.085301
2178,0.091099
2179,0.0977
2180,0.10455999999999999
2181,0.11273
2182,0.11959000000000002
2183,0.12516
2184,0.13203
2185,0.13912
2186,0.14729
2187,0.15439
2188,0.16149000000000002
2189,0.16705
2190,0.1737
2191,0.17843
2192,0.18659
2193,0.19239
2194,0.19798
2195,0.20122
2196,0.20938
2197,0.21645999999999999
2198,0.22098
2199,0.22659
2200,0.23348000000000002
2201,0.24399
2202,0.24853000000000003
2203,0.25181
2204,0.25635
2205,0.26450999999999997
2206,0.27155999999999997
2207,0.27610999999999997
2208,0.27941
2209,0.28273000000000004
2210,0.28841
2211,0.29175
2212,0.29868
2213,0.3057
2214,0.3115
2215,0.31721
2216,0.32058000000000003
2217,0.3276
2218,0.33574
2219,0.34033
2220,0.34371999999999997
2221,0.34945
2222,0.35401
2223,0.35978000000000004
2224,0.36791
2225,0.37604
2226,0.37949
2227,0.38295
2228,0.38642
2229,0.39223
2230,0.39573
2231,0.39925
2232,0.40278
2233,0.41208
2234,0.41901000000000005
2235,0.42368
2236,0.42723
2237,0.4308
2238,0.43438000000000004
2239,0.43796999999999997
2240,0.44158000000000003
2241,0.4452
2242,0.44883999999999996
2243,0.44898000000000005
2244,0.44104
2245,0.43768999999999997
2246,0.44138
2247,0.44508000000000003
2248,0.4488
2249,0.45025
2250,0.45399999999999996
2251,0.45776000000000006
2252,0.46153999999999995
2253,0.456
2254,0.44693999999999995
2255,0.44142
2256,0.43463999999999997
2257,0.43012
2258,0.4317
2259,0.43556000000000006
2260,0.43233999999999995
2261,0.42558999999999997
2262,0.41884
2263,0.4121
2264,0.40536
2265,0.39638
2266,0.38965
2267,0.38293
2268,0.37621
2269,0.3695
2270,0.36279
2271,0.35884
2272,0.35266
2273,0.34686999999999996
2274,0.34015
2275,0.33344
2276,0.32316999999999996
2277,0.31647
2278,0.30977
2279,0.30308
2280,0.29952
2281,0.29331
2282,0.28488
2283,0.27686
2284,0.27016
2285,0.26396
2286,0.26000999999999996
2287,0.24974000000000002
2288,0.24303000000000002
2289,0.23633
2290,0.22963000000000003
2291,0.22294
2292,0.21493
2293,0.20824
2294,0.20156
2295,0.19489
2296,0.18822
2297,0.17934
2298,0.17268
2299,0.16643
2300,0.16018
2301,0.15439
2302,0.14772000000000002
2303,0.13972
2304,0.13305999999999998
2305,0.12641
2306,0.1215
2307,0.11524000000000001
2308,0.10811
2309,0.10145
2310,0.094795
2311,0.088148
2312,0.080151
2313,0.073511
2314,0.06687699999999999
2315,0.06025
2316,0.053628999999999996
2317,0.047013
2318,0.039865
2319,0.032192
2320,0.026412
2321,0.019788
2322,0.013171
2323,0.0065611
2324,-0.0014179
2325,-0.0080219
2326,-0.014616999999999998
2327,-0.021205
2328,-0.02779
2329,-0.036558
2330,-0.041531
2331,-0.047887
2332,-0.055049
2333,-0.06163099999999999
2334,-0.068208
2335,-0.07478
2336,-0.081345
2337,-0.089303
2338,-0.095859
2339,-0.10240999999999999
2340,-0.11112999999999999
2341,-0.11765999999999999
2342,-0.12265999999999999
2343,-0.12907000000000002
2344,-0.13625
2345,-0.1442
2346,-0.15138
2347,-0.15777
2348,-0.16276
2349,-0.16931
2350,-0.17586
2351,-0.18599000000000002
2352,-0.19252
2353,-0.19752999999999998
2354,-0.20393
2355,-0.20893
2356,-0.21547
2357,-0.22341999999999998
2358,-0.22996
2359,-0.23649
2360,-0.24225
2361,-0.24649000000000001
2362,-0.2529
2363,-0.25944
2364,-0.26597
2365,-0.27392
2366,-0.28044
2367,-0.28838
2368,-0.29263
2369,-0.29905
2370,-0.30558
2371,-0.31351999999999997
2372,-0.32222
2373,-0.32873
2374,-0.33449
2375,-0.33876
2376,-0.34519
2377,-0.34954
2378,-0.35606
2379,-0.36399000000000004
2380,-0.3705
2381,-0.377
2382,-0.38345
2383,-0.39349
2384,-0.4
2385,-0.4065
2386,-0.413
2387,-0.42091999999999996
2388,-0.42741
2389,-0.43388000000000004
2390,-0.44035
2391,-0.4454
2392,-0.45188
2393,-0.45692
2394,-0.46556000000000003
2395,-0.47203
2396,-0.47994
2397,-0.4864
2398,-0.49285
2399,-0.49928999999999996
2400,-0.50572
2401,-0.5101100000000001
2402,-0.51663
2403,-0.5223800000000001
2404,-0.5309699999999999
2405,-0.5374
2406,-0.54383
2407,-0.55172
2408,-0.55813
2409,-0.5645399999999999
2410,-0.57093
2411,-0.5773199999999999
2412,-0.5837
2413,-0.59029
2414,-0.59687
2415,-0.6047399999999999
2416,-0.6111300000000001
2417,-0.6175
2418,-0.62536
2419,-0.63172
2420,-0.63808
2421,-0.64442
2422,-0.65015
2423,-0.65678
2424,-0.6612899999999999
2425,-0.6655300000000001
2426,-0.67399
2427,-0.68183
2428,-0.68816
2429,-0.69448
2430,-0.70114
2431,-0.70567
2432,-0.7135199999999999
2433,-0.7198399999999999
2434,-0.72768
2435,-0.7340000000000001
2436,-0.74335
2437,-0.7500100000000001
2438,-0.7530399999999999
2439,-0.75936
2440,-0.7672
2441,-0.7735
2442,-0.7798
2443,-0.78762
2444,-0.79068
2445,-0.7973600000000001
2446,-0.80308
2447,-0.81301
2448,-0.81816
2449,-0.82483
2450,-0.8299700000000001
2451,-0.8362799999999999
2452,-0.84411
2453,-0.85041
2454,-0.8567
2455,-0.8624200000000001
2456,-0.86911
2457,-0.87579
2458,-0.88571
2459,-0.89144
2460,-0.89812
2461,-0.90479
2462,-0.9126200000000001
2463,-0.92045
2464,-0.92712
2465,-0.93166
2466,-0.9358799999999999
2467,-0.9422
2468,-0.9500200000000001
2469,-0.95842
2470,-0.96624
2471,-0.97083
2472,-0.9775
2473,-0.9838
2474,-0.9901
2475,-0.9979100000000001
2476,-1.0042
2477,-1.0084
2478,-1.0151
2479,-1.0233
2480,-1.0275
2481,-1.0353
2482,-1.0426
2483,-1.0493
2484,-1.0544
2485,-1.0607
2486,-1.0685
2487,-1.0748
2488,-1.0811
2489,-1.0847
2490,-1.095
2491,-1.1002
2492,-1.1065
2493,-1.1143
2494,-1.1205
2495,-1.1268
2496,-1.1325
2497,-1.1371
2498,-1.1439
2499,-1.1501
2500,-1.1579
2501,-1.1662
2502,-1.1729
2503,-1.1786
2504,-1.1849
2505,-1.1921
2506,-1.1988
2507,-1.2061
2508,-1.2124
2509,-1.2202
2510,-1.2264
2511,-1.2363
2512,-1.2429999999999999
2513,-1.2498
2514,-1.256
2515,-1.2638
2516,-1.2685
2517,-1.2752
2518,-1.2809
2519,-1.2872
2520,-1.295
2521,-1.3012
2522,-1.311
2523,-1.3162
2524,-1.3209
2525,-1.3266
2526,-1.3344
2527,-1.338
2528,-1.3448
2529,-1.3494
2530,-1.3561
2531,-1.3607
2532,-1.3658
2533,-1.3758
2534,-1.383
2535,-1.3897
2536,-1.3948
2537,-1.4027
2538,-1.409
2539,-1.4135
2540,-1.4202
2541,-1.4280000000000002
2542,-1.4359
2543,-1.4409999999999998
2544,-1.4491
2545,-1.4569999999999999
2546,-1.4648
2547,-1.47
2548,-1.4766
2549,-1.4838
2550,-1.4917
2551,-1.4989
2552,-1.5055
2553,-1.5106
2554,-1.5191
2555,-1.527
2556,-1.5333
2557,-1.5397
2558,-1.5448
2559,-1.5514
2560,-1.5565
2561,-1.5629
2562,-1.5707
2563,-1.5771
2564,-1.5834
2565,-1.5906
2566,-1.5973
2567,-1.6045
2568,-1.6109
2569,-1.6172
2570,-1.6235
2571,-1.6313
2572,-1.6376
2573,-1.6438
2574,-1.6516
2575,-1.6562
2576,-1.6651
2577,-1.6713
2578,-1.6776
2579,-1.6838
2580,-1.69
2581,-1.6962
2582,-1.7023
2583,-1.7101
2584,-1.7162
2585,-1.7223
2586,-1.7304
2587,-1.7365
2588,-1.7425
2589,-1.7478
2590,-1.7547
2591,-1.7619999999999998
2592,-1.7681
2593,-1.7741
2594,-1.7801
2595,-1.7861
2596,-1.7921
2597,-1.8016
2598,-1.8076
2599,-1.8134
2600,-1.8193
2601,-1.8251
2602,-1.8309
2603,-1.8385
2604,-1.8419
2605,-1.8491
2606,-1.8547
2607,-1.8605
2608,-1.8681
2609,-1.8739
2610,-1.8796
2611,-1.8852
2612,-1.8927
2613,-1.8983
2614,-1.9039
2615,-1.9094
2616,-1.9149
2617,-1.9204
2618,-1.9277
2619,-1.9331
2620,-1.9385
2621,-1.9419
2622,-1.9472
2623,-1.9544
2624,-1.9596
2625,-1.9648
2626,-1.97
2627,-1.9751
2628,-1.9801
2629,-1.9868
2630,-1.9938
2631,-2.0011
2632,-2.0071
2633,-2.0124
2634,-2.0174
2635,-2.0223
2636,-2.0271
2637,-2.032
2638,-2.0388
2639,-2.0435
2640,-2.0498
2641,-2.0544
2642,-2.0589
2643,-2.0635
2644,-2.0679
2645,-2.0723
2646,-2.0767
2647,-2.081
2648,-2.0852
2649,-2.0894
2650,-2.0935
2651,-2.0989
2652,-2.1029
2653,-2.1091
2654,-2.1158
2655,-2.1238
2656,-2.1278
2657,-2.1316
2658,-2.1354
2659,-2.1391
2660,-2.1428
2661,-2.1476
2662,-2.1511
2663,-2.1545
2664,-2.1578
2665,-2.1611
2666,-2.1643
2667,-2.1674
2668,-2.1729
2669,-2.1758
2670,-2.1787
2671,-2.1816
2672,-2.1852
2673,-2.1878
2674,-2.1904
2675,-2.1928
2676,-2.1986
2677,-2.2068
2678,-2.2125
2679,-2.2149
2680,-2.2171
2681,-2.2193
2682,-2.2214
2683,-2.224
2684,-2.2258
2685,-2.2276
2686,-2.2293
2687,-2.2308
2688,-2.2323
2689,-2.2337
2690,-2.235
2691,-2.2361
2692,-2.2372
2693,-2.2385
2694,-2.2419
2695,-2.2426
2696,-2.2433
2697,-2.2438
2698,-2.2443
2699,-2.2446
2700,-2.2448
2701,-2.2449
2702,-2.2449
2703,-2.2449
2704,-2.2449
2705,-2.2449
2706,-2.2449
2707,-2.2449
2708,-2.2449
