[<text>
<title>&lt;oe inc&gt; 4th qtr net</title>
<dateline>    montreal, march 20 -
    </dateline>shr 24 cts vs 26 cts
    net 1.5 mln vs 1.3 mln
    revs 40.5 mln vs 33.5 mln
    year
    shr 80 cts vs 82 cts
    net 4.9 mln vs 4.1 mln
    revs 143.0 mln vs 121.1 mln
    avg shrs 6.1 mln vs 5.0 mln
 reuter
</text>]