time,value
0,0.7106100000000001
1,-1.0176
2,-1.0176
3,-1.0176
4,0.80157
5,1.2564
6,-0.017055
7,-1.0176
8,-1.0176
9,-1.0176
10,1.4383
11,1.2564
12,-0.65376
13,-1.0176
14,-1.0176
15,-0.19897
16,1.3473
17,1.0744
18,-1.0176
19,-1.0176
20,-1.0176
21,0.34678000000000003
22,1.2564
23,0.61965
24,-1.0176
25,-1.0176
26,-1.0176
27,1.4383
28,1.1654
29,-0.5628
30,-1.0176
31,-0.017055
32,1.2564
33,1.2564
34,0.25582
35,-1.0176
36,-1.0176
37,0.073903
38,1.2564
39,1.0744
40,-1.0176
41,-1.0176
42,-1.0176
43,1.3473
44,1.2564
45,-0.7447199999999999
46,-1.0176
47,-1.0176
48,1.2564
49,1.2564
50,-0.19897
51,-1.0176
52,-1.0176
53,0.8925299999999999
54,1.2564
55,0.7106100000000001
56,-1.0176
57,-1.0176
58,-0.5628
59,1.3473
60,1.1654
61,-0.47184
62,-1.0176
63,-1.0176
64,0.16485999999999998
65,1.2564
66,0.80157
67,-1.0176
68,-1.0176
69,-1.0176
70,1.1654
71,1.2564
72,-0.017055
73,-1.0176
74,-1.0176
75,-0.65376
76,1.2564
77,1.2564
78,-0.47184
79,-1.0176
80,0.073903
81,1.2564
82,1.1654
83,1.1654
84,-1.0176
85,-1.0176
86,-1.0176
87,-0.017055
88,1.2564
89,1.0744
90,-1.0176
91,-1.0176
92,-0.19897
93,1.2564
94,1.1654
95,0.52869
