time,value
0,-0.90707
1,-0.90707
2,0.9696299999999999
3,1.2511
4,1.1573
5,-0.34406
6,-0.90707
7,-0.90707
8,-0.90707
9,-0.90707
10,-0.90707
11,-0.90707
12,1.345
13,1.345
14,1.2511
15,-0.15639
16,-0.90707
17,-0.90707
18,-0.90707
19,-0.90707
20,-0.90707
21,-0.90707
22,0.12511
23,1.345
24,1.2511
25,1.1573
26,-0.53173
27,-0.90707
28,-0.90707
29,-0.90707
30,-0.90707
31,-0.062557
32,1.345
33,1.2511
34,1.2511
35,-0.62557
36,-0.90707
37,-0.90707
38,-0.90707
39,1.1573
40,1.345
41,1.345
42,0.31278
43,-0.90707
44,-0.90707
45,-0.90707
46,-0.90707
47,0.31278
48,1.345
49,1.345
50,1.2511
51,-0.15639
52,-0.90707
53,-0.90707
54,-0.90707
55,1.1573
56,1.4388
57,1.2511
58,0.50045
59,-0.90707
60,-0.90707
61,-0.90707
62,-0.90707
63,0.87579
64,1.345
65,1.345
66,0.031278
67,-0.90707
68,-0.90707
69,-0.90707
70,-0.15639
71,1.4388
72,1.345
73,1.2511
74,-0.7194
75,-0.90707
76,-0.90707
77,-0.90707
78,1.1573
79,1.4388
80,1.2511
81,0.12511
82,-0.90707
83,-0.90707
84,-0.90707
85,-0.90707
86,0.78196
87,1.4388
88,1.2511
89,0.50045
90,-0.90707
91,-0.90707
92,-0.90707
93,-0.90707
94,-0.34406
95,1.4388
