time,value
0,-0.13795
1,-0.13795
2,-0.13795
3,-0.13795
4,-0.13795
5,-0.13795
6,-0.13795
7,-0.13795
8,-0.13795
9,-0.13795
10,-0.13795
11,-0.13795
12,-0.13795
13,-0.13795
14,-0.13795
15,-0.13795
16,-0.13795
17,-0.13795
18,-0.13795
19,-0.13795
20,-0.13795
21,-0.13795
22,-0.13795
23,-0.13795
24,-0.13795
25,-0.13795
26,-0.13795
27,-0.13795
28,0.9656600000000001
29,9.2427
30,-0.13795
31,2.6211
32,-0.13795
33,-0.13795
34,-0.13795
35,-0.13795
36,-0.13795
37,-0.13795
38,-0.13795
39,-0.13795
40,-0.13795
41,-0.13795
42,-0.13795
43,-0.13795
44,-0.13795
45,-0.13795
46,-0.13795
47,-0.13795
48,-0.13795
49,-0.13795
50,-0.13795
51,-0.13795
52,-0.13795
53,-0.13795
54,-0.13795
55,-0.13795
56,-0.13795
57,-0.13795
58,-0.13795
59,-0.13795
60,-0.13795
61,-0.13795
62,-0.13795
63,-0.13795
64,-0.13795
65,-0.13795
66,-0.13795
67,-0.13795
68,-0.13795
69,-0.13795
70,-0.13795
71,-0.13795
72,-0.13795
73,-0.13795
74,-0.13795
75,-0.13795
76,-0.13795
77,-0.13795
78,-0.13795
79,-0.13795
80,-0.13795
81,-0.13795
82,-0.13795
83,-0.13795
84,-0.13795
85,-0.13795
86,-0.13795
87,-0.13795
88,-0.13795
89,-0.13795
90,-0.13795
91,-0.13795
92,-0.13795
93,-0.13795
94,-0.13795
95,-0.13795
