time,value
0,0.63032
1,0.55162
2,0.5362600000000001
3,0.40026999999999996
4,0.25537
5,0.1748
6,0.18606
7,0.18844
8,0.25658000000000003
9,0.21568
10,0.052388
11,-0.08841399999999999
12,-0.22098
13,-0.37138000000000004
14,-0.50346
15,-0.66233
16,-0.78012
17,-0.83373
18,-0.8183
19,-0.79132
20,-0.67707
21,-0.56165
22,-0.47081999999999996
23,-0.38034
24,-0.21733000000000002
25,-0.050753
26,0.065179
27,0.2205
28,0.30730999999999997
29,0.38616999999999996
30,0.50818
31,0.5353100000000001
32,0.3702
33,0.25109000000000004
34,0.10774
35,-0.031188999999999998
36,-0.19030999999999998
37,-0.30344
38,-0.4603
39,-0.5471699999999999
40,-0.65196
41,-0.71499
42,-0.8218700000000001
43,-0.93015
44,-1.0867
45,-1.2399
46,-1.3217
47,-1.463
48,-1.5165
49,-1.6423
50,-1.7291
51,-1.7344
52,-1.8624
53,-1.9862
54,-1.9902
55,-1.9748
56,-2.0348
57,-2.0393
58,-2.0111
59,-1.9281
60,-1.9204
61,-1.7776
62,-1.8332
63,-1.7209
64,-1.6418
65,-1.5851
66,-1.4804
67,-1.2811
68,-1.1739
69,-1.0098
70,-0.91743
71,-0.8287899999999999
72,-0.6695
73,-0.55602
74,-0.38944
75,-0.26687
76,-0.10790999999999999
77,0.038862
78,0.20077
79,0.24828000000000003
80,0.21505
81,0.15452
82,0.16065
83,0.18887
84,0.22244
85,0.40417
86,0.52785
87,0.66922
88,0.76641
89,0.9188799999999999
90,0.9868100000000001
91,1.0566
92,1.278
93,1.4563
94,1.6069
95,1.6832
96,1.6968
97,1.6595
98,1.6209
99,1.59
100,1.5672
101,1.5522
102,1.5453
103,1.5466
104,1.5561
105,1.5735
106,1.5911
107,1.6236
108,1.6646
109,1.714
110,1.7722
111,1.8405
112,1.9145
113,1.993
114,2.0712
115,1.9424
116,1.7109
117,1.6467
118,1.6458
119,1.6045
120,1.6364
121,1.662
122,1.7448
123,1.8519
124,1.9633
125,2.088
126,2.2124
127,2.3437
128,2.2403
129,2.1497
130,2.1468
131,2.1345
132,2.15
133,2.1125
134,2.0053
135,1.8279
136,1.7104
137,1.6198
138,1.5469
139,1.4411
140,1.3662
141,1.2412
142,1.0869
143,0.92163
144,0.89374
145,0.84525
146,0.7687
147,0.67477
148,0.5905699999999999
149,0.4918
150,0.5320199999999999
151,0.6661699999999999
152,0.75339
153,0.7521100000000001
154,0.64112
155,0.5951
156,0.44545
157,0.32329
158,0.24964
159,0.16546
160,0.09109400000000001
161,-0.011673000000000001
162,-0.11470999999999999
163,-0.24018
164,-0.3554
165,-0.43233
166,-0.43209
167,-0.40884000000000004
168,-0.20509000000000002
169,0.01295
170,0.076534
171,-0.0038003
172,-0.078811
173,-0.14169
174,-0.26489
175,-0.40113000000000004
176,-0.54414
177,-0.63798
178,-0.76551
179,-0.8794
180,-0.96205
181,-1.0682
182,-1.1635
183,-1.1805
184,-1.2371
185,-1.2912
186,-1.3798
187,-1.4691
188,-1.5345
189,-1.5886
190,-1.7297
191,-1.6658
192,-1.4916
193,-1.3138
194,-1.2542
195,-1.2693
196,-1.3045
197,-1.1817
198,-1.0291
199,-0.91212
200,-0.78352
201,-0.76202
202,-0.7603300000000001
203,-0.66014
204,-0.64242
205,-0.6725800000000001
206,-0.57592
207,-0.48596000000000006
208,-0.38133
209,-0.30741
210,-0.19141
211,-0.10221000000000001
212,-0.054522
213,0.093998
214,0.22771
215,0.32247
216,0.45866999999999997
217,0.56102
218,0.67451
219,0.5522600000000001
220,0.43995
221,0.26145999999999997
222,0.13682
223,-0.012647
224,-0.19293
225,-0.31442
226,-0.49788000000000004
227,-0.56272
228,-0.6451399999999999
229,-0.7369399999999999
230,-0.65072
231,-0.60752
232,-0.63115
233,-0.53972
234,-0.53298
235,-0.44535
236,-0.36496999999999996
237,-0.27684000000000003
238,-0.14893
239,-0.032355
240,0.078349
241,0.16375
242,0.2695
243,0.2725
244,0.35931
245,0.31632
246,0.40184000000000003
247,0.50366
248,0.56528
249,0.6882
250,0.73264
251,0.80091
252,0.8887799999999999
253,1.0332
254,1.1526
255,1.0806
256,0.91056
257,0.7426699999999999
258,0.62084
259,0.47494
260,0.37940999999999997
261,0.37806999999999996
262,0.46948999999999996
263,0.57243
264,0.69628
265,0.78257
266,0.8315600000000001
267,0.92724
268,1.0603
269,1.0994
270,1.1593
271,1.053
272,1.0365
273,0.9673299999999999
274,0.9042
275,0.8503299999999999
276,0.80419
277,0.76703
278,0.73869
279,0.70625
280,0.67062
281,0.5691
282,0.43523
283,0.27534000000000003
284,0.15827
285,0.12747999999999998
286,0.056962
287,-0.095523
288,-0.24108000000000002
289,-0.40417
290,-0.5656100000000001
291,-0.71123
292,-0.85646
293,-0.94314
294,-0.9770200000000001
295,-1.0578
296,-1.1346
297,-1.2812
298,-1.3564
299,-1.4599
300,-1.5276
301,-1.3942
302,-1.4436
303,-1.3587
304,-1.3195
305,-1.2764
306,-1.2277
307,-1.1451
308,-0.9886299999999999
309,-0.94995
310,-0.8957299999999999
311,-0.81697
312,-0.71363
313,-0.62083
314,-0.57985
315,-0.47606000000000004
316,-0.3748
317,-0.23668000000000003
318,-0.088654
319,0.00037044
320,0.13263
321,0.20873000000000003
322,0.35317
323,0.46321999999999997
324,0.5924699999999999
325,0.74468
326,0.8919299999999999
327,1.0518
328,1.1598
329,1.1079
330,0.91612
331,0.70839
332,0.52477
333,0.31389
334,0.14115999999999998
335,-0.041848
336,-0.17212
337,-0.34185
338,-0.49217
339,-0.65682
340,-0.78652
341,-0.79838
342,-0.73218
343,-0.6097600000000001
344,-0.60761
345,-0.56834
346,-0.40783
347,-0.23293000000000003
348,-0.08795
349,0.039275
350,0.18477000000000002
351,0.35102
352,0.5254800000000001
353,0.60309
354,0.46736000000000005
355,0.3672
356,0.28515
357,0.31
358,0.42186999999999997
359,0.50031
360,0.64269
361,0.78667
362,0.79679
363,0.9136299999999999
364,1.025
365,1.1822
366,1.3466
367,1.3492
368,1.1716
369,0.98314
370,0.80729
371,0.64374
372,0.47625
373,0.31190999999999997
374,0.15233
375,0.020422
376,-0.11832000000000001
377,-0.19121
378,-0.35986999999999997
379,-0.47931
380,-0.61787
381,-0.75964
382,-0.9031600000000001
383,-0.97391
384,-1.0614
385,-1.1969
386,-1.3999
387,-1.557
388,-1.6347
389,-1.6759
390,-1.6988
391,-1.6846
392,-1.5778
393,-1.4938
394,-1.3807
395,-1.1961
396,-0.9633
397,-0.73218
398,-0.51769
399,-0.30835999999999997
400,-0.11347
401,-0.22223
402,-0.35179
403,-0.48698
404,-0.59542
405,-0.6751199999999999
406,-0.76849
407,-0.8913200000000001
408,-0.94024
409,-1.0049
410,-0.9572799999999999
411,-0.9271299999999999
412,-0.91309
413,-0.81338
414,-0.65113
415,-0.47884
416,-0.30491999999999997
417,-0.16645
418,0.013303
419,0.17104
420,0.13694
421,0.14065
422,0.23362
423,0.34265
424,0.40565999999999997
425,0.47763999999999995
426,0.55776
