time,value
0,0.0068100999999999995
1,-0.9738399999999999
2,0.8785
3,-0.9738399999999999
4,-0.9738399999999999
5,0.22473
6,-0.21111
7,0.76954
8,1.0964
9,-0.9738399999999999
10,-0.32006999999999997
11,0.44266000000000005
12,-0.9738399999999999
13,-0.9738399999999999
14,0.98746
15,-0.6469600000000001
16,1.9681
17,-0.42904
18,-0.9738399999999999
19,-0.9738399999999999
20,0.8785
21,-0.9738399999999999
22,-0.9738399999999999
23,0.6605800000000001
24,0.11577
25,1.9681
26,0.0068100999999999995
27,-0.9738399999999999
28,-0.9738399999999999
29,1.0964
30,-0.9738399999999999
31,-0.9738399999999999
32,-0.9738399999999999
33,1.2054
34,0.8785
35,-0.5379999999999999
36,0.55162
37,-0.9738399999999999
38,-0.9738399999999999
39,1.0964
40,-0.9738399999999999
41,0.98746
42,0.55162
43,-0.9738399999999999
44,0.11577
45,0.0068100999999999995
46,-0.9738399999999999
47,-0.21111
48,2.0771
49,0.11577
50,-0.42904
51,0.55162
52,-0.9738399999999999
53,-0.9738399999999999
54,2.186
55,1.5323
56,-0.9738399999999999
57,-0.9738399999999999
58,-0.42904
59,0.6605800000000001
60,-0.6469600000000001
61,2.0771
62,0.55162
63,-0.9738399999999999
64,-0.9738399999999999
65,1.3143
66,-0.9738399999999999
67,-0.9738399999999999
68,0.6605800000000001
69,1.9681
70,-0.32006999999999997
71,0.6605800000000001
72,-0.42904
73,-0.9738399999999999
74,-0.5379999999999999
75,0.76954
76,1.3143
77,1.0964
78,-0.9738399999999999
79,-0.9738399999999999
80,1.0964
81,-0.9738399999999999
82,-0.9738399999999999
83,0.0068100999999999995
84,2.0771
85,0.76954
86,-0.9738399999999999
87,-0.9738399999999999
88,-0.42904
89,0.6605800000000001
90,-0.9738399999999999
91,-0.21111
92,1.9681
93,0.22473
94,-0.9738399999999999
95,0.98746
