[<text>
<title>amcast industrial corp &lt;acst&gt; 2nd qtr march one</title>
<dateline>    dayton, ohio, march 16 -
    </dateline>shr profit 10 cts vs loss 2.20 dlrs
    net profit 687,000 vs loss 14.5 mln
    sales 68.3 mln vs 54.8 mln
    avg shrs 7,018,000 vs 6,577,000
    1st half
    shr profit 38 cts vs loss 1.95 dlrs
    net profit 2,596,000 vs loss 12.8 mln
    sales 129.9 mln vs 113.3 mln
    avg shrs 6,964,000 vs 6,568,000
 reuter
</text>]