time,value
0,0.44791000000000003
1,-0.6581899999999999
2,-1.073
3,0.44791000000000003
4,-1.2112
5,-0.38166
6,-0.51993
7,-1.3495
8,0.17139000000000001
9,-1.073
10,-0.6581899999999999
11,-0.10514000000000001
12,-1.626
13,0.17139000000000001
14,-0.79645
15,-1.4878
16,0.58618
17,-1.4878
18,-0.79645
19,0.033125999999999996
20,-1.9026
21,-0.2434
22,-0.51993
23,-1.3495
24,0.17139000000000001
25,-1.073
26,-0.6581899999999999
27,-0.51993
28,-1.4878
29,-0.10514000000000001
30,-0.9347200000000001
31,-0.9347200000000001
32,0.17139000000000001
33,-1.626
34,-0.2434
35,-0.38166
36,-1.4878
37,0.17139000000000001
38,-0.9347200000000001
39,-0.79645
40,0.44791000000000003
41,-0.38166
42,0.17139000000000001
43,0.17139000000000001
44,-0.9347200000000001
45,0.30965
46,-0.79645
47,-0.51993
48,1.2775
49,-0.9347200000000001
50,0.72444
51,0.30965
52,-0.79645
53,1.554
54,0.17139000000000001
55,-0.10514000000000001
56,1.4158
57,-1.2112
58,0.72444
59,1.1392
60,-0.2434
61,1.8305
62,1.6923
63,1.2775
64,1.554
65,-0.9347200000000001
66,0.8627
67,1.554
68,0.033125999999999996
69,0.30965
70,1.1392
71,0.033125999999999996
72,-0.79645
73,0.72444
74,0.30965
75,-0.6581899999999999
76,0.58618
77,1.4158
78,-0.79645
79,0.8627
80,2.2453
81,1.001
82,1.1392
83,1.8305
84,0.8627
85,-0.10514000000000001
86,1.8305
87,1.8305
88,-0.9347200000000001
89,0.72444
90,1.8305
91,-0.51993
92,0.30965
93,1.4158
94,-0.6581899999999999
95,-0.2434
