time,value
0,-0.1606
1,-0.1606
2,-0.1606
3,-0.1606
4,-0.1606
5,-0.1606
6,-0.1606
7,-0.1606
8,-0.1606
9,-0.1606
10,-0.1606
11,-0.1606
12,-0.1606
13,-0.1606
14,-0.1606
15,-0.1606
16,-0.1606
17,-0.1606
18,-0.1606
19,-0.1606
20,-0.1606
21,-0.1606
22,-0.1606
23,-0.1606
24,-0.1606
25,-0.1606
26,-0.1606
27,-0.1606
28,-0.1606
29,-0.1606
30,-0.1606
31,-0.1606
32,-0.1606
33,-0.1606
34,-0.1606
35,-0.1606
36,-0.1606
37,-0.1606
38,-0.1606
39,-0.1606
40,-0.1606
41,-0.1606
42,-0.1606
43,-0.1606
44,-0.1606
45,-0.1606
46,-0.1606
47,-0.1606
48,-0.1606
49,-0.1606
50,-0.1606
51,-0.1606
52,-0.1606
53,-0.1606
54,-0.1606
55,-0.1606
56,-0.1606
57,-0.1606
58,-0.1606
59,-0.1606
60,-0.1606
61,-0.1606
62,-0.1606
63,-0.1606
64,-0.1606
65,-0.1606
66,-0.1606
67,-0.1606
68,-0.1606
69,-0.1606
70,-0.1606
71,-0.1606
72,5.3835
73,7.7759
74,-0.1606
75,-0.1606
76,-0.1606
77,-0.1606
78,-0.1606
79,-0.1606
80,1.7761
81,-0.1606
82,-0.1606
83,-0.1606
84,-0.1606
85,-0.1606
86,-0.1606
87,-0.1606
88,-0.1606
89,-0.1606
90,-0.1606
91,-0.1606
92,-0.1606
93,-0.1606
94,-0.1606
95,-0.1606
