time,value
0,-0.9493299999999999
1,-0.9493299999999999
2,-0.7588699999999999
3,-0.9493299999999999
4,-0.9969399999999999
5,-0.9493299999999999
6,-0.9493299999999999
7,-0.9493299999999999
8,-0.9493299999999999
9,-0.9969399999999999
10,-0.9493299999999999
11,-0.9493299999999999
12,-0.90171
13,-0.9493299999999999
14,-0.9493299999999999
15,-0.9969399999999999
16,-0.9493299999999999
17,-0.9493299999999999
18,-0.9969399999999999
19,-0.9493299999999999
20,-0.90171
21,-0.9493299999999999
22,-0.9493299999999999
23,-0.9493299999999999
24,-0.9493299999999999
25,-0.9493299999999999
26,-0.9969399999999999
27,-0.9493299999999999
28,-0.9493299999999999
29,-0.9969399999999999
30,-0.9493299999999999
31,-0.28271999999999997
32,1.1457
33,-0.9493299999999999
34,-0.9969399999999999
35,-0.9493299999999999
36,-0.9969399999999999
37,-0.9493299999999999
38,-0.9493299999999999
39,-0.9493299999999999
40,-0.90171
41,-0.9493299999999999
42,-0.9969399999999999
43,-0.9493299999999999
44,-0.9493299999999999
45,0.0029760000000000003
46,0.9552799999999999
47,0.9552799999999999
48,0.9552799999999999
49,0.9552799999999999
50,0.9552799999999999
51,0.9552799999999999
52,1.0981
53,1.0981
54,1.0029
55,0.9552799999999999
56,1.0505
57,0.9552799999999999
58,0.9552799999999999
59,0.9552799999999999
60,1.1457
61,1.1934
62,1.1457
63,1.1457
64,1.1457
65,0.9552799999999999
66,0.9076700000000001
67,0.9552799999999999
68,0.9552799999999999
69,0.9552799999999999
70,0.9552799999999999
71,0.9552799999999999
72,0.9552799999999999
73,1.0029
74,0.9552799999999999
75,-0.09225499999999999
76,-0.9493299999999999
77,-0.9493299999999999
78,-0.9493299999999999
79,-0.9493299999999999
80,-0.9493299999999999
81,-0.90171
82,1.1934
83,1.2409999999999999
84,1.1457
85,1.1934
86,1.1934
87,1.1934
88,1.1457
89,1.1934
90,1.1934
91,1.1934
92,1.1934
93,1.1934
94,1.1934
95,1.1934
