time,value
0,-0.39558000000000004
1,-0.39558000000000004
2,-0.39558000000000004
3,-0.23994000000000001
4,-0.39558000000000004
5,-0.39558000000000004
6,-0.23994000000000001
7,-0.39558000000000004
8,-0.39558000000000004
9,-0.39558000000000004
10,-0.23994000000000001
11,-0.39558000000000004
12,-0.39558000000000004
13,-0.39558000000000004
14,-0.23994000000000001
15,-0.39558000000000004
16,-0.39558000000000004
17,-0.39558000000000004
18,-0.23994000000000001
19,-0.39558000000000004
20,-0.39558000000000004
21,-0.39558000000000004
22,-0.23994000000000001
23,-0.39558000000000004
24,-0.39558000000000004
25,-0.39558000000000004
26,-0.23994000000000001
27,-0.39558000000000004
28,-0.39558000000000004
29,-0.23994000000000001
30,-0.39558000000000004
31,-0.39558000000000004
32,-0.39558000000000004
33,-0.23994000000000001
34,-0.39558000000000004
35,-0.39558000000000004
36,-0.39558000000000004
37,-0.23994000000000001
38,-0.39558000000000004
39,-0.39558000000000004
40,-0.39558000000000004
41,-0.23994000000000001
42,-0.39558000000000004
43,-0.39558000000000004
44,-0.39558000000000004
45,-0.23994000000000001
46,-0.39558000000000004
47,-0.39558000000000004
48,-0.39558000000000004
49,-0.23994000000000001
50,-0.39558000000000004
51,-0.39558000000000004
52,-0.39558000000000004
53,-0.23994000000000001
54,-0.39558000000000004
55,-0.39558000000000004
56,-0.39558000000000004
57,-0.23994000000000001
58,-0.39558000000000004
59,-0.39558000000000004
60,-0.39558000000000004
61,-0.23994000000000001
62,-0.39558000000000004
63,-0.39558000000000004
64,-0.23994000000000001
65,-0.39558000000000004
66,-0.39558000000000004
67,-0.39558000000000004
68,-0.23994000000000001
69,-0.39558000000000004
70,-0.39558000000000004
71,-0.39558000000000004
72,-0.23994000000000001
73,-0.39558000000000004
74,-0.39558000000000004
75,-0.39558000000000004
76,-0.23994000000000001
77,-0.39558000000000004
78,-0.23994000000000001
79,-0.08430399999999999
80,2.7172
81,2.8728
82,2.7172
83,2.7172
84,2.8728
85,2.8728
86,3.0285
87,3.0285
88,2.8728
89,3.0285
90,1.1608
91,-0.39558000000000004
92,-0.23994000000000001
93,-0.39558000000000004
94,-0.39558000000000004
95,-0.39558000000000004
