d3mIndex,timeseries_file,label
0,0000_train_ts.csv,1
1,0001_train_ts.csv,1
2,0002_train_ts.csv,0
3,0003_train_ts.csv,1
4,0004_train_ts.csv,1
5,0005_train_ts.csv,1
6,0006_train_ts.csv,1
7,0007_train_ts.csv,1
8,0008_train_ts.csv,1
9,0009_train_ts.csv,1
10,0010_train_ts.csv,0
11,0011_train_ts.csv,0
12,0012_train_ts.csv,1
13,0013_train_ts.csv,1
14,0014_train_ts.csv,1
15,0015_train_ts.csv,1
16,0016_train_ts.csv,0
17,0017_train_ts.csv,1
18,0018_train_ts.csv,0
19,0019_train_ts.csv,1
20,0020_train_ts.csv,0
21,0021_train_ts.csv,1
22,0022_train_ts.csv,1
23,0023_train_ts.csv,0
24,0024_train_ts.csv,0
25,0025_train_ts.csv,0
26,0026_train_ts.csv,1
27,0027_train_ts.csv,1
28,0028_train_ts.csv,1
29,0029_train_ts.csv,1
30,0030_train_ts.csv,0
31,0031_train_ts.csv,1
32,0032_train_ts.csv,0
33,0033_train_ts.csv,1
34,0034_train_ts.csv,0
35,0035_train_ts.csv,1
36,0036_train_ts.csv,1
37,0037_train_ts.csv,1
38,0038_train_ts.csv,1
39,0039_train_ts.csv,1
40,0040_train_ts.csv,1
41,0041_train_ts.csv,1
42,0042_train_ts.csv,0
43,0043_train_ts.csv,0
44,0044_train_ts.csv,1
45,0045_train_ts.csv,1
46,0046_train_ts.csv,1
47,0047_train_ts.csv,1
48,0048_train_ts.csv,1
49,0049_train_ts.csv,0
50,0050_train_ts.csv,1
51,0051_train_ts.csv,0
52,0052_train_ts.csv,1
53,0053_train_ts.csv,0
54,0054_train_ts.csv,1
55,0055_train_ts.csv,1
56,0056_train_ts.csv,1
57,0057_train_ts.csv,0
58,0058_train_ts.csv,1
59,0059_train_ts.csv,1
60,0060_train_ts.csv,1
61,0061_train_ts.csv,0
62,0062_train_ts.csv,0
63,0063_train_ts.csv,1
64,0064_train_ts.csv,0
65,0065_train_ts.csv,0
66,0066_train_ts.csv,1
67,0067_train_ts.csv,0
68,0068_train_ts.csv,0
69,0069_train_ts.csv,1
70,0070_train_ts.csv,1
71,0071_train_ts.csv,1
72,0072_train_ts.csv,0
73,0073_train_ts.csv,1
74,0074_train_ts.csv,1
75,0075_train_ts.csv,1
76,0076_train_ts.csv,1
77,0077_train_ts.csv,0
78,0078_train_ts.csv,1
79,0079_train_ts.csv,1
80,0080_train_ts.csv,1
81,0081_train_ts.csv,0
82,0082_train_ts.csv,0
83,0083_train_ts.csv,0
84,0084_train_ts.csv,1
85,0085_train_ts.csv,0
86,0086_train_ts.csv,0
87,0087_train_ts.csv,1
88,0088_train_ts.csv,0
89,0089_train_ts.csv,0
90,0090_train_ts.csv,0
91,0091_train_ts.csv,1
92,0092_train_ts.csv,1
93,0093_train_ts.csv,1
94,0094_train_ts.csv,0
95,0095_train_ts.csv,1
96,0096_train_ts.csv,1
97,0097_train_ts.csv,1
98,0098_train_ts.csv,1
99,0099_train_ts.csv,0
100,0100_train_ts.csv,1
101,0101_train_ts.csv,1
102,0102_train_ts.csv,0
103,0103_train_ts.csv,0
104,0104_train_ts.csv,1
105,0105_train_ts.csv,0
106,0106_train_ts.csv,1
107,0107_train_ts.csv,1
108,0108_train_ts.csv,1
109,0109_train_ts.csv,0
110,0110_train_ts.csv,0
111,0111_train_ts.csv,0
112,0112_train_ts.csv,0
113,0113_train_ts.csv,1
114,0114_train_ts.csv,1
115,0115_train_ts.csv,1
116,0116_train_ts.csv,0
117,0117_train_ts.csv,1
118,0118_train_ts.csv,1
119,0119_train_ts.csv,0
120,0120_train_ts.csv,1
121,0121_train_ts.csv,1
122,0122_train_ts.csv,1
123,0123_train_ts.csv,0
124,0124_train_ts.csv,0
125,0125_train_ts.csv,1
126,0126_train_ts.csv,0
127,0127_train_ts.csv,0
128,0128_train_ts.csv,1
129,0129_train_ts.csv,1
130,0130_train_ts.csv,0
131,0131_train_ts.csv,1
132,0132_train_ts.csv,1
133,0133_train_ts.csv,0
134,0134_train_ts.csv,0
135,0135_train_ts.csv,0
136,0136_train_ts.csv,0
137,0137_train_ts.csv,1
138,0138_train_ts.csv,1
139,0139_train_ts.csv,0
140,0140_train_ts.csv,1
141,0141_train_ts.csv,1
142,0142_train_ts.csv,0
143,0143_train_ts.csv,1
144,0144_train_ts.csv,1
145,0145_train_ts.csv,1
146,0146_train_ts.csv,1
147,0147_train_ts.csv,1
148,0148_train_ts.csv,0
149,0149_train_ts.csv,1
150,0150_train_ts.csv,0
151,0151_train_ts.csv,1
152,0152_train_ts.csv,1
153,0153_train_ts.csv,0
154,0154_train_ts.csv,1
155,0155_train_ts.csv,1
156,0156_train_ts.csv,1
157,0157_train_ts.csv,0
158,0158_train_ts.csv,1
159,0159_train_ts.csv,1
160,0160_train_ts.csv,1
161,0161_train_ts.csv,1
162,0162_train_ts.csv,0
163,0163_train_ts.csv,0
164,0164_train_ts.csv,0
165,0165_train_ts.csv,1
166,0166_train_ts.csv,0
167,0167_train_ts.csv,1
168,0168_train_ts.csv,1
169,0169_train_ts.csv,0
170,0170_train_ts.csv,1
171,0171_train_ts.csv,0
172,0172_train_ts.csv,0
173,0173_train_ts.csv,0
174,0174_train_ts.csv,1
175,0175_train_ts.csv,1
176,0176_train_ts.csv,0
177,0177_train_ts.csv,0
178,0178_train_ts.csv,0
179,0179_train_ts.csv,1
180,0180_train_ts.csv,1
181,0181_train_ts.csv,1
182,0182_train_ts.csv,1
183,0183_train_ts.csv,1
184,0184_train_ts.csv,1
185,0185_train_ts.csv,1
186,0186_train_ts.csv,1
187,0187_train_ts.csv,0
188,0188_train_ts.csv,1
189,0189_train_ts.csv,0
190,0190_train_ts.csv,1
191,0191_train_ts.csv,1
192,0192_train_ts.csv,1
193,0193_train_ts.csv,1
194,0194_train_ts.csv,1
195,0195_train_ts.csv,1
196,0196_train_ts.csv,1
197,0197_train_ts.csv,0
198,0198_train_ts.csv,0
199,0199_train_ts.csv,0
200,0200_train_ts.csv,1
201,0201_train_ts.csv,0
202,0202_train_ts.csv,0
203,0203_train_ts.csv,1
204,0204_train_ts.csv,1
205,0205_train_ts.csv,0
206,0206_train_ts.csv,1
207,0207_train_ts.csv,0
208,0208_train_ts.csv,1
209,0209_train_ts.csv,0
210,0210_train_ts.csv,1
211,0211_train_ts.csv,0
212,0212_train_ts.csv,1
213,0213_train_ts.csv,0
214,0214_train_ts.csv,0
215,0215_train_ts.csv,0
216,0216_train_ts.csv,1
217,0217_train_ts.csv,1
218,0218_train_ts.csv,1
219,0219_train_ts.csv,1
220,0220_train_ts.csv,1
221,0221_train_ts.csv,1
222,0222_train_ts.csv,1
223,0223_train_ts.csv,1
224,0224_train_ts.csv,0
225,0225_train_ts.csv,0
226,0226_train_ts.csv,0
227,0227_train_ts.csv,1
228,0228_train_ts.csv,1
229,0229_train_ts.csv,1
230,0230_train_ts.csv,1
231,0231_train_ts.csv,1
232,0232_train_ts.csv,1
233,0233_train_ts.csv,1
234,0234_train_ts.csv,0
235,0235_train_ts.csv,1
236,0236_train_ts.csv,1
237,0237_train_ts.csv,0
238,0238_train_ts.csv,0
239,0239_train_ts.csv,1
240,0240_train_ts.csv,1
241,0241_train_ts.csv,0
242,0242_train_ts.csv,0
243,0243_train_ts.csv,1
244,0244_train_ts.csv,1
245,0245_train_ts.csv,0
246,0246_train_ts.csv,1
247,0247_train_ts.csv,0
248,0248_train_ts.csv,1
249,0249_train_ts.csv,1
250,0250_train_ts.csv,1
251,0251_train_ts.csv,1
252,0252_train_ts.csv,1
253,0253_train_ts.csv,1
254,0254_train_ts.csv,0
255,0255_train_ts.csv,0
256,0256_train_ts.csv,1
257,0257_train_ts.csv,1
258,0258_train_ts.csv,0
259,0259_train_ts.csv,0
260,0260_train_ts.csv,1
261,0261_train_ts.csv,1
262,0262_train_ts.csv,1
263,0263_train_ts.csv,0
264,0264_train_ts.csv,1
265,0265_train_ts.csv,0
266,0266_train_ts.csv,1
267,0267_train_ts.csv,1
268,0268_train_ts.csv,0
269,0269_train_ts.csv,1
270,0270_train_ts.csv,0
271,0271_train_ts.csv,1
272,0272_train_ts.csv,1
273,0273_train_ts.csv,1
274,0274_train_ts.csv,1
275,0275_train_ts.csv,0
276,0276_train_ts.csv,1
277,0277_train_ts.csv,1
278,0278_train_ts.csv,0
279,0279_train_ts.csv,0
280,0280_train_ts.csv,1
281,0281_train_ts.csv,1
282,0282_train_ts.csv,1
283,0283_train_ts.csv,1
284,0284_train_ts.csv,1
285,0285_train_ts.csv,0
286,0286_train_ts.csv,1
287,0287_train_ts.csv,1
288,0288_train_ts.csv,1
289,0289_train_ts.csv,1
290,0290_train_ts.csv,1
291,0291_train_ts.csv,0
292,0292_train_ts.csv,1
293,0293_train_ts.csv,0
294,0294_train_ts.csv,1
295,0295_train_ts.csv,1
296,0296_train_ts.csv,1
297,0297_train_ts.csv,0
298,0298_train_ts.csv,1
299,0299_train_ts.csv,1
300,0300_train_ts.csv,1
301,0301_train_ts.csv,0
302,0302_train_ts.csv,1
303,0303_train_ts.csv,0
304,0304_train_ts.csv,0
305,0305_train_ts.csv,1
306,0306_train_ts.csv,0
307,0307_train_ts.csv,1
308,0308_train_ts.csv,1
309,0309_train_ts.csv,1
310,0310_train_ts.csv,1
311,0311_train_ts.csv,0
312,0312_train_ts.csv,1
313,0313_train_ts.csv,1
314,0314_train_ts.csv,1
315,0315_train_ts.csv,0
316,0316_train_ts.csv,0
317,0317_train_ts.csv,1
318,0318_train_ts.csv,0
319,0319_train_ts.csv,0
320,0320_train_ts.csv,1
321,0321_train_ts.csv,1
322,0322_train_ts.csv,0
323,0323_train_ts.csv,0
324,0324_train_ts.csv,1
325,0325_train_ts.csv,1
326,0326_train_ts.csv,1
327,0327_train_ts.csv,1
328,0328_train_ts.csv,1
329,0329_train_ts.csv,0
330,0330_train_ts.csv,1
331,0331_train_ts.csv,1
332,0332_train_ts.csv,0
333,0333_train_ts.csv,1
334,0334_train_ts.csv,0
335,0335_train_ts.csv,1
336,0336_train_ts.csv,0
337,0337_train_ts.csv,0
338,0338_train_ts.csv,1
339,0339_train_ts.csv,1
340,0340_train_ts.csv,1
341,0341_train_ts.csv,0
342,0342_train_ts.csv,1
343,0343_train_ts.csv,1
344,0344_train_ts.csv,0
345,0345_train_ts.csv,1
346,0346_train_ts.csv,1
347,0347_train_ts.csv,1
348,0348_train_ts.csv,1
349,0349_train_ts.csv,1
350,0350_train_ts.csv,1
351,0351_train_ts.csv,1
352,0352_train_ts.csv,1
353,0353_train_ts.csv,1
354,0354_train_ts.csv,0
355,0355_train_ts.csv,0
356,0356_train_ts.csv,1
357,0357_train_ts.csv,1
358,0358_train_ts.csv,0
359,0359_train_ts.csv,1
360,0360_train_ts.csv,1
361,0361_train_ts.csv,1
362,0362_train_ts.csv,1
363,0363_train_ts.csv,1
364,0364_train_ts.csv,1
365,0365_train_ts.csv,0
366,0366_train_ts.csv,1
367,0367_train_ts.csv,1
368,0368_train_ts.csv,0
369,0369_train_ts.csv,1
370,0370_test_ts.csv,0
371,0371_test_ts.csv,1
372,0372_test_ts.csv,0
373,0373_test_ts.csv,0
374,0374_test_ts.csv,1
375,0375_test_ts.csv,0
376,0376_test_ts.csv,1
377,0377_test_ts.csv,1
378,0378_test_ts.csv,1
379,0379_test_ts.csv,0
380,0380_test_ts.csv,0
381,0381_test_ts.csv,1
382,0382_test_ts.csv,1
383,0383_test_ts.csv,1
384,0384_test_ts.csv,1
385,0385_test_ts.csv,1
386,0386_test_ts.csv,1
387,0387_test_ts.csv,0
388,0388_test_ts.csv,0
389,0389_test_ts.csv,1
390,0390_test_ts.csv,1
391,0391_test_ts.csv,1
392,0392_test_ts.csv,1
393,0393_test_ts.csv,0
394,0394_test_ts.csv,0
395,0395_test_ts.csv,0
396,0396_test_ts.csv,0
397,0397_test_ts.csv,1
398,0398_test_ts.csv,1
399,0399_test_ts.csv,0
400,0400_test_ts.csv,1
401,0401_test_ts.csv,1
402,0402_test_ts.csv,1
403,0403_test_ts.csv,1
404,0404_test_ts.csv,0
405,0405_test_ts.csv,1
406,0406_test_ts.csv,1
407,0407_test_ts.csv,0
408,0408_test_ts.csv,0
409,0409_test_ts.csv,0
410,0410_test_ts.csv,0
411,0411_test_ts.csv,1
412,0412_test_ts.csv,1
413,0413_test_ts.csv,0
414,0414_test_ts.csv,0
415,0415_test_ts.csv,0
416,0416_test_ts.csv,1
417,0417_test_ts.csv,1
418,0418_test_ts.csv,1
419,0419_test_ts.csv,1
420,0420_test_ts.csv,0
421,0421_test_ts.csv,0
422,0422_test_ts.csv,1
423,0423_test_ts.csv,0
424,0424_test_ts.csv,0
425,0425_test_ts.csv,0
426,0426_test_ts.csv,0
427,0427_test_ts.csv,1
428,0428_test_ts.csv,0
429,0429_test_ts.csv,0
430,0430_test_ts.csv,0
431,0431_test_ts.csv,0
432,0432_test_ts.csv,1
433,0433_test_ts.csv,1
434,0434_test_ts.csv,0
435,0435_test_ts.csv,1
436,0436_test_ts.csv,1
437,0437_test_ts.csv,1
438,0438_test_ts.csv,1
439,0439_test_ts.csv,1
440,0440_test_ts.csv,0
441,0441_test_ts.csv,1
442,0442_test_ts.csv,1
443,0443_test_ts.csv,1
444,0444_test_ts.csv,1
445,0445_test_ts.csv,1
446,0446_test_ts.csv,0
447,0447_test_ts.csv,1
448,0448_test_ts.csv,0
449,0449_test_ts.csv,1
450,0450_test_ts.csv,1
451,0451_test_ts.csv,0
452,0452_test_ts.csv,0
453,0453_test_ts.csv,0
454,0454_test_ts.csv,1
455,0455_test_ts.csv,0
456,0456_test_ts.csv,0
457,0457_test_ts.csv,1
458,0458_test_ts.csv,1
459,0459_test_ts.csv,1
460,0460_test_ts.csv,1
461,0461_test_ts.csv,1
462,0462_test_ts.csv,1
463,0463_test_ts.csv,0
464,0464_test_ts.csv,1
465,0465_test_ts.csv,1
466,0466_test_ts.csv,1
467,0467_test_ts.csv,0
468,0468_test_ts.csv,1
469,0469_test_ts.csv,1
470,0470_test_ts.csv,0
471,0471_test_ts.csv,1
472,0472_test_ts.csv,1
473,0473_test_ts.csv,1
474,0474_test_ts.csv,0
475,0475_test_ts.csv,1
476,0476_test_ts.csv,0
477,0477_test_ts.csv,1
478,0478_test_ts.csv,0
479,0479_test_ts.csv,0
480,0480_test_ts.csv,1
481,0481_test_ts.csv,1
482,0482_test_ts.csv,1
483,0483_test_ts.csv,1
484,0484_test_ts.csv,1
485,0485_test_ts.csv,1
486,0486_test_ts.csv,0
487,0487_test_ts.csv,0
488,0488_test_ts.csv,1
489,0489_test_ts.csv,0
490,0490_test_ts.csv,1
491,0491_test_ts.csv,0
492,0492_test_ts.csv,1
493,0493_test_ts.csv,0
494,0494_test_ts.csv,1
495,0495_test_ts.csv,0
496,0496_test_ts.csv,0
497,0497_test_ts.csv,1
498,0498_test_ts.csv,0
499,0499_test_ts.csv,0
500,0500_test_ts.csv,1
501,0501_test_ts.csv,1
502,0502_test_ts.csv,0
503,0503_test_ts.csv,0
504,0504_test_ts.csv,1
505,0505_test_ts.csv,1
506,0506_test_ts.csv,0
507,0507_test_ts.csv,1
508,0508_test_ts.csv,1
509,0509_test_ts.csv,0
510,0510_test_ts.csv,1
511,0511_test_ts.csv,0
512,0512_test_ts.csv,1
513,0513_test_ts.csv,1
514,0514_test_ts.csv,0
515,0515_test_ts.csv,0
516,0516_test_ts.csv,0
517,0517_test_ts.csv,1
518,0518_test_ts.csv,1
519,0519_test_ts.csv,1
520,0520_test_ts.csv,0
521,0521_test_ts.csv,1
522,0522_test_ts.csv,1
523,0523_test_ts.csv,0
524,0524_test_ts.csv,1
525,0525_test_ts.csv,1
526,0526_test_ts.csv,1
527,0527_test_ts.csv,1
528,0528_test_ts.csv,1
529,0529_test_ts.csv,0
530,0530_test_ts.csv,1
531,0531_test_ts.csv,0
532,0532_test_ts.csv,1
533,0533_test_ts.csv,0
534,0534_test_ts.csv,1
535,0535_test_ts.csv,0
536,0536_test_ts.csv,0
537,0537_test_ts.csv,0
538,0538_test_ts.csv,0
539,0539_test_ts.csv,1
540,0540_test_ts.csv,1
541,0541_test_ts.csv,1
542,0542_test_ts.csv,0
543,0543_test_ts.csv,1
544,0544_test_ts.csv,1
545,0545_test_ts.csv,0
546,0546_test_ts.csv,0
547,0547_test_ts.csv,1
548,0548_test_ts.csv,0
549,0549_test_ts.csv,1
550,0550_test_ts.csv,0
551,0551_test_ts.csv,1
552,0552_test_ts.csv,1
553,0553_test_ts.csv,0
554,0554_test_ts.csv,1
555,0555_test_ts.csv,1
556,0556_test_ts.csv,1
557,0557_test_ts.csv,1
558,0558_test_ts.csv,1
559,0559_test_ts.csv,1
560,0560_test_ts.csv,1
561,0561_test_ts.csv,1
562,0562_test_ts.csv,1
563,0563_test_ts.csv,1
564,0564_test_ts.csv,1
565,0565_test_ts.csv,0
566,0566_test_ts.csv,1
567,0567_test_ts.csv,0
568,0568_test_ts.csv,1
569,0569_test_ts.csv,0
570,0570_test_ts.csv,0
571,0571_test_ts.csv,1
572,0572_test_ts.csv,0
573,0573_test_ts.csv,1
574,0574_test_ts.csv,1
575,0575_test_ts.csv,1
576,0576_test_ts.csv,0
577,0577_test_ts.csv,0
578,0578_test_ts.csv,1
579,0579_test_ts.csv,1
580,0580_test_ts.csv,1
581,0581_test_ts.csv,1
582,0582_test_ts.csv,0
583,0583_test_ts.csv,1
584,0584_test_ts.csv,1
585,0585_test_ts.csv,1
586,0586_test_ts.csv,1
587,0587_test_ts.csv,1
588,0588_test_ts.csv,1
589,0589_test_ts.csv,1
590,0590_test_ts.csv,1
591,0591_test_ts.csv,1
592,0592_test_ts.csv,0
593,0593_test_ts.csv,0
594,0594_test_ts.csv,1
595,0595_test_ts.csv,0
596,0596_test_ts.csv,0
597,0597_test_ts.csv,1
598,0598_test_ts.csv,1
599,0599_test_ts.csv,1
600,0600_test_ts.csv,0
601,0601_test_ts.csv,1
602,0602_test_ts.csv,1
603,0603_test_ts.csv,1
604,0604_test_ts.csv,1
605,0605_test_ts.csv,1
606,0606_test_ts.csv,0
607,0607_test_ts.csv,0
608,0608_test_ts.csv,0
609,0609_test_ts.csv,1
610,0610_test_ts.csv,0
611,0611_test_ts.csv,0
612,0612_test_ts.csv,1
613,0613_test_ts.csv,1
614,0614_test_ts.csv,1
615,0615_test_ts.csv,0
616,0616_test_ts.csv,1
617,0617_test_ts.csv,1
618,0618_test_ts.csv,0
619,0619_test_ts.csv,0
620,0620_test_ts.csv,0
621,0621_test_ts.csv,1
622,0622_test_ts.csv,0
623,0623_test_ts.csv,1
624,0624_test_ts.csv,1
625,0625_test_ts.csv,1
626,0626_test_ts.csv,0
627,0627_test_ts.csv,1
628,0628_test_ts.csv,0
629,0629_test_ts.csv,1
630,0630_test_ts.csv,1
631,0631_test_ts.csv,0
632,0632_test_ts.csv,1
633,0633_test_ts.csv,1
634,0634_test_ts.csv,1
635,0635_test_ts.csv,0
636,0636_test_ts.csv,0
637,0637_test_ts.csv,1
638,0638_test_ts.csv,0
639,0639_test_ts.csv,1
640,0640_test_ts.csv,1
641,0641_test_ts.csv,1
642,0642_test_ts.csv,1
643,0643_test_ts.csv,1
644,0644_test_ts.csv,1
645,0645_test_ts.csv,1
646,0646_test_ts.csv,0
647,0647_test_ts.csv,1
648,0648_test_ts.csv,1
649,0649_test_ts.csv,1
650,0650_test_ts.csv,0
651,0651_test_ts.csv,0
652,0652_test_ts.csv,1
653,0653_test_ts.csv,1
654,0654_test_ts.csv,0
655,0655_test_ts.csv,0
656,0656_test_ts.csv,0
657,0657_test_ts.csv,0
658,0658_test_ts.csv,0
659,0659_test_ts.csv,0
660,0660_test_ts.csv,1
661,0661_test_ts.csv,0
662,0662_test_ts.csv,1
663,0663_test_ts.csv,1
664,0664_test_ts.csv,0
665,0665_test_ts.csv,0
666,0666_test_ts.csv,0
667,0667_test_ts.csv,1
668,0668_test_ts.csv,1
669,0669_test_ts.csv,1
670,0670_test_ts.csv,1
671,0671_test_ts.csv,1
672,0672_test_ts.csv,1
673,0673_test_ts.csv,1
674,0674_test_ts.csv,0
675,0675_test_ts.csv,0
676,0676_test_ts.csv,1
677,0677_test_ts.csv,1
678,0678_test_ts.csv,1
679,0679_test_ts.csv,1
680,0680_test_ts.csv,1
681,0681_test_ts.csv,1
682,0682_test_ts.csv,0
683,0683_test_ts.csv,1
684,0684_test_ts.csv,1
685,0685_test_ts.csv,1
686,0686_test_ts.csv,1
687,0687_test_ts.csv,0
688,0688_test_ts.csv,0
689,0689_test_ts.csv,1
690,0690_test_ts.csv,0
691,0691_test_ts.csv,0
692,0692_test_ts.csv,1
693,0693_test_ts.csv,1
694,0694_test_ts.csv,1
695,0695_test_ts.csv,1
696,0696_test_ts.csv,1
697,0697_test_ts.csv,0
698,0698_test_ts.csv,0
699,0699_test_ts.csv,0
700,0700_test_ts.csv,1
701,0701_test_ts.csv,1
702,0702_test_ts.csv,1
703,0703_test_ts.csv,1
704,0704_test_ts.csv,1
705,0705_test_ts.csv,0
706,0706_test_ts.csv,1
707,0707_test_ts.csv,1
708,0708_test_ts.csv,1
709,0709_test_ts.csv,1
710,0710_test_ts.csv,1
711,0711_test_ts.csv,1
712,0712_test_ts.csv,1
713,0713_test_ts.csv,1
714,0714_test_ts.csv,0
715,0715_test_ts.csv,1
716,0716_test_ts.csv,1
717,0717_test_ts.csv,1
718,0718_test_ts.csv,0
719,0719_test_ts.csv,1
720,0720_test_ts.csv,1
721,0721_test_ts.csv,1
722,0722_test_ts.csv,1
723,0723_test_ts.csv,0
724,0724_test_ts.csv,1
725,0725_test_ts.csv,0
726,0726_test_ts.csv,0
727,0727_test_ts.csv,1
728,0728_test_ts.csv,0
729,0729_test_ts.csv,0
730,0730_test_ts.csv,1
731,0731_test_ts.csv,0
732,0732_test_ts.csv,0
733,0733_test_ts.csv,1
734,0734_test_ts.csv,1
735,0735_test_ts.csv,0
736,0736_test_ts.csv,0
737,0737_test_ts.csv,0
738,0738_test_ts.csv,0
739,0739_test_ts.csv,0
740,0740_test_ts.csv,0
741,0741_test_ts.csv,1
742,0742_test_ts.csv,0
743,0743_test_ts.csv,1
744,0744_test_ts.csv,1
745,0745_test_ts.csv,1
746,0746_test_ts.csv,1
747,0747_test_ts.csv,0
748,0748_test_ts.csv,1
749,0749_test_ts.csv,1
750,0750_test_ts.csv,1
751,0751_test_ts.csv,1
752,0752_test_ts.csv,0
753,0753_test_ts.csv,1
754,0754_test_ts.csv,1
755,0755_test_ts.csv,0
756,0756_test_ts.csv,0
757,0757_test_ts.csv,0
758,0758_test_ts.csv,1
759,0759_test_ts.csv,0
760,0760_test_ts.csv,1
761,0761_test_ts.csv,0
762,0762_test_ts.csv,1
763,0763_test_ts.csv,1
764,0764_test_ts.csv,1
765,0765_test_ts.csv,0
766,0766_test_ts.csv,0
767,0767_test_ts.csv,1
768,0768_test_ts.csv,0
769,0769_test_ts.csv,0
770,0770_test_ts.csv,1
771,0771_test_ts.csv,1
772,0772_test_ts.csv,0
773,0773_test_ts.csv,0
774,0774_test_ts.csv,1
775,0775_test_ts.csv,1
776,0776_test_ts.csv,1
777,0777_test_ts.csv,1
778,0778_test_ts.csv,0
779,0779_test_ts.csv,1
780,0780_test_ts.csv,1
781,0781_test_ts.csv,1
782,0782_test_ts.csv,0
783,0783_test_ts.csv,0
784,0784_test_ts.csv,0
785,0785_test_ts.csv,0
786,0786_test_ts.csv,0
787,0787_test_ts.csv,1
788,0788_test_ts.csv,0
789,0789_test_ts.csv,0
790,0790_test_ts.csv,1
791,0791_test_ts.csv,1
792,0792_test_ts.csv,1
793,0793_test_ts.csv,0
794,0794_test_ts.csv,1
795,0795_test_ts.csv,1
796,0796_test_ts.csv,0
797,0797_test_ts.csv,0
798,0798_test_ts.csv,0
799,0799_test_ts.csv,1
800,0800_test_ts.csv,0
801,0801_test_ts.csv,0
802,0802_test_ts.csv,1
803,0803_test_ts.csv,1
804,0804_test_ts.csv,0
805,0805_test_ts.csv,1
806,0806_test_ts.csv,1
807,0807_test_ts.csv,1
808,0808_test_ts.csv,0
809,0809_test_ts.csv,0
810,0810_test_ts.csv,0
811,0811_test_ts.csv,0
812,0812_test_ts.csv,1
813,0813_test_ts.csv,0
814,0814_test_ts.csv,0
815,0815_test_ts.csv,1
816,0816_test_ts.csv,0
817,0817_test_ts.csv,0
818,0818_test_ts.csv,0
819,0819_test_ts.csv,1
820,0820_test_ts.csv,0
821,0821_test_ts.csv,0
822,0822_test_ts.csv,1
823,0823_test_ts.csv,0
824,0824_test_ts.csv,0
825,0825_test_ts.csv,0
826,0826_test_ts.csv,0
827,0827_test_ts.csv,1
828,0828_test_ts.csv,1
829,0829_test_ts.csv,1
830,0830_test_ts.csv,1
831,0831_test_ts.csv,1
832,0832_test_ts.csv,0
833,0833_test_ts.csv,1
834,0834_test_ts.csv,1
835,0835_test_ts.csv,1
836,0836_test_ts.csv,1
837,0837_test_ts.csv,0
838,0838_test_ts.csv,0
839,0839_test_ts.csv,0
840,0840_test_ts.csv,1
841,0841_test_ts.csv,1
842,0842_test_ts.csv,0
843,0843_test_ts.csv,0
844,0844_test_ts.csv,0
845,0845_test_ts.csv,1
846,0846_test_ts.csv,1
847,0847_test_ts.csv,1
848,0848_test_ts.csv,0
849,0849_test_ts.csv,1
850,0850_test_ts.csv,0
851,0851_test_ts.csv,1
852,0852_test_ts.csv,0
853,0853_test_ts.csv,1
854,0854_test_ts.csv,1
855,0855_test_ts.csv,1
856,0856_test_ts.csv,1
857,0857_test_ts.csv,0
858,0858_test_ts.csv,1
859,0859_test_ts.csv,1
860,0860_test_ts.csv,1
861,0861_test_ts.csv,0
862,0862_test_ts.csv,1
863,0863_test_ts.csv,1
864,0864_test_ts.csv,1
865,0865_test_ts.csv,1
866,0866_test_ts.csv,0
867,0867_test_ts.csv,0
868,0868_test_ts.csv,0
869,0869_test_ts.csv,0
870,0870_test_ts.csv,1
871,0871_test_ts.csv,1
872,0872_test_ts.csv,1
873,0873_test_ts.csv,1
874,0874_test_ts.csv,1
875,0875_test_ts.csv,1
876,0876_test_ts.csv,1
877,0877_test_ts.csv,1
878,0878_test_ts.csv,0
879,0879_test_ts.csv,1
880,0880_test_ts.csv,1
881,0881_test_ts.csv,1
882,0882_test_ts.csv,1
883,0883_test_ts.csv,1
884,0884_test_ts.csv,1
885,0885_test_ts.csv,0
886,0886_test_ts.csv,1
887,0887_test_ts.csv,0
888,0888_test_ts.csv,1
889,0889_test_ts.csv,1
890,0890_test_ts.csv,1
891,0891_test_ts.csv,1
892,0892_test_ts.csv,1
893,0893_test_ts.csv,1
894,0894_test_ts.csv,0
895,0895_test_ts.csv,1
896,0896_test_ts.csv,1
897,0897_test_ts.csv,1
898,0898_test_ts.csv,1
899,0899_test_ts.csv,1
900,0900_test_ts.csv,1
901,0901_test_ts.csv,1
902,0902_test_ts.csv,1
903,0903_test_ts.csv,0
904,0904_test_ts.csv,1
905,0905_test_ts.csv,1
906,0906_test_ts.csv,0
907,0907_test_ts.csv,1
908,0908_test_ts.csv,1
909,0909_test_ts.csv,1
910,0910_test_ts.csv,0
911,0911_test_ts.csv,0
912,0912_test_ts.csv,1
913,0913_test_ts.csv,1
914,0914_test_ts.csv,1
915,0915_test_ts.csv,1
916,0916_test_ts.csv,1
917,0917_test_ts.csv,1
918,0918_test_ts.csv,1
919,0919_test_ts.csv,1
920,0920_test_ts.csv,1
921,0921_test_ts.csv,1
922,0922_test_ts.csv,1
923,0923_test_ts.csv,1
924,0924_test_ts.csv,1
925,0925_test_ts.csv,1
926,0926_test_ts.csv,1
927,0927_test_ts.csv,1
928,0928_test_ts.csv,1
929,0929_test_ts.csv,0
930,0930_test_ts.csv,0
931,0931_test_ts.csv,1
932,0932_test_ts.csv,1
933,0933_test_ts.csv,1
934,0934_test_ts.csv,1
935,0935_test_ts.csv,0
936,0936_test_ts.csv,0
937,0937_test_ts.csv,1
938,0938_test_ts.csv,1
939,0939_test_ts.csv,1
940,0940_test_ts.csv,1
941,0941_test_ts.csv,0
942,0942_test_ts.csv,0
943,0943_test_ts.csv,1
944,0944_test_ts.csv,1
945,0945_test_ts.csv,1
946,0946_test_ts.csv,0
947,0947_test_ts.csv,1
948,0948_test_ts.csv,0
949,0949_test_ts.csv,1
950,0950_test_ts.csv,0
951,0951_test_ts.csv,1
952,0952_test_ts.csv,1
953,0953_test_ts.csv,1
954,0954_test_ts.csv,0
955,0955_test_ts.csv,1
956,0956_test_ts.csv,1
957,0957_test_ts.csv,1
958,0958_test_ts.csv,1
959,0959_test_ts.csv,1
960,0960_test_ts.csv,0
961,0961_test_ts.csv,0
962,0962_test_ts.csv,0
963,0963_test_ts.csv,1
964,0964_test_ts.csv,1
965,0965_test_ts.csv,1
966,0966_test_ts.csv,1
967,0967_test_ts.csv,1
968,0968_test_ts.csv,0
969,0969_test_ts.csv,1
970,0970_test_ts.csv,1
971,0971_test_ts.csv,0
972,0972_test_ts.csv,1
973,0973_test_ts.csv,1
974,0974_test_ts.csv,1
975,0975_test_ts.csv,1
976,0976_test_ts.csv,1
977,0977_test_ts.csv,1
978,0978_test_ts.csv,1
979,0979_test_ts.csv,1
980,0980_test_ts.csv,1
981,0981_test_ts.csv,1
982,0982_test_ts.csv,1
983,0983_test_ts.csv,0
984,0984_test_ts.csv,0
985,0985_test_ts.csv,0
986,0986_test_ts.csv,1
987,0987_test_ts.csv,1
988,0988_test_ts.csv,1
989,0989_test_ts.csv,0
990,0990_test_ts.csv,1
991,0991_test_ts.csv,1
992,0992_test_ts.csv,1
993,0993_test_ts.csv,1
994,0994_test_ts.csv,1
995,0995_test_ts.csv,1
996,0996_test_ts.csv,1
997,0997_test_ts.csv,0
998,0998_test_ts.csv,1
999,0999_test_ts.csv,1
1000,1000_test_ts.csv,1
1001,1001_test_ts.csv,1
1002,1002_test_ts.csv,1
1003,1003_test_ts.csv,1
1004,1004_test_ts.csv,0
1005,1005_test_ts.csv,1
1006,1006_test_ts.csv,1
1007,1007_test_ts.csv,1
1008,1008_test_ts.csv,1
1009,1009_test_ts.csv,1
1010,1010_test_ts.csv,1
1011,1011_test_ts.csv,1
1012,1012_test_ts.csv,1
1013,1013_test_ts.csv,1
1014,1014_test_ts.csv,1
1015,1015_test_ts.csv,1
1016,1016_test_ts.csv,1
1017,1017_test_ts.csv,1
1018,1018_test_ts.csv,1
1019,1019_test_ts.csv,1
1020,1020_test_ts.csv,1
1021,1021_test_ts.csv,0
1022,1022_test_ts.csv,1
1023,1023_test_ts.csv,1
1024,1024_test_ts.csv,1
1025,1025_test_ts.csv,0
1026,1026_test_ts.csv,1
1027,1027_test_ts.csv,1
1028,1028_test_ts.csv,0
1029,1029_test_ts.csv,1
1030,1030_test_ts.csv,0
1031,1031_test_ts.csv,0
1032,1032_test_ts.csv,1
1033,1033_test_ts.csv,0
1034,1034_test_ts.csv,1
1035,1035_test_ts.csv,1
1036,1036_test_ts.csv,0
1037,1037_test_ts.csv,0
1038,1038_test_ts.csv,1
1039,1039_test_ts.csv,1
1040,1040_test_ts.csv,1
1041,1041_test_ts.csv,1
1042,1042_test_ts.csv,1
1043,1043_test_ts.csv,1
1044,1044_test_ts.csv,1
1045,1045_test_ts.csv,1
1046,1046_test_ts.csv,0
1047,1047_test_ts.csv,0
1048,1048_test_ts.csv,1
1049,1049_test_ts.csv,1
1050,1050_test_ts.csv,1
1051,1051_test_ts.csv,1
1052,1052_test_ts.csv,1
1053,1053_test_ts.csv,1
1054,1054_test_ts.csv,1
1055,1055_test_ts.csv,1
1056,1056_test_ts.csv,1
1057,1057_test_ts.csv,1
1058,1058_test_ts.csv,1
1059,1059_test_ts.csv,1
1060,1060_test_ts.csv,0
1061,1061_test_ts.csv,0
1062,1062_test_ts.csv,0
1063,1063_test_ts.csv,1
1064,1064_test_ts.csv,1
1065,1065_test_ts.csv,1
1066,1066_test_ts.csv,0
1067,1067_test_ts.csv,1
1068,1068_test_ts.csv,1
1069,1069_test_ts.csv,1
1070,1070_test_ts.csv,1
1071,1071_test_ts.csv,1
1072,1072_test_ts.csv,1
1073,1073_test_ts.csv,1
1074,1074_test_ts.csv,0
1075,1075_test_ts.csv,1
1076,1076_test_ts.csv,1
1077,1077_test_ts.csv,1
1078,1078_test_ts.csv,1
1079,1079_test_ts.csv,0
1080,1080_test_ts.csv,1
1081,1081_test_ts.csv,1
1082,1082_test_ts.csv,1
1083,1083_test_ts.csv,0
1084,1084_test_ts.csv,1
1085,1085_test_ts.csv,1
1086,1086_test_ts.csv,1
1087,1087_test_ts.csv,0
1088,1088_test_ts.csv,1
1089,1089_test_ts.csv,1
1090,1090_test_ts.csv,1
1091,1091_test_ts.csv,1
1092,1092_test_ts.csv,1
1093,1093_test_ts.csv,0
1094,1094_test_ts.csv,1
1095,1095_test_ts.csv,0
1096,1096_test_ts.csv,1
1097,1097_test_ts.csv,1
1098,1098_test_ts.csv,1
1099,1099_test_ts.csv,1
1100,1100_test_ts.csv,1
1101,1101_test_ts.csv,1
1102,1102_test_ts.csv,1
1103,1103_test_ts.csv,0
1104,1104_test_ts.csv,0
1105,1105_test_ts.csv,0
1106,1106_test_ts.csv,1
1107,1107_test_ts.csv,1
1108,1108_test_ts.csv,0
1109,1109_test_ts.csv,1
1110,1110_test_ts.csv,1
1111,1111_test_ts.csv,1
1112,1112_test_ts.csv,1
1113,1113_test_ts.csv,1
1114,1114_test_ts.csv,1
1115,1115_test_ts.csv,1
1116,1116_test_ts.csv,1
1117,1117_test_ts.csv,1
1118,1118_test_ts.csv,1
1119,1119_test_ts.csv,1
1120,1120_test_ts.csv,1
1121,1121_test_ts.csv,1
1122,1122_test_ts.csv,0
1123,1123_test_ts.csv,1
1124,1124_test_ts.csv,1
1125,1125_test_ts.csv,0
1126,1126_test_ts.csv,1
1127,1127_test_ts.csv,1
1128,1128_test_ts.csv,1
1129,1129_test_ts.csv,1
1130,1130_test_ts.csv,1
1131,1131_test_ts.csv,1
1132,1132_test_ts.csv,1
1133,1133_test_ts.csv,1
1134,1134_test_ts.csv,1
1135,1135_test_ts.csv,0
1136,1136_test_ts.csv,1
1137,1137_test_ts.csv,1
1138,1138_test_ts.csv,1
1139,1139_test_ts.csv,1
1140,1140_test_ts.csv,1
1141,1141_test_ts.csv,0
1142,1142_test_ts.csv,1
1143,1143_test_ts.csv,0
1144,1144_test_ts.csv,1
1145,1145_test_ts.csv,1
1146,1146_test_ts.csv,1
1147,1147_test_ts.csv,0
1148,1148_test_ts.csv,1
1149,1149_test_ts.csv,1
1150,1150_test_ts.csv,1
1151,1151_test_ts.csv,1
1152,1152_test_ts.csv,1
1153,1153_test_ts.csv,1
1154,1154_test_ts.csv,1
1155,1155_test_ts.csv,1
1156,1156_test_ts.csv,1
1157,1157_test_ts.csv,0
1158,1158_test_ts.csv,1
1159,1159_test_ts.csv,1
1160,1160_test_ts.csv,1
1161,1161_test_ts.csv,1
1162,1162_test_ts.csv,1
1163,1163_test_ts.csv,1
1164,1164_test_ts.csv,1
1165,1165_test_ts.csv,0
1166,1166_test_ts.csv,0
1167,1167_test_ts.csv,1
1168,1168_test_ts.csv,0
1169,1169_test_ts.csv,1
1170,1170_test_ts.csv,1
1171,1171_test_ts.csv,1
1172,1172_test_ts.csv,1
1173,1173_test_ts.csv,1
1174,1174_test_ts.csv,1
1175,1175_test_ts.csv,1
1176,1176_test_ts.csv,1
1177,1177_test_ts.csv,1
1178,1178_test_ts.csv,1
1179,1179_test_ts.csv,1
1180,1180_test_ts.csv,1
1181,1181_test_ts.csv,1
1182,1182_test_ts.csv,1
1183,1183_test_ts.csv,0
1184,1184_test_ts.csv,1
1185,1185_test_ts.csv,1
1186,1186_test_ts.csv,0
1187,1187_test_ts.csv,1
1188,1188_test_ts.csv,1
1189,1189_test_ts.csv,1
1190,1190_test_ts.csv,1
1191,1191_test_ts.csv,1
1192,1192_test_ts.csv,1
1193,1193_test_ts.csv,1
1194,1194_test_ts.csv,0
1195,1195_test_ts.csv,1
1196,1196_test_ts.csv,1
1197,1197_test_ts.csv,1
1198,1198_test_ts.csv,1
1199,1199_test_ts.csv,1
1200,1200_test_ts.csv,0
1201,1201_test_ts.csv,1
1202,1202_test_ts.csv,1
1203,1203_test_ts.csv,0
1204,1204_test_ts.csv,0
1205,1205_test_ts.csv,1
1206,1206_test_ts.csv,1
1207,1207_test_ts.csv,1
1208,1208_test_ts.csv,1
1209,1209_test_ts.csv,1
1210,1210_test_ts.csv,0
1211,1211_test_ts.csv,1
1212,1212_test_ts.csv,1
1213,1213_test_ts.csv,0
1214,1214_test_ts.csv,1
1215,1215_test_ts.csv,1
1216,1216_test_ts.csv,1
1217,1217_test_ts.csv,0
1218,1218_test_ts.csv,0
1219,1219_test_ts.csv,0
1220,1220_test_ts.csv,0
1221,1221_test_ts.csv,1
1222,1222_test_ts.csv,0
1223,1223_test_ts.csv,1
1224,1224_test_ts.csv,1
1225,1225_test_ts.csv,1
1226,1226_test_ts.csv,0
1227,1227_test_ts.csv,0
1228,1228_test_ts.csv,1
1229,1229_test_ts.csv,1
1230,1230_test_ts.csv,1
1231,1231_test_ts.csv,0
1232,1232_test_ts.csv,0
1233,1233_test_ts.csv,0
1234,1234_test_ts.csv,1
1235,1235_test_ts.csv,0
1236,1236_test_ts.csv,0
1237,1237_test_ts.csv,0
1238,1238_test_ts.csv,0
1239,1239_test_ts.csv,0
1240,1240_test_ts.csv,0
1241,1241_test_ts.csv,0
1242,1242_test_ts.csv,0
1243,1243_test_ts.csv,0
1244,1244_test_ts.csv,0
1245,1245_test_ts.csv,0
1246,1246_test_ts.csv,1
1247,1247_test_ts.csv,1
1248,1248_test_ts.csv,0
1249,1249_test_ts.csv,1
1250,1250_test_ts.csv,0
1251,1251_test_ts.csv,0
1252,1252_test_ts.csv,1
1253,1253_test_ts.csv,0
1254,1254_test_ts.csv,1
1255,1255_test_ts.csv,0
1256,1256_test_ts.csv,1
1257,1257_test_ts.csv,1
1258,1258_test_ts.csv,0
1259,1259_test_ts.csv,1
1260,1260_test_ts.csv,0
1261,1261_test_ts.csv,1
1262,1262_test_ts.csv,0
1263,1263_test_ts.csv,1
1264,1264_test_ts.csv,1
1265,1265_test_ts.csv,0
1266,1266_test_ts.csv,0
1267,1267_test_ts.csv,0
1268,1268_test_ts.csv,0
1269,1269_test_ts.csv,0
1270,1270_test_ts.csv,0
1271,1271_test_ts.csv,1
1272,1272_test_ts.csv,0
1273,1273_test_ts.csv,1
1274,1274_test_ts.csv,0
1275,1275_test_ts.csv,0
1276,1276_test_ts.csv,1
1277,1277_test_ts.csv,0
1278,1278_test_ts.csv,1
1279,1279_test_ts.csv,0
1280,1280_test_ts.csv,1
1281,1281_test_ts.csv,0
1282,1282_test_ts.csv,0
1283,1283_test_ts.csv,0
1284,1284_test_ts.csv,0
1285,1285_test_ts.csv,0
1286,1286_test_ts.csv,0
1287,1287_test_ts.csv,0
1288,1288_test_ts.csv,1
1289,1289_test_ts.csv,1
1290,1290_test_ts.csv,1
1291,1291_test_ts.csv,0
1292,1292_test_ts.csv,1
1293,1293_test_ts.csv,0
1294,1294_test_ts.csv,0
1295,1295_test_ts.csv,0
1296,1296_test_ts.csv,0
1297,1297_test_ts.csv,0
1298,1298_test_ts.csv,0
1299,1299_test_ts.csv,0
1300,1300_test_ts.csv,0
1301,1301_test_ts.csv,0
1302,1302_test_ts.csv,1
1303,1303_test_ts.csv,1
1304,1304_test_ts.csv,0
1305,1305_test_ts.csv,0
1306,1306_test_ts.csv,0
1307,1307_test_ts.csv,0
1308,1308_test_ts.csv,1
1309,1309_test_ts.csv,0
1310,1310_test_ts.csv,0
1311,1311_test_ts.csv,0
1312,1312_test_ts.csv,0
1313,1313_test_ts.csv,1
1314,1314_test_ts.csv,1
1315,1315_test_ts.csv,1
1316,1316_test_ts.csv,1
1317,1317_test_ts.csv,1
1318,1318_test_ts.csv,0
1319,1319_test_ts.csv,1
1320,1320_test_ts.csv,0
1321,1321_test_ts.csv,1
1322,1322_test_ts.csv,1
1323,1323_test_ts.csv,1
1324,1324_test_ts.csv,1
1325,1325_test_ts.csv,0
1326,1326_test_ts.csv,1
1327,1327_test_ts.csv,0
1328,1328_test_ts.csv,1
1329,1329_test_ts.csv,1
1330,1330_test_ts.csv,1
1331,1331_test_ts.csv,0
1332,1332_test_ts.csv,0
1333,1333_test_ts.csv,0
1334,1334_test_ts.csv,1
1335,1335_test_ts.csv,1
1336,1336_test_ts.csv,0
1337,1337_test_ts.csv,1
1338,1338_test_ts.csv,1
1339,1339_test_ts.csv,1
1340,1340_test_ts.csv,0
1341,1341_test_ts.csv,1
1342,1342_test_ts.csv,0
1343,1343_test_ts.csv,0
1344,1344_test_ts.csv,0
1345,1345_test_ts.csv,1
1346,1346_test_ts.csv,1
1347,1347_test_ts.csv,1
1348,1348_test_ts.csv,1
1349,1349_test_ts.csv,1
1350,1350_test_ts.csv,0
1351,1351_test_ts.csv,1
1352,1352_test_ts.csv,0
1353,1353_test_ts.csv,1
1354,1354_test_ts.csv,0
1355,1355_test_ts.csv,1
1356,1356_test_ts.csv,1
1357,1357_test_ts.csv,0
1358,1358_test_ts.csv,1
1359,1359_test_ts.csv,1
1360,1360_test_ts.csv,1
1361,1361_test_ts.csv,1
1362,1362_test_ts.csv,1
1363,1363_test_ts.csv,1
1364,1364_test_ts.csv,0
1365,1365_test_ts.csv,1
1366,1366_test_ts.csv,1
1367,1367_test_ts.csv,1
1368,1368_test_ts.csv,0
1369,1369_test_ts.csv,0
