time,value
0,-0.21963000000000002
1,-0.22587
2,-0.23201999999999998
3,-0.23600000000000002
4,-0.23818000000000003
5,-0.24081
6,-0.24299
7,-0.24543
8,-0.24663000000000002
9,-0.24438000000000001
10,-0.24236
11,-0.24015
12,-0.23443000000000003
13,-0.22726
14,-0.22057
15,-0.21176
16,-0.20206
17,-0.19141
18,-0.1811
19,-0.17445
20,-0.17109000000000002
21,-0.16960999999999998
22,-0.16835999999999998
23,-0.16933
24,-0.16908
25,-0.16619
26,-0.1621
27,-0.15604
28,-0.14726
29,-0.13525
30,-0.12228
31,-0.10801
32,-0.09218
33,-0.074537
34,-0.058073
35,-0.043454
36,-0.030775
37,-0.025012
38,-0.024318
39,-0.026262999999999998
40,-0.034132
41,-0.05125
42,-0.07028999999999999
43,-0.085881
44,-0.10357999999999999
45,-0.12232
46,-0.13965999999999998
47,-0.15550999999999998
48,-0.16835
49,-0.18048
50,-0.19292
51,-0.20119
52,-0.20769
53,-0.21275
54,-0.21433000000000002
55,-0.21491999999999997
56,-0.21415
57,-0.21058000000000002
58,-0.20525
59,-0.2005
60,-0.19759000000000002
61,-0.19577999999999998
62,-0.19696
63,-0.20248
64,-0.2131
65,-0.22854000000000002
66,-0.24506
67,-0.25913
68,-0.2689
69,-0.275
70,-0.27878000000000003
71,-0.28051
72,-0.27898
73,-0.27301
74,-0.26529
75,-0.25906
76,-0.25177
77,-0.24472
78,-0.24045
79,-0.23734
80,-0.23376999999999998
81,-0.23192
82,-0.23139
83,-0.23069
84,-0.22924
85,-0.22858
86,-0.23016999999999999
87,-0.23196999999999998
88,-0.23758
89,-0.24796999999999997
90,-0.25934
91,-0.26928
92,-0.27842
93,-0.28615999999999997
94,-0.29091
95,-0.2937
96,-0.29594000000000004
97,-0.29627
98,-0.29433000000000004
99,-0.29295
100,-0.29166
101,-0.2899
102,-0.287
103,-0.28281999999999996
104,-0.27756
105,-0.27155
106,-0.2662
107,-0.26092
108,-0.25367
109,-0.24558000000000002
110,-0.23738
111,-0.22864
112,-0.22016999999999998
113,-0.21154
114,-0.20238
115,-0.19351
116,-0.18538
117,-0.17706
118,-0.16998
119,-0.16417
120,-0.16007000000000002
121,-0.15736
122,-0.15554
123,-0.1544
124,-0.1551
125,-0.15888
126,-0.16293
127,-0.16796
128,-0.17406
129,-0.1808
130,-0.18712
131,-0.19174000000000002
132,-0.19577
133,-0.19924
134,-0.20122
135,-0.20312
136,-0.20578000000000002
137,-0.20855
138,-0.21095
139,-0.21266
140,-0.21359
141,-0.21404
142,-0.21293
143,-0.2103
144,-0.20943
145,-0.20911999999999997
146,-0.20659
147,-0.20403
148,-0.20235
149,-0.19876
150,-0.19274000000000002
151,-0.18607
152,-0.17887999999999998
153,-0.17049
154,-0.16207
155,-0.15508
156,-0.14927
157,-0.14485
158,-0.14300000000000002
159,-0.14387
160,-0.14872
161,-0.15621
162,-0.16755
163,-0.18174
164,-0.1949
165,-0.21015
166,-0.22428
167,-0.23431999999999997
168,-0.24388
169,-0.25114000000000003
170,-0.25505
171,-0.25736
172,-0.2574
173,-0.25828
174,-0.26328
175,-0.26523
176,-0.2668
177,-0.27015
178,-0.27252
179,-0.27428
180,-0.27439
181,-0.2755
182,-0.27525
183,-0.27226999999999996
184,-0.26726
185,-0.26243
186,-0.25978
187,-0.25232
188,-0.24261999999999997
189,-0.24069000000000002
190,-0.23853000000000002
191,-0.22912
192,-0.21425
193,-0.19344
194,-0.16717
195,-0.14163
196,-0.10995999999999999
197,-0.073536
198,-0.038497
199,-0.0012093
200,0.035481
201,0.068372
202,0.087798
203,0.097419
204,0.092799
205,0.07639299999999999
206,0.06434400000000001
207,0.042577
208,0.011558
209,-0.012022
210,-0.034246
211,-0.054194000000000006
212,-0.068312
213,-0.07914
214,-0.088406
215,-0.11167
216,-0.12854000000000002
217,-0.13959000000000002
218,-0.1572
219,-0.16624
220,-0.17997
221,-0.19338
222,-0.19448
223,-0.1863
224,-0.17722000000000002
225,-0.16757
226,-0.1528
227,-0.14068
228,-0.12972999999999998
229,-0.11867
230,-0.11052000000000001
231,-0.09921100000000001
232,-0.086493
233,-0.074499
234,-0.072214
235,-0.091515
236,-0.098475
237,-0.10038
238,-0.10559
239,-0.11624000000000001
240,-0.12055999999999999
241,-0.12655999999999998
242,-0.14159000000000002
243,-0.17873
244,-0.19672
245,-0.21338000000000001
246,-0.22027
247,-0.22154000000000001
248,-0.21856
249,-0.20804
250,-0.19288
251,-0.17570999999999998
252,-0.15333
253,-0.12784
254,-0.099237
255,-0.06564
256,-0.031912
257,0.0033756
258,0.039404
259,0.080322
260,0.13122999999999999
261,0.19187
262,0.2464
263,0.30498000000000003
264,0.36637
265,0.4194
266,0.47678000000000004
267,0.51543
268,0.5509
269,0.6009800000000001
270,0.6574300000000001
271,0.71406
272,0.7772600000000001
273,0.84349
274,0.9061600000000001
275,0.9803299999999999
276,1.0345
277,1.0777
278,1.121
279,1.2033
280,1.2631
281,1.3113
282,1.3263
283,1.311
284,1.2963
285,1.2524
286,1.2163
287,1.1699
288,1.056
289,1.0588
290,1.0368
291,1.005
292,0.99445
293,0.97051
294,0.95793
295,0.9655600000000001
296,0.9633299999999999
297,0.9607399999999999
298,0.9737399999999999
299,0.99174
300,1.0082
301,1.034
302,1.0615
303,1.0939
304,1.1358
305,1.1812
306,1.227
307,1.2848
308,1.3448
309,1.4169999999999998
310,1.4934
311,1.5812
312,1.6796
313,1.7955
314,1.9134
315,2.0379
316,2.1493
317,2.2621
318,2.4188
319,2.5776
320,2.6895
321,2.8209
322,2.9591
323,3.0514
324,3.1523
325,3.2552
326,3.2526
327,3.1977
328,3.2798
329,3.3543
330,3.3641
331,3.3216
332,3.2028
333,3.0695
334,3.028
335,2.9439
336,2.6446
337,2.6135
338,2.6052
339,2.4885
340,2.3419
341,2.1812
342,2.0087
343,1.9064
344,1.7671
345,1.6062
346,1.4729
347,1.3725
348,1.2078
349,1.1057
350,0.9827100000000001
351,0.8679399999999999
352,0.74024
353,0.57796
354,0.51226
355,0.40219
356,0.29058
357,0.20081
358,0.1006
359,-0.026829000000000002
360,-0.079855
361,-0.20239000000000001
362,-0.26011
363,-0.31913
364,-0.39648
365,-0.44822
366,-0.50371
367,-0.54882
368,-0.59778
369,-0.64203
370,-0.69125
371,-0.7248899999999999
372,-0.75105
373,-0.78356
374,-0.80889
375,-0.8311799999999999
376,-0.8582
377,-0.8821100000000001
378,-0.90174
379,-0.9276
380,-0.93929
381,-0.9635
382,-0.9844200000000001
383,-1.0045
384,-1.0272
385,-1.0492
386,-1.077
387,-1.1051
388,-1.1316
389,-1.1498
390,-1.1749
391,-1.1946
392,-1.2093
393,-1.2274
394,-1.2409
395,-1.2529
396,-1.2667
397,-1.2752
398,-1.2863
399,-1.2963
400,-1.3037
401,-1.3122
402,-1.3203
403,-1.3275
404,-1.3332
405,-1.3403
406,-1.3458
407,-1.3504
408,-1.3549
409,-1.3613
410,-1.3664
411,-1.3714
412,-1.376
413,-1.3809
414,-1.3854
415,-1.3895
416,-1.3935
417,-1.3975
418,-1.4007
419,-1.4045
420,-1.4076
421,-1.4104
422,-1.4129
423,-1.4155
424,-1.4180000000000001
425,-1.4201
426,-1.4229
427,-1.4254
428,-1.4284
429,-1.4304
430,-1.4329
431,-1.435
432,-1.4363
433,-1.4388
434,-1.4407
435,-1.443
436,-1.4446
437,-1.4451
438,-1.4458
439,-1.4466
440,-1.4474
441,-1.4488
442,-1.4498
443,-1.4509999999999998
444,-1.4528
445,-1.4538
446,-1.4551
447,-1.4567
