time,value
0,0.66781
1,-0.97603
2,0.66781
3,-0.97603
4,0.66781
5,-0.97603
6,0.66781
7,-0.97603
8,0.66781
9,-0.97603
10,0.66781
11,-0.97603
12,0.66781
13,-0.97603
14,0.66781
15,-0.97603
16,0.66781
17,-0.97603
18,0.66781
19,-0.97603
20,0.66781
21,-0.97603
22,0.66781
23,-0.97603
24,0.66781
25,-0.97603
26,0.66781
27,0.66781
28,-0.97603
29,0.66781
30,-0.97603
31,0.66781
32,-0.97603
33,0.66781
34,-0.97603
35,0.66781
36,-0.97603
37,0.66781
38,-0.97603
39,0.66781
40,-0.97603
41,0.66781
42,-0.97603
43,0.66781
44,-0.97603
45,0.66781
46,-0.97603
47,0.66781
48,-0.97603
49,0.66781
50,-0.97603
51,0.66781
52,-0.97603
53,0.66781
54,-0.97603
55,0.66781
56,-0.97603
57,0.66781
58,-0.97603
59,0.66781
60,-0.97603
61,0.66781
62,-0.97603
63,0.66781
64,-0.97603
65,0.66781
66,-0.97603
67,0.66781
68,-0.97603
69,0.66781
70,-0.97603
71,0.66781
72,-0.97603
73,0.66781
74,-0.97603
75,0.66781
76,-0.97603
77,0.66781
78,-0.97603
79,0.66781
80,-0.97603
81,0.66781
82,-0.97603
83,0.66781
84,2.3117
85,2.3117
86,3.9555
87,2.3117
88,0.66781
89,0.66781
90,-0.97603
91,0.66781
92,-0.97603
93,0.66781
94,-0.97603
95,0.66781
