time,value
0,-0.71011
1,0.058009000000000005
2,1.9783
3,-0.32605
4,-0.71011
5,-0.71011
6,-0.71011
7,1.2102
8,1.4022
9,-0.71011
10,-0.71011
11,-0.71011
12,-0.71011
13,2.1703
14,0.44206999999999996
15,-0.71011
16,-0.71011
17,-0.71011
18,0.25004
19,1.9783
20,-0.32605
21,-0.71011
22,-0.71011
23,-0.71011
24,1.0182
25,1.4022
26,-0.71011
27,-0.71011
28,-0.71011
29,-0.71011
30,1.9783
31,0.6341
32,-0.71011
33,-0.71011
34,-0.71011
35,0.058009000000000005
36,1.9783
37,-0.13402
38,-0.71011
39,-0.71011
40,-0.71011
41,1.0182
42,1.5942
43,-0.71011
44,-0.71011
45,-0.71011
46,-0.71011
47,1.7863
48,0.8261299999999999
49,-0.71011
50,-0.71011
51,-0.71011
52,-0.13402
53,1.9783
54,0.058009000000000005
55,-0.71011
56,-0.71011
57,-0.71011
58,0.8261299999999999
59,1.7863
60,-0.71011
61,-0.71011
62,-0.71011
63,-0.71011
64,1.7863
65,0.8261299999999999
66,-0.71011
67,-0.71011
68,-0.71011
69,-0.13402
70,1.9783
71,0.058009000000000005
72,-0.71011
73,-0.71011
74,0.44206999999999996
75,1.9783
76,-0.71011
77,-0.71011
78,-0.71011
79,-0.71011
80,1.7863
81,1.0182
82,-0.71011
83,-0.71011
84,-0.71011
85,0.25004
86,1.9783
87,-0.32605
88,-0.71011
89,-0.71011
90,-0.71011
91,1.5942
92,1.0182
93,-0.71011
94,-0.71011
95,-0.71011
