time,value
0,1.7042
1,1.6817
2,1.6735
3,1.646
4,1.5943
5,1.5461
6,1.4681
7,1.3604
8,1.2551
9,1.1440000000000001
10,1.0348
11,0.9275700000000001
12,0.82258
13,0.71507
14,0.60622
15,0.5078699999999999
16,0.41228000000000004
17,0.31966999999999995
18,0.22019
19,0.12222000000000001
20,0.024623
21,-0.066116
22,-0.15609
23,-0.24675
24,-0.32632
25,-0.40615
26,-0.48801000000000005
27,-0.5534600000000001
28,-0.62054
29,-0.6913100000000001
30,-0.7690100000000001
31,-0.82225
32,-0.8656200000000001
33,-0.9191799999999999
34,-0.9587
35,-1.0197
36,-1.0434
37,-1.0959
38,-1.1423
39,-1.1451
40,-1.1781
41,-1.2041
42,-1.2234
43,-1.235
44,-1.2394
45,-1.2366
46,-1.2259
47,-1.2081
48,-1.1834
49,-1.173
50,-1.1501
51,-1.1047
52,-1.0531
53,-0.99608
54,-0.9605100000000001
55,-0.91354
56,-0.8585
57,-0.80292
58,-0.7397199999999999
59,-0.67208
60,-0.6268600000000001
61,-0.5494100000000001
62,-0.46961
63,-0.40743
64,-0.31863
65,-0.24865
66,-0.17365
67,-0.075134
68,0.007258800000000001
69,0.09364600000000001
70,0.18517999999999998
71,0.292
72,0.35095
73,0.44891000000000003
74,0.54986
75,0.64971
76,0.74865
77,0.85762
78,0.96851
79,1.0813
80,1.1958
81,1.3108
82,1.4196
83,1.5329
84,1.6058
85,1.6622
86,1.6828
87,1.7041
88,1.7059
89,1.6717
90,1.6797
91,1.6484
92,1.6011
93,1.4905
94,1.3776
95,1.2653
96,1.1518
97,1.0784
98,0.9683799999999999
99,0.8604299999999999
100,0.74961
101,0.63898
102,0.5371600000000001
103,0.43273
104,0.32653000000000004
105,0.21715
106,0.11999000000000001
107,0.019066999999999997
108,-0.077679
109,-0.13835999999999998
110,-0.23340999999999998
111,-0.32077
112,-0.40331999999999996
113,-0.47084
114,-0.54427
115,-0.6178
116,-0.6933
117,-0.75052
118,-0.80928
119,-0.89266
120,-0.9408
121,-1.0154
122,-1.0849
123,-1.1152
124,-1.1414
125,-1.1894
126,-1.1977
127,-1.2041
128,-1.2284
129,-1.2134
130,-1.2292
131,-1.2378
132,-1.2392
133,-1.2328
134,-1.2375
135,-1.2443
136,-1.2178
137,-1.1846
138,-1.179
139,-1.1347
140,-1.0818
141,-1.0527
142,-0.99271
143,-0.92314
144,-0.87379
145,-0.81429
146,-0.77915
147,-0.73625
148,-0.65283
149,-0.58499
150,-0.50365
151,-0.41873999999999995
152,-0.35365
153,-0.26143
154,-0.18746
155,-0.10892
156,-0.0077180999999999994
157,0.095276
158,0.18350999999999998
159,0.29086
160,0.38466
161,0.48165
162,0.5814199999999999
163,0.6836899999999999
164,0.78856
165,0.8956
166,1.0047
167,1.1108
168,1.2193
169,1.3297
170,1.4443
171,1.5166
172,1.5994
173,1.6542
174,1.6731
175,1.7045
