time,value
0,-0.88476
1,-0.87074
2,-0.8494
3,-0.82045
4,-0.78409
5,-0.74088
6,-0.69181
7,-0.63778
8,-0.57965
9,-0.51837
10,-0.45495
11,-0.39066
12,-0.32696
13,-0.26518
14,-0.20681
15,-0.15323
16,-0.10564000000000001
17,-0.065139
18,-0.031872000000000004
19,-0.005675100000000001
20,0.013999000000000001
21,0.027916000000000003
22,0.036551
23,0.040845
24,0.041636
25,0.039582
26,0.035191
27,0.028577999999999996
28,0.019902
29,0.009654600000000001
30,-0.0018430999999999996
31,-0.014336000000000002
32,-0.027808
33,-0.042645999999999996
34,-0.058667
35,-0.07596699999999999
36,-0.094648
37,-0.11481
38,-0.13695
39,-0.16075
40,-0.18592999999999998
41,-0.21211
42,-0.23892
43,-0.26627
44,-0.29391999999999996
45,-0.32154
46,-0.34896
47,-0.37604
48,-0.40273000000000003
49,-0.42903
50,-0.45464
51,-0.47928000000000004
52,-0.50264
53,-0.5244
54,-0.5443899999999999
55,-0.56225
56,-0.57775
57,-0.59067
58,-0.60085
59,-0.60826
60,-0.61264
61,-0.6138100000000001
62,-0.6116699999999999
63,-0.6061300000000001
64,-0.59729
65,-0.58507
66,-0.56942
67,-0.55066
68,-0.52932
69,-0.5061
70,-0.48191000000000006
71,-0.4569
72,-0.43193000000000004
73,-0.40786999999999995
74,-0.38547
75,-0.36577
76,-0.3484
77,-0.33351
78,-0.32126
79,-0.31167
80,-0.305
81,-0.30065
82,-0.29808
83,-0.29721
84,-0.29804
85,-0.30082
86,-0.30565
87,-0.31213
88,-0.32049
89,-0.33107
90,-0.34418000000000004
91,-0.36051
92,-0.3794
93,-0.40084000000000003
94,-0.42476
95,-0.45093999999999995
96,-0.47933000000000003
97,-0.5089899999999999
98,-0.5391
99,-0.56902
100,-0.59816
101,-0.62625
102,-0.65288
103,-0.6773100000000001
104,-0.69933
105,-0.7189
106,-0.73624
107,-0.75236
108,-0.76666
109,-0.7791899999999999
110,-0.78995
111,-0.79901
112,-0.80771
113,-0.81548
114,-0.82191
115,-0.82678
116,-0.82999
117,-0.8326600000000001
118,-0.83535
119,-0.83734
120,-0.8384799999999999
121,-0.83868
122,-0.83845
123,-0.83949
124,-0.8402299999999999
125,-0.84026
126,-0.8391799999999999
127,-0.83683
128,-0.83596
129,-0.8349
130,-0.83326
131,-0.83076
132,-0.82725
133,-0.82484
134,-0.82337
135,-0.82144
136,-0.8184
137,-0.8137300000000001
138,-0.80835
139,-0.80392
140,-0.79867
141,-0.7923600000000001
142,-0.78483
143,-0.7762600000000001
144,-0.76962
145,-0.7625
146,-0.75397
147,-0.74282
148,-0.7276600000000001
149,-0.70916
150,-0.68502
151,-0.65271
152,-0.61019
153,-0.55571
154,-0.48917
155,-0.41075
156,-0.31932
157,-0.21534
158,-0.10004
159,0.024099000000000002
160,0.15266
161,0.28381
162,0.41473999999999994
163,0.54298
164,0.66647
165,0.7822399999999999
166,0.8902700000000001
167,0.9909100000000001
168,1.085
169,1.1736
170,1.2572
171,1.3368
172,1.4139
173,1.4899
174,1.5659
175,1.6426
176,1.7203
177,1.8004
178,1.8834
179,1.9695
180,2.0582
181,2.1477
182,2.2364
183,2.3219
184,2.4012
185,2.4712
186,2.5289
187,2.5721
188,2.5993
189,2.6101
190,2.6051
191,2.5853
192,2.5529
193,2.5103
194,2.46
195,2.4044
196,2.3455
197,2.2847
198,2.2233
199,2.1618
200,2.1007
201,2.0399
202,1.9793
203,1.9189
204,1.8586
205,1.7983
206,1.7377
207,1.6765
208,1.6144
209,1.5512
210,1.4866
211,1.42
212,1.3511
213,1.2797
214,1.2065
215,1.1318
216,1.0558
217,0.97898
218,0.90085
219,0.82311
220,0.74587
221,0.66892
222,0.59195
223,0.51395
224,0.43593999999999994
225,0.35845
226,0.28141
227,0.2048
228,0.12825999999999999
229,0.05243300000000001
230,-0.020804
231,-0.091171
232,-0.15852
233,-0.22279000000000002
234,-0.2848
235,-0.34169
236,-0.39341
237,-0.44027
238,-0.48273
239,-0.52262
240,-0.55811
241,-0.58917
242,-0.6167199999999999
243,-0.64166
244,-0.66561
245,-0.6879
246,-0.70712
247,-0.72367
248,-0.7380899999999999
249,-0.75124
250,-0.76407
251,-0.77449
252,-0.78303
253,-0.79037
254,-0.79709
255,-0.80479
256,-0.81114
257,-0.81597
258,-0.8196200000000001
259,-0.82258
260,-0.82625
261,-0.8299799999999999
262,-0.8334600000000001
263,-0.8374299999999999
264,-0.84254
265,-0.84949
266,-0.85808
267,-0.86639
268,-0.8738799999999999
269,-0.8801100000000001
