[<text>
<title>cavalier homes inc &lt;cavh&gt; 4th qtr net</title>
<dateline>    wichita falls, texas, march 19 -
    </dateline>shr 10 cts vs 14 cts
    net 191,465 vs 193,799
    sales 7,160,945 vs 6,576,670
    avg shrs 2,000,565 vs 1,400,000
    year
    oper shr 33 cts vs 50 cts
    oper net 605,725 vs 694,785
    sales 23.3 mln vs 22.1 mln
    avg shrs 1,840,692 vs 1,400,000
    note: 1985 year net excludes 30,000 dlr tax credit.
 reuter
</text>]