time,value
0,-2.2352
1,-2.2352
2,-2.2352
3,-2.2352
4,-2.2352
5,-2.2352
6,-2.2352
7,-2.2352
8,-2.2352
9,-2.2352
10,-2.235
11,-2.2347
12,-2.2343
13,-2.2339
14,-2.2332
15,-2.2326
16,-2.2319
17,-2.2332
18,-2.2324
19,-2.2311
20,-2.2301
21,-2.2289
22,-2.2273
23,-2.226
24,-2.2246
25,-2.2227
26,-2.2268
27,-2.2332
28,-2.2367
29,-2.235
30,-2.2333
31,-2.2308
32,-2.2289
33,-2.2268
34,-2.2241
35,-2.2219
36,-2.2196
37,-2.2165
38,-2.2141
39,-2.2116
40,-2.2104
41,-2.2078
42,-2.2051
43,-2.2014
44,-2.1985
45,-2.1956
46,-2.1917
47,-2.1886
48,-2.1855
49,-2.1812
50,-2.178
51,-2.1747
52,-2.1702
53,-2.1667
54,-2.1632
55,-2.1585
56,-2.1549
57,-2.1499
58,-2.1462
59,-2.1424
60,-2.1373
61,-2.1334
62,-2.1294
63,-2.1241
64,-2.1299
65,-2.1344
66,-2.1322
67,-2.128
68,-2.1237
69,-2.1180000000000003
70,-2.1137
71,-2.1093
72,-2.1034
73,-2.0989
74,-2.0944
75,-2.0883
76,-2.0837
77,-2.0791
78,-2.0746
79,-2.0699
80,-2.0651
81,-2.0587
82,-2.0539
83,-2.049
84,-2.0408
85,-2.0358
86,-2.0308
87,-2.0242
88,-2.0191
89,-2.0140000000000002
90,-2.0072
91,-2.0021
92,-1.9952
93,-1.99
94,-1.9848
95,-1.9778
96,-1.9725
97,-1.9672
98,-1.9601
99,-1.9547
100,-1.9493
101,-1.9436
102,-1.9381
103,-1.9327
104,-1.9253
105,-1.9183
106,-1.9128
107,-1.9054
108,-1.8998
109,-1.8942
110,-1.8867
111,-1.881
112,-1.8753
113,-1.8678
114,-1.8621
115,-1.8563
116,-1.8487
117,-1.8429
118,-1.8371
119,-1.8294
120,-1.8235
121,-1.8177
122,-1.8099
123,-1.804
124,-1.7981
125,-1.7903
126,-1.7843
127,-1.7778
128,-1.7719
129,-1.7686
130,-1.7594
131,-1.7535
132,-1.7475
133,-1.7396
134,-1.7336
135,-1.7276
136,-1.7184
137,-1.7124
138,-1.7064
139,-1.6983
140,-1.6923
141,-1.6878
142,-1.6808
143,-1.6755
144,-1.6695
145,-1.6614
146,-1.6554
147,-1.6481
148,-1.64
149,-1.6339
150,-1.6294
151,-1.6225
152,-1.6172
153,-1.6111
154,-1.6030000000000002
155,-1.5969
156,-1.5896
157,-1.5815
158,-1.5753
159,-1.5709
160,-1.564
161,-1.5587
162,-1.5526
163,-1.5445
164,-1.5372
165,-1.5290000000000001
166,-1.5228
167,-1.5167
168,-1.5090000000000001
169,-1.5055
170,-1.4981
171,-1.4899
172,-1.4826
173,-1.4764
174,-1.47
175,-1.4644
176,-1.4591
177,-1.4497
178,-1.4435
179,-1.4362
180,-1.4277
181,-1.4221
182,-1.4156
183,-1.4062
184,-1.3986
185,-1.393
186,-1.3877
187,-1.3815
188,-1.3742
189,-1.3659999999999999
190,-1.3595
191,-1.3539
192,-1.3475
193,-1.3413
194,-1.3352
195,-1.3258
196,-1.3184
197,-1.3149
198,-1.3072
199,-1.3011
200,-1.2917
201,-1.2855
202,-1.2794
203,-1.2738
204,-1.2682
205,-1.2609
206,-1.2527
207,-1.2465
208,-1.2391
209,-1.2309
210,-1.2247
211,-1.2174
212,-1.2106
213,-1.2042
214,-1.198
215,-1.1886
216,-1.1824
217,-1.1762
218,-1.1695
219,-1.166
220,-1.1598
221,-1.1504
222,-1.1442
223,-1.138
224,-1.1316
225,-1.126
226,-1.1217
227,-1.1134
228,-1.1072
229,-1.101
230,-1.0916
231,-1.0854
232,-1.0791
233,-1.0716
234,-1.0661
235,-1.0566
236,-1.0504
237,-1.043
238,-1.0347
239,-1.0292
240,-1.0237
241,-1.0143
242,-1.0081
243,-1.0019
244,-0.9924200000000001
245,-0.98619
246,-0.97995
247,-0.97144
248,-0.9659700000000001
249,-0.95954
250,-0.9512299999999999
251,-0.94499
252,-0.93761
253,-0.92911
254,-0.92364
255,-0.9172100000000001
256,-0.9089
257,-0.90265
258,-0.89528
259,-0.88694
260,-0.8806799999999999
261,-0.8744200000000001
262,-0.8678600000000001
263,-0.8624
264,-0.85615
265,-0.8478100000000001
266,-0.8404299999999999
267,-0.8341700000000001
268,-0.82776
269,-0.82232
270,-0.81702
271,-0.8075600000000001
272,-0.8013
273,-0.79294
274,-0.78555
275,-0.77928
276,-0.7709
277,-0.76758
278,-0.7621600000000001
279,-0.75478
280,-0.7485
281,-0.74222
282,-0.7338399999999999
283,-0.72645
284,-0.72016
285,-0.7117600000000001
286,-0.7054600000000001
287,-0.69915
288,-0.6907300000000001
289,-0.6844100000000001
290,-0.67808
291,-0.67166
292,-0.6684
293,-0.6609999999999999
294,-0.65259
295,-0.64933
296,-0.64395
297,-0.63656
298,-0.63025
299,-0.62395
300,-0.61553
301,-0.6081300000000001
302,-0.6018100000000001
303,-0.59337
304,-0.58704
305,-0.5807100000000001
306,-0.57327
307,-0.56793
308,-0.56053
309,-0.5542
310,-0.54787
311,-0.53942
312,-0.53308
313,-0.52567
314,-0.5172
315,-0.51085
316,-0.50449
317,-0.49813999999999997
318,-0.49285
319,-0.48861000000000004
320,-0.48013999999999996
321,-0.47379
322,-0.46743
323,-0.45893999999999996
324,-0.45257
325,-0.44516000000000006
326,-0.43665
327,-0.43028
328,-0.42389
329,-0.41538
330,-0.40898
331,-0.40479
332,-0.39851
333,-0.39321999999999996
334,-0.38683
335,-0.37832
336,-0.37193000000000004
337,-0.36553
338,-0.35699000000000003
339,-0.35059
340,-0.34418000000000004
341,-0.33563000000000004
342,-0.32921999999999996
343,-0.32178
344,-0.31322
345,-0.30679
346,-0.29822
347,-0.29178000000000004
348,-0.28535
349,-0.27676
350,-0.27031
351,-0.26386
352,-0.25873
353,-0.25359
354,-0.2483
355,-0.23970999999999998
356,-0.23326999999999998
357,-0.22682
358,-0.21821999999999997
359,-0.21176
360,-0.2053
361,-0.19668
362,-0.19021
363,-0.18374000000000001
364,-0.17414000000000002
365,-0.16766
366,-0.16119
367,-0.15254
368,-0.14845
369,-0.14337
370,-0.13613
371,-0.12966
372,-0.12339000000000001
373,-0.11732000000000001
374,-0.11202000000000001
375,-0.10555999999999999
376,-0.09694
377,-0.09046799999999999
378,-0.083993
379,-0.074387
380,-0.067906
381,-0.059264
382,-0.052779
383,-0.047488999999999996
384,-0.041458
385,-0.035196
386,-0.028718
387,-0.020075
388,-0.012624
389,-0.006139199999999999
390,0.0025128
391,0.009004799999999999
392,0.016218
393,0.024403
394,0.031852
395,0.038110000000000005
396,0.044157
397,0.049447000000000005
398,0.055922
399,0.06456
400,0.072009
401,0.07849199999999999
402,0.087139
403,0.09362899999999999
404,0.09868400000000001
405,0.10375
406,0.1112
407,0.11767999999999999
408,0.12633
409,0.13282
410,0.14027
411,0.14892
412,0.15542
413,0.16192
414,0.17059000000000002
415,0.17465999999999998
416,0.18066
417,0.18595
418,0.19244
419,0.2011
420,0.2076
421,0.21506
422,0.22373
423,0.23024
424,0.23526
425,0.24029
426,0.24774000000000002
427,0.25424
428,0.26291
429,0.27037
430,0.27565
431,0.28164
432,0.28572
433,0.29220999999999997
434,0.30183000000000004
435,0.30833
436,0.31484
437,0.32299
438,0.32803000000000004
439,0.33452
440,0.34318000000000004
441,0.34969
442,0.35619
443,0.36486
444,0.37137
445,0.37788
446,0.38750999999999997
447,0.39403
448,0.40055
449,0.40924
450,0.41329
451,0.41828999999999994
452,0.42452
453,0.43104
454,0.43972
455,0.44718
456,0.4537
457,0.4624
458,0.46892
459,0.47545
460,0.48416000000000003
461,0.49038000000000004
462,0.49255
463,0.49908
464,0.50655
465,0.5140100000000001
466,0.52365
467,0.5311100000000001
468,0.53422
469,0.5364
470,0.54294
471,0.5472899999999999
472,0.54947
473,0.55383
474,0.56038
475,0.5691
476,0.57657
477,0.58312
478,0.59185
479,0.5984
480,0.60059
481,0.60277
482,0.60715
483,0.6137
484,0.62245
485,0.62464
486,0.62464
487,0.63339
488,0.6399600000000001
489,0.64782
490,0.6543899999999999
491,0.65479
492,0.6534300000000001
493,0.65693
494,0.66264
495,0.6622
496,0.65957
497,0.65696
498,0.6535
499,0.65091
500,0.6483399999999999
501,0.64493
502,0.64323
503,0.63575
504,0.62827
505,0.62574
506,0.62321
507,0.61765
508,0.61765
509,0.61322
510,0.60436
511,0.59688
512,0.5894
513,0.5797
514,0.57665
515,0.57444
516,0.57001
517,0.5633600000000001
518,0.5633600000000001
519,0.55894
520,0.5523
521,0.54566
522,0.53597
523,0.5293399999999999
524,0.52375
525,0.5190100000000001
526,0.51237
527,0.50267
528,0.50016
529,0.49543999999999994
530,0.48796000000000006
531,0.48131
532,0.47383000000000003
533,0.46497
534,0.4597
535,0.45498
536,0.45027
537,0.44361999999999996
538,0.43696999999999997
539,0.42727
540,0.42062
541,0.41757
542,0.41203
543,0.40594
544,0.39928
545,0.38958000000000004
546,0.38293
547,0.37545
548,0.36991999999999997
549,0.36605
550,0.35939
551,0.35026
552,0.34558
553,0.34173000000000003
554,0.33284
555,0.32616999999999996
556,0.31951
557,0.31062
558,0.30314
559,0.29648
560,0.2876
561,0.28095
562,0.27208000000000004
563,0.26543
564,0.25878
565,0.24991999999999998
566,0.24328000000000002
567,0.23801
568,0.23467
569,0.23218000000000003
570,0.22748000000000002
571,0.2228
572,0.21531999999999998
573,0.20865
574,0.19977
575,0.19229000000000002
576,0.18925
577,0.18375
578,0.17767
579,0.171
580,0.16129000000000002
581,0.15463
582,0.14795999999999998
583,0.14469
584,0.14003
585,0.13760999999999998
586,0.13441
587,0.12915
588,0.12247000000000001
589,0.11355
590,0.10687
591,0.099382
592,0.090477
593,0.083798
594,0.080765
595,0.075324
596,0.071495
597,0.062581
598,0.055896
599,0.049214999999999995
600,0.039501999999999995
601,0.032823000000000005
602,0.026146
603,0.017245
604,0.010573
605,0.0030878
606,-0.0023761999999999998
607,-0.0084402
608,-0.015119999999999998
609,-0.024021999999999998
610,-0.031507
611,-0.038991000000000005
612,-0.044444
613,-0.048273
614,-0.054959
615,-0.06467200000000001
616,-0.071354
617,-0.078033
618,-0.085702
619,-0.08809600000000001
620,-0.09478500000000001
621,-0.1053
622,-0.10991
623,-0.11450999999999999
624,-0.12120999999999998
625,-0.1279
626,-0.13539
627,-0.14432
628,-0.14892
629,-0.15128
630,-0.15663
631,-0.15895
632,-0.16049000000000002
633,-0.16126
634,-0.16202
635,-0.16505999999999998
636,-0.16505999999999998
637,-0.16357
638,-0.16657
639,-0.1688
640,-0.16205
641,-0.15305
642,-0.1463
643,-0.13954
644,-0.13126
645,-0.1245
646,-0.11774000000000001
647,-0.10872000000000001
648,-0.10196000000000001
649,-0.095192
650,-0.086881
651,-0.083079
652,-0.082946
653,-0.077569
654,-0.071479
655,-0.064688
656,-0.055634
657,-0.052485000000000004
658,-0.05454
659,-0.054985
660,-0.057003
661,-0.056728
662,-0.047636000000000005
663,-0.040812
664,-0.033991
665,-0.024891
666,-0.018065
667,-0.011890000000000001
668,-0.0027811999999999997
669,0.0040498
670,0.013163
671,0.019997
672,0.026835
673,0.027197000000000002
674,0.028210000000000002
675,0.030489999999999996
676,0.039619999999999995
677,0.046468
678,0.053318
679,0.062452999999999995
680,0.06930499999999999
681,0.076157
682,0.07969
683,0.081572
684,0.08842
685,0.097552
686,0.1044
687,0.11125
688,0.12100999999999999
689,0.12787
690,0.13472
691,0.14386
692,0.15072
693,0.15486
694,0.15902
695,0.1665
696,0.17335
697,0.18248
698,0.18934
699,0.19619
700,0.20533
701,0.2128
702,0.21966
703,0.2288
704,0.23565999999999998
705,0.24481
706,0.25061
707,0.25475
708,0.26285
709,0.2697
710,0.27656
711,0.2857
712,0.29318
713,0.30003
714,0.30918
715,0.31604
716,0.3229
717,0.32931
718,0.33346
719,0.34093
720,0.35007
721,0.35693
722,0.36379
723,0.37355
724,0.38040999999999997
725,0.38727
726,0.38973
727,0.39389
728,0.40074
729,0.40988
730,0.41673000000000004
731,0.42358999999999997
732,0.43273
733,0.43959
734,0.44643999999999995
735,0.45558999999999994
736,0.46245
737,0.46931999999999996
738,0.47847
739,0.48533000000000004
740,0.4922
741,0.50135
742,0.50883
743,0.51798
744,0.52485
745,0.53172
746,0.53919
747,0.5433
748,0.5451199999999999
749,0.5542699999999999
750,0.56114
751,0.568
752,0.57776
753,0.58463
754,0.5915
755,0.59897
756,0.6030800000000001
757,0.6072
758,0.61635
759,0.62321
760,0.63007
761,0.63923
762,0.6460899999999999
763,0.65296
764,0.6621199999999999
765,0.66899
766,0.67586
767,0.68502
768,0.6919
769,0.69877
770,0.7079300000000001
771,0.7148100000000001
772,0.7216899999999999
773,0.7308600000000001
774,0.73833
775,0.74521
776,0.75438
777,0.76126
778,0.7704300000000001
779,0.77732
780,0.7842
781,0.78825
782,0.7923100000000001
783,0.7974899999999999
784,0.80666
785,0.8135399999999999
786,0.82042
787,0.8295899999999999
788,0.83647
789,0.84395
790,0.8531200000000001
791,0.86
792,0.8668899999999999
793,0.8760700000000001
794,0.88295
795,0.887
796,0.89164
797,0.89623
798,0.9031100000000001
799,0.9128700000000001
800,0.91975
801,0.92663
802,0.93581
803,0.9426899999999999
804,0.94958
805,0.9587600000000001
806,0.9650700000000001
807,0.97195
808,0.98114
809,0.98229
810,0.98057
811,0.98287
812,0.98287
813,0.9851700000000001
814,0.9920700000000001
815,0.9943700000000001
816,0.9943700000000001
817,0.9943700000000001
818,0.9978
819,1.0018
820,1.0087
821,1.0156
822,1.0254
823,1.0323
824,1.0391
825,1.0483
826,1.0529
827,1.0552
828,1.0598
829,1.0667
830,1.0736
831,1.0771
832,1.0799
833,1.0851
834,1.0949
835,1.1023
836,1.1092
837,1.1138
838,1.1138
839,1.1213
840,1.1305
841,1.1374
842,1.1443
843,1.1535
844,1.1604
845,1.1673
846,1.1765
847,1.1834
848,1.1903
849,1.2
850,1.2069
851,1.2161
852,1.2231
853,1.23
854,1.2392
855,1.2415
856,1.2438
857,1.2507
858,1.2576
859,1.2645
860,1.2668
861,1.2691
862,1.276
863,1.2852
864,1.2916
865,1.2985
866,1.2992
867,1.2999
868,1.3063
869,1.3155
870,1.3219
871,1.3219
872,1.3203
873,1.3187
874,1.3172
875,1.3151
876,1.3136
877,1.3131
878,1.3103
879,1.3074
880,1.3036
881,1.2975
882,1.29
883,1.2844
884,1.2824
885,1.275
886,1.2653
887,1.2615
888,1.2577
889,1.2503
890,1.2433
891,1.2364
892,1.2271
893,1.2201
894,1.2127
895,1.2034
896,1.1965
897,1.1895
898,1.1839
899,1.1801
900,1.1769
901,1.1676
902,1.1606
903,1.1532
904,1.1439
905,1.1402
906,1.1387
907,1.1313
908,1.1243
909,1.1174
910,1.1081
911,1.1011
912,1.0937
913,1.0844
914,1.0775
915,1.0705
916,1.0644
917,1.0607
918,1.0533
919,1.044
920,1.037
921,1.0296
922,1.024
923,1.0217
924,1.0124
925,1.0055
926,0.99849
927,0.98921
928,0.9845799999999999
929,0.98225
930,0.9817799999999999
931,0.97946
932,0.97946
933,0.97482
934,0.96786
935,0.96786
936,0.96786
937,0.96555
938,0.9641200000000001
939,0.9566899999999999
940,0.9497200000000001
941,0.9427700000000001
942,0.93301
943,0.92605
944,0.9191
945,0.9098200000000001
946,0.9088700000000001
947,0.9051299999999999
948,0.89955
949,0.89259
950,0.8856200000000001
951,0.87634
952,0.8693799999999999
953,0.86195
954,0.85267
955,0.8457100000000001
956,0.83875
957,0.83131
958,0.82758
959,0.82385
960,0.81689
961,0.80993
962,0.80064
963,0.79368
964,0.78625
965,0.77696
966,0.77
967,0.7630399999999999
968,0.75376
969,0.75235
970,0.74863
971,0.73888
972,0.7319100000000001
973,0.72448
974,0.71519
975,0.71148
976,0.70778
977,0.70036
978,0.69338
979,0.68596
980,0.67667
981,0.67156
982,0.66787
983,0.66187
984,0.6549
985,0.6479199999999999
986,0.63863
987,0.63166
988,0.62468
989,0.61539
990,0.6079600000000001
991,0.6009899999999999
992,0.5917
993,0.58473
994,0.57544
995,0.57544
996,0.57311
997,0.5656800000000001
998,0.5582600000000001
999,0.55083
1000,0.5476
1001,0.5425
1002,0.5350699999999999
1003,0.53274
1004,0.53274
1005,0.52764
1006,0.51835
1007,0.5128
1008,0.51145
1009,0.50359
1010,0.49617
1011,0.48918999999999996
1012,0.47988000000000003
1013,0.47523000000000004
1014,0.47158
1015,0.46793
1016,0.46052
1017,0.45353999999999994
1018,0.44423
1019,0.43681000000000003
1020,0.42983000000000005
1021,0.42052
1022,0.41498999999999997
1023,0.41136000000000006
1024,0.40584000000000003
1025,0.39886
1026,0.39187
1027,0.38256
1028,0.37558
1029,0.3686
1030,0.35929
1031,0.35186999999999996
1032,0.34256
1033,0.33557
1034,0.32859
1035,0.31929
1036,0.31609
1037,0.31479
1038,0.30927
1039,0.30228
1040,0.2953
1041,0.28598
1042,0.27899999999999997
1043,0.27202
1044,0.26271
1045,0.25572
1046,0.24874000000000002
1047,0.239
1048,0.23201999999999998
1049,0.22503
1050,0.22184
1051,0.21950999999999998
1052,0.21485
1053,0.20511
1054,0.19769
1055,0.19027
1056,0.18053
1057,0.17777
1058,0.17544
1059,0.16846
1060,0.1638
1061,0.16147
1062,0.15682000000000001
1063,0.14984
1064,0.14285
1065,0.13310999999999998
1066,0.12613
1067,0.12207
1068,0.11845
1069,0.11147
1070,0.10215
1071,0.095163
1072,0.087747
1073,0.078435
1074,0.071448
1075,0.071019
1076,0.069319
1077,0.068064
1078,0.066826
1079,0.06519900000000001
1080,0.064001
1081,0.062817
1082,0.067098
1083,0.074104
1084,0.072949
1085,0.073771
1086,0.08078400000000001
1087,0.087799
1088,0.09677999999999999
1089,0.1038
1090,0.10811
1091,0.10665
1092,0.10558
1093,0.10687
1094,0.10784
1095,0.11487
1096,0.1219
1097,0.13094
1098,0.13796
1099,0.13931
1100,0.1427
1101,0.14974
1102,0.15582000000000001
1103,0.15724000000000002
1104,0.15662
1105,0.16571
1106,0.17245
1107,0.17156
1108,0.17538
1109,0.18244000000000002
1110,0.18949000000000002
1111,0.19889
1112,0.20594
1113,0.21299
1114,0.22239
1115,0.22916
1116,0.23621
1117,0.24561999999999998
1118,0.25267
1119,0.26000999999999996
1120,0.26941
1121,0.27646
1122,0.28352
1123,0.29265
1124,0.2997
1125,0.30703
1126,0.31644
1127,0.32322
1128,0.33027
1129,0.33968000000000004
1130,0.34674
1131,0.35379
1132,0.3632
1133,0.37026
1134,0.37732
1135,0.38673
1136,0.39378
1137,0.39614
1138,0.39849
1139,0.40528000000000003
1140,0.40972
1141,0.41181
1142,0.41626
1143,0.42541999999999996
1144,0.43222
1145,0.43196999999999997
1146,0.43432
1147,0.44138999999999995
1148,0.44845
1149,0.45787
1150,0.46493
1151,0.47198999999999997
1152,0.48141000000000006
1153,0.48848
1154,0.49554
1155,0.5049600000000001
1156,0.51202
1157,0.5190899999999999
1158,0.52454
1159,0.5253
1160,0.53027
1161,0.53968
1162,0.54675
1163,0.55381
1164,0.5632199999999999
1165,0.57028
1166,0.57735
1167,0.5867600000000001
1168,0.59383
1169,0.6008899999999999
1170,0.61031
1171,0.61737
1172,0.62443
1173,0.63385
1174,0.63856
1175,0.63993
1176,0.64157
1177,0.64863
1178,0.6580600000000001
1179,0.66513
1180,0.67219
1181,0.68162
1182,0.6886800000000001
1183,0.69575
1184,0.70518
1185,0.71225
1186,0.71932
1187,0.7287399999999999
1188,0.7358100000000001
1189,0.74288
1190,0.75231
1191,0.75938
1192,0.76644
1193,0.77587
1194,0.78271
1195,0.78979
1196,0.7992100000000001
1197,0.80628
1198,0.81335
1199,0.82278
1200,0.82705
1201,0.82639
1202,0.83068
1203,0.83775
1204,0.84483
1205,0.85426
1206,0.86113
1207,0.8682
1208,0.8776299999999999
1209,0.88471
1210,0.89179
1211,0.90122
1212,0.9083
1213,0.9177299999999999
1214,0.92481
1215,0.9318799999999999
1216,0.94132
1217,0.94839
1218,0.95547
1219,0.9593799999999999
1220,0.9587899999999999
1221,0.9658700000000001
1222,0.97531
1223,0.98239
1224,0.9894700000000001
1225,0.9989100000000001
1226,1.006
1227,1.0131
1228,1.0225
1229,1.0296
1230,1.0367
1231,1.0461
1232,1.0532
1233,1.0603
1234,1.0697
1235,1.0768
1236,1.0839
1237,1.0931
1238,1.1002
1239,1.1073
1240,1.1167
1241,1.1238
1242,1.1309
1243,1.1403
1244,1.1451
1245,1.1474
1246,1.1521
1247,1.1592
1248,1.1687
1249,1.1756
1250,1.1777
1251,1.1799
1252,1.1868
1253,1.1939
1254,1.2035
1255,1.2108
1256,1.2181
1257,1.2229999999999999
1258,1.2229999999999999
1259,1.2299
1260,1.2344
1261,1.2366
1262,1.2411
1263,1.2504
1264,1.2573
1265,1.2571
1266,1.2595
1267,1.2666
1268,1.2737
1269,1.2831
1270,1.2902
1271,1.2973
1272,1.3067
1273,1.3138
1274,1.3209
1275,1.3304
1276,1.3373
1277,1.3444
1278,1.3538
1279,1.3609
1280,1.368
1281,1.3774
1282,1.3845
1283,1.3891
1284,1.3914
1285,1.3938
1286,1.4031
1287,1.41
1288,1.4169999999999998
1289,1.4215
1290,1.4237
1291,1.4283
1292,1.4378
1293,1.4448
1294,1.4472
1295,1.4519
1296,1.459
1297,1.4661
1298,1.4754
1299,1.4824
1300,1.4819
1301,1.4837
1302,1.4833
1303,1.4829
1304,1.4875
1305,1.4874
1306,1.4871
1307,1.4866
1308,1.4863
1309,1.4859
1310,1.4855
1311,1.4854
1312,1.4829
1313,1.4779
1314,1.4776
1315,1.4727
1316,1.4632
1317,1.4605
1318,1.4579
1319,1.4507
1320,1.4436
1321,1.4341
1322,1.4269999999999998
1323,1.4199
1324,1.4105
1325,1.4034
1326,1.3962
1327,1.3867
1328,1.3796
1329,1.3725
1330,1.3631
1331,1.3559999999999999
1332,1.3489
1333,1.3394
1334,1.3323
1335,1.3275
1336,1.3248
1337,1.3223
1338,1.3152
1339,1.3057
1340,1.2986
1341,1.2915
1342,1.2819999999999998
1343,1.2748
1344,1.2677
1345,1.2583
1346,1.2512
1347,1.2512
1348,1.2465
1349,1.2393
1350,1.2321
1351,1.2272
1352,1.2248
1353,1.22
1354,1.2129
1355,1.2105
1356,1.2105
1357,1.2035
1358,1.1964
1359,1.1871
1360,1.18
1361,1.1729
1362,1.1704
1363,1.168
1364,1.1608
1365,1.1513
1366,1.1442
1367,1.1371
1368,1.1371
1369,1.1348
1370,1.1276
1371,1.1181
1372,1.111
1373,1.1039
1374,1.0945
1375,1.0874
1376,1.0803
1377,1.0708
1378,1.0637
1379,1.0566
1380,1.0471
1381,1.04
1382,1.0329
1383,1.0235
1384,1.0164
1385,1.0093
1386,0.9998
1387,0.9927
1388,0.9856
1389,0.9761299999999999
1390,0.96903
1391,0.95957
1392,0.95247
1393,0.94537
1394,0.9358299999999999
1395,0.9287299999999999
1396,0.92163
1397,0.9121600000000001
1398,0.9097200000000001
1399,0.90714
1400,0.9045799999999999
1401,0.8974799999999999
1402,0.89038
1403,0.8809100000000001
1404,0.8738100000000001
1405,0.8667100000000001
1406,0.85724
1407,0.85008
1408,0.8429700000000001
1409,0.8335100000000001
1410,0.8264100000000001
1411,0.81931
1412,0.80984
1413,0.80274
1414,0.79557
1415,0.79308
1416,0.79072
1417,0.78362
1418,0.77415
1419,0.76705
1420,0.75995
1421,0.75285
1422,0.75048
1423,0.74811
1424,0.73864
1425,0.73154
1426,0.72444
1427,0.71497
1428,0.70787
1429,0.70077
1430,0.69835
1431,0.69817
1432,0.6887
1433,0.6816
1434,0.6745
1435,0.66503
1436,0.65793
1437,0.65078
1438,0.64131
1439,0.63421
1440,0.6271
1441,0.61764
1442,0.61053
1443,0.6058
1444,0.60343
1445,0.5987
1446,0.5916
1447,0.58213
1448,0.58213
1449,0.57976
1450,0.5726600000000001
1451,0.5655600000000001
1452,0.5584600000000001
1453,0.54899
1454,0.54189
1455,0.53479
1456,0.5253800000000001
1457,0.51828
1458,0.51117
1459,0.50171
1460,0.4946
1461,0.4875
1462,0.47803999999999996
1463,0.47093
1464,0.46147
1465,0.45437
1466,0.44963000000000003
1467,0.44963000000000003
1468,0.44726000000000005
1469,0.44022
1470,0.43555
1471,0.43325
1472,0.43095
1473,0.42155
1474,0.41444
1475,0.41208
1476,0.40965
1477,0.40248
1478,0.39531
1479,0.38578
1480,0.37868
1481,0.37638
1482,0.37644
1483,0.36941
1484,0.36230999999999997
1485,0.35284
1486,0.34574
1487,0.33864
1488,0.33391
1489,0.33405
1490,0.32702
1491,0.31755
1492,0.31045
1493,0.30335
1494,0.29389
1495,0.28679
1496,0.27969
1497,0.27021999999999996
1498,0.26311999999999997
1499,0.25366
1500,0.24656
1501,0.23945999999999998
1502,0.22999
1503,0.22762
1504,0.22526
1505,0.22038000000000002
1506,0.2132
1507,0.20603000000000002
1508,0.2036
1509,0.20115999999999998
1510,0.19637000000000002
1511,0.18927
1512,0.18927
1513,0.18447
1514,0.175
1515,0.17021
1516,0.16767
1517,0.16514
1518,0.15804
1519,0.15094000000000002
1520,0.14142000000000002
1521,0.13432
1522,0.13180999999999998
1523,0.12929000000000002
1524,0.12219000000000001
1525,0.11508
1526,0.10558
1527,0.098476
1528,0.093707
1529,0.093593
1530,0.093529
1531,0.09348200000000001
1532,0.093444
1533,0.093435
1534,0.093444
1535,0.09348200000000001
1536,0.093529
1537,0.10065
1538,0.10775
1539,0.11485999999999999
1540,0.12435
1541,0.12916
1542,0.13162000000000001
1543,0.13879
1544,0.1459
1545,0.14837999999999998
1546,0.15094000000000002
1547,0.15109
1548,0.15127000000000002
1549,0.15613
1550,0.16323
1551,0.1704
1552,0.17986
1553,0.18703
1554,0.18961
1555,0.19457
1556,0.20167000000000002
1557,0.20876999999999998
1558,0.21831
1559,0.22541
1560,0.23251
1561,0.24198000000000003
1562,0.24450999999999998
1563,0.24713000000000002
1564,0.25204
1565,0.25914
1566,0.26624000000000003
1567,0.27579000000000004
1568,0.28289000000000003
1569,0.28999
1570,0.29954000000000003
1571,0.3021
1572,0.30487
1573,0.31196999999999997
1574,0.31906
1575,0.32852
1576,0.33571999999999996
1577,0.34281999999999996
1578,0.35228000000000004
1579,0.35938000000000003
1580,0.36648000000000003
1581,0.37594
1582,0.37851
1583,0.38121
1584,0.38616
1585,0.39326
1586,0.40035
1587,0.40981000000000006
1588,0.41691000000000006
1589,0.424
1590,0.43346
1591,0.44067
1592,0.44777
1593,0.45723
1594,0.46431999999999995
1595,0.47142
1596,0.47413
1597,0.47686000000000006
1598,0.48171
1599,0.49117
1600,0.49827
1601,0.50536
1602,0.5148199999999999
1603,0.52191
1604,0.52913
1605,0.53859
1606,0.54568
1607,0.55277
1608,0.56223
1609,0.5693199999999999
1610,0.5722
1611,0.5725899999999999
1612,0.5796899999999999
1613,0.58914
1614,0.59623
1615,0.60333
1616,0.61292
1617,0.6200100000000001
1618,0.6271
1619,0.63656
1620,0.64378
1621,0.64642
1622,0.64935
1623,0.6564399999999999
1624,0.66368
1625,0.67313
1626,0.6802199999999999
1627,0.68524
1628,0.68821
1629,0.69545
1630,0.7025399999999999
1631,0.71199
1632,0.71907
1633,0.72616
1634,0.73577
1635,0.7428600000000001
1636,0.74995
1637,0.7594
1638,0.76223
1639,0.76508
1640,0.7723300000000001
1641,0.77958
1642,0.78666
1643,0.79611
1644,0.8011699999999999
1645,0.8042100000000001
1646,0.80911
1647,0.81619
1648,0.82581
1649,0.8328899999999999
1650,0.83998
1651,0.84234
1652,0.84488
1653,0.85196
1654,0.8568600000000001
1655,0.8594
1656,0.86666
1657,0.8764700000000001
1658,0.8790100000000001
1659,0.8813700000000001
1660,0.88845
1661,0.89554
1662,0.9028
1663,0.9122399999999999
1664,0.9173399999999999
1665,0.9202600000000001
1666,0.9253600000000001
1667,0.9324399999999999
1668,0.93952
1669,0.94896
1670,0.95604
1671,0.9631200000000001
1672,0.9725600000000001
1673,0.9798399999999999
1674,0.9869100000000001
1675,0.99635
1676,1.0034
1677,1.0107
1678,1.016
1679,1.0166
1680,1.026
1681,1.0331
1682,1.0402
1683,1.0496
1684,1.0567
1685,1.064
1686,1.0734
1687,1.0805
1688,1.0876
1689,1.097
1690,1.1041
1691,1.1092
1692,1.1124
1693,1.1173
1694,1.1244
1695,1.1338
1696,1.1409
1697,1.1482
1698,1.1576
1699,1.1647
1700,1.1718
1701,1.1812
1702,1.1861
1703,1.1891
1704,1.1945
1705,1.2015
1706,1.2086
1707,1.218
1708,1.2253
1709,1.2324
1710,1.2418
1711,1.2446
1712,1.2476
1713,1.2551
1714,1.2622
1715,1.2693
1716,1.2787
1717,1.2858
1718,1.2952
1719,1.3023
1720,1.3096
1721,1.319
1722,1.3261
1723,1.3332
1724,1.3426
1725,1.3497
1726,1.3567
1727,1.3598
1728,1.3628
1729,1.3677
1730,1.3774
1731,1.3802
1732,1.3832
1733,1.3861
1734,1.3934
1735,1.4007
1736,1.4016
1737,1.4024
1738,1.4031
1739,1.4041
1740,1.4049
1741,1.4057
1742,1.4067
1743,1.4076
1744,1.4084
1745,1.4042
1746,1.3975
1747,1.393
1748,1.3918
1749,1.3901
1750,1.383
1751,1.3736
1752,1.3666
1753,1.3575
1754,1.3504
1755,1.3434
1756,1.334
1757,1.3269
1758,1.3199
1759,1.3175
1760,1.3152
1761,1.3081
1762,1.2987
1763,1.2964
1764,1.294
1765,1.2893
1766,1.2823
1767,1.2752
1768,1.2658
1769,1.2585
1770,1.2515
1771,1.2421
1772,1.2397
1773,1.2374
1774,1.2303
1775,1.2256
1776,1.2233
1777,1.2186
1778,1.2115
1779,1.2045
1780,1.1951
1781,1.188
1782,1.181
1783,1.1716
1784,1.1646
1785,1.1575
1786,1.1481
1787,1.1414
1788,1.1320000000000001
1789,1.125
1790,1.1179
1791,1.1085
1792,1.1015
1793,1.0945
1794,1.0851
1795,1.078
1796,1.0757
1797,1.0733
1798,1.0663
1799,1.0593
1800,1.0522
1801,1.0499
1802,1.0499
1803,1.0405
1804,1.0331
1805,1.0261
1806,1.0167
1807,1.0144
1808,1.012
1809,1.0090000000000001
1810,1.0017
1811,0.9966700000000001
1812,0.9940100000000001
1813,0.98665
1814,0.9793
1815,0.9746100000000001
1816,0.97226
1817,0.9652200000000001
1818,0.9564600000000001
1819,0.94942
1820,0.9423799999999999
1821,0.9329999999999999
1822,0.92596
1823,0.92361
1824,0.92255
1825,0.9155200000000001
1826,0.90614
1827,0.8991
1828,0.89207
1829,0.88269
1830,0.87565
1831,0.8686200000000001
1832,0.8636
1833,0.8602799999999999
1834,0.8549399999999999
1835,0.8455600000000001
1836,0.83852
1837,0.8314799999999999
1838,0.8221
1839,0.81506
1840,0.80803
1841,0.79865
1842,0.79161
1843,0.79227
1844,0.7912600000000001
1845,0.78691
1846,0.77988
1847,0.77051
1848,0.76348
1849,0.75645
1850,0.74708
1851,0.74005
1852,0.73302
1853,0.72365
1854,0.71662
1855,0.7095899999999999
1856,0.6998800000000001
1857,0.6945100000000001
1858,0.69114
1859,0.68377
1860,0.67674
1861,0.66737
1862,0.6603399999999999
1863,0.6533100000000001
1864,0.64394
1865,0.6369100000000001
1866,0.62954
1867,0.62017
1868,0.61314
1869,0.60611
1870,0.5967399999999999
1871,0.5897100000000001
1872,0.58268
1873,0.57697
1874,0.57663
1875,0.5696
1876,0.5602199999999999
1877,0.5532
1878,0.5461699999999999
1879,0.5368
1880,0.52977
1881,0.52708
1882,0.52474
1883,0.51771
1884,0.51068
1885,0.50132
1886,0.49428999999999995
1887,0.48726
1888,0.48258
1889,0.48189
1890,0.4772
1891,0.46783
1892,0.4608
1893,0.45343
1894,0.44406
1895,0.43703000000000003
1896,0.43001000000000006
1897,0.42063999999999996
1898,0.41361000000000003
1899,0.40893
1900,0.40659
1901,0.39955999999999997
1902,0.39488
1903,0.39254
1904,0.38985
1905,0.38013
1906,0.37276
1907,0.36538000000000004
1908,0.35601
1909,0.35133000000000003
1910,0.34899
1911,0.34326
1912,0.33623000000000003
1913,0.32921
1914,0.31984
1915,0.31281
1916,0.30544
1917,0.29607
1918,0.28904
1919,0.28202
1920,0.27265
1921,0.26563000000000003
1922,0.2586
1923,0.25251999999999997
1924,0.25149
1925,0.24445999999999998
1926,0.23509000000000002
1927,0.22771999999999998
1928,0.22069
1929,0.21600999999999998
1930,0.21366
1931,0.20898000000000003
1932,0.20195
1933,0.19960999999999998
1934,0.19458
1935,0.1872
1936,0.17983
1937,0.16978
1938,0.16275
1939,0.15805999999999998
1940,0.15572
1941,0.15036
1942,0.14299
1943,0.13763
1944,0.13429000000000002
1945,0.12895
1946,0.11957000000000001
1947,0.11254000000000002
1948,0.1055
1949,0.09612000000000001
1950,0.089085
1951,0.082051
1952,0.07234299999999999
1953,0.065308
1954,0.058276
1955,0.048897
1956,0.041865
1957,0.034832999999999996
1958,0.025457
1959,0.018424
1960,0.011392
1961,0.0020178
1962,-0.0050122
1963,-0.012041
1964,-0.021415
1965,-0.028444999999999998
1966,-0.035475
1967,-0.044844
1968,-0.051874
1969,-0.06124299999999999
1970,-0.068271
1971,-0.075298
1972,-0.08466699999999999
1973,-0.091693
1974,-0.098718
1975,-0.10808
1976,-0.11475999999999999
1977,-0.12178
1978,-0.13114
1979,-0.13817000000000002
1980,-0.14519
1981,-0.15455
1982,-0.15887
1983,-0.15778
1984,-0.16134
1985,-0.16835
1986,-0.17537
1987,-0.18472
1988,-0.19172999999999998
1989,-0.19835999999999998
1990,-0.20770999999999998
1991,-0.21472
1992,-0.22171999999999997
1993,-0.23068000000000002
1994,-0.23184000000000002
1995,-0.23298000000000002
1996,-0.23998000000000003
1997,-0.24698
1998,-0.25398000000000004
1999,-0.26331
2000,-0.2699
2001,-0.2769
2002,-0.28622
2003,-0.29322
2004,-0.30021
2005,-0.30129
2006,-0.30235
2007,-0.30062
2008,-0.2993
2009,-0.30074
2010,-0.30959000000000003
2011,-0.31379
2012,-0.31474
2013,-0.31799
2014,-0.32449
2015,-0.32865
2016,-0.32905999999999996
2017,-0.3304
2018,-0.33736
2019,-0.34613
2020,-0.35308
2021,-0.36002
2022,-0.36265
2023,-0.36344
2024,-0.37037
2025,-0.37627
2026,-0.37471
2027,-0.37312
2028,-0.37328
2029,-0.37396
2030,-0.37571
2031,-0.38492
2032,-0.39127
2033,-0.39818000000000003
2034,-0.40396
2035,-0.40456
2036,-0.40571
2037,-0.41431999999999997
2038,-0.41773999999999994
2039,-0.41827
2040,-0.42396000000000006
2041,-0.43023
2042,-0.43299
2043,-0.43116000000000004
2044,-0.43511000000000005
2045,-0.44425
2046,-0.45048
2047,-0.45733
2048,-0.46292
2049,-0.46329
2050,-0.46656000000000003
2051,-0.47567
2052,-0.48185
2053,-0.48868
2054,-0.49485
2055,-0.49287
2056,-0.49541
2057,-0.49473
2058,-0.49338000000000004
2059,-0.49133000000000004
2060,-0.48857
2061,-0.48648
2062,-0.48578000000000005
2063,-0.48508
2064,-0.48211000000000004
2065,-0.47998
2066,-0.47712
2067,-0.47268999999999994
2068,-0.4705
2069,-0.46076000000000006
2070,-0.45401
2071,-0.44725
2072,-0.43823999999999996
2073,-0.43075
2074,-0.42399
2075,-0.41497
2076,-0.4082
2077,-0.39918000000000003
2078,-0.3924
2079,-0.38563000000000003
2080,-0.37969
2081,-0.37528
2082,-0.37158
2083,-0.36256
2084,-0.35579
2085,-0.34902
2086,-0.33928
2087,-0.33251
2088,-0.32574000000000003
2089,-0.31682
2090,-0.31466
2091,-0.30943000000000004
2092,-0.30041
2093,-0.29364
2094,-0.28686999999999996
2095,-0.27785
2096,-0.27036
2097,-0.26359
2098,-0.25456
2099,-0.24778000000000003
2100,-0.24100000000000002
2101,-0.23196
2102,-0.22376999999999997
2103,-0.21938000000000002
2104,-0.21344000000000002
2105,-0.20667
2106,-0.19989
2107,-0.19086
2108,-0.18408
2109,-0.1773
2110,-0.16826
2111,-0.16147
2112,-0.15469000000000002
2113,-0.14494
2114,-0.13815
2115,-0.1291
2116,-0.12230999999999999
2117,-0.11550999999999999
2118,-0.10645999999999999
2119,-0.09966
2120,-0.092173
2121,-0.087144
2122,-0.083491
2123,-0.07670199999999999
2124,-0.067648
2125,-0.06085499999999999
2126,-0.054062
2127,-0.045001
2128,-0.038202999999999994
2129,-0.031405
2130,-0.022336
2131,-0.015534000000000001
2132,-0.0087292
2133,0.0003438
2134,0.0071518
2135,0.013959000000000001
2136,0.023714
2137,0.030524000000000003
2138,0.037336
2139,0.046421
2140,0.053235000000000005
2141,0.059114
2142,0.064075
2143,0.069288
2144,0.076098
2145,0.085176
2146,0.091988
2147,0.0988
2148,0.10855
2149,0.11537
2150,0.12445
2151,0.13127
2152,0.13715
2153,0.1421
2154,0.14731
2155,0.15412
2156,0.16321
2157,0.17002
2158,0.1775
2159,0.18659
2160,0.1934
2161,0.19701
2162,0.20197
2163,0.20718000000000003
2164,0.21399
2165,0.22374000000000002
2166,0.23055
2167,0.23509000000000002
2168,0.24006
2169,0.24664
2170,0.25411999999999996
2171,0.2616
2172,0.26592
2173,0.26799
2174,0.27774
2175,0.28453
2176,0.28661
2177,0.29166
2178,0.29914
2179,0.30593000000000004
2180,0.31326
2181,0.31538
2182,0.32215
2183,0.33119
2184,0.33868000000000004
2185,0.34546
2186,0.35139000000000004
2187,0.35578000000000004
2188,0.36171
2189,0.3692
2190,0.37443000000000004
2191,0.3773
2192,0.38172
2193,0.38389
2194,0.38906999999999997
2195,0.39655999999999997
2196,0.40405
2197,0.40924
2198,0.41147
2199,0.41371
2200,0.41896000000000005
2201,0.42645
2202,0.43393999999999994
2203,0.43921000000000004
2204,0.44297
2205,0.45046
2206,0.45795
2207,0.46024
2208,0.46255
2209,0.46565
2210,0.46798999999999996
2211,0.47034
2212,0.4735
2213,0.47589
2214,0.47828000000000004
2215,0.4815
2216,0.48393
2217,0.48636999999999997
2218,0.48965
2219,0.49212
2220,0.49461000000000005
2221,0.49795
2222,0.50046
2223,0.49856999999999996
2224,0.49278
2225,0.49007
2226,0.49128999999999995
2227,0.48773999999999995
2228,0.48199
2229,0.48018999999999995
2230,0.48061000000000004
2231,0.47489
2232,0.46698
2233,0.46743999999999997
2234,0.47012
2235,0.46443
2236,0.45786000000000004
2237,0.45128
2238,0.44251999999999997
2239,0.43596
2240,0.42938999999999994
2241,0.42063999999999996
2242,0.41408
2243,0.40753
2244,0.39879000000000003
2245,0.39223
2246,0.38568
2247,0.37695
2248,0.37041
2249,0.36203
2250,0.35617
2251,0.35089000000000004
2252,0.34434000000000003
2253,0.33560999999999996
2254,0.32905999999999996
2255,0.32252
2256,0.31288
2257,0.30634
2258,0.29762
2259,0.29109
2260,0.28456
2261,0.27586
2262,0.26933
2263,0.26435
2264,0.26063000000000003
2265,0.2541
2266,0.24756
2267,0.23886
2268,0.23233
2269,0.22580999999999998
2270,0.21616999999999997
2271,0.20965
2272,0.20313
2273,0.19445
2274,0.19228
2275,0.19011
2276,0.18482
2277,0.17736
2278,0.17642
2279,0.17207
2280,0.16557
2281,0.15905999999999998
2282,0.15472
2283,0.15350999999999998
2284,0.15012999999999999
2285,0.14459
2286,0.14243
2287,0.14027
2288,0.13162000000000001
2289,0.12513
2290,0.11865
2291,0.11001
2292,0.10353
2293,0.097062
2294,0.088434
2295,0.08197
2296,0.073351
2297,0.066892
2298,0.060435
2299,0.051833000000000004
2300,0.045384
2301,0.038936
2302,0.033808
2303,0.028686
2304,0.021244
2305,0.01264
2306,0.0061898000000000005
2307,-0.0002572
2308,-0.0098442
2309,-0.016284
2310,-0.022725
2311,-0.031303
2312,-0.037734
2313,-0.041888999999999996
2314,-0.048041
2315,-0.053333000000000005
2316,-0.059771000000000005
2317,-0.068351
2318,-0.074785
2319,-0.082219
2320,-0.090788
2321,-0.097212
2322,-0.10363
2323,-0.11219000000000001
2324,-0.1185
2325,-0.12368
2326,-0.13212000000000002
2327,-0.13855
2328,-0.14495999999999998
2329,-0.15352000000000002
2330,-0.15993
2331,-0.16847
2332,-0.17487
2333,-0.1823
2334,-0.19083
2335,-0.19722
2336,-0.20360999999999999
2337,-0.21211999999999998
2338,-0.2185
2339,-0.22488000000000002
2340,-0.23338000000000003
2341,-0.23975
2342,-0.24611
2343,-0.25459
2344,-0.26200999999999997
2345,-0.26516999999999996
2346,-0.27044
2347,-0.27681
2348,-0.28317
2349,-0.29165
2350,-0.29801
2351,-0.30435999999999996
2352,-0.31283
2353,-0.31917
2354,-0.32550999999999997
2355,-0.33395
2356,-0.34028
2357,-0.34661
2358,-0.35503
2359,-0.36243000000000003
2360,-0.36875
2361,-0.37716
2362,-0.38345999999999997
2363,-0.38976
2364,-0.39816
2365,-0.40445
2366,-0.41283000000000003
2367,-0.41799
2368,-0.42538000000000004
2369,-0.43373999999999996
2370,-0.44
2371,-0.44626000000000005
2372,-0.4546
2373,-0.46085
2374,-0.46708999999999995
2375,-0.47541000000000005
2376,-0.48163999999999996
2377,-0.48786999999999997
2378,-0.49616000000000005
2379,-0.50238
2380,-0.50859
2381,-0.5168699999999999
2382,-0.5230600000000001
2383,-0.5292600000000001
2384,-0.53751
2385,-0.54369
2386,-0.54987
2387,-0.55632
2388,-0.56189
2389,-0.56421
2390,-0.5724600000000001
2391,-0.5786399999999999
2392,-0.58482
2393,-0.59304
2394,-0.60038
2395,-0.60654
2396,-0.61475
2397,-0.6209
2398,-0.6270399999999999
2399,-0.63522
2400,-0.64255
2401,-0.64783
2402,-0.65465
2403,-0.65993
2404,-0.66811
2405,-0.6754399999999999
2406,-0.68157
2407,-0.69009
2408,-0.69572
2409,-0.7022
2410,-0.71038
2411,-0.7177
2412,-0.72382
2413,-0.73114
2414,-0.73679
2415,-0.74038
2416,-0.74855
2417,-0.75588
2418,-0.762
2419,-0.77015
2420,-0.7758
2421,-0.78145
2422,-0.78673
2423,-0.79285
2424,-0.8001699999999999
2425,-0.8083199999999999
2426,-0.81443
2427,-0.81805
2428,-0.82695
2429,-0.83306
2430,-0.8403799999999999
2431,-0.8485299999999999
2432,-0.8546299999999999
2433,-0.8590899999999999
2434,-0.8659600000000001
2435,-0.87328
2436,-0.87939
2437,-0.88874
2438,-0.8948299999999999
2439,-0.90133
2440,-0.907
2441,-0.91145
2442,-0.92081
2443,-0.92609
2444,-0.93174
2445,-0.93739
2446,-0.9435100000000001
2447,-0.94963
2448,-0.9589799999999999
2449,-0.9650799999999999
2450,-0.96954
2451,-0.97641
2452,-0.98169
2453,-0.9878
2454,-0.99715
2455,-1.0033
2456,-1.0106
2457,-1.0174
2458,-1.0239
2459,-1.0313
2460,-1.0389
2461,-1.0446
2462,-1.0519
2463,-1.0601
2464,-1.0662
2465,-1.0735
2466,-1.0816
2467,-1.0877
2468,-1.0938
2469,-1.0987
2470,-1.1044
2471,-1.1105
2472,-1.1198
2473,-1.1259
2474,-1.1320000000000001
2475,-1.1385
2476,-1.1442
2477,-1.1507
2478,-1.158
2479,-1.1640000000000001
2480,-1.1721
2481,-1.1762
2482,-1.1819
2483,-1.1888
2484,-1.1949
2485,-1.2009999999999998
2486,-1.2103
2487,-1.2164
2488,-1.2217
2489,-1.2286
2490,-1.2331
2491,-1.2404
2492,-1.2477
2493,-1.2534
2494,-1.2591
2495,-1.2672
2496,-1.2733
2497,-1.2806
2498,-1.2887
2499,-1.2924
2500,-1.2981
2501,-1.3033
2502,-1.3106
2503,-1.3167
2504,-1.3248
2505,-1.3321
2506,-1.3378
2507,-1.3435
2508,-1.3508
2509,-1.3581
2510,-1.3651
2511,-1.3695
2512,-1.3789
2513,-1.3841
2514,-1.3898
2515,-1.3955
2516,-1.4016
2517,-1.4077
2518,-1.4169999999999998
2519,-1.4231
2520,-1.4288
2521,-1.4357
2522,-1.4418
2523,-1.4491
2524,-1.4548
2525,-1.4604
2526,-1.4657
2527,-1.4751
2528,-1.4795
2529,-1.4831
2530,-1.4896
2531,-1.4969
2532,-1.5043
2533,-1.5111
2534,-1.5175
2535,-1.5249
2536,-1.5313
2537,-1.5369
2538,-1.5434
2539,-1.5528
2540,-1.5572
2541,-1.5628
2542,-1.5692
2543,-1.5754
2544,-1.5828
2545,-1.591
2546,-1.5971
2547,-1.6018
2548,-1.6074
2549,-1.6136
2550,-1.6218
2551,-1.6292
2552,-1.6353
2553,-1.6418
2554,-1.6474
2555,-1.6518
2556,-1.66
2557,-1.6662
2558,-1.6723
2559,-1.6805
2560,-1.6866
2561,-1.6927
2562,-1.7009
2563,-1.7069999999999999
2564,-1.713
2565,-1.7211
2566,-1.7272
2567,-1.7345
2568,-1.7425
2569,-1.7485
2570,-1.7545
2571,-1.7625
2572,-1.7685
2573,-1.7744
2574,-1.7784
2575,-1.7804
2576,-1.7863
2577,-1.7903
2578,-1.7922
2579,-1.7981
2580,-1.806
2581,-1.8132
2582,-1.8191
2583,-1.8268
2584,-1.8327
2585,-1.8404
2586,-1.8437
2587,-1.8478
2588,-1.8544
2589,-1.8602
2590,-1.8659999999999999
2591,-1.8737
2592,-1.8809
2593,-1.8866
2594,-1.8943
2595,-1.9
2596,-1.9057
2597,-1.9132
2598,-1.9189
2599,-1.9245
2600,-1.932
2601,-1.9375
2602,-1.9431
2603,-1.9505
2604,-1.956
2605,-1.9615
2606,-1.9688
2607,-1.9742
2608,-1.9796
2609,-1.9852
2610,-1.9906
2611,-1.9959
2612,-2.0029
2613,-2.0082
2614,-2.0134
2615,-2.0204
2616,-2.0206
2617,-2.0223
2618,-2.0274
2619,-2.0325
2620,-2.0359
2621,-2.0392
2622,-2.0425
2623,-2.0424
2624,-2.044
2625,-2.0473
2626,-2.0522
2627,-2.0522
2628,-2.0538
2629,-2.0602
2630,-2.065
2631,-2.0697
2632,-2.076
2633,-2.0807
2634,-2.0853
2635,-2.0896
2636,-2.0941
2637,-2.0986
2638,-2.1045
2639,-2.1089
2640,-2.1132
2641,-2.119
2642,-2.1232
2643,-2.1294
2644,-2.1349
2645,-2.1371
2646,-2.1412
2647,-2.1485
2648,-2.1524
2649,-2.1563
2650,-2.1615
2651,-2.1653
2652,-2.169
2653,-2.1739
2654,-2.1776
2655,-2.1823
2656,-2.1858
2657,-2.1892
2658,-2.1917
2659,-2.1949
2660,-2.1982
2661,-2.2024
2662,-2.2055
2663,-2.2085
2664,-2.2125
2665,-2.2154
2666,-2.2182
2667,-2.2104
2668,-2.2047
2669,-2.2074
2670,-2.2108
2671,-2.2133
2672,-2.2157
2673,-2.2189
2674,-2.2211
2675,-2.2233
2676,-2.2262
2677,-2.2282
2678,-2.2302
2679,-2.2327
2680,-2.2344
2681,-2.2362
2682,-2.2383
2683,-2.2399
2684,-2.2413
2685,-2.2432
2686,-2.2445
2687,-2.2457
2688,-2.2472
2689,-2.2482
2690,-2.2491
2691,-2.2479
2692,-2.2487
2693,-2.2495
2694,-2.2501
2695,-2.2506
2696,-2.2511
2697,-2.2514
2698,-2.2516
2699,-2.247
2700,-2.2399
2701,-2.2376
2702,-2.2352
2703,-2.2352
2704,-2.2352
2705,-2.2352
2706,-2.2352
2707,-2.2352
2708,-2.2352
