time,value
0,-0.3969
1,-0.3969
2,-0.3969
3,-0.3969
4,-0.3969
5,-0.3969
6,-0.3969
7,-0.3969
8,-0.3969
9,-0.3969
10,-0.3969
11,-0.3969
12,-0.3969
13,-0.3969
14,-0.3969
15,-0.3969
16,-0.3969
17,-0.3969
18,-0.3969
19,-0.3969
20,-0.3969
21,-0.3969
22,-0.3969
23,-0.3969
24,-0.3969
25,-0.3969
26,-0.3969
27,-0.3969
28,-0.3969
29,-0.3969
30,-0.3969
31,-0.3969
32,-0.3969
33,-0.3969
34,-0.3969
35,-0.3969
36,-0.3969
37,-0.3969
38,-0.3969
39,-0.3969
40,-0.3969
41,-0.3969
42,-0.3969
43,-0.3969
44,-0.3969
45,-0.3969
46,-0.3969
47,-0.3969
48,-0.3969
49,-0.3969
50,-0.3969
51,0.56343
52,4.3483
53,3.4256
54,-0.3969
55,-0.3969
56,2.6065
57,1.3261
58,0.8553
59,1.5426
60,1.9757
61,1.5614
62,3.2279
63,1.778
64,-0.37806999999999996
65,-0.3969
66,-0.3969
67,-0.3969
68,-0.3969
69,-0.3969
70,2.0981
71,0.8458899999999999
72,1.7121
73,0.45987
74,3.4068
75,-0.3969
76,-0.3969
77,-0.3969
78,-0.3969
79,-0.3969
80,-0.3969
81,-0.3969
82,-0.3969
83,-0.3969
84,-0.3969
85,-0.3969
86,-0.3969
87,-0.3969
88,-0.3969
89,-0.3969
90,-0.3969
91,-0.3969
92,-0.3969
93,-0.3969
94,-0.3969
95,-0.3969
