time,value
0,-0.15696
1,-0.15696
2,-0.15696
3,-0.15696
4,-0.15696
5,-0.15696
6,-0.15696
7,-0.15696
8,-0.15696
9,-0.15696
10,-0.15696
11,-0.15696
12,-0.15696
13,-0.15696
14,-0.15696
15,-0.15696
16,-0.15696
17,-0.15696
18,-0.15696
19,-0.15696
20,-0.15696
21,-0.15696
22,-0.15696
23,-0.15696
24,-0.15696
25,-0.15696
26,-0.15696
27,-0.15696
28,-0.15696
29,-0.15696
30,-0.15696
31,-0.15696
32,-0.15696
33,-0.15696
34,-0.15696
35,-0.15696
36,-0.15696
37,-0.15696
38,-0.15696
39,-0.15696
40,-0.15696
41,-0.15696
42,-0.15696
43,-0.15696
44,-0.15696
45,-0.15696
46,-0.15696
47,-0.15696
48,-0.15696
49,-0.15696
50,-0.15696
51,-0.15696
52,-0.15696
53,-0.15696
54,-0.15696
55,-0.15696
56,-0.15696
57,-0.15696
58,-0.15696
59,-0.15696
60,-0.15696
61,-0.15696
62,-0.15696
63,-0.15696
64,-0.15696
65,-0.15696
66,-0.15696
67,-0.15696
68,-0.15696
69,-0.018142
70,6.4434
71,0.6885899999999999
72,0.044959
73,7.1249
74,-0.15696
75,-0.15696
76,-0.15696
77,-0.15696
78,-0.15696
79,-0.15696
80,-0.15696
81,-0.15696
82,-0.15696
83,-0.15696
84,-0.15696
85,-0.15696
86,-0.15696
87,-0.15696
88,-0.15696
89,-0.15696
90,-0.15696
91,-0.15696
92,-0.15696
93,-0.15696
94,-0.15696
95,-0.15696
