time,value
0,-0.20571
1,-0.20571
2,-0.20571
3,-0.20571
4,-0.20571
5,-0.20571
6,-0.20571
7,-0.20571
8,-0.20571
9,-0.20571
10,-0.20571
11,-0.20571
12,-0.20571
13,-0.20571
14,-0.20571
15,-0.20571
16,-0.20571
17,-0.20571
18,-0.20571
19,-0.20571
20,-0.20571
21,-0.20571
22,-0.20571
23,-0.20571
24,-0.20571
25,-0.20571
26,-0.20571
27,-0.20571
28,-0.20571
29,-0.20571
30,-0.20571
31,-0.20571
32,-0.20571
33,-0.20571
34,-0.20571
35,-0.20571
36,-0.20571
37,-0.20571
38,-0.20571
39,-0.20571
40,-0.20571
41,-0.20571
42,-0.20571
43,-0.20571
44,-0.20571
45,-0.20571
46,-0.20571
47,-0.20571
48,-0.20571
49,-0.20571
50,-0.20571
51,-0.20571
52,-0.20571
53,-0.20571
54,-0.20571
55,0.9349
56,3.7997
57,-0.20571
58,-0.20571
59,-0.20571
60,-0.20571
61,-0.20571
62,-0.20571
63,-0.20571
64,-0.20571
65,-0.20571
66,-0.20571
67,-0.20571
68,-0.20571
69,-0.20571
70,-0.20571
71,-0.20571
72,1.5848
73,5.5239
74,6.5451
75,0.12586
76,-0.20571
77,-0.20571
78,-0.20571
79,-0.20571
80,-0.20571
81,-0.20571
82,-0.20571
83,-0.20571
84,-0.20571
85,-0.20571
86,-0.20571
87,-0.20571
88,-0.20571
89,-0.20571
90,-0.20571
91,-0.20571
92,-0.20571
93,-0.20571
94,-0.20571
95,-0.20571
