{
  "about": {
    "problemID": "LL1_TXT_CLS_apple_products_sentiment_problem",
    "problemName": "Apple Computers Twitter sentiment analysis problem",
    "problemDescription": "A look into the sentiment around Apple, based on tweets containing #AAPL, @apple, etc. Contributors were given a tweet and asked whether the user was positive, negative, or neutral about Apple.",
    "problemSchemaVersion": "4.0.0",
    "problemVersion": "4.0.0",
    "taskKeywords": [
      "classification",
      "multiClass",
      "text"
    ]
  },
  "inputs": {
    "data": [
      {
        "datasetID": "LL1_TXT_CLS_apple_products_sentiment_dataset",
        "targets": [
          {
            "targetIndex": 0,
            "resID": "learningData",
            "colIndex": 2,
            "colName": "sentiment"
          }
        ]
      }
    ],
    "dataSplits": {
      "splitsFile": "dataSplits.csv",
      "splitScript": "splitScript.py",
      "datasetViewMaps": {
        "train": [
          {
            "from": "LL1_TXT_CLS_apple_products_sentiment_dataset",
            "to": "LL1_TXT_CLS_apple_products_sentiment_dataset_TRAIN"
          }
        ],
        "test": [
          {
            "from": "LL1_TXT_CLS_apple_products_sentiment_dataset",
            "to": "LL1_TXT_CLS_apple_products_sentiment_dataset_TEST"
          }
        ],
        "score": [
          {
            "from": "LL1_TXT_CLS_apple_products_sentiment_dataset",
            "to": "LL1_TXT_CLS_apple_products_sentiment_dataset_SCORE"
          }
        ]
      }
    },
    "performanceMetrics": [
      {
        "metric": "accuracy"
      }
    ]
  },
  "expectedOutputs": {
    "predictionsFile": "predictions.csv"
  }
}