time,value
0,-0.51667
1,-0.51667
2,-0.51667
3,-0.51667
4,-0.51667
5,-0.51667
6,-0.51667
7,-0.51667
8,-0.51667
9,-0.51667
10,-0.51667
11,-0.51667
12,-0.51667
13,-0.51667
14,-0.51667
15,-0.51667
16,-0.51667
17,-0.51667
18,-0.51667
19,-0.51667
20,-0.51667
21,-0.51667
22,-0.51667
23,-0.51667
24,-0.51667
25,-0.51667
26,-0.51667
27,-0.51667
28,-0.51667
29,-0.51667
30,-0.51667
31,-0.51667
32,-0.51667
33,-0.51667
34,-0.51667
35,-0.51667
36,0.1536
37,3.1698
38,1.159
39,-0.51667
40,2.8347
41,1.159
42,-0.51667
43,1.4941
44,0.1536
45,1.4941
46,5.1806
47,3.1698
48,1.159
49,0.48873999999999995
50,0.8238700000000001
51,-0.51667
52,0.1536
53,0.1536
54,1.159
55,2.1644
56,1.159
57,1.159
58,0.8238700000000001
59,0.48873999999999995
60,0.1536
61,0.48873999999999995
62,1.159
63,0.48873999999999995
64,0.8238700000000001
65,0.8238700000000001
66,0.1536
67,0.1536
68,-0.51667
69,0.1536
70,-0.51667
71,-0.51667
72,-0.51667
73,-0.51667
74,-0.51667
75,-0.51667
76,-0.51667
77,-0.51667
78,-0.51667
79,-0.51667
80,-0.51667
81,-0.51667
82,-0.51667
83,-0.51667
84,-0.51667
85,-0.51667
86,-0.51667
87,-0.51667
88,-0.51667
89,-0.51667
90,-0.51667
91,-0.51667
92,-0.51667
93,-0.51667
94,-0.51667
95,-0.51667
