time,value
0,0.5100100000000001
1,1.2921
2,1.1357
3,0.97929
4,0.97929
5,0.97929
6,0.97929
7,0.97929
8,0.97929
9,0.97929
10,0.97929
11,0.82286
12,0.35359
13,-1.0542
14,-1.0542
15,-1.0542
16,-1.0542
17,-1.0542
18,-1.0542
19,0.6664399999999999
20,1.2921
21,0.97929
22,0.97929
23,0.97929
24,-0.74139
25,-1.0542
26,-1.0542
27,-1.0542
28,-1.0542
29,-1.0542
30,0.35359
31,1.2921
32,0.97929
33,0.97929
34,0.97929
35,-0.58496
36,-1.0542
37,-1.0542
38,-1.0542
39,-1.0542
40,-1.0542
41,-1.0542
42,1.1357
43,1.1357
44,0.97929
45,-0.58496
46,-1.0542
47,-1.0542
48,-1.0542
49,-1.0542
50,-1.0542
51,-0.58496
52,1.4486
53,1.1357
54,0.97929
55,-0.11569000000000002
56,-1.0542
57,-1.0542
58,-1.0542
59,-1.0542
60,0.19716
61,1.2921
62,0.97929
63,0.97929
64,-0.42854
65,-1.0542
66,-1.0542
67,-1.0542
68,-1.0542
69,-0.58496
70,1.4486
71,1.1357
72,0.97929
73,0.97929
74,0.97929
75,0.97929
76,0.97929
77,0.97929
78,0.97929
79,-0.27211
80,-1.0542
81,-1.0542
82,-1.0542
83,-1.0542
84,-1.0542
85,0.19716
86,1.4486
87,0.97929
88,0.97929
89,0.19716
90,-1.0542
91,-1.0542
92,-1.0542
93,-1.0542
94,-1.0542
95,1.1357
