time,value
0,-0.6291899999999999
1,-0.6291899999999999
2,-0.6291899999999999
3,-0.6291899999999999
4,-0.6291899999999999
5,-0.6291899999999999
6,-0.6291899999999999
7,-0.6291899999999999
8,-0.6291899999999999
9,-0.6291899999999999
10,-0.6291899999999999
11,-0.6291899999999999
12,-0.6291899999999999
13,-0.6291899999999999
14,-0.6291899999999999
15,-0.6291899999999999
16,-0.6291899999999999
17,-0.6291899999999999
18,-0.6291899999999999
19,-0.6291899999999999
20,-0.6291899999999999
21,-0.6291899999999999
22,-0.6291899999999999
23,-0.6291899999999999
24,-0.6291899999999999
25,-0.6291899999999999
26,-0.6291899999999999
27,-0.6291899999999999
28,-0.6291899999999999
29,-0.6291899999999999
30,-0.6291899999999999
31,-0.6291899999999999
32,0.034571
33,2.9108
34,3.1321
35,2.6896
36,1.3621
37,0.47707
38,1.5833
39,1.8046
40,0.47707
41,0.91958
42,1.3621
43,0.47707
44,2.4683
45,2.9108
46,2.0258
47,0.47707
48,1.8046
49,0.69833
50,1.3621
51,1.3621
52,0.69833
53,0.69833
54,1.1408
55,-0.18667999999999998
56,0.47707
57,0.25582
58,0.47707
59,0.034571
60,-0.18667999999999998
61,2.2471
62,0.69833
63,0.034571
64,0.034571
65,0.47707
66,0.25582
67,-0.6291899999999999
68,-0.18667999999999998
69,-0.6291899999999999
70,-0.18667999999999998
71,-0.6291899999999999
72,-0.6291899999999999
73,-0.6291899999999999
74,-0.6291899999999999
75,-0.6291899999999999
76,-0.6291899999999999
77,-0.6291899999999999
78,-0.6291899999999999
79,-0.6291899999999999
80,-0.6291899999999999
81,-0.6291899999999999
82,-0.6291899999999999
83,-0.6291899999999999
84,-0.6291899999999999
85,-0.6291899999999999
86,-0.6291899999999999
87,-0.6291899999999999
88,-0.6291899999999999
89,-0.6291899999999999
90,-0.6291899999999999
91,-0.6291899999999999
92,-0.6291899999999999
93,-0.6291899999999999
94,-0.6291899999999999
95,-0.6291899999999999
