time,value
0,-1.0128
1,-0.9985299999999999
2,-0.97993
3,-0.9640700000000001
4,-0.94235
5,-0.91394
6,-0.8704799999999999
7,-0.80286
8,-0.6906399999999999
9,-0.4991
10,-0.22175999999999998
11,0.13760999999999998
12,0.53708
13,0.9385
14,1.2895
15,1.5565
16,1.7317
17,1.8336
18,1.9034
19,1.9888
20,2.1693
21,2.5076
22,2.9899
23,3.4819
24,3.8171
25,3.9198
26,3.8339999999999996
27,3.6548
28,3.4432
29,3.2229
30,2.9983
31,2.7710000000000004
32,2.5443
33,2.3086
34,2.062
35,1.8011
36,1.5485
37,1.3213
38,1.1313
39,0.9747299999999999
40,0.82726
41,0.67357
42,0.50431
43,0.3523
44,0.22245
45,0.11660999999999999
46,0.020968999999999998
47,-0.061841
48,-0.12755999999999998
49,-0.18554
50,-0.22635999999999998
51,-0.24968
52,-0.2408
53,-0.19988
54,-0.11400999999999999
55,0.016876
56,0.17927
57,0.35363
58,0.5097
59,0.62533
60,0.68914
61,0.7199800000000001
62,0.7277899999999999
63,0.70225
64,0.62807
65,0.51443
66,0.39653
67,0.29852
68,0.21889
69,0.13405999999999998
70,0.028225
71,-0.10004
72,-0.2387
73,-0.37037
74,-0.48531
75,-0.58092
76,-0.66287
77,-0.7273
78,-0.77584
79,-0.8131
80,-0.84691
81,-0.8785700000000001
82,-0.90161
83,-0.9168299999999999
84,-0.9232299999999999
85,-0.9268200000000001
86,-0.9235
87,-0.91402
88,-0.8977
89,-0.88066
90,-0.86793
91,-0.85898
92,-0.8525299999999999
93,-0.84291
94,-0.83211
95,-0.8156100000000001
96,-0.80006
97,-0.78367
98,-0.76369
99,-0.73344
100,-0.6947300000000001
101,-0.6501600000000001
102,-0.58892
103,-0.50446
104,-0.39498
105,-0.27174
106,-0.13627
107,0.0098201
108,0.16575
109,0.32739
110,0.48361000000000004
111,0.6230399999999999
112,0.72893
113,0.79372
114,0.81167
115,0.7905800000000001
116,0.74931
117,0.7106
118,0.68601
119,0.66984
120,0.6584399999999999
121,0.65746
122,0.67697
123,0.71024
124,0.73216
125,0.71914
126,0.65781
127,0.55401
128,0.42293000000000003
129,0.29066
130,0.17168
131,0.06425399999999999
132,-0.03928
133,-0.14819000000000002
134,-0.26063000000000003
135,-0.37401999999999996
136,-0.4736
137,-0.557
138,-0.62715
139,-0.68862
140,-0.73995
141,-0.778
142,-0.8083100000000001
143,-0.8283200000000001
144,-0.84062
145,-0.84206
146,-0.8401799999999999
147,-0.83639
148,-0.8341299999999999
149,-0.83291
150,-0.82963
151,-0.8272700000000001
152,-0.82696
153,-0.8331299999999999
154,-0.83178
155,-0.8192299999999999
156,-0.79301
157,-0.75734
158,-0.7111
159,-0.65522
160,-0.59159
161,-0.51188
162,-0.40160999999999997
163,-0.24253000000000002
164,-0.031889999999999995
165,0.21224
166,0.44866000000000006
167,0.6345
168,0.74934
169,0.79824
170,0.7961699999999999
171,0.7481
172,0.65515
173,0.5271899999999999
174,0.38768
175,0.25836
176,0.14425
177,0.036538
178,-0.077045
179,-0.19555999999999998
180,-0.30746
181,-0.402
182,-0.48202
183,-0.5562199999999999
184,-0.6197699999999999
185,-0.66737
186,-0.6978300000000001
187,-0.72453
188,-0.7461300000000001
189,-0.7618199999999999
190,-0.77025
191,-0.7754800000000001
192,-0.78165
193,-0.78709
194,-0.79438
195,-0.79718
196,-0.80256
197,-0.8085600000000001
198,-0.81266
199,-0.8032699999999999
200,-0.7794
201,-0.74344
202,-0.68588
203,-0.58926
204,-0.43513999999999997
205,-0.22234
206,0.037901
207,0.31196
208,0.55219
209,0.71512
210,0.7863
211,0.78632
212,0.74775
213,0.69404
214,0.6270100000000001
215,0.54274
216,0.44193999999999994
217,0.33091
218,0.21481
219,0.096239
220,-0.017311
221,-0.12017
222,-0.20695
223,-0.28053
224,-0.34483
225,-0.40418000000000004
226,-0.46336000000000005
227,-0.5182899999999999
228,-0.5664
229,-0.59723
230,-0.6129600000000001
231,-0.61248
232,-0.59451
233,-0.55608
234,-0.49867
235,-0.43492
236,-0.37279
237,-0.32314
238,-0.28954
239,-0.27864
240,-0.28636999999999996
241,-0.30271
242,-0.32095999999999997
243,-0.34273000000000003
244,-0.37208
245,-0.40254
246,-0.42968
247,-0.45433999999999997
248,-0.48081
249,-0.50721
250,-0.53147
251,-0.55747
252,-0.5867100000000001
253,-0.61506
254,-0.6339
255,-0.64241
256,-0.64572
257,-0.65052
258,-0.6604800000000001
259,-0.6754399999999999
260,-0.69624
261,-0.72164
262,-0.7558699999999999
263,-0.80076
264,-0.8531700000000001
265,-0.9045799999999999
266,-0.9522200000000001
267,-0.9954299999999999
268,-1.0243
269,-1.0322
