time,value
0,-0.75592
1,-0.75592
2,-0.75592
3,-0.75592
4,-0.75592
5,-0.75592
6,-0.75592
7,-0.75592
8,-0.75592
9,-0.75592
10,-0.75592
11,-0.75592
12,-0.75592
13,-0.75592
14,-0.75592
15,-0.75592
16,-0.75592
17,-0.75592
18,-0.75592
19,-0.75592
20,-0.75592
21,-0.75592
22,-0.75592
23,-0.75592
24,-0.75592
25,-0.75592
26,-0.75592
27,-0.75592
28,-0.75592
29,-0.75592
30,-0.75592
31,-0.75592
32,-0.75592
33,-0.75592
34,-0.75592
35,-0.75592
36,-0.75592
37,-0.75592
38,-0.75592
39,-0.75592
40,-0.75592
41,-0.75592
42,-0.75592
43,-0.75592
44,-0.75592
45,-0.75592
46,-0.75592
47,-0.75592
48,-0.75592
49,-0.051373
50,1.4858
51,1.4218
52,-0.75592
53,-0.17947000000000002
54,1.5499
55,1.5499
56,1.4218
57,1.4858
58,1.4218
59,1.3577
60,1.3577
61,1.0375
62,-0.56377
63,-0.75592
64,-0.75592
65,-0.75592
66,-0.75592
67,0.52508
68,1.4858
69,1.4218
70,1.4858
71,1.4218
72,1.4218
73,1.4218
74,0.52508
75,-0.75592
76,-0.30756999999999995
77,1.4218
78,1.4858
79,1.3577
80,1.4218
81,1.3577
82,1.2937
83,1.3577
84,1.2937
85,1.4218
86,1.2937
87,1.2937
88,1.2937
89,1.3577
90,1.3577
91,1.3577
92,0.78128
93,-0.75592
94,-0.75592
95,-0.75592
