time,value
0,-0.20583
1,-0.20583
2,-0.20583
3,-0.20583
4,-0.20583
5,-0.20583
6,-0.20583
7,-0.20583
8,-0.20583
9,-0.20583
10,-0.20583
11,-0.20583
12,-0.20583
13,-0.20583
14,-0.20583
15,-0.20583
16,-0.20583
17,-0.20583
18,-0.20583
19,-0.20583
20,-0.20583
21,-0.20583
22,-0.20583
23,-0.20583
24,-0.20583
25,-0.20583
26,-0.20583
27,-0.20583
28,-0.20583
29,-0.20583
30,-0.20583
31,-0.20583
32,-0.20583
33,-0.20583
34,-0.20583
35,-0.20583
36,-0.20583
37,-0.20583
38,-0.20583
39,-0.20583
40,-0.20583
41,-0.20583
42,-0.20583
43,-0.20583
44,-0.1593
45,3.1753
46,5.5327
47,0.042328
48,4.2144
49,5.7188
50,-0.20583
51,-0.20583
52,-0.20583
53,-0.20583
54,-0.20583
55,-0.20583
56,-0.20583
57,-0.20583
58,-0.20583
59,-0.20583
60,-0.20583
61,-0.20583
62,-0.20583
63,-0.20583
64,-0.20583
65,-0.20583
66,-0.20583
67,-0.20583
68,-0.20583
69,-0.20583
70,-0.20583
71,-0.20583
72,-0.20583
73,-0.20583
74,-0.20583
75,-0.20583
76,-0.20583
77,-0.20583
78,-0.20583
79,-0.20583
80,-0.20583
81,-0.20583
82,-0.20583
83,-0.20583
84,-0.20583
85,-0.20583
86,-0.20583
87,-0.20583
88,-0.20583
89,-0.20583
90,-0.20583
91,-0.20583
92,-0.20583
93,-0.20583
94,-0.20583
95,-0.20583
