time,value
0,-0.10279
1,-0.10279
2,-0.10279
3,-0.10279
4,-0.10279
5,-0.10279
6,-0.10279
7,-0.10279
8,-0.10279
9,-0.10279
10,-0.10279
11,-0.10279
12,-0.10279
13,-0.10279
14,-0.10279
15,-0.10279
16,-0.10279
17,-0.10279
18,-0.10279
19,-0.10279
20,-0.10279
21,-0.10279
22,-0.10279
23,-0.10279
24,-0.10279
25,-0.10279
26,-0.10279
27,-0.10279
28,-0.10279
29,-0.10279
30,-0.10279
31,-0.10279
32,-0.10279
33,-0.10279
34,-0.10279
35,-0.10279
36,-0.10279
37,-0.10279
38,-0.10279
39,-0.10279
40,-0.10279
41,-0.10279
42,-0.10279
43,-0.10279
44,-0.10279
45,-0.10279
46,-0.10279
47,-0.10279
48,-0.10279
49,-0.10279
50,-0.10279
51,-0.10279
52,-0.10279
53,-0.10279
54,-0.10279
55,-0.10279
56,-0.10279
57,-0.10279
58,-0.10279
59,-0.10279
60,-0.10279
61,-0.10279
62,-0.10279
63,-0.10279
64,-0.10279
65,-0.10279
66,-0.10279
67,-0.10279
68,-0.10279
69,-0.10279
70,-0.10279
71,-0.10279
72,-0.10279
73,-0.10279
74,-0.10279
75,-0.10279
76,9.6957
77,-0.033783
78,-0.10279
79,-0.10279
80,-0.10279
81,-0.10279
82,-0.10279
83,-0.10279
84,-0.10279
85,-0.10279
86,-0.10279
87,-0.10279
88,-0.10279
89,-0.10279
90,-0.10279
91,-0.10279
92,-0.10279
93,-0.10279
94,-0.10279
95,-0.10279
