time,value
0,-0.85172
1,-0.69524
2,-0.44111000000000006
3,-0.18448
4,0.049423
5,0.25615
6,0.41852
7,0.54992
8,0.67397
9,0.78876
10,0.8819899999999999
11,0.94284
12,0.95689
13,0.9111600000000001
14,0.81116
15,0.68029
16,0.5361899999999999
17,0.38692
18,0.24314000000000002
19,0.11102000000000001
20,-0.011754
21,-0.12117
22,-0.21283000000000002
23,-0.28539000000000003
24,-0.34155
25,-0.3847
26,-0.41388
27,-0.43586
28,-0.45208999999999994
29,-0.45688999999999996
30,-0.45175
31,-0.43263999999999997
32,-0.39714
33,-0.34395
34,-0.26974000000000004
35,-0.17922000000000002
36,-0.081705
37,0.0096412
38,0.08585599999999999
39,0.15095999999999998
40,0.20453
41,0.23978000000000002
42,0.25506999999999996
43,0.24778000000000003
44,0.21005
45,0.13774
46,0.037969
47,-0.074918
48,-0.19236
49,-0.30825
50,-0.41263
51,-0.4977
52,-0.55983
53,-0.5997
54,-0.62303
55,-0.63502
56,-0.6431399999999999
57,-0.64871
58,-0.6452899999999999
59,-0.63589
60,-0.62439
61,-0.6058
62,-0.57823
63,-0.54956
64,-0.53069
65,-0.51875
66,-0.50732
67,-0.49941
68,-0.49663
69,-0.49706999999999996
70,-0.49993999999999994
71,-0.50605
72,-0.51564
73,-0.5252100000000001
74,-0.53099
75,-0.5363399999999999
76,-0.54786
77,-0.56945
78,-0.5995
79,-0.6310899999999999
80,-0.65856
81,-0.67815
82,-0.6931
83,-0.711
84,-0.72807
85,-0.74461
86,-0.75831
87,-0.76012
88,-0.74595
89,-0.71335
90,-0.66759
91,-0.62449
92,-0.58433
93,-0.50495
94,-0.32018
95,-0.019693000000000002
96,0.32053000000000004
97,0.59687
98,0.74802
99,0.78663
100,0.7687
101,0.72995
102,0.6723899999999999
103,0.59573
104,0.50876
105,0.41639
106,0.31687
107,0.20722
108,0.08521000000000001
109,-0.046138
110,-0.17519
111,-0.28836999999999996
112,-0.38014000000000003
113,-0.45111
114,-0.50526
115,-0.55097
116,-0.5882
117,-0.62321
118,-0.66046
119,-0.69511
120,-0.72687
121,-0.7520899999999999
122,-0.76559
123,-0.7608699999999999
124,-0.73344
125,-0.68765
126,-0.62774
127,-0.56174
128,-0.49473
129,-0.41771
130,-0.32849
131,-0.23663
132,-0.1521
133,-0.085188
134,-0.043680000000000004
135,-0.02673
136,-0.028957
137,-0.048674
138,-0.086002
139,-0.13326
140,-0.18245
141,-0.2344
142,-0.29115
143,-0.34786999999999996
144,-0.39697
145,-0.43546999999999997
146,-0.46671
147,-0.49296
148,-0.51217
149,-0.5250199999999999
150,-0.53492
151,-0.54551
152,-0.55883
153,-0.5705600000000001
154,-0.5799300000000001
155,-0.5897899999999999
156,-0.60092
157,-0.61568
158,-0.63447
159,-0.65389
160,-0.6706
161,-0.68323
162,-0.6967
163,-0.71204
164,-0.7256100000000001
165,-0.7378600000000001
166,-0.74692
167,-0.75364
168,-0.75932
169,-0.76559
170,-0.77688
171,-0.79046
172,-0.80085
173,-0.79488
174,-0.7457
175,-0.63574
176,-0.46799999999999997
177,-0.26545
178,-0.063737
179,0.10985
180,0.24716999999999997
181,0.35372
182,0.4334
183,0.47408
184,0.46839
185,0.42806000000000005
186,0.37039
187,0.30396
188,0.22150999999999998
189,0.12650999999999998
190,0.047986
191,0.0031366999999999996
192,-0.008275200000000002
193,0.0074366
194,0.034921
195,0.07452
196,0.12755
197,0.19368
198,0.27684000000000003
199,0.36521
200,0.45841000000000004
201,0.5481699999999999
202,0.61682
203,0.7005
204,0.86403
205,1.1649
206,1.6125
207,2.1441
208,2.6818
209,3.1493
210,3.4843
211,3.6712
212,3.7441
213,3.7605
214,3.7597
215,3.7523
216,3.7517
217,3.7714
218,3.7837
219,3.7236
220,3.5268
221,3.173
222,2.7
223,2.1719
224,1.6434
225,1.1488
226,0.71021
227,0.36861
228,0.1277
229,-0.052302999999999995
230,-0.18713
231,-0.28509
232,-0.35739
233,-0.41163999999999995
234,-0.45513000000000003
235,-0.47538
236,-0.47523999999999994
237,-0.46924
238,-0.45885
239,-0.44922
240,-0.43716000000000005
241,-0.42918999999999996
242,-0.43558
243,-0.44383
244,-0.44578999999999996
245,-0.44243000000000005
246,-0.43568
247,-0.42988999999999994
248,-0.42999
249,-0.43893000000000004
250,-0.45216999999999996
251,-0.46258999999999995
252,-0.46834
253,-0.46918000000000004
254,-0.4647
255,-0.45656
256,-0.4474
257,-0.44121000000000005
258,-0.44316000000000005
259,-0.45441000000000004
260,-0.47026999999999997
261,-0.48478999999999994
262,-0.49986
263,-0.5239
264,-0.56272
265,-0.6188899999999999
266,-0.68237
267,-0.73375
268,-0.77517
269,-0.8192299999999999
