time,value
0,-0.76871
1,-0.76871
2,-0.76871
3,-0.76871
4,-0.76871
5,-0.76871
6,-0.76871
7,-0.76871
8,-0.1142
9,1.6857
10,1.3584
11,1.3584
12,1.3584
13,-0.1142
14,-0.76871
15,-0.76871
16,-0.76871
17,-0.76871
18,-0.76871
19,-0.76871
20,-0.76871
21,-0.76871
22,-0.76871
23,1.5221
24,1.5221
25,1.3584
26,1.1948
27,1.0312
28,-0.76871
29,-0.76871
30,-0.76871
31,-0.76871
32,-0.76871
33,-0.76871
34,-0.76871
35,-0.76871
36,-0.76871
37,0.21306
38,1.5221
39,1.3584
40,1.3584
41,1.3584
42,1.1948
43,1.3584
44,0.86756
45,-0.76871
46,-0.76871
47,-0.76871
48,-0.76871
49,-0.76871
50,-0.76871
51,-0.76871
52,-0.76871
53,-0.76871
54,1.0312
55,1.5221
56,1.3584
57,1.3584
58,1.1948
59,-0.1142
60,-0.76871
61,-0.76871
62,-0.76871
63,-0.76871
64,-0.76871
65,-0.76871
66,-0.76871
67,1.6857
68,1.5221
69,1.3584
70,1.1948
71,1.3584
72,1.1948
73,1.3584
74,-0.1142
75,-0.76871
76,-0.76871
77,-0.76871
78,-0.76871
79,-0.76871
80,-0.76871
81,-0.76871
82,-0.76871
83,-0.76871
84,1.5221
85,1.5221
86,1.3584
87,1.3584
88,1.1948
89,-0.44145
90,-0.76871
91,-0.76871
92,-0.76871
93,-0.76871
94,-0.76871
95,-0.76871
