time,value
0,-0.22173
1,-0.22173
2,-0.22173
3,-0.22173
4,0.60975
5,-0.22173
6,-0.22173
7,-0.22173
8,-0.22173
9,-0.22173
10,-0.22173
11,-0.22173
12,-0.22173
13,-0.22173
14,-0.22173
15,-0.22173
16,-0.22173
17,-0.22173
18,-0.22173
19,-0.22173
20,-0.22173
21,-0.22173
22,-0.22173
23,-0.22173
24,-0.22173
25,-0.22173
26,-0.22173
27,-0.22173
28,-0.22173
29,-0.22173
30,-0.22173
31,-0.22173
32,-0.22173
33,-0.22173
34,-0.22173
35,-0.22173
36,-0.22173
37,-0.22173
38,-0.22173
39,-0.22173
40,-0.22173
41,-0.22173
42,-0.22173
43,-0.22173
44,-0.22173
45,-0.22173
46,-0.22173
47,-0.22173
48,-0.22173
49,-0.22173
50,-0.22173
51,-0.22173
52,-0.22173
53,-0.22173
54,-0.22173
55,-0.22173
56,-0.22173
57,-0.22173
58,-0.22173
59,-0.22173
60,-0.22173
61,1.9401
62,5.5986
63,5.5986
64,-0.22173
65,-0.22173
66,-0.22173
67,4.6008
68,1.6075
69,-0.22173
70,-0.22173
71,-0.22173
72,-0.22173
73,-0.22173
74,-0.22173
75,-0.22173
76,-0.22173
77,-0.22173
78,-0.22173
79,-0.22173
80,-0.22173
81,-0.22173
82,-0.22173
83,-0.22173
84,-0.22173
85,-0.22173
86,-0.22173
87,-0.22173
88,-0.22173
89,-0.22173
90,-0.22173
91,-0.22173
92,-0.22173
93,-0.22173
94,-0.22173
95,-0.22173
