time,value
0,-0.33304
1,-0.33304
2,-0.33304
3,-0.33304
4,-0.33304
5,-0.33304
6,-0.33304
7,-0.33304
8,-0.33304
9,-0.33304
10,-0.33304
11,-0.33304
12,-0.33304
13,-0.33304
14,-0.33304
15,-0.33304
16,-0.33304
17,-0.33304
18,-0.33304
19,-0.33304
20,-0.33304
21,-0.33304
22,-0.33304
23,-0.33304
24,-0.33304
25,-0.33304
26,-0.33304
27,-0.33304
28,-0.33304
29,-0.33304
30,-0.33304
31,-0.33304
32,-0.33304
33,-0.33304
34,-0.33304
35,-0.33304
36,-0.33304
37,-0.33304
38,-0.33304
39,-0.33304
40,-0.33304
41,-0.33304
42,-0.33304
43,-0.33304
44,-0.33304
45,-0.33304
46,-0.33304
47,-0.33304
48,-0.33304
49,-0.33304
50,-0.33304
51,-0.33304
52,-0.33304
53,-0.33304
54,-0.33304
55,-0.33304
56,-0.33304
57,-0.33304
58,-0.33304
59,-0.33304
60,-0.33304
61,-0.33304
62,-0.33304
63,-0.33304
64,-0.33304
65,-0.33304
66,-0.33304
67,-0.33304
68,-0.33304
69,-0.33304
70,-0.33304
71,-0.33304
72,-0.33304
73,-0.33304
74,-0.33304
75,-0.33304
76,-0.33304
77,2.5596
78,3.1686
79,3.1686
80,3.1686
81,3.0164
82,3.0164
83,3.1686
84,3.0164
85,3.1686
86,1.1894
87,-0.33304
88,-0.33304
89,-0.33304
90,-0.33304
91,-0.33304
92,-0.33304
93,-0.33304
94,-0.33304
95,-0.33304
