time,value
0,-1.14
1,-1.0221
2,-1.0617
3,-1.1789
4,-1.2102
5,-1.1858
6,-1.0191
7,-0.9214700000000001
8,-0.9827899999999999
9,-1.0046
10,-1.0819
11,-1.0311
12,-0.85344
13,-0.79372
14,-0.8280299999999999
15,-0.6598
16,-0.5463899999999999
17,-0.46867
18,-0.46911
19,-0.39705
20,-0.34923000000000004
21,-0.23403000000000002
22,-0.18865
23,-0.2258
24,-0.22996999999999998
25,-0.15992
26,-0.12766
27,-0.1694
28,-0.0627
29,-0.007727600000000001
30,0.11202000000000001
31,0.43468
32,1.3522
33,3.2065
34,3.2575
35,1.7973
36,0.55798
37,0.036375
38,1.2494
39,1.7074
40,1.1069
41,0.56225
42,0.8724299999999999
43,0.34254
44,0.070384
45,0.41577
46,0.74047
47,0.38324
48,-0.12695
49,0.28491
50,0.3084
51,0.30363
52,0.066103
53,0.73536
54,0.75202
55,0.48295
56,0.6300899999999999
57,0.63473
58,0.89241
59,0.61511
60,0.51349
61,0.68011
62,0.4812
63,0.49441999999999997
64,0.5939300000000001
65,0.30624
66,0.50651
67,0.45011
68,0.44087
69,0.36719
70,0.44632
71,0.38179
72,0.42208
73,0.46315
74,0.4788
75,0.6491600000000001
76,0.59841
77,0.58099
78,0.6303300000000001
79,0.6320399999999999
80,0.6067600000000001
81,0.5785399999999999
82,0.62426
83,0.69723
84,0.70121
85,0.75784
86,0.70385
87,0.79752
88,0.8644200000000001
89,0.90553
90,0.97016
91,0.88774
92,1.0403
93,0.94165
94,0.89491
95,0.8925
96,0.92945
97,0.8565
98,0.84296
99,0.9311
100,0.9423799999999999
101,0.8943700000000001
102,0.8567600000000001
103,0.93217
104,0.90064
105,1.0274
106,1.0185
107,0.9962
108,1.018
109,1.0282
110,1.0938
111,1.0041
112,1.0696
113,0.98288
114,0.97209
115,1.0931
116,1.1083
117,1.1991
118,1.2105
119,1.1261
120,1.1428
121,1.1734
122,1.1649
123,1.1937
124,1.2038
125,1.2132
126,1.2574
127,1.2781
128,1.1805
129,1.2333
130,1.2306
131,1.2904
132,1.3574
133,1.3651
134,1.4185
135,1.4353
136,1.3742
137,1.4025
138,1.3769
139,1.4052
140,1.337
141,1.2103
142,1.4332
143,1.4784
144,1.652
145,1.4438
146,1.2838
147,1.4761
148,1.4139
149,1.1539
150,0.27009
151,-0.7408899999999999
152,-1.5722
153,-2.5684
154,-2.9382
155,-3.0769
156,-1.8734
157,-1.7576
158,-2.8539999999999996
159,-2.8666
160,-2.5981
161,-1.8727
162,-1.6458
163,-0.72387
164,-0.8427899999999999
165,-1.8171
166,-0.65232
167,2.6857
168,0.047868
169,0.77508
170,0.9815200000000001
171,0.53709
172,0.59642
173,0.8176800000000001
174,1.8906
175,2.6445
176,2.6064
177,1.4615
178,0.51463
179,-0.8395799999999999
180,-1.3117
181,-1.3459
182,0.37293000000000004
183,0.13449
184,-0.45974
185,-0.44211999999999996
186,-0.31159000000000003
187,-0.24148000000000003
188,-0.47267
189,-0.64727
190,-0.5482199999999999
191,-0.43223999999999996
192,-0.44706999999999997
193,-0.45116999999999996
194,-0.43546999999999997
195,-0.43693000000000004
196,-0.34646
197,-0.38618
198,-0.43526000000000004
199,-0.5209699999999999
200,-0.51778
201,-0.5411699999999999
202,-0.48895
203,-0.48513999999999996
204,-0.46068000000000003
205,-0.46561
206,-0.55201
207,-0.53417
208,-0.56042
209,-0.53756
210,-0.58234
211,-0.57797
212,-0.54242
213,-0.60144
214,-0.63026
215,-0.6460899999999999
216,-0.63443
217,-0.62
218,-0.61568
219,-0.6351600000000001
220,-0.62812
221,-0.6103
222,-0.5945
223,-0.6033
224,-0.61423
225,-0.69444
226,-0.57047
227,-0.46934
228,-0.59558
229,-0.6643899999999999
230,-0.60937
231,-0.62551
232,-0.5323899999999999
233,-0.59524
234,-0.53632
235,-0.65378
236,-0.6693899999999999
237,-0.68082
238,-0.69738
239,-0.76727
240,-0.7205
241,-0.7276199999999999
242,-0.59885
243,-0.59021
244,-0.6905600000000001
245,-0.69696
246,-0.70895
247,-0.70681
248,-0.70657
249,-0.71609
250,-0.64139
251,-0.6438
252,-0.71628
253,-0.6331
254,-0.72015
255,-0.69344
256,-0.60661
257,-0.71401
258,-0.71355
259,-0.60449
260,-0.60509
261,-0.71422
262,-0.7179300000000001
263,-0.71531
264,-0.7179800000000001
265,-0.7311300000000001
266,-0.71101
267,-0.61882
268,-0.61428
269,-0.72775
270,-0.72275
271,-0.73011
272,-0.73058
273,-0.72872
274,-0.72858
275,-0.72988
276,-0.7137899999999999
277,-0.62034
278,-0.745
279,-0.74603
280,-0.74457
281,-0.74462
282,-0.75159
283,-0.75245
284,-0.8614799999999999
285,-0.74728
286,-0.6405
287,-0.74361
288,-0.74443
289,-0.63764
290,-0.75498
291,-0.7594
292,-0.76008
293,-0.75002
294,-0.75111
295,-0.75225
296,-0.75622
297,-0.75983
298,-0.76055
299,-0.75837
