time,value
0,-0.8892399999999999
1,1.6464
2,-0.55115
3,-0.8892399999999999
4,1.3083
5,-0.21306999999999998
6,-0.8892399999999999
7,1.1393
8,-0.044022000000000006
9,-0.8892399999999999
10,0.8012
11,0.12502
12,-0.8892399999999999
13,0.8012
14,0.29407
15,-0.8892399999999999
16,0.29407
17,0.63215
18,-0.8892399999999999
19,-0.21306999999999998
20,1.1393
21,-0.8892399999999999
22,-0.38211
23,1.3083
24,-0.8892399999999999
25,-0.8892399999999999
26,1.9845
27,-0.8892399999999999
28,-0.8892399999999999
29,1.6464
30,-0.8892399999999999
31,-0.8892399999999999
32,1.8155
33,-0.8892399999999999
34,-0.8892399999999999
35,1.8155
36,-0.8892399999999999
37,-0.8892399999999999
38,1.9845
39,-0.8892399999999999
40,-0.8892399999999999
41,1.1393
42,-0.21306999999999998
43,-0.8892399999999999
44,0.46311
45,0.63215
46,-0.8892399999999999
47,-0.55115
48,1.4774
49,-0.8892399999999999
50,-0.8892399999999999
51,1.8155
52,-0.8892399999999999
53,-0.8892399999999999
54,1.4774
55,-0.38211
56,-0.8892399999999999
57,0.12502
58,0.8012
59,-0.8892399999999999
60,-0.8892399999999999
61,1.9845
62,-0.8892399999999999
63,-0.8892399999999999
64,0.8012
65,0.29407
66,-0.8892399999999999
67,-0.8892399999999999
68,1.9845
69,-0.8892399999999999
70,-0.8892399999999999
71,0.63215
72,0.46311
73,-0.8892399999999999
74,0.63215
75,0.29407
76,-0.8892399999999999
77,0.63215
78,0.12502
79,-0.8892399999999999
80,1.6464
81,-0.8892399999999999
82,0.12502
83,0.8012
84,-0.8892399999999999
85,1.3083
86,-0.38211
87,-0.8892399999999999
88,1.8155
89,-0.8892399999999999
90,0.12502
91,0.8012
92,-0.8892399999999999
93,1.3083
94,-0.38211
95,-0.8892399999999999
