time,value
0,-0.58306
1,-0.58306
2,-0.58306
3,0.20254
4,2.1665
5,-0.58306
6,-0.58306
7,-0.58306
8,-0.58306
9,0.20254
10,2.1665
11,-0.58306
12,-0.58306
13,-0.58306
14,-0.58306
15,0.39893
16,1.9701
17,-0.58306
18,-0.58306
19,-0.58306
20,-0.58306
21,0.39893
22,1.9701
23,-0.58306
24,-0.58306
25,-0.58306
26,-0.58306
27,0.59533
28,1.7737
29,-0.58306
30,-0.58306
31,-0.58306
32,-0.58306
33,0.39893
34,1.9701
35,-0.58306
36,-0.58306
37,-0.58306
38,-0.58306
39,0.39893
40,2.1665
41,-0.58306
42,-0.58306
43,-0.58306
44,-0.58306
45,0.0061373999999999995
46,2.1665
47,-0.58306
48,-0.58306
49,-0.58306
50,-0.58306
51,0.0061373999999999995
52,2.1665
53,-0.58306
54,-0.58306
55,-0.58306
56,-0.58306
57,0.20254
58,2.1665
59,-0.58306
60,-0.58306
61,-0.58306
62,-0.58306
63,0.20254
64,2.1665
65,-0.58306
66,-0.58306
67,-0.58306
68,-0.58306
69,0.0061373999999999995
70,2.1665
71,-0.58306
72,-0.58306
73,-0.58306
74,-0.58306
75,0.0061373999999999995
76,2.1665
77,-0.58306
78,-0.58306
79,-0.58306
80,-0.58306
81,0.20254
82,2.1665
83,-0.58306
84,-0.58306
85,-0.58306
86,-0.58306
87,0.0061373999999999995
88,2.3629
89,-0.58306
90,-0.58306
91,-0.58306
92,-0.58306
93,0.20254
94,2.1665
95,-0.58306
