time,value
0,-0.7290000000000001
1,-0.66032
2,-0.66032
3,-0.66032
4,-0.7290000000000001
5,-0.66032
6,-0.66032
7,-0.66032
8,-0.66032
9,-0.7290000000000001
10,-0.66032
11,-0.66032
12,-0.66032
13,-0.7290000000000001
14,-0.66032
15,-0.66032
16,-0.66032
17,-0.7290000000000001
18,-0.66032
19,-0.66032
20,-0.66032
21,-0.7290000000000001
22,-0.66032
23,-0.66032
24,-0.66032
25,-0.7290000000000001
26,-0.66032
27,-0.66032
28,-0.66032
29,-0.7290000000000001
30,-0.66032
31,-0.66032
32,-0.66032
33,-0.7290000000000001
34,-0.66032
35,-0.66032
36,-0.66032
37,-0.7290000000000001
38,-0.66032
39,-0.17957
40,1.8808
41,1.4001
42,1.9495
43,1.8808
44,1.8808
45,2.4989
46,1.0567
47,1.8121
48,1.194
49,2.4302
50,1.5374
51,0.71326
52,0.5759
53,1.6748
54,1.5374
55,0.98798
56,0.98798
57,1.0567
58,0.85062
59,0.50722
60,0.78194
61,0.98798
62,0.50722
63,1.6748
64,1.1253
65,1.9495
66,0.98798
67,0.98798
68,1.8121
69,1.0567
70,1.1253
71,1.4001
72,-0.66032
73,-0.66032
74,-0.66032
75,-0.66032
76,-0.7290000000000001
77,-0.66032
78,-0.66032
79,-0.66032
80,-0.7290000000000001
81,-0.66032
82,-0.66032
83,-0.66032
84,-0.7290000000000001
85,-0.66032
86,-0.66032
87,-0.66032
88,-0.7290000000000001
89,-0.66032
90,-0.66032
91,-0.66032
92,-0.7290000000000001
93,-0.66032
94,-0.66032
95,-0.66032
