time,value
0,-0.16435
1,-0.16435
2,-0.16435
3,-0.16435
4,-0.16435
5,-0.16435
6,-0.16435
7,-0.16435
8,-0.16435
9,-0.16435
10,-0.16435
11,-0.16435
12,-0.16435
13,-0.16435
14,-0.16435
15,-0.16435
16,-0.16435
17,-0.16435
18,-0.16435
19,-0.16435
20,-0.16435
21,-0.16435
22,-0.16435
23,-0.16435
24,-0.16435
25,-0.16435
26,-0.16435
27,-0.16435
28,-0.16435
29,-0.16435
30,-0.16435
31,-0.16435
32,-0.16435
33,-0.16435
34,-0.16435
35,-0.16435
36,-0.16435
37,-0.16435
38,-0.16435
39,-0.16435
40,-0.16435
41,-0.16435
42,-0.16435
43,-0.16435
44,-0.16435
45,-0.16435
46,-0.16435
47,-0.16435
48,-0.16435
49,-0.16435
50,-0.16435
51,-0.16435
52,-0.16435
53,-0.16435
54,-0.16435
55,-0.16435
56,-0.16435
57,-0.16435
58,-0.16435
59,-0.16435
60,-0.16435
61,-0.16435
62,-0.16435
63,-0.16435
64,-0.16435
65,-0.16435
66,-0.16435
67,-0.16435
68,-0.16435
69,-0.16435
70,-0.16435
71,-0.16435
72,-0.16435
73,-0.16435
74,-0.16435
75,-0.16435
76,-0.16435
77,-0.16435
78,-0.16435
79,-0.16435
80,-0.16435
81,-0.16435
82,4.5977
83,8.0121
84,2.6749
85,-0.16435
86,-0.16435
87,-0.16435
88,-0.16435
89,-0.16435
90,-0.16435
91,-0.16435
92,-0.16435
93,-0.16435
94,-0.16435
95,-0.16435
