time,value
0,1.786
1,1.7486
2,1.6733
3,1.5725
4,1.4716
5,1.3703
6,1.2830000000000001
7,1.1825
8,1.0848
9,0.98706
10,0.89171
11,0.7955
12,0.7002
13,0.60849
14,0.5184
15,0.42686999999999997
16,0.33542
17,0.24425
18,0.15915
19,0.079028
20,-0.0072952
21,-0.08655800000000001
22,-0.16846
23,-0.2497
24,-0.33473
25,-0.41476
26,-0.49238999999999994
27,-0.56334
28,-0.63862
29,-0.71311
30,-0.7819
31,-0.8501299999999999
32,-0.9083399999999999
33,-0.97344
34,-1.0393
35,-1.0847
36,-1.1303
37,-1.1831
38,-1.2184
39,-1.2418
40,-1.2753
41,-1.2887
42,-1.3065
43,-1.3161
44,-1.3172
45,-1.3098
46,-1.294
47,-1.2702
48,-1.251
49,-1.2122
50,-1.1782
51,-1.1265
52,-1.08
53,-1.0278
54,-0.9725600000000001
55,-0.91781
56,-0.85234
57,-0.7954600000000001
58,-0.72091
59,-0.64842
60,-0.57534
61,-0.5017199999999999
62,-0.41518999999999995
63,-0.34046
64,-0.25659
65,-0.17154
66,-0.08722200000000001
67,-0.0037145000000000004
68,0.086242
69,0.17271
70,0.26122
71,0.35042
72,0.44291
73,0.5320600000000001
74,0.62175
75,0.71467
76,0.80866
77,0.9036200000000001
78,0.99751
79,1.0944
80,1.179
81,1.2762
82,1.3766
83,1.4762
84,1.5763
85,1.6762
86,1.7624
87,1.8248
88,1.8118
89,1.7743
90,1.6738
91,1.5724
92,1.4716
93,1.3712
94,1.2831
95,1.1837
96,1.085
97,0.9883299999999999
98,0.89165
99,0.7954399999999999
100,0.70014
101,0.60843
102,0.51739
103,0.42368
104,0.33321
105,0.24419000000000002
106,0.15675999999999998
107,0.06918099999999999
108,-0.017321
109,-0.10173
110,-0.18955
111,-0.27597
112,-0.34631
113,-0.42258999999999997
114,-0.50355
115,-0.58089
116,-0.6573100000000001
117,-0.72609
118,-0.7937
119,-0.86939
120,-0.92909
121,-0.9884700000000001
122,-1.0456
123,-1.0998
124,-1.1372
125,-1.1797
126,-1.2237
127,-1.24
128,-1.2701
129,-1.2939
130,-1.2969
131,-1.3043
132,-1.3032
133,-1.3066
134,-1.2888
135,-1.2631
136,-1.2299
137,-1.2015
138,-1.1561
139,-1.1128
140,-1.0649
141,-1.0036
142,-0.95321
143,-0.8836700000000001
144,-0.82371
145,-0.75344
146,-0.6825100000000001
147,-0.61119
148,-0.53468
149,-0.4575
150,-0.38021
151,-0.29723
152,-0.21322
153,-0.12707000000000002
154,-0.045702
155,0.032313
156,0.12257
157,0.20933000000000002
158,0.29585
159,0.38616999999999996
160,0.47688
161,0.5696100000000001
162,0.64889
163,0.74259
164,0.83644
165,0.9312799999999999
166,1.0266
167,1.1218
168,1.2206
169,1.319
170,1.4177
171,1.5193
172,1.6051
173,1.7028
174,1.7758
175,1.8119999999999998
