time,value
0,-1.0222
1,0.25639
2,0.73587
3,1.3752
4,-0.063265
5,-1.0222
6,-0.8624
7,0.25639
8,0.73587
9,0.73587
10,0.41622
11,-0.8624
12,-1.0222
13,0.41622
14,0.57604
15,0.25639
16,0.8957
17,-0.8624
18,-1.0222
19,0.57604
20,0.57604
21,-0.54275
22,1.2154
23,-0.54275
24,-0.8624
25,0.41622
26,0.41622
27,-0.8624
28,1.0555
29,0.096562
30,-0.8624
31,0.41622
32,0.57604
33,-1.0222
34,0.25639
35,0.8957
36,-0.8624
37,0.096562
38,0.73587
39,-0.8624
40,-0.8624
41,1.2154
42,-0.063265
43,-0.063265
44,0.8957
45,-0.8624
46,-1.0222
47,0.25639
48,0.8957
49,-0.063265
50,1.0555
51,-1.0222
52,-0.8624
53,-1.0222
54,1.2154
55,0.57604
56,1.2154
57,-0.8624
58,-1.0222
59,-0.8624
60,-0.063265
61,1.3752
62,1.3752
63,-0.54275
64,-1.0222
65,-0.8624
66,-1.0222
67,0.57604
68,2.6538
69,-0.22309
70,-1.0222
71,-0.8624
72,-1.0222
73,-0.8624
74,2.9735
75,0.8957
76,-1.0222
77,-0.8624
78,-1.0222
79,-0.8624
80,1.0555
81,2.6538
82,-0.8624
83,-1.0222
84,-0.8624
85,-1.0222
86,-0.38292
87,2.6538
88,0.57604
89,-0.8624
90,-1.0222
91,-0.8624
92,-0.8624
93,1.3752
94,1.2154
95,0.096562
