time,value
0,-0.25228
1,-0.25228
2,-0.25228
3,-0.25228
4,-0.25228
5,-0.25228
6,-0.25228
7,-0.25228
8,-0.25228
9,-0.25228
10,-0.25228
11,-0.25228
12,-0.25228
13,-0.25228
14,-0.25228
15,-0.25228
16,-0.25228
17,-0.25228
18,-0.25228
19,-0.25228
20,-0.25228
21,-0.25228
22,-0.25228
23,-0.25228
24,-0.25228
25,-0.25228
26,-0.25228
27,-0.25228
28,3.4257
29,0.6845600000000001
30,-0.25228
31,-0.25228
32,-0.25228
33,-0.25228
34,-0.25228
35,-0.044095
36,6.9649
37,-0.25228
38,-0.25228
39,-0.25228
40,-0.25228
41,-0.25228
42,-0.25228
43,-0.25228
44,-0.25228
45,-0.25228
46,-0.25228
47,-0.25228
48,-0.25228
49,-0.25228
50,-0.25228
51,-0.25228
52,-0.25228
53,-0.25228
54,3.0787
55,-0.25228
56,-0.25228
57,0.92745
58,-0.25228
59,-0.25228
60,-0.25228
61,-0.25228
62,-0.25228
63,-0.25228
64,3.3563
65,-0.25228
66,-0.25228
67,-0.25228
68,-0.25228
69,-0.25228
70,-0.25228
71,-0.25228
72,-0.25228
73,-0.25228
74,-0.25228
75,-0.25228
76,-0.25228
77,-0.25228
78,-0.25228
79,-0.25228
80,-0.25228
81,-0.25228
82,-0.25228
83,-0.25228
84,-0.25228
85,-0.25228
86,-0.25228
87,-0.25228
88,-0.25228
89,-0.25228
90,-0.25228
91,-0.25228
92,2.4195
93,1.1356
94,-0.25228
95,-0.25228
