time,value
0,-0.25008
1,-0.25008
2,-0.25008
3,-0.25008
4,-0.25008
5,-0.25008
6,-0.25008
7,-0.25008
8,-0.25008
9,-0.25008
10,-0.25008
11,-0.25008
12,-0.25008
13,-0.25008
14,-0.25008
15,-0.25008
16,-0.25008
17,-0.25008
18,-0.25008
19,-0.25008
20,-0.25008
21,-0.25008
22,-0.25008
23,-0.25008
24,-0.25008
25,-0.25008
26,-0.25008
27,-0.25008
28,-0.25008
29,-0.25008
30,-0.25008
31,-0.25008
32,-0.25008
33,-0.25008
34,-0.25008
35,-0.25008
36,-0.25008
37,-0.25008
38,-0.25008
39,-0.25008
40,-0.25008
41,-0.25008
42,-0.25008
43,4.4029
44,5.3881
45,1.4777
46,3.1904
47,0.007578199999999999
48,-0.037891
49,3.8118
50,3.7664
51,-0.25008
52,-0.25008
53,-0.25008
54,-0.25008
55,-0.25008
56,-0.25008
57,-0.25008
58,-0.25008
59,-0.25008
60,-0.25008
61,-0.25008
62,-0.25008
63,-0.25008
64,-0.25008
65,-0.25008
66,-0.25008
67,-0.25008
68,-0.25008
69,-0.25008
70,-0.25008
71,-0.25008
72,-0.25008
73,-0.25008
74,-0.25008
75,-0.25008
76,-0.25008
77,-0.25008
78,-0.25008
79,-0.25008
80,-0.25008
81,-0.25008
82,-0.25008
83,-0.25008
84,-0.25008
85,-0.25008
86,-0.25008
87,-0.25008
88,-0.25008
89,-0.25008
90,-0.25008
91,-0.25008
92,-0.25008
93,-0.25008
94,-0.25008
95,-0.25008
