time,value
0,1.3181
1,1.4127
2,1.0341
3,-0.8586600000000001
4,-0.8586600000000001
5,-0.8586600000000001
6,-0.8586600000000001
7,-0.8586600000000001
8,-0.8586600000000001
9,1.1288
10,1.4127
11,1.3181
12,-0.38545999999999997
13,-0.8586600000000001
14,-0.8586600000000001
15,-0.8586600000000001
16,-0.8586600000000001
17,-0.8586600000000001
18,-0.0069009
19,1.4127
20,1.3181
21,0.75022
22,-0.8586600000000001
23,-0.8586600000000001
24,-0.8586600000000001
25,-0.8586600000000001
26,-0.8586600000000001
27,1.0341
28,1.3181
29,1.3181
30,-0.0069009
31,-0.8586600000000001
32,-0.8586600000000001
33,-0.8586600000000001
34,-0.8586600000000001
35,1.5073
36,1.3181
37,1.1288
38,-0.8586600000000001
39,-0.8586600000000001
40,-0.8586600000000001
41,-0.8586600000000001
42,-0.66938
43,1.5073
44,1.3181
45,0.84486
46,-0.8586600000000001
47,-0.8586600000000001
48,-0.8586600000000001
49,-0.8586600000000001
50,0.9395
51,1.4127
52,1.2234
53,-0.8586600000000001
54,-0.8586600000000001
55,-0.8586600000000001
56,-0.8586600000000001
57,-0.38545999999999997
58,1.4127
59,1.4127
60,0.56094
61,-0.8586600000000001
62,-0.8586600000000001
63,-0.8586600000000001
64,-0.8586600000000001
65,0.4663
66,1.4127
67,1.4127
68,-0.19618
69,-0.8586600000000001
70,-0.8586600000000001
71,1.5073
72,1.4127
73,1.0341
74,-0.8586600000000001
75,-0.8586600000000001
76,-0.8586600000000001
77,0.9395
78,1.3181
79,0.4663
80,-0.8586600000000001
81,-0.8586600000000001
82,-0.8586600000000001
83,0.087739
84,1.4127
85,1.3181
86,-0.8586600000000001
87,-0.8586600000000001
88,-0.8586600000000001
89,0.087739
90,1.4127
91,1.3181
92,-0.38545999999999997
93,-0.8586600000000001
94,-0.8586600000000001
95,-0.8586600000000001
