time,value
0,0.69799
1,0.87113
2,0.69799
3,0.87113
4,0.17855
5,-0.34088
6,-0.34088
7,-0.34088
8,-0.34088
9,-0.34088
10,-0.34088
11,-0.34088
12,0.17855
13,-0.34088
14,-0.34088
15,-0.34088
16,-0.34088
17,-0.34088
18,-0.34088
19,-0.34088
20,0.3517
21,-0.34088
22,-0.34088
23,-0.34088
24,-0.34088
25,-0.34088
26,-0.34088
27,-0.34088
28,-0.34088
29,-0.34088
30,-0.34088
31,-0.34088
32,-0.34088
33,-0.34088
34,-0.34088
35,-0.34088
36,-0.34088
37,-0.34088
38,-0.34088
39,-0.34088
40,0.17855
41,-0.34088
42,-0.34088
43,-0.34088
44,-0.34088
45,-0.34088
46,-0.34088
47,-0.34088
48,-0.34088
49,-0.34088
50,-0.34088
51,-0.34088
52,-0.34088
53,-0.34088
54,-0.34088
55,-0.34088
56,0.17855
57,-0.34088
58,-0.34088
59,-0.34088
60,-0.34088
61,-0.34088
62,-0.34088
63,-0.34088
64,-0.34088
65,-0.34088
66,-0.34088
67,-0.34088
68,-0.34088
69,-0.34088
70,-0.34088
71,-0.34088
72,-0.34088
73,-0.34088
74,-0.34088
75,-0.34088
76,-0.34088
77,-0.34088
78,-0.34088
79,-0.34088
80,-0.34088
81,-0.34088
82,-0.34088
83,-0.34088
84,-0.34088
85,-0.34088
86,-0.34088
87,-0.34088
88,-0.34088
89,3.4683
90,3.6414
91,3.8146
92,3.6414
93,3.8146
94,3.8146
95,0.87113
