time,value
0,1.9026
1,1.8471
2,1.7961
3,1.7598
4,1.7311
5,1.7055
6,1.6802
7,1.6552
8,1.6243
9,1.5776
10,1.5217
11,1.4747
12,1.4311
13,1.3875
14,1.344
15,1.3006
16,1.2573
17,1.2147
18,1.1709
19,1.1279
20,1.0849
21,1.0421
22,0.99934
23,0.9556600000000001
24,0.91395
25,0.8718299999999999
26,0.83091
27,0.7896
28,0.74549
29,0.7003699999999999
30,0.6533899999999999
31,0.6039
32,0.5525
33,0.5011800000000001
34,0.44997
35,0.39885
36,0.34784
37,0.29695
38,0.24618
39,0.19212
40,0.1416
41,0.087787
42,0.039335
43,-0.010758
44,-0.06415599999999999
45,-0.1157
46,-0.1688
47,-0.22008000000000003
48,-0.27283
49,-0.3238
50,-0.37613
51,-0.42673
52,-0.47713
53,-0.52732
54,-0.57728
55,-0.62698
56,-0.6763899999999999
57,-0.72549
58,-0.7742399999999999
59,-0.8236600000000001
60,-0.8687299999999999
61,-0.9093
62,-0.93652
63,-0.9653
64,-0.9813799999999999
65,-0.9828
66,-0.97503
67,-0.9638
68,-0.94739
69,-0.93147
70,-0.91422
71,-0.9034399999999999
72,-0.88754
73,-0.8666200000000001
74,-0.84746
75,-0.8214899999999999
76,-0.79086
77,-0.75371
78,-0.70573
79,-0.7024699999999999
80,-0.69087
81,-0.66545
82,-0.64005
83,-0.6140399999999999
84,-0.58734
85,-0.5634899999999999
86,-0.53894
87,-0.51718
88,-0.4981
89,-0.47827
90,-0.46102
91,-0.44766000000000006
92,-0.44342
93,-0.43909
94,-0.44314
95,-0.48775
96,-0.53725
97,-0.58031
98,-0.61882
99,-0.65696
100,-0.69491
101,-0.73495
102,-0.77535
103,-0.8153199999999999
104,-0.85246
105,-0.8839
106,-0.9148200000000001
107,-0.94235
108,-0.96915
109,-0.9951700000000001
110,-1.0203
111,-1.0446
112,-1.0679
113,-1.0902
114,-1.1114
115,-1.1314
116,-1.1502
117,-1.1676
118,-1.1837
119,-1.1982
120,-1.215
121,-1.2295
122,-1.2461
123,-1.2865
124,-1.3279
125,-1.3694
126,-1.4126
127,-1.4519
128,-1.4853
129,-1.517
130,-1.5459
131,-1.5753
132,-1.6028
133,-1.6259
134,-1.6482
135,-1.6911
136,-1.6897
137,-1.6829
138,-1.6687
139,-1.6529
140,-1.6326
141,-1.6043
142,-1.5765
143,-1.5430000000000001
144,-1.5089
145,-1.4699
146,-1.4294
147,-1.3911
148,-1.3498
149,-1.3076
150,-1.2662
151,-1.2215
152,-1.178
153,-1.1337
154,-1.0841
155,-1.0373
156,-0.99034
157,-0.9440000000000001
158,-0.89874
159,-0.8502799999999999
160,-0.8046800000000001
161,-0.75568
162,-0.70652
163,-0.6572399999999999
164,-0.60783
165,-0.55521
166,-0.49943000000000004
167,-0.44598999999999994
168,-0.39353
169,-0.34381999999999996
170,-0.29725
171,-0.24675
172,-0.1986
173,-0.1528
174,-0.10722999999999999
175,-0.061163
176,-0.017641999999999998
177,0.027381
178,0.067201
179,0.10884
180,0.14994000000000002
181,0.18915
182,0.22814
183,0.26558000000000004
184,0.30364
185,0.34454
186,0.37983
187,0.41526
188,0.45291000000000003
189,0.48858
190,0.5264300000000001
191,0.5645399999999999
192,0.60438
193,0.64244
194,0.68023
195,0.7168
196,0.75508
197,0.79452
198,0.83375
199,0.8721899999999999
200,0.91259
201,0.9521799999999999
202,0.9934799999999999
203,1.0341
204,1.0763
205,1.1197
206,1.1648
207,1.2147
208,1.2654
209,1.2562
210,1.2274
211,1.2009
212,1.1767
213,1.1549
214,1.1395
215,1.1281
216,1.1076
217,1.0809
218,1.0573
219,1.0388
220,1.0261
221,1.0166
222,0.99398
223,0.98035
224,0.9655600000000001
225,0.9425100000000001
226,0.9223
227,0.8987700000000001
228,0.86956
229,0.84059
230,0.81188
231,0.78617
232,0.76079
233,0.74257
234,0.72518
235,0.72049
236,0.75527
237,0.7850699999999999
238,0.81511
239,0.8453799999999999
240,0.8758799999999999
241,0.9090600000000001
242,0.9424
243,0.9734799999999999
244,1.0071
245,1.041
246,1.0773
247,1.1158
248,1.1525
249,1.19
250,1.2064
251,1.2148
252,1.2274
253,1.2387
254,1.255
255,1.2539
256,1.2366
257,1.2164
258,1.1999
259,1.1834
260,1.1644
261,1.1215
262,1.0725
263,1.0275
264,0.98305
265,0.93894
266,0.89649
267,0.8540399999999999
268,0.81161
269,0.77103
270,0.72942
271,0.68657
272,0.64558
273,0.60332
274,0.56096
275,0.51862
276,0.47618999999999995
277,0.4334
278,0.39165
279,0.34976999999999997
280,0.30895
281,0.26482
282,0.22063000000000002
283,0.17689000000000002
284,0.13615
285,0.093986
286,0.057787
287,0.020191999999999998
288,-0.016247
289,-0.05411799999999999
290,-0.097544
291,-0.14567
292,-0.19697
293,-0.2515
294,-0.30255
295,-0.35006
296,-0.40418000000000004
297,-0.45128999999999997
298,-0.50162
299,-0.55172
300,-0.60158
301,-0.64765
302,-0.69692
303,-0.74335
304,-0.79084
305,-0.83535
306,-0.883
307,-0.93127
308,-0.9803799999999999
309,-1.0263
310,-1.0586
311,-1.0677
312,-1.0489
313,-1.0155
314,-0.9841200000000001
315,-0.9510799999999999
316,-0.9165399999999999
317,-0.8767299999999999
318,-0.83973
319,-0.79764
320,-0.7549
321,-0.7109300000000001
322,-0.66666
323,-0.62463
324,-0.58292
325,-0.54409
326,-0.51582
327,-0.55186
328,-0.58667
329,-0.62205
330,-0.65709
331,-0.6906399999999999
332,-0.71877
333,-0.74055
334,-0.7721899999999999
335,-0.80758
336,-0.8427
337,-0.87751
338,-0.91366
339,-0.94786
340,-0.98167
341,-1.0169
342,-1.0518
343,-1.0844
344,-1.1185
345,-1.15
346,-1.1808
347,-1.2097
348,-1.2403
349,-1.2737
350,-1.3032
351,-1.3225
352,-1.3341
353,-1.3386
354,-1.3305
355,-1.3072
356,-1.2771
357,-1.2479
358,-1.2211
359,-1.193
360,-1.1621
361,-1.1236
362,-1.0833
363,-1.0436
364,-1.0036
365,-0.9647600000000001
366,-0.92558
367,-0.8850899999999999
368,-0.84424
369,-0.80523
370,-0.77594
371,-0.75785
372,-0.73844
373,-0.71927
374,-0.68717
375,-0.65308
376,-0.65144
377,-0.6552
378,-0.65399
379,-0.65556
380,-0.65603
381,-0.6593
382,-0.6582600000000001
383,-0.6625
384,-0.6663
385,-0.67665
386,-0.6864100000000001
387,-0.7013
388,-0.7078800000000001
389,-0.70229
390,-0.65328
391,-0.6037600000000001
392,-0.55378
393,-0.50338
394,-0.45258999999999994
395,-0.40146
396,-0.3559
397,-0.31266
398,-0.26058000000000003
399,-0.20981999999999998
400,-0.1589
401,-0.10785
402,-0.06018
403,-0.01069
404,0.038999
405,0.08540199999999999
406,0.12822999999999998
407,0.1685
408,0.21694000000000002
409,0.26954
410,0.32176
411,0.37101999999999996
412,0.41093999999999997
413,0.45442
414,0.49828999999999996
415,0.54187
416,0.58437
417,0.6259899999999999
418,0.67087
419,0.71297
420,0.75651
421,0.80048
422,0.8458899999999999
423,0.88846
424,0.9325100000000001
425,0.9744
426,1.0164
427,1.0522
428,1.0961
429,1.1424
430,1.1825
431,1.2227
432,1.263
433,1.3035
434,1.344
435,1.3839
436,1.4254
437,1.4693
438,1.5162
439,1.5632
440,1.6058
441,1.6484
442,1.6866
443,1.7155
444,1.7444
445,1.7706
446,1.7971
447,1.8238
448,1.8564
449,1.8892
450,1.9193
451,1.9495
452,1.976
453,2.0022
454,2.0275
455,2.0558
456,2.0353
457,2.0076
458,1.9802
459,1.9615
460,1.949
461,1.931
462,1.9105
