time,value
0,-0.24315
1,-0.24315
2,-0.24315
3,-0.24315
4,-0.24315
5,-0.24315
6,-0.24315
7,-0.24315
8,-0.24315
9,-0.24315
10,-0.24315
11,-0.24315
12,-0.24315
13,-0.24315
14,-0.24315
15,-0.24315
16,-0.24315
17,-0.24315
18,-0.24315
19,-0.24315
20,-0.24315
21,-0.24315
22,-0.24315
23,-0.24315
24,-0.24315
25,-0.24315
26,-0.24315
27,-0.24315
28,-0.24315
29,-0.24315
30,-0.24315
31,-0.24315
32,-0.24315
33,-0.24315
34,-0.24315
35,-0.24315
36,-0.24315
37,-0.24315
38,-0.24315
39,-0.24315
40,-0.24315
41,-0.24315
42,-0.24315
43,-0.24315
44,-0.24315
45,3.3359
46,4.9842
47,0.7929
48,4.7016
49,0.02371
50,-0.023383
51,2.708
52,4.8743
53,-0.24315
54,-0.24315
55,-0.24315
56,-0.24315
57,-0.24315
58,-0.24315
59,-0.24315
60,-0.24315
61,-0.24315
62,-0.24315
63,-0.24315
64,-0.24315
65,-0.24315
66,-0.24315
67,-0.24315
68,-0.24315
69,-0.24315
70,-0.24315
71,-0.24315
72,-0.24315
73,-0.24315
74,-0.24315
75,-0.24315
76,-0.24315
77,-0.24315
78,-0.24315
79,-0.24315
80,-0.24315
81,-0.24315
82,-0.24315
83,-0.24315
84,-0.24315
85,-0.24315
86,-0.24315
87,-0.24315
88,-0.24315
89,-0.24315
90,-0.24315
91,-0.24315
92,-0.24315
93,-0.24315
94,-0.24315
95,-0.24315
