time,value
0,-0.19413
1,-0.19413
2,-0.19413
3,-0.19413
4,-0.19413
5,-0.19413
6,-0.19413
7,-0.19413
8,-0.19413
9,-0.19413
10,-0.19413
11,-0.19413
12,-0.19413
13,-0.19413
14,-0.19413
15,-0.19413
16,-0.19413
17,-0.19413
18,-0.19413
19,-0.19413
20,-0.19413
21,-0.19413
22,-0.19413
23,-0.19413
24,-0.19413
25,-0.19413
26,-0.19413
27,-0.19413
28,-0.19413
29,-0.19413
30,-0.19413
31,-0.19413
32,-0.19413
33,-0.19413
34,-0.19413
35,-0.19413
36,-0.19413
37,-0.19413
38,-0.19413
39,-0.19413
40,-0.19413
41,-0.19413
42,-0.19413
43,-0.19413
44,-0.19413
45,-0.19413
46,-0.19413
47,-0.19413
48,-0.19413
49,-0.19413
50,-0.19413
51,-0.19413
52,-0.19413
53,-0.19413
54,-0.19413
55,-0.19413
56,-0.19413
57,-0.19413
58,-0.19413
59,-0.19413
60,-0.19413
61,-0.19413
62,-0.19413
63,-0.19413
64,-0.19413
65,-0.19413
66,-0.19413
67,-0.19413
68,3.1252
69,4.6049
70,0.56572
71,-0.19413
72,-0.19413
73,-0.19413
74,-0.19413
75,-0.19413
76,7.6843
77,1.0256
78,0.46574
79,-0.19413
80,-0.19413
81,-0.19413
82,-0.19413
83,-0.19413
84,-0.19413
85,-0.19413
86,-0.19413
87,-0.19413
88,-0.19413
89,-0.19413
90,-0.19413
91,-0.19413
92,-0.19413
93,-0.19413
94,-0.19413
95,-0.19413
