time,value
0,0.29821
1,0.46369
2,0.29821
3,0.46369
4,0.29821
5,0.29821
6,0.46369
7,0.29821
8,0.29821
9,0.29821
10,0.46369
11,0.29821
12,0.29821
13,0.46369
14,0.29821
15,0.29821
16,0.29821
17,0.29821
18,0.46369
19,0.29821
20,0.29821
21,0.29821
22,0.29821
23,0.13273
24,0.29821
25,0.29821
26,0.29821
27,0.46369
28,0.62917
29,0.29821
30,0.29821
31,0.29821
32,0.29821
33,0.29821
34,0.29821
35,0.13273
36,0.29821
37,0.13273
38,0.29821
39,0.29821
40,0.13273
41,0.29821
42,-1.3566
43,-3.0114
44,-3.0114
45,-3.0114
46,-3.0114
47,-3.0114
48,-3.0114
49,-3.0114
50,-3.0114
51,-3.0114
52,0.79465
53,1.1256
54,0.79465
55,0.62917
56,0.62917
57,0.46369
58,0.46369
59,0.29821
60,0.46369
61,0.46369
62,0.29821
63,0.29821
64,0.46369
65,0.29821
66,0.29821
67,0.29821
68,0.46369
69,0.29821
70,0.29821
71,0.29821
72,0.13273
73,0.29821
74,0.13273
75,0.29821
76,0.29821
77,0.13273
78,0.29821
79,0.13273
80,0.29821
81,0.29821
82,0.29821
83,0.13273
84,0.29821
85,0.29821
86,0.13273
87,0.29821
88,0.13273
89,0.29821
90,0.29821
91,0.13273
92,0.29821
93,0.29821
94,0.13273
95,0.29821
