time,value
0,-0.35675
1,-0.35675
2,-0.35675
3,-0.35675
4,-0.35675
5,-0.35675
6,-0.35675
7,-0.35675
8,-0.35675
9,-0.35675
10,-0.35675
11,-0.35675
12,-0.35675
13,-0.35675
14,-0.35675
15,-0.35675
16,-0.35675
17,-0.35675
18,-0.35675
19,-0.35675
20,-0.35675
21,-0.35675
22,-0.35675
23,-0.35675
24,-0.35675
25,-0.35675
26,-0.35675
27,-0.35675
28,-0.35675
29,-0.35675
30,-0.35675
31,-0.35675
32,-0.35675
33,-0.35675
34,-0.35675
35,-0.2659
36,1.0463
37,7.0116
38,1.339
39,1.4298
40,1.8437
41,1.6418
42,-0.33655999999999997
43,-0.35675
44,-0.35675
45,-0.35675
46,-0.35675
47,-0.35675
48,-0.35675
49,-0.35675
50,-0.20534000000000002
51,0.8847700000000001
52,0.34981
53,0.13784000000000002
54,0.14793
55,0.12775
56,0.11765
57,0.057092
58,0.087373
59,0.12775
60,0.057092
61,-0.35675
62,-0.35675
63,-0.35675
64,-0.35675
65,-0.35675
66,-0.35675
67,-0.25581
68,0.8343
69,0.73336
70,0.28925
71,-0.25581
72,-0.35675
73,-0.35675
74,-0.35675
75,0.11765
76,4.5387
77,1.8134
78,-0.094312
79,-0.094312
80,-0.094312
81,-0.074125
82,-0.22553
83,-0.35675
84,-0.35675
85,-0.35675
86,-0.35675
87,-0.35675
88,-0.35675
89,-0.35675
90,-0.35675
91,-0.35675
92,-0.35675
93,-0.35675
94,-0.35675
95,-0.35675
