time,value
0,0.5091399999999999
1,-0.91275
2,1.5756
3,-0.91275
4,-0.91275
5,1.2201
6,-0.91275
7,1.0424
8,-0.37954
9,-0.91275
10,1.5756
11,-0.91275
12,-0.55728
13,1.3978
14,-0.91275
15,0.5091399999999999
16,0.15367
17,-0.91275
18,1.3978
19,-0.91275
20,-0.91275
21,1.5756
22,-0.91275
23,-0.55728
24,1.2201
25,-0.91275
26,0.5091399999999999
27,0.33141
28,-0.91275
29,1.2201
30,-0.55728
31,-0.91275
32,1.5756
33,-0.91275
34,-0.91275
35,1.3978
36,-0.91275
37,0.68688
38,-0.024069
39,-0.91275
40,1.5756
41,-0.91275
42,0.68688
43,-0.024069
44,-0.91275
45,1.3978
46,-0.91275
47,-0.91275
48,1.3978
49,-0.91275
50,0.68688
51,0.15367
52,-0.91275
53,1.5756
54,-0.91275
55,-0.91275
56,1.5756
57,-0.91275
58,-0.024069
59,0.68688
60,-0.91275
61,1.2201
62,-0.55728
63,-0.91275
64,1.5756
65,-0.91275
66,-0.55728
67,1.2201
68,-0.91275
69,0.68688
70,-0.024069
71,-0.91275
72,1.5756
73,-0.91275
74,-0.91275
75,1.3978
76,-0.91275
77,0.5091399999999999
78,0.15367
79,-0.91275
80,1.7533
81,-0.91275
82,-0.91275
83,1.5756
84,-0.91275
85,0.33141
86,0.33141
87,-0.91275
88,1.3978
89,-0.91275
90,-0.91275
91,1.5756
92,-0.91275
93,0.5091399999999999
94,-0.024069
95,-0.91275
