time,value
0,-0.34165999999999996
1,-0.34165999999999996
2,-0.34165999999999996
3,-0.34165999999999996
4,-0.34165999999999996
5,-0.34165999999999996
6,-0.34165999999999996
7,-0.34165999999999996
8,-0.34165999999999996
9,-0.34165999999999996
10,-0.34165999999999996
11,-0.34165999999999996
12,-0.34165999999999996
13,-0.34165999999999996
14,-0.34165999999999996
15,-0.34165999999999996
16,-0.34165999999999996
17,-0.34165999999999996
18,-0.34165999999999996
19,-0.34165999999999996
20,-0.34165999999999996
21,-0.34165999999999996
22,-0.34165999999999996
23,-0.34165999999999996
24,-0.34165999999999996
25,-0.34165999999999996
26,-0.34165999999999996
27,-0.34165999999999996
28,-0.34165999999999996
29,-0.34165999999999996
30,-0.34165999999999996
31,-0.34165999999999996
32,-0.34165999999999996
33,-0.34165999999999996
34,-0.09840299999999999
35,3.3478
36,-0.34165999999999996
37,-0.34165999999999996
38,-0.34165999999999996
39,-0.34165999999999996
40,3.3073
41,0.7530100000000001
42,-0.26058000000000003
43,-0.34165999999999996
44,3.9560000000000004
45,-0.34165999999999996
46,-0.34165999999999996
47,-0.34165999999999996
48,-0.34165999999999996
49,1.1179
50,1.7261
51,-0.34165999999999996
52,-0.34165999999999996
53,-0.34165999999999996
54,-0.34165999999999996
55,-0.34165999999999996
56,-0.34165999999999996
57,-0.34165999999999996
58,-0.34165999999999996
59,-0.34165999999999996
60,-0.34165999999999996
61,2.7802
62,-0.34165999999999996
63,-0.34165999999999996
64,-0.34165999999999996
65,-0.34165999999999996
66,-0.34165999999999996
67,-0.34165999999999996
68,-0.34165999999999996
69,3.1045
70,-0.34165999999999996
71,-0.34165999999999996
72,-0.34165999999999996
73,-0.34165999999999996
74,-0.34165999999999996
75,-0.34165999999999996
76,-0.34165999999999996
77,-0.34165999999999996
78,2.4964
79,-0.34165999999999996
80,-0.34165999999999996
81,-0.34165999999999996
82,-0.34165999999999996
83,-0.34165999999999996
84,-0.34165999999999996
85,-0.34165999999999996
86,-0.34165999999999996
87,-0.34165999999999996
88,-0.34165999999999996
89,2.6991
90,-0.34165999999999996
91,-0.34165999999999996
92,-0.34165999999999996
93,-0.34165999999999996
94,3.4289
95,-0.34165999999999996
