time,value
0,-0.18213
1,-0.18213
2,-0.18213
3,-0.18213
4,-0.18213
5,-0.18213
6,-0.18213
7,-0.18213
8,-0.18213
9,-0.18213
10,-0.18213
11,-0.18213
12,-0.18213
13,-0.18213
14,-0.18213
15,-0.18213
16,-0.18213
17,-0.18213
18,-0.18213
19,-0.18213
20,-0.18213
21,-0.18213
22,-0.18213
23,-0.18213
24,-0.18213
25,-0.18213
26,-0.18213
27,-0.18213
28,-0.18213
29,-0.18213
30,-0.18213
31,-0.18213
32,-0.18213
33,-0.18213
34,-0.18213
35,-0.18213
36,-0.18213
37,-0.18213
38,-0.18213
39,-0.18213
40,-0.18213
41,-0.18213
42,-0.18213
43,-0.18213
44,-0.18213
45,-0.18213
46,-0.18213
47,-0.18213
48,-0.18213
49,-0.18213
50,-0.18213
51,2.6901
52,0.46137
53,-0.18213
54,-0.18213
55,-0.18213
56,-0.18213
57,-0.18213
58,-0.18213
59,-0.18213
60,-0.18213
61,-0.18213
62,-0.18213
63,-0.18213
64,-0.18213
65,-0.18213
66,-0.18213
67,1.0578
68,8.6856
69,2.7215
70,-0.18213
71,-0.18213
72,-0.18213
73,-0.18213
74,-0.18213
75,-0.18213
76,-0.18213
77,-0.18213
78,-0.18213
79,-0.18213
80,-0.18213
81,-0.18213
82,0.77527
83,-0.18213
84,-0.18213
85,-0.18213
86,-0.18213
87,-0.18213
88,-0.18213
89,-0.18213
90,-0.18213
91,-0.18213
92,-0.18213
93,-0.18213
94,-0.18213
95,-0.18213
