time,value
0,-0.73434
1,-0.73434
2,-0.73434
3,-0.73434
4,-0.73434
5,-0.045728
6,1.6758
7,1.6758
8,0.72896
9,-0.73434
10,-0.73434
11,-0.73434
12,-0.73434
13,-0.73434
14,-0.73434
15,-0.1318
16,1.6758
17,1.5897
18,1.4176
19,-0.73434
20,-0.73434
21,-0.73434
22,-0.73434
23,-0.73434
24,-0.73434
25,-0.73434
26,1.7619
27,1.6758
28,0.55681
29,-0.73434
30,-0.73434
31,-0.73434
32,-0.73434
33,-0.56219
34,1.7619
35,1.6758
36,0.2125
37,-0.73434
38,-0.73434
39,-0.73434
40,0.12643
41,1.5037
42,-0.045728
43,0.90112
44,1.5897
45,0.98719
46,-0.73434
47,-0.73434
48,-0.73434
49,-0.73434
50,-0.73434
51,-0.73434
52,-0.73434
53,0.29858
54,1.6758
55,1.3315
56,-0.73434
57,-0.73434
58,-0.73434
59,-0.73434
60,-0.73434
61,-0.30396
62,1.5037
63,1.5897
64,1.5897
65,0.98719
66,-0.73434
67,-0.73434
68,-0.73434
69,-0.73434
70,-0.73434
71,-0.73434
72,-0.73434
73,-0.73434
74,1.5037
75,1.6758
76,-0.045728
77,-0.73434
78,-0.73434
79,-0.73434
80,0.90112
81,1.5897
82,1.6758
83,1.1593
84,-0.73434
85,-0.73434
86,-0.73434
87,-0.73434
88,-0.73434
89,-0.73434
90,0.64289
91,1.7619
92,1.5897
93,-0.73434
94,-0.73434
95,-0.73434
