time,value
0,-0.29475999999999997
1,-0.31677
2,-0.29875999999999997
3,-0.31276
4,-0.30075999999999997
5,-0.31477
6,-0.29675999999999997
7,-0.31276
8,-0.30075999999999997
9,-0.31076
10,-0.30075999999999997
11,-0.30276
12,-0.31076
13,-0.29475999999999997
14,-0.31276
15,-0.29275999999999996
16,-0.31677
17,-0.29275999999999996
18,-0.31076
19,-0.30476
20,-0.30476
21,-0.31076
22,-0.29875999999999997
23,-0.31477
24,-0.28675
25,-0.30676
26,-0.29875999999999997
27,-0.29875999999999997
28,-0.30075999999999997
29,-0.27675
30,-0.30276
31,-0.28675
32,-0.30476
33,-0.29475999999999997
34,-0.30075999999999997
35,-0.30075999999999997
36,-0.29475999999999997
37,-0.31076
38,-0.28675
39,-0.31276
40,-0.29875999999999997
41,-0.30676
42,-0.30276
43,-0.29875999999999997
44,-0.31276
45,-0.29475999999999997
46,-0.31076
47,-0.29475999999999997
48,-0.30676
49,-0.29475999999999997
50,-0.29275999999999996
51,-0.30075999999999997
52,-0.29075
53,-0.30476
54,-0.29075
55,-0.31076
56,-0.29075
57,-0.30075999999999997
58,-0.30276
59,-0.29675999999999997
60,-0.31076
61,-0.29275999999999996
62,-0.30276
63,-0.28275
64,-0.30276
65,-0.30676
66,-0.29475999999999997
67,-0.30476
68,-0.28875
69,-0.30876
70,-0.24073000000000003
71,3.9311
72,3.3269
73,3.2948
74,3.3689
75,3.3569
76,3.4949
77,3.3289
78,1.9883
79,-0.24073000000000003
80,-0.27875
81,-0.26674000000000003
82,-0.27675
83,-0.27875
84,-0.27475
85,-0.29475999999999997
86,-0.24874000000000002
87,-0.26875
88,-0.29675999999999997
89,-0.27475
90,-0.29275999999999996
91,-0.30276
92,-0.28275
93,-0.29075
94,-0.30876
95,-0.28075
