time,value
0,2.1594
1,2.1594
2,0.74147
3,-0.39289
4,-0.39289
5,-0.39289
6,-0.39289
7,-0.39289
8,-0.39289
9,-0.39289
10,-0.39289
11,-0.39289
12,0.17429
13,-0.39289
14,-0.39289
15,-0.39289
16,-0.39289
17,-0.39289
18,-0.39289
19,-0.39289
20,0.032494999999999996
21,-0.39289
22,-0.39289
23,-0.39289
24,-0.39289
25,-0.39289
26,-0.39289
27,-0.39289
28,-0.39289
29,-0.39289
30,-0.39289
31,-0.39289
32,-0.39289
33,-0.39289
34,-0.39289
35,-0.39289
36,-0.39289
37,-0.39289
38,-0.39289
39,-0.39289
40,0.032494999999999996
41,-0.39289
42,-0.39289
43,-0.39289
44,-0.39289
45,-0.39289
46,-0.39289
47,-0.39289
48,-0.39289
49,-0.39289
50,-0.39289
51,-0.39289
52,-0.39289
53,-0.39289
54,-0.39289
55,-0.39289
56,0.032494999999999996
57,-0.39289
58,-0.39289
59,-0.39289
60,-0.39289
61,-0.39289
62,-0.39289
63,-0.39289
64,-0.39289
65,-0.39289
66,-0.39289
67,-0.39289
68,-0.39289
69,-0.39289
70,-0.39289
71,-0.39289
72,-0.39289
73,-0.39289
74,-0.39289
75,-0.39289
76,-0.39289
77,-0.39289
78,-0.39289
79,-0.39289
80,-0.39289
81,-0.39289
82,-0.39289
83,-0.39289
84,-0.39289
85,1.3087
86,3.0102
87,3.0102
88,2.8684
89,3.0102
90,3.0102
91,3.0102
92,2.8684
93,3.0102
94,0.59968
95,-0.39289
