time,value
0,0.65855
1,-0.41298999999999997
2,-0.41298999999999997
3,-0.41298999999999997
4,-0.41298999999999997
5,0.65855
6,-0.41298999999999997
7,-0.41298999999999997
8,-0.41298999999999997
9,-0.41298999999999997
10,0.65855
11,-0.41298999999999997
12,1.7301
13,-0.41298999999999997
14,-0.41298999999999997
15,-0.41298999999999997
16,0.65855
17,-0.41298999999999997
18,-0.41298999999999997
19,-0.41298999999999997
20,-0.41298999999999997
21,0.65855
22,-0.41298999999999997
23,-0.41298999999999997
24,-0.41298999999999997
25,-0.41298999999999997
26,0.65855
27,-0.41298999999999997
28,-0.41298999999999997
29,-0.41298999999999997
30,-0.41298999999999997
31,-0.41298999999999997
32,0.65855
33,-0.41298999999999997
34,-0.41298999999999997
35,-0.41298999999999997
36,0.65855
37,-0.41298999999999997
38,-0.41298999999999997
39,-0.41298999999999997
40,0.65855
41,-0.41298999999999997
42,-0.41298999999999997
43,-0.41298999999999997
44,0.65855
45,-0.41298999999999997
46,-0.41298999999999997
47,-0.41298999999999997
48,-0.41298999999999997
49,0.65855
50,-0.41298999999999997
51,-0.41298999999999997
52,-0.41298999999999997
53,-0.41298999999999997
54,-0.41298999999999997
55,0.65855
56,-0.41298999999999997
57,-0.41298999999999997
58,-0.41298999999999997
59,0.65855
60,-0.41298999999999997
61,-0.41298999999999997
62,-0.41298999999999997
63,-0.41298999999999997
64,-0.41298999999999997
65,-0.41298999999999997
66,0.65855
67,-0.41298999999999997
68,-0.41298999999999997
69,-0.41298999999999997
70,-0.41298999999999997
71,-0.41298999999999997
72,-0.41298999999999997
73,-0.41298999999999997
74,-0.41298999999999997
75,0.65855
76,-0.41298999999999997
77,-0.41298999999999997
78,-0.41298999999999997
79,1.7301
80,3.8731
81,4.9447
82,3.8731
83,3.8731
84,-0.41298999999999997
85,-0.41298999999999997
86,-0.41298999999999997
87,-0.41298999999999997
88,-0.41298999999999997
89,-0.41298999999999997
90,-0.41298999999999997
91,-0.41298999999999997
92,-0.41298999999999997
93,-0.41298999999999997
94,0.65855
95,-0.41298999999999997
