time,value
0,2.5371
1,2.4537
2,2.3722
3,2.2915
4,2.2051
5,2.1307
6,2.0508
7,1.9654
8,1.88
9,1.8023
10,1.7254
11,1.6446
12,1.5643
13,1.5158
14,1.4599
15,1.4147
16,1.3689
17,1.3209
18,1.2624
19,1.194
20,1.1248
21,1.0573
22,1.0003
23,0.94884
24,0.90835
25,0.85354
26,0.79173
27,0.74736
28,0.70293
29,0.68597
30,0.6611899999999999
31,0.63684
32,0.62232
33,0.61341
34,0.60565
35,0.58654
36,0.52025
37,0.49498000000000003
38,0.48988000000000004
39,0.51543
40,0.5141600000000001
41,0.46141000000000004
42,0.39548
43,0.32761999999999997
44,0.26066999999999996
45,0.18843
46,0.10905
47,0.023481000000000002
48,-0.069379
49,-0.16232
50,-0.24054
51,-0.31619
52,-0.38304
53,-0.44128999999999996
54,-0.48676
55,-0.51988
56,-0.54114
57,-0.55469
58,-0.56089
59,-0.56915
60,-0.57514
61,-0.58031
62,-0.58158
63,-0.57934
64,-0.56338
65,-0.5364800000000001
66,-0.57705
67,-0.58508
68,-0.5772
69,-0.55438
70,-0.52042
71,-0.46698
72,-0.48083000000000004
73,-0.55809
74,-0.62234
75,-0.6855600000000001
76,-0.75456
77,-0.8316600000000001
78,-0.9104
79,-0.9958899999999999
80,-1.0802
81,-1.1616
82,-1.2503
83,-1.3486
84,-1.4291
85,-1.4679
86,-1.5016
87,-1.5376
88,-1.5621
89,-1.5737
90,-1.56
91,-1.5141
92,-1.4716
93,-1.4307
94,-1.3658
95,-1.2787
96,-1.1878
97,-1.1028
98,-1.0362
99,-0.9811
100,-0.93342
101,-0.87756
102,-0.8046800000000001
103,-0.7273
104,-0.65052
105,-0.56909
106,-0.51215
107,-0.58639
108,-0.63942
109,-0.58562
110,-0.51891
111,-0.44555
112,-0.37514000000000003
113,-0.29969
114,-0.23314000000000001
115,-0.32744
116,-0.43921000000000004
117,-0.5401199999999999
118,-0.59943
119,-0.68876
120,-0.77181
121,-0.8482
122,-0.9209700000000001
123,-0.9937799999999999
124,-1.0505
125,-1.1058
126,-1.1668
127,-1.2261
128,-1.2876
129,-1.3572
130,-1.3959
131,-1.4156
132,-1.3773
133,-1.3235
134,-1.2522
135,-1.1731
136,-1.1094
137,-1.031
138,-0.96485
139,-0.88685
140,-0.8137800000000001
141,-0.72963
142,-0.6521399999999999
143,-0.5695399999999999
144,-0.47158
145,-0.38169000000000003
146,-0.29585
147,-0.20806999999999998
148,-0.12819
149,-0.044111000000000004
150,0.037367000000000004
151,0.1155
152,0.20453
153,0.2779
154,0.36606
155,0.4194
156,0.37091999999999997
157,0.40301
158,0.47352
159,0.56305
160,0.64189
161,0.73364
162,0.8251200000000001
163,0.88413
164,0.77671
165,0.66933
166,0.56911
167,0.4814
168,0.39860999999999996
169,0.31887
170,0.25835
171,0.18199
172,0.12525
173,0.072173
174,0.005063499999999999
175,-0.048325
176,-0.095113
177,-0.042932
178,0.036712
179,0.12065999999999999
180,0.19789
181,0.27851
182,0.35661
183,0.44215
184,0.51765
185,0.60297
186,0.67982
187,0.7603300000000001
188,0.8377100000000001
189,0.92186
190,0.99766
191,1.0778
192,1.1014
193,1.1817
194,1.2665
195,1.2984
196,1.2145
197,1.1302
198,1.0735
199,1.0883
200,1.1659
201,1.2489
202,1.329
203,1.4099
204,1.4969999999999999
205,1.5789
206,1.6435
207,1.6002
208,1.5205
209,1.4342
210,1.3586
211,1.3465
212,1.3506
213,1.2672
214,1.1873
215,1.1045
216,1.0261
217,0.943
218,0.8643200000000001
219,0.78292
220,0.7448899999999999
221,0.74744
222,0.76936
223,0.8132
224,0.87085
225,0.956
226,0.9704200000000001
227,0.88325
228,0.7951
229,0.71585
230,0.6561600000000001
231,0.59816
232,0.51273
233,0.4273
234,0.34247
235,0.26105
236,0.17924
237,0.093339
238,0.011747
239,-0.06925
240,-0.15531
241,-0.23560999999999999
242,-0.31103000000000003
243,-0.39181
244,-0.46269
245,-0.52882
246,-0.5866399999999999
247,-0.59426
248,-0.5734
249,-0.53222
250,-0.47495
251,-0.42933000000000004
252,-0.38293
253,-0.32626
254,-0.27059
255,-0.21458000000000002
256,-0.14689000000000002
257,-0.077727
258,-0.0075301000000000005
259,0.071113
260,0.15915
261,0.19685
262,0.26966
263,0.3452
264,0.42118999999999995
265,0.48949
266,0.43725
267,0.34692
268,0.25755
269,0.14204
270,0.05790599999999999
271,-0.033833999999999996
272,-0.12247000000000001
273,-0.1946
274,-0.252
275,-0.27408000000000005
276,-0.25151
277,-0.3493
278,-0.44675
279,-0.54396
280,-0.6411600000000001
281,-0.73797
282,-0.8348200000000001
283,-0.93106
284,-1.0267
285,-1.107
286,-1.1994
287,-1.2932
288,-1.3782
289,-1.4619
290,-1.5542
291,-1.6453
292,-1.7208
293,-1.8033
294,-1.8717
295,-1.9337
296,-1.9677
297,-1.9708
298,-1.9657
299,-1.9472
300,-1.9086
301,-1.8334
302,-1.7537
303,-1.6753
304,-1.5961
305,-1.5103
306,-1.4293
307,-1.3453
308,-1.2634
309,-1.1829
310,-1.0988
311,-1.0184
312,-0.9293899999999999
313,-0.8517299999999999
314,-0.77146
315,-0.68285
316,-0.5961
317,-0.5164300000000001
318,-0.45938999999999997
319,-0.38226
320,-0.29936999999999997
321,-0.21404
322,-0.13274
323,-0.1348
324,-0.21941999999999998
325,-0.30085
326,-0.37323
327,-0.40178
328,-0.46498
329,-0.54509
330,-0.6116199999999999
331,-0.66466
332,-0.69824
333,-0.70587
334,-0.70125
335,-0.62232
336,-0.64086
337,-0.7027
338,-0.76285
339,-0.82468
340,-0.8799600000000001
341,-0.9320700000000001
342,-0.98034
343,-1.0173
344,-1.0526
345,-1.0903
346,-1.1133
347,-1.1413
348,-1.1701
349,-1.1864
350,-1.1977
351,-1.1929
352,-1.1679
353,-1.1446
354,-1.1105
355,-1.0699
356,-1.0168
357,-0.95601
358,-0.8841700000000001
359,-0.81586
360,-0.74915
361,-0.67543
362,-0.5993
363,-0.52058
364,-0.43200000000000005
365,-0.33842
366,-0.2735
367,-0.21403000000000003
368,-0.15113
369,-0.090263
370,-0.025414
371,0.032255
372,0.085684
373,0.15847
374,0.23855
375,0.31401
376,0.41781999999999997
377,0.5159199999999999
378,0.62883
379,0.56788
380,0.51825
381,0.46319
382,0.40535
383,0.37517
384,0.40133
385,0.44556
386,0.48557
387,0.51841
388,0.5566800000000001
389,0.58724
390,0.59065
391,0.6209100000000001
392,0.65245
393,0.65457
394,0.6361899999999999
395,0.6484300000000001
396,0.7076100000000001
397,0.73752
398,0.80276
399,0.87744
400,0.9559799999999999
401,1.0377
402,1.0706
403,1.1058
404,1.1598
405,1.1992
406,1.2405
407,1.2397
408,1.2493
409,1.2892
410,1.3447
411,1.4244
412,1.5076
413,1.5925
414,1.6246
415,1.6279
416,1.7096
417,1.7903
418,1.8736
419,1.952
420,2.0371
421,2.1164
422,2.1795
423,2.2364
424,2.3127
425,2.3974
426,2.4795
