time,value
0,-0.1351
1,-0.1351
2,-0.1351
3,-0.1351
4,-0.1351
5,-0.1351
6,-0.1351
7,-0.1351
8,-0.1351
9,-0.1351
10,-0.1351
11,-0.1351
12,-0.1351
13,-0.1351
14,-0.1351
15,-0.1351
16,-0.1351
17,-0.1351
18,-0.1351
19,-0.1351
20,-0.1351
21,-0.1351
22,-0.1351
23,-0.1351
24,-0.1351
25,-0.1351
26,-0.1351
27,-0.1351
28,-0.1351
29,-0.1351
30,-0.1351
31,-0.1351
32,-0.1351
33,-0.1351
34,-0.1351
35,-0.1351
36,-0.1351
37,-0.1351
38,-0.1351
39,-0.1351
40,-0.1351
41,-0.1351
42,-0.1351
43,-0.1351
44,-0.1351
45,0.086604
46,9.4167
47,2.1004
48,0.40069
49,0.28983000000000003
50,-0.1351
51,-0.1351
52,-0.1351
53,-0.1351
54,-0.1351
55,-0.1351
56,-0.1351
57,-0.1351
58,-0.1351
59,-0.1351
60,-0.1351
61,-0.1351
62,-0.1351
63,-0.1351
64,-0.1351
65,-0.1351
66,-0.1351
67,-0.1351
68,-0.1351
69,-0.1351
70,-0.1351
71,-0.1351
72,-0.1351
73,-0.1351
74,-0.1351
75,-0.1351
76,-0.1351
77,-0.1351
78,-0.1351
79,-0.1351
80,-0.1351
81,-0.1351
82,-0.1351
83,-0.1351
84,-0.1351
85,-0.1351
86,-0.1351
87,-0.1351
88,-0.1351
89,-0.1351
90,-0.1351
91,-0.1351
92,-0.1351
93,-0.1351
94,-0.1351
95,-0.1351
