time,value
0,1.9667
1,1.9401
2,1.9151
3,1.9454
4,1.9593
5,1.9451
6,1.9197
7,1.881
8,1.8565
9,1.8184
10,1.7805
11,1.742
12,1.7038
13,1.6666
14,1.6284
15,1.591
16,1.5529
17,1.5162
18,1.4782
19,1.4399
20,1.4041
21,1.3663
22,1.331
23,1.2937
24,1.2586
25,1.222
26,1.185
27,1.1502
28,1.1146
29,1.0801
30,1.0453
31,1.011
32,0.9749899999999999
33,0.9392
34,0.9062
35,0.8721200000000001
36,0.8401799999999999
37,0.80555
38,0.77168
39,0.73729
40,0.70312
41,0.66919
42,0.63551
43,0.60207
44,0.56889
45,0.53199
46,0.49811000000000005
47,0.46563999999999994
48,0.42801999999999996
49,0.39602
50,0.35868
51,0.32718
52,0.2927
53,0.2592
54,0.2225
55,0.18594000000000002
56,0.1543
57,0.11961
58,0.083588
59,0.047727
60,0.018759
61,-0.016648
62,-0.051863
63,-0.08688
64,-0.12055999999999999
65,-0.15045999999999998
66,-0.18874000000000002
67,-0.21719000000000002
68,-0.25093000000000004
69,-0.28441
70,-0.3176
71,-0.35049
72,-0.38308000000000003
73,-0.41534
74,-0.44725
75,-0.4788
76,-0.50997
77,-0.54074
78,-0.57108
79,-0.6009800000000001
80,-0.63041
81,-0.66889
82,-0.69753
83,-0.7255699999999999
84,-0.7530399999999999
85,-0.77989
86,-0.80611
87,-0.8316600000000001
88,-0.85651
89,-0.8806
90,-0.8990100000000001
91,-0.92642
92,-0.94185
93,-0.9570700000000001
94,-0.9647600000000001
95,-0.97111
96,-0.97609
97,-0.9797
98,-0.9714
99,-0.96996
100,-0.96925
101,-0.9671700000000001
102,-0.96331
103,-0.9578200000000001
104,-0.9526700000000001
105,-0.94514
106,-0.93327
107,-0.92619
108,-0.9148
109,-0.9022
110,-0.8961399999999999
111,-0.88686
112,-0.87075
113,-0.8535299999999999
114,-0.84031
115,-0.82034
116,-0.82021
117,-0.86056
118,-0.90086
119,-0.93878
120,-0.97856
121,-1.0186
122,-1.0556
123,-1.0884
124,-1.1159999999999999
125,-1.1505
126,-1.1807
127,-1.2139
128,-1.2447
129,-1.2702
130,-1.2965
131,-1.3226
132,-1.3429
133,-1.355
134,-1.3665
135,-1.3513
136,-1.3275
137,-1.3159999999999998
138,-1.2888
139,-1.2672
140,-1.2444
141,-1.2203
142,-1.1951
143,-1.1688
144,-1.1415
145,-1.1133
146,-1.0842
147,-1.0543
148,-1.0237
149,-0.9923299999999999
150,-0.9603299999999999
151,-0.9277200000000001
152,-0.89455
153,-0.86085
154,-0.8266700000000001
155,-0.79202
156,-0.75695
157,-0.72148
158,-0.6856399999999999
159,-0.6489
160,-0.60969
161,-0.57007
162,-0.5330600000000001
163,-0.49311000000000005
164,-0.45282
165,-0.41008999999999995
166,-0.37003
167,-0.32706
168,-0.28698
169,-0.24591999999999997
170,-0.20393
171,-0.16379000000000002
172,-0.12491
173,-0.08741900000000001
174,-0.049714
175,-0.027349000000000002
176,-0.0065674999999999996
177,0.015078
178,0.027170999999999997
179,0.025323
180,-0.0047072
181,-0.045602
182,-0.086493
183,-0.12618
184,-0.16702999999999998
185,-0.1802
186,-0.14034000000000002
187,-0.10054
188,-0.060253999999999995
189,-0.020041
190,0.020278
191,0.060698
192,0.10147
193,0.14223
194,0.18324000000000001
195,0.22425
196,0.26527
197,0.30673
198,0.34813
199,0.38925
200,0.43081
201,0.47181000000000006
202,0.51339
203,0.5544
204,0.59604
205,0.63702
206,0.6787
207,0.71968
208,0.76139
209,0.80291
210,0.84411
211,0.88589
212,0.92684
213,0.96865
214,1.0101
215,1.0514
216,1.0933
217,1.1359
218,1.179
219,1.2183
220,1.2572
221,1.2567
222,1.2546
223,1.2395
224,1.2377
225,1.2107
226,1.1971
227,1.1947
228,1.1813
229,1.1724
230,1.1741
231,1.1763
232,1.179
233,1.1821
234,1.1724
235,1.1631
236,1.1592
237,1.1553
238,1.1517
239,1.1578
240,1.1644
241,1.1714
242,1.1789
243,1.1869
244,1.1953
245,1.2042
246,1.2135
247,1.2233
248,1.2336
249,1.2442
250,1.2554
251,1.2669
252,1.2789
253,1.2974
254,1.3236
255,1.3556
256,1.3691
257,1.383
258,1.3502
259,1.3071
260,1.2639
261,1.2208
262,1.1776
263,1.1343
264,1.0866
265,1.0435
266,0.99564
267,0.9517200000000001
268,0.9001100000000001
269,0.8639
270,0.82875
271,0.78096
272,0.7289399999999999
273,0.67714
274,0.62964
275,0.5782
276,0.53089
277,0.48235
278,0.4365
279,0.38942
280,0.34173000000000003
281,0.29202
282,0.24529
283,0.20845
284,0.17514000000000002
285,0.14199
286,0.095885
287,0.053205999999999996
288,0.013156000000000001
289,-0.027604000000000004
290,-0.069859
291,-0.1118
292,-0.14215
293,-0.17135
294,-0.19297
295,-0.21051
296,-0.22748000000000002
297,-0.24388
298,-0.26841
299,-0.28417
300,-0.30644
301,-0.33286
302,-0.35254
303,-0.37688
304,-0.40018000000000004
305,-0.42261000000000004
306,-0.43692
307,-0.428
308,-0.43478999999999995
309,-0.46242
310,-0.49587
311,-0.5343
312,-0.56495
313,-0.60254
314,-0.64315
315,-0.68811
316,-0.73247
317,-0.77275
318,-0.81876
319,-0.8615799999999999
320,-0.90146
321,-0.95006
322,-0.99754
323,-1.0472
324,-1.1045
325,-1.1532
326,-1.1832
327,-1.2126
328,-1.2412
329,-1.2689
330,-1.2958
331,-1.3217
332,-1.3425
333,-1.3591
334,-1.3814
335,-1.3962
336,-1.415
337,-1.4352
338,-1.4564
339,-1.4747
340,-1.4969999999999999
341,-1.5214
342,-1.5014
343,-1.4580000000000002
344,-1.4149
345,-1.3718
346,-1.3288
347,-1.2889
348,-1.249
349,-1.209
350,-1.2014
351,-1.1986
352,-1.2223
353,-1.2538
354,-1.2779
355,-1.2924
356,-1.3053
357,-1.3165
358,-1.348
359,-1.3734
360,-1.4047
361,-1.4385
362,-1.4741
363,-1.5054
364,-1.5177
365,-1.5266
366,-1.5083
367,-1.4883
368,-1.4668
369,-1.4417
370,-1.4089
371,-1.3912
372,-1.3576
373,-1.3304
374,-1.3023
375,-1.2733
376,-1.2435
377,-1.2077
378,-1.1731
379,-1.1415
380,-1.1094
381,-1.0785
382,-1.0449
383,-1.0176
384,-0.99026
385,-0.9559799999999999
386,-0.9277200000000001
387,-0.8921399999999999
388,-0.8571
389,-0.8263799999999999
390,-0.79122
391,-0.7573300000000001
392,-0.71999
393,-0.67897
394,-0.64163
395,-0.6041300000000001
396,-0.5664600000000001
397,-0.52864
398,-0.49068999999999996
399,-0.45261
400,-0.4144
401,-0.37608
402,-0.34145
403,-0.30365
404,-0.26494
405,-0.22613000000000003
406,-0.19146
407,-0.15241
408,-0.11682000000000001
409,-0.07803500000000001
410,-0.041685
411,-0.0030578000000000003
412,0.035314
413,0.072462
414,0.11072
415,0.14847
416,0.18827
417,0.22493000000000002
418,0.26299
419,0.3018
420,0.33979000000000004
421,0.37905
422,0.41696000000000005
423,0.45663000000000004
424,0.49425
425,0.5345300000000001
426,0.5723600000000001
427,0.6126
428,0.65075
429,0.69084
430,0.7294
431,0.76774
432,0.80766
433,0.8455
434,0.8854200000000001
435,0.92416
436,0.9630200000000001
437,1.002
438,1.0411
439,1.0802
440,1.1185
441,1.1578
442,1.1972
443,1.2368
444,1.2763
445,1.315
446,1.3548
447,1.3948
448,1.4348
449,1.4742
450,1.5143
451,1.5541
452,1.5943
453,1.6345
454,1.6749
455,1.7152
456,1.7558
457,1.7965
458,1.8239
459,1.865
460,1.893
461,1.9348
462,1.9666
