time,value
0,-0.8545799999999999
1,-0.8545799999999999
2,-0.8545799999999999
3,-0.8545799999999999
4,-0.8545799999999999
5,-0.8545799999999999
6,-0.8545799999999999
7,-0.8545799999999999
8,-0.8545799999999999
9,-0.8545799999999999
10,-0.8545799999999999
11,-0.8545799999999999
12,-0.8545799999999999
13,-0.8545799999999999
14,-0.8545799999999999
15,-0.8545799999999999
16,-0.8545799999999999
17,-0.8545799999999999
18,-0.8545799999999999
19,-0.8545799999999999
20,-0.8545799999999999
21,-0.8545799999999999
22,-0.8545799999999999
23,-0.8545799999999999
24,-0.35024
25,1.9193
26,1.9193
27,1.0787
28,1.3309
29,1.1628
30,0.9106200000000001
31,1.0787
32,1.2469
33,1.1628
34,1.8353
35,2.5918
36,1.7512
37,0.74251
38,0.74251
39,0.65845
40,0.49033000000000004
41,0.070048
42,-0.01401
43,-0.01401
44,-0.01401
45,-0.68647
46,-0.35024
47,1.9193
48,0.23815999999999998
49,-0.8545799999999999
50,-0.68647
51,-0.8545799999999999
52,-0.8545799999999999
53,-0.8545799999999999
54,-0.8545799999999999
55,-0.8545799999999999
56,-0.8545799999999999
57,-0.8545799999999999
58,-0.8545799999999999
59,-0.8545799999999999
60,-0.8545799999999999
61,-0.8545799999999999
62,-0.8545799999999999
63,-0.8545799999999999
64,-0.8545799999999999
65,-0.4343
66,0.9106200000000001
67,1.9193
68,1.2469
69,1.2469
70,0.9106200000000001
71,0.9106200000000001
72,1.1628
73,0.8265600000000001
74,0.74251
75,1.0787
76,0.9946799999999999
77,0.9106200000000001
78,1.2469
79,1.1628
80,0.9106200000000001
81,1.1628
82,0.9946799999999999
83,0.8265600000000001
84,0.9106200000000001
85,0.9106200000000001
86,-0.26618
87,-0.8545799999999999
88,-0.8545799999999999
89,-0.8545799999999999
90,-0.8545799999999999
91,-0.8545799999999999
92,-0.8545799999999999
93,-0.8545799999999999
94,-0.8545799999999999
95,-0.8545799999999999
