time,value
0,-0.19644
1,-0.19644
2,-0.19644
3,-0.19644
4,-0.19644
5,-0.19644
6,-0.19644
7,-0.19644
8,-0.19644
9,-0.19644
10,-0.19644
11,-0.19644
12,-0.19644
13,-0.19644
14,-0.19644
15,-0.19644
16,-0.19644
17,-0.19644
18,-0.19644
19,-0.19644
20,-0.19644
21,-0.19644
22,-0.19644
23,-0.19644
24,-0.19644
25,-0.19644
26,-0.19644
27,-0.19644
28,-0.19644
29,-0.19644
30,-0.19644
31,-0.19644
32,-0.19644
33,-0.19644
34,-0.19644
35,-0.19644
36,-0.19644
37,-0.19644
38,-0.19644
39,-0.19644
40,-0.19644
41,-0.19644
42,3.3459
43,5.1171
44,-0.19644
45,-0.19644
46,-0.19644
47,-0.19644
48,-0.19644
49,-0.19644
50,-0.19644
51,-0.19644
52,-0.19644
53,-0.19644
54,-0.19644
55,-0.19644
56,1.8873
57,-0.19644
58,-0.19644
59,-0.19644
60,-0.19644
61,-0.19644
62,-0.19644
63,-0.19644
64,-0.19644
65,-0.19644
66,-0.19644
67,-0.19644
68,-0.19644
69,-0.19644
70,-0.19644
71,-0.19644
72,-0.19644
73,-0.19644
74,-0.19644
75,-0.19644
76,-0.19644
77,-0.19644
78,-0.19644
79,-0.19644
80,-0.19644
81,-0.19644
82,7.0967
83,0.42868999999999996
84,-0.19644
85,-0.19644
86,-0.19644
87,-0.19644
88,-0.19644
89,-0.19644
90,-0.19644
91,-0.19644
92,-0.19644
93,-0.19644
94,-0.19644
95,-0.19644
