time,value
0,-1.1142
1,-1.1142
2,-1.1142
3,-1.1142
4,-1.1142
5,-1.1142
6,1.1923
7,1.2884
8,1.0962
9,0.9040100000000001
10,1.0001
11,0.9040100000000001
12,0.8079
13,0.9040100000000001
14,0.8079
15,0.8079
16,0.8079
17,0.7117899999999999
18,-1.1142
19,-1.1142
20,-1.1142
21,-1.1142
22,-1.1142
23,-1.1142
24,-1.1142
25,-1.1142
26,-1.1142
27,-0.34539000000000003
28,1.2884
29,1.1923
30,1.0001
31,0.9040100000000001
32,0.9040100000000001
33,0.8079
34,0.8079
35,0.8079
36,0.8079
37,0.8079
38,0.8079
39,0.13515
40,-1.1142
41,-1.1142
42,-1.1142
43,-1.1142
44,-1.1142
45,-1.1142
46,-1.1142
47,-1.1142
48,-0.63371
49,1.2884
50,1.2884
51,1.0001
52,0.9040100000000001
53,0.9040100000000001
54,0.8079
55,0.9040100000000001
56,0.8079
57,0.8079
58,0.7117899999999999
59,0.9040100000000001
60,0.8079
61,0.7117899999999999
62,0.8079
63,0.8079
64,-1.1142
65,-1.1142
66,-1.1142
67,-1.1142
68,-1.1142
69,-1.1142
70,-1.1142
71,-1.1142
72,-1.1142
73,0.23126
74,1.2884
75,1.0962
76,1.0001
77,0.9040100000000001
78,0.9040100000000001
79,0.8079
80,0.8079
81,0.8079
82,0.8079
83,0.8079
84,0.8079
85,0.51958
86,-1.1142
87,-1.1142
88,-1.1142
89,-1.1142
90,-1.1142
91,-1.1142
92,-1.1142
93,-1.1142
94,-1.1142
95,0.9040100000000001
