time,value
0,-0.30054000000000003
1,-0.30054000000000003
2,-0.30054000000000003
3,-0.30054000000000003
4,-0.30054000000000003
5,-0.30054000000000003
6,-0.30054000000000003
7,-0.30054000000000003
8,-0.30054000000000003
9,-0.30054000000000003
10,-0.30054000000000003
11,-0.30054000000000003
12,-0.30054000000000003
13,-0.30054000000000003
14,-0.30054000000000003
15,-0.30054000000000003
16,-0.30054000000000003
17,-0.30054000000000003
18,-0.30054000000000003
19,-0.30054000000000003
20,-0.30054000000000003
21,-0.30054000000000003
22,-0.30054000000000003
23,-0.30054000000000003
24,-0.30054000000000003
25,-0.30054000000000003
26,-0.30054000000000003
27,-0.30054000000000003
28,-0.30054000000000003
29,-0.30054000000000003
30,-0.30054000000000003
31,-0.30054000000000003
32,-0.30054000000000003
33,-0.30054000000000003
34,-0.30054000000000003
35,-0.30054000000000003
36,-0.30054000000000003
37,-0.30054000000000003
38,-0.30054000000000003
39,-0.30054000000000003
40,-0.30054000000000003
41,-0.30054000000000003
42,-0.30054000000000003
43,-0.006669
44,0.087791
45,-0.30054000000000003
46,-0.30054000000000003
47,-0.30054000000000003
48,-0.30054000000000003
49,-0.30054000000000003
50,-0.30054000000000003
51,-0.30054000000000003
52,0.21374
53,0.14027
54,1.9769999999999999
55,4.412
56,1.9035
57,2.061
58,-0.30054000000000003
59,-0.30054000000000003
60,-0.30054000000000003
61,-0.30054000000000003
62,-0.30054000000000003
63,-0.30054000000000003
64,-0.30054000000000003
65,-0.30054000000000003
66,-0.30054000000000003
67,-0.30054000000000003
68,-0.30054000000000003
69,-0.30054000000000003
70,-0.30054000000000003
71,6.0493
72,2.1764
73,1.4627
74,1.0324
75,3.4149
76,-0.27955
77,-0.30054000000000003
78,-0.30054000000000003
79,-0.30054000000000003
80,-0.30054000000000003
81,-0.30054000000000003
82,-0.30054000000000003
83,-0.30054000000000003
84,-0.30054000000000003
85,-0.30054000000000003
86,-0.30054000000000003
87,-0.30054000000000003
88,-0.30054000000000003
89,-0.30054000000000003
90,-0.30054000000000003
91,-0.30054000000000003
92,-0.30054000000000003
93,-0.30054000000000003
94,-0.30054000000000003
95,-0.30054000000000003
