time,value
0,-0.51705
1,-0.51705
2,-0.51705
3,-0.51705
4,-0.51705
5,-0.51705
6,-0.51705
7,-0.51705
8,-0.51705
9,-0.51705
10,-0.51705
11,-0.51705
12,-0.51705
13,-0.51705
14,-0.51705
15,-0.51705
16,-0.51705
17,-0.51705
18,-0.51705
19,-0.51705
20,-0.51705
21,-0.51705
22,-0.51705
23,-0.51705
24,-0.51705
25,-0.51705
26,-0.51705
27,-0.51705
28,-0.51705
29,-0.51705
30,-0.51705
31,-0.51705
32,-0.51705
33,-0.51705
34,-0.51705
35,-0.51705
36,-0.51705
37,-0.51705
38,0.48717
39,-0.30186
40,1.3479
41,2.2804
42,2.3521
43,0.27198
44,-0.51705
45,-0.51705
46,-0.51705
47,-0.51705
48,-0.51705
49,-0.51705
50,-0.51705
51,-0.51705
52,-0.51705
53,1.4914
54,2.4239
55,2.0652
56,2.3521
57,2.137
58,2.2804
59,2.137
60,2.137
61,0.63063
62,-0.51705
63,-0.51705
64,-0.51705
65,-0.51705
66,-0.51705
67,-0.51705
68,-0.51705
69,-0.51705
70,-0.51705
71,-0.51705
72,-0.51705
73,-0.51705
74,-0.51705
75,-0.51705
76,-0.51705
77,-0.51705
78,-0.51705
79,-0.51705
80,-0.51705
81,-0.51705
82,1.9935
83,1.4197
84,-0.51705
85,-0.51705
86,-0.086674
87,2.2804
88,2.2804
89,2.2087
90,2.137
91,0.48717
92,-0.30186
93,-0.30186
94,-0.23013000000000003
95,-0.30186
