time,value
0,-0.7278399999999999
1,-0.7278399999999999
2,-0.7278399999999999
3,-0.7278399999999999
4,-0.7278399999999999
5,-0.7278399999999999
6,-0.7278399999999999
7,-0.7278399999999999
8,-0.7278399999999999
9,-0.7278399999999999
10,-0.7278399999999999
11,-0.7278399999999999
12,-0.7278399999999999
13,-0.7278399999999999
14,-0.7278399999999999
15,-0.7278399999999999
16,-0.7278399999999999
17,-0.7278399999999999
18,-0.7278399999999999
19,-0.7278399999999999
20,-0.7278399999999999
21,-0.7278399999999999
22,-0.7278399999999999
23,-0.7278399999999999
24,-0.7278399999999999
25,-0.7278399999999999
26,-0.7278399999999999
27,-0.7278399999999999
28,-0.7278399999999999
29,-0.7278399999999999
30,-0.7278399999999999
31,-0.7278399999999999
32,-0.7278399999999999
33,-0.42666000000000004
34,0.47686000000000006
35,0.025098
36,1.531
37,-0.12549000000000002
38,0.32627
39,0.32627
40,-0.27608
41,0.025098
42,-0.27608
43,1.2298
44,2.1333
45,1.531
46,1.6816
47,1.531
48,0.17569
49,1.3804
50,0.47686000000000006
51,1.3804
52,0.77804
53,-0.42666000000000004
54,1.0792
55,0.9286200000000001
56,0.47686000000000006
57,-0.42666000000000004
58,0.9286200000000001
59,1.8321
60,1.3804
61,1.531
62,0.9286200000000001
63,0.32627
64,0.025098
65,1.531
66,-0.27608
67,0.025098
68,1.8321
69,0.62745
70,1.2298
71,-0.42666000000000004
72,0.025098
73,-0.7278399999999999
74,-0.42666000000000004
75,-0.42666000000000004
76,-0.7278399999999999
77,-0.7278399999999999
78,-0.7278399999999999
79,-0.7278399999999999
80,-0.7278399999999999
81,-0.7278399999999999
82,-0.7278399999999999
83,-0.7278399999999999
84,-0.7278399999999999
85,-0.7278399999999999
86,2.2839
87,3.338
88,2.4345
89,2.1333
90,-0.7278399999999999
91,-0.7278399999999999
92,-0.7278399999999999
93,-0.7278399999999999
94,-0.7278399999999999
95,-0.7278399999999999
