time,value
0,-0.1031
1,-0.1031
2,-0.1031
3,-0.1031
4,-0.1031
5,-0.1031
6,-0.1031
7,-0.1031
8,-0.1031
9,-0.1031
10,-0.1031
11,-0.1031
12,-0.1031
13,-0.1031
14,-0.1031
15,-0.1031
16,-0.1031
17,-0.1031
18,-0.1031
19,-0.1031
20,-0.1031
21,-0.1031
22,-0.1031
23,-0.1031
24,-0.1031
25,-0.1031
26,-0.1031
27,-0.1031
28,-0.1031
29,-0.1031
30,-0.1031
31,-0.1031
32,-0.1031
33,-0.1031
34,-0.1031
35,-0.1031
36,-0.1031
37,-0.1031
38,-0.1031
39,-0.1031
40,-0.1031
41,-0.1031
42,-0.1031
43,-0.1031
44,-0.1031
45,-0.1031
46,-0.1031
47,-0.1031
48,-0.1031
49,-0.1031
50,-0.1031
51,-0.1031
52,-0.1031
53,-0.1031
54,-0.1031
55,-0.1031
56,-0.1031
57,-0.1031
58,-0.1031
59,-0.1031
60,-0.1031
61,-0.1031
62,-0.1031
63,-0.1031
64,-0.1031
65,-0.1031
66,-0.1031
67,9.6954
68,-0.0041239
69,-0.1031
70,-0.1031
71,-0.1031
72,-0.1031
73,-0.1031
74,-0.1031
75,-0.1031
76,-0.1031
77,-0.1031
78,-0.1031
79,-0.1031
80,-0.1031
81,-0.1031
82,-0.1031
83,-0.1031
84,-0.1031
85,-0.1031
86,-0.1031
87,-0.1031
88,-0.1031
89,-0.1031
90,-0.1031
91,-0.1031
92,-0.1031
93,-0.1031
94,-0.1031
95,-0.1031
