time,value
0,1.9567
1,0.6624899999999999
2,-0.63168
3,-0.63168
4,-0.63168
5,-0.63168
6,-0.63168
7,0.6624899999999999
8,1.9567
9,1.2171
10,-0.63168
11,-0.63168
12,-0.63168
13,-0.63168
14,-0.63168
15,-0.63168
16,1.5869
17,2.1415
18,0.10785
19,-0.63168
20,-0.63168
21,-0.63168
22,-0.63168
23,-0.63168
24,-0.63168
25,1.9567
26,1.7718
27,-0.077034
28,-0.63168
29,-0.63168
30,-0.63168
31,-0.63168
32,-0.63168
33,-0.63168
34,1.9567
35,1.9567
36,-0.26191
37,-0.63168
38,-0.63168
39,-0.63168
40,-0.63168
41,-0.63168
42,-0.63168
43,1.7718
44,1.9567
45,-0.077034
46,-0.63168
47,-0.63168
48,-0.63168
49,-0.63168
50,-0.63168
51,-0.63168
52,1.5869
53,1.9567
54,0.47761000000000003
55,-0.63168
56,-0.63168
57,-0.63168
58,-0.63168
59,-0.63168
60,-0.63168
61,1.5869
62,1.9567
63,0.29273000000000005
64,-0.63168
65,-0.63168
66,-0.63168
67,-0.63168
68,-0.63168
69,-0.63168
70,1.402
71,1.9567
72,0.47761000000000003
73,-0.63168
74,-0.63168
75,-0.63168
76,-0.63168
77,-0.63168
78,-0.63168
79,1.0323
80,1.9567
81,0.6624899999999999
82,-0.63168
83,-0.63168
84,-0.63168
85,-0.63168
86,-0.63168
87,-0.63168
88,0.47761000000000003
89,2.1415
90,1.2171
91,-0.63168
92,-0.63168
93,-0.63168
94,-0.63168
95,-0.63168
