time,value
0,1.0508
1,0.59227
2,-1.7004
3,1.0508
4,0.59227
5,-0.78333
6,0.13374
7,1.0508
8,0.13374
9,-1.7004
10,1.0508
11,1.0508
12,-1.7004
13,0.59227
14,1.0508
15,-0.78333
16,-0.3248
17,1.0508
18,0.13374
19,-0.78333
20,0.59227
21,0.59227
22,-1.7004
23,0.59227
24,1.0508
25,-1.7004
26,0.59227
27,1.0508
28,-1.7004
29,0.59227
30,1.0508
31,-1.7004
32,0.59227
33,0.59227
34,-1.7004
35,0.59227
36,0.59227
37,-1.7004
38,0.59227
39,0.59227
40,-1.7004
41,0.59227
42,0.59227
43,-0.78333
44,0.13374
45,0.59227
46,-0.78333
47,-0.3248
48,1.0508
49,-0.78333
50,-0.3248
51,1.0508
52,-0.78333
53,-0.3248
54,0.59227
55,0.13374
56,-0.78333
57,0.59227
58,0.13374
59,-0.78333
60,0.59227
61,0.59227
62,-1.7004
63,0.59227
64,1.0508
65,-1.7004
66,0.59227
67,1.0508
68,-1.7004
69,0.59227
70,1.0508
71,-0.78333
72,0.13374
73,0.59227
74,0.59227
75,-1.7004
76,0.59227
77,1.0508
78,-1.7004
79,0.59227
80,1.0508
81,-1.7004
82,0.59227
83,1.0508
84,-0.78333
85,-0.3248
86,1.0508
87,-0.3248
88,-0.78333
89,1.0508
90,0.13374
91,-1.7004
92,1.0508
93,0.59227
94,-1.7004
95,1.0508
