time,value
0,-1.2681
1,-1.1402
2,-0.9222899999999999
3,-0.6246
4,-0.27625
5,0.082485
6,0.40378000000000003
7,0.6520699999999999
8,0.81275
9,0.9039299999999999
10,0.95726
11,0.99955
12,1.042
13,1.0784
14,1.0961
15,1.0751
16,1.0024
17,0.878
18,0.7207100000000001
19,0.5575600000000001
20,0.40548
21,0.27008000000000004
22,0.14868
23,0.042931
24,-0.046836
25,-0.12385
26,-0.19233
27,-0.25138
28,-0.29512
29,-0.32449
30,-0.34581
31,-0.37327
32,-0.40598
33,-0.44042
34,-0.46893
35,-0.49026000000000003
36,-0.5100899999999999
37,-0.52582
38,-0.5424899999999999
39,-0.55765
40,-0.57681
41,-0.59844
42,-0.6189399999999999
43,-0.6393399999999999
44,-0.65914
45,-0.687
46,-0.72307
47,-0.76807
48,-0.8177300000000001
49,-0.86793
50,-0.91635
51,-0.9577100000000001
52,-0.9933200000000001
53,-1.0218
54,-1.0457
55,-1.0647
56,-1.0755
57,-1.0836
58,-1.0869
59,-1.0922
60,-1.0952
61,-1.094
62,-1.0922
63,-1.0892
64,-1.0963
65,-1.1067
66,-1.1238
67,-1.1421
68,-1.1595
69,-1.1762
70,-1.1837
71,-1.1835
72,-1.1623
73,-1.1105
74,-1.0058
75,-0.82834
76,-0.57207
77,-0.24450999999999998
78,0.1248
79,0.50743
80,0.8739600000000001
81,1.2086
82,1.5012
83,1.744
84,1.933
85,2.0624
86,2.1355
87,2.155
88,2.1309
89,2.075
90,1.9994
91,1.9126
92,1.8093
93,1.6831
94,1.5268
95,1.3486
96,1.1606
97,0.9720700000000001
98,0.79085
99,0.61728
100,0.46318000000000004
101,0.33133
102,0.228
103,0.14479
104,0.074184
105,0.011295999999999999
106,-0.048812
107,-0.10001
108,-0.15228
109,-0.19776
110,-0.23843000000000003
111,-0.25943
112,-0.24722
113,-0.19646
114,-0.10254
115,0.018073
116,0.16498
117,0.32581
118,0.49658
119,0.6638
120,0.80805
121,0.9170200000000001
122,0.9777899999999999
123,1.0001
124,0.9925299999999999
125,0.97129
126,0.946
127,0.9208700000000001
128,0.8989799999999999
129,0.87498
130,0.84767
131,0.80794
132,0.75188
133,0.67804
134,0.5905699999999999
135,0.49718999999999997
136,0.3984
137,0.29636
138,0.18864
139,0.081048
140,-0.021741
141,-0.1174
142,-0.20688
143,-0.29701
144,-0.3833
145,-0.46758999999999995
146,-0.5442
147,-0.61375
148,-0.6734600000000001
149,-0.71841
150,-0.7531399999999999
151,-0.77772
152,-0.80324
153,-0.8286399999999999
154,-0.85364
155,-0.87456
156,-0.88886
157,-0.90105
158,-0.9059999999999999
159,-0.90615
160,-0.8967299999999999
161,-0.8798799999999999
162,-0.8595
163,-0.8375
164,-0.82234
165,-0.8102699999999999
166,-0.80255
167,-0.79342
168,-0.78235
169,-0.77446
170,-0.76974
171,-0.77379
172,-0.77535
173,-0.7752899999999999
174,-0.77327
175,-0.77403
176,-0.78593
177,-0.7953399999999999
178,-0.7953399999999999
179,-0.76174
180,-0.69175
181,-0.58791
182,-0.45962
183,-0.32285
184,-0.18248
185,-0.055102
186,0.056622000000000006
187,0.14737
188,0.22821
189,0.31909
190,0.44065
191,0.61716
192,0.8607600000000001
193,1.1827
194,1.5711
195,1.9937
196,2.3937
197,2.7077
198,2.8962
199,2.9544
200,2.9169
201,2.8245
202,2.7079
203,2.575
204,2.423
205,2.2532
206,2.0709
207,1.8876
208,1.7036
209,1.5182
210,1.3247
211,1.124
212,0.92525
213,0.73995
214,0.58243
215,0.44943
216,0.3356
217,0.22388000000000002
218,0.1078
219,-0.01238
220,-0.12949000000000002
221,-0.22776
222,-0.30831
223,-0.36079
224,-0.39277
225,-0.40045
226,-0.38843
227,-0.36798000000000003
228,-0.34539000000000003
229,-0.33525
230,-0.32966
231,-0.33158000000000004
232,-0.33837
233,-0.35404
234,-0.37943000000000005
235,-0.40406
236,-0.42685
237,-0.44348000000000004
238,-0.46356
239,-0.48893000000000003
240,-0.5177
241,-0.5455899999999999
242,-0.5675399999999999
243,-0.58629
244,-0.60025
245,-0.6128
246,-0.62474
247,-0.63937
248,-0.65754
249,-0.6764899999999999
250,-0.69484
251,-0.70914
252,-0.72064
253,-0.7280399999999999
254,-0.7337199999999999
255,-0.74122
256,-0.75266
257,-0.7678699999999999
258,-0.7804399999999999
259,-0.79246
260,-0.81075
261,-0.8449
262,-0.8956
263,-0.95762
264,-1.0315
265,-1.1186
266,-1.2141
267,-1.295
268,-1.3386
269,-1.3428
