time,value
0,-0.81753
1,-0.7588600000000001
2,-0.73049
3,-0.74165
4,-0.75957
5,-0.7770699999999999
6,-0.76235
7,-0.6803100000000001
8,-0.48245
9,-0.10121000000000001
10,0.39883
11,0.76877
12,0.89489
13,0.89933
14,0.86971
15,0.8022100000000001
16,0.69687
17,0.5572
18,0.39319
19,0.22705
20,0.07921399999999999
21,-0.046266
22,-0.16132
23,-0.2701
24,-0.37217
25,-0.46403
26,-0.54596
27,-0.61457
28,-0.66757
29,-0.71068
30,-0.73873
31,-0.75243
32,-0.75859
33,-0.7679
34,-0.77253
35,-0.7641899999999999
36,-0.74359
37,-0.69844
38,-0.64166
39,-0.57199
40,-0.45792
41,-0.26518
42,0.016304
43,0.29116
44,0.43501999999999996
45,0.45393
46,0.41494
47,0.35313
48,0.28679
49,0.2194
50,0.13043
51,0.0077608
52,-0.12429000000000001
53,-0.25884
54,-0.40010999999999997
55,-0.53132
56,-0.62675
57,-0.67718
58,-0.70144
59,-0.71367
60,-0.72064
61,-0.72833
62,-0.73141
63,-0.73433
64,-0.7426
65,-0.74721
66,-0.7550899999999999
67,-0.76756
68,-0.77046
69,-0.77051
70,-0.77833
71,-0.78232
72,-0.77415
73,-0.7620600000000001
74,-0.74992
75,-0.72985
76,-0.70519
77,-0.6765
78,-0.6447
79,-0.62039
80,-0.59309
81,-0.5077
82,-0.19074000000000002
83,0.48523999999999995
84,1.4011
85,2.1836
86,2.5883
87,2.7739
88,2.858
89,2.8321
90,2.7135
91,2.511
92,2.2293
93,1.901
94,1.6253
95,1.4676
96,1.3979
97,1.3178
98,1.2091
99,1.1301
100,1.0901
101,1.104
102,1.1877
103,1.3487
104,1.6079
105,1.9039
106,2.1002
107,2.1395
108,2.0841
109,2.0015
110,1.8639
111,1.6349
112,1.3361
113,0.99079
114,0.6169
115,0.24698
116,-0.07518
117,-0.31587
118,-0.47945
119,-0.58336
120,-0.63366
121,-0.6484300000000001
122,-0.6532600000000001
123,-0.65896
124,-0.66484
125,-0.6714600000000001
126,-0.67467
127,-0.6721199999999999
128,-0.6685
129,-0.6683
130,-0.6806399999999999
131,-0.70117
132,-0.71542
133,-0.72373
134,-0.72611
135,-0.7209
136,-0.7088800000000001
137,-0.6812199999999999
138,-0.64357
139,-0.58883
140,-0.45313000000000003
141,-0.20058
142,0.10388
143,0.33669
144,0.44081000000000004
145,0.50264
146,0.59196
147,0.68514
148,0.7227
149,0.6560600000000001
150,0.49675
151,0.28194
152,0.049010000000000005
153,-0.17606
154,-0.3833
155,-0.5591
156,-0.68108
157,-0.74636
158,-0.77733
159,-0.78808
160,-0.78709
161,-0.79005
162,-0.80006
163,-0.80493
164,-0.80155
165,-0.79259
166,-0.77928
167,-0.77545
168,-0.78035
169,-0.7912899999999999
170,-0.8044
171,-0.81253
172,-0.8264100000000001
173,-0.83699
174,-0.8413
175,-0.81545
176,-0.6826800000000001
177,-0.40485
178,-0.07028
179,0.18692999999999999
180,0.34847
181,0.46595
182,0.55316
183,0.5875600000000001
184,0.55813
185,0.47758999999999996
186,0.36129
187,0.23494
188,0.13332
189,0.07184600000000001
190,0.030879000000000004
191,-0.007552199999999999
192,-0.034977
193,-0.058924000000000004
194,-0.10044
195,-0.15943
196,-0.24174
197,-0.33739
198,-0.4315
199,-0.52684
200,-0.61064
201,-0.67411
202,-0.70834
203,-0.71812
204,-0.72065
205,-0.72239
206,-0.7286699999999999
207,-0.7383
208,-0.74431
209,-0.74485
210,-0.74326
211,-0.73649
212,-0.73061
213,-0.73124
214,-0.73192
215,-0.73058
216,-0.72182
217,-0.7037
218,-0.67997
219,-0.65492
220,-0.61297
221,-0.4691
222,-0.10202
223,0.58848
224,1.5864
225,2.5736
226,3.1807
227,3.4012
228,3.4138
229,3.2908
230,3.0357
231,2.6548
232,2.1754
233,1.646
234,1.1333
235,0.71028
236,0.39771999999999996
237,0.18028
238,0.050608
239,-0.0025913
240,-0.008759200000000002
241,-0.019806
242,-0.060032
243,-0.10486
244,-0.15202000000000002
245,-0.20673000000000002
246,-0.26755999999999996
247,-0.33805999999999997
248,-0.41136999999999996
249,-0.48318
250,-0.54471
251,-0.5886600000000001
252,-0.62537
253,-0.65263
254,-0.66532
255,-0.6734899999999999
256,-0.67861
257,-0.67875
258,-0.67303
259,-0.65677
260,-0.62821
261,-0.5929800000000001
262,-0.56308
263,-0.54203
264,-0.53
265,-0.53275
266,-0.55079
267,-0.60943
268,-0.6798
269,-0.76053
