time,value
0,-0.043618000000000004
1,-0.043618000000000004
2,-0.043618000000000004
3,-0.34271
4,-0.043618000000000004
5,-0.34271
6,-0.043618000000000004
7,-0.043618000000000004
8,-0.34271
9,-0.043618000000000004
10,-0.043618000000000004
11,-0.34271
12,-0.043618000000000004
13,-0.043618000000000004
14,-0.34271
15,-0.043618000000000004
16,-0.043618000000000004
17,-0.043618000000000004
18,-0.34271
19,-0.043618000000000004
20,-0.043618000000000004
21,-0.34271
22,-0.043618000000000004
23,-0.34271
24,-0.043618000000000004
25,-0.34271
26,-0.043618000000000004
27,-0.34271
28,-0.043618000000000004
29,-0.043618000000000004
30,-0.34271
31,-0.043618000000000004
32,-0.34271
33,-0.043618000000000004
34,-0.043618000000000004
35,-0.34271
36,-0.043618000000000004
37,-0.043618000000000004
38,-0.34271
39,-0.043618000000000004
40,-0.34271
41,-0.043618000000000004
42,-0.043618000000000004
43,-0.34271
44,-0.043618000000000004
45,-0.34271
46,-0.043618000000000004
47,-0.34271
48,-0.043618000000000004
49,-0.34271
50,-0.043618000000000004
51,-0.34271
52,-0.043618000000000004
53,-0.34271
54,-0.043618000000000004
55,-0.34271
56,-0.043618000000000004
57,-0.34271
58,-0.043618000000000004
59,-0.34271
60,-0.043618000000000004
61,-0.34271
62,-0.043618000000000004
63,-0.043618000000000004
64,-0.34271
65,-0.043618000000000004
66,-0.34271
67,-0.043618000000000004
68,-0.34271
69,-0.043618000000000004
70,-0.34271
71,-0.043618000000000004
72,-0.34271
73,-0.043618000000000004
74,-0.34271
75,-0.043618000000000004
76,-0.34271
77,-0.043618000000000004
78,-0.34271
79,-0.043618000000000004
80,-0.34271
81,-0.043618000000000004
82,-0.34271
83,-0.043618000000000004
84,-0.34271
85,-0.043618000000000004
86,-0.043618000000000004
87,-0.34271
88,6.2374
89,6.5365
90,2.9473
91,-0.043618000000000004
92,-0.043618000000000004
93,-0.34271
94,-0.043618000000000004
95,-0.34271
