time,value
0,-0.23805
1,-0.23805
2,-0.23805
3,-0.23805
4,-0.23805
5,-0.23805
6,-0.23805
7,-0.23805
8,-0.23805
9,-0.23805
10,-0.23805
11,-0.23805
12,-0.23805
13,-0.23805
14,-0.23805
15,-0.23805
16,-0.23805
17,-0.23805
18,-0.23805
19,-0.23805
20,-0.23805
21,-0.23805
22,-0.23805
23,-0.23805
24,-0.23805
25,-0.23805
26,-0.23805
27,-0.23805
28,-0.23805
29,-0.23805
30,-0.23805
31,-0.23805
32,-0.23805
33,-0.23805
34,-0.23805
35,-0.23805
36,4.2099
37,-0.23805
38,-0.23805
39,-0.23805
40,3.5580000000000003
41,-0.23805
42,-0.23805
43,-0.23805
44,-0.23805
45,4.2099
46,-0.23805
47,0.68221
48,-0.23805
49,-0.23805
50,-0.23805
51,-0.23805
52,-0.23805
53,-0.23805
54,-0.23805
55,-0.23805
56,-0.23805
57,3.1746
58,-0.23805
59,-0.23805
60,-0.23805
61,-0.23805
62,-0.23805
63,-0.23805
64,-0.23805
65,-0.23805
66,-0.23805
67,-0.23805
68,-0.23805
69,-0.23805
70,-0.23805
71,-0.23805
72,-0.23805
73,-0.23805
74,-0.23805
75,-0.23805
76,-0.23805
77,-0.23805
78,-0.23805
79,-0.23805
80,-0.23805
81,-0.23805
82,5.5903
83,-0.23805
84,-0.23805
85,-0.23805
86,-0.23805
87,-0.23805
88,-0.23805
89,-0.23805
90,-0.23805
91,-0.23805
92,-0.23805
93,-0.23805
94,-0.23805
95,-0.23805
