time,value
0,0.35700000000000004
1,0.35700000000000004
2,0.35700000000000004
3,0.35700000000000004
4,0.35700000000000004
5,0.35700000000000004
6,0.19907
7,0.35700000000000004
8,0.35700000000000004
9,0.35700000000000004
10,0.35700000000000004
11,0.35700000000000004
12,0.35700000000000004
13,0.35700000000000004
14,0.35700000000000004
15,0.19907
16,0.35700000000000004
17,0.35700000000000004
18,0.35700000000000004
19,0.35700000000000004
20,0.35700000000000004
21,0.35700000000000004
22,0.35700000000000004
23,0.35700000000000004
24,0.35700000000000004
25,0.19907
26,0.35700000000000004
27,0.35700000000000004
28,0.35700000000000004
29,0.35700000000000004
30,0.19907
31,0.35700000000000004
32,0.35700000000000004
33,0.35700000000000004
34,0.35700000000000004
35,0.35700000000000004
36,0.35700000000000004
37,0.35700000000000004
38,0.35700000000000004
39,0.35700000000000004
40,0.35700000000000004
41,0.35700000000000004
42,0.35700000000000004
43,0.19907
44,0.35700000000000004
45,0.51494
46,0.35700000000000004
47,0.35700000000000004
48,0.35700000000000004
49,0.35700000000000004
50,0.35700000000000004
51,0.35700000000000004
52,0.35700000000000004
53,0.35700000000000004
54,0.35700000000000004
55,0.51494
56,0.35700000000000004
57,0.19907
58,0.35700000000000004
59,0.35700000000000004
60,0.35700000000000004
61,0.35700000000000004
62,0.35700000000000004
63,0.35700000000000004
64,0.19907
65,0.35700000000000004
66,0.35700000000000004
67,0.35700000000000004
68,0.19907
69,0.35700000000000004
70,0.35700000000000004
71,0.35700000000000004
72,0.19907
73,0.35700000000000004
74,0.35700000000000004
75,0.35700000000000004
76,0.19907
77,0.35700000000000004
78,0.35700000000000004
79,0.35700000000000004
80,0.19907
81,-1.3803
82,-2.8017
83,-2.8017
84,-2.8017
85,-2.8017
86,-2.8017
87,-2.8017
88,-2.8017
89,-2.8017
90,-2.8017
91,-2.8017
92,-1.2224
93,1.3046
94,1.1467
95,0.67288
