time,value
0,-0.26637
1,-0.26637
2,-0.26637
3,-0.26637
4,-0.26637
5,-0.049661000000000004
6,-0.26637
7,-0.26637
8,-0.26637
9,-0.26637
10,-0.26637
11,-0.26637
12,-0.26637
13,-0.26637
14,-0.26637
15,-0.26637
16,-0.26637
17,-0.26637
18,-0.26637
19,-0.26637
20,-0.26637
21,-0.26637
22,-0.26637
23,-0.26637
24,-0.26637
25,-0.26637
26,-0.26637
27,-0.26637
28,-0.26637
29,-0.26637
30,-0.26637
31,-0.26637
32,-0.26637
33,-0.26637
34,-0.26637
35,-0.26637
36,-0.26637
37,-0.26637
38,-0.26637
39,-0.26637
40,-0.26637
41,-0.26637
42,-0.26637
43,-0.26637
44,-0.26637
45,-0.26637
46,-0.26637
47,-0.26637
48,-0.26637
49,-0.26637
50,-0.26637
51,-0.26637
52,-0.049661000000000004
53,-0.26637
54,-0.26637
55,-0.26637
56,-0.26637
57,-0.26637
58,-0.26637
59,-0.26637
60,-0.26637
61,-0.26637
62,-0.26637
63,-0.26637
64,-0.26637
65,-0.26637
66,-0.26637
67,-0.26637
68,-0.26637
69,-0.26637
70,-0.26637
71,-0.26637
72,-0.26637
73,0.81716
74,-0.26637
75,-0.26637
76,-0.26637
77,-0.26637
78,-0.26637
79,-0.26637
80,-0.26637
81,-0.26637
82,-0.26637
83,-0.26637
84,-0.049661000000000004
85,-0.26637
86,2.9842
87,3.6343
88,3.4176
89,3.6343
90,3.4176
91,3.6343
92,3.4176
93,0.16704000000000002
94,-1.5666
95,-1.5666
