time,value
0,-0.26844
1,-0.26844
2,-0.26844
3,-0.26844
4,-0.26844
5,-0.26844
6,-0.26844
7,-0.26844
8,-0.26844
9,-0.26844
10,-0.26844
11,-0.26844
12,-0.26844
13,-0.26844
14,-0.26844
15,-0.26844
16,-0.26844
17,-0.26844
18,-0.26844
19,-0.26844
20,-0.26844
21,-0.26844
22,-0.26844
23,-0.26844
24,-0.26844
25,-0.26844
26,-0.26844
27,-0.26844
28,-0.26844
29,-0.26844
30,-0.26844
31,-0.26844
32,-0.26844
33,-0.26844
34,-0.26844
35,-0.26844
36,-0.26844
37,-0.26844
38,-0.26844
39,-0.26844
40,-0.26844
41,-0.26844
42,-0.26844
43,-0.26844
44,-0.26844
45,-0.26844
46,-0.26844
47,-0.26844
48,-0.26844
49,-0.26844
50,-0.26844
51,-0.26844
52,-0.26844
53,-0.26844
54,-0.26844
55,-0.26844
56,-0.26844
57,-0.26844
58,-0.26844
59,-0.26844
60,-0.26844
61,-0.26844
62,-0.26844
63,-0.26844
64,-0.26844
65,-0.26844
66,-0.26844
67,-0.26844
68,-0.26844
69,-0.26844
70,-0.26844
71,-0.26844
72,-0.26844
73,-0.26844
74,-0.26844
75,3.5697
76,4.118
77,2.4731
78,-0.26844
79,3.0214
80,5.2146
81,3.5697
82,1.9248
83,-0.26844
84,-0.26844
85,-0.26844
86,-0.26844
87,-0.26844
88,-0.26844
89,-0.26844
90,-0.26844
91,-0.26844
92,-0.26844
93,-0.26844
94,-0.26844
95,-0.26844
