time,value
0,-0.87469
1,-0.87469
2,-0.87469
3,-0.87469
4,-0.87469
5,-0.87469
6,-0.87469
7,-0.87469
8,-0.87469
9,-0.87469
10,-0.87469
11,-0.87469
12,-0.87469
13,-0.87469
14,-0.87469
15,-0.87469
16,-0.87469
17,-0.87469
18,-0.87469
19,-0.87469
20,-0.87469
21,-0.87469
22,-0.87469
23,-0.87469
24,-0.87469
25,-0.87469
26,-0.87469
27,-0.87469
28,-0.87469
29,-0.87469
30,-0.87469
31,-0.87469
32,-0.87469
33,0.78193
34,0.47131999999999996
35,0.47131999999999996
36,1.0925
37,0.9890100000000001
38,0.9890100000000001
39,0.9890100000000001
40,0.78193
41,0.8854700000000001
42,0.57485
43,0.6783899999999999
44,0.8854700000000001
45,-0.046377
46,0.26424000000000003
47,-0.25345
48,-0.14992
49,-0.25345
50,-0.87469
51,-0.87469
52,-0.87469
53,-0.87469
54,-0.87469
55,-0.87469
56,-0.87469
57,-0.87469
58,-0.87469
59,-0.87469
60,-0.87469
61,-0.87469
62,-0.87469
63,-0.87469
64,-0.87469
65,-0.56407
66,-0.87469
67,-0.87469
68,0.26424000000000003
69,2.4385
70,2.0244
71,1.7138
72,1.2996
73,1.6102
74,0.9890100000000001
75,1.2996
76,1.4032
77,0.9890100000000001
78,1.1961
79,1.4032
80,1.0925
81,1.0925
82,1.4032
83,1.0925
84,0.9890100000000001
85,1.2996
86,1.1961
87,0.9890100000000001
88,1.2996
89,1.1961
90,0.9890100000000001
91,1.1961
92,1.2996
93,1.2996
94,1.0925
95,0.9890100000000001
