time,value
0,-0.94395
1,0.73031
2,1.7767
3,0.83495
4,-0.94395
5,-0.94395
6,-0.42075
7,0.62567
8,-0.94395
9,-0.94395
10,0.62567
11,1.2535
12,-0.94395
13,0.9395899999999999
14,-0.94395
15,-0.94395
16,0.31174
17,-0.21145999999999998
18,0.73031
19,1.0442
20,-0.94395
21,-0.94395
22,0.10246
23,-0.00218
24,-0.94395
25,-0.94395
26,0.73031
27,1.8814
28,0.10246
29,-0.94395
30,-0.94395
31,0.9395899999999999
32,-0.94395
33,-0.94395
34,2.0906
35,-0.5253899999999999
36,0.2071
37,-0.21145999999999998
38,-0.94395
39,-0.94395
40,0.9395899999999999
41,0.9395899999999999
42,1.4628
43,-0.94395
44,-0.94395
45,-0.94395
46,1.0442
47,-0.94395
48,-0.94395
49,-0.00218
50,1.986
51,-0.94395
52,0.62567
53,-0.42075
54,-0.94395
55,0.62567
56,-0.21145999999999998
57,1.8814
58,0.41639
59,-0.94395
60,-0.94395
61,0.9395899999999999
62,-0.94395
63,-0.94395
64,-0.21145999999999998
65,0.10246
66,1.8814
67,0.10246
68,-0.94395
69,-0.94395
70,1.0442
71,-0.94395
72,-0.94395
73,0.52103
74,1.8814
75,-0.10682
76,0.52103
77,-0.94395
78,-0.94395
79,-0.3161
80,2.0906
81,1.3582
82,-0.94395
83,-0.94395
84,0.73031
85,-0.42075
86,0.83495
87,1.7767
88,-0.94395
89,-0.94395
90,0.83495
91,-0.63003
92,-0.94395
93,0.83495
94,1.8814
95,-0.7346699999999999
