time,value
0,-0.66989
1,-0.66989
2,-0.66989
3,-0.66989
4,-0.66989
5,-0.66989
6,0.40492
7,1.838
8,1.6589
9,0.22578
10,-0.66989
11,-0.66989
12,-0.66989
13,-0.66989
14,-0.66989
15,-0.66989
16,0.22578
17,1.838
18,1.6589
19,0.04665
20,-0.66989
21,-0.66989
22,-0.66989
23,-0.66989
24,-0.66989
25,-0.66989
26,0.22578
27,1.838
28,1.6589
29,0.7631899999999999
30,-0.66989
31,-0.66989
32,-0.66989
33,-0.66989
34,-0.66989
35,-0.66989
36,1.4797
37,1.838
38,0.94232
39,-0.66989
40,-0.66989
41,-0.66989
42,-0.66989
43,-0.66989
44,-0.66989
45,1.838
46,1.6589
47,0.58405
48,-0.66989
49,-0.66989
50,-0.66989
51,-0.66989
52,-0.66989
53,-0.66989
54,0.94232
55,1.838
56,1.3006
57,-0.66989
58,-0.66989
59,-0.66989
60,-0.66989
61,-0.66989
62,-0.66989
63,-0.66989
64,2.0171
65,1.6589
66,0.22578
67,-0.66989
68,-0.66989
69,-0.66989
70,-0.66989
71,-0.66989
72,-0.66989
73,1.3006
74,1.6589
75,1.6589
76,-0.66989
77,-0.66989
78,-0.66989
79,-0.66989
80,-0.66989
81,-0.66989
82,-0.66989
83,1.838
84,1.838
85,1.1215
86,-0.66989
87,-0.66989
88,-0.66989
89,-0.66989
90,-0.66989
91,-0.66989
92,-0.66989
93,1.838
94,1.6589
95,0.58405
