time,value
0,0.58298
1,-0.5109600000000001
2,-0.6422399999999999
3,-0.59848
4,0.1454
5,0.45171000000000006
6,-0.46721
7,-0.6422399999999999
8,-0.55472
9,0.1454
10,0.36419
11,-0.42345
12,-0.6422399999999999
13,-0.5109600000000001
14,0.057888
15,0.27668000000000004
16,-0.33593
17,-0.59848
18,-0.46721
19,0.057888
20,0.1454
21,-0.20465999999999998
22,-0.55472
23,-0.37969
24,0.014130000000000002
25,0.057888
26,-0.073385
27,-0.59848
28,-0.5109600000000001
29,5.3088
30,0.18916
31,5.1775
32,1.7644
33,0.23292
34,1.1518
35,0.93304
36,0.45171000000000006
37,-0.59848
38,-0.59848
39,-0.11714000000000001
40,2.7709
41,0.10165
42,-0.37969
43,-0.6422399999999999
44,-0.24841999999999997
45,0.057888
46,0.014130000000000002
47,-0.46721
48,-0.59848
49,-0.42345
50,0.1454
51,0.1454
52,1.7207
53,-0.6422399999999999
54,-0.46721
55,0.32043
56,0.057888
57,-0.59848
58,-0.59848
59,-0.6422399999999999
60,0.27668000000000004
61,0.27668000000000004
62,-0.6422399999999999
63,-0.59848
64,-0.6422399999999999
65,0.49546999999999997
66,0.1454
67,-0.6422399999999999
68,-0.59848
69,-0.6422399999999999
70,0.18916
71,0.27668000000000004
72,-0.46721
73,-0.6422399999999999
74,-0.59848
75,-0.11714000000000001
76,0.36419
77,-0.29217
78,-0.59848
79,-0.6422399999999999
80,-0.20465999999999998
81,2.6396
82,-0.073385
83,-0.59848
84,-0.6422399999999999
85,-0.42345
86,0.057888
87,0.057888
88,-0.37969
89,-0.6422399999999999
90,-0.46721
91,0.014130000000000002
92,-0.11714000000000001
93,-0.11714000000000001
94,-0.59848
95,-0.5109600000000001
