time,value
0,-0.7131
1,-0.7131
2,2.108
3,0.41531999999999997
4,-0.7131
5,-0.7131
6,-0.7131
7,1.5438
8,1.1676
9,-0.7131
10,-0.7131
11,-0.7131
12,0.6034
13,1.9199
14,-0.7131
15,-0.7131
16,-0.7131
17,-0.33696
18,1.9199
19,0.41531999999999997
20,-0.7131
21,-0.7131
22,-0.7131
23,1.1676
24,1.3557
25,-0.7131
26,-0.7131
27,-0.7131
28,0.039181
29,1.9199
30,0.039181
31,-0.7131
32,-0.7131
33,-0.7131
34,1.1676
35,1.3557
36,-0.7131
37,-0.7131
38,-0.7131
39,0.22725
40,1.9199
41,-0.14889000000000002
42,-0.7131
43,-0.7131
44,-0.7131
45,1.1676
46,1.5438
47,-0.7131
48,-0.7131
49,-0.7131
50,-0.7131
51,2.108
52,0.41531999999999997
53,-0.7131
54,-0.7131
55,-0.7131
56,0.41531999999999997
57,1.9199
58,-0.33696
59,-0.7131
60,-0.7131
61,-0.7131
62,0.97954
63,1.7318
64,-0.7131
65,-0.7131
66,-0.7131
67,-0.7131
68,1.7318
69,0.79147
70,-0.7131
71,-0.7131
72,-0.7131
73,-0.33696
74,2.108
75,0.039181
76,-0.7131
77,-0.7131
78,-0.7131
79,0.6034
80,1.9199
81,-0.7131
82,-0.7131
83,-0.7131
84,-0.7131
85,1.1676
86,1.3557
87,-0.7131
88,-0.7131
89,-0.7131
90,-0.7131
91,1.9199
92,0.6034
93,-0.7131
94,-0.7131
95,-0.7131
