time,value
0,2.0517
1,2.0226
2,1.9885
3,1.9453
4,1.9
5,1.8554
6,1.8106
7,1.7661
8,1.7217
9,1.6780000000000002
10,1.6347
11,1.5917
12,1.5489
13,1.5062
14,1.4635
15,1.421
16,1.3786
17,1.3359999999999999
18,1.2934
19,1.2509
20,1.2087
21,1.1662
22,1.1239
23,1.0817
24,1.0395
25,0.9973799999999999
26,0.9553299999999999
27,0.9133399999999999
28,0.87141
29,0.8295600000000001
30,0.78789
31,0.74634
32,0.70489
33,0.66346
34,0.6221300000000001
35,0.58076
36,0.53961
37,0.49828999999999996
38,0.45708999999999994
39,0.41584
40,0.37461
41,0.33368000000000003
42,0.29259
43,0.25182
44,0.21088
45,0.1698
46,0.12889
47,0.088146
48,0.047143
49,0.0065378
50,-0.034224
51,-0.074586
52,-0.11514
53,-0.15582000000000001
54,-0.19642
55,-0.23695
56,-0.27784000000000003
57,-0.31816
58,-0.35807
59,-0.39854
60,-0.43856999999999996
61,-0.47891999999999996
62,-0.51881
63,-0.5592199999999999
64,-0.59823
65,-0.63774
66,-0.6775399999999999
67,-0.71702
68,-0.75655
69,-0.79573
70,-0.83515
71,-0.87376
72,-0.9120299999999999
73,-0.9500299999999999
74,-0.98775
75,-1.0241
76,-1.0611
77,-1.0969
78,-1.1328
79,-1.1685
80,-1.1996
81,-1.2267
82,-1.2282
83,-1.2209
84,-1.2066
85,-1.1865
86,-1.1663
87,-1.143
88,-1.1165
89,-1.089
90,-1.0688
91,-1.0461
92,-1.0205
93,-0.99298
94,-0.96455
95,-0.93361
96,-0.9053100000000001
97,-0.87572
98,-0.8462700000000001
99,-0.81775
100,-0.78757
101,-0.76059
102,-0.7336600000000001
103,-0.70575
104,-0.68267
105,-0.66297
106,-0.6540199999999999
107,-0.64728
108,-0.63007
109,-0.61897
110,-0.64117
111,-0.6754899999999999
112,-0.71394
113,-0.7459
114,-0.78149
115,-0.82295
116,-0.85364
117,-0.88546
118,-0.91674
119,-0.9537
120,-0.99287
121,-1.0346
122,-1.0692
123,-1.0904
124,-1.1167
125,-1.1453
126,-1.1787
127,-1.2131
128,-1.2437
129,-1.268
130,-1.2834
131,-1.2997
132,-1.3249
133,-1.3511
134,-1.3695
135,-1.3964
136,-1.4258
137,-1.4479
138,-1.4709999999999999
139,-1.4908
140,-1.5145
141,-1.5376
142,-1.5605
143,-1.5243
144,-1.4892
145,-1.4518
146,-1.4147
147,-1.3771
148,-1.3401
149,-1.3021
150,-1.2628
151,-1.2245
152,-1.1847
153,-1.1459
154,-1.1069
155,-1.0676
156,-1.028
157,-0.98766
158,-0.9470000000000001
159,-0.9062600000000001
160,-0.86635
161,-0.82632
162,-0.78618
163,-0.74511
164,-0.70381
165,-0.66282
166,-0.62164
167,-0.58113
168,-0.5390699999999999
169,-0.49623999999999996
170,-0.45266000000000006
171,-0.40907
172,-0.36472
173,-0.32036
174,-0.27599
175,-0.22778
176,-0.18228
177,-0.132
178,-0.092303
179,-0.046037
180,0.0063062
181,0.050495
182,0.09728099999999999
183,0.14255
184,0.18342
185,0.22565
186,0.26791
187,0.31201
188,0.35363
189,0.39018
190,0.42932
191,0.46658999999999995
192,0.50847
193,0.54845
194,0.59137
195,0.63642
196,0.6832
197,0.72938
198,0.77862
199,0.82809
200,0.88202
201,0.93924
202,0.99349
203,1.0402
204,1.0772
205,1.115
206,1.1529
207,1.1396
208,1.1275
209,1.128
210,1.1146
211,1.095
212,1.0788
213,1.0611
214,1.0438
215,1.0290000000000001
216,1.0077
217,0.9889600000000001
218,0.97909
219,0.95775
220,0.93824
221,0.92132
222,0.89095
223,0.86019
224,0.8255399999999999
225,0.80199
226,0.78196
227,0.7659100000000001
228,0.7548600000000001
229,0.7449899999999999
230,0.73538
231,0.72632
232,0.72496
233,0.7337
234,0.75027
235,0.7661
236,0.79679
237,0.83431
238,0.8736200000000001
239,0.91243
240,0.9521299999999999
241,0.99349
242,1.0349
243,1.0748
244,1.1157
245,1.1529
246,1.1855
247,1.2159
248,1.2256
249,1.2417
250,1.2824
251,1.3079
252,1.338
253,1.3531
254,1.3562
255,1.3609
256,1.3565
257,1.3586
258,1.3612
259,1.3492
260,1.3317
261,1.2895
262,1.2503
263,1.2102
264,1.1678
265,1.1258
266,1.0832
267,1.0406
268,0.99865
269,0.9566899999999999
270,0.91495
271,0.87277
272,0.83068
273,0.78886
274,0.74641
275,0.70385
276,0.6612899999999999
277,0.61905
278,0.57675
279,0.53493
280,0.4929
281,0.45076000000000005
282,0.40904
283,0.36646
284,0.32369000000000003
285,0.28117
286,0.23943000000000003
287,0.19769
288,0.15583
289,0.11525999999999999
290,0.072244
291,0.030561
292,-0.010894
293,-0.05259199999999999
294,-0.09428099999999999
295,-0.13565
296,-0.17667
297,-0.21763000000000002
298,-0.25781
299,-0.29788000000000003
300,-0.33854
301,-0.37917
302,-0.41927
303,-0.45923
304,-0.49854
305,-0.53819
306,-0.5775399999999999
307,-0.61636
308,-0.65545
309,-0.6949
310,-0.73248
311,-0.77141
312,-0.80878
313,-0.84662
314,-0.88415
315,-0.92135
316,-0.9591700000000001
317,-0.9470299999999999
318,-0.9017200000000001
319,-0.8549700000000001
320,-0.81109
321,-0.79173
322,-0.76595
323,-0.7447600000000001
324,-0.72783
325,-0.73375
326,-0.73502
327,-0.75143
328,-0.77409
329,-0.80698
330,-0.84226
331,-0.8752700000000001
332,-0.9097
333,-0.93971
334,-0.97914
335,-1.008
336,-1.0412
337,-1.0769
338,-1.0936
339,-1.1194
340,-1.1626
341,-1.1982
342,-1.2235
343,-1.2477
344,-1.2731
345,-1.2973
346,-1.3206
347,-1.3417
348,-1.3643
349,-1.3826
350,-1.3963
351,-1.4080000000000001
352,-1.4176
353,-1.4251
354,-1.4054
355,-1.3653
356,-1.331
357,-1.2992
358,-1.2633
359,-1.2457
360,-1.248
361,-1.2136
362,-1.1936
363,-1.1740000000000002
364,-1.1675
365,-1.1587
366,-1.1469
367,-1.1258
368,-1.1118
369,-1.095
370,-1.0742
371,-1.0576
372,-1.0345
373,-1.013
374,-0.98782
375,-0.9642299999999999
376,-0.9421299999999999
377,-0.91666
378,-0.8926799999999999
379,-0.8722700000000001
380,-0.84875
381,-0.8199299999999999
382,-0.79046
383,-0.7603800000000001
384,-0.72972
385,-0.6981
386,-0.66306
387,-0.63079
388,-0.59635
389,-0.56286
390,-0.51626
391,-0.47298999999999997
392,-0.434
393,-0.39837
394,-0.36409
395,-0.33009
396,-0.29854
397,-0.2605
398,-0.226
399,-0.19122
400,-0.15617
401,-0.12088
402,-0.083835
403,-0.048007999999999995
404,-0.011744
405,0.022605
406,0.06346
407,0.10525
408,0.13477999999999998
409,0.16924
410,0.20633
411,0.24356999999999998
412,0.2796
413,0.31583
414,0.35222
415,0.39008000000000004
416,0.42678999999999995
417,0.46221999999999996
418,0.49943999999999994
419,0.53903
420,0.5763
421,0.61488
422,0.6524
423,0.6877800000000001
424,0.72447
425,0.76022
426,0.79614
427,0.8322700000000001
428,0.8695799999999999
429,0.90602
430,0.9426200000000001
431,0.98361
432,1.0258
433,1.0665
434,1.1044
435,1.1433
436,1.1759
437,1.2124
438,1.2504
439,1.2892
440,1.3295
441,1.3656
442,1.4052
443,1.4456
444,1.4868
445,1.5272
446,1.567
447,1.6075
448,1.6473
449,1.6842
450,1.7227
451,1.7599
452,1.7967
453,1.8329
454,1.8664
455,1.8991
456,1.9257
457,1.9378
458,1.9685
459,2.005
460,2.0291
461,2.0491
462,2.0507
