[<text>
<title>mercantile bankshares corp &lt;mrbk.o&gt; 3rd qtr net</title>
<dateline>    baltimore, oct 20 -
    </dateline>shr 99 cts vs 77 cts
    net 12.7 mln vs 9,736,000
    avg shrs 12.8 mln vs 12.7 mln
    nine mths
    shr 2.67 dlrs vs 2.30 dlrs
    net 34.0 mln vs 29.1 mln
    note: net includes pretax securities gains 16,000 dlrs vs
228,000 dlrs in quarter and 48,000 dlrs vs 1,673,000 dlrs in
nine mths.
    net includes loan loss provisions 1,092,000 dlrs vs 790,000
dlrs in quarter and 3,089,000 dlrs vs 2,584,000 dlrs in nine
mths.   
 reuter
</text>]