time,value
0,-0.66502
1,-0.66502
2,1.5176
3,1.6995
4,0.79006
5,-0.66502
6,-0.66502
7,-0.66502
8,-0.66502
9,-0.66502
10,-0.66502
11,0.60818
12,1.8814
13,1.1538
14,-0.66502
15,-0.66502
16,-0.66502
17,-0.66502
18,-0.66502
19,-0.66502
20,-0.11936
21,1.8814
22,1.6995
23,-0.66502
24,-0.66502
25,-0.66502
26,-0.66502
27,-0.66502
28,-0.66502
29,-0.11936
30,2.0633
31,1.6995
32,0.062523
33,-0.66502
34,-0.66502
35,-0.66502
36,-0.66502
37,-0.66502
38,-0.66502
39,1.3357
40,1.6995
41,0.79006
42,-0.66502
43,-0.66502
44,-0.66502
45,-0.66502
46,-0.66502
47,-0.66502
48,0.60818
49,1.8814
50,1.1538
51,-0.66502
52,-0.66502
53,-0.66502
54,-0.66502
55,-0.66502
56,-0.66502
57,0.062523
58,1.8814
59,1.5176
60,-0.66502
61,-0.66502
62,-0.66502
63,-0.66502
64,-0.66502
65,-0.66502
66,-0.30125
67,1.8814
68,1.8814
69,-0.66502
70,-0.66502
71,-0.66502
72,-0.66502
73,-0.66502
74,-0.66502
75,0.60818
76,1.8814
77,1.6995
78,-0.66502
79,-0.66502
80,-0.66502
81,-0.66502
82,-0.66502
83,-0.66502
84,0.24441
85,1.8814
86,1.6995
87,-0.30125
88,-0.66502
89,-0.66502
90,-0.66502
91,-0.66502
92,-0.66502
93,1.6995
94,1.8814
95,0.062523
