time,value
0,-0.37916
1,-0.37916
2,-0.37916
3,-0.37916
4,-0.37916
5,-0.37916
6,-0.37916
7,-0.37916
8,-0.37916
9,-0.37916
10,-0.37916
11,-0.37916
12,0.12405999999999999
13,-0.37916
14,-0.37916
15,-0.37916
16,-0.37916
17,-0.37916
18,-0.37916
19,-0.37916
20,0.12405999999999999
21,-0.37916
22,-0.37916
23,-0.37916
24,-0.37916
25,-0.37916
26,-0.37916
27,-0.37916
28,-0.37916
29,-0.37916
30,-0.37916
31,-0.37916
32,-0.37916
33,-0.37916
34,-0.37916
35,-0.37916
36,-0.37916
37,-0.37916
38,-0.37916
39,-0.37916
40,0.12405999999999999
41,-0.37916
42,-0.37916
43,-0.37916
44,-0.37916
45,-0.37916
46,-0.37916
47,-0.37916
48,-0.37916
49,-0.37916
50,-0.37916
51,-0.37916
52,-0.37916
53,-0.37916
54,-0.37916
55,-0.37916
56,0.12405999999999999
57,-0.37916
58,-0.37916
59,-0.37916
60,-0.37916
61,-0.37916
62,-0.37916
63,-0.37916
64,-0.37916
65,-0.37916
66,-0.37916
67,-0.37916
68,-0.37916
69,-0.37916
70,-0.37916
71,-0.37916
72,1.1305
73,-0.37916
74,0.12405999999999999
75,0.62727
76,0.62727
77,0.795
78,0.62727
79,0.795
80,-0.37916
81,-0.37916
82,-0.37916
83,-0.37916
84,0.45953
85,3.6465
86,3.6465
87,3.4788
88,3.6465
89,3.4788
90,3.6465
91,1.6337
92,-0.043682
93,-0.37916
94,-0.37916
95,-0.37916
