time,value
0,-0.9473600000000001
1,-0.48958
2,1.4942
3,1.189
4,1.0364
5,0.73118
6,-0.9473600000000001
7,-0.9473600000000001
8,-0.9473600000000001
9,-0.9473600000000001
10,-0.9473600000000001
11,-0.031791
12,1.4942
13,1.189
14,1.0364
15,1.189
16,1.0364
17,1.0364
18,0.5785899999999999
19,-0.9473600000000001
20,-0.9473600000000001
21,-0.9473600000000001
22,-0.9473600000000001
23,-0.9473600000000001
24,-0.9473600000000001
25,0.73118
26,1.3416
27,1.0364
28,1.0364
29,1.0364
30,-0.33698
31,-0.9473600000000001
32,-0.9473600000000001
33,-0.9473600000000001
34,-0.9473600000000001
35,-0.9473600000000001
36,-0.33698
37,1.4942
38,1.189
39,1.0364
40,0.73118
41,-0.9473600000000001
42,-0.9473600000000001
43,-0.9473600000000001
44,-0.9473600000000001
45,-0.9473600000000001
46,-0.9473600000000001
47,0.73118
48,1.3416
49,1.0364
50,1.0364
51,0.8837799999999999
52,-0.9473600000000001
53,-0.9473600000000001
54,-0.9473600000000001
55,-0.9473600000000001
56,-0.9473600000000001
57,-0.9473600000000001
58,0.8837799999999999
59,1.189
60,1.189
61,1.0364
62,1.0364
63,1.0364
64,0.5785899999999999
65,-0.9473600000000001
66,-0.9473600000000001
67,-0.9473600000000001
68,-0.9473600000000001
69,-0.9473600000000001
70,-0.9473600000000001
71,0.42599
72,1.4942
73,1.0364
74,1.0364
75,1.0364
76,-0.9473600000000001
77,-0.9473600000000001
78,-0.9473600000000001
79,-0.9473600000000001
80,-0.9473600000000001
81,-0.9473600000000001
82,0.42599
83,1.3416
84,1.189
85,1.0364
86,1.0364
87,-0.64217
88,-0.9473600000000001
89,-0.9473600000000001
90,-0.9473600000000001
91,-0.9473600000000001
92,-0.9473600000000001
93,-0.9473600000000001
94,1.4942
95,1.189
