time,value
0,2.0534
1,-0.67904
2,-0.67904
3,-0.67904
4,-0.67904
5,1.0775
6,1.4679
7,-0.67904
8,-0.67904
9,-0.67904
10,-0.67904
11,1.4679
12,1.0775
13,-0.67904
14,-0.67904
15,-0.67904
16,-0.67904
17,1.8582
18,0.68717
19,-0.67904
20,-0.67904
21,-0.67904
22,-0.67904
23,2.0534
24,0.10165
25,-0.67904
26,-0.67904
27,-0.67904
28,0.10165
29,2.0534
30,-0.28869
31,-0.67904
32,-0.67904
33,-0.67904
34,0.10165
35,2.2485
36,-0.67904
37,-0.67904
38,-0.67904
39,-0.67904
40,0.49200000000000005
41,1.8582
42,-0.67904
43,-0.67904
44,-0.67904
45,-0.67904
46,1.0775
47,1.4679
48,-0.67904
49,-0.67904
50,-0.67904
51,-0.67904
52,1.4679
53,1.0775
54,-0.67904
55,-0.67904
56,-0.67904
57,0.10165
58,2.0534
59,-0.28869
60,-0.67904
61,-0.67904
62,-0.67904
63,0.49200000000000005
64,2.0534
65,-0.67904
66,-0.67904
67,-0.67904
68,-0.67904
69,0.88234
70,1.4679
71,-0.67904
72,-0.67904
73,-0.67904
74,-0.67904
75,1.663
76,1.2727
77,-0.67904
78,-0.67904
79,-0.67904
80,0.29682
81,2.0534
82,0.10165
83,-0.67904
84,-0.67904
85,-0.67904
86,1.0775
87,1.663
88,-0.67904
89,-0.67904
90,-0.67904
91,0.29682
92,2.0534
93,-0.67904
94,-0.67904
95,-0.67904
