time,value
0,1.1526
1,1.1526
2,1.1526
3,1.1526
4,1.2007
5,1.1526
6,1.1526
7,1.1045
8,1.2969
9,1.1045
10,1.0082
11,1.0563
12,1.1045
13,1.0563
14,0.57528
15,-1.0604
16,-1.1085
17,-1.1085
18,-1.1566
19,-1.1085
20,-1.0604
21,-1.1085
22,-1.1566
23,-1.1085
24,-1.1566
25,-1.1085
26,-1.1566
27,-1.1566
28,-1.1085
29,-1.1566
30,-1.1085
31,-1.1566
32,-1.1085
33,-1.0122
34,-1.0604
35,-1.0604
36,-1.1085
37,-1.1566
38,-1.1085
39,-1.1566
40,-1.0604
41,-1.1085
42,-0.14632
43,0.81581
44,0.81581
45,-0.24254
46,-1.0122
47,-1.0122
48,-1.0122
49,-1.0122
50,-1.0604
51,-1.0604
52,-1.1566
53,-0.86793
54,-0.9160299999999999
55,-0.86793
56,-0.96414
57,-0.86793
58,-1.1566
59,-1.0604
60,-1.2047
61,-1.0604
62,0.046102
63,0.7677
64,0.7677
65,0.7677
66,0.7677
67,0.86392
68,0.91202
69,0.6714899999999999
70,0.6714899999999999
71,0.6714899999999999
72,0.7196
73,0.7677
74,0.9601299999999999
75,0.91202
76,0.91202
77,0.91202
78,0.91202
79,0.91202
80,0.91202
81,0.86392
82,0.91202
83,0.9601299999999999
84,0.86392
85,0.91202
86,0.91202
87,0.91202
88,0.9601299999999999
89,0.91202
90,0.91202
91,0.9601299999999999
92,0.86392
93,0.91202
94,1.0082
95,0.9601299999999999
