time,value
0,-0.14543
1,-0.14543
2,-0.14543
3,-0.14543
4,-0.14543
5,-0.14543
6,-0.14543
7,-0.14543
8,-0.14543
9,-0.14543
10,-0.14543
11,-0.14543
12,-0.14543
13,-0.14543
14,-0.14543
15,-0.14543
16,-0.14543
17,-0.14543
18,-0.14543
19,-0.14543
20,-0.14543
21,-0.14543
22,-0.14543
23,-0.14543
24,-0.14543
25,-0.14543
26,-0.14543
27,-0.14543
28,-0.14543
29,-0.14543
30,-0.14543
31,-0.14543
32,-0.14543
33,-0.14543
34,-0.14543
35,-0.14543
36,-0.14543
37,-0.14543
38,-0.14543
39,-0.14543
40,-0.14543
41,-0.14543
42,-0.14543
43,-0.14543
44,-0.14543
45,-0.14543
46,-0.14543
47,-0.14543
48,-0.14543
49,-0.14543
50,-0.14543
51,-0.14543
52,-0.14543
53,-0.14543
54,-0.14543
55,-0.14543
56,-0.14543
57,-0.14543
58,-0.14543
59,-0.14543
60,-0.14543
61,-0.14543
62,-0.14543
63,-0.14543
64,-0.14543
65,-0.14543
66,-0.14543
67,-0.14543
68,-0.14543
69,-0.14543
70,-0.14543
71,-0.14543
72,-0.14543
73,-0.14543
74,-0.14543
75,-0.14543
76,-0.14543
77,-0.14543
78,-0.14543
79,-0.14543
80,-0.14543
81,-0.14543
82,-0.14543
83,-0.14543
84,-0.14543
85,-0.14543
86,-0.14543
87,-0.14543
88,-0.14543
89,-0.14543
90,-0.14543
91,-0.14543
92,0.17115999999999998
93,4.0335
94,8.7507
95,0.42443000000000003
