time,value
0,-2.1308
1,-2.1044
2,-2.0748
3,-2.0254
4,-1.9449
5,-1.8604
6,-1.7906
7,-1.7175
8,-1.6573
9,-1.6165
10,-1.547
11,-1.4708
12,-1.3702
13,-1.252
14,-1.1926
15,-1.085
16,-0.97944
17,-0.8680100000000001
18,-0.75139
19,-0.70309
20,-0.5574899999999999
21,-0.43299
22,-0.33153
23,-0.21141999999999997
24,-0.055229999999999994
25,0.017494
26,0.10114
27,0.16724
28,0.23836
29,0.30685
30,0.31316
31,0.36393000000000003
32,0.42496000000000006
33,0.58858
34,0.77481
35,0.84493
36,0.9597700000000001
37,1.087
38,1.1879
39,1.3536
40,1.4603
41,1.5083
42,1.6158
43,1.6816
44,1.7992
45,1.7422
46,1.7633
47,1.7354
48,1.6580000000000001
49,1.5728
50,1.4869
51,1.5081
52,1.4935
53,1.4576
54,1.4203
55,1.3494
56,1.3046
57,1.2697
58,1.1107
59,1.0777
60,1.0187
61,0.95606
62,0.9348700000000001
63,0.8668100000000001
64,0.7388
65,0.6640199999999999
66,0.61011
67,0.58239
68,0.47753
69,0.37077
70,0.34010999999999997
71,0.38271
72,0.42728
73,0.47483000000000003
74,0.5234
75,0.54681
76,0.45513000000000003
77,0.28446
78,0.17605
79,-0.030873
80,-0.14051
81,-0.26954
82,-0.38955
83,-0.44823999999999997
84,-0.60848
85,-0.68542
86,-0.76794
87,-0.83847
88,-0.90633
89,-0.91161
90,-0.9426700000000001
91,-1.0032
92,-1.0318
93,-0.97495
94,-0.9721
95,-0.96764
96,-0.9611799999999999
97,-0.9547200000000001
98,-0.89545
99,-0.83455
100,-0.74374
101,-0.67482
102,-0.53815
103,-0.43478999999999995
104,-0.3531
105,-0.31081
106,-0.22334
107,-0.13207
108,-0.055169
109,-0.0087855
110,0.01457
111,0.061322
112,0.10764000000000001
113,0.15295999999999998
114,0.17172
115,0.16446
116,0.096416
117,0.051628
118,0.0044670000000000005
119,-0.016271
120,0.021646000000000002
121,0.039275
122,0.10717
123,0.17123
124,0.1808
125,0.16857
126,0.2168
127,0.06790700000000001
128,-0.0013412
129,-0.046436
130,-0.109
131,-0.10032999999999999
132,-0.057235
133,0.009273
134,0.042834
135,0.15658
136,0.2162
137,0.13926
138,0.082039
139,0.02862
140,-0.057602999999999994
141,-0.14151
142,-0.19039
143,-0.28514
144,-0.44503000000000004
145,-0.56304
146,-0.64253
147,-0.68069
148,-0.81465
149,-0.91294
150,-1.0058
151,-1.0642
152,-1.1005
153,-1.104
154,-1.051
155,-1.0242
156,-0.9656600000000001
157,-0.90422
158,-0.9339799999999999
159,-0.8690100000000001
160,-0.80097
161,-0.78708
162,-0.71278
163,-0.67443
164,-0.59541
165,-0.54175
166,-0.41476
167,-0.32085
168,-0.19033
169,-0.12007999999999999
170,0.020869
171,0.1934
172,0.39455999999999997
173,0.48917
174,0.5228
175,0.55169
176,0.50151
177,0.43351000000000006
178,0.414
179,0.34541
180,0.27998
181,0.33796
182,0.40031
183,0.50659
184,0.6210100000000001
185,0.6490199999999999
186,0.80491
187,0.85446
188,1.0113
189,1.1293
190,1.1696
191,1.2021
192,1.2884
193,1.3647
194,1.4576
195,1.4873
196,1.5526
197,1.5678
198,1.5467
199,1.5757
200,1.5339
201,1.5339
202,1.5711
203,1.5507
204,1.4999
205,1.5461
206,1.5148
207,1.4245
208,1.3997
209,1.3559999999999999
210,1.2704
211,1.2358
212,1.1192
213,1.018
214,0.84441
215,0.76265
216,0.64695
217,0.58123
218,0.53766
219,0.4692
220,0.44968
221,0.38199
222,0.32564
223,0.26566999999999996
224,0.19679000000000002
225,0.10404000000000001
226,0.006368899999999999
227,-0.06680599999999999
228,-0.19182000000000002
229,-0.31782
230,-0.48446000000000006
231,-0.5954699999999999
232,-0.7532300000000001
233,-0.8224600000000001
234,-0.95676
235,-1.054
236,-1.1705
237,-1.2655
238,-1.3171
239,-1.4267
240,-1.5418
241,-1.6316
242,-1.7167
243,-1.7357
244,-1.8111
245,-1.8596
246,-1.9445
247,-2.003
248,-2.0341
249,-2.08
250,-2.1034
