time,value
0,0.78593
1,0.78593
2,0.78593
3,0.78593
4,0.72167
5,-0.9492799999999999
6,-1.3349
7,-1.3349
8,-1.2063
9,1.1073
10,0.8502
11,0.8502
12,0.78593
13,0.72167
14,0.52886
15,-1.3349
16,-1.3349
17,-1.3349
18,-0.5636800000000001
19,1.043
20,0.8502
21,0.78593
22,0.78593
23,0.2718
24,-1.3349
25,-1.3349
26,-1.3349
27,-0.17807
28,0.9787299999999999
29,0.78593
30,0.78593
31,0.72167
32,-0.5636800000000001
33,-1.3349
34,-1.3349
35,-1.3349
36,0.8502
37,0.9144700000000001
38,0.78593
39,0.78593
40,0.72167
41,-0.6279399999999999
42,-1.3349
43,-1.3349
44,-1.3349
45,0.9787299999999999
46,0.9144700000000001
47,0.78593
48,0.78593
49,0.72167
50,-1.2063
51,-1.3349
52,-1.3349
53,-0.8207399999999999
54,1.1073
55,0.9144700000000001
56,0.78593
57,0.78593
58,0.78593
59,-1.0135
60,-1.3349
61,-1.3349
62,-0.9492799999999999
63,1.043
64,0.9144700000000001
65,0.78593
66,0.78593
67,0.78593
68,-0.5636800000000001
69,-1.3349
70,-1.3349
71,-1.3349
72,0.9144700000000001
73,0.9144700000000001
74,0.8502
75,0.78593
76,0.72167
77,0.78593
78,0.78593
79,0.72167
80,-1.3349
81,-1.3349
82,-1.3349
83,-0.69221
84,1.043
85,0.8502
86,0.78593
87,0.72167
88,-0.43513999999999997
89,-1.3349
90,-1.3349
91,-1.3349
92,0.72167
93,0.9787299999999999
94,0.78593
95,0.78593
