[<text>
<title>telequest inc &lt;telq&gt; 4th qtr dec 31 loss</title>
<dateline>    san diego, calif., march 16 -
    </dateline>shr loss nine cts vs profit 35 cts
    net loss 299,000 vs profit 1,025,000
    sales 9,704,000 vs 9,659,000
    avg shrs 3,792,138 vs 2,892,138
    year
    shr profit one ct vs profit 58 cts
    net profit 45,000 vs profit 1,705,000
    sales 25.4 mln vs 17.8 mln
    avg shrs 3,567,138 vs 2,892,138
 reuter
</text>]