time,value
0,1.7752
1,1.8384
2,1.9105
3,1.9687
4,1.9569999999999999
5,1.9365
6,1.92
7,1.8878
8,1.8573
9,1.8324
10,1.8061
11,1.7777
12,1.7282
13,1.6915
14,1.6353
15,1.5821
16,1.5236
17,1.4689
18,1.4158
19,1.3716
20,1.3385
21,1.3084
22,1.2723
23,1.2412
24,1.2184
25,1.1987
26,1.1916
27,1.1877
28,1.1806
29,1.1687
30,1.1554
31,1.1205
32,1.0753
33,1.0489
34,1.0524
35,1.0476
36,1.0542
37,1.0035
38,0.96229
39,0.92375
40,0.8839100000000001
41,0.8298399999999999
42,0.78591
43,0.73632
44,0.69794
45,0.65704
46,0.61007
47,0.56488
48,0.52177
49,0.47173000000000004
50,0.43249
51,0.38675
52,0.33351
53,0.28071999999999997
54,0.22268000000000002
55,0.14215999999999998
56,0.065983
57,0.004419
58,-0.069017
59,-0.12783
60,-0.19343
61,-0.24950999999999998
62,-0.31023
63,-0.37106999999999996
64,-0.42885
65,-0.47718
66,-0.53266
67,-0.57828
68,-0.62137
69,-0.654
70,-0.6836800000000001
71,-0.70634
72,-0.72373
73,-0.73819
74,-0.73674
75,-0.73219
76,-0.72391
77,-0.7117399999999999
78,-0.69976
79,-0.68282
80,-0.6542
81,-0.62068
82,-0.58833
83,-0.55757
84,-0.5345300000000001
85,-0.49761000000000005
86,-0.43155
87,-0.3886
88,-0.42678999999999995
89,-0.51565
90,-0.5452600000000001
91,-0.56334
92,-0.55733
93,-0.53033
94,-0.49678999999999995
95,-0.44903000000000004
96,-0.39163000000000003
97,-0.34397
98,-0.27638
99,-0.20751999999999998
100,-0.13787
101,-0.090232
102,-0.017741999999999997
103,-0.019073
104,-0.075616
105,-0.074873
106,-0.14787
107,-0.22951
108,-0.31572
109,-0.3827
110,-0.46828000000000003
111,-0.53727
112,-0.61962
113,-0.69297
114,-0.76202
115,-0.8337100000000001
116,-0.8967799999999999
117,-0.9748
118,-1.0536
119,-1.1184
120,-1.1936
121,-1.2704
122,-1.3406
123,-1.4209
124,-1.49
125,-1.5534
126,-1.6352
127,-1.7077
128,-1.7753
129,-1.8585
130,-1.9376
131,-2.011
132,-2.0421
133,-2.0801
134,-2.1111
135,-2.136
136,-2.1489
137,-2.1476
138,-2.1404
139,-2.1293
140,-2.0909999999999997
141,-2.0459
142,-1.9956
143,-1.9401
144,-1.8713
145,-1.7987
146,-1.7255
147,-1.6568
148,-1.5944
149,-1.5156
150,-1.4391
151,-1.3718
152,-1.2894
153,-1.225
154,-1.1475
155,-1.069
156,-1.0049
157,-0.93615
158,-0.8632700000000001
159,-0.7850199999999999
160,-0.71327
161,-0.64737
162,-0.57058
163,-0.50526
164,-0.43259
165,-0.35670999999999997
166,-0.29372
167,-0.21793
168,-0.15559
169,-0.079797
170,-0.016996
171,0.05708200000000001
172,0.1374
173,0.20344
174,0.27497
175,0.35477
176,0.41893
177,0.49877
178,0.57845
179,0.65075
180,0.71663
181,0.6508
182,0.5804600000000001
183,0.49277
184,0.41696000000000005
185,0.3178
186,0.24236
187,0.14572000000000002
188,0.070729
189,0.0018968
190,-0.023347
191,-0.0086925
192,0.05051
193,0.11752
194,0.17704
195,0.24229
196,0.31708000000000003
197,0.39436
198,0.45736000000000004
199,0.52604
200,0.60864
201,0.67872
202,0.73931
203,0.81932
204,0.8951100000000001
205,0.96221
206,1.0314
207,1.1134
208,1.1813
209,1.2597
210,1.3266
211,1.3993
212,1.3893
213,1.4426
214,1.5124
215,1.5841
216,1.6533
217,1.7291
218,1.8163
219,1.7511
220,1.6598
221,1.5945
222,1.5162
223,1.4480000000000002
224,1.3639
225,1.2896
226,1.2192
227,1.1447
228,1.0638
229,0.9907100000000001
230,0.92127
231,0.8412799999999999
232,0.76593
233,0.6955
234,0.73053
235,0.7712600000000001
236,0.82368
237,0.76444
238,0.69301
239,0.61629
240,0.54164
241,0.47305
242,0.3945
243,0.3171
244,0.24534
245,0.17472000000000001
246,0.10198
247,0.029742
248,-0.039716
249,-0.12287999999999999
250,-0.19416
251,-0.26618
252,-0.33831
253,-0.40244
254,-0.46858
255,-0.5416
256,-0.58654
257,-0.6237699999999999
258,-0.64266
259,-0.6358600000000001
260,-0.61529
261,-0.5785100000000001
262,-0.5282399999999999
263,-0.45303000000000004
264,-0.38399
265,-0.32522
266,-0.22630999999999998
267,-0.1293
268,-0.031889999999999995
269,0.068494
270,0.16368
271,0.25040999999999997
272,0.31511
273,0.26188
274,0.16121
275,0.07750900000000001
276,-0.001633
277,-0.073492
278,-0.13915999999999998
279,-0.19962
280,-0.23926
281,-0.21502
282,-0.27153
283,-0.35181
284,-0.42723999999999995
285,-0.49851999999999996
286,-0.5631
287,-0.64056
288,-0.69681
289,-0.7605
290,-0.8241299999999999
291,-0.8729299999999999
292,-0.92663
293,-0.99215
294,-1.0489
295,-1.117
296,-1.1755
297,-1.2354
298,-1.2799
299,-1.3311
300,-1.3855
301,-1.4295
302,-1.4749
303,-1.5192
304,-1.5567
305,-1.6027
306,-1.6385
307,-1.6758
308,-1.7111
309,-1.7491
310,-1.7727
311,-1.7914
312,-1.8074
313,-1.8088
314,-1.8033
315,-1.7931
316,-1.7614
317,-1.6992
318,-1.6519
319,-1.5694
320,-1.4787
321,-1.4049
322,-1.3222
323,-1.2455
324,-1.1802
325,-1.1011
326,-1.0427
327,-0.9795799999999999
328,-0.91233
329,-0.83042
330,-0.76522
331,-0.70031
332,-0.62451
333,-0.55847
334,-0.48551000000000005
335,-0.4181
336,-0.34679
337,-0.28236999999999995
338,-0.21061999999999997
339,-0.12947
340,-0.056615
341,0.014383000000000002
342,0.080138
343,0.15713
344,0.23800000000000002
345,0.3071
346,0.38827
347,0.46415
348,0.54698
349,0.6296
350,0.6323300000000001
351,0.5723699999999999
352,0.52979
353,0.50439
354,0.47415
355,0.43906000000000006
356,0.4181
357,0.4153
358,0.45233
359,0.52265
360,0.49373999999999996
361,0.43915
362,0.40465
363,0.34943
364,0.31481
365,0.27581
366,0.25090999999999997
367,0.22871999999999998
368,0.20374
369,0.19333
370,0.1788
371,0.16651
372,0.16651
373,0.15750999999999998
374,0.15509
375,0.15079
376,0.14969000000000002
377,0.14261
378,0.1281
379,0.13027
380,0.13147999999999999
381,0.132
382,0.13633
383,0.1431
384,0.14786
385,0.16521
386,0.18775
387,0.20848000000000003
388,0.22034
389,0.23515
390,0.25747
391,0.28047
392,0.31266
393,0.34903
394,0.38728
395,0.42588000000000004
396,0.47123000000000004
397,0.5169699999999999
398,0.56713
399,0.59195
400,0.61554
401,0.64591
402,0.67918
403,0.71487
404,0.75344
405,0.78241
406,0.82206
407,0.86198
408,0.88134
409,0.92296
410,0.97039
411,1.0064
412,1.0454
413,1.0994
414,1.1261
415,1.1788
416,1.2382
417,1.28
418,1.324
419,1.3873
420,1.4505
421,1.4948
422,1.5453
423,1.5868
424,1.6397
425,1.7078
426,1.7564
