time,value
0,0.6984
1,0.6984
2,0.5949399999999999
3,0.6984
4,0.6984
5,-0.5432
6,-1.3709
7,-1.3709
8,-1.3709
9,-1.3709
10,-1.3709
11,-1.3709
12,-1.3709
13,-1.3709
14,-1.3709
15,-1.3709
16,0.38799999999999996
17,1.2157
18,1.0088
19,0.9053399999999999
20,0.80187
21,0.80187
22,0.80187
23,0.6984
24,0.6984
25,0.6984
26,0.6984
27,0.6984
28,0.6984
29,0.6984
30,0.5949399999999999
31,0.6984
32,0.6984
33,0.5949399999999999
34,0.6984
35,-0.33626999999999996
36,-1.3709
37,-1.3709
38,-1.3709
39,-1.3709
40,-1.3709
41,-1.3709
42,-1.3709
43,-1.3709
44,-1.3709
45,-1.3709
46,-0.43973
47,1.2157
48,1.1123
49,0.9053399999999999
50,0.80187
51,0.6984
52,0.80187
53,0.6984
54,0.6984
55,0.6984
56,0.5949399999999999
57,0.6984
58,0.6984
59,0.6984
60,0.6984
61,0.5949399999999999
62,0.6984
63,0.6984
64,0.6984
65,-1.3709
66,-1.3709
67,-1.3709
68,-1.3709
69,-1.3709
70,-1.3709
71,-1.3709
72,-1.3709
73,-1.3709
74,-1.3709
75,0.38799999999999996
76,1.2157
77,1.1123
78,0.80187
79,0.80187
80,0.80187
81,0.6984
82,0.6984
83,0.6984
84,0.6984
85,0.5949399999999999
86,0.6984
87,0.5949399999999999
88,0.6984
89,0.6984
90,0.5949399999999999
91,0.6984
92,0.5949399999999999
93,0.6984
94,-1.1640000000000001
95,-1.3709
