time,value
0,-0.35303
1,-0.35303
2,-0.35303
3,-0.35303
4,-0.35303
5,-0.35303
6,-0.35303
7,-0.35303
8,-0.35303
9,-0.35303
10,-0.35303
11,-0.35303
12,-0.35303
13,-0.35303
14,-0.35303
15,-0.35303
16,-0.35303
17,-0.35303
18,-0.35303
19,-0.35303
20,-0.35303
21,-0.35303
22,-0.35303
23,0.32673
24,2.4631
25,-0.35303
26,-0.35303
27,-0.35303
28,-0.35303
29,-0.35303
30,2.7544
31,-0.35303
32,-0.35303
33,2.803
34,-0.35303
35,-0.35303
36,-0.35303
37,-0.35303
38,-0.35303
39,-0.35303
40,2.6573
41,-0.35303
42,-0.35303
43,-0.35303
44,-0.35303
45,-0.35303
46,-0.35303
47,2.6573
48,0.5695
49,-0.35303
50,-0.35303
51,-0.35303
52,2.8515
53,-0.35303
54,-0.35303
55,-0.35303
56,-0.35303
57,-0.35303
58,-0.35303
59,-0.35303
60,-0.35303
61,3.5799
62,-0.35303
63,-0.35303
64,-0.35303
65,-0.35303
66,-0.35303
67,2.9972
68,-0.35303
69,2.4631
70,-0.35303
71,3.5313
72,-0.35303
73,-0.35303
74,-0.35303
75,-0.35303
76,-0.35303
77,-0.35303
78,-0.35303
79,-0.35303
80,-0.35303
81,-0.35303
82,-0.35303
83,-0.35303
84,-0.35303
85,-0.35303
86,-0.35303
87,-0.35303
88,-0.35303
89,-0.35303
90,-0.35303
91,-0.35303
92,-0.35303
93,-0.35303
94,-0.35303
95,-0.35303
