time,value
0,-2.2643
1,-2.2643
2,-2.2643
3,-2.2643
4,-2.2643
5,-2.2643
6,-2.2643
7,-2.2643
8,-2.2643
9,-2.2643
10,-2.2642
11,-2.2639
12,-2.2636
13,-2.2656
14,-2.265
15,-2.2643
16,-2.2636
17,-2.2628
18,-2.2619
19,-2.2609
20,-2.2598
21,-2.2586
22,-2.2569
23,-2.2635
24,-2.2702
25,-2.2716
26,-2.27
27,-2.2684
28,-2.2666
29,-2.2648
30,-2.2629
31,-2.2602
32,-2.2581
33,-2.2559
34,-2.2536
35,-2.2512
36,-2.2487
37,-2.2462
38,-2.2436
39,-2.2409
40,-2.2371
41,-2.2343
42,-2.2313
43,-2.2283
44,-2.2252
45,-2.222
46,-2.2188
47,-2.2154
48,-2.2121
49,-2.2074
50,-2.2039
51,-2.2003
52,-2.1966
53,-2.1929
54,-2.1891
55,-2.1853
56,-2.1813
57,-2.176
58,-2.1719999999999997
59,-2.1679
60,-2.1637
61,-2.1595
62,-2.1553
63,-2.1509
64,-2.1466
65,-2.1422
66,-2.1362
67,-2.1317
68,-2.1271
69,-2.1225
70,-2.1178
71,-2.1131
72,-2.1084
73,-2.1036
74,-2.0987
75,-2.0922
76,-2.0873
77,-2.0823
78,-2.0773
79,-2.0723
80,-2.0672
81,-2.0621
82,-2.0569
83,-2.0517
84,-2.0448
85,-2.0395
86,-2.0342
87,-2.0289
88,-2.0235
89,-2.0182
90,-2.0127
91,-2.0073
92,-2.0018
93,-1.9945
94,-1.9889
95,-1.9834
96,-1.9778
97,-1.9722
98,-1.9665
99,-1.9609
100,-1.9552
101,-1.9476
102,-1.9418
103,-1.9361
104,-1.9303
105,-1.9245
106,-1.9186
107,-1.9128
108,-1.9069
109,-1.901
110,-1.8931
111,-1.8872
112,-1.8812
113,-1.8753
114,-1.8693
115,-1.8632
116,-1.8572
117,-1.8512
118,-1.8451
119,-1.837
120,-1.8309
121,-1.8248
122,-1.8187
123,-1.8125
124,-1.8063
125,-1.8002
126,-1.794
127,-1.7878
128,-1.7795
129,-1.7732
130,-1.767
131,-1.7607
132,-1.7544
133,-1.7482
134,-1.7419
135,-1.7367
136,-1.7283
137,-1.7219
138,-1.7156
139,-1.7092
140,-1.7073
141,-1.7086
142,-1.7055
143,-1.699
144,-1.6926
145,-1.6851
146,-1.6786
147,-1.6721
148,-1.6656
149,-1.6591
150,-1.6537
151,-1.6471
152,-1.6406
153,-1.6340000000000001
154,-1.6253
155,-1.6187
156,-1.6121
157,-1.6056
158,-1.599
159,-1.5924
160,-1.5932
161,-1.5962
162,-1.5906
163,-1.5817
164,-1.575
165,-1.5684
166,-1.5617
167,-1.555
168,-1.5483
169,-1.5416
170,-1.5358
171,-1.5269
172,-1.5202
173,-1.5134
174,-1.5067
175,-1.5
176,-1.4932
177,-1.4865
178,-1.4797
179,-1.472
180,-1.463
181,-1.4562
182,-1.4495
183,-1.4427
184,-1.4359
185,-1.4319
186,-1.4269
187,-1.4206
188,-1.4139
189,-1.4048
190,-1.3981
191,-1.3904
192,-1.3836
193,-1.3768
194,-1.3714
195,-1.3665
196,-1.3638
197,-1.3571
198,-1.348
199,-1.3404
200,-1.3336
201,-1.3282
202,-1.3232
203,-1.3206
204,-1.3138
205,-1.307
206,-1.2994
207,-1.2903
208,-1.2849
209,-1.28
210,-1.2773
211,-1.2705
212,-1.2638
213,-1.2570000000000001
214,-1.2502
215,-1.2403
216,-1.2335
217,-1.2267
218,-1.2227
219,-1.2178
220,-1.2137
221,-1.207
222,-1.1993
223,-1.1925
224,-1.1835
225,-1.1794
226,-1.1745
227,-1.1704
228,-1.1637
229,-1.1569
230,-1.1501
231,-1.1425
232,-1.1357
233,-1.1267
234,-1.119
235,-1.1141
236,-1.1114
237,-1.1046
238,-1.0979
239,-1.0911
240,-1.0843
241,-1.0766
242,-1.0676
243,-1.0608
244,-1.054
245,-1.0472
246,-1.0395
247,-1.0347
248,-1.0298
249,-1.023
250,-1.0139
251,-1.0071
252,-0.99946
253,-0.99266
254,-0.9858600000000001
255,-0.97906
256,-0.97645
257,-0.9715600000000001
258,-0.96615
259,-0.9571
260,-0.95031
261,-0.9435100000000001
262,-0.93671
263,-0.92991
264,-0.92224
265,-0.91543
266,-0.9086200000000001
267,-0.90181
268,-0.89469
269,-0.8920899999999999
270,-0.88669
271,-0.87989
272,-0.8730899999999999
273,-0.8662799999999999
274,-0.8594700000000001
275,-0.85265
276,-0.84583
277,-0.8358899999999999
278,-0.82906
279,-0.82224
280,-0.8154100000000001
281,-0.80857
282,-0.80174
283,-0.7949
284,-0.78806
285,-0.77893
286,-0.77208
287,-0.76441
288,-0.7619199999999999
289,-0.7571399999999999
290,-0.75258
291,-0.74574
292,-0.7389
293,-0.73206
294,-0.72292
295,-0.71607
296,-0.70922
297,-0.7015399999999999
298,-0.6946899999999999
299,-0.68783
300,-0.68096
301,-0.6741
302,-0.66723
303,-0.66494
304,-0.66494
305,-0.6572600000000001
306,-0.65188
307,-0.64878
308,-0.64568
309,-0.6380100000000001
310,-0.6303300000000001
311,-0.6249399999999999
312,-0.62266
313,-0.61808
314,-0.61121
315,-0.60353
316,-0.5966600000000001
317,-0.58978
318,-0.5829
319,-0.57602
320,-0.56834
321,-0.56366
322,-0.56125
323,-0.55438
324,-0.54751
325,-0.54063
326,-0.53375
327,-0.52687
328,-0.51999
329,-0.51002
330,-0.50313
331,-0.49625
332,-0.48935
333,-0.48246000000000006
334,-0.47557
335,-0.47248999999999997
336,-0.46784
337,-0.46087
338,-0.45169
339,-0.44481000000000004
340,-0.43791
341,-0.43101999999999996
342,-0.42413
343,-0.41723000000000005
344,-0.41033000000000003
345,-0.40343
346,-0.39652
347,-0.38732
348,-0.38040999999999997
349,-0.3735
350,-0.36658
351,-0.35967
352,-0.35275
353,-0.34583
354,-0.33891
355,-0.33198
356,-0.32275
357,-0.31582
358,-0.30889
359,-0.30501
360,-0.30344
361,-0.30112
362,-0.29418
363,-0.28724
364,-0.27798
365,-0.27104
366,-0.26482
367,-0.26554
368,-0.26395
369,-0.26002
370,-0.25306999999999996
371,-0.24611
372,-0.23914000000000002
373,-0.23218000000000003
374,-0.22985999999999998
375,-0.22521
376,-0.21824000000000002
377,-0.21128000000000002
378,-0.2043
379,-0.19733
380,-0.19036
381,-0.18338
382,-0.17407999999999998
383,-0.17199
384,-0.16755
385,-0.16058
386,-0.15361
387,-0.14664000000000002
388,-0.13965999999999998
389,-0.13269
390,-0.12571
391,-0.11571
392,-0.10873
393,-0.10175
394,-0.09476699999999999
395,-0.087783
396,-0.080796
397,-0.07545299999999999
398,-0.073387
399,-0.068976
400,-0.066653
401,-0.059673000000000004
402,-0.05269600000000001
403,-0.045714
404,-0.03804
405,-0.031058
406,-0.024077
407,-0.01709
408,-0.0077751999999999995
409,-0.0007862
410,0.006203800000000001
411,0.013194999999999998
412,0.020189
413,0.027183
414,0.03418
415,0.041176
416,0.048175
417,0.057509000000000005
418,0.059842
419,0.062175
420,0.064511
421,0.071515
422,0.07385
423,0.076183
424,0.079183
425,0.086852
426,0.096857
427,0.10453
428,0.11152999999999999
429,0.11854
430,0.11854
431,0.1222
432,0.12753
433,0.1352
434,0.14121
435,0.14556
436,0.14924
437,0.15624000000000002
438,0.16323
439,0.17023
440,0.17723
441,0.18423
442,0.19122999999999998
443,0.20056
444,0.20823000000000003
445,0.21524000000000001
446,0.22224000000000002
447,0.22925
448,0.23626
449,0.24327
450,0.25028
451,0.25729
452,0.26226
453,0.26426
454,0.27126
455,0.27826
456,0.28526999999999997
457,0.29227
458,0.29928
459,0.30629
460,0.3133
461,0.32331
462,0.33032
463,0.33733
464,0.34435
465,0.35136
466,0.35838000000000003
467,0.3654
468,0.37240999999999996
469,0.37944
470,0.3888
471,0.39582
472,0.40284000000000003
473,0.40986999999999996
474,0.41689
475,0.42391999999999996
476,0.43095
477,0.43798000000000004
478,0.44736000000000004
479,0.45438999999999996
480,0.46205
481,0.46908
482,0.47143
483,0.47143
484,0.47846000000000005
485,0.48613
486,0.49378999999999995
487,0.5038
488,0.50443
489,0.5074
490,0.51507
491,0.5221
492,0.52913
493,0.52913
494,0.5314800000000001
495,0.53617
496,0.54555
497,0.5525800000000001
498,0.55962
499,0.56729
500,0.5743199999999999
501,0.58136
502,0.58668
503,0.5909
504,0.59513
505,0.60451
506,0.61154
507,0.61858
508,0.62561
509,0.63265
510,0.63969
511,0.64673
512,0.65377
513,0.66378
514,0.67082
515,0.67787
516,0.68491
517,0.69195
518,0.6990000000000001
519,0.70605
520,0.71309
521,0.72075
522,0.72729
523,0.73149
524,0.73854
525,0.74558
526,0.75262
527,0.75967
528,0.76671
529,0.77376
530,0.78081
531,0.7831600000000001
532,0.7831600000000001
533,0.78133
534,0.77952
535,0.77772
536,0.77594
537,0.77535
538,0.77476
539,0.77181
540,0.7671100000000001
541,0.7636
542,0.75652
543,0.74945
544,0.74238
545,0.73531
546,0.72824
547,0.72059
548,0.71117
549,0.70706
550,0.70532
551,0.70003
552,0.69295
553,0.68588
554,0.67881
555,0.67173
556,0.66466
557,0.65465
558,0.64758
559,0.64052
560,0.63345
561,0.62992
562,0.6258199999999999
563,0.62231
564,0.61524
565,0.60758
566,0.59815
567,0.59108
568,0.5875600000000001
569,0.5858399999999999
570,0.58413
571,0.58008
572,0.5784
573,0.57312
574,0.56603
575,0.55658
576,0.5494899999999999
577,0.5424
578,0.53532
579,0.5282399999999999
580,0.52059
581,0.5135
582,0.50642
583,0.49933999999999995
584,0.4899
585,0.48403999999999997
586,0.47998999999999997
587,0.47415
588,0.46706000000000003
589,0.45997
590,0.45288999999999996
591,0.4458
592,0.43578999999999996
593,0.42871000000000004
594,0.42163
595,0.41455
596,0.4069
597,0.40341
598,0.39936
599,0.39171
600,0.38406999999999997
601,0.37948000000000004
602,0.37546999999999997
603,0.36837
604,0.36128000000000005
605,0.35419
606,0.34654
607,0.33945
608,0.33236
609,0.32527
610,0.31943
611,0.31542
612,0.31196999999999997
613,0.30487
614,0.29723
615,0.29324
616,0.29163
617,0.28636
618,0.27926
619,0.26925
620,0.26215
621,0.25504
622,0.24794000000000002
623,0.24084
624,0.23503000000000002
625,0.23106
626,0.22763000000000003
627,0.21763000000000002
628,0.21236
629,0.20842
630,0.20449
631,0.19738
632,0.18975
633,0.18263
634,0.17552
635,0.16974
636,0.16532
637,0.16005999999999998
638,0.15294000000000002
639,0.14531
640,0.13819
641,0.13107
642,0.12479000000000001
643,0.12329000000000001
644,0.11565999999999999
645,0.10615999999999999
646,0.09903200000000001
647,0.091907
648,0.08478200000000001
649,0.077659
650,0.070029
651,0.06290599999999999
652,0.055783000000000006
653,0.048663
654,0.039169
655,0.031536
656,0.028147000000000002
657,0.024263
658,0.021388
659,0.014261000000000001
660,0.0066328
661,-0.0004942
662,-0.0099942
663,-0.013371000000000001
664,-0.017235
665,-0.020595
666,-0.027727999999999996
667,-0.03486
668,-0.041993
669,-0.049123
670,-0.056748
671,-0.066255
672,-0.073385
673,-0.080512
674,-0.08764
675,-0.092891
676,-0.094376
677,-0.095843
678,-0.09729
679,-0.09872
680,-0.1006
681,-0.10198
682,-0.10335
683,-0.1047
684,-0.10603
685,-0.10734
686,-0.1006
687,-0.093435
688,-0.086268
689,-0.07713300000000001
690,-0.069964
691,-0.06279
692,-0.05561900000000001
693,-0.053648
694,-0.052503999999999995
695,-0.051338999999999996
696,-0.044157999999999996
697,-0.034581
698,-0.027801
699,-0.020617
700,-0.019017
701,-0.017796
702,-0.016172
703,-0.0089792
704,-0.0021701999999999997
705,0.0050238
706,0.014615000000000001
707,0.016263999999999997
708,0.017553
709,0.024025
710,0.031225
711,0.038428
712,0.045631
713,0.052834000000000006
714,0.060037
715,0.069643
716,0.076846
717,0.084051
718,0.09125599999999999
719,0.097126
720,0.10061
721,0.10818
722,0.11538
723,0.12258
724,0.13254000000000002
725,0.13974
726,0.14695
727,0.15415
728,0.15727
729,0.16078
730,0.16392
731,0.17112
732,0.17832
733,0.18828
734,0.19548
735,0.20268
736,0.20986999999999997
737,0.21706999999999999
738,0.22426999999999997
739,0.23146999999999998
740,0.23664000000000002
741,0.24053000000000002
742,0.24368
743,0.25088
744,0.25806999999999997
745,0.26527
746,0.27246
747,0.27965
748,0.28723000000000004
749,0.29441999999999996
750,0.30401
751,0.31121
752,0.31601
753,0.31840999999999997
754,0.3208
755,0.32837
756,0.33115
757,0.33392
758,0.33909
759,0.34907
760,0.35664
761,0.35941999999999996
762,0.35941999999999996
763,0.36661
764,0.3738
765,0.381
766,0.38819000000000004
767,0.39538
768,0.40498
769,0.41217
770,0.41973999999999995
771,0.42694
772,0.43413
773,0.44133
774,0.44853000000000004
775,0.45571999999999996
776,0.46531999999999996
777,0.47012
778,0.47363999999999995
779,0.47717
780,0.47755
781,0.48473999999999995
782,0.49193000000000003
783,0.49951
784,0.5067
785,0.5162899999999999
786,0.5234800000000001
787,0.53068
788,0.53787
789,0.5450699999999999
790,0.5522600000000001
791,0.5594600000000001
792,0.56666
793,0.57385
794,0.58345
795,0.59065
796,0.5978399999999999
797,0.6050399999999999
798,0.61187
799,0.61907
800,0.62664
801,0.63347
802,0.6410399999999999
803,0.65064
804,0.65784
805,0.66504
806,0.67224
807,0.6794399999999999
808,0.6866399999999999
809,0.69348
810,0.7006899999999999
811,0.71029
812,0.7175
813,0.7247
814,0.7319100000000001
815,0.73911
816,0.73911
817,0.74151
818,0.7459600000000001
819,0.7528199999999999
820,0.76174
821,0.76174
822,0.76654
823,0.77375
824,0.77615
825,0.77822
826,0.78062
827,0.78783
828,0.79504
829,0.79985
830,0.80191
831,0.80879
832,0.8136
833,0.816
834,0.8184100000000001
835,0.82562
836,0.83283
837,0.84005
838,0.84967
839,0.85688
840,0.8641
841,0.87131
842,0.8785299999999999
843,0.88574
844,0.8929600000000001
845,0.89602
846,0.89943
847,0.9073100000000001
848,0.91453
849,0.92174
850,0.92895
851,0.93616
852,0.9433799999999999
853,0.9509299999999999
854,0.95814
855,0.9677600000000001
856,0.9749700000000001
857,0.9821799999999999
858,0.9894
859,0.99454
860,0.99795
861,1.0014
862,1.0086
863,1.0158
864,1.0254
865,1.0326
866,1.0398
867,1.047
868,1.0543
869,1.0615
870,1.0687
871,1.0677
872,1.0691
873,1.0759999999999998
874,1.0832
875,1.0904
876,1.0973
877,1.1045
878,1.1118
879,1.119
880,1.1235
881,1.1225
882,1.1264
883,1.1336
884,1.1409
885,1.1481
886,1.1553
887,1.1625
888,1.1698
889,1.177
890,1.1866
891,1.1938
892,1.2011
893,1.2083
894,1.2155
895,1.2227
896,1.23
897,1.2372
898,1.242
899,1.2444
900,1.2492
901,1.2565
902,1.2565
903,1.2589
904,1.2637
905,1.2709
906,1.2779
907,1.2851
908,1.2947
909,1.2963
910,1.2954
911,1.2975
912,1.2972
913,1.297
914,1.2961
915,1.2953
916,1.2945
917,1.2937
918,1.2934
919,1.291
920,1.2902
921,1.287
922,1.2819
923,1.2747
924,1.2675
925,1.2575
926,1.2503
927,1.2431
928,1.2358
929,1.2307
930,1.23
931,1.2268
932,1.2196
933,1.2123
934,1.2024
935,1.1952
936,1.1879
937,1.1807
938,1.1734
939,1.1703
940,1.1672
941,1.1621
942,1.1546
943,1.1491
944,1.1459
945,1.1409
946,1.1336
947,1.1264
948,1.1191
949,1.1117
950,1.1044
951,1.0972
952,1.0875
953,1.0802
954,1.073
955,1.0657
956,1.0585
957,1.0515
958,1.0442
959,1.037
960,1.0273
961,1.0201
962,1.0128
963,1.0056
964,0.99831
965,0.99106
966,0.9838100000000001
967,0.97656
968,0.9693200000000001
969,0.95942
970,0.9521700000000001
971,0.9449200000000001
972,0.9376700000000001
973,0.93042
974,0.9231799999999999
975,0.9159299999999999
976,0.91522
977,0.9121
978,0.9046200000000001
979,0.8973700000000001
980,0.89012
981,0.88287
982,0.8756200000000001
983,0.8683700000000001
984,0.8611200000000001
985,0.85364
986,0.84639
987,0.83672
988,0.8294799999999999
989,0.8222299999999999
990,0.81498
991,0.8077300000000001
992,0.80048
993,0.79323
994,0.78598
995,0.77873
996,0.76907
997,0.7618199999999999
998,0.75893
999,0.7558199999999999
1000,0.75295
1001,0.7457
1002,0.73845
1003,0.7312
1004,0.72153
1005,0.71428
1006,0.7068
1007,0.69955
1008,0.6923
1009,0.68505
1010,0.6778
1011,0.67055
1012,0.6633
1013,0.6602
1014,0.6571100000000001
1015,0.64964
1016,0.64239
1017,0.63513
1018,0.62788
1019,0.62041
1020,0.62019
1021,0.6177699999999999
1022,0.61052
1023,0.60305
1024,0.59558
1025,0.58811
1026,0.58548
1027,0.58285
1028,0.58022
1029,0.57296
1030,0.56571
1031,0.55845
1032,0.55845
1033,0.55361
1034,0.5463600000000001
1035,0.5391
1036,0.53164
1037,0.5243800000000001
1038,0.51713
1039,0.50745
1040,0.5024
1041,0.49936
1042,0.49633
1043,0.48908
1044,0.48181999999999997
1045,0.47436000000000006
1046,0.4671
1047,0.46206
1048,0.45886000000000005
1049,0.45606
1050,0.4488
1051,0.44154
1052,0.43428
1053,0.42683000000000004
1054,0.41956000000000004
1055,0.4123
1056,0.40504
1057,0.39964
1058,0.3991
1059,0.39408000000000004
1060,0.38681
1061,0.37955
1062,0.37229
1063,0.36501999999999996
1064,0.35758
1065,0.35031999999999996
1066,0.34063000000000004
1067,0.33337
1068,0.32611
1069,0.32333
1070,0.32039
1071,0.31521
1072,0.30794
1073,0.30068
1074,0.29099
1075,0.28371999999999997
1076,0.27646
1077,0.26919
1078,0.26193
1079,0.25466
1080,0.24999000000000002
1081,0.2481
1082,0.24622
1083,0.23654
1084,0.22928
1085,0.22200999999999999
1086,0.21475
1087,0.20749
1088,0.20023
1089,0.19297
1090,0.18571
1091,0.17845
1092,0.16876
1093,0.1615
1094,0.15424000000000002
1095,0.14698
1096,0.13972
1097,0.13246
1098,0.12947
1099,0.12650999999999998
1100,0.12149000000000001
1101,0.1118
1102,0.10454000000000001
1103,0.097097
1104,0.089834
1105,0.08257
1106,0.075307
1107,0.070286
1108,0.06976399999999999
1109,0.066839
1110,0.066196
1111,0.065734
1112,0.060738
1113,0.06059
1114,0.060441999999999996
1115,0.060016999999999994
1116,0.059609
1117,0.059221
1118,0.05873099999999999
1119,0.058383000000000004
1120,0.058383000000000004
1121,0.063234
1122,0.070398
1123,0.077673
1124,0.082308
1125,0.084427
1126,0.086755
1127,0.096362
1128,0.10354000000000001
1129,0.11082
1130,0.1181
1131,0.12025999999999999
1132,0.12485999999999998
1133,0.13199
1134,0.13927
1135,0.13905
1136,0.14121
1137,0.14104
1138,0.14088
1139,0.14564000000000002
1140,0.15292
1141,0.16016
1142,0.16744
1143,0.17472000000000001
1144,0.17707
1145,0.18178
1146,0.18903
1147,0.19630999999999998
1148,0.2036
1149,0.21088
1150,0.21816
1151,0.22544
1152,0.23273000000000002
1153,0.24244000000000002
1154,0.24971999999999997
1155,0.257
1156,0.25943
1157,0.26185
1158,0.26671
1159,0.27399
1160,0.27642
1161,0.27642
1162,0.28619
1163,0.29351
1164,0.30079
1165,0.30804000000000004
1166,0.31529
1167,0.31769000000000003
1168,0.32011999999999996
1169,0.32254
1170,0.32983
1171,0.33468000000000003
1172,0.33471
1173,0.34199
1174,0.34931
1175,0.35662
1176,0.36386999999999997
1177,0.37112
1178,0.37598000000000004
1179,0.37595
1180,0.3808
1181,0.38811
1182,0.39057
1183,0.39303
1184,0.39549
1185,0.40281
1186,0.41013
1187,0.41502
1188,0.41745
1189,0.42473
1190,0.43201000000000006
1191,0.4393
1192,0.44658000000000003
1193,0.45386000000000004
1194,0.46113999999999994
1195,0.46842
1196,0.47571
1197,0.48541000000000006
1198,0.4927
1199,0.49998000000000004
1200,0.50726
1201,0.51454
1202,0.52183
1203,0.52668
1204,0.5291100000000001
1205,0.5315300000000001
1206,0.54125
1207,0.5485300000000001
1208,0.55095
1209,0.55338
1210,0.55824
1211,0.56552
1212,0.5728
1213,0.58008
1214,0.58736
1215,0.59707
1216,0.60435
1217,0.61164
1218,0.61892
1219,0.6262
1220,0.63348
1221,0.64077
1222,0.6431899999999999
1223,0.64558
1224,0.6504
1225,0.65765
1226,0.6649
1227,0.6673
1228,0.6697
1229,0.6721
1230,0.6793899999999999
1231,0.68424
1232,0.68667
1233,0.69152
1234,0.69881
1235,0.70609
1236,0.71337
1237,0.72065
1238,0.7279399999999999
1239,0.73522
1240,0.7425
1241,0.7521899999999999
1242,0.75947
1243,0.76675
1244,0.77403
1245,0.78132
1246,0.7886
1247,0.79588
1248,0.79827
1249,0.80064
1250,0.80547
1251,0.81276
1252,0.82004
1253,0.82732
1254,0.8346
1255,0.8418899999999999
1256,0.8491700000000001
1257,0.85644
1258,0.8637299999999999
1259,0.87344
1260,0.8807200000000001
1261,0.888
1262,0.8952899999999999
1263,0.9025700000000001
1264,0.90985
1265,0.9147
1266,0.9171100000000001
1267,0.91953
1268,0.9268200000000001
1269,0.9341
1270,0.9413799999999999
1271,0.9486700000000001
1272,0.95595
1273,0.9632299999999999
1274,0.97052
1275,0.9729399999999999
1276,0.9753700000000001
1277,0.9802299999999999
1278,0.98751
1279,0.99479
1280,0.99723
1281,0.99966
1282,1.0045
1283,1.0118
1284,1.0191
1285,1.0288
1286,1.0313
1287,1.0337
1288,1.0385
1289,1.0458
1290,1.0531
1291,1.0604
1292,1.0677
1293,1.0749
1294,1.0847
1295,1.0919
1296,1.0944
1297,1.0968
1298,1.1041
1299,1.1114
1300,1.1186
1301,1.1259
1302,1.1283
1303,1.1308
1304,1.138
1305,1.1453
1306,1.1526
1307,1.1551
1308,1.1551
1309,1.1599
1310,1.1672
1311,1.1696
1312,1.172
1313,1.1793
1314,1.1866
1315,1.189
1316,1.1915
1317,1.1939
1318,1.2012
1319,1.2061
1320,1.2085
1321,1.2133
1322,1.2206
1323,1.2279
1324,1.2352
1325,1.2425
1326,1.2498
1327,1.2570000000000001
1328,1.2643
1329,1.274
1330,1.2813
1331,1.2886
1332,1.2959
1333,1.3032
1334,1.3057
1335,1.3057
1336,1.3130000000000002
1337,1.3228
1338,1.3229
1339,1.3254
1340,1.3327
1341,1.34
1342,1.3472
1343,1.3545
1344,1.3618
1345,1.3691
1346,1.3788
1347,1.3861
1348,1.3934
1349,1.4006
1350,1.4079
1351,1.4152
1352,1.4225
1353,1.4298
1354,1.4371
1355,1.4443
1356,1.4468
1357,1.4468
1358,1.4517
1359,1.4589
1360,1.4589
1361,1.4589
1362,1.4614
1363,1.4616
1364,1.4689
1365,1.4762
1366,1.4835
1367,1.4908
1368,1.4981
1369,1.4982
1370,1.4984
1371,1.501
1372,1.5012
1373,1.5014
1374,1.5014
1375,1.5014
1376,1.5017
1377,1.5018
1378,1.5019
1379,1.4995
1380,1.4997
1381,1.5
1382,1.4927
1383,1.4855
1384,1.4833
1385,1.4812
1386,1.4789
1387,1.4717
1388,1.4669
1389,1.4669
1390,1.4596
1391,1.4523
1392,1.4499
1393,1.4475
1394,1.4452
1395,1.4380000000000002
1396,1.4308
1397,1.4236
1398,1.4164
1399,1.4067
1400,1.4067
1401,1.4044
1402,1.3997
1403,1.3924
1404,1.3853
1405,1.3780000000000001
1406,1.3707
1407,1.3685
1408,1.3666
1409,1.3618
1410,1.3546
1411,1.3473
1412,1.34
1413,1.3327
1414,1.3255
1415,1.3182
1416,1.3085
1417,1.3012
1418,1.294
1419,1.2867
1420,1.2794
1421,1.2721
1422,1.2649
1423,1.2576
1424,1.2503
1425,1.2406
1426,1.2333
1427,1.2261
1428,1.2188
1429,1.2115
1430,1.2044
1431,1.197
1432,1.1898
1433,1.1826
1434,1.1727
1435,1.1656
1436,1.1583
1437,1.1509
1438,1.1436
1439,1.1364
1440,1.1291
1441,1.1218
1442,1.1146
1443,1.1049
1444,1.0976
1445,1.0903
1446,1.083
1447,1.0758
1448,1.0685
1449,1.0612
1450,1.054
1451,1.0443
1452,1.037
1453,1.0297
1454,1.0226
1455,1.0153
1456,1.008
1457,1.0008
1458,0.99349
1459,0.9862200000000001
1460,0.97652
1461,0.96925
1462,0.96198
1463,0.9547100000000001
1464,0.94744
1465,0.9425899999999999
1466,0.94016
1467,0.93774
1468,0.93061
1469,0.9283299999999999
1470,0.92604
1471,0.9189200000000001
1472,0.91179
1473,0.90709
1474,0.9048200000000001
1475,0.9024
1476,0.8999799999999999
1477,0.89271
1478,0.8830100000000001
1479,0.87575
1480,0.8686299999999999
1481,0.86136
1482,0.85409
1483,0.84683
1484,0.8395600000000001
1485,0.83229
1486,0.8250200000000001
1487,0.81533
1488,0.80806
1489,0.80079
1490,0.7935300000000001
1491,0.78884
1492,0.78884
1493,0.78642
1494,0.77915
1495,0.76946
1496,0.7621899999999999
1497,0.75492
1498,0.75492
1499,0.7525
1500,0.7475
1501,0.74023
1502,0.7329600000000001
1503,0.7257
1504,0.716
1505,0.7087399999999999
1506,0.70131
1507,0.69404
1508,0.6867800000000001
1509,0.6795100000000001
1510,0.67224
1511,0.66498
1512,0.65771
1513,0.6480199999999999
1514,0.64075
1515,0.63349
1516,0.62622
1517,0.61912
1518,0.61185
1519,0.60458
1520,0.59732
1521,0.59005
1522,0.58036
1523,0.57586
1524,0.57395
1525,0.57188
1526,0.56462
1527,0.5573600000000001
1528,0.5501
1529,0.54283
1530,0.53315
1531,0.52589
1532,0.51862
1533,0.51136
1534,0.5041
1535,0.49683999999999995
1536,0.48958
1537,0.48231
1538,0.47505
1539,0.46537
1540,0.45811
1541,0.45083999999999996
1542,0.44358000000000003
1543,0.43651
1544,0.42906000000000005
1545,0.42198
1546,0.41453999999999996
1547,0.40728000000000003
1548,0.39759
1549,0.39033
1550,0.38306999999999997
1551,0.37581
1552,0.36855
1553,0.36129
1554,0.35403
1555,0.34676999999999997
1556,0.33951
1557,0.32964
1558,0.32907
1559,0.32611
1560,0.31884
1561,0.31158
1562,0.30432
1563,0.29706
1564,0.28961
1565,0.27993
1566,0.27266
1567,0.2654
1568,0.25814000000000004
1569,0.2507
1570,0.25017
1571,0.24481
1572,0.23754
1573,0.23028
1574,0.22059
1575,0.21331999999999998
1576,0.20606
1577,0.19879000000000002
1578,0.19153
1579,0.18425999999999998
1580,0.177
1581,0.16974
1582,0.16767
1583,0.16597
1584,0.16132
1585,0.15424000000000002
1586,0.14959
1587,0.15018
1588,0.14836
1589,0.14353
1590,0.13627
1591,0.12922
1592,0.11954000000000001
1593,0.11229000000000001
1594,0.10503
1595,0.097774
1596,0.09315
1597,0.093793
1598,0.09204
1599,0.085015
1600,0.07799199999999999
1601,0.078688
1602,0.079404
1603,0.080138
1604,0.080888
1605,0.08165700000000001
1606,0.082446
1607,0.08325199999999999
1608,0.084075
1609,0.09131
1610,0.09854600000000001
1611,0.10578
1612,0.11329000000000002
1613,0.12053
1614,0.12777
1615,0.135
1616,0.13797
1617,0.13881
1618,0.13996
1619,0.14085
1620,0.14415999999999998
1621,0.14508
1622,0.14602
1623,0.14906
1624,0.15628
1625,0.1635
1626,0.17072
1627,0.18035
1628,0.18757000000000001
1629,0.19479000000000002
1630,0.20201
1631,0.20923000000000003
1632,0.21645999999999999
1633,0.22368000000000002
1634,0.23121
1635,0.23843000000000003
1636,0.24806999999999998
1637,0.25529
1638,0.26250999999999997
1639,0.26974000000000004
1640,0.27696
1641,0.28419
1642,0.29141
1643,0.29864
1644,0.30228
1645,0.30291
1646,0.31045
1647,0.31767
1648,0.32489
1649,0.33211
1650,0.33933
1651,0.34655
1652,0.35409
1653,0.36372
1654,0.37094
1655,0.37816
1656,0.37911
1657,0.38247
1658,0.39002
1659,0.39723
1660,0.40445
1661,0.41198999999999997
1662,0.42162
1663,0.42883999999999994
1664,0.43606000000000006
1665,0.43878
1666,0.44217
1667,0.44283
1668,0.45037
1669,0.45758999999999994
1670,0.46513999999999994
1671,0.47475
1672,0.4799
1673,0.48331
1674,0.48433000000000004
1675,0.49154
1676,0.49875
1677,0.5059600000000001
1678,0.51317
1679,0.52313
1680,0.5303399999999999
1681,0.53755
1682,0.54476
1683,0.55197
1684,0.55919
1685,0.5615899999999999
1686,0.5615899999999999
1687,0.5664
1688,0.57601
1689,0.5835600000000001
1690,0.5839
1691,0.5866399999999999
1692,0.5917899999999999
1693,0.59934
1694,0.6069
1695,0.61445
1696,0.61926
1697,0.62166
1698,0.6288699999999999
1699,0.63608
1700,0.6432899999999999
1701,0.6505
1702,0.65805
1703,0.6652600000000001
1704,0.67247
1705,0.67969
1706,0.6893
1707,0.69685
1708,0.70028
1709,0.7013199999999999
1710,0.70853
1711,0.7157399999999999
1712,0.72329
1713,0.7305
1714,0.7377100000000001
1715,0.74116
1716,0.74222
1717,0.74738
1718,0.75459
1719,0.76215
1720,0.76935
1721,0.77655
1722,0.77967
1723,0.78592
1724,0.78869
1725,0.79589
1726,0.80309
1727,0.81029
1728,0.8174899999999999
1729,0.8246899999999999
1730,0.83225
1731,0.83946
1732,0.84906
1733,0.85626
1734,0.8593799999999999
1735,0.86288
1736,0.87082
1737,0.87802
1738,0.88559
1739,0.89279
1740,0.8999799999999999
1741,0.90238
1742,0.9047799999999999
1743,0.9119799999999999
1744,0.9191799999999999
1745,0.92435
1746,0.92712
1747,0.92989
1748,0.9374600000000001
1749,0.9450299999999999
1750,0.95499
1751,0.9597899999999999
1752,0.96219
1753,0.96496
1754,0.97216
1755,0.97936
1756,0.98655
1757,0.99375
1758,1.0033
1759,1.0109
1760,1.0181
1761,1.0253
1762,1.0325
1763,1.0397
1764,1.0469
1765,1.0541
1766,1.0576
1767,1.0639
1768,1.0711
1769,1.0783
1770,1.0855
1771,1.0927
1772,1.1003
1773,1.1075
1774,1.1146
1775,1.1182
1776,1.1197
1777,1.1233
1778,1.1244
1779,1.1276
1780,1.1348
1781,1.1420000000000001
1782,1.1492
1783,1.1564
1784,1.1639
1785,1.1735
1786,1.1807
1787,1.1879
1788,1.1951
1789,1.2007
1790,1.2042
1791,1.2074
1792,1.215
1793,1.2222
1794,1.2234
1795,1.227
1796,1.2346
1797,1.2422
1798,1.2454
1799,1.249
1800,1.2522
1801,1.2527
1802,1.2531
1803,1.2544
1804,1.2556
1805,1.2569
1806,1.2582
1807,1.2582
1808,1.2587
1809,1.2572
1810,1.2585
1811,1.2579
1812,1.2593
1813,1.2583
1814,1.2511
1815,1.2444
1816,1.2434
1817,1.2448
1818,1.2429
1819,1.2358
1820,1.2263
1821,1.2191
1822,1.212
1823,1.2053
1824,1.1982
1825,1.1909999999999998
1826,1.1839
1827,1.1768
1828,1.173
1829,1.1744
1830,1.1731
1831,1.1659
1832,1.1588
1833,1.1517
1834,1.1445
1835,1.1374
1836,1.1303
1837,1.1213
1838,1.1142
1839,1.107
1840,1.0999
1841,1.0928
1842,1.0857
1843,1.0809
1844,1.0785
1845,1.0785
1846,1.069
1847,1.0667
1848,1.0643
1849,1.0595
1850,1.0524
1851,1.0453
1852,1.0382
1853,1.0311
1854,1.0239
1855,1.0145
1856,1.0073
1857,1.0002
1858,0.99311
1859,0.9854799999999999
1860,0.9783700000000001
1861,0.97125
1862,0.96414
1863,0.95465
1864,0.95176
1865,0.94783
1866,0.9468
1867,0.9391700000000001
1868,0.93205
1869,0.92494
1870,0.9173
1871,0.9101799999999999
1872,0.9007
1873,0.8935799999999999
1874,0.8912100000000001
1875,0.88884
1876,0.88121
1877,0.8735700000000001
1878,0.8659399999999999
1879,0.8654200000000001
1880,0.8625299999999999
1881,0.8520200000000001
1882,0.84964
1883,0.8472700000000001
1884,0.84015
1885,0.83304
1886,0.8259200000000001
1887,0.8188
1888,0.8116899999999999
1889,0.80457
1890,0.79509
1891,0.78798
1892,0.78086
1893,0.77375
1894,0.76664
1895,0.75953
1896,0.75242
1897,0.74531
1898,0.73821
1899,0.72873
1900,0.7216199999999999
1901,0.7145199999999999
1902,0.70741
1903,0.70031
1904,0.6932
1905,0.6861
1906,0.679
1907,0.66899
1908,0.66189
1909,0.65479
1910,0.64769
1911,0.64059
1912,0.63349
1913,0.62639
1914,0.6193
1915,0.6122
1916,0.60219
1917,0.60056
1918,0.59421
1919,0.5871
1920,0.58
1921,0.5729
1922,0.5658
1923,0.5587
1924,0.55161
1925,0.5416
1926,0.5345
1927,0.52741
1928,0.52213
1929,0.51813
1930,0.51652
1931,0.50941
1932,0.50231
1933,0.49521000000000004
1934,0.48573999999999995
1935,0.47865
1936,0.47155
1937,0.46445
1938,0.45681000000000005
1939,0.44971000000000005
1940,0.44261000000000006
1941,0.43551999999999996
1942,0.42661000000000004
1943,0.41896000000000005
1944,0.41186999999999996
1945,0.40478000000000003
1946,0.39769
1947,0.3906
1948,0.38351
1949,0.37642
1950,0.36933
1951,0.35988000000000003
1952,0.3528
1953,0.34695
1954,0.34292
1955,0.33709
1956,0.32999
1957,0.3229
1958,0.31581
1959,0.30872
1960,0.29927
1961,0.29163
1962,0.28454
1963,0.27745
1964,0.27037
1965,0.26328
1966,0.2562
1967,0.24911
1968,0.24203000000000002
1969,0.23259000000000002
1970,0.22551
1971,0.21843
1972,0.21078000000000002
1973,0.20908000000000002
1974,0.20503000000000002
1975,0.19794
1976,0.19086
1977,0.18141
1978,0.17432999999999998
1979,0.16725
1980,0.1596
1981,0.15252000000000002
1982,0.14544
1983,0.13835999999999998
1984,0.13128
1985,0.1242
1986,0.11477000000000001
1987,0.11069000000000001
1988,0.10662999999999999
1989,0.10134
1990,0.09425900000000001
1991,0.087175
1992,0.080094
1993,0.073015
1994,0.065936
1995,0.056497000000000006
1996,0.048848
1997,0.041770999999999996
1998,0.034694
1999,0.027618
2000,0.021124
2001,0.013472
2002,0.006399800000000001
2003,-0.0006722000000000001
2004,-0.010098000000000001
2005,-0.017166999999999998
2006,-0.024234000000000002
2007,-0.031299
2008,-0.038366000000000004
2009,-0.043075
2010,-0.04543
2011,-0.047783
2012,-0.054847
2013,-0.064261
2014,-0.06661399999999999
2015,-0.068969
2016,-0.074271
2017,-0.081925
2018,-0.08958200000000001
2019,-0.09664099999999999
2020,-0.1037
2021,-0.11310999999999999
2022,-0.12017
2023,-0.12017
2024,-0.12252
2025,-0.12722
2026,-0.13427999999999998
2027,-0.14132999999999998
2028,-0.14837999999999998
2029,-0.15542999999999998
2030,-0.16247999999999999
2031,-0.16483
2032,-0.16534000000000001
2033,-0.17238
2034,-0.17942
2035,-0.18646
2036,-0.19287
2037,-0.19991
2038,-0.20694
2039,-0.21568
2040,-0.21675
2041,-0.21481999999999998
2042,-0.22119
2043,-0.22821
2044,-0.23523000000000002
2045,-0.24224
2046,-0.24925
2047,-0.25626
2048,-0.26561
2049,-0.27195
2050,-0.27896
2051,-0.28596
2052,-0.29296
2053,-0.29996
2054,-0.30696
2055,-0.31395
2056,-0.32328
2057,-0.32123
2058,-0.3215
2059,-0.32778
2060,-0.33475
2061,-0.34103
2062,-0.348
2063,-0.35425999999999996
2064,-0.35212
2065,-0.35461
2066,-0.36156
2067,-0.36851
2068,-0.37473
2069,-0.37473
2070,-0.37326
2071,-0.37104000000000004
2072,-0.36880999999999997
2073,-0.36655
2074,-0.36351
2075,-0.36198
2076,-0.36198
2077,-0.35507
2078,-0.3474
2079,-0.34048
2080,-0.33358000000000004
2081,-0.32896
2082,-0.32588
2083,-0.31668
2084,-0.30978
2085,-0.30287
2086,-0.29519
2087,-0.28828000000000004
2088,-0.28137
2089,-0.27523000000000003
2090,-0.27061999999999997
2091,-0.26216999999999996
2092,-0.25527
2093,-0.24836
2094,-0.24145
2095,-0.23454
2096,-0.22687
2097,-0.21996
2098,-0.21535
2099,-0.21075
2100,-0.20536
2101,-0.20075
2102,-0.19385
2103,-0.18617
2104,-0.17927
2105,-0.17235999999999999
2106,-0.16774
2107,-0.16541
2108,-0.16004000000000002
2109,-0.15084
2110,-0.14394
2111,-0.13704000000000002
2112,-0.13014
2113,-0.12245999999999999
2114,-0.11555
2115,-0.10864000000000001
2116,-0.10173
2117,-0.094823
2118,-0.089448
2119,-0.0856
2120,-0.07792400000000001
2121,-0.07102
2122,-0.06334400000000001
2123,-0.05644
2124,-0.048761
2125,-0.046443
2126,-0.043321
2127,-0.038664
2128,-0.036289999999999996
2129,-0.028613999999999997
2130,-0.021731
2131,-0.014846999999999999
2132,-0.0079592
2133,-0.0002832
2134,0.0066067999999999995
2135,0.015795
2136,0.022687
2137,0.029584
2138,0.03726
2139,0.041907
2140,0.045777
2141,0.053453
2142,0.060342999999999994
2143,0.067235
2144,0.07720700000000001
2145,0.079506
2146,0.08416
2147,0.08653200000000001
2148,0.091914
2149,0.098799
2150,0.10568
2151,0.11335999999999999
2152,0.12025
2153,0.128
2154,0.13189
2155,0.13956
2156,0.14644000000000001
2157,0.15333
2158,0.161
2159,0.16638
2160,0.17107
2161,0.17576
2162,0.18492999999999998
2163,0.1926
2164,0.19948
2165,0.20636
2166,0.21025
2167,0.21494000000000002
2168,0.22114
2169,0.22880999999999999
2170,0.23501
2171,0.23973000000000003
2172,0.24364
2173,0.25132
2174,0.25818
2175,0.25981
2176,0.26456
2177,0.27076999999999996
2178,0.27844
2179,0.28549
2180,0.29026
2181,0.29565
2182,0.30333000000000004
2183,0.30956
2184,0.31435
2185,0.32058000000000003
2186,0.32825
2187,0.33281
2188,0.33846
2189,0.341
2190,0.34781999999999996
2191,0.35549000000000003
2192,0.35946999999999996
2193,0.36203
2194,0.36687
2195,0.36946
2196,0.37206999999999996
2197,0.38061
2198,0.38741
2199,0.39229
2200,0.39491
2201,0.39982
2202,0.40247
2203,0.4074
2204,0.41418
2205,0.42183999999999994
2206,0.42452
2207,0.42721000000000003
2208,0.42991
2209,0.43263
2210,0.43536
2211,0.4381
2212,0.44086000000000003
2213,0.44364
2214,0.44736000000000004
2215,0.45016000000000006
2216,0.45298
2217,0.45581000000000005
2218,0.45866
2219,0.46152
2220,0.45897
2221,0.45325
2222,0.44976000000000005
2223,0.45141000000000003
2224,0.45114
2225,0.44545
2226,0.43977
2227,0.44051999999999997
2228,0.44348999999999994
2229,0.43685
2230,0.4302
2231,0.42357
2232,0.41572
2233,0.41231
2234,0.41313
2235,0.41313
2236,0.40651
2237,0.3999
2238,0.39328
2239,0.38666999999999996
2240,0.37786
2241,0.37126
2242,0.36685999999999996
2243,0.36261
2244,0.35616
2245,0.34955
2246,0.34193
2247,0.33533
2248,0.32873
2249,0.32345
2250,0.31818
2251,0.31275
2252,0.30614
2253,0.29852
2254,0.29191999999999996
2255,0.28531999999999996
2256,0.28209
2257,0.27681
2258,0.27154
2259,0.26494
2260,0.25731
2261,0.2507
2262,0.24411
2263,0.23868000000000003
2264,0.2334
2265,0.23135999999999998
2266,0.22373
2267,0.21491999999999997
2268,0.20831999999999998
2269,0.20172
2270,0.19513
2271,0.1875
2272,0.18091
2273,0.17432
2274,0.16773
2275,0.16115
2276,0.15481
2277,0.14951
2278,0.14292
2279,0.13633
2280,0.12974000000000002
2281,0.12315999999999999
2282,0.11554
2283,0.10895999999999999
2284,0.10019
2285,0.093623
2286,0.087056
2287,0.080579
2288,0.075248
2289,0.066584
2290,0.06001
2291,0.053440999999999995
2292,0.046874
2293,0.037069
2294,0.030507
2295,0.02395
2296,0.020706
2297,0.015358000000000002
2298,0.010020000000000001
2299,0.0034508000000000004
2300,-0.0031142
2301,-0.009673200000000002
2302,-0.019474
2303,-0.026027999999999996
2304,-0.032581
2305,-0.039127999999999996
2306,-0.044498
2307,-0.047668
2308,-0.053097000000000005
2309,-0.059654
2310,-0.066208
2311,-0.076004
2312,-0.082554
2313,-0.087921
2314,-0.093279
2315,-0.10089
2316,-0.10851
2317,-0.1128
2318,-0.11596
2319,-0.12243
2320,-0.129
2321,-0.13557
2322,-0.14213
2323,-0.14869000000000002
2324,-0.1563
2325,-0.16285
2326,-0.1694
2327,-0.17257999999999998
2328,-0.17899
2329,-0.18555
2330,-0.19211
2331,-0.19972
2332,-0.20628000000000002
2333,-0.21283000000000002
2334,-0.21936999999999998
2335,-0.22591999999999998
2336,-0.23240999999999998
2337,-0.23885
2338,-0.24427
2339,-0.25082
2340,-0.25843
2341,-0.26498
2342,-0.27152
2343,-0.27584000000000003
2344,-0.28121
2345,-0.28988
2346,-0.29861
2347,-0.30623
2348,-0.31277
2349,-0.3182
2350,-0.32356999999999997
2351,-0.32675
2352,-0.33331
2353,-0.33986
2354,-0.34859
2355,-0.35619
2356,-0.36273
2357,-0.36927
2358,-0.3758
2359,-0.38013
2360,-0.38550999999999996
2361,-0.39200999999999997
2362,-0.39855
2363,-0.40834000000000004
2364,-0.41486999999999996
2365,-0.42248
2366,-0.42568999999999996
2367,-0.43218999999999996
2368,-0.4398
2369,-0.44633999999999996
2370,-0.45287
2371,-0.4594
2372,-0.4681
2373,-0.4757
2374,-0.48222
2375,-0.48873999999999995
2376,-0.49525
2377,-0.50067
2378,-0.5061100000000001
2379,-0.51045
2380,-0.51805
2381,-0.52673
2382,-0.5332399999999999
2383,-0.54084
2384,-0.5473399999999999
2385,-0.55384
2386,-0.56034
2387,-0.56363
2388,-0.56907
2389,-0.57667
2390,-0.58534
2391,-0.5918399999999999
2392,-0.59943
2393,-0.60593
2394,-0.61241
2395,-0.6188899999999999
2396,-0.62216
2397,-0.62764
2398,-0.63527
2399,-0.64176
2400,-0.64935
2401,-0.65584
2402,-0.66232
2403,-0.66669
2404,-0.6721699999999999
2405,-0.67869
2406,-0.68519
2407,-0.69494
2408,-0.7014199999999999
2409,-0.70901
2410,-0.71449
2411,-0.71996
2412,-0.72645
2413,-0.7329399999999999
2414,-0.74053
2415,-0.7470100000000001
2416,-0.75681
2417,-0.7622800000000001
2418,-0.76555
2419,-0.77204
2420,-0.77963
2421,-0.7861100000000001
2422,-0.79259
2423,-0.79697
2424,-0.8024399999999999
2425,-0.80897
2426,-0.8154600000000001
2427,-0.82195
2428,-0.8295399999999999
2429,-0.8360200000000001
2430,-0.84249
2431,-0.84896
2432,-0.85654
2433,-0.86316
2434,-0.86754
2435,-0.8740100000000001
2436,-0.8816
2437,-0.88807
2438,-0.8945299999999999
2439,-0.9010799999999999
2440,-0.9065799999999999
2441,-0.91312
2442,-0.92286
2443,-0.92724
2444,-0.9327200000000001
2445,-0.93709
2446,-0.94358
2447,-0.95006
2448,-0.95765
2449,-0.9641299999999999
2450,-0.9695600000000001
2451,-0.97615
2452,-0.98051
2453,-0.987
2454,-0.99349
2455,-1.0011
2456,-1.0076
2457,-1.0141
2458,-1.0196
2459,-1.0261
2460,-1.0348
2461,-1.0423
2462,-1.0488
2463,-1.0553
2464,-1.0586
2465,-1.0641
2466,-1.0695
2467,-1.0759999999999998
2468,-1.0858
2469,-1.0922
2470,-1.0998
2471,-1.1053
2472,-1.1086
2473,-1.1151
2474,-1.1216
2475,-1.1292
2476,-1.1357
2477,-1.1444
2478,-1.1499
2479,-1.1542
2480,-1.1618
2481,-1.1683
2482,-1.1738
2483,-1.1771
2484,-1.1846
2485,-1.1922
2486,-1.2009
2487,-1.2074
2488,-1.2128
2489,-1.2183
2490,-1.2237
2491,-1.2302
2492,-1.2378
2493,-1.2411
2494,-1.2465
2495,-1.2552
2496,-1.2617
2497,-1.2661
2498,-1.2715
2499,-1.2758
2500,-1.2823
2501,-1.2899
2502,-1.2921
2503,-1.2985
2504,-1.3039
2505,-1.3115
2506,-1.317
2507,-1.3223
2508,-1.3254
2509,-1.3319999999999999
2510,-1.3396
2511,-1.3429
2512,-1.3492
2513,-1.3557
2514,-1.3633
2515,-1.3687
2516,-1.374
2517,-1.3792
2518,-1.3869
2519,-1.3945
2520,-1.3975
2521,-1.4049
2522,-1.4126
2523,-1.4202
2524,-1.4232
2525,-1.4284
2526,-1.435
2527,-1.4417
2528,-1.4483
2529,-1.455
2530,-1.4648
2531,-1.4715
2532,-1.4781
2533,-1.4847
2534,-1.4913
2535,-1.4979
2536,-1.5045
2537,-1.5111
2538,-1.5165
2539,-1.5228
2540,-1.5271
2541,-1.5337
2542,-1.5403
2543,-1.5469
2544,-1.5535
2545,-1.5601
2546,-1.5666
2547,-1.5754
2548,-1.5819
2549,-1.5885
2550,-1.595
2551,-1.6016
2552,-1.6081
2553,-1.6146
2554,-1.6211
2555,-1.6276
2556,-1.6362
2557,-1.6438
2558,-1.6503
2559,-1.6567
2560,-1.6632
2561,-1.6696
2562,-1.6761
2563,-1.6825
2564,-1.6889
2565,-1.6986
2566,-1.702
2567,-1.7065
2568,-1.714
2569,-1.7205
2570,-1.7269
2571,-1.7332
2572,-1.7396
2573,-1.746
2574,-1.7545
2575,-1.7608
2576,-1.7672
2577,-1.7735
2578,-1.7798
2579,-1.7861
2580,-1.7924
2581,-1.7986
2582,-1.807
2583,-1.8132
2584,-1.8194
2585,-1.8256
2586,-1.8318
2587,-1.838
2588,-1.8442
2589,-1.8503
2590,-1.8564
2591,-1.8646
2592,-1.8707
2593,-1.8768
2594,-1.8828
2595,-1.8889
2596,-1.8949
2597,-1.9009
2598,-1.9069
2599,-1.9128
2600,-1.9208
2601,-1.9267
2602,-1.9326
2603,-1.9385
2604,-1.9443
2605,-1.9502
2606,-1.956
2607,-1.9603
2608,-1.9646
2609,-1.9722
2610,-1.9779
2611,-1.9836
2612,-1.9893
2613,-1.9949
2614,-2.0005
2615,-2.0061
2616,-2.0116
2617,-2.019
2618,-2.0244
2619,-2.0299
2620,-2.0353
2621,-2.0407
2622,-2.0461
2623,-2.0514
2624,-2.0567
2625,-2.0619
2626,-2.0689
2627,-2.0741
2628,-2.0792
2629,-2.0844
2630,-2.0894
2631,-2.0945
2632,-2.0995
2633,-2.1044
2634,-2.1112
2635,-2.1195
2636,-2.1243
2637,-2.1291
2638,-2.1339
2639,-2.1386
2640,-2.1433
2641,-2.1479
2642,-2.1525
2643,-2.1571
2644,-2.1630000000000003
2645,-2.1675
2646,-2.1718
2647,-2.1761
2648,-2.1804
2649,-2.1846
2650,-2.1888
2651,-2.1929
2652,-2.1969
2653,-2.2022
2654,-2.2061
2655,-2.2099
2656,-2.2137
2657,-2.2174
2658,-2.2211
2659,-2.2247
2660,-2.2282
2661,-2.2328
2662,-2.2361
2663,-2.2329
2664,-2.2274
2665,-2.2241
2666,-2.2273
2667,-2.2303
2668,-2.2333
2669,-2.2362
2670,-2.2399
2671,-2.2427
2672,-2.2453
2673,-2.2479
2674,-2.2504
2675,-2.2528
2676,-2.2528
2677,-2.255
2678,-2.2572
2679,-2.2599
2680,-2.2618
2681,-2.2637
2682,-2.2655
2683,-2.2671
2684,-2.2687
2685,-2.2702
2686,-2.2716
2687,-2.2729
2688,-2.2745
2689,-2.2756
2690,-2.2766
2691,-2.2775
2692,-2.2783
2693,-2.279
2694,-2.2797
2695,-2.2802
2696,-2.2807
2697,-2.281
2698,-2.2763
2699,-2.2691
2700,-2.2643
2701,-2.2643
2702,-2.2643
2703,-2.2643
2704,-2.2643
2705,-2.2643
2706,-2.2643
2707,-2.2643
2708,-2.2643
