time,value
0,1.5699
1,1.5717
2,1.5532
3,1.5273
4,1.4924
5,1.4281
6,1.3486
7,1.2647
8,1.1798
9,1.0924
10,1.0049
11,0.9188700000000001
12,0.8315299999999999
13,0.75607
14,0.6707
15,0.58532
16,0.50127
17,0.41589
18,0.33188
19,0.24793
20,0.16555999999999998
21,0.08179700000000001
22,-0.0018824000000000002
23,-0.085467
24,-0.16894
25,-0.25031
26,-0.33341
27,-0.41634
28,-0.49904
29,-0.5815
30,-0.66365
31,-0.74544
32,-0.8267700000000001
33,-0.90754
34,-0.9876
35,-1.0651
36,-1.1402
37,-1.2057
38,-1.2703
39,-1.3191
40,-1.3618
41,-1.3766
42,-1.3844
43,-1.3871
44,-1.3964
45,-1.4118
46,-1.4355
47,-1.439
48,-1.4233
49,-1.3903
50,-1.3337
51,-1.2673
52,-1.1912
53,-1.1157
54,-1.0353
55,-0.95405
56,-0.8722799999999999
57,-0.79008
58,-0.7075199999999999
59,-0.62468
60,-0.54162
61,-0.45836000000000005
62,-0.37494
63,-0.29139
64,-0.20773000000000003
65,-0.12397000000000001
66,-0.052186
67,0.031789
68,0.11582
69,0.19991
70,0.28405
71,0.36914
72,0.45358999999999994
73,0.5378
74,0.6125
75,0.69786
76,0.78385
77,0.8697600000000001
78,0.9569200000000001
79,1.043
80,1.1297
81,1.215
82,1.2988
83,1.3807
84,1.4613
85,1.5278
86,1.5735
87,1.5814
88,1.5806
89,1.5819
90,1.5746
91,1.5403
92,1.4734
93,1.3938
94,1.3199
95,1.2392
96,1.153
97,1.0671
98,0.98103
99,0.8944
100,0.80713
101,0.72251
102,0.64704
103,0.56252
104,0.47753
105,0.39344
106,0.30806999999999995
107,0.22401999999999997
108,0.14003
109,0.056093
110,-0.027772
111,-0.11155999999999999
112,-0.18417999999999998
113,-0.26649
114,-0.34988
115,-0.43312
116,-0.5161899999999999
117,-0.59904
118,-0.68404
119,-0.76545
120,-0.84862
121,-0.9302799999999999
122,-1.0114
123,-1.0917
124,-1.1671
125,-1.2432
126,-1.315
127,-1.3712
128,-1.4089
129,-1.4308
130,-1.4342
131,-1.4186
132,-1.3964
133,-1.3905
134,-1.3823
135,-1.3871
136,-1.3756
137,-1.3406
138,-1.2941
139,-1.235
140,-1.1644
141,-1.0908
142,-1.0116
143,-0.9449299999999999
144,-0.8639
145,-0.7823100000000001
146,-0.7003
147,-0.6179399999999999
148,-0.53752
149,-0.45451
150,-0.37131
151,-0.28976999999999997
152,-0.20619
153,-0.12251
154,-0.038732
155,0.045123
156,0.12766
157,0.2117
158,0.2958
159,0.37993000000000005
160,0.46411
161,0.54833
162,0.63368
163,0.70839
164,0.79375
165,0.88028
166,0.9668700000000001
167,1.0527
168,1.1389
169,1.2242
170,1.3083
171,1.3792
172,1.4591
173,1.5036
174,1.5405
175,1.5596
