time,value
0,-0.66623
1,-0.66623
2,-0.66623
3,-0.66623
4,-0.66623
5,-0.66623
6,-0.66623
7,-0.66623
8,-0.66623
9,-0.66623
10,-0.66623
11,-0.66623
12,-0.66623
13,-0.66623
14,-0.66623
15,-0.66623
16,-0.66623
17,-0.66623
18,-0.66623
19,-0.66623
20,-0.66623
21,-0.66623
22,-0.66623
23,-0.66623
24,-0.66623
25,-0.66623
26,-0.66623
27,-0.66623
28,-0.66623
29,-0.66623
30,-0.66623
31,-0.66623
32,-0.66623
33,-0.66623
34,-0.66623
35,0.5244800000000001
36,0.014175
37,2.0554
38,1.0348
39,1.7152
40,0.8646799999999999
41,0.18428
42,0.5244800000000001
43,2.2255
44,0.69458
45,0.35438000000000003
46,1.7152
47,0.18428
48,-0.66623
49,0.5244800000000001
50,1.2049
51,0.8646799999999999
52,1.375
53,2.2255
54,2.3956
55,0.35438000000000003
56,0.18428
57,2.2255
58,0.8646799999999999
59,-0.15592999999999999
60,0.014175
61,0.8646799999999999
62,-0.66623
63,0.8646799999999999
64,0.5244800000000001
65,0.69458
66,-0.32603000000000004
67,0.35438000000000003
68,0.18428
69,-0.15592999999999999
70,-0.32603000000000004
71,-0.15592999999999999
72,-0.66623
73,-0.66623
74,-0.66623
75,-0.66623
76,-0.66623
77,-0.66623
78,-0.66623
79,-0.66623
80,0.014175
81,1.8853
82,0.8646799999999999
83,3.5863
84,3.4162
85,0.18428
86,-0.66623
87,-0.66623
88,-0.66623
89,-0.66623
90,-0.66623
91,-0.66623
92,-0.66623
93,-0.66623
94,-0.66623
95,-0.66623
