time,value
0,-0.24311
1,-0.24311
2,-0.24311
3,-0.24311
4,-0.24311
5,-0.24311
6,-0.24311
7,-0.24311
8,-0.24311
9,-0.24311
10,-0.24311
11,-0.24311
12,-0.24311
13,-0.24311
14,-0.24311
15,-0.24311
16,-0.24311
17,-0.24311
18,-0.24311
19,-0.24311
20,-0.24311
21,-0.24311
22,-0.24311
23,-0.24311
24,-0.24311
25,-0.24311
26,-0.24311
27,-0.24311
28,-0.24311
29,-0.24311
30,-0.24311
31,-0.24311
32,-0.24311
33,-0.24311
34,4.0699
35,-0.24311
36,-0.24311
37,-0.24311
38,3.2637
39,-0.24311
40,-0.24311
41,-0.24311
42,-0.24311
43,-0.24311
44,5.4807
45,-0.24311
46,-0.24311
47,-0.24311
48,-0.24311
49,-0.24311
50,-0.24311
51,-0.24311
52,-0.24311
53,4.473
54,-0.24311
55,-0.24311
56,-0.24311
57,-0.24311
58,-0.24311
59,-0.24311
60,-0.24311
61,-0.24311
62,-0.24311
63,-0.24311
64,-0.24311
65,-0.24311
66,-0.24311
67,-0.24311
68,-0.24311
69,-0.24311
70,-0.24311
71,-0.24311
72,3.2637
73,1.3289
74,-0.24311
75,-0.24311
76,-0.24311
77,-0.24311
78,-0.24311
79,-0.24311
80,-0.24311
81,-0.24311
82,-0.24311
83,-0.24311
84,-0.24311
85,-0.24311
86,-0.24311
87,-0.24311
88,-0.24311
89,-0.24311
90,-0.24311
91,-0.24311
92,-0.24311
93,-0.24311
94,-0.24311
95,-0.24311
