time,value
0,1.4312
1,1.2729
2,-0.78483
3,-0.78483
4,-0.78483
5,-0.78483
6,-0.78483
7,1.4312
8,1.5894
9,1.2729
10,-0.78483
11,-0.78483
12,-0.78483
13,-0.78483
14,-0.78483
15,0.79802
16,1.5894
17,1.4312
18,-0.78483
19,-0.78483
20,-0.78483
21,-0.78483
22,-0.78483
23,0.0065952
24,1.7477
25,1.2729
26,-0.30996999999999997
27,-0.78483
28,-0.78483
29,-0.78483
30,-0.78483
31,-0.30996999999999997
32,1.5894
33,1.4312
34,0.0065952
35,-0.78483
36,-0.78483
37,-0.78483
38,-0.78483
39,-0.78483
40,1.7477
41,1.4312
42,0.63973
43,-0.78483
44,-0.78483
45,-0.78483
46,-0.78483
47,-0.78483
48,1.1146
49,1.5894
50,1.2729
51,-0.30996999999999997
52,-0.78483
53,-0.78483
54,-0.78483
55,-0.78483
56,0.48145
57,1.5894
58,1.4312
59,0.32316
60,-0.78483
61,-0.78483
62,-0.78483
63,-0.78483
64,-0.78483
65,1.7477
66,1.4312
67,0.79802
68,-0.78483
69,-0.78483
70,-0.78483
71,-0.78483
72,-0.78483
73,0.48145
74,1.5894
75,0.9563
76,1.4312
77,0.0065952
78,-0.78483
79,-0.78483
80,-0.78483
81,-0.78483
82,-0.15169000000000002
83,1.7477
84,1.2729
85,0.16488
86,-0.78483
87,-0.78483
88,-0.78483
89,-0.78483
90,-0.78483
91,1.7477
92,1.4312
93,0.16488
94,-0.78483
95,-0.78483
