time,value
0,0.020887
1,0.010736
2,0.022083000000000002
3,0.0080098
4,0.0036793
5,0.15691
6,0.017478999999999998
7,0.021472
8,0.020362
9,0.024446000000000002
10,0.16437000000000002
11,0.027375999999999998
12,-0.079854
13,-0.14009000000000002
14,0.06059
15,-0.38395
16,-0.78267
17,-1.3695
18,-2.1918
19,-2.6094
20,-3.2857
21,-3.5556
22,-3.7982
23,-3.8127
24,-3.958
25,-3.7739999999999996
26,-3.4813
27,-3.1664
28,-2.7316
29,-2.4034
30,-2.1172
31,-1.96
32,-1.4772
33,-1.1017
34,-0.81409
35,-0.3527
36,-0.17693
37,0.020611
38,0.17657
39,0.3399
40,0.67057
41,0.5774199999999999
42,0.61741
43,0.5957399999999999
44,0.45291000000000003
45,0.40201
46,1.4931
47,0.19451
48,0.22938000000000003
49,-0.10307999999999999
50,-0.15093
51,0.094794
52,0.076362
53,-0.35991
54,-0.0049481
55,-0.28893
56,-0.13165
57,0.008920200000000001
58,-0.13225
59,-0.19965
60,-0.1107
61,-0.16315
62,-0.16116
63,-0.20115
64,-0.27776999999999996
65,-0.30904
66,-0.35256
67,-0.35655
68,-0.27844
69,-0.3311
70,-0.37041999999999997
71,-0.36417
72,-0.29496
73,-0.28371999999999997
74,-0.38495
75,-0.36751999999999996
76,-0.43951
77,-0.41258999999999996
78,-0.43863
79,-0.43438999999999994
80,-0.39246
81,-0.38575
82,-0.40356
83,-0.45424
84,-0.41066
85,-0.34968
86,-0.63678
87,-0.42923
88,-0.5515800000000001
89,-0.1188
90,-0.12628
91,-0.35591
92,-0.44027
93,-0.21436999999999998
94,-0.084267
95,-0.44401999999999997
96,-0.42641999999999997
97,-0.31063
98,-0.5856600000000001
99,-0.92419
100,-0.9133600000000001
101,-1.0111
102,-1.3594
103,-1.9515
104,-2.1003
105,-2.3191
106,-2.4742
107,-2.8175
108,-2.8986
109,-2.761
110,-2.234
111,-2.51
112,-2.219
113,-2.1069999999999998
114,-1.9546
115,-1.8677
116,-1.8023
117,-1.5996
118,-0.96583
119,-0.28626
120,0.27173
121,0.32816999999999996
122,0.12636
123,-0.16069
124,-0.26179
125,-0.34823000000000004
126,0.27108000000000004
127,0.64179
128,0.61452
129,0.41899
130,0.25781
131,0.21118
132,0.21345
133,0.25722
134,0.26483
135,0.358
136,0.25572
137,0.21677
138,0.20353
139,0.2825
140,0.30133000000000004
141,0.35094000000000003
142,0.32971
143,0.34253
144,0.33298
145,0.24455
146,0.2238
147,0.2802
148,0.30116
149,0.32805
150,0.31333
151,0.34098
152,0.26741
153,0.2564
154,0.28299
155,0.16825
156,0.14878
157,0.24185
158,0.19685999999999998
159,0.26497
160,0.28898
161,0.32537
162,0.36621
163,0.51679
164,0.5929800000000001
165,0.68657
166,0.6010300000000001
167,0.61634
168,0.52387
169,0.36632
170,0.32365
171,0.33435
172,0.43236
173,0.37943000000000005
174,0.4285
175,0.43536
176,0.50031
177,0.5763699999999999
178,0.6276
179,0.54611
180,0.5071899999999999
181,0.53391
182,0.54184
183,0.5451600000000001
184,0.57868
185,0.5765899999999999
186,0.49709
187,0.47718999999999995
188,0.44969
189,0.5381
190,0.59759
191,0.66594
192,0.38935
193,0.74549
194,0.63626
195,0.6257
196,0.42907
197,0.5515800000000001
198,0.63176
199,0.54793
200,0.54364
201,0.62232
202,0.60624
203,0.64049
204,0.6612899999999999
205,0.75459
206,0.7451800000000001
207,0.7971
208,0.79201
209,0.8069
210,0.91753
211,0.93217
212,0.9552
213,1.0374
214,0.89591
215,0.93981
216,0.9117700000000001
217,0.79114
218,0.8650899999999999
219,0.8581
220,0.9066200000000001
221,0.77936
222,0.62793
223,0.72221
224,0.7873899999999999
225,0.89815
226,1.1182
227,0.9234600000000001
228,0.81902
229,0.5352899999999999
230,0.53036
231,0.53033
232,0.66693
233,0.6798
234,0.6341100000000001
235,0.68477
236,0.80952
237,0.78901
238,1.0101
239,0.98311
240,0.8137800000000001
241,0.78669
242,0.7416699999999999
243,0.66694
244,0.5304300000000001
245,0.52485
246,0.59865
247,0.59354
248,0.66874
249,0.5945199999999999
250,0.53052
251,0.52704
252,0.6010800000000001
253,0.67393
254,0.81275
255,0.66345
256,0.6688
257,0.54396
258,0.6772199999999999
259,0.6732199999999999
260,0.6793600000000001
261,0.68375
262,0.62247
263,0.44453000000000004
264,0.53655
265,0.5233
266,0.5109899999999999
267,0.6594300000000001
268,0.66477
269,0.6655399999999999
270,0.6230399999999999
271,0.66796
272,0.67293
273,0.67174
274,0.53669
275,0.64193
276,0.53115
277,0.49577
278,0.37446999999999997
279,0.36394
280,0.5198
281,0.37089
282,0.54187
283,0.5359
284,0.6366
285,0.52003
286,0.38664
287,0.51752
288,0.65484
289,0.52076
290,0.63493
291,0.4925
292,0.49512
293,0.64865
294,0.64548
295,0.64713
296,0.5070399999999999
297,0.5021800000000001
298,0.34515999999999997
299,0.34698
