time,value
0,0.80986
1,0.71539
2,0.71539
3,0.71539
4,0.71539
5,0.71539
6,0.71539
7,0.80986
8,0.71539
9,0.71539
10,0.71539
11,-0.040345
12,-1.1739
13,-1.1739
14,-1.1739
15,-1.1739
16,-1.1739
17,-1.1739
18,-1.1739
19,-1.1739
20,-0.7016100000000001
21,1.2822
22,1.1877
23,0.9043200000000001
24,0.9043200000000001
25,0.80986
26,0.80986
27,0.80986
28,0.80986
29,0.43199
30,-1.1739
31,-1.1739
32,-1.1739
33,-1.1739
34,-1.1739
35,-1.1739
36,-1.1739
37,-0.41821
38,1.2822
39,1.0933
40,0.99879
41,0.9043200000000001
42,0.80986
43,0.80986
44,0.71539
45,-1.1739
46,-1.1739
47,-1.1739
48,-1.1739
49,-1.1739
50,-1.1739
51,-1.1739
52,1.0933
53,1.1877
54,0.99879
55,0.99879
56,0.80986
57,0.9043200000000001
58,0.80986
59,0.80986
60,0.80986
61,-0.89055
62,-1.1739
63,-1.1739
64,-1.1739
65,-1.1739
66,-1.1739
67,-1.1739
68,0.62092
69,1.1877
70,0.99879
71,0.9043200000000001
72,0.9043200000000001
73,0.80986
74,0.80986
75,0.80986
76,0.80986
77,0.24306
78,-1.1739
79,-1.1739
80,-1.1739
81,-1.1739
82,-1.1739
83,-1.1739
84,0.71539
85,1.1877
86,0.99879
87,0.99879
88,0.80986
89,0.9043200000000001
90,0.80986
91,0.80986
92,-0.89055
93,-1.1739
94,-1.1739
95,-1.1739
