time,value
0,-0.15719
1,-0.15719
2,-0.15719
3,-0.15719
4,-0.15719
5,-0.15719
6,-0.15719
7,-0.15719
8,-0.15719
9,-0.15719
10,-0.15719
11,-0.15719
12,-0.15719
13,-0.15719
14,-0.15719
15,-0.15719
16,-0.15719
17,-0.15719
18,-0.15719
19,-0.15719
20,-0.15719
21,-0.15719
22,-0.15719
23,-0.15719
24,-0.15719
25,-0.15719
26,-0.15719
27,-0.15719
28,-0.15719
29,-0.15719
30,-0.15719
31,-0.15719
32,-0.15719
33,-0.15719
34,-0.15719
35,-0.15719
36,-0.15719
37,-0.15719
38,-0.15719
39,-0.15719
40,-0.15719
41,-0.15719
42,-0.15719
43,-0.15719
44,-0.15719
45,-0.15719
46,-0.15719
47,-0.15719
48,-0.15719
49,-0.15719
50,-0.15719
51,-0.15719
52,-0.15719
53,-0.15719
54,-0.15719
55,-0.15719
56,-0.15719
57,-0.15719
58,-0.15719
59,-0.15719
60,-0.15719
61,-0.15719
62,-0.15719
63,-0.15719
64,-0.15719
65,-0.15719
66,-0.15719
67,-0.15719
68,8.1136
69,4.9428
70,1.5619
71,-0.15719
72,-0.15719
73,-0.15719
74,-0.15719
75,-0.15719
76,-0.15719
77,-0.15719
78,-0.15719
79,-0.15719
80,-0.15719
81,-0.15719
82,-0.15719
83,-0.15719
84,-0.15719
85,-0.15719
86,-0.15719
87,-0.15719
88,-0.15719
89,-0.15719
90,-0.15719
91,-0.15719
92,-0.15719
93,-0.15719
94,-0.15719
95,-0.15719
