time,value
0,0.7532300000000001
1,0.61779
2,0.41106000000000004
3,0.21054
4,0.096787
5,-0.11080999999999999
6,-0.33281
7,-0.5180100000000001
8,-0.65759
9,-0.76873
10,-0.66032
11,-0.57503
12,-0.47591999999999995
13,-0.36928
14,-0.29322
15,-0.22823000000000002
16,-0.13305
17,-0.037281
18,-0.028225999999999998
19,0.042674000000000004
20,0.083579
21,0.17872000000000002
22,0.30308
23,0.35679
24,0.47129
25,0.56934
26,0.6986600000000001
27,0.78481
28,0.88126
29,0.9906799999999999
30,1.1508
31,1.1301
32,1.032
33,0.81881
34,0.63247
35,0.45671000000000006
36,0.27610999999999997
37,0.092528
38,0.004621
39,-0.13760999999999998
40,-0.32209
41,-0.41245
42,-0.58885
43,-0.73931
44,-0.60169
45,-0.52475
46,-0.43323
47,-0.30079
48,-0.20818000000000003
49,-0.12628
50,0.013536000000000001
51,0.060711
52,0.19964
53,0.32948
54,0.44545
55,0.40104
56,0.30168
57,0.41517
58,0.54897
59,0.68048
60,0.76269
61,0.9708600000000001
62,1.1204
63,1.1548
64,1.0569
65,1.2237
66,1.3795
67,1.4768
68,1.7083
69,1.868
70,1.9539
71,1.7913
72,1.6383
73,1.4892
74,1.2925
75,1.1099
76,0.97957
77,0.78289
78,0.6342300000000001
79,0.4985
80,0.33618000000000003
81,0.30422
82,0.21531999999999998
83,0.071524
84,-0.072796
85,-0.26508000000000004
86,-0.44765
87,-0.52273
88,-0.62766
89,-0.75584
90,-0.86166
91,-0.97757
92,-1.1133
93,-1.2946
94,-1.3253
95,-1.1891
96,-1.2101
97,-1.0549
98,-1.0311
99,-0.9673700000000001
100,-0.81067
101,-0.7414
102,-0.73734
103,-0.58039
104,-0.47616
105,-0.53997
106,-0.31519
107,-0.38009
108,-0.27465
109,-0.17323
110,-0.060320000000000006
111,0.0048415
112,0.053834
113,0.12884
114,0.26674000000000003
115,0.43237
116,0.59738
117,0.75066
118,0.73529
119,0.61802
120,0.4339
121,0.2677
122,0.18058
123,0.016108
124,-0.06175
125,-0.1821
126,-0.33166999999999996
127,-0.35655
128,-0.48045
129,-0.62466
130,-0.46234
131,-0.67123
132,-0.8702799999999999
133,-0.9566100000000001
134,-1.1621
135,-1.3485
136,-1.4763
137,-1.4929
138,-1.3307
139,-1.3657
140,-1.3949
141,-1.35
142,-1.2966
143,-1.3224
144,-1.2098
145,-1.0905
146,-1.0623
147,-0.96614
148,-0.8034100000000001
149,-0.85196
150,-0.6846
151,-0.52594
152,-0.35768
153,-0.22758
154,-0.019057
155,0.14742
156,0.25240999999999997
157,0.45103999999999994
158,0.65666
159,0.76636
160,0.85462
161,0.95873
162,1.0565
163,1.2189
164,1.4082
165,1.6038
166,1.7886
167,1.6222
168,1.5509
169,1.3835
170,1.2552
171,1.0804
172,1.021
173,0.9693
174,0.80173
175,0.68976
176,0.70798
177,0.5523
178,0.49582
179,0.38656
180,0.33929000000000004
181,0.19458
182,0.041955
183,0.0034305
184,0.0032811999999999997
185,0.057773000000000005
186,-0.075288
187,-0.18252000000000002
188,-0.29839
189,-0.42717
190,-0.54906
191,-0.68553
192,-0.7149399999999999
193,-0.78261
194,-0.55503
195,-0.35002
196,-0.17779
197,0.011170000000000001
198,0.20345
199,0.39003000000000004
200,0.52159
201,0.6663399999999999
202,0.7893100000000001
203,0.8889600000000001
204,1.1229
205,1.2622
206,1.5136
207,1.7106
208,1.9037
209,1.7985
210,1.6855
211,1.6035
212,1.5113
213,1.3365
214,1.2127
215,1.2417
216,1.0699
217,0.9379
218,1.0266
219,0.93261
220,0.77788
221,0.64574
222,0.60644
223,0.4988
224,0.37971
225,0.23049
226,0.37953000000000003
227,0.32126
228,0.20995999999999998
229,0.10684
230,0.023145
231,-0.074137
232,-0.16972
233,-0.2955
234,-0.32658000000000004
235,-0.46063999999999994
236,-0.5589
237,-0.69124
238,-0.6078100000000001
239,-0.78459
240,-0.87565
241,-0.97801
242,-1.1051
243,-1.0597
244,-0.83816
245,-0.67282
246,-0.50117
247,-0.3323
248,-0.16974
249,0.0077491
250,0.18455
251,0.36715
252,0.34699
253,0.53178
254,0.71078
255,0.8890899999999999
256,1.0696
257,1.1233
258,1.0008
259,0.8993700000000001
260,0.89231
261,0.7866
262,0.65647
263,0.7077
264,0.65222
265,0.53852
266,0.44919
267,0.41408999999999996
268,0.30706
269,0.15175999999999998
270,0.14426
271,0.059774
272,0.17334000000000002
273,0.095738
274,-0.041843
275,-0.17096
276,-0.31196999999999997
277,-0.35588000000000003
278,-0.48735
279,-0.6015699999999999
280,-0.7468199999999999
281,-0.8367100000000001
282,-0.77195
283,-0.70609
284,-0.6399699999999999
285,-0.51959
286,-0.32783
287,-0.31299
288,-0.35661
289,-0.44888
290,-0.47844
291,-0.55416
292,-0.69425
293,-0.66457
294,-0.7383
295,-0.82975
296,-0.8933
297,-1.0082
298,-1.1136
299,-1.2347
300,-1.2669
301,-1.3652
302,-1.4768
303,-1.5674
304,-1.6680000000000001
305,-1.7278
306,-1.8318
307,-1.9488
308,-2.0922
309,-2.2049
310,-2.3654
311,-2.5331
312,-2.4085
313,-2.3161
314,-2.4813
315,-2.5786
316,-2.4602
317,-2.3014
318,-2.127
319,-1.9618
320,-1.791
321,-1.6167
322,-1.4407
323,-1.2555
324,-1.0788
325,-0.90375
326,-0.7350399999999999
327,-0.53117
328,-0.36730999999999997
329,-0.19938
330,-0.028687
331,0.16677
332,0.33815
333,0.50951
334,0.68499
335,0.8766200000000001
336,1.0528
337,1.2485
338,1.4097
339,1.5988
340,1.7795
341,1.9587
342,2.1258
343,2.3089
344,2.4756
345,2.6448
346,2.73
347,2.7007
348,2.6203
349,2.5002
350,2.3034
351,2.1317
352,1.9611
353,1.7879
354,1.5995
355,1.4248
356,1.2403
357,1.1664
358,1.0675
359,0.87469
360,0.67595
361,0.55766
362,0.40304
363,0.24361999999999998
364,0.057367999999999995
365,-0.10858
366,-0.27485
367,-0.48206000000000004
368,-0.6643
369,-0.82255
370,-1.0038
371,-1.2089
372,-1.3841
373,-1.5565
374,-1.7358
375,-1.7469999999999999
376,-1.597
377,-1.4852
378,-1.3535
379,-1.2635
380,-1.2638
381,-1.3367
382,-1.1855
383,-1.0608
384,-0.95965
385,-0.87236
386,-0.7095
387,-0.58504
388,-0.4723
389,-0.43299
390,-0.436
391,-0.39382
392,-0.31473
393,-0.29714
394,-0.23978000000000002
395,-0.42263999999999996
396,-0.55945
397,-0.70027
398,-0.8467600000000001
399,-0.75339
400,-0.64344
401,-0.5654100000000001
402,-0.4948
403,-0.42463999999999996
404,-0.37322
405,-0.27121
406,-0.29552
407,-0.21322
408,-0.13452
409,-0.013201
410,0.066713
411,0.11454
412,0.19668
413,0.23765999999999998
414,0.39421
415,0.32526
416,0.39077
417,0.46088999999999997
418,0.48206000000000004
419,0.39553
420,0.4898
421,0.55113
422,0.6166699999999999
423,0.60228
424,0.67279
425,0.72075
426,0.7739
