time,value
0,0.81295
1,0.69504
2,0.7027
3,0.62984
4,0.48901000000000006
5,0.47893
6,0.47148
7,0.48613
8,0.45741000000000004
9,0.62427
10,0.59509
11,0.43146
12,0.41125
13,0.51249
14,0.5787
15,0.59647
16,0.50798
17,0.43462
18,0.44676000000000005
19,0.53646
20,0.5516800000000001
21,0.57693
22,0.5675399999999999
23,0.50963
24,0.54592
25,0.64146
26,0.65295
27,0.5858800000000001
28,0.53136
29,0.6118899999999999
30,0.63178
31,0.6175
32,0.5748
33,0.5428
34,0.59007
35,0.62922
36,0.61703
37,0.55592
38,0.59692
39,0.59372
40,0.55485
41,0.49013
42,0.44687
43,0.36796999999999996
44,0.15677
45,-0.37608
46,-0.75307
47,-1.1641
48,-1.8937
49,-2.3958
50,-2.6322
51,-2.9893
52,-3.1839
53,-3.4527
54,-2.8362
55,-2.8746
56,-2.7253
57,-2.2933
58,-1.8635
59,-1.8955
60,-1.4078
61,-0.8923
62,-0.66457
63,-0.84195
64,-0.50145
65,-0.30325
66,-0.36217
67,-0.63715
68,-0.19594
69,-0.7943399999999999
70,-0.55803
71,-1.2556
72,-0.8221700000000001
73,-0.78586
74,-0.90145
75,-0.92568
76,-0.9545899999999999
77,-0.87646
78,-1.2029
79,-1.0318
80,-0.9284600000000001
81,-0.9752799999999999
82,-0.89438
83,-0.95188
84,-0.9976200000000001
85,-0.9183100000000001
86,-0.9265200000000001
87,-0.9796799999999999
88,-0.8654200000000001
89,-0.84436
90,-0.7904399999999999
91,-0.85016
92,-0.8807
93,-0.82389
94,-0.77371
95,-0.87803
96,-0.8570700000000001
97,-0.73142
98,-0.74736
99,-0.7793399999999999
100,-0.77713
101,-0.75821
102,-0.75026
103,-0.8158
104,-0.8145
105,-0.78214
106,-0.72845
107,-0.85401
108,-0.84751
109,-0.75969
110,-0.76337
111,-0.8427399999999999
112,-0.76173
113,-0.78927
114,-0.79924
115,-0.7022
116,-0.73744
117,-0.65898
118,-0.52941
119,-0.37062
120,-0.5499
121,-0.7272
122,-0.72335
123,-0.43918
124,-0.39476
125,-0.34803
126,-0.54656
127,-0.23833000000000001
128,-0.37172
129,-0.5705
130,-0.73073
131,-1.0253
132,-1.8833
133,-1.8516
134,-1.685
135,-2.7247
136,-2.5736
137,-2.6548
138,-2.9159
139,-2.2796
140,-2.0115
141,-2.4262
142,-1.8439
143,-1.3818
144,-1.3419
145,-1.3499
146,-2.7107
147,-1.6801
148,-1.7605
149,-1.3134
150,-0.93715
151,-0.19877
152,-0.39776
153,0.07361000000000001
154,0.63643
155,0.53547
156,0.3797
157,0.45598999999999995
158,0.49233999999999994
159,0.68197
160,0.90828
161,0.8239200000000001
162,0.58277
163,0.56901
164,0.43277
165,0.44141
166,0.38192
167,0.38950999999999997
168,0.29761
169,0.24316999999999997
170,0.38103000000000004
171,0.44511000000000006
172,0.5513600000000001
173,0.51103
174,0.38576
175,0.48813
176,0.54009
177,0.37944
178,0.36821
179,0.38316
180,0.4742
181,0.5309699999999999
182,0.56005
183,0.51451
184,0.5523899999999999
185,0.46025
186,0.47366
187,0.45269
188,0.42406000000000005
189,0.61173
190,0.57834
191,0.65353
192,0.7620600000000001
193,0.8463799999999999
194,0.84177
195,0.7104699999999999
196,0.63298
197,0.65087
198,0.7459600000000001
199,0.54365
200,0.53674
201,0.62415
202,0.71722
203,0.74997
204,0.8961100000000001
205,0.64528
206,0.6228199999999999
207,0.6822
208,0.69689
209,0.80407
210,0.77825
211,0.7065600000000001
212,0.9425899999999999
213,0.80886
214,0.79984
215,0.69402
216,0.66923
217,0.73705
218,0.6279100000000001
219,0.64174
220,0.6651
221,0.6382800000000001
222,0.72805
223,0.60682
224,0.60801
225,0.59614
226,0.70418
227,0.5031899999999999
228,0.46843999999999997
229,0.67919
230,0.8508100000000001
231,0.88881
232,1.2324
233,0.52307
234,0.8356
235,0.71029
236,0.8291
237,0.67406
238,0.53037
239,0.67461
240,0.64454
241,0.69612
242,0.64708
243,0.96088
244,0.83085
245,0.68908
246,0.70432
247,0.70404
248,0.8378399999999999
249,0.83555
250,0.84219
251,0.8388
252,0.84645
253,0.7145600000000001
254,0.69796
255,0.83667
256,0.8417899999999999
257,0.8583299999999999
258,0.84978
259,0.84665
260,0.85436
261,0.85782
262,0.84852
263,0.7467600000000001
264,0.70912
265,0.6963699999999999
266,0.68283
267,0.78489
268,0.98755
269,0.98749
270,1.1246
271,1.133
272,1.0614
273,0.9161299999999999
274,0.8544299999999999
275,0.7111
276,0.70635
277,0.8489200000000001
278,0.8441299999999999
279,0.82886
280,0.69567
281,0.83849
282,0.8367600000000001
283,0.9309700000000001
284,0.9398
285,0.9456399999999999
286,0.69045
287,0.6544300000000001
288,0.6883600000000001
289,0.71157
290,0.6675800000000001
291,0.69089
292,0.81139
293,0.80615
294,0.68785
295,0.68826
296,0.8258
297,0.9626100000000001
298,0.67096
299,0.66906
