time,value
0,0.0
1,0.0
2,0.0
3,0.0
4,0.0
5,0.0
6,0.0
7,0.0
8,0.0
9,0.0
10,0.0
11,0.0
12,0.0
13,0.0
14,0.0
15,0.0
16,0.0
17,0.0
18,0.0
19,1.6716
20,0.0
21,0.0
22,0.0
23,0.0
24,0.0
25,0.0
26,0.0
27,0.0
28,0.0
29,0.0
30,0.0
31,-1.6716
32,0.0
33,0.0
34,0.0
35,0.0
36,-1.6716
37,0.0
38,0.0
39,0.0
40,-1.6716
41,0.0
42,0.0
43,0.0
44,-1.6716
45,0.0
46,0.0
47,0.0
48,-1.6716
49,0.0
50,0.0
51,0.0
52,-1.6716
53,0.0
54,0.0
55,0.0
56,-1.6716
57,0.0
58,0.0
59,0.0
60,-1.6716
61,0.0
62,0.0
63,0.0
64,-1.6716
65,0.0
66,0.0
67,0.0
68,-1.6716
69,0.0
70,0.0
71,0.0
72,-1.6716
73,0.0
74,0.0
75,0.0
76,-1.6716
77,3.3431
78,0.0
79,0.0
80,3.3431
81,3.3431
82,3.3431
83,3.3431
84,1.6716
85,0.0
86,0.0
87,0.0
88,0.0
89,0.0
90,0.0
91,0.0
92,0.0
93,0.0
94,0.0
95,0.0
