time,value
0,-1.3729
1,-1.1652
2,-0.8726700000000001
3,-0.50571
4,-0.084017
5,0.36796999999999996
6,0.8134899999999999
7,1.2294
8,1.5916
9,1.8983
10,2.1445
11,2.3244
12,2.4345
13,2.4699
14,2.449
15,2.3843
16,2.3044
17,2.2254
18,2.1573
19,2.1023
20,2.043
21,1.9702
22,1.8736
23,1.7692
24,1.6741
25,1.6019
26,1.5539
27,1.5192
28,1.4954
29,1.4805
30,1.4916
31,1.5352
32,1.621
33,1.7409
34,1.8819
35,2.0281
36,2.1537
37,2.2486
38,2.2895
39,2.2751
40,2.2008
41,2.076
42,1.9177
43,1.7373
44,1.5581
45,1.3822
46,1.2199
47,1.0669
48,0.92266
49,0.7872399999999999
50,0.6515
51,0.5174
52,0.37555
53,0.23479
54,0.09811399999999999
55,-0.026458
56,-0.13302999999999998
57,-0.2252
58,-0.29512
59,-0.35186
60,-0.38955
61,-0.41494
62,-0.42757
63,-0.42573
64,-0.41952
65,-0.40386
66,-0.39277
67,-0.37873
68,-0.36441999999999997
69,-0.34919
70,-0.33042
71,-0.31783
72,-0.30377
73,-0.29588000000000003
74,-0.2858
75,-0.27109
76,-0.24395
77,-0.19294
78,-0.11827
79,-0.015288
80,0.10558
81,0.24135
82,0.38287
83,0.5230199999999999
84,0.65909
85,0.7891100000000001
86,0.9199
87,1.0491
88,1.1759
89,1.2924
90,1.3936
91,1.4733
92,1.5182
93,1.5161
94,1.4531
95,1.337
96,1.1863
97,1.0282
98,0.8807
99,0.7432
100,0.60952
101,0.46641000000000005
102,0.31722
103,0.1655
104,0.019883
105,-0.11413
106,-0.23565
107,-0.33575
108,-0.41908999999999996
109,-0.4813
110,-0.53355
111,-0.5797
112,-0.62052
113,-0.65578
114,-0.67466
115,-0.6826
116,-0.6714
117,-0.64825
118,-0.61092
119,-0.5618
120,-0.5069899999999999
121,-0.44772
122,-0.39559
123,-0.34406
124,-0.29091999999999996
125,-0.22248
126,-0.1294
127,-0.010126000000000001
128,0.13165
129,0.27621
130,0.40908
131,0.51143
132,0.57598
133,0.60133
134,0.58977
135,0.54819
136,0.47786999999999996
137,0.38733
138,0.28156
139,0.17025
140,0.060858
141,-0.043066
142,-0.13878
143,-0.22921
144,-0.31073
145,-0.38397
146,-0.44603000000000004
147,-0.49831000000000003
148,-0.54332
149,-0.58196
150,-0.61869
151,-0.64995
152,-0.67785
153,-0.69795
154,-0.71136
155,-0.71915
156,-0.72202
157,-0.72664
158,-0.7297899999999999
159,-0.73847
160,-0.75153
161,-0.77168
162,-0.79723
163,-0.82294
164,-0.85098
165,-0.8766200000000001
166,-0.9026700000000001
167,-0.9238
168,-0.93875
169,-0.94929
170,-0.9566899999999999
171,-0.9655799999999999
172,-0.9678700000000001
173,-0.9600700000000001
174,-0.93735
175,-0.9045799999999999
176,-0.87118
177,-0.8398700000000001
178,-0.81381
179,-0.7847
180,-0.75536
181,-0.72838
182,-0.7084
183,-0.6956600000000001
184,-0.68134
185,-0.6652600000000001
186,-0.64427
187,-0.62371
188,-0.60002
189,-0.5685
190,-0.52825
191,-0.48127
192,-0.43668
193,-0.39461
194,-0.35507
195,-0.31119
196,-0.2574
197,-0.18929
198,-0.10485
199,-0.012523999999999999
200,0.07791100000000001
201,0.15150999999999998
202,0.20268
203,0.22918000000000002
204,0.2333
205,0.22058000000000003
206,0.19445
207,0.16159
208,0.11874000000000001
209,0.063055
210,-0.010545
211,-0.098952
212,-0.19243
213,-0.28389000000000003
214,-0.36673
215,-0.44308000000000003
216,-0.50917
217,-0.5635600000000001
218,-0.60282
219,-0.6267199999999999
220,-0.6392
221,-0.64127
222,-0.64023
223,-0.63721
224,-0.6381
225,-0.6424
226,-0.64978
227,-0.6611199999999999
228,-0.67371
229,-0.69152
230,-0.70938
231,-0.7289800000000001
232,-0.7481899999999999
233,-0.76717
234,-0.78681
235,-0.80398
236,-0.8234
237,-0.8448100000000001
238,-0.8724
239,-0.9028299999999999
240,-0.92999
241,-0.9488700000000001
242,-0.9570700000000001
243,-0.9610700000000001
244,-0.9653200000000001
245,-0.97467
246,-0.98608
247,-0.99535
248,-0.99802
249,-0.99198
250,-0.9809200000000001
251,-0.96701
252,-0.95539
253,-0.9467700000000001
254,-0.94326
255,-0.94625
256,-0.9554
257,-0.9696100000000001
258,-0.98426
259,-1.0021
260,-1.0284
261,-1.0698
262,-1.1256
263,-1.1918
264,-1.27
265,-1.361
266,-1.4582
267,-1.5383
268,-1.5807
269,-1.5845
