time,value
0,0.12102
1,-1.5386
2,0.12102
3,0.12102
4,0.12102
5,-1.5386
6,0.12102
7,0.12102
8,0.12102
9,-1.5386
10,0.12102
11,0.12102
12,0.12102
13,-1.5386
14,0.12102
15,0.12102
16,0.12102
17,-1.5386
18,0.12102
19,0.12102
20,0.12102
21,0.12102
22,-1.5386
23,0.12102
24,0.12102
25,0.12102
26,-1.5386
27,0.12102
28,0.12102
29,0.12102
30,-1.5386
31,0.12102
32,0.12102
33,0.12102
34,-1.5386
35,0.12102
36,0.12102
37,0.12102
38,-1.5386
39,0.12102
40,0.12102
41,0.12102
42,-1.5386
43,0.12102
44,0.12102
45,0.12102
46,-1.5386
47,0.12102
48,0.12102
49,0.12102
50,-1.5386
51,0.12102
52,0.12102
53,0.12102
54,0.12102
55,-1.5386
56,0.12102
57,0.12102
58,0.12102
59,-1.5386
60,0.12102
61,0.12102
62,0.12102
63,-1.5386
64,0.12102
65,0.12102
66,0.12102
67,-1.5386
68,0.12102
69,0.12102
70,0.12102
71,1.7807
72,0.12102
73,0.12102
74,0.12102
75,0.12102
76,0.12102
77,0.12102
78,0.12102
79,0.12102
80,0.12102
81,0.12102
82,0.12102
83,0.12102
84,3.4403
85,3.4403
86,3.4403
87,3.4403
88,1.7807
89,0.12102
90,0.12102
91,0.12102
92,0.12102
93,0.12102
94,0.12102
95,0.12102
