time,value
0,2.4462
1,1.3532
2,1.8576
3,1.8576
4,1.1009
5,1.7736
6,1.4372
7,1.2691
8,1.6895
9,1.185
10,1.6054
11,1.2691
12,1.2691
13,1.8576
14,0.8486799999999999
15,1.3532
16,1.4372
17,0.7646
18,1.5213
19,0.93276
20,0.93276
21,1.2691
22,0.7646
23,1.4372
24,0.8486799999999999
25,0.93276
26,1.6895
27,0.59644
28,1.6054
29,1.0168
30,-0.58068
31,0.59644
32,-0.16028
33,-0.16028
34,0.42828
35,-0.58068
36,0.0078825
37,-0.24436
38,-0.58068
39,0.091962
40,-0.74884
41,-0.24436
42,-0.58068
43,-0.8329200000000001
44,0.0078825
45,-1.1692
46,-0.58068
47,-0.41252
48,-1.0852
49,-0.24436
50,-0.917
51,-0.74884
52,-0.32844
53,-1.0011
54,-0.41252
55,-0.66476
56,-0.74884
57,0.091962
58,-1.0852
59,-0.4966
60,-0.4966
61,-1.0852
62,-0.24436
63,-1.0852
64,-0.74884
65,-0.66476
66,-1.2533
67,-0.32844
68,-0.58068
69,-0.74884
70,-0.32844
71,-1.2533
72,-0.58068
73,-0.58068
74,-1.2533
75,-0.24436
76,-0.917
77,-0.8329200000000001
78,-0.4966
79,-1.0852
80,-0.24436
81,-0.41252
82,-1.0852
83,-0.076197
84,-0.8329200000000001
85,-0.8329200000000001
86,0.3442
87,-1.0852
88,-0.917
89,-0.4966
90,-1.4215
91,-0.58068
92,-1.0852
93,-1.0011
94,-0.58068
95,-1.4215
