time,value
0,-0.3591
1,-0.3591
2,-0.3591
3,-0.3591
4,-0.3591
5,-0.3591
6,-0.3591
7,-0.3591
8,-0.3591
9,-0.3591
10,-0.3591
11,-0.3591
12,-0.3591
13,-0.3591
14,-0.3591
15,-0.3591
16,-0.3591
17,-0.3591
18,-0.3591
19,-0.3591
20,-0.3591
21,-0.3591
22,-0.3591
23,-0.3591
24,-0.3591
25,-0.3591
26,-0.3591
27,-0.3591
28,-0.3591
29,-0.3591
30,-0.3591
31,-0.3591
32,-0.3591
33,-0.3591
34,-0.3591
35,-0.3591
36,-0.3591
37,-0.3591
38,-0.3591
39,-0.3591
40,0.41911000000000004
41,4.9606
42,-0.15003
43,-0.17326
44,-0.022262
45,-0.3591
46,-0.3591
47,-0.3591
48,-0.3591
49,-0.3591
50,-0.3591
51,-0.3591
52,3.1254
53,0.70949
54,0.77918
55,4.2056
56,0.26811999999999997
57,0.012583
58,2.8931
59,0.15195999999999998
60,-0.3591
61,-0.3591
62,-0.3591
63,-0.3591
64,-0.3591
65,-0.3591
66,1.0115
67,1.6619
68,0.00096792
69,2.3704
70,0.7211
71,0.093889
72,3.6713
73,0.22165
74,-0.3591
75,-0.3591
76,-0.3591
77,-0.3591
78,-0.3591
79,-0.3591
80,-0.3591
81,-0.3591
82,-0.3591
83,-0.3591
84,-0.3591
85,-0.3591
86,-0.3591
87,-0.3591
88,-0.3591
89,-0.3591
90,-0.3591
91,-0.3591
92,-0.3591
93,-0.3591
94,-0.3591
95,-0.3591
