time,value
0,-0.62835
1,-0.62835
2,-0.62835
3,1.2373
4,1.8591
5,-0.62835
6,-0.62835
7,-0.62835
8,-0.62835
9,-0.006477800000000001
10,2.2737
11,0.20081
12,-0.62835
13,-0.62835
14,-0.62835
15,-0.62835
16,1.2373
17,1.6518
18,-0.62835
19,-0.62835
20,-0.62835
21,-0.62835
22,-0.62835
23,2.0664
24,0.82268
25,-0.62835
26,-0.62835
27,-0.62835
28,-0.62835
29,-0.62835
30,2.2737
31,0.61539
32,-0.62835
33,-0.62835
34,-0.62835
35,-0.62835
36,-0.006477800000000001
37,2.0664
38,0.20081
39,-0.62835
40,-0.62835
41,-0.62835
42,-0.62835
43,0.4081
44,2.2737
45,-0.21377
46,-0.62835
47,-0.62835
48,-0.62835
49,-0.62835
50,1.2373
51,1.8591
52,-0.62835
53,-0.62835
54,-0.62835
55,-0.62835
56,-0.62835
57,1.6518
58,1.4445
59,-0.62835
60,-0.62835
61,-0.62835
62,-0.62835
63,-0.62835
64,1.8591
65,1.2373
66,-0.62835
67,-0.62835
68,-0.62835
69,-0.62835
70,-0.62835
71,2.2737
72,0.61539
73,-0.62835
74,-0.62835
75,-0.62835
76,-0.62835
77,0.20081
78,2.2737
79,0.20081
80,-0.62835
81,-0.62835
82,-0.62835
83,-0.62835
84,1.8591
85,1.4445
86,-0.62835
87,-0.62835
88,-0.62835
89,-0.62835
90,0.20081
91,2.0664
92,0.20081
93,-0.62835
94,-0.62835
95,-0.62835
