time,value
0,-1.3701
1,-1.3701
2,-1.3701
3,-1.3701
4,-1.3701
5,-1.3701
6,-1.3701
7,-1.3701
8,-1.3701
9,-1.3701
10,-1.3701
11,-1.3701
12,-1.3701
13,-1.3701
14,0.092503
15,1.8686
16,0.8238200000000001
17,0.71935
18,0.9283
19,0.30145
20,0.8238200000000001
21,0.30145
22,0.61487
23,0.40593
24,0.5104
25,0.61487
26,0.30145
27,0.8238200000000001
28,0.30145
29,0.61487
30,0.8238200000000001
31,0.61487
32,0.5104
33,0.61487
34,0.5104
35,0.71935
36,0.61487
37,0.40593
38,0.30145
39,0.61487
40,0.71935
41,0.5104
42,0.30145
43,0.71935
44,0.71935
45,1.8686
46,1.6596
47,0.5104
48,-0.11645
49,-1.3701
50,-0.74329
51,-1.1612
52,-1.3701
53,-1.1612
54,-1.3701
55,-0.32539
56,-1.3701
57,-1.3701
58,-1.3701
59,-1.1612
60,-1.3701
61,-1.3701
62,1.0328
63,1.4507
64,0.71935
65,1.0328
66,0.71935
67,0.5104
68,0.9283
69,0.8238200000000001
70,0.5104
71,0.61487
72,0.9283
73,0.61487
74,0.40593
75,0.8238200000000001
76,0.8238200000000001
77,0.40593
78,0.9283
79,0.9283
80,0.61487
81,0.61487
82,0.9283
83,0.71935
84,0.5104
85,0.8238200000000001
86,0.9283
87,0.5104
88,0.61487
89,-0.22091999999999998
90,-1.3701
91,-1.3701
92,-1.3701
93,-1.3701
94,-1.3701
95,-1.3701
