time,value
0,-0.1897
1,-0.1897
2,-0.1897
3,-0.1897
4,-0.1897
5,-0.1897
6,-0.1897
7,-0.1897
8,-0.1897
9,-0.1897
10,-0.1897
11,-0.1897
12,-0.1897
13,-0.1897
14,-0.1897
15,-0.1897
16,-0.1897
17,-0.1897
18,-0.1897
19,-0.1897
20,-0.1897
21,-0.1897
22,-0.1897
23,-0.1897
24,-0.1897
25,-0.1897
26,-0.1897
27,-0.1897
28,-0.1897
29,-0.1897
30,-0.1897
31,-0.1897
32,-0.1897
33,-0.1897
34,-0.1897
35,-0.1897
36,-0.1897
37,-0.1897
38,-0.1897
39,-0.1897
40,-0.1897
41,-0.1897
42,-0.1897
43,-0.1897
44,-0.1897
45,-0.1897
46,-0.1897
47,-0.1897
48,-0.1897
49,-0.1897
50,-0.1897
51,-0.1897
52,-0.1897
53,-0.1897
54,-0.1897
55,-0.1897
56,-0.1897
57,-0.1897
58,-0.1897
59,-0.1897
60,-0.1897
61,-0.1897
62,-0.1897
63,-0.1897
64,-0.1897
65,-0.1897
66,-0.1897
67,-0.1897
68,-0.1897
69,-0.1897
70,-0.1897
71,3.4547
72,3.0133
73,7.7669
74,3.217
75,-0.1897
76,-0.1897
77,-0.1897
78,-0.1897
79,-0.1897
80,-0.1897
81,-0.1897
82,-0.1897
83,-0.1897
84,-0.1897
85,-0.1897
86,-0.1897
87,-0.1897
88,-0.1897
89,-0.1897
90,-0.1897
91,-0.1897
92,-0.1897
93,-0.1897
94,-0.1897
95,-0.1897
