time,value
0,-0.45428999999999997
1,-0.45428999999999997
2,-0.45428999999999997
3,-0.45428999999999997
4,-0.45428999999999997
5,-0.45428999999999997
6,-0.45428999999999997
7,-0.45428999999999997
8,-0.45428999999999997
9,-0.45428999999999997
10,-0.45428999999999997
11,-0.45428999999999997
12,-0.10067999999999999
13,-0.45428999999999997
14,-0.45428999999999997
15,-0.45428999999999997
16,-0.45428999999999997
17,-0.45428999999999997
18,-0.45428999999999997
19,-0.45428999999999997
20,-0.10067999999999999
21,-0.45428999999999997
22,-0.45428999999999997
23,-0.45428999999999997
24,-0.45428999999999997
25,-0.45428999999999997
26,-0.45428999999999997
27,-0.45428999999999997
28,-0.45428999999999997
29,-0.45428999999999997
30,-0.45428999999999997
31,-0.45428999999999997
32,-0.45428999999999997
33,-0.45428999999999997
34,-0.45428999999999997
35,-0.45428999999999997
36,-0.45428999999999997
37,-0.45428999999999997
38,-0.45428999999999997
39,-0.21855
40,-0.21855
41,-0.45428999999999997
42,-0.45428999999999997
43,-0.45428999999999997
44,-0.45428999999999997
45,-0.45428999999999997
46,-0.45428999999999997
47,-0.45428999999999997
48,-0.45428999999999997
49,-0.45428999999999997
50,-0.45428999999999997
51,-0.45428999999999997
52,-0.45428999999999997
53,-0.45428999999999997
54,-0.45428999999999997
55,-0.45428999999999997
56,-0.10067999999999999
57,-0.45428999999999997
58,-0.45428999999999997
59,-0.45428999999999997
60,-0.45428999999999997
61,-0.45428999999999997
62,-0.45428999999999997
63,-0.45428999999999997
64,-0.45428999999999997
65,-0.45428999999999997
66,-0.45428999999999997
67,-0.45428999999999997
68,-0.45428999999999997
69,-0.45428999999999997
70,-0.45428999999999997
71,-0.45428999999999997
72,-0.45428999999999997
73,-0.45428999999999997
74,-0.45428999999999997
75,-0.45428999999999997
76,-0.45428999999999997
77,-0.45428999999999997
78,-0.45428999999999997
79,1.5495
80,2.3746
81,2.2567
82,2.3746
83,2.3746
84,2.3746
85,2.2567
86,2.3746
87,2.2567
88,2.3746
89,2.3746
90,2.3746
91,2.2567
92,2.3746
93,2.3746
94,0.48866000000000004
95,-0.45428999999999997
