time,value
0,-0.50015
1,-0.59618
2,-0.50015
3,-0.50015
4,-0.50015
5,-0.59618
6,-0.50015
7,-0.50015
8,-0.50015
9,-0.59618
10,-0.50015
11,-0.50015
12,-0.50015
13,-0.50015
14,-0.59618
15,-0.50015
16,-0.50015
17,-0.50015
18,-0.59618
19,-0.50015
20,-0.50015
21,-0.50015
22,-0.59618
23,-0.50015
24,-0.50015
25,-0.50015
26,-0.50015
27,-0.59618
28,-0.50015
29,-0.50015
30,-0.50015
31,-0.50015
32,-0.59618
33,-0.50015
34,-0.50015
35,-0.50015
36,-0.50015
37,-0.59618
38,-0.50015
39,-0.50015
40,0.94029
41,1.9006
42,1.9006
43,1.8046
44,1.8046
45,1.9006
46,1.8046
47,1.8046
48,1.8046
49,1.8046
50,1.7085
51,1.1323
52,1.8046
53,1.3244
54,2.2847
55,3.4371
56,2.7648
57,1.3244
58,1.1323
59,-0.59618
60,-0.50015
61,-0.50015
62,-0.50015
63,-0.59618
64,-0.50015
65,-0.50015
66,-0.50015
67,-0.59618
68,-0.50015
69,-0.50015
70,1.4204
71,1.9006
72,0.94029
73,-0.50015
74,-0.50015
75,-0.50015
76,-0.59618
77,-0.50015
78,-0.50015
79,-0.50015
80,-0.59618
81,-0.50015
82,-0.50015
83,-0.50015
84,-0.59618
85,-0.50015
86,-0.50015
87,-0.50015
88,-0.59618
89,-0.50015
90,-0.50015
91,-0.50015
92,-0.59618
93,-0.50015
94,-0.50015
95,-0.50015
