time,value
0,-0.23265
1,-0.23265
2,-0.23265
3,-0.23265
4,-0.23265
5,-0.23265
6,-0.23265
7,-0.23265
8,-0.23265
9,-0.23265
10,-0.23265
11,-0.23265
12,-0.23265
13,-0.23265
14,-0.23265
15,-0.23265
16,-0.23265
17,-0.23265
18,-0.23265
19,-0.23265
20,-0.23265
21,-0.23265
22,-0.23265
23,-0.23265
24,-0.23265
25,-0.23265
26,-0.23265
27,-0.23265
28,-0.23265
29,4.0316
30,-0.23265
31,-0.23265
32,-0.23265
33,-0.23265
34,-0.23265
35,-0.23265
36,-0.23265
37,-0.23265
38,-0.23265
39,-0.23265
40,-0.23265
41,-0.23265
42,-0.23265
43,-0.23265
44,-0.23265
45,-0.23265
46,-0.23265
47,-0.23265
48,-0.23265
49,-0.23265
50,-0.23265
51,-0.23265
52,-0.23265
53,-0.23265
54,-0.23265
55,-0.019433000000000002
56,-0.072737
57,-0.23265
58,-0.23265
59,-0.23265
60,-0.23265
61,-0.23265
62,-0.23265
63,-0.23265
64,-0.23265
65,-0.23265
66,-0.23265
67,-0.23265
68,-0.23265
69,4.6712
70,4.7779
71,4.7779
72,-0.23265
73,-0.23265
74,-0.23265
75,-0.23265
76,-0.23265
77,-0.23265
78,2.5391
79,-0.23265
80,-0.23265
81,-0.23265
82,-0.23265
83,-0.23265
84,-0.23265
85,-0.23265
86,-0.23265
87,-0.23265
88,-0.23265
89,-0.23265
90,-0.23265
91,-0.23265
92,-0.23265
93,-0.23265
94,-0.23265
95,-0.23265
