time,value
0,-0.29184
1,-0.29184
2,-0.29184
3,-0.29184
4,-0.29184
5,-0.29184
6,-0.29184
7,-0.29184
8,-0.29184
9,-0.29184
10,-0.29184
11,-0.29184
12,-0.29184
13,-0.29184
14,-0.29184
15,-0.29184
16,-0.29184
17,-0.29184
18,-0.29184
19,-0.29184
20,-0.29184
21,-0.29184
22,-0.29184
23,-0.29184
24,-0.29184
25,-0.29184
26,-0.29184
27,-0.29184
28,-0.29184
29,-0.29184
30,-0.29184
31,-0.29184
32,-0.29184
33,-0.29184
34,-0.29184
35,-0.29184
36,-0.29184
37,-0.29184
38,-0.29184
39,-0.29184
40,-0.29184
41,-0.29184
42,-0.29184
43,-0.29184
44,-0.29184
45,-0.29184
46,-0.29184
47,-0.29184
48,-0.29184
49,-0.29184
50,-0.29184
51,-0.29184
52,3.1632
53,2.5051
54,0.74232
55,-0.29184
56,-0.29184
57,-0.29184
58,-0.29184
59,-0.29184
60,-0.29184
61,-0.29184
62,-0.29184
63,-0.29184
64,-0.29184
65,-0.29184
66,-0.29184
67,-0.29184
68,-0.29184
69,-0.29184
70,-0.29184
71,-0.29184
72,-0.29184
73,-0.29184
74,-0.29184
75,-0.29184
76,-0.29184
77,-0.29184
78,-0.29184
79,-0.29184
80,3.9858
81,0.88334
82,0.69531
83,4.5499
84,0.55429
85,-0.29184
86,5.443
87,1.659
88,0.6248
89,-0.29184
90,-0.29184
91,-0.29184
92,-0.29184
93,-0.29184
94,-0.29184
95,-0.29184
