d3mIndex,label
50000,5
50001,8
50002,8
50003,0
50004,4
50005,6
50006,1
50007,6
50008,3
50009,1
50010,4
50011,9
50012,5
50013,7
50014,9
50015,8
50016,5
50017,7
50018,8
50019,6
50020,9
50021,0
50022,4
50023,9
50024,4
50025,2
50026,4
50027,0
50028,9
50029,6
50030,6
50031,4
50032,4
50033,2
50034,9
50035,1
50036,4
50037,9
50038,9
50039,5
50040,4
50041,6
50042,7
50043,6
50044,0
50045,9
50046,3
50047,9
50048,7
50049,6
50050,9
50051,8
50052,2
50053,3
50054,8
50055,8
50056,7
50057,7
50058,4
50059,3
50060,7
50061,3
50062,6
50063,3
50064,6
50065,2
50066,1
50067,2
50068,3
50069,7
50070,8
50071,3
50072,8
50073,8
50074,0
50075,2
50076,9
50077,3
50078,5
50079,8
50080,8
50081,0
50082,1
50083,7
50084,2
50085,7
50086,4
50087,3
50088,8
50089,9
50090,0
50091,2
50092,8
50093,6
50094,4
50095,5
50096,6
50097,0
50098,0
50099,7
50100,4
50101,5
50102,6
50103,3
50104,1
50105,1
50106,3
50107,6
50108,3
50109,7
50110,3
50111,0
50112,2
50113,2
50114,9
50115,4
50116,0
50117,4
50118,2
50119,5
50120,8
50121,7
50122,1
50123,2
50124,8
50125,2
50126,8
50127,3
50128,3
50129,0
50130,4
50131,1
50132,8
50133,9
50134,1
50135,2
50136,9
50137,7
50138,2
50139,0
50140,3
50141,5
50142,6
50143,3
50144,0
50145,7
50146,6
50147,5
50148,7
50149,0
50150,8
50151,9
50152,6
50153,0
50154,0
50155,5
50156,2
50157,9
50158,3
50159,4
50160,0
50161,1
50162,7
50163,6
50164,0
50165,4
50166,8
50167,4
50168,5
50169,0
50170,9
50171,0
50172,9
50173,8
50174,9
50175,9
50176,3
50177,7
50178,5
50179,0
50180,0
50181,5
50182,2
50183,2
50184,4
50185,8
50186,2
50187,3
50188,3
50189,8
50190,5
50191,8
50192,0
50193,1
50194,7
50195,5
50196,8
50197,8
50198,7
50199,8
50200,5
50201,1
50202,8
50203,7
50204,1
50205,3
50206,0
50207,5
50208,7
50209,9
50210,7
50211,0
50212,5
50213,7
50214,8
50215,0
50216,7
50217,9
50218,8
50219,2
50220,7
50221,3
50222,9
50223,4
50224,3
50225,9
50226,4
50227,4
50228,7
50229,3
50230,5
50231,1
50232,7
50233,8
50234,8
50235,0
50236,4
50237,0
50238,5
50239,2
50240,1
50241,1
50242,8
50243,9
50244,0
50245,3
50246,1
50247,8
50248,2
50249,2
50250,5
50251,5
50252,9
50253,9
50254,2
50255,0
50256,3
50257,0
50258,8
50259,9
50260,8
50261,1
50262,3
50263,3
50264,0
50265,8
50266,8
50267,4
50268,7
50269,0
50270,2
50271,4
50272,6
50273,3
50274,8
50275,2
50276,0
50277,2
50278,4
50279,5
50280,9
50281,8
50282,6
50283,1
50284,9
50285,9
50286,1
50287,0
50288,7
50289,9
50290,1
50291,2
50292,6
50293,1
50294,3
50295,4
50296,6
50297,0
50298,0
50299,6
50300,6
50301,4
50302,5
50303,0
50304,6
50305,1
50306,8
50307,2
50308,1
50309,4
50310,8
50311,6
50312,0
50313,2
50314,4
50315,0
50316,7
50317,7
50318,5
50319,5
50320,3
50321,3
50322,2
50323,5
50324,7
50325,9
50326,7
50327,5
50328,4
50329,6
50330,1
50331,9
50332,4
50333,6
50334,6
50335,9
50336,3
50337,8
50338,0
50339,7
50340,4
50341,6
50342,2
50343,1
50344,8
50345,5
50346,4
50347,3
50348,8
50349,9
50350,9
50351,1
50352,8
50353,2
50354,2
50355,7
50356,5
50357,2
50358,8
50359,0
50360,9
50361,5
50362,8
50363,1
50364,9
50365,4
50366,0
50367,1
50368,4
50369,1
50370,4
50371,7
50372,9
50373,4
50374,2
50375,7
50376,0
50377,7
50378,8
50379,6
50380,6
50381,9
50382,0
50383,0
50384,5
50385,0
50386,7
50387,5
50388,2
50389,5
50390,1
50391,2
50392,6
50393,2
50394,9
50395,6
50396,2
50397,3
50398,0
50399,9
50400,9
50401,8
50402,7
50403,8
50404,8
50405,6
50406,0
50407,1
50408,8
50409,3
50410,7
50411,9
50412,5
50413,6
50414,1
50415,9
50416,3
50417,7
50418,5
50419,7
50420,4
50421,7
50422,8
50423,0
50424,2
50425,9
50426,5
50427,4
50428,6
50429,6
50430,4
50431,5
50432,3
50433,3
50434,9
50435,7
50436,2
50437,5
50438,5
50439,9
50440,1
50441,4
50442,9
50443,9
50444,5
50445,7
50446,5
50447,0
50448,2
50449,0
50450,2
50451,9
50452,7
50453,5
50454,9
50455,4
50456,6
50457,7
50458,4
50459,9
50460,5
50461,6
50462,1
50463,4
50464,4
50465,4
50466,4
50467,3
50468,7
50469,8
50470,3
50471,7
50472,8
50473,8
50474,5
50475,7
50476,6
50477,0
50478,5
50479,4
50480,0
50481,6
50482,8
50483,2
50484,5
50485,9
50486,9
50487,9
50488,4
50489,0
50490,1
50491,0
50492,8
50493,1
50494,1
50495,8
50496,0
50497,2
50498,2
50499,0
50500,6
50501,6
50502,3
50503,4
50504,9
50505,4
50506,7
50507,9
50508,9
50509,4
50510,5
50511,6
50512,6
50513,1
50514,5
50515,3
50516,8
50517,9
50518,7
50519,8
50520,5
50521,7
50522,0
50523,7
50524,0
50525,5
50526,4
50527,0
50528,4
50529,6
50530,9
50531,3
50532,1
50533,5
50534,6
50535,6
50536,6
50537,6
50538,8
50539,0
50540,1
50541,7
50542,6
50543,7
50544,5
50545,9
50546,1
50547,6
50548,2
50549,5
50550,5
50551,3
50552,8
50553,3
50554,9
50555,4
50556,6
50557,4
50558,3
50559,2
50560,0
50561,7
50562,6
50563,4
50564,2
50565,3
50566,9
50567,7
50568,8
50569,4
50570,2
50571,7
50572,1
50573,0
50574,6
50575,6
50576,8
50577,8
50578,7
50579,2
50580,4
50581,0
50582,8
50583,4
50584,0
50585,9
50586,5
50587,4
50588,8
50589,9
50590,6
50591,9
50592,2
50593,6
50594,1
50595,4
50596,7
50597,3
50598,5
50599,3
50600,0
50601,5
50602,0
50603,2
50604,1
50605,6
50606,4
50607,4
50608,3
50609,9
50610,6
50611,9
50612,8
50613,8
50614,5
50615,8
50616,6
50617,6
50618,4
50619,1
50620,7
50621,7
50622,1
50623,4
50624,7
50625,9
50626,9
50627,4
50628,4
50629,9
50630,8
50631,5
50632,6
50633,8
50634,4
50635,6
50636,8
50637,0
50638,0
50639,5
50640,3
50641,6
50642,0
50643,7
50644,9
50645,9
50646,4
50647,4
50648,4
50649,5
50650,3
50651,9
50652,5
50653,6
50654,9
50655,4
50656,1
50657,1
50658,4
50659,1
50660,9
50661,4
50662,7
50663,6
50664,3
50665,8
50666,9
50667,0
50668,9
50669,3
50670,6
50671,3
50672,4
50673,3
50674,4
50675,0
50676,4
50677,9
50678,3
50679,3
50680,1
50681,6
50682,4
50683,0
50684,9
50685,2
50686,9
50687,2
50688,6
50689,0
50690,3
50691,7
50692,0
50693,7
50694,8
50695,3
50696,8
50697,3
50698,7
50699,5
50700,7
50701,0
50702,4
50703,8
50704,4
50705,4
50706,0
50707,3
50708,8
50709,8
50710,3
50711,8
50712,8
50713,7
50714,4
50715,5
50716,3
50717,8
50718,4
50719,9
50720,7
50721,8
50722,8
50723,1
50724,8
50725,0
50726,1
50727,3
50728,6
50729,5
50730,4
50731,0
50732,7
50733,9
50734,8
50735,2
50736,0
50737,4
50738,1
50739,7
50740,5
50741,7
50742,0
50743,7
50744,9
50745,7
50746,6
50747,6
50748,2
50749,3
50750,9
50751,0
50752,9
50753,1
50754,2
50755,4
50756,6
50757,8
50758,2
50759,1
50760,3
50761,2
50762,6
50763,0
50764,1
50765,2
50766,4
50767,9
50768,5
50769,4
50770,0
50771,9
50772,6
50773,5
50774,0
50775,2
50776,5
50777,6
50778,0
50779,5
50780,9
50781,1
50782,7
50783,6
50784,7
50785,0
50786,3
50787,9
50788,6
50789,8
50790,0
50791,0
50792,4
50793,5
50794,7
50795,7
50796,4
50797,4
50798,7
50799,4
50800,7
50801,1
50802,4
50803,7
50804,4
50805,4
50806,0
50807,6
50808,7
50809,9
50810,5
50811,5
50812,7
50813,2
50814,0
50815,8
50816,9
50817,5
50818,8
50819,5
50820,3
50821,2
50822,0
50823,8
50824,7
50825,6
50826,0
50827,6
50828,5
50829,3
50830,1
50831,3
50832,2
50833,5
50834,2
50835,4
50836,9
50837,2
50838,9
50839,2
50840,7
50841,0
50842,7
50843,2
50844,2
50845,3
50846,2
50847,0
50848,2
50849,4
50850,3
50851,9
50852,8
50853,1
50854,0
50855,7
50856,7
50857,0
50858,7
50859,8
50860,4
50861,6
50862,3
50863,3
50864,0
50865,1
50866,9
50867,7
50868,0
50869,9
50870,3
50871,1
50872,4
50873,2
50874,3
50875,8
50876,4
50877,5
50878,4
50879,7
50880,8
50881,4
50882,0
50883,0
50884,8
50885,0
50886,0
50887,9
50888,8
50889,4
50890,4
50891,6
50892,7
50893,7
50894,1
50895,1
50896,3
50897,7
50898,3
50899,5
50900,5
50901,6
50902,6
50903,5
50904,0
50905,4
50906,1
50907,6
50908,8
50909,8
50910,5
50911,3
50912,3
50913,4
50914,0
50915,1
50916,4
50917,8
50918,8
50919,0
50920,6
50921,9
50922,9
50923,9
50924,0
50925,3
50926,8
50927,5
50928,0
50929,0
50930,4
50931,2
50932,3
50933,3
50934,7
50935,2
50936,3
50937,5
50938,9
50939,8
50940,9
50941,9
50942,7
50943,4
50944,0
50945,3
50946,0
50947,1
50948,4
50949,8
50950,3
50951,9
50952,6
50953,9
50954,4
50955,7
50956,0
50957,3
50958,7
50959,8
50960,9
50961,9
50962,1
50963,6
50964,5
50965,3
50966,6
50967,9
50968,1
50969,9
50970,9
50971,4
50972,5
50973,1
50974,7
50975,0
50976,6
50977,8
50978,1
50979,9
50980,6
50981,9
50982,3
50983,4
50984,7
50985,8
50986,5
50987,1
50988,2
50989,0
50990,1
50991,5
50992,8
50993,7
50994,2
50995,2
50996,8
50997,1
50998,3
50999,8
51000,5
51001,0
51002,8
51003,4
51004,8
51005,1
51006,1
51007,8
51008,9
51009,6
51010,0
51011,8
51012,4
51013,1
51014,3
51015,4
51016,1
51017,6
51018,0
51019,3
51020,1
51021,1
51022,8
51023,0
51024,3
51025,5
51026,0
51027,0
51028,6
51029,6
51030,3
51031,3
51032,6
51033,3
51034,3
51035,6
51036,4
51037,7
51038,2
51039,4
51040,4
51041,5
51042,2
51043,4
51044,8
51045,5
51046,2
51047,1
51048,1
51049,1
51050,0
51051,6
51052,0
51053,5
51054,1
51055,5
51056,3
51057,7
51058,6
51059,8
51060,9
51061,1
51062,6
51063,4
51064,1
51065,3
51066,1
51067,0
51068,9
51069,6
51070,3
51071,6
51072,8
51073,7
51074,3
51075,8
51076,0
51077,0
51078,0
51079,6
51080,9
51081,6
51082,0
51083,2
51084,5
51085,4
51086,4
51087,6
51088,5
51089,6
51090,8
51091,8
51092,6
51093,4
51094,6
51095,2
51096,7
51097,5
51098,1
51099,2
51100,4
51101,8
51102,8
51103,0
51104,9
51105,3
51106,9
51107,7
51108,2
51109,0
51110,2
51111,8
51112,5
51113,8
51114,9
51115,1
51116,5
51117,5
51118,4
51119,7
51120,5
51121,3
51122,8
51123,3
51124,2
51125,6
51126,0
51127,8
51128,4
51129,0
51130,4
51131,9
51132,0
51133,4
51134,0
51135,6
51136,1
51137,3
51138,3
51139,8
51140,3
51141,1
51142,8
51143,6
51144,9
51145,4
51146,4
51147,0
51148,2
51149,7
51150,9
51151,2
51152,0
51153,8
51154,6
51155,7
51156,1
51157,7
51158,1
51159,8
51160,8
51161,0
51162,7
51163,5
51164,8
51165,0
51166,3
51167,3
51168,3
51169,7
51170,7
51171,9
51172,7
51173,3
51174,1
51175,9
51176,1
51177,9
51178,2
51179,3
51180,3
51181,2
51182,1
51183,0
51184,6
51185,1
51186,4
51187,1
51188,0
51189,0
51190,1
51191,1
51192,6
51193,5
51194,4
51195,6
51196,2
51197,0
51198,7
51199,9
51200,8
51201,7
51202,2
51203,8
51204,6
51205,8
51206,1
51207,0
51208,0
51209,7
51210,0
51211,6
51212,1
51213,8
51214,5
51215,7
51216,8
51217,4
51218,8
51219,3
51220,3
51221,9
51222,1
51223,0
51224,7
51225,6
51226,6
51227,5
51228,3
51229,1
51230,0
51231,9
51232,1
51233,4
51234,9
51235,5
51236,3
51237,0
51238,1
51239,3
51240,2
51241,8
51242,1
51243,8
51244,3
51245,3
51246,7
51247,2
51248,4
51249,4
51250,7
51251,5
51252,5
51253,8
51254,2
51255,4
51256,8
51257,2
51258,1
51259,8
51260,9
51261,8
51262,8
51263,8
51264,8
51265,1
51266,8
51267,4
51268,3
51269,5
51270,9
51271,8
51272,7
51273,6
51274,3
51275,3
51276,1
51277,2
51278,2
51279,8
51280,3
51281,8
51282,9
51283,5
51284,8
51285,1
51286,0
51287,9
51288,1
51289,6
51290,5
51291,9
51292,4
51293,4
51294,8
51295,0
51296,7
51297,0
51298,9
51299,9
51300,4
51301,1
51302,6
51303,2
51304,8
51305,9
51306,3
51307,0
51308,4
51309,6
51310,0
51311,8
51312,6
51313,1
51314,9
51315,4
51316,5
51317,9
51318,5
51319,0
51320,7
51321,2
51322,0
51323,9
51324,4
51325,2
51326,4
51327,6
51328,3
51329,7
51330,7
51331,8
51332,1
51333,3
51334,2
51335,1
51336,4
51337,5
51338,6
51339,3
51340,1
51341,4
51342,7
51343,0
51344,9
51345,4
51346,9
51347,8
51348,6
51349,8
51350,4
51351,7
51352,2
51353,3
51354,1
51355,3
51356,3
51357,9
51358,8
51359,9
51360,7
51361,9
51362,5
51363,1
51364,4
51365,0
51366,8
51367,2
51368,3
51369,8
51370,9
51371,1
51372,9
51373,5
51374,0
51375,4
51376,9
51377,3
51378,1
51379,7
51380,3
51381,6
51382,2
51383,8
51384,9
51385,5
51386,3
51387,9
51388,3
51389,5
51390,6
51391,5
51392,2
51393,3
51394,5
51395,3
51396,1
51397,0
51398,7
51399,0
51400,3
51401,7
51402,7
51403,3
51404,1
51405,1
51406,9
51407,8
51408,1
51409,0
51410,1
51411,3
51412,1
51413,9
51414,1
51415,7
51416,3
51417,9
51418,6
51419,8
51420,7
51421,6
51422,8
51423,4
51424,9
51425,3
51426,7
51427,9
51428,7
51429,6
51430,8
51431,4
51432,9
51433,7
51434,0
51435,1
51436,6
51437,1
51438,5
51439,1
51440,0
51441,4
51442,3
51443,4
51444,1
51445,4
51446,0
51447,8
51448,4
51449,6
51450,2
51451,2
51452,6
51453,2
51454,3
51455,6
51456,2
51457,1
51458,1
51459,8
51460,6
51461,0
51462,4
51463,0
51464,1
51465,9
51466,7
51467,1
51468,3
51469,7
51470,7
51471,8
51472,9
51473,7
51474,7
51475,9
51476,7
51477,7
51478,7
51479,3
51480,1
51481,2
51482,0
51483,6
51484,4
51485,0
51486,7
51487,9
51488,8
51489,2
51490,8
51491,6
51492,9
51493,1
51494,2
51495,0
51496,2
51497,8
51498,3
51499,8
51500,1
51501,5
51502,2
51503,5
51504,1
51505,2
51506,7
51507,9
51508,8
51509,1
51510,8
51511,1
51512,8
51513,5
51514,0
51515,2
51516,4
51517,1
51518,3
51519,6
51520,7
51521,7
51522,4
51523,4
51524,3
51525,3
51526,4
51527,3
51528,2
51529,4
51530,3
51531,7
51532,8
51533,7
51534,4
51535,4
51536,3
51537,7
51538,8
51539,2
51540,8
51541,4
51542,5
51543,5
51544,4
51545,9
51546,4
51547,2
51548,5
51549,9
51550,6
51551,4
51552,3
51553,4
51554,4
51555,0
51556,8
51557,8
51558,4
51559,5
51560,7
51561,5
51562,6
51563,9
51564,1
51565,6
51566,7
51567,2
51568,0
51569,1
51570,7
51571,5
51572,1
51573,0
51574,9
51575,2
51576,4
51577,3
51578,6
51579,0
51580,1
51581,5
51582,9
51583,9
51584,7
51585,7
51586,5
51587,0
51588,5
51589,6
51590,4
51591,1
51592,4
51593,4
51594,5
51595,6
51596,0
51597,3
51598,5
51599,5
51600,9
51601,9
51602,7
51603,3
51604,1
51605,3
51606,3
51607,3
51608,4
51609,4
51610,2
51611,3
51612,4
51613,9
51614,1
51615,7
51616,7
51617,0
51618,7
51619,4
51620,3
51621,1
51622,4
51623,2
51624,4
51625,3
51626,9
51627,9
51628,2
51629,9
51630,9
51631,1
51632,8
51633,1
51634,6
51635,7
51636,2
51637,5
51638,4
51639,9
51640,5
51641,6
51642,3
51643,9
51644,2
51645,4
51646,0
51647,7
51648,8
51649,6
51650,5
51651,0
51652,0
51653,9
51654,9
51655,8
51656,2
51657,5
51658,4
51659,8
51660,3
51661,6
51662,9
51663,6
51664,0
51665,6
51666,6
51667,6
51668,9
51669,6
51670,6
51671,8
51672,6
51673,9
51674,4
51675,2
51676,8
51677,1
51678,2
51679,7
51680,6
51681,5
51682,7
51683,8
51684,1
51685,4
51686,0
51687,0
51688,6
51689,9
51690,4
51691,8
51692,9
51693,8
51694,0
51695,9
51696,4
51697,9
51698,2
51699,7
51700,3
51701,5
51702,9
51703,5
51704,0
51705,0
51706,1
51707,9
51708,3
51709,2
51710,4
51711,1
51712,0
51713,0
51714,0
51715,5
51716,1
51717,7
51718,8
51719,0
51720,4
51721,3
51722,6
51723,5
51724,2
51725,0
51726,0
51727,9
51728,0
51729,8
51730,0
51731,3
51732,9
51733,3
51734,9
51735,0
51736,5
51737,7
51738,3
51739,8
51740,1
51741,4
51742,8
51743,1
51744,0
51745,5
51746,4
51747,9
51748,0
51749,2
51750,8
51751,1
51752,5
51753,2
51754,7
51755,7
51756,2
51757,6
51758,2
51759,5
51760,0
51761,1
51762,4
51763,4
51764,5
51765,4
51766,2
51767,2
51768,0
51769,0
51770,7
51771,2
51772,8
51773,5
51774,5
51775,3
51776,0
51777,4
51778,8
51779,5
51780,7
51781,6
51782,3
51783,8
51784,1
51785,0
51786,1
51787,5
51788,6
51789,0
51790,5
51791,6
51792,9
51793,5
51794,3
51795,6
51796,0
51797,1
51798,4
51799,4
51800,4
51801,4
51802,5
51803,3
51804,4
51805,8
51806,1
51807,4
51808,9
51809,8
51810,1
51811,1
51812,7
51813,4
51814,9
51815,9
51816,9
51817,6
51818,5
51819,0
51820,8
51821,4
51822,7
51823,4
51824,9
51825,2
51826,8
51827,4
51828,7
51829,8
51830,2
51831,9
51832,6
51833,8
51834,9
51835,4
51836,4
51837,9
51838,8
51839,7
51840,8
51841,9
51842,4
51843,8
51844,0
51845,7
51846,2
51847,5
51848,3
51849,7
51850,3
51851,0
51852,2
51853,9
51854,5
51855,5
51856,8
51857,5
51858,4
51859,2
51860,8
51861,3
51862,4
51863,8
51864,7
51865,7
51866,8
51867,4
51868,7
51869,8
51870,2
51871,3
51872,5
51873,6
51874,8
51875,0
51876,0
51877,3
51878,7
51879,0
51880,1
51881,9
51882,1
51883,5
51884,2
51885,0
51886,2
51887,3
51888,2
51889,9
51890,4
51891,8
51892,6
51893,9
51894,3
51895,0
51896,9
51897,8
51898,5
51899,7
51900,8
51901,5
51902,0
51903,0
51904,1
51905,8
51906,3
51907,1
51908,5
51909,3
51910,7
51911,4
51912,0
51913,9
51914,9
51915,9
51916,3
51917,8
51918,2
51919,4
51920,2
51921,5
51922,5
51923,1
51924,6
51925,1
51926,0
51927,9
51928,4
51929,4
51930,1
51931,6
51932,0
51933,5
51934,9
51935,3
51936,7
51937,9
51938,0
51939,6
51940,2
51941,0
51942,4
51943,8
51944,4
51945,7
51946,8
51947,3
51948,5
51949,0
51950,5
51951,7
51952,4
51953,4
51954,0
51955,2
51956,7
51957,7
51958,3
51959,0
51960,5
51961,7
51962,6
51963,2
51964,3
51965,0
51966,7
51967,7
51968,8
51969,9
51970,1
51971,4
51972,6
51973,0
51974,6
51975,6
51976,5
51977,5
51978,6
51979,3
51980,9
51981,3
51982,6
51983,2
51984,7
51985,6
51986,4
51987,9
51988,3
51989,5
51990,7
51991,1
51992,6
51993,3
51994,8
51995,2
51996,5
51997,9
51998,2
51999,5
52000,1
52001,3
52002,2
52003,5
52004,7
52005,2
52006,7
52007,8
52008,9
52009,1
52010,2
52011,4
52012,5
52013,4
52014,8
52015,4
52016,6
52017,5
52018,6
52019,9
52020,9
52021,8
52022,5
52023,3
52024,6
52025,4
52026,5
52027,9
52028,7
52029,5
52030,5
52031,1
52032,4
52033,4
52034,2
52035,6
52036,3
52037,3
52038,2
52039,0
52040,0
52041,0
52042,1
52043,8
52044,3
52045,1
52046,3
52047,5
52048,8
52049,3
52050,8
52051,5
52052,8
52053,6
52054,3
52055,5
52056,5
52057,5
52058,8
52059,9
52060,3
52061,4
52062,7
52063,1
52064,8
52065,4
52066,4
52067,4
52068,3
52069,4
52070,2
52071,9
52072,0
52073,2
52074,2
52075,4
52076,3
52077,0
52078,0
52079,0
52080,9
52081,3
52082,2
52083,5
52084,7
52085,0
52086,1
52087,0
52088,7
52089,7
52090,2
52091,0
52092,1
52093,6
52094,5
52095,0
52096,9
52097,2
52098,0
52099,1
52100,4
52101,6
52102,0
52103,1
52104,6
52105,6
52106,5
52107,3
52108,5
52109,0
52110,0
52111,9
52112,1
52113,0
52114,2
52115,5
52116,9
52117,7
52118,8
52119,6
52120,8
52121,6
52122,0
52123,2
52124,0
52125,1
52126,1
52127,4
52128,4
52129,4
52130,0
52131,7
52132,2
52133,9
52134,4
52135,8
52136,9
52137,4
52138,6
52139,8
52140,9
52141,7
52142,1
52143,9
52144,3
52145,4
52146,2
52147,7
52148,9
52149,6
52150,9
52151,3
52152,7
52153,0
52154,5
52155,0
52156,8
52157,3
52158,9
52159,7
52160,0
52161,2
52162,5
52163,7
52164,1
52165,0
52166,0
52167,3
52168,5
52169,8
52170,2
52171,5
52172,4
52173,6
52174,9
52175,3
52176,1
52177,9
52178,3
52179,1
52180,4
52181,3
52182,4
52183,4
52184,9
52185,0
52186,3
52187,5
52188,9
52189,2
52190,9
52191,7
52192,4
52193,0
52194,8
52195,4
52196,8
52197,6
52198,0
52199,4
52200,0
52201,5
52202,9
52203,6
52204,9
52205,5
52206,1
52207,3
52208,4
52209,4
52210,8
52211,7
52212,2
52213,4
52214,4
52215,0
52216,7
52217,8
52218,4
52219,1
52220,1
52221,2
52222,6
52223,8
52224,1
52225,7
52226,6
52227,8
52228,7
52229,4
52230,3
52231,5
52232,3
52233,5
52234,7
52235,2
52236,5
52237,6
52238,1
52239,7
52240,9
52241,0
52242,6
52243,7
52244,9
52245,8
52246,9
52247,5
52248,8
52249,0
52250,3
52251,5
52252,3
52253,3
52254,8
52255,8
52256,4
52257,0
52258,1
52259,5
52260,4
52261,3
52262,2
52263,6
52264,3
52265,8
52266,8
52267,6
52268,3
52269,3
52270,4
52271,0
52272,7
52273,3
52274,1
52275,6
52276,0
52277,3
52278,9
52279,9
52280,8
52281,5
52282,9
52283,7
52284,8
52285,5
52286,7
52287,2
52288,5
52289,1
52290,9
52291,5
52292,5
52293,1
52294,9
52295,8
52296,9
52297,7
52298,0
52299,6
52300,3
52301,2
52302,0
52303,2
52304,6
52305,9
52306,3
52307,9
52308,1
52309,2
52310,7
52311,4
52312,2
52313,6
52314,3
52315,2
52316,2
52317,5
52318,2
52319,7
52320,2
52321,3
52322,0
52323,8
52324,3
52325,5
52326,7
52327,0
52328,7
52329,4
52330,0
52331,7
52332,2
52333,6
52334,1
52335,5
52336,9
52337,7
52338,6
52339,2
52340,7
52341,0
52342,5
52343,6
52344,0
52345,1
52346,1
52347,8
52348,4
52349,5
52350,5
52351,9
52352,5
52353,4
52354,8
52355,9
52356,8
52357,1
52358,7
52359,2
52360,7
52361,0
52362,4
52363,6
52364,6
52365,7
52366,1
52367,4
52368,0
52369,1
52370,0
52371,4
52372,5
52373,0
52374,8
52375,0
52376,0
52377,4
52378,1
52379,8
52380,8
52381,5
52382,9
52383,4
52384,7
52385,7
52386,5
52387,9
52388,0
52389,6
52390,1
52391,2
52392,5
52393,9
52394,6
52395,7
52396,9
52397,2
52398,8
52399,8
52400,0
52401,3
52402,9
52403,4
52404,0
52405,6
52406,4
52407,9
52408,2
52409,4
52410,3
52411,0
52412,9
52413,6
52414,3
52415,3
52416,6
52417,7
52418,8
52419,4
52420,8
52421,8
52422,4
52423,6
52424,4
52425,0
52426,0
52427,3
52428,6
52429,8
52430,7
52431,8
52432,0
52433,9
52434,0
52435,6
52436,6
52437,8
52438,1
52439,1
52440,7
52441,4
52442,3
52443,0
52444,3
52445,6
52446,9
52447,4
52448,2
52449,5
52450,1
52451,8
52452,4
52453,4
52454,1
52455,6
52456,8
52457,6
52458,0
52459,5
52460,9
52461,0
52462,1
52463,0
52464,2
52465,9
52466,0
52467,9
52468,0
52469,9
52470,7
52471,8
52472,2
52473,0
52474,6
52475,6
52476,8
52477,1
52478,6
52479,5
52480,8
52481,7
52482,9
52483,7
52484,1
52485,6
52486,4
52487,3
52488,6
52489,3
52490,0
52491,0
52492,8
52493,9
52494,5
52495,8
52496,9
52497,0
52498,3
52499,2
52500,4
52501,4
52502,8
52503,8
52504,1
52505,7
52506,0
52507,0
52508,6
52509,4
52510,4
52511,9
52512,2
52513,2
52514,9
52515,2
52516,3
52517,9
52518,7
52519,4
52520,1
52521,5
52522,1
52523,4
52524,3
52525,2
52526,2
52527,8
52528,9
52529,5
52530,6
52531,2
52532,1
52533,3
52534,9
52535,6
52536,5
52537,1
52538,5
52539,8
52540,4
52541,1
52542,0
52543,3
52544,2
52545,4
52546,8
52547,4
52548,0
52549,4
52550,4
52551,2
52552,9
52553,8
52554,7
52555,7
52556,6
52557,2
52558,4
52559,7
52560,7
52561,6
52562,4
52563,0
52564,2
52565,3
52566,2
52567,5
52568,7
52569,0
52570,0
52571,9
52572,6
52573,5
52574,8
52575,4
52576,2
52577,4
52578,8
52579,8
52580,3
52581,0
52582,5
52583,7
52584,6
52585,3
52586,5
52587,0
52588,3
52589,0
52590,5
52591,8
52592,4
52593,8
52594,0
52595,4
52596,9
52597,5
52598,3
52599,3
52600,8
52601,1
52602,6
52603,9
52604,8
52605,4
52606,3
52607,1
52608,2
52609,3
52610,2
52611,4
52612,3
52613,6
52614,0
52615,7
52616,1
52617,3
52618,5
52619,7
52620,1
52621,8
52622,0
52623,4
52624,8
52625,2
52626,7
52627,7
52628,0
52629,4
52630,2
52631,4
52632,3
52633,3
52634,9
52635,4
52636,1
52637,6
52638,2
52639,6
52640,7
52641,4
52642,7
52643,3
52644,8
52645,1
52646,3
52647,1
52648,4
52649,6
52650,0
52651,0
52652,7
52653,4
52654,5
52655,4
52656,9
52657,5
52658,7
52659,2
52660,5
52661,5
52662,6
52663,7
52664,4
52665,1
52666,6
52667,1
52668,0
52669,4
52670,9
52671,2
52672,8
52673,3
52674,0
52675,4
52676,6
52677,7
52678,0
52679,0
52680,0
52681,0
52682,7
52683,5
52684,3
52685,2
52686,7
52687,8
52688,5
52689,3
52690,0
52691,2
52692,8
52693,9
52694,1
52695,2
52696,2
52697,0
52698,3
52699,4
52700,9
52701,1
52702,4
52703,0
52704,8
52705,0
52706,3
52707,6
52708,4
52709,6
52710,7
52711,5
52712,1
52713,8
52714,8
52715,0
52716,3
52717,0
52718,3
52719,5
52720,3
52721,8
52722,4
52723,2
52724,0
52725,8
52726,5
52727,9
52728,2
52729,3
52730,6
52731,5
52732,7
52733,4
52734,7
52735,3
52736,8
52737,0
52738,4
52739,2
52740,0
52741,6
52742,2
52743,9
52744,9
52745,8
52746,6
52747,3
52748,1
52749,0
52750,5
52751,2
52752,5
52753,7
52754,9
52755,7
52756,9
52757,1
52758,1
52759,3
52760,2
52761,7
52762,2
52763,4
52764,1
52765,9
52766,4
52767,3
52768,5
52769,9
52770,4
52771,7
52772,6
52773,1
52774,5
52775,3
52776,7
52777,3
52778,4
52779,2
52780,7
52781,3
52782,0
52783,0
52784,1
52785,4
52786,4
52787,3
52788,2
52789,9
52790,8
52791,7
52792,0
52793,9
52794,0
52795,3
52796,7
52797,6
52798,3
52799,8
52800,6
52801,5
52802,6
52803,5
52804,4
52805,4
52806,2
52807,9
52808,3
52809,4
52810,0
52811,2
52812,0
52813,1
52814,1
52815,8
52816,8
52817,9
52818,4
52819,1
52820,6
52821,0
52822,2
52823,4
52824,7
52825,2
52826,4
52827,5
52828,4
52829,6
52830,6
52831,0
52832,3
52833,0
52834,4
52835,3
52836,3
52837,8
52838,1
52839,2
52840,3
52841,2
52842,7
52843,0
52844,3
52845,5
52846,6
52847,0
52848,6
52849,6
52850,5
52851,2
52852,2
52853,9
52854,9
52855,5
52856,2
52857,0
52858,4
52859,9
52860,5
52861,5
52862,5
52863,6
52864,5
52865,6
52866,9
52867,4
52868,9
52869,4
52870,8
52871,3
52872,1
52873,9
52874,0
52875,9
52876,0
52877,0
52878,3
52879,0
52880,4
52881,7
52882,7
52883,2
52884,6
52885,5
52886,3
52887,9
52888,4
52889,5
52890,5
52891,7
52892,0
52893,8
52894,6
52895,5
52896,8
52897,3
52898,3
52899,9
52900,5
52901,2
52902,9
52903,2
52904,7
52905,4
52906,9
52907,0
52908,7
52909,0
52910,0
52911,1
52912,3
52913,0
52914,6
52915,5
52916,1
52917,4
52918,2
52919,8
52920,4
52921,8
52922,3
52923,3
52924,1
52925,4
52926,9
52927,8
52928,1
52929,1
52930,7
52931,9
52932,9
52933,4
52934,3
52935,8
52936,5
52937,5
52938,2
52939,4
52940,0
52941,8
52942,5
52943,1
52944,9
52945,7
52946,9
52947,1
52948,0
52949,3
52950,1
52951,0
52952,3
52953,8
52954,9
52955,2
52956,0
52957,8
52958,8
52959,4
52960,0
52961,4
52962,0
52963,3
52964,0
52965,7
52966,0
52967,7
52968,0
52969,5
52970,3
52971,4
52972,3
52973,0
52974,9
52975,2
52976,0
52977,9
52978,2
52979,0
52980,8
52981,5
52982,4
52983,5
52984,2
52985,0
52986,8
52987,4
52988,5
52989,5
52990,4
52991,3
52992,4
52993,0
52994,8
52995,4
52996,8
52997,5
52998,5
52999,6
53000,5
53001,1
53002,7
53003,3
53004,4
53005,2
53006,5
53007,6
53008,8
53009,7
53010,6
53011,3
53012,9
53013,2
53014,6
53015,6
53016,2
53017,5
53018,5
53019,5
53020,1
53021,8
53022,7
53023,3
53024,0
53025,6
53026,7
53027,1
53028,1
53029,9
53030,6
53031,5
53032,0
53033,1
53034,2
53035,3
53036,9
53037,8
53038,4
53039,1
53040,7
53041,4
53042,8
53043,4
53044,7
53045,5
53046,8
53047,3
53048,0
53049,3
53050,0
53051,8
53052,2
53053,3
53054,0
53055,9
53056,4
53057,6
53058,1
53059,4
53060,7
53061,7
53062,9
53063,0
53064,1
53065,4
53066,1
53067,4
53068,0
53069,4
53070,0
53071,7
53072,8
53073,3
53074,1
53075,3
53076,2
53077,1
53078,8
53079,8
53080,1
53081,9
53082,7
53083,3
53084,3
53085,2
53086,9
53087,0
53088,6
53089,8
53090,4
53091,1
53092,7
53093,7
53094,0
53095,4
53096,7
53097,7
53098,4
53099,9
53100,0
53101,7
53102,0
53103,6
53104,7
53105,1
53106,8
53107,3
53108,3
53109,8
53110,5
53111,0
53112,0
53113,2
53114,8
53115,3
53116,7
53117,0
53118,6
53119,5
53120,4
53121,9
53122,1
53123,8
53124,6
53125,3
53126,9
53127,4
53128,9
53129,3
53130,3
53131,7
53132,5
53133,9
53134,7
53135,7
53136,4
53137,3
53138,0
53139,9
53140,8
53141,9
53142,5
53143,3
53144,1
53145,9
53146,6
53147,2
53148,0
53149,1
53150,9
53151,8
53152,1
53153,1
53154,0
53155,8
53156,9
53157,9
53158,0
53159,2
53160,2
53161,9
53162,1
53163,9
53164,2
53165,9
53166,9
53167,2
53168,7
53169,9
53170,9
53171,9
53172,9
53173,9
53174,2
53175,1
53176,7
53177,0
53178,7
53179,6
53180,3
53181,9
53182,8
53183,3
53184,0
53185,3
53186,4
53187,7
53188,3
53189,8
53190,0
53191,0
53192,4
53193,4
53194,5
53195,5
53196,7
53197,6
53198,6
53199,6
53200,5
53201,3
53202,3
53203,4
53204,5
53205,8
53206,0
53207,0
53208,9
53209,2
53210,9
53211,8
53212,6
53213,9
53214,6
53215,1
53216,7
53217,7
53218,7
53219,0
53220,3
53221,5
53222,4
53223,7
53224,6
53225,9
53226,8
53227,4
53228,3
53229,9
53230,5
53231,3
53232,7
53233,8
53234,3
53235,5
53236,5
53237,9
53238,6
53239,1
53240,3
53241,7
53242,4
53243,8
53244,7
53245,7
53246,8
53247,3
53248,0
53249,3
53250,6
53251,5
53252,4
53253,8
53254,3
53255,5
53256,4
53257,7
53258,3
53259,3
53260,7
53261,0
53262,7
53263,1
53264,0
53265,8
53266,7
53267,3
53268,5
53269,7
53270,8
53271,5
53272,7
53273,8
53274,9
53275,5
53276,4
53277,7
53278,0
53279,8
53280,3
53281,2
53282,9
53283,7
53284,4
53285,1
53286,6
53287,3
53288,9
53289,8
53290,5
53291,5
53292,4
53293,1
53294,0
53295,9
53296,4
53297,3
53298,3
53299,4
53300,4
53301,8
53302,0
53303,8
53304,2
53305,9
53306,4
53307,9
53308,7
53309,4
53310,6
53311,7
53312,5
53313,2
53314,1
53315,3
53316,7
53317,7
53318,8
53319,6
53320,7
53321,0
53322,2
53323,5
53324,9
53325,7
53326,4
53327,7
53328,2
53329,5
53330,7
53331,8
53332,7
53333,2
53334,5
53335,0
53336,0
53337,7
53338,0
53339,3
53340,6
53341,1
53342,3
53343,3
53344,9
53345,7
53346,3
53347,9
53348,1
53349,6
53350,8
53351,1
53352,4
53353,3
53354,0
53355,0
53356,4
53357,3
53358,9
53359,3
53360,4
53361,4
53362,1
53363,1
53364,4
53365,9
53366,0
53367,7
53368,9
53369,3
53370,1
53371,5
53372,1
53373,2
53374,6
53375,4
53376,5
53377,7
53378,4
53379,3
53380,8
53381,3
53382,4
53383,8
53384,7
53385,8
53386,2
53387,5
53388,6
53389,1
53390,5
53391,3
53392,1
53393,5
53394,1
53395,9
53396,0
53397,9
53398,0
53399,0
53400,9
53401,2
53402,4
53403,8
53404,5
53405,7
53406,6
53407,1
53408,2
53409,9
53410,4
53411,3
53412,0
53413,3
53414,7
53415,7
53416,0
53417,3
53418,1
53419,4
53420,5
53421,0
53422,3
53423,8
53424,5
53425,0
53426,0
53427,6
53428,2
53429,0
53430,0
53431,4
53432,5
53433,7
53434,5
53435,6
53436,4
53437,7
53438,9
53439,0
53440,3
53441,0
53442,0
53443,2
53444,0
53445,0
53446,7
53447,4
53448,6
53449,1
53450,1
53451,5
53452,3
53453,2
53454,2
53455,6
53456,3
53457,4
53458,5
53459,9
53460,1
53461,3
53462,4
53463,3
53464,9
53465,6
53466,5
53467,0
53468,2
53469,9
53470,5
53471,1
53472,7
53473,2
53474,2
53475,0
53476,8
53477,3
53478,4
53479,5
53480,2
53481,7
53482,7
53483,0
53484,4
53485,8
53486,6
53487,5
53488,9
53489,9
53490,0
53491,3
53492,9
53493,0
53494,9
53495,2
53496,0
53497,1
53498,9
53499,0
53500,1
53501,1
53502,8
53503,4
53504,9
53505,5
53506,2
53507,4
53508,3
53509,3
53510,4
53511,0
53512,4
53513,3
53514,7
53515,8
53516,9
53517,9
53518,5
53519,8
53520,1
53521,8
53522,2
53523,4
53524,4
53525,2
53526,4
53527,1
53528,1
53529,3
53530,6
53531,8
53532,5
53533,2
53534,3
53535,5
53536,0
53537,8
53538,2
53539,3
53540,6
53541,2
53542,9
53543,2
53544,1
53545,4
53546,5
53547,9
53548,0
53549,9
53550,4
53551,0
53552,8
53553,3
53554,9
53555,6
53556,6
53557,2
53558,5
53559,4
53560,9
53561,5
53562,8
53563,6
53564,9
53565,1
53566,7
53567,6
53568,0
53569,9
53570,3
53571,5
53572,3
53573,2
53574,3
53575,3
53576,4
53577,1
53578,9
53579,9
53580,4
53581,4
53582,6
53583,1
53584,5
53585,8
53586,8
53587,3
53588,6
53589,4
53590,7
53591,6
53592,7
53593,2
53594,5
53595,2
53596,4
53597,6
53598,2
53599,7
53600,2
53601,3
53602,3
53603,3
53604,2
53605,4
53606,3
53607,2
53608,0
53609,9
53610,5
53611,1
53612,1
53613,5
53614,3
53615,2
53616,4
53617,3
53618,2
53619,1
53620,0
53621,4
53622,3
53623,5
53624,4
53625,8
53626,9
53627,4
53628,3
53629,1
53630,8
53631,9
53632,1
53633,3
53634,3
53635,4
53636,4
53637,2
53638,9
53639,7
53640,6
53641,8
53642,1
53643,8
53644,9
53645,9
53646,3
53647,1
53648,7
53649,3
53650,0
53651,9
53652,2
53653,8
53654,5
53655,9
53656,3
53657,7
53658,4
53659,6
53660,0
53661,1
53662,6
53663,1
53664,6
53665,7
53666,5
53667,2
53668,2
53669,4
53670,9
53671,4
53672,0
53673,0
53674,4
53675,4
53676,0
53677,4
53678,1
53679,0
53680,0
53681,4
53682,4
53683,8
53684,9
53685,2
53686,8
53687,9
53688,3
53689,7
53690,9
53691,1
53692,4
53693,3
53694,3
53695,8
53696,4
53697,4
53698,8
53699,9
53700,3
53701,1
53702,1
53703,6
53704,5
53705,8
53706,4
53707,6
53708,6
53709,5
53710,2
53711,4
53712,8
53713,2
53714,3
53715,1
53716,3
53717,6
53718,8
53719,5
53720,2
53721,0
53722,7
53723,1
53724,4
53725,2
53726,6
53727,9
53728,2
53729,8
53730,1
53731,6
53732,9
53733,8
53734,7
53735,4
53736,3
53737,2
53738,9
53739,7
53740,0
53741,7
53742,9
53743,3
53744,4
53745,1
53746,6
53747,9
53748,5
53749,8
53750,0
53751,7
53752,3
53753,3
53754,0
53755,0
53756,7
53757,0
53758,2
53759,4
53760,7
53761,0
53762,0
53763,8
53764,1
53765,0
53766,0
53767,6
53768,1
53769,9
53770,9
53771,0
53772,1
53773,5
53774,5
53775,6
53776,8
53777,7
53778,7
53779,3
53780,4
53781,2
53782,0
53783,2
53784,5
53785,2
53786,7
53787,4
53788,7
53789,0
53790,4
53791,2
53792,0
53793,6
53794,1
53795,7
53796,5
53797,6
53798,5
53799,7
53800,9
53801,0
53802,7
53803,8
53804,5
53805,9
53806,4
53807,8
53808,5
53809,4
53810,3
53811,7
53812,9
53813,8
53814,1
53815,7
53816,4
53817,8
53818,9
53819,5
53820,0
53821,4
53822,4
53823,0
53824,2
53825,0
53826,1
53827,3
53828,7
53829,0
53830,3
53831,5
53832,7
53833,9
53834,8
53835,5
53836,7
53837,9
53838,1
53839,5
53840,3
53841,9
53842,8
53843,4
53844,2
53845,0
53846,9
53847,0
53848,8
53849,5
53850,9
53851,6
53852,3
53853,5
53854,8
53855,1
53856,9
53857,1
53858,8
53859,3
53860,7
53861,6
53862,4
53863,2
53864,3
53865,7
53866,0
53867,5
53868,4
53869,8
53870,8
53871,8
53872,7
53873,9
53874,4
53875,0
53876,7
53877,4
53878,0
53879,7
53880,6
53881,7
53882,9
53883,7
53884,3
53885,3
53886,8
53887,4
53888,6
53889,6
53890,7
53891,1
53892,5
53893,9
53894,7
53895,1
53896,5
53897,0
53898,1
53899,4
53900,3
53901,8
53902,1
53903,0
53904,1
53905,0
53906,6
53907,2
53908,2
53909,5
53910,4
53911,9
53912,8
53913,7
53914,4
53915,4
53916,9
53917,7
53918,6
53919,7
53920,7
53921,1
53922,9
53923,7
53924,3
53925,1
53926,9
53927,0
53928,2
53929,3
53930,1
53931,5
53932,6
53933,9
53934,2
53935,7
53936,6
53937,8
53938,8
53939,9
53940,6
53941,6
53942,9
53943,0
53944,7
53945,5
53946,8
53947,4
53948,9
53949,5
53950,8
53951,1
53952,4
53953,7
53954,5
53955,0
53956,3
53957,0
53958,9
53959,5
53960,2
53961,8
53962,7
53963,1
53964,9
53965,0
53966,4
53967,4
53968,8
53969,2
53970,9
53971,0
53972,7
53973,9
53974,8
53975,7
53976,1
53977,6
53978,3
53979,9
53980,0
53981,3
53982,9
53983,7
53984,6
53985,7
53986,7
53987,1
53988,1
53989,2
53990,4
53991,2
53992,0
53993,6
53994,8
53995,9
53996,7
53997,2
53998,2
53999,9
54000,0
54001,2
54002,7
54003,0
54004,0
54005,5
54006,8
54007,6
54008,8
54009,2
54010,7
54011,7
54012,9
54013,9
54014,8
54015,1
54016,3
54017,5
54018,9
54019,7
54020,8
54021,9
54022,3
54023,3
54024,8
54025,1
54026,9
54027,4
54028,0
54029,5
54030,1
54031,4
54032,3
54033,4
54034,2
54035,2
54036,0
54037,0
54038,9
54039,7
54040,0
54041,7
54042,4
54043,3
54044,6
54045,7
54046,7
54047,7
54048,7
54049,4
54050,3
54051,3
54052,6
54053,4
54054,0
54055,1
54056,0
54057,7
54058,7
54059,1
54060,3
54061,5
54062,0
54063,7
54064,7
54065,4
54066,2
54067,1
54068,8
54069,5
54070,9
54071,3
54072,5
54073,6
54074,2
54075,2
54076,7
54077,3
54078,5
54079,8
54080,1
54081,0
54082,6
54083,8
54084,7
54085,7
54086,8
54087,5
54088,7
54089,2
54090,4
54091,9
54092,7
54093,3
54094,5
54095,0
54096,8
54097,4
54098,0
54099,3
54100,7
54101,4
54102,0
54103,0
54104,0
54105,7
54106,0
54107,4
54108,4
54109,5
54110,2
54111,8
54112,5
54113,0
54114,3
54115,8
54116,2
54117,4
54118,0
54119,3
54120,4
54121,7
54122,6
54123,0
54124,8
54125,2
54126,0
54127,4
54128,1
54129,1
54130,6
54131,1
54132,4
54133,3
54134,1
54135,5
54136,2
54137,5
54138,4
54139,0
54140,3
54141,8
54142,8
54143,5
54144,1
54145,8
54146,2
54147,3
54148,3
54149,9
54150,6
54151,6
54152,9
54153,0
54154,7
54155,3
54156,3
54157,2
54158,7
54159,4
54160,5
54161,6
54162,0
54163,6
54164,1
54165,8
54166,1
54167,0
54168,9
54169,3
54170,1
54171,0
54172,5
54173,4
54174,2
54175,4
54176,3
54177,6
54178,7
54179,6
54180,0
54181,0
54182,5
54183,7
54184,4
54185,7
54186,7
54187,0
54188,6
54189,1
54190,4
54191,9
54192,0
54193,0
54194,0
54195,3
54196,8
54197,4
54198,0
54199,8
54200,4
54201,1
54202,0
54203,2
54204,6
54205,4
54206,1
54207,1
54208,2
54209,7
54210,3
54211,7
54212,1
54213,4
54214,7
54215,1
54216,0
54217,0
54218,9
54219,0
54220,4
54221,2
54222,8
54223,8
54224,5
54225,3
54226,0
54227,4
54228,0
54229,8
54230,2
54231,2
54232,5
54233,9
54234,2
54235,9
54236,1
54237,1
54238,5
54239,4
54240,7
54241,3
54242,8
54243,6
54244,7
54245,1
54246,5
54247,5
54248,5
54249,4
54250,9
54251,8
54252,9
54253,9
54254,8
54255,9
54256,8
54257,6
54258,8
54259,5
54260,8
54261,0
54262,4
54263,6
54264,2
54265,5
54266,3
54267,7
54268,4
54269,0
54270,0
54271,1
54272,7
54273,3
54274,1
54275,5
54276,9
54277,3
54278,1
54279,6
54280,0
54281,5
54282,3
54283,4
54284,9
54285,1
54286,0
54287,4
54288,1
54289,7
54290,2
54291,6
54292,1
54293,9
54294,0
54295,0
54296,8
54297,9
54298,9
54299,0
54300,8
54301,4
54302,2
54303,5
54304,2
54305,0
54306,3
54307,2
54308,0
54309,5
54310,4
54311,7
54312,2
54313,3
54314,1
54315,6
54316,8
54317,8
54318,1
54319,6
54320,0
54321,5
54322,4
54323,5
54324,9
54325,6
54326,7
54327,1
54328,0
54329,6
54330,9
54331,5
54332,7
54333,7
54334,4
54335,3
54336,9
54337,1
54338,9
54339,7
54340,0
54341,1
54342,3
54343,5
54344,4
54345,3
54346,3
54347,8
54348,8
54349,0
54350,4
54351,8
54352,3
54353,4
54354,3
54355,3
54356,0
54357,4
54358,5
54359,2
54360,6
54361,8
54362,4
54363,9
54364,9
54365,9
54366,2
54367,0
54368,4
54369,7
54370,8
54371,1
54372,1
54373,0
54374,0
54375,5
54376,7
54377,4
54378,1
54379,1
54380,9
54381,4
54382,7
54383,6
54384,6
54385,8
54386,2
54387,0
54388,2
54389,8
54390,5
54391,8
54392,2
54393,7
54394,5
54395,7
54396,9
54397,8
54398,4
54399,4
54400,3
54401,1
54402,4
54403,8
54404,4
54405,6
54406,5
54407,3
54408,1
54409,8
54410,9
54411,3
54412,7
54413,6
54414,2
54415,0
54416,4
54417,9
54418,9
54419,0
54420,5
54421,3
54422,3
54423,4
54424,1
54425,1
54426,0
54427,2
54428,8
54429,2
54430,1
54431,1
54432,7
54433,5
54434,2
54435,3
54436,4
54437,1
54438,5
54439,9
54440,2
54441,1
54442,0
54443,4
54444,8
54445,9
54446,0
54447,9
54448,6
54449,9
54450,0
54451,2
54452,2
54453,0
54454,6
54455,8
54456,7
54457,5
54458,3
54459,8
54460,9
54461,0
54462,2
54463,2
54464,3
54465,6
54466,1
54467,3
54468,9
54469,5
54470,0
54471,2
54472,4
54473,4
54474,0
54475,9
54476,3
54477,5
54478,1
54479,4
54480,9
54481,9
54482,2
54483,2
54484,4
54485,7
54486,1
54487,7
54488,4
54489,7
54490,0
54491,2
54492,8
54493,4
54494,8
54495,3
54496,8
54497,8
54498,8
54499,3
54500,3
54501,5
54502,7
54503,5
54504,3
54505,4
54506,1
54507,5
54508,9
54509,7
54510,0
54511,6
54512,8
54513,3
54514,9
54515,0
54516,9
54517,8
54518,9
54519,6
54520,3
54521,9
54522,2
54523,4
54524,4
54525,0
54526,3
54527,7
54528,7
54529,4
54530,5
54531,1
54532,1
54533,8
54534,2
54535,2
54536,8
54537,3
54538,7
54539,8
54540,9
54541,2
54542,2
54543,1
54544,7
54545,3
54546,0
54547,5
54548,0
54549,1
54550,1
54551,5
54552,3
54553,3
54554,4
54555,9
54556,2
54557,0
54558,0
54559,3
54560,1
54561,5
54562,4
54563,7
54564,4
54565,4
54566,8
54567,4
54568,8
54569,9
54570,9
54571,4
54572,2
54573,4
54574,3
54575,6
54576,4
54577,4
54578,4
54579,6
54580,6
54581,3
54582,8
54583,7
54584,4
54585,8
54586,0
54587,5
54588,9
54589,3
54590,2
54591,0
54592,7
54593,3
54594,1
54595,9
54596,4
54597,9
54598,1
54599,8
54600,4
54601,2
54602,1
54603,6
54604,4
54605,3
54606,9
54607,1
54608,4
54609,8
54610,0
54611,1
54612,7
54613,1
54614,5
54615,4
54616,4
54617,3
54618,6
54619,9
54620,7
54621,8
54622,2
54623,5
54624,3
54625,4
54626,5
54627,4
54628,7
54629,7
54630,4
54631,5
54632,4
54633,1
54634,5
54635,7
54636,8
54637,5
54638,6
54639,0
54640,2
54641,5
54642,2
54643,2
54644,4
54645,4
54646,5
54647,1
54648,6
54649,8
54650,6
54651,8
54652,3
54653,2
54654,7
54655,5
54656,9
54657,7
54658,1
54659,4
54660,3
54661,3
54662,6
54663,1
54664,7
54665,3
54666,0
54667,0
54668,6
54669,6
54670,8
54671,6
54672,6
54673,0
54674,3
54675,4
54676,7
54677,4
54678,8
54679,4
54680,9
54681,9
54682,3
54683,4
54684,1
54685,4
54686,0
54687,3
54688,7
54689,1
54690,2
54691,2
54692,8
54693,4
54694,7
54695,8
54696,5
54697,3
54698,6
54699,2
54700,1
54701,0
54702,6
54703,4
54704,9
54705,5
54706,2
54707,7
54708,3
54709,0
54710,3
54711,9
54712,4
54713,1
54714,6
54715,9
54716,9
54717,4
54718,3
54719,9
54720,0
54721,1
54722,3
54723,9
54724,5
54725,9
54726,0
54727,9
54728,7
54729,2
54730,4
54731,4
54732,2
54733,6
54734,4
54735,8
54736,1
54737,9
54738,3
54739,6
54740,3
54741,1
54742,8
54743,6
54744,2
54745,0
54746,6
54747,7
54748,9
54749,3
54750,3
54751,6
54752,1
54753,2
54754,0
54755,1
54756,6
54757,4
54758,2
54759,0
54760,3
54761,9
54762,1
54763,0
54764,5
54765,5
54766,1
54767,6
54768,9
54769,8
54770,9
54771,0
54772,6
54773,1
54774,6
54775,7
54776,3
54777,5
54778,6
54779,9
54780,0
54781,7
54782,2
54783,7
54784,0
54785,3
54786,8
54787,8
54788,6
54789,9
54790,9
54791,9
54792,0
54793,6
54794,2
54795,3
54796,9
54797,5
54798,0
54799,1
54800,9
54801,7
54802,0
54803,7
54804,3
54805,3
54806,1
54807,8
54808,5
54809,0
54810,5
54811,0
54812,8
54813,8
54814,3
54815,9
54816,6
54817,0
54818,0
54819,5
54820,3
54821,4
54822,1
54823,4
54824,0
54825,5
54826,3
54827,9
54828,2
54829,5
54830,3
54831,1
54832,2
54833,2
54834,4
54835,9
54836,9
54837,7
54838,1
54839,7
54840,0
54841,1
54842,2
54843,1
54844,5
54845,3
54846,8
54847,5
54848,1
54849,5
54850,9
54851,9
54852,0
54853,7
54854,0
54855,1
54856,7
54857,6
54858,2
54859,6
54860,5
54861,0
54862,0
54863,1
54864,4
54865,9
54866,9
54867,9
54868,0
54869,8
54870,8
54871,5
54872,9
54873,0
54874,9
54875,1
54876,3
54877,6
54878,7
54879,6
54880,9
54881,8
54882,6
54883,2
54884,4
54885,2
54886,3
54887,5
54888,5
54889,5
54890,1
54891,6
54892,4
54893,1
54894,4
54895,1
54896,7
54897,1
54898,6
54899,0
54900,3
54901,0
54902,4
54903,6
54904,9
54905,7
54906,5
54907,3
54908,6
54909,0
54910,9
54911,8
54912,1
54913,1
54914,3
54915,5
54916,3
54917,6
54918,3
54919,8
54920,7
54921,2
54922,0
54923,7
54924,7
54925,5
54926,7
54927,1
54928,9
54929,9
54930,9
54931,8
54932,9
54933,4
54934,5
54935,5
54936,3
54937,0
54938,3
54939,0
54940,4
54941,3
54942,0
54943,4
54944,8
54945,9
54946,6
54947,5
54948,1
54949,1
54950,2
54951,7
54952,9
54953,0
54954,1
54955,8
54956,5
54957,4
54958,4
54959,7
54960,4
54961,8
54962,3
54963,3
54964,7
54965,2
54966,5
54967,0
54968,0
54969,1
54970,2
54971,9
54972,8
54973,9
54974,7
54975,3
54976,5
54977,9
54978,1
54979,9
54980,9
54981,0
54982,5
54983,6
54984,3
54985,4
54986,0
54987,3
54988,5
54989,6
54990,7
54991,8
54992,1
54993,7
54994,7
54995,3
54996,3
54997,3
54998,5
54999,1
55000,7
55001,6
55002,8
55003,4
55004,4
55005,5
55006,9
55007,3
55008,4
55009,2
55010,7
55011,4
55012,6
55013,0
55014,7
55015,2
55016,5
55017,7
55018,4
55019,1
55020,8
55021,0
55022,2
55023,4
55024,1
55025,5
55026,4
55027,0
55028,1
55029,3
55030,4
55031,0
55032,4
55033,3
55034,0
55035,5
55036,0
55037,0
55038,4
55039,6
55040,3
55041,9
55042,2
55043,0
55044,5
55045,7
55046,9
55047,5
55048,9
55049,7
55050,5
55051,9
55052,6
55053,3
55054,9
55055,0
55056,9
55057,4
55058,8
55059,4
55060,3
55061,1
55062,5
55063,9
55064,5
55065,0
55066,4
55067,9
55068,2
55069,1
55070,3
55071,1
55072,2
55073,8
55074,0
55075,6
55076,5
55077,0
55078,8
55079,1
55080,7
55081,3
55082,6
55083,9
55084,5
55085,6
55086,4
55087,9
55088,5
55089,6
55090,9
55091,0
55092,9
55093,0
55094,9
55095,8
55096,0
55097,7
55098,9
55099,4
55100,3
55101,5
55102,6
55103,9
55104,8
55105,7
55106,4
55107,9
55108,1
55109,9
55110,8
55111,9
55112,5
55113,4
55114,7
55115,0
55116,5
55117,7
55118,2
55119,5
55120,9
55121,6
55122,6
55123,7
55124,0
55125,1
55126,0
55127,1
55128,3
55129,4
55130,8
55131,6
55132,9
55133,2
55134,6
55135,1
55136,9
55137,9
55138,8
55139,6
55140,8
55141,3
55142,8
55143,9
55144,9
55145,4
55146,0
55147,3
55148,3
55149,6
55150,4
55151,8
55152,9
55153,7
55154,4
55155,5
55156,5
55157,6
55158,4
55159,6
55160,0
55161,3
55162,5
55163,5
55164,0
55165,2
55166,0
55167,2
55168,7
55169,2
55170,9
55171,2
55172,5
55173,8
55174,2
55175,6
55176,3
55177,3
55178,5
55179,5
55180,9
55181,1
55182,1
55183,2
55184,4
55185,3
55186,5
55187,4
55188,8
55189,0
55190,0
55191,5
55192,9
55193,2
55194,3
55195,4
55196,2
55197,3
55198,0
55199,6
55200,3
55201,1
55202,9
55203,5
55204,3
55205,8
55206,9
55207,8
55208,4
55209,7
55210,3
55211,7
55212,5
55213,7
55214,9
55215,0
55216,6
55217,1
55218,3
55219,2
55220,0
55221,7
55222,5
55223,0
55224,0
55225,0
55226,1
55227,4
55228,3
55229,5
55230,8
55231,4
55232,5
55233,9
55234,7
55235,1
55236,0
55237,3
55238,0
55239,4
55240,1
55241,4
55242,4
55243,1
55244,2
55245,1
55246,7
55247,9
55248,9
55249,8
55250,7
55251,5
55252,4
55253,0
55254,9
55255,0
55256,0
55257,8
55258,2
55259,0
55260,0
55261,9
55262,4
55263,8
55264,6
55265,2
55266,4
55267,6
55268,3
55269,5
55270,1
55271,5
55272,3
55273,3
55274,2
55275,2
55276,9
55277,8
55278,0
55279,0
55280,4
55281,3
55282,4
55283,2
55284,6
55285,9
55286,6
55287,2
55288,4
55289,4
55290,2
55291,9
55292,5
55293,0
55294,8
55295,0
55296,4
55297,5
55298,2
55299,7
55300,9
55301,7
55302,0
55303,5
55304,7
55305,7
55306,3
55307,9
55308,9
55309,7
55310,0
55311,9
55312,5
55313,3
55314,3
55315,9
55316,4
55317,4
55318,0
55319,7
55320,7
55321,9
55322,4
55323,1
55324,7
55325,8
55326,7
55327,0
55328,0
55329,4
55330,5
55331,2
55332,9
55333,7
55334,4
55335,0
55336,3
55337,5
55338,8
55339,0
55340,4
55341,6
55342,0
55343,3
55344,5
55345,4
55346,4
55347,1
55348,1
55349,3
55350,9
55351,7
55352,5
55353,1
55354,8
55355,8
55356,7
55357,0
55358,1
55359,6
55360,9
55361,3
55362,4
55363,7
55364,4
55365,8
55366,0
55367,8
55368,3
55369,4
55370,6
55371,7
55372,8
55373,2
55374,0
55375,1
55376,5
55377,3
55378,1
55379,4
55380,9
55381,3
55382,0
55383,8
55384,6
55385,3
55386,1
55387,6
55388,5
55389,4
55390,1
55391,9
55392,9
55393,4
55394,1
55395,0
55396,1
55397,9
55398,0
55399,3
55400,9
55401,0
55402,4
55403,7
55404,2
55405,0
55406,7
55407,7
55408,9
55409,1
55410,2
55411,6
55412,6
55413,5
55414,4
55415,4
55416,1
55417,5
55418,8
55419,2
55420,6
55421,6
55422,1
55423,6
55424,3
55425,6
55426,5
55427,8
55428,2
55429,6
55430,7
55431,1
55432,9
55433,5
55434,6
55435,0
55436,6
55437,0
55438,7
55439,1
55440,9
55441,3
55442,2
55443,6
55444,7
55445,7
55446,3
55447,5
55448,9
55449,1
55450,5
55451,6
55452,0
55453,2
55454,0
55455,9
55456,1
55457,8
55458,3
55459,3
55460,0
55461,0
55462,0
55463,3
55464,7
55465,7
55466,8
55467,5
55468,3
55469,3
55470,1
55471,6
55472,1
55473,5
55474,1
55475,0
55476,6
55477,4
55478,3
55479,2
55480,1
55481,2
55482,5
55483,1
55484,9
55485,8
55486,7
55487,4
55488,9
55489,7
55490,3
55491,0
55492,0
55493,0
55494,9
55495,4
55496,6
55497,3
55498,1
55499,6
55500,8
55501,6
55502,6
55503,8
55504,2
55505,4
55506,4
55507,6
55508,7
55509,7
55510,4
55511,6
55512,9
55513,6
55514,0
55515,0
55516,0
55517,1
55518,5
55519,6
55520,4
55521,9
55522,3
55523,6
55524,0
55525,0
55526,8
55527,7
55528,5
55529,8
55530,3
55531,8
55532,3
55533,2
55534,5
55535,3
55536,0
55537,5
55538,7
55539,4
55540,5
55541,7
55542,9
55543,0
55544,0
55545,6
55546,7
55547,7
55548,0
55549,3
55550,5
55551,3
55552,5
55553,5
55554,9
55555,4
55556,9
55557,4
55558,2
55559,2
55560,5
55561,6
55562,7
55563,1
55564,6
55565,3
55566,1
55567,6
55568,7
55569,0
55570,5
55571,0
55572,9
55573,3
55574,7
55575,5
55576,5
55577,4
55578,3
55579,9
55580,5
55581,5
55582,5
55583,0
55584,0
55585,0
55586,8
55587,0
55588,3
55589,2
55590,4
55591,5
55592,3
55593,7
55594,9
55595,6
55596,9
55597,8
55598,1
55599,2
55600,6
55601,7
55602,4
55603,4
55604,1
55605,3
55606,7
55607,9
55608,9
55609,0
55610,8
55611,2
55612,8
55613,5
55614,8
55615,5
55616,6
55617,5
55618,0
55619,8
55620,2
55621,9
55622,1
55623,8
55624,1
55625,5
55626,0
55627,9
55628,1
55629,3
55630,4
55631,6
55632,3
55633,4
55634,4
55635,7
55636,4
55637,7
55638,4
55639,2
55640,3
55641,4
55642,4
55643,5
55644,7
55645,8
55646,4
55647,3
55648,4
55649,0
55650,5
55651,4
55652,0
55653,5
55654,2
55655,3
55656,4
55657,2
55658,4
55659,2
55660,9
55661,4
55662,8
55663,8
55664,6
55665,0
55666,5
55667,1
55668,7
55669,0
55670,4
55671,3
55672,8
55673,5
55674,9
55675,2
55676,3
55677,5
55678,1
55679,4
55680,2
55681,3
55682,3
55683,6
55684,7
55685,1
55686,6
55687,2
55688,8
55689,3
55690,7
55691,2
55692,5
55693,7
55694,7
55695,7
55696,7
55697,1
55698,7
55699,4
55700,3
55701,3
55702,4
55703,0
55704,4
55705,2
55706,7
55707,0
55708,5
55709,3
55710,5
55711,6
55712,2
55713,5
55714,2
55715,6
55716,0
55717,0
55718,0
55719,5
55720,9
55721,0
55722,0
55723,1
55724,5
55725,3
55726,1
55727,6
55728,7
55729,8
55730,9
55731,6
55732,3
55733,3
55734,6
55735,0
55736,9
55737,9
55738,2
55739,2
55740,2
55741,1
55742,4
55743,6
55744,2
55745,5
55746,7
55747,0
55748,8
55749,3
55750,8
55751,2
55752,9
55753,3
55754,3
55755,5
55756,4
55757,4
55758,8
55759,9
55760,2
55761,6
55762,0
55763,9
55764,7
55765,9
55766,8
55767,7
55768,7
55769,3
55770,8
55771,2
55772,9
55773,3
55774,5
55775,7
55776,5
55777,8
55778,7
55779,3
55780,7
55781,0
55782,7
55783,0
55784,6
55785,2
55786,4
55787,1
55788,0
55789,2
55790,9
55791,8
55792,4
55793,8
55794,9
55795,4
55796,5
55797,6
55798,0
55799,1
55800,2
55801,1
55802,6
55803,1
55804,0
55805,1
55806,0
55807,6
55808,5
55809,3
55810,5
55811,7
55812,3
55813,4
55814,8
55815,3
55816,5
55817,4
55818,7
55819,2
55820,2
55821,3
55822,9
55823,5
55824,7
55825,6
55826,7
55827,0
55828,5
55829,4
55830,6
55831,3
55832,9
55833,3
55834,5
55835,4
55836,8
55837,3
55838,1
55839,2
55840,2
55841,6
55842,2
55843,6
55844,0
55845,5
55846,5
55847,8
55848,3
55849,3
55850,2
55851,1
55852,2
55853,5
55854,0
55855,2
55856,5
55857,0
55858,7
55859,2
55860,0
55861,1
55862,3
55863,4
55864,9
55865,6
55866,4
55867,5
55868,9
55869,7
55870,3
55871,4
55872,4
55873,4
55874,3
55875,1
55876,3
55877,9
55878,2
55879,8
55880,0
55881,5
55882,1
55883,6
55884,4
55885,4
55886,3
55887,1
55888,5
55889,2
55890,3
55891,0
55892,8
55893,9
55894,7
55895,6
55896,8
55897,4
55898,8
55899,1
55900,3
55901,2
55902,9
55903,0
55904,7
55905,1
55906,4
55907,5
55908,7
55909,1
55910,3
55911,6
55912,4
55913,7
55914,1
55915,3
55916,9
55917,4
55918,1
55919,4
55920,8
55921,7
55922,7
55923,0
55924,2
55925,2
55926,4
55927,6
55928,7
55929,7
55930,4
55931,4
55932,2
55933,4
55934,7
55935,6
55936,6
55937,1
55938,9
55939,9
55940,3
55941,9
55942,4
55943,3
55944,2
55945,9
55946,8
55947,5
55948,0
55949,6
55950,9
55951,0
55952,9
55953,7
55954,8
55955,2
55956,7
55957,4
55958,9
55959,0
55960,6
55961,6
55962,6
55963,9
55964,9
55965,7
55966,9
55967,9
55968,0
55969,5
55970,1
55971,1
55972,0
55973,6
55974,9
55975,9
55976,5
55977,6
55978,5
55979,5
55980,9
55981,7
55982,9
55983,4
55984,5
55985,4
55986,5
55987,3
55988,9
55989,8
55990,8
55991,3
55992,7
55993,8
55994,7
55995,0
55996,4
55997,0
55998,7
55999,4
56000,8
56001,0
56002,2
56003,0
56004,7
56005,4
56006,2
56007,6
56008,2
56009,5
56010,5
56011,7
56012,2
56013,7
56014,7
56015,0
56016,4
56017,9
56018,5
56019,6
56020,6
56021,3
56022,0
56023,3
56024,2
56025,4
56026,0
56027,3
56028,0
56029,0
56030,8
56031,5
56032,4
56033,2
56034,9
56035,3
56036,0
56037,5
56038,4
56039,8
56040,7
56041,3
56042,6
56043,5
56044,4
56045,8
56046,5
56047,0
56048,1
56049,8
56050,3
56051,4
56052,8
56053,4
56054,4
56055,0
56056,4
56057,0
56058,1
56059,9
56060,0
56061,0
56062,4
56063,4
56064,5
56065,6
56066,2
56067,8
56068,2
56069,0
56070,8
56071,4
56072,5
56073,2
56074,7
56075,6
56076,7
56077,0
56078,2
56079,3
56080,1
56081,2
56082,0
56083,2
56084,1
56085,2
56086,1
56087,4
56088,6
56089,7
56090,1
56091,0
56092,5
56093,2
56094,5
56095,9
56096,2
56097,5
56098,6
56099,7
56100,1
56101,9
56102,9
56103,6
56104,1
56105,0
56106,2
56107,9
56108,4
56109,2
56110,9
56111,0
56112,8
56113,2
56114,9
56115,8
56116,5
56117,1
56118,0
56119,1
56120,5
56121,5
56122,3
56123,6
56124,8
56125,8
56126,3
56127,2
56128,0
56129,4
56130,1
56131,3
56132,7
56133,0
56134,2
56135,3
56136,3
56137,2
56138,4
56139,9
56140,9
56141,8
56142,5
56143,9
56144,7
56145,3
56146,9
56147,9
56148,4
56149,7
56150,1
56151,3
56152,6
56153,7
56154,7
56155,8
56156,9
56157,0
56158,0
56159,1
56160,2
56161,4
56162,4
56163,3
56164,4
56165,4
56166,1
56167,9
56168,3
56169,5
56170,6
56171,4
56172,1
56173,1
56174,3
56175,3
56176,9
56177,2
56178,4
56179,0
56180,0
56181,8
56182,1
56183,5
56184,1
56185,2
56186,9
56187,0
56188,9
56189,2
56190,4
56191,0
56192,6
56193,9
56194,1
56195,1
56196,9
56197,4
56198,9
56199,5
56200,3
56201,3
56202,3
56203,3
56204,7
56205,1
56206,3
56207,9
56208,8
56209,7
56210,4
56211,8
56212,9
56213,2
56214,5
56215,2
56216,5
56217,8
56218,1
56219,7
56220,2
56221,0
56222,0
56223,7
56224,7
56225,3
56226,5
56227,7
56228,7
56229,6
56230,2
56231,0
56232,2
56233,7
56234,5
56235,3
56236,1
56237,6
56238,8
56239,6
56240,2
56241,0
56242,0
56243,4
56244,8
56245,6
56246,4
56247,0
56248,2
56249,5
56250,4
56251,0
56252,2
56253,4
56254,4
56255,6
56256,9
56257,2
56258,0
56259,5
56260,2
56261,0
56262,8
56263,2
56264,6
56265,4
56266,7
56267,9
56268,5
56269,7
56270,2
56271,6
56272,5
56273,1
56274,9
56275,9
56276,7
56277,2
56278,5
56279,1
56280,3
56281,1
56282,4
56283,3
56284,7
56285,8
56286,8
56287,5
56288,6
56289,9
56290,9
56291,9
56292,2
56293,3
56294,0
56295,8
56296,8
56297,5
56298,5
56299,4
56300,0
56301,1
56302,0
56303,7
56304,0
56305,3
56306,0
56307,4
56308,4
56309,6
56310,5
56311,3
56312,2
56313,9
56314,6
56315,6
56316,7
56317,0
56318,7
56319,7
56320,0
56321,8
56322,7
56323,2
56324,7
56325,7
56326,4
56327,4
56328,0
56329,3
56330,6
56331,0
56332,5
56333,3
56334,0
56335,2
56336,4
56337,9
56338,7
56339,3
56340,3
56341,2
56342,8
56343,8
56344,5
56345,3
56346,8
56347,0
56348,8
56349,2
56350,0
56351,0
56352,2
56353,9
56354,9
56355,0
56356,7
56357,7
56358,7
56359,3
56360,2
56361,0
56362,4
56363,0
56364,3
56365,7
56366,0
56367,4
56368,7
56369,9
56370,3
56371,0
56372,1
56373,6
56374,9
56375,3
56376,8
56377,9
56378,3
56379,8
56380,3
56381,9
56382,5
56383,2
56384,7
56385,5
56386,4
56387,4
56388,7
56389,5
56390,7
56391,9
56392,6
56393,2
56394,0
56395,8
56396,4
56397,5
56398,5
56399,9
56400,0
56401,4
56402,8
56403,4
56404,7
56405,1
56406,3
56407,2
56408,0
56409,9
56410,1
56411,8
56412,9
56413,2
56414,8
56415,1
56416,7
56417,1
56418,0
56419,8
56420,7
56421,6
56422,3
56423,4
56424,0
56425,2
56426,1
56427,2
56428,6
56429,9
56430,1
56431,1
56432,0
56433,8
56434,8
56435,9
56436,8
56437,0
56438,4
56439,6
56440,3
56441,3
56442,0
56443,6
56444,3
56445,1
56446,2
56447,7
56448,7
56449,8
56450,0
56451,1
56452,4
56453,8
56454,4
56455,6
56456,2
56457,2
56458,2
56459,6
56460,3
56461,3
56462,0
56463,8
56464,1
56465,3
56466,7
56467,3
56468,8
56469,1
56470,1
56471,6
56472,1
56473,9
56474,8
56475,3
56476,0
56477,4
56478,7
56479,4
56480,0
56481,2
56482,7
56483,6
56484,8
56485,9
56486,8
56487,6
56488,4
56489,8
56490,9
56491,2
56492,1
56493,0
56494,0
56495,7
56496,7
56497,2
56498,7
56499,7
56500,7
56501,2
56502,6
56503,6
56504,4
56505,4
56506,5
56507,4
56508,0
56509,9
56510,3
56511,7
56512,2
56513,5
56514,4
56515,2
56516,2
56517,7
56518,6
56519,2
56520,6
56521,4
56522,9
56523,6
56524,8
56525,3
56526,8
56527,5
56528,5
56529,2
56530,3
56531,4
56532,7
56533,3
56534,7
56535,2
56536,9
56537,5
56538,3
56539,7
56540,8
56541,8
56542,9
56543,3
56544,0
56545,0
56546,2
56547,6
56548,0
56549,8
56550,1
56551,4
56552,1
56553,3
56554,5
56555,1
56556,8
56557,9
56558,5
56559,4
56560,6
56561,9
56562,5
56563,6
56564,3
56565,9
56566,1
56567,4
56568,2
56569,8
56570,9
56571,5
56572,4
56573,7
56574,0
56575,3
56576,7
56577,3
56578,6
56579,9
56580,9
56581,9
56582,4
56583,0
56584,5
56585,1
56586,6
56587,3
56588,0
56589,2
56590,7
56591,4
56592,5
56593,2
56594,0
56595,2
56596,3
56597,1
56598,4
56599,6
56600,7
56601,0
56602,8
56603,9
56604,2
56605,3
56606,3
56607,9
56608,5
56609,5
56610,8
56611,8
56612,3
56613,8
56614,5
56615,7
56616,4
56617,4
56618,0
56619,0
56620,7
56621,0
56622,4
56623,0
56624,4
56625,4
56626,2
56627,3
56628,4
56629,0
56630,7
56631,7
56632,7
56633,0
56634,4
56635,3
56636,2
56637,0
56638,1
56639,1
56640,3
56641,0
56642,9
56643,1
56644,0
56645,2
56646,4
56647,3
56648,0
56649,9
56650,0
56651,6
56652,2
56653,0
56654,4
56655,1
56656,5
56657,7
56658,6
56659,1
56660,0
56661,4
56662,4
56663,0
56664,4
56665,4
56666,2
56667,7
56668,6
56669,4
56670,3
56671,5
56672,9
56673,2
56674,5
56675,2
56676,0
56677,5
56678,7
56679,4
56680,3
56681,8
56682,4
56683,5
56684,8
56685,1
56686,9
56687,3
56688,0
56689,8
56690,2
56691,8
56692,6
56693,6
56694,7
56695,4
56696,0
56697,3
56698,7
56699,2
56700,6
56701,1
56702,8
56703,4
56704,9
56705,4
56706,3
56707,2
56708,2
56709,3
56710,2
56711,5
56712,0
56713,2
56714,1
56715,0
56716,8
56717,0
56718,8
56719,5
56720,2
56721,7
56722,3
56723,7
56724,9
56725,8
56726,5
56727,6
56728,1
56729,3
56730,3
56731,6
56732,4
56733,5
56734,8
56735,9
56736,4
56737,4
56738,0
56739,0
56740,2
56741,0
56742,1
56743,8
56744,3
56745,4
56746,5
56747,8
56748,2
56749,9
56750,3
56751,8
56752,9
56753,3
56754,8
56755,9
56756,5
56757,4
56758,8
56759,9
56760,5
56761,7
56762,7
56763,4
56764,3
56765,8
56766,8
56767,1
56768,2
56769,3
56770,1
56771,3
56772,9
56773,2
56774,5
56775,0
56776,8
56777,4
56778,2
56779,1
56780,7
56781,6
56782,5
56783,6
56784,9
56785,6
56786,3
56787,5
56788,1
56789,1
56790,5
56791,7
56792,3
56793,3
56794,8
56795,9
56796,6
56797,0
56798,8
56799,0
56800,3
56801,6
56802,4
56803,6
56804,3
56805,1
56806,1
56807,7
56808,8
56809,6
56810,8
56811,9
56812,0
56813,6
56814,1
56815,0
56816,1
56817,1
56818,7
56819,2
56820,1
56821,3
56822,2
56823,5
56824,0
56825,3
56826,6
56827,3
56828,6
56829,8
56830,1
56831,8
56832,1
56833,3
56834,1
56835,5
56836,7
56837,5
56838,1
56839,2
56840,9
56841,9
56842,0
56843,1
56844,7
56845,2
56846,9
56847,8
56848,0
56849,4
56850,6
56851,0
56852,3
56853,3
56854,0
56855,4
56856,3
56857,3
56858,1
56859,1
56860,0
56861,8
56862,5
56863,6
56864,0
56865,3
56866,4
56867,6
56868,9
56869,4
56870,7
56871,9
56872,0
56873,3
56874,3
56875,5
56876,3
56877,8
56878,5
56879,1
56880,2
56881,0
56882,9
56883,4
56884,0
56885,1
56886,1
56887,3
56888,4
56889,5
56890,5
56891,9
56892,6
56893,3
56894,2
56895,2
56896,6
56897,8
56898,3
56899,3
56900,3
56901,9
56902,4
56903,9
56904,2
56905,2
56906,9
56907,5
56908,6
56909,2
56910,7
56911,6
56912,7
56913,3
56914,8
56915,1
56916,4
56917,6
56918,4
56919,2
56920,4
56921,6
56922,5
56923,0
56924,5
56925,2
56926,3
56927,5
56928,2
56929,5
56930,0
56931,3
56932,9
56933,0
56934,6
56935,7
56936,9
56937,8
56938,4
56939,2
56940,1
56941,4
56942,2
56943,4
56944,5
56945,5
56946,6
56947,8
56948,4
56949,0
56950,8
56951,9
56952,8
56953,0
56954,7
56955,7
56956,6
56957,6
56958,0
56959,7
56960,9
56961,8
56962,5
56963,9
56964,5
56965,5
56966,0
56967,4
56968,8
56969,3
56970,0
56971,9
56972,9
56973,5
56974,9
56975,1
56976,0
56977,7
56978,4
56979,4
56980,0
56981,2
56982,9
56983,9
56984,1
56985,8
56986,3
56987,8
56988,4
56989,7
56990,3
56991,1
56992,4
56993,3
56994,4
56995,1
56996,0
56997,3
56998,8
56999,8
57000,0
57001,1
57002,4
57003,7
57004,0
57005,1
57006,6
57007,9
57008,1
57009,3
57010,0
57011,7
57012,7
57013,1
57014,3
57015,3
57016,3
57017,0
57018,0
57019,2
57020,7
57021,9
57022,2
57023,2
57024,9
57025,6
57026,3
57027,5
57028,9
57029,4
57030,8
57031,0
57032,4
57033,0
57034,0
57035,9
57036,3
57037,4
57038,0
57039,4
57040,0
57041,0
57042,8
57043,6
57044,8
57045,3
57046,9
57047,8
57048,2
57049,2
57050,8
57051,3
57052,1
57053,1
57054,0
57055,0
57056,2
57057,6
57058,9
57059,4
57060,8
57061,4
57062,4
57063,1
57064,5
57065,2
57066,6
57067,9
57068,0
57069,0
57070,7
57071,1
57072,8
57073,9
57074,3
57075,9
57076,9
57077,0
57078,7
57079,7
57080,4
57081,4
57082,2
57083,4
57084,4
57085,5
57086,7
57087,5
57088,8
57089,7
57090,5
57091,6
57092,2
57093,2
57094,4
57095,4
57096,0
57097,3
57098,1
57099,5
57100,9
57101,6
57102,0
57103,0
57104,5
57105,3
57106,8
57107,4
57108,2
57109,4
57110,3
57111,5
57112,0
57113,9
57114,1
57115,0
57116,0
57117,0
57118,5
57119,9
57120,7
57121,9
57122,9
57123,6
57124,4
57125,5
57126,3
57127,9
57128,5
57129,1
57130,6
57131,6
57132,4
57133,1
57134,4
57135,4
57136,1
57137,5
57138,8
57139,0
57140,3
57141,5
57142,8
57143,2
57144,8
57145,5
57146,0
57147,7
57148,0
57149,5
57150,5
57151,1
57152,5
57153,7
57154,0
57155,9
57156,1
57157,5
57158,7
57159,6
57160,5
57161,7
57162,7
57163,6
57164,0
57165,0
57166,9
57167,7
57168,3
57169,0
57170,9
57171,4
57172,4
57173,6
57174,3
57175,7
57176,8
57177,0
57178,0
57179,9
57180,3
57181,2
57182,0
57183,5
57184,5
57185,8
57186,7
57187,7
57188,4
57189,0
57190,2
57191,7
57192,7
57193,8
57194,8
57195,2
57196,0
57197,3
57198,9
57199,1
57200,4
57201,8
57202,3
57203,4
57204,4
57205,6
57206,2
57207,3
57208,1
57209,0
57210,3
57211,9
57212,3
57213,2
57214,5
57215,1
57216,2
57217,0
57218,0
57219,7
57220,9
57221,3
57222,8
57223,4
57224,7
57225,1
57226,7
57227,7
57228,0
57229,3
57230,2
57231,8
57232,9
57233,5
57234,9
57235,6
57236,1
57237,7
57238,4
57239,4
57240,0
57241,3
57242,5
57243,1
57244,5
57245,4
57246,0
57247,8
57248,4
57249,9
57250,8
57251,7
57252,8
57253,4
57254,2
57255,3
57256,4
57257,0
57258,5
57259,4
57260,1
57261,8
57262,0
57263,5
57264,4
57265,5
57266,4
57267,4
57268,3
57269,7
57270,9
57271,7
57272,1
57273,4
57274,9
57275,9
57276,1
57277,4
57278,5
57279,5
57280,9
57281,7
57282,9
57283,4
57284,9
57285,9
57286,2
57287,3
57288,7
57289,0
57290,6
57291,3
57292,3
57293,7
57294,5
57295,5
57296,8
57297,9
57298,4
57299,6
57300,3
57301,6
57302,6
57303,8
57304,5
57305,6
57306,4
57307,8
57308,4
57309,1
57310,5
57311,8
57312,2
57313,3
57314,3
57315,0
57316,1
57317,6
57318,4
57319,2
57320,0
57321,2
57322,4
57323,4
57324,9
57325,4
57326,4
57327,4
57328,4
57329,1
57330,5
57331,5
57332,7
57333,6
57334,3
57335,4
57336,5
57337,6
57338,5
57339,6
57340,2
57341,4
57342,7
57343,5
57344,3
57345,6
57346,5
57347,0
57348,2
57349,3
57350,9
57351,1
57352,3
57353,8
57354,0
57355,7
57356,0
57357,6
57358,8
57359,1
57360,2
57361,8
57362,9
57363,1
57364,5
57365,4
57366,2
57367,5
57368,5
57369,5
57370,5
57371,6
57372,5
57373,0
57374,3
57375,0
57376,1
57377,5
57378,3
57379,7
57380,7
57381,4
57382,0
57383,4
57384,5
57385,9
57386,5
57387,1
57388,7
57389,6
57390,6
57391,4
57392,8
57393,4
57394,1
57395,5
57396,8
57397,5
57398,3
57399,3
57400,3
57401,3
57402,0
57403,2
57404,8
57405,7
57406,2
57407,9
57408,3
57409,8
57410,4
57411,5
57412,9
57413,1
57414,0
57415,5
57416,9
57417,3
57418,8
57419,0
57420,4
57421,5
57422,4
57423,6
57424,9
57425,2
57426,7
57427,2
57428,0
57429,3
57430,3
57431,9
57432,7
57433,5
57434,0
57435,7
57436,0
57437,3
57438,5
57439,3
57440,3
57441,8
57442,7
57443,5
57444,9
57445,6
57446,7
57447,8
57448,9
57449,0
57450,1
57451,9
57452,4
57453,7
57454,0
57455,9
57456,4
57457,2
57458,5
57459,8
57460,5
57461,9
57462,1
57463,2
57464,8
57465,0
57466,6
57467,6
57468,8
57469,4
57470,9
57471,6
57472,1
57473,1
57474,5
57475,3
57476,5
57477,0
57478,7
57479,6
57480,1
57481,4
57482,4
57483,1
57484,1
57485,8
57486,9
57487,1
57488,0
57489,9
57490,4
57491,9
57492,9
57493,3
57494,2
57495,7
57496,4
57497,0
57498,6
57499,9
57500,6
57501,9
57502,8
57503,8
57504,6
57505,7
57506,4
57507,7
57508,2
57509,9
57510,8
57511,0
57512,9
57513,9
57514,7
57515,8
57516,1
57517,3
57518,4
57519,2
57520,4
57521,2
57522,9
57523,0
57524,7
57525,8
57526,9
57527,3
57528,5
57529,3
57530,8
57531,4
57532,1
57533,0
57534,6
57535,1
57536,9
57537,4
57538,5
57539,4
57540,5
57541,0
57542,8
57543,9
57544,0
57545,3
57546,7
57547,9
57548,6
57549,5
57550,4
57551,4
57552,4
57553,9
57554,5
57555,1
57556,0
57557,5
57558,2
57559,1
57560,0
57561,2
57562,0
57563,9
57564,8
57565,1
57566,9
57567,4
57568,7
57569,3
57570,1
57571,3
57572,1
57573,9
57574,3
57575,8
57576,8
57577,1
57578,9
57579,3
57580,8
57581,9
57582,5
57583,1
57584,1
57585,6
57586,9
57587,7
57588,2
57589,6
57590,4
57591,6
57592,9
57593,6
57594,0
57595,1
57596,5
57597,9
57598,5
57599,8
57600,9
57601,8
57602,2
57603,9
57604,1
57605,6
57606,6
57607,8
57608,5
57609,0
57610,7
57611,5
57612,7
57613,9
57614,4
57615,5
57616,0
57617,0
57618,3
57619,3
57620,1
57621,8
57622,9
57623,1
57624,4
57625,7
57626,1
57627,3
57628,3
57629,6
57630,9
57631,1
57632,7
57633,7
57634,1
57635,9
57636,5
57637,8
57638,8
57639,9
57640,9
57641,2
57642,9
57643,8
57644,7
57645,0
57646,2
57647,6
57648,0
57649,2
57650,2
57651,4
57652,0
57653,8
57654,4
57655,8
57656,1
57657,5
57658,7
57659,2
57660,7
57661,9
57662,5
57663,2
57664,2
57665,9
57666,4
57667,4
57668,2
57669,4
57670,2
57671,5
57672,6
57673,5
57674,1
57675,8
57676,2
57677,9
57678,8
57679,6
57680,7
57681,0
57682,8
57683,0
57684,0
57685,9
57686,0
57687,7
57688,8
57689,8
57690,6
57691,6
57692,0
57693,7
57694,9
57695,8
57696,0
57697,5
57698,0
57699,9
57700,6
57701,0
57702,2
57703,7
57704,1
57705,7
57706,8
57707,8
57708,4
57709,3
57710,9
57711,4
57712,5
57713,5
57714,3
57715,1
57716,5
57717,3
57718,0
57719,7
57720,2
57721,2
57722,2
57723,2
57724,8
57725,4
57726,4
57727,6
57728,1
57729,9
57730,5
57731,1
57732,7
57733,0
57734,3
57735,3
57736,3
57737,0
57738,2
57739,9
57740,4
57741,3
57742,0
57743,3
57744,3
57745,7
57746,2
57747,3
57748,0
57749,1
57750,4
57751,7
57752,9
57753,9
57754,0
57755,7
57756,3
57757,2
57758,7
57759,1
57760,8
57761,6
57762,7
57763,3
57764,6
57765,8
57766,6
57767,9
57768,8
57769,4
57770,9
57771,0
57772,3
57773,4
57774,0
57775,2
57776,5
57777,6
57778,6
57779,7
57780,9
57781,5
57782,8
57783,5
57784,4
57785,2
57786,9
57787,5
57788,6
57789,4
57790,8
57791,2
57792,1
57793,8
57794,4
57795,4
57796,8
57797,4
57798,7
57799,9
57800,0
57801,4
57802,2
57803,0
57804,7
57805,9
57806,9
57807,3
57808,8
57809,4
57810,6
57811,0
57812,2
57813,8
57814,7
57815,8
57816,4
57817,5
57818,9
57819,1
57820,3
57821,0
57822,4
57823,7
57824,9
57825,3
57826,1
57827,5
57828,5
57829,0
57830,9
57831,4
57832,8
57833,8
57834,5
57835,0
57836,0
57837,7
57838,0
57839,3
57840,1
57841,4
57842,4
57843,9
57844,9
57845,2
57846,6
57847,4
57848,4
57849,0
57850,0
57851,0
57852,7
57853,2
57854,3
57855,5
57856,6
57857,4
57858,2
57859,7
57860,8
57861,9
57862,1
57863,0
57864,1
57865,3
57866,6
57867,0
57868,8
57869,0
57870,6
57871,0
57872,9
57873,1
57874,6
57875,2
57876,1
57877,0
57878,9
57879,3
57880,0
57881,4
57882,7
57883,9
57884,9
57885,3
57886,7
57887,5
57888,7
57889,1
57890,6
57891,6
57892,9
57893,8
57894,1
57895,4
57896,4
57897,2
57898,1
57899,7
57900,0
57901,9
57902,2
57903,1
57904,1
57905,5
57906,7
57907,3
57908,9
57909,8
57910,5
57911,2
57912,0
57913,8
57914,7
57915,3
57916,2
57917,6
57918,2
57919,6
57920,9
57921,4
57922,8
57923,9
57924,3
57925,0
57926,5
57927,7
57928,2
57929,0
57930,0
57931,9
57932,9
57933,3
57934,8
57935,7
57936,1
57937,1
57938,2
57939,2
57940,6
57941,2
57942,9
57943,1
57944,2
57945,6
57946,1
57947,6
57948,1
57949,8
57950,9
57951,2
57952,3
57953,1
57954,9
57955,9
57956,5
57957,4
57958,3
57959,2
57960,0
57961,5
57962,7
57963,7
57964,1
57965,7
57966,7
57967,7
57968,8
57969,3
57970,3
57971,5
57972,5
57973,1
57974,6
57975,3
57976,4
57977,8
57978,4
57979,7
57980,3
57981,5
57982,9
57983,8
57984,8
57985,3
57986,1
57987,0
57988,6
57989,3
57990,0
57991,9
57992,6
57993,2
57994,0
57995,8
57996,7
57997,1
57998,2
57999,6
58000,9
58001,1
58002,6
58003,3
58004,7
58005,1
58006,0
58007,0
58008,0
58009,3
58010,2
58011,4
58012,3
58013,8
58014,2
58015,0
58016,3
58017,0
58018,8
58019,3
58020,7
58021,1
58022,2
58023,3
58024,0
58025,5
58026,0
58027,7
58028,1
58029,7
58030,2
58031,0
58032,1
58033,3
58034,9
58035,4
58036,6
58037,1
58038,6
58039,1
58040,2
58041,0
58042,7
58043,0
58044,9
58045,5
58046,0
58047,4
58048,0
58049,9
58050,7
58051,9
58052,7
58053,1
58054,9
58055,2
58056,1
58057,9
58058,4
58059,3
58060,6
58061,0
58062,6
58063,0
58064,0
58065,9
58066,0
58067,8
58068,9
58069,4
58070,5
58071,3
58072,3
58073,0
58074,7
58075,8
58076,7
58077,8
58078,3
58079,3
58080,4
58081,6
58082,3
58083,9
58084,5
58085,2
58086,4
58087,3
58088,7
58089,9
58090,6
58091,7
58092,3
58093,7
58094,1
58095,0
58096,3
58097,1
58098,9
58099,3
58100,6
58101,8
58102,4
58103,7
58104,7
58105,0
58106,8
58107,1
58108,5
58109,2
58110,6
58111,3
58112,3
58113,4
58114,3
58115,3
58116,9
58117,8
58118,4
58119,6
58120,9
58121,0
58122,3
58123,1
58124,7
58125,1
58126,4
58127,9
58128,2
58129,4
58130,3
58131,3
58132,8
58133,8
58134,6
58135,7
58136,3
58137,0
58138,9
58139,9
58140,5
58141,3
58142,7
58143,9
58144,9
58145,0
58146,8
58147,5
58148,9
58149,9
58150,6
58151,8
58152,8
58153,4
58154,8
58155,1
58156,0
58157,1
58158,8
58159,8
58160,6
58161,3
58162,9
58163,0
58164,6
58165,1
58166,3
58167,6
58168,6
58169,3
58170,5
58171,6
58172,5
58173,3
58174,7
58175,3
58176,6
58177,8
58178,9
58179,4
58180,4
58181,3
58182,8
58183,5
58184,6
58185,0
58186,8
58187,2
58188,7
58189,0
58190,4
58191,6
58192,5
58193,3
58194,1
58195,8
58196,0
58197,8
58198,4
58199,1
58200,4
58201,3
58202,7
58203,3
58204,3
58205,2
58206,7
58207,7
58208,8
58209,4
58210,0
58211,5
58212,6
58213,6
58214,1
58215,1
58216,3
58217,9
58218,9
58219,3
58220,7
58221,7
58222,9
58223,8
58224,3
58225,0
58226,8
58227,0
58228,8
58229,1
58230,0
58231,3
58232,2
58233,5
58234,8
58235,7
58236,8
58237,7
58238,1
58239,8
58240,7
58241,3
58242,5
58243,4
58244,4
58245,3
58246,8
58247,6
58248,9
58249,1
58250,6
58251,3
58252,2
58253,2
58254,8
58255,9
58256,8
58257,5
58258,0
58259,8
58260,1
58261,0
58262,4
58263,3
58264,2
58265,0
58266,5
58267,0
58268,5
58269,0
58270,6
58271,3
58272,9
58273,6
58274,6
58275,5
58276,0
58277,7
58278,8
58279,3
58280,3
58281,5
58282,1
58283,0
58284,2
58285,9
58286,4
58287,8
58288,5
58289,5
58290,0
58291,7
58292,9
58293,5
58294,8
58295,0
58296,3
58297,1
58298,5
58299,3
58300,7
58301,5
58302,3
58303,8
58304,9
58305,4
58306,6
58307,4
58308,5
58309,4
58310,5
58311,8
58312,9
58313,6
58314,3
58315,6
58316,5
58317,5
58318,2
58319,7
58320,7
58321,4
58322,4
58323,9
58324,7
58325,0
58326,5
58327,7
58328,7
58329,8
58330,5
58331,6
58332,9
58333,3
58334,4
58335,3
58336,3
58337,3
58338,3
58339,8
58340,5
58341,4
58342,0
58343,3
58344,2
58345,9
58346,3
58347,1
58348,6
58349,4
58350,9
58351,0
58352,6
58353,7
58354,4
58355,9
58356,1
58357,6
58358,0
58359,6
58360,7
58361,8
58362,7
58363,5
58364,7
58365,6
58366,1
58367,6
58368,6
58369,4
58370,4
58371,2
58372,1
58373,8
58374,4
58375,4
58376,3
58377,8
58378,5
58379,8
58380,0
58381,4
58382,3
58383,2
58384,2
58385,9
58386,0
58387,0
58388,1
58389,1
58390,1
58391,1
58392,6
58393,8
58394,4
58395,1
58396,3
58397,0
58398,4
58399,2
58400,0
58401,3
58402,0
58403,6
58404,4
58405,4
58406,9
58407,8
58408,6
58409,8
58410,3
58411,8
58412,4
58413,9
58414,6
58415,0
58416,6
58417,1
58418,8
58419,2
58420,6
58421,2
58422,2
58423,6
58424,2
58425,2
58426,9
58427,4
58428,5
58429,4
58430,9
58431,8
58432,5
58433,6
58434,9
58435,3
58436,5
58437,7
58438,1
58439,8
58440,3
58441,8
58442,6
58443,7
58444,3
58445,1
58446,3
58447,0
58448,3
58449,1
58450,1
58451,0
58452,4
58453,9
58454,0
58455,1
58456,7
58457,3
58458,5
58459,9
58460,8
58461,7
58462,2
58463,1
58464,6
58465,9
58466,7
58467,3
58468,6
58469,0
58470,8
58471,9
58472,2
58473,0
58474,2
58475,9
58476,3
58477,5
58478,3
58479,4
58480,4
58481,3
58482,1
58483,0
58484,3
58485,0
58486,4
58487,3
58488,9
58489,9
58490,5
58491,7
58492,0
58493,2
58494,1
58495,1
58496,0
58497,4
58498,1
58499,9
58500,4
58501,8
58502,1
58503,1
58504,1
58505,5
58506,9
58507,8
58508,9
58509,6
58510,7
58511,2
58512,9
58513,9
58514,4
58515,8
58516,8
58517,1
58518,9
58519,7
58520,8
58521,8
58522,1
58523,6
58524,6
58525,3
58526,4
58527,1
58528,3
58529,1
58530,8
58531,8
58532,4
58533,2
58534,6
58535,7
58536,0
58537,0
58538,7
58539,6
58540,4
58541,8
58542,2
58543,0
58544,6
58545,6
58546,0
58547,6
58548,5
58549,9
58550,9
58551,8
58552,6
58553,4
58554,0
58555,5
58556,4
58557,3
58558,2
58559,1
58560,7
58561,8
58562,6
58563,0
58564,8
58565,7
58566,4
58567,8
58568,7
58569,6
58570,6
58571,7
58572,0
58573,4
58574,4
58575,9
58576,5
58577,6
58578,2
58579,1
58580,5
58581,4
58582,4
58583,8
58584,1
58585,9
58586,4
58587,7
58588,6
58589,5
58590,0
58591,6
58592,0
58593,1
58594,3
58595,1
58596,1
58597,5
58598,3
58599,5
58600,5
58601,2
58602,0
58603,1
58604,6
58605,6
58606,1
58607,8
58608,9
58609,6
58610,2
58611,7
58612,4
58613,3
58614,8
58615,9
58616,6
58617,4
58618,3
58619,5
58620,2
58621,1
58622,4
58623,1
58624,7
58625,5
58626,3
58627,7
58628,9
58629,4
58630,5
58631,2
58632,8
58633,3
58634,5
58635,6
58636,6
58637,4
58638,0
58639,7
58640,1
58641,7
58642,6
58643,0
58644,0
58645,1
58646,7
58647,4
58648,1
58649,2
58650,2
58651,4
58652,9
58653,8
58654,2
58655,8
58656,7
58657,3
58658,3
58659,4
58660,7
58661,2
58662,3
58663,1
58664,5
58665,3
58666,0
58667,4
58668,6
58669,4
58670,9
58671,3
58672,3
58673,9
58674,1
58675,7
58676,8
58677,3
58678,1
58679,8
58680,3
58681,2
58682,5
58683,7
58684,3
58685,7
58686,9
58687,6
58688,8
58689,6
58690,8
58691,2
58692,5
58693,9
58694,0
58695,4
58696,8
58697,5
58698,6
58699,5
58700,3
58701,8
58702,8
58703,4
58704,8
58705,6
58706,4
58707,2
58708,3
58709,1
58710,7
58711,2
58712,1
58713,3
58714,4
58715,5
58716,4
58717,8
58718,7
58719,2
58720,0
58721,6
58722,7
58723,7
58724,6
58725,8
58726,9
58727,0
58728,5
58729,5
58730,2
58731,9
58732,8
58733,7
58734,2
58735,3
58736,3
58737,7
58738,4
58739,3
58740,2
58741,0
58742,9
58743,8
58744,1
58745,5
58746,3
58747,2
58748,6
58749,3
58750,9
58751,3
58752,3
58753,7
58754,3
58755,6
58756,6
58757,0
58758,9
58759,7
58760,8
58761,0
58762,8
58763,9
58764,1
58765,3
58766,5
58767,7
58768,2
58769,0
58770,3
58771,6
58772,1
58773,2
58774,3
58775,3
58776,5
58777,0
58778,4
58779,7
58780,4
58781,6
58782,5
58783,6
58784,4
58785,8
58786,3
58787,4
58788,5
58789,5
58790,0
58791,6
58792,6
58793,7
58794,5
58795,0
58796,0
58797,9
58798,6
58799,1
58800,0
58801,4
58802,6
58803,4
58804,2
58805,9
58806,3
58807,6
58808,6
58809,2
58810,2
58811,7
58812,0
58813,1
58814,9
58815,2
58816,7
58817,4
58818,3
58819,0
58820,2
58821,7
58822,5
58823,4
58824,3
58825,0
58826,8
58827,2
58828,4
58829,0
58830,9
58831,6
58832,3
58833,6
58834,8
58835,7
58836,4
58837,1
58838,8
58839,1
58840,2
58841,2
58842,4
58843,8
58844,5
58845,2
58846,6
58847,4
58848,7
58849,9
58850,1
58851,0
58852,7
58853,2
58854,8
58855,2
58856,0
58857,0
58858,6
58859,4
58860,2
58861,4
58862,0
58863,5
58864,9
58865,7
58866,1
58867,8
58868,4
58869,3
58870,5
58871,9
58872,8
58873,5
58874,2
58875,8
58876,0
58877,9
58878,8
58879,9
58880,1
58881,6
58882,3
58883,8
58884,7
58885,3
58886,4
58887,4
58888,8
58889,4
58890,8
58891,9
58892,8
58893,6
58894,0
58895,0
58896,8
58897,2
58898,0
58899,4
58900,2
58901,7
58902,6
58903,0
58904,5
58905,8
58906,5
58907,1
58908,9
58909,0
58910,1
58911,4
58912,4
58913,8
58914,4
58915,9
58916,0
58917,0
58918,7
58919,7
58920,6
58921,8
58922,9
58923,2
58924,2
58925,0
58926,4
58927,9
58928,2
58929,9
58930,3
58931,9
58932,3
58933,6
58934,7
58935,0
58936,5
58937,7
58938,8
58939,8
58940,5
58941,0
58942,6
58943,3
58944,7
58945,1
58946,9
58947,4
58948,3
58949,7
58950,9
58951,8
58952,6
58953,9
58954,4
58955,1
58956,0
58957,7
58958,2
58959,1
58960,0
58961,0
58962,3
58963,6
58964,0
58965,4
58966,3
58967,2
58968,2
58969,8
58970,0
58971,6
58972,4
58973,3
58974,2
58975,8
58976,7
58977,9
58978,6
58979,5
58980,9
58981,4
58982,2
58983,5
58984,6
58985,0
58986,6
58987,2
58988,2
58989,4
58990,1
58991,0
58992,3
58993,9
58994,8
58995,9
58996,7
58997,5
58998,9
58999,3
59000,8
59001,1
59002,6
59003,4
59004,7
59005,5
59006,6
59007,2
59008,0
59009,2
59010,5
59011,6
59012,9
59013,7
59014,7
59015,8
59016,1
59017,0
59018,8
59019,9
59020,7
59021,0
59022,6
59023,8
59024,0
59025,5
59026,9
59027,5
59028,8
59029,7
59030,2
59031,0
59032,9
59033,2
59034,4
59035,7
59036,7
59037,9
59038,4
59039,5
59040,5
59041,3
59042,1
59043,0
59044,2
59045,0
59046,9
59047,4
59048,9
59049,6
59050,3
59051,8
59052,0
59053,5
59054,8
59055,6
59056,4
59057,8
59058,5
59059,3
59060,9
59061,7
59062,9
59063,7
59064,1
59065,0
59066,1
59067,9
59068,3
59069,9
59070,2
59071,3
59072,9
59073,6
59074,4
59075,0
59076,6
59077,2
59078,4
59079,1
59080,5
59081,7
59082,2
59083,8
59084,5
59085,9
59086,0
59087,5
59088,3
59089,3
59090,2
59091,7
59092,6
59093,3
59094,2
59095,5
59096,9
59097,0
59098,5
59099,9
59100,9
59101,8
59102,7
59103,7
59104,4
59105,8
59106,6
59107,3
59108,2
59109,3
59110,1
59111,0
59112,4
59113,1
59114,8
59115,8
59116,4
59117,9
59118,4
59119,4
59120,4
59121,3
59122,9
59123,2
59124,0
59125,1
59126,1
59127,8
59128,4
59129,4
59130,8
59131,3
59132,5
59133,9
59134,5
59135,7
59136,6
59137,6
59138,5
59139,4
59140,7
59141,3
59142,3
59143,1
59144,0
59145,9
59146,5
59147,3
59148,5
59149,0
59150,6
59151,0
59152,4
59153,0
59154,2
59155,5
59156,6
59157,3
59158,8
59159,9
59160,3
59161,6
59162,1
59163,4
59164,5
59165,4
59166,6
59167,7
59168,2
59169,8
59170,9
59171,2
59172,0
59173,4
59174,9
59175,8
59176,8
59177,9
59178,1
59179,1
59180,5
59181,0
59182,0
59183,8
59184,7
59185,1
59186,7
59187,4
59188,5
59189,4
59190,5
59191,3
59192,2
59193,0
59194,6
59195,6
59196,0
59197,1
59198,2
59199,9
59200,8
59201,3
59202,7
59203,8
59204,8
59205,4
59206,8
59207,9
59208,0
59209,1
59210,7
59211,1
59212,6
59213,2
59214,9
59215,5
59216,3
59217,9
59218,5
59219,2
59220,8
59221,7
59222,7
59223,9
59224,4
59225,2
59226,3
59227,9
59228,3
59229,1
59230,4
59231,7
59232,1
59233,0
59234,2
59235,0
59236,9
59237,4
59238,9
59239,8
59240,8
59241,6
59242,7
59243,3
59244,7
59245,1
59246,3
59247,9
59248,0
59249,9
59250,2
59251,6
59252,7
59253,4
59254,5
59255,3
59256,0
59257,5
59258,9
59259,7
59260,3
59261,5
59262,4
59263,6
59264,5
59265,1
59266,8
59267,2
59268,4
59269,3
59270,9
59271,0
59272,0
59273,2
59274,8
59275,8
59276,7
59277,3
59278,7
59279,8
59280,9
59281,4
59282,2
59283,9
59284,7
59285,8
59286,7
59287,9
59288,3
59289,3
59290,4
59291,8
59292,3
59293,7
59294,3
59295,3
59296,8
59297,2
59298,1
59299,9
59300,4
59301,3
59302,3
59303,1
59304,5
59305,4
59306,8
59307,7
59308,3
59309,5
59310,3
59311,5
59312,9
59313,7
59314,6
59315,7
59316,3
59317,4
59318,4
59319,3
59320,9
59321,4
59322,7
59323,1
59324,9
59325,6
59326,0
59327,2
59328,6
59329,7
59330,4
59331,9
59332,9
59333,0
59334,7
59335,4
59336,3
59337,3
59338,3
59339,1
59340,1
59341,2
59342,6
59343,8
59344,2
59345,9
59346,5
59347,8
59348,5
59349,0
59350,6
59351,9
59352,8
59353,4
59354,0
59355,6
59356,0
59357,9
59358,0
59359,0
59360,0
59361,0
59362,9
59363,3
59364,5
59365,6
59366,8
59367,9
59368,1
59369,2
59370,9
59371,8
59372,7
59373,1
59374,7
59375,4
59376,5
59377,4
59378,9
59379,7
59380,3
59381,2
59382,9
59383,9
59384,4
59385,3
59386,2
59387,1
59388,3
59389,8
59390,7
59391,9
59392,0
59393,4
59394,5
59395,7
59396,5
59397,4
59398,9
59399,7
59400,6
59401,9
59402,2
59403,9
59404,3
59405,8
59406,5
59407,6
59408,6
59409,9
59410,5
59411,7
59412,8
59413,0
59414,3
59415,4
59416,7
59417,4
59418,8
59419,2
59420,5
59421,8
59422,3
59423,2
59424,2
59425,6
59426,4
59427,1
59428,7
59429,5
59430,6
59431,3
59432,1
59433,3
59434,5
59435,7
59436,6
59437,3
59438,7
59439,0
59440,8
59441,4
59442,4
59443,2
59444,7
59445,7
59446,3
59447,4
59448,3
59449,0
59450,6
59451,8
59452,2
59453,3
59454,4
59455,1
59456,6
59457,1
59458,7
59459,0
59460,3
59461,4
59462,0
59463,9
59464,4
59465,7
59466,8
59467,3
59468,7
59469,0
59470,9
59471,9
59472,8
59473,0
59474,8
59475,2
59476,8
59477,5
59478,7
59479,7
59480,2
59481,2
59482,0
59483,0
59484,9
59485,7
59486,4
59487,1
59488,6
59489,6
59490,9
59491,8
59492,9
59493,8
59494,9
59495,0
59496,1
59497,2
59498,6
59499,0
59500,9
59501,6
59502,6
59503,4
59504,6
59505,3
59506,2
59507,8
59508,8
59509,4
59510,9
59511,4
59512,0
59513,3
59514,2
59515,9
59516,9
59517,9
59518,9
59519,9
59520,1
59521,2
59522,2
59523,5
59524,4
59525,2
59526,9
59527,3
59528,4
59529,0
59530,6
59531,6
59532,8
59533,0
59534,6
59535,1
59536,4
59537,6
59538,8
59539,0
59540,5
59541,4
59542,9
59543,2
59544,0
59545,9
59546,6
59547,4
59548,3
59549,5
59550,6
59551,2
59552,9
59553,7
59554,7
59555,4
59556,6
59557,2
59558,0
59559,9
59560,9
59561,0
59562,3
59563,9
59564,9
59565,0
59566,9
59567,7
59568,8
59569,6
59570,7
59571,6
59572,8
59573,4
59574,4
59575,5
59576,1
59577,0
59578,3
59579,5
59580,1
59581,7
59582,5
59583,9
59584,3
59585,4
59586,5
59587,9
59588,1
59589,5
59590,8
59591,1
59592,1
59593,1
59594,3
59595,7
59596,5
59597,1
59598,9
59599,7
59600,8
59601,5
59602,0
59603,2
59604,0
59605,5
59606,3
59607,7
59608,0
59609,9
59610,4
59611,8
59612,3
59613,4
59614,6
59615,6
59616,4
59617,8
59618,1
59619,8
59620,4
59621,6
59622,7
59623,9
59624,2
59625,0
59626,1
59627,4
59628,9
59629,1
59630,6
59631,7
59632,2
59633,0
59634,1
59635,4
59636,6
59637,3
59638,2
59639,2
59640,5
59641,3
59642,0
59643,0
59644,0
59645,1
59646,5
59647,3
59648,3
59649,3
59650,8
59651,7
59652,5
59653,6
59654,5
59655,8
59656,0
59657,3
59658,9
59659,7
59660,6
59661,5
59662,1
59663,1
59664,0
59665,5
59666,3
59667,9
59668,4
59669,8
59670,1
59671,7
59672,7
59673,9
59674,9
59675,4
59676,3
59677,6
59678,8
59679,2
59680,8
59681,2
59682,7
59683,5
59684,7
59685,0
59686,2
59687,1
59688,2
59689,9
59690,2
59691,2
59692,9
59693,3
59694,1
59695,0
59696,1
59697,8
59698,7
59699,9
59700,0
59701,4
59702,7
59703,4
59704,3
59705,6
59706,9
59707,2
59708,9
59709,9
59710,7
59711,4
59712,5
59713,8
59714,1
59715,2
59716,7
59717,9
59718,9
59719,8
59720,9
59721,3
59722,9
59723,7
59724,0
59725,4
59726,9
59727,8
59728,2
59729,3
59730,3
59731,2
59732,9
59733,7
59734,4
59735,0
59736,8
59737,5
59738,6
59739,1
59740,6
59741,5
59742,9
59743,9
59744,9
59745,3
59746,0
59747,0
59748,3
59749,0
59750,3
59751,0
59752,7
59753,5
59754,9
59755,3
59756,4
59757,7
59758,5
59759,5
59760,9
59761,5
59762,6
59763,1
59764,2
59765,4
59766,0
59767,2
59768,7
59769,8
59770,4
59771,4
59772,0
59773,9
59774,5
59775,9
59776,2
59777,9
59778,3
59779,2
59780,4
59781,3
59782,2
59783,2
59784,8
59785,0
59786,8
59787,0
59788,1
59789,6
59790,0
59791,6
59792,2
59793,5
59794,1
59795,4
59796,9
59797,1
59798,5
59799,7
59800,1
59801,6
59802,0
59803,1
59804,5
59805,0
59806,8
59807,1
59808,8
59809,3
59810,8
59811,1
59812,8
59813,1
59814,8
59815,5
59816,1
59817,9
59818,0
59819,5
59820,0
59821,4
59822,0
59823,3
59824,9
59825,2
59826,0
59827,4
59828,9
59829,3
59830,1
59831,2
59832,4
59833,7
59834,0
59835,7
59836,2
59837,4
59838,5
59839,3
59840,7
59841,8
59842,4
59843,1
59844,2
59845,9
59846,8
59847,0
59848,0
59849,0
59850,4
59851,6
59852,0
59853,6
59854,9
59855,7
59856,9
59857,0
59858,2
59859,7
59860,0
59861,6
59862,3
59863,6
59864,0
59865,9
59866,0
59867,8
59868,9
59869,7
59870,2
59871,9
59872,0
59873,9
59874,4
59875,9
59876,0
59877,2
59878,5
59879,3
59880,7
59881,9
59882,1
59883,0
59884,9
59885,8
59886,4
59887,5
59888,0
59889,8
59890,0
59891,3
59892,7
59893,2
59894,8
59895,4
59896,4
59897,8
59898,9
59899,7
59900,8
59901,1
59902,9
59903,6
59904,0
59905,1
59906,1
59907,1
59908,8
59909,1
59910,7
59911,4
59912,0
59913,7
59914,8
59915,2
59916,1
59917,6
59918,7
59919,2
59920,6
59921,0
59922,5
59923,7
59924,4
59925,4
59926,2
59927,9
59928,3
59929,8
59930,3
59931,0
59932,8
59933,2
59934,4
59935,1
59936,8
59937,4
59938,9
59939,5
59940,3
59941,1
59942,7
59943,7
59944,7
59945,7
59946,0
59947,3
59948,8
59949,3
59950,3
59951,0
59952,5
59953,7
59954,0
59955,8
59956,2
59957,0
59958,9
59959,3
59960,0
59961,3
59962,7
59963,8
59964,4
59965,2
59966,6
59967,4
59968,5
59969,2
59970,2
59971,9
59972,9
59973,0
59974,1
59975,7
59976,5
59977,5
59978,4
59979,5
59980,0
59981,7
59982,4
59983,0
59984,7
59985,9
59986,8
59987,0
59988,8
59989,2
59990,7
59991,0
59992,3
59993,3
59994,3
59995,8
59996,5
59997,5
59998,4
59999,7
