time,value
0,0.3006
1,-0.14238
2,0.16097
3,-0.01247
4,0.16080999999999998
5,0.15967
6,0.16751
7,0.17526
8,0.16585
9,0.17524
10,0.027989999999999998
11,0.16423
12,0.17273
13,0.15614
14,0.15014
15,0.20611999999999997
16,0.17464000000000002
17,0.22601999999999997
18,0.26615
19,0.30448000000000003
20,0.3435
21,0.39128
22,0.45186000000000004
23,0.48988000000000004
24,0.42123
25,0.44001
26,0.46176999999999996
27,0.52588
28,0.5340600000000001
29,0.55911
30,0.5825199999999999
31,0.5898399999999999
32,0.5869
33,0.5351100000000001
34,0.53313
35,0.54432
36,0.55176
37,0.50098
38,0.49394
39,0.40144
40,0.31098000000000003
41,0.18127000000000001
42,-0.020696
43,-0.27145
44,-0.49771000000000004
45,-0.77528
46,-1.1482
47,-1.4864
48,-1.7952
49,-2.3008
50,-2.7953
51,-3.1838
52,-3.7505
53,-4.3612
54,-3.2173
55,-2.8742
56,-3.0276
57,-2.7825
58,-2.0754
59,-1.5036
60,-1.615
61,-0.92789
62,-1.2216
63,-0.36918
64,-0.16692
65,-1.5618
66,0.6543899999999999
67,-0.074902
68,-0.43628999999999996
69,-0.36978
70,-0.72713
71,-1.2208
72,-1.5614
73,-0.6924899999999999
74,-0.20936999999999997
75,-0.53978
76,-0.44966000000000006
77,-0.38187
78,-0.5946100000000001
79,-0.8231200000000001
80,-0.68817
81,-0.76032
82,-0.78114
83,-0.76081
84,-0.7151
85,-0.6374
86,-0.66919
87,-0.6027399999999999
88,-0.55904
89,-0.5146
90,-0.55272
91,-0.6128899999999999
92,-0.66857
93,-0.60769
94,-0.56784
95,-0.7571
96,-0.5597300000000001
97,-0.56525
98,-0.51246
99,-0.52652
100,-0.46248
101,-0.47681
102,-0.49094
103,-0.48556000000000005
104,-0.45706
105,-0.42539
106,-0.37212
107,-0.4787
108,-0.22185
109,-0.28908
110,-1.1108
111,-0.81185
112,-0.63912
113,-0.8023600000000001
114,-0.59392
115,-0.11732999999999999
116,-0.30277
117,-0.33799999999999997
118,-0.061676999999999996
119,-0.23116
120,-0.71196
121,-0.7753800000000001
122,-0.60925
123,-0.7971699999999999
124,-1.3387
125,-1.4144
126,-2.0734
127,-3.1052
128,-3.2153
129,-2.8757
130,-3.6147
131,-3.0124
132,-1.8085
133,-1.7783
134,-1.6283
135,-4.0104
136,-2.3133
137,-1.8868
138,-0.84078
139,-0.51012
140,-0.37361
141,0.048423
142,0.26569
143,0.32161999999999996
144,0.5543100000000001
145,0.60842
146,0.5441
147,0.42583000000000004
148,0.29773
149,0.38983
150,0.6793600000000001
151,0.85141
152,0.71183
153,0.61419
154,0.5333100000000001
155,0.46346000000000004
156,0.54406
157,0.64966
158,0.5545
159,0.6254
160,0.5320699999999999
161,0.52946
162,0.63275
163,0.6231399999999999
164,0.5332100000000001
165,0.48905
166,0.33607
167,0.29505
168,0.48746999999999996
169,0.15817
170,0.46817
171,0.45382
172,0.56698
173,0.5994
174,0.64941
175,0.63465
176,0.67943
177,0.64456
178,0.51849
179,0.48439
180,0.5645899999999999
181,0.65168
182,0.73987
183,0.70714
184,0.6943199999999999
185,0.5422600000000001
186,0.55291
187,0.52991
188,0.49812
189,0.58814
190,0.51157
191,0.5353100000000001
192,0.60407
193,0.59185
194,0.64378
195,0.7015899999999999
196,0.71814
197,0.73487
198,0.7085899999999999
199,0.61168
200,0.60673
201,0.69768
202,0.67909
203,0.6292800000000001
204,0.64635
205,0.70667
206,0.69195
207,0.75612
208,0.74739
209,0.74898
210,0.74727
211,0.74922
212,0.78273
213,0.62608
214,0.71146
215,0.60251
216,0.7296100000000001
217,0.71628
218,0.6890000000000001
219,0.55613
220,0.57986
221,0.55915
222,0.53585
223,0.53135
224,0.59027
225,0.72727
226,0.70716
227,0.69413
228,0.59199
229,0.59708
230,0.72604
231,0.73845
232,0.74925
233,0.76413
234,0.61111
235,0.6158600000000001
236,0.59727
237,0.54866
238,0.69796
239,0.56588
240,0.56871
241,0.56094
242,0.64056
243,0.62897
244,0.59146
245,0.46413000000000004
246,0.54862
247,0.5893
248,0.59197
249,0.5867
250,0.5915600000000001
251,0.58753
252,0.75732
253,0.59659
254,0.58749
255,0.58353
256,0.58987
257,0.6071
258,0.7611399999999999
259,0.66855
260,0.76362
261,0.76869
262,0.75893
263,0.68195
264,0.59853
265,0.74534
266,0.73047
267,0.66969
268,0.7467600000000001
269,0.65218
270,0.68252
271,0.58796
272,0.59308
273,0.65018
274,0.7621100000000001
275,0.76085
276,0.81005
277,0.75465
278,0.63181
279,0.6157100000000001
280,0.74287
281,0.57938
282,0.57548
283,0.57029
284,0.74007
285,0.57944
286,0.57363
287,0.5765399999999999
288,0.73528
289,0.72618
290,0.5501199999999999
291,0.3965
292,0.5506300000000001
293,0.75839
294,0.73388
295,0.73416
296,0.72828
297,0.7226100000000001
298,0.71506
299,0.71337
