time,value
0,-0.9393299999999999
1,-0.9393299999999999
2,-0.0067997
3,1.2987
4,1.2055
5,-0.9393299999999999
6,-0.9393299999999999
7,-0.9393299999999999
8,-0.9393299999999999
9,0.83247
10,1.2987
11,0.6459699999999999
12,-0.9393299999999999
13,-0.9393299999999999
14,-0.9393299999999999
15,-0.9393299999999999
16,1.0190000000000001
17,1.2987
18,0.6459699999999999
19,-0.9393299999999999
20,-0.9393299999999999
21,-0.9393299999999999
22,-0.9393299999999999
23,0.83247
24,1.2987
25,0.9257299999999999
26,-0.9393299999999999
27,-0.9393299999999999
28,-0.9393299999999999
29,-0.37981
30,1.2987
31,1.2987
32,-0.0067997
33,-0.9393299999999999
34,-0.9393299999999999
35,-0.7528199999999999
36,1.392
37,1.2987
38,1.2987
39,-0.9393299999999999
40,-0.9393299999999999
41,-0.9393299999999999
42,0.83247
43,1.392
44,0.36621
45,-0.9393299999999999
46,-0.9393299999999999
47,-0.9393299999999999
48,1.0190000000000001
49,1.2987
50,0.45946000000000004
51,-0.9393299999999999
52,-0.9393299999999999
53,-0.9393299999999999
54,1.392
55,1.2987
56,-0.28656
57,-0.9393299999999999
58,-0.9393299999999999
59,0.36621
60,1.2987
61,0.55272
62,-0.9393299999999999
63,-0.9393299999999999
64,-0.37981
65,1.2987
66,1.2987
67,-0.9393299999999999
68,-0.9393299999999999
69,-0.7528199999999999
70,1.4852
71,1.392
72,-0.5663199999999999
73,-0.9393299999999999
74,-0.47306000000000004
75,1.392
76,1.2987
77,-0.9393299999999999
78,-0.9393299999999999
79,-0.7528199999999999
80,1.4852
81,1.392
82,-0.37981
83,-0.9393299999999999
84,-0.9393299999999999
85,0.73922
86,1.392
87,0.086453
88,-0.9393299999999999
89,-0.9393299999999999
90,0.36621
91,1.392
92,0.73922
93,-0.9393299999999999
94,-0.9393299999999999
95,1.2055
