time,value
0,-1.1535
1,-1.2548
2,-1.1535
3,-1.1535
4,-1.1535
5,-1.2548
6,-1.1535
7,-1.1535
8,-1.1535
9,-1.2548
10,-1.1535
11,-1.1535
12,-1.1535
13,-1.2548
14,-1.1535
15,-1.1535
16,-1.1535
17,-1.2548
18,-1.1535
19,-1.1535
20,-1.1535
21,-1.2548
22,-1.1535
23,-1.1535
24,-1.1535
25,-1.2548
26,-1.1535
27,-1.1535
28,-1.1535
29,-1.1535
30,-1.2548
31,-1.1535
32,-1.1535
33,-1.1535
34,-1.2548
35,0.16358
36,-1.1535
37,-1.1535
38,0.6701699999999999
39,1.5819999999999999
40,2.7978
41,2.5952
42,1.3794
43,1.3794
44,1.4807
45,0.8728
46,0.56885
47,0.6701699999999999
48,0.56885
49,0.6701699999999999
50,0.56885
51,0.56885
52,0.6701699999999999
53,0.56885
54,0.6701699999999999
55,0.56885
56,1.1767
57,0.77148
58,0.56885
59,0.6701699999999999
60,0.56885
61,0.56885
62,0.6701699999999999
63,0.6701699999999999
64,0.6701699999999999
65,0.56885
66,0.56885
67,0.56885
68,0.6701699999999999
69,0.56885
70,0.56885
71,0.56885
72,0.56885
73,0.6701699999999999
74,0.56885
75,0.56885
76,0.56885
77,0.6701699999999999
78,0.56885
79,0.56885
80,0.56885
81,0.56885
82,0.6701699999999999
83,0.56885
84,0.56885
85,0.56885
86,0.6701699999999999
87,0.56885
88,0.56885
89,0.56885
90,0.6701699999999999
91,0.56885
92,0.56885
93,0.56885
94,0.56885
95,0.56885
