time,value
0,0.33028
1,1.7797
2,-0.75681
3,-0.75681
4,-0.75681
5,-0.75681
6,1.7797
7,0.33028
8,-0.75681
9,-0.75681
10,-0.75681
11,0.51146
12,1.7797
13,-0.75681
14,-0.75681
15,-0.75681
16,-0.75681
17,1.5985
18,0.51146
19,-0.75681
20,-0.75681
21,-0.75681
22,-0.032083999999999994
23,1.7797
24,-0.21327
25,-0.75681
26,-0.75681
27,-0.75681
28,0.51146
29,1.7797
30,-0.75681
31,-0.75681
32,-0.75681
33,-0.75681
34,1.2362
35,0.87382
36,-0.75681
37,-0.75681
38,-0.75681
39,-0.21327
40,1.7797
41,0.1491
42,-0.75681
43,-0.75681
44,-0.75681
45,0.33028
46,1.7797
47,-0.75681
48,-0.75681
49,-0.75681
50,-0.75681
51,1.9609
52,1.2362
53,-0.75681
54,-0.75681
55,-0.75681
56,0.51146
57,1.7797
58,-0.75681
59,-0.75681
60,-0.75681
61,-0.21327
62,1.7797
63,-0.032083999999999994
64,-0.75681
65,-0.75681
66,-0.75681
67,1.2362
68,1.055
69,-0.75681
70,-0.75681
71,-0.032083999999999994
72,1.9609
73,1.5985
74,-0.75681
75,-0.75681
76,-0.75681
77,1.5985
78,1.055
79,-0.75681
80,-0.75681
81,-0.75681
82,1.4174
83,1.7797
84,-0.21327
85,-0.75681
86,-0.75681
87,0.1491
88,1.7797
89,-0.21327
90,-0.75681
91,-0.75681
92,-0.21327
93,1.7797
94,-0.032083999999999994
95,-0.75681
