time,value
0,-0.60451
1,-0.55779
2,-0.51978
3,-0.49598000000000003
4,-0.48489
5,-0.48728
6,-0.49856999999999996
7,-0.51373
8,-0.5284399999999999
9,-0.53404
10,-0.52867
11,-0.50544
12,-0.45976000000000006
13,-0.38304
14,-0.27885
15,-0.15727
16,-0.027341000000000004
17,0.10260999999999999
18,0.22891
19,0.34892
20,0.46638
21,0.5794100000000001
22,0.6792199999999999
23,0.7573300000000001
24,0.8132199999999999
25,0.8544700000000001
26,0.88241
27,0.89087
28,0.8681200000000001
29,0.80893
30,0.71809
31,0.6086
32,0.49527
33,0.38335
34,0.27305
35,0.16472
36,0.065801
37,-0.015951
38,-0.08040900000000001
39,-0.12800999999999998
40,-0.16477999999999998
41,-0.19207
42,-0.21338000000000001
43,-0.22776
44,-0.23661999999999997
45,-0.24386999999999998
46,-0.24759
47,-0.25199
48,-0.25939
49,-0.27455
50,-0.29123000000000004
51,-0.30951
52,-0.33415
53,-0.36463
54,-0.39642
55,-0.42585
56,-0.45463000000000003
57,-0.47831999999999997
58,-0.49566000000000004
59,-0.5100100000000001
60,-0.52399
61,-0.53582
62,-0.54427
63,-0.55274
64,-0.56079
65,-0.56925
66,-0.57793
67,-0.5872
68,-0.59243
69,-0.59396
70,-0.59623
71,-0.5995199999999999
72,-0.60326
73,-0.6025
74,-0.60132
75,-0.59953
76,-0.59953
77,-0.5966
78,-0.58494
79,-0.56311
80,-0.5290699999999999
81,-0.46736000000000005
82,-0.34565999999999997
83,-0.14752
84,0.1097
85,0.38095999999999997
86,0.61423
87,0.7671899999999999
88,0.82424
89,0.80312
90,0.7339399999999999
91,0.63874
92,0.52886
93,0.41281999999999996
94,0.29753
95,0.18805999999999998
96,0.08807899999999999
97,-0.004430300000000001
98,-0.094747
99,-0.18328
100,-0.26297
101,-0.32755
102,-0.37893000000000004
103,-0.41897
104,-0.45161
105,-0.47596000000000005
106,-0.49792
107,-0.51889
108,-0.53703
109,-0.5501199999999999
110,-0.55681
111,-0.56313
112,-0.5678300000000001
113,-0.5733699999999999
114,-0.57802
115,-0.58303
116,-0.5834600000000001
117,-0.56916
118,-0.53008
119,-0.45933
120,-0.35998
121,-0.24251999999999999
122,-0.12725999999999998
123,-0.033167
124,0.029427
125,0.060837999999999996
126,0.066065
127,0.049891000000000005
128,0.019251
129,-0.019312
130,-0.062878
131,-0.11494000000000001
132,-0.17465
133,-0.23246999999999998
134,-0.2813
135,-0.32464
136,-0.36598
137,-0.39871
138,-0.4195
139,-0.43412
140,-0.44515
141,-0.4501
142,-0.45024
143,-0.45373
144,-0.45893
145,-0.4627
146,-0.46538999999999997
147,-0.46878000000000003
148,-0.47167
149,-0.47402
150,-0.48053999999999997
151,-0.49076000000000003
152,-0.50427
153,-0.5202
154,-0.53603
155,-0.5473399999999999
156,-0.55608
157,-0.56805
158,-0.5817100000000001
159,-0.59449
160,-0.60751
161,-0.62357
162,-0.63636
163,-0.64473
164,-0.65071
165,-0.65472
166,-0.65408
167,-0.64962
168,-0.64952
169,-0.65171
170,-0.65591
171,-0.66035
172,-0.66647
173,-0.66684
174,-0.6459999999999999
175,-0.58486
176,-0.46423000000000003
177,-0.27921
178,-0.046127
179,0.19287
180,0.39179
181,0.52367
182,0.58939
183,0.60731
184,0.5976100000000001
185,0.57617
186,0.54482
187,0.49583999999999995
188,0.42056000000000004
189,0.32206
190,0.21454
191,0.11238
192,0.025852999999999998
193,-0.047135
194,-0.10595999999999998
195,-0.1534
196,-0.18612
197,-0.20315
198,-0.21153000000000002
199,-0.20889000000000002
200,-0.20861
201,-0.20052999999999999
202,-0.1994
203,-0.201
204,-0.2044
205,-0.19657
206,-0.15827
207,-0.068886
208,0.11709000000000001
209,0.41767
210,0.8303299999999999
211,1.3173
212,1.8459999999999999
213,2.3941
214,2.949
215,3.4948
216,3.9913
217,4.3803
218,4.6044
219,4.6401
220,4.51
221,4.2673
222,3.9665
223,3.6327
224,3.2654
225,2.8585
226,2.4222
227,1.9781
228,1.5412
229,1.1232
230,0.73551
231,0.40433
232,0.13998
233,-0.061751
234,-0.2186
235,-0.34491
236,-0.43426000000000003
237,-0.49663999999999997
238,-0.53205
239,-0.56139
240,-0.57822
241,-0.58818
242,-0.59341
243,-0.59436
244,-0.59519
245,-0.5937
246,-0.59711
247,-0.59675
248,-0.59343
249,-0.5895100000000001
250,-0.59104
251,-0.59518
252,-0.5960300000000001
253,-0.59446
254,-0.5937
255,-0.5942
256,-0.59207
257,-0.58868
258,-0.58777
259,-0.5864199999999999
260,-0.5806899999999999
261,-0.57536
262,-0.57418
263,-0.57171
264,-0.5692699999999999
265,-0.57487
266,-0.58223
267,-0.58278
268,-0.5934699999999999
269,-0.6299899999999999
