time,value
0,-0.21839
1,-0.21839
2,-0.21839
3,-0.21839
4,-0.21839
5,-0.21839
6,-0.21839
7,-0.21839
8,-0.21839
9,-0.21839
10,-0.21839
11,-0.21839
12,-0.21839
13,-0.21839
14,-0.21839
15,-0.21839
16,-0.21839
17,-0.21839
18,-0.21839
19,-0.21839
20,-0.21839
21,-0.21839
22,-0.21839
23,-0.21839
24,5.7318
25,-0.21839
26,-0.21839
27,-0.21839
28,-0.21839
29,0.99025
30,1.3156
31,-0.21839
32,-0.21839
33,1.7805
34,-0.21839
35,-0.21839
36,-0.21839
37,-0.21839
38,-0.21839
39,-0.21839
40,-0.21839
41,-0.21839
42,-0.21839
43,-0.21839
44,-0.21839
45,-0.21839
46,-0.21839
47,-0.21839
48,-0.21839
49,-0.21839
50,-0.21839
51,-0.21839
52,-0.21839
53,-0.21839
54,-0.21839
55,-0.21839
56,-0.21839
57,-0.21839
58,-0.21839
59,-0.21839
60,6.4291
61,-0.21839
62,-0.21839
63,-0.21839
64,-0.21839
65,-0.21839
66,-0.21839
67,-0.21839
68,-0.21839
69,-0.21839
70,-0.21839
71,3.2681
72,-0.21839
73,-0.21839
74,-0.21839
75,-0.21839
76,-0.21839
77,-0.21839
78,-0.21839
79,-0.21839
80,-0.21839
81,-0.21839
82,-0.078929
83,-0.21839
84,-0.21839
85,-0.21839
86,-0.21839
87,-0.21839
88,-0.21839
89,-0.21839
90,-0.21839
91,-0.21839
92,-0.21839
93,-0.21839
94,-0.21839
95,-0.21839
