time,value
0,1.8275
1,1.7895
2,1.735
3,1.6446
4,1.5327
5,1.4218
6,1.3143
7,1.206
8,1.1183
9,1.0126
10,0.9084399999999999
11,0.80587
12,0.7239800000000001
13,0.62995
14,0.53885
15,0.44509
16,0.35366
17,0.26485
18,0.1789
19,0.087853
20,-0.009246299999999999
21,-0.08725
22,-0.17088
23,-0.26173
24,-0.33981999999999996
25,-0.4093
26,-0.48118999999999995
27,-0.5613600000000001
28,-0.6388699999999999
29,-0.7119
30,-0.78162
31,-0.84715
32,-0.9232
33,-0.9798
34,-1.0318
35,-1.0932
36,-1.1329
37,-1.1838
38,-1.2103
39,-1.2305
40,-1.26
41,-1.2833
42,-1.2990000000000002
43,-1.2888
44,-1.2877
45,-1.2801
46,-1.2841
47,-1.2611
48,-1.2309
49,-1.1937
50,-1.1501
51,-1.1178
52,-1.0788
53,-1.0174
54,-0.9512200000000001
55,-0.8947799999999999
56,-0.83578
57,-0.7569100000000001
58,-0.6884899999999999
59,-0.62805
60,-0.55174
61,-0.47326999999999997
62,-0.39083
63,-0.30575
64,-0.22760999999999998
65,-0.14728
66,-0.055670000000000004
67,0.029806
68,0.11857999999999999
69,0.2088
70,0.29377
71,0.36336999999999997
72,0.46005
73,0.55238
74,0.6470199999999999
75,0.73937
76,0.838
77,0.9349299999999999
78,1.038
79,1.1393
80,1.2457
81,1.3344
82,1.4429
83,1.5529
84,1.6468
85,1.7369999999999999
86,1.7895
87,1.8279
88,1.7913
89,1.7186
90,1.6261
91,1.534
92,1.4245
93,1.3165
94,1.2272
95,1.1197
96,1.0170000000000001
97,0.97446
98,0.87981
99,0.77515
100,0.6862199999999999
101,0.58807
102,0.48701000000000005
103,0.39883
104,0.30249000000000004
105,0.21416999999999997
106,0.12877
107,0.038244
108,-0.049951999999999996
109,-0.13560999999999998
110,-0.20983000000000002
111,-0.29048
112,-0.36959000000000003
113,-0.43031
114,-0.5102300000000001
115,-0.58777
116,-0.66396
117,-0.72249
118,-0.7941
119,-0.8568399999999999
120,-0.9050299999999999
121,-0.9612200000000001
122,-1.0121
123,-1.0571
124,-1.1216
125,-1.1591
126,-1.1866
127,-1.2222
128,-1.2542
129,-1.2790000000000001
130,-1.2612
131,-1.2671
132,-1.2846
133,-1.2629
134,-1.2714
135,-1.2515
136,-1.2242
137,-1.19
138,-1.1672
139,-1.1197
140,-1.0835
141,-1.0245
142,-0.97655
143,-0.9230799999999999
144,-0.8614
145,-0.78687
146,-0.73346
147,-0.66005
148,-0.5887899999999999
149,-0.5207
150,-0.45111999999999997
151,-0.37766
152,-0.29258
153,-0.21058000000000002
154,-0.12782000000000002
155,-0.033486
156,0.054089
157,0.14223
158,0.22871999999999998
159,0.32321
160,0.4082
161,0.4996
162,0.5947899999999999
163,0.69212
164,0.77248
165,0.87046
166,0.97262
167,1.0773
168,1.1835
169,1.2909
170,1.4014
171,1.5115
172,1.6239
173,1.7314
174,1.8075
175,1.8429
