time,value
0,-1.349
1,-1.349
2,0.69628
3,0.88221
4,0.045515
5,-1.349
6,-1.349
7,-1.349
8,-0.047451
9,0.9751700000000001
10,0.88221
11,-1.349
12,-1.349
13,-1.349
14,-1.349
15,1.0681
16,0.9751700000000001
17,-0.23338000000000003
18,-1.349
19,-1.349
20,-1.349
21,-0.23338000000000003
22,0.9751700000000001
23,0.88221
24,-0.97711
25,-1.349
26,-1.349
27,-1.349
28,0.23145
29,0.9751700000000001
30,0.88221
31,-1.349
32,-1.349
33,-1.349
34,-0.69821
35,1.0681
36,0.88221
37,0.51034
38,-1.349
39,-1.349
40,-0.69821
41,0.9751700000000001
42,0.88221
43,0.88221
44,-0.14042000000000002
45,-1.349
46,-0.8841399999999999
47,1.0681
48,0.9751700000000001
49,0.88221
50,0.7892399999999999
51,0.7892399999999999
52,0.88221
53,0.69628
54,0.7892399999999999
55,0.69628
56,0.69628
57,0.69628
58,0.69628
59,0.60331
60,0.69628
61,-0.8841399999999999
62,-1.349
63,-1.349
64,-1.349
65,0.13848
66,0.7892399999999999
67,0.88221
68,-0.97711
69,-1.349
70,-0.23338000000000003
71,0.88221
72,0.7892399999999999
73,0.69628
74,-1.349
75,-1.349
76,-1.349
77,1.0681
78,0.9751700000000001
79,1.1611
80,0.9751700000000001
81,0.88221
82,0.88221
83,0.7892399999999999
84,0.7892399999999999
85,0.88221
86,0.7892399999999999
87,0.7892399999999999
88,0.7892399999999999
89,0.69628
90,0.7892399999999999
91,0.69628
92,0.69628
93,0.69628
94,0.69628
95,-1.0701
