time,value
0,-0.23114
1,-0.23114
2,-0.23114
3,-0.23114
4,-0.23114
5,-0.23114
6,-0.23114
7,-0.23114
8,-0.23114
9,-0.23114
10,-0.23114
11,-0.23114
12,-0.23114
13,-0.23114
14,-0.23114
15,-0.23114
16,-0.23114
17,-0.23114
18,-0.23114
19,-0.23114
20,-0.23114
21,-0.23114
22,-0.23114
23,-0.23114
24,-0.23114
25,-0.23114
26,-0.23114
27,-0.23114
28,-0.23114
29,-0.23114
30,-0.23114
31,-0.23114
32,-0.23114
33,-0.23114
34,-0.23114
35,2.9141
36,-0.23114
37,-0.23114
38,5.1607
39,-0.23114
40,-0.23114
41,-0.23114
42,-0.23114
43,-0.23114
44,-0.23114
45,-0.23114
46,4.4004
47,-0.23114
48,-0.23114
49,-0.23114
50,-0.23114
51,-0.23114
52,-0.23114
53,-0.23114
54,-0.23114
55,-0.23114
56,-0.23114
57,-0.23114
58,-0.23114
59,-0.23114
60,-0.23114
61,-0.23114
62,-0.23114
63,-0.23114
64,-0.23114
65,-0.23114
66,-0.23114
67,3.6745
68,-0.23114
69,-0.23114
70,-0.23114
71,-0.23114
72,-0.23114
73,-0.23114
74,-0.23114
75,-0.23114
76,-0.23114
77,-0.23114
78,-0.23114
79,-0.23114
80,-0.23114
81,-0.23114
82,-0.23114
83,4.7114
84,-0.058325999999999996
85,-0.23114
86,-0.23114
87,-0.23114
88,-0.23114
89,-0.23114
90,-0.23114
91,-0.23114
92,-0.23114
93,-0.23114
94,-0.23114
95,-0.23114
