time,value
0,-1.0979999999999999
1,-1.0979999999999999
2,-1.0979999999999999
3,-1.0979999999999999
4,-1.0979999999999999
5,-1.0979999999999999
6,-1.0979999999999999
7,-1.0979999999999999
8,-1.0979999999999999
9,-1.0979999999999999
10,-1.0979999999999999
11,-1.0979999999999999
12,-1.0979999999999999
13,-1.0979999999999999
14,-1.0979999999999999
15,-1.0979999999999999
16,-1.0979999999999999
17,-1.0979999999999999
18,-1.0979999999999999
19,-1.0979999999999999
20,-1.0979999999999999
21,-1.0979999999999999
22,-1.0979999999999999
23,-1.0979999999999999
24,0.9388700000000001
25,1.3026
26,1.2298
27,0.57514
28,0.8661200000000001
29,0.57514
30,0.72063
31,0.72063
32,0.5024
33,0.8661200000000001
34,0.9388700000000001
35,2.1028
36,1.7391
37,2.1755
38,1.8118
39,2.1755
40,0.42965
41,0.28415999999999997
42,0.21141999999999997
43,-0.006819800000000001
44,-0.15231
45,-0.44328999999999996
46,-0.006819800000000001
47,1.7391
48,1.6663
49,0.57514
50,1.3026
51,0.72063
52,0.57514
53,0.79338
54,0.35691
55,0.64789
56,-1.0979999999999999
57,-1.0979999999999999
58,-1.0979999999999999
59,-1.0979999999999999
60,-0.6615300000000001
61,-0.2978
62,-0.58878
63,-0.58878
64,-0.6615300000000001
65,-0.6615300000000001
66,1.0844
67,1.3026
68,0.57514
69,0.8661200000000001
70,0.42965
71,0.64789
72,0.72063
73,0.42965
74,0.72063
75,0.57514
76,0.42965
77,0.79338
78,0.42965
79,0.64789
80,0.72063
81,0.35691
82,0.79338
83,0.42965
84,0.57514
85,0.72063
86,0.9388700000000001
87,0.57514
88,-0.80702
89,-1.0979999999999999
90,-1.0979999999999999
91,-1.0979999999999999
92,-1.0979999999999999
93,-1.0979999999999999
94,-1.0979999999999999
95,-1.0979999999999999
