time,value
0,-0.50877
1,-0.26698
2,-0.50877
3,-0.50877
4,-0.50877
5,-0.26698
6,-0.50877
7,-0.50877
8,-0.50877
9,-0.26698
10,-0.50877
11,-0.50877
12,-0.50877
13,-0.26698
14,-0.50877
15,-0.50877
16,-0.26698
17,-0.50877
18,-0.50877
19,-0.50877
20,-0.26698
21,-0.50877
22,-0.26698
23,-0.26698
24,1.1838
25,2.3927
26,2.3927
27,2.3927
28,2.3927
29,2.8763
30,2.3927
31,2.3927
32,2.6345
33,2.3927
34,-0.26698
35,-0.50877
36,-0.26698
37,-0.50877
38,-0.26698
39,-0.50877
40,-0.26698
41,-0.50877
42,-0.50877
43,-0.50877
44,-0.26698
45,-0.50877
46,-0.50877
47,-0.50877
48,-0.26698
49,-0.50877
50,-0.50877
51,-0.50877
52,-0.26698
53,-0.50877
54,-0.50877
55,-0.50877
56,-0.26698
57,-0.50877
58,-0.50877
59,-0.50877
60,-0.26698
61,-0.50877
62,-0.50877
63,-0.50877
64,-0.26698
65,-0.50877
66,-0.50877
67,-0.50877
68,-0.26698
69,-0.50877
70,-0.50877
71,0.9419799999999999
72,2.8763
73,2.3927
74,-0.50877
75,0.4584
76,2.3927
77,1.4256
78,-0.26698
79,-0.50877
80,-0.26698
81,-0.50877
82,-0.26698
83,-0.50877
84,-0.26698
85,-0.50877
86,-0.26698
87,-0.50877
88,-0.26698
89,-0.50877
90,-0.26698
91,-0.50877
92,-0.26698
93,-0.50877
94,-0.50877
95,-0.26698
