time,value
0,-0.91961
1,1.1438
2,-0.91961
3,-0.035311
4,0.25945999999999997
5,-0.91961
6,1.1438
7,-0.91961
8,-0.91961
9,1.1438
10,-0.91961
11,0.40684000000000003
12,-0.18269000000000002
13,-0.91961
14,1.1438
15,-0.91961
16,-0.18269000000000002
17,0.40684000000000003
18,-0.91961
19,0.9963700000000001
20,-0.62484
21,-0.91961
22,1.1438
23,-0.91961
24,-0.18269000000000002
25,0.40684000000000003
26,-0.91961
27,1.1438
28,-0.91961
29,-0.91961
30,1.1438
31,-0.91961
32,-0.18269000000000002
33,0.40684000000000003
34,-0.91961
35,0.9963700000000001
36,-0.62484
37,-0.91961
38,1.1438
39,-0.91961
40,-0.33008000000000004
41,0.7016100000000001
42,-0.91961
43,0.7016100000000001
44,-0.47746000000000005
45,-0.91961
46,1.1438
47,-0.91961
48,-0.62484
49,0.9963700000000001
50,-0.91961
51,0.40684000000000003
52,-0.18269000000000002
53,-0.91961
54,1.2911
55,-0.91961
56,-0.91961
57,0.9963700000000001
58,-0.91961
59,0.5542199999999999
60,-0.33008000000000004
61,-0.91961
62,1.1438
63,-0.62484
64,2.765
65,-0.47746000000000005
66,-0.91961
67,2.6176
68,-0.18269000000000002
69,-0.91961
70,1.8807
71,-0.035311
72,-0.91961
73,1.4385
74,0.25945999999999997
75,-0.91961
76,0.9963700000000001
77,0.5542199999999999
78,-0.91961
79,0.8489899999999999
80,0.9963700000000001
81,-0.91961
82,0.11207
83,1.7333
84,-0.91961
85,-0.47746000000000005
86,2.4702
87,-0.91961
88,-0.91961
89,2.0281
90,-0.035311
91,-0.91961
92,0.8489899999999999
93,1.1438
94,-0.91961
95,-0.91961
