time,value
0,-2.3293
1,-2.3293
2,-2.3293
3,-2.3315
4,-2.3315
5,-2.3315
6,-2.336
7,-2.3448
8,-2.347
9,-2.3469
10,-2.3467
11,-2.3463
12,-2.3457
13,-2.345
14,-2.3442
15,-2.3432
16,-2.3424
17,-2.3434
18,-2.342
19,-2.3405
20,-2.3388
21,-2.3369999999999997
22,-2.3426
23,-2.3485
24,-2.3486
25,-2.3464
26,-2.3446
27,-2.3422
28,-2.3396
29,-2.3369
30,-2.334
31,-2.331
32,-2.33
33,-2.3268
34,-2.3234
35,-2.3199
36,-2.3172
37,-2.3136
38,-2.3206
39,-2.3247
40,-2.3207
41,-2.3166
42,-2.3124
43,-2.3081
44,-2.3037
45,-2.2992
46,-2.2977
47,-2.293
48,-2.2882
49,-2.2815
50,-2.2784
51,-2.2734
52,-2.2682
53,-2.263
54,-2.2577
55,-2.2524
56,-2.2483
57,-2.2428
58,-2.2372
59,-2.2315
60,-2.2258
61,-2.22
62,-2.2142
63,-2.2082
64,-2.2022
65,-2.1962
66,-2.1916
67,-2.1855
68,-2.1793
69,-2.173
70,-2.1667
71,-2.1603
72,-2.1539
73,-2.1474
74,-2.1409
75,-2.1343
76,-2.1277
77,-2.1227
78,-2.116
79,-2.1093
80,-2.1025
81,-2.0957
82,-2.0888
83,-2.0819
84,-2.075
85,-2.068
86,-2.061
87,-2.0557
88,-2.0486
89,-2.0402
90,-2.0331
91,-2.0259
92,-2.0188
93,-2.0115
94,-2.003
95,-1.9961
96,-1.99
97,-1.9846
98,-1.9773
99,-1.9688
100,-1.9626
101,-1.9558
102,-1.9491
103,-1.9418
104,-1.9345
105,-1.9259
106,-1.9186
107,-1.9131
108,-1.9057
109,-1.8983
110,-1.8898
111,-1.8824
112,-1.8751
113,-1.8676
114,-1.8602
115,-1.8516
116,-1.8441
117,-1.8385
118,-1.831
119,-1.8235
120,-1.8159
121,-1.8121
122,-1.8102
123,-1.8015
124,-1.7966
125,-1.7955
126,-1.7856
127,-1.7788
128,-1.7739
129,-1.7719999999999998
130,-1.7663
131,-1.7586
132,-1.751
133,-1.7423
134,-1.7346
135,-1.7258
136,-1.7195
137,-1.7154
138,-1.7077
139,-1.7001
140,-1.6924
141,-1.6836
142,-1.6759
143,-1.6682
144,-1.6604
145,-1.6533
146,-1.6471
147,-1.6394
148,-1.6336
149,-1.6259
150,-1.6181
151,-1.6093
152,-1.6015
153,-1.5937
154,-1.5859
155,-1.5781
156,-1.5692
157,-1.5651
158,-1.5611
159,-1.5533
160,-1.5454
161,-1.5366
162,-1.5288
163,-1.5209
164,-1.514
165,-1.508
166,-1.5019999999999998
167,-1.4942
168,-1.4883
169,-1.4794
170,-1.4715
171,-1.4637
172,-1.4577
173,-1.4517
174,-1.4448
175,-1.4369
176,-1.4281
177,-1.4192
178,-1.4162
179,-1.4072
180,-1.3994
181,-1.3915
182,-1.3836
183,-1.3757
184,-1.3668
185,-1.3589
186,-1.351
187,-1.3430000000000002
188,-1.3371
189,-1.3312
190,-1.3253
191,-1.3184
192,-1.3104
193,-1.3015
194,-1.2936
195,-1.2916
196,-1.2866
197,-1.2797
198,-1.2768
199,-1.2738
200,-1.2639
201,-1.255
202,-1.253
203,-1.249
204,-1.2411
205,-1.2361
206,-1.2321
207,-1.2252
208,-1.2223
209,-1.2193
210,-1.2094
211,-1.2005
212,-1.1995
213,-1.1956
214,-1.1866
215,-1.1787
216,-1.1707
217,-1.1638
218,-1.158
219,-1.1520000000000001
220,-1.1441
221,-1.1351
222,-1.1271
223,-1.1191
224,-1.1102
225,-1.1054
226,-1.0985
227,-1.0905
228,-1.0825
229,-1.0765
230,-1.0685
231,-1.0605
232,-1.0515
233,-1.0435
234,-1.0355
235,-1.0274
236,-1.0194
237,-1.0113
238,-1.0032
239,-0.99718
240,-0.9902200000000001
241,-0.9846
242,-0.9787600000000001
243,-0.9706899999999999
244,-0.96262
245,-0.9545399999999999
246,-0.9464600000000001
247,-0.9383600000000001
248,-0.9293799999999999
249,-0.9233
250,-0.9152
251,-0.90709
252,-0.89897
253,-0.89084
254,-0.8850399999999999
255,-0.8795
256,-0.87254
257,-0.8644299999999999
258,-0.85631
259,-0.85021
260,-0.8420799999999999
261,-0.83394
262,-0.8258
263,-0.81765
264,-0.8086399999999999
265,-0.8004899999999999
266,-0.79232
267,-0.7841600000000001
268,-0.77598
269,-0.76985
270,-0.76167
271,-0.75348
272,-0.74529
273,-0.7370899999999999
274,-0.7305
275,-0.7230800000000001
276,-0.7148899999999999
277,-0.7067
278,-0.6985
279,-0.6903
280,-0.6833199999999999
281,-0.6751199999999999
282,-0.6669
283,-0.65869
284,-0.65047
285,-0.64267
286,-0.63736
287,-0.63038
288,-0.62216
289,-0.6139399999999999
290,-0.60778
291,-0.59955
292,-0.59132
293,-0.58309
294,-0.57485
295,-0.5666
296,-0.55835
297,-0.5501
298,-0.54184
299,-0.53279
300,-0.52659
301,-0.5183300000000001
302,-0.5100600000000001
303,-0.50178
304,-0.4935
305,-0.48522
306,-0.47693
307,-0.46863999999999995
308,-0.46111
309,-0.45281000000000005
310,-0.44658000000000003
311,-0.43828
312,-0.42996999999999996
313,-0.42165
314,-0.41333000000000003
315,-0.40501
316,-0.39668000000000003
317,-0.39755
318,-0.39485
319,-0.38723
320,-0.38095999999999997
321,-0.37261
322,-0.36425
323,-0.35589
324,-0.34752
325,-0.33916
326,-0.33078
327,-0.32241
328,-0.31403000000000003
329,-0.30565
330,-0.29936
331,-0.29098
332,-0.28259
333,-0.2742
334,-0.2658
335,-0.2574
336,-0.249
337,-0.2406
338,-0.23219
339,-0.22378
340,-0.21746999999999997
341,-0.20906
342,-0.20064
343,-0.19365
344,-0.18884
345,-0.18327000000000002
346,-0.17486
347,-0.16645
348,-0.15735
349,-0.14894000000000002
350,-0.14052
351,-0.13639
352,-0.13155
353,-0.12315
354,-0.11474000000000001
355,-0.10564000000000001
356,-0.097232
357,-0.08881599999999999
358,-0.081826
359,-0.07700599999999999
360,-0.071436
361,-0.06513
362,-0.056719000000000006
363,-0.048307
364,-0.039214
365,-0.030797
366,-0.02238
367,-0.013958000000000002
368,-0.007724600000000001
369,-0.00080457
370,0.0076084
371,0.014599
372,0.023014
373,0.030003
374,0.034825999999999996
375,0.040398
376,0.048804
377,0.057214
378,0.065627
379,0.07472000000000001
380,0.083135
381,0.08945
382,0.09786900000000001
383,0.10343
384,0.10825
385,0.11523
386,0.12365
387,0.13205999999999998
388,0.14115
389,0.14957
390,0.15799000000000002
391,0.16430999999999998
392,0.17274
393,0.17753
394,0.18377000000000002
395,0.19286
396,0.20128
397,0.2097
398,0.21525999999999998
399,0.22007
400,0.22985
401,0.23615999999999998
402,0.24456999999999998
403,0.25298000000000004
404,0.25509
405,0.2614
406,0.26561
407,0.26771
408,0.27403
409,0.28245
410,0.29088
411,0.2972
412,0.30563
413,0.31406
414,0.32249
415,0.33093
416,0.33792
417,0.34268000000000004
418,0.34823000000000004
419,0.35666
420,0.36509
421,0.37351999999999996
422,0.37985
423,0.38895
424,0.39738
425,0.40581999999999996
426,0.41426
427,0.42271000000000003
428,0.42823999999999995
429,0.43298000000000003
430,0.43996999999999997
431,0.44841000000000003
432,0.45474
433,0.46384
434,0.47228000000000003
435,0.48072
436,0.48917
437,0.49762
438,0.50169
439,0.50643
440,0.5148699999999999
441,0.5239699999999999
442,0.5303
443,0.53874
444,0.54348
445,0.54757
446,0.55601
447,0.56445
448,0.5728800000000001
449,0.58133
450,0.58977
451,0.59821
452,0.60455
453,0.60536
454,0.60488
455,0.60424
456,0.60424
457,0.6127
458,0.62116
459,0.62539
460,0.62751
461,0.63597
462,0.64085
463,0.64552
464,0.65104
465,0.6594899999999999
466,0.66796
467,0.67642
468,0.68488
469,0.69335
470,0.70182
471,0.70754
472,0.7077600000000001
473,0.708
474,0.71649
475,0.72497
476,0.73345
477,0.7419399999999999
478,0.75043
479,0.7589199999999999
480,0.7668
481,0.77591
482,0.78167
483,0.7901699999999999
484,0.79867
485,0.80777
486,0.81628
487,0.82478
488,0.83329
489,0.8417899999999999
490,0.84665
491,0.84665
492,0.85515
493,0.86154
494,0.87005
495,0.8743
496,0.8764299999999999
497,0.8822200000000001
498,0.8907299999999999
499,0.8901399999999999
500,0.8901399999999999
501,0.8877799999999999
502,0.88661
503,0.88661
504,0.8842700000000001
505,0.8804
506,0.87187
507,0.8633299999999999
508,0.8548100000000001
509,0.8462799999999999
510,0.83775
511,0.8292200000000001
512,0.82011
513,0.81372
514,0.80519
515,0.79667
516,0.78815
517,0.77963
518,0.77112
519,0.7626
520,0.75408
521,0.7471
522,0.7426
523,0.74142
524,0.7329
525,0.72438
526,0.71527
527,0.70675
528,0.69823
529,0.69125
530,0.68676
531,0.68345
532,0.6743399999999999
533,0.6694899999999999
534,0.6656
535,0.6592
536,0.65068
537,0.6421600000000001
538,0.63305
539,0.62393
540,0.61908
541,0.61482
542,0.6063
543,0.59991
544,0.59565
545,0.5908
546,0.58228
547,0.57838
548,0.57177
549,0.56325
550,0.55472
551,0.5462
552,0.53768
553,0.5312899999999999
554,0.52277
555,0.51425
556,0.50573
557,0.49663
558,0.48811000000000004
559,0.4796
560,0.47108999999999995
561,0.46258
562,0.45407
563,0.44556999999999997
564,0.43918999999999997
565,0.43678
566,0.43073
567,0.42222
568,0.41311000000000003
569,0.4046
570,0.39914
571,0.39463000000000004
572,0.38552
573,0.37701
574,0.37003
575,0.36151
576,0.353
577,0.34389000000000003
578,0.33938
579,0.33181
580,0.32329
581,0.31418
582,0.30566
583,0.3033
584,0.2994
585,0.29241999999999996
586,0.28331
587,0.27885
588,0.27343
589,0.2649
590,0.26219000000000003
591,0.25578
592,0.24939
593,0.24725
594,0.24666999999999997
595,0.23756
596,0.22845
597,0.21934
598,0.21081
599,0.20867
600,0.20267000000000002
601,0.19355999999999998
602,0.18756
603,0.18314
604,0.17673
605,0.16819
606,0.15908
607,0.15054
608,0.14841
609,0.142
610,0.13773
611,0.1356
612,0.12707000000000002
613,0.11853
614,0.11213
615,0.1036
616,0.095073
617,0.086547
618,0.07802200000000001
619,0.069499
620,0.064064
621,0.059597000000000004
622,0.050483999999999994
623,0.041956
624,0.03556
625,0.027032
626,0.018509
627,0.0093984
628,0.00087543
629,-0.0076436
630,-0.016162
631,-0.025273
632,-0.029762
633,-0.037328
634,-0.045853
635,-0.052246
636,-0.060769000000000004
637,-0.069877
638,-0.078398
639,-0.08691499999999999
640,-0.096026
641,-0.09992899999999999
642,-0.10595
643,-0.11448
644,-0.12300000000000001
645,-0.12939
646,-0.1385
647,-0.14702
648,-0.15554
649,-0.16405
650,-0.17103
651,-0.17553
652,-0.18097
653,-0.18949000000000002
654,-0.19801
655,-0.20499
656,-0.21043
657,-0.21491
658,-0.21975
659,-0.22887
660,-0.23739000000000002
661,-0.24591999999999997
662,-0.2498
663,-0.25424
664,-0.26278
665,-0.26918000000000003
666,-0.27829
667,-0.28683000000000003
668,-0.29127
669,-0.29725
670,-0.30635999999999997
671,-0.31019
672,-0.31458
673,-0.31679
674,-0.32111999999999996
675,-0.32809
676,-0.3356
677,-0.33989
678,-0.34042
679,-0.34149
680,-0.34359
681,-0.34565
682,-0.34617
683,-0.34605
684,-0.34325
685,-0.33728
686,-0.33396
687,-0.33375
688,-0.32776
689,-0.3196
690,-0.32149
691,-0.31856999999999996
692,-0.31038000000000004
693,-0.30696999999999997
694,-0.30878
695,-0.30839
696,-0.3097
697,-0.30406
698,-0.29581999999999997
699,-0.29534
700,-0.29224
701,-0.28397
702,-0.28084000000000003
703,-0.28244
704,-0.27374
705,-0.26504
706,-0.25891
707,-0.25021
708,-0.24151
709,-0.2328
710,-0.23215999999999998
711,-0.22893000000000002
712,-0.22021999999999997
713,-0.21186999999999998
714,-0.20315
715,-0.20207
716,-0.20097
717,-0.19478
718,-0.18605
719,-0.17732
720,-0.16894
721,-0.16021
722,-0.15183
723,-0.15100999999999998
724,-0.14513
725,-0.13639
726,-0.12983
727,-0.12142
728,-0.11268
729,-0.10393
730,-0.09519
731,-0.08644400000000001
732,-0.083354
733,-0.081798
734,-0.07335900000000001
735,-0.064606
736,-0.058039
737,-0.049283999999999994
738,-0.040529
739,-0.031774000000000004
740,-0.023018
741,-0.014261000000000001
742,-0.0055036
743,0.0032544000000000006
744,0.012010999999999999
745,0.02077
746,0.027339
747,0.036099
748,0.044857999999999995
749,0.05362000000000001
750,0.06238
751,0.071141
752,0.079903
753,0.088667
754,0.097429
755,0.10619
756,0.11277000000000001
757,0.12153
758,0.1303
759,0.13906
760,0.14754
761,0.1563
762,0.16507
763,0.17412
764,0.18289
765,0.19138
766,0.20015
767,0.20672
768,0.21549000000000001
769,0.22454000000000002
770,0.23331
771,0.24208000000000002
772,0.25085
773,0.25961999999999996
774,0.26866999999999996
775,0.27199
776,0.27695
777,0.28352
778,0.29229
779,0.30106
780,0.30982
781,0.31888
782,0.32764
783,0.33641
784,0.34518000000000004
785,0.35395
786,0.36272
787,0.3693
788,0.37806999999999996
789,0.38683
790,0.39561
791,0.40438
792,0.41315
793,0.42165
794,0.43041999999999997
795,0.43918999999999997
796,0.44796
797,0.45455
798,0.46331999999999995
799,0.47208999999999995
800,0.47568
801,0.47708
802,0.48586
803,0.49463999999999997
804,0.50342
805,0.5122
806,0.52098
807,0.52756
808,0.53247
809,0.53572
810,0.5445
811,0.55161
812,0.5538
813,0.55819
814,0.56697
815,0.57575
816,0.58233
817,0.58453
818,0.58865
819,0.59743
820,0.60595
821,0.61473
822,0.61615
823,0.61953
824,0.62832
825,0.6371
826,0.64589
827,0.6524800000000001
828,0.6612600000000001
829,0.67005
830,0.67883
831,0.68762
832,0.6964100000000001
833,0.70495
834,0.7137399999999999
835,0.72253
836,0.73132
837,0.74011
838,0.7467
839,0.75549
840,0.75674
841,0.7582399999999999
842,0.7670399999999999
843,0.77583
844,0.78463
845,0.79342
846,0.8022199999999999
847,0.81079
848,0.81738
849,0.8261799999999999
850,0.8349700000000001
851,0.84377
852,0.85257
853,0.86159
854,0.8703799999999999
855,0.8789600000000001
856,0.88775
857,0.8967700000000001
858,0.9033700000000001
859,0.91217
860,0.92096
861,0.92976
862,0.9385600000000001
863,0.9473600000000001
864,0.95616
865,0.96495
866,0.97375
867,0.98255
868,0.98695
869,0.98915
870,0.99355
871,1.0001
872,1.0024
873,1.0067
874,1.0155
875,1.0241
876,1.0329
877,1.0367
878,1.0361
879,1.0447
880,1.0511
881,1.0503
882,1.0517
883,1.0513
884,1.0557
885,1.0646
886,1.0734
887,1.0822
888,1.0888
889,1.0888
890,1.0914
891,1.0914
892,1.0938
893,1.1026
894,1.1026
895,1.107
896,1.1158
897,1.1244
898,1.131
899,1.1374
900,1.1389
901,1.1451
902,1.1540000000000001
903,1.1628
904,1.1714
905,1.1802
906,1.189
907,1.1883
908,1.1922
909,1.1989
910,1.2077
911,1.2163
912,1.2251
913,1.234
914,1.2404
915,1.242
916,1.2483
917,1.2571
918,1.2659
919,1.2725
920,1.2813
921,1.2902
922,1.2990000000000002
923,1.3077
924,1.3165
925,1.3253
926,1.3341
927,1.3429
928,1.3469
929,1.3465
930,1.355
931,1.3615
932,1.3609
933,1.3607
934,1.3605
935,1.3602
936,1.3599
937,1.3598
938,1.3593
939,1.3589
940,1.3501
941,1.3413
942,1.3324
943,1.3236
944,1.3148
945,1.306
946,1.2971
947,1.2883
948,1.2795
949,1.2728
950,1.264
951,1.26
952,1.2581
953,1.2494
954,1.2406
955,1.2318
956,1.2229999999999999
957,1.2141
958,1.2053
959,1.1987
960,1.1899
961,1.181
962,1.1722
963,1.1652
964,1.1625
965,1.1537
966,1.1448
967,1.136
968,1.1272
969,1.1206
970,1.1117
971,1.1029
972,1.0941
973,1.0853
974,1.0833
975,1.0838
976,1.0821
977,1.0823
978,1.0757
979,1.0668
980,1.0602
981,1.0514
982,1.0448
983,1.0424
984,1.0378
985,1.0288
986,1.024
987,1.0237
988,1.0149
989,1.0061
990,0.99945
991,0.9906200000000001
992,0.9818
993,0.9773799999999999
994,0.9757100000000001
995,0.9692299999999999
996,0.9604
997,0.95158
998,0.94275
999,0.9340700000000001
1000,0.92745
1001,0.91863
1002,0.9098
1003,0.9009799999999999
1004,0.8921600000000001
1005,0.8883200000000001
1006,0.88656
1007,0.87774
1008,0.86892
1009,0.8601
1010,0.8534799999999999
1011,0.8446600000000001
1012,0.8358399999999999
1013,0.8270200000000001
1014,0.8182
1015,0.80938
1016,0.80056
1017,0.79569
1018,0.7929
1019,0.78408
1020,0.77746
1021,0.76864
1022,0.7598199999999999
1023,0.7509899999999999
1024,0.74217
1025,0.73335
1026,0.72453
1027,0.7157100000000001
1028,0.7067399999999999
1029,0.69792
1030,0.6913
1031,0.68248
1032,0.67366
1033,0.66484
1034,0.65601
1035,0.6472
1036,0.63837
1037,0.62955
1038,0.62073
1039,0.6119100000000001
1040,0.6053
1041,0.59648
1042,0.58765
1043,0.585
1044,0.58221
1045,0.57325
1046,0.5664899999999999
1047,0.56428
1048,0.55987
1049,0.55105
1050,0.54223
1051,0.53561
1052,0.5334
1053,0.52913
1054,0.52046
1055,0.5163399999999999
1056,0.51413
1057,0.50531
1058,0.49649
1059,0.48767
1060,0.47885
1061,0.47663999999999995
1062,0.47413999999999995
1063,0.46531999999999996
1064,0.45635
1065,0.44753000000000004
1066,0.44254
1067,0.44005
1068,0.43123
1069,0.42241000000000006
1070,0.41358
1071,0.40697
1072,0.39814
1073,0.39373
1074,0.3921
1075,0.38578
1076,0.37696
1077,0.36814
1078,0.35931
1079,0.35049
1080,0.34183
1081,0.33521
1082,0.32639
1083,0.31756999999999996
1084,0.30875
1085,0.30496999999999996
1086,0.30105
1087,0.29224
1088,0.28342
1089,0.27460999999999997
1090,0.26579
1091,0.25918
1092,0.25035999999999997
1093,0.24155
1094,0.23273000000000002
1095,0.22391999999999998
1096,0.2151
1097,0.20628000000000002
1098,0.19747
1099,0.18865
1100,0.17984
1101,0.17323
1102,0.16442
1103,0.1556
1104,0.14695999999999998
1105,0.13815
1106,0.12934
1107,0.12052
1108,0.11170999999999999
1109,0.1029
1110,0.094085
1111,0.087476
1112,0.078663
1113,0.077193
1114,0.075558
1115,0.06675
1116,0.057941
1117,0.049135000000000005
1118,0.040326999999999995
1119,0.031519
1120,0.022713
1121,0.013905
1122,0.0073013999999999996
1123,-0.0015046
1124,-0.010311
1125,-0.019117
1126,-0.027923000000000003
1127,-0.033106000000000003
1128,-0.035878
1129,-0.044686000000000003
1130,-0.053497
1131,-0.06230499999999999
1132,-0.069102
1133,-0.07791000000000001
1134,-0.08489
1135,-0.08781900000000001
1136,-0.09460700000000001
1137,-0.10342
1138,-0.11241
1139,-0.12122000000000001
1140,-0.12190999999999999
1141,-0.12683
1142,-0.1314
1143,-0.13155999999999998
1144,-0.13219
1145,-0.1328
1146,-0.13337000000000002
1147,-0.13392
1148,-0.13405
1149,-0.12755999999999998
1150,-0.12586
1151,-0.11727
1152,-0.11077000000000001
1153,-0.10901
1154,-0.10712
1155,-0.098393
1156,-0.09407599999999999
1157,-0.09225499999999999
1158,-0.08802
1159,-0.079185
1160,-0.07035
1161,-0.061604
1162,-0.054978
1163,-0.046143
1164,-0.041895
1165,-0.042211
1166,-0.0425
1167,-0.040551
1168,-0.040785
1169,-0.040991
1170,-0.034408
1171,-0.025569
1172,-0.018985
1173,-0.010145999999999999
1174,-0.008060600000000001
1175,-0.005991600000000001
1176,-0.006109600000000001
1177,-0.0039876
1178,0.0048544
1179,0.013694999999999999
1180,0.022536
1181,0.03136
1182,0.040201
1183,0.044606
1184,0.046768000000000004
1185,0.053386
1186,0.062227
1187,0.07106900000000001
1188,0.07991000000000001
1189,0.088751
1190,0.097592
1191,0.10643
1192,0.11528
1193,0.12190999999999999
1194,0.13074000000000002
1195,0.13959000000000002
1196,0.14843
1197,0.15727
1198,0.16610999999999998
1199,0.17495
1200,0.18379
1201,0.19263
1202,0.20147
1203,0.20811
1204,0.21695
1205,0.22136999999999998
1206,0.2258
1207,0.23465
1208,0.24349
1209,0.25233
1210,0.26116999999999996
1211,0.27001
1212,0.27885
1213,0.28548
1214,0.29433000000000004
1215,0.30317
1216,0.31201999999999996
1217,0.32086
1218,0.3297
1219,0.33853
1220,0.34738
1221,0.35622
1222,0.36506
1223,0.37169
1224,0.38054
1225,0.38937
1226,0.39821
1227,0.40705
1228,0.41589
1229,0.42473
1230,0.43356999999999996
1231,0.44242
1232,0.45126000000000005
1233,0.45788999999999996
1234,0.46673000000000003
1235,0.47557
1236,0.48441000000000006
1237,0.49325
1238,0.5020899999999999
1239,0.51094
1240,0.51979
1241,0.52863
1242,0.53746
1243,0.54409
1244,0.55294
1245,0.5617800000000001
1246,0.57062
1247,0.5794600000000001
1248,0.5883
1249,0.59715
1250,0.6059899999999999
1251,0.61483
1252,0.62367
1253,0.6281100000000001
1254,0.63036
1255,0.63481
1256,0.64365
1257,0.65251
1258,0.6613600000000001
1259,0.66582
1260,0.66803
1261,0.67687
1262,0.68571
1263,0.69455
1264,0.70118
1265,0.70339
1266,0.70777
1267,0.7166100000000001
1268,0.72545
1269,0.73429
1270,0.7431300000000001
1271,0.75198
1272,0.7608199999999999
1273,0.76966
1274,0.76972
1275,0.7742399999999999
1276,0.78308
1277,0.79192
1278,0.80079
1279,0.8096300000000001
1280,0.81847
1281,0.82299
1282,0.82755
1283,0.83639
1284,0.8430200000000001
1285,0.8518600000000001
1286,0.8607
1287,0.8695799999999999
1288,0.8784200000000001
1289,0.88726
1290,0.8961
1291,0.90494
1292,0.9115700000000001
1293,0.91394
1294,0.9162899999999999
1295,0.9251299999999999
1296,0.9339700000000001
1297,0.9428
1298,0.9516399999999999
1299,0.9605299999999999
1300,0.9693700000000001
1301,0.97821
1302,0.98705
1303,0.9958899999999999
1304,1.0004
1305,1.0028
1306,1.0073
1307,1.0161
1308,1.025
1309,1.0338
1310,1.0427
1311,1.0515
1312,1.0603
1313,1.0692
1314,1.0758
1315,1.0846
1316,1.0935
1317,1.1023
1318,1.1112
1319,1.12
1320,1.1288
1321,1.1377
1322,1.1466
1323,1.1554
1324,1.1642
1325,1.1709
1326,1.1797
1327,1.1885
1328,1.1974
1329,1.2062
1330,1.213
1331,1.2154
1332,1.2222
1333,1.2311
1334,1.2313
1335,1.2316
1336,1.2341
1337,1.2344
1338,1.2346
1339,1.2369
1340,1.2457
1341,1.2545
1342,1.2634
1343,1.27
1344,1.2722
1345,1.2719
1346,1.2716
1347,1.2735
1348,1.2732
1349,1.273
1350,1.2818
1351,1.2907
1352,1.2995
1353,1.3083
1354,1.3172
1355,1.3238
1356,1.3326
1357,1.3372
1358,1.3397
1359,1.3486
1360,1.3574
1361,1.3662
1362,1.3751
1363,1.3840000000000001
1364,1.3928
1365,1.3995
1366,1.4083
1367,1.4108
1368,1.4154
1369,1.4243
1370,1.4331
1371,1.4419
1372,1.4508
1373,1.4596
1374,1.4685
1375,1.4752
1376,1.4839
1377,1.4928
1378,1.5017
1379,1.5105
1380,1.5193
1381,1.5281
1382,1.537
1383,1.5458
1384,1.5547
1385,1.5613
1386,1.5701
1387,1.579
1388,1.5857
1389,1.5882
1390,1.5906
1391,1.5907
1392,1.5908
1393,1.5912
1394,1.5916
1395,1.5919
1396,1.5919
1397,1.5876
1398,1.5787
1399,1.5723
1400,1.5705
1401,1.5662
1402,1.5575
1403,1.5487
1404,1.5398
1405,1.5355
1406,1.5355
1407,1.5267
1408,1.5179
1409,1.5090000000000001
1410,1.5068
1411,1.5046
1412,1.4957
1413,1.4868
1414,1.4780000000000002
1415,1.4692
1416,1.4626
1417,1.4537
1418,1.4449
1419,1.4361
1420,1.4297
1421,1.4301
1422,1.4214
1423,1.4126
1424,1.4038
1425,1.395
1426,1.3885
1427,1.3796
1428,1.3708
1429,1.3643
1430,1.3626
1431,1.3563
1432,1.3474
1433,1.3387
1434,1.3299
1435,1.3256
1436,1.3256
1437,1.3168
1438,1.308
1439,1.2992
1440,1.2948
1441,1.2948
1442,1.2879
1443,1.2789
1444,1.2766
1445,1.2699
1446,1.2633
1447,1.2545
1448,1.2457
1449,1.2391
1450,1.2369
1451,1.2327
1452,1.2239
1453,1.2152
1454,1.2064
1455,1.2046
1456,1.2027
1457,1.1983
1458,1.1894
1459,1.1806
1460,1.1718
1461,1.163
1462,1.1564
1463,1.1537
1464,1.1446
1465,1.1377
1466,1.135
1467,1.1325
1468,1.1237
1469,1.1148
1470,1.1059
1471,1.0971
1472,1.0882
1473,1.0837
1474,1.081
1475,1.0763
1476,1.0675
1477,1.0609
1478,1.052
1479,1.0432
1480,1.0344
1481,1.0255
1482,1.0167
1483,1.0079
1484,0.9990600000000001
1485,0.99024
1486,0.98855
1487,0.98674
1488,0.9779100000000001
1489,0.96909
1490,0.96026
1491,0.95144
1492,0.9426200000000001
1493,0.9339299999999999
1494,0.9251
1495,0.9162799999999999
1496,0.90746
1497,0.90084
1498,0.89202
1499,0.8831899999999999
1500,0.8743700000000001
1501,0.86555
1502,0.85672
1503,0.8479
1504,0.8390799999999999
1505,0.83025
1506,0.8214299999999999
1507,0.81481
1508,0.80599
1509,0.7971699999999999
1510,0.78835
1511,0.77952
1512,0.7707
1513,0.76188
1514,0.75305
1515,0.7442300000000001
1516,0.74203
1517,0.7376199999999999
1518,0.7287899999999999
1519,0.71997
1520,0.71336
1521,0.71115
1522,0.70233
1523,0.69528
1524,0.69471
1525,0.68575
1526,0.67693
1527,0.6703100000000001
1528,0.6614899999999999
1529,0.65266
1530,0.64384
1531,0.6350100000000001
1532,0.6261899999999999
1533,0.61957
1534,0.61737
1535,0.61075
1536,0.60634
1537,0.6041300000000001
1538,0.59972
1539,0.5909
1540,0.58207
1541,0.57325
1542,0.56443
1543,0.5556
1544,0.54664
1545,0.53782
1546,0.52899
1547,0.52017
1548,0.51355
1549,0.50473
1550,0.4999
1551,0.49506999999999995
1552,0.48625
1553,0.47741999999999996
1554,0.4686
1555,0.45976999999999996
1556,0.45081000000000004
1557,0.44198999999999994
1558,0.43978
1559,0.43758
1560,0.42875
1561,0.42655
1562,0.42213
1563,0.41331
1564,0.40448
1565,0.39566
1566,0.3867
1567,0.37787
1568,0.37126
1569,0.36243000000000003
1570,0.35541
1571,0.35268
1572,0.34606
1573,0.33724
1574,0.32841
1575,0.31958000000000003
1576,0.31076
1577,0.30193000000000003
1578,0.29531
1579,0.28636
1580,0.27753
1581,0.2687
1582,0.25988
1583,0.25105
1584,0.24222
1585,0.2334
1586,0.23289
1587,0.22810999999999998
1588,0.22149000000000002
1589,0.21266
1590,0.20384000000000002
1591,0.19501
1592,0.18617999999999998
1593,0.17735
1594,0.1684
1595,0.15969
1596,0.15087
1597,0.14204
1598,0.13321
1599,0.12659
1600,0.11775999999999999
1601,0.10893
1602,0.10011
1603,0.09128
1604,0.082452
1605,0.073626
1606,0.06479800000000001
1607,0.055972
1608,0.052077
1609,0.050277999999999996
1610,0.043660000000000004
1611,0.034976
1612,0.026151999999999998
1613,0.017329
1614,0.015704
1615,0.013951
1616,0.005130399999999999
1617,-0.0036885999999999998
1618,-0.012354
1619,-0.018966999999999998
1620,-0.027786
1621,-0.034081
1622,-0.035626
1623,-0.042069
1624,-0.050713999999999995
1625,-0.050009
1626,-0.051667
1627,-0.060291
1628,-0.06652000000000001
1629,-0.068142
1630,-0.07215
1631,-0.080752
1632,-0.07993
1633,-0.079081
1634,-0.078202
1635,-0.077297
1636,-0.076365
1637,-0.075403
1638,-0.07711
1639,-0.076862
1640,-0.073657
1641,-0.07042799999999999
1642,-0.06717000000000001
1643,-0.062513
1644,-0.059775999999999996
1645,-0.056476
1646,-0.05563
1647,-0.055345000000000005
1648,-0.054768
1649,-0.0517
1650,-0.046724
1651,-0.037666000000000005
1652,-0.032686
1653,-0.031466
1654,-0.022404
1655,-0.013649000000000001
1656,-0.004586600000000001
1657,0.0022904
1658,0.0057294
1659,0.0085524
1660,0.017621
1661,0.022636
1662,0.026126
1663,0.033013
1664,0.041755
1665,0.050825999999999996
1666,0.059570000000000005
1667,0.068312
1668,0.07738300000000001
1669,0.08089600000000001
1670,0.083751
1671,0.092489
1672,0.10123
1673,0.10997
1674,0.11904
1675,0.12778
1676,0.13652
1677,0.14526
1678,0.154
1679,0.16275
1680,0.16745
1681,0.17097
1682,0.17602
1683,0.18475
1684,0.19349
1685,0.20223
1686,0.21097
1687,0.2197
1688,0.22844
1689,0.23751999999999998
1690,0.24406999999999998
1691,0.25281
1692,0.26155
1693,0.27029000000000003
1694,0.27903
1695,0.28778000000000004
1696,0.29533000000000004
1697,0.29886
1698,0.30541
1699,0.31415
1700,0.3207
1701,0.32944
1702,0.33818000000000004
1703,0.34692
1704,0.35566
1705,0.3644
1706,0.37346999999999997
1707,0.38221
1708,0.39095
1709,0.39969
1710,0.40625
1711,0.41498999999999997
1712,0.42373999999999995
1713,0.43248000000000003
1714,0.44122
1715,0.44997
1716,0.45871000000000006
1717,0.46746000000000004
1718,0.47621
1719,0.48495
1720,0.49151000000000006
1721,0.50026
1722,0.5090100000000001
1723,0.51776
1724,0.5230899999999999
1725,0.5284399999999999
1726,0.53751
1727,0.5462600000000001
1728,0.55533
1729,0.56003
1730,0.5632
1731,0.56639
1732,0.57513
1733,0.58387
1734,0.5926100000000001
1735,0.60135
1736,0.6100899999999999
1737,0.61883
1738,0.6279
1739,0.63664
1740,0.6453899999999999
1741,0.65194
1742,0.66069
1743,0.6672399999999999
1744,0.67075
1745,0.67394
1746,0.6826800000000001
1747,0.69142
1748,0.70049
1749,0.70553
1750,0.71126
1751,0.7137899999999999
1752,0.7225199999999999
1753,0.73125
1754,0.7399899999999999
1755,0.74907
1756,0.7578
1757,0.76654
1758,0.77527
1759,0.77882
1760,0.78641
1761,0.79296
1762,0.80169
1763,0.81077
1764,0.8195
1765,0.8282299999999999
1766,0.8336399999999999
1767,0.8372299999999999
1768,0.84595
1769,0.8546799999999999
1770,0.86341
1771,0.8699600000000001
1772,0.87869
1773,0.8874200000000001
1774,0.89615
1775,0.9048799999999999
1776,0.91361
1777,0.92269
1778,0.93142
1779,0.94016
1780,0.94889
1781,0.9551
1782,0.96383
1783,0.97257
1784,0.98164
1785,0.9903799999999999
1786,0.9991200000000001
1787,1.0079
1788,1.0166
1789,1.0253
1790,1.0285
1791,1.0296
1792,1.0309
1793,1.0324
1794,1.036
1795,1.0374
1796,1.0378
1797,1.0381
1798,1.0469
1799,1.0556
1800,1.0578
1801,1.0599
1802,1.0665
1803,1.0748
1804,1.0756
1805,1.0789
1806,1.0876
1807,1.0894
1808,1.0916
1809,1.1004
1810,1.1025
1811,1.1069
1812,1.1113
1813,1.12
1814,1.1291
1815,1.1378
1816,1.1465
1817,1.1553
1818,1.1588
1819,1.1621
1820,1.1708
1821,1.1795
1822,1.1861
1823,1.1952
1824,1.2039
1825,1.2126
1826,1.2214
1827,1.2286
1828,1.2322
1829,1.2391
1830,1.2478
1831,1.2565
1832,1.2635
1833,1.2722
1834,1.2809
1835,1.2831
1836,1.2856
1837,1.2947
1838,1.3038
1839,1.3067
1840,1.3114
1841,1.3205
1842,1.3227
1843,1.3274
1844,1.3361
1845,1.3394
1846,1.3408
1847,1.3412
1848,1.3423
1849,1.3430000000000002
1850,1.3434
1851,1.3434
1852,1.3434
1853,1.3369
1854,1.3325
1855,1.3304
1856,1.3238
1857,1.3151
1858,1.3064
1859,1.2977
1860,1.2890000000000001
1861,1.2803
1862,1.2737
1863,1.2646
1864,1.2563
1865,1.2472
1866,1.2385
1867,1.2298
1868,1.2211
1869,1.2128
1870,1.2041
1871,1.1954
1872,1.1888
1873,1.1801
1874,1.1718
1875,1.1734
1876,1.1698
1877,1.1612
1878,1.1525
1879,1.1442
1880,1.1355
1881,1.1272
1882,1.1228
1883,1.1207
1884,1.112
1885,1.1033
1886,1.0942
1887,1.092
1888,1.0894
1889,1.0882
1890,1.0859999999999999
1891,1.0774
1892,1.0687
1893,1.0621
1894,1.0535
1895,1.0513
1896,1.0503
1897,1.0442
1898,1.0356
1899,1.035
1900,1.0329
1901,1.0242
1902,1.0155
1903,1.0090000000000001
1904,1.0003
1905,0.99165
1906,0.9868899999999999
1907,0.98345
1908,0.97435
1909,0.96659
1910,0.9627600000000001
1911,0.95625
1912,0.9475600000000001
1913,0.94105
1914,0.9323600000000001
1915,0.9232600000000001
1916,0.91458
1917,0.9059
1918,0.8968
1919,0.89297
1920,0.8856299999999999
1921,0.87695
1922,0.86826
1923,0.86175
1924,0.85306
1925,0.8443700000000001
1926,0.8356899999999999
1927,0.82701
1928,0.8183199999999999
1929,0.8096399999999999
1930,0.80096
1931,0.79228
1932,0.7836
1933,0.77709
1934,0.76841
1935,0.75973
1936,0.75105
1937,0.74238
1938,0.7337
1939,0.7250300000000001
1940,0.71635
1941,0.70768
1942,0.69901
1943,0.69814
1944,0.6977300000000001
1945,0.68906
1946,0.6804
1947,0.67174
1948,0.66308
1949,0.65442
1950,0.64576
1951,0.6371
1952,0.63315
1953,0.62966
1954,0.62317
1955,0.6145
1956,0.6058399999999999
1957,0.59718
1958,0.5885199999999999
1959,0.5794100000000001
1960,0.57075
1961,0.56209
1962,0.55343
1963,0.54478
1964,0.53828
1965,0.52963
1966,0.5209699999999999
1967,0.51232
1968,0.50366
1969,0.49501000000000006
1970,0.48636
1971,0.47771
1972,0.47373000000000004
1973,0.46805
1974,0.46155
1975,0.4529
1976,0.44423999999999997
1977,0.43513999999999997
1978,0.42648
1979,0.41783000000000003
1980,0.40918000000000004
1981,0.40349
1982,0.39998
1983,0.39087
1984,0.38438
1985,0.37572
1986,0.36707
1987,0.35841
1988,0.34976
1989,0.3411
1990,0.33245
1991,0.3238
1992,0.31515
1993,0.30604000000000003
1994,0.29956
1995,0.29091
1996,0.28226
1997,0.27362
1998,0.26497
1999,0.26142
2000,0.25743
2001,0.24833000000000002
2002,0.24138
2003,0.23742
2004,0.2322
2005,0.22354000000000002
2006,0.21488000000000002
2007,0.20622
2008,0.19755999999999999
2009,0.18891
2010,0.1798
2011,0.17115
2012,0.16249
2013,0.15384
2014,0.14735
2015,0.1387
2016,0.13005
2017,0.1214
2018,0.1157
2019,0.11173
2020,0.10307999999999999
2021,0.094418
2022,0.085765
2023,0.077114
2024,0.068463
2025,0.061975
2026,0.053326
2027,0.044677
2028,0.03603
2029,0.027386
2030,0.018741
2031,0.010097
2032,0.0067134000000000004
2033,0.0064454
2034,0.00045143
2035,-0.0060226
2036,-0.014652000000000002
2037,-0.023278999999999998
2038,-0.031906
2039,-0.040045
2040,-0.048667
2041,-0.05729
2042,-0.06591
2043,-0.074528
2044,-0.077346
2045,-0.075839
2046,-0.081789
2047,-0.090391
2048,-0.098483
2049,-0.10442
2050,-0.10664000000000001
2051,-0.10989000000000002
2052,-0.11847
2053,-0.12705999999999998
2054,-0.13564
2055,-0.14207999999999998
2056,-0.15066
2057,-0.1587
2058,-0.16727
2059,-0.17585
2060,-0.18442
2061,-0.19299000000000002
2062,-0.20155
2063,-0.21011999999999997
2064,-0.21868
2065,-0.22566
2066,-0.23421999999999998
2067,-0.24223000000000003
2068,-0.25078
2069,-0.25934
2070,-0.26789
2071,-0.27644
2072,-0.28499
2073,-0.29084
2074,-0.29069
2075,-0.29167
2076,-0.3002
2077,-0.30815
2078,-0.31668
2079,-0.31976
2080,-0.31951
2081,-0.3253
2082,-0.3338
2083,-0.3417
2084,-0.34807
2085,-0.34775
2086,-0.34801
2087,-0.35649000000000003
2088,-0.36435
2089,-0.37282
2090,-0.37790999999999997
2091,-0.37746999999999997
2092,-0.38528
2093,-0.39032
2094,-0.3898
2095,-0.3927
2096,-0.39902
2097,-0.40678000000000003
2098,-0.4152
2099,-0.41806000000000004
2100,-0.41744
2101,-0.42305
2102,-0.43076000000000003
2103,-0.43916000000000005
2104,-0.44685
2105,-0.44613
2106,-0.4468
2107,-0.45516999999999996
2108,-0.46282
2109,-0.47118000000000004
2110,-0.47526999999999997
2111,-0.47234
2112,-0.48068
2113,-0.48545
2114,-0.48246000000000006
2115,-0.47944
2116,-0.47923000000000004
2117,-0.47617
2118,-0.47307
2119,-0.47279
2120,-0.48027
2121,-0.48202
2122,-0.47881999999999997
2123,-0.47766000000000003
2124,-0.4744
2125,-0.47358999999999996
2126,-0.47276999999999997
2127,-0.46947
2128,-0.46615
2129,-0.46531000000000006
2130,-0.46075
2131,-0.45737
2132,-0.44836000000000004
2133,-0.44223
2134,-0.4368
2135,-0.43017
2136,-0.42405
2137,-0.41912
2138,-0.41366
2139,-0.40701
2140,-0.39799999999999996
2141,-0.39134
2142,-0.38584
2143,-0.37771
2144,-0.36871
2145,-0.36058
2146,-0.35651
2147,-0.35101
2148,-0.34434000000000003
2149,-0.33621
2150,-0.32721
2151,-0.31908000000000003
2152,-0.31240999999999997
2153,-0.3069
2154,-0.29877
2155,-0.28978000000000004
2156,-0.28165
2157,-0.27671
2158,-0.2712
2159,-0.26539
2160,-0.2564
2161,-0.24827
2162,-0.24015
2163,-0.2326
2164,-0.22794
2165,-0.21895
2166,-0.21314
2167,-0.20847
2168,-0.20063
2169,-0.19252
2170,-0.18441
2171,-0.17542
2172,-0.1673
2173,-0.15917
2174,-0.15365
2175,-0.14898
2176,-0.14087
2177,-0.13477999999999998
2178,-0.12579
2179,-0.11767000000000001
2180,-0.10954000000000001
2181,-0.10171000000000001
2182,-0.096185
2183,-0.08922000000000001
2184,-0.081099
2185,-0.07210499999999999
2186,-0.063978
2187,-0.057882
2188,-0.049748
2189,-0.042211
2190,-0.037565
2191,-0.029442000000000003
2192,-0.021314
2193,-0.013183000000000002
2194,-0.0041796
2195,0.0039564
2196,0.012098999999999999
2197,0.018209
2198,0.026035000000000003
2199,0.031519
2200,0.038486
2201,0.047488999999999996
2202,0.052986
2203,0.057628
2204,0.065755
2205,0.074753
2206,0.082885
2207,0.087818
2208,0.093327
2209,0.099133
2210,0.10726
2211,0.11625999999999999
2212,0.12439000000000001
2213,0.13193
2214,0.13860999999999998
2215,0.14673
2216,0.15573
2217,0.16182
2218,0.16675
2219,0.17227
2220,0.17808
2221,0.18708
2222,0.19376
2223,0.19729000000000002
2224,0.20628000000000002
2225,0.21324
2226,0.2188
2227,0.22665
2228,0.23360999999999998
2229,0.23740999999999998
2230,0.243
2231,0.24995
2232,0.25894
2233,0.26703000000000005
2234,0.27601
2235,0.27958
2236,0.28518000000000004
2237,0.28879
2238,0.29463
2239,0.3036
2240,0.30924
2241,0.31801999999999997
2242,0.32606999999999997
2243,0.33504
2244,0.34310999999999997
2245,0.34784
2246,0.3535
2247,0.36246
2248,0.36941999999999997
2249,0.37306999999999996
2250,0.37675
2251,0.38245
2252,0.38616
2253,0.3899
2254,0.39576999999999996
2255,0.40471999999999997
2256,0.41153
2257,0.4153
2258,0.42128999999999994
2259,0.43023999999999996
2260,0.43401000000000006
2261,0.4378
2262,0.4436
2263,0.44647
2264,0.44743
2265,0.44935
2266,0.45224
2267,0.45121000000000006
2268,0.45315
2269,0.45703999999999995
2270,0.45008000000000004
2271,0.44215
2272,0.43423
2273,0.42631
2274,0.4184
2275,0.41048999999999997
2276,0.40258
2277,0.39764
2278,0.3927
2279,0.38479
2280,0.37688
2281,0.37096
2282,0.36405
2283,0.35613
2284,0.34723000000000004
2285,0.33931999999999995
2286,0.33142
2287,0.32450999999999997
2288,0.31759
2289,0.31069
2290,0.30578
2291,0.29686999999999997
2292,0.28894000000000003
2293,0.28101
2294,0.27211
2295,0.26419000000000004
2296,0.25727
2297,0.25136
2298,0.24345999999999998
2299,0.23751
2300,0.2296
2301,0.2207
2302,0.21279
2303,0.20488
2304,0.20290999999999998
2305,0.19797
2306,0.18908
2307,0.18018
2308,0.17722000000000002
2309,0.17524
2310,0.16735
2311,0.16538
2312,0.16243
2313,0.15556
2314,0.14965
2315,0.14668
2316,0.14174
2317,0.13285999999999998
2318,0.12297000000000001
2319,0.11707000000000001
2320,0.11510999999999999
2321,0.10920999999999999
2322,0.10135
2323,0.093499
2324,0.08565199999999999
2325,0.077812
2326,0.069977
2327,0.06112000000000001
2328,0.05329299999999999
2329,0.047427
2330,0.039611
2331,0.0318
2332,0.023995
2333,0.018928999999999998
2334,0.012837000000000001
2335,0.0050224
2336,-0.0027865999999999998
2337,-0.011631
2338,-0.019431
2339,-0.025277
2340,-0.034112
2341,-0.040235
2342,-0.046216
2343,-0.054014
2344,-0.062851
2345,-0.070642
2346,-0.07468
2347,-0.080801
2348,-0.08769
2349,-0.093539
2350,-0.10237
2351,-0.11016
2352,-0.11794
2353,-0.12572
2354,-0.13082
2355,-0.13696
2356,-0.14113
2357,-0.14424
2358,-0.15309
2359,-0.15894
2360,-0.16777999999999998
2361,-0.17557999999999999
2362,-0.18169000000000002
2363,-0.18871
2364,-0.19755999999999999
2365,-0.20262
2366,-0.2087
2367,-0.21652
2368,-0.22537
2369,-0.23318000000000003
2370,-0.24006999999999998
2371,-0.24616999999999997
2372,-0.25214000000000003
2373,-0.25995999999999997
2374,-0.2688
2375,-0.27660999999999997
2376,-0.28465999999999997
2377,-0.28972
2378,-0.29753
2379,-0.30638000000000004
2380,-0.31223
2381,-0.31911999999999996
2382,-0.32523
2383,-0.33316
2384,-0.342
2385,-0.34809
2386,-0.35313
2387,-0.36199000000000003
2388,-0.36980999999999997
2389,-0.37761999999999996
2390,-0.3836
2391,-0.39164
2392,-0.39658000000000004
2393,-0.4044
2394,-0.41221
2395,-0.42002
2396,-0.42886
2397,-0.4377
2398,-0.44381000000000004
2399,-0.44978999999999997
2400,-0.45564
2401,-0.46345
2402,-0.47123999999999994
2403,-0.48008
2404,-0.48786
2405,-0.49563999999999997
2406,-0.50341
2407,-0.5094
2408,-0.51555
2409,-0.5243800000000001
2410,-0.5302100000000001
2411,-0.53798
2412,-0.5468
2413,-0.55455
2414,-0.5623
2415,-0.57004
2416,-0.57777
2417,-0.58399
2418,-0.59106
2419,-0.5988100000000001
2420,-0.6046100000000001
2421,-0.61234
2422,-0.6200600000000001
2423,-0.6277699999999999
2424,-0.63656
2425,-0.64426
2426,-0.65195
2427,-0.65963
2428,-0.66457
2429,-0.67086
2430,-0.67689
2431,-0.68458
2432,-0.69226
2433,-0.70103
2434,-0.7087
2435,-0.71635
2436,-0.7235
2437,-0.72982
2438,-0.73749
2439,-0.74462
2440,-0.75092
2441,-0.7558600000000001
2442,-0.76354
2443,-0.7712100000000001
2444,-0.77998
2445,-0.78763
2446,-0.79528
2447,-0.80243
2448,-0.80877
2449,-0.81643
2450,-0.82519
2451,-0.8309200000000001
2452,-0.8377600000000001
2453,-0.84411
2454,-0.85398
2455,-0.8616299999999999
2456,-0.8703799999999999
2457,-0.8780100000000001
2458,-0.8856299999999999
2459,-0.89359
2460,-0.89997
2461,-0.9049
2462,-0.91253
2463,-0.92127
2464,-0.9288799999999999
2465,-0.93606
2466,-0.94245
2467,-0.9481700000000001
2468,-0.95691
2469,-0.96452
2470,-0.97135
2471,-0.9747299999999999
2472,-0.9819
2473,-0.9895200000000001
2474,-0.99713
2475,-1.0059
2476,-1.0119
2477,-1.0202
2478,-1.0252
2479,-1.0328
2480,-1.0404
2481,-1.0472
2482,-1.0548
2483,-1.0623
2484,-1.0707
2485,-1.0779
2486,-1.0855
2487,-1.0942
2488,-1.1017
2489,-1.109
2490,-1.1135
2491,-1.1192
2492,-1.1279
2493,-1.1355
2494,-1.143
2495,-1.1495
2496,-1.1548
2497,-1.1624
2498,-1.17
2499,-1.1786
2500,-1.1862
2501,-1.1937
2502,-1.1986
2503,-1.2051
2504,-1.2131
2505,-1.2206
2506,-1.2293
2507,-1.2368
2508,-1.2434
2509,-1.2506
2510,-1.2581
2511,-1.2668
2512,-1.2724
2513,-1.2774
2514,-1.2839
2515,-1.29
2516,-1.2975
2517,-1.3062
2518,-1.3137
2519,-1.3209
2520,-1.3275
2521,-1.335
2522,-1.3406
2523,-1.3493
2524,-1.3559999999999999
2525,-1.3626
2526,-1.3706
2527,-1.3793
2528,-1.3858
2529,-1.3912
2530,-1.3987
2531,-1.4074
2532,-1.413
2533,-1.4198
2534,-1.4264
2535,-1.4325
2536,-1.4399
2537,-1.4486
2538,-1.4561
2539,-1.4615
2540,-1.4681
2541,-1.4756
2542,-1.4823
2543,-1.4889
2544,-1.4943
2545,-1.5030000000000001
2546,-1.5079
2547,-1.5144
2548,-1.5205
2549,-1.528
2550,-1.5367
2551,-1.5442
2552,-1.5484
2553,-1.5569
2554,-1.5637
2555,-1.5723
2556,-1.5798
2557,-1.5878
2558,-1.5944
2559,-1.6011
2560,-1.6086
2561,-1.6173
2562,-1.6229
2563,-1.6283
2564,-1.6349
2565,-1.6424
2566,-1.651
2567,-1.6585
2568,-1.6653
2569,-1.6719
2570,-1.6798
2571,-1.6885
2572,-1.6951
2573,-1.6986
2574,-1.7061
2575,-1.7136
2576,-1.7222
2577,-1.7278
2578,-1.7344
2579,-1.7417
2580,-1.7492
2581,-1.7578
2582,-1.7653
2583,-1.7707
2584,-1.7761
2585,-1.7848
2586,-1.7922
2587,-1.7996
2588,-1.807
2589,-1.8144
2590,-1.8217
2591,-1.8303
2592,-1.8376
2593,-1.8431
2594,-1.8504
2595,-1.8576
2596,-1.8648
2597,-1.8699
2598,-1.8774
2599,-1.8846
2600,-1.8918
2601,-1.899
2602,-1.9062
2603,-1.9128
2604,-1.92
2605,-1.9271
2606,-1.9341
2607,-1.9412
2608,-1.9491
2609,-1.9562
2610,-1.9629
2611,-1.9699
2612,-1.9769
2613,-1.9821
2614,-1.989
2615,-1.996
2616,-2.0028
2617,-2.0111
2618,-2.0179
2619,-2.0246
2620,-2.0314
2621,-2.0381
2622,-2.0472
2623,-2.0515
2624,-2.0582
2625,-2.0649
2626,-2.0715
2627,-2.0781
2628,-2.0862
2629,-2.0927
2630,-2.0992
2631,-2.1069999999999998
2632,-2.1147
2633,-2.121
2634,-2.1275
2635,-2.1338
2636,-2.1402
2637,-2.1464
2638,-2.1527
2639,-2.1588
2640,-2.1649
2641,-2.171
2642,-2.177
2643,-2.1829
2644,-2.1874
2645,-2.1932
2646,-2.199
2647,-2.2047
2648,-2.2119999999999997
2649,-2.2176
2650,-2.2231
2651,-2.2285
2652,-2.2339
2653,-2.2374
2654,-2.2413
2655,-2.2464
2656,-2.2514
2657,-2.2564
2658,-2.2613
2659,-2.263
2660,-2.2597
2661,-2.2632
2662,-2.2678
2663,-2.2722
2664,-2.2755
2665,-2.2778
2666,-2.279
2667,-2.2781
2668,-2.2811
2669,-2.2851
2670,-2.2871
2671,-2.2880000000000003
2672,-2.2909
2673,-2.2946
2674,-2.2973
2675,-2.3008
2676,-2.3021
2677,-2.3054
2678,-2.3085
2679,-2.3116
2680,-2.3145
2681,-2.3173
2682,-2.3199
2683,-2.3225
2684,-2.3243
2685,-2.3266
2686,-2.3288
2687,-2.3308
2688,-2.3327
2689,-2.3345
2690,-2.3361
2691,-2.3376
2692,-2.339
2693,-2.3402
2694,-2.3386
2695,-2.3298
2696,-2.3262
2697,-2.327
2698,-2.3278
2699,-2.3284
2700,-2.3288
2701,-2.3291
2702,-2.3293
2703,-2.3293
2704,-2.3293
2705,-2.3293
2706,-2.3293
2707,-2.3293
2708,-2.3293
