time,value
0,-0.22819
1,-0.26118
2,-0.21994
3,-0.24468
4,-0.25018
5,-0.22819
6,-0.25293000000000004
7,-0.23369
8,-0.24468
9,-0.24743
10,-0.22269
11,-0.25843
12,-0.23369
13,-0.23644
14,-0.25293000000000004
15,-0.22544
16,-0.25568
17,-0.23094
18,-0.24468
19,-0.25568
20,-0.21719000000000002
21,-0.26393
22,-0.23919
23,-0.25018
24,-0.24193
25,-0.22544
26,-0.25568
27,-0.21719000000000002
28,-0.23919
29,-0.22819
30,-0.21444000000000002
31,-0.24743
32,-0.21169000000000002
33,-0.23919
34,-0.22269
35,-0.22544
36,-0.25568
37,-0.21994
38,-0.24743
39,-0.23919
40,-0.23094
41,-0.25018
42,-0.21994
43,-0.25843
44,-0.24193
45,-0.23644
46,-0.25568
47,-0.22819
48,-0.25843
49,-0.22819
50,-0.23919
51,-0.25018
52,-0.22269
53,-0.25843
54,-0.23919
55,-0.24743
56,-0.24193
57,-0.23094
58,1.9880000000000002
59,5.0538
60,0.44546
61,-0.18969
62,-0.18969
63,-0.22269
64,-0.18969
65,-0.22819
66,-0.22269
67,-0.21169000000000002
68,-0.23919
69,-0.21444000000000002
70,-0.20894000000000001
71,-0.20344
72,-0.22269
73,-0.23094
74,-0.20894000000000001
75,-0.24193
76,-0.20619
77,-0.24193
78,-0.21444000000000002
79,-0.23094
80,-0.23919
81,-0.21444000000000002
82,-0.24468
83,-0.21994
84,-0.24468
85,-0.22544
86,-0.22819
87,-0.25293000000000004
88,1.3776
89,5.8786
90,4.7403
91,1.2373
92,-0.21994
93,-0.20619
94,-0.24468
95,-0.19519
