time,value
0,1.6423
1,1.55
2,1.4580000000000002
3,1.3665
4,1.2751
5,1.1841
6,1.0932
7,1.0033
8,0.92253
9,0.8340299999999999
10,0.7451399999999999
11,0.6563399999999999
12,0.56802
13,0.48183000000000004
14,0.39482
15,0.30856
16,0.22503
17,0.14799
18,0.064729
19,-0.019653999999999998
20,-0.10039
21,-0.18077000000000001
22,-0.26022
23,-0.3407
24,-0.41644
25,-0.49413999999999997
26,-0.5595399999999999
27,-0.6269399999999999
28,-0.6978
29,-0.76668
30,-0.83211
31,-0.8918299999999999
32,-0.9471799999999999
33,-0.99961
34,-1.0555
35,-1.0972
36,-1.1382
37,-1.1722
38,-1.1985
39,-1.2166
40,-1.2349
41,-1.2463
42,-1.2478
43,-1.24
44,-1.2332
45,-1.2079
46,-1.1791
47,-1.1440000000000001
48,-1.1186
49,-1.0738
50,-1.0298
51,-0.97801
52,-0.92143
53,-0.8626299999999999
54,-0.7944399999999999
55,-0.73664
56,-0.6662899999999999
57,-0.60238
58,-0.5292
59,-0.45643999999999996
60,-0.38982
61,-0.30972
62,-0.2284
63,-0.14712
64,-0.06774
65,0.016193
66,0.091784
67,0.17773
68,0.25913
69,0.3438
70,0.42967
71,0.51664
72,0.60421
73,0.69315
74,0.78122
75,0.8700700000000001
76,0.9595799999999999
77,1.0495
78,1.139
79,1.2203
80,1.311
81,1.4018
82,1.4933
83,1.5848
84,1.6765
85,1.7611
86,1.7715
87,1.7494
88,1.6629
89,1.575
90,1.4865
91,1.3969
92,1.3086
93,1.2195
94,1.1294
95,1.0402
96,0.95068
97,0.8609899999999999
98,0.77151
99,0.68042
100,0.59085
101,0.50121
102,0.41191000000000005
103,0.32364
104,0.2334
105,0.14577
106,0.058580999999999994
107,-0.030815
108,-0.11993
109,-0.20576999999999998
110,-0.29405
111,-0.37861
112,-0.4658
113,-0.55238
114,-0.6251
115,-0.71004
116,-0.78959
117,-0.87211
118,-0.9481299999999999
119,-1.0271
120,-1.104
121,-1.1718
122,-1.2423
123,-1.2938
124,-1.3539
125,-1.3936
126,-1.4307
127,-1.4578
128,-1.4835
129,-1.4875
130,-1.4892
131,-1.4885
132,-1.466
133,-1.4326
134,-1.3985
135,-1.3524
136,-1.3052
137,-1.247
138,-1.1851
139,-1.1126
140,-1.0429
141,-0.9648200000000001
142,-0.88971
143,-0.80785
144,-0.7289899999999999
145,-0.64453
146,-0.56297
147,-0.47668
148,-0.38976
149,-0.31189
150,-0.22703
151,-0.1386
152,-0.05259
153,0.036621
154,0.1261
155,0.21338000000000001
156,0.3034
157,0.3936
158,0.48312
159,0.57239
160,0.66113
161,0.75202
162,0.84119
163,0.9206799999999999
164,1.0103
165,1.0901
166,1.1801
167,1.2691
168,1.3587
169,1.4375
170,1.5256
171,1.6117
172,1.6907
173,1.7198
174,1.7355
175,1.7077
