time,value
0,1.4243
1,1.3227
2,1.2218
3,1.1222
4,1.0237
5,0.9266399999999999
6,0.8327200000000001
7,0.74124
8,0.65083
9,0.5626899999999999
10,0.47703999999999996
11,0.38937
12,0.30873
13,0.22543000000000002
14,0.14429
15,0.065624
16,-0.010434
17,-0.090251
18,-0.16233
19,-0.22966
20,-0.30314
21,-0.36482
22,-0.43065
23,-0.4946
24,-0.55499
25,-0.61136
26,-0.66381
27,-0.7196899999999999
28,-0.75612
29,-0.80648
30,-0.84391
31,-0.8799899999999999
32,-0.9193600000000001
33,-0.93458
34,-0.9710700000000001
35,-0.9828899999999999
36,-0.9879399999999999
37,-1.0057
38,-1.0170000000000001
39,-1.0018
40,-1.0196
41,-1.0128
42,-0.99872
43,-0.9782200000000001
44,-0.9703200000000001
45,-0.9374600000000001
46,-0.9168299999999999
47,-0.89266
48,-0.85754
49,-0.8193799999999999
50,-0.77604
51,-0.7278
52,-0.69003
53,-0.63215
54,-0.57343
55,-0.52832
56,-0.46245
57,-0.39089
58,-0.33244
59,-0.26106999999999997
60,-0.19615
61,-0.12580999999999998
62,-0.04811
63,0.026055000000000002
64,0.10948
65,0.18541
66,0.2643
67,0.34829
68,0.42965
69,0.51783
70,0.6026600000000001
71,0.6927300000000001
72,0.78366
73,0.8786799999999999
74,0.9534299999999999
75,1.0509
76,1.1474
77,1.2477
78,1.3477
79,1.449
80,1.5511
81,1.655
82,1.7276
83,1.7531
84,1.7538
85,1.7348
86,1.686
87,1.5984
88,1.5011
89,1.4012
90,1.3052
91,1.2079
92,1.1147
93,1.0187
94,0.92594
95,0.8317200000000001
96,0.73653
97,0.64162
98,0.54974
99,0.45368
100,0.36202
101,0.2723
102,0.17667
103,0.081499
104,-0.013181
105,-0.10728
106,-0.20077
107,-0.29354
108,-0.38225
109,-0.46756000000000003
110,-0.55719
111,-0.64564
112,-0.73268
113,-0.82615
114,-0.9018
115,-0.9833
116,-1.075
117,-1.1442
118,-1.2113
119,-1.291
120,-1.3552
121,-1.4033
122,-1.473
123,-1.5014
124,-1.5386
125,-1.5669
126,-1.5853
127,-1.5933
128,-1.5908
129,-1.5968
130,-1.5542
131,-1.5396
132,-1.4975
133,-1.4612
134,-1.4069
135,-1.3438
136,-1.2755
137,-1.2048
138,-1.1272
139,-1.0483
140,-0.96675
141,-0.8829799999999999
142,-0.79738
143,-0.71009
144,-0.62143
145,-0.53154
146,-0.44058
147,-0.34869
148,-0.24795999999999999
149,-0.16253
150,-0.068436
151,0.026226
152,0.1214
153,0.21051999999999998
154,0.30679
155,0.40343
156,0.4946
157,0.59205
158,0.6844100000000001
159,0.77833
160,0.8710700000000001
161,0.96526
162,1.0553
163,1.1428
164,1.236
165,1.3361
166,1.4393
167,1.5385
168,1.6369999999999998
169,1.7281
170,1.7696
171,1.7785
172,1.744
173,1.6872
174,1.6037
175,1.5007
