time,value
0,2.7899
1,2.6906
2,2.5956
3,2.4963
4,2.3971
5,2.3069
6,2.2039
7,2.1001
8,2.0049
9,1.9066
10,1.8072
11,1.7155
12,1.6202
13,1.5194
14,1.4178
15,1.3141
16,1.2074
17,1.1411
18,1.1067
19,1.0732
20,1.0309
21,0.98598
22,0.9481299999999999
23,0.87764
24,0.80735
25,0.7155100000000001
26,0.6566
27,0.56986
28,0.49238000000000004
29,0.43985
30,0.3975
31,0.35146
32,0.30585999999999997
33,0.23346999999999998
34,0.16873
35,0.13296
36,0.083978
37,0.058200999999999996
38,0.040063999999999995
39,0.006511100000000001
40,-0.009095299999999999
41,-0.023093000000000002
42,-0.025608
43,-0.021766999999999998
44,-0.0317
45,-0.026491000000000004
46,-0.011170999999999999
47,0.0054379
48,0.0066611000000000005
49,0.019
50,0.061935000000000004
51,0.13435
52,0.10132999999999999
53,-0.0025607
54,-0.083882
55,-0.18274
56,-0.27602
57,-0.36563
58,-0.45053999999999994
59,-0.52976
60,-0.60568
61,-0.67556
62,-0.72878
63,-0.77742
64,-0.8433700000000001
65,-0.90851
66,-0.98549
67,-1.0775
68,-1.1738
69,-1.276
70,-1.3561
71,-1.4224
72,-1.4525
73,-1.4683
74,-1.4938
75,-1.4972
76,-1.4917
77,-1.4753
78,-1.4518
79,-1.4052
80,-1.3632
81,-1.3204
82,-1.2753
83,-1.2229999999999999
84,-1.1637
85,-1.0959
86,-1.0169
87,-0.94184
88,-0.8625
89,-0.77878
90,-0.6953
91,-0.6161300000000001
92,-0.52222
93,-0.4387
94,-0.47838
95,-0.50952
96,-0.52568
97,-0.4438
98,-0.34367
99,-0.24347
100,-0.15109
101,-0.05387
102,0.04457
103,0.019756
104,-0.075807
105,-0.17689000000000002
106,-0.27014
107,-0.3211
108,-0.42794
109,-0.47591999999999995
110,-0.5766
111,-0.6722
112,-0.77736
113,-0.87966
114,-0.9664799999999999
115,-1.0689
116,-1.1664
117,-1.2596
118,-1.3634
119,-1.4515
120,-1.5583
121,-1.6508
122,-1.7298
123,-1.7763
124,-1.7724
125,-1.7441
126,-1.7231
127,-1.6824
128,-1.6075
129,-1.5109
130,-1.4111
131,-1.3129
132,-1.1894
133,-1.0867
134,-0.9878100000000001
135,-0.88808
136,-0.78578
137,-0.67086
138,-0.5523600000000001
139,-0.41813999999999996
140,-0.30713
141,-0.1772
142,-0.040968
143,0.013649000000000001
144,0.006563899999999999
145,-0.014002
146,0.031767000000000004
147,0.12199000000000002
148,0.21696999999999997
149,0.34128000000000003
150,0.44958000000000004
151,0.52462
152,0.62521
153,0.71649
154,0.8255
155,0.93474
156,0.87023
157,0.7525
158,0.6433300000000001
159,0.50725
160,0.42612
161,0.37665
162,0.28004
163,0.18234
164,0.08319299999999999
165,-0.022737
166,-0.12194
167,-0.20075
168,-0.25976
169,-0.33116
170,-0.38287
171,-0.43051000000000006
172,-0.45486000000000004
173,-0.47467
174,-0.46126000000000006
175,-0.41551000000000005
176,-0.33933
177,-0.25408000000000003
178,-0.1559
179,-0.069825
180,0.023684
181,0.1301
182,0.22763000000000003
183,0.32689
184,0.44111999999999996
185,0.53659
186,0.62797
187,0.72935
188,0.81352
189,0.90375
190,1.0
191,1.0987
192,1.2022
193,1.119
194,1.0261
195,1.0069
196,1.0324
197,1.1127
198,1.1878
199,1.281
200,1.3803
201,1.4826
202,1.5641
203,1.6130000000000002
204,1.7046
205,1.8035
206,1.7728
207,1.6751
208,1.5827
209,1.5422
210,1.4405
211,1.3318
212,1.2265
213,1.1363
214,1.0204
215,0.9244100000000001
216,0.9055799999999999
217,0.9773299999999999
218,1.0624
219,1.1596
220,1.1129
221,1.021
222,0.91956
223,0.82263
224,0.7209
225,0.62588
226,0.5213
227,0.42694
228,0.32541
229,0.23256
230,0.12892
231,0.03294
232,-0.06424500000000001
233,-0.16543
234,-0.25813
235,-0.29672
236,-0.31442
237,-0.31051
238,-0.29583000000000004
239,-0.25456
240,-0.18713
241,-0.10755
242,0.0071807
243,0.1106
244,0.21698
245,0.3092
246,0.37401
247,0.4531
248,0.5563
249,0.68397
250,0.69692
251,0.58795
252,0.48906000000000005
253,0.39291
254,0.29352
255,0.19093
256,0.10554000000000001
257,0.0086882
258,0.014445
259,0.030728
260,0.038489999999999996
261,-0.076324
262,-0.17246
263,-0.27203
264,-0.36464
265,-0.45795
266,-0.5415300000000001
267,-0.6349100000000001
268,-0.73232
269,-0.82355
270,-0.9116200000000001
271,-1.0088
272,-1.0909
273,-1.1879
274,-1.2590000000000001
275,-1.3362
276,-1.4045
277,-1.4659
278,-1.5167
279,-1.5377
280,-1.5187
281,-1.486
282,-1.421
283,-1.3537
284,-1.2734
285,-1.1846
286,-1.0722
287,-0.96198
288,-0.83386
289,-0.71394
290,-0.6069899999999999
291,-0.47011000000000003
292,-0.39629000000000003
293,-0.29573
294,-0.18458
295,-0.046868
296,0.005143600000000001
297,-0.12804000000000001
298,-0.21311
299,-0.32908000000000004
300,-0.41393
301,-0.50526
302,-0.60214
303,-0.67242
304,-0.71946
305,-0.66667
306,-0.71032
307,-0.80761
308,-0.9222600000000001
309,-1.0249
310,-1.1118
311,-1.1805
312,-1.2508
313,-1.3077
314,-1.3606
315,-1.4107
316,-1.4479
317,-1.4896
318,-1.5063
319,-1.4916
320,-1.4799
321,-1.4725
322,-1.4495
323,-1.365
324,-1.2627
325,-1.1715
326,-1.0666
327,-0.96695
328,-0.87551
329,-0.7802899999999999
330,-0.68401
331,-0.58658
332,-0.48403
333,-0.3976
334,-0.29933000000000004
335,-0.20369
336,-0.10575999999999999
337,-0.042502
338,-0.1317
339,-0.23296999999999998
340,-0.31564000000000003
341,-0.41003
342,-0.49401000000000006
343,-0.57176
344,-0.5869800000000001
345,-0.49841
346,-0.5514
347,-0.61646
348,-0.68604
349,-0.75654
350,-0.81445
351,-0.85795
352,-0.88765
353,-0.90094
354,-0.8953
355,-0.86535
356,-0.82716
357,-0.7820699999999999
358,-0.71824
359,-0.58567
360,-0.4917
361,-0.3878
362,-0.29557
363,-0.21627
364,-0.13276
365,-0.048277
366,0.035606
367,0.11220999999999999
368,0.20348
369,0.27856
370,0.21593
371,0.14835
372,0.096803
373,0.052684
374,0.11033
375,0.085301
376,0.06952799999999999
377,0.05350800000000001
378,0.047777999999999994
379,0.055332000000000006
380,0.07512100000000001
381,0.088534
382,0.11241
383,0.15323
384,0.21896999999999997
385,0.29172
386,0.38949
387,0.49357
388,0.5652699999999999
389,0.62388
390,0.65704
391,0.65308
392,0.65462
393,0.6723600000000001
394,0.68596
395,0.71739
396,0.759
397,0.8055
398,0.85674
399,0.9101
400,0.95586
401,0.99108
402,1.0193
403,1.0593
404,1.0774
405,1.0971
406,1.1115
407,1.1172
408,1.129
409,1.169
410,1.2635
411,1.3537
412,1.4526
413,1.5477
414,1.6447
415,1.7469999999999999
416,1.8484
417,1.9394
418,2.0381
419,2.1349
420,2.2324
421,2.3346
422,2.431
423,2.5266
424,2.6268
425,2.7254
426,2.8149
