{
  "about": {
    "datasetSchemaVersion": "4.0.0",
    "datasetID": "uu10_posts_3_dataset_TRAIN",
    "datasetName": "Database dataset of type HAS_USER_MADE_COMMENT_ON_POST",
    "digest": "2545818a8f3d74e3386946159e74c619d3c5077410f085d754ceb94923840c0b",
    "datasetVersion": "4.0.0"
  },
  "dataResources": [
    {
      "resID": "users",
      "isCollection": false,
      "resFormat": {
        "text/csv": [
          "csv"
        ]
      },
      "resType": "table",
      "resPath": "tables/users.csv",
      "columns": [
        {
          "colIndex": 0,
          "colName": "id",
          "role": [
            "index"
          ],
          "colType": "integer"
        },
        {
          "colIndex": 1,
          "colName": "name",
          "role": [
            "attribute"
          ],
          "colType": "string"
        }
      ],
      "columnsCount": 2
    },
    {
      "resID": "posts",
      "isCollection": false,
      "resFormat": {
        "text/csv": [
          "csv"
        ]
      },
      "resType": "table",
      "resPath": "tables/posts.csv",
      "columns": [
        {
          "colIndex": 0,
          "colName": "id",
          "role": [
            "index"
          ],
          "colType": "integer"
        },
        {
          "colIndex": 1,
          "colName": "author_id",
          "role": [
            "attribute"
          ],
          "colType": "integer",
          "refersTo": {
            "resID": "users",
            "resObject": {
              "columnIndex": 0
            }
          }
        },
        {
          "colIndex": 2,
          "colName": "post",
          "role": [
            "attribute"
          ],
          "colType": "string"
        }
      ],
      "columnsCount": 3
    },
    {
      "resID": "comments",
      "isCollection": false,
      "resFormat": {
        "text/csv": [
          "csv"
        ]
      },
      "resType": "table",
      "resPath": "tables/comments.csv",
      "columns": [
        {
          "colIndex": 0,
          "colName": "id",
          "role": [
            "index"
          ],
          "colType": "integer"
        },
        {
          "colIndex": 1,
          "colName": "post_id",
          "role": [
            "attribute"
          ],
          "colType": "integer",
          "refersTo": {
            "resID": "posts",
            "resObject": {
              "columnIndex": 0
            }
          }
        },
        {
          "colIndex": 2,
          "colName": "author_id",
          "role": [
            "attribute"
          ],
          "colType": "integer",
          "refersTo": {
            "resID": "users",
            "resObject": {
              "columnIndex": 0
            }
          }
        },
        {
          "colIndex": 3,
          "colName": "comment",
          "role": [
            "attribute"
          ],
          "colType": "string"
        }
      ],
      "columnsCount": 4
    },
    {
      "resID": "learningData",
      "isCollection": false,
      "resFormat": {
        "text/csv": [
          "csv"
        ]
      },
      "resType": "table",
      "resPath": "tables/learningData.csv",
      "columns": [
        {
          "colIndex": 0,
          "colName": "d3mIndex",
          "role": [
            "index"
          ],
          "colType": "integer"
        },
        {
          "colIndex": 1,
          "colName": "user_id",
          "role": [
            "attribute"
          ],
          "colType": "integer",
          "refersTo": {
            "resID": "users",
            "resObject": {
              "columnIndex": 0
            }
          }
        },
        {
          "colIndex": 2,
          "colName": "post_id",
          "role": [
            "attribute"
          ],
          "colType": "integer",
          "refersTo": {
            "resID": "posts",
            "resObject": {
              "columnIndex": 0
            }
          }
        },
        {
          "colIndex": 3,
          "colName": "made_comment",
          "role": [
            "suggestedTarget"
          ],
          "colType": "boolean"
        }
      ],
      "columnsCount": 4
    }
  ]
}