time,value
0,1.2556
1,-0.55147
2,-1.02
3,0.25168
4,1.2556
5,-0.21681999999999998
6,-1.02
7,0.050894
8,1.2556
9,0.11782000000000001
10,-1.02
11,-0.6184
12,1.3895
13,0.38554
14,-1.02
15,-0.81919
16,1.3895
17,0.58633
18,-1.02
19,-1.02
20,1.3895
21,0.72019
22,-1.02
23,-1.02
24,1.2556
25,0.7871199999999999
26,-1.02
27,-1.02
28,1.1218
29,0.85405
30,-1.02
31,-1.02
32,0.9879100000000001
33,0.9879100000000001
34,-1.02
35,-1.02
36,0.9879100000000001
37,1.1218
38,-1.02
39,-1.02
40,0.7871199999999999
41,1.2556
42,-1.02
43,-1.02
44,0.7871199999999999
45,1.2556
46,-1.02
47,-1.02
48,0.6532600000000001
49,1.2556
50,-0.88612
51,-1.02
52,0.72019
53,1.1887
54,-1.02
55,-1.02
56,0.85405
57,1.0548
58,-1.02
59,-1.02
60,0.85405
61,0.9879100000000001
62,-1.02
63,-1.02
64,1.0548
65,1.1887
66,-1.02
67,-1.02
68,0.85405
69,1.2556
70,-0.81919
71,-1.02
72,0.58633
73,1.2556
74,-0.55147
75,-1.02
76,0.31861
77,1.3226
78,-0.6184
79,-1.02
80,1.3895
81,0.6532600000000001
82,-1.02
83,-1.02
84,1.3895
85,0.7871199999999999
86,-1.02
87,-1.02
88,1.2556
89,0.7871199999999999
90,-1.02
91,-1.02
92,1.3895
93,0.58633
94,-1.02
95,-1.02
