time,value
0,1.1543
1,1.2492
2,1.3296
3,1.4179
4,1.499
5,1.5883
6,1.6643
7,1.7158
8,1.7262
9,1.6923
10,1.614
11,1.5265
12,1.4380000000000002
13,1.3496
14,1.262
15,1.1728
16,1.0849
17,0.99634
18,0.9099299999999999
19,0.82147
20,0.73405
21,0.64595
22,0.55925
23,0.47925
24,0.39298
25,0.30579
26,0.21979
27,0.13527
28,0.055464
29,-0.028702
30,-0.11255
31,-0.19605
32,-0.28094
33,-0.36174
34,-0.44381000000000004
35,-0.5181
36,-0.59883
37,-0.67166
38,-0.75055
39,-0.82134
40,-0.8943399999999999
41,-0.9685
42,-1.0404
43,-1.1095
44,-1.171
45,-1.2309999999999999
46,-1.2861
47,-1.3363
48,-1.37
49,-1.4069999999999998
50,-1.4256
51,-1.4387
52,-1.4383
53,-1.4173
54,-1.3915
55,-1.3548
56,-1.3089
57,-1.2613
58,-1.2047
59,-1.1421
60,-1.078
61,-1.0144
62,-0.9398200000000001
63,-0.87029
64,-0.7951199999999999
65,-0.72259
66,-0.64567
67,-0.5664600000000001
68,-0.48798
69,-0.40873000000000004
70,-0.32855
71,-0.2484
72,-0.16747
73,-0.08380499999999999
74,-0.0020873000000000003
75,0.07416
76,0.15277000000000002
77,0.23454
78,0.31775
79,0.40209
80,0.48651000000000005
81,0.57081
82,0.65615
83,0.74156
84,0.8272700000000001
85,0.9129200000000001
86,0.9991700000000001
87,1.0858
88,1.1727
89,1.2601
90,1.3478
91,1.4361
92,1.5247
93,1.6143
94,1.6980000000000002
95,1.7385
96,1.7518
97,1.692
98,1.6074
99,1.5199
100,1.4313
101,1.3432
102,1.2627
103,1.1753
104,1.0876
105,0.99928
106,0.91179
107,0.82435
108,0.7369100000000001
109,0.6494800000000001
110,0.56305
111,0.47586000000000006
112,0.38973
113,0.30368
114,0.21774000000000002
115,0.1319
116,0.054975
117,-0.029004000000000002
118,-0.11429
119,-0.19644
120,-0.27876
121,-0.3611
122,-0.44287
123,-0.5239699999999999
124,-0.60427
125,-0.6816800000000001
126,-0.759
127,-0.8356899999999999
128,-0.9107299999999999
129,-0.9837600000000001
130,-1.0543
131,-1.1139
132,-1.1749
133,-1.2389
134,-1.2923
135,-1.3341
136,-1.3719999999999999
137,-1.4064
138,-1.4249
139,-1.4322
140,-1.4291
141,-1.4129
142,-1.3846
143,-1.3458
144,-1.2982
145,-1.2492
146,-1.1936
147,-1.1385
148,-1.0736
149,-1.0092
150,-0.9413
151,-0.86725
152,-0.7914
153,-0.7145699999999999
154,-0.6380600000000001
155,-0.5606300000000001
156,-0.47978999999999994
157,-0.40857
158,-0.32711
159,-0.24595
160,-0.1642
161,-0.082957
162,-3.3974000000000004e-05
163,0.082822
164,0.16633
165,0.24973
166,0.32700999999999997
167,0.41138
168,0.48868999999999996
169,0.57353
170,0.65865
171,0.74398
172,0.8297100000000001
173,0.9158299999999999
174,1.0021
175,1.0889
