time,value
0,0.52988
1,0.39314
2,0.52988
3,0.52988
4,0.52988
5,0.39314
6,0.52988
7,0.39314
8,0.52988
9,0.52988
10,0.39314
11,0.52988
12,0.52988
13,0.39314
14,0.52988
15,0.52988
16,0.39314
17,0.52988
18,0.52988
19,0.39314
20,0.52988
21,0.52988
22,0.52988
23,0.39314
24,0.52988
25,0.52988
26,0.39314
27,0.52988
28,0.52988
29,0.39314
30,0.52988
31,0.39314
32,0.52988
33,0.52988
34,0.52988
35,0.39314
36,0.52988
37,0.39314
38,0.52988
39,0.52988
40,0.39314
41,0.52988
42,0.52988
43,0.39314
44,0.52988
45,0.52988
46,0.52988
47,0.52988
48,-0.8375600000000001
49,-1.9315
50,-1.9315
51,-1.9315
52,-1.9315
53,-1.9315
54,-1.9315
55,-1.9315
56,-1.9315
57,-1.9315
58,-1.9315
59,-1.9315
60,-1.9315
61,-1.9315
62,-1.9315
63,-1.9315
64,-1.9315
65,-1.9315
66,-1.9315
67,-1.9315
68,-1.5213
69,0.6666300000000001
70,0.6666300000000001
71,0.9401200000000001
72,0.6666300000000001
73,0.52988
74,0.6666300000000001
75,0.6666300000000001
76,0.52988
77,0.52988
78,0.52988
79,0.52988
80,0.52988
81,0.52988
82,0.52988
83,0.39314
84,0.52988
85,0.52988
86,0.52988
87,0.39314
88,0.52988
89,0.80337
90,0.80337
91,0.6666300000000001
92,0.52988
93,0.39314
94,0.52988
95,0.52988
