time,value
0,1.3716
1,-0.4413
2,-0.9183899999999999
3,-0.9183899999999999
4,-0.9183899999999999
5,0.41745
6,1.3716
7,1.2762
8,-0.9183899999999999
9,-0.9183899999999999
10,-0.9183899999999999
11,-0.9183899999999999
12,0.5128699999999999
13,1.4669999999999999
14,1.3716
15,-0.9183899999999999
16,-0.9183899999999999
17,-0.9183899999999999
18,-0.9183899999999999
19,0.1312
20,1.4669999999999999
21,1.2762
22,-0.4413
23,-0.9183899999999999
24,-0.9183899999999999
25,-0.9183899999999999
26,-0.6321399999999999
27,1.3716
28,1.3716
29,0.5128699999999999
30,-0.9183899999999999
31,-0.9183899999999999
32,-0.9183899999999999
33,-0.059636
34,1.3716
35,1.3716
36,0.1312
37,-0.9183899999999999
38,-0.9183899999999999
39,0.1312
40,1.3716
41,1.3716
42,-0.4413
43,-0.9183899999999999
44,-0.9183899999999999
45,-0.9183899999999999
46,1.3716
47,1.3716
48,0.41745
49,-0.9183899999999999
50,-0.9183899999999999
51,-0.9183899999999999
52,-0.059636
53,1.3716
54,1.3716
55,0.8945299999999999
56,-0.9183899999999999
57,-0.9183899999999999
58,-0.9183899999999999
59,0.035781
60,1.3716
61,1.2762
62,-0.6321399999999999
63,-0.9183899999999999
64,-0.9183899999999999
65,-0.9183899999999999
66,0.32203000000000004
67,1.3716
68,1.3716
69,-0.9183899999999999
70,-0.9183899999999999
71,-0.9183899999999999
72,-0.53672
73,1.3716
74,1.3716
75,0.035781
76,-0.9183899999999999
77,-0.9183899999999999
78,-0.9183899999999999
79,0.7037
80,1.3716
81,1.1808
82,-0.9183899999999999
83,-0.9183899999999999
84,-0.9183899999999999
85,-0.059636
86,1.4669999999999999
87,1.2762
88,-0.53672
89,-0.9183899999999999
90,-0.9183899999999999
91,-0.53672
92,1.4669999999999999
93,1.3716
94,0.035781
95,-0.9183899999999999
