time,value
0,-0.21873
1,-0.21873
2,-0.21873
3,-0.21873
4,-0.21873
5,-0.21873
6,-0.21873
7,-0.21873
8,-0.21873
9,-0.21873
10,-0.21873
11,-0.21873
12,-0.21873
13,-0.21873
14,-0.21873
15,-0.21873
16,-0.21873
17,-0.21873
18,-0.21873
19,-0.21873
20,-0.21873
21,-0.21873
22,-0.21873
23,-0.21873
24,-0.21873
25,-0.21873
26,-0.21873
27,-0.21873
28,-0.21873
29,-0.21873
30,-0.21873
31,-0.21873
32,-0.21873
33,-0.21873
34,-0.21873
35,-0.21873
36,-0.21873
37,-0.21873
38,-0.21873
39,-0.21873
40,-0.21873
41,-0.21873
42,-0.21873
43,3.9572
44,4.3851
45,4.0162
46,0.63712
47,0.032125
48,0.002613
49,6.2739
50,-0.056411
51,-0.21873
52,-0.21873
53,-0.21873
54,-0.21873
55,-0.21873
56,-0.21873
57,-0.21873
58,-0.21873
59,-0.21873
60,-0.21873
61,-0.21873
62,-0.21873
63,-0.21873
64,-0.21873
65,-0.21873
66,-0.21873
67,-0.21873
68,-0.21873
69,-0.21873
70,-0.21873
71,-0.21873
72,-0.21873
73,-0.21873
74,-0.21873
75,-0.21873
76,-0.21873
77,-0.21873
78,-0.21873
79,-0.21873
80,-0.21873
81,-0.21873
82,-0.21873
83,-0.21873
84,-0.21873
85,-0.21873
86,-0.21873
87,-0.21873
88,-0.21873
89,-0.21873
90,-0.21873
91,-0.21873
92,-0.21873
93,-0.21873
94,-0.21873
95,-0.21873
