time,value
0,-0.24711
1,-0.37827
2,-0.34110999999999997
3,-0.21627
4,-0.31088000000000005
5,-0.23744
6,-0.24291
7,-0.23842
8,-0.22598000000000001
9,-0.25040999999999997
10,-0.22712
11,-0.23948000000000003
12,-0.30055
13,-0.30079
14,-0.35279
15,-0.28575
16,-0.29302
17,-0.20313
18,-0.18979000000000001
19,-0.17587
20,-0.19872
21,-0.18674000000000002
22,-0.1657
23,-0.17028
24,-0.14697000000000002
25,-0.12315
26,-0.15324000000000002
27,-0.15714
28,-0.15169000000000002
29,-0.13346
30,-0.081768
31,-0.072014
32,-0.075961
33,-0.14545999999999998
34,-0.11547
35,-0.1098
36,-0.1064
37,-0.12314000000000001
38,-0.16602999999999998
39,-0.16918
40,-0.15822999999999998
41,-0.17145
42,-0.23876999999999998
43,-0.25999
44,-0.29551
45,-0.31435
46,-0.39941
47,-0.43805
48,-0.5996
49,-0.61488
50,-0.70981
51,-0.78754
52,-0.80886
53,-0.8638299999999999
54,-0.9882200000000001
55,-1.168
56,-1.374
57,-1.3749
58,-1.6026
59,-1.6456
60,-1.4096
61,-1.4021
62,-1.3504
63,-1.2791
64,-1.2501
65,-1.1828
66,-1.1419
67,-1.0124
68,-0.97421
69,-0.9841
70,-0.8890600000000001
71,-0.8528
72,-0.79093
73,-0.7372
74,-0.7651600000000001
75,-0.74926
76,-0.748
77,-0.65154
78,-0.62692
79,-0.56012
80,-0.3846
81,-0.26976999999999995
82,-0.17145
83,-0.11174
84,0.033729
85,0.21453000000000003
86,0.15306
87,0.15509
88,0.2272
89,0.37897
90,0.53582
91,0.57499
92,0.67179
93,0.6170800000000001
94,0.53587
95,0.5273899999999999
96,0.45968000000000003
97,0.34835
98,0.41576
99,0.47908
100,0.40171
101,0.33943
102,0.27647
103,0.38359
104,0.39743
105,0.57934
106,0.67681
107,0.75795
108,0.83395
109,0.8607899999999999
110,0.91241
111,0.85811
112,0.85819
113,0.7139300000000001
114,0.74463
115,0.8645299999999999
116,0.79894
117,0.82386
118,0.80307
119,0.70921
120,0.78036
121,0.8993200000000001
122,0.80161
123,0.8646299999999999
124,0.96795
125,0.99413
126,1.0117
127,1.0398
128,0.99656
129,0.9738600000000001
130,0.9559200000000001
131,1.0116
132,1.0436
133,1.053
134,1.0349
135,1.0883
136,1.0985
137,1.1826
138,1.1506
139,1.2376
140,1.2913
141,1.314
142,1.3046
143,1.3039
144,1.3544
145,1.2246
146,1.2972
147,1.3181
148,1.2405
149,1.4008
150,1.4025
151,1.5209
152,1.3577
153,1.4587
154,1.3764
155,1.3494
156,1.4093
157,1.4573
158,1.5516
159,1.5694
160,1.6082
161,1.7372
162,1.8243
163,1.6944
164,1.6492
165,1.7218
166,1.5564
167,1.4132
168,1.7878
169,1.9874
170,2.1888
171,2.1889
172,2.2869
173,2.1232
174,2.1326
175,2.1846
176,2.1271
177,2.1602
178,2.1432
179,1.9305
180,1.9229
181,1.8806
182,1.8034
183,1.4632
184,0.9093
185,0.7931600000000001
186,0.73064
187,0.28233
188,0.14870999999999998
189,0.21771999999999997
190,-0.036478
191,-0.26845
192,0.27281
193,-0.063519
194,-0.53768
195,-0.56079
196,-1.1787
197,-1.052
198,-1.2061
199,-1.9399
200,-2.379
201,-2.3065
202,-2.329
203,-2.3688
204,-2.1269
205,-2.0166
206,-2.6342
207,-2.8098
208,-2.3995
209,-2.1568
210,-2.1923
211,-2.1531
212,-1.7805
213,-1.5364
214,-1.5535
215,-1.4777
216,-1.3596
217,-1.1455
218,-0.94945
219,-0.57826
220,-0.6522399999999999
221,-0.65623
222,-0.65496
223,-0.8456899999999999
224,-0.84491
225,-0.63697
226,-0.54228
227,-0.5451699999999999
228,-0.50938
229,-0.44993999999999995
230,-0.39555999999999997
231,-0.35483000000000003
232,-0.25528
233,-0.34797
234,-0.45397
235,-0.38805
236,-0.3607
237,-0.44842
238,-0.38042
239,-0.38674000000000003
240,-0.31933
241,-0.30288000000000004
242,-0.29391
243,-0.15727
244,-0.26498
245,-0.2694
246,-0.26408000000000004
247,-0.26792
248,-0.26635
249,-0.2704
250,-0.26784
251,-0.18266
252,-0.26498
253,-0.1848
254,-0.37598000000000004
255,-0.41958
256,-0.37524
257,-0.42841999999999997
258,-0.26248
259,-0.26618
260,-0.21114000000000002
261,-0.25864000000000004
262,-0.22141
263,-0.15120999999999998
264,-0.26371999999999995
265,-0.27399
266,-0.17134000000000002
267,-0.18779
268,-0.29073000000000004
269,-0.37840999999999997
270,-0.37758
271,-0.27111999999999997
272,-0.27016
273,-0.37537
274,-0.37196999999999997
275,-0.38326
276,-0.376
277,-0.37796
278,-0.38274
279,-0.28289000000000003
280,-0.27774
281,-0.27763000000000004
282,-0.28062
283,-0.28373000000000004
284,-0.2803
285,-0.27787
286,-0.28121999999999997
287,-0.32931
288,-0.38865
289,-0.3957
290,-0.40213000000000004
291,-0.40431
292,-0.32637
293,-0.31406999999999996
294,-0.39111
295,-0.39129
296,-0.38028
297,-0.30203
298,-0.29527
299,-0.29575999999999997
