time,value
0,-0.7720600000000001
1,0.8357
2,1.6396
3,1.318
4,0.1926
5,-0.7720600000000001
6,-0.7720600000000001
7,-0.7720600000000001
8,-0.7720600000000001
9,0.35336999999999996
10,1.8003
11,1.318
12,0.1926
13,-0.7720600000000001
14,-0.7720600000000001
15,-0.7720600000000001
16,-0.7720600000000001
17,-0.7720600000000001
18,1.8003
19,1.4788
20,0.67492
21,-0.7720600000000001
22,-0.7720600000000001
23,-0.7720600000000001
24,-0.7720600000000001
25,-0.7720600000000001
26,0.67492
27,1.6396
28,1.318
29,-0.7720600000000001
30,-0.7720600000000001
31,-0.7720600000000001
32,-0.7720600000000001
33,-0.7720600000000001
34,-0.7720600000000001
35,1.8003
36,1.318
37,0.51415
38,-0.7720600000000001
39,-0.7720600000000001
40,-0.7720600000000001
41,-0.7720600000000001
42,-0.7720600000000001
43,0.35336999999999996
44,1.6396
45,1.4788
46,-0.7720600000000001
47,-0.7720600000000001
48,-0.7720600000000001
49,-0.7720600000000001
50,-0.7720600000000001
51,0.51415
52,1.6396
53,1.318
54,-0.12896
55,-0.7720600000000001
56,-0.7720600000000001
57,-0.7720600000000001
58,-0.7720600000000001
59,-0.7720600000000001
60,1.318
61,1.4788
62,1.318
63,-0.7720600000000001
64,-0.7720600000000001
65,-0.7720600000000001
66,-0.7720600000000001
67,-0.7720600000000001
68,0.9964700000000001
69,1.6396
70,1.1572
71,-0.7720600000000001
72,-0.7720600000000001
73,-0.7720600000000001
74,-0.7720600000000001
75,-0.7720600000000001
76,-0.45051
77,1.8003
78,1.318
79,0.51415
80,-0.7720600000000001
81,-0.7720600000000001
82,-0.7720600000000001
83,-0.7720600000000001
84,-0.7720600000000001
85,1.1572
86,1.6396
87,0.67492
88,-0.7720600000000001
89,-0.7720600000000001
90,-0.7720600000000001
91,-0.7720600000000001
92,-0.7720600000000001
93,-0.12896
94,1.8003
95,1.318
