time,value
0,-0.93509
1,-0.93509
2,-0.93509
3,-0.93509
4,-0.93509
5,-0.93509
6,-0.93509
7,-0.93509
8,-0.93509
9,-0.93509
10,-0.93509
11,-0.93509
12,-0.35218
13,-0.93509
14,-0.93509
15,-0.93509
16,-0.93509
17,-0.93509
18,-0.93509
19,-0.93509
20,-0.35218
21,-0.93509
22,-0.93509
23,-0.93509
24,-0.93509
25,-0.93509
26,-0.93509
27,-0.93509
28,-0.93509
29,-0.93509
30,-0.93509
31,-0.93509
32,-0.93509
33,-0.93509
34,-0.93509
35,-0.20645
36,0.9593799999999999
37,1.1051
38,0.9593799999999999
39,1.1051
40,1.3966
41,1.1051
42,0.9593799999999999
43,1.1051
44,0.9593799999999999
45,1.1051
46,0.9593799999999999
47,1.5423
48,1.2508
49,0.085009
50,0.085009
51,-0.06072
52,0.085009
53,-0.06072
54,0.085009
55,-0.06072
56,0.085009
57,-0.06072
58,0.085009
59,-0.06072
60,0.085009
61,-0.93509
62,0.23074
63,0.66792
64,-0.06072
65,-0.06072
66,0.085009
67,-0.06072
68,0.085009
69,-0.06072
70,0.085009
71,-0.06072
72,-0.06072
73,0.085009
74,-0.06072
75,0.085009
76,-0.06072
77,0.085009
78,-0.06072
79,-0.06072
80,0.085009
81,-0.06072
82,0.085009
83,-0.06072
84,0.085009
85,0.81365
86,2.5624
87,2.5624
88,2.5624
89,2.5624
90,2.4167
91,2.5624
92,2.5624
93,0.23074
94,-0.93509
95,-0.93509
