time,value
0,0.8378
1,-0.54891
2,-1.0111
3,0.8378
4,0.8378
5,-1.9356
6,0.37556999999999996
7,0.37556999999999996
8,0.8378
9,-1.9356
10,0.8378
11,0.37556999999999996
12,-0.54891
13,-0.54891
14,0.8378
15,0.37556999999999996
16,-1.9356
17,0.8378
18,0.8378
19,-0.08666900000000001
20,-1.0111
21,0.37556999999999996
22,0.8378
23,-1.9356
24,-0.08666900000000001
25,0.8378
26,0.37556999999999996
27,-1.9356
28,0.37556999999999996
29,0.8378
30,-1.0111
31,-0.08666900000000001
32,0.8378
33,0.37556999999999996
34,-1.9356
35,0.8378
36,0.8378
37,-1.0111
38,-0.54891
39,0.8378
40,0.8378
41,-1.9356
42,0.37556999999999996
43,0.8378
44,0.37556999999999996
45,-1.9356
46,0.8378
47,0.37556999999999996
48,0.37556999999999996
49,-1.9356
50,0.37556999999999996
51,0.8378
52,0.37556999999999996
53,-1.9356
54,0.8378
55,0.37556999999999996
56,0.8378
57,-1.9356
58,0.8378
59,0.8378
60,0.37556999999999996
61,-1.0111
62,-0.08666900000000001
63,0.8378
64,0.8378
65,-0.54891
66,-0.54891
67,0.8378
68,0.8378
69,-0.08666900000000001
70,-1.0111
71,0.37556999999999996
72,0.8378
73,0.8378
74,-1.9356
75,0.37556999999999996
76,0.8378
77,0.8378
78,-0.54891
79,-0.54891
80,0.37556999999999996
81,0.8378
82,0.37556999999999996
83,-1.9356
84,0.8378
85,0.8378
86,0.37556999999999996
87,-1.9356
88,0.8378
89,0.8378
90,0.8378
91,-1.9356
92,0.37556999999999996
93,0.8378
94,0.37556999999999996
95,-0.54891
