time,value
0,0.3424
1,0.6778
2,-0.8315299999999999
3,0.3424
4,0.6778
5,-0.8315299999999999
6,0.3424
7,0.6778
8,-0.8315299999999999
9,0.0069876999999999995
10,1.0132
11,-0.8315299999999999
12,-0.8315299999999999
13,2.0194
14,-0.8315299999999999
15,-0.8315299999999999
16,1.6840000000000002
17,-0.8315299999999999
18,-0.8315299999999999
19,0.5101
20,0.6778
21,-0.8315299999999999
22,-0.8315299999999999
23,2.0194
24,-0.8315299999999999
25,-0.8315299999999999
26,0.6778
27,0.5101
28,-0.8315299999999999
29,-0.8315299999999999
30,2.0194
31,-0.8315299999999999
32,-0.8315299999999999
33,-0.32842
34,1.5163
35,-0.8315299999999999
36,-0.8315299999999999
37,1.5163
38,-0.49612
39,-0.8315299999999999
40,0.17469
41,0.84551
42,-0.8315299999999999
43,-0.8315299999999999
44,1.8517
45,-0.8315299999999999
46,-0.8315299999999999
47,1.8517
48,-0.8315299999999999
49,-0.8315299999999999
50,1.5163
51,-0.32842
52,-0.8315299999999999
53,0.84551
54,0.17469
55,-0.8315299999999999
56,0.17469
57,0.84551
58,-0.8315299999999999
59,-0.8315299999999999
60,2.0194
61,-0.8315299999999999
62,-0.8315299999999999
63,1.5163
64,-0.49612
65,-0.8315299999999999
66,0.3424
67,0.84551
68,-0.8315299999999999
69,-0.8315299999999999
70,1.8517
71,-0.8315299999999999
72,-0.8315299999999999
73,0.6778
74,0.5101
75,-0.8315299999999999
76,-0.8315299999999999
77,1.8517
78,-0.8315299999999999
79,-0.8315299999999999
80,1.5163
81,-0.32842
82,-0.8315299999999999
83,0.17469
84,0.84551
85,-0.8315299999999999
86,-0.8315299999999999
87,2.0194
88,-0.8315299999999999
89,-0.8315299999999999
90,1.6840000000000002
91,-0.49612
92,-0.8315299999999999
93,0.84551
94,0.17469
95,-0.8315299999999999
