time,value
0,-0.77128
1,-0.74526
2,-0.71404
3,-0.67773
4,-0.63684
5,-0.5924
6,-0.54604
7,-0.49914
8,-0.45319
9,-0.40944
10,-0.36888000000000004
11,-0.33192
12,-0.2983
13,-0.2676
14,-0.23935
15,-0.21356
16,-0.19019
17,-0.16939
18,-0.15137
19,-0.13623
20,-0.12403
21,-0.11409000000000001
22,-0.1056
23,-0.097758
24,-0.0901
25,-0.082692
26,-0.075794
27,-0.070128
28,-0.066591
29,-0.066143
30,-0.069349
31,-0.076172
32,-0.086224
33,-0.098868
34,-0.11366
35,-0.12994
36,-0.14725
37,-0.16535999999999998
38,-0.18425
39,-0.20417000000000002
40,-0.22486
41,-0.24602
42,-0.26725
43,-0.28825
44,-0.30883
45,-0.32861
46,-0.34745
47,-0.36538000000000004
48,-0.3828
49,-0.39991
50,-0.41677
51,-0.43338999999999994
52,-0.44969
53,-0.4658
54,-0.48112
55,-0.49531000000000003
56,-0.5081100000000001
57,-0.51945
58,-0.52951
59,-0.5379
60,-0.54484
61,-0.5506300000000001
62,-0.55582
63,-0.56053
64,-0.56457
65,-0.56813
66,-0.57135
67,-0.5746600000000001
68,-0.5776
69,-0.57996
70,-0.58181
71,-0.58318
72,-0.58444
73,-0.58468
74,-0.5837600000000001
75,-0.5817100000000001
76,-0.57873
77,-0.57502
78,-0.57015
79,-0.56447
80,-0.5583899999999999
81,-0.5525
82,-0.54677
83,-0.54097
84,-0.5353
85,-0.52995
86,-0.52542
87,-0.52142
88,-0.5181100000000001
89,-0.51595
90,-0.51536
91,-0.51698
92,-0.52041
93,-0.52575
94,-0.5330199999999999
95,-0.54219
96,-0.55305
97,-0.56495
98,-0.57763
99,-0.5908800000000001
100,-0.6046100000000001
101,-0.61843
102,-0.63197
103,-0.64512
104,-0.65786
105,-0.6704
106,-0.68247
107,-0.69402
108,-0.70508
109,-0.71567
110,-0.72613
111,-0.73592
112,-0.7449
113,-0.7529899999999999
114,-0.76042
115,-0.76763
116,-0.77423
117,-0.7802100000000001
118,-0.78557
119,-0.79099
120,-0.79647
121,-0.80137
122,-0.80538
123,-0.80835
124,-0.8116
125,-0.81463
126,-0.81717
127,-0.81914
128,-0.82073
129,-0.8236700000000001
130,-0.82658
131,-0.82896
132,-0.83034
133,-0.83125
134,-0.8327899999999999
135,-0.83363
136,-0.8334600000000001
137,-0.83211
138,-0.8314299999999999
139,-0.83162
140,-0.8314799999999999
141,-0.8303799999999999
142,-0.8278200000000001
143,-0.82645
144,-0.8245100000000001
145,-0.8208700000000001
146,-0.8146899999999999
147,-0.80598
148,-0.79745
149,-0.78659
150,-0.77231
151,-0.75344
152,-0.73047
153,-0.70426
154,-0.6722600000000001
155,-0.6332399999999999
156,-0.58641
157,-0.53396
158,-0.47623999999999994
159,-0.41252
160,-0.34284000000000003
161,-0.26746
162,-0.18994
163,-0.10929000000000001
164,-0.025487
165,0.061283000000000004
166,0.14986
167,0.23709000000000002
168,0.32331
169,0.40793
170,0.49061000000000005
171,0.57018
172,0.6460600000000001
173,0.7202
174,0.79433
175,0.87019
176,0.9477200000000001
177,1.028
178,1.1122
179,1.2007
180,1.2932
181,1.3876
182,1.484
183,1.5822
184,1.6818
185,1.7822
186,1.8823
187,1.9818
188,2.08
189,2.1755
190,2.2663
191,2.35
192,2.4249
193,2.4896
194,2.5428
195,2.5837
196,2.6122
197,2.6289999999999996
198,2.635
199,2.6309
200,2.6167
201,2.5932
202,2.5605
203,2.5189
204,2.4686
205,2.4103
206,2.3455
207,2.2757
208,2.2025
209,2.127
210,2.0507
211,1.9748
212,1.8998
213,1.8259999999999998
214,1.7529
215,1.6818
216,1.6127
217,1.5453
218,1.4789
219,1.412
220,1.3449
221,1.2759
222,1.2037
223,1.1268
224,1.0454
225,0.96093
226,0.8741399999999999
227,0.78594
228,0.6965600000000001
229,0.60826
230,0.52228
231,0.43858
232,0.35685
233,0.27569
234,0.1976
235,0.12282
236,0.051213999999999996
237,-0.017596
238,-0.084034
239,-0.14527
240,-0.2016
241,-0.25366
242,-0.30295
243,-0.34876999999999997
244,-0.38948
245,-0.42568
246,-0.45816999999999997
247,-0.48901000000000006
248,-0.5163
249,-0.53981
250,-0.56083
251,-0.58065
252,-0.60192
253,-0.62179
254,-0.6406
255,-0.65885
256,-0.67714
257,-0.6954899999999999
258,-0.71108
259,-0.72401
260,-0.7348899999999999
261,-0.74537
262,-0.75531
263,-0.7642800000000001
264,-0.7733399999999999
265,-0.7833
266,-0.7953
267,-0.80708
268,-0.81735
269,-0.82555
