time,value
0,-0.16327
1,-0.16327
2,-0.16327
3,-0.16327
4,-0.16327
5,-0.16327
6,-0.16327
7,-0.16327
8,-0.16327
9,-0.16327
10,-0.16327
11,-0.16327
12,-0.16327
13,-0.16327
14,-0.16327
15,-0.16327
16,-0.16327
17,-0.16327
18,-0.16327
19,-0.16327
20,-0.16327
21,-0.16327
22,-0.16327
23,-0.16327
24,-0.16327
25,-0.16327
26,-0.16327
27,-0.16327
28,-0.16327
29,-0.16327
30,-0.16327
31,-0.16327
32,-0.16327
33,-0.16327
34,-0.16327
35,-0.16327
36,-0.16327
37,7.7046
38,-0.16327
39,-0.16327
40,2.129
41,-0.16327
42,-0.16327
43,-0.16327
44,-0.16327
45,5.3504
46,-0.16327
47,-0.16327
48,-0.16327
49,-0.16327
50,-0.16327
51,-0.16327
52,-0.16327
53,-0.16327
54,-0.16327
55,-0.16327
56,-0.16327
57,-0.16327
58,-0.16327
59,-0.16327
60,-0.16327
61,-0.16327
62,-0.16327
63,-0.16327
64,-0.16327
65,-0.16327
66,-0.16327
67,-0.16327
68,-0.16327
69,-0.16327
70,-0.16327
71,-0.16327
72,-0.16327
73,-0.16327
74,-0.16327
75,-0.16327
76,-0.16327
77,-0.16327
78,-0.16327
79,-0.16327
80,-0.16327
81,-0.16327
82,-0.16327
83,-0.16327
84,-0.16327
85,-0.16327
86,-0.16327
87,-0.16327
88,-0.16327
89,-0.16327
90,-0.16327
91,-0.16327
92,-0.16327
93,-0.16327
94,-0.16327
95,-0.16327
