time,value
0,-0.25355
1,-0.25355
2,-0.25355
3,-0.25355
4,-0.25355
5,-0.25355
6,-0.25355
7,-0.25355
8,-0.25355
9,-0.25355
10,-0.25355
11,-0.25355
12,-0.25355
13,-0.25355
14,-0.25355
15,-0.25355
16,-0.25355
17,-0.25355
18,-0.25355
19,-0.25355
20,-0.25355
21,-0.25355
22,-0.25355
23,-0.25355
24,-0.25355
25,-0.25355
26,-0.25355
27,-0.25355
28,-0.25355
29,-0.25355
30,-0.25355
31,-0.25355
32,-0.25355
33,-0.25355
34,-0.25355
35,-0.25355
36,-0.25355
37,-0.25355
38,-0.25355
39,-0.25355
40,-0.25355
41,-0.25355
42,-0.25355
43,-0.25355
44,-0.25355
45,-0.25355
46,-0.25355
47,-0.25355
48,-0.25355
49,-0.25355
50,-0.25355
51,-0.25355
52,-0.25355
53,-0.25355
54,-0.25355
55,-0.25355
56,-0.19858
57,-0.0199
58,4.8455
59,-0.0199
60,-0.0199
61,-0.0199
62,5.1754
63,0.94219
64,-0.25355
65,-0.25355
66,-0.25355
67,-0.25355
68,-0.25355
69,-0.25355
70,-0.25355
71,-0.25355
72,-0.25355
73,-0.25355
74,-0.25355
75,-0.25355
76,-0.25355
77,-0.25355
78,-0.25355
79,-0.25355
80,-0.25355
81,-0.25355
82,-0.25355
83,-0.25355
84,-0.21231999999999998
85,-0.0199
86,3.7460000000000004
87,-0.0061563
88,-0.0199
89,-0.06113300000000001
90,4.7493
91,1.4232
92,-0.25355
93,-0.25355
94,-0.25355
95,-0.25355
