time,value
0,0.51031
1,-1.9392
2,0.51031
3,0.51031
4,0.51031
5,0.51031
6,0.51031
7,0.51031
8,0.51031
9,0.51031
10,0.51031
11,0.51031
12,0.51031
13,0.51031
14,0.51031
15,0.51031
16,0.51031
17,0.51031
18,0.51031
19,0.51031
20,-1.9392
21,0.51031
22,0.51031
23,0.51031
24,0.51031
25,0.51031
26,0.51031
27,-1.9392
28,0.51031
29,0.51031
30,-1.9392
31,0.51031
32,0.51031
33,-1.9392
34,0.51031
35,0.51031
36,0.51031
37,-1.9392
38,0.51031
39,0.51031
40,0.51031
41,0.51031
42,-1.9392
43,0.51031
44,0.51031
45,0.51031
46,-1.9392
47,0.51031
48,0.51031
49,0.51031
50,-1.9392
51,0.51031
52,0.51031
53,0.51031
54,0.51031
55,-1.9392
56,0.51031
57,0.51031
58,0.51031
59,-1.9392
60,0.51031
61,0.51031
62,0.51031
63,0.51031
64,0.51031
65,-1.9392
66,0.51031
67,0.51031
68,0.51031
69,0.51031
70,-1.9392
71,0.51031
72,0.51031
73,-1.9392
74,0.51031
75,0.51031
76,-1.9392
77,0.51031
78,0.51031
79,-1.9392
80,0.51031
81,0.51031
82,-1.9392
83,0.51031
84,0.51031
85,0.51031
86,-1.9392
87,0.51031
88,0.51031
89,0.51031
90,-1.9392
91,0.51031
92,0.51031
93,0.51031
94,-1.9392
95,0.51031
