time,value
0,-0.21336999999999998
1,-0.22066999999999998
2,-0.22673000000000001
3,-0.23171
4,-0.23481999999999997
5,-0.23681999999999997
6,-0.2391
7,-0.24119000000000002
8,-0.2427
9,-0.24208000000000002
10,-0.2408
11,-0.23667
12,-0.23119
13,-0.22436
14,-0.21641999999999997
15,-0.2094
16,-0.20037
17,-0.18929
18,-0.1785
19,-0.17067000000000002
20,-0.16722
21,-0.1674
22,-0.16915
23,-0.1712
24,-0.17147
25,-0.16902
26,-0.16529000000000002
27,-0.15963
28,-0.15179
29,-0.13915
30,-0.12515
31,-0.11241
32,-0.095126
33,-0.07812000000000001
34,-0.06299199999999999
35,-0.047062
36,-0.033463
37,-0.026732
38,-0.025105000000000002
39,-0.030083
40,-0.042055
41,-0.056758
42,-0.075029
43,-0.09325900000000001
44,-0.10974
45,-0.12693
46,-0.14444
47,-0.16093
48,-0.17439000000000002
49,-0.18577
50,-0.19527
51,-0.20226
52,-0.20875
53,-0.2122
54,-0.21495999999999998
55,-0.2149
56,-0.2118
57,-0.20793000000000003
58,-0.2028
59,-0.19921
60,-0.19445
61,-0.19224000000000002
62,-0.19435999999999998
63,-0.19994
64,-0.20988
65,-0.22315
66,-0.23923000000000003
67,-0.2557
68,-0.26853
69,-0.27533
70,-0.27789
71,-0.27834000000000003
72,-0.27773000000000003
73,-0.27405999999999997
74,-0.268
75,-0.26178
76,-0.25466
77,-0.24838000000000002
78,-0.24334
79,-0.2384
80,-0.23559000000000002
81,-0.23554
82,-0.23446999999999998
83,-0.23321999999999998
84,-0.23467
85,-0.2347
86,-0.23514000000000002
87,-0.23806999999999998
88,-0.24456999999999998
89,-0.25597
90,-0.26659
91,-0.27594
92,-0.28397
93,-0.28994000000000003
94,-0.29325
95,-0.29613
96,-0.29873
97,-0.29943000000000003
98,-0.30004000000000003
99,-0.29903
100,-0.29780999999999996
101,-0.29691999999999996
102,-0.29348
103,-0.2886
104,-0.28479
105,-0.28142
106,-0.27642
107,-0.26926
108,-0.26281
109,-0.25681
110,-0.2491
111,-0.24106999999999998
112,-0.2327
113,-0.22532
114,-0.21631
115,-0.20615
116,-0.19835999999999998
117,-0.19037
118,-0.18255
119,-0.17479
120,-0.16889
121,-0.16643
122,-0.16349
123,-0.1611
124,-0.16352
125,-0.16834000000000002
126,-0.1717
127,-0.17403
128,-0.17864000000000002
129,-0.18466
130,-0.19035
131,-0.19560999999999998
132,-0.19923
133,-0.20242000000000002
134,-0.20490999999999998
135,-0.20672
136,-0.20890999999999998
137,-0.21116999999999997
138,-0.21331
139,-0.21568
140,-0.21781999999999999
141,-0.21685
142,-0.215
143,-0.21358000000000002
144,-0.2129
145,-0.2123
146,-0.20955
147,-0.20800000000000002
148,-0.20544
149,-0.20102
150,-0.19727999999999998
151,-0.19147999999999998
152,-0.18388
153,-0.17509
154,-0.16539
155,-0.15728
156,-0.15056
157,-0.14568
158,-0.14373
159,-0.14424
160,-0.14974
161,-0.15933
162,-0.16939
163,-0.18181
164,-0.19652
165,-0.21111999999999997
166,-0.22454000000000002
167,-0.23559000000000002
168,-0.24402
169,-0.24979
170,-0.25433
171,-0.25677
172,-0.25789
173,-0.26156
174,-0.26521
175,-0.26631
176,-0.26871
177,-0.27157
178,-0.2736
179,-0.27546
180,-0.2763
181,-0.27669
182,-0.27525
183,-0.27310999999999996
184,-0.26987
185,-0.26555
186,-0.26302
187,-0.25461
188,-0.24468
189,-0.24273000000000003
190,-0.23869
191,-0.22960999999999998
192,-0.21661999999999998
193,-0.19746
194,-0.17182
195,-0.14436
196,-0.11274
197,-0.07828099999999999
198,-0.043849
199,-0.007856100000000001
200,0.026623
201,0.059673000000000004
202,0.08043099999999999
203,0.088741
204,0.08558500000000001
205,0.06775
206,0.052814
207,0.030037
208,-0.0011164000000000002
209,-0.021853
210,-0.043188
211,-0.063417
212,-0.076896
213,-0.08731799999999999
214,-0.09705599999999999
215,-0.12069
216,-0.13255999999999998
217,-0.1413
218,-0.15921
219,-0.16798
220,-0.18103
221,-0.19471
222,-0.19557
223,-0.18797
224,-0.18244000000000002
225,-0.17239000000000002
226,-0.15786
227,-0.1472
228,-0.13699
229,-0.12592
230,-0.11769
231,-0.10547000000000001
232,-0.091151
233,-0.078446
234,-0.076504
235,-0.099114
236,-0.10694000000000001
237,-0.10782
238,-0.11317
239,-0.12577
240,-0.13028
241,-0.13482
242,-0.14873
243,-0.1821
244,-0.19667
245,-0.21204
246,-0.21725999999999998
247,-0.21857
248,-0.21591
249,-0.20531
250,-0.19045
251,-0.17322
252,-0.1521
253,-0.12582000000000002
254,-0.096634
255,-0.064443
256,-0.032754000000000005
257,0.0013037
258,0.039322
259,0.08032
260,0.11887
261,0.17526
262,0.23643000000000003
263,0.29767
264,0.35821
265,0.4083
266,0.46111
267,0.49828
268,0.53437
269,0.58082
270,0.63639
271,0.6975899999999999
272,0.76152
273,0.8231
274,0.87895
275,0.95757
276,1.0125
277,1.0449
278,1.0829
279,1.1688
280,1.2264
281,1.2747
282,1.2937
283,1.2794
284,1.2646
285,1.2299
286,1.1935
287,1.138
288,1.0390000000000001
289,1.0447
290,1.0282
291,1.0036
292,0.9939399999999999
293,0.97136
294,0.95905
295,0.9665799999999999
296,0.9673200000000001
297,0.9657
298,0.98045
299,0.99884
300,1.0184
301,1.0486
302,1.0759
303,1.1102
304,1.1511
305,1.1972
306,1.2464
307,1.3019999999999998
308,1.3618
309,1.4316
310,1.5101
311,1.6025
312,1.6958
313,1.8083
314,1.925
315,2.0561
316,2.1736
317,2.2925
318,2.4455
319,2.5864
320,2.7017
321,2.8286
322,2.9524
323,3.0552
324,3.1755
325,3.2735
326,3.2835
327,3.2061
328,3.2602
329,3.3516
330,3.3407
331,3.3087
332,3.1995
333,3.0295
334,3.0131
335,2.9702
336,2.6776
337,2.6189999999999998
338,2.6277
339,2.5186
340,2.3687
341,2.2034
342,2.0353
343,1.9302
344,1.7789
345,1.6118
346,1.4874
347,1.3929
348,1.2287
349,1.1344
350,1.0139
351,0.8950100000000001
352,0.75874
353,0.59268
354,0.5321199999999999
355,0.42152
356,0.3064
357,0.21736999999999998
358,0.11993
359,-0.0081583
360,-0.06354800000000001
361,-0.18838
362,-0.24488000000000001
363,-0.30557
364,-0.38606
365,-0.43751
366,-0.49313
367,-0.54
368,-0.59103
369,-0.6358699999999999
370,-0.68711
371,-0.72202
372,-0.7478
373,-0.78117
374,-0.8082699999999999
375,-0.8317899999999999
376,-0.8597
377,-0.8832399999999999
378,-0.90605
379,-0.9359299999999999
380,-0.9462799999999999
381,-0.97006
382,-0.9909899999999999
383,-1.0114
384,-1.033
385,-1.0533
386,-1.0792
387,-1.1053
388,-1.1298
389,-1.1454
390,-1.1684
391,-1.1867
392,-1.2009999999999998
393,-1.2195
394,-1.232
395,-1.2432
396,-1.2565
397,-1.2641
398,-1.2759
399,-1.2864
400,-1.294
401,-1.3021
402,-1.3099
403,-1.3175
404,-1.3226
405,-1.3301
406,-1.3353
407,-1.3393
408,-1.3453
409,-1.3526
410,-1.3566
411,-1.361
412,-1.3661
413,-1.3723
414,-1.3761
415,-1.3796
416,-1.3837
417,-1.3881
418,-1.3923
419,-1.3952
420,-1.3977
421,-1.4007
422,-1.4032
423,-1.4057
424,-1.4074
425,-1.4104
426,-1.4137
427,-1.4147
428,-1.4177
429,-1.4205
430,-1.423
431,-1.4257
432,-1.4279
433,-1.4298
434,-1.4308
435,-1.433
436,-1.435
437,-1.4358
438,-1.4367
439,-1.4373
440,-1.4383
441,-1.4396
442,-1.4409
443,-1.4419
444,-1.4427
445,-1.4442
446,-1.4454
447,-1.4458
