time,value
0,0.5936100000000001
1,0.5936100000000001
2,0.5936100000000001
3,0.5936100000000001
4,0.5936100000000001
5,0.49415
6,0.5936100000000001
7,0.5936100000000001
8,0.49415
9,0.49415
10,0.49415
11,0.49415
12,0.49415
13,0.49415
14,0.49415
15,0.49415
16,0.49415
17,0.49415
18,0.3947
19,0.49415
20,0.3947
21,0.49415
22,0.3947
23,0.49415
24,0.3947
25,0.3947
26,0.3947
27,0.3947
28,0.3947
29,0.3947
30,0.3947
31,0.49415
32,0.3947
33,-0.79873
34,-2.7878
35,0.1958
36,0.49415
37,0.3947
38,0.49415
39,0.49415
40,0.49415
41,0.3947
42,-0.79873
43,-2.7878
44,0.49415
45,0.49415
46,0.3947
47,0.3947
48,0.49415
49,-1.7933
50,-1.8927
51,0.5936100000000001
52,0.49415
53,0.49415
54,0.3947
55,0.29525
56,-2.7878
57,-0.50037
58,0.69306
59,0.5936100000000001
60,0.5936100000000001
61,0.3947
62,0.49415
63,0.49415
64,0.49415
65,0.49415
66,0.3947
67,-0.40092
68,-2.7878
69,-0.20201
70,0.5936100000000001
71,0.49415
72,0.3947
73,-1.9922
74,-1.6938
75,0.5936100000000001
76,0.49415
77,0.3947
78,-1.9922
79,-1.4949
80,0.49415
81,0.3947
82,-0.40092
83,-2.7878
84,-0.20201
85,0.49415
86,0.49415
87,-0.89818
88,-2.7878
89,0.49415
90,0.49415
91,0.49415
92,-2.7878
93,-0.79873
94,0.49415
95,0.49415
