time,value
0,-0.12569
1,-0.12569
2,-0.12569
3,-0.12569
4,-0.12569
5,-0.12569
6,-0.12569
7,-0.12569
8,-0.12569
9,-0.12569
10,-0.12569
11,-0.12569
12,-0.12569
13,-0.12569
14,-0.12569
15,-0.12569
16,-0.12569
17,-0.12569
18,-0.12569
19,-0.12569
20,-0.12569
21,-0.12569
22,-0.12569
23,-0.12569
24,-0.12569
25,-0.12569
26,-0.12569
27,-0.12569
28,0.46653
29,9.6213
30,0.66394
31,0.56523
32,0.12107000000000001
33,-0.12569
34,-0.12569
35,-0.12569
36,-0.12569
37,-0.12569
38,-0.12569
39,-0.12569
40,-0.12569
41,-0.12569
42,-0.12569
43,-0.12569
44,-0.12569
45,-0.12569
46,-0.12569
47,-0.12569
48,-0.12569
49,-0.12569
50,-0.12569
51,-0.12569
52,-0.12569
53,-0.12569
54,-0.12569
55,-0.12569
56,-0.12569
57,-0.12569
58,-0.12569
59,-0.12569
60,-0.12569
61,-0.12569
62,-0.12569
63,-0.12569
64,-0.12569
65,-0.12569
66,-0.12569
67,-0.12569
68,-0.12569
69,-0.12569
70,-0.12569
71,-0.12569
72,-0.12569
73,-0.12569
74,-0.12569
75,-0.12569
76,-0.12569
77,-0.12569
78,-0.12569
79,-0.12569
80,-0.12569
81,-0.12569
82,-0.12569
83,-0.12569
84,-0.12569
85,-0.12569
86,-0.12569
87,-0.12569
88,-0.12569
89,-0.12569
90,-0.12569
91,-0.12569
92,-0.12569
93,-0.12569
94,-0.12569
95,-0.12569
