[<text>
<title>security pacific corp &lt;spc&gt; 3rd qtr net</title>
<dateline>    los angeles, oct 19 - 
    </dateline>shr 1.16 dlrs vs 1.09 dlrs
    net 128.1 mln vs 118.3 mln
    avg shrs 108.8 mln vs 105.7 mln
    nine months
    shr 40 cts vs 3.12 dlrs
    net 53.2 mln vs 335.1 mln
    avg shrs 108.0 mln vs 105.2 mln
    note: prior-period data have been restated to include on a
pooling-of-interest basis the august 31, 1987, acquisition of
rainier bancorporation.
 reuter
</text>]