time,value
0,-1.3183
1,-1.2065
2,-1.025
3,-0.7652899999999999
4,-0.44588999999999995
5,-0.10021000000000001
6,0.22455999999999998
7,0.50548
8,0.7357
9,0.9215700000000001
10,1.0806
11,1.2232
12,1.3674
13,1.5216
14,1.6824
15,1.8366
16,1.9558
17,2.0258
18,2.0435
19,2.0244
20,1.9943
21,1.9617
22,1.9306
23,1.8889
24,1.8288
25,1.755
26,1.6702
27,1.587
28,1.5069
29,1.4325
30,1.3653
31,1.3007
32,1.2431
33,1.188
34,1.1431
35,1.1109
36,1.0892
37,1.0832
38,1.0864
39,1.1103
40,1.1581
41,1.2289
42,1.3209
43,1.4113
44,1.4935
45,1.5525
46,1.5838
47,1.5932
48,1.5777
49,1.5504
50,1.5102
51,1.4595
52,1.4033
53,1.3386
54,1.2782
55,1.2209999999999999
56,1.1692
57,1.1228
58,1.0757
59,1.0365
60,1.0046
61,0.9832799999999999
62,0.9696
63,0.95211
64,0.92837
65,0.889
66,0.8356299999999999
67,0.76939
68,0.6890000000000001
69,0.60132
70,0.50343
71,0.40208
72,0.29932
73,0.19517
74,0.09697
75,0.0023093000000000002
76,-0.080864
77,-0.15165
78,-0.21322
79,-0.26602
80,-0.32072
81,-0.37614000000000003
82,-0.43373
83,-0.49248000000000003
84,-0.54548
85,-0.59364
86,-0.6292300000000001
87,-0.65363
88,-0.6712199999999999
89,-0.6856899999999999
90,-0.70676
91,-0.73026
92,-0.7549
93,-0.77669
94,-0.79089
95,-0.80109
96,-0.80271
97,-0.79777
98,-0.7877
99,-0.77384
100,-0.76295
101,-0.75275
102,-0.74374
103,-0.73397
104,-0.7220300000000001
105,-0.71308
106,-0.70795
107,-0.7113
108,-0.72325
109,-0.7398
110,-0.75802
111,-0.76999
112,-0.77471
113,-0.77294
114,-0.76635
115,-0.7590899999999999
116,-0.74903
117,-0.7389
118,-0.7316
119,-0.72946
120,-0.73703
121,-0.7487
122,-0.7623300000000001
123,-0.77544
124,-0.78676
125,-0.8015899999999999
126,-0.81719
127,-0.8350700000000001
128,-0.85306
129,-0.86713
130,-0.87665
131,-0.87482
132,-0.8626
133,-0.8413799999999999
134,-0.8145399999999999
135,-0.78666
136,-0.75436
137,-0.71612
138,-0.6664399999999999
139,-0.6007
140,-0.5160399999999999
141,-0.40926
142,-0.28652
143,-0.15684
144,-0.033148000000000004
145,0.074405
146,0.16295
147,0.22935
148,0.27388
149,0.29458
150,0.29154
151,0.26911
152,0.2298
153,0.17795
154,0.11385
155,0.038268
156,-0.044995
157,-0.13271
158,-0.21883000000000002
159,-0.30191999999999997
160,-0.38187
161,-0.45787
162,-0.52977
163,-0.5925600000000001
164,-0.6462
165,-0.6923199999999999
166,-0.7336600000000001
167,-0.77359
168,-0.80711
169,-0.8342200000000001
170,-0.85456
171,-0.8704799999999999
172,-0.88886
173,-0.90364
174,-0.91655
175,-0.92637
176,-0.9337
177,-0.9485299999999999
178,-0.96446
179,-0.98274
180,-0.99775
181,-1.004
182,-1.0079
183,-1.0049
184,-1.0002
185,-0.9923700000000001
186,-0.97921
187,-0.96662
188,-0.94868
189,-0.92396
190,-0.88016
191,-0.80369
192,-0.6918
193,-0.53735
194,-0.34331999999999996
195,-0.10767
196,0.16585999999999998
197,0.45774
198,0.74638
199,1.0042
200,1.219
201,1.3872
202,1.506
203,1.5773
204,1.5997
205,1.5835
206,1.5424
207,1.4884
208,1.4319
209,1.3765
210,1.3304
211,1.3008
212,1.2908
213,1.2967
214,1.3037
215,1.2961
216,1.2590000000000001
217,1.1868
218,1.0845
219,0.9620200000000001
220,0.83536
221,0.7119
222,0.5956600000000001
223,0.48402
224,0.37053
225,0.25743
226,0.14094
227,0.026059
228,-0.086561
229,-0.1991
230,-0.30524
231,-0.40776999999999997
232,-0.4995
233,-0.57896
234,-0.64793
235,-0.7038800000000001
236,-0.75455
237,-0.7984600000000001
238,-0.8381700000000001
239,-0.87459
240,-0.9037700000000001
241,-0.93055
242,-0.9520200000000001
243,-0.9722
244,-0.9925200000000001
245,-1.0106
246,-1.0296
247,-1.0444
248,-1.0556
249,-1.0619
250,-1.0617
251,-1.0598
252,-1.0563
253,-1.0561
254,-1.0604
255,-1.0676
256,-1.0773
257,-1.0859
258,-1.0957
259,-1.1099
260,-1.1311
261,-1.16
262,-1.1929
263,-1.2297
264,-1.2724
265,-1.3219
266,-1.3733
267,-1.4135
268,-1.4334
269,-1.4340000000000002
