time,value
0,-1.4315
1,0.067498
2,-1.9545
3,-2.2372
4,-1.1881
5,-1.3753
6,-1.9775
7,-1.7108
8,-1.4469999999999998
9,-1.6933
10,-1.7864
11,-1.6076
12,-1.6096
13,-1.6906
14,-1.655
15,-1.6139
16,-1.62
17,-1.6242
18,-1.6077
19,-1.6037
20,-1.5903
21,-1.5769
22,-1.5703
23,-1.5514
24,-1.5519999999999998
25,-1.5334
26,-1.5371
27,-1.5272
28,-1.5237
29,-1.5165
30,-1.5016
31,-1.4974
32,-1.4709999999999999
33,-1.4668
34,-1.4396
35,-1.4256
36,-1.4014
37,-1.3762
38,-1.3539
39,-1.3159999999999998
40,-1.2938
41,-1.2478
42,-1.22
43,-1.1731
44,-1.1305
45,-1.0836
46,-1.0298
47,-0.98765
48,-0.92753
49,-0.8976
50,-0.85455
51,-0.83426
52,-0.81176
53,-0.79713
54,-0.79297
55,-0.77817
56,-0.7804399999999999
57,-0.7608600000000001
58,-0.76354
59,-0.75074
60,-0.74466
61,-0.73574
62,-0.7215
63,-0.72037
64,-0.7027800000000001
65,-0.71349
66,-0.7075100000000001
67,-0.72347
68,-0.73715
69,-0.75068
70,-0.7690100000000001
71,-0.7916
72,-0.85372
73,-0.89094
74,-0.92968
75,-0.94891
76,-0.98777
77,-1.0272
78,-1.0562
79,-1.0989
80,-1.1231
81,-1.1653
82,-1.1847
83,-1.2234
84,-1.2508
85,-1.2726
86,-1.2965
87,-1.3046
88,-1.3237
89,-1.3206
90,-1.3476
91,-1.3657
92,-1.396
93,-1.4214
94,-1.4263
95,-1.4215
96,-1.3921
97,-1.3945
98,-1.3762
99,-1.3636
100,-1.3388
101,-1.3233
102,-1.3143
103,-1.2895
104,-1.2837
105,-1.2653
106,-1.27
107,-1.2511
108,-1.2452
109,-1.2504
110,-1.2526
111,-1.2527
112,-1.2364
113,-1.2578
114,-1.2551
115,-1.2508
116,-1.2342
117,-1.23
118,-1.2255
119,-1.2006
120,-1.1968
121,-1.1794
122,-1.1818
123,-1.1605
124,-1.1479
125,-1.1301
126,-1.1042
127,-1.0858
128,-1.0486
129,-1.0339
130,-0.99755
131,-0.9781200000000001
132,-0.9484100000000001
133,-0.92404
134,-0.90543
135,-0.87739
136,-0.86734
137,-0.8407399999999999
138,-0.8432
139,-0.8301
140,-0.82514
141,-0.81547
142,-0.80561
143,-0.8085600000000001
144,-0.79345
145,-0.8026399999999999
146,-0.79903
147,-0.82055
148,-0.83063
149,-0.8402200000000001
150,-0.85445
151,-0.8633
152,-0.8905200000000001
153,-0.89546
154,-0.9238700000000001
155,-0.93415
156,-0.95416
157,-0.96731
158,-0.9724700000000001
159,-0.98545
160,-0.9879100000000001
161,-1.0237
162,-1.0387
163,-1.0592
164,-1.0551
165,-1.0501
166,-1.0474
167,-1.0325
168,-1.0306
169,-1.0067
170,-1.0077
171,-0.98911
172,-0.9807600000000001
173,-0.96859
174,-0.95365
175,-0.94696
176,-0.9262
177,-0.9345899999999999
178,-0.92496
179,-0.9325
180,-0.9284399999999999
181,-0.93199
182,-0.93901
183,-0.9366200000000001
184,-0.9504
185,-0.94166
186,-0.9555
187,-0.9486
188,-0.94988
189,-0.9399200000000001
190,-0.9257799999999999
191,-0.92007
192,-0.8880600000000001
193,-0.8631200000000001
194,-0.8125399999999999
195,-0.78868
196,-0.75644
197,-0.72719
198,-0.6996
199,-0.6659999999999999
200,-0.65091
201,-0.6192
202,-0.61866
203,-0.59895
204,-0.59065
205,-0.57957
206,-0.5687399999999999
207,-0.56228
208,-0.5361199999999999
209,-0.53189
210,-0.50338
211,-0.49193000000000003
212,-0.46975
213,-0.45346000000000003
214,-0.43277
215,-0.40454
216,-0.40423000000000003
217,-0.38934
218,-0.39501
219,-0.37538
220,-0.37283
221,-0.36773
222,-0.358
223,-0.35270999999999997
224,-0.33198
225,-0.33416999999999997
226,-0.31228
227,-0.31264000000000003
228,-0.30680999999999997
229,-0.30968
230,-0.30908
231,-0.30185
232,-0.31859
233,-0.3103
234,-0.31265
235,-0.28478000000000003
236,-0.27404
237,-0.25873
238,-0.23909
239,-0.22775
240,-0.20469
241,-0.20624
242,-0.18723
243,-0.1922
244,-0.18555
245,-0.18655
246,-0.18903
247,-0.18362
248,-0.1931
249,-0.18137
250,-0.19909000000000002
251,-0.19535
252,-0.20360999999999999
253,-0.20265
254,-0.20010999999999998
255,-0.20407
256,-0.19029000000000001
257,-0.19638
258,-0.17887
259,-0.18220999999999998
260,-0.16965999999999998
261,-0.16246
262,-0.15367
263,-0.13591
264,-0.13255999999999998
265,-0.10662
266,-0.10828
267,-0.086521
268,-0.078709
269,-0.063532
270,-0.048999
271,-0.042174
272,-0.020631
273,-0.021182
274,0.0013609000000000002
275,0.0018585000000000001
276,0.016632
277,0.023400999999999998
278,0.033156
279,0.053177999999999996
280,0.058633000000000005
281,0.084198
282,0.079667
283,0.098322
284,0.10303
285,0.11757999999999999
286,0.13283
287,0.14229
288,0.16814
289,0.17463
290,0.20728000000000002
291,0.21899000000000002
292,0.24821999999999997
293,0.2719
294,0.2995
295,0.33219
296,0.34605
297,0.38166
298,0.38923
299,0.41503
300,0.41776
301,0.43098000000000003
302,0.4502
303,0.46607
304,0.49721000000000004
305,0.5139199999999999
306,0.56587
307,0.59763
308,0.63825
309,0.66209
310,0.68955
311,0.72934
312,0.7541100000000001
313,0.79503
314,0.80316
315,0.833
316,0.8416100000000001
317,0.8545200000000001
318,0.8650899999999999
319,0.8712
320,0.8898299999999999
321,0.88175
322,0.8960799999999999
323,0.8901700000000001
324,0.90512
325,0.9103399999999999
326,0.9174
327,0.9333299999999999
328,0.9349799999999999
329,0.9535
330,0.93971
331,0.95178
332,0.9477399999999999
333,0.9479
334,0.94096
335,0.92961
336,0.93616
337,0.9200799999999999
338,0.9253
339,0.9065
340,0.9063100000000001
341,0.89556
342,0.8858299999999999
343,0.88228
344,0.8633799999999999
345,0.86295
346,0.8319700000000001
347,0.8224899999999999
348,0.79419
349,0.7741399999999999
350,0.7519100000000001
351,0.72435
352,0.71032
353,0.67037
354,0.64412
355,0.58455
356,0.5391600000000001
357,0.48281
358,0.42621000000000003
359,0.37522
360,0.31537
361,0.28233
362,0.22655
363,0.19852
364,0.15946
365,0.13538
366,0.1126
367,0.08794
368,0.081738
369,0.061548
370,0.06894700000000001
371,0.052994000000000006
372,0.050901
373,0.033872
374,0.015511000000000002
375,0.00013198
376,-0.032888
377,-0.055026
378,-0.11095
379,-0.14857
380,-0.2065
381,-0.25824
382,-0.31066
383,-0.36122
384,-0.39819
385,-0.45828
386,-0.49345
387,-0.5412100000000001
388,-0.5643
389,-0.59801
390,-0.62821
391,-0.6487
392,-0.67701
393,-0.68466
394,-0.71541
395,-0.72196
396,-0.74411
397,-0.75353
398,-0.76355
399,-0.77603
400,-0.77554
401,-0.79088
402,-0.7814
403,-0.79271
404,-0.78204
405,-0.77758
406,-0.7664
407,-0.75057
408,-0.7459899999999999
409,-0.72359
410,-0.72605
411,-0.70908
412,-0.71254
413,-0.7046899999999999
414,-0.6976100000000001
415,-0.69067
416,-0.6722100000000001
417,-0.67177
418,-0.6492899999999999
419,-0.65099
420,-0.63341
421,-0.62622
422,-0.61241
423,-0.59388
424,-0.58333
425,-0.55006
426,-0.53515
427,-0.49401999999999996
428,-0.46688999999999997
429,-0.41812
430,-0.36449000000000004
431,-0.31093000000000004
432,-0.24900999999999998
433,-0.20204
434,-0.12617
435,-0.07450599999999999
436,-0.011387999999999999
437,0.028441
438,0.06536
439,0.096314
440,0.10640999999999999
441,0.12875999999999999
442,0.13417
443,0.17554
444,0.20475
445,0.24581
446,0.27951
447,0.31203000000000003
448,0.35577
449,0.37763
450,0.41126
451,0.40717
452,0.41794
453,0.41405
454,0.4154
455,0.42113
456,0.42052
457,0.44033
458,0.43946999999999997
459,0.46915
460,0.47988000000000003
461,0.49755
462,0.51071
463,0.53999
464,0.59608
465,0.6304
466,0.67201
467,0.67888
468,0.7116600000000001
469,0.7349399999999999
470,0.76062
471,0.78051
472,0.7843100000000001
473,0.80355
474,0.7982
475,0.81676
476,0.81326
477,0.82201
478,0.8227
479,0.82075
480,0.82852
481,0.81729
482,0.82665
483,0.80845
484,0.8183199999999999
485,0.81834
486,0.82326
487,0.8301
488,0.8335899999999999
489,0.8593799999999999
490,0.8584200000000001
491,0.87903
492,0.87882
493,0.893
494,0.8974
495,0.89843
496,0.9101
497,0.9055
498,0.92375
499,0.9114399999999999
500,0.9213100000000001
501,0.91751
502,0.92145
503,0.92669
504,0.92258
505,0.9364600000000001
506,0.9268299999999999
507,0.9404299999999999
508,0.92896
509,0.93145
510,0.9265700000000001
511,0.92091
512,0.9263399999999999
513,0.91633
514,0.92785
515,0.90927
516,0.92051
517,0.91533
518,0.91135
519,0.9178
520,0.92909
521,0.94119
522,0.9154100000000001
523,0.96365
524,1.0607
525,1.1786
526,1.2392
527,1.2792
528,1.3427
529,1.3896
530,1.4411
531,1.4496
532,1.4791
533,1.4889
534,1.5078
535,1.5297
536,1.5424
537,1.5701
538,1.5757
539,1.6076
540,1.6155
541,1.6412
542,1.6574
543,1.6686
544,1.6838
545,1.6835
546,1.7103
547,1.7055
548,1.7268
549,1.734
550,1.7524
551,1.7713
552,1.7845
553,1.8178
554,1.8261
555,1.8554
556,1.8604
557,1.8925
558,1.9211
559,1.9441
560,1.9669
561,1.9755
562,2.015
563,2.0215
564,2.0483
565,2.0572
566,2.0791
567,2.0981
568,2.1026
569,2.1215
570,2.1188
571,2.1408
572,2.134
573,2.1491
574,2.1615
575,2.1748
576,2.1908
577,2.1887
578,2.2102
579,2.1957
580,2.2029
581,2.1915
582,2.1906
583,2.1884
584,2.1787
585,2.1858
586,2.1694
587,2.1790000000000003
588,2.1621
589,2.1635
590,2.1554
591,2.1496
592,2.1515
593,2.1372
594,2.1472
595,2.1261
596,2.1316
597,2.1192
598,2.1182
599,2.1168
600,2.1087
601,2.1158
602,2.0991
603,2.1096
604,2.0951
605,2.1004
606,2.0962
607,2.0955
608,2.1032
609,2.0963
610,2.114
611,2.1011
612,2.1115
613,2.1006
614,2.0969
615,2.0821
616,2.0468
617,2.0182
618,1.9666
619,1.9391
620,1.88
621,1.8388
622,1.7916
623,1.751
624,1.7213
625,1.6826
626,1.6711
627,1.6321
628,1.6219
629,1.5965
630,1.5794
631,1.5565
632,1.5282
633,1.517
634,1.4815
635,1.4654
636,1.4176
637,1.3852
638,1.3404
639,1.2972
640,1.2592
641,1.2087
642,1.1866
643,1.1427
644,1.124
645,1.0879
646,1.0698
647,1.0551
648,1.0338
649,1.0262
650,0.9991399999999999
651,0.9910700000000001
652,0.9501700000000001
653,0.9315899999999999
654,0.9037799999999999
655,0.8619600000000001
656,0.80498
657,0.73544
658,0.70348
659,0.65425
660,0.62768
661,0.58148
662,0.5527
663,0.53073
664,0.51162
665,0.50989
666,0.49194
667,0.50175
668,0.48715
669,0.49075
670,0.48189
671,0.47636000000000006
672,0.4753
673,0.46135
674,0.46771999999999997
675,0.44915
676,0.45605
677,0.4446
678,0.44461000000000006
679,0.44068999999999997
680,0.43323
681,0.43943999999999994
682,0.42903
683,0.44356
684,0.43251999999999996
685,0.4415
686,0.44065
687,0.44598999999999994
688,0.45682
689,0.4562
690,0.47338
691,0.46351000000000003
692,0.4771
693,0.47171
694,0.47452
695,0.46416999999999997
696,0.44111000000000006
697,0.42677
698,0.39648
699,0.39111999999999997
700,0.35952
701,0.35020999999999997
702,0.33311
703,0.32314
704,0.31913
705,0.30791999999999997
706,0.31748000000000004
707,0.30195
708,0.31226
709,0.30754000000000004
710,0.31631
711,0.31932
712,0.32018
713,0.33454
714,0.33026
715,0.34557
716,0.33171999999999996
717,0.3367
718,0.32775
719,0.32014000000000004
720,0.31251
721,0.29394000000000003
722,0.29415
723,0.26852
724,0.26138
725,0.23144
726,0.21364
727,0.19187
728,0.16602999999999998
729,0.14891
730,0.11465999999999998
731,0.10419
732,0.06797
733,0.051511
734,0.022795
735,-0.0011187
736,-0.022675999999999998
737,-0.059820000000000005
738,-0.091264
739,-0.15245999999999998
740,-0.18204
741,-0.21868
742,-0.24327
743,-0.27771999999999997
744,-0.31155
745,-0.3319
746,-0.37401999999999996
747,-0.39725
748,-0.44168999999999997
749,-0.46408999999999995
750,-0.50108
751,-0.5331600000000001
752,-0.56275
753,-0.60214
754,-0.61936
755,-0.65676
756,-0.6801699999999999
757,-0.71885
758,-0.72588
759,-0.7501399999999999
760,-0.8254299999999999
761,-0.90461
762,-0.94942
763,-0.9313899999999999
764,-0.9496899999999999
765,-0.96378
766,-0.97964
767,-0.98121
768,-0.9873
769,-1.0039
770,-1.0004
771,-1.0196
772,-1.0199
773,-1.0374
774,-1.0409
775,-1.0511
776,-1.0614
777,-1.0605
778,-1.0733
779,-1.0642
780,-1.0788
781,-1.0724
782,-1.0787
783,-1.0793
784,-1.0786
785,-1.0851
786,-1.0763
787,-1.089
788,-1.0816
789,-1.0943
790,-1.0939
791,-1.0992
792,-1.1043
793,-1.1008
794,-1.1106
795,-1.0987
796,-1.1119
797,-1.1048
798,-1.1105
799,-1.1093
800,-1.1067
801,-1.1112
802,-1.1007
803,-1.1101
804,-1.0981
805,-1.1059999999999999
806,-1.101
807,-1.102
808,-1.103
809,-1.0983
810,-1.1096
811,-1.1002
812,-1.1162
813,-1.1138
814,-1.1278
815,-1.1345
816,-1.1375
817,-1.1465
818,-1.1444
819,-1.1628
820,-1.1563
821,-1.1692
822,-1.1724
823,-1.18
824,-1.1769
825,-1.1666
826,-1.1836
827,-1.1869
828,-1.209
829,-1.2052
830,-1.2158
831,-1.215
832,-1.2097
833,-1.2112
834,-1.1957
835,-1.1911
836,-1.1657
837,-1.1687
838,-1.1566
839,-1.1454
840,-1.1344
841,-1.1207
842,-1.1173
843,-1.0912
844,-1.0951
845,-1.0819
846,-1.082
847,-1.0737
848,-1.0674
849,-1.067
850,-1.0521
851,-1.0572
852,-1.0427
853,-1.0496
854,-1.0419
855,-1.0428
856,-1.0433
857,-1.0386
858,-1.0476
859,-1.0376
860,-1.0538
861,-1.0498
862,-1.061
863,-1.0626
864,-1.0634
865,-1.0687
866,-1.0596
867,-1.0681
868,-1.0544
869,-1.0617
870,-1.0515
871,-1.0486
872,-1.0405
873,-1.018
874,-1.0027
875,-0.9749200000000001
876,-0.97709
877,-0.9396399999999999
878,-0.89397
879,-0.8402200000000001
880,-0.80857
881,-0.78989
882,-0.7467600000000001
883,-0.71172
884,-0.65784
885,-0.63673
886,-0.60656
887,-0.5868399999999999
888,-0.5621
889,-0.53036
890,-0.5120100000000001
891,-0.47647
892,-0.46768999999999994
893,-0.43606000000000006
894,-0.41748999999999997
895,-0.3857
896,-0.35886999999999997
897,-0.33986
898,-0.30282
899,-0.28075
900,-0.24561999999999998
901,-0.23820999999999998
902,-0.20237
903,-0.1798
904,-0.17432
905,-0.14798
906,-0.081916
907,0.013115
908,0.030372000000000003
909,0.035594
910,0.039625
911,0.069978
912,0.086324
913,0.090862
914,0.11625
915,0.12627
916,0.15392
917,0.15656
918,0.18136
919,0.1935
920,0.20654
921,0.23756999999999998
922,0.27819
923,0.34106
924,0.35989
925,0.3917
926,0.41118999999999994
927,0.44255
928,0.46066999999999997
929,0.46698
930,0.48316000000000003
931,0.4764
932,0.49021000000000003
933,0.48026
934,0.48927
935,0.4844
936,0.48203
937,0.48643000000000003
938,0.48093
939,0.49478
940,0.48135
941,0.49101999999999996
942,0.48286
943,0.48645
944,0.48596000000000006
945,0.4807
946,0.48752
947,0.47503999999999996
948,0.4858
949,0.47036000000000006
950,0.47396000000000005
951,0.46728000000000003
952,0.46648
953,0.46971
954,0.46087
955,0.47493
956,0.46466999999999997
957,0.47357
958,0.46343
959,0.47239
960,0.47429
961,0.46245
962,0.47384
963,0.49026000000000003
964,0.52312
965,0.49732
966,0.48268
967,0.47231000000000006
968,0.47055
969,0.46574
970,0.45666
971,0.47855
972,0.47523000000000004
973,0.4962
974,0.5061100000000001
975,0.53252
976,0.54894
977,0.55776
978,0.57703
979,0.57676
980,0.60059
981,0.60067
982,0.62358
983,0.63246
984,0.64463
985,0.65956
986,0.6625800000000001
987,0.68038
988,0.67024
989,0.69058
990,0.70496
991,0.7450100000000001
992,0.78335
993,0.81628
994,0.8563299999999999
995,0.8754200000000001
996,0.91456
997,0.91912
998,0.93729
999,0.94024
1000,0.9502299999999999
1001,0.96091
1002,0.9613200000000001
1003,0.9913700000000001
1004,1.0032
1005,1.0222
1006,0.9971399999999999
1007,0.98669
1008,0.98839
1009,0.9935799999999999
1010,1.0017
1011,0.98719
1012,0.99541
1013,0.97051
1014,0.96246
1015,0.9467200000000001
1016,0.94511
1017,0.9447700000000001
1018,0.9308
1019,0.9418200000000001
1020,0.92869
1021,0.9213899999999999
1022,0.8889600000000001
1023,0.89315
1024,0.88825
1025,0.8275299999999999
1026,0.74448
1027,0.6733
1028,0.6562600000000001
1029,0.60219
1030,0.56366
1031,0.5332399999999999
1032,0.52252
1033,0.50718
1034,0.47753
1035,0.46753
1036,0.42873999999999995
1037,0.40406
1038,0.35158
1039,0.30651
1040,0.25142
1041,0.19777999999999998
1042,0.16349
1043,0.12236
1044,0.11288
1045,0.083208
1046,0.08054700000000001
1047,0.06666
1048,0.056687
1049,0.044318
1050,0.019241
1051,0.009079799999999999
1052,-0.024543000000000002
1053,-0.033775
1054,-0.056001
1055,-0.055862
1056,-0.061921000000000004
1057,-0.077574
1058,-0.088675
1059,-0.12117
1060,-0.15309
1061,-0.23818000000000003
1062,-0.30714
1063,-0.37682
1064,-0.43411000000000005
1065,-0.48963999999999996
1066,-0.5444
1067,-0.57131
1068,-0.61815
1069,-0.64472
1070,-0.68835
1071,-0.7119300000000001
1072,-0.7387100000000001
1073,-0.7647
1074,-0.78191
1075,-0.78819
1076,-0.82431
1077,-0.8980100000000001
1078,-0.8379
1079,-0.79647
1080,-0.97075
1081,-0.9555899999999999
1082,-0.64099
1083,-0.7552
1084,-1.1428
1085,-0.63837
1086,-0.13180999999999998
1087,-1.078
1088,-1.3395
1089,0.76395
1090,0.50335
1091,-6.2426
