[<text>
<title>seacoast banking corp of florida &lt;sbcf.o&gt; 3rd</title>
<dateline>    stuart, fla., oct 20 -
    </dateline>shr 44 cts vs 33 cts
    net 1,026,000 vs 769,000
    nine mths
    shr 1.30 dlrs vs 1.06 dlrs
    net 3,035,000 vs 2,472,000
 reuter
</text>]