time,value
0,-0.8931
1,-0.8931
2,-0.8931
3,-0.8931
4,-0.8931
5,-0.8931
6,-0.8931
7,-0.8931
8,-0.8931
9,-0.8931
10,-0.8931
11,-0.8931
12,-0.8931
13,-0.8931
14,-0.8931
15,-0.8931
16,-0.8931
17,-0.8931
18,-0.8931
19,-0.8931
20,-0.8931
21,-0.8931
22,-0.8931
23,-0.8931
24,-0.8931
25,-0.8931
26,-0.8931
27,-0.8931
28,-0.8931
29,-0.8931
30,-0.8931
31,1.3258
32,1.5033
33,1.237
34,0.8820100000000001
35,0.7045
36,0.9707600000000001
37,1.0595
38,1.237
39,2.3908
40,2.1246
41,1.7696
42,1.9471
43,1.5921
44,1.3258
45,1.5033
46,1.3258
47,1.3258
48,0.8820100000000001
49,0.43823
50,0.9707600000000001
51,0.52699
52,0.7045
53,0.083208
54,-0.8931
55,-0.8931
56,-0.8931
57,-0.8931
58,-0.8931
59,-0.8931
60,-0.8931
61,-0.8931
62,-0.8931
63,-0.71559
64,-0.8931
65,0.083208
66,-0.8931
67,-0.8931
68,-0.8931
69,1.7696
70,1.3258
71,0.79325
72,0.9707600000000001
73,0.8820100000000001
74,0.52699
75,0.8820100000000001
76,0.7045
77,0.61574
78,0.8820100000000001
79,0.7045
80,0.61574
81,0.8820100000000001
82,0.43823
83,0.8820100000000001
84,0.61574
85,0.61574
86,0.79325
87,0.52699
88,0.79325
89,0.43823
90,-0.094303
91,-0.8931
92,-0.8931
93,-0.8931
94,-0.8931
95,-0.8931
