{
  "about": {
    "datasetID": "uu4_SPECT_dataset_TRAIN",
    "datasetName": "SPECT Heart Data Set",
    "description": "Data on cardiac Single Proton Emission Computed Tomography (SPECT) images. Each patient classified into two categories: normal and abnormal.",
    "license": "CC-BY license",
    "citation": "\n@misc{Lichman:2013 ,\nauthor = \"M. Lichman\",\nyear = \"2013\",\ntitle = \"{UCI} Machine Learning Repository\",\nurl = \"http://archive.ics.uci.edu/ml\",\ninstitution = \"University of California, Irvine, School of Information and Computer Sciences\" }\n",
    "source": "OpenML",
    "sourceURI": "https://archive.ics.uci.edu/ml/datasets/spect+heart",
    "datasetSchemaVersion": "4.0.0",
    "redacted": false,
    "datasetVersion": "4.0.0",
    "digest": "cb56944f4fc8b065aa03aa70ca66d06f12d069941e8206e9cc535f56ec1210a5"
  },
  "dataResources": [
    {
      "resID": "learningData",
      "resPath": "tables/learningData.csv",
      "resType": "table",
      "resFormat": {
        "text/csv": [
          "csv"
        ]
      },
      "isCollection": false,
      "columns": [
        {
          "colIndex": 0,
          "colName": "d3mIndex",
          "colType": "integer",
          "role": [
            "index"
          ]
        },
        {
          "colIndex": 1,
          "colName": "OVERALL_DIAGNOSIS",
          "colType": "categorical",
          "role": [
            "suggestedTarget"
          ]
        },
        {
          "colIndex": 2,
          "colName": "F1R",
          "colType": "integer",
          "role": [
            "attribute"
          ]
        },
        {
          "colIndex": 3,
          "colName": "F1S",
          "colType": "integer",
          "role": [
            "attribute"
          ]
        },
        {
          "colIndex": 4,
          "colName": "F2R",
          "colType": "integer",
          "role": [
            "attribute"
          ]
        },
        {
          "colIndex": 5,
          "colName": "F2S",
          "colType": "integer",
          "role": [
            "attribute"
          ]
        },
        {
          "colIndex": 6,
          "colName": "F3R",
          "colType": "integer",
          "role": [
            "attribute"
          ]
        },
        {
          "colIndex": 7,
          "colName": "F3S",
          "colType": "integer",
          "role": [
            "attribute"
          ]
        },
        {
          "colIndex": 8,
          "colName": "F4R",
          "colType": "integer",
          "role": [
            "attribute"
          ]
        },
        {
          "colIndex": 9,
          "colName": "F4S",
          "colType": "integer",
          "role": [
            "attribute"
          ]
        },
        {
          "colIndex": 10,
          "colName": "F5R",
          "colType": "integer",
          "role": [
            "attribute"
          ]
        },
        {
          "colIndex": 11,
          "colName": "F5S",
          "colType": "integer",
          "role": [
            "attribute"
          ]
        },
        {
          "colIndex": 12,
          "colName": "F6R",
          "colType": "integer",
          "role": [
            "attribute"
          ]
        },
        {
          "colIndex": 13,
          "colName": "F6S",
          "colType": "integer",
          "role": [
            "attribute"
          ]
        },
        {
          "colIndex": 14,
          "colName": "F7R",
          "colType": "integer",
          "role": [
            "attribute"
          ]
        },
        {
          "colIndex": 15,
          "colName": "F7S",
          "colType": "integer",
          "role": [
            "attribute"
          ]
        },
        {
          "colIndex": 16,
          "colName": "F8R",
          "colType": "integer",
          "role": [
            "attribute"
          ]
        },
        {
          "colIndex": 17,
          "colName": "F8S",
          "colType": "integer",
          "role": [
            "attribute"
          ]
        },
        {
          "colIndex": 18,
          "colName": "F9R",
          "colType": "integer",
          "role": [
            "attribute"
          ]
        },
        {
          "colIndex": 19,
          "colName": "F9S",
          "colType": "integer",
          "role": [
            "attribute"
          ]
        },
        {
          "colIndex": 20,
          "colName": "F10R",
          "colType": "integer",
          "role": [
            "attribute"
          ]
        },
        {
          "colIndex": 21,
          "colName": "F10S",
          "colType": "integer",
          "role": [
            "attribute"
          ]
        },
        {
          "colIndex": 22,
          "colName": "F11R",
          "colType": "integer",
          "role": [
            "attribute"
          ]
        },
        {
          "colIndex": 23,
          "colName": "F11S",
          "colType": "integer",
          "role": [
            "attribute"
          ]
        },
        {
          "colIndex": 24,
          "colName": "F12R",
          "colType": "integer",
          "role": [
            "attribute"
          ]
        },
        {
          "colIndex": 25,
          "colName": "F12S",
          "colType": "integer",
          "role": [
            "attribute"
          ]
        },
        {
          "colIndex": 26,
          "colName": "F13R",
          "colType": "integer",
          "role": [
            "attribute"
          ]
        },
        {
          "colIndex": 27,
          "colName": "F13S",
          "colType": "integer",
          "role": [
            "attribute"
          ]
        },
        {
          "colIndex": 28,
          "colName": "F14R",
          "colType": "integer",
          "role": [
            "attribute"
          ]
        },
        {
          "colIndex": 29,
          "colName": "F14S",
          "colType": "integer",
          "role": [
            "attribute"
          ]
        },
        {
          "colIndex": 30,
          "colName": "F15R",
          "colType": "integer",
          "role": [
            "attribute"
          ]
        },
        {
          "colIndex": 31,
          "colName": "F15S",
          "colType": "integer",
          "role": [
            "attribute"
          ]
        },
        {
          "colIndex": 32,
          "colName": "F16R",
          "colType": "integer",
          "role": [
            "attribute"
          ]
        },
        {
          "colIndex": 33,
          "colName": "F16S",
          "colType": "integer",
          "role": [
            "attribute"
          ]
        },
        {
          "colIndex": 34,
          "colName": "F17R",
          "colType": "integer",
          "role": [
            "attribute"
          ]
        },
        {
          "colIndex": 35,
          "colName": "F17S",
          "colType": "integer",
          "role": [
            "attribute"
          ]
        },
        {
          "colIndex": 36,
          "colName": "F18R",
          "colType": "integer",
          "role": [
            "attribute"
          ]
        },
        {
          "colIndex": 37,
          "colName": "F18S",
          "colType": "integer",
          "role": [
            "attribute"
          ]
        },
        {
          "colIndex": 38,
          "colName": "F19R",
          "colType": "integer",
          "role": [
            "attribute"
          ]
        },
        {
          "colIndex": 39,
          "colName": "F19S",
          "colType": "integer",
          "role": [
            "attribute"
          ]
        },
        {
          "colIndex": 40,
          "colName": "F20R",
          "colType": "integer",
          "role": [
            "attribute"
          ]
        },
        {
          "colIndex": 41,
          "colName": "F20S",
          "colType": "integer",
          "role": [
            "attribute"
          ]
        },
        {
          "colIndex": 42,
          "colName": "F21R",
          "colType": "integer",
          "role": [
            "attribute"
          ]
        },
        {
          "colIndex": 43,
          "colName": "F21S",
          "colType": "integer",
          "role": [
            "attribute"
          ]
        },
        {
          "colIndex": 44,
          "colName": "F22R",
          "colType": "integer",
          "role": [
            "attribute"
          ]
        },
        {
          "colIndex": 45,
          "colName": "F22S",
          "colType": "integer",
          "role": [
            "attribute"
          ]
        },
        {
          "colIndex": 46,
          "colName": "F1",
          "colType": "boolean",
          "role": [
            "attribute",
            "suggestedPrivilegedData"
          ]
        },
        {
          "colIndex": 47,
          "colName": "F2",
          "colType": "boolean",
          "role": [
            "attribute",
            "suggestedPrivilegedData"
          ]
        },
        {
          "colIndex": 48,
          "colName": "F3",
          "colType": "boolean",
          "role": [
            "attribute",
            "suggestedPrivilegedData"
          ]
        },
        {
          "colIndex": 49,
          "colName": "F4",
          "colType": "boolean",
          "role": [
            "attribute",
            "suggestedPrivilegedData"
          ]
        },
        {
          "colIndex": 50,
          "colName": "F5",
          "colType": "boolean",
          "role": [
            "attribute",
            "suggestedPrivilegedData"
          ]
        },
        {
          "colIndex": 51,
          "colName": "F6",
          "colType": "boolean",
          "role": [
            "attribute",
            "suggestedPrivilegedData"
          ]
        },
        {
          "colIndex": 52,
          "colName": "F7",
          "colType": "boolean",
          "role": [
            "attribute",
            "suggestedPrivilegedData"
          ]
        },
        {
          "colIndex": 53,
          "colName": "F8",
          "colType": "boolean",
          "role": [
            "attribute",
            "suggestedPrivilegedData"
          ]
        },
        {
          "colIndex": 54,
          "colName": "F9",
          "colType": "boolean",
          "role": [
            "attribute",
            "suggestedPrivilegedData"
          ]
        },
        {
          "colIndex": 55,
          "colName": "F10",
          "colType": "boolean",
          "role": [
            "attribute",
            "suggestedPrivilegedData"
          ]
        },
        {
          "colIndex": 56,
          "colName": "F11",
          "colType": "boolean",
          "role": [
            "attribute",
            "suggestedPrivilegedData"
          ]
        },
        {
          "colIndex": 57,
          "colName": "F12",
          "colType": "boolean",
          "role": [
            "attribute",
            "suggestedPrivilegedData"
          ]
        },
        {
          "colIndex": 58,
          "colName": "F13",
          "colType": "boolean",
          "role": [
            "attribute",
            "suggestedPrivilegedData"
          ]
        },
        {
          "colIndex": 59,
          "colName": "F14",
          "colType": "boolean",
          "role": [
            "attribute",
            "suggestedPrivilegedData"
          ]
        },
        {
          "colIndex": 60,
          "colName": "F15",
          "colType": "boolean",
          "role": [
            "attribute",
            "suggestedPrivilegedData"
          ]
        },
        {
          "colIndex": 61,
          "colName": "F16",
          "colType": "boolean",
          "role": [
            "attribute",
            "suggestedPrivilegedData"
          ]
        },
        {
          "colIndex": 62,
          "colName": "F17",
          "colType": "boolean",
          "role": [
            "attribute",
            "suggestedPrivilegedData"
          ]
        },
        {
          "colIndex": 63,
          "colName": "F18",
          "colType": "boolean",
          "role": [
            "attribute",
            "suggestedPrivilegedData"
          ]
        },
        {
          "colIndex": 64,
          "colName": "F19",
          "colType": "boolean",
          "role": [
            "attribute",
            "suggestedPrivilegedData"
          ]
        },
        {
          "colIndex": 65,
          "colName": "F20",
          "colType": "boolean",
          "role": [
            "attribute",
            "suggestedPrivilegedData"
          ]
        },
        {
          "colIndex": 66,
          "colName": "F21",
          "colType": "boolean",
          "role": [
            "attribute",
            "suggestedPrivilegedData"
          ]
        },
        {
          "colIndex": 67,
          "colName": "F22",
          "colType": "boolean",
          "role": [
            "attribute",
            "suggestedPrivilegedData"
          ]
        }
      ],
      "columnsCount": 68
    }
  ]
}