time,value
0,-0.62941
1,-0.62941
2,-0.62941
3,-0.62941
4,-0.62941
5,-0.62941
6,1.5678
7,1.7509
8,1.0185
9,-0.62941
10,-0.62941
11,-0.62941
12,-0.62941
13,-0.62941
14,-0.62941
15,0.10299000000000001
16,1.9340000000000002
17,1.7509
18,-0.26321
19,-0.62941
20,-0.62941
21,-0.62941
22,-0.62941
23,-0.62941
24,-0.62941
25,1.3847
26,1.7509
27,1.2016
28,-0.62941
29,-0.62941
30,-0.62941
31,-0.62941
32,-0.62941
33,-0.62941
34,0.8354
35,1.9340000000000002
36,1.3847
37,-0.62941
38,-0.62941
39,-0.62941
40,-0.62941
41,-0.62941
42,-0.62941
43,-0.62941
44,2.1171
45,1.7509
46,-0.26321
47,-0.62941
48,-0.62941
49,-0.62941
50,-0.62941
51,-0.62941
52,-0.62941
53,1.2016
54,1.9340000000000002
55,0.8354
56,-0.62941
57,-0.62941
58,-0.62941
59,-0.62941
60,-0.62941
61,-0.62941
62,-0.26321
63,1.9340000000000002
64,1.9340000000000002
65,-0.62941
66,-0.62941
67,-0.62941
68,-0.62941
69,-0.62941
70,-0.62941
71,-0.62941
72,1.5678
73,1.9340000000000002
74,1.0185
75,-0.62941
76,-0.62941
77,-0.62941
78,-0.62941
79,-0.62941
80,-0.62941
81,1.9340000000000002
82,1.9340000000000002
83,0.2861
84,-0.62941
85,-0.62941
86,-0.62941
87,-0.08010700000000001
88,1.9340000000000002
89,1.9340000000000002
90,-0.62941
91,-0.62941
92,-0.62941
93,-0.62941
94,-0.62941
95,0.2861
