time,value
0,1.6385
1,1.609
2,1.5673
3,1.5278
4,1.4603
5,1.3849
6,1.2997
7,1.2121
8,1.1265
9,1.042
10,0.9532200000000001
11,0.86455
12,0.77799
13,0.68929
14,0.61779
15,0.52937
16,0.44109
17,0.35615
18,0.26828
19,0.18414
20,0.096872
21,0.013628999999999999
22,-0.068834
23,-0.15498
24,-0.24074
25,-0.32116
26,-0.40243
27,-0.48417
28,-0.56713
29,-0.6429600000000001
30,-0.72368
31,-0.80315
32,-0.8735299999999999
33,-0.9492299999999999
34,-1.0227
35,-1.0842
36,-1.151
37,-1.2138
38,-1.2717
39,-1.3234
40,-1.3678
41,-1.4034
42,-1.4289
43,-1.4432
44,-1.4456
45,-1.4215
46,-1.4007
47,-1.3695
48,-1.3417
49,-1.2927
50,-1.2366
51,-1.1657
52,-1.101
53,-1.0418
54,-0.9698399999999999
55,-0.90338
56,-0.82652
57,-0.74802
58,-0.66815
59,-0.58713
60,-0.51098
61,-0.42785
62,-0.34402
63,-0.26137
64,-0.19314
65,-0.1076
66,-0.025962
67,0.060496
68,0.14725
69,0.23051999999999997
70,0.31767
71,0.40209
72,0.48998
73,0.5696100000000001
74,0.64895
75,0.73733
76,0.82305
77,0.9097
78,0.99795
79,1.0845
80,1.1688
81,1.2541
82,1.3392
83,1.4107
84,1.4936
85,1.5534
86,1.5981
87,1.6214
88,1.6241
89,1.611
90,1.5972
91,1.5275
92,1.4458
93,1.3607
94,1.2769
95,1.1885
96,1.1014
97,1.0144
98,0.92775
99,0.84136
100,0.75259
101,0.6644800000000001
102,0.57821
103,0.48985
104,0.40478000000000003
105,0.31681
106,0.23148000000000002
107,0.14503
108,0.07566
109,-0.011208
110,-0.09353099999999999
111,-0.1757
112,-0.24673
113,-0.32673
114,-0.41098
115,-0.49458
116,-0.57314
117,-0.6531100000000001
118,-0.73369
119,-0.81286
120,-0.8831
121,-0.9585600000000001
122,-1.0317
123,-1.1022
124,-1.1585
125,-1.2116
126,-1.2696
127,-1.3216
128,-1.3663
129,-1.4023
130,-1.4282
131,-1.4429
132,-1.4457
133,-1.4364
134,-1.4155
135,-1.3707
136,-1.3306
137,-1.2946
138,-1.2393
139,-1.1785
140,-1.1229
141,-1.0534
142,-0.98095
143,-0.9061299999999999
144,-0.8293299999999999
145,-0.75089
146,-0.6776
147,-0.6014
148,-0.51974
149,-0.43635
150,-0.35304
151,-0.27251
152,-0.18714
153,-0.10134
154,-0.019359
155,0.067304
156,0.15045999999999998
157,0.23779
158,0.32534
159,0.40976
160,0.49778
161,0.58292
162,0.6713100000000001
163,0.7598199999999999
164,0.8484299999999999
165,0.93453
166,1.0234
167,1.1099
168,1.1946
169,1.2816
170,1.3669
171,1.4509999999999998
172,1.5183
173,1.58
174,1.6205
175,1.6389
