time,value
0,-0.21386999999999998
1,-0.19824
2,-0.22324000000000002
3,-0.21074
4,-0.20135999999999998
5,-0.22011999999999998
6,-0.21074
7,-0.19824
8,-0.22011999999999998
9,-0.20761
10,-0.19510999999999998
11,-0.22324000000000002
12,-0.20449
13,-0.18886
14,-0.22324000000000002
15,-0.20135999999999998
16,-0.18261
17,-0.22324000000000002
18,-0.21386999999999998
19,-0.17635
20,-0.22324000000000002
21,-0.22324000000000002
22,-0.17948
23,-0.21699000000000002
24,-0.22011999999999998
25,-0.17948
26,-0.20135999999999998
27,-0.21699000000000002
28,-0.17948
29,-0.19824
30,-0.20449
31,-0.17323
32,-0.18886
33,-0.20135999999999998
34,-0.18573
35,-0.18886
36,-0.21074
37,-0.19510999999999998
38,-0.19197999999999998
39,-0.21699000000000002
40,-0.20135999999999998
41,-0.19510999999999998
42,-0.22011999999999998
43,-0.20135999999999998
44,-0.18573
45,-0.22011999999999998
46,-0.19824
47,-0.17948
48,-0.21699000000000002
49,-0.20449
50,-0.1701
51,-0.21074
52,-0.20449
53,-0.1701
54,-0.21074
55,-0.20761
56,-0.1701
57,-0.21074
58,-0.20761
59,-0.18261
60,-0.20761
61,-0.20761
62,-0.18573
63,-0.21074
64,-0.21386999999999998
65,-0.18573
66,-0.21074
67,-0.21386999999999998
68,-0.19197999999999998
69,-0.20449
70,-0.20761
71,-0.18886
72,-0.19510999999999998
73,-0.19824
74,0.30816
75,0.22376
76,0.064342
77,0.045586
78,0.38944
79,6.3224
80,5.691
81,4.3437
82,-0.12320999999999999
83,-0.12634
84,-0.18261
85,-0.16385
86,-0.16072
87,-0.19197999999999998
88,-0.18261
89,-0.17635
90,-0.20761
91,-0.17948
92,-0.18573
93,-0.21386999999999998
94,-0.17948
95,-0.19197999999999998
