time,value
0,-0.2085
1,-0.2085
2,-0.2085
3,-0.2085
4,-0.2085
5,-0.2085
6,-0.2085
7,-0.2085
8,-0.2085
9,-0.2085
10,-0.2085
11,-0.2085
12,-0.2085
13,-0.2085
14,-0.2085
15,-0.2085
16,-0.2085
17,-0.2085
18,-0.2085
19,-0.2085
20,-0.2085
21,-0.2085
22,-0.2085
23,-0.2085
24,-0.2085
25,-0.2085
26,-0.2085
27,-0.2085
28,-0.2085
29,-0.2085
30,-0.2085
31,5.6641
32,-0.2085
33,-0.2085
34,1.9937
35,-0.2085
36,-0.2085
37,-0.2085
38,-0.2085
39,-0.2085
40,-0.2085
41,-0.2085
42,-0.2085
43,-0.2085
44,-0.2085
45,-0.2085
46,-0.2085
47,-0.2085
48,-0.2085
49,-0.2085
50,-0.2085
51,-0.2085
52,-0.2085
53,-0.2085
54,-0.2085
55,-0.2085
56,-0.2085
57,-0.2085
58,-0.2085
59,-0.2085
60,-0.2085
61,-0.2085
62,-0.2085
63,-0.2085
64,-0.2085
65,-0.2085
66,-0.2085
67,-0.2085
68,-0.2085
69,-0.2085
70,-0.2085
71,-0.2085
72,6.3003
73,0.72133
74,-0.2085
75,-0.2085
76,-0.2085
77,-0.061683
78,0.085132
79,-0.2085
80,-0.2085
81,-0.2085
82,-0.2085
83,-0.2085
84,-0.2085
85,-0.2085
86,-0.2085
87,-0.2085
88,3.8534
89,-0.2085
90,-0.2085
91,-0.2085
92,-0.2085
93,-0.2085
94,-0.2085
95,-0.2085
