time,value
0,0.11214
1,-0.2213
2,-0.74528
3,-0.60238
4,-0.60238
5,-0.6500100000000001
6,-0.26894
7,-0.2213
8,-0.030764
9,-0.12603
10,-0.41184
11,-0.60238
12,-0.12603
13,-0.31656999999999996
14,-0.74528
15,-0.60238
16,-0.60238
17,-0.69765
18,0.35031
19,0.25504
20,-0.26894
21,-0.6500100000000001
22,-0.69765
23,-0.6500100000000001
24,0.15977
25,3.4942
26,-0.69765
27,-0.45947
28,-0.030764
29,-0.12603
30,0.016871
31,-0.17367
32,-0.6500100000000001
33,-0.6500100000000001
34,4.2563
35,-0.60238
36,-0.26894
37,0.016871
38,-0.12603
39,0.15977
40,2.8273
41,-0.55474
42,0.68375
43,-0.26894
44,1.7793
45,1.5888
46,-0.6500100000000001
47,-0.3642
48,0.39795
49,0.30268
50,-0.55474
51,-0.60238
52,-0.60238
53,-0.60238
54,2.351
55,-0.31656999999999996
56,3.7324
57,2.351
58,-0.030764
59,-0.030764
60,-0.41184
61,-0.60238
62,2.2557
63,-0.60238
64,-0.12603
65,-0.26894
66,-0.030764
67,-0.12603
68,-0.2213
69,1.4935
70,0.016871
71,-0.45947
72,-0.60238
73,-0.69765
74,-0.6500100000000001
75,0.11214
76,0.49321000000000004
77,-0.078398
78,-0.41184
79,-0.69765
80,-0.69765
81,0.016871
82,-0.12603
83,-0.45947
84,-0.5071100000000001
85,-0.45947
86,0.11214
87,0.68375
88,0.20740999999999998
89,-0.6500100000000001
90,-0.74528
91,-0.60238
92,-0.60238
93,-0.030764
94,-0.55474
95,-0.60238
