time,value
0,0.1924
1,0.19505999999999998
2,0.18316
3,0.18511
4,0.16876
5,0.20288
6,0.2203
7,0.22646999999999998
8,0.24108000000000002
9,0.26277
10,0.2958
11,0.30062
12,0.29649000000000003
13,0.29443
14,0.31109000000000003
15,0.33446
16,0.35268
17,0.37279
18,0.40476
19,0.45032
20,0.4988
21,0.55152
22,0.59258
23,0.62975
24,0.68308
25,0.7480100000000001
26,0.80162
27,0.8404
28,0.8963200000000001
29,0.97036
30,1.0191
31,1.0759
32,1.1281
33,1.1836
34,1.2153
35,1.2633
36,1.3011
37,1.3459999999999999
38,1.3788
39,1.4195
40,1.4605
41,1.4965
42,1.5286
43,1.5538
44,1.5715
45,1.6024
46,1.671
47,1.7512
48,1.8451
49,1.9394
50,2.0234
51,2.1064
52,2.2128
53,2.2398
54,2.191
55,2.1049
56,2.0165
57,1.9162
58,1.8334
59,1.7565
60,1.67
61,1.5942
62,1.5434
63,1.4461
64,1.3722
65,1.3037
66,1.2474
67,1.194
68,1.1508
69,1.1119
70,1.0809
71,1.0444
72,1.0229
73,1.0018
74,0.98506
75,0.9737299999999999
76,0.9726899999999999
77,0.9668700000000001
78,0.95247
79,0.94183
80,0.9272799999999999
81,0.90627
82,0.88484
83,0.8581799999999999
84,0.87939
85,0.93921
86,0.99156
87,0.98977
88,0.97695
89,0.97682
90,0.97777
91,0.96055
92,0.92435
93,0.87311
94,0.84291
95,0.8105
96,0.76364
97,0.73023
98,0.70322
99,0.68099
100,0.64747
101,0.59392
102,0.52527
103,0.44797
104,0.35372
105,0.28125
106,0.20536999999999997
107,0.14565
108,0.10862999999999999
109,0.067
110,0.034361
111,0.0035759999999999998
112,-0.035494
113,-0.064053
114,-0.088568
115,-0.10815
116,-0.12577
117,-0.14623
118,-0.1613
119,-0.17907
120,-0.18692
121,-0.19276
122,-0.19005999999999998
123,-0.19252
124,-0.25749
125,-0.35222
126,-0.44615
127,-0.52045
128,-0.61429
129,-0.7075600000000001
130,-0.7849
131,-0.85141
132,-0.92568
133,-0.9975
134,-1.0842
135,-1.161
136,-1.2357
137,-1.2943
138,-1.3445
139,-1.3782
140,-1.4018
141,-1.429
142,-1.4418
143,-1.4455
144,-1.4459
145,-1.4269999999999998
146,-1.4101
147,-1.3911
148,-1.3523
149,-1.3132
150,-1.2669
151,-1.2216
152,-1.1806
153,-1.1431
154,-1.1008
155,-1.057
156,-1.0173
157,-0.96445
158,-0.90404
159,-0.8465600000000001
160,-0.78474
161,-0.7226600000000001
162,-0.71505
163,-0.67323
164,-0.61992
165,-0.5526800000000001
166,-0.49048
167,-0.41991999999999996
168,-0.34394
169,-0.27084
170,-0.20365999999999998
171,-0.12122999999999999
172,-0.0499
173,0.0030019
174,-0.07686599999999999
175,-0.14762
176,-0.22329000000000002
177,-0.30323
178,-0.38678
179,-0.47367
180,-0.55843
181,-0.6631100000000001
182,-0.7488100000000001
183,-0.85487
184,-0.9441700000000001
185,-1.0456
186,-1.1493
187,-1.2388
188,-1.2989
189,-1.3466
190,-1.3771
191,-1.3759
192,-1.3551
193,-1.3029
194,-1.2467
195,-1.1742
196,-1.109
197,-1.0361
198,-0.9729
199,-0.89751
200,-0.82632
201,-0.77856
202,-0.74338
203,-0.66246
204,-0.5927600000000001
205,-0.51398
206,-0.44077
207,-0.37453000000000003
208,-0.28894000000000003
209,-0.21215
210,-0.14073
211,-0.070702
212,0.018126
213,0.085534
214,0.1614
215,0.23881
216,0.31401999999999997
217,0.39594
218,0.46645
219,0.54611
220,0.62257
221,0.69987
222,0.77046
223,0.82584
224,0.87771
225,0.96188
226,0.95436
227,0.88807
228,0.8221799999999999
229,0.77965
230,0.70234
231,0.63442
232,0.57515
233,0.54006
234,0.54928
235,0.6228600000000001
236,0.7067899999999999
237,0.78909
238,0.87284
239,0.95754
240,1.0394
241,1.1235
242,1.2024
243,1.2894
244,1.3756
245,1.4665
246,1.5235
247,1.5769
248,1.6497
249,1.6566
250,1.7078
251,1.7648
252,1.8222
253,1.8897
254,1.8762
255,1.797
256,1.7273
257,1.6409
258,1.5444
259,1.4569999999999999
260,1.3879
261,1.2963
262,1.2261
263,1.1538
264,1.0798
265,1.0037
266,0.9603299999999999
267,0.97282
268,1.0176
269,1.0702
270,1.1523
271,1.2298
272,1.2978
273,1.2459
274,1.1672
275,1.095
276,1.0121
277,0.9406100000000001
278,0.84915
279,0.76308
280,0.6914399999999999
281,0.60725
282,0.5209199999999999
283,0.43466000000000005
284,0.34569
285,0.2782
286,0.1909
287,0.11205
288,0.039473
289,-0.037021
290,-0.10549000000000001
291,-0.17765999999999998
292,-0.25188
293,-0.3234
294,-0.40495
295,-0.47606000000000004
296,-0.54668
297,-0.62827
298,-0.7017100000000001
299,-0.76022
300,-0.7741
301,-0.7681399999999999
302,-0.7416
303,-0.70536
304,-0.6662
305,-0.61019
306,-0.5504600000000001
307,-0.49101000000000006
308,-0.42981
309,-0.37119
310,-0.30713
311,-0.24289000000000002
312,-0.17947000000000002
313,-0.10328
314,-0.0081169
315,0.07661
316,0.18291
317,0.21661
318,0.13758
319,0.033625999999999996
320,-0.048068
321,-0.1077
322,-0.19000999999999998
323,-0.27037
324,-0.29103
325,-0.32764
326,-0.41695
327,-0.48265
328,-0.579
329,-0.68399
330,-0.7893899999999999
331,-0.89249
332,-0.9707600000000001
333,-1.0724
334,-1.1705
335,-1.2213
336,-1.3043
337,-1.3968
338,-1.4625
339,-1.5590000000000002
340,-1.6312
341,-1.723
342,-1.7930000000000001
343,-1.8541
344,-1.9041
345,-1.9462
346,-1.9661
347,-1.9767
348,-1.9764
349,-1.9677
350,-1.9409
351,-1.8908
352,-1.7953
353,-1.7095
354,-1.6386
355,-1.5644
356,-1.4939
357,-1.4304
358,-1.3549
359,-1.2833
360,-1.2118
361,-1.143
362,-1.0752
363,-1.0077
364,-1.0164
365,-0.9260799999999999
366,-0.8609
367,-0.78478
368,-0.7188
369,-0.65465
370,-0.57968
371,-0.51541
372,-0.43993999999999994
373,-0.36823
374,-0.29804
375,-0.34163000000000004
376,-0.40738
377,-0.47756000000000004
378,-0.53789
379,-0.60534
380,-0.6601199999999999
381,-0.71615
382,-0.75317
383,-0.77904
384,-0.80407
385,-0.7934899999999999
386,-0.73547
387,-0.71267
388,-0.76479
389,-0.8055899999999999
390,-0.85275
391,-0.8922399999999999
392,-0.9247
393,-0.95775
394,-0.97854
395,-1.0045
396,-1.0254
397,-1.0495
398,-1.0615
399,-1.0566
400,-1.046
401,-1.0474
402,-1.0427
403,-1.0488
404,-1.0239
405,-0.9917299999999999
406,-0.9474600000000001
407,-0.88802
408,-0.8363200000000001
409,-0.76968
410,-0.69607
411,-0.6287699999999999
412,-0.54548
413,-0.46198
414,-0.37351
415,-0.28783000000000003
416,-0.23310999999999998
417,-0.18874000000000002
418,-0.13319
419,-0.078284
420,-0.036705
421,0.010277
422,0.053657
423,0.09042
424,0.12325
425,0.15192
426,0.17572000000000002
