time,value
0,2.0622
1,2.0196
2,1.9801
3,1.9395
4,1.9051
5,1.8559999999999999
6,1.8145
7,1.7731
8,1.7318
9,1.685
10,1.6373
11,1.5867
12,1.5361
13,1.4856
14,1.4352
15,1.3848
16,1.3315
17,1.2813
18,1.2343
19,1.1874
20,1.1405
21,1.0939
22,1.0473
23,1.0008
24,0.9545399999999999
25,0.90909
26,0.8655299999999999
27,0.82285
28,0.7771899999999999
29,0.7317100000000001
30,0.68001
31,0.62847
32,0.57708
33,0.5271899999999999
34,0.47743
35,0.4278
36,0.37831
37,0.32897
38,0.28101
39,0.23317
40,0.1847
41,0.13785999999999998
42,0.090419
43,0.044217
44,-0.0027372
45,-0.048893
46,-0.095113
47,-0.14139000000000002
48,-0.18688
49,-0.23135
50,-0.27658
51,-0.32161999999999996
52,-0.36646999999999996
53,-0.41106000000000004
54,-0.45531000000000005
55,-0.49933999999999995
56,-0.54292
57,-0.58657
58,-0.62934
59,-0.6723600000000001
60,-0.71501
61,-0.7572300000000001
62,-0.79899
63,-0.84047
64,-0.88146
65,-0.91771
66,-0.94211
67,-0.9267299999999999
68,-0.94404
69,-0.9356
70,-0.92025
71,-0.9011
72,-0.8819600000000001
73,-0.85864
74,-0.8375299999999999
75,-0.8165399999999999
76,-0.7957
77,-0.77176
78,-0.74605
79,-0.72145
80,-0.69516
81,-0.67127
82,-0.64666
83,-0.62739
84,-0.6027
85,-0.58058
86,-0.55906
87,-0.53968
88,-0.51952
89,-0.50413
90,-0.48783000000000004
91,-0.47333000000000003
92,-0.46611
93,-0.45898
94,-0.44766000000000006
95,-0.4363
96,-0.49107
97,-0.5364399999999999
98,-0.57877
99,-0.61388
100,-0.6469699999999999
101,-0.67781
102,-0.71558
103,-0.7436
104,-0.77374
105,-0.81038
106,-0.8474
107,-0.8740899999999999
108,-0.89745
109,-0.91686
110,-0.93521
111,-0.9719700000000001
112,-1.0177
113,-1.0417
114,-1.0686
115,-1.0923
116,-1.1109
117,-1.1248
118,-1.1405
119,-1.1513
120,-1.157
121,-1.1609
122,-1.1666
123,-1.187
124,-1.2259
125,-1.264
126,-1.3021
127,-1.3430000000000002
128,-1.3828
129,-1.4211
130,-1.459
131,-1.4651
132,-1.4704
133,-1.4982
134,-1.5183
135,-1.545
136,-1.5796
137,-1.5922
138,-1.5828
139,-1.574
140,-1.5612
141,-1.5446
142,-1.5245
143,-1.5011
144,-1.4758
145,-1.4488
146,-1.4196
147,-1.3885
148,-1.3559999999999999
149,-1.3223
150,-1.2895
151,-1.2529
152,-1.2179
153,-1.1805
154,-1.1447
155,-1.1065
156,-1.0685
157,-1.0305
158,-0.99039
159,-0.95001
160,-0.9093100000000001
161,-0.8710200000000001
162,-0.83019
163,-0.79093
164,-0.75116
165,-0.70994
166,-0.67042
167,-0.62597
168,-0.58312
169,-0.5401600000000001
170,-0.49465
171,-0.44906999999999997
172,-0.40101
173,-0.35293
174,-0.30241
175,-0.25669000000000003
176,-0.20615
177,-0.15320999999999999
178,-0.10041
179,-0.052663
180,-0.0063997
181,0.038396
182,0.083249
183,0.12816
184,0.1742
185,0.21971999999999997
186,0.26528
187,0.30844
188,0.34924
189,0.39136
190,0.43346999999999997
191,0.47473000000000004
192,0.5153300000000001
193,0.556
194,0.5967399999999999
195,0.63693
196,0.67829
197,0.71935
198,0.76117
199,0.80366
200,0.84652
201,0.8904
202,0.9360700000000001
203,0.9804200000000001
204,1.0266
205,1.0732
206,1.1234
207,1.1763
208,1.2288
209,1.266
210,1.2408
211,1.2181
212,1.2075
213,1.1964
214,1.1925
215,1.1848
216,1.1571
217,1.1214
218,1.0735
219,1.0452
220,1.0182
221,0.9915700000000001
222,0.96519
223,0.9390799999999999
224,0.91327
225,0.88775
226,0.8625299999999999
227,0.8376299999999999
228,0.81305
229,0.78605
230,0.7621100000000001
231,0.73851
232,0.71528
233,0.6924
234,0.6876800000000001
235,0.71196
236,0.73893
237,0.7622899999999999
238,0.78794
239,0.81398
240,0.84191
241,0.8706200000000001
242,0.89766
243,0.92206
244,0.9478200000000001
245,0.97267
246,1.0012
247,1.0321
248,1.0651
249,1.0988
250,1.1327
251,1.1675
252,1.1999
253,1.2322
254,1.2581
255,1.2803
256,1.3031
257,1.2928
258,1.2422
259,1.1951
260,1.1514
261,1.1146
262,1.0738
263,1.0384
264,1.0023
265,0.9653299999999999
266,0.92699
267,0.8865200000000001
268,0.84605
269,0.8055899999999999
270,0.76512
271,0.7250800000000001
272,0.68638
273,0.64593
274,0.60659
275,0.56725
276,0.52832
277,0.48976000000000003
278,0.45048
279,0.41121
280,0.37196
281,0.33273
282,0.2947
283,0.25536
284,0.21514
285,0.17534
286,0.13473
287,0.09529299999999999
288,0.053732
289,0.013397
290,-0.025693999999999998
291,-0.065749
292,-0.10505999999999999
293,-0.14661
294,-0.18868
295,-0.23425
296,-0.27976999999999996
297,-0.32524000000000003
298,-0.36945
299,-0.41426999999999997
300,-0.45895
301,-0.5031800000000001
302,-0.54711
303,-0.5919
304,-0.63726
305,-0.6852699999999999
306,-0.7299899999999999
307,-0.77445
308,-0.81809
309,-0.86415
310,-0.9091899999999999
311,-0.9535600000000001
312,-0.99828
313,-1.0421
314,-1.0834
315,-1.1241
316,-1.1161
317,-1.0979
318,-1.0761
319,-1.0553
320,-1.0334
321,-1.0195
322,-0.99344
323,-0.96285
324,-0.93114
325,-0.90486
326,-0.87826
327,-0.84364
328,-0.80996
329,-0.78441
330,-0.7612800000000001
331,-0.7470100000000001
332,-0.72852
333,-0.7028
334,-0.67705
335,-0.63998
336,-0.5871
337,-0.5589
338,-0.5885199999999999
339,-0.61258
340,-0.62876
341,-0.63889
342,-0.66362
343,-0.70655
344,-0.73965
345,-0.77679
346,-0.81372
347,-0.8504200000000001
348,-0.88223
349,-0.9111799999999999
350,-0.9395
351,-0.9671299999999999
352,-0.9940200000000001
353,-1.0481
354,-1.1034
355,-1.1587
356,-1.2114
357,-1.2386
358,-1.2713
359,-1.3089
360,-1.3465
361,-1.3762
362,-1.4186
363,-1.3852
364,-1.349
365,-1.3243
366,-1.3019
367,-1.2927
368,-1.2759
369,-1.253
370,-1.2266
371,-1.1913
372,-1.1540000000000001
373,-1.1253
374,-1.1198
375,-1.1164
376,-1.1059999999999999
377,-1.0918
378,-1.0727
379,-1.0355
380,-0.9905700000000001
381,-0.94163
382,-0.8921100000000001
383,-0.84535
384,-0.79483
385,-0.74531
386,-0.69907
387,-0.65064
388,-0.60188
389,-0.55284
390,-0.50353
391,-0.4571
392,-0.40424
393,-0.35122
394,-0.30111
395,-0.2569
396,-0.21768
397,-0.17364000000000002
398,-0.13194
399,-0.089839
400,-0.047542
401,-0.007312000000000001
402,0.031859
403,0.07699099999999999
404,0.11481
405,0.15057
406,0.18769
407,0.23340999999999998
408,0.27087
409,0.29746999999999996
410,0.33441
411,0.37887
412,0.42267
413,0.46153
414,0.50053
415,0.53967
416,0.57653
417,0.61538
418,0.65435
419,0.69743
420,0.73198
421,0.76425
422,0.80411
423,0.84325
424,0.8778600000000001
425,0.91261
426,0.95
427,0.988
428,1.0275
429,1.0603
430,1.1026
431,1.1507
432,1.1933
433,1.2337
434,1.2742
435,1.3123
436,1.3483
437,1.4013
438,1.4412
439,1.4796
440,1.5157
441,1.5492
442,1.5838
443,1.6212
444,1.6586
445,1.6927
446,1.7292
447,1.7657
448,1.8024
449,1.8391
450,1.8737
451,1.9039
452,1.9246
453,1.9173
454,1.9368
455,1.9742
456,2.0055
457,2.0347
458,2.0607
459,2.0708
460,2.0812
461,2.0762
462,2.0646
