[<text>
<title>vendo co &lt;ven&gt; 4th qtr loss</title>
<dateline>    fresno, calif., march 3 -
    </dateline>shr loss 1.48 dlrs vs loss 36 cts
    net loss 4,036,000 vs loss 983,000
    sales 16.6 mln vs 17 mln
    12 mths
    shr loss 1.88 dlrs vs profit 71 cts
    net loss 5,113,000 vs profit 1,904,000
    sales 85.4 mln vs 88.5 mln
    note: prior year net includes extraordinary loss of 298,000
dlrs in qtr and extraordinary profit of 718,000 dlrs in year.
 reuter
</text>]