time,value
0,-0.33402
1,-0.33402
2,-0.33402
3,-0.33402
4,-0.33402
5,-0.33402
6,-0.33402
7,-0.33402
8,-0.33402
9,-0.33402
10,-0.33402
11,-0.33402
12,0.38388
13,-0.33402
14,-0.33402
15,-0.33402
16,-0.33402
17,-0.33402
18,-0.33402
19,-0.33402
20,0.38388
21,-0.33402
22,-0.33402
23,-0.33402
24,-0.33402
25,-0.33402
26,-0.33402
27,-0.33402
28,-0.33402
29,-0.33402
30,-0.33402
31,-0.33402
32,-0.33402
33,-0.33402
34,-0.33402
35,-0.33402
36,-0.33402
37,-0.33402
38,-0.33402
39,-0.33402
40,0.38388
41,-0.33402
42,-0.33402
43,-0.33402
44,-0.33402
45,-0.33402
46,-0.33402
47,-0.33402
48,-0.33402
49,-0.33402
50,-0.33402
51,-0.33402
52,-0.33402
53,-0.33402
54,-0.33402
55,-0.33402
56,0.38388
57,-0.33402
58,-0.33402
59,-0.33402
60,-0.33402
61,-0.33402
62,-0.33402
63,-0.33402
64,-0.33402
65,-0.33402
66,-0.33402
67,-0.33402
68,-0.33402
69,-0.33402
70,-0.33402
71,-0.33402
72,-0.33402
73,-0.33402
74,-0.33402
75,-0.33402
76,0.6231800000000001
77,3.2555
78,-0.33402
79,-0.33402
80,-0.33402
81,2.2983
82,3.9734
83,1.1018
84,-0.33402
85,-0.33402
86,0.6231800000000001
87,3.9734
88,3.9734
89,3.9734
90,2.059
91,-0.33402
92,-0.33402
93,-0.33402
94,-0.33402
95,-0.33402
