time,value
0,-0.17367
1,-0.17367
2,-0.17367
3,-0.17367
4,-0.17367
5,-0.17367
6,-0.17367
7,-0.17367
8,-0.17367
9,-0.17367
10,-0.17367
11,-0.17367
12,-0.17367
13,-0.17367
14,-0.17367
15,-0.17367
16,-0.17367
17,-0.17367
18,-0.17367
19,-0.17367
20,-0.17367
21,-0.17367
22,-0.17367
23,-0.17367
24,-0.17367
25,-0.17367
26,-0.17367
27,-0.17367
28,3.5341
29,1.9955
30,-0.17367
31,-0.17367
32,-0.17367
33,-0.17367
34,-0.17367
35,-0.17367
36,-0.17367
37,-0.17367
38,-0.17367
39,-0.17367
40,-0.17367
41,-0.17367
42,-0.17367
43,-0.17367
44,-0.17367
45,-0.17367
46,-0.17367
47,-0.17367
48,-0.17367
49,-0.17367
50,-0.17367
51,-0.17367
52,-0.17367
53,-0.17367
54,-0.17367
55,1.9703
56,-0.17367
57,-0.17367
58,-0.17367
59,-0.17367
60,-0.17367
61,-0.17367
62,-0.17367
63,-0.17367
64,-0.17367
65,-0.17367
66,-0.17367
67,-0.17367
68,-0.17367
69,-0.17367
70,-0.17367
71,-0.17367
72,-0.17367
73,8.4777
74,-0.17367
75,-0.17367
76,-0.17367
77,-0.17367
78,-0.17367
79,-0.17367
80,-0.17367
81,-0.17367
82,-0.17367
83,-0.17367
84,-0.17367
85,-0.17367
86,-0.17367
87,-0.17367
88,-0.17367
89,-0.17367
90,-0.17367
91,-0.17367
92,-0.17367
93,-0.17367
94,-0.17367
95,-0.17367
