time,value
0,-0.9904799999999999
1,-0.84552
2,-0.6761
3,-0.4847
4,-0.28608
5,-0.11052999999999999
6,0.02204
7,0.11441
8,0.18128
9,0.23768000000000003
10,0.29028000000000004
11,0.34249
12,0.39011999999999997
13,0.42921000000000004
14,0.45643999999999996
15,0.47563
16,0.48878
17,0.49859
18,0.5043300000000001
19,0.50657
20,0.499
21,0.47229
22,0.41901000000000005
23,0.34342
24,0.25764000000000004
25,0.17448
26,0.09840700000000001
27,0.026869
28,-0.047249
29,-0.13203
30,-0.22585
31,-0.32199
32,-0.40105999999999997
33,-0.45993999999999996
34,-0.49449
35,-0.5192
36,-0.53023
37,-0.53427
38,-0.5272399999999999
39,-0.51739
40,-0.50375
41,-0.48827
42,-0.46892
43,-0.4449
44,-0.41641000000000006
45,-0.3758
46,-0.32261
47,-0.24085
48,-0.13172999999999999
49,0.021332
50,0.20185
51,0.40654
52,0.60125
53,0.77698
54,0.9187
55,1.0348
56,1.131
57,1.2158
58,1.2953
59,1.3739
60,1.4599
61,1.5604
62,1.6951
63,1.8877
64,2.1653
65,2.5286
66,2.9524
67,3.3814
68,3.7583
69,4.0275
70,4.1549
71,4.1259
72,3.963
73,3.7114
74,3.4298
75,3.1501
76,2.8743
77,2.5776
78,2.2442
79,1.8828
80,1.5205
81,1.1869
82,0.8897200000000001
83,0.62821
84,0.38413
85,0.15717
86,-0.057557000000000004
87,-0.24198000000000003
88,-0.39752
89,-0.51336
90,-0.59622
91,-0.6299100000000001
92,-0.61448
93,-0.54467
94,-0.44
95,-0.31919000000000003
96,-0.20206
97,-0.10262
98,-0.021544
99,0.037639
100,0.085985
101,0.11682999999999999
102,0.13635
103,0.13402
104,0.11932000000000001
105,0.093541
106,0.068636
107,0.046105
108,0.029231
109,0.016562999999999998
110,0.0082339
111,0.006790600000000001
112,0.016124
113,0.043025
114,0.089503
115,0.15541
116,0.23181999999999997
117,0.3092
118,0.37232
119,0.41389
120,0.42554
121,0.41068000000000005
122,0.36935999999999997
123,0.31046
124,0.24069000000000002
125,0.17359000000000002
126,0.11544000000000001
127,0.066737
128,0.018666
129,-0.03755
130,-0.10311
131,-0.17367
132,-0.23961999999999997
133,-0.29895
134,-0.34858
135,-0.3928
136,-0.42765
137,-0.45521000000000006
138,-0.47067
139,-0.47748
140,-0.47366
141,-0.4647
142,-0.45178999999999997
143,-0.44048000000000004
144,-0.42993000000000003
145,-0.41893
146,-0.40412
147,-0.38505
148,-0.36506
149,-0.34565999999999997
150,-0.3294
151,-0.3146
152,-0.30841
153,-0.31482
154,-0.3408
155,-0.37924
156,-0.42318999999999996
157,-0.46271
158,-0.4969
159,-0.52628
160,-0.55514
161,-0.58694
162,-0.62217
163,-0.65835
164,-0.688
165,-0.71114
166,-0.72526
167,-0.73432
168,-0.73197
169,-0.72192
170,-0.70216
171,-0.67998
172,-0.65179
173,-0.61953
174,-0.5813
175,-0.53989
176,-0.49405
177,-0.44356999999999996
178,-0.38921999999999995
179,-0.32804
180,-0.25216
181,-0.14694000000000002
182,-0.010325
183,0.14637
184,0.29331
185,0.40815
186,0.47791000000000006
187,0.51045
188,0.51412
189,0.50003
190,0.47434
191,0.44652
192,0.42103999999999997
193,0.39659
194,0.36701999999999996
195,0.32965
196,0.28769
197,0.2436
198,0.19923
199,0.15372
200,0.11039000000000002
201,0.06641799999999999
202,0.020916999999999998
203,-0.031180000000000003
204,-0.083219
205,-0.13399
206,-0.17844000000000002
207,-0.22055999999999998
208,-0.2559
209,-0.28449
210,-0.30307
211,-0.3155
212,-0.32223
213,-0.3251
214,-0.32468
215,-0.32308000000000003
216,-0.32221
217,-0.32072
218,-0.31966
219,-0.31751999999999997
220,-0.3186
221,-0.32033
222,-0.32465
223,-0.32813000000000003
224,-0.33571999999999996
225,-0.3501
226,-0.3778
227,-0.41923999999999995
228,-0.47626999999999997
229,-0.54781
230,-0.63059
231,-0.71449
232,-0.7881199999999999
233,-0.8471299999999999
234,-0.89415
235,-0.93437
236,-0.96604
237,-0.9887299999999999
238,-1.0018
239,-1.0111
240,-1.0168
241,-1.0205
242,-1.021
243,-1.021
244,-1.0196
245,-1.0179
246,-1.0162
247,-1.0173
248,-1.0212
249,-1.0263
250,-1.0311
251,-1.0356
252,-1.0417
253,-1.0489
254,-1.0571
255,-1.0643
256,-1.0716
257,-1.0789
258,-1.087
259,-1.0954
260,-1.1046
261,-1.1153
262,-1.1275
263,-1.1391
264,-1.1489
265,-1.158
266,-1.1683
267,-1.1788
268,-1.1856
269,-1.1868
