time,value
0,-0.34819
1,-0.34819
2,-0.34819
3,-0.34819
4,-0.34819
5,-0.34819
6,-0.34819
7,-0.34819
8,-0.34819
9,-0.34819
10,-0.34819
11,-0.34819
12,-0.34819
13,-0.34819
14,-0.34819
15,-0.34819
16,-0.34819
17,-0.34819
18,-0.34819
19,-0.34819
20,-0.34819
21,-0.34819
22,2.1819
23,0.11507
24,-0.34819
25,-0.34819
26,-0.34819
27,-0.34819
28,-0.34819
29,-0.34819
30,2.5383
31,-0.34819
32,-0.34819
33,-0.34819
34,-0.34819
35,0.9346899999999999
36,-0.34819
37,0.36451999999999996
38,-0.34819
39,-0.34819
40,-0.34819
41,-0.34819
42,0.8277899999999999
43,-0.34819
44,-0.34819
45,-0.34819
46,-0.34819
47,-0.34819
48,-0.34819
49,-0.34819
50,-0.34819
51,-0.34819
52,-0.34819
53,-0.34819
54,-0.34819
55,-0.34819
56,-0.34819
57,-0.34819
58,2.5383
59,-0.34819
60,-0.34819
61,-0.34819
62,-0.027469
63,0.8277899999999999
64,6.6008
65,-0.34819
66,-0.34819
67,1.0772
68,-0.34819
69,2.3958
70,-0.34819
71,-0.34819
72,-0.34819
73,1.6118
74,-0.34819
75,-0.34819
76,1.5761
77,-0.34819
78,-0.34819
79,-0.34819
80,-0.34819
81,-0.34819
82,2.6452
83,-0.34819
84,-0.34819
85,-0.34819
86,-0.34819
87,-0.34819
88,1.6474
89,-0.34819
90,-0.34819
91,-0.34819
92,-0.34819
93,-0.34819
94,-0.34819
95,-0.34819
