[<text>
<title>bogart crafts corp &lt;vogt&gt; year loss</title>
<dateline>    new york, march 18 - </dateline>yr ends nov 29, 1986
    shr loss 61 cts vs loss 1.19 dlrs
    net loss 1,017,000 vs loss 1,987,000
    revs 10.4 mln vs 10.3 mln
    note: prior yr ended nov. 30
 reuter
</text>]