time,value
0,-0.2556
1,-0.2556
2,-0.2556
3,-0.2556
4,-0.2556
5,-0.2556
6,-0.2556
7,-0.2556
8,-0.2556
9,-0.2556
10,-0.2556
11,-0.2556
12,-0.2556
13,-0.2556
14,-0.2556
15,-0.2556
16,-0.2556
17,-0.2556
18,-0.2556
19,-0.2556
20,-0.2556
21,-0.2556
22,-0.2556
23,-0.2556
24,-0.2556
25,-0.2556
26,-0.2556
27,-0.2556
28,-0.2556
29,-0.2556
30,-0.2556
31,-0.2556
32,-0.2556
33,-0.2556
34,-0.2556
35,-0.2556
36,-0.2556
37,-0.2556
38,-0.2556
39,-0.2556
40,-0.2556
41,-0.2556
42,-0.2556
43,-0.2556
44,-0.2556
45,-0.2556
46,-0.2556
47,-0.2556
48,0.8856799999999999
49,3.7389
50,-0.2556
51,1.4563
52,5.4508
53,5.4508
54,1.4563
55,3.1683
56,-0.2556
57,0.8856799999999999
58,-0.2556
59,-0.2556
60,-0.2556
61,-0.2556
62,-0.2556
63,-0.2556
64,-0.2556
65,-0.2556
66,-0.2556
67,-0.2556
68,-0.2556
69,-0.2556
70,-0.2556
71,-0.2556
72,-0.2556
73,-0.2556
74,-0.2556
75,-0.2556
76,-0.2556
77,-0.2556
78,-0.2556
79,-0.2556
80,-0.2556
81,-0.2556
82,-0.2556
83,-0.2556
84,-0.2556
85,-0.2556
86,-0.2556
87,-0.2556
88,-0.2556
89,-0.2556
90,-0.2556
91,-0.2556
92,-0.2556
93,-0.2556
94,-0.2556
95,-0.2556
