[<text>
<title>corporate software inc &lt;csof.o&gt; 3rd qtr net</title>
<dateline>    westwood, mass., oct 20 -
    </dateline>shr 13 cts vs 12 cts
    net 470,000 vs 311,000
    revs 15.8 mln vs 8,176,000
    avg shrs 3,723,000 vs 2,512,000
    nine mths
    shr 36 cts vs 43 cts
    net 1,138,000 vs 993,000
    revs 40.5 mln vs 21.9 mln
    avg shrs 3,199,000 vs 2,283,000
   
    note: 1986 includes extraordinary credit of 160,000 or six
cts per shr in qtr 1986 and 511,000 or 22 cts per shr in nine
mths 1986.
 reuter
</text>]