[<text>
<title>cooper lasersonics inc &lt;zaps&gt; 1st qtr loss</title>
<dateline>    palo alto, calif., march 16 - </dateline>period ended january 31.
    shr loss 22 cts vs profit one ct
    net loss 4,700,000 vs profit 150,000
    sales 15.0 mln vs 16.7 mln
    avg shrs 21,538,000 vs 19,259,000
    note: prior qtr figures include gain of 1.1 mln dlrs, or
six cts per share, from discontinued operations.
 reuter
</text>]