time,value
0,-0.35151
1,-0.35151
2,-0.35151
3,-0.35151
4,-0.35151
5,-0.35151
6,-0.35151
7,-0.35151
8,-0.35151
9,-0.35151
10,-0.35151
11,-0.35151
12,-0.35151
13,-0.35151
14,-0.35151
15,-0.35151
16,-0.35151
17,-0.35151
18,-0.35151
19,-0.35151
20,-0.35151
21,-0.35151
22,-0.35151
23,-0.35151
24,-0.35151
25,-0.35151
26,-0.35151
27,-0.35151
28,-0.35151
29,-0.35151
30,-0.35151
31,-0.35151
32,-0.35151
33,-0.35151
34,-0.35151
35,2.6837
36,3.9825
37,1.2125
38,2.3921
39,-0.1527
40,-0.1527
41,4.0621
42,1.0667
43,-0.35151
44,-0.35151
45,-0.35151
46,-0.35151
47,1.4908
48,3.6777
49,0.29794
50,2.7764
51,-0.13944
52,-0.16595
53,3.1078
54,1.9812
55,-0.35151
56,-0.35151
57,-0.35151
58,-0.35151
59,-0.35151
60,-0.35151
61,-0.35151
62,-0.35151
63,-0.35151
64,-0.35151
65,-0.35151
66,-0.35151
67,-0.35151
68,-0.35151
69,-0.35151
70,-0.35151
71,-0.35151
72,-0.35151
73,-0.35151
74,-0.35151
75,-0.35151
76,-0.35151
77,-0.35151
78,-0.35151
79,-0.35151
80,-0.35151
81,-0.35151
82,-0.35151
83,-0.35151
84,-0.35151
85,-0.35151
86,-0.35151
87,-0.35151
88,-0.35151
89,-0.35151
90,-0.35151
91,-0.35151
92,-0.35151
93,-0.35151
94,-0.35151
95,-0.35151
