time,value
0,-0.1881
1,-0.1881
2,-0.1881
3,-0.1881
4,-0.1881
5,-0.1881
6,-0.1881
7,-0.1881
8,-0.1881
9,-0.1881
10,-0.1881
11,-0.1881
12,-0.1881
13,-0.1881
14,-0.1881
15,-0.1881
16,-0.1881
17,-0.1881
18,-0.1881
19,-0.1881
20,-0.1881
21,-0.1881
22,-0.1881
23,-0.1881
24,-0.1881
25,-0.1881
26,-0.1881
27,-0.1881
28,-0.1881
29,-0.1881
30,-0.1881
31,-0.1881
32,-0.1881
33,-0.1881
34,-0.1881
35,-0.1881
36,-0.1881
37,-0.1881
38,-0.1881
39,-0.1881
40,-0.1881
41,-0.1881
42,-0.1881
43,-0.1881
44,-0.1881
45,-0.1881
46,-0.1881
47,-0.1881
48,-0.1881
49,-0.1881
50,-0.1881
51,5.5649
52,5.4051
53,5.5649
54,0.77073
55,-0.1881
56,-0.1881
57,-0.1881
58,-0.1881
59,-0.1881
60,-0.1881
61,-0.1881
62,-0.1881
63,-0.1881
64,-0.1881
65,-0.1881
66,-0.1881
67,-0.1881
68,-0.1881
69,-0.1881
70,-0.1881
71,-0.1881
72,-0.1881
73,-0.1881
74,-0.1881
75,-0.1881
76,-0.1881
77,-0.1881
78,-0.1881
79,-0.1881
80,-0.1881
81,-0.1881
82,-0.1881
83,-0.1881
84,-0.1881
85,-0.1881
86,-0.1881
87,-0.1881
88,-0.1881
89,-0.1881
90,-0.1881
91,-0.1881
92,-0.1881
93,-0.1881
94,-0.1881
95,-0.1881
