time,value
0,1.5503
1,1.4348
2,1.3279
3,1.2118
4,1.1444
5,1.0631
6,1.0081
7,0.88656
8,0.75058
9,0.7643
10,0.6390600000000001
11,0.56275
12,0.45597
13,0.40163000000000004
14,0.34241
15,0.31356
16,0.22111999999999998
17,0.098236
18,0.0010890000000000001
19,0.099802
20,0.1489
21,0.070595
22,0.024474
23,-0.06477000000000001
24,-0.061926
25,-0.14324
26,-0.16692
27,-0.22285
28,-0.29732
29,-0.4048
30,-0.5181899999999999
31,-0.59335
32,-0.52909
33,-0.38704
34,-0.23376
35,-0.099449
36,0.05604
37,0.21481999999999998
38,0.26798
39,0.36875
40,0.5141600000000001
41,0.6634800000000001
42,0.81592
43,0.96925
44,0.91874
45,0.82106
46,0.73639
47,0.69497
48,0.57727
49,0.43704
50,0.34739000000000003
51,0.23471
52,0.11325999999999999
53,0.019549
54,-0.046604
55,-0.0094963
56,-0.093673
57,-0.18407
58,-0.30066
59,-0.38928
60,-0.46567
61,-0.5713199999999999
62,-0.68672
63,-0.7270300000000001
64,-0.8622700000000001
65,-0.9595600000000001
66,-1.0819
67,-1.1011
68,-1.1856
69,-1.1673
70,-1.0294
71,-0.892
72,-0.8519899999999999
73,-0.9545
74,-1.0317
75,-1.1246
76,-1.1786
77,-1.2511
78,-1.3003
79,-1.4152
80,-1.5343
81,-1.6542
82,-1.7395
83,-1.824
84,-1.7696
85,-1.7805
86,-1.8525
87,-1.7603
88,-1.5939
89,-1.4141
90,-1.2747
91,-1.1002
92,-0.8915700000000001
93,-0.71223
94,-0.5381100000000001
95,-0.36015
96,-0.14954
97,0.021452000000000002
98,0.19322
99,0.35736999999999997
100,0.5144
101,0.7014100000000001
102,0.84435
103,0.98677
104,1.0694
105,1.2777
106,1.4466
107,1.6397
108,1.7976
109,1.9814
110,2.0992
111,2.2425
112,2.3604
113,2.5429
114,2.627
115,2.6708
116,2.659
117,2.5865
118,2.4677
119,2.285
120,2.144
121,1.9731
122,1.8271
123,1.6486
124,1.4759
125,1.3397
126,1.2114
127,1.0342
128,0.9135200000000001
129,0.73885
130,0.5784100000000001
131,0.45921999999999996
132,0.27185
133,0.099382
134,-0.11805999999999998
135,-0.2332
136,-0.41056000000000004
137,-0.57753
138,-0.72458
139,-0.86864
140,-1.0445
141,-1.2507
142,-1.4245
143,-1.6297
144,-1.807
145,-1.9751
146,-2.0636
147,-2.1451
148,-2.2344
149,-2.3284
150,-2.4104
151,-2.3268
152,-2.2535
153,-2.1631
154,-2.0837
155,-1.9869999999999999
156,-1.8438
157,-1.694
158,-1.5488
159,-1.4197
160,-1.3874
161,-1.2611
162,-1.1703
163,-1.0805
164,-1.0022
165,-0.9501
166,-0.8753700000000001
167,-0.76448
168,-0.65582
169,-0.5179699999999999
170,-0.5862
171,-0.59616
172,-0.48094
173,-0.33765
174,-0.30719
175,-0.44606
176,-0.58733
177,-0.72467
178,-0.85772
179,-1.0219
180,-1.0782
181,-1.0039
182,-0.8961600000000001
183,-0.8122
184,-0.6829
185,-0.5988399999999999
186,-0.53218
187,-0.42772
188,-0.3273
189,-0.23589000000000002
190,-0.29356
191,-0.16597
192,-0.1114
193,-0.017247
194,0.044817
195,0.11391
196,0.18349000000000001
197,0.086259
198,0.023666999999999997
199,0.12934
200,0.21353000000000003
201,0.29316
202,0.36762
203,0.4656
204,0.42976000000000003
205,0.5454100000000001
206,0.65678
207,0.71888
208,0.79242
209,0.88756
210,0.9744
211,1.0734
212,1.1312
213,0.9782200000000001
214,0.80403
215,0.62765
216,0.46897
217,0.2965
218,0.22954000000000002
219,0.17098
220,0.0021999000000000003
221,-0.2089
222,-0.36728
223,-0.5382600000000001
224,-0.73819
225,-0.92295
226,-1.0665
227,-1.0141
228,-0.92164
229,-0.76485
230,-0.60973
231,-0.57489
232,-0.48782
233,-0.42138000000000003
234,-0.32846
235,-0.22046999999999997
236,-0.080831
237,0.0096757
238,-0.074778
239,0.038772
240,0.16587000000000002
241,0.28698
242,0.38406999999999997
243,0.42688000000000004
244,0.49955
245,0.61587
246,0.7265699999999999
247,0.60592
248,0.61807
249,0.77751
250,0.86205
251,0.9592299999999999
252,1.0326
253,1.0284
254,1.1514
255,1.3143
256,1.3425
257,1.5086
258,1.6055
259,1.6911
260,1.7278
261,1.6095
262,1.4567
263,1.3187
264,1.162
265,1.0665
266,1.0123
267,0.8597299999999999
268,0.71058
269,0.5796600000000001
270,0.58177
271,0.42586
272,0.27471999999999996
273,0.13529000000000002
274,0.068095
275,-0.079825
276,-0.2164
277,-0.36971
278,-0.5102800000000001
279,-0.64084
280,-0.59958
281,-0.47363
282,-0.28926999999999997
283,-0.15049
284,-0.091765
285,-0.092576
286,0.049717000000000004
287,0.18984
288,0.33021
289,0.46926
290,0.5038699999999999
291,0.42232
292,0.57375
293,0.71691
294,0.81094
295,0.92501
296,1.0517
297,0.97264
298,1.0969
299,1.2043
300,1.2739
301,1.3843
302,1.5037
303,1.4566
304,1.3463
305,1.2083
306,1.08
307,0.9053200000000001
308,0.82199
309,0.73537
310,0.5634
311,0.55802
312,0.48828999999999995
313,0.3389
314,0.20302
315,0.06701
316,-0.10231
317,-0.25422
318,-0.29686999999999997
319,-0.41775
320,-0.54047
321,-0.69517
322,-0.7793
323,-0.91058
324,-1.0497
325,-1.2209999999999999
326,-1.3885
327,-1.5801
328,-1.7105
329,-1.7533
330,-1.7428
331,-1.5937
332,-1.4681
333,-1.3313
334,-1.1952
335,-1.0852
336,-0.9655
337,-0.8527600000000001
338,-0.7238
339,-0.60659
340,-0.71751
341,-0.60193
342,-0.46748999999999996
343,-0.37085999999999997
344,-0.34031999999999996
345,-0.38728
346,-0.25617
347,-0.17034000000000002
348,-0.24133000000000002
349,-0.34881999999999996
350,-0.29491999999999996
351,-0.43056000000000005
352,-0.5595600000000001
353,-0.49532
354,-0.43946999999999997
355,-0.5659
356,-0.7248
357,-0.81978
358,-0.83921
359,-0.94611
360,-1.1004
361,-1.1885
362,-1.3383
363,-1.3745
364,-1.2165
365,-1.0708
366,-0.91558
367,-0.77272
368,-0.60998
369,-0.486
370,-0.34139
371,-0.18037
372,-0.083611
373,0.074948
374,0.23419
375,0.33382
376,0.52023
377,0.66562
378,0.72232
379,0.82824
380,0.98972
381,1.1753
382,1.341
383,1.4846
384,1.4324
385,1.3352
386,1.1871
387,1.1925
388,1.0744
389,0.93668
390,0.8851
391,0.84255
392,0.72237
393,0.6196
394,0.56705
395,0.45298999999999995
396,0.37144
397,0.29909
398,0.46703
399,0.39718000000000003
400,0.30826
401,0.20597
402,0.08452
403,-0.012263
404,-0.1126
405,-0.22445
406,-0.30018
407,-0.43459
408,-0.45113000000000003
409,-0.49746
410,-0.5893
411,-0.59213
412,-0.6944600000000001
413,-0.52368
414,-0.35536
415,-0.18664
416,-0.018362
417,0.11195
418,0.30868
419,0.46803
420,0.5995
421,0.65342
422,0.8240299999999999
423,0.9952200000000001
424,1.1678
425,1.3395
426,1.5025
