[<text>
<title>careplus inc &lt;cpls&gt; 4th qtr net</title>
<dateline>    miami, april 1 -
    </dateline>shr loss nil vs profit nil
    net loss 17,000 vs profit 31,000
    revs 5,429,000 up 27 pct
    year
    shr profit four cts vs profit five cts
    net profit 523,000 vs profit 421,000
    revs 18.3 mln vs 11.6 mln
    avg shrs 15.2 mln vs 8,941,000
    note: year net includes tax credits of 131,000 dlrs vs
194,000 dlrs.
    1986 net both periods includes charge 264,000 dlrs from
settlement of overtime wage dispute and addition to provision
for uncollectible accounts.
 reuter
</text>]