time,value
0,-0.14435
1,-0.14435
2,-0.14435
3,-0.14435
4,-0.14435
5,-0.14435
6,-0.14435
7,-0.14435
8,-0.14435
9,-0.14435
10,-0.14435
11,-0.14435
12,-0.14435
13,-0.14435
14,-0.14435
15,-0.14435
16,-0.14435
17,-0.14435
18,-0.14435
19,-0.14435
20,-0.14435
21,-0.14435
22,-0.14435
23,-0.14435
24,-0.14435
25,-0.14435
26,-0.14435
27,-0.14435
28,-0.14435
29,-0.14435
30,-0.14435
31,-0.14435
32,-0.14435
33,-0.14435
34,-0.14435
35,-0.14435
36,-0.14435
37,-0.14435
38,-0.14435
39,-0.14435
40,-0.14435
41,-0.14435
42,-0.14435
43,-0.14435
44,-0.14435
45,-0.14435
46,-0.14435
47,-0.14435
48,-0.14435
49,-0.14435
50,-0.14435
51,-0.14435
52,-0.14435
53,-0.14435
54,-0.14435
55,-0.14435
56,-0.14435
57,-0.14435
58,-0.14435
59,-0.14435
60,-0.14435
61,-0.14435
62,-0.14435
63,-0.14435
64,-0.14435
65,-0.14435
66,-0.14435
67,-0.14435
68,-0.14435
69,-0.14435
70,-0.14435
71,-0.14435
72,-0.14435
73,-0.14435
74,-0.14435
75,-0.14435
76,-0.14435
77,-0.14435
78,-0.14435
79,-0.14435
80,-0.14435
81,6.0838
82,7.4852
83,-0.14435
84,-0.14435
85,-0.14435
86,-0.14435
87,-0.14435
88,-0.14435
89,-0.14435
90,-0.14435
91,-0.14435
92,-0.14435
93,-0.14435
94,-0.14435
95,-0.14435
