time,value
0,1.626
1,1.5311
2,1.4486
3,1.3541
4,1.2605
5,1.1666
6,1.0741
7,0.9813799999999999
8,0.88966
9,0.80805
10,0.72122
11,0.6301
12,0.54299
13,0.45551
14,0.37734
15,0.29217
16,0.20484000000000002
17,0.12134
18,0.036069
19,-0.047186
20,-0.1273
21,-0.21234
22,-0.27760999999999997
23,-0.35572
24,-0.43283999999999995
25,-0.50736
26,-0.57728
27,-0.64878
28,-0.71795
29,-0.78474
30,-0.8438399999999999
31,-0.8998200000000001
32,-0.9564600000000001
33,-1.0098
34,-1.0502
35,-1.0938
36,-1.1299
37,-1.1587
38,-1.1797
39,-1.2037
40,-1.2195
41,-1.2267
42,-1.2134
43,-1.2145
44,-1.1956
45,-1.1795
46,-1.1446
47,-1.1131
48,-1.0683
49,-1.0366
50,-0.9867
51,-0.9396899999999999
52,-0.8864799999999999
53,-0.8251299999999999
54,-0.77388
55,-0.7044199999999999
56,-0.64768
57,-0.57355
58,-0.50074
59,-0.43373999999999996
60,-0.35600000000000004
61,-0.2807
62,-0.20139
63,-0.12153
64,-0.049245
65,0.033960000000000004
66,0.11567999999999999
67,0.19035
68,0.27494
69,0.36464
70,0.44953000000000004
71,0.5137
72,0.57213
73,0.6392800000000001
74,0.70641
75,0.7834
76,0.87505
77,0.9650299999999999
78,1.0578
79,1.15
80,1.2427
81,1.3354
82,1.4292
83,1.5232
84,1.6178
85,1.6849
86,1.6995
87,1.6932
88,1.6425
89,1.5819999999999999
90,1.5254
91,1.4355
92,1.3479
93,1.2639
94,1.1717
95,1.0791
96,0.98819
97,0.8964200000000001
98,0.8033399999999999
99,0.71241
100,0.6218100000000001
101,0.52892
102,0.43618999999999997
103,0.34365
104,0.25131
105,0.1735
106,0.081731
107,-0.009740200000000001
108,-0.10088
109,-0.19165
110,-0.27817
111,-0.36784
112,-0.45692
113,-0.54086
114,-0.62826
115,-0.71472
116,-0.80007
117,-0.8841200000000001
118,-0.9666
119,-1.0472
120,-1.1186
121,-1.1936
122,-1.2486
123,-1.3157
124,-1.3685
125,-1.4135
126,-1.4599
127,-1.4972
128,-1.5238
129,-1.5386
130,-1.5408
131,-1.5304
132,-1.5078
133,-1.4752
134,-1.4406
135,-1.3977
136,-1.3379
137,-1.2724
138,-1.2024
139,-1.1357
140,-1.0585
141,-0.9787799999999999
142,-0.8970799999999999
143,-0.8137
144,-0.7289100000000001
145,-0.6429600000000001
146,-0.55601
147,-0.46986000000000006
148,-0.38384
149,-0.29448
150,-0.20459000000000002
151,-0.11423
152,-0.019968
153,0.06766599999999999
154,0.16229000000000002
155,0.25085999999999997
156,0.33461
157,0.4267
158,0.51185
159,0.59477
160,0.6876
161,0.78058
162,0.8737
163,0.9646100000000001
164,1.056
165,1.1494
166,1.2295
167,1.3214
168,1.411
169,1.5014
170,1.5852
171,1.6641
172,1.7186
173,1.7386
174,1.7356
175,1.6854
