time,value
0,-1.0094
1,-1.0083
2,-1.0072
3,-1.0062
4,-1.0054
5,-1.0048
6,-1.0049
7,-1.0055
8,-1.0061
9,-1.0066
10,-1.0070000000000001
11,-1.0082
12,-1.0094
13,-1.0104
14,-1.0108
15,-1.011
16,-1.0122
17,-1.0134
18,-1.014
19,-1.0139
20,-1.0136
21,-1.0144
22,-1.0151
23,-1.0152
24,-1.0143
25,-1.0134
26,-1.0134
27,-1.0129
28,-1.0113
29,-1.0081
30,-1.0047
31,-1.0018
32,-0.9981700000000001
33,-0.9933799999999999
34,-0.98708
35,-0.98116
36,-0.9759399999999999
37,-0.9700200000000001
38,-0.9625299999999999
39,-0.9527100000000001
40,-0.9424399999999999
41,-0.93105
42,-0.91696
43,-0.8991100000000001
44,-0.87664
45,-0.8517
46,-0.8230200000000001
47,-0.7891199999999999
48,-0.74871
49,-0.70065
50,-0.64683
51,-0.58517
52,-0.51431
53,-0.43328
54,-0.34163000000000004
55,-0.24222
56,-0.13416
57,-0.018129
58,0.1049
59,0.23335
60,0.36348
61,0.49476000000000003
62,0.62579
63,0.7552800000000001
64,0.88164
65,1.0022
66,1.1168
67,1.2249
68,1.3265
69,1.421
70,1.5078
71,1.5881
72,1.6627
73,1.7328
74,1.7988
75,1.8611
76,1.9206
77,1.9780000000000002
78,2.0333
79,2.0862
80,2.1362
81,2.1831
82,2.2267
83,2.2666
84,2.3021
85,2.3329
86,2.3586
87,2.3789
88,2.3934
89,2.4012
90,2.4018
91,2.3943
92,2.3782
93,2.3526
94,2.3167
95,2.2706
96,2.2142
97,2.1482
98,2.0736
99,1.9916
100,1.9043
101,1.8135
102,1.7213
103,1.6292
104,1.538
105,1.4493
106,1.3633
107,1.2799
108,1.1983
109,1.117
110,1.0364
111,0.9556899999999999
112,0.87389
113,0.79022
114,0.7036399999999999
115,0.6160399999999999
116,0.52765
117,0.43881000000000003
118,0.34981
119,0.26097
120,0.17532
121,0.093521
122,0.015857
123,-0.05820499999999999
124,-0.12892
125,-0.19428
126,-0.25475
127,-0.31103000000000003
128,-0.36462
129,-0.41562
130,-0.46184
131,-0.50339
132,-0.5405800000000001
133,-0.57522
134,-0.60707
135,-0.63442
136,-0.65799
137,-0.67866
138,-0.69909
139,-0.71851
140,-0.73522
141,-0.74946
142,-0.76159
143,-0.77412
144,-0.78546
145,-0.79433
146,-0.80124
147,-0.80687
148,-0.81411
149,-0.8209700000000001
150,-0.8264
151,-0.8305100000000001
152,-0.83347
153,-0.8377100000000001
154,-0.8407600000000001
155,-0.8420200000000001
156,-0.8418
157,-0.8406100000000001
158,-0.84116
159,-0.84114
160,-0.84035
161,-0.8388399999999999
162,-0.8365299999999999
163,-0.8351799999999999
164,-0.83155
165,-0.82468
166,-0.8135899999999999
167,-0.79752
168,-0.77691
169,-0.74892
170,-0.71273
171,-0.66793
172,-0.61485
173,-0.55493
174,-0.48762
175,-0.41403
176,-0.33560999999999996
177,-0.2545
178,-0.17318
179,-0.092351
180,-0.013413
181,0.062421000000000004
182,0.1337
183,0.1992
184,0.2592
185,0.31351
186,0.36200000000000004
187,0.40403
188,0.43915
189,0.46783
190,0.49013
191,0.5061899999999999
192,0.51573
193,0.51902
194,0.51708
195,0.5107
196,0.5007199999999999
197,0.48745
198,0.47161000000000003
199,0.45407
200,0.43533999999999995
201,0.41573000000000004
202,0.395
203,0.37337
204,0.35108
205,0.3282
206,0.3048
207,0.28060999999999997
208,0.25592
209,0.23096
210,0.20595
211,0.18114
212,0.15662
213,0.13302
214,0.11083
215,0.090489
216,0.072435
217,0.056813999999999996
218,0.044129
219,0.034455
220,0.027677999999999998
221,0.023494
222,0.021348
223,0.021037
224,0.021866
225,0.023065000000000002
226,0.023796
227,0.023284
228,0.021562
229,0.018096
230,0.012419
231,0.0039989000000000005
232,-0.0073233000000000005
233,-0.020826
234,-0.036614999999999995
235,-0.054778
236,-0.07560499999999999
237,-0.098674
238,-0.12290999999999999
239,-0.14825
240,-0.17479
241,-0.20306
242,-0.23268000000000003
243,-0.26297
244,-0.29418
245,-0.32653000000000004
246,-0.36054
247,-0.39533
248,-0.43001999999999996
249,-0.46461
250,-0.49922
251,-0.53461
252,-0.57013
253,-0.60548
254,-0.64079
255,-0.67589
256,-0.71078
257,-0.7436699999999999
258,-0.77345
259,-0.79976
260,-0.8227899999999999
261,-0.84378
262,-0.86287
263,-0.8812700000000001
264,-0.9003
265,-0.9207
266,-0.94286
267,-0.9647399999999999
268,-0.98475
269,-1.0013
