{
  "about": {
    "problemID": "56_sunspots_problem",
    "problemName": "Yearly sunspots prediction problem",
    "problemDescription": "Predicting yearly numbers of sunspots from 1749 to present, as from the World Data Center, aka SIDC.",
    "problemSchemaVersion": "4.0.0",
    "problemVersion": "4.0.0",
    "taskKeywords": [
      "timeSeries",
      "forecasting",
      "tabular"
    ]
  },
  "inputs": {
    "data": [
      {
        "datasetID": "56_sunspots_dataset",
        "targets": [
          {
            "targetIndex": 0,
            "resID": "learningData",
            "colIndex": 4,
            "colName": "sunspots"
          }
        ]
      }
    ],
    "dataSplits": {
      "splitsFile": "dataSplits.csv",
      "splitScript": "splitScript.py",
      "datasetViewMaps": {
        "train": [
          {
            "from": "56_sunspots_dataset",
            "to": "56_sunspots_dataset_TRAIN"
          }
        ],
        "test": [
          {
            "from": "56_sunspots_dataset",
            "to": "56_sunspots_dataset_TEST"
          }
        ],
        "score": [
          {
            "from": "56_sunspots_dataset",
            "to": "56_sunspots_dataset_SCORE"
          }
        ]
      }
    },
    "performanceMetrics": [
      {
        "metric": "rootMeanSquaredError"
      }
    ]
  },
  "expectedOutputs": {
    "predictionsFile": "predictions.csv"
  }
}