time,value
0,-1.0
1,0.94837
2,-0.64578
3,-0.46865
4,0.7712399999999999
5,-1.0
6,1.3026
7,-1.0
8,0.94837
9,-0.64578
10,-0.46865
11,0.7712399999999999
12,-1.0
13,1.4798
14,-1.0
15,0.23986
16,0.06273300000000001
17,-1.0
18,1.4798
19,-1.0
20,0.41698999999999997
21,0.06273300000000001
22,-1.0
23,1.3026
24,-1.0
25,0.23986
26,0.41698999999999997
27,-1.0
28,1.3026
29,-1.0
30,0.06273300000000001
31,0.23986
32,-1.0
33,1.4798
34,-1.0
35,0.06273300000000001
36,0.41698999999999997
37,-1.0
38,1.4798
39,-1.0
40,-0.46865
41,0.7712399999999999
42,-1.0
43,1.4798
44,-1.0
45,-1.0
46,1.3026
47,-1.0
48,0.94837
49,-0.46865
50,-1.0
51,1.4798
52,-1.0
53,0.06273300000000001
54,0.41698999999999997
55,-1.0
56,1.4798
57,-1.0
58,-0.64578
59,1.1255
60,-1.0
61,0.94837
62,-0.46865
63,-1.0
64,1.4798
65,-1.0
66,0.06273300000000001
67,0.41698999999999997
68,-1.0
69,1.4798
70,-1.0
71,-1.0
72,1.4798
73,-1.0
74,0.94837
75,-0.46865
76,-1.0
77,1.4798
78,-1.0
79,1.4798
80,-1.0
81,1.3026
82,-1.0
83,0.94837
84,-0.64578
85,1.1255
86,-0.64578
87,1.1255
88,-1.0
89,1.3026
90,-1.0
91,1.3026
92,-1.0
93,1.3026
94,-1.0
95,1.3026
