time,value
0,-0.67108
1,-0.67108
2,0.49672
3,2.0538
4,-0.67108
5,-0.67108
6,-0.67108
7,-0.67108
8,-0.67108
9,2.0538
10,0.30209
11,-0.67108
12,-0.67108
13,-0.67108
14,-0.67108
15,0.8859899999999999
16,1.4699
17,-0.67108
18,-0.67108
19,-0.67108
20,-0.67108
21,-0.28181999999999996
22,2.0538
23,0.10745
24,-0.67108
25,-0.67108
26,-0.67108
27,-0.67108
28,1.0806
29,1.4699
30,-0.67108
31,-0.67108
32,-0.67108
33,-0.67108
34,-0.08718
35,2.0538
36,-0.08718
37,-0.67108
38,-0.67108
39,-0.67108
40,-0.67108
41,1.6645
42,0.8859899999999999
43,-0.67108
44,-0.67108
45,-0.67108
46,-0.67108
47,0.6913600000000001
48,2.0538
49,0.30209
50,-0.67108
51,-0.67108
52,-0.67108
53,-0.08718
54,2.0538
55,-0.08718
56,-0.67108
57,-0.67108
58,-0.67108
59,-0.67108
60,2.0538
61,0.10745
62,-0.67108
63,-0.67108
64,-0.67108
65,-0.67108
66,1.8592
67,0.6913600000000001
68,-0.67108
69,-0.67108
70,-0.67108
71,-0.67108
72,1.0806
73,1.2753
74,-0.67108
75,-0.67108
76,-0.67108
77,-0.67108
78,0.6913600000000001
79,1.8592
80,-0.67108
81,-0.67108
82,-0.67108
83,2.0538
84,1.6645
85,-0.67108
86,-0.67108
87,-0.67108
88,-0.67108
89,2.2484
90,0.6913600000000001
91,-0.67108
92,-0.67108
93,-0.67108
94,1.6645
95,1.2753
