time,value
0,-2.3102
1,-2.3124
2,-2.3124
3,-2.3167
4,-2.3255
5,-2.3277
6,-2.3277
7,-2.3277
8,-2.3278
9,-2.3277
10,-2.3275
11,-2.3272
12,-2.3267
13,-2.3262
14,-2.3253
15,-2.3246
16,-2.3235
17,-2.3225
18,-2.3232
19,-2.322
20,-2.3203
21,-2.3189
22,-2.3169
23,-2.3152
24,-2.3135
25,-2.3117
26,-2.3111
27,-2.3119
28,-2.312
29,-2.3133
30,-2.3154
31,-2.316
32,-2.3158
33,-2.315
34,-2.3142
35,-2.3109
36,-2.3083
37,-2.3048
38,-2.3021
39,-2.2983
40,-2.2954
41,-2.2914
42,-2.2883
43,-2.2841
44,-2.2808
45,-2.2775
46,-2.273
47,-2.2695
48,-2.2648
49,-2.263
50,-2.2581
51,-2.2543
52,-2.2492
53,-2.2453
54,-2.24
55,-2.2359999999999998
56,-2.2306
57,-2.2264
58,-2.2208
59,-2.2166
60,-2.2109
61,-2.2065
62,-2.2007
63,-2.1962
64,-2.1902
65,-2.1857
66,-2.1826
67,-2.1858
68,-2.1888
69,-2.1841
70,-2.1793
71,-2.1729
72,-2.1681
73,-2.1615
74,-2.1566
75,-2.15
76,-2.145
77,-2.1383
78,-2.1332
79,-2.1264
80,-2.1213
81,-2.1144
82,-2.1093
83,-2.1023
84,-2.0971
85,-2.09
86,-2.0847
87,-2.0789
88,-2.0736
89,-2.0682
90,-2.061
91,-2.0555
92,-2.0483
93,-2.0428
94,-2.0355
95,-2.03
96,-2.0317
97,-2.0333
98,-2.0289
99,-2.0233
100,-2.0157
101,-2.0101
102,-2.0025
103,-1.9968
104,-1.9892
105,-1.9835
106,-1.9758
107,-1.9701
108,-1.9624
109,-1.9566
110,-1.9489
111,-1.9431
112,-1.9373
113,-1.9295
114,-1.9236
115,-1.9158
116,-1.9099
117,-1.9021
118,-1.8962
119,-1.8883
120,-1.8824
121,-1.8745
122,-1.8686
123,-1.8606
124,-1.8547
125,-1.8467
126,-1.8407
127,-1.8327
128,-1.8267
129,-1.8187
130,-1.8127
131,-1.8047
132,-1.7986
133,-1.7926
134,-1.7845
135,-1.7785
136,-1.7712
137,-1.7652
138,-1.7571
139,-1.751
140,-1.7428
141,-1.7367
142,-1.7286
143,-1.7225
144,-1.7256
145,-1.7259
146,-1.7177
147,-1.7115
148,-1.7033
149,-1.6971
150,-1.6889
151,-1.6827
152,-1.6745
153,-1.6683
154,-1.66
155,-1.6538
156,-1.6476
157,-1.64
158,-1.6338
159,-1.6254
160,-1.6192
161,-1.6137
162,-1.6136
163,-1.6115
164,-1.6052
165,-1.5968
166,-1.5905
167,-1.5822
168,-1.5759
169,-1.5675
170,-1.5612
171,-1.5528
172,-1.5465
173,-1.5381
174,-1.5318
175,-1.5234
176,-1.517
177,-1.5107
178,-1.5023
179,-1.496
180,-1.4875
181,-1.4812
182,-1.4728
183,-1.4664
184,-1.4580000000000002
185,-1.4516
186,-1.4432
187,-1.4368
188,-1.4284
189,-1.4266
190,-1.4201
191,-1.4137
192,-1.4053
193,-1.3989
194,-1.3899
195,-1.3835
196,-1.3751
197,-1.3687
198,-1.3603
199,-1.3576
200,-1.3537
201,-1.3477
202,-1.3414
203,-1.3330000000000002
204,-1.3259999999999998
205,-1.3176
206,-1.3112
207,-1.3028
208,-1.2995
209,-1.295
210,-1.2902
211,-1.2818
212,-1.2754
213,-1.2664
214,-1.2601
215,-1.2516
216,-1.2447
217,-1.2408
218,-1.239
219,-1.2306
220,-1.2242
221,-1.2179
222,-1.2095
223,-1.2025
224,-1.1941
225,-1.1877
226,-1.1793
227,-1.1724
228,-1.1679
229,-1.1625
230,-1.1541
231,-1.1477
232,-1.1393
233,-1.1323
234,-1.1239
235,-1.1175
236,-1.1091
237,-1.1027
238,-1.0962
239,-1.0944
240,-1.0859999999999999
241,-1.0796
242,-1.0706
243,-1.0643
244,-1.0579
245,-1.0495
246,-1.0446
247,-1.0402
248,-1.0369
249,-1.0284
250,-1.0221
251,-1.0131
252,-1.0067
253,-0.99828
254,-0.9919399999999999
255,-0.98806
256,-0.9841700000000001
257,-0.9751299999999999
258,-0.9688
259,-0.9597600000000001
260,-0.9534299999999999
261,-0.9449799999999999
262,-0.9386399999999999
263,-0.93265
264,-0.92875
265,-0.9239299999999999
266,-0.9154899999999999
267,-0.9091600000000001
268,-0.9007200000000001
269,-0.89438
270,-0.88535
271,-0.8790100000000001
272,-0.87056
273,-0.8642200000000001
274,-0.8557600000000001
275,-0.8494200000000001
276,-0.84403
277,-0.84015
278,-0.83475
279,-0.8284100000000001
280,-0.81996
281,-0.81362
282,-0.8051699999999999
283,-0.79824
284,-0.78979
285,-0.78345
286,-0.77498
287,-0.76864
288,-0.7622899999999999
289,-0.75536
290,-0.75152
291,-0.74765
292,-0.74131
293,-0.7328600000000001
294,-0.72651
295,-0.71805
296,-0.7117
297,-0.7026600000000001
298,-0.6963199999999999
299,-0.68785
300,-0.6815
301,-0.67302
302,-0.66667
303,-0.66227
304,-0.66054
305,-0.65208
306,-0.64573
307,-0.63727
308,-0.63092
309,-0.6239899999999999
310,-0.61552
311,-0.60917
312,-0.6007
313,-0.59434
314,-0.58995
315,-0.58822
316,-0.58187
317,-0.57553
318,-0.56706
319,-0.56071
320,-0.55167
321,-0.54532
322,-0.53684
323,-0.53049
324,-0.52145
325,-0.51763
326,-0.51379
327,-0.50744
328,-0.49896999999999997
329,-0.49205
330,-0.48358
331,-0.47723000000000004
332,-0.47086999999999996
333,-0.4655
334,-0.46166
335,-0.45416000000000006
336,-0.44781000000000004
337,-0.43877
338,-0.43241999999999997
339,-0.42396000000000006
340,-0.41761000000000004
341,-0.41011000000000003
342,-0.40626999999999996
343,-0.40087
344,-0.39453
345,-0.38606999999999997
346,-0.37972
347,-0.37126
348,-0.36433000000000004
349,-0.35586999999999996
350,-0.34952
351,-0.34105
352,-0.33469
353,-0.32834
354,-0.31986
355,-0.31351
356,-0.30446999999999996
357,-0.30065
358,-0.29682
359,-0.29047
360,-0.282
361,-0.27564
362,-0.26716999999999996
363,-0.26082
364,-0.25177
365,-0.24541999999999997
366,-0.23694
367,-0.23058
368,-0.2221
369,-0.21573
370,-0.20725
371,-0.20088
372,-0.19239
373,-0.18602
374,-0.17753
375,-0.17115999999999998
376,-0.16479000000000002
377,-0.16047
378,-0.1588
379,-0.14976
380,-0.1434
381,-0.13904
382,-0.13735
383,-0.12887
384,-0.12252
385,-0.11404
386,-0.10712
387,-0.098639
388,-0.092277
389,-0.08691499999999999
390,-0.083103
391,-0.075612
392,-0.068689
393,-0.06021699999999999
394,-0.053862
395,-0.048491
396,-0.044660000000000005
397,-0.041394
398,-0.032355
399,-0.026971
400,-0.02253
401,-0.015604
402,-0.0071503
403,-0.00080628
404,0.0082337
405,0.014578
406,0.023038999999999997
407,0.028426999999999997
408,0.032875
409,0.033462
410,0.041914
411,0.048254000000000005
412,0.057294000000000005
413,0.06363400000000001
414,0.07209299999999999
415,0.078437
416,0.083827
417,0.08769600000000001
418,0.093097
419,0.10002
420,0.10484
421,0.10932
422,0.11263
423,0.12165999999999999
424,0.12708
425,0.1316
426,0.13642
427,0.14485
428,0.15118
429,0.16022
430,0.16654000000000002
431,0.17498
432,0.18131
433,0.18582
434,0.18975
435,0.19879000000000002
436,0.20360999999999999
437,0.20815999999999998
438,0.2136
439,0.22202
440,0.22834000000000002
441,0.23465
442,0.24308000000000002
443,0.2494
444,0.25843
445,0.26475
446,0.27318000000000003
447,0.27951
448,0.28794000000000003
449,0.29427
450,0.3033
451,0.30963
452,0.31415
453,0.31747
454,0.3259
455,0.33221999999999996
456,0.34066
457,0.34698
458,0.35602
459,0.36234
460,0.37078
461,0.37711
462,0.38555
463,0.39188
464,0.39881
465,0.4006
466,0.40452
467,0.41295
468,0.41988000000000003
469,0.42832
470,0.43523999999999996
471,0.43795
472,0.44006000000000006
473,0.44638999999999995
474,0.45271999999999996
475,0.46116
476,0.46748999999999996
477,0.4696
478,0.47111000000000003
479,0.47956000000000004
480,0.48589
481,0.49433999999999995
482,0.50068
483,0.50913
484,0.51547
485,0.52181
486,0.52357
487,0.52745
488,0.5359
489,0.54283
490,0.5512699999999999
491,0.55761
492,0.5642
493,0.56599
494,0.57443
495,0.58076
496,0.5892
497,0.59554
498,0.6039800000000001
499,0.61032
500,0.61936
501,0.6257
502,0.63415
503,0.64049
504,0.64894
505,0.65528
506,0.66374
507,0.66702
508,0.67089
509,0.6784
510,0.68474
511,0.69319
512,0.69953
513,0.70799
514,0.71433
515,0.7227899999999999
516,0.7291300000000001
517,0.73759
518,0.74393
519,0.7502800000000001
520,0.7502800000000001
521,0.7502800000000001
522,0.74855
523,0.74741
524,0.74684
525,0.7457
526,0.7440000000000001
527,0.73652
528,0.73016
529,0.7238
530,0.7147600000000001
531,0.70841
532,0.69993
533,0.69357
534,0.68919
535,0.6875100000000001
536,0.68115
537,0.67479
538,0.6663100000000001
539,0.6593899999999999
540,0.65091
541,0.64455
542,0.63608
543,0.62972
544,0.62068
545,0.61687
546,0.61306
547,0.60614
548,0.59922
549,0.59543
550,0.59377
551,0.5874
552,0.58103
553,0.57255
554,0.56618
555,0.5577
556,0.55133
557,0.54285
558,0.53593
559,0.52745
560,0.5210899999999999
561,0.51261
562,0.50625
563,0.49778
564,0.49241
565,0.48804
566,0.48325
567,0.47476
568,0.46784
569,0.45936000000000005
570,0.45668000000000003
571,0.45233
572,0.4491
573,0.44273
574,0.43368999999999996
575,0.42991999999999997
576,0.4256
577,0.41923
578,0.41073999999999994
579,0.40436
580,0.39532
581,0.38895
582,0.38045999999999996
583,0.37724
584,0.37293000000000004
585,0.3676
586,0.3591
587,0.35535
588,0.35108
589,0.34949
590,0.34739000000000003
591,0.34048
592,0.33196
593,0.32556999999999997
594,0.31653000000000003
595,0.31014
596,0.30376
597,0.29684
598,0.29527
599,0.28945
600,0.28306
601,0.27563000000000004
602,0.27408000000000005
603,0.27042
604,0.26402
605,0.25549
606,0.24858000000000002
607,0.24005
608,0.23689000000000002
609,0.23273000000000002
610,0.22796
611,0.21891999999999998
612,0.21578000000000003
613,0.21165
614,0.20689000000000002
615,0.19834000000000002
616,0.19144
617,0.18503
618,0.17762999999999998
619,0.17615999999999998
620,0.16877
621,0.16186
622,0.15662
623,0.15303
624,0.14779
625,0.14137
626,0.13280999999999998
627,0.12591
628,0.11900999999999999
629,0.11544000000000001
630,0.10974
631,0.10332000000000001
632,0.094279
633,0.087854
634,0.080957
635,0.07740599999999999
636,0.071724
637,0.065294
638,0.05625700000000001
639,0.049826999999999996
640,0.043397000000000005
641,0.039403
642,0.03803
643,0.031596
644,0.02516
645,0.016124
646,0.0096897
647,0.0044857
648,0.00098172
649,-0.0020623
650,-0.008503299999999998
651,-0.017539
652,-0.023977000000000002
653,-0.033013
654,-0.034352
655,-0.039973
656,-0.046419
657,-0.055453999999999996
658,-0.061897
659,-0.070489
660,-0.071809
661,-0.073116
662,-0.07698300000000001
663,-0.078252
664,-0.085551
665,-0.092007
666,-0.10103999999999999
667,-0.10749
668,-0.11264
669,-0.11388
670,-0.11550999999999999
671,-0.11888
672,-0.12222999999999999
673,-0.1287
674,-0.13772
675,-0.14419
676,-0.15322
677,-0.1544
678,-0.15988
679,-0.16674
680,-0.1736
681,-0.17690999999999998
682,-0.1802
683,-0.18273
684,-0.1831
685,-0.18457
686,-0.18566
687,-0.18707000000000001
688,-0.18812
689,-0.18880999999999998
690,-0.18914
691,-0.18549000000000002
692,-0.18649000000000002
693,-0.18562
694,-0.18658
695,-0.18536
696,-0.17915
697,-0.17325
698,-0.17198
699,-0.16576
700,-0.15954000000000002
701,-0.15085
702,-0.14432999999999999
703,-0.13563
704,-0.12911
705,-0.12259
706,-0.11389
707,-0.10737000000000001
708,-0.09896100000000001
709,-0.092437
710,-0.083739
711,-0.07721499999999999
712,-0.06851499999999999
713,-0.061991
714,-0.053291
715,-0.051949
716,-0.052765
717,-0.046504000000000004
718,-0.037798000000000005
719,-0.031532
720,-0.022824
721,-0.019249000000000002
722,-0.018087
723,-0.013729
724,-0.0050143
725,0.0015227
726,0.010237999999999999
727,0.016776
728,0.023313
729,0.032027999999999994
730,0.038566
731,0.047283
732,0.052134
733,0.055316
734,0.062105999999999995
735,0.07081799999999999
736,0.07735399999999999
737,0.08606699999999999
738,0.09285399999999999
739,0.10157000000000001
740,0.1081
741,0.11682000000000001
742,0.12335
743,0.12553
744,0.12553
745,0.1345
746,0.13693
747,0.13935999999999998
748,0.14615
749,0.15294000000000002
750,0.15999000000000002
751,0.16217
752,0.16679000000000002
753,0.17332
754,0.1782
755,0.18117
756,0.18606
757,0.19286
758,0.20156
759,0.20809
760,0.21516999999999997
761,0.21816999999999998
762,0.22307
763,0.2296
764,0.2383
765,0.24483000000000002
766,0.25353000000000003
767,0.26005
768,0.26903
769,0.27555999999999997
770,0.28426
771,0.29079
772,0.29730999999999996
773,0.30412
774,0.30495
775,0.31015
776,0.31667
777,0.32537
778,0.33218000000000003
779,0.34088
780,0.3474
781,0.35638000000000003
782,0.35941
783,0.36246
784,0.36898000000000003
785,0.37767
786,0.38419000000000003
787,0.39289
788,0.3997
789,0.4084
790,0.41491999999999996
791,0.42361000000000004
792,0.43013
793,0.43101000000000006
794,0.43436
795,0.44088
796,0.44956999999999997
797,0.45638
798,0.46507
799,0.47158999999999995
800,0.48028000000000004
801,0.48493
802,0.48828999999999995
803,0.49107
804,0.49976000000000004
805,0.50627
806,0.5149600000000001
807,0.52148
808,0.53017
809,0.53668
810,0.54568
811,0.55219
812,0.56088
813,0.5674
814,0.57609
815,0.5826100000000001
816,0.58913
817,0.59782
818,0.60434
819,0.61303
820,0.61955
821,0.6282399999999999
822,0.63476
823,0.64346
824,0.64998
825,0.65867
826,0.66519
827,0.67389
828,0.6804100000000001
829,0.6891
830,0.69563
831,0.70432
832,0.71085
833,0.71954
834,0.72607
835,0.7347600000000001
836,0.74129
837,0.7478100000000001
838,0.75651
839,0.76303
840,0.77173
841,0.7782600000000001
842,0.78696
843,0.79348
844,0.80218
845,0.80871
846,0.8174100000000001
847,0.82394
848,0.8326399999999999
849,0.83916
850,0.8478700000000001
851,0.85249
852,0.85467
853,0.85685
854,0.86555
855,0.87208
856,0.8807799999999999
857,0.88323
858,0.8856799999999999
859,0.8924799999999999
860,0.8992899999999999
861,0.9074399999999999
862,0.91369
863,0.92212
864,0.92212
865,0.9243
866,0.9308299999999999
867,0.93545
868,0.9379
869,0.9447
870,0.9512299999999999
871,0.95775
872,0.9596600000000001
873,0.9618399999999999
874,0.96836
875,0.97272
876,0.9729899999999999
877,0.9797899999999999
878,0.98659
879,0.99339
880,0.9955700000000001
881,0.99774
882,1.0064
883,1.013
884,1.0217
885,1.0282
886,1.0369
887,1.0434
888,1.0521
889,1.0587
890,1.0609
891,1.0606
892,1.069
893,1.0753
894,1.0794
895,1.0813
896,1.0851
897,1.0917
898,1.0938
899,1.0959999999999999
900,1.1047
901,1.1113
902,1.12
903,1.1265
904,1.133
905,1.1418
906,1.1483
907,1.157
908,1.1635
909,1.1723
910,1.1788
911,1.1875
912,1.194
913,1.2028
914,1.2093
915,1.218
916,1.2188
917,1.2241
918,1.2307
919,1.2394
920,1.2459
921,1.2546
922,1.2612
923,1.2699
924,1.2764
925,1.2849
926,1.2841
927,1.2834
928,1.2853
929,1.2853
930,1.2843
931,1.2841
932,1.2839
933,1.2831
934,1.2822
935,1.2794
936,1.2785
937,1.2739
938,1.2649
939,1.2623
940,1.2593
941,1.2547
942,1.246
943,1.2394
944,1.2307
945,1.2241
946,1.2154
947,1.2089
948,1.2023
949,1.1936
950,1.187
951,1.1783
952,1.1718
953,1.1628
954,1.1563
955,1.1475
956,1.141
957,1.1323
958,1.1257
959,1.117
960,1.1104
961,1.1037
962,1.103
963,1.1022
964,1.0994
965,1.0986
966,1.0918
967,1.0829
968,1.0801
969,1.0773
970,1.0708
971,1.0642
972,1.0553
973,1.0487
974,1.0444
975,1.0444
976,1.0354
977,1.0331
978,1.0307
979,1.0261
980,1.0170000000000001
981,1.0103
982,1.0081
983,1.0059
984,0.9971700000000001
985,0.99061
986,0.98187
987,0.9753200000000001
988,0.9665799999999999
989,0.9600200000000001
990,0.9512799999999999
991,0.94473
992,0.9381700000000001
993,0.92943
994,0.9228799999999999
995,0.91414
996,0.90759
997,0.89885
998,0.8921
999,0.88336
1000,0.8768100000000001
1001,0.8680700000000001
1002,0.8615200000000001
1003,0.85278
1004,0.8462200000000001
1005,0.8374799999999999
1006,0.83093
1007,0.82219
1008,0.8156399999999999
1009,0.8069
1010,0.80035
1011,0.79161
1012,0.7850600000000001
1013,0.7821
1014,0.77935
1015,0.7728
1016,0.7640600000000001
1017,0.7575
1018,0.74876
1019,0.74202
1020,0.73328
1021,0.72673
1022,0.71799
1023,0.71143
1024,0.7085
1025,0.70796
1026,0.69922
1027,0.69266
1028,0.68392
1029,0.67718
1030,0.6684399999999999
1031,0.66188
1032,0.65715
1033,0.6544399999999999
1034,0.64754
1035,0.64098
1036,0.63425
1037,0.62551
1038,0.6208
1039,0.61795
1040,0.61341
1041,0.6046699999999999
1042,0.5981
1043,0.58936
1044,0.58263
1045,0.57389
1046,0.5673199999999999
1047,0.55858
1048,0.55201
1049,0.54935
1050,0.54669
1051,0.53997
1052,0.53341
1053,0.52466
1054,0.51795
1055,0.5092
1056,0.50263
1057,0.49577
1058,0.49313
1059,0.48846000000000006
1060,0.47971
1061,0.473
1062,0.46425
1063,0.45973
1064,0.45698999999999995
1065,0.45453000000000005
1066,0.44577
1067,0.43921000000000004
1068,0.43045
1069,0.42388000000000003
1070,0.41513
1071,0.40843
1072,0.39966999999999997
1073,0.39311
1074,0.38435
1075,0.37778
1076,0.37108
1077,0.3685
1078,0.36812
1079,0.36155
1080,0.35498
1081,0.34623000000000004
1082,0.33966
1083,0.3309
1084,0.32433
1085,0.31556999999999996
1086,0.30901
1087,0.30025
1088,0.29368
1089,0.2848
1090,0.27823000000000003
1091,0.26947
1092,0.2629
1093,0.25414000000000003
1094,0.24758000000000002
1095,0.24708000000000002
1096,0.24453000000000003
1097,0.23795999999999998
1098,0.23139
1099,0.22263000000000002
1100,0.21606
1101,0.2073
1102,0.20073
1103,0.19417
1104,0.18529
1105,0.17872000000000002
1106,0.16996
1107,0.16339
1108,0.15463
1109,0.14806
1110,0.1393
1111,0.13273
1112,0.12385
1113,0.12362000000000001
1114,0.12097999999999999
1115,0.11441
1116,0.10565
1117,0.09908
1118,0.090209
1119,0.083639
1120,0.074878
1121,0.070389
1122,0.069974
1123,0.067588
1124,0.06091900000000001
1125,0.052059
1126,0.051785000000000005
1127,0.049336
1128,0.042678
1129,0.036105
1130,0.033673
1131,0.031186000000000002
1132,0.026802
1133,0.018034
1134,0.011458
1135,0.0026197
1136,-0.0019003
1137,-0.0043433
1138,-0.0087863
1139,-0.0088413
1140,-0.008951299999999999
1141,-0.0091463
1142,-0.009273299999999998
1143,-0.0094203
1144,-0.0095123
1145,-0.009565299999999999
1146,-0.0051792999999999995
1147,-0.0052453000000000005
1148,-0.0031153
1149,0.0034527
1150,0.012216
1151,0.014391999999999999
1152,0.016581
1153,0.023163999999999997
1154,0.029747000000000003
1155,0.031962
1156,0.034194999999999996
1157,0.040774
1158,0.049546
1159,0.056123
1160,0.06489500000000001
1161,0.071492
1162,0.080264
1163,0.086841
1164,0.095613
1165,0.10002
1166,0.1023
1167,0.10674000000000002
1168,0.11331
1169,0.12209
1170,0.12867
1171,0.13746
1172,0.14404
1173,0.15282
1174,0.15511
1175,0.15745
1176,0.16403
1177,0.1728
1178,0.17942
1179,0.18819
1180,0.19050999999999998
1181,0.19291
1182,0.19949
1183,0.20826
1184,0.21483000000000002
1185,0.2236
1186,0.23018000000000002
1187,0.239
1188,0.24558000000000002
1189,0.25435
1190,0.26093
1191,0.2675
1192,0.27626999999999996
1193,0.27626999999999996
1194,0.28065999999999997
1195,0.28723000000000004
1196,0.29600000000000004
1197,0.2982
1198,0.30039
1199,0.30477
1200,0.31354
1201,0.32011999999999996
1202,0.32889
1203,0.33547
1204,0.34424
1205,0.35076
1206,0.35953
1207,0.36611
1208,0.37488
1209,0.38145999999999997
1210,0.39023
1211,0.3968
1212,0.40333
1213,0.40552
1214,0.40771999999999997
1215,0.41648999999999997
1216,0.42306000000000005
1217,0.43188000000000004
1218,0.43406999999999996
1219,0.43627
1220,0.44065
1221,0.44942
1222,0.456
1223,0.46476999999999996
1224,0.47135
1225,0.48012
1226,0.48668999999999996
1227,0.49546
1228,0.5020399999999999
1229,0.50857
1230,0.51063
1231,0.51278
1232,0.51936
1233,0.52813
1234,0.53471
1235,0.54128
1236,0.55005
1237,0.5566300000000001
1238,0.5566300000000001
1239,0.56102
1240,0.56979
1241,0.5764100000000001
1242,0.58526
1243,0.5918899999999999
1244,0.59632
1245,0.59851
1246,0.60728
1247,0.60947
1248,0.6116699999999999
1249,0.61824
1250,0.6270100000000001
1251,0.63359
1252,0.64236
1253,0.64894
1254,0.65771
1255,0.6642899999999999
1256,0.67087
1257,0.6796399999999999
1258,0.68621
1259,0.69503
1260,0.7016100000000001
1261,0.71038
1262,0.71695
1263,0.72572
1264,0.7323
1265,0.74107
1266,0.74765
1267,0.75642
1268,0.763
1269,0.77177
1270,0.77835
1271,0.7850199999999999
1272,0.7873600000000001
1273,0.79405
1274,0.80062
1275,0.8093899999999999
1276,0.81597
1277,0.8247399999999999
1278,0.83137
1279,0.83795
1280,0.84672
1281,0.8533
1282,0.86206
1283,0.86864
1284,0.87539
1285,0.8755799999999999
1286,0.8822200000000001
1287,0.88879
1288,0.89756
1289,0.9041399999999999
1290,0.9129
1291,0.91948
1292,0.92825
1293,0.9348299999999999
1294,0.9435899999999999
1295,0.9501700000000001
1296,0.95894
1297,0.9655799999999999
1298,0.97435
1299,0.9809200000000001
1300,0.9875
1301,0.9962700000000001
1302,0.9962700000000001
1303,0.99846
1304,1.005
1305,1.0138
1306,1.0182
1307,1.0204
1308,1.0226
1309,1.0313
1310,1.0379
1311,1.0467
1312,1.0533
1313,1.062
1314,1.0686
1315,1.0774
1316,1.084
1317,1.0927
1318,1.0993
1319,1.1081
1320,1.1146
1321,1.1192
1322,1.1213
1323,1.1257
1324,1.1346
1325,1.1412
1326,1.15
1327,1.1567
1328,1.1589
1329,1.1611
1330,1.1699
1331,1.1721
1332,1.1743
1333,1.1808
1334,1.1894
1335,1.196
1336,1.2049
1337,1.2116
1338,1.2137
1339,1.2137
1340,1.2224
1341,1.2246
1342,1.2289
1343,1.2355
1344,1.242
1345,1.2464
1346,1.2487
1347,1.2576
1348,1.2598
1349,1.262
1350,1.2685
1351,1.2773
1352,1.284
1353,1.2927
1354,1.2951
1355,1.2975
1356,1.3019999999999998
1357,1.3108
1358,1.3173
1359,1.3261
1360,1.3327
1361,1.3415
1362,1.348
1363,1.3568
1364,1.3634
1365,1.3721
1366,1.3787
1367,1.3853
1368,1.3941
1369,1.4006
1370,1.4049
1371,1.4068
1372,1.4111
1373,1.4177
1374,1.4264
1375,1.433
1376,1.4418
1377,1.4484
1378,1.4571
1379,1.4637
1380,1.4725
1381,1.479
1382,1.4878
1383,1.4879
1384,1.4904
1385,1.4949
1386,1.5037
1387,1.5061
1388,1.5063
1389,1.5066
1390,1.5069
1391,1.5072
1392,1.5075
1393,1.5079
1394,1.5082
1395,1.5085
1396,1.5021
1397,1.4934
1398,1.4914
1399,1.4919
1400,1.4853
1401,1.4767
1402,1.4749
1403,1.4754
1404,1.4688
1405,1.46
1406,1.4535
1407,1.4447
1408,1.4381
1409,1.4294
1410,1.4228
1411,1.4162
1412,1.4116
1413,1.4094
1414,1.4029
1415,1.3963
1416,1.3897
1417,1.3875
1418,1.3853
1419,1.3832
1420,1.3812
1421,1.3793
1422,1.375
1423,1.3730000000000002
1424,1.3735
1425,1.3713
1426,1.3713
1427,1.3649
1428,1.3562
1429,1.3566
1430,1.355
1431,1.3484
1432,1.3419
1433,1.3331
1434,1.3265
1435,1.3179
1436,1.3114
1437,1.3026
1438,1.2961
1439,1.2873
1440,1.2807
1441,1.272
1442,1.2654
1443,1.2567
1444,1.2525
1445,1.2509
1446,1.249
1447,1.2403
1448,1.2337
1449,1.225
1450,1.2184
1451,1.2097
1452,1.2031
1453,1.1944
1454,1.1878
1455,1.1814
1456,1.1727
1457,1.1661
1458,1.1573
1459,1.1508
1460,1.1420000000000001
1461,1.1355
1462,1.1311
1463,1.1289
1464,1.1224
1465,1.1179999999999999
1466,1.1158
1467,1.1114
1468,1.1027
1469,1.0961
1470,1.0874
1471,1.0808
1472,1.0721
1473,1.0655
1474,1.0566
1475,1.05
1476,1.0435
1477,1.0347
1478,1.0282
1479,1.0196
1480,1.013
1481,1.0043
1482,0.99774
1483,0.9889899999999999
1484,0.98244
1485,0.9736899999999999
1486,0.9671299999999999
1487,0.95839
1488,0.95183
1489,0.94309
1490,0.93889
1491,0.9374299999999999
1492,0.9378
1493,0.92906
1494,0.9225
1495,0.91376
1496,0.9072100000000001
1497,0.8984700000000001
1498,0.8921
1499,0.88555
1500,0.8768100000000001
1501,0.87025
1502,0.8615200000000001
1503,0.85496
1504,0.8462200000000001
1505,0.83967
1506,0.83093
1507,0.8243799999999999
1508,0.8156399999999999
1509,0.80909
1510,0.80035
1511,0.7938
1512,0.7850600000000001
1513,0.77851
1514,0.76977
1515,0.76322
1516,0.75448
1517,0.74793
1518,0.7389899999999999
1519,0.73244
1520,0.7258899999999999
1521,0.71715
1522,0.7106
1523,0.70186
1524,0.69531
1525,0.68657
1526,0.68002
1527,0.6712899999999999
1528,0.66474
1529,0.6559999999999999
1530,0.64945
1531,0.64071
1532,0.6341600000000001
1533,0.62543
1534,0.61908
1535,0.61035
1536,0.6038
1537,0.59507
1538,0.5885100000000001
1539,0.5797800000000001
1540,0.57323
1541,0.57323
1542,0.57105
1543,0.56689
1544,0.56055
1545,0.55858
1546,0.55225
1547,0.54592
1548,0.53937
1549,0.53719
1550,0.53457
1551,0.52781
1552,0.51908
1553,0.51275
1554,0.5086
1555,0.50642
1556,0.49987
1557,0.49333
1558,0.48633999999999994
1559,0.48395
1560,0.47936999999999996
1561,0.47281999999999996
1562,0.47063999999999995
1563,0.46846000000000004
1564,0.46191000000000004
1565,0.45318
1566,0.44663
1567,0.4379
1568,0.43135
1569,0.42262
1570,0.41586000000000006
1571,0.40713
1572,0.40059
1573,0.39207
1574,0.38553000000000004
1575,0.37658
1576,0.37003
1577,0.36130999999999996
1578,0.35475999999999996
1579,0.34603
1580,0.33949
1581,0.3325
1582,0.32966999999999996
1583,0.3227
1584,0.31615
1585,0.30741999999999997
1586,0.30086999999999997
1587,0.29431999999999997
1588,0.28559
1589,0.27904
1590,0.2701
1591,0.26355
1592,0.25482
1593,0.24849000000000002
1594,0.23976
1595,0.23321
1596,0.22449000000000002
1597,0.21794000000000002
1598,0.20920999999999998
1599,0.20506999999999997
1600,0.20379
1601,0.20207
1602,0.19358
1603,0.18969
1604,0.18847
1605,0.18436
1606,0.17565
1607,0.16935999999999998
1608,0.16282
1609,0.15704
1610,0.15564
1611,0.14719000000000002
1612,0.14092000000000002
1613,0.14199
1614,0.14064000000000002
1615,0.13194
1616,0.12569
1617,0.11699000000000001
1618,0.11045999999999999
1619,0.10943
1620,0.10812999999999999
1621,0.10930999999999999
1622,0.11022
1623,0.11052000000000001
1624,0.11083
1625,0.11207
1626,0.11302999999999999
1627,0.11367000000000001
1628,0.11399000000000001
1629,0.11464
1630,0.1178
1631,0.12063
1632,0.1293
1633,0.13614
1634,0.14481
1635,0.15131
1636,0.15482
1637,0.15802
1638,0.16668
1639,0.17318
1640,0.18218
1641,0.18868
1642,0.19222999999999998
1643,0.19544
1644,0.20194
1645,0.20843000000000003
1646,0.21744000000000002
1647,0.22394
1648,0.22716
1649,0.2304
1650,0.23725
1651,0.24374
1652,0.25023
1653,0.25924
1654,0.26573
1655,0.27438
1656,0.28088
1657,0.28448
1658,0.28773000000000004
1659,0.29638000000000003
1660,0.30287
1661,0.31151999999999996
1662,0.31801
1663,0.32666
1664,0.33315
1665,0.3418
1666,0.34829
1667,0.35694000000000004
1668,0.36379
1669,0.37245
1670,0.37894
1671,0.38759
1672,0.39408000000000004
1673,0.40274
1674,0.40923000000000004
1675,0.41572
1676,0.42257
1677,0.42581
1678,0.43121000000000004
1679,0.4377
1680,0.44635
1681,0.45283999999999996
1682,0.4615
1683,0.46798999999999996
1684,0.47700000000000004
1685,0.48349
1686,0.49213999999999997
1687,0.49863999999999997
1688,0.50729
1689,0.51198
1690,0.51558
1691,0.51847
1692,0.52712
1693,0.53361
1694,0.5422600000000001
1695,0.54874
1696,0.5556
1697,0.56425
1698,0.5707399999999999
1699,0.57939
1700,0.58444
1701,0.58806
1702,0.59275
1703,0.60177
1704,0.6043
1705,0.60795
1706,0.6108600000000001
1707,0.6195
1708,0.62598
1709,0.63463
1710,0.6411100000000001
1711,0.65013
1712,0.65661
1713,0.66525
1714,0.67174
1715,0.67718
1716,0.68047
1717,0.68733
1718,0.69382
1719,0.70029
1720,0.7089300000000001
1721,0.7157899999999999
1722,0.72443
1723,0.73129
1724,0.73498
1725,0.7379
1726,0.74654
1727,0.75302
1728,0.7620399999999999
1729,0.76852
1730,0.77715
1731,0.78363
1732,0.78694
1733,0.7902600000000001
1734,0.79713
1735,0.8036
1736,0.81223
1737,0.8191
1738,0.82773
1739,0.83421
1740,0.8406799999999999
1741,0.8444
1742,0.8477399999999999
1743,0.8563700000000001
1744,0.8628399999999999
1745,0.8714700000000001
1746,0.8779399999999999
1747,0.8865700000000001
1748,0.89344
1749,0.90207
1750,0.90854
1751,0.91364
1752,0.9169799999999999
1753,0.92209
1754,0.92856
1755,0.9371799999999999
1756,0.94366
1757,0.9522799999999999
1758,0.95915
1759,0.96778
1760,0.97425
1761,0.98288
1762,0.98935
1763,0.9958299999999999
1764,1.0027
1765,1.006
1766,1.0094
1767,1.0158
1768,1.0245
1769,1.0309
1770,1.0396
1771,1.0464
1772,1.0551
1773,1.0615
1774,1.0702
1775,1.0753
1776,1.0812
1777,1.088
1778,1.0967
1779,1.1031
1780,1.1122
1781,1.1186
1782,1.1273
1783,1.1302
1784,1.1314
1785,1.1387
1786,1.1452
1787,1.1538
1788,1.1602
1789,1.1689
1790,1.1757
1791,1.1844
1792,1.1908
1793,1.1995
1794,1.2024
1795,1.2062
1796,1.2131
1797,1.2221
1798,1.2286
1799,1.2372
1800,1.2406
1801,1.2465
1802,1.253
1803,1.262
1804,1.2685
1805,1.2771
1806,1.2805
1807,1.2817
1808,1.2907
1809,1.2972
1810,1.3062
1811,1.3127
1812,1.3161
1813,1.3174
1814,1.3191
1815,1.3204
1816,1.3221
1817,1.3234
1818,1.3252
1819,1.3265
1820,1.3253
1821,1.3193
1822,1.3138
1823,1.3130000000000002
1824,1.3101
1825,1.3037
1826,1.2991
1827,1.2984
1828,1.2903
1829,1.2865
1830,1.2858
1831,1.2851
1832,1.2786
1833,1.2706
1834,1.2642
1835,1.2561
1836,1.2571
1837,1.2569
1838,1.2505
1839,1.242
1840,1.2356
1841,1.227
1842,1.2206
1843,1.2126
1844,1.2062
1845,1.1976
1846,1.1912
1847,1.1827
1848,1.1763
1849,1.1678
1850,1.1614
1851,1.155
1852,1.1459
1853,1.1395
1854,1.131
1855,1.1246
1856,1.1161
1857,1.1097
1858,1.1055
1859,1.104
1860,1.0954
1861,1.089
1862,1.0805
1863,1.0741
1864,1.0656
1865,1.0592
1866,1.0506
1867,1.0442
1868,1.0352
1869,1.0288
1870,1.0203
1871,1.0139
1872,1.0054
1873,0.99898
1874,0.99259
1875,0.9856799999999999
1876,0.9819899999999999
1877,0.97831
1878,0.97191
1879,0.96339
1880,0.9570000000000001
1881,0.94795
1882,0.9415600000000001
1883,0.93304
1884,0.9266399999999999
1885,0.91812
1886,0.9128200000000001
1887,0.9086200000000001
1888,0.90171
1889,0.8931899999999999
1890,0.88679
1891,0.8782700000000001
1892,0.87136
1893,0.8628299999999999
1894,0.85644
1895,0.85005
1896,0.8415299999999999
1897,0.8394
1898,0.83462
1899,0.8277
1900,0.81866
1901,0.81601
1902,0.81284
1903,0.80593
1904,0.8038
1905,0.80167
1906,0.79528
1907,0.78888
1908,0.78036
1909,0.7739699999999999
1910,0.76545
1911,0.75907
1912,0.75002
1913,0.74364
1914,0.73565
1915,0.72926
1916,0.72022
1917,0.71383
1918,0.70745
1919,0.69894
1920,0.6925600000000001
1921,0.68405
1922,0.67767
1923,0.6691600000000001
1924,0.66596
1925,0.66171
1926,0.65692
1927,0.64841
1928,0.64203
1929,0.63352
1930,0.62713
1931,0.61863
1932,0.61225
1933,0.6032
1934,0.59682
1935,0.58832
1936,0.58194
1937,0.57344
1938,0.56706
1939,0.5606899999999999
1940,0.55219
1941,0.54582
1942,0.5394
1943,0.53566
1944,0.52715
1945,0.52077
1946,0.51227
1947,0.50589
1948,0.49738999999999994
1949,0.49101999999999996
1950,0.48198
1951,0.47561000000000003
1952,0.46711
1953,0.46074
1954,0.45224
1955,0.44588
1956,0.43738
1957,0.43101999999999996
1958,0.42253
1959,0.41616000000000003
1960,0.40768000000000004
1961,0.40131
1962,0.39495
1963,0.38647
1964,0.38011
1965,0.37163
1966,0.36783000000000005
1967,0.36403
1968,0.35712
1969,0.34863
1970,0.34226999999999996
1971,0.33378
1972,0.32686
1973,0.31838
1974,0.31201999999999996
1975,0.30354000000000003
1976,0.29718
1977,0.29281999999999997
1978,0.28903
1979,0.28265999999999997
1980,0.2763
1981,0.26781
1982,0.26145
1983,0.25509
1984,0.24605
1985,0.23969000000000001
1986,0.23121
1987,0.22485
1988,0.21638000000000002
1989,0.21001999999999998
1990,0.20409000000000002
1991,0.2024
1992,0.19336
1993,0.187
1994,0.17852
1995,0.17215999999999998
1996,0.16369
1997,0.15733
1998,0.14886
1999,0.14193
2000,0.13346
2001,0.12711
2002,0.11864000000000001
2003,0.11229000000000001
2004,0.10382000000000001
2005,0.097475
2006,0.091128
2007,0.082665
2008,0.076321
2009,0.067864
2010,0.061522
2011,0.053065999999999995
2012,0.046726
2013,0.038276
2014,0.031938
2015,0.023490999999999998
2016,0.017157
2017,0.008711700000000001
2018,0.0023807
2019,-0.0060603
2020,-0.012389
2021,-0.020826
2022,-0.027152999999999997
2023,-0.034980000000000004
2024,-0.041302
2025,-0.050339999999999996
2026,-0.05666
2027,-0.06236799999999999
2028,-0.07078999999999999
2029,-0.077106
2030,-0.085522
2031,-0.091836
2032,-0.10087
2033,-0.10655999999999999
2034,-0.11497
2035,-0.12128
2036,-0.12968
2037,-0.13598
2038,-0.14439000000000002
2039,-0.15068
2040,-0.15908
2041,-0.16538
2042,-0.17377
2043,-0.18007
2044,-0.18845
2045,-0.19474
2046,-0.20248
2047,-0.20393
2048,-0.20340999999999998
2049,-0.20693000000000003
2050,-0.2132
2051,-0.22155999999999998
2052,-0.22716999999999998
2053,-0.23551999999999998
2054,-0.24179
2055,-0.24805
2056,-0.24811
2057,-0.24745999999999999
2058,-0.25371
2059,-0.26135
2060,-0.26759
2061,-0.27521
2062,-0.27797
2063,-0.27723000000000003
2064,-0.28345
2065,-0.29103
2066,-0.29725
2067,-0.30482
2068,-0.30264
2069,-0.30251999999999996
2070,-0.30872
2071,-0.31418
2072,-0.32244
2073,-0.32863000000000003
2074,-0.33127
2075,-0.33108000000000004
2076,-0.33163000000000004
2077,-0.33704
2078,-0.33963000000000004
2079,-0.33732
2080,-0.33421999999999996
2081,-0.33188
2082,-0.32874000000000003
2083,-0.32636
2084,-0.32316999999999996
2085,-0.32156
2086,-0.31259000000000003
2087,-0.30771
2088,-0.30244
2089,-0.29674
2090,-0.28859
2091,-0.28167
2092,-0.27351
2093,-0.26863000000000004
2094,-0.26416
2095,-0.25968
2096,-0.25276
2097,-0.24584
2098,-0.24135
2099,-0.23685
2100,-0.23075
2101,-0.22261999999999998
2102,-0.21650999999999998
2103,-0.20836999999999997
2104,-0.20226
2105,-0.1933
2106,-0.18719
2107,-0.17904
2108,-0.17292000000000002
2109,-0.16476
2110,-0.15863
2111,-0.15338
2112,-0.15095
2113,-0.1428
2114,-0.13668
2115,-0.13055999999999998
2116,-0.1224
2117,-0.11628
2118,-0.10730999999999999
2119,-0.10117999999999999
2120,-0.093012
2121,-0.08688
2122,-0.078702
2123,-0.07256599999999999
2124,-0.06437899999999999
2125,-0.058239
2126,-0.051783
2127,-0.047363999999999996
2128,-0.040438
2129,-0.034302
2130,-0.026118000000000002
2131,-0.019191999999999997
2132,-0.011003
2133,-0.0048613
2134,0.0020667
2135,0.0064727000000000005
2136,0.012934000000000001
2137,0.019072
2138,0.02521
2139,0.033397
2140,0.039541
2141,0.047735
2142,0.053884
2143,0.062084
2144,0.06901399999999999
2145,0.077218
2146,0.083371
2147,0.09158200000000001
2148,0.097742
2149,0.10595999999999998
2150,0.11032
2151,0.11547
2152,0.12162
2153,0.12983
2154,0.13599
2155,0.1442
2156,0.15036
2157,0.15935
2158,0.16551
2159,0.17168
2160,0.1799
2161,0.18608
2162,0.19430999999999998
2163,0.19864
2164,0.20375
2165,0.20992
2166,0.21814
2167,0.22507
2168,0.2333
2169,0.23764000000000002
2170,0.24276
2171,0.24686999999999998
2172,0.25509
2173,0.26125
2174,0.27024000000000004
2175,0.27641
2176,0.28463
2177,0.28951
2178,0.29462
2179,0.30025999999999997
2180,0.30924
2181,0.31283
2182,0.3172
2183,0.32285
2184,0.32900999999999997
2185,0.33799
2186,0.34415
2187,0.35108
2188,0.35545
2189,0.35983000000000004
2190,0.36598
2191,0.37496
2192,0.38111999999999996
2193,0.3901
2194,0.39242
2195,0.39886
2196,0.40579
2197,0.4135
2198,0.41789
2199,0.42561000000000004
2200,0.43253
2201,0.43693999999999994
2202,0.44136000000000003
2203,0.44623999999999997
2204,0.45521000000000006
2205,0.45805
2206,0.46123000000000003
2207,0.46363000000000004
2208,0.46889
2209,0.47131000000000006
2210,0.48027
2211,0.48639
2212,0.48882
2213,0.49126000000000003
2214,0.49453
2215,0.49700000000000005
2216,0.5003
2217,0.5028
2218,0.5061399999999999
2219,0.50866
2220,0.5120399999999999
2221,0.51459
2222,0.518
2223,0.52057
2224,0.5240199999999999
2225,0.52086
2226,0.51481
2227,0.51253
2228,0.5131399999999999
2229,0.5088699999999999
2230,0.50284
2231,0.49481
2232,0.48878999999999995
2233,0.48077
2234,0.47475
2235,0.46674
2236,0.46073000000000003
2237,0.45271999999999996
2238,0.44671000000000005
2239,0.43871000000000004
2240,0.43271000000000004
2241,0.42472
2242,0.41872
2243,0.41073999999999994
2244,0.40475
2245,0.39676999999999996
2246,0.39078
2247,0.3848
2248,0.37683
2249,0.37409000000000003
2250,0.36845
2251,0.36246
2252,0.35448
2253,0.3485
2254,0.34053
2255,0.33364
2256,0.32566999999999996
2257,0.3197
2258,0.31174
2259,0.30578
2260,0.29783000000000004
2261,0.29186999999999996
2262,0.28604
2263,0.28405
2264,0.27610999999999997
2265,0.27015
2266,0.26222
2267,0.25627
2268,0.25231
2269,0.25032
2270,0.24825
2271,0.24033000000000002
2272,0.2344
2273,0.22649
2274,0.22055999999999998
2275,0.21266
2276,0.20674
2277,0.19885
2278,0.19293
2279,0.18505
2280,0.17914000000000002
2281,0.17127
2282,0.16537000000000002
2283,0.1575
2284,0.15161
2285,0.14473
2286,0.13885
2287,0.131
2288,0.12512
2289,0.11729
2290,0.11142
2291,0.10555
2292,0.097729
2293,0.09087100000000001
2294,0.083058
2295,0.07720199999999999
2296,0.069397
2297,0.063549
2298,0.05575700000000001
2299,0.049915
2300,0.042131
2301,0.036298000000000004
2302,0.028524
2303,0.021679
2304,0.01567
2305,0.0088237
2306,3.1723e-05
2307,-0.006815300000000001
2308,-0.014582
2309,-0.01958
2310,-0.025580000000000002
2311,-0.031416
2312,-0.039189999999999996
2313,-0.045018999999999997
2314,-0.051864
2315,-0.059627
2316,-0.065445
2317,-0.072287
2318,-0.077296
2319,-0.082299
2320,-0.088123
2321,-0.095884
2322,-0.1017
2323,-0.10945
2324,-0.11629
2325,-0.12403
2326,-0.12983
2327,-0.13756
2328,-0.14142000000000002
2329,-0.14751
2330,-0.15254
2331,-0.16028
2332,-0.16608
2333,-0.1738
2334,-0.1796
2335,-0.18642999999999998
2336,-0.19414
2337,-0.19992000000000001
2338,-0.20761999999999997
2339,-0.21252
2340,-0.21865
2341,-0.22266
2342,-0.23037
2343,-0.23615
2344,-0.24385
2345,-0.24961999999999998
2346,-0.2573
2347,-0.26306
2348,-0.27073
2349,-0.27755
2350,-0.28520999999999996
2351,-0.29096
2352,-0.29861
2353,-0.30434
2354,-0.31196999999999997
2355,-0.31413
2356,-0.32034
2357,-0.32716
2358,-0.33289
2359,-0.34053
2360,-0.34626
2361,-0.35388000000000003
2362,-0.3596
2363,-0.3683
2364,-0.37401
2365,-0.38161
2366,-0.3873
2367,-0.39489
2368,-0.40058
2369,-0.40815
2370,-0.41381999999999997
2371,-0.42138000000000003
2372,-0.42705
2373,-0.4315
2374,-0.43672
2375,-0.44428999999999996
2376,-0.44996
2377,-0.45863000000000004
2378,-0.46429
2379,-0.46995
2380,-0.47748
2381,-0.48349
2382,-0.48986
2383,-0.49663999999999997
2384,-0.5041800000000001
2385,-0.50983
2386,-0.51848
2387,-0.52374
2388,-0.5301100000000001
2389,-0.53577
2390,-0.5433
2391,-0.55007
2392,-0.5575899999999999
2393,-0.5617300000000001
2394,-0.56812
2395,-0.57301
2396,-0.5816600000000001
2397,-0.5873
2398,-0.59482
2399,-0.6008399999999999
2400,-0.60724
2401,-0.6121300000000001
2402,-0.6177699999999999
2403,-0.6252800000000001
2404,-0.63205
2405,-0.63955
2406,-0.64517
2407,-0.65266
2408,-0.65608
2409,-0.66251
2410,-0.66814
2411,-0.6756300000000001
2412,-0.6823899999999999
2413,-0.68987
2414,-0.69403
2415,-0.70047
2416,-0.70536
2417,-0.71285
2418,-0.71846
2419,-0.7270800000000001
2420,-0.73268
2421,-0.7401399999999999
2422,-0.74688
2423,-0.75035
2424,-0.75639
2425,-0.7631399999999999
2426,-0.77059
2427,-0.7773399999999999
2428,-0.78478
2429,-0.7901199999999999
2430,-0.79661
2431,-0.8022
2432,-0.81081
2433,-0.81639
2434,-0.82499
2435,-0.83034
2436,-0.83568
2437,-0.84126
2438,-0.8498700000000001
2439,-0.85544
2440,-0.86403
2441,-0.86939
2442,-0.87474
2443,-0.8803200000000001
2444,-0.88775
2445,-0.8944799999999999
2446,-0.90004
2447,-0.9042399999999999
2448,-0.9096
2449,-0.91565
2450,-0.92122
2451,-0.92981
2452,-0.9353600000000001
2453,-0.9409200000000001
2454,-0.9463
2455,-0.9528399999999999
2456,-0.9584
2457,-0.96698
2458,-0.97254
2459,-0.97993
2460,-0.9834700000000001
2461,-0.9900200000000001
2462,-0.9955799999999999
2463,-1.003
2464,-1.0097
2465,-1.0171
2466,-1.0225
2467,-1.0279
2468,-1.0346
2469,-1.0401
2470,-1.0487
2471,-1.0542
2472,-1.0603
2473,-1.0657
2474,-1.0736
2475,-1.0791
2476,-1.0877
2477,-1.0932
2478,-1.0993
2479,-1.1047
2480,-1.1126
2481,-1.1181
2482,-1.1267
2483,-1.1322
2484,-1.1395
2485,-1.1449
2486,-1.1534
2487,-1.1602
2488,-1.1637
2489,-1.1691
2490,-1.1759
2491,-1.1844
2492,-1.1898
2493,-1.1964
2494,-1.202
2495,-1.2099
2496,-1.2134
2497,-1.2181
2498,-1.2234
2499,-1.2281
2500,-1.2336
2501,-1.2423
2502,-1.2457
2503,-1.2522
2504,-1.2578
2505,-1.2664
2506,-1.2699
2507,-1.2763
2508,-1.2797
2509,-1.2861
2510,-1.291
2511,-1.2978
2512,-1.3030000000000002
2513,-1.3082
2514,-1.315
2515,-1.3218
2516,-1.3289
2517,-1.3323
2518,-1.3419999999999999
2519,-1.3477
2520,-1.3521
2521,-1.3573
2522,-1.3649
2523,-1.3706
2524,-1.3793
2525,-1.385
2526,-1.3891
2527,-1.3943
2528,-1.4022
2529,-1.4079
2530,-1.4165
2531,-1.4222
2532,-1.4293
2533,-1.4345
2534,-1.4394
2535,-1.4481
2536,-1.4538
2537,-1.4613
2538,-1.4662
2539,-1.4726
2540,-1.4786
2541,-1.4873
2542,-1.4929
2543,-1.5005
2544,-1.5054
2545,-1.5117
2546,-1.5158
2547,-1.5234
2548,-1.5291
2549,-1.5377
2550,-1.5434
2551,-1.5509
2552,-1.5565
2553,-1.5618
2554,-1.567
2555,-1.5719
2556,-1.5794
2557,-1.5851
2558,-1.5925
2559,-1.5981
2560,-1.6068
2561,-1.6123
2562,-1.6198
2563,-1.6253
2564,-1.6337
2565,-1.6391
2566,-1.6465
2567,-1.6521
2568,-1.6606
2569,-1.6662
2570,-1.6735
2571,-1.679
2572,-1.6863
2573,-1.6899
2574,-1.6966
2575,-1.7021
2576,-1.7095
2577,-1.715
2578,-1.7204
2579,-1.729
2580,-1.7344
2581,-1.7417
2582,-1.7471
2583,-1.7539
2584,-1.7594
2585,-1.7666
2586,-1.7721
2587,-1.7793
2588,-1.7847
2589,-1.7918
2590,-1.7985
2591,-1.8056
2592,-1.811
2593,-1.8176
2594,-1.8232
2595,-1.8306
2596,-1.8359
2597,-1.8430000000000002
2598,-1.8483
2599,-1.8536
2600,-1.8606
2601,-1.8672
2602,-1.8742
2603,-1.8794
2604,-1.8863
2605,-1.8915
2606,-1.8980000000000001
2607,-1.9021
2608,-1.9096
2609,-1.9148
2610,-1.9216
2611,-1.9268
2612,-1.9336
2613,-1.94
2614,-1.9468
2615,-1.9518
2616,-1.9585
2617,-1.9635
2618,-1.9701
2619,-1.9765
2620,-1.9839
2621,-1.9901
2622,-1.9951
2623,-2.0016
2624,-2.0065
2625,-2.013
2626,-2.0178
2627,-2.0242
2628,-2.0305
2629,-2.0368
2630,-2.0415
2631,-2.0478
2632,-2.0524
2633,-2.0601
2634,-2.0648
2635,-2.0709999999999997
2636,-2.0756
2637,-2.0818
2638,-2.0863
2639,-2.0923
2640,-2.0968
2641,-2.1027
2642,-2.1071
2643,-2.1114
2644,-2.1172
2645,-2.1214
2646,-2.1288
2647,-2.1329
2648,-2.1384
2649,-2.1425
2650,-2.1479
2651,-2.1519
2652,-2.1571
2653,-2.161
2654,-2.1679
2655,-2.1745
2656,-2.1811
2657,-2.185
2658,-2.19
2659,-2.1936
2660,-2.2003
2661,-2.2039
2662,-2.2086
2663,-2.2119999999999997
2664,-2.2166
2665,-2.2199
2666,-2.2231
2667,-2.2274
2668,-2.2305
2669,-2.2345
2670,-2.2375
2671,-2.2414
2672,-2.2442
2673,-2.2458
2674,-2.2505
2675,-2.2539
2676,-2.2564
2677,-2.2595
2678,-2.2619
2679,-2.2648
2680,-2.2669
2681,-2.2697
2682,-2.2716
2683,-2.2741
2684,-2.2758
2685,-2.278
2686,-2.2796
2687,-2.2811
2688,-2.2829
2689,-2.2842
2690,-2.2857
2691,-2.2926
2692,-2.3012
2693,-2.3023
2694,-2.3036
2695,-2.3045
2696,-2.3055
2697,-2.3061
2698,-2.3068
2699,-2.3073
2700,-2.3077
2701,-2.3079
2702,-2.3080000000000003
2703,-2.3080000000000003
2704,-2.3102
2705,-2.3102
2706,-2.3102
2707,-2.3102
2708,-2.3102
