time,value
0,1.1636
1,-0.63521
2,-0.99498
3,1.7033
4,-0.99498
5,0.80385
6,-0.27545
7,-0.99498
8,1.7033
9,-0.99498
10,0.62397
11,-0.095563
12,-0.99498
13,1.5234
14,-0.99498
15,0.44409
16,0.08432
17,-0.99498
18,1.7033
19,-0.99498
20,-0.095563
21,0.62397
22,-0.99498
23,1.5234
24,-0.99498
25,-0.45533
26,0.98374
27,-0.99498
28,1.3435
29,-0.99498
30,-0.45533
31,0.98374
32,-0.99498
33,1.5234
34,-0.99498
35,-0.99498
36,1.5234
37,-0.99498
38,0.62397
39,-0.095563
40,-0.99498
41,1.5234
42,-0.99498
43,-0.45533
44,0.98374
45,-0.99498
46,1.1636
47,-0.45533
48,-0.99498
49,1.5234
50,-0.99498
51,-0.27545
52,0.80385
53,-0.99498
54,1.1636
55,-0.63521
56,-0.99498
57,1.5234
58,-0.99498
59,-0.095563
60,0.62397
61,-0.99498
62,1.3435
63,-0.63521
64,-0.99498
65,1.5234
66,-0.99498
67,-0.27545
68,0.80385
69,-0.99498
70,0.98374
71,-0.095563
72,-0.63521
73,0.98374
74,-0.99498
75,1.5234
76,-0.99498
77,-0.99498
78,1.3435
79,-0.99498
80,0.98374
81,-0.45533
82,0.2642
83,0.2642
84,-0.45533
85,0.80385
86,-0.99498
87,1.3435
88,-0.99498
89,1.3435
90,-0.99498
91,-0.27545
92,0.62397
93,-0.99498
94,1.3435
95,-0.99498
