time,value
0,1.6057
1,1.5115
2,1.4297
3,1.3368
4,1.244
5,1.1523
6,1.0597
7,0.9801
8,0.88931
9,0.8097300000000001
10,0.72146
11,0.63273
12,0.54483
13,0.45815
14,0.37183
15,0.28431999999999996
16,0.19805
17,0.11463
18,0.030498
19,-0.046733
20,-0.13180999999999998
21,-0.2095
22,-0.28870999999999997
23,-0.36496999999999996
24,-0.44183999999999996
25,-0.51372
26,-0.5845600000000001
27,-0.6481399999999999
28,-0.7175600000000001
29,-0.7739699999999999
30,-0.83896
31,-0.88918
32,-0.9378799999999999
33,-0.9904700000000001
34,-1.0379
35,-1.0634
36,-1.1033
37,-1.1388
38,-1.1605
39,-1.1744
40,-1.1801
41,-1.1893
42,-1.1903
43,-1.183
44,-1.1793
45,-1.1559
46,-1.1252
47,-1.0983
48,-1.0646
49,-1.0244
50,-0.98567
51,-0.93506
52,-0.8831899999999999
53,-0.8283200000000001
54,-0.76764
55,-0.70511
56,-0.64181
57,-0.57119
58,-0.50584
59,-0.43018
60,-0.35613
61,-0.28338
62,-0.20219
63,-0.12572
64,-0.045704
65,0.036721
66,0.11777
67,0.20176
68,0.28526999999999997
69,0.37135
70,0.45687
71,0.54466
72,0.6315
73,0.71954
74,0.80778
75,0.89728
76,0.98831
77,1.0787
78,1.1699
79,1.2613
80,1.3534
81,1.4459
82,1.5384
83,1.6314
84,1.713
85,1.7375
86,1.7528
87,1.7233
88,1.6597
89,1.5733
90,1.4838
91,1.3967
92,1.305
93,1.2154
94,1.1261
95,1.0353
96,0.94468
97,0.8543200000000001
98,0.76425
99,0.67191
100,0.5797100000000001
101,0.49045
102,0.39868000000000003
103,0.30712
104,0.21577
105,0.12793
106,0.037237
107,-0.05313300000000001
108,-0.14314000000000002
109,-0.23274
110,-0.3178
111,-0.4062
112,-0.49398000000000003
113,-0.58102
114,-0.66366
115,-0.7470899999999999
116,-0.83081
117,-0.9131
118,-0.9872700000000001
119,-1.0654
120,-1.1336
121,-1.2007
122,-1.2655
123,-1.3195
124,-1.3764
125,-1.4265
126,-1.4529
127,-1.4864
128,-1.5095
129,-1.5213
130,-1.5212
131,-1.5092
132,-1.486
133,-1.4524
134,-1.4097
135,-1.3689
136,-1.3111
137,-1.2564
138,-1.188
139,-1.1327
140,-1.0575
141,-0.9822700000000001
142,-0.9059799999999999
143,-0.8240200000000001
144,-0.7406
145,-0.66105
146,-0.5751
147,-0.49282
148,-0.40504
149,-0.31663
150,-0.23156
151,-0.14196
152,-0.051942999999999996
153,0.038432
154,0.12913
155,0.21698
156,0.30832
157,0.39989
158,0.49166000000000004
159,0.5836100000000001
160,0.67573
161,0.7559999999999999
162,0.84634
163,0.93858
164,1.0293
165,1.12
166,1.2096
167,1.2884
168,1.3797
169,1.4681
170,1.5567
171,1.6304
172,1.6922
173,1.7087
174,1.7035
175,1.6652
