time,value
0,-0.84445
1,1.4586
2,-0.84445
3,1.3051
4,-0.53737
5,-0.53737
6,1.3051
7,-0.84445
8,0.99798
9,-0.2303
10,-0.84445
11,1.4586
12,-0.84445
13,0.38384
14,0.38384
15,-0.84445
16,1.4586
17,-0.84445
18,-0.84445
19,1.6121
20,-0.84445
21,-0.2303
22,0.99798
23,-0.84445
24,0.38384
25,0.2303
26,-0.84445
27,0.84445
28,-0.07676799999999999
29,-0.84445
30,1.1515
31,-0.38384
32,-0.84445
33,1.6121
34,-0.84445
35,-0.84445
36,1.6121
37,-0.84445
38,-0.84445
39,1.6121
40,-0.84445
41,-0.84445
42,1.7657
43,-0.84445
44,-0.84445
45,1.6121
46,-0.84445
47,-0.84445
48,1.6121
49,-0.84445
50,-0.84445
51,1.4586
52,-0.53737
53,-0.84445
54,1.3051
55,-0.53737
56,-0.84445
57,1.3051
58,-0.38384
59,-0.84445
60,0.69091
61,0.07676799999999999
62,-0.84445
63,0.2303
64,0.53737
65,-0.84445
66,-0.38384
67,1.1515
68,-0.84445
69,-0.84445
70,1.6121
71,-0.84445
72,-0.84445
73,1.6121
74,-0.84445
75,-0.84445
76,1.6121
77,-0.84445
78,-0.84445
79,1.6121
80,-0.84445
81,-0.84445
82,1.6121
83,-0.84445
84,-0.84445
85,1.6121
86,-0.84445
87,-0.38384
88,1.3051
89,-0.84445
90,0.2303
91,0.53737
92,-0.84445
93,1.3051
94,-0.53737
95,-0.84445
