time,value
0,-0.24878000000000003
1,-0.24878000000000003
2,-0.24878000000000003
3,-0.24878000000000003
4,-0.24878000000000003
5,-0.24878000000000003
6,-0.24878000000000003
7,-0.24878000000000003
8,-0.24878000000000003
9,-0.24878000000000003
10,-0.24878000000000003
11,-0.24878000000000003
12,-0.24878000000000003
13,-0.24878000000000003
14,-0.24878000000000003
15,-0.24878000000000003
16,-0.24878000000000003
17,-0.24878000000000003
18,-0.24878000000000003
19,-0.24878000000000003
20,-0.24878000000000003
21,-0.24878000000000003
22,-0.24878000000000003
23,-0.24878000000000003
24,-0.24878000000000003
25,-0.24878000000000003
26,-0.24878000000000003
27,5.4042
28,-0.24878000000000003
29,-0.24878000000000003
30,-0.24878000000000003
31,-0.24878000000000003
32,-0.24878000000000003
33,-0.24878000000000003
34,-0.24878000000000003
35,2.8625
36,-0.24878000000000003
37,0.8905799999999999
38,-0.24878000000000003
39,-0.24878000000000003
40,-0.24878000000000003
41,-0.24878000000000003
42,-0.24878000000000003
43,5.7986
44,-0.24878000000000003
45,-0.24878000000000003
46,-0.24878000000000003
47,-0.24878000000000003
48,-0.24878000000000003
49,-0.24878000000000003
50,-0.24878000000000003
51,-0.24878000000000003
52,-0.24878000000000003
53,-0.24878000000000003
54,-0.24878000000000003
55,-0.24878000000000003
56,-0.24878000000000003
57,-0.24878000000000003
58,-0.24878000000000003
59,-0.24878000000000003
60,2.8625
61,-0.24878000000000003
62,-0.24878000000000003
63,-0.24878000000000003
64,-0.24878000000000003
65,-0.24878000000000003
66,-0.24878000000000003
67,-0.24878000000000003
68,-0.24878000000000003
69,-0.24878000000000003
70,-0.24878000000000003
71,-0.24878000000000003
72,-0.24878000000000003
73,-0.24878000000000003
74,-0.24878000000000003
75,1.8985
76,2.4243
77,-0.24878000000000003
78,-0.24878000000000003
79,-0.24878000000000003
80,-0.24878000000000003
81,-0.24878000000000003
82,-0.24878000000000003
83,-0.24878000000000003
84,-0.24878000000000003
85,-0.24878000000000003
86,-0.24878000000000003
87,-0.24878000000000003
88,-0.24878000000000003
89,-0.24878000000000003
90,-0.24878000000000003
91,-0.24878000000000003
92,-0.24878000000000003
93,-0.24878000000000003
94,-0.24878000000000003
95,-0.24878000000000003
