time,value
0,-0.15036
1,-0.15036
2,-0.15036
3,-0.15036
4,-0.15036
5,-0.15036
6,-0.15036
7,-0.15036
8,-0.15036
9,-0.15036
10,-0.15036
11,-0.15036
12,-0.15036
13,-0.15036
14,-0.15036
15,-0.15036
16,-0.15036
17,-0.15036
18,-0.15036
19,-0.15036
20,-0.15036
21,-0.15036
22,-0.15036
23,-0.15036
24,-0.15036
25,-0.15036
26,-0.15036
27,-0.15036
28,-0.15036
29,-0.15036
30,8.5508
31,-0.15036
32,-0.15036
33,-0.15036
34,-0.15036
35,-0.15036
36,-0.15036
37,-0.15036
38,-0.15036
39,-0.15036
40,-0.15036
41,-0.15036
42,-0.15036
43,-0.15036
44,-0.15036
45,-0.15036
46,-0.15036
47,-0.15036
48,-0.15036
49,-0.15036
50,-0.15036
51,-0.15036
52,-0.15036
53,-0.15036
54,-0.15036
55,-0.15036
56,-0.15036
57,-0.15036
58,-0.15036
59,-0.15036
60,-0.15036
61,-0.15036
62,-0.15036
63,-0.15036
64,-0.15036
65,-0.15036
66,-0.15036
67,-0.15036
68,-0.15036
69,-0.15036
70,-0.15036
71,-0.15036
72,1.1312
73,4.3014
74,-0.15036
75,-0.15036
76,-0.15036
77,-0.15036
78,-0.15036
79,-0.15036
80,-0.15036
81,-0.15036
82,-0.15036
83,-0.15036
84,-0.15036
85,-0.15036
86,-0.15036
87,-0.15036
88,-0.15036
89,-0.15036
90,-0.15036
91,-0.15036
92,-0.15036
93,-0.15036
94,-0.15036
95,-0.15036
