time,value
0,-1.0438
1,-1.0201
2,-0.98782
3,-0.93786
4,-0.86136
5,-0.74768
6,-0.59507
7,-0.40614
8,-0.18825999999999998
9,0.044433999999999994
10,0.2785
11,0.49949
12,0.69655
13,0.86585
14,1.0069
15,1.124
16,1.2199
17,1.2929
18,1.3387
19,1.3504
20,1.3248
21,1.2656
22,1.1819
23,1.0867
24,0.9904299999999999
25,0.8971600000000001
26,0.80495
27,0.70698
28,0.59809
29,0.47663999999999995
30,0.3459
31,0.21336
32,0.085761
33,-0.030602999999999998
34,-0.13374
35,-0.22441999999999998
36,-0.30291999999999997
37,-0.37263
38,-0.43241
39,-0.48323
40,-0.52872
41,-0.56679
42,-0.60187
43,-0.6327699999999999
44,-0.6580699999999999
45,-0.6818
46,-0.7006
47,-0.7183
48,-0.73574
49,-0.74893
50,-0.75951
51,-0.76327
52,-0.76095
53,-0.7567699999999999
54,-0.74907
55,-0.74178
56,-0.73438
57,-0.7257100000000001
58,-0.71839
59,-0.71024
60,-0.70327
61,-0.6993199999999999
62,-0.69755
63,-0.69949
64,-0.70308
65,-0.70673
66,-0.7115199999999999
67,-0.7156100000000001
68,-0.72042
69,-0.72629
70,-0.73142
71,-0.73803
72,-0.74338
73,-0.74666
74,-0.7498
75,-0.74698
76,-0.7409399999999999
77,-0.73163
78,-0.7166600000000001
79,-0.70543
80,-0.6937399999999999
81,-0.68379
82,-0.67832
83,-0.67019
84,-0.66488
85,-0.65623
86,-0.64049
87,-0.62048
88,-0.58825
89,-0.5482600000000001
90,-0.50254
91,-0.44923
92,-0.39274000000000003
93,-0.31901999999999997
94,-0.21386
95,-0.060011
96,0.16505999999999998
97,0.46653
98,0.84254
99,1.2695
100,1.7041
101,2.1038
102,2.4296
103,2.6653
104,2.8176
105,2.9021
106,2.944
107,2.9599
108,2.9603
109,2.9533
110,2.9378
111,2.9153
112,2.8826
113,2.8333
114,2.7652
115,2.6724
116,2.5553
117,2.4185
118,2.265
119,2.1049
120,1.9404
121,1.7723
122,1.6038
123,1.4344
124,1.2759
125,1.1337
126,1.0104
127,0.9061899999999999
128,0.81024
129,0.72421
130,0.64551
131,0.57355
132,0.51649
133,0.4688
134,0.43531000000000003
135,0.41821
136,0.41434
137,0.43521000000000004
138,0.47533000000000003
139,0.53181
140,0.59853
141,0.65897
142,0.71031
143,0.7424
144,0.7490399999999999
145,0.7328100000000001
146,0.68996
147,0.6291100000000001
148,0.55703
149,0.47596000000000005
150,0.39516
151,0.31306
152,0.23199999999999998
153,0.15431
154,0.076418
155,-1.4692000000000001e-05
156,-0.078626
157,-0.16049000000000002
158,-0.24105
159,-0.31951999999999997
160,-0.39113000000000003
161,-0.45455
162,-0.5119100000000001
163,-0.55957
164,-0.5997899999999999
165,-0.63312
166,-0.65995
167,-0.68626
168,-0.7097
169,-0.7310399999999999
170,-0.7511899999999999
171,-0.76579
172,-0.77898
173,-0.78997
174,-0.79864
175,-0.80957
176,-0.8175600000000001
177,-0.82411
178,-0.8290799999999999
179,-0.82988
180,-0.8303299999999999
181,-0.8269799999999999
182,-0.81888
183,-0.80621
184,-0.78345
185,-0.75016
186,-0.7027100000000001
187,-0.6372
188,-0.55561
189,-0.45677
190,-0.34621999999999997
191,-0.23165
192,-0.11853
193,-0.014806999999999999
194,0.07728
195,0.15567999999999999
196,0.21731
197,0.26228
198,0.28931
199,0.30080999999999997
200,0.30217
201,0.2977
202,0.29339
203,0.2911
204,0.2905
205,0.2911
206,0.29057
207,0.28879
208,0.2849
209,0.27731
210,0.26536
211,0.24733000000000002
212,0.22319
213,0.19301
214,0.15584
215,0.11244000000000001
216,0.062273
217,0.0076763000000000005
218,-0.047833999999999995
219,-0.10277
220,-0.15350999999999998
221,-0.20175
222,-0.24919000000000002
223,-0.29632
224,-0.34608
225,-0.39593
226,-0.44513
227,-0.49337
228,-0.53718
229,-0.57844
230,-0.61638
231,-0.65104
232,-0.68442
233,-0.71285
234,-0.7370899999999999
235,-0.75675
236,-0.7712899999999999
237,-0.78362
238,-0.792
239,-0.79728
240,-0.8004100000000001
241,-0.80038
242,-0.80015
243,-0.79947
244,-0.79896
245,-0.8004600000000001
246,-0.8022600000000001
247,-0.80585
248,-0.81083
249,-0.81613
250,-0.8221200000000001
251,-0.82676
252,-0.8304299999999999
253,-0.8342
254,-0.8383
255,-0.8442200000000001
256,-0.8513700000000001
257,-0.85975
258,-0.87085
259,-0.88526
260,-0.90417
261,-0.9265
262,-0.9504799999999999
263,-0.97611
264,-1.0035
265,-1.0326
266,-1.06
267,-1.0798
268,-1.089
269,-1.0888
