time,value
0,-0.16824
1,-0.16824
2,-0.16824
3,-0.16824
4,-0.16824
5,-0.16824
6,-0.16824
7,-0.16824
8,-0.16824
9,-0.16824
10,-0.16824
11,-0.16824
12,-0.16824
13,-0.16824
14,-0.16824
15,-0.16824
16,-0.16824
17,-0.16824
18,-0.16824
19,-0.16824
20,-0.16824
21,-0.16824
22,-0.16824
23,-0.16824
24,-0.16824
25,-0.16824
26,-0.16824
27,-0.16824
28,-0.16824
29,-0.16824
30,5.4951
31,-0.16824
32,-0.16824
33,-0.16824
34,-0.16824
35,-0.16824
36,-0.16824
37,-0.16824
38,-0.16824
39,-0.16824
40,-0.16824
41,-0.16824
42,-0.16824
43,-0.16824
44,-0.16824
45,-0.16824
46,-0.16824
47,-0.16824
48,-0.16824
49,-0.16824
50,-0.16824
51,-0.16824
52,-0.16824
53,-0.16824
54,-0.16824
55,-0.16824
56,-0.16824
57,-0.16824
58,-0.16824
59,-0.16824
60,-0.16824
61,-0.16824
62,-0.16824
63,-0.16824
64,-0.16824
65,-0.16824
66,-0.16824
67,-0.16824
68,-0.16824
69,-0.16824
70,-0.16824
71,2.7683
72,7.3829
73,-0.16824
74,-0.16824
75,-0.16824
76,-0.16824
77,-0.16824
78,-0.16824
79,-0.16824
80,-0.16824
81,-0.16824
82,-0.16824
83,-0.16824
84,-0.16824
85,-0.16824
86,-0.16824
87,-0.16824
88,-0.16824
89,-0.16824
90,-0.16824
91,-0.16824
92,-0.16824
93,-0.16824
94,-0.16824
95,-0.16824
