time,value
0,1.7136
1,1.8151
2,-0.7220300000000001
3,-0.92501
4,-0.92501
5,0.59729
6,-0.41757
7,-0.92501
8,-0.2146
9,1.8151
10,0.90175
11,-0.92501
12,-0.92501
13,0.4958
14,-0.31609
15,-0.92501
16,-0.92501
17,0.08985800000000001
18,1.8151
19,-0.2146
20,-0.41757
21,0.4958
22,-0.92501
23,-0.92501
24,0.59729
25,-0.41757
26,0.4958
27,1.8151
28,-0.62055
29,-0.92501
30,-0.41757
31,0.59729
32,-0.92501
33,-0.92501
34,-0.011629
35,1.8151
36,1.2062
37,-0.92501
38,-0.92501
39,-0.92501
40,0.90175
41,-0.5190600000000001
42,-0.92501
43,-0.2146
44,1.9166
45,0.08985800000000001
46,-0.92501
47,0.4958
48,-0.2146
49,-0.92501
50,0.08985800000000001
51,0.19134
52,1.8151
53,1.0032
54,-0.92501
55,-0.92501
56,-0.92501
57,1.1047
58,-0.92501
59,-0.92501
60,1.9166
61,0.90175
62,-0.92501
63,0.59729
64,-0.31609
65,-0.92501
66,-0.92501
67,0.4958
68,1.8151
69,1.1047
70,-0.92501
71,-0.92501
72,-0.92501
73,1.1047
74,-0.92501
75,-0.5190600000000001
76,1.9166
77,0.19134
78,-0.62055
79,0.90175
80,-0.92501
81,-0.92501
82,0.59729
83,1.9166
84,-0.011629
85,-0.92501
86,-0.92501
87,1.0032
88,-0.92501
89,-0.92501
90,0.6987800000000001
91,1.8151
92,-0.62055
93,-0.92501
94,1.1047
95,-0.92501
