time,value
0,0.45416999999999996
1,0.6127199999999999
2,0.45416999999999996
3,0.45416999999999996
4,0.6127199999999999
5,0.45416999999999996
6,0.6127199999999999
7,0.45416999999999996
8,0.6127199999999999
9,0.45416999999999996
10,0.6127199999999999
11,0.45416999999999996
12,-0.18002
13,-0.49711000000000005
14,-0.49711000000000005
15,-0.49711000000000005
16,-0.49711000000000005
17,-0.49711000000000005
18,-0.49711000000000005
19,-0.49711000000000005
20,-0.18002
21,-0.49711000000000005
22,-0.49711000000000005
23,-0.49711000000000005
24,-0.49711000000000005
25,-0.49711000000000005
26,-0.49711000000000005
27,-0.49711000000000005
28,-0.49711000000000005
29,-0.49711000000000005
30,-0.49711000000000005
31,-0.49711000000000005
32,-0.49711000000000005
33,-0.49711000000000005
34,-0.49711000000000005
35,-0.49711000000000005
36,-0.49711000000000005
37,-0.49711000000000005
38,-0.49711000000000005
39,-0.49711000000000005
40,-0.02147
41,-0.49711000000000005
42,-0.49711000000000005
43,-0.49711000000000005
44,-0.49711000000000005
45,-0.49711000000000005
46,-0.49711000000000005
47,-0.49711000000000005
48,-0.49711000000000005
49,-0.49711000000000005
50,-0.49711000000000005
51,-0.49711000000000005
52,-0.49711000000000005
53,-0.49711000000000005
54,-0.49711000000000005
55,-0.49711000000000005
56,-0.18002
57,-0.49711000000000005
58,-0.49711000000000005
59,-0.49711000000000005
60,-0.49711000000000005
61,-0.49711000000000005
62,-0.49711000000000005
63,-0.49711000000000005
64,-0.49711000000000005
65,-0.49711000000000005
66,-0.49711000000000005
67,-0.49711000000000005
68,-0.49711000000000005
69,-0.49711000000000005
70,-0.49711000000000005
71,-0.49711000000000005
72,-0.49711000000000005
73,-0.49711000000000005
74,-0.49711000000000005
75,-0.49711000000000005
76,-0.49711000000000005
77,-0.49711000000000005
78,-0.49711000000000005
79,-0.49711000000000005
80,0.13708
81,1.2469
82,0.6127199999999999
83,0.45416999999999996
84,0.45416999999999996
85,2.3567
86,3.1495
87,3.3080000000000003
88,3.3080000000000003
89,3.1495
90,3.3080000000000003
91,3.3080000000000003
92,1.8811
93,0.45416999999999996
94,-0.49711000000000005
95,-0.49711000000000005
