time,value
0,1.7276
1,1.7493
2,1.7182
3,1.6336
4,1.5222
5,1.4119
6,1.3026
7,1.1941
8,1.0846
9,0.9816799999999999
10,0.8781399999999999
11,0.7783800000000001
12,0.67978
13,0.5867100000000001
14,0.49088000000000004
15,0.40365
16,0.30612
17,0.22505
18,0.13197
19,0.044315
20,-0.038905
21,-0.12808
22,-0.20798000000000003
23,-0.28924
24,-0.37621
25,-0.45085
26,-0.5301600000000001
27,-0.6007899999999999
28,-0.67708
29,-0.74989
30,-0.81888
31,-0.8694799999999999
32,-0.9430700000000001
33,-0.9961
34,-1.0436
35,-1.1028
36,-1.1487
37,-1.1863
38,-1.2278
39,-1.2433
40,-1.2709
41,-1.2911
42,-1.3039
43,-1.3089
44,-1.3063
45,-1.2959
46,-1.2779
47,-1.2526
48,-1.2379
49,-1.1998
50,-1.1662
51,-1.1201
52,-1.0797
53,-1.0165
54,-0.96759
55,-0.9081600000000001
56,-0.8450799999999999
57,-0.7771
58,-0.7052
59,-0.62973
60,-0.551
61,-0.47802
62,-0.3964
63,-0.3197
64,-0.23101
65,-0.15004
66,-0.06285700000000001
67,0.020337
68,0.10613
69,0.19283
70,0.28555
71,0.37537
72,0.46773000000000003
73,0.5624100000000001
74,0.65923
75,0.75573
76,0.8586600000000001
77,0.9571700000000001
78,1.0649
79,1.1702
80,1.2769
81,1.3873
82,1.4961
83,1.6059999999999999
84,1.6669999999999998
85,1.6726
86,1.6441
87,1.6467
88,1.7278
89,1.7133
90,1.6706
91,1.5966
92,1.4873
93,1.3769
94,1.2674
95,1.1569
96,1.0498
97,0.9439700000000001
98,0.84193
99,0.7411300000000001
100,0.6422
101,0.54708
102,0.45093
103,0.36334
104,0.26561
105,0.17683
106,0.090925
107,0.0081366
108,-0.080349
109,-0.16635999999999998
110,-0.24968
111,-0.32947
112,-0.40710999999999997
113,-0.48898
114,-0.57006
115,-0.62922
116,-0.69539
117,-0.7651100000000001
118,-0.8307399999999999
119,-0.8918799999999999
120,-0.95121
121,-1.0044
122,-1.0618
123,-1.1118
124,-1.1351
125,-1.1806
126,-1.2198
127,-1.2327
128,-1.2578
129,-1.2756
130,-1.286
131,-1.2803
132,-1.2636
133,-1.2713
134,-1.2513
135,-1.2241
136,-1.2049
137,-1.168
138,-1.1208
139,-1.075
140,-1.0442
141,-0.9801700000000001
142,-0.92779
143,-0.8686
144,-0.79306
145,-0.727
146,-0.66394
147,-0.58321
148,-0.5094
149,-0.43799
150,-0.35457
151,-0.27819
152,-0.19075999999999999
153,-0.10614000000000001
154,-0.021355000000000002
155,0.06044600000000001
156,0.14726
157,0.2394
158,0.32623
159,0.4158
160,0.5078699999999999
161,0.60225
162,0.6961
163,0.79895
164,0.8913
165,0.9242100000000001
166,1.0271
167,1.1315
168,1.2373
169,1.3444
170,1.4539
171,1.5622
172,1.6505
173,1.7144
174,1.6905
175,1.6816
