time,value
0,-0.20619
1,-0.20619
2,-0.20619
3,-0.20619
4,-0.20619
5,-0.20619
6,-0.20619
7,-0.20619
8,-0.20619
9,-0.20619
10,-0.20619
11,-0.20619
12,-0.20619
13,-0.20619
14,-0.20619
15,-0.20619
16,-0.20619
17,-0.20619
18,-0.20619
19,-0.20619
20,-0.20619
21,-0.20619
22,-0.20619
23,-0.20619
24,-0.20619
25,-0.20619
26,-0.20619
27,-0.20619
28,-0.20619
29,-0.20619
30,-0.20619
31,2.8321
32,-0.20619
33,-0.20619
34,-0.20619
35,8.0663
36,-0.20619
37,1.9597
38,-0.20619
39,-0.20619
40,-0.20619
41,-0.20619
42,-0.20619
43,-0.20619
44,-0.20619
45,-0.20619
46,-0.20619
47,-0.20619
48,-0.20619
49,-0.20619
50,-0.20619
51,-0.20619
52,-0.20619
53,-0.20619
54,-0.20619
55,-0.20619
56,-0.20619
57,-0.20619
58,-0.20619
59,-0.20619
60,-0.20619
61,-0.20619
62,-0.20619
63,-0.20619
64,-0.20619
65,-0.20619
66,-0.20619
67,-0.20619
68,-0.20619
69,-0.20619
70,-0.20619
71,0.42553
72,2.3508
73,-0.20619
74,-0.20619
75,-0.20619
76,-0.20619
77,-0.20619
78,-0.20619
79,-0.20619
80,-0.20619
81,-0.20619
82,-0.20619
83,-0.20619
84,-0.20619
85,-0.20619
86,-0.20619
87,-0.20619
88,-0.20619
89,-0.20619
90,-0.20619
91,-0.20619
92,-0.20619
93,-0.20619
94,-0.20619
95,2.9223
