time,value
0,-0.31587
1,-0.31587
2,-0.31587
3,-0.31587
4,-0.31587
5,-0.31587
6,-0.31587
7,-0.31587
8,-0.31587
9,-0.31587
10,-0.31587
11,-0.31587
12,-0.31587
13,-0.31587
14,-0.31587
15,-0.31587
16,-0.31587
17,-0.31587
18,-0.31587
19,-0.31587
20,-0.31587
21,-0.31587
22,-0.31587
23,-0.31587
24,-0.31587
25,-0.31587
26,-0.31587
27,-0.31587
28,-0.31587
29,0.12065
30,3.0017
31,2.3712
32,2.8756
33,-0.13155999999999998
34,-0.15095999999999998
35,-0.18007
36,4.6217
37,-0.31587
38,-0.31587
39,-0.31587
40,-0.31587
41,-0.31587
42,-0.31587
43,-0.31587
44,-0.31587
45,-0.31587
46,-0.31587
47,-0.31587
48,-0.31587
49,-0.31587
50,-0.31587
51,-0.31587
52,-0.31587
53,-0.31587
54,-0.31587
55,-0.31587
56,-0.31587
57,-0.31587
58,-0.31587
59,-0.31587
60,-0.31587
61,-0.31587
62,-0.31587
63,-0.31587
64,-0.31587
65,-0.31587
66,-0.31587
67,-0.31587
68,-0.31587
69,-0.31587
70,-0.31587
71,-0.31587
72,-0.31587
73,-0.31587
74,-0.31587
75,-0.31587
76,-0.31587
77,-0.31587
78,-0.31587
79,-0.31587
80,1.0422
81,2.8562
82,1.6339
83,2.8562
84,-0.15095999999999998
85,-0.16067
86,-0.083061
87,4.7478
88,-0.31587
89,-0.31587
90,-0.31587
91,-0.31587
92,-0.31587
93,-0.31587
94,-0.31587
95,-0.31587
