{
  "about": {
    "datasetID": "SEMI_1044_eye_movements_dataset_SCORE",
    "datasetName": "SEMI 1044 eye movements dataset",
    "description": "SEMI-SUPERVISED VERSION OF: **Author**:   \n**Source**: Unknown - Date unknown  \n**Please cite**:   \n\nJarkko Salojarvi, Kai Puolamaki, Jaana Simola, Lauri Kovanen, Ilpo Kojo, Samuel Kaski. Inferring Relevance from Eye Movements: Feature Extraction. Helsinki University of Technology, Publications in Computer and Information Science, Report A82. 3 March 2005. Data set at http://www.cis.hut.fi/eyechallenge2005/\n\nCompetition 1 (preprocessed data)\nA straight-forward classification task. We provide pre-computed feature vectors for each word in the eye movement trajectory, with class labels.\n\nThe dataset consist of several assignments. Each assignment consists of a question followed by ten sentences (titles of news articles). One of the sentences is the correct answer to the question (C) and five of the sentences are irrelevant to the question (I). Four of the sentences are relevant to the question (R), but they do not answer it.\n\n\n* Features are in columns, feature vectors in rows.\n* Each assignment is a time sequence of 22-dimensional feature vectors.\n* The first column is the line number, second the assignment number and the next 22 columns (3 to 24) are the different features. Columns 25 to 27 contain extra information about the example. The training data set contains the classification label in the 28th column: \"0\" for irrelevant, \"1\" for relevant and \"2\" for the correct answer.\n* Each example (row) represents a single word. You are asked to return the classification of each read sentence.\n* The 22 features provided are commonly used in psychological studies on eye movement. All of them are not necessarily relevant in this context.\n\nThe objective of the Challenge is to predict the classification labels (I, R, C).\n\n\n\nPlease see the technical report for information of eye movements, experimental setup, baseline methods and references:\n\nJarkko Salojarvi, Kai Puolamaki, Jaana Simola, Lauri Kovanen, Ilpo Kojo, Samuel Kaski. Inferring Relevance from Eye Movements: Feature Extraction. Helsinki University of Technology, Publications in Computer and Information Science, Report A82. 3 March 2005. [PDF]\n\n\n\nModified by TunedIT (converted to ARFF format)\n\n\nFEATURES\n\nThe values in columns marked with an asterisk (*) are same for all occurances of the word.\n\nCOL\tNAME\t\tDESCRIPTION\n1\t#line\t\tLine number\n2\t#assg\t\tAssignment Number\n3\tfixcount\tNumber of fixations to the word\n4*\tfirstPassCnt\tNumber of fixations to the word when it is first encountered\n5*\tP1stFixation\t'1' if fixation occured when the sentence the word was in was encountered the first time\n6*\tP2stFixation\t'1' if fixation occured when the sentence the word was in was encountered the second time\n7*\tprevFixDur\tDuration of previous fixation\n8*\tfirstfixDur\tDuration of the first fixation when the word is first encountered\n9*\tfirstPassFixDur\tSum of durations of fixations when the word is first encountered\n10*\tnextFixDur\tDuration of the next fixation when gaze initially moves from the word\n11\tfirstSaccLen\tLength of the first saccade\n12\tlastSaccLen\tDistance between fixation on the word and the next fixation\n13\tprevFixPos\tDistance between the first fixation preceding the word and the beginning ot the word\n14\tlandingPos\tDistance between the first fixation on the word and the beginning of the word\n15\tleavingPos\tDistance between the last fixation on the word and the beginning of the word\n16\ttotalFixDur\tSum of all durations of fixations to the word\n17\tmeanFixDur\tMean duration of the fixations to the word\n18*\tnRegressFrom\tNumber of regressions leaving from the word\n19*\tregressLen\tSum of durations of regressions initiating from this word\n20*\tnextWordRegress\t'1' if a regression initiated from the following word\n21*\tregressDur\tSum of durations of the fixations on the word during regression\n22\tpupilDiamMax\tMaximum pupil diameter\n23\tpupilDiamLag\tMaximum pupil diameter 0.5 - 1.5 seconds after the beginning of fixation\n24\ttimePrtctg\tFirst fixation duration divided by the total number of fixations\n25\tnWordsInTitle\tNumber of word in the sentence (title) this word is in\n26\ttitleNo\t\tTitle number\n27\twordNo\t\tWord number (ordinal) in this title\n28\tlabel\t\tClassification for training data ('0'=irrelevant, '1'=relevant, '2'=correct)",
    "citation": "\n\t\t\t\t@article{OpenML2013,\n\t\t\t\tauthor = {Vanschoren, Joaquin and van Rijn, Jan N. and Bischl, Bernd and Torgo, Luis},\n\t\t\t\ttitle = {OpenML: Networked Science in Machine Learning},\n\t\t\t\tjournal = {SIGKDD Explorations},\n\t\t\t\tvolume = {15},\n\t\t\t\tnumber = {2},\n\t\t\t\tyear = {2013},\n\t\t\t\tpages = {49--60},\n\t\t\t\turl = {http://doi.acm.org/10.1145/2641190.2641198},\n\t\t\t\tdoi = {10.1145/2641190.2641198},\n\t\t\t\tpublisher = {ACM},\n\t\t\t\taddress = {New York, NY, USA},\n\t\t\t\t}",
    "license": "CC-BY license",
    "source": "OpenML",
    "sourceURI": "",
    "approximateSize": "",
    "datasetSchemaVersion": "4.0.0",
    "redacted": false,
    "datasetVersion": "4.0.0",
    "digest": "1225b1388d8fb49a6b8a516286c7a4cfe091cc156c7e6b8fcb9befea10647c6e"
  },
  "dataResources": [
    {
      "resID": "learningData",
      "resPath": "tables/learningData.csv",
      "resType": "table",
      "resFormat": {
        "text/csv": [
          "csv"
        ]
      },
      "isCollection": false,
      "columns": [
        {
          "colIndex": 0,
          "colName": "d3mIndex",
          "colType": "integer",
          "role": [
            "index"
          ]
        },
        {
          "colIndex": 1,
          "colName": "lineNo",
          "colType": "integer",
          "role": [
            "attribute"
          ]
        },
        {
          "colIndex": 2,
          "colName": "assgNo",
          "colType": "integer",
          "role": [
            "attribute"
          ]
        },
        {
          "colIndex": 3,
          "colName": "fixcount",
          "colType": "integer",
          "role": [
            "attribute"
          ]
        },
        {
          "colIndex": 4,
          "colName": "firstPassCnt",
          "colType": "integer",
          "role": [
            "attribute"
          ]
        },
        {
          "colIndex": 5,
          "colName": "P1stFixation",
          "colType": "categorical",
          "role": [
            "attribute"
          ]
        },
        {
          "colIndex": 6,
          "colName": "P2stFixation",
          "colType": "categorical",
          "role": [
            "attribute"
          ]
        },
        {
          "colIndex": 7,
          "colName": "prevFixDur",
          "colType": "integer",
          "role": [
            "attribute"
          ]
        },
        {
          "colIndex": 8,
          "colName": "firstfixDur",
          "colType": "integer",
          "role": [
            "attribute"
          ]
        },
        {
          "colIndex": 9,
          "colName": "firstPassFixDur",
          "colType": "integer",
          "role": [
            "attribute"
          ]
        },
        {
          "colIndex": 10,
          "colName": "nextFixDur",
          "colType": "integer",
          "role": [
            "attribute"
          ]
        },
        {
          "colIndex": 11,
          "colName": "firstSaccLen",
          "colType": "real",
          "role": [
            "attribute"
          ]
        },
        {
          "colIndex": 12,
          "colName": "lastSaccLen",
          "colType": "real",
          "role": [
            "attribute"
          ]
        },
        {
          "colIndex": 13,
          "colName": "prevFixPos",
          "colType": "real",
          "role": [
            "attribute"
          ]
        },
        {
          "colIndex": 14,
          "colName": "landingPos",
          "colType": "real",
          "role": [
            "attribute"
          ]
        },
        {
          "colIndex": 15,
          "colName": "leavingPos",
          "colType": "real",
          "role": [
            "attribute"
          ]
        },
        {
          "colIndex": 16,
          "colName": "totalFixDur",
          "colType": "integer",
          "role": [
            "attribute"
          ]
        },
        {
          "colIndex": 17,
          "colName": "meanFixDur",
          "colType": "real",
          "role": [
            "attribute"
          ]
        },
        {
          "colIndex": 18,
          "colName": "nRegressFrom",
          "colType": "integer",
          "role": [
            "attribute"
          ]
        },
        {
          "colIndex": 19,
          "colName": "regressLen",
          "colType": "integer",
          "role": [
            "attribute"
          ]
        },
        {
          "colIndex": 20,
          "colName": "nextWordRegress",
          "colType": "categorical",
          "role": [
            "attribute"
          ]
        },
        {
          "colIndex": 21,
          "colName": "regressDur",
          "colType": "integer",
          "role": [
            "attribute"
          ]
        },
        {
          "colIndex": 22,
          "colName": "pupilDiamMax",
          "colType": "real",
          "role": [
            "attribute"
          ]
        },
        {
          "colIndex": 23,
          "colName": "pupilDiamLag",
          "colType": "real",
          "role": [
            "attribute"
          ]
        },
        {
          "colIndex": 24,
          "colName": "timePrtctg",
          "colType": "real",
          "role": [
            "attribute"
          ]
        },
        {
          "colIndex": 25,
          "colName": "nWordsInTitle",
          "colType": "integer",
          "role": [
            "attribute"
          ]
        },
        {
          "colIndex": 26,
          "colName": "titleNo",
          "colType": "integer",
          "role": [
            "attribute"
          ]
        },
        {
          "colIndex": 27,
          "colName": "wordNo",
          "colType": "integer",
          "role": [
            "attribute"
          ]
        },
        {
          "colIndex": 28,
          "colName": "label",
          "colType": "categorical",
          "role": [
            "suggestedTarget"
          ]
        }
      ],
      "columnsCount": 29
    }
  ]
}