[<text>
<title>pennsylvania real estate investment trust &lt;pei&gt;</title>
<dateline>    wyncote, pa., april 13 -
    </dateline>oper shr 39 cts vs 47 cts
    oper net 2,104,462 vs 2,452,420
    revs 4,675,904 vs 4,744,248
    avg shrs 5,427,561 vs 5,139,415
    1st half
    oper shr 82 cts vs 93 cts
    oper net 4,418,718 vs 4,609,613
    revs 9,346,483 vs 9,338,590
    avg shrs 5,427,486 vs 4,943,966
    note: current year net excludes gains on sale of real
estate of 470,778 dlrs in quarter and 1,533,273 dlrs in half.
    period ended february 28.
 reuter
</text>]