time,value
0,-0.8104399999999999
1,-0.8104399999999999
2,1.7095
3,-0.8104399999999999
4,-0.8104399999999999
5,1.867
6,-0.8104399999999999
7,-0.8104399999999999
8,1.7095
9,-0.8104399999999999
10,-0.8104399999999999
11,1.867
12,-0.8104399999999999
13,-0.8104399999999999
14,1.5519999999999998
15,-0.8104399999999999
16,-0.8104399999999999
17,1.0795
18,-0.022968000000000002
19,-0.8104399999999999
20,0.44951
21,0.60701
22,-0.8104399999999999
23,-0.33796
24,1.237
25,-0.8104399999999999
26,-0.8104399999999999
27,1.7095
28,-0.8104399999999999
29,-0.8104399999999999
30,1.7095
31,-0.8104399999999999
32,-0.8104399999999999
33,1.7095
34,-0.8104399999999999
35,-0.8104399999999999
36,1.7095
37,-0.8104399999999999
38,-0.8104399999999999
39,1.0795
40,-0.18045999999999998
41,-0.8104399999999999
42,0.7645
43,0.29202
44,-0.8104399999999999
45,0.29202
46,0.60701
47,-0.8104399999999999
48,-0.33796
49,1.3945
50,-0.8104399999999999
51,-0.8104399999999999
52,1.7095
53,-0.8104399999999999
54,-0.8104399999999999
55,1.7095
56,-0.8104399999999999
57,-0.8104399999999999
58,0.7645
59,0.13452999999999998
60,-0.8104399999999999
61,-0.18045999999999998
62,1.237
63,-0.8104399999999999
64,-0.8104399999999999
65,1.7095
66,-0.8104399999999999
67,-0.8104399999999999
68,1.0795
69,-0.022968000000000002
70,-0.8104399999999999
71,-0.18045999999999998
72,1.0795
73,-0.8104399999999999
74,-0.8104399999999999
75,1.7095
76,-0.8104399999999999
77,-0.8104399999999999
78,1.7095
79,-0.8104399999999999
80,-0.8104399999999999
81,1.5519999999999998
82,-0.49545
83,-0.8104399999999999
84,0.922
85,0.29202
86,-0.8104399999999999
87,0.29202
88,0.7645
89,-0.8104399999999999
90,-0.18045999999999998
91,1.237
92,-0.8104399999999999
93,-0.33796
94,1.5519999999999998
95,-0.8104399999999999
