time,value
0,-0.50944
1,-0.25339
2,-0.50944
3,-0.25339
4,-0.50944
5,-0.50944
6,-0.50944
7,-0.50944
8,-0.50944
9,-0.50944
10,-0.50944
11,-0.50944
12,-0.50944
13,-0.50944
14,-0.50944
15,-0.50944
16,-0.50944
17,-0.50944
18,-0.50944
19,-0.50944
20,-0.50944
21,-0.50944
22,-0.50944
23,-0.50944
24,-0.50944
25,-0.50944
26,-0.50944
27,-0.50944
28,-0.50944
29,-0.50944
30,-0.50944
31,-0.50944
32,-0.50944
33,-0.50944
34,-0.50944
35,-0.50944
36,-0.50944
37,-0.50944
38,-0.50944
39,-0.50944
40,-0.50944
41,-0.50944
42,-0.50944
43,-0.50944
44,-0.50944
45,-0.50944
46,-0.50944
47,-0.50944
48,-0.50944
49,-0.50944
50,-0.50944
51,-0.50944
52,-0.50944
53,-0.50944
54,-0.50944
55,-0.25339
56,-0.50944
57,-0.50944
58,-0.25339
59,-0.50944
60,1.0269
61,2.3071
62,2.5632
63,2.5632
64,2.0511
65,2.3071
66,2.3071
67,1.0269
68,-0.50944
69,-0.50944
70,0.0026671999999999998
71,2.3071
72,2.0511
73,2.3071
74,2.0511
75,1.795
76,-0.25339
77,-0.50944
78,-0.25339
79,-0.50944
80,1.795
81,2.3071
82,1.795
83,2.3071
84,1.5390000000000001
85,-0.25339
86,-0.50944
87,-0.25339
88,-0.50944
89,-0.25339
90,-0.50944
91,-0.25339
92,-0.50944
93,-0.50944
94,-0.25339
95,-0.50944
