time,value
0,-0.44846
1,-0.44846
2,-0.44846
3,-0.44846
4,-0.44846
5,-0.44846
6,-0.44846
7,-0.44846
8,-0.44846
9,-0.44846
10,-0.44846
11,-0.44846
12,-0.44846
13,-0.44846
14,-0.44846
15,-0.44846
16,-0.44846
17,-0.44846
18,-0.44846
19,-0.44846
20,-0.44846
21,-0.44846
22,-0.44846
23,-0.44846
24,-0.44846
25,-0.44846
26,-0.44846
27,-0.44846
28,-0.44846
29,-0.44846
30,-0.44846
31,-0.44846
32,-0.44846
33,-0.44846
34,-0.44846
35,-0.44846
36,-0.44846
37,-0.44846
38,-0.44846
39,-0.44846
40,-0.44846
41,-0.44846
42,-0.44846
43,-0.44846
44,-0.44846
45,-0.44846
46,-0.44846
47,-0.44846
48,-0.44846
49,-0.44846
50,-0.44846
51,-0.44846
52,-0.44846
53,-0.44846
54,-0.44846
55,-0.44846
56,-0.44846
57,-0.44846
58,-0.44846
59,-0.44846
60,-0.44846
61,-0.44846
62,-0.44846
63,-0.44846
64,-0.44846
65,-0.44846
66,-0.44846
67,-0.44846
68,-0.44846
69,-0.44846
70,-0.44846
71,-0.44846
72,-0.44846
73,-0.44846
74,-0.44846
75,-0.28722
76,2.3733
77,2.2927
78,2.2927
79,2.2927
80,2.0508
81,2.2121
82,2.1314
83,2.1314
84,2.2121
85,2.0508
86,2.2121
87,2.2121
88,2.2121
89,2.3733
90,2.2927
91,2.2121
92,-0.28722
93,-0.44846
94,-0.44846
95,-0.44846
