time,value
0,-0.69584
1,-0.69584
2,-0.69584
3,0.067596
4,1.9762
5,-0.31411999999999995
6,-0.69584
7,-0.69584
8,-0.69584
9,2.167
10,0.25845
11,-0.69584
12,-0.69584
13,-0.69584
14,1.2127
15,1.2127
16,-0.69584
17,-0.69584
18,-0.69584
19,0.44931000000000004
20,1.9762
21,-0.69584
22,-0.69584
23,-0.69584
24,-0.69584
25,1.9762
26,0.067596
27,-0.69584
28,-0.69584
29,-0.69584
30,1.5945
31,0.8310299999999999
32,-0.69584
33,-0.69584
34,-0.69584
35,0.64017
36,1.9762
37,-0.69584
38,-0.69584
39,-0.69584
40,-0.69584
41,1.9762
42,0.067596
43,-0.69584
44,-0.69584
45,-0.69584
46,1.4036
47,1.0219
48,-0.69584
49,-0.69584
50,-0.69584
51,0.44931000000000004
52,1.7853
53,-0.69584
54,-0.69584
55,-0.69584
56,0.44931000000000004
57,1.7853
58,-0.69584
59,-0.69584
60,-0.69584
61,0.067596
62,2.167
63,-0.69584
64,-0.69584
65,-0.69584
66,-0.69584
67,1.7853
68,0.64017
69,-0.69584
70,-0.69584
71,-0.69584
72,1.0219
73,1.2127
74,-0.69584
75,-0.69584
76,-0.69584
77,2.167
78,0.067596
79,-0.69584
80,-0.69584
81,-0.69584
82,1.4036
83,1.0219
84,-0.69584
85,-0.69584
86,-0.69584
87,0.44931000000000004
88,1.7853
89,-0.69584
90,-0.69584
91,-0.69584
92,-0.31411999999999995
93,1.9762
94,-0.12326
95,-0.69584
