time,value
0,-0.035455
1,1.357
2,-0.80901
3,-0.80901
4,1.9758
5,-0.80901
6,-0.80901
7,0.58339
8,0.7381
9,-0.80901
10,-0.80901
11,1.9758
12,-0.80901
13,-0.80901
14,0.8928200000000001
15,0.42868
16,-0.80901
17,-0.80901
18,1.9758
19,-0.80901
20,-0.80901
21,1.357
22,-0.19017
23,-0.80901
24,-0.19017
25,1.357
26,-0.80901
27,-0.80901
28,1.8211
29,-0.80901
30,-0.80901
31,0.11925999999999999
32,1.0475
33,-0.80901
34,-0.80901
35,2.1305
36,-0.80901
37,-0.80901
38,0.58339
39,0.58339
40,-0.80901
41,-0.80901
42,1.9758
43,-0.80901
44,-0.80901
45,0.7381
46,0.58339
47,-0.80901
48,-0.80901
49,1.9758
50,-0.80901
51,-0.80901
52,0.7381
53,0.42868
54,-0.80901
55,-0.80901
56,1.9758
57,-0.80901
58,-0.80901
59,0.42868
60,0.7381
61,-0.80901
62,-0.80901
63,1.8211
64,-0.80901
65,-0.80901
66,0.11925999999999999
67,1.0475
68,-0.80901
69,-0.80901
70,1.357
71,-0.34488
72,-0.80901
73,-0.80901
74,1.8211
75,-0.80901
76,-0.80901
77,0.8928200000000001
78,0.11925999999999999
79,-0.80901
80,-0.80901
81,1.9758
82,-0.80901
83,-0.80901
84,1.2022
85,-0.035455
86,-0.80901
87,1.2022
88,-0.035455
89,-0.80901
90,0.8928200000000001
91,0.11925999999999999
92,-0.80901
93,0.7381
94,0.27397
95,-0.80901
