time,value
0,-0.20992
1,-0.20992
2,-0.20992
3,-0.20992
4,-0.20992
5,-0.20992
6,-0.20992
7,-0.20992
8,-0.20992
9,-0.20992
10,-0.20992
11,-0.20992
12,-0.20992
13,-0.20992
14,-0.20992
15,-0.20992
16,-0.20992
17,-0.20992
18,-0.20992
19,-0.20992
20,-0.20992
21,-0.20992
22,-0.20992
23,-0.20992
24,-0.20992
25,-0.20992
26,-0.20992
27,-0.20992
28,-0.20992
29,-0.20992
30,-0.20992
31,6.7966
32,5.3519
33,2.1737
34,2.3904
35,2.3904
36,-0.20992
37,-0.20992
38,-0.20992
39,-0.20992
40,-0.20992
41,-0.20992
42,-0.20992
43,-0.20992
44,-0.20992
45,-0.20992
46,-0.20992
47,-0.20992
48,-0.20992
49,-0.20992
50,-0.20992
51,-0.20992
52,-0.20992
53,-0.20992
54,-0.20992
55,-0.20992
56,-0.20992
57,-0.20992
58,-0.20992
59,-0.20992
60,-0.20992
61,-0.20992
62,-0.20992
63,-0.20992
64,-0.20992
65,-0.20992
66,-0.20992
67,-0.20992
68,-0.20992
69,-0.20992
70,-0.20992
71,-0.20992
72,-0.20992
73,-0.20992
74,-0.20992
75,-0.20992
76,-0.20992
77,-0.20992
78,-0.20992
79,-0.20992
80,-0.20992
81,-0.20992
82,-0.20992
83,-0.20992
84,-0.20992
85,-0.20992
86,-0.20992
87,-0.20992
88,-0.20992
89,-0.20992
90,-0.20992
91,-0.20992
92,-0.20992
93,-0.20992
94,-0.20992
95,-0.20992
