time,value
0,-0.81138
1,-0.33988
2,1.0746
3,0.69743
4,-0.5284800000000001
5,-0.81138
6,-0.71708
7,-0.24558000000000002
8,0.50883
9,-0.056973
10,0.50883
11,-0.62278
12,-0.81138
13,-0.15127000000000002
14,0.41453
15,-0.71708
16,-0.15127000000000002
17,0.50883
18,-0.62278
19,-0.24558000000000002
20,0.50883
21,-0.71708
22,-0.71708
23,-0.24558000000000002
24,0.41453
25,-0.15127000000000002
26,0.50883
27,-0.43418
28,4.0923
29,4.941
30,-0.056973
31,0.50883
32,0.69743
33,-0.33988
34,-0.71708
35,-0.81138
36,-0.71708
37,-0.15127000000000002
38,1.5461
39,0.13163
40,-0.81138
41,-0.71708
42,-0.81138
43,-0.71708
44,0.79174
45,1.4518
46,-0.71708
47,-0.71708
48,-0.81138
49,-0.71708
50,-0.33988
51,0.98034
52,0.60313
53,-0.5284800000000001
54,-0.81138
55,-0.62278
56,0.22593000000000002
57,0.22593000000000002
58,-0.056973
59,0.41453
60,-0.71708
61,-0.71708
62,0.13163
63,0.22593000000000002
64,-0.81138
65,-0.24558000000000002
66,0.50883
67,-0.5284800000000001
68,0.037327
69,0.32023
70,-0.81138
71,-0.71708
72,-0.33988
73,0.50883
74,0.60313
75,0.13163
76,-0.71708
77,-0.81138
78,-0.71708
79,-0.15127000000000002
80,3.055
81,2.7721
82,-0.71708
83,-0.81138
84,-0.71708
85,-0.056973
86,1.3575
87,0.50883
88,-0.71708
89,-0.81138
90,-0.71708
91,0.41453
92,0.037327
93,0.13163
94,0.41453
95,-0.81138
