time,value
0,-0.45574
1,-0.45574
2,-0.45574
3,-0.45574
4,-0.45574
5,-0.45574
6,-0.45574
7,-0.45574
8,-0.45574
9,-0.45574
10,-0.45574
11,-0.45574
12,-0.45574
13,-0.45574
14,-0.45574
15,-0.45574
16,-0.45574
17,-0.45574
18,-0.45574
19,-0.45574
20,-0.45574
21,-0.45574
22,-0.45574
23,-0.45574
24,-0.45574
25,-0.45574
26,-0.45574
27,-0.45574
28,-0.45574
29,-0.45574
30,-0.45574
31,-0.45574
32,-0.45574
33,-0.45574
34,-0.45574
35,-0.45574
36,-0.45574
37,-0.45574
38,-0.45574
39,-0.45574
40,-0.45574
41,-0.45574
42,-0.45574
43,-0.45574
44,-0.45574
45,-0.45574
46,-0.45574
47,-0.45574
48,2.9645
49,2.4594
50,2.9894
51,0.9935200000000001
52,0.27303
53,1.8465
54,1.5732
55,2.244
56,0.56288
57,-0.4309
58,-0.45574
59,0.14881
60,2.2772
61,1.8714
62,0.53804
63,-0.43918
64,-0.45574
65,-0.45574
66,-0.45574
67,0.08255599999999999
68,-0.45574
69,-0.45574
70,-0.45574
71,-0.45574
72,-0.45574
73,3.3123
74,2.244
75,4.273
76,0.44693999999999995
77,0.32272
78,0.33928
79,0.30616
80,0.331
81,0.33928
82,0.032867
83,-0.45574
84,-0.45574
85,-0.45574
86,-0.45574
87,-0.45574
88,-0.45574
89,-0.45574
90,-0.45574
91,-0.45574
92,-0.45574
93,-0.45574
94,-0.45574
95,-0.45574
