time,value
0,-1.1467
1,-1.1116
2,-1.0546
3,-0.9953200000000001
4,-0.9460799999999999
5,-0.90795
6,-0.87874
7,-0.85613
8,-0.8447
9,-0.8397
10,-0.83942
11,-0.835
12,-0.82591
13,-0.8036300000000001
14,-0.7557699999999999
15,-0.664
16,-0.5143399999999999
17,-0.31426
18,-0.091159
19,0.1117
20,0.26498
21,0.36221
22,0.4215
23,0.46245
24,0.49623
25,0.52677
26,0.55904
27,0.59777
28,0.63994
29,0.6764399999999999
30,0.70013
31,0.7128399999999999
32,0.7147899999999999
33,0.7015899999999999
34,0.66359
35,0.598
36,0.50649
37,0.39129
38,0.25301
39,0.09654299999999999
40,-0.06577899999999999
41,-0.22099000000000002
42,-0.35819
43,-0.47600000000000003
44,-0.56982
45,-0.6435
46,-0.698
47,-0.74119
48,-0.77541
49,-0.8023899999999999
50,-0.82155
51,-0.83224
52,-0.8388
53,-0.8399200000000001
54,-0.8401299999999999
55,-0.8354600000000001
56,-0.83034
57,-0.8245
58,-0.8231299999999999
59,-0.8261700000000001
60,-0.83224
61,-0.8397700000000001
62,-0.8455600000000001
63,-0.8523299999999999
64,-0.8583
65,-0.8663799999999999
66,-0.8753200000000001
67,-0.8854799999999999
68,-0.8945200000000001
69,-0.90112
70,-0.90543
71,-0.90776
72,-0.90871
73,-0.9073899999999999
74,-0.90705
75,-0.91022
76,-0.9177299999999999
77,-0.9239200000000001
78,-0.9243399999999999
79,-0.91946
80,-0.9132
81,-0.9074399999999999
82,-0.89871
83,-0.88935
84,-0.88261
85,-0.88639
86,-0.89592
87,-0.90659
88,-0.91438
89,-0.9194399999999999
90,-0.9262299999999999
91,-0.92914
92,-0.9309
93,-0.92681
94,-0.92542
95,-0.92327
96,-0.9214
97,-0.91301
98,-0.8926799999999999
99,-0.85639
100,-0.79932
101,-0.72249
102,-0.6228899999999999
103,-0.49932
104,-0.33914
105,-0.12839
106,0.14734
107,0.48203999999999997
108,0.84464
109,1.1832
110,1.4458
111,1.6027
112,1.6548
113,1.6286
114,1.5563
115,1.463
116,1.3558
117,1.2332
118,1.0927
119,0.9381700000000001
120,0.77537
121,0.60698
122,0.43285
123,0.25506
124,0.081415
125,-0.07980599999999999
126,-0.22291
127,-0.35058
128,-0.46391000000000004
129,-0.5646899999999999
130,-0.6472399999999999
131,-0.71122
132,-0.75738
133,-0.7904399999999999
134,-0.81609
135,-0.8311700000000001
136,-0.8468700000000001
137,-0.85975
138,-0.88023
139,-0.9007299999999999
140,-0.92238
141,-0.94509
142,-0.9704299999999999
143,-0.99802
144,-1.0152
145,-1.0221
146,-1.0148
147,-1.0025
148,-0.97829
149,-0.93716
150,-0.8728
151,-0.7865800000000001
152,-0.68221
153,-0.5572600000000001
154,-0.4069
155,-0.22300999999999999
156,-0.0071844
157,0.23225
158,0.47465
159,0.69763
160,0.87997
161,1.0088
162,1.0791
163,1.0915
164,1.0518
165,0.96919
166,0.8587299999999999
167,0.73612
168,0.61435
169,0.49453
170,0.36934
171,0.23068000000000002
172,0.07989
173,-0.07177
174,-0.21156
175,-0.33176
176,-0.43272
177,-0.5152800000000001
178,-0.5835899999999999
179,-0.63661
180,-0.6801
181,-0.71518
182,-0.74822
183,-0.7800199999999999
184,-0.8096300000000001
185,-0.8355
186,-0.85003
187,-0.8572299999999999
188,-0.8519399999999999
189,-0.8437100000000001
190,-0.82995
191,-0.81706
192,-0.8049
193,-0.79609
194,-0.79206
195,-0.78857
196,-0.7835300000000001
197,-0.76283
198,-0.7216600000000001
199,-0.64486
200,-0.5325300000000001
201,-0.38451
202,-0.2126
203,-0.034295
204,0.13471
205,0.27379000000000003
206,0.3788
207,0.44056000000000006
208,0.47263999999999995
209,0.47975
210,0.48101000000000005
211,0.48113
212,0.48263999999999996
213,0.48601000000000005
214,0.49304
215,0.52004
216,0.57698
217,0.67961
218,0.82119
219,0.99749
220,1.1897
221,1.3901
222,1.5907
223,1.7878
224,1.974
225,2.1338
226,2.2582
227,2.3412
228,2.3991
229,2.4383
230,2.4718
231,2.4856
232,2.4721
233,2.4232
234,2.3467
235,2.2568
236,2.1613
237,2.063
238,1.953
239,1.8343
240,1.7092
241,1.5956
242,1.5004
243,1.4321
244,1.3873
245,1.3687
246,1.375
247,1.4075
248,1.4635
249,1.531
250,1.5971
251,1.6317
252,1.6174
253,1.5328
254,1.3880000000000001
255,1.2001
256,1.0015
257,0.80698
258,0.61243
259,0.40671999999999997
260,0.18145
261,-0.047048
262,-0.27094
263,-0.47675
264,-0.66269
265,-0.8125600000000001
266,-0.9212600000000001
267,-0.99597
268,-1.0564
269,-1.1111
