time,value
0,-0.19027
1,-0.19027
2,-0.19027
3,-0.19027
4,-0.19027
5,-0.19027
6,-0.19027
7,-0.19027
8,-0.19027
9,-0.19027
10,-0.19027
11,-0.19027
12,-0.19027
13,-0.19027
14,-0.19027
15,-0.19027
16,-0.19027
17,-0.19027
18,-0.19027
19,-0.19027
20,-0.19027
21,-0.19027
22,-0.19027
23,-0.19027
24,-0.19027
25,-0.19027
26,-0.19027
27,-0.19027
28,-0.19027
29,-0.19027
30,-0.19027
31,-0.19027
32,-0.19027
33,-0.19027
34,-0.19027
35,-0.19027
36,-0.19027
37,-0.19027
38,-0.19027
39,-0.19027
40,-0.19027
41,-0.19027
42,-0.19027
43,-0.19027
44,-0.19027
45,-0.19027
46,-0.19027
47,-0.19027
48,-0.19027
49,-0.19027
50,-0.19027
51,-0.19027
52,-0.19027
53,-0.19027
54,-0.19027
55,-0.19027
56,-0.19027
57,-0.19027
58,-0.19027
59,-0.19027
60,-0.19027
61,-0.19027
62,-0.19027
63,-0.19027
64,-0.19027
65,-0.19027
66,-0.19027
67,-0.19027
68,-0.19027
69,-0.19027
70,-0.19027
71,-0.19027
72,-0.19027
73,-0.19027
74,-0.19027
75,-0.19027
76,-0.19027
77,-0.19027
78,-0.19027
79,-0.19027
80,-0.19027
81,-0.19027
82,-0.19027
83,-0.19027
84,0.14799
85,6.8335
86,0.32706
87,0.16789
88,0.14799
89,5.5402
90,3.7693
91,-0.19027
92,-0.19027
93,-0.19027
94,-0.19027
95,-0.19027
