time,value
0,0.44469
1,-0.92945
2,-0.92945
3,-0.92945
4,-0.92945
5,-0.92945
6,-0.013359999999999999
7,1.3608
8,1.1776
9,0.9027299999999999
10,-0.92945
11,-0.92945
12,-0.92945
13,-0.92945
14,-0.92945
15,-0.92945
16,0.71951
17,1.2692
18,1.2692
19,0.5363
20,-0.92945
21,-0.92945
22,-0.92945
23,-0.92945
24,-0.92945
25,-0.7462300000000001
26,1.3608
27,1.1776
28,1.2692
29,0.16985999999999998
30,-0.92945
31,-0.92945
32,-0.92945
33,0.44469
34,1.4524
35,1.1776
36,1.1776
37,-0.10497000000000001
38,-0.92945
39,-0.92945
40,-0.013359999999999999
41,1.2692
42,1.1776
43,0.07825
44,-0.92945
45,-0.92945
46,-0.92945
47,0.71951
48,1.2692
49,1.2692
50,-0.56302
51,-0.92945
52,-0.92945
53,-0.92945
54,-0.65462
55,1.3608
56,1.1776
57,1.2692
58,-0.92945
59,-0.92945
60,-0.92945
61,-0.92945
62,-0.92945
63,0.99434
64,1.2692
65,1.2692
66,0.26147
67,-0.92945
68,-0.92945
69,-0.92945
70,0.35308
71,1.3608
72,1.2692
73,1.2692
74,1.1776
75,-0.7462300000000001
76,-0.92945
77,-0.92945
78,-0.013359999999999999
79,1.3608
80,1.3608
81,1.2692
82,-0.3798
83,-0.92945
84,-0.92945
85,-0.92945
86,1.1776
87,1.4524
88,1.2692
89,1.1776
90,1.2692
91,-0.92945
92,-0.92945
93,-0.92945
94,-0.92945
95,-0.92945
