time,value
0,-0.69826
1,-0.69826
2,-0.69826
3,-0.69826
4,-0.69826
5,-0.69826
6,-0.69826
7,1.6601
8,1.4787
9,1.5694
10,1.4787
11,1.4787
12,1.4787
13,1.4787
14,1.3880000000000001
15,1.3880000000000001
16,1.3880000000000001
17,-0.42613
18,-0.69826
19,-0.69826
20,-0.69826
21,-0.69826
22,-0.69826
23,-0.69826
24,-0.69826
25,-0.69826
26,-0.69826
27,-0.69826
28,-0.69826
29,-0.69826
30,-0.69826
31,-0.69826
32,-0.69826
33,-0.69826
34,-0.69826
35,-0.69826
36,-0.69826
37,-0.69826
38,-0.69826
39,-0.69826
40,-0.69826
41,-0.69826
42,-0.69826
43,-0.69826
44,1.0252
45,1.5694
46,1.5694
47,1.4787
48,1.4787
49,1.3880000000000001
50,1.4787
51,1.3880000000000001
52,1.3880000000000001
53,1.3880000000000001
54,1.0252
55,-0.69826
56,-0.69826
57,-0.69826
58,-0.69826
59,-0.69826
60,-0.69826
61,-0.69826
62,-0.69826
63,-0.69826
64,-0.69826
65,-0.69826
66,-0.69826
67,-0.69826
68,-0.69826
69,-0.69826
70,-0.69826
71,-0.69826
72,-0.69826
73,-0.69826
74,-0.69826
75,-0.69826
76,-0.69826
77,-0.69826
78,-0.69826
79,-0.69826
80,0.027401
81,1.5694
82,1.5694
83,1.4787
84,1.3880000000000001
85,1.4787
86,1.3880000000000001
87,1.4787
88,1.3880000000000001
89,1.3880000000000001
90,1.2973
91,-0.69826
92,-0.69826
93,-0.69826
94,-0.69826
95,-0.69826
