time,value
0,-0.15916
1,-0.15916
2,-0.15916
3,-0.15916
4,-0.15916
5,-0.15916
6,-0.15916
7,-0.15916
8,-0.15916
9,-0.15916
10,-0.15916
11,-0.15916
12,-0.15916
13,-0.15916
14,-0.15916
15,-0.15916
16,-0.15916
17,-0.15916
18,-0.15916
19,-0.15916
20,-0.15916
21,-0.15916
22,-0.15916
23,-0.15916
24,-0.15916
25,-0.15916
26,-0.15916
27,-0.15916
28,-0.15916
29,-0.15916
30,-0.15916
31,-0.15916
32,-0.15916
33,-0.15916
34,6.5682
35,-0.15916
36,-0.15916
37,-0.15916
38,-0.15916
39,-0.15916
40,-0.15916
41,1.3231
42,-0.15916
43,-0.15916
44,-0.15916
45,-0.15916
46,-0.15916
47,-0.15916
48,-0.15916
49,-0.15916
50,-0.15916
51,-0.15916
52,6.9103
53,-0.15916
54,-0.15916
55,-0.15916
56,-0.15916
57,-0.15916
58,-0.15916
59,-0.15916
60,-0.15916
61,-0.15916
62,-0.15916
63,-0.15916
64,-0.15916
65,-0.15916
66,-0.15916
67,-0.15916
68,-0.15916
69,-0.15916
70,-0.15916
71,-0.15916
72,-0.15916
73,-0.15916
74,-0.15916
75,-0.15916
76,-0.15916
77,-0.15916
78,-0.15916
79,-0.15916
80,-0.15916
81,-0.15916
82,-0.15916
83,-0.15916
84,-0.15916
85,-0.15916
86,-0.15916
87,-0.15916
88,-0.15916
89,-0.15916
90,-0.15916
91,-0.15916
92,-0.15916
93,-0.15916
94,-0.15916
95,-0.15916
