time,value
0,-0.33659
1,-0.33659
2,-0.33659
3,-0.33659
4,-0.33659
5,-0.33659
6,-0.33659
7,-0.33659
8,-0.33659
9,-0.33659
10,-0.33659
11,-0.33659
12,-0.33659
13,-0.33659
14,-0.33659
15,-0.33659
16,-0.33659
17,-0.33659
18,-0.33659
19,-0.33659
20,-0.33659
21,-0.33659
22,-0.33659
23,-0.33659
24,-0.33659
25,-0.33659
26,-0.33659
27,-0.33659
28,-0.33659
29,-0.33659
30,-0.33659
31,-0.33659
32,-0.33659
33,-0.33659
34,-0.33659
35,-0.33659
36,-0.33659
37,-0.33659
38,-0.33659
39,-0.33659
40,-0.33659
41,-0.33659
42,-0.33659
43,-0.33659
44,-0.33659
45,-0.33659
46,-0.33659
47,-0.33659
48,-0.33659
49,-0.33659
50,-0.33659
51,-0.33659
52,-0.33659
53,-0.33659
54,-0.33659
55,-0.33659
56,-0.33659
57,-0.33659
58,-0.33659
59,-0.33659
60,-0.33659
61,-0.33659
62,-0.33659
63,-0.33659
64,-0.33659
65,-0.33659
66,-0.33659
67,-0.33659
68,-0.33659
69,-0.33659
70,2.5485
71,2.5485
72,3.1255
73,3.7025
74,2.5485
75,3.1255
76,2.5485
77,3.1255
78,2.5485
79,3.1255
80,-0.33659
81,-0.33659
82,-0.33659
83,-0.33659
84,-0.33659
85,-0.33659
86,-0.33659
87,-0.33659
88,-0.33659
89,-0.33659
90,-0.33659
91,-0.33659
92,-0.33659
93,-0.33659
94,-0.33659
95,-0.33659
