time,value
0,-0.9253600000000001
1,-0.62538
2,-0.11510999999999999
3,0.34542
4,0.58962
5,0.6654899999999999
6,0.60453
7,0.45346000000000003
8,0.26921999999999996
9,0.041514999999999996
10,-0.17634
11,-0.32936
12,-0.4141
13,-0.44351
14,-0.4533
15,-0.45811999999999997
16,-0.44596
17,-0.35338
18,-0.16541
19,0.026319
20,0.14866
21,0.1991
22,0.2073
23,0.17222
24,0.11369000000000001
25,0.055480999999999996
26,0.0031191999999999995
27,-0.027569
28,-0.053233
29,-0.11370999999999999
30,-0.1989
31,-0.28485
32,-0.36386
33,-0.42091000000000006
34,-0.45932
35,-0.48573
36,-0.49025
37,-0.47707
38,-0.42541999999999996
39,-0.31988
40,-0.15616
41,0.014547
42,0.098302
43,0.075675
44,-0.065621
45,-0.28863
46,-0.49325
47,-0.6399699999999999
48,-0.73898
49,-0.79776
50,-0.81955
51,-0.82616
52,-0.8268700000000001
53,-0.81388
54,-0.79832
55,-0.77383
56,-0.74541
57,-0.72301
58,-0.7127600000000001
59,-0.71663
60,-0.72135
61,-0.71182
62,-0.6615
63,-0.54359
64,-0.37601999999999997
65,-0.15005
66,0.13125
67,0.34901
68,0.47111000000000003
69,0.53362
70,0.51688
71,0.45383
72,0.38932
73,0.28286
74,0.13369
75,0.023199
76,0.0044807
77,0.090237
78,0.21422
79,0.24109
80,0.15215
81,0.030186
82,-0.10519
83,-0.26577
84,-0.4274
85,-0.54942
86,-0.6244
87,-0.68515
88,-0.7354
89,-0.7659199999999999
90,-0.78777
91,-0.80166
92,-0.80748
93,-0.81435
94,-0.8232299999999999
95,-0.8324600000000001
96,-0.8360799999999999
97,-0.81942
98,-0.7749699999999999
99,-0.7046
100,-0.61824
101,-0.53614
102,-0.45461999999999997
103,-0.35508
104,-0.19117
105,0.040757999999999996
106,0.2498
107,0.38535
108,0.45532
109,0.46635
110,0.42413
111,0.31739
112,0.14631
113,-0.059160000000000004
114,-0.25384
115,-0.42083000000000004
116,-0.53718
117,-0.60017
118,-0.63912
119,-0.65495
120,-0.67501
121,-0.6944
122,-0.70203
123,-0.7052
124,-0.7086399999999999
125,-0.71445
126,-0.72454
127,-0.71153
128,-0.6133
129,-0.39851
130,-0.14775
131,0.0022874
132,0.04573
133,0.04663
134,0.021134
135,-0.028185
136,-0.11993
137,-0.23606999999999997
138,-0.34319
139,-0.43858
140,-0.4984
141,-0.54187
142,-0.5971
143,-0.6530100000000001
144,-0.70353
145,-0.735
146,-0.75655
147,-0.77378
148,-0.77582
149,-0.7648199999999999
150,-0.74655
151,-0.73885
152,-0.73768
153,-0.73837
154,-0.74816
155,-0.7602300000000001
156,-0.76559
157,-0.74295
158,-0.66314
159,-0.5256
160,-0.34164
161,0.032087
162,0.72551
163,1.4192
164,1.8055
165,2.0555
166,2.2769
167,2.4038
168,2.427
169,2.2942
170,2.0019
171,1.6526
172,1.3512
173,1.1887
174,1.1791
175,1.2254
176,1.2147
177,1.0997
178,0.90569
179,0.65791
180,0.35799000000000003
181,0.059142999999999994
182,-0.16234
183,-0.30319
184,-0.39742
185,-0.46588999999999997
186,-0.53063
187,-0.58355
188,-0.61359
189,-0.62641
190,-0.6472100000000001
191,-0.68021
192,-0.7137399999999999
193,-0.75549
194,-0.79885
195,-0.83131
196,-0.8463299999999999
197,-0.8521799999999999
198,-0.8448200000000001
199,-0.8183600000000001
200,-0.6902699999999999
201,-0.44251
202,-0.22296999999999997
203,-0.090211
204,0.013006
205,0.13217
206,0.29358
207,0.46578
208,0.58525
209,0.6278699999999999
210,0.61001
211,0.56143
212,0.50574
213,0.44254
214,0.37704
215,0.34384000000000003
216,0.3475
217,0.37054000000000004
218,0.40823000000000004
219,0.46148999999999996
220,0.57915
221,0.71268
222,0.7054199999999999
223,0.5946600000000001
224,0.52572
225,0.56043
226,0.75872
227,1.1754
228,1.7997
229,2.5388
230,3.2453
231,3.7167
232,3.9587
233,4.0789
234,4.1025
235,4.0384
236,3.9001
237,3.6255
238,3.0705
239,2.2843
240,1.4533
241,0.7663399999999999
242,0.26848
243,-0.07619
244,-0.29859
245,-0.45653999999999995
246,-0.5702
247,-0.6321100000000001
248,-0.6374
249,-0.5887
250,-0.53313
251,-0.51261
252,-0.50751
253,-0.52371
254,-0.54913
255,-0.56501
256,-0.58695
257,-0.6200899999999999
258,-0.6671
259,-0.72016
260,-0.78222
261,-0.8503299999999999
262,-0.9007
263,-0.9268299999999999
264,-0.9401700000000001
265,-0.93814
266,-0.94096
267,-0.95106
268,-0.9718200000000001
269,-0.9981700000000001
