time,value
0,0.57434
1,-1.723
2,0.57434
3,0.57434
4,0.57434
5,-1.723
6,0.57434
7,0.57434
8,0.57434
9,-1.723
10,0.57434
11,0.57434
12,0.57434
13,-1.723
14,0.57434
15,0.57434
16,0.57434
17,-1.723
18,0.57434
19,0.57434
20,0.57434
21,-1.723
22,0.57434
23,0.57434
24,0.57434
25,-1.723
26,0.57434
27,0.57434
28,0.57434
29,0.57434
30,-1.723
31,0.57434
32,0.57434
33,0.57434
34,-1.723
35,0.57434
36,0.57434
37,0.57434
38,-1.723
39,0.57434
40,0.57434
41,0.57434
42,-1.723
43,0.57434
44,0.57434
45,0.57434
46,-1.723
47,0.57434
48,0.57434
49,0.57434
50,-1.723
51,0.57434
52,0.57434
53,0.57434
54,-1.723
55,0.57434
56,0.57434
57,0.57434
58,-1.723
59,0.57434
60,0.57434
61,0.57434
62,-1.723
63,0.57434
64,0.57434
65,0.57434
66,0.57434
67,-1.723
68,0.57434
69,0.57434
70,0.57434
71,-1.723
72,0.57434
73,0.57434
74,0.57434
75,-1.723
76,0.57434
77,0.57434
78,0.57434
79,-1.723
80,0.57434
81,0.57434
82,0.57434
83,-1.723
84,0.57434
85,0.57434
86,0.57434
87,-1.723
88,0.57434
89,0.57434
90,0.57434
91,-1.723
92,0.57434
93,0.57434
94,0.57434
95,-1.723
