time,value
0,1.5456
1,1.4604
2,1.3762
3,1.2918
4,1.2075
5,1.1233
6,1.0389
7,0.9547899999999999
8,0.87084
9,0.7871
10,0.7043
11,0.6206
12,0.5387
13,0.45641000000000004
14,0.37451999999999996
15,0.29456
16,0.21577
17,0.13524
18,0.057525
19,-0.022688
20,-0.09926
21,-0.17774
22,-0.25575
23,-0.33292
24,-0.40773000000000004
25,-0.48412
26,-0.55785
27,-0.63003
28,-0.70043
29,-0.77504
30,-0.8415
31,-0.91238
32,-0.9809399999999999
33,-1.0381
34,-1.0997
35,-1.157
36,-1.1983
37,-1.2432
38,-1.2803
39,-1.3083
40,-1.3262
41,-1.3330000000000002
42,-1.3297
43,-1.3157
44,-1.291
45,-1.2632
46,-1.2254
47,-1.1756
48,-1.1255
49,-1.0686
50,-1.012
51,-0.9438700000000001
52,-0.88005
53,-0.80718
54,-0.73855
55,-0.6622899999999999
56,-0.59007
57,-0.51969
58,-0.44148999999999994
59,-0.36504000000000003
60,-0.29065
61,-0.21003000000000002
62,-0.13421
63,-0.056824
64,0.022668
65,0.10142999999999999
66,0.18303
67,0.26252
68,0.34336
69,0.42476
70,0.50745
71,0.5897899999999999
72,0.67356
73,0.75635
74,0.83898
75,0.9230799999999999
76,1.0091
77,1.0932
78,1.1779
79,1.2626
80,1.3472
81,1.4315
82,1.5163
83,1.6017
84,1.663
85,1.6919
86,1.6976
87,1.6525
88,1.5735
89,1.4911
90,1.4062
91,1.3197
92,1.2331
93,1.1449
94,1.0576
95,0.97185
96,0.88531
97,0.7995399999999999
98,0.71553
99,0.63071
100,0.5478
101,0.46298
102,0.38063
103,0.29621
104,0.21188
105,0.13004000000000002
106,0.046028
107,-0.037877
108,-0.12155
109,-0.20506999999999997
110,-0.28839000000000004
111,-0.37342
112,-0.45755
113,-0.5402
114,-0.62248
115,-0.70433
116,-0.78564
117,-0.8663
118,-0.95088
119,-1.0308
120,-1.111
121,-1.1906
122,-1.2656
123,-1.3379
124,-1.4065
125,-1.4699
126,-1.5257
127,-1.5711
128,-1.6018
129,-1.6142
130,-1.6067
131,-1.58
132,-1.5273
133,-1.4844
134,-1.4226
135,-1.3476
136,-1.2769
137,-1.2052
138,-1.1214
139,-1.0442
140,-0.9655799999999999
141,-0.88594
142,-0.8054600000000001
143,-0.72429
144,-0.63968
145,-0.55728
146,-0.47448
147,-0.39177
148,-0.30876
149,-0.2255
150,-0.13964000000000001
151,-0.055664
152,0.028054000000000003
153,0.11192
154,0.19593
155,0.28006
156,0.36429
157,0.45082
158,0.53517
159,0.61959
160,0.70614
161,0.79065
162,0.8752200000000001
163,0.95986
164,1.0458
165,1.133
166,1.2177
167,1.3042
168,1.3888
169,1.4713
170,1.5536
171,1.6325
172,1.6865
173,1.7058
174,1.6742
175,1.6165
