time,value
0,-0.21916999999999998
1,-0.23221
2,-0.23221
3,-0.21134
4,-0.24264000000000002
5,-0.22177
6,-0.22177
7,-0.24003000000000002
8,-0.20873000000000003
9,-0.23742
10,-0.22177
11,-0.21916999999999998
12,-0.24003000000000002
13,-0.20090999999999998
14,-0.23221
15,-0.2296
16,-0.21656
17,-0.23481999999999997
18,-0.21395
19,-0.22699
20,-0.23221
21,-0.19047999999999998
22,-0.23742
23,-0.21916999999999998
24,-0.21656
25,-0.23742
26,-0.20873000000000003
27,-0.23481999999999997
28,-0.21916999999999998
29,-0.19308
30,-0.23742
31,-0.20613
32,-0.21656
33,-0.22699
34,-0.19569
35,-0.21134
36,-0.20613
37,3.6148
38,5.5448
39,5.5683
40,3.9356
41,0.7302
42,-0.17222
43,-0.18265
44,-0.22177
45,-0.18525999999999998
46,-0.20352
47,-0.21395
48,-0.18525999999999998
49,-0.21916999999999998
50,-0.1983
51,-0.19047999999999998
52,-0.22177
53,-0.18525999999999998
54,-0.20090999999999998
55,-0.22438000000000002
56,-0.18525999999999998
57,-0.19047999999999998
58,-0.20873000000000003
59,-0.18525999999999998
60,-0.21916999999999998
61,-0.1983
62,-0.20613
63,-0.22438000000000002
64,-0.17482999999999999
65,-0.18525999999999998
66,-0.21395
67,-0.20873000000000003
68,-0.18787
69,-0.22699
70,-0.20613
71,-0.1983
72,-0.22699
73,-0.20090999999999998
74,-0.21656
75,-0.22177
76,-0.1983
77,-0.22438000000000002
78,-0.21656
79,-0.18525999999999998
80,-0.2296
81,-0.21395
82,-0.19569
83,-0.2296
84,-0.21656
85,-0.21656
86,-0.23221
87,-0.20613
88,-0.22699
89,-0.22438000000000002
90,-0.1983
91,-0.23481999999999997
92,-0.21916999999999998
93,-0.20613
94,-0.23221
95,-0.20352
