time,value
0,-0.8396399999999999
1,0.57938
2,0.08905
3,-0.9786600000000001
4,-1.4167
5,-1.0067
6,-0.39837
7,-0.23601
8,-0.52574
9,-0.8377899999999999
10,-0.83685
11,-0.59034
12,-0.41806000000000004
13,-0.46212
14,-0.6066199999999999
15,-0.6772100000000001
16,-0.61011
17,-0.50841
18,-0.48362
19,-0.52031
20,-0.5577300000000001
21,-0.5524
22,-0.51239
23,-0.49511000000000005
24,-0.5000399999999999
25,-0.50608
26,-0.5133
27,-0.5109899999999999
28,-0.51472
29,-0.52422
30,-0.52366
31,-0.53685
32,-0.54923
33,-0.55405
34,-0.58096
35,-0.59915
36,-0.61533
37,-0.64464
38,-0.66406
39,-0.69088
40,-0.72585
41,-0.7528699999999999
42,-0.7944100000000001
43,-0.8337
44,-0.86246
45,-0.9106
46,-0.94821
47,-0.9828399999999999
48,-1.0296
49,-1.0632
50,-1.0987
51,-1.1359
52,-1.1587
53,-1.1914
54,-1.2189
55,-1.2337
56,-1.2654
57,-1.2836
58,-1.2952
59,-1.3159999999999998
60,-1.3218
61,-1.3282
62,-1.3356
63,-1.3281
64,-1.3294
65,-1.325
66,-1.3076
67,-1.307
68,-1.2939
69,-1.2757
70,-1.2689
71,-1.2501
72,-1.2356
73,-1.2263
74,-1.2066
75,-1.1994
76,-1.1907
77,-1.173
78,-1.1752
79,-1.1691
80,-1.1615
81,-1.1683
82,-1.1668
83,-1.1725
84,-1.1863
85,-1.1924
86,-1.2121
87,-1.2311
88,-1.2411
89,-1.27
90,-1.2898
91,-1.3062
92,-1.3348
93,-1.3519999999999999
94,-1.3722
95,-1.3965
96,-1.4092
97,-1.4323
98,-1.4523
99,-1.4607
100,-1.4858
101,-1.4991
102,-1.5069
103,-1.5256
104,-1.5323
105,-1.5418
106,-1.555
107,-1.5549
108,-1.5634
109,-1.5667
110,-1.5575
111,-1.565
112,-1.5613
113,-1.5528
114,-1.5558
115,-1.5469
116,-1.5409
117,-1.5391
118,-1.5249
119,-1.5203
120,-1.5123
121,-1.4931
122,-1.4917
123,-1.4805
124,-1.4651
125,-1.4623
126,-1.4493
127,-1.4412
128,-1.44
129,-1.4288
130,-1.4286
131,-1.4263
132,-1.4131
133,-1.4180000000000001
134,-1.4140000000000001
135,-1.4064
136,-1.4124
137,-1.4082
138,-1.4076
139,-1.4122
140,-1.4045
141,-1.4059
142,-1.4039
143,-1.39
144,-1.3934
145,-1.3865
146,-1.3737
147,-1.3718
148,-1.3564
149,-1.3423
150,-1.3328
151,-1.3119
152,-1.3018
153,-1.2895
154,-1.2653
155,-1.2577
156,-1.2393
157,-1.2151
158,-1.2037
159,-1.1807
160,-1.1607
161,-1.1469
162,-1.1226
163,-1.1105
164,-1.0979999999999999
165,-1.0748
166,-1.0709
167,-1.0587
168,-1.0426
169,-1.0407
170,-1.0266
171,-1.0151
172,-1.0118
173,-1.0006
174,-1.0031
175,-1.003
176,-0.9855799999999999
177,-0.9802299999999999
178,-0.96093
179,-0.9335700000000001
180,-0.9151
181,-0.87495
182,-0.8260700000000001
183,-0.77846
184,-0.72437
185,-0.69355
186,-0.6705399999999999
187,-0.6344
188,-0.60621
189,-0.5565
190,-0.49637
191,-0.45333999999999997
192,-0.40501
193,-0.36441999999999997
194,-0.33307
195,-0.2929
196,-0.26891
197,-0.24931999999999999
198,-0.22138000000000002
199,-0.21051999999999998
200,-0.18450999999999998
201,-0.14676
202,-0.11853
203,-0.077657
204,-0.042256
205,-0.018647999999999998
206,0.0098876
207,0.020328
208,0.025820999999999997
209,0.037327
210,0.025814
211,0.020557
212,0.017981
213,-0.0003301
214,-0.008010300000000001
215,-0.020061000000000002
216,-0.040313
217,-0.050749
218,-0.074048
219,-0.096496
220,-0.1079
221,-0.13862
222,-0.16037
223,-0.1785
224,-0.21197
225,-0.23348000000000002
226,-0.25704
227,-0.28475
228,-0.29805
229,-0.32051999999999997
230,-0.33907
231,-0.34402
232,-0.36522
233,-0.37353000000000003
234,-0.37525
235,-0.39161999999999997
236,-0.39752
237,-0.4079
238,-0.42331
239,-0.42391999999999996
240,-0.43511000000000005
241,-0.44851
242,-0.45919
243,-0.49718
244,-0.5276
245,-0.5479
246,-0.57362
247,-0.58034
248,-0.58863
249,-0.60532
250,-0.61182
251,-0.6290899999999999
252,-0.64313
253,-0.64572
254,-0.66915
255,-0.68538
256,-0.69714
257,-0.7216899999999999
258,-0.73156
259,-0.7424
260,-0.7590100000000001
261,-0.7633300000000001
262,-0.77784
263,-0.7893100000000001
264,-0.7875
265,-0.80262
266,-0.80681
267,-0.80442
268,-0.8154
269,-0.81302
270,-0.81181
271,-0.81566
272,-0.80572
273,-0.8048
274,-0.80085
275,-0.78375
276,-0.78381
277,-0.77371
278,-0.7575
279,-0.7552300000000001
280,-0.74006
281,-0.72633
282,-0.7189399999999999
283,-0.69995
284,-0.69225
285,-0.68376
286,-0.66342
287,-0.66057
288,-0.6482600000000001
289,-0.63049
290,-0.62708
291,-0.61059
292,-0.5938399999999999
293,-0.58106
294,-0.55489
295,-0.53945
296,-0.52499
297,-0.5019899999999999
298,-0.49968
299,-0.49091
300,-0.47881
301,-0.4831
302,-0.47723999999999994
303,-0.4747
304,-0.47968999999999995
305,-0.47378000000000003
306,-0.47918999999999995
307,-0.48461000000000004
308,-0.47976
309,-0.49356000000000005
310,-0.4994
311,-0.5012
312,-0.51974
313,-0.52917
314,-0.54309
315,-0.56477
316,-0.57413
317,-0.59206
318,-0.6067899999999999
319,-0.60851
320,-0.6270600000000001
321,-0.6362399999999999
322,-0.6400100000000001
323,-0.65915
324,-0.66774
325,-0.68011
326,-0.7004199999999999
327,-0.70898
328,-0.72682
329,-0.74169
330,-0.74311
331,-0.76062
332,-0.76779
333,-0.7684300000000001
334,-0.7833
335,-0.78605
336,-0.79081
337,-0.80209
338,-0.80086
339,-0.80894
340,-0.81496
341,-0.80866
342,-0.81903
343,-0.8195399999999999
344,-0.81345
345,-0.82132
346,-0.81708
347,-0.81465
348,-0.8185899999999999
349,-0.81023
350,-0.81134
351,-0.81147
352,-0.8011199999999999
353,-0.80903
354,-0.80913
355,-0.80416
356,-0.81403
357,-0.81298
358,-0.81489
359,-0.82449
360,-0.82316
361,-0.83155
362,-0.8386
363,-0.8346
364,-0.84855
365,-0.85625
366,-0.8616299999999999
367,-0.8850299999999999
368,-0.9001
369,-0.9193399999999999
370,-0.9467
371,-0.96298
372,-0.98836
373,-1.0113
374,-1.0212
375,-1.0466
376,-1.0638
377,-1.0768
378,-1.1066
379,-1.126
380,-1.1474
381,-1.1758
382,-1.1925
383,-1.2182
384,-1.2407
385,-1.2469
386,-1.2646
387,-1.2697
388,-1.2671
389,-1.2795
390,-1.2799
391,-1.2799
392,-1.2845
393,-1.2745
394,-1.2721
395,-1.2672
396,-1.2477
397,-1.2416
398,-1.2242
399,-1.1985
400,-1.1873
401,-1.1634
402,-1.1386
403,-1.1186
404,-1.0841
405,-1.0574
406,-1.0298
407,-0.98945
408,-0.9646
409,-0.92971
410,-0.8863
411,-0.85739
412,-0.81718
413,-0.77917
414,-0.7509899999999999
415,-0.71334
416,-0.68721
417,-0.6632600000000001
418,-0.62907
419,-0.61248
420,-0.5883
421,-0.5573
422,-0.54184
423,-0.5152899999999999
424,-0.49022
425,-0.47368999999999994
426,-0.44597
427,-0.42798
428,-0.41092
429,-0.38315
430,-0.37312
431,-0.35605
432,-0.33296
433,-0.32635
434,-0.30958
435,-0.29565
436,-0.29149
437,-0.27703
438,-0.2728
439,-0.26913000000000004
440,-0.25437
441,-0.25761
442,-0.25451
443,-0.24677
444,-0.2565
445,-0.25568
446,-0.25664000000000003
447,-0.26576
448,-0.26338
449,-0.27111
450,-0.27959
451,-0.27741
452,-0.29348
453,-0.30283000000000004
454,-0.30712
455,-0.32842
456,-0.33828
457,-0.3488
458,-0.3657
459,-0.36929
460,-0.38227
461,-0.39633
462,-0.40046
463,-0.42228999999999994
464,-0.43476000000000004
465,-0.43938999999999995
466,-0.46115
467,-0.47547
468,-0.4965
469,-0.52747
470,-0.5429999999999999
471,-0.56139
472,-0.57426
473,-0.57389
474,-0.59114
475,-0.5993
476,-0.5977600000000001
477,-0.61088
478,-0.61617
479,-0.6319600000000001
480,-0.6644800000000001
481,-0.68681
482,-0.71267
483,-0.72953
484,-0.7282
485,-0.74182
486,-0.74702
487,-0.74354
488,-0.7532
489,-0.7490100000000001
490,-0.7469
491,-0.75584
492,-0.7542399999999999
493,-0.76062
494,-0.76412
495,-0.75307
496,-0.75788
497,-0.75464
498,-0.74362
499,-0.74741
500,-0.73739
501,-0.72651
502,-0.7229399999999999
503,-0.70633
504,-0.69802
505,-0.6897300000000001
506,-0.6693399999999999
507,-0.66545
508,-0.65293
509,-0.63163
510,-0.6258100000000001
511,-0.6080300000000001
512,-0.59106
513,-0.58249
514,-0.5606899999999999
515,-0.54667
516,-0.53345
517,-0.50953
518,-0.50325
519,-0.48825
520,-0.46258
521,-0.4509
522,-0.42763
523,-0.40792
524,-0.40068000000000004
525,-0.3825
526,-0.37143000000000004
527,-0.35857
528,-0.33248
529,-0.32415
530,-0.31001
531,-0.28873000000000004
532,-0.28371
533,-0.2661
534,-0.24903000000000003
535,-0.24199
536,-0.22341
537,-0.21366
538,-0.20449
539,-0.18303
540,-0.17895
541,-0.16792
542,-0.14906
543,-0.14715
544,-0.13308
545,-0.11937
546,-0.11495999999999999
547,-0.097585
548,-0.088041
549,-0.078351
550,-0.055449
551,-0.049268
552,-0.035449
553,-0.013373
554,-0.0085773
555,0.0084381
556,0.025077000000000002
557,0.032113
558,0.051789999999999996
559,0.062854
560,0.073249
561,0.09640599999999999
562,0.1023
563,0.11548
564,0.13663
565,0.1399
566,0.15553
567,0.17109000000000002
568,0.177
569,0.19544
570,0.20435999999999999
571,0.21133000000000002
572,0.23029000000000002
573,0.23129
574,0.23961999999999997
575,0.25664000000000003
576,0.25597
577,0.26837
578,0.28099
579,0.28331
580,0.29784
581,0.30236999999999997
582,0.3048
583,0.32011999999999996
584,0.31795
585,0.32365
586,0.3389
587,0.33701
588,0.35048
589,0.36743000000000003
590,0.37708
591,0.40174
592,0.41761000000000004
593,0.43138000000000004
594,0.45832
595,0.46835
596,0.48786
597,0.51882
598,0.5329999999999999
599,0.56207
600,0.59338
601,0.61637
602,0.65504
603,0.6865399999999999
604,0.71746
605,0.7621100000000001
606,0.78883
607,0.8228700000000001
608,0.8654799999999999
609,0.88728
610,0.91907
611,0.9474299999999999
612,0.96206
613,0.98885
614,1.0075
615,1.0265
616,1.0607
617,1.0775
618,1.1007
619,1.1311
620,1.1399
621,1.1595
622,1.1771
623,1.1817
624,1.1973
625,1.2016
626,1.2024
627,1.2153
628,1.2097
629,1.2109
630,1.2205
631,1.2096
632,1.2109
633,1.2117
634,1.2019
635,1.2055
636,1.1997
637,1.1921
638,1.1971
639,1.1836
640,1.1775
641,1.1805
642,1.1647
643,1.163
644,1.1616
645,1.1492
646,1.1484
647,1.1359
648,1.12
649,1.1161
650,1.0938
651,1.0793
652,1.0732
653,1.0475
654,1.0347
655,1.0217
656,0.9983299999999999
657,0.9875200000000001
658,0.96547
659,0.9395100000000001
660,0.92381
661,0.88855
662,0.86005
663,0.83955
664,0.79877
665,0.76961
666,0.73887
667,0.69776
668,0.6713899999999999
669,0.63823
670,0.60598
671,0.58759
672,0.55186
673,0.52367
674,0.5040399999999999
675,0.46452
676,0.43617
677,0.40476
678,0.36055
679,0.32903000000000004
680,0.29036
681,0.25374
682,0.23348000000000002
683,0.19865
684,0.17340999999999998
685,0.15897
686,0.12709
687,0.10979000000000001
688,0.093709
689,0.06793300000000001
690,0.056388
691,0.037382
692,0.018261000000000003
693,0.013746000000000001
694,-0.0061519
695,-0.016836
696,-0.016131
697,-0.032938
698,-0.035494
699,-0.036384
700,-0.046471
701,-0.040836000000000004
702,-0.040457
703,-0.039102
704,-0.022516
705,-0.021425
706,-0.012227
707,0.0082571
708,0.011597
709,0.030075
710,0.051654
711,0.06410199999999999
712,0.091438
713,0.11245
714,0.13268
715,0.16724
716,0.18603
717,0.21199
718,0.24838000000000002
719,0.26581
720,0.29614
721,0.32768
722,0.34763
723,0.38019000000000003
724,0.40425
725,0.4249
726,0.45798999999999995
727,0.4738
728,0.49546
729,0.5270699999999999
730,0.53885
731,0.56318
732,0.5888399999999999
733,0.6028100000000001
734,0.63005
735,0.6496
736,0.66627
737,0.69634
738,0.7096600000000001
739,0.7294
740,0.7600399999999999
741,0.77113
742,0.7957
743,0.8225600000000001
744,0.83825
745,0.86831
746,0.8913399999999999
747,0.9119200000000001
748,0.9467700000000001
749,0.96534
750,0.9913299999999999
751,1.0292
752,1.0469
753,1.077
754,1.1076
755,1.125
756,1.1564
757,1.1813
758,1.2048
759,1.2435
760,1.265
761,1.2922
762,1.3298
763,1.3457
764,1.3748
765,1.4054
766,1.423
767,1.454
768,1.4769999999999999
769,1.4972
770,1.5322
771,1.5496
772,1.5723
773,1.6047
774,1.615
775,1.6401
776,1.6691
777,1.6868
778,1.7179
779,1.7383
780,1.7526
781,1.7803
782,1.7911
783,1.8094
784,1.8391
785,1.845
786,1.8630000000000002
787,1.8821
788,1.8879
789,1.9076
790,1.9178
791,1.9231
792,1.942
793,1.9418
794,1.9463
795,1.9607
796,1.9529
797,1.9625
798,1.9783
799,1.982
800,1.9979
801,2.0034
802,2.0085
803,2.0363
804,2.0516
805,2.0699
806,2.0899
807,2.0821
808,2.0996
809,2.1432
810,2.1946
811,2.2627
812,2.303
813,2.3133
814,2.3221
815,2.3133
816,2.3207
817,2.3461
818,2.3464
819,2.3544
820,2.3606
821,2.3549
822,2.3672
823,2.3719
824,2.3706
825,2.3807
826,2.3708
827,2.3671
828,2.3747
829,2.3587
830,2.3559
831,2.354
832,2.3381
833,2.3359
834,2.3237
835,2.3064
836,2.3019
837,2.2783
838,2.2601
839,2.2522
840,2.2205
841,2.2025
842,2.1855
843,2.1547
844,2.1382
845,2.1127
846,2.0837
847,2.0689
848,2.0361
849,2.0098
850,1.9945
851,1.9561
852,1.9316
853,1.9083
854,1.8719999999999999
855,1.8503
856,1.8204
857,1.7877
858,1.7696
859,1.7344
860,1.7064
861,1.6898
862,1.6507
863,1.6258
864,1.6025
865,1.5672
866,1.5474
867,1.5206
868,1.4915
869,1.476
870,1.4423
871,1.4141
872,1.3957
873,1.3543
874,1.3264
875,1.3004
876,1.2633
877,1.2429
878,1.2173
879,1.1908
880,1.1785
881,1.1492
882,1.126
883,1.1135
884,1.0787
885,1.0558
886,1.0315
887,0.9918600000000001
888,0.9643200000000001
889,0.9294600000000001
890,0.8934799999999999
891,0.873
892,0.8376399999999999
893,0.80907
894,0.7914800000000001
895,0.7529899999999999
896,0.7283
897,0.70517
898,0.66889
899,0.64465
900,0.61182
901,0.57614
902,0.55575
903,0.52308
904,0.5000100000000001
905,0.4898
906,0.45852
907,0.43859
908,0.41861000000000004
909,0.38613000000000003
910,0.36846
911,0.34588
912,0.32136
913,0.309
914,0.27876
915,0.25174
916,0.23406999999999997
917,0.19576
918,0.17159000000000002
919,0.1515
920,0.12232
921,0.11019000000000001
922,0.095363
923,0.080238
924,0.078987
925,0.061848
926,0.048741
927,0.045482
928,0.021473
929,0.010245
930,0.0014445
931,-0.018866
932,-0.024787
933,-0.034957
934,-0.046281
935,-0.043347000000000004
936,-0.054684
937,-0.060889
938,-0.056057
939,-0.070687
940,-0.071589
941,-0.06892000000000001
942,-0.077642
943,-0.073385
944,-0.07532799999999999
945,-0.08063200000000001
946,-0.072778
947,-0.078775
948,-0.079555
949,-0.069513
950,-0.07979
951,-0.077752
952,-0.072818
953,-0.079759
954,-0.074286
955,-0.075535
956,-0.08126799999999999
957,-0.074759
958,-0.082566
959,-0.085842
960,-0.078683
961,-0.092553
962,-0.09475
963,-0.094202
964,-0.10580999999999999
965,-0.1047
966,-0.10937000000000001
967,-0.11738
968,-0.11110999999999999
969,-0.11703
970,-0.11688
971,-0.10497000000000001
972,-0.11391
973,-0.11104000000000001
974,-0.10505
975,-0.11119000000000001
976,-0.10419
977,-0.10273
978,-0.10500999999999999
979,-0.092789
980,-0.092111
981,-0.08389400000000001
982,-0.061297000000000004
983,-0.05781699999999999
984,-0.041027999999999995
985,-0.020115
986,-0.011170000000000001
987,0.011857
988,0.030519
989,0.045864999999999996
990,0.075633
991,0.092641
992,0.11527000000000001
993,0.15078
994,0.16522
995,0.19087
996,0.21794000000000002
997,0.22944
998,0.25245
999,0.27086
1000,0.28835
1001,0.32508000000000004
1002,0.35393
1003,0.39115
1004,0.44151999999999997
1005,0.46876999999999996
1006,0.5049600000000001
1007,0.541
1008,0.55984
1009,0.58775
1010,0.6068399999999999
1011,0.61902
1012,0.64444
1013,0.65746
1014,0.67655
1015,0.70875
1016,0.7189300000000001
1017,0.74
1018,0.76315
1019,0.77163
1020,0.7920699999999999
1021,0.8059999999999999
1022,0.81421
1023,0.83511
1024,0.8416
1025,0.852
1026,0.8738799999999999
1027,0.873
1028,0.88335
1029,0.8961100000000001
1030,0.8944700000000001
1031,0.9048799999999999
1032,0.9083200000000001
1033,0.9054
1034,0.9141799999999999
1035,0.90761
1036,0.90484
1037,0.91386
1038,0.90035
1039,0.8982899999999999
1040,0.8980799999999999
1041,0.8831200000000001
1042,0.8807200000000001
1043,0.87239
1044,0.8590899999999999
1045,0.85805
1046,0.8411700000000001
1047,0.82716
1048,0.8241700000000001
1049,0.79877
1050,0.78605
1051,0.77641
1052,0.7528
1053,0.7418
1054,0.72448
1055,0.70225
1056,0.69308
1057,0.66922
1058,0.64912
1059,0.64035
1060,0.6089
1061,0.59037
1062,0.57584
1063,0.54862
1064,0.5354
1065,0.52603
1066,0.51867
1067,0.49413
1068,0.43845
1069,0.40852
1070,0.4327
1071,0.46643
1072,0.45091000000000003
1073,0.34321999999999997
1074,0.23515999999999998
1075,0.27009
1076,0.42661000000000004
1077,0.52432
1078,0.39108000000000004
1079,0.10662
1080,0.020390000000000002
1081,0.31729
1082,0.71421
1083,0.70711
1084,0.12725
1085,-0.45416999999999996
1086,-0.20412
1087,0.9389
1088,1.8487
1089,0.9266
1090,-2.4655
1091,-7.1769
