time,value
0,-1.8822
1,-1.8806
2,-1.8658
3,-1.8366
4,-1.8033
5,-1.7507
6,-1.7091
7,-1.6627
8,-1.6274
9,-1.5565
10,-1.4765
11,-1.4054
12,-1.3294
13,-1.2453
14,-1.1585
15,-1.0621
16,-0.96747
17,-0.86775
18,-0.7680899999999999
19,-0.67201
20,-0.55913
21,-0.4471
22,-0.33153
23,-0.24783000000000002
24,-0.13733
25,-0.040935
26,0.075349
27,0.16913
28,0.21270999999999998
29,0.29464
30,0.40275
31,0.4745
32,0.54102
33,0.57097
34,0.6432899999999999
35,0.74269
36,0.80585
37,0.86462
38,0.87634
39,0.92243
40,0.93273
41,0.9670799999999999
42,0.99687
43,0.99575
44,1.0109
45,1.0415
46,1.0569
47,1.1041
48,1.1197
49,1.1036
50,1.0874
51,1.1031
52,1.0869
53,1.1027
54,1.1027
55,1.1186
56,1.1186
57,1.1345
58,1.1504
59,1.1504
60,1.1342
61,1.1502
62,1.1340000000000001
63,1.1340000000000001
64,1.1340000000000001
65,1.15
66,1.15
67,1.1499
68,1.1499
69,1.1176
70,1.1013
71,1.1013
72,1.1012
73,1.0688
74,1.0190000000000001
75,0.98459
76,0.9249799999999999
77,0.90044
78,0.8700600000000001
79,0.81512
80,0.72569
81,0.6832
82,0.63679
83,0.57017
84,0.49949
85,0.43732
86,0.34412
87,0.2786
88,0.24411
89,0.19463
90,0.14572000000000002
91,0.09715599999999999
92,0.050656
93,-0.025259
94,-0.06803
95,-0.10922
96,-0.14886
97,-0.18696
98,-0.22354000000000002
99,-0.26031
100,-0.32983
101,-0.37540999999999997
102,-0.4561
103,-0.53694
104,-0.6173
105,-0.69512
106,-0.75743
107,-0.83611
108,-0.8960899999999999
109,-0.99725
110,-1.0559
111,-1.1181
112,-1.1706
113,-1.205
114,-1.2204
115,-1.2153
116,-1.2296
117,-1.222
118,-1.19
119,-1.1586
120,-1.1433
121,-1.1116
122,-1.1052
123,-1.0821
124,-1.0849
125,-1.0575
126,-1.1038
127,-1.0828
128,-1.0789
129,-1.1011
130,-1.1399
131,-1.1568
132,-1.147
133,-1.16
134,-1.1709
135,-1.1798
136,-1.187
137,-1.1927
138,-1.1771
139,-1.1420000000000001
140,-1.1301
141,-1.0657
142,-1.001
143,-0.89812
144,-0.85146
145,-0.77367
146,-0.71281
147,-0.65235
148,-0.55695
149,-0.49833
150,-0.41989
151,-0.33509
152,-0.26682
153,-0.23096999999999998
154,-0.19498
155,-0.14003
156,-0.1011
157,-0.07821399999999999
158,-0.036336
159,-0.025308
160,0.019517
161,0.1301
162,0.17819000000000002
163,0.22749
164,0.2768
165,0.39004
166,0.41841000000000006
167,0.48022
168,0.55086
169,0.65298
170,0.71555
171,0.7677
172,0.82352
173,0.8756
174,0.9241799999999999
175,0.96946
176,1.0144
177,1.0511
178,1.1173
179,1.1497
180,1.1659
181,1.1659
182,1.166
183,1.2146
184,1.2146
185,1.2147
186,1.2471
187,1.1985
188,1.2147
189,1.2147
190,1.2147
191,1.1986
192,1.2309
193,1.2148
194,1.2309999999999999
195,1.1826
196,1.1826
197,1.1666
198,1.215
199,1.199
200,1.1348
201,1.1348
202,1.1189
203,1.1351
204,1.1031
205,1.1036
206,1.0879
207,1.0569
208,1.0099
209,0.97957
210,0.93473
211,0.8953
212,0.831
213,0.81904
214,0.7699199999999999
215,0.7420899999999999
216,0.67878
217,0.59482
218,0.53798
219,0.4609
220,0.39444
221,0.36999
222,0.2763
223,0.19318
224,0.12074000000000001
225,0.023936000000000002
226,-0.089216
227,-0.18561
228,-0.29611
229,-0.3797
230,-0.51139
231,-0.6073
232,-0.72018
233,-0.83221
234,-0.9156299999999999
235,-1.0153
236,-1.1098
237,-1.2222
238,-1.2961
239,-1.361
240,-1.4242
241,-1.4932
242,-1.5728
243,-1.6585
244,-1.7094
245,-1.7398
246,-1.7812
247,-1.834
248,-1.867
249,-1.8959
250,-1.8843
