time,value
0,-0.48945
1,-0.48945
2,-0.48945
3,-0.48945
4,-0.48945
5,-0.48945
6,-0.48945
7,-0.48945
8,-0.48945
9,-0.48945
10,-0.48945
11,-0.48945
12,-0.48945
13,-0.48945
14,-0.48945
15,-0.48945
16,-0.48945
17,-0.48945
18,-0.48945
19,-0.48945
20,-0.48945
21,-0.48945
22,-0.48945
23,-0.48945
24,-0.48945
25,-0.48945
26,-0.48945
27,-0.48945
28,-0.48945
29,-0.48945
30,-0.48945
31,-0.48945
32,-0.48945
33,-0.48945
34,-0.48945
35,-0.48945
36,-0.48945
37,-0.48945
38,-0.48945
39,-0.48945
40,-0.48945
41,-0.48945
42,-0.48945
43,-0.48945
44,-0.48945
45,-0.48945
46,-0.48945
47,-0.48945
48,-0.48945
49,-0.48945
50,-0.48945
51,-0.48945
52,-0.48945
53,-0.48945
54,-0.48945
55,-0.48945
56,-0.48945
57,-0.48945
58,-0.48945
59,-0.48945
60,-0.48945
61,-0.48945
62,-0.48945
63,-0.48945
64,-0.48945
65,-0.48945
66,2.097
67,2.097
68,1.6659
69,2.5281
70,1.2348
71,0.80377
72,1.6659
73,2.5281
74,1.2348
75,1.6659
76,1.6659
77,2.097
78,1.6659
79,2.097
80,2.5281
81,2.9591
82,2.5281
83,1.6659
84,2.097
85,0.3727
86,-0.48945
87,-0.48945
88,-0.48945
89,-0.48945
90,-0.48945
91,-0.48945
92,-0.48945
93,-0.48945
94,-0.48945
95,-0.48945
