time,value
0,-0.37967
1,-0.37967
2,-0.37967
3,-0.37967
4,-0.37967
5,-0.37967
6,-0.37967
7,-0.37967
8,-0.37967
9,-0.37967
10,-0.37967
11,-0.37967
12,-0.37967
13,-0.37967
14,-0.37967
15,-0.37967
16,-0.37967
17,-0.37967
18,-0.37967
19,-0.37967
20,-0.37967
21,-0.37967
22,-0.37967
23,-0.37967
24,-0.37967
25,-0.37967
26,-0.37967
27,-0.37967
28,-0.37967
29,-0.37967
30,-0.37967
31,2.6637
32,-0.37967
33,-0.37967
34,2.1982
35,0.19319
36,-0.37967
37,-0.37967
38,2.1266
39,-0.37967
40,-0.37967
41,-0.37967
42,-0.37967
43,-0.37967
44,-0.37967
45,-0.37967
46,-0.37967
47,2.1266
48,-0.37967
49,-0.37967
50,-0.37967
51,-0.37967
52,2.5921
53,-0.37967
54,-0.37967
55,-0.37967
56,-0.37967
57,2.5205
58,0.33641
59,-0.37967
60,-0.37967
61,-0.37967
62,-0.37967
63,-0.37967
64,-0.37967
65,-0.37967
66,-0.37967
67,-0.37967
68,-0.37967
69,-0.37967
70,2.1266
71,-0.37967
72,-0.37967
73,-0.37967
74,2.1982
75,-0.37967
76,-0.37967
77,4.8119
78,2.6279
79,-0.16485
80,2.0908
81,-0.37967
82,-0.37967
83,-0.37967
84,2.3056
85,-0.37967
86,-0.37967
87,-0.37967
88,-0.37967
89,-0.37967
90,-0.37967
91,-0.37967
92,-0.37967
93,-0.37967
94,-0.37967
95,-0.37967
