time,value
0,1.5756
1,1.1728
2,-0.63988
3,-0.63988
4,-0.63988
5,-0.63988
6,0.76995
7,1.777
8,-0.63988
9,-0.63988
10,-0.63988
11,-0.63988
12,-0.63988
13,2.3812
14,0.36714
15,-0.63988
16,-0.63988
17,-0.63988
18,-0.63988
19,0.36714
20,2.1798
21,-0.63988
22,-0.63988
23,-0.63988
24,-0.63988
25,-0.63988
26,0.76995
27,1.777
28,-0.63988
29,-0.63988
30,-0.63988
31,-0.63988
32,-0.63988
33,1.1728
34,1.3742
35,-0.63988
36,-0.63988
37,-0.63988
38,-0.63988
39,-0.63988
40,1.9784
41,0.56855
42,-0.63988
43,-0.63988
44,-0.63988
45,-0.63988
46,-0.035664999999999995
47,2.1798
48,-0.23706999999999998
49,-0.63988
50,-0.63988
51,-0.63988
52,-0.63988
53,1.777
54,0.97136
55,-0.63988
56,-0.63988
57,-0.63988
58,-0.63988
59,0.36714
60,2.1798
61,-0.63988
62,-0.63988
63,-0.63988
64,-0.63988
65,-0.63988
66,2.1798
67,0.56855
68,-0.63988
69,-0.63988
70,-0.63988
71,-0.035664999999999995
72,2.1798
73,-0.035664999999999995
74,-0.63988
75,-0.63988
76,-0.63988
77,-0.035664999999999995
78,2.1798
79,-0.035664999999999995
80,-0.63988
81,-0.63988
82,-0.63988
83,0.76995
84,2.1798
85,-0.63988
86,-0.63988
87,-0.63988
88,-0.63988
89,1.5756
90,1.1728
91,-0.63988
92,-0.63988
93,-0.63988
94,-0.63988
95,1.5756
