time,value
0,-0.26137
1,-0.26137
2,-0.26137
3,-0.26137
4,-0.26137
5,-0.26137
6,-0.26137
7,-0.26137
8,-0.26137
9,-0.26137
10,-0.26137
11,-0.26137
12,-0.26137
13,-0.26137
14,-0.26137
15,-0.26137
16,-0.26137
17,-0.26137
18,-0.26137
19,-0.26137
20,-0.26137
21,-0.26137
22,-0.26137
23,-0.26137
24,-0.26137
25,-0.26137
26,-0.26137
27,-0.26137
28,-0.26137
29,-0.26137
30,-0.26137
31,-0.26137
32,-0.26137
33,3.1785
34,-0.26137
35,-0.26137
36,-0.26137
37,4.0385
38,-0.26137
39,-0.26137
40,-0.26137
41,-0.26137
42,-0.26137
43,-0.26137
44,5.0503
45,-0.26137
46,-0.26137
47,-0.26137
48,-0.26137
49,4.4432
50,-0.26137
51,-0.26137
52,-0.26137
53,-0.26137
54,-0.26137
55,-0.26137
56,-0.26137
57,-0.26137
58,1.0033
59,2.1162
60,-0.26137
61,-0.26137
62,-0.26137
63,-0.26137
64,-0.26137
65,-0.26137
66,-0.26137
67,-0.26137
68,-0.26137
69,-0.26137
70,3.4315
71,-0.26137
72,-0.26137
73,-0.26137
74,-0.26137
75,-0.26137
76,-0.26137
77,-0.26137
78,-0.26137
79,-0.26137
80,-0.26137
81,-0.26137
82,-0.26137
83,-0.26137
84,-0.26137
85,-0.26137
86,-0.26137
87,-0.26137
88,-0.26137
89,-0.26137
90,-0.26137
91,-0.26137
92,-0.26137
93,-0.26137
94,-0.26137
95,-0.26137
