time,value
0,-0.94957
1,0.12289000000000001
2,0.7357199999999999
3,-0.94957
4,0.7357199999999999
5,0.12289000000000001
6,-0.94957
7,1.3486
8,-0.48995
9,-0.94957
10,1.8082
11,-0.94957
12,-0.94957
13,1.655
14,-0.94957
15,-0.6431600000000001
16,1.3486
17,-0.94957
18,-0.030322
19,0.8889299999999999
20,-0.94957
21,0.4293
22,0.27609
23,-0.94957
24,0.8889299999999999
25,-0.18353
26,-0.94957
27,1.1953
28,-0.48995
29,-0.94957
30,1.3486
31,-0.48995
32,-0.94957
33,1.3486
34,-0.6431600000000001
35,-0.94957
36,1.3486
37,-0.48995
38,-0.94957
39,1.5018
40,-0.48995
41,-0.94957
42,1.655
43,-0.94957
44,-0.94957
45,1.8082
46,-0.94957
47,0.4293
48,0.27609
49,-0.94957
50,1.0421
51,-0.18353
52,-0.94957
53,1.5018
54,-0.6431600000000001
55,-0.94957
56,1.8082
57,-0.94957
58,0.27609
59,0.4293
60,-0.94957
61,1.655
62,-0.94957
63,-0.33674
64,0.8889299999999999
65,-0.94957
66,0.8889299999999999
67,-0.18353
68,-0.94957
69,1.655
70,-0.94957
71,-0.94957
72,1.5018
73,-0.94957
74,-0.030322
75,0.7357199999999999
76,-0.94957
77,0.7357199999999999
78,0.12289000000000001
79,-0.94957
80,1.3486
81,-0.6431600000000001
82,-0.94957
83,1.8082
84,-0.94957
85,-0.48995
86,1.3486
87,-0.94957
88,0.27609
89,0.5825100000000001
90,-0.94957
91,1.1953
92,-0.33674
93,-0.94957
94,1.8082
95,-0.94957
