time,value
0,-0.48396000000000006
1,-0.31979
2,-0.31979
3,-0.31979
4,-0.48396000000000006
5,-0.31979
6,-0.31979
7,-0.31979
8,-0.48396000000000006
9,-0.31979
10,-0.31979
11,-0.31979
12,-0.48396000000000006
13,-0.31979
14,-0.31979
15,-0.31979
16,-0.31979
17,-0.48396000000000006
18,-0.31979
19,-0.31979
20,-0.31979
21,-0.48396000000000006
22,-0.31979
23,-0.31979
24,-0.31979
25,-0.48396000000000006
26,-0.31979
27,-0.31979
28,-0.31979
29,-0.31979
30,-0.48396000000000006
31,-0.31979
32,-0.31979
33,-0.31979
34,-0.48396000000000006
35,-0.31979
36,-0.31979
37,-0.31979
38,-0.48396000000000006
39,-0.31979
40,-0.31979
41,-0.31979
42,-0.48396000000000006
43,-0.31979
44,-0.31979
45,-0.31979
46,-0.48396000000000006
47,-0.31979
48,-0.31979
49,-0.31979
50,-0.48396000000000006
51,-0.31979
52,-0.31979
53,-0.31979
54,-0.48396000000000006
55,-0.31979
56,-0.31979
57,-0.31979
58,-0.31979
59,-0.31979
60,-0.31979
61,-0.31979
62,-0.31979
63,-0.31979
64,-0.31979
65,-0.31979
66,-0.31979
67,-0.31979
68,-0.31979
69,-0.31979
70,-0.31979
71,-0.31979
72,-0.31979
73,-0.31979
74,0.6652399999999999
75,-0.31979
76,-0.31979
77,-0.31979
78,-0.31979
79,-0.31979
80,3.292
81,3.1278
82,2.9636
83,3.292
84,3.292
85,3.292
86,3.1278
87,3.4562
88,0.9935799999999999
89,0.0085506
90,0.0085506
91,0.0085506
92,0.0085506
93,0.0085506
94,0.0085506
95,0.0085506
