time,value
0,-0.47623000000000004
1,1.2008
2,0.54459
3,-1.2783
4,0.03418
5,1.2008
6,-0.47623000000000004
7,-1.2783
8,1.055
9,0.98209
10,-1.2783
11,-0.47623000000000004
12,1.2008
13,0.03418
14,-1.2783
15,0.61751
16,1.1279
17,-1.2783
18,-0.7679
19,1.2008
20,0.03418
21,-1.2783
22,0.69043
23,0.9091799999999999
24,-1.2783
25,-0.40331999999999996
26,1.2008
27,-0.54915
28,-1.2783
29,0.98209
30,0.9091799999999999
31,-1.2783
32,-0.3304
33,1.2008
34,-0.40331999999999996
35,-1.2783
36,1.2738
37,0.9091799999999999
38,-1.2783
39,-0.54915
40,1.2738
41,-0.25749
42,-1.2783
43,0.83626
44,0.9091799999999999
45,-1.2783
46,-0.3304
47,1.1279
48,-0.62207
49,-1.2783
50,1.1279
51,0.9091799999999999
52,-1.2783
53,-0.54915
54,1.2008
55,-0.18457
56,-1.2783
57,0.76334
58,0.98209
59,-1.2783
60,-0.54915
61,1.2738
62,0.18001
63,-1.2783
64,0.25293000000000004
65,1.1279
66,-0.7679
67,-1.2783
68,1.2008
69,1.055
70,-1.2783
71,-0.62207
72,1.2008
73,0.32584
74,-1.2783
75,-0.038737
76,1.2008
77,-0.11165
78,-1.2783
79,0.54459
80,1.1279
81,-1.0596
82,-0.18457
83,1.2008
84,1.1279
85,-1.2783
86,-0.98665
87,1.2738
88,1.1279
89,-1.2783
90,-0.7679
91,1.2738
92,0.69043
93,-1.2783
94,-0.3304
95,1.1279
