time,value
0,-0.20203
1,-0.20203
2,-0.20203
3,-0.20203
4,-0.20203
5,-0.20203
6,-0.20203
7,-0.20203
8,-0.20203
9,-0.20203
10,-0.20203
11,-0.20203
12,-0.20203
13,-0.20203
14,-0.20203
15,-0.20203
16,-0.20203
17,-0.20203
18,-0.20203
19,-0.20203
20,-0.20203
21,-0.20203
22,-0.20203
23,-0.20203
24,-0.20203
25,-0.20203
26,-0.20203
27,-0.20203
28,-0.20203
29,-0.20203
30,-0.20203
31,-0.20203
32,-0.20203
33,-0.20203
34,-0.20203
35,-0.20203
36,-0.20203
37,-0.20203
38,3.6165
39,-0.20203
40,-0.20203
41,2.5957
42,-0.20203
43,-0.20203
44,-0.20203
45,-0.20203
46,-0.20203
47,-0.20203
48,6.5655
49,-0.20203
50,0.28946
51,-0.20203
52,-0.20203
53,-0.20203
54,-0.20203
55,-0.20203
56,-0.20203
57,-0.20203
58,-0.20203
59,-0.20203
60,-0.20203
61,-0.20203
62,-0.20203
63,-0.20203
64,-0.20203
65,-0.20203
66,-0.20203
67,-0.20203
68,-0.20203
69,-0.20203
70,-0.20203
71,-0.20203
72,-0.20203
73,-0.20203
74,-0.20203
75,-0.20203
76,-0.20203
77,-0.20203
78,-0.20203
79,-0.20203
80,-0.20203
81,5.3178
82,-0.20203
83,-0.20203
84,-0.20203
85,-0.20203
86,-0.20203
87,-0.20203
88,-0.20203
89,-0.20203
90,-0.20203
91,-0.20203
92,-0.20203
93,-0.20203
94,-0.20203
95,-0.20203
