time,value
0,1.0943
1,-0.8567
2,-0.25638
3,1.2444
4,-0.8567
5,-0.40646
6,1.3945
7,-0.8567
8,-0.5565399999999999
9,1.3945
10,-0.8567
11,-0.5565399999999999
12,1.3945
13,-0.8567
14,-0.40646
15,1.2444
16,-0.8567
17,-0.40646
18,1.2444
19,-0.8567
20,-0.5565399999999999
21,1.3945
22,-0.8567
23,-0.8567
24,1.5446
25,-0.8567
26,-0.8567
27,1.5446
28,-0.8567
29,-0.8567
30,1.6946
31,-0.8567
32,-0.8567
33,1.6946
34,-0.8567
35,-0.8567
36,1.6946
37,-0.8567
38,-0.8567
39,1.6946
40,-0.8567
41,-0.8567
42,2.1449
43,-0.8567
44,-0.8567
45,1.0943
46,-0.10630999999999999
47,-0.8567
48,0.34393
49,0.64408
50,-0.8567
51,-0.40646
52,1.3945
53,-0.8567
54,-0.8567
55,1.8447
56,-0.8567
57,-0.8567
58,1.0943
59,-0.25638
60,-0.8567
61,0.34393
62,0.49401000000000006
63,-0.8567
64,-0.5565399999999999
65,1.5446
66,-0.8567
67,-0.8567
68,1.5446
69,-0.8567
70,-0.8567
71,0.49401000000000006
72,0.19385
73,-0.8567
74,-0.40646
75,1.2444
76,-0.8567
77,-0.8567
78,1.8447
79,-0.8567
80,0.043773
81,0.94424
82,-0.8567
83,0.49401000000000006
84,0.19385
85,-0.8567
86,1.8447
87,-0.8567
88,-0.40646
89,1.2444
90,-0.8567
91,0.043773
92,0.7941600000000001
93,-0.8567
94,0.64408
95,0.19385
