time,value
0,0.40207
1,0.40207
2,0.5282100000000001
3,0.5282100000000001
4,0.40207
5,0.40207
6,0.5282100000000001
7,0.5282100000000001
8,0.40207
9,0.5282100000000001
10,0.5282100000000001
11,0.40207
12,0.5282100000000001
13,0.40207
14,0.5282100000000001
15,0.40207
16,0.5282100000000001
17,0.40207
18,0.5282100000000001
19,0.40207
20,0.5282100000000001
21,0.5282100000000001
22,0.40207
23,0.40207
24,0.5282100000000001
25,0.5282100000000001
26,0.40207
27,0.5282100000000001
28,0.40207
29,0.5282100000000001
30,0.40207
31,0.40207
32,0.5282100000000001
33,0.40207
34,0.5282100000000001
35,0.40207
36,0.40207
37,0.40207
38,0.5282100000000001
39,0.40207
40,0.023651
41,-1.9946
42,-1.49
43,-1.9946
44,-1.9946
45,-1.9946
46,-1.9946
47,-1.9946
48,-1.9946
49,0.27593
50,1.1589
51,0.78049
52,0.78049
53,0.65435
54,0.65435
55,0.5282100000000001
56,0.5282100000000001
57,0.5282100000000001
58,0.5282100000000001
59,0.5282100000000001
60,0.40207
61,0.5282100000000001
62,0.5282100000000001
63,0.40207
64,0.40207
65,0.5282100000000001
66,0.40207
67,0.5282100000000001
68,0.40207
69,0.40207
70,0.40207
71,0.5282100000000001
72,0.40207
73,0.40207
74,0.5282100000000001
75,0.40207
76,0.40207
77,0.5282100000000001
78,0.40207
79,0.40207
80,0.5282100000000001
81,-1.9946
82,-1.9946
83,-1.9946
84,-1.9946
85,-1.9946
86,-1.9946
87,-1.9946
88,-1.9946
89,-1.9946
90,-1.9946
91,-1.9946
92,-0.48091000000000006
93,1.1589
94,1.0328
95,0.78049
