time,value
0,-0.30434
1,-0.30434
2,-0.30434
3,-0.30434
4,-0.30434
5,-0.30434
6,-0.30434
7,-0.30434
8,-0.30434
9,-0.30434
10,-0.30434
11,0.15577
12,0.38582
13,-0.30434
14,-0.30434
15,-0.30434
16,-0.30434
17,-0.30434
18,-0.30434
19,-0.30434
20,0.38582
21,-0.30434
22,-0.30434
23,-0.30434
24,-0.30434
25,-0.30434
26,-0.30434
27,-0.30434
28,-0.30434
29,-0.30434
30,-0.30434
31,-0.30434
32,-0.30434
33,-0.30434
34,-0.30434
35,-0.30434
36,-0.30434
37,-0.30434
38,-0.30434
39,-0.30434
40,0.38582
41,-0.30434
42,-0.30434
43,-0.30434
44,-0.30434
45,-0.30434
46,-0.30434
47,-0.30434
48,-0.30434
49,-0.30434
50,-0.30434
51,-0.30434
52,-0.30434
53,-0.30434
54,-0.30434
55,-0.30434
56,0.38582
57,-0.30434
58,-0.30434
59,-0.30434
60,-0.30434
61,-0.30434
62,-0.30434
63,-0.30434
64,-0.30434
65,-0.30434
66,-0.30434
67,-0.30434
68,-0.30434
69,-0.30434
70,-0.30434
71,-0.30434
72,-0.30434
73,-0.30434
74,-0.30434
75,-0.30434
76,-0.30434
77,-0.30434
78,-0.30434
79,-0.30434
80,-0.30434
81,-0.30434
82,-0.30434
83,-0.30434
84,-0.30434
85,-0.30434
86,-0.30434
87,3.6066
88,3.8366
89,3.8366
90,3.8366
91,3.8366
92,3.6066
93,1.306
94,-0.30434
95,-0.30434
