time,value
0,-0.33941
1,-0.33941
2,-0.33941
3,-0.33941
4,-0.33941
5,-0.33941
6,-0.33941
7,-0.33941
8,-0.33941
9,-0.33941
10,-0.33941
11,-0.33941
12,-0.33941
13,-0.33941
14,-0.33941
15,-0.33941
16,-0.33941
17,-0.33941
18,-0.33941
19,-0.33941
20,-0.33941
21,-0.33941
22,-0.33941
23,-0.33941
24,-0.33941
25,-0.33941
26,-0.33941
27,-0.33941
28,-0.33941
29,-0.33941
30,-0.33941
31,-0.33941
32,-0.33941
33,-0.33941
34,-0.33941
35,-0.33941
36,-0.33941
37,-0.33941
38,-0.33941
39,-0.33941
40,-0.33941
41,-0.33941
42,-0.33941
43,-0.33941
44,-0.33941
45,-0.33941
46,-0.33941
47,-0.33941
48,-0.33941
49,-0.33941
50,-0.33941
51,-0.33941
52,-0.33941
53,-0.33941
54,-0.33941
55,-0.33941
56,-0.33941
57,-0.33941
58,-0.33941
59,-0.33941
60,-0.33941
61,-0.33941
62,-0.33941
63,-0.33941
64,-0.33941
65,-0.33941
66,-0.33941
67,-0.33941
68,-0.33941
69,-0.33941
70,-0.33941
71,-0.33941
72,-0.33941
73,-0.33941
74,2.1438
75,3.4189
76,0.58899
77,3.2512
78,-0.14926
79,-0.16044
80,1.5062
81,3.2512
82,-0.33941
83,-0.33941
84,-0.33941
85,-0.33941
86,-0.33941
87,-0.33941
88,0.93575
89,3.0610000000000004
90,1.5845
91,3.2288
92,-0.14926
93,-0.17163
94,0.07445399999999999
95,4.7388
