time,value
0,-1.0062
1,-1.0062
2,-1.0062
3,-1.0062
4,-1.0062
5,-1.0062
6,-1.0062
7,-1.0062
8,-1.0062
9,-1.0062
10,-1.0062
11,-1.0062
12,-1.0062
13,-1.0062
14,-1.0062
15,-1.0062
16,-1.0062
17,-1.0062
18,-1.0062
19,-1.0062
20,-1.0062
21,-1.0062
22,-1.0062
23,-1.0062
24,0.008947499999999999
25,1.4926
26,1.5707
27,0.946
28,0.946
29,0.78982
30,1.1022
31,0.63365
32,0.78982
33,0.946
34,0.7117399999999999
35,0.8679100000000001
36,1.0241
37,0.78982
38,0.78982
39,0.087035
40,-1.0062
41,-1.0062
42,-1.0062
43,-1.0062
44,-1.0062
45,-1.0062
46,-0.8500200000000001
47,1.5707
48,1.1022
49,1.2583
50,1.5707
51,1.9611
52,0.24320999999999998
53,0.47747
54,0.8679100000000001
55,2.742
56,0.47747
57,0.39939
58,0.3213
59,0.39939
60,-0.69384
61,-1.0062
62,-1.0062
63,-1.0062
64,-1.0062
65,-1.0062
66,1.1022
67,1.4926
68,0.7117399999999999
69,0.946
70,0.63365
71,0.63365
72,0.78982
73,0.7117399999999999
74,0.63365
75,0.78982
76,0.8679100000000001
77,0.55556
78,0.78982
79,0.8679100000000001
80,0.63365
81,0.78982
82,0.946
83,0.55556
84,0.7117399999999999
85,0.946
86,0.63365
87,1.1803
88,-1.0062
89,-1.0062
90,-1.0062
91,-1.0062
92,-1.0062
93,-1.0062
94,-1.0062
95,-1.0062
