time,value
0,-0.2418
1,-0.2418
2,-0.2418
3,-0.2418
4,-0.2418
5,-0.2418
6,-0.2418
7,-0.2418
8,-0.2418
9,-0.2418
10,-0.2418
11,-0.2418
12,-0.2418
13,-0.2418
14,-0.2418
15,-0.2418
16,-0.2418
17,-0.2418
18,-0.2418
19,-0.2418
20,-0.2418
21,-0.2418
22,-0.2418
23,-0.2418
24,-0.2418
25,-0.2418
26,-0.2418
27,-0.2418
28,-0.2418
29,-0.2418
30,-0.2418
31,-0.2418
32,-0.2418
33,-0.2418
34,-0.2418
35,-0.2418
36,-0.2418
37,3.627
38,-0.2418
39,-0.2418
40,-0.2418
41,-0.2418
42,-0.2418
43,-0.2418
44,-0.2418
45,-0.2418
46,-0.2418
47,-0.2418
48,-0.2418
49,-0.2418
50,-0.2418
51,-0.2418
52,-0.2418
53,-0.2418
54,-0.2418
55,-0.2418
56,-0.2418
57,-0.2418
58,-0.2418
59,-0.2418
60,-0.2418
61,-0.2418
62,-0.2418
63,-0.2418
64,-0.2418
65,-0.2418
66,-0.2418
67,-0.2418
68,-0.2418
69,-0.2418
70,-0.2418
71,-0.2418
72,-0.2418
73,-0.2418
74,1.2644
75,1.2053
76,1.1758
77,1.2053
78,1.2053
79,1.1758
80,2.2389
81,7.9388
82,-0.2418
83,-0.2418
84,-0.2418
85,-0.2418
86,-0.2418
87,-0.2418
88,-0.2418
89,-0.2418
90,-0.2418
91,-0.2418
92,-0.2418
93,-0.2418
94,-0.2418
95,-0.2418
