time,value
0,-0.056316
1,-0.9043700000000001
2,-0.9043700000000001
3,1.0038
4,1.1098
5,1.6398
6,-0.9043700000000001
7,-0.9043700000000001
8,-0.9043700000000001
9,1.2158
10,-0.9043700000000001
11,-0.9043700000000001
12,0.6857300000000001
13,1.2158
14,-0.9043700000000001
15,0.79174
16,-0.9043700000000001
17,-0.9043700000000001
18,-0.9043700000000001
19,1.2158
20,0.47372
21,1.5338
22,-0.9043700000000001
23,-0.9043700000000001
24,-0.056316
25,0.2617
26,-0.9043700000000001
27,-0.9043700000000001
28,-0.16232
29,1.7458
30,-0.9043700000000001
31,1.0038
32,-0.9043700000000001
33,-0.9043700000000001
34,1.1098
35,1.1098
36,0.47372
37,-0.9043700000000001
38,-0.056316
39,0.2617
40,-0.9043700000000001
41,-0.9043700000000001
42,-0.056316
43,1.9578
44,-0.9043700000000001
45,0.47372
46,-0.26833
47,-0.9043700000000001
48,-0.9043700000000001
49,1.2158
50,0.57972
51,1.4278
52,-0.9043700000000001
53,-0.9043700000000001
54,0.79174
55,-0.58635
56,-0.9043700000000001
57,-0.9043700000000001
58,1.5338
59,1.9578
60,-0.6923600000000001
61,-0.9043700000000001
62,-0.9043700000000001
63,-0.9043700000000001
64,1.1098
65,-0.9043700000000001
66,-0.9043700000000001
67,1.7458
68,0.1557
69,-0.26833
70,0.2617
71,-0.9043700000000001
72,-0.9043700000000001
73,0.1557
74,0.1557
75,2.1698
76,-0.48034
77,0.47372
78,-0.26833
79,-0.9043700000000001
80,-0.16232
81,1.8518
82,-0.9043700000000001
83,1.0038
84,-0.9043700000000001
85,-0.9043700000000001
86,0.47372
87,2.0638
88,0.2617
89,-0.9043700000000001
90,-0.9043700000000001
91,1.1098
92,0.1557
93,2.0638
94,-0.9043700000000001
95,-0.9043700000000001
