time,value
0,-1.2066
1,0.15588
2,0.30422
3,-0.37813
4,-1.311
5,-1.9936
6,-2.1608
7,-1.8619
8,-1.361
9,-0.9768399999999999
10,-0.88292
11,-1.0685
12,-1.3765
13,-1.6298
14,-1.6987
15,-1.5802
16,-1.3701
17,-1.208
18,-1.1643
19,-1.2346
20,-1.3519
21,-1.4505
22,-1.4729
23,-1.4180000000000001
24,-1.3252
25,-1.2591
26,-1.2402
27,-1.2613
28,-1.2935
29,-1.3225
30,-1.3248
31,-1.3008
32,-1.2635
33,-1.2429
34,-1.2371
35,-1.2393
36,-1.2384
37,-1.2427
38,-1.2422
39,-1.2359
40,-1.2248
41,-1.232
42,-1.2343
43,-1.2306
44,-1.2219
45,-1.2317
46,-1.2369
47,-1.2365
48,-1.2314
49,-1.2449
50,-1.2535
51,-1.2561
52,-1.2531
53,-1.2677
54,-1.2767
55,-1.2788
56,-1.2749
57,-1.2886
58,-1.2964
59,-1.2974
60,-1.2923
61,-1.3045
62,-1.3106
63,-1.3092
64,-1.3012
65,-1.31
66,-1.3123
67,-1.3069
68,-1.2947
69,-1.2995
70,-1.298
71,-1.2889
72,-1.2733
73,-1.275
74,-1.2705
75,-1.2587
76,-1.2406
77,-1.2402
78,-1.2339
79,-1.2208
80,-1.2017
81,-1.2007
82,-1.1938
83,-1.18
84,-1.1599
85,-1.1574
86,-1.1488
87,-1.1329
88,-1.1104
89,-1.1054
90,-1.0941
91,-1.0754
92,-1.0501
93,-1.0423
94,-1.0283
95,-1.0071
96,-0.9796
97,-0.9696100000000001
98,-0.95357
99,-0.9304399999999999
100,-0.90122
101,-0.88982
102,-0.8731399999999999
103,-0.8504799999999999
104,-0.82301
105,-0.81447
106,-0.8014899999999999
107,-0.78291
108,-0.75956
109,-0.75495
110,-0.74585
111,-0.73147
112,-0.71296
113,-0.71394
114,-0.71111
115,-0.70332
116,-0.6913100000000001
117,-0.6983199999999999
118,-0.70082
119,-0.69775
120,-0.69008
121,-0.70126
122,-0.7079
123,-0.70898
124,-0.70541
125,-0.7205600000000001
126,-0.731
127,-0.73575
128,-0.7357899999999999
129,-0.75453
130,-0.7684
131,-0.77636
132,-0.77937
133,-0.80091
134,-0.8175
135,-0.82826
136,-0.8341799999999999
137,-0.85857
138,-0.87755
139,-0.88992
140,-0.8965200000000001
141,-0.9208299999999999
142,-0.9392
143,-0.9508700000000001
144,-0.95699
145,-0.9811200000000001
146,-0.9992700000000001
147,-1.0104
148,-1.0153
149,-1.0379
150,-1.0543
151,-1.0637
152,-1.067
153,-1.0876
154,-1.101
155,-1.1058
156,-1.1027
157,-1.1159
158,-1.1221
159,-1.1214
160,-1.1161
161,-1.1305
162,-1.1406
163,-1.1448
164,-1.1434
165,-1.1591
166,-1.1672
167,-1.167
168,-1.1601
169,-1.1713
170,-1.1778
171,-1.1792
172,-1.1771
173,-1.1948
174,-1.2076
175,-1.2132
176,-1.2117
177,-1.226
178,-1.2317
179,-1.2278
180,-1.2159
181,-1.2207
182,-1.2192
183,-1.2108
184,-1.1971
185,-1.202
186,-1.2016
187,-1.1943
188,-1.1811
189,-1.1855
190,-1.1838
191,-1.175
192,-1.1601
193,-1.1632
194,-1.1605
195,-1.1508
196,-1.135
197,-1.1368
198,-1.1324
199,-1.1207
200,-1.1029
201,-1.103
202,-1.0975
203,-1.0856
204,-1.0681
205,-1.0689
206,-1.0642
207,-1.0528
208,-1.0354
209,-1.0359
210,-1.0304
211,-1.0179
212,-0.9993
213,-0.9986200000000001
214,-0.99229
215,-0.97929
216,-0.9604600000000001
217,-0.9595799999999999
218,-0.95278
219,-0.9388
220,-0.9185399999999999
221,-0.9162
222,-0.90845
223,-0.89439
224,-0.8748799999999999
225,-0.87366
226,-0.8667100000000001
227,-0.85288
228,-0.83354
229,-0.8337600000000001
230,-0.83101
231,-0.82499
232,-0.8164100000000001
233,-0.8280700000000001
234,-0.8339700000000001
235,-0.83067
236,-0.8175100000000001
237,-0.8185100000000001
238,-0.8113199999999999
239,-0.79725
240,-0.77962
241,-0.78409
242,-0.78668
243,-0.78476
244,-0.77699
245,-0.78569
246,-0.78584
247,-0.77655
248,-0.75993
249,-0.7619199999999999
250,-0.75967
251,-0.75244
252,-0.7407
253,-0.7479600000000001
254,-0.7490899999999999
255,-0.7423
256,-0.72841
257,-0.73232
258,-0.73048
259,-0.72228
260,-0.70881
261,-0.71446
262,-0.7144
263,-0.7068399999999999
264,-0.69219
265,-0.69497
266,-0.69115
267,-0.68023
268,-0.6639
269,-0.6675
270,-0.66685
271,-0.66056
272,-0.64889
273,-0.65576
274,-0.65584
275,-0.64736
276,-0.63089
277,-0.63131
278,-0.62431
279,-0.6090800000000001
280,-0.5868899999999999
281,-0.58308
282,-0.57339
283,-0.55689
284,-0.53464
285,-0.53172
286,-0.52344
287,-0.50852
288,-0.4878
289,-0.48636999999999997
290,-0.47965
291,-0.46653999999999995
292,-0.44803000000000004
293,-0.4493
294,-0.44546
295,-0.4351
296,-0.41881999999999997
297,-0.42175
298,-0.41888000000000003
299,-0.40886999999999996
300,-0.39249
301,-0.39513000000000004
302,-0.39175
303,-0.3809
304,-0.36329
305,-0.36448
306,-0.35935
307,-0.34659
308,-0.32704
309,-0.32652
310,-0.31986
311,-0.30573
312,-0.28486
313,-0.28306
314,-0.27503
315,-0.25932
316,-0.23665999999999998
317,-0.23299
318,-0.22308000000000003
319,-0.20567
320,-0.18173
321,-0.17756
322,-0.16802999999999998
323,-0.152
324,-0.1304
325,-0.12933
326,-0.12308
327,-0.10976
328,-0.089384
329,-0.087292
330,-0.077067
331,-0.0568
332,-0.027207
333,-0.015009999999999999
334,0.0047475
335,0.032757999999999995
336,0.067881
337,0.083872
338,0.10695999999999999
339,0.13908
340,0.17962999999999998
341,0.20171
342,0.23004000000000002
343,0.26466999999999996
344,0.30372
345,0.32023
346,0.34029
347,0.366
348,0.39731
349,0.40801
350,0.42378999999999994
351,0.4455
352,0.4719
353,0.47644
354,0.48573
355,0.50216
356,0.52579
357,0.53027
358,0.54108
359,0.5585600000000001
360,0.5808800000000001
361,0.58105
362,0.5855899999999999
363,0.597
364,0.61574
365,0.61611
366,0.6242800000000001
367,0.64085
368,0.66391
369,0.66603
370,0.67296
371,0.68618
372,0.70528
373,0.70417
374,0.70911
375,0.72118
376,0.73919
377,0.73655
378,0.7397
379,0.7501399999999999
380,0.76708
381,0.76378
382,0.76618
383,0.7750600000000001
384,0.78945
385,0.7834399999999999
386,0.78467
387,0.7954
388,0.81497
389,0.81599
390,0.82324
391,0.83549
392,0.8497100000000001
393,0.83844
394,0.82894
395,0.8240000000000001
396,0.8245100000000001
397,0.80532
398,0.79351
399,0.7894800000000001
400,0.79086
401,0.7700199999999999
402,0.75327
403,0.7420800000000001
404,0.73628
405,0.7104600000000001
406,0.6920000000000001
407,0.68204
408,0.67905
409,0.6561899999999999
410,0.6398699999999999
411,0.6310899999999999
412,0.62889
413,0.60728
414,0.59315
415,0.58744
416,0.58872
417,0.57053
418,0.55938
419,0.55606
420,0.5592199999999999
421,0.54259
422,0.53263
423,0.52996
424,0.53299
425,0.5154
426,0.50374
427,0.49886
428,0.4995
429,0.47973999999999994
430,0.46618999999999994
431,0.45956
432,0.45821999999999996
433,0.43587
434,0.41881
435,0.40771
436,0.40129000000000004
437,0.37401
438,0.35288
439,0.33901
440,0.331
441,0.30265
442,0.27986
443,0.26295999999999997
444,0.25053000000000003
445,0.21731999999999999
446,0.19068
447,0.17232999999999998
448,0.1614
449,0.13185
450,0.10907
451,0.092642
452,0.080386
453,0.046611
454,0.018499
455,-0.0016441
456,-0.013781
457,-0.04292
458,-0.063198
459,-0.074935
460,-0.08086900000000001
461,-0.10768
462,-0.12941
463,-0.14470999999999998
464,-0.15395
465,-0.18200999999999998
466,-0.20245
467,-0.21466999999999997
468,-0.22055
469,-0.24628000000000003
470,-0.26581
471,-0.27791
472,-0.28326
473,-0.30699
474,-0.32274
475,-0.32975
476,-0.32969
477,-0.34869
478,-0.36093000000000003
479,-0.36546
480,-0.36334
481,-0.38006999999999996
482,-0.38953000000000004
483,-0.39078
484,-0.38516
485,-0.39852
486,-0.40488
487,-0.40309
488,-0.3941
489,-0.40355
490,-0.40564
491,-0.39964
492,-0.3872
493,-0.39463000000000004
494,-0.39652
495,-0.39197
496,-0.38185
497,-0.39148
498,-0.3944
499,-0.3888
500,-0.37521
501,-0.37931
502,-0.37559000000000003
503,-0.36346
504,-0.34471999999999997
505,-0.34598
506,-0.34209
507,-0.33204
508,-0.31651
509,-0.32077
510,-0.31847
511,-0.30785999999999997
512,-0.28966
513,-0.28991999999999996
514,-0.28349
515,-0.2695
516,-0.24896
517,-0.24745999999999999
518,-0.23890999999999998
519,-0.22154000000000001
520,-0.19612000000000002
521,-0.18911
522,-0.17594
523,-0.15648
524,-0.13243
525,-0.12994
526,-0.12277
527,-0.10839000000000001
528,-0.086425
529,-0.082221
530,-0.070061
531,-0.049139999999999996
532,-0.021096
533,-0.012874000000000002
534,0.00097832
535,0.021987
536,0.049678
537,0.057807000000000004
538,0.071984
539,0.093086
540,0.11968
541,0.12477
542,0.13422
543,0.1499
544,0.17174
545,0.17372
546,0.1822
547,0.19864
548,0.22199000000000002
549,0.22505
550,0.23359000000000002
551,0.249
552,0.27066999999999997
553,0.27193
554,0.2792
555,0.29417
556,0.31629
557,0.31875
558,0.32796
559,0.34565
560,0.37131
561,0.37813
562,0.39252
563,0.41589
564,0.44736000000000004
565,0.4596
566,0.47876
567,0.5060899999999999
568,0.54065
569,0.55519
570,0.57622
571,0.60532
572,0.64185
573,0.65869
574,0.68248
575,0.71454
576,0.75375
577,0.77227
578,0.79625
579,0.8267200000000001
580,0.86266
581,0.87669
582,0.89594
583,0.9221799999999999
584,0.95485
585,0.96646
586,0.98367
587,1.0076
588,1.0369
589,1.044
590,1.0557
591,1.0736
592,1.0967
593,1.097
594,1.1014
595,1.111
596,1.1251
597,1.1162
598,1.1126
599,1.117
600,1.1297
601,1.1233
602,1.1252
603,1.1367
604,1.1562
605,1.1549
606,1.1601
607,1.1732
608,1.1937
609,1.1931
610,1.1991
611,1.2127
612,1.2328
613,1.2304
614,1.2335
615,1.2437
616,1.2605
617,1.2555
618,1.2568
619,1.2659
620,1.2819999999999998
621,1.2762
622,1.2771
623,1.2867
624,1.3044
625,1.3015
626,1.3066
627,1.3213
628,1.3452
629,1.3496
630,1.3636
631,1.3892
632,1.4252
633,1.4418
634,1.4663
635,1.4988
636,1.5375
637,1.5528
638,1.574
639,1.6036
640,1.6417
641,1.6595
642,1.6854
643,1.7197
644,1.7604
645,1.7773
646,1.7986
647,1.8262
648,1.8597
649,1.8706
650,1.8880000000000001
651,1.9133
652,1.9452
653,1.9541
654,1.9685
655,1.99
656,2.0176
657,2.0224
658,2.0333
659,2.0514
660,2.0755
661,2.0762
662,2.0823
663,2.0954
664,2.1145
665,2.1109
666,2.1135
667,2.1235
668,2.1398
669,2.1332
670,2.1323
671,2.1384
672,2.1505
673,2.1396
674,2.1347
675,2.1371
676,2.1457
677,2.1315
678,2.1234
679,2.1228
680,2.1285
681,2.1117
682,2.1015
683,2.0991
684,2.1034
685,2.0853
686,2.0741
687,2.0708
688,2.0742
689,2.0552
690,2.0431
691,2.039
692,2.0418
693,2.0225
694,2.0105
695,2.0068
696,2.0101
697,1.9912
698,1.9793
699,1.9754
700,1.9779
701,1.9579
702,1.9447
703,1.9393
704,1.9401
705,1.9182
706,1.9029
707,1.8949
708,1.8927
709,1.8676
710,1.8489
711,1.8377
712,1.8325
713,1.8047
714,1.7837
715,1.7703
716,1.7629
717,1.7331
718,1.7099
719,1.6945
720,1.6853
721,1.6542
722,1.6304
723,1.6147
724,1.6056
725,1.5748
726,1.5512
727,1.5358
728,1.5272
729,1.4975
730,1.476
731,1.4637
732,1.4591
733,1.4339
734,1.4167
735,1.4076
736,1.4046
737,1.3793
738,1.3603
739,1.3483
740,1.3418
741,1.3134
742,1.2918
743,1.2778
744,1.2698
745,1.2401
746,1.2167
747,1.2005
748,1.1896
749,1.1564
750,1.1294
751,1.1094
752,1.095
753,1.0590000000000002
754,1.0296
755,1.0079
756,0.99234
757,0.9558399999999999
758,0.9266
759,0.9053700000000001
760,0.89055
761,0.8549200000000001
762,0.8263299999999999
763,0.80543
764,0.79073
765,0.75549
766,0.7278399999999999
767,0.70886
768,0.69729
769,0.6665300000000001
770,0.6442100000000001
771,0.6309600000000001
772,0.62505
773,0.5997100000000001
774,0.58231
775,0.5734100000000001
776,0.57122
777,0.54881
778,0.5330199999999999
779,0.5239699999999999
780,0.51958
781,0.49316000000000004
782,0.47203999999999996
783,0.45731000000000005
784,0.44806
785,0.4186
786,0.39658000000000004
787,0.38289
788,0.37588
789,0.34892
790,0.32838
791,0.31434
792,0.30477
793,0.27334
794,0.24691999999999997
795,0.22651999999999997
796,0.21116999999999997
797,0.17565
798,0.14724
799,0.12719
800,0.11431
801,0.08295
802,0.059437000000000004
803,0.044164
804,0.035294
805,0.006935500000000001
806,-0.014863999999999999
807,-0.029508
808,-0.038414
809,-0.066817
810,-0.08836000000000001
811,-0.10207999999999999
812,-0.10917
813,-0.13473
814,-0.15272
815,-0.1625
816,-0.16566
817,-0.18767
818,-0.20292000000000002
819,-0.21101999999999999
820,-0.2136
821,-0.23592
822,-0.25215
823,-0.26150999999999996
824,-0.26528
825,-0.28843
826,-0.30519
827,-0.31484
828,-0.31890999999999997
829,-0.34264
830,-0.36058
831,-0.37215
832,-0.37878
833,-0.40552
834,-0.42667
835,-0.44128999999999996
836,-0.4505
837,-0.47913999999999995
838,-0.50157
839,-0.51689
840,-0.52636
841,-0.55493
842,-0.57724
843,-0.59239
844,-0.60158
845,-0.62962
846,-0.65105
847,-0.66482
848,-0.67197
849,-0.6973
850,-0.71543
851,-0.72538
852,-0.72827
853,-0.74898
854,-0.7623
855,-0.7673
856,-0.7651100000000001
857,-0.78067
858,-0.78883
859,-0.78867
860,-0.78133
861,-0.79182
862,-0.7951199999999999
863,-0.79033
864,-0.77865
865,-0.7851100000000001
866,-0.78471
867,-0.77651
868,-0.76166
869,-0.76523
870,-0.7622899999999999
871,-0.7519
872,-0.7351800000000001
873,-0.73722
874,-0.73307
875,-0.7218100000000001
876,-0.70468
877,-0.70707
878,-0.70427
879,-0.69524
880,-0.68075
881,-0.6854100000000001
882,-0.68353
883,-0.67327
884,-0.6552
885,-0.65461
886,-0.64713
887,-0.63238
888,-0.61198
889,-0.61166
890,-0.60652
891,-0.5949399999999999
892,-0.57733
893,-0.57875
894,-0.5742
895,-0.56247
896,-0.54445
897,-0.54557
898,-0.54062
899,-0.52794
900,-0.50812
901,-0.50688
902,-0.4997
903,-0.48576
904,-0.46612
905,-0.46623000000000003
906,-0.46031000000000005
907,-0.4459
908,-0.4228
909,-0.41636000000000006
910,-0.40175
911,-0.37834
912,-0.34786
913,-0.33692
914,-0.3206
915,-0.2973
916,-0.26731
917,-0.25622
918,-0.23861999999999997
919,-0.21316
920,-0.18065
921,-0.16705
922,-0.14679
923,-0.11812
924,-0.081561
925,-0.063304
926,-0.038555
927,-0.006659899999999999
928,0.031
929,0.048119999999999996
930,0.07028
931,0.099374
932,0.13514
933,0.15164
934,0.17399
935,0.20284000000000002
936,0.2366
937,0.24858000000000002
938,0.26428
939,0.28572
940,0.31323
941,0.32175
942,0.33763000000000004
943,0.3624
944,0.39474000000000004
945,0.40739000000000003
946,0.42473999999999995
947,0.44728
948,0.47397
949,0.47902
950,0.48898
951,0.50621
952,0.5305
953,0.53557
954,0.5464600000000001
955,0.56345
956,0.58475
957,0.5836100000000001
958,0.58591
959,0.59344
960,0.60597
961,0.59772
962,0.59459
963,0.5976100000000001
964,0.60575
965,0.5931
966,0.58633
967,0.5877100000000001
968,0.59734
969,0.58972
970,0.59075
971,0.6007899999999999
972,0.61769
973,0.61425
974,0.61587
975,0.62351
976,0.63642
977,0.6290600000000001
978,0.62788
979,0.6339100000000001
980,0.64573
981,0.63693
982,0.6332899999999999
983,0.6357
984,0.64317
985,0.63025
986,0.6236
987,0.62447
988,0.63164
989,0.61887
990,0.61169
991,0.61016
992,0.6122
993,0.59141
994,0.57389
995,0.56083
996,0.5516300000000001
997,0.5213800000000001
998,0.49723999999999996
999,0.48068
1000,0.47067
1001,0.44133
1002,0.41868999999999995
1003,0.40326999999999996
1004,0.3936
1005,0.36396
1006,0.3408
1007,0.3251
1008,0.31543000000000004
1009,0.28567
1010,0.26145
1011,0.24291
1012,0.22826999999999997
1013,0.1918
1014,0.16018
1015,0.135
1016,0.11582
1017,0.07768
1018,0.047241000000000005
1019,0.025387
1020,0.010645
1021,-0.022767
1022,-0.048608
1023,-0.065947
1024,-0.075959
1025,-0.10418
1026,-0.12448
1027,-0.1364
1028,-0.14172
1029,-0.16646
1030,-0.18463
1031,-0.19544
1032,-0.20002999999999999
1033,-0.2237
1034,-0.24001999999999998
1035,-0.24808000000000002
1036,-0.24925999999999998
1037,-0.26932
1038,-0.28235
1039,-0.2877
1040,-0.28678000000000003
1041,-0.30512
1042,-0.3166
1043,-0.3203
1044,-0.31748000000000004
1045,-0.33376999999999996
1046,-0.34339000000000003
1047,-0.34571
1048,-0.34225
1049,-0.3587
1050,-0.36923
1051,-0.37287
1052,-0.37071
1053,-0.37383
1054,-0.37256
1055,-0.37869
1056,-0.4
1057,-0.43906000000000006
1058,-0.46297
1059,-0.45801000000000003
1060,-0.42407
1061,-0.38654
1062,-0.36018
1063,-0.37617
1064,-0.44242
1065,-0.53766
1066,-0.59225
1067,-0.5642
1068,-0.45466000000000006
1069,-0.32525
1070,-0.24552
1071,-0.28728000000000004
1072,-0.4556
1073,-0.67566
1074,-0.79818
1075,-0.72101
1076,-0.44764
1077,-0.11656
1078,0.083259
1079,-0.016052
1080,-0.42632
1081,-0.9629
1082,-1.2859
1083,-1.1141
1084,-0.39505999999999997
1085,0.58739
1086,1.2992
1087,1.1215
1088,-0.35355
1089,-3.1139
1090,-6.6572
1091,-10.199
