time,value
0,0.29472
1,0.50546
2,0.52504
3,0.50075
4,0.49328
5,0.49693000000000004
6,0.5170899999999999
7,0.52398
8,0.52207
9,0.5291100000000001
10,0.5289
11,0.53417
12,0.56316
13,0.58625
14,0.59148
15,0.80062
16,0.78004
17,1.0057
18,0.91663
19,0.9738399999999999
20,1.0321
21,0.98534
22,1.1606
23,1.2506
24,1.2633
25,1.2815
26,1.3118
27,1.2671
28,1.2175
29,1.2545
30,1.2896
31,1.3722
32,1.3225
33,1.3181
34,1.3151
35,1.3318
36,1.3430000000000002
37,1.3812
38,1.2990000000000002
39,1.2988
40,1.3138
41,1.284
42,1.1368
43,1.0907
44,1.0403
45,0.9950899999999999
46,0.84991
47,0.83752
48,0.71846
49,0.70773
50,0.6017
51,0.6029100000000001
52,0.50357
53,0.4545
54,0.42803
55,0.41453999999999996
56,0.25977
57,0.26111999999999996
58,0.19089
59,0.15747
60,0.15332
61,0.10525999999999999
62,0.17193
63,0.13984000000000002
64,0.077437
65,0.021453
66,-0.081597
67,-0.041164
68,-0.16541
69,-0.14862
70,-0.13259
71,-0.16395
72,-0.16992000000000002
73,-0.13918
74,-0.11109000000000001
75,-0.19944
76,-0.21784
77,-0.17511
78,-0.16208
79,0.023699
80,0.09071
81,-0.37318
82,-0.4618
83,-0.61625
84,-0.49162
85,-0.16455999999999998
86,-0.14692
87,-0.44186000000000003
88,-0.9404600000000001
89,-1.1545
90,-1.2437
91,-1.3316
92,-1.421
93,-1.2931
94,-1.2294
95,-0.89786
96,-2.0269999999999997
97,-1.0619
98,-0.95101
99,-1.1941
100,-0.72592
101,-0.56402
102,-0.5933
103,-0.63942
104,-0.53067
105,-0.43135
106,-0.27769
107,-0.37433
108,-0.43409
109,-0.81367
110,-0.6157699999999999
111,-0.31316
112,-0.34397
113,-0.79523
114,-0.8175100000000001
115,-0.15479
116,-0.42013999999999996
117,-1.006
118,-1.3542
119,-1.3568
120,-1.3556
121,-1.2569
122,-1.6106
123,-1.7237
124,-1.2193
125,-1.2441
126,-1.4491
127,-1.3604
128,-0.96924
129,-0.63335
130,-0.86784
131,-0.78609
132,-0.90381
133,-1.0045
134,-1.0527
135,-1.2862
136,-1.0232
137,-0.95001
138,-1.1658
139,-1.1301
140,-1.0402
141,-1.0823
142,-0.9632299999999999
143,-0.87934
144,-1.3341
145,-1.0313
146,-1.3207
147,-1.4873
148,-1.5081
149,-1.3619999999999999
150,-1.5233
151,-1.3847
152,-1.3862
153,-1.4886
154,-1.0965
155,-1.0747
156,-1.1203
157,-1.2026
158,-1.2811
159,-1.3411
160,-1.1511
161,-0.1755
162,0.20665999999999998
163,0.28565
164,0.6472399999999999
165,0.3503
166,0.6049899999999999
167,0.8976700000000001
168,0.8175399999999999
169,0.16610999999999998
170,0.029692000000000003
171,-0.63166
172,-0.54327
173,-1.8221
174,-0.90471
175,-1.2393
176,-3.1764
177,-2.5846
178,-1.7731
179,-1.7480000000000002
180,-2.2578
181,-2.9323
182,-2.0776
183,-2.3128
184,-2.2807
185,-2.9253
186,-2.7775
187,-1.8522
188,-1.7452
189,-2.5022
190,-1.6379
191,-1.0191
192,-0.86915
193,-0.63974
194,-0.059088
195,0.28281999999999996
196,0.65322
197,0.60067
198,0.5674399999999999
199,0.5042399999999999
200,0.87985
201,1.0209
202,1.09
203,1.0175
204,3.0147
205,2.9768
206,1.5147
207,0.6377
208,-0.0094374
209,0.3355
210,0.764
211,1.0035
212,0.34542
213,-0.13833
214,-0.19087
215,0.24334
216,0.46343
217,0.27765
218,0.25222
219,0.23499
220,0.25884
221,0.26579
222,0.26868000000000003
223,0.25551999999999997
224,0.28181999999999996
225,0.46643999999999997
226,0.68021
227,0.7300300000000001
228,0.51754
229,0.36408
230,0.36833
231,0.26947
232,0.38816
233,0.48895
234,0.48658999999999997
235,0.37065
236,0.57147
237,0.42391
238,0.40417
239,0.6298600000000001
240,0.35578000000000004
241,0.52576
242,0.51174
243,0.58322
244,0.67492
245,0.66406
246,0.9186
247,0.91146
248,0.6642600000000001
249,0.6523899999999999
250,0.65545
251,0.64922
252,0.66154
253,0.66474
254,0.6503399999999999
255,0.64088
256,0.6510699999999999
257,0.67409
258,0.66723
259,0.91146
260,0.91815
261,0.9281299999999999
262,0.6616
263,0.66578
264,0.62083
265,0.89318
266,0.67391
267,0.8856799999999999
268,0.70602
269,0.71503
270,0.64644
271,0.6438699999999999
272,0.64862
273,0.64894
274,0.65558
275,0.6533800000000001
276,0.5323399999999999
277,0.6410899999999999
278,0.62968
279,0.61551
280,0.74369
281,0.73788
282,0.76771
283,0.8683299999999999
284,0.8756799999999999
285,0.62343
286,0.7922399999999999
287,0.80328
288,0.61837
289,0.60148
290,0.58897
291,0.5834
292,0.42256000000000005
293,0.6029
294,0.61155
295,0.61085
296,0.60229
297,0.5942
298,0.5868399999999999
299,0.58714
