time,value
0,0.8134600000000001
1,-1.0866
2,1.9535
3,-0.7065899999999999
4,0.24345
5,0.053439
6,0.053439
7,1.0035
8,-1.0866
9,1.9535
10,-0.51658
11,0.43345
12,0.24345
13,0.053439
14,0.8134600000000001
15,-1.4666
16,0.8134600000000001
17,-0.32656999999999997
18,-0.13657
19,0.053439
20,-1.2766
21,1.3835
22,-1.4666
23,0.24345
24,-0.32656999999999997
25,0.62346
26,1.0035
27,-0.7065899999999999
28,1.9535
29,-0.13657
30,2.1435
31,1.3835
32,0.8134600000000001
33,2.9035
34,0.43345
35,1.9535
36,0.43345
37,0.43345
38,0.43345
39,0.24345
40,1.9535
41,-0.89659
42,1.1935
43,-0.32656999999999997
44,0.24345
45,0.053439
46,-0.89659
47,1.0035
48,-1.0866
49,0.43345
50,-0.7065899999999999
51,0.24345
52,0.43345
53,-0.51658
54,1.0035
55,-1.0866
56,0.62346
57,-1.0866
58,0.053439
59,0.053439
60,-1.2766
61,0.24345
62,-1.2766
63,-0.13657
64,-0.89659
65,-0.7065899999999999
66,0.43345
67,-1.6566
68,0.24345
69,-1.6566
70,0.43345
71,-0.89659
72,-0.7065899999999999
73,1.1935
74,-0.89659
75,-0.51658
76,-0.32656999999999997
77,-1.2766
78,0.62346
79,-0.51658
80,-1.0866
81,1.3835
82,-1.0866
83,-0.13657
84,0.62346
85,-1.2766
86,0.43345
87,-0.51658
88,-0.7065899999999999
89,0.43345
90,-1.6566
91,-0.32656999999999997
92,0.24345
93,-1.6566
94,0.24345
95,-1.6566
