time,value
0,-0.35353
1,-0.35353
2,-0.35353
3,-0.35353
4,-0.35353
5,-0.35353
6,-0.35353
7,-0.35353
8,-0.35353
9,-0.35353
10,-0.35353
11,-0.35353
12,-0.35353
13,-0.35353
14,-0.35353
15,-0.35353
16,-0.35353
17,-0.35353
18,-0.35353
19,-0.35353
20,-0.35353
21,-0.35353
22,-0.35353
23,-0.35353
24,-0.35353
25,-0.35353
26,-0.35353
27,-0.35353
28,-0.35353
29,-0.35353
30,-0.35353
31,-0.35353
32,-0.35353
33,-0.35353
34,-0.35353
35,-0.35353
36,-0.35353
37,-0.35353
38,-0.35353
39,-0.35353
40,-0.35353
41,-0.35353
42,-0.35353
43,-0.35353
44,-0.35353
45,-0.35353
46,-0.35353
47,-0.35353
48,-0.35353
49,-0.35353
50,-0.35353
51,0.067957
52,4.7776
53,-0.31688
54,-0.35353
55,-0.35353
56,-0.35353
57,-0.35353
58,-0.35353
59,-0.35353
60,-0.35353
61,0.81931
62,5.419
63,2.7435
64,1.9555
65,1.9188
66,1.7722
67,1.9921
68,1.9372
69,1.4424
70,0.69103
71,0.47112
72,1.3141
73,1.2774
74,-0.35353
75,-0.35353
76,-0.35353
77,-0.35353
78,-0.35353
79,-0.35353
80,-0.35353
81,-0.35353
82,-0.35353
83,-0.35353
84,-0.35353
85,-0.35353
86,-0.35353
87,-0.35353
88,-0.35353
89,-0.35353
90,-0.35353
91,-0.35353
92,-0.35353
93,-0.35353
94,-0.35353
95,-0.35353
