time,value
0,1.2547
1,1.1618
2,-0.23235
3,-1.0688
4,-1.0688
5,-1.0688
6,0.13940999999999998
7,1.2547
8,0.97588
9,-1.0688
10,-1.0688
11,-1.0688
12,-1.0688
13,0.8829299999999999
14,1.1618
15,0.51117
16,-1.0688
17,-1.0688
18,-1.0688
19,-1.0688
20,1.0688
21,1.1618
22,0.23235
23,-1.0688
24,-1.0688
25,-1.0688
26,-1.0688
27,1.3476
28,1.0688
29,0.51117
30,-0.78999
31,0.41823
32,1.6265
33,1.0688
34,1.0688
35,1.0688
36,0.23235
37,-1.0688
38,-1.0688
39,-0.41823
40,1.1618
41,0.69705
42,-1.0688
43,-1.0688
44,0.78999
45,1.0688
46,0.32529
47,-1.0688
48,-1.0688
49,-1.0688
50,0.13940999999999998
51,1.1618
52,1.0688
53,-0.60411
54,-1.0688
55,-1.0688
56,0.97588
57,1.1618
58,-0.32529
59,-1.0688
60,-1.0688
61,-1.0688
62,0.69705
63,1.1618
64,0.78999
65,-1.0688
66,-1.0688
67,-0.78999
68,1.2547
69,1.1618
70,1.1618
71,1.0688
72,1.0688
73,0.78999
74,-1.0688
75,-1.0688
76,-1.0688
77,0.51117
78,1.1618
79,1.0688
80,-0.41823
81,-1.0688
82,-1.0688
83,-1.0688
84,-0.51117
85,1.3476
86,1.1618
87,1.0688
88,-0.41823
89,-1.0688
90,-1.0688
91,-0.41823
92,1.2547
93,1.1618
94,0.8829299999999999
95,-1.0688
