time,value
0,-0.49981000000000003
1,-0.49981000000000003
2,-0.49981000000000003
3,-0.49981000000000003
4,-0.49981000000000003
5,-0.49981000000000003
6,-0.49981000000000003
7,-0.49981000000000003
8,-0.49981000000000003
9,-0.49981000000000003
10,-0.49981000000000003
11,-0.49981000000000003
12,-0.060953
13,-0.49981000000000003
14,-0.49981000000000003
15,-0.49981000000000003
16,-0.49981000000000003
17,-0.49981000000000003
18,-0.49981000000000003
19,-0.49981000000000003
20,-0.060953
21,-0.49981000000000003
22,-0.49981000000000003
23,-0.49981000000000003
24,-0.49981000000000003
25,-0.49981000000000003
26,-0.49981000000000003
27,-0.49981000000000003
28,-0.49981000000000003
29,-0.49981000000000003
30,-0.49981000000000003
31,-0.49981000000000003
32,-0.49981000000000003
33,-0.49981000000000003
34,-0.49981000000000003
35,-0.49981000000000003
36,-0.49981000000000003
37,-0.49981000000000003
38,-0.49981000000000003
39,-0.49981000000000003
40,-0.20724
41,-0.49981000000000003
42,-0.49981000000000003
43,-0.49981000000000003
44,-0.49981000000000003
45,-0.49981000000000003
46,-0.49981000000000003
47,-0.49981000000000003
48,-0.49981000000000003
49,-0.49981000000000003
50,-0.49981000000000003
51,-0.49981000000000003
52,-0.49981000000000003
53,-0.49981000000000003
54,-0.49981000000000003
55,-0.49981000000000003
56,-0.20724
57,-0.49981000000000003
58,-0.49981000000000003
59,-0.49981000000000003
60,-0.49981000000000003
61,-0.49981000000000003
62,-0.49981000000000003
63,-0.49981000000000003
64,-0.49981000000000003
65,-0.49981000000000003
66,-0.49981000000000003
67,-0.49981000000000003
68,-0.49981000000000003
69,-0.49981000000000003
70,-0.49981000000000003
71,1.6945
72,0.67048
73,0.37790999999999997
74,0.5241899999999999
75,0.37790999999999997
76,0.5241899999999999
77,0.37790999999999997
78,0.5241899999999999
79,0.37790999999999997
80,0.37790999999999997
81,0.5241899999999999
82,0.37790999999999997
83,0.5241899999999999
84,1.5482
85,3.0111
86,3.0111
87,3.0111
88,3.0111
89,2.8648
90,2.7185
91,2.8648
92,3.0111
93,0.81676
94,0.5241899999999999
95,0.37790999999999997
