time,value
0,-0.064175
1,-0.26954
2,-0.064175
3,-0.26954
4,-0.26954
5,-0.064175
6,-0.26954
7,-0.064175
8,-0.26954
9,-0.064175
10,-0.26954
11,-0.26954
12,-0.064175
13,-0.26954
14,-0.064175
15,-0.26954
16,-0.064175
17,-0.26954
18,-0.064175
19,-0.26954
20,-0.26954
21,-0.064175
22,-0.26954
23,-0.064175
24,-0.26954
25,-0.064175
26,-0.26954
27,-0.26954
28,-0.064175
29,-0.26954
30,-0.064175
31,-0.26954
32,-0.064175
33,-0.26954
34,-0.064175
35,-0.26954
36,-0.26954
37,-0.064175
38,-0.26954
39,-0.064175
40,-0.26954
41,-0.064175
42,-0.26954
43,-0.26954
44,-0.064175
45,-0.26954
46,-0.064175
47,-0.26954
48,-0.064175
49,-0.26954
50,-0.26954
51,-0.064175
52,-0.26954
53,-0.064175
54,-0.26954
55,-0.064175
56,-0.26954
57,-0.26954
58,-0.064175
59,-0.26954
60,-0.26954
61,-0.064175
62,-0.26954
63,-0.26954
64,-0.064175
65,-0.26954
66,-0.064175
67,-0.26954
68,0.34655
69,-1.091
70,-1.5017
71,-1.5017
72,-1.5017
73,-1.5017
74,-1.5017
75,-0.8856200000000001
76,-0.064175
77,-0.26954
78,-0.064175
79,-0.26954
80,-0.26954
81,-0.064175
82,-0.26954
83,-0.064175
84,0.9626299999999999
85,3.427
86,3.2216
87,3.427
88,3.427
89,3.2216
90,2.1948
91,2.1948
92,2.1948
93,1.5787
94,-1.5017
95,-1.5017
