time,value
0,-0.26015
1,-0.26015
2,-0.26015
3,-0.26015
4,-0.26015
5,-0.26015
6,-0.26015
7,-0.26015
8,-0.26015
9,-0.26015
10,-0.26015
11,-0.26015
12,-0.26015
13,-0.26015
14,-0.26015
15,-0.26015
16,-0.26015
17,-0.26015
18,-0.26015
19,-0.26015
20,-0.26015
21,-0.26015
22,-0.26015
23,-0.26015
24,-0.26015
25,-0.26015
26,-0.26015
27,-0.26015
28,-0.26015
29,-0.26015
30,-0.26015
31,-0.26015
32,-0.26015
33,-0.26015
34,-0.26015
35,-0.26015
36,-0.26015
37,-0.26015
38,-0.26015
39,-0.26015
40,-0.26015
41,-0.26015
42,-0.26015
43,-0.26015
44,-0.26015
45,-0.26015
46,-0.26015
47,-0.26015
48,-0.26015
49,-0.26015
50,-0.26015
51,-0.26015
52,-0.26015
53,-0.26015
54,-0.26015
55,-0.26015
56,-0.26015
57,-0.26015
58,5.3419
59,0.93255
60,0.3362
61,-0.26015
62,-0.26015
63,-0.26015
64,-0.26015
65,-0.26015
66,-0.26015
67,-0.26015
68,-0.26015
69,-0.26015
70,5.4504
71,0.53499
72,-0.26015
73,-0.26015
74,-0.26015
75,-0.26015
76,-0.26015
77,-0.26015
78,-0.26015
79,-0.26015
80,-0.26015
81,-0.26015
82,-0.26015
83,-0.26015
84,-0.26015
85,-0.26015
86,4.5287
87,0.69763
88,1.818
89,2.2698
90,0.4627
91,-0.26015
92,-0.26015
93,-0.26015
94,-0.26015
95,-0.26015
