time,value
0,-0.37961
1,-0.28471
2,-0.37961
3,-0.28471
4,-0.37961
5,-0.28471
6,-0.28471
7,-0.37961
8,-0.28471
9,-0.37961
10,-0.28471
11,-0.37961
12,-0.28471
13,-0.37961
14,-0.28471
15,-0.37961
16,-0.28471
17,-0.37961
18,-0.28471
19,-0.37961
20,-0.28471
21,-0.37961
22,-0.28471
23,-0.37961
24,-0.28471
25,-0.37961
26,-0.28471
27,-0.37961
28,-0.28471
29,-0.37961
30,-0.28471
31,-0.37961
32,-0.28471
33,-0.37961
34,-0.28471
35,-0.37961
36,-0.28471
37,-0.37961
38,-0.28471
39,-0.37961
40,-0.28471
41,-0.37961
42,-0.28471
43,-0.37961
44,-0.28471
45,-0.37961
46,-0.28471
47,-0.37961
48,-0.28471
49,-0.37961
50,-0.28471
51,-0.37961
52,-0.28471
53,-0.66432
54,-0.66432
55,-0.66432
56,-0.66432
57,-0.66432
58,-0.66432
59,-0.66432
60,-0.47451000000000004
61,-0.37961
62,-0.28471
63,-0.37961
64,-0.37961
65,-0.28471
66,-0.37961
67,-0.37961
68,-0.37961
69,-0.28471
70,2.2777
71,2.6573
72,2.5624
73,2.4675
74,2.4675
75,1.7082
76,-0.37961
77,-0.37961
78,1.8980000000000001
79,2.6573
80,2.5624
81,2.5624
82,2.4675
83,2.4675
84,2.4675
85,1.9929
86,-0.66432
87,-0.66432
88,-0.66432
89,-0.66432
90,-0.66432
91,-0.66432
92,-0.66432
93,-0.66432
94,-0.66432
95,-0.66432
