time,value
0,-2.3857
1,-2.3877
2,-2.3896
3,-2.3916
4,-2.3916
5,-2.3916
6,-2.3915
7,-2.3912
8,-2.3907
9,-2.3883
10,-2.3855
11,-2.3848
12,-2.3837
13,-2.3827
14,-2.3794
15,-2.3778
16,-2.3765
17,-2.3746
18,-2.373
19,-2.3709
20,-2.369
21,-2.3685
22,-2.3659
23,-2.3637
24,-2.3608
25,-2.3584
26,-2.3534
27,-2.3508
28,-2.3474
29,-2.3438
30,-2.3409
31,-2.3371
32,-2.333
33,-2.3233
34,-2.3183
35,-2.3151
36,-2.3109
37,-2.3075
38,-2.3014
39,-2.2978
40,-2.2933
41,-2.2886
42,-2.2847
43,-2.2798
44,-2.2759
45,-2.2708
46,-2.2683
47,-2.2614
48,-2.2576
49,-2.2532
50,-2.2477
51,-2.2432
52,-2.2375
53,-2.2328
54,-2.2269
55,-2.221
56,-2.2161
57,-2.21
58,-2.2051
59,-2.2113
60,-2.2105
61,-2.2041
62,-2.1976
63,-2.1924
64,-2.1858
65,-2.1819
66,-2.1751
67,-2.1697
68,-2.1628
69,-2.1559
70,-2.1572
71,-2.1584
72,-2.1527
73,-2.1455
74,-2.1398
75,-2.1325
76,-2.1252
77,-2.1193
78,-2.1119
79,-2.1049
80,-2.0956
81,-2.0896
82,-2.0821
83,-2.0746
84,-2.0674
85,-2.0598
86,-2.0537
87,-2.0467
88,-2.0403
89,-2.0329
90,-2.0253
91,-2.0179
92,-2.0102
93,-2.004
94,-1.9974
95,-1.9909999999999999
96,-1.9849
97,-1.9771
98,-1.9697
99,-1.9619
100,-1.9544
101,-1.9455
102,-1.9396
103,-1.9333
104,-1.9243
105,-1.9180000000000001
106,-1.91
107,-1.905
108,-1.8957
109,-1.8878
110,-1.8803
111,-1.8723
112,-1.8659
113,-1.8589
114,-1.8528
115,-1.8453
116,-1.8373
117,-1.8297
118,-1.8217
119,-1.8152
120,-1.8065
121,-1.7994
122,-1.7914
123,-1.7822
124,-1.7768
125,-1.768
126,-1.7616
127,-1.7524
128,-1.7459
129,-1.7399
130,-1.7318
131,-1.7253
132,-1.7172
133,-1.7096
134,-1.7014
135,-1.6944
136,-1.6857
137,-1.6792
138,-1.6727
139,-1.6634
140,-1.6568
141,-1.6486
142,-1.6417
143,-1.6363
144,-1.6281
145,-1.6215
146,-1.6122
147,-1.6056
148,-1.5985
149,-1.59
150,-1.5834
151,-1.5751
152,-1.5685
153,-1.5592
154,-1.5525
155,-1.5442
156,-1.5361
157,-1.5304
158,-1.5219999999999998
159,-1.5154
160,-1.506
161,-1.4993
162,-1.4909
163,-1.4825
164,-1.4755
165,-1.4671
166,-1.4604
167,-1.452
168,-1.4452
169,-1.4358
170,-1.4274
171,-1.4206
172,-1.4136
173,-1.4080000000000001
174,-1.4002
175,-1.3935
176,-1.385
177,-1.3765
178,-1.3687
179,-1.3602
180,-1.3534
181,-1.3448
182,-1.3378
183,-1.3313
184,-1.3228
185,-1.3159999999999998
186,-1.3074
187,-1.2996
188,-1.291
189,-1.2842
190,-1.2764
191,-1.27
192,-1.2639
193,-1.2553
194,-1.2485
195,-1.2398
196,-1.2312
197,-1.2243
198,-1.2157
199,-1.2122
200,-1.2087
201,-1.2018
202,-1.2001
203,-1.1931
204,-1.1862
205,-1.1775
206,-1.1696
207,-1.1609
208,-1.1539
209,-1.1443
210,-1.1382
211,-1.1321
212,-1.1234
213,-1.1164
214,-1.1076
215,-1.1006
216,-1.0919
217,-1.0831
218,-1.0761
219,-1.0673
220,-1.0594
221,-1.0506
222,-1.0436
223,-1.0347
224,-1.0259
225,-1.0188
226,-1.0118
227,-1.0092
228,-0.9986700000000001
229,-0.99077
230,-0.98734
231,-0.97767
232,-0.9759
233,-0.9705799999999999
234,-0.9635
235,-0.95463
236,-0.9475299999999999
237,-0.93784
238,-0.92895
239,-0.92184
240,-0.91763
241,-0.9134200000000001
242,-0.9037299999999999
243,-0.8966200000000001
244,-0.8877299999999999
245,-0.87802
246,-0.8709
247,-0.8619899999999999
248,-0.8558399999999999
249,-0.85005
250,-0.8421299999999999
251,-0.8342
252,-0.82529
253,-0.81816
254,-0.80923
255,-0.8024899999999999
256,-0.79474
257,-0.78583
258,-0.77789
259,-0.76837
260,-0.76339
261,-0.75626
262,-0.7491300000000001
263,-0.74021
264,-0.73128
265,-0.72413
266,-0.71441
267,-0.70725
268,-0.6983
269,-0.69113
270,-0.6821699999999999
271,-0.6732
272,-0.66602
273,-0.6603600000000001
274,-0.6534399999999999
275,-0.64447
276,-0.6372899999999999
277,-0.62832
278,-0.61933
279,-0.61214
280,-0.60315
281,-0.59519
282,-0.58618
283,-0.57898
284,-0.56996
285,-0.56094
286,-0.55372
287,-0.54469
288,-0.53746
289,-0.52842
290,-0.5211899999999999
291,-0.5121399999999999
292,-0.50308
293,-0.49583
294,-0.48677
295,-0.48203999999999997
296,-0.47622
297,-0.46898
298,-0.45992
299,-0.45085
300,-0.4436
301,-0.43451999999999996
302,-0.42726000000000003
303,-0.42071000000000003
304,-0.42173999999999995
305,-0.41768999999999995
306,-0.40858
307,-0.40129000000000004
308,-0.39216999999999996
309,-0.38487
310,-0.37574
311,-0.36635
312,-0.36174
313,-0.35262
314,-0.34531999999999996
315,-0.33619
316,-0.32888
317,-0.31906
318,-0.30992
319,-0.3026
320,-0.29346
321,-0.28888
322,-0.2795
323,-0.27219
324,-0.26305
325,-0.2539
326,-0.24658000000000002
327,-0.23675
328,-0.22941999999999999
329,-0.22025999999999998
330,-0.21293
331,-0.20770999999999998
332,-0.20085
333,-0.19217
334,-0.18691
335,-0.18074
336,-0.1716
337,-0.16427999999999998
338,-0.15444000000000002
339,-0.14529
340,-0.13797
341,-0.1288
342,-0.12147000000000001
343,-0.11279000000000002
344,-0.10825
345,-0.10024
346,-0.09108
347,-0.083075
348,-0.073909
349,-0.066574
350,-0.0574
351,-0.050059
352,-0.044869
353,-0.036188
354,-0.028852999999999997
355,-0.019011
356,-0.013996999999999999
357,-0.0087855
358,-0.0014565
359,0.008383499999999999
360,0.017547999999999998
361,0.021407
362,0.027785
363,0.03511
364,0.044949
365,0.054787
366,0.059335
367,0.066189
368,0.073513
369,0.08335
370,0.090678
371,0.099839
372,0.10620999999999998
373,0.11192
374,0.12107000000000001
375,0.1284
376,0.13756
377,0.14489000000000002
378,0.15406
379,0.1639
380,0.17057
381,0.17975
382,0.1871
383,0.19627999999999998
384,0.20363
385,0.21281999999999998
386,0.22202
387,0.22938000000000003
388,0.23858000000000001
389,0.24594000000000002
390,0.2558
391,0.26316999999999996
392,0.27238
393,0.28159
394,0.28906
395,0.29286
396,0.30086999999999997
397,0.31008
398,0.31745999999999996
399,0.32666999999999996
400,0.33589
401,0.34391
402,0.35313
403,0.36051
404,0.36974
405,0.37713
406,0.38338
407,0.39084
408,0.39821999999999996
409,0.40744
410,0.41483000000000003
411,0.42406000000000005
412,0.43145
413,0.44068
414,0.44993
415,0.45732
416,0.46657
417,0.47397
418,0.47331999999999996
419,0.47455
420,0.47455
421,0.4801
422,0.48381
423,0.48381
424,0.48566000000000004
425,0.48877
426,0.49191
427,0.49686
428,0.5061100000000001
429,0.51351
430,0.52276
431,0.5301600000000001
432,0.53942
433,0.53878
434,0.54311
435,0.55238
436,0.5598
437,0.56907
438,0.5758800000000001
439,0.58517
440,0.59445
441,0.60188
442,0.6087100000000001
443,0.60817
444,0.61441
445,0.6218600000000001
446,0.63116
447,0.64047
448,0.6479199999999999
449,0.65723
450,0.66469
451,0.674
452,0.6782199999999999
453,0.68743
454,0.6967399999999999
455,0.7042
456,0.7135100000000001
457,0.72097
458,0.73029
459,0.73775
460,0.74707
461,0.7564
462,0.76386
463,0.7731899999999999
464,0.77276
465,0.77478
466,0.78169
467,0.79104
468,0.7973899999999999
469,0.79702
470,0.80152
471,0.80096
472,0.7982
473,0.7954600000000001
474,0.7932899999999999
475,0.79166
476,0.7854899999999999
477,0.78093
478,0.77235
479,0.76564
480,0.7611100000000001
481,0.75359
482,0.74419
483,0.73614
484,0.7267399999999999
485,0.71922
486,0.70982
487,0.70124
488,0.69723
489,0.68918
490,0.68166
491,0.67227
492,0.6642100000000001
493,0.65482
494,0.64542
495,0.6379100000000001
496,0.62852
497,0.6210100000000001
498,0.6116199999999999
499,0.60411
500,0.59473
501,0.5888100000000001
502,0.58344
503,0.57405
504,0.5665399999999999
505,0.55661
506,0.54911
507,0.54347
508,0.53918
509,0.53113
510,0.52254
511,0.52012
512,0.51395
513,0.50965
514,0.50912
515,0.50562
516,0.50375
517,0.49436
518,0.48683999999999994
519,0.47746000000000005
520,0.4737
521,0.47346000000000005
522,0.46462
523,0.46252
524,0.46363000000000004
525,0.46175
526,0.45799999999999996
527,0.45238999999999996
528,0.45238999999999996
529,0.44996
530,0.44775
531,0.44501
532,0.43963
533,0.43025
534,0.42086999999999997
535,0.41336999999999996
536,0.40344
537,0.39594
538,0.38656999999999997
539,0.38063
540,0.37524
541,0.36586
542,0.35836
543,0.34898
544,0.34148
545,0.33155999999999997
546,0.32406
547,0.31866
548,0.31085
549,0.30335
550,0.29341999999999996
551,0.28592
552,0.28186
553,0.27836
554,0.26898
555,0.25905
556,0.25155
557,0.24695999999999999
558,0.24213
559,0.23274
560,0.22469
561,0.21664
562,0.21208000000000002
563,0.20536999999999997
564,0.19732
565,0.19332
566,0.18662
567,0.1791
568,0.1697
569,0.15977
570,0.15225
571,0.14502
572,0.14103
573,0.13162000000000001
574,0.12357
575,0.11364
576,0.10912999999999999
577,0.10296
578,0.093551
579,0.085499
580,0.07933
581,0.07484500000000001
582,0.068676
583,0.059258000000000005
584,0.051205999999999995
585,0.04452
586,0.040572000000000004
587,0.03252
588,0.023098
589,0.015562000000000001
590,0.0061424999999999995
591,-0.0019095
592,-0.011323999999999999
593,-0.018855
594,-0.028267
595,-0.034959
596,-0.038919
597,-0.046971
598,-0.054505
599,-0.063921
600,-0.071451
601,-0.081387
602,-0.090796
603,-0.09832300000000001
604,-0.10772999999999999
605,-0.11442999999999999
606,-0.12028
607,-0.12645
608,-0.13587
609,-0.14528
610,-0.1528
611,-0.16274
612,-0.17026
613,-0.17966
614,-0.18717999999999999
615,-0.19441
616,-0.20027999999999999
617,-0.20781
618,-0.21721
619,-0.22526
620,-0.23465999999999998
621,-0.24219000000000002
622,-0.2467
623,-0.2534
624,-0.26145
625,-0.27086
626,-0.27755
627,-0.28204
628,-0.28409
629,-0.2899
630,-0.29933000000000004
631,-0.30688000000000004
632,-0.31682
633,-0.32436
634,-0.33103
635,-0.33307
636,-0.33746
637,-0.33994
638,-0.3419
639,-0.34713
640,-0.35519
641,-0.36136999999999997
642,-0.36469
643,-0.36469
644,-0.36657
645,-0.36843000000000004
646,-0.37072
647,-0.37117
648,-0.36917
649,-0.3667
650,-0.35909
651,-0.35001
652,-0.34239
653,-0.34265
654,-0.33969
655,-0.33016
656,-0.32063
657,-0.313
658,-0.30346
659,-0.29624
660,-0.2867
661,-0.27907
662,-0.26952
663,-0.25997
664,-0.25506
665,-0.25517
666,-0.24752
667,-0.23836
668,-0.23071
669,-0.22845
670,-0.22196
671,-0.21506
672,-0.21503000000000003
673,-0.20773000000000003
674,-0.20307999999999998
675,-0.20262
676,-0.19338
677,-0.18378
678,-0.17645
679,-0.16684000000000002
680,-0.15916
681,-0.14955
682,-0.14379
683,-0.13994
684,-0.13226
685,-0.13033
686,-0.12264000000000001
687,-0.11495999999999999
688,-0.105
689,-0.09730499999999999
690,-0.08769199999999999
691,-0.084379
692,-0.07948200000000001
693,-0.069875
694,-0.062188
695,-0.052580999999999996
696,-0.04297
697,-0.034934
698,-0.025323
699,-0.017634
700,-0.0080215
701,-0.005056499999999999
702,0.0001945
703,0.009799500000000001
704,0.017838
705,0.027444999999999997
706,0.028863
707,0.0357
708,0.043379
709,0.05297999999999999
710,0.062583
711,0.070622
712,0.080225
713,0.087908
714,0.097513
715,0.1052
716,0.1148
717,0.12284
718,0.12618
719,0.13266
720,0.14034000000000002
721,0.1503
722,0.15798
723,0.16758
724,0.1725
725,0.17778
726,0.18738
727,0.19505999999999998
728,0.20465999999999998
729,0.2127
730,0.2223
731,0.2319
732,0.23958000000000002
733,0.24918
734,0.25687
735,0.26647
736,0.26946
737,0.27282
738,0.28242
739,0.2901
740,0.30006
741,0.30774
742,0.31734
743,0.32502
744,0.33462
745,0.34423000000000004
746,0.35191
747,0.36152
748,0.36344
749,0.36763
750,0.37795
751,0.38215
752,0.38478
753,0.39282
754,0.39666
755,0.4005
756,0.4101
757,0.41971
758,0.42738999999999994
759,0.43700000000000006
760,0.44468
761,0.45428999999999997
762,0.46198
763,0.47158
764,0.48118999999999995
765,0.48888000000000004
766,0.49849
767,0.50618
768,0.5161399999999999
769,0.52383
770,0.5334399999999999
771,0.54306
772,0.55075
773,0.56037
774,0.56806
775,0.57768
776,0.58537
777,0.59499
778,0.60427
779,0.61197
780,0.62159
781,0.62962
782,0.63925
783,0.64695
784,0.65657
785,0.66619
786,0.67389
787,0.68352
788,0.69122
789,0.70085
790,0.70855
791,0.71818
792,0.7278100000000001
793,0.73359
794,0.7358399999999999
795,0.74195
796,0.7522300000000001
797,0.75641
798,0.7609199999999999
799,0.7667
800,0.76862
801,0.77825
802,0.78595
803,0.7955800000000001
804,0.8055399999999999
805,0.81324
806,0.8228700000000001
807,0.83057
808,0.8402
809,0.84503
810,0.8521299999999999
811,0.86175
812,0.86945
813,0.87908
814,0.88679
815,0.89641
816,0.90412
817,0.91375
818,0.92338
819,0.9310799999999999
820,0.9407200000000001
821,0.94842
822,0.9561299999999999
823,0.95678
824,0.9587
825,0.9587
826,0.96641
827,0.96834
828,0.96834
829,0.96898
830,0.97219
831,0.9738100000000001
832,0.9815200000000001
833,0.9892200000000001
834,0.99885
835,1.0066
836,1.0165
837,1.0223
838,1.0242
839,1.0338
840,1.0338
841,1.0393
842,1.0464
843,1.0557
844,1.0634
845,1.0692
846,1.0721
847,1.0798
848,1.0894
849,1.0972
850,1.1068
851,1.1145
852,1.1242
853,1.1338
854,1.1415
855,1.1512
856,1.1589
857,1.1685
858,1.1782
859,1.1862
860,1.1897
861,1.1977
862,1.2073
863,1.2154
864,1.2221
865,1.2253
866,1.2329999999999999
867,1.2429
868,1.2506
869,1.2603
870,1.268
871,1.2776
872,1.2873
873,1.295
874,1.3043
875,1.3119999999999998
876,1.3172
877,1.3179
878,1.327
879,1.3299
880,1.3307
881,1.34
882,1.3430000000000002
883,1.3416
884,1.3404
885,1.339
886,1.3377
887,1.3366
888,1.3352
889,1.3342
890,1.3329
891,1.3268
892,1.3185
893,1.3153
894,1.3093
895,1.3008
896,1.2978
897,1.2896
898,1.2835
899,1.2804
900,1.2724
901,1.2647
902,1.255
903,1.2472
904,1.2375
905,1.2298
906,1.2201
907,1.2104
908,1.2026
909,1.1929
910,1.1852
911,1.1832
912,1.1774
913,1.1677
914,1.158
915,1.1561
916,1.1522
917,1.1445
918,1.1348
919,1.1249
920,1.1171
921,1.111
922,1.1081
923,1.1018
924,1.0938
925,1.0841
926,1.0776
927,1.0747
928,1.065
929,1.0573
930,1.0473
931,1.0396
932,1.0299
933,1.0268
934,1.0207
935,1.011
936,1.0033
937,0.99356
938,0.9855700000000001
939,0.9778100000000001
940,0.9758700000000001
941,0.97005
942,0.9661700000000001
943,0.9640000000000001
944,0.9543
945,0.9480200000000001
946,0.9449299999999999
947,0.9352299999999999
948,0.92724
949,0.9175399999999999
950,0.9097799999999999
951,0.90202
952,0.9000799999999999
953,0.8938
954,0.88387
955,0.8814799999999999
956,0.8773700000000001
957,0.86939
958,0.86745
959,0.8635700000000001
960,0.8538600000000001
961,0.84416
962,0.8364
963,0.82647
964,0.81871
965,0.80901
966,0.80125
967,0.79155
968,0.78185
969,0.77409
970,0.76439
971,0.75663
972,0.74693
973,0.7421300000000001
974,0.73952
975,0.72982
976,0.72205
977,0.71235
978,0.70436
979,0.69466
980,0.68496
981,0.6806300000000001
982,0.6775800000000001
983,0.66982
984,0.65989
985,0.65213
986,0.64759
987,0.6409100000000001
988,0.6331399999999999
989,0.62343
990,0.61545
991,0.60574
992,0.5997
993,0.5967100000000001
994,0.5867899999999999
995,0.57881
996,0.5691
997,0.5667399999999999
998,0.56379
999,0.55581
1000,0.5495899999999999
1001,0.54667
1002,0.53889
1003,0.52917
1004,0.5212100000000001
1005,0.51149
1006,0.50371
1007,0.501
1008,0.4946
1009,0.48683000000000004
1010,0.4771
1011,0.46933
1012,0.4596
1013,0.45183
1014,0.44192
1015,0.43218999999999996
1016,0.42441999999999996
1017,0.4147
1018,0.40692
1019,0.40421999999999997
1020,0.40173000000000003
1021,0.392
1022,0.38228
1023,0.37431
1024,0.36459
1025,0.35857
1026,0.35573
1027,0.34583
1028,0.33804
1029,0.32814
1030,0.32036
1031,0.31063
1032,0.31011
1033,0.30358
1034,0.29385
1035,0.28607
1036,0.27634000000000003
1037,0.26838
1038,0.25865
1039,0.25087
1040,0.24114000000000002
1041,0.23141
1042,0.22879000000000002
1043,0.22455999999999998
1044,0.21678000000000003
1045,0.20704
1046,0.19926
1047,0.18953
1048,0.1798
1049,0.17785
1050,0.17007
1051,0.16228
1052,0.15255
1053,0.15044000000000002
1054,0.1446
1055,0.13485999999999998
1056,0.12708
1057,0.11735
1058,0.10957
1059,0.09966599999999999
1060,0.09188099999999999
1061,0.082151
1062,0.072421
1063,0.064636
1064,0.058799000000000004
1065,0.056853999999999995
1066,0.049069
1067,0.041287
1068,0.037396
1069,0.03333
1070,0.025376
1071,0.015646
1072,0.0078635
1073,-0.0016925
1074,-0.0034645
1075,-0.0094755
1076,-0.01955
1077,-0.023614
1078,-0.025899000000000002
1079,-0.033852
1080,-0.037745
1081,-0.041636
1082,-0.049421
1083,-0.059153
1084,-0.067105
1085,-0.076837
1086,-0.084622
1087,-0.09435199999999999
1088,-0.1007
1089,-0.1033
1090,-0.11302999999999999
1091,-0.12097999999999999
1092,-0.13071
1093,-0.13314
1094,-0.1357
1095,-0.14559
1096,-0.15008
1097,-0.15636
1098,-0.16415
1099,-0.17389000000000002
1100,-0.17987999999999998
1101,-0.17987999999999998
1102,-0.18016
1103,-0.18057
1104,-0.18070999999999998
1105,-0.18123
1106,-0.17770999999999998
1107,-0.17003
1108,-0.16660999999999998
1109,-0.16305
1110,-0.15525
1111,-0.1455
1112,-0.13781
1113,-0.12805999999999998
1114,-0.12242
1115,-0.11904
1116,-0.10928
1117,-0.10148
1118,-0.091722
1119,-0.08392000000000001
1120,-0.074263
1121,-0.066458
1122,-0.06079299999999999
1123,-0.05929299999999999
1124,-0.051573
1125,-0.045887
1126,-0.046207
1127,-0.044625
1128,-0.044896
1129,-0.035135
1130,-0.025436
1131,-0.017626
1132,-0.014022
1133,-0.010229
1134,-0.0005185
1135,0.0092445
1136,0.015000999999999999
1137,0.01681
1138,0.024622
1139,0.034385
1140,0.042197000000000005
1141,0.051962
1142,0.057821000000000004
1143,0.059966
1144,0.067826
1145,0.075638
1146,0.085401
1147,0.093213
1148,0.10298
1149,0.11274
1150,0.12055
1151,0.12636
1152,0.12830999999999998
1153,0.13808
1154,0.14589000000000002
1155,0.15175
1156,0.15375
1157,0.16155999999999998
1158,0.17132999999999998
1159,0.17914000000000002
1160,0.18895
1161,0.19676
1162,0.20651999999999998
1163,0.21629
1164,0.2241
1165,0.23206999999999997
1166,0.23424
1167,0.24205
1168,0.24986
1169,0.25963
1170,0.26939
1171,0.2772
1172,0.28696
1173,0.29477
1174,0.30454000000000003
1175,0.31235
1176,0.32216999999999996
1177,0.33193
1178,0.33974
1179,0.34951
1180,0.35548
1181,0.35743
1182,0.36524
1183,0.37501
1184,0.38483
1185,0.39081
1186,0.39478
1187,0.40265
1188,0.41241000000000005
1189,0.41827
1190,0.42022
1191,0.42998000000000003
1192,0.43778999999999996
1193,0.44755
1194,0.45543
1195,0.46518999999999994
1196,0.47495
1197,0.48276
1198,0.49251999999999996
1199,0.50033
1200,0.5100899999999999
1201,0.5142
1202,0.51615
1203,0.52591
1204,0.53385
1205,0.54368
1206,0.54766
1207,0.55156
1208,0.5593
1209,0.56112
1210,0.57075
1211,0.5765399999999999
1212,0.58038
1213,0.58624
1214,0.596
1215,0.6038100000000001
1216,0.61357
1217,0.62334
1218,0.63115
1219,0.6409100000000001
1220,0.64872
1221,0.6584800000000001
1222,0.6662899999999999
1223,0.67599
1224,0.68576
1225,0.69357
1226,0.70333
1227,0.71114
1228,0.7209
1229,0.7287100000000001
1230,0.73457
1231,0.73848
1232,0.7462300000000001
1233,0.74807
1234,0.75192
1235,0.76158
1236,0.76543
1237,0.7673800000000001
1238,0.77715
1239,0.78491
1240,0.79467
1241,0.80248
1242,0.8122
1243,0.81396
1244,0.8216899999999999
1245,0.8314600000000001
1246,0.8392700000000001
1247,0.84903
1248,0.8568399999999999
1249,0.8665700000000001
1250,0.8763299999999999
1251,0.8841399999999999
1252,0.89391
1253,0.9017200000000001
1254,0.9114899999999999
1255,0.9193
1256,0.9290700000000001
1257,0.9388299999999999
1258,0.9466399999999999
1259,0.95641
1260,0.9642200000000001
1261,0.9739899999999999
1262,0.9818
1263,0.99156
1264,1.0013
1265,1.0091
1266,1.0189
1267,1.0267
1268,1.0365
1269,1.0443
1270,1.0541
1271,1.0638
1272,1.0717
1273,1.0814
1274,1.0893
1275,1.099
1276,1.1068
1277,1.1166
1278,1.1263
1279,1.1341
1280,1.1439
1281,1.1518
1282,1.1615
1283,1.1693
1284,1.1791
1285,1.1889
1286,1.1967
1287,1.2064
1288,1.2142
1289,1.2164
1290,1.2204
1291,1.2302
1292,1.2399
1293,1.2477
1294,1.2575
1295,1.2653
1296,1.2673
1297,1.2712
1298,1.2769
1299,1.2808
1300,1.2885
1301,1.2963
1302,1.2982
1303,1.3041
1304,1.3139
1305,1.3217
1306,1.3314
1307,1.3392
1308,1.349
1309,1.3568
1310,1.3666
1311,1.3763
1312,1.3841
1313,1.3939
1314,1.4017
1315,1.4056
1316,1.4076
1317,1.4173
1318,1.4193
1319,1.4212
1320,1.431
1321,1.4389
1322,1.4486
1323,1.4488
1324,1.4567
1325,1.4665
1326,1.4743
1327,1.484
1328,1.4919
1329,1.5016
1330,1.5094
1331,1.5192
1332,1.5290000000000001
1333,1.5308
1334,1.5365
1335,1.5443
1336,1.5541
1337,1.5618
1338,1.5656
1339,1.5753
1340,1.5831
1341,1.5909
1342,1.5927
1343,1.5946
1344,1.5945
1345,1.6023
1346,1.6081
1347,1.6081
1348,1.61
1349,1.61
1350,1.61
1351,1.61
1352,1.61
1353,1.61
1354,1.6101
1355,1.6101
1356,1.6082
1357,1.6083
1358,1.6083
1359,1.6025
1360,1.5928
1361,1.5909
1362,1.587
1363,1.5792
1364,1.5772
1365,1.5714
1366,1.5636
1367,1.5618
1368,1.556
1369,1.5462
1370,1.5384
1371,1.5287
1372,1.5189
1373,1.5111
1374,1.5014
1375,1.4995
1376,1.4937
1377,1.4858
1378,1.4761
1379,1.4663
1380,1.4644
1381,1.4604
1382,1.4526
1383,1.4428
1384,1.435
1385,1.4253
1386,1.4214
1387,1.4176
1388,1.4079
1389,1.4062
1390,1.3985
1391,1.3907
1392,1.3809
1393,1.3712
1394,1.3634
1395,1.3597
1396,1.3559999999999999
1397,1.3462
1398,1.3384
1399,1.3286
1400,1.3189
1401,1.3111
1402,1.3013
1403,1.2935
1404,1.2838
1405,1.276
1406,1.2662
1407,1.2564
1408,1.2525
1409,1.2506
1410,1.2429
1411,1.2333
1412,1.2314
1413,1.2275
1414,1.2216
1415,1.2196
1416,1.2116
1417,1.2038
1418,1.2019
1419,1.1962
1420,1.1884
1421,1.1787
1422,1.1748
1423,1.1729
1424,1.1651
1425,1.1554
1426,1.1456
1427,1.1378
1428,1.128
1429,1.1203
1430,1.1105
1431,1.1027
1432,1.0929
1433,1.0831
1434,1.0753
1435,1.0655
1436,1.0577
1437,1.048
1438,1.0402
1439,1.0304
1440,1.0206
1441,1.0129
1442,1.0032
1443,0.99534
1444,0.9876
1445,0.98595
1446,0.9801700000000001
1447,0.97041
1448,0.9626
1449,0.95285
1450,0.9451200000000001
1451,0.9373100000000001
1452,0.9353600000000001
1453,0.92755
1454,0.9256
1455,0.9216200000000001
1456,0.91186
1457,0.9041299999999999
1458,0.8943700000000001
1459,0.88656
1460,0.8768799999999999
1461,0.86713
1462,0.86339
1463,0.8598299999999999
1464,0.85211
1465,0.84235
1466,0.8326899999999999
1467,0.83111
1468,0.82749
1469,0.8196899999999999
1470,0.81003
1471,0.80223
1472,0.80028
1473,0.7946300000000001
1474,0.78693
1475,0.78128
1476,0.7794399999999999
1477,0.77174
1478,0.76979
1479,0.76199
1480,0.7522399999999999
1481,0.74444
1482,0.73468
1483,0.7269899999999999
1484,0.71724
1485,0.70944
1486,0.6996899999999999
1487,0.68994
1488,0.68213
1489,0.67869
1490,0.67514
1491,0.6653899999999999
1492,0.65759
1493,0.64784
1494,0.6380899999999999
1495,0.63042
1496,0.6206699999999999
1497,0.61287
1498,0.60312
1499,0.59532
1500,0.58558
1501,0.5758300000000001
1502,0.56803
1503,0.55828
1504,0.55048
1505,0.54074
1506,0.53294
1507,0.5231899999999999
1508,0.51344
1509,0.50565
1510,0.49577
1511,0.48798
1512,0.47823000000000004
1513,0.47043
1514,0.46081000000000005
1515,0.45106999999999997
1516,0.44327
1517,0.43351999999999996
1518,0.42573
1519,0.41598
1520,0.40818000000000004
1521,0.39844
1522,0.38869000000000004
1523,0.38284
1524,0.37895
1525,0.37115
1526,0.36349000000000004
1527,0.35985
1528,0.3522
1529,0.34259
1530,0.33647
1531,0.33439
1532,0.32827
1533,0.31866
1534,0.31698000000000004
1535,0.31322
1536,0.30376
1537,0.29596999999999996
1538,0.28998
1539,0.28581
1540,0.27593
1541,0.26618
1542,0.25839
1543,0.25449
1544,0.25032
1545,0.24058000000000002
1546,0.23278000000000001
1547,0.22304000000000002
1548,0.2133
1549,0.2055
1550,0.19576
1551,0.18796
1552,0.18017
1553,0.17822000000000002
1554,0.17043
1555,0.16069
1556,0.15874000000000002
1557,0.15289
1558,0.1451
1559,0.13522
1560,0.12742
1561,0.11767999999999999
1562,0.11142
1563,0.11115
1564,0.1014
1565,0.09360800000000001
1566,0.083864
1567,0.076068
1568,0.068274
1569,0.066326
1570,0.05853
1571,0.048788
1572,0.040994
1573,0.035286
1574,0.033477
1575,0.029722000000000002
1576,0.019981
1577,0.012188
1578,0.0082915
1579,0.0064885
1580,-0.0010105000000000001
1581,-0.0065565
1582,-0.0078905
1583,-0.017312
1584,-0.021205
1585,-0.022992
1586,-0.030619
1587,-0.040024000000000004
1588,-0.041636
1589,-0.045359
1590,-0.051198
1591,-0.054919
1592,-0.06465
1593,-0.06784
1594,-0.07119199999999999
1595,-0.080916
1596,-0.088697
1597,-0.09842100000000001
1598,-0.10601
1599,-0.11574000000000001
1600,-0.12352
1601,-0.12684
1602,-0.12800999999999998
1603,-0.12780999999999998
1604,-0.12700999999999998
1605,-0.12619
1606,-0.12513
1607,-0.12491
1608,-0.12426
1609,-0.12314000000000001
1610,-0.12028
1611,-0.11569000000000002
1612,-0.10794000000000001
1613,-0.09800700000000001
1614,-0.09025
1615,-0.080553
1616,-0.074264
1617,-0.071368
1618,-0.06531
1619,-0.057557000000000004
1620,-0.047623
1621,-0.039869999999999996
1622,-0.030177
1623,-0.023389
1624,-0.020709
1625,-0.011022
1626,-0.0032705
1627,0.006664499999999999
1628,0.014415
1629,0.024104
1630,0.033793000000000004
1631,0.038163
1632,0.041357
1633,0.049104
1634,0.058788
1635,0.068727
1636,0.076474
1637,0.086413
1638,0.089371
1639,0.095698
1640,0.10344
1641,0.11312
1642,0.12280999999999999
1643,0.13055
1644,0.14023
1645,0.14798
1646,0.15792
1647,0.16566
1648,0.17535
1649,0.18503
1650,0.19278
1651,0.19716
1652,0.1991
1653,0.20878000000000002
1654,0.21653000000000003
1655,0.22428
1656,0.22646999999999998
1657,0.2306
1658,0.24028000000000002
1659,0.24803000000000003
1660,0.25772
1661,0.25965
1662,0.26429
1663,0.27397
1664,0.28171999999999997
1665,0.2914
1666,0.29915
1667,0.30883
1668,0.31684
1669,0.32652
1670,0.33621
1671,0.3389
1672,0.3438
1673,0.35155
1674,0.36123
1675,0.36898000000000003
1676,0.37866
1677,0.3886
1678,0.39634
1679,0.40603
1680,0.41376999999999997
1681,0.42346000000000006
1682,0.43121000000000004
1683,0.44114
1684,0.44888999999999996
1685,0.45185
1686,0.45816999999999997
1687,0.46592
1688,0.4756
1689,0.48528000000000004
1690,0.49303
1691,0.50297
1692,0.51071
1693,0.5204
1694,0.5281399999999999
1695,0.53783
1696,0.54751
1697,0.5552600000000001
1698,0.56495
1699,0.5726899999999999
1700,0.58238
1701,0.59013
1702,0.59333
1703,0.60159
1704,0.60934
1705,0.61902
1706,0.6267699999999999
1707,0.63671
1708,0.64445
1709,0.6541399999999999
1710,0.66382
1711,0.6696300000000001
1712,0.67157
1713,0.6793100000000001
1714,0.68319
1715,0.6873199999999999
1716,0.6975100000000001
1717,0.70745
1718,0.71519
1719,0.71907
1720,0.72177
1721,0.7317100000000001
1722,0.73442
1723,0.73935
1724,0.74902
1725,0.75676
1726,0.76644
1727,0.77445
1728,0.78413
1729,0.79187
1730,0.7976800000000001
1731,0.80155
1732,0.8095600000000001
1733,0.81202
1734,0.81615
1735,0.82636
1736,0.83049
1737,0.83436
1738,0.84404
1739,0.85178
1740,0.86146
1741,0.8692
1742,0.8791399999999999
1743,0.88882
1744,0.89656
1745,0.9062399999999999
1746,0.9137299999999999
1747,0.9236700000000001
1748,0.93115
1749,0.94109
1750,0.9507700000000001
1751,0.95852
1752,0.9682
1753,0.9759399999999999
1754,0.9856299999999999
1755,0.9886
1756,0.9944
1757,1.0041
1758,1.0118
1759,1.0215
1760,1.0293
1761,1.0307
1762,1.0343
1763,1.044
1764,1.0537
1765,1.0614
1766,1.0711
1767,1.0789
1768,1.0821
1769,1.0881
1770,1.0978
1771,1.1075
1772,1.1152
1773,1.1249
1774,1.1329
1775,1.1426
1776,1.1504
1777,1.16
1778,1.1697
1779,1.1775
1780,1.1872
1781,1.1901
1782,1.1928
1783,1.1931
1784,1.1989
1785,1.2027
1786,1.2066
1787,1.2163
1788,1.2238
1789,1.2335
1790,1.2354
1791,1.2412
1792,1.2509
1793,1.2528
1794,1.2587
1795,1.2664
1796,1.2761
1797,1.2858
1798,1.2935
1799,1.3032
1800,1.3112
1801,1.3209
1802,1.3286
1803,1.3383
1804,1.3463
1805,1.3493
1806,1.3556
1807,1.3633
1808,1.3733
1809,1.3793
1810,1.3806
1811,1.3839
1812,1.3849
1813,1.3949
1814,1.3993
1815,1.4006
1816,1.4037
1817,1.4051
1818,1.4065
1819,1.4071
1820,1.4073
1821,1.4082
1822,1.4097
1823,1.41
1824,1.4109
1825,1.4124
1826,1.4116
1827,1.4109
1828,1.4032
1829,1.3939
1830,1.3862
1831,1.3833
1832,1.3807
1833,1.3733
1834,1.3707
1835,1.3679
1836,1.3582
1837,1.3505
1838,1.3412
1839,1.3316
1840,1.3239
1841,1.3143
1842,1.3137
1843,1.3089
1844,1.3016
1845,1.2991
1846,1.2937
1847,1.2867
1848,1.2771
1849,1.2694
1850,1.2598
1851,1.2524
1852,1.2428
1853,1.2332
1854,1.2255
1855,1.2254
1856,1.2223
1857,1.2127
1858,1.2031
1859,1.1954
1860,1.1858
1861,1.1781
1862,1.1685
1863,1.1612
1864,1.1516
1865,1.1420000000000001
1866,1.1343
1867,1.1247
1868,1.1209
1869,1.1174
1870,1.1101
1871,1.1032
1872,1.1017
1873,1.0967
1874,1.0929
1875,1.0906
1876,1.0806
1877,1.0726
1878,1.0637
1879,1.0584
1880,1.0565
1881,1.0465
1882,1.0438
1883,1.0381
1884,1.0304
1885,1.025
1886,1.0197
1887,1.0162
1888,1.0143
1889,1.0059
1890,0.99593
1891,0.98788
1892,0.9802200000000001
1893,0.97754
1894,0.97141
1895,0.96183
1896,0.9541700000000001
1897,0.9446
1898,0.93694
1899,0.92737
1900,0.92201
1901,0.9204899999999999
1902,0.91475
1903,0.90749
1904,0.89871
1905,0.89146
1906,0.8880399999999999
1907,0.88421
1908,0.8784799999999999
1909,0.87656
1910,0.86892
1911,0.85936
1912,0.8498
1913,0.84216
1914,0.8326
1915,0.82496
1916,0.8154
1917,0.80776
1918,0.7982100000000001
1919,0.78866
1920,0.7810199999999999
1921,0.77148
1922,0.76425
1923,0.75471
1924,0.74707
1925,0.73753
1926,0.7279899999999999
1927,0.7260800000000001
1928,0.72459
1929,0.71738
1930,0.7086899999999999
1931,0.70721
1932,0.70044
1933,0.69663
1934,0.69282
1935,0.68329
1936,0.67567
1937,0.66614
1938,0.6585300000000001
1939,0.64944
1940,0.63948
1941,0.6318600000000001
1942,0.62235
1943,0.61473
1944,0.60521
1945,0.60287
1946,0.59716
1947,0.5872
1948,0.57915
1949,0.57447
1950,0.57212
1951,0.56407
1952,0.5569
1953,0.55353
1954,0.54681
1955,0.5392
1956,0.5292399999999999
1957,0.52645
1958,0.5203
1959,0.51269
1960,0.50889
1961,0.50508
1962,0.49746999999999997
1963,0.48752
1964,0.47991000000000006
1965,0.47041000000000005
1966,0.4609
1967,0.4533
1968,0.44378999999999996
1969,0.43618999999999997
1970,0.42668999999999996
1971,0.4191
1972,0.4096
1973,0.4001
1974,0.39250999999999997
1975,0.38301
1976,0.37542
1977,0.36593000000000003
1978,0.35834
1979,0.35459
1980,0.34942
1981,0.34181999999999996
1982,0.33233
1983,0.32474000000000003
1984,0.31525
1985,0.30765
1986,0.29817
1987,0.28868
1988,0.28109
1989,0.27161
1990,0.26402
1991,0.25406999999999996
1992,0.24649000000000001
1993,0.23701
1994,0.22753
1995,0.21995
1996,0.21048000000000003
1997,0.2029
1998,0.19343
1999,0.18586
2000,0.17639000000000002
2001,0.16692
2002,0.15935
2003,0.14989
2004,0.14232
2005,0.13285999999999998
2006,0.1253
2007,0.12097000000000001
2008,0.11433
2009,0.10676
2010,0.09729600000000001
2011,0.089242
2012,0.07978099999999999
2013,0.072216
2014,0.06275900000000001
2015,0.053301999999999995
2016,0.045741000000000004
2017,0.036289999999999996
2018,0.028730000000000002
2019,0.019283
2020,0.0098385
2021,0.0027825
2022,-0.0066565
2023,-0.014709999999999999
2024,-0.023643
2025,-0.031191000000000003
2026,-0.040622000000000005
2027,-0.050051
2028,-0.057594000000000006
2029,-0.067021
2030,-0.074559
2031,-0.083981
2032,-0.091517
2033,-0.10094
2034,-0.10021000000000001
2035,-0.10479000000000001
2036,-0.1142
2037,-0.12170999999999998
2038,-0.13111
2039,-0.13863
2040,-0.14802
2041,-0.15741
2042,-0.16492
2043,-0.1743
2044,-0.18181
2045,-0.19119
2046,-0.19869
2047,-0.20806
2048,-0.21744000000000002
2049,-0.22493000000000002
2050,-0.2343
2051,-0.24179
2052,-0.25115
2053,-0.25808000000000003
2054,-0.26743
2055,-0.27679000000000004
2056,-0.28426
2057,-0.29361
2058,-0.30108
2059,-0.31043000000000004
2060,-0.3179
2061,-0.32723
2062,-0.33655999999999997
2063,-0.34403
2064,-0.35335
2065,-0.36080999999999996
2066,-0.37071
2067,-0.37817
2068,-0.38749
2069,-0.3968
2070,-0.40425
2071,-0.41355
2072,-0.4204
2073,-0.4303
2074,-0.4396
2075,-0.44703000000000004
2076,-0.45632
2077,-0.46375
2078,-0.47303
2079,-0.47489
2080,-0.4786
2081,-0.48602
2082,-0.48788000000000004
2083,-0.49715
2084,-0.50457
2085,-0.51384
2086,-0.52125
2087,-0.53051
2088,-0.53976
2089,-0.5465300000000001
2090,-0.55578
2091,-0.56317
2092,-0.5724100000000001
2093,-0.5798
2094,-0.58903
2095,-0.5876600000000001
2096,-0.59004
2097,-0.59925
2098,-0.60661
2099,-0.6158100000000001
2100,-0.62316
2101,-0.63169
2102,-0.6408699999999999
2103,-0.6482100000000001
2104,-0.65738
2105,-0.66472
2106,-0.67388
2107,-0.68121
2108,-0.6903600000000001
2109,-0.6995100000000001
2110,-0.7068300000000001
2111,-0.71597
2112,-0.71319
2113,-0.7115100000000001
2114,-0.7086899999999999
2115,-0.70655
2116,-0.7044
2117,-0.70296
2118,-0.6997
2119,-0.6967899999999999
2120,-0.68735
2121,-0.68118
2122,-0.6775
2123,-0.67198
2124,-0.66899
2125,-0.65997
2126,-0.65275
2127,-0.64298
2128,-0.63575
2129,-0.62597
2130,-0.6211899999999999
2131,-0.6160899999999999
2132,-0.6055699999999999
2133,-0.60077
2134,-0.59385
2135,-0.58438
2136,-0.57955
2137,-0.5715899999999999
2138,-0.56439
2139,-0.5546300000000001
2140,-0.54742
2141,-0.53841
2142,-0.53359
2143,-0.52952
2144,-0.52052
2145,-0.51331
2146,-0.50355
2147,-0.49633
2148,-0.48731
2149,-0.48176
2150,-0.47663999999999995
2151,-0.46763000000000005
2152,-0.46042
2153,-0.4514
2154,-0.44418
2155,-0.4344
2156,-0.42536999999999997
2157,-0.41813999999999996
2158,-0.40909
2159,-0.40614
2160,-0.39849
2161,-0.39052
2162,-0.38148000000000004
2163,-0.37351
2164,-0.36874
2165,-0.36003
2166,-0.35206
2167,-0.34302
2168,-0.33579000000000003
2169,-0.32675
2170,-0.31943
2171,-0.31434
2172,-0.3053
2173,-0.29807
2174,-0.28829
2175,-0.28105
2176,-0.272
2177,-0.26294
2178,-0.25893
2179,-0.25237
2180,-0.24514
2181,-0.23609000000000002
2182,-0.22884000000000002
2183,-0.21978000000000003
2184,-0.21072
2185,-0.20273
2186,-0.19366
2187,-0.1864
2188,-0.17732
2189,-0.16824
2190,-0.16355
2191,-0.15775
2192,-0.15049
2193,-0.14140999999999998
2194,-0.13343
2195,-0.12434
2196,-0.11674000000000001
2197,-0.11023
2198,-0.10115
2199,-0.09388300000000001
2200,-0.08408099999999999
2201,-0.076812
2202,-0.067718
2203,-0.058623
2204,-0.053562
2205,-0.046354
2206,-0.039083
2207,-0.029992
2208,-0.022715
2209,-0.013614
2210,-0.0038045
2211,0.0034805
2212,0.010356
2213,0.015011000000000002
2214,0.024821
2215,0.032102
2216,0.041914
2217,0.051021
2218,0.058311
2219,0.06366000000000001
2220,0.068717
2221,0.07782
2222,0.085812
2223,0.09451
2224,0.099878
2225,0.10715999999999999
2226,0.11625999999999999
2227,0.12425
2228,0.13335
2229,0.14064000000000002
2230,0.14528
2231,0.15287
2232,0.16015
2233,0.16996
2234,0.17725
2235,0.18261
2236,0.18767
2237,0.19819
2238,0.20357999999999998
2239,0.20975
2240,0.21916999999999998
2241,0.22386
2242,0.23185
2243,0.24164000000000002
2244,0.24891
2245,0.25651999999999997
2246,0.2594
2247,0.2692
2248,0.27428
2249,0.27971999999999997
2250,0.28952
2251,0.29533000000000004
2252,0.30188000000000004
2253,0.30985
2254,0.31749
2255,0.32224
2256,0.33202
2257,0.33753
2258,0.34051
2259,0.34605
2260,0.35297
2261,0.36168
2262,0.3647
2263,0.37028
2264,0.37693000000000004
2265,0.38488
2266,0.38974000000000003
2267,0.39281
2268,0.39666999999999997
2269,0.39978
2270,0.40368000000000004
2271,0.4094
2272,0.41256000000000004
2273,0.41653
2274,0.41794
2275,0.42195
2276,0.42518
2277,0.42923999999999995
2278,0.43332
2279,0.4366
2280,0.43376000000000003
2281,0.42751000000000006
2282,0.43166000000000004
2283,0.43323999999999996
2284,0.43743999999999994
2285,0.42946999999999996
2286,0.4285
2287,0.42486999999999997
2288,0.4187
2289,0.42038000000000003
2290,0.42122
2291,0.41247
2292,0.40458
2293,0.39759
2294,0.40021999999999996
2295,0.39848
2296,0.38976
2297,0.38105
2298,0.37409000000000003
2299,0.36538000000000004
2300,0.35843
2301,0.34974
2302,0.34279
2303,0.33411
2304,0.32543
2305,0.3185
2306,0.31143000000000004
2307,0.307
2308,0.29833000000000004
2309,0.29139
2310,0.28273000000000004
2311,0.27316
2312,0.26624000000000003
2313,0.25759
2314,0.24968
2315,0.24433000000000002
2316,0.2374
2317,0.22784000000000001
2318,0.21829
2319,0.21466
2320,0.20765
2321,0.20073
2322,0.19118
2323,0.18335
2324,0.17799
2325,0.16926
2326,0.16234
2327,0.15369000000000002
2328,0.14678
2329,0.13815
2330,0.13125
2331,0.12262999999999999
2332,0.11402000000000001
2333,0.10712999999999999
2334,0.098534
2335,0.09166
2336,0.08214099999999999
2337,0.075275
2338,0.066699
2339,0.05812899999999999
2340,0.052052
2341,0.045653
2342,0.039572
2343,0.031002
2344,0.024151
2345,0.015593000000000001
2346,0.0070455
2347,0.0002105
2348,-0.0083245
2349,-0.015147
2350,-0.024625
2351,-0.033141000000000004
2352,-0.039948000000000004
2353,-0.048451999999999995
2354,-0.055248
2355,-0.063735
2356,-0.07052
2357,-0.07899400000000001
2358,-0.08745800000000001
2359,-0.094223
2360,-0.10267000000000001
2361,-0.10943
2362,-0.11785999999999999
2363,-0.1246
2364,-0.13332
2365,-0.14163
2366,-0.14837
2367,-0.15779
2368,-0.16551
2369,-0.17284000000000002
2370,-0.17818
2371,-0.18661
2372,-0.19502
2373,-0.20274
2374,-0.21114000000000002
2375,-0.21749000000000002
2376,-0.22315
2377,-0.22988000000000003
2378,-0.23828000000000002
2379,-0.24766999999999997
2380,-0.25438
2381,-0.26276
2382,-0.26845
2383,-0.27481
2384,-0.28152
2385,-0.28989000000000004
2386,-0.29927
2387,-0.30596
2388,-0.31431
2389,-0.32099
2390,-0.32737
2391,-0.3331
2392,-0.34145
2393,-0.35081
2394,-0.35748
2395,-0.3659
2396,-0.37127
2397,-0.37961
2398,-0.38628
2399,-0.39561999999999997
2400,-0.40394
2401,-0.41058999999999996
2402,-0.41889
2403,-0.4253
2404,-0.43273
2405,-0.44104
2406,-0.44766999999999996
2407,-0.45698999999999995
2408,-0.46361
2409,-0.47188
2410,-0.47953
2411,-0.48701000000000005
2412,-0.4957
2413,-0.50231
2414,-0.51056
2415,-0.51715
2416,-0.5253800000000001
2417,-0.53301
2418,-0.54123
2419,-0.54943
2420,-0.55598
2421,-0.56416
2422,-0.57013
2423,-0.57711
2424,-0.58472
2425,-0.5929
2426,-0.60106
2427,-0.60758
2428,-0.6157199999999999
2429,-0.62222
2430,-0.63034
2431,-0.63683
2432,-0.6449199999999999
2433,-0.653
2434,-0.65946
2435,-0.66751
2436,-0.67395
2437,-0.68198
2438,-0.6884
2439,-0.6964100000000001
2440,-0.7044
2441,-0.71078
2442,-0.71875
2443,-0.72625
2444,-0.7342
2445,-0.74055
2446,-0.74846
2447,-0.75637
2448,-0.76139
2449,-0.7691399999999999
2450,-0.77547
2451,-0.78337
2452,-0.79083
2453,-0.7987
2454,-0.80615
2455,-0.8123600000000001
2456,-0.8209700000000001
2457,-0.82725
2458,-0.8362700000000001
2459,-0.84254
2460,-0.85036
2461,-0.8566
2462,-0.8648
2463,-0.8726299999999999
2464,-0.88005
2465,-0.8874700000000001
2466,-0.8949
2467,-0.90076
2468,-0.9105200000000001
2469,-0.9167700000000001
2470,-0.92576
2471,-0.9331799999999999
2472,-0.9409799999999999
2473,-0.9499799999999999
2474,-0.95545
2475,-0.9644299999999999
2476,-0.97065
2477,-0.97805
2478,-0.98434
2479,-0.9913700000000001
2480,-1.0011
2481,-1.0074
2482,-1.0164
2483,-1.0238
2484,-1.0315
2485,-1.0378
2486,-1.0461
2487,-1.055
2488,-1.0612
2489,-1.0686
2490,-1.0749
2491,-1.0819
2492,-1.0905
2493,-1.0979999999999999
2494,-1.1054
2495,-1.1116
2496,-1.1205
2497,-1.126
2498,-1.1351
2499,-1.1412
2500,-1.1502
2501,-1.1591
2502,-1.1654
2503,-1.1724
2504,-1.1786
2505,-1.1875
2506,-1.1933
2507,-1.2009
2508,-1.2082
2509,-1.2156
2510,-1.2232
2511,-1.2299
2512,-1.2363
2513,-1.2425
2514,-1.2513
2515,-1.2590000000000001
2516,-1.2657
2517,-1.2721
2518,-1.2782
2519,-1.287
2520,-1.2931
2521,-1.2995
2522,-1.3062
2523,-1.3123
2524,-1.3212
2525,-1.3272
2526,-1.3352
2527,-1.3419
2528,-1.348
2529,-1.3555
2530,-1.3628
2531,-1.3703
2532,-1.3761
2533,-1.3838
2534,-1.3896
2535,-1.3956
2536,-1.4043
2537,-1.4101
2538,-1.4178
2539,-1.4236
2540,-1.4323
2541,-1.4398
2542,-1.4465
2543,-1.4546
2544,-1.4605
2545,-1.4692
2546,-1.4752
2547,-1.4845
2548,-1.4915
2549,-1.4987
2550,-1.5061
2551,-1.5118
2552,-1.5196
2553,-1.5254
2554,-1.534
2555,-1.5413
2556,-1.5468
2557,-1.5548
2558,-1.5606
2559,-1.5689
2560,-1.5755
2561,-1.5827
2562,-1.5913
2563,-1.5971
2564,-1.604
2565,-1.6106
2566,-1.6192
2567,-1.626
2568,-1.6341
2569,-1.6427
2570,-1.6495
2571,-1.6577
2572,-1.6648
2573,-1.6742
2574,-1.6825
2575,-1.6883
2576,-1.6963
2577,-1.7018
2578,-1.7091
2579,-1.7162
2580,-1.7233
2581,-1.7313
2582,-1.7369999999999999
2583,-1.7454
2584,-1.7521
2585,-1.7590000000000001
2586,-1.7662
2587,-1.7741
2588,-1.7811
2589,-1.7882
2590,-1.7962
2591,-1.8017
2592,-1.8103
2593,-1.8161
2594,-1.8245
2595,-1.834
2596,-1.8398
2597,-1.8483
2598,-1.854
2599,-1.8635
2600,-1.8705
2601,-1.8776
2602,-1.8861
2603,-1.8916
2604,-1.9012
2605,-1.9069
2606,-1.9153
2607,-1.9209
2608,-1.9292
2609,-1.936
2610,-1.9417
2611,-1.9487
2612,-1.9542
2613,-1.9625
2614,-1.9680000000000002
2615,-1.9749
2616,-1.9818
2617,-1.9888
2618,-1.9956
2619,-2.001
2620,-2.0077
2621,-2.0145
2622,-2.0211
2623,-2.0277
2624,-2.0346
2625,-2.0431
2626,-2.0484
2627,-2.0549
2628,-2.0613
2629,-2.0664
2630,-2.0742
2631,-2.0793
2632,-2.0855
2633,-2.0904
2634,-2.0972
2635,-2.106
2636,-2.1109
2637,-2.117
2638,-2.1218
2639,-2.1293
2640,-2.134
2641,-2.1398
2642,-2.1455
2643,-2.1501
2644,-2.1566
2645,-2.1641
2646,-2.1702
2647,-2.1747
2648,-2.1818
2649,-2.1872
2650,-2.1914
2651,-2.2001
2652,-2.2071
2653,-2.2124
2654,-2.2165
2655,-2.2216
2656,-2.2282
2657,-2.2322
2658,-2.237
2659,-2.2407
2660,-2.2444
2661,-2.2522
2662,-2.2593
2663,-2.2638
2664,-2.2673
2665,-2.2734
2666,-2.2768
2667,-2.281
2668,-2.2842
2669,-2.2881
2670,-2.2919
2671,-2.2967
2672,-2.3003
2673,-2.3083
2674,-2.3147
2675,-2.3174
2676,-2.3207
2677,-2.3238
2678,-2.3262
2679,-2.3291
2680,-2.3313
2681,-2.3358
2682,-2.3382
2683,-2.3401
2684,-2.3423
2685,-2.3439
2686,-2.3524
2687,-2.3585
2688,-2.3604
2689,-2.364
2690,-2.3653
2691,-2.3667
2692,-2.3677
2693,-2.3688
2694,-2.3696
2695,-2.3724
2696,-2.3731
2697,-2.3735
2698,-2.3736
2699,-2.3737
2700,-2.3759
2701,-2.3799
2702,-2.3819
2703,-2.3818
2704,-2.3838
2705,-2.3838
2706,-2.3838
2707,-2.3838
2708,-2.3857
