time,value
0,-1.5759
1,-1.5759
2,-1.5759
3,-1.5759
4,-1.5759
5,-1.5759
6,-1.5759
7,-1.5759
8,-1.2522
9,1.2297
10,1.1218
11,0.90596
12,0.69015
13,0.79805
14,0.58224
15,0.69015
16,0.69015
17,0.58224
18,0.58224
19,0.69015
20,0.58224
21,0.58224
22,0.58224
23,0.58224
24,0.69015
25,0.58224
26,0.47434
27,0.58224
28,0.58224
29,0.58224
30,0.47434
31,0.47434
32,0.58224
33,0.47434
34,0.58224
35,0.47434
36,0.58224
37,0.47434
38,0.58224
39,0.47434
40,0.47434
41,0.47434
42,0.58224
43,-1.1443
44,-1.5759
45,-1.5759
46,-1.5759
47,-1.5759
48,-1.5759
49,-1.5759
50,-1.3601
51,-1.2522
52,-0.281
53,1.3376
54,1.0139
55,0.90596
56,0.69015
57,0.69015
58,0.69015
59,0.58224
60,0.58224
61,0.58224
62,0.58224
63,0.47434
64,0.58224
65,0.58224
66,0.47434
67,0.58224
68,0.47434
69,0.47434
70,0.58224
71,0.47434
72,-0.38891
73,-1.5759
74,-1.5759
75,-1.5759
76,-1.5759
77,-1.5759
78,-1.5759
79,-1.5759
80,-1.5759
81,-1.5759
82,-1.0363
83,1.1218
84,1.0139
85,0.90596
86,0.69015
87,0.69015
88,0.69015
89,0.69015
90,0.58224
91,0.58224
92,0.69015
93,0.58224
94,0.58224
95,0.69015
