time,value
0,2.5584
1,2.6241
2,2.6898
3,2.6241
4,0.9823299999999999
5,-0.39676
6,-0.39676
7,-0.33109
8,-0.39676
9,-0.39676
10,-0.39676
11,-0.39676
12,-0.33109
13,-0.33109
14,-0.19975
15,-0.13408
16,-0.39676
17,-0.46243999999999996
18,-0.39676
19,-0.39676
20,-0.26542
21,-0.39676
22,-0.46243999999999996
23,-0.39676
24,-0.39676
25,-0.39676
26,-0.39676
27,-0.46243999999999996
28,-0.39676
29,-0.39676
30,-0.39676
31,-0.39676
32,-0.39676
33,-0.39676
34,-0.39676
35,-0.39676
36,-0.39676
37,-0.39676
38,-0.39676
39,-0.46243999999999996
40,-0.26542
41,-0.39676
42,-0.39676
43,-0.46243999999999996
44,-0.39676
45,-0.39676
46,-0.39676
47,-0.39676
48,-0.39676
49,-0.46243999999999996
50,-0.39676
51,-0.39676
52,-0.39676
53,-0.39676
54,-0.39676
55,-0.39676
56,-0.33109
57,-0.39676
58,-0.39676
59,-0.39676
60,-0.39676
61,-0.39676
62,-0.46243999999999996
63,-0.39676
64,-0.39676
65,-0.39676
66,-0.39676
67,-0.39676
68,-0.39676
69,-0.39676
70,-0.39676
71,-0.39676
72,-0.46243999999999996
73,-0.39676
74,-0.39676
75,-0.39676
76,-0.39676
77,-0.39676
78,-0.39676
79,-0.39676
80,-0.39676
81,-0.39676
82,-0.39676
83,-0.39676
84,-0.39676
85,-0.39676
86,-0.39676
87,-0.13408
88,2.5584
89,2.6241
90,2.5584
91,2.5584
92,2.6241
93,2.5584
94,2.6241
95,2.6241
