{
  "about": {
    "problemID": "124_174_cifar10_problem",
    "problemName": "cifar10_problem",
    "problemDescription": "Multiclass image classification problem. Each image belongs to one of 10 classes.",
    "problemSchemaVersion": "4.0.0",
    "problemVersion": "4.0.0",
    "taskKeywords": [
      "classification",
      "multiClass",
      "image"
    ]
  },
  "inputs": {
    "data": [
      {
        "datasetID": "124_174_cifar10_dataset",
        "targets": [
          {
            "targetIndex": 0,
            "resID": "learningData",
            "colIndex": 2,
            "colName": "label"
          }
        ]
      }
    ],
    "dataSplits": {
      "method": "holdOut",
      "testSize": 0.167,
      "stratified": false,
      "numRepeats": 0,
      "splitsFile": "dataSplits.csv",
      "datasetViewMaps": {
        "train": [
          {
            "from": "124_174_cifar10_dataset",
            "to": "124_174_cifar10_dataset_TRAIN"
          }
        ],
        "test": [
          {
            "from": "124_174_cifar10_dataset",
            "to": "124_174_cifar10_dataset_TEST"
          }
        ],
        "score": [
          {
            "from": "124_174_cifar10_dataset",
            "to": "124_174_cifar10_dataset_SCORE"
          }
        ]
      }
    },
    "performanceMetrics": [
      {
        "metric": "accuracy"
      }
    ]
  },
  "expectedOutputs": {
    "predictionsFile": "predictions.csv"
  }
}