time,value
0,-1.0104
1,-1.0104
2,0.72451
3,1.3554
4,1.0399
5,1.0399
6,1.0399
7,1.0399
8,1.0399
9,1.0399
10,0.88223
11,1.0399
12,1.0399
13,1.0399
14,0.093644
15,-1.0104
16,-1.0104
17,-1.0104
18,-1.0104
19,-1.0104
20,-1.0104
21,1.0399
22,1.3554
23,1.0399
24,1.0399
25,1.0399
26,0.88223
27,-1.0104
28,-1.0104
29,-1.0104
30,-1.0104
31,-1.0104
32,-1.0104
33,0.40908
34,1.3554
35,1.1977
36,1.0399
37,0.25136
38,-1.0104
39,-1.0104
40,-1.0104
41,-1.0104
42,-1.0104
43,-0.37951
44,1.5131
45,1.1977
46,0.88223
47,1.0399
48,-1.0104
49,-1.0104
50,-1.0104
51,-1.0104
52,-1.0104
53,-1.0104
54,0.40908
55,1.3554
56,1.0399
57,1.0399
58,0.40908
59,-1.0104
60,-1.0104
61,-1.0104
62,-1.0104
63,-1.0104
64,0.25136
65,1.3554
66,1.0399
67,1.0399
68,1.0399
69,1.0399
70,1.0399
71,0.40908
72,-1.0104
73,-1.0104
74,-1.0104
75,-1.0104
76,-1.0104
77,0.25136
78,1.3554
79,1.0399
80,1.0399
81,-0.69494
82,-1.0104
83,-1.0104
84,-1.0104
85,-1.0104
86,-1.0104
87,-0.22179000000000001
88,1.5131
89,1.0399
90,0.40908
91,-1.0104
92,-1.0104
93,-1.0104
94,-1.0104
95,-0.064072
