[<text>
<title>detection systems &lt;detc.o&gt; year end march 31</title>
<dateline>    fairport, n.y., june 1 -
    </dateline>shr 36 cts vs nil
    net 713,000 vs 1,500
    revs 13 mln vs 9,328,000
 reuter
</text>]