time,value
0,0.34517
1,0.23363
2,0.10967
3,0.13183
4,0.13783
5,0.40915
6,0.41849
7,0.4215
8,0.37722
9,0.14678
10,0.12420999999999999
11,0.1053
12,0.10212
13,0.099629
14,0.07446799999999999
15,0.15712
16,0.22757
17,0.29
18,0.33545
19,0.52766
20,0.43205
21,0.63278
22,0.55373
23,0.52286
24,0.45653999999999995
25,0.55385
26,0.7018399999999999
27,0.9093200000000001
28,1.4269
29,1.3964
30,1.4339
31,1.1199
32,1.1021
33,0.89625
34,1.0891
35,1.1921
36,1.3866
37,1.321
38,1.4973
39,1.5533
40,1.5027
41,1.5567
42,1.08
43,0.66505
44,0.3793
45,-0.10309000000000001
46,-0.55289
47,-1.5252
48,-2.6012
49,-2.4435
50,-2.3732
51,-2.3699
52,-2.5363
53,-2.5865
54,-2.3879
55,-2.3122
56,-2.1756
57,-1.8701
58,-1.6303
59,-1.3685
60,-1.0412
61,-0.77085
62,-0.62015
63,-0.45378999999999997
64,-0.073702
65,-0.38261999999999996
66,0.15802
67,0.64099
68,0.27305
69,-0.5033
70,-0.38823
71,-0.10005
72,0.046595
73,-0.34402
74,-0.87418
75,-1.3245
76,-1.5559
77,-1.7552
78,-2.1524
79,-2.3769
80,-2.1896
81,-2.3813
82,-2.3787
83,-3.0009
84,-1.7457
85,-2.5356
86,-2.0659
87,-2.0292
88,-2.0656
89,-1.7934
90,-1.7337
91,-1.6461
92,-1.6221
93,-1.6745
94,-1.6455
95,-1.994
96,-1.9525
97,-2.068
98,-2.1647
99,-2.0242
100,-1.7963
101,-1.6113
102,-1.3121
103,-1.1844
104,-1.0304
105,-0.556
106,-0.51143
107,-0.09411
108,0.016465
109,-0.033137
110,0.32642
111,0.19899999999999998
112,0.40209
113,0.63563
114,0.54952
115,0.34726999999999997
116,0.063859
117,0.10405
118,-0.028807
119,-0.2978
120,-0.45358999999999994
121,-0.5885100000000001
122,-1.1011
123,-1.3209
124,-1.4639
125,-1.3434
126,-1.8806
127,-1.9251
128,-1.9245
129,-1.5704
130,-1.6327
131,-1.8069
132,-1.9906
133,-1.7427
134,-1.5130000000000001
135,-0.2851
136,0.19209
137,0.25816999999999996
138,0.32071
139,0.38835
140,0.28875
141,0.44388999999999995
142,0.6241899999999999
143,0.41184
144,0.67884
145,0.70043
146,0.8516
147,0.6579999999999999
148,0.49455
149,0.6269600000000001
150,0.61341
151,0.72453
152,0.6130800000000001
153,0.4437
154,0.37355
155,0.41938000000000003
156,0.45022
157,0.56008
158,0.7481899999999999
159,0.56776
160,0.8198200000000001
161,0.72029
162,0.51476
163,0.25753000000000004
164,0.21269000000000002
165,0.25205
166,0.045725
167,-0.0016012999999999997
168,0.0083675
169,-0.11527000000000001
170,-0.18373
171,-0.13905
172,-0.077615
173,-0.017041999999999998
174,0.083441
175,0.063999
176,0.21611999999999998
177,0.20735
178,0.17923
179,0.12361
180,0.18586
181,0.26869
182,0.44578999999999996
183,0.44811999999999996
184,0.50568
185,0.49436
186,0.51227
187,0.47358999999999996
188,0.57597
189,0.76039
190,0.726
191,0.8574
192,0.88561
193,0.7671100000000001
194,0.78273
195,0.57358
196,0.59031
197,0.61233
198,0.32145999999999997
199,0.19505999999999998
200,0.18954000000000001
201,0.30124
202,0.28586
203,0.15045
204,0.3709
205,0.32104
206,0.28846
207,0.17023
208,0.35908
209,0.33129000000000003
210,0.34864
211,0.38908000000000004
212,0.62165
213,0.59691
214,0.56706
215,0.8501799999999999
216,0.80933
217,0.7869
218,0.69796
219,0.76103
220,0.7538199999999999
221,0.52276
222,0.71297
223,0.70682
224,0.57506
225,0.62815
226,0.54525
227,0.6881
228,0.50679
229,0.76002
230,0.7467199999999999
231,0.8241799999999999
232,0.5899300000000001
233,0.69653
234,0.61011
235,0.6180899999999999
236,0.58683
237,0.71157
238,0.5405800000000001
239,0.5340699999999999
240,0.48582
241,0.52576
242,0.61033
243,0.84235
244,0.57706
245,0.711
246,0.5852
247,0.57344
248,0.57792
249,0.56906
250,0.57723
251,0.5704600000000001
252,0.71435
253,0.85595
254,0.57039
255,0.5637300000000001
256,0.69331
257,0.48061000000000004
258,0.5912
259,0.5826
260,0.30529
261,0.49125
262,0.40885
263,0.41013
264,0.40507
265,0.56321
266,0.35004
267,0.55506
268,0.56547
269,0.56747
270,0.56685
271,0.57119
272,0.5798
273,0.65137
274,0.66003
275,0.58703
276,0.64372
277,0.63853
278,0.5647399999999999
279,0.25351
280,0.2667
281,0.55676
282,0.5502
283,0.30001
284,0.5508
285,0.83281
286,0.8219299999999999
287,0.58701
288,0.81884
289,0.80355
290,0.80815
291,0.7766
292,0.76115
293,0.24181999999999998
294,0.23569
295,-0.011071
296,0.5316
297,0.23229
298,0.2218
299,0.22054
