{
  "about": {
    "datasetID": "LL1_FISH_dataset",
    "datasetName": "LL1_FISH",
    "description": "one of UCR datasets for timeseries classification",
    "citation": " @misc{UCRArchive, title={The UCR Time Series Classification Archive}, author={ Chen, Yanping and Keogh, Eamonn and Hu, Bing and Begum, Nurjahan and Bagnall, Anthony and Mueen, Abdullah and Batista, Gustavo}, year={2015}, month={July}, note = {url{www.cs.ucr.edu/~eamonn/time_series_data/}}} ",
    "license": "Unknown public",
    "source": "UCR",
    "sourceURI": "http://www.cs.ucr.edu/~eamonn/time_series_data/",
    "datasetSchemaVersion": "4.0.0",
    "redacted": false,
    "datasetVersion": "4.0.0",
    "digest": "6295f3360bef4455a3782b62c14e40c242cc41c353f74deccda4c694a0b4a225"
  },
  "dataResources": [
    {
      "resID": "0",
      "resPath": "timeseries/",
      "resType": "timeseries",
      "resFormat": {
        "text/csv": [
          "csv"
        ]
      },
      "isCollection": true
    },
    {
      "resID": "learningData",
      "resPath": "tables/learningData.csv",
      "resType": "table",
      "resFormat": {
        "text/csv": [
          "csv"
        ]
      },
      "isCollection": false,
      "columns": [
        {
          "colIndex": 0,
          "colName": "d3mIndex",
          "colType": "integer",
          "role": [
            "index"
          ]
        },
        {
          "colIndex": 1,
          "colName": "timeseries_file",
          "colType": "string",
          "role": [
            "attribute"
          ],
          "refersTo": {
            "resID": "0",
            "resObject": "item"
          }
        },
        {
          "colIndex": 2,
          "colName": "label",
          "colType": "categorical",
          "role": [
            "suggestedTarget"
          ]
        }
      ],
      "columnsCount": 3
    }
  ]
}