time,value
0,2.012
1,-0.6786800000000001
2,-0.6786800000000001
3,-0.6786800000000001
4,-0.6786800000000001
5,0.8588600000000001
6,1.6276
7,-0.6786800000000001
8,-0.6786800000000001
9,-0.6786800000000001
10,-0.6786800000000001
11,0.66666
12,1.6276
13,-0.6786800000000001
14,-0.6786800000000001
15,-0.6786800000000001
16,-0.6786800000000001
17,0.28228000000000003
18,2.012
19,-0.6786800000000001
20,-0.6786800000000001
21,-0.6786800000000001
22,-0.6786800000000001
23,-0.29429
24,2.012
25,-0.1021
26,-0.6786800000000001
27,-0.6786800000000001
28,-0.6786800000000001
29,-0.6786800000000001
30,1.4354
31,0.8588600000000001
32,-0.6786800000000001
33,-0.6786800000000001
34,-0.6786800000000001
35,-0.6786800000000001
36,1.8198
37,0.66666
38,-0.6786800000000001
39,-0.6786800000000001
40,-0.6786800000000001
41,-0.6786800000000001
42,1.8198
43,0.66666
44,-0.6786800000000001
45,-0.6786800000000001
46,-0.6786800000000001
47,2.012
48,0.8588600000000001
49,-0.6786800000000001
50,-0.6786800000000001
51,-0.6786800000000001
52,1.2432
53,1.6276
54,-0.6786800000000001
55,-0.6786800000000001
56,-0.6786800000000001
57,-0.29429
58,2.012
59,0.28228000000000003
60,-0.6786800000000001
61,-0.6786800000000001
62,-0.6786800000000001
63,0.66666
64,2.012
65,-0.6786800000000001
66,-0.6786800000000001
67,-0.6786800000000001
68,-0.6786800000000001
69,1.4354
70,1.2432
71,-0.6786800000000001
72,-0.6786800000000001
73,-0.6786800000000001
74,-0.6786800000000001
75,1.8198
76,0.66666
77,-0.6786800000000001
78,-0.6786800000000001
79,-0.6786800000000001
80,-0.6786800000000001
81,2.2042
82,0.47447
83,-0.6786800000000001
84,-0.6786800000000001
85,-0.6786800000000001
86,-0.6786800000000001
87,2.012
88,0.66666
89,-0.6786800000000001
90,-0.6786800000000001
91,-0.6786800000000001
92,-0.6786800000000001
93,1.4354
94,1.051
95,-0.6786800000000001
