time,value
0,-0.62829
1,-0.62829
2,-0.62829
3,-0.62829
4,0.80294
5,2.0297
6,-0.62829
7,-0.62829
8,-0.62829
9,-0.62829
10,0.18955
11,2.2342
12,-0.21936999999999998
13,-0.62829
14,-0.62829
15,-0.62829
16,-0.62829
17,2.4386
18,0.39400999999999997
19,-0.62829
20,-0.62829
21,-0.62829
22,-0.62829
23,1.6208
24,1.2119
25,-0.62829
26,-0.62829
27,-0.62829
28,-0.62829
29,0.80294
30,2.0297
31,-0.62829
32,-0.62829
33,-0.62829
34,-0.62829
35,-0.014909
36,2.2342
37,-0.014909
38,-0.62829
39,-0.62829
40,-0.62829
41,-0.62829
42,1.8252
43,0.80294
44,-0.62829
45,-0.62829
46,-0.62829
47,-0.62829
48,1.2119
49,1.6208
50,-0.62829
51,-0.62829
52,-0.62829
53,-0.62829
54,0.39400999999999997
55,2.0297
56,-0.21936999999999998
57,-0.62829
58,-0.62829
59,-0.62829
60,-0.62829
61,2.2342
62,0.39400999999999997
63,-0.62829
64,-0.62829
65,-0.62829
66,-0.62829
67,1.6208
68,1.2119
69,-0.62829
70,-0.62829
71,-0.62829
72,-0.62829
73,1.0074
74,1.8252
75,-0.62829
76,-0.62829
77,-0.62829
78,-0.62829
79,0.18955
80,2.2342
81,-0.62829
82,-0.62829
83,-0.62829
84,-0.62829
85,0.80294
86,1.8252
87,-0.62829
88,-0.62829
89,-0.62829
90,-0.62829
91,0.59847
92,2.2342
93,-0.62829
94,-0.62829
95,-0.62829
