time,value
0,1.646
1,1.7228
2,1.7359
3,1.6821
4,1.5967
5,1.5174
6,1.4304
7,1.3515
8,1.2649
9,1.1864
10,1.1007
11,1.0143
12,0.9346899999999999
13,0.8518399999999999
14,0.77294
15,0.6883199999999999
16,0.61015
17,0.52432
18,0.43881000000000003
19,0.35436
20,0.26996
21,0.18349000000000001
22,0.10679000000000001
23,0.022706
24,-0.053257000000000006
25,-0.13647
26,-0.21911999999999998
27,-0.30116
28,-0.38248000000000004
29,-0.46576999999999996
30,-0.5454899999999999
31,-0.6241
32,-0.70482
33,-0.78447
34,-0.8589700000000001
35,-0.9354899999999999
36,-1.0101
37,-1.0823
38,-1.1502
39,-1.2113
40,-1.2715
41,-1.3259
42,-1.3727
43,-1.4105
44,-1.4452
45,-1.46
46,-1.4614
47,-1.4514
48,-1.4318
49,-1.4023
50,-1.3558
51,-1.3074
52,-1.2468
53,-1.195
54,-1.1268
55,-1.058
56,-0.9861700000000001
57,-0.91189
58,-0.8355899999999999
59,-0.75767
60,-0.67838
61,-0.59822
62,-0.52662
63,-0.44432
64,-0.36296999999999996
65,-0.28234000000000004
66,-0.20511999999999997
67,-0.12819
68,-0.043151
69,0.032945999999999996
70,0.11852
71,0.20254
72,0.28852
73,0.3661
74,0.45288999999999996
75,0.53096
76,0.6168
77,0.70292
78,0.7897
79,0.8760600000000001
80,0.9553299999999999
81,1.0426
82,1.1295
83,1.2167
84,1.3045
85,1.3924
86,1.4806
87,1.5687
88,1.6571
89,1.7322
90,1.7525
91,1.702
92,1.6159
93,1.5363
94,1.4492
95,1.3622
96,1.2754
97,1.1889
98,1.1032
99,1.0252
100,0.9470299999999999
101,0.86115
102,0.7757
103,0.6905600000000001
104,0.60459
105,0.51942
106,0.44198999999999994
107,0.35654
108,0.27302
109,0.18823
110,0.10377
111,0.019696
112,-0.063948
113,-0.14672000000000002
114,-0.22971
115,-0.31168
116,-0.39292
117,-0.47331999999999996
118,-0.55274
119,-0.63254
120,-0.71141
121,-0.787
122,-0.86388
123,-0.93647
124,-1.0056
125,-1.0764
126,-1.1440000000000001
127,-1.2077
128,-1.2664
129,-1.3189
130,-1.3638
131,-1.3996
132,-1.4244
133,-1.445
134,-1.4447
135,-1.4313
136,-1.413
137,-1.376
138,-1.3363
139,-1.2863
140,-1.2274
141,-1.167
142,-1.102
143,-1.0334
144,-0.96173
145,-0.8876700000000001
146,-0.81161
147,-0.7418
148,-0.66518
149,-0.58563
150,-0.50568
151,-0.43141999999999997
152,-0.34853
153,-0.26704
154,-0.18475999999999998
155,-0.10898
156,-0.026025
157,0.059503999999999994
158,0.14395
159,0.22884000000000002
160,0.30685
161,0.39181
162,0.4698
163,0.55598
164,0.63448
165,0.72113
166,0.80006
167,0.8863
168,0.9733200000000001
169,1.0606
170,1.1397
171,1.2276
172,1.315
173,1.4031
174,1.4912
175,1.5796
