time,value
0,-0.87439
1,0.79174
2,0.95042
3,-0.87439
4,-0.87439
5,0.6330600000000001
6,1.1091
7,-0.87439
8,-0.87439
9,0.55372
10,1.1091
11,-0.87439
12,-0.87439
13,0.23636999999999997
14,1.5058
15,-0.87439
16,-0.87439
17,-0.23967
18,1.9818
19,-0.87439
20,-0.87439
21,-0.63637
22,2.0612
23,-0.39835
24,-0.87439
25,-0.87439
26,1.6645
27,-0.0016529
28,-0.87439
29,-0.87439
30,1.9818
31,-0.31901
32,-0.87439
33,-0.87439
34,1.8232
35,-0.0016529
36,-0.87439
37,-0.87439
38,1.7438
39,0.077687
40,-0.87439
41,-0.87439
42,1.4265
43,0.39504
44,-0.87439
45,-0.87439
46,0.95042
47,1.0298
48,-0.87439
49,-0.87439
50,0.87108
51,0.95042
52,-0.87439
53,-0.87439
54,1.0298
55,0.7124
56,-0.87439
57,-0.87439
58,1.1884
59,0.55372
60,-0.87439
61,-0.87439
62,1.1091
63,0.7124
64,-0.87439
65,-0.87439
66,0.95042
67,0.87108
68,-0.87439
69,-0.87439
70,0.7124
71,0.95042
72,-0.87439
73,-0.87439
74,0.55372
75,1.4265
76,-0.87439
77,-0.87439
78,0.15703
79,1.5851
80,-0.87439
81,-0.87439
82,0.077687
83,1.5851
84,-0.87439
85,-0.87439
86,0.15703
87,1.3471
88,-0.87439
89,-0.87439
90,-0.0016529
91,1.6645
92,-0.87439
93,-0.87439
94,-0.47768999999999995
95,1.9818
