time,value
0,-0.40016
1,-0.40016
2,-0.40016
3,-0.40016
4,-0.40016
5,-0.40016
6,-0.40016
7,-0.40016
8,-0.40016
9,-0.40016
10,-0.40016
11,-0.40016
12,-0.40016
13,-0.40016
14,-0.40016
15,-0.40016
16,-0.40016
17,-0.40016
18,-0.40016
19,-0.40016
20,-0.40016
21,-0.40016
22,-0.40016
23,-0.40016
24,-0.40016
25,-0.40016
26,-0.40016
27,-0.40016
28,-0.40016
29,-0.40016
30,-0.40016
31,-0.40016
32,-0.40016
33,-0.40016
34,-0.40016
35,-0.40016
36,-0.40016
37,-0.40016
38,-0.40016
39,-0.40016
40,-0.40016
41,-0.40016
42,-0.40016
43,-0.40016
44,-0.40016
45,-0.40016
46,-0.40016
47,-0.40016
48,-0.40016
49,-0.40016
50,-0.40016
51,-0.40016
52,-0.40016
53,-0.40016
54,-0.40016
55,-0.40016
56,-0.40016
57,-0.40016
58,-0.40016
59,-0.40016
60,-0.40016
61,-0.40016
62,-0.40016
63,3.6435
64,3.6435
65,3.6435
66,0.61077
67,-0.40016
68,-0.40016
69,-0.40016
70,-0.40016
71,-0.40016
72,-0.40016
73,1.1162
74,2.1271
75,2.6326
76,2.6326
77,1.1162
78,1.6217
79,3.1381
80,2.1271
81,1.1162
82,1.1162
83,1.1162
84,0.61077
85,-0.40016
86,-0.40016
87,-0.40016
88,-0.40016
89,-0.40016
90,-0.40016
91,-0.40016
92,-0.40016
93,-0.40016
94,-0.40016
95,-0.40016
