[<text>
<title>mcrae industries inc &lt;mri.b&gt; 2nd qtr jan 31 net</title>
<dateline>    mount gilead, n.c., march 17 -
    </dateline>shr 19 cts vs three cts
    net 515,000 vs 87,000
    revs 6,830,000 vs 4,107,000
    six mths
    shr 36 cts vs 12 cts
    net 955,000 vs 327,000
    revs 14.2 mln vs 9,755,000
 reuter
</text>]