time,value
0,-0.8653799999999999
1,-0.8653799999999999
2,1.7627
3,-0.8653799999999999
4,-0.8653799999999999
5,1.6167
6,-0.8653799999999999
7,-0.28136
8,1.1787
9,-0.8653799999999999
10,0.15665
11,0.44866000000000006
12,-0.8653799999999999
13,0.8866700000000001
14,-0.13535999999999998
15,-0.8653799999999999
16,1.3247
17,-0.5733699999999999
18,-0.8653799999999999
19,1.4707
20,-0.8653799999999999
21,-0.8653799999999999
22,1.6167
23,-0.8653799999999999
24,-0.8653799999999999
25,1.3247
26,-0.8653799999999999
27,-0.5733699999999999
28,1.1787
29,-0.8653799999999999
30,-0.42736999999999997
31,1.1787
32,-0.8653799999999999
33,-0.8653799999999999
34,1.3247
35,-0.8653799999999999
36,-0.8653799999999999
37,1.4707
38,-0.8653799999999999
39,-0.8653799999999999
40,1.6167
41,-0.8653799999999999
42,0.8866700000000001
43,-0.13535999999999998
44,-0.8653799999999999
45,1.4707
46,-0.8653799999999999
47,-0.8653799999999999
48,1.6167
49,-0.8653799999999999
50,-0.8653799999999999
51,1.4707
52,-0.8653799999999999
53,-0.8653799999999999
54,1.6167
55,-0.8653799999999999
56,0.7406699999999999
57,0.010646
58,-0.8653799999999999
59,1.6167
60,-0.8653799999999999
61,-0.8653799999999999
62,1.6167
63,-0.8653799999999999
64,-0.13535999999999998
65,0.7406699999999999
66,-0.8653799999999999
67,0.5946600000000001
68,0.30265
69,-0.8653799999999999
70,1.0327
71,-0.28136
72,-0.8653799999999999
73,1.4707
74,-0.8653799999999999
75,-0.8653799999999999
76,1.7627
77,-0.8653799999999999
78,-0.42736999999999997
79,1.3247
80,-0.8653799999999999
81,0.44866000000000006
82,0.44866000000000006
83,-0.8653799999999999
84,1.1787
85,-0.28136
86,-0.8653799999999999
87,1.7627
88,-0.8653799999999999
89,-0.5733699999999999
90,1.4707
91,-0.8653799999999999
92,0.15665
93,0.7406699999999999
94,-0.8653799999999999
95,0.5946600000000001
