time,value
0,-0.47676
1,-0.47676
2,-0.47676
3,-0.47676
4,-0.47676
5,-0.47676
6,-0.47676
7,-0.47676
8,-0.47676
9,-0.47676
10,-0.47676
11,-0.47676
12,-0.47676
13,-0.47676
14,-0.47676
15,-0.47676
16,-0.47676
17,-0.47676
18,-0.47676
19,-0.47676
20,-0.47676
21,-0.47676
22,-0.47676
23,-0.47676
24,0.28925
25,2.7788
26,2.3
27,1.6298
28,1.6298
29,1.6298
30,1.534
31,3.1618
32,3.449
33,2.0128
34,1.4383
35,2.5873
36,3.2575
37,2.5873
38,-0.18950999999999998
39,0.1935
40,1.2468
41,-0.47676
42,1.151
43,-0.28526
44,0.9595
45,-0.47676
46,0.097745
47,-0.28526
48,-0.47676
49,-0.09375599999999999
50,-0.18950999999999998
51,-0.47676
52,0.0019948
53,-0.47676
54,-0.28526
55,-0.47676
56,-0.47676
57,-0.09375599999999999
58,-0.28526
59,-0.47676
60,-0.47676
61,-0.28526
62,-0.47676
63,-0.47676
64,-0.47676
65,-0.47676
66,-0.47676
67,-0.47676
68,-0.47676
69,-0.47676
70,-0.47676
71,-0.47676
72,-0.47676
73,-0.47676
74,-0.47676
75,-0.47676
76,-0.47676
77,-0.47676
78,-0.47676
79,-0.47676
80,-0.47676
81,-0.47676
82,-0.47676
83,-0.47676
84,-0.47676
85,-0.47676
86,-0.47676
87,-0.47676
88,-0.47676
89,-0.47676
90,-0.47676
91,-0.47676
92,-0.47676
93,-0.47676
94,-0.47676
95,-0.47676
