time,value
0,1.295
1,1.1122
2,1.0207
3,1.0207
4,0.9293399999999999
5,-0.076175
6,-0.9902799999999999
7,-0.9902799999999999
8,-0.9902799999999999
9,-0.9902799999999999
10,-0.9902799999999999
11,-0.9902799999999999
12,-0.259
13,1.3864
14,1.2036
15,1.0207
16,1.0207
17,1.0207
18,-0.259
19,-0.9902799999999999
20,-0.9902799999999999
21,-0.9902799999999999
22,-0.9902799999999999
23,-0.9902799999999999
24,-0.9902799999999999
25,-0.35041
26,1.295
27,1.295
28,1.1122
29,0.9293399999999999
30,1.0207
31,-0.16759000000000002
32,-0.9902799999999999
33,-0.9902799999999999
34,-0.9902799999999999
35,-0.9902799999999999
36,-0.9902799999999999
37,-0.9902799999999999
38,-0.62464
39,1.3864
40,1.295
41,1.0207
42,1.0207
43,1.0207
44,0.9293399999999999
45,-0.9902799999999999
46,-0.9902799999999999
47,-0.9902799999999999
48,-0.9902799999999999
49,-0.9902799999999999
50,-0.9902799999999999
51,-0.9902799999999999
52,0.47229
53,1.295
54,1.2036
55,1.0207
56,1.0207
57,0.9293399999999999
58,0.9293399999999999
59,0.015235
60,-0.9902799999999999
61,-0.9902799999999999
62,-0.9902799999999999
63,-0.9902799999999999
64,-0.9902799999999999
65,-0.9902799999999999
66,0.47229
67,1.295
68,1.2036
69,1.0207
70,1.0207
71,0.9293399999999999
72,0.9293399999999999
73,0.47229
74,-0.9902799999999999
75,-0.9902799999999999
76,-0.9902799999999999
77,-0.9902799999999999
78,-0.9902799999999999
79,-0.9902799999999999
80,-0.9902799999999999
81,1.3864
82,1.295
83,1.1122
84,1.0207
85,0.9293399999999999
86,0.9293399999999999
87,0.38088
88,-0.9902799999999999
89,-0.9902799999999999
90,-0.9902799999999999
91,-0.9902799999999999
92,-0.9902799999999999
93,-0.9902799999999999
94,-0.71605
95,1.3864
