time,value
0,-0.24736
1,-0.24736
2,-0.24736
3,-0.24736
4,-0.24736
5,-0.24736
6,-0.24736
7,-0.24736
8,-0.24736
9,-0.24736
10,-0.24736
11,-0.24736
12,-0.24736
13,-0.24736
14,-0.24736
15,-0.24736
16,-0.24736
17,-0.24736
18,-0.24736
19,-0.24736
20,-0.24736
21,-0.24736
22,-0.24736
23,-0.24736
24,-0.24736
25,-0.24736
26,-0.24736
27,-0.24736
28,-0.24736
29,-0.24736
30,-0.24736
31,-0.24736
32,-0.24736
33,-0.24736
34,-0.24736
35,-0.24736
36,-0.24736
37,-0.24736
38,-0.24736
39,-0.24736
40,-0.24736
41,-0.24736
42,-0.24736
43,-0.24736
44,-0.24736
45,-0.24736
46,-0.24736
47,-0.24736
48,-0.24736
49,-0.24736
50,-0.24736
51,-0.24736
52,-0.24736
53,-0.24736
54,-0.24736
55,-0.24736
56,-0.24736
57,-0.24736
58,-0.24736
59,-0.24736
60,-0.24736
61,-0.24736
62,-0.24736
63,-0.24736
64,-0.24736
65,-0.24736
66,-0.24736
67,-0.24736
68,-0.24736
69,-0.24736
70,-0.24736
71,-0.24736
72,-0.24736
73,-0.24736
74,-0.24736
75,-0.24736
76,-0.24736
77,-0.24736
78,-0.24736
79,3.9083
80,4.303999999999999
81,4.303999999999999
82,4.303999999999999
83,4.1061
84,1.3357
85,-0.24736
86,-0.24736
87,-0.24736
88,-0.24736
89,-0.24736
90,-0.24736
91,-0.24736
92,-0.24736
93,-0.24736
94,-0.24736
95,-0.24736
