time,value
0,-0.55838
1,-0.55838
2,-0.55838
3,1.7722
4,-0.55838
5,-0.55838
6,-0.55838
7,1.7722
8,-0.55838
9,-0.55838
10,-0.55838
11,1.7722
12,-0.55838
13,-0.55838
14,1.7722
15,-0.55838
16,-0.55838
17,-0.55838
18,1.7722
19,-0.55838
20,-0.55838
21,-0.55838
22,1.7722
23,-0.55838
24,-0.55838
25,-0.55838
26,1.7722
27,-0.55838
28,-0.55838
29,-0.55838
30,1.7722
31,-0.55838
32,-0.55838
33,1.7722
34,-0.55838
35,-0.55838
36,-0.55838
37,1.7722
38,-0.55838
39,-0.55838
40,-0.55838
41,1.7722
42,-0.55838
43,-0.55838
44,-0.55838
45,1.7722
46,-0.55838
47,-0.55838
48,-0.55838
49,1.7722
50,-0.55838
51,-0.55838
52,-0.55838
53,1.7722
54,-0.55838
55,-0.55838
56,1.7722
57,-0.55838
58,-0.55838
59,-0.55838
60,1.7722
61,-0.55838
62,-0.55838
63,-0.55838
64,1.7722
65,-0.55838
66,-0.55838
67,-0.55838
68,1.7722
69,-0.55838
70,-0.55838
71,-0.55838
72,1.7722
73,-0.55838
74,-0.55838
75,1.7722
76,-0.55838
77,-0.55838
78,-0.55838
79,1.7722
80,-0.55838
81,-0.55838
82,-0.55838
83,-0.55838
84,1.7722
85,-0.55838
86,-0.55838
87,-0.55838
88,-0.55838
89,-0.55838
90,-0.55838
91,1.7722
92,-0.55838
93,-0.55838
94,-0.55838
95,-0.55838
