time,value
0,-0.18675
1,-0.18675
2,-0.18675
3,-0.18675
4,-0.18675
5,-0.18675
6,-0.18675
7,-0.18675
8,-0.18675
9,-0.18675
10,-0.18675
11,-0.18675
12,-0.18675
13,-0.18675
14,-0.18675
15,-0.18675
16,-0.18675
17,-0.18675
18,-0.18675
19,-0.18675
20,-0.18675
21,-0.18675
22,-0.18675
23,-0.18675
24,-0.18675
25,-0.18675
26,-0.18675
27,-0.18675
28,-0.18675
29,-0.18675
30,-0.18675
31,-0.18675
32,-0.18675
33,-0.18675
34,-0.18675
35,-0.18675
36,-0.18675
37,-0.18675
38,-0.18675
39,-0.18675
40,-0.18675
41,-0.18675
42,-0.18675
43,-0.18675
44,-0.18675
45,-0.18675
46,-0.18675
47,-0.18675
48,-0.18675
49,-0.18675
50,-0.18675
51,-0.18675
52,-0.18675
53,-0.18675
54,-0.18675
55,-0.18675
56,-0.18675
57,-0.18675
58,-0.18675
59,-0.18675
60,-0.18675
61,-0.18675
62,-0.18675
63,-0.18675
64,-0.18675
65,-0.18675
66,-0.18675
67,-0.18675
68,-0.18675
69,-0.18675
70,-0.18675
71,-0.18675
72,-0.18675
73,-0.18675
74,-0.18675
75,-0.18675
76,-0.18675
77,-0.18675
78,-0.18675
79,-0.18675
80,-0.18675
81,-0.18675
82,-0.18675
83,-0.12287000000000001
84,0.17521
85,6.3285
86,0.1965
87,0.2178
88,0.13263
89,6.5627
90,2.9431
91,-0.18675
92,-0.18675
93,-0.18675
94,-0.18675
95,-0.18675
