time,value
0,1.3306
1,0.30945
2,-0.8973899999999999
3,-0.8973899999999999
4,-0.8973899999999999
5,-0.8973899999999999
6,-0.8973899999999999
7,0.86645
8,1.2378
9,1.3306
10,-0.061889
11,-0.8973899999999999
12,-0.8973899999999999
13,-0.8973899999999999
14,-0.8973899999999999
15,-0.8973899999999999
16,0.30945
17,1.4234
18,1.3306
19,0.68078
20,-0.8973899999999999
21,-0.8973899999999999
22,-0.8973899999999999
23,-0.8973899999999999
24,-0.8973899999999999
25,-0.8973899999999999
26,0.9592799999999999
27,1.3306
28,1.2378
29,0.58795
30,-0.8973899999999999
31,-0.8973899999999999
32,-0.8973899999999999
33,-0.15472
34,1.4234
35,1.4234
36,1.3306
37,-0.061889
38,-0.8973899999999999
39,-0.8973899999999999
40,-0.8973899999999999
41,1.4234
42,1.4234
43,0.30945
44,-0.8973899999999999
45,-0.8973899999999999
46,-0.8973899999999999
47,-0.71172
48,1.4234
49,1.3306
50,1.1449
51,-0.8973899999999999
52,-0.8973899999999999
53,-0.8973899999999999
54,0.40228
55,1.4234
56,1.2378
57,0.030945
58,-0.8973899999999999
59,-0.8973899999999999
60,-0.8973899999999999
61,-0.6188899999999999
62,1.4234
63,1.3306
64,0.30945
65,-0.8973899999999999
66,-0.8973899999999999
67,-0.8973899999999999
68,-0.5260600000000001
69,1.4234
70,1.3306
71,1.2378
72,-0.5260600000000001
73,-0.8973899999999999
74,-0.8973899999999999
75,1.4234
76,1.4234
77,1.1449
78,-0.8973899999999999
79,-0.8973899999999999
80,-0.8973899999999999
81,0.12378
82,1.4234
83,1.3306
84,-0.5260600000000001
85,-0.8973899999999999
86,-0.8973899999999999
87,-0.8973899999999999
88,0.77361
89,1.3306
90,1.3306
91,-0.15472
92,-0.8973899999999999
93,-0.8973899999999999
94,-0.8973899999999999
95,-0.8973899999999999
