time,value
0,1.5045
1,1.4481
2,1.4549
3,1.465
4,1.4785
5,1.4713
6,1.4278
7,1.3882
8,1.3149
9,1.2212
10,1.1185
11,1.0648
12,0.9683299999999999
13,0.86816
14,0.76751
15,0.65261
16,0.55924
17,0.45898
18,0.35491999999999996
19,0.25434
20,0.15882000000000002
21,0.079709
22,-0.020929
23,-0.09992999999999999
24,-0.20108
25,-0.26824000000000003
26,-0.36879
27,-0.46713000000000005
28,-0.56304
29,-0.64108
30,-0.68323
31,-0.74254
32,-0.79442
33,-0.8505799999999999
34,-0.9214399999999999
35,-0.98761
36,-1.0487
37,-1.1043
38,-1.1536
39,-1.1966
40,-1.2329
41,-1.2431
42,-1.2252
43,-1.2684
44,-1.306
45,-1.3052
46,-1.3402
47,-1.3399
48,-1.3158
49,-1.2842
50,-1.2453
51,-1.1996
52,-1.1475
53,-1.105
54,-1.0775
55,-1.0299
56,-1.0062
57,-0.94653
58,-0.89133
59,-0.81403
60,-0.75488
61,-0.66257
62,-0.56314
63,-0.49849
64,-0.42837
65,-0.35313
66,-0.26328
67,-0.14968
68,-0.034964999999999996
69,0.065565
70,0.15614
71,0.25013
72,0.34729
73,0.46537
74,0.5684
75,0.6738
76,0.7951699999999999
77,0.89205
78,0.96851
79,1.0784
80,1.1901
81,1.3036
82,1.4124
83,1.5203
84,1.5842
85,1.5826
86,1.5731
87,1.567
88,1.5643
89,1.5649
90,1.5689
91,1.5535
92,1.5271
93,1.5089
94,1.4623
95,1.3782
96,1.2665
97,1.1652
98,1.0569
99,0.94895
100,0.84124
101,0.72127
102,0.61349
103,0.49858
104,0.40014
105,0.29253
106,0.18784
107,0.097294
108,0.010388
109,-0.072601
110,-0.17987999999999998
111,-0.25845
112,-0.36632
113,-0.46663999999999994
114,-0.5403899999999999
115,-0.62851
116,-0.68315
117,-0.7523
118,-0.81684
119,-0.8831200000000001
120,-0.92935
121,-0.9923299999999999
122,-1.0633
123,-1.1294
124,-1.1868
125,-1.189
126,-1.2358
127,-1.276
128,-1.3092
129,-1.3078
130,-1.2939
131,-1.3041
132,-1.3066
133,-1.3014
134,-1.2885
135,-1.2681
136,-1.2403
137,-1.205
138,-1.1631
139,-1.1294
140,-1.1141
141,-1.0529
142,-0.9865799999999999
143,-0.9153899999999999
144,-0.8397700000000001
145,-0.76008
146,-0.71396
147,-0.67237
148,-0.58333
149,-0.48782
150,-0.39588
151,-0.33515
152,-0.25816999999999996
153,-0.16507
154,-0.07609199999999999
155,0.017230000000000002
156,0.11640999999999999
157,0.20995999999999998
158,0.29669
159,0.40875
160,0.50344
161,0.5985199999999999
162,0.6964899999999999
163,0.7971
164,0.90018
165,0.99969
166,1.0981
167,1.1703
168,1.2141
169,1.2582
170,1.3016
171,1.3489
172,1.3436
173,1.3952
174,1.4473
175,1.4449
