time,value
0,-0.66535
1,-0.66535
2,-0.66535
3,-0.66535
4,1.5256
5,1.8626
6,0.34584000000000004
7,-0.66535
8,-0.66535
9,-0.66535
10,-0.66535
11,-0.66535
12,1.02
13,1.8626
14,0.8514299999999999
15,-0.66535
16,-0.66535
17,-0.66535
18,-0.66535
19,-0.66535
20,0.34584000000000004
21,1.8626
22,1.357
23,-0.66535
24,-0.66535
25,-0.66535
26,-0.66535
27,-0.66535
28,-0.66535
29,2.0312
30,1.6941
31,-0.32828
32,-0.66535
33,-0.66535
34,-0.66535
35,-0.66535
36,-0.15975
37,2.0312
38,1.5256
39,-0.66535
40,-0.66535
41,-0.66535
42,-0.66535
43,-0.66535
44,-0.66535
45,1.8626
46,1.6941
47,-0.15975
48,-0.66535
49,-0.66535
50,-0.66535
51,-0.66535
52,-0.66535
53,0.8514299999999999
54,1.8626
55,0.51437
56,-0.66535
57,-0.66535
58,-0.66535
59,-0.66535
60,-0.66535
61,0.17731
62,2.0312
63,1.357
64,-0.66535
65,-0.66535
66,-0.66535
67,-0.66535
68,-0.66535
69,-0.32828
70,2.0312
71,1.5256
72,-0.66535
73,-0.66535
74,-0.66535
75,-0.66535
76,-0.66535
77,-0.66535
78,1.357
79,1.6941
80,0.17731
81,-0.66535
82,-0.66535
83,-0.66535
84,-0.66535
85,-0.66535
86,1.6941
87,1.6941
88,0.6829
89,-0.66535
90,-0.66535
91,-0.66535
92,-0.66535
93,-0.66535
94,0.17731
95,1.8626
