time,value
0,-0.40934
1,-0.40934
2,-0.40934
3,-0.40934
4,-0.40934
5,-0.40934
6,-0.40934
7,-0.40934
8,-0.40934
9,-0.40934
10,-0.40934
11,-0.40934
12,0.040621
13,-0.40934
14,-0.40934
15,-0.40934
16,-0.40934
17,-0.40934
18,-0.40934
19,-0.40934
20,-0.10937000000000001
21,-0.40934
22,-0.40934
23,-0.40934
24,-0.40934
25,-0.40934
26,-0.40934
27,-0.40934
28,-0.40934
29,-0.40934
30,-0.40934
31,-0.40934
32,-0.40934
33,-0.40934
34,-0.40934
35,-0.40934
36,-0.40934
37,-0.40934
38,-0.40934
39,-0.40934
40,0.040621
41,-0.40934
42,-0.40934
43,-0.40934
44,-0.40934
45,-0.40934
46,-0.40934
47,-0.40934
48,-0.40934
49,-0.40934
50,-0.40934
51,-0.40934
52,-0.40934
53,-0.40934
54,-0.40934
55,-0.40934
56,0.040621
57,-0.40934
58,-0.40934
59,-0.40934
60,-0.40934
61,-0.40934
62,-0.40934
63,-0.40934
64,-0.40934
65,-0.40934
66,-0.40934
67,-0.40934
68,-0.40934
69,-0.40934
70,-0.40934
71,-0.40934
72,-0.40934
73,-0.40934
74,-0.40934
75,-0.40934
76,-0.40934
77,-0.40934
78,-0.40934
79,1.0905
80,0.64057
81,0.49058
82,0.64057
83,0.49058
84,0.64057
85,3.0404
86,3.1903
87,3.1903
88,3.1903
89,3.1903
90,3.0404
91,3.1903
92,3.0404
93,0.49058
94,0.49058
95,0.64057
