time,value
0,-0.5424899999999999
1,1.3974
2,-0.8409399999999999
3,-0.5424899999999999
4,1.3974
5,-0.8409399999999999
6,-0.5424899999999999
7,1.3974
8,-0.8409399999999999
9,-0.8409399999999999
10,1.3974
11,-0.8409399999999999
12,-0.8409399999999999
13,1.6959
14,-0.8409399999999999
15,-0.8409399999999999
16,1.6959
17,-0.8409399999999999
18,-0.8409399999999999
19,1.5466
20,-0.8409399999999999
21,-0.8409399999999999
22,1.6959
23,-0.8409399999999999
24,-0.8409399999999999
25,1.3974
26,-0.5424899999999999
27,-0.8409399999999999
28,0.94975
29,-0.24404
30,-0.8409399999999999
31,0.35285
32,0.50208
33,-0.8409399999999999
34,-0.24404
35,1.099
36,-0.8409399999999999
37,-0.5424899999999999
38,1.2482
39,-0.8409399999999999
40,0.20363
41,0.80053
42,-0.8409399999999999
43,-0.5424899999999999
44,1.5466
45,-0.8409399999999999
46,-0.8409399999999999
47,1.6959
48,-0.8409399999999999
49,-0.8409399999999999
50,1.5466
51,-0.8409399999999999
52,-0.8409399999999999
53,0.80053
54,0.20363
55,-0.8409399999999999
56,0.50208
57,0.50208
58,-0.8409399999999999
59,0.054404999999999995
60,0.80053
61,-0.8409399999999999
62,-0.24404
63,1.099
64,-0.8409399999999999
65,-0.8409399999999999
66,1.5466
67,-0.8409399999999999
68,-0.8409399999999999
69,1.6959
70,-0.8409399999999999
71,-0.8409399999999999
72,1.6959
73,-0.8409399999999999
74,-0.8409399999999999
75,1.6959
76,-0.8409399999999999
77,-0.8409399999999999
78,1.3974
79,-0.8409399999999999
80,-0.24404
81,1.2482
82,-0.8409399999999999
83,1.2482
84,-0.39327
85,-0.8409399999999999
86,1.6959
87,-0.8409399999999999
88,0.054404999999999995
89,0.80053
90,-0.8409399999999999
91,1.2482
92,-0.24404
93,-0.8409399999999999
94,1.6959
95,-0.8409399999999999
