time,value
0,-0.2399
1,-0.2399
2,-0.2399
3,-0.2399
4,-0.2399
5,-0.2399
6,-0.2399
7,-0.2399
8,-0.2399
9,-0.2399
10,-0.2399
11,-0.2399
12,-0.2399
13,-0.2399
14,-0.2399
15,-0.2399
16,-0.2399
17,-0.2399
18,-0.2399
19,-0.2399
20,-0.2399
21,-0.2399
22,-0.2399
23,-0.2399
24,-0.2399
25,-0.2399
26,-0.2399
27,-0.2399
28,-0.2399
29,-0.2399
30,-0.2399
31,-0.2399
32,-0.2399
33,-0.2399
34,-0.2399
35,-0.2399
36,2.8597
37,-0.2399
38,-0.2399
39,-0.2399
40,2.4598
41,6.8259
42,-0.2399
43,-0.2399
44,4.1596
45,-0.13990999999999998
46,-0.2399
47,-0.2399
48,-0.2399
49,-0.2399
50,-0.2399
51,-0.2399
52,-0.2399
53,-0.2399
54,-0.2399
55,2.3598
56,0.093391
57,-0.2399
58,-0.2399
59,-0.2399
60,-0.2399
61,-0.2399
62,-0.2399
63,-0.2399
64,2.4931
65,-0.2399
66,-0.2399
67,-0.2399
68,-0.2399
69,-0.2399
70,-0.2399
71,-0.2399
72,-0.2399
73,-0.2399
74,-0.2399
75,-0.2399
76,-0.2399
77,-0.2399
78,-0.2399
79,-0.2399
80,-0.2399
81,-0.2399
82,-0.2399
83,-0.2399
84,-0.2399
85,-0.2399
86,-0.2399
87,-0.2399
88,-0.2399
89,-0.2399
90,-0.2399
91,-0.2399
92,-0.2399
93,-0.2399
94,-0.2399
95,-0.2399
