time,value
0,-0.13566
1,-0.46124
2,-0.4362
3,-0.11062000000000001
4,-0.41115
5,-0.26088
6,-0.21079
7,-0.46124
8,-0.28593
9,-0.21079
10,-0.48628999999999994
11,-0.18575
12,-0.26088
13,-0.46124
14,-0.13566
15,-0.38611
16,-0.46124
17,-0.13566
18,-0.31096999999999997
19,-0.36106
20,-0.1607
21,-0.46124
22,-0.46124
23,-0.08557000000000001
24,-0.38611
25,-0.21079
26,-0.31096999999999997
27,-0.46124
28,-0.38611
29,-0.13566
30,-0.41115
31,2.1184
32,-0.035480000000000005
33,-0.46124
34,-0.36106
35,-0.11062000000000001
36,-0.18575
37,-0.28593
38,-0.48628999999999994
39,-0.46124
40,-0.31096999999999997
41,0.01461
42,-0.21079
43,-0.48628999999999994
44,0.26506
45,-0.28593
46,0.01461
47,0.24001
48,-0.28593
49,-0.28593
50,-0.28593
51,-0.28593
52,0.21497
53,0.089744
54,-0.48628999999999994
55,-0.46124
56,-0.48628999999999994
57,-0.31096999999999997
58,0.18992
59,-0.38611
60,-0.48628999999999994
61,-0.46124
62,-0.48628999999999994
63,-0.08557000000000001
64,0.039654
65,-0.46124
66,-0.48628999999999994
67,-0.46124
68,-0.4362
69,0.089744
70,-0.18575
71,-0.46124
72,-0.48628999999999994
73,-0.46124
74,-0.23584000000000002
75,0.01461
76,-0.23584000000000002
77,-0.13566
78,0.61569
79,-0.33602
80,-0.060525
81,-0.11062000000000001
82,3.045
83,2.6193
84,-0.36106
85,5.4744
86,4.1721
87,0.11479
88,-0.1607
89,-0.060525
90,4.0969
91,-0.1607
92,0.71587
93,-0.31096999999999997
94,-0.36106
95,-0.060525
