time,value
0,0.5644399999999999
1,-1.7512
2,-0.13026
3,-0.36182
4,-1.2881
5,0.10131
6,-1.7512
7,-0.82496
8,0.10131
9,-1.7512
10,0.33288
11,-0.36182
12,-1.7512
13,0.79601
14,-0.59339
15,-1.0565
16,1.0276
17,-1.2881
18,-0.82496
19,0.10131
20,-1.2881
21,0.10131
22,-0.13026
23,-1.7512
24,1.9538
25,-0.36182
26,-0.82496
27,1.9538
28,-0.36182
29,-0.36182
30,1.2591
31,-0.59339
32,0.79601
33,1.4907
34,-0.59339
35,0.5644399999999999
36,0.10131
37,-1.2881
38,1.2591
39,-0.59339
40,-1.0565
41,1.2591
42,-0.82496
43,0.5644399999999999
44,0.79601
45,-0.82496
46,0.33288
47,0.10131
48,-0.82496
49,0.5644399999999999
50,-0.36182
51,0.33288
52,2.8801
53,0.33288
54,0.10131
55,1.9538
56,-0.82496
57,0.5644399999999999
58,1.2591
59,-0.59339
60,1.2591
61,1.4907
62,-0.36182
63,1.7223
64,-0.13026
65,0.10131
66,1.0276
67,-0.82496
68,0.10131
69,0.10131
70,-1.0565
71,1.0276
72,-0.13026
73,0.10131
74,1.0276
75,-0.82496
76,1.0276
77,0.10131
78,-1.0565
79,1.0276
80,-0.36182
81,-0.36182
82,1.2591
83,-0.59339
84,0.10131
85,0.33288
86,-1.0565
87,1.2591
88,-0.36182
89,-1.0565
90,1.4907
91,-1.2881
92,-0.59339
93,0.79601
94,-1.7512
95,0.10131
