time,value
0,-0.35954
1,-0.35954
2,-0.35954
3,-0.35954
4,-0.35954
5,-0.35954
6,-0.35954
7,-0.35954
8,-0.35954
9,-0.35954
10,-0.35954
11,-0.35954
12,-0.35954
13,-0.35954
14,-0.35954
15,-0.35954
16,-0.35954
17,-0.35954
18,-0.35954
19,-0.35954
20,-0.35954
21,-0.35954
22,-0.35954
23,-0.35954
24,-0.35954
25,-0.35954
26,-0.35954
27,-0.35954
28,-0.35954
29,-0.35954
30,-0.35954
31,-0.35954
32,-0.35954
33,-0.35954
34,-0.35954
35,-0.35954
36,-0.35954
37,-0.35954
38,-0.35954
39,-0.35954
40,-0.35954
41,-0.35954
42,-0.35954
43,-0.35954
44,-0.35954
45,-0.35954
46,-0.35954
47,-0.35954
48,-0.35954
49,-0.35954
50,-0.35954
51,-0.35954
52,-0.35954
53,-0.35954
54,-0.35954
55,-0.35954
56,-0.35954
57,-0.35954
58,-0.35954
59,-0.35954
60,-0.35954
61,-0.35954
62,-0.35954
63,-0.35954
64,-0.35954
65,-0.35954
66,-0.35954
67,-0.35954
68,-0.35954
69,-0.35954
70,-0.35954
71,-0.35954
72,-0.35954
73,-0.35954
74,-0.35954
75,-0.35954
76,-0.35954
77,-0.35954
78,-0.35954
79,-0.35954
80,1.8817
81,2.6288
82,2.6288
83,2.7782
84,3.0771
85,3.0771
86,3.2265
87,3.0771
88,2.33
89,2.6288
90,2.7782
91,0.23814000000000002
92,-0.35954
93,-0.5089600000000001
94,-0.35954
95,-0.35954
