time,value
0,1.3884
1,1.2952
2,0.26991
3,-0.94179
4,-0.94179
5,-0.94179
6,-0.94179
7,0.26991
8,1.2952
9,1.2952
10,-0.19613
11,-0.94179
12,-0.94179
13,-0.94179
14,-0.94179
15,0.17670999999999998
16,1.2952
17,1.2952
18,0.17670999999999998
19,-0.94179
20,-0.94179
21,-0.94179
22,-0.94179
23,-0.94179
24,1.1088
25,1.2952
26,1.2952
27,-0.19613
28,-0.94179
29,-0.94179
30,-0.94179
31,0.82916
32,1.2952
33,1.2952
34,-0.28933000000000003
35,-0.94179
36,-0.94179
37,-0.009709200000000001
38,1.2952
39,1.2952
40,-0.75537
41,-0.94179
42,-0.94179
43,-0.94179
44,1.3884
45,1.2952
46,0.26991
47,-0.94179
48,-0.94179
49,0.73595
50,1.2952
51,1.2952
52,-0.47575
53,-0.94179
54,-0.94179
55,-0.94179
56,1.2952
57,1.2952
58,0.36312
59,-0.94179
60,-0.94179
61,-0.94179
62,-0.94179
63,0.82916
64,1.2952
65,1.2952
66,-0.94179
67,-0.94179
68,-0.94179
69,-0.94179
70,1.202
71,1.2952
72,0.5495399999999999
73,-0.94179
74,-0.94179
75,-0.94179
76,1.202
77,1.2952
78,0.73595
79,-0.94179
80,-0.94179
81,-0.94179
82,-0.19613
83,1.3884
84,1.2952
85,-0.10292000000000001
86,-0.94179
87,-0.94179
88,-0.94179
89,0.64275
90,1.3884
91,1.2952
92,-0.38254
93,-0.75537
94,-0.94179
95,1.3884
