time,value
0,-0.16127
1,-0.16127
2,-0.16127
3,-0.16127
4,-0.16127
5,-0.16127
6,-0.16127
7,-0.16127
8,-0.16127
9,-0.16127
10,-0.16127
11,-0.16127
12,-0.16127
13,-0.16127
14,-0.16127
15,-0.16127
16,-0.16127
17,-0.16127
18,-0.16127
19,-0.16127
20,-0.16127
21,-0.16127
22,-0.16127
23,-0.16127
24,-0.16127
25,-0.16127
26,-0.16127
27,-0.16127
28,-0.16127
29,-0.16127
30,-0.16127
31,-0.16127
32,-0.16127
33,-0.16127
34,-0.16127
35,-0.16127
36,-0.16127
37,-0.16127
38,-0.16127
39,-0.16127
40,-0.16127
41,-0.16127
42,-0.16127
43,-0.16127
44,-0.16127
45,-0.16127
46,-0.16127
47,-0.16127
48,-0.16127
49,-0.16127
50,-0.16127
51,-0.16127
52,-0.16127
53,-0.16127
54,-0.16127
55,-0.16127
56,-0.16127
57,-0.16127
58,-0.16127
59,-0.16127
60,-0.16127
61,-0.16127
62,-0.16127
63,-0.16127
64,-0.16127
65,-0.16127
66,-0.16127
67,-0.16127
68,-0.16127
69,-0.16127
70,-0.16127
71,-0.16127
72,-0.16127
73,-0.16127
74,-0.16127
75,-0.16127
76,-0.16127
77,-0.16127
78,-0.16127
79,-0.16127
80,-0.16127
81,-0.16127
82,-0.16127
83,-0.16127
84,-0.037556
85,0.45731000000000005
86,6.0245
87,0.13918
88,0.15685
89,0.12150999999999999
90,7.4914
91,-0.16127
92,-0.16127
93,-0.16127
94,-0.16127
95,-0.16127
