time,value
0,-0.093284
1,-0.093284
2,-0.093284
3,-0.093284
4,-0.093284
5,-0.54105
6,-0.093284
7,-0.093284
8,-0.093284
9,-0.093284
10,-0.54105
11,-0.093284
12,-0.093284
13,-0.093284
14,-0.093284
15,-0.093284
16,-0.54105
17,-0.093284
18,-0.093284
19,-0.093284
20,-0.093284
21,-0.54105
22,-0.093284
23,-0.093284
24,-0.093284
25,-0.093284
26,-0.093284
27,5.7276
28,5.7276
29,4.8321
30,0.35448
31,-0.093284
32,-0.093284
33,-0.093284
34,-0.54105
35,-0.093284
36,-0.093284
37,-0.093284
38,-0.54105
39,-0.093284
40,-0.093284
41,-0.093284
42,-0.093284
43,-0.54105
44,-0.093284
45,-0.093284
46,-0.54105
47,-0.093284
48,-0.093284
49,-0.093284
50,-0.093284
51,-0.54105
52,-0.093284
53,-0.093284
54,-0.093284
55,-0.54105
56,-0.093284
57,-0.093284
58,-0.093284
59,-0.54105
60,-0.093284
61,-0.093284
62,-0.093284
63,-0.54105
64,-0.093284
65,-0.093284
66,-0.093284
67,-0.093284
68,-0.54105
69,-0.093284
70,-0.093284
71,-0.093284
72,-0.093284
73,-0.54105
74,-0.093284
75,-0.093284
76,-0.093284
77,-0.093284
78,-0.093284
79,-0.54105
80,-0.093284
81,-0.093284
82,-0.093284
83,-0.093284
84,-0.54105
85,-0.093284
86,-0.093284
87,-0.093284
88,-0.093284
89,-0.093284
90,-0.54105
91,-0.093284
92,-0.093284
93,-0.093284
94,-0.54105
95,-0.093284
