time,value
0,-0.18211
1,-0.18211
2,-0.18211
3,-0.18211
4,-0.18211
5,-0.18211
6,-0.18211
7,-0.18211
8,-0.18211
9,-0.18211
10,-0.18211
11,-0.18211
12,-0.18211
13,-0.18211
14,-0.18211
15,-0.18211
16,-0.18211
17,-0.18211
18,-0.18211
19,-0.18211
20,-0.18211
21,-0.18211
22,-0.18211
23,-0.18211
24,-0.18211
25,-0.18211
26,-0.18211
27,-0.18211
28,-0.18211
29,-0.18211
30,-0.18211
31,-0.18211
32,-0.18211
33,-0.18211
34,-0.18211
35,-0.18211
36,0.083583
37,4.7952
38,2.4925
39,0.13672
40,0.11900999999999999
41,0.68582
42,7.895
43,-0.18211
44,-0.18211
45,-0.18211
46,-0.18211
47,-0.18211
48,-0.18211
49,-0.18211
50,-0.18211
51,-0.18211
52,-0.18211
53,-0.18211
54,-0.18211
55,-0.18211
56,-0.18211
57,-0.18211
58,-0.18211
59,-0.18211
60,-0.18211
61,-0.18211
62,-0.18211
63,-0.18211
64,-0.18211
65,-0.18211
66,-0.18211
67,-0.18211
68,-0.18211
69,-0.18211
70,-0.18211
71,-0.18211
72,-0.18211
73,-0.18211
74,-0.18211
75,-0.18211
76,-0.18211
77,-0.18211
78,-0.18211
79,-0.18211
80,-0.18211
81,-0.18211
82,-0.18211
83,-0.18211
84,-0.18211
85,-0.18211
86,-0.18211
87,-0.18211
88,-0.18211
89,-0.18211
90,-0.18211
91,-0.18211
92,-0.18211
93,-0.18211
94,-0.18211
95,-0.18211
