time,value
0,-0.17867
1,-0.17867
2,-0.17867
3,-0.17867
4,-0.17867
5,-0.17867
6,-0.17867
7,-0.17867
8,-0.17867
9,-0.17867
10,-0.17867
11,-0.17867
12,-0.17867
13,-0.17867
14,-0.17867
15,5.5387
16,-0.17867
17,-0.17867
18,-0.17867
19,-0.17867
20,-0.17867
21,-0.17867
22,-0.17867
23,-0.17867
24,-0.17867
25,-0.17867
26,-0.17867
27,-0.17867
28,-0.17867
29,-0.17867
30,-0.17867
31,-0.17867
32,-0.17867
33,-0.17867
34,-0.17867
35,-0.17867
36,-0.17867
37,-0.17867
38,-0.17867
39,-0.17867
40,-0.17867
41,-0.17867
42,-0.17867
43,-0.17867
44,-0.17867
45,-0.17867
46,-0.17867
47,-0.17867
48,-0.17867
49,-0.17867
50,-0.17867
51,5.5387
52,-0.17867
53,-0.17867
54,-0.17867
55,-0.17867
56,-0.17867
57,-0.17867
58,-0.17867
59,-0.17867
60,-0.17867
61,-0.17867
62,-0.17867
63,-0.17867
64,-0.17867
65,-0.17867
66,-0.17867
67,-0.17867
68,-0.17867
69,-0.17867
70,-0.17867
71,-0.17867
72,-0.17867
73,-0.17867
74,-0.17867
75,-0.17867
76,-0.17867
77,-0.17867
78,-0.17867
79,-0.17867
80,-0.17867
81,-0.17867
82,-0.17867
83,-0.17867
84,-0.17867
85,-0.17867
86,-0.17867
87,-0.17867
88,-0.17867
89,-0.17867
90,-0.17867
91,-0.17867
92,-0.17867
93,5.5387
94,-0.17867
95,-0.17867
