time,value
0,-0.33531
1,2.9744
2,-0.33531
3,-0.33531
4,-0.33531
5,-0.33531
6,-0.33531
7,-0.33531
8,-0.33531
9,-0.33531
10,-0.33531
11,-0.33531
12,-0.33531
13,-0.33531
14,-0.33531
15,-0.33531
16,-0.33531
17,-0.33531
18,-0.33531
19,-0.33531
20,-0.33531
21,-0.33531
22,-0.33531
23,-0.33531
24,-0.33531
25,-0.33531
26,-0.33531
27,1.3931
28,-0.29854
29,-0.33531
30,-0.33531
31,-0.33531
32,-0.33531
33,-0.33531
34,-0.33531
35,-0.33531
36,-0.33531
37,-0.33531
38,-0.33531
39,1.1602
40,1.0744
41,-0.33531
42,-0.33531
43,-0.33531
44,-0.33531
45,1.8344
46,-0.33531
47,-0.33531
48,-0.33531
49,-0.33531
50,-0.33531
51,-0.33531
52,-0.33531
53,-0.33531
54,-0.33531
55,-0.33531
56,-0.33531
57,2.0305
58,-0.33531
59,-0.33531
60,-0.33531
61,-0.33531
62,-0.33531
63,-0.33531
64,-0.33531
65,-0.33531
66,-0.33531
67,-0.33531
68,-0.33531
69,-0.33531
70,-0.33531
71,-0.33531
72,-0.33531
73,-0.33531
74,-0.33531
75,0.97631
76,5.4873
77,2.3247
78,4.1267
79,2.2389
80,2.5086
81,-0.33531
82,-0.33531
83,-0.33531
84,-0.33531
85,-0.33531
86,-0.33531
87,-0.33531
88,-0.33531
89,-0.33531
90,-0.33531
91,-0.33531
92,-0.33531
93,-0.33531
94,-0.33531
95,-0.33531
