time,value
0,1.7036
1,1.7013
2,1.6944
3,1.6580000000000001
4,1.6329
5,1.6028
6,1.5753
7,1.5455
8,1.5105
9,1.475
10,1.44
11,1.4085
12,1.3742
13,1.339
14,1.3052
15,1.2736
16,1.2392
17,1.2046
18,1.1716
19,1.1409
20,1.1076
21,1.0728
22,1.0371
23,0.99946
24,0.9618399999999999
25,0.9247
26,0.88854
27,0.8529100000000001
28,0.81794
29,0.7834300000000001
30,0.74844
31,0.71418
32,0.68058
33,0.6459600000000001
34,0.61143
35,0.57699
36,0.54265
37,0.5088199999999999
38,0.47493
39,0.44092
40,0.40702
41,0.37323
42,0.33957
43,0.30679
44,0.27418000000000003
45,0.24175
46,0.20951
47,0.17745
48,0.14473
49,0.11217
50,0.078876
51,0.046643000000000004
52,0.013643
53,-0.020178
54,-0.052895000000000005
55,-0.085451
56,-0.11844
57,-0.12174000000000001
58,-0.11459000000000001
59,-0.13475
60,-0.15637
61,-0.17594
62,-0.1959
63,-0.21636999999999998
64,-0.22643000000000002
65,-0.23874
66,-0.25671
67,-0.26266
68,-0.28608
69,-0.31353000000000003
70,-0.33921
71,-0.35623
72,-0.38009
73,-0.40463000000000005
74,-0.41189
75,-0.43946999999999997
76,-0.47013
77,-0.49928
78,-0.5370199999999999
79,-0.5708300000000001
80,-0.6159100000000001
81,-0.64977
82,-0.68119
83,-0.70834
84,-0.7410899999999999
85,-0.76947
86,-0.80192
87,-0.85126
88,-0.9016
89,-0.9393299999999999
90,-0.9741799999999999
91,-1.0119
92,-1.0565
93,-1.0953
94,-1.1355
95,-1.1784
96,-1.2102
97,-1.248
98,-1.2913
99,-1.3363
100,-1.3726
101,-1.4065
102,-1.4482
103,-1.4957
104,-1.5223
105,-1.5231
106,-1.5198
107,-1.5147
108,-1.5092
109,-1.4994
110,-1.4872
111,-1.4734
112,-1.4575
113,-1.4419
114,-1.4251
115,-1.4094
116,-1.4027
117,-1.4021
118,-1.396
119,-1.3719999999999999
120,-1.3468
121,-1.3212
122,-1.2959
123,-1.2658
124,-1.2368
125,-1.228
126,-1.218
127,-1.193
128,-1.1565
129,-1.1179999999999999
130,-1.0802
131,-1.041
132,-1.0182
133,-1.0116
134,-0.9876
135,-0.96525
136,-0.9392
137,-0.92185
138,-0.9056299999999999
139,-0.8841399999999999
140,-0.85065
141,-0.81506
142,-0.78264
143,-0.75322
144,-0.72505
145,-0.69604
146,-0.66602
147,-0.63764
148,-0.61154
149,-0.58719
150,-0.56905
151,-0.5424899999999999
152,-0.51586
153,-0.49188000000000004
154,-0.46673000000000003
155,-0.44121000000000005
156,-0.41839
157,-0.39805999999999997
158,-0.3696
159,-0.33875
160,-0.31106
161,-0.28151
162,-0.25188
163,-0.22324000000000002
164,-0.19715
165,-0.16643
166,-0.13468
167,-0.10654000000000001
168,-0.076801
169,-0.048759
170,-0.017294
171,0.013235
172,0.044414
173,0.06868400000000001
174,0.09271499999999999
175,0.099011
176,0.1022
177,0.09942999999999999
178,0.10188
179,0.10226
180,0.096775
181,0.060398
182,0.031658
183,0.0080867
184,0.0027949999999999997
185,0.035416
186,0.072613
187,0.10977999999999999
188,0.14698
189,0.18429
190,0.22171999999999997
191,0.25928
192,0.29691999999999996
193,0.33464
194,0.37231
195,0.41011000000000003
196,0.44823
197,0.4864
198,0.52478
199,0.56281
200,0.60035
201,0.63865
202,0.67716
203,0.71558
204,0.7540399999999999
205,0.79256
206,0.83139
207,0.8702200000000001
208,0.90871
209,0.94578
210,0.98382
211,1.023
212,1.0618
213,1.1004
214,1.1389
215,1.1771
216,1.2148
217,1.2493
218,1.2852
219,1.3187
220,1.3534
221,1.3889
222,1.4195
223,1.4273
224,1.4462
225,1.4548
226,1.4623
227,1.4680000000000002
228,1.4711
229,1.4707
230,1.4707
231,1.4684
232,1.4691
233,1.4704
234,1.4771
235,1.4816
236,1.4888
237,1.4939
238,1.5
239,1.5087
240,1.515
241,1.5229
242,1.5182
243,1.4953
244,1.4779
245,1.455
246,1.4317
247,1.4087
248,1.3753
249,1.3401
250,1.3056
251,1.2716
252,1.2393
253,1.2033
254,1.1664
255,1.1298
256,1.0934
257,1.0572
258,1.0217
259,0.9865
260,0.95016
261,0.91341
262,0.8769299999999999
263,0.84065
264,0.8043899999999999
265,0.76813
266,0.73129
267,0.6939
268,0.6570199999999999
269,0.62007
270,0.5838899999999999
271,0.54796
272,0.51256
273,0.47685
274,0.44051999999999997
275,0.40315
276,0.36649
277,0.32985
278,0.29396
279,0.25737
280,0.22080999999999998
281,0.18427000000000002
282,0.14704
283,0.10983
284,0.074669
285,0.051445000000000005
286,0.015705
287,-0.018944
288,-0.052649
289,-0.087099
290,-0.12184
291,-0.15604
292,-0.19012
293,-0.22432
294,-0.25697
295,-0.29078000000000004
296,-0.32624000000000003
297,-0.36072
298,-0.3951
299,-0.43027
300,-0.46458
301,-0.49831000000000003
302,-0.5325
303,-0.56784
304,-0.60396
305,-0.63976
306,-0.67379
307,-0.70167
308,-0.73755
309,-0.7713399999999999
310,-0.8042100000000001
311,-0.8365600000000001
312,-0.87
313,-0.9033100000000001
314,-0.93778
315,-0.96939
316,-0.9987
317,-1.0304
318,-1.0649
319,-1.0959
320,-1.1247
321,-1.1537
322,-1.1849
323,-1.2153
324,-1.2441
325,-1.2691
326,-1.2952
327,-1.3245
328,-1.3552
329,-1.3853
330,-1.4105
331,-1.4238
332,-1.4467
333,-1.4723
334,-1.4983
335,-1.5211
336,-1.5355
337,-1.5492
338,-1.5637
339,-1.579
340,-1.595
341,-1.6122
342,-1.6294
343,-1.6445
344,-1.6599
345,-1.6753
346,-1.6804
347,-1.6449
348,-1.6021
349,-1.5622
350,-1.5225
351,-1.484
352,-1.4514
353,-1.4278
354,-1.4122
355,-1.3903
356,-1.3726
357,-1.3644
358,-1.3589
359,-1.3366
360,-1.3134
361,-1.2897
362,-1.2692
363,-1.2451
364,-1.2186
365,-1.1934
366,-1.1685
367,-1.1445
368,-1.1172
369,-1.0859
370,-1.0536
371,-1.0139
372,-0.99126
373,-0.9696100000000001
374,-0.9397399999999999
375,-0.91081
376,-0.88149
377,-0.8517600000000001
378,-0.81885
379,-0.78572
380,-0.7541899999999999
381,-0.72205
382,-0.6896800000000001
383,-0.65577
384,-0.62607
385,-0.59254
386,-0.55696
387,-0.52064
388,-0.49055
389,-0.47402
390,-0.43456000000000006
391,-0.39837
392,-0.36426
393,-0.32898
394,-0.29466
395,-0.26125
396,-0.22734000000000001
397,-0.19205999999999998
398,-0.15782000000000002
399,-0.12480999999999999
400,-0.09184500000000001
401,-0.058049
402,-0.022906
403,0.013174000000000002
404,0.048437
405,0.071123
406,0.10427
407,0.13984000000000002
408,0.17393
409,0.20736
410,0.2402
411,0.27202
412,0.29796
413,0.31216
414,0.33461
415,0.37009000000000003
416,0.39733
417,0.42951999999999996
418,0.46402
419,0.5032399999999999
420,0.5422899999999999
421,0.5803
422,0.61383
423,0.64995
424,0.68695
425,0.72423
426,0.7618699999999999
427,0.79935
428,0.83667
429,0.8738299999999999
430,0.9102600000000001
431,0.94645
432,0.9822200000000001
433,1.018
434,1.0539
435,1.0897
436,1.1252
437,1.1604
438,1.1956
439,1.2305
440,1.2663
441,1.3025
442,1.3376
443,1.3722
444,1.4067
445,1.442
446,1.4785
447,1.5149
448,1.5512
449,1.5837
450,1.6109
451,1.6466
452,1.6792
453,1.7002
454,1.7083
455,1.7062
456,1.7017
457,1.7009999999999998
458,1.6658
459,1.68
460,1.6943
461,1.702
462,1.7023
