time,value
0,-1.0537
1,-1.0537
2,-1.0537
3,-1.0537
4,-1.0537
5,-1.0537
6,-1.0537
7,1.2452
8,1.341
9,1.1494
10,0.9578700000000001
11,0.9578700000000001
12,0.8620899999999999
13,0.9578700000000001
14,0.8620899999999999
15,0.8620899999999999
16,0.7663
17,0.095787
18,-1.0537
19,-1.0537
20,-1.0537
21,-1.0537
22,-1.0537
23,-1.0537
24,-1.0537
25,-1.0537
26,-1.0537
27,-0.8620899999999999
28,1.4368
29,1.2452
30,1.0537
31,0.9578700000000001
32,0.9578700000000001
33,0.8620899999999999
34,0.8620899999999999
35,0.8620899999999999
36,0.7663
37,0.8620899999999999
38,0.47894
39,-1.0537
40,-1.0537
41,-1.0537
42,-1.0537
43,-1.0537
44,-1.0537
45,-1.0537
46,-1.0537
47,-1.0537
48,0.28736
49,1.2452
50,1.2452
51,0.9578700000000001
52,0.9578700000000001
53,0.9578700000000001
54,0.8620899999999999
55,0.8620899999999999
56,0.8620899999999999
57,0.8620899999999999
58,0.8620899999999999
59,0.7663
60,0.19157000000000002
61,-1.0537
62,-1.0537
63,-1.0537
64,-1.0537
65,-1.0537
66,-1.0537
67,-1.0537
68,-1.0537
69,-1.0537
70,0.28736
71,1.341
72,1.1494
73,1.0537
74,0.8620899999999999
75,0.8620899999999999
76,0.9578700000000001
77,0.8620899999999999
78,0.8620899999999999
79,0.7663
80,0.8620899999999999
81,0.7663
82,-1.0537
83,-1.0537
84,-1.0537
85,-1.0537
86,-1.0537
87,-1.0537
88,-1.0537
89,-1.0537
90,-1.0537
91,-0.38315
92,1.341
93,1.2452
94,1.0537
95,0.9578700000000001
