time,value
0,-0.28908
1,-0.28908
2,-0.28908
3,-0.28908
4,-0.28908
5,-0.28908
6,-0.28908
7,-0.28908
8,-0.28908
9,-0.28908
10,-0.28908
11,-0.28908
12,-0.28908
13,-0.28908
14,-0.28908
15,-0.28908
16,-0.28908
17,-0.28908
18,-0.28908
19,1.087
20,0.13685999999999998
21,-0.28908
22,-0.28908
23,-0.28908
24,-0.28908
25,-0.28908
26,-0.28908
27,-0.28908
28,1.8898
29,-0.28908
30,-0.28908
31,-0.28908
32,1.7259
33,-0.28908
34,-0.28908
35,-0.28908
36,-0.28908
37,-0.28908
38,1.5949
39,8.1314
40,-0.28908
41,-0.28908
42,-0.28908
43,-0.28908
44,-0.28908
45,-0.28908
46,-0.28908
47,-0.28908
48,-0.28908
49,-0.28908
50,-0.28908
51,-0.28908
52,-0.28908
53,-0.28908
54,-0.28908
55,-0.28908
56,-0.28908
57,-0.28908
58,1.2509
59,-0.28908
60,-0.28908
61,-0.28908
62,-0.28908
63,-0.28908
64,1.3983
65,-0.28908
66,-0.28908
67,-0.28908
68,-0.28908
69,1.5621
70,0.26792
71,-0.28908
72,-0.28908
73,-0.28908
74,-0.28908
75,-0.28908
76,1.3
77,-0.28908
78,0.7266199999999999
79,0.23515
80,-0.28908
81,-0.28908
82,-0.28908
83,-0.28908
84,1.857
85,0.25154
86,-0.28908
87,-0.28908
88,-0.28908
89,-0.28908
90,-0.28908
91,-0.28908
92,-0.28908
93,-0.28908
94,-0.28908
95,-0.28908
