time,value
0,1.2214
1,1.9671
2,1.4078
3,-0.64275
4,-0.64275
5,-0.64275
6,-0.64275
7,-0.64275
8,-0.64275
9,-0.64275
10,0.47575
11,1.9671
12,1.5942
13,-0.64275
14,-0.64275
15,-0.64275
16,-0.64275
17,-0.64275
18,-0.64275
19,-0.64275
20,0.28933000000000003
21,1.9671
22,1.9671
23,-0.64275
24,-0.64275
25,-0.64275
26,-0.64275
27,-0.64275
28,-0.64275
29,-0.64275
30,1.035
31,1.9671
32,1.7807
33,-0.26991
34,-0.64275
35,-0.64275
36,-0.64275
37,-0.64275
38,-0.64275
39,-0.64275
40,0.28933000000000003
41,1.9671
42,1.7807
43,-0.083499
44,-0.64275
45,-0.64275
46,-0.64275
47,-0.64275
48,-0.64275
49,-0.64275
50,-0.64275
51,1.2214
52,1.9671
53,1.035
54,-0.64275
55,-0.64275
56,-0.64275
57,-0.64275
58,-0.64275
59,-0.64275
60,-0.64275
61,0.66217
62,1.9671
63,1.2214
64,-0.64275
65,-0.64275
66,-0.64275
67,-0.64275
68,-0.64275
69,-0.64275
70,-0.64275
71,0.8485799999999999
72,1.9671
73,1.2214
74,-0.64275
75,-0.64275
76,-0.64275
77,-0.64275
78,-0.64275
79,-0.64275
80,-0.64275
81,0.47575
82,1.9671
83,1.4078
84,-0.64275
85,-0.64275
86,-0.64275
87,-0.64275
88,-0.64275
89,-0.64275
90,-0.64275
91,0.10292000000000001
92,1.9671
93,1.7807
94,-0.64275
95,-0.64275
