time,value
0,-0.22358000000000003
1,0.35653
2,0.5499
3,-1.3838
4,1.9035
5,-0.80369
6,-0.41695
7,0.35653
8,-0.9970600000000001
9,0.9366399999999999
10,-0.9970600000000001
11,0.16316
12,0.9366399999999999
13,-1.5772
14,1.13
15,-0.030213999999999998
16,-0.80369
17,0.9366399999999999
18,-1.5772
19,1.13
20,-0.22358000000000003
21,-1.1904
22,0.9366399999999999
23,-0.80369
24,0.16316
25,0.74327
26,-0.9970600000000001
27,2.2902
28,-0.41695
29,-0.030213999999999998
30,0.74327
31,0.16316
32,1.7101
33,0.5499
34,1.13
35,1.5167
36,-0.9970600000000001
37,0.9366399999999999
38,-0.41695
39,-0.22358000000000003
40,0.16316
41,-0.80369
42,1.5167
43,-0.9970600000000001
44,0.16316
45,-0.41695
46,-0.80369
47,0.16316
48,-1.3838
49,1.3234
50,-0.9970600000000001
51,-0.22358000000000003
52,-0.41695
53,-0.80369
54,0.35653
55,-0.9970600000000001
56,0.16316
57,-0.80369
58,-0.61032
59,-0.61032
60,-1.1904
61,0.9366399999999999
62,-1.7705
63,-0.22358000000000003
64,-0.9970600000000001
65,-0.80369
66,-0.61032
67,-1.9639
68,0.5499
69,-1.1904
70,0.5499
71,-0.80369
72,-0.030213999999999998
73,-0.030213999999999998
74,0.35653
75,2.0969
76,-0.80369
77,0.74327
78,-0.030213999999999998
79,0.35653
80,0.5499
81,-0.41695
82,1.3234
83,-0.80369
84,3.4504
85,0.9366399999999999
86,0.9366399999999999
87,0.5499
88,0.16316
89,1.13
90,-1.1904
91,1.13
92,-1.1904
93,0.16316
94,-0.80369
95,-0.22358000000000003
