time,value
0,-0.24852
1,-0.24852
2,-0.24852
3,-0.24852
4,-0.24852
5,-0.24852
6,-0.24852
7,-0.24852
8,-0.24852
9,-0.24852
10,-0.24852
11,-0.24852
12,-0.24852
13,-0.24852
14,-0.24852
15,-0.24852
16,-0.24852
17,-0.24852
18,-0.24852
19,-0.24852
20,-0.24852
21,-0.24852
22,-0.24852
23,-0.24852
24,-0.24852
25,-0.24852
26,-0.24852
27,-0.24852
28,-0.24852
29,-0.24852
30,-0.24852
31,-0.24852
32,-0.24852
33,-0.24852
34,-0.24852
35,-0.24852
36,-0.24852
37,-0.24852
38,-0.24852
39,-0.24852
40,-0.24852
41,-0.24852
42,-0.24852
43,-0.24852
44,-0.24852
45,-0.24852
46,-0.24852
47,-0.24852
48,-0.24852
49,-0.24852
50,5.0311
51,0.3921
52,0.48046000000000005
53,-0.24852
54,-0.24852
55,-0.24852
56,-0.24852
57,-0.24852
58,-0.24852
59,-0.24852
60,-0.24852
61,-0.24852
62,-0.24852
63,-0.24852
64,-0.24852
65,-0.24852
66,-0.24852
67,-0.24852
68,-0.24852
69,-0.24852
70,-0.24852
71,-0.24852
72,-0.24852
73,-0.24852
74,-0.24852
75,-0.24852
76,-0.24852
77,-0.24852
78,-0.24852
79,-0.24852
80,-0.24852
81,-0.09388400000000001
82,4.5893
83,0.48046000000000005
84,-0.24852
85,-0.24852
86,-0.24852
87,-0.24852
88,4.8764
89,0.59091
90,4.3021
91,0.19329000000000002
92,0.28165
93,-0.24852
94,-0.24852
95,-0.24852
