time,value
0,-0.29047
1,-0.29047
2,-0.29047
3,-0.29047
4,-0.29047
5,-0.29047
6,-0.29047
7,-0.29047
8,-0.29047
9,-0.29047
10,-0.29047
11,-0.29047
12,-0.29047
13,-0.29047
14,-0.29047
15,-0.29047
16,-0.29047
17,-0.29047
18,-0.29047
19,-0.29047
20,-0.29047
21,-0.29047
22,-0.29047
23,-0.29047
24,-0.29047
25,-0.29047
26,-0.29047
27,-0.29047
28,-0.29047
29,-0.29047
30,-0.29047
31,-0.29047
32,-0.29047
33,-0.29047
34,-0.29047
35,-0.29047
36,-0.29047
37,-0.29047
38,-0.29047
39,-0.29047
40,-0.29047
41,-0.29047
42,-0.29047
43,-0.29047
44,-0.29047
45,-0.29047
46,3.8804
47,1.4971
48,3.5229
49,3.7613
50,3.7613
51,3.5229
52,3.6421
53,1.9737
54,-0.29047
55,-0.29047
56,-0.29047
57,-0.29047
58,-0.29047
59,-0.29047
60,-0.29047
61,-0.29047
62,-0.29047
63,-0.29047
64,-0.29047
65,-0.29047
66,-0.29047
67,-0.29047
68,-0.29047
69,-0.29047
70,-0.29047
71,-0.29047
72,-0.29047
73,-0.29047
74,-0.29047
75,-0.29047
76,-0.29047
77,-0.29047
78,-0.29047
79,-0.29047
80,-0.29047
81,-0.29047
82,-0.29047
83,-0.29047
84,-0.29047
85,-0.29047
86,-0.29047
87,-0.29047
88,-0.29047
89,-0.29047
90,-0.29047
91,-0.29047
92,-0.29047
93,-0.29047
94,-0.29047
95,-0.29047
