time,value
0,-0.27810999999999997
1,-0.27810999999999997
2,-0.27810999999999997
3,-0.27810999999999997
4,-0.27810999999999997
5,-0.27810999999999997
6,-0.27810999999999997
7,-0.27810999999999997
8,-0.27810999999999997
9,-0.27810999999999997
10,-0.27810999999999997
11,-0.27810999999999997
12,-0.27810999999999997
13,-0.27810999999999997
14,-0.27810999999999997
15,-0.27810999999999997
16,-0.27810999999999997
17,0.085136
18,-0.27810999999999997
19,-0.27810999999999997
20,-0.27810999999999997
21,-0.27810999999999997
22,-0.27810999999999997
23,-0.27810999999999997
24,-0.27810999999999997
25,-0.27810999999999997
26,-0.27810999999999997
27,-0.27810999999999997
28,-0.27810999999999997
29,-0.27810999999999997
30,-0.27810999999999997
31,-0.27810999999999997
32,-0.27810999999999997
33,-0.27810999999999997
34,-0.27810999999999997
35,-0.27810999999999997
36,-0.27810999999999997
37,-0.27810999999999997
38,-0.27810999999999997
39,-0.27810999999999997
40,-0.27810999999999997
41,-0.27810999999999997
42,-0.27810999999999997
43,-0.27810999999999997
44,-0.27810999999999997
45,-0.27810999999999997
46,-0.27810999999999997
47,-0.27810999999999997
48,-0.27810999999999997
49,-0.27810999999999997
50,-0.27810999999999997
51,-0.27810999999999997
52,-0.27810999999999997
53,-0.27810999999999997
54,-0.27810999999999997
55,-0.27810999999999997
56,-0.27810999999999997
57,-0.27810999999999997
58,-0.27810999999999997
59,-0.27810999999999997
60,-0.27810999999999997
61,-0.27810999999999997
62,-0.27810999999999997
63,-0.27810999999999997
64,-0.27810999999999997
65,-0.27810999999999997
66,-0.27810999999999997
67,-0.27810999999999997
68,-0.27810999999999997
69,-0.27810999999999997
70,-0.27810999999999997
71,-0.27810999999999997
72,-0.27810999999999997
73,-0.27810999999999997
74,-0.27810999999999997
75,-0.27810999999999997
76,-0.27810999999999997
77,-0.27810999999999997
78,-0.27810999999999997
79,-0.27810999999999997
80,-0.27810999999999997
81,-0.27810999999999997
82,3.3544
83,4.0809
84,3.8992
85,3.7176
86,3.7176
87,3.7176
88,1.9014
89,-0.27810999999999997
90,-0.27810999999999997
91,-0.27810999999999997
92,-0.27810999999999997
93,-0.27810999999999997
94,-0.27810999999999997
95,-0.27810999999999997
