time,value
0,-0.8113100000000001
1,1.3384
2,-0.14986
3,-0.8113100000000001
4,1.0077
5,0.015503
6,-0.8113100000000001
7,0.51159
8,0.51159
9,-0.8113100000000001
10,-0.14986
11,1.3384
12,-0.8113100000000001
13,-0.8113100000000001
14,1.9999
15,-0.8113100000000001
16,-0.8113100000000001
17,1.0077
18,0.18087
19,-0.8113100000000001
20,-0.48058
21,1.6691
22,-0.8113100000000001
23,-0.8113100000000001
24,1.5038
25,-0.31522
26,-0.8113100000000001
27,-0.14986
28,1.173
29,-0.8113100000000001
30,-0.8113100000000001
31,1.9999
32,-0.8113100000000001
33,-0.8113100000000001
34,0.34623000000000004
35,0.8423200000000001
36,-0.8113100000000001
37,-0.8113100000000001
38,1.9999
39,-0.8113100000000001
40,-0.8113100000000001
41,0.34623000000000004
42,0.8423200000000001
43,-0.8113100000000001
44,-0.8113100000000001
45,1.9999
46,-0.8113100000000001
47,-0.8113100000000001
48,0.015503
49,1.3384
50,-0.8113100000000001
51,-0.8113100000000001
52,1.173
53,0.015503
54,-0.8113100000000001
55,-0.8113100000000001
56,2.1652
57,-0.8113100000000001
58,-0.8113100000000001
59,0.015503
60,1.173
61,-0.8113100000000001
62,-0.8113100000000001
63,1.173
64,0.015503
65,-0.8113100000000001
66,-0.8113100000000001
67,1.9999
68,-0.8113100000000001
69,-0.8113100000000001
70,-0.14986
71,1.3384
72,-0.8113100000000001
73,-0.8113100000000001
74,1.3384
75,-0.14986
76,-0.8113100000000001
77,-0.8113100000000001
78,1.8345
79,-0.8113100000000001
80,-0.8113100000000001
81,1.3384
82,-0.14986
83,-0.8113100000000001
84,-0.14986
85,1.3384
86,-0.8113100000000001
87,-0.8113100000000001
88,1.8345
89,-0.8113100000000001
90,-0.8113100000000001
91,1.6691
92,-0.8113100000000001
93,-0.8113100000000001
94,0.51159
95,0.67695
