time,value
0,-0.15471
1,-0.15471
2,-0.15471
3,-0.15471
4,-0.15471
5,-0.15471
6,-0.15471
7,-0.15471
8,-0.15471
9,-0.15471
10,-0.15471
11,-0.15471
12,-0.15471
13,-0.15471
14,-0.15471
15,-0.15471
16,-0.15471
17,-0.15471
18,-0.15471
19,-0.15471
20,-0.15471
21,-0.15471
22,-0.15471
23,-0.15471
24,-0.15471
25,-0.15471
26,-0.15471
27,-0.15471
28,-0.15471
29,-0.15471
30,-0.15471
31,-0.15471
32,-0.15471
33,-0.15471
34,-0.15471
35,-0.15471
36,-0.15471
37,0.081455
38,5.5526
39,0.081455
40,0.068335
41,0.068335
42,0.042094
43,7.8749
44,-0.15471
45,-0.15471
46,-0.15471
47,-0.15471
48,-0.15471
49,-0.15471
50,-0.15471
51,-0.15471
52,-0.15471
53,-0.15471
54,-0.15471
55,-0.15471
56,-0.15471
57,-0.15471
58,-0.15471
59,-0.15471
60,-0.15471
61,-0.15471
62,-0.15471
63,-0.15471
64,-0.15471
65,-0.15471
66,-0.15471
67,-0.15471
68,-0.15471
69,-0.15471
70,-0.15471
71,-0.15471
72,-0.15471
73,-0.15471
74,-0.15471
75,-0.15471
76,-0.15471
77,-0.15471
78,-0.15471
79,-0.15471
80,-0.15471
81,-0.15471
82,-0.15471
83,-0.15471
84,-0.15471
85,-0.15471
86,-0.15471
87,-0.15471
88,-0.15471
89,-0.15471
90,-0.15471
91,-0.15471
92,-0.15471
93,-0.15471
94,-0.15471
95,-0.15471
