time,value
0,-1.2012
1,-1.1865
2,-1.1667
3,-1.1412
4,-1.1096
5,-1.0715
6,-1.0291
7,-0.9798100000000001
8,-0.9220299999999999
9,-0.8537
10,-0.773
11,-0.6809999999999999
12,-0.5755
13,-0.4561
14,-0.32323
15,-0.17828
16,-0.025569
17,0.13348
18,0.29634
19,0.46065
20,0.62424
21,0.7834899999999999
22,0.93794
23,1.0868
24,1.2296
25,1.3659
26,1.4941
27,1.6146
28,1.7274
29,1.8324
30,1.9296
31,2.0181
32,2.0982
33,2.1699
34,2.2329
35,2.2867
36,2.3294
37,2.3605
38,2.3791
39,2.3847
40,2.3774
41,2.3571
42,2.3255
43,2.2844
44,2.2359999999999998
45,2.1822
46,2.1242
47,2.0635
48,2.0009
49,1.9369
50,1.8722
51,1.8068
52,1.7417
53,1.6776
54,1.6154
55,1.5553
56,1.4971
57,1.4404
58,1.3841
59,1.3268
60,1.2672
61,1.2035
62,1.1358
63,1.0639
64,0.9884200000000001
65,0.9101100000000001
66,0.82942
67,0.74859
68,0.66845
69,0.58944
70,0.51172
71,0.4342
72,0.35868
73,0.28486999999999996
74,0.21236
75,0.14089000000000002
76,0.06903300000000001
77,-0.00031248
78,-0.06697
79,-0.13092
80,-0.19205999999999998
81,-0.25185
82,-0.30677
83,-0.35686999999999997
84,-0.40262
85,-0.44464
86,-0.4854
87,-0.52184
88,-0.5548
89,-0.58537
90,-0.61456
91,-0.6449600000000001
92,-0.6732
93,-0.69962
94,-0.72472
95,-0.74889
96,-0.77415
97,-0.79682
98,-0.81692
99,-0.8348399999999999
100,-0.8510700000000001
101,-0.868
102,-0.8825299999999999
103,-0.89502
104,-0.9061299999999999
105,-0.91651
106,-0.9287799999999999
107,-0.93985
108,-0.9498700000000001
109,-0.9591799999999999
110,-0.9681799999999999
111,-0.9796799999999999
112,-0.99056
113,-1.0008
114,-1.0105
115,-1.0198
116,-1.0314
117,-1.042
118,-1.0511
119,-1.0586
120,-1.0646
121,-1.0721
122,-1.0784
123,-1.0836
124,-1.0877
125,-1.091
126,-1.0965
127,-1.1014
128,-1.1054
129,-1.1082
130,-1.1094
131,-1.1115
132,-1.1123
133,-1.1116
134,-1.1094
135,-1.1059
136,-1.1036
137,-1.1006
138,-1.0963
139,-1.09
140,-1.0807
141,-1.0693
142,-1.0534
143,-1.0318
144,-1.0042
145,-0.97047
146,-0.9329700000000001
147,-0.8910399999999999
148,-0.8451700000000001
149,-0.79556
150,-0.742
151,-0.6854100000000001
152,-0.6236
153,-0.55532
154,-0.47963999999999996
155,-0.39642
156,-0.30789
157,-0.21472
158,-0.11909000000000002
159,-0.023495
160,0.06970499999999999
161,0.1573
162,0.23931
163,0.31581
164,0.38754
165,0.45547
166,0.5189699999999999
167,0.57945
168,0.63693
169,0.69087
170,0.74019
171,0.78218
172,0.81662
173,0.8429200000000001
174,0.86098
175,0.87108
176,0.87241
177,0.86667
178,0.8548899999999999
179,0.8381
180,0.81712
181,0.79135
182,0.7621
183,0.73
184,0.6956899999999999
185,0.65983
186,0.6220100000000001
187,0.58355
188,0.5452100000000001
189,0.50771
190,0.47153999999999996
191,0.43615
192,0.40221
193,0.36972
194,0.33855999999999997
195,0.30851
196,0.27858
197,0.2492
198,0.22036
199,0.19221
200,0.165
201,0.13842000000000002
202,0.11367000000000001
203,0.091283
204,0.071839
205,0.055928
206,0.043467
207,0.035901999999999996
208,0.033477999999999994
209,0.036091000000000005
210,0.043299000000000004
211,0.053609000000000004
212,0.067351
213,0.083226
214,0.099768
215,0.11563
216,0.12891
217,0.1405
218,0.1497
219,0.15579
220,0.15811
221,0.15511
222,0.1483
223,0.1371
224,0.12095999999999998
225,0.09955599999999999
226,0.072004
227,0.040981000000000004
228,0.0072142
229,-0.028606
230,-0.06577000000000001
231,-0.1046
232,-0.14253
233,-0.17943
234,-0.21566999999999997
235,-0.25176
236,-0.28913
237,-0.3262
238,-0.36323
239,-0.40041
240,-0.43775
241,-0.47586999999999996
242,-0.51275
243,-0.5483
244,-0.5828300000000001
245,-0.6168600000000001
246,-0.65179
247,-0.6866899999999999
248,-0.72214
249,-0.75856
250,-0.79596
251,-0.8345899999999999
252,-0.8722799999999999
253,-0.90828
254,-0.9421799999999999
255,-0.9739200000000001
256,-1.0045
257,-1.0331
258,-1.0607
259,-1.0879
260,-1.1151
261,-1.1425
262,-1.1678
263,-1.1898
264,-1.2073
265,-1.2196
266,-1.2272
267,-1.2295
268,-1.2277
269,-1.2238
