time,value
0,-0.49006000000000005
1,-0.49006000000000005
2,-0.49006000000000005
3,-0.49006000000000005
4,-0.49006000000000005
5,-0.49006000000000005
6,-0.49006000000000005
7,-0.49006000000000005
8,-0.49006000000000005
9,-0.49006000000000005
10,-0.49006000000000005
11,-0.49006000000000005
12,0.059112
13,-0.49006000000000005
14,-0.49006000000000005
15,-0.49006000000000005
16,-0.49006000000000005
17,-0.49006000000000005
18,-0.49006000000000005
19,-0.49006000000000005
20,0.059112
21,-0.49006000000000005
22,-0.49006000000000005
23,-0.49006000000000005
24,-0.49006000000000005
25,-0.49006000000000005
26,-0.49006000000000005
27,-0.49006000000000005
28,-0.49006000000000005
29,-0.49006000000000005
30,-0.49006000000000005
31,-0.49006000000000005
32,-0.49006000000000005
33,-0.49006000000000005
34,-0.49006000000000005
35,-0.49006000000000005
36,-0.49006000000000005
37,-0.49006000000000005
38,-0.49006000000000005
39,-0.12394000000000001
40,-0.12394000000000001
41,-0.49006000000000005
42,-0.49006000000000005
43,-0.49006000000000005
44,-0.49006000000000005
45,-0.49006000000000005
46,-0.49006000000000005
47,-0.49006000000000005
48,-0.49006000000000005
49,-0.49006000000000005
50,-0.49006000000000005
51,-0.49006000000000005
52,-0.49006000000000005
53,-0.49006000000000005
54,-0.49006000000000005
55,-0.12394000000000001
56,-0.12394000000000001
57,-0.49006000000000005
58,-0.49006000000000005
59,-0.49006000000000005
60,-0.49006000000000005
61,-0.49006000000000005
62,-0.49006000000000005
63,-0.49006000000000005
64,-0.49006000000000005
65,-0.49006000000000005
66,-0.49006000000000005
67,-0.49006000000000005
68,-0.49006000000000005
69,-0.49006000000000005
70,-0.49006000000000005
71,-0.49006000000000005
72,-0.49006000000000005
73,-0.49006000000000005
74,-0.49006000000000005
75,2.2558
76,0.7913399999999999
77,0.7913399999999999
78,0.60828
79,0.7913399999999999
80,0.60828
81,0.7913399999999999
82,0.60828
83,0.7913399999999999
84,0.60828
85,0.7913399999999999
86,0.60828
87,3.3541
88,2.805
89,2.805
90,2.805
91,2.805
92,2.805
93,2.805
94,2.805
95,1.1575
