time,value
0,-1.1336
1,-1.2208
2,-1.1336
3,-1.1336
4,-1.1336
5,-1.2208
6,-1.1336
7,-1.1336
8,-1.1336
9,-1.1336
10,-1.2208
11,-1.1336
12,-1.1336
13,-1.1336
14,-1.2208
15,-1.1336
16,-1.1336
17,-1.1336
18,-1.2208
19,-1.1336
20,-1.1336
21,-1.1336
22,-1.2208
23,-1.1336
24,-1.1336
25,-1.1336
26,-1.2208
27,-1.1336
28,-1.1336
29,-1.1336
30,-1.2208
31,-1.1336
32,-1.1336
33,-1.1336
34,-1.2208
35,-1.1336
36,0.52189
37,2.1774
38,0.69615
39,0.95755
40,0.60902
41,0.43476000000000004
42,0.34762
43,0.43476000000000004
44,0.34762
45,0.34762
46,0.43476000000000004
47,0.34762
48,0.43476000000000004
49,0.34762
50,0.8704200000000001
51,0.7832899999999999
52,1.0447
53,0.8704200000000001
54,0.52189
55,2.0031
56,1.7417
57,1.7417
58,0.95755
59,0.95755
60,0.95755
61,0.95755
62,1.8289
63,2.7002
64,2.0903
65,1.1318
66,0.95755
67,0.60902
68,0.34762
69,0.34762
70,0.43476000000000004
71,0.34762
72,0.34762
73,0.43476000000000004
74,0.34762
75,0.34762
76,0.34762
77,0.43476000000000004
78,0.34762
79,0.34762
80,0.43476000000000004
81,0.34762
82,0.34762
83,0.34762
84,0.43476000000000004
85,0.34762
86,0.34762
87,0.34762
88,0.43476000000000004
89,0.34762
90,0.34762
91,0.34762
92,0.43476000000000004
93,0.34762
94,0.34762
95,0.43476000000000004
