[<text>
<title>toys "r" us inc &lt;toy&gt; 4th qtr feb one net</title>
<dateline>    rochelle park, n.j., march 18 -
    </dateline>shr 89 cts vs 68 cts
    net 116.0 mln vs 88.1 mln
    revs 1.17 billion vs 924.0 mln
    12 mths
    shr 1.17 dlrs vs 93 cts
    net 152.2 mln vs 119.8 mln
    revs 2.44 billion vs 1.97 billion
    note: net 1986 were restated to reflect three-for-two stock
split on june 27, 1986.
 reuter
</text>]