time,value
0,-0.61927
1,-0.61927
2,-0.61927
3,1.2321
4,1.4378
5,-0.61927
6,-0.61927
7,-0.61927
8,-0.61927
9,0.8207
10,2.055
11,-0.61927
12,-0.61927
13,-0.61927
14,-0.61927
15,-0.61927
16,2.2607
17,0.20357
18,-0.61927
19,-0.61927
20,-0.61927
21,-0.61927
22,1.4378
23,1.0264
24,-0.61927
25,-0.61927
26,-0.61927
27,-0.61927
28,0.40928000000000003
29,2.2607
30,-0.61927
31,-0.61927
32,-0.61927
33,-0.61927
34,-0.61927
35,2.2607
36,0.6149899999999999
37,-0.61927
38,-0.61927
39,-0.61927
40,-0.61927
41,1.0264
42,1.6435
43,-0.61927
44,-0.61927
45,-0.61927
46,-0.61927
47,-0.0021428000000000003
48,2.2607
49,0.20357
50,-0.61927
51,-0.61927
52,-0.61927
53,-0.61927
54,1.6435
55,1.0264
56,-0.61927
57,-0.61927
58,-0.61927
59,-0.61927
60,0.40928000000000003
61,2.2607
62,-0.61927
63,-0.61927
64,-0.61927
65,-0.61927
66,-0.61927
67,2.2607
68,0.40928000000000003
69,-0.61927
70,-0.61927
71,-0.61927
72,-0.61927
73,1.6435
74,1.0264
75,-0.61927
76,-0.61927
77,-0.61927
78,-0.61927
79,0.6149899999999999
80,2.2607
81,-0.61927
82,-0.61927
83,-0.61927
84,0.20357
85,2.2607
86,-0.20785
87,-0.61927
88,-0.61927
89,-0.61927
90,0.40928000000000003
91,2.2607
92,-0.61927
93,-0.61927
94,-0.61927
95,-0.61927
