time,value
0,-1.0671
1,-1.0671
2,-1.0671
3,-1.0671
4,-1.0671
5,-1.0671
6,-1.0671
7,-1.0671
8,-1.0671
9,-1.0671
10,-1.0671
11,-1.0671
12,-1.0671
13,-1.0671
14,-1.0671
15,-1.0671
16,-1.0671
17,-1.0671
18,-1.0671
19,-1.0671
20,-1.0671
21,-1.0671
22,-1.0671
23,-1.0671
24,-1.0671
25,-1.0671
26,-1.0671
27,-1.0671
28,-1.0671
29,-1.0671
30,-1.0671
31,0.61082
32,1.7589
33,0.87575
34,1.1407
35,0.87575
36,0.7874399999999999
37,1.0524
38,0.69913
39,0.52251
40,1.3173
41,2.2887
42,0.87575
43,2.2887
44,1.229
45,-0.71385
46,-1.0671
47,-1.0671
48,-1.0671
49,-1.0671
50,-0.0073592
51,1.3173
52,0.7874399999999999
53,0.96406
54,0.61082
55,0.52251
56,0.7874399999999999
57,0.7874399999999999
58,0.4342
59,0.69913
60,0.87575
61,0.61082
62,0.4342
63,0.87575
64,0.69913
65,0.52251
66,0.69913
67,1.0524
68,1.1407
69,0.87575
70,0.69913
71,0.96406
72,0.87575
73,0.61082
74,0.7874399999999999
75,0.96406
76,0.61082
77,0.61082
78,0.87575
79,0.69913
80,0.52251
81,0.7874399999999999
82,0.7874399999999999
83,0.52251
84,0.69913
85,0.96406
86,0.61082
87,0.61082
88,1.1407
89,-0.8904700000000001
90,-1.0671
91,-1.0671
92,-1.0671
93,-1.0671
94,-1.0671
95,-1.0671
