time,value
0,-0.39045
1,-0.39045
2,-0.39045
3,-0.39045
4,-0.39045
5,-0.39045
6,-0.39045
7,-0.39045
8,-0.39045
9,-0.39045
10,-0.39045
11,-0.39045
12,0.030708999999999997
13,-0.39045
14,-0.39045
15,-0.39045
16,-0.39045
17,-0.39045
18,-0.39045
19,-0.10968
20,0.030708999999999997
21,-0.39045
22,-0.39045
23,-0.39045
24,-0.39045
25,-0.39045
26,-0.39045
27,-0.39045
28,-0.39045
29,-0.39045
30,-0.39045
31,-0.39045
32,-0.39045
33,-0.39045
34,-0.39045
35,-0.39045
36,-0.39045
37,-0.39045
38,-0.39045
39,-0.10968
40,0.030708999999999997
41,-0.39045
42,-0.39045
43,-0.39045
44,-0.39045
45,-0.39045
46,-0.39045
47,-0.39045
48,-0.39045
49,-0.39045
50,-0.39045
51,-0.39045
52,-0.39045
53,-0.39045
54,-0.39045
55,-0.39045
56,0.030708999999999997
57,-0.39045
58,-0.39045
59,-0.39045
60,-0.39045
61,-0.39045
62,-0.39045
63,-0.39045
64,-0.39045
65,-0.39045
66,-0.39045
67,-0.39045
68,-0.39045
69,-0.39045
70,-0.39045
71,-0.39045
72,-0.39045
73,-0.39045
74,-0.39045
75,-0.39045
76,-0.39045
77,-0.39045
78,-0.39045
79,-0.39045
80,-0.39045
81,-0.39045
82,1.0134
83,2.9788
84,2.8384
85,2.9788
86,2.8384
87,2.9788
88,2.8384
89,2.9788
90,2.9788
91,2.698
92,2.1365
93,1.2942
94,-0.39045
95,-0.39045
