time,value
0,-0.6150800000000001
1,-0.6150800000000001
2,-0.6150800000000001
3,1.3316
4,1.3316
5,-0.6150800000000001
6,-0.6150800000000001
7,-0.6150800000000001
8,-0.6150800000000001
9,0.033796
10,2.4130000000000003
11,-0.6150800000000001
12,-0.6150800000000001
13,-0.6150800000000001
14,-0.6150800000000001
15,-0.6150800000000001
16,1.7641
17,0.89897
18,-0.6150800000000001
19,-0.6150800000000001
20,-0.6150800000000001
21,-0.6150800000000001
22,0.46638
23,2.1967
24,-0.6150800000000001
25,-0.6150800000000001
26,-0.6150800000000001
27,-0.6150800000000001
28,-0.6150800000000001
29,1.9804
30,0.6826800000000001
31,-0.6150800000000001
32,-0.6150800000000001
33,-0.6150800000000001
34,-0.6150800000000001
35,0.46638
36,2.1967
37,-0.6150800000000001
38,-0.6150800000000001
39,-0.6150800000000001
40,-0.6150800000000001
41,-0.6150800000000001
42,1.7641
43,1.1153
44,-0.6150800000000001
45,-0.6150800000000001
46,-0.6150800000000001
47,-0.6150800000000001
48,0.25009000000000003
49,2.1967
50,-0.6150800000000001
51,-0.6150800000000001
52,-0.6150800000000001
53,-0.6150800000000001
54,0.6826800000000001
55,1.9804
56,-0.6150800000000001
57,-0.6150800000000001
58,-0.6150800000000001
59,-0.6150800000000001
60,-0.1825
61,2.4130000000000003
62,-0.1825
63,-0.6150800000000001
64,-0.6150800000000001
65,-0.6150800000000001
66,-0.6150800000000001
67,1.9804
68,0.89897
69,-0.6150800000000001
70,-0.6150800000000001
71,-0.6150800000000001
72,-0.6150800000000001
73,0.89897
74,1.7641
75,-0.6150800000000001
76,-0.6150800000000001
77,-0.6150800000000001
78,-0.6150800000000001
79,0.25009000000000003
80,2.4130000000000003
81,0.033796
82,-0.6150800000000001
83,-0.6150800000000001
84,-0.6150800000000001
85,-0.6150800000000001
86,2.1967
87,0.46638
88,-0.6150800000000001
89,-0.6150800000000001
90,-0.6150800000000001
91,-0.6150800000000001
92,1.7641
93,0.89897
94,-0.6150800000000001
95,-0.6150800000000001
