time,value
0,-0.30916
1,-0.30916
2,-0.30916
3,-0.30916
4,-0.30916
5,-0.30916
6,-0.30916
7,-0.30916
8,-0.30916
9,-0.30916
10,-0.30916
11,-0.30916
12,-0.30916
13,-0.30916
14,-0.30916
15,-0.30916
16,-0.30916
17,-0.30916
18,-0.30916
19,-0.30916
20,-0.30916
21,-0.30916
22,-0.30916
23,-0.30916
24,-0.30916
25,-0.30916
26,-0.30916
27,-0.30916
28,-0.30916
29,-0.30916
30,-0.30916
31,-0.30916
32,-0.30916
33,-0.30916
34,-0.30916
35,-0.30916
36,-0.30916
37,-0.30916
38,-0.30916
39,-0.30916
40,-0.30916
41,-0.30916
42,-0.30916
43,-0.30916
44,-0.30916
45,-0.30916
46,-0.30916
47,-0.30916
48,-0.30916
49,-0.30916
50,-0.30916
51,-0.30916
52,-0.30916
53,-0.30916
54,-0.30916
55,-0.30916
56,-0.30916
57,-0.30916
58,-0.30916
59,-0.30916
60,-0.30916
61,-0.30916
62,-0.30916
63,-0.30916
64,-0.30916
65,-0.30916
66,-0.30916
67,-0.30916
68,-0.30916
69,-0.30916
70,0.64482
71,3.1888
72,3.4008
73,3.4008
74,3.1888
75,3.1888
76,3.4008
77,3.4008
78,3.0828
79,-0.30916
80,-0.30916
81,-0.30916
82,-0.30916
83,-0.30916
84,-0.30916
85,-0.30916
86,-0.30916
87,-0.30916
88,-0.30916
89,-0.30916
90,-0.30916
91,-0.30916
92,-0.30916
93,-0.30916
94,-0.30916
95,-0.30916
