time,value
0,1.6953
1,1.6317
2,1.5297
3,1.4389
4,1.3641
5,1.3074
6,1.2497
7,1.1535
8,1.0672
9,0.99941
10,0.92645
11,0.85396
12,0.76717
13,0.72422
14,0.80194
15,0.7686
16,0.67972
17,0.58678
18,0.4635
19,0.37398000000000003
20,0.31823
21,0.41298
22,0.46331000000000006
23,0.37517
24,0.24861
25,0.12596
26,0.012473
27,-0.023413999999999997
28,0.036341000000000005
29,0.092056
30,0.20195
31,0.24725999999999998
32,0.18357
33,0.0829
34,0.020309
35,-0.060926999999999995
36,-0.11314
37,-0.20751
38,-0.29813
39,-0.38373
40,-0.39511999999999997
41,-0.31182
42,-0.24003000000000002
43,-0.23749
44,-0.31033
45,-0.39933
46,-0.45806
47,-0.52645
48,-0.59619
49,-0.6623600000000001
50,-0.69768
51,-0.75145
52,-0.82237
53,-0.81448
54,-0.71428
55,-0.56933
56,-0.49618
57,-0.34471
58,-0.23535999999999999
59,-0.2117
60,-0.24863000000000002
61,-0.26097
62,-0.30616
63,-0.31243000000000004
64,-0.3334
65,-0.31943
66,-0.366
67,-0.44761000000000006
68,-0.49149
69,-0.58035
70,-0.5696
71,-0.6471
72,-0.63517
73,-0.65638
74,-0.70841
75,-0.7298100000000001
76,-0.82258
77,-0.90928
78,-0.94365
79,-0.9659399999999999
80,-1.0381
81,-1.1127
82,-1.2035
83,-1.2506
84,-1.3327
85,-1.389
86,-1.4344
87,-1.4936
88,-1.5219
89,-1.5805
90,-1.5638
91,-1.5827
92,-1.6083
93,-1.6233
94,-1.6253
95,-1.6702
96,-1.6099
97,-1.5098
98,-1.3847
99,-1.2873
100,-1.2013
101,-1.1162
102,-1.0005
103,-0.9050600000000001
104,-0.81521
105,-0.72492
106,-0.61559
107,-0.51499
108,-0.40149
109,-0.29148
110,-0.18051
111,-0.06781000000000001
112,0.035075
113,0.14440999999999998
114,0.26036
115,0.36711
116,0.47013999999999995
117,0.57924
118,0.70092
119,0.80483
120,0.9099799999999999
121,1.0249
122,1.1359
123,1.244
124,1.3488
125,1.4614
126,1.5749
127,1.6782
128,1.7921
129,1.9026
130,2.0052
131,2.1172
132,2.1759
133,2.2916
134,2.3961
135,2.4987
136,2.6225
137,2.7339
138,2.6959
139,2.5818
140,2.4784
141,2.375
142,2.2614
143,2.1579
144,2.0407
145,1.935
146,1.8272
147,1.7159
148,1.6056
149,1.5064
150,1.3929
151,1.272
152,1.1702
153,1.0628
154,0.9493
155,0.8462700000000001
156,0.7364
157,0.62151
158,0.51623
159,0.41473999999999994
160,0.30251
161,0.19162
162,0.082131
163,-0.025353999999999998
164,-0.13495
165,-0.24020999999999998
166,-0.34907
167,-0.46251000000000003
168,-0.5687300000000001
169,-0.67606
170,-0.79075
171,-0.8938299999999999
172,-1.0048
173,-1.1119
174,-1.2229
175,-1.3252
176,-1.4291
177,-1.55
178,-1.662
179,-1.7599
180,-1.7877
181,-1.8047
182,-1.7217
183,-1.6997
184,-1.6696
185,-1.6346
186,-1.5922
187,-1.5648
188,-1.5523
189,-1.5402
190,-1.5771
191,-1.5607
192,-1.5362
193,-1.4988
194,-1.4404
195,-1.3789
196,-1.3169
197,-1.229
198,-1.148
199,-1.0486
200,-0.9814
201,-0.91574
202,-0.84136
203,-0.81077
204,-0.8564299999999999
205,-0.84714
206,-0.7653300000000001
207,-0.68262
208,-0.59782
209,-0.5040100000000001
210,-0.44941000000000003
211,-0.36816
212,-0.34246
213,-0.43433999999999995
214,-0.3547
215,-0.27
216,-0.19115
217,-0.15616
218,-0.096015
219,-0.14075
220,-0.081704
221,-0.072466
222,-0.016701
223,0.031687
224,0.020909
225,-0.10059
226,-0.21094000000000002
227,-0.33915
228,-0.46056
229,-0.57987
230,-0.68405
231,-0.6764899999999999
232,-0.5898800000000001
233,-0.5223800000000001
234,-0.42228000000000004
235,-0.31508
236,-0.23159000000000002
237,-0.18918
238,-0.07952100000000001
239,-0.008065300000000001
240,0.0039131999999999995
241,-0.09452200000000001
242,-0.022553
243,0.084741
244,0.13957999999999998
245,0.22630999999999998
246,0.31366
247,0.31745999999999996
248,0.38372
249,0.46742
250,0.5481
251,0.6330899999999999
252,0.6238199999999999
253,0.5160100000000001
254,0.42783000000000004
255,0.33994
256,0.37678
257,0.41631999999999997
258,0.47378000000000003
259,0.5657300000000001
260,0.67084
261,0.7164699999999999
262,0.6818
263,0.78415
264,0.892
265,0.98655
266,1.0616
267,1.1288
268,1.0598
269,1.0589
270,1.156
271,1.2385
272,1.3035
273,1.3831
274,1.4387
275,1.4886
276,1.5575
277,1.6108
278,1.6524
279,1.6907
280,1.6659
281,1.5724
282,1.4556
283,1.3565
284,1.2566
285,1.1442
286,1.054
287,0.94511
288,0.82068
289,0.67374
290,0.5453100000000001
291,0.39046
292,0.23571999999999999
293,0.08231000000000001
294,0.024486
295,0.077955
296,0.016041
297,-0.08530599999999999
298,-0.24042
299,-0.31654
300,-0.4101
301,-0.52376
302,-0.64581
303,-0.75712
304,-0.8694299999999999
305,-0.9361
306,-1.0098
307,-1.1562
308,-1.2007
309,-1.1323
310,-1.0474
311,-1.0074
312,-0.99592
313,-0.9123
314,-0.82847
315,-0.7507
316,-0.6523100000000001
317,-0.56728
318,-0.49836
319,-0.52172
320,-0.41611000000000004
321,-0.32132
322,-0.22111
323,-0.17842
324,-0.12077
325,-0.031070999999999998
326,0.048147
327,0.14400000000000002
328,0.15824000000000002
329,0.095583
330,-0.039182999999999996
331,-0.11919
332,-0.16
333,-0.056468
334,0.04387
335,0.1435
336,0.24434
337,0.35049
338,0.45876000000000006
339,0.5625899999999999
340,0.56831
341,0.62927
342,0.73761
343,0.84752
344,0.9562
345,1.0605
346,1.1802
347,1.2906
348,1.3939
349,1.3115
350,1.2094
351,1.1006
352,1.0061
353,0.8971399999999999
354,0.79342
355,0.6914100000000001
356,0.63647
357,0.56133
358,0.57748
359,0.55133
360,0.46156
361,0.36822
362,0.30336
363,0.22118000000000002
364,0.14474
365,0.11214
366,0.027170999999999997
367,-0.076241
368,-0.17947000000000002
369,-0.29035
370,-0.36357
371,-0.34752
372,-0.306
373,-0.20604
374,-0.15202000000000002
375,-0.13552999999999998
376,-0.20897
377,-0.25059000000000003
378,-0.3247
379,-0.33138
380,-0.36651
381,-0.47562
382,-0.59391
383,-0.64698
384,-0.66078
385,-0.77042
386,-0.88379
387,-0.98825
388,-1.065
389,-1.1726
390,-1.2458
391,-1.3365
392,-1.4211
393,-1.5038
394,-1.5208
395,-1.6332
396,-1.6926
397,-1.5731
398,-1.4499
399,-1.3295
400,-1.2289
401,-1.1101
402,-1.0017
403,-0.8937200000000001
404,-0.79432
405,-0.69831
406,-0.5767
407,-0.45357
408,-0.33423
409,-0.23043000000000002
410,-0.15754
411,-0.12630999999999998
412,-0.075722
413,0.079013
414,0.22785
415,0.37728
416,0.5192100000000001
417,0.62308
418,0.67919
419,0.82704
420,0.94932
421,1.0994
422,1.2213
423,1.3531
424,1.4539
425,1.5523
426,1.6603
