time,value
0,1.7054
1,1.6957
2,1.6792
3,1.6603
4,1.6365
5,1.6129
6,1.5969
7,1.574
8,1.5443
9,1.5079
10,1.4717
11,1.4356
12,1.4111
13,1.3984
14,1.379
15,1.3462
16,1.3113
17,1.2759
18,1.2404
19,1.2036
20,1.1666
21,1.1311
22,1.0954
23,1.0603
24,1.0253
25,0.9903299999999999
26,0.9546600000000001
27,0.9194200000000001
28,0.88433
29,0.84975
30,0.81529
31,0.78094
32,0.74673
33,0.7117600000000001
34,0.67753
35,0.64247
36,0.60748
37,0.5747399999999999
38,0.54298
39,0.51257
40,0.48131
41,0.45
42,0.41811000000000004
43,0.38605
44,0.35311
45,0.32121
46,0.28738
47,0.25416
48,0.2208
49,0.18756
50,0.15238
51,0.11935
52,0.086447
53,0.057641
54,0.048352
55,0.046676
56,0.046432999999999995
57,0.040262
58,0.032256
59,0.023790000000000002
60,0.006273
61,-0.016035
62,-0.042156
63,-0.071132
64,-0.09316100000000001
65,-0.12159
66,-0.15336
67,-0.18127000000000001
68,-0.20888
69,-0.24
70,-0.27093
71,-0.30165
72,-0.33215
73,-0.36243000000000003
74,-0.40074
75,-0.43067
76,-0.4633
77,-0.50188
78,-0.5363
79,-0.58287
80,-0.61638
81,-0.64972
82,-0.68286
83,-0.7158
84,-0.7518600000000001
85,-0.78501
86,-0.8274100000000001
87,-0.8650100000000001
88,-0.9061899999999999
89,-0.94295
90,-0.98446
91,-1.0259
92,-1.0759
93,-1.1278
94,-1.1746
95,-1.2159
96,-1.242
97,-1.2525
98,-1.2584
99,-1.2645
100,-1.2672
101,-1.27
102,-1.271
103,-1.2826
104,-1.2993
105,-1.3148
106,-1.3189
107,-1.3173
108,-1.3124
109,-1.3082
110,-1.3019999999999998
111,-1.2946
112,-1.2925
113,-1.296
114,-1.298
115,-1.2866
116,-1.2704
117,-1.2595
118,-1.2558
119,-1.2577
120,-1.2512
121,-1.2402
122,-1.2202
123,-1.1962
124,-1.1848
125,-1.1788
126,-1.1721
127,-1.163
128,-1.1341
129,-1.1171
130,-1.128
131,-1.1695
132,-1.1708
133,-1.1514
134,-1.1192
135,-1.0937
136,-1.0765
137,-1.0483
138,-1.0285
139,-1.0121
140,-0.99795
141,-0.9775799999999999
142,-0.95642
143,-0.9778899999999999
144,-0.97319
145,-0.9454100000000001
146,-0.9126299999999999
147,-0.88408
148,-0.85514
149,-0.82588
150,-0.80586
151,-0.7933399999999999
152,-0.77322
153,-0.74947
154,-0.7178899999999999
155,-0.68608
156,-0.664
157,-0.64505
158,-0.6183
159,-0.59385
160,-0.5797
161,-0.55157
162,-0.52298
163,-0.49638000000000004
164,-0.46681999999999996
165,-0.43896
166,-0.41072
167,-0.37783
168,-0.35047
169,-0.32233
170,-0.29184
171,-0.26089
172,-0.2267
173,-0.19633
174,-0.16515
175,-0.13238
176,-0.09871
177,-0.065434
178,-0.031817000000000005
179,0.0013675
180,0.027287
181,0.03893
182,0.05355599999999999
183,0.092701
184,0.13141
185,0.16965
186,0.20783000000000001
187,0.24644000000000002
188,0.28458
189,0.32266999999999996
190,0.36017
191,0.39896
192,0.43716000000000005
193,0.47448
194,0.51181
195,0.54915
196,0.58741
197,0.6257
198,0.6640199999999999
199,0.70177
200,0.73974
201,0.7771
202,0.81447
203,0.8528600000000001
204,0.89128
205,0.92866
206,0.96604
207,1.0034
208,1.0408
209,1.0771
210,1.1132
211,1.1498
212,1.1872
213,1.2247
214,1.2615
215,1.2961
216,1.3315
217,1.3663
218,1.4016
219,1.4197
220,1.4516
221,1.4687
222,1.4725
223,1.4766
224,1.4811
225,1.4788
226,1.4901
227,1.4826
228,1.4679
229,1.4754
230,1.5118
231,1.5303
232,1.5517
233,1.5590000000000002
234,1.5668
235,1.5677
236,1.5762
237,1.5761
238,1.5584
239,1.5536
240,1.5492
241,1.5302
242,1.5336
243,1.516
244,1.4819
245,1.4448
246,1.4127
247,1.3797
248,1.3433
249,1.3097
250,1.2827
251,1.2464
252,1.2101
253,1.1749
254,1.1393
255,1.1024
256,1.0669
257,1.031
258,0.9959100000000001
259,0.9611
260,0.92612
261,0.8899799999999999
262,0.85515
263,0.8183199999999999
264,0.78164
265,0.74556
266,0.70823
267,0.67208
268,0.63467
269,0.5986199999999999
270,0.56398
271,0.52799
272,0.49346
273,0.45753
274,0.42161000000000004
275,0.38572
276,0.34985
277,0.314
278,0.27819
279,0.24239000000000002
280,0.20663
281,0.16924
282,0.13189
283,0.094476
284,0.057094000000000006
285,0.021381
286,-0.015994
287,-0.05336799999999999
288,-0.090741
289,-0.1264
290,-0.16202
291,-0.17626
292,-0.15183
293,-0.12007000000000001
294,-0.11182
295,-0.14901
296,-0.18402000000000002
297,-0.21674000000000002
298,-0.24929
299,-0.28165999999999997
300,-0.31627
301,-0.35081
302,-0.38525
303,-0.41961000000000004
304,-0.45387
305,-0.48803
306,-0.52478
307,-0.56419
308,-0.6009
309,-0.6348199999999999
310,-0.66862
311,-0.6993699999999999
312,-0.7328100000000001
313,-0.7661
314,-0.80233
315,-0.83215
316,-0.8615799999999999
317,-0.89554
318,-0.9297
319,-0.96175
320,-0.99354
321,-1.025
322,-1.0559
323,-1.0792
324,-1.1053
325,-1.1308
326,-1.16
327,-1.1842
328,-1.2122
329,-1.2397
330,-1.2715
331,-1.2977
332,-1.3233
333,-1.348
334,-1.3719
335,-1.3906
336,-1.4101
337,-1.4314
338,-1.4507
339,-1.4671
340,-1.4789
341,-1.5005
342,-1.5139
343,-1.5257
344,-1.5357
345,-1.5367
346,-1.5428
347,-1.5488
348,-1.5561
349,-1.5633
350,-1.5541
351,-1.5444
352,-1.5368
353,-1.5289
354,-1.5122
355,-1.5006
356,-1.4874
357,-1.4661
358,-1.4436
359,-1.4199
360,-1.3952
361,-1.3759
362,-1.3606
363,-1.3386
364,-1.3212
365,-1.3025
366,-1.2827
367,-1.2669
368,-1.2448
369,-1.2126
370,-1.1845
371,-1.1559
372,-1.1269
373,-1.0974
374,-1.0674
375,-1.0411
376,-1.0064
377,-0.9754
378,-0.9403799999999999
379,-0.90886
380,-0.8770899999999999
381,-0.84506
382,-0.81029
383,-0.7770100000000001
384,-0.74441
385,-0.71162
386,-0.6786399999999999
387,-0.64551
388,-0.61221
389,-0.58639
390,-0.5543399999999999
391,-0.5198
392,-0.48034
393,-0.43783999999999995
394,-0.39253000000000005
395,-0.35389
396,-0.31727
397,-0.28335
398,-0.24933000000000002
399,-0.21520999999999998
400,-0.18100000000000002
401,-0.14415999999999998
402,-0.10729000000000001
403,-0.072916
404,-0.038465
405,-0.0039396
406,0.030655
407,0.06314199999999999
408,0.09546
409,0.13030999999999998
410,0.16303
411,0.19588
412,0.22563000000000002
413,0.25595999999999997
414,0.28585
415,0.319
416,0.35641999999999996
417,0.39375
418,0.43477
419,0.47024
420,0.5039399999999999
421,0.54128
422,0.57863
423,0.61421
424,0.64947
425,0.6728
426,0.6896
427,0.70922
428,0.7364
429,0.76982
430,0.79805
431,0.82624
432,0.8549100000000001
433,0.8876
434,0.9233899999999999
435,0.95921
436,0.9950399999999999
437,1.0309
438,1.0668
439,1.1027
440,1.1371
441,1.1716
442,1.2076
443,1.2436
444,1.2782
445,1.3129
446,1.3476
447,1.3811
448,1.4159
449,1.4496
450,1.4841
451,1.5185
452,1.5517
453,1.5855
454,1.6197
455,1.6540000000000001
456,1.6873
457,1.7169
458,1.7126
459,1.7086
460,1.705
461,1.7089
462,1.7059
