time,value
0,-0.70207
1,-0.60353
2,-0.70207
3,-0.60353
4,-0.70207
5,-0.60353
6,-0.70207
7,-0.70207
8,-0.70207
9,-0.60353
10,-0.70207
11,-0.70207
12,-0.70207
13,-0.60353
14,-0.70207
15,-0.70207
16,-0.70207
17,-0.60353
18,-0.70207
19,-0.70207
20,-0.70207
21,-0.60353
22,-0.70207
23,-0.70207
24,-0.70207
25,-0.60353
26,-0.70207
27,-0.70207
28,-0.70207
29,-0.60353
30,-0.70207
31,-0.70207
32,-0.70207
33,-0.60353
34,-0.70207
35,-0.70207
36,-0.70207
37,-0.60353
38,-0.70207
39,-0.70207
40,-0.70207
41,-0.60353
42,-0.70207
43,-0.70207
44,-0.70207
45,0.8745
46,1.4657
47,1.6628
48,1.5643
49,-0.11085
50,1.0716
51,1.7613
52,1.5643
53,-0.70207
54,-0.60353
55,-0.60353
56,-0.70207
57,0.5789
58,0.67743
59,-0.60353
60,-0.60353
61,-0.70207
62,-0.60353
63,-0.012317
64,-0.70207
65,-0.60353
66,-0.70207
67,-0.60353
68,1.2686
69,1.1701
70,1.4657
71,1.9584
72,2.1555
73,2.1555
74,-0.012317
75,-0.012317
76,-0.012317
77,-0.012317
78,-0.012317
79,-0.012317
80,-0.012317
81,-0.012317
82,-0.012317
83,1.1701
84,2.0569
85,1.9584
86,1.9584
87,1.9584
88,1.9584
89,1.9584
90,1.9584
91,1.9584
92,1.4657
93,-0.11085
94,-0.70207
95,-0.60353
