time,value
0,0.9704200000000001
1,1.0205
2,1.0205
3,-0.58058
4,-1.0309
5,-1.0309
6,-1.0309
7,-1.0309
8,-1.0309
9,-1.0309
10,-1.0309
11,-1.0309
12,-1.0309
13,-1.0309
14,-1.0309
15,-1.0309
16,-1.0309
17,-1.0309
18,-1.0309
19,-1.0309
20,-1.0309
21,-1.0309
22,-1.0309
23,-1.0309
24,-1.0309
25,-1.0309
26,-1.0309
27,-1.0309
28,-1.0309
29,-1.0309
30,-1.0309
31,-1.0309
32,-1.0309
33,-1.0309
34,-0.030227999999999998
35,-0.53055
36,-1.0309
37,-1.0309
38,-1.0309
39,-1.0309
40,-1.0309
41,-1.0309
42,-1.0309
43,-1.0309
44,-1.0309
45,-1.0309
46,-1.0309
47,-0.8807799999999999
48,1.0205
49,0.9704200000000001
50,1.0205
51,0.9704200000000001
52,1.0205
53,0.9704200000000001
54,0.9704200000000001
55,1.0205
56,0.9704200000000001
57,1.0205
58,0.9704200000000001
59,1.0205
60,0.9704200000000001
61,0.9704200000000001
62,1.0205
63,0.9704200000000001
64,1.0205
65,0.9704200000000001
66,1.0205
67,0.9704200000000001
68,1.0205
69,0.9704200000000001
70,0.9704200000000001
71,0.9704200000000001
72,1.0205
73,0.9704200000000001
74,0.9704200000000001
75,0.9704200000000001
76,0.9704200000000001
77,1.0205
78,0.9704200000000001
79,0.9704200000000001
80,1.0205
81,0.9704200000000001
82,1.0205
83,0.9704200000000001
84,1.0205
85,0.9704200000000001
86,0.9704200000000001
87,0.9704200000000001
88,1.0205
89,1.0205
90,0.9704200000000001
91,1.0205
92,0.7702899999999999
93,-1.0309
94,-1.0309
95,-1.0309
