time,value
0,-0.26175
1,-0.26175
2,-0.26175
3,-0.26175
4,-0.26175
5,-0.26175
6,-0.26175
7,-0.26175
8,-0.26175
9,-0.26175
10,-0.26175
11,-0.26175
12,-0.26175
13,-0.26175
14,-0.26175
15,-0.26175
16,-0.26175
17,-0.26175
18,-0.26175
19,-0.26175
20,-0.26175
21,-0.26175
22,-0.26175
23,-0.26175
24,-0.26175
25,-0.26175
26,-0.26175
27,-0.26175
28,-0.26175
29,-0.26175
30,-0.26175
31,-0.26175
32,-0.26175
33,-0.26175
34,2.6388
35,-0.26175
36,-0.26175
37,-0.26175
38,-0.26175
39,-0.26175
40,2.8595
41,0.52645
42,-0.26175
43,-0.26175
44,5.2556
45,2.8280000000000003
46,-0.26175
47,-0.26175
48,-0.26175
49,-0.26175
50,-0.26175
51,-0.26175
52,-0.26175
53,-0.26175
54,-0.26175
55,1.6615
56,-0.26175
57,-0.26175
58,-0.26175
59,-0.26175
60,-0.26175
61,-0.26175
62,-0.26175
63,-0.26175
64,5.7286
65,1.5353
66,-0.26175
67,-0.26175
68,-0.26175
69,-0.26175
70,-0.26175
71,-0.26175
72,-0.26175
73,-0.26175
74,-0.26175
75,-0.26175
76,-0.26175
77,-0.26175
78,-0.26175
79,-0.26175
80,-0.26175
81,-0.26175
82,-0.26175
83,-0.26175
84,-0.26175
85,-0.26175
86,-0.26175
87,-0.26175
88,-0.26175
89,-0.26175
90,-0.26175
91,-0.26175
92,-0.26175
93,-0.26175
94,-0.26175
95,-0.26175
