time,value
0,-0.25308
1,-0.25308
2,-0.25308
3,-0.25308
4,-0.25308
5,-0.25308
6,-0.25308
7,-0.25308
8,-0.25308
9,-0.25308
10,-0.25308
11,-0.25308
12,-0.25308
13,-0.25308
14,-0.25308
15,-0.25308
16,-0.25308
17,-0.25308
18,-0.25308
19,-0.25308
20,-0.25308
21,-0.25308
22,-0.25308
23,-0.25308
24,-0.25308
25,-0.25308
26,-0.25308
27,-0.25308
28,-0.25308
29,-0.25308
30,-0.25308
31,-0.25308
32,-0.25308
33,-0.25308
34,-0.25308
35,-0.25308
36,-0.25308
37,-0.25308
38,-0.25308
39,-0.25308
40,-0.25308
41,-0.25308
42,2.8183
43,4.459
44,0.15381
45,0.27194
46,-0.25308
47,-0.25308
48,-0.25308
49,-0.25308
50,-0.25308
51,-0.25308
52,-0.25308
53,-0.25308
54,3.6583
55,0.46883
56,-0.043068
57,-0.25308
58,-0.25308
59,-0.25308
60,-0.25308
61,-0.25308
62,-0.25308
63,-0.25308
64,-0.25308
65,-0.25308
66,-0.25308
67,-0.25308
68,-0.25308
69,-0.25308
70,-0.25308
71,-0.25308
72,-0.25308
73,-0.25308
74,-0.25308
75,-0.25308
76,-0.25308
77,-0.25308
78,-0.25308
79,-0.0036915
80,6.6116
81,2.0833
82,0.31132
83,0.19319
84,-0.17432
85,-0.05619299999999999
86,-0.25308
87,-0.25308
88,-0.25308
89,-0.25308
90,-0.25308
91,-0.25308
92,-0.25308
93,-0.25308
94,-0.25308
95,-0.25308
