time,value
0,-0.066412
1,0.08728999999999999
2,-0.064687
3,-0.084995
4,-0.073425
5,-0.088188
6,-0.07132999999999999
7,-0.065567
8,-0.06717000000000001
9,-0.061276
10,-0.061457000000000005
11,-0.057047
12,-0.032799
13,-0.013493999999999999
14,0.03469
15,0.070214
16,0.14858
17,0.25513
18,0.26281
19,0.31066
20,0.15752
21,0.11489
22,-0.087396
23,-0.35552
24,-0.6863199999999999
25,-0.68103
26,-1.0923
27,-1.7928
28,-1.7952
29,-1.9598
30,-2.4572
31,-2.4363
32,-2.4738
33,-2.662
34,-2.6331
35,-2.4264
36,-2.4334
37,-2.0594
38,-1.7034
39,-1.4731
40,-1.1054
41,-0.36932
42,-0.22996
43,-0.29565
44,0.0011453
45,0.58291
46,0.58929
47,0.75639
48,1.0084
49,0.9333799999999999
50,1.1994
51,1.7227
52,1.5699
53,1.5839
54,1.8521
55,1.9111
56,1.5164
57,1.5968
58,1.7573
59,1.3556
60,1.3428
61,1.3927
62,1.0616
63,0.77898
64,1.0674
65,0.8405600000000001
66,0.8960799999999999
67,0.75193
68,0.75271
69,0.86187
70,0.77576
71,0.7204699999999999
72,0.7322
73,0.72402
74,0.64665
75,0.6773600000000001
76,0.63757
77,0.51131
78,0.60126
79,0.5363600000000001
80,0.36174
81,0.4215
82,0.62317
83,0.55807
84,0.71943
85,0.77533
86,0.7016100000000001
87,0.82095
88,0.8796200000000001
89,0.8701399999999999
90,0.82816
91,0.8331299999999999
92,1.0242
93,0.85511
94,0.8558600000000001
95,0.99467
96,1.0581
97,0.90155
98,0.93399
99,1.0117
100,0.99851
101,1.063
102,1.0691
103,1.1249
104,1.2263
105,1.2466
106,1.3179
107,1.5038
108,1.3408
109,1.3831
110,1.2889
111,0.8462299999999999
112,0.95411
113,1.1112
114,0.60569
115,0.63942
116,0.785
117,0.20335999999999999
118,0.14278
119,-0.32523
120,-1.2916
121,-1.5328
122,-1.4980000000000002
123,-1.8657
124,-1.9103
125,-2.3348
126,-2.9434
127,-2.7262
128,-3.1715
129,-3.824
130,-3.4341
131,-3.0783
132,-2.9048
133,-2.5353
134,-2.1872
135,-2.0206
136,-1.6503
137,-2.016
138,-2.4969
139,-2.5329
140,-2.3815
141,-2.0391
142,-1.5686
143,-0.9693700000000001
144,-0.8015100000000001
145,-0.39608000000000004
146,0.31042
147,0.22864
148,0.22394
149,0.58367
150,0.77879
151,0.48468999999999995
152,0.17362
153,0.5161100000000001
154,1.0735
155,1.5361
156,1.6672
157,1.4304
158,1.0817
159,0.62795
160,0.49671000000000004
161,0.31826
162,0.16714
163,0.065674
164,0.03752
165,0.05614500000000001
166,0.06587799999999999
167,0.076378
168,0.082088
169,0.049844
170,0.07037
171,0.058086
172,0.065959
173,0.082524
174,0.077296
175,0.06490399999999999
176,0.061184
177,0.11628
178,0.14343
179,0.13222
180,0.16677999999999998
181,0.20592
182,0.2604
183,0.33301
184,0.44795
185,0.34471
186,0.34584000000000004
187,0.1803
188,0.11212000000000001
189,0.081528
190,0.08466699999999999
191,0.035195
192,0.008993799999999998
193,0.20063
194,0.21233000000000002
195,0.047231999999999996
196,0.0621
197,-0.08454199999999999
198,-0.029224
199,0.07369400000000001
200,-0.081853
201,-0.046350999999999996
202,-0.039952
203,0.015693000000000002
204,-0.0014687
205,-0.02638
206,-0.059384000000000006
207,0.17532999999999999
208,0.15052000000000001
209,0.13972
210,0.13517
211,0.20197
212,0.20603000000000002
213,0.07231
214,0.090904
215,0.29474
216,0.27946
217,0.085746
218,0.06832300000000001
219,0.13664
220,0.20207999999999998
221,0.26641
222,0.24986
223,0.15844
224,0.20277
225,0.20953000000000002
226,0.11500999999999999
227,0.10676
228,0.11652
229,0.11091
230,-0.082163
231,-0.094783
232,-0.10084
233,0.105
234,0.039993
235,0.10237
236,0.13383
237,0.052659000000000004
238,0.19488
239,0.022981
240,0.20257
241,0.013729
242,-0.006093
243,-0.15686
244,-0.14552
245,-0.15495
246,0.053958000000000006
247,0.061080999999999996
248,0.051753999999999994
249,0.041826
250,0.044381
251,0.039176
252,0.049473
253,-0.14552
254,-0.17135999999999998
255,0.0322
256,0.040719
257,0.059974
258,0.054235000000000005
259,0.045906999999999996
260,0.050377
261,0.059425
262,0.049526
263,0.053024
264,-0.1016
265,-0.18287
266,0.01487
267,-0.049645999999999996
268,-0.10388
269,-0.17849
270,-0.17484
271,-0.088173
272,-0.056606
273,-0.17489000000000002
274,-0.17024
275,-0.17215
276,-0.17759
277,-0.18307
278,-0.19308
279,0.010979000000000001
280,-0.11110999999999999
281,0.019108
282,0.2278
283,0.22241999999999998
284,0.012749
285,0.017606999999999998
286,-0.046183
287,-0.19721
288,0.013368999999999999
289,-0.00075153
290,-0.011212999999999999
291,0.16029000000000002
292,-0.013762
293,0.00043759
294,-0.20747
295,-0.20829
296,-0.21541
297,-0.006839499999999999
298,-0.0054826
299,-0.0095359
