time,value
0,-1.2094
1,-1.0052
2,-0.77341
3,-0.49263999999999997
4,-0.17478
5,0.16751
6,0.5615600000000001
7,1.0008
8,1.4140000000000001
9,1.7428
10,1.9838
11,2.1674
12,2.3012
13,2.364
14,2.3405
15,2.2451
16,2.1089
17,1.9381
18,1.7172
19,1.4396
20,1.1292
21,0.8265299999999999
22,0.54498
23,0.27957
24,0.032285
25,-0.17509
26,-0.32298000000000004
27,-0.42966000000000004
28,-0.5111399999999999
29,-0.5817399999999999
30,-0.63327
31,-0.66772
32,-0.69353
33,-0.70217
34,-0.69825
35,-0.67866
36,-0.65649
37,-0.62353
38,-0.5803
39,-0.53614
40,-0.49221000000000004
41,-0.45378
42,-0.41173000000000004
43,-0.36489
44,-0.29761
45,-0.20925
46,-0.10658
47,0.0047603
48,0.10833
49,0.18939
50,0.24276999999999999
51,0.29131
52,0.35172
53,0.42208
54,0.49875
55,0.5763
56,0.6542600000000001
57,0.72377
58,0.7712100000000001
59,0.77117
60,0.70829
61,0.60295
62,0.47338
63,0.32803000000000004
64,0.16322
65,-0.0036421999999999995
66,-0.15536
67,-0.29025
68,-0.3999
69,-0.47694
70,-0.50763
71,-0.498
72,-0.46271999999999996
73,-0.41258999999999996
74,-0.34962
75,-0.25386
76,-0.11921
77,0.047764999999999995
78,0.21986
79,0.36215
80,0.45103999999999994
81,0.48076
82,0.47181999999999996
83,0.42163999999999996
84,0.31162
85,0.13322
86,-0.08484
87,-0.29913
88,-0.48567
89,-0.62888
90,-0.72546
91,-0.77522
92,-0.79145
93,-0.79174
94,-0.78491
95,-0.77728
96,-0.75895
97,-0.73663
98,-0.71034
99,-0.68314
100,-0.65694
101,-0.63147
102,-0.61102
103,-0.57539
104,-0.5253800000000001
105,-0.46368000000000004
106,-0.39533
107,-0.31245
108,-0.20172
109,-0.049933
110,0.16421
111,0.43713
112,0.73795
113,1.0284
114,1.2816
115,1.4758
116,1.5808
117,1.5767
118,1.4669
119,1.2881
120,1.0865
121,0.87364
122,0.62888
123,0.34154
124,0.045346
125,-0.22444
126,-0.45696000000000003
127,-0.64827
128,-0.79714
129,-0.90728
130,-0.99828
131,-1.0713
132,-1.1219
133,-1.1502
134,-1.1553
135,-1.1492
136,-1.1244
137,-1.0944
138,-1.0528
139,-1.0106
140,-0.9681799999999999
141,-0.91894
142,-0.86721
143,-0.80702
144,-0.74303
145,-0.65236
146,-0.5118699999999999
147,-0.27597
148,0.10897000000000001
149,0.65636
150,1.2961
151,1.8782
152,2.2912
153,2.5295
154,2.6653
155,2.7551
156,2.8065
157,2.8103
158,2.7385
159,2.5629
160,2.2837
161,1.9509
162,1.6293
163,1.3471
164,1.1046
165,0.88741
166,0.68367
167,0.48428999999999994
168,0.289
169,0.1239
170,-0.0018591999999999999
171,-0.087101
172,-0.1378
173,-0.15454
174,-0.146
175,-0.14498
176,-0.15557
177,-0.18850999999999998
178,-0.24908000000000002
179,-0.3451
180,-0.46386000000000005
181,-0.58076
182,-0.69002
183,-0.78181
184,-0.85795
185,-0.9138200000000001
186,-0.95324
187,-0.98034
188,-0.99584
189,-1.0072
190,-1.01
191,-1.0144
192,-1.0169
193,-1.0219
194,-1.0243
195,-1.0191
196,-1.0058
197,-0.9705600000000001
198,-0.91358
199,-0.8297399999999999
200,-0.72267
201,-0.5827600000000001
202,-0.37505
203,-0.042937
204,0.43793000000000004
205,0.97036
206,1.3994
207,1.6492
208,1.771
209,1.8345
210,1.8422
211,1.7713
212,1.6212
213,1.4286
214,1.2342
215,1.0545
216,0.87971
217,0.69924
218,0.53103
219,0.3935
220,0.28397
221,0.18179
222,0.074173
223,-0.026846
224,-0.12267
225,-0.21783000000000002
226,-0.31488
227,-0.40487
228,-0.48038000000000003
229,-0.5381
230,-0.55342
231,-0.54566
232,-0.55589
233,-0.59749
234,-0.63415
235,-0.6448
236,-0.65299
237,-0.6624399999999999
238,-0.66498
239,-0.65868
240,-0.65612
241,-0.66047
242,-0.66946
243,-0.68952
244,-0.71549
245,-0.7407699999999999
246,-0.75958
247,-0.77664
248,-0.79657
249,-0.81676
250,-0.83554
251,-0.8506
252,-0.8625
253,-0.8687299999999999
254,-0.86926
255,-0.86984
256,-0.87244
257,-0.87682
258,-0.8796799999999999
259,-0.8856700000000001
260,-0.9011
261,-0.9284399999999999
262,-0.9723200000000001
263,-1.0373
264,-1.1228
265,-1.2164
266,-1.3128
267,-1.405
268,-1.4685
269,-1.4864
