time,value
0,0.55838
1,0.55838
2,0.55838
3,-1.7722
4,0.55838
5,0.55838
6,0.55838
7,-1.7722
8,0.55838
9,0.55838
10,0.55838
11,-1.7722
12,0.55838
13,0.55838
14,0.55838
15,0.55838
16,0.55838
17,-1.7722
18,0.55838
19,0.55838
20,0.55838
21,0.55838
22,-1.7722
23,0.55838
24,0.55838
25,0.55838
26,-1.7722
27,0.55838
28,0.55838
29,0.55838
30,-1.7722
31,0.55838
32,0.55838
33,0.55838
34,-1.7722
35,0.55838
36,0.55838
37,0.55838
38,-1.7722
39,0.55838
40,0.55838
41,0.55838
42,-1.7722
43,0.55838
44,0.55838
45,0.55838
46,-1.7722
47,0.55838
48,0.55838
49,0.55838
50,-1.7722
51,0.55838
52,0.55838
53,0.55838
54,-1.7722
55,0.55838
56,0.55838
57,0.55838
58,-1.7722
59,0.55838
60,0.55838
61,0.55838
62,-1.7722
63,0.55838
64,0.55838
65,0.55838
66,0.55838
67,-1.7722
68,0.55838
69,0.55838
70,0.55838
71,-1.7722
72,0.55838
73,0.55838
74,0.55838
75,-1.7722
76,0.55838
77,0.55838
78,0.55838
79,-1.7722
80,0.55838
81,0.55838
82,0.55838
83,-1.7722
84,0.55838
85,0.55838
86,0.55838
87,-1.7722
88,0.55838
89,0.55838
90,0.55838
91,-1.7722
92,0.55838
93,0.55838
94,0.55838
95,-1.7722
