time,value
0,-0.5424
1,-0.5424
2,1.8244
3,-0.5424
4,-0.5424
5,-0.5424
6,1.8244
7,-0.5424
8,-0.5424
9,-0.5424
10,1.8244
11,-0.5424
12,-0.5424
13,-0.5424
14,1.8244
15,-0.5424
16,-0.5424
17,-0.5424
18,1.8244
19,-0.5424
20,-0.5424
21,-0.5424
22,1.8244
23,-0.5424
24,-0.5424
25,-0.5424
26,1.8244
27,-0.5424
28,-0.5424
29,-0.5424
30,1.8244
31,-0.5424
32,-0.5424
33,-0.5424
34,1.8244
35,-0.5424
36,-0.5424
37,-0.5424
38,-0.5424
39,1.8244
40,-0.5424
41,-0.5424
42,-0.5424
43,-0.5424
44,1.8244
45,-0.5424
46,-0.5424
47,-0.5424
48,1.8244
49,-0.5424
50,-0.5424
51,-0.5424
52,1.8244
53,-0.5424
54,-0.5424
55,-0.5424
56,-0.5424
57,-0.5424
58,1.8244
59,-0.5424
60,-0.5424
61,-0.5424
62,-0.5424
63,1.8244
64,-0.5424
65,-0.5424
66,-0.5424
67,1.8244
68,-0.5424
69,-0.5424
70,-0.5424
71,1.8244
72,-0.5424
73,-0.5424
74,-0.5424
75,1.8244
76,-0.5424
77,-0.5424
78,-0.5424
79,1.8244
80,-0.5424
81,-0.5424
82,-0.5424
83,1.8244
84,-0.5424
85,-0.5424
86,-0.5424
87,1.8244
88,-0.5424
89,-0.5424
90,-0.5424
91,-0.5424
92,1.8244
93,-0.5424
94,-0.5424
95,-0.5424
