time,value
0,-1.0173
1,-1.0173
2,-1.0173
3,-1.0173
4,-1.0173
5,-1.0173
6,-1.0173
7,-1.0173
8,-1.0173
9,-1.0173
10,-1.0173
11,-1.0173
12,-1.0173
13,-1.0173
14,-1.0173
15,-1.0173
16,-1.0173
17,-1.0173
18,-1.0173
19,-1.0173
20,-1.0173
21,-1.0173
22,-1.0173
23,-1.0173
24,0.29536
25,1.7831
26,1.433
27,1.258
28,0.8204299999999999
29,1.083
30,0.99546
31,0.73292
32,1.1705
33,0.90795
34,0.99546
35,1.1705
36,-0.7548
37,-1.0173
38,-1.0173
39,-1.0173
40,-1.0173
41,-1.0173
42,-0.22971999999999998
43,0.64541
44,0.55789
45,-1.0173
46,-1.0173
47,-1.0173
48,0.47038
49,0.032817
50,1.8706
51,0.90795
52,0.64541
53,0.64541
54,0.55789
55,0.64541
56,0.55789
57,0.55789
58,0.55789
59,0.55789
60,-0.14221
61,1.608
62,-1.0173
63,-1.0173
64,-1.0173
65,-1.0173
66,0.64541
67,1.8706
68,1.1705
69,0.99546
70,0.90795
71,1.3455
72,0.8204299999999999
73,0.99546
74,1.083
75,0.90795
76,0.99546
77,1.258
78,0.8204299999999999
79,0.99546
80,1.083
81,0.73292
82,1.083
83,0.90795
84,0.73292
85,1.1705
86,0.73292
87,0.90795
88,-0.7548
89,-1.0173
90,-1.0173
91,-1.0173
92,-1.0173
93,-1.0173
94,-1.0173
95,-1.0173
