time,value
0,0.56485
1,0.5887399999999999
2,0.55781
3,0.5081
4,0.49428
5,0.5039
6,0.56143
7,0.69375
8,0.70072
9,0.53771
10,0.55108
11,0.56971
12,0.74974
13,0.37690999999999997
14,0.31985
15,-0.54272
16,-2.1872
17,-2.9192
18,-2.5269999999999997
19,-1.5678
20,-0.89776
21,-1.2508
22,-0.72209
23,-0.16664
24,0.012508
25,0.72737
26,1.2339
27,1.2241
28,1.21
29,0.9614299999999999
30,0.9950600000000001
31,0.74287
32,0.23331
33,-0.67492
34,-0.75045
35,-0.41123999999999994
36,-0.66886
37,-0.9411200000000001
38,-0.95055
39,-1.2562
40,-1.5052
41,-1.6222
42,-1.5204
43,-0.90995
44,-0.9338799999999999
45,-0.7329399999999999
46,-0.40321999999999997
47,-0.0020824000000000003
48,0.14154
49,0.5242
50,0.5198
51,0.5025
52,0.7582899999999999
53,0.81786
54,0.8993899999999999
55,0.92658
56,0.66157
57,0.56255
58,0.69584
59,0.6191
60,0.51725
61,0.18107
62,-0.034799000000000004
63,-0.28515999999999997
64,-0.45848999999999995
65,-0.58633
66,-1.0187
67,-1.2531
68,-1.8221
69,-1.9055
70,-1.6457
71,-1.6004
72,-1.9009
73,-1.9621
74,-2.0386
75,-2.2263
76,-2.2193
77,-2.1282
78,-2.3343
79,-2.0324
80,-1.8092
81,-1.8361
82,-1.3926
83,-1.3558
84,-1.1327
85,-0.9234100000000001
86,-0.69526
87,-0.6683899999999999
88,-0.49659
89,-0.31843
90,-0.20108
91,0.065053
92,0.31268
93,0.36785
94,0.61928
95,0.5963
96,0.70401
97,0.65042
98,0.5494399999999999
99,0.57105
100,0.6443
101,0.47358999999999996
102,0.23793000000000003
103,0.11133
104,-0.15975
105,-0.50102
106,-0.90494
107,-0.9978600000000001
108,-1.024
109,-1.3391
110,-1.4401
111,-1.5328
112,-1.6796
113,-1.7935
114,-1.3109
115,-1.5982
116,-2.0288
117,-2.2219
118,-2.5319
119,-2.263
120,-2.5286
121,-2.4244
122,-1.9633
123,-1.4114
124,-0.80062
125,-0.59001
126,-0.25196999999999997
127,-0.09287100000000001
128,-0.19797
129,0.23628000000000002
130,0.48116000000000003
131,0.58667
132,0.77609
133,0.9944200000000001
134,1.1298
135,1.1518
136,0.93721
137,0.8660399999999999
138,0.90956
139,0.9080799999999999
140,0.89761
141,0.78254
142,0.89
143,0.64152
144,0.71999
145,0.56407
146,0.48516000000000004
147,-0.64525
148,-0.21941999999999998
149,-1.1532
150,-2.1253
151,-0.9029299999999999
152,-1.0385
153,-1.7919
154,-1.4855
155,-1.6282
156,-1.4328
157,-1.1178
158,-1.1183
159,-1.1201
160,-1.0482
161,-1.1452
162,-0.8260200000000001
163,-0.8356
164,-1.0426
165,-1.3061
166,-1.4643
167,-0.78192
168,-0.72144
169,-0.91935
170,-1.0799
171,-1.1499
172,-1.7094
173,-0.6635300000000001
174,0.1627
175,0.41312
176,0.70005
177,0.966
178,0.8517399999999999
179,1.2115
180,1.7271
181,1.7744
182,1.5090000000000001
183,1.0352
184,0.8172699999999999
185,0.37545
186,0.54681
187,0.62563
188,0.9184399999999999
189,0.9635299999999999
190,0.8837299999999999
191,0.8405600000000001
192,0.81302
193,0.8333299999999999
194,0.84711
195,0.60001
196,0.6039899999999999
197,0.5907100000000001
198,0.76512
199,0.78733
200,0.81735
201,0.8607799999999999
202,0.7662100000000001
203,0.81828
204,0.7853899999999999
205,0.76827
206,0.73905
207,0.78035
208,0.75446
209,0.74045
210,0.7357600000000001
211,0.7510899999999999
212,0.7472
213,0.7198100000000001
214,0.68905
215,0.58638
216,0.37631
217,0.38996
218,0.38932
219,0.36963
220,0.6882
221,0.7660899999999999
222,0.6949
223,0.8256
224,0.8516799999999999
225,0.8661700000000001
226,0.73041
227,0.72805
228,0.42141000000000006
229,0.40396
230,0.40604
231,0.38823
232,0.37387
233,0.69029
234,0.68852
235,0.7845300000000001
236,0.7408600000000001
237,0.64437
238,0.62895
239,0.6103
240,0.59601
241,0.6011
242,0.59959
243,0.6329
244,0.64412
245,0.6361600000000001
246,0.63178
247,0.63031
248,0.63171
249,0.6218100000000001
250,0.622
251,0.69877
252,0.72892
253,0.6291399999999999
254,0.6189600000000001
255,0.6109100000000001
256,0.6181800000000001
257,0.63266
258,0.62975
259,0.62192
260,0.62378
261,0.63226
262,0.62513
263,0.62827
264,0.62565
265,0.60837
266,0.59723
267,0.6029800000000001
268,0.60936
269,0.6121800000000001
270,0.28963
271,0.27199
272,0.61325
273,0.61427
274,0.61736
275,0.61574
276,0.61149
277,0.76717
278,0.74868
279,0.5909
280,0.5959300000000001
281,0.5959800000000001
282,0.58872
283,0.5857100000000001
284,0.5897600000000001
285,0.59391
286,0.5915
287,0.5955
288,0.59295
289,0.67438
290,0.73957
291,0.56999
292,0.57081
293,0.5807899999999999
294,0.5867
295,0.36888000000000004
296,0.23786
297,0.5746899999999999
298,0.57101
299,0.57217
