time,value
0,0.8217
1,1.4075
2,-0.74034
3,-0.74034
4,-0.74034
5,0.8217
6,1.2122
7,-0.74034
8,-0.74034
9,-0.74034
10,0.8217
11,1.6027
12,-0.74034
13,-0.74034
14,-0.74034
15,0.23593000000000003
16,1.9932
17,-0.74034
18,-0.74034
19,-0.74034
20,0.23593000000000003
21,1.9932
22,-0.74034
23,-0.74034
24,-0.74034
25,-0.34983000000000003
26,2.1885
27,-0.34983000000000003
28,-0.74034
29,-0.74034
30,-0.74034
31,1.798
32,0.62644
33,-0.74034
34,-0.74034
35,-0.74034
36,0.8217
37,1.6027
38,-0.74034
39,-0.74034
40,-0.74034
41,-0.74034
42,2.1885
43,-0.15458
44,-0.74034
45,-0.74034
46,-0.74034
47,1.2122
48,1.2122
49,-0.74034
50,-0.74034
51,-0.74034
52,-0.15458
53,1.9932
54,-0.34983000000000003
55,-0.74034
56,-0.74034
57,-0.74034
58,1.4075
59,1.0170000000000001
60,-0.74034
61,-0.74034
62,-0.74034
63,1.0170000000000001
64,1.0170000000000001
65,-0.74034
66,-0.74034
67,-0.74034
68,0.040678
69,1.9932
70,-0.74034
71,-0.74034
72,-0.74034
73,-0.74034
74,1.4075
75,0.8217
76,-0.74034
77,-0.74034
78,-0.74034
79,0.040678
80,1.9932
81,-0.34983000000000003
82,-0.74034
83,-0.74034
84,0.62644
85,1.6027
86,-0.74034
87,-0.74034
88,-0.74034
89,1.6027
90,0.62644
91,-0.74034
92,-0.74034
93,-0.74034
94,1.6027
95,0.8217
