[<text>
<title>discus corp &lt;disc&gt; 4th qtr loss</title>
<dateline>    bloomington, minn., march 26 -
    </dateline>shr loss six cts vs loss seven cts
    net loss 125,000 vs loss 140,000
    rev 2.4 mln vs 2.2 mln
    year
    shr loss 13 cts vs loss 14 cts
    net loss 271,000 vs loss 211,000
    rev 10.1 mln vs 8.2 mln
 reuter
</text>]