time,value
0,-0.14503
1,-0.14503
2,-0.14503
3,-0.14503
4,-0.14503
5,-0.14503
6,-0.14503
7,-0.14503
8,-0.14503
9,-0.14503
10,-0.14503
11,-0.14503
12,-0.14503
13,-0.14503
14,-0.14503
15,-0.14503
16,-0.14503
17,-0.14503
18,-0.14503
19,-0.14503
20,-0.14503
21,-0.14503
22,-0.14503
23,-0.14503
24,-0.14503
25,-0.14503
26,-0.14503
27,-0.14503
28,-0.14503
29,-0.14503
30,-0.14503
31,-0.14503
32,-0.14503
33,-0.14503
34,-0.14503
35,-0.14503
36,-0.14503
37,-0.14503
38,6.5938
39,7.0388
40,-0.14503
41,-0.14503
42,-0.14503
43,-0.14503
44,-0.14503
45,-0.14503
46,-0.14503
47,-0.14503
48,-0.14503
49,-0.14503
50,-0.14503
51,-0.14503
52,-0.14503
53,-0.14503
54,-0.14503
55,-0.14503
56,-0.14503
57,-0.14503
58,-0.14503
59,-0.14503
60,-0.14503
61,-0.14503
62,-0.14503
63,-0.14503
64,-0.14503
65,-0.14503
66,-0.14503
67,-0.14503
68,-0.14503
69,-0.14503
70,-0.14503
71,-0.14503
72,-0.14503
73,-0.14503
74,-0.14503
75,-0.14503
76,-0.14503
77,-0.14503
78,-0.14503
79,-0.14503
80,-0.14503
81,-0.14503
82,-0.14503
83,-0.14503
84,-0.14503
85,-0.14503
86,-0.14503
87,-0.14503
88,-0.14503
89,-0.14503
90,-0.14503
91,-0.14503
92,-0.14503
93,-0.14503
94,-0.14503
95,-0.14503
