[<text>
<title>norcros profits advance in 1986/87</title>
<dateline>    london, june 2 - </dateline>year to march 31
    shr 28.0p vs 21.4p
    final dividend 9p vs 6.5p making 12p vs 9.3p
    pretax profit 53.16 mln stg vs 45.12 mln
    turnover 641.1 mln stg vs 639.7 mln
    group operating profit 57.63 mln stg vs 49.06 mln
    share of associates' profits 1.33 mln stg vs 3.87 mln
    investment income 1.59 mln stg vs 2.19 mln
    interest payable 7.38 mln stg vs 10.01 mln
    tax 16.48 mln stg vs 17.60 mln
    leaving 36.68 mln vs 27.51
    minorities debit 1.58 mln stg vs debit 1.39 mln
    extraordinary items credit 2.95 mln stg vs debit 8.12 mln
    operating profits breakdown, by class of business,
    - building materials manufacture 23.7 mln stg vs 20.9 mln
    - distribution 10.1 mln stg vs 7.5 mln
    - specialist print and pack 12.6 mln stg vs 9.6 mln
    - international 6.0 mln stg vs 5.6 mln
    - head office and property 4.6 mln stg vs 3.6 mln
    - discontinued, sold businesses 589,000 stg vs 2.4 mln
    operating profits, geographic breakdown:
    - britain 51.4 mln stg vs 43.3 mln
    - africa 3.3 mln stg vs 3.4 mln
    - australasia 1.4 mln stg vs 854,000 stg
    - north america 1.5 mln stg vs 1.6 mln
    note - full name is norcros plc &lt;ncro.l&gt;.
 reuter
</text>]