time,value
0,0.7921100000000001
1,0.9312600000000001
2,-0.32105
3,-1.4342
4,-0.1819
5,0.9312600000000001
6,-0.25148000000000004
7,-1.4342
8,0.026813999999999998
9,0.9312600000000001
10,-0.59934
11,-1.4342
12,0.37468
13,0.9312600000000001
14,-0.8776299999999999
15,-1.4342
16,0.58339
17,0.9312600000000001
18,-0.9472
19,-1.4342
20,0.6529699999999999
21,0.9312600000000001
22,-1.2951
23,-1.4342
24,0.8616799999999999
25,0.8616799999999999
26,-1.4342
27,-1.2255
28,1.0704
29,0.23553000000000002
30,-1.4342
31,-0.80806
32,1.0008
33,0.5138199999999999
34,-1.4342
35,-1.1559
36,0.9312600000000001
37,0.58339
38,-1.4342
39,-1.0863
40,1.0008
41,0.6529699999999999
42,-1.4342
43,-1.2255
44,1.0008
45,0.7921100000000001
46,-1.4342
47,-1.4342
48,1.0008
49,0.8616799999999999
50,-0.8776299999999999
51,-1.4342
52,0.3051
53,0.8616799999999999
54,-0.042758
55,-1.4342
56,-0.52977
57,1.0008
58,0.9312600000000001
59,0.8616799999999999
60,0.8616799999999999
61,0.8616799999999999
62,0.8616799999999999
63,0.7921100000000001
64,0.8616799999999999
65,0.7921100000000001
66,0.7921100000000001
67,0.8616799999999999
68,0.7921100000000001
69,0.7921100000000001
70,0.72254
71,0.44425
72,-1.4342
73,-1.2951
74,1.0008
75,0.8616799999999999
76,0.7921100000000001
77,0.8616799999999999
78,-0.9472
79,-1.4342
80,0.44425
81,0.8616799999999999
82,0.8616799999999999
83,0.5138199999999999
84,-1.4342
85,-0.9472
86,0.9312600000000001
87,0.9312600000000001
88,0.7921100000000001
89,-1.2951
90,-1.4342
91,0.9312600000000001
92,0.8616799999999999
93,0.8616799999999999
94,0.3051
95,-1.4342
