d3mIndex,user_id,posts_count,comments_count
0,0,2,1
1,1,1,1
2,2,4,1
3,3,1,4
4,4,4,1
5,5,5,8
6,6,5,3
7,7,2,7
8,8,3,2
9,9,3,4
10,10,6,2
11,11,9,26
12,12,2,3
13,13,6,1
14,14,5,29
15,15,14,4
16,16,13,5
17,17,4,5
18,18,14,2
19,19,2,3
20,20,4,7
21,21,3,2
22,22,3,4
23,23,3,3
24,24,1,4
25,25,3,4
26,26,3,8
27,27,2,2
28,28,1,1
29,29,2,0
30,30,9,4
31,31,3,9
32,32,6,2
33,33,6,3
34,34,3,22
35,35,1,5
36,36,12,0
37,37,6,3
38,38,4,1
39,39,3,7
40,40,37,1
41,41,5,1
42,42,16,3
43,43,1,7
44,44,2,3
45,45,3,4
46,46,3,5
47,47,9,3
48,48,5,4
49,49,36,2
50,50,6,4
51,51,3,5
52,52,3,2
53,53,10,3
54,54,6,1
55,55,2,1
56,56,3,181
57,57,4,3
58,58,193,1
59,59,49,1
60,60,6,3
61,61,3,4
62,62,10,2
63,63,3,1
64,64,4,2
65,65,3,2
66,66,3,6
67,67,0,1
68,68,92,21
69,69,2,4
70,70,2,2
71,71,1,10
72,72,2,64
73,73,2,3
74,74,12,2
75,75,4,2
76,76,2,1
77,77,2,3
78,78,10,1
79,79,4,2
80,80,1,3
81,81,3,1
82,82,7,1
83,83,2,2
84,84,5,1
85,85,5,11
86,86,2,28
87,87,8,3
88,88,52,2
89,89,0,3
90,90,9,4
91,91,2,4
92,92,4,2
93,93,3,3
94,94,4,2
95,95,6,4
96,96,7,15
97,97,5,5
98,98,2,10
99,99,20,2
100,100,8,1
101,101,4,0
102,102,12,18
103,103,6,0
104,104,13,3
105,105,5,1
106,106,5,11
107,107,16,3
108,108,8,0
109,109,2,1
110,110,1,12
111,111,23,3
112,112,8,0
113,113,11,1
114,114,7,3
115,115,12,4
116,116,4,1
117,117,7,4
118,118,5,25
119,119,6,2
120,120,5,5
121,121,4,7
122,122,2,2
123,123,1,6
124,124,2,0
125,125,1,1
126,126,1,3
127,127,4,4
128,128,3,3
129,129,3,1649
130,130,1,1
131,131,4,2
132,132,5,13
133,133,3,4
134,134,6,8
135,135,8,9
136,136,15,6
137,137,121,3
138,138,2,4
139,139,3,1
140,140,3,4
141,141,0,5
142,142,11,1
143,143,2,1
144,144,12,3
145,145,6,6
146,146,7,2
147,147,6,1
148,148,3,0
149,149,9,8
150,150,6,2
151,151,0,5
152,152,7,4
153,153,5,21
154,154,1,5
155,155,2,3
156,156,0,1
157,157,2,1
158,158,6,8
159,159,1,3
160,160,10,4
161,161,4,12
162,162,8,2
163,163,3,6
164,164,2,2
165,165,32,8
166,166,1,39
167,167,4,6
168,168,4,2
169,169,1,4
170,170,1,5
171,171,4,9
172,172,1,4
173,173,4,0
174,174,5,17
175,175,5,5
176,176,6,1
177,177,15,2
178,178,6,2
179,179,35,2
180,180,5,13
181,181,1,6
182,182,3,0
183,183,12,11
184,184,6,9
185,185,20,4
186,186,8,6
187,187,10,3
188,188,2,2
189,189,1,5
190,190,19,3
191,191,0,3
192,192,10,3
193,193,0,1
194,194,1,4
195,195,3,1
196,196,22,12
197,197,3,16
198,198,21,4
199,199,8,9
200,200,2,2
201,201,8,2
202,202,2,4
203,203,3,2
204,204,4,0
205,205,4,4
206,206,13,1
207,207,3,2
208,208,13,2
209,209,24,1
210,210,30,3
211,211,9,0
212,212,1,6
213,213,3,29
214,214,3,137
215,215,15,4
216,216,9,4
217,217,0,10
218,218,4,14
219,219,11,6
220,220,19,3
221,221,1,208
222,222,5,4
223,223,8,1
224,224,3,2
225,225,0,11
226,226,5,2
227,227,1,6
228,228,6,10
229,229,8,4
230,230,6,2
231,231,12,4
232,232,3,28
233,233,1,55
234,234,7,1
235,235,1,2
236,236,24,2
237,237,7,184
238,238,6,3
239,239,18,2
240,240,1,5
241,241,4,2
242,242,10,10
243,243,4,1
244,244,5,5
245,245,5,8
246,246,52,2
247,247,1,4
248,248,8,1
249,249,9,3
250,250,3,4
251,251,11,0
252,252,5,2
253,253,4,9
254,254,2,21
255,255,6,1
256,256,4,5
257,257,0,1
258,258,0,1
259,259,5,16
260,260,7,1
261,261,2,1
262,262,8,4
263,263,4,1
264,264,1,6
265,265,6,2
266,266,23,3
267,267,77,5
268,268,8,2
269,269,6,1
270,270,1,6
271,271,6,2
272,272,1,29
273,273,1,1
274,274,2,2
275,275,21,28
276,276,2,3
277,277,103,2
278,278,218,0
279,279,7,2
280,280,9,2
281,281,13,1
282,282,18,3
283,283,38,2
284,284,10,0
285,285,5,3
286,286,5,12
287,287,5,13
288,288,3,0
289,289,4,6
290,290,15,3
291,291,10,7
292,292,2,5
293,293,4,28
294,294,9,10
295,295,3,5
296,296,2,1
297,297,3,2
298,298,3,4
299,299,21,19
300,300,3,1
301,301,3,13
302,302,2,12
303,303,3,3
304,304,28,0
305,305,3,1
306,306,10,5
307,307,2,2
308,308,2,2
309,309,18,88
310,310,13,0
311,311,4,4
312,312,58,2
313,313,7,2
314,314,3,3
315,315,1,1
316,316,3,6
317,317,36,2
318,318,7,3
319,319,0,1
320,320,5,5
321,321,4,8
322,322,26,5
323,323,6,5
324,324,2,2
325,325,2,5
326,326,5,9
327,327,4,5
328,328,4,5
329,329,4,2
330,330,6,0
331,331,1,49
332,332,2,5
333,333,6,4
334,334,1,8
335,335,29,4
336,336,1,5
337,337,6,0
338,338,4,3
339,339,0,2
340,340,1,1
341,341,1,3
342,342,2,8
343,343,2,11
344,344,10,5
345,345,7,23
346,346,4,9
347,347,11,3
348,348,4,2
349,349,0,3
350,350,6,1
351,351,5,21
352,352,19,2
353,353,4,3
354,354,12,2
355,355,32,2
356,356,3,3
357,357,3,1
358,358,20,5
359,359,2,3
360,360,2,10
361,361,6,30
362,362,7,1
363,363,3,24
364,364,1,3
365,365,9,3
366,366,1,1
367,367,6,7
368,368,6,1
369,369,5,148
370,370,6,1
371,371,3,7
372,372,20,2
373,373,13,0
374,374,2,1
375,375,1,4
376,376,1,1
377,377,3,2
378,378,5,3
379,379,5,13
380,380,1,2
381,381,3,2
382,382,4,4
383,383,34,4
384,384,3,4
385,385,4,6
386,386,3,7
387,387,6,6
388,388,3,3
389,389,12,5
390,390,4,0
391,391,3,1
392,392,2,2
393,393,4,2
394,394,4,2
395,395,4,1
396,396,6,11
397,397,2,5
398,398,2,1
399,399,0,1
400,400,1,1
401,401,6,2
402,402,5,1
403,403,6,1
404,404,2,6
405,405,2,1
406,406,6,5
407,407,3,1
408,408,1,8
409,409,6,8
410,410,3,8
411,411,3,2
412,412,6,26
413,413,3,1
414,414,1,1
415,415,4,46
416,416,5,1
417,417,27,0
418,418,7,5
419,419,13,8
420,420,2,5
421,421,25,1
422,422,2,5
423,423,25,3
424,424,10,3
425,425,2,0
426,426,13,6
427,427,17,1
428,428,1,1
429,429,45,0
430,430,1,8
431,431,5,8
432,432,2,1
433,433,19,4
434,434,6,1
435,435,3,3
436,436,34,2
437,437,4,2
438,438,11,7
439,439,2,1
440,440,3,2
441,441,9,1
442,442,4,0
443,443,9,1
444,444,8,22
445,445,4,2
446,446,3,4
447,447,3,1
448,448,2,7
449,449,8,1
450,450,6,2
451,451,8,6
452,452,3,2
453,453,63,8
454,454,6,1
455,455,6,2
456,456,3,4
457,457,3,5
458,458,9,1
459,459,23,4
460,460,0,12
461,461,20,2
462,462,2,28
463,463,11,7
464,464,5,17
465,465,16,0
466,466,36,3
467,467,2,2
468,468,2,1
469,469,5,25
470,470,3,6
471,471,6,0
472,472,6,6
473,473,14,4
474,474,5,2
475,475,27,5
476,476,4,1
477,477,4,3
478,478,65,14
479,479,623,5
480,480,5,2
481,481,12,2
482,482,5,1
483,483,0,3
484,484,5,1
485,485,3,1
486,486,5,1
487,487,6,1
488,488,1,1
489,489,6,5
490,490,7,80
491,491,6,3
492,492,14,2
493,493,3,2
494,494,6,5
495,495,4,3
496,496,2,6
497,497,7,2
498,498,3,2
499,499,4,2
500,500,2,3
501,501,2,0
502,502,1,3
503,503,8,5
504,504,11,4
505,505,78,2
506,506,0,1
507,507,10,2
508,508,2,1
509,509,6,9
510,510,1,3
511,511,8,23
512,512,2,2
513,513,12,4
514,514,1,3
515,515,9,6
516,516,1,7
517,517,1,18
518,518,2,4
519,519,9,11
520,520,4,2
521,521,3,0
522,522,2,5
523,523,8,2
524,524,8,1
525,525,1,0
526,526,22,0
527,527,0,1
528,528,2,9
529,529,2,3
530,530,7,2
531,531,11,0
532,532,18,1
533,533,1,6
534,534,2,16
535,535,3,4
536,536,2,1
537,537,2,3
538,538,2,2
539,539,28,2
540,540,1,16
541,541,2,2
542,542,2,6
543,543,5,2
544,544,11,5
545,545,9,10
546,546,8,3
547,547,4,28
548,548,2,6
549,549,7,3
550,550,4,3
551,551,9,1
552,552,2,20
553,553,0,10
554,554,12,39
555,555,2,1
556,556,5,4
557,557,8,3
558,558,28,0
559,559,5,1
560,560,3,0
561,561,12,1
562,562,2,3
563,563,2,11
564,564,3,8
565,565,4,2
566,566,2,5
567,567,4,1
568,568,3,1
569,569,6,4
570,570,3,3
571,571,7,2
572,572,4,2
573,573,9,3
574,574,513,2
575,575,2,1
576,576,6,3
577,577,6,3
578,578,5,2
579,579,0,0
580,580,1,7
581,581,7,2
582,582,3,2
583,583,1,5
584,584,112,34
585,585,42,2
586,586,21,0
587,587,2,1
588,588,3,0
589,589,6,4
590,590,4,3
591,591,46,6
592,592,9,3
593,593,128,2
594,594,2,3
595,595,2,1
596,596,4,62
597,597,1,2
598,598,4,1
599,599,3,2
600,600,2,3
601,601,1,9
602,602,4,3
603,603,2,1
604,604,8,2
605,605,2,0
606,606,2,2
607,607,15,2
608,608,4,5
609,609,2,2
610,610,16,4
611,611,8,6
612,612,147,5
613,613,6,12
614,614,3,5
615,615,1,1
616,616,8,1
617,617,2,1
618,618,2,1
619,619,5,2
620,620,2,6
621,621,7,1
622,622,4,0
623,623,0,2
624,624,3,3
625,625,2,2
626,626,93,3
627,627,1,0
628,628,5,1
629,629,5,3
630,630,10,4
631,631,2,6
632,632,3,1
633,633,3,0
634,634,4,3
635,635,6,2
636,636,5,7
637,637,8,5
638,638,4,4
639,639,3,6
640,640,0,20
641,641,1,2
642,642,18,4
643,643,8,0
644,644,4,6
645,645,2,9
646,646,2,9
647,647,4,6
648,648,8,10
649,649,1,1
650,650,4,3
651,651,6,5
652,652,4,3
653,653,6,3
654,654,5,1
655,655,9,3
656,656,0,3
657,657,2,4
658,658,5,2
659,659,1,3
660,660,11,0
661,661,1,3
662,662,2,1
663,663,4,20
664,664,1,7
665,665,6,19
666,666,4,1
667,667,7,3
668,668,5,1
669,669,2,1
670,670,22,1
671,671,3,5
672,672,3,1
673,673,6,2
674,674,3,5
675,675,2,2
676,676,15,7
677,677,11,1
678,678,26,0
679,679,3,0
680,680,4,0
681,681,3,0
682,682,99,0
683,683,3,182
684,684,4,4
685,685,5,5
686,686,1,3
687,687,3,2
688,688,5,16
689,689,4,0
690,690,15,2
691,691,17,7
692,692,4,5
693,693,2,5
694,694,8,3
695,695,9,1
696,696,2,4
697,697,6,4
698,698,2,1
699,699,3,10
700,700,6,4
701,701,1,2
702,702,2,3
703,703,0,13
704,704,0,6
705,705,3,1
706,706,12,1
707,707,2,0
708,708,1,2
709,709,16,2
710,710,7,8
711,711,8,3
712,712,22,4
713,713,5,7
714,714,8,6
715,715,5,4
716,716,24,8
717,717,37,6
718,718,3,3
719,719,6,1
720,720,4,7
721,721,6,7
722,722,1,6
723,723,5,5
724,724,5,3
725,725,21,3
726,726,1,3
727,727,3,7
728,728,11,1
729,729,1,2
730,730,10,1
731,731,3,5
732,732,17,2
733,733,11,22
734,734,5,5
735,735,16,0
736,736,4,29
737,737,2,1
738,738,3,3
739,739,3,2
740,740,4,5
741,741,16,1
742,742,1,1
743,743,39,2
744,744,1,3
745,745,3,3
746,746,15,1
747,747,96,4
748,748,3,3
749,749,3,4
750,750,26,2
751,751,8,4
752,752,4,3
753,753,32,3
754,754,1,2
755,755,1,3
756,756,21,10
757,757,5,2
758,758,4,5
759,759,22,1
760,760,3,4
761,761,34,2
762,762,1,4
763,763,2,1
764,764,36,3
765,765,5,4
766,766,3,2
767,767,71,18
768,768,3,4
769,769,25,3
770,770,4,2
771,771,3,4
772,772,6,11
773,773,19,3
774,774,57,0
775,775,6,6
776,776,2,1
777,777,13,13
778,778,29,0
779,779,6,2
780,780,7,0
781,781,14,7
782,782,3,0
783,783,7,0
784,784,3,1
785,785,1,5
786,786,4,12
787,787,1,2
788,788,3,4
789,789,3,2
790,790,1,2
791,791,8,3
792,792,7,4
793,793,9,5
794,794,5,3
795,795,1,2
796,796,4,439
797,797,4,7
798,798,2,7
799,799,6,6
800,800,9,4
801,801,4,1
802,802,3,0
803,803,19,1
804,804,7,3
805,805,1,9
806,806,15,2
807,807,6,3
808,808,4,3
809,809,5,7
810,810,1,2
811,811,5,64
812,812,6,1
813,813,5,0
814,814,2,2
815,815,4,1
816,816,4,1
817,817,24,2
818,818,15,4
819,819,4,12
820,820,0,17
821,821,4,3
822,822,4,3
823,823,4,6
824,824,4,0
825,825,1,6
826,826,5,3
827,827,10,2
828,828,14,3
829,829,4,6
830,830,3,2
831,831,3,0
832,832,20,0
833,833,15,2
834,834,3,7
835,835,6,1
836,836,2,5
837,837,2,1
838,838,6,3
839,839,3,6
840,840,4,3
841,841,3,1
842,842,1,3
843,843,4,2
844,844,5,2
845,845,4,3
846,846,0,3
847,847,2,4
848,848,5,6
849,849,0,9
850,850,4,0
851,851,23,6
852,852,12,1
853,853,7,2
854,854,2,55
855,855,6,1
856,856,4,3
857,857,1,3
858,858,2,1
859,859,4,68
860,860,4,0
861,861,1,4
862,862,3,2
863,863,4,1
864,864,12,2
865,865,7,5
866,866,2,1687
867,867,24,2
868,868,5,6
869,869,0,5
870,870,6,0
871,871,2,4
872,872,4,24
873,873,3,5
874,874,5,13
875,875,3,5
876,876,5,3
877,877,4,4
878,878,5,5
879,879,5,40
880,880,5,5
881,881,2,1
882,882,3,0
883,883,3,2
884,884,6,1
885,885,2,19
886,886,3,3
887,887,5,3
888,888,1,1
889,889,4,8
890,890,2,7
891,891,2,2
892,892,2,2
893,893,4,0
894,894,6,4
895,895,3,5
896,896,4,0
897,897,21,16
898,898,2,3
899,899,2,13
900,900,4,4
901,901,21,5
902,902,4,3
903,903,6,61
904,904,243,4
905,905,7,1
906,906,2,8
907,907,2,6
908,908,2,20
909,909,10,10
910,910,4,33
911,911,8,41
912,912,27,2
913,913,14,5
914,914,21,0
915,915,3,9
916,916,2,0
917,917,3,5
918,918,0,6
919,919,13,3
920,920,6,1
921,921,2,3
922,922,45,3
923,923,3,0
924,924,5,8
925,925,11,1
926,926,5,24
927,927,2,4
928,928,6,2
929,929,7,3
930,930,3,2
931,931,9,6
932,932,5,2
933,933,4,0
934,934,2,1
935,935,5,0
936,936,7,1
937,937,19,5
938,938,6,13
939,939,19,7
940,940,2,12
941,941,2,3
942,942,7,2
943,943,14,2
944,944,0,1
945,945,5,1
946,946,1,0
947,947,21,3
948,948,11,1
949,949,3,3
950,950,6,2
951,951,5,5
952,952,5,3
953,953,12,2
954,954,89,2
955,955,4,1
956,956,5,11
957,957,17,4
958,958,2,1
959,959,4,5
960,960,2,3
961,961,6,0
962,962,1,3
963,963,2,8
964,964,6,6
965,965,6,3
966,966,41,2
967,967,108,1
968,968,2,2
969,969,1,13
970,970,7,1
971,971,5,3
972,972,1,1
973,973,34,3
974,974,6,6
975,975,5,0
976,976,4,4
977,977,1,5
978,978,5,0
979,979,8,2
980,980,3,23
981,981,4,1
982,982,2,7
983,983,6,4
984,984,2,1
985,985,1,1
986,986,2,3
987,987,4,5
988,988,5,7
989,989,2,3
990,990,10,2
991,991,26,14
992,992,1,1
993,993,115,27
994,994,3,8
995,995,5,11
996,996,2,0
997,997,5,1
998,998,12,2
999,999,8,11
