time,value
0,-0.59418
1,-0.49863
2,-0.59418
3,-0.49863
4,-0.59418
5,-0.49863
6,-0.59418
7,-0.49863
8,-0.59418
9,-0.49863
10,-0.59418
11,-0.49863
12,-0.59418
13,-0.49863
14,-0.59418
15,-0.49863
16,-0.59418
17,-0.49863
18,-0.59418
19,-0.49863
20,-0.59418
21,-0.49863
22,-0.59418
23,-0.49863
24,-0.59418
25,-0.49863
26,-0.59418
27,-0.49863
28,-0.59418
29,-0.49863
30,-0.59418
31,-0.49863
32,-0.59418
33,-0.49863
34,-0.59418
35,-0.49863
36,-0.59418
37,-0.49863
38,-0.59418
39,-0.49863
40,-0.59418
41,-0.49863
42,-0.59418
43,-0.30754000000000004
44,1.7945
45,1.89
46,2.4633
47,2.8455
48,1.7945
49,1.3167
50,1.2212
51,1.1256
52,1.5078
53,1.6034
54,1.5078
55,1.7945
56,2.4633
57,2.2722
58,1.6034
59,1.7945
60,1.4123
61,1.89
62,1.7945
63,1.7945
64,1.89
65,1.5078
66,-0.30754000000000004
67,-0.49863
68,-0.49863
69,-0.49863
70,-0.59418
71,-0.49863
72,-0.49863
73,-0.49863
74,-0.59418
75,-0.49863
76,-0.49863
77,-0.49863
78,-0.59418
79,-0.49863
80,-0.49863
81,-0.49863
82,-0.59418
83,-0.49863
84,-0.49863
85,-0.49863
86,-0.59418
87,-0.49863
88,-0.49863
89,-0.49863
90,-0.59418
91,-0.49863
92,-0.49863
93,-0.49863
94,-0.59418
95,-0.49863
