time,value
0,1.1726
1,0.83178
2,0.84501
3,1.1526
4,1.1773
5,1.1561
6,1.1255
7,1.1664
8,1.2771
9,1.3271
10,1.2624
11,1.1949
12,1.115
13,1.0515
14,0.9660200000000001
15,0.9733299999999999
16,0.9481700000000001
17,0.71878
18,0.70605
19,0.50465
20,0.54464
21,0.55829
22,0.24309
23,0.31629
24,-0.19897
25,-0.31699
26,-0.50765
27,-0.23009000000000002
28,-0.11967
29,0.0039637
30,0.19063
31,-0.40291
32,-0.74502
33,-0.8881
34,-0.8852700000000001
35,-0.8280799999999999
36,-1.0949
37,-1.0352
38,-0.8754700000000001
39,-1.0952
40,-1.1785
41,-1.1333
42,-1.2027
43,-1.5831
44,-1.499
45,-1.3616
46,-1.6205
47,-1.521
48,-1.4529
49,-1.1062
50,-0.88805
51,-0.73505
52,-0.68939
53,-0.52617
54,-0.64023
55,-0.21133000000000002
56,-0.1287
57,-0.016627
58,0.30735
59,0.019625999999999998
60,-0.14794000000000002
61,-0.13043
62,0.01119
63,0.12014000000000001
64,0.30466
65,-0.032698000000000005
66,0.050709
67,-0.042194999999999996
68,-0.051151999999999996
69,0.036101999999999995
70,0.10042999999999999
71,-0.13902
72,-0.20444
73,0.18900999999999998
74,-0.24151
75,-0.29803
76,-0.31905
77,-0.20427
78,0.34769
79,0.3756
80,0.37823
81,0.25615
82,0.055144000000000006
83,0.23313000000000003
84,0.26685
85,-0.25206999999999996
86,-2.2678
87,-2.4937
88,-1.1136
89,-0.65717
90,-0.54094
91,-0.51289
92,0.52641
93,0.5444100000000001
94,0.6019
95,0.75643
96,1.0042
97,1.0127
98,0.64302
99,0.17726
100,-4.0711
101,-1.3786
102,-0.9164
103,-0.42715
104,0.31671
105,0.19142
106,1.0708
107,0.81657
108,1.271
109,1.1499
110,1.0574
111,-0.25465
112,-3.6652
113,-2.6239
114,-1.1972
115,-1.0771
116,-0.0658
117,0.2443
118,1.1412
119,1.3369
120,1.311
121,1.2593
122,1.0632
123,0.52391
124,-4.8871
125,-0.22962
126,-0.66437
127,-0.9398299999999999
128,0.84005
129,1.0423
130,1.2635
131,1.7004
132,1.4812
133,1.2418
134,1.5031
135,0.9050299999999999
136,0.047788
137,0.082474
138,-1.4389
139,0.82678
140,-1.2606
141,-0.76842
142,0.5582699999999999
143,1.4051
144,1.4331
145,1.2329999999999999
146,0.97367
147,0.91075
148,0.52668
149,-0.20874
150,-0.5310199999999999
151,-0.82885
152,-1.2343
153,-1.4896
154,-2.2938
155,-2.1961
156,-1.7748
157,-1.9909
158,-2.2137
159,-2.1902
160,-1.8006
161,-1.9634
162,-2.3924
163,-2.2039
164,-1.9336
165,-1.7954
166,-1.689
167,-1.4512
168,-1.5253
169,-1.4669
170,-1.4373
171,-1.4191
172,-1.7944
173,-1.7619
174,-1.5203
175,-1.4167
176,-1.0435
177,-0.72416
178,-0.20665
179,0.33011999999999997
180,0.40700000000000003
181,-0.10314000000000001
182,-0.74967
183,-1.0859999999999999
184,-0.74531
185,-0.06665599999999999
186,0.4917
187,0.26276
188,-0.2996
189,-0.5481
190,-0.52067
191,-0.3828
192,-0.096834
193,0.18097
194,0.1475
195,0.090986
196,-0.15054
197,-0.71397
198,-1.3278
199,-0.53561
200,-0.43631000000000003
201,0.080551
202,0.39171999999999996
203,0.44097
204,0.29072
205,0.1547
206,0.07021000000000001
207,0.026032999999999997
208,0.11327000000000001
209,0.10595
210,0.55957
211,0.84785
212,0.67184
213,0.62971
214,0.53463
215,0.45303000000000004
216,0.60735
217,0.59116
218,0.55804
219,0.57247
220,0.70257
221,0.75263
222,0.62168
223,0.53332
224,0.43817
225,0.34359
226,0.24181999999999998
227,0.31717
228,0.25793
229,0.3481
230,0.25461
231,0.25148000000000004
232,0.34376999999999996
233,0.4646
234,0.46348
235,0.46925
236,0.44666999999999996
237,0.60615
238,0.60217
239,0.40857
240,0.37372
241,0.40257
242,0.23731
243,0.23535
244,0.31368
245,0.50149
246,0.5152399999999999
247,0.6301800000000001
248,0.63373
249,0.43383999999999995
250,0.50468
251,0.4985
252,0.64099
253,0.64102
254,0.6301800000000001
255,0.688
256,0.6338199999999999
257,0.6554399999999999
258,0.64563
259,0.79055
260,0.70376
261,0.65479
262,0.64294
263,0.49763
264,0.64463
265,0.62644
266,0.60839
267,0.62066
268,0.62816
269,0.6292399999999999
270,0.62783
271,0.8004600000000001
272,0.47825
273,0.63794
274,0.6468
275,0.64527
276,0.60746
277,0.63774
278,0.6302
279,0.6409999999999999
280,0.6510199999999999
281,0.62374
282,0.6197699999999999
283,0.8224600000000001
284,0.6421100000000001
285,0.62431
286,0.61645
287,0.61974
288,0.82247
289,0.79713
290,0.7934899999999999
291,0.7793
292,0.59867
293,0.60553
294,0.61252
295,0.6128600000000001
296,0.60573
297,0.5988399999999999
298,0.58968
299,0.58762
