time,value
0,1.7019
1,1.6902
2,1.6715
3,1.6066
4,1.5537
5,1.4697
6,1.3742
7,1.2784
8,1.1839
9,1.0903
10,0.9937799999999999
11,0.9161600000000001
12,0.8312700000000001
13,0.7359100000000001
14,0.6504
15,0.55802
16,0.46597
17,0.38545999999999997
18,0.29213
19,0.19945
20,0.11200999999999998
21,0.025171000000000002
22,-0.064832
23,-0.15232
24,-0.23783
25,-0.32179
26,-0.39996
27,-0.48508999999999997
28,-0.56855
29,-0.63722
30,-0.7138800000000001
31,-0.78584
32,-0.84819
33,-0.91484
34,-0.9785
35,-1.0412
36,-1.1064
37,-1.1591
38,-1.2137
39,-1.239
40,-1.2738
41,-1.2983
42,-1.3323
43,-1.3485
44,-1.3553
45,-1.3503
46,-1.3327
47,-1.3237
48,-1.2953
49,-1.2674
50,-1.2315
51,-1.1863
52,-1.1340000000000001
53,-1.0751
54,-1.0246
55,-0.9633200000000001
56,-0.90165
57,-0.82949
58,-0.7552
59,-0.68626
60,-0.59916
61,-0.5312100000000001
62,-0.44609
63,-0.36494
64,-0.27739
65,-0.19233
66,-0.1041
67,-0.026775999999999998
68,0.064172
69,0.14987999999999999
70,0.23976
71,0.32957
72,0.41765
73,0.5023
74,0.5928399999999999
75,0.68524
76,0.77793
77,0.86492
78,0.95952
79,1.0442
80,1.1414
81,1.2209999999999999
82,1.3164
83,1.3941
84,1.4812
85,1.5544
86,1.6183
87,1.6278
88,1.6428
89,1.6284
90,1.6043
91,1.5719999999999998
92,1.4982
93,1.4115
94,1.3621
95,1.2672
96,1.171
97,1.0836
98,1.006
99,0.92038
100,0.82437
101,0.7309100000000001
102,0.63681
103,0.55179
104,0.45965
105,0.37073
106,0.27865
107,0.18908
108,0.10007
109,0.0090291
110,-0.077203
111,-0.16399999999999998
112,-0.2506
113,-0.33686
114,-0.41122
115,-0.4965
116,-0.57467
117,-0.65574
118,-0.72693
119,-0.79778
120,-0.87708
121,-0.92724
122,-0.9940399999999999
123,-1.0555
124,-1.1172
125,-1.171
126,-1.2186
127,-1.2516
128,-1.294
129,-1.3294
130,-1.3565
131,-1.3651
132,-1.3732
133,-1.3727
134,-1.3535
135,-1.3342
136,-1.3149
137,-1.2878
138,-1.2595
139,-1.2044
140,-1.1578
141,-1.0927
142,-1.0339
143,-0.9679
144,-0.8991600000000001
145,-0.83265
146,-0.75702
147,-0.68387
148,-0.60631
149,-0.52018
150,-0.43991
151,-0.35736
152,-0.2796
153,-0.18929
154,-0.10618
155,-0.023672
156,0.062183
157,0.14947
158,0.23843000000000003
159,0.32309
160,0.41253999999999996
161,0.5053
162,0.5886600000000001
163,0.68362
164,0.77549
165,0.872
166,0.9665799999999999
167,1.052
168,1.1384
169,1.235
170,1.3302
171,1.4175
172,1.5127
173,1.5796
174,1.6585
175,1.6831
