time,value
0,-0.75874
1,0.71648
2,1.8229
3,-0.75874
4,-0.75874
5,-0.75874
6,-0.20553000000000002
7,1.8229
8,0.16327
9,-0.75874
10,-0.75874
11,-0.75874
12,1.6385
13,0.90089
14,-0.75874
15,-0.75874
16,-0.75874
17,0.53208
18,1.8229
19,-0.75874
20,-0.75874
21,-0.75874
22,-0.75874
23,1.8229
24,0.53208
25,-0.75874
26,-0.75874
27,-0.75874
28,0.53208
29,1.8229
30,-0.75874
31,-0.75874
32,-0.75874
33,-0.75874
34,1.6385
35,1.0853
36,-0.75874
37,-0.75874
38,-0.75874
39,1.2697
40,1.2697
41,-0.75874
42,-0.75874
43,-0.75874
44,0.16327
45,1.8229
46,-0.20553000000000002
47,-0.75874
48,-0.75874
49,-0.75874
50,1.4541
51,0.90089
52,-0.75874
53,-0.75874
54,-0.75874
55,0.16327
56,1.8229
57,-0.20553000000000002
58,-0.75874
59,-0.75874
60,-0.75874
61,1.2697
62,1.0853
63,-0.75874
64,-0.75874
65,-0.75874
66,-0.20553000000000002
67,1.8229
68,0.16327
69,-0.75874
70,-0.75874
71,-0.75874
72,0.53208
73,1.8229
74,-0.20553000000000002
75,-0.75874
76,-0.75874
77,2.0073
78,0.53208
79,-0.75874
80,-0.75874
81,-0.75874
82,1.2697
83,1.2697
84,-0.75874
85,-0.75874
86,-0.75874
87,0.90089
88,1.8229
89,-0.75874
90,-0.75874
91,-0.75874
92,-0.02113
93,2.0073
94,-0.20553000000000002
95,-0.75874
