{
  "about": {
    "datasetID": "59_LP_karate_dataset",
    "datasetName": "karate network",
    "description": "These are data collected from the members of a university karate club by Wayne Zachary.",
    "citation": " @ARTICLE{fission_groups,   author = {{Zachary W}},    title = {{An information flow model for conflict and fission in small groups}},  journal = {Journal of Anthropological Research},volume= {33},pages={452-473},} ",
    "license": " CC Attribution-NonCommercial-ShareAlike 2.5 License ",
    "source": "UCINET IV DATASETS",
    "sourceURI": "http://vlado.fmf.uni-lj.si/pub/networks/data/ucinet/ucidata.htm",
    "datasetSchemaVersion": "4.0.0",
    "redacted": false,
    "datasetVersion": "4.0.0",
    "digest": "d89896b60d8fb948f7f16f2124c8999efba8836744ea9418a5f644a72fa11869"
  },
  "dataResources": [
    {
      "resID": "0",
      "resPath": "graphs/G.gml",
      "resType": "graph",
      "resFormat": {
        "text/vnd.gml": [
          "gml"
        ]
      },
      "isCollection": false
    },
    {
      "resID": "learningData",
      "resPath": "tables/learningData.csv",
      "resType": "table",
      "resFormat": {
        "text/csv": [
          "csv"
        ]
      },
      "isCollection": false,
      "columns": [
        {
          "colIndex": 0,
          "colName": "d3mIndex",
          "colType": "integer",
          "role": [
            "index"
          ]
        },
        {
          "colIndex": 1,
          "colName": "sourceNode",
          "colType": "integer",
          "role": [
            "attribute"
          ],
          "refersTo": {
            "resID": "0",
            "resObject": {
              "nodeAttribute": "nodeID"
            }
          }
        },
        {
          "colIndex": 2,
          "colName": "targetNode",
          "colType": "integer",
          "role": [
            "attribute"
          ],
          "refersTo": {
            "resID": "0",
            "resObject": {
              "nodeAttribute": "nodeID"
            }
          }
        },
        {
          "colIndex": 3,
          "colName": "linkExists",
          "colType": "categorical",
          "role": [
            "suggestedTarget"
          ]
        }
      ],
      "columnsCount": 4
    }
  ]
}