time,value
0,0.585
1,0.50254
2,0.45818000000000003
3,0.80967
4,0.6530100000000001
5,0.65274
6,0.4991
7,0.49687
8,0.62792
9,0.6268
10,0.49551000000000006
11,0.32439
12,0.43799
13,0.42778
14,0.52266
15,0.55757
16,0.57868
17,0.6016600000000001
18,0.61565
19,0.54815
20,0.65337
21,0.6863199999999999
22,0.71225
23,0.71623
24,0.6593899999999999
25,0.6627
26,0.6521399999999999
27,0.6729
28,0.67945
29,0.6755899999999999
30,0.3718
31,-0.078279
32,-0.83431
33,-1.3245
34,-2.3661
35,-2.5664
36,-2.8859
37,-3.4803
38,-3.5804
39,-3.6218
40,-3.3736
41,-3.1477
42,-2.6453
43,-2.7831
44,-2.5578
45,-1.5811
46,-1.2229999999999999
47,-1.3691
48,-0.8854799999999999
49,-0.74795
50,-0.39102
51,0.33354
52,0.30783
53,-0.98082
54,0.17815
55,-0.5253
56,-0.58524
57,-0.23600000000000002
58,-0.91695
59,-1.2353
60,-0.59916
61,-0.27455
62,-0.57625
63,-0.22971999999999998
64,-0.3132
65,-0.5233899999999999
66,-0.4964
67,-0.68738
68,-0.8072199999999999
69,-0.96083
70,-0.59895
71,-0.70552
72,-0.94157
73,-0.9005799999999999
74,-0.74502
75,-0.91035
76,-1.0213
77,-0.7399100000000001
78,-0.8458600000000001
79,-0.9167700000000001
80,-0.8109
81,-0.8209700000000001
82,-0.80418
83,-0.82396
84,-0.7822100000000001
85,-0.74574
86,-0.82235
87,-0.80273
88,-0.8153100000000001
89,-0.6407
90,-0.6906800000000001
91,-0.7296
92,-0.71091
93,-0.59272
94,-0.60409
95,-0.77595
96,-0.78359
97,-0.5011899999999999
98,-0.64856
99,-1.0959999999999999
100,-0.9540299999999999
101,-0.8469399999999999
102,-0.5976199999999999
103,-0.67015
104,-0.75978
105,-0.6241899999999999
106,-0.69084
107,-0.49651999999999996
108,0.05789299999999999
109,-0.037511
110,-0.12249000000000002
111,0.0080183
112,-0.32626
113,-1.0668
114,-0.7700100000000001
115,-0.75139
116,-1.3701
117,-2.4347
118,-2.4727
119,-3.102
120,-3.3173
121,-3.6996
122,-3.6864
123,-2.9346
124,-2.2876
125,-1.6681
126,-1.1019
127,-0.45698999999999995
128,0.20455
129,-0.80456
130,-1.6059
131,-1.3365
132,-0.29536999999999997
133,0.46493
134,0.58152
135,0.41786999999999996
136,0.42116000000000003
137,0.28846
138,0.36946999999999997
139,0.40764
140,0.42977
141,0.46621
142,0.4874
143,0.47898999999999997
144,0.4977
145,0.38588
146,0.24924000000000002
147,0.22364
148,0.24936999999999998
149,0.31001
150,0.32573
151,0.39007
152,0.30454000000000003
153,0.32866
154,0.38966
155,0.44916000000000006
156,0.49141
157,0.6360600000000001
158,0.7045399999999999
159,0.5884
160,0.46203999999999995
161,0.31833
162,0.46574
163,0.44111000000000006
164,0.41481
165,0.38359
166,0.30577
167,0.29434
168,0.33791
169,0.32886
170,0.43901999999999997
171,0.36332
172,0.36991999999999997
173,0.46976
174,0.45937
175,0.44616000000000006
176,0.54269
177,0.53805
178,0.52232
179,0.5040600000000001
180,0.45888999999999996
181,0.57992
182,0.5908800000000001
183,0.68855
184,0.73023
185,0.6312
186,0.64666
187,0.62248
188,0.57514
189,0.5915199999999999
190,0.54938
191,0.5212899999999999
192,0.5256
193,0.67279
194,0.70043
195,0.68818
196,0.7048
197,0.81394
198,0.5635899999999999
199,0.47694
200,0.59297
201,0.6842600000000001
202,0.6656
203,0.57876
204,0.59554
205,0.56248
206,0.62046
207,0.52712
208,0.73416
209,0.8085100000000001
210,0.6623
211,0.6874399999999999
212,0.76963
213,0.7348
214,0.57167
215,0.49494
216,0.56831
217,0.55819
218,0.5340699999999999
219,0.54218
220,0.5660000000000001
221,0.68709
222,0.65879
223,0.6551100000000001
224,0.83534
225,0.67904
226,0.69595
227,0.5454899999999999
228,0.57818
229,0.58328
230,0.5775600000000001
231,0.57753
232,0.73602
233,0.61561
234,0.73541
235,0.61452
236,0.59329
237,0.71532
238,0.55586
239,0.55197
240,0.5231600000000001
241,0.54701
242,0.50922
243,0.5765899999999999
244,0.5776399999999999
245,0.57116
246,0.5825
247,0.73519
248,0.73812
249,0.7337
250,0.73949
251,0.73549
252,0.61519
253,0.5827899999999999
254,0.5736600000000001
255,0.56968
256,0.78432
257,0.75607
258,0.7479600000000001
259,0.58094
260,0.6422100000000001
261,0.65037
262,0.80898
263,0.74797
264,0.5847399999999999
265,0.5693699999999999
266,0.6463300000000001
267,0.6383800000000001
268,0.57072
269,0.73441
270,0.653
271,0.57413
272,0.57927
273,0.57828
274,0.67848
275,0.81897
276,0.74238
277,0.9146700000000001
278,0.7352
279,0.72029
280,0.5653
281,0.56552
282,0.61045
283,0.7209399999999999
284,0.6835
285,0.60611
286,0.76346
287,0.72655
288,0.722
289,0.71287
290,0.6989
291,0.69677
292,0.67909
293,0.55047
294,0.7048300000000001
295,0.5563600000000001
296,0.5504899999999999
297,0.7017399999999999
298,0.54271
299,0.70001
