time,value
0,-1.0287
1,-1.0287
2,-1.0287
3,-1.0287
4,-1.0287
5,-1.0287
6,-1.0287
7,-1.0287
8,-1.0287
9,-1.0287
10,0.61241
11,1.3847
12,1.1916
13,1.0951
14,1.0951
15,0.90202
16,0.99856
17,0.90202
18,0.90202
19,0.61241
20,-1.0287
21,-1.0287
22,-1.0287
23,-1.0287
24,-1.0287
25,-1.0287
26,-1.0287
27,-1.0287
28,-1.0287
29,0.41934
30,1.3847
31,1.2882
32,0.99856
33,0.99856
34,0.99856
35,0.90202
36,0.90202
37,0.90202
38,0.90202
39,0.90202
40,0.90202
41,0.90202
42,0.61241
43,-1.0287
44,-1.0287
45,-1.0287
46,-1.0287
47,-1.0287
48,-1.0287
49,-1.0287
50,-1.0287
51,-1.0287
52,0.99856
53,1.2882
54,1.1916
55,1.0951
56,0.90202
57,0.99856
58,0.90202
59,0.90202
60,0.90202
61,0.90202
62,0.90202
63,0.8054899999999999
64,0.90202
65,-0.35297
66,-1.0287
67,-1.0287
68,-1.0287
69,-1.0287
70,-1.0287
71,-1.0287
72,-1.0287
73,-1.0287
74,1.2882
75,1.2882
76,1.0951
77,0.99856
78,0.90202
79,0.90202
80,0.90202
81,0.90202
82,0.90202
83,0.8054899999999999
84,0.90202
85,0.8054899999999999
86,-1.0287
87,-1.0287
88,-1.0287
89,-1.0287
90,-1.0287
91,-1.0287
92,-1.0287
93,-1.0287
94,-1.0287
95,-0.4495
