time,value
0,0.095827
1,0.095827
2,0.095827
3,0.095827
4,0.095827
5,0.095827
6,0.095827
7,0.095827
8,0.095827
9,0.095827
10,0.095827
11,0.58001
12,0.095827
13,0.095827
14,0.095827
15,0.095827
16,0.095827
17,0.095827
18,0.095827
19,0.58001
20,0.095827
21,0.095827
22,0.095827
23,0.095827
24,0.095827
25,0.095827
26,0.095827
27,-0.38835
28,0.095827
29,0.095827
30,0.095827
31,0.095827
32,0.095827
33,0.095827
34,0.095827
35,0.095827
36,0.095827
37,0.095827
38,0.095827
39,0.095827
40,0.095827
41,0.095827
42,0.095827
43,0.095827
44,0.095827
45,0.095827
46,0.095827
47,0.095827
48,0.095827
49,-0.38835
50,0.095827
51,0.095827
52,0.095827
53,0.58001
54,0.095827
55,0.095827
56,0.095827
57,0.095827
58,0.095827
59,0.095827
60,0.095827
61,0.095827
62,-0.38835
63,0.095827
64,0.095827
65,0.095827
66,0.095827
67,0.095827
68,0.095827
69,-0.38835
70,0.095827
71,0.095827
72,0.095827
73,0.095827
74,0.095827
75,0.095827
76,0.58001
77,0.095827
78,0.095827
79,0.095827
80,0.58001
81,0.095827
82,0.095827
83,0.095827
84,0.095827
85,0.095827
86,0.095827
87,0.095827
88,0.095827
89,0.095827
90,0.095827
91,0.095827
92,0.095827
93,0.095827
94,0.095827
95,-9.5878
