time,value
0,1.9686
1,1.9395
2,1.9024
3,1.8657
4,1.8301
5,1.7951
6,1.7605
7,1.7308
8,1.6959
9,1.6602
10,1.6235
11,1.588
12,1.5513
13,1.5148
14,1.4784
15,1.4421
16,1.406
17,1.3688
18,1.3326
19,1.2962
20,1.2596
21,1.2241
22,1.1872
23,1.1521
24,1.1152
25,1.0785
26,1.0439
27,1.0074
28,0.97096
29,0.93565
30,0.89991
31,0.86244
32,0.8265100000000001
33,0.7907
34,0.75502
35,0.71948
36,0.68408
37,0.6463
38,0.61114
39,0.57353
40,0.53864
41,0.5012
42,0.46658999999999995
43,0.42935
44,0.39299
45,0.35802
46,0.32108000000000003
47,0.28425
48,0.24750999999999998
49,0.21088
50,0.17437
51,0.13797
52,0.10495
53,0.068855
54,0.032901
55,-0.006332
56,-0.042049
57,-0.07760800000000001
58,-0.113
59,-0.14822000000000002
60,-0.18325
61,-0.21808000000000002
62,-0.25656
63,-0.29104
64,-0.32529
65,-0.3593
66,-0.39305
67,-0.42227
68,-0.45537
69,-0.48371000000000003
70,-0.5115
71,-0.5340199999999999
72,-0.5556800000000001
73,-0.5727399999999999
74,-0.59108
75,-0.60385
76,-0.61648
77,-0.6328199999999999
78,-0.64415
79,-0.65627
80,-0.6630199999999999
81,-0.6683100000000001
82,-0.67575
83,-0.68094
84,-0.68852
85,-0.6948300000000001
86,-0.7054600000000001
87,-0.7105199999999999
88,-0.71614
89,-0.72133
90,-0.72126
91,-0.72715
92,-0.73185
93,-0.74278
94,-0.75261
95,-0.78965
96,-0.8265100000000001
97,-0.86313
98,-0.89948
99,-0.93555
100,-0.97131
101,-1.0067
102,-1.0444
103,-1.0791
104,-1.1163
105,-1.1503
106,-1.1806
107,-1.2164
108,-1.2497
109,-1.2827
110,-1.3066
111,-1.3291
112,-1.3506
113,-1.3713
114,-1.3943
115,-1.4099
116,-1.4233
117,-1.4345
118,-1.4509999999999998
119,-1.4573
120,-1.4655
121,-1.4698
122,-1.4682
123,-1.464
124,-1.4595
125,-1.4547
126,-1.4428
127,-1.4343
128,-1.4183
129,-1.3997
130,-1.3848
131,-1.3624
132,-1.3427
133,-1.318
134,-1.2921
135,-1.2675
136,-1.2407
137,-1.2121
138,-1.181
139,-1.1525
140,-1.1209
141,-1.0896
142,-1.0577
143,-1.0239
144,-0.98895
145,-0.9535799999999999
146,-0.9178700000000001
147,-0.88184
148,-0.84135
149,-0.80084
150,-0.7603300000000001
151,-0.7198
152,-0.6792699999999999
153,-0.63873
154,-0.59819
155,-0.5576300000000001
156,-0.51707
157,-0.47848
158,-0.43981000000000003
159,-0.40109
160,-0.36412
161,-0.32575
162,-0.30276
163,-0.26966999999999997
164,-0.24455
165,-0.23396999999999998
166,-0.22354000000000002
167,-0.24285
168,-0.26605
169,-0.30132
170,-0.26421999999999995
171,-0.2249
172,-0.18529
173,-0.14567
174,-0.10595999999999998
175,-0.06612799999999999
176,-0.026241000000000004
177,0.013677000000000002
178,0.053622
179,0.093554
180,0.13352999999999998
181,0.17342
182,0.21334
183,0.25328
184,0.29325
185,0.33324000000000004
186,0.37335999999999997
187,0.41345
188,0.45366999999999996
189,0.49391
190,0.53435
191,0.5748800000000001
192,0.6155
193,0.6564800000000001
194,0.69743
195,0.73849
196,0.77985
197,0.8209200000000001
198,0.8627
199,0.9043200000000001
200,0.94595
201,0.98811
202,1.0296
203,1.0711
204,1.1127
205,1.1543
206,1.195
207,1.2358
208,1.2773
209,1.3179
210,1.3575
211,1.3763
212,1.3475
213,1.3115
214,1.2758
215,1.244
216,1.2183
217,1.193
218,1.1682
219,1.1423
220,1.12
221,1.0998
222,1.0659
223,1.0361
224,1.0127
225,0.98474
226,0.95988
227,0.93814
228,0.9169799999999999
229,0.8894
230,0.87851
231,0.87231
232,0.8687600000000001
233,0.87215
234,0.8863
235,0.9025700000000001
236,0.9387200000000001
237,0.96624
238,1.0062
239,1.0522
240,1.0834
241,1.1167
242,1.1463
243,1.1714
244,1.1821
245,1.2079
246,1.2415
247,1.2681
248,1.2925
249,1.3149
250,1.3279
251,1.3397
252,1.3168
253,1.2767
254,1.2345
255,1.1911
256,1.143
257,1.0966
258,1.048
259,0.99955
260,0.9511799999999999
261,0.90043
262,0.8498899999999999
263,0.79957
264,0.74948
265,0.7015399999999999
266,0.6522899999999999
267,0.6048899999999999
268,0.55774
269,0.51075
270,0.46392
271,0.41915
272,0.37478
273,0.33166
274,0.28888
275,0.24613000000000002
276,0.20339000000000002
277,0.16088
278,0.11799000000000001
279,0.074482
280,0.035518
281,-0.0051266
282,-0.044047
283,-0.082928
284,-0.12355999999999999
285,-0.16239
286,-0.20117000000000002
287,-0.23990999999999998
288,-0.27859
289,-0.31722
290,-0.35579
291,-0.38795999999999997
292,-0.41495
293,-0.42539
294,-0.44893
295,-0.46316999999999997
296,-0.45438
297,-0.43768999999999997
298,-0.43396
299,-0.40876999999999997
300,-0.38971
301,-0.36328
302,-0.3363
303,-0.31533
304,-0.2937
305,-0.27146
306,-0.26115
307,-0.26425
308,-0.28193
309,-0.32731
310,-0.36806
311,-0.42096000000000006
312,-0.46508999999999995
313,-0.51513
314,-0.56037
315,-0.60559
316,-0.6615800000000001
317,-0.71137
318,-0.76725
319,-0.8042199999999999
320,-0.8473700000000001
321,-0.89651
322,-0.95188
323,-0.98806
324,-1.0391
325,-1.0896
326,-1.1371
327,-1.1731
328,-1.2058
329,-1.2333
330,-1.2596
331,-1.2885
332,-1.314
333,-1.3422
334,-1.3693
335,-1.3952
336,-1.4197
337,-1.4426
338,-1.4639
339,-1.4832
340,-1.5005
341,-1.5144
342,-1.5207
343,-1.5306
344,-1.5377
345,-1.5419999999999998
346,-1.5357
347,-1.5342
348,-1.5298
349,-1.5227
350,-1.4992
351,-1.4677
352,-1.4327
353,-1.3959
354,-1.3584
355,-1.3199
356,-1.2813
357,-1.2487
358,-1.2318
359,-1.2424
360,-1.2434
361,-1.2649
362,-1.2625
363,-1.2855
364,-1.2954
365,-1.2958
366,-1.2904
367,-1.2827
368,-1.2728
369,-1.2608
370,-1.2468
371,-1.2298
372,-1.208
373,-1.1888
374,-1.1584
375,-1.1272
376,-1.0955
377,-1.0631
378,-1.0303
379,-0.9969299999999999
380,-0.9651700000000001
381,-0.9329299999999999
382,-0.89831
383,-0.8633700000000001
384,-0.8281200000000001
385,-0.79261
386,-0.75685
387,-0.72085
388,-0.68465
389,-0.65135
390,-0.61768
391,-0.58241
392,-0.54655
393,-0.5120100000000001
394,-0.47456000000000004
395,-0.43956000000000006
396,-0.40183
397,-0.364
398,-0.32845
399,-0.29039
400,-0.25225
401,-0.21623
402,-0.18003
403,-0.14159000000000002
404,-0.10512
405,-0.068476
406,-0.029800999999999998
407,0.0070707999999999995
408,0.045870999999999995
409,0.086411
410,0.12918
411,0.16955
412,0.20571
413,0.23929
414,0.27331
415,0.30789
416,0.34436
417,0.38235
418,0.42041000000000006
419,0.45753999999999995
420,0.4956
421,0.53282
422,0.57126
423,0.60977
424,0.64758
425,0.68697
426,0.7256600000000001
427,0.76352
428,0.80235
429,0.84146
430,0.87871
431,0.9169700000000001
432,0.9547899999999999
433,0.99398
434,1.0318
435,1.0709
436,1.1094
437,1.1484
438,1.1875
439,1.2267
440,1.2662
441,1.3057
442,1.3452
443,1.3847
444,1.4244
445,1.4642
446,1.504
447,1.5439
448,1.5838
449,1.6237
450,1.6636
451,1.7035
452,1.7435
453,1.7834
454,1.8233
455,1.8633
456,1.8759
457,1.8672
458,1.9006
459,1.9342
460,1.9557
461,1.9655
462,1.9680000000000002
