time,value
0,0.076801
1,0.9796100000000001
2,-0.82601
3,-0.3746
4,1.2805
5,-0.82601
6,-0.82601
7,1.732
8,-0.82601
9,-0.82601
10,1.732
11,-0.82601
12,-0.82601
13,1.5815
14,-0.82601
15,-0.82601
16,1.431
17,-0.52507
18,-0.82601
19,0.67867
20,0.22726999999999997
21,-0.82601
22,-0.3746
23,1.2805
24,-0.82601
25,-0.82601
26,1.732
27,-0.82601
28,-0.82601
29,0.9796100000000001
30,-0.22413000000000002
31,-0.82601
32,-0.073667
33,0.9796100000000001
34,-0.82601
35,-0.82601
36,1.732
37,-0.82601
38,-0.82601
39,1.732
40,-0.82601
41,-0.82601
42,1.1301
43,-0.3746
44,-0.82601
45,0.82914
46,0.076801
47,-0.82601
48,-0.073667
49,0.9796100000000001
50,-0.82601
51,-0.82601
52,1.732
53,-0.82601
54,-0.22413000000000002
55,1.1301
56,-0.82601
57,0.076801
58,0.67867
59,-0.82601
60,0.076801
61,0.82914
62,-0.82601
63,-0.22413000000000002
64,1.1301
65,-0.82601
66,-0.52507
67,1.431
68,-0.82601
69,-0.82601
70,1.732
71,-0.82601
72,-0.82601
73,1.732
74,-0.82601
75,-0.82601
76,1.732
77,-0.82601
78,-0.3746
79,1.2805
80,-0.82601
81,-0.52507
82,1.5815
83,-0.82601
84,-0.82601
85,1.5815
86,-0.82601
87,-0.82601
88,1.8824
89,-0.82601
90,-0.52507
91,1.5815
92,-0.82601
93,-0.3746
94,1.431
95,-0.82601
