time,value
0,-0.2485
1,-0.43935
2,-0.2485
3,-0.2485
4,-0.2485
5,-0.43935
6,-0.2485
7,-0.2485
8,-0.2485
9,-0.43935
10,-0.2485
11,-0.2485
12,-0.2485
13,-0.43935
14,-0.057651999999999995
15,-0.43935
16,-0.2485
17,-0.2485
18,-0.2485
19,-0.43935
20,-0.2485
21,-0.2485
22,-0.2485
23,-0.43935
24,-0.2485
25,-0.2485
26,-0.2485
27,-0.43935
28,-0.2485
29,-0.2485
30,-0.2485
31,-0.43935
32,-0.2485
33,-0.2485
34,-0.2485
35,-0.43935
36,-0.2485
37,-0.2485
38,-0.2485
39,-0.43935
40,-0.2485
41,-0.2485
42,-0.2485
43,-0.2485
44,-0.43935
45,-0.2485
46,-0.2485
47,-0.2485
48,-0.43935
49,-0.2485
50,-0.2485
51,-0.2485
52,-0.43935
53,-0.2485
54,-0.2485
55,-0.2485
56,-0.43935
57,-0.2485
58,-0.2485
59,-0.2485
60,-0.43935
61,-0.2485
62,-0.2485
63,-0.2485
64,-0.43935
65,-0.2485
66,-0.2485
67,-0.2485
68,-0.43935
69,-0.2485
70,-0.2485
71,-0.2485
72,-0.43935
73,-0.2485
74,-0.2485
75,-0.2485
76,-0.43935
77,-0.2485
78,-0.2485
79,-0.2485
80,-0.43935
81,-0.2485
82,-0.2485
83,2.0417
84,3.5685
85,3.3776
86,3.3776
87,3.3776
88,3.7593
89,3.9502
90,2.4234
91,-0.2485
92,-0.2485
93,-0.43935
94,-0.2485
95,-0.2485
