time,value
0,0.71807
1,0.7700199999999999
2,0.7700199999999999
3,0.7700199999999999
4,0.71807
5,0.7700199999999999
6,0.7700199999999999
7,0.30249000000000004
8,-1.4118
9,-1.4118
10,-1.4118
11,-1.4118
12,-1.4118
13,-1.4118
14,-1.4118
15,-1.4118
16,-1.4118
17,-1.4118
18,-1.4118
19,-1.4118
20,-1.4118
21,-1.4118
22,-1.4118
23,-1.4118
24,-1.4118
25,-1.4118
26,-1.4118
27,-1.4118
28,-1.4118
29,-1.4118
30,-1.4118
31,-1.4118
32,-1.4118
33,-1.4118
34,-1.4118
35,-1.4118
36,-1.4118
37,-1.4118
38,-1.4118
39,-0.32088
40,0.5102800000000001
41,0.56223
42,0.5102800000000001
43,0.56223
44,0.5102800000000001
45,0.5102800000000001
46,0.5102800000000001
47,0.5102800000000001
48,0.56223
49,0.5102800000000001
50,0.5102800000000001
51,0.5102800000000001
52,0.56223
53,0.5102800000000001
54,0.5102800000000001
55,0.56223
56,0.56223
57,0.5102800000000001
58,0.5102800000000001
59,0.5102800000000001
60,0.5102800000000001
61,0.56223
62,0.5102800000000001
63,0.5102800000000001
64,0.56223
65,0.5102800000000001
66,0.5102800000000001
67,0.56223
68,0.5102800000000001
69,0.5102800000000001
70,0.5102800000000001
71,0.61417
72,1.0817
73,1.2895
74,1.2375
75,1.2375
76,1.0817
77,1.0298
78,0.9778100000000001
79,0.82196
80,0.7700199999999999
81,0.82196
82,0.7700199999999999
83,0.82196
84,0.82196
85,0.82196
86,0.7700199999999999
87,0.82196
88,0.7700199999999999
89,0.82196
90,0.82196
91,0.82196
92,0.7700199999999999
93,0.82196
94,0.82196
95,0.7700199999999999
