time,value
0,1.659
1,1.6495
2,1.6028
3,1.5158
4,1.4136
5,1.3224
6,1.2207
7,1.1215
8,1.0278
9,0.96014
10,0.91595
11,0.8835299999999999
12,0.8295799999999999
13,0.7759
14,0.6986399999999999
15,0.62744
16,0.5483899999999999
17,0.47134
18,0.39325
19,0.30793000000000004
20,0.22869
21,0.1524
22,0.06712699999999999
23,-0.016944999999999998
24,-0.099497
25,-0.18617999999999998
26,-0.27148
27,-0.35522
28,-0.43722
29,-0.51726
30,-0.59509
31,-0.67776
32,-0.75061
33,-0.82821
34,-0.90169
35,-0.9679
36,-1.0354
37,-1.0993
38,-1.1647
39,-1.2204
40,-1.2722
41,-1.3143
42,-1.3575
43,-1.3923
44,-1.4076
45,-1.4236
46,-1.4295
47,-1.4252
48,-1.4009
49,-1.3771
50,-1.3442
51,-1.3093
52,-1.2613
53,-1.2136
54,-1.1542
55,-1.0962
56,-1.0269
57,-0.9532700000000001
58,-0.88531
59,-0.80553
60,-0.73606
61,-0.6518
62,-0.5654899999999999
63,-0.4774
64,-0.38776
65,-0.29674
66,-0.20452
67,-0.10843
68,-0.022878
69,0.072129
70,0.16818
71,0.26434
72,0.35281999999999997
73,0.45001
74,0.54772
75,0.64591
76,0.7460899999999999
77,0.845
78,0.94429
79,1.0452
80,1.1462
81,1.2474
82,1.3487
83,1.4512
84,1.5521
85,1.6405
86,1.7371
87,1.791
88,1.7859
89,1.7751
90,1.7057
91,1.6159
92,1.5148
93,1.4126
94,1.3105
95,1.2092
96,1.1073
97,1.0168
98,0.91617
99,0.81566
100,0.71665
101,0.6168399999999999
102,0.51884
103,0.42151000000000005
104,0.3231
105,0.22518000000000002
106,0.12989
107,0.033319999999999995
108,-0.052083000000000004
109,-0.14697000000000002
110,-0.23808
111,-0.33081
112,-0.41898
113,-0.5089199999999999
114,-0.58753
115,-0.66999
116,-0.74987
117,-0.8270200000000001
118,-0.9061799999999999
119,-0.9763200000000001
120,-1.0419
121,-1.1024
122,-1.1569
123,-1.2128
124,-1.2482
125,-1.2898
126,-1.3142
127,-1.3291
128,-1.3463
129,-1.3530000000000002
130,-1.351
131,-1.34
132,-1.3224
133,-1.2943
134,-1.2576
135,-1.2234
136,-1.1721
137,-1.1286
138,-1.071
139,-1.0134
140,-0.95109
141,-0.88326
142,-0.81435
143,-0.74765
144,-0.6715300000000001
145,-0.60031
146,-0.5262899999999999
147,-0.44977
148,-0.37101
149,-0.29027
150,-0.21391999999999997
151,-0.1355
152,-0.055211
153,0.026771
154,0.10667
155,0.19018
156,0.26491
157,0.34538
158,0.42875
159,0.50675
160,0.5867600000000001
161,0.66505
162,0.73221
163,0.80682
164,0.8687799999999999
165,0.92019
166,0.9540000000000001
167,0.99703
168,1.0762
169,1.1709
170,1.2592
171,1.361
172,1.4518
173,1.5525
174,1.6255
175,1.6597
