time,value
0,-2.1912
1,-2.1912
2,-2.1912
3,-2.1912
4,-2.1912
5,-2.1912
6,-1.1518
7,1.187
8,1.057
9,0.79718
10,0.53732
11,0.66725
12,0.53732
13,0.53732
14,0.40739000000000003
15,0.53732
16,0.53732
17,0.40739000000000003
18,0.53732
19,0.40739000000000003
20,0.53732
21,0.40739000000000003
22,0.40739000000000003
23,0.53732
24,0.40739000000000003
25,0.40739000000000003
26,0.40739000000000003
27,0.53732
28,0.40739000000000003
29,0.40739000000000003
30,0.40739000000000003
31,0.40739000000000003
32,0.40739000000000003
33,0.40739000000000003
34,0.40739000000000003
35,0.40739000000000003
36,0.27746
37,0.40739000000000003
38,0.40739000000000003
39,0.40739000000000003
40,0.40739000000000003
41,0.40739000000000003
42,0.27746
43,0.40739000000000003
44,0.40739000000000003
45,0.27746
46,0.40739000000000003
47,0.40739000000000003
48,0.40739000000000003
49,0.27746
50,0.40739000000000003
51,0.40739000000000003
52,0.40739000000000003
53,0.27746
54,0.40739000000000003
55,0.40739000000000003
56,0.40739000000000003
57,0.27746
58,0.40739000000000003
59,0.40739000000000003
60,0.40739000000000003
61,0.40739000000000003
62,0.27746
63,0.40739000000000003
64,0.27746
65,0.40739000000000003
66,0.27746
67,-1.6715
68,-2.1912
69,-2.1912
70,-2.1912
71,-2.1912
72,-2.1912
73,-2.1912
74,-2.1912
75,-2.1912
76,-2.1912
77,-0.24226999999999999
78,1.187
79,0.79718
80,0.66725
81,0.53732
82,0.53732
83,0.40739000000000003
84,0.40739000000000003
85,0.53732
86,0.40739000000000003
87,0.40739000000000003
88,0.40739000000000003
89,0.53732
90,0.40739000000000003
91,0.40739000000000003
92,0.40739000000000003
93,0.53732
94,0.40739000000000003
95,0.40739000000000003
