time,value
0,2.0580000000000003
1,2.0339
2,2.0032
3,1.9621
4,1.9212
5,1.8803
6,1.8396
7,1.7988
8,1.7582
9,1.7174
10,1.6767
11,1.6358
12,1.5947
13,1.5537
14,1.5127
15,1.4716
16,1.4307
17,1.3899
18,1.3491
19,1.3085
20,1.2679
21,1.2274
22,1.1869
23,1.1465
24,1.1061
25,1.0658
26,1.0255
27,0.9855799999999999
28,0.94632
29,0.90748
30,0.86826
31,0.8291299999999999
32,0.78951
33,0.75056
34,0.71106
35,0.67166
36,0.63235
37,0.59255
38,0.5531699999999999
39,0.51312
40,0.47328000000000003
41,0.43323
42,0.39387
43,0.35420999999999997
44,0.31563
45,0.27664
46,0.2378
47,0.19748
48,0.15816
49,0.11902
50,0.07878500000000001
51,0.039809
52,0.00027311
53,-0.038756
54,-0.077757
55,-0.11764000000000001
56,-0.15608
57,-0.19439
58,-0.23255
59,-0.27055
60,-0.30990999999999996
61,-0.3476
62,-0.3855
63,-0.42407
64,-0.46121
65,-0.49812
66,-0.5366
67,-0.57306
68,-0.61115
69,-0.64672
70,-0.68271
71,-0.7179800000000001
72,-0.75505
73,-0.78962
74,-0.82606
75,-0.8598100000000001
76,-0.89305
77,-0.92829
78,-0.9604799999999999
79,-0.9921
80,-1.0257
81,-1.0559
82,-1.0724
83,-1.0846
84,-1.0854
85,-1.0798
86,-1.068
87,-1.0491
88,-1.0298
89,-1.0091
90,-0.98655
91,-0.9622700000000001
92,-0.9375100000000001
93,-0.90894
94,-0.87845
95,-0.84757
96,-0.81582
97,-0.78359
98,-0.75141
99,-0.7170000000000001
100,-0.6825600000000001
101,-0.64704
102,-0.61112
103,-0.57876
104,-0.55043
105,-0.5294
106,-0.53064
107,-0.53079
108,-0.5391600000000001
109,-0.56575
110,-0.59348
111,-0.63431
112,-0.6742199999999999
113,-0.71348
114,-0.7525
115,-0.79218
116,-0.8317
117,-0.86975
118,-0.90515
119,-0.9325700000000001
120,-0.96044
121,-0.99411
122,-1.0231
123,-1.0533
124,-1.0802
125,-1.1047
126,-1.1258
127,-1.1422
128,-1.1611
129,-1.1865
130,-1.2218
131,-1.2539
132,-1.2846
133,-1.3177
134,-1.3467
135,-1.3781
136,-1.4047
137,-1.4332
138,-1.4595
139,-1.4827
140,-1.5065
141,-1.5282
142,-1.5476
143,-1.5781
144,-1.5755
145,-1.5655
146,-1.554
147,-1.5404
148,-1.525
149,-1.5027
150,-1.4809
151,-1.459
152,-1.4318
153,-1.4033
154,-1.3738
155,-1.3423
156,-1.3119
157,-1.2798
158,-1.246
159,-1.212
160,-1.1784
161,-1.1431
162,-1.1083
163,-1.071
164,-1.0345
165,-0.9986
166,-0.96078
167,-0.9241
168,-0.88571
169,-0.84709
170,-0.80916
171,-0.77045
172,-0.73234
173,-0.69385
174,-0.6543899999999999
175,-0.61469
176,-0.5748800000000001
177,-0.53496
178,-0.49496
179,-0.45406
180,-0.41391999999999995
181,-0.37295
182,-0.33196
183,-0.29094000000000003
184,-0.25001999999999996
185,-0.20922
186,-0.16709000000000002
187,-0.12465
188,-0.081501
189,-0.03832
190,0.005761100000000001
191,0.050366
192,0.094584
193,0.13904
194,0.18392
195,0.22910999999999998
196,0.27538
197,0.32104
198,0.36273
199,0.41013
200,0.45737
201,0.5045
202,0.5536399999999999
203,0.6030300000000001
204,0.6513899999999999
205,0.70119
206,0.74987
207,0.7986800000000001
208,0.8476100000000001
209,0.89666
210,0.9444
211,0.99219
212,1.04
213,1.0879
214,1.1344
215,1.1809
216,1.2246
217,1.2609
218,1.2945
219,1.2873
220,1.2671
221,1.2478
222,1.2243
223,1.1964
224,1.1724
225,1.1581
226,1.1443
227,1.1268
228,1.1133
229,1.0963
230,1.0844
231,1.0655
232,1.0290000000000001
233,0.9913700000000001
234,0.9636600000000001
235,0.93948
236,0.90971
237,0.88349
238,0.8577899999999999
239,0.83515
240,0.81872
241,0.8125
242,0.80662
243,0.8014600000000001
244,0.82134
245,0.84934
246,0.88266
247,0.9117700000000001
248,0.94585
249,0.98187
250,1.0138
251,1.0518
252,1.0876
253,1.1236
254,1.16
255,1.1909999999999998
256,1.2244
257,1.2562
258,1.2853
259,1.3147
260,1.3445
261,1.3794
262,1.4007
263,1.3959
264,1.364
265,1.3327
266,1.2958
267,1.2561
268,1.2157
269,1.1754
270,1.1357
271,1.0953
272,1.0532
273,1.0094
274,0.96688
275,0.92306
276,0.87795
277,0.8341299999999999
278,0.78904
279,0.74271
280,0.69876
281,0.65284
282,0.6076600000000001
283,0.5647399999999999
284,0.52012
285,0.47636000000000006
286,0.43206000000000006
287,0.38766999999999996
288,0.34393
289,0.29903
290,0.25417
291,0.20933000000000002
292,0.16452999999999998
293,0.12195999999999999
294,0.07964199999999999
295,0.037916000000000005
296,-0.004659
297,-0.047234
298,-0.08994500000000001
299,-0.1335
300,-0.17496
301,-0.21559
302,-0.25668
303,-0.2969
304,-0.33705999999999997
305,-0.37716
306,-0.41718999999999995
307,-0.45714
308,-0.49613999999999997
309,-0.5354300000000001
310,-0.5751
311,-0.61466
312,-0.65261
313,-0.6919
314,-0.73054
315,-0.7609100000000001
316,-0.72532
317,-0.6967899999999999
318,-0.66367
319,-0.62683
320,-0.58707
321,-0.5552699999999999
322,-0.53533
323,-0.52586
324,-0.55403
325,-0.58317
326,-0.6161
327,-0.64753
328,-0.68123
329,-0.71307
330,-0.74503
331,-0.77663
332,-0.80835
333,-0.8350799999999999
334,-0.86677
335,-0.89991
336,-0.9325
337,-0.96825
338,-1.0071
339,-1.0347
340,-1.0651
341,-1.0984
342,-1.131
343,-1.1627
344,-1.1936
345,-1.2152
346,-1.2406
347,-1.2814
348,-1.3077
349,-1.337
350,-1.3575
351,-1.3849
352,-1.3922
353,-1.3971
354,-1.3817
355,-1.3405
356,-1.2982
357,-1.3139
358,-1.3201
359,-1.2867
360,-1.2495
361,-1.2399
362,-1.2326
363,-1.2263
364,-1.2227
365,-1.2171
366,-1.2131
367,-1.2
368,-1.18
369,-1.1629
370,-1.1488
371,-1.1364
372,-1.1165
373,-1.0957
374,-1.0715
375,-1.0498
376,-1.0234
377,-0.99256
378,-0.96444
379,-0.9355100000000001
380,-0.89594
381,-0.8625799999999999
382,-0.8294799999999999
383,-0.78978
384,-0.75598
385,-0.72175
386,-0.69192
387,-0.6635
388,-0.6254
389,-0.59423
390,-0.55991
391,-0.52266
392,-0.49021000000000003
393,-0.47856000000000004
394,-0.42654
395,-0.38869000000000004
396,-0.35488000000000003
397,-0.32135
398,-0.28941
399,-0.2526
400,-0.21141999999999997
401,-0.1765
402,-0.14132
403,-0.093766
404,-0.059495000000000006
405,-0.034751
406,-0.0026796
407,0.035647000000000005
408,0.078566
409,0.11592999999999999
410,0.15262
411,0.18947999999999998
412,0.2282
413,0.26700999999999997
414,0.30591
415,0.34794
416,0.3892
417,0.41413999999999995
418,0.44271000000000005
419,0.48278000000000004
420,0.5215
421,0.55811
422,0.59401
423,0.63459
424,0.67298
425,0.7114699999999999
426,0.75135
427,0.79
428,0.83125
429,0.8687799999999999
430,0.90523
431,0.9418799999999999
432,0.9720200000000001
433,1.0105
434,1.0469
435,1.0846
436,1.1225
437,1.1609
438,1.1997
439,1.2312
440,1.2693
441,1.3068
442,1.3452
443,1.3840000000000001
444,1.4229
445,1.4614
446,1.5003
447,1.5387
448,1.5773
449,1.6159999999999999
450,1.6555
451,1.6945
452,1.733
453,1.771
454,1.8115
455,1.8406
456,1.8744
457,1.9132
458,1.9432
459,1.9780000000000002
460,2.0129
461,2.0343
462,2.0534
