time,value
0,-0.15214
1,0.8788100000000001
2,-1.3549
3,0.019688
4,0.8788100000000001
5,-1.5267
6,-0.15214
7,0.70699
8,-1.5267
9,0.36334
10,0.36334
11,-2.0422
12,0.36334
13,0.19150999999999999
14,-1.6986
15,0.5351600000000001
16,-0.32395999999999997
17,-1.8704
18,1.9098
19,1.0506
20,0.8788100000000001
21,-1.1831
22,-0.49578999999999995
23,0.5351600000000001
24,0.19150999999999999
25,-0.32395999999999997
26,0.8788100000000001
27,1.0506
28,-1.3549
29,0.019688
30,1.7379
31,-0.83944
32,-0.15214
33,2.0816
34,0.019688
35,-1.0113
36,1.9098
37,0.5351600000000001
38,0.36334
39,1.5661
40,0.8788100000000001
41,0.019688
42,1.0506
43,1.2225
44,-1.1831
45,0.19150999999999999
46,1.0506
47,-1.1831
48,-0.15214
49,1.3943
50,0.019688
51,0.5351600000000001
52,1.2225
53,-1.0113
54,0.019688
55,1.0506
56,-1.1831
57,0.19150999999999999
58,0.70699
59,-1.1831
60,0.5351600000000001
61,0.5351600000000001
62,-1.3549
63,0.70699
64,0.19150999999999999
65,-1.5267
66,1.0506
67,-0.32395999999999997
68,-1.5267
69,0.70699
70,0.5351600000000001
71,-0.83944
72,1.3943
73,-0.66761
74,-0.83944
75,1.3943
76,-1.1831
77,-0.32395999999999997
78,0.8788100000000001
79,-1.3549
80,0.19150999999999999
81,0.5351600000000001
82,-0.66761
83,0.70699
84,0.019688
85,-1.1831
86,1.2225
87,0.19150999999999999
88,-1.1831
89,0.36334
90,-1.5267
91,-1.0113
92,-0.15214
93,-1.6986
94,-0.15214
95,-0.32395999999999997
