time,value
0,-0.23501999999999998
1,-0.23501999999999998
2,-0.23501999999999998
3,-0.23501999999999998
4,-0.23501999999999998
5,-0.23501999999999998
6,-0.23501999999999998
7,-0.23501999999999998
8,-0.23501999999999998
9,-0.23501999999999998
10,-0.23501999999999998
11,-0.23501999999999998
12,-0.23501999999999998
13,-0.23501999999999998
14,-0.23501999999999998
15,-0.23501999999999998
16,-0.23501999999999998
17,-0.23501999999999998
18,-0.23501999999999998
19,-0.23501999999999998
20,-0.23501999999999998
21,-0.23501999999999998
22,-0.23501999999999998
23,-0.23501999999999998
24,-0.23501999999999998
25,-0.23501999999999998
26,-0.23501999999999998
27,-0.23501999999999998
28,-0.23501999999999998
29,-0.23501999999999998
30,-0.23501999999999998
31,-0.23501999999999998
32,-0.23501999999999998
33,-0.23501999999999998
34,-0.23501999999999998
35,-0.23501999999999998
36,-0.23501999999999998
37,5.9932
38,2.0529
39,-0.23501999999999998
40,1.0996
41,-0.23501999999999998
42,-0.23501999999999998
43,-0.23501999999999998
44,-0.23501999999999998
45,-0.23501999999999998
46,-0.23501999999999998
47,-0.23501999999999998
48,-0.23501999999999998
49,-0.23501999999999998
50,-0.23501999999999998
51,-0.23501999999999998
52,-0.23501999999999998
53,0.94073
54,2.7838
55,6.025
56,-0.23501999999999998
57,-0.23501999999999998
58,-0.23501999999999998
59,-0.23501999999999998
60,-0.23501999999999998
61,-0.23501999999999998
62,-0.23501999999999998
63,-0.23501999999999998
64,-0.23501999999999998
65,-0.23501999999999998
66,-0.17146
67,1.9576
68,-0.23501999999999998
69,-0.23501999999999998
70,-0.23501999999999998
71,-0.23501999999999998
72,-0.23501999999999998
73,-0.23501999999999998
74,-0.23501999999999998
75,-0.23501999999999998
76,-0.23501999999999998
77,-0.23501999999999998
78,-0.23501999999999998
79,-0.23501999999999998
80,-0.23501999999999998
81,-0.23501999999999998
82,-0.23501999999999998
83,-0.23501999999999998
84,-0.23501999999999998
85,-0.23501999999999998
86,-0.23501999999999998
87,-0.23501999999999998
88,-0.23501999999999998
89,-0.23501999999999998
90,-0.23501999999999998
91,-0.23501999999999998
92,-0.23501999999999998
93,-0.23501999999999998
94,-0.23501999999999998
95,-0.23501999999999998
