time,value
0,-0.65914
1,-0.65914
2,-0.65914
3,-0.65914
4,1.2583
5,1.7813
6,0.7354
7,-0.65914
8,-0.65914
9,-0.65914
10,-0.65914
11,-0.65914
12,-0.65914
13,2.1299
14,1.7813
15,-0.3105
16,-0.65914
17,-0.65914
18,-0.65914
19,-0.65914
20,-0.65914
21,-0.13618
22,2.1299
23,1.607
24,0.38677
25,-0.65914
26,-0.65914
27,-0.65914
28,-0.65914
29,-0.65914
30,-0.13618
31,1.9556
32,1.7813
33,-0.65914
34,-0.65914
35,-0.65914
36,-0.65914
37,-0.65914
38,-0.65914
39,0.9097200000000001
40,1.9556
41,0.9097200000000001
42,-0.65914
43,-0.65914
44,-0.65914
45,-0.65914
46,-0.65914
47,-0.65914
48,1.607
49,1.7813
50,0.21245
51,-0.65914
52,-0.65914
53,-0.65914
54,-0.65914
55,-0.65914
56,-0.13618
57,1.9556
58,1.607
59,-0.65914
60,-0.65914
61,-0.65914
62,-0.65914
63,-0.65914
64,-0.65914
65,0.21245
66,1.9556
67,1.4327
68,-0.65914
69,-0.65914
70,-0.65914
71,-0.65914
72,-0.65914
73,-0.65914
74,0.9097200000000001
75,1.7813
76,0.7354
77,-0.65914
78,-0.65914
79,-0.65914
80,-0.65914
81,-0.65914
82,-0.65914
83,1.2583
84,1.7813
85,1.084
86,-0.65914
87,-0.65914
88,-0.65914
89,-0.65914
90,-0.65914
91,0.38677
92,1.9556
93,1.607
94,-0.65914
95,-0.65914
