time,value
0,-0.17949
1,-0.21313000000000001
2,-0.22435
3,-0.18229
4,-0.21593
5,-0.22435
6,-0.1879
7,-0.21313000000000001
8,-0.21874000000000002
9,-0.1851
10,-0.22715
11,-0.20472
12,-0.1879
13,-0.22715
14,-0.21033000000000002
15,-0.1851
16,-0.22715
17,-0.20751999999999998
18,-0.20472
19,-0.22154000000000001
20,-0.19351
21,-0.20192000000000002
22,-0.21874000000000002
23,-0.14865
24,-0.19630999999999998
25,-0.19630999999999998
26,-0.17388
27,-0.20192000000000002
28,-0.20751999999999998
29,-0.17949
30,-0.20751999999999998
31,-0.1879
32,-0.17388
33,-0.21593
34,-0.19351
35,-0.1851
36,-0.20472
37,-0.18229
38,-0.19910999999999998
39,-0.21033000000000002
40,-0.1879
41,-0.21313000000000001
42,-0.19910999999999998
43,-0.16267
44,-0.20192000000000002
45,-0.19351
46,-0.17388
47,-0.20751999999999998
48,-0.1907
49,-0.20192000000000002
50,-0.21313000000000001
51,-0.17388
52,-0.20751999999999998
53,-0.1879
54,-0.17949
55,-0.21874000000000002
56,-0.20472
57,-0.1879
58,-0.21874000000000002
59,-0.20751999999999998
60,-0.19351
61,-0.21874000000000002
62,-0.21593
63,-0.1907
64,-0.21874000000000002
65,-0.20192000000000002
66,-0.18229
67,-0.21593
68,-0.19351
69,-0.19351
70,-0.21874000000000002
71,-0.19630999999999998
72,-0.19910999999999998
73,-0.22154000000000001
74,-0.19351
75,-0.21033000000000002
76,1.7185
77,5.6464
78,5.7781
79,4.8137
80,0.070031
81,-0.14024
82,-0.17107999999999998
83,-0.18229
84,-0.15986
85,-0.19351
86,-0.21313000000000001
87,-0.15986
88,-0.1907
89,-0.20472
90,-0.16267
91,-0.19910999999999998
92,-0.21593
93,-0.1851
94,-0.19910999999999998
95,-0.22715
