time,value
0,-0.23233
1,-0.23233
2,-0.23233
3,-0.23233
4,-0.23233
5,-0.23233
6,-0.23233
7,-0.23233
8,-0.23233
9,-0.23233
10,-0.23233
11,-0.23233
12,-0.23233
13,-0.23233
14,-0.23233
15,-0.23233
16,-0.23233
17,-0.23233
18,-0.23233
19,-0.23233
20,-0.23233
21,-0.23233
22,-0.23233
23,-0.23233
24,-0.23233
25,-0.23233
26,-0.23233
27,-0.23233
28,-0.23233
29,-0.23233
30,-0.23233
31,-0.23233
32,-0.23233
33,-0.23233
34,-0.23233
35,-0.23233
36,-0.23233
37,-0.23233
38,-0.23233
39,-0.23233
40,-0.23233
41,-0.23233
42,-0.23233
43,-0.23233
44,-0.23233
45,-0.23233
46,-0.23233
47,-0.23233
48,-0.23233
49,-0.23233
50,-0.23233
51,-0.23233
52,-0.23233
53,-0.23233
54,-0.23233
55,-0.23233
56,-0.23233
57,-0.23233
58,-0.23233
59,-0.23233
60,-0.23233
61,-0.23233
62,-0.23233
63,-0.23233
64,-0.23233
65,-0.23233
66,-0.23233
67,-0.23233
68,-0.23233
69,-0.23233
70,-0.23233
71,-0.23233
72,-0.23233
73,-0.23233
74,-0.23233
75,-0.23233
76,4.4143
77,4.4143
78,4.4143
79,4.4143
80,3.485
81,-0.23233
82,-0.23233
83,-0.23233
84,-0.23233
85,-0.23233
86,-0.23233
87,-0.23233
88,-0.23233
89,-0.23233
90,-0.23233
91,-0.23233
92,-0.23233
93,-0.23233
94,-0.23233
95,-0.23233
