time,value
0,-0.25597
1,-0.25597
2,-0.25597
3,-0.25597
4,-0.25597
5,-0.25597
6,-0.25597
7,-0.25597
8,-0.25597
9,-0.25597
10,-0.25597
11,-0.25597
12,-0.25597
13,-0.25597
14,-0.25597
15,-0.25597
16,-0.25597
17,-0.25597
18,-0.25597
19,-0.25597
20,-0.25597
21,-0.25597
22,-0.25597
23,-0.25597
24,-0.25597
25,-0.25597
26,-0.25597
27,-0.25597
28,-0.25597
29,-0.25597
30,-0.25597
31,-0.25597
32,-0.25597
33,-0.25597
34,-0.25597
35,-0.25597
36,-0.25597
37,-0.25597
38,-0.25597
39,-0.25597
40,-0.25597
41,-0.25597
42,-0.25597
43,-0.25597
44,-0.25597
45,-0.25597
46,-0.25597
47,-0.25597
48,-0.25597
49,-0.22901999999999997
50,1.4684
51,0.61522
52,-0.25597
53,-0.25597
54,-0.25597
55,-0.25597
56,-0.25597
57,-0.25597
58,-0.25597
59,-0.25597
60,-0.25597
61,-0.25597
62,-0.25597
63,-0.25597
64,-0.25597
65,-0.25597
66,-0.25597
67,-0.25597
68,4.4323
69,3.8575
70,5.8513
71,4.064
72,1.0733
73,0.51642
74,-0.21106
75,-0.25597
76,-0.25597
77,-0.25597
78,-0.25597
79,0.31884
80,-0.25597
81,-0.25597
82,-0.25597
83,-0.25597
84,-0.25597
85,-0.25597
86,-0.25597
87,-0.25597
88,-0.25597
89,-0.25597
90,-0.25597
91,-0.25597
92,-0.25597
93,-0.25597
94,-0.25597
95,-0.25597
