time,value
0,-0.4039
1,-0.37113
2,-0.41357
3,-0.47486999999999996
4,-0.50076
5,-0.26742
6,-0.24254
7,-0.45537
8,-0.23485999999999999
9,-0.44116000000000005
10,-0.42281
11,-0.37471
12,-0.17300000000000001
13,-0.2951
14,-0.26441
15,-0.15559
16,-0.038785
17,0.052833000000000005
18,0.12715
19,0.19647
20,0.37293000000000004
21,0.19203
22,-0.3458
23,0.48928999999999995
24,-0.22851
25,-1.2072
26,-2.4098
27,-2.823
28,-2.7752
29,-2.9107
30,-3.3227
31,-3.7039999999999997
32,-3.3002
33,-2.8310000000000004
34,-2.2386
35,-1.693
36,-0.98831
37,-0.35961
38,0.18733
39,0.77817
40,0.9859
41,1.0324
42,1.5007
43,1.9053
44,1.9728
45,1.9884
46,1.9373
47,1.6838
48,1.7217
49,1.8784
50,1.9341
51,1.8774
52,1.7059
53,1.7534
54,1.7691
55,1.8693
56,1.9524
57,1.7788
58,1.9709999999999999
59,2.1662
60,1.7887
61,1.5116
62,1.3667
63,1.2773
64,1.5711
65,1.5849
66,1.7181
67,1.442
68,1.3019
69,1.2342
70,1.1354
71,1.1326
72,1.1824
73,1.3843
74,1.2313
75,1.3513
76,1.1856
77,1.0736
78,1.1179
79,1.0839
80,1.0855
81,1.1041
82,1.2663
83,1.2808
84,1.2352
85,1.3743
86,1.3668
87,1.5022
88,1.5426
89,1.5537
90,1.6381
91,1.7447
92,1.9437
93,1.4647
94,1.4338
95,1.1962
96,1.093
97,1.3977
98,1.3693
99,1.6504
100,1.4433
101,1.1557
102,1.0456
103,0.83826
104,0.57599
105,0.11184000000000001
106,-0.27514
107,-1.24
108,-2.3313
109,-2.2768
110,-1.8303
111,-2.0036
112,-2.1783
113,-2.1853
114,-1.7024
115,-1.8144
116,-1.8744
117,-1.605
118,-1.3304
119,-1.1628
120,-1.1383
121,-1.1284
122,-1.0518
123,-0.88403
124,-0.73274
125,-0.56595
126,-0.45103999999999994
127,-0.21083000000000002
128,-0.35484
129,-0.16744
130,-0.031639999999999995
131,0.15020999999999998
132,0.17404
133,0.14012
134,-0.0042005
135,0.016198
136,-0.14173
137,-0.15014
138,-0.0074933000000000005
139,0.10313
140,0.13273
141,0.10407999999999999
142,0.050713999999999995
143,-0.13262000000000002
144,-0.17193
145,-0.19458
146,-0.17197
147,-0.17547000000000001
148,-0.17517
149,-0.18394000000000002
150,-0.18403
151,-0.14307
152,-0.18369000000000002
153,-0.16885999999999998
154,-0.14784
155,-0.14620999999999998
156,0.0356
157,0.076891
158,0.10275999999999999
159,0.19518
160,0.147
161,0.1318
162,0.14322000000000001
163,0.1602
164,0.12871
165,0.14954
166,0.06500800000000001
167,0.085655
168,0.074577
169,0.030951
170,0.12974000000000002
171,0.033613
172,0.036388
173,0.057395
174,0.053617
175,0.040843
176,0.032813999999999996
177,-0.033717000000000004
178,-0.2675
179,-0.014334
180,0.011221
181,0.055325
182,-0.19313
183,-0.21578000000000003
184,0.068152
185,0.027627999999999996
186,0.0083133
187,-0.016041
188,-0.052576
189,0.021032
190,0.033729
191,-0.025518
192,-0.063316
193,-0.035439
194,-0.016526
195,-0.025059
196,-0.0096849
197,-0.017518000000000002
198,-0.12905
199,-0.1734
200,-0.17246
201,-0.14897
202,-0.13539
203,-0.071805
204,-0.10123
205,-0.12473
206,-0.16482
207,-0.10815
208,-0.14368
209,0.034849
210,-0.16935
211,-0.14831
212,-0.15364
213,-0.19122999999999998
214,-0.23345
215,-0.028664
216,-0.067454
217,-0.19604000000000002
218,-0.20504
219,-0.21816999999999998
220,-0.07162
221,-0.22812
222,-0.22543000000000002
223,-0.23774
224,-0.21313000000000001
225,-0.18715
226,-0.17668
227,-0.17992
228,-0.19185
229,-0.20695999999999998
230,-0.20718000000000003
231,-0.22468000000000002
232,-0.2357
233,-0.23175
234,-0.23417
235,-0.24015999999999998
236,-0.26858000000000004
237,-0.29477
238,-0.23295
239,-0.34153
240,-0.36115
241,-0.35416
242,-0.35623
243,-0.31051
244,-0.29512
245,-0.086579
246,-0.19172
247,-0.09188400000000001
248,-0.089616
249,-0.21563000000000002
250,-0.2125
251,-0.33142
252,-0.32015
253,-0.31567
254,-0.32964
255,-0.34069
256,-0.33071999999999996
257,-0.31085
258,-0.31483
259,-0.23345
260,-0.095948
261,-0.31139
262,-0.32119000000000003
263,-0.091347
264,-0.23961999999999997
265,-0.19654000000000002
266,-0.21014000000000002
267,-0.19932
268,-0.34281999999999996
269,-0.18247
270,-0.10882
271,-0.11327000000000001
272,-0.27423000000000003
273,-0.33608000000000005
274,-0.33185
275,-0.33407
276,-0.3399
277,-0.34697
278,-0.35865
279,-0.36816
280,-0.36125
281,-0.36118
282,-0.37114
283,-0.37529
284,-0.36973
285,-0.36403
286,-0.36734
287,-0.36184
288,-0.36534
289,-0.85126
290,-0.8552299999999999
291,-0.8627
292,-0.86279
293,-0.85131
294,-0.8431700000000001
295,-0.84486
296,-0.85269
297,-0.8598899999999999
298,-0.8631200000000001
299,-0.39386
