time,value
0,-0.55574
1,-0.55574
2,-0.55574
3,-0.55574
4,-0.55574
5,-0.55574
6,-0.55574
7,-0.55574
8,-0.55574
9,-0.55574
10,-0.55574
11,-0.55574
12,-0.55574
13,-0.55574
14,-0.55574
15,-0.55574
16,-0.55574
17,-0.55574
18,-0.55574
19,-0.55574
20,-0.55574
21,-0.55574
22,-0.55574
23,-0.55574
24,-0.55574
25,-0.55574
26,-0.55574
27,-0.55574
28,2.2854
29,2.1802
30,1.3384
31,3.3377
32,3.2325
33,3.1273
34,1.8645
35,1.5488
36,0.39132
37,0.39132
38,0.18086
39,0.28609
40,0.075633
41,0.075633
42,-0.24005
43,0.39132
44,0.28609
45,0.39132
46,0.075633
47,0.39132
48,0.28609
49,-0.029595999999999997
50,-0.55574
51,-0.34528000000000003
52,-0.55574
53,-0.55574
54,-0.55574
55,-0.55574
56,-0.55574
57,-0.24005
58,-0.55574
59,-0.55574
60,-0.13482
61,-0.55574
62,-0.55574
63,-0.55574
64,-0.55574
65,-0.55574
66,-0.55574
67,-0.55574
68,-0.55574
69,-0.55574
70,-0.55574
71,-0.55574
72,-0.55574
73,-0.55574
74,-0.55574
75,-0.55574
76,-0.55574
77,-0.55574
78,-0.55574
79,-0.55574
80,-0.55574
81,-0.55574
82,2.2854
83,2.3907
84,1.7593
85,1.7593
86,1.4436
87,1.2331
88,1.5488
89,1.4436
90,-0.55574
91,-0.55574
92,-0.55574
93,-0.55574
94,-0.55574
95,-0.55574
