{
  "about": {
    "datasetID": "loan_status_dataset",
    "datasetName": "Loan Status",
    "description": "This dataset includes data related to Loan Status",
    "license": "Creative Commons",
    "sourceURI": "https://www.featuretools.com/demos",
    "approximateSize": "58 MB",
    "datasetSchemaVersion": "4.0.0",
    "redacted": true,
    "datasetVersion": "4.0.0",
    "digest": "7c7ffcdff1016c2f3a5b7edcba184220e402a91293f90dc7f34ee992d8b85d2d"
  },
  "dataResources": [
    {
      "resID": "0",
      "resPath": "tables/account.csv",
      "resType": "table",
      "resFormat": {
        "text/csv": [
          "csv"
        ]
      },
      "isCollection": false,
      "columns": [
        {
          "colIndex": 0,
          "colName": "account_id",
          "colType": "integer",
          "role": [
            "index"
          ]
        },
        {
          "colIndex": 1,
          "colName": "district_id",
          "colType": "integer",
          "role": [
            "attribute"
          ],
          "refersTo": {
            "resID": "4",
            "resObject": {
              "columnName": "district_id"
            }
          }
        },
        {
          "colIndex": 2,
          "colName": "frequency",
          "colType": "string",
          "role": [
            "attribute"
          ]
        },
        {
          "colIndex": 3,
          "colName": "date",
          "colType": "dateTime",
          "role": [
            "timeIndicator"
          ]
        }
      ],
      "columnsCount": 4
    },
    {
      "resID": "1",
      "resPath": "tables/card.csv",
      "resType": "table",
      "resFormat": {
        "text/csv": [
          "csv"
        ]
      },
      "isCollection": false,
      "columns": [
        {
          "colIndex": 0,
          "colName": "card_id",
          "colType": "integer",
          "role": [
            "index"
          ]
        },
        {
          "colIndex": 1,
          "colName": "disp_id",
          "colType": "integer",
          "role": [
            "attribute"
          ],
          "refersTo": {
            "resID": "3",
            "resObject": {
              "columnName": "disp_id"
            }
          }
        },
        {
          "colIndex": 2,
          "colName": "type",
          "colType": "string",
          "role": [
            "attribute"
          ]
        },
        {
          "colIndex": 3,
          "colName": "issued",
          "colType": "string",
          "role": [
            "attribute"
          ]
        }
      ],
      "columnsCount": 4
    },
    {
      "resID": "2",
      "resPath": "tables/client.csv",
      "resType": "table",
      "resFormat": {
        "text/csv": [
          "csv"
        ]
      },
      "isCollection": false,
      "columns": [
        {
          "colIndex": 0,
          "colName": "client_id",
          "colType": "integer",
          "role": [
            "index"
          ]
        },
        {
          "colIndex": 1,
          "colName": "gender",
          "colType": "string",
          "role": [
            "attribute"
          ]
        },
        {
          "colIndex": 2,
          "colName": "birth_date",
          "colType": "dateTime",
          "role": [
            "attribute"
          ]
        },
        {
          "colIndex": 3,
          "colName": "district_id",
          "colType": "integer",
          "role": [
            "attribute"
          ],
          "refersTo": {
            "resID": "4",
            "resObject": {
              "columnName": "district_id"
            }
          }
        }
      ],
      "columnsCount": 4
    },
    {
      "resID": "3",
      "resPath": "tables/disp.csv",
      "resType": "table",
      "resFormat": {
        "text/csv": [
          "csv"
        ]
      },
      "isCollection": false,
      "columns": [
        {
          "colIndex": 0,
          "colName": "disp_id",
          "colType": "integer",
          "role": [
            "index"
          ]
        },
        {
          "colIndex": 1,
          "colName": "client_id",
          "colType": "integer",
          "role": [
            "attribute"
          ],
          "refersTo": {
            "resID": "2",
            "resObject": {
              "columnName": "client_id"
            }
          }
        },
        {
          "colIndex": 2,
          "colName": "account_id",
          "colType": "integer",
          "role": [
            "attribute"
          ],
          "refersTo": {
            "resID": "0",
            "resObject": {
              "columnName": "account_id"
            }
          }
        },
        {
          "colIndex": 3,
          "colName": "type",
          "colType": "string",
          "role": [
            "attribute"
          ]
        }
      ],
      "columnsCount": 4
    },
    {
      "resID": "4",
      "resPath": "tables/district.csv",
      "resType": "table",
      "resFormat": {
        "text/csv": [
          "csv"
        ]
      },
      "isCollection": false,
      "columns": [
        {
          "colIndex": 0,
          "colName": "district_id",
          "colType": "integer",
          "role": [
            "index"
          ]
        },
        {
          "colIndex": 1,
          "colName": "A2",
          "colType": "string",
          "role": [
            "attribute"
          ]
        },
        {
          "colIndex": 2,
          "colName": "A3",
          "colType": "string",
          "role": [
            "attribute"
          ]
        },
        {
          "colIndex": 3,
          "colName": "A4",
          "colType": "integer",
          "role": [
            "attribute"
          ]
        },
        {
          "colIndex": 4,
          "colName": "A5",
          "colType": "integer",
          "role": [
            "attribute"
          ]
        },
        {
          "colIndex": 5,
          "colName": "A6",
          "colType": "integer",
          "role": [
            "attribute"
          ]
        },
        {
          "colIndex": 6,
          "colName": "A7",
          "colType": "integer",
          "role": [
            "attribute"
          ]
        },
        {
          "colIndex": 7,
          "colName": "A8",
          "colType": "integer",
          "role": [
            "attribute"
          ]
        },
        {
          "colIndex": 8,
          "colName": "A9",
          "colType": "integer",
          "role": [
            "attribute"
          ]
        },
        {
          "colIndex": 9,
          "colName": "A10",
          "colType": "integer",
          "role": [
            "attribute"
          ]
        },
        {
          "colIndex": 10,
          "colName": "A11",
          "colType": "integer",
          "role": [
            "attribute"
          ]
        },
        {
          "colIndex": 11,
          "colName": "A12",
          "colType": "real",
          "role": [
            "attribute"
          ]
        },
        {
          "colIndex": 12,
          "colName": "A13",
          "colType": "real",
          "role": [
            "attribute"
          ]
        },
        {
          "colIndex": 13,
          "colName": "A14",
          "colType": "integer",
          "role": [
            "attribute"
          ]
        },
        {
          "colIndex": 14,
          "colName": "A15",
          "colType": "integer",
          "role": [
            "attribute"
          ]
        },
        {
          "colIndex": 15,
          "colName": "A16",
          "colType": "integer",
          "role": [
            "attribute"
          ]
        }
      ],
      "columnsCount": 16
    },
    {
      "resID": "5",
      "resPath": "tables/order.csv",
      "resType": "table",
      "resFormat": {
        "text/csv": [
          "csv"
        ]
      },
      "isCollection": false,
      "columns": [
        {
          "colIndex": 0,
          "colName": "order_id",
          "colType": "integer",
          "role": [
            "index"
          ]
        },
        {
          "colIndex": 1,
          "colName": "account_id",
          "colType": "integer",
          "role": [
            "attribute"
          ],
          "refersTo": {
            "resID": "0",
            "resObject": {
              "columnName": "account_id"
            }
          }
        },
        {
          "colIndex": 2,
          "colName": "bank_to",
          "colType": "string",
          "role": [
            "attribute"
          ]
        },
        {
          "colIndex": 3,
          "colName": "account_to",
          "colType": "integer",
          "role": [
            "attribute"
          ]
        },
        {
          "colIndex": 4,
          "colName": "amount",
          "colType": "integer",
          "role": [
            "attribute"
          ]
        },
        {
          "colIndex": 5,
          "colName": "k_symbol",
          "colType": "string",
          "role": [
            "attribute"
          ]
        }
      ],
      "columnsCount": 6
    },
    {
      "resID": "6",
      "resPath": "tables/trans.csv",
      "resType": "table",
      "resFormat": {
        "text/csv": [
          "csv"
        ]
      },
      "isCollection": false,
      "columns": [
        {
          "colIndex": 0,
          "colName": "trans_id",
          "colType": "integer",
          "role": [
            "index"
          ]
        },
        {
          "colIndex": 1,
          "colName": "account_id",
          "colType": "integer",
          "role": [
            "attribute"
          ],
          "refersTo": {
            "resID": "0",
            "resObject": {
              "columnName": "account_id"
            }
          }
        },
        {
          "colIndex": 2,
          "colName": "date",
          "colType": "dateTime",
          "role": [
            "timeIndicator"
          ]
        },
        {
          "colIndex": 3,
          "colName": "type",
          "colType": "string",
          "role": [
            "attribute"
          ]
        },
        {
          "colIndex": 4,
          "colName": "operation",
          "colType": "string",
          "role": [
            "attribute"
          ]
        },
        {
          "colIndex": 5,
          "colName": "amount",
          "colType": "integer",
          "role": [
            "attribute"
          ]
        },
        {
          "colIndex": 6,
          "colName": "balance",
          "colType": "integer",
          "role": [
            "attribute"
          ]
        },
        {
          "colIndex": 7,
          "colName": "k_symbol",
          "colType": "string",
          "role": [
            "attribute"
          ]
        },
        {
          "colIndex": 8,
          "colName": "bank",
          "colType": "string",
          "role": [
            "attribute"
          ]
        },
        {
          "colIndex": 9,
          "colName": "account",
          "colType": "integer",
          "role": [
            "attribute"
          ]
        }
      ],
      "columnsCount": 10
    },
    {
      "resID": "learningData",
      "resPath": "tables/learningData.csv",
      "resType": "table",
      "resFormat": {
        "text/csv": [
          "csv"
        ]
      },
      "isCollection": false,
      "columns": [
        {
          "colIndex": 0,
          "colName": "d3mIndex",
          "colType": "integer",
          "role": [
            "index"
          ]
        },
        {
          "colIndex": 1,
          "colName": "account_id",
          "colType": "integer",
          "role": [
            "attribute"
          ],
          "refersTo": {
            "resID": "0",
            "resObject": {
              "columnName": "account_id"
            }
          }
        },
        {
          "colIndex": 2,
          "colName": "date",
          "colType": "dateTime",
          "role": [
            "timeIndicator"
          ]
        },
        {
          "colIndex": 3,
          "colName": "amount",
          "colType": "integer",
          "role": [
            "attribute"
          ]
        },
        {
          "colIndex": 4,
          "colName": "duration",
          "colType": "integer",
          "role": [
            "attribute"
          ]
        },
        {
          "colIndex": 5,
          "colName": "payments",
          "colType": "integer",
          "role": [
            "attribute"
          ]
        },
        {
          "colIndex": 6,
          "colName": "status",
          "colType": "string",
          "role": [
            "suggestedTarget"
          ]
        }
      ],
      "columnsCount": 7
    }
  ]
}