time,value
0,-0.1268
1,-0.1268
2,-0.1268
3,-0.1268
4,-0.1268
5,-0.1268
6,-0.1268
7,-0.1268
8,-0.1268
9,-0.1268
10,-0.1268
11,-0.1268
12,-0.1268
13,-0.1268
14,-0.1268
15,-0.1268
16,-0.1268
17,-0.1268
18,-0.1268
19,-0.1268
20,-0.1268
21,-0.1268
22,-0.1268
23,-0.1268
24,-0.1268
25,-0.1268
26,-0.1268
27,-0.1268
28,0.08407
29,9.6117
30,0.65918
31,0.52499
32,0.65918
33,-0.1268
34,-0.1268
35,-0.1268
36,-0.1268
37,-0.1268
38,-0.1268
39,-0.1268
40,-0.1268
41,-0.1268
42,-0.1268
43,-0.1268
44,-0.1268
45,-0.1268
46,-0.1268
47,-0.1268
48,-0.1268
49,-0.1268
50,-0.1268
51,-0.1268
52,-0.1268
53,-0.1268
54,-0.1268
55,-0.1268
56,-0.1268
57,-0.1268
58,-0.1268
59,-0.1268
60,-0.1268
61,-0.1268
62,-0.1268
63,-0.1268
64,-0.1268
65,-0.1268
66,-0.1268
67,-0.1268
68,-0.1268
69,-0.1268
70,-0.1268
71,-0.1268
72,-0.1268
73,-0.1268
74,-0.1268
75,-0.1268
76,-0.1268
77,-0.1268
78,-0.1268
79,-0.1268
80,-0.1268
81,-0.1268
82,-0.1268
83,-0.1268
84,-0.1268
85,-0.1268
86,-0.1268
87,-0.1268
88,-0.1268
89,-0.1268
90,-0.1268
91,-0.1268
92,-0.1268
93,-0.1268
94,-0.1268
95,-0.1268
