time,value
0,-0.24586999999999998
1,-0.7376
2,-0.7376
3,-0.7376
4,-0.7376
5,1.3932
6,1.7211
7,0.7376
8,-0.7376
9,-0.7376
10,-0.7376
11,-0.7376
12,-0.7376
13,1.3932
14,1.7211
15,0.40978000000000003
16,-0.7376
17,-0.7376
18,-0.7376
19,-0.7376
20,-0.7376
21,1.2293
22,1.5571
23,0.40978000000000003
24,-0.7376
25,-0.7376
26,-0.7376
27,-0.7376
28,-0.7376
29,1.7211
30,1.5571
31,0.081955
32,-0.7376
33,-0.7376
34,-0.7376
35,-0.7376
36,-0.7376
37,1.0654
38,1.7211
39,0.40978000000000003
40,-0.7376
41,-0.7376
42,-0.7376
43,-0.7376
44,-0.7376
45,1.885
46,1.3932
47,0.081955
48,-0.7376
49,-0.7376
50,-0.7376
51,-0.7376
52,0.24586999999999998
53,1.7211
54,1.5571
55,-0.24586999999999998
56,-0.7376
57,-0.7376
58,-0.7376
59,-0.7376
60,0.90151
61,1.7211
62,1.2293
63,-0.7376
64,-0.7376
65,-0.7376
66,-0.7376
67,-0.7376
68,1.5571
69,1.5571
70,0.7376
71,-0.7376
72,-0.7376
73,-0.7376
74,-0.7376
75,-0.7376
76,0.40978000000000003
77,1.7211
78,1.3932
79,-0.7376
80,-0.7376
81,-0.7376
82,-0.7376
83,-0.7376
84,-0.7376
85,1.7211
86,1.5571
87,1.2293
88,-0.7376
89,-0.7376
90,-0.7376
91,-0.7376
92,-0.7376
93,0.24586999999999998
94,1.7211
95,1.5571
