time,value
0,-1.1888
1,0.37240999999999996
2,-0.19863
3,-1.4637
4,-2.0724
5,-1.7074
6,-1.0294
7,-0.7925
8,-1.0967
9,-1.5035
10,-1.5952
11,-1.3611
12,-1.1286
13,-1.1289
14,-1.2909
15,-1.421
16,-1.3959
17,-1.2816
18,-1.2279
19,-1.2616
20,-1.3192
21,-1.3449
22,-1.3184
23,-1.2867
24,-1.2876
25,-1.2991
26,-1.3103
27,-1.314
28,-1.305
29,-1.3153
30,-1.3155
31,-1.3076
32,-1.318
33,-1.3161
34,-1.3131
35,-1.3218
36,-1.3175
37,-1.3184
38,-1.3241
39,-1.3167
40,-1.321
41,-1.3233
42,-1.3125
43,-1.3198
44,-1.3184
45,-1.3074
46,-1.3156
47,-1.3114
48,-1.3045
49,-1.3104
50,-1.3028
51,-1.2987
52,-1.3005
53,-1.2890000000000001
54,-1.2883
55,-1.287
56,-1.2724
57,-1.2746
58,-1.2689
59,-1.2518
60,-1.2545
61,-1.2439
62,-1.2278
63,-1.2248
64,-1.2078
65,-1.1925
66,-1.1843
67,-1.1621
68,-1.1489
69,-1.1364
70,-1.1112
71,-1.1022
72,-1.0868
73,-1.0583
74,-1.0513
75,-1.0326
76,-1.0099
77,-1.004
78,-0.9848100000000001
79,-0.96526
80,-0.95286
81,-0.9269200000000001
82,-0.9110299999999999
83,-0.9005299999999999
84,-0.8799399999999999
85,-0.8760100000000001
86,-0.8675
87,-0.84567
88,-0.8448700000000001
89,-0.83301
90,-0.8158
91,-0.81748
92,-0.8084899999999999
93,-0.80116
94,-0.8044100000000001
95,-0.7938
96,-0.78927
97,-0.78788
98,-0.7743399999999999
99,-0.7762399999999999
100,-0.77593
101,-0.76355
102,-0.77163
103,-0.76967
104,-0.76053
105,-0.76955
106,-0.76525
107,-0.7591899999999999
108,-0.76431
109,-0.75776
110,-0.75957
111,-0.76754
112,-0.7625
113,-0.7690100000000001
114,-0.77227
115,-0.76403
116,-0.7777
117,-0.7851
118,-0.78569
119,-0.8063
120,-0.81521
121,-0.82414
122,-0.8481299999999999
123,-0.86146
124,-0.8811200000000001
125,-0.907
126,-0.9204399999999999
127,-0.94637
128,-0.97205
129,-0.98595
130,-1.0181
131,-1.0419
132,-1.0553
133,-1.0884
134,-1.1082
135,-1.1242
136,-1.1529
137,-1.1677
138,-1.1853
139,-1.209
140,-1.2189
141,-1.2384
142,-1.2569
143,-1.262
144,-1.2835
145,-1.2979
146,-1.3012
147,-1.3256
148,-1.3371
149,-1.3437
150,-1.3646
151,-1.3725
152,-1.3829
153,-1.4017
154,-1.4074
155,-1.4216
156,-1.4365
157,-1.4378
158,-1.4541
159,-1.4646
160,-1.4625
161,-1.4816
162,-1.4880000000000002
163,-1.4876
164,-1.5022
165,-1.5027
166,-1.5028
167,-1.5114
168,-1.5061
169,-1.5078
170,-1.5117
171,-1.5023
172,-1.506
173,-1.5042
174,-1.4880000000000002
175,-1.4908
176,-1.4824
177,-1.4664
178,-1.4668
179,-1.4526
180,-1.4359
181,-1.4294
182,-1.411
183,-1.3998
184,-1.3916
185,-1.3665
186,-1.3499
187,-1.3294
188,-1.2994
189,-1.2944
190,-1.2841
191,-1.2651
192,-1.2612
193,-1.2416
194,-1.2193
195,-1.2111
196,-1.1922
197,-1.1789
198,-1.1705
199,-1.1487
200,-1.1388
201,-1.1289
202,-1.1073
203,-1.104
204,-1.0928
205,-1.0719
206,-1.0714
207,-1.0594
208,-1.0449
209,-1.0441
210,-1.0309
211,-1.0217
212,-1.0196
213,-1.0046
214,-0.99995
215,-0.9954
216,-0.97888
217,-0.98054
218,-0.9766600000000001
219,-0.9628399999999999
220,-0.97044
221,-0.9662299999999999
222,-0.95837
223,-0.966
224,-0.96196
225,-0.9615100000000001
226,-0.9696899999999999
227,-0.9651200000000001
228,-0.9697899999999999
229,-0.9754799999999999
230,-0.96857
231,-0.97834
232,-0.98354
233,-0.9778100000000001
234,-0.99534
235,-1.0014
236,-1.0024
237,-1.0196
238,-1.024
239,-1.0299
240,-1.045
241,-1.0468
242,-1.0564
243,-1.0681
244,-1.0664
245,-1.0794
246,-1.0874
247,-1.0823
248,-1.0975
249,-1.1001
250,-1.0944
251,-1.1044
252,-1.1003
253,-1.0953
254,-1.1005
255,-1.0924
256,-1.0911
257,-1.0934
258,-1.0817
259,-1.0831
260,-1.0806
261,-1.0648
262,-1.0691
263,-1.0629
264,-1.0478
265,-1.0508
266,-1.0404
267,-1.0284
268,-1.0283
269,-1.0147
270,-1.0062
271,-1.0025
272,-0.98529
273,-0.98041
274,-0.97349
275,-0.95268
276,-0.95019
277,-0.93814
278,-0.91555
279,-0.91246
280,-0.8957700000000001
281,-0.875
282,-0.8666
283,-0.8437600000000001
284,-0.8242
285,-0.81071
286,-0.78273
287,-0.7648
288,-0.7454
289,-0.71159
290,-0.6956399999999999
291,-0.6724100000000001
292,-0.6380399999999999
293,-0.62538
294,-0.59997
295,-0.57018
296,-0.55589
297,-0.52893
298,-0.50566
299,-0.49151999999999996
300,-0.46421
301,-0.44701
302,-0.43082
303,-0.4008
304,-0.38781
305,-0.36857
306,-0.33613000000000004
307,-0.32595999999999997
308,-0.30219
309,-0.27197
310,-0.25823
311,-0.2312
312,-0.20576999999999998
313,-0.18989
314,-0.15941
315,-0.13735999999999998
316,-0.11855999999999998
317,-0.08765099999999999
318,-0.075588
319,-0.061077
320,-0.034391000000000005
321,-0.032222
322,-0.019462
323,-0.0018390000000000001
324,-0.0053881
325,0.0025025
326,0.009196700000000002
327,0.0046661
328,0.01568
329,0.021809000000000002
330,0.028321
331,0.05455
332,0.07041499999999999
333,0.092439
334,0.12861
335,0.14135
336,0.16537000000000002
337,0.20048
338,0.21911999999999998
339,0.25415
340,0.29056
341,0.31199
342,0.34512
343,0.36982
344,0.38798
345,0.41991999999999996
346,0.43648000000000003
347,0.45348
348,0.48293
349,0.48916000000000004
350,0.5039899999999999
351,0.52793
352,0.52936
353,0.54389
354,0.5604
355,0.56207
356,0.57796
357,0.5888100000000001
358,0.59331
359,0.61333
360,0.6216
361,0.63166
362,0.65676
363,0.6621600000000001
364,0.67687
365,0.7038399999999999
366,0.7084199999999999
367,0.72665
368,0.74779
369,0.7519100000000001
370,0.7693
371,0.78172
372,0.78487
373,0.80114
374,0.80375
375,0.8039
376,0.8165399999999999
377,0.80825
378,0.80558
379,0.81357
380,0.795
381,0.78819
382,0.78481
383,0.76352
384,0.7565
385,0.7469600000000001
386,0.72835
387,0.72472
388,0.71109
389,0.69626
390,0.69615
391,0.67847
392,0.6671100000000001
393,0.6694899999999999
394,0.64715
395,0.63851
396,0.6360399999999999
397,0.615
398,0.6077600000000001
399,0.5982
400,0.57718
401,0.57012
402,0.55337
403,0.5332
404,0.52659
405,0.50233
406,0.48171
407,0.47372
408,0.4413
409,0.42065
410,0.40712
411,0.37346
412,0.35356
413,0.33321
414,0.30098
415,0.28385
416,0.25956999999999997
417,0.23108
418,0.2165
419,0.1868
420,0.16153
421,0.15209
422,0.12307
423,0.10667
424,0.10017000000000001
425,0.074199
426,0.06464299999999999
427,0.059824
428,0.045145
429,0.046737
430,0.042270999999999996
431,0.031475
432,0.034512
433,0.02424
434,0.016078
435,0.020856
436,0.0033664000000000003
437,-0.006655299999999999
438,-0.0076284
439,-0.030894
440,-0.04088
441,-0.049277999999999995
442,-0.074005
443,-0.086172
444,-0.10367
445,-0.12789
446,-0.13695
447,-0.15687
448,-0.17559
449,-0.17997
450,-0.20268
451,-0.21661
452,-0.21738000000000002
453,-0.23913
454,-0.24544000000000002
455,-0.2456
456,-0.25994
457,-0.25866999999999996
458,-0.25891
459,-0.26635
460,-0.2587
461,-0.26106
462,-0.26454
463,-0.25425
464,-0.26165
465,-0.26254
466,-0.24975
467,-0.26038
468,-0.25695
469,-0.24716
470,-0.25453000000000003
471,-0.24799000000000002
472,-0.24291999999999997
473,-0.24749000000000002
474,-0.23698000000000002
475,-0.23448000000000002
476,-0.23414000000000001
477,-0.21964
478,-0.22139
479,-0.21788000000000002
480,-0.19939
481,-0.20235
482,-0.19157000000000002
483,-0.17218
484,-0.17074
485,-0.1546
486,-0.13715
487,-0.13005999999999998
488,-0.10790999999999999
489,-0.09302300000000001
490,-0.082618
491,-0.058075999999999996
492,-0.048237
493,-0.034733
494,-0.0068043999999999995
495,-0.00051344
496,0.017032
497,0.044113
498,0.051164
499,0.071802
500,0.093832
501,0.10303
502,0.12747
503,0.14665999999999998
504,0.15971
505,0.1859
506,0.1976
507,0.2121
508,0.2438
509,0.25734
510,0.28059
511,0.31158
512,0.31669
513,0.33307
514,0.35314
515,0.36109
516,0.38561
517,0.40565999999999997
518,0.41691999999999996
519,0.44126000000000004
520,0.45274
521,0.46486000000000005
522,0.49168999999999996
523,0.49841
524,0.51302
525,0.54002
526,0.5444899999999999
527,0.5635
528,0.58749
529,0.59568
530,0.61935
531,0.6408
532,0.65374
533,0.68065
534,0.69485
535,0.7067899999999999
536,0.73325
537,0.74085
538,0.75438
539,0.77935
540,0.77636
541,0.78523
542,0.7996800000000001
543,0.79678
544,0.80938
545,0.8203
546,0.8205899999999999
547,0.83642
548,0.8437100000000001
549,0.85016
550,0.87305
551,0.8785799999999999
552,0.88944
553,0.91507
554,0.9159700000000001
555,0.9313
556,0.9552299999999999
557,0.9600700000000001
558,0.9798899999999999
559,0.9992700000000001
560,1.0068
561,1.0305
562,1.0474
563,1.0627
564,1.0959999999999999
565,1.1148
566,1.1384
567,1.1764
568,1.1883
569,1.2106
570,1.2404
571,1.2476
572,1.2682
573,1.2884
574,1.2931
575,1.3116
576,1.3216
577,1.3246
578,1.3417
579,1.3425
580,1.3453
581,1.3637
582,1.3594
583,1.3659
584,1.3827
585,1.376
586,1.3840000000000001
587,1.3954
588,1.3926
589,1.4064
590,1.4152
591,1.4172
592,1.4357
593,1.4409999999999998
594,1.4484
595,1.472
596,1.474
597,1.4861
598,1.5116
599,1.5135
600,1.5316
601,1.5544
602,1.5603
603,1.5823
604,1.6007
605,1.611
606,1.6381
607,1.6529
608,1.6671
609,1.6965
610,1.7043
611,1.7194
612,1.7479
613,1.7499
614,1.7668
615,1.7892
616,1.7923
617,1.8103
618,1.8245
619,1.8272
620,1.8453
621,1.8519
622,1.8562
623,1.8762
624,1.8766
625,1.8835
626,1.9061
627,1.9017
628,1.9122
629,1.9298
630,1.9268
631,1.9392
632,1.9503
633,1.9491
634,1.9633
635,1.9669
636,1.9662
637,1.9811
638,1.9780000000000002
639,1.9802
640,1.9980000000000002
641,1.9895
642,1.9942
643,2.0076
644,1.9991
645,2.0062
646,2.0131
647,2.006
648,2.0144
649,2.0141
650,2.0085
651,2.0185
652,2.0114
653,2.0073
654,2.0183
655,2.0042
656,2.0017
657,2.0088
658,1.9923
659,1.9909
660,1.9905
661,1.9747
662,1.9743
663,1.9664
664,1.9516
665,1.9526
666,1.9385
667,1.9267
668,1.9305
669,1.911
670,1.9017
671,1.9036
672,1.8807
673,1.8729
674,1.8678
675,1.8459999999999999
676,1.8395
677,1.827
678,1.8061
679,1.8005
680,1.7806
681,1.7608
682,1.7559
683,1.7292
684,1.7115
685,1.7068
686,1.6766
687,1.6617
688,1.6511
689,1.6228
690,1.61
691,1.5932
692,1.5667
693,1.5554
694,1.5312
695,1.5059
696,1.4956
697,1.4653
698,1.442
699,1.4323
700,1.3958
701,1.3751
702,1.3618
703,1.3313
704,1.3172
705,1.3005
706,1.2725
707,1.2599
708,1.2373
709,1.2135
710,1.2057
711,1.1801
712,1.1604
713,1.155
714,1.1241
715,1.1071
716,1.0975
717,1.0677
718,1.0528
719,1.0366
720,1.0081
721,0.9943299999999999
722,0.9714
723,0.9445
724,0.9325600000000001
725,0.9043
726,0.88065
727,0.8716700000000001
728,0.8395100000000001
729,0.8201200000000001
730,0.81017
731,0.78003
732,0.76539
733,0.7518199999999999
734,0.72533
735,0.71404
736,0.69576
737,0.67251
738,0.66425
739,0.64144
740,0.62167
741,0.61639
742,0.58941
743,0.57297
744,0.56639
745,0.53751
746,0.52282
747,0.50995
748,0.48241000000000006
749,0.46945
750,0.45078999999999997
751,0.42555
752,0.41516000000000003
753,0.39193
754,0.3702
755,0.36286
756,0.33543
757,0.31728
758,0.31111
759,0.28267
760,0.26905999999999997
761,0.25953000000000004
762,0.23471
763,0.22482
764,0.21141
765,0.19053
766,0.18464
767,0.16798
768,0.15215
769,0.15161
770,0.13329000000000002
771,0.12251
772,0.1242
773,0.10252
774,0.096441
775,0.097954
776,0.08479600000000001
777,0.086232
778,0.08373
779,0.06993300000000001
780,0.06905399999999999
781,0.05782999999999999
782,0.044655
783,0.044449
784,0.025495
785,0.010865999999999999
786,0.009159200000000001
787,-0.015535
788,-0.02624
789,-0.030151
790,-0.052265
791,-0.061251
792,-0.072188
793,-0.094515
794,-0.1037
795,-0.12217
796,-0.14419
797,-0.15203
798,-0.17411
799,-0.19012
800,-0.19143
801,-0.2141
802,-0.22516
803,-0.2282
804,-0.24811999999999998
805,-0.25101
806,-0.25081
807,-0.26236
808,-0.26342
809,-0.27545
810,-0.29278000000000004
811,-0.29359
812,-0.30527
813,-0.31511
814,-0.31801999999999997
815,-0.34834
816,-0.37003
817,-0.37806999999999996
818,-0.3999
819,-0.40635
820,-0.41343
821,-0.43436
822,-0.43728
823,-0.43982
824,-0.44942
825,-0.45905
826,-0.5009600000000001
827,-0.5534899999999999
828,-0.58808
829,-0.62335
830,-0.6308199999999999
831,-0.6200600000000001
832,-0.6342300000000001
833,-0.643
834,-0.65188
835,-0.67187
836,-0.67409
837,-0.67993
838,-0.69587
839,-0.70123
840,-0.71765
841,-0.73134
842,-0.72954
843,-0.74529
844,-0.7546
845,-0.75272
846,-0.7720100000000001
847,-0.77693
848,-0.77654
849,-0.7912600000000001
850,-0.7923
851,-0.79548
852,-0.80642
853,-0.80348
854,-0.81029
855,-0.81834
856,-0.81261
857,-0.8225600000000001
858,-0.8259
859,-0.81583
860,-0.82825
861,-0.82762
862,-0.82055
863,-0.8294100000000001
864,-0.8241700000000001
865,-0.81937
866,-0.82386
867,-0.81442
868,-0.81284
869,-0.81361
870,-0.8004
871,-0.80172
872,-0.79796
873,-0.7804399999999999
874,-0.7842399999999999
875,-0.7764800000000001
876,-0.76132
877,-0.76418
878,-0.75356
879,-0.7421399999999999
880,-0.74152
881,-0.7268899999999999
882,-0.7187399999999999
883,-0.7145
884,-0.69609
885,-0.69107
886,-0.68283
887,-0.6611199999999999
888,-0.66017
889,-0.64893
890,-0.62803
891,-0.62565
892,-0.6091
893,-0.5899800000000001
894,-0.58328
895,-0.5625
896,-0.5465399999999999
897,-0.53556
898,-0.50975
899,-0.49571000000000004
900,-0.47952
901,-0.44903999999999994
902,-0.43782
903,-0.41736
904,-0.38585
905,-0.37496
906,-0.35062
907,-0.32288
908,-0.30958
909,-0.28241
910,-0.25913
911,-0.24306
912,-0.21276
913,-0.1938
914,-0.17471
915,-0.14135
916,-0.12658
917,-0.10442
918,-0.070323
919,-0.059042
920,-0.034456
921,-0.0046174
922,0.0097265
923,0.03846
924,0.064609
925,0.081446
926,0.11205999999999999
927,0.13199
928,0.15028
929,0.18313
930,0.19851
931,0.22027
932,0.25589
933,0.26735
934,0.29231
935,0.32382
936,0.33769
937,0.36555
938,0.39186
939,0.40742
940,0.43753000000000003
941,0.45875
942,0.47723000000000004
943,0.51035
944,0.52633
945,0.5465399999999999
946,0.58063
947,0.59041
948,0.61295
949,0.64352
950,0.65479
951,0.68
952,0.7047800000000001
953,0.71716
954,0.74406
955,0.76297
956,0.7772600000000001
957,0.80589
958,0.81843
959,0.83445
960,0.8655200000000001
961,0.87449
962,0.8955
963,0.925
964,0.9313
965,0.94842
966,0.96394
967,0.9654
968,0.9832799999999999
969,0.9965700000000001
970,1.0042
971,1.0237
972,1.024
973,1.0232
974,1.0364
975,1.0294
976,1.034
977,1.048
978,1.0372
979,1.0378
980,1.0393
981,1.0259
982,1.0274
983,1.0227
984,1.0098
985,1.0106
986,0.9976700000000001
987,0.9855799999999999
988,0.9875200000000001
989,0.9685299999999999
990,0.9587700000000001
991,0.96144
992,0.9414299999999999
993,0.9347700000000001
994,0.92843
995,0.9013100000000001
996,0.8841200000000001
997,0.8594299999999999
998,0.82544
999,0.80642
1000,0.7763
1001,0.7468
1002,0.7319899999999999
1003,0.69813
1004,0.67218
1005,0.6595
1006,0.62352
1007,0.60342
1008,0.58996
1009,0.561
1010,0.5475399999999999
1011,0.5312899999999999
1012,0.50529
1013,0.49307
1014,0.46934
1015,0.44306
1016,0.42991999999999997
1017,0.39833
1018,0.37275
1019,0.3605
1020,0.32335
1021,0.29879
1022,0.27928000000000003
1023,0.24128000000000002
1024,0.2185
1025,0.19546
1026,0.1623
1027,0.14257
1028,0.11233
1029,0.078933
1030,0.061551
1031,0.031435000000000005
1032,0.0089084
1033,0.00051464
1034,-0.031928
1035,-0.053864999999999996
1036,-0.06862
1037,-0.10172
1038,-0.11950999999999999
1039,-0.13664
1040,-0.16558
1041,-0.18014000000000002
1042,-0.20140999999999998
1043,-0.22610999999999998
1044,-0.23614000000000002
1045,-0.26055
1046,-0.28156
1047,-0.28836999999999996
1048,-0.31539
1049,-0.3307
1050,-0.33596
1051,-0.36077
1052,-0.37063
1053,-0.3774
1054,-0.39599
1055,-0.3994
1056,-0.40785
1057,-0.42149
1058,-0.41995
1059,-0.42978
1060,-0.43643999999999994
1061,-0.42813999999999997
1062,-0.43896999999999997
1063,-0.44038
1064,-0.42936
1065,-0.41985
1066,-0.41407
1067,-0.4405
1068,-0.47426
1069,-0.45491000000000004
1070,-0.38968
1071,-0.3355
1072,-0.3664
1073,-0.48049
1074,-0.52947
1075,-0.40862
1076,-0.21475999999999998
1077,-0.1566
1078,-0.35817
1079,-0.63477
1080,-0.60768
1081,-0.19568
1082,0.20983000000000002
1083,0.09021
1084,-0.5943
1085,-1.126
1086,-0.68065
1087,0.6451
1088,1.5497
1089,0.37032
1090,-3.4486
1091,-8.6077
