time,value
0,-0.13245
1,-0.13245
2,-0.13245
3,-0.13245
4,-0.13245
5,-0.13245
6,-0.13245
7,-0.13245
8,-0.13245
9,-0.13245
10,-0.13245
11,-0.13245
12,-0.13245
13,-0.13245
14,-0.13245
15,-0.13245
16,-0.13245
17,-0.13245
18,-0.13245
19,-0.13245
20,-0.13245
21,-0.13245
22,-0.13245
23,-0.13245
24,-0.13245
25,-0.13245
26,-0.13245
27,-0.13245
28,-0.13245
29,-0.13245
30,-0.13245
31,-0.13245
32,-0.13245
33,9.1919
34,-0.13245
35,-0.13245
36,2.9757
37,0.15011
38,-0.13245
39,-0.13245
40,-0.13245
41,-0.13245
42,-0.13245
43,-0.13245
44,-0.13245
45,-0.13245
46,-0.13245
47,-0.13245
48,-0.13245
49,-0.13245
50,-0.13245
51,-0.13245
52,-0.13245
53,-0.13245
54,-0.13245
55,-0.13245
56,-0.13245
57,-0.13245
58,-0.13245
59,-0.13245
60,-0.13245
61,-0.13245
62,-0.13245
63,-0.13245
64,-0.13245
65,-0.13245
66,-0.13245
67,-0.13245
68,-0.13245
69,-0.13245
70,-0.13245
71,-0.13245
72,-0.13245
73,-0.13245
74,-0.13245
75,-0.13245
76,-0.13245
77,-0.13245
78,-0.13245
79,-0.13245
80,-0.13245
81,-0.13245
82,-0.13245
83,-0.13245
84,-0.13245
85,-0.13245
86,-0.13245
87,-0.13245
88,-0.13245
89,-0.13245
90,-0.13245
91,-0.13245
92,-0.13245
93,-0.13245
94,-0.13245
95,-0.13245
