time,value
0,-2.3315
1,-2.3315
2,-2.3335
3,-2.3395
4,-2.3474
5,-2.3474
6,-2.3474
7,-2.3474
8,-2.3472
9,-2.3469
10,-2.3464
11,-2.3458
12,-2.3452
13,-2.3464
14,-2.3453
15,-2.3443
16,-2.3432
17,-2.342
18,-2.3403
19,-2.3388
20,-2.3373
21,-2.3356
22,-2.3334
23,-2.3315
24,-2.3294
25,-2.3273
26,-2.3246
27,-2.3223
28,-2.3198
29,-2.3173
30,-2.314
31,-2.3113
32,-2.3085
33,-2.3056
34,-2.3018
35,-2.2987
36,-2.2955
37,-2.2922
38,-2.2880000000000003
39,-2.2846
40,-2.281
41,-2.2774
42,-2.271
43,-2.2672
44,-2.2634
45,-2.2594
46,-2.2544
47,-2.2503
48,-2.2461
49,-2.2419
50,-2.2365
51,-2.2321
52,-2.2277
53,-2.2232
54,-2.2175
55,-2.2128
56,-2.2081
57,-2.2034
58,-2.1973
59,-2.1918
60,-2.1842
61,-2.1790000000000003
62,-2.171
63,-2.1635
64,-2.1579
65,-2.153
66,-2.1468
67,-2.1418
68,-2.1367
69,-2.1301
70,-2.1236
71,-2.1184
72,-2.1132
73,-2.1079
74,-2.1012
75,-2.0973
76,-2.0918
77,-2.0863
78,-2.0794
79,-2.0739
80,-2.0683
81,-2.0612
82,-2.0555
83,-2.0498
84,-2.044
85,-2.0368
86,-2.0309
87,-2.0251
88,-2.0191
89,-2.0117
90,-2.0044
91,-1.9984
92,-1.9924
93,-1.9848
94,-1.9788
95,-1.9726
96,-1.9665
97,-1.9588
98,-1.9526
99,-1.9463
100,-1.9413
101,-1.9335
102,-1.9271
103,-1.9208
104,-1.9144
105,-1.9065
106,-1.9
107,-1.8936
108,-1.8872
109,-1.8791
110,-1.8726
111,-1.8659999999999999
112,-1.8595
113,-1.8513
114,-1.8436
115,-1.837
116,-1.8304
117,-1.8221
118,-1.8159999999999998
119,-1.8099
120,-1.8028
121,-1.7945
122,-1.7878
123,-1.7811
124,-1.7744
125,-1.765
126,-1.7583
127,-1.7515
128,-1.7448
129,-1.7363
130,-1.7295
131,-1.7237
132,-1.7171
133,-1.7087
134,-1.7019
135,-1.6951
136,-1.6883
137,-1.6787
138,-1.6719
139,-1.665
140,-1.6581
141,-1.6495
142,-1.6426
143,-1.6355
144,-1.6298
145,-1.6236
146,-1.6167
147,-1.6098
148,-1.6019
149,-1.5933
150,-1.5863
151,-1.5794
152,-1.5732
153,-1.5666
154,-1.5604
155,-1.5535
156,-1.5448
157,-1.5368
158,-1.5299
159,-1.5229
160,-1.5141
161,-1.5087
162,-1.5032
163,-1.4969999999999999
164,-1.4883
165,-1.4803
166,-1.4733
167,-1.4663
168,-1.4582
169,-1.4527
170,-1.4457
171,-1.4387
172,-1.4289
173,-1.4219
174,-1.4149
175,-1.4086
176,-1.4013
177,-1.3943
178,-1.3863
179,-1.3793
180,-1.3719999999999999
181,-1.3657
182,-1.3578
183,-1.3507
184,-1.3419
185,-1.3365
186,-1.3319
187,-1.3249
188,-1.3151
189,-1.3081
190,-1.301
191,-1.2931
192,-1.285
193,-1.2787
194,-1.2717
195,-1.2637
196,-1.2548
197,-1.2494
198,-1.2431
199,-1.2361
200,-1.2272
201,-1.2202
202,-1.2122
203,-1.2051
204,-1.1962
205,-1.19
206,-1.1882
207,-1.1829
208,-1.1731
209,-1.1651
210,-1.1615
211,-1.1589
212,-1.1491
213,-1.1420000000000001
214,-1.1420000000000001
215,-1.1384
216,-1.1286
217,-1.1224
218,-1.1188
219,-1.1117
220,-1.1028
221,-1.0957
222,-1.0885
223,-1.0814
224,-1.0725
225,-1.0653
226,-1.0573
227,-1.0501
228,-1.0411
229,-1.0339
230,-1.0268
231,-1.0214
232,-1.0135
233,-1.0055
234,-0.99929
235,-0.99405
236,-0.98874
237,-0.98157
238,-0.97439
239,-0.9654200000000001
240,-0.9582299999999999
241,-0.9501799999999999
242,-0.94299
243,-0.9339799999999999
244,-0.9267700000000001
245,-0.91956
246,-0.9143899999999999
247,-0.90645
248,-0.8992399999999999
249,-0.8920299999999999
250,-0.88482
251,-0.87495
252,-0.8677299999999999
253,-0.86049
254,-0.85326
255,-0.8442
256,-0.8377700000000001
257,-0.83052
258,-0.82326
259,-0.8168
260,-0.8182
261,-0.81615
262,-0.80886
263,-0.79973
264,-0.79243
265,-0.7851199999999999
266,-0.7778
267,-0.76865
268,-0.76055
269,-0.75638
270,-0.74854
271,-0.73861
272,-0.73129
273,-0.72319
274,-0.72136
275,-0.71586
276,-0.70854
277,-0.7012
278,-0.69753
279,-0.69463
280,-0.68729
281,-0.67994
282,-0.6733399999999999
283,-0.66414
284,-0.65678
285,-0.6571899999999999
286,-0.65832
287,-0.64983
288,-0.6476
289,-0.6439
290,-0.63649
291,-0.6272300000000001
292,-0.6198199999999999
293,-0.61426
294,-0.6124
295,-0.6054
296,-0.59726
297,-0.59251
298,-0.58662
299,-0.57736
300,-0.56922
301,-0.56109
302,-0.55632
303,-0.5493100000000001
304,-0.5419
305,-0.5345
306,-0.52709
307,-0.51782
308,-0.50968
309,-0.50226
310,-0.49299
311,-0.48628000000000005
312,-0.47884
313,-0.47141000000000005
314,-0.46211
315,-0.45466999999999996
316,-0.44722
317,-0.44303000000000003
318,-0.44277
319,-0.43531000000000003
320,-0.42783999999999994
321,-0.42103999999999997
322,-0.41747
323,-0.4156
324,-0.40811
325,-0.40062
326,-0.39126
327,-0.38563000000000003
328,-0.38495999999999997
329,-0.3804
330,-0.3777
331,-0.37208
332,-0.3646
333,-0.35711
334,-0.34775
335,-0.34026
336,-0.33905
337,-0.34171999999999997
338,-0.34313
339,-0.34321
340,-0.33569
341,-0.32816999999999996
342,-0.31875
343,-0.31122
344,-0.30369
345,-0.2974
346,-0.29418
347,-0.28969
348,-0.28707
349,-0.28078000000000003
350,-0.27195
351,-0.26743
352,-0.26048000000000004
353,-0.25297
354,-0.24359
355,-0.23608
356,-0.22857
357,-0.22105
358,-0.21166
359,-0.20414000000000002
360,-0.19662000000000002
361,-0.18844
362,-0.17968
363,-0.17151
364,-0.16462000000000002
365,-0.15708
366,-0.14765999999999999
367,-0.14012
368,-0.13258
369,-0.12503
370,-0.1156
371,-0.10805
372,-0.10049
373,-0.092939
374,-0.083493
375,-0.075931
376,-0.06837
377,-0.06080599999999999
378,-0.050730000000000004
379,-0.043162
380,-0.035593
381,-0.028022000000000002
382,-0.018556
383,-0.01037
384,-0.0060261
385,-0.0010101
386,0.008451899999999998
387,0.016636
388,0.024208
389,0.029177999999999996
390,0.034199
391,0.041762
392,0.04933
393,0.059405999999999994
394,0.066976
395,0.07516
396,0.07951799999999999
397,0.08642799999999999
398,0.09399400000000001
399,0.10156
400,0.10974
401,0.11921
402,0.1255
403,0.12986
404,0.13488
405,0.14432999999999999
406,0.1519
407,0.16008
408,0.16765
409,0.17645
410,0.18081
411,0.18711
412,0.19529000000000002
413,0.20475
414,0.21104
415,0.21541
416,0.21854
417,0.22799
418,0.23618000000000003
419,0.24374
420,0.2513
421,0.26138
422,0.26324000000000003
423,0.26888
424,0.27644
425,0.28589000000000003
426,0.29408
427,0.30164
428,0.30921
429,0.31867
430,0.32623
431,0.33381
432,0.34138
433,0.35085
434,0.35775
435,0.3621
436,0.36839
437,0.37719
438,0.37966
439,0.38404
440,0.38654
441,0.39346
442,0.40101
443,0.40857
444,0.41612
445,0.42557
446,0.43375
447,0.44131000000000004
448,0.44888
449,0.45833
450,0.4659
451,0.47347
452,0.48103999999999997
453,0.4905
454,0.49423
455,0.50049
456,0.50805
457,0.51751
458,0.52508
459,0.53265
460,0.54023
461,0.5503
462,0.55788
463,0.5654600000000001
464,0.57304
465,0.5825100000000001
466,0.5888100000000001
467,0.59313
468,0.6000300000000001
469,0.60761
470,0.61519
471,0.6227699999999999
472,0.6322399999999999
473,0.63983
474,0.64741
475,0.64691
476,0.64393
477,0.64157
478,0.64112
479,0.6388
480,0.6370600000000001
481,0.6370600000000001
482,0.63285
483,0.6322800000000001
484,0.63057
485,0.6283
486,0.6220100000000001
487,0.61438
488,0.60427
489,0.59665
490,0.58902
491,0.58463
492,0.57799
493,0.56979
494,0.5615899999999999
495,0.55396
496,0.5465399999999999
497,0.5423899999999999
498,0.53475
499,0.52655
500,0.5170100000000001
501,0.51207
502,0.5079199999999999
503,0.49916000000000005
504,0.49041
505,0.4882
506,0.48191000000000006
507,0.47371
508,0.46905
509,0.46221999999999996
510,0.45457
511,0.44637
512,0.43762
513,0.43353
514,0.42725
515,0.42096000000000006
516,0.41658999999999996
517,0.41085
518,0.40265
519,0.39444
520,0.38953000000000004
521,0.38708000000000004
522,0.37888
523,0.37122
524,0.3693
525,0.36546999999999996
526,0.35727
527,0.34962
528,0.34004
529,0.3365
530,0.33243
531,0.32423
532,0.3174
533,0.31335
534,0.30706
535,0.2994
536,0.28928000000000004
537,0.28353
538,0.28160999999999997
539,0.27778
540,0.27203
541,0.2682
542,0.26053000000000004
543,0.25042
544,0.24276
545,0.2351
546,0.22744
547,0.2187
548,0.21654
549,0.20886999999999997
550,0.20121
551,0.1911
552,0.18344000000000002
553,0.17578
554,0.17087
555,0.16434
556,0.15667999999999999
557,0.14902
558,0.14135
559,0.13124
560,0.12358
561,0.11592000000000001
562,0.10826
563,0.10418
564,0.098734
565,0.09106900000000001
566,0.08340800000000001
567,0.073291
568,0.06563200000000001
569,0.057976
570,0.054436
571,0.048451999999999995
572,0.040787000000000004
573,0.033124
574,0.024924
575,0.01948
576,0.015431
577,0.0077619
578,9.2933e-05
579,-0.010026
580,-0.017692
581,-0.025356999999999998
582,-0.030798000000000002
583,-0.034841000000000004
584,-0.042512
585,-0.050713999999999995
586,-0.058385
587,-0.0652
588,-0.069231
589,-0.07359500000000001
590,-0.081272
591,-0.091392
592,-0.099067
593,-0.10309000000000001
594,-0.1085
595,-0.1181
596,-0.1263
597,-0.13398
598,-0.13606
599,-0.14338
600,-0.15158
601,-0.15556
602,-0.16093
603,-0.17106
604,-0.17501
605,-0.17844000000000002
606,-0.18664
607,-0.19391
608,-0.19780999999999999
609,-0.20601999999999998
610,-0.21229
611,-0.21666
612,-0.21859
613,-0.22049000000000002
614,-0.2253
615,-0.22624
616,-0.2281
617,-0.22994
618,-0.23176
619,-0.23310999999999998
620,-0.23012
621,-0.23188000000000003
622,-0.22887
623,-0.22930999999999999
624,-0.2306
625,-0.23035999999999998
626,-0.22857
627,-0.22704000000000002
628,-0.22551
629,-0.2252
630,-0.22721
631,-0.22760999999999998
632,-0.2284
633,-0.22996999999999998
634,-0.22995
635,-0.23146
636,-0.22365
637,-0.21816
638,-0.21805
639,-0.21291
640,-0.20508
641,-0.19725
642,-0.18747
643,-0.17964000000000002
644,-0.17181
645,-0.16398
646,-0.15419000000000002
647,-0.14636
648,-0.13852
649,-0.13104000000000002
650,-0.12124000000000001
651,-0.11341
652,-0.10557000000000001
653,-0.097734
654,-0.09714500000000001
655,-0.094238
656,-0.086392
657,-0.078546
658,-0.06906799999999999
659,-0.061220000000000004
660,-0.05337000000000001
661,-0.050101
662,-0.049753
663,-0.041895
664,-0.034039
665,-0.026181
666,-0.016359000000000002
667,-0.0084991
668,-0.00095407
669,0.006907899999999999
670,0.016734
671,0.024596
672,0.032458
673,0.040322000000000004
674,0.050151
675,0.058015
676,0.065879
677,0.073745
678,0.083577
679,0.091443
680,0.099311
681,0.10718
682,0.11731
683,0.12517999999999999
684,0.13305
685,0.14092000000000002
686,0.15075
687,0.15862
688,0.16649
689,0.17436
690,0.1842
691,0.19207
692,0.19995
693,0.20506999999999997
694,0.21186999999999998
695,0.21973
696,0.2276
697,0.23744
698,0.24531
699,0.25318
700,0.26134
701,0.27118000000000003
702,0.27905
703,0.28692
704,0.29479
705,0.29962
706,0.30475
707,0.31262
708,0.32049
709,0.33032
710,0.33849
711,0.34636
712,0.35423000000000004
713,0.36407
714,0.37194
715,0.37981
716,0.38768
717,0.39752
718,0.40539000000000003
719,0.41158999999999996
720,0.41473999999999994
721,0.42125
722,0.42911000000000005
723,0.43698000000000004
724,0.44515
725,0.45498
726,0.46285
727,0.47071999999999997
728,0.47722
729,0.4807
730,0.48857
731,0.49643000000000004
732,0.5043
733,0.51413
734,0.522
735,0.52987
736,0.53774
737,0.54757
738,0.5554399999999999
739,0.5633100000000001
740,0.57118
741,0.58102
742,0.5888899999999999
743,0.5967600000000001
744,0.60463
745,0.61447
746,0.62234
747,0.63021
748,0.6380899999999999
749,0.64793
750,0.6499
751,0.6558
752,0.66368
753,0.66761
754,0.66987
755,0.67104
756,0.67587
757,0.6859999999999999
758,0.68917
759,0.69402
760,0.7018800000000001
761,0.70612
762,0.71005
763,0.71595
764,0.71792
765,0.72578
766,0.73365
767,0.74152
768,0.74938
769,0.75922
770,0.7670899999999999
771,0.77466
772,0.78282
773,0.79266
774,0.80023
775,0.8081
776,0.81794
777,0.82581
778,0.8336899999999999
779,0.8415600000000001
780,0.8514
781,0.8592700000000001
782,0.86715
783,0.87502
784,0.8848600000000001
785,0.89274
786,0.90061
787,0.9087799999999999
788,0.9186200000000001
789,0.9265
790,0.93437
791,0.94225
792,0.95209
793,0.9599700000000001
794,0.96785
795,0.9757299999999999
796,0.9855700000000001
797,0.99345
798,1.0016
799,1.0042
800,1.0112
801,1.0191
802,1.0270000000000001
803,1.0351
804,1.045
805,1.0531
806,1.0563
807,1.0608
808,1.0706
809,1.0785
810,1.0867
811,1.0945
812,1.103
813,1.1058
814,1.1117
815,1.1196
816,1.1295
817,1.1373
818,1.1452
819,1.1469
820,1.1474
821,1.1463
822,1.1494
823,1.1572
824,1.1668
825,1.1744
826,1.1733
827,1.1722
828,1.1709
829,1.1699
830,1.1708
831,1.1698
832,1.1685
833,1.1675
834,1.1666
835,1.1663
836,1.1659
837,1.1652
838,1.1649
839,1.1642
840,1.1631
841,1.1602
842,1.1576
843,1.1497
844,1.1398
845,1.1319
846,1.124
847,1.1158
848,1.1059
849,1.0979999999999999
850,1.0901
851,1.0822
852,1.0723
853,1.0644
854,1.0565
855,1.0466
856,1.0387
857,1.0308
858,1.0229
859,1.0132
860,1.0051
861,0.9974200000000001
862,0.98951
863,0.9796299999999999
864,0.97172
865,0.96359
866,0.95568
867,0.9458
868,0.93789
869,0.92999
870,0.9238299999999999
871,0.92071
872,0.91653
873,0.9086200000000001
874,0.9007200000000001
875,0.89061
876,0.8827
877,0.87479
878,0.87192
879,0.8673
880,0.85939
881,0.8514799999999999
882,0.84335
883,0.8334600000000001
884,0.8253299999999999
885,0.8224799999999999
886,0.8181
887,0.8082
888,0.80029
889,0.7921600000000001
890,0.78425
891,0.77612
892,0.7733
893,0.7689199999999999
894,0.7608
895,0.7558199999999999
896,0.74948
897,0.74156
898,0.73344
899,0.7255199999999999
900,0.72354
901,0.71562
902,0.7077
903,0.69781
904,0.69781
905,0.69385
906,0.68613
907,0.6806
908,0.67862
909,0.67071
910,0.66279
911,0.6529
912,0.6469600000000001
913,0.64477
914,0.63665
915,0.62655
916,0.61863
917,0.61406
918,0.61127
919,0.60335
920,0.59544
921,0.58731
922,0.5794
923,0.5695
924,0.5655399999999999
925,0.5635600000000001
926,0.55762
927,0.5516800000000001
928,0.55148
929,0.5433600000000001
930,0.5330600000000001
931,0.5251399999999999
932,0.51722
933,0.51722
934,0.51069
935,0.5027699999999999
936,0.49485
937,0.48693000000000003
938,0.47703
939,0.46911
940,0.46098999999999996
941,0.45307
942,0.44337
943,0.43545
944,0.42753
945,0.41961000000000004
946,0.40972
947,0.4018
948,0.39388
949,0.38595999999999997
950,0.37606
951,0.36794
952,0.36003
953,0.35211
954,0.34221
955,0.3343
956,0.32638
957,0.31845999999999997
958,0.30856999999999996
959,0.30065
960,0.29273000000000005
961,0.28481999999999996
962,0.27492
963,0.26700999999999997
964,0.25909
965,0.25118
966,0.24639
967,0.24181999999999998
968,0.2339
969,0.22598000000000001
970,0.21608000000000002
971,0.20817
972,0.20004
973,0.19213
974,0.18223
975,0.17431
976,0.1664
977,0.15847999999999998
978,0.14859
979,0.14067000000000002
980,0.13432
981,0.13153
982,0.12340999999999999
983,0.11549000000000001
984,0.10757
985,0.099452
986,0.08955199999999999
987,0.081635
988,0.073715
989,0.069156
990,0.064413
991,0.056491
992,0.04857
993,0.04065
994,0.030552999999999997
995,0.022632
996,0.020073
997,0.017341
998,0.007434899999999999
999,-0.00067507
1000,-0.0086011
1001,-0.013113999999999999
1002,-0.017796
1003,-0.025723000000000003
1004,-0.033828
1005,-0.041756
1006,-0.046245
1007,-0.050891000000000006
1008,-0.05899
1009,-0.063612
1010,-0.068057
1011,-0.07615
1012,-0.080428
1013,-0.08118099999999999
1014,-0.083743
1015,-0.084299
1016,-0.08443400000000001
1017,-0.084832
1018,-0.08534299999999999
1019,-0.085592
1020,-0.085713
1021,-0.0863
1022,-0.084756
1023,-0.085178
1024,-0.07942
1025,-0.071667
1026,-0.070053
1027,-0.064356
1028,-0.056405
1029,-0.054831
1030,-0.05101
1031,-0.043133
1032,-0.039376
1033,-0.033681
1034,-0.025725
1035,-0.017834
1036,-0.0098781
1037,-0.0078901
1038,-0.0019871
1039,0.0058499
1040,0.0097699
1041,0.013634
1042,0.021537
1043,0.023527
1044,0.025515
1045,0.035460000000000005
1046,0.043418
1047,0.051321000000000006
1048,0.055202
1049,0.057005999999999994
1050,0.06492200000000001
1051,0.072879
1052,0.08079700000000001
1053,0.084659
1054,0.086516
1055,0.094443
1056,0.10041
1057,0.10227
1058,0.11019000000000001
1059,0.11612
1060,0.11805
1061,0.12598
1062,0.13394
1063,0.1419
1064,0.14986
1065,0.1598
1066,0.16776
1067,0.17572000000000002
1068,0.18367999999999998
1069,0.19363
1070,0.1956
1071,0.19957
1072,0.20753000000000002
1073,0.21748
1074,0.22544
1075,0.2334
1076,0.24136
1077,0.25131
1078,0.25927
1079,0.26723
1080,0.27519
1081,0.28514
1082,0.2931
1083,0.30106
1084,0.311
1085,0.31895999999999997
1086,0.32692
1087,0.33488
1088,0.34483
1089,0.35279
1090,0.36075
1091,0.36871
1092,0.37866
1093,0.38661999999999996
1094,0.39458000000000004
1095,0.40254
1096,0.41248999999999997
1097,0.42045
1098,0.42841
1099,0.43637
1100,0.44632
1101,0.45031000000000004
1102,0.45233
1103,0.46029
1104,0.47023000000000004
1105,0.47818999999999995
1106,0.48615
1107,0.49411000000000005
1108,0.5040600000000001
1109,0.51202
1110,0.51998
1111,0.52794
1112,0.5379
1113,0.54586
1114,0.55381
1115,0.56177
1116,0.57172
1117,0.57968
1118,0.58763
1119,0.59559
1120,0.60554
1121,0.6135
1122,0.61347
1123,0.61744
1124,0.62739
1125,0.63535
1126,0.64331
1127,0.65127
1128,0.66122
1129,0.66918
1130,0.67714
1131,0.6851
1132,0.69505
1133,0.70301
1134,0.71097
1135,0.7189300000000001
1136,0.72887
1137,0.73683
1138,0.74479
1139,0.75275
1140,0.75476
1141,0.76075
1142,0.76871
1143,0.77668
1144,0.78465
1145,0.78669
1146,0.79069
1147,0.79864
1148,0.8085899999999999
1149,0.81655
1150,0.8245100000000001
1151,0.83247
1152,0.83641
1153,0.83835
1154,0.8383200000000001
1155,0.8423
1156,0.85225
1157,0.8602
1158,0.86816
1159,0.8761200000000001
1160,0.88607
1161,0.8940299999999999
1162,0.90199
1163,0.91194
1164,0.91394
1165,0.91596
1166,0.9239200000000001
1167,0.93386
1168,0.94183
1169,0.9497899999999999
1170,0.95775
1171,0.9677
1172,0.97567
1173,0.9777100000000001
1174,0.98172
1175,0.99167
1176,0.9996299999999999
1177,1.0076
1178,1.0155
1179,1.0255
1180,1.0335
1181,1.0414
1182,1.0494
1183,1.0593
1184,1.0673
1185,1.0753
1186,1.0832
1187,1.0932
1188,1.1011
1189,1.1091
1190,1.117
1191,1.127
1192,1.135
1193,1.1429
1194,1.1509
1195,1.1608
1196,1.1688
1197,1.1767
1198,1.1847
1199,1.1946
1200,1.2026
1201,1.2105
1202,1.2185
1203,1.2285
1204,1.2344
1205,1.2364
1206,1.2443
1207,1.2543
1208,1.2622
1209,1.2702
1210,1.2781
1211,1.2802
1212,1.2842
1213,1.2921
1214,1.3001
1215,1.31
1216,1.318
1217,1.3259999999999998
1218,1.3259999999999998
1219,1.3262
1220,1.3263
1221,1.3284
1222,1.3285
1223,1.3286
1224,1.3286
1225,1.3346
1226,1.3425
1227,1.3465
1228,1.3505
1229,1.3584
1230,1.3623
1231,1.3621
1232,1.364
1233,1.3639
1234,1.3638
1235,1.3678
1236,1.3757
1237,1.3837
1238,1.3917
1239,1.4016
1240,1.4056
1241,1.4077
1242,1.4176
1243,1.4256
1244,1.4336
1245,1.4415
1246,1.4515
1247,1.4594
1248,1.4674
1249,1.4754
1250,1.4853
1251,1.4933
1252,1.5012
1253,1.5092
1254,1.5191
1255,1.5271
1256,1.535
1257,1.5430000000000001
1258,1.5529
1259,1.5609
1260,1.5689
1261,1.5689
1262,1.5748
1263,1.5808
1264,1.5828
1265,1.5887
1266,1.5987
1267,1.6067
1268,1.6146
1269,1.6226
1270,1.6227
1271,1.6228
1272,1.6229
1273,1.6230000000000002
1274,1.6232
1275,1.6213
1276,1.6134
1277,1.6054
1278,1.5995
1279,1.5977
1280,1.5938
1281,1.5858
1282,1.5759
1283,1.5679
1284,1.56
1285,1.5519999999999998
1286,1.5421
1287,1.5341
1288,1.5262
1289,1.5203
1290,1.5185
1291,1.5126
1292,1.5047
1293,1.4968
1294,1.4868
1295,1.4789
1296,1.475
1297,1.4732
1298,1.4674
1299,1.4594
1300,1.4515
1301,1.4436
1302,1.4336
1303,1.4257
1304,1.4259
1305,1.4242
1306,1.4246
1307,1.4208
1308,1.4129
1309,1.4089
1310,1.4049
1311,1.399
1312,1.3969999999999998
1313,1.391
1314,1.3829
1315,1.3826
1316,1.3803
1317,1.3803
1318,1.3723
1319,1.3644
1320,1.3564
1321,1.3465
1322,1.3465
1323,1.3448
1324,1.3451
1325,1.3393
1326,1.3314
1327,1.3234
1328,1.3156
1329,1.314
1330,1.3101
1331,1.3022
1332,1.2942
1333,1.2843
1334,1.2763
1335,1.2684
1336,1.2604
1337,1.2541
1338,1.2499
1339,1.2419
1340,1.234
1341,1.224
1342,1.2161
1343,1.2081
1344,1.2001
1345,1.1901
1346,1.1822
1347,1.1742
1348,1.1663
1349,1.1563
1350,1.1484
1351,1.1404
1352,1.1325
1353,1.1226
1354,1.1146
1355,1.1066
1356,1.0987
1357,1.0888
1358,1.0808
1359,1.0728
1360,1.065
1361,1.055
1362,1.0471
1363,1.0391
1364,1.0312
1365,1.0276
1366,1.0239
1367,1.0159
1368,1.008
1369,0.9981399999999999
1370,0.99018
1371,0.9822299999999999
1372,0.9742799999999999
1373,0.9664299999999999
1374,0.96485
1375,0.9610799999999999
1376,0.9531299999999999
1377,0.9432
1378,0.93535
1379,0.9274
1380,0.91956
1381,0.9181299999999999
1382,0.9103
1383,0.9024700000000001
1384,0.8945200000000001
1385,0.8886799999999999
1386,0.8847
1387,0.87676
1388,0.8688100000000001
1389,0.86087
1390,0.8587600000000001
1391,0.8547899999999999
1392,0.84673
1393,0.84429
1394,0.84186
1395,0.8414299999999999
1396,0.8352700000000001
1397,0.82732
1398,0.81937
1399,0.81142
1400,0.8014899999999999
1401,0.7935399999999999
1402,0.78988
1403,0.7882100000000001
1404,0.77828
1405,0.7703300000000001
1406,0.7625
1407,0.75455
1408,0.74461
1409,0.74308
1410,0.73946
1411,0.73152
1412,0.72159
1413,0.7136399999999999
1414,0.7057
1415,0.69776
1416,0.68782
1417,0.67988
1418,0.67194
1419,0.6676
1420,0.66515
1421,0.6572
1422,0.6492600000000001
1423,0.6412
1424,0.63126
1425,0.62332
1426,0.62088
1427,0.61658
1428,0.60665
1429,0.5987
1430,0.59075
1431,0.5828
1432,0.57276
1433,0.56481
1434,0.55687
1435,0.54892
1436,0.53898
1437,0.53104
1438,0.5230899999999999
1439,0.51525
1440,0.50532
1441,0.49737
1442,0.48941999999999997
1443,0.48147
1444,0.47363999999999995
1445,0.47165
1446,0.46768000000000004
1447,0.45985
1448,0.45003000000000004
1449,0.44628999999999996
1450,0.44442
1451,0.4366
1452,0.42667
1453,0.42468
1454,0.42268999999999995
1455,0.41475
1456,0.40481999999999996
1457,0.39688
1458,0.38893
1459,0.38099
1460,0.37106
1461,0.36696
1462,0.3645
1463,0.35831
1464,0.35002
1465,0.34759
1466,0.33954
1467,0.33159
1468,0.32155
1469,0.31726
1470,0.31289
1471,0.30295
1472,0.295
1473,0.28705
1474,0.2791
1475,0.26916
1476,0.26121
1477,0.25327
1478,0.24531999999999998
1479,0.23538
1480,0.2337
1481,0.23214
1482,0.22419
1483,0.21425
1484,0.2063
1485,0.19835999999999998
1486,0.19041
1487,0.18048
1488,0.17264000000000002
1489,0.1647
1490,0.15675
1491,0.14681
1492,0.13887
1493,0.13734000000000002
1494,0.13572
1495,0.12579
1496,0.11797
1497,0.11002999999999999
1498,0.10842
1499,0.10497999999999999
1500,0.09703400000000001
1501,0.089228
1502,0.081289
1503,0.077735
1504,0.076324
1505,0.070518
1506,0.062727
1507,0.06150800000000001
1508,0.053729
1509,0.045955
1510,0.038021
1511,0.032394
1512,0.031073000000000003
1513,0.025294
1514,0.017365000000000002
1515,0.007452899999999999
1516,-0.00047807
1517,-0.0082351
1518,-0.016163999999999998
1519,-0.026074
1520,-0.029687
1521,-0.028967000000000003
1522,-0.030205000000000003
1523,-0.029245
1524,-0.037167
1525,-0.040733
1526,-0.039927
1527,-0.038888
1528,-0.038033
1529,-0.037157
1530,-0.036258
1531,-0.031617
1532,-0.023481000000000002
1533,-0.02278
1534,-0.021825
1535,-0.020604
1536,-0.019601
1537,-0.016604
1538,-0.015559
1539,-0.014224
1540,-0.013130000000000001
1541,-0.012017
1542,-0.007512100000000001
1543,0.0023349
1544,0.010498
1545,0.018376
1546,0.019516
1547,0.022938
1548,0.024124
1549,0.028658999999999997
1550,0.038495
1551,0.046662999999999996
1552,0.054530999999999996
1553,0.057709
1554,0.062562
1555,0.070734
1556,0.075598
1557,0.078823
1558,0.088645
1559,0.096819
1560,0.10468
1561,0.10792
1562,0.1115
1563,0.11282
1564,0.11740999999999999
1565,0.12559
1566,0.1354
1567,0.14357999999999999
1568,0.14689000000000002
1569,0.15345
1570,0.16197
1571,0.16530999999999998
1572,0.16993
1573,0.17776
1574,0.18756
1575,0.19574
1576,0.20357999999999998
1577,0.21141999999999997
1578,0.21511999999999998
1579,0.2217
1580,0.22953
1581,0.23736999999999997
1582,0.24750999999999998
1583,0.25535
1584,0.26193
1585,0.2653
1586,0.27349
1587,0.28131999999999996
1588,0.28915
1589,0.29698
1590,0.30713
1591,0.31496
1592,0.32279
1593,0.33061999999999997
1594,0.34042
1595,0.34539000000000003
1596,0.34878000000000003
1597,0.35661
1598,0.3664
1599,0.37423
1600,0.38206
1601,0.39024000000000003
1602,0.40003
1603,0.40786
1604,0.4157
1605,0.42353
1606,0.43332
1607,0.4399
1608,0.44328
1609,0.45147
1610,0.46126000000000006
1611,0.46908999999999995
1612,0.47726999999999997
1613,0.48511000000000004
1614,0.49488999999999994
1615,0.50273
1616,0.50539
1617,0.50878
1618,0.51893
1619,0.52676
1620,0.53459
1621,0.54242
1622,0.5522
1623,0.56003
1624,0.56787
1625,0.5757
1626,0.58549
1627,0.59367
1628,0.60151
1629,0.6113
1630,0.6191300000000001
1631,0.62697
1632,0.63355
1633,0.6372800000000001
1634,0.6451100000000001
1635,0.65294
1636,0.66077
1637,0.67056
1638,0.67875
1639,0.68658
1640,0.6944100000000001
1641,0.70421
1642,0.71204
1643,0.7147
1644,0.71808
1645,0.72627
1646,0.7341
1647,0.74228
1648,0.74851
1649,0.7511800000000001
1650,0.7570600000000001
1651,0.76489
1652,0.77272
1653,0.78251
1654,0.78446
1655,0.78732
1656,0.79515
1657,0.80495
1658,0.8127800000000001
1659,0.8206200000000001
1660,0.82845
1661,0.83825
1662,0.84321
1663,0.8462299999999999
1664,0.85441
1665,0.86135
1666,0.86474
1667,0.8729299999999999
1668,0.88075
1669,0.8909
1670,0.8955299999999999
1671,0.89894
1672,0.90517
1673,0.91495
1674,0.9227799999999999
1675,0.9309700000000001
1676,0.93879
1677,0.94575
1678,0.9511299999999999
1679,0.95895
1680,0.96678
1681,0.9769200000000001
1682,0.98475
1683,0.9925700000000001
1684,0.9975799999999999
1685,1.001
1686,1.0088
1687,1.0167
1688,1.0245
1689,1.0343
1690,1.0421
1691,1.0499
1692,1.0577
1693,1.0675
1694,1.0753
1695,1.0831
1696,1.091
1697,1.1008
1698,1.1086
1699,1.1164
1700,1.1242
1701,1.1340000000000001
1702,1.1418
1703,1.15
1704,1.1598
1705,1.1677
1706,1.1755
1707,1.1833
1708,1.1863
1709,1.1917
1710,1.1995
1711,1.2038
1712,1.2038
1713,1.2068
1714,1.2076
1715,1.2103
1716,1.216
1717,1.2195
1718,1.2222
1719,1.2222
1720,1.2261
1721,1.2339
1722,1.2417
1723,1.2456
1724,1.2468
1725,1.2454
1726,1.2439
1727,1.2513
1728,1.2572
1729,1.2611
1730,1.2689
1731,1.2768
1732,1.2846
1733,1.2866
1734,1.2905
1735,1.2983
1736,1.3084
1737,1.3163
1738,1.3197
1739,1.3247
1740,1.3345
1741,1.3423
1742,1.3505
1743,1.3583
1744,1.3665
1745,1.3699
1746,1.3765
1747,1.3843
1748,1.3941
1749,1.4019
1750,1.4098
1751,1.4179
1752,1.4277
1753,1.4356
1754,1.4434
1755,1.4480000000000002
1756,1.4518
1757,1.4596
1758,1.4675
1759,1.4753
1760,1.4854
1761,1.4932
1762,1.4975
1763,1.501
1764,1.504
1765,1.504
1766,1.5055
1767,1.507
1768,1.5090000000000001
1769,1.5093
1770,1.5078
1771,1.5074
1772,1.5015
1773,1.4937
1774,1.4859
1775,1.4781
1776,1.4684
1777,1.466
1778,1.4609
1779,1.4531
1780,1.4434
1781,1.4356
1782,1.4278
1783,1.4180000000000001
1784,1.4145
1785,1.4142
1786,1.4087
1787,1.399
1788,1.3912
1789,1.3834
1790,1.3756
1791,1.3659
1792,1.3581
1793,1.3507
1794,1.3429
1795,1.3331
1796,1.3254
1797,1.3246
1798,1.3244
1799,1.3146
1800,1.3073
1801,1.2995
1802,1.2956
1803,1.2917
1804,1.2839
1805,1.2761
1806,1.2684
1807,1.2684
1808,1.2656
1809,1.2639
1810,1.2572
1811,1.249
1812,1.249
1813,1.2432
1814,1.2354
1815,1.2296
1816,1.23
1817,1.2293
1818,1.2309999999999999
1819,1.2213
1820,1.2135
1821,1.2057
1822,1.198
1823,1.1883
1824,1.1805
1825,1.1727
1826,1.165
1827,1.1583
1828,1.1546
1829,1.1464
1830,1.1386
1831,1.1285
1832,1.1207
1833,1.1129
1834,1.1082
1835,1.1022
1836,1.0944
1837,1.0866
1838,1.0788
1839,1.0687
1840,1.0609
1841,1.0532
1842,1.0454
1843,1.0398
1844,1.0366
1845,1.0288
1846,1.021
1847,1.0113
1848,1.0035
1849,0.99574
1850,0.9879700000000001
1851,0.97826
1852,0.97049
1853,0.96315
1854,0.96057
1855,0.958
1856,0.95024
1857,0.9424799999999999
1858,0.9327799999999999
1859,0.9254600000000001
1860,0.9177
1861,0.90994
1862,0.90025
1863,0.89249
1864,0.88474
1865,0.8769899999999999
1866,0.8696799999999999
1867,0.86956
1868,0.86467
1869,0.85693
1870,0.84724
1871,0.8395
1872,0.83176
1873,0.8240200000000001
1874,0.81435
1875,0.8124899999999999
1876,0.80724
1877,0.79904
1878,0.7933399999999999
1879,0.7881
1880,0.78035
1881,0.7726
1882,0.7629199999999999
1883,0.75517
1884,0.74742
1885,0.73968
1886,0.72954
1887,0.7217899999999999
1888,0.71405
1889,0.70631
1890,0.69663
1891,0.68889
1892,0.68115
1893,0.6734100000000001
1894,0.66374
1895,0.6559999999999999
1896,0.65166
1897,0.64787
1898,0.63727
1899,0.6290600000000001
1900,0.62132
1901,0.61745
1902,0.61505
1903,0.60685
1904,0.59864
1905,0.59385
1906,0.5895199999999999
1907,0.58325
1908,0.58131
1909,0.5755100000000001
1910,0.56583
1911,0.55809
1912,0.55035
1913,0.54261
1914,0.53247
1915,0.52473
1916,0.517
1917,0.50926
1918,0.49959
1919,0.49186
1920,0.48413
1921,0.4764
1922,0.47112
1923,0.46924
1924,0.4615
1925,0.45377
1926,0.4441
1927,0.43637
1928,0.42863
1929,0.4209
1930,0.41123999999999994
1931,0.40351
1932,0.39531
1933,0.38758000000000004
1934,0.37792
1935,0.37019
1936,0.36246999999999996
1937,0.35815
1938,0.3514
1939,0.34367
1940,0.33594
1941,0.32628
1942,0.31808000000000003
1943,0.31035
1944,0.30263
1945,0.29297
1946,0.28525
1947,0.28139000000000003
1948,0.27753
1949,0.26691
1950,0.26064
1951,0.25774
1952,0.25146999999999997
1953,0.2452
1954,0.2452
1955,0.23747
1956,0.22926999999999997
1957,0.21961999999999998
1958,0.21575999999999998
1959,0.2119
1960,0.20418
1961,0.19646
1962,0.19453
1963,0.18825
1964,0.17956
1965,0.16990999999999998
1966,0.1622
1967,0.15448
1968,0.15255
1969,0.14677
1970,0.13905
1971,0.13134
1972,0.12362999999999999
1973,0.11785
1974,0.11690999999999999
1975,0.11163
1976,0.10393
1977,0.0943
1978,0.087103
1979,0.079404
1980,0.071707
1981,0.062089
1982,0.058241999999999995
1983,0.05631799999999999
1984,0.049138999999999995
1985,0.046323
1986,0.041076
1987,0.033912
1988,0.030072
1989,0.027630000000000002
1990,0.021348
1991,0.012625
1992,0.0049419
1993,0.0011019
1994,-0.0032600999999999997
1995,-0.010943000000000001
1996,-0.018622
1997,-0.028744
1998,-0.036423000000000004
1999,-0.044098000000000005
2000,-0.051773
2001,-0.061364
2002,-0.069034
2003,-0.076705
2004,-0.084372
2005,-0.093955
2006,-0.10162
2007,-0.10928
2008,-0.11694
2009,-0.12652
2010,-0.13418
2011,-0.14182999999999998
2012,-0.14948
2013,-0.15905
2014,-0.1667
2015,-0.17435
2016,-0.18391
2017,-0.19155
2018,-0.19864
2019,-0.20626999999999998
2020,-0.21581999999999998
2021,-0.22345
2022,-0.23109000000000002
2023,-0.23872
2024,-0.24825999999999998
2025,-0.25588
2026,-0.26294
2027,-0.26254
2028,-0.26898
2029,-0.27659
2030,-0.2842
2031,-0.2918
2032,-0.30130999999999997
2033,-0.30831
2034,-0.31590999999999997
2035,-0.3235
2036,-0.33299
2037,-0.34058
2038,-0.34817
2039,-0.35014
2040,-0.34959
2041,-0.35655
2042,-0.35909
2043,-0.35848
2044,-0.36541
2045,-0.37296
2046,-0.3805
2047,-0.38741
2048,-0.39683
2049,-0.40437
2050,-0.4119
2051,-0.41436999999999996
2052,-0.413
2053,-0.42052
2054,-0.42803
2055,-0.43487
2056,-0.44425
2057,-0.45176000000000005
2058,-0.45416999999999996
2059,-0.45333999999999997
2060,-0.45947
2061,-0.4637
2062,-0.46282
2063,-0.46771999999999997
2064,-0.47308
2065,-0.47212
2066,-0.47626999999999997
2067,-0.48227
2068,-0.48052
2069,-0.48721000000000003
2070,-0.49203
2071,-0.49094
2072,-0.4961
2073,-0.50089
2074,-0.49973
2075,-0.5019
2076,-0.5085
2077,-0.5072800000000001
2078,-0.51047
2079,-0.51703
2080,-0.51574
2081,-0.51886
2082,-0.5253800000000001
2083,-0.52481
2084,-0.5270699999999999
2085,-0.53354
2086,-0.53392
2087,-0.5351
2088,-0.54333
2089,-0.54002
2090,-0.53668
2091,-0.53428
2092,-0.53089
2093,-0.52749
2094,-0.5240600000000001
2095,-0.51974
2096,-0.51626
2097,-0.51276
2098,-0.5092399999999999
2099,-0.50302
2100,-0.49946
2101,-0.49587
2102,-0.49226000000000003
2103,-0.48596000000000006
2104,-0.47883000000000003
2105,-0.47261000000000003
2106,-0.46718999999999994
2107,-0.45653
2108,-0.44853999999999994
2109,-0.44146
2110,-0.43611000000000005
2111,-0.428
2112,-0.42002
2113,-0.41373999999999994
2114,-0.40745
2115,-0.39771
2116,-0.39064
2117,-0.38266
2118,-0.37906
2119,-0.37094
2120,-0.36388000000000004
2121,-0.3559
2122,-0.34884
2123,-0.34347
2124,-0.33804
2125,-0.33435
2126,-0.33064
2127,-0.32266999999999996
2128,-0.31563
2129,-0.30858
2130,-0.30151999999999995
2131,-0.2927
2132,-0.28472
2133,-0.27765
2134,-0.27058000000000004
2135,-0.26173
2136,-0.25632
2137,-0.24827
2138,-0.2412
2139,-0.23144
2140,-0.22436
2141,-0.21896
2142,-0.21445
2143,-0.20561
2144,-0.19852999999999998
2145,-0.19054000000000001
2146,-0.18345
2147,-0.17459000000000002
2148,-0.16749
2149,-0.16039
2150,-0.15679
2151,-0.14876
2152,-0.14077
2153,-0.13451
2154,-0.12911
2155,-0.12025999999999999
2156,-0.11317
2157,-0.10517
2158,-0.10159
2159,-0.095291
2160,-0.08820900000000001
2161,-0.080215
2162,-0.073126
2163,-0.067807
2164,-0.06603200000000001
2165,-0.058934
2166,-0.051829999999999994
2167,-0.050055
2168,-0.048277999999999995
2169,-0.041169
2170,-0.032274000000000004
2171,-0.025154
2172,-0.018031000000000002
2173,-0.010903
2174,-0.0019871
2175,0.0033659
2176,0.0086769
2177,0.014897
2178,0.024693
2179,0.030018
2180,0.034467000000000005
2181,0.041587
2182,0.050492
2183,0.058504999999999995
2184,0.065636
2185,0.072772
2186,0.079868
2187,0.085203
2188,0.093216
2189,0.10035
2190,0.11015
2191,0.11546
2192,0.1199
2193,0.12703
2194,0.13595
2195,0.14396
2196,0.14929
2197,0.15283
2198,0.16084
2199,0.16885999999999998
2200,0.17599
2201,0.18222
2202,0.18842
2203,0.19732
2204,0.20444
2205,0.20978000000000002
2206,0.21955999999999998
2207,0.22401
2208,0.22846
2209,0.23646999999999999
2210,0.24536999999999998
2211,0.24804
2212,0.25605
2213,0.25872
2214,0.25961
2215,0.26495
2216,0.26941
2217,0.27741
2218,0.28543
2219,0.29079
2220,0.29702
2221,0.30414
2222,0.30864
2223,0.31404
2224,0.31944
2225,0.32743
2226,0.3337
2227,0.33912
2228,0.34619
2229,0.35241
2230,0.35418
2231,0.35868
2232,0.36228
2233,0.36588000000000004
2234,0.374
2235,0.37853000000000003
2236,0.38121
2237,0.38575
2238,0.39121999999999996
2239,0.39918000000000003
2240,0.40549
2241,0.41097
2242,0.4207
2243,0.42608
2244,0.43157
2245,0.44222
2246,0.44853999999999994
2247,0.45403999999999994
2248,0.45781000000000005
2249,0.46334
2250,0.46429
2251,0.46713000000000005
2252,0.47093999999999997
2253,0.47572
2254,0.47668
2255,0.47763999999999995
2256,0.47973999999999994
2257,0.47916000000000003
2258,0.47221
2259,0.46623000000000003
2260,0.45929
2261,0.45875
2262,0.46093999999999996
2263,0.45402
2264,0.4471
2265,0.43846
2266,0.43156000000000005
2267,0.42466000000000004
2268,0.41776
2269,0.40988
2270,0.40418000000000004
2271,0.39702
2272,0.39011999999999997
2273,0.38051
2274,0.37534
2275,0.36964
2276,0.36493000000000003
2277,0.35631
2278,0.34843
2279,0.34154
2280,0.3351
2281,0.3294
2282,0.3225
2283,0.31561999999999996
2284,0.30773
2285,0.29913
2286,0.29225999999999996
2287,0.28481
2288,0.28009
2289,0.27149
2290,0.26361
2291,0.25674
2292,0.25029
2293,0.24456
2294,0.23769
2295,0.23081
2296,0.22395
2297,0.21536999999999998
2298,0.20851
2299,0.20065
2300,0.1938
2301,0.18525
2302,0.17842
2303,0.17157999999999998
2304,0.16476
2305,0.15624000000000002
2306,0.14942
2307,0.14262
2308,0.13582
2309,0.12732000000000002
2310,0.12053
2311,0.11375
2312,0.10802
2313,0.098511
2314,0.09174700000000001
2315,0.084988
2316,0.078236
2317,0.069803
2318,0.063066
2319,0.05633200000000001
2320,0.050406
2321,0.04386
2322,0.037122
2323,0.029325999999999998
2324,0.020915
2325,0.014193
2326,0.007476899999999999
2327,0.0015279000000000002
2328,-0.0067111
2329,-0.013430000000000001
2330,-0.021214
2331,-0.027924
2332,-0.036302999999999995
2333,-0.043476999999999995
2334,-0.049442
2335,-0.057221
2336,-0.06667100000000001
2337,-0.073366
2338,-0.07886599999999999
2339,-0.084842
2340,-0.092614
2341,-0.09931
2342,-0.10708
2343,-0.11375999999999999
2344,-0.12211
2345,-0.12544
2346,-0.12986
2347,-0.13427999999999998
2348,-0.14479
2349,-0.14920999999999998
2350,-0.15197
2351,-0.15972
2352,-0.16138
2353,-0.16746
2354,-0.17412
2355,-0.17906
2356,-0.18508
2357,-0.19174000000000002
2358,-0.19839
2359,-0.20614000000000002
2360,-0.21444000000000002
2361,-0.22107
2362,-0.22713000000000003
2363,-0.23374
2364,-0.24204
2365,-0.24977
2366,-0.25639
2367,-0.26411999999999997
2368,-0.27074000000000004
2369,-0.27737
2370,-0.28399
2371,-0.29170999999999997
2372,-0.29996999999999996
2373,-0.30657
2374,-0.31101999999999996
2375,-0.3193
2376,-0.32756
2377,-0.33416
2378,-0.34187
2379,-0.34845
2380,-0.35668
2381,-0.36324
2382,-0.37041999999999997
2383,-0.37490999999999997
2384,-0.38215
2385,-0.38661
2386,-0.3932
2387,-0.39979000000000003
2388,-0.40802
2389,-0.41458999999999996
2390,-0.42115
2391,-0.42883000000000004
2392,-0.43701999999999996
2393,-0.44355
2394,-0.45008000000000004
2395,-0.45661
2396,-0.46475
2397,-0.47125
2398,-0.47773999999999994
2399,-0.48396999999999996
2400,-0.49066000000000004
2401,-0.49716000000000005
2402,-0.50365
2403,-0.51175
2404,-0.51823
2405,-0.52469
2406,-0.5323100000000001
2407,-0.54037
2408,-0.5468
2409,-0.55323
2410,-0.55965
2411,-0.56799
2412,-0.57473
2413,-0.58233
2414,-0.5887399999999999
2415,-0.59792
2416,-0.60431
2417,-0.61069
2418,-0.6170399999999999
2419,-0.62539
2420,-0.63178
2421,-0.63815
2422,-0.64571
2423,-0.65366
2424,-0.66
2425,-0.6663899999999999
2426,-0.6715800000000001
2427,-0.67952
2428,-0.68706
2429,-0.6934
2430,-0.70018
2431,-0.70658
2432,-0.71292
2433,-0.71925
2434,-0.72678
2435,-0.7346600000000001
2436,-0.7409600000000001
2437,-0.74497
2438,-0.75141
2439,-0.75893
2440,-0.76522
2441,-0.77273
2442,-0.77866
2443,-0.7863399999999999
2444,-0.7950699999999999
2445,-0.8009999999999999
2446,-0.80745
2447,-0.81618
2448,-0.82247
2449,-0.8287399999999999
2450,-0.8358899999999999
2451,-0.8435799999999999
2452,-0.85108
2453,-0.85946
2454,-0.86592
2455,-0.8762200000000001
2456,-0.8818
2457,-0.88825
2458,-0.89541
2459,-0.9041399999999999
2460,-0.9121600000000001
2461,-0.9165200000000001
2462,-0.9228200000000001
2463,-0.93189
2464,-0.93904
2465,-0.9455
2466,-0.9526600000000001
2467,-0.96016
2468,-0.96662
2469,-0.9722
2470,-0.9797100000000001
2471,-0.98895
2472,-0.99611
2473,-1.0024
2474,-1.0099
2475,-1.0162
2476,-1.0226
2477,-1.0294
2478,-1.0397
2479,-1.0462
2480,-1.0518
2481,-1.0593
2482,-1.0673
2483,-1.0725
2484,-1.0801
2485,-1.0844
2486,-1.0921
2487,-1.0996
2488,-1.1068
2489,-1.1132
2490,-1.1219
2491,-1.1294
2492,-1.1357
2493,-1.1417
2494,-1.1478
2495,-1.1542
2496,-1.159
2497,-1.165
2498,-1.1741
2499,-1.1804
2500,-1.1876
2501,-1.194
2502,-1.2015
2503,-1.2087
2504,-1.2151
2505,-1.2207
2506,-1.2298
2507,-1.235
2508,-1.2414
2509,-1.2462
2510,-1.2545
2511,-1.2609
2512,-1.2681
2513,-1.2744
2514,-1.2819999999999998
2515,-1.2876
2516,-1.2952
2517,-1.3004
2518,-1.3099
2519,-1.3163
2520,-1.3238
2521,-1.3301
2522,-1.3381
2523,-1.3449
2524,-1.3512
2525,-1.358
2526,-1.3672
2527,-1.3748
2528,-1.3799
2529,-1.3847
2530,-1.3923
2531,-1.3975
2532,-1.405
2533,-1.4106
2534,-1.4181
2535,-1.4257
2536,-1.4329
2537,-1.4408
2538,-1.4480000000000002
2539,-1.4551
2540,-1.4614
2541,-1.469
2542,-1.4778
2543,-1.4825
2544,-1.4897
2545,-1.4973
2546,-1.5036
2547,-1.5087
2548,-1.5163
2549,-1.5219
2550,-1.5309
2551,-1.5385
2552,-1.5453
2553,-1.5499
2554,-1.5573
2555,-1.5623
2556,-1.57
2557,-1.5767
2558,-1.5829
2559,-1.5874
2560,-1.5935
2561,-1.6012
2562,-1.6079
2563,-1.614
2564,-1.6217
2565,-1.6289
2566,-1.635
2567,-1.6411
2568,-1.6488
2569,-1.6549
2570,-1.6598
2571,-1.6676
2572,-1.6742
2573,-1.6836
2574,-1.6902
2575,-1.6979
2576,-1.7045
2577,-1.7106
2578,-1.7172
2579,-1.725
2580,-1.7294
2581,-1.7382
2582,-1.7426
2583,-1.7492
2584,-1.7558
2585,-1.7652
2586,-1.7718
2587,-1.7778
2588,-1.7839
2589,-1.7928
2590,-1.7993
2591,-1.807
2592,-1.8135
2593,-1.8217
2594,-1.8272
2595,-1.8334
2596,-1.8395
2597,-1.8476
2598,-1.8541
2599,-1.8617
2600,-1.8682
2601,-1.8762
2602,-1.8826
2603,-1.8882
2604,-1.8945
2605,-1.9021
2606,-1.9085
2607,-1.9148
2608,-1.9212
2609,-1.9291
2610,-1.9366
2611,-1.9429
2612,-1.9491
2613,-1.9569
2614,-1.9631
2615,-1.9693
2616,-1.9754
2617,-1.9831
2618,-1.9892
2619,-1.9952
2620,-2.0013
2621,-2.0099
2622,-2.0166
2623,-2.0224
2624,-2.0284
2625,-2.0359
2626,-2.0418
2627,-2.0477
2628,-2.0535
2629,-2.0608
2630,-2.0666
2631,-2.0723
2632,-2.0795
2633,-2.0851
2634,-2.0908
2635,-2.0964
2636,-2.1033
2637,-2.1088
2638,-2.1142
2639,-2.1197
2640,-2.1264
2641,-2.1317
2642,-2.137
2643,-2.1422
2644,-2.1487
2645,-2.1538
2646,-2.1589
2647,-2.1639
2648,-2.1717
2649,-2.1766
2650,-2.1814
2651,-2.1847
2652,-2.1906
2653,-2.1953
2654,-2.1999
2655,-2.2044
2656,-2.2101
2657,-2.2161
2658,-2.2205
2659,-2.2248
2660,-2.2284
2661,-2.2343
2662,-2.2366
2663,-2.2407
2664,-2.2473
2665,-2.2494
2666,-2.2532
2667,-2.2569
2668,-2.2614
2669,-2.265
2670,-2.2684
2671,-2.2718
2672,-2.2759
2673,-2.2791
2674,-2.2822
2675,-2.2853
2676,-2.2889
2677,-2.2936
2678,-2.2964
2679,-2.299
2680,-2.3003
2681,-2.3047
2682,-2.307
2683,-2.3093
2684,-2.312
2685,-2.3141
2686,-2.316
2687,-2.3179
2688,-2.32
2689,-2.3217
2690,-2.3232
2691,-2.3227
2692,-2.3243
2693,-2.3255
2694,-2.3265
2695,-2.3275
2696,-2.3286
2697,-2.3293
2698,-2.33
2699,-2.3305
2700,-2.331
2701,-2.3313
2702,-2.3314
2703,-2.3315
2704,-2.3315
2705,-2.3315
2706,-2.3315
2707,-2.3315
2708,-2.3315
