time,value
0,0.55838
1,0.55838
2,0.55838
3,-1.7722
4,0.55838
5,0.55838
6,0.55838
7,-1.7722
8,0.55838
9,0.55838
10,0.55838
11,-1.7722
12,0.55838
13,0.55838
14,0.55838
15,0.55838
16,-1.7722
17,0.55838
18,0.55838
19,0.55838
20,-1.7722
21,0.55838
22,0.55838
23,0.55838
24,-1.7722
25,0.55838
26,0.55838
27,0.55838
28,-1.7722
29,0.55838
30,0.55838
31,0.55838
32,-1.7722
33,0.55838
34,0.55838
35,0.55838
36,-1.7722
37,0.55838
38,0.55838
39,0.55838
40,-1.7722
41,0.55838
42,0.55838
43,0.55838
44,-1.7722
45,0.55838
46,0.55838
47,0.55838
48,0.55838
49,-1.7722
50,0.55838
51,0.55838
52,0.55838
53,-1.7722
54,0.55838
55,0.55838
56,0.55838
57,-1.7722
58,0.55838
59,0.55838
60,0.55838
61,-1.7722
62,0.55838
63,0.55838
64,0.55838
65,-1.7722
66,0.55838
67,0.55838
68,0.55838
69,-1.7722
70,0.55838
71,0.55838
72,0.55838
73,-1.7722
74,0.55838
75,0.55838
76,0.55838
77,-1.7722
78,0.55838
79,0.55838
80,0.55838
81,0.55838
82,-1.7722
83,0.55838
84,0.55838
85,0.55838
86,-1.7722
87,0.55838
88,0.55838
89,0.55838
90,-1.7722
91,0.55838
92,0.55838
93,0.55838
94,-1.7722
95,0.55838
