time,value
0,-0.7431300000000001
1,-0.55083
2,-0.7431300000000001
3,-0.7431300000000001
4,-0.7431300000000001
5,-0.55083
6,-0.7431300000000001
7,-0.7431300000000001
8,-0.7431300000000001
9,-0.55083
10,-0.7431300000000001
11,-0.7431300000000001
12,-0.7431300000000001
13,-0.55083
14,-0.7431300000000001
15,-0.7431300000000001
16,-0.7431300000000001
17,-0.55083
18,-0.7431300000000001
19,-0.7431300000000001
20,-0.7431300000000001
21,-0.55083
22,-0.7431300000000001
23,-0.7431300000000001
24,-0.7431300000000001
25,-0.55083
26,-0.7431300000000001
27,-0.7431300000000001
28,-0.7431300000000001
29,1.1798
30,1.7567
31,1.949
32,1.5644
33,1.7567
34,1.3721
35,1.5644
36,1.7567
37,1.3721
38,1.5644
39,1.3721
40,1.949
41,1.7567
42,1.3721
43,1.5644
44,0.6029100000000001
45,-0.7431300000000001
46,-0.55083
47,-0.7431300000000001
48,-0.55083
49,-0.7431300000000001
50,-0.55083
51,-0.7431300000000001
52,-0.55083
53,-0.7431300000000001
54,-0.7431300000000001
55,-0.7431300000000001
56,-0.55083
57,-0.7431300000000001
58,-0.7431300000000001
59,-0.7431300000000001
60,-0.55083
61,-0.7431300000000001
62,-0.7431300000000001
63,-0.7431300000000001
64,-0.55083
65,1.1798
66,0.7952
67,-0.7431300000000001
68,1.1798
69,0.41062
70,-0.55083
71,-0.7431300000000001
72,-0.55083
73,-0.7431300000000001
74,-0.55083
75,-0.7431300000000001
76,-0.55083
77,-0.7431300000000001
78,0.21833000000000002
79,1.5644
80,1.5644
81,1.5644
82,1.5644
83,1.5644
84,1.5644
85,1.5644
86,0.7952
87,1.5644
88,1.1798
89,0.7952
90,-0.7431300000000001
91,-0.55083
92,-0.7431300000000001
93,-0.55083
94,-0.7431300000000001
95,-0.55083
