time,value
0,-0.5099899999999999
1,-0.5099899999999999
2,-0.5099899999999999
3,-0.5099899999999999
4,-0.5099899999999999
5,-0.5099899999999999
6,-0.5099899999999999
7,-0.5099899999999999
8,-0.5099899999999999
9,-0.5099899999999999
10,-0.5099899999999999
11,-0.5099899999999999
12,-0.5099899999999999
13,-0.5099899999999999
14,-0.5099899999999999
15,-0.5099899999999999
16,-0.5099899999999999
17,-0.5099899999999999
18,-0.5099899999999999
19,-0.5099899999999999
20,-0.5099899999999999
21,-0.5099899999999999
22,-0.5099899999999999
23,-0.5099899999999999
24,-0.5099899999999999
25,-0.5099899999999999
26,-0.5099899999999999
27,-0.5099899999999999
28,-0.5099899999999999
29,-0.5099899999999999
30,-0.5099899999999999
31,-0.5099899999999999
32,-0.5099899999999999
33,-0.5099899999999999
34,-0.5099899999999999
35,-0.5099899999999999
36,-0.5099899999999999
37,-0.5099899999999999
38,-0.5099899999999999
39,-0.5099899999999999
40,-0.5099899999999999
41,-0.5099899999999999
42,-0.5099899999999999
43,-0.5099899999999999
44,-0.5099899999999999
45,-0.5099899999999999
46,-0.5099899999999999
47,-0.5099899999999999
48,-0.5099899999999999
49,-0.5099899999999999
50,-0.5099899999999999
51,-0.5099899999999999
52,-0.5099899999999999
53,-0.5099899999999999
54,-0.5099899999999999
55,1.8485
56,2.3365
57,2.0925
58,0.059302
59,-0.5099899999999999
60,-0.5099899999999999
61,-0.5099899999999999
62,-0.5099899999999999
63,-0.5099899999999999
64,-0.5099899999999999
65,-0.5099899999999999
66,-0.5099899999999999
67,-0.18467999999999998
68,2.3365
69,2.3365
70,1.4419
71,-0.18467999999999998
72,-0.18467999999999998
73,-0.18467999999999998
74,-0.26600999999999997
75,1.4419
76,2.2552
77,2.0112
78,1.8485
79,1.9298
80,2.0925
81,1.7672
82,2.0925
83,2.2552
84,2.1738
85,2.2552
86,2.1738
87,0.46593999999999997
88,-0.5099899999999999
89,-0.5099899999999999
90,-0.5099899999999999
91,-0.5099899999999999
92,-0.5099899999999999
93,-0.5099899999999999
94,-0.5099899999999999
95,-0.5099899999999999
