time,value
0,-0.69819
1,2.15
2,0.44106999999999996
3,-0.69819
4,-0.69819
5,-0.69819
6,-0.12855999999999998
7,2.15
8,-0.12855999999999998
9,-0.69819
10,-0.69819
11,-0.69819
12,0.061314
13,1.9601
14,-0.12855999999999998
15,-0.69819
16,-0.69819
17,-0.69819
18,0.061314
19,1.9601
20,-0.12855999999999998
21,-0.69819
22,-0.69819
23,-0.69819
24,-0.12855999999999998
25,1.9601
26,-0.12855999999999998
27,-0.69819
28,-0.69819
29,-0.69819
30,-0.12855999999999998
31,1.9601
32,0.061314
33,-0.69819
34,-0.69819
35,-0.69819
36,0.25119
37,1.9601
38,-0.31844
39,-0.69819
40,-0.69819
41,-0.69819
42,1.9601
43,0.63095
44,-0.69819
45,-0.69819
46,1.0107
47,1.5803
48,-0.69819
49,-0.69819
50,-0.69819
51,-0.69819
52,1.9601
53,0.63095
54,-0.69819
55,-0.69819
56,-0.69819
57,-0.31844
58,1.9601
59,0.25119
60,-0.69819
61,-0.69819
62,-0.69819
63,-0.69819
64,1.9601
65,0.44106999999999996
66,-0.69819
67,-0.69819
68,-0.69819
69,-0.69819
70,1.9601
71,0.44106999999999996
72,-0.69819
73,-0.69819
74,-0.69819
75,1.9601
76,0.63095
77,-0.69819
78,-0.69819
79,-0.69819
80,-0.31844
81,1.9601
82,0.25119
83,-0.69819
84,-0.69819
85,-0.69819
86,0.061314
87,1.9601
88,-0.12855999999999998
89,-0.69819
90,-0.69819
91,-0.69819
92,0.44106999999999996
93,1.9601
94,-0.69819
95,-0.69819
