time,value
0,-0.47347
1,-0.47347
2,-0.47347
3,-0.47347
4,-0.47347
5,-0.47347
6,-0.47347
7,-0.47347
8,-0.47347
9,-0.47347
10,-0.47347
11,-0.47347
12,0.11492000000000001
13,-0.47347
14,-0.47347
15,-0.47347
16,-0.47347
17,-0.47347
18,-0.47347
19,-0.47347
20,-0.032178
21,-0.47347
22,-0.47347
23,-0.47347
24,-0.47347
25,-0.47347
26,-0.47347
27,-0.47347
28,-0.47347
29,-0.47347
30,-0.47347
31,-0.47347
32,-0.47347
33,-0.47347
34,-0.47347
35,-0.47347
36,-0.47347
37,-0.47347
38,-0.47347
39,-0.17928
40,-0.17928
41,-0.47347
42,-0.47347
43,-0.47347
44,-0.47347
45,-0.47347
46,-0.47347
47,-0.47347
48,-0.47347
49,-0.47347
50,-0.47347
51,-0.47347
52,-0.47347
53,-0.47347
54,-0.47347
55,-0.17928
56,-0.17928
57,-0.47347
58,-0.47347
59,-0.47347
60,-0.47347
61,-0.47347
62,-0.47347
63,-0.47347
64,-0.47347
65,-0.47347
66,-0.47347
67,-0.47347
68,-0.47347
69,-0.47347
70,-0.47347
71,1.4388
72,0.5562199999999999
73,0.40912
74,0.40912
75,0.5562199999999999
76,0.40912
77,0.5562199999999999
78,0.40912
79,0.5562199999999999
80,0.40912
81,0.40912
82,0.5562199999999999
83,0.40912
84,2.7627
85,3.0569
86,3.0569
87,2.9098
88,3.0569
89,2.9098
90,3.0569
91,3.0569
92,1.8801
93,-0.47347
94,-0.47347
95,-0.47347
