time,value
0,1.8244
1,-0.5424
2,-0.5424
3,-0.5424
4,-0.5424
5,1.8244
6,-0.5424
7,-0.5424
8,-0.5424
9,1.8244
10,-0.5424
11,-0.5424
12,-0.5424
13,1.8244
14,-0.5424
15,-0.5424
16,-0.5424
17,-0.5424
18,1.8244
19,-0.5424
20,-0.5424
21,-0.5424
22,1.8244
23,-0.5424
24,-0.5424
25,-0.5424
26,1.8244
27,-0.5424
28,-0.5424
29,-0.5424
30,1.8244
31,-0.5424
32,-0.5424
33,-0.5424
34,1.8244
35,-0.5424
36,-0.5424
37,-0.5424
38,1.8244
39,-0.5424
40,-0.5424
41,-0.5424
42,-0.5424
43,1.8244
44,-0.5424
45,-0.5424
46,-0.5424
47,-0.5424
48,-0.5424
49,1.8244
50,-0.5424
51,-0.5424
52,-0.5424
53,-0.5424
54,1.8244
55,-0.5424
56,-0.5424
57,-0.5424
58,-0.5424
59,-0.5424
60,-0.5424
61,-0.5424
62,1.8244
63,-0.5424
64,-0.5424
65,-0.5424
66,1.8244
67,-0.5424
68,-0.5424
69,-0.5424
70,1.8244
71,-0.5424
72,-0.5424
73,-0.5424
74,1.8244
75,-0.5424
76,-0.5424
77,-0.5424
78,1.8244
79,-0.5424
80,-0.5424
81,-0.5424
82,1.8244
83,-0.5424
84,-0.5424
85,-0.5424
86,1.8244
87,-0.5424
88,-0.5424
89,-0.5424
90,-0.5424
91,1.8244
92,-0.5424
93,-0.5424
94,-0.5424
95,1.8244
