time,value
0,1.8823
1,1.8665
2,1.8453
3,1.8204
4,1.7941
5,1.767
6,1.7438
7,1.7437
8,1.7302
9,1.7094
10,1.6967
11,1.6704
12,1.6427
13,1.6137
14,1.5855
15,1.5561
16,1.527
17,1.4959
18,1.4649
19,1.4341
20,1.4047
21,1.3729
22,1.3426
23,1.3101
24,1.2785
25,1.2503
26,1.2182
27,1.1875
28,1.157
29,1.1254
30,1.0939
31,1.0652
32,1.0366
33,1.0057
34,0.97641
35,0.94511
36,0.91671
37,0.88382
38,0.85264
39,0.82125
40,0.79164
41,0.75376
42,0.7178899999999999
43,0.68395
44,0.64923
45,0.61465
46,0.57726
47,0.54567
48,0.50978
49,0.4747
50,0.4378
51,0.40406
52,0.37049
53,0.3363
54,0.30391
55,0.26458000000000004
56,0.22719
57,0.18946
58,0.15413
59,0.11947
60,0.085002
61,0.044235000000000003
62,0.006681
63,-0.023858
64,-0.057494
65,-0.09497799999999999
66,-0.12943
67,-0.16335999999999998
68,-0.20052999999999999
69,-0.2368
70,-0.2706
71,-0.30341
72,-0.33587
73,-0.36685999999999996
74,-0.39597
75,-0.42402
76,-0.44997
77,-0.46925
78,-0.48607
79,-0.49663
80,-0.51299
81,-0.52854
82,-0.54324
83,-0.55707
84,-0.57
85,-0.58201
86,-0.59307
87,-0.59549
88,-0.6037
89,-0.60743
90,-0.61443
91,-0.62473
92,-0.62966
93,-0.62915
94,-0.63193
95,-0.63803
96,-0.64173
97,-0.64698
98,-0.64982
99,-0.6579699999999999
100,-0.674
101,-0.69516
102,-0.72406
103,-0.7642899999999999
104,-0.7967
105,-0.8389
106,-0.8742
107,-0.91276
108,-0.95183
109,-0.99025
110,-1.0287
111,-1.067
112,-1.1061
113,-1.1447
114,-1.1832
115,-1.2223
116,-1.2512
117,-1.273
118,-1.2890000000000001
119,-1.3023
120,-1.3128
121,-1.3203
122,-1.3249
123,-1.3285
124,-1.3287
125,-1.3248
126,-1.3175
127,-1.3066
128,-1.2927
129,-1.2787
130,-1.2599
131,-1.24
132,-1.2162
133,-1.1921
134,-1.1644
135,-1.1352
136,-1.1055
137,-1.0737
138,-1.0411
139,-1.0074
140,-0.97244
141,-0.9408200000000001
142,-0.90796
143,-0.8703700000000001
144,-0.83211
145,-0.7935399999999999
146,-0.75502
147,-0.71673
148,-0.6783
149,-0.63988
150,-0.60128
151,-0.5626399999999999
152,-0.5239699999999999
153,-0.48503
154,-0.44596
155,-0.40664
156,-0.36594
157,-0.32466
158,-0.2876
159,-0.25235
160,-0.22703
161,-0.214
162,-0.20643000000000003
163,-0.19569
164,-0.18539
165,-0.18186
166,-0.22100999999999998
167,-0.25861999999999996
168,-0.28255
169,-0.24175
170,-0.19655999999999998
171,-0.15855999999999998
172,-0.1154
173,-0.06837
174,-0.022571
175,0.023348
176,0.069378
177,0.11433
178,0.15789
179,0.19993
180,0.24043
181,0.28041
182,0.3199
183,0.3604
184,0.4009
185,0.4414
186,0.48231999999999997
187,0.52241
188,0.56291
189,0.60256
190,0.64241
191,0.68274
192,0.72132
193,0.76093
194,0.79995
195,0.83898
196,0.8780100000000001
197,0.91705
198,0.95465
199,0.99371
200,1.0328
201,1.0719
202,1.1109
203,1.1508
204,1.1909
205,1.2325
206,1.2726
207,1.3135
208,1.3554
209,1.3974
210,1.4402
211,1.482
212,1.5198
213,1.5328
214,1.5166
215,1.4998
216,1.4815
217,1.4549
218,1.4307
219,1.4056
220,1.3795
221,1.3535
222,1.3279
223,1.3027
224,1.2745
225,1.2445
226,1.2161
227,1.2486
228,1.2790000000000001
229,1.3104
230,1.3359
231,1.3626
232,1.3858
233,1.4056
234,1.4221
235,1.4425
236,1.4633
237,1.4917
238,1.4946
239,1.4592
240,1.4262
241,1.3947
242,1.3616
243,1.3321
244,1.2984
245,1.2678
246,1.2434
247,1.2113
248,1.1754
249,1.1314
250,1.0812
251,1.0404
252,0.99849
253,0.95452
254,0.90538
255,0.857
256,0.80983
257,0.75888
258,0.71065
259,0.66078
260,0.6220899999999999
261,0.5698300000000001
262,0.52655
263,0.48727
264,0.44656
265,0.40551
266,0.36086
267,0.31258
268,0.27404
269,0.22576999999999997
270,0.17728
271,0.1317
272,0.089253
273,0.040192
274,-0.005626699999999999
275,-0.050204
276,-0.092467
277,-0.13355
278,-0.17442
279,-0.21925
280,-0.26116999999999996
281,-0.30244
282,-0.3415
283,-0.38299999999999995
284,-0.40301
285,-0.41802
286,-0.42983999999999994
287,-0.44608000000000003
288,-0.46683
289,-0.48623999999999995
290,-0.50065
291,-0.50995
292,-0.51712
293,-0.51863
294,-0.51779
295,-0.51454
296,-0.50534
297,-0.49378999999999995
298,-0.48195
299,-0.47238
300,-0.4628
301,-0.45243
302,-0.4911
303,-0.52877
304,-0.56855
305,-0.60647
306,-0.64777
307,-0.6867800000000001
308,-0.7249399999999999
309,-0.76212
310,-0.80102
311,-0.83846
312,-0.8801100000000001
313,-0.9192600000000001
314,-0.95831
315,-0.99725
316,-1.036
317,-1.0747
318,-1.12
319,-1.1612
320,-1.1873
321,-1.2187
322,-1.253
323,-1.2858
324,-1.3155
325,-1.3481
326,-1.3768
327,-1.4056
328,-1.4338
329,-1.4603
330,-1.4847
331,-1.5024
332,-1.5171
333,-1.5332
334,-1.5459
335,-1.5506
336,-1.5557
337,-1.554
338,-1.5538
339,-1.5434
340,-1.5328
341,-1.5132
342,-1.4874
343,-1.4605
344,-1.4436
345,-1.4478
346,-1.4437
347,-1.4375
348,-1.4287
349,-1.4161
350,-1.4
351,-1.3849
352,-1.3508
353,-1.3119
354,-1.2752
355,-1.2386
356,-1.2006
357,-1.1617
358,-1.1292
359,-1.0974
360,-1.0524
361,-1.015
362,-0.98214
363,-0.9620299999999999
364,-0.94478
365,-0.9264399999999999
366,-0.9145399999999999
367,-0.90136
368,-0.9067799999999999
369,-0.9298700000000001
370,-0.94885
371,-0.96119
372,-0.9725600000000001
373,-0.98501
374,-1.0088
375,-1.034
376,-1.0569
377,-1.0712
378,-1.0829
379,-1.0957
380,-1.1035
381,-1.1134
382,-1.1209
383,-1.1285
384,-1.1325
385,-1.1284
386,-1.1265
387,-1.12
388,-1.1085
389,-1.0732
390,-1.037
391,-0.9999100000000001
392,-0.96244
393,-0.92486
394,-0.88699
395,-0.84885
396,-0.81048
397,-0.77199
398,-0.73316
399,-0.6945399999999999
400,-0.65522
401,-0.6157600000000001
402,-0.5760000000000001
403,-0.5364300000000001
404,-0.49717
405,-0.45648
406,-0.41608
407,-0.37589
408,-0.33529000000000003
409,-0.29459
410,-0.25476
411,-0.21422
412,-0.17431
413,-0.13427999999999998
414,-0.091516
415,-0.049779000000000004
416,-0.0094434
417,0.032941000000000005
418,0.075517
419,0.1187
420,0.1618
421,0.20199999999999999
422,0.24040999999999998
423,0.28006
424,0.32204
425,0.36327
426,0.4046
427,0.44518
428,0.48105
429,0.51683
430,0.55803
431,0.60265
432,0.64623
433,0.68988
434,0.73446
435,0.7774
436,0.82126
437,0.86265
438,0.90659
439,0.95201
440,0.9944299999999999
441,1.0408
442,1.0854
443,1.1284
444,1.1714
445,1.2154
446,1.2558
447,1.2959
448,1.3418
449,1.3847
450,1.4249
451,1.4641
452,1.5061
453,1.5495
454,1.594
455,1.6393
456,1.676
457,1.7141
458,1.7443
459,1.7744
460,1.8131
461,1.8474
462,1.8761
