time,value
0,-0.60835
1,-0.4247
2,0.6772199999999999
3,-1.1593
4,1.5955
5,-1.1593
6,1.0445
7,-0.792
8,-0.4247
9,0.6772199999999999
10,-1.1593
11,1.4118
12,-1.1593
13,1.2282
14,-1.1593
15,-0.24104
16,0.49357
17,-1.1593
18,1.4118
19,-1.1593
20,1.0445
21,-0.792
22,-0.4247
23,0.6772199999999999
24,-1.1593
25,1.4118
26,-1.1593
27,0.86087
28,-0.60835
29,-0.792
30,1.0445
31,-1.1593
32,1.5955
33,-1.1593
34,-0.057391
35,0.30990999999999996
36,-1.1593
37,1.4118
38,-1.1593
39,1.2282
40,-1.1593
41,1.5955
42,-1.1593
43,1.2282
44,-1.1593
45,0.86087
46,-0.60835
47,-0.057391
48,0.30990999999999996
49,-1.1593
50,1.2282
51,-1.1593
52,1.4118
53,-1.1593
54,0.49357
55,-0.24104
56,-0.792
57,1.0445
58,-1.1593
59,1.4118
60,-1.1593
61,0.86087
62,-0.60835
63,-0.4247
64,0.6772199999999999
65,-1.1593
66,1.4118
67,-1.1593
68,0.6772199999999999
69,-0.24104
70,-1.1593
71,1.4118
72,-1.1593
73,1.4118
74,-1.1593
75,0.12625999999999998
76,0.30990999999999996
77,-0.24104
78,1.5955
79,-1.1593
80,1.5955
81,-0.792
82,1.2282
83,-0.24104
84,0.6772199999999999
85,0.6772199999999999
86,-0.4247
87,1.0445
88,-0.792
89,1.0445
90,-0.60835
91,0.6772199999999999
92,-0.4247
93,0.30990999999999996
94,-0.057391
95,-0.4247
