time,value
0,-0.39223
1,-0.3436
2,-0.40458
3,-0.3566
4,-0.37064
5,-0.3602
6,-0.33766
7,-0.34247
8,-0.32319000000000003
9,-0.33174000000000003
10,-0.315
11,0.17082
12,0.26306
13,0.6653399999999999
14,1.5697
15,1.317
16,1.3723
17,1.1023
18,0.34988
19,-0.38736
20,-1.022
21,-1.3921
22,-1.7653
23,-1.7635
24,-1.9441
25,-2.3195
26,-2.4079
27,-2.3705
28,-2.2507
29,-2.0144
30,-1.8386
31,-1.7584
32,-1.3788
33,-0.8831700000000001
34,-0.32563000000000003
35,0.013802000000000002
36,0.30266
37,0.6300600000000001
38,0.85644
39,1.1764
40,1.4685
41,1.6123
42,1.6588
43,1.6880000000000002
44,1.4496
45,1.7058
46,1.8002
47,2.0465
48,2.1255
49,2.0629
50,1.9424
51,2.3955
52,3.1111
53,3.3341
54,2.6504
55,2.4757
56,2.4941
57,2.2016
58,1.9048
59,1.3817
60,1.3197
61,1.2473
62,1.2702
63,1.5716
64,3.5278
65,2.5773
66,2.1414
67,1.9863
68,1.7438
69,1.6409
70,1.1891
71,1.1371
72,1.3333
73,2.7694
74,2.0113
75,1.7846
76,2.1627
77,1.9340000000000002
78,2.0835
79,1.7401
80,1.2804
81,1.1704
82,1.1349
83,1.1887
84,0.9431700000000001
85,0.68314
86,0.61373
87,0.39819
88,0.25326
89,0.16493
90,0.016132
91,-0.46155
92,-0.9583799999999999
93,-1.1415
94,-1.1767
95,-1.8135
96,-1.9648
97,-1.9841
98,-2.1173
99,-1.9605
100,-1.7358
101,-1.7469
102,-1.5492
103,-1.6719
104,-1.9034
105,-1.6047
106,-1.0305
107,-1.123
108,-0.83795
109,-0.45468000000000003
110,-0.35233000000000003
111,-0.27891
112,-0.079554
113,-0.09675700000000001
114,0.06527899999999999
115,0.7238600000000001
116,0.9466700000000001
117,0.12078
118,-0.20690999999999998
119,-0.34655
120,-0.36446999999999996
121,-0.15217999999999998
122,-0.079649
123,0.030902999999999996
124,0.032179
125,0.046966
126,-0.094043
127,-0.1192
128,-0.069208
129,-0.10933
130,-0.082014
131,0.023102
132,0.15596
133,0.1524
134,0.10894000000000001
135,-0.055324
136,-0.091584
137,-0.12997999999999998
138,-0.06929
139,-0.024822999999999998
140,0.10092000000000001
141,0.13899
142,0.10380999999999999
143,0.09214800000000001
144,0.07701799999999999
145,0.062053
146,0.07637200000000001
147,0.07568899999999999
148,0.074985
149,0.077025
150,0.079822
151,0.098887
152,0.076123
153,0.00033047
154,0.009871
155,0.010609
156,0.0099377
157,0.027454000000000003
158,0.035677
159,0.043223000000000004
160,0.054220000000000004
161,0.043508
162,0.045148
163,0.056784
164,0.043795999999999995
165,0.050561
166,0.017578
167,-0.0060918
168,-0.035733
169,-0.06619
170,-0.07080700000000001
171,-0.074222
172,-0.081462
173,-0.068435
174,-0.028494
175,-0.033867
176,-0.080593
177,-0.02657
178,-0.044442
179,-0.10048
180,-0.061402
181,-0.077639
182,-0.010688
183,-0.020966
184,-0.085421
185,-0.080248
186,-0.05884299999999999
187,-0.068493
188,-0.08365800000000001
189,-0.059657
190,-0.083124
191,-0.10855
192,-0.13443
193,-0.14285
194,-0.08519199999999999
195,-0.087777
196,-0.08197
197,0.069018
198,0.018396
199,-0.0017327999999999998
200,-0.0013036
201,0.0093567
202,0.015518
203,0.044379
204,-0.14257
205,-0.14917
206,-0.25877
207,-0.24059
208,-0.26206
209,-0.27569
210,-0.18475
211,-0.17804
212,-0.18273
213,-0.19815
214,-0.22046
215,-0.22895
216,-0.23535999999999999
217,-0.31148000000000003
218,-0.39905
219,-0.33164
220,-0.3233
221,-0.30472
222,-0.29386999999999996
223,-0.29889
224,-0.20876999999999998
225,-0.28507
226,-0.27242
227,-0.35265
228,-0.38129
229,-0.3038
230,-0.20526999999999998
231,-0.21636999999999998
232,-0.22530999999999998
233,-0.32753000000000004
234,-0.32895
235,-0.41944
236,-0.44648999999999994
237,-0.5591
238,-0.57501
239,-0.69618
240,-0.67401
241,-0.6041300000000001
242,-0.55886
243,-0.40098
244,-0.4652
245,-0.37124
246,-0.37992
247,-0.37871
248,-0.37834
249,-0.3862
250,-0.3165
251,-0.32071
252,-0.48791999999999996
253,-0.5514399999999999
254,-0.5986899999999999
255,-0.60621
256,-0.49341999999999997
257,-0.48591000000000006
258,-0.3833
259,-0.38916
260,-0.38969000000000004
261,-0.43296999999999997
262,-0.38693
263,-0.3847
264,-0.38688
265,-0.39829000000000003
266,-0.29624
267,-0.35453
268,-0.39781
269,-0.43755
270,-0.6011
271,-0.60853
272,-0.60936
273,-0.49891
274,-0.49878999999999996
275,-0.49993000000000004
276,-0.50212
277,-0.50708
278,-0.5132899999999999
279,-0.59283
280,-0.40915999999999997
281,-0.40919
282,-0.41494
283,-0.5198699999999999
284,-0.49626000000000003
285,-0.5153
286,-0.51507
287,-0.49445
288,-0.51278
289,-0.5220600000000001
290,-0.41935
291,-0.31458
292,-0.32587
293,-0.41863
294,-0.51869
295,-0.51969
296,-0.5232
297,-0.5263899999999999
298,-0.52461
299,-0.42199
