time,value
0,-0.33448
1,-0.33448
2,-0.33448
3,-0.33448
4,-0.33448
5,-0.33448
6,-0.33448
7,-0.33448
8,-0.33448
9,-0.33448
10,-0.33448
11,-0.33448
12,-0.33448
13,-0.33448
14,-0.33448
15,-0.33448
16,-0.33448
17,-0.33448
18,-0.33448
19,-0.33448
20,-0.33448
21,-0.33448
22,-0.33448
23,-0.33448
24,-0.33448
25,-0.33448
26,-0.33448
27,-0.33448
28,-0.33448
29,-0.33448
30,-0.33448
31,-0.33448
32,-0.33448
33,-0.33448
34,-0.33448
35,-0.33448
36,-0.33448
37,-0.33448
38,-0.33448
39,-0.33448
40,-0.33448
41,-0.33448
42,-0.33448
43,-0.33448
44,-0.33448
45,-0.33448
46,-0.33448
47,-0.33448
48,-0.33448
49,-0.33448
50,-0.33448
51,-0.33448
52,-0.33448
53,-0.33448
54,-0.33448
55,1.9954
56,3.1308
57,0.49341
58,3.1663
59,-0.13342
60,-0.15708
61,2.0427
62,3.0125
63,-0.33448
64,-0.33448
65,-0.33448
66,-0.33448
67,-0.33448
68,-0.33448
69,-0.33448
70,-0.33448
71,-0.33448
72,-0.33448
73,-0.33448
74,-0.33448
75,-0.33448
76,-0.33448
77,-0.33448
78,-0.33448
79,-0.33448
80,-0.33448
81,-0.33448
82,-0.038807
83,3.1426
84,2.504
85,3.3555
86,-0.15708
87,-0.1689
88,-0.038807
89,4.6092
90,-0.33448
91,-0.33448
92,-0.33448
93,-0.33448
94,-0.33448
95,-0.33448
