time,value
0,-1.2603
1,0.2221
2,-0.96105
3,-2.0597
4,-1.7383
5,-0.99172
6,-1.0057
7,-1.5033
8,-1.6463
9,-1.3439
10,-1.1794
11,-1.3294
12,-1.4805
13,-1.413
14,-1.2913
15,-1.2984
16,-1.3582
17,-1.3652
18,-1.3143
19,-1.2993
20,-1.3038
21,-1.3082
22,-1.295
23,-1.2896
24,-1.2794
25,-1.2714
26,-1.271
27,-1.2604
28,-1.2631
29,-1.247
30,-1.2534
31,-1.2437
32,-1.2458
33,-1.2402
34,-1.2383
35,-1.2407
36,-1.2371
37,-1.2459
38,-1.2382
39,-1.2524
40,-1.2485
41,-1.2595
42,-1.26
43,-1.2663
44,-1.2721
45,-1.2728
46,-1.2824
47,-1.2781
48,-1.2924
49,-1.2875
50,-1.2998
51,-1.301
52,-1.3148
53,-1.3282
54,-1.3386
55,-1.3501
56,-1.3448
57,-1.3529
58,-1.3429
59,-1.354
60,-1.3488
61,-1.3535
62,-1.3511
63,-1.3503
64,-1.3537
65,-1.3486
66,-1.3562
67,-1.3459
68,-1.3589
69,-1.3551
70,-1.3664
71,-1.369
72,-1.3757
73,-1.3833
74,-1.3852
75,-1.3978
76,-1.3945
77,-1.4099
78,-1.4053
79,-1.4153
80,-1.4118
81,-1.4139
82,-1.4128
83,-1.4075
84,-1.4089
85,-1.3966
86,-1.4013
87,-1.3872
88,-1.3916
89,-1.3806
90,-1.3788
91,-1.3718
92,-1.3643
93,-1.361
94,-1.3461
95,-1.3444
96,-1.3232
97,-1.3231
98,-1.3044
99,-1.2966
100,-1.2796
101,-1.2649
102,-1.2527
103,-1.2332
104,-1.2258
105,-1.2018
106,-1.1995
107,-1.1789
108,-1.1734
109,-1.157
110,-1.1464
111,-1.1355
112,-1.1201
113,-1.1141
114,-1.0936
115,-1.0917
116,-1.0703
117,-1.0665
118,-1.0487
119,-1.0394
120,-1.0261
121,-1.0105
122,-1.001
123,-0.98011
124,-0.9762
125,-0.9536600000000001
126,-0.9517899999999999
127,-0.9330299999999999
128,-0.9258200000000001
129,-0.9125200000000001
130,-0.9012899999999999
131,-0.8948200000000001
132,-0.88121
133,-0.8831399999999999
134,-0.86805
135,-0.8764299999999999
136,-0.86598
137,-0.86977
138,-0.86362
139,-0.86129
140,-0.8587100000000001
141,-0.84903
142,-0.84834
143,-0.8301
144,-0.8307399999999999
145,-0.81188
146,-0.81011
147,-0.79538
148,-0.78774
149,-0.77827
150,-0.76818
151,-0.76837
152,-0.75772
153,-0.76557
154,-0.75559
155,-0.76749
156,-0.7665
157,-0.77832
158,-0.7864800000000001
159,-0.79665
160,-0.81313
161,-0.82155
162,-0.8458200000000001
163,-0.85206
164,-0.88077
165,-0.8913399999999999
166,-0.9152899999999999
167,-0.9310700000000001
168,-0.9505399999999999
169,-0.9714799999999999
170,-0.98529
171,-1.0104
172,-1.0187
173,-1.0481
174,-1.058
175,-1.0835
176,-1.097
177,-1.1167
178,-1.1347
179,-1.1485
180,-1.1706
181,-1.1786
182,-1.205
183,-1.2122
184,-1.2372
185,-1.2469
186,-1.2647
187,-1.2769
188,-1.2867
189,-1.3004
190,-1.301
191,-1.315
192,-1.3082
193,-1.3205
194,-1.3148
195,-1.3196
196,-1.3162
197,-1.3134
198,-1.3127
199,-1.3039
200,-1.3085
201,-1.296
202,-1.3061
203,-1.2981
204,-1.305
205,-1.3027
206,-1.3057
207,-1.3095
208,-1.3085
209,-1.3178
210,-1.3119999999999998
211,-1.3254
212,-1.3198
213,-1.3308
214,-1.3291
215,-1.3344
216,-1.3362
217,-1.3348
218,-1.3403
219,-1.3334
220,-1.3432
221,-1.3335
222,-1.3419999999999999
223,-1.3336
224,-1.3339
225,-1.3271
226,-1.3189
227,-1.3131
228,-1.2959
229,-1.2917
230,-1.2682
231,-1.2663
232,-1.2458
233,-1.238
234,-1.2219
235,-1.2094
236,-1.199
237,-1.182
238,-1.176
239,-1.1527
240,-1.1497
241,-1.1281
242,-1.1224
243,-1.1049
244,-1.0926
245,-1.0783
246,-1.06
247,-1.0501
248,-1.0261
249,-1.0206
250,-0.99845
251,-0.9980600000000001
252,-0.98615
253,-0.9842
254,-0.97815
255,-0.97175
256,-0.9726799999999999
257,-0.96426
258,-0.9726600000000001
259,-0.96335
260,-0.9766299999999999
261,-0.9742700000000001
262,-0.9847299999999999
263,-0.98811
264,-0.9930899999999999
265,-1.0004
266,-0.99892
267,-1.0095
268,-1.0014
269,-1.0146
270,-1.0086
271,-1.0173
272,-1.0153
273,-1.0176
274,-1.0186
275,-1.0139
276,-1.0186
277,-1.0078
278,-1.0162
279,-1.0056
280,-1.013
281,-1.0082
282,-1.0123
283,-1.0147
284,-1.0163
285,-1.0267
286,-1.0261
287,-1.0436
288,-1.0432
289,-1.0641
290,-1.0697
291,-1.0859
292,-1.0952
293,-1.1038
294,-1.1154
295,-1.1163
296,-1.1302
297,-1.1233
298,-1.1372
299,-1.1298
300,-1.1337
301,-1.1268
302,-1.122
303,-1.1172
304,-1.1043
305,-1.1012
306,-1.0798
307,-1.0781
308,-1.0563
309,-1.0508
310,-1.0334
311,-1.0223
312,-1.0095
313,-0.99246
314,-0.9840700000000001
315,-0.9616100000000001
316,-0.95773
317,-0.9343899999999999
318,-0.92999
319,-0.9100299999999999
320,-0.8983399999999999
321,-0.88115
322,-0.8622299999999999
323,-0.84896
324,-0.8241200000000001
325,-0.8147300000000001
326,-0.78501
327,-0.77655
328,-0.7497
329,-0.7347899999999999
330,-0.71195
331,-0.6904100000000001
332,-0.67104
333,-0.64245
334,-0.62689
335,-0.59306
336,-0.58228
337,-0.5522
338,-0.53781
339,-0.51322
340,-0.49436
341,-0.47613999999999995
342,-0.45293999999999995
343,-0.44063
344,-0.41318999999999995
345,-0.40676999999999996
346,-0.3812
347,-0.37439
348,-0.3537
349,-0.3411
350,-0.32534
351,-0.30748000000000003
352,-0.29738000000000003
353,-0.27465
354,-0.26982
355,-0.24554
356,-0.24402
357,-0.22716
358,-0.22333000000000003
359,-0.21423000000000003
360,-0.20703000000000002
361,-0.20581999999999998
362,-0.19655
363,-0.20364000000000002
364,-0.19069
365,-0.20182
366,-0.19237
367,-0.1977
368,-0.19322999999999999
369,-0.19187
370,-0.19037
371,-0.18076
372,-0.1827
373,-0.16649
374,-0.17126
375,-0.15349000000000002
376,-0.15163
377,-0.13530999999999999
378,-0.12509
379,-0.11159000000000001
380,-0.092541
381,-0.081245
382,-0.054782000000000004
383,-0.048497000000000005
384,-0.022049000000000003
385,-0.017002
386,0.004176300000000001
387,0.014616999999999998
388,0.029611000000000002
389,0.044698
390,0.053336
391,0.07385
392,0.077923
393,0.10367
394,0.10597999999999999
395,0.12821
396,0.13731
397,0.15558
398,0.17232
399,0.187
400,0.21114000000000002
401,0.22193000000000002
402,0.2531
403,0.26091
404,0.29024
405,0.30253
406,0.32634
407,0.34417
408,0.36216
409,0.38525
410,0.39644
411,0.42332
412,0.42785
413,0.45358000000000004
414,0.45933999999999997
415,0.48099
416,0.49438999999999994
417,0.51247
418,0.53371
419,0.54789
420,0.57622
421,0.58587
422,0.61705
423,0.62479
424,0.65157
425,0.6661600000000001
426,0.68742
427,0.70582
428,0.71728
429,0.73717
430,0.74028
431,0.76464
432,0.76251
433,0.7811899999999999
434,0.78299
435,0.7953
436,0.80348
437,0.81101
438,0.82576
439,0.82834
440,0.8499700000000001
441,0.84825
442,0.86705
443,0.86525
444,0.8781100000000001
445,0.88476
446,0.89456
447,0.9059999999999999
448,0.90589
449,0.92025
450,0.9151600000000001
451,0.9317200000000001
452,0.92376
453,0.93106
454,0.92545
455,0.9244700000000001
456,0.92096
457,0.90881
458,0.90594
459,0.8835
460,0.87925
461,0.8461299999999999
462,0.83255
463,0.80545
464,0.7892899999999999
465,0.76961
466,0.74751
467,0.7346
468,0.71001
469,0.7065600000000001
470,0.68038
471,0.6785899999999999
472,0.6612899999999999
473,0.65705
474,0.64395
475,0.63122
476,0.62451
477,0.6090399999999999
478,0.60816
479,0.58203
480,0.5745
481,0.54513
482,0.53136
483,0.50563
484,0.4824
485,0.45945
486,0.42982
487,0.41281
488,0.37698000000000004
489,0.36213
490,0.32478
491,0.3084
492,0.28065
493,0.26221
494,0.24329
495,0.2234
496,0.21600999999999998
497,0.19677
498,0.19972
499,0.17853
500,0.17937999999999998
501,0.16469
502,0.16099000000000002
503,0.1508
504,0.13878
505,0.13133
506,0.11098
507,0.10605
508,0.077265
509,0.068522
510,0.040619
511,0.027043
512,0.0056088
513,-0.01149
514,-0.023281
515,-0.040465
516,-0.041384
517,-0.059626
518,-0.055341999999999995
519,-0.071035
520,-0.06848
521,-0.076948
522,-0.079485
523,-0.08243500000000001
524,-0.09037200000000001
525,-0.087448
526,-0.10067999999999999
527,-0.093352
528,-0.11049
529,-0.10747999999999999
530,-0.11832999999999999
531,-0.11882000000000001
532,-0.12093
533,-0.1228
534,-0.11498
535,-0.11862
536,-0.10257000000000001
537,-0.10872000000000001
538,-0.093226
539,-0.09414
540,-0.0818
541,-0.075536
542,-0.068523
543,-0.057616999999999995
544,-0.056915
545,-0.040529
546,-0.045579
547,-0.031702
548,-0.039164
549,-0.029197000000000004
550,-0.025241
551,-0.015193
552,-0.0053272
553,-0.0047044
554,0.010133
555,0.013506
556,0.044118
557,0.052207
558,0.074528
559,0.08097
560,0.098828
561,0.12329000000000001
562,0.14861
563,0.18056
564,0.19227
565,0.22339
566,0.23318000000000003
567,0.26565
568,0.27851
569,0.29735
570,0.30988000000000004
571,0.32364
572,0.34478000000000003
573,0.35276
574,0.37659000000000004
575,0.37808
576,0.40158
577,0.40592
578,0.42412
579,0.43404
580,0.44715
581,0.46393
582,0.47268999999999994
583,0.49696999999999997
584,0.50302
585,0.53169
586,0.5381
587,0.56188
588,0.57338
589,0.59058
590,0.60717
591,0.61798
592,0.6395
593,0.64362
594,0.66872
595,0.6677
596,0.6877800000000001
597,0.69316
598,0.7087100000000001
599,0.72101
600,0.73177
601,0.75126
602,0.7581899999999999
603,0.78528
604,0.7884
605,0.81271
606,0.81704
607,0.8327700000000001
608,0.8397600000000001
609,0.8468
610,0.85725
611,0.8560700000000001
612,0.8698100000000001
613,0.86098
614,0.8736
615,0.86411
616,0.87154
617,0.86906
618,0.87264
619,0.8789899999999999
620,0.8800100000000001
621,0.89589
622,0.89513
623,0.9184399999999999
624,0.9179200000000001
625,0.9382299999999999
626,0.94491
627,0.9607100000000001
628,0.97501
629,0.9857899999999999
630,1.0055
631,1.0084
632,1.0318
633,1.0287
634,1.048
635,1.0497
636,1.064
637,1.0734
638,1.0835
639,1.1005
640,1.105
641,1.1274
642,1.1266
643,1.15
644,1.1532
645,1.1717
646,1.181
647,1.1965
648,1.2185
649,1.2311
650,1.2556
651,1.2601
652,1.2944
653,1.3068
654,1.3298
655,1.3314
656,1.3497
657,1.3939
658,1.4492
659,1.5042
660,1.5138
661,1.5318
662,1.5284
663,1.5584
664,1.5717
665,1.5895
666,1.6036
667,1.6227
668,1.6542
669,1.6694
670,1.7024
671,1.7102
672,1.7428
673,1.7546
674,1.7790000000000001
675,1.7949
676,1.8124
677,1.8339
678,1.844
679,1.8722
680,1.8788
681,1.9086
682,1.9119
683,1.9307
684,1.9368
685,1.9488
686,1.962
687,1.9673
688,1.9856
689,1.9848
690,2.0095
691,2.0091
692,2.0317
693,2.0397
694,2.0582
695,2.0757
696,2.0909999999999997
697,2.116
698,2.1229
699,2.1498
700,2.1474
701,2.1677
702,2.1678
703,2.1791
704,2.1813
705,2.1817
706,2.1865
707,2.1772
708,2.1844
709,2.1653
710,2.1691
711,2.1499
712,2.1471
713,2.1333
714,2.1231
715,2.1148
716,2.0974
717,2.094
718,2.0686
719,2.0664
720,2.0381
721,2.0302
722,2.0078
723,1.9934
724,1.9778
725,1.9586
726,1.9514
727,1.9277
728,1.9281
729,1.9001
730,1.896
731,1.8736
732,1.8615
733,1.8427
734,1.8219999999999998
735,1.8083
736,1.7805
737,1.7719999999999998
738,1.7368
739,1.7245
740,1.6915
741,1.6748
742,1.6509
743,1.6315
744,1.6173
745,1.5946
746,1.5894
747,1.5639
748,1.5637
749,1.5414
750,1.5391
751,1.5253
752,1.5186
753,1.5123
754,1.5003
755,1.501
756,1.483
757,1.4874
758,1.464
759,1.4609999999999999
760,1.4411
761,1.4299
762,1.4138
763,1.3940000000000001
764,1.3822
765,1.3553
766,1.3497
767,1.3189
768,1.3122
769,1.2882
770,1.2788
771,1.2639
772,1.2514
773,1.2451
774,1.2283
775,1.2297
776,1.2091
777,1.212
778,1.1931
779,1.1902
780,1.1763
781,1.1661
782,1.1567
783,1.1388
784,1.1338
785,1.1084
786,1.1046
787,1.0754
788,1.0654
789,1.0416
790,1.0257
791,1.0079
792,0.98598
793,0.97501
794,0.94942
795,0.9468200000000001
796,0.9182299999999999
797,0.9124700000000001
798,0.8910799999999999
799,0.88302
800,0.87198
801,0.86172
802,0.85805
803,0.84109
804,0.8417899999999999
805,0.81863
806,0.8173199999999999
807,0.79528
808,0.78647
809,0.7680899999999999
810,0.75232
811,0.73987
812,0.71814
813,0.71094
814,0.68378
815,0.67991
816,0.6543100000000001
817,0.64584
818,0.6250600000000001
819,0.61228
820,0.60345
821,0.59232
822,0.59292
823,0.57516
824,0.57914
825,0.5597
826,0.562
827,0.5485899999999999
828,0.54356
829,0.53562
830,0.5272399999999999
831,0.52774
832,0.5143800000000001
833,0.5202
834,0.50222
835,0.5060399999999999
836,0.49182
837,0.49004
838,0.48123
839,0.47262
840,0.4668
841,0.44977
842,0.44888999999999996
843,0.42668999999999996
844,0.42291000000000006
845,0.3945
846,0.37993000000000005
847,0.35695
848,0.34112
849,0.32736
850,0.30605
851,0.29667
852,0.26978
853,0.26347
854,0.23249
855,0.21866
856,0.19153
857,0.17289000000000002
858,0.15282
859,0.12985
860,0.11645
861,0.089039
862,0.081772
863,0.050081
864,0.039762
865,0.01377
866,-0.0017973
867,-0.023434
868,-0.044973
869,-0.059787
870,-0.08593300000000001
871,-0.097924
872,-0.1349
873,-0.1522
874,-0.18514
875,-0.19957
876,-0.22025
877,-0.23990999999999998
878,-0.26069000000000003
879,-0.29052
880,-0.30418
881,-0.33214
882,-0.33755
883,-0.36421
884,-0.3741
885,-0.39303
886,-0.40260999999999997
887,-0.41144
888,-0.42682
889,-0.43458
890,-0.45803999999999995
891,-0.45902
892,-0.48161000000000004
893,-0.48581
894,-0.5071
895,-0.5208699999999999
896,-0.53723
897,-0.55418
898,-0.5644899999999999
899,-0.58805
900,-0.59204
901,-0.61448
902,-0.6138
903,-0.62955
904,-0.63349
905,-0.64218
906,-0.64617
907,-0.64278
908,-0.64736
909,-0.6361
910,-0.6430100000000001
911,-0.62765
912,-0.6301399999999999
913,-0.6166699999999999
914,-0.61136
915,-0.59947
916,-0.5837899999999999
917,-0.57391
918,-0.55297
919,-0.54893
920,-0.5225
921,-0.51603
922,-0.49256000000000005
923,-0.48418
924,-0.4689
925,-0.45186000000000004
926,-0.4353
927,-0.41098
928,-0.4048
929,-0.38114000000000003
930,-0.37936
931,-0.35567
932,-0.34857
933,-0.33449
934,-0.32745
935,-0.32091
936,-0.30719
937,-0.30467
938,-0.28647
939,-0.28964
940,-0.27091
941,-0.26835
942,-0.25103000000000003
943,-0.24051
944,-0.22424000000000002
945,-0.20084000000000002
946,-0.18407
947,-0.15483
948,-0.14364000000000002
949,-0.10814000000000001
950,-0.093309
951,-0.06871000000000001
952,-0.062014
953,-0.042289999999999994
954,-0.0035635
955,0.040819
956,0.083277
957,0.083865
958,0.08913
959,0.071712
960,0.082097
961,0.079854
962,0.084676
963,0.086542
964,0.088318
965,0.097831
966,0.09437100000000001
967,0.11255
968,0.10934
969,0.12332
970,0.11725
971,0.13355
972,0.16135
973,0.19879000000000002
974,0.2302
975,0.23546
976,0.25375
977,0.26282
978,0.30262
979,0.31917
980,0.34519
981,0.36112
982,0.38776
983,0.41913999999999996
984,0.4403
985,0.46807
986,0.47452
987,0.50197
988,0.50607
989,0.52881
990,0.53486
991,0.54361
992,0.5474100000000001
993,0.55083
994,0.56948
995,0.57449
996,0.59495
997,0.58921
998,0.6147699999999999
999,0.63788
1000,0.67557
1001,0.69515
1002,0.6984600000000001
1003,0.70197
1004,0.69781
1005,0.71286
1006,0.69985
1007,0.70019
1008,0.6774899999999999
1009,0.67202
1010,0.66094
1011,0.6551899999999999
1012,0.65352
1013,0.64628
1014,0.65581
1015,0.64828
1016,0.6630199999999999
1017,0.65459
1018,0.66335
1019,0.65885
1020,0.66037
1021,0.6601199999999999
1022,0.65457
1023,0.65827
1024,0.64413
1025,0.6483300000000001
1026,0.62487
1027,0.6221300000000001
1028,0.60359
1029,0.59264
1030,0.57245
1031,0.54765
1032,0.52933
1033,0.49946
1034,0.48693000000000003
1035,0.44953999999999994
1036,0.43263999999999997
1037,0.39810999999999996
1038,0.37684
1039,0.34551
1040,0.31411999999999995
1041,0.28613
1042,0.25072
1043,0.23037
1044,0.18854
1045,0.16627
1046,0.12390999999999999
1047,0.10131
1048,0.070647
1049,0.045952999999999994
1050,0.019523
1051,-0.014575
1052,-0.037594999999999996
1053,-0.075422
1054,-0.090037
1055,-0.12685
1056,-0.14402
1057,-0.17451
1058,-0.19434
1059,-0.21419000000000002
1060,-0.23406999999999997
1061,-0.24463000000000001
1062,-0.26804
1063,-0.2713
1064,-0.29759
1065,-0.30361
1066,-0.32754
1067,-0.34026
1068,-0.35783000000000004
1069,-0.37342
1070,-0.37582
1071,-0.37726
1072,-0.41022
1073,-0.46111
1074,-0.42971000000000004
1075,-0.36109
1076,-0.3789
1077,-0.5193800000000001
1078,-0.53277
1079,-0.32723
1080,-0.21248000000000003
1081,-0.46326999999999996
1082,-0.71682
1083,-0.41013999999999995
1084,0.10411
1085,-0.096661
1086,-0.9514100000000001
1087,-0.9639200000000001
1088,0.47923000000000004
1089,1.3283
1090,-1.2396
1091,-6.9989
