time,value
0,-0.17055
1,-0.17055
2,-0.17055
3,-0.17055
4,-0.17055
5,-0.17055
6,-0.17055
7,-0.17055
8,-0.17055
9,-0.17055
10,-0.17055
11,-0.17055
12,-0.17055
13,-0.17055
14,-0.17055
15,-0.17055
16,-0.17055
17,-0.17055
18,-0.17055
19,-0.17055
20,-0.17055
21,-0.17055
22,-0.17055
23,-0.17055
24,-0.17055
25,-0.17055
26,-0.17055
27,-0.17055
28,-0.17055
29,-0.17055
30,-0.17055
31,-0.17055
32,-0.11165
33,0.094476
34,6.9262
35,0.094476
36,0.079752
37,0.079752
38,1.2724
39,6.5434
40,-0.17055
41,-0.17055
42,-0.1411
43,-0.17055
44,-0.17055
45,-0.17055
46,-0.17055
47,-0.17055
48,-0.17055
49,-0.17055
50,-0.17055
51,-0.17055
52,-0.17055
53,-0.17055
54,-0.17055
55,-0.17055
56,-0.17055
57,-0.17055
58,-0.17055
59,-0.17055
60,-0.17055
61,-0.17055
62,-0.17055
63,-0.17055
64,-0.17055
65,-0.17055
66,-0.17055
67,-0.17055
68,-0.17055
69,-0.17055
70,-0.17055
71,-0.17055
72,-0.17055
73,-0.17055
74,-0.17055
75,-0.17055
76,-0.17055
77,-0.17055
78,-0.17055
79,-0.17055
80,-0.17055
81,-0.17055
82,-0.17055
83,-0.17055
84,-0.17055
85,-0.17055
86,-0.17055
87,-0.17055
88,-0.17055
89,-0.17055
90,-0.17055
91,-0.17055
92,-0.17055
93,-0.17055
94,-0.17055
95,-0.17055
