time,value
0,-2.316
1,-2.316
2,-2.316
3,-2.3178
4,-2.3178
5,-2.3178
6,-2.3178
7,-2.3177
8,-2.323
9,-2.3303
10,-2.3299
11,-2.3295
12,-2.3288
13,-2.3282
14,-2.3273
15,-2.3282
16,-2.327
17,-2.3259
18,-2.3245
19,-2.3232
20,-2.3214
21,-2.3199
22,-2.3263
23,-2.3312
24,-2.329
25,-2.3272
26,-2.3248
27,-2.3228
28,-2.3201
29,-2.3179
30,-2.3167
31,-2.3143
32,-2.3111
33,-2.3085
34,-2.3051
35,-2.3040000000000003
36,-2.3099
37,-2.3118
38,-2.3080000000000003
39,-2.3049
40,-2.3017
41,-2.2977
42,-2.2943
43,-2.2916
44,-2.2881
45,-2.2836
46,-2.2799
47,-2.2752
48,-2.2714
49,-2.2705
50,-2.2757
51,-2.2731
52,-2.269
53,-2.2638
54,-2.261
55,-2.2556
56,-2.2513
57,-2.2457
58,-2.2412
59,-2.2381
60,-2.2425
61,-2.2418
62,-2.2371
63,-2.2311
64,-2.2263
65,-2.2215
66,-2.2166
67,-2.2103
68,-2.2053
69,-2.1989
70,-2.1938
71,-2.1873
72,-2.1821
73,-2.1806
74,-2.1843
75,-2.1802
76,-2.1747
77,-2.1693
78,-2.1625
79,-2.157
80,-2.15
81,-2.1444
82,-2.1374
83,-2.1318
84,-2.1247
85,-2.1201
86,-2.1129
87,-2.1071
88,-2.0998
89,-2.094
90,-2.0866
91,-2.0807
92,-2.0769
93,-2.0796
94,-2.0747
95,-2.0687
96,-2.0611
97,-2.055
98,-2.0484
99,-2.0423
100,-2.0346
101,-2.0275
102,-2.0197
103,-2.0135
104,-2.0058
105,-1.9995
106,-1.9917
107,-1.9855
108,-1.9776
109,-1.9713
110,-1.9634
111,-1.9569999999999999
112,-1.9491
113,-1.9436
114,-1.9356
115,-1.9292
116,-1.9228
117,-1.9147
118,-1.9083
119,-1.9002
120,-1.8937
121,-1.8856
122,-1.8791
123,-1.871
124,-1.8645
125,-1.8563
126,-1.8498
127,-1.8416
128,-1.8342
129,-1.8259999999999998
130,-1.8194
131,-1.8111
132,-1.8045
133,-1.7963
134,-1.7896
135,-1.7813
136,-1.7747
137,-1.7664
138,-1.7597
139,-1.7514
140,-1.7447
141,-1.7363
142,-1.7296
143,-1.7213
144,-1.7145
145,-1.7061
146,-1.6994
147,-1.6909999999999998
148,-1.6842
149,-1.6758
150,-1.669
151,-1.6606
152,-1.6538
153,-1.6469999999999998
154,-1.6385
155,-1.6318
156,-1.6267
157,-1.6203
158,-1.6118
159,-1.605
160,-1.5966
161,-1.5898
162,-1.5806
163,-1.5738
164,-1.5653
165,-1.5578
166,-1.5529
167,-1.5471
168,-1.5386
169,-1.5311
170,-1.5226
171,-1.5158
172,-1.5081
173,-1.5027
174,-1.4942
175,-1.4874
176,-1.4783
177,-1.4714
178,-1.4629
179,-1.4561
180,-1.4484
181,-1.4448
182,-1.4362
183,-1.4294
184,-1.4209
185,-1.4134
186,-1.4049
187,-1.3980000000000001
188,-1.3916
189,-1.3874
190,-1.3799
191,-1.3731
192,-1.3662
193,-1.3571
194,-1.3502
195,-1.3432
196,-1.3407
197,-1.3321
198,-1.3253
199,-1.3161
200,-1.3093
201,-1.3007
202,-1.2965
203,-1.2912
204,-1.2843
205,-1.2752
206,-1.2683
207,-1.2635
208,-1.2588
209,-1.2502
210,-1.2428
211,-1.2342
212,-1.2274
213,-1.2209999999999999
214,-1.2167
215,-1.2093
216,-1.2024
217,-1.1933
218,-1.1864
219,-1.1779
220,-1.1719
221,-1.1649
222,-1.1581
223,-1.1489
224,-1.1431
225,-1.1382
226,-1.1308
227,-1.1216
228,-1.1148
229,-1.1101
230,-1.1052
231,-1.0984
232,-1.0898
233,-1.0824
234,-1.0738
235,-1.067
236,-1.061
237,-1.0574
238,-1.0489
239,-1.042
240,-1.0329
241,-1.026
242,-1.0192
243,-1.0149
244,-1.0079
245,-1.0011
246,-0.99254
247,-0.9857
248,-0.97652
249,-0.96967
250,-0.96111
251,-0.95426
252,-0.9450700000000001
253,-0.9408700000000001
254,-0.9327700000000001
255,-0.9259200000000001
256,-0.9173600000000001
257,-0.9105
258,-0.9013100000000001
259,-0.89445
260,-0.88587
261,-0.879
262,-0.8715200000000001
263,-0.86736
264,-0.86098
265,-0.8541200000000001
266,-0.84554
267,-0.83867
268,-0.83119
269,-0.8226
270,-0.81572
271,-0.80712
272,-0.80024
273,-0.79223
274,-0.7853399999999999
275,-0.7761399999999999
276,-0.7692399999999999
277,-0.76062
278,-0.75372
279,-0.7450899999999999
280,-0.74336
281,-0.7376
282,-0.72953
283,-0.7237600000000001
284,-0.7208600000000001
285,-0.71165
286,-0.7099300000000001
287,-0.70475
288,-0.69784
289,-0.6892
290,-0.68171
291,-0.67307
292,-0.6661600000000001
293,-0.65751
294,-0.65233
295,-0.64828
296,-0.64079
297,-0.6338600000000001
298,-0.63152
299,-0.6228899999999999
300,-0.6154
301,-0.60677
302,-0.6027
303,-0.5957600000000001
304,-0.58886
305,-0.57965
306,-0.57216
307,-0.56808
308,-0.56172
309,-0.55423
310,-0.54953
311,-0.54489
312,-0.53628
313,-0.5288
314,-0.5201899999999999
315,-0.5133
316,-0.50694
317,-0.50283
318,-0.49533999999999995
319,-0.48786
320,-0.47925
321,-0.47229
322,-0.46816
323,-0.46128
324,-0.45208000000000004
325,-0.4452
326,-0.44106999999999996
327,-0.43581000000000003
328,-0.42662
329,-0.42075
330,-0.41376
331,-0.40628000000000003
332,-0.40149
333,-0.39683
334,-0.38764
335,-0.38344
336,-0.37643000000000004
337,-0.36959000000000003
338,-0.3604
339,-0.35464
340,-0.3498
341,-0.34233
342,-0.33315
343,-0.3263
344,-0.32225
345,-0.3174
346,-0.31164000000000003
347,-0.30246
348,-0.29562
349,-0.28923000000000004
350,-0.285
351,-0.2769
352,-0.27114
353,-0.26625
354,-0.26049
355,-0.25132
356,-0.24449
357,-0.23809
358,-0.23383
359,-0.22401999999999997
360,-0.21868
361,-0.21269000000000002
362,-0.20523000000000002
363,-0.19924
364,-0.19388
365,-0.18472
366,-0.18106
367,-0.17504
368,-0.16758
369,-0.16117
370,-0.15853
371,-0.14870999999999998
372,-0.14465999999999998
373,-0.13964000000000001
374,-0.13152
375,-0.1251
376,-0.12072000000000001
377,-0.11091
378,-0.10617
379,-0.099413
380,-0.091968
381,-0.084858
382,-0.082136
383,-0.07469400000000001
384,-0.068259
385,-0.063831
386,-0.060386
387,-0.055926
388,-0.048492
389,-0.044426
390,-0.039258
391,-0.031125999999999997
392,-0.024678
393,-0.020187
394,-0.010373
395,-0.0056036
396,-0.00038561
397,0.0070393999999999995
398,0.014203
399,0.017053
400,0.022315
401,0.026149000000000002
402,0.034518
403,0.041937999999999996
404,0.050312
405,0.053188
406,0.060372
407,0.067788
408,0.074026
409,0.079546
410,0.089357
411,0.092269
412,0.095932
413,0.098879
414,0.10425
415,0.10722999999999999
416,0.11097
417,0.11489
418,0.12394000000000001
419,0.12952
420,0.1342
421,0.14249
422,0.14987999999999999
423,0.15893
424,0.16360999999999998
425,0.17251
426,0.17824
427,0.1837
428,0.19019
429,0.19757
430,0.20228
431,0.21119000000000002
432,0.21691999999999997
433,0.22241
434,0.22814
435,0.23717
436,0.24378000000000002
437,0.25027
438,0.25335
439,0.25886
440,0.26195999999999997
441,0.27098
442,0.27583
443,0.28138
444,0.28874
445,0.29525
446,0.29838000000000003
447,0.30230999999999997
448,0.30711
449,0.31108
450,0.31511
451,0.32331
452,0.33066
453,0.33886
454,0.34209
455,0.34536999999999995
456,0.35194000000000003
457,0.36015
458,0.36672
459,0.37
460,0.37172
461,0.37751999999999997
462,0.37847
463,0.377
464,0.3836
465,0.3902
466,0.39769
467,0.39946
468,0.39729000000000003
469,0.40391
470,0.41143
471,0.41806000000000004
472,0.41911000000000004
473,0.41611000000000004
474,0.41236999999999996
475,0.40939000000000003
476,0.40569
477,0.40274
478,0.39907
479,0.39616
480,0.39253000000000005
481,0.38774000000000003
482,0.37865
483,0.37409000000000003
484,0.36691
485,0.36021
486,0.35112
487,0.34538
488,0.34010999999999997
489,0.33197
490,0.3248
491,0.31859
492,0.30949
493,0.30496
494,0.30141999999999997
495,0.29691999999999996
496,0.29047
497,0.28234000000000004
498,0.27954
499,0.27438
500,0.27161
501,0.26348
502,0.25704
503,0.2536
504,0.25087
505,0.24578000000000003
506,0.24308000000000002
507,0.23768000000000003
508,0.23023000000000002
509,0.22585
510,0.22149000000000002
511,0.21818
512,0.21006
513,0.20232999999999998
514,0.198
515,0.1895
516,0.18204
517,0.17354
518,0.17053
519,0.16726
520,0.16295
521,0.15972
522,0.15716
523,0.15183
524,0.14436
525,0.1384
526,0.13479000000000002
527,0.12561
528,0.12093
529,0.11607
530,0.1086
531,0.1033
532,0.099089
533,0.089902
534,0.084611
535,0.078706
536,0.069515
537,0.064236
538,0.060062
539,0.053197
540,0.044004
541,0.037141
542,0.032359
543,0.025985
544,0.016179
545,0.012029
546,0.0039414
547,-0.0024265999999999997
548,-0.007157600000000001
549,-0.013519
550,-0.021602
551,-0.027431999999999998
552,-0.037235000000000004
553,-0.042462
554,-0.049996
555,-0.058071000000000005
556,-0.061
557,-0.065052
558,-0.069662
559,-0.077155
560,-0.084636
561,-0.09154
562,-0.10017000000000001
563,-0.10415999999999999
564,-0.11222
565,-0.11799000000000001
566,-0.12079000000000001
567,-0.12474
568,-0.12749000000000002
569,-0.13499
570,-0.14185
571,-0.14576
572,-0.14845
573,-0.15179
574,-0.1593
575,-0.16491
576,-0.16702
577,-0.17137
578,-0.17765
579,-0.18516
580,-0.18722
581,-0.19153
582,-0.19355
583,-0.19605
584,-0.19979
585,-0.20604
586,-0.21229
587,-0.21473000000000003
588,-0.21666
589,-0.21905
590,-0.2227
591,-0.22503
592,-0.22688000000000003
593,-0.23309000000000002
594,-0.2406
595,-0.24243
596,-0.24555
597,-0.24600000000000002
598,-0.24734
599,-0.24866999999999997
600,-0.24911
601,-0.25306999999999996
602,-0.2548
603,-0.25694
604,-0.25861999999999996
605,-0.2607
606,-0.26153000000000004
607,-0.26235
608,-0.2622
609,-0.2642
610,-0.26499
611,-0.26499
612,-0.25609
613,-0.24896999999999997
614,-0.24006999999999998
615,-0.23295
616,-0.22405
617,-0.21693
618,-0.20801999999999998
619,-0.2009
620,-0.19401
621,-0.18928
622,-0.18037999999999998
623,-0.17325
624,-0.16435
625,-0.15684
626,-0.14794000000000002
627,-0.14082
628,-0.13609000000000002
629,-0.13274
630,-0.12385
631,-0.11673
632,-0.10744000000000001
633,-0.10031
634,-0.091414
635,-0.089847
636,-0.081545
637,-0.07443
638,-0.065139
639,-0.058022000000000004
640,-0.049123
641,-0.044778
642,-0.039234
643,-0.032121
644,-0.022831999999999998
645,-0.015717
646,-0.01234
647,-0.0057986
648,0.0030884
649,0.0106
650,0.018112
651,0.021918
652,0.029432
653,0.038721
654,0.045825
655,0.051014
656,0.057578
657,0.066866
658,0.07396599999999999
659,0.08148
660,0.084912
661,0.09107
662,0.098165
663,0.10745
664,0.11277999999999999
665,0.11664000000000001
666,0.12103
667,0.13032
668,0.13741
669,0.14492
670,0.14839000000000002
671,0.15456
672,0.16207
673,0.17093
674,0.1771
675,0.18236
676,0.18987
677,0.19691
678,0.20043
679,0.20751
680,0.21502
681,0.22386999999999999
682,0.22871999999999998
683,0.23401
684,0.24153000000000002
685,0.24684
686,0.24994
687,0.25701
688,0.26629
689,0.27336
690,0.27868000000000004
691,0.2818
692,0.29108
693,0.29641999999999996
694,0.30132
695,0.30838000000000004
696,0.31766
697,0.32471
698,0.32831
699,0.33145
700,0.34073000000000003
701,0.34778000000000003
702,0.3566
703,0.3602
704,0.36688000000000004
705,0.37393000000000004
706,0.38321
707,0.38896
708,0.39305
709,0.3988
710,0.40761
711,0.41512
712,0.42393000000000003
713,0.43098000000000003
714,0.4359
715,0.43954
716,0.44881000000000004
717,0.45375
718,0.45788
719,0.4598
720,0.46651000000000004
721,0.47451000000000004
722,0.47868999999999995
723,0.48494
724,0.49294
725,0.49666000000000005
726,0.50417
727,0.51294
728,0.5199600000000001
729,0.52874
730,0.53625
731,0.54503
732,0.55206
733,0.5562600000000001
734,0.5625100000000001
735,0.57177
736,0.5787899999999999
737,0.58504
738,0.58877
739,0.59628
740,0.60329
741,0.61256
742,0.61958
743,0.62835
744,0.63334
745,0.63883
746,0.64584
747,0.6551100000000001
748,0.6621199999999999
749,0.6663600000000001
750,0.67086
751,0.68013
752,0.68714
753,0.69465
754,0.6984
755,0.7046600000000001
756,0.71217
757,0.7209300000000001
758,0.72669
759,0.73096
760,0.7367199999999999
761,0.74547
762,0.75298
763,0.7592399999999999
764,0.76302
765,0.77104
766,0.77782
767,0.7833600000000001
768,0.79262
769,0.79591
770,0.80147
771,0.80898
772,0.81455
773,0.8196100000000001
774,0.82834
775,0.8353299999999999
776,0.84406
777,0.85157
778,0.8603
779,0.86729
780,0.87603
781,0.88302
782,0.8885799999999999
783,0.89364
784,0.90289
785,0.90846
786,0.9170200000000001
787,0.9233
788,0.92768
789,0.9334399999999999
790,0.9426899999999999
791,0.9496700000000001
792,0.95839
793,0.9653700000000001
794,0.9721799999999999
795,0.97604
796,0.9847600000000001
797,0.99174
798,1.001
799,1.008
800,1.0155
801,1.0193
802,1.0239
803,1.0326
804,1.0401
805,1.0488
806,1.0558
807,1.0626
808,1.0659
809,1.0752
810,1.0827
811,1.0914
812,1.0947
813,1.1004
814,1.1079
815,1.1147
816,1.1186
817,1.1278
818,1.1317
819,1.1386
820,1.1461
821,1.1523
822,1.1568
823,1.1655
824,1.1725
825,1.1812
826,1.1881
827,1.1968
828,1.2038
829,1.2102
830,1.2098
831,1.214
832,1.2199
833,1.2173
834,1.2152
835,1.2126
836,1.2105
837,1.2079
838,1.2059
839,1.2033
840,1.1958
841,1.1896
842,1.1853
843,1.1778
844,1.1715
845,1.1678
846,1.158
847,1.1513
848,1.1475
849,1.1405
850,1.1313
851,1.1242
852,1.1183
853,1.1138
854,1.105
855,1.0975
856,1.09
857,1.0863
858,1.08
859,1.072
860,1.0678
861,1.0603
862,1.0536
863,1.0499
864,1.0419
865,1.0362
866,1.0321
867,1.0241
868,1.0174
869,1.0155
870,1.0114
871,1.0065
872,0.9972
873,0.99359
874,0.98869
875,0.9811799999999999
876,0.97582
877,0.9726899999999999
878,0.9656299999999999
879,0.95681
880,0.9493
881,0.94047
882,0.9334100000000001
883,0.9293799999999999
884,0.92317
885,0.9152100000000001
886,0.91341
887,0.9094200000000001
888,0.90765
889,0.8979299999999999
890,0.89351
891,0.88956
892,0.8824799999999999
893,0.8736299999999999
894,0.86655
895,0.8572700000000001
896,0.85019
897,0.8444799999999999
898,0.8383
899,0.82945
900,0.82237
901,0.81308
902,0.8059999999999999
903,0.7971600000000001
904,0.79008
905,0.7848
906,0.77995
907,0.7711
908,0.76359
909,0.75607
910,0.75257
911,0.74463
912,0.73712
913,0.72826
914,0.72343
915,0.71818
916,0.7106600000000001
917,0.70627
918,0.7006100000000001
919,0.6931
920,0.6883
921,0.68486
922,0.67557
923,0.67119
924,0.6655800000000001
925,0.6580699999999999
926,0.6537
927,0.6503
928,0.6406
929,0.63625
930,0.63247
931,0.62495
932,0.61882
933,0.61546
934,0.60756
935,0.60183
936,0.5981
937,0.5919800000000001
938,0.58409
939,0.58255
940,0.57887
941,0.5755899999999999
942,0.56845
943,0.5613199999999999
944,0.5524
945,0.54527
946,0.53598
947,0.52885
948,0.51993
949,0.5128
950,0.50707
951,0.50378
952,0.49731000000000003
953,0.49017
954,0.48868
955,0.48506000000000005
956,0.4836
957,0.47752
958,0.47001000000000004
959,0.46643
960,0.46036000000000005
961,0.45106999999999997
962,0.44392
963,0.43785
964,0.43465
965,0.42715
966,0.41963999999999996
967,0.4107
968,0.40642
969,0.40145
970,0.39395
971,0.385
972,0.3775
973,0.36855
974,0.3614
975,0.35245
976,0.34709
977,0.34356
978,0.3375
979,0.32855999999999996
980,0.32105
981,0.31285999999999997
982,0.30971
983,0.30075999999999997
984,0.2936
985,0.2843
986,0.27714
987,0.26964
988,0.2665
989,0.26045
990,0.25329
991,0.24399
992,0.23829
993,0.23515999999999998
994,0.22521
995,0.22096999999999997
996,0.21755
997,0.21038
998,0.20108
999,0.19391
1000,0.18756
1001,0.18449000000000002
1002,0.17731
1003,0.17013
1004,0.16084
1005,0.1581
1006,0.15325999999999998
1007,0.14607
1008,0.13677999999999998
1009,0.1296
1010,0.12655999999999998
1011,0.12025
1012,0.11127000000000001
1013,0.10377
1014,0.095976
1015,0.09117
1016,0.081881
1017,0.074391
1018,0.06540399999999999
1019,0.062408000000000005
1020,0.057924
1021,0.050436
1022,0.047469
1023,0.043292000000000004
1024,0.034006
1025,0.026521
1026,0.017522
1027,0.016378999999999998
1028,0.01013
1029,0.0026474
1030,-0.0023426
1031,-0.0082976
1032,-0.015778999999999998
1033,-0.017127
1034,-0.019991
1035,-0.02129
1036,-0.02696
1037,-0.034689
1038,-0.037505000000000004
1039,-0.043419
1040,-0.050889
1041,-0.053676999999999996
1042,-0.058015
1043,-0.067288
1044,-0.068239
1045,-0.0694
1046,-0.072117
1047,-0.078212
1048,-0.08566900000000001
1049,-0.086761
1050,-0.089422
1051,-0.092272
1052,-0.097705
1053,-0.10495
1054,-0.10515
1055,-0.10575999999999999
1056,-0.10655999999999999
1057,-0.10752
1058,-0.10770999999999999
1059,-0.10809
1060,-0.10628
1061,-0.099025
1062,-0.09177300000000001
1063,-0.082708
1064,-0.08089400000000001
1065,-0.07527
1066,-0.06801900000000001
1067,-0.058952
1068,-0.0517
1069,-0.044447
1070,-0.035381
1071,-0.028127999999999997
1072,-0.019061
1073,-0.011807999999999999
1074,-0.0027405999999999997
1075,0.004513399999999999
1076,0.013581000000000001
1077,0.020835
1078,0.029904000000000003
1079,0.037159
1080,0.046228
1081,0.053483
1082,0.062552
1083,0.06980700000000001
1084,0.078878
1085,0.08631
1086,0.095203
1087,0.10246
1088,0.1117
1089,0.11896
1090,0.12803
1091,0.13529000000000002
1092,0.14436
1093,0.14998
1094,0.15267
1095,0.15829000000000001
1096,0.16735999999999998
1097,0.17462
1098,0.18386
1099,0.19112
1100,0.20019
1101,0.20744
1102,0.21179
1103,0.21416
1104,0.22321999999999997
1105,0.23066
1106,0.23972
1107,0.24698
1108,0.25423
1109,0.25697
1110,0.26279
1111,0.27186
1112,0.2793
1113,0.28512
1114,0.28770999999999997
1115,0.29515
1116,0.3024
1117,0.31166
1118,0.3189
1119,0.32796
1120,0.33037
1121,0.33660999999999996
1122,0.34385
1123,0.35311
1124,0.36036
1125,0.36319
1126,0.36723
1127,0.37629
1128,0.38374
1129,0.39098
1130,0.39363000000000004
1131,0.3979
1132,0.40514
1133,0.4144
1134,0.42163999999999996
1135,0.43068999999999996
1136,0.43655
1137,0.43945
1138,0.44669
1139,0.45573
1140,0.46319
1141,0.46747
1142,0.47018000000000004
1143,0.47922
1144,0.48668
1145,0.49391999999999997
1146,0.49845
1147,0.50276
1148,0.51203
1149,0.51477
1150,0.52091
1151,0.5281399999999999
1152,0.53741
1153,0.54464
1154,0.54765
1155,0.55355
1156,0.56102
1157,0.56382
1158,0.56818
1159,0.5754
1160,0.5844199999999999
1161,0.5918899999999999
1162,0.60092
1163,0.60659
1164,0.6096600000000001
1165,0.61533
1166,0.6230600000000001
1167,0.6259
1168,0.63183
1169,0.6390399999999999
1170,0.6480600000000001
1171,0.65528
1172,0.66456
1173,0.67177
1174,0.68079
1175,0.68801
1176,0.69703
1177,0.69987
1178,0.70427
1179,0.71175
1180,0.71642
1181,0.7190300000000001
1182,0.72831
1183,0.73093
1184,0.73383
1185,0.74284
1186,0.75032
1187,0.7593300000000001
1188,0.7619600000000001
1189,0.76668
1190,0.77388
1191,0.78289
1192,0.79009
1193,0.79937
1194,0.80658
1195,0.81558
1196,0.8227899999999999
1197,0.8317899999999999
1198,0.83595
1199,0.8388700000000001
1200,0.84636
1201,0.85536
1202,0.86256
1203,0.8715700000000001
1204,0.87905
1205,0.88805
1206,0.8952600000000001
1207,0.9042600000000001
1208,0.9096700000000001
1209,0.9128700000000001
1210,0.92064
1211,0.9296399999999999
1212,0.93684
1213,0.9461299999999999
1214,0.9533299999999999
1215,0.9623299999999999
1216,0.9698200000000001
1217,0.97304
1218,0.9805200000000001
1219,0.9895200000000001
1220,0.9970100000000001
1221,1.0042
1222,1.0132
1223,1.018
1224,1.0224
1225,1.0299
1226,1.0329
1227,1.0374
1228,1.0464
1229,1.0538
1230,1.0628
1231,1.0658
1232,1.0721
1233,1.0796
1234,1.0829
1235,1.0889
1236,1.0979
1237,1.1051
1238,1.1141
1239,1.1216
1240,1.1305
1241,1.1377
1242,1.1425
1243,1.1453
1244,1.1542
1245,1.1614
1246,1.1707
1247,1.1779
1248,1.1854
1249,1.1866
1250,1.19
1251,1.1912
1252,1.1987
1253,1.2062
1254,1.2152
1255,1.2215
1256,1.2261
1257,1.2336
1258,1.2426
1259,1.2497
1260,1.2569
1261,1.2659
1262,1.2731
1263,1.2819999999999998
1264,1.2895
1265,1.2985
1266,1.3057
1267,1.3147
1268,1.3222
1269,1.3255
1270,1.3330000000000002
1271,1.3423
1272,1.3495
1273,1.3558
1274,1.3571
1275,1.3661
1276,1.3736
1277,1.3826
1278,1.3853
1279,1.392
1280,1.3995
1281,1.4044
1282,1.409
1283,1.4180000000000001
1284,1.4255
1285,1.4333
1286,1.4364
1287,1.4436
1288,1.4508
1289,1.4597
1290,1.4669
1291,1.4762
1292,1.4815
1293,1.4833
1294,1.4887
1295,1.4923
1296,1.4955
1297,1.5042
1298,1.5107
1299,1.5179
1300,1.5232
1301,1.5226
1302,1.5228
1303,1.5215
1304,1.5248
1305,1.5241
1306,1.5225
1307,1.5213
1308,1.5198
1309,1.5195
1310,1.5149
1311,1.5119
1312,1.5024
1313,1.4985
1314,1.4952
1315,1.494
1316,1.4909999999999999
1317,1.4835
1318,1.4769999999999999
1319,1.4743
1320,1.4651
1321,1.4579
1322,1.4486
1323,1.4414
1324,1.4339
1325,1.4309
1326,1.4232
1327,1.4157
1328,1.4067
1329,1.4023
1330,1.3957
1331,1.3885
1332,1.3792
1333,1.3718
1334,1.3686
1335,1.3611
1336,1.3554
1337,1.3523
1338,1.3463
1339,1.3386
1340,1.3357
1341,1.328
1342,1.3218
1343,1.3187
1344,1.3177
1345,1.3149
1346,1.3074
1347,1.3015
1348,1.3005
1349,1.291
1350,1.2869
1351,1.2841
1352,1.2769
1353,1.2678
1354,1.2606
1355,1.2513
1356,1.2441
1357,1.2387
1358,1.2351
1359,1.2279
1360,1.2276
1361,1.2271
1362,1.2244
1363,1.2149
1364,1.2108
1365,1.2096
1366,1.2069
1367,1.2042
1368,1.1969
1369,1.1877
1370,1.1804
1371,1.1759
1372,1.1735
1373,1.1644
1374,1.157
1375,1.1497
1376,1.1461
1377,1.1425
1378,1.1334
1379,1.1294
1380,1.1255
1381,1.1179
1382,1.1086
1383,1.103
1384,1.1011
1385,1.0957
1386,1.0867
1387,1.0794
1388,1.0702
1389,1.0629
1390,1.0566
1391,1.0542
1392,1.0451
1393,1.0377
1394,1.0286
1395,1.026
1396,1.0217
1397,1.0145
1398,1.0052
1399,0.99777
1400,0.99493
1401,0.9893
1402,0.98185
1403,0.97924
1404,0.97321
1405,0.9657600000000001
1406,0.96298
1407,0.95716
1408,0.9481
1409,0.94066
1410,0.93465
1411,0.9321
1412,0.92484
1413,0.91885
1414,0.9163100000000001
1415,0.9088799999999999
1416,0.90145
1417,0.89238
1418,0.8882200000000001
1419,0.88389
1420,0.87646
1421,0.87034
1422,0.8662
1423,0.85696
1424,0.85449
1425,0.8503799999999999
1426,0.84296
1427,0.83388
1428,0.82662
1429,0.82401
1430,0.8200700000000001
1431,0.81099
1432,0.80357
1433,0.7944899999999999
1434,0.78723
1435,0.78147
1436,0.77905
1437,0.77164
1438,0.76437
1439,0.7551399999999999
1440,0.74787
1441,0.73879
1442,0.73639
1443,0.73385
1444,0.73329
1445,0.7275699999999999
1446,0.7203
1447,0.71121
1448,0.70381
1449,0.69472
1450,0.69081
1451,0.6884600000000001
1452,0.67925
1453,0.67198
1454,0.66276
1455,0.6554800000000001
1456,0.6463899999999999
1457,0.63912
1458,0.63159
1459,0.62927
1460,0.62005
1461,0.61278
1462,0.60356
1463,0.59955
1464,0.59726
1465,0.5899800000000001
1466,0.58089
1467,0.5735
1468,0.5644
1469,0.55713
1470,0.5547300000000001
1471,0.55087
1472,0.54177
1473,0.53438
1474,0.52699
1475,0.52474
1476,0.51725
1477,0.50997
1478,0.50088
1479,0.4936
1480,0.4844
1481,0.47712
1482,0.46802
1483,0.46579
1484,0.46185
1485,0.45457
1486,0.44537
1487,0.43809
1488,0.42899
1489,0.42343000000000003
1490,0.42123
1491,0.41376
1492,0.40648
1493,0.39729000000000003
1494,0.39000999999999997
1495,0.38090999999999997
1496,0.37363
1497,0.36453
1498,0.36234
1499,0.35844000000000004
1500,0.35115999999999997
1501,0.34197
1502,0.33469
1503,0.33246
1504,0.32684
1505,0.31773
1506,0.31037
1507,0.30475
1508,0.30264
1509,0.29346
1510,0.28618000000000005
1511,0.27699999999999997
1512,0.27321999999999996
1513,0.27108000000000004
1514,0.26379
1515,0.25461999999999996
1516,0.24734
1517,0.2434
1518,0.23964000000000002
1519,0.23053
1520,0.22319
1521,0.21585
1522,0.21383000000000002
1523,0.2064
1524,0.20089
1525,0.19885999999999998
1526,0.19153
1527,0.18603
1528,0.18403
1529,0.17848
1530,0.17115999999999998
1531,0.16924
1532,0.1619
1533,0.1564
1534,0.15449000000000002
1535,0.149
1536,0.14169
1537,0.13985
1538,0.13072999999999999
1539,0.12708
1540,0.12344000000000001
1541,0.11615999999999999
1542,0.11254000000000002
1543,0.10895
1544,0.099851
1545,0.09623999999999999
1546,0.09452200000000001
1547,0.087256
1548,0.08372
1549,0.08199
1550,0.082058
1551,0.078449
1552,0.069413
1553,0.063986
1554,0.060425
1555,0.054957000000000006
1556,0.05135599999999999
1557,0.05135599999999999
1558,0.051490999999999995
1559,0.051688
1560,0.051958000000000004
1561,0.052074
1562,0.054078999999999995
1563,0.054338
1564,0.056508
1565,0.056732000000000005
1566,0.064015
1567,0.073197
1568,0.08048
1569,0.084356
1570,0.086506
1571,0.095694
1572,0.099685
1573,0.10542
1574,0.1127
1575,0.12189000000000001
1576,0.12927
1577,0.13157
1578,0.13713
1579,0.14633
1580,0.15361
1581,0.15938
1582,0.16162
1583,0.17072
1584,0.17800000000000002
1585,0.1872
1586,0.19448
1587,0.20357
1588,0.21085
1589,0.21835
1590,0.22061
1591,0.22981999999999997
1592,0.2371
1593,0.24619000000000002
1594,0.25347
1595,0.26256
1596,0.26995
1597,0.27904
1598,0.28631999999999996
1599,0.29541999999999996
1600,0.30269
1601,0.31179
1602,0.31906
1603,0.32634
1604,0.33543
1605,0.34271
1606,0.35181
1607,0.35908
1608,0.36818
1609,0.37545
1610,0.38444
1611,0.39171999999999996
1612,0.40092
1613,0.40809
1614,0.41718999999999995
1615,0.42446000000000006
1616,0.43356000000000006
1617,0.44083999999999995
1618,0.44993
1619,0.45721000000000006
1620,0.46246000000000004
1621,0.46387
1622,0.47103999999999996
1623,0.47831999999999997
1624,0.48741999999999996
1625,0.4947
1626,0.5037
1627,0.51098
1628,0.52008
1629,0.52736
1630,0.53445
1631,0.53408
1632,0.5359
1633,0.53772
1634,0.54682
1635,0.55228
1636,0.55228
1637,0.55419
1638,0.55466
1639,0.56194
1640,0.57104
1641,0.57832
1642,0.5856
1643,0.5947
1644,0.6019800000000001
1645,0.60716
1646,0.61044
1647,0.61954
1648,0.6268199999999999
1649,0.63593
1650,0.6432100000000001
1651,0.6523100000000001
1652,0.65959
1653,0.66869
1654,0.67598
1655,0.68508
1656,0.6923600000000001
1657,0.7014600000000001
1658,0.7087399999999999
1659,0.71785
1660,0.72513
1661,0.73423
1662,0.74151
1663,0.75053
1664,0.75781
1665,0.7669199999999999
1666,0.7742
1667,0.7814
1668,0.7829
1669,0.7901
1670,0.7973899999999999
1671,0.8064899999999999
1672,0.8137800000000001
1673,0.82288
1674,0.82834
1675,0.8305600000000001
1676,0.8361
1677,0.8452
1678,0.85249
1679,0.85985
1680,0.86895
1681,0.87624
1682,0.8854200000000001
1683,0.88931
1684,0.8950299999999999
1685,0.9023100000000001
1686,0.9114200000000001
1687,0.9187
1688,0.92789
1689,0.9351700000000001
1690,0.94427
1691,0.95155
1692,0.9606600000000001
1693,0.9679399999999999
1694,0.9770399999999999
1695,0.9843200000000001
1696,0.9934200000000001
1697,1.0007
1698,1.0098
1699,1.0170000000000001
1700,1.0261
1701,1.0334
1702,1.0425
1703,1.0498
1704,1.0589
1705,1.0604
1706,1.0638
1707,1.0711
1708,1.0802
1709,1.0874
1710,1.0965
1711,1.1038
1712,1.1129
1713,1.1202
1714,1.1293
1715,1.1349
1716,1.137
1717,1.1425
1718,1.1497
1719,1.1588
1720,1.1661
1721,1.1752
1722,1.1769
1723,1.1803
1724,1.1875
1725,1.1909999999999998
1726,1.1947
1727,1.2038
1728,1.2109999999999999
1729,1.2201
1730,1.222
1731,1.2258
1732,1.2329999999999999
1733,1.2422
1734,1.2496
1735,1.2534
1736,1.2555
1737,1.2646
1738,1.2719
1739,1.281
1740,1.2884
1741,1.2975
1742,1.3047
1743,1.3138
1744,1.3211
1745,1.3302
1746,1.3375
1747,1.3465
1748,1.3538
1749,1.3629
1750,1.3646
1751,1.3659999999999999
1752,1.3733
1753,1.3824
1754,1.3897
1755,1.3988
1756,1.4061
1757,1.4134
1758,1.4225
1759,1.4298
1760,1.4389
1761,1.4425
1762,1.4462
1763,1.4516
1764,1.4535
1765,1.459
1766,1.4682
1767,1.4756
1768,1.4847
1769,1.4847
1770,1.4851
1771,1.4854
1772,1.4858
1773,1.4862
1774,1.4866
1775,1.4869999999999999
1776,1.4874
1777,1.4878
1778,1.4884
1779,1.4888
1780,1.4874
1781,1.4874
1782,1.4783
1783,1.4711
1784,1.4623
1785,1.4587
1786,1.4569
1787,1.4496
1788,1.446
1789,1.4424
1790,1.4333
1791,1.426
1792,1.4169
1793,1.4096
1794,1.4024
1795,1.3933
1796,1.3861
1797,1.3769999999999998
1798,1.3697
1799,1.3606
1800,1.3534
1801,1.3443
1802,1.337
1803,1.3318
1804,1.3305
1805,1.3233
1806,1.3159999999999998
1807,1.3071
1808,1.3037
1809,1.3007
1810,1.2936
1811,1.2903
1812,1.2872
1813,1.2781
1814,1.271
1815,1.2619
1816,1.2625
1817,1.2575
1818,1.2502
1819,1.2411
1820,1.2339
1821,1.2248
1822,1.2177
1823,1.2086
1824,1.2013
1825,1.1922
1826,1.185
1827,1.1759
1828,1.1747
1829,1.1715
1830,1.1642
1831,1.1553
1832,1.1482
1833,1.147
1834,1.1401
1835,1.1328
1836,1.1238
1837,1.1165
1838,1.1074
1839,1.1002
1840,1.0911
1841,1.0871
1842,1.0845
1843,1.0809
1844,1.0718
1845,1.0645
1846,1.0555
1847,1.0482
1848,1.0390000000000001
1849,1.0319
1850,1.0228
1851,1.0155
1852,1.0065
1853,0.9992
1854,0.9901200000000001
1855,0.9828600000000001
1856,0.97378
1857,0.97445
1858,0.96951
1859,0.96226
1860,0.9531799999999999
1861,0.9461
1862,0.9370299999999999
1863,0.93176
1864,0.9308200000000001
1865,0.92375
1866,0.9146799999999999
1867,0.90761
1868,0.89854
1869,0.8912899999999999
1870,0.89002
1871,0.88715
1872,0.8799
1873,0.8710200000000001
1874,0.86377
1875,0.86072
1876,0.8595
1877,0.8506299999999999
1878,0.84339
1879,0.8343299999999999
1880,0.8270799999999999
1881,0.81802
1882,0.8107800000000001
1883,0.80172
1884,0.79447
1885,0.78562
1886,0.77837
1887,0.76932
1888,0.76207
1889,0.76026
1890,0.75664
1891,0.74758
1892,0.7439600000000001
1893,0.73853
1894,0.73129
1895,0.72223
1896,0.71499
1897,0.70594
1898,0.6986899999999999
1899,0.6896399999999999
1900,0.6824
1901,0.6733399999999999
1902,0.6661
1903,0.65705
1904,0.64981
1905,0.64076
1906,0.63352
1907,0.62425
1908,0.6170100000000001
1909,0.60977
1910,0.60072
1911,0.59348
1912,0.58443
1913,0.58262
1914,0.579
1915,0.57357
1916,0.5737800000000001
1917,0.57421
1918,0.57328
1919,0.57328
1920,0.56966
1921,0.56242
1922,0.557
1923,0.557
1924,0.55519
1925,0.55519
1926,0.54614
1927,0.53891
1928,0.53145
1929,0.52942
1930,0.52174
1931,0.5145
1932,0.50546
1933,0.49822
1934,0.49641
1935,0.49235
1936,0.48331
1937,0.47607
1938,0.46703
1939,0.45979
1940,0.45075
1941,0.44351
1942,0.44283
1943,0.43943999999999994
1944,0.4304
1945,0.42317
1946,0.41594
1947,0.40713
1948,0.3999
1949,0.39629000000000003
1950,0.39448
1951,0.38725
1952,0.38364000000000004
1953,0.37821
1954,0.37098000000000003
1955,0.36195
1956,0.35472
1957,0.34568000000000004
1958,0.33846
1959,0.32942
1960,0.32219000000000003
1961,0.31316
1962,0.30617
1963,0.29714
1964,0.28991999999999996
1965,0.28704
1966,0.28442
1967,0.27564
1968,0.27254
1969,0.27202
1970,0.2648
1971,0.25604
1972,0.24883000000000002
1973,0.24628000000000003
1974,0.24348000000000003
1975,0.23474
1976,0.22754000000000002
1977,0.2206
1978,0.21991
1979,0.21325999999999998
1980,0.20606
1981,0.19734000000000002
1982,0.19014
1983,0.18114
1984,0.1787
1985,0.17777
1986,0.16877999999999999
1987,0.16159
1988,0.1526
1989,0.1457
1990,0.13671
1991,0.12952
1992,0.12503
1993,0.12445999999999999
1994,0.11547
1995,0.10829000000000001
1996,0.099311
1997,0.09244
1998,0.083463
1999,0.076282
2000,0.06941699999999999
2001,0.06889400000000001
2002,0.062362
2003,0.055513
2004,0.046548
2005,0.043618000000000004
2006,0.043151
2007,0.036319
2008,0.027363
2009,0.020199
2010,0.011243000000000001
2011,0.0044224
2012,-0.004529600000000001
2013,-0.011691
2014,-0.020641
2015,-0.025666
2016,-0.025715
2017,-0.032514999999999995
2018,-0.041454000000000005
2019,-0.04825
2020,-0.052174
2021,-0.054655999999999996
2022,-0.063583
2023,-0.07072300000000001
2024,-0.07749600000000001
2025,-0.086418
2026,-0.091399
2027,-0.091305
2028,-0.096273
2029,-0.1048
2030,-0.11193
2031,-0.1165
2032,-0.11673
2033,-0.12523
2034,-0.13235
2035,-0.14085
2036,-0.14795999999999998
2037,-0.15685
2038,-0.15702
2039,-0.15935
2040,-0.16604000000000002
2041,-0.17492
2042,-0.18161
2043,-0.18307
2044,-0.18974000000000002
2045,-0.19817
2046,-0.20526
2047,-0.20665
2048,-0.20931999999999998
2049,-0.21816999999999998
2050,-0.2248
2051,-0.23099
2052,-0.2292
2053,-0.22871
2054,-0.22688000000000003
2055,-0.23524
2056,-0.23736999999999997
2057,-0.23901
2058,-0.24558000000000002
2059,-0.24766999999999997
2060,-0.2475
2061,-0.25405
2062,-0.25785
2063,-0.25763
2064,-0.25514000000000003
2065,-0.25538
2066,-0.26361999999999997
2067,-0.26384
2068,-0.26302
2069,-0.26093
2070,-0.26285
2071,-0.2693
2072,-0.26944
2073,-0.27078
2074,-0.27894
2075,-0.2785
2076,-0.27749
2077,-0.27526999999999996
2078,-0.28108
2079,-0.28802
2080,-0.29612
2081,-0.30304000000000003
2082,-0.3117
2083,-0.31345
2084,-0.31287
2085,-0.3192
2086,-0.3209
2087,-0.31854
2088,-0.31556999999999996
2089,-0.3149
2090,-0.31187
2091,-0.30943000000000004
2092,-0.30635999999999997
2093,-0.30683
2094,-0.30621
2095,-0.30372
2096,-0.30057
2097,-0.29867
2098,-0.29803
2099,-0.29377
2100,-0.28843
2101,-0.27926
2102,-0.27392
2103,-0.26793
2104,-0.26047
2105,-0.25381
2106,-0.2474
2107,-0.23889000000000002
2108,-0.23143000000000002
2109,-0.22501999999999997
2110,-0.22241
2111,-0.21741
2112,-0.21475999999999998
2113,-0.20626999999999998
2114,-0.19948
2115,-0.19099000000000002
2116,-0.18354
2117,-0.17504
2118,-0.16824
2119,-0.15972999999999998
2120,-0.15292
2121,-0.14717
2122,-0.14376
2123,-0.13525
2124,-0.12843
2125,-0.12332
2126,-0.12032999999999999
2127,-0.11285999999999999
2128,-0.10605
2129,-0.097523
2130,-0.092407
2131,-0.09006
2132,-0.088771
2133,-0.08706699999999999
2134,-0.07960199999999999
2135,-0.076192
2136,-0.071077
2137,-0.06425299999999999
2138,-0.055720000000000006
2139,-0.048892000000000005
2140,-0.040351
2141,-0.033517
2142,-0.024971
2143,-0.020919999999999998
2144,-0.014334
2145,-0.01028
2146,-0.0017396
2147,0.0057284
2148,0.014272
2149,0.02111
2150,0.027502
2151,0.031744
2152,0.040922
2153,0.047757
2154,0.05630399999999999
2155,0.063144
2156,0.072326
2157,0.079169
2158,0.087726
2159,0.094573
2160,0.10314000000000001
2161,0.10999
2162,0.11528
2163,0.1212
2164,0.12976
2165,0.13660999999999998
2166,0.1458
2167,0.15265
2168,0.16075
2169,0.16495
2170,0.17414000000000002
2171,0.18099
2172,0.18955999999999998
2173,0.19702999999999998
2174,0.2056
2175,0.21245999999999998
2176,0.21932
2177,0.2279
2178,0.23489000000000002
2179,0.24079
2180,0.24764
2181,0.25683
2182,0.2637
2183,0.26959
2184,0.27488
2185,0.28407
2186,0.28656
2187,0.2914
2188,0.29391999999999996
2189,0.30201999999999996
2190,0.30885999999999997
2191,0.31740999999999997
2192,0.32488
2193,0.33344
2194,0.33937
2195,0.34469
2196,0.35152
2197,0.3607
2198,0.36818
2199,0.37304
2200,0.38051
2201,0.38754
2202,0.3918
2203,0.395
2204,0.39928
2205,0.40845
2206,0.41208999999999996
2207,0.41639
2208,0.4232
2209,0.43172
2210,0.43918
2211,0.4477
2212,0.45452
2213,0.46134
2214,0.46816
2215,0.47243999999999997
2216,0.47948999999999997
2217,0.48631
2218,0.49546999999999997
2219,0.5029399999999999
2220,0.5078699999999999
2221,0.51363
2222,0.52174
2223,0.52604
2224,0.53415
2225,0.54056
2226,0.54384
2227,0.5481699999999999
2228,0.55148
2229,0.55893
2230,0.56535
2231,0.56802
2232,0.5713600000000001
2233,0.57406
2234,0.57744
2235,0.58017
2236,0.5835899999999999
2237,0.5846600000000001
2238,0.57692
2239,0.5773199999999999
2240,0.57436
2241,0.56903
2242,0.56708
2243,0.56204
2244,0.5536399999999999
2245,0.54692
2246,0.5385300000000001
2247,0.53685
2248,0.5320699999999999
2249,0.52536
2250,0.51626
2251,0.50955
2252,0.50284
2253,0.49541999999999997
2254,0.49088999999999994
2255,0.48275
2256,0.47603999999999996
2257,0.46766
2258,0.46024
2259,0.45186000000000004
2260,0.44732
2261,0.44015
2262,0.43343999999999994
2263,0.42435
2264,0.41693
2265,0.41168000000000005
2266,0.40426
2267,0.39587
2268,0.38916999999999996
2269,0.38079
2270,0.37337
2271,0.365
2272,0.35831
2273,0.34995
2274,0.3442
2275,0.33892
2276,0.33316999999999997
2277,0.32481
2278,0.31811999999999996
2279,0.30976
2280,0.30307
2281,0.29472
2282,0.28804
2283,0.2797
2284,0.27302
2285,0.26469000000000004
2286,0.26523
2287,0.26321
2288,0.25656
2289,0.24824000000000002
2290,0.2416
2291,0.23495
2292,0.22665
2293,0.22077
2294,0.21248000000000003
2295,0.2051
2296,0.19680999999999998
2297,0.19019
2298,0.18191
2299,0.1753
2300,0.16702999999999998
2301,0.16042
2302,0.15404
2303,0.15009
2304,0.14182
2305,0.13521
2306,0.12695
2307,0.11957000000000001
2308,0.11132
2309,0.10472000000000001
2310,0.098223
2311,0.093481
2312,0.08610599999999999
2313,0.07950299999999999
2314,0.07048
2315,0.063884
2316,0.055644000000000006
2317,0.051662
2318,0.043612
2319,0.037015
2320,0.028772000000000002
2321,0.022182
2322,0.013168000000000001
2323,0.0065834000000000005
2324,-0.0016416
2325,-0.007285600000000001
2326,-0.013706999999999999
2327,-0.020291
2328,-0.027658
2329,-0.035883
2330,-0.039881
2331,-0.044652
2332,-0.051240999999999995
2333,-0.05946900000000001
2334,-0.066048
2335,-0.074268
2336,-0.08084
2337,-0.08984099999999999
2338,-0.09640599999999999
2339,-0.10461
2340,-0.11116
2341,-0.11936
2342,-0.12503
2343,-0.13149
2344,-0.13805
2345,-0.14624
2346,-0.15279
2347,-0.16097
2348,-0.16832
2349,-0.17649
2350,-0.18303
2351,-0.19119
2352,-0.19608
2353,-0.20339000000000002
2354,-0.20992
2355,-0.21809
2356,-0.22461
2357,-0.23276999999999998
2358,-0.23929
2359,-0.24743
2360,-0.25393000000000004
2361,-0.26206
2362,-0.26855999999999997
2363,-0.27668000000000004
2364,-0.28317
2365,-0.29128000000000004
2366,-0.29775999999999997
2367,-0.29932
2368,-0.29834
2369,-0.3048
2370,-0.31285999999999997
2371,-0.31931
2372,-0.32736
2373,-0.3338
2374,-0.34183
2375,-0.34826
2376,-0.35541999999999996
2377,-0.36183000000000004
2378,-0.36984
2379,-0.37624
2380,-0.38424
2381,-0.39063000000000003
2382,-0.39860999999999996
2383,-0.40499
2384,-0.41296000000000005
2385,-0.41931999999999997
2386,-0.4241
2387,-0.42568999999999996
2388,-0.43363
2389,-0.4384
2390,-0.43998000000000004
2391,-0.44633
2392,-0.45425
2393,-0.46148999999999996
2394,-0.4694
2395,-0.47573000000000004
2396,-0.48362
2397,-0.48993000000000003
2398,-0.49606999999999996
2399,-0.5010399999999999
2400,-0.50985
2401,-0.5161600000000001
2402,-0.5243
2403,-0.52952
2404,-0.53517
2405,-0.54422
2406,-0.54942
2407,-0.55666
2408,-0.56298
2409,-0.5717800000000001
2410,-0.57809
2411,-0.58597
2412,-0.59029
2413,-0.5971
2414,-0.60432
2415,-0.6111300000000001
2416,-0.61859
2417,-0.62831
2418,-0.63352
2419,-0.64165
2420,-0.64889
2421,-0.65678
2422,-0.66267
2423,-0.66788
2424,-0.67511
2425,-0.68166
2426,-0.68686
2427,-0.6941
2428,-0.70043
2429,-0.70924
2430,-0.7155600000000001
2431,-0.72345
2432,-0.7277600000000001
2433,-0.73388
2434,-0.7375
2435,-0.74336
2436,-0.7497
2437,-0.75762
2438,-0.76485
2439,-0.77275
2440,-0.7784
2441,-0.78452
2442,-0.78859
2443,-0.79582
2444,-0.80372
2445,-0.81003
2446,-0.81616
2447,-0.82114
2448,-0.83176
2449,-0.83696
2450,-0.8451
2451,-0.8516600000000001
2452,-0.85774
2453,-0.86498
2454,-0.87402
2455,-0.8791899999999999
2456,-0.88713
2457,-0.8943700000000001
2458,-0.90161
2459,-0.9083700000000001
2460,-0.9174100000000001
2461,-0.92396
2462,-0.93001
2463,-0.93637
2464,-0.94521
2465,-0.95155
2466,-0.95742
2467,-0.9625799999999999
2468,-0.9714200000000001
2469,-0.9772700000000001
2470,-0.9824200000000001
2471,-0.9887799999999999
2472,-0.9976200000000001
2473,-1.004
2474,-1.0123
2475,-1.0166
2476,-1.0254
2477,-1.0306
2478,-1.038
2479,-1.0453
2480,-1.0529
2481,-1.0578
2482,-1.0642
2483,-1.073
2484,-1.0803
2485,-1.0863
2486,-1.0936
2487,-1.1024
2488,-1.1088
2489,-1.1146
2490,-1.1198
2491,-1.1286
2492,-1.1336
2493,-1.1396
2494,-1.1468
2495,-1.1543
2496,-1.1593
2497,-1.1673
2498,-1.1746
2499,-1.1826
2500,-1.1893
2501,-1.1967
2502,-1.204
2503,-1.21
2504,-1.2149
2505,-1.2238
2506,-1.2272
2507,-1.2346
2508,-1.2411
2509,-1.2499
2510,-1.2572
2511,-1.2632
2512,-1.2688
2513,-1.2777
2514,-1.2841
2515,-1.2907
2516,-1.2957
2517,-1.3039
2518,-1.308
2519,-1.3146
2520,-1.3219999999999998
2521,-1.3293
2522,-1.3336
2523,-1.3386
2524,-1.3444
2525,-1.3517
2526,-1.3599
2527,-1.3656
2528,-1.3746
2529,-1.3795
2530,-1.3852
2531,-1.3917
2532,-1.3998
2533,-1.4072
2534,-1.4153
2535,-1.421
2536,-1.4267
2537,-1.4324
2538,-1.4414
2539,-1.4479
2540,-1.4552
2541,-1.4602
2542,-1.4683
2543,-1.4748
2544,-1.4829
2545,-1.4902
2546,-1.4982
2547,-1.5047
2548,-1.5119999999999998
2549,-1.517
2550,-1.5235
2551,-1.53
2552,-1.538
2553,-1.5445
2554,-1.5525
2555,-1.5589
2556,-1.5678
2557,-1.5742
2558,-1.5805
2559,-1.5885
2560,-1.5949
2561,-1.6028
2562,-1.6092
2563,-1.6171
2564,-1.6234
2565,-1.6313
2566,-1.6381
2567,-1.6455
2568,-1.6519
2569,-1.6597
2570,-1.666
2571,-1.6739
2572,-1.681
2573,-1.6889
2574,-1.6951
2575,-1.7029
2576,-1.7091
2577,-1.7162
2578,-1.7216
2579,-1.7282
2580,-1.7344
2581,-1.7421
2582,-1.7483
2583,-1.756
2584,-1.7622
2585,-1.7698
2586,-1.7769
2587,-1.7846
2588,-1.7907
2589,-1.7983
2590,-1.8043
2591,-1.8119
2592,-1.8175
2593,-1.825
2594,-1.8311
2595,-1.8371
2596,-1.8446
2597,-1.8506
2598,-1.8581
2599,-1.864
2600,-1.8725
2601,-1.8784
2602,-1.8858
2603,-1.8917
2604,-1.899
2605,-1.9037
2606,-1.911
2607,-1.9168
2608,-1.9241
2609,-1.9299
2610,-1.9383
2611,-1.9441
2612,-1.9513
2613,-1.9569999999999999
2614,-1.9641
2615,-1.9698
2616,-1.9769
2617,-1.9825
2618,-1.9895
2619,-1.995
2620,-2.003
2621,-2.0091
2622,-2.0172
2623,-2.0227
2624,-2.0296
2625,-2.0351
2626,-2.0431
2627,-2.0485
2628,-2.0552
2629,-2.0606
2630,-2.0672
2631,-2.0725
2632,-2.079
2633,-2.0842
2634,-2.0894
2635,-2.0958
2636,-2.1009
2637,-2.1072
2638,-2.1122
2639,-2.1184
2640,-2.1233
2641,-2.1294
2642,-2.1343
2643,-2.1355
2644,-2.1367
2645,-2.1426
2646,-2.1438
2647,-2.1485
2648,-2.1532
2649,-2.1589
2650,-2.1635
2651,-2.1691
2652,-2.1736
2653,-2.1791
2654,-2.1834
2655,-2.1888
2656,-2.193
2657,-2.1982
2658,-2.2024
2659,-2.2074
2660,-2.2114
2661,-2.2163
2662,-2.2202
2663,-2.2249
2664,-2.2286
2665,-2.2332
2666,-2.2367
2667,-2.2411
2668,-2.2429
2669,-2.2471
2670,-2.2504
2671,-2.2552
2672,-2.2591
2673,-2.2605
2674,-2.2642
2675,-2.2671
2676,-2.2723
2677,-2.275
2678,-2.2783
2679,-2.2808
2680,-2.2838
2681,-2.2862
2682,-2.289
2683,-2.2912
2684,-2.2938
2685,-2.2957
2686,-2.2981
2687,-2.2998
2688,-2.3019
2689,-2.3035
2690,-2.3054
2691,-2.3067
2692,-2.3083
2693,-2.3095
2694,-2.3108
2695,-2.3117
2696,-2.3128
2697,-2.3135
2698,-2.3125
2699,-2.313
2700,-2.3135
2701,-2.3138
2702,-2.3141
2703,-2.3141
2704,-2.3141
2705,-2.316
2706,-2.316
2707,-2.316
2708,-2.316
