time,value
0,-0.49782
1,-0.49782
2,-0.49782
3,-0.49782
4,-0.49782
5,-0.49782
6,-0.49782
7,-0.49782
8,-0.49782
9,-0.49782
10,-0.49782
11,-0.49782
12,-0.49782
13,-0.49782
14,-0.49782
15,-0.49782
16,-0.49782
17,-0.49782
18,-0.49782
19,-0.49782
20,-0.49782
21,-0.49782
22,-0.49782
23,-0.49782
24,-0.49782
25,-0.49782
26,-0.49782
27,-0.49782
28,-0.49782
29,-0.49782
30,-0.49782
31,-0.49782
32,1.9072
33,2.2176
34,1.1314
35,-0.49782
36,-0.49782
37,-0.49782
38,-0.49782
39,-0.49782
40,-0.49782
41,-0.49782
42,-0.49782
43,-0.49782
44,-0.49782
45,-0.49782
46,-0.49782
47,-0.49782
48,-0.49782
49,-0.49782
50,-0.49782
51,-0.49782
52,-0.49782
53,-0.49782
54,-0.49782
55,-0.49782
56,-0.49782
57,-0.49782
58,-0.49782
59,-0.49782
60,-0.49782
61,-0.49782
62,-0.49782
63,-0.49782
64,-0.49782
65,-0.49782
66,-0.49782
67,-0.49782
68,-0.49782
69,-0.49782
70,-0.49782
71,0.7435
72,2.2176
73,2.2176
74,2.14
75,2.0624
76,2.2176
77,2.2176
78,1.9848
79,1.6745
80,2.2176
81,2.14
82,2.14
83,2.14
84,2.0624
85,1.9072
86,1.9072
87,0.58833
88,-0.49782
89,-0.49782
90,-0.49782
91,-0.49782
92,-0.49782
93,-0.49782
94,-0.49782
95,-0.49782
