time,value
0,-0.39
1,-0.39
2,-0.39
3,-0.39
4,-0.39
5,-0.39
6,-0.39
7,-0.39
8,-0.39
9,-0.39
10,-0.39
11,-0.39
12,-0.043332999999999997
13,-0.39
14,-0.39
15,-0.39
16,-0.39
17,-0.39
18,-0.39
19,-0.39
20,-0.043332999999999997
21,-0.39
22,-0.39
23,-0.39
24,-0.39
25,-0.39
26,-0.39
27,-0.39
28,-0.39
29,-0.39
30,-0.39
31,-0.39
32,-0.39
33,-0.39
34,-0.39
35,-0.39
36,-0.39
37,-0.39
38,-0.39
39,-0.39
40,-0.043332999999999997
41,-0.39
42,-0.39
43,-0.39
44,-0.39
45,-0.39
46,-0.39
47,-0.39
48,-0.39
49,-0.39
50,-0.39
51,-0.39
52,-0.39
53,-0.39
54,-0.39
55,-0.39
56,-0.043332999999999997
57,-0.39
58,-0.39
59,-0.39
60,-0.39
61,-0.39
62,-0.39
63,-0.39
64,-0.39
65,-0.39
66,-0.39
67,-0.39
68,-0.39
69,-0.39
70,-0.39
71,-0.39
72,-0.39
73,-0.39
74,-0.39
75,-0.39
76,-0.39
77,1.5167
78,0.65
79,0.65
80,0.8233299999999999
81,0.65
82,0.65
83,0.47667
84,0.8233299999999999
85,2.73
86,3.5967
87,3.77
88,3.77
89,3.5967
90,2.9033
91,2.73
92,0.47667
93,-0.39
94,-0.39
95,-0.39
