time,value
0,0.81107
1,-0.27792
2,-1.0947
3,-1.0947
4,-1.0947
5,-1.0947
6,-1.0947
7,-1.0947
8,-1.0947
9,-1.0947
10,-1.0947
11,-1.0947
12,-1.0947
13,-1.0947
14,1.2648
15,1.0833
16,0.9925700000000001
17,1.0833
18,0.9925700000000001
19,0.9018200000000001
20,0.9925700000000001
21,0.9018200000000001
22,-0.6409100000000001
23,-1.0947
24,-1.0947
25,-1.0947
26,-1.0947
27,-1.0947
28,-1.0947
29,-1.0947
30,-1.0947
31,-1.0947
32,-1.0947
33,-1.0947
34,0.9018200000000001
35,1.0833
36,1.0833
37,1.0833
38,0.9925700000000001
39,0.9018200000000001
40,0.9018200000000001
41,0.9018200000000001
42,0.9018200000000001
43,0.81107
44,0.9018200000000001
45,0.81107
46,0.81107
47,0.9018200000000001
48,0.81107
49,0.35731999999999997
50,-1.0947
51,-1.0947
52,-1.0947
53,-1.0947
54,1.0833
55,0.9925700000000001
56,0.9925700000000001
57,-0.18717
58,0.26657
59,1.6278
60,1.2648
61,0.9018200000000001
62,0.9018200000000001
63,0.9018200000000001
64,0.9018200000000001
65,0.9018200000000001
66,-0.27792
67,-1.0947
68,-1.0947
69,-1.0947
70,0.9925700000000001
71,1.0833
72,-0.27792
73,-1.0947
74,-1.0947
75,-0.18717
76,1.1741
77,1.1741
78,0.44806999999999997
79,-1.0947
80,-1.0947
81,-1.0947
82,0.81107
83,1.1741
84,1.1741
85,-0.45942
86,-1.0947
87,-1.0947
88,-0.0056718
89,1.1741
90,1.1741
91,0.085077
92,-1.0947
93,-1.0947
94,-0.7316600000000001
95,1.3556
