time,value
0,-0.14037
1,-0.14037
2,0.35871
3,-0.14037
4,-0.14037
5,-0.14037
6,-0.14037
7,-0.14037
8,-0.14037
9,-0.14037
10,-0.14037
11,-0.14037
12,-0.14037
13,-0.14037
14,-0.14037
15,-0.14037
16,-0.14037
17,-0.14037
18,-0.14037
19,-0.14037
20,-0.14037
21,-0.14037
22,-0.14037
23,-0.14037
24,-0.14037
25,-0.14037
26,-0.14037
27,0.35871
28,-0.14037
29,-0.14037
30,-0.14037
31,-0.14037
32,-0.14037
33,-0.14037
34,-0.14037
35,-0.14037
36,-0.14037
37,-0.14037
38,-0.14037
39,-0.14037
40,-0.14037
41,-0.14037
42,-0.14037
43,-0.14037
44,-0.14037
45,-0.14037
46,-0.14037
47,-0.14037
48,-0.14037
49,-0.14037
50,-0.14037
51,-0.14037
52,-0.14037
53,-0.14037
54,-0.14037
55,-0.14037
56,-0.14037
57,-0.14037
58,-0.14037
59,-0.14037
60,-0.14037
61,-0.14037
62,-0.14037
63,-0.14037
64,-0.14037
65,-0.14037
66,-0.14037
67,-0.14037
68,-0.14037
69,-0.14037
70,-0.14037
71,-0.14037
72,-0.14037
73,-0.14037
74,-0.14037
75,-0.14037
76,-0.14037
77,-0.14037
78,0.35871
79,-0.14037
80,-0.14037
81,-0.14037
82,-0.14037
83,-0.14037
84,-0.14037
85,-0.14037
86,-0.14037
87,2.355
88,9.3421
89,-0.14037
90,-0.14037
91,-0.14037
92,-0.14037
93,-0.14037
94,-0.14037
95,-0.14037
