time,value
0,0.56745
1,0.7310399999999999
2,-0.086907
3,-0.41408
4,-0.41408
5,-0.41408
6,-0.41408
7,-0.41408
8,-0.41408
9,-0.41408
10,-0.41408
11,-0.41408
12,0.24026999999999998
13,-0.41408
14,-0.41408
15,-0.41408
16,-0.41408
17,-0.41408
18,-0.41408
19,-0.41408
20,0.40386
21,-0.41408
22,-0.41408
23,-0.41408
24,-0.41408
25,-0.41408
26,-0.41408
27,-0.41408
28,-0.41408
29,-0.41408
30,-0.41408
31,-0.41408
32,-0.41408
33,-0.41408
34,-0.41408
35,-0.41408
36,-0.41408
37,-0.41408
38,-0.41408
39,-0.41408
40,0.076682
41,-0.41408
42,-0.41408
43,-0.41408
44,-0.41408
45,-0.41408
46,-0.41408
47,-0.41408
48,-0.41408
49,-0.41408
50,-0.41408
51,-0.41408
52,-0.41408
53,-0.41408
54,-0.41408
55,-0.41408
56,-0.086907
57,-0.41408
58,-0.41408
59,-0.41408
60,-0.41408
61,-0.41408
62,-0.41408
63,-0.41408
64,-0.41408
65,-0.41408
66,-0.41408
67,-0.41408
68,-0.41408
69,-0.41408
70,-0.41408
71,-0.41408
72,-0.41408
73,-0.41408
74,-0.41408
75,-0.41408
76,-0.41408
77,-0.41408
78,-0.41408
79,-0.41408
80,-0.41408
81,0.8946299999999999
82,0.56745
83,0.7310399999999999
84,0.56745
85,0.7310399999999999
86,2.5305
87,3.512
88,3.3485
89,3.512
90,3.3485
91,3.512
92,3.3485
93,0.8946299999999999
94,0.7310399999999999
95,0.56745
