time,value
0,-0.33353
1,-0.33353
2,-0.33353
3,-0.33353
4,-0.33353
5,-0.33353
6,-0.33353
7,-0.33353
8,-0.33353
9,-0.33353
10,-0.33353
11,-0.33353
12,-0.33353
13,-0.33353
14,-0.33353
15,-0.33353
16,-0.33353
17,-0.33353
18,-0.33353
19,-0.33353
20,-0.33353
21,-0.33353
22,-0.33353
23,-0.33353
24,-0.33353
25,-0.33353
26,-0.33353
27,-0.33353
28,-0.33353
29,-0.33353
30,-0.33353
31,-0.33353
32,1.7801
33,-0.33353
34,-0.33353
35,-0.33353
36,-0.33353
37,1.6659
38,0.23773000000000002
39,-0.33353
40,-0.33353
41,-0.33353
42,-0.33353
43,-0.33353
44,-0.33353
45,-0.33353
46,-0.33353
47,-0.33353
48,-0.33353
49,1.4088
50,5.6076
51,-0.33353
52,4.5793
53,1.7801
54,-0.33353
55,-0.33353
56,-0.33353
57,-0.33353
58,2.2086
59,-0.33353
60,-0.33353
61,-0.33353
62,-0.33353
63,-0.33353
64,-0.33353
65,2.637
66,-0.33353
67,-0.33353
68,-0.33353
69,-0.33353
70,-0.33353
71,0.32342
72,1.4088
73,-0.33353
74,-0.33353
75,1.8087
76,-0.33353
77,-0.33353
78,-0.33353
79,-0.33353
80,-0.33353
81,-0.33353
82,2.2371
83,-0.33353
84,-0.33353
85,-0.33353
86,-0.33353
87,-0.33353
88,-0.33353
89,-0.33353
90,-0.33353
91,-0.33353
92,-0.33353
93,-0.33353
94,-0.33353
95,-0.33353
