time,value
0,-0.47686000000000006
1,-0.25246
2,-0.028051
3,-1.3745
4,1.3184
5,-1.8233
6,0.64517
7,-0.25246
8,-0.25246
9,0.19635
10,-0.9256700000000001
11,1.5428
12,-1.5989
13,0.64517
14,-0.25246
15,-0.25246
16,-0.028051
17,-0.70127
18,1.3184
19,-1.5989
20,0.64517
21,-0.70127
22,-0.47686000000000006
23,-0.25246
24,-0.9256700000000001
25,1.9916
26,-1.3745
27,0.64517
28,0.8695700000000001
29,0.64517
30,1.3184
31,-0.70127
32,2.2159999999999997
33,-0.70127
34,0.42076
35,1.3184
36,-0.9256700000000001
37,1.094
38,-0.9256700000000001
39,0.64517
40,-0.70127
41,-0.028051
42,0.8695700000000001
43,-0.9256700000000001
44,0.8695700000000001
45,-1.1501
46,0.64517
47,-0.70127
48,-0.47686000000000006
49,1.094
50,-1.3745
51,0.8695700000000001
52,-1.1501
53,0.42076
54,-0.47686000000000006
55,-0.70127
56,1.5428
57,-1.5989
58,0.8695700000000001
59,-1.1501
60,0.19635
61,-0.25246
62,-0.9256700000000001
63,1.3184
64,-1.8233
65,-0.028051
66,-0.9256700000000001
67,-0.028051
68,-0.25246
69,-1.5989
70,1.094
71,-1.5989
72,1.3184
73,-0.028051
74,0.42076
75,0.19635
76,-0.70127
77,1.5428
78,-1.5989
79,0.8695700000000001
80,-0.70127
81,1.7672
82,0.42076
83,-0.47686000000000006
84,1.5428
85,-0.47686000000000006
86,1.3184
87,0.42076
88,0.42076
89,0.19635
90,-0.028051
91,1.5428
92,-1.1501
93,0.8695700000000001
94,-0.70127
95,0.42076
