time,value
0,-0.42808
1,0.94179
2,-0.42808
3,-0.42808
4,-0.42808
5,0.94179
6,-0.42808
7,-0.42808
8,-0.42808
9,0.94179
10,-0.42808
11,-0.42808
12,-0.42808
13,0.94179
14,-0.42808
15,-0.42808
16,-0.42808
17,0.94179
18,-0.42808
19,-0.42808
20,-0.42808
21,0.94179
22,-0.42808
23,-0.42808
24,0.94179
25,-0.42808
26,-0.42808
27,7.7911
28,-0.42808
29,-0.42808
30,0.94179
31,-0.42808
32,-0.42808
33,-0.42808
34,0.94179
35,-0.42808
36,-0.42808
37,-0.42808
38,0.94179
39,-0.42808
40,-0.42808
41,0.94179
42,-0.42808
43,-0.42808
44,-0.42808
45,0.94179
46,-0.42808
47,-0.42808
48,-0.42808
49,0.94179
50,-0.42808
51,-0.42808
52,-0.42808
53,0.94179
54,-0.42808
55,-0.42808
56,-0.42808
57,0.94179
58,-0.42808
59,-0.42808
60,-0.42808
61,0.94179
62,-0.42808
63,-0.42808
64,-0.42808
65,0.94179
66,-0.42808
67,-0.42808
68,-0.42808
69,0.94179
70,-0.42808
71,-0.42808
72,0.94179
73,-0.42808
74,-0.42808
75,-0.42808
76,0.94179
77,-0.42808
78,-0.42808
79,-0.42808
80,0.94179
81,-0.42808
82,-0.42808
83,-0.42808
84,0.94179
85,-0.42808
86,-0.42808
87,-0.42808
88,0.94179
89,-0.42808
90,-0.42808
91,-0.42808
92,0.94179
93,-0.42808
94,-0.42808
95,-0.42808
