time,value
0,-0.30341
1,-0.30341
2,-0.30341
3,-0.30341
4,-0.30341
5,-0.30341
6,-0.30341
7,-0.30341
8,-0.30341
9,-0.30341
10,-0.30341
11,-0.30341
12,-0.30341
13,-0.30341
14,-0.30341
15,-0.30341
16,-0.30341
17,-0.30341
18,-0.30341
19,-0.30341
20,-0.30341
21,-0.30341
22,-0.30341
23,-0.30341
24,-0.30341
25,-0.30341
26,-0.30341
27,2.6999
28,-0.30341
29,4.4161
30,-0.30341
31,-0.30341
32,-0.30341
33,-0.30341
34,-0.30341
35,-0.30341
36,-0.30341
37,-0.30341
38,-0.30341
39,2.7953
40,-0.30341
41,-0.30341
42,-0.30341
43,-0.30341
44,-0.30341
45,-0.30341
46,4.4638
47,-0.30341
48,-0.30341
49,-0.30341
50,-0.30341
51,-0.30341
52,-0.30341
53,1.1267
54,1.9848
55,-0.30341
56,-0.30341
57,-0.30341
58,-0.30341
59,-0.30341
60,0.74537
61,1.1267
62,-0.30341
63,-0.30341
64,-0.30341
65,-0.30341
66,-0.30341
67,-0.30341
68,-0.30341
69,-0.30341
70,-0.30341
71,-0.30341
72,2.1755
73,-0.30341
74,-0.30341
75,-0.30341
76,-0.30341
77,-0.30341
78,-0.30341
79,4.5591
80,-0.30341
81,-0.30341
82,-0.30341
83,-0.30341
84,-0.30341
85,-0.30341
86,-0.30341
87,-0.30341
88,-0.30341
89,-0.30341
90,-0.30341
91,-0.30341
92,-0.30341
93,-0.30341
94,-0.30341
95,-0.30341
