time,value
0,-0.40160999999999997
1,-0.40160999999999997
2,-0.24861999999999998
3,-0.40160999999999997
4,-0.40160999999999997
5,-0.40160999999999997
6,-0.24861999999999998
7,-0.40160999999999997
8,-0.40160999999999997
9,-0.24861999999999998
10,-0.40160999999999997
11,-0.40160999999999997
12,-0.40160999999999997
13,-0.24861999999999998
14,-0.40160999999999997
15,-0.40160999999999997
16,-0.40160999999999997
17,-0.24861999999999998
18,-0.40160999999999997
19,-0.40160999999999997
20,-0.40160999999999997
21,-0.24861999999999998
22,-0.40160999999999997
23,-0.40160999999999997
24,-0.40160999999999997
25,-0.24861999999999998
26,-0.40160999999999997
27,-0.40160999999999997
28,-0.40160999999999997
29,-0.24861999999999998
30,-0.40160999999999997
31,-0.40160999999999997
32,-0.24861999999999998
33,-0.40160999999999997
34,-0.40160999999999997
35,-0.40160999999999997
36,-0.24861999999999998
37,-0.40160999999999997
38,-0.40160999999999997
39,-0.40160999999999997
40,-0.24861999999999998
41,-0.40160999999999997
42,-0.40160999999999997
43,-0.40160999999999997
44,-0.24861999999999998
45,-0.40160999999999997
46,-0.40160999999999997
47,-0.40160999999999997
48,-0.24861999999999998
49,-0.40160999999999997
50,-0.40160999999999997
51,-0.40160999999999997
52,-0.24861999999999998
53,-0.40160999999999997
54,-0.40160999999999997
55,-0.40160999999999997
56,-0.24861999999999998
57,-0.40160999999999997
58,-0.40160999999999997
59,-0.40160999999999997
60,-0.24861999999999998
61,-0.40160999999999997
62,-0.40160999999999997
63,-0.24861999999999998
64,-0.40160999999999997
65,-0.40160999999999997
66,-0.40160999999999997
67,-0.24861999999999998
68,-0.40160999999999997
69,-0.40160999999999997
70,-0.40160999999999997
71,-0.24861999999999998
72,-0.40160999999999997
73,-0.24861999999999998
74,-0.40160999999999997
75,-0.24861999999999998
76,-0.40160999999999997
77,-0.24861999999999998
78,-0.40160999999999997
79,-0.24861999999999998
80,2.6583
81,2.5053
82,2.6583
83,2.8113
84,2.6583
85,2.8113
86,2.6583
87,2.6583
88,2.9643
89,2.9643
90,2.9643
91,-0.24861999999999998
92,-0.40160999999999997
93,-0.24861999999999998
94,-0.40160999999999997
95,-0.40160999999999997
