time,value
0,-0.52867
1,-0.52867
2,-0.52867
3,-0.52867
4,-0.52867
5,-0.52867
6,-0.52867
7,-0.52867
8,-0.52867
9,-0.40365999999999996
10,-0.40365999999999996
11,-0.52867
12,-0.46617
13,-0.46617
14,-0.59117
15,-0.52867
16,-0.52867
17,-0.46617
18,-0.59117
19,-0.52867
20,-0.40365999999999996
21,-0.52867
22,-0.52867
23,-0.52867
24,-0.52867
25,-0.52867
26,-0.52867
27,0.033856
28,1.9714
29,1.9714
30,1.9714
31,1.9089
32,2.0339
33,1.9714
34,1.9089
35,1.9714
36,1.9089
37,1.5964
38,-0.52867
39,-0.52867
40,-0.46617
41,-0.46617
42,-0.52867
43,-0.52867
44,-0.52867
45,-0.52867
46,-0.52867
47,-0.52867
48,-0.52867
49,-0.52867
50,-0.52867
51,-0.52867
52,-0.52867
53,-0.52867
54,-0.59117
55,-0.27865999999999996
56,-0.09115
57,-0.21616
58,-0.21616
59,0.28386999999999996
60,2.2840000000000003
61,2.3465
62,2.2840000000000003
63,2.2840000000000003
64,2.0339
65,-0.52867
66,-0.52867
67,-0.52867
68,-0.52867
69,-0.52867
70,-0.52867
71,-0.52867
72,-0.52867
73,-0.52867
74,-0.59117
75,-0.52867
76,-0.52867
77,-0.46617
78,-0.59117
79,-0.52867
80,-0.52867
81,-0.52867
82,-0.52867
83,-0.52867
84,-0.52867
85,-0.15365
86,2.0964
87,2.0964
88,2.0964
89,0.34636999999999996
90,-0.52867
91,-0.52867
92,-0.52867
93,-0.46617
94,-0.46617
95,-0.52867
