time,value
0,-0.19916
1,-0.19916
2,-0.19916
3,-0.19916
4,-0.19916
5,-0.19916
6,-0.19916
7,-0.19916
8,-0.19916
9,-0.19916
10,-0.19916
11,-0.19916
12,-0.19916
13,-0.19916
14,-0.19916
15,-0.19916
16,-0.19916
17,-0.19916
18,-0.19916
19,-0.19916
20,-0.19916
21,-0.19916
22,-0.19916
23,-0.19916
24,-0.19916
25,-0.19916
26,4.796
27,-0.19916
28,-0.19916
29,-0.19916
30,-0.19916
31,-0.19916
32,-0.19916
33,-0.19916
34,-0.19916
35,-0.19916
36,-0.19916
37,2.7865
38,-0.19916
39,-0.19916
40,-0.19916
41,-0.19916
42,-0.19916
43,-0.19916
44,-0.19916
45,-0.19916
46,-0.19916
47,-0.19916
48,-0.19916
49,-0.19916
50,-0.19916
51,-0.19916
52,-0.19916
53,-0.19916
54,-0.19916
55,-0.19916
56,-0.19916
57,-0.19916
58,-0.19916
59,4.1644
60,-0.19916
61,-0.19916
62,-0.19916
63,-0.19916
64,-0.19916
65,-0.19916
66,-0.19916
67,-0.19916
68,-0.19916
69,-0.19916
70,-0.19916
71,-0.19916
72,-0.19916
73,-0.19916
74,-0.19916
75,6.5759
76,-0.19916
77,-0.19916
78,-0.19916
79,-0.19916
80,-0.19916
81,-0.19916
82,-0.19916
83,-0.19916
84,-0.19916
85,-0.19916
86,-0.19916
87,-0.19916
88,-0.19916
89,-0.19916
90,-0.19916
91,-0.19916
92,-0.19916
93,-0.19916
94,-0.19916
95,-0.19916
