time,value
0,1.0568
1,1.1087
2,0.58901
3,-1.0741
4,-1.1261
5,-1.0741
6,-1.0741
7,-1.0741
8,-1.0221
9,-1.1261
10,-1.0741
11,-1.0741
12,-1.0741
13,-1.1261
14,-1.0741
15,-1.0741
16,-1.0221
17,-1.0741
18,-1.1261
19,-1.0741
20,-1.0741
21,-1.0741
22,-1.1261
23,-1.0741
24,-1.0741
25,-1.0741
26,-1.1261
27,-1.0741
28,-1.0741
29,-0.13859000000000002
30,1.1087
31,1.1087
32,1.0568
33,-0.8142199999999999
34,-1.0741
35,-1.0741
36,-1.0221
37,-1.0741
38,-1.0741
39,-1.1261
40,-1.0741
41,-1.0741
42,0.27718000000000004
43,0.8488700000000001
44,0.8488700000000001
45,0.8488700000000001
46,0.8488700000000001
47,0.90084
48,0.8488700000000001
49,0.8488700000000001
50,0.8488700000000001
51,0.8488700000000001
52,0.9528200000000001
53,0.8488700000000001
54,0.90084
55,0.8488700000000001
56,0.90084
57,0.8488700000000001
58,0.90084
59,0.8488700000000001
60,0.8488700000000001
61,0.90084
62,0.8488700000000001
63,0.8488700000000001
64,0.8488700000000001
65,0.8488700000000001
66,0.90084
67,0.8488700000000001
68,0.8488700000000001
69,0.8488700000000001
70,0.8488700000000001
71,0.90084
72,1.0568
73,1.0568
74,1.0568
75,1.0568
76,0.8488700000000001
77,1.1087
78,-0.6583100000000001
79,-1.1261
80,-1.0741
81,-1.0741
82,-1.1261
83,-1.0741
84,-1.0741
85,-1.0741
86,-1.1261
87,0.7969
88,1.1087
89,1.0568
90,1.1087
91,1.1087
92,1.0568
93,1.1087
94,1.1087
95,1.0568
