time,value
0,-0.1161
1,-0.1161
2,-0.1161
3,-0.1161
4,-0.1161
5,-0.1161
6,-0.1161
7,-0.1161
8,-0.1161
9,-0.1161
10,-0.1161
11,-0.1161
12,-0.1161
13,-0.1161
14,-0.1161
15,-0.1161
16,-0.1161
17,-0.1161
18,-0.1161
19,-0.1161
20,-0.1161
21,-0.1161
22,-0.1161
23,-0.1161
24,-0.1161
25,-0.1161
26,-0.1161
27,-0.1161
28,-0.1161
29,-0.1161
30,-0.1161
31,-0.1161
32,-0.1161
33,-0.1161
34,-0.1161
35,-0.1161
36,-0.1161
37,-0.1161
38,-0.1161
39,-0.1161
40,-0.1161
41,-0.1161
42,-0.1161
43,-0.1161
44,-0.1161
45,-0.1161
46,-0.1161
47,-0.1161
48,-0.1161
49,-0.1161
50,-0.1161
51,-0.1161
52,-0.1161
53,-0.1161
54,-0.1161
55,-0.1161
56,-0.1161
57,-0.1161
58,-0.1161
59,-0.1161
60,-0.1161
61,-0.1161
62,-0.1161
63,-0.1161
64,-0.1161
65,-0.1161
66,-0.1161
67,-0.1161
68,-0.1161
69,-0.1161
70,-0.1161
71,-0.1161
72,-0.1161
73,-0.1161
74,-0.1161
75,-0.1161
76,-0.1161
77,-0.1161
78,-0.1161
79,1.3231
80,9.5907
81,-0.1161
82,-0.1161
83,-0.1161
84,-0.1161
85,-0.1161
86,-0.1161
87,-0.1161
88,-0.1161
89,-0.1161
90,-0.1161
91,-0.1161
92,-0.1161
93,-0.1161
94,-0.1161
95,-0.1161
