time,value
0,-0.4484
1,-0.39485
2,-0.58672
3,-0.57902
4,-0.66842
5,-0.6451100000000001
6,-0.66443
7,-0.62257
8,-0.6290399999999999
9,-0.5997399999999999
10,-0.5573600000000001
11,-0.56035
12,-0.48723999999999995
13,-0.38009
14,-0.31318
15,-0.28098
16,-0.15316
17,-0.088388
18,-0.0315
19,0.019019
20,0.06105599999999999
21,0.10285
22,0.10867
23,0.12942
24,0.16037
25,0.17412
26,0.20964000000000002
27,0.20027999999999999
28,0.21086999999999997
29,0.21845
30,0.22816999999999998
31,0.21078000000000002
32,0.22073
33,0.23254
34,0.23903000000000002
35,0.25184
36,0.28354
37,0.26734
38,0.25077
39,0.27293
40,0.25353000000000003
41,0.2471
42,0.23849
43,0.23686
44,0.23153
45,0.2123
46,0.21008000000000002
47,0.19465
48,0.18914
49,0.18705
50,0.1573
51,0.14185
52,0.13178
53,0.12084
54,0.13402999999999998
55,0.091985
56,0.058517999999999994
57,0.063239
58,0.041466
59,0.037712999999999997
60,0.033132
61,0.036719999999999996
62,0.080856
63,0.087302
64,0.10347
65,0.14035
66,0.2575
67,0.30741999999999997
68,0.43958
69,0.60097
70,0.68985
71,1.1318
72,1.1451
73,0.68487
74,-0.56389
75,-0.23544
76,0.29821
77,0.54785
78,0.0075133
79,-0.37986
80,-0.56302
81,-0.41203999999999996
82,-0.14482
83,-0.33825
84,-0.5829
85,-0.6130800000000001
86,-0.52672
87,-0.41267
88,-0.21338000000000001
89,0.017099
90,0.22764
91,0.41515
92,0.45746000000000003
93,0.62626
94,0.80014
95,0.90341
96,0.93795
97,0.9524600000000001
98,1.1029
99,1.0733
100,1.0272
101,1.1504
102,1.2062
103,1.2524
104,1.2807
105,1.3522
106,1.4305
107,1.5177
108,1.5665
109,1.3463
110,1.5519999999999998
111,1.7028
112,1.636
113,1.6836
114,2.8539
115,0.31748000000000004
116,1.8755
117,1.5987
118,1.3428
119,1.5881
120,1.7398
121,1.7426
122,1.7989
123,1.8248
124,1.6297
125,1.7259
126,1.6359
127,1.4999
128,1.8404
129,1.001
130,1.77
131,1.4844
132,1.5055
133,1.9299
134,2.1630000000000003
135,1.9984
136,1.9049
137,2.2396
138,2.0652
139,1.8661
140,1.8825
141,1.6829
142,1.7333
143,2.0157
144,0.8616
145,2.046
146,1.4795
147,1.7603
148,1.581
149,1.536
150,1.4472
151,1.4891
152,1.3516
153,1.395
154,1.4280000000000002
155,1.1991
156,1.1356
157,0.99656
158,0.75384
159,0.55547
160,0.51156
161,0.20049
162,-0.093463
163,-0.40592
164,-0.8056399999999999
165,-0.82675
166,-0.64298
167,-0.47076999999999997
168,-0.53969
169,-0.57228
170,-0.8599
171,-0.9942
172,-0.86275
173,-0.65693
174,-0.66242
175,-0.46848999999999996
176,-0.31418
177,-0.2438
178,0.00086474
179,0.18872
180,0.37884
181,0.46758
182,0.5414
183,0.29175
184,-0.1857
185,-0.054778
186,0.08137
187,0.12517
188,0.23355
189,0.32578
190,0.58249
191,0.7332
192,3.1579
193,1.1851
194,0.7139300000000001
195,-0.15192999999999998
196,-1.1031
197,-2.7978
198,-0.086043
199,-0.022494
200,-0.56918
201,-0.35575999999999997
202,-0.67148
203,-0.64407
204,-0.8062199999999999
205,-0.35962
206,-0.8262
207,-1.1617
208,-1.3273
209,-1.5257
210,-1.359
211,-1.1524
212,-1.0025
213,-0.89644
214,-0.80834
215,-0.78746
216,-0.74751
217,-0.78335
218,-0.72665
219,-0.79495
220,-0.94881
221,-0.8684200000000001
222,-0.97135
223,-0.84762
224,-0.94294
225,-0.8820399999999999
226,-0.77637
227,-0.8353299999999999
228,-0.8704700000000001
229,-0.95945
230,-0.8924
231,-0.91861
232,-0.94847
233,-0.9266399999999999
234,-0.90969
235,-0.9261799999999999
236,-0.9946200000000001
237,-0.93791
238,-0.9599799999999999
239,-0.99067
240,-0.9718100000000001
241,-1.0008
242,-0.94181
243,-0.98614
244,-0.9381799999999999
245,-0.9974299999999999
246,-0.9980600000000001
247,-0.98945
248,-0.9281200000000001
249,-0.9387700000000001
250,-1.0097
251,-1.0117
252,-0.9761200000000001
253,-0.9740700000000001
254,-1.0090000000000001
255,-1.0185
256,-1.0145
257,-1.0141
258,-1.008
259,-1.0151
260,-1.0217
261,-1.014
262,-1.0129
263,-0.97021
264,-0.94999
265,-0.95901
266,-1.0217
267,-0.9827
268,-1.0233
269,-0.9557
270,-1.0295
271,-1.025
272,-1.0296
273,-1.0259
274,-1.0307
275,-1.0317
276,-1.0318
277,-1.0394
278,-1.0455
279,-1.0369
280,-1.0411
281,-1.0413
282,-1.0493
283,-1.0468
284,-1.0479
285,-1.0455
286,-1.0492
287,-1.0376
288,-1.0357
289,-1.045
290,-1.0356
291,-1.0407
292,-1.044
293,-1.1083
294,-1.0446
295,-1.0465
296,-1.0483
297,-1.0498
298,-1.0457
299,-1.0414
