time,value
0,-0.28036
1,-0.30415
2,-0.2645
3,-0.29093
4,-0.29622
5,-0.2645
6,-0.29886
7,-0.28300000000000003
8,-0.28036
9,-0.30151
10,-0.26186
11,-0.29886
12,-0.29358
13,-0.27243
14,-0.30151
15,-0.27771999999999997
16,-0.29093
17,-0.29886
18,-0.2645
19,-0.29358
20,-0.27771999999999997
21,-0.25921
22,-0.29886
23,-0.27243
24,-0.29093
25,-0.29093
26,-0.26714
27,-0.30415
28,-0.26186
29,-0.26714
30,-0.29886
31,-0.2645
32,-0.28829
33,-0.27771999999999997
34,-0.27771999999999997
35,-0.30679
36,-0.27771999999999997
37,-0.29358
38,2.7754
39,5.2046
40,1.4272
41,-0.23278000000000001
42,-0.25128
43,-0.28036
44,-0.23542
45,-0.27507
46,-0.26979000000000003
47,-0.25393000000000004
48,-0.28300000000000003
49,-0.25921
50,-0.27771999999999997
51,-0.28036
52,-0.25393000000000004
53,-0.29622
54,-0.28036
55,-0.27243
56,-0.29886
57,-0.26714
58,-0.27243
59,-0.27771999999999997
60,-0.26714
61,-0.29886
62,-0.26979000000000003
63,-0.28036
64,-0.27243
65,-0.27771999999999997
66,-0.29886
67,-0.27771999999999997
68,-0.28036
69,-0.28300000000000003
70,-0.25128
71,-0.28300000000000003
72,-0.28300000000000003
73,-0.25393000000000004
74,-0.29622
75,-0.26979000000000003
76,-0.25656999999999996
77,-0.27243
78,0.90122
79,2.7093
80,-0.23806999999999998
81,-0.22221
82,-0.26979000000000003
83,-0.24600000000000002
84,3.69
85,4.4195
86,3.1824
87,-0.26979000000000003
88,-0.25128
89,-0.25921
90,-0.29358
91,-0.24070999999999998
92,-0.28829
93,-0.28300000000000003
94,-0.26714
95,-0.29622
