time,value
0,-0.25837
1,-0.25837
2,-0.25837
3,-0.25837
4,-0.25837
5,-0.25837
6,-0.25837
7,-0.25837
8,-0.25837
9,-0.25837
10,-0.25837
11,-0.25837
12,-0.25837
13,-0.25837
14,-0.25837
15,-0.25837
16,-0.25837
17,-0.25837
18,-0.25837
19,-0.25837
20,-0.25837
21,-0.25837
22,-0.25837
23,-0.25837
24,-0.25837
25,-0.25837
26,-0.25837
27,-0.25837
28,-0.25837
29,-0.25837
30,-0.25837
31,-0.25837
32,-0.25837
33,-0.25837
34,-0.25837
35,-0.25837
36,-0.25837
37,-0.25837
38,-0.25837
39,-0.25837
40,-0.25837
41,-0.25837
42,2.3636
43,1.7432
44,0.057673
45,0.12791
46,2.7616
47,6.0157
48,0.12791
49,0.1162
50,0.069378
51,-0.23496
52,-0.25837
53,-0.25837
54,-0.082791
55,5.7465
56,2.0008
57,0.10449000000000001
58,0.010851999999999999
59,-0.25837
60,-0.25837
61,-0.25837
62,-0.25837
63,-0.25837
64,-0.25837
65,-0.25837
66,-0.25837
67,-0.25837
68,-0.25837
69,-0.25837
70,-0.25837
71,-0.25837
72,-0.25837
73,-0.25837
74,-0.25837
75,-0.25837
76,-0.25837
77,-0.25837
78,-0.25837
79,-0.25837
80,-0.25837
81,-0.25837
82,-0.25837
83,-0.25837
84,-0.25837
85,-0.25837
86,-0.25837
87,-0.25837
88,-0.25837
89,-0.25837
90,-0.25837
91,-0.25837
92,-0.25837
93,-0.25837
94,-0.25837
95,-0.25837
