time,value
0,0.4896
1,-0.8297399999999999
2,-0.0051537
3,1.1493
4,-0.8297399999999999
5,-0.8297399999999999
6,1.8089
7,-0.8297399999999999
8,-0.8297399999999999
9,1.9739
10,-0.8297399999999999
11,-0.8297399999999999
12,1.1493
13,-0.17007
14,-0.8297399999999999
15,-0.0051537
16,1.1493
17,-0.8297399999999999
18,-0.8297399999999999
19,1.9739
20,-0.8297399999999999
21,-0.8297399999999999
22,0.65452
23,0.4896
24,-0.8297399999999999
25,-0.8297399999999999
26,1.8089
27,-0.8297399999999999
28,-0.8297399999999999
29,1.4791
30,-0.33499
31,-0.8297399999999999
32,-0.0051537
33,0.98435
34,-0.8297399999999999
35,-0.8297399999999999
36,1.8089
37,-0.8297399999999999
38,-0.49991
39,1.4791
40,-0.8297399999999999
41,-0.8297399999999999
42,1.8089
43,-0.8297399999999999
44,-0.8297399999999999
45,1.8089
46,-0.8297399999999999
47,-0.8297399999999999
48,1.8089
49,-0.8297399999999999
50,-0.8297399999999999
51,1.3142
52,-0.33499
53,-0.8297399999999999
54,0.65452
55,0.4896
56,-0.8297399999999999
57,-0.33499
58,1.3142
59,-0.8297399999999999
60,-0.8297399999999999
61,1.8089
62,-0.8297399999999999
63,-0.8297399999999999
64,0.81944
65,0.32468
66,-0.8297399999999999
67,-0.8297399999999999
68,1.9739
69,-0.8297399999999999
70,-0.8297399999999999
71,0.98435
72,-0.0051537
73,-0.8297399999999999
74,-0.8297399999999999
75,1.6440000000000001
76,-0.8297399999999999
77,-0.8297399999999999
78,1.6440000000000001
79,-0.49991
80,-0.8297399999999999
81,-0.0051537
82,1.1493
83,-0.8297399999999999
84,0.4896
85,0.65452
86,-0.8297399999999999
87,0.81944
88,0.15975999999999999
89,-0.8297399999999999
90,1.1493
91,-0.17007
92,-0.8297399999999999
93,0.98435
94,-0.0051537
95,-0.8297399999999999
