time,value
0,-0.18578
1,-0.18578
2,-0.18578
3,-0.18578
4,-0.18578
5,-0.18578
6,-0.18578
7,-0.18578
8,-0.18578
9,-0.18578
10,-0.18578
11,-0.18578
12,-0.18578
13,-0.18578
14,-0.18578
15,-0.18578
16,-0.18578
17,-0.18578
18,-0.18578
19,-0.18578
20,-0.18578
21,-0.18578
22,-0.18578
23,-0.18578
24,-0.18578
25,-0.18578
26,-0.18578
27,-0.18578
28,-0.18578
29,-0.18578
30,-0.18578
31,-0.18578
32,-0.18578
33,-0.18578
34,6.9672
35,-0.18578
36,4.5352
37,0.91101
38,-0.18578
39,-0.18578
40,-0.18578
41,-0.18578
42,-0.18578
43,-0.18578
44,-0.18578
45,-0.18578
46,-0.18578
47,-0.18578
48,-0.18578
49,-0.18578
50,-0.18578
51,-0.18578
52,-0.18578
53,-0.18578
54,-0.18578
55,-0.18578
56,-0.18578
57,-0.18578
58,-0.18578
59,-0.18578
60,-0.18578
61,-0.18578
62,-0.18578
63,-0.18578
64,-0.18578
65,-0.18578
66,-0.18578
67,-0.18578
68,-0.18578
69,-0.18578
70,-0.18578
71,4.6782
72,-0.18578
73,-0.18578
74,-0.18578
75,-0.18578
76,-0.18578
77,-0.18578
78,-0.18578
79,-0.18578
80,-0.18578
81,-0.18578
82,-0.18578
83,-0.18578
84,-0.18578
85,-0.18578
86,-0.18578
87,-0.18578
88,-0.18578
89,-0.18578
90,-0.18578
91,-0.18578
92,-0.18578
93,-0.18578
94,-0.18578
95,-0.18578
