{
  "about": {
    "datasetID": "59_umls_dataset_TRAIN",
    "datasetName": "NULL",
    "license": "public dataset, unknown license",
    "datasetSchemaVersion": "4.0.0",
    "redacted": true,
    "datasetVersion": "4.0.0",
    "digest": "120b530100eebe9bca74b75fac03939f8d847e3d0f55f8a920560ec46e6dcf7f"
  },
  "dataResources": [
    {
      "resID": "0",
      "resPath": "graphs/graph.gml",
      "resType": "graph",
      "resFormat": {
        "text/vnd.gml": [
          "gml"
        ]
      },
      "isCollection": false
    },
    {
      "resID": "learningData",
      "resPath": "tables/learningData.csv",
      "resType": "table",
      "resFormat": {
        "text/csv": [
          "csv"
        ]
      },
      "isCollection": false,
      "columns": [
        {
          "colIndex": 0,
          "colName": "d3mIndex",
          "colType": "integer",
          "role": [
            "index"
          ]
        },
        {
          "colIndex": 1,
          "colName": "source_nodeID",
          "colType": "integer",
          "role": [
            "attribute"
          ],
          "refersTo": {
            "resID": "0",
            "resObject": {
              "nodeAttribute": "nodeID"
            }
          }
        },
        {
          "colIndex": 2,
          "colName": "target_nodeID",
          "colType": "integer",
          "role": [
            "attribute"
          ],
          "refersTo": {
            "resID": "0",
            "resObject": {
              "nodeAttribute": "nodeID"
            }
          }
        },
        {
          "colIndex": 3,
          "colName": "linkType",
          "colType": "categorical",
          "role": [
            "attribute"
          ]
        },
        {
          "colIndex": 4,
          "colName": "linkExists",
          "colType": "categorical",
          "role": [
            "suggestedTarget"
          ]
        }
      ],
      "columnsCount": 5
    }
  ]
}