time,value
0,-2.3006
1,-2.3006
2,-2.303
3,-2.303
4,-2.3054
5,-2.3128
6,-2.3201
7,-2.3201
8,-2.32
9,-2.3198
10,-2.3195
11,-2.3191
12,-2.3186
13,-2.3178
14,-2.3196
15,-2.3187
16,-2.3176
17,-2.3167
18,-2.3153
19,-2.3138
20,-2.3122
21,-2.3166
22,-2.3257
23,-2.3263
24,-2.3248
25,-2.3227
26,-2.3204
27,-2.3187
28,-2.3162
29,-2.316
30,-2.3139
31,-2.3111
32,-2.3081
33,-2.3058
34,-2.3027
35,-2.2994
36,-2.2968
37,-2.2933
38,-2.2897
39,-2.2869
40,-2.2927
41,-2.3007
42,-2.2977
43,-2.2936
44,-2.2895
45,-2.2863
46,-2.2819
47,-2.2796
48,-2.2762
49,-2.2716
50,-2.2668
51,-2.2632
52,-2.2616
53,-2.2687
54,-2.2716
55,-2.2665
56,-2.2612
57,-2.2559
58,-2.2518
59,-2.2464
60,-2.2408
61,-2.2366
62,-2.2308
63,-2.225
64,-2.2206
65,-2.2147
66,-2.2087
67,-2.206
68,-2.198
69,-2.1918
70,-2.1871
71,-2.1808
72,-2.1744
73,-2.1695
74,-2.1648
75,-2.1582
76,-2.1533
77,-2.1466
78,-2.1398
79,-2.1347
80,-2.1261
81,-2.1192
82,-2.114
83,-2.1071
84,-2.1
85,-2.0947
86,-2.0895
87,-2.081
88,-2.0776
89,-2.0688
90,-2.0617
91,-2.0563
92,-2.0491
93,-2.0419
94,-2.0364
95,-2.0291
96,-2.0217
97,-2.0143
98,-2.0087
99,-2.0012
100,-1.9937
101,-1.9880000000000002
102,-1.9804
103,-1.9728
104,-1.9669999999999999
105,-1.9593
106,-1.9516
107,-1.9443
108,-1.9366
109,-1.9288
110,-1.9229
111,-1.915
112,-1.9071
113,-1.9012
114,-1.8944
115,-1.8867
116,-1.8794
117,-1.8715
118,-1.8635
119,-1.8575
120,-1.8495
121,-1.8415
122,-1.8355
123,-1.8274
124,-1.8193
125,-1.8133
126,-1.8038
127,-1.7956
128,-1.7895
129,-1.7813
130,-1.7718
131,-1.7658
132,-1.7598
133,-1.7516
134,-1.7434
135,-1.7372
136,-1.729
137,-1.7194
138,-1.7132
139,-1.7049
140,-1.6966
141,-1.6904
142,-1.682
143,-1.6741
144,-1.6703
145,-1.6628
146,-1.6544
147,-1.6482
148,-1.6398
149,-1.6314
150,-1.6251
151,-1.6155
152,-1.6071
153,-1.6007
154,-1.5923
155,-1.5838
156,-1.5774
157,-1.5689
158,-1.5619999999999998
159,-1.5584
160,-1.5499
161,-1.5415
162,-1.5351
163,-1.5266
164,-1.518
165,-1.5116
166,-1.5019
167,-1.4933
168,-1.4869
169,-1.4783
170,-1.4697
171,-1.4611
172,-1.4546
173,-1.446
174,-1.4384
175,-1.4328
176,-1.4251
177,-1.4165
178,-1.41
179,-1.4014
180,-1.3927
181,-1.3862
182,-1.3775
183,-1.3677
184,-1.3612
185,-1.3525
186,-1.3437
187,-1.3372
188,-1.3284
189,-1.3208
190,-1.3154
191,-1.3078
192,-1.2991
193,-1.2925
194,-1.2837
195,-1.275
196,-1.2673
197,-1.2586
198,-1.2498
199,-1.2455
200,-1.2433
201,-1.2345
202,-1.2268
203,-1.217
204,-1.2061
205,-1.2017
206,-1.1985
207,-1.1941
208,-1.1874
209,-1.1841
210,-1.1785
211,-1.1707
212,-1.165
213,-1.1572
214,-1.1507
215,-1.1475
216,-1.1420000000000001
217,-1.1332
218,-1.1265
219,-1.1176
220,-1.1176
221,-1.1144
222,-1.1055
223,-1.0966
224,-1.0899
225,-1.081
226,-1.0711
227,-1.0644
228,-1.0555
229,-1.0465
230,-1.0398
231,-1.0309
232,-1.0219
233,-1.0152
234,-1.0062
235,-0.99721
236,-0.9904700000000001
237,-0.9814700000000001
238,-0.9724700000000001
239,-0.96741
240,-0.96234
241,-0.9524100000000001
242,-0.9456700000000001
243,-0.93668
244,-0.9276700000000001
245,-0.91866
246,-0.9119
247,-0.9028799999999999
248,-0.89294
249,-0.8861600000000001
250,-0.87713
251,-0.8680899999999999
252,-0.8613
253,-0.8549700000000001
254,-0.84906
255,-0.8436299999999999
256,-0.8346
257,-0.8255600000000001
258,-0.81877
259,-0.80972
260,-0.80067
261,-0.79387
262,-0.78391
263,-0.77485
264,-0.76804
265,-0.7589600000000001
266,-0.74988
267,-0.74306
268,-0.73726
269,-0.73095
270,-0.72414
271,-0.71506
272,-0.70598
273,-0.69916
274,-0.68919
275,-0.68009
276,-0.6755399999999999
277,-0.6732600000000001
278,-0.6641600000000001
279,-0.66188
280,-0.6596
281,-0.65277
282,-0.64593
283,-0.63681
284,-0.62683
285,-0.6177
286,-0.61085
287,-0.60172
288,-0.5925699999999999
289,-0.58631
290,-0.58063
291,-0.57065
292,-0.5638
293,-0.55466
294,-0.5455300000000001
295,-0.53867
296,-0.52868
297,-0.51953
298,-0.51266
299,-0.5035
300,-0.49433999999999995
301,-0.48893000000000003
302,-0.48331
303,-0.47476999999999997
304,-0.4679
305,-0.4631
306,-0.45743
307,-0.44973
308,-0.43888999999999995
309,-0.43318999999999996
310,-0.42691
311,-0.41778999999999994
312,-0.41066
313,-0.40806
314,-0.40176999999999996
315,-0.39266
316,-0.38495999999999997
317,-0.37585
318,-0.36956999999999995
319,-0.36469
320,-0.35611
321,-0.34614
322,-0.34036
323,-0.33545
324,-0.32548
325,-0.32006
326,-0.31513
327,-0.31019
328,-0.30112
329,-0.29431
330,-0.28435
331,-0.27665
332,-0.27171
333,-0.2645
334,-0.25454
335,-0.24774000000000002
336,-0.23867
337,-0.23146
338,-0.2265
339,-0.21791
340,-0.20885
341,-0.20615
342,-0.19891
343,-0.18986
344,-0.18307
345,-0.17402
346,-0.16496
347,-0.15727
348,-0.1482
349,-0.14365999999999998
350,-0.1414
351,-0.13459000000000002
352,-0.13005
353,-0.12779000000000001
354,-0.12009
355,-0.11012999999999999
356,-0.10519
357,-0.095716
358,-0.084861
359,-0.07900599999999999
360,-0.072676
361,-0.063622
362,-0.054563
363,-0.046869
364,-0.037805
365,-0.028736
366,-0.021931
367,-0.012853999999999999
368,-0.005160100000000001
369,-0.00022614
370,0.0047199
371,0.013787
372,0.020589
373,0.030552
374,0.038247
375,0.040922
376,0.048142000000000004
377,0.057203
378,0.06400399999999999
379,0.073072
380,0.083035
381,0.08984099999999999
382,0.098919
383,0.10474000000000001
384,0.10969000000000001
385,0.11965
386,0.12508
387,0.13003
388,0.135
389,0.14495999999999998
390,0.15037999999999999
391,0.15627
392,0.16261
393,0.16939
394,0.17844000000000002
395,0.18839
396,0.19744
397,0.20423
398,0.21281999999999998
399,0.2187
400,0.22414
401,0.23409000000000002
402,0.23906999999999998
403,0.24406999999999998
404,0.25176
405,0.2608
406,0.26758000000000004
407,0.27662
408,0.28657
409,0.29336
410,0.30241
411,0.31146
412,0.31826
413,0.32732
414,0.33501
415,0.33997
416,0.3472
417,0.35625
418,0.36305
419,0.37301
420,0.38206999999999997
421,0.38887
422,0.39655999999999997
423,0.40241
424,0.40874
425,0.4178
426,0.42775
427,0.43455
428,0.44177
429,0.44991000000000003
430,0.4576
431,0.46529
432,0.47118000000000004
433,0.47752
434,0.48521000000000003
435,0.49155
436,0.49746
437,0.50289
438,0.5119199999999999
439,0.5209600000000001
440,0.52774
441,0.53678
442,0.54583
443,0.55261
444,0.56167
445,0.57072
446,0.57119
447,0.56988
448,0.57719
449,0.58224
450,0.57873
451,0.57524
452,0.5726399999999999
453,0.5692
454,0.5657800000000001
455,0.56323
456,0.55984
457,0.5564899999999999
458,0.55107
459,0.54108
460,0.5371199999999999
461,0.5323399999999999
462,0.52381
463,0.51464
464,0.5077699999999999
465,0.49778
466,0.49383
467,0.48905
468,0.48281
469,0.47363999999999995
470,0.46593999999999997
471,0.45677
472,0.44761000000000006
473,0.43845
474,0.43221000000000004
475,0.4266
476,0.41578000000000004
477,0.4089
478,0.40331
479,0.39626
480,0.38856
481,0.38233
482,0.37678
483,0.37138000000000004
484,0.36138000000000003
485,0.35584
486,0.35114
487,0.34795
488,0.34248
489,0.33476999999999996
490,0.32628
491,0.32083
492,0.31544
493,0.30543000000000003
494,0.3
495,0.29306
496,0.28381999999999996
497,0.27458
498,0.26687
499,0.25764000000000004
500,0.2484
501,0.24148000000000003
502,0.23605
503,0.23142
504,0.22371999999999997
505,0.21600999999999998
506,0.21061999999999997
507,0.20678000000000002
508,0.19676
509,0.18754
510,0.18219000000000002
511,0.17524
512,0.16522
513,0.15596
514,0.14825
515,0.14292
516,0.13677999999999998
517,0.12907000000000002
518,0.11987
519,0.11458
520,0.10762000000000001
521,0.099175
522,0.096232
523,0.09171699999999999
524,0.08882000000000001
525,0.08200700000000001
526,0.074305
527,0.068216
528,0.063044
529,0.05767100000000001
530,0.047637
531,0.043193
532,0.038758999999999995
533,0.031056999999999998
534,0.021021
535,0.014018000000000001
536,0.0046838999999999995
537,0.00025386
538,-0.0018271000000000001
539,-0.006917100000000001
540,-0.011977
541,-0.014996
542,-0.025034999999999998
543,-0.03241
544,-0.034413
545,-0.044454
546,-0.052814
547,-0.05779600000000001
548,-0.065493
549,-0.074879
550,-0.084262
551,-0.091959
552,-0.10134
553,-0.11072
554,-0.11505
555,-0.12236
556,-0.13175
557,-0.13944
558,-0.14883
559,-0.15653
560,-0.16084
561,-0.16513
562,-0.17517
563,-0.18116
564,-0.18606
565,-0.19376
566,-0.20081
567,-0.21085
568,-0.22025999999999998
569,-0.22389
570,-0.22876999999999997
571,-0.23646
572,-0.24352
573,-0.25356
574,-0.26298
575,-0.26659
576,-0.27144
577,-0.27913000000000004
578,-0.2862
579,-0.29562
580,-0.30504000000000003
581,-0.31211
582,-0.32215
583,-0.33157
584,-0.34098
585,-0.34569
586,-0.35056
587,-0.35714
588,-0.36482
589,-0.37077
590,-0.37558
591,-0.38327
592,-0.39331
593,-0.39573
594,-0.39752
595,-0.39987
596,-0.40219
597,-0.40391
598,-0.40617
599,-0.40839000000000003
600,-0.41003
601,-0.41058
602,-0.40928000000000003
603,-0.40851
604,-0.40824
605,-0.40348
606,-0.40162
607,-0.40078
608,-0.4018
609,-0.4023
610,-0.40092
611,-0.40291
612,-0.40101
613,-0.39195
614,-0.38813000000000003
615,-0.38716999999999996
616,-0.38333
617,-0.37376
618,-0.36659
619,-0.35702
620,-0.34745
621,-0.33788
622,-0.3307
623,-0.32158000000000003
624,-0.312
625,-0.30482
626,-0.29524
627,-0.28565999999999997
628,-0.27848
629,-0.27741
630,-0.27915
631,-0.27804
632,-0.27971999999999997
633,-0.27293
634,-0.26573
635,-0.25653000000000004
636,-0.24691999999999997
637,-0.24533000000000002
638,-0.24691999999999997
639,-0.24608000000000002
640,-0.24723
641,-0.24316
642,-0.23353000000000002
643,-0.22630999999999998
644,-0.21668
645,-0.20704
646,-0.19982
647,-0.19018
648,-0.18055
649,-0.1774
650,-0.1735
651,-0.16312000000000001
652,-0.1559
653,-0.15195999999999998
654,-0.14837999999999998
655,-0.14117000000000002
656,-0.13155
657,-0.12154000000000001
658,-0.11432
659,-0.1047
660,-0.09508
661,-0.093511
662,-0.089912
663,-0.088292
664,-0.084238
665,-0.079435
666,-0.069833
667,-0.060228
668,-0.052611
669,-0.043007
670,-0.033402
671,-0.026197
672,-0.01659
673,-0.010964
674,-0.0073161
675,-0.0016780999999999999
676,0.0083429
677,0.012018000000000001
678,0.018102
679,0.028125999999999998
680,0.035321
681,0.045344999999999996
682,0.052971000000000004
683,0.054277
684,0.06279
685,0.072373
686,0.079563
687,0.089149
688,0.099175
689,0.10636
690,0.11595
691,0.12554
692,0.13273
693,0.136
694,0.1384
695,0.14559
696,0.15517999999999998
697,0.16477
698,0.17436
699,0.17915
700,0.18069000000000002
701,0.19028
702,0.19748
703,0.20706999999999998
704,0.21666999999999997
705,0.22386999999999999
706,0.23346999999999998
707,0.24306999999999998
708,0.25027
709,0.25987
710,0.26947
711,0.27666999999999997
712,0.28628000000000003
713,0.28951
714,0.28951
715,0.29911
716,0.30871
717,0.31592
718,0.32594
719,0.33116
720,0.33397
721,0.34399
722,0.35359
723,0.3608
724,0.3656
725,0.368
726,0.37321
727,0.38282
728,0.39242
729,0.39962
730,0.40923000000000004
731,0.41925
732,0.42645
733,0.43606000000000006
734,0.44566999999999996
735,0.45528
736,0.46248
737,0.46488
738,0.46768999999999994
739,0.47531
740,0.48532
741,0.48813999999999996
742,0.49095
743,0.49898000000000003
744,0.50378
745,0.5061899999999999
746,0.51339
747,0.52299
748,0.5302
749,0.54022
750,0.54982
751,0.55703
752,0.56265
753,0.56672
754,0.57434
755,0.58394
756,0.59354
757,0.6007399999999999
758,0.61034
759,0.62036
760,0.62757
761,0.63717
762,0.64677
763,0.65398
764,0.6635800000000001
765,0.67319
766,0.6804
767,0.69
768,0.6996100000000001
769,0.70324
770,0.70449
771,0.7145100000000001
772,0.72411
773,0.73131
774,0.74092
775,0.75093
776,0.7581399999999999
777,0.76774
778,0.77735
779,0.78057
780,0.78464
781,0.79466
782,0.80186
783,0.81147
784,0.8214799999999999
785,0.8286899999999999
786,0.83829
787,0.8406899999999999
788,0.84309
789,0.85029
790,0.8598899999999999
791,0.8647
792,0.8671
793,0.8743
794,0.8815
795,0.8911100000000001
796,0.9007200000000001
797,0.9079200000000001
798,0.91753
799,0.92714
800,0.93434
801,0.94395
802,0.9535600000000001
803,0.9607700000000001
804,0.9703799999999999
805,0.976
806,0.97962
807,0.98525
808,0.9948600000000001
809,1.0045
810,1.0121
811,1.0217
812,1.0313
813,1.0365
814,1.0406
815,1.0462
816,1.0534
817,1.063
818,1.073
819,1.0778
820,1.0819
821,1.088
822,1.0952
823,1.1052
824,1.1148
825,1.12
826,1.1241
827,1.1322
828,1.1394
829,1.149
830,1.1585
831,1.1657
832,1.1753
833,1.1849
834,1.1921
835,1.2017
836,1.2029
837,1.204
838,1.2108
839,1.22
840,1.2272
841,1.2368
842,1.2376
843,1.2388
844,1.248
845,1.252
846,1.2508
847,1.2493
848,1.2477
849,1.2462
850,1.2451
851,1.2436
852,1.2357
853,1.2281
854,1.2267
855,1.2228
856,1.2218
857,1.2183
858,1.2087
859,1.2014
860,1.1915
861,1.1842
862,1.1832
863,1.1794
864,1.1694
865,1.1619
866,1.1581
867,1.1502
868,1.143
869,1.133
870,1.1233
871,1.12
872,1.1166
873,1.1066
874,1.0994
875,1.0897
876,1.08
877,1.0728
878,1.0628
879,1.0531
880,1.0459
881,1.0404
882,1.0367
883,1.0292
884,1.0192
885,1.018
886,1.0122
887,1.005
888,0.9953
889,0.9856299999999999
890,0.97808
891,0.96841
892,0.9584299999999999
893,0.9575299999999999
894,0.95393
895,0.9527700000000001
896,0.9495
897,0.9398200000000001
898,0.93014
899,0.9226
900,0.9153399999999999
901,0.9118
902,0.90855
903,0.8988700000000001
904,0.88918
905,0.88192
906,0.8719600000000001
907,0.8622700000000001
908,0.85501
909,0.8515
910,0.8482799999999999
911,0.84101
912,0.83106
913,0.82137
914,0.8141
915,0.80442
916,0.79473
917,0.79393
918,0.78805
919,0.77836
920,0.7710899999999999
921,0.7611399999999999
922,0.75336
923,0.7499399999999999
924,0.74242
925,0.7327199999999999
926,0.72302
927,0.71575
928,0.70581
929,0.69611
930,0.68884
931,0.67915
932,0.6738
933,0.67065
934,0.6653100000000001
935,0.65562
936,0.6481
937,0.6384
938,0.63355
939,0.63113
940,0.6260399999999999
941,0.61587
942,0.60836
943,0.6057
944,0.6030399999999999
945,0.59553
946,0.59068
947,0.58802
948,0.58075
949,0.57324
950,0.56991
951,0.56462
952,0.55491
953,0.5452100000000001
954,0.53771
955,0.528
956,0.5182899999999999
957,0.51344
958,0.5110100000000001
959,0.5008699999999999
960,0.49094
961,0.4883
962,0.48566000000000004
963,0.47552
964,0.4731
965,0.47067
966,0.46096000000000004
967,0.45368
968,0.44376000000000004
969,0.43405
970,0.43341999999999997
971,0.43018
972,0.42046000000000006
973,0.41298
974,0.40326
975,0.39355
976,0.39296
977,0.38976
978,0.38004
979,0.37256999999999996
980,0.36958
981,0.36644
982,0.35915
983,0.34943
984,0.33953
985,0.33224000000000004
986,0.32911999999999997
987,0.32619000000000004
988,0.31873
989,0.31128
990,0.30822
991,0.30548000000000003
992,0.29575999999999997
993,0.28603
994,0.27858
995,0.26886
996,0.25913
997,0.25168
998,0.24866999999999997
999,0.24352
1000,0.23379
1001,0.2265
1002,0.21663000000000002
1003,0.2069
1004,0.1996
1005,0.19203
1006,0.18907000000000002
1007,0.18408
1008,0.17434000000000002
1009,0.16460999999999998
1010,0.15730999999999998
1011,0.14758
1012,0.13772
1013,0.13042
1014,0.12068
1015,0.11095
1016,0.10365
1017,0.093793
1018,0.090869
1019,0.08576900000000001
1020,0.076035
1021,0.066299
1022,0.058997
1023,0.049263
1024,0.039529
1025,0.032226
1026,0.022491999999999998
1027,0.012756
1028,0.0054559
1029,-0.0042801
1030,-0.009146099999999999
1031,-0.01158
1032,-0.018882
1033,-0.023748
1034,-0.026182
1035,-0.031051
1036,-0.040784
1037,-0.050518
1038,-0.057817999999999994
1039,-0.067674
1040,-0.077408
1041,-0.084708
1042,-0.094442
1043,-0.10198
1044,-0.10475
1045,-0.10984000000000001
1046,-0.11957000000000001
1047,-0.12697999999999998
1048,-0.13672
1049,-0.14189000000000002
1050,-0.14218
1051,-0.14497000000000002
1052,-0.14529
1053,-0.15267
1054,-0.16247999999999999
1055,-0.16492
1056,-0.16492
1057,-0.16513
1058,-0.16537000000000002
1059,-0.16554000000000002
1060,-0.16568
1061,-0.16573
1062,-0.16580999999999999
1063,-0.16351
1064,-0.1538
1065,-0.14649
1066,-0.13674
1067,-0.12702
1068,-0.11971
1069,-0.10997
1070,-0.10762000000000001
1071,-0.10522000000000001
1072,-0.09547699999999999
1073,-0.085743
1074,-0.07599700000000001
1075,-0.068695
1076,-0.06627100000000001
1077,-0.058954
1078,-0.051639
1079,-0.049173
1080,-0.046666
1081,-0.041796
1082,-0.032027999999999994
1083,-0.029481
1084,-0.026945
1085,-0.017199000000000002
1086,-0.007453100000000001
1087,-0.00014514
1088,0.0096009
1089,0.019344
1090,0.026654
1091,0.036398
1092,0.046144
1093,0.053453
1094,0.063197
1095,0.065634
1096,0.068036
1097,0.077748
1098,0.087463
1099,0.08743300000000001
1100,0.09225499999999999
1101,0.10198
1102,0.10440999999999999
1103,0.10440999999999999
1104,0.11172
1105,0.11903
1106,0.12878
1107,0.13852
1108,0.14583
1109,0.15556
1110,0.1653
1111,0.17505
1112,0.18236
1113,0.1921
1114,0.19939
1115,0.19935
1116,0.2042
1117,0.21394000000000002
1118,0.22125
1119,0.231
1120,0.24075
1121,0.24805
1122,0.2578
1123,0.26755
1124,0.27486
1125,0.2846
1126,0.29435
1127,0.30166
1128,0.3114
1129,0.32114000000000004
1130,0.32845
1131,0.3382
1132,0.34795
1133,0.35525999999999996
1134,0.365
1135,0.37475
1136,0.38206
1137,0.3918
1138,0.40155
1139,0.40886
1140,0.41861000000000004
1141,0.42835
1142,0.43567
1143,0.44541000000000003
1144,0.45516
1145,0.46247
1146,0.47221
1147,0.4771
1148,0.47958999999999996
1149,0.48691999999999996
1150,0.49666000000000005
1151,0.50641
1152,0.51372
1153,0.52346
1154,0.5332100000000001
1155,0.54052
1156,0.55027
1157,0.56001
1158,0.5673199999999999
1159,0.57707
1160,0.58681
1161,0.59412
1162,0.60387
1163,0.61361
1164,0.62092
1165,0.63067
1166,0.64043
1167,0.64773
1168,0.65747
1169,0.66723
1170,0.6745399999999999
1171,0.68429
1172,0.69402
1173,0.70133
1174,0.71107
1175,0.72082
1176,0.72813
1177,0.73787
1178,0.74762
1179,0.75493
1180,0.76468
1181,0.77442
1182,0.78173
1183,0.7914800000000001
1184,0.8012199999999999
1185,0.8036300000000001
1186,0.80607
1187,0.81581
1188,0.82555
1189,0.8328399999999999
1190,0.84257
1191,0.84745
1192,0.84988
1193,0.85719
1194,0.8620700000000001
1195,0.8645200000000001
1196,0.87184
1197,0.88161
1198,0.8865
1199,0.88894
1200,0.89381
1201,0.90112
1202,0.91086
1203,0.92061
1204,0.92794
1205,0.93768
1206,0.9474299999999999
1207,0.9547399999999999
1208,0.9644799999999999
1209,0.9742299999999999
1210,0.98154
1211,0.9912799999999999
1212,1.001
1213,1.0083
1214,1.0181
1215,1.023
1216,1.0254
1217,1.0351
1218,1.04
1219,1.04
1220,1.0497
1221,1.057
1222,1.057
1223,1.0643
1224,1.074
1225,1.0838
1226,1.0911
1227,1.1008
1228,1.1106
1229,1.1179
1230,1.1276
1231,1.1374
1232,1.1447
1233,1.1544
1234,1.1642
1235,1.1715
1236,1.1764
1237,1.1788
1238,1.1813
1239,1.1909999999999998
1240,1.2007
1241,1.2081
1242,1.2178
1243,1.2275
1244,1.2349
1245,1.2446
1246,1.2543
1247,1.2617
1248,1.2714
1249,1.2812
1250,1.2885
1251,1.2982
1252,1.308
1253,1.3153
1254,1.325
1255,1.3299
1256,1.3323
1257,1.3396
1258,1.3494
1259,1.3543
1260,1.3567
1261,1.3616
1262,1.3713
1263,1.3786
1264,1.3884
1265,1.3981
1266,1.4054
1267,1.4152
1268,1.4249
1269,1.4273
1270,1.4298
1271,1.4395
1272,1.4469
1273,1.4518
1274,1.4542
1275,1.4591
1276,1.4664
1277,1.4689
1278,1.4713
1279,1.4809999999999999
1280,1.4907
1281,1.4980000000000002
1282,1.5078
1283,1.5102
1284,1.5126
1285,1.5199
1286,1.5297
1287,1.537
1288,1.5467
1289,1.5492
1290,1.5516
1291,1.5613
1292,1.5687
1293,1.5711
1294,1.5759999999999998
1295,1.5858
1296,1.5883
1297,1.5884
1298,1.5909
1299,1.5935
1300,1.6008
1301,1.6082
1302,1.6084
1303,1.6085
1304,1.6087
1305,1.6089
1306,1.6091
1307,1.6093
1308,1.6096
1309,1.6098
1310,1.6101
1311,1.6105
1312,1.6107
1313,1.6111
1314,1.6115
1315,1.6118
1316,1.6098
1317,1.6026
1318,1.5953
1319,1.5933
1320,1.5888
1321,1.5816
1322,1.577
1323,1.5775
1324,1.5779
1325,1.5759999999999998
1326,1.5714
1327,1.5643
1328,1.5574
1329,1.5554
1330,1.5483
1331,1.5386
1332,1.5290000000000001
1333,1.5217
1334,1.5197
1335,1.5155
1336,1.5058
1337,1.4987
1338,1.4889
1339,1.4844
1340,1.4825
1341,1.4755
1342,1.4658
1343,1.4585
1344,1.4488
1345,1.4391
1346,1.432
1347,1.4223
1348,1.4125
1349,1.4053
1350,1.3955
1351,1.3882
1352,1.3864
1353,1.3847
1354,1.3752
1355,1.3707
1356,1.369
1357,1.3595
1358,1.3523
1359,1.3425
1360,1.3328
1361,1.3258
1362,1.3159999999999998
1363,1.314
1364,1.3122
1365,1.3054
1366,1.2957
1367,1.2884
1368,1.2787
1369,1.2692
1370,1.2619
1371,1.2522
1372,1.2425
1373,1.2379
1374,1.2363
1375,1.2295
1376,1.2198
1377,1.2125
1378,1.2028
1379,1.1931
1380,1.1859
1381,1.1762
1382,1.1665
1383,1.1592
1384,1.1495
1385,1.1398
1386,1.1325
1387,1.1228
1388,1.1179999999999999
1389,1.1155
1390,1.1107
1391,1.1034
1392,1.101
1393,1.0961
1394,1.0864
1395,1.0792
1396,1.0695
1397,1.0598
1398,1.0525
1399,1.0428
1400,1.0331
1401,1.0258
1402,1.0161
1403,1.0064
1404,0.99941
1405,0.9897100000000001
1406,0.98001
1407,0.9727399999999999
1408,0.9662200000000001
1409,0.9599700000000001
1410,0.9527
1411,0.94301
1412,0.93332
1413,0.92363
1414,0.91637
1415,0.9066799999999999
1416,0.89699
1417,0.8897200000000001
1418,0.88003
1419,0.87034
1420,0.86308
1421,0.85339
1422,0.8437
1423,0.8364299999999999
1424,0.82675
1425,0.81706
1426,0.8098
1427,0.80038
1428,0.79069
1429,0.7834300000000001
1430,0.77375
1431,0.7640600000000001
1432,0.7568
1433,0.74711
1434,0.73743
1435,0.73017
1436,0.72048
1437,0.7189
1438,0.71734
1439,0.70795
1440,0.69827
1441,0.69101
1442,0.68134
1443,0.67166
1444,0.6644
1445,0.6550199999999999
1446,0.64535
1447,0.6380899999999999
1448,0.62842
1449,0.61875
1450,0.60907
1451,0.60182
1452,0.59215
1453,0.5824699999999999
1454,0.57522
1455,0.56585
1456,0.56467
1457,0.56288
1458,0.5532100000000001
1459,0.54355
1460,0.5363
1461,0.52664
1462,0.5172899999999999
1463,0.51005
1464,0.50039
1465,0.49073
1466,0.48348
1467,0.47381999999999996
1468,0.46997
1469,0.47097
1470,0.46407
1471,0.45441000000000004
1472,0.44718
1473,0.43751999999999996
1474,0.42787
1475,0.42063
1476,0.41133000000000003
1477,0.40168000000000004
1478,0.3941
1479,0.38445
1480,0.3748
1481,0.36757
1482,0.35791999999999996
1483,0.34828000000000003
1484,0.34104
1485,0.3314
1486,0.32175
1487,0.31211
1488,0.30488000000000004
1489,0.29523
1490,0.28559
1491,0.27836
1492,0.26871999999999996
1493,0.25908000000000003
1494,0.25185
1495,0.24220999999999998
1496,0.23631999999999997
1497,0.23285
1498,0.22526
1499,0.21561999999999998
1500,0.20838
1501,0.19839
1502,0.18874000000000002
1503,0.18151
1504,0.17187
1505,0.16222999999999999
1506,0.1574
1507,0.15499000000000002
1508,0.145
1509,0.14223
1510,0.13947
1511,0.12912
1512,0.12154000000000001
1513,0.11637
1514,0.11395999999999999
1515,0.10672000000000001
1516,0.097077
1517,0.094319
1518,0.091907
1519,0.082261
1520,0.079848
1521,0.077436
1522,0.06779199999999999
1523,0.058146
1524,0.048501999999999997
1525,0.041268
1526,0.03198
1527,0.022338999999999998
1528,0.01511
1529,0.0058289
1530,0.007287899999999999
1531,0.008401899999999999
1532,0.007509899999999999
1533,0.0062599
1534,-0.00095414
1535,-0.010576
1536,-0.020196000000000002
1537,-0.027016000000000002
1538,-0.036633
1539,-0.04625
1540,-0.045048000000000005
1541,-0.043418
1542,-0.044159
1543,-0.042892
1544,-0.049661000000000004
1545,-0.059255999999999996
1546,-0.058825
1547,-0.058825
1548,-0.057521
1549,-0.05664400000000001
1550,-0.0562
1551,-0.05575700000000001
1552,-0.054412
1553,-0.050657
1554,-0.040626
1555,-0.034925
1556,-0.030677999999999997
1557,-0.023037000000000002
1558,-0.015393
1559,-0.0091971
1560,-0.007287100000000001
1561,-0.0020291
1562,0.0080069
1563,0.014240000000000001
1564,0.020485
1565,0.027643
1566,0.03719
1567,0.046736
1568,0.053899
1569,0.063448
1570,0.07348400000000001
1571,0.080648
1572,0.090199
1573,0.099753
1574,0.10692
1575,0.11647
1576,0.12603
1577,0.12938
1578,0.1337
1579,0.14374
1580,0.1509
1581,0.16045
1582,0.17
1583,0.17717
1584,0.1872
1585,0.19675
1586,0.20392000000000002
1587,0.21348000000000003
1588,0.22303
1589,0.22829000000000002
1590,0.23260999999999998
1591,0.24075
1592,0.24791
1593,0.25745999999999997
1594,0.26700999999999997
1595,0.27416999999999997
1596,0.28421
1597,0.29375999999999997
1598,0.30091999999999997
1599,0.30856999999999996
1600,0.3129
1601,0.31865
1602,0.32581
1603,0.33585
1604,0.3454
1605,0.35115
1606,0.35552
1607,0.36556
1608,0.37271
1609,0.38225
1610,0.39229
1611,0.39945
1612,0.40899
1613,0.41286999999999996
1614,0.41676
1615,0.42441
1616,0.43445
1617,0.4416
1618,0.45114
1619,0.45553999999999994
1620,0.45946000000000004
1621,0.46898999999999996
1622,0.47903
1623,0.48617
1624,0.4957
1625,0.50013
1626,0.50169
1627,0.51121
1628,0.52125
1629,0.5283899999999999
1630,0.53843
1631,0.5429
1632,0.54633
1633,0.55585
1634,0.56589
1635,0.57303
1636,0.5806899999999999
1637,0.58518
1638,0.591
1639,0.59867
1640,0.6050300000000001
1641,0.6119399999999999
1642,0.61907
1643,0.62857
1644,0.63808
1645,0.6452
1646,0.65471
1647,0.66475
1648,0.67188
1649,0.6813899999999999
1650,0.6909
1651,0.69803
1652,0.70385
1653,0.70838
1654,0.71605
1655,0.72555
1656,0.73506
1657,0.74273
1658,0.7522300000000001
1659,0.76174
1660,0.7651899999999999
1661,0.76973
1662,0.7774
1663,0.78452
1664,0.79457
1665,0.80407
1666,0.80808
1667,0.81265
1668,0.82214
1669,0.8292700000000001
1670,0.8387600000000001
1671,0.8488100000000001
1672,0.85593
1673,0.8654200000000001
1674,0.8723700000000001
1675,0.87877
1676,0.88589
1677,0.89594
1678,0.90543
1679,0.91128
1680,0.91589
1681,0.9259299999999999
1682,0.93305
1683,0.94253
1684,0.95258
1685,0.9596899999999999
1686,0.9691799999999999
1687,0.97616
1688,0.97785
1689,0.9873299999999999
1690,0.9968100000000001
1691,1.0039
1692,1.014
1693,1.0235
1694,1.0306
1695,1.0401
1696,1.0495
1697,1.0536
1698,1.0582
1699,1.0653
1700,1.0724
1701,1.0819
1702,1.0914
1703,1.0985
1704,1.1086
1705,1.1179999999999999
1706,1.1252
1707,1.1346
1708,1.1441
1709,1.1513
1710,1.1607
1711,1.1708
1712,1.1748
1713,1.1765
1714,1.186
1715,1.1955
1716,1.2026
1717,1.2121
1718,1.2221
1719,1.2292
1720,1.2387
1721,1.2482
1722,1.2517
1723,1.2563
1724,1.264
1725,1.2711
1726,1.2806
1727,1.2906
1728,1.2977
1729,1.3072
1730,1.3136
1731,1.3177
1732,1.3254
1733,1.3349
1734,1.3425
1735,1.3519999999999999
1736,1.3561
1737,1.3601
1738,1.3678
1739,1.3779
1740,1.385
1741,1.3945
1742,1.4015
1743,1.4056
1744,1.415
1745,1.4245
1746,1.4322
1747,1.4417
1748,1.4511
1749,1.4582
1750,1.4629
1751,1.4669999999999999
1752,1.4769999999999999
1753,1.4829
1754,1.4876
1755,1.4953
1756,1.5030000000000001
1757,1.5071
1758,1.5095
1759,1.5113
1760,1.5137
1761,1.5161
1762,1.5179
1763,1.5227
1764,1.5228
1765,1.5271
1766,1.5296
1767,1.5321
1768,1.5316
1769,1.5342
1770,1.5368
1771,1.5387
1772,1.5413
1773,1.544
1774,1.5436
1775,1.5349
1776,1.5309
1777,1.5329
1778,1.5333
1779,1.536
1780,1.5381
1781,1.5294
1782,1.5231
1783,1.5228
1784,1.5226
1785,1.5139
1786,1.51
1787,1.5105
1788,1.5049
1789,1.4956
1790,1.4893
1791,1.48
1792,1.4775
1793,1.4774
1794,1.4711
1795,1.4618
1796,1.4548
1797,1.4463
1798,1.4369999999999998
1799,1.43
1800,1.4276
1801,1.4282
1802,1.4213
1803,1.412
1804,1.4027
1805,1.3958
1806,1.3865
1807,1.3780000000000001
1808,1.3711
1809,1.3618
1810,1.3525
1811,1.3456
1812,1.3363
1813,1.3271
1814,1.3201
1815,1.3101
1816,1.3009
1817,1.2939
1818,1.2847
1819,1.2755
1820,1.2685
1821,1.2608
1822,1.2554
1823,1.2516
1824,1.2423
1825,1.2331
1826,1.2238
1827,1.2169
1828,1.2077
1829,1.1984
1830,1.1907
1831,1.1815
1832,1.173
1833,1.1661
1834,1.1561
1835,1.1469
1836,1.1399
1837,1.1307
1838,1.1215
1839,1.1146
1840,1.1069
1841,1.1014
1842,1.0999
1843,1.0906
1844,1.0814
1845,1.0745
1846,1.0653
1847,1.0553
1848,1.0484
1849,1.0391
1850,1.0299
1851,1.026
1852,1.0206
1853,1.0129
1854,1.0059
1855,0.99672
1856,0.98751
1857,0.9798
1858,0.97059
1859,0.9613799999999999
1860,0.9544799999999999
1861,0.9459700000000001
1862,0.94279
1863,0.93509
1864,0.9281799999999999
1865,0.91896
1866,0.90975
1867,0.90285
1868,0.89364
1869,0.88364
1870,0.87674
1871,0.86754
1872,0.85834
1873,0.85145
1874,0.84226
1875,0.83226
1876,0.82834
1877,0.82281
1878,0.81361
1879,0.80671
1880,0.79752
1881,0.78833
1882,0.7814399999999999
1883,0.77144
1884,0.76225
1885,0.75537
1886,0.7461899999999999
1887,0.73701
1888,0.73078
1889,0.72522
1890,0.71522
1891,0.70833
1892,0.69915
1893,0.68915
1894,0.6822699999999999
1895,0.67309
1896,0.66392
1897,0.65704
1898,0.6508
1899,0.64523
1900,0.6398199999999999
1901,0.63064
1902,0.62146
1903,0.61147
1904,0.60459
1905,0.59542
1906,0.58625
1907,0.57938
1908,0.57168
1909,0.56607
1910,0.56213
1911,0.55296
1912,0.54379
1913,0.53692
1914,0.52776
1915,0.5186
1916,0.51173
1917,0.50174
1918,0.49259
1919,0.48572
1920,0.47658
1921,0.46743
1922,0.46057
1923,0.45143999999999995
1924,0.4423
1925,0.43545
1926,0.42632
1927,0.41777
1928,0.41293
1929,0.40667
1930,0.39753
1931,0.39068
1932,0.38155
1933,0.37243000000000004
1934,0.36472
1935,0.3556
1936,0.34648
1937,0.33964
1938,0.33053
1939,0.32055
1940,0.31483
1941,0.30855
1942,0.29943000000000003
1943,0.29031
1944,0.28347
1945,0.2735
1946,0.26439
1947,0.25756
1948,0.24846
1949,0.24076
1950,0.23815
1951,0.231
1952,0.22189
1953,0.21419000000000002
1954,0.20508
1955,0.19738
1956,0.19478
1957,0.18992
1958,0.1808
1959,0.17396
1960,0.16399
1961,0.15488
1962,0.15228
1963,0.14657
1964,0.13744
1965,0.1306
1966,0.12149000000000001
1967,0.11150999999999998
1968,0.10468
1969,0.095571
1970,0.088418
1971,0.08582999999999999
1972,0.07813099999999999
1973,0.069013
1974,0.061315999999999996
1975,0.05220399999999999
1976,0.044195
1977,0.039339
1978,0.032497000000000005
1979,0.023377000000000002
1980,0.013397
1981,0.006559899999999999
1982,0.00084086
1983,-0.0040031
1984,-0.010851999999999999
1985,-0.019976
1986,-0.029099
1987,-0.036798000000000004
1988,-0.045916000000000005
1989,-0.055028
1990,-0.057615999999999994
1991,-0.063322
1992,-0.07245
1993,-0.079292
1994,-0.088411
1995,-0.097527
1996,-0.10436
1997,-0.11347
1998,-0.12257
1999,-0.1294
2000,-0.1385
2001,-0.14759
2002,-0.15441
2003,-0.16349
2004,-0.17257
2005,-0.17937999999999998
2006,-0.18846
2007,-0.19752
2008,-0.20432
2009,-0.21338000000000001
2010,-0.22334
2011,-0.23013000000000003
2012,-0.23918000000000003
2013,-0.24823
2014,-0.25727
2015,-0.26404
2016,-0.27308000000000004
2017,-0.2821
2018,-0.28886999999999996
2019,-0.29789
2020,-0.30691
2021,-0.31366
2022,-0.32266999999999996
2023,-0.33166999999999996
2024,-0.33841
2025,-0.3474
2026,-0.35639
2027,-0.36312
2028,-0.3721
2029,-0.38106999999999996
2030,-0.38779
2031,-0.39675
2032,-0.4057
2033,-0.41242
2034,-0.42039
2035,-0.42933000000000004
2036,-0.43601999999999996
2037,-0.44495
2038,-0.45387
2039,-0.46055
2040,-0.46946000000000004
2041,-0.47192
2042,-0.46893
2043,-0.47357
2044,-0.48143
2045,-0.48807
2046,-0.49693000000000004
2047,-0.49725
2048,-0.49738999999999994
2049,-0.50297
2050,-0.51178
2051,-0.52059
2052,-0.52613
2053,-0.53492
2054,-0.54264
2055,-0.54164
2056,-0.5428
2057,-0.5515399999999999
2058,-0.5581
2059,-0.5657399999999999
2060,-0.57445
2061,-0.58098
2062,-0.58641
2063,-0.58417
2064,-0.58411
2065,-0.5916600000000001
2066,-0.5937399999999999
2067,-0.59251
2068,-0.59455
2069,-0.60316
2070,-0.60847
2071,-0.61707
2072,-0.6178899999999999
2073,-0.61654
2074,-0.62179
2075,-0.62915
2076,-0.62561
2077,-0.6241800000000001
2078,-0.63148
2079,-0.63665
2080,-0.63394
2081,-0.63241
2082,-0.63874
2083,-0.64595
2084,-0.65437
2085,-0.6594399999999999
2086,-0.6544800000000001
2087,-0.64949
2088,-0.64573
2089,-0.64069
2090,-0.63769
2091,-0.63259
2092,-0.62874
2093,-0.62359
2094,-0.62229
2095,-0.621
2096,-0.6158
2097,-0.61244
2098,-0.6111300000000001
2099,-0.6059
2100,-0.59917
2101,-0.5917
2102,-0.58496
2103,-0.5797
2104,-0.57368
2105,-0.5683699999999999
2106,-0.5616300000000001
2107,-0.5541699999999999
2108,-0.5461
2109,-0.53871
2110,-0.53127
2111,-0.52044
2112,-0.51305
2113,-0.50764
2114,-0.49816000000000005
2115,-0.49007
2116,-0.48603999999999997
2117,-0.47522
2118,-0.46778000000000003
2119,-0.46374
2120,-0.45563000000000003
2121,-0.44616999999999996
2122,-0.44076000000000004
2123,-0.43333
2124,-0.42455
2125,-0.41847
2126,-0.409
2127,-0.40088
2128,-0.39481
2129,-0.38873
2130,-0.37995
2131,-0.37048000000000003
2132,-0.36643000000000003
2133,-0.36034
2134,-0.35089000000000004
2135,-0.34481
2136,-0.33737
2137,-0.33127
2138,-0.3252
2139,-0.31642
2140,-0.30896
2141,-0.30219
2142,-0.29275
2143,-0.28462
2144,-0.28053
2145,-0.26971999999999996
2146,-0.2623
2147,-0.25619000000000003
2148,-0.24805
2149,-0.23861999999999997
2150,-0.23387
2151,-0.22837
2152,-0.22085
2153,-0.2167
2154,-0.20792
2155,-0.19989
2156,-0.19249000000000002
2157,-0.18445
2158,-0.1763
2159,-0.17215999999999998
2160,-0.16137
2161,-0.15395999999999999
2162,-0.14982
2163,-0.14427
2164,-0.13671
2165,-0.13052
2166,-0.12453
2167,-0.11575
2168,-0.10815999999999999
2169,-0.10536
2170,-0.095987
2171,-0.08720499999999999
2172,-0.08300199999999999
2173,-0.075391
2174,-0.06975
2175,-0.064938
2176,-0.056997000000000006
2177,-0.047638
2178,-0.041669
2179,-0.034294
2180,-0.026677
2181,-0.023858
2182,-0.014499000000000001
2183,-0.007126100000000001
2184,-0.00091314
2185,0.005309899999999999
2186,0.014663999999999998
2187,0.021459
2188,0.029098000000000002
2189,0.034480000000000004
2190,0.041846
2191,0.048644
2192,0.056291999999999995
2193,0.061672000000000005
2194,0.071018
2195,0.077251
2196,0.083491
2197,0.092272
2198,0.10161
2199,0.10785
2200,0.11607999999999999
2201,0.12541
2202,0.13166
2203,0.13594
2204,0.14165999999999998
2205,0.14937
2206,0.15474000000000002
2207,0.16405
2208,0.17033
2209,0.17464000000000002
2210,0.18238
2211,0.18817
2212,0.19549
2213,0.20478
2214,0.21253000000000002
2215,0.21884
2216,0.22812
2217,0.23494
2218,0.2393
2219,0.24708000000000002
2220,0.25292
2221,0.25974
2222,0.26899999999999996
2223,0.27533
2224,0.27973000000000003
2225,0.28561
2226,0.29344000000000003
2227,0.29786999999999997
2228,0.3038
2229,0.31256
2230,0.31985
2231,0.32623
2232,0.33216999999999997
2233,0.33857
2234,0.34454
2235,0.3533
2236,0.35908
2237,0.36698000000000003
2238,0.37296999999999997
2239,0.37898000000000004
2240,0.3835
2241,0.39145
2242,0.39751
2243,0.40206
2244,0.40815
2245,0.41425
2246,0.41883000000000004
2247,0.42496000000000006
2248,0.43111000000000005
2249,0.43573
2250,0.44191
2251,0.4481
2252,0.45276000000000005
2253,0.45898
2254,0.46521999999999997
2255,0.46991000000000005
2256,0.47618
2257,0.4806
2258,0.48532
2259,0.49163999999999997
2260,0.49796999999999997
2261,0.494
2262,0.48662
2263,0.49299
2264,0.49593999999999994
2265,0.50234
2266,0.50876
2267,0.50327
2268,0.49756999999999996
2269,0.50221
2270,0.50525
2271,0.49961000000000005
2272,0.49761000000000005
2273,0.50069
2274,0.50198
2275,0.49641
2276,0.49625
2277,0.50103
2278,0.50074
2279,0.49523999999999996
2280,0.49676000000000003
2281,0.49983999999999995
2282,0.49438999999999994
2283,0.48906000000000005
2284,0.48365
2285,0.4817
2286,0.48498
2287,0.48482
2288,0.47778999999999994
2289,0.47253
2290,0.46721999999999997
2291,0.46023000000000003
2292,0.45498999999999995
2293,0.44977
2294,0.44803000000000004
2295,0.44455
2296,0.4376
2297,0.4324
2298,0.43067
2299,0.42721000000000003
2300,0.4203
2301,0.41512
2302,0.40651
2303,0.39963000000000004
2304,0.39448
2305,0.38761
2306,0.37897
2307,0.37379
2308,0.3652
2309,0.35658
2310,0.35139000000000004
2311,0.3445
2312,0.33763000000000004
2313,0.33247
2314,0.32384
2315,0.31521
2316,0.30662
2317,0.30144
2318,0.29281
2319,0.28422
2320,0.27734000000000003
2321,0.2687
2322,0.26181
2323,0.25494
2324,0.24805
2325,0.23940999999999998
2326,0.23424
2327,0.22566
2328,0.21875
2329,0.21184
2330,0.20496
2331,0.19638
2332,0.19118
2333,0.18255
2334,0.17564000000000002
2335,0.17047
2336,0.16013
2337,0.15324000000000002
2338,0.14635
2339,0.13773
2340,0.12912
2341,0.12395
2342,0.11534000000000001
2343,0.11017
2344,0.10328
2345,0.096385
2346,0.08777
2347,0.082602
2348,0.073991
2349,0.067096
2350,0.060204999999999995
2351,0.053312
2352,0.046424
2353,0.037806
2354,0.030916000000000003
2355,0.0223
2356,0.013687000000000001
2357,0.006793899999999999
2358,-0.0018191
2359,-0.010428
2360,-0.017325999999999998
2361,-0.024215999999999998
2362,-0.032832
2363,-0.03972
2364,-0.048338
2365,-0.055230999999999995
2366,-0.06211900000000001
2367,-0.069012
2368,-0.077627
2369,-0.08279500000000001
2370,-0.089681
2371,-0.098277
2372,-0.10342
2373,-0.11030999999999999
2374,-0.11895
2375,-0.12583
2376,-0.13441
2377,-0.14306
2378,-0.14825
2379,-0.15684
2380,-0.16371
2381,-0.17062
2382,-0.17753
2383,-0.18612
2384,-0.19301
2385,-0.19993
2386,-0.20856
2387,-0.21374
2388,-0.22063000000000002
2389,-0.22924
2390,-0.23786
2391,-0.24475
2392,-0.25164000000000003
2393,-0.26025
2394,-0.26715
2395,-0.27576
2396,-0.28436999999999996
2397,-0.28954
2398,-0.29816
2399,-0.30849
2400,-0.31365
2401,-0.32228
2402,-0.32916999999999996
2403,-0.33605999999999997
2404,-0.34295
2405,-0.35157
2406,-0.35846
2407,-0.36707
2408,-0.37396
2409,-0.38086
2410,-0.39119
2411,-0.39981
2412,-0.4067
2413,-0.41531
2414,-0.42391999999999996
2415,-0.4291
2416,-0.43771000000000004
2417,-0.44633
2418,-0.45493999999999996
2419,-0.46356
2420,-0.47217
2421,-0.47733000000000003
2422,-0.48767
2423,-0.49456999999999995
2424,-0.50146
2425,-0.51007
2426,-0.51869
2427,-0.5273
2428,-0.53247
2429,-0.54109
2430,-0.55142
2431,-0.5583100000000001
2432,-0.5652
2433,-0.57382
2434,-0.57899
2435,-0.58587
2436,-0.5944699999999999
2437,-0.5996
2438,-0.60649
2439,-0.6151399999999999
2440,-0.6203
2441,-0.62888
2442,-0.6392399999999999
2443,-0.64444
2444,-0.6530199999999999
2445,-0.66162
2446,-0.6685399999999999
2447,-0.67543
2448,-0.6822699999999999
2449,-0.68913
2450,-0.69594
2451,-0.7028300000000001
2452,-0.7097600000000001
2453,-0.71665
2454,-0.7252
2455,-0.73214
2456,-0.7408100000000001
2457,-0.74762
2458,-0.75446
2459,-0.7612300000000001
2460,-0.76974
2461,-0.7732600000000001
2462,-0.78366
2463,-0.7921699999999999
2464,-0.79906
2465,-0.80778
2466,-0.81291
2467,-0.82142
2468,-0.82831
2469,-0.83534
2470,-0.84385
2471,-0.8489
2472,-0.85739
2473,-0.8640899999999999
2474,-0.8694
2475,-0.8781399999999999
2476,-0.88485
2477,-0.89341
2478,-0.90217
2479,-0.9107299999999999
2480,-0.9175200000000001
2481,-0.92451
2482,-0.9332600000000001
2483,-0.9383799999999999
2484,-0.9450799999999999
2485,-0.9555100000000001
2486,-0.96249
2487,-0.97096
2488,-0.97962
2489,-0.98661
2490,-0.9951700000000001
2491,-1.0036
2492,-1.0089
2493,-1.0176
2494,-1.0243
2495,-1.0311
2496,-1.0377
2497,-1.0445
2498,-1.0498
2499,-1.0585
2500,-1.0669
2501,-1.072
2502,-1.0808
2503,-1.0877
2504,-1.0961
2505,-1.1014
2506,-1.1102
2507,-1.1204
2508,-1.1253
2509,-1.1341
2510,-1.1428
2511,-1.1496
2512,-1.1582
2513,-1.167
2514,-1.1738
2515,-1.1840000000000002
2516,-1.1928
2517,-1.1996
2518,-1.2062
2519,-1.2145
2520,-1.2195
2521,-1.2265
2522,-1.2353
2523,-1.2386
2524,-1.247
2525,-1.2558
2526,-1.2629
2527,-1.2696
2528,-1.2761
2529,-1.2816
2530,-1.2904
2531,-1.2988
2532,-1.3055
2533,-1.3144
2534,-1.3212
2535,-1.3279
2536,-1.3348
2537,-1.3437
2538,-1.3471
2539,-1.3555
2540,-1.3624
2541,-1.3712
2542,-1.3763
2543,-1.3846
2544,-1.3935
2545,-1.4006
2546,-1.4089
2547,-1.4174
2548,-1.4245
2549,-1.4314
2550,-1.4397
2551,-1.4449
2552,-1.4538
2553,-1.4605
2554,-1.4672
2555,-1.4777
2556,-1.4864
2557,-1.4931
2558,-1.5016
2559,-1.5089
2560,-1.5139
2561,-1.5222
2562,-1.5309
2563,-1.5364
2564,-1.5449
2565,-1.5532
2566,-1.5587
2567,-1.5674
2568,-1.5757
2569,-1.5825
2570,-1.5914
2571,-1.5981
2572,-1.6048
2573,-1.6119
2574,-1.6224
2575,-1.6291
2576,-1.6357
2577,-1.643
2578,-1.6519
2579,-1.6574
2580,-1.6644
2581,-1.6728
2582,-1.6797
2583,-1.6869
2584,-1.6954
2585,-1.7003
2586,-1.709
2587,-1.7179
2588,-1.7233
2589,-1.7305
2590,-1.739
2591,-1.7439
2592,-1.7544
2593,-1.7615
2594,-1.7664
2595,-1.7749
2596,-1.7821
2597,-1.7891
2598,-1.7963
2599,-1.805
2600,-1.8117
2601,-1.8204
2602,-1.8309
2603,-1.8376
2604,-1.8462
2605,-1.855
2606,-1.8617
2607,-1.8701
2608,-1.8773
2609,-1.8843
2610,-1.8927
2611,-1.8978
2612,-1.9048
2613,-1.9152
2614,-1.9236
2615,-1.9322
2616,-1.9376
2617,-1.946
2618,-1.9544
2619,-1.9593
2620,-1.9694
2621,-1.9783
2622,-1.985
2623,-1.9915
2624,-1.9979
2625,-2.0045
2626,-2.0108
2627,-2.0171
2628,-2.0224
2629,-2.0314
2630,-2.0380000000000003
2631,-2.0427
2632,-2.0489
2633,-2.055
2634,-2.0595
2635,-2.0656
2636,-2.0734
2637,-2.0779
2638,-2.0837
2639,-2.0895
2640,-2.0958
2641,-2.1031
2642,-2.1105
2643,-2.1148
2644,-2.1204
2645,-2.126
2646,-2.1301
2647,-2.1356
2648,-2.1430000000000002
2649,-2.147
2650,-2.1523
2651,-2.1575
2652,-2.1592
2653,-2.1642
2654,-2.1692
2655,-2.1761
2656,-2.1797
2657,-2.1844
2658,-2.1891
2659,-2.1925
2660,-2.1969
2661,-2.2013
2662,-2.2078
2663,-2.2176
2664,-2.222
2665,-2.2252
2666,-2.2293
2667,-2.2334
2668,-2.2363
2669,-2.2402
2670,-2.244
2671,-2.2467
2672,-2.2503
2673,-2.2538
2674,-2.2563
2675,-2.2595
2676,-2.2627
2677,-2.265
2678,-2.2679
2679,-2.2707
2680,-2.2728
2681,-2.2754
2682,-2.2779
2683,-2.2797
2684,-2.282
2685,-2.2841
2686,-2.2856
2687,-2.2876
2688,-2.2893
2689,-2.2906
2690,-2.2922
2691,-2.2936
2692,-2.2949
2693,-2.2958
2694,-2.2969
2695,-2.2978
2696,-2.2984
2697,-2.2991
2698,-2.2997
2699,-2.3
2700,-2.3003
2701,-2.3005
2702,-2.3006
2703,-2.3006
2704,-2.3006
2705,-2.3006
2706,-2.3006
2707,-2.3006
2708,-2.3006
