time,value
0,-2.0026
1,0.49415
2,0.49415
3,0.49415
4,0.49415
5,0.49415
6,-2.0026
7,0.49415
8,0.49415
9,0.49415
10,0.49415
11,0.49415
12,-2.0026
13,0.49415
14,0.49415
15,0.49415
16,0.49415
17,-2.0026
18,0.49415
19,0.49415
20,0.49415
21,0.49415
22,0.49415
23,-2.0026
24,0.49415
25,0.49415
26,0.49415
27,0.49415
28,0.49415
29,-2.0026
30,0.49415
31,0.49415
32,0.49415
33,0.49415
34,0.49415
35,-2.0026
36,0.49415
37,0.49415
38,0.49415
39,0.49415
40,-2.0026
41,0.49415
42,0.49415
43,0.49415
44,-2.0026
45,0.49415
46,0.49415
47,0.49415
48,0.49415
49,-2.0026
50,0.49415
51,0.49415
52,0.49415
53,-2.0026
54,0.49415
55,0.49415
56,0.49415
57,0.49415
58,-2.0026
59,0.49415
60,0.49415
61,0.49415
62,-2.0026
63,0.49415
64,0.49415
65,0.49415
66,-2.0026
67,0.49415
68,0.49415
69,0.49415
70,0.49415
71,-2.0026
72,0.49415
73,0.49415
74,0.49415
75,0.49415
76,-2.0026
77,0.49415
78,0.49415
79,0.49415
80,0.49415
81,0.49415
82,-2.0026
83,0.49415
84,0.49415
85,0.49415
86,0.49415
87,0.49415
88,-2.0026
89,0.49415
90,0.49415
91,0.49415
92,-2.0026
93,0.49415
94,0.49415
95,0.49415
