[<text>
<title>yellow freight system &lt;yell.o&gt; 3rd qtr net</title>
<dateline>    overland park, kan., oct 20 -
    </dateline>shr 40 cts vs 75 cts
    qtly div 15-1/2 cts vs 15-1/2 cts prior
    net 11.7 mln vs 21.4 mln
    revs 447.5 mln vs 445.2 mln
    nine mths
    shr 1.04 dlrs vs 1.99 dlrs
    net 29.9 mln vs 56.8 mln
    revs 1.30 billion vs 1.28 billion
    note: full name is yellow freight system inc. dividend is
payable november 23, record november 9.
 reuter
</text>]