time,value
0,1.1111
1,0.33479000000000003
2,-0.9073399999999999
3,-0.9073399999999999
4,-0.9073399999999999
5,-0.9073399999999999
6,-0.9073399999999999
7,-0.28626999999999997
8,1.5769
9,1.2664
10,1.1111
11,0.6453300000000001
12,-0.9073399999999999
13,-0.9073399999999999
14,-0.9073399999999999
15,-0.9073399999999999
16,-0.9073399999999999
17,-0.9073399999999999
18,1.5769
19,1.2664
20,1.1111
21,0.33479000000000003
22,-0.9073399999999999
23,-0.9073399999999999
24,-0.9073399999999999
25,-0.9073399999999999
26,-0.9073399999999999
27,-0.9073399999999999
28,1.5769
29,1.2664
30,1.1111
31,-0.5968100000000001
32,-0.9073399999999999
33,-0.9073399999999999
34,-0.9073399999999999
35,-0.9073399999999999
36,-0.9073399999999999
37,0.49006000000000005
38,1.4217
39,1.1111
40,1.1111
41,-0.9073399999999999
42,-0.9073399999999999
43,-0.9073399999999999
44,-0.9073399999999999
45,-0.9073399999999999
46,-0.9073399999999999
47,1.1111
48,1.2664
49,1.1111
50,0.49006000000000005
51,-0.9073399999999999
52,-0.9073399999999999
53,-0.9073399999999999
54,-0.9073399999999999
55,-0.9073399999999999
56,0.02426
57,1.4217
58,1.2664
59,1.1111
60,1.1111
61,0.02426
62,-0.9073399999999999
63,-0.9073399999999999
64,-0.9073399999999999
65,-0.9073399999999999
66,-0.9073399999999999
67,-0.13101
68,1.5769
69,1.1111
70,1.1111
71,0.49006000000000005
72,-0.9073399999999999
73,-0.9073399999999999
74,-0.9073399999999999
75,-0.9073399999999999
76,-0.9073399999999999
77,0.17953
78,1.4217
79,1.2664
80,1.2664
81,1.1111
82,1.1111
83,1.1111
84,0.95586
85,1.1111
86,-0.9073399999999999
87,-0.9073399999999999
88,-0.9073399999999999
89,-0.9073399999999999
90,-0.9073399999999999
91,-0.9073399999999999
92,0.6453300000000001
93,1.4217
94,1.1111
95,1.1111
