time,value
0,-0.7478100000000001
1,-0.7478100000000001
2,1.5853
3,0.68798
4,-0.7478100000000001
5,-0.7478100000000001
6,-0.7478100000000001
7,0.32903000000000004
8,1.7648
9,-0.7478100000000001
10,-0.7478100000000001
11,-0.7478100000000001
12,-0.7478100000000001
13,1.7648
14,0.50851
15,-0.7478100000000001
16,-0.7478100000000001
17,-0.7478100000000001
18,0.32903000000000004
19,1.7648
20,-0.7478100000000001
21,-0.7478100000000001
22,-0.7478100000000001
23,-0.7478100000000001
24,1.4059
25,0.68798
26,-0.7478100000000001
27,-0.7478100000000001
28,-0.7478100000000001
29,0.14956
30,1.9443
31,-0.7478100000000001
32,-0.7478100000000001
33,-0.7478100000000001
34,-0.7478100000000001
35,1.4059
36,1.9443
37,0.50851
38,-0.7478100000000001
39,-0.7478100000000001
40,-0.7478100000000001
41,1.7648
42,0.50851
43,-0.7478100000000001
44,-0.7478100000000001
45,-0.7478100000000001
46,1.0469
47,1.2264
48,-0.7478100000000001
49,-0.7478100000000001
50,-0.7478100000000001
51,0.32903000000000004
52,1.7648
53,-0.7478100000000001
54,-0.7478100000000001
55,-0.7478100000000001
56,-0.7478100000000001
57,1.9443
58,0.14956
59,-0.7478100000000001
60,-0.7478100000000001
61,1.5853
62,1.4059
63,-0.7478100000000001
64,-0.7478100000000001
65,-0.7478100000000001
66,0.86745
67,1.7648
68,-0.7478100000000001
69,-0.7478100000000001
70,-0.7478100000000001
71,1.0469
72,1.4059
73,-0.7478100000000001
74,-0.7478100000000001
75,-0.7478100000000001
76,0.50851
77,1.7648
78,0.14956
79,-0.7478100000000001
80,-0.7478100000000001
81,1.0469
82,1.4059
83,-0.7478100000000001
84,-0.7478100000000001
85,-0.7478100000000001
86,1.2264
87,1.2264
88,-0.7478100000000001
89,-0.7478100000000001
90,-0.7478100000000001
91,0.68798
92,1.7648
93,-0.7478100000000001
94,-0.7478100000000001
95,-0.7478100000000001
