time,value
0,0.7838
1,0.83747
2,0.83747
3,0.7838
4,0.83747
5,0.46178
6,-1.4167
7,-1.4167
8,-1.3630000000000002
9,-1.4703
10,-1.4167
11,-1.4167
12,-1.4167
13,-1.4167
14,-1.4703
15,-1.4167
16,-1.3630000000000002
17,-1.4167
18,-1.4167
19,-1.4703
20,-1.4167
21,-1.4167
22,-1.4167
23,-1.4703
24,-1.4167
25,-1.4167
26,-1.4167
27,-1.4703
28,-1.4167
29,-0.55794
30,0.8911399999999999
31,0.83747
32,0.13977
33,-1.4167
34,-1.4167
35,-1.4167
36,-1.3630000000000002
37,-1.4167
38,-1.4167
39,-1.4167
40,-1.3630000000000002
41,0.56912
42,0.56912
43,0.56912
44,0.56912
45,0.56912
46,0.56912
47,0.56912
48,0.56912
49,0.56912
50,0.56912
51,0.56912
52,0.62279
53,0.56912
54,0.56912
55,0.56912
56,0.56912
57,0.56912
58,0.56912
59,0.56912
60,0.56912
61,0.56912
62,0.56912
63,0.56912
64,0.56912
65,0.56912
66,0.62279
67,0.51545
68,0.7838
69,0.83747
70,0.7838
71,0.7838
72,0.7838
73,0.83747
74,0.7838
75,0.7838
76,0.7838
77,0.7838
78,0.83747
79,0.83747
80,0.7838
81,0.83747
82,0.7838
83,0.83747
84,0.83747
85,0.83747
86,0.83747
87,0.7838
88,0.83747
89,0.7838
90,0.83747
91,0.83747
92,0.83747
93,0.7838
94,0.83747
95,0.7838
