time,value
0,-0.19159
1,-0.19159
2,-0.19159
3,-0.19159
4,-0.19159
5,-0.19159
6,-0.19159
7,-0.19159
8,-0.19159
9,-0.19159
10,-0.19159
11,-0.19159
12,-0.19159
13,-0.19159
14,-0.19159
15,-0.19159
16,-0.19159
17,-0.19159
18,-0.19159
19,-0.19159
20,-0.19159
21,-0.19159
22,-0.19159
23,-0.19159
24,-0.19159
25,-0.19159
26,-0.19159
27,-0.19159
28,-0.19159
29,-0.19159
30,-0.19159
31,-0.19159
32,-0.19159
33,-0.19159
34,-0.19159
35,-0.19159
36,-0.19159
37,-0.19159
38,-0.19159
39,-0.19159
40,-0.19159
41,-0.19159
42,-0.19159
43,-0.19159
44,-0.19159
45,-0.19159
46,-0.19159
47,-0.19159
48,-0.19159
49,-0.19159
50,-0.19159
51,-0.19159
52,-0.19159
53,-0.19159
54,-0.19159
55,-0.19159
56,-0.19159
57,-0.19159
58,-0.19159
59,-0.19159
60,-0.19159
61,-0.19159
62,-0.19159
63,-0.19159
64,-0.19159
65,-0.19159
66,-0.19159
67,-0.19159
68,-0.19159
69,-0.19159
70,-0.19159
71,-0.19159
72,-0.19159
73,6.7055
74,5.3261
75,3.9467
76,-0.19159
77,-0.19159
78,-0.19159
79,-0.19159
80,-0.19159
81,-0.19159
82,-0.19159
83,-0.19159
84,-0.19159
85,-0.19159
86,-0.19159
87,-0.19159
88,-0.19159
89,-0.19159
90,-0.19159
91,-0.19159
92,-0.19159
93,-0.19159
94,-0.19159
95,1.6476
