time,value
0,-0.17578
1,-0.17578
2,-0.17578
3,-0.17578
4,-0.17578
5,-0.17578
6,-0.17578
7,-0.17578
8,-0.17578
9,-0.17578
10,-0.17578
11,-0.17578
12,-0.17578
13,-0.17578
14,-0.17578
15,-0.17578
16,-0.17578
17,-0.17578
18,-0.17578
19,-0.17578
20,-0.17578
21,-0.17578
22,-0.17578
23,-0.17578
24,-0.17578
25,-0.17578
26,-0.17578
27,-0.17578
28,-0.17578
29,-0.17578
30,-0.17578
31,-0.17578
32,-0.17578
33,-0.17578
34,-0.17578
35,7.0881
36,-0.092927
37,-0.17578
38,-0.17578
39,-0.17578
40,-0.17578
41,-0.17578
42,-0.17578
43,-0.17578
44,-0.17578
45,-0.17578
46,-0.17578
47,4.9614
48,4.1604
49,-0.12055
50,-0.17578
51,-0.17578
52,-0.17578
53,-0.17578
54,-0.17578
55,-0.17578
56,-0.17578
57,-0.17578
58,-0.17578
59,-0.17578
60,-0.17578
61,-0.17578
62,-0.17578
63,-0.17578
64,-0.17578
65,-0.17578
66,-0.17578
67,-0.17578
68,-0.17578
69,-0.17578
70,-0.17578
71,-0.17578
72,-0.17578
73,-0.17578
74,-0.17578
75,-0.17578
76,-0.17578
77,-0.17578
78,-0.17578
79,-0.17578
80,-0.17578
81,-0.17578
82,-0.17578
83,-0.17578
84,-0.17578
85,-0.17578
86,-0.17578
87,-0.17578
88,-0.17578
89,-0.17578
90,-0.17578
91,-0.17578
92,-0.17578
93,-0.17578
94,-0.17578
95,-0.17578
