time,value
0,-0.44978999999999997
1,-0.80004
2,-0.64993
3,-0.8500700000000001
4,-0.8500700000000001
5,-0.80004
6,-0.8500700000000001
7,-0.8500700000000001
8,-0.80004
9,-0.8500700000000001
10,-0.8500700000000001
11,-0.8500700000000001
12,-0.75
13,-0.8500700000000001
14,-0.80004
15,-0.8500700000000001
16,-0.8500700000000001
17,-0.8500700000000001
18,-0.8500700000000001
19,-0.8500700000000001
20,-0.75
21,-0.80004
22,-0.8500700000000001
23,-0.8500700000000001
24,-0.8500700000000001
25,-0.8500700000000001
26,-0.80004
27,-0.9001100000000001
28,-0.80004
29,-0.8500700000000001
30,-0.8500700000000001
31,-0.8500700000000001
32,-0.8500700000000001
33,-0.80004
34,-0.80004
35,-0.80004
36,1.0012
37,1.4515
38,1.4015
39,1.3515
40,1.3515
41,1.2514
42,1.1013
43,1.1513
44,1.1513
45,1.1513
46,1.1513
47,1.1513
48,1.1513
49,1.1013
50,1.1513
51,1.1013
52,1.1513
53,1.1513
54,1.1013
55,1.1513
56,1.2014
57,1.1513
58,1.1513
59,1.1513
60,1.1513
61,1.2514
62,1.4015
63,1.3515
64,1.5016
65,1.4515
66,1.3515
67,1.3515
68,1.3515
69,1.3515
70,1.3515
71,1.4015
72,-0.19962
73,-0.64993
74,-0.5999
75,-0.64993
76,-0.5999
77,-0.64993
78,-0.5999
79,-0.64993
80,-0.80004
81,-0.8500700000000001
82,-0.8500700000000001
83,-0.80004
84,-0.8500700000000001
85,-0.8500700000000001
86,-0.8500700000000001
87,-0.80004
88,-0.8500700000000001
89,-0.8500700000000001
90,-0.8500700000000001
91,-0.8500700000000001
92,-0.80004
93,-0.8500700000000001
94,-0.44978999999999997
95,1.4515
