time,value
0,-0.3487
1,-0.3487
2,-0.3487
3,-0.010567
4,-0.3487
5,-0.3487
6,-0.3487
7,-0.3487
8,-0.3487
9,-0.3487
10,-0.3487
11,-0.3487
12,-0.3487
13,-0.3487
14,-0.3487
15,-0.3487
16,-0.68683
17,-0.3487
18,-0.3487
19,-0.3487
20,-0.3487
21,-0.3487
22,-0.3487
23,-0.3487
24,-0.3487
25,-0.3487
26,-0.3487
27,-0.3487
28,-0.3487
29,-0.3487
30,-0.3487
31,-0.3487
32,-0.3487
33,-0.3487
34,-0.3487
35,-0.3487
36,-0.3487
37,-0.3487
38,-0.3487
39,-0.3487
40,-0.3487
41,-0.3487
42,-0.3487
43,-0.3487
44,-0.3487
45,-0.3487
46,-0.3487
47,-0.3487
48,-0.3487
49,-0.3487
50,-0.3487
51,-0.3487
52,-0.3487
53,-0.3487
54,-0.3487
55,2.0182
56,1.6801
57,-0.3487
58,-0.3487
59,-0.3487
60,-0.3487
61,-0.010567
62,-0.3487
63,-0.3487
64,-0.3487
65,-0.010567
66,-0.3487
67,-0.3487
68,-0.3487
69,-0.010567
70,-0.3487
71,-0.3487
72,-0.3487
73,-0.3487
74,-0.3487
75,-0.3487
76,-0.3487
77,-0.3487
78,4.047
79,1.6801
80,-0.3487
81,-0.010567
82,-0.3487
83,-0.3487
84,-0.3487
85,-0.3487
86,2.0182
87,3.3707
88,3.0326
89,3.3707
90,3.7089
91,3.0326
92,-0.010567
93,-0.3487
94,-0.3487
95,-0.010567
