[<text>
<title>coleman co inc &lt;cln&gt; 3rd qtr net</title>
<dateline>    wichita, kan., oct 20 -
    </dateline>shr 42 cts vs 34 cts
    net 2,945,000 vs 2,400,000
    sales 146.8 mln vs 117.2 mln
    nine mths
    shr 2.45 dlrs vs 2.35 dlrs
    net 17,280,000 vs 16,366,000
    sales 465.6 mln vs 387.8 mln
    avg shrs 7,046,000 vs 6,961,000
    note: 1986 data restated for changes in method of
accounting for pensions
 reuter
</text>]