time,value
0,-0.37931
1,-0.37931
2,-0.37931
3,-0.37931
4,-0.37931
5,-0.37931
6,-0.37931
7,-0.37931
8,-0.37931
9,-0.37931
10,-0.37931
11,-0.37931
12,-0.37931
13,-0.37931
14,-0.37931
15,-0.37931
16,-0.37931
17,-0.37931
18,-0.37931
19,-0.37931
20,-0.37931
21,-0.37931
22,-0.37931
23,-0.37931
24,-0.37931
25,-0.37931
26,-0.37931
27,-0.37931
28,-0.37931
29,-0.37931
30,-0.37931
31,-0.37931
32,-0.37931
33,-0.37931
34,-0.37931
35,-0.37931
36,-0.37931
37,-0.37931
38,-0.37931
39,-0.37931
40,-0.37931
41,-0.37931
42,-0.37931
43,3.9328
44,2.9746
45,-0.37931
46,-0.37931
47,1.5372
48,2.4954
49,2.4954
50,2.4954
51,2.4954
52,2.4954
53,2.4954
54,2.4954
55,2.4954
56,2.4954
57,0.57894
58,-0.37931
59,-0.37931
60,-0.37931
61,-0.37931
62,-0.37931
63,-0.37931
64,-0.37931
65,-0.37931
66,-0.37931
67,-0.37931
68,-0.37931
69,-0.37931
70,-0.37931
71,-0.37931
72,-0.37931
73,-0.37931
74,-0.37931
75,-0.37931
76,-0.37931
77,-0.37931
78,-0.37931
79,-0.37931
80,-0.37931
81,-0.37931
82,-0.37931
83,-0.37931
84,-0.37931
85,-0.37931
86,-0.37931
87,-0.37931
88,-0.37931
89,-0.37931
90,-0.37931
91,-0.37931
92,-0.37931
93,-0.37931
94,-0.37931
95,-0.37931
