time,value
0,-0.9363
1,-0.7261
2,-0.98631
3,-1.2501
4,-1.2446
5,-1.1989
6,-1.129
7,-1.2849
8,-1.0684
9,-1.1811
10,-0.98182
11,-0.89339
12,-0.80911
13,-0.7045600000000001
14,-0.5908899999999999
15,-0.48002
16,-0.36338000000000004
17,-0.22441
18,-0.099844
19,0.011701000000000001
20,0.023530000000000002
21,0.08655700000000001
22,0.16243
23,0.19121
24,0.2616
25,0.22728
26,0.6359600000000001
27,0.9838
28,1.1351
29,1.1105
30,0.8042100000000001
31,0.43051000000000006
32,0.30355
33,0.27432
34,0.37629
35,0.34439000000000003
36,0.34089
37,0.55917
38,0.56657
39,0.65064
40,0.56872
41,0.61239
42,0.81296
43,0.94811
44,0.86666
45,0.9373100000000001
46,0.94509
47,0.92966
48,1.1055
49,1.1912
50,1.0957
51,1.0861
52,1.1201
53,1.01
54,1.1316
55,1.1228
56,1.1783
57,1.2525
58,1.2702
59,1.2078
60,1.1169
61,1.1155
62,1.1381
63,1.158
64,1.2212
65,1.2011
66,1.2046
67,1.1205
68,1.0834
69,1.1021
70,1.1105
71,1.125
72,1.1136
73,1.1434
74,1.1114
75,1.1131
76,1.1274
77,1.0557
78,1.1008
79,1.068
80,1.0462
81,1.0458
82,1.0863
83,1.0408
84,1.0623
85,1.0877
86,1.0714
87,1.0888
88,1.1093
89,1.0828
90,1.093
91,1.0892
92,1.114
93,1.12
94,1.1420000000000001
95,1.1407
96,1.145
97,1.1314
98,1.141
99,1.1571
100,1.16
101,1.163
102,1.1499
103,1.1789
104,1.1758
105,1.1712
106,1.1871
107,1.2036
108,1.2394
109,1.2278
110,1.232
111,1.1933
112,1.2051
113,1.2121
114,1.1966
115,1.2207
116,1.2302
117,1.2538
118,1.2393
119,1.2377
120,1.2638
121,1.275
122,1.2833
123,1.2812
124,1.3441
125,1.3453
126,1.3287
127,1.3398
128,1.3437
129,1.3030000000000002
130,1.3144
131,1.3224
132,1.3119999999999998
133,1.2738
134,1.2147
135,1.1624
136,1.2556
137,1.2312
138,1.1212
139,1.3161
140,1.4096
141,1.45
142,1.4517
143,1.3218
144,1.2576
145,1.1006
146,0.9190200000000001
147,0.7827
148,0.55828
149,0.48544
150,0.54961
151,0.25673
152,0.22632
153,0.18875999999999998
154,0.050524
155,-0.053689
156,-0.29907
157,-0.16527
158,0.054626999999999995
159,0.098954
160,0.054319000000000006
161,-0.13863
162,0.2248
163,-0.05771799999999999
164,0.5273800000000001
165,0.29753
166,0.004664199999999999
167,0.2674
168,0.08358099999999999
169,-0.031406
170,0.039768
171,0.17478
172,0.30751999999999996
173,0.14729
174,-0.17047
175,-0.57007
176,-0.68592
177,-0.39432
178,-0.25563
179,-0.1547
180,-0.22901
181,-0.16139
182,-0.13593
183,-0.282
184,-0.30494
185,-0.35924
186,-0.46331999999999995
187,-0.53646
188,-0.46212
189,-0.5231899999999999
190,-0.4377
191,-0.52822
192,-0.49945
193,-0.58533
194,-0.61457
195,-0.64783
196,-0.57981
197,-0.51917
198,-0.7781
199,-0.72101
200,-0.6341600000000001
201,-0.80913
202,-0.66845
203,-0.67051
204,-0.7669199999999999
205,-0.78578
206,-0.84298
207,-0.8576
208,-0.8678799999999999
209,-0.88223
210,-0.8896299999999999
211,-0.9105700000000001
212,-0.9661799999999999
213,-1.0062
214,-1.0251
215,-1.0795
216,-0.97304
217,-0.9311299999999999
218,-0.89454
219,-0.97503
220,-1.0138
221,-0.9753200000000001
222,-0.91299
223,-0.8753200000000001
224,-0.93978
225,-0.93465
226,-0.88029
227,-0.8550399999999999
228,-0.90246
229,-0.94375
230,-0.96075
231,-1.051
232,-1.0362
233,-1.0270000000000001
234,-1.0554
235,-1.1686
236,-1.0983
237,-1.0625
238,-1.0914
239,-1.1686
240,-1.1269
241,-1.2423
242,-1.1197
243,-1.1909
244,-1.1627
245,-1.1079999999999999
246,-1.1859
247,-1.1953
248,-1.1362
249,-1.2123
250,-1.1611
251,-1.2257
252,-1.2039
253,-1.2161
254,-1.1597
255,-1.2158
256,-1.1674
257,-1.2319
258,-1.1599
259,-1.1688
260,-1.1785
261,-1.2156
262,-1.2733
263,-1.2259
264,-1.1677
265,-1.1641
266,-1.1609
267,-1.1947
268,-1.2412
269,-1.2837
270,-1.2251
271,-1.2321
272,-1.1881
273,-1.1723
274,-1.1903
275,-1.1915
276,-1.2541
277,-1.2644
278,-1.2082
279,-1.258
280,-1.265
281,-1.202
282,-1.2122
283,-1.2715
284,-1.2738
285,-1.2649
286,-1.1949
287,-1.202
288,-1.2566
289,-1.2634
290,-1.2531
291,-1.2597
292,-1.2017
293,-1.1471
294,-1.2051
295,-1.2096
296,-1.2093
297,-1.2727
298,-1.2665
299,-1.1981
