time,value
0,-0.23726
1,-0.23726
2,-0.23726
3,-0.23726
4,-0.23726
5,-0.23726
6,-0.23726
7,-0.23726
8,-0.23726
9,-0.23726
10,-0.23726
11,-0.23726
12,-0.23726
13,-0.23726
14,-0.23726
15,-0.23726
16,-0.23726
17,-0.23726
18,-0.23726
19,-0.23726
20,-0.23726
21,-0.23726
22,-0.23726
23,-0.23726
24,-0.23726
25,-0.23726
26,-0.23726
27,-0.23726
28,-0.23726
29,-0.23726
30,-0.23726
31,-0.23726
32,-0.23726
33,-0.23726
34,-0.23726
35,-0.23726
36,-0.23726
37,-0.23726
38,-0.23726
39,-0.23726
40,-0.23726
41,-0.23726
42,-0.23726
43,4.7295
44,0.3146
45,0.013587
46,-0.23726
47,-0.23726
48,-0.23726
49,5.0137
50,0.46511
51,-0.23726
52,-0.23726
53,-0.23726
54,-0.23726
55,-0.23726
56,-0.23726
57,-0.23726
58,4.4786
59,0.58217
60,-0.23726
61,-0.23726
62,-0.23726
63,-0.23726
64,-0.23726
65,-0.23726
66,-0.23726
67,-0.23726
68,-0.23726
69,-0.23726
70,-0.23726
71,-0.23726
72,-0.23726
73,-0.23726
74,-0.23726
75,-0.23726
76,-0.23726
77,-0.23726
78,-0.23726
79,-0.23726
80,-0.23726
81,-0.23726
82,-0.23726
83,-0.23726
84,-0.23726
85,-0.23726
86,-0.23726
87,-0.23726
88,4.6626
89,0.38149
90,-0.23726
91,-0.23726
92,-0.23726
93,-0.23726
94,-0.23726
95,-0.23726
