time,value
0,-0.29083000000000003
1,-0.29083000000000003
2,-0.29083000000000003
3,-0.29083000000000003
4,-0.29083000000000003
5,-0.29083000000000003
6,-0.29083000000000003
7,-0.29083000000000003
8,-0.29083000000000003
9,-0.29083000000000003
10,-0.29083000000000003
11,-0.29083000000000003
12,-0.29083000000000003
13,-0.29083000000000003
14,-0.29083000000000003
15,-0.29083000000000003
16,-0.29083000000000003
17,-0.29083000000000003
18,-0.29083000000000003
19,-0.29083000000000003
20,-0.29083000000000003
21,-0.29083000000000003
22,-0.29083000000000003
23,-0.29083000000000003
24,-0.29083000000000003
25,-0.29083000000000003
26,-0.29083000000000003
27,-0.29083000000000003
28,-0.29083000000000003
29,-0.29083000000000003
30,-0.29083000000000003
31,-0.29083000000000003
32,-0.29083000000000003
33,2.8616
34,5.1294
35,0.7066399999999999
36,0.094983
37,0.10439000000000001
38,-0.036758
39,2.5322
40,5.0729
41,0.44316000000000005
42,0.038523
43,0.019702
44,-0.17790999999999998
45,-0.29083000000000003
46,-0.29083000000000003
47,-0.29083000000000003
48,-0.29083000000000003
49,-0.29083000000000003
50,-0.29083000000000003
51,-0.29083000000000003
52,-0.29083000000000003
53,-0.29083000000000003
54,-0.29083000000000003
55,-0.29083000000000003
56,-0.29083000000000003
57,-0.29083000000000003
58,-0.29083000000000003
59,-0.29083000000000003
60,-0.29083000000000003
61,-0.29083000000000003
62,-0.2626
63,3.5203
64,2.9086
65,0.010292
66,0.010292
67,-0.29083000000000003
68,-0.29083000000000003
69,-0.29083000000000003
70,-0.29083000000000003
71,-0.29083000000000003
72,-0.29083000000000003
73,-0.29083000000000003
74,-0.29083000000000003
75,-0.29083000000000003
76,-0.29083000000000003
77,-0.29083000000000003
78,-0.29083000000000003
79,-0.29083000000000003
80,-0.29083000000000003
81,-0.29083000000000003
82,-0.29083000000000003
83,-0.29083000000000003
84,-0.29083000000000003
85,-0.29083000000000003
86,-0.29083000000000003
87,-0.29083000000000003
88,-0.29083000000000003
89,-0.29083000000000003
90,-0.29083000000000003
91,-0.29083000000000003
92,-0.29083000000000003
93,-0.29083000000000003
94,-0.29083000000000003
95,-0.29083000000000003
