time,value
0,-0.66799
1,0.11405
2,2.0691
3,-0.27697
4,-0.66799
5,-0.66799
6,-0.66799
7,0.50507
8,2.0691
9,-0.66799
10,-0.66799
11,-0.66799
12,-0.66799
13,0.50507
14,2.0691
15,-0.66799
16,-0.66799
17,-0.66799
18,-0.66799
19,0.50507
20,1.8736
21,-0.66799
22,-0.66799
23,-0.66799
24,-0.66799
25,-0.081463
26,2.0691
27,-0.081463
28,-0.66799
29,-0.66799
30,-0.66799
31,-0.66799
32,2.0691
33,0.50507
34,-0.66799
35,-0.66799
36,-0.66799
37,-0.66799
38,1.6781
39,0.8960899999999999
40,-0.66799
41,-0.66799
42,-0.66799
43,-0.66799
44,1.0916
45,1.4826
46,-0.66799
47,-0.66799
48,-0.66799
49,-0.66799
50,0.30956
51,2.0691
52,-0.66799
53,-0.66799
54,-0.66799
55,-0.66799
56,1.2871
57,1.4826
58,-0.66799
59,-0.66799
60,-0.66799
61,-0.66799
62,1.2871
63,1.4826
64,-0.66799
65,-0.66799
66,-0.66799
67,-0.66799
68,0.8960899999999999
69,1.8736
70,-0.66799
71,-0.66799
72,-0.66799
73,-0.66799
74,1.4826
75,1.2871
76,-0.66799
77,-0.66799
78,-0.66799
79,-0.66799
80,2.2647
81,0.70058
82,-0.66799
83,-0.66799
84,-0.66799
85,0.70058
86,2.0691
87,-0.27697
88,-0.66799
89,-0.66799
90,-0.66799
91,1.6781
92,1.0916
93,-0.66799
94,-0.66799
95,-0.66799
