time,value
0,-0.46029
1,-0.46029
2,-0.46029
3,-0.28902
4,-0.46029
5,-0.46029
6,-0.46029
7,-0.28902
8,-0.46029
9,-0.46029
10,-0.46029
11,-0.28902
12,-0.46029
13,-0.46029
14,-0.46029
15,-0.28902
16,-0.46029
17,-0.46029
18,-0.46029
19,-0.28902
20,-0.46029
21,-0.46029
22,-0.46029
23,-0.28902
24,-0.46029
25,-0.46029
26,-0.46029
27,-0.28902
28,-0.46029
29,-0.46029
30,-0.46029
31,-0.28902
32,-0.46029
33,-0.46029
34,-0.28902
35,-0.46029
36,-0.46029
37,-0.28902
38,-0.46029
39,-0.46029
40,0.053522
41,3.4789
42,0.9098700000000001
43,0.7386
44,0.9098700000000001
45,4.5065
46,1.2524
47,1.0811
48,0.7386
49,0.7386
50,2.6226
51,2.4513
52,0.22479000000000002
53,-0.28902
54,0.56733
55,0.9098700000000001
56,0.053522
57,2.6226
58,3.8215
59,2.7938
60,0.39605999999999997
61,-0.28902
62,-0.46029
63,-0.28902
64,-0.46029
65,-0.28902
66,-0.46029
67,-0.28902
68,-0.46029
69,-0.28902
70,-0.46029
71,-0.28902
72,-0.46029
73,-0.28902
74,-0.46029
75,-0.28902
76,-0.46029
77,-0.46029
78,-0.28902
79,-0.46029
80,-0.46029
81,-0.28902
82,-0.46029
83,-0.28902
84,-0.46029
85,-0.46029
86,-0.46029
87,-0.28902
88,-0.46029
89,-0.46029
90,-0.46029
91,-0.28902
92,-0.46029
93,-0.46029
94,-0.46029
95,-0.46029
