time,value
0,-0.14243
1,-0.14243
2,-0.14243
3,-0.14243
4,-0.14243
5,-0.14243
6,-0.14243
7,-0.14243
8,-0.14243
9,-0.14243
10,-0.14243
11,-0.14243
12,-0.14243
13,-0.14243
14,-0.14243
15,-0.14243
16,-0.14243
17,-0.14243
18,-0.14243
19,-0.14243
20,-0.14243
21,-0.14243
22,-0.14243
23,-0.14243
24,-0.14243
25,-0.14243
26,-0.14243
27,-0.14243
28,-0.14243
29,-0.14243
30,-0.14243
31,-0.14243
32,-0.14243
33,-0.14243
34,-0.14243
35,-0.14243
36,-0.14243
37,-0.14243
38,-0.14243
39,-0.14243
40,-0.14243
41,-0.14243
42,-0.14243
43,-0.14243
44,-0.14243
45,-0.14243
46,-0.14243
47,-0.14243
48,-0.14243
49,-0.14243
50,-0.14243
51,-0.14243
52,-0.14243
53,-0.14243
54,-0.14243
55,-0.14243
56,-0.14243
57,-0.14243
58,-0.14243
59,-0.14243
60,-0.14243
61,-0.14243
62,-0.14243
63,-0.14243
64,-0.14243
65,-0.14243
66,-0.14243
67,-0.14243
68,-0.14243
69,-0.14243
70,-0.14243
71,-0.14243
72,-0.14243
73,-0.14243
74,-0.14243
75,-0.14243
76,-0.14243
77,-0.14243
78,-0.14243
79,-0.14243
80,8.0104
81,5.3784
82,-0.14243
83,-0.14243
84,-0.14243
85,-0.14243
86,-0.14243
87,-0.14243
88,-0.14243
89,-0.14243
90,-0.14243
91,-0.14243
92,-0.14243
93,-0.14243
94,-0.14243
95,-0.14243
