time,value
0,1.8736
1,1.8736
2,-0.62949
3,-0.62949
4,-0.62949
5,-0.62949
6,-0.62949
7,-0.62949
8,-0.62949
9,-0.62949
10,0.6220399999999999
11,1.8736
12,1.6948
13,-0.62949
14,-0.62949
15,-0.62949
16,-0.62949
17,-0.62949
18,-0.62949
19,-0.62949
20,-0.62949
21,0.26446
22,1.8736
23,1.6948
24,-0.62949
25,-0.62949
26,-0.62949
27,-0.62949
28,-0.62949
29,-0.62949
30,-0.62949
31,0.44325
32,1.8736
33,1.6948
34,-0.27191
35,-0.62949
36,-0.62949
37,-0.62949
38,-0.62949
39,-0.62949
40,-0.62949
41,-0.62949
42,-0.62949
43,2.0523
44,1.6948
45,0.08567000000000001
46,-0.62949
47,-0.62949
48,-0.62949
49,-0.62949
50,-0.62949
51,0.44325
52,1.8736
53,1.6948
54,-0.62949
55,-0.62949
56,-0.62949
57,-0.62949
58,-0.62949
59,-0.62949
60,-0.62949
61,1.8736
62,1.6948
63,0.44325
64,-0.62949
65,-0.62949
66,-0.62949
67,-0.62949
68,-0.62949
69,-0.62949
70,-0.62949
71,1.8736
72,1.8736
73,1.3372
74,-0.62949
75,-0.62949
76,-0.62949
77,-0.62949
78,-0.62949
79,-0.62949
80,-0.62949
81,0.26446
82,1.8736
83,1.6948
84,0.26446
85,-0.62949
86,-0.62949
87,-0.62949
88,-0.62949
89,-0.62949
90,-0.62949
91,-0.27191
92,1.8736
93,1.8736
94,0.26446
95,-0.62949
