time,value
0,2.4246
1,1.3271
2,1.3271
3,0.37905
4,0.37905
5,1.2396
6,1.2396
7,1.9767
8,1.9767
9,-0.29378000000000004
10,-0.3764
11,-0.3764
12,-0.45902
13,-0.45902
14,-0.45902
15,-0.45902
16,-0.45902
17,-0.45902
18,-0.45902
19,-0.3764
20,-0.3764
21,-0.3764
22,-0.3764
23,-0.3764
24,-0.3764
25,-0.3764
26,-0.3764
27,-0.46216999999999997
28,-0.3764
29,-0.3764
30,-0.46216999999999997
31,-0.46216999999999997
32,-0.46216999999999997
33,-0.46216999999999997
34,-0.55095
35,-0.55095
36,-0.3764
37,-0.55095
38,-0.55095
39,-0.46518000000000004
40,-0.46518000000000004
41,-0.20800000000000002
42,-0.20800000000000002
43,0.45148
44,0.45148
45,1.0954
46,1.886
47,1.886
48,2.4248
49,2.4248
50,2.3622
51,2.3622
52,1.7915
53,1.7915
54,0.86424
55,0.062664
56,0.062664
57,-0.5767800000000001
58,-0.5767800000000001
59,-0.8725799999999999
60,-0.8725799999999999
61,-0.97377
62,-0.97377
63,-0.9795299999999999
64,-1.1686
65,-1.1686
66,-1.0679
67,-1.0679
68,-0.8725799999999999
69,-0.8725799999999999
70,-0.8655299999999999
71,-0.8655299999999999
72,-0.57102
73,-0.087643
74,-0.087643
75,-0.18589
76,-0.18589
77,-0.3764
78,-0.3764
79,-0.18589
80,-0.18589
81,-0.28002
82,-0.57102
83,-0.57102
84,-0.47278000000000003
85,-0.47278000000000003
86,-0.3764
87,-0.3764
88,-0.56691
89,-0.56691
90,-0.47278000000000003
91,-0.18178
92,-0.18178
93,-0.08208700000000001
94,-0.08208700000000001
95,0.11978
96,0.11978
97,0.41578999999999994
98,0.41578999999999994
99,0.42135
100,0.32497
101,0.32497
102,0.32165
103,0.32165
104,0.023408
105,0.023408
106,-0.17845999999999998
107,-0.17845999999999998
108,-0.3764
109,-0.57434
110,-0.57434
111,-0.67071
112,-0.67071
113,-0.47463999999999995
114,-0.47463999999999995
115,-0.47463999999999995
116,-0.47463999999999995
117,-0.27816
118,0.01205
119,0.01205
120,0.10364000000000001
121,0.10364000000000001
122,0.09271900000000001
123,0.09271900000000001
124,0.09271900000000001
125,0.09271900000000001
126,-0.005525
127,-0.11027
128,-0.11027
129,-0.28762
130,-0.28762
131,-0.3764
132,-0.3764
133,-0.20800000000000002
134,-0.20800000000000002
135,0.068267
136,0.053337999999999997
137,0.053337999999999997
138,0.44367
139,0.44367
140,0.6168600000000001
141,0.6168600000000001
142,0.6290600000000001
143,0.6290600000000001
144,0.42236
145,0.5798399999999999
146,0.5798399999999999
147,0.3579
148,0.3579
149,0.27049
150,0.27049
151,0.17867
152,0.17867
153,0.29481999999999997
154,0.16287000000000001
155,0.16287000000000001
156,0.080246
157,0.080246
158,0.2931
159,0.2931
160,0.20432
161,0.20432
162,0.018597
163,-0.077779
164,-0.077779
165,0.023408
166,0.023408
167,-0.27521
168,-0.27521
169,-0.17403
170,-0.17403
171,-0.17403
172,-0.073344
173,-0.073344
174,-0.17453
175,-0.17453
176,-0.27521
177,-0.27521
178,-0.27571999999999997
179,-0.27571999999999997
180,-0.17602
181,-0.27671
182,-0.27671
183,-0.17845999999999998
184,-0.17845999999999998
185,0.018597
186,0.018597
187,0.10364000000000001
188,0.10364000000000001
189,-0.058433000000000006
190,0.036988
191,0.036988
192,0.07087
193,0.07087
194,0.20438
195,0.20438
196,0.018655
197,0.018655
198,0.27093
199,0.31578
200,0.31578
201,0.30943000000000004
202,0.30943000000000004
203,0.13739
204,0.13739
205,0.2498
206,0.2498
207,0.23489000000000002
208,0.23058
209,0.23058
210,0.25374
211,0.25374
212,0.6240399999999999
213,0.6240399999999999
214,0.87782
215,0.87782
216,0.81455
217,0.6785899999999999
218,0.6785899999999999
219,0.52966
220,0.52966
221,-0.22896999999999998
222,-0.22896999999999998
223,-0.74259
224,-0.74259
225,-0.85431
226,-0.85431
227,-0.85431
228,-0.85431
229,-0.85431
230,-0.61541
231,-0.61541
232,-0.46798999999999996
233,-0.46798999999999996
234,-0.64253
235,-0.55676
236,-0.55676
237,-0.28226
238,-0.28226
239,-0.19068
240,-0.19068
241,0.003941900000000001
242,0.003941900000000001
243,0.58124
244,0.39428
245,0.39428
246,-0.47053999999999996
247,-0.47053999999999996
248,-0.6509
249,-0.6509
250,-1.1694
251,-1.1694
252,-1.8442
253,-1.8033
254,-1.8033
255,-1.0894
256,-1.0894
257,-0.70029
258,-0.70029
259,-0.22091
260,-0.22091
261,0.39991
262,0.94931
263,0.94931
264,1.4231
265,1.4231
266,1.7951
267,1.7951
268,2.2232
269,2.2232
270,2.0135
271,1.1471
272,1.1471
273,0.0032213000000000003
274,0.0032213000000000003
275,-1.2015
276,-1.2015
277,-1.8128
278,-1.8128
279,-1.6798
280,-0.51718
281,-0.51718
282,0.029373000000000003
283,0.029373000000000003
284,0.4413
285,0.4413
286,-0.60053
287,-0.60053
288,-1.248
289,-2.4491
290,-2.4491
291,-1.9098
292,-1.9098
293,-0.75876
294,-0.75876
295,0.7005600000000001
296,0.7005600000000001
297,0.98518
298,1.4009
299,1.4009
300,0.42425
301,0.42425
302,-0.7620399999999999
303,-0.7620399999999999
304,-0.9571799999999999
305,-0.9571799999999999
306,-0.5918899999999999
307,-0.17162
308,-0.17162
309,0.7308899999999999
310,0.7308899999999999
311,1.3925
312,1.3925
313,1.594
314,1.594
315,1.6346
316,1.3126
317,1.3126
318,0.9471700000000001
319,0.9471700000000001
320,0.43308
321,0.43308
322,-0.061256
323,-0.061256
324,-0.3764
325,-0.6651600000000001
326,-0.6651600000000001
327,-1.1136
328,-1.1136
329,-1.0933
330,-1.0933
331,-1.1440000000000001
332,-1.1440000000000001
333,-1.4483
334,-1.3768
335,-1.3768
336,-1.1545
337,-1.1545
338,-1.0751
339,-1.0751
340,-1.0751
341,-1.0751
342,-0.61441
343,0.5626800000000001
344,0.5626800000000001
345,1.8801
346,1.8801
347,5.9081
348,5.9081
349,5.9081
