time,value
0,-1.723
1,0.57434
2,0.57434
3,0.57434
4,-1.723
5,0.57434
6,0.57434
7,0.57434
8,-1.723
9,0.57434
10,0.57434
11,0.57434
12,-1.723
13,0.57434
14,0.57434
15,0.57434
16,-1.723
17,0.57434
18,0.57434
19,0.57434
20,-1.723
21,0.57434
22,0.57434
23,0.57434
24,0.57434
25,-1.723
26,0.57434
27,0.57434
28,0.57434
29,-1.723
30,0.57434
31,0.57434
32,0.57434
33,-1.723
34,0.57434
35,0.57434
36,0.57434
37,-1.723
38,0.57434
39,0.57434
40,0.57434
41,-1.723
42,0.57434
43,0.57434
44,0.57434
45,0.57434
46,-1.723
47,0.57434
48,0.57434
49,0.57434
50,-1.723
51,0.57434
52,0.57434
53,0.57434
54,-1.723
55,0.57434
56,0.57434
57,0.57434
58,-1.723
59,0.57434
60,0.57434
61,0.57434
62,-1.723
63,0.57434
64,0.57434
65,0.57434
66,-1.723
67,0.57434
68,0.57434
69,0.57434
70,-1.723
71,0.57434
72,0.57434
73,0.57434
74,0.57434
75,-1.723
76,0.57434
77,0.57434
78,0.57434
79,-1.723
80,0.57434
81,0.57434
82,0.57434
83,-1.723
84,0.57434
85,0.57434
86,0.57434
87,-1.723
88,0.57434
89,0.57434
90,0.57434
91,-1.723
92,0.57434
93,0.57434
94,0.57434
95,-1.723
