time,value
0,-0.15366
1,-0.15366
2,-0.15366
3,-0.15366
4,-0.15366
5,-0.15366
6,-0.15366
7,-0.15366
8,-0.15366
9,-0.15366
10,-0.15366
11,-0.15366
12,-0.15366
13,-0.15366
14,-0.15366
15,-0.15366
16,-0.15366
17,-0.15366
18,-0.15366
19,-0.15366
20,-0.15366
21,-0.15366
22,-0.15366
23,-0.15366
24,-0.15366
25,-0.15366
26,-0.15366
27,8.8194
28,-0.15366
29,2.5654
30,-0.15366
31,-0.15366
32,-0.15366
33,-0.15366
34,-0.15366
35,-0.15366
36,-0.15366
37,-0.15366
38,-0.15366
39,-0.15366
40,-0.15366
41,-0.15366
42,-0.15366
43,-0.15366
44,-0.15366
45,-0.15366
46,-0.15366
47,-0.15366
48,-0.15366
49,-0.15366
50,-0.15366
51,-0.15366
52,-0.15366
53,-0.15366
54,-0.15366
55,-0.15366
56,-0.15366
57,-0.15366
58,-0.15366
59,-0.15366
60,-0.15366
61,-0.15366
62,-0.15366
63,-0.15366
64,-0.15366
65,-0.15366
66,-0.15366
67,-0.15366
68,-0.15366
69,-0.15366
70,-0.15366
71,-0.15366
72,-0.15366
73,-0.15366
74,-0.15366
75,-0.15366
76,2.9053
77,-0.15366
78,-0.15366
79,-0.15366
80,-0.15366
81,-0.15366
82,-0.15366
83,-0.15366
84,-0.15366
85,-0.15366
86,-0.15366
87,-0.15366
88,-0.15366
89,-0.15366
90,-0.15366
91,-0.15366
92,-0.15366
93,-0.15366
94,-0.15366
95,-0.15366
