time,value
0,-0.48044
1,-0.48044
2,-0.48044
3,-0.48044
4,-0.48044
5,-0.48044
6,-0.48044
7,-0.48044
8,-0.48044
9,-0.48044
10,-0.48044
11,-0.48044
12,-0.48044
13,-0.48044
14,-0.48044
15,-0.48044
16,-0.48044
17,-0.48044
18,-0.48044
19,-0.48044
20,-0.48044
21,-0.48044
22,-0.48044
23,-0.48044
24,-0.48044
25,-0.48044
26,-0.48044
27,-0.48044
28,-0.48044
29,-0.48044
30,-0.48044
31,-0.48044
32,-0.48044
33,-0.48044
34,-0.48044
35,-0.48044
36,-0.48044
37,-0.48044
38,-0.48044
39,-0.48044
40,-0.48044
41,-0.48044
42,-0.48044
43,-0.48044
44,-0.48044
45,-0.48044
46,-0.48044
47,-0.48044
48,-0.48044
49,0.084611
50,0.2965
51,2.0741
52,1.7798
53,4.8169
54,2.3213
55,1.9681
56,3.3689999999999998
57,2.6391
58,1.6385
59,1.3442
60,0.94396
61,0.84978
62,0.82624
63,2.0387
64,0.84978
65,0.79092
66,0.84978
67,-0.42158
68,0.77915
69,0.79092
70,1.8269
71,0.74384
72,1.3324
73,-0.42158
74,-0.48044
75,-0.48044
76,-0.48044
77,-0.48044
78,-0.48044
79,-0.48044
80,-0.48044
81,-0.48044
82,-0.48044
83,-0.48044
84,-0.48044
85,-0.48044
86,-0.48044
87,-0.48044
88,-0.48044
89,-0.48044
90,-0.48044
91,-0.48044
92,-0.48044
93,-0.48044
94,-0.48044
95,-0.48044
