time,value
0,-0.3698
1,-0.3698
2,-0.3698
3,-0.3698
4,-0.3698
5,-0.3698
6,-0.3698
7,-0.3698
8,-0.3698
9,-0.3698
10,-0.3698
11,-0.3698
12,-0.3698
13,-0.3698
14,-0.3698
15,-0.3698
16,-0.3698
17,-0.3698
18,-0.3698
19,-0.3698
20,-0.3698
21,-0.3698
22,-0.3698
23,-0.3698
24,-0.3698
25,-0.3698
26,-0.3698
27,-0.3698
28,-0.3698
29,-0.3698
30,-0.3698
31,-0.3698
32,-0.3698
33,4.3097
34,3.4653
35,2.9141
36,2.9023
37,2.6326
38,2.5388
39,2.7029
40,2.8671
41,1.6122
42,-0.3698
43,-0.3698
44,-0.3698
45,-0.3698
46,-0.3698
47,-0.3698
48,-0.3698
49,-0.3698
50,-0.3698
51,-0.3698
52,1.0024
53,-0.017959
54,-0.3698
55,-0.3698
56,-0.3698
57,-0.3698
58,-0.3698
59,-0.3698
60,-0.3698
61,-0.3698
62,-0.3698
63,-0.3698
64,-0.3698
65,-0.3698
66,-0.3698
67,-0.3698
68,-0.3698
69,-0.3698
70,0.9202899999999999
71,1.7530000000000001
72,0.040681999999999996
73,-0.2877
74,-0.3698
75,-0.3698
76,-0.3698
77,-0.3698
78,-0.3698
79,-0.3698
80,0.22833
81,-0.3698
82,-0.3698
83,-0.3698
84,-0.3698
85,-0.3698
86,-0.3698
87,-0.3698
88,-0.3698
89,-0.3698
90,-0.3698
91,-0.3698
92,-0.3698
93,-0.3698
94,-0.3698
95,-0.3698
