time,value
0,-0.1451
1,-0.1451
2,-0.1451
3,-0.1451
4,-0.1451
5,-0.1451
6,-0.1451
7,-0.1451
8,-0.1451
9,-0.1451
10,-0.1451
11,-0.1451
12,-0.1451
13,-0.1451
14,-0.1451
15,-0.1451
16,-0.1451
17,-0.1451
18,-0.1451
19,-0.1451
20,-0.1451
21,-0.1451
22,-0.1451
23,-0.1451
24,6.8199
25,-0.1451
26,-0.1451
27,-0.1451
28,-0.1451
29,-0.1451
30,-0.1451
31,-0.1451
32,-0.1451
33,-0.1451
34,-0.1451
35,-0.1451
36,-0.1451
37,-0.1451
38,-0.1451
39,-0.1451
40,-0.1451
41,-0.1451
42,-0.1451
43,-0.1451
44,-0.1451
45,-0.1451
46,-0.1451
47,-0.1451
48,-0.1451
49,-0.1451
50,-0.1451
51,-0.1451
52,-0.1451
53,-0.1451
54,-0.1451
55,-0.1451
56,-0.1451
57,-0.1451
58,-0.1451
59,-0.1451
60,-0.1451
61,-0.1451
62,-0.1451
63,-0.1451
64,-0.1451
65,-0.1451
66,-0.1451
67,-0.1451
68,-0.1451
69,-0.1451
70,-0.1451
71,-0.1451
72,-0.1451
73,-0.1451
74,-0.1451
75,-0.1451
76,-0.1451
77,-0.1451
78,-0.1451
79,-0.1451
80,-0.1451
81,-0.1451
82,6.8199
83,-0.1451
84,-0.1451
85,-0.1451
86,-0.1451
87,-0.1451
88,-0.1451
89,-0.1451
90,-0.1451
91,-0.1451
92,-0.1451
93,-0.1451
94,-0.1451
95,-0.1451
