time,value
0,-0.32718
1,-0.32718
2,-0.32718
3,-0.32718
4,-0.32718
5,-0.32718
6,-0.32718
7,-0.32718
8,-0.32718
9,-0.32718
10,-0.32718
11,-0.32718
12,-0.32718
13,-0.32718
14,-0.32718
15,-0.32718
16,-0.32718
17,-0.32718
18,-0.32718
19,-0.32718
20,-0.32718
21,-0.32718
22,-0.32718
23,-0.32718
24,-0.32718
25,-0.32718
26,-0.32718
27,-0.32718
28,-0.32718
29,-0.32718
30,-0.1412
31,0.39605999999999997
32,0.013775999999999998
33,-0.32718
34,0.43738
35,-0.1722
36,-0.32718
37,-0.32718
38,-0.32718
39,-0.32718
40,-0.32718
41,-0.32718
42,-0.32718
43,-0.32718
44,-0.32718
45,-0.32718
46,-0.32718
47,-0.32718
48,-0.32718
49,-0.32718
50,-0.32718
51,-0.11020999999999999
52,2.2765
53,-0.32718
54,-0.32718
55,-0.32718
56,-0.32718
57,-0.32718
58,-0.32718
59,-0.32718
60,-0.32718
61,-0.32718
62,-0.32718
63,-0.32718
64,0.12743
65,3.8882
66,1.9458
67,2.6381
68,2.3694
69,3.134
70,2.6484
71,5.655
72,0.799
73,-0.058547
74,-0.32718
75,-0.32718
76,-0.32718
77,-0.32718
78,-0.32718
79,-0.32718
80,-0.32718
81,-0.32718
82,-0.32718
83,-0.32718
84,-0.32718
85,-0.32718
86,-0.32718
87,-0.32718
88,-0.32718
89,-0.32718
90,-0.32718
91,-0.32718
92,-0.32718
93,-0.32718
94,-0.32718
95,-0.32718
