time,value
0,-0.60368
1,-0.45383999999999997
2,-0.71058
3,-0.79418
4,-0.83109
5,-0.88002
6,-0.8225
7,-0.8487299999999999
8,-0.77564
9,-0.73757
10,-0.67906
11,-0.61224
12,-0.5092300000000001
13,-0.42733000000000004
14,-0.34424
15,-0.25135
16,-0.043931
17,0.33276999999999995
18,0.99434
19,1.7202
20,2.0661
21,1.5679
22,1.2628
23,0.89044
24,0.59764
25,0.23253000000000001
26,-0.36707
27,-0.9468700000000001
28,-1.6872
29,-1.9394
30,-1.6212
31,-1.5927
32,-1.5795
33,-1.1665
34,-0.84016
35,-0.73863
36,-0.36945
37,0.0041731
38,0.33851
39,0.61808
40,1.1097
41,1.2017
42,1.3886
43,1.4579
44,1.3586
45,1.733
46,1.7358
47,1.5958
48,1.7028
49,1.6668
50,1.7798
51,1.5219999999999998
52,1.5401
53,1.4986
54,1.4795
55,1.3464
56,1.7174
57,2.6893
58,1.9552
59,1.5212
60,1.4877
61,1.6157
62,1.6549
63,1.5679
64,1.528
65,1.5829
66,1.6248
67,1.4816
68,1.5574
69,1.5243
70,1.443
71,1.4419
72,1.4614
73,1.5595
74,1.4572
75,1.4299
76,1.4854
77,1.4568
78,1.4874
79,1.4296
80,1.4
81,1.3957
82,1.4456
83,1.4558
84,1.4735
85,1.5143
86,1.5291
87,1.524
88,1.5375
89,1.5205
90,1.5564
91,1.4809
92,1.5265
93,1.4712
94,1.5142
95,1.5987
96,1.6819
97,1.5886
98,1.7002
99,1.771
100,1.8838
101,1.903
102,1.829
103,1.8545
104,1.1983
105,1.0876
106,1.1293
107,1.0551
108,0.63208
109,0.12867
110,-0.48673
111,-0.52122
112,-0.16674
113,-0.21281
114,-0.8902200000000001
115,-1.3431
116,-1.0125
117,-0.63069
118,-0.69665
119,-0.8616299999999999
120,-1.5686
121,-1.386
122,-0.96815
123,-0.35020999999999997
124,0.0022102
125,0.14085999999999999
126,0.40515999999999996
127,0.88207
128,0.66556
129,2.1512
130,0.4658
131,-0.061058
132,-0.3702
133,-0.33299
134,-0.195
135,0.20605
136,0.73401
137,1.0904
138,0.9494299999999999
139,0.55878
140,0.055175999999999996
141,-0.19608
142,-0.34700000000000003
143,-0.38336
144,-0.29225
145,-0.053248000000000004
146,0.083579
147,0.1889
148,0.16701
149,0.12592
150,0.13901
151,0.11932999999999999
152,0.10137
153,0.060048000000000004
154,0.088615
155,0.068874
156,0.048072000000000004
157,0.083577
158,0.096439
159,0.081981
160,0.072298
161,0.038544
162,0.044673000000000004
163,0.07911499999999999
164,0.045591
165,0.031817000000000005
166,0.076838
167,0.12236
168,0.021518000000000002
169,-0.0056443000000000005
170,-0.053022
171,-0.0589
172,-0.08544299999999999
173,-0.091799
174,-0.092029
175,-0.088844
176,-0.11794
177,-0.12367
178,-0.17875
179,-0.16655
180,-0.16139
181,-0.14567
182,-0.11545
183,-0.16939
184,-0.30084
185,-0.35963
186,-0.28662
187,-0.21045
188,-0.21323000000000003
189,-0.27579000000000004
190,-0.26321
191,-0.33724
192,-0.40781
193,-0.42427
194,-0.43255
195,-0.39129
196,-0.4506
197,-0.5233899999999999
198,-0.5867100000000001
199,-0.50051
200,-0.45241000000000003
201,-0.59851
202,-0.55015
203,-0.51982
204,-0.5995
205,-0.5775
206,-0.61249
207,-0.5794600000000001
208,-0.61524
209,-0.64355
210,-0.70472
211,-0.7186100000000001
212,-0.66575
213,-0.6668
214,-0.70272
215,-0.8073100000000001
216,-0.77927
217,-0.68202
218,-0.64869
219,-0.68329
220,-0.69468
221,-0.7134699999999999
222,-0.60282
223,-0.61449
224,-0.67957
225,-0.6994
226,-0.5908100000000001
227,-0.5719
228,-0.648
229,-0.7481
230,-0.7418899999999999
231,-0.70497
232,-0.73017
233,-0.68377
234,-0.7579199999999999
235,-0.8418100000000001
236,-0.79042
237,-0.79385
238,-0.8195
239,-0.91732
240,-0.8967299999999999
241,-0.92909
242,-0.86288
243,-0.85259
244,-0.83076
245,-0.81719
246,-0.86866
247,-0.8604700000000001
248,-0.8631700000000001
249,-0.9296399999999999
250,-0.93819
251,-0.9406100000000001
252,-0.88754
253,-0.93127
254,-0.93758
255,-0.94855
256,-0.9437700000000001
257,-0.9427200000000001
258,-0.8920899999999999
259,-0.8653299999999999
260,-0.87224
261,-0.9017700000000001
262,-0.90192
263,-0.90025
264,-0.94278
265,-0.9170799999999999
266,-0.9172600000000001
267,-0.8779
268,-0.9204600000000001
269,-0.9497899999999999
270,-0.9093
271,-0.95585
272,-0.9314399999999999
273,-0.95676
274,-0.9345600000000001
275,-0.88344
276,-0.88376
277,-0.97221
278,-0.9794200000000001
279,-0.89056
280,-0.9157200000000001
281,-0.9149200000000001
282,-0.9841200000000001
283,-0.90138
284,-0.9824299999999999
285,-0.97965
286,-0.9597600000000001
287,-0.90454
288,-0.9016200000000001
289,-0.97957
290,-0.9693
291,-0.9751799999999999
292,-0.9788899999999999
293,-0.90176
294,-0.89899
295,-0.97593
296,-0.90735
297,-0.9851700000000001
298,-0.98077
299,-0.9758399999999999
