time,value
0,0.63158
1,-0.68855
2,-0.68855
3,-0.68855
4,-0.68855
5,-0.68855
6,-0.68855
7,1.5745
8,1.7631
9,1.8574
10,0.8201700000000001
11,-0.68855
12,-0.68855
13,-0.68855
14,-0.68855
15,-0.68855
16,-0.68855
17,-0.68855
18,-0.68855
19,1.5745
20,1.8574
21,-0.31137
22,-0.68855
23,-0.68855
24,-0.68855
25,0.06581000000000001
26,1.7631
27,0.06581000000000001
28,-0.68855
29,1.2916
30,1.7631
31,0.06581000000000001
32,-0.68855
33,-0.68855
34,-0.68855
35,-0.68855
36,-0.68855
37,-0.68855
38,1.1031
39,1.7631
40,-0.68855
41,-0.68855
42,0.9144700000000001
43,1.1031
44,-0.68855
45,-0.68855
46,-0.68855
47,0.8201700000000001
48,1.8574
49,0.44298999999999994
50,-0.68855
51,-0.68855
52,-0.68855
53,-0.68855
54,-0.68855
55,-0.68855
56,-0.68855
57,1.6688
58,1.9517
59,1.5745
60,-0.68855
61,-0.68855
62,-0.68855
63,-0.68855
64,-0.68855
65,-0.68855
66,-0.68855
67,-0.68855
68,-0.68855
69,1.6688
70,1.9517
71,1.6688
72,-0.40567
73,-0.68855
74,-0.68855
75,-0.68855
76,-0.68855
77,-0.68855
78,0.5372899999999999
79,2.046
80,0.2544
81,-0.68855
82,-0.68855
83,-0.68855
84,-0.68855
85,1.1031
86,1.7631
87,1.9517
88,0.72588
89,-0.68855
90,-0.68855
91,-0.68855
92,-0.68855
93,-0.68855
94,-0.68855
95,0.06581000000000001
