time,value
0,-1.226
1,0.28706
2,-1.3057
3,-2.0599
4,-1.2212
5,-0.8172699999999999
6,-1.3472
7,-1.61
8,-1.2670000000000001
9,-1.1345
10,-1.3589
11,-1.4491
12,-1.3029
13,-1.2658
14,-1.3405
15,-1.3608
16,-1.3073
17,-1.3024
18,-1.3117
19,-1.3127
20,-1.3028
21,-1.3041
22,-1.2973
23,-1.3006
24,-1.2963
25,-1.2996
26,-1.2966
27,-1.2999
28,-1.2975
29,-1.2991
30,-1.2966
31,-1.297
32,-1.2948
33,-1.2946
34,-1.2947
35,-1.2961
36,-1.2988
37,-1.3006
38,-1.3056
39,-1.3088
40,-1.3159999999999998
41,-1.3192
42,-1.3282
43,-1.3318
44,-1.3415
45,-1.3438
46,-1.3541
47,-1.3559
48,-1.3665
49,-1.3661
50,-1.3762
51,-1.3744
52,-1.3843
53,-1.3801
54,-1.3888
55,-1.382
56,-1.3895
57,-1.3806
58,-1.3884
59,-1.3794
60,-1.3884
61,-1.3787
62,-1.3874
63,-1.3756
64,-1.3836
65,-1.37
66,-1.3774
67,-1.361
68,-1.3666
69,-1.3479
70,-1.3515
71,-1.3305
72,-1.3303
73,-1.308
74,-1.3069
75,-1.2851
76,-1.2823
77,-1.2602
78,-1.2572
79,-1.2365
80,-1.2327
81,-1.2127
82,-1.209
83,-1.1907
84,-1.1869
85,-1.1696
86,-1.1648
87,-1.1467
88,-1.1407
89,-1.1258
90,-1.1216
91,-1.1047
92,-1.0925
93,-1.0723
94,-1.0631
95,-1.0507
96,-1.0442
97,-1.0309
98,-1.0209
99,-1.0073
100,-0.99666
101,-0.9832700000000001
102,-0.9699700000000001
103,-0.95481
104,-0.9382299999999999
105,-0.92111
106,-0.90051
107,-0.88135
108,-0.85935
109,-0.84264
110,-0.8217700000000001
111,-0.8064600000000001
112,-0.78562
113,-0.7741100000000001
114,-0.75721
115,-0.75029
116,-0.73393
117,-0.72709
118,-0.7086600000000001
119,-0.70133
120,-0.68143
121,-0.67576
122,-0.6584300000000001
123,-0.6574800000000001
124,-0.64176
125,-0.64393
126,-0.6338600000000001
127,-0.64531
128,-0.63871
129,-0.6512100000000001
130,-0.6499699999999999
131,-0.67724
132,-0.6847300000000001
133,-0.70728
134,-0.70318
135,-0.72596
136,-0.73185
137,-0.76357
138,-0.769
139,-0.79732
140,-0.8062199999999999
141,-0.84116
142,-0.8559700000000001
143,-0.89076
144,-0.9054200000000001
145,-0.94095
146,-0.95954
147,-0.99608
148,-1.0147
149,-1.05
150,-1.0702
151,-1.1043
152,-1.1215
153,-1.1518
154,-1.1724
155,-1.2069
156,-1.2276
157,-1.2544
158,-1.2704
159,-1.2969
160,-1.3147
161,-1.3377
162,-1.3528
163,-1.3744
164,-1.3906
165,-1.41
166,-1.4245
167,-1.4416
168,-1.4554
169,-1.4699
170,-1.4821
171,-1.4927
172,-1.5002
173,-1.5033
174,-1.5063
175,-1.5055
176,-1.5065
177,-1.5019999999999998
178,-1.5012
179,-1.4939
180,-1.4909
181,-1.4793
182,-1.4743
183,-1.4604
184,-1.4543
185,-1.4368
186,-1.4279
187,-1.4061
188,-1.3943
189,-1.3689
190,-1.357
191,-1.3325
192,-1.3242
193,-1.3016
194,-1.2959
195,-1.2745
196,-1.2712
197,-1.2492
198,-1.2448
199,-1.2201
200,-1.2153
201,-1.1887
202,-1.1822
203,-1.1528
204,-1.1464
205,-1.1163
206,-1.1098
207,-1.0811
208,-1.0775
209,-1.054
210,-1.0531
211,-1.0326
212,-1.0333
213,-1.0146
214,-1.014
215,-0.99497
216,-0.99384
217,-0.9760700000000001
218,-0.9742200000000001
219,-0.95747
220,-0.95685
221,-0.9441700000000001
222,-0.94705
223,-0.9398299999999999
224,-0.94584
225,-0.9411799999999999
226,-0.94809
227,-0.9470700000000001
228,-0.9539799999999999
229,-0.9495399999999999
230,-0.9524100000000001
231,-0.9530799999999999
232,-0.96193
233,-0.9616399999999999
234,-0.96199
235,-0.9622299999999999
236,-0.97231
237,-0.98257
238,-0.9920700000000001
239,-1.0004
240,-1.0105
241,-1.0216
242,-1.028
243,-1.0339
244,-1.0358
245,-1.0418
246,-1.0426
247,-1.0479
248,-1.0474
249,-1.0549
250,-1.055
251,-1.0621
252,-1.0579
253,-1.0627
254,-1.0569
255,-1.0618
256,-1.0525
257,-1.0544
258,-1.0434
259,-1.0485
260,-1.0398
261,-1.0463
262,-1.0356
263,-1.0425
264,-1.0332
265,-1.0434
266,-1.0348
267,-1.0465
268,-1.0392
269,-1.0542
270,-1.0467
271,-1.0602
272,-1.0508
273,-1.0667
274,-1.0601
275,-1.0763
276,-1.0686
277,-1.0832
278,-1.0764
279,-1.0898
280,-1.0809
281,-1.0905
282,-1.0809
283,-1.0895
284,-1.0795
285,-1.0854
286,-1.0748
287,-1.0801
288,-1.0705
289,-1.0745
290,-1.0649
291,-1.069
292,-1.0624
293,-1.0678
294,-1.0627
295,-1.0676
296,-1.0637
297,-1.0682
298,-1.0644
299,-1.067
300,-1.0635
301,-1.0656
302,-1.0628
303,-1.0633
304,-1.0603
305,-1.0591
306,-1.0554
307,-1.0521
308,-1.0484
309,-1.0431
310,-1.0373
311,-1.0290000000000001
312,-1.025
313,-1.0186
314,-1.0161
315,-1.0082
316,-1.0079
317,-1.0029
318,-1.0058
319,-1.0006
320,-1.0046
321,-0.99915
322,-1.0035
323,-0.9967299999999999
324,-1.002
325,-0.99356
326,-0.99705
327,-0.98725
328,-0.9928299999999999
329,-0.97865
330,-0.9738100000000001
331,-0.95019
332,-0.9495
333,-0.9348700000000001
334,-0.9371799999999999
335,-0.9150299999999999
336,-0.9143100000000001
337,-0.89879
338,-0.90984
339,-0.8950600000000001
340,-0.89445
341,-0.86146
342,-0.8498399999999999
343,-0.81457
344,-0.80374
345,-0.76968
346,-0.75869
347,-0.72892
348,-0.72475
349,-0.7039
350,-0.70462
351,-0.68665
352,-0.68794
353,-0.6731699999999999
354,-0.67695
355,-0.6646
356,-0.66805
357,-0.65766
358,-0.66317
359,-0.6555300000000001
360,-0.65968
361,-0.6505
362,-0.652
363,-0.6422
364,-0.64049
365,-0.62685
366,-0.6181399999999999
367,-0.5985
368,-0.5825100000000001
369,-0.55785
370,-0.5364399999999999
371,-0.50956
372,-0.48636999999999997
373,-0.4611
374,-0.43928
375,-0.41818999999999995
376,-0.40048
377,-0.38618
378,-0.37322
379,-0.36346999999999996
380,-0.35215
381,-0.34538
382,-0.33505999999999997
383,-0.32969
384,-0.31839
385,-0.31405
386,-0.30282
387,-0.30014
388,-0.289
389,-0.28836999999999996
390,-0.27726999999999996
391,-0.27706
392,-0.26434
393,-0.26482
394,-0.25118
395,-0.25081
396,-0.2336
397,-0.23199
398,-0.21333000000000002
399,-0.21231999999999998
400,-0.19272999999999998
401,-0.19296
402,-0.17406
403,-0.17704
404,-0.1593
405,-0.1645
406,-0.14673
407,-0.15278
408,-0.13423
409,-0.14093
410,-0.12142
411,-0.12743
412,-0.1077
413,-0.11254000000000002
414,-0.092501
415,-0.094578
416,-0.07234600000000001
417,-0.070272
418,-0.044369
419,-0.036418
420,-0.0064762
421,0.005781199999999999
422,0.037745
423,0.053087
424,0.085602
425,0.10147
426,0.13183
427,0.14648
428,0.1734
429,0.18559
430,0.20903000000000002
431,0.22127
432,0.24503000000000003
433,0.25908000000000003
434,0.28135
435,0.29422
436,0.31355
437,0.32466999999999996
438,0.33907
439,0.34602
440,0.35527
441,0.35945
442,0.3644
443,0.36774
444,0.3738
445,0.38181
446,0.38906
447,0.39838
448,0.40726999999999997
449,0.42265
450,0.43501000000000006
451,0.45228999999999997
452,0.46295
453,0.47989
454,0.48744
455,0.5009600000000001
456,0.5018
457,0.50963
458,0.50366
459,0.50847
460,0.49977
461,0.50357
462,0.49258
463,0.49983999999999995
464,0.49513
465,0.5082899999999999
466,0.50138
467,0.51231
468,0.50549
469,0.51904
470,0.50952
471,0.52128
472,0.51154
473,0.52469
474,0.51318
475,0.52941
476,0.5220600000000001
477,0.53785
478,0.5252
479,0.5496300000000001
480,0.56083
481,0.59855
482,0.59953
483,0.61875
484,0.619
485,0.6462600000000001
486,0.64659
487,0.6614
488,0.6535
489,0.6655399999999999
490,0.65599
491,0.66045
492,0.64513
493,0.64669
494,0.63403
495,0.63752
496,0.6267699999999999
497,0.628
498,0.61549
499,0.61382
500,0.60067
501,0.59606
502,0.58086
503,0.5726399999999999
504,0.55666
505,0.54714
506,0.53174
507,0.52004
508,0.50302
509,0.48798
510,0.47058
511,0.45506
512,0.43976000000000004
513,0.42423
514,0.40934
515,0.39148
516,0.37578
517,0.35567
518,0.33924
519,0.31654
520,0.30021
521,0.27823000000000003
522,0.26602
523,0.24623
524,0.23613
525,0.21556
526,0.20640999999999998
527,0.18607
528,0.17956
529,0.16088
530,0.15809
531,0.14160999999999999
532,0.14182
533,0.12573
534,0.12713
535,0.11029000000000001
536,0.11205
537,0.094235
538,0.09763
539,0.080961
540,0.085613
541,0.06538
542,0.06590399999999999
543,0.042881
544,0.047635000000000004
545,0.030293
546,0.038957
547,0.018989
548,0.023393
549,0.0029322
550,0.0071863
551,-0.012536
552,-0.009937
553,-0.029921
554,-0.029535000000000002
555,-0.051022000000000005
556,-0.05346
557,-0.075809
558,-0.081389
559,-0.10592
560,-0.11356
561,-0.13660999999999998
562,-0.14476
563,-0.168
564,-0.17597000000000002
565,-0.19479000000000002
566,-0.20046
567,-0.21631999999999998
568,-0.21868
569,-0.22976
570,-0.23306
571,-0.24309
572,-0.24048000000000003
573,-0.24361999999999998
574,-0.24409
575,-0.2459
576,-0.2339
577,-0.22729000000000002
578,-0.22958
579,-0.2265
580,-0.18911
581,-0.1299
582,-0.088353
583,-0.07671499999999999
584,-0.074335
585,-0.055567
586,-0.034516000000000005
587,-0.015105
588,-0.0038718000000000003
589,0.01797
590,0.034698
591,0.05614500000000001
592,0.067166
593,0.089331
594,0.10292000000000001
595,0.12744
596,0.13914
597,0.16272
598,0.17235999999999999
599,0.1962
600,0.20444
601,0.22760999999999998
602,0.23271999999999998
603,0.25439
604,0.25658000000000003
605,0.27760999999999997
606,0.27864
607,0.30063
608,0.3007
609,0.32308000000000003
610,0.32214
611,0.34557
612,0.34538
613,0.37283
614,0.37496999999999997
615,0.40297
616,0.40341
617,0.43206999999999995
618,0.43925
619,0.47321
620,0.48073999999999995
621,0.50751
622,0.5099600000000001
623,0.53557
624,0.54063
625,0.56412
626,0.5661
627,0.58801
628,0.59386
629,0.61669
630,0.62107
631,0.6413300000000001
632,0.64884
633,0.67165
634,0.68
635,0.6996100000000001
636,0.70723
637,0.72532
638,0.73207
639,0.7468600000000001
640,0.75308
641,0.76747
642,0.77632
643,0.79214
644,0.80361
645,0.81947
646,0.8328899999999999
647,0.8496600000000001
648,0.8650100000000001
649,0.88051
650,0.8970799999999999
651,0.91432
652,0.93361
653,0.94729
654,0.96247
655,0.9736899999999999
656,0.99269
657,1.006
658,1.026
659,1.0371
660,1.0569
661,1.0656
662,1.0839
663,1.0895
664,1.107
665,1.11
666,1.1269
667,1.1286
668,1.1467
669,1.1472
670,1.1649
671,1.1633
672,1.1805
673,1.1765
674,1.1935
675,1.188
676,1.2045
677,1.1957
678,1.2109999999999999
679,1.2011
680,1.2176
681,1.2064
682,1.2234
683,1.2131
684,1.2328
685,1.2253
686,1.2456
687,1.2405
688,1.2633
689,1.2628
690,1.2871
691,1.2873
692,1.3092
693,1.3086
694,1.3286
695,1.3273
696,1.344
697,1.3421
698,1.3599
699,1.3627
700,1.382
701,1.3863
702,1.4071
703,1.4175
704,1.4429
705,1.4579
706,1.4854
707,1.5045
708,1.5332
709,1.5530000000000002
710,1.5792
711,1.5973
712,1.6178
713,1.6306
714,1.645
715,1.655
716,1.6657
717,1.6757
718,1.6869
719,1.6993
720,1.7096
721,1.7261
722,1.7453
723,1.7730000000000001
724,1.7924
725,1.8135
726,1.8252
727,1.8455
728,1.8552
729,1.8732
730,1.8792
731,1.8976
732,1.9024
733,1.9213
734,1.9263
735,1.9494
736,1.9576
737,1.9862
738,1.9985
739,2.0314
740,2.044
741,2.0786
742,2.0906
743,2.1225
744,2.1248
745,2.1485
746,2.1456
747,2.1683
748,2.1605
749,2.1791
750,2.1688
751,2.1903
752,2.1828
753,2.2061
754,2.2009
755,2.2232
756,2.2167
757,2.235
758,2.2265
759,2.241
760,2.2286
761,2.2358
762,2.2187
763,2.2218
764,2.2025
765,2.1995
766,2.1769
767,2.1734
768,2.1531
769,2.1443
770,2.1184
771,2.1106
772,2.0972
773,2.0976
774,2.0836
775,2.077
776,2.0613
777,2.0533
778,2.0368
779,2.0256
780,2.0085
781,1.9942
782,1.9758
783,1.9601
784,1.9415
785,1.9187
786,1.8923
787,1.8633
788,1.8359
789,1.8030000000000002
790,1.7737
791,1.7412
792,1.7147
793,1.6778
794,1.6479
795,1.6155
796,1.6013
797,1.58
798,1.5691
799,1.5446
800,1.5342
801,1.5105
802,1.5016
803,1.4764
804,1.4678
805,1.4417
806,1.4334
807,1.4046
808,1.3947
809,1.3638
810,1.3555
811,1.3253
812,1.3176
813,1.2868
814,1.2841
815,1.2584
816,1.2561
817,1.2224
818,1.2162
819,1.1853
820,1.183
821,1.1489
822,1.1402
823,1.1061
824,1.0986
825,1.065
826,1.0545
827,1.0233
828,1.018
829,0.99136
830,0.98267
831,0.9545600000000001
832,0.94984
833,0.9286
834,0.92135
835,0.8995299999999999
836,0.9011100000000001
837,0.8873200000000001
838,0.87705
839,0.85745
840,0.8689
841,0.86387
842,0.82237
843,0.73356
844,0.67366
845,0.65588
846,0.6631
847,0.64767
848,0.62805
849,0.6151800000000001
850,0.61336
851,0.6047100000000001
852,0.59592
853,0.59241
854,0.5925699999999999
855,0.59218
856,0.58926
857,0.5909
858,0.5894199999999999
859,0.5908
860,0.58495
861,0.58329
862,0.5728800000000001
863,0.5696899999999999
864,0.5573600000000001
865,0.55155
866,0.5313100000000001
867,0.51977
868,0.49742
869,0.48973999999999995
870,0.46871
871,0.45986000000000005
872,0.43393999999999994
873,0.42308
874,0.39558000000000004
875,0.38594
876,0.36066
877,0.3588
878,0.34003
879,0.33992
880,0.31561
881,0.31325
882,0.28865
883,0.28207
884,0.2426
885,0.22487
886,0.18775999999999998
887,0.1841
888,0.15524000000000002
889,0.14993
890,0.11792000000000001
891,0.11208
892,0.083522
893,0.077429
894,0.047185000000000005
895,0.03785
896,0.008895700000000001
897,0.0020413000000000002
898,-0.022682
899,-0.029182
900,-0.054649
901,-0.06389600000000001
902,-0.08732999999999999
903,-0.092886
904,-0.11372
905,-0.12528
906,-0.15189
907,-0.16471
908,-0.18991
909,-0.21305
910,-0.25361999999999996
911,-0.28355
912,-0.31371
913,-0.33303
914,-0.36067
915,-0.38332
916,-0.40757
917,-0.42448
918,-0.44351999999999997
919,-0.45916
920,-0.47452
921,-0.4872
922,-0.49883999999999995
923,-0.50977
924,-0.51726
925,-0.52535
926,-0.52968
927,-0.53779
928,-0.54074
929,-0.54707
930,-0.5441
931,-0.5455399999999999
932,-0.53827
933,-0.5386
934,-0.52718
935,-0.5222399999999999
936,-0.50449
937,-0.49876000000000004
938,-0.48203
939,-0.47846000000000005
940,-0.46016
941,-0.456
942,-0.43688999999999995
943,-0.4337
944,-0.41205
945,-0.40641
946,-0.38215
947,-0.37694
948,-0.35014
949,-0.34204
950,-0.31272
951,-0.30669
952,-0.27708
953,-0.26993
954,-0.23944000000000001
955,-0.23512
956,-0.20138
957,-0.18688
958,-0.14517
959,-0.13327999999999998
960,-0.10287
961,-0.095683
962,-0.062251
963,-0.049264999999999996
964,-0.017034
965,-0.007852
966,0.021352
967,0.034147000000000004
968,0.068511
969,0.086868
970,0.12240999999999999
971,0.14121
972,0.17492
973,0.19359
974,0.22646
975,0.24661
976,0.27845
977,0.29563
978,0.31869000000000003
979,0.3272
980,0.34308
981,0.35201
982,0.37168
983,0.38733
984,0.40995
985,0.4272
986,0.44866999999999996
987,0.46841000000000005
988,0.49332
989,0.5152399999999999
990,0.5331899999999999
991,0.54856
992,0.56417
993,0.5794
994,0.5877
995,0.6016
996,0.61616
997,0.63012
998,0.62968
999,0.64613
1000,0.6704600000000001
1001,0.69195
1002,0.68225
1003,0.70576
1004,0.7782399999999999
1005,0.8810100000000001
1006,0.91637
1007,0.90651
1008,0.8788
1009,0.8899100000000001
1010,0.88474
1011,0.88092
1012,0.85783
1013,0.86154
1014,0.8437399999999999
1015,0.83878
1016,0.8133199999999999
1017,0.81482
1018,0.79357
1019,0.79257
1020,0.7677
1021,0.7699600000000001
1022,0.74507
1023,0.7409899999999999
1024,0.70609
1025,0.69939
1026,0.66755
1027,0.65814
1028,0.6188100000000001
1029,0.60726
1030,0.58121
1031,0.58298
1032,0.55994
1033,0.55477
1034,0.52836
1035,0.52051
1036,0.49094
1037,0.47821
1038,0.44882
1039,0.43526000000000004
1040,0.4042
1041,0.3877
1042,0.35871
1043,0.34437
1044,0.32039
1045,0.31296
1046,0.2998
1047,0.29785
1048,0.28636999999999996
1049,0.28268000000000004
1050,0.27084
1051,0.26244
1052,0.24668
1053,0.23795
1054,0.22989
1055,0.22689
1056,0.22093000000000002
1057,0.21547
1058,0.2097
1059,0.20310999999999998
1060,0.19594
1061,0.18550999999999998
1062,0.17820999999999998
1063,0.16737
1064,0.15829000000000001
1065,0.13898
1066,0.12180999999999999
1067,0.09677100000000001
1068,0.080221
1069,0.056124
1070,0.04312
1071,0.023395
1072,0.018244
1073,0.02396
1074,0.015338
1075,-0.048942
1076,-0.035726
1077,0.039925
1078,-0.004397
1079,-0.17936
1080,-0.10502
1081,0.12874000000000002
1082,-0.01831
1083,-0.4195
1084,-0.1717
1085,0.40756
1086,-0.009390700000000002
1087,-0.9596899999999999
1088,-0.2087
1089,1.5526
1090,0.031076
1091,-6.3517
