time,value
0,-0.92494
1,-0.92494
2,-0.92494
3,-0.92494
4,-0.92494
5,-0.92494
6,-0.92494
7,-0.92494
8,-0.92494
9,-0.92494
10,-0.92494
11,-0.92494
12,-0.92494
13,-0.92494
14,-0.92494
15,-0.92494
16,-0.92494
17,-0.92494
18,-0.92494
19,-0.92494
20,-0.92494
21,-0.92494
22,-0.92494
23,-0.92494
24,-0.92494
25,-0.92494
26,-0.92494
27,-0.92494
28,-0.92494
29,-0.92494
30,-0.92494
31,-0.92494
32,-0.92494
33,-0.92494
34,-0.92494
35,-0.92494
36,-0.92494
37,-0.92494
38,-0.92494
39,-0.92494
40,-0.92494
41,-0.92494
42,-0.92494
43,-0.92494
44,-0.92494
45,-0.92494
46,-0.92494
47,0.013027
48,1.2636
49,1.2636
50,1.2636
51,1.2636
52,1.2636
53,1.5763
54,1.2636
55,0.95099
56,0.63834
57,0.63834
58,0.95099
59,1.5763
60,1.2636
61,1.5763
62,1.5763
63,1.2636
64,1.5763
65,1.2636
66,1.2636
67,1.2636
68,1.5763
69,1.2636
70,1.2636
71,1.2636
72,1.2636
73,1.2636
74,0.95099
75,0.63834
76,0.95099
77,1.2636
78,0.32568
79,0.32568
80,0.63834
81,0.63834
82,0.32568
83,0.63834
84,1.2636
85,0.63834
86,0.32568
87,0.32568
88,0.63834
89,0.32568
90,0.32568
91,0.32568
92,0.32568
93,-0.92494
94,-0.92494
95,1.2636
