time,value
0,0.8653
1,-0.94758
2,-1.2066
3,-1.2066
4,-0.30012
5,1.189
6,0.93004
7,0.93004
8,-0.041139999999999996
9,-1.2066
10,-1.2066
11,-1.2066
12,0.93004
13,1.0595
14,0.99479
15,0.41208
16,-1.2066
17,-1.2066
18,-1.2066
19,0.47681999999999997
20,1.0595
21,0.99479
22,0.47681999999999997
23,-1.2066
24,-1.2066
25,-1.2066
26,0.34733
27,1.0595
28,0.8653
29,0.28259
30,-1.2066
31,-1.2066
32,-1.2066
33,0.60632
34,0.99479
35,0.93004
36,0.93004
37,-0.94758
38,-1.2066
39,-1.2066
40,-0.17063
41,1.1243
42,0.99479
43,0.93004
44,0.28259
45,-1.2066
46,-1.2066
47,-1.2066
48,0.67106
49,1.0595
50,0.93004
51,0.93004
52,-0.10589000000000001
53,-1.2066
54,-1.2066
55,-1.2066
56,1.1243
57,1.0595
58,0.93004
59,0.93004
60,-0.30012
61,-1.2066
62,-1.2066
63,-0.49436
64,1.1243
65,1.0595
66,0.93004
67,0.93004
68,0.93004
69,-0.23538
70,-1.2066
71,-1.2066
72,-1.2066
73,1.2538
74,1.0595
75,0.93004
76,0.93004
77,0.93004
78,-0.75334
79,-1.2066
80,-1.2066
81,-0.62385
82,1.189
83,0.99479
84,0.93004
85,0.8653
86,-0.49436
87,-1.2066
88,-1.2066
89,-0.94758
90,1.189
91,0.99479
92,0.99479
93,0.8653
94,-0.42961000000000005
95,-1.2066
