time,value
0,-0.41943
1,0.69905
2,-1.3142
3,0.69905
4,-0.19573
5,-1.7616
6,2.0412
7,-0.86682
8,-0.86682
9,2.0412
10,-1.3142
11,-0.41943
12,0.69905
13,-0.86682
14,0.47535
15,-0.19573
16,-1.0905
17,1.3701
18,-0.86682
19,-0.41943
20,1.1464
21,-1.5379
22,-0.19573
23,0.47535
24,-1.0905
25,0.92274
26,0.47535
27,-0.86682
28,1.8175
29,-0.19573
30,1.5938
31,2.2649
32,-0.19573
33,1.3701
34,1.1464
35,-0.86682
36,1.1464
37,0.25166
38,-1.3142
39,1.1464
40,-0.64312
41,0.47535
42,0.92274
43,-0.41943
44,0.25166
45,1.5938
46,-0.64312
47,1.5938
48,-0.19573
49,-0.64312
50,2.2649
51,-0.64312
52,0.25166
53,1.1464
54,-1.0905
55,0.69905
56,-0.19573
57,-0.86682
58,1.1464
59,-0.86682
60,-0.19573
61,0.47535
62,-1.3142
63,0.92274
64,0.25166
65,-1.3142
66,1.1464
67,-0.41943
68,-0.86682
69,0.25166
70,-1.0905
71,0.027962
72,0.027962
73,-1.0905
74,0.47535
75,-0.41943
76,-0.64312
77,1.3701
78,-0.86682
79,0.25166
80,1.1464
81,-0.86682
82,0.47535
83,0.027962
84,-1.0905
85,0.69905
86,-0.86682
87,-0.41943
88,0.027962
89,-1.5379
90,-0.19573
91,-0.64312
92,-1.3142
93,0.92274
94,-1.5379
95,-0.86682
