time,value
0,-1.0778
1,0.35927
2,-1.0778
3,0.35927
4,-1.0778
5,0.35927
6,0.35927
7,-1.0778
8,0.35927
9,-1.0778
10,0.35927
11,-1.0778
12,0.35927
13,-1.0778
14,0.35927
15,-1.0778
16,0.35927
17,-1.0778
18,0.35927
19,-1.0778
20,0.35927
21,-1.0778
22,0.35927
23,-1.0778
24,0.35927
25,-1.0778
26,0.35927
27,-1.0778
28,0.35927
29,0.35927
30,-1.0778
31,0.35927
32,-1.0778
33,0.35927
34,-1.0778
35,0.35927
36,-1.0778
37,0.35927
38,-1.0778
39,0.35927
40,-1.0778
41,0.35927
42,-1.0778
43,0.35927
44,-1.0778
45,0.35927
46,-1.0778
47,0.35927
48,-1.0778
49,0.35927
50,-1.0778
51,0.35927
52,3.2334
53,0.35927
54,0.35927
55,0.35927
56,0.35927
57,-1.0778
58,0.35927
59,0.35927
60,0.35927
61,-1.0778
62,0.35927
63,0.35927
64,0.35927
65,-1.0778
66,0.35927
67,0.35927
68,0.35927
69,-1.0778
70,0.35927
71,0.35927
72,0.35927
73,-1.0778
74,0.35927
75,0.35927
76,0.35927
77,-1.0778
78,0.35927
79,1.7964
80,1.7964
81,3.2334
82,3.2334
83,3.2334
84,0.35927
85,0.35927
86,-1.0778
87,0.35927
88,0.35927
89,0.35927
90,0.35927
91,-1.0778
92,0.35927
93,0.35927
94,0.35927
95,-1.0778
