time,value
0,0.32587
1,0.24419000000000002
2,0.33579000000000003
3,0.083705
4,0.36161
5,0.36941
6,0.37371
7,0.39236
8,0.091405
9,0.38661
10,0.13135
11,0.34368000000000004
12,0.14132999999999998
13,0.11517000000000001
14,0.2731
15,0.39731
16,0.33094
17,0.40725
18,0.5449
19,0.48453999999999997
20,0.54479
21,0.65789
22,0.80779
23,0.77584
24,0.6189
25,0.80791
26,0.7265699999999999
27,0.7178399999999999
28,0.77305
29,0.8431799999999999
30,0.92629
31,0.8939799999999999
32,0.93201
33,0.83825
34,0.83301
35,0.85031
36,0.91114
37,0.82042
38,0.90717
39,0.99503
40,1.7769
41,2.4778
42,1.7003
43,0.89891
44,-0.16702999999999998
45,-0.53389
46,-0.56792
47,-0.34548
48,-0.13372
49,-0.14589000000000002
50,-0.28394
51,-0.62478
52,-0.6171300000000001
53,-0.91855
54,-1.348
55,-1.1611
56,-1.6662
57,-2.2335
58,-2.6345
59,-2.6611
60,-2.8741
61,-2.7207
62,-2.2348
63,-2.3388
64,-3.1661
65,-2.2266
66,-1.7404
67,-1.2217
68,-1.1676
69,-0.96988
70,-1.11
71,-0.88674
72,-0.15472
73,0.77884
74,-0.1832
75,-0.42375
76,0.54474
77,1.0538
78,0.077029
79,0.94881
80,0.38634
81,-0.52546
82,-0.74538
83,-0.9950899999999999
84,-1.6721
85,-2.3216
86,-2.2119999999999997
87,-2.7188
88,-2.9187
89,-2.6238
90,-2.4965
91,-2.3644
92,-2.6289999999999996
93,-2.2377
94,-1.7728
95,-1.8252
96,-1.8683
97,-1.7774
98,-1.8333
99,-2.3779
100,-2.2469
101,-2.3483
102,-2.0846
103,-2.2921
104,-2.3648
105,-1.7028
106,-1.2038
107,-1.4126
108,-1.0066
109,-0.90009
110,-0.82225
111,-0.45416999999999996
112,-0.17689000000000002
113,-0.06254900000000001
114,-0.080665
115,0.29533000000000004
116,-0.39615
117,1.1042
118,0.60592
119,0.80323
120,0.5174
121,0.42511000000000004
122,1.1229
123,0.8808799999999999
124,1.0209
125,1.0688
126,0.5274
127,0.25828
128,-0.081307
129,-0.12814
130,-0.62493
131,-0.92653
132,-1.1302
133,-1.1269
134,-1.0752
135,-1.5536
136,-1.8062
137,-1.9916
138,-1.5637
139,-1.1849
140,-0.84721
141,-0.3395
142,-0.14528
143,-0.32603000000000004
144,-0.81786
145,-0.45093
146,-0.53181
147,0.43343000000000004
148,0.42196999999999996
149,0.36801999999999996
150,0.74754
151,0.8055
152,0.6954899999999999
153,0.75216
154,0.39662
155,-0.16172
156,-0.16410999999999998
157,-0.34442
158,-0.08042300000000001
159,0.16084
160,0.3463
161,0.3432
162,0.12155
163,0.22329000000000002
164,0.33232
165,0.6283
166,0.70295
167,0.64969
168,0.58411
169,0.43804
170,0.57529
171,0.43755
172,0.36285
173,0.43858
174,0.47006000000000003
175,0.5007
176,0.45837
177,0.13527999999999998
178,-0.22114
179,-0.40875
180,-0.19449
181,0.019363
182,0.20288
183,0.36376
184,0.32528
185,0.38006999999999996
186,0.38165
187,0.15092
188,0.1015
189,0.42485
190,0.5892
191,0.53537
192,0.74174
193,0.83262
194,0.62017
195,0.60247
196,0.42135
197,0.43118999999999996
198,0.18499000000000002
199,0.29906
200,0.43121000000000004
201,0.78764
202,0.76331
203,0.83388
204,0.8629700000000001
205,0.63007
206,0.30254000000000003
207,0.39385
208,0.10941
209,0.09435199999999999
210,0.088011
211,0.17076
212,0.3891
213,0.33543
214,0.33285
215,0.31042
216,0.3193
217,0.28323000000000004
218,0.253
219,0.50534
220,0.30574
221,0.27093
222,0.24786
223,0.23704
224,0.3137
225,0.56494
226,0.54847
227,0.5367
228,0.57157
229,0.57476
230,0.56681
231,0.30635999999999997
232,0.5702699999999999
233,0.58917
234,0.35484
235,0.59234
236,0.5593600000000001
237,0.52181
238,0.50921
239,0.49733999999999995
240,0.39775
241,0.48728999999999995
242,0.43461000000000005
243,0.5392
244,0.54456
245,0.53285
246,0.75741
247,0.53676
248,0.63126
249,0.5301899999999999
250,0.53698
251,0.52989
252,0.36575
253,0.26673
254,0.42122
255,0.52199
256,0.5333100000000001
257,0.56223
258,0.55119
259,0.83767
260,0.55066
261,0.8582700000000001
262,0.84206
263,0.5503600000000001
264,0.54791
265,0.52067
266,0.49706999999999996
267,0.51208
268,0.24067
269,0.52552
270,0.52632
271,0.52827
272,0.72414
273,0.5350199999999999
274,0.54524
275,0.54286
276,0.53433
277,0.24503000000000003
278,0.51825
279,0.57973
280,0.81055
281,0.81092
282,0.80414
283,0.79511
284,0.80476
285,0.81103
286,0.50151
287,0.80598
288,0.79865
289,0.78189
290,0.76002
291,0.75565
292,0.49331
293,0.75783
294,0.79488
295,0.49486
296,0.78488
297,0.7641100000000001
298,0.75612
299,0.46593
