time,value
0,-0.1545
1,-0.1545
2,-0.1545
3,-0.1545
4,-0.1545
5,-0.1545
6,-0.1545
7,-0.1545
8,-0.1545
9,-0.1545
10,-0.1545
11,-0.1545
12,-0.1545
13,-0.1545
14,-0.1545
15,-0.1545
16,-0.1545
17,-0.1545
18,-0.1545
19,-0.1545
20,-0.1545
21,-0.1545
22,-0.1545
23,-0.1545
24,-0.1545
25,-0.1545
26,-0.1545
27,-0.1545
28,-0.1545
29,-0.1545
30,-0.1545
31,-0.1545
32,-0.1545
33,-0.1545
34,-0.1545
35,-0.1545
36,-0.1545
37,6.5439
38,7.0224
39,0.8024100000000001
40,-0.1545
41,-0.1545
42,-0.1545
43,-0.1545
44,-0.1545
45,-0.1545
46,-0.1545
47,-0.1545
48,-0.1545
49,-0.1545
50,-0.1545
51,-0.1545
52,-0.1545
53,-0.1545
54,-0.1545
55,-0.1545
56,-0.1545
57,-0.1545
58,-0.1545
59,-0.1545
60,-0.1545
61,-0.1545
62,-0.1545
63,-0.1545
64,-0.1545
65,-0.1545
66,-0.1545
67,-0.1545
68,-0.1545
69,-0.1545
70,-0.1545
71,-0.1545
72,-0.1545
73,-0.1545
74,-0.1545
75,-0.1545
76,-0.1545
77,-0.1545
78,-0.1545
79,-0.1545
80,-0.1545
81,-0.1545
82,-0.1545
83,-0.1545
84,-0.1545
85,-0.1545
86,-0.1545
87,-0.1545
88,-0.1545
89,-0.1545
90,-0.1545
91,-0.1545
92,-0.1545
93,-0.1545
94,-0.1545
95,-0.1545
