time,value
0,-0.14573
1,-0.14573
2,-0.14573
3,-0.14573
4,-0.14573
5,-0.14573
6,-0.14573
7,-0.14573
8,-0.14573
9,-0.14573
10,-0.14573
11,-0.14573
12,-0.14573
13,-0.14573
14,-0.14573
15,-0.14573
16,-0.14573
17,-0.14573
18,-0.14573
19,-0.14573
20,-0.14573
21,-0.14573
22,-0.14573
23,-0.14573
24,-0.14573
25,-0.14573
26,-0.14573
27,-0.14573
28,-0.14573
29,-0.14573
30,-0.14573
31,-0.14573
32,-0.14573
33,-0.14573
34,-0.14573
35,-0.14573
36,-0.14573
37,-0.14573
38,-0.14573
39,-0.14573
40,-0.14573
41,-0.14573
42,-0.14573
43,-0.14573
44,-0.14573
45,-0.14573
46,-0.14573
47,-0.14573
48,-0.14573
49,-0.14573
50,-0.14573
51,-0.14573
52,-0.14573
53,-0.14573
54,-0.14573
55,-0.14573
56,-0.14573
57,-0.14573
58,-0.14573
59,-0.14573
60,-0.14573
61,-0.14573
62,-0.14573
63,-0.14573
64,-0.14573
65,-0.14573
66,-0.14573
67,-0.14573
68,-0.14573
69,-0.14573
70,-0.14573
71,-0.14573
72,-0.14573
73,-0.14573
74,-0.14573
75,-0.14573
76,-0.14573
77,-0.14573
78,-0.14573
79,-0.14573
80,-0.14573
81,-0.14573
82,-0.14573
83,-0.14573
84,-0.14573
85,-0.14573
86,-0.14573
87,-0.14573
88,-0.14573
89,6.6693
90,6.9670000000000005
91,-0.083066
92,-0.14573
93,-0.14573
94,-0.14573
95,-0.14573
