time,value
0,-0.2993
1,-0.2993
2,-0.45805
3,-0.2993
4,-0.2993
5,-0.2993
6,-0.45805
7,-0.2993
8,-0.2993
9,-0.2993
10,-0.45805
11,-0.2993
12,-0.2993
13,-0.2993
14,-0.45805
15,-0.2993
16,-0.2993
17,-0.2993
18,-0.45805
19,-0.2993
20,-0.2993
21,-0.2993
22,-0.2993
23,-0.45805
24,-0.2993
25,-0.2993
26,-0.2993
27,-0.45805
28,-0.2993
29,-0.2993
30,-0.2993
31,-0.45805
32,-0.2993
33,-0.2993
34,-0.2993
35,-0.45805
36,-0.2993
37,-0.2993
38,-0.2993
39,-0.45805
40,-0.2993
41,-0.2993
42,-0.2993
43,-0.45805
44,-0.2993
45,-0.2993
46,-0.2993
47,-0.45805
48,-0.2993
49,-0.2993
50,-0.2993
51,-0.45805
52,-0.2993
53,-0.2993
54,-0.2993
55,-0.2993
56,-0.45805
57,-0.2993
58,-0.2993
59,-0.2993
60,-0.45805
61,-0.2993
62,-0.2993
63,-0.2993
64,-0.45805
65,-0.2993
66,-0.2993
67,-0.2993
68,-0.45805
69,-0.2993
70,-0.2993
71,-0.2993
72,-0.45805
73,-0.2993
74,-0.2993
75,-0.2993
76,-0.2993
77,-0.2993
78,0.33568000000000003
79,3.0344
80,3.1931
81,2.3994
82,2.7169
83,2.7169
84,3.0344
85,3.5106
86,3.3519
87,3.3519
88,0.97067
89,-0.45805
90,-0.2993
91,-0.2993
92,-0.2993
93,-0.45805
94,-0.2993
95,-0.2993
