time,value
0,-0.93022
1,-0.93022
2,-0.93022
3,-0.93022
4,1.5853
5,1.2709
6,1.1136
7,0.48476
8,-0.93022
9,-0.93022
10,-0.93022
11,-0.93022
12,-0.93022
13,-0.45856
14,1.5853
15,1.2709
16,1.1136
17,0.013102
18,-0.93022
19,-0.93022
20,-0.93022
21,-0.93022
22,-0.93022
23,-0.30134
24,1.5853
25,1.1136
26,1.1136
27,-0.14412
28,-0.93022
29,-0.93022
30,-0.93022
31,-0.93022
32,-0.93022
33,0.013102
34,1.5853
35,1.1136
36,1.1136
37,0.013102
38,-0.93022
39,-0.93022
40,-0.93022
41,-0.93022
42,-0.93022
43,-0.14412
44,1.5853
45,1.1136
46,1.1136
47,-0.30134
48,-0.93022
49,-0.93022
50,-0.93022
51,-0.93022
52,-0.45856
53,1.5853
54,1.2709
55,1.2709
56,1.1136
57,1.1136
58,1.1136
59,1.1136
60,1.1136
61,1.1136
62,0.013102
63,-0.93022
64,-0.93022
65,-0.93022
66,-0.93022
67,-0.93022
68,0.17032
69,1.5853
70,1.1136
71,1.1136
72,1.1136
73,1.1136
74,0.013102
75,-0.93022
76,-0.93022
77,-0.93022
78,-0.93022
79,-0.93022
80,0.7992
81,1.4281
82,1.1136
83,1.1136
84,-0.45856
85,-0.93022
86,-0.93022
87,-0.93022
88,-0.93022
89,-0.93022
90,0.32754
91,1.4281
92,1.1136
93,-0.14412
94,-0.93022
95,-0.93022
