time,value
0,-0.57047
1,-0.57047
2,-0.57047
3,-0.57047
4,-0.57047
5,-0.57047
6,-0.57047
7,-0.57047
8,-0.57047
9,-0.57047
10,-0.57047
11,-0.57047
12,-0.57047
13,-0.57047
14,-0.57047
15,-0.57047
16,-0.57047
17,-0.57047
18,-0.57047
19,-0.57047
20,-0.57047
21,-0.57047
22,-0.57047
23,-0.57047
24,-0.57047
25,-0.57047
26,-0.57047
27,-0.57047
28,-0.57047
29,-0.57047
30,-0.57047
31,-0.57047
32,-0.57047
33,-0.57047
34,-0.57047
35,-0.57047
36,0.71773
37,2.7789
38,2.3098
39,2.5608
40,0.5393600000000001
41,1.1603
42,1.2329999999999999
43,2.5741
44,2.323
45,1.4509999999999998
46,0.8234299999999999
47,0.010873
48,0.29494000000000004
49,0.14300000000000002
50,0.40724
51,0.08354
52,0.22888000000000003
53,0.26850999999999997
54,0.12978
55,0.24209
56,0.32136
57,0.12978
58,0.22888000000000003
59,0.18924000000000002
60,0.18263
61,0.34779
62,0.18924000000000002
63,0.15621
64,0.30815
65,3.1884
66,3.0035
67,3.0695
68,2.3693
69,1.2793
70,-0.44495
71,-0.57047
72,-0.57047
73,-0.57047
74,-0.57047
75,-0.57047
76,-0.57047
77,-0.57047
78,-0.57047
79,-0.57047
80,-0.57047
81,-0.57047
82,-0.57047
83,-0.57047
84,-0.57047
85,-0.57047
86,-0.57047
87,-0.57047
88,-0.57047
89,-0.57047
90,-0.57047
91,-0.57047
92,-0.57047
93,-0.57047
94,-0.57047
95,-0.57047
