time,value
0,-0.90749
1,-0.90749
2,-0.90749
3,-0.90749
4,-0.90749
5,-0.90749
6,-0.90749
7,0.8534299999999999
8,1.4095
9,1.2242
10,1.1315
11,1.1315
12,1.0388
13,-0.90749
14,-0.90749
15,-0.90749
16,-0.90749
17,-0.90749
18,-0.90749
19,-0.90749
20,0.48271000000000003
21,1.4095
22,1.3168
23,1.1315
24,1.0388
25,1.0388
26,-0.53677
27,-0.90749
28,-0.90749
29,-0.90749
30,-0.90749
31,-0.90749
32,-0.90749
33,0.57539
34,1.3168
35,1.3168
36,1.1315
37,1.0388
38,1.0388
39,-0.16605
40,-0.90749
41,-0.90749
42,-0.90749
43,-0.90749
44,-0.90749
45,-0.90749
46,-0.35141
47,1.4095
48,1.3168
49,1.2242
50,1.0388
51,1.0388
52,0.11199
53,-0.90749
54,-0.90749
55,-0.90749
56,-0.90749
57,-0.90749
58,-0.90749
59,-0.72213
60,1.5022
61,1.3168
62,1.2242
63,1.1315
64,1.0388
65,0.48271000000000003
66,-0.90749
67,-0.90749
68,-0.90749
69,-0.90749
70,-0.90749
71,-0.90749
72,-0.90749
73,1.3168
74,1.3168
75,1.3168
76,1.0388
77,1.1315
78,1.0388
79,0.019308000000000002
80,-0.90749
81,-0.90749
82,-0.90749
83,-0.90749
84,-0.90749
85,-0.90749
86,-0.53677
87,1.4095
88,1.4095
89,1.1315
90,1.1315
91,1.0388
92,0.11199
93,-0.90749
94,-0.90749
95,-0.90749
