time,value
0,-0.34314
1,-0.34314
2,-0.49494
3,-0.34314
4,-0.34314
5,-0.34314
6,-0.49494
7,-0.34314
8,-0.34314
9,-0.34314
10,-0.49494
11,-0.34314
12,-0.34314
13,-0.34314
14,-0.34314
15,-0.49494
16,-0.34314
17,-0.34314
18,-0.34314
19,-0.49494
20,-0.34314
21,-0.34314
22,-0.34314
23,-0.34314
24,-0.49494
25,-0.34314
26,-0.34314
27,-0.34314
28,-0.49494
29,-0.34314
30,-0.34314
31,-0.34314
32,-0.49494
33,-0.34314
34,-0.34314
35,-0.34314
36,-0.49494
37,-0.34314
38,-0.49494
39,-0.34314
40,-0.34314
41,-0.34314
42,-0.49494
43,-0.34314
44,-0.34314
45,-0.34314
46,-0.49494
47,-0.34314
48,-0.34314
49,-0.34314
50,-0.34314
51,-0.49494
52,-0.34314
53,-0.34314
54,-0.34314
55,-0.49494
56,-0.34314
57,-0.34314
58,-0.34314
59,-0.49494
60,-0.34314
61,-0.34314
62,-0.34314
63,-0.49494
64,-0.34314
65,-0.34314
66,-0.34314
67,-0.49494
68,-0.34314
69,-0.34314
70,-0.34314
71,-0.49494
72,-0.34314
73,-0.34314
74,-0.34314
75,-0.49494
76,-0.34314
77,-0.34314
78,1.3267
79,2.6929
80,2.8447
81,2.6929
82,2.5411
83,2.6929
84,2.5411
85,2.5411
86,2.6929
87,2.8447
88,2.8447
89,2.8447
90,0.41588
91,-0.34314
92,-0.49494
93,-0.34314
94,-0.34314
95,-0.34314
