time,value
0,-0.22805
1,-0.40181
2,-0.22805
3,-0.40181
4,-0.22805
5,-0.40181
6,-0.22805
7,-0.40181
8,-0.22805
9,-0.40181
10,-0.22805
11,-0.40181
12,-0.22805
13,-0.40181
14,-0.22805
15,-0.40181
16,-0.22805
17,-0.22805
18,-0.40181
19,-0.22805
20,-0.40181
21,-0.22805
22,-0.40181
23,-0.22805
24,-0.40181
25,-0.22805
26,-0.40181
27,-0.22805
28,-0.40181
29,-0.22805
30,-0.40181
31,-0.22805
32,-0.40181
33,-0.22805
34,-0.40181
35,-0.22805
36,-0.40181
37,-0.22805
38,-0.40181
39,-0.22805
40,-0.40181
41,-0.22805
42,-0.40181
43,-0.22805
44,-0.40181
45,-0.22805
46,-0.40181
47,-0.22805
48,-0.40181
49,-0.22805
50,-0.40181
51,-0.22805
52,-0.40181
53,-0.22805
54,-0.40181
55,-0.22805
56,-0.40181
57,-0.22805
58,-0.40181
59,-0.22805
60,-0.40181
61,-0.22805
62,-0.40181
63,-0.22805
64,-0.40181
65,-0.22805
66,-0.40181
67,-0.22805
68,-0.40181
69,-0.22805
70,-0.22805
71,-0.40181
72,-0.22805
73,-0.40181
74,-0.22805
75,-0.054299
76,3.5946
77,3.4208
78,3.5946
79,3.5946
80,2.8995
81,0.29320999999999997
82,0.29320999999999997
83,0.11946
84,3.5946
85,3.5946
86,1.162
87,-0.22805
88,-0.40181
89,-0.22805
90,-0.40181
91,-0.22805
92,-0.22805
93,-0.40181
94,-0.22805
95,-0.40181
