time,value
0,-1.3254
1,0.15145999999999998
2,-0.8716
3,-2.0605
4,-1.9958
5,-1.2475
6,-1.0118
7,-1.4233
8,-1.7726
9,-1.639
10,-1.3576
11,-1.3559
12,-1.5505
13,-1.6473
14,-1.5557
15,-1.4731
16,-1.5081
17,-1.5766
18,-1.5935
19,-1.5576
20,-1.5514
21,-1.5634
22,-1.5705
23,-1.5631
24,-1.5515
25,-1.5472
26,-1.5253
27,-1.524
28,-1.5057
29,-1.4958
30,-1.4837
31,-1.4662
32,-1.4613
33,-1.4416
34,-1.4423
35,-1.4317
36,-1.4267
37,-1.4236
38,-1.4124
39,-1.4183
40,-1.4095
41,-1.4169999999999998
42,-1.4154
43,-1.4157
44,-1.4221
45,-1.4175
46,-1.4332
47,-1.4340000000000002
48,-1.4473
49,-1.4554
50,-1.4616
51,-1.4768
52,-1.4758
53,-1.496
54,-1.4992
55,-1.5103
56,-1.5191
57,-1.5225
58,-1.5384
59,-1.5369
60,-1.5523
61,-1.5518
62,-1.5528
63,-1.5524
64,-1.5402
65,-1.5419
66,-1.5249
67,-1.5211
68,-1.5057
69,-1.4899
70,-1.4780000000000002
71,-1.4525
72,-1.4461
73,-1.4236
74,-1.4141
75,-1.3993
76,-1.3818
77,-1.3729
78,-1.3471
79,-1.3437
80,-1.3239
81,-1.3122
82,-1.2979
83,-1.2768
84,-1.2679
85,-1.2419
86,-1.2345
87,-1.2136
88,-1.1971
89,-1.1822
90,-1.1577
91,-1.1487
92,-1.1221
93,-1.1104
94,-1.0896
95,-1.0711
96,-1.0587
97,-1.0333
98,-1.0277
99,-1.0068
100,-0.99945
101,-0.9860200000000001
102,-0.96888
103,-0.9614
104,-0.9415399999999999
105,-0.9492
106,-0.9424
107,-0.9424
108,-0.9379700000000001
109,-0.9285899999999999
110,-0.93566
111,-0.92974
112,-0.9437
113,-0.9429799999999999
114,-0.9462
115,-0.9514
116,-0.94845
117,-0.9613200000000001
118,-0.95583
119,-0.9650299999999999
120,-0.9654
121,-0.9693
122,-0.9792200000000001
123,-0.9768399999999999
124,-0.9974799999999999
125,-1.0098
126,-1.0433
127,-1.0723
128,-1.0928
129,-1.114
130,-1.1173
131,-1.1478
132,-1.1654
133,-1.1904
134,-1.2078
135,-1.2162
136,-1.2363
137,-1.2393
138,-1.2593
139,-1.2633
140,-1.2716
141,-1.2823
142,-1.2853
143,-1.3048
144,-1.308
145,-1.328
146,-1.339
147,-1.3519999999999999
148,-1.3695
149,-1.3736
150,-1.3962
151,-1.4013
152,-1.4172
153,-1.4249
154,-1.4285
155,-1.4401
156,-1.4357
157,-1.454
158,-1.4545
159,-1.4614
160,-1.4642
161,-1.4609999999999999
162,-1.4712
163,-1.4652
164,-1.4773
165,-1.4745
166,-1.4751
167,-1.4763
168,-1.4667
169,-1.4711
170,-1.4563
171,-1.4558
172,-1.4456
173,-1.4365
174,-1.4312
175,-1.4104
176,-1.4078
177,-1.3892
178,-1.3835
179,-1.3692
180,-1.3471
181,-1.3304
182,-1.2988
183,-1.294
184,-1.2743
185,-1.2598
186,-1.2383
187,-1.2087
188,-1.1927
189,-1.1611
190,-1.1478
191,-1.1201
192,-1.0972
193,-1.0775
194,-1.0497
195,-1.0388
196,-1.0122
197,-1.0031
198,-0.98692
199,-0.9742700000000001
200,-0.96941
201,-0.9545
202,-0.96249
203,-0.95706
204,-0.966
205,-0.9701200000000001
206,-0.97216
207,-0.98331
208,-0.97795
209,-0.9950600000000001
210,-0.9949899999999999
211,-1.0025
212,-1.0066
213,-1.0036
214,-1.0126
215,-1.0046
216,-1.0158
217,-1.0127
218,-1.0138
219,-1.0162
220,-1.0098
221,-1.0198
222,-1.0115
223,-1.0181
224,-1.0155
225,-1.0157
226,-1.0203
227,-1.0083
228,-1.014
229,-1.005
230,-1.0115
231,-1.0099
232,-1.0012
233,-1.0026
234,-0.9974200000000001
235,-1.0239
236,-1.0287
237,-1.0272
238,-1.0143
239,-1.0017
240,-1.014
241,-1.0127
242,-1.0257
243,-1.0245
244,-1.0373
245,-1.0594
246,-1.0658
247,-1.0726
248,-1.051
249,-1.0466
250,-1.0384
251,-1.0324
252,-1.0277
253,-1.0074
254,-1.0097
255,-0.9977
256,-0.99808
257,-0.99054
258,-0.98013
259,-0.9797799999999999
260,-0.9616600000000001
261,-0.9644799999999999
262,-0.9485
263,-0.94142
264,-0.9325100000000001
265,-0.9159999999999999
266,-0.9102399999999999
267,-0.8853
268,-0.87997
269,-0.86106
270,-0.84635
271,-0.8322799999999999
272,-0.80718
273,-0.79874
274,-0.77246
275,-0.7618199999999999
276,-0.74041
277,-0.7196100000000001
278,-0.70492
279,-0.67675
280,-0.66902
281,-0.64291
282,-0.62843
283,-0.60738
284,-0.58328
285,-0.56834
286,-0.5344300000000001
287,-0.52273
288,-0.49256000000000005
289,-0.47101000000000004
290,-0.44727
291,-0.41607
292,-0.39732
293,-0.35965
294,-0.34237
295,-0.31169
296,-0.28686999999999996
297,-0.26553000000000004
298,-0.23592
299,-0.22745
300,-0.20435999999999999
301,-0.20075
302,-0.18786
303,-0.17604
304,-0.17107999999999998
305,-0.15225
306,-0.15432
307,-0.13499
308,-0.12514
309,-0.10744000000000001
310,-0.087176
311,-0.07715599999999999
312,-0.04414
313,-0.028006
314,0.014713999999999998
315,0.052631
316,0.0927
317,0.13848
318,0.16964
319,0.22105999999999998
320,0.25258
321,0.29895
322,0.33868000000000004
323,0.37396
324,0.41861000000000004
325,0.44473
326,0.49075
327,0.51957
328,0.55797
329,0.59346
330,0.62125
331,0.66327
332,0.6814600000000001
333,0.71434
334,0.7272
335,0.73988
336,0.7500100000000001
337,0.7450100000000001
338,0.75439
339,0.7344
340,0.7328
341,0.726
342,0.72948
343,0.74684
344,0.75134
345,0.77137
346,0.7642
347,0.77003
348,0.77157
349,0.77289
350,0.78392
351,0.77265
352,0.77774
353,0.7642
354,0.7635
355,0.76283
356,0.7573
357,0.76805
358,0.75815
359,0.7693
360,0.76653
361,0.7702
362,0.7752600000000001
363,0.7690899999999999
364,0.78066
365,0.76457
366,0.76583
367,0.7549
368,0.7450100000000001
369,0.74011
370,0.7194699999999999
371,0.7165699999999999
372,0.68993
373,0.6774
374,0.65793
375,0.63661
376,0.62573
377,0.59621
378,0.58555
379,0.55629
380,0.5384800000000001
381,0.51925
382,0.49487
383,0.4855
384,0.45468000000000003
385,0.44287
386,0.41707
387,0.40051
388,0.3889
389,0.36848000000000003
390,0.36488000000000004
391,0.33598
392,0.33093
393,0.32003000000000004
394,0.30917
395,0.29757
396,0.27325
397,0.27841
398,0.26608000000000004
399,0.25511999999999996
400,0.22219
401,0.19732
402,0.21206
403,0.21391
404,0.18427000000000002
405,0.06364299999999999
406,-0.072173
407,-0.16159
408,-0.18048
409,-0.14814000000000002
410,-0.15313
411,-0.16614
412,-0.19359
413,-0.19535
414,-0.18516
415,-0.19158
416,-0.18755
417,-0.20503000000000002
418,-0.19618
419,-0.19602999999999998
420,-0.19755
421,-0.19485
422,-0.20299
423,-0.19016
424,-0.19962
425,-0.19684000000000001
426,-0.20081
427,-0.20563
428,-0.20018
429,-0.21291
430,-0.20781
431,-0.22003000000000003
432,-0.22145
433,-0.22425
434,-0.23271999999999998
435,-0.22753
436,-0.24376
437,-0.24204
438,-0.25392
439,-0.25961
440,-0.26338
441,-0.27698
442,-0.27234
443,-0.29149
444,-0.29199
445,-0.30169
446,-0.30858
447,-0.30837
448,-0.32074
449,-0.31386
450,-0.32706
451,-0.32481
452,-0.3266
453,-0.32826
454,-0.31778
455,-0.32343
456,-0.30965
457,-0.31223
458,-0.3034
459,-0.29513
460,-0.29194000000000003
461,-0.27374
462,-0.27608
463,-0.25913
464,-0.2546
465,-0.24284
466,-0.22789
467,-0.22229000000000002
468,-0.19771
469,-0.19697
470,-0.17742
471,-0.16694
472,-0.15387
473,-0.13352
474,-0.12633
475,-0.10015
476,-0.094911
477,-0.075348
478,-0.061197
479,-0.049027
480,-0.026112
481,-0.020612000000000002
482,0.0039938000000000005
483,0.011138
484,0.027460000000000002
485,0.040794
486,0.047337
487,0.069408
488,0.071221
489,0.09175499999999999
490,0.097512
491,0.10837999999999999
492,0.12215999999999999
493,0.12699000000000002
494,0.15175999999999998
495,0.1522
496,0.17182999999999998
497,0.18255
498,0.19554000000000002
499,0.21489
500,0.21969
501,0.24431999999999998
502,0.24886999999999998
503,0.26905
504,0.28348
505,0.29516
506,0.3177
507,0.32222
508,0.34619
509,0.35249
510,0.37021
511,0.38777
512,0.39951
513,0.42563999999999996
514,0.42808
515,0.44928
516,0.45758000000000004
517,0.47402
518,0.49443000000000004
519,0.50444
520,0.53382
521,0.53772
522,0.5615600000000001
523,0.57623
524,0.59346
525,0.61831
526,0.62931
527,0.66118
528,0.6719
529,0.69838
530,0.71942
531,0.73847
532,0.76928
533,0.78158
534,0.81355
535,0.82655
536,0.84975
537,0.87093
538,0.88497
539,0.9136299999999999
540,0.9181799999999999
541,0.9412299999999999
542,0.9491200000000001
543,0.96352
544,0.98114
545,0.98814
546,1.015
547,1.0146
548,1.0336
549,1.0424
550,1.0539
551,1.0735
552,1.0777
553,1.1012
554,1.0993
555,1.1102
556,1.114
557,1.1162
558,1.1318
559,1.1268
560,1.1393
561,1.1315
562,1.1407
563,1.1607
564,1.1863
565,1.2355
566,1.2631
567,1.3129
568,1.3512
569,1.3994
570,1.4501
571,1.4853
572,1.5363
573,1.5559
574,1.5928
575,1.6154
576,1.6366
577,1.663
578,1.6729
579,1.7037
580,1.7102
581,1.7318
582,1.7463
583,1.7573
584,1.7794
585,1.7805
586,1.8023
587,1.8044
588,1.8179
589,1.8298
590,1.8349
591,1.8572
592,1.8561
593,1.8767
594,1.8824
595,1.8954
596,1.9113
597,1.9154
598,1.9397
599,1.9344
600,1.9489
601,1.9512
602,1.9549
603,1.9645
604,1.9566
605,1.9681
606,1.9537
607,1.9549
608,1.9492
609,1.9416
610,1.9468
611,1.9327
612,1.9408
613,1.9296
614,1.9317
615,1.9331
616,1.929
617,1.9423
618,1.9317
619,1.9431
620,1.9389
621,1.9421
622,1.9475
623,1.9411
624,1.9555
625,1.9406
626,1.9458
627,1.9386
628,1.9344
629,1.9402
630,1.9336
631,1.95
632,1.9380000000000002
633,1.9338
634,1.9139
635,1.8883
636,1.8773
637,1.8505
638,1.8473
639,1.8236
640,1.8138
641,1.8081
642,1.8033
643,1.8198
644,1.8133
645,1.8292
646,1.8319
647,1.8451
648,1.8616
649,1.8648
650,1.8863
651,1.8774
652,1.8888
653,1.8879
654,1.8882
655,1.8939
656,1.8825
657,1.891
658,1.8742
659,1.8730000000000002
660,1.864
661,1.8522
662,1.8516
663,1.8306
664,1.8306
665,1.8105
666,1.8025
667,1.7924
668,1.7761
669,1.776
670,1.7523
671,1.7506
672,1.7342
673,1.7261
674,1.7205
675,1.7038
676,1.7074
677,1.6828
678,1.6792
679,1.6642
680,1.651
681,1.6434
682,1.6203
683,1.6187
684,1.5928
685,1.5805
686,1.5589
687,1.5371
688,1.5307
689,1.5053
690,1.4957
691,1.4634
692,1.4495
693,1.4432
694,1.4289
695,1.4114
696,1.3497
697,1.3076
698,1.2712
699,1.2664
700,1.2713
701,1.2571
702,1.2534
703,1.2218
704,1.2156
705,1.1999
706,1.1837
707,1.1701
708,1.1402
709,1.1307
710,1.0974
711,1.0793
712,1.0549
713,1.0307
714,1.0201
715,0.99267
716,0.98759
717,0.96529
718,0.95693
719,0.94876
720,0.93695
721,0.9419200000000001
722,0.9238299999999999
723,0.9244600000000001
724,0.9084700000000001
725,0.8985799999999999
726,0.8902399999999999
727,0.8710200000000001
728,0.8702799999999999
729,0.84159
730,0.8315100000000001
731,0.8103199999999999
732,0.7925800000000001
733,0.78256
734,0.75921
735,0.75617
736,0.73088
737,0.72159
738,0.70652
739,0.69058
740,0.68607
741,0.66392
742,0.6623899999999999
743,0.6434
744,0.6366
745,0.62785
746,0.61282
747,0.6119100000000001
748,0.58818
749,0.5836
750,0.56405
751,0.55086
752,0.53889
753,0.51618
754,0.51203
755,0.48203999999999997
756,0.47123000000000004
757,0.44971000000000005
758,0.43059
759,0.41776
760,0.39142
761,0.385
762,0.35734
763,0.34534000000000004
764,0.3275
765,0.30896999999999997
766,0.30214
767,0.27874
768,0.27541
769,0.25443000000000005
770,0.24485
771,0.23365999999999998
772,0.2174
773,0.21609
774,0.19364
775,0.19072
776,0.17396
777,0.16379000000000002
778,0.15485
779,0.13552
780,0.1344
781,0.10808
782,0.099859
783,0.080734
784,0.064339
785,0.055259
786,0.033665
787,0.030737
788,0.0057217
789,-0.0047129
790,-0.020538999999999998
791,-0.037357999999999995
792,-0.044333
793,-0.0693
794,-0.074962
795,-0.096485
796,-0.10570999999999998
797,-0.11629
798,-0.13201
799,-0.13221
800,-0.15178
801,-0.15186
802,-0.16607
803,-0.17426
804,-0.18015
805,-0.19464
806,-0.19039
807,-0.21068
808,-0.21286999999999998
809,-0.22438000000000002
810,-0.23209000000000002
811,-0.23245
812,-0.24572
813,-0.24094000000000002
814,-0.25689
815,-0.25745
816,-0.2626
817,-0.26881
818,-0.26544
819,-0.27941
820,-0.27468000000000004
821,-0.28707
822,-0.29113
823,-0.30098
824,-0.31921
825,-0.3232
826,-0.34481
827,-0.34571999999999997
828,-0.35963
829,-0.36811
830,-0.37531
831,-0.3919
832,-0.39082
833,-0.41438
834,-0.42091000000000006
835,-0.43713
836,-0.44993999999999995
837,-0.45548999999999995
838,-0.47408
839,-0.47556000000000004
840,-0.49818
841,-0.5058600000000001
842,-0.51817
843,-0.5324800000000001
844,-0.53792
845,-0.5593
846,-0.5585399999999999
847,-0.57182
848,-0.57685
849,-0.58753
850,-0.60127
851,-0.58933
852,-0.58521
853,-0.5603199999999999
854,-0.55665
855,-0.55543
856,-0.55325
857,-0.5566300000000001
858,-0.5401600000000001
859,-0.54848
860,-0.53766
861,-0.53046
862,-0.51603
863,-0.49713999999999997
864,-0.49877
865,-0.48813999999999996
866,-0.49804
867,-0.49095
868,-0.48783000000000004
869,-0.48768
870,-0.47893
871,-0.48713
872,-0.47595
873,-0.48002
874,-0.4728
875,-0.46597
876,-0.46371
877,-0.44623
878,-0.44799999999999995
879,-0.43071000000000004
880,-0.42593000000000003
881,-0.41516000000000003
882,-0.40267
883,-0.40042
884,-0.38068
885,-0.38502
886,-0.37192
887,-0.36880999999999997
888,-0.36423
889,-0.3538
890,-0.35703
891,-0.34226999999999996
892,-0.34838
893,-0.34104
894,-0.33986
895,-0.34106
896,-0.3319
897,-0.33931
898,-0.32747
899,-0.33181
900,-0.3258
901,-0.32151
902,-0.32299999999999995
903,-0.30919
904,-0.31451
905,-0.29975
906,-0.29705
907,-0.28743
908,-0.27455
909,-0.27025
910,-0.24569000000000002
911,-0.24344000000000002
912,-0.22136
913,-0.20855
914,-0.19522
915,-0.17764000000000002
916,-0.17574
917,-0.15537
918,-0.15559
919,-0.14135999999999999
920,-0.1327
921,-0.12525
922,-0.10453
923,-0.098859
924,-0.073068
925,-0.064248
926,-0.044368
927,-0.024474
928,-0.010083
929,0.018626
930,0.026876
931,0.05806
932,0.08203099999999999
933,0.11617000000000001
934,0.15267
935,0.17712999999999998
936,0.22030999999999998
937,0.24086
938,0.28075
939,0.30839
940,0.33302
941,0.35902
942,0.36569
943,0.38495999999999997
944,0.37631
945,0.37743000000000004
946,0.37145
947,0.36391
948,0.36733000000000005
949,0.35218
950,0.35566
951,0.3425
952,0.34188
953,0.34160999999999997
954,0.33646
955,0.34714
956,0.33708
957,0.34707
958,0.34379
959,0.34709
960,0.3528
961,0.3482
962,0.36265
963,0.35129
964,0.35853
965,0.35569
966,0.35606
967,0.36465
968,0.3598
969,0.37427
970,0.36663
971,0.37615
972,0.38508000000000003
973,0.39871999999999996
974,0.42781
975,0.43788
976,0.46291000000000004
977,0.46553
978,0.47863
979,0.49313999999999997
980,0.50388
981,0.5287
982,0.52757
983,0.54304
984,0.54474
985,0.55534
986,0.5703199999999999
987,0.57531
988,0.59955
989,0.5990300000000001
990,0.61812
991,0.62693
992,0.63777
993,0.6552399999999999
994,0.65762
995,0.67695
996,0.6731699999999999
997,0.68596
998,0.69431
999,0.6975899999999999
1000,0.70523
1001,0.69363
1002,0.7073699999999999
1003,0.70622
1004,0.7069
1005,0.69315
1006,0.67678
1007,0.69407
1008,0.6966899999999999
1009,0.6896399999999999
1010,0.61949
1011,0.53168
1012,0.46917
1013,0.44273999999999997
1014,0.45993
1015,0.44293000000000005
1016,0.42603
1017,0.39541
1018,0.37756
1019,0.37145
1020,0.34684
1021,0.33516999999999997
1022,0.30289
1023,0.28935
1024,0.26854
1025,0.24175
1026,0.22228
1027,0.18606
1028,0.17
1029,0.13571
1030,0.11234000000000001
1031,0.087202
1032,0.056149
1033,0.037005
1034,-0.004830600000000001
1035,-0.025804
1036,-0.058453
1037,-0.0862
1038,-0.1183
1039,-0.16418
1040,-0.18880999999999998
1041,-0.22993000000000002
1042,-0.24615
1043,-0.27195
1044,-0.29691999999999996
1045,-0.31474
1046,-0.34134000000000003
1047,-0.34469
1048,-0.36703
1049,-0.37369
1050,-0.38424
1051,-0.39283
1052,-0.38841
1053,-0.40021
1054,-0.39342
1055,-0.4036
1056,-0.40185
1057,-0.40064
1058,-0.40445
1059,-0.39392
1060,-0.40348
1061,-0.39304
1062,-0.39521999999999996
1063,-0.3919
1064,-0.3876
1065,-0.39139
1066,-0.37244
1067,-0.37374
1068,-0.35856
1069,-0.3448
1070,-0.33893
1071,-0.37298000000000003
1072,-0.40743
1073,-0.36568
1074,-0.29814
1075,-0.30951
1076,-0.43888
1077,-0.48225
1078,-0.31085
1079,-0.14254
1080,-0.27878000000000003
1081,-0.60642
1082,-0.5719
1083,-0.082111
1084,0.17027
1085,-0.39373
1086,-1.1155
1087,-0.6684100000000001
1088,0.82729
1089,1.1774
1090,-1.7778
1091,-7.352
