time,value
0,-0.28452
1,-0.28452
2,-0.28452
3,-0.28452
4,-0.28452
5,-0.28452
6,-0.28452
7,-0.28452
8,-0.28452
9,-0.28452
10,-0.28452
11,-0.28452
12,-0.28452
13,-0.28452
14,-0.28452
15,-0.28452
16,-0.28452
17,-0.28452
18,-0.28452
19,-0.28452
20,-0.28452
21,-0.28452
22,-0.28452
23,-0.28452
24,-0.28452
25,-0.28452
26,-0.28452
27,-0.28452
28,-0.28452
29,-0.28452
30,-0.28452
31,-0.28452
32,-0.28452
33,-0.28452
34,-0.28452
35,-0.28452
36,-0.28452
37,-0.28452
38,-0.28452
39,-0.28452
40,-0.28452
41,-0.28452
42,-0.28452
43,-0.28452
44,-0.28452
45,-0.28452
46,-0.28452
47,-0.28452
48,-0.28452
49,-0.28452
50,-0.28452
51,-0.28452
52,-0.28452
53,-0.28452
54,-0.28452
55,-0.28452
56,-0.28452
57,-0.28452
58,-0.28452
59,-0.28452
60,-0.28452
61,-0.28452
62,-0.28452
63,-0.28452
64,-0.28452
65,-0.28452
66,-0.28452
67,-0.28452
68,-0.28452
69,-0.28452
70,-0.28452
71,-0.28452
72,2.3632
73,3.7568
74,3.8962
75,2.9207
76,-0.28452
77,-0.28452
78,-0.28452
79,-0.28452
80,-0.28452
81,-0.28452
82,-0.28452
83,-0.28452
84,-0.28452
85,-0.28452
86,-0.28452
87,-0.28452
88,-0.28452
89,-0.28452
90,-0.28452
91,-0.0058065
92,0.27291
93,3.7568
94,3.8962
95,3.8962
