time,value
0,-0.16721
1,-0.16721
2,-0.16721
3,-0.16721
4,-0.16721
5,-0.16721
6,-0.16721
7,-0.16721
8,-0.16721
9,-0.16721
10,-0.16721
11,-0.16721
12,-0.16721
13,-0.16721
14,-0.16721
15,-0.16721
16,-0.16721
17,-0.16721
18,-0.16721
19,-0.16721
20,-0.16721
21,-0.16721
22,-0.16721
23,-0.16721
24,-0.16721
25,-0.16721
26,-0.16721
27,-0.16721
28,-0.16721
29,-0.16721
30,6.9517
31,-0.16721
32,-0.16721
33,2.4151
34,-0.16721
35,-0.16721
36,-0.16721
37,-0.16721
38,-0.16721
39,-0.16721
40,-0.16721
41,-0.16721
42,-0.16721
43,-0.16721
44,-0.16721
45,-0.16721
46,-0.16721
47,-0.16721
48,-0.16721
49,-0.16721
50,-0.16721
51,-0.16721
52,-0.16721
53,-0.16721
54,-0.16721
55,-0.16721
56,-0.16721
57,-0.16721
58,-0.16721
59,-0.16721
60,-0.16721
61,-0.16721
62,-0.16721
63,-0.16721
64,-0.16721
65,-0.16721
66,-0.16721
67,-0.16721
68,-0.16721
69,-0.16721
70,6.1839
71,-0.16721
72,-0.16721
73,-0.16721
74,-0.16721
75,-0.16721
76,-0.16721
77,-0.16721
78,-0.16721
79,-0.16721
80,-0.16721
81,-0.16721
82,-0.16721
83,-0.16721
84,-0.16721
85,-0.16721
86,-0.16721
87,-0.16721
88,-0.16721
89,-0.16721
90,-0.16721
91,-0.16721
92,-0.16721
93,-0.16721
94,-0.16721
95,-0.16721
