time,value
0,-0.35462
1,-0.35462
2,-0.35462
3,-0.35462
4,-0.35462
5,-0.35462
6,-0.35462
7,-0.35462
8,-0.35462
9,-0.35462
10,-0.35462
11,-0.35462
12,-0.35462
13,-0.35462
14,-0.35462
15,-0.35462
16,-0.35462
17,-0.35462
18,-0.35462
19,-0.35462
20,-0.35462
21,-0.35462
22,-0.35462
23,-0.35462
24,2.5911
25,-0.35462
26,-0.35462
27,-0.35462
28,-0.35462
29,-0.35462
30,-0.35462
31,-0.35462
32,2.181
33,-0.35462
34,-0.35462
35,-0.35462
36,-0.35462
37,-0.35462
38,-0.35462
39,-0.35462
40,-0.35462
41,-0.35462
42,-0.35462
43,-0.35462
44,-0.35462
45,-0.35462
46,-0.35462
47,-0.35462
48,-0.35462
49,2.2555
50,-0.35462
51,-0.35462
52,-0.35462
53,-0.35462
54,-0.35462
55,-0.35462
56,2.6657
57,-0.35462
58,-0.35462
59,-0.35462
60,-0.35462
61,-0.35462
62,-0.35462
63,1.3979
64,-0.35462
65,4.3064
66,3.5233
67,4.1945
68,0.503
69,-0.35462
70,1.2488
71,-0.35462
72,-0.35462
73,-0.35462
74,2.2182
75,-0.35462
76,-0.35462
77,-0.35462
78,-0.35462
79,1.8454
80,0.503
81,-0.35462
82,-0.35462
83,-0.35462
84,-0.35462
85,-0.35462
86,-0.35462
87,-0.35462
88,-0.35462
89,-0.35462
90,-0.35462
91,-0.35462
92,-0.35462
93,-0.35462
94,-0.35462
95,-0.35462
