[<text>
<title>bowater 1986 pretax profits rise 15.6 mln stg</title>
<dateline>    london, april 8 -
    </dateline>shr 27.7p vs 20.7p
    div 6.0p vs 5.5p making 10.0p vs 9.25p
    turnover 1.34 billion stg vs 1.29 billion
    pretax profit 48.0 mln vs 32.4 mln
    tax 14.4 mln vs 6.9 mln
    company name is bowater industries plc &lt;bwtr.l&gt;
    trading profit 63.4 mln vs 45.1 mln
    trading profit includes -
    packaging and associated products 23.2 mln vs 14.2 mln
    merchanting and services 18.4 mln vs 9.6 mln
    tissue and timber products 9.0 mln vs 5.8 mln
    interest debit 15.4 mln vs 12.7 mln
    minority interests 7.0 mln debit vs 6.2 mln debit
    extraordinary items 15.4 mln credit vs 11.9 mln debit
 reuter
</text>]