time,value
0,-2.1973
1,-2.1973
2,-2.1997
3,-2.1997
4,-2.2021
5,-2.2094
6,-2.2167
7,-2.2167
8,-2.2167
9,-2.2166
10,-2.2165
11,-2.2162
12,-2.2159
13,-2.2179
14,-2.2175
15,-2.2169
16,-2.2162
17,-2.2154
18,-2.2145
19,-2.2183
20,-2.2251
21,-2.2292
22,-2.2279
23,-2.2266
24,-2.2252
25,-2.2237
26,-2.2221
27,-2.2204
28,-2.2186
29,-2.219
30,-2.217
31,-2.2149
32,-2.2128
33,-2.2105
34,-2.2082
35,-2.2057
36,-2.2041
37,-2.21
38,-2.2159
39,-2.2155
40,-2.2127
41,-2.2108
42,-2.2078
43,-2.2048
44,-2.2017
45,-2.2007
46,-2.1975
47,-2.1941
48,-2.1907
49,-2.1873
50,-2.1837
51,-2.1801
52,-2.1764
53,-2.1726
54,-2.1688
55,-2.1649
56,-2.161
57,-2.1616
58,-2.1663
59,-2.1696
60,-2.1654
61,-2.1611
62,-2.1568
63,-2.1524
64,-2.148
65,-2.1435
66,-2.1390000000000002
67,-2.1344
68,-2.1313
69,-2.1267
70,-2.1219
71,-2.1172
72,-2.1124
73,-2.1075
74,-2.1044
75,-2.0994
76,-2.0944
77,-2.0894
78,-2.0911
79,-2.0946
80,-2.0945
81,-2.0893
82,-2.084
83,-2.0787
84,-2.0734
85,-2.068
86,-2.0626
87,-2.0571
88,-2.0516
89,-2.0461
90,-2.0406
91,-2.035
92,-2.0309
93,-2.0253
94,-2.0196
95,-2.0158
96,-2.0101
97,-2.0043
98,-1.9985
99,-2.001
100,-2.0053
101,-2.0008
102,-1.9949
103,-1.989
104,-1.983
105,-1.9771
106,-1.9711
107,-1.965
108,-1.9603
109,-1.9543
110,-1.9482
111,-1.942
112,-1.9359
113,-1.9298
114,-1.9236
115,-1.9174
116,-1.9145
117,-1.9162
118,-1.9199
119,-1.9157
120,-1.9094
121,-1.9031
122,-1.8989
123,-1.8925
124,-1.8862
125,-1.8798
126,-1.8734
127,-1.8682
128,-1.8618
129,-1.8553
130,-1.8489
131,-1.8425
132,-1.8403
133,-1.8414
134,-1.8392
135,-1.8327
136,-1.8261
137,-1.8196
138,-1.8130000000000002
139,-1.8075
140,-1.8009
141,-1.7943
142,-1.7876
143,-1.781
144,-1.7744
145,-1.7677
146,-1.7611
147,-1.7617
148,-1.7624
149,-1.7611
150,-1.7543
151,-1.7476
152,-1.7409
153,-1.7341
154,-1.7274
155,-1.7215
156,-1.7148
157,-1.7080000000000002
158,-1.7012
159,-1.6944
160,-1.6877
161,-1.6809
162,-1.6780000000000002
163,-1.6782
164,-1.6753
165,-1.6685
166,-1.6616
167,-1.6548
168,-1.6479
169,-1.641
170,-1.6341
171,-1.6273
172,-1.6212
173,-1.6143
174,-1.6074
175,-1.6005
176,-1.5935
177,-1.5889
178,-1.5819999999999999
179,-1.5751
180,-1.5743
181,-1.5741
182,-1.5732
183,-1.5663
184,-1.5593
185,-1.5523
186,-1.5454
187,-1.5384
188,-1.5314
189,-1.5251
190,-1.5181
191,-1.5111
192,-1.5041
193,-1.4971
194,-1.4901
195,-1.4831
196,-1.4761
197,-1.4691
198,-1.4668
199,-1.4644
200,-1.4574
201,-1.4527
202,-1.4504
203,-1.4481
204,-1.4434
205,-1.4364
206,-1.4293
207,-1.4223
208,-1.4153
209,-1.4076
210,-1.4006
211,-1.3936
212,-1.3865
213,-1.3795
214,-1.3753
215,-1.3711
216,-1.3635
217,-1.3564
218,-1.3494
219,-1.3418
220,-1.3347
221,-1.3329
222,-1.3286
223,-1.3233
224,-1.3156
225,-1.3097
226,-1.3054
227,-1.2994
228,-1.2924
229,-1.2847
230,-1.2778
231,-1.2731
232,-1.2671
233,-1.2628
234,-1.2568
235,-1.2498
236,-1.2421
237,-1.2351
238,-1.2282
239,-1.2245
240,-1.2201
241,-1.2141
242,-1.2071
243,-1.1995
244,-1.1925
245,-1.1855
246,-1.1811
247,-1.1767
248,-1.1714
249,-1.1644
250,-1.1568
251,-1.1498
252,-1.1428
253,-1.1391
254,-1.1347
255,-1.1287
256,-1.1217
257,-1.1147
258,-1.1094
259,-1.1024
260,-1.0964
261,-1.0919
262,-1.0859
263,-1.0789
264,-1.072
265,-1.0643
266,-1.0574
267,-1.0536
268,-1.0492
269,-1.0431
270,-1.0361
271,-1.0292
272,-1.0215
273,-1.0146
274,-1.0108
275,-1.0063
276,-1.0026
277,-0.99564
278,-0.9887100000000001
279,-0.98105
280,-0.97411
281,-0.96803
282,-0.9635
283,-0.9574
284,-0.9504799999999999
285,-0.9458700000000001
286,-0.93821
287,-0.9312799999999999
288,-0.9259299999999999
289,-0.92369
290,-0.9191299999999999
291,-0.91222
292,-0.9053100000000001
293,-0.89765
294,-0.8907299999999999
295,-0.88382
296,-0.87926
297,-0.8769899999999999
298,-0.8716299999999999
299,-0.86472
300,-0.85706
301,-0.85015
302,-0.84325
303,-0.8394299999999999
304,-0.8348399999999999
305,-0.831
306,-0.82411
307,-0.81721
308,-0.8103100000000001
309,-0.80265
310,-0.79575
311,-0.78884
312,-0.7842399999999999
313,-0.77963
314,-0.7750600000000001
315,-0.77276
316,-0.7651
317,-0.7582
318,-0.7513
319,-0.74364
320,-0.73674
321,-0.73444
322,-0.72983
323,-0.72446
324,-0.7175699999999999
325,-0.71068
326,-0.70302
327,-0.69612
328,-0.68923
329,-0.68233
330,-0.67543
331,-0.67083
332,-0.66852
333,-0.66315
334,-0.6562600000000001
335,-0.6486
336,-0.6417
337,-0.63481
338,-0.63097
339,-0.62942
340,-0.62327
341,-0.61561
342,-0.6087199999999999
343,-0.6018399999999999
344,-0.59495
345,-0.58728
346,-0.58039
347,-0.5735
348,-0.5666
349,-0.55971
350,-0.55281
351,-0.5482100000000001
352,-0.54589
353,-0.5405300000000001
354,-0.53364
355,-0.52675
356,-0.51908
357,-0.5121899999999999
358,-0.50529
359,-0.4984
360,-0.49149
361,-0.4869
362,-0.48228999999999994
363,-0.47691999999999996
364,-0.47003
365,-0.46313999999999994
366,-0.45853999999999995
367,-0.45165
368,-0.44398000000000004
369,-0.43708
370,-0.43018
371,-0.42558999999999997
372,-0.42327
373,-0.41791000000000006
374,-0.41102
375,-0.40413000000000004
376,-0.39723
377,-0.39034
378,-0.38344
379,-0.37654
380,-0.36963
381,-0.36196999999999996
382,-0.35507
383,-0.34891
384,-0.342
385,-0.33509
386,-0.32816999999999996
387,-0.32126
388,-0.31434
389,-0.30741999999999997
390,-0.30049000000000003
391,-0.2943
392,-0.29199
393,-0.29199
394,-0.28736999999999996
395,-0.28044
396,-0.27351
397,-0.26657
398,-0.25963
399,-0.2566
400,-0.2566
401,-0.24966
402,-0.24272
403,-0.23506
404,-0.22810999999999998
405,-0.22116999999999998
406,-0.2167
407,-0.21450999999999998
408,-0.20915999999999998
409,-0.20223
410,-0.19457
411,-0.18763
412,-0.18069000000000002
413,-0.17837999999999998
414,-0.17607
415,-0.17072
416,-0.16305
417,-0.15539
418,-0.15236
419,-0.14932
420,-0.147
421,-0.13934000000000002
422,-0.1363
423,-0.1363
424,-0.13326
425,-0.1318
426,-0.1318
427,-0.12487000000000001
428,-0.11721
429,-0.10954000000000001
430,-0.10188
431,-0.094217
432,-0.088863
433,-0.08655399999999999
434,-0.084244
435,-0.07731
436,-0.075001
437,-0.072689
438,-0.069647
439,-0.06271399999999999
440,-0.055777
441,-0.048841
442,-0.041902999999999996
443,-0.037274
444,-0.03279
445,-0.030601999999999997
446,-0.022938999999999998
447,-0.018319
448,-0.012234
449,-0.010024
450,-0.0054892
451,0.0014298
452,0.0090928
453,0.016015
454,0.022938999999999998
455,0.030601999999999997
456,0.032829000000000004
457,0.037377999999999995
458,0.044293
459,0.051207
460,0.058126
461,0.065045
462,0.07270900000000001
463,0.07962999999999999
464,0.08655399999999999
465,0.09191
466,0.094137
467,0.098686
468,0.1056
469,0.11325999999999999
470,0.12018
471,0.1271
472,0.13402
473,0.13626
474,0.14081
475,0.14387
476,0.15078
477,0.15769
478,0.16535999999999998
479,0.17227
480,0.17762999999999998
481,0.17989000000000002
482,0.18675999999999998
483,0.19367
484,0.20058
485,0.20749
486,0.21515
487,0.22205999999999998
488,0.22896999999999998
489,0.23588
490,0.23894
491,0.2435
492,0.24578000000000003
493,0.25268
494,0.25958000000000003
495,0.26649
496,0.2734
497,0.28106
498,0.28798
499,0.29489
500,0.3018
501,0.30872
502,0.31333
503,0.31943
504,0.32399
505,0.3301
506,0.33701
507,0.34393
508,0.35159
509,0.3585
510,0.36537
511,0.36994
512,0.37224
513,0.37915
514,0.38605
515,0.39296
516,0.39988
517,0.40679
518,0.4137
519,0.42062
520,0.42449
521,0.42457
522,0.42541
523,0.43233999999999995
524,0.43854
525,0.44547
526,0.45241000000000003
527,0.45558000000000004
528,0.45343
529,0.45198999999999995
530,0.44986000000000004
531,0.44773999999999997
532,0.44564
533,0.44355
534,0.44148000000000004
535,0.43942
536,0.43738
537,0.43535
538,0.43333999999999995
539,0.43133999999999995
540,0.42936
541,0.42404
542,0.41638000000000003
543,0.41106000000000004
544,0.40676999999999996
545,0.40248
546,0.39483
547,0.38782
548,0.38355
549,0.37929
550,0.37631
551,0.3693
552,0.36165
553,0.35464
554,0.34762
555,0.34401
556,0.34039
557,0.3385
558,0.33148
559,0.32445999999999997
560,0.31681
561,0.30979
562,0.30277
563,0.3015
564,0.29728000000000004
565,0.29134
566,0.28431999999999996
567,0.27839
568,0.27418000000000003
569,0.26765
570,0.26061
571,0.2547
572,0.25051999999999996
573,0.24871
574,0.24166999999999997
575,0.23401999999999998
576,0.22987
577,0.22574
578,0.22045
579,0.2134
580,0.20635
581,0.19871
582,0.19166
583,0.18696
584,0.17991
585,0.17287
586,0.16992000000000002
587,0.16579000000000002
588,0.1646
589,0.15696
590,0.14991
591,0.14227
592,0.13522
593,0.12817
594,0.12699000000000002
595,0.12523
596,0.12349
597,0.11940999999999999
598,0.11771
599,0.11243
600,0.10536
601,0.098291
602,0.090655
603,0.083585
604,0.07651799999999999
605,0.069454
606,0.061814999999999995
607,0.057754999999999994
608,0.053711
609,0.048997000000000006
610,0.044281
611,0.037209
612,0.030137
613,0.022503
614,0.015431
615,0.0083608
616,0.0012938
617,-0.0027601999999999995
618,-0.0044372
619,-0.0097132
620,-0.016788
621,-0.024422
622,-0.031498000000000005
623,-0.038573
624,-0.042046
625,-0.046064
626,-0.051883000000000006
627,-0.058963999999999996
628,-0.06604600000000001
629,-0.073127
630,-0.080759
631,-0.087838
632,-0.094917
633,-0.10199
634,-0.10601
635,-0.10765
636,-0.10819000000000001
637,-0.10873
638,-0.10873
639,-0.11034000000000001
640,-0.11192
641,-0.11349000000000001
642,-0.11740999999999999
643,-0.12029000000000001
644,-0.12317
645,-0.12705999999999998
646,-0.12857000000000002
647,-0.12768
648,-0.12677
649,-0.12583
650,-0.1244
651,-0.12487000000000001
652,-0.12534
653,-0.12674000000000002
654,-0.1272
655,-0.12766
656,-0.12619
657,-0.12709
658,-0.12470999999999999
659,-0.11756
660,-0.11042
661,-0.10327
662,-0.096122
663,-0.089414
664,-0.08508500000000001
665,-0.07836699999999999
666,-0.075985
667,-0.075985
668,-0.06883099999999999
669,-0.061676
670,-0.054520000000000006
671,-0.052135
672,-0.052135
673,-0.044981
674,-0.038248000000000004
675,-0.037127999999999994
676,-0.035983999999999995
677,-0.031617
678,-0.024451
679,-0.017284
680,-0.010118
681,-0.0029492
682,0.0042198
683,0.011387999999999999
684,0.01856
685,0.025731
686,0.0329
687,0.040070999999999996
688,0.047245
689,0.052424
690,0.056018
691,0.05683200000000001
692,0.062018
693,0.069185
694,0.076351
695,0.083925
696,0.091093
697,0.09826
698,0.10543
699,0.1126
700,0.11382
701,0.11745
702,0.12264000000000001
703,0.1298
704,0.13696
705,0.14454
706,0.15170999999999998
707,0.1569
708,0.15816
709,0.1642
710,0.17135999999999998
711,0.17852
712,0.1861
713,0.19326
714,0.1965
715,0.20018
716,0.20343
717,0.21059
718,0.21535
719,0.2225
720,0.22966
721,0.23681
722,0.24395999999999998
723,0.25111999999999995
724,0.2587
725,0.26586
726,0.27302
727,0.28017
728,0.28733000000000003
729,0.29448
730,0.30164
731,0.3088
732,0.314
733,0.31528
734,0.31897
735,0.32611999999999997
736,0.33326999999999996
737,0.34043
738,0.34758
739,0.35473000000000005
740,0.36189
741,0.36946999999999997
742,0.37663
743,0.38378
744,0.39094
745,0.39571
746,0.40287
747,0.41002
748,0.41718
749,0.42433999999999994
750,0.4315
751,0.43866000000000005
752,0.44582
753,0.45059
754,0.45298
755,0.4534
756,0.46098
757,0.46856000000000003
758,0.47613999999999995
759,0.47657
760,0.47938000000000003
761,0.48458
762,0.49173999999999995
763,0.49412
764,0.49412
765,0.5012800000000001
766,0.50844
767,0.51559
768,0.52275
769,0.52991
770,0.5370699999999999
771,0.54423
772,0.5513899999999999
773,0.55616
774,0.56333
775,0.57091
776,0.57807
777,0.58523
778,0.59239
779,0.59955
780,0.60672
781,0.61388
782,0.6210399999999999
783,0.62821
784,0.63537
785,0.64254
786,0.6497
787,0.65687
788,0.66404
789,0.6712
790,0.67837
791,0.6855399999999999
792,0.69271
793,0.69987
794,0.70226
795,0.70465
796,0.70745
797,0.71502
798,0.7226
799,0.72778
800,0.73058
801,0.73338
802,0.74095
803,0.74334
804,0.74573
805,0.74812
806,0.7552800000000001
807,0.76245
808,0.76962
809,0.77678
810,0.78395
811,0.7915300000000001
812,0.79869
813,0.80586
814,0.81262
815,0.8198
816,0.82696
817,0.83414
818,0.84131
819,0.8484799999999999
820,0.85525
821,0.86203
822,0.86364
823,0.8684200000000001
824,0.8756
825,0.88277
826,0.88995
827,0.89474
828,0.90191
829,0.90909
830,0.9138799999999999
831,0.91665
832,0.9202100000000001
833,0.9273899999999999
834,0.9345600000000001
835,0.9417399999999999
836,0.9489200000000001
837,0.9561
838,0.9632700000000001
839,0.97045
840,0.9776299999999999
841,0.9848100000000001
842,0.9919899999999999
843,0.99916
844,1.0063
845,1.0135
846,1.0207
847,1.0279
848,1.0347
849,1.036
850,1.0372
851,1.0444
852,1.0516
853,1.0588
854,1.0636
855,1.0708
856,1.078
857,1.0852
858,1.0923
859,1.0995
860,1.1047
861,1.1082
862,1.1089
863,1.1161
864,1.1233
865,1.1305
866,1.1377
867,1.1448
868,1.1520000000000001
869,1.1592
870,1.1664
871,1.1681
872,1.1694
873,1.1762
874,1.1834
875,1.1903
876,1.1975
877,1.2023
878,1.2036
879,1.2026
880,1.2016
881,1.2009
882,1.1999
883,1.1989
884,1.1979
885,1.197
886,1.196
887,1.1951
888,1.1942
889,1.1867
890,1.1791
891,1.1761
892,1.1728
893,1.1698
894,1.1626
895,1.1554
896,1.1482
897,1.141
898,1.1338
899,1.1265
900,1.1193
901,1.1121
902,1.1046
903,1.0974
904,1.0905
905,1.0832
906,1.0757
907,1.0685
908,1.0637
909,1.0565
910,1.0493
911,1.0421
912,1.0348
913,1.0276
914,1.0204
915,1.0171
916,1.0162
917,1.0111
918,1.0039
919,0.9966799999999999
920,0.9894700000000001
921,0.98225
922,0.9747399999999999
923,0.96752
924,0.96031
925,0.95309
926,0.9458700000000001
927,0.94106
928,0.93866
929,0.93625
930,0.92904
931,0.9218200000000001
932,0.91671
933,0.91401
934,0.9137200000000001
935,0.90861
936,0.9011
937,0.89359
938,0.88608
939,0.8812700000000001
940,0.87887
941,0.87646
942,0.86924
943,0.8620200000000001
944,0.8548100000000001
945,0.8473
946,0.8400799999999999
947,0.83286
948,0.8256399999999999
949,0.82237
950,0.8191
951,0.81401
952,0.80678
953,0.79956
954,0.7923399999999999
955,0.78484
956,0.77762
957,0.7704
958,0.76318
959,0.7559600000000001
960,0.74874
961,0.74364
962,0.74307
963,0.73983
964,0.73233
965,0.72511
966,0.7178800000000001
967,0.7106600000000001
968,0.70344
969,0.69594
970,0.68871
971,0.6814899999999999
972,0.67427
973,0.66705
974,0.6643600000000001
975,0.66113
976,0.66032
977,0.65309
978,0.64586
979,0.63837
980,0.6311399999999999
981,0.62392
982,0.61669
983,0.60947
984,0.60411
985,0.60091
986,0.5979800000000001
987,0.59075
988,0.5835199999999999
989,0.57845
990,0.57122
991,0.56399
992,0.5632199999999999
993,0.56005
994,0.55498
995,0.54775
996,0.54052
997,0.5332899999999999
998,0.52605
999,0.51882
1000,0.51134
1001,0.5041100000000001
1002,0.49688000000000004
1003,0.48965
1004,0.48482
1005,0.48408
1006,0.48094
1007,0.47588
1008,0.46863999999999995
1009,0.4614
1010,0.45393
1011,0.44669
1012,0.43946
1013,0.43222
1014,0.42499
1015,0.42428
1016,0.42139
1017,0.41852
1018,0.41128000000000003
1019,0.40381999999999996
1020,0.40381999999999996
1021,0.4014
1022,0.39394
1023,0.38647
1024,0.37901
1025,0.37879
1026,0.37615
1027,0.3711
1028,0.36364
1029,0.36123
1030,0.35882
1031,0.35399
1032,0.34675
1033,0.33951
1034,0.33226999999999995
1035,0.32503000000000004
1036,0.31779
1037,0.31033
1038,0.30308
1039,0.29585
1040,0.2886
1041,0.28136
1042,0.27412
1043,0.2693
1044,0.26666
1045,0.2636
1046,0.26054
1047,0.25571
1048,0.24846999999999997
1049,0.24101999999999998
1050,0.23378000000000002
1051,0.22653
1052,0.22653
1053,0.22411999999999999
1054,0.21929
1055,0.21204
1056,0.2048
1057,0.20239000000000001
1058,0.19997
1059,0.19272999999999998
1060,0.18549000000000002
1061,0.17825
1062,0.171
1063,0.16376
1064,0.15652
1065,0.14928
1066,0.14686
1067,0.14686
1068,0.14665
1069,0.1436
1070,0.14057
1071,0.13776
1072,0.13476
1073,0.13215
1074,0.13196
1075,0.13159
1076,0.13105
1077,0.13294
1078,0.13502
1079,0.13743
1080,0.13952
1081,0.14146
1082,0.1413
1083,0.14372000000000001
1084,0.14340999999999998
1085,0.14297
1086,0.14752
1087,0.15478
1088,0.16204000000000002
1089,0.1693
1090,0.17642
1091,0.18367
1092,0.19094
1093,0.19805999999999999
1094,0.20008
1095,0.20213
1096,0.20939000000000002
1097,0.21665
1098,0.22149000000000002
1099,0.22863000000000003
1100,0.2359
1101,0.24316
1102,0.25042
1103,0.25526
1104,0.25768
1105,0.2601
1106,0.26736
1107,0.26979000000000003
1108,0.27221
1109,0.27221
1110,0.27947
1111,0.28673000000000004
1112,0.29399000000000003
1113,0.30125
1114,0.30851999999999996
1115,0.31578
1116,0.32316
1117,0.33042
1118,0.33768000000000004
1119,0.34494
1120,0.35220999999999997
1121,0.35946999999999996
1122,0.36673
1123,0.37399
1124,0.38126
1125,0.3861
1126,0.38852
1127,0.39105
1128,0.39359
1129,0.40097
1130,0.40836
1131,0.4109
1132,0.41331999999999997
1133,0.42058
1134,0.42541999999999996
1135,0.42783999999999994
1136,0.43013999999999997
1137,0.43728
1138,0.44454
1139,0.44938999999999996
1140,0.45181000000000004
1141,0.45677
1142,0.46415
1143,0.47153
1144,0.47891999999999996
1145,0.48376
1146,0.48618
1147,0.4886
1148,0.49586
1149,0.50312
1150,0.5103800000000001
1151,0.51764
1152,0.52248
1153,0.52975
1154,0.53701
1155,0.54427
1156,0.55153
1157,0.55879
1158,0.56605
1159,0.56812
1160,0.5677800000000001
1161,0.5725100000000001
1162,0.57977
1163,0.58704
1164,0.5943
1165,0.60156
1166,0.60883
1167,0.6160899999999999
1168,0.62335
1169,0.63062
1170,0.63788
1171,0.6451399999999999
1172,0.65241
1173,0.65967
1174,0.66694
1175,0.6742
1176,0.6814600000000001
1177,0.6887300000000001
1178,0.69599
1179,0.7008300000000001
1180,0.7081
1181,0.71536
1182,0.7226199999999999
1183,0.7298899999999999
1184,0.73715
1185,0.74442
1186,0.75168
1187,0.75652
1188,0.75894
1189,0.76137
1190,0.76863
1191,0.77589
1192,0.7783100000000001
1193,0.78074
1194,0.7879999999999999
1195,0.79527
1196,0.80253
1197,0.8096899999999999
1198,0.81696
1199,0.81696
1200,0.8193799999999999
1201,0.8266399999999999
1202,0.83139
1203,0.8337100000000001
1204,0.83604
1205,0.84321
1206,0.84796
1207,0.85514
1208,0.8574700000000001
1209,0.8574700000000001
1210,0.86474
1211,0.8720100000000001
1212,0.8792700000000001
1213,0.88654
1214,0.8938
1215,0.9009799999999999
1216,0.90825
1217,0.9155200000000001
1218,0.9227799999999999
1219,0.93005
1220,0.93732
1221,0.94458
1222,0.95185
1223,0.95185
1224,0.9542700000000001
1225,0.96145
1226,0.9662200000000001
1227,0.9685600000000001
1228,0.97098
1229,0.97825
1230,0.9855200000000001
1231,0.99036
1232,0.9928600000000001
1233,0.9928600000000001
1234,1.0001
1235,1.005
1236,1.005
1237,1.0073
1238,1.0145
1239,1.0217
1240,1.0289
1241,1.0312
1242,1.0312
1243,1.0361
1244,1.0434
1245,1.0506
1246,1.0579
1247,1.0652
1248,1.0724
1249,1.0797
1250,1.087
1251,1.0942
1252,1.1014
1253,1.1087
1254,1.1159999999999999
1255,1.1232
1256,1.1305
1257,1.1378
1258,1.145
1259,1.1523
1260,1.1572
1261,1.1644
1262,1.1717
1263,1.179
1264,1.1813
1265,1.1835
1266,1.1882
1267,1.1955
1268,1.2028
1269,1.21
1270,1.2173
1271,1.2245
1272,1.2318
1273,1.239
1274,1.2463
1275,1.2536
1276,1.2608
1277,1.2681
1278,1.2754
1279,1.2827
1280,1.2899
1281,1.2972
1282,1.3045
1283,1.3117
1284,1.319
1285,1.3214
1286,1.3214
1287,1.3263
1288,1.3335
1289,1.3359
1290,1.3358
1291,1.3382
1292,1.3454
1293,1.3526
1294,1.3574
1295,1.3599
1296,1.3599
1297,1.3671
1298,1.3744
1299,1.3816
1300,1.3889
1301,1.3962
1302,1.4034
1303,1.4107
1304,1.4131
1305,1.4154
1306,1.4153
1307,1.4152
1308,1.4152
1309,1.4175
1310,1.4175
1311,1.4174
1312,1.4174
1313,1.4174
1314,1.4174
1315,1.4174
1316,1.4174
1317,1.4151
1318,1.4151
1319,1.4152
1320,1.4153
1321,1.4080000000000001
1322,1.4007
1323,1.3935
1324,1.3862
1325,1.3789
1326,1.3717
1327,1.3644
1328,1.3571
1329,1.3499
1330,1.3426
1331,1.3353
1332,1.3281
1333,1.3208
1334,1.3135
1335,1.3063
1336,1.3014
1337,1.3015
1338,1.2992
1339,1.2919999999999998
1340,1.2847
1341,1.2824
1342,1.2801
1343,1.2802
1344,1.273
1345,1.2657
1346,1.2584
1347,1.2512
1348,1.2439
1349,1.2366
1350,1.2294
1351,1.2221
1352,1.2149
1353,1.2076
1354,1.2003
1355,1.1931
1356,1.1858
1357,1.1834
1358,1.1809
1359,1.1761
1360,1.1688
1361,1.1616
1362,1.1591
1363,1.1567
1364,1.1495
1365,1.1422
1366,1.1349
1367,1.1276
1368,1.1204
1369,1.1155
1370,1.1083
1371,1.101
1372,1.0937
1373,1.0865
1374,1.0792
1375,1.0719
1376,1.0647
1377,1.0574
1378,1.0502
1379,1.0504
1380,1.0456
1381,1.0384
1382,1.0312
1383,1.0239
1384,1.0166
1385,1.0094
1386,1.0022
1387,0.9949100000000001
1388,0.98764
1389,0.9803700000000001
1390,0.97311
1391,0.9658399999999999
1392,0.95857
1393,0.95373
1394,0.9513
1395,0.94653
1396,0.94176
1397,0.9345700000000001
1398,0.9322299999999999
1399,0.9298799999999999
1400,0.92512
1401,0.91794
1402,0.9155200000000001
1403,0.91309
1404,0.9106700000000001
1405,0.90341
1406,0.8961399999999999
1407,0.88887
1408,0.88169
1409,0.8744299999999999
1410,0.86716
1411,0.8599
1412,0.85765
1413,0.8552299999999999
1414,0.84796
1415,0.8407
1416,0.8334299999999999
1417,0.8261700000000001
1418,0.8189
1419,0.81406
1420,0.81406
1421,0.8114600000000001
1422,0.80419
1423,0.79935
1424,0.79208
1425,0.78482
1426,0.77755
1427,0.7702899999999999
1428,0.76302
1429,0.75575
1430,0.74849
1431,0.74122
1432,0.7339600000000001
1433,0.72669
1434,0.7219399999999999
1435,0.7198
1436,0.72
1437,0.71273
1438,0.7054699999999999
1439,0.69821
1440,0.69094
1441,0.6836800000000001
1442,0.6764100000000001
1443,0.66925
1444,0.66199
1445,0.65715
1446,0.65715
1447,0.6523
1448,0.64504
1449,0.64504
1450,0.64262
1451,0.6402
1452,0.63293
1453,0.62567
1454,0.61841
1455,0.61114
1456,0.6039899999999999
1457,0.59672
1458,0.58946
1459,0.58704
1460,0.58462
1461,0.5822
1462,0.57493
1463,0.56767
1464,0.56294
1465,0.5606300000000001
1466,0.5559
1467,0.54875
1468,0.54161
1469,0.53446
1470,0.52975
1471,0.52732
1472,0.52732
1473,0.5200600000000001
1474,0.5128
1475,0.50554
1476,0.49828
1477,0.49344
1478,0.48618
1479,0.47891999999999996
1480,0.47166
1481,0.46438999999999997
1482,0.45713000000000004
1483,0.44987
1484,0.44261000000000006
1485,0.43535
1486,0.42808999999999997
1487,0.42083000000000004
1488,0.41357
1489,0.40631
1490,0.39905
1491,0.39179
1492,0.38453000000000004
1493,0.37727
1494,0.37001
1495,0.36275
1496,0.35549000000000003
1497,0.34823000000000004
1498,0.34097
1499,0.33371
1500,0.32645
1501,0.31919000000000003
1502,0.31193000000000004
1503,0.30467
1504,0.29983000000000004
1505,0.29244000000000003
1506,0.28963
1507,0.28685
1508,0.27959
1509,0.27221
1510,0.26494
1511,0.25768
1512,0.25284
1513,0.25042
1514,0.24558000000000002
1515,0.23831999999999998
1516,0.23831999999999998
1517,0.2359
1518,0.23105
1519,0.22379000000000002
1520,0.21653000000000003
1521,0.20939000000000002
1522,0.20213
1523,0.19983
1524,0.20021
1525,0.20060999999999998
1526,0.20103
1527,0.20147
1528,0.20192000000000002
1529,0.20239000000000001
1530,0.20288
1531,0.20322
1532,0.20373
1533,0.20409000000000002
1534,0.21134
1535,0.21877
1536,0.22601999999999997
1537,0.23326999999999998
1538,0.24051999999999998
1539,0.24349
1540,0.24405
1541,0.25149
1542,0.25874
1543,0.26599
1544,0.27343
1545,0.28067
1546,0.28367
1547,0.28428000000000003
1548,0.29173000000000004
1549,0.29896999999999996
1550,0.30622
1551,0.31346
1552,0.32071
1553,0.32795
1554,0.3352
1555,0.34244
1556,0.34969
1557,0.35693
1558,0.36175999999999997
1559,0.36921
1560,0.37645
1561,0.3837
1562,0.39094
1563,0.39819
1564,0.40544
1565,0.41268
1566,0.41751000000000005
1567,0.41993
1568,0.42233999999999994
1569,0.42958999999999997
1570,0.43200000000000005
1571,0.43442
1572,0.43704
1573,0.44448000000000004
1574,0.45193
1575,0.45938
1576,0.46662
1577,0.47386999999999996
1578,0.47628000000000004
1579,0.4789
1580,0.47931
1581,0.48656000000000005
1582,0.4938
1583,0.5010399999999999
1584,0.5082899999999999
1585,0.51312
1586,0.52057
1587,0.52781
1588,0.5350600000000001
1589,0.5423
1590,0.54955
1591,0.5545800000000001
1592,0.55521
1593,0.5582699999999999
1594,0.5655100000000001
1595,0.57275
1596,0.57999
1597,0.58723
1598,0.59448
1599,0.60193
1600,0.60917
1601,0.61642
1602,0.62366
1603,0.6309
1604,0.6339600000000001
1605,0.6370399999999999
1606,0.6421
1607,0.64933
1608,0.65657
1609,0.66381
1610,0.67105
1611,0.67829
1612,0.68312
1613,0.69058
1614,0.69782
1615,0.70506
1616,0.7123
1617,0.71954
1618,0.72678
1619,0.73402
1620,0.74126
1621,0.7485
1622,0.75574
1623,0.76298
1624,0.77022
1625,0.77746
1626,0.7847
1627,0.79194
1628,0.79919
1629,0.80643
1630,0.80928
1631,0.8123600000000001
1632,0.8176399999999999
1633,0.82488
1634,0.83211
1635,0.83935
1636,0.84659
1637,0.85383
1638,0.8610700000000001
1639,0.8659
1640,0.87336
1641,0.8806
1642,0.88784
1643,0.8950799999999999
1644,0.9023200000000001
1645,0.9076
1646,0.9107
1647,0.91599
1648,0.92322
1649,0.9304600000000001
1650,0.9377
1651,0.9449299999999999
1652,0.9521700000000001
1653,0.95941
1654,0.96665
1655,0.97411
1656,0.98135
1657,0.98859
1658,0.9958299999999999
1659,1.0031
1660,1.0103
1661,1.0175
1662,1.0226
1663,1.0255
1664,1.0286
1665,1.0361
1666,1.0433
1667,1.0481
1668,1.0554
1669,1.0626
1670,1.0698
1671,1.0771
1672,1.0845
1673,1.0918
1674,1.0992
1675,1.1043
1676,1.1074
1677,1.1128
1678,1.12
1679,1.1272
1680,1.1345
1681,1.1417
1682,1.1489
1683,1.1562
1684,1.1636
1685,1.1709
1686,1.1781
1687,1.1853
1688,1.1926
1689,1.1998
1690,1.2027
1691,1.2059
1692,1.2088
1693,1.216
1694,1.2208
1695,1.2283
1696,1.2355
1697,1.2428
1698,1.2435
1699,1.2467
1700,1.2542
1701,1.2614
1702,1.2687
1703,1.2759
1704,1.2834
1705,1.2906
1706,1.2978
1707,1.3029
1708,1.3061
1709,1.3093
1710,1.3166
1711,1.3238
1712,1.331
1713,1.3385
1714,1.3457
1715,1.3530000000000002
1716,1.3602
1717,1.3631
1718,1.3664
1719,1.3672
1720,1.368
1721,1.3686
1722,1.3716
1723,1.3788
1724,1.386
1725,1.3887
1726,1.3887
1727,1.3914
1728,1.3947
1729,1.3980000000000001
1730,1.401
1731,1.4037
1732,1.4061
1733,1.4094
1734,1.41
1735,1.4103
1736,1.4106
1737,1.4116
1738,1.4125
1739,1.4111
1740,1.4121
1741,1.4131
1742,1.4141
1743,1.4151
1744,1.4161
1745,1.4113
1746,1.4041
1747,1.3973
1748,1.3925
1749,1.3853
1750,1.3836
1751,1.3822
1752,1.3805
1753,1.3734
1754,1.3662
1755,1.359
1756,1.3521
1757,1.345
1758,1.3378
1759,1.3306
1760,1.3282
1761,1.3258
1762,1.3238
1763,1.3169
1764,1.3101
1765,1.3057
1766,1.3037
1767,1.3017
1768,1.2949
1769,1.2925
1770,1.2901
1771,1.2853
1772,1.2781
1773,1.2709
1774,1.2637
1775,1.2590000000000001
1776,1.2518
1777,1.2446
1778,1.2374
1779,1.2302
1780,1.2231
1781,1.2159
1782,1.2087
1783,1.2015
1784,1.1944
1785,1.1872
1786,1.18
1787,1.1728
1788,1.1656
1789,1.1585
1790,1.1513
1791,1.1441
1792,1.1369
1793,1.1298
1794,1.1226
1795,1.1154
1796,1.1083
1797,1.1011
1798,1.0939
1799,1.0867
1800,1.0796
1801,1.0724
1802,1.0676
1803,1.0604
1804,1.0577
1805,1.0553
1806,1.0529
1807,1.0457
1808,1.0385
1809,1.0314
1810,1.0242
1811,1.0242
1812,1.0218
1813,1.0174
1814,1.0103
1815,1.0031
1816,0.99593
1817,0.9887600000000001
1818,0.98159
1819,0.9744299999999999
1820,0.9676799999999999
1821,0.9605100000000001
1822,0.95335
1823,0.9461799999999999
1824,0.9390200000000001
1825,0.9314399999999999
1826,0.9247
1827,0.91712
1828,0.9103700000000001
1829,0.9051799999999999
1830,0.89844
1831,0.89128
1832,0.8841200000000001
1833,0.8769600000000001
1834,0.8693799999999999
1835,0.8622200000000001
1836,0.85506
1837,0.8479
1838,0.84075
1839,0.8335899999999999
1840,0.82686
1841,0.81927
1842,0.81255
1843,0.80496
1844,0.79781
1845,0.79065
1846,0.7835
1847,0.7763399999999999
1848,0.7691899999999999
1849,0.7620399999999999
1850,0.75489
1851,0.74773
1852,0.74059
1853,0.73343
1854,0.73212
1855,0.72887
1856,0.72649
1857,0.71934
1858,0.71218
1859,0.70503
1860,0.6978800000000001
1861,0.69072
1862,0.68314
1863,0.67793
1864,0.67555
1865,0.67555
1866,0.6684
1867,0.6612399999999999
1868,0.65409
1869,0.65409
1870,0.65171
1871,0.6473800000000001
1872,0.64067
1873,0.63352
1874,0.62637
1875,0.6192300000000001
1876,0.6120800000000001
1877,0.6049399999999999
1878,0.60255
1879,0.6015199999999999
1880,0.59767
1881,0.59053
1882,0.58339
1883,0.57863
1884,0.5714899999999999
1885,0.56435
1886,0.5572199999999999
1887,0.55008
1888,0.54294
1889,0.53581
1890,0.52867
1891,0.52154
1892,0.5144
1893,0.50727
1894,0.5001399999999999
1895,0.493
1896,0.48586999999999997
1897,0.47873999999999994
1898,0.47161000000000003
1899,0.46448
1900,0.45735
1901,0.45022
1902,0.4431
1903,0.43596999999999997
1904,0.42883999999999994
1905,0.42172
1906,0.41458999999999996
1907,0.40747
1908,0.40035
1909,0.39321999999999996
1910,0.38847
1911,0.38135
1912,0.37423
1913,0.36711
1914,0.35999000000000003
1915,0.35286999999999996
1916,0.3514
1917,0.34757
1918,0.33997
1919,0.33284
1920,0.32572
1921,0.31859
1922,0.31146999999999997
1923,0.30434
1924,0.29722
1925,0.28961
1926,0.28249
1927,0.27537
1928,0.26825
1929,0.26113000000000003
1930,0.25401
1931,0.2469
1932,0.23928000000000002
1933,0.23454
1934,0.23215999999999998
1935,0.22741999999999998
1936,0.2203
1937,0.21506
1938,0.20745
1939,0.19984000000000002
1940,0.19984000000000002
1941,0.19746
1942,0.19035
1943,0.18323
1944,0.17662
1945,0.17475
1946,0.17288
1947,0.16577
1948,0.16391
1949,0.16154000000000002
1950,0.1568
1951,0.14969000000000002
1952,0.14257999999999998
1953,0.13548
1954,0.12889
1955,0.12178
1956,0.11467999999999999
1957,0.10758
1958,0.10048
1959,0.09337899999999999
1960,0.088646
1961,0.090228
1962,0.089462
1963,0.082371
1964,0.075282
1965,0.07109700000000001
1966,0.064013
1967,0.056927
1968,0.049843
1969,0.042759
1970,0.035677
1971,0.028595
1972,0.021514
1973,0.01499
1974,0.0079128
1975,0.00083577
1976,-0.0062382
1977,-0.013312000000000001
1978,-0.020387
1979,-0.027458
1980,-0.034527999999999996
1981,-0.038675
1982,-0.039317000000000005
1983,-0.039937
1984,-0.046994
1985,-0.054051999999999996
1986,-0.060520000000000004
1987,-0.06757300000000001
1988,-0.07168300000000001
1989,-0.072245
1990,-0.072786
1991,-0.079824
1992,-0.084516
1993,-0.091554
1994,-0.097976
1995,-0.10500999999999999
1996,-0.11204000000000001
1997,-0.11907000000000001
1998,-0.12251
1999,-0.12297000000000001
2000,-0.12405
2001,-0.13105999999999998
2002,-0.13808
2003,-0.14509
2004,-0.15145999999999998
2005,-0.15846
2006,-0.16547
2007,-0.17248
2008,-0.17285
2009,-0.1732
2010,-0.1772
2011,-0.18352000000000002
2012,-0.1875
2013,-0.18547
2014,-0.18342
2015,-0.18342
2016,-0.18273
2017,-0.18135
2018,-0.17926
2019,-0.17926
2020,-0.17926
2021,-0.17694000000000001
2022,-0.16998
2023,-0.16232
2024,-0.15535
2025,-0.14839000000000002
2026,-0.14235
2027,-0.13794
2028,-0.13421
2029,-0.12655
2030,-0.11959000000000002
2031,-0.11747
2032,-0.11302000000000001
2033,-0.10767
2034,-0.10072
2035,-0.093776
2036,-0.086825
2037,-0.079164
2038,-0.072211
2039,-0.06525800000000001
2040,-0.057597
2041,-0.05315
2042,-0.048691000000000005
2043,-0.041745
2044,-0.034797
2045,-0.027849000000000002
2046,-0.023215
2047,-0.015553999999999998
2048,-0.008603200000000002
2049,-0.0016501999999999999
2050,0.0036938
2051,0.0081428
2052,0.010293
2053,0.017956
2054,0.0249
2055,0.029373000000000003
2056,0.033862
2057,0.039213
2058,0.046149
2059,0.053085
2060,0.060024
2061,0.067687
2062,0.074626
2063,0.081569
2064,0.08851200000000001
2065,0.092986
2066,0.095165
2067,0.10282999999999999
2068,0.10976
2069,0.1167
2070,0.12435999999999998
2071,0.1313
2072,0.13824
2073,0.14287
2074,0.15053
2075,0.15500999999999998
2076,0.1572
2077,0.16413
2078,0.17107
2079,0.17800000000000002
2080,0.18566
2081,0.1926
2082,0.19709000000000002
2083,0.19929000000000002
2084,0.20695999999999998
2085,0.21388000000000001
2086,0.22080999999999998
2087,0.22775
2088,0.23540999999999998
2089,0.24234
2090,0.24928000000000003
2091,0.25621
2092,0.26315
2093,0.27009
2094,0.27385
2095,0.27835
2096,0.28212
2097,0.28905
2098,0.29598
2099,0.30291999999999997
2100,0.30827
2101,0.3152
2102,0.32214
2103,0.32908000000000004
2104,0.33443
2105,0.33660999999999996
2106,0.34110999999999997
2107,0.34804
2108,0.35497
2109,0.36191
2110,0.36884
2111,0.37651
2112,0.38344
2113,0.39038
2114,0.39573
2115,0.39791
2116,0.40242
2117,0.40935
2118,0.41701000000000005
2119,0.42078999999999994
2120,0.42531
2121,0.4291
2122,0.43601999999999996
2123,0.44293999999999994
2124,0.44987
2125,0.45679
2126,0.46446000000000004
2127,0.46908
2128,0.47601000000000004
2129,0.48208999999999996
2130,0.48662
2131,0.49041
2132,0.49806999999999996
2133,0.5049899999999999
2134,0.5072300000000001
2135,0.51178
2136,0.51483
2137,0.52175
2138,0.52941
2139,0.53632
2140,0.54324
2141,0.5486
2142,0.55085
2143,0.55311
2144,0.55769
2145,0.55999
2146,0.56612
2147,0.57302
2148,0.58068
2149,0.58758
2150,0.59448
2151,0.5983
2152,0.6006100000000001
2153,0.60293
2154,0.60678
2155,0.6091300000000001
2156,0.6129899999999999
2157,0.62065
2158,0.62753
2159,0.63218
2160,0.63456
2161,0.64222
2162,0.64988
2163,0.65376
2164,0.65615
2165,0.65856
2166,0.66098
2167,0.66342
2168,0.66587
2169,0.67061
2170,0.67308
2171,0.67557
2172,0.67807
2173,0.6783100000000001
2174,0.68084
2175,0.6833899999999999
2176,0.68594
2177,0.68852
2178,0.6911
2179,0.69057
2180,0.68465
2181,0.68013
2182,0.67961
2183,0.67998
2184,0.67723
2185,0.67135
2186,0.66862
2187,0.66905
2188,0.66635
2189,0.6605
2190,0.65782
2191,0.6583100000000001
2192,0.65698
2193,0.65025
2194,0.64352
2195,0.63679
2196,0.63007
2197,0.62334
2198,0.61663
2199,0.6099100000000001
2200,0.60319
2201,0.60041
2202,0.5954
2203,0.58868
2204,0.58195
2205,0.57524
2206,0.56852
2207,0.56088
2208,0.5564
2209,0.54969
2210,0.54298
2211,0.53627
2212,0.52957
2213,0.52322
2214,0.51818
2215,0.51408
2216,0.50737
2217,0.50066
2218,0.49395
2219,0.48725
2220,0.48053999999999997
2221,0.47384
2222,0.4662
2223,0.4595
2224,0.45281000000000005
2225,0.44611999999999996
2226,0.43943000000000004
2227,0.43273999999999996
2228,0.42605
2229,0.41936999999999997
2230,0.41173999999999994
2231,0.4076
2232,0.40251
2233,0.39487
2234,0.38819000000000004
2235,0.38373
2236,0.37705
2237,0.37037
2238,0.36369
2239,0.35702
2240,0.35035
2241,0.34271
2242,0.33604
2243,0.32938
2244,0.32271
2245,0.31605
2246,0.3094
2247,0.30274
2248,0.29609
2249,0.29094000000000003
2250,0.28802
2251,0.28039000000000003
2252,0.27373000000000003
2253,0.26707
2254,0.26042
2255,0.25376
2256,0.24711999999999998
2257,0.24047
2258,0.23284000000000002
2259,0.2262
2260,0.21955999999999998
2261,0.21291999999999997
2262,0.20629
2263,0.20187
2264,0.19767
2265,0.19249000000000002
2266,0.18609
2267,0.17945
2268,0.17182
2269,0.16519
2270,0.15855
2271,0.15337
2272,0.14819000000000002
2273,0.14278
2274,0.13614
2275,0.1295
2276,0.12286
2277,0.11524000000000001
2278,0.1086
2279,0.10198
2280,0.095349
2281,0.088726
2282,0.082107
2283,0.07569
2284,0.07048099999999999
2285,0.06628099999999999
2286,0.059653
2287,0.053027
2288,0.046406
2289,0.038784
2290,0.034371
2291,0.027754
2292,0.021143000000000002
2293,0.014532
2294,0.0079278
2295,0.0013228
2296,-0.0039192
2297,-0.0091492
2298,-0.014565
2299,-0.021177
2300,-0.027786
2301,-0.03439
2302,-0.040991
2303,-0.047591
2304,-0.055205
2305,-0.0618
2306,-0.068389
2307,-0.074977
2308,-0.08039299999999999
2309,-0.083469
2310,-0.088725
2311,-0.095322
2312,-0.10192000000000001
2313,-0.10851
2314,-0.11509000000000001
2315,-0.12168
2316,-0.12929000000000002
2317,-0.13367
2318,-0.14025
2319,-0.14682
2320,-0.15339
2321,-0.15985
2322,-0.16515
2323,-0.1716
2324,-0.17818
2325,-0.18475
2326,-0.19132000000000002
2327,-0.19788
2328,-0.20445
2329,-0.21100000000000002
2330,-0.21756
2331,-0.22411
2332,-0.23065
2333,-0.2372
2334,-0.2448
2335,-0.25133
2336,-0.25787
2337,-0.26439
2338,-0.27092
2339,-0.27744
2340,-0.28396
2341,-0.29047
2342,-0.29698
2343,-0.30456
2344,-0.30673
2345,-0.31215
2346,-0.31537
2347,-0.32189
2348,-0.3284
2349,-0.33491
2350,-0.34141
2351,-0.349
2352,-0.3555
2353,-0.36199000000000003
2354,-0.3685
2355,-0.37393000000000004
2356,-0.37826
2357,-0.38477
2358,-0.39127
2359,-0.39776
2360,-0.40535
2361,-0.41183000000000003
2362,-0.41831999999999997
2363,-0.4248
2364,-0.42916000000000004
2365,-0.4346
2366,-0.43895
2367,-0.44543999999999995
2368,-0.45193
2369,-0.45841000000000004
2370,-0.46598999999999996
2371,-0.47031000000000006
2372,-0.47678000000000004
2373,-0.48325
2374,-0.48867
2375,-0.49198000000000003
2376,-0.49743999999999994
2377,-0.50392
2378,-0.5104
2379,-0.5168699999999999
2380,-0.5233300000000001
2381,-0.53091
2382,-0.53737
2383,-0.54382
2384,-0.54924
2385,-0.5525800000000001
2386,-0.55806
2387,-0.56453
2388,-0.57099
2389,-0.5785600000000001
2390,-0.58502
2391,-0.59259
2392,-0.59809
2393,-0.6035699999999999
2394,-0.6100399999999999
2395,-0.61649
2396,-0.6240600000000001
2397,-0.63052
2398,-0.63593
2399,-0.6392800000000001
2400,-0.64477
2401,-0.65123
2402,-0.65769
2403,-0.66415
2404,-0.6705899999999999
2405,-0.67816
2406,-0.6846
2407,-0.69104
2408,-0.6964600000000001
2409,-0.6998300000000001
2410,-0.70534
2411,-0.7096399999999999
2412,-0.71609
2413,-0.72365
2414,-0.73009
2415,-0.73653
2416,-0.74093
2417,-0.74645
2418,-0.7529899999999999
2419,-0.75944
2420,-0.7658699999999999
2421,-0.77231
2422,-0.77987
2423,-0.7862899999999999
2424,-0.79271
2425,-0.79699
2426,-0.8014100000000001
2427,-0.80696
2428,-0.8113600000000001
2429,-0.81779
2430,-0.82535
2431,-0.8317700000000001
2432,-0.83819
2433,-0.84147
2434,-0.8470200000000001
2435,-0.8547100000000001
2436,-0.86113
2437,-0.86869
2438,-0.8720899999999999
2439,-0.87761
2440,-0.88303
2441,-0.8894700000000001
2442,-0.89591
2443,-0.9034700000000001
2444,-0.90989
2445,-0.9163100000000001
2446,-0.9227299999999999
2447,-0.9291299999999999
2448,-0.9325700000000001
2449,-0.9381200000000001
2450,-0.94353
2451,-0.95109
2452,-0.9532299999999999
2453,-0.95878
2454,-0.96431
2455,-0.96972
2456,-0.97729
2457,-0.9827100000000001
2458,-0.9882200000000001
2459,-0.9915700000000001
2460,-0.9991399999999999
2461,-1.0056
2462,-1.0111
2463,-1.0166
2464,-1.0198
2465,-1.0274
2466,-1.035
2467,-1.0372
2468,-1.0426
2469,-1.0459
2470,-1.0535
2471,-1.06
2472,-1.0632
2473,-1.0687
2474,-1.0741
2475,-1.0806
2476,-1.0882
2477,-1.0947
2478,-1.1012
2479,-1.1023
2480,-1.1077
2481,-1.1131
2482,-1.1196
2483,-1.1272
2484,-1.1348
2485,-1.138
2486,-1.1456
2487,-1.1521
2488,-1.1586
2489,-1.1651
2490,-1.1716
2491,-1.1781
2492,-1.1857
2493,-1.1922
2494,-1.1987
2495,-1.2051
2496,-1.2095
2497,-1.215
2498,-1.2193
2499,-1.2258
2500,-1.2323
2501,-1.2387
2502,-1.2452
2503,-1.2517
2504,-1.2581
2505,-1.2657
2506,-1.27
2507,-1.2764
2508,-1.2828
2509,-1.2893
2510,-1.2957
2511,-1.3021
2512,-1.3085
2513,-1.3148
2514,-1.3212
2515,-1.3276
2516,-1.3339
2517,-1.3403
2518,-1.3466
2519,-1.3542
2520,-1.3565
2521,-1.3622
2522,-1.3676
2523,-1.374
2524,-1.3803
2525,-1.3866
2526,-1.393
2527,-1.4005
2528,-1.4068
2529,-1.4131
2530,-1.4194
2531,-1.4257
2532,-1.4319
2533,-1.4361
2534,-1.4424
2535,-1.449
2536,-1.4527
2537,-1.4593
2538,-1.4656
2539,-1.4719
2540,-1.4781
2541,-1.4844
2542,-1.4906
2543,-1.4968
2544,-1.5030000000000001
2545,-1.5105
2546,-1.5167
2547,-1.5228
2548,-1.5290000000000001
2549,-1.5352
2550,-1.5413
2551,-1.5474
2552,-1.5535
2553,-1.5596
2554,-1.5657
2555,-1.5718
2556,-1.5779
2557,-1.5839
2558,-1.59
2559,-1.5959999999999999
2560,-1.6019999999999999
2561,-1.6059999999999999
2562,-1.6119999999999999
2563,-1.6179
2564,-1.6227
2565,-1.6288
2566,-1.6336
2567,-1.6395
2568,-1.6455
2569,-1.6515
2570,-1.6574
2571,-1.6633
2572,-1.6692
2573,-1.6751
2574,-1.681
2575,-1.6869
2576,-1.6927
2577,-1.6985
2578,-1.7043
2579,-1.7101
2580,-1.7159
2581,-1.7231
2582,-1.7289
2583,-1.7346
2584,-1.7403
2585,-1.7459
2586,-1.7516
2587,-1.7572
2588,-1.761
2589,-1.7666
2590,-1.7722
2591,-1.7777
2592,-1.7832
2593,-1.7888
2594,-1.7942
2595,-1.8013
2596,-1.8061
2597,-1.8127
2598,-1.8182
2599,-1.8236
2600,-1.8291
2601,-1.8345
2602,-1.8399
2603,-1.8453
2604,-1.8506
2605,-1.8559
2606,-1.8612
2607,-1.8665
2608,-1.8734
2609,-1.8769
2610,-1.8821
2611,-1.8872
2612,-1.8923
2613,-1.8974
2614,-1.9025
2615,-1.9058
2616,-1.9126
2617,-1.9158
2618,-1.9207
2619,-1.9256
2620,-1.9322
2621,-1.9371
2622,-1.9419
2623,-1.9466
2624,-1.9513
2625,-1.956
2626,-1.9607
2627,-1.9653
2628,-1.9698
2629,-1.9743
2630,-1.9788
2631,-1.9833
2632,-1.9881
2633,-1.9939
2634,-2.0011
2635,-2.0056
2636,-2.01
2637,-2.0143
2638,-2.0186
2639,-2.0228
2640,-2.0269999999999997
2641,-2.0312
2642,-2.0339
2643,-2.0380000000000003
2644,-2.042
2645,-2.0459
2646,-2.0499
2647,-2.0537
2648,-2.0575
2649,-2.0633
2650,-2.0669999999999997
2651,-2.0707
2652,-2.0743
2653,-2.0778
2654,-2.0812
2655,-2.0846
2656,-2.088
2657,-2.0913
2658,-2.0945
2659,-2.0976
2660,-2.1007
2661,-2.1049
2662,-2.1126
2663,-2.1202
2664,-2.1232
2665,-2.1261
2666,-2.129
2667,-2.1317
2668,-2.1345
2669,-2.1362
2670,-2.1388
2671,-2.1413
2672,-2.1438
2673,-2.1484
2674,-2.1507
2675,-2.1506
2676,-2.1527
2677,-2.1548
2678,-2.1567
2679,-2.1586
2680,-2.1604
2681,-2.1645
2682,-2.1661
2683,-2.1677
2684,-2.1691
2685,-2.1705
2686,-2.1718
2687,-2.173
2688,-2.1741
2689,-2.1751
2690,-2.176
2691,-2.1769
2692,-2.1776
2693,-2.1783
2694,-2.1788
2695,-2.1793
2696,-2.1796
2697,-2.1799
2698,-2.1801
2699,-2.1803
2700,-2.1803
2701,-2.1803
2702,-2.1803
2703,-2.1803
2704,-2.1852
2705,-2.1876
2706,-2.1924
2707,-2.1949
2708,-2.1973
