time,value
0,-0.97809
1,0.6945100000000001
2,0.019563
3,-1.3398
4,-1.896
5,-1.4080000000000001
6,-0.69885
7,-0.5523399999999999
8,-0.94862
9,-1.345
10,-1.3414
11,-1.0483
12,-0.86395
13,-0.94655
14,-1.1389
15,-1.2269
16,-1.1487
17,-1.0434
18,-1.038
19,-1.1019
20,-1.1608
21,-1.162
22,-1.1248
23,-1.1175
24,-1.1329
25,-1.1461
26,-1.1555
27,-1.1497
28,-1.1534
29,-1.1568
30,-1.146
31,-1.1549
32,-1.1538
33,-1.1449
34,-1.1537
35,-1.1482
36,-1.145
37,-1.15
38,-1.1408
39,-1.1441
40,-1.1462
41,-1.135
42,-1.1456
43,-1.1447
44,-1.138
45,-1.1476
46,-1.1435
47,-1.1443
48,-1.1520000000000001
49,-1.1456
50,-1.1533
51,-1.1574
52,-1.1483
53,-1.1631
54,-1.1644
55,-1.1613
56,-1.1712
57,-1.1658
58,-1.166
59,-1.1705
60,-1.1606
61,-1.1664
62,-1.1655
63,-1.1518
64,-1.1591
65,-1.1522
66,-1.1437
67,-1.1479
68,-1.1378
69,-1.1358
70,-1.136
71,-1.1217
72,-1.1253
73,-1.121
74,-1.1062
75,-1.1108
76,-1.1005
77,-1.0897
78,-1.089
79,-1.0733
80,-1.0673
81,-1.0609
82,-1.0394
83,-1.0371
84,-1.0245
85,-1.0031
86,-0.99987
87,-0.98187
88,-0.96524
89,-0.95647
90,-0.93216
91,-0.91937
92,-0.90469
93,-0.8756
94,-0.8685799999999999
95,-0.8497
96,-0.82426
97,-0.81501
98,-0.79104
99,-0.77108
100,-0.7578699999999999
101,-0.73006
102,-0.7165199999999999
103,-0.69934
104,-0.66799
105,-0.66065
106,-0.63967
107,-0.61474
108,-0.6048
109,-0.58089
110,-0.56408
111,-0.55303
112,-0.5287
113,-0.52212
114,-0.5112300000000001
115,-0.48968999999999996
116,-0.49201999999999996
117,-0.48202
118,-0.47172
119,-0.47546000000000005
120,-0.46558
121,-0.46481999999999996
122,-0.46712
123,-0.45556
124,-0.46312
125,-0.46347
126,-0.45442
127,-0.46656000000000003
128,-0.46533
129,-0.46543
130,-0.47706000000000004
131,-0.47472
132,-0.48346000000000006
133,-0.49288000000000004
134,-0.48845
135,-0.5048699999999999
136,-0.51135
137,-0.50981
138,-0.52665
139,-0.52913
140,-0.53464
141,-0.54918
142,-0.5493399999999999
143,-0.56221
144,-0.57294
145,-0.56963
146,-0.58911
147,-0.59706
148,-0.60001
149,-0.62008
150,-0.6260600000000001
151,-0.63717
152,-0.65494
153,-0.6584300000000001
154,-0.67694
155,-0.6917399999999999
156,-0.69324
157,-0.71923
158,-0.73129
159,-0.7397100000000001
160,-0.7622899999999999
161,-0.77003
162,-0.78446
163,-0.80324
164,-0.80782
165,-0.8289799999999999
166,-0.84365
167,-0.8461299999999999
168,-0.87046
169,-0.88074
170,-0.88976
171,-0.91086
172,-0.9166200000000001
173,-0.93021
174,-0.9456
175,-0.9471700000000001
176,-0.9672700000000001
177,-0.9785
178,-0.97865
179,-0.9981200000000001
180,-1.0043
181,-1.0131
182,-1.0334
183,-1.0382
184,-1.0504
185,-1.0599
186,-1.0546
187,-1.071
188,-1.0792
189,-1.0805
190,-1.099
191,-1.1021
192,-1.1072
193,-1.121
194,-1.121
195,-1.1333
196,-1.1431
197,-1.1385
198,-1.1555
199,-1.1608
200,-1.1604
201,-1.1757
202,-1.176
203,-1.18
204,-1.1898
205,-1.1848
206,-1.1937
207,-1.1982
208,-1.1883
209,-1.2008
210,-1.1983
211,-1.1908
212,-1.1964
213,-1.1869
214,-1.1828
215,-1.1824
216,-1.1672
217,-1.1678
218,-1.1624
219,-1.1454
220,-1.1505
221,-1.1421
222,-1.1321
223,-1.1345
224,-1.1223
225,-1.1179999999999999
226,-1.1158
227,-1.0994
228,-1.1011
229,-1.0952
230,-1.0795
231,-1.0836
232,-1.0735
233,-1.0633
234,-1.0634
235,-1.0492
236,-1.0453
237,-1.042
238,-1.0248
239,-1.0276
240,-1.0209
241,-1.0063
242,-1.0098
243,-0.99895
244,-0.99013
245,-0.98993
246,-0.97565
247,-0.9737
248,-0.96967
249,-0.9507700000000001
250,-0.9530200000000001
251,-0.94383
252,-0.92979
253,-0.9333600000000001
254,-0.92332
255,-0.9172100000000001
256,-0.9169
257,-0.9017799999999999
258,-0.90107
259,-0.8970899999999999
260,-0.87935
261,-0.8850299999999999
262,-0.8766299999999999
263,-0.86424
264,-0.86659
265,-0.85505
266,-0.85025
267,-0.8502700000000001
268,-0.83629
269,-0.8390700000000001
270,-0.83662
271,-0.82262
272,-0.8306600000000001
273,-0.8246100000000001
274,-0.81658
275,-0.82109
276,-0.81145
277,-0.8106300000000001
278,-0.8125399999999999
279,-0.8003399999999999
280,-0.8065100000000001
281,-0.8051
282,-0.7941699999999999
283,-0.8036800000000001
284,-0.79904
285,-0.7944399999999999
286,-0.80018
287,-0.7917
288,-0.7943600000000001
289,-0.7981
290,-0.78819
291,-0.79875
292,-0.7997
293,-0.79332
294,-0.80595
295,-0.80484
296,-0.8064399999999999
297,-0.81675
298,-0.81288
299,-0.8219799999999999
300,-0.82965
301,-0.82345
302,-0.8394299999999999
303,-0.8435799999999999
304,-0.8418100000000001
305,-0.8559200000000001
306,-0.85456
307,-0.85672
308,-0.86526
309,-0.8600899999999999
310,-0.87008
311,-0.87551
312,-0.8648299999999999
313,-0.8753799999999999
314,-0.8707600000000001
315,-0.86311
316,-0.87177
317,-0.86715
318,-0.8685299999999999
319,-0.8725200000000001
320,-0.86036
321,-0.86385
322,-0.86162
323,-0.84814
324,-0.8572299999999999
325,-0.8527299999999999
326,-0.84706
327,-0.8543700000000001
328,-0.8476600000000001
329,-0.8497399999999999
330,-0.85431
331,-0.84495
332,-0.8542799999999999
333,-0.8563
334,-0.84946
335,-0.86415
336,-0.8664700000000001
337,-0.87045
338,-0.8847700000000001
339,-0.8831100000000001
340,-0.8896200000000001
341,-0.89466
342,-0.8855
343,-0.89759
344,-0.9012
345,-0.89774
346,-0.9122600000000001
347,-0.91212
348,-0.91459
349,-0.9265399999999999
350,-0.9255399999999999
351,-0.93804
352,-0.94886
353,-0.94524
354,-0.96314
355,-0.9693
356,-0.97029
357,-0.9881
358,-0.99121
359,-0.9975799999999999
360,-1.0089
361,-1.0047
362,-1.0147
363,-1.0209
364,-1.0132
365,-1.0287
366,-1.0293
367,-1.0247
368,-1.0332
369,-1.026
370,-1.024
371,-1.0255
372,-1.0118
373,-1.0139
374,-1.0097
375,-0.99277
376,-0.99736
377,-0.9874700000000001
378,-0.97557
379,-0.9764700000000001
380,-0.9628899999999999
381,-0.9575799999999999
382,-0.95431
383,-0.93578
384,-0.93479
385,-0.92517
386,-0.90469
387,-0.90415
388,-0.88902
389,-0.8735799999999999
390,-0.8685200000000001
391,-0.8482799999999999
392,-0.83806
393,-0.82824
394,-0.80389
395,-0.79996
396,-0.78605
397,-0.76336
398,-0.7589100000000001
399,-0.73965
400,-0.72226
401,-0.71377
402,-0.6902699999999999
403,-0.67898
404,-0.66591
405,-0.63795
406,-0.63237
407,-0.61469
408,-0.59025
409,-0.58236
410,-0.55908
411,-0.53928
412,-0.526
413,-0.49728
414,-0.48307
415,-0.46529
416,-0.43281000000000003
417,-0.42503
418,-0.40293
419,-0.37604
420,-0.36419
421,-0.3371
422,-0.31625
423,-0.30046
424,-0.26939
425,-0.25524
426,-0.23538
427,-0.20272
428,-0.19362000000000001
429,-0.17024
430,-0.14458
431,-0.13234
432,-0.10439000000000001
433,-0.084661
434,-0.06775700000000001
435,-0.03543
436,-0.022601
437,-0.0019207999999999999
438,0.029835000000000004
439,0.039924
440,0.065151
441,0.09070700000000001
442,0.10454000000000001
443,0.13397
444,0.15242
445,0.17002
446,0.20329
447,0.21466999999999997
448,0.23611999999999997
449,0.26648
450,0.2767
451,0.30259
452,0.32645
453,0.33999
454,0.36867
455,0.38389
456,0.40191
457,0.43833999999999995
458,0.45278999999999997
459,0.48031
460,0.5130399999999999
461,0.52498
462,0.5516
463,0.5747399999999999
464,0.59225
465,0.62721
466,0.6462600000000001
467,0.66802
468,0.7046100000000001
469,0.71455
470,0.73993
471,0.77008
472,0.78356
473,0.81261
474,0.83445
475,0.8508
476,0.8831100000000001
477,0.89692
478,0.91659
479,0.94929
480,0.95626
481,0.9770399999999999
482,0.99759
483,1.0012
484,1.0184
485,1.0239
486,1.0242
487,1.0386
488,1.0306
489,1.0301
490,1.0407
491,1.0286
492,1.0324
493,1.0355
494,1.0255
495,1.0307
496,1.0233
497,1.0156
498,1.0243
499,1.0104
500,1.0074
501,1.0127
502,0.9967299999999999
503,0.99705
504,0.9951
505,0.9837799999999999
506,0.98874
507,0.97924
508,0.97225
509,0.98225
510,0.96801
511,0.9673700000000001
512,0.97264
513,0.95925
514,0.96373
515,0.9651799999999999
516,0.96019
517,0.9695299999999999
518,0.95795
519,0.94655
520,0.9487899999999999
521,0.92468
522,0.91811
523,0.9162899999999999
524,0.897
525,0.8920899999999999
526,0.87859
527,0.8611
528,0.86213
529,0.84701
530,0.84006
531,0.8460700000000001
532,0.82606
533,0.8206700000000001
534,0.81624
535,0.79767
536,0.79505
537,0.7819
538,0.7653399999999999
539,0.76368
540,0.74083
541,0.72683
542,0.72349
543,0.6974899999999999
544,0.68723
545,0.67596
546,0.65278
547,0.64505
548,0.62448
549,0.60318
550,0.5970300000000001
551,0.56823
552,0.5506300000000001
553,0.5411699999999999
554,0.51108
555,0.49651999999999996
556,0.47889
557,0.45252
558,0.44273
559,0.41945
560,0.39869
561,0.39314
562,0.36321
563,0.34693
564,0.33734000000000003
565,0.31038000000000004
566,0.2995
567,0.28326
568,0.26015
569,0.25301
570,0.23028
571,0.21244000000000002
572,0.20955
573,0.18068
574,0.16748
575,0.15878
576,0.13533
577,0.12819
578,0.11408
579,0.096205
580,0.095167
581,0.077877
582,0.06858
583,0.07244199999999999
584,0.052570000000000006
585,0.0481
586,0.045632
587,0.030322
588,0.030475
589,0.020288
590,0.0063511
591,0.0060325000000000005
592,-0.015757
593,-0.030755
594,-0.03729
595,-0.066755
596,-0.081001
597,-0.094503
598,-0.11707000000000001
599,-0.12230999999999999
600,-0.13779
601,-0.15275
602,-0.15202000000000002
603,-0.1721
604,-0.18062
605,-0.18017
606,-0.19863
607,-0.20119
608,-0.20571
609,-0.21861999999999998
610,-0.21579
611,-0.2262
612,-0.23419
613,-0.22625
614,-0.2404
615,-0.24045999999999998
616,-0.23355
617,-0.24411
618,-0.23956999999999998
619,-0.24004
620,-0.24745
621,-0.23884
622,-0.24459
623,-0.2447
624,-0.22824
625,-0.23651999999999998
626,-0.23024
627,-0.22045
628,-0.22643000000000002
629,-0.2159
630,-0.21059
631,-0.20939000000000002
632,-0.19293
633,-0.19449
634,-0.1892
635,-0.16848
636,-0.16889
637,-0.15283
638,-0.13437000000000002
639,-0.12922
640,-0.10605999999999999
641,-0.08772
642,-0.068495
643,-0.031957
644,-0.015999
645,0.006713500000000001
646,0.040494
647,0.053721000000000005
648,0.08430599999999999
649,0.1159
650,0.13458
651,0.16722
652,0.18745
653,0.20688
654,0.24308000000000002
655,0.25744
656,0.28117
657,0.31255
658,0.32314
659,0.35131
660,0.38094
661,0.40324
662,0.44195
663,0.46584
664,0.49033000000000004
665,0.5324399999999999
666,0.5532199999999999
667,0.58922
668,0.63254
669,0.65556
670,0.69302
671,0.7258899999999999
672,0.7513
673,0.79281
674,0.81694
675,0.84311
676,0.88476
677,0.89985
678,0.93086
679,0.96675
680,0.98501
681,1.0189
682,1.0459
683,1.0674
684,1.1056
685,1.1246
686,1.1488
687,1.1862
688,1.1975
689,1.2239
690,1.2522
691,1.2649
692,1.2938
693,1.3131
694,1.3292
695,1.3624
696,1.3744
697,1.3951
698,1.4277
699,1.4361
700,1.4606
701,1.4847
702,1.4956
703,1.5233
704,1.5387
705,1.5531
706,1.5844
707,1.5914
708,1.6095
709,1.6368
710,1.6416
711,1.6625
712,1.6803
713,1.6874
714,1.7121
715,1.7227
716,1.7354
717,1.7654
718,1.7690000000000001
719,1.7868
720,1.8123
721,1.8185
722,1.8425
723,1.8617
724,1.8729
725,1.9017
726,1.9132
727,1.9288
728,1.9611
729,1.9643
730,1.984
731,2.0085
732,2.0149
733,2.0378
734,2.0517
735,2.0581
736,2.0808
737,2.0827
738,2.0911
739,2.1138
740,2.1087
741,2.1196
742,2.1317
743,2.1273
744,2.1398
745,2.1415
746,2.1399
747,2.1559
748,2.1493
749,2.1518
750,2.1664
751,2.1563
752,2.1643
753,2.1727
754,2.1674
755,2.1786
756,2.1756
757,2.1722
758,2.1879
759,2.1796
760,2.1824
761,2.1919999999999997
762,2.1766
763,2.1794
764,2.1821
765,2.177
766,2.1895
767,2.1842
768,2.1798
769,2.1942
770,2.1852
771,2.1934
772,2.2079
773,2.1995
774,2.2066
775,2.2079
776,2.2016
777,2.2116
778,2.2012
779,2.1934
780,2.2015
781,2.1806
782,2.1746
783,2.1681
784,2.1405
785,2.1298
786,2.1136
787,2.0948
788,2.092
789,2.0666
790,2.048
791,2.0454
792,2.0177
793,2.0039
794,1.9854
795,1.9499
796,1.9352
797,1.9143
798,1.8879
799,1.8678
800,1.8193
801,1.7883
802,1.7844
803,1.7603
804,1.7274
805,1.6462
806,1.515
807,1.3996
808,1.3076
809,1.2629
810,1.2608
811,1.2318
812,1.1982
813,1.1638
814,1.1134
815,1.0902
816,1.0668
817,1.0289
818,1.0009
819,0.9566399999999999
820,0.9187799999999999
821,0.89961
822,0.85415
823,0.81994
824,0.78977
825,0.74221
826,0.7137600000000001
827,0.68118
828,0.64232
829,0.61912
830,0.57811
831,0.54157
832,0.51986
833,0.47153999999999996
834,0.4403
835,0.4136
836,0.37182
837,0.3468
838,0.31481
839,0.27979
840,0.26182
841,0.22621
842,0.19787000000000002
843,0.18214
844,0.14273
845,0.12075999999999999
846,0.1027
847,0.07398400000000001
848,0.063032
849,0.043045
850,0.021033
851,0.014422999999999998
852,-0.012172
853,-0.029776999999999998
854,-0.037781
855,-0.069125
856,-0.08670800000000001
857,-0.10626
858,-0.13677
859,-0.15025
860,-0.1729
861,-0.19263
862,-0.19480999999999998
863,-0.21684
864,-0.22694
865,-0.22839
866,-0.24846999999999997
867,-0.25211999999999996
868,-0.25727
869,-0.27002
870,-0.26696
871,-0.27716
872,-0.28498
873,-0.27765
874,-0.29270999999999997
875,-0.29448
876,-0.29036999999999996
877,-0.30379
878,-0.30283000000000004
879,-0.30774
880,-0.32048000000000004
881,-0.32003000000000004
882,-0.33708
883,-0.35200000000000004
884,-0.35401
885,-0.38118
886,-0.39338
887,-0.40133
888,-0.42416000000000004
889,-0.4325
890,-0.44845
891,-0.4692
892,-0.47485
893,-0.49698000000000003
894,-0.51227
895,-0.51485
896,-0.53981
897,-0.54927
898,-0.5558
899,-0.5741
900,-0.5765399999999999
901,-0.58746
902,-0.60024
903,-0.59701
904,-0.61136
905,-0.61598
906,-0.60923
907,-0.6230399999999999
908,-0.62134
909,-0.61879
910,-0.62585
911,-0.61622
912,-0.61639
913,-0.6160399999999999
914,-0.59972
915,-0.60346
916,-0.59563
917,-0.57804
918,-0.5786
919,-0.56289
920,-0.54808
921,-0.54108
922,-0.51739
923,-0.50532
924,-0.49031
925,-0.4588
926,-0.44919
927,-0.42622
928,-0.3958
929,-0.38198000000000004
930,-0.35195
931,-0.32515
932,-0.30498000000000003
933,-0.26939
934,-0.24906999999999999
935,-0.22505
936,-0.18537
937,-0.17025
938,-0.14051
939,-0.10653
940,-0.088408
941,-0.054598
942,-0.026262999999999998
943,-0.0023504999999999997
944,0.037057
945,0.058692999999999995
946,0.08569700000000001
947,0.12562
948,0.14107999999999998
949,0.16898
950,0.19572
951,0.20521999999999999
952,0.22823000000000002
953,0.24198000000000003
954,0.25251
955,0.27816
956,0.28393
957,0.29886999999999997
958,0.32747
959,0.33625
960,0.36027
961,0.38206999999999997
962,0.38885
963,0.40943
964,0.41828000000000004
965,0.42598
966,0.44853000000000004
967,0.44843
968,0.46041000000000004
969,0.48567
970,0.49545
971,0.52355
972,0.54866
973,0.56116
974,0.58739
975,0.5997100000000001
976,0.61475
977,0.64652
978,0.65345
979,0.67208
980,0.69618
981,0.70092
982,0.72111
983,0.73642
984,0.74436
985,0.76903
986,0.77836
987,0.79196
988,0.8208799999999999
989,0.8224899999999999
990,0.83896
991,0.8595799999999999
992,0.86315
993,0.8813
994,0.8902899999999999
995,0.8923700000000001
996,0.90969
997,0.90851
998,0.9134700000000001
999,0.9309999999999999
1000,0.92279
1001,0.9295
1002,0.9380799999999999
1003,0.93258
1004,0.9425100000000001
1005,0.94137
1006,0.9358200000000001
1007,0.9449200000000001
1008,0.93306
1009,0.9298799999999999
1010,0.9371200000000001
1011,0.92081
1012,0.91889
1013,0.91515
1014,0.89899
1015,0.8983700000000001
1016,0.8852899999999999
1017,0.8712700000000001
1018,0.87187
1019,0.84909
1020,0.83709
1021,0.83316
1022,0.80805
1023,0.79723
1024,0.7814300000000001
1025,0.7549600000000001
1026,0.74358
1027,0.71713
1028,0.69115
1029,0.67776
1030,0.63799
1031,0.61144
1032,0.59187
1033,0.55457
1034,0.53079
1035,0.49742
1036,0.45432
1037,0.42772
1038,0.38949
1039,0.3618
1040,0.3532
1041,0.32029
1042,0.30363
1043,0.29181
1044,0.26631
1045,0.25811
1046,0.24198000000000003
1047,0.21916
1048,0.20851
1049,0.17590999999999998
1050,0.14664000000000002
1051,0.12686
1052,0.080597
1053,0.048862
1054,0.019209999999999998
1055,-0.021837
1056,-0.044086
1057,-0.07274299999999999
1058,-0.10052
1059,-0.10987000000000001
1060,-0.13699999999999998
1061,-0.15347
1062,-0.15786
1063,-0.18286
1064,-0.19062
1065,-0.18949000000000002
1066,-0.18554
1067,-0.1974
1068,-0.24697
1069,-0.27296
1070,-0.23015
1071,-0.16236
1072,-0.14274
1073,-0.23385999999999998
1074,-0.34636999999999996
1075,-0.30005
1076,-0.09718500000000001
1077,0.055112
1078,-0.061345000000000004
1079,-0.37878
1080,-0.48771000000000003
1081,-0.13612
1082,0.36958
1083,0.42136
1084,-0.21923
1085,-0.9026700000000001
1086,-0.61865
1087,0.75148
1088,1.8861
1089,0.8572799999999999
1090,-3.1354
1091,-8.7355
