time,value
0,-0.13777999999999999
1,-0.13777999999999999
2,-0.13777999999999999
3,-0.13777999999999999
4,-0.13777999999999999
5,-0.13777999999999999
6,-0.13777999999999999
7,-0.13777999999999999
8,-0.13777999999999999
9,-0.13777999999999999
10,-0.13777999999999999
11,-0.13777999999999999
12,-0.13777999999999999
13,-0.13777999999999999
14,-0.13777999999999999
15,-0.13777999999999999
16,-0.13777999999999999
17,-0.13777999999999999
18,-0.13777999999999999
19,-0.13777999999999999
20,-0.13777999999999999
21,-0.13777999999999999
22,-0.13777999999999999
23,-0.13777999999999999
24,-0.13777999999999999
25,-0.13777999999999999
26,-0.13777999999999999
27,-0.13777999999999999
28,-0.13777999999999999
29,-0.13777999999999999
30,-0.13777999999999999
31,-0.13777999999999999
32,-0.13777999999999999
33,-0.13777999999999999
34,-0.13777999999999999
35,-0.13777999999999999
36,-0.13777999999999999
37,-0.13777999999999999
38,8.6892
39,4.2102
40,-0.13777999999999999
41,-0.13777999999999999
42,-0.13777999999999999
43,-0.13777999999999999
44,-0.13777999999999999
45,-0.085399
46,-0.13777999999999999
47,-0.13777999999999999
48,-0.13777999999999999
49,-0.13777999999999999
50,-0.13777999999999999
51,-0.13777999999999999
52,-0.13777999999999999
53,-0.13777999999999999
54,-0.13777999999999999
55,-0.13777999999999999
56,-0.13777999999999999
57,-0.13777999999999999
58,-0.13777999999999999
59,-0.13777999999999999
60,-0.13777999999999999
61,-0.13777999999999999
62,-0.13777999999999999
63,-0.13777999999999999
64,-0.13777999999999999
65,-0.13777999999999999
66,-0.13777999999999999
67,-0.13777999999999999
68,-0.13777999999999999
69,-0.13777999999999999
70,-0.13777999999999999
71,-0.13777999999999999
72,-0.13777999999999999
73,-0.13777999999999999
74,-0.13777999999999999
75,-0.13777999999999999
76,-0.13777999999999999
77,-0.13777999999999999
78,-0.13777999999999999
79,-0.13777999999999999
80,-0.13777999999999999
81,-0.13777999999999999
82,-0.13777999999999999
83,-0.13777999999999999
84,-0.13777999999999999
85,-0.13777999999999999
86,-0.13777999999999999
87,-0.13777999999999999
88,-0.13777999999999999
89,-0.13777999999999999
90,-0.13777999999999999
91,-0.13777999999999999
92,-0.13777999999999999
93,-0.13777999999999999
94,-0.13777999999999999
95,-0.13777999999999999
