time,value
0,-2.3479
1,-2.3479
2,-2.3479
3,-2.3479
4,-2.3503
5,-2.3503
6,-2.3503
7,-2.3503
8,-2.3502
9,-2.35
10,-2.3475
11,-2.347
12,-2.3465
13,-2.3458
14,-2.3451
15,-2.3441
16,-2.3432
17,-2.3419
18,-2.3408
19,-2.3392
20,-2.3379
21,-2.336
22,-2.3345
23,-2.3323
24,-2.3306
25,-2.3282
26,-2.3263
27,-2.3237
28,-2.3216
29,-2.3187
30,-2.3164
31,-2.3132
32,-2.3108
33,-2.3074
34,-2.3048
35,-2.3012
36,-2.3005
37,-2.2966
38,-2.2937
39,-2.2896
40,-2.2865
41,-2.2822
42,-2.2778
43,-2.2744
44,-2.2699
45,-2.2663
46,-2.2616
47,-2.2579
48,-2.253
49,-2.2492
50,-2.2421
51,-2.2382
52,-2.233
53,-2.2289
54,-2.2235
55,-2.2194
56,-2.2138
57,-2.2096
58,-2.2038
59,-2.1995
60,-2.1936
61,-2.1892
62,-2.1832
63,-2.1786
64,-2.1725
65,-2.1679
66,-2.1616
67,-2.1569
68,-2.1505
69,-2.1457
70,-2.1393
71,-2.1344
72,-2.1278
73,-2.1212
74,-2.1129
75,-2.108
76,-2.1014
77,-2.0964
78,-2.0897
79,-2.0846
80,-2.0778
81,-2.0694
82,-2.0643
83,-2.0573
84,-2.0521
85,-2.0451
86,-2.0399
87,-2.0328
88,-2.0274
89,-2.0203
90,-2.0149
91,-2.0077
92,-2.0022
93,-1.9949
94,-1.9894
95,-1.9821
96,-1.9765
97,-1.9691
98,-1.9635
99,-1.956
100,-1.9504
101,-1.9429
102,-1.9372
103,-1.9296
104,-1.9239
105,-1.9162
106,-1.9105
107,-1.9028
108,-1.8969999999999998
109,-1.8892
110,-1.8834
111,-1.8756
112,-1.8717
113,-1.8697
114,-1.8658
115,-1.8567
116,-1.8555
117,-1.8515
118,-1.8456
119,-1.8377
120,-1.8345
121,-1.8306
122,-1.8226
123,-1.8207
124,-1.8174
125,-1.8103
126,-1.8011
127,-1.7979
128,-1.7939
129,-1.7879
130,-1.7799
131,-1.7739
132,-1.7659
133,-1.7599
134,-1.7518
135,-1.7457
136,-1.7365
137,-1.7304
138,-1.7223
139,-1.7162
140,-1.7080000000000002
141,-1.7019
142,-1.6937
143,-1.6876
144,-1.6801
145,-1.6747
146,-1.6654
147,-1.6593
148,-1.65
149,-1.6438
150,-1.6384
151,-1.633
152,-1.6237
153,-1.6176
154,-1.6094
155,-1.6021
156,-1.5939
157,-1.5877
158,-1.5814
159,-1.5761
160,-1.5697
161,-1.5625
162,-1.5562
163,-1.5496
164,-1.5444
165,-1.5362
166,-1.5301
167,-1.5208
168,-1.5155
169,-1.5091
170,-1.5027
171,-1.4945
172,-1.4873
173,-1.4791
174,-1.4738
175,-1.4674
176,-1.4631
177,-1.4549
178,-1.4476
179,-1.4394
180,-1.4321
181,-1.4257
182,-1.4214
183,-1.4132
184,-1.4069999999999998
185,-1.3977
186,-1.3904
187,-1.3840000000000001
188,-1.3797
189,-1.3715
190,-1.3653
191,-1.3571
192,-1.3498
193,-1.3416
194,-1.3354
195,-1.3289
196,-1.3236
197,-1.3154
198,-1.3092
199,-1.3009
200,-1.2936
201,-1.2854
202,-1.2792
203,-1.2729
204,-1.2665
205,-1.2613
206,-1.253
207,-1.2457
208,-1.2374
209,-1.2312
210,-1.2229
211,-1.2156
212,-1.2093
213,-1.203
214,-1.1947
215,-1.1885
216,-1.1791
217,-1.1729
218,-1.1646
219,-1.1573
220,-1.1541
221,-1.1488
222,-1.1405
223,-1.1343
224,-1.126
225,-1.1187
226,-1.1103
227,-1.1041
228,-1.0968
229,-1.0915
230,-1.0842
231,-1.078
232,-1.0696
233,-1.0634
234,-1.054
235,-1.0477
236,-1.0404
237,-1.0373
238,-1.03
239,-1.0237
240,-1.0154
241,-1.0091
242,-0.9997
243,-0.9913299999999999
244,-0.9850399999999999
245,-0.97987
246,-0.97469
247,-0.9673799999999999
248,-0.9611
249,-0.9527200000000001
250,-0.9454100000000001
251,-0.9370200000000001
252,-0.9307200000000001
253,-0.9223899999999999
254,-0.91933
255,-0.91309
256,-0.9068
257,-0.89841
258,-0.8921100000000001
259,-0.8827
260,-0.87639
261,-0.86797
262,-0.86074
263,-0.85459
264,-0.84829
265,-0.83988
266,-0.8325600000000001
267,-0.82415
268,-0.8211200000000001
269,-0.81497
270,-0.80867
271,-0.8002600000000001
272,-0.79396
273,-0.7845300000000001
274,-0.77822
275,-0.76979
276,-0.76257
277,-0.75644
278,-0.75013
279,-0.7407100000000001
280,-0.73439
281,-0.72597
282,-0.72085
283,-0.71472
284,-0.70631
285,-0.69999
286,-0.69057
287,-0.68425
288,-0.67582
289,-0.6694899999999999
290,-0.66328
291,-0.65818
292,-0.64985
293,-0.64353
294,-0.6341
295,-0.6277699999999999
296,-0.62156
297,-0.61646
298,-0.61024
299,-0.60392
300,-0.59549
301,-0.58916
302,-0.58072
303,-0.57438
304,-0.56592
305,-0.55958
306,-0.55111
307,-0.54378
308,-0.5353
309,-0.52894
310,-0.52045
311,-0.51408
312,-0.5119600000000001
313,-0.50983
314,-0.50133
315,-0.49921000000000004
316,-0.49921000000000004
317,-0.49283000000000005
318,-0.48431
319,-0.47791999999999996
320,-0.4694
321,-0.46299999999999997
322,-0.45447
323,-0.44806
324,-0.4431
325,-0.43718999999999997
326,-0.4308
327,-0.42132
328,-0.41491999999999996
329,-0.40545
330,-0.40048
331,-0.39337
332,-0.38698
333,-0.37751
334,-0.37111
335,-0.36258
336,-0.35974
337,-0.35168
338,-0.34434000000000003
339,-0.3351
340,-0.3301
341,-0.32064000000000004
342,-0.31425
343,-0.30479
344,-0.2984
345,-0.28988
346,-0.28348
347,-0.27425
348,-0.27139
349,-0.2631
350,-0.25671
351,-0.24863000000000002
352,-0.24363
353,-0.23512
354,-0.22874
355,-0.21928000000000003
356,-0.21194000000000002
357,-0.20598000000000002
358,-0.19981
359,-0.1913
360,-0.18492999999999998
361,-0.17642
362,-0.17003
363,-0.16055999999999998
364,-0.15204
365,-0.14565
366,-0.13710999999999998
367,-0.13071
368,-0.12217
369,-0.11508
370,-0.10917
371,-0.10182999999999999
372,-0.094487
373,-0.089512
374,-0.084525
375,-0.078139
376,-0.06962
377,-0.062277
378,-0.053752
379,-0.047356
380,-0.038821
381,-0.034802
382,-0.028883999999999996
383,-0.023673
384,-0.015147999999999998
385,-0.0078068
386,0.0007252000000000001
387,0.0068792
388,0.012801
389,0.018012
390,0.026535000000000003
391,0.033875999999999996
392,0.042402999999999996
393,0.045482
394,0.053537
395,0.05757
396,0.066088
397,0.073429
398,0.081954
399,0.08835
400,0.09427200000000001
401,0.09713
402,0.10564000000000001
403,0.11202999999999999
404,0.12055999999999999
405,0.12909
406,0.13643
407,0.14495999999999998
408,0.14993
409,0.15585
410,0.16011
411,0.16864
412,0.17598
413,0.18450999999999998
414,0.18972
415,0.19564
416,0.19754000000000002
417,0.20606
418,0.2134
419,0.22191999999999998
420,0.22832
421,0.23329
422,0.23826999999999998
423,0.24561
424,0.252
425,0.26053000000000004
426,0.26787
427,0.2764
428,0.2828
429,0.29134
430,0.29775
431,0.30723
432,0.3091
433,0.315
434,0.3214
435,0.32994
436,0.33635
437,0.34489000000000003
438,0.35224
439,0.36079
440,0.3672
441,0.37576
442,0.38218
443,0.3859
444,0.39084
445,0.39939
446,0.40794
447,0.41436000000000006
448,0.42383999999999994
449,0.43027
450,0.43883
451,0.44282
452,0.44866999999999996
453,0.45388
454,0.46243999999999996
455,0.46886000000000005
456,0.47835
457,0.48478000000000004
458,0.49333999999999995
459,0.49763
460,0.50346
461,0.50839
462,0.51695
463,0.52337
464,0.53194
465,0.53837
466,0.54786
467,0.55429
468,0.56287
469,0.56931
470,0.5766600000000001
471,0.58155
472,0.58645
473,0.5928800000000001
474,0.60146
475,0.6078899999999999
476,0.61648
477,0.62292
478,0.63242
479,0.6388699999999999
480,0.64746
481,0.65267
482,0.65845
483,0.66457
484,0.67498
485,0.67895
486,0.68691
487,0.6954899999999999
488,0.70192
489,0.7105100000000001
490,0.71695
491,0.72554
492,0.73198
493,0.74058
494,0.74703
495,0.74343
496,0.74074
497,0.7398399999999999
498,0.73895
499,0.73539
500,0.73539
501,0.73274
502,0.73009
503,0.72658
504,0.72397
505,0.7170300000000001
506,0.70967
507,0.7036
508,0.69885
509,0.69279
510,0.68542
511,0.6772
512,0.67462
513,0.66857
514,0.66206
515,0.6533800000000001
516,0.64688
517,0.63821
518,0.63084
519,0.62217
520,0.61568
521,0.60702
522,0.6005199999999999
523,0.59187
524,0.58667
525,0.58102
526,0.57496
527,0.5684600000000001
528,0.55893
529,0.5524399999999999
530,0.54508
531,0.5424800000000001
532,0.5390199999999999
533,0.53428
534,0.53087
535,0.52435
536,0.51567
537,0.5083
538,0.49962
539,0.49573999999999996
540,0.49016000000000004
541,0.4828
542,0.47411000000000003
543,0.4676
544,0.45806
545,0.45155
546,0.44287
547,0.43768
548,0.43208
549,0.42821000000000004
550,0.41867
551,0.41262
552,0.40706
553,0.40187
554,0.39316999999999996
555,0.38665
556,0.37711
557,0.3706
558,0.36191
559,0.35757
560,0.35199
561,0.34945
562,0.34391
563,0.3414
564,0.33403
565,0.32749
566,0.31795
567,0.30924
568,0.30455
569,0.29904000000000003
570,0.29468
571,0.28513
572,0.28129
573,0.2758
574,0.27061
575,0.26188
576,0.25451
577,0.24579
578,0.2406
579,0.23512
580,0.22910999999999998
581,0.21955
582,0.21573
583,0.21028000000000002
584,0.2029
585,0.19335
586,0.18872
587,0.18549000000000002
588,0.17812
589,0.17155
590,0.16695
591,0.15936
592,0.15279
593,0.14323
594,0.13665
595,0.12709
596,0.1233
597,0.12011
598,0.11352999999999999
599,0.10475999999999999
600,0.097386
601,0.088621
602,0.081845
603,0.076477
604,0.069104
605,0.06094
606,0.056385000000000005
607,0.048225
608,0.038653
609,0.036311
610,0.028807
611,0.022206
612,0.013406999999999999
613,0.0060322
614,-0.0027618
615,-0.0050948
616,-0.010381999999999999
617,-0.015556
618,-0.025134
619,-0.02887
620,-0.034126
621,-0.040741
622,-0.050323
623,-0.056936
624,-0.066513
625,-0.07321
626,-0.077691
627,-0.085066
628,-0.093198
629,-0.097662
630,-0.10579000000000001
631,-0.11241
632,-0.122
633,-0.12862
634,-0.13454000000000002
635,-0.139
636,-0.1449
637,-0.15228
638,-0.15818
639,-0.16261
640,-0.17072
641,-0.17737
642,-0.18695
643,-0.19359
644,-0.20244
645,-0.20464000000000002
646,-0.21423000000000003
647,-0.22382
648,-0.23046999999999998
649,-0.24006
650,-0.24225
651,-0.24885
652,-0.25623
653,-0.26433
654,-0.2687
655,-0.27679000000000004
656,-0.28417
657,-0.28923000000000004
658,-0.29356
659,-0.30316
660,-0.30983
661,-0.31263
662,-0.31471
663,-0.31745999999999996
664,-0.3195
665,-0.32218
666,-0.32418
667,-0.32682
668,-0.3201
669,-0.31114
670,-0.30507
671,-0.2961
672,-0.29515
673,-0.29545
674,-0.28934
675,-0.28098
676,-0.28223000000000004
677,-0.28244
678,-0.2763
679,-0.26729
680,-0.26053000000000004
681,-0.25151999999999997
682,-0.24475999999999998
683,-0.23634000000000002
684,-0.22958
685,-0.22055999999999998
686,-0.21379
687,-0.21388000000000001
688,-0.21336999999999998
689,-0.20715999999999998
690,-0.20095
691,-0.20039
692,-0.19755
693,-0.19075999999999999
694,-0.1817
695,-0.1749
696,-0.16584000000000002
697,-0.15904000000000001
698,-0.14997
699,-0.14317
700,-0.13409000000000001
701,-0.12729000000000001
702,-0.11822
703,-0.11141
704,-0.10525
705,-0.1036
706,-0.093981
707,-0.08718200000000001
708,-0.078113
709,-0.071311
710,-0.06224
711,-0.055436
712,-0.045819
713,-0.039015
714,-0.029939
715,-0.023132
716,-0.014053999999999999
717,-0.0072428
718,0.0018382000000000001
719,0.0051802
720,0.0096152
721,0.014695
722,0.023769
723,0.031116
724,0.04019
725,0.04527
726,0.049725
727,0.053096000000000004
728,0.062713
729,0.06946799999999999
730,0.073417
731,0.082472
732,0.089262
733,0.098319
734,0.10567
735,0.11473
736,0.12153
737,0.12772999999999998
738,0.13169
739,0.13904
740,0.14583
741,0.15488
742,0.16224
743,0.17129
744,0.17808
745,0.18317
746,0.18713
747,0.19336
748,0.20014
749,0.20919000000000001
750,0.21598
751,0.22503
752,0.23239
753,0.24144000000000002
754,0.24823
755,0.25729
756,0.26408000000000004
757,0.27314
758,0.28049
759,0.285
760,0.28839000000000004
761,0.29745
762,0.30424
763,0.31385
764,0.32064000000000004
765,0.3297
766,0.33649
767,0.34044
768,0.3444
769,0.35176
770,0.36080999999999996
771,0.36759000000000003
772,0.37665
773,0.38344
774,0.39249
775,0.39928
776,0.40834000000000004
777,0.41513
778,0.42475
779,0.43154
780,0.44061000000000006
781,0.4474
782,0.45647
783,0.46326000000000006
784,0.47233
785,0.47913
786,0.4882
787,0.495
788,0.50407
789,0.5108699999999999
790,0.51995
791,0.52675
792,0.53583
793,0.54264
794,0.55172
795,0.55853
796,0.5676100000000001
797,0.5744199999999999
798,0.57896
799,0.58123
800,0.58577
801,0.59258
802,0.6016699999999999
803,0.60901
804,0.6146199999999999
805,0.61515
806,0.6247699999999999
807,0.63158
808,0.64066
809,0.64975
810,0.6542899999999999
811,0.65763
812,0.6644399999999999
813,0.6735300000000001
814,0.68034
815,0.68943
816,0.69625
817,0.70586
818,0.71268
819,0.72177
820,0.72859
821,0.7329600000000001
822,0.73456
823,0.74364
824,0.75046
825,0.75954
826,0.76636
827,0.77544
828,0.78279
829,0.79188
830,0.7987
831,0.80779
832,0.8146100000000001
833,0.8214299999999999
834,0.8252700000000001
835,0.8296600000000001
836,0.83647
837,0.8455600000000001
838,0.8523700000000001
839,0.86146
840,0.8682799999999999
841,0.8773700000000001
842,0.88471
843,0.8938
844,0.9006200000000001
845,0.9097200000000001
846,0.9165399999999999
847,0.92563
848,0.9324600000000001
849,0.94155
850,0.95065
851,0.9574799999999999
852,0.9665799999999999
853,0.9734
854,0.98251
855,0.9893299999999999
856,0.99844
857,1.0053
858,1.0144
859,1.0212
860,1.0298
861,1.0366
862,1.0458
863,1.0526
864,1.0617
865,1.0685
866,1.0776
867,1.0799
868,1.0845
869,1.0913
870,1.1004
871,1.1004
872,1.1027
873,1.1096
874,1.1187
875,1.1192
876,1.1237
877,1.1306
878,1.1328
879,1.1351
880,1.1425
881,1.1498
882,1.1599
883,1.1667
884,1.1759
885,1.1759
886,1.1796
887,1.1865
888,1.1956
889,1.2029
890,1.212
891,1.2166
892,1.2166
893,1.2257
894,1.2325
895,1.2417
896,1.2462
897,1.2485
898,1.2531
899,1.2622
900,1.2690000000000001
901,1.2782
902,1.2845
903,1.2937
904,1.3005
905,1.3009
906,1.2994
907,1.3086
908,1.315
909,1.315
910,1.3172
911,1.3154
912,1.3149
913,1.3144
914,1.3135
915,1.3117
916,1.3103
917,1.3085
918,1.3049
919,1.3032
920,1.2996
921,1.29
922,1.285
923,1.2832
924,1.2801
925,1.2709
926,1.264
927,1.2549
928,1.248
929,1.2384
930,1.2292
931,1.2233
932,1.2194
933,1.2125
934,1.2033
935,1.1964
936,1.1872
937,1.1799
938,1.1708
939,1.1649
940,1.1632
941,1.1563
942,1.1472
943,1.1399
944,1.1307
945,1.1276
946,1.1236
947,1.1209
948,1.1117
949,1.1048
950,1.0956
951,1.0883
952,1.0792
953,1.0723
954,1.0631
955,1.0562
956,1.047
957,1.0401
958,1.031
959,1.0241
960,1.0145
961,1.0132
962,1.0097
963,1.0028
964,0.9936200000000001
965,0.9867299999999999
966,0.97714
967,0.97025
968,0.9610700000000001
969,0.95606
970,0.9521200000000001
971,0.9467200000000001
972,0.9398299999999999
973,0.9306399999999999
974,0.92375
975,0.91415
976,0.9072600000000001
977,0.8980799999999999
978,0.8911899999999999
979,0.8820100000000001
980,0.87889
981,0.87497
982,0.86997
983,0.8607799999999999
984,0.8538899999999999
985,0.8443
986,0.8374
987,0.8282200000000001
988,0.8209200000000001
989,0.81701
990,0.81392
991,0.8047300000000001
992,0.79783
993,0.78864
994,0.7813399999999999
995,0.77215
996,0.76526
997,0.76176
998,0.7582800000000001
999,0.75329
1000,0.746
1001,0.7368100000000001
1002,0.7299100000000001
1003,0.72223
1004,0.7187600000000001
1005,0.71339
1006,0.70649
1007,0.69729
1008,0.69039
1009,0.6808
1010,0.6739
1011,0.66469
1012,0.6555
1013,0.6486
1014,0.64513
1015,0.64169
1016,0.6344
1017,0.62712
1018,0.6179100000000001
1019,0.61101
1020,0.60527
1021,0.6018399999999999
1022,0.5945600000000001
1023,0.5876600000000001
1024,0.57845
1025,0.5715399999999999
1026,0.56233
1027,0.55505
1028,0.54584
1029,0.53893
1030,0.52972
1031,0.52282
1032,0.51361
1033,0.51055
1034,0.50676
1035,0.49948000000000004
1036,0.49027
1037,0.48299
1038,0.47378000000000003
1039,0.47073999999999994
1040,0.46698
1041,0.4597
1042,0.45048
1043,0.44356999999999996
1044,0.43435
1045,0.42744
1046,0.41786
1047,0.41095
1048,0.40174
1049,0.39446
1050,0.39107
1051,0.38769000000000003
1052,0.37847
1053,0.36925
1054,0.36234
1055,0.35276
1056,0.34584000000000004
1057,0.33662
1058,0.33555
1059,0.33185
1060,0.32458000000000004
1061,0.31535
1062,0.31201
1063,0.30834
1064,0.30141999999999997
1065,0.29219
1066,0.28526
1067,0.27603
1068,0.27603
1069,0.27108000000000004
1070,0.26416
1071,0.26185
1072,0.25689
1073,0.24731999999999998
1074,0.24006
1075,0.23049
1076,0.22323
1077,0.21861
1078,0.21631
1079,0.21101999999999999
1080,0.20409000000000002
1081,0.19485999999999998
1082,0.18794
1083,0.17837
1084,0.17144
1085,0.16221
1086,0.15529
1087,0.14605
1088,0.14307
1089,0.13944
1090,0.13449
1091,0.12525
1092,0.11600999999999999
1093,0.10909
1094,0.099852
1095,0.092924
1096,0.083356
1097,0.076431
1098,0.067196
1099,0.060267999999999995
1100,0.051036
1101,0.048060000000000005
1102,0.044442
1103,0.037188
1104,0.027949
1105,0.021018000000000002
1106,0.011455
1107,0.004525199999999999
1108,-0.004713800000000001
1109,-0.0099838
1110,-0.013569
1111,-0.018507
1112,-0.027750999999999998
1113,-0.035
1114,-0.044244
1115,-0.049182
1116,-0.05273200000000001
1117,-0.053341
1118,-0.053644000000000004
1119,-0.054242
1120,-0.055412
1121,-0.056271
1122,-0.056554999999999994
1123,-0.056835000000000004
1124,-0.055622000000000005
1125,-0.051529
1126,-0.042259
1127,-0.035308
1128,-0.026302
1129,-0.019349
1130,-0.010077
1131,-0.0033848
1132,-0.0020878
1133,0.0043711999999999996
1134,0.011084
1135,0.012676999999999999
1136,0.014288999999999998
1137,0.023341999999999998
1138,0.030076
1139,0.031499
1140,0.030846
1141,0.039922000000000006
1142,0.046679000000000005
1143,0.048176
1144,0.052622
1145,0.061719
1146,0.068691
1147,0.077989
1148,0.084961
1149,0.09425800000000001
1150,0.10123
1151,0.11052999999999999
1152,0.1175
1153,0.1268
1154,0.13377
1155,0.14307
1156,0.14985
1157,0.15915
1158,0.16613
1159,0.17543
1160,0.1824
1161,0.19189
1162,0.19887
1163,0.20817
1164,0.21514
1165,0.22444
1166,0.2316
1167,0.23895999999999998
1168,0.23954
1169,0.24904
1170,0.25601
1171,0.26531
1172,0.27228
1173,0.28158
1174,0.29086999999999996
1175,0.29785
1176,0.30714
1177,0.31431
1178,0.32361
1179,0.33058000000000004
1180,0.33988
1181,0.34685
1182,0.35615
1183,0.36313
1184,0.36796999999999996
1185,0.37029
1186,0.37262
1187,0.37959
1188,0.38908000000000004
1189,0.39625
1190,0.4013
1191,0.40362
1192,0.40826999999999997
1193,0.41523999999999994
1194,0.42413999999999996
1195,0.42395
1196,0.42608
1197,0.43287
1198,0.43751999999999996
1199,0.43983999999999995
1200,0.44468
1201,0.45183999999999996
1202,0.46153
1203,0.4685
1204,0.4778
1205,0.48012
1206,0.48283999999999994
1207,0.48768
1208,0.49698000000000003
1209,0.50395
1210,0.51325
1211,0.52022
1212,0.52952
1213,0.53882
1214,0.54579
1215,0.55509
1216,0.56206
1217,0.5713600000000001
1218,0.57834
1219,0.58763
1220,0.58996
1221,0.59209
1222,0.59888
1223,0.6078100000000001
1224,0.60995
1225,0.6120899999999999
1226,0.61907
1227,0.6237199999999999
1228,0.62605
1229,0.63553
1230,0.64269
1231,0.65199
1232,0.65879
1233,0.6655800000000001
1234,0.66773
1235,0.67471
1236,0.6793600000000001
1237,0.68169
1238,0.68401
1239,0.6933199999999999
1240,0.70029
1241,0.7096
1242,0.71658
1243,0.72588
1244,0.7328600000000001
1245,0.7419899999999999
1246,0.74897
1247,0.7582800000000001
1248,0.76525
1249,0.77456
1250,0.78154
1251,0.79084
1252,0.7931699999999999
1253,0.79782
1254,0.80713
1255,0.81411
1256,0.8164399999999999
1257,0.81876
1258,0.8280700000000001
1259,0.83505
1260,0.84436
1261,0.8513299999999999
1262,0.86064
1263,0.8676200000000001
1264,0.8769299999999999
1265,0.88374
1266,0.8854299999999999
1267,0.8899299999999999
1268,0.8990799999999999
1269,0.9060600000000001
1270,0.9153700000000001
1271,0.9223600000000001
1272,0.9316700000000001
1273,0.93865
1274,0.94796
1275,0.95494
1276,0.96193
1277,0.96193
1278,0.9665799999999999
1279,0.97356
1280,0.9758899999999999
1281,0.9782200000000001
1282,0.9875299999999999
1283,0.99451
1284,1.0038
1285,1.0108
1286,1.0201
1287,1.0271
1288,1.0363
1289,1.0432
1290,1.0526
1291,1.0595
1292,1.0689
1293,1.0758
1294,1.0852
1295,1.0945
1296,1.1014
1297,1.1108
1298,1.1177
1299,1.1247
1300,1.1271
1301,1.1316
1302,1.1384
1303,1.1474
1304,1.1496
1305,1.1518
1306,1.1587
1307,1.161
1308,1.1633
1309,1.1727
1310,1.1796
1311,1.189
1312,1.1959
1313,1.2053
1314,1.2122
1315,1.2216
1316,1.2285
1317,1.2379
1318,1.2448
1319,1.2542
1320,1.261
1321,1.2703
1322,1.2773
1323,1.2866
1324,1.2936
1325,1.3029
1326,1.3099
1327,1.3192
1328,1.3262
1329,1.3305
1330,1.3302
1331,1.337
1332,1.344
1333,1.3533
1334,1.3603
1335,1.3696
1336,1.379
1337,1.3858
1338,1.3952
1339,1.4021
1340,1.4115
1341,1.4184
1342,1.4278
1343,1.4348
1344,1.4441
1345,1.4511
1346,1.4578
1347,1.4598
1348,1.4666
1349,1.4736
1350,1.4829
1351,1.4898
1352,1.4991
1353,1.5061
1354,1.5130000000000001
1355,1.5151
1356,1.5194
1357,1.524
1358,1.5237
1359,1.5235
1360,1.5231
1361,1.5229
1362,1.5226
1363,1.5224
1364,1.5224
1365,1.5153
1366,1.5127
1367,1.5102
1368,1.5008
1369,1.4938
1370,1.4912
1371,1.4865
1372,1.4772
1373,1.4701
1374,1.4608
1375,1.456
1376,1.4559
1377,1.4534
1378,1.4533
1379,1.4509
1380,1.4439
1381,1.4346
1382,1.4276
1383,1.4182
1384,1.4112
1385,1.4019
1386,1.3996
1387,1.3972
1388,1.3926
1389,1.3856
1390,1.3856
1391,1.3809
1392,1.3739
1393,1.3645
1394,1.3575
1395,1.3482
1396,1.3436
1397,1.3413
1398,1.3389
1399,1.3296
1400,1.3296
1401,1.3249
1402,1.3179
1403,1.3085
1404,1.3015
1405,1.2922
1406,1.2875
1407,1.2852
1408,1.2805
1409,1.2711
1410,1.2641
1411,1.2548
1412,1.2478
1413,1.2385
1414,1.2315
1415,1.2222
1416,1.2175
1417,1.2152
1418,1.2105
1419,1.2036
1420,1.1943
1421,1.1919
1422,1.1896
1423,1.1827
1424,1.178
1425,1.1756
1426,1.1663
1427,1.1593
1428,1.1499
1429,1.1429
1430,1.1382
1431,1.1359
1432,1.1313
1433,1.1243
1434,1.1149
1435,1.1079
1436,1.0986
1437,1.0916
1438,1.0869
1439,1.0846
1440,1.0753
1441,1.0683
1442,1.0589
1443,1.0519
1444,1.0449
1445,1.0426
1446,1.0379
1447,1.0309
1448,1.0216
1449,1.0146
1450,1.0052
1451,0.99824
1452,0.9889100000000001
1453,0.9819100000000001
1454,0.9725799999999999
1455,0.96559
1456,0.95626
1457,0.9469299999999999
1458,0.9399299999999999
1459,0.9306
1460,0.92358
1461,0.91425
1462,0.9072600000000001
1463,0.8979299999999999
1464,0.8909299999999999
1465,0.8816
1466,0.87692
1467,0.8745299999999999
1468,0.86985
1469,0.8605200000000001
1470,0.8535200000000001
1471,0.84419
1472,0.83719
1473,0.82786
1474,0.82086
1475,0.81153
1476,0.80453
1477,0.79985
1478,0.79986
1479,0.7905300000000001
1480,0.7835300000000001
1481,0.7742
1482,0.7672100000000001
1483,0.75788
1484,0.75088
1485,0.74155
1486,0.73456
1487,0.72522
1488,0.71823
1489,0.7089
1490,0.7019
1491,0.69257
1492,0.68557
1493,0.67624
1494,0.66924
1495,0.65991
1496,0.65292
1497,0.64359
1498,0.63426
1499,0.62726
1500,0.61793
1501,0.61559
1502,0.61093
1503,0.6039399999999999
1504,0.5946199999999999
1505,0.58763
1506,0.58298
1507,0.5806600000000001
1508,0.5713600000000001
1509,0.5643600000000001
1510,0.5597
1511,0.5573600000000001
1512,0.55037
1513,0.54337
1514,0.53404
1515,0.52704
1516,0.51773
1517,0.51073
1518,0.5014
1519,0.49441
1520,0.48508
1521,0.48508
1522,0.48273999999999995
1523,0.47576999999999997
1524,0.47112
1525,0.46881000000000006
1526,0.46184
1527,0.45487
1528,0.44793
1529,0.4456
1530,0.4456
1531,0.4386
1532,0.42927
1533,0.42228000000000004
1534,0.41298
1535,0.40598
1536,0.39665
1537,0.38733
1538,0.38033
1539,0.371
1540,0.364
1541,0.35467
1542,0.34768000000000004
1543,0.33835
1544,0.33135
1545,0.32202
1546,0.31501999999999997
1547,0.3057
1548,0.2987
1549,0.28936999999999996
1550,0.28236999999999995
1551,0.27304
1552,0.26604
1553,0.25672
1554,0.24971999999999997
1555,0.24036
1556,0.23335999999999998
1557,0.22403
1558,0.21703000000000003
1559,0.2077
1560,0.20071
1561,0.19138
1562,0.19128
1563,0.18887
1564,0.18188
1565,0.17255
1566,0.16555
1567,0.15622
1568,0.14922
1569,0.13989000000000001
1570,0.13289
1571,0.13064
1572,0.1284
1573,0.11907999999999999
1574,0.11210999999999999
1575,0.10279
1576,0.095826
1577,0.091284
1578,0.089094
1579,0.082148
1580,0.07526000000000001
1581,0.075432
1582,0.068563
1583,0.061568
1584,0.052307000000000006
1585,0.045312
1586,0.038387
1587,0.038600999999999996
1588,0.038914
1589,0.039169999999999996
1590,0.039534
1591,0.039827999999999995
1592,0.040246
1593,0.040579000000000004
1594,0.049898000000000005
1595,0.056889
1596,0.066321
1597,0.07331
1598,0.078441
1599,0.083473
1600,0.092789
1601,0.09990299999999999
1602,0.10922
1603,0.11414
1604,0.11699999999999999
1605,0.1218
1606,0.13111
1607,0.13824
1608,0.14755
1609,0.15235
1610,0.15525999999999998
1611,0.15789
1612,0.16735
1613,0.17215999999999998
1614,0.17512
1615,0.17778
1616,0.18708
1617,0.19405999999999998
1618,0.20337
1619,0.21268
1620,0.21966
1621,0.22896
1622,0.23611
1623,0.24541999999999997
1624,0.2524
1625,0.2617
1626,0.26868000000000003
1627,0.27799
1628,0.28513
1629,0.28813
1630,0.29545
1631,0.30476
1632,0.31173
1633,0.32104
1634,0.32802
1635,0.33749
1636,0.34447
1637,0.35378000000000004
1638,0.36075999999999997
1639,0.36378
1640,0.36646999999999996
1641,0.37595
1642,0.38293
1643,0.39223
1644,0.3992
1645,0.40851
1646,0.41566000000000003
1647,0.42496999999999996
1648,0.43194
1649,0.44125
1650,0.44822
1651,0.45538
1652,0.45593
1653,0.46347
1654,0.47043999999999997
1655,0.47973999999999994
1656,0.48672
1657,0.49601999999999996
1658,0.50532
1659,0.5122899999999999
1660,0.52178
1661,0.52875
1662,0.53787
1663,0.54484
1664,0.55433
1665,0.5613
1666,0.5706
1667,0.57758
1668,0.5868800000000001
1669,0.59386
1670,0.60316
1671,0.6060399999999999
1672,0.60914
1673,0.61611
1674,0.62541
1675,0.63238
1676,0.64168
1677,0.64885
1678,0.65814
1679,0.6651199999999999
1680,0.6744100000000001
1681,0.6813899999999999
1682,0.6906899999999999
1683,0.6976600000000001
1684,0.70309
1685,0.70349
1686,0.7129800000000001
1687,0.71996
1688,0.72925
1689,0.73642
1690,0.7457199999999999
1691,0.75269
1692,0.75774
1693,0.76068
1694,0.76575
1695,0.77272
1696,0.78201
1697,0.78898
1698,0.79848
1699,0.80777
1700,0.8147399999999999
1701,0.8240299999999999
1702,0.831
1703,0.83396
1704,0.83693
1705,0.84411
1706,0.85108
1707,0.8603700000000001
1708,0.86755
1709,0.87684
1710,0.88381
1711,0.89099
1712,0.8939799999999999
1713,0.89697
1714,0.9039299999999999
1715,0.91322
1716,0.92019
1717,0.92947
1718,0.9364399999999999
1719,0.94595
1720,0.9529200000000001
1721,0.9622
1722,0.9691700000000001
1723,0.97845
1724,0.9854200000000001
1725,0.9884200000000001
1726,0.9891
1727,0.9963
1728,1.0033
1729,1.0125
1730,1.0195
1731,1.0288
1732,1.0358
1733,1.0453
1734,1.0522
1735,1.0615
1736,1.0685
1737,1.0778
1738,1.0805
1739,1.0838
1740,1.0933
1741,1.1003
1742,1.1096
1743,1.1165
1744,1.1258
1745,1.1328
1746,1.1423
1747,1.1493
1748,1.1585
1749,1.1655
1750,1.1748
1751,1.1778
1752,1.1788
1753,1.1857
1754,1.195
1755,1.202
1756,1.2112
1757,1.2184
1758,1.2277
1759,1.2347
1760,1.244
1761,1.2509
1762,1.2542
1763,1.255
1764,1.2642
1765,1.2712
1766,1.2807
1767,1.2877
1768,1.2905
1769,1.2936
1770,1.301
1771,1.308
1772,1.3175
1773,1.3245
1774,1.3338
1775,1.3407
1776,1.3482
1777,1.3513
1778,1.3588
1779,1.3657
1780,1.3752
1781,1.3845
1782,1.3874
1783,1.3907
1784,1.3980000000000001
1785,1.4075
1786,1.4080000000000001
1787,1.4092
1788,1.41
1789,1.4111
1790,1.412
1791,1.4132
1792,1.4141
1793,1.4153
1794,1.4162
1795,1.4175
1796,1.4184
1797,1.4197
1798,1.4207
1799,1.4141
1800,1.4075
1801,1.4062
1802,1.4049
1803,1.3963
1804,1.3897
1805,1.3888
1806,1.3872
1807,1.3780000000000001
1808,1.3711
1809,1.3622
1810,1.3553
1811,1.3459999999999999
1812,1.3391
1813,1.3359999999999999
1814,1.337
1815,1.3278
1816,1.3209
1817,1.3117
1818,1.3048
1819,1.2956
1820,1.2864
1821,1.2795
1822,1.2706
1823,1.2633
1824,1.2545
1825,1.2476
1826,1.238
1827,1.2311
1828,1.2219
1829,1.215
1830,1.2058
1831,1.1989
1832,1.1958
1833,1.1924
1834,1.1848
1835,1.1778
1836,1.1686
1837,1.1617
1838,1.1521
1839,1.1452
1840,1.136
1841,1.1291
1842,1.1199
1843,1.1165
1844,1.115
1845,1.1081
1846,1.0989
1847,1.092
1848,1.0828
1849,1.0759
1850,1.0666
1851,1.0597
1852,1.0505
1853,1.0432
1854,1.034
1855,1.0271
1856,1.0179
1857,1.011
1858,1.0018
1859,0.9948799999999999
1860,0.98798
1861,0.9856799999999999
1862,0.9833700000000001
1863,0.9741700000000001
1864,0.96726
1865,0.96496
1866,0.9622799999999999
1867,0.9527
1868,0.9454100000000001
1869,0.9362
1870,0.9293
1871,0.92009
1872,0.91319
1873,0.9101299999999999
1874,0.9047799999999999
1875,0.8955700000000001
1876,0.88866
1877,0.87945
1878,0.87255
1879,0.86334
1880,0.8564299999999999
1881,0.8472299999999999
1882,0.8403200000000001
1883,0.8311200000000001
1884,0.8242200000000001
1885,0.81501
1886,0.80811
1887,0.79891
1888,0.79201
1889,0.7828
1890,0.7759
1891,0.7667
1892,0.7598
1893,0.7506
1894,0.7437
1895,0.73451
1896,0.7276100000000001
1897,0.71841
1898,0.7115100000000001
1899,0.7023199999999999
1900,0.6954199999999999
1901,0.68623
1902,0.6766399999999999
1903,0.66974
1904,0.66055
1905,0.65405
1906,0.64486
1907,0.63756
1908,0.62837
1909,0.62148
1910,0.61229
1911,0.6054
1912,0.59621
1913,0.58932
1914,0.58013
1915,0.57892
1916,0.5754199999999999
1917,0.56812
1918,0.55893
1919,0.55204
1920,0.54285
1921,0.53595
1922,0.52676
1923,0.5198699999999999
1924,0.51068
1925,0.50379
1926,0.4946
1927,0.48771000000000003
1928,0.47852
1929,0.47163999999999995
1930,0.46245
1931,0.45556
1932,0.44638
1933,0.43908
1934,0.42988999999999994
1935,0.42341999999999996
1936,0.41423999999999994
1937,0.40736
1938,0.39818000000000003
1939,0.39129
1940,0.3817
1941,0.37251999999999996
1942,0.36564
1943,0.35646
1944,0.34958
1945,0.3404
1946,0.33352
1947,0.32435
1948,0.31934
1949,0.31535
1950,0.31222
1951,0.30304000000000003
1952,0.29616
1953,0.28698
1954,0.2801
1955,0.27092
1956,0.26404
1957,0.25444
1958,0.24756
1959,0.23838
1960,0.2315
1961,0.22233000000000003
1962,0.21545
1963,0.20585
1964,0.20228
1965,0.19643
1966,0.18955
1967,0.18037
1968,0.17349
1969,0.16430999999999998
1970,0.15743
1971,0.14825
1972,0.14137
1973,0.13177
1974,0.12532000000000001
1975,0.11615
1976,0.10884
1977,0.09967000000000001
1978,0.092791
1979,0.083622
1980,0.07674600000000001
1981,0.067579
1982,0.058412
1983,0.051538
1984,0.042373
1985,0.035499
1986,0.026777999999999996
1987,0.019465
1988,0.010748
1989,0.0038792
1990,-0.0052788
1991,-0.012145999999999999
1992,-0.021303
1993,-0.028168000000000002
1994,-0.037323
1995,-0.039612
1996,-0.0419
1997,-0.048762
1998,-0.052427
1999,-0.054252999999999996
2000,-0.062937
2001,-0.069329
2002,-0.073429
2003,-0.075244
2004,-0.079811
2005,-0.086664
2006,-0.09579800000000001
2007,-0.10265
2008,-0.11177999999999999
2009,-0.11863
2010,-0.12775999999999998
2011,-0.13413
2012,-0.14325
2013,-0.15058
2014,-0.15971
2015,-0.16605999999999999
2016,-0.17567
2017,-0.18202000000000002
2018,-0.19114
2019,-0.19798
2020,-0.2071
2021,-0.21394000000000002
2022,-0.22305
2023,-0.23215999999999998
2024,-0.23571
2025,-0.23594
2026,-0.23997
2027,-0.24906999999999999
2028,-0.25589
2029,-0.26499
2030,-0.2718
2031,-0.2809
2032,-0.28770999999999997
2033,-0.29627
2034,-0.30308
2035,-0.31217
2036,-0.31898000000000004
2037,-0.32806
2038,-0.33487
2039,-0.34059
2040,-0.34121
2041,-0.34464
2042,-0.35143
2043,-0.36049000000000003
2044,-0.36672
2045,-0.37577
2046,-0.38256
2047,-0.39161
2048,-0.38989
2049,-0.38983
2050,-0.39661
2051,-0.40564
2052,-0.41181999999999996
2053,-0.42083999999999994
2054,-0.42191000000000006
2055,-0.42175
2056,-0.42565
2057,-0.43465
2058,-0.4414
2059,-0.44978
2060,-0.45653
2061,-0.46552
2062,-0.47163999999999995
2063,-0.47200000000000003
2064,-0.47233
2065,-0.47841000000000006
2066,-0.48383999999999994
2067,-0.48412
2068,-0.48728
2069,-0.49398000000000003
2070,-0.50226
2071,-0.50673
2072,-0.5060600000000001
2073,-0.50403
2074,-0.5013
2075,-0.49923
2076,-0.49643999999999994
2077,-0.49503
2078,-0.4921
2079,-0.48695
2080,-0.48188000000000003
2081,-0.47823000000000004
2082,-0.46935
2083,-0.46198
2084,-0.45308999999999994
2085,-0.44572
2086,-0.44063
2087,-0.43696999999999997
2088,-0.42736999999999997
2089,-0.42221000000000003
2090,-0.41708
2091,-0.41118999999999994
2092,-0.40233
2093,-0.39496
2094,-0.38609
2095,-0.38093
2096,-0.37579
2097,-0.37209000000000003
2098,-0.36325
2099,-0.35661
2100,-0.34702
2101,-0.34038
2102,-0.33521
2103,-0.33077
2104,-0.32414
2105,-0.3153
2106,-0.30866
2107,-0.29980999999999997
2108,-0.29244000000000003
2109,-0.28358
2110,-0.27694
2111,-0.26808000000000004
2112,-0.26292
2113,-0.25777
2114,-0.25408000000000003
2115,-0.24523000000000003
2116,-0.23785
2117,-0.22899999999999998
2118,-0.22236
2119,-0.2172
2120,-0.21497
2121,-0.20611999999999997
2122,-0.19949
2123,-0.1899
2124,-0.18327000000000002
2125,-0.17440999999999998
2126,-0.16777
2127,-0.16114
2128,-0.1567
2129,-0.14711
2130,-0.13974
2131,-0.13454000000000002
2132,-0.13008
2133,-0.12125
2134,-0.11462
2135,-0.10579000000000001
2136,-0.09915700000000001
2137,-0.090317
2138,-0.082941
2139,-0.07409600000000001
2140,-0.06746
2141,-0.061554
2142,-0.057111
2143,-0.051198
2144,-0.042359
2145,-0.035727999999999996
2146,-0.026141
2147,-0.01951
2148,-0.010662
2149,-0.0032868000000000003
2150,0.0018992000000000002
2151,0.0056032
2152,0.014440999999999999
2153,0.02107
2154,0.029913
2155,0.036545999999999995
2156,0.046135
2157,0.052772
2158,0.061624
2159,0.068262
2160,0.074161
2161,0.078593
2162,0.08450099999999999
2163,0.091133
2164,0.09998
2165,0.10736
2166,0.11621
2167,0.12285
2168,0.13244
2169,0.13685999999999998
2170,0.1413
2171,0.14793
2172,0.15678
2173,0.16415
2174,0.17300000000000001
2175,0.17523
2176,0.18263
2177,0.18925999999999998
2178,0.1981
2179,0.20546999999999999
2180,0.21431999999999998
2181,0.22095
2182,0.2298
2183,0.23349
2184,0.23868000000000003
2185,0.24827
2186,0.25564000000000003
2187,0.26448
2188,0.27111999999999997
2189,0.27852
2190,0.28298
2191,0.29256
2192,0.29773
2193,0.30296
2194,0.30668
2195,0.3155
2196,0.32288
2197,0.3317
2198,0.33833
2199,0.34356
2200,0.34508
2201,0.35466
2202,0.36204000000000003
2203,0.36654000000000003
2204,0.36884
2205,0.37622
2206,0.38282
2207,0.3924
2208,0.39901
2209,0.40792
2210,0.41244
2211,0.42278999999999994
2212,0.42796000000000006
2213,0.43108
2214,0.43562
2215,0.43877
2216,0.44335
2217,0.45072
2218,0.4573
2219,0.46048
2220,0.46508
2221,0.47463999999999995
2222,0.48121
2223,0.48441999999999996
2224,0.48985
2225,0.49228999999999995
2226,0.49773999999999996
2227,0.5051100000000001
2228,0.5133
2229,0.51578
2230,0.5190899999999999
2231,0.52159
2232,0.52494
2233,0.52747
2234,0.53087
2235,0.5334300000000001
2236,0.53686
2237,0.5394399999999999
2238,0.54291
2239,0.5455300000000001
2240,0.54904
2241,0.5434399999999999
2242,0.5365800000000001
2243,0.53925
2244,0.54283
2245,0.54337
2246,0.54484
2247,0.5393100000000001
2248,0.53469
2249,0.5353
2250,0.53286
2251,0.5264300000000001
2252,0.5188
2253,0.5123800000000001
2254,0.50784
2255,0.51065
2256,0.50826
2257,0.5018600000000001
2258,0.49333999999999995
2259,0.48694
2260,0.47841999999999996
2261,0.47203
2262,0.46352
2263,0.4581
2264,0.44864
2265,0.44013
2266,0.43376000000000003
2267,0.42527
2268,0.4189
2269,0.41042
2270,0.40406
2271,0.39671999999999996
2272,0.39381
2273,0.38666
2274,0.38029
2275,0.37084
2276,0.36446999999999996
2277,0.35599000000000003
2278,0.35096
2279,0.34496
2280,0.33859
2281,0.32914
2282,0.32277
2283,0.31332
2284,0.30829
2285,0.30114
2286,0.29477
2287,0.28628000000000003
2288,0.27992
2289,0.27144
2290,0.26509
2291,0.25661999999999996
2292,0.25026
2293,0.2418
2294,0.23448000000000002
2295,0.22601999999999997
2296,0.21968000000000001
2297,0.21123000000000003
2298,0.20390999999999998
2299,0.19995
2300,0.19375
2301,0.18529
2302,0.17895999999999998
2303,0.17051
2304,0.16418
2305,0.15475
2306,0.14631
2307,0.13999
2308,0.13155999999999998
2309,0.12525
2310,0.11682999999999999
2311,0.11052000000000001
2312,0.10212
2313,0.095817
2314,0.08966299999999999
2315,0.08664
2316,0.078224
2317,0.07191499999999999
2318,0.063511
2319,0.057210000000000004
2320,0.048813
2321,0.04252
2322,0.033113
2323,0.026824
2324,0.019514
2325,0.014347
2326,0.0091902
2327,0.0028951999999999997
2328,-0.005492800000000001
2329,-0.01178
2330,-0.021185
2331,-0.027466
2332,-0.035838
2333,-0.039992
2334,-0.046194
2335,-0.051410000000000004
2336,-0.059788
2337,-0.06607
2338,-0.07547000000000001
2339,-0.081747
2340,-0.090107
2341,-0.096375
2342,-0.10260999999999999
2343,-0.1057
2344,-0.11407
2345,-0.12035
2346,-0.12871
2347,-0.13706
2348,-0.14436
2349,-0.15270999999999998
2350,-0.15897
2351,-0.1673
2352,-0.17252
2353,-0.17879
2354,-0.18295999999999998
2355,-0.1913
2356,-0.19755999999999999
2357,-0.20694
2358,-0.21319000000000002
2359,-0.22152
2360,-0.22776
2361,-0.23606999999999997
2362,-0.2423
2363,-0.24964
2364,-0.25697
2365,-0.26634
2366,-0.27258000000000004
2367,-0.28195
2368,-0.28817
2369,-0.29646999999999996
2370,-0.30269
2371,-0.30903
2372,-0.3143
2373,-0.32261
2374,-0.32883
2375,-0.33712
2376,-0.34334000000000003
2377,-0.35269
2378,-0.3589
2379,-0.36717
2380,-0.37337
2381,-0.38163
2382,-0.38781
2383,-0.39605999999999997
2384,-0.39933
2385,-0.40574
2386,-0.414
2387,-0.42018999999999995
2388,-0.42844
2389,-0.43571000000000004
2390,-0.44395
2391,-0.45011999999999996
2392,-0.45833999999999997
2393,-0.4645
2394,-0.47271
2395,-0.47886000000000006
2396,-0.48705
2397,-0.4932
2398,-0.50137
2399,-0.5075
2400,-0.51567
2401,-0.51975
2402,-0.5263100000000001
2403,-0.52968
2404,-0.53786
2405,-0.54398
2406,-0.55214
2407,-0.5582600000000001
2408,-0.5675399999999999
2409,-0.57365
2410,-0.58178
2411,-0.5878800000000001
2412,-0.596
2413,-0.6020800000000001
2414,-0.6101800000000001
2415,-0.61625
2416,-0.62433
2417,-0.62985
2418,-0.63651
2419,-0.64258
2420,-0.65068
2421,-0.65674
2422,-0.66598
2423,-0.67204
2424,-0.6801
2425,-0.6853
2426,-0.69201
2427,-0.69839
2428,-0.70444
2429,-0.7125
2430,-0.71972
2431,-0.72777
2432,-0.7338
2433,-0.74183
2434,-0.74622
2435,-0.7529600000000001
2436,-0.75817
2437,-0.7662100000000001
2438,-0.77342
2439,-0.7814399999999999
2440,-0.78583
2441,-0.7925800000000001
2442,-0.79779
2443,-0.80582
2444,-0.81303
2445,-0.82105
2446,-0.82626
2447,-0.8330200000000001
2448,-0.8374
2449,-0.84544
2450,-0.85145
2451,-0.8606600000000001
2452,-0.86667
2453,-0.8746700000000001
2454,-0.88066
2455,-0.8862700000000001
2456,-0.89187
2457,-0.90107
2458,-0.90707
2459,-0.9162600000000001
2460,-0.92225
2461,-0.9310700000000001
2462,-0.9346700000000001
2463,-0.9426700000000001
2464,-0.9498700000000001
2465,-0.95785
2466,-0.96383
2467,-0.9726600000000001
2468,-0.9802700000000001
2469,-0.98626
2470,-0.99424
2471,-1.0014
2472,-1.0098
2473,-1.0155
2474,-1.0239
2475,-1.0298
2476,-1.0390000000000001
2477,-1.045
2478,-1.0546
2479,-1.0602
2480,-1.0654
2481,-1.0714
2482,-1.0794
2483,-1.0866
2484,-1.0945
2485,-1.1004
2486,-1.1076
2487,-1.1133
2488,-1.1229
2489,-1.1289
2490,-1.138
2491,-1.1439
2492,-1.1491
2493,-1.1548
2494,-1.1625
2495,-1.1684
2496,-1.1776
2497,-1.1835
2498,-1.1907
2499,-1.1964
2500,-1.2021
2501,-1.208
2502,-1.2171
2503,-1.2229999999999999
2504,-1.2309
2505,-1.2366
2506,-1.2436
2507,-1.2515
2508,-1.2574
2509,-1.2665
2510,-1.2724
2511,-1.2794
2512,-1.2851
2513,-1.2943
2514,-1.2994
2515,-1.3044
2516,-1.3108
2517,-1.32
2518,-1.3252
2519,-1.3321
2520,-1.3365
2521,-1.3445
2522,-1.3516
2523,-1.3595
2524,-1.3655
2525,-1.3724
2526,-1.3781
2527,-1.3872
2528,-1.3924
2529,-1.3993
2530,-1.4058
2531,-1.4149
2532,-1.4194
2533,-1.4263
2534,-1.4314
2535,-1.4406
2536,-1.4463
2537,-1.4551
2538,-1.4611
2539,-1.4707
2540,-1.4763
2541,-1.4827
2542,-1.4887
2543,-1.4967
2544,-1.5039
2545,-1.5098
2546,-1.5155
2547,-1.5211
2548,-1.5303
2549,-1.5363
2550,-1.5454
2551,-1.5514
2552,-1.5551
2553,-1.5607
2554,-1.5699
2555,-1.5759
2556,-1.5838
2557,-1.591
2558,-1.5989
2559,-1.6048
2560,-1.6145
2561,-1.6182
2562,-1.6273
2563,-1.6333
2564,-1.6411
2565,-1.6469999999999998
2566,-1.6562
2567,-1.662
2568,-1.6685
2569,-1.6742
2570,-1.6826
2571,-1.6885
2572,-1.6964
2573,-1.7022
2574,-1.7113
2575,-1.7171
2576,-1.7249
2577,-1.7307
2578,-1.7384
2579,-1.7442
2580,-1.7519
2581,-1.7576
2582,-1.7653
2583,-1.7718
2584,-1.7790000000000001
2585,-1.7842
2586,-1.7918
2587,-1.7975
2588,-1.8051
2589,-1.8127
2590,-1.8197
2591,-1.8273
2592,-1.8329
2593,-1.8404
2594,-1.8459999999999999
2595,-1.8534
2596,-1.8566
2597,-1.8642
2598,-1.8707
2599,-1.8781
2600,-1.8837
2601,-1.891
2602,-1.8966
2603,-1.9053
2604,-1.9108
2605,-1.9181
2606,-1.9235
2607,-1.9307
2608,-1.9361
2609,-1.9459
2610,-1.9504
2611,-1.9591
2612,-1.9644
2613,-1.9715
2614,-1.9769
2615,-1.9854
2616,-1.9907
2617,-1.9977
2618,-2.0029
2619,-2.0097
2620,-2.0161
2621,-2.0225
2622,-2.0277
2623,-2.0346
2624,-2.0398
2625,-2.0466
2626,-2.0517
2627,-2.0584
2628,-2.065
2629,-2.0717
2630,-2.0783
2631,-2.0832
2632,-2.0897
2633,-2.0946
2634,-2.101
2635,-2.1077
2636,-2.1127
2637,-2.1193
2638,-2.1256
2639,-2.1304
2640,-2.1367
2641,-2.1413
2642,-2.1475
2643,-2.1521
2644,-2.1599
2645,-2.1644
2646,-2.1703
2647,-2.1747
2648,-2.1805
2649,-2.1848
2650,-2.1905
2651,-2.1947
2652,-2.2002
2653,-2.2043
2654,-2.2097
2655,-2.2136
2656,-2.2188
2657,-2.2227
2658,-2.2278
2659,-2.2315
2660,-2.2364
2661,-2.242
2662,-2.2512
2663,-2.2576
2664,-2.2623
2665,-2.2658
2666,-2.2704
2667,-2.2737
2668,-2.2781
2669,-2.2823
2670,-2.2875
2671,-2.2916
2672,-2.2945
2673,-2.2984
2674,-2.3012
2675,-2.3048
2676,-2.3074
2677,-2.3108
2678,-2.3132
2679,-2.3164
2680,-2.3187
2681,-2.3216
2682,-2.3237
2683,-2.3263
2684,-2.3282
2685,-2.3306
2686,-2.3323
2687,-2.3345
2688,-2.336
2689,-2.3379
2690,-2.3392
2691,-2.3408
2692,-2.3419
2693,-2.3432
2694,-2.3441
2695,-2.3451
2696,-2.3458
2697,-2.3465
2698,-2.347
2699,-2.3475
2700,-2.3477
2701,-2.3479
2702,-2.3479
2703,-2.3479
2704,-2.3479
2705,-2.3479
2706,-2.3479
2707,-2.3479
2708,-2.3479
