time,value
0,-1.0874
1,-1.0874
2,-1.0874
3,-1.0874
4,-1.0874
5,-1.0874
6,-1.0874
7,-1.0874
8,-1.0874
9,-1.0874
10,-1.0874
11,-1.0874
12,-1.0874
13,-1.0874
14,-1.0874
15,-1.0874
16,-1.0874
17,-1.0874
18,-1.0874
19,-1.0874
20,-1.0874
21,-1.0874
22,-1.0874
23,-1.0874
24,-1.0874
25,-1.0874
26,-1.0874
27,-0.28253
28,1.4881
29,1.0052
30,0.6832699999999999
31,1.3271
32,2.1319999999999997
33,1.6491
34,2.2929
35,2.0515
36,1.9709999999999999
37,1.9709999999999999
38,2.2125
39,1.8905
40,1.5686
41,1.6491
42,1.0857
43,0.84424
44,1.0052
45,1.0052
46,0.6832699999999999
47,0.28085
48,-0.36301
49,-0.28253
50,-0.36301
51,-0.28253
52,-0.28253
53,-0.36301
54,-0.28253
55,-0.36301
56,-0.28253
57,-0.36301
58,-0.28253
59,-0.36301
60,-0.28253
61,-0.28253
62,-0.36301
63,-0.28253
64,0.76375
65,-0.20205
66,-0.12155999999999999
67,-0.28253
68,-0.20205
69,-0.28253
70,1.0857
71,1.1662
72,0.84424
73,0.44182
74,0.76375
75,0.84424
76,0.6027899999999999
77,0.36134
78,0.5223
79,0.6027899999999999
80,0.20037
81,0.5223
82,0.36134
83,0.28085
84,0.5223
85,0.11989000000000001
86,0.44182
87,0.36134
88,0.20037
89,0.5223
90,0.36134
91,-0.52398
92,-1.0874
93,-1.0874
94,-1.0874
95,-1.0874
