time,value
0,-0.58512
1,-1.2163
2,-0.58512
3,-0.58512
4,-1.2163
5,-0.58512
6,-0.58512
7,-0.58512
8,-1.2163
9,-0.58512
10,-0.58512
11,-0.58512
12,-1.2163
13,-0.58512
14,-0.58512
15,-1.2163
16,-0.58512
17,-0.58512
18,-1.2163
19,-0.58512
20,-0.58512
21,-1.2163
22,-0.58512
23,-1.2163
24,-0.58512
25,-1.2163
26,-0.58512
27,-1.2163
28,-0.58512
29,-1.2163
30,-0.58512
31,-1.2163
32,-0.58512
33,-1.2163
34,-0.58512
35,-1.2163
36,-0.58512
37,-1.2163
38,-0.58512
39,-1.2163
40,-0.58512
41,-1.2163
42,-0.58512
43,-0.58512
44,-1.2163
45,-0.58512
46,-1.2163
47,-0.58512
48,-1.2163
49,-0.58512
50,-0.58512
51,-1.2163
52,-0.58512
53,0.046021
54,1.3083
55,0.67716
56,1.3083
57,1.3083
58,0.67716
59,1.3083
60,1.3083
61,0.67716
62,1.3083
63,1.3083
64,0.67716
65,1.3083
66,1.3083
67,0.67716
68,1.3083
69,1.3083
70,0.67716
71,1.3083
72,0.67716
73,1.3083
74,1.3083
75,0.67716
76,1.3083
77,1.3083
78,0.67716
79,1.3083
80,1.3083
81,1.3083
82,0.67716
83,1.3083
84,1.3083
85,1.3083
86,0.67716
87,1.3083
88,1.3083
89,1.3083
90,0.67716
91,1.3083
92,0.67716
93,1.3083
94,0.67716
95,-0.58512
