time,value
0,0.93066
1,0.8476299999999999
2,0.94884
3,0.99828
4,0.8393799999999999
5,0.83114
6,0.8279299999999999
7,0.8419200000000001
8,0.9486600000000001
9,0.96788
10,0.8457399999999999
11,0.94376
12,0.78265
13,0.77237
14,0.74767
15,0.7899
16,0.8214299999999999
17,0.91481
18,0.87211
19,0.89355
20,0.9198799999999999
21,0.9567399999999999
22,0.98592
23,0.96442
24,0.93806
25,0.9806299999999999
26,0.99826
27,1.0198
28,1.0597
29,1.0590000000000002
30,0.97805
31,1.0535
32,1.0474
33,0.9907100000000001
34,0.96654
35,0.8214
36,0.70554
37,0.24723
38,-0.8517299999999999
39,-1.0519
40,-1.0399
41,-1.2734
42,-2.1145
43,-2.1644
44,-2.5278
45,-3.1187
46,-3.0661
47,-3.0067
48,-3.0709
49,-2.7275
50,-2.3191
51,-2.1386
52,-2.1653
53,-1.4085
54,-0.93186
55,-1.0411
56,-0.95434
57,-0.45951000000000003
58,-0.27688
59,-0.20875
60,0.14488
61,0.4016
62,0.24656999999999998
63,0.28197
64,-0.0076603999999999995
65,-0.11649000000000001
66,0.47713999999999995
67,-0.26754
68,-1.0489
69,-1.1014
70,-0.70709
71,-0.31565
72,-0.45282
73,-0.90953
74,-0.82457
75,-0.6549699999999999
76,-0.68983
77,-0.42585
78,-0.32291
79,-0.5002300000000001
80,-0.62661
81,-0.71511
82,-0.6805100000000001
83,-0.64671
84,-0.53115
85,-0.51359
86,-0.6655300000000001
87,-0.55803
88,-0.51556
89,-0.41362
90,-0.50063
91,-0.54376
92,-0.5792
93,-0.42721000000000003
94,-0.29051
95,-0.44847
96,-0.46563000000000004
97,-0.44778
98,-0.4195
99,-0.41476999999999997
100,-0.37223
101,-0.43703000000000003
102,-0.46957
103,-0.4618
104,-0.45395
105,-0.50626
106,-0.54338
107,-0.40073000000000003
108,-0.29722
109,-0.3793
110,-0.44301999999999997
111,-0.39621999999999996
112,-0.29641
113,-0.37699
114,-0.34345
115,-0.28575
116,-0.38039
117,-0.2378
118,-0.11880999999999999
119,-0.15164
120,-0.3348
121,-0.26141
122,0.016737000000000002
123,-0.40086
124,-0.37979
125,-0.16735
126,-0.0074882
127,0.035572
128,0.1357
129,0.21308000000000002
130,0.22318000000000002
131,0.53872
132,0.49446
133,-0.10553
134,-0.07357999999999999
135,-0.29319
136,-1.1353
137,-1.0037
138,-0.8284299999999999
139,-1.7719999999999998
140,-2.9605
141,-2.9405
142,-3.4814
143,-4.2223
144,-3.4007
145,-3.1164
146,-3.5027
147,-2.5455
148,-1.7842
149,-1.6189
150,-1.8837
151,-1.7287
152,-1.5956
153,-1.5719999999999998
154,-1.1763
155,-0.94839
156,-0.59521
157,-0.25206
158,0.029866000000000004
159,0.00049857
160,0.19543
161,0.43755
162,1.0219
163,1.5279
164,2.1272
165,2.3318
166,1.5951
167,1.1747
168,1.0196
169,0.78866
170,0.5665399999999999
171,-0.023405000000000002
172,-0.44504
173,0.046327
174,0.31672
175,0.52455
176,0.61771
177,0.8833799999999999
178,1.0566
179,1.1218
180,1.183
181,0.9878399999999999
182,0.7472300000000001
183,0.65132
184,0.46756000000000003
185,0.33895
186,0.43341
187,0.41468999999999995
188,0.49899
189,0.5672699999999999
190,0.58496
191,0.64126
192,0.74887
193,0.795
194,0.78622
195,0.78997
196,0.68477
197,0.56024
198,0.49756999999999996
199,0.44353000000000004
200,0.44232
201,0.48756000000000005
202,0.6197699999999999
203,0.66276
204,0.66446
205,0.63764
206,0.47471
207,0.64798
208,0.6274
209,0.49483999999999995
210,0.5219199999999999
211,0.51093
212,0.51069
213,0.59428
214,0.45532
215,0.57144
216,0.45111
217,0.45115
218,0.43704
219,0.49235
220,0.45253999999999994
221,0.44705
222,0.584
223,0.51
224,0.62065
225,0.62575
226,0.55106
227,0.46816
228,0.47606000000000004
229,0.47152
230,0.46913
231,0.61798
232,0.56265
233,0.46673000000000003
234,0.35453
235,0.46461
236,0.44475
237,0.54597
238,0.41305
239,0.40034000000000003
240,0.38025
241,0.2533
242,0.3768
243,0.42372
244,0.5977600000000001
245,0.42349
246,0.42541
247,0.42172
248,0.42971000000000004
249,0.41828999999999994
250,0.41766000000000003
251,0.41345
252,0.42178000000000004
253,0.42395
254,0.41421
255,0.4078
256,0.2642
257,0.57787
258,0.25408000000000003
259,0.4189
260,0.42252
261,0.42983999999999994
262,0.42183000000000004
263,0.29827
264,0.29948
265,0.23369
266,0.22198
267,0.22841999999999998
268,0.40729
269,0.58167
270,0.64879
271,0.40981999999999996
272,0.41303999999999996
273,0.41325
274,0.24391999999999997
275,0.24236999999999997
276,0.23797
277,0.23353000000000002
278,0.40021
279,0.39061999999999997
280,0.46593
281,0.3972
282,0.21644000000000002
283,0.21300999999999998
284,0.21734
285,0.22136999999999998
286,0.2183
287,0.22208000000000003
288,0.39255999999999996
289,0.38111999999999996
290,0.37265
291,0.36888000000000004
292,0.37059000000000003
293,0.38209
294,0.38794
295,0.56182
296,0.55599
297,0.54086
298,0.37121
299,0.19833
