time,value
0,-0.19569
1,-0.19569
2,-0.19569
3,-0.19569
4,-0.19569
5,-0.19569
6,-0.19569
7,-0.19569
8,-0.19569
9,-0.19569
10,-0.19569
11,-0.19569
12,-0.19569
13,-0.19569
14,-0.19569
15,-0.19569
16,-0.19569
17,-0.19569
18,-0.19569
19,-0.19569
20,-0.19569
21,-0.19569
22,-0.19569
23,-0.19569
24,-0.19569
25,-0.19569
26,-0.19569
27,-0.19569
28,-0.19569
29,-0.19569
30,-0.19569
31,-0.19569
32,-0.19569
33,-0.19569
34,-0.19569
35,-0.19569
36,-0.19569
37,-0.19569
38,-0.19569
39,-0.19569
40,-0.19569
41,-0.19569
42,-0.19569
43,-0.19569
44,-0.19569
45,-0.19569
46,-0.19569
47,-0.19569
48,-0.19569
49,-0.19569
50,-0.19569
51,-0.19569
52,-0.19569
53,-0.19569
54,-0.19569
55,-0.19569
56,1.8362
57,-0.19569
58,-0.19569
59,-0.19569
60,-0.19569
61,-0.19569
62,-0.19569
63,-0.19569
64,-0.19569
65,-0.19569
66,-0.19569
67,-0.19569
68,-0.19569
69,-0.19569
70,-0.19569
71,-0.19569
72,0.7311300000000001
73,7.7892
74,3.6719999999999997
75,3.6719999999999997
76,-0.088746
77,-0.19569
78,-0.19569
79,-0.19569
80,-0.19569
81,-0.19569
82,-0.19569
83,-0.19569
84,-0.19569
85,-0.19569
86,-0.19569
87,-0.19569
88,-0.19569
89,-0.19569
90,-0.19569
91,-0.19569
92,-0.19569
93,-0.19569
94,-0.19569
95,-0.19569
