time,value
0,1.6878
1,1.6317
2,1.5499
3,1.4679
4,1.386
5,1.3037
6,1.2211
7,1.148
8,1.0659
9,0.9838600000000001
10,0.90191
11,0.8200299999999999
12,0.73754
13,0.65654
14,0.57493
15,0.49258
16,0.41208
17,0.32985
18,0.24823
19,0.16699
20,0.085711
21,0.0050257
22,-0.07543
23,-0.15623
24,-0.23709000000000002
25,-0.31840999999999997
26,-0.39784
27,-0.47836999999999996
28,-0.55735
29,-0.63539
30,-0.71453
31,-0.7942600000000001
32,-0.87029
33,-0.94701
34,-1.0215
35,-1.0956
36,-1.1698
37,-1.2367
38,-1.2988
39,-1.361
40,-1.4164
41,-1.4605
42,-1.4841
43,-1.5109
44,-1.5056
45,-1.4909999999999999
46,-1.463
47,-1.4077
48,-1.3465
49,-1.285
50,-1.2253
51,-1.1541
52,-1.0807
53,-1.0055
54,-0.9302600000000001
55,-0.85616
56,-0.77681
57,-0.6973
58,-0.61768
59,-0.53995
60,-0.46055
61,-0.37954
62,-0.29996
63,-0.22050999999999998
64,-0.14025
65,-0.059164999999999995
66,0.022471
67,0.10181
68,0.18355
69,0.26468
70,0.34647
71,0.42758
72,0.50807
73,0.59021
74,0.67188
75,0.75573
76,0.83696
77,0.91876
78,0.9999600000000001
79,1.0825
80,1.1637
81,1.245
82,1.3267
83,1.409
84,1.4909
85,1.5726
86,1.6543
87,1.6879
88,1.6791
89,1.6230000000000002
90,1.5472
91,1.4677
92,1.3855
93,1.3039
94,1.2213
95,1.1478
96,1.0653
97,0.9829399999999999
98,0.9013399999999999
99,0.81897
100,0.7379899999999999
101,0.6563899999999999
102,0.5749
103,0.49261000000000005
104,0.41131
105,0.32998
106,0.24766
107,0.16599
108,0.083989
109,0.0033066000000000003
110,-0.07849199999999999
111,-0.15879000000000001
112,-0.24031999999999998
113,-0.32011999999999996
114,-0.39954
115,-0.48041000000000006
116,-0.5595899999999999
117,-0.63927
118,-0.71678
119,-0.79604
120,-0.87746
121,-0.9527
122,-1.0298
123,-1.102
124,-1.1758
125,-1.252
126,-1.3159
127,-1.3741
128,-1.4309
129,-1.4783
130,-1.5205
131,-1.5291
132,-1.5259
133,-1.5034
134,-1.4648
135,-1.4146
136,-1.355
137,-1.2901
138,-1.2209999999999999
139,-1.1491
140,-1.0754
141,-1.0027
142,-0.92256
143,-0.8476
144,-0.7689199999999999
145,-0.69204
146,-0.6122
147,-0.532
148,-0.45151
149,-0.37078
150,-0.29155
151,-0.21194000000000002
152,-0.13051
153,-0.048966
154,0.032682
155,0.11188
156,0.1938
157,0.27482
158,0.35674
159,0.43886000000000003
160,0.5200600000000001
161,0.60138
162,0.68283
163,0.76439
164,0.84641
165,0.92827
166,1.0103
167,1.0921
168,1.1741
169,1.2566
170,1.3386
171,1.4207
172,1.5033
173,1.5851
174,1.6661
175,1.7055
