time,value
0,2.0883
1,2.0486
2,2.0181
3,1.9841
4,1.9548
5,1.9308
6,1.9056
7,1.8767
8,1.8468
9,1.8125
10,1.7775
11,1.7416
12,1.7059
13,1.6693
14,1.6331
15,1.5963
16,1.5595
17,1.5228
18,1.4852
19,1.4484
20,1.4108
21,1.3745
22,1.3372
23,1.3009
24,1.2649
25,1.2291
26,1.1911
27,1.1549
28,1.1194
29,1.084
30,1.0473
31,1.0106
32,0.97406
33,0.93924
34,0.9012899999999999
35,0.86506
36,0.82816
37,0.7912399999999999
38,0.7536
39,0.71604
40,0.6769
41,0.6411399999999999
42,0.60544
43,0.57085
44,0.52817
45,0.48668999999999996
46,0.44966000000000006
47,0.41079
48,0.37394
49,0.33582
50,0.29653
51,0.25792
52,0.22145
53,0.18300999999999998
54,0.14400000000000002
55,0.10636
56,0.068156
57,0.029835000000000004
58,-0.010192
59,-0.048138
60,-0.08598
61,-0.12370999999999999
62,-0.16133
63,-0.19807
64,-0.23376
65,-0.26878
66,-0.30549
67,-0.33978
68,-0.37381
69,-0.4049
70,-0.43559
71,-0.46156
72,-0.48703
73,-0.50725
74,-0.5295300000000001
75,-0.55053
76,-0.56824
77,-0.5877600000000001
78,-0.6017
79,-0.6168100000000001
80,-0.62953
81,-0.64099
82,-0.65137
83,-0.66394
84,-0.67553
85,-0.68593
86,-0.69692
87,-0.70721
88,-0.71818
89,-0.7290300000000001
90,-0.74465
91,-0.7573300000000001
92,-0.76832
93,-0.78404
94,-0.80357
95,-0.8361200000000001
96,-0.8743700000000001
97,-0.9108799999999999
98,-0.9437
99,-0.97909
100,-1.0149
101,-1.0531
102,-1.0907
103,-1.1334
104,-1.1745
105,-1.217
106,-1.2613
107,-1.3018
108,-1.3444
109,-1.3886
110,-1.4154
111,-1.4398
112,-1.4669999999999999
113,-1.485
114,-1.5055
115,-1.5190000000000001
116,-1.5317
117,-1.5428
118,-1.5556
119,-1.5598
120,-1.5627
121,-1.5616
122,-1.5573
123,-1.55
124,-1.5432
125,-1.5307
126,-1.5149
127,-1.5003
128,-1.4797
129,-1.4598
130,-1.4365
131,-1.4124
132,-1.3847
133,-1.3567
134,-1.3278
135,-1.2971
136,-1.2664
137,-1.2352
138,-1.2021
139,-1.1682
140,-1.1333
141,-1.0963
142,-1.0577
143,-1.0176
144,-0.975
145,-0.93304
146,-0.8915299999999999
147,-0.8492200000000001
148,-0.80912
149,-0.76768
150,-0.72754
151,-0.6877800000000001
152,-0.64964
153,-0.61347
154,-0.57905
155,-0.54503
156,-0.52617
157,-0.51178
158,-0.50332
159,-0.5077
160,-0.52066
161,-0.55953
162,-0.55684
163,-0.51684
164,-0.47688
165,-0.43677
166,-0.39653
167,-0.35617
168,-0.31575
169,-0.27528
170,-0.23487
171,-0.19437000000000001
172,-0.15391
173,-0.11356
174,-0.073339
175,-0.033183
176,0.0070236000000000005
177,0.047278
178,0.087572
179,0.12799000000000002
180,0.16852999999999999
181,0.2092
182,0.25004
183,0.29102
184,0.33213000000000004
185,0.37361
186,0.41521
187,0.45681000000000005
188,0.49604
189,0.53578
190,0.57821
191,0.62085
192,0.6631600000000001
193,0.7055600000000001
194,0.7480899999999999
195,0.7900699999999999
196,0.83226
197,0.8747299999999999
198,0.9159799999999999
199,0.95786
200,1.0001
201,1.0418
202,1.0831
203,1.1233
204,1.1623
205,1.193
206,1.188
207,1.1740000000000002
208,1.1577
209,1.1427
210,1.1252
211,1.1082
212,1.087
213,1.0711
214,1.0556
215,1.0407
216,1.0224
217,1.0018
218,0.9768899999999999
219,0.95232
220,0.92819
221,0.90355
222,0.86692
223,0.83852
224,0.8066
225,0.78669
226,0.79168
227,0.7972199999999999
228,0.80804
229,0.83367
230,0.8710100000000001
231,0.91345
232,0.95057
233,0.99367
234,1.0314
235,1.0657
236,1.0958
237,1.1205
238,1.1477
239,1.1740000000000002
240,1.1898
241,1.2107
242,1.2238
243,1.2352
244,1.2436
245,1.2570000000000001
246,1.2573
247,1.2437
248,1.2092
249,1.1716
250,1.1307
251,1.0897
252,1.0487
253,1.0066
254,0.96305
255,0.91589
256,0.8669600000000001
257,0.81857
258,0.7693
259,0.7205699999999999
260,0.67101
261,0.62164
262,0.5744100000000001
263,0.52928
264,0.48098
265,0.43353
266,0.39076
267,0.34729
268,0.29646
269,0.25345
270,0.21241999999999997
271,0.16563
272,0.12
273,0.075909
274,0.03171
275,-0.010248
276,-0.054811
277,-0.098054
278,-0.14039000000000001
279,-0.18437
280,-0.22646
281,-0.26841
282,-0.30704000000000004
283,-0.34365
284,-0.36016
285,-0.31940999999999997
286,-0.27052
287,-0.2274
288,-0.17954
289,-0.13307
290,-0.10392
291,-0.094677
292,-0.11022
293,-0.11997999999999999
294,-0.11692000000000001
295,-0.10428
296,-0.082312
297,-0.055504
298,-0.029312
299,0.00013330000000000001
300,0.036062000000000004
301,0.06853200000000001
302,0.089479
303,0.11074
304,0.12850999999999999
305,0.1273
306,0.099643
307,0.07141
308,0.031346
309,-0.015374
310,-0.057967
311,-0.10590999999999999
312,-0.15365
313,-0.19925
314,-0.2464
315,-0.29420999999999997
316,-0.34493
317,-0.39273
318,-0.44051999999999997
319,-0.4883
320,-0.5331100000000001
321,-0.58086
322,-0.62859
323,-0.6793
324,-0.72701
325,-0.77772
326,-0.8254100000000001
327,-0.8669899999999999
328,-0.9176700000000001
329,-0.96465
330,-1.0147
331,-1.0647
332,-1.1067
333,-1.1464
334,-1.1909
335,-1.2321
336,-1.2633
337,-1.291
338,-1.3135
339,-1.3438
340,-1.3747
341,-1.4015
342,-1.4229
343,-1.4384
344,-1.4527
345,-1.483
346,-1.5031
347,-1.5207
348,-1.5314
349,-1.5395
350,-1.5401
351,-1.5278
352,-1.5403
353,-1.5398
354,-1.5333
355,-1.5122
356,-1.4876
357,-1.4636
358,-1.4359
359,-1.3958
360,-1.3835
361,-1.3846
362,-1.3771
363,-1.3721
364,-1.3694
365,-1.36
366,-1.3486
367,-1.3309
368,-1.3074
369,-1.3079
370,-1.2932
371,-1.2755
372,-1.2676
373,-1.2472
374,-1.2264
375,-1.2183
376,-1.1963
377,-1.1673
378,-1.1425
379,-1.1119
380,-1.0803
381,-1.0482
382,-1.0143
383,-0.97993
384,-0.94411
385,-0.90441
386,-0.87166
387,-0.83998
388,-0.80567
389,-0.76862
390,-0.73349
391,-0.69857
392,-0.66254
393,-0.6261
394,-0.58839
395,-0.5525800000000001
396,-0.51571
397,-0.47905
398,-0.44228999999999996
399,-0.40514
400,-0.36735999999999996
401,-0.33155999999999997
402,-0.29466
403,-0.25756999999999997
404,-0.22029
405,-0.18285
406,-0.14537
407,-0.10837000000000001
408,-0.070431
409,-0.032628
410,0.005853100000000001
411,0.044072
412,0.082304
413,0.12117
414,0.1596
415,0.19812000000000002
416,0.23675
417,0.2758
418,0.31484
419,0.35379
420,0.39271
421,0.43200000000000005
422,0.47136999999999996
423,0.51044
424,0.54994
425,0.5895100000000001
426,0.6291399999999999
427,0.66882
428,0.70855
429,0.7481
430,0.7875800000000001
431,0.82709
432,0.8669100000000001
433,0.90694
434,0.9467
435,0.9867799999999999
436,1.0271
437,1.0675
438,1.1033
439,1.1438
440,1.1845
441,1.2255
442,1.2663
443,1.3068
444,1.3471
445,1.3880000000000001
446,1.4291
447,1.4698
448,1.5103
449,1.5519
450,1.594
451,1.6342
452,1.6742
453,1.7163
454,1.7582
455,1.8002
456,1.8428
457,1.886
458,1.9248
459,1.9638
460,2.0025
461,2.0454
462,2.0774
