time,value
0,-2.2816
1,-2.2816
2,-2.2816
3,-2.2843
4,-2.2843
5,-2.2843
6,-2.2843
7,-2.2871
8,-2.2953
9,-2.3007
10,-2.3034
11,-2.3031
12,-2.3028
13,-2.3022
14,-2.3016
15,-2.3009
16,-2.3001
17,-2.2991
18,-2.2981
19,-2.2969
20,-2.2957
21,-2.2938
22,-2.2923
23,-2.2907
24,-2.289
25,-2.2872
26,-2.2852
27,-2.2832
28,-2.2811
29,-2.278
30,-2.2757
31,-2.2732
32,-2.2706
33,-2.2680000000000002
34,-2.2652
35,-2.2624
36,-2.2595
37,-2.2554
38,-2.2522
39,-2.249
40,-2.2457
41,-2.2423
42,-2.2388
43,-2.2352
44,-2.2315
45,-2.2265
46,-2.2227
47,-2.2212
48,-2.2148
49,-2.2107
50,-2.2066
51,-2.2024
52,-2.2004
53,-2.1946
54,-2.1878
55,-2.1856
56,-2.181
57,-2.1763
58,-2.1716
59,-2.1669
60,-2.162
61,-2.1533
62,-2.1483
63,-2.1433
64,-2.1382
65,-2.1353
66,-2.1301
67,-2.1248
68,-2.1195
69,-2.1103
70,-2.1069999999999998
71,-2.1015
72,-2.096
73,-2.0905
74,-2.0849
75,-2.0792
76,-2.0736
77,-2.0678
78,-2.0679
79,-2.0679
80,-2.064
81,-2.0582
82,-2.0523
83,-2.0464
84,-2.0404
85,-2.0344
86,-2.0304
87,-2.0267
88,-2.0206
89,-2.0146
90,-2.0085
91,-2.0024
92,-1.9962
93,-1.9882
94,-1.9799
95,-1.9736
96,-1.9674
97,-1.9609999999999999
98,-1.9547
99,-1.9483
100,-1.9445
101,-1.9372
102,-1.9277
103,-1.9214
104,-1.915
105,-1.9086
106,-1.9021
107,-1.8940000000000001
108,-1.8875
109,-1.881
110,-1.8723
111,-1.8657
112,-1.8597
113,-1.8526
114,-1.8455
115,-1.8389
116,-1.8324
117,-1.8258
118,-1.817
119,-1.8103
120,-1.8021
121,-1.7954
122,-1.7887
123,-1.7819999999999998
124,-1.7752
125,-1.7685
126,-1.7579
127,-1.7526
128,-1.7479
129,-1.7418
130,-1.7351
131,-1.7283
132,-1.7215
133,-1.7147
134,-1.7056
135,-1.6973
136,-1.6904
137,-1.6836
138,-1.6767
139,-1.6698
140,-1.6628
141,-1.6544
142,-1.6463
143,-1.6387
144,-1.6318
145,-1.6249
146,-1.6179
147,-1.611
148,-1.604
149,-1.597
150,-1.5886
151,-1.5792
152,-1.5722
153,-1.5652
154,-1.5581
155,-1.5497
156,-1.5431
157,-1.5389
158,-1.5319
159,-1.5225
160,-1.5154
161,-1.507
162,-1.4999
163,-1.4928
164,-1.4857
165,-1.4806
166,-1.4741
167,-1.4642
168,-1.4571
169,-1.4487
170,-1.4416
171,-1.4355
172,-1.429
173,-1.4225
174,-1.4178
175,-1.4083
176,-1.3998
177,-1.3927
178,-1.3856
179,-1.3785
180,-1.3713
181,-1.3639
182,-1.3598
183,-1.3523
184,-1.3452
185,-1.3381
186,-1.3309
187,-1.3238
188,-1.3153
189,-1.3081
190,-1.3009
191,-1.2913
192,-1.2841
193,-1.278
194,-1.2741
195,-1.2677
196,-1.2605
197,-1.2533
198,-1.2448
199,-1.2352
200,-1.2291
201,-1.2228
202,-1.2188
203,-1.2116
204,-1.2044
205,-1.1972
206,-1.1887
207,-1.1791
208,-1.1719
209,-1.1633
210,-1.1583
211,-1.1520000000000001
212,-1.1435
213,-1.1363
214,-1.129
215,-1.1194
216,-1.1121
217,-1.1049
218,-1.0976
219,-1.0903
220,-1.0818
221,-1.0745
222,-1.0672
223,-1.0599
224,-1.0502
225,-1.0428
226,-1.0355
227,-1.0294
228,-1.0256
229,-1.0171
230,-1.0098
231,-1.0025
232,-0.99269
233,-0.98536
234,-0.9767899999999999
235,-0.96945
236,-0.9621
237,-0.9547399999999999
238,-0.9473799999999999
239,-0.94001
240,-0.93017
241,-0.9227799999999999
242,-0.9153899999999999
243,-0.90681
244,-0.9007799999999999
245,-0.8947299999999999
246,-0.88735
247,-0.8799600000000001
248,-0.8701
249,-0.8627
250,-0.8553
251,-0.8478899999999999
252,-0.84047
253,-0.83188
254,-0.82445
255,-0.81702
256,-0.8071
257,-0.79966
258,-0.7922100000000001
259,-0.78475
260,-0.77863
261,-0.77271
262,-0.76925
263,-0.76181
264,-0.75189
265,-0.74443
266,-0.73698
267,-0.72951
268,-0.72204
269,-0.71344
270,-0.70596
271,-0.69848
272,-0.6885
273,-0.68101
274,-0.67351
275,-0.66601
276,-0.6585
277,-0.65099
278,-0.64347
279,-0.63595
280,-0.6259100000000001
281,-0.61838
282,-0.6108399999999999
283,-0.6033
284,-0.59575
285,-0.5882
286,-0.58065
287,-0.57309
288,-0.563
289,-0.55648
290,-0.54891
291,-0.54132
292,-0.53374
293,-0.52615
294,-0.51855
295,-0.5180899999999999
296,-0.51862
297,-0.51558
298,-0.50795
299,-0.50032
300,-0.49268999999999996
301,-0.48505
302,-0.47741000000000006
303,-0.46976
304,-0.46211
305,-0.45288999999999996
306,-0.44523
307,-0.43659
308,-0.42891999999999997
309,-0.42126
310,-0.41358
311,-0.40591
312,-0.39823000000000003
313,-0.38799
314,-0.3803
315,-0.37261
316,-0.36491999999999997
317,-0.35723
318,-0.34953
319,-0.34181999999999996
320,-0.33412
321,-0.32384
322,-0.31519
323,-0.30817
324,-0.30534
325,-0.29669
326,-0.28899
327,-0.28129
328,-0.27264
329,-0.26236
330,-0.25465
331,-0.24694000000000002
332,-0.2425
333,-0.23711
334,-0.23265
335,-0.22495
336,-0.2163
337,-0.20603000000000002
338,-0.19738
339,-0.19292
340,-0.18750999999999998
341,-0.17887
342,-0.17117000000000002
343,-0.16347
344,-0.15575999999999998
345,-0.14549
346,-0.13777999999999999
347,-0.13007
348,-0.12235
349,-0.1137
350,-0.10597999999999999
351,-0.09825700000000001
352,-0.090534
353,-0.08023
354,-0.072498
355,-0.06385
356,-0.061087
357,-0.055729999999999995
358,-0.050582999999999996
359,-0.042863
360,-0.035136
361,-0.023913
362,-0.016184
363,-0.0084528
364,-0.00072082
365,0.005350199999999999
366,0.008111199999999999
367,0.013465000000000001
368,0.021186
369,0.02891
370,0.039213
371,0.047862
372,0.055590999999999995
373,0.063325
374,0.07106
375,0.078797
376,0.086537
377,0.095188
378,0.10142000000000001
379,0.10583
380,0.11357
381,0.1213
382,0.12903
383,0.13677
384,0.14451
385,0.15225
386,0.16258
387,0.17123
388,0.17898
389,0.18673
390,0.19449
391,0.20224
392,0.21
393,0.21775999999999998
394,0.22810999999999998
395,0.23588
396,0.24364
397,0.25140999999999997
398,0.25919000000000003
399,0.26696
400,0.27474
401,0.28252
402,0.29289
403,0.30068
404,0.30933
405,0.31366
406,0.31628
407,0.32493
408,0.33271
409,0.34049
410,0.35086
411,0.35864
412,0.36643000000000003
413,0.37422
414,0.38287
415,0.39066
416,0.39845
417,0.40624
418,0.41578000000000004
419,0.42358
420,0.43138000000000004
421,0.43918999999999997
422,0.447
423,0.4548
424,0.45228
425,0.45488999999999996
426,0.46271
427,0.47052
428,0.47834
429,0.48616000000000004
430,0.49316000000000004
431,0.49495
432,0.49673999999999996
433,0.5011399999999999
434,0.5124
435,0.5210600000000001
436,0.52971
437,0.53574
438,0.5391699999999999
439,0.5426
440,0.55125
441,0.55909
442,0.5643100000000001
443,0.5677300000000001
444,0.5677300000000001
445,0.5702
446,0.57267
447,0.57872
448,0.58654
449,0.59437
450,0.60219
451,0.61263
452,0.62046
453,0.62829
454,0.63694
455,0.64477
456,0.65261
457,0.65963
458,0.66828
459,0.67792
460,0.68577
461,0.69442
462,0.7014600000000001
463,0.70931
464,0.71716
465,0.72501
466,0.7328600000000001
467,0.74334
468,0.7511899999999999
469,0.75905
470,0.7669100000000001
471,0.76953
472,0.76718
473,0.76485
474,0.76252
475,0.75946
476,0.75718
477,0.75492
478,0.75342
479,0.74816
480,0.74027
481,0.73237
482,0.72448
483,0.71396
484,0.70607
485,0.69819
486,0.6903
487,0.68242
488,0.67377
489,0.66589
490,0.65801
491,0.6475
492,0.63963
493,0.63175
494,0.62388
495,0.616
496,0.61338
497,0.61075
498,0.60551
499,0.59424
500,0.58637
501,0.5785
502,0.5751
503,0.5717
504,0.5683
505,0.55965
506,0.55178
507,0.5412899999999999
508,0.53342
509,0.52818
510,0.52556
511,0.51875
512,0.51089
513,0.50302
514,0.49437
515,0.48651000000000005
516,0.4763
517,0.47396000000000005
518,0.46531000000000006
519,0.45743999999999996
520,0.44878999999999997
521,0.44092
522,0.43306000000000006
523,0.43073
524,0.42502
525,0.41713999999999996
526,0.40926
527,0.40139
528,0.39274000000000003
529,0.38487
530,0.377
531,0.36913
532,0.36233000000000004
533,0.35739
534,0.35322
535,0.34534000000000004
536,0.33747
537,0.32959
538,0.32172
539,0.31385
540,0.30257
541,0.2947
542,0.28684
543,0.27897
544,0.26954
545,0.26721
546,0.26042
547,0.25255
548,0.24205
549,0.2334
550,0.22553
551,0.21766
552,0.20979
553,0.20376
554,0.19881
555,0.19388
556,0.18261
557,0.17583
558,0.17092000000000002
559,0.16414
560,0.15625999999999998
561,0.14837
562,0.13973
563,0.13184
564,0.12355999999999999
565,0.12130999999999999
566,0.11341
567,0.10552
568,0.096876
569,0.088983
570,0.08109
571,0.08109
572,0.07846
573,0.073199
574,0.06531100000000001
575,0.062682
576,0.061926999999999996
577,0.055911
578,0.047268
579,0.038625
580,0.028105
581,0.020217
582,0.014959
583,0.014959
584,0.012694
585,0.007813200000000001
586,0.0055882
587,-0.0011558
588,-0.0090628
589,-0.019599000000000002
590,-0.028242000000000003
591,-0.036882
592,-0.041724000000000004
593,-0.046551
594,-0.054463
595,-0.062375
596,-0.070285
597,-0.080827
598,-0.08873400000000001
599,-0.097374
600,-0.10528
601,-0.11317999999999999
602,-0.12108
603,-0.12897999999999998
604,-0.13688
605,-0.1474
606,-0.14964
607,-0.15449000000000002
608,-0.16313
609,-0.17104
610,-0.17894000000000002
611,-0.18684
612,-0.19474
613,-0.20526999999999998
614,-0.21316999999999997
615,-0.22105999999999998
616,-0.22971
617,-0.2376
618,-0.24549
619,-0.25338
620,-0.26126
621,-0.27176999999999996
622,-0.27965999999999996
623,-0.28754
624,-0.29541
625,-0.30143000000000003
626,-0.30373
627,-0.30863
628,-0.31389
629,-0.32516
630,-0.33005
631,-0.33228
632,-0.33448
633,-0.33666999999999997
634,-0.34146
635,-0.3436
636,-0.34571
637,-0.34711
638,-0.3478
639,-0.34918000000000005
640,-0.35122
641,-0.35324
642,-0.35126
643,-0.35126
644,-0.34926999999999997
645,-0.33865
646,-0.33465
647,-0.33394
648,-0.3299
649,-0.32255
650,-0.31722
651,-0.31644
652,-0.3183
653,-0.30824
654,-0.30024
655,-0.29223000000000005
656,-0.28423000000000004
657,-0.27621999999999997
658,-0.26881
659,-0.2608
660,-0.25279
661,-0.24478000000000003
662,-0.23735
663,-0.23642
664,-0.23815
665,-0.23012
666,-0.22266
667,-0.21898
668,-0.22063000000000002
669,-0.21313000000000001
670,-0.20294
671,-0.20185999999999998
672,-0.20344
673,-0.1959
674,-0.18784
675,-0.17978
676,-0.17223
677,-0.16416
678,-0.15341
679,-0.14534
680,-0.14365999999999998
681,-0.14245
682,-0.13804
683,-0.12996
684,-0.12189000000000001
685,-0.1138
686,-0.10303
687,-0.094947
688,-0.087341
689,-0.079256
690,-0.071171
691,-0.063084
692,-0.061784000000000006
693,-0.060458000000000005
694,-0.049664
695,-0.041569
696,-0.033473
697,-0.025374
698,-0.017279
699,-0.009179799999999998
700,-0.0010788
701,0.007019199999999999
702,0.011058
703,0.012417000000000001
704,0.02051
705,0.028602999999999996
706,0.036696
707,0.045245999999999995
708,0.053339
709,0.061435000000000003
710,0.072228
711,0.07492599999999999
712,0.077626
713,0.083024
714,0.091568
715,0.09202
716,0.095172
717,0.10372
718,0.11542000000000001
719,0.12128
720,0.12397999999999999
721,0.12397999999999999
722,0.13207
723,0.14062
724,0.14870999999999998
725,0.1568
726,0.16580999999999999
727,0.1699
728,0.17623
729,0.18431
730,0.1924
731,0.20049
732,0.20856999999999998
733,0.21666
734,0.22521999999999998
735,0.23600000000000002
736,0.24409
737,0.25218
738,0.26027
739,0.26836
740,0.27645
741,0.27784000000000003
742,0.28194
743,0.2905
744,0.29858
745,0.30667
746,0.31475
747,0.32284
748,0.33093
749,0.33901
750,0.3471
751,0.35789
752,0.36058
753,0.36328
754,0.36598
755,0.37406999999999996
756,0.38216
757,0.38755
758,0.38755
759,0.39294
760,0.40104
761,0.40913
762,0.41722
763,0.42532
764,0.43386
765,0.44196
766,0.45005
767,0.46085
768,0.46893999999999997
769,0.47703999999999996
770,0.48513
771,0.49323
772,0.50133
773,0.50942
774,0.51752
775,0.52832
776,0.53642
777,0.54452
778,0.5526300000000001
779,0.5607300000000001
780,0.5688300000000001
781,0.57693
782,0.58503
783,0.5958399999999999
784,0.6039399999999999
785,0.61205
786,0.62015
787,0.62826
788,0.63636
789,0.64447
790,0.65258
791,0.66338
792,0.66879
793,0.6714899999999999
794,0.6714899999999999
795,0.6796
796,0.68501
797,0.68501
798,0.68771
799,0.69852
800,0.70621
801,0.71433
802,0.72244
803,0.72702
804,0.72849
805,0.73039
806,0.73851
807,0.74663
808,0.7570600000000001
809,0.76518
810,0.76789
811,0.77059
812,0.7733
813,0.78142
814,0.78955
815,0.79496
816,0.79767
817,0.80038
818,0.8085
819,0.81662
820,0.82475
821,0.8328700000000001
822,0.84099
823,0.8491200000000001
824,0.85995
825,0.8684700000000001
826,0.87659
827,0.8847200000000001
828,0.89284
829,0.90097
830,0.9091
831,0.9172299999999999
832,0.92574
833,0.9296
834,0.93348
835,0.9416100000000001
836,0.94973
837,0.95785
838,0.96598
839,0.9741
840,0.98493
841,0.99306
842,1.0012
843,1.0093
844,1.0174
845,1.0256
846,1.0337
847,1.0418
848,1.0526
849,1.0526
850,1.0554
851,1.0635
852,1.0716
853,1.0767
854,1.079
855,1.0813
856,1.0918
857,1.0996
858,1.1073
859,1.1155
860,1.1158
861,1.1189
862,1.1274
863,1.1359
864,1.1467
865,1.1549
866,1.1626
867,1.165
868,1.1673
869,1.1697
870,1.1778
871,1.186
872,1.1968
873,1.2026
874,1.2057
875,1.2087
876,1.2172
877,1.225
878,1.2328
879,1.2406
880,1.2484
881,1.2534
882,1.2561
883,1.2643
884,1.2670000000000001
885,1.2697
886,1.2724
887,1.2806
888,1.2887
889,1.2996
890,1.3077
891,1.3158
892,1.324
893,1.3318
894,1.3399
895,1.3481
896,1.3562
897,1.3671
898,1.3752
899,1.3745
900,1.3763
901,1.381
902,1.3892
903,1.3973
904,1.4052
905,1.416
906,1.4151
907,1.4168
908,1.4247
909,1.4325
910,1.4343
911,1.4334
912,1.4326
913,1.4314
914,1.4306
915,1.4297
916,1.4289
917,1.4281
918,1.4273
919,1.4216
920,1.4134
921,1.4023
922,1.3941
923,1.3857
924,1.3822
925,1.3787
926,1.3706
927,1.3624
928,1.3542
929,1.3433
930,1.3351
931,1.327
932,1.3185
933,1.3104
934,1.3022
935,1.294
936,1.2858
937,1.2749
938,1.2715
939,1.2707
940,1.2623
941,1.2542
942,1.246
943,1.2378
944,1.2294
945,1.2185
946,1.2103
947,1.2071
948,1.2037
949,1.2005
950,1.1923
951,1.1841
952,1.176
953,1.1675
954,1.1566
955,1.1485
956,1.1401
957,1.1366
958,1.136
959,1.1278
960,1.1196
961,1.1114
962,1.1005
963,1.0924
964,1.0842
965,1.0759999999999998
966,1.0676
967,1.0594
968,1.0512
969,1.043
970,1.0321
971,1.024
972,1.0158
973,1.0076
974,1.0046
975,1.0046
976,0.9991899999999999
977,0.9910100000000001
978,0.9801
979,0.9719200000000001
980,0.9692
981,0.96647
982,0.96124
983,0.95306
984,0.9448799999999999
985,0.9367
986,0.92579
987,0.9176200000000001
988,0.90943
989,0.9012600000000001
990,0.8930799999999999
991,0.8849
992,0.87672
993,0.87376
994,0.87376
995,0.8655799999999999
996,0.8574
997,0.8492200000000001
998,0.84105
999,0.83809
1000,0.83514
1001,0.8321799999999999
1002,0.82106
1003,0.81287
1004,0.80469
1005,0.79651
1006,0.78833
1007,0.78561
1008,0.7824300000000001
1009,0.77425
1010,0.76335
1011,0.75517
1012,0.74698
1013,0.7388
1014,0.7306199999999999
1015,0.72244
1016,0.71426
1017,0.70608
1018,0.69518
1019,0.687
1020,0.67882
1021,0.67064
1022,0.66246
1023,0.65405
1024,0.6458699999999999
1025,0.63769
1026,0.62951
1027,0.61861
1028,0.61043
1029,0.60225
1030,0.59407
1031,0.5906600000000001
1032,0.58727
1033,0.5816
1034,0.5734199999999999
1035,0.5625100000000001
1036,0.55432
1037,0.54593
1038,0.53774
1039,0.52956
1040,0.5213800000000001
1041,0.5132
1042,0.5048
1043,0.4987
1044,0.49535
1045,0.48716000000000004
1046,0.47898
1047,0.47079
1048,0.46261
1049,0.45442
1050,0.44623999999999997
1051,0.43533
1052,0.42713999999999996
1053,0.41896000000000005
1054,0.41078000000000003
1055,0.40259
1056,0.3942
1057,0.38602
1058,0.37783
1059,0.36691999999999997
1060,0.35874
1061,0.35055
1062,0.34237
1063,0.33419
1064,0.32579
1065,0.32244
1066,0.32184
1067,0.31093000000000004
1068,0.30274
1069,0.29455
1070,0.28617
1071,0.27798
1072,0.2698
1073,0.26161
1074,0.25849
1075,0.25519000000000003
1076,0.24973
1077,0.24154
1078,0.23335
1079,0.22516
1080,0.21696999999999997
1081,0.20878000000000002
1082,0.2006
1083,0.19533
1084,0.19592
1085,0.18794
1086,0.17975
1087,0.17157
1088,0.16338
1089,0.1552
1090,0.14702
1091,0.1361
1092,0.12792
1093,0.11972999999999999
1094,0.11155
1095,0.10337
1096,0.095183
1097,0.086997
1098,0.08426900000000001
1099,0.081541
1100,0.073147
1101,0.064756
1102,0.056365
1103,0.047976
1104,0.045045999999999996
1105,0.042119
1106,0.033736
1107,0.025547
1108,0.017361
1109,0.014633000000000002
1110,0.011903
1111,0.0037171999999999995
1112,-0.0044688
1113,-0.012655
1114,-0.020841
1115,-0.029026999999999997
1116,-0.040139999999999995
1117,-0.048523000000000004
1118,-0.049102999999999994
1119,-0.052386
1120,-0.060578
1121,-0.068767
1122,-0.07167799999999999
1123,-0.07167799999999999
1124,-0.074586
1125,-0.07510599999999999
1126,-0.07560399999999999
1127,-0.075921
1128,-0.075921
1129,-0.07607699999999999
1130,-0.076378
1131,-0.07681
1132,-0.074619
1133,-0.07499600000000001
1134,-0.075349
1135,-0.06715
1136,-0.059059
1137,-0.056541999999999995
1138,-0.054110000000000005
1139,-0.051565999999999994
1140,-0.040626999999999996
1141,-0.032425
1142,-0.024222999999999998
1143,-0.016108
1144,-0.0079048
1145,0.00030018
1146,0.008502200000000001
1147,0.0083332
1148,0.010759000000000001
1149,0.01616
1150,0.024297
1151,0.029702999999999997
1152,0.029522000000000003
1153,0.0321
1154,0.031966
1155,0.031856
1156,0.037265
1157,0.045446
1158,0.050896
1159,0.053574000000000004
1160,0.059019
1161,0.067227
1162,0.075434
1163,0.083642
1164,0.094586
1165,0.10279
1166,0.111
1167,0.11921
1168,0.12195
1169,0.12468
1170,0.12742
1171,0.13563
1172,0.14382999999999999
1173,0.15478
1174,0.16025
1175,0.16297999999999999
1176,0.16572
1177,0.17118
1178,0.17939000000000002
1179,0.1876
1180,0.19580999999999998
1181,0.20675
1182,0.21495999999999998
1183,0.22316999999999998
1184,0.23138000000000003
1185,0.23958000000000002
1186,0.24779
1187,0.256
1188,0.26421
1189,0.27515
1190,0.28336
1191,0.29157
1192,0.29977
1193,0.30798000000000003
1194,0.31619
1195,0.3244
1196,0.33261
1197,0.34354
1198,0.35175
1199,0.35996
1200,0.36817
1201,0.37638
1202,0.38458000000000003
1203,0.39279000000000003
1204,0.401
1205,0.41194
1206,0.42015
1207,0.42836
1208,0.43656999999999996
1209,0.44477
1210,0.45298
1211,0.46119
1212,0.4694
1213,0.48034
1214,0.48855
1215,0.49676000000000003
1216,0.50497
1217,0.51317
1218,0.5213800000000001
1219,0.52959
1220,0.5378
1221,0.54874
1222,0.55695
1223,0.56516
1224,0.5733600000000001
1225,0.58157
1226,0.58978
1227,0.5979899999999999
1228,0.6062
1229,0.6171399999999999
1230,0.62535
1231,0.63355
1232,0.64176
1233,0.6499699999999999
1234,0.65818
1235,0.66365
1236,0.6663899999999999
1237,0.6691199999999999
1238,0.67732
1239,0.68553
1240,0.69101
1241,0.69375
1242,0.69648
1243,0.7046899999999999
1244,0.70743
1245,0.71016
1246,0.71563
1247,0.7238399999999999
1248,0.7320399999999999
1249,0.73478
1250,0.73752
1251,0.74026
1252,0.74847
1253,0.75668
1254,0.76763
1255,0.7731
1256,0.7731
1257,0.77584
1258,0.78405
1259,0.7922600000000001
1260,0.80048
1261,0.8086899999999999
1262,0.81689
1263,0.81963
1264,0.82237
1265,0.83057
1266,0.83878
1267,0.84425
1268,0.8469899999999999
1269,0.8497299999999999
1270,0.86067
1271,0.8688799999999999
1272,0.87708
1273,0.8852899999999999
1274,0.8935
1275,0.90171
1276,0.9099200000000001
1277,0.91812
1278,0.9290700000000001
1279,0.9372799999999999
1280,0.9454799999999999
1281,0.9536899999999999
1282,0.9619
1283,0.97011
1284,0.97011
1285,0.9728399999999999
1286,0.97831
1287,0.9865200000000001
1288,0.9947299999999999
1289,0.9974799999999999
1290,1.0002
1291,1.0002
1292,1.0085
1293,1.0167
1294,1.0277
1295,1.0359
1296,1.0359
1297,1.0386
1298,1.0468
1299,1.055
1300,1.0633
1301,1.0715
1302,1.0824
1303,1.0906
1304,1.0988
1305,1.1071
1306,1.1153
1307,1.1235
1308,1.1317
1309,1.1399
1310,1.1508
1311,1.159
1312,1.1672
1313,1.1754
1314,1.1837
1315,1.1919
1316,1.2001
1317,1.2083
1318,1.2165
1319,1.2274
1320,1.2356
1321,1.2438
1322,1.252
1323,1.2602
1324,1.2684
1325,1.2766
1326,1.2821
1327,1.2849
1328,1.2903
1329,1.2985
1330,1.3012
1331,1.3039
1332,1.3094
1333,1.3176
1334,1.3258
1335,1.3258
1336,1.3286
1337,1.3368
1338,1.3423
1339,1.345
1340,1.345
1341,1.3505
1342,1.3587
1343,1.3697
1344,1.3779
1345,1.3861
1346,1.3943
1347,1.4025
1348,1.4107
1349,1.4189
1350,1.4271
1351,1.4381
1352,1.4463
1353,1.4518
1354,1.4545
1355,1.4545
1356,1.4627
1357,1.4709
1358,1.4791
1359,1.4819
1360,1.4819
1361,1.4901
1362,1.4983
1363,1.5065
1364,1.5147
1365,1.5229
1366,1.5311
1367,1.5419999999999998
1368,1.5503
1369,1.5585
1370,1.5667
1371,1.5749
1372,1.5831
1373,1.5859
1374,1.5915
1375,1.6025
1376,1.6053
1377,1.6082
1378,1.611
1379,1.6192
1380,1.6274
1381,1.6276
1382,1.6278
1383,1.6308
1384,1.631
1385,1.6338
1386,1.6421
1387,1.6422
1388,1.6424
1389,1.6427
1390,1.643
1391,1.6433
1392,1.6436
1393,1.6440000000000001
1394,1.6442
1395,1.636
1396,1.6335
1397,1.6338
1398,1.6315
1399,1.6319
1400,1.6297
1401,1.6216
1402,1.6134
1403,1.6138
1404,1.6115
1405,1.6062
1406,1.598
1407,1.59
1408,1.5791
1409,1.5709
1410,1.5713
1411,1.5691
1412,1.5638
1413,1.5558
1414,1.5506
1415,1.5484
1416,1.5433
1417,1.5351
1418,1.5269
1419,1.5188
1420,1.5107
1421,1.5026
1422,1.4944
1423,1.4864
1424,1.4844
1425,1.4793
1426,1.4711
1427,1.463
1428,1.4548
1429,1.4466
1430,1.4384
1431,1.4302
1432,1.4193
1433,1.4111
1434,1.4029
1435,1.3947
1436,1.3865
1437,1.3784
1438,1.3702
1439,1.3619999999999999
1440,1.3511
1441,1.3429
1442,1.3349
1443,1.3267
1444,1.3185
1445,1.3104
1446,1.3022
1447,1.294
1448,1.2831
1449,1.2749
1450,1.2699
1451,1.2678
1452,1.2655
1453,1.2573
1454,1.2491
1455,1.2409
1456,1.23
1457,1.2219
1458,1.2137
1459,1.2055
1460,1.1973
1461,1.1891
1462,1.181
1463,1.1728
1464,1.1619
1465,1.1537
1466,1.1455
1467,1.1373
1468,1.1291
1469,1.121
1470,1.1128
1471,1.1046
1472,1.0964
1473,1.0855
1474,1.0773
1475,1.0692
1476,1.061
1477,1.0528
1478,1.0446
1479,1.0365
1480,1.0285
1481,1.0174
1482,1.0092
1483,1.001
1484,0.99308
1485,0.9849
1486,0.9767299999999999
1487,0.96855
1488,0.9603700000000001
1489,0.94947
1490,0.9413
1491,0.9331200000000001
1492,0.92494
1493,0.92222
1494,0.9194899999999999
1495,0.91132
1496,0.9061100000000001
1497,0.9038799999999999
1498,0.8959600000000001
1499,0.8880399999999999
1500,0.88285
1501,0.88039
1502,0.87766
1503,0.87221
1504,0.86405
1505,0.85315
1506,0.84498
1507,0.83681
1508,0.8286399999999999
1509,0.82047
1510,0.8123
1511,0.80413
1512,0.79623
1513,0.7853399999999999
1514,0.77717
1515,0.769
1516,0.76056
1517,0.75266
1518,0.7445
1519,0.73633
1520,0.72816
1521,0.71727
1522,0.70911
1523,0.70094
1524,0.69277
1525,0.68461
1526,0.6764399999999999
1527,0.66827
1528,0.6601100000000001
1529,0.64922
1530,0.6410600000000001
1531,0.63261
1532,0.62445
1533,0.61628
1534,0.60812
1535,0.59995
1536,0.5917899999999999
1537,0.5809
1538,0.57734
1539,0.57653
1540,0.56809
1541,0.55992
1542,0.55176
1543,0.54359
1544,0.53542
1545,0.52725
1546,0.51636
1547,0.5081899999999999
1548,0.50003
1549,0.49186
1550,0.48368999999999995
1551,0.47553
1552,0.46736000000000005
1553,0.4592
1554,0.44831000000000004
1555,0.44014
1556,0.43198000000000003
1557,0.42381
1558,0.41563999999999995
1559,0.40748
1560,0.39932
1561,0.39087
1562,0.37998000000000004
1563,0.37182
1564,0.36394
1565,0.35549000000000003
1566,0.34733
1567,0.33916
1568,0.331
1569,0.32284
1570,0.31195
1571,0.30379
1572,0.29563
1573,0.28747
1574,0.2793
1575,0.27114
1576,0.26298
1577,0.25482
1578,0.24394000000000002
1579,0.23578000000000002
1580,0.22762
1581,0.21946
1582,0.2113
1583,0.20858000000000002
1584,0.20586
1585,0.20284000000000002
1586,0.19167
1587,0.18322
1588,0.1802
1589,0.1772
1590,0.17147
1591,0.16302
1592,0.16302
1593,0.1603
1594,0.15214
1595,0.14397000000000001
1596,0.13552999999999998
1597,0.12736
1598,0.1192
1599,0.11835999999999999
1600,0.11481
1601,0.10664000000000001
1602,0.09575399999999999
1603,0.087588
1604,0.079421
1605,0.071254
1606,0.063087
1607,0.054920000000000004
1608,0.049477999999999994
1609,0.047314
1610,0.045741000000000004
1611,0.03758
1612,0.029418
1613,0.021256999999999998
1614,0.013099000000000001
1615,0.0049372
1616,-0.0029228
1617,-0.011082
1618,-0.01924
1619,-0.030116000000000004
1620,-0.037971
1621,-0.040072
1622,-0.039125
1623,-0.044239
1624,-0.052065999999999994
1625,-0.054127
1626,-0.05312000000000001
1627,-0.051744000000000005
1628,-0.050685
1629,-0.049604
1630,-0.048496
1631,-0.047369
1632,-0.046217
1633,-0.04312
1634,-0.034606
1635,-0.028402999999999998
1636,-0.024496
1637,-0.018275
1638,-0.010159999999999999
1639,-0.0016347999999999998
1640,0.006480199999999999
1641,0.014597999999999998
1642,0.018529
1643,0.020201
1644,0.024182
1645,0.025481
1646,0.029060000000000002
1647,0.037604000000000005
1648,0.045703
1649,0.047041
1650,0.051095
1651,0.062342999999999996
1652,0.070436
1653,0.078986
1654,0.08707899999999999
1655,0.092474
1656,0.095172
1657,0.09832300000000001
1658,0.10687
1659,0.11812
1660,0.12128
1661,0.12444000000000001
1662,0.13029000000000002
1663,0.13885
1664,0.14154
1665,0.14154
1666,0.14693
1667,0.15772
1668,0.16580999999999999
1669,0.1739
1670,0.18199
1671,0.19054000000000001
1672,0.19863
1673,0.20673000000000002
1674,0.21481999999999998
1675,0.22560999999999998
1676,0.22698000000000002
1677,0.23106999999999997
1678,0.23693000000000003
1679,0.24502
1680,0.25358
1681,0.26166
1682,0.26975
1683,0.27655
1684,0.27798
1685,0.28654
1686,0.29462
1687,0.3027
1688,0.31079
1689,0.31887
1690,0.32695
1691,0.33551
1692,0.34629
1693,0.35436999999999996
1694,0.36245
1695,0.36388000000000004
1696,0.36801999999999996
1697,0.37389
1698,0.38197
1699,0.39005
1700,0.40081999999999995
1701,0.40938
1702,0.41746000000000005
1703,0.42554
1704,0.43362
1705,0.4417
1706,0.44978
1707,0.45392
1708,0.46125
1709,0.46933
1710,0.4774
1711,0.48548
1712,0.49355
1713,0.50212
1714,0.5101899999999999
1715,0.51827
1716,0.52904
1717,0.5371199999999999
1718,0.54299
1719,0.54715
1720,0.54813
1721,0.5567
1722,0.56477
1723,0.57284
1724,0.5836100000000001
1725,0.59217
1726,0.60025
1727,0.60832
1728,0.6164
1729,0.62447
1730,0.63255
1731,0.63402
1732,0.6387
1733,0.64677
1734,0.65484
1735,0.66291
1736,0.67098
1737,0.67905
1738,0.68762
1739,0.6956899999999999
1740,0.7064600000000001
1741,0.71453
1742,0.7226
1743,0.72409
1744,0.72828
1745,0.73416
1746,0.7422300000000001
1747,0.7503
1748,0.76155
1749,0.76962
1750,0.77769
1751,0.78576
1752,0.79214
1753,0.79635
1754,0.80006
1755,0.80812
1756,0.81887
1757,0.8269299999999999
1758,0.8355100000000001
1759,0.84357
1760,0.85164
1761,0.8597100000000001
1762,0.86392
1763,0.86546
1764,0.87135
1765,0.8821
1766,0.8901600000000001
1767,0.89822
1768,0.90628
1769,0.9143399999999999
1770,0.9224100000000001
1771,0.9309799999999999
1772,0.93905
1773,0.9498
1774,0.95786
1775,0.96593
1776,0.9739899999999999
1777,0.98206
1778,0.99013
1779,0.9981899999999999
1780,1.0063
1781,1.0170000000000001
1782,1.0251
1783,1.0332
1784,1.0395
1785,1.0411
1786,1.0474
1787,1.0555
1788,1.0636
1789,1.0748
1790,1.0829
1791,1.091
1792,1.099
1793,1.1044
1794,1.1071
1795,1.1076
1796,1.1162
1797,1.1274
1798,1.1333
1799,1.1365
1800,1.137
1801,1.1456
1802,1.151
1803,1.1537
1804,1.1569
1805,1.1676
1806,1.1735
1807,1.1777
1808,1.1793
1809,1.1874
1810,1.1954
1811,1.2035
1812,1.2115
1813,1.2223
1814,1.2309
1815,1.2389
1816,1.247
1817,1.255
1818,1.2631
1819,1.2668
1820,1.2684
1821,1.2775
1822,1.2861
1823,1.2898
1824,1.2941
1825,1.2978
1826,1.3064
1827,1.315
1828,1.3166
1829,1.3188
1830,1.3205
1831,1.3221
1832,1.3238
1833,1.3255
1834,1.3272
1835,1.329
1836,1.3307
1837,1.3325
1838,1.3349
1839,1.3301
1840,1.3227
1841,1.318
1842,1.3171
1843,1.3163
1844,1.3089
1845,1.3016
1846,1.3014
1847,1.3
1848,1.2919999999999998
1849,1.284
1850,1.2767
1851,1.2687
1852,1.2646
1853,1.2639
1854,1.2599
1855,1.2519
1856,1.2446
1857,1.2367
1858,1.2287
1859,1.2274
1860,1.2267
1861,1.2254
1862,1.2148
1863,1.2068
1864,1.1989
1865,1.1909
1866,1.183
1867,1.175
1868,1.1671
1869,1.1591
1870,1.1485
1871,1.1413
1872,1.1333
1873,1.1254
1874,1.1175
1875,1.1095
1876,1.1016
1877,1.0936
1878,1.0831
1879,1.0751
1880,1.0672
1881,1.0593
1882,1.0513
1883,1.0434
1884,1.0348
1885,1.0268
1886,1.0163
1887,1.0083
1888,1.0023
1889,0.9975700000000001
1890,0.99282
1891,0.9848899999999999
1892,0.97695
1893,0.9690200000000001
1894,0.95845
1895,0.9505100000000001
1896,0.9425899999999999
1897,0.93395
1898,0.9260200000000001
1899,0.9181
1900,0.91017
1901,0.90225
1902,0.8916799999999999
1903,0.88376
1904,0.87584
1905,0.86792
1906,0.86001
1907,0.85209
1908,0.84729
1909,0.8425
1910,0.8365100000000001
1911,0.82594
1912,0.81802
1913,0.81009
1914,0.80218
1915,0.7942600000000001
1916,0.7863399999999999
1917,0.77842
1918,0.77051
1919,0.7599600000000001
1920,0.75205
1921,0.7441399999999999
1922,0.73623
1923,0.72832
1924,0.72041
1925,0.7125100000000001
1926,0.7046
1927,0.69407
1928,0.68617
1929,0.6782699999999999
1930,0.67037
1931,0.6624800000000001
1932,0.65383
1933,0.64594
1934,0.6380399999999999
1935,0.62752
1936,0.61963
1937,0.61174
1938,0.60385
1939,0.59597
1940,0.58995
1941,0.58581
1942,0.58581
1943,0.57529
1944,0.5674100000000001
1945,0.55876
1946,0.5501199999999999
1947,0.54147
1948,0.53808
1949,0.53545
1950,0.53283
1951,0.52231
1952,0.52231
1953,0.51968
1954,0.51443
1955,0.50655
1956,0.49867
1957,0.49078999999999995
1958,0.48291000000000006
1959,0.47241000000000005
1960,0.46453999999999995
1961,0.45666
1962,0.44802
1963,0.44015
1964,0.43228
1965,0.42441
1966,0.41653999999999997
1967,0.40606
1968,0.3982
1969,0.39558000000000004
1970,0.39296
1971,0.38772
1972,0.37986
1973,0.37121
1974,0.3678
1975,0.36439
1976,0.35574
1977,0.3471
1978,0.33845
1979,0.33059
1980,0.32797
1981,0.32535
1982,0.32194
1983,0.31408
1984,0.30361
1985,0.29575999999999997
1986,0.2879
1987,0.28005
1988,0.2722
1989,0.26436
1990,0.25651
1991,0.24786
1992,0.23740999999999998
1993,0.22956
1994,0.22173
1995,0.21389
1996,0.20605
1997,0.19822
1998,0.19039
1999,0.18256
2000,0.17749
2001,0.17244
2002,0.1664
2003,0.15855999999999998
2004,0.14991
2005,0.14207
2006,0.13424
2007,0.12641
2008,0.11596
2009,0.10992
2010,0.10486
2011,0.10243
2012,0.09458899999999999
2013,0.08675
2014,0.078912
2015,0.070261
2016,0.059815
2017,0.05198200000000001
2018,0.044152
2019,0.036475
2020,0.031427
2021,0.028004
2022,0.020163
2023,0.012324
2024,0.0018762
2025,-0.0059597999999999995
2026,-0.014611
2027,-0.022444
2028,-0.030274000000000002
2029,-0.038102
2030,-0.04593
2031,-0.050184
2032,-0.056063999999999996
2033,-0.064715
2034,-0.07255
2035,-0.080386
2036,-0.088216
2037,-0.096868
2038,-0.1047
2039,-0.11252999999999999
2040,-0.12021
2041,-0.12525999999999998
2042,-0.1313
2043,-0.13914
2044,-0.14698
2045,-0.15481
2046,-0.16264
2047,-0.17047
2048,-0.18091
2049,-0.18873
2050,-0.19655999999999998
2051,-0.20438
2052,-0.21219000000000002
2053,-0.22000999999999998
2054,-0.22782
2055,-0.23563
2056,-0.24428000000000002
2057,-0.25469
2058,-0.2625
2059,-0.2703
2060,-0.2781
2061,-0.2859
2062,-0.29195
2063,-0.29711
2064,-0.30224
2065,-0.31265
2066,-0.32045999999999997
2067,-0.32826
2068,-0.33605999999999997
2069,-0.34386
2070,-0.35166
2071,-0.35945
2072,-0.36811
2073,-0.37849
2074,-0.38628
2075,-0.39407
2076,-0.40185
2077,-0.40963
2078,-0.4174
2079,-0.42346000000000006
2080,-0.42693000000000003
2081,-0.43212
2082,-0.43988999999999995
2083,-0.44766000000000006
2084,-0.45543
2085,-0.4632
2086,-0.47096000000000005
2087,-0.47096000000000005
2088,-0.47266
2089,-0.47951000000000005
2090,-0.48727
2091,-0.49411000000000005
2092,-0.50185
2093,-0.50959
2094,-0.50683
2095,-0.50756
2096,-0.51271
2097,-0.523
2098,-0.53071
2099,-0.53842
2100,-0.5461199999999999
2101,-0.55383
2102,-0.56153
2103,-0.56247
2104,-0.56787
2105,-0.57815
2106,-0.58585
2107,-0.59355
2108,-0.60124
2109,-0.6089399999999999
2110,-0.61662
2111,-0.62431
2112,-0.6319899999999999
2113,-0.62908
2114,-0.6287
2115,-0.63635
2116,-0.6430100000000001
2117,-0.6451100000000001
2118,-0.64208
2119,-0.64869
2120,-0.65528
2121,-0.66035
2122,-0.66035
2123,-0.66795
2124,-0.67302
2125,-0.67555
2126,-0.67808
2127,-0.68062
2128,-0.68821
2129,-0.6958
2130,-0.70591
2131,-0.71349
2132,-0.72106
2133,-0.72863
2134,-0.73619
2135,-0.73657
2136,-0.73335
2137,-0.73009
2138,-0.72572
2139,-0.7224
2140,-0.71906
2141,-0.7157
2142,-0.71231
2143,-0.7088899999999999
2144,-0.70545
2145,-0.70198
2146,-0.69206
2147,-0.68347
2148,-0.68116
2149,-0.67767
2150,-0.67168
2151,-0.66815
2152,-0.66459
2153,-0.65847
2154,-0.64742
2155,-0.64139
2156,-0.6353300000000001
2157,-0.62921
2158,-0.62184
2159,-0.61445
2160,-0.60588
2161,-0.59849
2162,-0.5887899999999999
2163,-0.58273
2164,-0.57536
2165,-0.5667800000000001
2166,-0.56438
2167,-0.5583
2168,-0.55342
2169,-0.5460699999999999
2170,-0.53625
2171,-0.52767
2172,-0.5203
2173,-0.51544
2174,-0.50936
2175,-0.50203
2176,-0.49467
2177,-0.48731
2178,-0.47626999999999997
2179,-0.4689
2180,-0.46152
2181,-0.45414
2182,-0.44683
2183,-0.44077
2184,-0.43345
2185,-0.42608
2186,-0.41623999999999994
2187,-0.40885
2188,-0.40026999999999996
2189,-0.39288
2190,-0.38548000000000004
2191,-0.37818
2192,-0.37215
2193,-0.3673
2194,-0.35625999999999997
2195,-0.35014
2196,-0.34649
2197,-0.34649
2198,-0.3391
2199,-0.33171
2200,-0.32431
2201,-0.31690999999999997
2202,-0.30951
2203,-0.30209
2204,-0.30327
2205,-0.29949000000000003
2206,-0.29207
2207,-0.28464
2208,-0.2772
2209,-0.26976
2210,-0.26232
2211,-0.25238
2212,-0.24493
2213,-0.23747
2214,-0.23135999999999998
2215,-0.22793000000000002
2216,-0.21950999999999998
2217,-0.21206
2218,-0.20461
2219,-0.19467
2220,-0.18721
2221,-0.17861
2222,-0.17114000000000001
2223,-0.16367
2224,-0.15619
2225,-0.14872
2226,-0.14147
2227,-0.13446
2228,-0.12834
2229,-0.11974000000000001
2230,-0.11475999999999999
2231,-0.10885999999999998
2232,-0.10544
2233,-0.09684
2234,-0.089382
2235,-0.07943099999999999
2236,-0.07082999999999999
2237,-0.06336
2238,-0.055888
2239,-0.048414
2240,-0.043662
2241,-0.040261
2242,-0.033007999999999996
2243,-0.021915999999999998
2244,-0.015804
2245,-0.012379000000000001
2246,-0.006452800000000001
2247,0.00099718
2248,0.008450200000000001
2249,0.017049
2250,0.02451
2251,0.033109
2252,0.039024
2253,0.04495
2254,0.0524
2255,0.060997
2256,0.064447
2257,0.070395
2258,0.07651000000000001
2259,0.087585
2260,0.09122100000000001
2261,0.094701
2262,0.10067999999999999
2263,0.10419
2264,0.10772999999999999
2265,0.11502000000000001
2266,0.12243
2267,0.12972999999999998
2268,0.13575
2269,0.13932
2270,0.1479
2271,0.15529
2272,0.16013
2273,0.16618
2274,0.17104
2275,0.17961
2276,0.18939
2277,0.193
2278,0.19663
2279,0.20272
2280,0.20639000000000002
2281,0.2125
2282,0.22107
2283,0.22719
2284,0.23209000000000002
2285,0.23579
2286,0.2395
2287,0.24323000000000003
2288,0.24698
2289,0.25075
2290,0.25453000000000003
2291,0.25833
2292,0.26342
2293,0.26726
2294,0.27111999999999997
2295,0.26758000000000004
2296,0.26164
2297,0.25811999999999996
2298,0.25963
2299,0.26356
2300,0.25527
2301,0.24808000000000002
2302,0.25206
2303,0.25232
2304,0.24754
2305,0.24038
2306,0.23321999999999998
2307,0.22605999999999998
2308,0.21653000000000003
2309,0.20939000000000002
2310,0.20225
2311,0.2009
2312,0.19447
2313,0.18598
2314,0.17884
2315,0.1717
2316,0.1622
2317,0.15508
2318,0.1466
2319,0.13948
2320,0.13237000000000002
2321,0.12527
2322,0.11679
2323,0.11268
2324,0.10384000000000002
2325,0.096731
2326,0.089626
2327,0.082526
2328,0.075432
2329,0.06834
2330,0.06126
2331,0.05279400000000001
2332,0.043364
2333,0.036297
2334,0.029235
2335,0.022179
2336,0.015131
2337,0.0080892
2338,0.0010522
2339,-0.0059788
2340,-0.015344
2341,-0.022359
2342,-0.027538999999999998
2343,-0.034129
2344,-0.039298
2345,-0.046326
2346,-0.053347000000000006
2347,-0.060362
2348,-0.067371
2349,-0.076706
2350,-0.083699
2351,-0.090687
2352,-0.097666
2353,-0.10464000000000001
2354,-0.11160999999999999
2355,-0.11857000000000001
2356,-0.12552
2357,-0.13477999999999998
2358,-0.14172
2359,-0.14865
2360,-0.15557
2361,-0.16249
2362,-0.1694
2363,-0.1763
2364,-0.1832
2365,-0.19238
2366,-0.19925
2367,-0.20611999999999997
2368,-0.21299
2369,-0.22135
2370,-0.2282
2371,-0.23504
2372,-0.24188
2373,-0.25098000000000004
2374,-0.2578
2375,-0.26237
2376,-0.26919
2377,-0.27526999999999996
2378,-0.28209
2379,-0.28891999999999995
2380,-0.29725999999999997
2381,-0.30633
2382,-0.31092
2383,-0.31776
2384,-0.32383
2385,-0.33065
2386,-0.33746
2387,-0.34579
2388,-0.35259
2389,-0.36164
2390,-0.36841999999999997
2391,-0.37601999999999997
2392,-0.38291
2393,-0.38825
2394,-0.39657
2395,-0.4049
2396,-0.41176999999999997
2397,-0.41863999999999996
2398,-0.42544
2399,-0.43223
2400,-0.44055
2401,-0.44733
2402,-0.45338999999999996
2403,-0.45802
2404,-0.46336000000000005
2405,-0.47395
2406,-0.48072
2407,-0.48749
2408,-0.49581000000000003
2409,-0.50256
2410,-0.50931
2411,-0.5160399999999999
2412,-0.52298
2413,-0.53371
2414,-0.54046
2415,-0.5472
2416,-0.55393
2417,-0.56065
2418,-0.5673600000000001
2419,-0.57406
2420,-0.58234
2421,-0.58903
2422,-0.5979300000000001
2423,-0.60459
2424,-0.61125
2425,-0.6178899999999999
2426,-0.62332
2427,-0.63035
2428,-0.63577
2429,-0.64242
2430,-0.65128
2431,-0.65792
2432,-0.6645399999999999
2433,-0.67115
2434,-0.67938
2435,-0.68597
2436,-0.6925600000000001
2437,-0.69913
2438,-0.7078800000000001
2439,-0.71443
2440,-0.72096
2441,-0.72593
2442,-0.73305
2443,-0.73907
2444,-0.74562
2445,-0.75216
2446,-0.7608600000000001
2447,-0.76737
2448,-0.77554
2449,-0.78203
2450,-0.78851
2451,-0.79498
2452,-0.80143
2453,-0.80788
2454,-0.81645
2455,-0.82414
2456,-0.8313799999999999
2457,-0.8369200000000001
2458,-0.84336
2459,-0.85149
2460,-0.8579
2461,-0.8643
2462,-0.87371
2463,-0.88097
2464,-0.8890899999999999
2465,-0.89549
2466,-0.9036
2467,-0.9099799999999999
2468,-0.91635
2469,-0.9215200000000001
2470,-0.93053
2471,-0.9369200000000001
2472,-0.94329
2473,-0.9513799999999999
2474,-0.95773
2475,-0.9658100000000001
2476,-0.9731299999999999
2477,-0.9783299999999999
2478,-0.9868
2479,-0.9931399999999999
2480,-1.0012
2481,-1.0075
2482,-1.0135
2483,-1.0208
2484,-1.0261
2485,-1.0324
2486,-1.0443
2487,-1.0495
2488,-1.0572
2489,-1.0653
2490,-1.0716
2491,-1.0797
2492,-1.0859999999999999
2493,-1.0937
2494,-1.1011
2495,-1.1109
2496,-1.1189
2497,-1.1263
2498,-1.1336
2499,-1.1417
2500,-1.148
2501,-1.1543
2502,-1.1623
2503,-1.1703
2504,-1.1756
2505,-1.183
2506,-1.1893
2507,-1.1973
2508,-1.205
2509,-1.2103
2510,-1.218
2511,-1.2282
2512,-1.2344
2513,-1.2407
2514,-1.2469
2515,-1.2523
2516,-1.2576
2517,-1.265
2518,-1.2703
2519,-1.278
2520,-1.286
2521,-1.2923
2522,-1.3003
2523,-1.3066
2524,-1.3143
2525,-1.3196
2526,-1.3273
2527,-1.3374
2528,-1.3413
2529,-1.3487
2530,-1.354
2531,-1.3619999999999999
2532,-1.3683
2533,-1.3757
2534,-1.383
2535,-1.3932
2536,-1.3994
2537,-1.4057
2538,-1.4137
2539,-1.4196
2540,-1.4271
2541,-1.4324
2542,-1.4404
2543,-1.4505
2544,-1.4558
2545,-1.4632
2546,-1.4695
2547,-1.4775
2548,-1.4814
2549,-1.4888
2550,-1.4944
2551,-1.5045
2552,-1.5107
2553,-1.5187
2554,-1.5249
2555,-1.5306
2556,-1.538
2557,-1.5437
2558,-1.5517
2559,-1.5597
2560,-1.5671
2561,-1.5707
2562,-1.5787
2563,-1.5867
2564,-1.5905
2565,-1.598
2566,-1.6033
2567,-1.6096
2568,-1.6214
2569,-1.6288
2570,-1.6345
2571,-1.6425
2572,-1.6487
2573,-1.6567
2574,-1.6629
2575,-1.6688
2576,-1.6781
2577,-1.6878
2578,-1.6958
2579,-1.7033
2580,-1.7107
2581,-1.7187
2582,-1.7267
2583,-1.7324
2584,-1.7416
2585,-1.7475
2586,-1.7537
2587,-1.7617
2588,-1.7679
2589,-1.774
2590,-1.7815
2591,-1.7890000000000001
2592,-1.797
2593,-1.8031
2594,-1.8092
2595,-1.8171
2596,-1.8232
2597,-1.8292
2598,-1.8352
2599,-1.8411
2600,-1.8505
2601,-1.8563
2602,-1.8623
2603,-1.8682
2604,-1.8742
2605,-1.882
2606,-1.8879
2607,-1.8937
2608,-1.9015
2609,-1.9092
2610,-1.915
2611,-1.9208
2612,-1.9267
2613,-1.9324
2614,-1.9382
2615,-1.9439
2616,-1.9515
2617,-1.9571
2618,-1.9647
2619,-1.9703
2620,-1.9758
2621,-1.9813
2622,-1.9868
2623,-1.9943
2624,-2.0043
2625,-2.0102
2626,-2.0156
2627,-2.021
2628,-2.0263
2629,-2.0316
2630,-2.0369
2631,-2.0421
2632,-2.049
2633,-2.0562
2634,-2.0613
2635,-2.0663
2636,-2.0712
2637,-2.0761
2638,-2.081
2639,-2.0858
2640,-2.0927
2641,-2.1033
2642,-2.1109
2643,-2.1156
2644,-2.1203
2645,-2.1249
2646,-2.1294
2647,-2.1339
2648,-2.1383
2649,-2.1441
2650,-2.1484
2651,-2.155
2652,-2.1591
2653,-2.1632
2654,-2.1672
2655,-2.1712
2656,-2.1751
2657,-2.1825
2658,-2.1862
2659,-2.1874
2660,-2.1912
2661,-2.1973
2662,-2.2034
2663,-2.2094
2664,-2.2128
2665,-2.2165
2666,-2.2176
2667,-2.221
2668,-2.2231
2669,-2.2242
2670,-2.2264
2671,-2.2295
2672,-2.2325
2673,-2.2365
2674,-2.2393
2675,-2.242
2676,-2.2447
2677,-2.2473
2678,-2.2497
2679,-2.2547
2680,-2.2569999999999997
2681,-2.2573
2682,-2.2593
2683,-2.2613
2684,-2.2632
2685,-2.2649
2686,-2.2666
2687,-2.2681
2688,-2.2696
2689,-2.2714
2690,-2.2726
2691,-2.2737
2692,-2.2747
2693,-2.2756
2694,-2.2764
2695,-2.2769999999999997
2696,-2.2776
2697,-2.2782
2698,-2.2785
2699,-2.2787
2700,-2.2789
2701,-2.2789
2702,-2.2789
2703,-2.2789
2704,-2.2789
2705,-2.2816
2706,-2.2816
2707,-2.2816
2708,-2.2816
