time,value
0,2.1403
1,2.0954
2,2.0022
3,1.9131
4,1.8079
5,1.7511
6,1.7327
7,1.7142
8,1.7047
9,1.6986
10,1.6842
11,1.6629
12,1.6345
13,1.6130000000000002
14,1.599
15,1.5775
16,1.5652
17,1.5408
18,1.5114
19,1.4831
20,1.443
21,1.4023
22,1.3693
23,1.3152
24,1.2626
25,1.2121
26,1.1496
27,1.0641
28,1.0319
29,1.0071
30,0.9348700000000001
31,0.8634799999999999
32,0.77968
33,0.70586
34,0.63017
35,0.5934
36,0.5402899999999999
37,0.47881
38,0.42215
39,0.35654
40,0.31113
41,0.25888
42,0.21005
43,0.14977000000000001
44,0.11606
45,0.094483
46,0.085694
47,0.095702
48,0.10676
49,0.12378
50,0.14151
51,0.16205
52,0.18514
53,0.19958
54,0.12022000000000001
55,0.058411000000000005
56,0.023497999999999998
57,0.015496000000000001
58,0.016828
59,0.027392000000000003
60,0.049411000000000004
61,0.081456
62,0.045443
63,-0.014786
64,-0.08049400000000001
65,-0.14384
66,-0.20307
67,-0.27321999999999996
68,-0.37156
69,-0.46178
70,-0.48995
71,-0.53145
72,-0.5794699999999999
73,-0.63953
74,-0.701
75,-0.75794
76,-0.816
77,-0.8591700000000001
78,-0.9266700000000001
79,-1.0082
80,-1.0994
81,-1.1723
82,-1.2442
83,-1.3259
84,-1.391
85,-1.4592
86,-1.5168
87,-1.5787
88,-1.6286
89,-1.6669999999999998
90,-1.7066
91,-1.7335
92,-1.7196
93,-1.6932
94,-1.6641
95,-1.6264
96,-1.5819999999999999
97,-1.5272
98,-1.4703
99,-1.4147
100,-1.3568
101,-1.3018
102,-1.2535
103,-1.2083
104,-1.1607
105,-1.1116
106,-1.0608
107,-1.0092
108,-0.9534100000000001
109,-0.8900399999999999
110,-0.8206600000000001
111,-0.77453
112,-0.83946
113,-0.8471799999999999
114,-0.81004
115,-0.7429
116,-0.67082
117,-0.60609
118,-0.52494
119,-0.45256
120,-0.37606
121,-0.31292
122,-0.24756
123,-0.20761999999999997
124,-0.11911
125,-0.10046000000000001
126,-0.09468
127,-0.18946
128,-0.26653000000000004
129,-0.34825
130,-0.42938999999999994
131,-0.50457
132,-0.58248
133,-0.58758
134,-0.59955
135,-0.68021
136,-0.76207
137,-0.83045
138,-0.9193899999999999
139,-0.9928100000000001
140,-1.0717
141,-1.1531
142,-1.2283
143,-1.3003
144,-1.3784
145,-1.4517
146,-1.5318
147,-1.6044
148,-1.6649
149,-1.6787
150,-1.6675
151,-1.6471
152,-1.6228
153,-1.5819999999999999
154,-1.5123
155,-1.4183
156,-1.3124
157,-1.2037
158,-1.0969
159,-1.015
160,-0.93169
161,-0.84736
162,-0.73807
163,-0.6261
164,-0.51467
165,-0.42604
166,-0.31431
167,-0.20349
168,-0.0933
169,-0.035233
170,-0.10728
171,-0.061916
172,-0.11667000000000001
173,-0.08205
174,-0.020159
175,0.061509
176,0.14902
177,0.23706999999999998
178,0.34888
179,0.44472
180,0.5272600000000001
181,0.61797
182,0.7287
183,0.69663
184,0.60828
185,0.54084
186,0.46198999999999996
187,0.39979000000000003
188,0.40246
189,0.35611
190,0.28585
191,0.21028000000000002
192,0.15133
193,0.092226
194,0.035822
195,-0.003654
196,-0.040063
197,-0.067732
198,-0.09994
199,-0.10389000000000001
200,-0.058864
201,0.011726
202,0.078868
203,0.15494000000000002
204,0.24809
205,0.33549
206,0.4155
207,0.50537
208,0.59663
209,0.68829
210,0.77283
211,0.76874
212,0.76078
213,0.82285
214,0.9019
215,0.97331
216,1.0486
217,1.1332
218,1.1698
219,1.1805
220,1.079
221,1.0608
222,1.1259
223,1.1973
224,1.2651
225,1.3415
226,1.4231
227,1.5
228,1.5673
229,1.6280000000000001
230,1.6969999999999998
231,1.7733
232,1.8345
233,1.7799
234,1.7071
235,1.6251
236,1.5483
237,1.4691
238,1.3793
239,1.3162
240,1.3351
241,1.2432
242,1.1615
243,1.0799
244,0.99174
245,0.90115
246,0.79806
247,0.7102
248,0.6232
249,0.53573
250,0.44932
251,0.34855
252,0.28931
253,0.23906999999999998
254,0.25385
255,0.31501999999999997
256,0.37936
257,0.46403999999999995
258,0.5424
259,0.61516
260,0.69052
261,0.76972
262,0.8405
263,0.77103
264,0.69806
265,0.61007
266,0.52628
267,0.44416000000000005
268,0.35872
269,0.28965
270,0.20673000000000002
271,0.12580999999999998
272,0.050913
273,0.082712
274,0.047011000000000004
275,-0.026722000000000003
276,-0.10759
277,-0.17718
278,-0.2641
279,-0.33615
280,-0.41113999999999995
281,-0.48881
282,-0.56829
283,-0.64289
284,-0.71708
285,-0.7993399999999999
286,-0.8742700000000001
287,-0.9513
288,-1.0198
289,-1.1005
290,-1.1645
291,-1.2259
292,-1.2733
293,-1.2871
294,-1.2922
295,-1.2868
296,-1.2659
297,-1.2323
298,-1.1607
299,-1.0853
300,-1.0168
301,-0.9372
302,-0.85893
303,-0.7711
304,-0.69219
305,-0.5825199999999999
306,-0.47153999999999996
307,-0.36025999999999997
308,-0.26939
309,-0.19524
310,-0.24633000000000002
311,-0.28575
312,-0.35405
313,-0.42361000000000004
314,-0.48903
315,-0.55119
316,-0.60935
317,-0.6632899999999999
318,-0.7067399999999999
319,-0.75997
320,-0.80474
321,-0.83137
322,-0.8083
323,-0.7367600000000001
324,-0.79865
325,-0.88029
326,-0.9576
327,-1.0176
328,-1.0754
329,-1.1209
330,-1.1671
331,-1.2151
332,-1.2578
333,-1.2921
334,-1.3319999999999999
335,-1.3618
336,-1.3836
337,-1.4011
338,-1.4149
339,-1.42
340,-1.426
341,-1.4275
342,-1.4084
343,-1.3846
344,-1.3487
345,-1.3122
346,-1.2677
347,-1.2207
348,-1.1374
349,-1.0444
350,-0.96514
351,-0.88194
352,-0.80487
353,-0.7334
354,-0.65756
355,-0.59342
356,-0.50994
357,-0.44823999999999997
358,-0.38127
359,-0.30606
360,-0.30385
361,-0.30912
362,-0.31663
363,-0.3139
364,-0.30894
365,-0.29516
366,-0.2723
367,-0.21796999999999997
368,-0.1558
369,-0.16976
370,-0.17352
371,-0.17132
372,-0.16879
373,-0.15893
374,-0.14617
375,-0.12738
376,-0.10164
377,-0.077194
378,-0.057155
379,-0.009983200000000001
380,0.032234
381,0.070312
382,0.11681
383,0.16341
384,0.21909
385,0.28152
386,0.36708
387,0.47756000000000004
388,0.54723
389,0.60005
390,0.65283
391,0.69323
392,0.73022
393,0.77283
394,0.80219
395,0.82757
396,0.86179
397,0.9018799999999999
398,0.9484899999999999
399,0.99329
400,1.0485
401,1.0908
402,1.1359
403,1.1781
404,1.222
405,1.2656
406,1.3064
407,1.3388
408,1.381
409,1.4118
410,1.4423
411,1.4802
412,1.514
413,1.5524
414,1.5898
415,1.6261
416,1.6642
417,1.6987
418,1.7225
419,1.7419
420,1.7634
421,1.8009
422,1.8473
423,1.9026
424,1.9785
425,2.0657
426,2.1228
