[<text>
<title>wells fargo and co &lt;wfc&gt; 3rd qtr net</title>
<dateline>    san francisco, oct 20 -
    </dateline>shr profit 2.77 dlrs vs profit 1.35 dlrs
    net 155.0 mln vs 77.4 mln
    nine mths
    shr loss 1.43 dlrs vs profit 3.66 dlrs
    net loss 60.4 mln vs profit 195.2 mln
    assets 45.15 billion vs 42.69 billion
    loans 36.33 billion vs 34.46 billion
    deposits 29.7 billion vs 23.3 billion
 reuter
</text>]