time,value
0,-1.2492
1,0.34725
2,-0.6493899999999999
3,-1.983
4,-2.0976
5,-1.3293
6,-0.9013200000000001
7,-1.213
8,-1.6698
9,-1.6841
10,-1.3664
11,-1.2174
12,-1.3611
13,-1.5388
14,-1.5285
15,-1.3994
16,-1.3595
17,-1.4174
18,-1.4756
19,-1.4677
20,-1.4275
21,-1.4265
22,-1.4389
23,-1.4501
24,-1.4465
25,-1.4419
26,-1.4441
27,-1.4279
28,-1.4314
29,-1.4189
30,-1.4087
31,-1.4027
32,-1.3813
33,-1.3826
34,-1.3678
35,-1.3605
36,-1.3552
37,-1.3387
38,-1.3425
39,-1.3308
40,-1.33
41,-1.328
42,-1.3178
43,-1.3251
44,-1.3164
45,-1.3212
46,-1.3202
47,-1.3125
48,-1.3182
49,-1.3082
50,-1.3165
51,-1.317
52,-1.3143
53,-1.3199
54,-1.3064
55,-1.311
56,-1.3023
57,-1.2935
58,-1.2907
59,-1.27
60,-1.2706
61,-1.2535
62,-1.2378
63,-1.2238
64,-1.1945
65,-1.1877
66,-1.1647
67,-1.1493
68,-1.133
69,-1.1041
70,-1.0938
71,-1.0665
72,-1.0511
73,-1.0335
74,-1.0090000000000001
75,-1.0022
76,-0.97965
77,-0.97254
78,-0.95915
79,-0.94109
80,-0.9364600000000001
81,-0.91565
82,-0.91345
83,-0.90122
84,-0.88734
85,-0.8834700000000001
86,-0.8640100000000001
87,-0.8668799999999999
88,-0.8554700000000001
89,-0.84304
90,-0.8332299999999999
91,-0.80499
92,-0.8022600000000001
93,-0.78503
94,-0.77475
95,-0.76673
96,-0.7440100000000001
97,-0.7428600000000001
98,-0.72642
99,-0.72178
100,-0.71815
101,-0.70487
102,-0.71018
103,-0.69902
104,-0.70177
105,-0.7007899999999999
106,-0.6926899999999999
107,-0.69901
108,-0.68779
109,-0.6923
110,-0.68775
111,-0.6786
112,-0.68134
113,-0.6693899999999999
114,-0.6792699999999999
115,-0.67775
116,-0.67416
117,-0.6775100000000001
118,-0.66669
119,-0.68348
120,-0.68914
121,-0.69847
122,-0.7106600000000001
123,-0.7074699999999999
124,-0.7306199999999999
125,-0.7402
126,-0.75857
127,-0.77773
128,-0.7844
129,-0.81208
130,-0.8238200000000001
131,-0.84678
132,-0.86724
133,-0.8790100000000001
134,-0.9086
135,-0.92232
136,-0.95088
137,-0.9734700000000001
138,-0.98985
139,-1.0187
140,-1.0295
141,-1.0565
142,-1.0729
143,-1.0858
144,-1.1069
145,-1.1094
146,-1.1309
147,-1.1384
148,-1.1462
149,-1.1598
150,-1.1565
151,-1.1772
152,-1.1829
153,-1.1936
154,-1.2068
155,-1.2044
156,-1.224
157,-1.2275
158,-1.2398
159,-1.2513
160,-1.2499
161,-1.2665
162,-1.2673
163,-1.2817
164,-1.2931
165,-1.2939
166,-1.3061
167,-1.2982
168,-1.3046
169,-1.3051
170,-1.3014
171,-1.3088
172,-1.2976
173,-1.3032
174,-1.2981
175,-1.2911
176,-1.2919
177,-1.2749
178,-1.2779
179,-1.2672
180,-1.2588
181,-1.2562
182,-1.2377
183,-1.244
184,-1.2348
185,-1.2322
186,-1.2323
187,-1.2197
188,-1.2288
189,-1.2226
190,-1.2267
191,-1.2306
192,-1.2243
193,-1.2354
194,-1.2294
195,-1.236
196,-1.2384
197,-1.2337
198,-1.2426
199,-1.2333
200,-1.2387
201,-1.2361
202,-1.2297
203,-1.2336
204,-1.2187
205,-1.2208
206,-1.2107
207,-1.2003
208,-1.1976
209,-1.1766
210,-1.1758
211,-1.1595
212,-1.1467
213,-1.1394
214,-1.1166
215,-1.1159
216,-1.0976
217,-1.0857
218,-1.0758
219,-1.0542
220,-1.0528
221,-1.0344
222,-1.026
223,-1.0161
224,-0.99815
225,-0.9980700000000001
226,-0.98126
227,-0.97783
228,-0.96899
229,-0.9550799999999999
230,-0.95589
231,-0.9404
232,-0.94201
233,-0.93489
234,-0.92581
235,-0.92769
236,-0.91315
237,-0.91945
238,-0.91464
239,-0.91205
240,-0.91664
241,-0.90361
242,-0.91402
243,-0.9112
244,-0.91675
245,-0.92816
246,-0.9236200000000001
247,-0.93814
248,-0.93271
249,-0.93376
250,-0.93395
251,-0.9219799999999999
252,-0.9306
253,-0.9257
254,-0.9357700000000001
255,-0.9416
256,-0.93381
257,-0.9370700000000001
258,-0.9234700000000001
259,-0.93022
260,-0.93384
261,-0.92905
262,-0.9269799999999999
263,-0.8978299999999999
264,-0.88375
265,-0.86265
266,-0.84516
267,-0.8387600000000001
268,-0.81301
269,-0.80675
270,-0.78819
271,-0.77676
272,-0.77651
273,-0.76132
274,-0.7702600000000001
275,-0.7612800000000001
276,-0.7590100000000001
277,-0.76162
278,-0.7518100000000001
279,-0.76381
280,-0.75755
281,-0.75976
282,-0.7604
283,-0.74898
284,-0.75437
285,-0.74021
286,-0.73744
287,-0.7291
288,-0.71191
289,-0.7087399999999999
290,-0.6864100000000001
291,-0.6795899999999999
292,-0.66394
293,-0.64322
294,-0.63348
295,-0.60454
296,-0.5947899999999999
297,-0.57292
298,-0.55008
299,-0.5352899999999999
300,-0.50144
301,-0.49008
302,-0.46283
303,-0.43806999999999996
304,-0.41755
305,-0.37875
306,-0.36348
307,-0.32986
308,-0.30256
309,-0.27586
310,-0.23376
311,-0.21205
312,-0.17243
313,-0.14499
314,-0.11745
315,-0.08078300000000001
316,-0.063485
317,-0.029062
318,-0.010919
319,0.011009
320,0.038422000000000005
321,0.049441000000000006
322,0.07766100000000001
323,0.086509
324,0.10486
325,0.12794
326,0.14127
327,0.17443
328,0.18602
329,0.21172
330,0.23899
331,0.26103000000000004
332,0.30373
333,0.32121
334,0.35517
335,0.38416999999999996
336,0.40886999999999996
337,0.45006999999999997
338,0.46637
339,0.50108
340,0.5272
341,0.55252
342,0.58935
343,0.6020399999999999
344,0.6302
345,0.64263
346,0.6562399999999999
347,0.6778
348,0.6807
349,0.7016399999999999
350,0.70438
351,0.71232
352,0.7245
353,0.72359
354,0.7448199999999999
355,0.7487699999999999
356,0.76447
357,0.7793800000000001
358,0.78052
359,0.79823
360,0.79078
361,0.7972100000000001
362,0.79901
363,0.79146
364,0.8003899999999999
365,0.7802100000000001
366,0.77758
367,0.76723
368,0.75349
369,0.7550600000000001
370,0.73331
371,0.73119
372,0.71846
373,0.7067100000000001
374,0.70626
375,0.68587
376,0.68523
377,0.67083
378,0.66251
379,0.66272
380,0.6476
381,0.65276
382,0.64137
383,0.6413399999999999
384,0.6472399999999999
385,0.64186
386,0.65452
387,0.64256
388,0.63945
389,0.63178
390,0.61127
391,0.6050800000000001
392,0.56992
393,0.54838
394,0.52117
395,0.48838000000000004
396,0.47183
397,0.42857
398,0.4039
399,0.37185
400,0.3397
401,0.32134
402,0.28108
403,0.26023
404,0.22835
405,0.19972
406,0.18082
407,0.14484
408,0.13062
409,0.10437
410,0.08618300000000001
411,0.07272
412,0.043705
413,0.035496
414,0.013931
415,0.0082691
416,0.0062023
417,-0.010304
418,-0.014852
419,-0.047087000000000004
420,-0.06780499999999999
421,-0.089642
422,-0.11717999999999999
423,-0.12645
424,-0.1625
425,-0.18379
426,-0.2121
427,-0.24386999999999998
428,-0.25873
429,-0.29554
430,-0.31209000000000003
431,-0.33559
432,-0.35641
433,-0.36234
434,-0.38556
435,-0.38781
436,-0.40074
437,-0.40864
438,-0.40715
439,-0.42112
440,-0.41517
441,-0.42371000000000003
442,-0.42389
443,-0.41908999999999996
444,-0.42757
445,-0.41756000000000004
446,-0.42613
447,-0.42273999999999995
448,-0.4176
449,-0.42233000000000004
450,-0.40943
451,-0.4191
452,-0.41336000000000006
453,-0.40915
454,-0.41179
455,-0.39882
456,-0.41358999999999996
457,-0.40993
458,-0.40938
459,-0.40904
460,-0.39453
461,-0.40525
462,-0.3998
463,-0.40321
464,-0.40243
465,-0.38621
466,-0.38503000000000004
467,-0.3622
468,-0.3521
469,-0.34021999999999997
470,-0.32413000000000003
471,-0.32311999999999996
472,-0.29615
473,-0.27649
474,-0.2443
475,-0.2122
476,-0.20062
477,-0.17453
478,-0.16604000000000002
479,-0.13962
480,-0.10974
481,-0.090822
482,-0.057539
483,-0.050446
484,-0.026712
485,-0.0037196
486,0.015569999999999999
487,0.051909000000000004
488,0.061701
489,0.08907999999999999
490,0.11009000000000001
491,0.13055
492,0.1655
493,0.17772000000000002
494,0.20763
495,0.22546
496,0.24336999999999998
497,0.26911
498,0.27341
499,0.29545
500,0.30248
501,0.31487
502,0.33311
503,0.33535
504,0.35695
505,0.3591
506,0.36799
507,0.37756999999999996
508,0.37895
509,0.41108999999999996
510,0.4349
511,0.48008999999999996
512,0.5220600000000001
513,0.54835
514,0.58963
515,0.60795
516,0.6504800000000001
517,0.6916399999999999
518,0.7252
519,0.7677
520,0.7773100000000001
521,0.8016399999999999
522,0.81594
523,0.82942
524,0.8543700000000001
525,0.8542200000000001
526,0.8698100000000001
527,0.8699899999999999
528,0.87234
529,0.8832399999999999
530,0.87492
531,0.8854700000000001
532,0.8798
533,0.8837200000000001
534,0.89631
535,0.8973399999999999
536,0.92032
537,0.9243
538,0.9409200000000001
539,0.9595299999999999
540,0.96652
541,0.9909
542,0.9877100000000001
543,0.9975299999999999
544,1.0036
545,1.0024
546,1.0206
547,1.0096
548,1.0173
549,1.0183
550,1.0174
551,1.0343
552,1.0273
553,1.0404
554,1.0425
555,1.046
556,1.0631
557,1.0599
558,1.0769
559,1.0784
560,1.0842
561,1.0982
562,1.094
563,1.1106
564,1.1122
565,1.1321
566,1.1683
567,1.1991
568,1.2517
569,1.2777
570,1.3151
571,1.3559999999999999
572,1.392
573,1.4496
574,1.4757
575,1.5115
576,1.5379
577,1.5564
578,1.5930000000000002
579,1.6003
580,1.6253
581,1.64
582,1.6511
583,1.6757
584,1.675
585,1.6942
586,1.7012
587,1.7101
588,1.7289
589,1.7256
590,1.7419
591,1.7417
592,1.7475
593,1.7588
594,1.7506
595,1.7601
596,1.7469999999999999
597,1.7438
598,1.7432
599,1.73
600,1.7381
601,1.7225
602,1.724
603,1.7265
604,1.7228
605,1.7411
606,1.7317
607,1.7418
608,1.7465
609,1.7466
610,1.7641
611,1.7534
612,1.7630000000000001
613,1.7629
614,1.7633
615,1.7778
616,1.7690000000000001
617,1.7816
618,1.7806
619,1.7839
620,1.7965
621,1.7886
622,1.8008
623,1.7941
624,1.7952
625,1.8011
626,1.7905
627,1.8003
628,1.7882
629,1.7893
630,1.7929
631,1.7857
632,1.7994
633,1.7867
634,1.7905
635,1.7915
636,1.7852
637,1.7995
638,1.7841
639,1.7895
640,1.788
641,1.7834
642,1.7955
643,1.7821
644,1.7908
645,1.7892
646,1.7886
647,1.7994
648,1.7875
649,1.8001
650,1.8055
651,1.8263
652,1.8595
653,1.8671
654,1.8799
655,1.8593
656,1.847
657,1.849
658,1.8469
659,1.8659999999999999
660,1.8526
661,1.8459999999999999
662,1.8423
663,1.8384
664,1.8629
665,1.8595
666,1.8689
667,1.8711
668,1.8698
669,1.8924
670,1.8886
671,1.9041
672,1.9081
673,1.909
674,1.926
675,1.92
676,1.9357
677,1.9372
678,1.939
679,1.9495
680,1.9373
681,1.945
682,1.9342
683,1.9287
684,1.9285
685,1.9103
686,1.9119
687,1.8917
688,1.8822
689,1.8759
690,1.8577
691,1.8606
692,1.8386
693,1.8317
694,1.8233
695,1.807
696,1.8108
697,1.7858
698,1.7797
699,1.768
700,1.7528
701,1.755
702,1.7299
703,1.7248
704,1.7088
705,1.6928
706,1.6896
707,1.6621
708,1.6532
709,1.6281
710,1.6066
711,1.594
712,1.5612
713,1.5461
714,1.5112
715,1.4858
716,1.4677
717,1.4347
718,1.4184
719,1.3793
720,1.3582
721,1.3461
722,1.3235
723,1.3084
724,1.2525
725,1.2101
726,1.1782
727,1.1588
728,1.167
729,1.1403
730,1.1228
731,1.0929
732,1.0619
733,1.0474
734,1.0051
735,0.9782200000000001
736,0.93774
737,0.89933
738,0.8730100000000001
739,0.8263799999999999
740,0.8013399999999999
741,0.76539
742,0.7408399999999999
743,0.72901
744,0.70485
745,0.70403
746,0.6875899999999999
747,0.68248
748,0.68092
749,0.66564
750,0.66824
751,0.6469
752,0.63641
753,0.62256
754,0.59709
755,0.58814
756,0.55185
757,0.53078
758,0.5040100000000001
759,0.47167
760,0.45674
761,0.41626
762,0.39565
763,0.36745
764,0.33883
765,0.32506
766,0.29136999999999996
767,0.28043
768,0.2615
769,0.2482
770,0.24603000000000003
771,0.22579000000000002
772,0.2253
773,0.21031
774,0.20243
775,0.19987
776,0.18087
777,0.17928
778,0.15783
779,0.14654
780,0.13782
781,0.1188
782,0.11944
783,0.098248
784,0.09039
785,0.079927
786,0.061746
787,0.062689
788,0.039409
789,0.033524
790,0.02103
791,0.0033821999999999997
792,0.0012118
793,-0.02355
794,-0.027558
795,-0.038602
796,-0.048283
797,-0.044982999999999995
798,-0.061134
799,-0.057612000000000003
800,-0.066039
801,-0.070999
802,-0.06905700000000001
803,-0.086037
804,-0.08610599999999999
805,-0.10272
806,-0.1112
807,-0.11413
808,-0.13021
809,-0.12874000000000002
810,-0.14767
811,-0.15563
812,-0.16178
813,-0.17661
814,-0.17318
815,-0.1931
816,-0.19934000000000002
817,-0.20893
818,-0.22496999999999998
819,-0.22378
820,-0.24854
821,-0.25493000000000005
822,-0.26664
823,-0.27976999999999996
824,-0.27864
825,-0.30023
826,-0.30355
827,-0.31564000000000003
828,-0.32492
829,-0.32297
830,-0.34035
831,-0.34029
832,-0.35391999999999996
833,-0.36238000000000004
834,-0.36362
835,-0.38009
836,-0.37849
837,-0.39405999999999997
838,-0.40186
839,-0.40681999999999996
840,-0.42321000000000003
841,-0.4213
842,-0.44122
843,-0.45357
844,-0.46997
845,-0.493
846,-0.49076000000000003
847,-0.50392
848,-0.50054
849,-0.50742
850,-0.52642
851,-0.53064
852,-0.55429
853,-0.55498
854,-0.56225
855,-0.5736899999999999
856,-0.57489
857,-0.59659
858,-0.59829
859,-0.60974
860,-0.61952
861,-0.6212
862,-0.64036
863,-0.64
864,-0.65162
865,-0.65551
866,-0.65281
867,-0.66366
868,-0.65577
869,-0.66382
870,-0.66066
871,-0.65417
872,-0.65775
873,-0.64368
874,-0.65061
875,-0.6453399999999999
876,-0.6422800000000001
877,-0.64645
878,-0.6327699999999999
879,-0.64252
880,-0.637
881,-0.63815
882,-0.64399
883,-0.6353
884,-0.65047
885,-0.6519
886,-0.66666
887,-0.68442
888,-0.68992
889,-0.71195
890,-0.71478
891,-0.7302
892,-0.74351
893,-0.74849
894,-0.76771
895,-0.7674
896,-0.78135
897,-0.78771
898,-0.78867
899,-0.80216
900,-0.79915
901,-0.8167800000000001
902,-0.82501
903,-0.83101
904,-0.8440200000000001
905,-0.83741
906,-0.8519200000000001
907,-0.85216
908,-0.85383
909,-0.85967
910,-0.8458700000000001
911,-0.85535
912,-0.8459700000000001
913,-0.84104
914,-0.8371700000000001
915,-0.8174
916,-0.81825
917,-0.80006
918,-0.78988
919,-0.7773399999999999
920,-0.7526
921,-0.74622
922,-0.7220300000000001
923,-0.7107399999999999
924,-0.69419
925,-0.66871
926,-0.65789
927,-0.62876
928,-0.61527
929,-0.5912
930,-0.55928
931,-0.53694
932,-0.49683
933,-0.47853999999999997
934,-0.44946
935,-0.41798
936,-0.39225
937,-0.34721
938,-0.32655
939,-0.29291999999999996
940,-0.26385
941,-0.24072
942,-0.20192000000000002
943,-0.18963
944,-0.16211
945,-0.14362
946,-0.12900999999999999
947,-0.10364000000000001
948,-0.10238
949,-0.084845
950,-0.078466
951,-0.070299
952,-0.052819000000000005
953,-0.054563
954,-0.038542
955,-0.036697
956,-0.028841000000000002
957,-0.014546000000000002
958,-0.015141
959,0.0033531
960,0.0047114
961,0.016021
962,0.029537
963,0.030483
964,0.049352
965,0.046561
966,0.057724
967,0.068788
968,0.073303
969,0.098194
970,0.09921
971,0.11760999999999999
972,0.1304
973,0.13831
974,0.16271
975,0.16345
976,0.18342999999999998
977,0.19543
978,0.2083
979,0.23533
980,0.24122
981,0.26438
982,0.27414
983,0.28976
984,0.3193
985,0.33382
986,0.36455
987,0.37296999999999997
988,0.38529
989,0.40526999999999996
990,0.41586000000000006
991,0.44671000000000005
992,0.45352
993,0.46578
994,0.47723999999999994
995,0.48028000000000004
996,0.50526
997,0.50778
998,0.52384
999,0.53569
1000,0.54015
1001,0.56324
1002,0.55943
1003,0.57339
1004,0.5798
1005,0.58225
1006,0.59859
1007,0.59046
1008,0.6
1009,0.59818
1010,0.59663
1011,0.60542
1012,0.5930300000000001
1013,0.59775
1014,0.58668
1015,0.5797399999999999
1016,0.57963
1017,0.56171
1018,0.5594899999999999
1019,0.53604
1020,0.51995
1021,0.5083300000000001
1022,0.48572
1023,0.48168
1024,0.45441000000000004
1025,0.43805
1026,0.4213
1027,0.39688
1028,0.39102
1029,0.35974
1030,0.34279
1031,0.32051999999999997
1032,0.29474
1033,0.28798
1034,0.25656
1035,0.24135
1036,0.2157
1037,0.1909
1038,0.18384
1039,0.15634
1040,0.14269
1041,0.11319000000000001
1042,0.091464
1043,0.088662
1044,0.067493
1045,0.050906
1046,0.0088545
1047,-0.014099
1048,-0.0069658
1049,-0.015784
1050,-0.054518
1051,-0.17728
1052,-0.31466
1053,-0.40917
1054,-0.44353000000000004
1055,-0.41661000000000004
1056,-0.41783000000000003
1057,-0.43246
1058,-0.45911
1059,-0.48028000000000004
1060,-0.46896000000000004
1061,-0.48223
1062,-0.48612
1063,-0.49736
1064,-0.50603
1065,-0.49331
1066,-0.50455
1067,-0.50063
1068,-0.49249
1069,-0.48228000000000004
1070,-0.50525
1071,-0.54711
1072,-0.52184
1073,-0.45055
1074,-0.42483999999999994
1075,-0.5269
1076,-0.63349
1077,-0.5372899999999999
1078,-0.32106999999999997
1079,-0.28707
1080,-0.57445
1081,-0.8012199999999999
1082,-0.51905
1083,0.013106
1084,0.025128
1085,-0.7299899999999999
1086,-1.2694
1087,-0.48036
1088,1.0598
1089,1.052
1090,-2.3341
1091,-8.1255
