time,value
0,1.1613
1,0.06005599999999999
2,-1.1059999999999999
3,-1.1059999999999999
4,-1.1059999999999999
5,0.9669700000000001
6,1.0965
7,0.31917
8,-1.1059999999999999
9,-1.1059999999999999
10,-1.1059999999999999
11,0.64307
12,1.1613
13,0.64307
14,-1.1059999999999999
15,-1.1059999999999999
16,-1.1059999999999999
17,0.31917
18,1.1613
19,0.77263
20,-1.1059999999999999
21,-1.1059999999999999
22,-1.1059999999999999
23,0.12484
24,1.1613
25,0.9669700000000001
26,-1.1059999999999999
27,-1.1059999999999999
28,-1.1059999999999999
29,0.25439
30,1.1613
31,0.70785
32,-1.1059999999999999
33,-1.1059999999999999
34,-1.1059999999999999
35,-0.069503
36,1.2261
37,1.0317
38,-0.65252
39,-1.1059999999999999
40,-1.1059999999999999
41,-0.7173
42,1.2909
43,1.0965
44,-0.13427999999999998
45,-1.1059999999999999
46,-1.1059999999999999
47,-1.1059999999999999
48,0.9021899999999999
49,1.1613
50,0.77263
51,-1.1059999999999999
52,-1.1059999999999999
53,-1.1059999999999999
54,0.70785
55,1.1613
56,1.0317
57,0.64307
58,-1.1059999999999999
59,-1.1059999999999999
60,-1.1059999999999999
61,0.31917
62,1.2261
63,1.0317
64,1.0317
65,0.9669700000000001
66,0.9669700000000001
67,-0.13427999999999998
68,-1.1059999999999999
69,-1.1059999999999999
70,-0.9764200000000001
71,1.3556
72,1.0965
73,1.0317
74,1.0317
75,0.9669700000000001
76,0.9021899999999999
77,0.9669700000000001
78,0.9669700000000001
79,-1.1059999999999999
80,-1.1059999999999999
81,-1.1059999999999999
82,-0.26384
83,1.2261
84,1.0965
85,1.0317
86,1.0317
87,-0.91164
88,-1.1059999999999999
89,-1.1059999999999999
90,-0.3934
91,1.2909
92,1.0965
93,1.0317
94,-0.19906
95,-1.1059999999999999
