time,value
0,-0.21394000000000002
1,-0.21394000000000002
2,-0.21394000000000002
3,-0.21394000000000002
4,-0.21394000000000002
5,-0.21394000000000002
6,-0.21394000000000002
7,-0.21394000000000002
8,-0.21394000000000002
9,-0.21394000000000002
10,-0.21394000000000002
11,-0.21394000000000002
12,-0.21394000000000002
13,-0.21394000000000002
14,-0.21394000000000002
15,-0.21394000000000002
16,-0.21394000000000002
17,-0.21394000000000002
18,-0.21394000000000002
19,-0.21394000000000002
20,-0.21394000000000002
21,-0.21394000000000002
22,-0.21394000000000002
23,-0.21394000000000002
24,-0.21394000000000002
25,-0.21394000000000002
26,-0.21394000000000002
27,-0.21394000000000002
28,-0.21394000000000002
29,-0.21394000000000002
30,-0.21394000000000002
31,-0.21394000000000002
32,-0.21394000000000002
33,-0.21394000000000002
34,-0.21394000000000002
35,-0.21394000000000002
36,-0.21394000000000002
37,-0.21394000000000002
38,-0.21394000000000002
39,-0.21394000000000002
40,-0.21394000000000002
41,4.515
42,5.0443
43,0.10822999999999999
44,-0.21394000000000002
45,-0.21394000000000002
46,-0.21394000000000002
47,-0.21394000000000002
48,-0.21394000000000002
49,-0.21394000000000002
50,-0.21394000000000002
51,-0.21394000000000002
52,-0.21394000000000002
53,-0.21394000000000002
54,-0.21394000000000002
55,-0.21394000000000002
56,-0.21394000000000002
57,-0.21394000000000002
58,-0.21394000000000002
59,-0.21394000000000002
60,-0.21394000000000002
61,-0.21394000000000002
62,-0.21394000000000002
63,-0.21394000000000002
64,-0.21394000000000002
65,-0.21394000000000002
66,-0.21394000000000002
67,-0.21394000000000002
68,-0.21394000000000002
69,-0.21394000000000002
70,-0.21394000000000002
71,-0.21394000000000002
72,-0.21394000000000002
73,-0.21394000000000002
74,-0.21394000000000002
75,-0.21394000000000002
76,-0.21394000000000002
77,-0.21394000000000002
78,-0.21394000000000002
79,-0.21394000000000002
80,-0.21394000000000002
81,-0.21394000000000002
82,0.29231999999999997
83,5.585
84,3.7096
85,-0.21394000000000002
86,-0.21394000000000002
87,-0.21394000000000002
88,-0.21394000000000002
89,-0.21394000000000002
90,-0.21394000000000002
91,-0.21394000000000002
92,-0.21394000000000002
93,-0.21394000000000002
94,-0.21394000000000002
95,-0.21394000000000002
