time,value
0,0.8823799999999999
1,0.78815
2,0.8823799999999999
3,0.78815
4,0.8823799999999999
5,0.78815
6,0.8823799999999999
7,-0.43677
8,-1.0963
9,-1.0963
10,-1.0963
11,-1.0963
12,-1.0963
13,-1.0963
14,-1.0963
15,-1.0963
16,1.165
17,1.2593
18,1.165
19,0.9766
20,0.9766
21,0.8823799999999999
22,0.8823799999999999
23,0.8823799999999999
24,0.034352999999999995
25,-1.0963
26,-1.0963
27,-1.0963
28,-1.0963
29,-1.0963
30,-1.0963
31,-1.0963
32,0.50548
33,1.2593
34,1.0708
35,0.9766
36,0.9766
37,0.8823799999999999
38,0.8823799999999999
39,0.78815
40,0.8823799999999999
41,-0.531
42,-1.0963
43,-1.0963
44,-1.0963
45,-1.0963
46,-1.0963
47,-1.0963
48,-1.0963
49,-0.24831999999999999
50,1.3535
51,1.165
52,1.0708
53,0.9766
54,0.8823799999999999
55,0.8823799999999999
56,0.8823799999999999
57,-0.24831999999999999
58,-1.0963
59,-1.0963
60,-1.0963
61,-1.0963
62,-1.0963
63,-1.0963
64,-1.0963
65,-0.34255
66,1.3535
67,1.2593
68,0.9766
69,0.9766
70,0.8823799999999999
71,0.8823799999999999
72,0.8823799999999999
73,0.8823799999999999
74,0.8823799999999999
75,-0.62522
76,-1.0963
77,-1.0963
78,-1.0963
79,-1.0963
80,-1.0963
81,-1.0963
82,-1.0963
83,0.12858
84,1.2593
85,1.165
86,1.0708
87,0.8823799999999999
88,0.9766
89,0.78815
90,0.8823799999999999
91,0.5997
92,-1.0963
93,-1.0963
94,-1.0963
95,-1.0963
