time,value
0,-0.24329
1,-0.24329
2,-0.24329
3,-0.24329
4,-0.24329
5,-0.24329
6,-0.24329
7,-0.24329
8,-0.24329
9,-0.24329
10,-0.24329
11,-0.24329
12,-0.24329
13,-0.24329
14,-0.24329
15,-0.24329
16,-0.24329
17,-0.24329
18,-0.24329
19,-0.24329
20,-0.24329
21,-0.24329
22,-0.24329
23,-0.24329
24,-0.24329
25,-0.24329
26,-0.24329
27,-0.24329
28,-0.24329
29,-0.24329
30,-0.24329
31,-0.24329
32,-0.24329
33,-0.24329
34,-0.24329
35,-0.24329
36,-0.24329
37,-0.24329
38,-0.24329
39,-0.24329
40,-0.24329
41,-0.24329
42,-0.24329
43,-0.24329
44,-0.24329
45,-0.24329
46,-0.24329
47,4.354
48,0.31085
49,0.085088
50,4.9492
51,0.78289
52,4.6824
53,0.37242
54,-0.058578
55,-0.24329
56,-0.24329
57,-0.24329
58,-0.24329
59,-0.24329
60,-0.24329
61,-0.24329
62,-0.24329
63,-0.24329
64,-0.24329
65,-0.24329
66,-0.24329
67,-0.24329
68,-0.24329
69,-0.24329
70,-0.24329
71,-0.24329
72,-0.24329
73,-0.24329
74,-0.24329
75,4.8261
76,0.6187
77,-0.24329
78,-0.24329
79,-0.24329
80,-0.24329
81,-0.24329
82,-0.24329
83,-0.24329
84,-0.24329
85,-0.24329
86,-0.24329
87,-0.24329
88,-0.24329
89,-0.24329
90,-0.24329
91,-0.24329
92,-0.24329
93,-0.24329
94,-0.24329
95,-0.24329
