time,value
0,1.1879
1,1.0361
2,1.0361
3,1.0361
4,1.0361
5,1.0361
6,0.42866000000000004
7,-0.93799
8,-0.93799
9,-0.93799
10,-0.93799
11,-0.93799
12,-0.93799
13,1.3398
14,1.1879
15,1.1879
16,1.0361
17,0.5805100000000001
18,-0.93799
19,-0.93799
20,-0.93799
21,-0.93799
22,-0.93799
23,-0.93799
24,1.4916
25,1.1879
26,1.1879
27,1.0361
28,-0.17874
29,-0.93799
30,-0.93799
31,-0.93799
32,-0.93799
33,-0.93799
34,-0.026889999999999997
35,1.3398
36,1.1879
37,1.0361
38,0.27681
39,-0.93799
40,-0.93799
41,-0.93799
42,-0.93799
43,-0.93799
44,-0.93799
45,1.4916
46,1.1879
47,1.0361
48,1.0361
49,-0.6342899999999999
50,-0.93799
51,-0.93799
52,-0.93799
53,-0.93799
54,-0.93799
55,0.27681
56,1.4916
57,1.0361
58,1.0361
59,1.0361
60,-0.93799
61,-0.93799
62,-0.93799
63,-0.93799
64,-0.93799
65,-0.93799
66,0.5805100000000001
67,1.3398
68,1.1879
69,1.0361
70,1.0361
71,-0.93799
72,-0.93799
73,-0.93799
74,-0.93799
75,-0.93799
76,-0.93799
77,1.6435
78,1.1879
79,1.0361
80,1.0361
81,1.0361
82,-0.026889999999999997
83,-0.93799
84,-0.93799
85,-0.93799
86,-0.93799
87,-0.93799
88,0.27681
89,1.3398
90,1.1879
91,1.0361
92,0.42866000000000004
93,-0.93799
94,-0.93799
95,-0.93799
