time,value
0,-1.4785
1,0.10885
2,-0.44677
3,-1.7263
4,-2.3737
5,-2.0334
6,-1.3349
7,-1.0496
8,-1.3239
9,-1.7432
10,-1.8711
11,-1.6521
12,-1.3933
13,-1.3573
14,-1.5071
15,-1.6501
16,-1.6442
17,-1.5254
18,-1.4483
19,-1.4637
20,-1.5174
21,-1.5519999999999998
22,-1.5322
23,-1.4916
24,-1.483
25,-1.4915
26,-1.4985
27,-1.5026
28,-1.493
29,-1.4926
30,-1.4915
31,-1.4764
32,-1.4765
33,-1.4706
34,-1.4512
35,-1.4519
36,-1.4406
37,-1.4205
38,-1.4186
39,-1.4041
40,-1.3869999999999998
41,-1.3826
42,-1.3648
43,-1.3502
44,-1.3428
45,-1.3219999999999998
46,-1.3109
47,-1.3015
48,-1.2797
49,-1.2739
50,-1.2644
51,-1.2424
52,-1.2419
53,-1.2313
54,-1.2124
55,-1.2134
56,-1.2019
57,-1.1873
58,-1.1863
59,-1.1718
60,-1.1597
61,-1.1547
62,-1.1352
63,-1.1233
64,-1.1126
65,-1.0884
66,-1.0789
67,-1.0651
68,-1.0377
69,-1.0299
70,-1.0119
71,-0.9847799999999999
72,-0.9784200000000001
73,-0.95994
74,-0.9381
75,-0.93091
76,-0.9111899999999999
77,-0.8951600000000001
78,-0.8893700000000001
79,-0.87172
80,-0.8637
81,-0.85949
82,-0.84344
83,-0.8432799999999999
84,-0.84119
85,-0.82726
86,-0.8340299999999999
87,-0.83247
88,-0.82235
89,-0.83447
90,-0.83539
91,-0.8332700000000001
92,-0.8465799999999999
93,-0.84709
94,-0.8500700000000001
95,-0.86295
96,-0.86351
97,-0.8728799999999999
98,-0.88608
99,-0.8867700000000001
100,-0.9018
101,-0.91448
102,-0.91495
103,-0.9353899999999999
104,-0.94765
105,-0.9500799999999999
106,-0.97414
107,-0.9856299999999999
108,-0.9927799999999999
109,-1.0157
110,-1.026
111,-1.0384
112,-1.0611
113,-1.0712
114,-1.0895
115,-1.1123
116,-1.1228
117,-1.1474
118,-1.1699
119,-1.1793
120,-1.2068
121,-1.2252
122,-1.2322
123,-1.2607
124,-1.2761
125,-1.2853
126,-1.3092
127,-1.3178
128,-1.3252
129,-1.3415
130,-1.3433
131,-1.3508
132,-1.3617
133,-1.3579
134,-1.3658
135,-1.3719
136,-1.3653
137,-1.3776
138,-1.3825
139,-1.3747
140,-1.3880000000000001
141,-1.3875
142,-1.3806
143,-1.3905
144,-1.3871
145,-1.3828
146,-1.3883
147,-1.379
148,-1.3743
149,-1.3741
150,-1.3597
151,-1.3563
152,-1.3512
153,-1.3319999999999999
154,-1.3294
155,-1.3196
156,-1.2965
157,-1.2957
158,-1.2819
159,-1.2606
160,-1.2564
161,-1.239
162,-1.2207
163,-1.2146
164,-1.1955
165,-1.1818
166,-1.1743
167,-1.1536
168,-1.1443
169,-1.1358
170,-1.1149
171,-1.1118
172,-1.104
173,-1.0843
174,-1.0874
175,-1.079
176,-1.0632
177,-1.0659
178,-1.0564
179,-1.0459
180,-1.048
181,-1.0364
182,-1.0283
183,-1.0266
184,-1.0117
185,-1.0075
186,-1.0038
187,-0.98587
188,-0.98316
189,-0.9752200000000001
190,-0.9561299999999999
191,-0.9612200000000001
192,-0.9570299999999999
193,-0.9451700000000001
194,-0.9511200000000001
195,-0.9430200000000001
196,-0.9327200000000001
197,-0.93686
198,-0.92981
199,-0.9281799999999999
200,-0.9340200000000001
201,-0.92596
202,-0.9274100000000001
203,-0.9309
204,-0.9233299999999999
205,-0.93347
206,-0.9396100000000001
207,-0.93229
208,-0.9447
209,-0.9459700000000001
210,-0.94
211,-0.95606
212,-0.96188
213,-0.96675
214,-0.9859700000000001
215,-0.9923
216,-1.0026
217,-1.0213
218,-1.0270000000000001
219,-1.0417
220,-1.0577
221,-1.0609
222,-1.0802
223,-1.0969
224,-1.1019
225,-1.1279
226,-1.1434
227,-1.1485
228,-1.1724
229,-1.1819
230,-1.1869
231,-1.2055
232,-1.2104
233,-1.2173
234,-1.2317
235,-1.2308
236,-1.2365
237,-1.2431
238,-1.2353
239,-1.2417
240,-1.2443
241,-1.2332
242,-1.2412
243,-1.2386
244,-1.2253
245,-1.2327
246,-1.2272
247,-1.2172
248,-1.2218
249,-1.2123
250,-1.2039
251,-1.2044
252,-1.1907
253,-1.1843
254,-1.1805
255,-1.1619
256,-1.1558
257,-1.1456
258,-1.1207
259,-1.1142
260,-1.0981
261,-1.0701
262,-1.0627
263,-1.0413
264,-1.0136
265,-1.0013
266,-0.9757100000000001
267,-0.95163
268,-0.9383799999999999
269,-0.91165
270,-0.89186
271,-0.8764700000000001
272,-0.84801
273,-0.8334799999999999
274,-0.81753
275,-0.78804
276,-0.77767
277,-0.7600600000000001
278,-0.7317899999999999
279,-0.7267100000000001
280,-0.7084
281,-0.68292
282,-0.6737
283,-0.6524
284,-0.63438
285,-0.63056
286,-0.61433
287,-0.6035699999999999
288,-0.59596
289,-0.57352
290,-0.56433
291,-0.5555100000000001
292,-0.53415
293,-0.53157
294,-0.52104
295,-0.49755
296,-0.49773
297,-0.48578000000000005
298,-0.4679
299,-0.46798999999999996
300,-0.45438
301,-0.44035
302,-0.43846999999999997
303,-0.42321000000000003
304,-0.41441000000000006
305,-0.41158999999999996
306,-0.39466
307,-0.38985
308,-0.3844
309,-0.36511
310,-0.36436999999999997
311,-0.35666
312,-0.33524
313,-0.33819
314,-0.32841
315,-0.31206999999999996
316,-0.31539
317,-0.30539
318,-0.29448
319,-0.29663
320,-0.28536999999999996
321,-0.28062
322,-0.28331
323,-0.27166999999999997
324,-0.2708
325,-0.2686
326,-0.25085999999999997
327,-0.25033
328,-0.24279
329,-0.22055
330,-0.22129000000000001
331,-0.20803000000000002
332,-0.18527000000000002
333,-0.18123
334,-0.16230999999999998
335,-0.14078
336,-0.13251
337,-0.10982
338,-0.092234
339,-0.08275
340,-0.059477999999999996
341,-0.048159
342,-0.038482
343,-0.015163
344,-0.010302
345,-0.00027037
346,0.024143
347,0.025914
348,0.041514999999999996
349,0.06763
350,0.073425
351,0.092347
352,0.11218
353,0.11599999999999999
354,0.13404000000000002
355,0.14895999999999998
356,0.15696
357,0.1805
358,0.19325
359,0.20337
360,0.22721
361,0.2335
362,0.24495999999999998
363,0.27116
364,0.27365
365,0.2868
366,0.30877
367,0.30821
368,0.32183
369,0.33919
370,0.34094
371,0.3565
372,0.3673
373,0.3679
374,0.3834
375,0.38988
376,0.39526
377,0.41634
378,0.42096000000000006
379,0.43013999999999997
380,0.45476000000000005
381,0.45798
382,0.47417
383,0.50266
384,0.50951
385,0.5312399999999999
386,0.5575399999999999
387,0.56801
388,0.5937899999999999
389,0.61695
390,0.62971
391,0.6564300000000001
392,0.67209
393,0.68272
394,0.70597
395,0.7097600000000001
396,0.71308
397,0.7266600000000001
398,0.71368
399,0.7087100000000001
400,0.71418
401,0.6956899999999999
402,0.69122
403,0.69158
404,0.6762100000000001
405,0.67911
406,0.6839
407,0.6805
408,0.6924100000000001
409,0.69462
410,0.69377
411,0.71153
412,0.71799
413,0.72931
414,0.75289
415,0.74898
416,0.7505
417,0.76337
418,0.75407
419,0.7617
420,0.7752399999999999
421,0.76962
422,0.77809
423,0.7854899999999999
424,0.7825300000000001
425,0.79472
426,0.79676
427,0.79183
428,0.8005800000000001
429,0.7943399999999999
430,0.7912
431,0.80277
432,0.79164
433,0.78805
434,0.7962
435,0.77932
436,0.7771100000000001
437,0.78089
438,0.76579
439,0.7653
440,0.76402
441,0.75112
442,0.75343
443,0.7478899999999999
444,0.7368399999999999
445,0.74032
446,0.7290800000000001
447,0.71914
448,0.7231
449,0.7054199999999999
450,0.69519
451,0.69716
452,0.67275
453,0.66171
454,0.6562100000000001
455,0.63085
456,0.61974
457,0.6079399999999999
458,0.58321
459,0.5726899999999999
460,0.5543399999999999
461,0.52974
462,0.51979
463,0.49646999999999997
464,0.47461000000000003
465,0.46738
466,0.44051999999999997
467,0.42191000000000006
468,0.41768
469,0.3884
470,0.37373
471,0.36607
472,0.33876999999999996
473,0.32621
474,0.31434
475,0.28973000000000004
476,0.27960999999999997
477,0.26243
478,0.23806999999999998
479,0.2278
480,0.20457999999999998
481,0.18169000000000002
482,0.17271
483,0.14411
484,0.12197999999999999
485,0.11327000000000001
486,0.079881
487,0.060109
488,0.048192
489,0.016447999999999997
490,-0.00043031
491,-0.015334
492,-0.042694
493,-0.05435
494,-0.070421
495,-0.09249500000000001
496,-0.09891699999999999
497,-0.11596
498,-0.1323
499,-0.13360999999999998
500,-0.1524
501,-0.16452999999999998
502,-0.16234
503,-0.1835
504,-0.1918
505,-0.1915
506,-0.21181999999999998
507,-0.2178
508,-0.22135
509,-0.23881
510,-0.24147
511,-0.24845
512,-0.26308000000000004
513,-0.26265
514,-0.2723
515,-0.28239000000000003
516,-0.27731
517,-0.28854
518,-0.29344000000000003
519,-0.28286
520,-0.29381999999999997
521,-0.29177
522,-0.27906
523,-0.28654
524,-0.27853
525,-0.26571
526,-0.26658000000000004
527,-0.25142
528,-0.2386
529,-0.23444
530,-0.21578000000000003
531,-0.20699
532,-0.19941
533,-0.1752
534,-0.16644
535,-0.15479
536,-0.13125
537,-0.13104000000000002
538,-0.11682999999999999
539,-0.087086
540,-0.078047
541,-0.058904
542,-0.040583
543,-0.037304000000000004
544,-0.010476000000000001
545,0.022568
546,0.042754
547,0.061914
548,0.05773300000000001
549,0.057106
550,0.10489000000000001
551,0.17968
552,0.28064
553,0.38251999999999997
554,0.42226
555,0.43387
556,0.44328
557,0.44014
558,0.46726
559,0.50393
560,0.51452
561,0.52871
562,0.53932
563,0.5464600000000001
564,0.57616
565,0.59835
566,0.61158
567,0.63525
568,0.64372
569,0.65792
570,0.68883
571,0.6967399999999999
572,0.71112
573,0.73587
574,0.73639
575,0.7511899999999999
576,0.77067
577,0.76988
578,0.78161
579,0.7911600000000001
580,0.78913
581,0.8026399999999999
582,0.8083899999999999
583,0.80938
584,0.82544
585,0.82629
586,0.8291799999999999
587,0.84729
588,0.8440700000000001
589,0.85015
590,0.86961
591,0.8638299999999999
592,0.8726299999999999
593,0.8881
594,0.88485
595,0.8971100000000001
596,0.9093
597,0.90946
598,0.92553
599,0.93447
600,0.93795
601,0.95681
602,0.96088
603,0.96621
604,0.98698
605,0.9868299999999999
606,0.9954700000000001
607,1.0184
608,1.0148
609,1.0257
610,1.0436
611,1.0414
612,1.0543
613,1.0675
614,1.067
615,1.0822
616,1.0906
617,1.0926
618,1.1107
619,1.1151
620,1.1201
621,1.1407
622,1.1404
623,1.1478
624,1.1706
625,1.1663
626,1.1772
627,1.197
628,1.1963
629,1.2117
630,1.2291
631,1.2329
632,1.2535
633,1.2689
634,1.2777
635,1.3031
636,1.3157
637,1.3284
638,1.3575
639,1.3665
640,1.3826
641,1.4143
642,1.4186
643,1.4371
644,1.4649
645,1.4705
646,1.4916
647,1.5144
648,1.521
649,1.5432
650,1.5597
651,1.5677
652,1.5919999999999999
653,1.6039
654,1.6145
655,1.6412
656,1.6480000000000001
657,1.6613
658,1.6909
659,1.6946
660,1.7125
661,1.7409999999999999
662,1.7468
663,1.7686
664,1.7936
665,1.8025
666,1.8276
667,1.8478
668,1.8583
669,1.8845
670,1.8979
671,1.9085
672,1.9342
673,1.9392
674,1.9484
675,1.9726
676,1.9698
677,1.9792
678,1.9989
679,1.9937
680,2.0036
681,2.0166
682,2.0122
683,2.0242
684,2.0324
685,2.0306
686,2.0453
687,2.0484
688,2.0486
689,2.0649
690,2.0622
691,2.0642
692,2.0819
693,2.0736
694,2.0769
695,2.0909999999999997
696,2.0794
697,2.083
698,2.0901
699,2.0787
700,2.0829
701,2.0827
702,2.0708
703,2.0741
704,2.0657
705,2.0534
706,2.0566
707,2.0411
708,2.0288
709,2.0312
710,2.0079
711,1.9958
712,1.9957
713,1.9702
714,1.9605
715,1.955
716,1.9306
717,1.9222
718,1.9114
719,1.8896
720,1.8843
721,1.8687
722,1.8488
723,1.8443
724,1.8222
725,1.8035
726,1.8001
727,1.7724
728,1.7549
729,1.7495
730,1.7175
731,1.7011
732,1.6902
733,1.6605
734,1.6469999999999998
735,1.6314
736,1.6041
737,1.5932
738,1.5735
739,1.55
740,1.5427
741,1.5190000000000001
742,1.4980000000000002
743,1.4921
744,1.4631
745,1.4439
746,1.4378
747,1.4052
748,1.3878
749,1.3764
750,1.3456
751,1.331
752,1.3153
753,1.2874
754,1.2753
755,1.2546
756,1.2285
757,1.218
758,1.1926
759,1.1698
760,1.163
761,1.1349
762,1.1162
763,1.1112
764,1.0795
765,1.0632
766,1.054
767,1.0252
768,1.012
769,0.9982
770,0.97119
771,0.9596399999999999
772,0.9407200000000001
773,0.91599
774,0.90664
775,0.88295
776,0.86049
777,0.8534299999999999
778,0.82642
779,0.80845
780,0.80557
781,0.77651
782,0.76277
783,0.7569899999999999
784,0.73164
785,0.72231
786,0.71421
787,0.6933199999999999
788,0.68847
789,0.6779
790,0.66152
791,0.66098
792,0.64757
793,0.63436
794,0.63544
795,0.61622
796,0.6036
797,0.60477
798,0.57991
799,0.56844
800,0.5646100000000001
801,0.53974
802,0.52991
803,0.5219699999999999
804,0.50078
805,0.49543999999999994
806,0.48498
807,0.46731000000000006
808,0.46486000000000005
809,0.45097
810,0.43767
811,0.4398
812,0.42383999999999994
813,0.41435
814,0.41883000000000004
815,0.39836
816,0.38985
817,0.38932
818,0.36834
819,0.3638
820,0.36280999999999997
821,0.34656
822,0.34207
823,0.33066999999999996
824,0.31358
825,0.3174
826,0.315
827,0.31024
828,0.31337
829,0.29478000000000004
830,0.28686999999999996
831,0.30469
832,0.30483000000000005
833,0.30469
834,0.2848
835,0.21438000000000001
836,0.14836
837,0.10053
838,0.066433
839,0.068685
840,0.070513
841,0.053854
842,0.041759
843,0.018698
844,0.00074255
845,0.0030711
846,-0.011387000000000001
847,-0.025544999999999998
848,-0.029177999999999996
849,-0.054353
850,-0.0654
851,-0.065294
852,-0.088308
853,-0.09962
854,-0.10857
855,-0.13199
856,-0.13985
857,-0.15075
858,-0.17134000000000002
859,-0.17827
860,-0.19474
861,-0.21320999999999998
862,-0.21750999999999998
863,-0.23798000000000002
864,-0.25497
865,-0.25876
866,-0.28419
867,-0.29952
868,-0.30474
869,-0.33211999999999997
870,-0.34588
871,-0.35578000000000004
872,-0.38171
873,-0.39388
874,-0.4088
875,-0.43348000000000003
876,-0.44387
877,-0.46251000000000003
878,-0.48394
879,-0.49133000000000004
880,-0.51357
881,-0.53262
882,-0.53774
883,-0.56271
884,-0.57733
885,-0.58003
886,-0.60447
887,-0.61473
888,-0.61971
889,-0.64079
890,-0.64766
891,-0.65586
892,-0.67403
893,-0.67745
894,-0.6876399999999999
895,-0.70068
896,-0.69868
897,-0.7097399999999999
898,-0.71772
899,-0.71122
900,-0.72355
901,-0.72617
902,-0.7157399999999999
903,-0.72709
904,-0.72387
905,-0.71373
906,-0.71935
907,-0.70975
908,-0.6996100000000001
909,-0.69985
910,-0.6859
911,-0.6789
912,-0.67672
913,-0.66023
914,-0.65633
915,-0.65079
916,-0.6318
917,-0.63253
918,-0.6262300000000001
919,-0.60751
920,-0.61223
921,-0.6035
922,-0.58795
923,-0.59011
924,-0.57835
925,-0.56629
926,-0.5666899999999999
927,-0.55389
928,-0.5476800000000001
929,-0.54691
930,-0.53076
931,-0.52566
932,-0.51982
933,-0.5009
934,-0.50144
935,-0.49462
936,-0.47181000000000006
937,-0.47043999999999997
938,-0.45399999999999996
939,-0.43013
940,-0.42633000000000004
941,-0.40928000000000003
942,-0.38988
943,-0.38101
944,-0.35568
945,-0.33464
946,-0.32056999999999997
947,-0.29265
948,-0.27655
949,-0.26023
950,-0.22903
951,-0.21583000000000002
952,-0.19682
953,-0.16426
954,-0.15616
955,-0.13532
956,-0.10575999999999999
957,-0.09577999999999999
958,-0.07157000000000001
959,-0.045103
960,-0.032258999999999996
961,-0.0046213
962,0.019047
963,0.035809
964,0.06759
965,0.087923
966,0.1061
967,0.13752
968,0.15065
969,0.1698
970,0.20442000000000002
971,0.2159
972,0.23865
973,0.26833
974,0.27471999999999996
975,0.29391999999999996
976,0.31628
977,0.32531
978,0.34975
979,0.36988000000000004
980,0.38058000000000003
981,0.40502
982,0.41868
983,0.43113999999999997
984,0.45851000000000003
985,0.4682
986,0.48163999999999996
987,0.5079199999999999
988,0.50978
989,0.5227
990,0.54501
991,0.54514
992,0.55825
993,0.57291
994,0.57058
995,0.5813699999999999
996,0.58733
997,0.58316
998,0.59225
999,0.58959
1000,0.58345
1001,0.5909
1002,0.58075
1003,0.57394
1004,0.57963
1005,0.56083
1006,0.55201
1007,0.55297
1008,0.53176
1009,0.52444
1010,0.51976
1011,0.49821000000000004
1012,0.4904
1013,0.47886000000000006
1014,0.45732
1015,0.44913000000000003
1016,0.42998000000000003
1017,0.40791
1018,0.40096
1019,0.37905
1020,0.36141
1021,0.35638000000000003
1022,0.32755
1023,0.30861
1024,0.30116
1025,0.27273000000000003
1026,0.25923
1027,0.24894000000000002
1028,0.221
1029,0.20629
1030,0.18731
1031,0.15527
1032,0.13232
1033,0.094773
1034,0.05154500000000001
1035,0.024128
1036,-0.014943000000000001
1037,-0.048486
1038,-0.06977799999999999
1039,-0.11557
1040,-0.15277000000000002
1041,-0.17603
1042,-0.21703000000000003
1043,-0.23976
1044,-0.25673
1045,-0.29108
1046,-0.31029
1047,-0.32804
1048,-0.35226
1049,-0.36057
1050,-0.3795
1051,-0.40681999999999996
1052,-0.42325
1053,-0.45447
1054,-0.48085
1055,-0.49044
1056,-0.51835
1057,-0.53598
1058,-0.54038
1059,-0.5668300000000001
1060,-0.5775899999999999
1061,-0.5811
1062,-0.60085
1063,-0.6048899999999999
1064,-0.60088
1065,-0.59345
1066,-0.59745
1067,-0.63563
1068,-0.66147
1069,-0.62756
1070,-0.55991
1071,-0.51891
1072,-0.57276
1073,-0.6903600000000001
1074,-0.70762
1075,-0.55273
1076,-0.35909
1077,-0.33709
1078,-0.57412
1079,-0.8333200000000001
1080,-0.74963
1081,-0.30256
1082,0.076272
1083,-0.11199
1084,-0.83268
1085,-1.3165
1086,-0.7754
1087,0.60759
1088,1.4746
1089,0.17640999999999998
1090,-3.7824
1091,-9.0557
