time,value
0,-0.18103
1,-0.16667
2,-0.19898
3,-0.16308
4,-0.1918
5,-0.18462
6,-0.1559
7,-0.20257
8,-0.16308
9,-0.16667
10,-0.20257
11,-0.15231
12,-0.18462
13,-0.18103
14,-0.15949000000000002
15,-0.18821
16,-0.16308
17,-0.17744000000000001
18,-0.18821
19,-0.14872
20,-0.19539
21,-0.17744000000000001
22,-0.15231
23,-0.19898
24,-0.15231
25,-0.1559
26,-0.19539
27,-0.14154
28,-0.17385
29,-0.14154
30,-0.13077
31,-0.17026
32,-0.14872
33,-0.14513
34,-0.17385
35,-0.14513
36,-0.16667
37,-0.18103
38,-0.15231
39,-0.18821
40,-0.17385
41,-0.15949000000000002
42,-0.19539
43,-0.15949000000000002
44,-0.17026
45,-0.1918
46,-0.1559
47,-0.18821
48,-0.18103
49,-0.16308
50,-0.1918
51,-0.16667
52,-0.18103
53,-0.1918
54,-0.15949000000000002
55,-0.19898
56,-0.18103
57,-0.17385
58,-0.19539
59,-0.16308
60,-0.18103
61,-0.18103
62,-0.15231
63,-0.19898
64,-0.15949000000000002
65,-0.16667
66,-0.19539
67,-0.15231
68,-0.18821
69,-0.1918
70,-0.1559
71,5.8824
72,7.0598
73,2.8022
74,-0.10205
75,-0.11282
76,-0.14872
77,-0.13077
78,-0.14154
79,-0.16667
80,-0.13435999999999998
81,-0.15231
82,-0.17026
83,-0.13795
84,-0.17385
85,-0.17385
86,-0.14154
87,-0.18462
88,-0.18103
89,-0.16667
90,-0.19539
91,-0.15949000000000002
92,-0.17026
93,-0.18821
94,-0.16667
95,-0.17385
