time,value
0,0.21686
1,1.1997
2,1.1997
3,1.1104
4,-1.034
5,-1.034
6,-1.034
7,-1.034
8,-1.034
9,0.57426
10,1.1997
11,1.1104
12,1.021
13,-1.034
14,-1.034
15,-1.034
16,-1.034
17,-1.034
18,-0.7659999999999999
19,1.2891
20,1.1104
21,1.1997
22,0.21686
23,-1.034
24,-1.034
25,-1.034
26,-1.034
27,-1.034
28,-0.14054
29,1.1997
30,1.1104
31,1.1104
32,1.1104
33,-0.85535
34,-1.034
35,-1.034
36,-1.034
37,0.66361
38,1.1104
39,1.1104
40,0.8423200000000001
41,-1.034
42,-1.034
43,-1.034
44,-1.034
45,0.12750999999999998
46,1.1997
47,1.1104
48,1.021
49,-0.58729
50,-1.034
51,-1.034
52,-1.034
53,0.66361
54,1.1997
55,1.1104
56,1.021
57,1.021
58,0.39555999999999997
59,-1.034
60,-1.034
61,-1.034
62,0.8423200000000001
63,1.1104
64,1.1104
65,0.39555999999999997
66,-1.034
67,-1.034
68,-1.034
69,0.39555999999999997
70,1.1997
71,1.1104
72,0.9316700000000001
73,-1.034
74,-1.034
75,-1.034
76,-1.034
77,-0.31924
78,1.1104
79,1.1104
80,1.1104
81,-0.85535
82,-1.034
83,-1.034
84,-1.034
85,0.48491000000000006
86,1.1997
87,1.021
88,1.1104
89,-1.034
90,-1.034
91,-0.40859
92,1.1997
93,1.021
94,1.1104
95,-0.85535
