time,value
0,1.0554
1,1.0554
2,1.0554
3,1.1045
4,1.0064
5,1.0554
6,1.0554
7,1.1045
8,1.0554
9,1.1045
10,1.0554
11,1.0554
12,-0.76002
13,-0.85815
14,-1.0544
15,-1.0053
16,-1.0544
17,-1.0544
18,-1.0544
19,-1.0544
20,-1.0544
21,-1.0544
22,-1.0544
23,-1.0544
24,-1.0544
25,-1.0544
26,-1.0544
27,-1.0544
28,-1.0544
29,-1.0544
30,-1.0544
31,-1.0544
32,-1.0544
33,-1.0053
34,-1.0544
35,-1.0544
36,-0.9562799999999999
37,-0.9562799999999999
38,-0.9562799999999999
39,-1.0544
40,-1.0544
41,-1.0544
42,-1.0544
43,-1.0544
44,-1.0544
45,-0.9562799999999999
46,-1.0053
47,-1.0544
48,-1.0053
49,-1.0053
50,0.27038
51,0.9082399999999999
52,0.9573
53,0.9082399999999999
54,0.9082399999999999
55,0.9573
56,1.1536
57,1.1045
58,1.0064
59,0.9573
60,0.9573
61,0.9082399999999999
62,0.9573
63,0.9573
64,-0.66188
65,-1.0053
66,-1.0544
67,-1.0053
68,-1.0544
69,-1.0053
70,-1.0053
71,-1.0053
72,0.31944
73,0.9573
74,1.0064
75,1.0064
76,0.9573
77,1.0064
78,0.9573
79,0.9573
80,0.9573
81,0.9573
82,0.9573
83,0.9573
84,1.0064
85,0.9573
86,0.9573
87,0.9082399999999999
88,-0.61282
89,1.0064
90,0.9573
91,0.9573
92,1.0064
93,0.9573
94,1.0064
95,0.9573
