time,value
0,-0.19393
1,-0.22589
2,-0.22298
3,-0.19393
4,-0.22008000000000003
5,-0.22879000000000002
6,-0.20264000000000001
7,-0.21427
8,-0.2346
9,-0.19974
10,-0.21136
11,-0.23751
12,-0.20264000000000001
13,-0.21136
14,-0.24622
15,-0.19974
16,-0.21716999999999997
17,-0.24040999999999998
18,-0.19974
19,-0.22008000000000003
20,-0.23751
21,-0.19974
22,-0.22879000000000002
23,-0.24040999999999998
24,-0.19102
25,-0.22879000000000002
26,-0.22879000000000002
27,-0.19102
28,-0.24040999999999998
29,-0.22298
30,-0.17359000000000002
31,-0.23751
32,-0.21427
33,-0.19393
34,-0.24040999999999998
35,-0.20264000000000001
36,-0.20845999999999998
37,-0.2346
38,-0.19683
39,-0.21427
40,-0.24040999999999998
41,-0.19683
42,-0.22008000000000003
43,-0.2346
44,-0.19974
45,-0.2317
46,-0.2317
47,-0.19683
48,-0.23751
49,-0.22589
50,-0.19683
51,-0.24331999999999998
52,-0.22008000000000003
53,-0.19974
54,-0.2346
55,-0.21136
56,-0.20845999999999998
57,-0.24040999999999998
58,-0.20555
59,-0.21427
60,-0.2346
61,-0.20845999999999998
62,-0.17359000000000002
63,-0.21427
64,-0.19683
65,-0.21716999999999997
66,-0.20555
67,-0.20555
68,-0.2317
69,-0.20555
70,-0.19393
71,-0.22879000000000002
72,-0.20264000000000001
73,-0.20555
74,2.2175
75,5.5034
76,5.085
77,5.3755
78,0.98272
79,-0.15616
80,-0.18812
81,-0.14454
82,-0.19102
83,-0.19102
84,-0.16777999999999998
85,-0.20845999999999998
86,-0.1794
87,-0.15907000000000002
88,-0.21716999999999997
89,-0.18520999999999999
90,-0.19393
91,-0.21716999999999997
92,-0.19393
93,-0.19683
94,-0.22298
95,-0.18812
