time,value
0,-0.89625
1,-0.89625
2,-0.89625
3,-0.89625
4,-0.89625
5,-0.89625
6,-0.89625
7,-0.89625
8,-0.89625
9,-0.89625
10,-0.89625
11,-0.89625
12,-0.89625
13,-0.89625
14,-0.89625
15,-0.89625
16,-0.89625
17,-0.89625
18,-0.89625
19,-0.89625
20,-0.89625
21,-0.89625
22,-0.89625
23,-0.89625
24,-0.89625
25,-0.89625
26,-0.89625
27,-0.89625
28,-0.89625
29,-0.89625
30,-0.89625
31,-0.89625
32,-0.89625
33,-0.89625
34,-0.89625
35,-0.89625
36,-0.89625
37,-0.89625
38,-0.89625
39,-0.89625
40,-0.89625
41,-0.89625
42,-0.89625
43,-0.89625
44,-0.89625
45,-0.89625
46,-0.89625
47,-0.89625
48,-0.89625
49,-0.89625
50,-0.43054
51,2.713
52,2.3637
53,1.7816
54,1.5487
55,1.5487
56,1.5487
57,1.5487
58,1.5487
59,1.3159
60,0.96659
61,0.96659
62,0.8501700000000001
63,0.73374
64,0.73374
65,0.8501700000000001
66,0.73374
67,0.73374
68,0.73374
69,0.73374
70,0.73374
71,0.73374
72,0.73374
73,0.73374
74,0.73374
75,0.8501700000000001
76,0.73374
77,0.73374
78,0.73374
79,0.73374
80,1.1995
81,1.1995
82,1.1995
83,0.96659
84,0.73374
85,0.73374
86,0.8501700000000001
87,0.8501700000000001
88,0.73374
89,0.8501700000000001
90,0.73374
91,0.8501700000000001
92,0.73374
93,0.73374
94,1.083
95,0.38445
