time,value
0,-0.20085
1,-0.20085
2,-0.20085
3,-0.20085
4,-0.20085
5,-0.20085
6,-0.20085
7,-0.20085
8,-0.20085
9,-0.20085
10,-0.20085
11,-0.20085
12,-0.20085
13,-0.20085
14,-0.20085
15,-0.20085
16,-0.20085
17,-0.20085
18,-0.20085
19,-0.20085
20,-0.20085
21,-0.20085
22,-0.20085
23,-0.20085
24,-0.20085
25,-0.20085
26,-0.20085
27,-0.20085
28,-0.20085
29,-0.20085
30,-0.20085
31,-0.20085
32,-0.20085
33,-0.20085
34,-0.20085
35,-0.20085
36,-0.20085
37,-0.20085
38,-0.20085
39,-0.20085
40,-0.20085
41,-0.20085
42,-0.20085
43,-0.20085
44,-0.20085
45,-0.20085
46,-0.20085
47,-0.20085
48,-0.20085
49,-0.20085
50,-0.20085
51,-0.20085
52,-0.20085
53,-0.20085
54,8.6001
55,-0.20085
56,-0.20085
57,-0.20085
58,-0.20085
59,-0.20085
60,-0.20085
61,-0.20085
62,-0.20085
63,-0.20085
64,-0.20085
65,-0.20085
66,-0.20085
67,-0.20085
68,-0.20085
69,-0.20085
70,-0.20085
71,1.7994
72,1.426
73,1.5859999999999999
74,1.186
75,0.43921000000000004
76,-0.20085
77,-0.20085
78,-0.20085
79,-0.20085
80,-0.20085
81,2.8395
82,-0.20085
83,-0.20085
84,-0.20085
85,-0.20085
86,-0.20085
87,-0.20085
88,-0.20085
89,-0.20085
90,-0.20085
91,-0.20085
92,-0.20085
93,-0.20085
94,-0.20085
95,-0.20085
