time,value
0,0.80882
1,0.76336
2,-0.7368399999999999
3,-1.3278
4,-1.146
5,0.44513
6,0.8542799999999999
7,0.7179
8,0.7179
9,0.6724399999999999
10,0.26329
11,-1.3278
12,-1.2824
13,-1.3733
14,-1.3278
15,-1.3278
16,-1.2369
17,-1.3733
18,-1.3278
19,-1.3278
20,-1.3278
21,-1.3733
22,-1.3278
23,-1.3278
24,-1.2824
25,-1.3278
26,-1.3733
27,-1.3278
28,-1.3278
29,-1.3733
30,-1.3278
31,-1.3278
32,-1.3278
33,-1.3733
34,-1.3278
35,-1.3733
36,-1.3278
37,-1.1914
38,-1.2824
39,-1.2369
40,-1.2824
41,-1.3278
42,-0.69138
43,0.76336
44,0.8542799999999999
45,0.7179
46,0.4906
47,0.53606
48,0.4906
49,0.53606
50,0.6724399999999999
51,0.6724399999999999
52,0.62698
53,0.58152
54,0.62698
55,0.53606
56,0.4906
57,0.53606
58,0.53606
59,0.53606
60,0.62698
61,0.4906
62,0.58152
63,0.62698
64,0.58152
65,0.53606
66,0.53606
67,0.4906
68,0.53606
69,0.4906
70,0.58152
71,0.53606
72,0.53606
73,0.58152
74,0.4906
75,0.53606
76,0.62698
77,0.62698
78,0.89974
79,1.127
80,1.127
81,1.127
82,1.0361
83,1.0361
84,1.0816
85,1.0361
86,1.0361
87,1.0361
88,1.0816
89,1.0361
90,1.0361
91,1.0816
92,1.1725
93,1.1725
94,1.1725
95,1.127
