time,value
0,-0.34976999999999997
1,-0.34976999999999997
2,0.9416899999999999
3,-0.34976999999999997
4,0.9416899999999999
5,-0.34976999999999997
6,-0.34976999999999997
7,0.9416899999999999
8,-0.34976999999999997
9,0.9416899999999999
10,-0.34976999999999997
11,0.9416899999999999
12,-0.34976999999999997
13,-0.34976999999999997
14,0.9416899999999999
15,-0.34976999999999997
16,0.9416899999999999
17,-0.34976999999999997
18,-0.34976999999999997
19,0.9416899999999999
20,-0.34976999999999997
21,0.9416899999999999
22,-0.34976999999999997
23,-0.34976999999999997
24,0.9416899999999999
25,-0.34976999999999997
26,-0.34976999999999997
27,-0.34976999999999997
28,-0.34976999999999997
29,0.9416899999999999
30,-0.34976999999999997
31,-0.34976999999999997
32,-0.34976999999999997
33,-0.34976999999999997
34,0.9416899999999999
35,-0.34976999999999997
36,-0.34976999999999997
37,-0.34976999999999997
38,0.9416899999999999
39,-0.34976999999999997
40,-0.34976999999999997
41,-0.34976999999999997
42,-0.34976999999999997
43,-0.34976999999999997
44,-0.34976999999999997
45,-0.34976999999999997
46,-0.34976999999999997
47,0.9416899999999999
48,6.1076
49,4.8161
50,0.9416899999999999
51,0.9416899999999999
52,-0.34976999999999997
53,0.9416899999999999
54,-0.34976999999999997
55,-0.34976999999999997
56,-0.34976999999999997
57,-0.34976999999999997
58,-0.34976999999999997
59,0.9416899999999999
60,-0.34976999999999997
61,-0.34976999999999997
62,-0.34976999999999997
63,-0.34976999999999997
64,-0.34976999999999997
65,-0.34976999999999997
66,-0.34976999999999997
67,-0.34976999999999997
68,-0.34976999999999997
69,-0.34976999999999997
70,-0.34976999999999997
71,-0.34976999999999997
72,-0.34976999999999997
73,-0.34976999999999997
74,-0.34976999999999997
75,-0.34976999999999997
76,-0.34976999999999997
77,0.9416899999999999
78,-0.34976999999999997
79,-0.34976999999999997
80,-0.34976999999999997
81,-0.34976999999999997
82,-0.34976999999999997
83,-0.34976999999999997
84,-0.34976999999999997
85,-0.34976999999999997
86,-1.6412
87,-0.34976999999999997
88,-0.34976999999999997
89,-1.6412
90,-0.34976999999999997
91,-1.6412
92,-0.34976999999999997
93,-0.34976999999999997
94,0.9416899999999999
95,-0.34976999999999997
