time,value
0,-0.25149
1,-0.25149
2,-0.25149
3,-0.25149
4,-0.25149
5,-0.25149
6,-0.25149
7,-0.25149
8,-0.25149
9,-0.25149
10,-0.25149
11,-0.25149
12,-0.25149
13,-0.25149
14,-0.25149
15,-0.25149
16,-0.25149
17,-0.25149
18,-0.25149
19,-0.25149
20,-0.25149
21,-0.25149
22,-0.25149
23,-0.25149
24,-0.25149
25,-0.25149
26,-0.25149
27,3.3475
28,-0.25149
29,-0.25149
30,-0.25149
31,-0.25149
32,-0.25149
33,-0.25149
34,2.4477
35,6.4066
36,-0.25149
37,-0.25149
38,-0.25149
39,-0.25149
40,-0.25149
41,-0.25149
42,-0.25149
43,-0.25149
44,-0.25149
45,-0.25149
46,-0.25149
47,-0.25149
48,2.5077
49,0.55828
50,-0.25149
51,-0.25149
52,-0.25149
53,-0.25149
54,-0.25149
55,-0.25149
56,-0.25149
57,-0.25149
58,-0.25149
59,-0.25149
60,-0.25149
61,-0.25149
62,-0.25149
63,-0.25149
64,-0.25149
65,-0.25149
66,-0.25149
67,-0.25149
68,-0.25149
69,-0.25149
70,-0.25149
71,3.8873
72,-0.10153
73,-0.25149
74,-0.25149
75,-0.25149
76,-0.25149
77,-0.25149
78,-0.25149
79,-0.25149
80,-0.25149
81,-0.25149
82,-0.25149
83,-0.25149
84,-0.25149
85,-0.25149
86,-0.25149
87,-0.25149
88,-0.25149
89,3.0775
90,-0.25149
91,-0.25149
92,-0.25149
93,-0.25149
94,-0.25149
95,-0.25149
