time,value
0,1.6447
1,1.0190000000000001
2,-0.64962
3,-0.64962
4,-0.64962
5,-0.64962
6,1.4361
7,1.2275
8,-0.64962
9,-0.64962
10,-0.64962
11,-0.64962
12,1.0190000000000001
13,1.6447
14,-0.64962
15,-0.64962
16,-0.64962
17,-0.64962
18,0.39325
19,2.2704
20,-0.64962
21,-0.64962
22,-0.64962
23,-0.64962
24,-0.64962
25,2.2704
26,0.18467999999999998
27,-0.64962
28,-0.64962
29,-0.64962
30,-0.64962
31,1.6447
32,0.8104
33,-0.64962
34,-0.64962
35,-0.64962
36,-0.64962
37,0.8104
38,1.8533
39,-0.64962
40,-0.64962
41,-0.64962
42,-0.64962
43,-0.023899
44,2.2704
45,-0.23246999999999998
46,-0.64962
47,-0.64962
48,-0.64962
49,-0.64962
50,1.8533
51,0.8104
52,-0.64962
53,-0.64962
54,-0.64962
55,-0.64962
56,1.0190000000000001
57,1.6447
58,-0.64962
59,-0.64962
60,-0.64962
61,-0.64962
62,0.39325
63,2.0618
64,-0.64962
65,-0.64962
66,-0.64962
67,-0.64962
68,-0.23246999999999998
69,2.2704
70,-0.023899
71,-0.64962
72,-0.64962
73,-0.64962
74,-0.64962
75,2.0618
76,0.60182
77,-0.64962
78,-0.64962
79,-0.64962
80,-0.64962
81,1.2275
82,1.4361
83,-0.64962
84,-0.64962
85,-0.64962
86,-0.64962
87,0.60182
88,1.8533
89,-0.64962
90,-0.64962
91,-0.64962
92,-0.64962
93,0.18467999999999998
94,2.2704
95,-0.64962
