time,value
0,0.7468199999999999
1,-0.9327
2,0.22196999999999997
3,-0.19791
4,-0.9327
5,-0.9327
6,0.32694
7,1.9015
8,1.0617
9,-0.9327
10,-0.9327
11,-0.092942
12,0.22196999999999997
13,-0.9327
14,-0.9327
15,0.64185
16,1.9015
17,-0.9327
18,-0.9327
19,-0.5128199999999999
20,0.64185
21,-0.9327
22,-0.9327
23,0.8517899999999999
24,1.9015
25,-0.61779
26,-0.9327
27,0.012028
28,0.11699999999999999
29,-0.9327
30,-0.9327
31,1.0617
32,1.9015
33,-0.61779
34,-0.9327
35,-0.7227600000000001
36,0.8517899999999999
37,-0.9327
38,-0.5128199999999999
39,1.9015
40,-0.19791
41,-0.7227600000000001
42,0.8517899999999999
43,-0.9327
44,-0.9327
45,-0.9327
46,1.0617
47,1.1667
48,0.32694
49,-0.9327
50,-0.30288000000000004
51,0.43191
52,-0.9327
53,1.1667
54,1.5866
55,-0.9327
56,0.012028
57,0.11699999999999999
58,-0.9327
59,-0.9327
60,1.9015
61,1.9015
62,-0.40785
63,-0.9327
64,-0.19791
65,0.43191
66,0.32694
67,2.0065
68,0.32694
69,-0.9327
70,-0.9327
71,0.7468199999999999
72,-0.61779
73,0.32694
74,2.0065
75,-0.092942
76,-0.9327
77,1.0617
78,-0.9327
79,-0.9327
80,-0.9327
81,1.5866
82,1.9015
83,-0.092942
84,-0.9327
85,-0.9327
86,1.0617
87,-0.9327
88,-0.9327
89,-0.30288000000000004
90,2.0065
91,0.012028
92,0.22196999999999997
93,-0.092942
94,-0.9327
95,-0.9327
