time,value
0,-0.20649
1,-0.20649
2,-0.20649
3,-0.20649
4,-0.20649
5,-0.20649
6,-0.20649
7,-0.20649
8,-0.20649
9,-0.20649
10,-0.20649
11,-0.20649
12,-0.20649
13,-0.20649
14,-0.20649
15,-0.20649
16,-0.20649
17,-0.20649
18,-0.20649
19,-0.20649
20,-0.20649
21,-0.20649
22,-0.20649
23,-0.20649
24,-0.20649
25,-0.20649
26,-0.20649
27,-0.20649
28,-0.20649
29,-0.20649
30,-0.20649
31,-0.20649
32,-0.20649
33,-0.20649
34,4.145
35,4.7897
36,5.4343
37,4.6285
38,-0.20649
39,-0.20649
40,-0.20649
41,-0.20649
42,-0.20649
43,-0.20649
44,-0.20649
45,-0.20649
46,-0.20649
47,-0.20649
48,-0.20649
49,-0.20649
50,-0.20649
51,-0.20649
52,-0.20649
53,-0.20649
54,-0.20649
55,-0.20649
56,-0.20649
57,-0.20649
58,-0.20649
59,-0.20649
60,-0.20649
61,-0.20649
62,-0.20649
63,-0.20649
64,-0.20649
65,-0.20649
66,-0.20649
67,-0.20649
68,-0.20649
69,-0.20649
70,-0.20649
71,-0.20649
72,-0.20649
73,-0.20649
74,-0.20649
75,-0.20649
76,-0.20649
77,-0.20649
78,-0.20649
79,-0.20649
80,-0.20649
81,-0.20649
82,-0.20649
83,-0.20649
84,-0.20649
85,-0.20649
86,-0.20649
87,-0.20649
88,-0.20649
89,-0.20649
90,-0.20649
91,-0.20649
92,-0.20649
93,-0.20649
94,-0.20649
95,-0.20649
