time,value
0,-0.31313
1,-0.31313
2,-0.31313
3,4.6229
4,0.8962
5,-0.31313
6,-0.31313
7,-0.31313
8,-0.31313
9,-0.31313
10,-0.31313
11,-0.31313
12,-0.31313
13,-0.31313
14,-0.31313
15,-0.31313
16,-0.31313
17,-0.31313
18,-0.31313
19,-0.31313
20,-0.31313
21,-0.31313
22,-0.31313
23,-0.31313
24,-0.31313
25,-0.31313
26,-0.31313
27,-0.31313
28,-0.31313
29,-0.31313
30,-0.31313
31,-0.31313
32,2.3523
33,0.82216
34,-0.31313
35,-0.31313
36,1.686
37,-0.31313
38,-0.31313
39,-0.31313
40,-0.31313
41,6.2024
42,-0.26377
43,-0.21441
44,-0.31313
45,-0.31313
46,-0.31313
47,-0.31313
48,-0.31313
49,-0.31313
50,-0.31313
51,-0.31313
52,-0.31313
53,-0.31313
54,-0.31313
55,-0.31313
56,0.97024
57,-0.31313
58,-0.31313
59,-0.31313
60,-0.31313
61,-0.31313
62,1.3158
63,2.0315
64,-0.31313
65,-0.31313
66,-0.31313
67,-0.31313
68,-0.31313
69,-0.31313
70,-0.31313
71,1.9081
72,-0.31313
73,-0.31313
74,-0.18972999999999998
75,-0.26377
76,2.5251
77,0.6494
78,-0.31313
79,-0.31313
80,-0.31313
81,-0.31313
82,-0.31313
83,-0.31313
84,-0.31313
85,-0.31313
86,-0.31313
87,-0.31313
88,-0.31313
89,-0.31313
90,-0.31313
91,-0.31313
92,-0.31313
93,-0.31313
94,-0.31313
95,-0.31313
