[<text>
<title>rose's stores inc &lt;rsto&gt; 4th qtr jan 28</title>
<dateline>    henderson, n.c., march 12 -
    </dateline>shr 37 cts vs 37 cts
    net 7.6 mln vs 7.5 mln
    revs 383.9 mln vs 326.3 mln
    year
    shr 1.17 dlrs vs 99 cts
    net 24.0 mln vs 20.3 mln
    revs 1.2 billion vs 1.0 billion
 reuter
</text>]