time,value
0,-0.48707
1,-0.31432
2,-0.12869
3,0.06646200000000001
4,0.26786
5,0.47234
6,0.67687
7,0.87803
8,1.0734
9,1.2604
10,1.4369
11,1.601
12,1.7514
13,1.8868
14,2.0071
15,2.1125
16,2.2034
17,2.2804
18,2.3437
19,2.3935
20,2.4296
21,2.452
22,2.4603
23,2.454
24,2.4331
25,2.3977
26,2.3488
27,2.2879
28,2.217
29,2.1384
30,2.0547
31,1.9681
32,1.8809
33,1.7948
34,1.7109
35,1.6299
36,1.5518
37,1.4758
38,1.4011
39,1.3268
40,1.2516
41,1.1747
42,1.0952
43,1.0123
44,0.92605
45,0.8366600000000001
46,0.7447199999999999
47,0.65117
48,0.55712
49,0.46363000000000004
50,0.3721
51,0.28371999999999997
52,0.1995
53,0.12018
54,0.0462
55,-0.022491
56,-0.085872
57,-0.1442
58,-0.19780999999999999
59,-0.24706999999999998
60,-0.29228000000000004
61,-0.33413000000000004
62,-0.37221
63,-0.40667
64,-0.43768999999999997
65,-0.46546000000000004
66,-0.49026000000000003
67,-0.5133300000000001
68,-0.5336
69,-0.5516399999999999
70,-0.56811
71,-0.58368
72,-0.59883
73,-0.61521
74,-0.63055
75,-0.64483
76,-0.6581199999999999
77,-0.67047
78,-0.68186
79,-0.69385
80,-0.7036600000000001
81,-0.71146
82,-0.71773
83,-0.7231
84,-0.72816
85,-0.73497
86,-0.74098
87,-0.74646
88,-0.75178
89,-0.75731
90,-0.7632899999999999
91,-0.7712
92,-0.7784800000000001
93,-0.78513
94,-0.79132
95,-0.7972899999999999
96,-0.8032
97,-0.81034
98,-0.8165
99,-0.8216200000000001
100,-0.8258
101,-0.82919
102,-0.83194
103,-0.83534
104,-0.8376299999999999
105,-0.8390000000000001
106,-0.8398
107,-0.84049
108,-0.84152
109,-0.84445
110,-0.8479200000000001
111,-0.8521
112,-0.85713
113,-0.86316
114,-0.87026
115,-0.87965
116,-0.88984
117,-0.90061
118,-0.9117299999999999
119,-0.92296
120,-0.9341200000000001
121,-0.94621
122,-0.9578
123,-0.96862
124,-0.97846
125,-0.98719
126,-0.9948
127,-1.0025
128,-1.0094
129,-1.0155
130,-1.0209
131,-1.0256
132,-1.0299
133,-1.035
134,-1.0399
135,-1.0446
136,-1.0490000000000002
137,-1.0532
138,-1.0571
139,-1.0618
140,-1.0665
141,-1.0711
142,-1.0757
143,-1.08
144,-1.0842
145,-1.0892
146,-1.094
147,-1.0982
148,-1.1017
149,-1.1041
150,-1.105
151,-1.1054
152,-1.104
153,-1.1003
154,-1.0937
155,-1.0837
156,-1.0698
157,-1.0532
158,-1.0322
159,-1.006
160,-0.9742799999999999
161,-0.9364899999999999
162,-0.89261
163,-0.84488
164,-0.79235
165,-0.73554
166,-0.67516
167,-0.61216
168,-0.54774
169,-0.48532
170,-0.42471000000000003
171,-0.36684
172,-0.31240999999999997
173,-0.26191
174,-0.21565
175,-0.17556
176,-0.14029
177,-0.10935999999999998
178,-0.082199
179,-0.058185
180,-0.036824
181,-0.019139
182,-0.0038735999999999996
183,0.0092811
184,0.020577
185,0.030193
186,0.038217
187,0.043658999999999996
188,0.047327
189,0.049448
190,0.050307
191,0.050204
192,0.049393
193,0.047369999999999995
194,0.044827
195,0.042019
196,0.039227
197,0.036772000000000006
198,0.035024
199,0.034049
200,0.03467
201,0.037589
202,0.043616
203,0.053634
204,0.068553
205,0.089139
206,0.11632
207,0.15083
208,0.19326
209,0.24401
210,0.30326
211,0.37089
212,0.4465
213,0.5293100000000001
214,0.61819
215,0.71163
216,0.80779
217,0.9045
218,0.99945
219,1.0902
220,1.1743
221,1.2496
222,1.3139
223,1.3657
224,1.4039
225,1.4277
226,1.4369999999999998
227,1.4318
228,1.4129
229,1.3808
230,1.3372
231,1.2835
232,1.2209999999999999
233,1.1513
234,1.0759999999999998
235,0.9961700000000001
236,0.9140299999999999
237,0.8309799999999999
238,0.74822
239,0.66677
240,0.58745
241,0.51037
242,0.4367
243,0.36643000000000003
244,0.29917
245,0.23423000000000002
246,0.17074
247,0.10719000000000001
248,0.043576
249,-0.020961
250,-0.087092
251,-0.15519000000000002
252,-0.22523
253,-0.2973
254,-0.36974
255,-0.44161999999999996
256,-0.5120100000000001
257,-0.58008
258,-0.6451399999999999
259,-0.7072
260,-0.76507
261,-0.81867
262,-0.8681
263,-0.9134899999999999
264,-0.95488
265,-0.99267
266,-1.0257
267,-1.0535
268,-1.0759999999999998
269,-1.0931
