time,value
0,0.55838
1,0.55838
2,-1.7722
3,0.55838
4,0.55838
5,0.55838
6,-1.7722
7,0.55838
8,0.55838
9,0.55838
10,0.55838
11,-1.7722
12,0.55838
13,0.55838
14,0.55838
15,-1.7722
16,0.55838
17,0.55838
18,0.55838
19,-1.7722
20,0.55838
21,0.55838
22,0.55838
23,-1.7722
24,0.55838
25,0.55838
26,0.55838
27,-1.7722
28,0.55838
29,0.55838
30,0.55838
31,-1.7722
32,0.55838
33,0.55838
34,0.55838
35,-1.7722
36,0.55838
37,0.55838
38,0.55838
39,-1.7722
40,0.55838
41,0.55838
42,0.55838
43,-1.7722
44,0.55838
45,0.55838
46,0.55838
47,-1.7722
48,0.55838
49,0.55838
50,0.55838
51,-1.7722
52,0.55838
53,0.55838
54,0.55838
55,0.55838
56,-1.7722
57,0.55838
58,0.55838
59,0.55838
60,-1.7722
61,0.55838
62,0.55838
63,0.55838
64,-1.7722
65,0.55838
66,0.55838
67,0.55838
68,-1.7722
69,0.55838
70,0.55838
71,0.55838
72,-1.7722
73,0.55838
74,0.55838
75,0.55838
76,-1.7722
77,0.55838
78,0.55838
79,0.55838
80,-1.7722
81,0.55838
82,0.55838
83,0.55838
84,-1.7722
85,0.55838
86,0.55838
87,0.55838
88,-1.7722
89,0.55838
90,0.55838
91,0.55838
92,-1.7722
93,0.55838
94,0.55838
95,0.55838
