time,value
0,-0.26919
1,-0.26919
2,-0.26919
3,-0.26919
4,-0.26919
5,-0.26919
6,-0.26919
7,-0.26919
8,-0.26919
9,-0.26919
10,-0.26919
11,-0.26919
12,-0.26919
13,-0.26919
14,-0.26919
15,-0.26919
16,-0.26919
17,-0.26919
18,-0.26919
19,-0.26919
20,-0.26919
21,-0.26919
22,-0.26919
23,-0.26919
24,-0.26919
25,-0.26919
26,-0.26919
27,-0.26919
28,-0.26919
29,-0.26919
30,-0.26919
31,-0.26919
32,-0.26919
33,-0.26919
34,-0.26919
35,-0.26919
36,-0.26919
37,-0.26919
38,-0.26919
39,-0.26919
40,-0.26919
41,-0.26919
42,-0.26919
43,-0.26919
44,-0.26919
45,-0.26919
46,-0.26919
47,-0.26919
48,-0.26919
49,-0.26919
50,-0.26919
51,-0.26919
52,-0.26919
53,-0.26919
54,-0.26919
55,-0.26919
56,-0.26919
57,-0.26919
58,-0.26919
59,-0.26919
60,-0.26919
61,-0.26919
62,-0.26919
63,-0.26919
64,-0.26919
65,1.1277
66,3.9215
67,3.2231
68,3.9215
69,3.9215
70,3.9215
71,3.9215
72,-0.26919
73,-0.26919
74,-0.26919
75,-0.26919
76,-0.26919
77,-0.26919
78,-0.26919
79,-0.26919
80,-0.26919
81,-0.26919
82,-0.26919
83,-0.26919
84,-0.26919
85,-0.26919
86,-0.26919
87,-0.26919
88,-0.26919
89,-0.26919
90,-0.26919
91,-0.26919
92,-0.26919
93,-0.26919
94,-0.26919
95,-0.26919
