time,value
0,1.4701
1,1.3519
2,1.2337
3,1.4701
4,1.3519
5,1.2337
6,1.3519
7,1.3519
8,1.3519
9,1.3519
10,1.2337
11,1.3519
12,1.3519
13,1.3519
14,1.3519
15,1.3519
16,1.3519
17,1.2337
18,1.3519
19,1.3519
20,1.3519
21,1.3519
22,1.2337
23,1.3519
24,1.3519
25,1.3519
26,1.3519
27,1.2337
28,1.3519
29,1.3519
30,1.4701
31,1.4701
32,-0.18469000000000002
33,-0.77569
34,-0.65749
35,-0.77569
36,-0.77569
37,-0.77569
38,-0.65749
39,-0.77569
40,-0.77569
41,-0.77569
42,-0.65749
43,-0.77569
44,-0.77569
45,-0.77569
46,-0.65749
47,-0.77569
48,-0.77569
49,-0.65749
50,-0.77569
51,-0.77569
52,-0.77569
53,-0.65749
54,-0.77569
55,-0.77569
56,-0.77569
57,-0.65749
58,-0.77569
59,-0.77569
60,-0.77569
61,-0.65749
62,-0.77569
63,-0.77569
64,-0.77569
65,-0.65749
66,-0.77569
67,-0.77569
68,-0.65749
69,-0.77569
70,-0.77569
71,-0.77569
72,-0.65749
73,-0.77569
74,-0.77569
75,-0.77569
76,-0.65749
77,-0.77569
78,0.9973200000000001
79,1.4701
80,-0.65749
81,-0.77569
82,-0.77569
83,-0.77569
84,-0.65749
85,-0.77569
86,-0.77569
87,-0.77569
88,-0.65749
89,-0.77569
90,-0.77569
91,-0.65749
92,-0.77569
93,-0.77569
94,-0.77569
95,-0.65749
