time,value
0,-0.30576
1,-0.30576
2,-0.30576
3,-0.30576
4,-0.30576
5,-0.30576
6,-0.30576
7,-0.30576
8,-0.30576
9,-0.30576
10,-0.30576
11,-0.30576
12,-0.30576
13,-0.30576
14,-0.30576
15,-0.30576
16,-0.30576
17,-0.30576
18,-0.30576
19,-0.30576
20,-0.30576
21,-0.30576
22,-0.30576
23,-0.30576
24,-0.30576
25,-0.30576
26,-0.30576
27,-0.30576
28,-0.30576
29,4.0768
30,-0.30576
31,-0.30576
32,-0.30576
33,4.0258
34,-0.30576
35,-0.30576
36,-0.30576
37,-0.30576
38,-0.30576
39,-0.30576
40,-0.30576
41,3.4653
42,-0.30576
43,-0.30576
44,-0.30576
45,-0.30576
46,2.0384
47,0.7644
48,-0.30576
49,-0.30576
50,-0.30576
51,-0.30576
52,-0.30576
53,-0.30576
54,-0.30576
55,-0.30576
56,-0.30576
57,-0.30576
58,-0.30576
59,-0.30576
60,-0.30576
61,-0.30576
62,-0.30576
63,-0.30576
64,4.2297
65,-0.30576
66,-0.30576
67,-0.30576
68,-0.30576
69,-0.30576
70,-0.30576
71,-0.30576
72,-0.30576
73,1.8855
74,-0.30576
75,-0.30576
76,-0.30576
77,3.1086
78,-0.30576
79,-0.30576
80,0.20384000000000002
81,2.497
82,-0.30576
83,-0.30576
84,-0.30576
85,-0.30576
86,-0.30576
87,-0.30576
88,-0.30576
89,-0.30576
90,-0.30576
91,-0.30576
92,-0.30576
93,-0.30576
94,-0.30576
95,-0.30576
