time,value
0,1.3133
1,-0.75352
2,-0.75352
3,1.3133
4,-0.75352
5,1.3133
6,-0.75352
7,1.3133
8,-0.75352
9,1.3133
10,-0.75352
11,1.3133
12,-0.75352
13,-0.75352
14,1.3133
15,-0.75352
16,-0.75352
17,-0.75352
18,1.3133
19,-0.75352
20,-0.75352
21,1.3133
22,-0.75352
23,-0.75352
24,-0.75352
25,1.3133
26,-0.75352
27,-0.75352
28,1.3133
29,-0.75352
30,-0.75352
31,1.3133
32,-0.75352
33,1.3133
34,-0.75352
35,-0.75352
36,1.3133
37,-0.75352
38,1.3133
39,-0.75352
40,-0.75352
41,-0.75352
42,1.3133
43,-0.75352
44,1.3133
45,-0.75352
46,1.3133
47,-0.75352
48,1.3133
49,-0.75352
50,-0.75352
51,-0.75352
52,1.3133
53,-0.75352
54,-0.75352
55,-0.75352
56,1.3133
57,-0.75352
58,-0.75352
59,-0.75352
60,1.3133
61,-0.75352
62,-0.75352
63,-0.75352
64,1.3133
65,-0.75352
66,-0.75352
67,-0.75352
68,1.3133
69,-0.75352
70,-0.75352
71,1.3133
72,-0.75352
73,1.3133
74,-0.75352
75,-0.75352
76,-0.75352
77,1.3133
78,-0.75352
79,1.3133
80,1.3133
81,-0.75352
82,1.3133
83,1.3133
84,-0.75352
85,1.3133
86,-0.75352
87,-0.75352
88,1.3133
89,-0.75352
90,-0.75352
91,1.3133
92,-0.75352
93,-0.75352
94,-0.75352
95,1.3133
