time,value
0,-0.011139
1,0.65718
2,-0.27847
3,-0.81312
4,0.79085
5,0.38985
6,-1.6151
7,0.79085
8,0.92451
9,-1.2141
10,-0.011139
11,0.79085
12,-0.41213
13,-0.6794600000000001
14,0.79085
15,0.38985
16,-1.6151
17,0.65718
18,0.79085
19,-1.4814
20,0.25619000000000003
21,0.79085
22,-0.5458
23,-0.81312
24,0.79085
25,-0.011139
26,-1.2141
27,0.92451
28,0.38985
29,-1.6151
30,1.1918
31,-1.4814
32,0.79085
33,0.25619000000000003
34,-0.9467899999999999
35,1.3255
36,-2.0161
37,0.92451
38,0.25619000000000003
39,-1.0805
40,0.92451
41,-0.6794600000000001
42,-0.1448
43,1.3255
44,-2.0161
45,1.1918
46,-0.9467899999999999
47,-0.1448
48,0.92451
49,-0.6794600000000001
50,-0.5458
51,0.79085
52,-0.81312
53,-0.1448
54,0.79085
55,-0.9467899999999999
56,-0.1448
57,0.79085
58,-0.81312
59,-0.27847
60,0.92451
61,-0.9467899999999999
62,-0.1448
63,0.79085
64,-0.81312
65,-0.41213
66,1.3255
67,-2.0161
68,1.3255
69,-1.2141
70,0.12253
71,0.92451
72,-1.2141
73,0.12253
74,1.1918
75,-2.0161
76,1.3255
77,-1.7488
78,0.79085
79,0.92451
80,-2.0161
81,0.79085
82,0.92451
83,-2.0161
84,1.3255
85,1.4592
86,1.1918
87,0.12253
88,0.25619000000000003
89,0.12253
90,-0.1448
91,0.65718
92,0.92451
93,0.79085
94,0.52352
95,0.38985
