time,value
0,-0.5704600000000001
1,-0.5704600000000001
2,-0.5704600000000001
3,-0.5704600000000001
4,-0.5704600000000001
5,-0.5704600000000001
6,-0.5704600000000001
7,-0.5704600000000001
8,-0.5704600000000001
9,-0.5704600000000001
10,-0.5704600000000001
11,-0.5704600000000001
12,-0.5704600000000001
13,-0.5704600000000001
14,-0.5704600000000001
15,-0.5704600000000001
16,-0.5704600000000001
17,-0.5704600000000001
18,-0.5704600000000001
19,-0.5704600000000001
20,-0.5704600000000001
21,-0.5704600000000001
22,-0.5704600000000001
23,-0.5704600000000001
24,-0.5704600000000001
25,-0.5704600000000001
26,-0.5704600000000001
27,-0.5704600000000001
28,-0.5704600000000001
29,-0.5704600000000001
30,-0.5704600000000001
31,-0.5704600000000001
32,-0.5704600000000001
33,-0.5704600000000001
34,-0.5704600000000001
35,-0.5704600000000001
36,-0.5704600000000001
37,-0.5704600000000001
38,-0.5704600000000001
39,-0.5704600000000001
40,-0.17859
41,-0.27656
42,-0.17859
43,-0.17859
44,-0.17859
45,-0.27656
46,-0.17859
47,-0.17859
48,-0.17859
49,-0.27656
50,-0.17859
51,-0.27656
52,-0.17859
53,-0.27656
54,-0.27656
55,-0.5704600000000001
56,-0.5704600000000001
57,-0.5704600000000001
58,-0.5704600000000001
59,-0.5704600000000001
60,-0.5704600000000001
61,-0.5704600000000001
62,-0.27656
63,2.2706
64,2.1727
65,2.2706
66,2.1727
67,0.9970399999999999
68,-0.17859
69,-0.27656
70,-0.17859
71,-0.17859
72,-0.27656
73,-0.17859
74,-0.27656
75,-0.17859
76,-0.27656
77,-0.17859
78,0.70313
79,2.2706
80,2.2706
81,2.1727
82,2.3686
83,2.4666
84,2.0747
85,2.1727
86,2.1727
87,2.1727
88,2.2706
89,2.2706
90,0.11532
91,-0.5704600000000001
92,-0.5704600000000001
93,-0.5704600000000001
94,-0.5704600000000001
95,-0.5704600000000001
