time,value
0,-2.2736
1,-2.2736
2,-2.276
3,-2.276
4,-2.276
5,-2.276
6,-2.276
7,-2.2785
8,-2.2809
9,-2.2834
10,-2.2882
11,-2.2905
12,-2.2875
13,-2.2851
14,-2.2825
15,-2.2794
16,-2.2787
17,-2.2826
18,-2.2842
19,-2.2857
20,-2.2881
21,-2.2877
22,-2.2862
23,-2.2854
24,-2.2854
25,-2.2836
26,-2.2821
27,-2.2806
28,-2.2783
29,-2.2765
30,-2.274
31,-2.272
32,-2.2722
33,-2.2692
34,-2.2669
35,-2.2636
36,-2.261
37,-2.2584
38,-2.2547
39,-2.2519
40,-2.249
41,-2.2427
42,-2.2396
43,-2.2354
44,-2.2321
45,-2.2287
46,-2.2263
47,-2.2227
48,-2.2157
49,-2.2119999999999997
50,-2.2104
51,-2.2052
52,-2.2013
53,-2.1973
54,-2.1919
55,-2.1857
56,-2.1801
57,-2.1758
58,-2.1715
59,-2.1656
60,-2.1612
61,-2.1552
62,-2.1506
63,-2.1506
64,-2.1459
65,-2.1413
66,-2.1397
67,-2.1381
68,-2.1333
69,-2.1269
70,-2.1221
71,-2.1171
72,-2.1105
73,-2.1055
74,-2.0988
75,-2.0936
76,-2.0885
77,-2.0816
78,-2.0763
79,-2.0709999999999997
80,-2.0709999999999997
81,-2.0693
82,-2.0622
83,-2.0604
84,-2.0569
85,-2.0498
86,-2.0428
87,-2.0355
88,-2.0317
89,-2.0278
90,-2.0276
91,-2.0257
92,-2.0183
93,-2.0164
94,-2.0145
95,-2.0108
96,-2.0051
97,-1.9994
98,-1.9918
99,-1.986
100,-1.9783
101,-1.9725
102,-1.9682
103,-1.9603
104,-1.9544
105,-1.9465
106,-1.9406
107,-1.9346
108,-1.9266
109,-1.9246
110,-1.9226
111,-1.9185
112,-1.9125
113,-1.9044
114,-1.9044
115,-1.9024
116,-1.899
117,-1.8928
118,-1.8846
119,-1.8784
120,-1.8722
121,-1.8639
122,-1.8619
123,-1.8598
124,-1.8535
125,-1.8473
126,-1.8389
127,-1.8326
128,-1.8263
129,-1.8241
130,-1.8208
131,-1.8132
132,-1.8068
133,-1.8005
134,-1.7919999999999998
135,-1.7856
136,-1.7771
137,-1.7694
138,-1.7630000000000001
139,-1.7544
140,-1.7480000000000002
141,-1.7415
142,-1.7329
143,-1.7264
144,-1.7177
145,-1.7112
146,-1.7046
147,-1.6959
148,-1.6894
149,-1.6817
150,-1.6761
151,-1.6705
152,-1.6618
153,-1.6553
154,-1.6465
155,-1.6399
156,-1.6334
157,-1.6235
158,-1.6169
159,-1.6103
160,-1.6015
161,-1.5982
162,-1.5916
163,-1.585
164,-1.5773
165,-1.5685
166,-1.5619
167,-1.5564
168,-1.5509
169,-1.5454
170,-1.5366
171,-1.5289
172,-1.5223
173,-1.5146
174,-1.5091
175,-1.5036
176,-1.4969999999999999
177,-1.4904
178,-1.4805
179,-1.4739
180,-1.4651
181,-1.4584
182,-1.4529
183,-1.4464
184,-1.442
185,-1.4332
186,-1.4266
187,-1.42
188,-1.41
189,-1.4034
190,-1.3968
191,-1.3902
192,-1.3848
193,-1.3782
194,-1.3716
195,-1.3649
196,-1.355
197,-1.3483
198,-1.3395
199,-1.3328
200,-1.3285
201,-1.3219999999999998
202,-1.3187
203,-1.3121
204,-1.3032
205,-1.2955
206,-1.2866
207,-1.2799
208,-1.2732
209,-1.2667
210,-1.2613
211,-1.2526
212,-1.2459
213,-1.2382
214,-1.2293
215,-1.2238
216,-1.2184
217,-1.2108
218,-1.2042
219,-1.1953
220,-1.1886
221,-1.1809
222,-1.1719
223,-1.1652
224,-1.1599
225,-1.1546
226,-1.1491
227,-1.1402
228,-1.1335
229,-1.1245
230,-1.1178
231,-1.1101
232,-1.1012
233,-1.0945
234,-1.0877
235,-1.0812
236,-1.0759
237,-1.0694
238,-1.0627
239,-1.055
240,-1.046
241,-1.0405
242,-1.0342
243,-1.0299
244,-1.0232
245,-1.0143
246,-1.0076
247,-1.0009
248,-0.9908799999999999
249,-0.98416
250,-0.9751799999999999
251,-0.96844
252,-0.9607
253,-0.95445
254,-0.94794
255,-0.9389799999999999
256,-0.93224
257,-0.9255
258,-0.91651
259,-0.90976
260,-0.90202
261,-0.8930100000000001
262,-0.88625
263,-0.87723
264,-0.87046
265,-0.8636799999999999
266,-0.85851
267,-0.85331
268,-0.84782
269,-0.84106
270,-0.83429
271,-0.82429
272,-0.81752
273,-0.80848
274,-0.8017
275,-0.79491
276,-0.78585
277,-0.77905
278,-0.77225
279,-0.76318
280,-0.75637
281,-0.74728
282,-0.74046
283,-0.73364
284,-0.72453
285,-0.7177
286,-0.7085899999999999
287,-0.70175
288,-0.6949
289,-0.6885100000000001
290,-0.6834600000000001
291,-0.68161
292,-0.6725
293,-0.66566
294,-0.65654
295,-0.6497
296,-0.64194
297,-0.63281
298,-0.6259600000000001
299,-0.6168100000000001
300,-0.60995
301,-0.60495
302,-0.59902
303,-0.59217
304,-0.58532
305,-0.57619
306,-0.56842
307,-0.55928
308,-0.55242
309,-0.54694
310,-0.54103
311,-0.53693
312,-0.52779
313,-0.52094
314,-0.51408
315,-0.50493
316,-0.49717
317,-0.48801000000000005
318,-0.48113999999999996
319,-0.47426999999999997
320,-0.46738999999999997
321,-0.4651
322,-0.46051000000000003
323,-0.45363000000000003
324,-0.45133
325,-0.44356999999999996
326,-0.4358
327,-0.42803
328,-0.41797
329,-0.4102
330,-0.40791
331,-0.40473000000000003
332,-0.40155
333,-0.39237
334,-0.38548000000000004
335,-0.37858
336,-0.36939
337,-0.36249000000000003
338,-0.35241999999999996
339,-0.34551
340,-0.3386
341,-0.32939
342,-0.32248000000000004
343,-0.31326
344,-0.30634
345,-0.29941
346,-0.29018
347,-0.28325
348,-0.27631999999999995
349,-0.26707
350,-0.26014
351,-0.25531
352,-0.25048000000000004
353,-0.24500999999999998
354,-0.23578000000000002
355,-0.22885
356,-0.2196
357,-0.21183000000000002
358,-0.20489000000000002
359,-0.19564
360,-0.1887
361,-0.17944000000000002
362,-0.17464000000000002
363,-0.16982
364,-0.16205
365,-0.15511
366,-0.14817
367,-0.13809000000000002
368,-0.13115
369,-0.12189000000000001
370,-0.11725999999999999
371,-0.11245
372,-0.1068
373,-0.10217999999999999
374,-0.092929
375,-0.085988
376,-0.079047
377,-0.068959
378,-0.062015
379,-0.055067
380,-0.047123000000000005
381,-0.042309
382,-0.033059
383,-0.025285
384,-0.018347
385,-0.009090299999999999
386,-0.0065943
387,0.0013797
388,0.008312700000000001
389,0.015247
390,0.024496
391,0.031437
392,0.041525
393,0.048466
394,0.055412
395,0.064676
396,0.072448
397,0.072448
398,0.074764
399,0.081717
400,0.090987
401,0.097942
402,0.1049
403,0.10722000000000001
404,0.10722000000000001
405,0.1165
406,0.12347000000000001
407,0.13043
408,0.13972
409,0.14669000000000001
410,0.15366
411,0.16296
412,0.16609000000000002
413,0.1693
414,0.17173
415,0.17418
416,0.17978
417,0.18227000000000002
418,0.1856
419,0.19022999999999998
420,0.198
421,0.20745
422,0.20998000000000003
423,0.21775
424,0.22783
425,0.23037
426,0.23608
427,0.243
428,0.24991999999999998
429,0.25915
430,0.26607
431,0.2753
432,0.28223000000000004
433,0.28916
434,0.29924
435,0.30618
436,0.31543000000000004
437,0.32236
438,0.3293
439,0.33855999999999997
440,0.34633
441,0.35114
442,0.35828000000000004
443,0.36521
444,0.37446
445,0.38223
446,0.38916999999999996
447,0.39843
448,0.40538
449,0.41018000000000004
450,0.41498999999999997
451,0.42277
452,0.43201999999999996
453,0.43978999999999996
454,0.44673
455,0.45136000000000004
456,0.45366999999999996
457,0.4583
458,0.46525
459,0.46525
460,0.47218999999999994
461,0.47913999999999995
462,0.48758999999999997
463,0.49455
464,0.5015
465,0.49906000000000006
466,0.49663999999999997
467,0.49422
468,0.49103
469,0.48866000000000004
470,0.48551000000000005
471,0.48317
472,0.48084
473,0.47386000000000006
474,0.46608
475,0.45911
476,0.45448
477,0.4467
478,0.43735
479,0.43033999999999994
480,0.42100000000000004
481,0.41322
482,0.40621
483,0.39687
484,0.38987
485,0.3821
486,0.37822
487,0.37358
488,0.36580999999999997
489,0.35803
490,0.35102
491,0.34168000000000004
492,0.33547
493,0.33008000000000004
494,0.32465
495,0.31763
496,0.30751999999999996
497,0.30051
498,0.29273000000000005
499,0.28811
500,0.2835
501,0.27338
502,0.26795
503,0.26335
504,0.25877
505,0.25174
506,0.24236999999999997
507,0.23535
508,0.22832
509,0.21896
510,0.21194000000000002
511,0.20492
512,0.19557
513,0.19399
514,0.19319
515,0.19085
516,0.18384
517,0.17451
518,0.1675
519,0.15817
520,0.1535
521,0.1535
522,0.14807
523,0.14577
524,0.14273
525,0.13571
526,0.12793
527,0.12332
528,0.12107000000000001
529,0.11649000000000001
530,0.11352999999999999
531,0.10972
532,0.10032999999999999
533,0.092555
534,0.08551900000000001
535,0.07774400000000001
536,0.073196
537,0.068659
538,0.061614999999999996
539,0.054571
540,0.045181
541,0.03814
542,0.030364999999999996
543,0.020983
544,0.013946
545,0.008659700000000001
546,0.0041256999999999995
547,-0.0029213
548,-0.012313
549,-0.019357
550,-0.028742
551,-0.036516
552,-0.043556
553,-0.052938
554,-0.059972000000000004
555,-0.067747
556,-0.06995900000000001
557,-0.074501
558,-0.083893
559,-0.091665
560,-0.098707
561,-0.10809
562,-0.11264
563,-0.12025
564,-0.12729000000000001
565,-0.13434000000000001
566,-0.14373
567,-0.15150999999999998
568,-0.1609
569,-0.16794
570,-0.17336
571,-0.17628
572,-0.18008
573,-0.18713
574,-0.19652999999999998
575,-0.2043
576,-0.21369000000000002
577,-0.2175
578,-0.22200999999999999
579,-0.22815
580,-0.23521
581,-0.24533000000000002
582,-0.25239
583,-0.25943
584,-0.26231
585,-0.2668
586,-0.27386
587,-0.28469
588,-0.28681
589,-0.29362
590,-0.30139
591,-0.30916
592,-0.3136
593,-0.31566
594,-0.32106
595,-0.32175
596,-0.32378
597,-0.32882
598,-0.33316999999999997
599,-0.34053
600,-0.3442
601,-0.34485
602,-0.34549
603,-0.34503
604,-0.34329
605,-0.34154
606,-0.34104
607,-0.33874
608,-0.33758
609,-0.33818000000000004
610,-0.33998
611,-0.33937
612,-0.33338
613,-0.32621999999999995
614,-0.32556
615,-0.32544
616,-0.31826
617,-0.31108
618,-0.3015
619,-0.29486999999999997
620,-0.28529
621,-0.27810999999999997
622,-0.27092
623,-0.26852
624,-0.26852
625,-0.25893
626,-0.25174
627,-0.24694000000000002
628,-0.24455
629,-0.24029
630,-0.23363
631,-0.22403
632,-0.21684
633,-0.20723000000000003
634,-0.20002999999999999
635,-0.19523
636,-0.1944
637,-0.19304000000000002
638,-0.18342
639,-0.17620999999999998
640,-0.16899
641,-0.15988
642,-0.15267
643,-0.14304
644,-0.13582
645,-0.1286
646,-0.11897
647,-0.11175
648,-0.10453
649,-0.09489600000000001
650,-0.08766900000000001
651,-0.078034
652,-0.070316
653,-0.06309
654,-0.053940999999999996
655,-0.046225999999999996
656,-0.036585
657,-0.029356999999999998
658,-0.022126
659,-0.012483
660,-0.0052493
661,0.0019837
662,0.01163
663,0.018862999999999998
664,0.028511
665,0.03575
666,0.039595
667,0.043942
668,0.051173
669,0.060814
670,0.06804500000000001
671,0.075276
672,0.08540299999999999
673,0.09263400000000001
674,0.099868
675,0.10951
676,0.11675
677,0.1206
678,0.12447000000000001
679,0.12978
680,0.13942000000000002
681,0.14665
682,0.15678
683,0.16399999999999998
684,0.17124
685,0.18136
686,0.18524000000000002
687,0.18913
688,0.19635
689,0.20357999999999998
690,0.21370999999999998
691,0.22143000000000002
692,0.22533000000000003
693,0.23165999999999998
694,0.23886999999999997
695,0.2485
696,0.25622
697,0.26344
698,0.27307
699,0.28029
700,0.28611
701,0.29003
702,0.29346
703,0.30308
704,0.31029
705,0.31801999999999997
706,0.32764
707,0.33486
708,0.34448
709,0.34841
710,0.35235
711,0.36248
712,0.3697
713,0.37983
714,0.38704
715,0.38945
716,0.39185
717,0.39716999999999997
718,0.4049
719,0.40781999999999996
720,0.41313999999999995
721,0.42328000000000005
722,0.431
723,0.43393000000000004
724,0.43873
725,0.44593999999999995
726,0.45556
727,0.46276999999999996
728,0.46998
729,0.4796
730,0.48733000000000004
731,0.49695
732,0.50416
733,0.5113800000000001
734,0.521
735,0.52822
736,0.53215
737,0.5342100000000001
738,0.54142
739,0.55104
740,0.55825
741,0.5654600000000001
742,0.57508
743,0.58281
744,0.59243
745,0.59964
746,0.6068600000000001
747,0.61648
748,0.6237
749,0.63092
750,0.64054
751,0.64776
752,0.6573899999999999
753,0.66461
754,0.67183
755,0.6814600000000001
756,0.6886899999999999
757,0.6983199999999999
758,0.70554
759,0.71277
760,0.7224
761,0.72963
762,0.73927
763,0.7465
764,0.75373
765,0.76337
766,0.76483
767,0.76872
768,0.77644
769,0.78367
770,0.7933
771,0.80053
772,0.80775
773,0.81739
774,0.82511
775,0.8347399999999999
776,0.8419700000000001
777,0.8492
778,0.8588399999999999
779,0.86174
780,0.8656200000000001
781,0.8743299999999999
782,0.88155
783,0.8911899999999999
784,0.89841
785,0.90564
786,0.91528
787,0.9225
788,0.93214
789,0.93937
790,0.9466
791,0.95624
792,0.96347
793,0.9707
794,0.98034
795,0.9875799999999999
796,0.9972200000000001
797,0.9972200000000001
798,0.9996299999999999
799,1.0093
800,1.0165
801,1.0213
802,1.0242
803,1.0247
804,1.0266
805,1.03
806,1.0397
807,1.0469
808,1.0541
809,1.0643
810,1.0715
811,1.0787
812,1.0845
813,1.0884
814,1.0942
815,1.1014
816,1.1086
817,1.1183
818,1.1255
819,1.1351
820,1.1429
821,1.1501
822,1.1597
823,1.167
824,1.1742
825,1.1838
826,1.1911
827,1.2007
828,1.2079
829,1.2152
830,1.2229
831,1.2267
832,1.2306
833,1.2378
834,1.2451
835,1.2547
836,1.2619
837,1.2692
838,1.2788
839,1.2865
840,1.2962
841,1.3034
842,1.3102
843,1.3198
844,1.327
845,1.3367
846,1.3439
847,1.3512
848,1.3546
849,1.3532
850,1.3537
851,1.3524
852,1.3515
853,1.351
854,1.3501
855,1.3488
856,1.3483
857,1.3479
858,1.3461
859,1.3448
860,1.3411
861,1.3394
862,1.3322
863,1.3216
864,1.3179
865,1.3167
866,1.307
867,1.2997
868,1.2925
869,1.2828
870,1.2755
871,1.2658
872,1.2585
873,1.2513
874,1.2416
875,1.2343
876,1.2246
877,1.2174
878,1.2101
879,1.2
880,1.1927
881,1.1854
882,1.1758
883,1.1685
884,1.1588
885,1.1515
886,1.1439
887,1.1397
888,1.1365
889,1.1268
890,1.1191
891,1.1118
892,1.1017
893,1.1009
894,1.0968
895,1.0895
896,1.0823
897,1.0726
898,1.0653
899,1.058
900,1.0483
901,1.0406
902,1.0309
903,1.0237
904,1.0164
905,1.0067
906,0.99945
907,0.9897600000000001
908,0.98208
909,0.98082
910,0.9747299999999999
911,0.96746
912,0.96019
913,0.9500799999999999
914,0.94281
915,0.93673
916,0.9355100000000001
917,0.9278299999999999
918,0.9181299999999999
919,0.91085
920,0.90075
921,0.8934700000000001
922,0.8862
923,0.8785200000000001
924,0.87731
925,0.87126
926,0.86398
927,0.8567
928,0.847
929,0.83972
930,0.83244
931,0.8227399999999999
932,0.8154600000000001
933,0.80576
934,0.79848
935,0.7912100000000001
936,0.7811
937,0.77383
938,0.76413
939,0.75685
940,0.74958
941,0.74231
942,0.73866
943,0.7350300000000001
944,0.72735
945,0.72007
946,0.71037
947,0.7026899999999999
948,0.6954100000000001
949,0.68571
950,0.67843
951,0.6744100000000001
952,0.67323
953,0.66595
954,0.65584
955,0.65225
956,0.6511
957,0.6434300000000001
958,0.6361399999999999
959,0.6260399999999999
960,0.6187600000000001
961,0.61314
962,0.60921
963,0.6039800000000001
964,0.59425
965,0.58696
966,0.57967
967,0.56958
968,0.56229
969,0.55257
970,0.55145
971,0.54792
972,0.5402600000000001
973,0.5329699999999999
974,0.52567
975,0.51558
976,0.5082899999999999
977,0.49856000000000006
978,0.4909
979,0.48981
980,0.48631
981,0.47901000000000005
982,0.46928000000000003
983,0.46162
984,0.45432
985,0.44875
986,0.44526000000000004
987,0.44214
988,0.4324
989,0.4251
990,0.41501000000000005
991,0.40771
992,0.40668000000000004
993,0.40289
994,0.39559
995,0.38584
996,0.37854
997,0.37123
998,0.36149000000000003
999,0.35418
1000,0.34654
1001,0.3368
1002,0.32949
1003,0.31975
1004,0.31245
1005,0.30514
1006,0.2954
1007,0.2881
1008,0.27836
1009,0.27105999999999997
1010,0.26794
1011,0.26415
1012,0.25894
1013,0.2492
1014,0.24189000000000002
1015,0.23458
1016,0.22484
1017,0.21753000000000003
1018,0.20989000000000002
1019,0.20015
1020,0.19284
1021,0.1831
1022,0.1758
1023,0.16849
1024,0.1647
1025,0.1647
1026,0.15496
1027,0.14765999999999999
1028,0.14035
1029,0.13027
1030,0.12262999999999999
1031,0.11499000000000001
1032,0.11255
1033,0.10768
1034,0.09793500000000001
1035,0.09063
1036,0.08819400000000001
1037,0.08332300000000001
1038,0.076016
1039,0.066274
1040,0.05897
1041,0.051664999999999996
1042,0.041926
1043,0.034279000000000004
1044,0.026975
1045,0.017236
1046,0.009932700000000001
1047,0.00019367
1048,-0.007452299999999999
1049,-0.01023
1050,-0.014019
1051,-0.021658
1052,-0.031405
1053,-0.039044
1054,-0.046354
1055,-0.051888
1056,-0.055305999999999994
1057,-0.060823
1058,-0.068457
1059,-0.07396699999999999
1060,-0.07764800000000001
1061,-0.085272
1062,-0.092589
1063,-0.10265999999999999
1064,-0.10997
1065,-0.11546
1066,-0.1188
1067,-0.12182
1068,-0.13188
1069,-0.13734000000000002
1070,-0.13846
1071,-0.14173
1072,-0.14253
1073,-0.1482
1074,-0.14845999999999998
1075,-0.14895999999999998
1076,-0.14995
1077,-0.15066
1078,-0.15158
1079,-0.15225
1080,-0.15247
1081,-0.15023
1082,-0.14842
1083,-0.14678
1084,-0.13943
1085,-0.13227
1086,-0.13039
1087,-0.12849000000000002
1088,-0.12132000000000001
1089,-0.11395999999999999
1090,-0.1066
1091,-0.096968
1092,-0.08960900000000001
1093,-0.08225299999999999
1094,-0.072443
1095,-0.070498
1096,-0.071145
1097,-0.063783
1098,-0.056422
1099,-0.046607
1100,-0.039245
1101,-0.029582999999999998
1102,-0.022221
1103,-0.01486
1104,-0.0050433
1105,0.0023187
1106,0.0046226999999999996
1107,0.006500700000000001
1108,0.008678700000000001
1109,0.018366999999999998
1110,0.023016
1111,0.025096
1112,0.032224
1113,0.03959
1114,0.049415
1115,0.056667999999999996
1116,0.06403400000000001
1117,0.07385900000000001
1118,0.081228
1119,0.083355
1120,0.08795499999999999
1121,0.095228
1122,0.10505
1123,0.11242
1124,0.11979000000000001
1125,0.12962
1126,0.13699
1127,0.14682
1128,0.15419000000000002
1129,0.16155999999999998
1130,0.17139000000000001
1131,0.17876
1132,0.18849000000000002
1133,0.19585999999999998
1134,0.20323
1135,0.21306
1136,0.22043000000000001
1137,0.2278
1138,0.23754
1139,0.23990999999999998
1140,0.24481999999999998
1141,0.25219
1142,0.25956999999999997
1143,0.26939
1144,0.27676
1145,0.28168000000000004
1146,0.28414
1147,0.28676999999999997
1148,0.2966
1149,0.30396999999999996
1150,0.31134
1151,0.32116999999999996
1152,0.32863000000000003
1153,0.33846
1154,0.34583
1155,0.3532
1156,0.36057
1157,0.36303
1158,0.37049
1159,0.3755
1160,0.37805
1161,0.38550999999999996
1162,0.39298
1163,0.40045
1164,0.40301
1165,0.40792
1166,0.41775
1167,0.42512
1168,0.43249
1169,0.44231000000000004
1170,0.44968
1171,0.45951000000000003
1172,0.46698
1173,0.47435
1174,0.48418
1175,0.49155
1176,0.49892
1177,0.50137
1178,0.50383
1179,0.51366
1180,0.5161100000000001
1181,0.51867
1182,0.5286
1183,0.5360699999999999
1184,0.54601
1185,0.55348
1186,0.5584
1187,0.56074
1188,0.56566
1189,0.57548
1190,0.58285
1191,0.59022
1192,0.60005
1193,0.60742
1194,0.61233
1195,0.61448
1196,0.6193
1197,0.62912
1198,0.6364
1199,0.64377
1200,0.6511399999999999
1201,0.6536
1202,0.65851
1203,0.66588
1204,0.67325
1205,0.67816
1206,0.67816
1207,0.6855399999999999
1208,0.6953600000000001
1209,0.70273
1210,0.7125600000000001
1211,0.7199300000000001
1212,0.7273
1213,0.7371300000000001
1214,0.7445
1215,0.7543300000000001
1216,0.7617
1217,0.76907
1218,0.77118
1219,0.77093
1220,0.78076
1221,0.78813
1222,0.79551
1223,0.80533
1224,0.81271
1225,0.8200799999999999
1226,0.82991
1227,0.8372799999999999
1228,0.84711
1229,0.8544799999999999
1230,0.8618600000000001
1231,0.87169
1232,0.8790600000000001
1233,0.88889
1234,0.8962600000000001
1235,0.9036299999999999
1236,0.91346
1237,0.92084
1238,0.9282100000000001
1239,0.93804
1240,0.9454100000000001
1241,0.95524
1242,0.9626100000000001
1243,0.96999
1244,0.97982
1245,0.98719
1246,0.99702
1247,1.0044
1248,1.0118
1249,1.0216
1250,1.0290000000000001
1251,1.0317
1252,1.0317
1253,1.0390000000000001
1254,1.0489
1255,1.0562
1256,1.0637
1257,1.0638
1258,1.0663
1259,1.0688
1260,1.0762
1261,1.0836
1262,1.0885
1263,1.091
1264,1.0959
1265,1.1032
1266,1.1106
1267,1.1204
1268,1.1278
1269,1.1352
1270,1.1451
1271,1.1525
1272,1.1623
1273,1.1697
1274,1.177
1275,1.1869
1276,1.1942
1277,1.2041
1278,1.2114
1279,1.2188
1280,1.2263
1281,1.2287
1282,1.2336
1283,1.2436
1284,1.251
1285,1.2609
1286,1.2635
1287,1.266
1288,1.2759
1289,1.2833
1290,1.288
1291,1.288
1292,1.2952
1293,1.305
1294,1.3123
1295,1.3197
1296,1.3221
1297,1.3219999999999998
1298,1.3319
1299,1.3392
1300,1.3466
1301,1.3564
1302,1.3638
1303,1.3736
1304,1.381
1305,1.3884
1306,1.3982
1307,1.4056
1308,1.4154
1309,1.4228
1310,1.4302
1311,1.44
1312,1.4426
1313,1.4453
1314,1.4529
1315,1.4602
1316,1.4701
1317,1.4774
1318,1.4848
1319,1.4946
1320,1.5019999999999998
1321,1.5118
1322,1.5192
1323,1.5266
1324,1.5364
1325,1.5361
1326,1.5384
1327,1.5457
1328,1.5530000000000002
1329,1.5576
1330,1.5574
1331,1.5623
1332,1.5721
1333,1.5743
1334,1.5741
1335,1.574
1336,1.5763
1337,1.5761
1338,1.5759999999999998
1339,1.5759
1340,1.5758
1341,1.5758
1342,1.5757
1343,1.5757
1344,1.5757
1345,1.5756
1346,1.5756
1347,1.5731
1348,1.5731
1349,1.5731
1350,1.5632
1351,1.5558
1352,1.546
1353,1.5386
1354,1.5362
1355,1.5338
1356,1.5288
1357,1.5215
1358,1.5116
1359,1.5042
1360,1.4944
1361,1.4869999999999999
1362,1.4797
1363,1.4698
1364,1.4625
1365,1.4576
1366,1.4527
1367,1.4454
1368,1.4355
1369,1.4282
1370,1.4208
1371,1.411
1372,1.4036
1373,1.3938
1374,1.3864
1375,1.379
1376,1.3791
1377,1.3767
1378,1.3718
1379,1.3645
1380,1.3571
1381,1.3473
1382,1.34
1383,1.3376
1384,1.3377
1385,1.3303
1386,1.3205
1387,1.3131
1388,1.3058
1389,1.2959
1390,1.2886
1391,1.2787
1392,1.2713
1393,1.264
1394,1.2541
1395,1.2468
1396,1.2369
1397,1.2296
1398,1.2222
1399,1.2124
1400,1.205
1401,1.1976
1402,1.1878
1403,1.1804
1404,1.1706
1405,1.1632
1406,1.1559
1407,1.146
1408,1.1387
1409,1.1288
1410,1.1214
1411,1.1141
1412,1.1042
1413,1.0969
1414,1.0895
1415,1.0797
1416,1.0723
1417,1.0649
1418,1.0624
1419,1.0575
1420,1.0502
1421,1.0477
1422,1.0428
1423,1.0354
1424,1.028
1425,1.0183
1426,1.0109
1427,1.001
1428,0.9936200000000001
1429,0.98624
1430,0.9837899999999999
1431,0.97887
1432,0.97155
1433,0.9716600000000001
1434,0.9668
1435,0.9570200000000001
1436,0.94971
1437,0.94731
1438,0.94731
1439,0.94486
1440,0.94486
1441,0.93748
1442,0.9325700000000001
1443,0.93017
1444,0.9252600000000001
1445,0.9178799999999999
1446,0.90805
1447,0.9006799999999999
1448,0.89085
1449,0.8834700000000001
1450,0.8761
1451,0.8662700000000001
1452,0.8589
1453,0.8490700000000001
1454,0.8416899999999999
1455,0.8343200000000001
1456,0.82449
1457,0.81711
1458,0.80728
1459,0.79991
1460,0.7925300000000001
1461,0.78271
1462,0.77533
1463,0.77049
1464,0.76832
1465,0.76602
1466,0.7561899999999999
1467,0.7488100000000001
1468,0.74152
1469,0.73169
1470,0.72432
1471,0.71449
1472,0.71203
1473,0.70958
1474,0.7046600000000001
1475,0.69729
1476,0.6948300000000001
1477,0.6924600000000001
1478,0.68518
1479,0.67543
1480,0.66815
1481,0.66087
1482,0.6535
1483,0.6535
1484,0.64878
1485,0.64141
1486,0.6340399999999999
1487,0.62421
1488,0.6168399999999999
1489,0.60947
1490,0.59964
1491,0.59227
1492,0.58244
1493,0.57508
1494,0.5677
1495,0.55788
1496,0.55051
1497,0.54068
1498,0.5333100000000001
1499,0.52604
1500,0.5162100000000001
1501,0.50885
1502,0.49901999999999996
1503,0.49165
1504,0.48428000000000004
1505,0.47435
1506,0.46698
1507,0.45961
1508,0.44978999999999997
1509,0.44242
1510,0.43956000000000006
1511,0.43928999999999996
1512,0.43191999999999997
1513,0.42208999999999997
1514,0.41472
1515,0.40489
1516,0.39752
1517,0.39006
1518,0.38023
1519,0.37285999999999997
1520,0.36549
1521,0.35566
1522,0.34829
1523,0.33846
1524,0.33109
1525,0.32372
1526,0.32091
1527,0.31821
1528,0.30838000000000004
1529,0.30101
1530,0.29364
1531,0.28381
1532,0.27644
1533,0.26905999999999997
1534,0.25916
1535,0.25178
1536,0.24195
1537,0.23458
1538,0.22721
1539,0.21738000000000002
1540,0.21001
1541,0.20018
1542,0.1928
1543,0.18542999999999998
1544,0.1756
1545,0.16823
1546,0.1584
1547,0.15111
1548,0.14374
1549,0.13391
1550,0.12654
1551,0.11915999999999999
1552,0.10933
1553,0.10196000000000001
1554,0.099855
1555,0.10013999999999999
1556,0.092769
1557,0.08304299999999999
1558,0.083355
1559,0.081341
1560,0.073975
1561,0.066606
1562,0.056899
1563,0.049533
1564,0.044862
1565,0.042917000000000004
1566,0.043322
1567,0.04389
1568,0.041734
1569,0.034373
1570,0.027319
1571,0.025342
1572,0.023387
1573,0.016198
1574,0.0090137
1575,0.0072757
1576,0.0076437
1577,0.0078337
1578,0.0082167
1579,0.0088067
1580,0.0096237
1581,0.0096237
1582,0.009832700000000002
1583,0.010473999999999999
1584,0.011136
1585,0.014494
1586,0.0152
1587,0.018126
1588,0.028156999999999998
1589,0.033293
1590,0.036738
1591,0.042137
1592,0.049474000000000004
1593,0.059512999999999996
1594,0.066847
1595,0.074184
1596,0.075226
1597,0.078472
1598,0.08824800000000001
1599,0.09585
1600,0.10318
1601,0.11295
1602,0.11594000000000002
1603,0.11949000000000001
1604,0.12495
1605,0.13227
1606,0.13773
1607,0.14104
1608,0.14407
1609,0.15384
1610,0.16116
1611,0.17092000000000002
1612,0.17854
1613,0.18586
1614,0.19563
1615,0.20295
1616,0.21272
1617,0.21789
1618,0.22121999999999997
1619,0.22426999999999997
1620,0.23159000000000002
1621,0.23890999999999998
1622,0.24866999999999997
1623,0.25599
1624,0.26605
1625,0.27337
1626,0.28069
1627,0.28557
1628,0.28801
1629,0.29748
1630,0.29962
1631,0.30177
1632,0.31125
1633,0.31856999999999996
1634,0.32101
1635,0.32345
1636,0.33107
1637,0.34083
1638,0.34815999999999997
1639,0.3552
1640,0.35736
1641,0.3598
1642,0.36956999999999995
1643,0.37718
1644,0.3799
1645,0.38263
1646,0.39025
1647,0.39542
1648,0.39786
1649,0.4003
1650,0.41007
1651,0.41739
1652,0.42472
1653,0.43449
1654,0.44181000000000004
1655,0.45187
1656,0.45919
1657,0.46652
1658,0.47629
1659,0.48361000000000004
1660,0.49338000000000004
1661,0.49423999999999996
1662,0.49755
1663,0.50761
1664,0.51493
1665,0.5247
1666,0.5320199999999999
1667,0.53935
1668,0.5494
1669,0.5567300000000001
1670,0.56405
1671,0.57382
1672,0.57714
1673,0.58077
1674,0.58809
1675,0.59541
1676,0.60517
1677,0.61249
1678,0.62226
1679,0.62958
1680,0.6369
1681,0.6469600000000001
1682,0.65428
1683,0.6616
1684,0.67137
1685,0.67869
1686,0.68845
1687,0.6957800000000001
1688,0.7031
1689,0.71286
1690,0.71375
1691,0.71739
1692,0.7247100000000001
1693,0.7320300000000001
1694,0.74179
1695,0.74941
1696,0.75673
1697,0.76649
1698,0.77381
1699,0.7762600000000001
1700,0.7814399999999999
1701,0.78906
1702,0.79699
1703,0.79973
1704,0.80492
1705,0.81224
1706,0.8146800000000001
1707,0.81712
1708,0.8241299999999999
1709,0.8335899999999999
1710,0.8409
1711,0.8485299999999999
1712,0.85859
1713,0.8613299999999999
1714,0.8637799999999999
1715,0.8735299999999999
1716,0.87597
1717,0.87597
1718,0.8832899999999999
1719,0.89061
1720,0.9003700000000001
1721,0.90769
1722,0.91776
1723,0.9250799999999999
1724,0.9324
1725,0.94216
1726,0.9494799999999999
1727,0.95252
1728,0.9561799999999999
1729,0.9613700000000001
1730,0.9711299999999999
1731,0.97844
1732,0.9857600000000001
1733,0.9955200000000001
1734,1.0028
1735,1.0129
1736,1.0202
1737,1.0275
1738,1.0373
1739,1.0446
1740,1.0519
1741,1.0544
1742,1.0593
1743,1.069
1744,1.0763
1745,1.0788
1746,1.0812
1747,1.0885
1748,1.0983
1749,1.1056
1750,1.1129
1751,1.1227
1752,1.13
1753,1.1398
1754,1.1471
1755,1.1495
1756,1.1520000000000001
1757,1.1523
1758,1.1599
1759,1.17
1760,1.1751
1761,1.1776
1762,1.1849
1763,1.1898
1764,1.1925
1765,1.1998
1766,1.2096
1767,1.2145
1768,1.2169
1769,1.2246
1770,1.2297
1771,1.2322
1772,1.2374
1773,1.2447
1774,1.2499
1775,1.2532
1776,1.2566
1777,1.2663
1778,1.2737
1779,1.2834
1780,1.2907
1781,1.298
1782,1.3078
1783,1.3154
1784,1.3227
1785,1.3325
1786,1.3398
1787,1.3496
1788,1.3569
1789,1.3642
1790,1.3694
1791,1.3728
1792,1.3786
1793,1.3859
1794,1.3935
1795,1.4033
1796,1.4109
1797,1.4122
1798,1.4156
1799,1.4166
1800,1.4203
1801,1.4252
1802,1.4328
1803,1.4363
1804,1.4373
1805,1.4387
1806,1.4397
1807,1.4408
1808,1.4422
1809,1.4433
1810,1.4448
1811,1.4459
1812,1.4469999999999998
1813,1.4486
1814,1.4413
1815,1.4344
1816,1.4331
1817,1.4319
1818,1.425
1819,1.4181
1820,1.4165
1821,1.4157
1822,1.4113
1823,1.4016
1824,1.3947
1825,1.3875
1826,1.383
1827,1.3819
1828,1.3836
1829,1.3824
1830,1.3837
1831,1.3745
1832,1.3672
1833,1.36
1834,1.3507
1835,1.3435
1836,1.3338
1837,1.329
1838,1.3266
1839,1.3217
1840,1.3149
1841,1.3129
1842,1.311
1843,1.3042
1844,1.2954
1845,1.2935
1846,1.2911
1847,1.2838
1848,1.2766
1849,1.2669
1850,1.2597
1851,1.2524
1852,1.2428
1853,1.2355
1854,1.2259
1855,1.2186
1856,1.2114
1857,1.2017
1858,1.1945
1859,1.1872
1860,1.1776
1861,1.1704
1862,1.1607
1863,1.1535
1864,1.1462
1865,1.1395
1866,1.1381
1867,1.1284
1868,1.1212
1869,1.114
1870,1.1043
1871,1.0971
1872,1.087
1873,1.0797
1874,1.0725
1875,1.0628
1876,1.0556
1877,1.0483
1878,1.0421
1879,1.0383
1880,1.0306
1881,1.0233
1882,1.0161
1883,1.0064
1884,0.9991899999999999
1885,0.98954
1886,0.9823
1887,0.97459
1888,0.9649399999999999
1889,0.9577
1890,0.95094
1891,0.94129
1892,0.93406
1893,0.9244100000000001
1894,0.9167
1895,0.90946
1896,0.8998200000000001
1897,0.89259
1898,0.88294
1899,0.87571
1900,0.8684799999999999
1901,0.8660700000000001
1902,0.86366
1903,0.8588399999999999
1904,0.8492
1905,0.84149
1906,0.83859
1907,0.8356899999999999
1908,0.8279700000000001
1909,0.8173699999999999
1910,0.81013
1911,0.8053100000000001
1912,0.8029
1913,0.80001
1914,0.7903600000000001
1915,0.78313
1916,0.77349
1917,0.76626
1918,0.75903
1919,0.74939
1920,0.74217
1921,0.7349399999999999
1922,0.72531
1923,0.71808
1924,0.70845
1925,0.70122
1926,0.6940000000000001
1927,0.68437
1928,0.67715
1929,0.66752
1930,0.6603
1931,0.65308
1932,0.64345
1933,0.6362300000000001
1934,0.62902
1935,0.61939
1936,0.6121800000000001
1937,0.60256
1938,0.59534
1939,0.58813
1940,0.5785100000000001
1941,0.5713
1942,0.5616899999999999
1943,0.55447
1944,0.54727
1945,0.53765
1946,0.53045
1947,0.5232399999999999
1948,0.51363
1949,0.50642
1950,0.49682
1951,0.48961000000000005
1952,0.48241000000000006
1953,0.47281000000000006
1954,0.46507
1955,0.45547
1956,0.44827
1957,0.44106999999999996
1958,0.43146999999999996
1959,0.42428
1960,0.41468
1961,0.40748
1962,0.40029000000000003
1963,0.39574000000000004
1964,0.39174000000000003
1965,0.38454
1966,0.37494
1967,0.36773
1968,0.35814
1969,0.35094000000000003
1970,0.3432
1971,0.3336
1972,0.32641
1973,0.31681
1974,0.30962
1975,0.30241999999999997
1976,0.2984
1977,0.2944
1978,0.28665999999999997
1979,0.27706
1980,0.26986
1981,0.26026
1982,0.25306999999999996
1983,0.24586999999999998
1984,0.23573000000000002
1985,0.22854000000000002
1986,0.21895
1987,0.21175
1988,0.20456
1989,0.19814
1990,0.19412000000000001
1991,0.18399000000000001
1992,0.17679
1993,0.16959000000000002
1994,0.15946
1995,0.15225999999999998
1996,0.14506
1997,0.13733
1998,0.13439
1999,0.12959
2000,0.1224
2001,0.11465999999999998
2002,0.10399000000000001
2003,0.09625299999999999
2004,0.090918
2005,0.088518
2006,0.083719
2007,0.076522
2008,0.07412300000000001
2009,0.069326
2010,0.059729
2011,0.052535000000000005
2012,0.042944
2013,0.03575
2014,0.028558
2015,0.018969
2016,0.01178
2017,0.0021956999999999996
2018,-0.004991300000000001
2019,-0.0057163000000000005
2020,-0.0058543
2021,-0.013028
2022,-0.020203
2023,-0.029767000000000002
2024,-0.036939
2025,-0.046501
2026,-0.053671
2027,-0.06084
2028,-0.070395
2029,-0.077562
2030,-0.087114
2031,-0.094278
2032,-0.10144
2033,-0.1104
2034,-0.11755
2035,-0.1271
2036,-0.13425
2037,-0.14140999999999998
2038,-0.15094000000000002
2039,-0.15869
2040,-0.16524
2041,-0.17477
2042,-0.18192
2043,-0.19145
2044,-0.19859000000000002
2045,-0.20573000000000002
2046,-0.21525
2047,-0.22239
2048,-0.23190999999999998
2049,-0.23905
2050,-0.24618
2051,-0.24668
2052,-0.24715
2053,-0.25125
2054,-0.26075
2055,-0.26721
2056,-0.2767
2057,-0.28079
2058,-0.27881
2059,-0.28155
2060,-0.28865
2061,-0.29811
2062,-0.3052
2063,-0.31229
2064,-0.32175
2065,-0.32883
2066,-0.33592
2067,-0.34468000000000004
2068,-0.35176
2069,-0.36119
2070,-0.36827
2071,-0.37534
2072,-0.38477
2073,-0.38878
2074,-0.3883
2075,-0.39157
2076,-0.39863000000000004
2077,-0.4073
2078,-0.41434
2079,-0.41991999999999996
2080,-0.4177
2081,-0.4209
2082,-0.42951000000000006
2083,-0.43267
2084,-0.43272
2085,-0.43585
2086,-0.44206999999999996
2087,-0.44438
2088,-0.44433999999999996
2089,-0.44587
2090,-0.45516999999999996
2091,-0.46133
2092,-0.47062
2093,-0.47758999999999996
2094,-0.47746000000000005
2095,-0.47648
2096,-0.48258999999999996
2097,-0.48722
2098,-0.48616000000000004
2099,-0.48362
2100,-0.48018999999999995
2101,-0.47758999999999996
2102,-0.47498
2103,-0.47146000000000005
2104,-0.46879
2105,-0.46521
2106,-0.4625
2107,-0.45611
2108,-0.44606999999999997
2109,-0.44196
2110,-0.43693999999999994
2111,-0.42826000000000003
2112,-0.42141000000000006
2113,-0.41229
2114,-0.40544
2115,-0.39858000000000005
2116,-0.38944
2117,-0.38168
2118,-0.37253000000000003
2119,-0.36566
2120,-0.3588
2121,-0.34963
2122,-0.34326999999999996
2123,-0.33738
2124,-0.3319
2125,-0.32505
2126,-0.31589
2127,-0.30901999999999996
2128,-0.30215
2129,-0.29209
2130,-0.28522
2131,-0.27604
2132,-0.26916
2133,-0.26369000000000004
2134,-0.25785
2135,-0.25377
2136,-0.24461
2137,-0.23773000000000002
2138,-0.23085
2139,-0.22168000000000002
2140,-0.21391
2141,-0.20701999999999998
2142,-0.19784000000000002
2143,-0.19095
2144,-0.18405
2145,-0.18175
2146,-0.18087999999999999
2147,-0.17081
2148,-0.16305
2149,-0.1567
2150,-0.15353
2151,-0.14576
2152,-0.14115999999999998
2153,-0.13887
2154,-0.13657
2155,-0.12737
2156,-0.1196
2157,-0.1104
2158,-0.1035
2159,-0.1009
2160,-0.09510199999999999
2161,-0.08821
2162,-0.07901699999999999
2163,-0.072121
2164,-0.065219
2165,-0.056015999999999996
2166,-0.04911
2167,-0.039899000000000004
2168,-0.032987999999999996
2169,-0.026074
2170,-0.015998
2171,-0.0090823
2172,-0.0021613
2173,0.0070667
2174,0.013993
2175,0.02323
2176,0.030159
2177,0.036463
2178,0.042158999999999995
2179,0.047623
2180,0.056852999999999994
2181,0.063776
2182,0.071548
2183,0.080786
2184,0.08771699999999999
2185,0.095489
2186,0.10117000000000001
2187,0.10749
2188,0.11672
2189,0.12449
2190,0.13141
2191,0.13919
2192,0.14403
2193,0.1489
2194,0.15581
2195,0.16272999999999999
2196,0.17196
2197,0.17889000000000002
2198,0.18897
2199,0.1959
2200,0.20282999999999998
2201,0.21206999999999998
2202,0.21900999999999998
2203,0.22152
2204,0.22866999999999998
2205,0.23644
2206,0.24506
2207,0.24761
2208,0.25248000000000004
2209,0.26256
2210,0.26947
2211,0.27521
2212,0.27779
2213,0.2847
2214,0.29477
2215,0.30168
2216,0.30859000000000003
2217,0.31578
2218,0.32066999999999996
2219,0.32416
2220,0.32679
2221,0.33084
2222,0.34003
2223,0.34779
2224,0.35698
2225,0.36386999999999997
2226,0.3665
2227,0.37233
2228,0.37499
2229,0.37767
2230,0.38633
2231,0.3941
2232,0.39998
2233,0.40498
2234,0.40771
2235,0.41365
2236,0.41685
2237,0.42688999999999994
2238,0.43101000000000006
2239,0.43378
2240,0.43749
2241,0.44256
2242,0.44632
2243,0.44915
2244,0.45426000000000005
2245,0.46297
2246,0.46523000000000003
2247,0.46808999999999995
2248,0.47193
2249,0.47481999999999996
2250,0.4787
2251,0.48163
2252,0.48457
2253,0.48428000000000004
2254,0.47752
2255,0.47823999999999994
2256,0.48123
2257,0.48199
2258,0.48601000000000005
2259,0.4858
2260,0.47908
2261,0.47012
2262,0.46341000000000004
2263,0.45446000000000003
2264,0.44878
2265,0.44208000000000003
2266,0.43315
2267,0.42645
2268,0.42183999999999994
2269,0.42273
2270,0.42038000000000003
2271,0.41148999999999997
2272,0.40481999999999996
2273,0.39816
2274,0.38928
2275,0.38261999999999996
2276,0.37375
2277,0.3671
2278,0.36046
2279,0.35398
2280,0.35186
2281,0.34193
2282,0.33526999999999996
2283,0.32863000000000003
2284,0.31976
2285,0.31312
2286,0.3032
2287,0.29657
2288,0.28993
2289,0.2811
2290,0.27447
2291,0.26785
2292,0.26127
2293,0.25582
2294,0.24703000000000003
2295,0.24040999999999998
2296,0.2327
2297,0.22386999999999999
2298,0.21729
2299,0.21076
2300,0.20305
2301,0.19642
2302,0.18759
2303,0.18097
2304,0.17436
2305,0.16554000000000002
2306,0.15894
2307,0.14904
2308,0.14243
2309,0.13584000000000002
2310,0.12705
2311,0.12155999999999999
2312,0.11279000000000002
2313,0.10620999999999998
2314,0.098523
2315,0.089762
2316,0.083195
2317,0.076633
2318,0.067887
2319,0.061332000000000005
2320,0.052601999999999996
2321,0.047025
2322,0.043647000000000005
2323,0.035963999999999996
2324,0.029406
2325,0.020668000000000002
2326,0.014121000000000002
2327,0.0064417
2328,-0.0022793
2329,-0.008817299999999998
2330,-0.017525
2331,-0.024053
2332,-0.028518
2333,-0.035262
2334,-0.040757999999999996
2335,-0.047295
2336,-0.057145
2337,-0.063675
2338,-0.072371
2339,-0.078889
2340,-0.085405
2341,-0.09435700000000001
2342,-0.097799
2343,-0.1065
2344,-0.11302000000000001
2345,-0.12069
2346,-0.12937
2347,-0.13385
2348,-0.13948
2349,-0.14612
2350,-0.15265
2351,-0.16249
2352,-0.16899999999999998
2353,-0.17551
2354,-0.1823
2355,-0.18575
2356,-0.19444
2357,-0.20096
2358,-0.20747
2359,-0.21731
2360,-0.22380999999999998
2361,-0.23248000000000002
2362,-0.23798000000000002
2363,-0.24145999999999998
2364,-0.24927
2365,-0.25578
2366,-0.26228
2367,-0.27095
2368,-0.27860999999999997
2369,-0.28726
2370,-0.29374
2371,-0.29924
2372,-0.30608
2373,-0.31058
2374,-0.31924
2375,-0.32572
2376,-0.3322
2377,-0.34202
2378,-0.34849
2379,-0.35496
2380,-0.36358
2381,-0.37003
2382,-0.37648000000000004
2383,-0.37863
2384,-0.38293
2385,-0.39152
2386,-0.39795
2387,-0.40035
2388,-0.4037
2389,-0.41134
2390,-0.42112
2391,-0.42875
2392,-0.43518
2393,-0.4349
2394,-0.43368999999999996
2395,-0.44223
2396,-0.44863000000000003
2397,-0.45503000000000005
2398,-0.46355
2399,-0.46993
2400,-0.46993
2401,-0.46835
2402,-0.47471
2403,-0.48318999999999995
2404,-0.48954
2405,-0.498
2406,-0.50434
2407,-0.51067
2408,-0.5191
2409,-0.52541
2410,-0.53172
2411,-0.5401199999999999
2412,-0.5477
2413,-0.55492
2414,-0.55957
2415,-0.56587
2416,-0.57428
2417,-0.58057
2418,-0.58895
2419,-0.59523
2420,-0.6015
2421,-0.61115
2422,-0.61741
2423,-0.62366
2424,-0.63198
2425,-0.63822
2426,-0.64423
2427,-0.6502399999999999
2428,-0.6578
2429,-0.6661199999999999
2430,-0.67367
2431,-0.68197
2432,-0.6866800000000001
2433,-0.6927
2434,-0.70157
2435,-0.70911
2436,-0.71382
2437,-0.72113
2438,-0.7266100000000001
2439,-0.73493
2440,-0.74117
2441,-0.7474
2442,-0.75702
2443,-0.7632399999999999
2444,-0.77151
2445,-0.7755
2446,-0.78154
2447,-0.78908
2448,-0.79662
2449,-0.80265
2450,-0.8086800000000001
2451,-0.81415
2452,-0.8224600000000001
2453,-0.83
2454,-0.8362200000000001
2455,-0.84375
2456,-0.8498
2457,-0.85659
2458,-0.86413
2459,-0.87034
2460,-0.87995
2461,-0.88615
2462,-0.89354
2463,-0.8995799999999999
2464,-0.9058
2465,-0.91466
2466,-0.91863
2467,-0.92465
2468,-0.93296
2469,-0.9391799999999999
2470,-0.9474600000000001
2471,-0.95499
2472,-0.96119
2473,-0.96944
2474,-0.97355
2475,-0.98098
2476,-0.98705
2477,-0.9945799999999999
2478,-1.0021
2479,-1.0082
2480,-1.0142
2481,-1.0218
2482,-1.028
2483,-1.0354
2484,-1.0393
2485,-1.0455
2486,-1.0551
2487,-1.0614
2488,-1.0696
2489,-1.0757
2490,-1.0817
2491,-1.0913
2492,-1.0989
2493,-1.1063
2494,-1.1123
2495,-1.1198
2496,-1.1274
2497,-1.1334
2498,-1.1394
2499,-1.1457
2500,-1.1519
2501,-1.1615
2502,-1.1677
2503,-1.1724
2504,-1.1819
2505,-1.1894
2506,-1.1977
2507,-1.2052
2508,-1.2114
2509,-1.2196
2510,-1.2236
2511,-1.229
2512,-1.2373
2513,-1.2435
2514,-1.2531
2515,-1.2586
2516,-1.2646
2517,-1.2728
2518,-1.2790000000000001
2519,-1.2871
2520,-1.2931
2521,-1.2999
2522,-1.3082
2523,-1.3157
2524,-1.3219
2525,-1.3308
2526,-1.3369
2527,-1.3437
2528,-1.3512
2529,-1.3567
2530,-1.364
2531,-1.3708
2532,-1.3791
2533,-1.3867
2534,-1.3929
2535,-1.4017
2536,-1.4078
2537,-1.4180000000000001
2538,-1.4242
2539,-1.4302
2540,-1.4396
2541,-1.4472
2542,-1.4534
2543,-1.4608
2544,-1.4647
2545,-1.4743
2546,-1.4806
2547,-1.4866
2548,-1.4918
2549,-1.4980000000000002
2550,-1.5077
2551,-1.5139
2552,-1.5202
2553,-1.527
2554,-1.5309
2555,-1.5377
2556,-1.5473
2557,-1.5541
2558,-1.5614
2559,-1.5668
2560,-1.5744
2561,-1.5799
2562,-1.5858
2563,-1.5918
2564,-1.5981
2565,-1.6044
2566,-1.614
2567,-1.6203
2568,-1.6263
2569,-1.6322
2570,-1.6377
2571,-1.6461
2572,-1.6523
2573,-1.6586
2574,-1.6669
2575,-1.6731
2576,-1.6827
2577,-1.6889
2578,-1.6951
2579,-1.7033
2580,-1.7094
2581,-1.7183
2582,-1.7224
2583,-1.7292
2584,-1.7374
2585,-1.7435
2586,-1.7496
2587,-1.7578
2588,-1.7638
2589,-1.7719
2590,-1.7779
2591,-1.7854
2592,-1.7934
2593,-1.7994
2594,-1.8073
2595,-1.8133
2596,-1.8192
2597,-1.8231
2598,-1.8251
2599,-1.829
2600,-1.8369
2601,-1.8442
2602,-1.8476
2603,-1.8511
2604,-1.8584
2605,-1.8692
2606,-1.875
2607,-1.8789
2608,-1.8808
2609,-1.8862
2610,-1.8939
2611,-1.8996
2612,-1.9072
2613,-1.9129
2614,-1.9201
2615,-1.9276
2616,-1.9332
2617,-1.9388
2618,-1.9457
2619,-1.9524
2620,-1.9612
2621,-1.9684
2622,-1.9735
2623,-1.9817
2624,-1.9871
2625,-1.9945
2626,-2.0001
2627,-2.0056
2628,-2.0129
2629,-2.0183
2630,-2.0237
2631,-2.0309
2632,-2.0362
2633,-2.0433
2634,-2.0485
2635,-2.0537
2636,-2.0606
2637,-2.0658
2638,-2.0725
2639,-2.0776
2640,-2.0826
2641,-2.0892
2642,-2.0941
2643,-2.0989
2644,-2.1053
2645,-2.1101
2646,-2.1164
2647,-2.121
2648,-2.1256
2649,-2.1316
2650,-2.1361
2651,-2.142
2652,-2.1464
2653,-2.1507
2654,-2.1563
2655,-2.1605
2656,-2.166
2657,-2.17
2658,-2.174
2659,-2.1792
2660,-2.1830000000000003
2661,-2.1867
2662,-2.1938
2663,-2.1953
2664,-2.2021
2665,-2.2056
2666,-2.209
2667,-2.2134
2668,-2.2166
2669,-2.2207
2670,-2.2238
2671,-2.2245
2672,-2.2283
2673,-2.231
2674,-2.2337
2675,-2.2371
2676,-2.2396
2677,-2.2428
2678,-2.245
2679,-2.2472
2680,-2.25
2681,-2.252
2682,-2.2545
2683,-2.2562
2684,-2.2579
2685,-2.26
2686,-2.2638
2687,-2.2652
2688,-2.2644
2689,-2.2655
2690,-2.2668
2691,-2.2677
2692,-2.2685
2693,-2.2694
2694,-2.2699
2695,-2.2702
2696,-2.2704
2697,-2.2705
2698,-2.2709
2699,-2.2709
2700,-2.2685
2701,-2.2662
2702,-2.2662
2703,-2.2686
2704,-2.2711
2705,-2.2711
2706,-2.2711
2707,-2.2736
2708,-2.2736
