time,value
0,-0.52956
1,-0.52956
2,-0.52956
3,-0.52956
4,-0.52956
5,-0.52956
6,-0.52956
7,-0.52956
8,-0.52956
9,-0.52956
10,-0.52956
11,-0.52956
12,-0.52956
13,-0.52956
14,-0.52956
15,-0.52956
16,-0.52956
17,-0.52956
18,-0.52956
19,-0.52956
20,-0.52956
21,-0.52956
22,-0.52956
23,-0.52956
24,-0.52956
25,-0.52956
26,-0.52956
27,-0.52956
28,-0.52956
29,-0.52956
30,-0.52956
31,-0.52956
32,-0.52956
33,-0.52956
34,-0.52956
35,-0.52956
36,-0.52956
37,-0.52956
38,-0.52956
39,-0.52956
40,-0.52956
41,-0.52956
42,-0.52956
43,-0.52956
44,-0.52956
45,-0.52956
46,-0.52956
47,-0.52956
48,-0.52956
49,-0.52956
50,-0.52956
51,-0.52956
52,-0.52956
53,-0.52956
54,-0.52956
55,-0.52956
56,-0.52956
57,-0.52956
58,-0.52956
59,-0.52956
60,-0.52956
61,-0.52956
62,-0.52956
63,-0.52956
64,-0.52956
65,-0.52956
66,-0.52956
67,-0.52956
68,-0.52956
69,-0.52956
70,-0.52956
71,-0.52956
72,-0.52956
73,-0.52956
74,2.2347
75,2.475
76,2.1145
77,1.6337
78,1.7539
79,2.475
80,2.3548
81,2.1145
82,2.2347
83,2.2347
84,1.9943
85,1.6337
86,1.6337
87,1.7539
88,1.3934
89,1.5136
90,1.3934
91,1.5136
92,1.3934
93,0.79246
94,1.0328
95,1.5136
