time,value
0,1.4444
1,0.77593
2,-0.8475600000000001
3,-0.8475600000000001
4,-0.8475600000000001
5,-0.8475600000000001
6,-0.8475600000000001
7,1.3489
8,1.4444
9,0.77593
10,-0.8475600000000001
11,-0.8475600000000001
12,-0.8475600000000001
13,-0.8475600000000001
14,-0.8475600000000001
15,0.96693
16,1.3489
17,1.4444
18,-0.8475600000000001
19,-0.8475600000000001
20,-0.8475600000000001
21,-0.8475600000000001
22,-0.8475600000000001
23,-0.37006
24,1.4444
25,1.4444
26,1.3489
27,-0.8475600000000001
28,-0.8475600000000001
29,-0.8475600000000001
30,-0.27455999999999997
31,1.4444
32,1.3489
33,0.20294
34,-0.8475600000000001
35,-0.8475600000000001
36,-0.8475600000000001
37,-0.8475600000000001
38,1.1579
39,1.4444
40,1.0624
41,-0.8475600000000001
42,-0.8475600000000001
43,-0.8475600000000001
44,-0.8475600000000001
45,-0.8475600000000001
46,1.5399
47,1.4444
48,1.4444
49,-0.27455999999999997
50,-0.8475600000000001
51,-0.8475600000000001
52,-0.8475600000000001
53,1.2534
54,1.4444
55,0.48943000000000003
56,-0.8475600000000001
57,-0.8475600000000001
58,-0.8475600000000001
59,-0.8475600000000001
60,1.1579
61,1.3489
62,0.96693
63,-0.8475600000000001
64,-0.8475600000000001
65,-0.8475600000000001
66,-0.8475600000000001
67,0.77593
68,1.4444
69,1.4444
70,0.29844
71,-0.8475600000000001
72,-0.8475600000000001
73,-0.8475600000000001
74,0.96693
75,1.4444
76,0.8714299999999999
77,-0.8475600000000001
78,-0.8475600000000001
79,-0.8475600000000001
80,-0.27455999999999997
81,1.4444
82,1.3489
83,0.10744000000000001
84,-0.8475600000000001
85,-0.8475600000000001
86,-0.8475600000000001
87,-0.17906
88,1.4444
89,1.4444
90,0.29844
91,-0.8475600000000001
92,-0.8475600000000001
93,-0.8475600000000001
94,-0.8475600000000001
95,-0.27455999999999997
