time,value
0,1.6381
1,0.65591
2,-0.8719
3,-0.8719
4,-0.43538000000000004
5,1.5290000000000001
6,0.65591
7,-0.8719
8,-0.8719
9,-0.65364
10,1.6381
11,0.54678
12,-0.8719
13,-0.8719
14,-0.54451
15,1.5290000000000001
16,0.54678
17,-0.8719
18,-0.8719
19,-0.54451
20,1.5290000000000001
21,0.54678
22,-0.8719
23,-0.8719
24,-0.8719
25,1.6381
26,0.54678
27,-0.8719
28,-0.8719
29,-0.8719
30,1.5290000000000001
31,0.65591
32,-0.8719
33,-0.8719
34,-0.8719
35,1.3107
36,0.9833
37,-0.8719
38,-0.8719
39,-0.8719
40,1.2016
41,1.5290000000000001
42,-0.8719
43,-0.8719
44,-0.8719
45,1.4198
46,0.9833
47,-0.8719
48,-0.8719
49,-0.8719
50,1.6381
51,0.7650399999999999
52,-0.8719
53,-0.8719
54,-0.8719
55,1.4198
56,0.9833
57,-0.8719
58,-0.8719
59,-0.8719
60,0.9833
61,1.5290000000000001
62,-0.8719
63,-0.8719
64,-0.8719
65,0.65591
66,1.5290000000000001
67,-0.65364
68,-0.8719
69,-0.21711999999999998
70,1.5290000000000001
71,0.2194
72,-0.8719
73,-0.8719
74,0.32853000000000004
75,1.5290000000000001
76,-0.32625
77,-0.8719
78,-0.8719
79,0.43765
80,1.5290000000000001
81,-0.32625
82,-0.8719
83,-0.54451
84,1.6381
85,0.7650399999999999
86,-0.8719
87,-0.8719
88,0.0011368
89,1.5290000000000001
90,0.32853000000000004
91,-0.8719
92,-0.8719
93,0.8741700000000001
94,1.5290000000000001
95,-0.8719
