time,value
0,-0.47091000000000005
1,-0.47091000000000005
2,-0.47091000000000005
3,-0.47091000000000005
4,-0.47091000000000005
5,-0.47091000000000005
6,-0.47091000000000005
7,-0.47091000000000005
8,-0.47091000000000005
9,-0.47091000000000005
10,-0.47091000000000005
11,-0.47091000000000005
12,-0.47091000000000005
13,-0.47091000000000005
14,-0.47091000000000005
15,-0.47091000000000005
16,-0.47091000000000005
17,-0.47091000000000005
18,-0.47091000000000005
19,-0.47091000000000005
20,-0.47091000000000005
21,-0.47091000000000005
22,-0.47091000000000005
23,-0.47091000000000005
24,-0.47091000000000005
25,-0.47091000000000005
26,-0.47091000000000005
27,-0.47091000000000005
28,-0.47091000000000005
29,-0.47091000000000005
30,-0.47091000000000005
31,-0.47091000000000005
32,-0.47091000000000005
33,-0.47091000000000005
34,-0.47091000000000005
35,-0.47091000000000005
36,-0.47091000000000005
37,-0.47091000000000005
38,-0.47091000000000005
39,-0.47091000000000005
40,-0.47091000000000005
41,-0.47091000000000005
42,-0.47091000000000005
43,-0.47091000000000005
44,-0.47091000000000005
45,-0.47091000000000005
46,-0.47091000000000005
47,-0.47091000000000005
48,-0.47091000000000005
49,1.3618
50,2.3218
51,-0.29636
52,-0.47091000000000005
53,-0.47091000000000005
54,-0.47091000000000005
55,-0.47091000000000005
56,-0.47091000000000005
57,-0.47091000000000005
58,-0.47091000000000005
59,-0.47091000000000005
60,-0.47091000000000005
61,-0.47091000000000005
62,-0.47091000000000005
63,-0.47091000000000005
64,-0.47091000000000005
65,-0.47091000000000005
66,-0.47091000000000005
67,-0.47091000000000005
68,-0.47091000000000005
69,2.1473
70,2.4964
71,0.66363
72,-0.47091000000000005
73,-0.47091000000000005
74,-0.47091000000000005
75,-0.47091000000000005
76,1.9727
77,2.4091
78,2.2345
79,2.2345
80,2.1473
81,1.9727
82,2.2345
83,1.9727
84,2.2345
85,2.3218
86,2.3218
87,2.1473
88,1.3618
89,-0.47091000000000005
90,-0.47091000000000005
91,-0.47091000000000005
92,-0.47091000000000005
93,-0.47091000000000005
94,-0.47091000000000005
95,-0.47091000000000005
