time,value
0,-1.0027
1,-1.0027
2,-1.0027
3,-1.0027
4,-1.0027
5,-1.0027
6,-1.0027
7,-1.0027
8,-1.0027
9,-1.0027
10,-1.0027
11,-1.0027
12,-1.0027
13,-1.0027
14,-1.0027
15,-1.0027
16,-1.0027
17,-1.0027
18,-1.0027
19,-1.0027
20,-1.0027
21,-1.0027
22,-1.0027
23,-1.0027
24,-1.0027
25,-1.0027
26,-1.0027
27,-1.0027
28,0.5927399999999999
29,0.9472799999999999
30,1.3018
31,0.7700100000000001
32,0.9472799999999999
33,1.0359
34,0.5927399999999999
35,0.7700100000000001
36,0.9472799999999999
37,0.5927399999999999
38,2.0109
39,2.3654
40,2.1882
41,2.1882
42,2.4541
43,1.4791
44,0.5041100000000001
45,0.5927399999999999
46,-0.11632999999999999
47,-0.11632999999999999
48,-0.47086999999999996
49,-0.11632999999999999
50,-0.47086999999999996
51,-0.6481399999999999
52,-0.6481399999999999
53,-0.47086999999999996
54,-0.73677
55,-0.8254100000000001
56,-0.20496999999999999
57,-0.8254100000000001
58,-1.0027
59,-1.0027
60,-1.0027
61,-1.0027
62,-1.0027
63,-1.0027
64,0.7700100000000001
65,1.3904
66,0.85864
67,1.2132
68,0.85864
69,0.7700100000000001
70,1.0359
71,0.68138
72,0.5927399999999999
73,0.85864
74,0.68138
75,0.5927399999999999
76,0.7700100000000001
77,0.85864
78,0.5927399999999999
79,0.5927399999999999
80,0.7700100000000001
81,0.85864
82,0.5927399999999999
83,0.5927399999999999
84,0.85864
85,0.85864
86,0.5041100000000001
87,0.5927399999999999
88,0.85864
89,0.68138
90,0.5041100000000001
91,0.68138
92,-1.0027
93,-1.0027
94,-1.0027
95,-1.0027
