time,value
0,0.55842
1,0.60344
2,0.70802
3,0.76408
4,0.7782100000000001
5,0.6533899999999999
6,0.60875
7,0.62312
8,0.7350399999999999
9,0.67943
10,0.59172
11,0.5694899999999999
12,0.5032
13,0.42465
14,0.4342
15,0.53508
16,0.55304
17,0.5726
18,0.5845
19,0.59791
20,0.61659
21,0.64137
22,0.60512
23,0.58696
24,0.6217199999999999
25,0.65792
26,0.6716300000000001
27,0.6440899999999999
28,0.6674800000000001
29,0.68957
30,0.68216
31,0.66222
32,0.7101
33,0.67919
34,0.69317
35,0.66233
36,0.66581
37,0.6424
38,0.63583
39,0.67928
40,0.59605
41,0.57635
42,0.49703
43,0.50722
44,0.467
45,0.40626999999999996
46,0.36627
47,0.35433000000000003
48,0.32649
49,0.32003000000000004
50,0.25225
51,0.20483
52,0.20531999999999997
53,0.1765
54,0.15572
55,0.11510999999999999
56,0.067748
57,0.019469999999999998
58,-0.0054486000000000005
59,-0.24745999999999999
60,-0.28584
61,-0.65786
62,-1.0544
63,-1.4307
64,-1.8297
65,-2.1795
66,-2.7045
67,-2.4895
68,-2.6914
69,-2.8154
70,-2.6713
71,-2.6312
72,-2.4975
73,-2.3129
74,-2.0529
75,-1.966
76,-1.6138
77,-1.1733
78,-1.1739
79,-1.0697
80,-0.95015
81,-0.64159
82,-0.5514
83,-0.7139
84,-0.57547
85,-0.51675
86,-0.71749
87,-0.90597
88,-1.1221
89,-1.3344
90,-0.35705
91,0.19734000000000002
92,-0.47696000000000005
93,-0.34299
94,0.13323
95,-0.25581
96,-0.49961000000000005
97,-0.24254
98,-0.3325
99,-0.3908
100,-0.36052
101,-0.44606
102,-0.37227
103,-0.48046000000000005
104,-0.39068
105,-0.47068000000000004
106,-0.5313399999999999
107,-0.4442
108,-0.31381
109,-0.40102
110,-0.34833000000000003
111,-0.60596
112,-0.32995
113,-0.47581999999999997
114,-0.51302
115,-0.418
116,-0.36496999999999996
117,-0.41393
118,-0.41527
119,-0.34754
120,-0.31828
121,-0.34321999999999997
122,-0.25605
123,-0.28889000000000004
124,-0.27513000000000004
125,-0.27145
126,-0.27755
127,-0.26650999999999997
128,-0.22491999999999998
129,-0.2416
130,-0.17278
131,-0.16630999999999999
132,-0.26404
133,-0.13310999999999998
134,-0.25635
135,-0.38445999999999997
136,-0.23091
137,0.066639
138,-0.34374
139,-0.24461999999999998
140,-0.32774000000000003
141,0.34160999999999997
142,-0.20834
143,-0.52396
144,-0.43333999999999995
145,-0.20178
146,-0.10086
147,-0.25874
148,-0.13992000000000002
149,0.21186
150,0.13224
151,0.21468
152,0.27601
153,-0.5426
154,-0.61702
155,-0.40071999999999997
156,-0.92394
157,-1.5397
158,-1.7313
159,-2.6151
160,-4.8184
161,-4.3487
162,-3.3198
163,-4.0131
164,-4.5419
165,-2.9883
166,-1.7745
167,-1.1378
168,-1.5996
169,-1.2286
170,-1.0216
171,-1.4565
172,-1.7619
173,-2.0388
174,-1.266
175,-0.2135
176,-0.18529
177,-0.16583
178,0.5366
179,1.1768
180,0.93321
181,0.6377
182,0.48546999999999996
183,0.55408
184,0.5998
185,0.75495
186,0.799
187,0.59032
188,0.56224
189,0.60135
190,0.75803
191,0.69458
192,0.80684
193,0.8677600000000001
194,0.8354299999999999
195,0.67185
196,0.66035
197,0.55447
198,0.31031
199,0.25942
200,0.46212
201,0.41895
202,0.41661000000000004
203,0.43973
204,0.47243999999999997
205,0.5392600000000001
206,0.63799
207,0.61806
208,0.5665
209,0.4384
210,0.43612
211,0.58638
212,0.5908
213,0.68588
214,0.67279
215,0.59277
216,0.67015
217,0.6414
218,0.62452
219,0.64562
220,0.6671699999999999
221,0.77235
222,0.50467
223,0.61808
224,0.67523
225,0.76199
226,0.85649
227,0.76095
228,0.727
229,0.75226
230,0.55209
231,0.49383
232,0.5587
233,0.5697300000000001
234,0.60669
235,0.73779
236,0.68894
237,0.6693100000000001
238,0.66651
239,0.53032
240,0.50581
241,0.5261
242,0.47888000000000003
243,0.5512699999999999
244,0.55216
245,0.58158
246,0.55629
247,0.6862199999999999
248,0.68871
249,0.6111
250,0.48131999999999997
251,0.46758999999999995
252,0.60973
253,0.69384
254,0.68621
255,0.6834899999999999
256,0.57693
257,0.56552
258,0.68479
259,0.83857
260,0.84541
261,0.8403799999999999
262,0.55713
263,0.53578
264,0.52751
265,0.5451199999999999
266,0.67088
267,0.82535
268,0.8306100000000001
269,0.5472899999999999
270,0.54697
271,0.61005
272,0.63871
273,0.5997600000000001
274,0.65763
275,0.44532
276,0.43375
277,0.5311
278,0.5459
279,0.6735399999999999
280,0.5433
281,0.68169
282,0.81014
283,0.82147
284,0.8267399999999999
285,0.82965
286,0.67656
287,0.67887
288,0.67499
289,0.52759
290,0.51686
291,0.51471
292,0.65647
293,0.66888
294,0.8209799999999999
295,0.96136
296,0.78869
297,0.81143
298,0.79157
299,0.9363
