time,value
0,-0.43027
1,-0.43027
2,-0.43027
3,-0.43027
4,-0.43027
5,-0.43027
6,-0.43027
7,-0.43027
8,-0.43027
9,-0.43027
10,-0.43027
11,-0.43027
12,-0.43027
13,-0.43027
14,-0.43027
15,-0.43027
16,-0.43027
17,-0.43027
18,-0.43027
19,-0.43027
20,-0.43027
21,-0.43027
22,-0.43027
23,-0.43027
24,-0.43027
25,-0.43027
26,-0.43027
27,-0.43027
28,-0.43027
29,-0.43027
30,-0.43027
31,-0.43027
32,-0.43027
33,-0.43027
34,-0.43027
35,-0.43027
36,-0.43027
37,-0.43027
38,-0.43027
39,-0.43027
40,-0.43027
41,-0.43027
42,-0.43027
43,-0.43027
44,-0.43027
45,-0.43027
46,-0.43027
47,-0.43027
48,-0.43027
49,-0.43027
50,-0.43027
51,-0.43027
52,-0.43027
53,-0.43027
54,-0.43027
55,-0.43027
56,-0.43027
57,-0.43027
58,-0.43027
59,-0.43027
60,-0.43027
61,-0.43027
62,-0.43027
63,-0.43027
64,-0.43027
65,-0.43027
66,-0.43027
67,-0.43027
68,-0.43027
69,-0.43027
70,-0.43027
71,-0.43027
72,-0.43027
73,-0.43027
74,-0.43027
75,-0.43027
76,-0.43027
77,-0.43027
78,-0.43027
79,-0.43027
80,0.47556000000000004
81,3.5554
82,2.8307
83,2.2872
84,2.106
85,2.106
86,2.106
87,1.9249
88,1.9249
89,1.9249
90,1.9249
91,2.106
92,1.9249
93,1.9249
94,2.8307
95,2.4684
