time,value
0,-0.49473999999999996
1,-0.50642
2,-0.33695
3,-0.33997
4,-0.51454
5,-0.5121
6,-0.66689
7,-0.6654100000000001
8,-0.49535
9,-0.49065
10,-0.49078999999999995
11,-0.48728
12,-0.46795
13,-0.33014
14,-0.43743000000000004
15,-0.26854
16,-0.20590999999999998
17,-0.26095
18,-0.23228000000000001
19,-0.19414
20,-0.16630999999999999
21,-0.11878
22,0.0058998
23,-0.009623200000000002
24,-0.030386
25,0.01099
26,0.031195
27,-0.040967
28,-0.031692000000000005
29,-0.0070314999999999996
30,0.0031574999999999997
31,0.023264
32,0.021902
33,-0.027441000000000004
34,-0.076051
35,-0.015885
36,0.037724
37,-0.026868
38,-0.22994
39,-0.41978000000000004
40,-0.64002
41,-1.0172
42,-1.6312
43,-1.7092
44,-1.8064
45,-1.8635
46,-2.5001
47,-2.0875
48,-2.1217
49,-1.8656
50,-1.8006
51,-1.6363
52,-1.4215
53,-1.2069
54,-1.0105
55,-0.54497
56,-0.11539
57,-0.2867
58,-0.0071985
59,0.34153
60,0.69555
61,0.5373600000000001
62,0.29661
63,0.6016699999999999
64,0.79769
65,0.60039
66,0.75331
67,0.17724
68,0.06604
69,0.37601999999999997
70,0.41031000000000006
71,0.19733
72,0.42536
73,0.42513999999999996
74,0.46062
75,0.45947
76,0.45508000000000004
77,0.40891
78,0.38524
79,0.39003000000000004
80,0.32106999999999997
81,0.34503
82,0.44938
83,0.46023000000000003
84,0.46758
85,0.5193399999999999
86,0.49648000000000003
87,0.66309
88,0.72887
89,0.71204
90,0.65968
91,0.6221899999999999
92,0.79104
93,0.7562300000000001
94,0.77809
95,0.9299
96,1.069
97,0.98867
98,0.8574799999999999
99,0.89459
100,0.78109
101,0.77068
102,0.66374
103,0.8054100000000001
104,0.9119700000000001
105,1.0002
106,1.062
107,1.1435
108,1.1942
109,1.1346
110,1.2189
111,1.1784
112,1.1582
113,1.1557
114,1.0449
115,1.2302
116,1.1876
117,1.3668
118,1.355
119,1.2613
120,1.4823
121,1.6758
122,1.6218
123,1.6133
124,1.7466
125,1.735
126,1.699
127,1.7401
128,1.6952
129,1.7696
130,1.8691
131,1.8629
132,1.9633
133,1.9781
134,1.9543
135,1.9792
136,1.942
137,2.1175
138,2.0695
139,2.1428
140,2.1101
141,1.8546
142,1.7052
143,1.6455
144,1.4638
145,1.2048
146,1.2606
147,1.4664
148,1.6252
149,1.7935
150,1.6746
151,1.5102
152,1.1831
153,0.65051
154,-0.15227000000000002
155,-0.6641600000000001
156,-0.6088899999999999
157,-0.71394
158,-1.5947
159,-2.259
160,-2.3742
161,-2.6163
162,-2.6801
163,-3.0810000000000004
164,-2.6603
165,-3.1191
166,-3.2528
167,-2.3589
168,-2.8142
169,-2.3918
170,-1.9727
171,-1.1353
172,-1.0362
173,-1.3526
174,-1.3401
175,-0.6188100000000001
176,-1.9481
177,-1.1175
178,-1.2622
179,-1.0639
180,-0.88845
181,-0.43091999999999997
182,0.16025
183,0.37635
184,0.37108
185,-0.039751
186,-0.39091
187,-0.29806
188,-0.13817000000000002
189,0.62988
190,0.81704
191,0.64818
192,0.019348
193,-0.069457
194,-0.11314
195,-0.24345
196,-0.26784
197,-0.39427
198,-0.4651
199,-0.5072399999999999
200,-0.29872
201,-0.34081
202,-0.34052
203,-0.16505
204,-0.16338
205,-0.18979000000000001
206,-0.21134
207,-0.07509
208,-0.17605
209,-0.18204
210,-0.18517999999999998
211,-0.16341
212,-0.16183
213,-0.19252
214,-0.21514
215,-0.20683
216,-0.30533000000000005
217,-0.37344
218,-0.30679
219,-0.2394
220,-0.073293
221,-0.08875
222,-0.24261
223,-0.17883
224,-0.20651999999999998
225,-0.27513000000000004
226,-0.20681
227,-0.15050999999999998
228,-0.057460000000000004
229,-0.05563099999999999
230,-0.27471
231,-0.20915
232,-0.20761999999999997
233,-0.19876
234,-0.048473
235,-0.04558
236,-0.064445
237,-0.14995
238,-0.24796999999999997
239,-0.25755
240,-0.1255
241,-0.16777
242,-0.13579000000000002
243,-0.075971
244,-0.13099
245,-0.13675
246,-0.23096
247,-0.23573000000000002
248,-0.23359000000000002
249,-0.2406
250,-0.07724199999999999
251,-0.081298
252,-0.12405
253,-0.12174000000000001
254,-0.24123000000000003
255,-0.24674000000000001
256,-0.24011
257,-0.22415
258,-0.22960999999999998
259,-0.23573000000000002
260,-0.23126999999999998
261,-0.26852
262,-0.23296999999999998
263,-0.23033
264,-0.070993
265,-0.08657100000000001
266,-0.10007
267,-0.12675999999999998
268,-0.08530599999999999
269,-0.11685999999999999
270,-0.24366
271,-0.27658
272,-0.24011
273,-0.2403
274,-0.23514000000000002
275,-0.26484
276,-0.24126
277,-0.21946
278,-0.08795599999999999
279,-0.12253
280,-0.25518
281,-0.25504
282,-0.2602
283,-0.26448
284,-0.11331
285,-0.42776000000000003
286,-0.41577
287,-0.25693
288,-0.098274
289,-0.27113000000000004
290,-0.28089000000000003
291,-0.28419
292,-0.28206
293,-0.10699000000000002
294,-0.10124
295,-0.10651
296,-0.2702
297,-0.44725
298,-0.28123000000000004
299,-0.28151
