time,value
0,-0.61529
1,-0.48821000000000003
2,-0.64645
3,-0.7875300000000001
4,-0.8252700000000001
5,-0.79584
6,-0.74119
7,-0.7609899999999999
8,-0.7003199999999999
9,-0.73174
10,-0.6801
11,-0.61945
12,-0.6372399999999999
13,-0.44022
14,-0.3652
15,-0.25428
16,-0.11872
17,-0.018858
18,0.066826
19,0.14401
20,0.21113
21,0.3498
22,0.40442
23,0.41306000000000004
24,0.9496600000000001
25,1.1623
26,2.9251
27,4.0702
28,5.034
29,3.0499
30,2.1673
31,4.3823
32,3.4748
33,2.8167
34,1.4738
35,0.7577
36,1.2706
37,1.5345
38,0.84893
39,0.25873
40,0.19105999999999998
41,0.36653
42,0.29504
43,0.010688
44,0.22241
45,0.15861
46,0.34341
47,0.13037
48,0.11473
49,0.1096
50,0.041122000000000006
51,-0.07697000000000001
52,-0.10005
53,-0.1688
54,0.043213
55,0.024516
56,-0.24839
57,-0.42411000000000004
58,-0.56145
59,-0.46858999999999995
60,-0.74164
61,-0.9122600000000001
62,-0.80704
63,-0.925
64,-0.93474
65,-0.81583
66,-0.9902299999999999
67,-0.88105
68,-0.93921
69,-0.9507
70,-0.9442200000000001
71,-0.9528700000000001
72,-1.0534
73,-1.0759999999999998
74,-0.9809100000000001
75,-1.0989
76,-1.1583
77,-1.0296
78,-1.1304
79,-1.1176
80,-0.91546
81,-0.9908899999999999
82,-0.9364600000000001
83,-1.0057
84,-0.99061
85,-1.091
86,-1.0698
87,-1.1102
88,-1.14
89,-0.9921200000000001
90,-0.9715299999999999
91,-0.8996700000000001
92,-0.93875
93,-0.87344
94,-0.75669
95,-0.80505
96,-0.82152
97,-0.8227
98,-0.79635
99,-0.8174899999999999
100,-0.72013
101,-0.82481
102,-0.86916
103,-0.87403
104,-0.79023
105,-0.77828
106,-0.80603
107,-0.8278
108,-0.78314
109,-0.77666
110,-0.7973
111,-0.79433
112,-0.69455
113,-0.68296
114,-0.71764
115,-0.7268600000000001
116,-0.56348
117,-0.31451
118,0.16497
119,0.773
120,1.1544
121,1.1173
122,0.9823700000000001
123,0.78608
124,0.79183
125,1.3353
126,0.9327700000000001
127,0.27171999999999996
128,1.2590000000000001
129,0.27328
130,-0.8815799999999999
131,-1.0287
132,1.8939
133,2.6924
134,1.0587
135,0.92961
136,1.0146
137,1.1371
138,2.3861
139,2.7834
140,3.062
141,2.7893
142,3.1713
143,2.6164
144,2.7762
145,2.4214
146,3.128
147,3.2094
148,2.3347
149,1.2805
150,-0.10592
151,-0.083511
152,0.53788
153,-0.028372
154,0.0015360999999999999
155,0.33864
156,0.38956
157,0.41257
158,0.18169000000000002
159,0.25639
160,0.32361
161,0.23922
162,0.29608
163,0.32003000000000004
164,0.36903
165,0.37458
166,0.27486
167,0.37234
168,0.32115
169,0.27498
170,0.2637
171,0.25998000000000004
172,0.24638000000000002
173,0.26566999999999996
174,0.26859
175,0.18631
176,0.24866
177,0.16218
178,0.13283
179,0.14326
180,0.13871
181,0.16649
182,0.17481
183,0.15425999999999998
184,0.14363
185,0.19255
186,0.16377
187,0.15254
188,0.038235000000000005
189,0.051548000000000004
190,0.0887
191,0.039587
192,-0.010878
193,0.08842
194,0.10733
195,-0.0016129000000000002
196,0.003885
197,-0.017116
198,-0.12485999999999998
199,-0.10517
200,-0.10051
201,-0.1396
202,-0.22046999999999997
203,-0.067108
204,-0.11794
205,-0.2311
206,-0.15348
207,-0.13548
208,-0.16955
209,-0.19255
210,-0.19863
211,-0.19537000000000002
212,-0.20643000000000003
213,-0.22405
214,-0.26094
215,-0.41457
216,-0.2662
217,-0.24586999999999998
218,-0.35943
219,-0.26463000000000003
220,-0.25751999999999997
221,-0.2316
222,-0.20814000000000002
223,-0.21948
224,-0.23993
225,-0.2044
226,-0.17952
227,-0.17222
228,-0.21509
229,-0.36404000000000003
230,-0.23351999999999998
231,-0.25514000000000003
232,-0.27547
233,-0.28174
234,-0.41543
235,-0.29545
236,-0.31454
237,-0.32768
238,-0.34936
239,-0.37768
240,-0.37716
241,-0.5265
242,-0.49049
243,-0.36049000000000003
244,-0.34236
245,-0.3503
246,-0.36748000000000003
247,-0.36393000000000003
248,-0.21899999999999997
249,-0.37611
250,-0.37998000000000004
251,-0.38387
252,-0.51656
253,-0.51103
254,-0.38163
255,-0.39187
256,-0.38502
257,-0.37532
258,-0.374
259,-0.38288
260,-0.38511999999999996
261,-0.37555
262,-0.23268000000000003
263,-0.37633
264,-0.37981
265,-0.39593
266,-0.40254
267,-0.40089
268,-0.3954
269,-0.39164
270,-0.38491
271,-0.39503
272,-0.39616
273,-0.39357
274,-0.2455
275,-0.39565
276,-0.39846
277,-0.5474100000000001
278,-0.41461000000000003
279,-0.41467
280,-0.41353999999999996
281,-0.41363999999999995
282,-0.42258999999999997
283,-0.42323999999999995
284,-0.42115
285,-0.41721
286,-0.41628999999999994
287,-0.41200000000000003
288,-0.41268999999999995
289,-0.42582
290,-0.42465
291,-0.43033999999999994
292,-0.43154
293,-0.42649
294,-0.42144
295,-0.42296999999999996
296,-0.42772
297,-0.28311
298,-0.4323
299,-0.28135
