time,value
0,0.63674
1,0.68776
2,0.9428799999999999
3,-0.53682
4,-1.6083
5,-1.6083
6,-1.3532
7,0.68776
8,0.73879
9,0.68776
10,0.63674
11,0.68776
12,0.73879
13,-0.84296
14,-1.6083
15,-1.6083
16,-1.6083
17,-1.6083
18,-1.6593
19,-1.6083
20,-1.5573
21,-1.6083
22,-1.6083
23,-1.6593
24,-1.6083
25,-1.6593
26,-1.5573
27,-1.6083
28,-1.6593
29,-1.6083
30,-1.6083
31,-1.6083
32,-1.6083
33,-1.6083
34,-1.6083
35,-1.4552
36,-1.0471
37,0.48367
38,0.43263999999999997
39,0.43263999999999997
40,0.53469
41,0.38161999999999996
42,0.48367
43,0.43263999999999997
44,0.43263999999999997
45,0.53469
46,0.53469
47,0.53469
48,0.53469
49,0.53469
50,0.53469
51,0.43263999999999997
52,0.38161999999999996
53,0.43263999999999997
54,0.48367
55,0.53469
56,0.63674
57,0.48367
58,0.48367
59,0.48367
60,0.43263999999999997
61,0.48367
62,0.43263999999999997
63,0.48367
64,0.43263999999999997
65,0.43263999999999997
66,0.38161999999999996
67,0.43263999999999997
68,0.38161999999999996
69,0.43263999999999997
70,0.43263999999999997
71,0.43263999999999997
72,0.43263999999999997
73,0.63674
74,0.63674
75,0.68776
76,0.78981
77,0.9428799999999999
78,0.89186
79,0.89186
80,0.89186
81,0.9428799999999999
82,0.89186
83,1.0449
84,1.147
85,1.0959999999999999
86,1.147
87,0.9428799999999999
88,0.78981
89,0.68776
90,0.68776
91,0.68776
92,0.63674
93,0.68776
94,0.63674
95,0.68776
