time,value
0,1.8152
1,1.7766
2,1.7204
3,1.649
4,1.5529
5,1.435
6,1.3135
7,1.1917
8,1.0699
9,0.95245
10,0.84673
11,0.74038
12,0.63658
13,0.53666
14,0.46098999999999996
15,0.37549
16,0.28973000000000004
17,0.20922
18,0.1232
19,0.044702
20,-0.038388
21,-0.12767
22,-0.20349
23,-0.28615999999999997
24,-0.35529
25,-0.44088999999999995
26,-0.51235
27,-0.57999
28,-0.65615
29,-0.71411
30,-0.7812100000000001
31,-0.8280299999999999
32,-0.9022399999999999
33,-0.94063
34,-1.002
35,-1.043
36,-1.0775
37,-1.1053
38,-1.1331
39,-1.1599
40,-1.1867
41,-1.1832
42,-1.1968
43,-1.2031
44,-1.202
45,-1.1935
46,-1.1776
47,-1.1547
48,-1.1447
49,-1.1079
50,-1.0648
51,-1.0379
52,-0.99754
53,-0.95445
54,-0.9055
55,-0.83449
56,-0.77563
57,-0.71172
58,-0.6574399999999999
59,-0.59835
60,-0.52265
61,-0.44213
62,-0.37095
63,-0.29291
64,-0.225
65,-0.14196
66,-0.05934299999999999
67,0.023691999999999998
68,0.10194
69,0.18556
70,0.26861999999999997
71,0.34605
72,0.42653
73,0.51831
74,0.58996
75,0.6883199999999999
76,0.79325
77,0.89213
78,1.0104
79,1.1301
80,1.2518
81,1.3736
82,1.4931
83,1.5904
84,1.7056
85,1.7795
86,1.796
87,1.7945
88,1.7959
89,1.7830000000000001
90,1.7334
91,1.6199
92,1.5049
93,1.4021
94,1.2876
95,1.1661
96,1.0474
97,0.92911
98,0.8162699999999999
99,0.70831
100,0.6070800000000001
101,0.51197
102,0.41775
103,0.32907
104,0.25506999999999996
105,0.16758
106,0.078275
107,-0.009435200000000001
108,-0.099493
109,-0.1886
110,-0.26411999999999997
111,-0.34705
112,-0.43728999999999996
113,-0.51267
114,-0.58032
115,-0.6615
116,-0.73912
117,-0.80045
118,-0.86992
119,-0.93109
120,-0.99018
121,-1.0323
122,-1.0986
123,-1.1416
124,-1.1855
125,-1.2073
126,-1.2489
127,-1.2838
128,-1.3023
129,-1.311
130,-1.3232
131,-1.3276
132,-1.3035
133,-1.3127
134,-1.2889
135,-1.251
136,-1.2334
137,-1.1928
138,-1.1646
139,-1.1122
140,-1.0703
141,-1.0224
142,-0.96826
143,-0.91032
144,-0.84304
145,-0.77745
146,-0.70591
147,-0.6409999999999999
148,-0.57682
149,-0.49391
150,-0.42008999999999996
151,-0.34602
152,-0.26116
153,-0.18402000000000002
154,-0.097264
155,-0.016967
156,0.07575499999999999
157,0.16266
158,0.24529
159,0.3321
160,0.42095
161,0.5101600000000001
162,0.58382
163,0.68248
164,0.7912399999999999
165,0.9016799999999999
166,1.0197
167,1.1382
168,1.2596
169,1.3811
170,1.4999
171,1.6144
172,1.7058
173,1.76
174,1.7776
175,1.795
