[<text>
<title>morrison inc &lt;morr&gt; 3rd qtr feb 28 net</title>
<dateline>    mobile, ala., march 30 -
    </dateline>shr 35 cts vs 29 cts
    qtly div 12 cts vs 12 cts prior qtr
    net 5,036,000 vs 4,165,000
    revs 147.6 mln vs 132.4 mln
    nine mths
    shr 1.12 dlrs vs one dlr
    net 16.1 mln vs 14.4 mln
    revs 433.4 mln vs 385 mln
    note: per share data reflect march 1986 five pct stock
distribution. cash dividend is payable april 30 to holders of
record april 15.
 reuter
</text>]