time,value
0,-0.41841000000000006
1,-0.41841000000000006
2,-0.41841000000000006
3,-0.41841000000000006
4,-0.41841000000000006
5,-0.41841000000000006
6,-0.41841000000000006
7,-0.41841000000000006
8,-0.41841000000000006
9,-0.41841000000000006
10,-0.41841000000000006
11,-0.41841000000000006
12,-0.41841000000000006
13,-0.41841000000000006
14,-0.41841000000000006
15,-0.41841000000000006
16,-0.41841000000000006
17,-0.41841000000000006
18,-0.41841000000000006
19,-0.41841000000000006
20,-0.41841000000000006
21,-0.41841000000000006
22,-0.41841000000000006
23,-0.41841000000000006
24,-0.41841000000000006
25,-0.41841000000000006
26,-0.41841000000000006
27,-0.41841000000000006
28,-0.41841000000000006
29,-0.41841000000000006
30,-0.41841000000000006
31,-0.41841000000000006
32,-0.41841000000000006
33,-0.41841000000000006
34,-0.41841000000000006
35,-0.41841000000000006
36,-0.41841000000000006
37,-0.41841000000000006
38,-0.035864
39,0.92051
40,1.4943
41,-0.41841000000000006
42,1.3031
43,3.0245
44,2.8333
45,3.0245
46,2.8333
47,3.0245
48,2.8333
49,3.0245
50,2.2594
51,2.0682
52,1.6856
53,1.8769
54,-0.035864
55,-0.41841000000000006
56,0.15541
57,0.34669
58,-0.41841000000000006
59,-0.41841000000000006
60,-0.41841000000000006
61,-0.41841000000000006
62,-0.41841000000000006
63,-0.41841000000000006
64,-0.41841000000000006
65,-0.41841000000000006
66,-0.41841000000000006
67,-0.41841000000000006
68,-0.41841000000000006
69,-0.41841000000000006
70,-0.41841000000000006
71,-0.41841000000000006
72,-0.41841000000000006
73,-0.41841000000000006
74,-0.41841000000000006
75,-0.41841000000000006
76,-0.41841000000000006
77,-0.41841000000000006
78,-0.41841000000000006
79,-0.41841000000000006
80,-0.41841000000000006
81,-0.41841000000000006
82,-0.41841000000000006
83,-0.41841000000000006
84,-0.41841000000000006
85,-0.41841000000000006
86,-0.41841000000000006
87,-0.41841000000000006
88,-0.41841000000000006
89,-0.41841000000000006
90,-0.41841000000000006
91,-0.41841000000000006
92,-0.41841000000000006
93,-0.41841000000000006
94,-0.41841000000000006
95,-0.41841000000000006
