time,value
0,-0.16267
1,-0.16267
2,-0.16267
3,-0.16267
4,-0.16267
5,-0.16267
6,-0.16267
7,-0.16267
8,-0.16267
9,-0.16267
10,-0.16267
11,-0.16267
12,-0.16267
13,-0.16267
14,-0.16267
15,-0.16267
16,-0.16267
17,-0.16267
18,-0.16267
19,-0.16267
20,-0.16267
21,-0.16267
22,-0.16267
23,-0.16267
24,-0.16267
25,-0.16267
26,-0.16267
27,-0.16267
28,-0.16267
29,-0.16267
30,-0.16267
31,-0.16267
32,-0.16267
33,-0.16267
34,-0.16267
35,-0.16267
36,-0.16267
37,-0.16267
38,-0.16267
39,-0.16267
40,-0.16267
41,-0.16267
42,-0.16267
43,-0.16267
44,-0.16267
45,-0.16267
46,-0.16267
47,-0.16267
48,-0.16267
49,-0.16267
50,-0.16267
51,-0.16267
52,-0.16267
53,-0.16267
54,-0.16267
55,-0.16267
56,-0.16267
57,-0.16267
58,-0.16267
59,-0.16267
60,-0.16267
61,-0.16267
62,-0.16267
63,-0.16267
64,-0.16267
65,-0.16267
66,-0.16267
67,-0.16267
68,-0.16267
69,-0.16267
70,-0.16267
71,-0.16267
72,-0.16267
73,-0.16267
74,-0.16267
75,-0.16267
76,7.1904
77,6.1292
78,1.8083
79,-0.16267
80,-0.16267
81,-0.16267
82,-0.16267
83,-0.16267
84,-0.16267
85,-0.16267
86,-0.16267
87,-0.16267
88,-0.16267
89,-0.16267
90,-0.16267
91,-0.16267
92,-0.16267
93,-0.16267
94,-0.16267
95,-0.16267
