time,value
0,-0.20894000000000001
1,0.31890999999999997
2,-0.20894000000000001
3,-0.20894000000000001
4,-0.20894000000000001
5,0.31890999999999997
6,-0.20894000000000001
7,-0.20894000000000001
8,-0.20894000000000001
9,0.31890999999999997
10,-0.20894000000000001
11,-0.20894000000000001
12,-0.20894000000000001
13,0.31890999999999997
14,-0.20894000000000001
15,-0.20894000000000001
16,-0.20894000000000001
17,-0.20894000000000001
18,-0.20894000000000001
19,-0.20894000000000001
20,-0.20894000000000001
21,-0.20894000000000001
22,-0.20894000000000001
23,-0.20894000000000001
24,-0.20894000000000001
25,-0.20894000000000001
26,-0.20894000000000001
27,1.9025
28,9.2924
29,0.31890999999999997
30,-0.20894000000000001
31,-0.20894000000000001
32,-0.20894000000000001
33,0.31890999999999997
34,-0.20894000000000001
35,-0.20894000000000001
36,-0.20894000000000001
37,0.31890999999999997
38,-0.20894000000000001
39,-0.20894000000000001
40,-0.20894000000000001
41,0.31890999999999997
42,-0.20894000000000001
43,-0.20894000000000001
44,-0.20894000000000001
45,0.31890999999999997
46,-0.20894000000000001
47,-0.20894000000000001
48,-0.20894000000000001
49,-0.20894000000000001
50,-0.20894000000000001
51,-0.20894000000000001
52,-0.20894000000000001
53,-0.20894000000000001
54,-0.20894000000000001
55,0.31890999999999997
56,-0.20894000000000001
57,-0.20894000000000001
58,-0.20894000000000001
59,-0.20894000000000001
60,-0.20894000000000001
61,-0.20894000000000001
62,-0.20894000000000001
63,-0.20894000000000001
64,-0.20894000000000001
65,-0.20894000000000001
66,-0.20894000000000001
67,-0.20894000000000001
68,-0.20894000000000001
69,-0.20894000000000001
70,-0.20894000000000001
71,-0.20894000000000001
72,-0.20894000000000001
73,-0.20894000000000001
74,0.31890999999999997
75,-0.20894000000000001
76,-0.20894000000000001
77,-0.20894000000000001
78,0.31890999999999997
79,-0.20894000000000001
80,-0.20894000000000001
81,-0.20894000000000001
82,0.31890999999999997
83,-0.20894000000000001
84,-0.20894000000000001
85,-0.20894000000000001
86,0.31890999999999997
87,-0.20894000000000001
88,-0.20894000000000001
89,-0.20894000000000001
90,0.31890999999999997
91,-0.20894000000000001
92,-0.20894000000000001
93,-0.20894000000000001
94,0.31890999999999997
95,-0.20894000000000001
