time,value
0,-0.2141
1,-0.2141
2,-0.2141
3,-0.2141
4,-0.2141
5,-0.2141
6,-0.2141
7,-0.2141
8,-0.2141
9,-0.2141
10,-0.2141
11,-0.2141
12,-0.2141
13,-0.2141
14,-0.2141
15,-0.2141
16,-0.2141
17,-0.2141
18,-0.2141
19,-0.2141
20,-0.2141
21,-0.2141
22,-0.2141
23,-0.2141
24,-0.2141
25,-0.2141
26,-0.2141
27,-0.2141
28,-0.2141
29,-0.2141
30,-0.2141
31,-0.2141
32,-0.2141
33,-0.2141
34,-0.2141
35,-0.2141
36,-0.2141
37,-0.2141
38,-0.2141
39,-0.2141
40,-0.2141
41,-0.2141
42,-0.2141
43,-0.2141
44,5.881
45,4.9171
46,3.7265
47,0.52299
48,-0.2141
49,-0.2141
50,-0.2141
51,-0.2141
52,-0.2141
53,-0.2141
54,-0.2141
55,-0.2141
56,-0.2141
57,-0.2141
58,-0.2141
59,-0.2141
60,-0.2141
61,-0.2141
62,-0.2141
63,-0.2141
64,-0.2141
65,-0.2141
66,-0.2141
67,-0.2141
68,-0.2141
69,-0.2141
70,-0.2141
71,-0.2141
72,4.2367
73,-0.015650999999999998
74,-0.2141
75,-0.2141
76,-0.2141
77,-0.2141
78,-0.2141
79,-0.2141
80,-0.2141
81,-0.2141
82,-0.2141
83,-0.2141
84,-0.2141
85,-0.2141
86,-0.2141
87,-0.2141
88,-0.2141
89,-0.2141
90,-0.2141
91,-0.2141
92,-0.2141
93,-0.2141
94,-0.2141
95,-0.2141
