time,value
0,-0.66869
1,-0.66869
2,-0.66869
3,1.2819999999999998
4,1.814
5,0.74997
6,-0.66869
7,-0.66869
8,-0.66869
9,-0.66869
10,-0.66869
11,-0.31403000000000003
12,1.9913
13,1.814
14,-0.31403000000000003
15,-0.66869
16,-0.66869
17,-0.66869
18,-0.66869
19,-0.66869
20,0.5726399999999999
21,1.9913
22,1.1046
23,-0.66869
24,-0.66869
25,-0.66869
26,-0.66869
27,-0.66869
28,-0.66869
29,1.6366
30,1.814
31,0.3953
32,-0.66869
33,-0.66869
34,-0.66869
35,-0.66869
36,-0.66869
37,-0.13669
38,1.9913
39,1.6366
40,-0.66869
41,-0.66869
42,-0.66869
43,-0.66869
44,-0.66869
45,-0.66869
46,0.9273
47,1.814
48,1.1046
49,-0.66869
50,-0.66869
51,-0.66869
52,-0.66869
53,-0.66869
54,-0.66869
55,1.6366
56,1.814
57,0.21796999999999997
58,-0.66869
59,-0.66869
60,-0.66869
61,-0.66869
62,-0.66869
63,-0.13669
64,1.9913
65,1.814
66,-0.31403000000000003
67,-0.66869
68,-0.66869
69,-0.66869
70,-0.66869
71,-0.66869
72,0.21796999999999997
73,1.9913
74,1.6366
75,-0.13669
76,-0.66869
77,-0.66869
78,-0.66869
79,-0.66869
80,-0.66869
81,0.5726399999999999
82,1.9913
83,1.2819999999999998
84,-0.66869
85,-0.66869
86,-0.66869
87,-0.66869
88,-0.66869
89,-0.66869
90,1.1046
91,1.9913
92,0.5726399999999999
93,-0.66869
94,-0.66869
95,-0.66869
