time,value
0,-0.21543
1,-0.21543
2,-0.21543
3,-0.21543
4,-0.21543
5,-0.21543
6,-0.21543
7,-0.21543
8,-0.21543
9,-0.21543
10,-0.21543
11,-0.21543
12,-0.21543
13,-0.21543
14,-0.21543
15,-0.21543
16,-0.21543
17,-0.21543
18,-0.21543
19,-0.21543
20,-0.21543
21,-0.21543
22,-0.21543
23,-0.21543
24,-0.21543
25,-0.21543
26,-0.21543
27,-0.21543
28,-0.21543
29,-0.21543
30,-0.21543
31,-0.21543
32,-0.21543
33,-0.21543
34,-0.21543
35,-0.21543
36,-0.21543
37,-0.21543
38,-0.21543
39,-0.21543
40,-0.21543
41,-0.21543
42,-0.21543
43,-0.21543
44,-0.21543
45,-0.21543
46,-0.21543
47,-0.21543
48,-0.21543
49,-0.21543
50,-0.21543
51,-0.21543
52,-0.21543
53,-0.21543
54,-0.21543
55,-0.21543
56,-0.21543
57,-0.21543
58,-0.21543
59,-0.21543
60,-0.21543
61,-0.21543
62,-0.21543
63,-0.21543
64,-0.21543
65,-0.21543
66,-0.21543
67,-0.21543
68,-0.21543
69,-0.21543
70,-0.21543
71,-0.21543
72,-0.21543
73,-0.21543
74,-0.17246
75,3.2935
76,5.8858
77,0.44338999999999995
78,0.028048000000000003
79,-0.014919
80,4.4966
81,4.9979
82,-0.21543
83,-0.21543
84,-0.21543
85,-0.21543
86,-0.21543
87,-0.21543
88,-0.21543
89,-0.21543
90,-0.21543
91,-0.21543
92,-0.21543
93,-0.21543
94,-0.21543
95,-0.21543
