time,value
0,-1.1587
1,-1.1587
2,-1.1587
3,-1.1587
4,-1.1587
5,-1.1587
6,-1.1587
7,-1.1587
8,-1.1587
9,-1.1587
10,-1.1587
11,-1.1587
12,-1.1587
13,-1.1587
14,-1.1587
15,-1.1587
16,-1.1587
17,-1.1587
18,-1.1587
19,-1.1587
20,-1.1587
21,-1.1587
22,-1.1587
23,-1.1587
24,-1.1587
25,-1.1587
26,-1.1587
27,-1.1587
28,-1.1587
29,-1.1587
30,-1.1587
31,-0.9584299999999999
32,0.243
33,0.34312
34,0.74359
35,0.74359
36,0.64347
37,0.74359
38,0.74359
39,0.64347
40,0.74359
41,0.64347
42,0.74359
43,0.64347
44,0.64347
45,0.74359
46,0.34312
47,0.243
48,-0.2576
49,0.243
50,0.042759
51,-0.55795
52,-0.2576
53,-0.45783
54,-0.9584299999999999
55,-0.55795
56,-0.55795
57,-0.6580699999999999
58,-0.6580699999999999
59,-0.9584299999999999
60,-0.9584299999999999
61,-1.1587
62,-0.15748
63,2.1453
64,1.7448
65,1.0439
66,0.8437100000000001
67,0.8437100000000001
68,0.8437100000000001
69,0.8437100000000001
70,0.94383
71,1.2442
72,1.1441
73,1.1441
74,1.1441
75,1.0439
76,0.94383
77,0.8437100000000001
78,0.8437100000000001
79,0.74359
80,0.8437100000000001
81,0.74359
82,1.0439
83,1.1441
84,1.0439
85,1.0439
86,1.1441
87,1.0439
88,1.0439
89,0.8437100000000001
90,1.0439
91,1.0439
92,1.1441
93,1.2442
94,1.2442
95,1.1441
