time,value
0,-0.29335
1,-0.29335
2,-0.29335
3,-0.29335
4,-0.29335
5,-0.29335
6,-0.29335
7,-0.29335
8,-0.29335
9,-0.29335
10,-0.29335
11,-0.29335
12,-0.29335
13,-0.29335
14,-0.29335
15,-0.29335
16,-0.29335
17,-0.29335
18,-0.29335
19,-0.29335
20,-0.29335
21,-0.29335
22,-0.29335
23,-0.29335
24,-0.29335
25,-0.29335
26,-0.29335
27,-0.29335
28,-0.29335
29,-0.29335
30,-0.29335
31,-0.29335
32,-0.29335
33,-0.29335
34,-0.29335
35,-0.29335
36,-0.29335
37,-0.29335
38,-0.29335
39,-0.29335
40,-0.29335
41,-0.29335
42,-0.29335
43,-0.29335
44,-0.29335
45,-0.29335
46,-0.29335
47,-0.29335
48,-0.29335
49,-0.29335
50,-0.29335
51,-0.29335
52,-0.29335
53,-0.29335
54,-0.29335
55,-0.29335
56,-0.29335
57,-0.29335
58,-0.29335
59,-0.29335
60,-0.29335
61,-0.29335
62,-0.29335
63,-0.29335
64,-0.29335
65,-0.29335
66,-0.29335
67,-0.29335
68,-0.29335
69,-0.29335
70,-0.29335
71,-0.29335
72,-0.29335
73,-0.29335
74,-0.29335
75,-0.29335
76,-0.29335
77,3.3799
78,4.2545
79,4.4294
80,4.0796
81,4.6043
82,0.58123
83,0.2314
84,0.2314
85,0.40631999999999996
86,0.2314
87,0.2314
88,0.40631999999999996
89,0.2314
90,0.2314
91,0.2314
92,-0.29335
93,-0.29335
94,-0.29335
95,-0.29335
