time,value
0,-1.2443
1,-1.2443
2,-1.2443
3,-1.2443
4,-1.2443
5,-1.2443
6,-1.2443
7,-1.2443
8,-1.2443
9,-1.2443
10,-1.2443
11,-1.2443
12,-1.2443
13,-1.2443
14,-1.2443
15,-1.2443
16,-1.2443
17,-1.2443
18,-1.2443
19,-1.2443
20,-1.2443
21,-1.2443
22,-1.2443
23,-1.2443
24,-1.2443
25,-1.2443
26,-1.2443
27,-1.2443
28,-1.2443
29,-1.2443
30,-1.2443
31,-1.2443
32,-1.2443
33,-1.2443
34,0.83229
35,1.5245
36,1.0301
37,1.0301
38,0.7334
39,0.7334
40,0.63452
41,0.53563
42,0.63452
43,0.53563
44,0.33786
45,0.33786
46,0.14009000000000002
47,0.63452
48,0.83229
49,0.53563
50,0.53563
51,0.53563
52,0.53563
53,0.7334
54,0.7334
55,0.63452
56,0.63452
57,0.53563
58,0.53563
59,0.53563
60,0.53563
61,0.53563
62,0.53563
63,0.43673999999999996
64,0.53563
65,0.53563
66,0.53563
67,0.43673999999999996
68,0.53563
69,0.53563
70,0.43673999999999996
71,0.53563
72,0.53563
73,0.43673999999999996
74,0.83229
75,0.7334
76,0.53563
77,0.7334
78,1.7223
79,1.5245
80,1.5245
81,1.4256
82,1.4256
83,1.4256
84,1.5245
85,1.4256
86,1.4256
87,0.33786
88,0.041201999999999996
89,0.041201999999999996
90,0.83229
91,0.83229
92,0.63452
93,0.53563
94,-0.057683000000000005
95,-1.2443
