time,value
0,-0.7466
1,-0.7466
2,1.9313
3,-0.7466
4,-0.7466
5,1.1437
6,0.041022
7,-0.7466
8,-0.7466
9,1.7738
10,-0.7466
11,-0.7466
12,1.1437
13,0.041022
14,-0.7466
15,-0.7466
16,1.9313
17,-0.7466
18,-0.7466
19,0.5136
20,0.6711199999999999
21,-0.7466
22,-0.7466
23,1.6163
24,-0.43155
25,-0.7466
26,-0.7466
27,1.9313
28,-0.7466
29,-0.7466
30,0.5136
31,0.6711199999999999
32,-0.7466
33,-0.7466
34,1.7738
35,-0.7466
36,-0.7466
37,0.041022
38,1.1437
39,-0.7466
40,-0.7466
41,1.7738
42,-0.7466
43,-0.7466
44,0.8286399999999999
45,0.35607
46,-0.7466
47,-0.7466
48,1.9313
49,-0.7466
50,-0.7466
51,0.6711199999999999
52,0.5136
53,-0.7466
54,-0.7466
55,2.0888
56,-0.7466
57,-0.7466
58,-0.43155
59,1.6163
60,-0.7466
61,-0.7466
62,0.5136
63,0.6711199999999999
64,-0.7466
65,-0.7466
66,1.9313
67,-0.7466
68,-0.7466
69,-0.7466
70,1.9313
71,-0.7466
72,-0.7466
73,0.35607
74,0.8286399999999999
75,-0.7466
76,-0.7466
77,1.6163
78,-0.43155
79,-0.7466
80,-0.7466
81,1.7738
82,-0.7466
83,-0.7466
84,1.3012
85,-0.1165
86,-0.7466
87,-0.1165
88,1.3012
89,-0.7466
90,-0.7466
91,1.7738
92,-0.7466
93,-0.7466
94,1.4587
95,-0.27403
