time,value
0,-0.37227
1,-0.51435
2,-0.37578
3,-0.41598999999999997
4,-0.22749
5,-0.39876999999999996
6,-0.19064
7,-0.18500999999999998
8,-0.2186
9,-0.34945
10,-0.33887
11,-0.36483000000000004
12,-0.7529100000000001
13,-1.5366
14,-1.3207
15,-1.3282
16,-2.3593
17,-2.6869
18,-2.9695
19,-2.792
20,-2.8909
21,-2.8216
22,-2.6084
23,-2.7694
24,-2.4616
25,-2.0878
26,-1.9723
27,-1.5217
28,-1.2432
29,-0.59839
30,-0.12877
31,0.47973999999999994
32,0.7651600000000001
33,1.1633
34,1.3462
35,1.5288
36,1.9729
37,2.0509
38,2.1621
39,2.3693
40,2.23
41,2.3878
42,2.2349
43,2.1973
44,2.0627
45,2.1276
46,2.1088
47,2.0567
48,1.9881
49,2.0335
50,2.0545
51,2.0419
52,2.0126
53,2.017
54,1.8665
55,2.0959
56,2.0185
57,1.7956
58,1.8826
59,1.8374
60,1.7849
61,1.7065
62,1.5423
63,1.4175
64,1.5248
65,1.4584
66,1.5775
67,1.3224
68,1.3367
69,1.2934
70,1.2446
71,1.2341
72,1.2584
73,1.3278
74,1.2489
75,1.2882
76,1.2877
77,1.1532
78,1.3465
79,1.2744
80,1.1944
81,1.0958
82,1.14
83,1.1246
84,0.9244
85,0.90994
86,0.76582
87,0.4601
88,0.56897
89,0.22605
90,0.20245
91,0.21331999999999998
92,-0.07559199999999999
93,-0.10232999999999999
94,-0.29141999999999996
95,-0.5009899999999999
96,-0.28284000000000004
97,-0.52248
98,-1.3538
99,-1.4619
100,-1.3471
101,-1.7446
102,-2.0241
103,-2.1883
104,-2.1839
105,-2.1152
106,-2.0401
107,-2.0748
108,-1.7765
109,-1.3499
110,-1.1874
111,-1.121
112,-1.1137
113,-1.2265
114,-1.225
115,-1.1266
116,-0.97949
117,-0.86839
118,-0.6458
119,-0.43388000000000004
120,-0.40855
121,-0.49759
122,-0.31446999999999997
123,-0.22146999999999997
124,-0.06023099999999999
125,-0.098461
126,-0.17744000000000001
127,-0.21925999999999998
128,-0.1076
129,-0.050444
130,-0.086327
131,0.020227000000000002
132,0.022084
133,0.015818000000000002
134,0.06715499999999999
135,0.00013713
136,-0.0062797
137,0.022359999999999998
138,-0.11955
139,-0.10665999999999999
140,-0.02186
141,-0.14655
142,-0.15242999999999998
143,-0.16751
144,-0.19662000000000002
145,-0.22541
146,-0.19785999999999998
147,-0.19917
148,-0.12787
149,-0.1183
150,-0.11027
151,-0.073141
152,-0.12099000000000001
153,-0.10112
154,-0.084975
155,-0.085312
156,-0.005582
157,0.032826999999999995
158,0.062187
159,0.072508
160,0.033388
161,0.097832
162,0.11460999999999999
163,0.12189000000000001
164,0.091879
165,0.14340999999999998
166,0.11878
167,0.033147
168,0.054775
169,0.030233
170,-0.052242
171,0.044308999999999994
172,0.057540999999999995
173,-0.040371
174,0.011356999999999999
175,-0.05758099999999999
176,-0.061214
177,-0.06867000000000001
178,-0.096117
179,-0.10332000000000001
180,-0.075431
181,-0.1484
182,0.12505
183,-0.15057
184,0.068688
185,-0.008465899999999998
186,-0.020491
187,-0.081205
188,-0.082474
189,-0.010073
190,-0.038279
191,0.028125
192,0.034982
193,0.07497899999999999
194,0.23899
195,0.22779000000000002
196,0.092152
197,0.094391
198,0.01261
199,-0.20114
200,-0.047879000000000005
201,-0.16229000000000002
202,0.0031066999999999996
203,0.045954
204,-0.10812000000000001
205,0.020518
206,-0.008800299999999999
207,0.050270999999999996
208,0.20461
209,0.048839999999999995
210,-0.13421
211,0.0349
212,0.17638
213,-0.0013792
214,-0.032187
215,0.1079
216,-0.037275
217,-0.037224
218,-0.054241
219,-0.24456999999999998
220,-0.11132
221,-0.042174
222,-0.052063
223,-0.060717999999999994
224,-0.20567
225,-0.097193
226,-0.008640700000000001
227,-0.18958
228,-0.19027
229,-0.19971
230,-0.20122
231,-0.21354
232,-0.21946
233,-0.21361999999999998
234,-0.21555
235,-0.07950499999999999
236,-0.18835
237,-0.21625
238,-0.28286999999999995
239,-0.098526
240,-0.046463
241,-0.27591
242,0.068381
243,-0.070314
244,-0.061717999999999995
245,-0.25296
246,-0.25826
247,-0.27694
248,-0.070423
249,-0.08012000000000001
250,-0.077624
251,-0.28457
252,-0.081801
253,-0.05678300000000001
254,-0.081794
255,-0.067887
256,-0.10697000000000001
257,-0.062395000000000006
258,-0.10201
259,-0.24549
260,-0.071768
261,-0.062932
262,-0.0726
263,-0.06918400000000001
264,-0.071609
265,-0.09151000000000001
266,-0.3137
267,-0.23421999999999998
268,-0.2983
269,-0.087527
270,-0.08498
271,-0.17561
272,-0.29253
273,-0.19476
274,-0.17914000000000002
275,-0.28911
276,-0.29441
277,-0.18517
278,-0.30955
279,-0.11025
280,-0.22949
281,-0.31245
282,-0.32038
283,-0.32452
284,-0.17497000000000001
285,-0.25224
286,-0.16608
287,-0.10403
288,-0.1571
289,-0.1217
290,-0.13192
291,-0.13648
292,-0.16685999999999998
293,-0.12054000000000001
294,-0.11348
295,-0.3244
296,-0.33136
297,-0.33788
298,-0.33573000000000003
299,-0.13342
