time,value
0,-0.034801
1,-0.34726
2,-0.32323
3,-0.29919
4,-0.39533
5,-0.15498
6,0.037305
7,-0.058837
8,-0.13094
9,-0.32323
10,-0.32323
11,-0.20305
12,-0.082872
13,-0.32323
14,-0.3713
15,-0.17901
16,-0.034801
17,-0.034801
18,-0.082872
19,-0.32323
20,-0.32323
21,-0.3713
22,-0.32323
23,-0.22708000000000003
24,0.037305
25,-0.010766
26,-0.082872
27,-0.34726
28,7.8969
29,4.6521
30,1.2391
31,0.42186999999999997
32,0.34976
33,-0.010766
34,-0.10690999999999999
35,-0.25111999999999995
36,-0.058837
37,-0.25111999999999995
38,-0.39533
39,-0.34726
40,-0.34726
41,-0.39533
42,0.20555
43,1.5035
44,-0.20305
45,-0.34726
46,-0.32323
47,-0.39533
48,-0.20305
49,-0.082872
50,-0.34726
51,-0.22708000000000003
52,-0.034801
53,-0.082872
54,-0.27515
55,-0.058837
56,-0.32323
57,-0.41936999999999997
58,-0.34726
59,-0.34726
60,-0.10690999999999999
61,0.20555
62,-0.058837
63,-0.32323
64,-0.39533
65,-0.3713
66,-0.22708000000000003
67,-0.034801
68,-0.39533
69,-0.25111999999999995
70,-0.010766
71,-0.13094
72,-0.25111999999999995
73,0.06134
74,-0.25111999999999995
75,-0.29919
76,-0.25111999999999995
77,-0.25111999999999995
78,-0.17901
79,0.34976
80,0.085376
81,-0.20305
82,0.30169
83,-0.22708000000000003
84,-0.17901
85,1.0228
86,-0.20305
87,-0.058837
88,0.06134
89,-0.15498
90,-0.15498
91,-0.010766
92,-0.4434
93,-0.3713
94,-0.34726
95,-0.39533
