time,value
0,-0.9263
1,0.36246
2,-0.067123
3,-0.9263
4,-0.9263
5,1.5438
6,1.8659999999999999
7,-0.17452
8,-0.9263
9,-0.9263
10,1.1142
11,-0.9263
12,-0.9263
13,-0.9263
14,1.329
15,1.5438
16,-0.9263
17,0.040274000000000004
18,0.040274000000000004
19,-0.9263
20,0.14767
21,0.040274000000000004
22,0.040274000000000004
23,1.9734
24,-0.067123
25,-0.9263
26,-0.9263
27,1.0068
28,-0.60411
29,-0.9263
30,0.14767
31,2.0808
32,0.68465
33,-0.9263
34,-0.9263
35,1.0068
36,-0.9263
37,-0.9263
38,1.7586
39,0.46986000000000006
40,-0.49671000000000004
41,0.57726
42,-0.9263
43,-0.9263
44,0.68465
45,-0.17452
46,1.9734
47,0.36246
48,-0.9263
49,-0.9263
50,0.46986000000000006
51,-0.28192
52,-0.9263
53,-0.9263
54,1.2216
55,1.9734
56,-0.38931
57,-0.9263
58,-0.9263
59,1.0068
60,-0.9263
61,-0.9263
62,-0.067123
63,0.25506999999999996
64,1.9734
65,0.46986000000000006
66,-0.9263
67,-0.9263
68,-0.17452
69,0.36246
70,-0.9263
71,-0.9263
72,0.79205
73,1.9734
74,0.25506999999999996
75,-0.9263
76,-0.9263
77,1.1142
78,-0.9263
79,-0.9263
80,2.0808
81,1.2216
82,-0.9263
83,0.68465
84,-0.49671000000000004
85,-0.9263
86,0.68465
87,0.14767
88,1.9734
89,0.79205
90,-0.9263
91,-0.9263
92,-0.49671000000000004
93,0.79205
94,-0.9263
95,-0.49671000000000004
