time,value
0,0.8935799999999999
1,0.9580799999999999
2,0.055092999999999996
3,-1.1704
4,-1.1704
5,-1.1704
6,0.8290799999999999
7,1.0871
8,1.0226
9,0.8935799999999999
10,0.9580799999999999
11,-0.2029
12,-1.1704
13,-1.1704
14,-1.1704
15,1.1516
16,1.0226
17,1.0226
18,0.9580799999999999
19,-0.073905
20,-1.1704
21,-1.1704
22,-1.1704
23,0.8935799999999999
24,1.0226
25,0.9580799999999999
26,0.9580799999999999
27,-0.9768899999999999
28,-1.1704
29,-1.1704
30,-0.6543899999999999
31,1.1516
32,1.0226
33,0.9580799999999999
34,-0.9768899999999999
35,-1.1704
36,-1.1704
37,-0.7188899999999999
38,1.2161
39,1.0226
40,0.9580799999999999
41,0.31309000000000003
42,-1.1704
43,-1.1704
44,-1.1704
45,0.24859
46,1.1516
47,0.9580799999999999
48,0.9580799999999999
49,0.8935799999999999
50,-1.1704
51,-1.1704
52,-1.1704
53,-0.2674
54,1.1516
55,1.0226
56,1.0226
57,0.8935799999999999
58,0.70008
59,-1.1704
60,-1.1704
61,-1.1704
62,0.44209
63,1.0871
64,0.9580799999999999
65,0.8935799999999999
66,-0.7833899999999999
67,-1.1704
68,-1.1704
69,-0.2029
70,1.0871
71,0.9580799999999999
72,0.8935799999999999
73,0.37759000000000004
74,-1.1704
75,-1.1704
76,-1.1704
77,0.8290799999999999
78,1.0226
79,0.9580799999999999
80,-0.8478899999999999
81,-1.1704
82,-1.1704
83,-0.2029
84,1.0871
85,0.9580799999999999
86,0.76458
87,-1.1704
88,-1.1704
89,-1.1704
90,0.37759000000000004
91,1.0871
92,0.9580799999999999
93,0.63558
94,-1.1704
95,-1.1704
