time,value
0,-0.56965
1,-1.0331
2,-1.0331
3,0.26455
4,-0.47696000000000005
5,1.4695
6,1.3768
7,-0.013517
8,-1.0331
9,-1.0331
10,-0.66233
11,0.35724
12,-1.0331
13,-1.0331
14,0.079171
15,-0.29158
16,-1.0331
17,1.1914
18,1.2841
19,0.17185999999999998
20,-1.0331
21,-1.0331
22,-1.0331
23,0.6353
24,-0.8477100000000001
25,-1.0331
26,-0.56965
27,0.26455
28,-1.0331
29,1.5622
30,1.3768
31,0.079171
32,-1.0331
33,-1.0331
34,0.26455
35,-0.56965
36,-1.0331
37,-0.75502
38,0.54261
39,0.82068
40,1.5622
41,1.2841
42,-1.0331
43,-1.0331
44,-1.0331
45,0.26455
46,-0.47696000000000005
47,-1.0331
48,-0.47696000000000005
49,1.5622
50,1.4695
51,1.3768
52,-0.75502
53,-1.0331
54,-0.19889
55,-0.013517
56,-1.0331
57,-0.38427
58,1.5622
59,1.5622
60,0.26455
61,-0.47696000000000005
62,0.35724
63,-1.0331
64,-1.0331
65,0.9133600000000001
66,1.5622
67,1.5622
68,1.4695
69,1.3768
70,0.54261
71,-1.0331
72,-1.0331
73,0.35724
74,-0.8477100000000001
75,-1.0331
76,-0.47696000000000005
77,1.4695
78,1.4695
79,1.4695
80,0.54261
81,-1.0331
82,-1.0331
83,0.35724
84,-0.66233
85,-0.47696000000000005
86,1.6549
87,1.5622
88,1.4695
89,1.3768
90,0.26455
91,-1.0331
92,-1.0331
93,-0.66233
94,0.26455
95,-1.0331
