time,value
0,-0.21306
1,-0.19810999999999998
2,-0.21605
3,-0.19213
4,-0.22203
5,-0.19810999999999998
6,-0.21006999999999998
7,-0.21306
8,-0.20409000000000002
9,-0.21904
10,-0.19512000000000002
11,-0.22203
12,-0.19810999999999998
13,-0.20409000000000002
14,-0.21006999999999998
15,-0.19810999999999998
16,-0.21904
17,-0.19512000000000002
18,-0.21605
19,-0.20708000000000001
20,-0.19810999999999998
21,-0.22203
22,-0.19213
23,-0.22501999999999997
24,-0.19213
25,-0.2011
26,-0.21605
27,-0.18016
28,-0.20708000000000001
29,-0.2011
30,-0.19810999999999998
31,-0.2011
32,-0.17717
33,-0.20409000000000002
34,-0.18316
35,-0.19512000000000002
36,-0.20708000000000001
37,-0.19213
38,-0.21306
39,-0.18316
40,-0.20708000000000001
41,-0.20708000000000001
42,-0.19213
43,-0.21306
44,-0.19213
45,-0.21306
46,-0.19810999999999998
47,-0.2011
48,-0.21605
49,-0.18316
50,-0.21006999999999998
51,-0.20409000000000002
52,-0.2011
53,-0.21306
54,-0.18615
55,-0.21904
56,-0.20409000000000002
57,-0.19512000000000002
58,-0.21605
59,-0.18316
60,-0.21306
61,-0.18914
62,-0.20409000000000002
63,-0.21006999999999998
64,-0.18316
65,-0.21605
66,-0.19213
67,-0.20409000000000002
68,-0.19810999999999998
69,-0.18914
70,-0.21306
71,-0.17119
72,-0.19213
73,-0.18316
74,-0.18914
75,-0.19213
76,-0.18316
77,-0.21006999999999998
78,-0.17418
79,2.9955
80,5.7346
81,6.228
82,3.2736
83,-0.1383
84,-0.17119
85,-0.14428
86,-0.18914
87,-0.16222
88,-0.19512000000000002
89,-0.17717
90,-0.19512000000000002
91,-0.19512000000000002
92,-0.18615
93,-0.19512000000000002
94,-0.17418
95,-0.20708000000000001
