time,value
0,-0.11662
1,-0.11662
2,-0.11662
3,-0.11662
4,-0.11662
5,-0.11662
6,-0.11662
7,-0.11662
8,-0.11662
9,-0.11662
10,-0.11662
11,-0.11662
12,-0.11662
13,-0.11662
14,-0.11662
15,-0.11662
16,-0.11662
17,-0.11662
18,-0.11662
19,-0.11662
20,-0.11662
21,-0.11662
22,-0.11662
23,-0.11662
24,-0.11662
25,-0.11662
26,-0.11662
27,-0.11662
28,-0.11662
29,-0.11662
30,-0.11662
31,-0.11662
32,-0.11662
33,-0.11662
34,-0.11662
35,-0.11662
36,-0.11662
37,-0.11662
38,9.5821
39,1.3805
40,-0.11662
41,-0.11662
42,-0.11662
43,-0.11662
44,-0.11662
45,-0.11662
46,-0.11662
47,-0.11662
48,-0.11662
49,-0.11662
50,-0.11662
51,-0.11662
52,-0.11662
53,-0.11662
54,-0.11662
55,-0.11662
56,-0.11662
57,-0.11662
58,-0.11662
59,-0.11662
60,-0.11662
61,-0.11662
62,-0.11662
63,-0.11662
64,-0.11662
65,-0.11662
66,-0.11662
67,-0.11662
68,-0.11662
69,-0.11662
70,-0.11662
71,-0.11662
72,-0.11662
73,-0.11662
74,-0.11662
75,-0.11662
76,-0.11662
77,-0.11662
78,-0.11662
79,-0.11662
80,-0.11662
81,-0.11662
82,-0.11662
83,-0.11662
84,-0.11662
85,-0.11662
86,-0.11662
87,-0.11662
88,-0.11662
89,-0.11662
90,-0.11662
91,-0.11662
92,-0.11662
93,-0.11662
94,-0.11662
95,-0.11662
