time,value
0,-0.9116299999999999
1,-0.9116299999999999
2,-0.9116299999999999
3,-0.9116299999999999
4,-0.9116299999999999
5,-0.9116299999999999
6,-0.9116299999999999
7,-0.9116299999999999
8,-0.9116299999999999
9,-0.9116299999999999
10,-0.9116299999999999
11,-0.9116299999999999
12,-0.9116299999999999
13,-0.9116299999999999
14,-0.9116299999999999
15,-0.9116299999999999
16,-0.9116299999999999
17,-0.9116299999999999
18,-0.9116299999999999
19,-0.9116299999999999
20,-0.9116299999999999
21,-0.9116299999999999
22,-0.9116299999999999
23,-0.9116299999999999
24,-0.060302
25,1.8977
26,1.4721
27,1.2167
28,1.1316
29,0.87616
30,0.87616
31,1.1316
32,0.79102
33,0.79102
34,1.3869999999999998
35,1.0464
36,0.96129
37,1.3018
38,0.36536
39,-0.9116299999999999
40,-0.9116299999999999
41,-0.9116299999999999
42,-0.9116299999999999
43,-0.9116299999999999
44,-0.9116299999999999
45,-0.9116299999999999
46,0.02483
47,1.8977
48,1.4721
49,0.96129
50,1.3018
51,1.2167
52,0.87616
53,0.79102
54,0.10995999999999999
55,-0.9116299999999999
56,-0.9116299999999999
57,-0.9116299999999999
58,-0.9116299999999999
59,-0.9116299999999999
60,-0.9116299999999999
61,-0.9116299999999999
62,-0.9116299999999999
63,-0.9116299999999999
64,-0.9116299999999999
65,-0.9116299999999999
66,0.02483
67,1.8977
68,1.3869999999999998
69,0.96129
70,1.0464
71,1.1316
72,0.79102
73,0.96129
74,1.2167
75,0.87616
76,0.79102
77,1.0464
78,1.0464
79,0.79102
80,0.87616
81,1.1316
82,0.87616
83,0.79102
84,1.0464
85,1.0464
86,0.79102
87,1.2167
88,-0.9116299999999999
89,-0.9116299999999999
90,-0.9116299999999999
91,-0.9116299999999999
92,-0.9116299999999999
93,-0.9116299999999999
94,-0.9116299999999999
95,-0.9116299999999999
