time,value
0,-0.47967
1,-0.5956600000000001
2,-0.5956600000000001
3,-0.5956600000000001
4,-0.47967
5,-0.5956600000000001
6,-0.5956600000000001
7,-0.5956600000000001
8,-0.47967
9,-0.5956600000000001
10,-0.5956600000000001
11,-0.5956600000000001
12,-0.47967
13,-0.5956600000000001
14,-0.5956600000000001
15,-0.5956600000000001
16,-0.47967
17,-0.5956600000000001
18,-0.5956600000000001
19,-0.5956600000000001
20,-0.47967
21,-0.5956600000000001
22,-0.5956600000000001
23,-0.5956600000000001
24,-0.47967
25,-0.5956600000000001
26,-0.5956600000000001
27,-0.47967
28,-0.5956600000000001
29,-0.5956600000000001
30,-0.5956600000000001
31,-0.47967
32,-0.5956600000000001
33,-0.5956600000000001
34,-0.5956600000000001
35,-0.47967
36,-0.5956600000000001
37,-0.5956600000000001
38,-0.5956600000000001
39,-0.47967
40,-0.5956600000000001
41,-0.5956600000000001
42,-0.5956600000000001
43,-0.47967
44,-0.5956600000000001
45,0.56424
46,1.0282
47,1.2602
48,-0.5956600000000001
49,-0.47967
50,-0.47967
51,-0.5956600000000001
52,-0.47967
53,-0.47967
54,-0.5956600000000001
55,-0.47967
56,-0.5956600000000001
57,-0.47967
58,-0.47967
59,-0.5956600000000001
60,-0.47967
61,-0.47967
62,-0.47967
63,-0.5956600000000001
64,-0.5956600000000001
65,-0.47967
66,-0.5956600000000001
67,1.7241
68,2.0721
69,1.3762
70,1.9561
71,1.2602
72,-0.24769000000000002
73,2.1881
74,0.21627
75,-0.1317
76,2.0721
77,2.1881
78,1.9561
79,2.0721
80,-0.36368
81,0.9122100000000001
82,1.9561
83,1.9561
84,2.1881
85,1.9561
86,2.1881
87,2.0721
88,1.9561
89,1.9561
90,-0.1317
91,-0.5956600000000001
92,-0.47967
93,-0.5956600000000001
94,-0.47967
95,-0.5956600000000001
