time,value
0,-0.16994
1,-0.16994
2,-0.16994
3,-0.16994
4,-0.16994
5,-0.16994
6,-0.16994
7,-0.16994
8,-0.16994
9,-0.16994
10,-0.16994
11,-0.16994
12,-0.16994
13,-0.16994
14,-0.16994
15,-0.16994
16,-0.16994
17,-0.16994
18,-0.16994
19,-0.16994
20,-0.16994
21,-0.16994
22,-0.16994
23,-0.16994
24,-0.16994
25,-0.16994
26,-0.16994
27,-0.16994
28,-0.16994
29,-0.16994
30,-0.16994
31,-0.16994
32,-0.16994
33,-0.16994
34,-0.16994
35,-0.16994
36,-0.16994
37,-0.16994
38,-0.16994
39,-0.16994
40,-0.16994
41,-0.16994
42,-0.16994
43,-0.16994
44,-0.16994
45,-0.16994
46,-0.16994
47,-0.16994
48,-0.16994
49,-0.16994
50,-0.16994
51,-0.16994
52,-0.16994
53,-0.16994
54,-0.16994
55,-0.16994
56,-0.16994
57,-0.16994
58,-0.16994
59,-0.16994
60,-0.16994
61,-0.16994
62,-0.16994
63,-0.16994
64,-0.16994
65,-0.16994
66,-0.16994
67,-0.16994
68,-0.16994
69,-0.16994
70,-0.16994
71,-0.16994
72,-0.16994
73,-0.16994
74,-0.16994
75,-0.16994
76,-0.16994
77,-0.16994
78,-0.16994
79,-0.16994
80,-0.16994
81,-0.16994
82,-0.16994
83,-0.16994
84,-0.16994
85,0.026813999999999998
86,2.8961
87,3.4208
88,0.10879000000000001
89,0.12519
90,0.043210000000000005
91,8.5036
92,-0.16994
93,-0.16994
94,-0.16994
95,-0.16994
