time,value
0,-0.06754500000000001
1,-0.37632
2,-0.06754500000000001
3,-0.37632
4,-0.37632
5,-0.37632
6,-0.37632
7,-0.37632
8,-0.37632
9,-0.37632
10,-0.37632
11,-0.37632
12,-0.37632
13,-0.37632
14,-0.37632
15,-0.37632
16,-0.37632
17,-0.37632
18,-0.37632
19,-0.37632
20,-0.37632
21,-0.37632
22,-0.37632
23,-0.37632
24,-0.37632
25,-0.37632
26,-0.37632
27,-0.37632
28,-0.37632
29,-0.37632
30,-0.37632
31,-0.37632
32,-0.37632
33,-0.37632
34,-0.37632
35,-0.37632
36,-0.37632
37,-0.37632
38,-0.37632
39,-0.37632
40,-0.37632
41,-0.37632
42,0.55001
43,2.7114
44,3.3289999999999997
45,-0.37632
46,-0.37632
47,-0.06754500000000001
48,-0.37632
49,-0.37632
50,-0.37632
51,-0.06754500000000001
52,-0.37632
53,-0.37632
54,-0.37632
55,-0.06754500000000001
56,-0.37632
57,-0.37632
58,-0.37632
59,-0.06754500000000001
60,-0.37632
61,-0.37632
62,-0.37632
63,-0.37632
64,-0.37632
65,-0.37632
66,-0.37632
67,-0.37632
68,-0.37632
69,-0.37632
70,-0.37632
71,-0.37632
72,-0.37632
73,-0.37632
74,-0.37632
75,-0.37632
76,-0.37632
77,-0.37632
78,-0.37632
79,-0.37632
80,-0.37632
81,-0.37632
82,-0.37632
83,-0.37632
84,-0.37632
85,1.7851
86,3.0202
87,3.0202
88,3.0202
89,3.0202
90,2.7114
91,3.0202
92,3.0202
93,0.24123000000000003
94,-0.37632
95,-0.06754500000000001
