time,value
0,-0.14437
1,-0.14437
2,-0.14437
3,-0.14437
4,-0.14437
5,-0.14437
6,-0.14437
7,-0.14437
8,-0.14437
9,-0.14437
10,-0.14437
11,-0.14437
12,-0.14437
13,-0.14437
14,-0.14437
15,-0.14437
16,-0.14437
17,-0.14437
18,-0.14437
19,-0.14437
20,-0.14437
21,-0.14437
22,-0.14437
23,-0.14437
24,-0.14437
25,-0.14437
26,6.0923
27,-0.14437
28,-0.14437
29,-0.14437
30,-0.14437
31,-0.14437
32,-0.14437
33,-0.14437
34,-0.14437
35,-0.14437
36,-0.14437
37,-0.14437
38,-0.14437
39,-0.14437
40,7.4783
41,-0.14437
42,-0.14437
43,-0.14437
44,-0.14437
45,-0.14437
46,-0.14437
47,-0.14437
48,-0.14437
49,-0.14437
50,-0.14437
51,-0.14437
52,-0.14437
53,-0.14437
54,-0.14437
55,-0.14437
56,-0.14437
57,-0.14437
58,-0.14437
59,-0.14437
60,-0.14437
61,-0.14437
62,-0.14437
63,-0.14437
64,-0.14437
65,-0.14437
66,-0.14437
67,-0.14437
68,-0.14437
69,-0.14437
70,-0.14437
71,-0.14437
72,-0.14437
73,-0.14437
74,-0.14437
75,-0.14437
76,-0.14437
77,-0.14437
78,-0.14437
79,-0.14437
80,-0.14437
81,-0.14437
82,-0.14437
83,-0.14437
84,-0.14437
85,-0.14437
86,-0.14437
87,-0.14437
88,-0.14437
89,-0.14437
90,-0.14437
91,-0.14437
92,-0.14437
93,-0.14437
94,-0.14437
95,-0.14437
