time,value
0,-0.84309
1,-0.84309
2,-0.84309
3,-0.84309
4,-0.84309
5,-0.84309
6,-0.84309
7,-0.84309
8,-0.84309
9,-0.84309
10,-0.84309
11,-0.84309
12,-0.84309
13,-0.84309
14,-0.84309
15,-0.84309
16,-0.84309
17,-0.84309
18,-0.84309
19,-0.84309
20,-0.84309
21,-0.84309
22,-0.84309
23,-0.84309
24,-0.84309
25,-0.84309
26,-0.84309
27,-0.84309
28,1.7234
29,1.9984
30,1.9067
31,1.3568
32,1.1734
33,0.80681
34,1.1734
35,1.0818
36,0.71514
37,0.99013
38,1.1734
39,0.16518
40,-0.84309
41,-0.84309
42,-0.65977
43,-0.84309
44,-0.84309
45,-0.84309
46,-0.84309
47,-0.84309
48,-0.84309
49,-0.84309
50,-0.84309
51,-0.84309
52,-0.84309
53,-0.84309
54,-0.84309
55,-0.84309
56,-0.84309
57,-0.84309
58,-0.84309
59,-0.84309
60,-0.84309
61,-0.84309
62,-0.84309
63,-0.20146
64,2.0901
65,1.6318
66,1.0818
67,1.2651
68,1.1734
69,0.80681
70,1.1734
71,1.1734
72,0.8984700000000001
73,0.99013
74,1.1734
75,1.1734
76,0.8984700000000001
77,1.0818
78,1.1734
79,1.0818
80,0.8984700000000001
81,1.0818
82,1.1734
83,0.8984700000000001
84,0.8984700000000001
85,1.1734
86,1.0818
87,0.8984700000000001
88,0.8984700000000001
89,1.0818
90,1.1734
91,1.2651
92,-0.1098
93,-0.84309
94,-0.84309
95,-0.84309
