time,value
0,-0.93104
1,1.5779
2,-0.93104
3,-0.93104
4,1.7347
5,-0.93104
6,-0.93104
7,1.5779
8,-0.93104
9,-0.61743
10,1.4211
11,-0.93104
12,-0.46062
13,1.1074
14,-0.93104
15,-0.30380999999999997
16,1.1074
17,-0.93104
18,-0.30380999999999997
19,1.1074
20,-0.93104
21,-0.30380999999999997
22,0.9506399999999999
23,-0.93104
24,-0.30380999999999997
25,1.1074
26,-0.93104
27,-0.46062
28,1.1074
29,-0.93104
30,-0.61743
31,1.4211
32,-0.93104
33,-0.93104
34,1.5779
35,-0.93104
36,-0.46062
37,1.1074
38,-0.93104
39,1.4211
40,-0.61743
41,-0.14701
42,0.79383
43,-0.93104
44,0.79383
45,0.009800399999999999
46,-0.30380999999999997
47,0.9506399999999999
48,-0.93104
49,1.5779
50,-0.93104
51,-0.46062
52,1.4211
53,-0.93104
54,1.4211
55,-0.93104
56,1.1074
57,-0.46062
58,-0.93104
59,1.2643
60,-0.93104
61,1.1074
62,-0.46062
63,-0.93104
64,1.5779
65,-0.93104
66,-0.30380999999999997
67,0.9506399999999999
68,-0.93104
69,0.63703
70,0.009800399999999999
71,-0.93104
72,1.4211
73,-0.93104
74,-0.93104
75,1.7347
76,-0.93104
77,-0.93104
78,1.4211
79,-0.93104
80,-0.14701
81,0.9506399999999999
82,-0.93104
83,1.2643
84,-0.46062
85,-0.93104
86,1.7347
87,-0.93104
88,0.79383
89,-0.14701
90,-0.93104
91,1.7347
92,-0.93104
93,0.009800399999999999
94,0.63703
95,-0.93104
