time,value
0,-0.29451
1,-0.29451
2,-0.29451
3,-0.29451
4,-0.29451
5,-0.29451
6,-0.29451
7,-0.29451
8,-0.29451
9,-0.29451
10,-0.29451
11,-0.29451
12,-0.29451
13,-0.29451
14,-0.29451
15,-0.29451
16,-0.29451
17,-0.29451
18,-0.29451
19,-0.29451
20,-0.29451
21,-0.29451
22,-0.29451
23,-0.29451
24,-0.29451
25,-0.29451
26,-0.29451
27,-0.29451
28,-0.29451
29,-0.29451
30,-0.29451
31,-0.29451
32,-0.29451
33,-0.29451
34,-0.29451
35,-0.29451
36,-0.29451
37,-0.29451
38,-0.29451
39,-0.29451
40,-0.29451
41,-0.29451
42,-0.29451
43,-0.29451
44,-0.29451
45,-0.29451
46,-0.29451
47,-0.29451
48,-0.29451
49,-0.29451
50,-0.29451
51,0.030827999999999998
52,0.12528
53,-0.29451
54,-0.29451
55,-0.29451
56,-0.29451
57,-0.063624
58,5.4985
59,2.9483
60,3.4101
61,2.1927
62,-0.29451
63,-0.29451
64,-0.29451
65,-0.29451
66,-0.29451
67,3.2527
68,3.2107
69,3.0953
70,1.3322
71,-0.29451
72,-0.29451
73,-0.29451
74,-0.29451
75,-0.29451
76,-0.29451
77,-0.29451
78,-0.29451
79,-0.29451
80,-0.29451
81,-0.29451
82,-0.29451
83,-0.29451
84,-0.29451
85,-0.29451
86,-0.29451
87,-0.29451
88,-0.29451
89,-0.29451
90,-0.29451
91,-0.29451
92,-0.29451
93,-0.29451
94,-0.29451
95,-0.29451
