time,value
0,0.75352
1,0.75352
2,0.75352
3,-1.3133
4,0.75352
5,0.75352
6,0.75352
7,0.75352
8,0.75352
9,0.75352
10,0.75352
11,0.75352
12,-1.3133
13,0.75352
14,0.75352
15,0.75352
16,0.75352
17,0.75352
18,0.75352
19,-1.3133
20,0.75352
21,-1.3133
22,0.75352
23,0.75352
24,-1.3133
25,0.75352
26,-1.3133
27,-1.3133
28,0.75352
29,-1.3133
30,0.75352
31,0.75352
32,-1.3133
33,0.75352
34,-1.3133
35,0.75352
36,-1.3133
37,0.75352
38,-1.3133
39,0.75352
40,-1.3133
41,0.75352
42,-1.3133
43,0.75352
44,-1.3133
45,0.75352
46,-1.3133
47,0.75352
48,-1.3133
49,0.75352
50,0.75352
51,0.75352
52,0.75352
53,0.75352
54,0.75352
55,0.75352
56,0.75352
57,0.75352
58,0.75352
59,0.75352
60,-1.3133
61,0.75352
62,0.75352
63,0.75352
64,-1.3133
65,-1.3133
66,0.75352
67,-1.3133
68,0.75352
69,-1.3133
70,0.75352
71,0.75352
72,-1.3133
73,0.75352
74,-1.3133
75,0.75352
76,-1.3133
77,0.75352
78,-1.3133
79,0.75352
80,-1.3133
81,0.75352
82,-1.3133
83,0.75352
84,-1.3133
85,0.75352
86,-1.3133
87,0.75352
88,-1.3133
89,-1.3133
90,0.75352
91,-1.3133
92,0.75352
93,-1.3133
94,-1.3133
95,0.75352
