time,value
0,-0.31129
1,-0.31129
2,-0.31129
3,-0.47025
4,-0.31129
5,-0.31129
6,-0.31129
7,-0.47025
8,-0.31129
9,-0.31129
10,-0.31129
11,-0.47025
12,-0.31129
13,-0.31129
14,-0.31129
15,-0.47025
16,-0.31129
17,-0.31129
18,-0.31129
19,-0.47025
20,-0.31129
21,-0.31129
22,-0.31129
23,-0.31129
24,-0.47025
25,-0.31129
26,-0.31129
27,-0.31129
28,-0.47025
29,-0.31129
30,-0.31129
31,-0.31129
32,-0.47025
33,-0.31129
34,-0.31129
35,-0.31129
36,-0.47025
37,-0.31129
38,-0.31129
39,-0.31129
40,-0.47025
41,-0.31129
42,-0.31129
43,-0.31129
44,-0.47025
45,-0.31129
46,-0.31129
47,-0.31129
48,-0.47025
49,-0.31129
50,-0.31129
51,-0.31129
52,-0.31129
53,-0.47025
54,-0.31129
55,-0.31129
56,-0.31129
57,-0.31129
58,-0.47025
59,-0.31129
60,-0.31129
61,-0.31129
62,-0.47025
63,-0.31129
64,-0.31129
65,-0.31129
66,-0.47025
67,-0.31129
68,-0.31129
69,-0.31129
70,-0.47025
71,-0.31129
72,-0.31129
73,-0.15233
74,-0.31129
75,-0.31129
76,-0.31129
77,-0.31129
78,-0.31129
79,-0.31129
80,0.64245
81,3.1857
82,3.0268
83,2.8678
84,3.1857
85,3.0268
86,3.0268
87,2.8678
88,3.0268
89,3.0268
90,1.2783
91,-0.47025
92,-0.31129
93,-0.31129
94,-0.31129
95,-0.31129
