time,value
0,-1.218
1,-1.2694
2,-1.1152
3,-1.4236
4,-1.4749
5,-1.4749
6,-1.4749
7,-1.4236
8,-1.4749
9,-1.4749
10,-1.4749
11,-1.4749
12,-1.3208
13,-1.3722
14,-1.3722
15,-1.3208
16,-1.4749
17,-1.4749
18,-1.4749
19,-1.4749
20,-1.3722
21,-1.4749
22,-1.4749
23,-1.5263
24,-1.4749
25,-1.4749
26,-1.4749
27,-1.4749
28,-1.4749
29,-1.4749
30,0.2725
31,0.5808800000000001
32,0.5808800000000001
33,0.63227
34,0.63227
35,0.63227
36,0.5808800000000001
37,0.5808800000000001
38,0.63227
39,0.5808800000000001
40,0.73506
41,0.5808800000000001
42,0.63227
43,0.5808800000000001
44,0.63227
45,0.5808800000000001
46,0.63227
47,0.5808800000000001
48,0.73506
49,0.83786
50,0.83786
51,0.83786
52,0.83786
53,0.73506
54,0.63227
55,0.5808800000000001
56,0.73506
57,0.63227
58,0.5808800000000001
59,0.63227
60,0.5808800000000001
61,0.63227
62,0.5808800000000001
63,0.63227
64,0.5808800000000001
65,0.5808800000000001
66,0.5808800000000001
67,0.63227
68,0.5808800000000001
69,0.5808800000000001
70,0.63227
71,0.5808800000000001
72,0.5808800000000001
73,0.5808800000000001
74,0.63227
75,0.5808800000000001
76,0.83786
77,0.83786
78,0.83786
79,0.83786
80,0.83786
81,0.83786
82,0.83786
83,0.83786
84,0.88925
85,0.83786
86,0.88925
87,0.83786
88,0.88925
89,0.83786
90,0.88925
91,0.88925
92,0.83786
93,0.88925
94,0.015526
95,-1.4749
