time,value
0,-0.16719
1,-0.16719
2,-0.16719
3,-0.16719
4,-0.16719
5,-0.16719
6,-0.16719
7,-0.16719
8,-0.16719
9,-0.16719
10,-0.16719
11,-0.16719
12,-0.16719
13,-0.16719
14,-0.16719
15,-0.16719
16,-0.16719
17,-0.16719
18,-0.16719
19,-0.16719
20,-0.16719
21,-0.16719
22,-0.16719
23,-0.16719
24,-0.16719
25,-0.16719
26,-0.16719
27,-0.16719
28,-0.16719
29,-0.16719
30,-0.16719
31,-0.16719
32,-0.16719
33,-0.16719
34,-0.16719
35,-0.16719
36,-0.16719
37,-0.16719
38,-0.16719
39,-0.16719
40,-0.16719
41,-0.16719
42,-0.16719
43,-0.16719
44,-0.16719
45,-0.16719
46,-0.16719
47,-0.16719
48,-0.16719
49,-0.16719
50,-0.16719
51,-0.16719
52,-0.16719
53,-0.16719
54,-0.16719
55,-0.16719
56,-0.16719
57,-0.16719
58,-0.16719
59,-0.16719
60,-0.16719
61,-0.16719
62,-0.16719
63,-0.16719
64,-0.16719
65,-0.16719
66,-0.16719
67,-0.16719
68,-0.16719
69,-0.16719
70,-0.16719
71,-0.16719
72,-0.16719
73,0.030962
74,1.6314
75,7.4237
76,5.8841
77,0.24436
78,-0.16719
79,-0.16719
80,-0.16719
81,-0.16719
82,-0.16719
83,-0.16719
84,-0.16719
85,-0.16719
86,-0.16719
87,-0.16719
88,-0.16719
89,-0.16719
90,-0.16719
91,-0.16719
92,-0.16719
93,-0.16719
94,-0.16719
95,-0.16719
