time,value
0,-0.19843
1,-0.19843
2,-0.19843
3,-0.19843
4,-0.19843
5,-0.19843
6,-0.19843
7,-0.19843
8,-0.19843
9,-0.19843
10,-0.19843
11,-0.19843
12,-0.19843
13,-0.19843
14,-0.19843
15,-0.19843
16,-0.19843
17,-0.19843
18,-0.19843
19,-0.19843
20,-0.19843
21,-0.19843
22,-0.19843
23,-0.19843
24,-0.19843
25,-0.19843
26,-0.19843
27,-0.19843
28,-0.19843
29,-0.19843
30,-0.19843
31,-0.19843
32,0.58407
33,6.5751
34,1.6845
35,0.009424600000000002
36,-0.0028019000000000004
37,2.5892
38,6.196000000000001
39,-0.17397
40,-0.19843
41,-0.19843
42,-0.19843
43,-0.19843
44,-0.19843
45,-0.19843
46,-0.19843
47,-0.19843
48,-0.19843
49,-0.19843
50,-0.19843
51,-0.19843
52,-0.19843
53,-0.19843
54,-0.19843
55,-0.19843
56,-0.19843
57,-0.19843
58,-0.19843
59,-0.19843
60,-0.19843
61,-0.19843
62,-0.19843
63,-0.19843
64,-0.19843
65,-0.19843
66,-0.19843
67,-0.19843
68,-0.19843
69,-0.19843
70,-0.19843
71,-0.19843
72,-0.19843
73,-0.19843
74,-0.19843
75,-0.19843
76,-0.19843
77,-0.19843
78,-0.19843
79,-0.19843
80,-0.19843
81,-0.19843
82,-0.19843
83,-0.19843
84,-0.19843
85,-0.19843
86,-0.19843
87,-0.19843
88,-0.19843
89,-0.19843
90,-0.19843
91,-0.19843
92,-0.19843
93,-0.19843
94,-0.19843
95,-0.19843
