[<text>
<title>equity oil co &lt;eqty&gt; 4th qtr loss</title>
<dateline>    salt lake city, march 12 -
    </dateline>shr loss nine cts vs profit 11 cts
    net loss 1,102,592 vs profit 1,364,763
    revs 2,836,508 vs 5,547,121
    year
    shr loss six cts vs profit 32 cts
    net loss 789,300 vs profit 3,953,822
    revs 11.7 mln vs 21.1 mln
    note:  per share figures reflect five pct stock dividend
paid december 1986.
 reuter
</text>]