time,value
0,0.8256100000000001
1,0.8256100000000001
2,0.8256100000000001
3,0.8256100000000001
4,0.0062588999999999995
5,-1.4686
6,-1.5232
7,-1.4686
8,-1.4686
9,-1.4686
10,-1.4686
11,-1.5232
12,-1.3593
13,-1.4686
14,-1.4686
15,-1.5232
16,-1.4686
17,-1.4686
18,-1.4686
19,-1.5232
20,-1.3593
21,-1.4686
22,-1.4686
23,-1.4686
24,-1.5232
25,-1.4686
26,-1.4686
27,-1.4686
28,-1.5232
29,-1.4686
30,-1.4686
31,-1.4686
32,-1.5232
33,-1.4686
34,-1.1408
35,0.8256100000000001
36,0.8256100000000001
37,0.8256100000000001
38,0.38861999999999997
39,0.60711
40,0.77098
41,0.60711
42,0.5524899999999999
43,0.5524899999999999
44,0.60711
45,0.5524899999999999
46,0.60711
47,0.5524899999999999
48,0.60711
49,0.5524899999999999
50,0.5524899999999999
51,0.60711
52,0.5524899999999999
53,0.60711
54,0.5524899999999999
55,0.5524899999999999
56,0.71636
57,0.60711
58,0.5524899999999999
59,0.60711
60,0.5524899999999999
61,0.60711
62,0.5524899999999999
63,0.60711
64,0.5524899999999999
65,0.5524899999999999
66,0.5524899999999999
67,0.5524899999999999
68,0.60711
69,0.5524899999999999
70,0.5524899999999999
71,0.5524899999999999
72,0.60711
73,0.5524899999999999
74,0.5524899999999999
75,0.60711
76,0.71636
77,0.8256100000000001
78,0.8256100000000001
79,0.77098
80,0.8256100000000001
81,0.8256100000000001
82,0.77098
83,0.8256100000000001
84,0.77098
85,0.8256100000000001
86,0.8256100000000001
87,0.8256100000000001
88,0.8256100000000001
89,0.77098
90,0.8256100000000001
91,0.8256100000000001
92,0.8256100000000001
93,0.77098
94,0.8256100000000001
95,0.8256100000000001
