time,value
0,-0.16063
1,-0.16063
2,-0.16063
3,-0.16063
4,-0.16063
5,-0.16063
6,-0.16063
7,-0.16063
8,-0.16063
9,-0.16063
10,-0.16063
11,-0.16063
12,-0.16063
13,-0.16063
14,-0.16063
15,-0.16063
16,-0.16063
17,-0.16063
18,-0.16063
19,-0.16063
20,-0.16063
21,-0.16063
22,-0.16063
23,-0.16063
24,-0.16063
25,-0.16063
26,-0.16063
27,-0.16063
28,-0.16063
29,-0.16063
30,-0.16063
31,-0.16063
32,-0.16063
33,-0.16063
34,-0.16063
35,-0.16063
36,-0.16063
37,-0.16063
38,-0.16063
39,-0.16063
40,-0.16063
41,-0.16063
42,-0.16063
43,-0.16063
44,-0.16063
45,-0.16063
46,-0.16063
47,-0.16063
48,-0.16063
49,-0.16063
50,-0.16063
51,-0.16063
52,-0.16063
53,3.2371
54,8.4642
55,3.2371
56,-0.16063
57,-0.16063
58,-0.16063
59,-0.16063
60,-0.16063
61,-0.16063
62,-0.16063
63,-0.16063
64,-0.16063
65,-0.16063
66,-0.16063
67,-0.16063
68,-0.16063
69,-0.16063
70,-0.16063
71,-0.16063
72,-0.16063
73,-0.16063
74,-0.16063
75,-0.16063
76,-0.16063
77,-0.16063
78,-0.16063
79,-0.16063
80,-0.16063
81,-0.16063
82,-0.16063
83,-0.16063
84,-0.16063
85,-0.16063
86,-0.16063
87,-0.16063
88,-0.16063
89,-0.16063
90,-0.16063
91,-0.16063
92,-0.16063
93,-0.16063
94,-0.16063
95,-0.16063
