time,value
0,-0.82285
1,-0.82285
2,1.2026
3,-0.82285
4,-0.82285
5,1.2026
6,-0.82285
7,-0.82285
8,-0.82285
9,1.2026
10,-0.82285
11,-0.82285
12,-0.82285
13,1.2026
14,-0.82285
15,-0.82285
16,1.2026
17,-0.82285
18,-0.82285
19,-0.82285
20,1.2026
21,-0.82285
22,-0.82285
23,1.2026
24,-0.82285
25,-0.82285
26,1.2026
27,-0.82285
28,-0.82285
29,1.2026
30,-0.82285
31,1.2026
32,-0.82285
33,1.2026
34,-0.82285
35,1.2026
36,-0.82285
37,1.2026
38,-0.82285
39,1.2026
40,-0.82285
41,1.2026
42,-0.82285
43,1.2026
44,-0.82285
45,1.2026
46,-0.82285
47,1.2026
48,-0.82285
49,1.2026
50,-0.82285
51,-0.82285
52,1.2026
53,-0.82285
54,1.2026
55,-0.82285
56,1.2026
57,-0.82285
58,1.2026
59,-0.82285
60,1.2026
61,-0.82285
62,1.2026
63,-0.82285
64,-0.82285
65,1.2026
66,-0.82285
67,1.2026
68,-0.82285
69,1.2026
70,-0.82285
71,1.2026
72,-0.82285
73,1.2026
74,-0.82285
75,-0.82285
76,1.2026
77,-0.82285
78,1.2026
79,-0.82285
80,1.2026
81,-0.82285
82,1.2026
83,-0.82285
84,1.2026
85,-0.82285
86,1.2026
87,-0.82285
88,-0.82285
89,1.2026
90,-0.82285
91,-0.82285
92,1.2026
93,-0.82285
94,-0.82285
95,1.2026
