time,value
0,1.3466
1,1.3315
2,1.3266
3,1.2982
4,1.2292
5,1.1595
6,1.085
7,0.98731
8,0.8804
9,0.77357
10,0.66184
11,0.5554399999999999
12,0.44167
13,0.33004
14,0.20895999999999998
15,0.10189
16,-0.014159999999999999
17,-0.12165
18,-0.22518000000000002
19,-0.33393
20,-0.44193000000000005
21,-0.56104
22,-0.67683
23,-0.79747
24,-0.9052600000000001
25,-1.025
26,-1.1415
27,-1.2621
28,-1.3803
29,-1.4767
30,-1.5662
31,-1.4734
32,-1.3834
33,-1.2807
34,-1.2015
35,-1.1888
36,-1.1028
37,-1.0635
38,-0.98692
39,-0.9842799999999999
40,-0.89354
41,-0.8885
42,-0.82606
43,-0.77757
44,-0.7483
45,-0.74847
46,-0.64965
47,-0.6452
48,-0.60425
49,-0.55457
50,-0.50638
51,-0.53145
52,-0.56067
53,-0.5362899999999999
54,-0.48023999999999994
55,-0.414
56,-0.3945
57,-0.37396
58,-0.33612
59,-0.30279
60,-0.25358
61,-0.21648
62,-0.18128
63,-0.13441
64,-0.093788
65,-0.10555
66,-0.1487
67,-0.18062
68,-0.15947999999999998
69,-0.13380999999999998
70,-0.10477
71,-0.06854099999999999
72,-0.012258
73,0.021445
74,0.066505
75,0.09227
76,0.079613
77,0.039125
78,0.031764
79,0.065855
80,0.10057
81,0.12628
82,0.12293
83,0.14094
84,0.18589
85,0.21935
86,0.23644
87,0.24428000000000002
88,0.29498
89,0.33424
90,0.39588
91,0.46657
92,0.5374
93,0.61998
94,0.6935899999999999
95,0.7628699999999999
96,0.79797
97,0.7067
98,0.6089600000000001
99,0.5101399999999999
100,0.41057
101,0.32733
102,0.2327
103,0.12775999999999998
104,0.07999400000000001
105,-0.03028
106,-0.12415999999999999
107,-0.19648
108,-0.29906
109,-0.3356
110,-0.41703
111,-0.5182100000000001
112,-0.61335
113,-0.70641
114,-0.76965
115,-0.8661700000000001
116,-0.9552200000000001
117,-1.0121
118,-1.0875
119,-1.0590000000000002
120,-1.0065
121,-0.9229299999999999
122,-0.8412
123,-0.75617
124,-0.67396
125,-0.57738
126,-0.48553
127,-0.41899
128,-0.32497
129,-0.21695
130,-0.11615999999999999
131,-0.022084
132,0.08301900000000001
133,0.15202000000000002
134,0.24067
135,0.2475
136,0.14623
137,0.067301
138,-0.036437
139,-0.06429800000000001
140,-0.11032
141,-0.21101999999999999
142,-0.27174
143,-0.3676
144,-0.36485
145,-0.37432
146,-0.48071
147,-0.55318
148,-0.59816
149,-0.67661
150,-0.7568199999999999
151,-0.73332
152,-0.7417600000000001
153,-0.6411399999999999
154,-0.53573
155,-0.41513
156,-0.28743
157,-0.1538
158,-0.044095999999999996
159,0.047198000000000004
160,0.077192
161,0.08188200000000001
162,0.096455
163,0.17565
164,0.27257
165,0.36611
166,0.46963999999999995
167,0.54493
168,0.60793
169,0.66071
170,0.61114
171,0.6633
172,0.77274
173,0.86303
174,0.9789200000000001
175,1.0596
176,1.1337
177,1.2016
178,1.1609
179,1.1749
180,1.2292
181,1.3152
182,1.3986
183,1.4795
184,1.4982
185,1.5282
186,1.6391
187,1.7257
188,1.8130000000000002
189,1.8621
190,1.9633
191,2.0766
192,2.1746
193,2.2803
194,2.3927
195,2.5035
196,2.6065
197,2.5214
198,2.3925
199,2.2613
200,2.1294
201,2.0367
202,1.9357
203,1.8758
204,1.7632
205,1.6851
206,1.6475
207,1.5429
208,1.4106
209,1.4158
210,1.4074
211,1.2942
212,1.2333
213,1.1198
214,1.1402
215,1.1599
216,1.0538
217,0.9875799999999999
218,0.87405
219,0.82105
220,0.6996600000000001
221,0.62936
222,0.64749
223,0.67084
224,0.6200399999999999
225,0.52604
226,0.46061
227,0.37949
228,0.26733
229,0.22962
230,0.15780999999999998
231,0.045409
232,0.0032156999999999997
233,-0.10761
234,-0.11073
235,-0.10488
236,-0.10786
237,-0.20951999999999998
238,-0.29425
239,-0.32848
240,-0.43293000000000004
241,-0.5412
242,-0.58699
243,-0.6933600000000001
244,-0.7918
245,-0.8538899999999999
246,-0.9393100000000001
247,-0.98014
248,-1.091
249,-1.1788
250,-1.2759
251,-1.3847
252,-1.4089
253,-1.5073
254,-1.6113
255,-1.7153
256,-1.7345
257,-1.8346
258,-1.9425
259,-2.0297
260,-2.1305
261,-2.2388
262,-2.2682
263,-2.251
264,-2.2071
265,-2.1615
266,-2.1029
267,-2.0423
268,-1.9739
269,-1.9086
270,-1.8508
271,-1.7773
272,-1.7093
273,-1.6366
274,-1.5527
275,-1.4598
276,-1.3649
277,-1.2756
278,-1.1809
279,-1.0859
280,-0.99803
281,-0.9091899999999999
282,-0.85616
283,-0.93458
284,-0.9081799999999999
285,-0.92361
286,-1.0004
287,-1.1025
288,-1.0599
289,-1.0967
290,-1.0803
291,-1.0972
292,-1.1606
293,-1.1299
294,-1.1683
295,-1.1259
296,-1.0685
297,-0.9941399999999999
298,-0.89551
299,-0.7933399999999999
300,-0.72848
301,-0.62343
302,-0.53305
303,-0.40093
304,-0.35547
305,-0.25233
306,-0.15105
307,-0.065109
308,0.044577
309,0.1258
310,0.24511999999999998
311,0.28311
312,0.40858
313,0.50442
314,0.5687800000000001
315,0.6554399999999999
316,0.7707
317,0.79552
318,0.90102
319,0.97578
320,1.1056
321,1.1977
322,1.3218
323,1.4077
324,1.5129
325,1.6221
326,1.7411
327,1.8511
328,1.7714
329,1.6737
330,1.5764
331,1.5149
332,1.3844
333,1.3623
334,1.2836
335,1.187
336,1.2528
337,1.1859
338,1.0821
339,1.0475
340,0.9774299999999999
341,1.0199
342,1.0394
343,0.9674
344,0.86567
345,0.85441
346,0.75216
347,0.79579
348,0.8293299999999999
349,0.8234600000000001
350,0.74437
351,0.7300399999999999
352,0.64039
353,0.55835
354,0.5716600000000001
355,0.47381999999999996
356,0.40297
357,0.37519
358,0.44023
359,0.52589
360,0.46763000000000005
361,0.37935
362,0.40499
363,0.33509
364,0.24047
365,0.27236
366,0.21143
367,0.12555999999999998
368,0.035184
369,0.12772
370,0.16833
371,0.27154
372,0.19339
373,0.17362
374,0.081976
375,0.076695
376,-0.0073807000000000005
377,-0.047458
378,-0.045758
379,-0.12022000000000001
380,-0.19799
381,-0.28295
382,-0.37285
383,-0.33379000000000003
384,-0.41383000000000003
385,-0.50273
386,-0.57796
387,-0.6604
388,-0.71558
389,-0.8135899999999999
390,-0.89807
391,-0.96196
392,-1.0322
393,-1.0631
394,-1.1679
395,-1.2962
396,-1.4257
397,-1.574
398,-1.5766
399,-1.4663
400,-1.3488
401,-1.2926
402,-1.1867
403,-1.073
404,-0.96701
405,-0.84801
406,-0.7361300000000001
407,-0.62663
408,-0.506
409,-0.40023000000000003
410,-0.28536
411,-0.1653
412,-0.061989999999999996
413,0.058658
414,0.16130999999999998
415,0.28094
416,0.39524000000000004
417,0.47941999999999996
418,0.58844
419,0.69326
420,0.8125899999999999
421,0.9247
422,1.0033
423,1.1001
424,1.1455
425,1.2155
426,1.3125
