time,value
0,-0.30174
1,-0.30174
2,-0.30174
3,-0.30174
4,-0.30174
5,-0.30174
6,-0.30174
7,-0.30174
8,-0.30174
9,-0.30174
10,-0.30174
11,-0.30174
12,-0.30174
13,-0.30174
14,-0.30174
15,-0.30174
16,-0.30174
17,-0.30174
18,-0.30174
19,-0.30174
20,-0.30174
21,-0.30174
22,-0.30174
23,-0.30174
24,-0.30174
25,-0.30174
26,-0.30174
27,-0.30174
28,-0.30174
29,-0.30174
30,-0.30174
31,-0.30174
32,-0.30174
33,-0.30174
34,-0.30174
35,-0.30174
36,-0.30174
37,-0.30174
38,-0.30174
39,-0.30174
40,-0.30174
41,-0.30174
42,-0.30174
43,-0.30174
44,-0.30174
45,-0.30174
46,-0.30174
47,-0.30174
48,-0.30174
49,-0.30174
50,3.3984
51,3.3504
52,-0.13835999999999998
53,-0.30174
54,-0.30174
55,-0.30174
56,-0.30174
57,-0.30174
58,-0.30174
59,-0.30174
60,-0.30174
61,-0.30174
62,-0.30174
63,-0.30174
64,-0.30174
65,-0.30174
66,-0.30174
67,-0.30174
68,-0.30174
69,0.61129
70,0.053861
71,0.053861
72,2.5815
73,2.1202
74,-0.30174
75,-0.30174
76,-0.30174
77,1.3705
78,5.5993
79,3.8405
80,2.2643
81,-0.061469
82,-0.30174
83,-0.30174
84,-0.30174
85,-0.30174
86,-0.30174
87,-0.30174
88,-0.30174
89,-0.30174
90,-0.30174
91,-0.30174
92,-0.30174
93,-0.30174
94,-0.30174
95,-0.30174
