{
  "about": {
    "problemID": "SEMI_155_pokerhand_problem",
    "problemName": "SEMI 155 pokerhand problem",
    "problemDescription": "SEMI-SUPERVISED VERSION OF: **Author**:   \n**Source**: Unknown -   \n**Please cite**:   \n\nNormalized version of the pokerhand data set.\n\nAutomated file upload of pokerhand-normalized.arff",
    "problemSchemaVersion": "4.0.0",
    "problemVersion": "4.0.0",
    "taskKeywords": [
      "semiSupervised",
      "classification",
      "multiClass",
      "tabular"
    ]
  },
  "inputs": {
    "data": [
      {
        "datasetID": "SEMI_155_pokerhand_dataset",
        "targets": [
          {
            "targetIndex": 0,
            "resID": "learningData",
            "colIndex": 11,
            "colName": "class"
          }
        ]
      }
    ],
    "dataSplits": {
      "method": "holdOut",
      "testSize": 0.2,
      "stratified": true,
      "numRepeats": 0,
      "randomSeed": 42,
      "splitsFile": "dataSplits.csv",
      "datasetViewMaps": {
        "train": [
          {
            "from": "SEMI_155_pokerhand_dataset",
            "to": "SEMI_155_pokerhand_dataset_TRAIN"
          }
        ],
        "test": [
          {
            "from": "SEMI_155_pokerhand_dataset",
            "to": "SEMI_155_pokerhand_dataset_TEST"
          }
        ],
        "score": [
          {
            "from": "SEMI_155_pokerhand_dataset",
            "to": "SEMI_155_pokerhand_dataset_SCORE"
          }
        ]
      }
    },
    "performanceMetrics": [
      {
        "metric": "f1Macro"
      }
    ]
  },
  "expectedOutputs": {
    "predictionsFile": "predictions.csv"
  }
}