time,value
0,-0.31134
1,-0.20556
2,0.71765
3,-0.32095999999999997
4,-0.35943
5,-0.36904000000000003
6,-0.36904000000000003
7,-0.28249
8,-0.23440999999999998
9,-0.24403000000000002
10,-0.24403000000000002
11,-0.25364000000000003
12,-0.34981
13,-0.35943
14,-0.23440999999999998
15,-0.32095999999999997
16,-0.36904000000000003
17,-0.36904000000000003
18,-0.36904000000000003
19,-0.35943
20,-0.32095999999999997
21,-0.24403000000000002
22,-0.23440999999999998
23,-0.24403000000000002
24,-0.24403000000000002
25,-0.30173
26,-0.36904000000000003
27,-0.28249
28,-0.25364000000000003
29,-0.36904000000000003
30,-0.35943
31,-0.35943
32,-0.35943
33,-0.35943
34,-0.25364000000000003
35,-0.17670999999999998
36,-0.24403000000000002
37,2.5352
38,4.8913
39,2.8141
40,2.7853
41,-0.20556
42,-0.33058000000000004
43,-0.34019
44,-0.32095999999999997
45,-0.34981
46,-0.34019
47,-0.10939000000000002
48,5.8723
49,1.7563
50,-0.13824
51,-0.26326
52,-0.33058000000000004
53,-0.31134
54,-0.22479000000000002
55,-0.31134
56,-0.34981
57,-0.34019
58,-0.34981
59,-0.34019
60,1.16
61,-0.05169
62,1.4869999999999999
63,0.23681
64,-0.14786
65,-0.33058000000000004
66,-0.21518
67,-0.30173
68,-0.34981
69,-0.34981
70,-0.34981
71,-0.25364000000000003
72,-0.24403000000000002
73,-0.24403000000000002
74,-0.20556
75,-0.19594
76,-0.21518
77,-0.21518
78,-0.23440999999999998
79,-0.32095999999999997
80,-0.32095999999999997
81,-0.32095999999999997
82,-0.32095999999999997
83,-0.22479000000000002
84,-0.18633
85,-0.30173
86,-0.23440999999999998
87,-0.17670999999999998
88,-0.19594
89,-0.12862
90,-0.19594
91,-0.30173
92,-0.29211
93,-0.34019
94,-0.34019
95,-0.29211
