time,value
0,-0.68415
1,0.8612299999999999
2,1.4407
3,-0.68415
4,-0.68415
5,-0.68415
6,-0.68415
7,2.2134
8,0.088538
9,-0.68415
10,-0.68415
11,-0.68415
12,1.0544
13,1.2476
14,-0.68415
15,-0.68415
16,-0.68415
17,-0.10464000000000001
18,2.2134
19,-0.29780999999999996
20,-0.68415
21,-0.68415
22,-0.68415
23,1.2476
24,1.2476
25,-0.68415
26,-0.68415
27,-0.68415
28,0.47488
29,1.8271
30,-0.68415
31,-0.68415
32,-0.68415
33,-0.29780999999999996
34,2.2134
35,-0.29780999999999996
36,-0.68415
37,-0.68415
38,-0.68415
39,1.2476
40,1.0544
41,-0.68415
42,-0.68415
43,-0.68415
44,0.088538
45,2.0203
46,-0.68415
47,-0.68415
48,-0.68415
49,-0.68415
50,1.8271
51,0.47488
52,-0.68415
53,-0.68415
54,-0.68415
55,0.47488
56,1.6339
57,-0.68415
58,-0.68415
59,-0.68415
60,-0.68415
61,2.2134
62,0.088538
63,-0.68415
64,-0.68415
65,-0.68415
66,0.8612299999999999
67,1.2476
68,-0.68415
69,-0.68415
70,-0.68415
71,-0.29780999999999996
72,2.2134
73,-0.10464000000000001
74,-0.68415
75,-0.68415
76,-0.68415
77,1.0544
78,1.4407
79,-0.68415
80,-0.68415
81,-0.68415
82,-0.68415
83,2.2134
84,-0.10464000000000001
85,-0.68415
86,-0.68415
87,-0.68415
88,1.0544
89,1.2476
90,-0.68415
91,-0.68415
92,-0.68415
93,-0.68415
94,2.2134
95,-0.29780999999999996
