[<text>
<title>sand technology systems &lt;sndcf&gt; 2nd qtr net</title>
<dateline>    toronto, march 19 - </dateline>ended january 31
    shr nil vs nil
    net profit 351,000 vs loss 243,000
    sales 7,050,000 vs 7,012,000
    avg shrs 106,780,000 vs 93,666,000
    six mths
    shr loss one ct vs loss one ct
    net loss 999,000 vs loss 563,000
    sales 10.6 mln vs 13.0 mln
    avg shrs 106,641,000 vs 92,986,000
 reuter
</text>]