time,value
0,-0.16587000000000002
1,-0.19013
2,-0.1962
3,-0.1689
4,-0.20226
5,-0.1871
6,-0.18103
7,-0.19923
8,-0.17497000000000001
9,-0.18407
10,-0.20226
11,-0.15980999999999998
12,-0.19923
13,-0.19316
14,-0.15374000000000002
15,-0.20226
16,-0.18407
17,-0.16284
18,-0.19923
19,-0.17497000000000001
20,-0.17497000000000001
21,-0.20226
22,-0.16587000000000002
23,-0.19013
24,-0.1962
25,-0.15677
26,-0.1689
27,-0.1689
28,-0.15980999999999998
29,-0.19316
30,-0.15677
31,-0.15677
32,-0.19316
33,-0.15374000000000002
34,-0.17800000000000002
35,-0.1962
36,-0.15070999999999998
37,-0.19013
38,-0.19316
39,-0.15677
40,-0.19923
41,-0.19013
42,-0.17497000000000001
43,-0.20226
44,-0.18103
45,-0.19013
46,-0.20529
47,-0.17497000000000001
48,-0.19013
49,-0.19316
50,-0.1689
51,-0.1962
52,-0.18407
53,-0.17194
54,-0.1962
55,-0.17194
56,-0.17800000000000002
57,-0.20226
58,-0.15677
59,-0.18407
60,-0.19923
61,-0.15374000000000002
62,-0.19923
63,-0.19316
64,-0.16587000000000002
65,-0.20831999999999998
66,-0.18103
67,-0.17800000000000002
68,-0.18407
69,-0.1689
70,-0.19316
71,-0.1962
72,-0.1689
73,-0.19923
74,-0.18407
75,-0.17497000000000001
76,6.075
77,6.1659
78,4.1402
79,-0.05366900000000001
80,-0.12342
81,-0.15374000000000002
82,-0.14768
83,-0.13251
84,-0.15980999999999998
85,-0.16587000000000002
86,-0.12947999999999998
87,-0.15980999999999998
88,-0.18407
89,-0.13555
90,-0.15980999999999998
91,-0.17497000000000001
92,-0.14160999999999999
93,-0.17194
94,-0.1871
95,-0.15677
