time,value
0,-0.94158
1,-0.77205
2,-0.9824299999999999
3,-1.0497
4,-1.094
5,-1.1658
6,-1.102
7,-1.1297
8,-1.0509
9,-1.0937
10,-1.0203
11,-0.9506
12,-0.83136
13,-0.72925
14,-0.64156
15,-0.53655
16,-0.38537
17,-0.22626999999999997
18,-0.13949
19,-0.10995
20,-0.042448
21,0.024987
22,0.087272
23,0.10085
24,0.15972
25,0.183
26,0.21006
27,0.18062
28,0.27291
29,0.4071
30,0.40718000000000004
31,0.5947
32,0.41983000000000004
33,-0.019903
34,-0.13077
35,0.7621100000000001
36,0.32276
37,1.0277
38,1.3905
39,1.3456
40,1.5651
41,0.5081399999999999
42,0.088063
43,-0.26004
44,-0.16735
45,-0.1732
46,-0.19068
47,-0.011726
48,0.23376
49,0.30005
50,0.33165
51,0.26835
52,0.3625
53,0.68105
54,0.6935
55,0.61224
56,0.57004
57,0.56504
58,0.5997899999999999
59,0.8598100000000001
60,0.93432
61,0.81607
62,0.74726
63,0.64995
64,0.8186100000000001
65,0.92871
66,0.94514
67,0.75993
68,0.79832
69,0.8981899999999999
70,0.84525
71,0.76193
72,0.87759
73,0.98026
74,0.9269299999999999
75,0.90017
76,0.89436
77,0.89899
78,0.93604
79,0.89285
80,0.8568899999999999
81,0.81639
82,0.83268
83,0.8456100000000001
84,0.83288
85,0.85767
86,0.87045
87,0.89956
88,0.8929299999999999
89,0.88886
90,0.92279
91,0.9107299999999999
92,0.99354
93,0.9960600000000001
94,1.0159
95,1.022
96,1.0112
97,1.0156
98,0.95085
99,0.9670700000000001
100,0.9738399999999999
101,1.0685
102,0.9922799999999999
103,0.98267
104,0.9587100000000001
105,1.0443
106,1.1118
107,1.1021
108,1.1407
109,1.1293
110,1.1359
111,1.0934
112,1.1061
113,1.073
114,1.0471
115,1.1401
116,1.1265
117,1.1657
118,1.2027
119,1.1456
120,1.1834
121,1.2265
122,1.2523
123,1.2429
124,1.2853
125,1.3193
126,1.3238
127,1.3428
128,1.2953
129,1.317
130,1.3327
131,1.3507
132,1.3703
133,1.4022
134,1.4082
135,1.3874
136,1.3736
137,1.3818
138,1.3985
139,1.5197
140,1.6037
141,1.4885
142,1.3437
143,0.9363299999999999
144,0.9729700000000001
145,0.82601
146,0.8954200000000001
147,0.8591
148,0.93214
149,1.0882
150,1.1945
151,1.3030000000000002
152,1.1623
153,1.4822
154,1.5004
155,0.72849
156,0.48285
157,0.746
158,0.51
159,0.43168
160,0.483
161,0.64107
162,0.9018700000000001
163,1.5181
164,2.4635
165,1.7784
166,2.0653
167,1.6969
168,2.1035
169,2.9476
170,0.95135
171,-1.7594
172,-0.8534
173,-0.53689
174,0.10789000000000001
175,0.042199
176,-0.7195600000000001
177,-0.90995
178,-0.72092
179,-1.0893
180,-1.2933
181,-1.0224
182,-0.8608899999999999
183,-0.76618
184,-0.55785
185,-0.37763
186,-0.27269
187,-0.39793
188,-0.47089
189,-0.4541
190,-0.31932
191,-0.49018
192,-0.66004
193,-0.71205
194,-0.7351
195,-0.7500100000000001
196,-0.75297
197,-0.7195199999999999
198,-0.8592700000000001
199,-0.6906399999999999
200,-0.68138
201,-0.78705
202,-0.68471
203,-0.69877
204,-0.78269
205,-0.73307
206,-0.80298
207,-0.8145399999999999
208,-0.85667
209,-0.8893700000000001
210,-0.80785
211,-0.81818
212,-0.88982
213,-0.8942
214,-0.9746600000000001
215,-1.0183
216,-0.9801700000000001
217,-0.9445
218,-0.91774
219,-0.9616899999999999
220,-0.96619
221,-0.87382
222,-0.7819699999999999
223,-0.79504
224,-0.9472299999999999
225,-0.93973
226,-0.84885
227,-0.78673
228,-0.9123899999999999
229,-0.9489299999999999
230,-0.93865
231,-0.9699
232,-0.91015
233,-0.97885
234,-1.0239
235,-1.0435
236,-1.004
237,-1.0087
238,-0.99531
239,-1.0321
240,-1.1126
241,-1.084
242,-1.0193
243,-1.1217
244,-1.0961
245,-1.1036
246,-1.0711
247,-1.1259
248,-1.0277
249,-1.1079999999999999
250,-1.0832
251,-1.0528
252,-1.0807
253,-1.0418
254,-1.1197
255,-1.0918
256,-1.0557
257,-1.1535
258,-1.1471
259,-1.0555
260,-1.1639
261,-1.0783
262,-1.0524
263,-1.0492
264,-1.1546
265,-1.0669
266,-1.1691
267,-1.0932
268,-1.147
269,-1.0406
270,-1.053
271,-1.0684
272,-1.0917
273,-1.1705
274,-1.1753
275,-1.0914
276,-1.0755
277,-1.0848
278,-1.0932
279,-1.0856
280,-1.0889
281,-1.0892
282,-1.19
283,-1.1884
284,-1.0975
285,-1.0941
286,-1.099
287,-1.0853
288,-1.0839
289,-1.1039
290,-1.0879
291,-1.0943
292,-1.0976
293,-1.1963
294,-1.0947
295,-1.0969
296,-1.2027
297,-1.1028
298,-1.0994
299,-1.095
