time,value
0,-0.6580600000000001
1,1.5079
2,1.8689
3,0.42491999999999996
4,-0.6580600000000001
5,-0.6580600000000001
6,-0.6580600000000001
7,-0.6580600000000001
8,-0.6580600000000001
9,-0.6580600000000001
10,-0.6580600000000001
11,2.0494
12,1.6884
13,-0.11657000000000001
14,-0.6580600000000001
15,-0.6580600000000001
16,-0.6580600000000001
17,-0.6580600000000001
18,-0.6580600000000001
19,-0.6580600000000001
20,-0.6580600000000001
21,1.6884
22,1.6884
23,0.42491999999999996
24,-0.6580600000000001
25,-0.6580600000000001
26,-0.6580600000000001
27,-0.6580600000000001
28,-0.6580600000000001
29,-0.6580600000000001
30,-0.6580600000000001
31,1.3274
32,1.8689
33,0.96641
34,-0.6580600000000001
35,-0.6580600000000001
36,-0.6580600000000001
37,-0.6580600000000001
38,0.063926
39,1.8689
40,1.6884
41,-0.6580600000000001
42,-0.6580600000000001
43,-0.6580600000000001
44,-0.6580600000000001
45,-0.6580600000000001
46,-0.6580600000000001
47,0.24441999999999997
48,1.8689
49,1.6884
50,-0.6580600000000001
51,-0.6580600000000001
52,-0.6580600000000001
53,-0.6580600000000001
54,-0.6580600000000001
55,-0.6580600000000001
56,-0.6580600000000001
57,-0.11657000000000001
58,1.8689
59,1.6884
60,0.063926
61,-0.6580600000000001
62,-0.6580600000000001
63,-0.6580600000000001
64,-0.6580600000000001
65,-0.6580600000000001
66,-0.6580600000000001
67,-0.6580600000000001
68,0.78592
69,1.8689
70,1.6884
71,0.063926
72,-0.6580600000000001
73,-0.6580600000000001
74,-0.6580600000000001
75,-0.6580600000000001
76,-0.6580600000000001
77,-0.6580600000000001
78,-0.6580600000000001
79,1.8689
80,1.6884
81,1.8689
82,-0.11657000000000001
83,-0.6580600000000001
84,-0.6580600000000001
85,-0.6580600000000001
86,-0.6580600000000001
87,-0.6580600000000001
88,-0.6580600000000001
89,0.78592
90,1.8689
91,1.6884
92,0.42491999999999996
93,-0.6580600000000001
94,-0.6580600000000001
95,-0.6580600000000001
