time,value
0,-0.75378
1,-0.75378
2,-0.75378
3,-0.75378
4,1.4879
5,1.757
6,-0.3951
7,-0.75378
8,-0.75378
9,-0.75378
10,1.6673
11,0.23258
12,-0.75378
13,-0.75378
14,1.1293
15,1.6673
16,-0.21577
17,-0.75378
18,-0.75378
19,-0.75378
20,-0.75378
21,-0.75378
22,-0.75378
23,-0.75378
24,0.23258
25,1.757
26,1.6673
27,0.59125
28,-0.75378
29,-0.75378
30,-0.75378
31,-0.75378
32,-0.75378
33,-0.75378
34,-0.1261
35,1.757
36,0.41192
37,-0.75378
38,-0.75378
39,0.32225
40,1.4879
41,-0.75378
42,-0.75378
43,1.0396
44,1.757
45,0.053241
46,-0.75378
47,-0.75378
48,-0.75378
49,-0.75378
50,-0.75378
51,-0.75378
52,1.2189
53,1.6673
54,0.053241
55,-0.75378
56,-0.75378
57,-0.75378
58,-0.75378
59,0.41192
60,1.5776
61,0.14290999999999998
62,1.6673
63,1.3983
64,-0.75378
65,-0.75378
66,-0.75378
67,-0.75378
68,-0.75378
69,-0.75378
70,-0.75378
71,-0.75378
72,1.757
73,1.757
74,-0.57444
75,-0.75378
76,-0.75378
77,-0.75378
78,0.77059
79,1.8466
80,1.757
81,-0.75378
82,-0.75378
83,-0.75378
84,-0.75378
85,-0.75378
86,0.77059
87,1.8466
88,0.23258
89,-0.75378
90,-0.75378
91,0.23258
92,1.5776
93,-0.3951
94,1.0396
95,1.6673
