[<text>
<title>baruch-foster corp &lt;bfo&gt; 4th qtr loss</title>
<dateline>    dallas, march 31 -
    </dateline>shr loss 92 cts vs profit one ct
    net loss 2,487,439 vs profit 48,709
    revs 1,788,141 vs 4,167,070
    year
    shr loss 1.50 dlrs vs profit 48 cts
    net loss 4,073,724 vs profit 1,309,412
    revs 8,193,455 vs 15.7 mln
    note: 1986 year net includes 3,095,305 dlr writedown of oil
properties and reserves.
 reuter
</text>]