time,value
0,-1.0988
1,-1.0988
2,0.68367
3,1.0656
4,0.6200100000000001
5,-1.0988
6,-1.0988
7,-0.080237
8,1.1929
9,0.9383100000000001
10,-1.0988
11,-1.0988
12,-0.39853
13,1.2566
14,1.0656
15,-1.0988
16,-1.0988
17,-0.84415
18,1.3203
19,1.0656
20,-0.78049
21,-1.0988
22,-1.0988
23,1.1929
24,1.0656
25,-0.65317
26,-1.0988
27,-1.0988
28,1.1293
29,1.0656
30,-0.39853
31,-1.0988
32,-1.0988
33,0.87465
34,1.0656
35,0.23806
36,-1.0988
37,-1.0988
38,0.23806
39,1.1293
40,1.0656
41,-0.97146
42,-1.0988
43,-0.84415
44,1.2566
45,1.0656
46,0.047081
47,-1.0988
48,-0.84415
49,1.2566
50,1.0656
51,1.0656
52,0.87465
53,-1.0988
54,-1.0988
55,-0.5895100000000001
56,1.2566
57,1.002
58,-0.84415
59,-1.0988
60,-0.97146
61,1.2566
62,1.0656
63,0.42904
64,-1.0988
65,-1.0988
66,0.1744
67,1.1293
68,1.002
69,-1.0988
70,-1.0988
71,-0.39853
72,1.1929
73,1.0656
74,1.002
75,-1.0988
76,-1.0988
77,1.3203
78,1.0656
79,1.0656
80,-0.016578
81,-1.0988
82,-1.0988
83,0.30172
84,1.1293
85,0.42904
86,-1.0988
87,-1.0988
88,0.11074
89,1.1293
90,0.9383100000000001
91,-1.0988
92,-1.0988
93,-0.39853
94,1.1929
95,1.1293
