time,value
0,-0.35873
1,-0.35873
2,-0.35873
3,-0.35873
4,-0.35873
5,-0.35873
6,-0.35873
7,-0.35873
8,-0.35873
9,-0.35873
10,-0.35873
11,-0.35873
12,-0.35873
13,-0.35873
14,-0.35873
15,-0.35873
16,-0.35873
17,-0.35873
18,-0.35873
19,-0.35873
20,-0.35873
21,-0.35873
22,-0.35873
23,-0.35873
24,-0.35873
25,-0.35873
26,-0.35873
27,-0.35873
28,-0.35873
29,-0.35873
30,-0.35873
31,-0.35873
32,-0.35873
33,-0.35873
34,-0.16899
35,-0.12587
36,-0.35873
37,-0.35873
38,-0.35873
39,-0.35873
40,-0.35873
41,-0.35873
42,-0.35873
43,-0.35873
44,-0.35873
45,-0.35873
46,-0.35873
47,-0.35873
48,-0.35873
49,-0.013744999999999999
50,2.5995
51,1.2023
52,-0.065493
53,-0.35873
54,-0.35873
55,-0.35873
56,-0.35873
57,-0.35873
58,-0.35873
59,-0.35873
60,-0.35873
61,-0.35873
62,-0.35873
63,-0.35873
64,-0.35873
65,0.29674
66,4.9023
67,3.3757
68,3.1687
69,3.2895
70,0.40024
71,1.2627
72,3.6
73,0.7366
74,0.18462
75,2.0303
76,1.0212
77,-0.07411799999999999
78,-0.35873
79,-0.35873
80,-0.35873
81,-0.35873
82,-0.35873
83,-0.35873
84,-0.35873
85,-0.35873
86,-0.35873
87,-0.35873
88,-0.35873
89,-0.35873
90,-0.35873
91,-0.35873
92,-0.35873
93,-0.35873
94,-0.35873
95,-0.35873
