time,value
0,0.083369
1,0.12742
2,0.11729
3,0.085342
4,0.093251
5,0.12437000000000001
6,0.12330999999999999
7,0.097676
8,0.090651
9,0.099625
10,0.096985
11,0.077885
12,0.051486000000000004
13,0.03081
14,0.025879000000000003
15,0.035961
16,0.06098200000000001
17,0.088872
18,0.096603
19,0.095801
20,0.1002
21,0.08684299999999999
22,0.063694
23,0.06072
24,0.062749
25,0.062597
26,0.08232300000000001
27,0.1025
28,0.09651900000000001
29,0.09078
30,0.10181
31,0.096819
32,0.056111
33,0.011297
34,-0.0031197
35,-0.0012412
36,-0.005974899999999999
37,-0.0033121
38,0.0031475
39,-0.015313
40,-0.03608
41,-0.034189
42,-0.04565
43,-0.06915700000000001
44,-0.055390999999999996
45,-0.018703
46,-0.13532
47,-0.14753
48,-0.12797999999999998
49,-0.13538
50,-0.13702
51,-0.13565
52,-0.13523
53,-0.12821
54,-0.15482
55,-0.20213
56,-0.22508000000000003
57,-0.24856
58,-0.26753000000000005
59,-0.24821
60,-0.22230999999999998
61,-0.20051
62,-0.17201
63,-0.17679
64,-0.20181
65,-0.18503
66,-0.1556
67,-0.16977
68,-0.19826
69,-0.19455999999999998
70,-0.16682
71,-0.14192000000000002
72,-0.13122
73,-0.13575
74,-0.13878
75,-0.12925999999999999
76,-0.13674
77,-0.16367
78,-0.16158
79,-0.13341
80,-0.11199
81,-0.085967
82,-0.069199
83,-0.089173
84,-0.11685999999999999
85,-0.13713
86,-0.1612
87,-0.17143
88,-0.16814
89,-0.16871
90,-0.16605999999999999
91,-0.16927999999999999
92,-0.17517
93,-0.14452
94,-0.09892100000000001
95,-0.093948
96,-0.11755
97,-0.13675
98,-0.13937
99,-0.12824000000000002
100,-0.13819
101,-0.16562000000000002
102,-0.15821
103,-0.13344
104,-0.13405999999999998
105,-0.12818
106,-0.098186
107,-0.074985
108,-0.0578
109,-0.032544
110,-0.0091893
111,0.003157
112,-0.0063739
113,-0.048721
114,-0.1054
115,-0.13702999999999999
116,-0.11871
117,-0.067802
118,-0.033325
119,-0.032941000000000005
120,-0.040681
121,-0.033163
122,0.0081254
123,0.072336
124,0.09514
125,0.069858
126,0.059838
127,0.06260700000000001
128,0.059397000000000005
129,0.079837
130,0.09579800000000001
131,0.071788
132,0.054942
133,0.06590900000000001
134,0.08595900000000001
135,0.12715
136,0.16623
137,0.1461
138,0.08877
139,0.06079
140,0.061720000000000004
141,0.069606
142,0.10639000000000001
143,0.15548
144,0.15600999999999998
145,0.1223
146,0.10169
147,0.071461
148,0.018865
149,-0.0054042000000000005
150,0.012609
151,0.033769
152,0.054633
153,0.08616599999999999
154,0.093824
155,0.068766
156,0.058311
157,0.06261599999999999
158,0.039820999999999995
159,0.0053246000000000005
160,-0.0028805
161,-0.0016550999999999998
162,-0.0082307
163,0.0018587
164,0.026079
165,0.032820999999999996
166,0.029559
167,0.030444
168,0.026494
169,0.034571
170,0.059636
171,0.055677
172,0.021425
173,0.022313999999999997
174,0.05873099999999999
175,0.055577999999999995
176,0.0070301999999999995
177,-0.025818
178,-0.040885000000000005
179,-0.06452100000000001
180,-0.076655
181,-0.063802
182,-0.041313
183,-0.015864
184,-0.0023559
185,-0.027351999999999998
186,-0.065983
187,-0.063432
188,-0.038599
189,-0.035828
190,-0.034444
191,-0.033797
192,-0.046581
193,-0.02404
194,0.00094644
195,-0.055285
196,-0.11105
197,-0.079042
198,-0.037368
199,-0.040849
200,-0.064202
201,-0.093615
202,-0.09946100000000001
203,-0.07324800000000001
204,-0.062183
205,-0.07273400000000001
206,-0.07081799999999999
207,-0.06365
208,-0.07588400000000001
209,-0.099483
210,-0.10786
211,-0.098695
212,-0.10051
213,-0.10983
214,-0.09298
215,-0.070274
216,-0.07156799999999999
217,-0.062424
218,-0.038066
219,-0.035503
220,-0.031613999999999996
221,-0.0059786
222,0.0030897
223,-0.006446899999999999
224,-0.0040957
225,0.00020881
226,-0.0058426
227,-0.0044732
228,0.014079
229,0.04007
230,0.06138300000000001
231,0.067558
232,0.058950999999999996
233,0.061167
234,0.08586
235,0.094488
236,0.066054
237,0.048915
238,0.08115
239,0.12647
240,0.13547
241,0.12768
242,0.15769
243,0.21254
244,0.22635999999999998
245,0.19727999999999998
246,0.18514
247,0.20572
248,0.22698000000000002
249,0.24649000000000001
250,0.27005
251,0.26306999999999997
252,0.2304
253,0.24038
254,0.29162
255,0.3221
256,0.32902
257,0.32769000000000004
258,0.3207
259,0.34224
260,0.3915
261,0.42106000000000005
262,0.42804
263,0.42668999999999996
264,0.42177
265,0.43582
266,0.45911
267,0.4616
268,0.45905
269,0.45969
270,0.44138999999999995
271,0.41278000000000004
272,0.39368000000000003
273,0.38775
274,0.40324
275,0.42633999999999994
276,0.42963999999999997
277,0.42313
278,0.42646000000000006
279,0.44553000000000004
280,0.46871999999999997
281,0.45952
282,0.44473
283,0.48705
284,0.52568
285,0.502
286,0.49678
287,0.52593
288,0.52564
289,0.53843
290,0.59277
291,0.6069899999999999
292,0.57062
293,0.55891
294,0.56638
295,0.5372100000000001
296,0.49133000000000004
297,0.46663999999999994
298,0.45168
299,0.46076000000000006
300,0.50675
301,0.53463
302,0.5248
303,0.5048199999999999
304,0.47415
305,0.45985
306,0.48273
307,0.49487
308,0.49294
309,0.51422
310,0.53149
311,0.52504
312,0.5241
313,0.52045
314,0.48982
315,0.46186000000000005
316,0.46082
317,0.45876999999999996
318,0.45343999999999995
319,0.47486999999999996
320,0.49241
321,0.47043999999999997
322,0.45191000000000003
323,0.46043999999999996
324,0.46211
325,0.45613000000000004
326,0.46005
327,0.46205
328,0.44988
329,0.42321000000000003
330,0.39748
331,0.39278
332,0.39244
333,0.37166
334,0.34235
335,0.32678
336,0.34446
337,0.38531
338,0.39099
339,0.36318
340,0.37091
341,0.39436
342,0.37399
343,0.34031
344,0.32605
345,0.32343
346,0.34058
347,0.36217
348,0.36225999999999997
349,0.35863
350,0.36038000000000003
351,0.35953
352,0.36280999999999997
353,0.35805
354,0.3345
355,0.32095
356,0.3289
357,0.33088
358,0.31464000000000003
359,0.28972
360,0.26548
361,0.26402
362,0.30327
363,0.35213
364,0.35708
365,0.31972
366,0.29478000000000004
367,0.29711
368,0.2922
369,0.2896
370,0.30528
371,0.28581999999999996
372,0.23536999999999997
373,0.23531
374,0.26521
375,0.26333
376,0.26744
377,0.30182
378,0.32564
379,0.32037
380,0.28394
381,0.23575
382,0.23060999999999998
383,0.27079000000000003
384,0.29525999999999997
385,0.27955
386,0.25778
387,0.25834
388,0.26571999999999996
389,0.2586
390,0.25695
391,0.27960999999999997
392,0.29445
393,0.27093
394,0.23689000000000002
395,0.22807
396,0.22910999999999998
397,0.2245
398,0.23051999999999997
399,0.2315
400,0.21716
401,0.2388
402,0.28742
403,0.29699000000000003
404,0.29723
405,0.32323
406,0.32055
407,0.28429
408,0.26316999999999996
409,0.25685
410,0.2674
411,0.31451999999999997
412,0.3607
413,0.35169
414,0.30456
415,0.25888
416,0.2161
417,0.19393
418,0.21276
419,0.23005
420,0.22719
421,0.24325
422,0.26538
423,0.26259
424,0.26071
425,0.25628
426,0.20761999999999997
427,0.15474000000000002
428,0.17864000000000002
429,0.25045
430,0.28836999999999996
431,0.2956
432,0.29602
433,0.27665
434,0.25709
435,0.25995999999999997
436,0.26295
437,0.26084
438,0.26195999999999997
439,0.24686
440,0.22043000000000001
441,0.22416
442,0.25246999999999997
443,0.26098000000000005
444,0.26
445,0.26926
446,0.24794000000000002
447,0.20002999999999999
448,0.18703
449,0.19834000000000002
450,0.1959
451,0.19479000000000002
452,0.19185
453,0.16644
454,0.13783
455,0.12709
456,0.12862
457,0.1317
458,0.12419000000000001
459,0.099659
460,0.072045
461,0.061312
462,0.063189
463,0.051678999999999996
464,0.0095754
465,-0.060845
466,-0.1358
467,-0.18217
468,-0.19993
469,-0.2188
470,-0.24465
471,-0.26569
472,-0.28512
473,-0.3146
474,-0.36217
475,-0.40016
476,-0.38950999999999997
477,-0.36687
478,-0.38142
479,-0.41436999999999996
480,-0.46163999999999994
481,-0.5050899999999999
482,-0.47644
483,-0.43231
484,-0.49831000000000003
485,-0.6029399999999999
486,-0.60134
487,-0.54218
488,-0.53801
489,-0.56409
490,-0.56672
491,-0.56272
492,-0.53473
493,-0.44791000000000003
494,-0.37585
495,-0.39726
496,-0.45356
497,-0.46168000000000003
498,-0.43375
499,-0.40854
500,-0.39359
501,-0.39912
502,-0.42338000000000003
503,-0.43382
504,-0.43259
505,-0.4506
506,-0.47706000000000004
507,-0.49849
508,-0.5210199999999999
509,-0.53962
510,-0.5646399999999999
511,-0.59331
512,-0.59353
513,-0.5979300000000001
514,-0.64285
515,-0.67114
516,-0.66409
517,-0.67814
518,-0.7171
519,-0.76379
520,-0.82732
521,-0.8960799999999999
522,-0.9626600000000001
523,-1.0311
524,-1.085
525,-1.1278
526,-1.1748
527,-1.2005
528,-1.1925
529,-1.1875
530,-1.197
531,-1.1924
532,-1.1842
533,-1.2123
534,-1.2606
535,-1.2859
536,-1.2993
537,-1.3263
538,-1.3356
539,-1.2999
540,-1.2570000000000001
541,-1.2338
542,-1.2124
543,-1.1914
544,-1.1553
545,-1.0794
546,-1.0264
547,-1.0463
548,-1.0622
549,-1.0235
550,-0.9753200000000001
551,-0.94432
552,-0.92715
553,-0.9086700000000001
554,-0.8668100000000001
555,-0.8269299999999999
556,-0.8235100000000001
557,-0.83157
558,-0.8289799999999999
559,-0.8448100000000001
560,-0.8897799999999999
561,-0.9317799999999999
562,-0.9711
563,-1.0344
564,-1.0992
565,-1.1424
566,-1.1873
567,-1.2292
568,-1.2497
569,-1.2803
570,-1.3303
571,-1.3557
572,-1.3616
573,-1.3974
574,-1.4476
575,-1.4534
576,-1.4185
577,-1.3757
578,-1.3191
579,-1.2489
580,-1.1823
581,-1.1169
582,-1.0508
583,-0.9844200000000001
584,-0.9226700000000001
585,-0.8928
586,-0.87672
587,-0.81321
588,-0.71486
589,-0.64463
590,-0.61164
591,-0.59601
592,-0.59633
593,-0.59236
594,-0.5573199999999999
595,-0.5311899999999999
596,-0.53345
597,-0.48367
598,-0.38756999999999997
599,-0.34739000000000003
600,-0.32563000000000003
601,-0.25556999999999996
602,-0.20869000000000001
603,-0.19796
604,-0.15392
605,-0.09940299999999999
606,-0.060747
607,0.004252000000000001
608,0.086922
609,0.1355
610,0.15506
611,0.18867
612,0.23792
613,0.26150999999999996
614,0.25638
615,0.26575
616,0.29006
617,0.29649000000000003
618,0.29455
619,0.2962
620,0.28047
621,0.25743
622,0.25785
623,0.26728
624,0.25665
625,0.23308
626,0.22141999999999998
627,0.23258
628,0.25603000000000004
629,0.26723
630,0.25816999999999996
631,0.25763
632,0.2703
633,0.25306
634,0.22682
635,0.25525
636,0.30465
637,0.32481
638,0.33275
639,0.32105
640,0.2958
641,0.3058
642,0.3338
643,0.35425999999999996
644,0.38398000000000004
645,0.39015
646,0.3642
647,0.35878000000000004
648,0.35677
649,0.33149
650,0.32378
651,0.32529
652,0.30015
653,0.28321999999999997
654,0.30195
655,0.3247
656,0.3305
657,0.32361999999999996
658,0.30041999999999996
659,0.26909
660,0.26337
661,0.28854
662,0.31516
663,0.33059
664,0.32931
665,0.31951999999999997
666,0.33563000000000004
667,0.35916
668,0.35659
669,0.36773
670,0.39255
671,0.37785
672,0.35622
673,0.36025
674,0.34686999999999996
675,0.31801
676,0.29765
677,0.27189
678,0.26195
679,0.28893
680,0.31916
681,0.32619000000000004
682,0.30013
683,0.26265
684,0.26944
685,0.29395
686,0.27673000000000003
687,0.25747
688,0.26108000000000003
689,0.25709
690,0.26950999999999997
691,0.29364
692,0.27816
693,0.25604
694,0.26061999999999996
695,0.25891
696,0.27068000000000003
697,0.32165
698,0.3476
699,0.30212
700,0.23342
701,0.21111999999999997
702,0.24686
703,0.2915
704,0.30217
705,0.28592
706,0.26338
707,0.23945
708,0.2235
709,0.22726999999999997
710,0.23445
711,0.21814
712,0.19575
713,0.20834
714,0.23954
715,0.2309
716,0.18314
717,0.15554
718,0.16172999999999998
719,0.15081
720,0.111
721,0.095637
722,0.10452
723,0.078446
724,0.031781000000000004
725,0.008223999999999999
726,-0.015983
727,-0.036177
728,-0.016302
729,-0.0023729
730,-0.03451
731,-0.0655
732,-0.068141
733,-0.068925
734,-0.086401
735,-0.11709000000000001
736,-0.13527
737,-0.11964000000000001
738,-0.086515
739,-0.069247
740,-0.083673
741,-0.12395
742,-0.16791
743,-0.17898
744,-0.15664
745,-0.16802999999999998
746,-0.23419
747,-0.29319
748,-0.33358000000000004
749,-0.35252
750,-0.29317
751,-0.20105
752,-0.17035
753,-0.1623
754,-0.13501
755,-0.11507
756,-0.082035
757,-0.035505
758,-0.013738
759,0.017809000000000002
760,0.098491
761,0.2079
762,0.31096
763,0.36103
764,0.37362
765,0.4316
766,0.5291600000000001
767,0.6140100000000001
768,0.71539
769,0.82705
770,0.8782399999999999
771,0.9093600000000001
772,1.03
773,1.2282
774,1.4173
775,1.5937
776,1.7919999999999998
777,1.9749
778,2.1215
779,2.3207
780,2.6082
781,2.8515
782,2.968
783,3.0552
784,3.1788
785,3.2748
786,3.3277
787,3.4096
788,3.5401
789,3.6684
790,3.7725
791,3.8613
792,3.935
793,4.002
794,4.0856
795,4.1833
796,4.2668
797,4.3313
798,4.3925
799,4.4247
800,4.3708
801,4.2284
802,4.0807
803,4.0389
804,4.1109
805,4.1606
806,4.118
807,4.0473
808,3.9447
809,3.7853
810,3.6565
811,3.5905
812,3.5261
813,3.4485
814,3.3507
815,3.2173
816,3.0973
817,3.0285
818,2.9688
819,2.8662
820,2.7136
821,2.5393
822,2.3498
823,2.0969
824,1.7167
825,1.1709
826,0.46631000000000006
827,-0.29498
828,-0.95599
829,-1.4751
830,-1.9548
831,-2.4778
832,-3.0505
833,-3.6482
834,-4.2328
835,-4.751
836,-5.1015
837,-5.2067
838,-5.1401
839,-4.9945
840,-4.7219
841,-4.2601
842,-3.6247
843,-2.8786
844,-2.1383
845,-1.4756
846,-0.86745
847,-0.32606
848,0.11605
849,0.48982
850,0.83115
851,1.1621
852,1.4657
853,1.6423
854,1.6584
855,1.6409
856,1.7081
857,1.8431
858,1.9746
859,2.0612
860,2.0627
861,1.9685
862,1.8561
863,1.7703
864,1.6691
865,1.5557
866,1.4674
867,1.4069
868,1.3796
869,1.36
870,1.3108
871,1.2843
872,1.3316
873,1.4239
874,1.5564
875,1.7368
876,1.9144
877,2.0393
878,2.1033
879,2.1284
880,2.151
881,2.1744
882,2.1793
883,2.1768
884,2.178
885,2.166
886,2.1325
887,2.0878
888,2.0417
889,1.9995
890,1.9562
891,1.8972
892,1.8233
893,1.7578
894,1.7126
895,1.6635
896,1.5955
897,1.5369
898,1.5102
899,1.4906
900,1.4272
901,1.3092
902,1.2
903,1.1333
904,1.0574
905,0.9674200000000001
906,0.9037200000000001
907,0.81965
908,0.68066
909,0.55288
910,0.46232
911,0.37419
912,0.28371
913,0.19838
914,0.13458
915,0.11739000000000001
916,0.13951
917,0.18738
918,0.23051999999999997
919,0.21391
920,0.16649
921,0.14507
922,0.11225
923,0.066201
924,0.060797000000000004
925,0.057279
926,0.031431
927,0.042106
928,0.071388
929,0.065411
930,0.043189
931,0.020939
932,-0.0010982000000000001
933,-0.019701
934,-0.049132
935,-0.069097
936,-0.063082
937,-0.083474
938,-0.13185999999999998
939,-0.14515999999999998
940,-0.12634
941,-0.10414000000000001
942,-0.091308
943,-0.11963
944,-0.16593
945,-0.17394
946,-0.16667
947,-0.16869
948,-0.15089
949,-0.12809
950,-0.13425
951,-0.14145
952,-0.1292
953,-0.13387000000000002
954,-0.16053
955,-0.16762
956,-0.1674
957,-0.20457
958,-0.25340999999999997
959,-0.26757
960,-0.26498
961,-0.26985
962,-0.26782
963,-0.26322
964,-0.27236
965,-0.26828
966,-0.24098000000000003
967,-0.23901
968,-0.26677
969,-0.27365
970,-0.26268
971,-0.26724000000000003
972,-0.27179000000000003
973,-0.26215
974,-0.26715
975,-0.2917
976,-0.30207
977,-0.3005
978,-0.31782
979,-0.34797
980,-0.36662
981,-0.35479
982,-0.30607
983,-0.26750999999999997
984,-0.28236
985,-0.31635
986,-0.33368000000000003
987,-0.33671999999999996
988,-0.32828
989,-0.33395
990,-0.37681
991,-0.41341000000000006
992,-0.39897
993,-0.35485
994,-0.31023
995,-0.26641
996,-0.23725
997,-0.23634000000000002
998,-0.23396
999,-0.20956999999999998
1000,-0.20315999999999998
1001,-0.23586
1002,-0.24861999999999998
1003,-0.2066
1004,-0.16748
1005,-0.16614
1006,-0.16707
1007,-0.16895
1008,-0.1913
1009,-0.20669
1010,-0.20072
1011,-0.18298
1012,-0.14190999999999998
1013,-0.10082
1014,-0.1137
1015,-0.16575
1016,-0.20323
1017,-0.22518000000000002
1018,-0.24294000000000002
1019,-0.23237
1020,-0.2044
1021,-0.20983000000000002
1022,-0.23598000000000002
1023,-0.23783
1024,-0.23214
1025,-0.23412
1026,-0.21453000000000003
1027,-0.18748
1028,-0.20542
1029,-0.25461999999999996
1030,-0.2682
1031,-0.22901999999999997
1032,-0.18049
1033,-0.15900999999999998
1034,-0.17121
1035,-0.21316
1036,-0.26645
1037,-0.3037
1038,-0.32594
1039,-0.34069
1040,-0.33123
1041,-0.32374
1042,-0.3623
1043,-0.40287
1044,-0.42031999999999997
1045,-0.46429
1046,-0.50002
1047,-0.47745
1048,-0.45127
1049,-0.42746000000000006
1050,-0.3787
1051,-0.36471
1052,-0.40795
1053,-0.47298
1054,-0.54194
1055,-0.56334
1056,-0.53637
1057,-0.53461
1058,-0.52673
1059,-0.47673999999999994
1060,-0.46743999999999997
1061,-0.50444
1062,-0.5249
1063,-0.55484
1064,-0.60668
1065,-0.65078
1066,-0.68683
1067,-0.69592
1068,-0.69099
1069,-0.7195600000000001
1070,-0.72464
1071,-0.65499
1072,-0.59601
1073,-0.60285
1074,-0.64559
1075,-0.7119300000000001
1076,-0.77107
1077,-0.77215
1078,-0.7389
1079,-0.73168
1080,-0.75479
1081,-0.77952
1082,-0.8004600000000001
1083,-0.8232299999999999
1084,-0.8357899999999999
1085,-0.82476
1086,-0.80192
1087,-0.78
1088,-0.75873
1089,-0.75718
1090,-0.78373
1091,-0.79474
1092,-0.77077
1093,-0.74429
1094,-0.72588
1095,-0.72364
1096,-0.7623300000000001
1097,-0.80048
1098,-0.77604
1099,-0.73085
1100,-0.7357100000000001
1101,-0.76137
1102,-0.75148
1103,-0.72309
1104,-0.7027100000000001
1105,-0.6683
1106,-0.61837
1107,-0.59692
1108,-0.6038600000000001
1109,-0.59119
1110,-0.56712
1111,-0.565
1112,-0.5626
1113,-0.56167
1114,-0.57709
1115,-0.5494600000000001
1116,-0.47777
1117,-0.44296
1118,-0.42386
1119,-0.37603000000000003
1120,-0.34456
1121,-0.32526
1122,-0.27781999999999996
1123,-0.24009
1124,-0.23269
1125,-0.20976999999999998
1126,-0.16251
1127,-0.12648
1128,-0.10626
1129,-0.082856
1130,-0.06582
1131,-0.068481
1132,-0.061551999999999996
1133,-0.020059
1134,0.024499
1135,0.046893000000000004
1136,0.074544
1137,0.12078
1138,0.16599
1139,0.21051
1140,0.25506
1141,0.28357
1142,0.29791
1143,0.29661
1144,0.27344
1145,0.26050999999999996
1146,0.28703
1147,0.34476999999999997
1148,0.42116000000000003
1149,0.48661000000000004
1150,0.50263
1151,0.48621000000000003
1152,0.48905
1153,0.52593
1154,0.57695
1155,0.6200899999999999
1156,0.64722
1157,0.66066
1158,0.65867
1159,0.65235
1160,0.66433
1161,0.68796
1162,0.70963
1163,0.73031
1164,0.72663
1165,0.6945899999999999
1166,0.70281
1167,0.78042
1168,0.84698
1169,0.85254
1170,0.8539100000000001
1171,0.8801200000000001
1172,0.8873700000000001
1173,0.8871600000000001
1174,0.9253899999999999
1175,0.96899
1176,0.9867600000000001
1177,1.0085
1178,1.0214
1179,0.9916799999999999
1180,0.95565
1181,0.96485
1182,1.0167
1183,1.0701
1184,1.0908
1185,1.0877
1186,1.0848
1187,1.0903
1188,1.1177
1189,1.1664
1190,1.1883
1191,1.156
1192,1.1201
1193,1.1281
1194,1.1527
1195,1.1563
1196,1.1501
1197,1.1531
1198,1.1686
1199,1.205
1200,1.2514
1201,1.2641
1202,1.2357
1203,1.2194
1204,1.2405
1205,1.2515
1206,1.2206
1207,1.1886
1208,1.1879
1209,1.1868
1210,1.1624
1211,1.1524
1212,1.1862
1213,1.2195
1214,1.2068
1215,1.1867
1216,1.2031
1217,1.2319
1218,1.2528
1219,1.2594
1220,1.2371
1221,1.2197
1222,1.224
1223,1.2033
1224,1.1868
1225,1.228
1226,1.2638
1227,1.2522
1228,1.2301
1229,1.2031
1230,1.1866
1231,1.2068
1232,1.2237
1233,1.2196
1234,1.2366
1235,1.2631
1236,1.2514
1237,1.2229999999999999
1238,1.22
1239,1.2189
1240,1.195
1241,1.1814
1242,1.1865
1243,1.1689
1244,1.1328
1245,1.1204
1246,1.1223
1247,1.1141
1248,1.1218
1249,1.1479
1250,1.1462
1251,1.1183
1252,1.0966
1253,1.0655
1254,1.0176
1255,0.9893200000000001
1256,0.9885700000000001
1257,0.98772
1258,0.98541
1259,0.99074
1260,0.98718
1261,0.98188
1262,1.0032
1263,1.0213
1264,1.0012
1265,0.9648100000000001
1266,0.9159299999999999
1267,0.8637
1268,0.8616299999999999
1269,0.89136
1270,0.8927700000000001
1271,0.88508
1272,0.88946
1273,0.88987
1274,0.8826
1275,0.8500700000000001
1276,0.8016399999999999
1277,0.7770699999999999
1278,0.7521800000000001
1279,0.7227899999999999
1280,0.74031
1281,0.7548600000000001
1282,0.70825
1283,0.6778
1284,0.6924600000000001
1285,0.675
1286,0.62324
1287,0.58699
1288,0.54688
1289,0.47739
1290,0.42063999999999996
1291,0.41849
1292,0.43766000000000005
1293,0.4203
1294,0.37377
1295,0.34129
1296,0.32423
1297,0.30251
1298,0.27739
1299,0.2587
1300,0.25748000000000004
1301,0.26884
1302,0.25545
1303,0.20931999999999998
1304,0.17392
1305,0.15942
1306,0.13783
1307,0.11102000000000001
1308,0.092752
1309,0.072088
1310,0.036501
1311,-0.014823
1312,-0.08141799999999999
1313,-0.14451
1314,-0.17012
1315,-0.16746
1316,-0.17939000000000002
1317,-0.20731999999999998
1318,-0.22894
1319,-0.2491
1320,-0.27255
1321,-0.29408
1322,-0.31777
1323,-0.33616
1324,-0.33488
1325,-0.33791
1326,-0.37897
1327,-0.42618999999999996
1328,-0.43485
1329,-0.43428
1330,-0.457
1331,-0.49345
1332,-0.5458
1333,-0.59241
1334,-0.5982
1335,-0.60125
1336,-0.62626
1337,-0.63189
1338,-0.63484
1339,-0.68148
1340,-0.7390399999999999
1341,-0.7684
1342,-0.78961
1343,-0.8164600000000001
1344,-0.8307
1345,-0.8294
1346,-0.8286600000000001
1347,-0.82831
1348,-0.82749
1349,-0.84109
1350,-0.8719399999999999
1351,-0.9166799999999999
1352,-0.9691700000000001
1353,-0.9983700000000001
1354,-0.9955700000000001
1355,-0.99205
1356,-0.99424
1357,-0.99382
1358,-0.9954700000000001
1359,-0.99182
1360,-0.99135
1361,-1.013
1362,-1.0290000000000001
1363,-1.0265
1364,-1.0404
1365,-1.0682
1366,-1.0894
1367,-1.1115
1368,-1.1317
1369,-1.1540000000000001
1370,-1.1837
1371,-1.1906
1372,-1.189
1373,-1.2271
1374,-1.2666
1375,-1.2613
1376,-1.2514
1377,-1.2639
1378,-1.2868
1379,-1.3258
1380,-1.3716
1381,-1.3911
1382,-1.3751
1383,-1.3495
1384,-1.3539
1385,-1.3844
1386,-1.3826
1387,-1.3326
1388,-1.2807
1389,-1.247
1390,-1.2269
1391,-1.2236
1392,-1.2244
1393,-1.2246
1394,-1.2408
1395,-1.2682
1396,-1.2902
1397,-1.2849
1398,-1.2342
1399,-1.1928
1400,-1.2229
1401,-1.2753
1402,-1.2918
1403,-1.2793
1404,-1.2378
1405,-1.1945
1406,-1.2012
1407,-1.2427
1408,-1.2877
1409,-1.3225
1410,-1.315
1411,-1.2921
1412,-1.3092
1413,-1.3251
1414,-1.295
1415,-1.2643
1416,-1.2528
1417,-1.2279
1418,-1.2112
1419,-1.2446
1420,-1.29
1421,-1.2974
1422,-1.2844
1423,-1.261
1424,-1.2148
1425,-1.1819
1426,-1.1915
1427,-1.2143
1428,-1.2331
1429,-1.2576
1430,-1.2819
1431,-1.2947
1432,-1.2924
1433,-1.2731
1434,-1.2443
1435,-1.2261
1436,-1.2244
1437,-1.2237
1438,-1.2256
1439,-1.2448
1440,-1.2654
1441,-1.2594
1442,-1.2348
1443,-1.2204
1444,-1.2258
1445,-1.2301
1446,-1.215
1447,-1.193
1448,-1.1729
1449,-1.1397
1450,-1.0938
1451,-1.0481
1452,-1.0076
1453,-0.9946299999999999
1454,-1.0169
1455,-1.0257
1456,-0.9941200000000001
1457,-0.9627399999999999
1458,-0.96762
1459,-0.99498
1460,-1.0032
1461,-0.9775799999999999
1462,-0.9615600000000001
1463,-0.98141
1464,-1.0012
1465,-0.9938899999999999
1466,-0.9568200000000001
1467,-0.8874299999999999
1468,-0.8281299999999999
1469,-0.83804
1470,-0.8875700000000001
1471,-0.8942700000000001
1472,-0.8497399999999999
1473,-0.80998
1474,-0.79586
1475,-0.79367
1476,-0.79852
1477,-0.7954
1478,-0.77228
1479,-0.7560899999999999
1480,-0.76407
1481,-0.7841899999999999
1482,-0.81071
1483,-0.82991
1484,-0.8311799999999999
1485,-0.82134
1486,-0.79346
1487,-0.76464
1488,-0.76678
1489,-0.7611399999999999
1490,-0.73122
1491,-0.74729
1492,-0.7996300000000001
1493,-0.8052600000000001
1494,-0.78503
1495,-0.7987
1496,-0.82406
1497,-0.82893
1498,-0.82994
1499,-0.8503
1500,-0.8727600000000001
1501,-0.85893
1502,-0.8304299999999999
1503,-0.83839
1504,-0.8647
1505,-0.8844
1506,-0.91412
1507,-0.92738
1508,-0.90218
1509,-0.898
1510,-0.9323899999999999
1511,-0.93794
1512,-0.90676
1513,-0.8955200000000001
1514,-0.89899
1515,-0.87874
1516,-0.86188
1517,-0.8825799999999999
1518,-0.91271
1519,-0.9305100000000001
1520,-0.95147
1521,-0.97711
1522,-0.99631
1523,-0.9984799999999999
1524,-0.9787799999999999
1525,-0.95929
1526,-0.9587899999999999
1527,-0.96267
1528,-0.9605899999999999
1529,-0.95916
1530,-0.9697899999999999
1531,-1.0001
1532,-1.0252
1533,-1.023
1534,-1.0317
1535,-1.0769
1536,-1.1178
1537,-1.1253
1538,-1.1044
1539,-1.0622
1540,-1.0205
1541,-0.99756
1542,-0.9892299999999999
1543,-0.9972799999999999
1544,-1.0206
1545,-1.033
1546,-1.0249
1547,-1.0237
1548,-1.0339
1549,-1.0219
1550,-0.9960700000000001
1551,-1.004
1552,-1.0316
1553,-1.0312
1554,-1.0193
1555,-1.0321
1556,-1.0566
1557,-1.0546
1558,-1.0172
1559,-0.9921700000000001
1560,-1.0122
1561,-1.0264
1562,-1.0013
1563,-0.98535
1564,-0.99751
1565,-0.99874
1566,-0.96804
1567,-0.91348
1568,-0.86751
1569,-0.85882
1570,-0.86031
1571,-0.83698
1572,-0.80615
1573,-0.79574
1574,-0.81843
1575,-0.8681700000000001
1576,-0.89736
1577,-0.87208
1578,-0.83425
1579,-0.83101
1580,-0.83396
1581,-0.7883399999999999
1582,-0.70753
1583,-0.66395
1584,-0.68104
1585,-0.69707
1586,-0.67174
1587,-0.63944
1588,-0.62967
1589,-0.63055
1590,-0.6315
1591,-0.6285
1592,-0.60615
1593,-0.55008
1594,-0.47675
1595,-0.43408
1596,-0.44564
1597,-0.47139
1598,-0.46906000000000003
1599,-0.44726000000000005
1600,-0.42578
1601,-0.40387
1602,-0.38006
1603,-0.36034
1604,-0.33869
1605,-0.30016
1606,-0.25215
1607,-0.23233
1608,-0.26625
1609,-0.31059000000000003
1610,-0.28074
1611,-0.18348
1612,-0.12393
1613,-0.13237000000000002
1614,-0.14099
1615,-0.13218
1616,-0.13424
1617,-0.13808
1618,-0.1333
1619,-0.13452
1620,-0.13793
1621,-0.13296
1622,-0.13410999999999998
1623,-0.14201
1624,-0.12377
1625,-0.075443
1626,-0.040312
1627,-0.037367000000000004
1628,-0.03728
1629,-0.020944
1630,0.011269
1631,0.057888999999999996
1632,0.08135099999999999
1633,0.041154
1634,-0.0025986
1635,0.028185
1636,0.07714700000000001
1637,0.066272
1638,0.0471
