time,value
0,-0.3422
1,-0.3422
2,-0.3422
3,-0.3422
4,-0.3422
5,-0.3422
6,-0.3422
7,-0.3422
8,-0.3422
9,-0.3422
10,-0.3422
11,-0.3422
12,-0.3422
13,-0.3422
14,-0.3422
15,-0.3422
16,-0.3422
17,-0.3422
18,-0.3422
19,-0.3422
20,-0.3422
21,-0.3422
22,-0.3422
23,-0.3422
24,-0.3422
25,-0.3422
26,-0.3422
27,-0.3422
28,-0.3422
29,-0.3422
30,-0.3422
31,-0.3422
32,-0.3422
33,-0.3422
34,-0.3422
35,-0.3422
36,-0.3422
37,-0.3422
38,-0.3422
39,-0.3422
40,-0.3422
41,-0.3422
42,1.3752
43,3.3252
44,1.4638
45,3.2255
46,-0.15385
47,-0.17601
48,0.38906
49,4.7102
50,-0.3422
51,-0.3422
52,-0.3422
53,-0.3422
54,-0.3422
55,-0.3422
56,-0.3422
57,-0.3422
58,-0.3422
59,-0.3422
60,-0.3422
61,-0.3422
62,-0.3422
63,-0.3422
64,-0.3422
65,-0.3422
66,-0.3422
67,-0.3422
68,-0.3422
69,-0.3422
70,-0.3422
71,-0.3422
72,-0.3422
73,-0.3422
74,-0.3422
75,-0.3422
76,-0.3422
77,-0.3422
78,-0.3422
79,-0.3422
80,-0.3422
81,2.4277
82,3.292
83,0.012348999999999999
84,3.1036
85,-0.15385
86,-0.17601
87,2.6937
88,2.0178
89,-0.3422
90,-0.3422
91,-0.3422
92,-0.3422
93,-0.3422
94,-0.3422
95,-0.3422
