time,value
0,-0.2379
1,-0.34185
2,-0.34985
3,-0.34985
4,-0.34985
5,-0.30186999999999997
6,-0.18192
7,-0.21391
8,-0.37384
9,-0.34185
10,-0.34985
11,-0.34985
12,-0.36584
13,-0.2379
14,-0.31786
15,-0.30987
16,-0.24589
17,-0.29386999999999996
18,-0.36584
19,-0.30186999999999997
20,-0.26189
21,-0.34185
22,-0.37384
23,-0.34985
24,-0.34185
25,-0.30186999999999997
26,-0.14194
27,-0.24589
28,-0.34985
29,0.4738
30,-0.33386
31,-0.33386
32,-0.31786
33,-0.25389
34,-0.34185
35,-0.25389
36,-0.25389
37,-0.31786
38,-0.34985
39,-0.26189
40,-0.31786
41,-0.34185
42,-0.37384
43,-0.34185
44,-0.29386999999999996
45,3.7444
46,-0.06997
47,-0.2299
48,-0.18992
49,-0.2299
50,-0.021991
51,-0.31786
52,-0.25389
53,-0.31786
54,-0.2379
55,-0.25389
56,1.4254
57,2.3369999999999997
58,-0.029987
59,-0.11795
60,-0.15793
61,-0.12595
62,-0.33386
63,-0.34985
64,-0.17393
65,-0.16593
66,-0.35785
67,-0.35785
68,-0.34985
69,-0.34185
70,-0.29386999999999996
71,-0.27788
72,-0.30987
73,-0.2299
74,-0.24589
75,-0.35785
76,-0.26988
77,-0.28588
78,-0.34185
79,-0.34185
80,-0.34985
81,0.48178999999999994
82,3.5685
83,6.7831
84,1.4894
85,-0.18992
86,-0.14994000000000002
87,1.2175
88,1.7772
89,0.4738
90,-0.30987
91,-0.24589
92,-0.18192
93,-0.15793
94,-0.33386
95,-0.33386
