{
  "about": {
    "datasetID": "56_sunspots_dataset_TRAIN",
    "datasetName": "sunspots",
    "description": "Yearly numbers of sunspots from 1700 to present, as from the World Data Center, aka SIDC.",
    "citation": "WDC-SILSO, Solar Influences Data Analysis Center (SIDC),  Royal Observatory of Belgium, Av. Circulaire, 3, B-1180 BRUSSELS, Currently at http://www.sidc.be/silso/datafiles",
    "license": "general public domain",
    "source": "WDC-SILSO, Solar Influences Data Analysis Center (SIDC)",
    "sourceURI": "http://www.sidc.be/silso/datafiles",
    "approximateSize": "",
    "datasetSchemaVersion": "4.0.0",
    "redacted": false,
    "datasetVersion": "4.0.0",
    "digest": "7a5198d2925ebcf8eb06418d243fc3aa5916a5e0f2444c4624bcdfd7bddd42d0"
  },
  "dataResources": [
    {
      "resID": "learningData",
      "resPath": "tables/learningData.csv",
      "resType": "table",
      "resFormat": {
        "text/csv": [
          "csv"
        ]
      },
      "isCollection": false,
      "columns": [
        {
          "colIndex": 0,
          "colName": "d3mIndex",
          "colType": "integer",
          "role": [
            "index"
          ]
        },
        {
          "colIndex": 1,
          "colName": "year",
          "colType": "dateTime",
          "role": [
            "attribute",
            "timeIndicator"
          ]
        },
        {
          "colIndex": 2,
          "colName": "sd",
          "colType": "real",
          "role": [
            "attribute"
          ]
        },
        {
          "colIndex": 3,
          "colName": "observations",
          "colType": "real",
          "role": [
            "attribute"
          ]
        },
        {
          "colIndex": 4,
          "colName": "sunspots",
          "colType": "real",
          "role": [
            "suggestedTarget"
          ]
        }
      ],
      "columnsCount": 5
    }
  ]
}