time,value
0,-0.35786
1,-0.35786
2,-0.35786
3,-0.35786
4,-0.35786
5,-0.35786
6,2.7653
7,-0.35786
8,-0.35786
9,-0.35786
10,-0.35786
11,2.7653
12,-0.35786
13,-0.35786
14,-0.35786
15,-0.35786
16,-0.35786
17,-0.35786
18,2.7653
19,-0.35786
20,-0.35786
21,-0.35786
22,-0.35786
23,-0.35786
24,-0.35786
25,2.7653
26,-0.35786
27,-0.35786
28,-0.35786
29,-0.35786
30,2.7653
31,-0.35786
32,-0.35786
33,-0.35786
34,-0.35786
35,-0.35786
36,-0.35786
37,-0.35786
38,-0.35786
39,-0.35786
40,2.7653
41,-0.35786
42,-0.35786
43,-0.35786
44,-0.35786
45,-0.35786
46,-0.35786
47,-0.35786
48,-0.35786
49,-0.35786
50,-0.35786
51,2.7653
52,-0.35786
53,-0.35786
54,-0.35786
55,-0.35786
56,-0.35786
57,-0.35786
58,-0.35786
59,-0.35786
60,-0.35786
61,-0.35786
62,-0.35786
63,-0.35786
64,-0.35786
65,-0.35786
66,-0.35786
67,-0.35786
68,-0.35786
69,-0.35786
70,-0.35786
71,-0.35786
72,-0.35786
73,2.7653
74,-0.35786
75,-0.35786
76,-0.35786
77,-0.35786
78,-0.35786
79,-0.35786
80,-0.35786
81,-0.35786
82,-0.35786
83,-0.35786
84,2.7653
85,-0.35786
86,-0.35786
87,-0.35786
88,-0.35786
89,2.7653
90,-0.35786
91,-0.35786
92,-0.35786
93,2.7653
94,-0.35786
95,-0.35786
