time,value
0,-0.91927
1,-0.91927
2,-0.91927
3,-0.91927
4,-0.91927
5,-0.91927
6,-0.91927
7,-0.91927
8,-0.91927
9,-0.91927
10,-0.91927
11,-0.91927
12,-0.91927
13,-0.91927
14,-0.91927
15,-0.91927
16,-0.91927
17,-0.91927
18,-0.91927
19,-0.91927
20,-0.91927
21,-0.91927
22,-0.91927
23,-0.91927
24,0.99921
25,1.6131
26,1.1527
27,0.84573
28,1.0759
29,0.76899
30,0.69225
31,0.99921
32,0.84573
33,0.61551
34,0.84573
35,1.9968
36,2.0736
37,2.3805
38,2.227
39,1.9201
40,0.30856
41,0.15508
42,0.23181999999999997
43,0.078338
44,0.0015987
45,-0.15188
46,0.078338
47,1.8433
48,1.0759
49,0.53877
50,-0.91927
51,-0.91927
52,-0.91927
53,-0.91927
54,-0.91927
55,-0.91927
56,-0.91927
57,-0.91927
58,-0.91927
59,-0.7658
60,-0.91927
61,-0.91927
62,-0.91927
63,-0.91927
64,-0.91927
65,-0.91927
66,1.0759
67,1.5364
68,0.9224700000000001
69,0.99921
70,0.61551
71,0.84573
72,0.99921
73,0.61551
74,0.76899
75,0.46203
76,0.99921
77,0.76899
78,0.61551
79,0.84573
80,0.76899
81,0.61551
82,1.0759
83,0.84573
84,0.76899
85,0.99921
86,0.76899
87,0.61551
88,-0.68906
89,-0.91927
90,-0.91927
91,-0.91927
92,-0.91927
93,-0.91927
94,-0.91927
95,-0.91927
