time,value
0,-0.18645
1,-0.22221999999999997
2,-0.16369
3,-0.20271
4,-0.20596
5,-0.17019
6,-0.21896999999999997
7,-0.1897
8,-0.1767
9,-0.21896999999999997
10,-0.17345
11,-0.19946
12,-0.20596
13,-0.17019
14,-0.21896999999999997
15,-0.18645
16,-0.1897
17,-0.20920999999999998
18,-0.1767
19,-0.20271
20,-0.19295
21,-0.1897
22,-0.20920999999999998
23,-0.17345
24,-0.20271
25,-0.18645
26,-0.17995
27,-0.21245999999999998
28,-0.16694
29,-0.19621
30,-0.1897
31,-0.16694
32,-0.21570999999999999
33,-0.16694
34,-0.18645
35,-0.18645
36,-0.15069000000000002
37,-0.1832
38,-0.17995
39,-0.16369
40,-0.20920999999999998
41,-0.17019
42,-0.16044
43,-0.1832
44,-0.15719
45,-0.20596
46,-0.17995
47,-0.17345
48,-0.20271
49,-0.16694
50,-0.18645
51,-0.19295
52,-0.17345
53,-0.20596
54,-0.17995
55,5.0289
56,6.2449
57,5.2337
58,0.41507
59,-0.16694
60,-0.13443
61,-0.17345
62,-0.16369
63,-0.15069000000000002
64,-0.19295
65,-0.15069000000000002
66,-0.16694
67,-0.19621
68,-0.15069000000000002
69,-0.19295
70,-0.17995
71,-0.16694
72,-0.20596
73,-0.14743
74,-0.17345
75,-0.1832
76,-0.17019
77,-0.19621
78,-0.16369
79,-0.16044
80,-0.17019
81,-0.16694
82,-0.19946
83,-0.15069000000000002
84,-0.19295
85,-0.1897
86,-0.16369
87,-0.20920999999999998
88,-0.1832
89,-0.19621
90,-0.20271
91,-0.1832
92,-0.20920999999999998
93,-0.18645
94,-0.19946
95,-0.19621
