time,value
0,-1.3358
1,0.17287
2,0.17287
3,0.17287
4,-1.3358
5,0.17287
6,0.17287
7,0.17287
8,-1.3358
9,0.17287
10,0.17287
11,0.17287
12,-1.3358
13,0.17287
14,0.17287
15,0.17287
16,0.17287
17,-1.3358
18,0.17287
19,0.17287
20,0.17287
21,-1.3358
22,0.17287
23,0.17287
24,0.17287
25,-1.3358
26,0.17287
27,0.17287
28,0.17287
29,-1.3358
30,0.17287
31,0.17287
32,0.17287
33,-1.3358
34,0.17287
35,0.17287
36,0.17287
37,-1.3358
38,0.17287
39,0.17287
40,0.17287
41,-1.3358
42,0.17287
43,0.17287
44,0.17287
45,-1.3358
46,0.17287
47,0.17287
48,0.17287
49,-1.3358
50,0.17287
51,0.17287
52,0.17287
53,-1.3358
54,0.17287
55,0.17287
56,0.17287
57,-1.3358
58,0.17287
59,0.17287
60,0.17287
61,-1.3358
62,0.17287
63,0.17287
64,0.17287
65,0.17287
66,-1.3358
67,0.17287
68,0.17287
69,0.17287
70,-1.3358
71,0.17287
72,0.17287
73,0.17287
74,-1.3358
75,0.17287
76,0.17287
77,0.17287
78,-1.3358
79,0.17287
80,0.17287
81,0.17287
82,-1.3358
83,1.6815
84,1.6815
85,3.1902
86,3.1902
87,3.1902
88,1.6815
89,3.1902
90,1.6815
91,-1.3358
92,0.17287
93,0.17287
94,0.17287
95,-1.3358
