time,value
0,-0.33866999999999997
1,-0.33866999999999997
2,-0.33866999999999997
3,-0.33866999999999997
4,-0.33866999999999997
5,-0.33866999999999997
6,-0.33866999999999997
7,-0.33866999999999997
8,-0.33866999999999997
9,-0.33866999999999997
10,-0.33866999999999997
11,-0.33866999999999997
12,-0.33866999999999997
13,-0.33866999999999997
14,-0.33866999999999997
15,-0.33866999999999997
16,-0.33866999999999997
17,-0.33866999999999997
18,-0.33866999999999997
19,-0.33866999999999997
20,-0.33866999999999997
21,-0.33866999999999997
22,-0.33866999999999997
23,-0.33866999999999997
24,-0.33866999999999997
25,-0.33866999999999997
26,-0.33866999999999997
27,-0.33866999999999997
28,-0.33866999999999997
29,-0.33866999999999997
30,-0.33866999999999997
31,-0.33866999999999997
32,-0.33866999999999997
33,-0.33866999999999997
34,-0.33866999999999997
35,-0.33866999999999997
36,-0.33866999999999997
37,-0.33866999999999997
38,-0.33866999999999997
39,-0.33866999999999997
40,-0.33866999999999997
41,-0.33866999999999997
42,-0.33866999999999997
43,-0.33866999999999997
44,-0.33866999999999997
45,-0.33866999999999997
46,-0.33866999999999997
47,-0.33866999999999997
48,-0.33866999999999997
49,-0.33866999999999997
50,-0.33866999999999997
51,-0.33866999999999997
52,-0.33866999999999997
53,-0.33866999999999997
54,-0.33866999999999997
55,-0.33866999999999997
56,-0.33866999999999997
57,-0.33866999999999997
58,-0.33866999999999997
59,-0.33866999999999997
60,-0.33866999999999997
61,-0.33866999999999997
62,-0.33866999999999997
63,-0.33866999999999997
64,-0.33866999999999997
65,-0.33866999999999997
66,-0.33866999999999997
67,-0.33866999999999997
68,-0.33866999999999997
69,-0.33866999999999997
70,-0.33866999999999997
71,0.70173
72,8.7648
73,0.70173
74,0.44163
75,0.70173
76,0.70173
77,0.70173
78,0.70173
79,0.44163
80,0.70173
81,0.70173
82,0.70173
83,0.44163
84,0.70173
85,0.70173
86,0.70173
87,0.44163
88,0.70173
89,0.70173
90,0.70173
91,0.44163
92,0.70173
93,0.70173
94,0.70173
95,0.44163
