time,value
0,0.71701
1,0.6039800000000001
2,0.74251
3,0.8245100000000001
4,0.6966600000000001
5,0.68115
6,0.6648
7,0.8372
8,0.89975
9,0.9324600000000001
10,0.90004
11,0.85364
12,0.79869
13,0.75502
14,0.59697
15,0.60785
16,0.45258000000000004
17,0.51683
18,0.59527
19,0.59409
20,0.5323
21,0.6056199999999999
22,0.6933600000000001
23,0.60595
24,0.63121
25,0.6535
26,0.77437
27,0.6627
28,0.6252
29,0.64805
30,0.55917
31,0.33301
32,0.23895
33,-0.14245
34,-0.53935
35,-1.2215
36,-1.5762
37,-1.9140000000000001
38,-2.5051
39,-2.7117
40,-2.7018
41,-3.0874
42,-3.3139
43,-2.9688
44,-2.3318
45,-2.1761
46,-1.9884
47,-1.1123
48,-1.0802
49,-0.80201
50,-0.54464
51,-0.16699
52,-0.24991999999999998
53,-0.51978
54,-0.48668999999999996
55,-0.067786
56,-0.21570999999999999
57,-0.5253399999999999
58,-0.17246
59,0.38139
60,0.041667
61,-0.21466
62,0.04506
63,0.90335
64,0.29409
65,-0.90891
66,-0.74507
67,-0.5454399999999999
68,-0.91469
69,-0.54785
70,-0.32033
71,-0.44292
72,-0.62746
73,-0.6956399999999999
74,-0.47668999999999995
75,-0.40973999999999994
76,-0.62938
77,-0.7250800000000001
78,-0.57802
79,-0.47965
80,-0.53547
81,-0.65218
82,-0.5245
83,-0.5130399999999999
84,-0.58521
85,-0.62228
86,-0.56986
87,-0.50937
88,-0.5212399999999999
89,-0.48286
90,-0.4806
91,-0.44777
92,-0.45321999999999996
93,-0.46451000000000003
94,-0.42948000000000003
95,-0.41673000000000004
96,-0.40415
97,-0.40562
98,-0.45614
99,-0.43873999999999996
100,-0.30619
101,-0.38661999999999996
102,-0.42749
103,-0.42713999999999996
104,-0.38968
105,-0.34263000000000005
106,-0.36935
107,-0.35946999999999996
108,-0.26736
109,-0.37511
110,-0.38011999999999996
111,-0.3454
112,-0.31033
113,-0.35286
114,-0.35795
115,-0.30009
116,-0.33563000000000004
117,-0.27305
118,-0.27187
119,-0.31032
120,-0.23604
121,-0.19155999999999998
122,-0.23579
123,-0.23501
124,-0.14806
125,-0.086535
126,-0.11875999999999999
127,-0.17222
128,-0.14708
129,-0.039323000000000004
130,-0.071608
131,-0.11904
132,-0.10645999999999999
133,-0.019249000000000002
134,-0.15204
135,-0.11026
136,0.052483
137,0.15788
138,0.067174
139,-0.022359
140,-0.1332
141,-0.024363
142,0.091665
143,0.10469
144,0.06427100000000001
145,-0.16314
146,-0.39774
147,-0.60725
148,-0.65205
149,-0.57845
150,-1.1862
151,-1.54
152,-1.607
153,-1.5842
154,-2.4492
155,-2.9967
156,-3.0278
157,-2.8319
158,-2.8451
159,-3.1889
160,-3.1811
161,-2.9301
162,-2.5053
163,-2.5191
164,-2.4603
165,-1.9615
166,-1.7284
167,-1.2491
168,-1.2509
169,-1.3114
170,-1.3366
171,-1.3783
172,-1.2873
173,-1.138
174,-0.8284100000000001
175,-0.63255
176,-0.25945999999999997
177,0.24481999999999998
178,0.35231999999999997
179,0.051836
180,0.17123
181,0.26149
182,0.26918000000000003
183,0.27034
184,0.31192
185,0.46901000000000004
186,0.48603999999999997
187,0.46498
188,0.5243399999999999
189,0.5241100000000001
190,0.49211000000000005
191,0.5561699999999999
192,0.49506000000000006
193,0.6359100000000001
194,0.54094
195,0.53464
196,0.64365
197,0.76835
198,0.76991
199,0.66372
200,0.5522699999999999
201,0.7643300000000001
202,0.62524
203,0.66015
204,0.68926
205,0.76831
206,0.7619199999999999
207,0.83357
208,0.7029
209,0.7085
210,0.58927
211,0.39544
212,0.72938
213,0.71309
214,0.68702
215,0.98879
216,0.83188
217,0.8123
218,0.78112
219,0.8009
220,0.82586
221,0.79173
222,0.75551
223,0.66197
224,0.8003600000000001
225,0.72036
226,0.7873100000000001
227,0.7692100000000001
228,0.94279
229,0.92466
230,0.70294
231,0.7091
232,0.72331
233,0.87272
234,0.9561200000000001
235,1.011
236,0.95031
237,0.8471299999999999
238,0.8494
239,0.7166100000000001
240,0.7671399999999999
241,0.79675
242,0.79891
243,0.87779
244,0.87203
245,0.72946
246,0.74659
247,0.8778100000000001
248,0.88089
249,0.80795
250,0.81553
251,0.88341
252,0.8908200000000001
253,0.8895
254,0.8825
255,0.88182
256,0.88659
257,0.8214600000000001
258,0.8940100000000001
259,0.80728
260,0.81355
261,0.90245
262,0.8931399999999999
263,0.89464
264,0.8946799999999999
265,0.88302
266,0.86895
267,0.8792700000000001
268,0.88439
269,0.7420899999999999
270,0.78191
271,0.88821
272,0.8946200000000001
273,0.8924700000000001
274,0.90035
275,0.89944
276,1.0309
277,0.92671
278,0.89126
279,0.8754700000000001
280,0.88507
281,0.88535
282,0.88425
283,0.99234
284,0.8841100000000001
285,0.88679
286,0.8796700000000001
287,0.8988
288,0.89275
289,1.0070000000000001
290,0.85545
291,0.8547100000000001
292,0.8587
293,0.8728100000000001
294,0.73374
295,0.7411300000000001
296,0.73473
297,0.8684
298,0.9942700000000001
299,0.85785
