time,value
0,0.033744
1,-0.8918
2,0.34226
3,0.49651000000000006
4,-0.8918
5,0.033744
6,1.1135
7,-0.8918
8,-0.58328
9,1.4221
10,-0.8918
11,-0.8918
12,1.7306
13,-0.8918
14,-0.8918
15,1.8848
16,-0.8918
17,-0.8918
18,1.2678
19,-0.42903
20,-0.8918
21,0.65077
22,0.34226
23,-0.8918
24,-0.27476999999999996
25,1.1135
26,-0.8918
27,-0.8918
28,1.7306
29,-0.8918
30,-0.8918
31,1.7306
32,-0.8918
33,-0.8918
34,1.1135
35,-0.27476999999999996
36,-0.8918
37,0.188
38,0.80503
39,-0.8918
40,-0.8918
41,1.7306
42,-0.8918
43,-0.8918
44,1.7306
45,-0.8918
46,-0.8918
47,1.7306
48,-0.8918
49,-0.8918
50,0.9592799999999999
51,-0.12050999999999999
52,-0.8918
53,0.49651000000000006
54,0.65077
55,-0.8918
56,1.1135
57,-0.12050999999999999
58,-0.8918
59,1.1135
60,-0.12050999999999999
61,-0.8918
62,0.80503
63,0.188
64,-0.8918
65,0.49651000000000006
66,0.49651000000000006
67,-0.8918
68,1.1135
69,-0.27476999999999996
70,-0.8918
71,1.1135
72,-0.12050999999999999
73,-0.8918
74,1.4221
75,-0.42903
76,-0.8918
77,1.4221
78,-0.42903
79,-0.8918
80,1.2678
81,-0.12050999999999999
82,-0.8918
83,1.5763
84,-0.58328
85,-0.8918
86,1.8848
87,-0.8918
88,-0.8918
89,2.0391
90,-0.8918
91,-0.8918
92,1.8848
93,-0.8918
94,-0.27476999999999996
95,1.2678
