time,value
0,-0.188
1,-0.188
2,-0.188
3,-0.188
4,-0.188
5,-0.188
6,-0.188
7,-0.188
8,-0.188
9,-0.188
10,-0.188
11,-0.188
12,-0.188
13,-0.188
14,-0.188
15,-0.188
16,-0.188
17,-0.188
18,-0.188
19,-0.188
20,-0.188
21,-0.188
22,-0.188
23,-0.188
24,-0.188
25,-0.188
26,-0.188
27,-0.188
28,-0.188
29,-0.188
30,-0.188
31,-0.188
32,-0.188
33,-0.188
34,-0.188
35,-0.188
36,-0.188
37,-0.188
38,-0.188
39,-0.188
40,-0.188
41,-0.188
42,-0.188
43,-0.188
44,-0.188
45,-0.188
46,-0.188
47,-0.188
48,-0.188
49,-0.188
50,-0.188
51,-0.188
52,-0.188
53,-0.188
54,-0.188
55,-0.188
56,-0.188
57,-0.188
58,-0.188
59,-0.188
60,-0.188
61,-0.188
62,-0.188
63,-0.188
64,-0.188
65,-0.188
66,-0.188
67,-0.188
68,-0.188
69,-0.188
70,-0.188
71,-0.188
72,0.047921
73,2.8986
74,4.6876
75,0.16588
76,0.16588
77,0.99159
78,7.7742
79,-0.188
80,-0.188
81,-0.188
82,-0.188
83,-0.188
84,-0.188
85,-0.188
86,-0.188
87,-0.188
88,-0.188
89,-0.188
90,-0.188
91,-0.188
92,-0.188
93,-0.188
94,-0.188
95,-0.188
