time,value
0,0.46056
1,0.46056
2,0.65196
3,0.46056
4,0.65196
5,0.46056
6,0.65196
7,0.46056
8,0.65196
9,0.46056
10,0.46056
11,0.65196
12,0.65196
13,0.46056
14,0.46056
15,0.65196
16,0.46056
17,0.65196
18,0.46056
19,0.65196
20,0.46056
21,0.65196
22,0.46056
23,0.65196
24,0.46056
25,0.65196
26,0.46056
27,0.65196
28,0.46056
29,-0.30505
30,-0.68785
31,-0.68785
32,-0.68785
33,-0.68785
34,-0.68785
35,-0.68785
36,-0.68785
37,-0.68785
38,-0.68785
39,-0.68785
40,-0.11365
41,-0.68785
42,-0.68785
43,-0.68785
44,-0.68785
45,-0.68785
46,-0.68785
47,-0.68785
48,-0.68785
49,-0.68785
50,-0.68785
51,-0.68785
52,-0.68785
53,-0.68785
54,-0.68785
55,-0.68785
56,-0.30505
57,-0.68785
58,-0.68785
59,-0.68785
60,-0.68785
61,-0.68785
62,-0.68785
63,-0.68785
64,-0.68785
65,-0.68785
66,-0.68785
67,-0.68785
68,-0.68785
69,-0.68785
70,-0.68785
71,-0.68785
72,-0.68785
73,-0.68785
74,-0.68785
75,-0.68785
76,-0.68785
77,-0.68785
78,-0.68785
79,-0.68785
80,-0.68785
81,-0.68785
82,-0.68785
83,-0.68785
84,-0.30505
85,2.1832
86,1.9918
87,3.7144
88,2.7574
89,2.7574
90,2.7574
91,2.7574
92,2.5660000000000003
93,0.8433700000000001
94,-0.68785
95,-0.68785
