time,value
0,-0.63307
1,-0.5717399999999999
2,-0.55947
3,-0.5473100000000001
4,-0.5206
5,-0.50527
6,-0.51269
7,-0.5253
8,-0.5300199999999999
9,-0.53569
10,-0.55097
11,-0.5698300000000001
12,-0.5846100000000001
13,-0.59682
14,-0.61202
15,-0.62867
16,-0.64354
17,-0.65323
18,-0.65899
19,-0.65905
20,-0.65253
21,-0.63676
22,-0.61433
23,-0.58865
24,-0.56271
25,-0.53384
26,-0.50226
27,-0.46913999999999995
28,-0.43576000000000004
29,-0.39595
30,-0.34602
31,-0.28661
32,-0.22455999999999998
33,-0.16358
34,-0.10973
35,-0.070119
36,-0.053324
37,-0.061137000000000004
38,-0.09173400000000001
39,-0.14374
40,-0.21461
41,-0.29727
42,-0.37851
43,-0.45073
44,-0.5110600000000001
45,-0.56316
46,-0.60446
47,-0.63457
48,-0.65125
49,-0.65828
50,-0.65015
51,-0.61761
52,-0.5460699999999999
53,-0.43858
54,-0.30873
55,-0.18262
56,-0.070729
57,0.020412
58,0.09800299999999999
59,0.16127
60,0.21766
61,0.27044
62,0.32632
63,0.37858
64,0.41336000000000006
65,0.41733000000000003
66,0.38828
67,0.3375
68,0.27468000000000004
69,0.21291999999999997
70,0.15868
71,0.1269
72,0.1192
73,0.1423
74,0.19471
75,0.28659
76,0.41658999999999996
77,0.58408
78,0.77585
79,0.9844
80,1.1905
81,1.3799
82,1.5384
83,1.6719
84,1.7867
85,1.8942
86,2.0004
87,2.1169
88,2.2345
89,2.3246
90,2.3491
91,2.2923
92,2.1514
93,1.9362
94,1.676
95,1.4269
96,1.2204
97,1.0290000000000001
98,0.80381
99,0.55178
100,0.31973
101,0.12212999999999999
102,-0.06793300000000001
103,-0.24715
104,-0.3653
105,-0.41167
106,-0.44523
107,-0.52693
108,-0.63043
109,-0.7057100000000001
110,-0.73866
111,-0.77022
112,-0.80738
113,-0.83842
114,-0.8474299999999999
115,-0.85372
116,-0.86224
117,-0.87011
118,-0.8652200000000001
119,-0.85251
120,-0.8349200000000001
121,-0.81679
122,-0.7991199999999999
123,-0.7856
124,-0.77628
125,-0.7691600000000001
126,-0.76376
127,-0.7603300000000001
128,-0.75877
129,-0.7559600000000001
130,-0.75322
131,-0.75027
132,-0.75175
133,-0.75233
134,-0.75645
135,-0.75646
136,-0.76047
137,-0.7580399999999999
138,-0.75522
139,-0.7450600000000001
140,-0.73368
141,-0.71829
142,-0.7015899999999999
143,-0.6829999999999999
144,-0.66018
145,-0.6267699999999999
146,-0.57216
147,-0.49022
148,-0.37015
149,-0.19885999999999998
150,0.050506
151,0.4003
152,0.86413
153,1.4253
154,2.0425
155,2.6508
156,3.1887
157,3.6058
158,3.8727
159,3.9701
160,3.8982
161,3.6807
162,3.3718
163,3.0352
164,2.7218
165,2.4438
166,2.188
167,1.9355
168,1.6802
169,1.4165
170,1.1423
171,0.86936
172,0.62848
173,0.43259
174,0.2651
175,0.10490999999999999
176,-0.026008
177,-0.10121000000000001
178,-0.13152
179,-0.17289000000000002
180,-0.24619000000000002
181,-0.31225
182,-0.31876
183,-0.26331
184,-0.19697
185,-0.15798
186,-0.15092
187,-0.1453
188,-0.13012
189,-0.10602
190,-0.0927
191,-0.089107
192,-0.097321
193,-0.11310999999999999
194,-0.14263
195,-0.17933
196,-0.21636999999999998
197,-0.24664
198,-0.27408000000000005
199,-0.30086999999999997
200,-0.32965
201,-0.36213
202,-0.4016
203,-0.44491
204,-0.48594
205,-0.52122
206,-0.5525800000000001
207,-0.5807100000000001
208,-0.60383
209,-0.62254
210,-0.639
211,-0.65617
212,-0.6694100000000001
213,-0.67719
214,-0.67715
215,-0.67609
216,-0.67361
217,-0.6733899999999999
218,-0.67198
219,-0.67361
220,-0.6773100000000001
221,-0.6844399999999999
222,-0.68987
223,-0.69121
224,-0.68471
225,-0.66925
226,-0.6405
227,-0.59238
228,-0.52059
229,-0.42858
230,-0.32789
231,-0.2283
232,-0.13337000000000002
233,-0.043474
234,0.033549
235,0.087072
236,0.11238
237,0.1163
238,0.10592
239,0.084747
240,0.054547000000000005
241,0.022956999999999998
242,-0.0038124
243,-0.024054
244,-0.042049
245,-0.060425
246,-0.08382300000000001
247,-0.11731
248,-0.16465
249,-0.22119
250,-0.27949
251,-0.33468000000000003
252,-0.38693
253,-0.43265
254,-0.47068000000000004
255,-0.50267
256,-0.5331600000000001
257,-0.55758
258,-0.57422
259,-0.58906
260,-0.6085699999999999
261,-0.6232300000000001
262,-0.6250399999999999
263,-0.62759
264,-0.64552
265,-0.6608
266,-0.6459699999999999
267,-0.6258100000000001
268,-0.6617
269,-0.7657
