time,value
0,-0.1937
1,-0.17702
2,-0.22373
3,-0.17702
4,-0.22039
5,-0.22707
6,-0.18035
7,-0.22039
8,-0.18035
9,-0.20371
10,-0.21038
11,-0.18035
12,-0.22373
13,-0.18369000000000002
14,-0.20037
15,-0.21372
16,-0.17702
17,-0.22373
18,-0.18703
19,-0.20037
20,-0.22039
21,-0.19704000000000002
22,-0.23374
23,-0.18703
24,-0.1937
25,-0.20705
26,-0.16033
27,-0.21706
28,-0.18369000000000002
29,-0.19704000000000002
30,-0.19704000000000002
31,-0.17368
32,-0.18035
33,-0.21706
34,-0.18369000000000002
35,-0.17368
36,-0.22039
37,-0.19036
38,-0.18369000000000002
39,-0.23374
40,-0.17702
41,-0.20037
42,-0.22039
43,-0.17034000000000002
44,-0.21038
45,-0.22039
46,-0.18035
47,-0.22039
48,-0.21706
49,-0.1937
50,-0.21372
51,-0.22039
52,-0.1937
53,-0.21372
54,-0.22373
55,-0.19704000000000002
56,-0.22039
57,-0.22039
58,-0.18703
59,-0.23374
60,-0.21706
61,-0.19036
62,-0.24040999999999998
63,-0.20705
64,-0.20037
65,-0.24040999999999998
66,-0.19036
67,-0.22039
68,-0.2304
69,-0.19036
70,-0.23374
71,-0.19704000000000002
72,-0.19036
73,-0.23708
74,-0.20037
75,-0.20705
76,-0.23708
77,-0.18703
78,-0.21372
79,-0.21706
80,-0.19036
81,-0.23708
82,4.6344
83,5.7956
84,5.1616
85,3.0762
86,-0.17034000000000002
87,-0.17368
88,-0.16033
89,-0.2304
90,-0.17702
91,-0.20705
92,-0.18703
93,-0.16701
94,-0.20705
95,-0.22373
