time,value
0,1.1161
1,1.0228
2,0.9294399999999999
3,0.9294399999999999
4,-0.28389000000000003
5,-1.0305
6,-1.0305
7,-1.0305
8,-1.0305
9,-1.0305
10,-1.0305
11,-1.0305
12,1.3961
13,1.3028
14,1.1161
15,1.0228
16,0.9294399999999999
17,0.9294399999999999
18,0.46276999999999996
19,-1.0305
20,-1.0305
21,-1.0305
22,-1.0305
23,-1.0305
24,-1.0305
25,-1.0305
26,0.55611
27,1.3961
28,1.1161
29,1.0228
30,0.9294399999999999
31,0.9294399999999999
32,0.08944400000000001
33,-1.0305
34,-1.0305
35,-1.0305
36,-1.0305
37,-1.0305
38,-1.0305
39,-0.0038888000000000004
40,1.3028
41,1.2094
42,1.0228
43,0.9294399999999999
44,0.9294399999999999
45,0.9294399999999999
46,0.9294399999999999
47,0.8361
48,-1.0305
49,-1.0305
50,-1.0305
51,-1.0305
52,-1.0305
53,-1.0305
54,-1.0305
55,0.46276999999999996
56,1.3961
57,1.1161
58,1.0228
59,0.9294399999999999
60,0.9294399999999999
61,0.9294399999999999
62,-0.097221
63,-1.0305
64,-1.0305
65,-1.0305
66,-1.0305
67,-1.0305
68,-1.0305
69,-1.0305
70,1.0228
71,1.3028
72,1.0228
73,1.0228
74,0.9294399999999999
75,0.9294399999999999
76,0.8361
77,0.8361
78,-0.56388
79,-1.0305
80,-1.0305
81,-1.0305
82,-1.0305
83,-1.0305
84,-1.0305
85,-0.37722
86,1.3028
87,1.2094
88,1.0228
89,0.9294399999999999
90,0.9294399999999999
91,0.9294399999999999
92,-0.65722
93,-1.0305
94,-1.0305
95,-1.0305
