[<text>
<title>gantos inc &lt;gtos&gt; 4th qtr jan 31 net</title>
<dateline>    grand rapids, mich., march 17 -
    </dateline>shr 43 cts vs 37 cts
    net 2,276,000 vs 1,674,000
    sales 31.9 mln vs 23.9 mln
    avg shrs 5.3 mln vs 4.5 mln
    year
    shr 90 cts vs 69 cts
    net 4,508,000 vs 3,096,000
    sales 98.4 mln vs 75.0 mln
    avg shrs 5.0 mln vs 4.5 mln
 reuter
</text>]