time,value
0,-0.51031
1,-0.51031
2,1.9392
3,-0.51031
4,-0.51031
5,-0.51031
6,1.9392
7,-0.51031
8,-0.51031
9,-0.51031
10,1.9392
11,-0.51031
12,-0.51031
13,-0.51031
14,1.9392
15,-0.51031
16,-0.51031
17,-0.51031
18,1.9392
19,-0.51031
20,-0.51031
21,-0.51031
22,1.9392
23,-0.51031
24,-0.51031
25,-0.51031
26,1.9392
27,-0.51031
28,-0.51031
29,-0.51031
30,1.9392
31,-0.51031
32,-0.51031
33,-0.51031
34,1.9392
35,-0.51031
36,-0.51031
37,-0.51031
38,1.9392
39,-0.51031
40,-0.51031
41,-0.51031
42,-0.51031
43,1.9392
44,-0.51031
45,-0.51031
46,-0.51031
47,-0.51031
48,1.9392
49,-0.51031
50,-0.51031
51,-0.51031
52,-0.51031
53,1.9392
54,-0.51031
55,-0.51031
56,-0.51031
57,-0.51031
58,-0.51031
59,-0.51031
60,-0.51031
61,-0.51031
62,-0.51031
63,-0.51031
64,1.9392
65,-0.51031
66,-0.51031
67,-0.51031
68,-0.51031
69,1.9392
70,-0.51031
71,-0.51031
72,-0.51031
73,1.9392
74,-0.51031
75,-0.51031
76,-0.51031
77,1.9392
78,-0.51031
79,-0.51031
80,-0.51031
81,1.9392
82,-0.51031
83,-0.51031
84,-0.51031
85,-0.51031
86,1.9392
87,-0.51031
88,-0.51031
89,-0.51031
90,1.9392
91,-0.51031
92,-0.51031
93,-0.51031
94,-0.51031
95,-0.51031
