time,value
0,-0.26781
1,-0.26781
2,-0.26781
3,-0.26781
4,-0.26781
5,-0.26781
6,-0.26781
7,-0.26781
8,-0.26781
9,-0.26781
10,-0.26781
11,-0.26781
12,-0.26781
13,-0.26781
14,-0.26781
15,-0.26781
16,-0.26781
17,-0.26781
18,-0.26781
19,-0.26781
20,-0.26781
21,-0.26781
22,-0.26781
23,-0.26781
24,-0.26781
25,-0.26781
26,-0.26781
27,-0.26781
28,-0.26781
29,-0.26781
30,-0.26781
31,-0.26781
32,-0.26781
33,-0.26781
34,-0.26781
35,-0.26781
36,-0.26781
37,-0.26781
38,-0.26781
39,-0.26781
40,-0.26781
41,-0.26781
42,-0.26781
43,-0.26781
44,-0.26781
45,-0.26781
46,-0.26781
47,-0.26781
48,-0.26781
49,-0.26781
50,-0.1509
51,3.4628
52,1.2946
53,-0.26781
54,-0.26781
55,-0.26781
56,-0.26781
57,-0.26781
58,-0.26781
59,-0.26781
60,-0.26781
61,-0.26781
62,-0.26781
63,-0.26781
64,-0.26781
65,-0.26781
66,-0.26781
67,-0.26781
68,5.0464
69,3.2821
70,3.6222
71,4.6425
72,2.0386
73,0.06166699999999999
74,-0.26781
75,-0.26781
76,-0.26781
77,-0.26781
78,-0.26781
79,-0.26781
80,-0.26781
81,-0.26781
82,-0.26781
83,-0.26781
84,-0.26781
85,-0.26781
86,-0.26781
87,-0.26781
88,-0.26781
89,-0.26781
90,-0.26781
91,-0.26781
92,-0.26781
93,-0.26781
94,-0.26781
95,-0.26781
