time,value
0,-2.2302
1,-2.2302
2,-2.2382
3,-2.2463
4,-2.2489
5,-2.2489
6,-2.2489
7,-2.2489
8,-2.2489
9,-2.2489
10,-2.2488
11,-2.2486
12,-2.2483
13,-2.2478
14,-2.2473
15,-2.2467
16,-2.2459
17,-2.2451
18,-2.2442
19,-2.2431
20,-2.242
21,-2.2408
22,-2.2394
23,-2.238
24,-2.2365
25,-2.2348
26,-2.2331
27,-2.2339
28,-2.2319999999999998
29,-2.23
30,-2.2279
31,-2.2257
32,-2.2234
33,-2.221
34,-2.2186
35,-2.2159999999999997
36,-2.2134
37,-2.2106
38,-2.2078
39,-2.2049
40,-2.2044
41,-2.2108
42,-2.2172
43,-2.2151
44,-2.2118
45,-2.2085
46,-2.2051
47,-2.2016
48,-2.198
49,-2.1944
50,-2.1907
51,-2.1869
52,-2.1830000000000003
53,-2.1791
54,-2.1751
55,-2.171
56,-2.1668
57,-2.1626
58,-2.1584
59,-2.154
60,-2.1496
61,-2.1452
62,-2.1406
63,-2.1361
64,-2.1314
65,-2.1283
66,-2.1235
67,-2.1209
68,-2.116
69,-2.1111
70,-2.1062
71,-2.1011
72,-2.0961
73,-2.0909999999999997
74,-2.0858
75,-2.0806
76,-2.0753
77,-2.07
78,-2.0647
79,-2.0593
80,-2.0614
81,-2.0655
82,-2.0637
83,-2.0601
84,-2.0545
85,-2.0488
86,-2.0431
87,-2.0373
88,-2.0316
89,-2.0257
90,-2.0199
91,-2.0140000000000002
92,-2.0081
93,-2.0021
94,-1.9961
95,-1.9901
96,-1.984
97,-1.9779
98,-1.9718
99,-1.9657
100,-1.9612
101,-1.955
102,-1.9488
103,-1.9425
104,-1.9362
105,-1.9299
106,-1.9235
107,-1.9171
108,-1.9107
109,-1.9043
110,-1.8978
111,-1.8914
112,-1.8849
113,-1.8799
114,-1.8846
115,-1.8833
116,-1.8782
117,-1.8715
118,-1.8649
119,-1.8582
120,-1.8515
121,-1.8447
122,-1.838
123,-1.8312
124,-1.8244
125,-1.8176
126,-1.8108
127,-1.8054
128,-1.7985
129,-1.7917
130,-1.7848
131,-1.7779
132,-1.7709
133,-1.764
134,-1.7571
135,-1.7501
136,-1.7481
137,-1.7497
138,-1.75
139,-1.7429
140,-1.7358
141,-1.7288
142,-1.7217
143,-1.7145
144,-1.7074
145,-1.7003
146,-1.6931
147,-1.686
148,-1.6788
149,-1.6716
150,-1.6645
151,-1.6573
152,-1.65
153,-1.6428
154,-1.6356
155,-1.6283
156,-1.6211
157,-1.6138
158,-1.6066
159,-1.5993
160,-1.5919999999999999
161,-1.5847
162,-1.5774
163,-1.5701
164,-1.5627
165,-1.5567
166,-1.551
167,-1.5451
168,-1.5378
169,-1.5305
170,-1.5232
171,-1.5148
172,-1.5074
173,-1.5001
174,-1.4928
175,-1.4845
176,-1.4812
177,-1.4752
178,-1.4679
179,-1.4606
180,-1.4521
181,-1.4448
182,-1.4374
183,-1.4301
184,-1.4216
185,-1.4169999999999998
186,-1.4137
187,-1.4052
188,-1.3979
189,-1.3906
190,-1.3832
191,-1.3747
192,-1.3674
193,-1.36
194,-1.354
195,-1.3519
196,-1.3461
197,-1.3401
198,-1.3328
199,-1.3254
200,-1.318
201,-1.3096
202,-1.3022
203,-1.2948
204,-1.2864
205,-1.2818
206,-1.2785
207,-1.2701
208,-1.2627
209,-1.2553
210,-1.2469
211,-1.2395
212,-1.2321
213,-1.2247
214,-1.2187
215,-1.2131
216,-1.2074
217,-1.2
218,-1.1926
219,-1.1852
220,-1.1778
221,-1.1694
222,-1.162
223,-1.1546
224,-1.1489
225,-1.1433
226,-1.1373
227,-1.1299
228,-1.1225
229,-1.1151
230,-1.1077
231,-1.0992
232,-1.0918
233,-1.0834
234,-1.0777
235,-1.0746
236,-1.0672
237,-1.0598
238,-1.0524
239,-1.045
240,-1.0375
241,-1.0301
242,-1.0227
243,-1.0142
244,-1.0068
245,-0.99934
246,-0.9918899999999999
247,-0.98444
248,-0.9759700000000001
249,-0.9704299999999999
250,-0.96734
251,-0.95991
252,-0.95247
253,-0.9450200000000001
254,-0.93758
255,-0.9301200000000001
256,-0.92266
257,-0.91419
258,-0.9067299999999999
259,-0.8992600000000001
260,-0.89179
261,-0.8873
262,-0.88179
263,-0.8772700000000001
264,-0.86982
265,-0.86236
266,-0.8548899999999999
267,-0.8474200000000001
268,-0.83995
269,-0.8314799999999999
270,-0.8240000000000001
271,-0.8165100000000001
272,-0.80902
273,-0.80153
274,-0.79404
275,-0.78556
276,-0.77958
277,-0.7741399999999999
278,-0.7721600000000001
279,-0.76467
280,-0.7571899999999999
281,-0.74871
282,-0.74122
283,-0.7337199999999999
284,-0.72622
285,-0.7187100000000001
286,-0.7127399999999999
287,-0.70731
288,-0.70436
289,-0.69687
290,-0.68938
291,-0.68188
292,-0.67438
293,-0.66687
294,-0.6584
295,-0.65089
296,-0.64337
297,-0.6358600000000001
298,-0.62834
299,-0.6239100000000001
300,-0.61851
301,-0.61406
302,-0.60656
303,-0.59905
304,-0.59153
305,-0.58402
306,-0.5765
307,-0.56802
308,-0.5604899999999999
309,-0.55296
310,-0.54543
311,-0.5379
312,-0.53036
313,-0.52282
314,-0.51685
315,-0.51151
316,-0.5061399999999999
317,-0.49862
318,-0.49108
319,-0.48355
320,-0.47601000000000004
321,-0.46847
322,-0.45998999999999995
323,-0.45496000000000003
324,-0.44741000000000003
325,-0.43986000000000003
326,-0.4323
327,-0.42475
328,-0.41718999999999995
329,-0.41213999999999995
330,-0.40962
331,-0.4071
332,-0.40206
333,-0.39357
334,-0.39265
335,-0.38921
336,-0.38073
337,-0.37224
338,-0.36376
339,-0.36283000000000004
340,-0.36030999999999996
341,-0.35619
342,-0.34953
343,-0.34196
344,-0.33438
345,-0.3268
346,-0.31922
347,-0.31073
348,-0.3073
349,-0.30477
350,-0.30224
351,-0.29466
352,-0.28707
353,-0.28201
354,-0.28201
355,-0.27948
356,-0.27188
357,-0.26428
358,-0.2558
359,-0.2482
360,-0.23970999999999998
361,-0.23451
362,-0.23181999999999997
363,-0.22424000000000002
364,-0.21664
365,-0.20815999999999998
366,-0.20056
367,-0.19296
368,-0.19029000000000001
369,-0.18506
370,-0.17911
371,-0.17152
372,-0.16393
373,-0.15545
374,-0.14786
375,-0.14026
376,-0.13267
377,-0.12507000000000001
378,-0.12239000000000001
379,-0.11717000000000001
380,-0.11120999999999999
381,-0.10363
382,-0.096041
383,-0.088447
384,-0.080853
385,-0.072366
386,-0.06477000000000001
387,-0.05717100000000001
388,-0.049569
389,-0.041964999999999995
390,-0.034358
391,-0.026748
392,-0.019136
393,-0.011523
394,-0.0039064
395,0.0037116
396,0.011335
397,0.018958000000000003
398,0.026583999999999997
399,0.034212
400,0.041841
401,0.049475
402,0.057109
403,0.064748
404,0.072387
405,0.080874
406,0.085969
407,0.091061
408,0.093627
409,0.10126
410,0.10889000000000001
411,0.11653
412,0.12415999999999999
413,0.13265
414,0.14029
415,0.14793
416,0.15387
417,0.15642
418,0.16153
419,0.16662000000000002
420,0.17425
421,0.18189
422,0.18952
423,0.19716
424,0.2048
425,0.21245
426,0.22093000000000002
427,0.22858
428,0.23621999999999999
429,0.24386999999999998
430,0.25151999999999997
431,0.25918
432,0.26683
433,0.27449
434,0.28215
435,0.28981
436,0.29746999999999996
437,0.30514
438,0.3128
439,0.32047
440,0.32814
441,0.33582
442,0.34349
443,0.34605
444,0.35117
445,0.35965
446,0.36733000000000005
447,0.37501
448,0.38013
449,0.3835
450,0.38431
451,0.39279000000000003
452,0.39791
453,0.40559
454,0.41247
455,0.41936
456,0.42625
457,0.42546000000000006
458,0.42801999999999996
459,0.43316000000000004
460,0.44085
461,0.44085
462,0.44342
463,0.44598000000000004
464,0.45368
465,0.46138
466,0.46908999999999995
467,0.47678999999999994
468,0.4845
469,0.4922
470,0.49991
471,0.50762
472,0.5153300000000001
473,0.52305
474,0.52896
475,0.53385
476,0.5361899999999999
477,0.54389
478,0.5516
479,0.5593
480,0.56702
481,0.57472
482,0.58244
483,0.59015
484,0.59787
485,0.60558
486,0.61407
487,0.62179
488,0.62951
489,0.63647
490,0.6441899999999999
491,0.65268
492,0.6604
493,0.66813
494,0.67586
495,0.6835899999999999
496,0.6913199999999999
497,0.69906
498,0.7067899999999999
499,0.71453
500,0.72117
501,0.72342
502,0.72858
503,0.73631
504,0.7440399999999999
505,0.7517699999999999
506,0.75951
507,0.76725
508,0.77498
509,0.77757
510,0.77683
511,0.77461
512,0.77242
513,0.7702399999999999
514,0.76808
515,0.76594
516,0.76381
517,0.76122
518,0.75345
519,0.74568
520,0.73792
521,0.73016
522,0.72239
523,0.71463
524,0.70687
525,0.69911
526,0.6913600000000001
527,0.6836
528,0.67585
529,0.66809
530,0.6603399999999999
531,0.65259
532,0.64484
533,0.63636
534,0.62861
535,0.62087
536,0.61312
537,0.60538
538,0.60133
539,0.59655
540,0.5899300000000001
541,0.58218
542,0.5737
543,0.56595
544,0.5582
545,0.55561
546,0.55303
547,0.55045
548,0.5427
549,0.5401199999999999
550,0.53754
551,0.5331100000000001
552,0.52537
553,0.51947
554,0.51689
555,0.51431
556,0.50657
557,0.49883
558,0.49367
559,0.49367
560,0.49108999999999997
561,0.48886999999999997
562,0.48666000000000004
563,0.48076
564,0.47302
565,0.46526999999999996
566,0.45679
567,0.44905
568,0.445
569,0.44022
570,0.43618999999999997
571,0.42843000000000003
572,0.42068
573,0.4122
574,0.40445
575,0.39783
576,0.39307
577,0.38645999999999997
578,0.3787
579,0.37023
580,0.36246999999999996
581,0.3573
582,0.35069
583,0.34595
584,0.33935
585,0.33159
586,0.32382
587,0.31535
588,0.30758
589,0.30286
590,0.29815
591,0.29486
592,0.28708
593,0.27931999999999996
594,0.27155
595,0.26378
596,0.2553
597,0.24754
598,0.23976999999999998
599,0.23201
600,0.22425
601,0.21649000000000002
602,0.21435
603,0.20963
604,0.20375
605,0.19598
606,0.1875
607,0.17973
608,0.17196
609,0.16796
610,0.16327
611,0.15667999999999999
612,0.14891
613,0.14044
614,0.13266
615,0.12489000000000001
616,0.1209
617,0.11622
618,0.11225
619,0.10447000000000001
620,0.09599400000000001
621,0.091343
622,0.089305
623,0.08343500000000001
624,0.07496599999999999
625,0.068425
626,0.063822
627,0.059897000000000006
628,0.05209199999999999
629,0.043626
630,0.035823
631,0.02802
632,0.021491999999999997
633,0.016915
634,0.013005000000000001
635,0.0051936000000000005
636,-0.0026173999999999998
637,-0.010426000000000001
638,-0.018234
639,-0.026697000000000002
640,-0.034506
641,-0.042308
642,-0.04623
643,-0.050793
644,-0.054696
645,-0.06251
646,-0.070323
647,-0.078137
648,-0.0866
649,-0.094411
650,-0.10222
651,-0.11002999999999999
652,-0.11394000000000001
653,-0.11849000000000001
654,-0.12239000000000001
655,-0.1302
656,-0.13867000000000002
657,-0.14057999999999998
658,-0.14247
659,-0.14435
660,-0.14619000000000001
661,-0.15064
662,-0.15244000000000002
663,-0.15423
664,-0.15802
665,-0.16588
666,-0.17432
667,-0.18218
668,-0.18218
669,-0.18277000000000002
670,-0.18450999999999998
671,-0.18624000000000002
672,-0.18794
673,-0.18962
674,-0.19127
675,-0.19182000000000002
676,-0.18919
677,-0.1813
678,-0.17342
679,-0.16552999999999998
680,-0.15818
681,-0.15029
682,-0.1424
683,-0.1345
684,-0.12661
685,-0.12503
686,-0.12395999999999999
687,-0.12235
688,-0.11444000000000001
689,-0.10654000000000001
690,-0.098631
691,-0.091225
692,-0.083315
693,-0.075402
694,-0.067491
695,-0.065843
696,-0.06467
697,-0.062993
698,-0.05506900000000001
699,-0.047619999999999996
700,-0.039694
701,-0.031768
702,-0.027419
703,-0.024775
704,-0.022131
705,-0.014202000000000001
706,-0.0062714
707,0.0016635999999999999
708,0.009595600000000001
709,0.01753
710,0.020174
711,0.022821
712,0.026382999999999997
713,0.034317
714,0.042249
715,0.050183
716,0.058117999999999996
717,0.066511
718,0.074446
719,0.08238
720,0.090317
721,0.09825199999999999
722,0.10400000000000001
723,0.10802
724,0.11205999999999999
725,0.12045
726,0.12885
727,0.13292
728,0.13699999999999998
729,0.14492
730,0.15284
731,0.16076
732,0.16868
733,0.17709
734,0.18500999999999998
735,0.19293
736,0.20085999999999998
737,0.20878000000000002
738,0.21670999999999999
739,0.21935
740,0.222
741,0.22464
742,0.23256999999999997
743,0.23521
744,0.23831999999999998
745,0.24095999999999998
746,0.24936
747,0.25776
748,0.26616
749,0.27457
750,0.28249
751,0.28513
752,0.28561
753,0.28872
754,0.29665
755,0.30457
756,0.3125
757,0.32042
758,0.32835
759,0.33628
760,0.34421
761,0.35214
762,0.36006
763,0.36441999999999997
764,0.36707
765,0.37235
766,0.38028
767,0.38776
768,0.39524000000000004
769,0.40271999999999997
770,0.41021
771,0.41286000000000006
772,0.41286000000000006
773,0.4208
774,0.42654
775,0.42963999999999997
776,0.42963999999999997
777,0.43493000000000004
778,0.44287
779,0.45081000000000004
780,0.45301
781,0.45566
782,0.4636
783,0.4689
784,0.47153999999999996
785,0.47198
786,0.48036999999999996
787,0.48876000000000003
788,0.49713999999999997
789,0.49759
790,0.50024
791,0.50553
792,0.51347
793,0.52141
794,0.52935
795,0.5372899999999999
796,0.54524
797,0.55318
798,0.56112
799,0.56907
800,0.57701
801,0.57835
802,0.57707
803,0.5823699999999999
804,0.59032
805,0.59827
806,0.60622
807,0.61417
808,0.62212
809,0.63008
810,0.63803
811,0.64375
812,0.6450199999999999
813,0.64853
814,0.6564800000000001
815,0.66443
816,0.67238
817,0.68033
818,0.68828
819,0.69623
820,0.70418
821,0.7125600000000001
822,0.72051
823,0.72846
824,0.73641
825,0.74437
826,0.75232
827,0.76027
828,0.76781
829,0.77577
830,0.78372
831,0.79168
832,0.79964
833,0.8075899999999999
834,0.81555
835,0.8235100000000001
836,0.83147
837,0.8394299999999999
838,0.84739
839,0.85269
840,0.86065
841,0.86861
842,0.8765799999999999
843,0.8845299999999999
844,0.8925
845,0.90046
846,0.9084200000000001
847,0.91638
848,0.91785
849,0.9166799999999999
850,0.9242600000000001
851,0.9322299999999999
852,0.9402
853,0.9481700000000001
854,0.95614
855,0.96411
856,0.9717
857,0.97967
858,0.98764
859,0.9956200000000001
860,1.0036
861,1.0119
862,1.0199
863,1.0279
864,1.0359
865,1.0438
866,1.0518
867,1.0598
868,1.0678
869,1.0757
870,1.0837
871,1.0917
872,1.0997
873,1.1076
874,1.1153
875,1.1232
876,1.1312
877,1.1392
878,1.1472
879,1.1551
880,1.1631
881,1.1681
882,1.1697
883,1.1686
884,1.1766
885,1.1846
886,1.1926
887,1.2006
888,1.2086
889,1.2165
890,1.2245
891,1.2325
892,1.2405
893,1.2485
894,1.2568
895,1.2605
896,1.2609
897,1.2688
898,1.2768
899,1.2848
900,1.2928
901,1.3008
902,1.3088
903,1.3168
904,1.3168
905,1.3184
906,1.3204
907,1.328
908,1.3307
909,1.3297
910,1.3287
911,1.3278
912,1.3268
913,1.3259
914,1.325
915,1.3241
916,1.3214
917,1.3131
918,1.3099
919,1.3063
920,1.3031
921,1.2951
922,1.2871
923,1.2791
924,1.2708
925,1.2628
926,1.2547
927,1.2467
928,1.2387
929,1.2307
930,1.2227
931,1.2147
932,1.207
933,1.199
934,1.1909999999999998
935,1.186
936,1.1839
937,1.1839
938,1.1759
939,1.1679
940,1.1599
941,1.1519
942,1.1439
943,1.1385
944,1.1385
945,1.135
946,1.127
947,1.119
948,1.111
949,1.1027
950,1.0947
951,1.0867
952,1.0786
953,1.073
954,1.0695
955,1.0686
956,1.0606
957,1.0526
958,1.0446
959,1.0363
960,1.0283
961,1.0203
962,1.0123
963,1.0066
964,1.0031
965,1.0023
966,0.9969299999999999
967,0.98892
968,0.9835799999999999
969,0.97557
970,0.9675600000000001
971,0.9595600000000001
972,0.95155
973,0.9435399999999999
974,0.93553
975,0.9275200000000001
976,0.9195200000000001
977,0.91151
978,0.9035
979,0.8952100000000001
980,0.8872
981,0.8791899999999999
982,0.8711899999999999
983,0.86318
984,0.8548899999999999
985,0.8516600000000001
986,0.85082
987,0.8425299999999999
988,0.83452
989,0.82652
990,0.8185100000000001
991,0.8105
992,0.8024899999999999
993,0.79448
994,0.7861899999999999
995,0.77818
996,0.77017
997,0.7621600000000001
998,0.75415
999,0.7461399999999999
1000,0.7381300000000001
1001,0.7301300000000001
1002,0.72451
1003,0.72101
1004,0.71753
1005,0.7095100000000001
1006,0.7015
1007,0.6934899999999999
1008,0.68548
1009,0.67747
1010,0.66946
1011,0.6614399999999999
1012,0.6534300000000001
1013,0.64542
1014,0.6371399999999999
1015,0.62913
1016,0.62112
1017,0.61311
1018,0.60509
1019,0.59708
1020,0.5936
1021,0.59013
1022,0.58186
1023,0.57384
1024,0.56583
1025,0.55755
1026,0.5495399999999999
1027,0.54152
1028,0.53351
1029,0.52764
1030,0.5242100000000001
1031,0.51836
1032,0.51034
1033,0.50232
1034,0.49431
1035,0.48628999999999994
1036,0.47827
1037,0.47
1038,0.46198999999999996
1039,0.45397
1040,0.44595
1041,0.44035
1042,0.43693999999999994
1043,0.43354
1044,0.42528999999999995
1045,0.41703
1046,0.41633000000000003
1047,0.41298
1048,0.40496
1049,0.39693
1050,0.38891
1051,0.38088
1052,0.37263
1053,0.36461
1054,0.35659
1055,0.35079
1056,0.34747
1057,0.34705
1058,0.33902
1059,0.33099
1060,0.32295999999999997
1061,0.31473
1062,0.3067
1063,0.29867
1064,0.29064
1065,0.28776
1066,0.28446
1067,0.2812
1068,0.27316
1069,0.26513000000000003
1070,0.2571
1071,0.24906999999999999
1072,0.24104
1073,0.23301
1074,0.22478
1075,0.21675
1076,0.20872
1077,0.20069
1078,0.19266
1079,0.18463
1080,0.1766
1081,0.16857
1082,0.16054000000000002
1083,0.15498
1084,0.15172
1085,0.15116
1086,0.14313
1087,0.13509000000000002
1088,0.12705999999999998
1089,0.11902
1090,0.11080999999999999
1091,0.10277
1092,0.09474099999999999
1093,0.086707
1094,0.078673
1095,0.07064
1096,0.067593
1097,0.067233
1098,0.06135499999999999
1099,0.053318
1100,0.045285
1101,0.037076
1102,0.029039999999999996
1103,0.021004
1104,0.015646
1105,0.015646
1106,0.015147
1107,0.014669
1108,0.014213
1109,0.01378
1110,0.013369999999999998
1111,0.013109
1112,0.013109
1113,0.021151
1114,0.02907
1115,0.037114
1116,0.03943
1117,0.041774
1118,0.047029
1119,0.055074
1120,0.06312100000000001
1121,0.071168
1122,0.079213
1123,0.087155
1124,0.095203
1125,0.10325
1126,0.11129000000000001
1127,0.11934000000000002
1128,0.12460999999999998
1129,0.12432
1130,0.12673
1131,0.13477999999999998
1132,0.14282999999999998
1133,0.1508
1134,0.15885
1135,0.16689
1136,0.16666
1137,0.16913
1138,0.17443
1139,0.18248
1140,0.19047
1141,0.19852
1142,0.20656999999999998
1143,0.21461999999999998
1144,0.22266999999999998
1145,0.23071999999999998
1146,0.23071999999999998
1147,0.23340999999999998
1148,0.23876999999999998
1149,0.24681999999999998
1150,0.25487
1151,0.25756
1152,0.26024
1153,0.26292
1154,0.27097
1155,0.27902
1156,0.28708
1157,0.29513
1158,0.30324
1159,0.31129
1160,0.31934
1161,0.32739
1162,0.33544
1163,0.34349
1164,0.35154
1165,0.35959
1166,0.36764
1167,0.37569
1168,0.38374
1169,0.39179
1170,0.39984000000000003
1171,0.40789000000000003
1172,0.41594
1173,0.42399
1174,0.43204
1175,0.4401
1176,0.44815
1177,0.4562
1178,0.46425
1179,0.47223999999999994
1180,0.48028999999999994
1181,0.48833999999999994
1182,0.49638999999999994
1183,0.50444
1184,0.51249
1185,0.52054
1186,0.52859
1187,0.53117
1188,0.53371
1189,0.5363100000000001
1190,0.5443600000000001
1191,0.5524100000000001
1192,0.5604600000000001
1193,0.56847
1194,0.57653
1195,0.58458
1196,0.59263
1197,0.59521
1198,0.5978
1199,0.60583
1200,0.61388
1201,0.6219399999999999
1202,0.6299899999999999
1203,0.6380399999999999
1204,0.6460899999999999
1205,0.6541399999999999
1206,0.66218
1207,0.67023
1208,0.67828
1209,0.68633
1210,0.69438
1211,0.70244
1212,0.71049
1213,0.71854
1214,0.72391
1215,0.72659
1216,0.7319399999999999
1217,0.73998
1218,0.7480100000000001
1219,0.75068
1220,0.75337
1221,0.75874
1222,0.76679
1223,0.76947
1224,0.76947
1225,0.77752
1226,0.78289
1227,0.79094
1228,0.7936300000000001
1229,0.7963
1230,0.80166
1231,0.8097
1232,0.8097
1233,0.81239
1234,0.82044
1235,0.82849
1236,0.83654
1237,0.84459
1238,0.85265
1239,0.8553299999999999
1240,0.8553299999999999
1241,0.8633799999999999
1242,0.87144
1243,0.8794799999999999
1244,0.8821700000000001
1245,0.8821700000000001
1246,0.8902200000000001
1247,0.89828
1248,0.90633
1249,0.9143899999999999
1250,0.91707
1251,0.91976
1252,0.9224399999999999
1253,0.9305
1254,0.93855
1255,0.9466100000000001
1256,0.9546600000000001
1257,0.9627100000000001
1258,0.9707600000000001
1259,0.97882
1260,0.98687
1261,0.99492
1262,1.003
1263,1.011
1264,1.0191
1265,1.0271
1266,1.0352
1267,1.0432
1268,1.0513
1269,1.0513
1270,1.054
1271,1.0593
1272,1.0674
1273,1.0754
1274,1.0835
1275,1.0915
1276,1.0996
1277,1.1076
1278,1.1103
1279,1.113
1280,1.113
1281,1.1211
1282,1.1291
1283,1.1372
1284,1.1452
1285,1.1533
1286,1.1613
1287,1.1694
1288,1.1775
1289,1.1855
1290,1.1936
1291,1.1963
1292,1.199
1293,1.2044
1294,1.2125
1295,1.2205
1296,1.2286
1297,1.2366
1298,1.2447
1299,1.2527
1300,1.2608
1301,1.2688
1302,1.2769
1303,1.285
1304,1.2930000000000001
1305,1.301
1306,1.3091
1307,1.3171
1308,1.3252
1309,1.3332
1310,1.3413
1311,1.3493
1312,1.3574
1313,1.3655
1314,1.3735
1315,1.3816
1316,1.3896
1317,1.3977
1318,1.4057
1319,1.4138
1320,1.4218
1321,1.4299
1322,1.4379
1323,1.446
1324,1.454
1325,1.4621
1326,1.4702
1327,1.4782
1328,1.4863
1329,1.4943
1330,1.5024
1331,1.5104
1332,1.5185
1333,1.5213
1334,1.5213
1335,1.5294
1336,1.5375
1337,1.5455
1338,1.5536
1339,1.5617
1340,1.5618
1341,1.5646
1342,1.5727
1343,1.5781
1344,1.5782
1345,1.5783
1346,1.5785
1347,1.5787
1348,1.5789
1349,1.5791
1350,1.5793
1351,1.5794
1352,1.5714
1353,1.5634
1354,1.5554
1355,1.55
1356,1.5475
1357,1.5451
1358,1.5372
1359,1.5292
1360,1.5211
1361,1.5131
1362,1.505
1363,1.4969999999999999
1364,1.4889
1365,1.4809
1366,1.4728
1367,1.4648
1368,1.4646
1369,1.4619
1370,1.4539
1371,1.4458
1372,1.4378
1373,1.4297
1374,1.4217
1375,1.4163
1376,1.4163
1377,1.4138
1378,1.4059
1379,1.3979
1380,1.3929
1381,1.3932
1382,1.3853
1383,1.3772
1384,1.3749
1385,1.3726
1386,1.3673
1387,1.3593
1388,1.3513
1389,1.3432
1390,1.3352
1391,1.3271
1392,1.3191
1393,1.311
1394,1.3030000000000002
1395,1.295
1396,1.2869
1397,1.2789
1398,1.2708
1399,1.2628
1400,1.2547
1401,1.2467
1402,1.2387
1403,1.2306
1404,1.2226
1405,1.2145
1406,1.2065
1407,1.1984
1408,1.1904
1409,1.1823
1410,1.1743
1411,1.1664
1412,1.1584
1413,1.1503
1414,1.1423
1415,1.1342
1416,1.1262
1417,1.1181
1418,1.1186
1419,1.1163
1420,1.1111
1421,1.1031
1422,1.095
1423,1.0871
1424,1.0791
1425,1.0767
1426,1.0745
1427,1.0695
1428,1.0614
1429,1.0534
1430,1.0454
1431,1.0373
1432,1.0293
1433,1.0213
1434,1.0132
1435,1.0052
1436,0.99715
1437,0.98911
1438,0.98108
1439,0.97304
1440,0.9651700000000001
1441,0.95714
1442,0.9491
1443,0.9410700000000001
1444,0.9330299999999999
1445,0.92499
1446,0.91696
1447,0.9091
1448,0.9067799999999999
1449,0.90464
1450,0.8968
1451,0.88876
1452,0.8807299999999999
1453,0.8727
1454,0.86467
1455,0.8566299999999999
1456,0.8486
1457,0.84057
1458,0.83273
1459,0.8247
1460,0.81667
1461,0.8086399999999999
1462,0.8006
1463,0.79257
1464,0.78454
1465,0.77651
1466,0.76848
1467,0.76045
1468,0.75242
1469,0.74439
1470,0.73616
1471,0.72813
1472,0.7201
1473,0.71207
1474,0.70404
1475,0.696
1476,0.68797
1477,0.67994
1478,0.67191
1479,0.66388
1480,0.65585
1481,0.6552600000000001
1482,0.6520100000000001
1483,0.64647
1484,0.6411100000000001
1485,0.63308
1486,0.62505
1487,0.6170100000000001
1488,0.60898
1489,0.60095
1490,0.59291
1491,0.5848800000000001
1492,0.57685
1493,0.56882
1494,0.56633
1495,0.56425
1496,0.56218
1497,0.55682
1498,0.5488
1499,0.54077
1500,0.53295
1501,0.5249199999999999
1502,0.51689
1503,0.5088699999999999
1504,0.50105
1505,0.49903000000000003
1506,0.4997
1507,0.49167
1508,0.48365
1509,0.47563
1510,0.4676
1511,0.45958000000000004
1512,0.45156
1513,0.44354
1514,0.43551000000000006
1515,0.42772
1516,0.4197
1517,0.41168000000000005
1518,0.40365999999999996
1519,0.39564
1520,0.38761999999999996
1521,0.3796
1522,0.37156999999999996
1523,0.36332
1524,0.3553
1525,0.34726999999999997
1526,0.33925
1527,0.33123
1528,0.32321
1529,0.31495
1530,0.31425
1531,0.31089
1532,0.30287
1533,0.29484
1534,0.28681999999999996
1535,0.27879
1536,0.27076999999999996
1537,0.26275
1538,0.2545
1539,0.24647
1540,0.23845
1541,0.23041999999999999
1542,0.2224
1543,0.21438000000000001
1544,0.20613
1545,0.20323
1546,0.20055
1547,0.19253
1548,0.1845
1549,0.17648
1550,0.16846
1551,0.16043
1552,0.15775999999999998
1553,0.15508
1554,0.15287
1555,0.14485
1556,0.13683
1557,0.12880999999999998
1558,0.12079000000000001
1559,0.113
1560,0.10497999999999999
1561,0.096963
1562,0.094776
1563,0.092851
1564,0.093364
1565,0.085349
1566,0.077334
1567,0.069579
1568,0.061564
1569,0.053551999999999995
1570,0.045805
1571,0.046071
1572,0.046071
1573,0.046893000000000004
1574,0.047733
1575,0.048597
1576,0.049483
1577,0.050084
1578,0.05039
1579,0.056028999999999995
1580,0.056964
1581,0.060585
1582,0.066237
1583,0.07423099999999999
1584,0.082549
1585,0.090543
1586,0.098536
1587,0.10185
1588,0.10550999999999999
1589,0.10884
1590,0.11717000000000001
1591,0.1255
1592,0.12653
1593,0.13291
1594,0.14125
1595,0.14923
1596,0.15297
1597,0.15406
1598,0.15975
1599,0.16772
1600,0.1757
1601,0.18367999999999998
1602,0.19165
1603,0.19963
1604,0.20761
1605,0.21595
1606,0.22393000000000002
1607,0.23190999999999998
1608,0.23989000000000002
1609,0.24786
1610,0.25548000000000004
1611,0.26382
1612,0.2718
1613,0.27676
1614,0.28474
1615,0.29308
1616,0.30106
1617,0.30904
1618,0.31703000000000003
1619,0.32500999999999997
1620,0.33299
1621,0.34097
1622,0.34896
1623,0.35694000000000004
1624,0.36527
1625,0.369
1626,0.37274
1627,0.38072
1628,0.3887
1629,0.39668000000000003
1630,0.40465999999999996
1631,0.41263999999999995
1632,0.42098
1633,0.42896000000000006
1634,0.43693999999999994
1635,0.44492
1636,0.45326000000000005
1637,0.457
1638,0.45811
1639,0.46608999999999995
1640,0.47406000000000004
1641,0.48203999999999997
1642,0.49001000000000006
1643,0.49836
1644,0.5063300000000001
1645,0.51431
1646,0.52037
1647,0.52415
1648,0.53022
1649,0.5382
1650,0.5461699999999999
1651,0.55414
1652,0.56211
1653,0.57008
1654,0.57806
1655,0.58603
1656,0.59438
1657,0.60235
1658,0.61033
1659,0.6183
1660,0.62627
1661,0.63425
1662,0.64222
1663,0.6502
1664,0.65398
1665,0.6551100000000001
1666,0.6604300000000001
1667,0.6684
1668,0.67675
1669,0.68472
1670,0.6926899999999999
1671,0.7006600000000001
1672,0.7086399999999999
1673,0.7166100000000001
1674,0.72458
1675,0.73256
1676,0.74053
1677,0.7485
1678,0.75648
1679,0.7648199999999999
1680,0.7728
1681,0.78077
1682,0.78152
1683,0.78532
1684,0.7914
1685,0.79937
1686,0.80734
1687,0.8153100000000001
1688,0.8232799999999999
1689,0.83163
1690,0.8396
1691,0.84757
1692,0.85554
1693,0.86351
1694,0.86959
1695,0.87341
1696,0.8791100000000001
1697,0.88746
1698,0.89543
1699,0.9034
1700,0.9113600000000001
1701,0.91933
1702,0.9273
1703,0.93527
1704,0.94363
1705,0.9515899999999999
1706,0.9595600000000001
1707,0.9675299999999999
1708,0.9755
1709,0.9812
1710,0.98159
1711,0.98424
1712,0.99221
1713,1.0006
1714,1.0089
1715,1.0173
1716,1.0256
1717,1.0287
1718,1.0313
1719,1.0366
1720,1.0446
1721,1.0473
1722,1.0499
1723,1.0552
1724,1.0632
1725,1.0712
1726,1.0791
1727,1.0871
1728,1.0951
1729,1.1034
1730,1.1114
1731,1.1194
1732,1.1273
1733,1.1308
1734,1.1346
1735,1.1407
1736,1.1487
1737,1.1566
1738,1.1646
1739,1.1726
1740,1.1805
1741,1.1889
1742,1.1942
1743,1.2022
1744,1.2101
1745,1.2181
1746,1.2219
1747,1.2258
1748,1.2341
1749,1.2421
1750,1.2501
1751,1.258
1752,1.266
1753,1.2739
1754,1.2823
1755,1.2903
1756,1.2982
1757,1.3062
1758,1.3096
1759,1.3108
1760,1.3143
1761,1.3223
1762,1.3302
1763,1.3386
1764,1.3466
1765,1.3523
1766,1.3561
1767,1.36
1768,1.368
1769,1.3764
1770,1.3776
1771,1.3789
1772,1.3802
1773,1.3815
1774,1.3828
1775,1.3841
1776,1.3855
1777,1.3868
1778,1.3882
1779,1.3865
1780,1.379
1781,1.3711
1782,1.3698
1783,1.3713
1784,1.3665
1785,1.3585
1786,1.3506
1787,1.3427
1788,1.3352
1789,1.3273
1790,1.3194
1791,1.3146
1792,1.3134
1793,1.3123
1794,1.3044
1795,1.2965
1796,1.2886
1797,1.2807
1798,1.2727
1799,1.2648
1800,1.2569
1801,1.2495
1802,1.2416
1803,1.2337
1804,1.2258
1805,1.2179
1806,1.21
1807,1.2021
1808,1.1942
1809,1.1863
1810,1.1784
1811,1.171
1812,1.1694
1813,1.1684
1814,1.1636
1815,1.1557
1816,1.1479
1817,1.14
1818,1.1321
1819,1.1242
1820,1.1163
1821,1.1084
1822,1.1005
1823,1.0926
1824,1.0847
1825,1.0769
1826,1.069
1827,1.0611
1828,1.0532
1829,1.0506
1830,1.0479
1831,1.0448
1832,1.0363
1833,1.0279
1834,1.0221
1835,1.0189
1836,1.0184
1837,1.01
1838,1.0047
1839,1.0021
1840,0.99945
1841,0.99156
1842,0.9842200000000001
1843,0.9763299999999999
1844,0.96845
1845,0.96057
1846,0.9526899999999999
1847,0.9448
1848,0.9369200000000001
1849,0.9385899999999999
1850,0.9376399999999999
1851,0.9297700000000001
1852,0.9219
1853,0.9140299999999999
1854,0.90615
1855,0.89828
1856,0.89099
1857,0.8831200000000001
1858,0.87525
1859,0.86739
1860,0.8595200000000001
1861,0.8516600000000001
1862,0.8438
1863,0.83593
1864,0.8280700000000001
1865,0.82021
1866,0.81235
1867,0.8044899999999999
1868,0.7966300000000001
1869,0.78878
1870,0.78092
1871,0.77568
1872,0.7672399999999999
1873,0.75938
1874,0.75212
1875,0.74427
1876,0.73641
1877,0.7285699999999999
1878,0.72072
1879,0.71227
1880,0.7044199999999999
1881,0.69657
1882,0.6893199999999999
1883,0.68148
1884,0.6736300000000001
1885,0.66579
1886,0.65795
1887,0.6495
1888,0.64166
1889,0.63381
1890,0.62597
1891,0.61875
1892,0.6103
1893,0.60246
1894,0.5946199999999999
1895,0.5867899999999999
1896,0.57896
1897,0.57112
1898,0.56329
1899,0.5554600000000001
1900,0.5476300000000001
1901,0.54502
1902,0.5424100000000001
1903,0.53458
1904,0.52675
1905,0.52153
1906,0.51893
1907,0.51371
1908,0.50588
1909,0.49806000000000006
1910,0.49023999999999995
1911,0.48241999999999996
1912,0.4746
1913,0.46678000000000003
1914,0.45896000000000003
1915,0.45114
1916,0.44333
1917,0.43551000000000006
1918,0.4277
1919,0.42118999999999995
1920,0.41666000000000003
1921,0.41276999999999997
1922,0.40495
1923,0.39713000000000004
1924,0.38931
1925,0.38149
1926,0.37367
1927,0.36586
1928,0.35804
1929,0.35023000000000004
1930,0.34242
1931,0.33461
1932,0.32679
1933,0.31899
1934,0.31051999999999996
1935,0.30271
1936,0.29491
1937,0.2871
1938,0.2793
1939,0.27083
1940,0.26626
1941,0.2643
1942,0.25648000000000004
1943,0.24866999999999997
1944,0.24086
1945,0.23305
1946,0.22524
1947,0.21744000000000002
1948,0.20963
1949,0.20182999999999998
1950,0.19403
1951,0.18622
1952,0.17842
1953,0.17063
1954,0.16283
1955,0.15436
1956,0.14656
1957,0.13877
1958,0.13097
1959,0.12318
1960,0.11539
1961,0.1076
1962,0.09913
1963,0.094502
1964,0.092489
1965,0.084689
1966,0.076891
1967,0.069096
1968,0.061301
1969,0.053506
1970,0.045714
1971,0.037925
1972,0.030135000000000002
1973,0.022348
1974,0.014561000000000001
1975,0.006776600000000001
1976,-0.0010074
1977,-0.0087884
1978,-0.016569999999999998
1979,-0.024349000000000003
1980,-0.032125
1981,-0.039901
1982,-0.047674
1983,-0.056148
1984,-0.063922
1985,-0.07169199999999999
1986,-0.079463
1987,-0.08723099999999999
1988,-0.094999
1989,-0.10275999999999999
1990,-0.11052999999999999
1991,-0.11829
1992,-0.12605
1993,-0.13380999999999998
1994,-0.14156
1995,-0.14932
1996,-0.15707000000000002
1997,-0.16482
1998,-0.17257
1999,-0.18032
2000,-0.18549000000000002
2001,-0.19322999999999999
2002,-0.20097
2003,-0.20870999999999998
2004,-0.21645
2005,-0.21903000000000003
2006,-0.22236
2007,-0.23084000000000002
2008,-0.23931999999999998
2009,-0.24522
2010,-0.2478
2011,-0.25038
2012,-0.25811999999999996
2013,-0.2607
2014,-0.26327
2015,-0.26768000000000003
2016,-0.27466
2017,-0.28164
2018,-0.28345
2019,-0.28602
2020,-0.29117
2021,-0.29889
2022,-0.30661
2023,-0.31432
2024,-0.32203000000000004
2025,-0.32974000000000003
2026,-0.33666999999999997
2027,-0.34438
2028,-0.35208
2029,-0.35978000000000004
2030,-0.36412
2031,-0.36173
2032,-0.36188000000000003
2033,-0.36956
2034,-0.37724
2035,-0.3841
2036,-0.39176
2037,-0.39778
2038,-0.39783
2039,-0.3987
2040,-0.40634000000000003
2041,-0.41398999999999997
2042,-0.42162
2043,-0.42926000000000003
2044,-0.43604
2045,-0.44366000000000005
2046,-0.45128999999999997
2047,-0.45121999999999995
2048,-0.45111999999999997
2049,-0.45531000000000005
2050,-0.46291000000000004
2051,-0.46961
2052,-0.4772
2053,-0.48478999999999994
2054,-0.4846
2055,-0.48438000000000003
2056,-0.4885
2057,-0.49606000000000006
2058,-0.50362
2059,-0.51117
2060,-0.51779
2061,-0.52533
2062,-0.53287
2063,-0.5404100000000001
2064,-0.53756
2065,-0.53468
2066,-0.53178
2067,-0.52886
2068,-0.52591
2069,-0.52294
2070,-0.51994
2071,-0.5169199999999999
2072,-0.51094
2073,-0.50348
2074,-0.49601000000000006
2075,-0.48754
2076,-0.48007
2077,-0.4726
2078,-0.46512
2079,-0.45764
2080,-0.45216000000000006
2081,-0.44666999999999996
2082,-0.44068
2083,-0.43221000000000004
2084,-0.42473999999999995
2085,-0.41727
2086,-0.4088
2087,-0.4033
2088,-0.3988
2089,-0.39033
2090,-0.38286
2091,-0.3754
2092,-0.36791999999999997
2093,-0.36045
2094,-0.35197
2095,-0.34449
2096,-0.34001
2097,-0.33452
2098,-0.32854
2099,-0.32006999999999997
2100,-0.3126
2101,-0.30512
2102,-0.29665
2103,-0.29216
2104,-0.28665999999999997
2105,-0.28215
2106,-0.27469
2107,-0.26723
2108,-0.25875
2109,-0.25129
2110,-0.24381
2111,-0.23634000000000002
2112,-0.22885999999999998
2113,-0.22436999999999999
2114,-0.21888000000000002
2115,-0.2119
2116,-0.20443
2117,-0.19596
2118,-0.18848
2119,-0.18101
2120,-0.17552
2121,-0.17001
2122,-0.16154000000000002
2123,-0.15408
2124,-0.14661
2125,-0.13814
2126,-0.13067
2127,-0.12319000000000001
2128,-0.11571
2129,-0.11072
2130,-0.10324000000000001
2131,-0.09575299999999999
2132,-0.088785
2133,-0.083315
2134,-0.078827
2135,-0.071351
2136,-0.063873
2137,-0.055399000000000004
2138,-0.047916
2139,-0.041935
2140,-0.038952999999999995
2141,-0.034463
2142,-0.025991000000000004
2143,-0.018518
2144,-0.011040000000000001
2145,-0.0035604
2146,0.0049146
2147,0.012398000000000001
2148,0.019884
2149,0.026851999999999997
2150,0.032323000000000005
2151,0.039302
2152,0.04678
2153,0.055254
2154,0.06273200000000001
2155,0.070215
2156,0.074693
2157,0.080174
2158,0.08466699999999999
2159,0.092137
2160,0.10061
2161,0.10809
2162,0.11556
2163,0.12155
2164,0.12703
2165,0.13004000000000002
2166,0.13751
2167,0.14498
2168,0.15245
2169,0.16092
2170,0.1684
2171,0.1714
2172,0.1769
2173,0.18537
2174,0.19283
2175,0.20131
2176,0.20878000000000002
2177,0.21625
2178,0.22175
2179,0.22476999999999997
2180,0.23075
2181,0.23922
2182,0.24520999999999998
2183,0.25073
2184,0.25379
2185,0.26225
2186,0.2697
2187,0.27423000000000003
2188,0.27978000000000003
2189,0.28431999999999996
2190,0.29278000000000004
2191,0.30022
2192,0.30330999999999997
2193,0.30889
2194,0.3184
2195,0.32582
2196,0.33141
2197,0.33702
2198,0.34548
2199,0.3529
2200,0.36136
2201,0.36878
2202,0.37621
2203,0.37829
2204,0.38142
2205,0.38704
2206,0.39021
2207,0.39339
2208,0.39939
2209,0.40784000000000004
2210,0.41383000000000003
2211,0.4195
2212,0.42271000000000003
2213,0.43009
2214,0.43855
2215,0.44315
2216,0.44883999999999996
2217,0.45346000000000003
2218,0.46191000000000004
2219,0.46928000000000003
2220,0.47253
2221,0.47579
2222,0.47906000000000004
2223,0.48235
2224,0.48566000000000004
2225,0.48899
2226,0.49233000000000005
2227,0.49568
2228,0.49905
2229,0.50244
2230,0.50584
2231,0.50926
2232,0.5127
2233,0.51615
2234,0.51961
2235,0.51235
2236,0.50625
2237,0.50734
2238,0.50845
2239,0.5048
2240,0.49756999999999996
2241,0.49033999999999994
2242,0.48312
2243,0.4759
2244,0.46868000000000004
2245,0.46147
2246,0.45426000000000005
2247,0.44706
2248,0.43986000000000003
2249,0.43266000000000004
2250,0.42546999999999996
2251,0.41828000000000004
2252,0.4111
2253,0.40391
2254,0.39909
2255,0.39305999999999996
2256,0.38825
2257,0.38106
2258,0.37627
2259,0.36908
2260,0.36069
2261,0.35351
2262,0.34633
2263,0.33916
2264,0.33316
2265,0.3295
2266,0.32345999999999997
2267,0.31628
2268,0.30788000000000004
2269,0.30071
2270,0.29354
2271,0.28515
2272,0.27909
2273,0.27305
2274,0.26826
2275,0.26109
2276,0.25392
2277,0.24675
2278,0.23958000000000002
2279,0.23242
2280,0.22526999999999997
2281,0.21811999999999998
2282,0.20973000000000003
2283,0.20259000000000002
2284,0.19545
2285,0.18830999999999998
2286,0.18118
2287,0.17405
2288,0.16693
2289,0.15980999999999998
2290,0.1527
2291,0.14559
2292,0.13944
2293,0.1333
2294,0.1273
2295,0.12018
2296,0.11307
2297,0.10595999999999998
2298,0.098858
2299,0.091761
2300,0.08466699999999999
2301,0.076303
2302,0.069217
2303,0.062133
2304,0.055058
2305,0.047985
2306,0.040918
2307,0.033858
2308,0.026801
2309,0.01975
2310,0.012701
2311,0.0056606
2312,-0.0016384
2313,-0.007886399999999998
2314,-0.012831
2315,-0.019879
2316,-0.026925
2317,-0.033966
2318,-0.041000999999999996
2319,-0.048031
2320,-0.056367999999999994
2321,-0.06339
2322,-0.07040700000000001
2323,-0.077418
2324,-0.08442100000000001
2325,-0.088391
2326,-0.09468
2327,-0.10300999999999999
2328,-0.11002999999999999
2329,-0.11835999999999999
2330,-0.12537
2331,-0.13237000000000002
2332,-0.13634000000000002
2333,-0.14264000000000002
2334,-0.14862999999999998
2335,-0.15565
2336,-0.16266
2337,-0.16965999999999998
2338,-0.17665
2339,-0.18498
2340,-0.19197
2341,-0.20029
2342,-0.20661999999999997
2343,-0.21294000000000002
2344,-0.2176
2345,-0.2246
2346,-0.23158
2347,-0.23856
2348,-0.24554
2349,-0.2525
2350,-0.26082
2351,-0.26778
2352,-0.27473000000000003
2353,-0.28167
2354,-0.28670999999999996
2355,-0.29309
2356,-0.30043000000000003
2357,-0.30738000000000004
2358,-0.31569
2359,-0.32264
2360,-0.32958000000000004
2361,-0.33462
2362,-0.341
2363,-0.34603
2364,-0.35298
2365,-0.35993
2366,-0.36687
2367,-0.3738
2368,-0.3821
2369,-0.38903000000000004
2370,-0.39594
2371,-0.40237
2372,-0.40878000000000003
2373,-0.41708
2374,-0.42401000000000005
2375,-0.43093000000000004
2376,-0.43783999999999995
2377,-0.44613
2378,-0.45303000000000004
2379,-0.45992
2380,-0.46729
2381,-0.47375
2382,-0.47881
2383,-0.48571000000000003
2384,-0.49261000000000005
2385,-0.49951
2386,-0.50778
2387,-0.51237
2388,-0.51925
2389,-0.52612
2390,-0.53069
2391,-0.53719
2392,-0.54368
2393,-0.5473600000000001
2394,-0.55424
2395,-0.56111
2396,-0.56797
2397,-0.57624
2398,-0.58309
2399,-0.5899300000000001
2400,-0.59677
2401,-0.6036
2402,-0.61042
2403,-0.61782
2404,-0.62437
2405,-0.62949
2406,-0.63632
2407,-0.6431399999999999
2408,-0.64996
2409,-0.6582
2410,-0.665
2411,-0.67179
2412,-0.6785800000000001
2413,-0.6837300000000001
2414,-0.6903199999999999
2415,-0.69629
2416,-0.70453
2417,-0.71132
2418,-0.7181
2419,-0.72487
2420,-0.73163
2421,-0.73985
2422,-0.74659
2423,-0.75098
2424,-0.75761
2425,-0.76583
2426,-0.77259
2427,-0.7793399999999999
2428,-0.78755
2429,-0.7942899999999999
2430,-0.80094
2431,-0.80533
2432,-0.8113
2433,-0.81805
2434,-0.8247899999999999
2435,-0.8315299999999999
2436,-0.83973
2437,-0.84645
2438,-0.85316
2439,-0.8598600000000001
2440,-0.86656
2441,-0.871
2442,-0.8792
2443,-0.8859100000000001
2444,-0.8941
2445,-0.9008
2446,-0.90748
2447,-0.9142
2448,-0.9209
2449,-0.92909
2450,-0.93579
2451,-0.9439700000000001
2452,-0.95065
2453,-0.9581
2454,-0.9648200000000001
2455,-0.97004
2456,-0.9767299999999999
2457,-0.9849100000000001
2458,-0.9916200000000001
2459,-0.9960899999999999
2460,-1.002
2461,-1.0087
2462,-1.0169
2463,-1.0236
2464,-1.0303
2465,-1.0355
2466,-1.0422
2467,-1.0475
2468,-1.0542
2469,-1.0623
2470,-1.069
2471,-1.0757
2472,-1.0831
2473,-1.0899
2474,-1.0973
2475,-1.104
2476,-1.1122
2477,-1.1188
2478,-1.1255
2479,-1.1307
2480,-1.1375
2481,-1.1427
2482,-1.1494
2483,-1.156
2484,-1.1642
2485,-1.1708
2486,-1.1752
2487,-1.182
2488,-1.1866
2489,-1.1962
2490,-1.2029
2491,-1.2081
2492,-1.2149
2493,-1.2201
2494,-1.2268
2495,-1.2334
2496,-1.2416
2497,-1.2482
2498,-1.2541
2499,-1.2609
2500,-1.264
2501,-1.2721
2502,-1.2788
2503,-1.2869
2504,-1.2935
2505,-1.3001
2506,-1.3032
2507,-1.31
2508,-1.3175
2509,-1.3241
2510,-1.3322
2511,-1.3388
2512,-1.3454
2513,-1.3491
2514,-1.3559999999999999
2515,-1.3606
2516,-1.365
2517,-1.3716
2518,-1.3797
2519,-1.3863
2520,-1.3928
2521,-1.3997
2522,-1.4065
2523,-1.4125
2524,-1.4206
2525,-1.4265
2526,-1.4312
2527,-1.4380000000000002
2528,-1.4446
2529,-1.4512
2530,-1.4593
2531,-1.4659
2532,-1.474
2533,-1.4786
2534,-1.4855
2535,-1.4921
2536,-1.4986
2537,-1.5067
2538,-1.5133
2539,-1.5198
2540,-1.5245
2541,-1.5314
2542,-1.5373
2543,-1.5438
2544,-1.5519
2545,-1.5585
2546,-1.565
2547,-1.5703
2548,-1.5772
2549,-1.5825
2550,-1.589
2551,-1.5955
2552,-1.6019999999999999
2553,-1.6085
2554,-1.6149
2555,-1.6230000000000002
2556,-1.6294
2557,-1.6358
2558,-1.6422
2559,-1.6502
2560,-1.6551
2561,-1.6621
2562,-1.6685
2563,-1.6749
2564,-1.6812
2565,-1.6876
2566,-1.6939
2567,-1.7002
2568,-1.7081
2569,-1.7144
2570,-1.7206
2571,-1.7268
2572,-1.733
2573,-1.7392
2574,-1.7453
2575,-1.7505
2576,-1.7578
2577,-1.7636
2578,-1.7698
2579,-1.7759
2580,-1.7819999999999998
2581,-1.7881
2582,-1.7941
2583,-1.8002
2584,-1.808
2585,-1.814
2586,-1.8199
2587,-1.8259
2588,-1.8318
2589,-1.8376
2590,-1.8433
2591,-1.8507
2592,-1.8564
2593,-1.8622
2594,-1.8681
2595,-1.8739
2596,-1.8797
2597,-1.8855
2598,-1.8912
2599,-1.8969
2600,-1.9026
2601,-1.9083
2602,-1.9139
2603,-1.9194
2604,-1.925
2605,-1.9324
2606,-1.9379
2607,-1.9433
2608,-1.9487
2609,-1.9541
2610,-1.9594
2611,-1.9647
2612,-1.9699
2613,-1.9751
2614,-1.9803
2615,-1.9854
2616,-1.995
2617,-2.003
2618,-2.0067
2619,-2.0118
2620,-2.0169
2621,-2.0219
2622,-2.0268
2623,-2.0318
2624,-2.0366
2625,-2.0414
2626,-2.0462
2627,-2.0509
2628,-2.0556
2629,-2.0602
2630,-2.0647
2631,-2.0692
2632,-2.0759
2633,-2.0803
2634,-2.0847
2635,-2.089
2636,-2.0932
2637,-2.0973
2638,-2.1015
2639,-2.1055
2640,-2.1095
2641,-2.1134
2642,-2.1172
2643,-2.121
2644,-2.1248
2645,-2.1272
2646,-2.1308
2647,-2.1343
2648,-2.1378
2649,-2.1412
2650,-2.1445
2651,-2.1478
2652,-2.151
2653,-2.1584
2654,-2.1594
2655,-2.1615
2656,-2.1646
2657,-2.1675
2658,-2.1704
2659,-2.1732
2660,-2.1785
2661,-2.181
2662,-2.1845
2663,-2.1897
2664,-2.1923
2665,-2.1922
2666,-2.1946
2667,-2.1954
2668,-2.1936
2669,-2.1918
2670,-2.1914
2671,-2.1935
2672,-2.1981
2673,-2.2027
2674,-2.2072
2675,-2.2104
2676,-2.211
2677,-2.2116
2678,-2.2133
2679,-2.2144
2680,-2.2149
2681,-2.2154
2682,-2.2169
2683,-2.2183
2684,-2.2196
2685,-2.2207
2686,-2.2218
2687,-2.2228
2688,-2.2238
2689,-2.2246
2690,-2.2253
2691,-2.2259
2692,-2.2234
2693,-2.2235
2694,-2.2239
2695,-2.2242
2696,-2.2218
2697,-2.2193
2698,-2.2167
2699,-2.214
2700,-2.2114
2701,-2.2114
2702,-2.2114
2703,-2.2167
2704,-2.2194
2705,-2.2248
2706,-2.2275
2707,-2.2302
2708,-2.2302
