time,value
0,-0.30646999999999996
1,-0.30646999999999996
2,-0.30646999999999996
3,-0.30646999999999996
4,-0.30646999999999996
5,-0.30646999999999996
6,-0.30646999999999996
7,-0.30646999999999996
8,-0.30646999999999996
9,-0.30646999999999996
10,-0.30646999999999996
11,-0.30646999999999996
12,-0.30646999999999996
13,-0.30646999999999996
14,-0.30646999999999996
15,-0.30646999999999996
16,-0.30646999999999996
17,-0.30646999999999996
18,-0.30646999999999996
19,-0.30646999999999996
20,-0.30646999999999996
21,-0.30646999999999996
22,-0.30646999999999996
23,-0.30646999999999996
24,-0.30646999999999996
25,-0.30646999999999996
26,3.8585
27,-0.30646999999999996
28,-0.30646999999999996
29,-0.30646999999999996
30,-0.30646999999999996
31,-0.30646999999999996
32,-0.30646999999999996
33,3.4154
34,0.40247
35,-0.30646999999999996
36,-0.30646999999999996
37,-0.30646999999999996
38,-0.30646999999999996
39,-0.30646999999999996
40,-0.30646999999999996
41,-0.30646999999999996
42,1.776
43,-0.30646999999999996
44,-0.30646999999999996
45,-0.30646999999999996
46,3.3268
47,-0.30646999999999996
48,-0.30646999999999996
49,-0.30646999999999996
50,-0.30646999999999996
51,-0.30646999999999996
52,-0.30646999999999996
53,-0.30646999999999996
54,-0.30646999999999996
55,-0.30646999999999996
56,-0.30646999999999996
57,-0.30646999999999996
58,-0.30646999999999996
59,-0.30646999999999996
60,-0.30646999999999996
61,-0.30646999999999996
62,-0.30646999999999996
63,2.3964
64,0.9784799999999999
65,-0.30646999999999996
66,-0.30646999999999996
67,-0.30646999999999996
68,-0.30646999999999996
69,-0.30646999999999996
70,-0.30646999999999996
71,-0.30646999999999996
72,-0.30646999999999996
73,-0.30646999999999996
74,5.1435
75,-0.30646999999999996
76,-0.30646999999999996
77,-0.30646999999999996
78,-0.30646999999999996
79,-0.30646999999999996
80,-0.30646999999999996
81,-0.30646999999999996
82,-0.30646999999999996
83,-0.30646999999999996
84,-0.30646999999999996
85,-0.30646999999999996
86,-0.30646999999999996
87,-0.30646999999999996
88,-0.30646999999999996
89,2.3964
90,-0.30646999999999996
91,2.6622
92,-0.30646999999999996
93,-0.30646999999999996
94,-0.30646999999999996
95,-0.30646999999999996
