time,value
0,1.088
1,1.023
2,-0.53689
3,-1.1218
4,-1.1218
5,-0.53689
6,1.218
7,1.023
8,0.56803
9,-1.1218
10,-1.1218
11,-1.1218
12,0.69802
13,1.088
14,1.023
15,-0.60188
16,-1.1218
17,-1.1218
18,-0.60188
19,1.2830000000000001
20,1.088
21,0.11306
22,-1.1218
23,-1.1218
24,-1.1218
25,0.8930100000000001
26,1.088
27,0.76302
28,-1.1218
29,-1.1218
30,-1.1218
31,0.17806
32,1.153
33,1.023
34,-0.60188
35,-1.1218
36,-1.1218
37,-0.47189
38,1.2830000000000001
39,1.088
40,1.023
41,-0.92686
42,-1.1218
43,-1.1218
44,0.048069
45,1.218
46,1.088
47,1.023
48,-0.99185
49,-1.1218
50,-1.1218
51,0.17806
52,1.153
53,1.088
54,1.023
55,-1.1218
56,-1.1218
57,-1.1218
58,0.17806
59,1.218
60,1.023
61,0.958
62,-1.1218
63,-1.1218
64,-1.1218
65,0.43804
66,1.153
67,1.023
68,0.958
69,-0.27691
70,-1.1218
71,-1.1218
72,0.76302
73,1.153
74,1.088
75,1.023
76,0.958
77,-0.92686
78,-1.1218
79,-1.1218
80,0.11306
81,1.218
82,1.023
83,1.023
84,-0.53689
85,-1.1218
86,-1.1218
87,-0.47189
88,1.2830000000000001
89,1.088
90,1.023
91,-0.66688
92,-1.1218
93,-1.1218
94,-0.27691
95,1.218
