time,value
0,1.1616
1,1.0637
2,0.86787
3,0.86787
4,0.86787
5,0.7699699999999999
6,0.7699699999999999
7,0.47626
8,-1.1881
9,-1.1881
10,-1.1881
11,-1.1881
12,-1.1881
13,-1.1881
14,-1.1881
15,-1.1881
16,-1.1881
17,-1.1881
18,-1.1881
19,1.3574
20,1.2595
21,1.0637
22,0.96578
23,0.86787
24,0.86787
25,0.7699699999999999
26,0.7699699999999999
27,0.86787
28,0.7699699999999999
29,0.7699699999999999
30,0.67207
31,0.7699699999999999
32,0.7699699999999999
33,-0.11116
34,-1.1881
35,-1.1881
36,-1.1881
37,-1.1881
38,-1.1881
39,-1.1881
40,-1.1881
41,-1.1881
42,-1.1881
43,-1.1881
44,0.7699699999999999
45,1.1616
46,1.1616
47,0.86787
48,0.86787
49,0.86787
50,0.7699699999999999
51,0.7699699999999999
52,0.7699699999999999
53,0.7699699999999999
54,0.7699699999999999
55,0.7699699999999999
56,0.67207
57,0.7699699999999999
58,0.7699699999999999
59,0.67207
60,-0.013258
61,-1.1881
62,-1.1881
63,-1.1881
64,-1.1881
65,-1.1881
66,-1.1881
67,-1.1881
68,-1.1881
69,-1.1881
70,-0.89439
71,1.2595
72,1.1616
73,0.96578
74,0.96578
75,0.7699699999999999
76,0.7699699999999999
77,0.7699699999999999
78,0.7699699999999999
79,0.67207
80,0.7699699999999999
81,0.67207
82,0.7699699999999999
83,0.67207
84,0.7699699999999999
85,0.67207
86,0.67207
87,0.47626
88,-1.1881
89,-1.1881
90,-1.1881
91,-1.1881
92,-1.1881
93,-1.1881
94,-1.1881
95,-1.1881
