time,value
0,1.8527
1,1.8438
2,1.8403
3,1.8271
4,1.8068
5,1.7787
6,1.7451
7,1.7112
8,1.6772
9,1.6401
10,1.6035
11,1.5667
12,1.5376
13,1.5026
14,1.4665
15,1.4305
16,1.3936
17,1.3557
18,1.3179
19,1.281
20,1.2449
21,1.2078
22,1.1808
23,1.145
24,1.1089
25,1.0714
26,1.0322
27,0.9993700000000001
28,0.9668
29,0.93117
30,0.89559
31,0.8591700000000001
32,0.8231700000000001
33,0.78605
34,0.74924
35,0.7132
36,0.67714
37,0.63942
38,0.60036
39,0.56277
40,0.52459
41,0.48828999999999995
42,0.45263000000000003
43,0.41611000000000004
44,0.37715
45,0.33821999999999997
46,0.30167
47,0.26403000000000004
48,0.22744
49,0.19227
50,0.15684
51,0.12082999999999999
52,0.084508
53,0.048228
54,0.010581
55,-0.013558
56,-0.041022
57,-0.06391799999999999
58,-0.086245
59,-0.10611
60,-0.13446
61,-0.1623
62,-0.19682
63,-0.23154
64,-0.26616
65,-0.30288000000000004
66,-0.34176999999999996
67,-0.38019000000000003
68,-0.41993
69,-0.46793
70,-0.5097
71,-0.54764
72,-0.58821
73,-0.633
74,-0.67019
75,-0.70663
76,-0.74253
77,-0.77959
78,-0.81458
79,-0.8497600000000001
80,-0.88626
81,-0.9209700000000001
82,-0.9575299999999999
83,-0.9941200000000001
84,-1.0306
85,-1.067
86,-1.1033
87,-1.1402
88,-1.1781
89,-1.2115
90,-1.242
91,-1.2744
92,-1.3036
93,-1.3352
94,-1.3662
95,-1.3966
96,-1.4206
97,-1.436
98,-1.462
99,-1.4859
100,-1.5111
101,-1.5393
102,-1.5571
103,-1.5777
104,-1.5964
105,-1.6129
106,-1.6271
107,-1.6442
108,-1.6477
109,-1.6480000000000001
110,-1.6509
111,-1.653
112,-1.6532
113,-1.6469
114,-1.6432
115,-1.6312
116,-1.6218
117,-1.6096
118,-1.5927
119,-1.5735
120,-1.5433
121,-1.5172
122,-1.4875
123,-1.453
124,-1.4188
125,-1.385
126,-1.3508
127,-1.3179
128,-1.2815
129,-1.2494
130,-1.2143
131,-1.1771
132,-1.1397
133,-1.1022
134,-1.0646
135,-1.0271
136,-0.9890700000000001
137,-0.95116
138,-0.91606
139,-0.87826
140,-0.84904
141,-0.81587
142,-0.78056
143,-0.74688
144,-0.71222
145,-0.6764899999999999
146,-0.6432399999999999
147,-0.6123
148,-0.5813699999999999
149,-0.55187
150,-0.56225
151,-0.59137
152,-0.6272399999999999
153,-0.6694399999999999
154,-0.70917
155,-0.74844
156,-0.79056
157,-0.8304299999999999
158,-0.86945
159,-0.8601200000000001
160,-0.8280299999999999
161,-0.7942600000000001
162,-0.7586
163,-0.72521
164,-0.6853899999999999
165,-0.6470100000000001
166,-0.61043
167,-0.57292
168,-0.5354
169,-0.4982
170,-0.46132
171,-0.42426
172,-0.38519000000000003
173,-0.34761
174,-0.31148000000000003
175,-0.27386
176,-0.23624
177,-0.19860999999999998
178,-0.15957000000000002
179,-0.12145999999999998
180,-0.082886
181,-0.045249
182,-0.0076066
183,0.028664999999999996
184,0.064974
185,0.10132000000000001
186,0.1377
187,0.17411
188,0.21055
189,0.24828000000000003
190,0.28909
191,0.33143
192,0.37385999999999997
193,0.41213999999999995
194,0.44935
195,0.49186
196,0.53447
197,0.57385
198,0.61148
199,0.6511399999999999
200,0.69098
201,0.7286199999999999
202,0.76767
203,0.8053
204,0.84435
205,0.8834
206,0.92245
207,0.9588399999999999
208,0.99549
209,1.0368
210,1.0772
211,1.1149
212,1.1525
213,1.1884
214,1.2236
215,1.2599
216,1.2962
217,1.3325
218,1.3702
219,1.4033
220,1.4272
221,1.4523
222,1.4683
223,1.4756
224,1.4778
225,1.4755
226,1.4696
227,1.4642
228,1.4591
229,1.4483
230,1.4239
231,1.3998
232,1.376
233,1.4072
234,1.4417
235,1.469
236,1.4953
237,1.5168
238,1.5213
239,1.5205
240,1.5201
241,1.52
242,1.5244
243,1.5219
244,1.4846
245,1.4474
246,1.4102
247,1.3732
248,1.3359999999999999
249,1.2989
250,1.2617
251,1.2246
252,1.1875
253,1.1504
254,1.1125
255,1.0749
256,1.0376
257,0.99998
258,0.96262
259,0.92504
260,0.8874
261,0.84985
262,0.8123199999999999
263,0.77494
264,0.7373
265,0.69984
266,0.66247
267,0.62511
268,0.5876100000000001
269,0.55019
270,0.5130100000000001
271,0.47586000000000006
272,0.43872
273,0.40173000000000003
274,0.36478
275,0.32761
276,0.29039
277,0.25337
278,0.21613000000000002
279,0.17934
280,0.1426
281,0.10555999999999999
282,0.069082
283,0.032695999999999996
284,-0.0042458
285,-0.0407
286,-0.076921
287,-0.11339
288,-0.15001
289,-0.18600000000000003
290,-0.22175
291,-0.25775
292,-0.2928
293,-0.32763000000000003
294,-0.36239
295,-0.39760999999999996
296,-0.43206999999999995
297,-0.46662
298,-0.50022
299,-0.53509
300,-0.56765
301,-0.60117
302,-0.63362
303,-0.66593
304,-0.6985399999999999
305,-0.73035
306,-0.76121
307,-0.79228
308,-0.8232799999999999
309,-0.85495
310,-0.88389
311,-0.9144
312,-0.9424
313,-0.9715600000000001
314,-0.99849
315,-1.0255
316,-1.0518
317,-1.0772
318,-1.1018
319,-1.1253
320,-1.1445
321,-1.1616
322,-1.1648
323,-1.1425
324,-1.1115
325,-1.0724
326,-1.0297
327,-0.9920200000000001
328,-0.95793
329,-0.92911
330,-0.8998200000000001
331,-0.87351
332,-0.8466100000000001
333,-0.81916
334,-0.81902
335,-0.8257899999999999
336,-0.8345799999999999
337,-0.83715
338,-0.83031
339,-0.83831
340,-0.8544799999999999
341,-0.86751
342,-0.8830399999999999
343,-0.89933
344,-0.9117299999999999
345,-0.9242299999999999
346,-0.93515
347,-0.9535799999999999
348,-0.9660200000000001
349,-0.9778700000000001
350,-0.99116
351,-1.0051
352,-1.0122
353,-1.018
354,-1.0168
355,-1.02
356,-1.0193
357,-1.0281
358,-1.031
359,-1.032
360,-1.0328
361,-1.0352
362,-1.038
363,-1.0357
364,-1.032
365,-1.0194
366,-1.0103
367,-0.99439
368,-0.9790200000000001
369,-0.96426
370,-0.94373
371,-0.92238
372,-0.90479
373,-0.88184
374,-0.8581799999999999
375,-0.8338700000000001
376,-0.80894
377,-0.78428
378,-0.76139
379,-0.7347100000000001
380,-0.70755
381,-0.67993
382,-0.65187
383,-0.62339
384,-0.59453
385,-0.56882
386,-0.53988
387,-0.51259
388,-0.48452
389,-0.45487
390,-0.42391999999999996
391,-0.39581
392,-0.36734
393,-0.33825
394,-0.30645
395,-0.27704
396,-0.24733000000000002
397,-0.21544000000000002
398,-0.18667999999999998
399,-0.1565
400,-0.12564
401,-0.094674
402,-0.063412
403,-0.031932
404,-0.0021218000000000005
405,0.029370999999999998
406,0.060830999999999996
407,0.09164
408,0.1233
409,0.1548
410,0.18567999999999998
411,0.21877
412,0.25008
413,0.28163
414,0.3134
415,0.34536999999999995
416,0.37781
417,0.40993
418,0.44248999999999994
419,0.47444
420,0.50665
421,0.53978
422,0.57165
423,0.60378
424,0.63615
425,0.66874
426,0.70108
427,0.73345
428,0.7661899999999999
429,0.7991199999999999
430,0.83193
431,0.8657299999999999
432,0.89938
433,0.93434
434,0.9688200000000001
435,1.0035
436,1.0383
437,1.0732
438,1.1083
439,1.1432
440,1.1783
441,1.2139
442,1.2494
443,1.2849
444,1.3206
445,1.3565
446,1.3923
447,1.4283
448,1.4648
449,1.5012
450,1.5379
451,1.5746
452,1.6113
453,1.6423
454,1.6737
455,1.6996
456,1.7371
457,1.7598
458,1.7899
459,1.8185
460,1.8427
461,1.8444
462,1.85
