time,value
0,-1.0243
1,-1.0243
2,0.36983
3,1.1134
4,1.1134
5,-0.8384
6,-1.0243
7,-1.0243
8,-1.0243
9,-1.0243
10,0.8345299999999999
11,1.1134
12,1.2063
13,-1.0243
14,-1.0243
15,-1.0243
16,-1.0243
17,-1.0243
18,-0.0019363
19,1.2063
20,1.2063
21,0.36983
22,-1.0243
23,-1.0243
24,-1.0243
25,-1.0243
26,-1.0243
27,0.18395
28,1.2063
29,1.2063
30,0.27689
31,-1.0243
32,-1.0243
33,-1.0243
34,-0.094877
35,1.2063
36,1.2063
37,1.2063
38,1.1134
39,0.18395
40,-1.0243
41,-1.0243
42,0.091004
43,1.2063
44,1.2063
45,1.1134
46,-0.55958
47,-1.0243
48,-1.0243
49,0.8345299999999999
50,1.2992
51,1.1134
52,-0.46663999999999994
53,-1.0243
54,-1.0243
55,-0.55958
56,1.2992
57,1.2063
58,0.091004
59,-1.0243
60,-1.0243
61,-1.0243
62,0.091004
63,1.2992
64,1.1134
65,-0.3737
66,-1.0243
67,-1.0243
68,-1.0243
69,1.2992
70,1.2063
71,1.1134
72,-1.0243
73,-1.0243
74,0.18395
75,1.2063
76,1.2063
77,1.1134
78,1.2063
79,1.0204
80,-0.094877
81,-1.0243
82,-1.0243
83,-0.65252
84,1.2992
85,1.2063
86,1.1134
87,-0.18782000000000001
88,-1.0243
89,-1.0243
90,-1.0243
91,1.2992
92,1.2063
93,0.8345299999999999
94,-1.0243
95,-1.0243
