time,value
0,1.7105
1,1.6592
2,1.6104
3,1.5481
4,1.4480000000000002
5,1.3465
6,1.2479
7,1.1475
8,1.0505
9,0.9515600000000001
10,0.8558899999999999
11,0.75864
12,0.6865899999999999
13,0.59307
14,0.49776000000000004
15,0.40325
16,0.31606999999999996
17,0.22658000000000003
18,0.13435999999999998
19,0.051184
20,-0.03584
21,-0.12169
22,-0.20575
23,-0.28781999999999996
24,-0.36758
25,-0.44881000000000004
26,-0.50618
27,-0.58438
28,-0.65382
29,-0.7340000000000001
30,-0.7892899999999999
31,-0.84716
32,-0.9051799999999999
33,-0.9582200000000001
34,-1.0243
35,-1.0708
36,-1.1105
37,-1.1417
38,-1.1869
39,-1.2032
40,-1.2342
41,-1.2404
42,-1.25
43,-1.2570000000000001
44,-1.2559
45,-1.2467
46,-1.2295
47,-1.2272
48,-1.1942
49,-1.1544
50,-1.1222
51,-1.0766
52,-1.0206
53,-0.98031
54,-0.92496
55,-0.85329
56,-0.7944100000000001
57,-0.73115
58,-0.664
59,-0.5877600000000001
60,-0.51708
61,-0.43123
62,-0.35519
63,-0.27191
64,-0.18916
65,-0.10455999999999999
66,-0.027299
67,0.054488999999999996
68,0.13247
69,0.21914
70,0.31092
71,0.39616
72,0.48513999999999996
73,0.58041
74,0.6723
75,0.76815
76,0.86477
77,0.96205
78,1.0585
79,1.1578
80,1.2573
81,1.3546
82,1.4539
83,1.5505
84,1.6476
85,1.6951
86,1.7359
87,1.7342
88,1.7166
89,1.7146
90,1.6448
91,1.5643
92,1.4666
93,1.3716
94,1.2717
95,1.1727
96,1.074
97,0.9757899999999999
98,0.8785700000000001
99,0.78127
100,0.69013
101,0.59749
102,0.50216
103,0.40746
104,0.3365
105,0.23949
106,0.15179
107,0.061083000000000005
108,-0.028372
109,-0.094641
110,-0.18631
111,-0.27643
112,-0.37065
113,-0.45178999999999997
114,-0.53315
115,-0.6107100000000001
116,-0.69852
117,-0.77135
118,-0.8395799999999999
119,-0.91979
120,-0.98729
121,-1.0544
122,-1.1059999999999999
123,-1.1703
124,-1.2098
125,-1.2627
126,-1.2903
127,-1.3266
128,-1.3575
129,-1.3679
130,-1.3706
131,-1.3755
132,-1.3711
133,-1.3577
134,-1.3358
135,-1.328
136,-1.2897
137,-1.2442
138,-1.2011
139,-1.1539
140,-1.0906
141,-1.04
142,-0.98444
143,-0.9093600000000001
144,-0.84225
145,-0.77855
146,-0.69518
147,-0.61364
148,-0.53347
149,-0.44365
150,-0.3637
151,-0.28152
152,-0.19738
153,-0.10217000000000001
154,-0.013944999999999999
155,0.059101
156,0.14878
157,0.23909
158,0.32544
159,0.41673000000000004
160,0.4873
161,0.58575
162,0.67708
163,0.77305
164,0.86967
165,0.96226
166,1.0603
167,1.1563
168,1.2547
169,1.3302
170,1.4264
171,1.5237
172,1.6204
173,1.671
174,1.6949
175,1.7198
