time,value
0,1.0843
1,1.0843
2,-0.6668
3,-0.6668
4,-0.6668
5,-0.083096
6,2.0571
7,-0.27766
8,-0.6668
9,-0.6668
10,-0.6668
11,0.88974
12,1.2789
13,-0.6668
14,-0.6668
15,-0.6668
16,-0.6668
17,2.2517
18,-0.083096
19,-0.6668
20,-0.6668
21,-0.6668
22,0.5006
23,1.6680000000000001
24,-0.6668
25,-0.6668
26,-0.6668
27,-0.6668
28,1.4734
29,0.69517
30,-0.6668
31,-0.6668
32,-0.6668
33,-0.6668
34,2.2517
35,0.11147
36,-0.6668
37,-0.6668
38,-0.6668
39,0.11147
40,2.0571
41,-0.6668
42,-0.6668
43,-0.6668
44,-0.6668
45,0.88974
46,1.2789
47,-0.6668
48,-0.6668
49,-0.6668
50,0.11147
51,2.0571
52,-0.6668
53,-0.6668
54,-0.6668
55,-0.6668
56,2.2517
57,-0.083096
58,-0.6668
59,-0.6668
60,0.11147
61,2.0571
62,-0.6668
63,-0.6668
64,-0.6668
65,-0.6668
66,1.4734
67,0.69517
68,-0.6668
69,-0.6668
70,-0.6668
71,-0.083096
72,2.2517
73,-0.6668
74,-0.6668
75,-0.6668
76,-0.6668
77,2.2517
78,0.30604000000000003
79,-0.6668
80,-0.6668
81,-0.6668
82,0.30604000000000003
83,2.0571
84,-0.6668
85,-0.6668
86,-0.6668
87,-0.6668
88,1.2789
89,0.88974
90,-0.6668
91,-0.6668
92,-0.6668
93,-0.27766
94,2.0571
95,-0.27766
