time,value
0,-0.25317
1,-0.25317
2,-0.25317
3,-0.25317
4,-0.25317
5,-0.25317
6,-0.25317
7,-0.25317
8,-0.25317
9,-0.25317
10,-0.25317
11,-0.25317
12,-0.25317
13,-0.25317
14,-0.25317
15,-0.25317
16,-0.25317
17,-0.25317
18,-0.25317
19,-0.25317
20,-0.25317
21,-0.25317
22,-0.25317
23,-0.25317
24,-0.25317
25,-0.25317
26,-0.25317
27,-0.25317
28,-0.25317
29,-0.25317
30,-0.25317
31,-0.25317
32,-0.25317
33,-0.25317
34,-0.25317
35,-0.25317
36,-0.25317
37,-0.25317
38,-0.25317
39,-0.25317
40,4.8412
41,-0.25317
42,-0.25317
43,-0.25317
44,2.7716
45,-0.25317
46,-0.25317
47,-0.25317
48,4.2044
49,2.0287
50,-0.25317
51,-0.25317
52,-0.25317
53,-0.25317
54,-0.25317
55,-0.25317
56,-0.25317
57,-0.25317
58,-0.25317
59,-0.25317
60,-0.25317
61,-0.25317
62,-0.25317
63,2.6655
64,-0.25317
65,-0.25317
66,-0.25317
67,-0.25317
68,-0.25317
69,-0.25317
70,-0.25317
71,-0.25317
72,-0.25317
73,-0.25317
74,-0.25317
75,-0.25317
76,-0.25317
77,-0.25317
78,-0.25317
79,-0.25317
80,-0.25317
81,5.3719
82,0.64896
83,-0.25317
84,-0.25317
85,-0.25317
86,-0.25317
87,-0.25317
88,-0.25317
89,-0.25317
90,-0.25317
91,-0.25317
92,-0.25317
93,-0.25317
94,-0.25317
95,-0.25317
