time,value
0,-0.90665
1,0.41211000000000003
2,-0.90665
3,0.41211000000000003
4,-0.90665
5,0.41211000000000003
6,-0.90665
7,0.41211000000000003
8,-0.90665
9,0.41211000000000003
10,-0.90665
11,0.41211000000000003
12,-0.90665
13,0.41211000000000003
14,-0.90665
15,0.41211000000000003
16,-0.90665
17,0.41211000000000003
18,-0.90665
19,0.41211000000000003
20,-0.90665
21,0.41211000000000003
22,0.41211000000000003
23,-0.90665
24,0.41211000000000003
25,-0.90665
26,0.41211000000000003
27,-0.90665
28,0.41211000000000003
29,-0.90665
30,0.41211000000000003
31,-0.90665
32,0.41211000000000003
33,-0.90665
34,0.41211000000000003
35,-0.90665
36,0.41211000000000003
37,-0.90665
38,0.41211000000000003
39,-0.90665
40,0.41211000000000003
41,-0.90665
42,0.41211000000000003
43,-0.90665
44,0.41211000000000003
45,-0.90665
46,0.41211000000000003
47,-0.90665
48,0.41211000000000003
49,-0.90665
50,0.41211000000000003
51,-0.90665
52,0.41211000000000003
53,-0.90665
54,0.41211000000000003
55,-0.90665
56,0.41211000000000003
57,-0.90665
58,0.41211000000000003
59,-0.90665
60,0.41211000000000003
61,-0.90665
62,0.41211000000000003
63,-0.90665
64,0.41211000000000003
65,-0.90665
66,0.41211000000000003
67,0.41211000000000003
68,-0.90665
69,0.41211000000000003
70,-0.90665
71,0.41211000000000003
72,-0.90665
73,0.41211000000000003
74,-0.90665
75,0.41211000000000003
76,-0.90665
77,0.41211000000000003
78,-0.90665
79,0.41211000000000003
80,-0.90665
81,0.41211000000000003
82,3.0496
83,1.7309
84,3.0496
85,1.7309
86,3.0496
87,1.7309
88,3.0496
89,1.7309
90,1.7309
91,-0.90665
92,0.41211000000000003
93,-0.90665
94,0.41211000000000003
95,-0.90665
