time,value
0,0.61326
1,-0.71345
2,-0.71345
3,-0.71345
4,-0.71345
5,-0.71345
6,0.44742
7,1.7741
8,1.1108
9,-0.71345
10,-0.71345
11,-0.71345
12,-0.71345
13,-0.71345
14,1.6083
15,1.6083
16,0.11574000000000001
17,-0.71345
18,-0.71345
19,-0.71345
20,-0.71345
21,-0.71345
22,1.7741
23,1.6083
24,-0.050097
25,-0.71345
26,-0.71345
27,-0.71345
28,-0.71345
29,-0.71345
30,1.6083
31,1.6083
32,-0.21594000000000002
33,-0.71345
34,-0.71345
35,-0.71345
36,-0.71345
37,-0.71345
38,1.1108
39,1.7741
40,0.7791
41,-0.71345
42,-0.71345
43,-0.71345
44,-0.71345
45,-0.71345
46,1.7741
47,1.6083
48,0.28158
49,-0.71345
50,-0.71345
51,-0.71345
52,-0.71345
53,0.11574000000000001
54,1.7741
55,1.6083
56,-0.71345
57,-0.71345
58,-0.71345
59,-0.71345
60,-0.71345
61,0.28158
62,1.7741
63,1.4425
64,0.11574000000000001
65,-0.71345
66,-0.71345
67,-0.71345
68,-0.71345
69,-0.21594000000000002
70,1.7741
71,1.6083
72,-0.71345
73,-0.71345
74,-0.71345
75,-0.71345
76,-0.71345
77,0.11574000000000001
78,1.7741
79,1.4425
80,0.11574000000000001
81,-0.71345
82,-0.71345
83,-0.71345
84,-0.71345
85,-0.050097
86,1.7741
87,1.6083
88,-0.71345
89,-0.71345
90,-0.71345
91,-0.71345
92,-0.71345
93,-0.71345
94,1.7741
95,1.6083
