time,value
0,-0.66595
1,1.7401
2,1.7401
3,0.53706
4,-0.66595
5,-0.66595
6,-0.66595
7,-0.66595
8,-0.66595
9,0.3652
10,2.0838
11,1.3963
12,-0.66595
13,-0.66595
14,-0.66595
15,-0.66595
16,-0.66595
17,-0.66595
18,1.3963
19,1.9119
20,0.3652
21,-0.66595
22,-0.66595
23,-0.66595
24,-0.66595
25,-0.66595
26,-0.66595
27,2.0838
28,1.7401
29,-0.32223
30,-0.66595
31,-0.66595
32,-0.66595
33,-0.66595
34,-0.66595
35,1.3963
36,1.7401
37,0.70891
38,-0.66595
39,-0.66595
40,-0.66595
41,-0.66595
42,-0.66595
43,0.021481999999999998
44,1.9119
45,1.7401
46,-0.66595
47,-0.66595
48,-0.66595
49,-0.66595
50,-0.66595
51,-0.66595
52,1.2245
53,1.9119
54,0.53706
55,-0.66595
56,-0.66595
57,-0.66595
58,-0.66595
59,-0.66595
60,-0.66595
61,2.0838
62,1.7401
63,-0.32223
64,-0.66595
65,-0.66595
66,-0.66595
67,-0.66595
68,-0.66595
69,0.3652
70,1.9119
71,1.3963
72,-0.66595
73,-0.66595
74,-0.66595
75,-0.66595
76,-0.66595
77,-0.66595
78,0.88077
79,1.9119
80,0.70891
81,-0.66595
82,-0.66595
83,-0.66595
84,-0.66595
85,-0.66595
86,-0.66595
87,1.3963
88,1.7401
89,0.53706
90,-0.66595
91,-0.66595
92,-0.66595
93,-0.66595
94,-0.66595
95,0.70891
