time,value
0,-0.42382
1,-0.42382
2,-0.42382
3,-0.42382
4,-0.42382
5,-0.42382
6,-0.42382
7,-0.42382
8,-0.42382
9,-0.42382
10,-0.42382
11,-0.42382
12,-0.42382
13,-0.42382
14,-0.42382
15,-0.42382
16,-0.42382
17,-0.42382
18,-0.42382
19,-0.42382
20,-0.42382
21,-0.42382
22,-0.42382
23,-0.42382
24,-0.42382
25,-0.42382
26,-0.42382
27,-0.42382
28,-0.42382
29,-0.42382
30,-0.42382
31,-0.42382
32,-0.42382
33,-0.42382
34,-0.42382
35,-0.42382
36,-0.083346
37,-0.42382
38,-0.42382
39,-0.42382
40,-0.42382
41,-0.42382
42,-0.42382
43,-0.42382
44,-0.42382
45,-0.42382
46,-0.42382
47,-0.42382
48,-0.42382
49,-0.42382
50,-0.42382
51,-0.42382
52,-0.42382
53,-0.42382
54,-0.42382
55,-0.42382
56,-0.42382
57,-0.42382
58,-0.42382
59,-0.42382
60,-0.42382
61,-0.42382
62,-0.42382
63,-0.42382
64,-0.42382
65,-0.42382
66,-0.42382
67,-0.42382
68,-0.42382
69,-0.42382
70,-0.42382
71,0.76785
72,0.5976100000000001
73,0.5976100000000001
74,0.5976100000000001
75,0.5976100000000001
76,-0.42382
77,-0.42382
78,0.086893
79,0.42736999999999997
80,0.5976100000000001
81,0.93809
82,3.6619
83,3.4917
84,3.6619
85,3.4917
86,3.4917
87,3.4917
88,1.1083
89,0.5976100000000001
90,0.086893
91,-0.083346
92,0.5976100000000001
93,0.5976100000000001
94,0.5976100000000001
95,0.5976100000000001
