time,value
0,-0.22869
1,-0.22869
2,-0.22869
3,-0.22869
4,-0.22869
5,-0.22869
6,-0.22869
7,-0.22869
8,-0.22869
9,-0.22869
10,-0.22869
11,-0.22869
12,-0.22869
13,-0.22869
14,-0.22869
15,-0.22869
16,-0.22869
17,-0.22869
18,-0.22869
19,-0.22869
20,-0.22869
21,-0.22869
22,-0.22869
23,-0.22869
24,-0.22869
25,-0.22869
26,-0.22869
27,-0.22869
28,-0.22869
29,-0.22869
30,-0.22869
31,-0.22869
32,-0.22869
33,-0.22869
34,-0.22869
35,-0.22869
36,-0.22869
37,-0.22869
38,-0.22869
39,-0.22869
40,-0.22869
41,-0.22869
42,-0.22869
43,-0.22869
44,-0.22869
45,-0.22869
46,-0.22869
47,-0.22869
48,-0.22869
49,-0.22869
50,-0.22869
51,-0.22869
52,-0.22869
53,-0.22869
54,-0.22869
55,-0.22869
56,-0.22869
57,-0.22869
58,-0.22869
59,-0.22869
60,-0.22869
61,-0.22869
62,-0.22869
63,-0.22869
64,-0.22869
65,-0.22869
66,-0.22869
67,-0.22869
68,-0.22869
69,-0.22869
70,-0.22869
71,-0.22869
72,1.2323
73,4.1276
74,3.1846
75,4.2604
76,0.063501
77,-0.0029053
78,-0.042749
79,6.5846
80,0.4885
81,-0.22869
82,-0.22869
83,-0.22869
84,-0.22869
85,-0.22869
86,-0.22869
87,-0.22869
88,-0.22869
89,-0.22869
90,-0.22869
91,-0.22869
92,-0.22869
93,-0.22869
94,-0.22869
95,-0.22869
