time,value
0,-0.9332299999999999
1,1.0626
2,-0.046199000000000004
3,-0.7114699999999999
4,1.5061
5,-1.155
6,-0.046199000000000004
7,0.84083
8,-1.3767
9,0.84083
10,0.17556
11,-1.155
12,1.2843
13,-1.155
14,0.17556
15,0.17556
16,-1.3767
17,1.9496
18,-0.7114699999999999
19,-0.7114699999999999
20,1.0626
21,-1.3767
22,0.17556
23,-0.48971000000000003
24,-0.7114699999999999
25,1.5061
26,-0.9332299999999999
27,0.84083
28,1.0626
29,-1.155
30,0.84083
31,0.84083
32,-0.48971000000000003
33,1.7279
34,-0.48971000000000003
35,0.61907
36,0.17556
37,-1.155
38,2.1714
39,-0.7114699999999999
40,-0.26796
41,1.5061
42,-1.5985
43,0.39731
44,-0.48971000000000003
45,-1.155
46,1.0626
47,-1.3767
48,0.39731
49,0.17556
50,-1.3767
51,1.5061
52,-0.26796
53,-0.7114699999999999
54,1.2843
55,-0.7114699999999999
56,0.17556
57,-0.046199000000000004
58,-1.155
59,1.0626
60,-0.7114699999999999
61,-0.26796
62,1.5061
63,-1.5985
64,0.39731
65,0.17556
66,-1.3767
67,0.84083
68,-0.9332299999999999
69,-0.26796
70,1.0626
71,-0.9332299999999999
72,1.2843
73,-0.26796
74,-0.7114699999999999
75,1.9496
76,-1.155
77,-0.046199000000000004
78,1.0626
79,-1.3767
80,1.2843
81,-0.046199000000000004
82,-0.26796
83,1.0626
84,-1.155
85,0.84083
86,0.39731
87,-0.7114699999999999
88,1.7279
89,-1.155
90,-0.48971000000000003
91,0.61907
92,-0.7114699999999999
93,0.39731
94,-0.26796
95,-0.7114699999999999
