time,value
0,0.47622
1,0.5273100000000001
2,0.60838
3,0.64798
4,0.65781
5,0.52755
6,0.64152
7,0.65514
8,0.62843
9,0.78357
10,0.65161
11,0.72923
12,0.7015899999999999
13,0.5989800000000001
14,0.5435399999999999
15,0.60034
16,0.58872
17,0.5566
18,0.61853
19,0.70193
20,0.64895
21,0.7126399999999999
22,0.69644
23,0.73607
24,0.76479
25,0.7995399999999999
26,0.73024
27,0.71834
28,0.69719
29,0.71812
30,0.73673
31,0.74366
32,0.70539
33,0.70775
34,0.70235
35,0.77418
36,0.6956
37,0.64062
38,0.71383
39,0.7454
40,0.6754
41,0.56955
42,0.5241600000000001
43,0.49783
44,0.43213999999999997
45,0.36709
46,0.28505
47,0.078604
48,-0.29699000000000003
49,-0.5738
50,-0.67614
51,-0.86892
52,-1.2464
53,-1.5812
54,-1.8061
55,-2.3046
56,-2.3209
57,-2.4383
58,-2.7126
59,-2.7531
60,-2.5223
61,-2.4794
62,-1.9271
63,-1.5522
64,-1.4992
65,-1.3679
66,-1.3148
67,-0.95252
68,-0.90035
69,-0.66132
70,-0.43303
71,-0.29999000000000003
72,-0.30069
73,-0.19760999999999998
74,-0.1987
75,-0.29009
76,-0.29325
77,0.095792
78,-0.70081
79,-0.58406
80,-0.6277699999999999
81,-0.90236
82,-0.64767
83,-0.43714
84,-0.59887
85,-0.69701
86,-0.75653
87,-0.59865
88,-0.46097
89,-0.4486
90,-0.53169
91,-0.51808
92,-0.46805
93,-0.396
94,-0.38436
95,-0.50742
96,-0.52463
97,-0.44092
98,-0.4197
99,-0.48521000000000003
100,-0.55491
101,-0.50325
102,-0.45912
103,-0.47931
104,-0.51835
105,-0.4558
106,-0.32677
107,-0.4346
108,-0.46813999999999995
109,-0.45548
110,-0.46534
111,-0.47808
112,-0.39826
113,-0.39682
114,-0.42676000000000003
115,-0.47412
116,-0.42891999999999997
117,-0.36969
118,-0.32908000000000004
119,-0.32783
120,-0.276
121,-0.30306
122,-0.38409
123,-0.326
124,-0.26724000000000003
125,-0.22428
126,-0.19854000000000002
127,-0.16568
128,-0.20688
129,-0.2863
130,-0.2908
131,-0.17782
132,-0.099215
133,-0.0040027000000000005
134,-0.12178
135,-0.15434
136,-0.28748
137,-0.32946
138,-0.15254
139,-0.1211
140,-0.15098
141,0.042871
142,-0.114
143,-0.27513000000000004
144,-0.65145
145,-0.5211100000000001
146,-0.29267
147,-0.34951
148,-0.44267
149,-0.26907
150,-0.0028566999999999998
151,0.13183
152,0.41231999999999996
153,0.9295899999999999
154,0.65398
155,0.8860299999999999
156,1.0290000000000001
157,0.44222
158,-0.31584
159,-0.75238
160,-1.3787
161,-1.6576
162,-1.2214
163,-1.2257
164,-3.8668
165,-4.8292
166,-3.3075
167,-3.6282
168,-3.497
169,-3.5197
170,-2.8504
171,-2.6226
172,-2.5377
173,-2.2897
174,-2.0385
175,-1.7438
176,-1.4079
177,-1.2396
178,-1.0659999999999998
179,-0.74119
180,-0.54437
181,-0.39714
182,-0.18345
183,-0.021266
184,-0.019888999999999997
185,0.87026
186,2.2528
187,1.5971
188,0.99503
189,0.58519
190,0.12337999999999999
191,0.91884
192,0.9116700000000001
193,0.80252
194,0.68691
195,0.5815899999999999
196,0.49303
197,0.40143
198,0.57655
199,0.50666
200,0.50371
201,0.5672699999999999
202,0.44766000000000006
203,0.6775899999999999
204,0.59283
205,0.47608999999999996
206,0.46286000000000005
207,0.59407
208,0.60148
209,0.62178
210,0.71401
211,0.64642
212,0.6245
213,0.62832
214,0.58306
215,0.59683
216,0.58035
217,0.64881
218,0.78695
219,0.6764600000000001
220,0.69689
221,0.5766399999999999
222,0.54287
223,0.65036
224,0.58692
225,0.5837399999999999
226,0.5725600000000001
227,0.56195
228,0.58832
229,0.59243
230,0.58781
231,0.66208
232,0.71562
233,0.60454
234,0.6037899999999999
235,0.6954
236,0.71753
237,0.6670699999999999
238,0.57031
239,0.6677
240,0.5179699999999999
241,0.56318
242,0.5327
243,0.58704
244,0.5878800000000001
245,0.7098899999999999
246,0.5918
247,0.58614
248,0.59292
249,0.58608
250,0.5885100000000001
251,0.71518
252,0.72215
253,0.85035
254,0.8520700000000001
255,0.98103
256,0.8550200000000001
257,0.7517199999999999
258,0.6161399999999999
259,0.61468
260,0.72725
261,0.73135
262,0.69147
263,0.72525
264,0.5936
265,0.58121
266,0.5696899999999999
267,0.57729
268,0.7136
269,0.71431
270,0.7951199999999999
271,0.71658
272,0.5892
273,0.72012
274,0.65784
275,0.65823
276,0.7207399999999999
277,0.7199800000000001
278,0.71495
279,0.70293
280,0.71045
281,0.71065
282,0.7983
283,0.70345
284,0.70819
285,0.8509
286,0.84509
287,0.84711
288,0.84315
289,0.8062699999999999
290,0.68567
291,0.68396
292,0.8256100000000001
293,0.6985100000000001
294,0.71923
295,0.7034
296,0.8382700000000001
297,0.83363
298,0.82211
299,0.6845899999999999
