time,value
0,1.6062
1,1.5112
2,1.4166
3,1.3226
4,1.2289
5,1.1356
6,1.0428
7,0.95124
8,0.8598100000000001
9,0.76884
10,0.67884
11,0.60165
12,0.5142800000000001
13,0.42782
14,0.34239
15,0.25648000000000004
16,0.16996
17,0.087015
18,0.0089299
19,-0.070655
20,-0.151
21,-0.23321999999999998
22,-0.30921
23,-0.3843
24,-0.45432
25,-0.52582
26,-0.58441
27,-0.6521100000000001
28,-0.71336
29,-0.76657
30,-0.81817
31,-0.87487
32,-0.92332
33,-0.9634
34,-1.0177
35,-1.0476
36,-1.0773
37,-1.102
38,-1.1257
39,-1.1409
40,-1.1521
41,-1.1607
42,-1.1585
43,-1.1483
44,-1.1303
45,-1.1201
46,-1.0996
47,-1.0607
48,-1.0354
49,-1.0031
50,-0.9667600000000001
51,-0.9151600000000001
52,-0.8657299999999999
53,-0.81593
54,-0.75972
55,-0.69523
56,-0.63543
57,-0.56304
58,-0.49811000000000005
59,-0.41991000000000006
60,-0.34965
61,-0.28346
62,-0.20629
63,-0.12805999999999998
64,-0.057459
65,0.022276
66,0.10402
67,0.18652
68,0.27073
69,0.35615
70,0.44185
71,0.53018
72,0.60718
73,0.69898
74,0.78856
75,0.87755
76,0.9685799999999999
77,1.0595
78,1.1519
79,1.2448
80,1.3377
81,1.4313
82,1.5134
83,1.6082
84,1.6926
85,1.7326
86,1.7258
87,1.7132
88,1.6572
89,1.5739
90,1.4919
91,1.4018
92,1.3116
93,1.22
94,1.1308
95,1.0413
96,0.9490299999999999
97,0.85601
98,0.76575
99,0.67585
100,0.58341
101,0.49095
102,0.39909
103,0.30724
104,0.21423000000000003
105,0.12428
106,0.033227
107,-0.057490999999999993
108,-0.14783
109,-0.23775
110,-0.32718
111,-0.41605
112,-0.50429
113,-0.59178
114,-0.67842
115,-0.7640399999999999
116,-0.8484799999999999
117,-0.9253299999999999
118,-1.0063
119,-1.0795
120,-1.1614
121,-1.2209999999999999
122,-1.2868
123,-1.3516
124,-1.4009
125,-1.4421
126,-1.4851
127,-1.5186
128,-1.5411
129,-1.5518
130,-1.5501
131,-1.5361
132,-1.5105
133,-1.4743
134,-1.429
135,-1.3844
136,-1.3254
137,-1.2652
138,-1.1979
139,-1.1238
140,-1.0469
141,-0.9747100000000001
142,-0.8971100000000001
143,-0.8199799999999999
144,-0.73551
145,-0.64988
146,-0.5583199999999999
147,-0.47108999999999995
148,-0.38311
149,-0.29875999999999997
150,-0.20936999999999997
151,-0.1195
152,-0.029211
153,0.061457000000000005
154,0.15245999999999998
155,0.24376
156,0.33532
157,0.41843
158,0.51031
159,0.6024
160,0.69468
161,0.7843600000000001
162,0.8770399999999999
163,0.96852
164,1.0603
165,1.1487
166,1.2417
167,1.3312
168,1.4207
169,1.5092
170,1.5844
171,1.6719
172,1.7144
173,1.7379
174,1.73
175,1.6783
