[<text>
<title>computer devices inc 4th qtr</title>
<dateline>    nutting lake, mass, march 23 -
    </dateline>shr loss one cnt vs profit one cnt
    net loss 35,000 vs profit 42,000
    revs 881,000 vs 1.3 mln
    year
    shr profit seven cts vs profit nine cts
    net profit 291,000 vs profit 366,000
    revs 4.4 mln vs 5.9 mln
    note:1985 4th qtr and year includes gain of 7,000 dlrs and
147,000 dlrs respectivley. 1986 year includes gain of 35,000
dlrs from tax loss carryforwards.
 reuter
</text>]