time,value
0,1.7854
1,1.733
2,1.8901
3,1.6807
4,1.7854
5,1.733
6,1.2094
7,-0.6235
8,-0.67586
9,-0.6235
10,-0.67586
11,-0.67586
12,-0.57113
13,-0.67586
14,-0.6235
15,-0.67586
16,-0.67586
17,-0.67586
18,-0.67586
19,-0.67586
20,-0.57113
21,-0.67586
22,-0.67586
23,-0.67586
24,-0.67586
25,-0.67586
26,-0.67586
27,-0.67586
28,0.79042
29,1.4188
30,1.4712
31,1.4188
32,1.4712
33,1.4712
34,1.4712
35,1.4188
36,1.4712
37,1.4188
38,1.4188
39,1.4712
40,1.5236
41,1.4712
42,1.4188
43,1.4712
44,1.4188
45,-0.099825
46,-0.6235
47,-0.67586
48,-0.67586
49,-0.67586
50,-0.67586
51,-0.67586
52,-0.67586
53,-0.6235
54,-0.67586
55,-0.67586
56,-0.57113
57,-0.67586
58,-0.67586
59,-0.67586
60,-0.67586
61,-0.6235
62,-0.67586
63,-0.67586
64,-0.67586
65,-0.67586
66,-0.67586
67,-0.6235
68,-0.67586
69,-0.67586
70,-0.67586
71,-0.67586
72,-0.67586
73,0.057277
74,1.7854
75,1.7854
76,1.733
77,1.733
78,-0.4664
79,-0.67586
80,-0.67586
81,-0.6235
82,-0.67586
83,-0.67586
84,-0.67586
85,-0.67586
86,-0.6235
87,-0.6235
88,-0.67586
89,-0.67586
90,-0.6235
91,-0.67586
92,-0.67586
93,-0.51876
94,-0.41403
95,-0.41403
