time,value
0,-0.16727999999999998
1,-0.20774
2,-0.16727999999999998
3,-0.18173
4,-0.20774
5,-0.16727999999999998
6,-0.1904
7,-0.18750999999999998
8,-0.17595
9,-0.19907
10,-0.15861
11,-0.18173
12,-0.19907
13,-0.15572
14,-0.19329000000000002
15,-0.18462
16,-0.17017000000000002
17,-0.19329000000000002
18,-0.17017000000000002
19,-0.18750999999999998
20,-0.20196
21,-0.14994000000000002
22,-0.20196
23,-0.18750999999999998
24,-0.1615
25,-0.19618
26,-0.17017000000000002
27,-0.18173
28,-0.1904
29,-0.12683
30,-0.17884
31,-0.17884
32,-0.14415999999999998
33,-0.18462
34,-0.15861
35,-0.16727999999999998
36,-0.18750999999999998
37,-0.16439
38,-0.18750999999999998
39,-0.15572
40,-0.15572
41,-0.19618
42,-0.17595
43,-0.17017000000000002
44,-0.19618
45,-0.16439
46,-0.1904
47,-0.18462
48,-0.15572
49,-0.19618
50,-0.18173
51,-0.14994000000000002
52,-0.19329000000000002
53,-0.17306
54,-0.17595
55,-0.1904
56,-0.1615
57,-0.18750999999999998
58,-0.18750999999999998
59,-0.14415999999999998
60,-0.19618
61,-0.18173
62,-0.16727999999999998
63,-0.19907
64,-0.17595
65,-0.1904
66,-0.19329000000000002
67,-0.16727999999999998
68,-0.20196
69,-0.1904
70,-0.16727999999999998
71,-0.20485
72,-0.17884
73,-0.1904
74,-0.17306
75,-0.16439
76,-0.1904
77,-0.17595
78,-0.14705
79,-0.1904
80,-0.17595
81,-0.17017000000000002
82,-0.19618
83,-0.16727999999999998
84,-0.1904
85,-0.18173
86,-0.16727999999999998
87,-0.19907
88,-0.18750999999999998
89,5.4103
90,6.205
91,4.9248
92,-0.08925599999999999
93,-0.17884
94,-0.16439
95,-0.17306
