time,value
0,-0.23308
1,-0.23308
2,-0.23308
3,-0.23308
4,-0.23308
5,-0.23308
6,-0.23308
7,-0.23308
8,-0.23308
9,-0.23308
10,-0.23308
11,-0.23308
12,-0.23308
13,-0.23308
14,-0.23308
15,-0.23308
16,-0.23308
17,-0.23308
18,-0.23308
19,-0.23308
20,-0.23308
21,-0.23308
22,-0.23308
23,-0.23308
24,-0.23308
25,-0.23308
26,-0.23308
27,-0.23308
28,-0.23308
29,-0.23308
30,-0.23308
31,-0.23308
32,-0.23308
33,-0.23308
34,-0.23308
35,-0.23308
36,-0.23308
37,-0.23308
38,-0.23308
39,-0.23308
40,-0.23308
41,-0.23308
42,-0.23308
43,-0.23308
44,-0.23308
45,-0.23308
46,-0.23308
47,-0.23308
48,-0.23308
49,-0.23308
50,-0.23308
51,-0.23308
52,-0.23308
53,-0.23308
54,-0.23308
55,-0.23308
56,-0.23308
57,-0.23308
58,-0.23308
59,-0.23308
60,-0.23308
61,-0.23308
62,-0.23308
63,-0.23308
64,-0.23308
65,-0.23308
66,-0.23308
67,-0.23308
68,-0.23308
69,-0.23308
70,-0.23308
71,-0.23308
72,-0.23308
73,-0.23308
74,-0.23308
75,5.1542
76,-0.16182
77,-0.23308
78,-0.23308
79,-0.23308
80,-0.23308
81,4.2278
82,3.6719999999999997
83,4.3133
84,3.6862
85,-0.14757
86,-0.23308
87,-0.23308
88,-0.23308
89,-0.23308
90,-0.23308
91,-0.23308
92,-0.23308
93,-0.23308
94,-0.23308
95,-0.23308
