time,value
0,-0.35329
1,0.27093
2,1.1032
3,-0.76944
4,1.1032
5,-0.35329
6,-0.35329
7,1.3113
8,-1.1856
9,0.8951600000000001
10,0.47901000000000005
11,-1.6017
12,1.5194
13,-0.56137
14,-0.56137
15,0.68708
16,-1.1856
17,0.47901000000000005
18,-0.35329
19,-0.76944
20,0.8951600000000001
21,-1.6017
22,0.062856
23,0.27093
24,-1.6017
25,1.3113
26,-0.14522000000000002
27,-0.56137
28,1.5194
29,-0.9775200000000001
30,1.3113
31,0.8951600000000001
32,-0.35329
33,1.7275
34,-0.14522000000000002
35,0.062856
36,1.5194
37,-1.3937
38,1.1032
39,0.8951600000000001
40,-1.3937
41,1.3113
42,-0.14522000000000002
43,-0.56137
44,0.68708
45,-1.1856
46,0.27093
47,-0.14522000000000002
48,-0.9775200000000001
49,1.3113
50,-0.56137
51,-0.14522000000000002
52,1.9355
53,-1.1856
54,0.27093
55,0.47901000000000005
56,-1.3937
57,0.68708
58,-0.35329
59,-0.56137
60,0.8951600000000001
61,-1.1856
62,0.062856
63,-0.14522000000000002
64,-1.3937
65,1.3113
66,-0.76944
67,-0.76944
68,1.7275
69,-1.3937
70,0.062856
71,0.062856
72,-1.1856
73,0.68708
74,0.47901000000000005
75,-0.35329
76,0.8951600000000001
77,-1.1856
78,0.8951600000000001
79,0.47901000000000005
80,-1.1856
81,1.9355
82,-0.56137
83,-0.56137
84,1.7275
85,-1.6017
86,-0.14522000000000002
87,0.062856
88,-1.8098
89,0.27093
90,-1.1856
91,0.27093
92,0.68708
93,-1.6017
94,1.3113
95,0.27093
