time,value
0,1.2754
1,1.0914
2,-1.0243
3,-1.0243
4,-1.0243
5,-1.0243
6,0.2635
7,1.1834
8,1.1834
9,-0.3804
10,-1.0243
11,-1.0243
12,-1.0243
13,-1.0243
14,1.3673
15,1.2754
16,0.81542
17,-1.0243
18,-1.0243
19,-1.0243
20,-1.0243
21,-0.10444
22,1.1834
23,1.1834
24,0.07952999999999999
25,-1.0243
26,-1.0243
27,-1.0243
28,-1.0243
29,0.81542
30,1.1834
31,1.1834
32,-1.0243
33,-1.0243
34,-1.0243
35,-0.28841999999999995
36,1.2754
37,1.2754
38,0.53946
39,-1.0243
40,-1.0243
41,-1.0243
42,0.2635
43,1.1834
44,1.1834
45,-0.84034
46,-1.0243
47,-1.0243
48,-1.0243
49,1.2754
50,1.1834
51,0.2635
52,-1.0243
53,-1.0243
54,-1.0243
55,-0.19643
56,1.1834
57,1.1834
58,-0.3804
59,-1.0243
60,-1.0243
61,-1.0243
62,0.35549000000000003
63,1.2754
64,1.1834
65,1.2754
66,0.17152
67,-1.0243
68,-1.0243
69,0.90741
70,1.1834
71,1.1834
72,1.0914
73,-1.0243
74,-1.0243
75,0.17152
76,1.2754
77,1.0914
78,0.35549000000000003
79,-1.0243
80,-1.0243
81,0.9994
82,1.1834
83,0.72344
84,-1.0243
85,-1.0243
86,0.2635
87,1.1834
88,1.1834
89,1.0914
90,1.0914
91,0.44748000000000004
92,-1.0243
93,-1.0243
94,-1.0243
95,0.63145
