time,value
0,0.1757
1,1.2154
2,0.8688600000000001
3,0.63781
4,0.63781
5,0.63781
6,0.63781
7,0.52228
8,0.52228
9,0.52228
10,0.63781
11,0.52228
12,0.52228
13,0.52228
14,0.40675
15,0.52228
16,0.52228
17,0.52228
18,0.52228
19,0.40675
20,0.52228
21,0.52228
22,0.52228
23,0.40675
24,0.52228
25,0.40675
26,-0.055357
27,-1.7883
28,-1.7883
29,-1.7883
30,-1.7883
31,-1.7883
32,-1.7883
33,-1.7883
34,-1.7883
35,-1.7883
36,-1.7883
37,-1.7883
38,0.8688600000000001
39,1.0999
40,0.75333
41,0.75333
42,0.63781
43,0.52228
44,0.52228
45,0.52228
46,0.52228
47,0.52228
48,0.52228
49,0.52228
50,0.52228
51,0.40675
52,0.52228
53,0.52228
54,0.40675
55,0.52228
56,0.40675
57,0.52228
58,0.52228
59,0.52228
60,0.52228
61,0.40675
62,0.52228
63,0.40675
64,0.52228
65,-0.6329899999999999
66,-1.7883
67,-1.7883
68,-1.7883
69,-1.7883
70,-1.7883
71,-1.7883
72,-1.7883
73,-1.7883
74,-1.7883
75,-1.7883
76,-1.7883
77,0.63781
78,1.0999
79,0.75333
80,0.63781
81,0.63781
82,0.52228
83,0.52228
84,0.52228
85,0.52228
86,0.40675
87,0.52228
88,0.1757
89,0.63781
90,0.52228
91,0.52228
92,0.52228
93,0.52228
94,0.40675
95,0.52228
