time,value
0,1.4615
1,1.3758
2,1.2785
3,1.1772
4,1.0679
5,0.9809200000000001
6,0.89025
7,0.79674
8,0.7082
9,0.619
10,0.56728
11,0.46726999999999996
12,0.37055
13,0.27078
14,0.15766
15,0.052445000000000006
16,-0.063302
17,-0.1898
18,-0.22689
19,-0.36346999999999996
20,-0.47398
21,-0.57595
22,-0.68283
23,-0.74102
24,-0.7820600000000001
25,-0.8440700000000001
26,-0.8108
27,-0.71207
28,-0.58333
29,-0.45293999999999995
30,-0.31866
31,-0.19025
32,-0.07484500000000001
33,0.04362
34,0.16054000000000002
35,0.27702
36,0.38492
37,0.46761
38,0.5635399999999999
39,0.66272
40,0.78103
41,0.88415
42,0.9832
43,1.0931
44,1.2058
45,1.3173
46,1.2865
47,1.1628
48,1.0231
49,0.8909600000000001
50,0.75672
51,0.66662
52,0.5886
53,0.49465
54,0.37753000000000003
55,0.26976
56,0.20751
57,0.20319
58,0.14787
59,0.027257999999999998
60,-0.086594
61,-0.196
62,-0.30628
63,-0.41818
64,-0.52659
65,-0.6397
66,-0.72236
67,-0.71535
68,-0.75371
69,-0.77235
70,-0.86082
71,-0.9566100000000001
72,-1.0093
73,-1.0505
74,-1.1178
75,-1.1446
76,-1.0962
77,-0.9574600000000001
78,-0.8783700000000001
79,-0.77462
80,-0.6272
81,-0.51052
82,-0.38023
83,-0.26573
84,-0.15254
85,-0.030324
86,0.063012
87,0.18738
88,0.32611
89,0.43168
90,0.5455300000000001
91,0.67499
92,0.8025899999999999
93,0.9470200000000001
94,1.0439
95,1.0506
96,0.95032
97,0.87518
98,0.74421
99,0.62649
100,0.49906999999999996
101,0.44975
102,0.41116
103,0.29716
104,0.15197
105,-0.0080395
106,-0.10902
107,-0.23706999999999998
108,-0.37346
109,-0.50156
110,-0.62454
111,-0.77345
112,-0.8948799999999999
113,-1.0311
114,-1.1682
115,-1.2882
116,-1.3973
117,-1.4612
118,-1.4725
119,-1.5487
120,-1.4702
121,-1.4943
122,-1.3762
123,-1.2754
124,-1.2264
125,-1.1815
126,-1.1681
127,-1.1015
128,-1.0188
129,-0.91986
130,-0.8062600000000001
131,-0.7147
132,-0.6068100000000001
133,-0.53488
134,-0.4478
135,-0.3423
136,-0.23526999999999998
137,-0.14651
138,-0.066709
139,-0.057048
140,-0.077198
141,-0.050131999999999996
142,0.035297
143,0.1296
144,0.22535
145,0.32845
146,0.43662
147,0.53249
148,0.5475899999999999
149,0.59922
150,0.69944
151,0.7942899999999999
152,0.9020600000000001
153,1.004
154,1.0987
155,1.2114
156,1.3174
157,1.4161
158,1.306
159,1.1872
160,1.0697
161,0.951
162,0.8357600000000001
163,0.71863
164,0.60216
165,0.48825
166,0.3856
167,0.27299
168,0.15913
169,0.040609
170,-0.07285
171,-0.18893
172,-0.30726
173,-0.42446000000000006
174,-0.5361100000000001
175,-0.6157600000000001
176,-0.70368
177,-0.79291
178,-0.84855
179,-0.83934
180,-0.8136899999999999
181,-0.7341300000000001
182,-0.63672
183,-0.5271
184,-0.44577
185,-0.36193000000000003
186,-0.27476
187,-0.1545
188,-0.028906
189,0.10957
190,0.22676
191,0.33641
192,0.44837
193,0.53465
194,0.59425
195,0.64873
196,0.75021
197,0.8540399999999999
198,0.9503299999999999
199,1.0181
200,1.0865
201,1.1798
202,1.2722
203,1.3581
204,1.2856
205,1.1688
206,1.054
207,0.94048
208,0.82809
209,0.71334
210,0.61465
211,0.5282
212,0.50561
213,0.57063
214,0.6568
215,0.74293
216,0.79402
217,0.8975700000000001
218,0.9297700000000001
219,0.9495100000000001
220,0.9969600000000001
221,1.0803
222,1.1547
223,1.2343
224,1.3185
225,1.4154
226,1.5035
227,1.5812
228,1.4542
229,1.3238
230,1.1832
231,1.0576
232,0.9715299999999999
233,0.9416399999999999
234,0.81107
235,0.6681199999999999
236,0.54328
237,0.40624
238,0.3161
239,0.26493
240,0.24973
241,0.23173000000000002
242,0.10027
243,-0.027975999999999997
244,-0.15225
245,-0.27476999999999996
246,-0.39625
247,-0.50965
248,-0.61856
249,-0.7321300000000001
250,-0.84945
251,-0.96273
252,-1.0704
253,-1.1835
254,-1.2903
255,-1.4057
256,-1.5129
257,-1.5437
258,-1.6275
259,-1.732
260,-1.8176
261,-1.86
262,-1.929
263,-1.9129
264,-1.8266
265,-1.7567
266,-1.663
267,-1.56
268,-1.4594
269,-1.3476
270,-1.2426
271,-1.1306
272,-1.0199
273,-0.90889
274,-0.79271
275,-0.6759999999999999
276,-0.56442
277,-0.46115
278,-0.3728
279,-0.25775
280,-0.14213
281,-0.026548000000000002
282,0.094428
283,0.20864000000000002
284,0.32532
285,0.44978999999999997
286,0.56735
287,0.68215
288,0.77988
289,0.6846899999999999
290,0.5784199999999999
291,0.48615
292,0.45465
293,0.42886
294,0.41768999999999995
295,0.49701000000000006
296,0.62283
297,0.71409
298,0.8145100000000001
299,0.9148200000000001
300,0.97946
301,0.9645299999999999
302,0.99372
303,1.0674
304,1.1546
305,1.2215
306,1.3087
307,1.3857
308,1.3361
309,1.2211
310,1.1198
311,1.0333
312,0.94578
313,0.8607299999999999
314,0.7624
315,0.68833
316,0.6357
317,0.53482
318,0.43021000000000004
319,0.32309
320,0.22459
321,0.12113
322,0.012764
323,-0.089757
324,-0.14271
325,-0.086368
326,-0.020896
327,0.038167
328,0.12149000000000001
329,0.149
330,0.0092266
331,-0.13377
332,-0.24966999999999998
333,-0.38898
334,-0.54352
335,-0.69416
336,-0.83588
337,-0.95425
338,-1.0247
339,-1.1276
340,-1.2664
341,-1.3848
342,-1.5104
343,-1.5586
344,-1.699
345,-1.8322
346,-1.9371
347,-2.0449
348,-2.1622
349,-2.2735
350,-2.3467
351,-2.3721
352,-2.4426
353,-2.4961
354,-2.4792
355,-2.5156
356,-2.5368
357,-2.4587
358,-2.3442
359,-2.2842
360,-2.213
361,-2.1588
362,-2.0435
363,-1.926
364,-1.8108
365,-1.7167
366,-1.5961
367,-1.5048
368,-1.4225
369,-1.3544
370,-1.2646
371,-1.1415
372,-1.0246
373,-0.9699399999999999
374,-0.8505
375,-0.7330800000000001
376,-0.62197
377,-0.50789
378,-0.39036
379,-0.27155999999999997
380,-0.15489
381,-0.043355
382,0.074809
383,0.18965
384,0.26816
385,0.24902
386,0.22395
387,0.21589
388,0.32081
389,0.43263
390,0.52674
391,0.6427
392,0.76366
393,0.87366
394,0.9452200000000001
395,1.0542
396,1.1712
397,1.2909
398,1.4169999999999998
399,1.5361
400,1.6533
401,1.7742
402,1.7767
403,1.6951
404,1.5903
405,1.5038
406,1.435
407,1.3592
408,1.2992
409,1.2349
410,1.2365
411,1.1817
412,1.0839
413,0.99536
414,0.9025200000000001
415,0.80971
416,0.71399
417,0.65132
418,0.6379
419,0.67707
420,0.75197
421,0.8292299999999999
422,0.9375700000000001
423,1.0773
424,1.1662
425,1.2824
426,1.4106
