time,value
0,-0.32809
1,-0.32809
2,-0.32809
3,-0.32809
4,-0.32809
5,-0.32809
6,-0.32809
7,-0.32809
8,-0.32809
9,-0.32809
10,-0.32809
11,-0.32809
12,-0.32809
13,-0.32809
14,-0.32809
15,-0.32809
16,-0.32809
17,-0.32809
18,-0.32809
19,-0.32809
20,-0.32809
21,-0.32809
22,-0.32809
23,-0.32809
24,-0.32809
25,-0.32809
26,-0.32809
27,-0.32809
28,-0.32809
29,-0.32809
30,-0.32809
31,-0.32809
32,-0.32809
33,-0.32809
34,-0.32809
35,-0.32809
36,-0.32809
37,-0.32809
38,-0.32809
39,-0.32809
40,-0.32809
41,2.3936
42,3.359
43,0.46282
44,2.5448
45,-0.13036
46,-0.15363
47,3.138
48,1.5329
49,-0.32809
50,-0.32809
51,-0.32809
52,-0.32809
53,-0.32809
54,-0.32809
55,-0.32809
56,-0.32809
57,-0.32809
58,-0.32809
59,-0.32809
60,-0.32809
61,-0.32809
62,-0.32809
63,-0.32809
64,-0.32809
65,-0.32809
66,-0.32809
67,-0.32809
68,-0.32809
69,-0.32809
70,-0.32809
71,-0.32809
72,-0.32809
73,-0.32809
74,-0.32809
75,-0.32809
76,-0.32809
77,-0.32809
78,-0.32809
79,-0.32809
80,-0.32809
81,-0.32809
82,-0.32809
83,-0.32809
84,-0.32809
85,-0.32809
86,-0.32809
87,-0.2932
88,3.1612
89,2.5913
90,3.3473
91,-0.13036
92,-0.15363
93,-0.15363
94,4.7314
95,-0.32809
