time,value
0,-0.18830999999999998
1,-0.17732
2,-0.19564
3,-0.17732
4,-0.20296
5,-0.16633
6,-0.20663
7,-0.159
8,-0.19564
9,-0.17365999999999998
10,-0.17732
11,-0.19197
12,-0.17365999999999998
13,-0.19197
14,-0.159
15,-0.1993
16,-0.14801
17,-0.19564
18,-0.16999
19,-0.17365999999999998
20,-0.18098
21,-0.16999
22,-0.19197
23,-0.15168
24,-0.1993
25,-0.15168
26,-0.17732
27,-0.159
28,-0.14801
29,-0.16267
30,-0.15168
31,-0.18830999999999998
32,-0.13335999999999998
33,-0.18830999999999998
34,-0.16633
35,-0.17732
36,-0.18098
37,-0.17365999999999998
38,-0.18465
39,-0.14069
40,-0.18465
41,-0.15534
42,-0.16267
43,-0.15534
44,-0.17365999999999998
45,-0.16267
46,-0.16999
47,2.4455
48,8.1051
49,4.5628
50,-0.078415
51,-0.15168
52,-0.11137999999999999
53,-0.16267
54,-0.093067
55,-0.16267
56,-0.14435
57,-0.16267
58,-0.17365999999999998
59,-0.15168
60,-0.17732
61,-0.14435
62,-0.19197
63,-0.15534
64,-0.18830999999999998
65,-0.15534
66,-0.18465
67,-0.159
68,-0.18098
69,-0.14801
70,-0.16633
71,-0.159
72,-0.14801
73,-0.16267
74,-0.1297
75,-0.16999
76,-0.14069
77,-0.17365999999999998
78,-0.14801
79,-0.18098
80,-0.14435
81,-0.17365999999999998
82,-0.11871
83,-0.13702999999999999
84,-0.12604
85,-0.1297
86,-0.1297
87,-0.14435
88,-0.14801
89,-0.14435
90,-0.159
91,-0.13335999999999998
92,-0.18465
93,-0.14069
94,-0.13335999999999998
95,-0.14435
