time,value
0,1.7567
1,1.7358
2,1.6561
3,1.5647
4,1.4725
5,1.3795
6,1.2865
7,1.1936
8,1.1012
9,1.0170000000000001
10,0.9253899999999999
11,0.83326
12,0.74752
13,0.66083
14,0.57826
15,0.48895
16,0.40074
17,0.31323
18,0.22573000000000001
19,0.13892000000000002
20,0.061513
21,-0.024166
22,-0.10684
23,-0.18384
24,-0.26765
25,-0.34643
26,-0.4282
27,-0.51061
28,-0.5877399999999999
29,-0.66496
30,-0.73295
31,-0.80891
32,-0.8760899999999999
33,-0.9477700000000001
34,-1.0101
35,-1.0746
36,-1.1306
37,-1.1862
38,-1.2405
39,-1.2785
40,-1.3151
41,-1.3466
42,-1.3708
43,-1.3840000000000001
44,-1.3882
45,-1.3807
46,-1.3626
47,-1.3405
48,-1.3052
49,-1.2671
50,-1.2148
51,-1.1629
52,-1.1054
53,-1.0435
54,-0.98082
55,-0.9071299999999999
56,-0.83895
57,-0.76751
58,-0.69011
59,-0.61432
60,-0.53693
61,-0.45719
62,-0.37632
63,-0.29418
64,-0.22109
65,-0.13909000000000002
66,-0.053725
67,0.030427999999999997
68,0.11581
69,0.19424
70,0.28021999999999997
71,0.35957
72,0.44666999999999996
73,0.52756
74,0.61583
75,0.6985399999999999
76,0.78933
77,0.87956
78,0.96272
79,1.0542
80,1.1465
81,1.2388
82,1.3313
83,1.4242
84,1.5167
85,1.6083
86,1.6928
87,1.7697
88,1.7811
89,1.7347
90,1.6446
91,1.5611
92,1.4681
93,1.375
94,1.2819999999999998
95,1.189
96,1.0965
97,1.0047
98,0.9212299999999999
99,0.82986
100,0.73919
101,0.64977
102,0.5606399999999999
103,0.47043999999999997
104,0.38395
105,0.29569
106,0.20800000000000002
107,0.12264000000000001
108,0.036468
109,-0.047492
110,-0.13333
111,-0.21436
112,-0.29543
113,-0.37266
114,-0.44668
115,-0.527
116,-0.59722
117,-0.6753899999999999
118,-0.75033
119,-0.82499
120,-0.8960899999999999
121,-0.96406
122,-1.0317
123,-1.0939
124,-1.1496
125,-1.21
126,-1.2514
127,-1.2991
128,-1.3317
129,-1.3627
130,-1.3761
131,-1.3869999999999998
132,-1.3871
133,-1.3763
134,-1.3611
135,-1.3246
136,-1.2925
137,-1.2521
138,-1.1988
139,-1.1495
140,-1.0855
141,-1.0282
142,-0.96129
143,-0.8976200000000001
144,-0.82911
145,-0.75762
146,-0.67981
147,-0.60592
148,-0.5292
149,-0.44943
150,-0.36823
151,-0.28702
152,-0.20471
153,-0.13014
154,-0.044565
155,0.039169999999999996
156,0.12514
157,0.21129
158,0.29746999999999996
159,0.38443
160,0.46475
161,0.5535
162,0.63572
163,0.72529
164,0.8156
165,0.90738
166,0.9905799999999999
167,1.0827
168,1.175
169,1.2679
170,1.3608
171,1.4532
172,1.5461
173,1.6385
174,1.7108
175,1.749
