time,value
0,0.67066
1,-0.88308
2,-0.88308
3,-0.5917600000000001
4,1.6417
5,1.6417
6,0.088005
7,-0.88308
8,-0.88308
9,-0.20332
10,0.18511
11,-0.88308
12,-0.49465
13,1.6417
14,1.6417
15,-0.39754
16,-0.88308
17,-0.88308
18,0.86487
19,-0.88308
20,-0.88308
21,-0.88308
22,1.6417
23,1.6417
24,-0.30043000000000003
25,-0.88308
26,-0.88308
27,-0.49465
28,0.67066
29,-0.88308
30,-0.88308
31,1.3504
32,1.7388
33,-0.5917600000000001
34,-0.39754
35,0.47644
36,-0.88308
37,-0.88308
38,-0.20332
39,1.8359999999999999
40,0.76776
41,-0.88308
42,-0.88308
43,0.76776
44,-0.5917600000000001
45,-0.88308
46,0.96198
47,1.6417
48,-0.88308
49,-0.88308
50,0.57355
51,-0.49465
52,-0.88308
53,-0.5917600000000001
54,0.67066
55,1.1562
56,1.3504
57,-0.88308
58,-0.88308
59,-0.88308
60,0.96198
61,-0.88308
62,-0.88308
63,0.86487
64,1.6417
65,-0.0091039
66,-0.88308
67,-0.88308
68,0.96198
69,-0.88308
70,-0.88308
71,0.088005
72,1.7388
73,1.2533
74,-0.88308
75,-0.88308
76,-0.88308
77,0.76776
78,-0.39754
79,0.76776
80,1.7388
81,-0.88308
82,-0.88308
83,0.96198
84,-0.88308
85,-0.88308
86,0.57355
87,1.8359999999999999
88,0.96198
89,-0.88308
90,-0.88308
91,-0.88308
92,0.96198
93,-0.88308
94,-0.68886
95,1.8359999999999999
