time,value
0,-0.27297
1,-0.27297
2,-0.27297
3,-0.27297
4,-0.27297
5,-0.27297
6,-0.27297
7,-0.27297
8,-0.27297
9,-0.27297
10,-0.27297
11,-0.27297
12,-0.27297
13,-0.27297
14,-0.27297
15,-0.27297
16,-0.27297
17,-0.27297
18,-0.27297
19,-0.27297
20,-0.27297
21,-0.27297
22,-0.27297
23,-0.27297
24,-0.27297
25,-0.27297
26,-0.27297
27,-0.27297
28,-0.27297
29,-0.27297
30,-0.27297
31,-0.27297
32,-0.27297
33,-0.27297
34,-0.27297
35,-0.27297
36,-0.27297
37,-0.27297
38,-0.27297
39,-0.27297
40,-0.27297
41,-0.27297
42,1.4087
43,4.9183
44,0.31196
45,-0.27297
46,2.3154
47,4.0701
48,0.34121
49,-0.27297
50,4.0117
51,0.34121
52,-0.1706
53,-0.27297
54,0.12186
55,4.9037
56,0.35583000000000004
57,-0.27297
58,-0.27297
59,-0.27297
60,-0.27297
61,-0.27297
62,-0.27297
63,-0.27297
64,-0.27297
65,-0.27297
66,-0.27297
67,-0.27297
68,-0.27297
69,-0.27297
70,-0.27297
71,-0.27297
72,-0.27297
73,-0.27297
74,-0.27297
75,-0.27297
76,-0.27297
77,-0.27297
78,-0.27297
79,-0.27297
80,-0.27297
81,-0.27297
82,-0.27297
83,-0.27297
84,-0.27297
85,-0.27297
86,-0.27297
87,-0.27297
88,-0.27297
89,-0.27297
90,-0.27297
91,-0.27297
92,-0.27297
93,-0.27297
94,-0.27297
95,-0.27297
