time,value
0,1.7164
1,1.6665
2,1.528
3,1.396
4,1.2611
5,1.1485
6,0.9955700000000001
7,1.0490000000000002
8,0.96906
9,0.8382299999999999
10,0.70538
11,0.5715
12,0.39794
13,0.2627
14,0.10149
15,0.012925999999999998
16,-0.016137000000000002
17,0.08203400000000001
18,0.12430999999999999
19,0.032033
20,-0.07101299999999999
21,-0.21783000000000002
22,-0.34549
23,-0.47313
24,-0.54242
25,-0.68637
26,-0.78989
27,-0.9422299999999999
28,-1.0597
29,-1.1753
30,-1.1177
31,-1.0811
32,-0.98213
33,-0.8625299999999999
34,-0.7461300000000001
35,-0.64288
36,-0.66098
37,-0.76546
38,-0.9070799999999999
39,-0.9605799999999999
40,-1.0952
41,-1.1789
42,-1.2037
43,-1.3528
44,-1.4662
45,-1.5535
46,-1.6323
47,-1.6801
48,-1.6887
49,-1.8030000000000002
50,-1.9014
51,-1.9651
52,-2.0667
53,-2.1733
54,-2.2171
55,-2.3008
56,-2.3913
57,-2.4493
58,-2.4217
59,-2.2894
60,-2.1425
61,-2.1674
62,-2.0426
63,-1.9237
64,-1.7828
65,-1.6651
66,-1.5891
67,-1.4752
68,-1.351
69,-1.2369
70,-1.0996
71,-0.98962
72,-0.8779100000000001
73,-0.7490100000000001
74,-0.62317
75,-0.49309
76,-0.34619
77,-0.28076
78,-0.17423
79,-0.17494
80,-0.087122
81,0.04506
82,0.17723
83,0.24825
84,0.32845
85,0.43732
86,0.55697
87,0.66683
88,0.7845300000000001
89,0.9322299999999999
90,1.0683
91,1.0552
92,1.0336
93,0.95689
94,0.9
95,0.82925
96,0.74738
97,0.68619
98,0.59904
99,0.51415
100,0.45091000000000003
101,0.38587
102,0.36775
103,0.30459
104,0.20406
105,0.18079
106,0.12097999999999999
107,0.087854
108,0.0047442
109,-0.062215999999999994
110,-0.045704
111,-0.1091
112,-0.11085999999999999
113,-0.038137
114,-0.012487
115,0.031504000000000004
116,-0.016284
117,-0.050204
118,-0.020276
119,-0.07921900000000001
120,-0.13927
121,-0.20190999999999998
122,-0.26166
123,-0.30182
124,-0.37577
125,-0.3906
126,-0.40492
127,-0.43235
128,-0.36245
129,-0.29801
130,-0.29825999999999997
131,-0.32116999999999996
132,-0.33009
133,-0.35079
134,-0.35813
135,-0.38242
136,-0.35535
137,-0.28434
138,-0.30032
139,-0.22255
140,-0.083471
141,0.034422
142,0.17001
143,0.31275
144,0.43243000000000004
145,0.55887
146,0.67696
147,0.71268
148,0.70621
149,0.71415
150,0.77568
151,0.83521
152,0.86026
153,0.8730600000000001
154,0.84115
155,0.87416
156,0.89464
157,0.96529
158,1.035
159,1.0347
160,1.0555
161,1.0262
162,1.0072
163,0.96259
164,0.96831
165,0.9868600000000001
166,0.9834700000000001
167,0.9391200000000001
168,0.90754
169,0.8515299999999999
170,0.8607899999999999
171,0.80502
172,0.76532
173,0.86925
174,0.90951
175,0.8930600000000001
176,0.8658
177,0.9068
178,0.8419399999999999
179,0.7824300000000001
180,0.82371
181,0.75617
182,0.6754
183,0.58412
184,0.50556
185,0.41413
186,0.33973000000000003
187,0.26231
188,0.20951
189,0.18541
190,0.14304
191,0.086711
192,0.10054
193,0.22503
194,0.36329
195,0.5426
196,0.72188
197,0.8595700000000001
198,1.0386
199,1.1771
200,1.3149
201,1.4952
202,1.6753
203,1.7665
204,1.7734
205,1.7026
206,1.5534
207,1.3728
208,1.1921
209,1.0526
210,0.93758
211,0.77382
212,0.59317
213,0.4538
214,0.2732
215,0.16512000000000002
216,0.14332999999999999
217,0.15861
218,0.1767
219,0.22905
220,0.23763
221,0.29512
222,0.35872
223,0.43116000000000004
224,0.46835
225,0.50872
226,0.58829
227,0.6491399999999999
228,0.7085100000000001
229,0.78258
230,0.83024
231,0.9081100000000001
232,0.9659700000000001
233,0.9841
234,0.97278
235,0.88785
236,0.77012
237,0.638
238,0.61917
239,0.63668
240,0.68514
241,0.7197600000000001
242,0.76141
243,0.80976
244,0.87236
245,0.75881
246,0.7971699999999999
247,0.82105
248,0.83278
249,0.84095
250,0.8395799999999999
251,0.70631
252,0.6392
253,0.65258
254,0.65069
255,0.65154
256,0.6523
257,0.6236
258,0.49313999999999997
259,0.46851000000000004
260,0.45009
261,0.40576
262,0.4391
263,0.35995
264,0.22525
265,0.10558
266,-0.031485
267,-0.15306
268,-0.29011
269,-0.41188
270,-0.53675
271,-0.5453600000000001
272,-0.55572
273,-0.55165
274,-0.5351899999999999
275,-0.53395
276,-0.5089100000000001
277,-0.49313999999999997
278,-0.47503
279,-0.46006
280,-0.42868
281,-0.39839
282,-0.35622
283,-0.37312
284,-0.4827
285,-0.55861
286,-0.53042
287,-0.47686000000000006
288,-0.43396999999999997
289,-0.37596
290,-0.375
291,-0.39655999999999997
292,-0.34731999999999996
293,-0.38458000000000003
294,-0.37687
295,-0.32305
296,-0.25785
297,-0.19259
298,-0.14633
299,-0.20125
300,-0.36071
301,-0.39049
302,-0.31408
303,-0.25105
304,-0.17361
305,-0.09971100000000001
306,-0.030926
307,0.052528
308,0.14047
309,0.22851
310,0.30365
311,0.32139
312,0.26226
313,0.34835
314,0.45069
315,0.47529
316,0.5876399999999999
317,0.68975
318,0.78788
319,0.85795
320,0.96751
321,1.0734
322,1.192
323,1.3055
324,1.4256
325,1.5198
326,1.5817
327,1.4825
328,1.3386
329,1.195
330,1.0519
331,0.91769
332,0.7877
333,0.65995
334,0.52579
335,0.39714
336,0.26347
337,0.17293
338,0.11638
339,0.06801
340,-0.029876
341,-0.13884000000000002
342,-0.1808
343,-0.29503
344,-0.45787
345,-0.57714
346,-0.67552
347,-0.69315
348,-0.72922
349,-0.7598600000000001
350,-0.91538
351,-1.011
352,-1.0997
353,-1.2367
354,-1.3123
355,-1.4489
356,-1.5454
357,-1.6961
358,-1.8243
359,-1.9531
360,-2.0856
361,-2.148
362,-2.2327
363,-2.3215
364,-2.4322
365,-2.5064
366,-2.5057
367,-2.4639
368,-2.4138
369,-2.3514
370,-2.283
371,-2.1706
372,-2.037
373,-1.892
374,-1.8145
375,-1.8099
376,-1.8007
377,-1.6614
378,-1.514
379,-1.3951
380,-1.2554
381,-1.1019
382,-1.0426
383,-0.9938100000000001
384,-0.8831600000000001
385,-0.80716
386,-0.71712
387,-0.64762
388,-0.59928
389,-0.5545100000000001
390,-0.61046
391,-0.70133
392,-0.75284
393,-0.84262
394,-0.73301
395,-0.621
396,-0.5181899999999999
397,-0.38795
398,-0.25690999999999997
399,-0.15299000000000001
400,-0.031083
401,0.088632
402,0.15688
403,0.19327
404,0.28486
405,0.46513999999999994
406,0.63431
407,0.74312
408,0.8765299999999999
409,0.97267
410,1.1529
411,1.2617
412,1.3819
413,1.2659
414,1.1718
415,1.0998
416,1.1131
417,1.2004
418,1.3146
419,1.4939
420,1.6738
421,1.7585
422,1.7466
423,1.7365
424,1.7171
425,1.7321
426,1.7317
