time,value
0,-0.32983
1,-0.32983
2,-0.32983
3,-0.32983
4,-0.32983
5,-0.32983
6,-0.32983
7,-0.32983
8,-0.32983
9,-0.32983
10,-0.32983
11,-0.32983
12,-0.32983
13,-0.32983
14,-0.32983
15,-0.32983
16,-0.32983
17,-0.32983
18,-0.32983
19,-0.32983
20,-0.32983
21,-0.32983
22,-0.32983
23,-0.32983
24,-0.32983
25,-0.32983
26,-0.32983
27,-0.32983
28,-0.32983
29,-0.32983
30,-0.32983
31,-0.32983
32,-0.32983
33,-0.32983
34,-0.32983
35,-0.32983
36,-0.32983
37,-0.32983
38,-0.32983
39,-0.32983
40,-0.32983
41,-0.32983
42,-0.32983
43,-0.32983
44,2.8689999999999998
45,3.1128
46,2.2191
47,0.71615
48,-0.15719
49,-0.1775
50,4.6563
51,-0.32983
52,-0.32983
53,-0.32983
54,-0.32983
55,-0.32983
56,-0.32983
57,-0.32983
58,-0.32983
59,-0.32983
60,-0.32983
61,-0.32983
62,-0.32983
63,-0.32983
64,-0.32983
65,-0.32983
66,-0.32983
67,-0.32983
68,-0.32983
69,-0.32983
70,-0.32983
71,-0.32983
72,-0.32983
73,-0.32983
74,-0.32983
75,-0.32983
76,-0.32983
77,-0.32983
78,-0.32983
79,-0.32983
80,-0.32983
81,-0.32983
82,-0.32983
83,-0.32983
84,-0.32983
85,-0.32983
86,1.8637
87,3.1128
88,1.0614
89,3.0417
90,-0.15719
91,-0.18766
92,0.60444
93,4.1384
94,-0.32983
95,-0.32983
