time,value
0,-0.15238
1,-0.15238
2,-0.15238
3,-0.15238
4,-0.15238
5,-0.15238
6,-0.15238
7,-0.15238
8,-0.15238
9,-0.15238
10,-0.15238
11,-0.15238
12,-0.15238
13,-0.15238
14,-0.15238
15,-0.15238
16,-0.15238
17,-0.15238
18,-0.15238
19,-0.15238
20,-0.15238
21,-0.15238
22,-0.15238
23,-0.15238
24,-0.15238
25,-0.15238
26,8.32
27,0.58189
28,-0.15238
29,-0.15238
30,-0.15238
31,-0.15238
32,-0.15238
33,-0.15238
34,-0.15238
35,-0.15238
36,-0.15238
37,-0.15238
38,-0.15238
39,-0.15238
40,-0.15238
41,-0.15238
42,-0.15238
43,-0.15238
44,-0.15238
45,-0.15238
46,-0.15238
47,-0.15238
48,-0.15238
49,-0.15238
50,-0.15238
51,-0.15238
52,-0.15238
53,-0.15238
54,-0.15238
55,-0.15238
56,-0.15238
57,-0.15238
58,-0.15238
59,-0.15238
60,-0.15238
61,-0.15238
62,-0.15238
63,-0.15238
64,-0.15238
65,-0.15238
66,-0.15238
67,-0.15238
68,-0.15238
69,-0.15238
70,-0.15238
71,-0.15238
72,-0.15238
73,4.8181
74,0.29946999999999996
75,-0.15238
76,-0.15238
77,-0.15238
78,-0.15238
79,-0.15238
80,-0.15238
81,-0.15238
82,-0.15238
83,-0.15238
84,-0.15238
85,-0.15238
86,-0.15238
87,-0.15238
88,-0.15238
89,-0.15238
90,-0.15238
91,-0.15238
92,-0.15238
93,-0.15238
94,-0.15238
95,-0.15238
