time,value
0,-0.2773
1,-0.2773
2,-0.2773
3,-0.2773
4,-0.2773
5,-0.2773
6,-0.2773
7,-0.2773
8,-0.2773
9,-0.2773
10,-0.2773
11,-0.2773
12,-0.2773
13,-0.2773
14,-0.2773
15,-0.2773
16,-0.2773
17,-0.2773
18,-0.2773
19,-0.2773
20,-0.2773
21,-0.2773
22,-0.2773
23,-0.2773
24,-0.2773
25,-0.2773
26,-0.2773
27,-0.2773
28,-0.2773
29,-0.2773
30,-0.2773
31,-0.2773
32,3.6388
33,1.7907
34,-0.2773
35,-0.2773
36,-0.2773
37,-0.2773
38,-0.2773
39,-0.2773
40,-0.2773
41,-0.2773
42,4.4748
43,-0.2773
44,-0.2773
45,-0.2773
46,-0.2773
47,3.4188
48,-0.2773
49,-0.2773
50,-0.2773
51,-0.2773
52,-0.2773
53,-0.2773
54,3.5508
55,-0.2773
56,-0.2773
57,-0.2773
58,-0.2773
59,-0.2773
60,-0.2773
61,-0.2773
62,-0.2773
63,3.9028
64,-0.2773
65,-0.2773
66,-0.2773
67,-0.2773
68,-0.2773
69,-0.2773
70,-0.2773
71,-0.2773
72,-0.2773
73,-0.2773
74,-0.2773
75,-0.2773
76,-0.2773
77,-0.2773
78,-0.2773
79,3.5068
80,-0.2773
81,-0.2773
82,-0.057293
83,-0.10128999999999999
84,-0.2773
85,-0.2773
86,-0.2773
87,-0.2773
88,-0.2773
89,-0.2773
90,-0.2773
91,-0.2773
92,-0.2773
93,-0.2773
94,-0.2773
95,-0.2773
