time,value
0,-0.094963
1,1.089
2,0.8522
3,0.7338100000000001
4,0.7338100000000001
5,0.49701000000000006
6,0.61541
7,0.49701000000000006
8,0.61541
9,0.49701000000000006
10,0.49701000000000006
11,0.49701000000000006
12,0.49701000000000006
13,0.49701000000000006
14,0.49701000000000006
15,0.49701000000000006
16,0.49701000000000006
17,0.49701000000000006
18,0.49701000000000006
19,0.37861999999999996
20,0.49701000000000006
21,-1.0421
22,-1.8709
23,-1.8709
24,-1.8709
25,-1.8709
26,-1.8709
27,-1.8709
28,-1.8709
29,-1.8709
30,-1.8709
31,-1.8709
32,-0.094963
33,1.089
34,0.9706
35,0.7338100000000001
36,0.61541
37,0.61541
38,0.49701000000000006
39,0.49701000000000006
40,0.49701000000000006
41,0.49701000000000006
42,0.49701000000000006
43,0.49701000000000006
44,0.37861999999999996
45,0.61541
46,0.49701000000000006
47,0.49701000000000006
48,0.49701000000000006
49,0.49701000000000006
50,0.49701000000000006
51,0.49701000000000006
52,0.61541
53,0.49701000000000006
54,0.49701000000000006
55,0.49701000000000006
56,0.49701000000000006
57,0.49701000000000006
58,0.49701000000000006
59,0.37861999999999996
60,0.49701000000000006
61,0.49701000000000006
62,0.49701000000000006
63,0.37861999999999996
64,0.49701000000000006
65,0.49701000000000006
66,0.49701000000000006
67,0.37861999999999996
68,0.49701000000000006
69,0.37861999999999996
70,0.49701000000000006
71,0.37861999999999996
72,0.49701000000000006
73,0.37861999999999996
74,0.37861999999999996
75,0.37861999999999996
76,0.37861999999999996
77,0.37861999999999996
78,0.37861999999999996
79,-1.3973
80,-1.8709
81,-1.8709
82,-1.8709
83,-1.8709
84,-1.8709
85,-1.8709
86,-1.8709
87,-1.8709
88,-1.8709
89,-1.2789
90,1.2074
91,0.9706
92,0.8522
93,0.61541
94,0.49701000000000006
95,0.61541
