time,value
0,-0.7165100000000001
1,-0.7165100000000001
2,-0.7165100000000001
3,-0.7165100000000001
4,-0.7165100000000001
5,-0.7165100000000001
6,-0.7165100000000001
7,-0.7165100000000001
8,-0.7165100000000001
9,-0.7165100000000001
10,-0.7165100000000001
11,-0.7165100000000001
12,-0.7165100000000001
13,-0.7165100000000001
14,-0.7165100000000001
15,-0.7165100000000001
16,-0.7165100000000001
17,-0.7165100000000001
18,-0.7165100000000001
19,-0.7165100000000001
20,-0.7165100000000001
21,-0.7165100000000001
22,-0.7165100000000001
23,-0.7165100000000001
24,-0.7165100000000001
25,-0.7165100000000001
26,-0.7165100000000001
27,-0.7165100000000001
28,-0.7165100000000001
29,-0.7165100000000001
30,-0.7165100000000001
31,-0.7165100000000001
32,-0.7165100000000001
33,-0.7165100000000001
34,-0.7165100000000001
35,-0.7165100000000001
36,-0.7165100000000001
37,-0.7165100000000001
38,-0.7165100000000001
39,-0.7165100000000001
40,-0.7165100000000001
41,-0.7165100000000001
42,-0.7165100000000001
43,-0.7165100000000001
44,-0.7165100000000001
45,-0.7165100000000001
46,-0.7165100000000001
47,-0.7165100000000001
48,-0.7165100000000001
49,-0.7165100000000001
50,-0.7165100000000001
51,-0.7165100000000001
52,-0.7165100000000001
53,-0.7165100000000001
54,-0.7165100000000001
55,-0.7165100000000001
56,-0.7165100000000001
57,-0.55857
58,-0.40062
59,-0.40062
60,0.62602
61,1.4157
62,1.4947
63,1.6527
64,1.5737
65,1.5737
66,1.4947
67,1.5737
68,1.4947
69,1.4157
70,1.4947
71,1.4157
72,0.3891
73,-0.40062
74,-0.40062
75,1.0999
76,1.4947
77,1.4947
78,1.4947
79,1.4157
80,1.4157
81,1.4157
82,1.4157
83,1.4947
84,1.4157
85,1.4157
86,1.4157
87,1.4157
88,1.4157
89,1.4157
90,0.073214
91,-0.40062
92,-0.55857
93,1.6527
94,1.7316
95,1.6527
