time,value
0,-0.98355
1,-0.98355
2,-0.98355
3,-0.98355
4,-0.98355
5,-0.98355
6,-0.98355
7,-0.98355
8,-0.98355
9,-0.98355
10,-0.98355
11,-0.98355
12,-0.98355
13,-0.98355
14,-0.98355
15,-0.98355
16,-0.98355
17,-0.98355
18,-0.98355
19,-0.98355
20,-0.98355
21,-0.98355
22,-0.98355
23,-0.98355
24,-0.074068
25,1.6622
26,1.7449
27,1.2488
28,0.83542
29,1.1661
30,0.83542
31,0.9181
32,1.0835
33,0.83542
34,0.9181
35,1.1661
36,-0.73551
37,-0.98355
38,-0.98355
39,-0.98355
40,-0.98355
41,-0.98355
42,-0.81819
43,0.33933
44,0.58737
45,0.50469
46,-0.57015
47,0.0086125
48,0.33933
49,1.6622
50,1.9929
51,0.83542
52,1.4142
53,0.75274
54,1.2488
55,1.1661
56,-0.48746999999999996
57,0.0086125
58,-0.98355
59,-0.65283
60,0.42201000000000005
61,-0.98355
62,-0.98355
63,-0.73551
64,-0.98355
65,-0.98355
66,-0.074068
67,1.7449
68,1.4969
69,1.0835
70,1.0835
71,1.0008
72,0.83542
73,1.0835
74,1.0008
75,0.75274
76,1.0008
77,1.0008
78,0.83542
79,0.9181
80,1.0835
81,0.83542
82,0.83542
83,1.0835
84,0.9181
85,0.83542
86,1.0835
87,1.0008
88,-0.73551
89,-0.98355
90,-0.98355
91,-0.98355
92,-0.98355
93,-0.98355
94,-0.98355
95,-0.98355
