time,value
0,0.27255
1,0.29094000000000003
2,0.46531000000000006
3,0.56853
4,0.59492
5,0.57162
6,0.36749
7,0.21974000000000002
8,0.17654
9,0.18263
10,0.17032
11,0.1449
12,0.09914099999999999
13,0.07065199999999999
14,0.15055
15,0.17199
16,0.12380999999999999
17,-0.023306999999999998
18,-0.10161
19,0.0078385
20,0.025435
21,-0.17054
22,-0.13878
23,-0.15517
24,-0.07942
25,-0.062955
26,-0.25332
27,-0.49232
28,-0.6066
29,-0.6984899999999999
30,-1.0282
31,-1.5618
32,-1.7380000000000002
33,-1.9881
34,-2.3209999999999997
35,-2.6055
36,-2.841
37,-2.7718
38,-2.6061
39,-2.5053
40,-2.3219
41,-2.1013
42,-1.8834
43,-1.8709
44,0.16787
45,0.4668
46,0.62753
47,0.85067
48,0.57445
49,0.7994
50,0.7962199999999999
51,0.42045
52,0.34931
53,0.61251
54,0.50469
55,0.14114000000000002
56,0.14768
57,0.2669
58,0.14544
59,-0.051699
60,0.027268999999999998
61,0.011918999999999999
62,0.12122000000000001
63,0.13339
64,0.31386
65,0.23676999999999998
66,0.29553
67,0.09501
68,0.058369000000000004
69,0.051696000000000006
70,-0.048541
71,-0.08959400000000001
72,-0.015781
73,-0.02696
74,-0.1138
75,-0.18558
76,-0.17159000000000002
77,-0.22439
78,-0.2245
79,-0.19485
80,-0.24729
81,-0.27241
82,-0.19759000000000002
83,-0.06704
84,-0.051380999999999996
85,0.026702999999999998
86,-0.020922
87,-0.015588
88,0.066899
89,0.073949
90,0.14634
91,0.17048
92,0.066484
93,0.070938
94,0.18947999999999998
95,0.23445
96,0.016547
97,-0.213
98,-0.23110999999999998
99,-0.081756
100,-0.43371000000000004
101,0.21061
102,0.30255
103,-0.38702
104,-0.25408000000000003
105,0.26066
106,-0.080559
107,-0.74742
108,-0.39489
109,-0.37495
110,-1.3007
111,-1.8730000000000002
112,-2.0663
113,-3.0309
114,-3.2969999999999997
115,-3.6587
116,-4.3891
117,-4.3113
118,-4.1266
119,-3.7765
120,-2.7906
121,-2.3068
122,-2.7164
123,-2.6164
124,-1.8935
125,-1.8472
126,-1.9329
127,-1.7890000000000001
128,-1.7183
129,-1.5075
130,-1.296
131,-1.3905
132,-1.3319
133,-1.1534
134,-0.49933
135,0.026597000000000003
136,0.18899999999999997
137,0.3527
138,0.38345
139,0.44952
140,0.41417
141,0.26316
142,0.13601
143,-0.036802
144,-0.092422
145,-0.21470999999999998
146,-0.17189000000000002
147,-0.22246
148,-0.22853
149,-0.19009
150,-0.09917000000000001
151,-0.064411
152,-0.13085
153,-0.099636
154,-0.10953
155,-0.048865
156,0.1104
157,0.15266
158,0.12953
159,0.13119
160,0.17553
161,0.19572
162,0.23365999999999998
163,0.12067
164,0.027522
165,0.06104
166,0.032767000000000004
167,-0.077737
168,0.0019838
169,0.12405999999999999
170,0.09677000000000001
171,0.07821499999999999
172,0.21588000000000002
173,0.21441999999999997
174,0.10243
175,0.17995999999999998
176,0.29295
177,0.28934
178,0.18949000000000002
179,-0.00039648
180,0.16244
181,0.34968
182,0.30083000000000004
183,0.34462
184,0.33066
185,0.44998
186,0.48663
187,0.45666999999999996
188,0.32779
189,0.39729000000000003
190,0.37827
191,0.36094
192,0.39169
193,0.5152
194,0.59291
195,0.57581
196,0.59709
197,0.63031
198,0.64025
199,0.4928
200,0.48363999999999996
201,0.63113
202,0.59177
203,0.4967
204,0.54587
205,0.49778999999999995
206,0.48973999999999995
207,0.56966
208,0.71553
209,0.72795
210,0.72819
211,0.76763
212,0.78241
213,0.7405
214,0.58018
215,0.64795
216,0.5937
217,0.70467
218,0.66201
219,0.53882
220,0.57023
221,0.5272600000000001
222,0.48168
223,0.56345
224,0.7296600000000001
225,0.70211
226,0.66543
227,0.64045
228,0.71741
229,0.7393
230,0.72753
231,0.74051
232,0.8570399999999999
233,0.71585
234,0.78891
235,0.80329
236,0.6506
237,0.59701
238,0.6040800000000001
239,0.6078899999999999
240,0.56548
241,0.60612
242,0.6301899999999999
243,0.63559
244,0.62834
245,0.62271
246,0.64762
247,0.80281
248,0.63951
249,0.6377
250,0.61341
251,0.64268
252,0.652
253,0.6503399999999999
254,0.64153
255,0.8105600000000001
256,0.64668
257,0.83762
258,0.82547
259,0.8227700000000001
260,0.71717
261,0.66664
262,0.7657
263,0.8265100000000001
264,0.65686
265,0.64218
266,0.79414
267,0.80789
268,0.6439
269,0.64383
270,0.80929
271,0.8194299999999999
272,0.82815
273,0.82504
274,0.8356899999999999
275,0.7306
276,0.8283
277,0.8302200000000001
278,0.67056
279,0.80394
280,0.64476
281,0.64512
282,0.64373
283,0.63642
284,0.64355
285,0.64693
286,0.8097300000000001
287,0.95011
288,0.8055100000000001
289,0.79828
290,0.77783
291,0.7773100000000001
292,0.78279
293,0.80135
294,0.8073600000000001
295,0.90641
296,0.8021199999999999
297,0.79589
298,0.78522
299,0.78145
