time,value
0,-1.8442
1,-1.8399
2,-1.8257
3,-1.7927
4,-1.7397
5,-1.6979
6,-1.6677
7,-1.6327
8,-1.5597
9,-1.5131
10,-1.4432
11,-1.367
12,-1.2988
13,-1.2083
14,-1.1732
15,-1.0721
16,-0.96099
17,-0.85193
18,-0.7358100000000001
19,-0.62363
20,-0.49868
21,-0.37037
22,-0.24705
23,-0.11911
24,-0.038364999999999996
25,0.080786
26,0.17847000000000002
27,0.25108
28,0.33159
29,0.40433
30,0.43733999999999995
31,0.51341
32,0.58349
33,0.64791
34,0.70707
35,0.76135
36,0.81119
37,0.8406100000000001
38,0.89164
39,0.88638
40,0.92801
41,0.9520000000000001
42,0.97173
43,1.0185
44,1.0338
45,1.0163
46,1.0318
47,1.0638
48,1.0795
49,1.0631
50,1.0788
51,1.0946
52,1.0946
53,1.1105
54,1.1265
55,1.1265
56,1.1261
57,1.1097
58,1.1258
59,1.1094
60,1.093
61,1.1091
62,1.1091
63,1.1091
64,1.0928
65,1.1415
66,1.1578
67,1.1088
68,1.1251
69,1.1251
70,1.1251
71,1.1414
72,1.1052
73,1.0673
74,1.0073
75,0.961
76,0.9162799999999999
77,0.85836
78,0.8247
79,0.75727
80,0.74503
81,0.67637
82,0.6399600000000001
83,0.53961
84,0.47439
85,0.4742
86,0.40758
87,0.34021
88,0.29036999999999996
89,0.24176
90,0.21088
91,0.16496
92,0.10279
93,0.059649
94,0.018040999999999998
95,-0.022045
96,-0.052388
97,-0.11079000000000001
98,-0.15727
99,-0.24264000000000002
100,-0.30086999999999997
101,-0.37408
102,-0.46008000000000004
103,-0.54783
104,-0.63659
105,-0.71034
106,-0.81655
107,-0.90494
108,-0.96401
109,-1.0486
110,-1.1297
111,-1.1997
112,-1.2577
113,-1.2792
114,-1.2674
115,-1.2691
116,-1.2522
117,-1.2458
118,-1.2373
119,-1.2264
120,-1.2129
121,-1.1905
122,-1.1972
123,-1.1948
124,-1.158
125,-1.1575
126,-1.2017
127,-1.1972
128,-1.2163
129,-1.2324
130,-1.2456
131,-1.2561
132,-1.2828
133,-1.2666
134,-1.2707
135,-1.2558
136,-1.2572
137,-1.2476
138,-1.2233
139,-1.1633
140,-1.0843
141,-1.0185
142,-0.9336399999999999
143,-0.84667
144,-0.77473
145,-0.6853899999999999
146,-0.59511
147,-0.50589
148,-0.41851000000000005
149,-0.32746
150,-0.24456
151,-0.16533
152,-0.070927
153,-0.013129
154,0.016295
155,0.013209
156,0.073533
157,0.087655
158,0.13215
159,0.17806
160,0.20895999999999998
161,0.25756999999999997
162,0.29123000000000004
163,0.35836999999999997
164,0.39396
165,0.42525
166,0.49046999999999996
167,0.56596
168,0.62107
169,0.6884100000000001
170,0.74402
171,0.78808
172,0.8797299999999999
173,0.9319200000000001
174,0.9805299999999999
175,0.9920100000000001
176,1.0184
177,1.0563
178,1.0763
179,1.1415
180,1.1579
181,1.1417
182,1.1581
183,1.1581
184,1.1419
185,1.1745
186,1.1583
187,1.1583
188,1.1422
189,1.1261
190,1.1261
191,1.1101
192,1.0941
193,1.0941
194,1.0782
195,1.0624
196,1.0952
197,1.0795
198,1.0959
199,1.0802
200,1.1123
201,1.0811
202,1.0656
203,1.0502
204,1.0665
205,1.0524
206,1.0373
207,1.0025
208,0.96744
209,0.95767
210,0.9366899999999999
211,0.89386
212,0.87418
213,0.79608
214,0.74557
215,0.69072
216,0.64746
217,0.61559
218,0.5455300000000001
219,0.50248
220,0.42058999999999996
221,0.33142
222,0.26757
223,0.17943
224,0.09906799999999999
225,-0.017987
226,-0.12912
227,-0.25426
228,-0.35423000000000004
229,-0.48255
230,-0.59142
231,-0.7037100000000001
232,-0.82704
233,-0.9390200000000001
234,-1.0363
235,-1.1396
236,-1.2373
237,-1.3104
238,-1.3517
239,-1.4282
240,-1.4987
241,-1.5597
242,-1.6185
243,-1.6701
244,-1.6997
245,-1.7565
246,-1.7942
247,-1.8267
248,-1.8289
249,-1.844
250,-1.8448
