time,value
0,0.45564
1,0.36236999999999997
2,0.45564
3,0.45564
4,0.45564
5,0.36236999999999997
6,0.45564
7,0.45564
8,0.45564
9,0.45564
10,0.45564
11,0.45564
12,0.45564
13,0.45564
14,0.36236999999999997
15,0.45564
16,0.45564
17,0.36236999999999997
18,0.5489
19,0.45564
20,0.36236999999999997
21,0.45564
22,0.45564
23,0.45564
24,0.45564
25,0.45564
26,3.3468
27,2.6007
28,2.4142
29,2.1344
30,2.694
31,1.5748
32,0.36236999999999997
33,0.45564
34,0.45564
35,0.45564
36,0.45564
37,0.36236999999999997
38,0.45564
39,0.45564
40,0.45564
41,0.45564
42,0.8286899999999999
43,0.45564
44,0.36236999999999997
45,0.17584
46,-0.010687
47,0.17584
48,-0.10395
49,-0.19722
50,-0.47701000000000005
51,-0.5702699999999999
52,-0.5702699999999999
53,-0.66354
54,-1.3164
55,-1.3164
56,-1.3164
57,-1.3164
58,-1.3164
59,-1.3164
60,-1.3164
61,-1.3164
62,-1.3164
63,-1.3164
64,-1.3164
65,-0.010687
66,-1.3164
67,-1.1299
68,-1.3164
69,-0.29048
70,-0.5702699999999999
71,-0.47701000000000005
72,-1.3164
73,-1.3164
74,-1.3164
75,-1.3164
76,-1.3164
77,-1.3164
78,-1.3164
79,-1.3164
80,-1.1299
81,1.5748
82,1.6681
83,0.5489
84,0.5489
85,0.5489
86,0.17584
87,-0.47701000000000005
88,-0.38374
89,-0.47701000000000005
90,-0.38374
91,-0.38374
92,-0.47701000000000005
93,-0.38374
94,-0.47701000000000005
95,-0.38374
