time,value
0,-0.39249
1,-0.39249
2,-0.39249
3,-0.39249
4,-0.39249
5,-0.39249
6,-0.39249
7,-0.39249
8,-0.39249
9,-0.39249
10,-0.39249
11,-0.39249
12,-0.39249
13,-0.39249
14,-0.39249
15,-0.39249
16,-0.39249
17,-0.39249
18,-0.39249
19,-0.39249
20,-0.39249
21,-0.39249
22,-0.39249
23,-0.39249
24,-0.39249
25,-0.39249
26,-0.39249
27,-0.39249
28,-0.39249
29,-0.39249
30,-0.39249
31,-0.39249
32,-0.39249
33,-0.39249
34,-0.39249
35,-0.39249
36,-0.39249
37,-0.39249
38,-0.39249
39,-0.39249
40,-0.39249
41,-0.39249
42,-0.39249
43,-0.39249
44,-0.39249
45,-0.39249
46,-0.39249
47,-0.39249
48,-0.39249
49,-0.39249
50,2.6984
51,3.4343
52,0.19625
53,0.19625
54,0.19625
55,0.19625
56,0.19625
57,0.19625
58,0.19625
59,0.19625
60,0.19625
61,0.19625
62,0.19625
63,0.19625
64,0.19625
65,0.19625
66,0.93217
67,4.9061
68,4.7589
69,4.1702
70,0.19625
71,0.19625
72,0.19625
73,0.19625
74,0.19625
75,0.19625
76,0.19625
77,0.19625
78,0.19625
79,0.19625
80,-0.098123
81,-0.39249
82,-0.39249
83,-0.39249
84,-0.39249
85,-0.39249
86,-0.39249
87,-0.39249
88,-0.39249
89,-0.39249
90,-0.39249
91,-0.39249
92,-0.39249
93,-0.39249
94,-0.39249
95,-0.39249
