time,value
0,-0.303
1,-0.303
2,-0.303
3,-0.303
4,-0.303
5,-0.303
6,-0.303
7,-0.303
8,-0.303
9,-0.303
10,-0.303
11,-0.303
12,0.15508
13,-0.303
14,-0.303
15,-0.303
16,-0.303
17,-0.303
18,-0.303
19,-0.303
20,0.15508
21,-0.303
22,-0.303
23,-0.303
24,-0.303
25,-0.303
26,-0.303
27,-0.303
28,-0.303
29,-0.303
30,-0.303
31,-0.303
32,-0.303
33,-0.303
34,-0.303
35,-0.303
36,-0.303
37,-0.303
38,-0.303
39,-0.303
40,0.15508
41,-0.303
42,-0.303
43,-0.303
44,-0.303
45,-0.303
46,-0.303
47,-0.303
48,-0.303
49,-0.303
50,-0.303
51,-0.303
52,-0.303
53,-0.303
54,-0.303
55,-0.303
56,0.15508
57,-0.303
58,-0.303
59,-0.303
60,-0.303
61,-0.303
62,-0.303
63,-0.303
64,-0.303
65,-0.303
66,-0.303
67,-0.303
68,-0.303
69,-0.303
70,-0.303
71,-0.303
72,-0.303
73,-0.303
74,-0.303
75,-0.303
76,-0.303
77,-0.303
78,-0.303
79,-0.303
80,-0.303
81,-0.303
82,-0.303
83,-0.303
84,-0.303
85,0.8421799999999999
86,3.8197
87,3.8197
88,3.5906
89,3.8197
90,3.5906
91,3.8197
92,1.5293
93,-0.303
94,-0.303
95,-0.303
