time,value
0,-0.55838
1,1.7722
2,-0.55838
3,-0.55838
4,-0.55838
5,-0.55838
6,-0.55838
7,1.7722
8,-0.55838
9,-0.55838
10,1.7722
11,-0.55838
12,-0.55838
13,-0.55838
14,-0.55838
15,-0.55838
16,1.7722
17,1.7722
18,-0.55838
19,-0.55838
20,1.7722
21,-0.55838
22,-0.55838
23,-0.55838
24,-0.55838
25,1.7722
26,-0.55838
27,-0.55838
28,-0.55838
29,1.7722
30,-0.55838
31,-0.55838
32,-0.55838
33,1.7722
34,-0.55838
35,-0.55838
36,-0.55838
37,-0.55838
38,1.7722
39,-0.55838
40,-0.55838
41,-0.55838
42,-0.55838
43,-0.55838
44,-0.55838
45,-0.55838
46,1.7722
47,-0.55838
48,-0.55838
49,-0.55838
50,-0.55838
51,1.7722
52,-0.55838
53,1.7722
54,-0.55838
55,-0.55838
56,1.7722
57,-0.55838
58,-0.55838
59,-0.55838
60,-0.55838
61,-0.55838
62,1.7722
63,-0.55838
64,-0.55838
65,-0.55838
66,1.7722
67,-0.55838
68,-0.55838
69,-0.55838
70,-0.55838
71,1.7722
72,-0.55838
73,-0.55838
74,-0.55838
75,1.7722
76,-0.55838
77,-0.55838
78,-0.55838
79,-0.55838
80,1.7722
81,-0.55838
82,-0.55838
83,-0.55838
84,-0.55838
85,1.7722
86,-0.55838
87,-0.55838
88,-0.55838
89,1.7722
90,-0.55838
91,1.7722
92,-0.55838
93,-0.55838
94,1.7722
95,-0.55838
