time,value
0,-0.64676
1,-0.64676
2,-0.64676
3,-0.64676
4,-0.64676
5,1.6463
6,1.8227
7,0.58797
8,-0.64676
9,-0.64676
10,-0.64676
11,-0.64676
12,-0.64676
13,-0.64676
14,-0.64676
15,0.41158
16,1.8227
17,1.8227
18,-0.64676
19,-0.64676
20,-0.64676
21,-0.64676
22,-0.64676
23,-0.64676
24,-0.64676
25,-0.64676
26,1.1171
27,1.8227
28,1.2935
29,-0.64676
30,-0.64676
31,-0.64676
32,-0.64676
33,-0.64676
34,-0.64676
35,-0.11759000000000001
36,1.8227
37,1.6463
38,0.58797
39,-0.64676
40,-0.64676
41,-0.64676
42,-0.64676
43,-0.64676
44,-0.64676
45,-0.64676
46,1.8227
47,1.8227
48,1.4699
49,-0.29398
50,-0.64676
51,-0.64676
52,-0.64676
53,-0.64676
54,-0.64676
55,0.058797
56,1.8227
57,1.8227
58,0.58797
59,-0.64676
60,-0.64676
61,-0.64676
62,-0.64676
63,-0.64676
64,-0.64676
65,0.23519
66,1.8227
67,1.6463
68,0.76436
69,-0.64676
70,-0.64676
71,-0.64676
72,-0.64676
73,-0.64676
74,-0.64676
75,-0.64676
76,1.9991
77,1.6463
78,1.6463
79,-0.64676
80,-0.64676
81,-0.64676
82,-0.64676
83,-0.64676
84,-0.64676
85,0.23519
86,1.9991
87,1.6463
88,-0.64676
89,-0.64676
90,-0.64676
91,-0.64676
92,-0.64676
93,-0.64676
94,-0.29398
95,1.9991
