time,value
0,-0.23735
1,-0.23735
2,-0.23735
3,-0.23735
4,-0.23735
5,-0.23735
6,-0.23735
7,-0.23735
8,-0.23735
9,-0.23735
10,-0.23735
11,-0.23735
12,-0.23735
13,-0.23735
14,-0.23735
15,-0.23735
16,-0.23735
17,-0.23735
18,-0.23735
19,-0.23735
20,-0.23735
21,-0.23735
22,-0.23735
23,-0.23735
24,-0.23735
25,-0.23735
26,-0.23735
27,-0.23735
28,-0.23735
29,-0.23735
30,-0.23735
31,-0.23735
32,-0.23735
33,-0.23735
34,-0.23735
35,-0.23735
36,-0.23735
37,-0.23735
38,-0.23735
39,-0.11238
40,1.1095
41,3.2201
42,-0.0013017
43,0.012583
44,-0.042957
45,6.3165
46,-0.23735
47,-0.23735
48,-0.23735
49,-0.23735
50,-0.23735
51,-0.23735
52,-0.0013017
53,3.3034
54,0.012583
55,0.012583
56,-0.0013017
57,5.2751
58,0.35971
59,-0.23735
60,-0.23735
61,-0.23735
62,-0.23735
63,-0.23735
64,-0.23735
65,-0.23735
66,-0.23735
67,-0.23735
68,-0.23735
69,-0.23735
70,-0.23735
71,-0.23735
72,-0.23735
73,-0.23735
74,-0.23735
75,-0.23735
76,-0.23735
77,-0.23735
78,-0.23735
79,-0.23735
80,-0.23735
81,-0.23735
82,-0.23735
83,-0.23735
84,-0.23735
85,-0.23735
86,-0.23735
87,-0.23735
88,-0.23735
89,-0.23735
90,-0.23735
91,-0.23735
92,-0.23735
93,-0.23735
94,-0.23735
95,-0.23735
