time,value
0,-0.14494
1,-0.14494
2,-0.14494
3,-0.14494
4,-0.14494
5,-0.14494
6,-0.14494
7,-0.14494
8,-0.14494
9,-0.14494
10,-0.14494
11,-0.14494
12,-0.14494
13,-0.14494
14,-0.14494
15,-0.14494
16,-0.14494
17,-0.14494
18,-0.14494
19,-0.14494
20,-0.14494
21,-0.14494
22,-0.14494
23,-0.14494
24,-0.14494
25,-0.14494
26,-0.14494
27,-0.14494
28,-0.14494
29,-0.14494
30,-0.14494
31,-0.14494
32,-0.14494
33,-0.14494
34,-0.14494
35,-0.14494
36,-0.14494
37,-0.14494
38,-0.14494
39,-0.14494
40,-0.14494
41,-0.14494
42,-0.14494
43,-0.14494
44,-0.14494
45,-0.14494
46,-0.14494
47,-0.14494
48,-0.14494
49,-0.14494
50,-0.14494
51,-0.14494
52,-0.14494
53,-0.14494
54,-0.14494
55,-0.14494
56,-0.14494
57,-0.14494
58,6.4807
59,7.1433
60,-0.14494
61,-0.14494
62,-0.14494
63,-0.14494
64,-0.14494
65,-0.14494
66,-0.14494
67,-0.14494
68,-0.14494
69,-0.14494
70,-0.14494
71,-0.14494
72,-0.14494
73,-0.14494
74,-0.14494
75,-0.14494
76,-0.14494
77,-0.14494
78,-0.14494
79,-0.14494
80,-0.14494
81,-0.14494
82,-0.14494
83,-0.14494
84,-0.14494
85,-0.14494
86,-0.14494
87,-0.14494
88,-0.14494
89,-0.14494
90,-0.14494
91,-0.14494
92,-0.14494
93,-0.14494
94,-0.14494
95,-0.14494
