time,value
0,0.8051699999999999
1,1.6004
2,1.2823
3,1.2823
4,1.2823
5,-0.7852899999999999
6,-0.7852899999999999
7,-0.7852899999999999
8,-0.7852899999999999
9,-0.7852899999999999
10,0.32803000000000004
11,1.6004
12,1.4413
13,0.8051699999999999
14,-0.7852899999999999
15,-0.7852899999999999
16,-0.7852899999999999
17,-0.7852899999999999
18,-0.7852899999999999
19,0.8051699999999999
20,1.6004
21,1.2823
22,-0.30815
23,-0.7852899999999999
24,-0.7852899999999999
25,-0.7852899999999999
26,-0.7852899999999999
27,-0.4672
28,1.7594
29,1.4413
30,0.48708
31,-0.7852899999999999
32,-0.7852899999999999
33,-0.7852899999999999
34,-0.7852899999999999
35,-0.7852899999999999
36,0.8051699999999999
37,1.6004
38,1.2823
39,-0.30815
40,-0.7852899999999999
41,-0.7852899999999999
42,-0.7852899999999999
43,-0.7852899999999999
44,-0.7852899999999999
45,1.7594
46,1.4413
47,0.64612
48,-0.7852899999999999
49,-0.7852899999999999
50,-0.7852899999999999
51,-0.7852899999999999
52,-0.7852899999999999
53,0.64612
54,1.6004
55,1.2823
56,-0.7852899999999999
57,-0.7852899999999999
58,-0.7852899999999999
59,-0.7852899999999999
60,-0.7852899999999999
61,-0.7852899999999999
62,1.7594
63,1.4413
64,0.16899
65,-0.7852899999999999
66,-0.7852899999999999
67,-0.7852899999999999
68,-0.7852899999999999
69,-0.7852899999999999
70,0.96421
71,1.6004
72,0.96421
73,-0.7852899999999999
74,-0.7852899999999999
75,-0.7852899999999999
76,-0.7852899999999999
77,-0.7852899999999999
78,-0.30815
79,1.6004
80,1.4413
81,-0.30815
82,-0.7852899999999999
83,-0.7852899999999999
84,-0.7852899999999999
85,-0.7852899999999999
86,-0.7852899999999999
87,1.7594
88,1.4413
89,0.48708
90,-0.7852899999999999
91,-0.7852899999999999
92,-0.7852899999999999
93,-0.7852899999999999
94,0.0099403
95,1.6004
