time,value
0,-0.2342
1,-0.2342
2,-0.12865
3,-0.2342
4,-0.33976
5,-0.65642
6,-0.65642
7,-0.65642
8,-0.55087
9,-0.65642
10,-0.65642
11,-0.65642
12,-0.44531000000000004
13,-0.65642
14,-0.65642
15,-0.65642
16,-0.65642
17,-0.65642
18,-0.55087
19,-0.65642
20,-0.65642
21,-0.65642
22,-0.65642
23,-0.65642
24,-0.65642
25,-0.65642
26,-0.65642
27,-0.65642
28,-0.65642
29,-0.55087
30,-0.65642
31,-0.65642
32,-0.65642
33,-0.65642
34,-0.65642
35,-0.65642
36,-0.65642
37,-0.55087
38,-0.65642
39,-0.65642
40,-0.65642
41,-0.65642
42,0.82135
43,1.7713
44,1.0325
45,-0.65642
46,-0.65642
47,-0.65642
48,-0.65642
49,-0.65642
50,-0.55087
51,-0.65642
52,-0.65642
53,-0.65642
54,-0.65642
55,-0.55087
56,-0.65642
57,-0.65642
58,-0.65642
59,-0.55087
60,-0.65642
61,-0.65642
62,-0.65642
63,-0.44531000000000004
64,1.7713
65,1.8769
66,1.8769
67,1.8769
68,1.7713
69,1.8769
70,1.8769
71,1.8769
72,1.2436
73,-0.12865
74,0.082465
75,1.7713
76,1.8769
77,1.8769
78,1.7713
79,-0.02309
80,-0.2342
81,-0.12865
82,-0.2342
83,-0.2342
84,-0.2342
85,0.18802
86,1.8769
87,1.8769
88,1.8769
89,1.7713
90,1.8769
91,1.8769
92,1.5602
93,-0.65642
94,-0.65642
95,-0.65642
