time,value
0,1.6352
1,1.6127
2,1.5927
3,1.5754
4,1.5333
5,1.4543
6,1.3657
7,1.2724
8,1.1803
9,1.0896
10,0.99621
11,0.90238
12,0.81207
13,0.71899
14,0.62567
15,0.5352100000000001
16,0.44473999999999997
17,0.34863
18,0.28698
19,0.19533
20,0.10870999999999999
21,0.021311
22,-0.060887000000000004
23,-0.15345
24,-0.20800000000000002
25,-0.28503
26,-0.36629
27,-0.44647
28,-0.53187
29,-0.59914
30,-0.6801699999999999
31,-0.7588600000000001
32,-0.81598
33,-0.8883
34,-0.9572200000000001
35,-1.0223
36,-1.083
37,-1.1387
38,-1.1888
39,-1.2325
40,-1.2693
41,-1.2986
42,-1.3199
43,-1.3326
44,-1.3398
45,-1.3591
46,-1.3449
47,-1.3409
48,-1.3169
49,-1.2775
50,-1.2552
51,-1.2017
52,-1.1436
53,-1.0994
54,-1.0497
55,-0.97575
56,-0.9075799999999999
57,-0.8575299999999999
58,-0.79114
59,-0.70765
60,-0.63338
61,-0.55761
62,-0.47546000000000005
63,-0.39324000000000003
64,-0.30435
65,-0.2201
66,-0.13407
67,-0.037823
68,0.050963999999999995
69,0.1407
70,0.23437
71,0.32711
72,0.4207
73,0.51039
74,0.60502
75,0.7005399999999999
76,0.79642
77,0.8930600000000001
78,0.9920899999999999
79,1.0629
80,1.1589
81,1.2575
82,1.3564
83,1.4536
84,1.5496
85,1.6468
86,1.7324
87,1.7454
88,1.7471
89,1.7485
90,1.704
91,1.6119999999999999
92,1.5196
93,1.4248
94,1.3292
95,1.2323
96,1.136
97,1.035
98,0.9341200000000001
99,0.8388899999999999
100,0.75905
101,0.67102
102,0.57749
103,0.48482
104,0.38636
105,0.29443
106,0.23054000000000002
107,0.1388
108,0.044357
109,-0.042621
110,-0.12804000000000001
111,-0.217
112,-0.28026
113,-0.36232
114,-0.44255
115,-0.5291600000000001
116,-0.61756
117,-0.66637
118,-0.74769
119,-0.8175100000000001
120,-0.89736
121,-0.9589700000000001
122,-1.0287
123,-1.0772
124,-1.1413
125,-1.1939
126,-1.2304
127,-1.2770000000000001
128,-1.3164
129,-1.3481
130,-1.3715
131,-1.3587
132,-1.364
133,-1.3602
134,-1.3475
135,-1.3259999999999998
136,-1.296
137,-1.2584
138,-1.2139
139,-1.1631
140,-1.1066
141,-1.0451
142,-0.9793
143,-0.9094899999999999
144,-0.8363200000000001
145,-0.7781600000000001
146,-0.70668
147,-0.6332
148,-0.54889
149,-0.4775
150,-0.41181999999999996
151,-0.33744
152,-0.24675
153,-0.16154000000000002
154,-0.078683
155,0.0017594000000000002
156,0.06769800000000001
157,0.16323
158,0.25
159,0.33803
160,0.43058
161,0.52177
162,0.60893
163,0.70119
164,0.7942899999999999
165,0.88856
166,0.9827600000000001
167,1.0528
168,1.1492
169,1.2413
170,1.3308
171,1.4216
172,1.4914
173,1.5608
174,1.5855
175,1.6256
