time,value
0,0.064054
1,-0.39286
2,-0.39738
3,-0.29146
4,-0.2635
5,-0.28914
6,-0.041692
7,-0.0029358
8,-0.085501
9,0.25388
10,-0.098937
11,-0.16792
12,-0.2432
13,-0.10490999999999999
14,-0.39075
15,-0.18694000000000002
16,-0.35600000000000004
17,-0.34137
18,-0.33994
19,-0.33252
20,-0.44322
21,-0.29386
22,-0.23403000000000002
23,-0.28426
24,-0.4544
25,-0.29727
26,-0.2466
27,-0.26843
28,-0.26393
29,-0.21930999999999998
30,-0.06851
31,-0.12994
32,-0.10784
33,-0.28858
34,-0.30088000000000004
35,-0.39021
36,-0.32406999999999997
37,-0.3425
38,-0.50827
39,-0.51427
40,-0.47353999999999996
41,-0.28535
42,-0.047978
43,0.00080677
44,-0.25203000000000003
45,-0.48278000000000004
46,-0.6554399999999999
47,-0.68077
48,-0.5405800000000001
49,-0.51631
50,-0.65054
51,-0.73165
52,-1.0663
53,-0.9599
54,-0.85844
55,-0.51156
56,-0.54104
57,-0.48131
58,-0.56435
59,-0.60115
60,-0.58911
61,-0.69634
62,-0.7539600000000001
63,-0.94605
64,-0.68926
65,-0.65366
66,-0.8907799999999999
67,-0.86335
68,-0.71933
69,-0.87508
70,-0.8125600000000001
71,-0.30021
72,-0.53182
73,-0.9273
74,-1.6408
75,-1.8904
76,-2.1767
77,-2.3544
78,-2.6391
79,-2.5654
80,-2.0242
81,-2.1283
82,-1.9645
83,-1.9043
84,-1.9882
85,-1.8679
86,-1.845
87,-1.2639
88,-1.0292
89,-0.71705
90,-0.19699
91,0.3714
92,0.56238
93,0.78628
94,1.1854
95,1.689
96,1.2499
97,1.0552
98,0.74328
99,0.80265
100,0.31553000000000003
101,0.26750999999999997
102,0.11922
103,-0.31534
104,-0.64291
105,-0.49318999999999996
106,-0.84965
107,-0.7278899999999999
108,-1.0576
109,-0.7552399999999999
110,-1.1307
111,-1.5526
112,-1.6911
113,-1.6147
114,-1.6028
115,-1.5452
116,-1.7213
117,-1.6001
118,-1.492
119,-1.7381
120,-1.849
121,-1.4505
122,-1.6262
123,-1.7561
124,-1.5767
125,-1.3689
126,-1.4534
127,-1.4209
128,-0.93704
129,-0.75715
130,-0.72042
131,-0.98106
132,0.18293
133,1.218
134,0.90535
135,0.9690200000000001
136,1.5028
137,2.2213
138,2.3358
139,2.7736
140,2.7791
141,3.0622
142,2.6338
143,2.8192
144,2.3802
145,1.7125
146,1.3811
147,1.0455
148,0.60133
149,0.5125
150,0.24725
151,-0.50495
152,-1.115
153,-1.1303
154,-1.4549
155,-1.8988
156,-1.6313
157,-1.1289
158,-0.56093
159,-1.2115
160,-1.0881
161,0.027460000000000002
162,0.56795
163,1.0772
164,1.2468
165,1.3547
166,-0.3006
167,-0.32771999999999996
168,1.2999
169,2.1597
170,1.4587
171,0.41677
172,1.5428
173,1.6393
174,0.34652
175,-0.49445
176,-0.005689199999999999
177,0.25836
178,-0.67457
179,-0.64967
180,0.040928
181,-0.09945
182,-0.71618
183,-1.5261
184,-1.6933
185,-0.9237700000000001
186,0.15
187,-0.47067
188,-0.86872
189,-0.69595
190,-0.21261
191,-0.069314
192,0.1911
193,0.24375
194,0.49613
195,0.91243
196,0.95139
197,1.0239
198,0.84386
199,0.37446
200,-0.056726
201,0.15989
202,0.10434
203,0.37940999999999997
204,0.24531999999999998
205,0.17935
206,0.16883
207,0.006867
208,-0.25944
209,0.06994
210,0.53866
211,0.35819
212,0.6259100000000001
213,0.55848
214,0.54935
215,0.39739
216,0.33704
217,0.29893000000000003
218,-0.056935
219,-0.023633
220,0.53177
221,0.7058399999999999
222,0.3727
223,0.55999
224,0.7995800000000001
225,0.4967
226,0.20643000000000003
227,0.33557
228,0.28013000000000005
229,0.31013
230,0.53761
231,0.82027
232,0.68382
233,0.63655
234,0.63636
235,0.9335700000000001
236,0.9056700000000001
237,0.58737
238,0.33218000000000003
239,0.61287
240,0.53983
241,0.61138
242,0.48718999999999996
243,0.9408700000000001
244,0.7667
245,0.51455
246,0.67984
247,0.80821
248,0.53552
249,0.53066
250,0.67998
251,0.67357
252,0.68872
253,0.83739
254,0.6712899999999999
255,0.6712
256,0.6806
257,0.7147399999999999
258,0.69518
259,0.57931
260,0.43386
261,0.43963
262,0.69406
263,1.0847
264,1.2589
265,0.8625200000000001
266,0.64478
267,0.66691
268,0.9658700000000001
269,0.67661
270,0.66915
271,0.68548
272,0.78012
273,0.98406
274,0.71163
275,0.7098800000000001
276,0.63412
277,0.7028300000000001
278,0.47744
279,0.44222
280,0.68118
281,0.73649
282,0.9731200000000001
283,0.9598700000000001
284,0.97239
285,0.6854100000000001
286,0.9607700000000001
287,0.9636
288,0.95304
289,0.65144
290,0.61854
291,0.6177
292,0.62651
293,0.96644
294,0.9733200000000001
295,0.9726299999999999
296,0.9492299999999999
297,0.93909
298,0.63551
299,0.62653
