time,value
0,-0.37919
1,-0.37919
2,-0.37919
3,-0.37919
4,-0.37919
5,-0.37919
6,-0.37919
7,-0.37919
8,-0.37919
9,-0.37919
10,-0.37919
11,-0.37919
12,-0.37919
13,-0.37919
14,-0.37919
15,-0.37919
16,-0.37919
17,-0.37919
18,-0.37919
19,-0.37919
20,-0.37919
21,-0.37919
22,-0.37919
23,-0.37919
24,-0.37919
25,-0.37919
26,-0.37919
27,-0.37919
28,-0.37919
29,-0.37919
30,-0.37919
31,-0.37919
32,-0.37919
33,-0.37919
34,-0.37919
35,-0.37919
36,-0.37919
37,-0.37919
38,-0.37919
39,-0.37919
40,0.6929
41,1.0015
42,-0.37919
43,-0.37919
44,-0.37919
45,-0.37919
46,-0.37919
47,-0.37919
48,-0.37919
49,-0.37919
50,-0.37919
51,-0.37919
52,-0.37919
53,-0.37919
54,1.4076
55,1.7325
56,-0.37919
57,-0.37919
58,-0.37919
59,-0.37919
60,-0.37919
61,-0.37919
62,0.70914
63,1.1315
64,1.6838
65,1.9112
66,5.1275
67,3.0807
68,3.0807
69,2.9345
70,1.8787
71,3.1132
72,1.2289
73,-0.37919
74,-0.37919
75,-0.37919
76,-0.37919
77,-0.37919
78,-0.37919
79,-0.37919
80,-0.37919
81,-0.37919
82,-0.37919
83,-0.37919
84,-0.37919
85,-0.37919
86,-0.37919
87,-0.37919
88,-0.37919
89,-0.37919
90,-0.37919
91,-0.37919
92,-0.37919
93,-0.37919
94,-0.37919
95,-0.37919
