time,value
0,-1.1578
1,-1.1578
2,-1.1578
3,-1.1578
4,-1.1578
5,-1.1578
6,-1.1578
7,-1.1578
8,-1.1578
9,-1.1578
10,-1.1578
11,-1.1578
12,-1.1578
13,-1.1578
14,-1.1578
15,-1.1578
16,-1.1578
17,-1.1578
18,-1.1578
19,-1.1578
20,-1.1578
21,-1.1578
22,-1.1578
23,-1.1578
24,-1.1578
25,-1.1578
26,-1.8613
27,-1.1578
28,-1.1578
29,-1.1578
30,-1.1578
31,-1.1578
32,-1.1578
33,-1.1578
34,-1.1578
35,-1.1578
36,0.24915
37,1.6561
38,2.3596
39,2.3596
40,1.6561
41,0.24915
42,0.9526399999999999
43,0.24915
44,0.9526399999999999
45,0.24915
46,0.9526399999999999
47,0.24915
48,0.9526399999999999
49,0.9526399999999999
50,0.24915
51,0.9526399999999999
52,0.24915
53,0.9526399999999999
54,0.24915
55,0.9526399999999999
56,0.24915
57,0.9526399999999999
58,0.24915
59,0.9526399999999999
60,0.24915
61,0.9526399999999999
62,0.24915
63,0.9526399999999999
64,0.24915
65,0.9526399999999999
66,0.24915
67,0.9526399999999999
68,0.24915
69,0.9526399999999999
70,0.24915
71,0.9526399999999999
72,0.24915
73,0.9526399999999999
74,0.24915
75,0.9526399999999999
76,0.24915
77,0.9526399999999999
78,0.24915
79,0.9526399999999999
80,0.24915
81,0.9526399999999999
82,0.9526399999999999
83,0.24915
84,0.9526399999999999
85,0.24915
86,0.9526399999999999
87,0.24915
88,0.9526399999999999
89,0.24915
90,0.9526399999999999
91,0.9526399999999999
92,0.24915
93,0.9526399999999999
94,0.24915
95,0.9526399999999999
