time,value
0,-0.34835
1,-0.24038
2,-0.28945
3,-0.34835
4,-0.35816
5,-0.34835
6,-0.1913
7,-0.12259
8,-0.24038
9,-0.26000999999999996
10,-0.30908
11,-0.34835
12,-0.23056
13,-0.29927
14,-0.34835
15,-0.35816
16,-0.34835
17,-0.30908
18,-0.23056
19,-0.29927
20,-0.23056
21,-0.24038
22,-0.25019
23,-0.18148
24,-0.26000999999999996
25,-0.34835
26,-0.35816
27,-0.34835
28,-0.35816
29,-0.24038
30,-0.27964
31,0.45652
32,-0.33853
33,-0.23056
34,-0.24038
35,-0.11277999999999999
36,-0.1913
37,-0.36798000000000003
38,-0.36798000000000003
39,-0.36798000000000003
40,-0.083329
41,0.30929
42,-0.32871
43,-0.37779
44,-0.36798000000000003
45,-0.37779
46,-0.26000999999999996
47,-0.12259
48,-0.21093
49,-0.25019
50,-0.35816
51,-0.37779
52,-0.35816
53,-0.24038
54,-0.33853
55,-0.37779
56,-0.37779
57,-0.37779
58,0.16205999999999998
59,-0.15204
60,-0.21093
61,-0.26000999999999996
62,-0.25019
63,-0.34835
64,-0.35816
65,-0.24038
66,-0.33853
67,-0.37779
68,-0.37779
69,-0.37779
70,-0.36798000000000003
71,3.4502
72,6.6402
73,4.3532
74,3.3226
75,0.77061
76,0.20132
77,0.75098
78,-0.044067
79,0.16205999999999998
80,-0.18148
81,0.093349
82,-0.22075
83,-0.13241
84,-0.24038
85,0.54486
86,-0.26982
87,-0.23056
88,0.27003
89,0.14243
90,-0.093144
91,-0.12259
92,-0.21093
93,-0.26000999999999996
94,0.5644899999999999
95,-0.20110999999999998
