[<text>
<title>wholesale club inc &lt;whls&gt; 4th qtr jan 31 net</title>
<dateline>    indianapolis, march 16 -
    </dateline>shr profit two cts vs loss 16 cts
    net profit 558,000 vs loss 580,000
    sales 66.2 mln vs 29.5 mln
    avg shrs 4,476,000 vs 3,615,000
    year
    shr loss 61 cts vs loss 79 cts
    net loss 1,760,000 vs loss 2,180,000
    sales 158.4 mln vs 76.3 mln
    avg shrs 4,475,000 vs 2,751,000
 reuter
</text>]