time,value
0,-0.22808
1,-0.22808
2,-0.22808
3,-0.22808
4,-0.22808
5,-0.22808
6,-0.22808
7,-0.22808
8,-0.22808
9,-0.22808
10,-0.22808
11,-0.22808
12,-0.22808
13,-0.22808
14,-0.22808
15,-0.22808
16,-0.22808
17,-0.22808
18,-0.22808
19,-0.22808
20,-0.22808
21,-0.22808
22,-0.22808
23,-0.22808
24,-0.22808
25,-0.22808
26,-0.22808
27,-0.22808
28,-0.22808
29,-0.22808
30,-0.22808
31,-0.22808
32,-0.22808
33,-0.22808
34,-0.22808
35,-0.22808
36,-0.22808
37,-0.22808
38,-0.22808
39,-0.22808
40,-0.22808
41,-0.22808
42,-0.22808
43,-0.22808
44,-0.22808
45,-0.22808
46,-0.22808
47,-0.22808
48,-0.22808
49,-0.22808
50,-0.22808
51,-0.22808
52,-0.22808
53,-0.22808
54,-0.22808
55,-0.22808
56,-0.22808
57,-0.22808
58,-0.22808
59,-0.22808
60,-0.22808
61,-0.22808
62,-0.22808
63,-0.22808
64,-0.22808
65,-0.22808
66,-0.22808
67,-0.22808
68,-0.22808
69,-0.22808
70,-0.22808
71,-0.22808
72,-0.22808
73,-0.22808
74,-0.22808
75,-0.22808
76,-0.22808
77,-0.22808
78,-0.22808
79,-0.22808
80,-0.22808
81,-0.22808
82,-0.22808
83,-0.22808
84,2.3479
85,4.7092
86,4.4945
87,4.7092
88,4.4945
89,-0.22808
90,-0.22808
91,-0.22808
92,-0.22808
93,-0.22808
94,-0.22808
95,-0.22808
