time,value
0,1.2183
1,-0.4745
2,-0.9361799999999999
3,1.5261
4,-0.9361799999999999
5,-0.012824
6,0.75664
7,-0.9361799999999999
8,1.0644
9,-0.4745
10,-0.9361799999999999
11,1.5261
12,-0.9361799999999999
13,-0.012824
14,0.60275
15,-0.9361799999999999
16,1.2183
17,-0.62839
18,-0.9361799999999999
19,1.5261
20,-0.9361799999999999
21,-0.32061
22,1.0644
23,-0.9361799999999999
24,0.29496
25,0.29496
26,-0.9361799999999999
27,1.0644
28,-0.4745
29,-0.9361799999999999
30,1.68
31,-0.9361799999999999
32,-0.9361799999999999
33,1.3722
34,-0.9361799999999999
35,-0.16672
36,0.75664
37,-0.9361799999999999
38,0.75664
39,0.14107
40,-0.9361799999999999
41,1.5261
42,-0.9361799999999999
43,-0.9361799999999999
44,1.68
45,-0.9361799999999999
46,-0.9361799999999999
47,1.68
48,-0.9361799999999999
49,-0.9361799999999999
50,1.5261
51,-0.9361799999999999
52,-0.62839
53,1.3722
54,-0.9361799999999999
55,0.75664
56,-0.16672
57,-0.9361799999999999
58,1.0644
59,-0.32061
60,-0.9361799999999999
61,1.2183
62,-0.4745
63,-0.9361799999999999
64,1.2183
65,-0.4745
66,-0.9361799999999999
67,1.2183
68,-0.4745
69,-0.9361799999999999
70,1.2183
71,-0.32061
72,-0.9361799999999999
73,1.68
74,-0.9361799999999999
75,-0.012824
76,0.75664
77,-0.9361799999999999
78,0.91053
79,-0.16672
80,-0.9361799999999999
81,1.8339
82,-0.9361799999999999
83,1.0644
84,-0.32061
85,-0.9361799999999999
86,1.5261
87,-0.9361799999999999
88,0.60275
89,0.29496
90,-0.9361799999999999
91,1.68
92,-0.9361799999999999
93,-0.9361799999999999
94,1.68
95,-0.9361799999999999
