time,value
0,-0.35123000000000004
1,-0.35123000000000004
2,-0.35123000000000004
3,-0.35123000000000004
4,-0.35123000000000004
5,-0.35123000000000004
6,-0.35123000000000004
7,-0.35123000000000004
8,-0.35123000000000004
9,-0.35123000000000004
10,-0.35123000000000004
11,-0.35123000000000004
12,-0.02387
13,-0.35123000000000004
14,-0.35123000000000004
15,-0.35123000000000004
16,-0.35123000000000004
17,-0.35123000000000004
18,-0.35123000000000004
19,-0.35123000000000004
20,0.13981
21,-0.35123000000000004
22,-0.35123000000000004
23,-0.35123000000000004
24,-0.35123000000000004
25,-0.35123000000000004
26,-0.35123000000000004
27,-0.35123000000000004
28,-0.35123000000000004
29,-0.35123000000000004
30,-0.35123000000000004
31,-0.35123000000000004
32,-0.35123000000000004
33,-0.35123000000000004
34,-0.35123000000000004
35,-0.35123000000000004
36,-0.35123000000000004
37,-0.35123000000000004
38,-0.35123000000000004
39,-0.35123000000000004
40,0.13981
41,-0.35123000000000004
42,-0.35123000000000004
43,-0.35123000000000004
44,-0.35123000000000004
45,-0.35123000000000004
46,-0.35123000000000004
47,-0.35123000000000004
48,-0.35123000000000004
49,-0.35123000000000004
50,-0.35123000000000004
51,-0.35123000000000004
52,-0.35123000000000004
53,-0.35123000000000004
54,-0.35123000000000004
55,-0.35123000000000004
56,-0.02387
57,-0.35123000000000004
58,-0.35123000000000004
59,-0.35123000000000004
60,-0.35123000000000004
61,-0.35123000000000004
62,-0.35123000000000004
63,-0.35123000000000004
64,-0.35123000000000004
65,-0.35123000000000004
66,-0.35123000000000004
67,-0.35123000000000004
68,-0.35123000000000004
69,-0.35123000000000004
70,-0.35123000000000004
71,-0.35123000000000004
72,-0.35123000000000004
73,-0.35123000000000004
74,-0.35123000000000004
75,-0.35123000000000004
76,-0.35123000000000004
77,-0.35123000000000004
78,-0.35123000000000004
79,-0.35123000000000004
80,-0.35123000000000004
81,-0.35123000000000004
82,0.95821
83,0.7945300000000001
84,0.63085
85,0.7945300000000001
86,2.9224
87,3.5771
88,3.4134
89,3.4134
90,3.5771
91,3.4134
92,3.5771
93,0.7945300000000001
94,-0.35123000000000004
95,-0.35123000000000004
