[<text>
<title>techamerica group inc &lt;tch&gt; 4th qtr loss</title>
<dateline>    elwood, kan., feb 26 -
    </dateline>shr loss six cts vs not available
    net loss 562,231 vs profit 10,253
    revs 8,871,874 vs 9,549,308
    year
    shr loss 60 cts vs loss nine cts
    net loss 5,058,145 vs loss 766,185
    revs 34.3 mln vs 35.5 mln
   
 reuter
</text>]