time,value
0,-1.3274
1,-1.2147
2,-1.0702
3,-0.8908
4,-0.67603
5,-0.43043000000000003
6,-0.15971
7,0.12792
8,0.42172
9,0.70873
10,0.97736
11,1.2202
12,1.4328
13,1.614
14,1.765
15,1.8915
16,1.9993
17,2.093
18,2.1739
19,2.2434
20,2.3003
21,2.3423
22,2.3654
23,2.3686
24,2.3532
25,2.322
26,2.2785
27,2.2275
28,2.1746
29,2.1235
30,2.0752
31,2.0284
32,1.9813
33,1.9306
34,1.8723
35,1.8019999999999998
36,1.7189
37,1.6237
38,1.5186
39,1.4057
40,1.2903
41,1.1767
42,1.0685
43,0.9662700000000001
44,0.87092
45,0.78233
46,0.6996100000000001
47,0.62053
48,0.54491
49,0.47393
50,0.40843
51,0.34812
52,0.29315
53,0.2457
54,0.20485
55,0.1683
56,0.132
57,0.09879199999999999
58,0.067643
59,0.037794
60,0.004804600000000001
61,-0.025439
62,-0.051876
63,-0.074393
64,-0.097127
65,-0.11700999999999999
66,-0.13282
67,-0.14569000000000001
68,-0.15983
69,-0.17528
70,-0.18886
71,-0.20038
72,-0.21118
73,-0.22261999999999998
74,-0.22918000000000002
75,-0.23043000000000002
76,-0.22735999999999998
77,-0.22591999999999998
78,-0.22174000000000002
79,-0.2161
80,-0.21033000000000002
81,-0.20959
82,-0.20972
83,-0.2089
84,-0.20643000000000003
85,-0.20498000000000002
86,-0.20306
87,-0.19848
88,-0.19096
89,-0.18172
90,-0.17024
91,-0.15159
92,-0.12311
93,-0.083338
94,-0.033302
95,0.030414
96,0.10687999999999999
97,0.19377
98,0.28486999999999996
99,0.38023
100,0.4774
101,0.57429
102,0.66723
103,0.75678
104,0.84305
105,0.9252100000000001
106,1.0008
107,1.069
108,1.1299
109,1.1828
110,1.2263
111,1.2601
112,1.2865
113,1.307
114,1.3223
115,1.3319999999999999
116,1.3388
117,1.3429
118,1.3437
119,1.3386
120,1.3284
121,1.3128
122,1.2918
123,1.264
124,1.2311
125,1.1946
126,1.1551
127,1.1118
128,1.0647
129,1.0147
130,0.96147
131,0.9041799999999999
132,0.84201
133,0.77709
134,0.7098800000000001
135,0.64066
136,0.56789
137,0.49394
138,0.41888000000000003
139,0.34279
140,0.2647
141,0.18752
142,0.11315
143,0.042854
144,-0.023591
145,-0.08445
146,-0.13858
147,-0.18695
148,-0.23171999999999998
149,-0.27384000000000003
150,-0.31167
151,-0.34565
152,-0.37633
153,-0.40489
154,-0.42756000000000005
155,-0.44443999999999995
156,-0.45628
157,-0.4664
158,-0.47228000000000003
159,-0.47507
160,-0.47668
161,-0.48086999999999996
162,-0.48665
163,-0.49401000000000006
164,-0.50405
165,-0.51875
166,-0.53709
167,-0.5566399999999999
168,-0.57721
169,-0.59948
170,-0.6239
171,-0.64746
172,-0.6701699999999999
173,-0.69222
174,-0.71542
175,-0.7359
176,-0.75358
177,-0.7690600000000001
178,-0.78505
179,-0.8002
180,-0.81498
181,-0.8301700000000001
182,-0.84698
183,-0.8633
184,-0.8764700000000001
185,-0.8851100000000001
186,-0.88912
187,-0.88841
188,-0.8822
189,-0.87185
190,-0.8591799999999999
191,-0.8463200000000001
192,-0.83199
193,-0.8163600000000001
194,-0.79964
195,-0.78376
196,-0.76786
197,-0.7531100000000001
198,-0.74105
199,-0.73397
200,-0.73129
201,-0.7318899999999999
202,-0.73451
203,-0.73835
204,-0.7417699999999999
205,-0.74298
206,-0.74205
207,-0.7403
208,-0.73953
209,-0.7399100000000001
210,-0.74246
211,-0.7477199999999999
212,-0.75626
213,-0.7658
214,-0.77527
215,-0.78393
216,-0.7921600000000001
217,-0.79919
218,-0.8054399999999999
219,-0.81171
220,-0.81891
221,-0.82649
222,-0.8337200000000001
223,-0.8400700000000001
224,-0.84521
225,-0.84857
226,-0.84972
227,-0.84909
228,-0.8473299999999999
229,-0.84485
230,-0.8411
231,-0.8361200000000001
232,-0.83001
233,-0.8234100000000001
234,-0.816
235,-0.80862
236,-0.80218
237,-0.79766
238,-0.79455
239,-0.7926300000000001
240,-0.79184
241,-0.7925800000000001
242,-0.79481
243,-0.79901
244,-0.8064899999999999
245,-0.81867
246,-0.83621
247,-0.85872
248,-0.8860600000000001
249,-0.9178
250,-0.95345
251,-0.9913799999999999
252,-1.0311
253,-1.0723
254,-1.1149
255,-1.1579
256,-1.2007
257,-1.2435
258,-1.2866
259,-1.3292
260,-1.3708
261,-1.4109
262,-1.4484
263,-1.4816
264,-1.5083
265,-1.5275
266,-1.5392
267,-1.5443
268,-1.544
269,-1.5408
