time,value
0,-0.17626
1,-0.17626
2,-0.17626
3,-0.17626
4,-0.17626
5,-0.17626
6,-0.17626
7,-0.17626
8,-0.17626
9,-0.17626
10,-0.17626
11,-0.17626
12,-0.17626
13,-0.17626
14,-0.17626
15,-0.17626
16,-0.17626
17,-0.17626
18,-0.17626
19,-0.17626
20,-0.17626
21,-0.17626
22,-0.17626
23,-0.17626
24,-0.17626
25,-0.17626
26,-0.17626
27,-0.17626
28,-0.17626
29,-0.17626
30,-0.17626
31,-0.17626
32,-0.17626
33,-0.17626
34,-0.17626
35,-0.17626
36,-0.17626
37,-0.17626
38,-0.17626
39,-0.17626
40,-0.17626
41,-0.17626
42,-0.17626
43,-0.17626
44,-0.17626
45,-0.17626
46,-0.17626
47,-0.17626
48,-0.17626
49,-0.17626
50,-0.17626
51,-0.17626
52,-0.17626
53,-0.17626
54,-0.17626
55,-0.17626
56,-0.17626
57,-0.17626
58,-0.17626
59,-0.17626
60,-0.17626
61,-0.17626
62,-0.17626
63,-0.17626
64,-0.17626
65,-0.17626
66,-0.17626
67,-0.17626
68,-0.17626
69,1.205
70,8.1265
71,2.7515
72,4.1328
73,-0.17626
74,-0.17626
75,-0.17626
76,-0.17626
77,-0.17626
78,-0.17626
79,-0.17626
80,-0.17626
81,-0.17626
82,-0.17626
83,-0.17626
84,-0.17626
85,-0.17626
86,-0.17626
87,-0.17626
88,-0.17626
89,-0.17626
90,-0.17626
91,-0.17626
92,-0.17626
93,-0.17626
94,-0.17626
95,-0.17626
