time,value
0,-0.50159
1,-0.50159
2,-0.50159
3,-0.50159
4,-0.50159
5,-0.50159
6,-0.50159
7,-0.50159
8,-0.50159
9,-0.50159
10,-0.50159
11,-0.50159
12,-0.50159
13,-0.50159
14,-0.50159
15,-0.50159
16,-0.50159
17,-0.50159
18,-0.50159
19,-0.50159
20,-0.50159
21,-0.50159
22,-0.50159
23,-0.50159
24,-0.50159
25,-0.50159
26,-0.50159
27,-0.50159
28,-0.50159
29,-0.50159
30,-0.50159
31,-0.50159
32,-0.50159
33,-0.50159
34,-0.50159
35,-0.50159
36,-0.50159
37,0.8891
38,1.4106
39,1.2368
40,1.7583
41,2.1059
42,1.9321
43,1.0629
44,0.019919
45,0.19375
46,1.5844
47,0.36759000000000003
48,0.19375
49,-0.50159
50,0.019919
51,-0.15392
52,0.019919
53,-0.50159
54,0.019919
55,0.19375
56,-0.15392
57,1.0629
58,2.6275
59,1.7583
60,1.5844
61,-0.50159
62,1.0629
63,-0.50159
64,-0.50159
65,0.19375
66,-0.50159
67,-0.50159
68,-0.50159
69,-0.50159
70,0.19375
71,-0.50159
72,-0.50159
73,-0.50159
74,-0.50159
75,-0.50159
76,-0.50159
77,-0.50159
78,-0.50159
79,-0.50159
80,-0.50159
81,-0.50159
82,-0.50159
83,-0.50159
84,-0.50159
85,-0.50159
86,4.8873
87,2.6275
88,3.1489999999999996
89,1.7583
90,-0.50159
91,-0.50159
92,-0.50159
93,-0.50159
94,-0.50159
95,-0.50159
