time,value
0,-0.20726999999999998
1,-0.20726999999999998
2,-0.20726999999999998
3,-0.20726999999999998
4,-0.20726999999999998
5,-0.20726999999999998
6,-0.20726999999999998
7,-0.20726999999999998
8,-0.20726999999999998
9,-0.20726999999999998
10,-0.20726999999999998
11,-0.20726999999999998
12,-0.20726999999999998
13,-0.20726999999999998
14,-0.20726999999999998
15,-0.20726999999999998
16,-0.20726999999999998
17,-0.20726999999999998
18,-0.20726999999999998
19,-0.20726999999999998
20,-0.20726999999999998
21,-0.20726999999999998
22,-0.20726999999999998
23,-0.20726999999999998
24,-0.20726999999999998
25,-0.20726999999999998
26,-0.20726999999999998
27,-0.20726999999999998
28,-0.20726999999999998
29,-0.20726999999999998
30,-0.20726999999999998
31,-0.20726999999999998
32,-0.20726999999999998
33,-0.20726999999999998
34,-0.20726999999999998
35,-0.20726999999999998
36,-0.20726999999999998
37,-0.20726999999999998
38,-0.20726999999999998
39,-0.20726999999999998
40,-0.20726999999999998
41,-0.20726999999999998
42,-0.20726999999999998
43,-0.20726999999999998
44,-0.20726999999999998
45,-0.20726999999999998
46,-0.15854000000000001
47,3.4474
48,5.9164
49,0.068864
50,4.3571
51,5.023
52,-0.20726999999999998
53,-0.20726999999999998
54,-0.20726999999999998
55,-0.20726999999999998
56,-0.20726999999999998
57,-0.20726999999999998
58,-0.20726999999999998
59,-0.20726999999999998
60,-0.20726999999999998
61,-0.20726999999999998
62,-0.20726999999999998
63,-0.20726999999999998
64,-0.20726999999999998
65,-0.20726999999999998
66,-0.20726999999999998
67,-0.20726999999999998
68,-0.20726999999999998
69,-0.20726999999999998
70,-0.20726999999999998
71,-0.20726999999999998
72,-0.20726999999999998
73,-0.20726999999999998
74,-0.20726999999999998
75,-0.20726999999999998
76,-0.20726999999999998
77,-0.20726999999999998
78,-0.20726999999999998
79,-0.20726999999999998
80,-0.20726999999999998
81,-0.20726999999999998
82,-0.20726999999999998
83,-0.20726999999999998
84,-0.20726999999999998
85,-0.20726999999999998
86,-0.20726999999999998
87,-0.20726999999999998
88,-0.20726999999999998
89,-0.20726999999999998
90,-0.20726999999999998
91,-0.20726999999999998
92,-0.20726999999999998
93,-0.20726999999999998
94,-0.20726999999999998
95,-0.20726999999999998
