time,value
0,1.4551
1,-0.055059000000000004
2,-0.9989399999999999
3,0.88882
4,-0.62139
5,-0.9989399999999999
6,0.51127
7,-0.9989399999999999
8,-0.81016
9,0.51127
10,-1.3765
11,-0.43261000000000005
12,-0.055059000000000004
13,-1.754
14,-0.24383000000000002
15,-0.81016
16,-1.754
17,0.32249
18,-1.3765
19,-1.3765
20,0.88882
21,-2.1316
22,-0.62139
23,0.70004
24,-1.9428
25,0.32249
26,0.32249
27,-1.754
28,0.70004
29,0.13372
30,0.13372
31,1.4551
32,-0.43261000000000005
33,0.51127
34,0.70004
35,-0.62139
36,1.6439
37,0.32249
38,-0.43261000000000005
39,1.2664
40,-0.43261000000000005
41,-0.055059000000000004
42,0.70004
43,-0.9989399999999999
44,0.13372
45,-0.43261000000000005
46,-1.3765
47,1.2664
48,-0.81016
49,-0.43261000000000005
50,1.2664
51,-1.1877
52,0.32249
53,1.0776
54,-1.1877
55,0.70004
56,0.51127
57,-1.3765
58,1.0776
59,-0.43261000000000005
60,-0.62139
61,1.2664
62,-0.9989399999999999
63,0.13372
64,0.51127
65,-0.9989399999999999
66,0.51127
67,0.13372
68,-0.62139
69,0.88882
70,-0.43261000000000005
71,-0.24383000000000002
72,1.4551
73,-0.62139
74,0.88882
75,1.2664
76,-0.055059000000000004
77,2.0215
78,0.51127
79,-0.81016
80,2.0215
81,0.32249
82,0.32249
83,2.2102
84,-1.1877
85,0.70004
86,1.0776
87,-0.24383000000000002
88,1.2664
89,0.32249
90,-0.62139
91,1.2664
92,-0.9989399999999999
93,0.13372
94,1.2664
95,-1.5653
