{
  "about": {
    "datasetID": "LL0_1100_popularkids_dataset",
    "datasetName": "LL0_1100_popularkids",
    "description": "**Author**:   \n**Source**: Unknown - Date unknown  \n**Please cite**:   \n\nDatasets of Data And Story Library, project illustrating use of basic statistic methods, converted to arff format by Hakan Kjellerstrand.\nSource: TunedIT: http://tunedit.org/repo/DASL\n\nDASL file http://lib.stat.cmu.edu/DASL/Datafiles/PopularKids.html\n\nStudents' Goals\n,\n\nWhat Makes Kids Popular\n\nReference:   Chase, M. A., and Dummer, G. M. (1992), \"The Role of Sports as a Social Determinant for Children,\" Research Quarterly for Exercise and Sport, 63, 418-424\n\nAuthorization:   Contact authors\nDescription:        Subjects were students in grades 4-6 from three school districts in Ingham and Clinton Counties, Michigan.  Chase and Dummer stratified their sample, selecting students from urban, suburban, and rural school districts with approximately 1/3 of their sample coming from each district.  Students indicated whether good grades, athletic ability, or popularity was most important to them.  They also ranked four factors:  grades, sports, looks, and money, in order of their importance for popularity.  The questionnaire also asked for gender, grade level, and other demographic information.\nNumber of cases:   478\nVariable Names:\n\nGender:   Boy or girl\nGrade:   4, 5 or 6\nAge:   Age in years\nRace:   White, Other\nUrban/Rural:   Rural, Suburban, or Urban school district\nSchool:   Brentwood Elementary, Brentwood Middle, Ridge, Sand, Eureka, Brown, Main, Portage, Westdale Middle\nGoals:   Student's choice in the personal goals question where options were 1 = Make Good Grades,  2 = Be Popular,  3 = Be Good in Sports\nGrades:   Rank of \"make good grades\"  (1=most important for popularity, 4=least important)\nSports:   Rank of \"being good at sports\"  (1=most important for popularity, 4=least important)\nLooks:   Rank of \"being handsome or pretty\"  (1=most important for popularity, 4=least important)\nMoney:   Rank of \"having lots of money\"  (1=most important for popularity, 4=least important)",
    "citation": " @misc{datsets_of_data_and_story,        title = {Datasets of Data And Story Library, project illustrating use of basic statistic methods},        author = {Hakan Kjellerstrand},    } ",
    "license": " CC Public Domain Mark 1.0 ",
    "source": "OpenML",
    "sourceURI": "http://www.openml.org/d/1100",
    "approximateSize": "",
    "datasetSchemaVersion": "4.0.0",
    "redacted": false,
    "datasetVersion": "4.0.0",
    "digest": "ce38ac06729bd4be5ab3a63dff4e193b05f1a64b8510aaea1c97f64964ea6cab"
  },
  "dataResources": [
    {
      "resID": "learningData",
      "resPath": "tables/learningData.csv",
      "resType": "table",
      "resFormat": {
        "text/csv": [
          "csv"
        ]
      },
      "isCollection": false,
      "columns": [
        {
          "colIndex": 0,
          "colName": "d3mIndex",
          "colType": "integer",
          "role": [
            "index"
          ]
        },
        {
          "colIndex": 1,
          "colName": "Gender",
          "colType": "categorical",
          "role": [
            "attribute"
          ]
        },
        {
          "colIndex": 2,
          "colName": "Grade",
          "colType": "real",
          "role": [
            "attribute"
          ]
        },
        {
          "colIndex": 3,
          "colName": "Age",
          "colType": "real",
          "role": [
            "attribute"
          ]
        },
        {
          "colIndex": 4,
          "colName": "Race",
          "colType": "categorical",
          "role": [
            "attribute"
          ]
        },
        {
          "colIndex": 5,
          "colName": "Urban/Rural",
          "colType": "categorical",
          "role": [
            "attribute"
          ]
        },
        {
          "colIndex": 6,
          "colName": "School",
          "colType": "categorical",
          "role": [
            "attribute"
          ]
        },
        {
          "colIndex": 7,
          "colName": "Goals",
          "colType": "categorical",
          "role": [
            "suggestedTarget"
          ]
        },
        {
          "colIndex": 8,
          "colName": "Grades",
          "colType": "real",
          "role": [
            "attribute"
          ]
        },
        {
          "colIndex": 9,
          "colName": "Sports",
          "colType": "real",
          "role": [
            "attribute"
          ]
        },
        {
          "colIndex": 10,
          "colName": "Looks",
          "colType": "real",
          "role": [
            "attribute"
          ]
        },
        {
          "colIndex": 11,
          "colName": "Money",
          "colType": "real",
          "role": [
            "attribute"
          ]
        }
      ],
      "columnsCount": 12
    }
  ]
}