[<text>
<title>agency rent-a-car inc &lt;agnc&gt; 4th qtr jan 31 net</title>
<dateline>    cleveland, march 19 -
    </dateline>shr 26 cts vs 21 cts
    net 5,553,000 vs 4,307,000
    revs 45.1 mln vs 34.2 mln
    year
    shr 86 cts vs 67 cts
    net 18.2 mln vs 14.0 mln
    revs 161.1 mln vs 118.3 mln
    note: share adjusted for stock dividends.
 reuter
</text>]