time,value
0,-0.57434
1,-0.57434
2,-0.57434
3,1.723
4,-0.57434
5,-0.57434
6,1.723
7,-0.57434
8,-0.57434
9,-0.57434
10,1.723
11,-0.57434
12,-0.57434
13,-0.57434
14,1.723
15,-0.57434
16,-0.57434
17,-0.57434
18,1.723
19,-0.57434
20,-0.57434
21,-0.57434
22,1.723
23,-0.57434
24,-0.57434
25,-0.57434
26,1.723
27,-0.57434
28,-0.57434
29,-0.57434
30,1.723
31,-0.57434
32,-0.57434
33,-0.57434
34,1.723
35,-0.57434
36,-0.57434
37,-0.57434
38,1.723
39,-0.57434
40,-0.57434
41,-0.57434
42,1.723
43,-0.57434
44,-0.57434
45,-0.57434
46,1.723
47,-0.57434
48,-0.57434
49,-0.57434
50,1.723
51,-0.57434
52,-0.57434
53,-0.57434
54,1.723
55,-0.57434
56,-0.57434
57,-0.57434
58,1.723
59,-0.57434
60,-0.57434
61,-0.57434
62,1.723
63,-0.57434
64,-0.57434
65,-0.57434
66,1.723
67,-0.57434
68,-0.57434
69,-0.57434
70,1.723
71,-0.57434
72,-0.57434
73,-0.57434
74,1.723
75,-0.57434
76,-0.57434
77,1.723
78,-0.57434
79,-0.57434
80,-0.57434
81,1.723
82,-0.57434
83,-0.57434
84,-0.57434
85,1.723
86,-0.57434
87,-0.57434
88,-0.57434
89,1.723
90,-0.57434
91,-0.57434
92,-0.57434
93,1.723
94,-0.57434
95,-0.57434
