time,value
0,-0.2096
1,-0.2096
2,-0.2096
3,-0.2096
4,-0.2096
5,-0.2096
6,-0.2096
7,-0.2096
8,-0.2096
9,-0.2096
10,-0.2096
11,-0.2096
12,-0.2096
13,-0.2096
14,-0.2096
15,-0.2096
16,-0.2096
17,-0.2096
18,-0.2096
19,-0.2096
20,-0.2096
21,-0.2096
22,-0.2096
23,-0.2096
24,-0.2096
25,-0.2096
26,-0.2096
27,-0.2096
28,-0.2096
29,-0.2096
30,-0.2096
31,-0.2096
32,-0.2096
33,-0.2096
34,-0.2096
35,-0.2096
36,-0.2096
37,-0.2096
38,-0.2096
39,-0.2096
40,-0.2096
41,-0.2096
42,-0.2096
43,-0.2096
44,-0.2096
45,-0.2096
46,-0.2096
47,-0.2096
48,-0.2096
49,-0.2096
50,-0.2096
51,-0.2096
52,-0.2096
53,-0.2096
54,-0.2096
55,-0.2096
56,-0.2096
57,-0.2096
58,-0.2096
59,-0.2096
60,-0.2096
61,-0.2096
62,-0.2096
63,-0.2096
64,-0.2096
65,-0.2096
66,-0.2096
67,-0.2096
68,-0.2096
69,-0.2096
70,-0.2096
71,-0.2096
72,-0.2096
73,-0.2096
74,-0.2096
75,-0.2096
76,-0.2096
77,-0.2096
78,-0.2096
79,0.7795300000000001
80,6.4741
81,1.8534
82,0.044746
83,0.0023550999999999997
84,4.7926
85,4.7078
86,-0.2096
87,-0.2096
88,-0.2096
89,-0.2096
90,-0.2096
91,-0.2096
92,-0.2096
93,-0.2096
94,-0.2096
95,-0.2096
