time,value
0,1.9899
1,1.9664
2,1.9453
3,1.913
4,1.8792
5,1.8494
6,1.8161
7,1.7794
8,1.7475
9,1.734
10,1.7022
11,1.6665
12,1.6271
13,1.5879
14,1.5488
15,1.5136
16,1.4746
17,1.4357
18,1.3969
19,1.3583
20,1.3196
21,1.2811
22,1.2427
23,1.2044
24,1.1662
25,1.1279
26,1.0901
27,1.0522
28,1.0143
29,0.97624
30,0.9382299999999999
31,0.9002600000000001
32,0.86239
33,0.8245399999999999
34,0.7864899999999999
35,0.7488199999999999
36,0.71077
37,0.6732899999999999
38,0.63542
39,0.59758
40,0.55981
41,0.5221100000000001
42,0.48385
43,0.44597
44,0.40811
45,0.37064
46,0.33192
47,0.29463
48,0.25668
49,0.21878000000000003
50,0.18174
51,0.14398
52,0.10629000000000001
53,0.068674
54,0.032011000000000005
55,-0.0054368
56,-0.042802999999999994
57,-0.080082
58,-0.11727
59,-0.15417999999999998
60,-0.19125999999999999
61,-0.22678
62,-0.2628
63,-0.29938000000000003
64,-0.33466
65,-0.36972
66,-0.40456
67,-0.43788
68,-0.47213
69,-0.50473
70,-0.5358
71,-0.56557
72,-0.59145
73,-0.61461
74,-0.63655
75,-0.65741
76,-0.6764899999999999
77,-0.69225
78,-0.70754
79,-0.7204
80,-0.7337600000000001
81,-0.74738
82,-0.75832
83,-0.76962
84,-0.78088
85,-0.78992
86,-0.79742
87,-0.80848
88,-0.8215399999999999
89,-0.83616
90,-0.8439700000000001
91,-0.84993
92,-0.85674
93,-0.8829899999999999
94,-0.9234600000000001
95,-0.9601799999999999
96,-0.99671
97,-1.0368
98,-1.0787
99,-1.1244
100,-1.1662
101,-1.2041
102,-1.2419
103,-1.2785
104,-1.3256
105,-1.3774
106,-1.4168
107,-1.4409999999999998
108,-1.4581
109,-1.4732
110,-1.4861
111,-1.4967
112,-1.5048
113,-1.5104
114,-1.5134
115,-1.5137
116,-1.5114
117,-1.5065
118,-1.4989
119,-1.489
120,-1.4766
121,-1.4621
122,-1.4455
123,-1.4269999999999998
124,-1.4067
125,-1.3848
126,-1.3615
127,-1.3398
128,-1.3147
129,-1.2895
130,-1.2613
131,-1.2323
132,-1.2025
133,-1.1728
134,-1.1408
135,-1.1112
136,-1.0789
137,-1.046
138,-1.0107
139,-0.97703
140,-0.9430200000000001
141,-0.90341
142,-0.8609899999999999
143,-0.81547
144,-0.7698
145,-0.72601
146,-0.68407
147,-0.6421100000000001
148,-0.6007
149,-0.56176
150,-0.5232899999999999
151,-0.4865
152,-0.44956999999999997
153,-0.41257
154,-0.37701999999999997
155,-0.34457
156,-0.31621
157,-0.29212
158,-0.27579000000000004
159,-0.29439
160,-0.32153000000000004
161,-0.35306
162,-0.39824
163,-0.37409000000000003
164,-0.33621
165,-0.29851
166,-0.26124
167,-0.22336
168,-0.18596
169,-0.14774
170,-0.11039000000000002
171,-0.071159
172,-0.032025
173,0.006998399999999999
174,0.047195
175,0.087642
176,0.12955999999999998
177,0.17148
178,0.21343
179,0.2563
180,0.29921
181,0.34215999999999996
182,0.38495
183,0.42822
184,0.47251000000000004
185,0.51789
186,0.55876
187,0.59945
188,0.63664
189,0.6834600000000001
190,0.72929
191,0.77635
192,0.81813
193,0.8647799999999999
194,0.91091
195,0.95595
196,1.0015
197,1.0463
198,1.0911
199,1.1351
200,1.1782
201,1.2192
202,1.2604
203,1.3
204,1.3336
205,1.3494
206,1.3336
207,1.3146
208,1.2968
209,1.2814
210,1.2673
211,1.2535
212,1.2402
213,1.2231
214,1.2058
215,1.1876
216,1.1722
217,1.1527
218,1.1275
219,1.1085
220,1.073
221,1.0369
222,1.0054
223,0.9668
224,0.93596
225,0.93143
226,0.93122
227,0.93137
228,0.9691
229,1.0077
230,1.0452
231,1.083
232,1.1212
233,1.1555
234,1.1862
235,1.2095
236,1.2246
237,1.2441
238,1.2601
239,1.2728
240,1.2797
241,1.2804
242,1.2642
243,1.2397
244,1.2073
245,1.1746
246,1.135
247,1.0959999999999999
248,1.0575
249,1.0187
250,0.9802200000000001
251,0.94101
252,0.9016299999999999
253,0.8610200000000001
254,0.82094
255,0.78068
256,0.74015
257,0.69907
258,0.65769
259,0.61627
260,0.57533
261,0.53464
262,0.49365
263,0.45308999999999994
264,0.41286000000000006
265,0.37289
266,0.33304
267,0.29334
268,0.25371
269,0.21414
270,0.1746
271,0.13515
272,0.095685
273,0.056222
274,0.016775
275,-0.022672
276,-0.062110000000000005
277,-0.10155
278,-0.14099
279,-0.18042
280,-0.21984
281,-0.2592
282,-0.29849000000000003
283,-0.33786
284,-0.37701999999999997
285,-0.41608
286,-0.45477
287,-0.48541000000000006
288,-0.4745
289,-0.43543000000000004
290,-0.39987
291,-0.3708
292,-0.34478000000000003
293,-0.3202
294,-0.30565
295,-0.29622
296,-0.26735
297,-0.24158000000000002
298,-0.23299
299,-0.24819000000000002
300,-0.26711999999999997
301,-0.285
302,-0.32065
303,-0.36162
304,-0.40329
305,-0.44733
306,-0.49136
307,-0.5375800000000001
308,-0.58327
309,-0.62721
310,-0.6684100000000001
311,-0.70814
312,-0.74915
313,-0.79267
314,-0.8366
315,-0.8805
316,-0.92345
317,-0.9657399999999999
318,-1.0059
319,-1.0466
320,-1.085
321,-1.1221
322,-1.1584
323,-1.1787
324,-1.194
325,-1.2126
326,-1.24
327,-1.268
328,-1.2962
329,-1.3256
330,-1.3492
331,-1.3713
332,-1.3917
333,-1.4102
334,-1.4267
335,-1.4384
336,-1.4465
337,-1.4580000000000002
338,-1.4604
339,-1.4633
340,-1.4611
341,-1.4573
342,-1.4516
343,-1.4453
344,-1.4292
345,-1.4141
346,-1.3942
347,-1.3764
348,-1.354
349,-1.329
350,-1.2930000000000001
351,-1.2577
352,-1.2527
353,-1.2542
354,-1.2452
355,-1.2431
356,-1.2468
357,-1.2487
358,-1.2409999999999999
359,-1.2469
360,-1.2509
361,-1.2606
362,-1.2647
363,-1.2676
364,-1.2625
365,-1.2532
366,-1.2386
367,-1.2225
368,-1.2026
369,-1.1728
370,-1.1388
371,-1.0985
372,-1.0724
373,-1.047
374,-1.0177
375,-0.98777
376,-0.9571799999999999
377,-0.9259999999999999
378,-0.8942899999999999
379,-0.8649
380,-0.8324600000000001
381,-0.79362
382,-0.75364
383,-0.72113
384,-0.68715
385,-0.6553
386,-0.62312
387,-0.58867
388,-0.5553100000000001
389,-0.52218
390,-0.48738000000000004
391,-0.45308999999999994
392,-0.41883000000000004
393,-0.38379
394,-0.34881
395,-0.31348000000000004
396,-0.27828
397,-0.24485
398,-0.21063
399,-0.1773
400,-0.14374
401,-0.10997
402,-0.077544
403,-0.043856
404,-0.012423
405,0.021573
406,0.054572
407,0.087791
408,0.12122000000000001
409,0.15485
410,0.18867
411,0.22268000000000002
412,0.25686
413,0.29120999999999997
414,0.32418
415,0.35888000000000003
416,0.39289
417,0.42844
418,0.46238999999999997
419,0.49715
420,0.53168
421,0.56588
422,0.60002
423,0.63476
424,0.66855
425,0.70425
426,0.73892
427,0.77371
428,0.8092699999999999
429,0.8437600000000001
430,0.8770600000000001
431,0.91059
432,0.9434600000000001
433,0.97729
434,1.0111
435,1.0453
436,1.0796
437,1.1144
438,1.1493
439,1.1845
440,1.2206
441,1.2570000000000001
442,1.2939
443,1.3303
444,1.3669
445,1.4042
446,1.4412
447,1.4784
448,1.5159
449,1.5532
450,1.5907
451,1.6283
452,1.666
453,1.7038
454,1.7417
455,1.7795
456,1.817
457,1.8547
458,1.891
459,1.9272
460,1.9456
461,1.9628
462,1.9829
