time,value
0,-2.3537
1,-2.3537
2,-2.3537
3,-2.3537
4,-2.3537
5,-2.3537
6,-2.3557
7,-2.3555
8,-2.3553
9,-2.3549
10,-2.3544
11,-2.3537
12,-2.353
13,-2.352
14,-2.3511
15,-2.3498
16,-2.3483
17,-2.347
18,-2.3453
19,-2.3438
20,-2.3399
21,-2.3381
22,-2.3377
23,-2.3358
24,-2.3314
25,-2.3292
26,-2.3282
27,-2.324
28,-2.3228
29,-2.3196
30,-2.3169
31,-2.3134
32,-2.3088
33,-2.3051
34,-2.302
35,-2.2981
36,-2.2949
37,-2.2907
38,-2.2891
39,-2.2839
40,-2.2787
41,-2.2726
42,-2.2691
43,-2.2638
44,-2.2629
45,-2.2592
46,-2.2545
47,-2.2507
48,-2.2458
49,-2.2419
50,-2.2368
51,-2.2327
52,-2.2275
53,-2.2216
54,-2.2162
55,-2.2119
56,-2.2063
57,-2.2018
58,-2.1961
59,-2.1903
60,-2.1857
61,-2.1797
62,-2.1749
63,-2.1689
64,-2.1639
65,-2.1577
66,-2.1542
67,-2.1479
68,-2.1413
69,-2.1348
70,-2.1296
71,-2.1231
72,-2.1178
73,-2.1108
74,-2.1025
75,-2.0972
76,-2.0905
77,-2.0851
78,-2.0783
79,-2.0715
80,-2.0646
81,-2.059
82,-2.052
83,-2.0464
84,-2.0393
85,-2.0326
86,-2.0258
87,-2.0187
88,-2.013
89,-2.0058
90,-1.9987
91,-1.9915
92,-1.9857
93,-1.9789
94,-1.9721
95,-1.9636
96,-1.9577
97,-1.9491
98,-1.9432
99,-1.9347
100,-1.9282
101,-1.9196
102,-1.9121
103,-1.9061
104,-1.8974
105,-1.8902
106,-1.8825
107,-1.8768
108,-1.8692
109,-1.8619999999999999
110,-1.8544
111,-1.8483
112,-1.8401
113,-1.8338
114,-1.8261
115,-1.8188
116,-1.81
117,-1.8025
118,-1.7955
119,-1.787
120,-1.7806
121,-1.7718
122,-1.7645
123,-1.7568
124,-1.7502
125,-1.7408
126,-1.7335
127,-1.726
128,-1.7205
129,-1.7129
130,-1.7055
131,-1.6969999999999998
132,-1.6880000000000002
133,-1.6806
134,-1.6725
135,-1.6662
136,-1.6585
137,-1.6512
138,-1.6434
139,-1.6387
140,-1.6305
141,-1.6244
142,-1.6155
143,-1.6081
144,-1.6007
145,-1.5921
146,-1.5863
147,-1.5789
148,-1.5731
149,-1.5653
150,-1.5591
151,-1.5502
152,-1.544
153,-1.537
154,-1.5308
155,-1.5218
156,-1.5144
157,-1.5066
158,-1.5004
159,-1.4938
160,-1.486
161,-1.4786
162,-1.4712
163,-1.465
164,-1.4580000000000002
165,-1.4518
166,-1.4428
167,-1.4364
168,-1.4286
169,-1.4231
170,-1.4159
171,-1.4096
172,-1.4017
173,-1.3942
174,-1.3863
175,-1.3783
176,-1.3723
177,-1.3641
178,-1.3578
179,-1.3498
180,-1.3423
181,-1.3343
182,-1.3278
183,-1.3197
184,-1.3122
185,-1.3042
186,-1.2978
187,-1.2897
188,-1.2822
189,-1.2741
190,-1.266
191,-1.2595
192,-1.2509
193,-1.2456
194,-1.2375
195,-1.2309999999999999
196,-1.2228
197,-1.2153
198,-1.2071
199,-1.2006
200,-1.1942
201,-1.1894
202,-1.1802
203,-1.172
204,-1.1654
205,-1.1572
206,-1.1507
207,-1.1424
208,-1.1358
209,-1.1276
210,-1.121
211,-1.1117
212,-1.105
213,-1.0967
214,-1.0901
215,-1.0818
216,-1.0751
217,-1.0681
218,-1.0624
219,-1.0548
220,-1.0464
221,-1.0397
222,-1.0314
223,-1.0237
224,-1.0153
225,-1.0086
226,-1.0002
227,-0.99346
228,-0.98503
229,-0.9782799999999999
230,-0.9707899999999999
231,-0.9630700000000001
232,-0.95554
233,-0.94706
234,-0.93932
235,-0.93176
236,-0.92494
237,-0.9164200000000001
238,-0.90959
239,-0.90105
240,-0.8942100000000001
241,-0.88564
242,-0.87879
243,-0.8702
244,-0.8633299999999999
245,-0.85646
246,-0.8547299999999999
247,-0.8461299999999999
248,-0.8444
249,-0.84096
250,-0.8323299999999999
251,-0.8254299999999999
252,-0.8167800000000001
253,-0.80986
254,-0.80033
255,-0.7934
256,-0.78473
257,-0.77778
258,-0.7691
259,-0.7621399999999999
260,-0.75344
261,-0.74473
262,-0.73775
263,-0.7290300000000001
264,-0.72204
265,-0.7133
266,-0.7063
267,-0.7003199999999999
268,-0.69338
269,-0.6846399999999999
270,-0.67765
271,-0.6689
272,-0.66189
273,-0.6522899999999999
274,-0.64527
275,-0.63649
276,-0.62771
277,-0.62068
278,-0.61188
279,-0.60483
280,-0.5980300000000001
281,-0.59204
282,-0.58324
283,-0.5762
284,-0.56739
285,-0.56034
286,-0.55152
287,-0.54446
288,-0.53562
289,-0.52855
290,-0.51971
291,-0.5108600000000001
292,-0.5037699999999999
293,-0.49411000000000005
294,-0.48781
295,-0.47894
296,-0.47183
297,-0.46295
298,-0.45583
299,-0.44693
300,-0.43981000000000003
301,-0.4309
302,-0.42377
303,-0.41485
304,-0.40771
305,-0.39878
306,-0.38985
307,-0.38269000000000003
308,-0.37375
309,-0.36659
310,-0.35688000000000003
311,-0.34970999999999997
312,-0.34075
313,-0.33358000000000004
314,-0.32461
315,-0.31983
316,-0.31221
317,-0.30504000000000003
318,-0.29531999999999997
319,-0.28635
320,-0.27917
321,-0.27335
322,-0.26857
323,-0.25961
324,-0.25168
325,-0.24270999999999998
326,-0.23614000000000002
327,-0.23031
328,-0.22314
329,-0.21416999999999997
330,-0.20625
331,-0.19727
332,-0.19115
333,-0.18563
334,-0.17695999999999998
335,-0.17009000000000002
336,-0.16634000000000002
337,-0.16379000000000002
338,-0.16021
339,-0.15305
340,-0.14767
341,-0.14587999999999998
342,-0.13721
343,-0.13004000000000002
344,-0.12107000000000001
345,-0.11389
346,-0.10670999999999999
347,-0.10269
348,-0.095817
349,-0.086844
350,-0.078921
351,-0.069511
352,-0.064733
353,-0.057561
354,-0.050384
355,-0.041408999999999994
356,-0.033485
357,-0.024503
358,-0.019744
359,-0.013923
360,-0.0060014
361,0.00057158
362,0.0046126000000000006
363,0.013574000000000001
364,0.023286
365,0.030461000000000002
366,0.035995
367,0.04108
368,0.050039
369,0.057958
370,0.066924
371,0.0741
372,0.080972
373,0.085757
374,0.095468
375,0.10339000000000001
376,0.11235
377,0.11968
378,0.12476
379,0.13372
380,0.1409
381,0.15061
382,0.15779
383,0.16466
384,0.16765
385,0.1732
386,0.17622000000000002
387,0.18517
388,0.19233
389,0.20204
390,0.2092
391,0.21816
392,0.22713000000000003
393,0.2343
394,0.24327
395,0.24835
396,0.25313
397,0.26105
398,0.27002
399,0.27719
400,0.28691
401,0.2941
402,0.30308
403,0.31026
404,0.31576
405,0.32263000000000003
406,0.33161
407,0.34059
408,0.34778000000000003
409,0.35677
410,0.36396
411,0.37369
412,0.38089
413,0.38882
414,0.39355
415,0.40221
416,0.40941
417,0.41913999999999996
418,0.42633999999999994
419,0.43535
420,0.44186000000000003
421,0.44946
422,0.45846000000000003
423,0.46638999999999997
424,0.47325
425,0.47798
426,0.48591000000000006
427,0.49383999999999995
428,0.50283
429,0.50863
430,0.5151600000000001
431,0.52236
432,0.53135
433,0.53855
434,0.54755
435,0.55656
436,0.56376
437,0.5727800000000001
438,0.57999
439,0.58648
440,0.5836100000000001
441,0.58185
442,0.57901
443,0.58303
444,0.5895699999999999
445,0.58677
446,0.5857899999999999
447,0.58233
448,0.58823
449,0.59162
450,0.59005
451,0.58734
452,0.5908
453,0.59013
454,0.5867899999999999
455,0.58415
456,0.58085
457,0.57889
458,0.57458
459,0.57145
460,0.5663699999999999
461,0.5584
462,0.55161
463,0.5472
464,0.53922
465,0.5300600000000001
466,0.52273
467,0.51357
468,0.50559
469,0.49643999999999994
470,0.48912
471,0.47997
472,0.47265
473,0.4635
474,0.45619
475,0.44705
476,0.44208000000000003
477,0.43696999999999997
478,0.43148000000000003
479,0.42168
480,0.41253999999999996
481,0.40809
482,0.40064
483,0.39332
484,0.38351999999999997
485,0.3762
486,0.36706
487,0.36025999999999997
488,0.35334
489,0.34536
490,0.33726999999999996
491,0.3335
492,0.32434
493,0.31453000000000003
494,0.30721
495,0.30278
496,0.29901
497,0.28920999999999997
498,0.28361
499,0.27921
500,0.27188
501,0.26206
502,0.25473
503,0.25033
504,0.24595
505,0.24279
506,0.23601999999999998
507,0.22683000000000003
508,0.21700999999999998
509,0.21270999999999998
510,0.20773000000000003
511,0.19975
512,0.19055
513,0.18257
514,0.17338
515,0.16602999999999998
516,0.16167
517,0.15612
518,0.1463
519,0.14321
520,0.13642
521,0.12905
522,0.11922999999999999
523,0.11002999999999999
524,0.1057
525,0.10017000000000001
526,0.092797
527,0.083588
528,0.076226
529,0.067023
530,0.059664
531,0.049841
532,0.042486
533,0.033293
534,0.025942000000000003
535,0.016125
536,0.011770000000000001
537,0.0031606
538,-0.006032399999999999
539,-0.014013999999999999
540,-0.019575
541,-0.023911
542,-0.033112
543,-0.040469
544,-0.050291
545,-0.057646
546,-0.066835
547,-0.069347
548,-0.078577
549,-0.085936
550,-0.095759
551,-0.10315
552,-0.10747999999999999
553,-0.11667999999999999
554,-0.12405
555,-0.13387000000000002
556,-0.14123
557,-0.15105
558,-0.15538
559,-0.16399
560,-0.17197
561,-0.18118
562,-0.1861
563,-0.19288
564,-0.19841
565,-0.20823000000000003
566,-0.21744000000000002
567,-0.22052
568,-0.22544
569,-0.22788000000000003
570,-0.23399
571,-0.24138
572,-0.25121
573,-0.25859
574,-0.26782
575,-0.27396
576,-0.27884000000000003
577,-0.28498
578,-0.29481999999999997
579,-0.30221
580,-0.30956
581,-0.31751
582,-0.3255
583,-0.33218000000000003
584,-0.33892
585,-0.34815999999999997
586,-0.35556
587,-0.36349000000000004
588,-0.3677
589,-0.37754
590,-0.38242
591,-0.38534
592,-0.3895
593,-0.39365
594,-0.40351
595,-0.40764
596,-0.41043999999999997
597,-0.41267
598,-0.41541999999999996
599,-0.41758999999999996
600,-0.42028000000000004
601,-0.41573000000000004
602,-0.40931
603,-0.4114
604,-0.41398
605,-0.41415
606,-0.40903
607,-0.40152
608,-0.39264
609,-0.38849
610,-0.38858000000000004
611,-0.37918
612,-0.37165
613,-0.36225
614,-0.35472
615,-0.34531
616,-0.33778
617,-0.32836
618,-0.32083
619,-0.31140999999999996
620,-0.30387
621,-0.30199000000000004
622,-0.29822
623,-0.28879
624,-0.28549
625,-0.28361
626,-0.28547
627,-0.28307
628,-0.27363000000000004
629,-0.26608000000000004
630,-0.25709
631,-0.24953000000000003
632,-0.24008000000000002
633,-0.23251999999999998
634,-0.22862
635,-0.22994
636,-0.22046999999999997
637,-0.2129
638,-0.20343
639,-0.19396
640,-0.18681
641,-0.17734
642,-0.16976
643,-0.16028
644,-0.1527
645,-0.14322000000000001
646,-0.13563
647,-0.12615
648,-0.11855999999999998
649,-0.10907
650,-0.10148
651,-0.09199600000000001
652,-0.082506
653,-0.074911
654,-0.065419
655,-0.057823
656,-0.048326999999999995
657,-0.040729
658,-0.030825
659,-0.023225
660,-0.013727000000000001
661,-0.0061254
662,0.0033766
663,0.008388600000000001
664,0.013411000000000001
665,0.021417
666,0.030913
667,0.040411
668,0.048011
669,0.057914999999999994
670,0.065515
671,0.075017
672,0.08261900000000001
673,0.087227
674,0.090751
675,0.09875700000000001
676,0.10636
677,0.11585
678,0.12345
679,0.13335999999999998
680,0.14096
681,0.15045999999999998
682,0.15996
683,0.16757
684,0.17707
685,0.18208
686,0.1875
687,0.19509
688,0.20459000000000002
689,0.2122
690,0.2217
691,0.2297
692,0.23920999999999998
693,0.24681
694,0.25632
695,0.26092
696,0.26674000000000003
697,0.27624
698,0.28384000000000004
699,0.29374
700,0.30134
701,0.30895
702,0.31246
703,0.31748000000000004
704,0.32508000000000004
705,0.33458000000000004
706,0.34258
707,0.35208
708,0.3586
709,0.36444
710,0.37204
711,0.37963
712,0.38913000000000003
713,0.39671999999999996
714,0.40621999999999997
715,0.41423000000000004
716,0.42373
717,0.43132
718,0.44083
719,0.44843
720,0.45223
721,0.45643
722,0.46674
723,0.47285
724,0.47746000000000005
725,0.48546000000000006
726,0.48546000000000006
727,0.48858999999999997
728,0.49023
729,0.49823999999999996
730,0.50625
731,0.51574
732,0.51953
733,0.5233300000000001
734,0.53092
735,0.53852
736,0.54042
737,0.54802
738,0.55561
739,0.56511
740,0.5746100000000001
741,0.5818
742,0.59131
743,0.59891
744,0.60841
745,0.61602
746,0.62552
747,0.63313
748,0.64264
749,0.6502399999999999
750,0.65975
751,0.6673600000000001
752,0.67687
753,0.68448
754,0.69439
755,0.7039
756,0.7115100000000001
757,0.7210300000000001
758,0.72864
759,0.73816
760,0.74578
761,0.7553
762,0.7629100000000001
763,0.77244
764,0.78005
765,0.7895800000000001
766,0.79719
767,0.80672
768,0.8124399999999999
769,0.81702
770,0.8265399999999999
771,0.83416
772,0.8436799999999999
773,0.8513
774,0.8612
775,0.86882
776,0.87835
777,0.88597
778,0.8894
779,0.8943700000000001
780,0.90389
781,0.91189
782,0.9214100000000001
783,0.92525
784,0.93174
785,0.94125
786,0.9488700000000001
787,0.95839
788,0.966
789,0.97552
790,0.98313
791,0.99266
792,1.0003
793,1.0098
794,1.0174
795,1.0269
796,1.0346
797,1.0365
798,1.0422
799,1.046
800,1.0464
801,1.0475
802,1.0513
803,1.0529
804,1.0579
805,1.0655
806,1.075
807,1.0826
808,1.0921
809,1.0997
810,1.1093
811,1.1169
812,1.1169
813,1.1218
814,1.1294
815,1.139
816,1.1466
817,1.1561
818,1.1634
819,1.1729
820,1.1805
821,1.19
822,1.1977
823,1.2049
824,1.2057
825,1.2133
826,1.2229
827,1.2305
828,1.2401
829,1.2458
830,1.2488
831,1.2549
832,1.2644
833,1.2724
834,1.2819999999999998
835,1.2896
836,1.296
837,1.2999
838,1.3094
839,1.317
840,1.3266
841,1.3285
842,1.3316
843,1.3411
844,1.3487
845,1.3583
846,1.3656
847,1.3751
848,1.3828
849,1.3878
850,1.3883
851,1.3956
852,1.4029
853,1.4124
854,1.4171
855,1.4157
856,1.4154
857,1.4140000000000001
858,1.4124
859,1.412
860,1.4114
861,1.4081
862,1.4065
863,1.4033
864,1.3937
865,1.3861
866,1.3762
867,1.3685
868,1.3602
869,1.3551
870,1.3487
871,1.3419999999999999
872,1.3389
873,1.3293
874,1.3216
875,1.3119999999999998
876,1.3043
877,1.2944
878,1.2868
879,1.2772
880,1.2695
881,1.2599
882,1.2523
883,1.2452
884,1.2405
885,1.2328
886,1.2232
887,1.2152
888,1.2057
889,1.1996
890,1.1942
891,1.1901
892,1.1805
893,1.1725
894,1.1664
895,1.1633
896,1.155
897,1.1473
898,1.1374
899,1.1308
900,1.1277
901,1.1178
902,1.1147
903,1.1061
904,1.0984
905,1.0888
906,1.0811
907,1.0715
908,1.0636
909,1.054
910,1.0463
911,1.0367
912,1.0290000000000001
913,1.021
914,1.0176
915,1.0116
916,1.0017
917,0.9940000000000001
918,0.98766
919,0.98459
920,0.97498
921,0.96729
922,0.95768
923,0.95
924,0.94039
925,0.9371299999999999
926,0.9344600000000001
927,0.9267799999999999
928,0.9171799999999999
929,0.9075799999999999
930,0.8999
931,0.8903
932,0.88292
933,0.8733299999999999
934,0.86565
935,0.85605
936,0.8480700000000001
937,0.8384799999999999
938,0.8308
939,0.82121
940,0.81353
941,0.8036300000000001
942,0.8002
943,0.79415
944,0.78425
945,0.77657
946,0.7699199999999999
947,0.76682
948,0.75722
949,0.74954
950,0.73964
951,0.73196
952,0.72236
953,0.72148
954,0.7164699999999999
955,0.7087899999999999
956,0.69918
957,0.68929
958,0.6816
959,0.6736300000000001
960,0.67056
961,0.66422
962,0.6565300000000001
963,0.6469199999999999
964,0.6392399999999999
965,0.62963
966,0.62166
967,0.61205
968,0.60437
969,0.5947600000000001
970,0.5936100000000001
971,0.5870000000000001
972,0.57739
973,0.56942
974,0.56116
975,0.55812
976,0.54988
977,0.54384
978,0.54164
979,0.53587
980,0.52625
981,0.51856
982,0.51059
983,0.50812
984,0.50208
985,0.49438000000000004
986,0.48477
987,0.479
988,0.4768
989,0.46718000000000004
990,0.45921999999999996
991,0.44933
992,0.44631000000000004
993,0.44001
994,0.43231
995,0.42268999999999995
996,0.41498999999999997
997,0.4051
998,0.39741
999,0.38779
1000,0.37817
1001,0.37048000000000003
1002,0.36855
1003,0.36278
1004,0.35316
1005,0.34931999999999996
1006,0.34547
1007,0.33778
1008,0.32816
1009,0.32047
1010,0.31085999999999997
1011,0.30316
1012,0.29355
1013,0.28586
1014,0.27625
1015,0.26664
1016,0.25895
1017,0.24934
1018,0.24165
1019,0.23204
1020,0.22435
1021,0.21666
1022,0.21361
1023,0.207
1024,0.19931
1025,0.1897
1026,0.18200999999999998
1027,0.1724
1028,0.16471
1029,0.15482
1030,0.14520999999999998
1031,0.13752
1032,0.12791
1033,0.12186
1034,0.11853
1035,0.11057
1036,0.10095
1037,0.093261
1038,0.083369
1039,0.075678
1040,0.066065
1041,0.058376
1042,0.055067
1043,0.048749
1044,0.039133
1045,0.029514
1046,0.021823
1047,0.011931
1048,0.0042396000000000005
1049,-0.005377399999999999
1050,-0.013068000000000001
1051,-0.021037
1052,-0.024054
1053,-0.032292
1054,-0.039987
1055,-0.049605
1056,-0.057572000000000005
1057,-0.067191
1058,-0.076809
1059,-0.084503
1060,-0.086426
1061,-0.09274199999999999
1062,-0.10263
1063,-0.10702
1064,-0.11114
1065,-0.11717999999999999
1066,-0.1191
1067,-0.12487000000000001
1068,-0.1331
1069,-0.13608
1070,-0.14237
1071,-0.15008
1072,-0.1597
1073,-0.16959000000000002
1074,-0.17729
1075,-0.18192
1076,-0.18486
1077,-0.19449
1078,-0.2022
1079,-0.21208000000000002
1080,-0.21475999999999998
1081,-0.21574000000000002
1082,-0.21599000000000002
1083,-0.21718
1084,-0.21718
1085,-0.21548
1086,-0.20776999999999998
1087,-0.2046
1088,-0.19972
1089,-0.192
1090,-0.18257
1091,-0.17506
1092,-0.1742
1093,-0.16883
1094,-0.16130999999999998
1095,-0.16019
1096,-0.15286
1097,-0.14513
1098,-0.13546
1099,-0.12792
1100,-0.11825999999999999
1101,-0.10859
1102,-0.10105
1103,-0.10005
1104,-0.092501
1105,-0.08283
1106,-0.07509400000000001
1107,-0.065421
1108,-0.057864
1109,-0.048191000000000005
1110,-0.040452999999999996
1111,-0.030780000000000002
1112,-0.025327000000000002
1113,-0.024245
1114,-0.016503
1115,-0.0068243999999999996
1116,0.0026866
1117,0.010431000000000001
1118,0.02011
1119,0.019465
1120,0.024805
1121,0.032551
1122,0.042234
1123,0.049828
1124,0.059512
1125,0.06726
1126,0.07694400000000001
1127,0.08469199999999999
1128,0.09422699999999999
1129,0.095725
1130,0.10111
1131,0.1108
1132,0.11855
1133,0.12824000000000002
1134,0.13599
1135,0.14568
1136,0.15342999999999998
1137,0.1555
1138,0.16339
1139,0.17336
1140,0.17544
1141,0.18334
1142,0.18736
1143,0.18929
1144,0.19704000000000002
1145,0.20673000000000002
1146,0.21641999999999997
1147,0.22416999999999998
1148,0.23385999999999998
1149,0.2416
1150,0.25129
1151,0.25904
1152,0.26887
1153,0.27662
1154,0.28631
1155,0.29406
1156,0.30375
1157,0.3115
1158,0.32119000000000003
1159,0.33074000000000003
1160,0.33849
1161,0.34818000000000005
1162,0.35593
1163,0.36575
1164,0.37337
1165,0.38306
1166,0.39081
1167,0.40063000000000004
1168,0.40839000000000003
1169,0.41808
1170,0.42583000000000004
1171,0.43551999999999996
1172,0.44327
1173,0.45283
1174,0.46265
1175,0.4704
1176,0.48008999999999996
1177,0.48785
1178,0.49754
1179,0.50529
1180,0.51137
1181,0.51386
1182,0.52369
1183,0.5314399999999999
1184,0.54127
1185,0.54901
1186,0.5587
1187,0.56121
1188,0.56552
1189,0.5752
1190,0.58295
1191,0.59264
1192,0.60039
1193,0.6100800000000001
1194,0.61782
1195,0.62751
1196,0.63526
1197,0.64495
1198,0.6527
1199,0.6623899999999999
1200,0.67013
1201,0.67996
1202,0.68771
1203,0.6974
1204,0.70709
1205,0.7149800000000001
1206,0.71765
1207,0.72554
1208,0.73523
1209,0.74298
1210,0.75266
1211,0.76041
1212,0.7701
1213,0.77785
1214,0.7812899999999999
1215,0.78266
1216,0.79235
1217,0.8019
1218,0.80965
1219,0.81298
1220,0.81453
1221,0.8242200000000001
1222,0.8319700000000001
1223,0.84167
1224,0.8494200000000001
1225,0.85898
1226,0.86674
1227,0.8764299999999999
1228,0.88431
1229,0.8938799999999999
1230,0.9016299999999999
1231,0.91133
1232,0.9210200000000001
1233,0.9287700000000001
1234,0.93847
1235,0.9462200000000001
1236,0.94973
1237,0.95119
1238,0.9608899999999999
1239,0.96865
1240,0.97834
1241,0.9861
1242,0.99579
1243,1.0036
1244,1.0132
1245,1.021
1246,1.0307
1247,1.0403
1248,1.048
1249,1.0577
1250,1.0655
1251,1.073
1252,1.0745
1253,1.0841
1254,1.0919
1255,1.1016
1256,1.1093
1257,1.119
1258,1.1268
1259,1.131
1260,1.1334
1261,1.1431
1262,1.1528
1263,1.1605
1264,1.1703
1265,1.1781
1266,1.1878
1267,1.1936
1268,1.1956
1269,1.2033
1270,1.213
1271,1.2149
1272,1.2208
1273,1.2285
1274,1.2382
1275,1.2479
1276,1.2557
1277,1.2653
1278,1.273
1279,1.2827
1280,1.2905
1281,1.2924
1282,1.2982
1283,1.3041
1284,1.3081
1285,1.3179
1286,1.3202
1287,1.3281
1288,1.3359
1289,1.3456
1290,1.3553
1291,1.3630000000000002
1292,1.3686
1293,1.3721
1294,1.3818
1295,1.3894
1296,1.399
1297,1.4005
1298,1.4062
1299,1.4139
1300,1.4236
1301,1.4314
1302,1.4409999999999998
1303,1.4488
1304,1.4585
1305,1.4682
1306,1.4759
1307,1.4778
1308,1.4816
1309,1.4914
1310,1.4991
1311,1.5049
1312,1.5069
1313,1.5128
1314,1.5206
1315,1.5303
1316,1.538
1317,1.5478
1318,1.5556
1319,1.5653
1320,1.575
1321,1.5826
1322,1.5923
1323,1.6001
1324,1.6098
1325,1.6155
1326,1.617
1327,1.6228
1328,1.6325
1329,1.6401
1330,1.6457
1331,1.6454
1332,1.6469
1333,1.6525
1334,1.6525
1335,1.6521
1336,1.6519
1337,1.6515
1338,1.6514
1339,1.6474
1340,1.6453
1341,1.6412
1342,1.6334
1343,1.6237
1344,1.6159
1345,1.6137
1346,1.6135
1347,1.6114
1348,1.6036
1349,1.5958
1350,1.5861
1351,1.5783
1352,1.5686
1353,1.5608
1354,1.5511
1355,1.5433
1356,1.5336
1357,1.5258
1358,1.5161
1359,1.5084
1360,1.4986
1361,1.4909
1362,1.4868
1363,1.4829
1364,1.4751
1365,1.4653
1366,1.4576
1367,1.4479
1368,1.442
1369,1.4379
1370,1.4321
1371,1.4224
1372,1.4146
1373,1.4106
1374,1.4086
1375,1.3989
1376,1.3911
1377,1.3814
1378,1.3794
1379,1.3755
1380,1.3657
1381,1.358
1382,1.3483
1383,1.3405
1384,1.3308
1385,1.3230000000000002
1386,1.3133
1387,1.3113
1388,1.3036
1389,1.2997
1390,1.2977
1391,1.288
1392,1.2803
1393,1.2705
1394,1.2628
1395,1.2531
1396,1.2453
1397,1.2394
1398,1.2375
1399,1.2278
1400,1.22
1401,1.2103
1402,1.2045
1403,1.2006
1404,1.1928
1405,1.1831
1406,1.1734
1407,1.1716
1408,1.1658
1409,1.158
1410,1.1483
1411,1.1405
1412,1.1308
1413,1.127
1414,1.1232
1415,1.1154
1416,1.1057
1417,1.0979999999999999
1418,1.0883
1419,1.0805
1420,1.0708
1421,1.0611
1422,1.0533
1423,1.0436
1424,1.0377
1425,1.0337
1426,1.0279
1427,1.0181
1428,1.0104
1429,1.0006
1430,0.99287
1431,0.98316
1432,0.9753799999999999
1433,0.97335
1434,0.96749
1435,0.95778
1436,0.94806
1437,0.94029
1438,0.93058
1439,0.92279
1440,0.9130799999999999
1441,0.9053100000000001
1442,0.8975299999999999
1443,0.89554
1444,0.88969
1445,0.88192
1446,0.87221
1447,0.86444
1448,0.85472
1449,0.84501
1450,0.83724
1451,0.82752
1452,0.81975
1453,0.81779
1454,0.8139
1455,0.80419
1456,0.79642
1457,0.78865
1458,0.78673
1459,0.77898
1460,0.7712100000000001
1461,0.76149
1462,0.75372
1463,0.7440100000000001
1464,0.73431
1465,0.72653
1466,0.71682
1467,0.70905
1468,0.69934
1469,0.69157
1470,0.68185
1471,0.67408
1472,0.66437
1473,0.6566
1474,0.64884
1475,0.64695
1476,0.6392100000000001
1477,0.63144
1478,0.62173
1479,0.61201
1480,0.60424
1481,0.59453
1482,0.5867600000000001
1483,0.58281
1484,0.57889
1485,0.56917
1486,0.5614
1487,0.5516800000000001
1488,0.54391
1489,0.5342
1490,0.52642
1491,0.51862
1492,0.51279
1493,0.50308
1494,0.49337
1495,0.4856
1496,0.47783000000000003
1497,0.47588
1498,0.47005
1499,0.46228
1500,0.45257
1501,0.4448
1502,0.44091
1503,0.43896999999999997
1504,0.42925
1505,0.42148
1506,0.41176999999999997
1507,0.40205
1508,0.39816
1509,0.39621999999999996
1510,0.38845999999999997
1511,0.3807
1512,0.37877
1513,0.37295
1514,0.36907
1515,0.36324
1516,0.35547
1517,0.34575
1518,0.33798
1519,0.32827
1520,0.3205
1521,0.31078
1522,0.30107
1523,0.2933
1524,0.2836
1525,0.27581999999999995
1526,0.26611
1527,0.25833
1528,0.24861999999999998
1529,0.24086
1530,0.23114
1531,0.22336
1532,0.21366
1533,0.20589000000000002
1534,0.19618
1535,0.1884
1536,0.17869000000000002
1537,0.16898
1538,0.16121
1539,0.15149
1540,0.14961
1541,0.14578
1542,0.13801
1543,0.1283
1544,0.12053
1545,0.11080999999999999
1546,0.10304
1547,0.093331
1548,0.08556
1549,0.083618
1550,0.07973200000000001
1551,0.073904
1552,0.07002
1553,0.06225
1554,0.052536
1555,0.044788
1556,0.035075
1557,0.027304000000000002
1558,0.025493000000000002
1559,0.02167
1560,0.011956
1561,0.0041866
1562,-0.0054944
1563,-0.013262999999999999
1564,-0.019056
1565,-0.020806
1566,-0.026592
1567,-0.036259
1568,-0.044028
1569,-0.049714
1570,-0.051453
1571,-0.061163
1572,-0.068875
1573,-0.078585
1574,-0.080355
1575,-0.083988
1576,-0.09175499999999999
1577,-0.10146000000000001
1578,-0.10916
1579,-0.11887
1580,-0.12657000000000002
1581,-0.12822999999999998
1582,-0.1339
1583,-0.14159000000000002
1584,-0.14312
1585,-0.14877
1586,-0.15847
1587,-0.16614
1588,-0.17178
1589,-0.17334000000000002
1590,-0.17507999999999999
1591,-0.17487
1592,-0.17434000000000002
1593,-0.17388
1594,-0.17353
1595,-0.17134000000000002
1596,-0.1689
1597,-0.16102
1598,-0.15327000000000002
1599,-0.14345
1600,-0.13569
1601,-0.126
1602,-0.12172999999999999
1603,-0.11925
1604,-0.1115
1605,-0.10181
1606,-0.094057
1607,-0.084229
1608,-0.076477
1609,-0.066789
1610,-0.060698
1611,-0.058194
1612,-0.048362
1613,-0.040467
1614,-0.030780000000000002
1615,-0.0284
1616,-0.023919
1617,-0.016017
1618,-0.0097374
1619,-0.009092399999999999
1620,0.00075158
1621,0.0084936
1622,0.018338
1623,0.02288
1624,0.029026999999999997
1625,0.037112
1626,0.039755
1627,0.043983999999999995
1628,0.051722000000000004
1629,0.061392999999999996
1630,0.069131
1631,0.078802
1632,0.08672
1633,0.09639099999999999
1634,0.10413
1635,0.1138
1636,0.12154000000000001
1637,0.13121
1638,0.14089000000000002
1639,0.14862999999999998
1640,0.1583
1641,0.16252
1642,0.1673
1643,0.17503
1644,0.1847
1645,0.19244
1646,0.20210999999999998
1647,0.20985
1648,0.21952
1649,0.22726
1650,0.23693000000000003
1651,0.24466
1652,0.25434
1653,0.26419000000000004
1654,0.27192
1655,0.2816
1656,0.28934
1657,0.29901
1658,0.30324
1659,0.30801999999999996
1660,0.31575
1661,0.32542
1662,0.33316
1663,0.34283
1664,0.35056
1665,0.36024
1666,0.36991
1667,0.37783
1668,0.3875
1669,0.39523
1670,0.4049
1671,0.41263999999999995
1672,0.42231
1673,0.43005
1674,0.43972
1675,0.44746
1676,0.45713000000000004
1677,0.45961
1678,0.46421
1679,0.47193999999999997
1680,0.48161000000000004
1681,0.49128
1682,0.49901999999999996
1683,0.50869
1684,0.5164300000000001
1685,0.5261
1686,0.53383
1687,0.54351
1688,0.54913
1689,0.5501699999999999
1690,0.55581
1691,0.56548
1692,0.57322
1693,0.58273
1694,0.5904699999999999
1695,0.60014
1696,0.60982
1697,0.61773
1698,0.62741
1699,0.63515
1700,0.64499
1701,0.64568
1702,0.65184
1703,0.65958
1704,0.66943
1705,0.67716
1706,0.68684
1707,0.69299
1708,0.6958300000000001
1709,0.7035600000000001
1710,0.7134199999999999
1711,0.72309
1712,0.72751
1713,0.73212
1714,0.73985
1715,0.74952
1716,0.75745
1717,0.7671100000000001
1718,0.77485
1719,0.78452
1720,0.78876
1721,0.7935800000000001
1722,0.8013100000000001
1723,0.81098
1724,0.82065
1725,0.82857
1726,0.83824
1727,0.8459700000000001
1728,0.85215
1729,0.85487
1730,0.8628
1731,0.8705299999999999
1732,0.8801899999999999
1733,0.88792
1734,0.89759
1735,0.90551
1736,0.9151799999999999
1737,0.92291
1738,0.9325700000000001
1739,0.94224
1740,0.9499700000000001
1741,0.95944
1742,0.9671700000000001
1743,0.9768399999999999
1744,0.9845700000000001
1745,0.99424
1746,1.002
1747,1.0116
1748,1.0194
1749,1.0290000000000001
1750,1.0368
1751,1.0464
1752,1.0542
1753,1.0638
1754,1.0735
1755,1.0812
1756,1.0909
1757,1.0986
1758,1.1083
1759,1.1161
1760,1.1257
1761,1.1296
1762,1.1335
1763,1.1412
1764,1.147
1765,1.1489
1766,1.1547
1767,1.1627
1768,1.1723
1769,1.1785
1770,1.1812
1771,1.1891
1772,1.1968
1773,1.2067
1774,1.2144
1775,1.2241
1776,1.2318
1777,1.2396
1778,1.2423
1779,1.2467
1780,1.2544
1781,1.2641
1782,1.2738
1783,1.2815
1784,1.2912
1785,1.2989
1786,1.3086
1787,1.3163
1788,1.3259999999999998
1789,1.3337
1790,1.3434
1791,1.3511
1792,1.3608
1793,1.3627
1794,1.3683
1795,1.3759
1796,1.3813
1797,1.383
1798,1.3906
1799,1.3945
1800,1.3966
1801,1.4064
1802,1.4145
1803,1.4242
1804,1.4281
1805,1.4323
1806,1.44
1807,1.4499
1808,1.4576
1809,1.4603
1810,1.4648
1811,1.4746
1812,1.4775
1813,1.4783
1814,1.4793
1815,1.4801
1816,1.4812
1817,1.482
1818,1.4831
1819,1.4758
1820,1.4707
1821,1.4697
1822,1.4603
1823,1.4569
1824,1.4542
1825,1.4465
1826,1.4371
1827,1.4274
1828,1.4264
1829,1.4231
1830,1.4154
1831,1.4057
1832,1.3980000000000001
1833,1.3884
1834,1.3807
1835,1.3761
1836,1.3734
1837,1.3638
1838,1.3561
1839,1.3464
1840,1.3368
1841,1.3291
1842,1.3195
1843,1.3117
1844,1.3021
1845,1.2944
1846,1.2848
1847,1.2771
1848,1.272
1849,1.2711
1850,1.2615
1851,1.2538
1852,1.2444
1853,1.2367
1854,1.2292
1855,1.2286
1856,1.2212
1857,1.2118
1858,1.2041
1859,1.1994
1860,1.1964
1861,1.187
1862,1.1862
1863,1.1832
1864,1.1755
1865,1.1659
1866,1.1582
1867,1.1486
1868,1.1409
1869,1.1316
1870,1.122
1871,1.114
1872,1.1044
1873,1.0967
1874,1.0871
1875,1.0794
1876,1.0698
1877,1.0621
1878,1.0525
1879,1.0448
1880,1.0352
1881,1.0275
1882,1.0179
1883,1.0129
1884,1.0063
1885,0.9964
1886,0.9887100000000001
1887,0.9823799999999999
1888,0.9793200000000001
1889,0.9732799999999999
1890,0.96559
1891,0.9559799999999999
1892,0.94829
1893,0.9384
1894,0.93071
1895,0.9211
1896,0.91369
1897,0.9040799999999999
1898,0.8944799999999999
1899,0.88679
1900,0.8774700000000001
1901,0.87671
1902,0.87154
1903,0.8638600000000001
1904,0.85426
1905,0.8465799999999999
1906,0.8372799999999999
1907,0.8296
1908,0.82
1909,0.8123199999999999
1910,0.80273
1911,0.80202
1912,0.79911
1913,0.78951
1914,0.78184
1915,0.77257
1916,0.7649
1917,0.75531
1918,0.74764
1919,0.74315
1920,0.7422
1921,0.7326199999999999
1922,0.72528
1923,0.7157
1924,0.7137899999999999
1925,0.7083699999999999
1926,0.70136
1927,0.69787
1928,0.69279
1929,0.68738
1930,0.6854600000000001
1931,0.6854600000000001
1932,0.6832199999999999
1933,0.67556
1934,0.66791
1935,0.66824
1936,0.66667
1937,0.66633
1938,0.65676
1939,0.65485
1940,0.65103
1941,0.64337
1942,0.63381
1943,0.62425
1944,0.61659
1945,0.60738
1946,0.59973
1947,0.59017
1948,0.5825199999999999
1949,0.57262
1950,0.56497
1951,0.5554100000000001
1952,0.54777
1953,0.5382100000000001
1954,0.53057
1955,0.5269199999999999
1956,0.5205
1957,0.51285
1958,0.50329
1959,0.49563999999999997
1960,0.48608
1961,0.47808999999999996
1962,0.46853
1963,0.46088999999999997
1964,0.45133
1965,0.44369
1966,0.43413
1967,0.42649
1968,0.41694
1969,0.4093
1970,0.39975
1971,0.39019000000000004
1972,0.38256
1973,0.37301
1974,0.36537
1975,0.35581999999999997
1976,0.34819
1977,0.33864
1978,0.33100999999999997
1979,0.32719000000000004
1980,0.32528
1981,0.31765
1982,0.31574
1983,0.30811
1984,0.30046999999999996
1985,0.29093
1986,0.2814
1987,0.27376
1988,0.26423
1989,0.2566
1990,0.25131
1991,0.24713000000000002
1992,0.23759
1993,0.22996
1994,0.22041999999999998
1995,0.21279
1996,0.20515999999999998
1997,0.20515999999999998
1998,0.19563
1999,0.188
2000,0.17847000000000002
2001,0.17275
2002,0.1701
2003,0.16055999999999998
2004,0.15294000000000002
2005,0.14303
2006,0.13541
2007,0.12778
2008,0.12588
2009,0.11635
2010,0.11444000000000001
2011,0.11062999999999999
2012,0.10300999999999999
2013,0.093485
2014,0.08396
2015,0.07633999999999999
2016,0.066819
2017,0.059201
2018,0.053488
2019,0.04968
2020,0.042064
2021,0.038257
2022,0.034451
2023,0.026837
2024,0.01732
2025,0.0097076
2026,0.00019458
2027,-0.0070214
2028,-0.01653
2029,-0.026039999999999997
2030,-0.033645999999999995
2031,-0.043151999999999996
2032,-0.050755
2033,-0.050635
2034,-0.053614999999999996
2035,-0.063109
2036,-0.070701
2037,-0.080194
2038,-0.087368
2039,-0.096855
2040,-0.10444
2041,-0.11392999999999999
2042,-0.12150999999999999
2043,-0.13099
2044,-0.14047
2045,-0.14806
2046,-0.15753
2047,-0.16510999999999998
2048,-0.16994
2049,-0.17182999999999998
2050,-0.1813
2051,-0.18887
2052,-0.19834000000000002
2053,-0.20125
2054,-0.20459000000000002
2055,-0.21170999999999998
2056,-0.22116999999999998
2057,-0.22684
2058,-0.22873000000000002
2059,-0.23585
2060,-0.24341
2061,-0.25285
2062,-0.25995999999999997
2063,-0.2694
2064,-0.27318000000000003
2065,-0.27884000000000003
2066,-0.28639000000000003
2067,-0.29205
2068,-0.2944
2069,-0.30384
2070,-0.30761
2071,-0.31327
2072,-0.31893
2073,-0.32082
2074,-0.33025
2075,-0.33779000000000003
2076,-0.34722
2077,-0.35475999999999996
2078,-0.36371
2079,-0.37125
2080,-0.37735
2081,-0.3773
2082,-0.3867
2083,-0.39421999999999996
2084,-0.40313000000000004
2085,-0.41063999999999995
2086,-0.42003999999999997
2087,-0.42943000000000003
2088,-0.43218
2089,-0.43153
2090,-0.43903000000000003
2091,-0.4484
2092,-0.4559
2093,-0.46475
2094,-0.47223999999999994
2095,-0.4816
2096,-0.48856000000000005
2097,-0.48778999999999995
2098,-0.49286
2099,-0.50166
2100,-0.50913
2101,-0.51364
2102,-0.51277
2103,-0.52022
2104,-0.52898
2105,-0.53642
2106,-0.54032
2107,-0.53991
2108,-0.54919
2109,-0.55662
2110,-0.5653199999999999
2111,-0.5727399999999999
2112,-0.57957
2113,-0.57908
2114,-0.5853
2115,-0.5927
2116,-0.60135
2117,-0.60568
2118,-0.60753
2119,-0.6167600000000001
2120,-0.6241399999999999
2121,-0.63275
2122,-0.6358199999999999
2123,-0.63827
2124,-0.6450199999999999
2125,-0.65422
2126,-0.65422
2127,-0.65422
2128,-0.6517
2129,-0.64853
2130,-0.64532
2131,-0.6410100000000001
2132,-0.6354
2133,-0.6309600000000001
2134,-0.62767
2135,-0.62385
2136,-0.61473
2137,-0.60742
2138,-0.59763
2139,-0.5949800000000001
2140,-0.5875
2141,-0.5802
2142,-0.57107
2143,-0.56311
2144,-0.55398
2145,-0.54484
2146,-0.53752
2147,-0.52941
2148,-0.5256
2149,-0.51647
2150,-0.5085
2151,-0.49936
2152,-0.49488999999999994
2153,-0.48741999999999996
2154,-0.48012
2155,-0.47098999999999996
2156,-0.46368000000000004
2157,-0.45453999999999994
2158,-0.44656999999999997
2159,-0.43743000000000004
2160,-0.42828
2161,-0.42095
2162,-0.4118
2163,-0.40447
2164,-0.39531
2165,-0.38797
2166,-0.3788
2167,-0.37146
2168,-0.36228
2169,-0.36044
2170,-0.35494000000000003
2171,-0.35126
2172,-0.34759
2173,-0.3384
2174,-0.33105
2175,-0.32185
2176,-0.31449
2177,-0.30529
2178,-0.30283000000000004
2179,-0.29914
2180,-0.29178000000000004
2181,-0.28257
2182,-0.27705
2183,-0.2752
2184,-0.27029000000000003
2185,-0.26106999999999997
2186,-0.25369
2187,-0.24445999999999998
2188,-0.23584000000000002
2189,-0.22845
2190,-0.21861
2191,-0.21122
2192,-0.20198
2193,-0.19459
2194,-0.18415
2195,-0.17991
2196,-0.17007
2197,-0.16268
2198,-0.15342999999999998
2199,-0.14604
2200,-0.13679000000000002
2201,-0.1288
2202,-0.11954000000000001
2203,-0.11029000000000001
2204,-0.10288
2205,-0.09362000000000001
2206,-0.090008
2207,-0.08394299999999999
2208,-0.076541
2209,-0.066697
2210,-0.059294000000000006
2211,-0.052636
2212,-0.047746
2213,-0.038499
2214,-0.031099
2215,-0.021255
2216,-0.013853
2217,-0.007120399999999999
2218,-0.00045042
2219,0.0069456000000000006
2220,0.01679
2221,0.024782
2222,0.031461
2223,0.035756
2224,0.044998
2225,0.052989999999999995
2226,0.062234000000000005
2227,0.069632
2228,0.078815
2229,0.081207
2230,0.090446
2231,0.10029
2232,0.10768
2233,0.11437
2234,0.12112
2235,0.12971
2236,0.13398
2237,0.14073
2238,0.14870999999999998
2239,0.15794
2240,0.16469
2241,0.16959000000000002
2242,0.17695999999999998
2243,0.18679
2244,0.19417
2245,0.2003
2246,0.20583
2247,0.21381999999999998
2248,0.21935
2249,0.22366999999999998
2250,0.23287
2251,0.24086
2252,0.25068
2253,0.25623
2254,0.26361
2255,0.2716
2256,0.27656
2257,0.28333
2258,0.29315
2259,0.30051
2260,0.30727
2261,0.31042
2262,0.3148
2263,0.31735
2264,0.32533
2265,0.33275
2266,0.33716
2267,0.34697
2268,0.35257
2269,0.35581999999999997
2270,0.36025999999999997
2271,0.36356
2272,0.36621
2273,0.37185999999999997
2274,0.37982
2275,0.3825
2276,0.38587
2277,0.38858000000000004
2278,0.39199
2279,0.39474000000000004
2280,0.39066999999999996
2281,0.38661
2282,0.38829
2283,0.38356
2284,0.37772
2285,0.37875
2286,0.37366
2287,0.36895
2288,0.37075
2289,0.36246
2290,0.35598
2291,0.34698
2292,0.34557
2293,0.34418000000000004
2294,0.337
2295,0.32802
2296,0.32083
2297,0.31185999999999997
2298,0.30469
2299,0.29886
2300,0.29484
2301,0.28586
2302,0.27868000000000004
2303,0.26897
2304,0.26
2305,0.25283
2306,0.24388
2307,0.23879
2308,0.23325
2309,0.22608000000000003
2310,0.21711999999999998
2311,0.2092
2312,0.20024
2313,0.19308
2314,0.18574000000000002
2315,0.17886
2316,0.1699
2317,0.16197999999999999
2318,0.15303
2319,0.14409
2320,0.13693
2321,0.12799000000000002
2322,0.1262
2323,0.12084
2324,0.11727
2325,0.11548
2326,0.11012999999999999
2327,0.1012
2328,0.094066
2329,0.08515
2330,0.07802100000000001
2331,0.069113
2332,0.061991
2333,0.053092999999999994
2334,0.044202
2335,0.037091000000000006
2336,0.028994
2337,0.021893
2338,0.013022999999999998
2339,0.005927600000000001
2340,-0.0029334
2341,-0.010020000000000001
2342,-0.0077824
2343,-0.011470999999999999
2344,-0.020303
2345,-0.027363
2346,-0.036183
2347,-0.044181
2348,-0.051226
2349,-0.060028
2350,-0.067065
2351,-0.074099
2352,-0.07585700000000001
2353,-0.082884
2354,-0.089909
2355,-0.093422
2356,-0.095176
2357,-0.10395
2358,-0.11095999999999999
2359,-0.11972000000000001
2360,-0.12673
2361,-0.13547
2362,-0.14422000000000001
2363,-0.15120999999999998
2364,-0.16079000000000002
2365,-0.16777
2366,-0.17649
2367,-0.18347
2368,-0.1913
2369,-0.19647
2370,-0.20342000000000002
2371,-0.21039000000000002
2372,-0.2191
2373,-0.22607
2374,-0.23563
2375,-0.24259
2376,-0.25128
2377,-0.25997
2378,-0.26516999999999996
2379,-0.273
2380,-0.27995
2381,-0.28864
2382,-0.29558
2383,-0.30425
2384,-0.31119
2385,-0.32073
2386,-0.32765
2387,-0.3363
2388,-0.34321
2389,-0.35185
2390,-0.35875
2391,-0.36737
2392,-0.37598000000000004
2393,-0.38287
2394,-0.38459
2395,-0.38803000000000004
2396,-0.39671999999999996
2397,-0.39934000000000003
2398,-0.40803
2399,-0.41581
2400,-0.42015
2401,-0.42358999999999997
2402,-0.43218
2403,-0.43904
2404,-0.44761999999999996
2405,-0.45618000000000003
2406,-0.46395
2407,-0.4725
2408,-0.47933000000000003
2409,-0.48786999999999997
2410,-0.49468999999999996
2411,-0.50321
2412,-0.51002
2413,-0.51853
2414,-0.52532
2415,-0.53381
2416,-0.5406
2417,-0.54907
2418,-0.55584
2419,-0.56429
2420,-0.57177
2421,-0.57852
2422,-0.58694
2423,-0.59367
2424,-0.6020800000000001
2425,-0.60544
2426,-0.60712
2427,-0.61383
2428,-0.62221
2429,-0.62388
2430,-0.62792
2431,-0.63361
2432,-0.6419600000000001
2433,-0.64862
2434,-0.65695
2435,-0.6566
2436,-0.6569
2437,-0.66519
2438,-0.67181
2439,-0.68008
2440,-0.6866899999999999
2441,-0.69391
2442,-0.7005
2443,-0.70872
2444,-0.71529
2445,-0.72349
2446,-0.7300399999999999
2447,-0.73822
2448,-0.74475
2449,-0.7529100000000001
2450,-0.76105
2451,-0.76756
2452,-0.77675
2453,-0.7832399999999999
2454,-0.7913399999999999
2455,-0.79781
2456,-0.80588
2457,-0.81342
2458,-0.82044
2459,-0.8279799999999999
2460,-0.83604
2461,-0.84357
2462,-0.85162
2463,-0.86074
2464,-0.86672
2465,-0.87211
2466,-0.87854
2467,-0.88766
2468,-0.8940799999999999
2469,-0.9011600000000001
2470,-0.90656
2471,-0.91458
2472,-0.92209
2473,-0.9296
2474,-0.9355899999999999
2475,-0.9426
2476,-0.95011
2477,-0.95719
2478,-0.9658
2479,-0.9733200000000001
2480,-0.9813200000000001
2481,-0.98893
2482,-0.9954299999999999
2483,-1.0018
2484,-1.0109
2485,-1.0173
2486,-1.0233
2487,-1.0299
2488,-1.0379
2489,-1.0453
2490,-1.0544
2491,-1.0605
2492,-1.0675
2493,-1.0754
2494,-1.0818
2495,-1.0909
2496,-1.0972
2497,-1.1054
2498,-1.1098
2499,-1.1178
2500,-1.1252
2501,-1.1332
2502,-1.1408
2503,-1.1474
2504,-1.1537
2505,-1.1616
2506,-1.1679
2507,-1.1769
2508,-1.1839
2509,-1.1901
2510,-1.1975
2511,-1.2038
2512,-1.2128
2513,-1.2191
2514,-1.2269
2515,-1.2319
2516,-1.2412
2517,-1.2475
2518,-1.2564
2519,-1.2627
2520,-1.27
2521,-1.2786
2522,-1.2848
2523,-1.2938
2524,-1.3
2525,-1.3077
2526,-1.314
2527,-1.3206
2528,-1.328
2529,-1.3357
2530,-1.3419
2531,-1.3497
2532,-1.3547
2533,-1.3625
2534,-1.3686
2535,-1.3775
2536,-1.3852
2537,-1.391
2538,-1.3985
2539,-1.4027
2540,-1.4104
2541,-1.4177
2542,-1.4254
2543,-1.4314
2544,-1.4396
2545,-1.446
2546,-1.4536
2547,-1.4609
2548,-1.4684
2549,-1.4763
2550,-1.4845
2551,-1.4933
2552,-1.4994
2553,-1.5076
2554,-1.514
2555,-1.5227
2556,-1.5288
2557,-1.5375
2558,-1.5442
2559,-1.5524
2560,-1.5584
2561,-1.5671
2562,-1.5728
2563,-1.5805
2564,-1.5863
2565,-1.595
2566,-1.6024
2567,-1.6091
2568,-1.6171
2569,-1.6243
2570,-1.631
2571,-1.6375
2572,-1.6462
2573,-1.6517
2574,-1.6594
2575,-1.6666
2576,-1.6748
2577,-1.6828
2578,-1.6915
2579,-1.6994
2580,-1.7047
2581,-1.7121
2582,-1.7193
2583,-1.7280000000000002
2584,-1.7345
2585,-1.743
2586,-1.7512
2587,-1.7604
2588,-1.7676
2589,-1.7743
2590,-1.7808
2591,-1.7895
2592,-1.795
2593,-1.8012
2594,-1.8088
2595,-1.814
2596,-1.8228
2597,-1.828
2598,-1.8344
2599,-1.8416
2600,-1.8498
2601,-1.8562
2602,-1.865
2603,-1.8705
2604,-1.8781
2605,-1.8853
2606,-1.8935
2607,-1.8999
2608,-1.9075
2609,-1.9163
2610,-1.9223
2611,-1.9287
2612,-1.9354
2613,-1.9429
2614,-1.9489
2615,-1.9564
2616,-1.9623
2617,-1.9697
2618,-1.9756
2619,-1.9829
2620,-1.9888
2621,-1.996
2622,-2.0018
2623,-2.0089
2624,-2.016
2625,-2.0217
2626,-2.0287
2627,-2.0343
2628,-2.0412
2629,-2.0467
2630,-2.0536
2631,-2.0604
2632,-2.0671
2633,-2.0725
2634,-2.0791
2635,-2.0844
2636,-2.0909
2637,-2.0974
2638,-2.1026
2639,-2.1089
2640,-2.1139
2641,-2.1202
2642,-2.1251
2643,-2.1312
2644,-2.1361
2645,-2.1421
2646,-2.1494
2647,-2.1576
2648,-2.1623
2649,-2.1682
2650,-2.1728
2651,-2.1786
2652,-2.1842
2653,-2.1902
2654,-2.1957
2655,-2.2001
2656,-2.2054
2657,-2.2096
2658,-2.2148
2659,-2.2189
2660,-2.2239
2661,-2.2278
2662,-2.2326
2663,-2.2394
2664,-2.2473
2665,-2.2511
2666,-2.2558
2667,-2.2603
2668,-2.2639
2669,-2.2682
2670,-2.2734
2671,-2.2775
2672,-2.2808
2673,-2.2847
2674,-2.2877
2675,-2.2914
2676,-2.2943
2677,-2.2978
2678,-2.3005
2679,-2.3037
2680,-2.3062
2681,-2.3092
2682,-2.3121
2683,-2.3175
2684,-2.3273
2685,-2.3295
2686,-2.332
2687,-2.334
2688,-2.3362
2689,-2.338
2690,-2.34
2691,-2.3415
2692,-2.3451
2693,-2.3464
2694,-2.3478
2695,-2.3491
2696,-2.3501
2697,-2.3511
2698,-2.3518
2699,-2.3505
2700,-2.351
2701,-2.3514
2702,-2.3516
2703,-2.3518
2704,-2.3518
2705,-2.3518
2706,-2.3537
2707,-2.3537
2708,-2.3537
