time,value
0,-0.68612
1,-0.68612
2,-0.68612
3,-0.68612
4,-0.68612
5,-0.68612
6,-0.68612
7,-0.68612
8,-0.68612
9,-0.68612
10,-0.68612
11,-0.68612
12,-0.68612
13,-0.68612
14,-0.68612
15,-0.68612
16,-0.68612
17,-0.68612
18,-0.68612
19,-0.68612
20,-0.68612
21,-0.68612
22,-0.68612
23,-0.68612
24,-0.68612
25,-0.68612
26,-0.68612
27,-0.68612
28,-0.68612
29,-0.68612
30,-0.68612
31,-0.68612
32,-0.68612
33,-0.68612
34,-0.68612
35,-0.68612
36,-0.68612
37,-0.68612
38,-0.68612
39,-0.68612
40,-0.68612
41,-0.68612
42,-0.68612
43,-0.68612
44,-0.68612
45,-0.68612
46,-0.68612
47,-0.68612
48,-0.68612
49,-0.68612
50,-0.68612
51,-0.68612
52,-0.68612
53,-0.68612
54,-0.68612
55,-0.68612
56,-0.68612
57,-0.68612
58,-0.35470999999999997
59,1.6337
60,1.5509
61,1.5509
62,1.6337
63,1.5509
64,1.6337
65,1.5509
66,1.5509
67,1.7166
68,1.4680000000000002
69,1.1366
70,-0.35470999999999997
71,-0.43756000000000006
72,0.63951
73,1.6337
74,1.6337
75,-0.023302
76,-0.35470999999999997
77,0.47381
78,1.6337
79,1.6337
80,1.6337
81,1.6337
82,1.6337
83,1.4680000000000002
84,-0.35470999999999997
85,-0.35470999999999997
86,-0.43756000000000006
87,-0.35470999999999997
88,0.47381
89,1.7166
90,1.6337
91,1.5509
92,1.6337
93,1.6337
94,1.5509
95,1.6337
