time,value
0,-0.79006
1,0.6352800000000001
2,0.011392
3,-1.2749
4,-1.9198
5,-1.6122
6,-0.98482
7,-0.77048
8,-1.08
9,-1.4976
10,-1.6163
11,-1.4155
12,-1.2047
13,-1.2143
14,-1.3842
15,-1.527
16,-1.52
17,-1.42
18,-1.3718
19,-1.4071
20,-1.4665
21,-1.4949
22,-1.4709999999999999
23,-1.4378
24,-1.4356
25,-1.4456
26,-1.4543
27,-1.4556
28,-1.4441
29,-1.4478
30,-1.444
31,-1.4307
32,-1.4367
33,-1.432
34,-1.4241
35,-1.4297
36,-1.4243
37,-1.4216
38,-1.4272
39,-1.4224
40,-1.4264
41,-1.4327
42,-1.4279
43,-1.4368
44,-1.4417
45,-1.4359
46,-1.4494
47,-1.4534
48,-1.4516
49,-1.4654
50,-1.4680000000000002
51,-1.4705
52,-1.4832
53,-1.4847
54,-1.4922
55,-1.5039
56,-1.5038
57,-1.5147
58,-1.5231
59,-1.5195
60,-1.5318
61,-1.5351
62,-1.5282
63,-1.5371
64,-1.5333
65,-1.5254
66,-1.5285
67,-1.5189
68,-1.5114
69,-1.5089
70,-1.4934
71,-1.4859
72,-1.4777
73,-1.4575
74,-1.452
75,-1.4413
76,-1.4205
77,-1.4198
78,-1.4082
79,-1.3915
80,-1.3889
81,-1.3749
82,-1.3619
83,-1.3577
84,-1.3416
85,-1.3323
86,-1.3259999999999998
87,-1.3090000000000002
88,-1.3057
89,-1.3001
90,-1.2832
91,-1.2849
92,-1.2784
93,-1.2662
94,-1.2723
95,-1.2683
96,-1.2632
97,-1.2698
98,-1.2659
99,-1.268
100,-1.2759
101,-1.2704
102,-1.2718
103,-1.2679
104,-1.2481
105,-1.2416
106,-1.2263
107,-1.1996
108,-1.1903
109,-1.1688
110,-1.1426
111,-1.1292
112,-1.1037
113,-1.0804
114,-1.0659999999999998
115,-1.0425
116,-1.0313
117,-1.0258
118,-1.0114
119,-1.0128
120,-1.0099
121,-0.9955299999999999
122,-1.0013
123,-0.99664
124,-0.9839
125,-0.9821200000000001
126,-0.9619700000000001
127,-0.93616
128,-0.9196700000000001
129,-0.89636
130,-0.88697
131,-0.88749
132,-0.8766299999999999
133,-0.87397
134,-0.86524
135,-0.84435
136,-0.8448399999999999
137,-0.84172
138,-0.83241
139,-0.8404
140,-0.8347600000000001
141,-0.8254299999999999
142,-0.82899
143,-0.8217700000000001
144,-0.81853
145,-0.8204899999999999
146,-0.8085100000000001
147,-0.80501
148,-0.80142
149,-0.78645
150,-0.78786
151,-0.78332
152,-0.76727
153,-0.7704300000000001
154,-0.76144
155,-0.7475
156,-0.74854
157,-0.73831
158,-0.73
159,-0.73064
160,-0.71942
161,-0.71605
162,-0.71541
163,-0.70301
164,-0.7044699999999999
165,-0.70273
166,-0.69043
167,-0.69885
168,-0.69909
169,-0.6936
170,-0.70558
171,-0.70589
172,-0.70541
173,-0.71649
174,-0.71687
175,-0.7239399999999999
176,-0.73649
177,-0.7370399999999999
178,-0.7489899999999999
179,-0.76068
180,-0.76273
181,-0.7833
182,-0.79606
183,-0.79808
184,-0.81848
185,-0.82914
186,-0.8397700000000001
187,-0.86462
188,-0.87431
189,-0.8809
190,-0.8899799999999999
191,-0.8875799999999999
192,-0.8992600000000001
193,-0.91684
194,-0.9234600000000001
195,-0.9412799999999999
196,-0.94934
197,-0.9445100000000001
198,-0.96162
199,-0.9696299999999999
200,-0.97255
201,-0.99005
202,-0.99567
203,-1.0033
204,-1.0213
205,-1.0268
206,-1.0376
207,-1.0524
208,-1.0582
209,-1.0781
210,-1.0914
211,-1.0855
212,-1.0932
213,-1.0957
214,-1.1006
215,-1.1301
216,-1.1438
217,-1.1427
218,-1.1442
219,-1.1384
220,-1.1534
221,-1.1885
222,-1.2099
223,-1.2229
224,-1.213
225,-1.1806
226,-1.1705
227,-1.1688
228,-1.1673
229,-1.1846
230,-1.181
231,-1.1640000000000001
232,-1.1591
233,-1.1465
234,-1.1413
235,-1.1464
236,-1.1365
237,-1.1289
238,-1.1192
239,-1.097
240,-1.0909
241,-1.0836
242,-1.0651
243,-1.0641
244,-1.0504
245,-1.0286
246,-1.0246
247,-1.0112
248,-0.99829
249,-0.99585
250,-0.9799899999999999
251,-0.96831
252,-0.96114
253,-0.94201
254,-0.93424
255,-0.92458
256,-0.90233
257,-0.89704
258,-0.8841100000000001
259,-0.86185
260,-0.8583200000000001
261,-0.84291
262,-0.8235399999999999
263,-0.8167399999999999
264,-0.7975800000000001
265,-0.7812399999999999
266,-0.77203
267,-0.7501800000000001
268,-0.73655
269,-0.72288
270,-0.6964
271,-0.68506
272,-0.66896
273,-0.64165
274,-0.6357
275,-0.61856
276,-0.59612
277,-0.59021
278,-0.57402
279,-0.56025
280,-0.5575399999999999
281,-0.5432600000000001
282,-0.53579
283,-0.53156
284,-0.5153399999999999
285,-0.5129199999999999
286,-0.50858
287,-0.49304
288,-0.49683999999999995
289,-0.49167
290,-0.47871
291,-0.48391999999999996
292,-0.47767
293,-0.47
294,-0.47463
295,-0.46742
296,-0.46529
297,-0.46958
298,-0.46215
299,-0.46601000000000004
300,-0.46948
301,-0.46076000000000006
302,-0.46889
303,-0.47034
304,-0.46187
305,-0.47393
306,-0.47415
307,-0.47011000000000003
308,-0.48062
309,-0.47951000000000005
310,-0.48096000000000005
311,-0.48983999999999994
312,-0.48502
313,-0.48911000000000004
314,-0.49856000000000006
315,-0.50095
316,-0.5207
317,-0.53227
318,-0.5230100000000001
319,-0.52598
320,-0.51635
321,-0.5054
322,-0.51812
323,-0.52076
324,-0.51945
325,-0.52435
326,-0.51718
327,-0.52191
328,-0.53665
329,-0.53857
330,-0.5465399999999999
331,-0.54573
332,-0.53165
333,-0.54147
334,-0.5494399999999999
335,-0.54971
336,-0.5639
337,-0.55745
338,-0.5421199999999999
339,-0.53978
340,-0.5290100000000001
341,-0.52651
342,-0.53305
343,-0.52559
344,-0.52536
345,-0.52391
346,-0.5100100000000001
347,-0.51343
348,-0.5109899999999999
349,-0.49446999999999997
350,-0.49601999999999996
351,-0.48252
352,-0.46213000000000004
353,-0.45771000000000006
354,-0.44058
355,-0.42282
356,-0.41234
357,-0.38711
358,-0.36883
359,-0.35444000000000003
360,-0.32768
361,-0.31461
362,-0.29751
363,-0.26727
364,-0.25747
365,-0.23859
366,-0.21205
367,-0.2043
368,-0.18415
369,-0.16213
370,-0.15249000000000001
371,-0.12978
372,-0.11145
373,-0.098358
374,-0.07115
375,-0.054604999999999994
376,-0.037067
377,-0.0064472999999999996
378,0.0061846
379,0.026575
380,0.058828
381,0.070572
382,0.094451
383,0.12214000000000001
384,0.13419
385,0.15953
386,0.18359
387,0.19954000000000002
388,0.22863000000000003
389,0.24825
390,0.26611999999999997
391,0.29866
392,0.31656999999999996
393,0.33899999999999997
394,0.37274
395,0.38248000000000004
396,0.4043
397,0.43615
398,0.45327
399,0.48418999999999995
400,0.51318
401,0.5270100000000001
402,0.55185
403,0.5703199999999999
404,0.5858300000000001
405,0.61621
406,0.63269
407,0.64979
408,0.67882
409,0.68708
410,0.7045600000000001
411,0.7318399999999999
412,0.73826
413,0.7571
414,0.77853
415,0.78566
416,0.80588
417,0.82135
418,0.8286899999999999
419,0.84898
420,0.85772
421,0.86572
422,0.88665
423,0.889
424,0.89741
425,0.91771
426,0.91491
427,0.9248299999999999
428,0.93965
429,0.9368200000000001
430,0.9461299999999999
431,0.9527700000000001
432,0.94915
433,0.9590799999999999
434,0.9597100000000001
435,0.9555799999999999
436,0.96205
437,0.95042
438,0.9421200000000001
439,0.94789
440,0.93337
441,0.93032
442,0.9333100000000001
443,0.9141
444,0.9055799999999999
445,0.8969
446,0.87631
447,0.86985
448,0.8567600000000001
449,0.8368899999999999
450,0.8290299999999999
451,0.8075
452,0.78797
453,0.7821600000000001
454,0.7571100000000001
455,0.74025
456,0.7327600000000001
457,0.7027399999999999
458,0.68514
459,0.6705800000000001
460,0.6413800000000001
461,0.62613
462,0.60731
463,0.57994
464,0.56508
465,0.53932
466,0.51347
467,0.50251
468,0.47586000000000006
469,0.45483999999999997
470,0.44451999999999997
471,0.40968000000000004
472,0.38800999999999997
473,0.37476
474,0.34678000000000003
475,0.3329
476,0.3168
477,0.28864
478,0.27384000000000003
479,0.25290999999999997
480,0.23023000000000002
481,0.22129000000000001
482,0.1976
483,0.1774
484,0.17198
485,0.14952000000000001
486,0.13982
487,0.13915
488,0.1172
489,0.10652
490,0.097737
491,0.078057
492,0.073863
493,0.064364
494,0.044680000000000004
495,0.032768
496,0.0062099
497,-0.017681
498,-0.021855
499,-0.036431
500,-0.040253
501,-0.034683
502,-0.055623
503,-0.066776
504,-0.071989
505,-0.08856499999999999
506,-0.088372
507,-0.08939
508,-0.1006
509,-0.099346
510,-0.10557000000000001
511,-0.11155999999999999
512,-0.10265
513,-0.10885999999999998
514,-0.11142
515,-0.10142999999999999
516,-0.11144000000000001
517,-0.1081
518,-0.09531
519,-0.099531
520,-0.090545
521,-0.08063300000000001
522,-0.081934
523,-0.069186
524,-0.061375
525,-0.057606
526,-0.039731
527,-0.034032
528,-0.026679
529,-0.0064205
530,-0.0051482
531,0.0049747
532,0.026018
533,0.026860000000000002
534,0.040062
535,0.05577000000000001
536,0.05554
537,0.067521
538,0.076972
539,0.081175
540,0.1027
541,0.11763
542,0.13260999999999998
543,0.15986
544,0.1685
545,0.18195999999999998
546,0.20934
547,0.21520999999999998
548,0.23458
549,0.26097
550,0.27166999999999997
551,0.29891
552,0.32998
553,0.3525
554,0.38677
555,0.40895
556,0.42298
557,0.45001
558,0.46553999999999995
559,0.48727
560,0.52325
561,0.5361
562,0.55607
563,0.58421
564,0.59354
565,0.61784
566,0.64552
567,0.65942
568,0.6866
569,0.70958
570,0.72707
571,0.75969
572,0.78087
573,0.8016300000000001
574,0.83521
575,0.84915
576,0.8700200000000001
577,0.90291
578,0.91314
579,0.9363299999999999
580,0.9644299999999999
581,0.9756100000000001
582,1.0
583,1.0221
584,1.0346
585,1.0616
586,1.0795
587,1.0948
588,1.1241
589,1.1364
590,1.1532
591,1.1839
592,1.1915
593,1.2114
594,1.2396
595,1.2484
596,1.271
597,1.2945
598,1.3056
599,1.3313
600,1.3506
601,1.3641
602,1.3915
603,1.4041
604,1.4185
605,1.4477
606,1.4559
607,1.4736
608,1.5016
609,1.5057
610,1.5219999999999998
611,1.5403
612,1.5418
613,1.5574
614,1.5694
615,1.574
616,1.5951
617,1.6069
618,1.6196
619,1.6485
620,1.6589
621,1.6758
622,1.7065
623,1.7122
624,1.733
625,1.7627
626,1.777
627,1.8093
628,1.8437
629,1.8688
630,1.9096
631,1.9408
632,1.9662
633,2.0037
634,2.0219
635,2.0411
636,2.0725
637,2.0778
638,2.0919
639,2.1126
640,2.1093
641,2.1186
642,2.1289
643,2.1253
644,2.1376
645,2.1449
646,2.1459
647,2.1617
648,2.1630000000000003
649,2.1643
650,2.1795
651,2.173
652,2.1746
653,2.1881
654,2.1766
655,2.1788
656,2.1854
657,2.1747
658,2.1792
659,2.181
660,2.1736
661,2.1817
662,2.1789
663,2.1737
664,2.1830000000000003
665,2.1738
666,2.1712
667,2.1838
668,2.1707
669,2.1698
670,2.1744
671,2.1586
672,2.1590000000000003
673,2.1606
674,2.1495
675,2.1506
676,2.1407
677,2.1266
678,2.1329
679,2.131
680,2.1358
681,2.1507
682,2.1318
683,2.1112
684,2.0933
685,2.0529
686,2.0327
687,2.0208
688,1.996
689,1.9841
690,1.9632
691,1.9323
692,1.9171
693,1.8925
694,1.8718
695,1.8671
696,1.8418
697,1.8221
698,1.8137
699,1.7801
700,1.7623
701,1.7512
702,1.7231
703,1.7096
704,1.6934
705,1.6664
706,1.6544
707,1.633
708,1.6096
709,1.6012
710,1.5762
711,1.5563
712,1.5501
713,1.5201
714,1.5025
715,1.4933
716,1.4638
717,1.4486
718,1.4338
719,1.4057
720,1.3921
721,1.3715
722,1.3454
723,1.3332
724,1.3066
725,1.2818
726,1.2711
727,1.2409
728,1.2218
729,1.2154
730,1.1876
731,1.1740000000000002
732,1.1632
733,1.1366
734,1.1247
735,1.1092
736,1.0852
737,1.074
738,1.0508
739,1.0270000000000001
740,1.0183
741,0.99177
742,0.96788
743,0.9498
744,0.90044
745,0.86098
746,0.8302
747,0.78784
748,0.7654
749,0.7447699999999999
750,0.71308
751,0.69434
752,0.6678
753,0.6393399999999999
754,0.62673
755,0.60136
756,0.58134
757,0.5764199999999999
758,0.55247
759,0.5401199999999999
760,0.53652
761,0.51223
762,0.50138
763,0.4935
764,0.47447
765,0.47076999999999997
766,0.46215
767,0.44626000000000005
768,0.44233999999999996
769,0.42533000000000004
770,0.40851
771,0.40455
772,0.38213
773,0.36703
774,0.36295
775,0.33639
776,0.32279
777,0.31403000000000003
778,0.29023000000000004
779,0.27965
780,0.26431
781,0.2348
782,0.21222
783,0.17687999999999998
784,0.14153
785,0.1264
786,0.10363
787,0.08881
788,0.083512
789,0.051424
790,0.028543000000000002
791,0.016711
792,-0.005215399999999999
793,-0.007985899999999999
794,-0.0093633
795,-0.025001
796,-0.03058
797,-0.042307
798,-0.055259
799,-0.051636
800,-0.059305
801,-0.065928
802,-0.06219500000000001
803,-0.07819
804,-0.085448
805,-0.083212
806,-0.10123
807,-0.10775
808,-0.11269000000000001
809,-0.1319
810,-0.13881
811,-0.14968
812,-0.16765
813,-0.17403
814,-0.19376
815,-0.21936
816,-0.23756
817,-0.27205999999999997
818,-0.29467
819,-0.29793000000000003
820,-0.32058000000000003
821,-0.33745
822,-0.35862
823,-0.39803
824,-0.41602
825,-0.42282
826,-0.43849
827,-0.4609
828,-0.52062
829,-0.60241
830,-0.66479
831,-0.71128
832,-0.72229
833,-0.70627
834,-0.71497
835,-0.72741
836,-0.7389399999999999
837,-0.76422
838,-0.76857
839,-0.76754
840,-0.78117
841,-0.78696
842,-0.7989
843,-0.8135
844,-0.81214
845,-0.8209799999999999
846,-0.8301799999999999
847,-0.82825
848,-0.8428200000000001
849,-0.8485799999999999
850,-0.84278
851,-0.8570700000000001
852,-0.8595299999999999
853,-0.85761
854,-0.8690200000000001
855,-0.8665799999999999
856,-0.86493
857,-0.87021
858,-0.86195
859,-0.86119
860,-0.8613200000000001
861,-0.8477600000000001
862,-0.84716
863,-0.84062
864,-0.8209700000000001
865,-0.82095
866,-0.80958
867,-0.79069
868,-0.78793
869,-0.77256
870,-0.75602
871,-0.7491300000000001
872,-0.72833
873,-0.71253
874,-0.70195
875,-0.6807300000000001
876,-0.6732899999999999
877,-0.66367
878,-0.6390399999999999
879,-0.62957
880,-0.61065
881,-0.58368
882,-0.57857
883,-0.56307
884,-0.5433899999999999
885,-0.5343899999999999
886,-0.51057
887,-0.48927
888,-0.47573999999999994
889,-0.44985
890,-0.43278999999999995
891,-0.41478000000000004
892,-0.38251
893,-0.36593000000000003
894,-0.34429
895,-0.31137
896,-0.30032
897,-0.27710999999999997
898,-0.2476
899,-0.23405
900,-0.20861999999999997
901,-0.18481
902,-0.17172
903,-0.14620999999999998
904,-0.12792
905,-0.11274
906,-0.084424
907,-0.070258
908,-0.053537
909,-0.024518
910,-0.015529
911,0.0042619
912,0.033652
913,0.045025
914,0.068493
915,0.093217
916,0.10557000000000001
917,0.13192
918,0.15435
919,0.17027
920,0.19732
921,0.21076
922,0.22494
923,0.25475
924,0.26936
925,0.29175
926,0.32161
927,0.32447
928,0.33507
929,0.34885
930,0.34938
931,0.36564
932,0.38090999999999997
933,0.38733
934,0.40639000000000003
935,0.41616000000000003
936,0.42458999999999997
937,0.4467
938,0.45253999999999994
939,0.46253
940,0.48478000000000004
941,0.48465
942,0.49672
943,0.5162100000000001
944,0.51818
945,0.5329999999999999
946,0.5474899999999999
947,0.55027
948,0.5660000000000001
949,0.57455
950,0.57829
951,0.595
952,0.59737
953,0.60119
954,0.6169100000000001
955,0.6111
956,0.6134
957,0.6241399999999999
958,0.6137
959,0.61557
960,0.61945
961,0.60875
962,0.6106600000000001
963,0.60756
964,0.59697
965,0.5999800000000001
966,0.59233
967,0.58531
968,0.59233
969,0.58222
970,0.5796100000000001
971,0.58986
972,0.5783
973,0.58054
974,0.58873
975,0.58099
976,0.58675
977,0.5906600000000001
978,0.58457
979,0.59148
980,0.58911
981,0.58338
982,0.5904699999999999
983,0.58173
984,0.5767899999999999
985,0.58433
986,0.5697
987,0.56555
988,0.5685
989,0.55176
990,0.54732
991,0.54302
992,0.52622
993,0.52298
994,0.51389
995,0.49923
996,0.49716000000000005
997,0.4815
998,0.46721999999999997
999,0.46661
1000,0.44808000000000003
1001,0.439
1002,0.44064
1003,0.42116000000000003
1004,0.41468
1005,0.41192
1006,0.39483
1007,0.39111
1008,0.38413
1009,0.36999
1010,0.37013
1011,0.36043000000000003
1012,0.34808
1013,0.34503
1014,0.32156999999999997
1015,0.30224
1016,0.29678000000000004
1017,0.27265
1018,0.26371
1019,0.26079
1020,0.23948000000000003
1021,0.22985999999999998
1022,0.21939
1023,0.19938
1024,0.19266
1025,0.17879
1026,0.16355999999999998
1027,0.16458
1028,0.153
1029,0.14064000000000002
1030,0.13255
1031,0.098385
1032,0.07471599999999999
1033,0.064735
1034,0.037527
1035,0.016786000000000002
1036,-0.01116
1037,-0.05169
1038,-0.065702
1039,-0.069034
1040,-0.080228
1041,-0.10614000000000001
1042,-0.18247
1043,-0.28052
1044,-0.3531
1045,-0.40266
1046,-0.40421
1047,-0.37751999999999997
1048,-0.38054
1049,-0.38766
1050,-0.39705999999999997
1051,-0.41458999999999996
1052,-0.40855
1053,-0.40128
1054,-0.40781
1055,-0.40776
1056,-0.4176
1057,-0.42591
1058,-0.41803999999999997
1059,-0.42553
1060,-0.43113
1061,-0.42572
1062,-0.43981000000000003
1063,-0.44001
1064,-0.42881
1065,-0.41863
1066,-0.41534
1067,-0.44346
1068,-0.47376999999999997
1069,-0.45308999999999994
1070,-0.39285
1071,-0.34676
1072,-0.38211999999999996
1073,-0.49021000000000003
1074,-0.53012
1075,-0.41207
1076,-0.23346999999999998
1077,-0.18737
1078,-0.38053000000000003
1079,-0.63136
1080,-0.59437
1081,-0.20773000000000003
1082,0.16033
1083,0.037479000000000005
1084,-0.59673
1085,-1.0723
1086,-0.6410899999999999
1087,0.5887399999999999
1088,1.4101
1089,0.30044
1090,-3.2362
1091,-7.9967
