[<text>
<title>morgan crucible pretax profit rises 6.1 mln stg</title>
<dateline>    london, april 13 - </dateline>year to december 28, 1986
    shr 20.1p vs 17.6p
    div 5.0p vs 4.6p making 9.2p vs 8.5p
    turnover 242.1 mln stg vs 211.5 mln
    pretax profit 24.8 mln vs 18.7 mln
    tax 6.7 mln vs 5.8 mln
    operating profit 28.3 mln vs 21.3 mln
    investment income 1.0 mln vs 0.7 mln
    net finance charges 4.5 mln vs 3.3 mln
    company full name is morgan crucible co plc &lt;mgcr.l&gt;
    minorities and provisions for preference dividends 0.7 mln
vs 1.2 mln
    extraordinary debit - 0.9 mln vs 1.3 mln credit
    operating profit includes -
    carbon 8.3 mln vs 7.0 mln
    technical ceramics 7.0 mln vs 5.6 mln
    thermal ceramics 7.6 mln vs 4.6 mln
    speciality chemicals 4.4 mln vs 4.0 mln
    electronics 1.0 mln vs 0.1 mln
reuter^m
</text>]