time,value
0,-0.51135
1,-0.51135
2,-0.51135
3,-0.51135
4,-0.51135
5,-0.51135
6,-0.51135
7,-0.51135
8,-0.51135
9,-0.51135
10,-0.51135
11,-0.51135
12,-0.51135
13,-0.51135
14,-0.51135
15,-0.51135
16,-0.51135
17,-0.51135
18,-0.51135
19,-0.51135
20,-0.51135
21,-0.51135
22,-0.51135
23,-0.51135
24,-0.51135
25,-0.51135
26,-0.51135
27,-0.51135
28,-0.51135
29,-0.51135
30,-0.51135
31,-0.51135
32,-0.51135
33,-0.51135
34,-0.51135
35,-0.51135
36,-0.51135
37,-0.51135
38,-0.51135
39,-0.51135
40,-0.51135
41,-0.51135
42,-0.51135
43,-0.51135
44,-0.51135
45,-0.51135
46,-0.51135
47,-0.51135
48,-0.51135
49,-0.51135
50,-0.51135
51,-0.51135
52,-0.51135
53,-0.51135
54,-0.51135
55,-0.51135
56,-0.51135
57,-0.51135
58,-0.51135
59,-0.51135
60,-0.51135
61,-0.51135
62,-0.51135
63,-0.51135
64,-0.51135
65,-0.51135
66,-0.51135
67,-0.51135
68,-0.51135
69,-0.51135
70,-0.51135
71,-0.51135
72,-0.51135
73,0.11399000000000001
74,3.0844
75,2.459
76,1.521
77,1.052
78,1.052
79,0.8956700000000001
80,2.1464
81,1.99
82,1.8337
83,2.3027
84,2.459
85,2.3027
86,2.3027
87,1.99
88,2.1464
89,1.6773
90,1.6773
91,1.8337
92,1.3647
93,1.052
94,0.583
95,-0.51135
