time,value
0,-2.2218
1,-2.2218
2,-2.2239
3,-2.2239
4,-2.2239
5,-2.2323
6,-2.2386
7,-2.2386
8,-2.2386
9,-2.2384
10,-2.2381
11,-2.2398
12,-2.2393
13,-2.2386
14,-2.2377
15,-2.2388
16,-2.2424
17,-2.2504
18,-2.2498
19,-2.2484
20,-2.2469
21,-2.2453
22,-2.2436
23,-2.2417
24,-2.2417
25,-2.24
26,-2.2378
27,-2.2354
28,-2.2401
29,-2.2474
30,-2.2447
31,-2.2419
32,-2.2416
33,-2.2386
34,-2.2378
35,-2.2362
36,-2.2338
37,-2.2329
38,-2.2323
39,-2.2316
40,-2.2318
41,-2.2299
42,-2.227
43,-2.2279
44,-2.2268
45,-2.2245
46,-2.23
47,-2.2361
48,-2.2318
49,-2.2274
50,-2.2229
51,-2.2182
52,-2.2135
53,-2.2099
54,-2.2051
55,-2.2001
56,-2.1951
57,-2.1916
58,-2.1864
59,-2.1811
60,-2.1771
61,-2.1716
62,-2.1661
63,-2.1606
64,-2.1549
65,-2.1492
66,-2.145
67,-2.1421
68,-2.1391
69,-2.1435
70,-2.1390000000000002
71,-2.1329
72,-2.1268
73,-2.1206
74,-2.1159
75,-2.1096
76,-2.1047
77,-2.0983
78,-2.0919
79,-2.0867
80,-2.0851
81,-2.0835
82,-2.0769
83,-2.0703
84,-2.0637
85,-2.062
86,-2.0604
87,-2.0537
88,-2.0486
89,-2.0419
90,-2.0351
91,-2.0283
92,-2.0214
93,-2.0221
94,-2.025
95,-2.0216
96,-2.0146
97,-2.0087
98,-2.0016
99,-1.9945
100,-1.9874
101,-1.9803
102,-1.9731
103,-1.9678
104,-1.9606
105,-1.9533
106,-1.9461
107,-1.9425
108,-1.9406
109,-1.9352
110,-1.9315
111,-1.9307
112,-1.9252
113,-1.9199
114,-1.9135
115,-1.9061
116,-1.9024
117,-1.9015
118,-1.8996
119,-1.8922
120,-1.8847
121,-1.8772
122,-1.8697
123,-1.8621
124,-1.8565
125,-1.8489
126,-1.8413
127,-1.8337
128,-1.827
129,-1.8194
130,-1.8117
131,-1.806
132,-1.7983
133,-1.7907
134,-1.7857
135,-1.787
136,-1.7848
137,-1.777
138,-1.7712
139,-1.7635
140,-1.7557
141,-1.7479
142,-1.7409
143,-1.733
144,-1.7252
145,-1.7194
146,-1.7115
147,-1.7037
148,-1.6958
149,-1.6880000000000002
150,-1.6801
151,-1.6722
152,-1.6669999999999998
153,-1.6651
154,-1.6631
155,-1.6552
156,-1.6487
157,-1.6414
158,-1.6401
159,-1.6388
160,-1.6315
161,-1.6235
162,-1.6215
163,-1.6169
164,-1.6083
165,-1.6003
166,-1.5944
167,-1.5864
168,-1.5784
169,-1.5771
170,-1.5712
171,-1.5633
172,-1.5553
173,-1.5493
174,-1.5414
175,-1.5334
176,-1.5248
177,-1.5174
178,-1.5094
179,-1.5014
180,-1.4954
181,-1.4874
182,-1.4793
183,-1.4765
184,-1.4768
185,-1.4694
186,-1.4613
187,-1.4553
188,-1.4472
189,-1.4391
190,-1.4311
191,-1.423
192,-1.4149
193,-1.4074
194,-1.4013
195,-1.3932
196,-1.3851
197,-1.3852
198,-1.3847
199,-1.3766
200,-1.3684
201,-1.3623
202,-1.3547
203,-1.3466
204,-1.3384
205,-1.3364
206,-1.3344
207,-1.3262
208,-1.3262
209,-1.3217
210,-1.3135
211,-1.3085
212,-1.306
213,-1.2999
214,-1.2917
215,-1.2856
216,-1.2775
217,-1.2714
218,-1.2698
219,-1.2687
220,-1.2605
221,-1.2524
222,-1.2463
223,-1.2381
224,-1.2299
225,-1.2218
226,-1.2136
227,-1.2054
228,-1.1972
229,-1.1938
230,-1.1879
231,-1.1798
232,-1.1711
233,-1.163
234,-1.1589
235,-1.1564
236,-1.1498
237,-1.1412
238,-1.1367
239,-1.1337
240,-1.1271
241,-1.123
242,-1.1226
243,-1.1201
244,-1.1182
245,-1.1111
246,-1.1029
247,-1.0943
248,-1.0862
249,-1.078
250,-1.0719
251,-1.0684
252,-1.0624
253,-1.0543
254,-1.0462
255,-1.038
256,-1.0299
257,-1.0238
258,-1.0151
259,-1.0070000000000001
260,-0.99884
261,-0.99069
262,-0.9825299999999999
263,-0.9743799999999999
264,-0.96826
265,-0.9648100000000001
266,-0.96135
267,-0.9527200000000001
268,-0.9441
269,-0.93595
270,-0.9304399999999999
271,-0.92694
272,-0.92035
273,-0.9122100000000001
274,-0.9040799999999999
275,-0.89545
276,-0.88731
277,-0.8791700000000001
278,-0.87771
279,-0.8716799999999999
280,-0.86355
281,-0.85541
282,-0.8467899999999999
283,-0.83865
284,-0.83052
285,-0.8244100000000001
286,-0.8162699999999999
287,-0.8096800000000001
288,-0.80569
289,-0.79861
290,-0.78998
291,-0.78595
292,-0.7824
293,-0.7758
294,-0.7692100000000001
295,-0.76512
296,-0.76003
297,-0.75192
298,-0.7433
299,-0.73519
300,-0.72911
301,-0.721
302,-0.71591
303,-0.7118
304,-0.7052
305,-0.6971
306,-0.6890000000000001
307,-0.68292
308,-0.67429
309,-0.66618
310,-0.65959
311,-0.6575
312,-0.65037
313,-0.64175
314,-0.63567
315,-0.62757
316,-0.62344
317,-0.61779
318,-0.60917
319,-0.60553
320,-0.60351
321,-0.59745
322,-0.58936
323,-0.58127
324,-0.57318
325,-0.56806
326,-0.5655100000000001
327,-0.55688
328,-0.55082
329,-0.54273
330,-0.53666
331,-0.53666
332,-0.52803
333,-0.5214300000000001
334,-0.51726
335,-0.5141600000000001
336,-0.50608
337,-0.49745
338,-0.48936999999999997
339,-0.48423999999999995
340,-0.48005
341,-0.47343999999999997
342,-0.46684
343,-0.46115
344,-0.45892
345,-0.45086000000000004
346,-0.44278999999999996
347,-0.43417
348,-0.4261
349,-0.42005
350,-0.41197
351,-0.40774
352,-0.40405
353,-0.39598
354,-0.38736
355,-0.3793
356,-0.37471
357,-0.37044
358,-0.36528
359,-0.35723
360,-0.34917
361,-0.34110999999999997
362,-0.33305
363,-0.327
364,-0.31838
365,-0.31031
366,-0.30225
367,-0.29417
368,-0.2861
369,-0.27803
370,-0.27344
371,-0.26921
372,-0.26205
373,-0.25398000000000004
374,-0.24536
375,-0.23729
376,-0.23305
377,-0.23192
378,-0.2233
379,-0.21524000000000001
380,-0.20718000000000003
381,-0.19855
382,-0.19049000000000002
383,-0.18388
384,-0.18019000000000002
385,-0.17446
386,-0.16641
387,-0.15778
388,-0.14973
389,-0.14602
390,-0.13971
391,-0.13368
392,-0.12505
393,-0.11699999999999999
394,-0.11095999999999999
395,-0.10667
396,-0.10293
397,-0.094885
398,-0.08885
399,-0.080228
400,-0.073619
401,-0.069299
402,-0.062109000000000004
403,-0.053487
404,-0.051736000000000004
405,-0.047964
406,-0.041352999999999994
407,-0.033324
408,-0.024705
409,-0.016673
410,-0.0086404
411,-0.00060443
412,0.0031585999999999997
413,0.0055206000000000005
414,0.013546
415,0.021574
416,0.029605000000000003
417,0.037636
418,0.046256
419,0.052280999999999994
420,0.060316999999999996
421,0.068354
422,0.076394
423,0.085015
424,0.087344
425,0.091704
426,0.09348200000000001
427,0.097277
428,0.10529000000000001
429,0.11391
430,0.12193
431,0.12772999999999998
432,0.13354000000000002
433,0.14015
434,0.14817
435,0.15679
436,0.16399999999999998
437,0.16842000000000001
438,0.17503
439,0.18365
440,0.18966
441,0.19767
442,0.20349
443,0.20793000000000003
444,0.21593
445,0.22394
446,0.23194
447,0.23856
448,0.24656999999999998
449,0.25458000000000003
450,0.26259
451,0.2698
452,0.27423000000000003
453,0.28084000000000003
454,0.28685
455,0.29486
456,0.30346999999999996
457,0.31149
458,0.3195
459,0.32331
460,0.32975
461,0.33575
462,0.34376
463,0.35176999999999997
464,0.35978000000000004
465,0.36779
466,0.3758
467,0.38382
468,0.38983
469,0.39786
470,0.40588
471,0.4087
472,0.40835
473,0.41379
474,0.41923
475,0.4195
476,0.4172
477,0.41694
478,0.41468
479,0.42218
480,0.4251
481,0.42289
482,0.42123999999999995
483,0.41906000000000004
484,0.41691000000000006
485,0.41476999999999997
486,0.41266
487,0.40606
488,0.39946
489,0.39534
490,0.39025
491,0.38214000000000004
492,0.37403000000000003
493,0.36541
494,0.35731
495,0.3492
496,0.34358
497,0.34203
498,0.3334
499,0.32478
500,0.31667
501,0.30955
502,0.30546999999999996
503,0.29886999999999997
504,0.29279
505,0.28415999999999997
506,0.27605
507,0.27097
508,0.26893
509,0.2603
510,0.25168
511,0.24559
512,0.23747
513,0.23342
514,0.22988000000000003
515,0.22125999999999998
516,0.2172
517,0.21516
518,0.2106
519,0.20148
520,0.19488
521,0.19235
522,0.1873
523,0.1812
524,0.17917
525,0.17712999999999998
526,0.16899999999999998
527,0.16088
528,0.15275
529,0.14463
530,0.136
531,0.12788
532,0.12179000000000001
533,0.11367000000000001
534,0.10555
535,0.098446
536,0.09440499999999999
537,0.08781
538,0.079185
539,0.077691
540,0.075722
541,0.071741
542,0.067781
543,0.059635
544,0.051009
545,0.042865
546,0.037833
547,0.033892
548,0.027306
549,0.01821
550,0.014297
551,0.009288600000000001
552,0.0011276
553,-0.004991399999999999
554,-0.013615
555,-0.021772
556,-0.029929
557,-0.034475
558,-0.038372
559,-0.043374
560,-0.049498
561,-0.057659
562,-0.06628300000000001
563,-0.074446
564,-0.082605
565,-0.088073
566,-0.09194400000000001
567,-0.098069
568,-0.10669000000000001
569,-0.11485999999999999
570,-0.12347999999999999
571,-0.12734
572,-0.13232
573,-0.1405
574,-0.14662999999999998
575,-0.15525
576,-0.16022999999999998
577,-0.16405999999999998
578,-0.17107
579,-0.17969000000000002
580,-0.18348
581,-0.18639
582,-0.19458
583,-0.20277
584,-0.21139000000000002
585,-0.21635
586,-0.2201
587,-0.22914
588,-0.23571
589,-0.23943000000000003
590,-0.24436
591,-0.25297
592,-0.2583
593,-0.25992
594,-0.26813000000000003
595,-0.27469
596,-0.2829
597,-0.29152
598,-0.29517
599,-0.30006
600,-0.30867
601,-0.31395
602,-0.31511
603,-0.3241
604,-0.33065
605,-0.33421
606,-0.33907
607,-0.34731
608,-0.35554
609,-0.36209
610,-0.37032
611,-0.37856
612,-0.38342
613,-0.38489
614,-0.38839
615,-0.3898
616,-0.39428
617,-0.40081
618,-0.40185
619,-0.4032
620,-0.40452
621,-0.40581999999999996
622,-0.40708
623,-0.4077
624,-0.4018
625,-0.39826999999999996
626,-0.39739
627,-0.39147
628,-0.38318
629,-0.37519
630,-0.36926
631,-0.37038000000000004
632,-0.36471
633,-0.35641
634,-0.35254
635,-0.35046
636,-0.34217
637,-0.34009
638,-0.33802
639,-0.33387
640,-0.32556999999999997
641,-0.31727
642,-0.30896999999999997
643,-0.30067
644,-0.29444000000000004
645,-0.28586999999999996
646,-0.27757
647,-0.26927
648,-0.26097
649,-0.25293000000000004
650,-0.24461999999999998
651,-0.2384
652,-0.23009000000000002
653,-0.22179000000000001
654,-0.21348000000000003
655,-0.20517
656,-0.20102
657,-0.19895
658,-0.19272
659,-0.19064
660,-0.18855999999999998
661,-0.18
662,-0.17169
663,-0.16339
664,-0.15508
665,-0.14885
666,-0.14054
667,-0.13223
668,-0.12392
669,-0.11560999999999999
670,-0.10755
671,-0.10388
672,-0.10252
673,-0.096751
674,-0.088435
675,-0.080117
676,-0.071799
677,-0.063483
678,-0.055165
679,-0.046847
680,-0.042457999999999996
681,-0.03945
682,-0.034818
683,-0.026504000000000003
684,-0.01819
685,-0.009876399999999999
686,-0.0015604000000000002
687,0.0046756
688,0.013226
689,0.02154
690,0.029856
691,0.038172000000000005
692,0.046488
693,0.054804
694,0.061042
695,0.069358
696,0.076061
697,0.079087
698,0.085561
699,0.093875
700,0.10219
701,0.10865999999999999
702,0.11697
703,0.12529
704,0.13041
705,0.13323
706,0.14154
707,0.14985
708,0.15608
709,0.16439
710,0.1727
711,0.18126
712,0.18957000000000002
713,0.19787000000000002
714,0.20619
715,0.21241999999999997
716,0.21523
717,0.21599000000000002
718,0.22454000000000002
719,0.23285
720,0.24115999999999999
721,0.24971999999999997
722,0.25595
723,0.26426
724,0.27257
725,0.28112
726,0.28422
727,0.29096
728,0.29925999999999997
729,0.30575
730,0.31406
731,0.31690999999999997
732,0.32005
733,0.32835
734,0.33665
735,0.34495
736,0.35117
737,0.35948
738,0.36778
739,0.37608
740,0.38464
741,0.39295
742,0.40125
743,0.40747
744,0.41578000000000004
745,0.42408
746,0.43238000000000004
747,0.44068999999999997
748,0.44898999999999994
749,0.45729
750,0.46352
751,0.47183
752,0.48013
753,0.48453999999999997
754,0.48765
755,0.49233000000000005
756,0.50063
757,0.5068600000000001
758,0.51543
759,0.5201100000000001
760,0.5232600000000001
761,0.53183
762,0.5401199999999999
763,0.54869
764,0.55492
765,0.56321
766,0.5715100000000001
767,0.57468
768,0.57758
769,0.58587
770,0.59445
771,0.60067
772,0.6089600000000001
773,0.61726
774,0.62555
775,0.63385
776,0.6421399999999999
777,0.65044
778,0.65666
779,0.66496
780,0.67298
781,0.68128
782,0.68958
783,0.6978800000000001
784,0.70617
785,0.71032
786,0.7124
787,0.71862
788,0.72277
789,0.72692
790,0.73522
791,0.74352
792,0.74975
793,0.75805
794,0.76635
795,0.7749199999999999
796,0.78322
797,0.79152
798,0.79982
799,0.80605
800,0.81435
801,0.82265
802,0.83096
803,0.83926
804,0.8475600000000001
805,0.85613
806,0.8569100000000001
807,0.8634
808,0.87197
809,0.8805299999999999
810,0.8888299999999999
811,0.8971299999999999
812,0.9054399999999999
813,0.91166
814,0.9202299999999999
815,0.92853
816,0.9368299999999999
817,0.9451299999999999
818,0.95344
819,0.9617399999999999
820,0.96796
821,0.9762700000000001
822,0.9845700000000001
823,0.99106
824,0.99418
825,0.9988600000000001
826,1.0072
827,1.0137
828,1.022
829,1.0266
830,1.0287
831,1.0349
832,1.0432
833,1.0515
834,1.058
835,1.0645
836,1.0669
837,1.0734
838,1.0817
839,1.09
840,1.0938
841,1.0956
842,1.0995
843,1.1078
844,1.1161
845,1.1244
846,1.1307
847,1.1325
848,1.1340000000000001
849,1.1423
850,1.1506
851,1.159
852,1.1673
853,1.1756
854,1.1839
855,1.1901
856,1.1984
857,1.2067
858,1.215
859,1.2233
860,1.2282
861,1.2313
862,1.2376
863,1.2459
864,1.2542
865,1.2627
866,1.271
867,1.2794
868,1.2877
869,1.2939
870,1.3022
871,1.3105
872,1.3188
873,1.3269
874,1.3352
875,1.3435
876,1.3469
877,1.3482
878,1.3563
879,1.3643
880,1.3727
881,1.3784
882,1.3775
883,1.3765
884,1.3758
885,1.3749
886,1.374
887,1.3732
888,1.3723
889,1.3715
890,1.3707
891,1.3701
892,1.3693
893,1.3685
894,1.3621
895,1.3533
896,1.3505
897,1.3459999999999999
898,1.3397
899,1.3312
900,1.3229
901,1.3182
902,1.3155
903,1.307
904,1.2987
905,1.2924
906,1.2841
907,1.2758
908,1.2674
909,1.2589
910,1.2507
911,1.2422
912,1.236
913,1.2276
914,1.2193
915,1.2109999999999999
916,1.2026
917,1.1943
918,1.186
919,1.1797
920,1.1714
921,1.1668
922,1.1640000000000001
923,1.1576
924,1.1493
925,1.1408
926,1.1345
927,1.1298
928,1.1272
929,1.1187
930,1.1104
931,1.102
932,1.0937
933,1.0874
934,1.0789
935,1.0706
936,1.0623
937,1.0539
938,1.0456
939,1.0372
940,1.031
941,1.0282
942,1.0257
943,1.0173
944,1.0090000000000001
945,1.0006
946,0.9922799999999999
947,0.9860200000000001
948,0.9776799999999999
949,0.96934
950,0.96099
951,0.95249
952,0.94414
953,0.9358
954,0.9295399999999999
955,0.9212
956,0.91286
957,0.9045200000000001
958,0.8960100000000001
959,0.89376
960,0.8875
961,0.88125
962,0.8729
963,0.86456
964,0.85798
965,0.8557299999999999
966,0.8514
967,0.84305
968,0.8368
969,0.82845
970,0.82637
971,0.82204
972,0.8136899999999999
973,0.80535
974,0.797
975,0.79075
976,0.7824
977,0.7739
978,0.76556
979,0.75721
980,0.74887
981,0.74438
982,0.74182
983,0.73525
984,0.7269
985,0.7185600000000001
986,0.71006
987,0.7017100000000001
988,0.69321
989,0.69276
990,0.68605
991,0.6777
992,0.6693600000000001
993,0.66086
994,0.65252
995,0.64417
996,0.64179
997,0.6391399999999999
998,0.63065
999,0.6223
1000,0.61395
1001,0.6056
1002,0.59725
1003,0.59099
1004,0.5826399999999999
1005,0.57429
1006,0.56594
1007,0.5575899999999999
1008,0.54924
1009,0.54089
1010,0.53686
1011,0.53477
1012,0.52851
1013,0.5201600000000001
1014,0.51181
1015,0.50764
1016,0.50555
1017,0.50332
1018,0.49483
1019,0.49037
1020,0.48773999999999995
1021,0.48134
1022,0.47298999999999997
1023,0.4645
1024,0.45824
1025,0.45563000000000003
1026,0.45108000000000004
1027,0.44272
1028,0.43437
1029,0.42601999999999995
1030,0.41766000000000003
1031,0.4114
1032,0.40305
1033,0.39457
1034,0.38621
1035,0.37786
1036,0.36951
1037,0.36115
1038,0.35489
1039,0.34654
1040,0.33818000000000004
1041,0.32983
1042,0.32148000000000004
1043,0.31312
1044,0.30477
1045,0.29851
1046,0.29016
1047,0.28756
1048,0.28302
1049,0.27466999999999997
1050,0.26631
1051,0.25795999999999997
1052,0.25169
1053,0.24334
1054,0.23485999999999999
1055,0.22651
1056,0.21816
1057,0.2098
1058,0.20340999999999998
1059,0.20098
1060,0.19855
1061,0.19019
1062,0.18184
1063,0.17348
1064,0.16512000000000002
1065,0.15677
1066,0.14841
1067,0.14203
1068,0.13367
1069,0.12532000000000001
1070,0.11696
1071,0.10860999999999998
1072,0.10223
1073,0.09970599999999999
1074,0.09740900000000001
1075,0.089051
1076,0.080693
1077,0.072335
1078,0.063976
1079,0.055514999999999995
1080,0.047157
1081,0.040889999999999996
1082,0.03462
1083,0.032132
1084,0.02976
1085,0.021398
1086,0.012948
1087,0.0045856000000000004
1088,0.00040557
1089,-0.0020353999999999997
1090,-0.0043744
1091,-0.012816
1092,-0.021178
1093,-0.029539999999999997
1094,-0.033951999999999996
1095,-0.036259
1096,-0.042669
1097,-0.051032999999999995
1098,-0.051289
1099,-0.055644000000000006
1100,-0.064065
1101,-0.06840399999999999
1102,-0.06854400000000001
1103,-0.070799
1104,-0.070937
1105,-0.07724299999999999
1106,-0.085611
1107,-0.089824
1108,-0.089824
1109,-0.089877
1110,-0.089963
1111,-0.090023
1112,-0.09005
1113,-0.090055
1114,-0.08797100000000001
1115,-0.083774
1116,-0.077498
1117,-0.06913
1118,-0.060752999999999995
1119,-0.054469000000000004
1120,-0.052324
1121,-0.048105
1122,-0.039736
1123,-0.033460000000000004
1124,-0.025092
1125,-0.016705
1126,-0.0083374
1127,-0.004109399999999999
1128,-0.0019084
1129,0.006491599999999999
1130,0.012766
1131,0.021134
1132,0.029533999999999998
1133,0.037902
1134,0.046268000000000004
1135,0.048505
1136,0.050722
1137,0.056996000000000005
1138,0.065363
1139,0.073729
1140,0.08214099999999999
1141,0.090507
1142,0.096873
1143,0.09917000000000001
1144,0.10340999999999999
1145,0.11177000000000001
1146,0.12014000000000001
1147,0.1285
1148,0.13692000000000001
1149,0.14529
1150,0.15365
1151,0.15993
1152,0.16422
1153,0.16655999999999999
1154,0.1729
1155,0.18127000000000001
1156,0.18963
1157,0.19799
1158,0.20427
1159,0.21263
1160,0.22105999999999998
1161,0.22943000000000002
1162,0.23779
1163,0.24615
1164,0.25451999999999997
1165,0.26079
1166,0.26909
1167,0.27745
1168,0.28581999999999996
1169,0.29418
1170,0.29628000000000004
1171,0.30039
1172,0.30661
1173,0.31490999999999997
1174,0.31689
1175,0.31892
1176,0.32724000000000003
1177,0.32933
1178,0.33351
1179,0.33978
1180,0.34815
1181,0.35652
1182,0.36488000000000004
1183,0.37325
1184,0.38156
1185,0.38993
1186,0.3962
1187,0.40457
1188,0.41293
1189,0.4213
1190,0.42966000000000004
1191,0.43803000000000003
1192,0.4464
1193,0.45266999999999996
1194,0.46103999999999995
1195,0.4694
1196,0.47777
1197,0.48613
1198,0.49445
1199,0.49636
1200,0.49837
1201,0.50674
1202,0.5151100000000001
1203,0.5234800000000001
1204,0.53184
1205,0.5402100000000001
1206,0.5485800000000001
1207,0.55481
1208,0.56318
1209,0.57155
1210,0.57991
1211,0.58828
1212,0.59665
1213,0.60502
1214,0.61129
1215,0.61966
1216,0.62802
1217,0.63639
1218,0.64476
1219,0.64685
1220,0.65103
1221,0.6573100000000001
1222,0.66567
1223,0.66777
1224,0.67195
1225,0.68032
1226,0.6886899999999999
1227,0.69705
1228,0.70333
1229,0.7116899999999999
1230,0.72006
1231,0.72839
1232,0.73042
1233,0.7346
1234,0.74297
1235,0.74925
1236,0.75761
1237,0.76598
1238,0.76807
1239,0.77236
1240,0.78072
1241,0.78909
1242,0.7953600000000001
1243,0.80373
1244,0.8121
1245,0.82047
1246,0.82883
1247,0.8372
1248,0.84557
1249,0.8518399999999999
1250,0.86021
1251,0.8685799999999999
1252,0.8769399999999999
1253,0.88531
1254,0.8936799999999999
1255,0.90205
1256,0.9083600000000001
1257,0.9167200000000001
1258,0.92509
1259,0.9334600000000001
1260,0.9418200000000001
1261,0.95019
1262,0.9585600000000001
1263,0.96693
1264,0.9732
1265,0.98157
1266,0.9899
1267,0.9983
1268,1.0067
1269,1.015
1270,1.0234
1271,1.0297
1272,1.038
1273,1.0464
1274,1.0507
1275,1.053
1276,1.0592
1277,1.0676
1278,1.0739
1279,1.0822
1280,1.0906
1281,1.099
1282,1.1073
1283,1.1136
1284,1.1155
1285,1.1175
1286,1.1259
1287,1.1343
1288,1.1426
1289,1.151
1290,1.1593
1291,1.1677
1292,1.1740000000000002
1293,1.1823
1294,1.1907
1295,1.1991
1296,1.2075
1297,1.2158
1298,1.2201
1299,1.2202
1300,1.2285
1301,1.2369
1302,1.2453
1303,1.2536
1304,1.262
1305,1.2662
1306,1.2681
1307,1.2744
1308,1.2828
1309,1.2912
1310,1.2995
1311,1.3079
1312,1.3163
1313,1.3184
1314,1.3206
1315,1.3207
1316,1.3207
1317,1.3291
1318,1.3312
1319,1.3333
1320,1.3396
1321,1.3479
1322,1.3563
1323,1.3647
1324,1.3730000000000002
1325,1.3813
1326,1.3897
1327,1.396
1328,1.4044
1329,1.4127
1330,1.4211
1331,1.4295
1332,1.4378
1333,1.4462
1334,1.4525
1335,1.4608
1336,1.4692
1337,1.4776
1338,1.4859
1339,1.4943
1340,1.5027
1341,1.5090000000000001
1342,1.5173
1343,1.5216
1344,1.5239
1345,1.5323
1346,1.5366
1347,1.5389
1348,1.5389
1349,1.5474
1350,1.5537
1351,1.5561
1352,1.5603
1353,1.5687
1354,1.571
1355,1.5712
1356,1.5715
1357,1.5718
1358,1.5721
1359,1.5724
1360,1.5728
1361,1.5732
1362,1.5734
1363,1.5738
1364,1.5742
1365,1.5747
1366,1.5751
1367,1.5668
1368,1.5608
1369,1.5612
1370,1.5596
1371,1.56
1372,1.5561
1373,1.5478
1374,1.5394
1375,1.5312
1376,1.5249
1377,1.5166
1378,1.5127
1379,1.5111
1380,1.505
1381,1.4969
1382,1.4954
1383,1.4915
1384,1.4832
1385,1.475
1386,1.4666
1387,1.4629
1388,1.4634
1389,1.4552
1390,1.4489
1391,1.4406
1392,1.4322
1393,1.4239
1394,1.4156
1395,1.4072
1396,1.3989
1397,1.3926
1398,1.3843
1399,1.3759
1400,1.3676
1401,1.3592
1402,1.3509
1403,1.3425
1404,1.3363
1405,1.3279
1406,1.3196
1407,1.3113
1408,1.3029
1409,1.2965
1410,1.2925
1411,1.2883
1412,1.28
1413,1.2716
1414,1.2654
1415,1.2633
1416,1.2591
1417,1.2508
1418,1.2445
1419,1.2362
1420,1.2278
1421,1.2195
1422,1.2113
1423,1.203
1424,1.1945
1425,1.1882
1426,1.1799
1427,1.1715
1428,1.1632
1429,1.1548
1430,1.1463
1431,1.1415
1432,1.1391
1433,1.1307
1434,1.1224
1435,1.1141
1436,1.1057
1437,1.0974
1438,1.089
1439,1.0828
1440,1.0744
1441,1.0661
1442,1.0578
1443,1.0492
1444,1.0411
1445,1.0327
1446,1.0265
1447,1.0181
1448,1.0098
1449,1.0014
1450,0.99744
1451,0.9955299999999999
1452,0.99136
1453,0.98319
1454,0.97711
1455,0.9689399999999999
1456,0.96095
1457,0.9588700000000001
1458,0.95262
1459,0.94845
1460,0.9463600000000001
1461,0.94011
1462,0.9317700000000001
1463,0.9234399999999999
1464,0.9151
1465,0.90676
1466,0.8984200000000001
1467,0.8900899999999999
1468,0.8838299999999999
1469,0.8755
1470,0.86716
1471,0.8609100000000001
1472,0.85882
1473,0.85257
1474,0.84841
1475,0.84841
1476,0.84215
1477,0.8338200000000001
1478,0.8254799999999999
1479,0.81715
1480,0.80881
1481,0.80047
1482,0.79422
1483,0.78589
1484,0.77755
1485,0.76922
1486,0.76088
1487,0.7588
1488,0.75653
1489,0.7500899999999999
1490,0.74574
1491,0.73949
1492,0.73115
1493,0.7269800000000001
1494,0.723
1495,0.71505
1496,0.71505
1497,0.71296
1498,0.70463
1499,0.6963
1500,0.68816
1501,0.68191
1502,0.67983
1503,0.67983
1504,0.6714899999999999
1505,0.6631600000000001
1506,0.66108
1507,0.65691
1508,0.6489699999999999
1509,0.64064
1510,0.6344
1511,0.62607
1512,0.61754
1513,0.61317
1514,0.6110899999999999
1515,0.60693
1516,0.59859
1517,0.59443
1518,0.59235
1519,0.58402
1520,0.57568
1521,0.5673600000000001
1522,0.55903
1523,0.5507
1524,0.54445
1525,0.53592
1526,0.52779
1527,0.51946
1528,0.51113
1529,0.5028100000000001
1530,0.49448000000000003
1531,0.48823
1532,0.48199
1533,0.4799
1534,0.47366
1535,0.46533
1536,0.46116999999999997
1537,0.45908999999999994
1538,0.45492
1539,0.44659
1540,0.43827
1541,0.42994
1542,0.42141000000000006
1543,0.41308
1544,0.40475
1545,0.39851
1546,0.39393
1547,0.39103000000000004
1548,0.38458000000000003
1549,0.37625
1550,0.36791999999999997
1551,0.35959
1552,0.35334
1553,0.34502
1554,0.33648
1555,0.32816
1556,0.31983
1557,0.3113
1558,0.30921
1559,0.30713
1560,0.30088000000000004
1561,0.29235
1562,0.28381999999999996
1563,0.27926
1564,0.27489
1565,0.26636
1566,0.26011999999999996
1567,0.25823
1568,0.25655
1569,0.25051
1570,0.24218
1571,0.23364000000000001
1572,0.22928
1573,0.2272
1574,0.22095
1575,0.21281999999999998
1576,0.20886999999999997
1577,0.2072
1578,0.19909000000000002
1579,0.19701
1580,0.19493
1581,0.1866
1582,0.17828
1583,0.16995
1584,0.16184
1585,0.15352000000000002
1586,0.1475
1587,0.14816
1588,0.14883
1589,0.14698
1590,0.14306
1591,0.13521
1592,0.12921
1593,0.12737
1594,0.12345
1595,0.11746
1596,0.11538
1597,0.10939000000000002
1598,0.10132000000000001
1599,0.10232999999999999
1600,0.10127
1601,0.10206
1602,0.10078
1603,0.09275599999999999
1604,0.08943
1605,0.088474
1606,0.08018099999999999
1607,0.073963
1608,0.07424800000000001
1609,0.07424800000000001
1610,0.075112
1611,0.075693
1612,0.075988
1613,0.077179
1614,0.08015800000000001
1615,0.086367
1616,0.09349199999999999
1617,0.09680599999999999
1618,0.10332000000000001
1619,0.1116
1620,0.12019
1621,0.12877
1622,0.12972999999999998
1623,0.13102
1624,0.1344
1625,0.13746
1626,0.14606
1627,0.15086
1628,0.15429
1629,0.15875999999999998
1630,0.16735999999999998
1631,0.17047
1632,0.17394
1633,0.17537
1634,0.17683
1635,0.18507
1636,0.19125
1637,0.19985
1638,0.20809
1639,0.20956
1640,0.21106
1641,0.21463000000000002
1642,0.21989
1643,0.22605999999999998
1644,0.23429
1645,0.24251999999999999
1646,0.25074
1647,0.25897
1648,0.2672
1649,0.27543
1650,0.28404
1651,0.29020999999999997
1652,0.29844
1653,0.3063
1654,0.31453000000000003
1655,0.32277
1656,0.331
1657,0.33924
1658,0.34541
1659,0.35365
1660,0.36225999999999997
1661,0.3705
1662,0.37873
1663,0.38697
1664,0.39521
1665,0.40139
1666,0.41
1667,0.41315
1668,0.41633000000000003
1669,0.42456000000000005
1670,0.4328
1671,0.44103000000000003
1672,0.44721000000000005
1673,0.45545
1674,0.46369
1675,0.47229
1676,0.48053
1677,0.48877
1678,0.49737
1679,0.49848000000000003
1680,0.50165
1681,0.50988
1682,0.51812
1683,0.52636
1684,0.53459
1685,0.54283
1686,0.54901
1687,0.55725
1688,0.56548
1689,0.57372
1690,0.58196
1691,0.5902
1692,0.59845
1693,0.60463
1694,0.61287
1695,0.62111
1696,0.62936
1697,0.6376
1698,0.64584
1699,0.65409
1700,0.66027
1701,0.66852
1702,0.67677
1703,0.68537
1704,0.69362
1705,0.70187
1706,0.71011
1707,0.7149399999999999
1708,0.71843
1709,0.72291
1710,0.73116
1711,0.7394
1712,0.748
1713,0.75625
1714,0.76243
1715,0.77068
1716,0.77928
1717,0.7844800000000001
1718,0.78762
1719,0.79586
1720,0.80411
1721,0.81029
1722,0.81853
1723,0.82714
1724,0.8353799999999999
1725,0.84362
1726,0.8518700000000001
1727,0.86011
1728,0.8663
1729,0.8694299999999999
1730,0.8729399999999999
1731,0.88118
1732,0.8894200000000001
1733,0.89766
1734,0.90591
1735,0.91209
1736,0.92069
1737,0.92894
1738,0.9371799999999999
1739,0.94542
1740,0.95367
1741,0.96191
1742,0.9681
1743,0.97635
1744,0.98459
1745,0.98772
1746,0.9932799999999999
1747,1.0015
1748,1.0098
1749,1.016
1750,1.0246
1751,1.0328
1752,1.041
1753,1.0493
1754,1.0555
1755,1.0575
1756,1.0637
1757,1.0678
1758,1.0699
1759,1.0789
1760,1.0875
1761,1.0961
1762,1.1047
1763,1.1067
1764,1.1116
1765,1.1198
1766,1.1281
1767,1.1367
1768,1.1449
1769,1.1532
1770,1.158
1771,1.1615
1772,1.168
1773,1.1766
1774,1.1849
1775,1.1931
1776,1.2014
1777,1.2079
1778,1.2131
1779,1.2183
1780,1.2266
1781,1.2348
1782,1.2431
1783,1.2513
1784,1.2575
1785,1.2657
1786,1.274
1787,1.2822
1788,1.2908
1789,1.2990000000000002
1790,1.3073
1791,1.3135
1792,1.3217
1793,1.3286
1794,1.3321
1795,1.339
1796,1.3476
1797,1.3512
1798,1.3559999999999999
1799,1.3646
1800,1.3678
1801,1.3693
1802,1.3729
1803,1.3745
1804,1.381
1805,1.381
1806,1.3826
1807,1.3842
1808,1.3858
1809,1.3874
1810,1.3882
1811,1.3824
1812,1.3837
1813,1.3853
1814,1.3869999999999998
1815,1.3866
1816,1.3883
1817,1.3855
1818,1.3778
1819,1.3769999999999998
1820,1.3767
1821,1.369
1822,1.3633
1823,1.3631
1824,1.3599
1825,1.3517
1826,1.3459999999999999
1827,1.3379
1828,1.3342
1829,1.334
1830,1.3309
1831,1.3232
1832,1.3230000000000002
1833,1.3224
1834,1.3142
1835,1.3061
1836,1.2979
1837,1.2902
1838,1.2821
1839,1.274
1840,1.2658
1841,1.2597
1842,1.2616
1843,1.2590000000000001
1844,1.2509
1845,1.2428
1846,1.2346
1847,1.2265
1848,1.2204
1849,1.2123
1850,1.2041
1851,1.196
1852,1.1919
1853,1.1899
1854,1.1818
1855,1.1797
1856,1.1772
1857,1.1686
1858,1.16
1859,1.1508
1860,1.1427
1861,1.1407
1862,1.1377
1863,1.1295
1864,1.1214
1865,1.1133
1866,1.1046
1867,1.0965
1868,1.0884
1869,1.0823
1870,1.0742
1871,1.0656
1872,1.0595
1873,1.0554
1874,1.0483
1875,1.0402
1876,1.0341
1877,1.0255
1878,1.0174
1879,1.0092
1880,1.0037
1881,0.99964
1882,0.9915200000000001
1883,0.9854200000000001
1884,0.97729
1885,0.9691700000000001
1886,0.96104
1887,0.9529200000000001
1888,0.94429
1889,0.9361700000000001
1890,0.9300799999999999
1891,0.92195
1892,0.9138299999999999
1893,0.9057200000000001
1894,0.8976
1895,0.8894799999999999
1896,0.8813700000000001
1897,0.87528
1898,0.8671700000000001
1899,0.8595700000000001
1900,0.85146
1901,0.84335
1902,0.83525
1903,0.82714
1904,0.82106
1905,0.81296
1906,0.81093
1907,0.80943
1908,0.80185
1909,0.79481
1910,0.7953399999999999
1911,0.79385
1912,0.7862899999999999
1913,0.78225
1914,0.77969
1915,0.77107
1916,0.7619100000000001
1917,0.7532800000000001
1918,0.74721
1919,0.74519
1920,0.7421
1921,0.73401
1922,0.72592
1923,0.71783
1924,0.7097399999999999
1925,0.70314
1926,0.69505
1927,0.68697
1928,0.67888
1929,0.6708
1930,0.66218
1931,0.65799
1932,0.65288
1933,0.64479
1934,0.6361600000000001
1935,0.62808
1936,0.61945
1937,0.61083
1938,0.6088100000000001
1939,0.60678
1940,0.60072
1941,0.59264
1942,0.5851
1943,0.58106
1944,0.57904
1945,0.57353
1946,0.56747
1947,0.5594
1948,0.55133
1949,0.5432600000000001
1950,0.5351899999999999
1951,0.52768
1952,0.51961
1953,0.513
1954,0.5049399999999999
1955,0.49688000000000004
1956,0.48882
1957,0.48076
1958,0.4727
1959,0.46463999999999994
1960,0.4586
1961,0.45055
1962,0.4425
1963,0.43445
1964,0.4264
1965,0.41835
1966,0.41462
1967,0.4109
1968,0.40429
1969,0.39624000000000004
1970,0.38818
1971,0.38013
1972,0.37209000000000003
1973,0.36404000000000003
1974,0.35743
1975,0.34996
1976,0.34192
1977,0.3333
1978,0.32526
1979,0.31722
1980,0.30919
1981,0.30316
1982,0.29513
1983,0.2871
1984,0.2819
1985,0.27756
1986,0.27095
1987,0.26291
1988,0.2563
1989,0.24825999999999998
1990,0.24450999999999998
1991,0.24018
1992,0.23356999999999997
1993,0.22495
1994,0.22065
1995,0.2175
1996,0.20944000000000002
1997,0.20139
1998,0.19334
1999,0.1853
2000,0.17725
2001,0.16921
2002,0.16318
2003,0.15514
2004,0.1471
2005,0.13906
2006,0.13103
2007,0.12299000000000002
2008,0.11495999999999999
2009,0.10894000000000001
2010,0.10091
2011,0.092888
2012,0.084863
2013,0.076842
2014,0.068823
2015,0.060804
2016,0.054792999999999994
2017,0.048783
2018,0.051204
2019,0.047036
2020,0.039037999999999996
2021,0.031042
2022,0.023046
2023,0.017053
2024,0.0090626
2025,0.0010756
2026,-0.0069104
2027,-0.014893
2028,-0.022874000000000002
2029,-0.030853
2030,-0.036837
2031,-0.04481
2032,-0.052782
2033,-0.060751
2034,-0.06872
2035,-0.076684
2036,-0.084647
2037,-0.09260700000000001
2038,-0.09857300000000001
2039,-0.10653
2040,-0.11448
2041,-0.12243
2042,-0.13038
2043,-0.13833
2044,-0.14627
2045,-0.15222
2046,-0.1595
2047,-0.16743
2048,-0.17536
2049,-0.18329
2050,-0.19121
2051,-0.19913
2052,-0.19975
2053,-0.19899999999999998
2054,-0.20424
2055,-0.21145
2056,-0.20936999999999997
2057,-0.20854
2058,-0.21570999999999999
2059,-0.22161
2060,-0.21875999999999998
2061,-0.21785
2062,-0.21495
2063,-0.21666999999999997
2064,-0.22376999999999997
2065,-0.22471999999999998
2066,-0.22246999999999997
2067,-0.23028
2068,-0.23463
2069,-0.23159000000000002
2070,-0.23124
2071,-0.23124
2072,-0.23708
2073,-0.24291
2074,-0.24796999999999997
2075,-0.24836
2076,-0.25534
2077,-0.26231
2078,-0.26927
2079,-0.27121
2080,-0.27235
2081,-0.27736
2082,-0.2843
2083,-0.28108
2084,-0.27976999999999996
2085,-0.2765
2086,-0.27678
2087,-0.27596
2088,-0.27431
2089,-0.27098
2090,-0.26764
2091,-0.26511
2092,-0.26426
2093,-0.25981
2094,-0.25534
2095,-0.25067
2096,-0.24216999999999997
2097,-0.2377
2098,-0.23235999999999998
2099,-0.2289
2100,-0.22351999999999997
2101,-0.21781
2102,-0.2102
2103,-0.20259000000000002
2104,-0.1941
2105,-0.18648
2106,-0.17904
2107,-0.17367
2108,-0.16899999999999998
2109,-0.16138
2110,-0.15289
2111,-0.14527
2112,-0.14077
2113,-0.1354
2114,-0.12692
2115,-0.12034
2116,-0.11495999999999999
2117,-0.10751
2118,-0.099902
2119,-0.091421
2120,-0.082942
2121,-0.078427
2122,-0.075803
2123,-0.068203
2124,-0.059726
2125,-0.052117
2126,-0.04641
2127,-0.044506
2128,-0.036023
2129,-0.033253
2130,-0.030481
2131,-0.023902
2132,-0.014552
2133,-0.009876399999999999
2134,-0.007975399999999999
2135,-0.00035743
2136,0.0043176
2137,0.011594
2138,0.016109000000000002
2139,0.023718
2140,0.032199
2141,0.039812
2142,0.044488
2143,0.046392
2144,0.052105
2145,0.059729
2146,0.067354
2147,0.07117000000000001
2148,0.073078
2149,0.077946
2150,0.083676
2151,0.09131900000000001
2152,0.098965
2153,0.10661
2154,0.11427000000000001
2155,0.12193
2156,0.12959
2157,0.13534000000000002
2158,0.14062
2159,0.14506
2160,0.15272
2161,0.16038
2162,0.16888
2163,0.17655
2164,0.1823
2165,0.18972999999999998
2166,0.195
2167,0.20435
2168,0.21178000000000002
2169,0.21516
2170,0.21877
2171,0.21877
2172,0.2245
2173,0.233
2174,0.24235
2175,0.24702
2176,0.24978000000000003
2177,0.25551999999999997
2178,0.26041
2179,0.26532
2180,0.26639
2181,0.27023
2182,0.27598
2183,0.27873000000000003
2184,0.28808
2185,0.29466
2186,0.30125
2187,0.30317
2188,0.31168
2189,0.31994
2190,0.3233
2191,0.33096
2192,0.33671
2193,0.34521999999999997
2194,0.35372
2195,0.35708
2196,0.36259
2197,0.3711
2198,0.37661
2199,0.38106
2200,0.38466
2201,0.39316
2202,0.39869
2203,0.40399999999999997
2204,0.41058
2205,0.41908
2206,0.42163999999999996
2207,0.42888000000000004
2208,0.43737
2209,0.44376000000000004
2210,0.44911
2211,0.4557
2212,0.46228
2213,0.46676999999999996
2214,0.47025
2215,0.47373999999999994
2216,0.47915
2217,0.48267
2218,0.48722
2219,0.4948
2220,0.50037
2221,0.50392
2222,0.50748
2223,0.51107
2224,0.51467
2225,0.5183
2226,0.52193
2227,0.52747
2228,0.5283399999999999
2229,0.53203
2230,0.53573
2231,0.53945
2232,0.54319
2233,0.54695
2234,0.54885
2235,0.5460699999999999
2236,0.53956
2237,0.54151
2238,0.5425300000000001
2239,0.53606
2240,0.53427
2241,0.5362899999999999
2242,0.53356
2243,0.52615
2244,0.51875
2245,0.51135
2246,0.5039600000000001
2247,0.49658
2248,0.49005
2249,0.48526
2250,0.48047
2251,0.47307
2252,0.46568999999999994
2253,0.45732
2254,0.44993999999999995
2255,0.44256
2256,0.43788999999999995
2257,0.43209
2258,0.42643000000000003
2259,0.41905
2260,0.41068999999999994
2261,0.40231999999999996
2262,0.39468000000000003
2263,0.39271
2264,0.38533
2265,0.37795
2266,0.37058
2267,0.36322
2268,0.35486
2269,0.3475
2270,0.34199
2271,0.33464
2272,0.32729
2273,0.31995999999999997
2274,0.31262
2275,0.3063
2276,0.29796999999999996
2277,0.29248
2278,0.28517
2279,0.27786
2280,0.27055999999999997
2281,0.26326
2282,0.25597
2283,0.24869000000000002
2284,0.24323000000000003
2285,0.23595
2286,0.22868000000000002
2287,0.22141999999999998
2288,0.21570999999999999
2289,0.20974
2290,0.20326
2291,0.1978
2292,0.19054000000000001
2293,0.18224
2294,0.17499
2295,0.16774
2296,0.1605
2297,0.15327000000000002
2298,0.14785
2299,0.14062
2300,0.13384000000000001
2301,0.12782000000000002
2302,0.12059
2303,0.11231
2304,0.10507999999999999
2305,0.098614
2306,0.09258
2307,0.08685599999999999
2308,0.07962999999999999
2309,0.071354
2310,0.064139
2311,0.057352
2312,0.054178
2313,0.044844
2314,0.038369
2315,0.032344
2316,0.026624000000000002
2317,0.018338999999999998
2318,0.010515
2319,0.0055586
2320,-0.0016824000000000001
2321,-0.0089184
2322,-0.017200999999999998
2323,-0.024427
2324,-0.031644
2325,-0.038856
2326,-0.044259
2327,-0.05179299999999999
2328,-0.05784299999999999
2329,-0.066117
2330,-0.074387
2331,-0.08159
2332,-0.088055
2333,-0.091253
2334,-0.095498
2335,-0.10153
2336,-0.1065
2337,-0.11373
2338,-0.12201
2339,-0.12922999999999998
2340,-0.13496
2341,-0.14099
2342,-0.14745999999999998
2343,-0.15469000000000002
2344,-0.1619
2345,-0.17017000000000002
2346,-0.17737999999999998
2347,-0.18278
2348,-0.18778
2349,-0.19383
2350,-0.20104
2351,-0.20824
2352,-0.21544000000000002
2353,-0.2237
2354,-0.22909000000000002
2355,-0.23626999999999998
2356,-0.24344000000000002
2357,-0.25168
2358,-0.25779
2359,-0.26533
2360,-0.2725
2361,-0.27895
2362,-0.28611
2363,-0.28969
2364,-0.29257
2365,-0.3008
2366,-0.30368
2367,-0.30655
2368,-0.313
2369,-0.32232
2370,-0.32411
2371,-0.32947
2372,-0.33660999999999996
2373,-0.34373000000000004
2374,-0.35085
2375,-0.35729
2376,-0.3644
2377,-0.3715
2378,-0.37859
2379,-0.38568
2380,-0.39275
2381,-0.39964
2382,-0.40476
2383,-0.41118999999999994
2384,-0.41938000000000003
2385,-0.42645
2386,-0.43463999999999997
2387,-0.44088
2388,-0.44843
2389,-0.45485
2390,-0.46192
2391,-0.46897
2392,-0.47523000000000004
2393,-0.48212
2394,-0.48918999999999996
2395,-0.49738000000000004
2396,-0.50267
2397,-0.51021
2398,-0.51647
2399,-0.52289
2400,-0.52995
2401,-0.5381199999999999
2402,-0.5451600000000001
2403,-0.5503100000000001
2404,-0.55658
2405,-0.5636399999999999
2406,-0.57181
2407,-0.57885
2408,-0.58236
2409,-0.58412
2410,-0.58877
2411,-0.59517
2412,-0.59806
2413,-0.60561
2414,-0.6137699999999999
2415,-0.61841
2416,-0.62017
2417,-0.62367
2418,-0.6318199999999999
2419,-0.6388199999999999
2420,-0.6469600000000001
2421,-0.6539
2422,-0.6591
2423,-0.66609
2424,-0.67308
2425,-0.6794600000000001
2426,-0.68643
2427,-0.69339
2428,-0.69804
2429,-0.70616
2430,-0.71312
2431,-0.72125
2432,-0.72531
2433,-0.7316699999999999
2434,-0.73865
2435,-0.74562
2436,-0.75257
2437,-0.75952
2438,-0.76763
2439,-0.77282
2440,-0.77974
2441,-0.78783
2442,-0.79427
2443,-0.80182
2444,-0.81109
2445,-0.81752
2446,-0.81986
2447,-0.8268
2448,-0.8348899999999999
2449,-0.8418100000000001
2450,-0.8481700000000001
2451,-0.85462
2452,-0.8587
2453,-0.8638899999999999
2454,-0.87198
2455,-0.8788799999999999
2456,-0.8864200000000001
2457,-0.8928799999999999
2458,-0.90097
2459,-0.90905
2460,-0.91422
2461,-0.92109
2462,-0.92586
2463,-0.93286
2464,-0.93975
2465,-0.9478200000000001
2466,-0.9546899999999999
2467,-0.9593200000000001
2468,-0.9658200000000001
2469,-0.97164
2470,-0.9797100000000001
2471,-0.9865799999999999
2472,-0.9934299999999999
2473,-1.0005
2474,-1.0041
2475,-1.0104
2476,-1.0197
2477,-1.0262
2478,-1.0303
2479,-1.0371
2480,-1.0452
2481,-1.0503
2482,-1.055
2483,-1.0632
2484,-1.069
2485,-1.0771
2486,-1.0836
2487,-1.0889
2488,-1.094
2489,-1.1021
2490,-1.1089
2491,-1.117
2492,-1.1206
2493,-1.1254
2494,-1.1319
2495,-1.1354
2496,-1.1418
2497,-1.1499
2498,-1.1563
2499,-1.165
2500,-1.1743
2501,-1.1808
2502,-1.1854
2503,-1.1923
2504,-1.2004
2505,-1.2073
2506,-1.2126
2507,-1.219
2508,-1.2271
2509,-1.2323
2510,-1.237
2511,-1.2434
2512,-1.2481
2513,-1.2533
2514,-1.2603
2515,-1.2684
2516,-1.2736
2517,-1.28
2518,-1.2847
2519,-1.2893
2520,-1.2956
2521,-1.3032
2522,-1.3102
2523,-1.3166
2524,-1.3235
2525,-1.3288
2526,-1.3351
2527,-1.3432
2528,-1.3496
2529,-1.3559999999999999
2530,-1.3618
2531,-1.3699
2532,-1.3769
2533,-1.3814
2534,-1.3896
2535,-1.3971
2536,-1.4034
2537,-1.4081
2538,-1.4151
2539,-1.4233
2540,-1.4303
2541,-1.4384
2542,-1.4453
2543,-1.4523
2544,-1.4587
2545,-1.4657
2546,-1.4744
2547,-1.4807
2548,-1.4877
2549,-1.4947
2550,-1.5028
2551,-1.508
2552,-1.515
2553,-1.5225
2554,-1.5289
2555,-1.5353
2556,-1.5422
2557,-1.5503
2558,-1.5555
2559,-1.5624
2560,-1.5693
2561,-1.5746
2562,-1.5811
2563,-1.588
2564,-1.5948
2565,-1.6012
2566,-1.608
2567,-1.6148
2568,-1.6217
2569,-1.6282
2570,-1.6353
2571,-1.6421
2572,-1.6484
2573,-1.6552
2574,-1.661
2575,-1.6676
2576,-1.6739
2577,-1.6807
2578,-1.6875
2579,-1.6925
2580,-1.7005
2581,-1.7072
2582,-1.7139
2583,-1.7206
2584,-1.726
2585,-1.7328
2586,-1.7361
2587,-1.7428
2588,-1.7494
2589,-1.756
2590,-1.7639
2591,-1.7705
2592,-1.777
2593,-1.7819
2594,-1.7884
2595,-1.7948
2596,-1.8007
2597,-1.8076
2598,-1.8138
2599,-1.8203
2600,-1.8264
2601,-1.8328
2602,-1.8392
2603,-1.8455
2604,-1.8471
2605,-1.8503
2606,-1.8593
2607,-1.8623
2608,-1.8668
2609,-1.8744
2610,-1.8819
2611,-1.8835
2612,-1.8835
2613,-1.8897
2614,-1.8958
2615,-1.9004
2616,-1.9080000000000001
2617,-1.9141
2618,-1.9201
2619,-1.9275
2620,-1.9335
2621,-1.9394
2622,-1.9438
2623,-1.9498
2624,-1.9557
2625,-1.9616
2626,-1.9674
2627,-1.9732
2628,-1.9789
2629,-1.9848
2630,-1.9904
2631,-1.996
2632,-2.0016
2633,-2.0071
2634,-2.0141
2635,-2.0219
2636,-2.0278
2637,-2.0332
2638,-2.0386
2639,-2.0439
2640,-2.0492
2641,-2.056
2642,-2.0611
2643,-2.065
2644,-2.0675
2645,-2.0687
2646,-2.0737
2647,-2.0762
2648,-2.0791
2649,-2.0832
2650,-2.0886
2651,-2.0934
2652,-2.0964
2653,-2.0964
2654,-2.0975
2655,-2.1038
2656,-2.1079
2657,-2.1096
2658,-2.1147
2659,-2.1227
2660,-2.1267
2661,-2.1278
2662,-2.131
2663,-2.1352
2664,-2.1384
2665,-2.1424
2666,-2.1464
2667,-2.1503
2668,-2.1541
2669,-2.1578
2670,-2.1615
2671,-2.1641
2672,-2.1675
2673,-2.1708
2674,-2.1741
2675,-2.1772
2676,-2.1779
2677,-2.1794
2678,-2.1816
2679,-2.1845
2680,-2.1845
2681,-2.1859
2682,-2.1885
2683,-2.1911
2684,-2.1935
2685,-2.1952
2686,-2.1975
2687,-2.2016
2688,-2.2036
2689,-2.2054
2690,-2.2072
2691,-2.2088
2692,-2.2099
2693,-2.2113
2694,-2.2125
2695,-2.2136
2696,-2.2146
2697,-2.2154
2698,-2.2162
2699,-2.2166
2700,-2.2171
2701,-2.2174
2702,-2.2176
2703,-2.2177
2704,-2.2177
2705,-2.2177
2706,-2.2177
2707,-2.2177
2708,-2.2218
