[<text>
<title>u.s. vegetable oil products output in february</title>
<dateline>    washington, april 1 - </dateline>u.s. factories used 1,053.0 mln lbs
of various vegetable oils in the production of edible products
during february, the census bureau reported.
    that compared with a revised usage of 1,075.0 mln lbs in
january and 1,084.2 mln lbs in february, 1986.
    february production of selected products included the
following, with comparisons, in mln lbs --
                 feb 87    jan 87    feb 86
     baking or
   frying fats -- 355.5    387.6-r   427.4
 soybean salad and
   cooking oil -- 388.1    373.3-r   351.7
 r-revised.

    production, continued (in mln lbs --)
                   feb 87    jan 87   feb 86
 other salad and
    cooking oils   111.2    111.4-r   114.3
       margarine   218.8    216.9-r   214.4
       glycerine --
           crude    21.5     25.9      31.3
         refined    23.5     23.6-r    25.4
     fatty acids   102.9    112.5-r   113.1
       meat/meal
         tankage   410.2    458.2-r   446.2
 r-revised.
reuter^m
</text>]