time,value
0,1.1968
1,1.0037
2,0.81062
3,0.90717
4,0.81062
5,0.81062
6,0.81062
7,0.71407
8,0.81062
9,0.81062
10,0.71407
11,0.71407
12,0.81062
13,0.71407
14,0.71407
15,0.71407
16,0.71407
17,0.71407
18,0.71407
19,0.71407
20,0.71407
21,0.71407
22,0.71407
23,0.71407
24,0.71407
25,0.71407
26,0.61752
27,0.71407
28,0.71407
29,0.71407
30,0.61752
31,0.71407
32,0.71407
33,-0.63764
34,-1.2169
35,-1.2169
36,-1.2169
37,-1.2169
38,-1.2169
39,-1.2169
40,-1.2169
41,-1.2169
42,-1.2169
43,-1.2169
44,-1.2169
45,-0.058333
46,1.2934
47,1.1003
48,1.0037
49,0.81062
50,-0.92729
51,-1.2169
52,-1.2169
53,-1.2169
54,-1.2169
55,-1.2169
56,-1.2169
57,-1.2169
58,0.13477
59,1.2934
60,1.1003
61,1.0037
62,0.81062
63,0.90717
64,-0.54108
65,-1.2169
66,-1.2169
67,-1.2169
68,-1.2169
69,-1.2169
70,-1.2169
71,-0.92729
72,1.2934
73,1.1968
74,1.0037
75,0.90717
76,0.90717
77,0.81062
78,-0.73419
79,-1.2169
80,-1.2169
81,-1.2169
82,-1.2169
83,-1.2169
84,-1.2169
85,-0.63764
86,1.2934
87,1.1968
88,1.0037
89,0.90717
90,0.81062
91,0.038218
92,-1.2169
93,-1.2169
94,-1.2169
95,-1.2169
