time,value
0,-0.14742
1,-0.14742
2,-0.14742
3,-0.14742
4,-0.14742
5,-0.14742
6,-0.14742
7,-0.14742
8,-0.14742
9,-0.14742
10,-0.14742
11,-0.14742
12,-0.14742
13,-0.14742
14,-0.14742
15,-0.14742
16,-0.14742
17,-0.14742
18,-0.14742
19,-0.14742
20,-0.14742
21,-0.14742
22,-0.14742
23,-0.14742
24,-0.14742
25,-0.14742
26,-0.14742
27,-0.14742
28,-0.14742
29,-0.14742
30,-0.14742
31,-0.14742
32,-0.14742
33,-0.14742
34,-0.14742
35,-0.14742
36,-0.14742
37,-0.14742
38,-0.14742
39,-0.14742
40,-0.14742
41,-0.14742
42,-0.14742
43,-0.14742
44,-0.14742
45,-0.14742
46,-0.14742
47,-0.14742
48,-0.14742
49,-0.14742
50,-0.14742
51,-0.14742
52,-0.14742
53,-0.14742
54,-0.14742
55,-0.14742
56,-0.14742
57,-0.14742
58,-0.14742
59,-0.14742
60,-0.14742
61,-0.14742
62,-0.14742
63,-0.14742
64,-0.14742
65,-0.14742
66,-0.14742
67,-0.14742
68,-0.14742
69,-0.14742
70,-0.14742
71,-0.14742
72,-0.14742
73,-0.14742
74,-0.14742
75,-0.14742
76,-0.14742
77,-0.14742
78,-0.14742
79,-0.14742
80,-0.14742
81,-0.14742
82,-0.14742
83,-0.14742
84,-0.14742
85,-0.14742
86,-0.14742
87,-0.14742
88,-0.14742
89,-0.14742
90,6.4771
91,7.1427
92,0.09030099999999999
93,-0.14742
94,-0.14742
95,-0.14742
