time,value
0,-0.97839
1,-1.0253
2,-0.88465
3,-1.0253
4,-1.0253
5,-0.97839
6,-1.0253
7,-1.0253
8,-1.0253
9,-0.97839
10,-1.0253
11,-0.9315200000000001
12,-0.65031
13,-0.74405
14,-0.79092
15,-0.83778
16,-0.9315200000000001
17,-1.0253
18,-1.0253
19,-1.0253
20,-0.97839
21,-1.0253
22,-1.0253
23,-1.0253
24,-1.0253
25,-1.0253
26,-1.0253
27,-1.0253
28,-1.0253
29,-1.0253
30,-1.0253
31,-0.88465
32,0.8495
33,0.8495
34,0.8963700000000001
35,0.8495
36,0.8495
37,0.8495
38,0.8495
39,0.8495
40,1.037
41,0.94324
42,0.8963700000000001
43,-0.27536
44,-1.0253
45,-1.0253
46,-1.0253
47,-0.97839
48,-1.0253
49,-1.0253
50,-1.0253
51,-1.0253
52,-1.0253
53,-1.0253
54,-1.0253
55,-1.0253
56,-0.9315200000000001
57,0.33394
58,1.0838
59,1.1307
60,1.037
61,1.1307
62,1.0838
63,1.0838
64,1.1307
65,1.0838
66,1.0838
67,1.0838
68,1.0838
69,1.0838
70,1.0838
71,1.0838
72,1.0838
73,1.0838
74,1.0838
75,1.0838
76,1.0838
77,1.1307
78,1.0838
79,1.0838
80,1.0838
81,1.0838
82,1.1307
83,1.0838
84,1.0838
85,1.0838
86,1.0838
87,1.0838
88,1.1307
89,1.0838
90,1.0838
91,1.0838
92,-0.27536
93,-0.74405
94,-0.79092
95,-0.79092
