time,value
0,-0.50898
1,-0.50898
2,-0.50898
3,-0.50898
4,-0.50898
5,-0.50898
6,-0.50898
7,-0.50898
8,-0.38863000000000003
9,-0.50898
10,-0.50898
11,-0.50898
12,-0.38863000000000003
13,-0.50898
14,-0.38863000000000003
15,-0.50898
16,-0.50898
17,-0.50898
18,-0.50898
19,-0.50898
20,-0.50898
21,-0.50898
22,-0.50898
23,-0.50898
24,-0.50898
25,-0.50898
26,-0.50898
27,-0.50898
28,-0.50898
29,-0.50898
30,-0.50898
31,-0.50898
32,-0.50898
33,-0.50898
34,-0.50898
35,-0.50898
36,-0.50898
37,-0.50898
38,-0.38863000000000003
39,-0.50898
40,-0.50898
41,-0.50898
42,-0.50898
43,-0.50898
44,-0.50898
45,-0.50898
46,-0.50898
47,-0.50898
48,-0.50898
49,-0.38863000000000003
50,-0.50898
51,-0.50898
52,-0.50898
53,-0.50898
54,-0.50898
55,-0.50898
56,-0.50898
57,-0.50898
58,-0.50898
59,-0.50898
60,-0.50898
61,-0.50898
62,-0.50898
63,-0.50898
64,-0.50898
65,-0.50898
66,-0.50898
67,-0.50898
68,-0.50898
69,-0.50898
70,0.57417
71,2.3794
72,2.3794
73,2.3794
74,2.2591
75,2.3794
76,2.2591
77,2.3794
78,2.3794
79,2.2591
80,2.3794
81,2.3794
82,1.4166
83,-0.14793
84,0.092769
85,1.7777
86,2.2591
87,2.3794
88,0.69452
89,-0.02758
90,0.092769
91,-0.02758
92,-0.02758
93,0.092769
94,-0.02758
95,0.092769
