time,value
0,-0.19477
1,-0.19477
2,-0.19477
3,-0.19477
4,-0.19477
5,-0.19477
6,-0.19477
7,-0.19477
8,-0.19477
9,-0.19477
10,-0.19477
11,-0.19477
12,-0.19477
13,-0.19477
14,-0.19477
15,-0.19477
16,-0.19477
17,-0.19477
18,-0.19477
19,-0.19477
20,-0.19477
21,-0.19477
22,-0.19477
23,-0.19477
24,-0.19477
25,-0.19477
26,-0.19477
27,-0.19477
28,-0.19477
29,-0.19477
30,-0.19477
31,-0.19477
32,-0.19477
33,-0.19477
34,-0.19477
35,-0.19477
36,-0.19477
37,-0.19477
38,-0.19477
39,-0.19477
40,-0.19477
41,-0.19477
42,-0.19477
43,-0.19477
44,-0.19477
45,-0.19477
46,-0.19477
47,-0.19477
48,-0.19477
49,-0.19477
50,-0.19477
51,-0.19477
52,-0.19477
53,-0.19477
54,-0.19477
55,-0.19477
56,-0.19477
57,-0.19477
58,-0.19477
59,-0.19477
60,-0.19477
61,-0.19477
62,-0.19477
63,-0.19477
64,-0.19477
65,-0.19477
66,-0.19477
67,-0.19477
68,-0.19477
69,-0.19477
70,-0.19477
71,-0.19477
72,-0.19477
73,-0.19477
74,-0.19477
75,-0.19477
76,-0.19477
77,-0.19477
78,-0.19477
79,-0.19477
80,-0.19477
81,-0.19477
82,-0.19477
83,-0.19477
84,0.031497000000000004
85,3.0963
86,4.1248
87,0.15491
88,0.17548
89,1.9239
90,7.8273
91,-0.19477
92,-0.19477
93,-0.19477
94,-0.19477
95,-0.19477
