time,value
0,-0.29996
1,-0.29996
2,-0.29996
3,-0.29996
4,-0.29996
5,-0.29996
6,-0.29996
7,-0.29996
8,-0.29996
9,-0.29996
10,-0.29996
11,-0.29996
12,0.20820999999999998
13,-0.29996
14,-0.29996
15,-0.29996
16,-0.29996
17,-0.29996
18,-0.29996
19,-0.29996
20,0.20820999999999998
21,-0.29996
22,-0.29996
23,-0.29996
24,-0.29996
25,-0.29996
26,-0.29996
27,-0.29996
28,-0.29996
29,-0.29996
30,-0.29996
31,-0.29996
32,-0.29996
33,-0.29996
34,-0.29996
35,-0.29996
36,-0.29996
37,-0.29996
38,-0.29996
39,0.038818
40,0.038818
41,-0.29996
42,-0.29996
43,-0.29996
44,-0.29996
45,-0.29996
46,-0.29996
47,-0.29996
48,-0.29996
49,-0.29996
50,-0.29996
51,-0.29996
52,-0.29996
53,-0.29996
54,-0.29996
55,0.038818
56,0.038818
57,-0.29996
58,-0.29996
59,-0.29996
60,-0.29996
61,-0.29996
62,-0.29996
63,-0.29996
64,-0.29996
65,-0.29996
66,-0.29996
67,-0.29996
68,-0.29996
69,-0.29996
70,-0.29996
71,-0.29996
72,-0.29996
73,-0.29996
74,-0.29996
75,-0.29996
76,-0.29996
77,-0.29996
78,-0.29996
79,-0.29996
80,-0.29996
81,-0.29996
82,-0.29996
83,-0.29996
84,3.7654
85,3.7654
86,3.7654
87,3.7654
88,3.596
89,3.7654
90,1.9021
91,-0.29996
92,-0.29996
93,-0.29996
94,-0.29996
95,-0.29996
