time,value
0,1.7129
1,1.6666
2,1.6264
3,1.5874
4,1.5417
5,1.5023
6,1.4643
7,1.4321
8,1.3973
9,1.3598
10,1.3183
11,1.2766
12,1.236
13,1.1976
14,1.1563
15,1.1146
16,1.075
17,1.0351
18,0.99559
19,0.95121
20,0.9061899999999999
21,0.8648399999999999
22,0.8237399999999999
23,0.77686
24,0.73735
25,0.69917
26,0.6565300000000001
27,0.6218600000000001
28,0.58558
29,0.54638
30,0.50238
31,0.46187
32,0.42212
33,0.38224
34,0.34271999999999997
35,0.30044
36,0.25571
37,0.21706999999999999
38,0.17288
39,0.12964
40,0.086579
41,0.043789999999999996
42,0.0011991
43,-0.041184
44,-0.08031100000000001
45,-0.11872
46,-0.13374
47,-0.17490999999999998
48,-0.2158
49,-0.25625
50,-0.29369
51,-0.32779
52,-0.36701999999999996
53,-0.40571
54,-0.44378999999999996
55,-0.48152
56,-0.5162899999999999
57,-0.55047
58,-0.5866600000000001
59,-0.62207
60,-0.65677
61,-0.6906899999999999
62,-0.72322
63,-0.75527
64,-0.78647
65,-0.81666
66,-0.8448
67,-0.86908
68,-0.8908200000000001
69,-0.9033200000000001
70,-0.9051299999999999
71,-0.9013100000000001
72,-0.89581
73,-0.89051
74,-0.8803799999999999
75,-0.8618
76,-0.8481
77,-0.8322299999999999
78,-0.81821
79,-0.80676
80,-0.79635
81,-0.7804300000000001
82,-0.7612899999999999
83,-0.7401
84,-0.71853
85,-0.69943
86,-0.6781699999999999
87,-0.65053
88,-0.62961
89,-0.66379
90,-0.69508
91,-0.72806
92,-0.7759
93,-0.8284600000000001
94,-0.8708
95,-0.91004
96,-0.94771
97,-0.9963700000000001
98,-1.0404
99,-1.0829
100,-1.1239
101,-1.1668
102,-1.2037
103,-1.2229999999999999
104,-1.2355
105,-1.2409
106,-1.2363
107,-1.2264
108,-1.2109
109,-1.1953
110,-1.1816
111,-1.1733
112,-1.141
113,-1.1179
114,-1.0881
115,-1.0679
116,-1.0468
117,-1.0233
118,-0.9952
119,-0.96573
120,-0.9419299999999999
121,-0.9139
122,-0.88435
123,-0.8556600000000001
124,-0.8262799999999999
125,-0.7985899999999999
126,-0.7702399999999999
127,-0.74354
128,-0.70943
129,-0.67593
130,-0.64832
131,-0.61148
132,-0.5774699999999999
133,-0.5413399999999999
134,-0.50122
135,-0.4599
136,-0.42711000000000005
137,-0.40145
138,-0.38108000000000003
139,-0.35609
140,-0.32931
141,-0.29583000000000004
142,-0.25944
143,-0.23149
144,-0.19588
145,-0.16383
146,-0.12932000000000002
147,-0.09652999999999999
148,-0.065182
149,-0.026769
150,0.0086208
151,0.045062
152,0.08002100000000001
153,0.11667999999999999
154,0.15369000000000002
155,0.17675
156,0.20213
157,0.23621999999999999
158,0.2705
159,0.30433000000000004
160,0.33444
161,0.37049
162,0.40685
163,0.45005
164,0.49754
165,0.546
166,0.57929
167,0.62369
168,0.67224
169,0.71799
170,0.75302
171,0.79513
172,0.8479200000000001
173,0.89766
174,0.9458700000000001
175,0.9902700000000001
176,1.0408
177,1.0843
178,1.1178
179,1.1603
180,1.2046
181,1.2476
182,1.2901
183,1.3328
184,1.3705
185,1.4101
186,1.4506
187,1.4914
188,1.5299
189,1.5684
190,1.5961
191,1.5681
192,1.5254
193,1.4848
194,1.4371
195,1.3923
196,1.3655
197,1.3384
198,1.3043
199,1.2608
200,1.2489
201,1.2552
202,1.2561
203,1.2347
204,1.1983
205,1.167
206,1.1779
207,1.1707
208,1.1498
209,1.1318
210,1.1243
211,1.1107
212,1.123
213,1.1528
214,1.159
215,1.1702
216,1.1836
217,1.1863
218,1.1843
219,1.1809
220,1.1776
221,1.1639
222,1.1438
223,1.1644
224,1.1749
225,1.1643
226,1.1559
227,1.131
228,1.0909
229,1.0497
230,1.0102
231,0.97098
232,0.9327200000000001
233,0.8947700000000001
234,0.8567799999999999
235,0.8182
236,0.78055
237,0.7436
238,0.70623
239,0.66946
240,0.63251
241,0.59585
242,0.56023
243,0.5243800000000001
244,0.48893000000000003
245,0.45293
246,0.41686999999999996
247,0.38067
248,0.34463
249,0.30894
250,0.27218000000000003
251,0.23526999999999998
252,0.19942000000000001
253,0.16401
254,0.12819
255,0.093327
256,0.058438
257,0.022628
258,-0.014107
259,-0.052394
260,-0.09273300000000001
261,-0.13304000000000002
262,-0.1744
263,-0.21681999999999998
264,-0.26249
265,-0.30226
266,-0.33073
267,-0.36541999999999997
268,-0.39245
269,-0.40288
270,-0.4129
271,-0.42111000000000004
272,-0.42323
273,-0.40955
274,-0.41471
275,-0.42498
276,-0.45593
277,-0.48972
278,-0.529
279,-0.55777
280,-0.55545
281,-0.55066
282,-0.59004
283,-0.61759
284,-0.64975
285,-0.68402
286,-0.72395
287,-0.7640899999999999
288,-0.8043399999999999
289,-0.84459
290,-0.88502
291,-0.9254
292,-0.9657100000000001
293,-1.0061
294,-1.0465
295,-1.087
296,-1.1274
297,-1.1677
298,-1.2079
299,-1.248
300,-1.2882
301,-1.3286
302,-1.369
303,-1.4093
304,-1.4495
305,-1.4835
306,-1.5187
307,-1.5564
308,-1.5933
309,-1.6257
310,-1.6583
311,-1.6806
312,-1.6995
313,-1.7175
314,-1.7327
315,-1.7437
316,-1.7493
317,-1.7467
318,-1.7405
319,-1.7295
320,-1.7115
321,-1.7115
322,-1.7015
323,-1.6756
324,-1.6253
325,-1.5799
326,-1.5281
327,-1.4796
328,-1.4361
329,-1.3981
330,-1.3611
331,-1.3237
332,-1.2862
333,-1.2498
334,-1.2123
335,-1.176
336,-1.139
337,-1.1045
338,-1.0909
339,-1.1023
340,-1.1202
341,-1.1389
342,-1.1586
343,-1.1795
344,-1.2017
345,-1.2212
346,-1.2439
347,-1.2619
348,-1.2845
349,-1.3085
350,-1.3301
351,-1.3512
352,-1.3684
353,-1.3626
354,-1.3339
355,-1.2929
356,-1.2539
357,-1.2109999999999999
358,-1.1766
359,-1.1358
360,-1.0945
361,-1.0523
362,-1.0123
363,-0.97144
364,-0.92805
365,-0.88356
366,-0.84031
367,-0.79689
368,-0.75554
369,-0.71307
370,-0.6682899999999999
371,-0.62708
372,-0.58272
373,-0.54132
374,-0.49795
375,-0.45677
376,-0.4139
377,-0.37624
378,-0.34845
379,-0.34655
380,-0.35355
381,-0.35831
382,-0.32924000000000003
383,-0.31459000000000004
384,-0.29554
385,-0.26749
386,-0.22643000000000002
387,-0.19666
388,-0.1711
389,-0.14945
390,-0.12722999999999998
391,-0.1066
392,-0.085372
393,-0.065652
394,-0.043262
395,-0.020331000000000002
396,0.0031230999999999997
397,0.026976999999999998
398,0.049598
399,0.076458
400,0.10372
401,0.13137000000000001
402,0.15757000000000002
403,0.18598
404,0.21611999999999998
405,0.25695
406,0.29822
407,0.33341
408,0.37532
409,0.41753999999999997
410,0.44855
411,0.48825
412,0.53277
413,0.57489
414,0.61335
415,0.65586
416,0.7028
417,0.7446699999999999
418,0.7809699999999999
419,0.82355
420,0.86716
421,0.90699
422,0.9547200000000001
423,0.99685
424,1.0423
425,1.0796
426,1.1145
427,1.149
428,1.1835
429,1.2289
430,1.2774
431,1.3223
432,1.3552
433,1.3883
434,1.4215
435,1.4559
436,1.4889
437,1.5221
438,1.5568
439,1.5912
440,1.6267
441,1.6609
442,1.6937
443,1.7197
444,1.7408
445,1.7269999999999999
446,1.68
447,1.6382
448,1.5916
449,1.5475
450,1.5039
451,1.4594
452,1.4553
453,1.4869
454,1.517
455,1.5481
456,1.5856
457,1.6342
458,1.6749
459,1.704
460,1.7204
461,1.7139
462,1.7115
