time,value
0,0.9436200000000001
1,-0.6644399999999999
2,-1.2675
3,-1.2675
4,1.0776
5,0.9436200000000001
6,0.9436200000000001
7,-0.19542
8,-1.2675
9,-1.2675
10,0.4076
11,1.0106
12,0.9436200000000001
13,0.20659
14,-1.2675
15,-1.2675
16,0.072586
17,1.0106
18,0.9436200000000001
19,-0.06141900000000001
20,-1.2675
21,-1.2675
22,0.27359
23,1.0106
24,0.9436200000000001
25,-0.39643
26,-1.2675
27,-1.2675
28,0.4746
29,1.0106
30,0.9436200000000001
31,-0.86545
32,-1.2675
33,-1.2675
34,1.2116
35,0.9436200000000001
36,0.9436200000000001
37,-0.99945
38,-1.2675
39,-0.93245
40,1.2116
41,1.0106
42,0.87661
43,-0.73144
44,-1.2675
45,-1.2675
46,1.1446
47,1.0106
48,0.9436200000000001
49,-0.12842
50,-1.2675
51,-1.2675
52,0.5416
53,1.0106
54,0.9436200000000001
55,0.3406
56,-1.2675
57,-1.2675
58,-0.06141900000000001
59,1.0776
60,0.9436200000000001
61,0.9436200000000001
62,-1.1335
63,-1.2675
64,-0.79845
65,1.1446
66,1.0106
67,0.87661
68,-0.93245
69,-1.2675
70,-0.46343
71,1.1446
72,1.0106
73,0.87661
74,0.9436200000000001
75,0.87661
76,0.9436200000000001
77,-0.06141900000000001
78,-1.2675
79,-1.2675
80,0.74261
81,0.9436200000000001
82,0.9436200000000001
83,-0.19542
84,-1.2675
85,-1.2675
86,1.0776
87,0.9436200000000001
88,0.87661
89,-1.2675
90,-1.2675
91,-0.06141900000000001
92,1.0776
93,0.9436200000000001
94,-0.46343
95,-1.2675
