time,value
0,-0.22880999999999999
1,-0.20713
2,-0.2261
3,-0.22339
4,-0.20442000000000002
5,-0.23423000000000002
6,-0.20713
7,-0.21525999999999998
8,-0.22339
9,-0.20171
10,-0.23151999999999998
11,-0.19087
12,-0.21525999999999998
13,-0.22068000000000002
14,-0.19358
15,-0.21796999999999997
16,-0.19629000000000002
17,-0.21255
18,-0.21525999999999998
19,-0.19629000000000002
20,-0.2261
21,-0.19899999999999998
22,-0.21255
23,-0.21796999999999997
24,-0.19358
25,-0.22068000000000002
26,-0.17461
27,-0.20984
28,-0.18003
29,-0.18545
30,-0.20984
31,-0.18816
32,-0.20984
33,-0.20442000000000002
34,-0.18816
35,-0.21796999999999997
36,-0.19087
37,-0.21796999999999997
38,-0.19087
39,-0.20713
40,-0.19629000000000002
41,-0.19087
42,-0.21255
43,-0.18274
44,-0.18003
45,-0.18003
46,-0.20713
47,-0.20984
48,-0.19899999999999998
49,-0.21796999999999997
50,-0.19629000000000002
51,-0.22339
52,-0.18545
53,-0.21796999999999997
54,-0.20713
55,-0.20442000000000002
56,-0.21525999999999998
57,-0.20171
58,-0.18545
59,-0.18545
60,-0.20984
61,-0.18274
62,-0.21255
63,-0.19358
64,-0.21525999999999998
65,-0.19358
66,-0.20984
67,-0.20713
68,-0.20442000000000002
69,-0.21255
70,-0.19087
71,-0.20442000000000002
72,-0.18003
73,-0.21796999999999997
74,-0.19358
75,-0.21525999999999998
76,-0.19899999999999998
77,2.08
78,6.0309
79,5.8304
80,4.0608
81,0.32399
82,-0.17461
83,-0.15294000000000002
84,-0.18545
85,-0.17732
86,-0.17461
87,-0.18545
88,-0.17461
89,-0.21525999999999998
90,-0.17732
91,-0.20171
92,-0.19358
93,-0.19358
94,-0.18545
95,-0.18545
