time,value
0,-0.44666000000000006
1,-0.44666000000000006
2,-0.30878
3,-0.44666000000000006
4,-0.44666000000000006
5,-0.44666000000000006
6,-0.44666000000000006
7,-0.30878
8,-0.44666000000000006
9,-0.44666000000000006
10,-0.30878
11,-0.44666000000000006
12,-0.30878
13,-0.30878
14,-0.44666000000000006
15,-0.44666000000000006
16,-0.44666000000000006
17,-0.30878
18,-0.44666000000000006
19,-0.44666000000000006
20,-0.44666000000000006
21,-0.30878
22,-0.44666000000000006
23,-0.44666000000000006
24,-0.44666000000000006
25,-0.44666000000000006
26,-0.30878
27,-0.44666000000000006
28,-0.44666000000000006
29,-0.44666000000000006
30,-0.44666000000000006
31,-0.44666000000000006
32,-0.30878
33,-0.44666000000000006
34,-0.44666000000000006
35,-0.44666000000000006
36,-0.44666000000000006
37,-0.30878
38,-0.44666000000000006
39,-0.44666000000000006
40,-0.44666000000000006
41,-0.30878
42,-0.44666000000000006
43,-0.44666000000000006
44,-0.44666000000000006
45,-0.30878
46,-0.44666000000000006
47,-0.44666000000000006
48,-0.44666000000000006
49,-0.44666000000000006
50,-0.30878
51,-0.44666000000000006
52,-0.44666000000000006
53,-0.44666000000000006
54,-0.30878
55,-0.44666000000000006
56,-0.44666000000000006
57,-0.44666000000000006
58,-0.44666000000000006
59,-0.44666000000000006
60,-0.30878
61,-0.44666000000000006
62,-0.44666000000000006
63,-0.44666000000000006
64,-0.44666000000000006
65,-0.44666000000000006
66,-0.44666000000000006
67,-0.44666000000000006
68,-0.30878
69,-0.44666000000000006
70,-0.44666000000000006
71,-0.30878
72,0.51847
73,2.8623
74,2.8623
75,2.8623
76,2.8623
77,2.3108
78,-0.44666000000000006
79,-0.44666000000000006
80,-0.30878
81,-0.44666000000000006
82,-0.44666000000000006
83,1.3457
84,2.8623
85,2.8623
86,2.7245
87,2.8623
88,2.8623
89,0.93209
90,0.24272
91,0.24272
92,0.24272
93,0.10484
94,0.24272
95,0.10484
