time,value
0,-0.6673
1,-0.6673
2,-0.6673
3,-0.6673
4,-0.6673
5,-0.6673
6,0.39155
7,1.8034
8,1.6269
9,-0.6673
10,-0.6673
11,-0.6673
12,-0.6673
13,-0.6673
14,-0.6673
15,-0.6673
16,-0.13787
17,1.8034
18,1.8034
19,-0.31435
20,-0.6673
21,-0.6673
22,-0.6673
23,-0.6673
24,-0.6673
25,-0.6673
26,-0.6673
27,1.9798
28,1.6269
29,0.56803
30,-0.6673
31,-0.6673
32,-0.6673
33,-0.6673
34,-0.6673
35,-0.6673
36,-0.6673
37,1.9798
38,1.6269
39,1.6269
40,-0.13787
41,-0.6673
42,-0.6673
43,-0.6673
44,-0.6673
45,0.39155
46,1.8034
47,1.6269
48,-0.13787
49,-0.6673
50,-0.6673
51,-0.6673
52,-0.6673
53,-0.6673
54,1.2739
55,1.8034
56,1.6269
57,-0.6673
58,-0.6673
59,-0.6673
60,-0.6673
61,-0.6673
62,-0.6673
63,1.4504
64,1.6269
65,0.9209799999999999
66,-0.6673
67,-0.6673
68,-0.6673
69,-0.6673
70,-0.6673
71,0.39155
72,1.8034
73,1.6269
74,-0.6673
75,-0.6673
76,-0.6673
77,-0.6673
78,-0.6673
79,-0.6673
80,0.7445
81,1.8034
82,1.6269
83,0.9209799999999999
84,-0.6673
85,-0.6673
86,-0.6673
87,-0.6673
88,-0.6673
89,0.39155
90,1.8034
91,1.6269
92,-0.6673
93,-0.6673
94,-0.6673
95,-0.6673
