time,value
0,-0.24408000000000002
1,-0.28121999999999997
2,-0.26141
3,-0.26141
4,-0.26884
5,-0.25893
6,-0.28121999999999997
7,-0.23665
8,-0.28369
9,-0.25645999999999997
10,-0.26636
11,-0.26389
12,-0.25398000000000004
13,-0.27626999999999996
14,-0.23665
15,-0.27874
16,-0.25893
17,-0.26884
18,-0.26636
19,-0.25151
20,-0.28369
21,-0.25151
22,-0.27131
23,-0.26884
24,-0.25893
25,-0.27626999999999996
26,-0.22921999999999998
27,-0.27626999999999996
28,-0.25398000000000004
29,-0.24903000000000003
30,-0.25151
31,-0.24656
32,-0.25645999999999997
33,-0.23913
34,-0.26389
35,-0.25398000000000004
36,-0.2416
37,-0.25893
38,-0.2416
39,-0.27626999999999996
40,-0.25151
41,-0.27131
42,-0.26141
43,-0.26636
44,-0.27874
45,-0.25398000000000004
46,-0.28617
47,-0.26141
48,-0.27874
49,-0.25645999999999997
50,-0.26389
51,-0.27626999999999996
52,-0.25645999999999997
53,-0.27874
54,-0.25645999999999997
55,-0.27626999999999996
56,-0.26884
57,-0.26141
58,-0.26636
59,-0.25151
60,-0.27874
61,-0.24903000000000003
62,-0.27379000000000003
63,-0.27131
64,-0.26141
65,-0.28369
66,-0.25398000000000004
67,-0.28369
68,-0.26636
69,-0.26636
70,-0.25893
71,-0.25398000000000004
72,-0.27379000000000003
73,1.3182
74,5.084
75,4.4749
76,4.2471
77,2.3952
78,3.7544
79,1.8654
80,-0.20942
81,-0.23913
82,-0.20942
83,-0.2218
84,-0.22675
85,-0.23665
86,-0.26636
87,-0.2317
88,-0.26884
89,-0.25151
90,-0.26141
91,-0.26389
92,-0.25151
93,-0.28121999999999997
94,-0.2416
95,-0.27626999999999996
