time,value
0,-0.18084
1,-0.18084
2,-0.18084
3,-0.18084
4,-0.18084
5,-0.18084
6,-0.18084
7,-0.18084
8,-0.18084
9,-0.18084
10,-0.18084
11,-0.18084
12,-0.18084
13,-0.18084
14,-0.18084
15,-0.18084
16,-0.18084
17,-0.18084
18,-0.18084
19,-0.18084
20,-0.18084
21,-0.18084
22,-0.18084
23,-0.18084
24,-0.18084
25,2.0926
26,-0.18084
27,-0.18084
28,-0.18084
29,-0.18084
30,-0.18084
31,-0.18084
32,-0.18084
33,-0.18084
34,-0.18084
35,-0.18084
36,-0.18084
37,-0.18084
38,-0.18084
39,-0.18084
40,-0.18084
41,-0.18084
42,-0.18084
43,-0.18084
44,-0.18084
45,-0.18084
46,-0.18084
47,-0.18084
48,-0.18084
49,2.1959999999999997
50,-0.18084
51,-0.18084
52,-0.18084
53,-0.18084
54,4.3661
55,-0.18084
56,-0.18084
57,-0.18084
58,-0.18084
59,-0.18084
60,-0.18084
61,-0.18084
62,-0.18084
63,-0.18084
64,-0.18084
65,-0.18084
66,-0.18084
67,-0.18084
68,7.9829
69,-0.18084
70,-0.18084
71,-0.18084
72,-0.18084
73,-0.18084
74,-0.18084
75,-0.18084
76,-0.18084
77,-0.18084
78,-0.18084
79,-0.18084
80,-0.18084
81,-0.18084
82,-0.18084
83,-0.18084
84,-0.18084
85,-0.18084
86,-0.18084
87,-0.18084
88,-0.18084
89,-0.18084
90,-0.18084
91,-0.18084
92,-0.18084
93,-0.18084
94,-0.18084
95,-0.18084
