time,value
0,-2.3078
1,-2.3078
2,-2.3078
3,-2.3078
4,-2.3078
5,-2.3078
6,-2.3078
7,-2.3078
8,-2.3078
9,-2.3078
10,-2.3099
11,-2.3096
12,-2.3092
13,-2.3087
14,-2.3079
15,-2.3072
16,-2.3063
17,-2.303
18,-2.3016
19,-2.3004
20,-2.2992
21,-2.2978
22,-2.2959
23,-2.2943
24,-2.2927
25,-2.2909
26,-2.2884
27,-2.2864
28,-2.2844
29,-2.2822
30,-2.2793
31,-2.2769
32,-2.2745
33,-2.2711
34,-2.2685
35,-2.2658
36,-2.263
37,-2.2592
38,-2.2562
39,-2.2532
40,-2.25
41,-2.2458
42,-2.2425
43,-2.2391
44,-2.2316
45,-2.222
46,-2.2186
47,-2.2152
48,-2.2117
49,-2.2069
50,-2.2032
51,-2.1995
52,-2.1937
53,-2.1885
54,-2.1846
55,-2.1806
56,-2.1766
57,-2.1712
58,-2.167
59,-2.1628
60,-2.1586
61,-2.1528
62,-2.1484
63,-2.144
64,-2.1381
65,-2.1335
66,-2.129
67,-2.1243
68,-2.1181
69,-2.1152
70,-2.1104
71,-2.1056
72,-2.0991
73,-2.0942
74,-2.0893
75,-2.0843
76,-2.0776
77,-2.0725
78,-2.0675
79,-2.0623
80,-2.0554
81,-2.0486
82,-2.0433
83,-2.0381
84,-2.031
85,-2.0257
86,-2.0203
87,-2.0149
88,-2.0077
89,-2.0038
90,-1.9983
91,-1.9928
92,-1.9854
93,-1.9798
94,-1.9742
95,-1.9667
96,-1.9609999999999999
97,-1.9554
98,-1.9497
99,-1.9502
100,-1.9526
101,-1.9482
102,-1.9424
103,-1.9346
104,-1.9287
105,-1.9228
106,-1.9169
107,-1.9089
108,-1.903
109,-1.8969999999999998
110,-1.891
111,-1.883
112,-1.8769999999999998
113,-1.8709
114,-1.8648
115,-1.8567
116,-1.8506
117,-1.8445
118,-1.8384
119,-1.8302
120,-1.824
121,-1.8178
122,-1.8116
123,-1.8033
124,-1.7971
125,-1.7917
126,-1.7848
127,-1.7803
128,-1.7741
129,-1.7679
130,-1.7596
131,-1.7533
132,-1.7471
133,-1.7408
134,-1.7312
135,-1.7249
136,-1.7186
137,-1.7123
138,-1.7039
139,-1.6976
140,-1.6912
141,-1.6848
142,-1.6793
143,-1.6738
144,-1.6684
145,-1.6621
146,-1.6536
147,-1.6472
148,-1.6409
149,-1.6345
150,-1.6249
151,-1.6185
152,-1.6121
153,-1.6056
154,-1.5971
155,-1.5906
156,-1.5852
157,-1.5787
158,-1.5723
159,-1.5659
160,-1.5595
161,-1.5509
162,-1.5444
163,-1.538
164,-1.5304
165,-1.5218
166,-1.5153
167,-1.5089
168,-1.5024
169,-1.4937
170,-1.4884
171,-1.4853
172,-1.4777
173,-1.4691
174,-1.4626
175,-1.4561
176,-1.4485
177,-1.4399
178,-1.4334
179,-1.4268
180,-1.4203
181,-1.4116
182,-1.405
183,-1.3997
184,-1.3955
185,-1.3869999999999998
186,-1.3805
187,-1.374
188,-1.3642
189,-1.3577
190,-1.3511
191,-1.3446
192,-1.3338
193,-1.3308
194,-1.3245
195,-1.3179
196,-1.3092
197,-1.3026
198,-1.296
199,-1.2885
200,-1.2797
201,-1.2731
202,-1.2665
203,-1.2612
204,-1.256
205,-1.2487
206,-1.2421
207,-1.2355
208,-1.2268
209,-1.2192
210,-1.2126
211,-1.206
212,-1.1972
213,-1.1906
214,-1.1840000000000002
215,-1.1799
216,-1.1738
217,-1.1684
218,-1.1618
219,-1.153
220,-1.1455
221,-1.1388
222,-1.1322
223,-1.1234
224,-1.1168
225,-1.1101
226,-1.1035
227,-1.0946
228,-1.088
229,-1.0813
230,-1.0747
231,-1.0671
232,-1.0621
233,-1.0593
234,-1.0527
235,-1.0438
236,-1.0371
237,-1.0305
238,-1.0238
239,-1.0149
240,-1.0083
241,-1.0007
242,-0.9940000000000001
243,-0.9851
244,-0.97841
245,-0.9726100000000001
246,-0.9659200000000001
247,-0.9569799999999999
248,-0.94939
249,-0.9435600000000001
250,-0.93461
251,-0.92789
252,-0.92117
253,-0.91445
254,-0.9054700000000001
255,-0.89874
256,-0.89115
257,-0.88441
258,-0.8754200000000001
259,-0.86867
260,-0.86193
261,-0.8551700000000001
262,-0.8461700000000001
263,-0.83941
264,-0.8326399999999999
265,-0.8295600000000001
266,-0.8217
267,-0.8155100000000001
268,-0.80876
269,-0.802
270,-0.79299
271,-0.78623
272,-0.77947
273,-0.7727
274,-0.76367
275,-0.7569
276,-0.7493
277,-0.74252
278,-0.73348
279,-0.72669
280,-0.7207100000000001
281,-0.7116600000000001
282,-0.70486
283,-0.69726
284,-0.6904600000000001
285,-0.6813899999999999
286,-0.6745899999999999
287,-0.66778
288,-0.66097
289,-0.65266
290,-0.64584
291,-0.6382399999999999
292,-0.63142
293,-0.62232
294,-0.6155
295,-0.6086699999999999
296,-0.60183
297,-0.59272
298,-0.5858800000000001
299,-0.5835899999999999
300,-0.579
301,-0.5714
302,-0.56457
303,-0.55774
304,-0.55091
305,-0.54179
306,-0.53496
307,-0.52736
308,-0.52052
309,-0.51139
310,-0.50455
311,-0.4977
312,-0.48857
313,-0.48172
314,-0.47486000000000006
315,-0.46801000000000004
316,-0.45886000000000005
317,-0.45126000000000005
318,-0.44978
319,-0.446
320,-0.43915
321,-0.43228999999999995
322,-0.42543000000000003
323,-0.41857
324,-0.40943
325,-0.40183
326,-0.39651
327,-0.39421999999999996
328,-0.39194
329,-0.38506999999999997
330,-0.3782
331,-0.37363
332,-0.37134
333,-0.36676
334,-0.35988000000000003
335,-0.35301
336,-0.34384000000000003
337,-0.33696
338,-0.33008000000000004
339,-0.3232
340,-0.31401999999999997
341,-0.30713
342,-0.30025
343,-0.29106
344,-0.28417
345,-0.27657
346,-0.26968000000000003
347,-0.26048000000000004
348,-0.25358
349,-0.24668
350,-0.23978000000000002
351,-0.23058
352,-0.22528
353,-0.22089
354,-0.21649000000000002
355,-0.20729
356,-0.2004
357,-0.1935
358,-0.1866
359,-0.1774
360,-0.17049
361,-0.16359
362,-0.15599000000000002
363,-0.14678
364,-0.13987
365,-0.13296
366,-0.12605
367,-0.11682999999999999
368,-0.10991
369,-0.10299000000000001
370,-0.096074
371,-0.09010800000000001
372,-0.085761
373,-0.082088
374,-0.07287300000000001
375,-0.065961
376,-0.059046
377,-0.051451
378,-0.042229
379,-0.035312
380,-0.028392
381,-0.021473
382,-0.01157
383,-0.007234999999999999
384,-0.0051920000000000004
385,0.001721
386,0.01094
387,0.018538
388,0.025453
389,0.032369999999999996
390,0.041597
391,0.049192
392,0.053529999999999994
393,0.05558
394,0.064795
395,0.071707
396,0.079305
397,0.086219
398,0.095179
399,0.097242
400,0.10254
401,0.10944000000000001
402,0.11934000000000002
403,0.12625
404,0.13316
405,0.13822
406,0.1426
407,0.1495
408,0.1571
409,0.16630999999999999
410,0.17321
411,0.1769
412,0.17899
413,0.18499000000000002
414,0.19189
415,0.19949
416,0.20638
417,0.21558000000000002
418,0.21928000000000003
419,0.22369
420,0.2274
421,0.23658
422,0.24418
423,0.25108
424,0.25797
425,0.26309
426,0.26752
427,0.27441
428,0.2813
429,0.29048
430,0.29736999999999997
431,0.30426
432,0.31185999999999997
433,0.32105
434,0.32795
435,0.33485
436,0.34404
437,0.35094000000000003
438,0.35854
439,0.36224
440,0.36735
441,0.37424
442,0.38114000000000003
443,0.38803000000000004
444,0.39723
445,0.40413000000000004
446,0.41173000000000004
447,0.41863
448,0.42783000000000004
449,0.43473
450,0.44164
451,0.44853999999999994
452,0.45683
453,0.46121
454,0.46721
455,0.47411000000000003
456,0.48331
457,0.49021000000000003
458,0.49781000000000003
459,0.50472
460,0.5139199999999999
461,0.5183
462,0.5213
463,0.5259
464,0.5351
465,0.54201
466,0.54892
467,0.55582
468,0.56503
469,0.5696399999999999
470,0.57058
471,0.5738300000000001
472,0.58007
473,0.58401
474,0.58431
475,0.58462
476,0.58396
477,0.58396
478,0.58198
479,0.5793699999999999
480,0.57743
481,0.5755
482,0.57318
483,0.57022
484,0.56328
485,0.55633
486,0.55209
487,0.54723
488,0.54027
489,0.53332
490,0.52573
491,0.51646
492,0.51055
493,0.50634
494,0.50276
495,0.49348000000000003
496,0.48652
497,0.47957
498,0.47198
499,0.4627
500,0.45574
501,0.45047
502,0.44564
503,0.44206000000000006
504,0.4351
505,0.42751000000000006
506,0.41823
507,0.41126999999999997
508,0.40475
509,0.40289
510,0.39468000000000003
511,0.38771
512,0.38354
513,0.37938
514,0.3718
515,0.36482
516,0.35724
517,0.35026
518,0.34268000000000004
519,0.34085
520,0.33671999999999996
521,0.32974000000000003
522,0.31923
523,0.3151
524,0.31099
525,0.304
526,0.2941
527,0.28711
528,0.28012
529,0.27601
530,0.27133
531,0.26434
532,0.25735
533,0.24744000000000002
534,0.24044000000000001
535,0.23346
536,0.22646999999999998
537,0.21715
538,0.21715
539,0.21481999999999998
540,0.20724
541,0.20199
542,0.19907
543,0.19149000000000002
544,0.18391
545,0.17633
546,0.17574
547,0.17340999999999998
548,0.17107999999999998
549,0.16117
550,0.15533
551,0.15125
552,0.14776
553,0.13843
554,0.13143
555,0.12385999999999998
556,0.11685999999999999
557,0.10753
558,0.10054
559,0.097621
560,0.093547
561,0.087154
562,0.079579
563,0.072575
564,0.067958
565,0.06626599999999999
566,0.059254999999999995
567,0.052246
568,0.042901999999999996
569,0.035328
570,0.028319999999999998
571,0.021314
572,0.011974
573,0.0049700000000000005
574,-0.002034
575,-0.007276
576,-0.011883
577,-0.017682
578,-0.024693
579,-0.031702
580,-0.041611
581,-0.049185
582,-0.050867
583,-0.054874
584,-0.06478099999999999
585,-0.072352
586,-0.07399800000000001
587,-0.077971
588,-0.087337
589,-0.09436
590,-0.10192999999999999
591,-0.10895
592,-0.11472
593,-0.11868
594,-0.12209
595,-0.132
596,-0.13722
597,-0.14115
598,-0.14506
599,-0.15496
600,-0.16018
601,-0.16407
602,-0.1656
603,-0.175
604,-0.18255
605,-0.18406
606,-0.18556
607,-0.18752
608,-0.18897
609,-0.1904
610,-0.19180999999999998
611,-0.19366
612,-0.19222
613,-0.18559
614,-0.17895
615,-0.17836
616,-0.17687
617,-0.16978
618,-0.16269
619,-0.15323
620,-0.14657
621,-0.13947
622,-0.13237000000000002
623,-0.12290999999999999
624,-0.11581
625,-0.10870999999999999
626,-0.10801
627,-0.10687
628,-0.099766
629,-0.09306
630,-0.08911799999999999
631,-0.09030099999999999
632,-0.08633500000000001
633,-0.079601
634,-0.075616
635,-0.07436799999999999
636,-0.07273099999999999
637,-0.065605
638,-0.056466999999999996
639,-0.049341
640,-0.042212
641,-0.040554
642,-0.039588
643,-0.035177
644,-0.028041000000000003
645,-0.020906
646,-0.01139
647,-0.004254
648,0.002884
649,0.010020000000000001
650,0.019538
651,0.026676
652,0.033817
653,0.040955
654,0.050475
655,0.057613
656,0.06475399999999999
657,0.074274
658,0.08141699999999999
659,0.088558
660,0.095699
661,0.10522000000000001
662,0.11235999999999999
663,0.11950999999999999
664,0.12665
665,0.13445
666,0.13783
667,0.14088
668,0.14802
669,0.15754
670,0.16468
671,0.17182
672,0.17895999999999998
673,0.18880999999999998
674,0.19595
675,0.2031
676,0.21024
677,0.21975999999999998
678,0.2269
679,0.23404
680,0.24118
681,0.25071
682,0.25308
683,0.25308
684,0.26023
685,0.26565
686,0.26836
687,0.27107
688,0.28093
689,0.2884
690,0.29112
691,0.2935
692,0.29825999999999997
693,0.3054
694,0.31254
695,0.31968
696,0.32953000000000005
697,0.33666999999999997
698,0.34381999999999996
699,0.35096
700,0.36048
701,0.36795
702,0.371
703,0.37201999999999996
704,0.37949
705,0.38663000000000003
706,0.39377
707,0.40091
708,0.41076
709,0.4179
710,0.42504
711,0.43218
712,0.4417
713,0.44883
714,0.45598
715,0.46311
716,0.4655
717,0.46788
718,0.47535
719,0.48045
720,0.48316000000000003
721,0.48588000000000003
722,0.49336
723,0.50356
724,0.50594
725,0.50832
726,0.51308
727,0.52259
728,0.52973
729,0.53687
730,0.544
731,0.55352
732,0.56066
733,0.56814
734,0.57528
735,0.5848
736,0.5919300000000001
737,0.5990800000000001
738,0.60621
739,0.61573
740,0.62117
741,0.62456
742,0.6300100000000001
743,0.63952
744,0.64666
745,0.6538
746,0.66093
747,0.67045
748,0.6775899999999999
749,0.68506
750,0.69458
751,0.70172
752,0.70886
753,0.716
754,0.7255199999999999
755,0.7326600000000001
756,0.7398
757,0.7466
758,0.75645
759,0.7636
760,0.7704
761,0.77755
762,0.7870699999999999
763,0.7945399999999999
764,0.8013600000000001
765,0.8085
766,0.81802
767,0.8251700000000001
768,0.83231
769,0.83945
770,0.84898
771,0.8561200000000001
772,0.8632700000000001
773,0.87041
774,0.88026
775,0.88741
776,0.89456
777,0.9017
778,0.9112299999999999
779,0.91838
780,0.9255200000000001
781,0.93505
782,0.9422
783,0.9490299999999999
784,0.95649
785,0.9660200000000001
786,0.9731700000000001
787,0.98001
788,0.98716
789,0.99669
790,1.0038
791,1.011
792,1.0181
793,1.0277
794,1.0348
795,1.0366
796,1.0381
797,1.0449
798,1.0521
799,1.0592
800,1.0664
801,1.0759
802,1.0831
803,1.0899
804,1.0971
805,1.0995
806,1.0995
807,1.1069
808,1.112
809,1.1147
810,1.1198
811,1.1272
812,1.1373
813,1.1373
814,1.1376
815,1.1406
816,1.1419
817,1.1469
818,1.1541
819,1.1612
820,1.1708
821,1.1779
822,1.1851
823,1.1922
824,1.2018
825,1.2089
826,1.2161
827,1.2232
828,1.2298
829,1.2312
830,1.2329999999999999
831,1.2402
832,1.2497
833,1.2569
834,1.264
835,1.2712
836,1.2807
837,1.2879
838,1.2951
839,1.3025
840,1.31
841,1.3132
842,1.3162
843,1.3257
844,1.3329
845,1.3401
846,1.3472
847,1.3568
848,1.3639
849,1.3711
850,1.3782
851,1.3821
852,1.3813
853,1.381
854,1.3807
855,1.3796
856,1.3793
857,1.379
858,1.3782
859,1.3771
860,1.3723
861,1.3649
862,1.3577
863,1.3482
864,1.341
865,1.3402
866,1.3371
867,1.3296
868,1.3225
869,1.3153
870,1.3081
871,1.2986
872,1.2914
873,1.2842
874,1.2747
875,1.2675
876,1.2603
877,1.2532
878,1.2436
879,1.2362
880,1.229
881,1.2219
882,1.2123
883,1.2075
884,1.2043
885,1.2012
886,1.1938
887,1.1866
888,1.1792
889,1.172
890,1.1648
891,1.1648
892,1.1624
893,1.1553
894,1.1505
895,1.1481
896,1.1431
897,1.1356
898,1.1256
899,1.1181
900,1.111
901,1.1062
902,1.1038
903,1.1009
904,1.0937
905,1.0842
906,1.077
907,1.0696
908,1.0624
909,1.0529
910,1.0478
911,1.0447
912,1.044
913,1.0344
914,1.0272
915,1.0198
916,1.0126
917,1.0074
918,1.0043
919,0.99902
920,0.99185
921,0.9822799999999999
922,0.9751
923,0.96793
924,0.96075
925,0.9511799999999999
926,0.94401
927,0.9368299999999999
928,0.92965
929,0.92009
930,0.91291
931,0.90574
932,0.8983200000000001
933,0.88876
934,0.8815799999999999
935,0.8744
936,0.8686799999999999
937,0.868
938,0.86082
939,0.85364
940,0.8440700000000001
941,0.8368899999999999
942,0.82949
943,0.82231
944,0.81274
945,0.80556
946,0.79838
947,0.79337
948,0.7900699999999999
949,0.78485
950,0.77767
951,0.77049
952,0.7609100000000001
953,0.75351
954,0.74633
955,0.73915
956,0.73393
957,0.7308899999999999
958,0.72568
959,0.71849
960,0.7087100000000001
961,0.70152
962,0.69413
963,0.69112
964,0.68812
965,0.68094
966,0.67375
967,0.6641699999999999
968,0.65698
969,0.6498
970,0.64261
971,0.63283
972,0.62565
973,0.61846
974,0.61128
975,0.6017
976,0.59451
977,0.58733
978,0.58014
979,0.57714
980,0.57416
981,0.56918
982,0.56199
983,0.5524
984,0.5452199999999999
985,0.53803
986,0.53065
987,0.52107
988,0.51388
989,0.5067
990,0.49951
991,0.49635
992,0.4934
993,0.48621000000000003
994,0.47902
995,0.46943
996,0.46224
997,0.45505
998,0.44547
999,0.43828
1000,0.43091
1001,0.42371000000000003
1002,0.41413
1003,0.40694
1004,0.40196
1005,0.39902
1006,0.39609
1007,0.3889
1008,0.38171
1009,0.37451999999999996
1010,0.36493000000000003
1011,0.35774
1012,0.35055
1013,0.34336
1014,0.33376999999999996
1015,0.32658000000000004
1016,0.31939
1017,0.31201999999999996
1018,0.30244
1019,0.29524
1020,0.28805
1021,0.28086
1022,0.27126999999999996
1023,0.26409
1024,0.25689
1025,0.24971
1026,0.24011999999999997
1027,0.23293000000000003
1028,0.22795
1029,0.22485
1030,0.22211
1031,0.21491999999999997
1032,0.20773000000000003
1033,0.19814
1034,0.19095
1035,0.18375
1036,0.17656
1037,0.16697
1038,0.15978
1039,0.15259
1040,0.1454
1041,0.13581
1042,0.12862
1043,0.12125
1044,0.11406
1045,0.10447000000000001
1046,0.09727999999999999
1047,0.090089
1048,0.082898
1049,0.073135
1050,0.070227
1051,0.069732
1052,0.062538
1053,0.05294600000000001
1054,0.045591
1055,0.038395
1056,0.033438999999999997
1057,0.030418
1058,0.027719
1059,0.020523
1060,0.013034
1061,0.010209999999999999
1062,0.009804
1063,0.005004
1064,-0.004728
1065,-0.007386
1066,-0.010159999999999999
1067,-0.010398000000000001
1068,-0.010626
1069,-0.010957999999999999
1070,-0.011268
1071,-0.011465000000000001
1072,-0.011561
1073,-0.011746
1074,-0.009604000000000001
1075,-0.004966
1076,0.004566
1077,0.006816
1078,0.009008
1079,0.011279
1080,0.020891
1081,0.028099000000000002
1082,0.035244
1083,0.042452
1084,0.052064
1085,0.059272000000000005
1086,0.064076
1087,0.066309
1088,0.068513
1089,0.073318
1090,0.08048200000000001
1091,0.08520499999999999
1092,0.087498
1093,0.09464600000000001
1094,0.10182999999999999
1095,0.10413
1096,0.10407999999999999
1097,0.11129000000000001
1098,0.11850999999999999
1099,0.12812
1100,0.13532
1101,0.14253
1102,0.14974
1103,0.15935
1104,0.16172999999999998
1105,0.16172
1106,0.16652999999999998
1107,0.17614000000000002
1108,0.18335
1109,0.19055999999999998
1110,0.19777
1111,0.20739000000000002
1112,0.2146
1113,0.22180999999999998
1114,0.22901999999999997
1115,0.23863
1116,0.24584
1117,0.25305
1118,0.26026
1119,0.26988
1120,0.27709
1121,0.2843
1122,0.29391
1123,0.30112
1124,0.30833
1125,0.31554
1126,0.32515
1127,0.33237
1128,0.33958
1129,0.34679
1130,0.3564
1131,0.36362
1132,0.37083
1133,0.37804
1134,0.38765
1135,0.39486
1136,0.40207
1137,0.40928000000000003
1138,0.41889
1139,0.4261
1140,0.43331000000000003
1141,0.44051999999999997
1142,0.45014
1143,0.45735
1144,0.46456000000000003
1145,0.47176999999999997
1146,0.48138000000000003
1147,0.48858999999999997
1148,0.4958
1149,0.5030100000000001
1150,0.51263
1151,0.51984
1152,0.52705
1153,0.53666
1154,0.54387
1155,0.55108
1156,0.55829
1157,0.5679
1158,0.57512
1159,0.58233
1160,0.58954
1161,0.59915
1162,0.60636
1163,0.61357
1164,0.62078
1165,0.6304
1166,0.63761
1167,0.64482
1168,0.65203
1169,0.66164
1170,0.66885
1171,0.67606
1172,0.6832699999999999
1173,0.69289
1174,0.7001
1175,0.70731
1176,0.7145199999999999
1177,0.72413
1178,0.73134
1179,0.73855
1180,0.7457600000000001
1181,0.75538
1182,0.75539
1183,0.75783
1184,0.76746
1185,0.77467
1186,0.78188
1187,0.78909
1188,0.7987
1189,0.80591
1190,0.81312
1191,0.82035
1192,0.82996
1193,0.8371700000000001
1194,0.8443799999999999
1195,0.85159
1196,0.86121
1197,0.8684200000000001
1198,0.87085
1199,0.87326
1200,0.8804700000000001
1201,0.8877
1202,0.8949299999999999
1203,0.9021600000000001
1204,0.9118
1205,0.9142299999999999
1206,0.91663
1207,0.92384
1208,0.92865
1209,0.93105
1210,0.93826
1211,0.94547
1212,0.9550799999999999
1213,0.96229
1214,0.9695
1215,0.9791200000000001
1216,0.9863299999999999
1217,0.99354
1218,1.0007
1219,1.0104
1220,1.0176
1221,1.0248
1222,1.032
1223,1.0416
1224,1.0488
1225,1.056
1226,1.0633
1227,1.0729
1228,1.0801
1229,1.0873
1230,1.0945
1231,1.1017
1232,1.1042
1233,1.1043
1234,1.1115
1235,1.1212
1236,1.1284
1237,1.1356
1238,1.1428
1239,1.1524
1240,1.1596
1241,1.1669
1242,1.1741
1243,1.1837
1244,1.1909
1245,1.1981
1246,1.2077
1247,1.2149
1248,1.2174
1249,1.2198
1250,1.2294
1251,1.2366
1252,1.2438
1253,1.251
1254,1.2607
1255,1.2631
1256,1.263
1257,1.2702
1258,1.2798
1259,1.287
1260,1.2942
1261,1.3014
1262,1.311
1263,1.3183
1264,1.3254
1265,1.3327
1266,1.3423
1267,1.3495
1268,1.3567
1269,1.3639
1270,1.3735
1271,1.3807
1272,1.3880000000000001
1273,1.3905
1274,1.393
1275,1.4002
1276,1.4075
1277,1.4171
1278,1.4243
1279,1.4315
1280,1.4387
1281,1.4483
1282,1.4555
1283,1.4627
1284,1.4699
1285,1.4746
1286,1.4769
1287,1.4841
1288,1.4913
1289,1.5009
1290,1.5081
1291,1.5153
1292,1.5225
1293,1.5321
1294,1.5394
1295,1.5442
1296,1.5467
1297,1.5516
1298,1.5517
1299,1.5517
1300,1.5519
1301,1.5521
1302,1.5523
1303,1.5524
1304,1.5524
1305,1.5476
1306,1.5478
1307,1.5456
1308,1.5362
1309,1.5290000000000001
1310,1.5266
1311,1.5266
1312,1.5194
1313,1.5122
1314,1.505
1315,1.4978
1316,1.4931
1317,1.4932
1318,1.4884
1319,1.4812
1320,1.4716
1321,1.4644
1322,1.4572
1323,1.4548
1324,1.4501
1325,1.4455
1326,1.4383
1327,1.4336
1328,1.4316
1329,1.4294
1330,1.4222
1331,1.415
1332,1.4054
1333,1.3982
1334,1.396
1335,1.3940000000000001
1336,1.3894
1337,1.3822
1338,1.375
1339,1.3654
1340,1.3581
1341,1.3509
1342,1.3437
1343,1.3342
1344,1.327
1345,1.3198
1346,1.3126
1347,1.3030000000000002
1348,1.2958
1349,1.2886
1350,1.2814
1351,1.2795
1352,1.2775
1353,1.2703
1354,1.2631
1355,1.2535
1356,1.2462
1357,1.239
1358,1.2318
1359,1.2224
1360,1.2152
1361,1.208
1362,1.2008
1363,1.1912
1364,1.1865
1365,1.1845
1366,1.1849
1367,1.1753
1368,1.1681
1369,1.1609
1370,1.1537
1371,1.1441
1372,1.1369
1373,1.1297
1374,1.1201
1375,1.1129
1376,1.1057
1377,1.0985
1378,1.0889
1379,1.0817
1380,1.0745
1381,1.0673
1382,1.0579
1383,1.0507
1384,1.0435
1385,1.0363
1386,1.0267
1387,1.0193
1388,1.0123
1389,1.0051
1390,0.99549
1391,0.98829
1392,0.98109
1393,0.9738899999999999
1394,0.9643
1395,0.9571
1396,0.9571
1397,0.9547
1398,0.94765
1399,0.943
1400,0.94076
1401,0.9385100000000001
1402,0.9290700000000001
1403,0.9220299999999999
1404,0.91979
1405,0.9174
1406,0.9102
1407,0.90317
1408,0.9007700000000001
1409,0.8983700000000001
1410,0.89118
1411,0.88415
1412,0.8771200000000001
1413,0.8678600000000001
1414,0.8656299999999999
1415,0.8658
1416,0.8587799999999999
1417,0.8492
1418,0.8444
1419,0.8444
1420,0.84201
1421,0.83242
1422,0.8252200000000001
1423,0.81803
1424,0.81084
1425,0.80125
1426,0.79406
1427,0.78687
1428,0.77986
1429,0.77027
1430,0.7630899999999999
1431,0.75589
1432,0.74871
1433,0.73912
1434,0.73193
1435,0.7247399999999999
1436,0.71515
1437,0.70796
1438,0.70077
1439,0.69358
1440,0.684
1441,0.67681
1442,0.6694399999999999
1443,0.66225
1444,0.65266
1445,0.64547
1446,0.6382800000000001
1447,0.6310899999999999
1448,0.62151
1449,0.61635
1450,0.6158100000000001
1451,0.6108399999999999
1452,0.60125
1453,0.59406
1454,0.58687
1455,0.57967
1456,0.57009
1457,0.5629
1458,0.55571
1459,0.55553
1460,0.55073
1461,0.54372
1462,0.53672
1463,0.52971
1464,0.52271
1465,0.5205
1466,0.51589
1467,0.5065
1468,0.49931000000000003
1469,0.49931000000000003
1470,0.49692
1471,0.49213
1472,0.48494
1473,0.47775
1474,0.47057
1475,0.46098
1476,0.4538
1477,0.44661000000000006
1478,0.43943000000000004
1479,0.42983999999999994
1480,0.42266000000000004
1481,0.41547
1482,0.40829
1483,0.4077
1484,0.4053
1485,0.40051
1486,0.39332
1487,0.38355
1488,0.37617
1489,0.36879
1490,0.36380999999999997
1491,0.36141
1492,0.35902
1493,0.35183000000000003
1494,0.34943
1495,0.34704
1496,0.34244
1497,0.33544
1498,0.32605
1499,0.31867
1500,0.31129
1501,0.30630999999999997
1502,0.30391
1503,0.30151999999999995
1504,0.29433000000000004
1505,0.29193
1506,0.28954
1507,0.28235
1508,0.27516
1509,0.26798
1510,0.2582
1511,0.25101
1512,0.24383000000000002
1513,0.23664000000000002
1514,0.23126999999999998
1515,0.23071
1516,0.22574
1517,0.21855
1518,0.20895999999999998
1519,0.20177
1520,0.19458
1521,0.18739
1522,0.17781
1523,0.17062
1524,0.16343
1525,0.15624000000000002
1526,0.14665999999999998
1527,0.13947
1528,0.13228
1529,0.13305
1530,0.13125
1531,0.12405999999999999
1532,0.11707999999999999
1533,0.11312
1534,0.11377000000000001
1535,0.10659
1536,0.09940700000000001
1537,0.089834
1538,0.08265499999999999
1539,0.075697
1540,0.068518
1541,0.058945000000000004
1542,0.057236
1543,0.057935
1544,0.050999
1545,0.041433
1546,0.034499
1547,0.027325
1548,0.022787
1549,0.021394999999999997
1550,0.019518
1551,0.012608
1552,0.005441
1553,0.006501000000000001
1554,0.007318000000000001
1555,0.008154999999999999
1556,0.009008
1557,0.010173999999999999
1558,0.01107
1559,0.011984
1560,0.013229
1561,0.014185
1562,0.015158000000000001
1563,0.022302000000000002
1564,0.031827
1565,0.039296
1566,0.046439999999999995
1567,0.051528
1568,0.055234000000000005
1569,0.058286000000000004
1570,0.065427
1571,0.072565
1572,0.08242200000000001
1573,0.08956
1574,0.09261699999999999
1575,0.093648
1576,0.097427
1577,0.098496
1578,0.099585
1579,0.10670999999999999
1580,0.11657999999999999
1581,0.11767999999999999
1582,0.12118
1583,0.1263
1584,0.13618
1585,0.13931
1586,0.14284000000000002
1587,0.14599
1588,0.15547
1589,0.16259
1590,0.1697
1591,0.17919000000000002
1592,0.18631
1593,0.19343
1594,0.20093
1595,0.21041999999999997
1596,0.21754
1597,0.22465
1598,0.23176999999999998
1599,0.24004
1600,0.24120999999999998
1601,0.24634
1602,0.25385
1603,0.25859
1604,0.26095999999999997
1605,0.26334
1606,0.27045
1607,0.28033
1608,0.28309
1609,0.28586
1610,0.28862
1611,0.2985
1612,0.30601
1613,0.31312
1614,0.31786
1615,0.32023
1616,0.32299999999999995
1617,0.33011
1618,0.33721999999999996
1619,0.3471
1620,0.35420999999999997
1621,0.36132
1622,0.37081
1623,0.37634
1624,0.37990999999999997
1625,0.38545999999999997
1626,0.39493
1627,0.40204
1628,0.40915
1629,0.41626
1630,0.42613999999999996
1631,0.43325
1632,0.44036000000000003
1633,0.44747
1634,0.45458000000000004
1635,0.45815
1636,0.45936000000000005
1637,0.46688
1638,0.47635
1639,0.48346000000000006
1640,0.49096999999999996
1641,0.49808
1642,0.50755
1643,0.51466
1644,0.51703
1645,0.5198
1646,0.52495
1647,0.53246
1648,0.53998
1649,0.54276
1650,0.5483100000000001
1651,0.55542
1652,0.55542
1653,0.56015
1654,0.56726
1655,0.57436
1656,0.5814699999999999
1657,0.59135
1658,0.59846
1659,0.60556
1660,0.6126699999999999
1661,0.6221399999999999
1662,0.62925
1663,0.63284
1664,0.63644
1665,0.6439600000000001
1666,0.6510600000000001
1667,0.6581600000000001
1668,0.66527
1669,0.67474
1670,0.68225
1671,0.6893600000000001
1672,0.6964600000000001
1673,0.70594
1674,0.71108
1675,0.7146899999999999
1676,0.7183
1677,0.72819
1678,0.73377
1679,0.7374
1680,0.74063
1681,0.7500899999999999
1682,0.75718
1683,0.7642800000000001
1684,0.77374
1685,0.7812600000000001
1686,0.7883600000000001
1687,0.79545
1688,0.80492
1689,0.81201
1690,0.81201
1691,0.81438
1692,0.81953
1693,0.82706
1694,0.8345799999999999
1695,0.8373700000000001
1696,0.84059
1697,0.84811
1698,0.8528399999999999
1699,0.8528399999999999
1700,0.85757
1701,0.86467
1702,0.8717600000000001
1703,0.87928
1704,0.88875
1705,0.89197
1706,0.8956200000000001
1707,0.90122
1708,0.9106799999999999
1709,0.9177700000000001
1710,0.92486
1711,0.9323899999999999
1712,0.94184
1713,0.9489299999999999
1714,0.95216
1715,0.9586399999999999
1716,0.96144
1717,0.9685299999999999
1718,0.97562
1719,0.9850700000000001
1720,0.99216
1721,0.99925
1722,1.0063
1723,1.0158
1724,1.0229
1725,1.0304
1726,1.0375
1727,1.047
1728,1.0541
1729,1.0611
1730,1.0682
1731,1.0777
1732,1.0848
1733,1.088
1734,1.0917
1735,1.0973
1736,1.1044
1737,1.1115
1738,1.1186
1739,1.1284
1740,1.1355
1741,1.1426
1742,1.1482
1743,1.1523
1744,1.1575
1745,1.1646
1746,1.1745
1747,1.1816
1748,1.1887
1749,1.19
1750,1.1941
1751,1.2012
1752,1.2088
1753,1.212
1754,1.2148
1755,1.2196
1756,1.2266
1757,1.2337
1758,1.2432
1759,1.2502
1760,1.2554
1761,1.2582
1762,1.261
1763,1.2681
1764,1.2752
1765,1.2823
1766,1.2894
1767,1.2917
1768,1.2922
1769,1.2993
1770,1.3092
1771,1.3162
1772,1.3233
1773,1.3285
1774,1.3303
1775,1.334
1776,1.3354
1777,1.3396
1778,1.3401
1779,1.3406
1780,1.3419999999999999
1781,1.3439
1782,1.3453
1783,1.3463
1784,1.3468
1785,1.3449
1786,1.3464
1787,1.3455
1788,1.3465
1789,1.3465
1790,1.3418
1791,1.3348
1792,1.3282
1793,1.3193
1794,1.3175
1795,1.3157
1796,1.3138
1797,1.3049
1798,1.2979
1799,1.2955
1800,1.2932
1801,1.2885
1802,1.2815
1803,1.2744
1804,1.2679
1805,1.2585
1806,1.2562
1807,1.2562
1808,1.2491
1809,1.2444
1810,1.2421
1811,1.2421
1812,1.2327
1813,1.2262
1814,1.2192
1815,1.2121
1816,1.2022
1817,1.1952
1818,1.1881
1819,1.1835
1820,1.1811
1821,1.1741
1822,1.1694
1823,1.1671
1824,1.1624
1825,1.1553
1826,1.1483
1827,1.1413
1828,1.1319
1829,1.1249
1830,1.1178
1831,1.1108
1832,1.1015
1833,1.0944
1834,1.0874
1835,1.0804
1836,1.0734
1837,1.071
1838,1.0687
1839,1.0593
1840,1.057
1841,1.057
1842,1.0523
1843,1.0429
1844,1.0359
1845,1.0289
1846,1.0219
1847,1.0125
1848,1.0055
1849,0.9985
1850,0.9914799999999999
1851,0.98213
1852,0.9751200000000001
1853,0.96811
1854,0.96109
1855,0.95175
1856,0.9447399999999999
1857,0.93773
1858,0.9307200000000001
1859,0.92138
1860,0.9143700000000001
1861,0.9073700000000001
1862,0.90036
1863,0.89102
1864,0.88402
1865,0.87702
1866,0.8700200000000001
1867,0.8606799999999999
1868,0.85311
1869,0.84611
1870,0.83678
1871,0.82978
1872,0.82278
1873,0.81579
1874,0.8064600000000001
1875,0.79947
1876,0.79247
1877,0.7854800000000001
1878,0.7761600000000001
1879,0.76917
1880,0.76218
1881,0.75693
1882,0.75225
1883,0.74875
1884,0.74175
1885,0.7347600000000001
1886,0.72544
1887,0.71844
1888,0.71145
1889,0.7044600000000001
1890,0.69455
1891,0.6875600000000001
1892,0.68057
1893,0.6735800000000001
1894,0.66427
1895,0.65728
1896,0.6503
1897,0.64331
1898,0.634
1899,0.62702
1900,0.6217600000000001
1901,0.61705
1902,0.61353
1903,0.60655
1904,0.59956
1905,0.59024
1906,0.58326
1907,0.57568
1908,0.5686899999999999
1909,0.55938
1910,0.5524
1911,0.54542
1912,0.54189
1913,0.53718
1914,0.53252
1915,0.52494
1916,0.51795
1917,0.50864
1918,0.50165
1919,0.49407
1920,0.48708999999999997
1921,0.47778000000000004
1922,0.4708
1923,0.46381999999999995
1924,0.45969
1925,0.45731000000000005
1926,0.45032
1927,0.44333
1928,0.43635
1929,0.42703
1930,0.42005
1931,0.41307
1932,0.40316
1933,0.39616999999999997
1934,0.38919000000000004
1935,0.38221
1936,0.37290999999999996
1937,0.36593000000000003
1938,0.36412
1939,0.36
1940,0.35009
1941,0.3431
1942,0.33612
1943,0.32914
1944,0.31983
1945,0.31285
1946,0.30587
1947,0.29889
1948,0.28959
1949,0.28201
1950,0.27503
1951,0.26805999999999996
1952,0.25876
1953,0.25179
1954,0.24763000000000002
1955,0.24348000000000003
1956,0.2359
1957,0.22891999999999998
1958,0.22195
1959,0.21497
1960,0.20567
1961,0.19869
1962,0.19172
1963,0.18181
1964,0.17484
1965,0.16787
1966,0.1609
1967,0.15161
1968,0.14465
1969,0.13768
1970,0.13241
1971,0.12762
1972,0.12175
1973,0.11477000000000001
1974,0.1078
1975,0.098511
1976,0.091541
1977,0.084575
1978,0.076988
1979,0.067701
1980,0.060735000000000004
1981,0.053770000000000005
1982,0.046810000000000004
1983,0.037528
1984,0.031009
1985,0.026826999999999997
1986,0.021564
1987,0.012272
1988,0.005307
1989,-0.0016589999999999999
1990,-0.008624
1991,-0.017906000000000002
1992,-0.024869
1993,-0.031827
1994,-0.041104
1995,-0.048062
1996,-0.055018
1997,-0.061971000000000005
1998,-0.071244
1999,-0.078194
2000,-0.085143
2001,-0.09209099999999999
2002,-0.10135
2003,-0.1083
2004,-0.11524000000000001
2005,-0.12219000000000001
2006,-0.13144
2007,-0.13838
2008,-0.14532
2009,-0.15225
2010,-0.16216
2011,-0.16909000000000002
2012,-0.17603
2013,-0.18295999999999998
2014,-0.1922
2015,-0.19286
2016,-0.19715
2017,-0.19912
2018,-0.20836999999999997
2019,-0.21531
2020,-0.22224000000000002
2021,-0.22918000000000002
2022,-0.23842
2023,-0.24536
2024,-0.25228
2025,-0.26152
2026,-0.26845
2027,-0.27537
2028,-0.2823
2029,-0.29153
2030,-0.29844
2031,-0.30535999999999996
2032,-0.3116
2033,-0.31115
2034,-0.31206
2035,-0.31895999999999997
2036,-0.32586
2037,-0.33505999999999997
2038,-0.34195
2039,-0.34884
2040,-0.35573
2041,-0.36491999999999997
2042,-0.37109000000000003
2043,-0.37797
2044,-0.38485
2045,-0.39402
2046,-0.4009
2047,-0.40776999999999997
2048,-0.41465
2049,-0.4238
2050,-0.43067
2051,-0.43451000000000006
2052,-0.43458
2053,-0.4369
2054,-0.44375
2055,-0.45059
2056,-0.45971000000000006
2057,-0.46655
2058,-0.47339
2059,-0.48023000000000005
2060,-0.48933999999999994
2061,-0.49538999999999994
2062,-0.50222
2063,-0.5090399999999999
2064,-0.5181399999999999
2065,-0.52495
2066,-0.53177
2067,-0.53779
2068,-0.53541
2069,-0.53301
2070,-0.53285
2071,-0.5304
2072,-0.53328
2073,-0.53922
2074,-0.5420699999999999
2075,-0.53955
2076,-0.5361600000000001
2077,-0.5336
2078,-0.5310199999999999
2079,-0.52842
2080,-0.5249199999999999
2081,-0.52227
2082,-0.51961
2083,-0.5169199999999999
2084,-0.50843
2085,-0.50175
2086,-0.49506000000000006
2087,-0.48613
2088,-0.47855
2089,-0.47185
2090,-0.46515
2091,-0.45801000000000003
2092,-0.45533
2093,-0.44998
2094,-0.44238999999999995
2095,-0.43523
2096,-0.43028999999999995
2097,-0.42493000000000003
2098,-0.41826
2099,-0.40844
2100,-0.40176
2101,-0.39508000000000004
2102,-0.39237
2103,-0.38650999999999996
2104,-0.37984
2105,-0.37226
2106,-0.36558
2107,-0.35667
2108,-0.35131
2109,-0.34636999999999996
2110,-0.34141
2111,-0.3316
2112,-0.32533
2113,-0.32036
2114,-0.31629
2115,-0.30741
2116,-0.30075
2117,-0.29317
2118,-0.28428000000000003
2119,-0.28153
2120,-0.27654
2121,-0.26896
2122,-0.26009
2123,-0.25342
2124,-0.24584
2125,-0.23918000000000003
2126,-0.23029000000000002
2127,-0.22361999999999999
2128,-0.22088000000000002
2129,-0.2159
2130,-0.20831999999999998
2131,-0.20074
2132,-0.19667
2133,-0.19168
2134,-0.18539
2135,-0.17874
2136,-0.17207999999999998
2137,-0.16543
2138,-0.15563
2139,-0.14897
2140,-0.14231
2141,-0.13694
2142,-0.13104000000000002
2143,-0.12475
2144,-0.1181
2145,-0.11052000000000001
2146,-0.10164
2147,-0.09498
2148,-0.08999800000000001
2149,-0.084073
2150,-0.077423
2151,-0.07077
2152,-0.06319
2153,-0.054314
2154,-0.050247
2155,-0.04525
2156,-0.038958
2157,-0.030092
2158,-0.022513
2159,-0.015858
2160,-0.009203
2161,-0.003281
2162,-0.00048302
2163,0.0061600000000000005
2164,0.012808000000000002
2165,0.022602
2166,0.029251999999999997
2167,0.034615
2168,0.039620999999999996
2169,0.046851
2170,0.054429
2171,0.060728
2172,0.065759
2173,0.072065
2174,0.078696
2175,0.085332
2176,0.09291100000000001
2177,0.10176
2178,0.10457999999999999
2179,0.10962000000000001
2180,0.11719
2181,0.12382
2182,0.1314
2183,0.13802999999999999
2184,0.14561
2185,0.15065
2186,0.15474000000000002
2187,0.16232
2188,0.17084000000000002
2189,0.1759
2190,0.18095999999999998
2191,0.18853
2192,0.19705999999999999
2193,0.20214000000000001
2194,0.20626
2195,0.21383000000000002
2196,0.2214
2197,0.2265
2198,0.2294
2199,0.23697
2200,0.24577
2201,0.24866999999999997
2202,0.25379
2203,0.26136
2204,0.27111999999999997
2205,0.27307
2206,0.2782
2207,0.28456
2208,0.29431
2209,0.29945
2210,0.30461
2211,0.31316
2212,0.31973
2213,0.32489
2214,0.32788
2215,0.33405999999999997
2216,0.33707
2217,0.34126999999999996
2218,0.34881999999999996
2219,0.35638000000000003
2220,0.36159
2221,0.36463
2222,0.37218
2223,0.38190999999999997
2224,0.38495999999999997
2225,0.38802
2226,0.3911
2227,0.39521999999999996
2228,0.39833
2229,0.40360999999999997
2230,0.40674
2231,0.41093999999999997
2232,0.4141
2233,0.41727
2234,0.41831
2235,0.42258
2236,0.4258
2237,0.42903
2238,0.43228
2239,0.43662
2240,0.43233999999999995
2241,0.42701000000000006
2242,0.42491999999999996
2243,0.42608999999999997
2244,0.42617
2245,0.42088000000000003
2246,0.4156
2247,0.41681999999999997
2248,0.41806000000000004
2249,0.41168999999999994
2250,0.4032
2251,0.39684
2252,0.39048
2253,0.38411999999999996
2254,0.37565
2255,0.3693
2256,0.36296
2257,0.35662
2258,0.34817
2259,0.34184000000000003
2260,0.33551
2261,0.32919
2262,0.32266
2263,0.3171
2264,0.31056999999999996
2265,0.30424
2266,0.29466
2267,0.28833000000000003
2268,0.28201
2269,0.27644
2270,0.26971999999999996
2271,0.26339
2272,0.25706
2273,0.24958000000000002
2274,0.24115999999999999
2275,0.23558
2276,0.23001
2277,0.22253
2278,0.21505
2279,0.21064000000000002
2280,0.20508
2281,0.19856
2282,0.19222
2283,0.18589
2284,0.17840999999999999
2285,0.16998
2286,0.16441
2287,0.16096
2288,0.15559
2289,0.14714000000000002
2290,0.14082
2291,0.13449
2292,0.12702
2293,0.11859000000000001
2294,0.11227999999999999
2295,0.11017
2296,0.10459
2297,0.09996000000000001
2298,0.093636
2299,0.08731799999999999
2300,0.079841
2301,0.071424
2302,0.066054
2303,0.062572
2304,0.056996000000000005
2305,0.048567
2306,0.04225
2307,0.035939
2308,0.026363
2309,0.020059
2310,0.01376
2311,0.007465
2312,0.00068498
2313,-0.007018000000000001
2314,-0.013323
2315,-0.019624000000000003
2316,-0.028017
2317,-0.035485
2318,-0.041772000000000004
2319,-0.048057
2320,-0.055782000000000005
2321,-0.061401
2322,-0.068869
2323,-0.075159
2324,-0.084717
2325,-0.090998
2326,-0.09754700000000001
2327,-0.10318
2328,-0.10972
2329,-0.11600999999999999
2330,-0.12229000000000001
2331,-0.12975
2332,-0.13812
2333,-0.14376
2334,-0.1473
2335,-0.15475999999999998
2336,-0.16314
2337,-0.1706
2338,-0.17687999999999998
2339,-0.18342999999999998
2340,-0.18905999999999998
2341,-0.19352
2342,-0.1998
2343,-0.20935
2344,-0.21563000000000002
2345,-0.2219
2346,-0.22635999999999998
2347,-0.23318000000000003
2348,-0.24065
2349,-0.24811
2350,-0.25439
2351,-0.26274000000000003
2352,-0.26811
2353,-0.27376
2354,-0.27731
2355,-0.28568000000000005
2356,-0.29195
2357,-0.29822
2358,-0.30568
2359,-0.31401999999999997
2360,-0.32028
2361,-0.32653000000000004
2362,-0.33011999999999997
2363,-0.33698
2364,-0.34324
2365,-0.3495
2366,-0.35695
2367,-0.36528
2368,-0.37065
2369,-0.37633
2370,-0.38199
2371,-0.38825
2372,-0.39450999999999997
2373,-0.40076
2374,-0.40908
2375,-0.41652
2376,-0.42275
2377,-0.42898000000000003
2378,-0.43728
2379,-0.44348999999999994
2380,-0.44922
2381,-0.45493
2382,-0.46445
2383,-0.47067
2384,-0.47688
2385,-0.48431
2386,-0.49259
2387,-0.49878999999999996
2388,-0.50621
2389,-0.50989
2390,-0.5177
2391,-0.52391
2392,-0.5301100000000001
2393,-0.5363
2394,-0.54455
2395,-0.55197
2396,-0.55815
2397,-0.5643199999999999
2398,-0.5725399999999999
2399,-0.5787
2400,-0.5845
2401,-0.59029
2402,-0.5977100000000001
2403,-0.60387
2404,-0.6100300000000001
2405,-0.6182300000000001
2406,-0.62563
2407,-0.6317699999999999
2408,-0.6379
2409,-0.64607
2410,-0.6521899999999999
2411,-0.65881
2412,-0.66466
2413,-0.67128
2414,-0.6774100000000001
2415,-0.68353
2416,-0.69091
2417,-0.70034
2418,-0.70416
2419,-0.71001
2420,-0.71613
2421,-0.72429
2422,-0.7316699999999999
2423,-0.73778
2424,-0.74312
2425,-0.75027
2426,-0.7569
2427,-0.7630100000000001
2428,-0.7703899999999999
2429,-0.77853
2430,-0.78462
2431,-0.78719
2432,-0.79435
2433,-0.80173
2434,-0.80911
2435,-0.81371
2436,-0.82084
2437,-0.82619
2438,-0.83231
2439,-0.83842
2440,-0.84783
2441,-0.8539200000000001
2442,-0.8598100000000001
2443,-0.86365
2444,-0.87231
2445,-0.8784200000000001
2446,-0.8863200000000001
2447,-0.89218
2448,-0.8995700000000001
2449,-0.9056799999999999
2450,-0.91307
2451,-0.91917
2452,-0.9258
2453,-0.9316700000000001
2454,-0.93625
2455,-0.94237
2456,-0.9505100000000001
2457,-0.9578899999999999
2458,-0.96398
2459,-0.9685799999999999
2460,-0.9757399999999999
2461,-0.98109
2462,-0.98719
2463,-0.9966
2464,-1.0027
2465,-1.0088
2466,-1.0126
2467,-1.0218
2468,-1.0292
2469,-1.0353
2470,-1.0392
2471,-1.0471
2472,-1.0545
2473,-1.0606
2474,-1.0667
2475,-1.0761
2476,-1.0794
2477,-1.0853
2478,-1.0891
2479,-1.0985
2480,-1.1046
2481,-1.1105
2482,-1.1143
2483,-1.1217
2484,-1.1278
2485,-1.1352
2486,-1.1413
2487,-1.1487
2488,-1.1546
2489,-1.1584
2490,-1.1645
2491,-1.1726
2492,-1.18
2493,-1.1861
2494,-1.1927
2495,-1.1986
2496,-1.2032
2497,-1.2093
2498,-1.2174
2499,-1.2248
2500,-1.2309
2501,-1.2355
2502,-1.2427
2503,-1.248
2504,-1.2541
2505,-1.2615
2506,-1.2696
2507,-1.2756
2508,-1.2782
2509,-1.2842
2510,-1.2908
2511,-1.2969
2512,-1.3042
2513,-1.3103
2514,-1.3197
2515,-1.3236
2516,-1.3295
2517,-1.3356
2518,-1.3436
2519,-1.351
2520,-1.357
2521,-1.3637
2522,-1.3709
2523,-1.3783
2524,-1.3857
2525,-1.3949
2526,-1.3988
2527,-1.4049
2528,-1.4122
2529,-1.4202
2530,-1.4241
2531,-1.4294
2532,-1.4355
2533,-1.4449
2534,-1.4509
2535,-1.4569999999999999
2536,-1.4609
2537,-1.4681
2538,-1.4755
2539,-1.4816
2540,-1.4875
2541,-1.4947
2542,-1.5008
2543,-1.5081
2544,-1.5142
2545,-1.5223
2546,-1.5289
2547,-1.5349
2548,-1.5395
2549,-1.5489
2550,-1.5555
2551,-1.5614
2552,-1.5659999999999998
2553,-1.5754
2554,-1.5808
2555,-1.5867
2556,-1.5946
2557,-1.6019999999999999
2558,-1.6073
2559,-1.6132
2560,-1.619
2561,-1.6264
2562,-1.6325
2563,-1.6384
2564,-1.6455
2565,-1.6516
2566,-1.659
2567,-1.6648
2568,-1.6686
2569,-1.676
2570,-1.6822
2571,-1.6883
2572,-1.6965
2573,-1.7039
2574,-1.71
2575,-1.7161
2576,-1.724
2577,-1.7278
2578,-1.7352
2579,-1.7413
2580,-1.7494
2581,-1.7568
2582,-1.7629
2583,-1.7689
2584,-1.777
2585,-1.7816
2586,-1.7856
2587,-1.7922
2588,-1.7983
2589,-1.8043
2590,-1.8103
2591,-1.8184
2592,-1.8257
2593,-1.8317
2594,-1.8376
2595,-1.8456
2596,-1.8515
2597,-1.8574
2598,-1.8633
2599,-1.8714
2600,-1.8775
2601,-1.8848
2602,-1.8907
2603,-1.8985
2604,-1.9044
2605,-1.9102
2606,-1.916
2607,-1.9252
2608,-1.931
2609,-1.9367
2610,-1.9425
2611,-1.9501
2612,-1.9558
2613,-1.9614
2614,-1.9671
2615,-1.9746
2616,-1.9801
2617,-1.9857
2618,-1.9937
2619,-1.9967
2620,-2.0038
2621,-2.0094
2622,-2.0168
2623,-2.0223
2624,-2.0293
2625,-2.0348
2626,-2.0421
2627,-2.0475
2628,-2.0528
2629,-2.0582
2630,-2.0652
2631,-2.0705
2632,-2.0757
2633,-2.0793
2634,-2.0861
2635,-2.0912
2636,-2.0963
2637,-2.1014
2638,-2.108
2639,-2.113
2640,-2.1179
2641,-2.1228
2642,-2.1292
2643,-2.134
2644,-2.1387
2645,-2.1434
2646,-2.1496
2647,-2.1542
2648,-2.1587
2649,-2.1647
2650,-2.1691
2651,-2.1735
2652,-2.1778
2653,-2.1835
2654,-2.1877
2655,-2.1918
2656,-2.1959
2657,-2.2033
2658,-2.2073
2659,-2.2112
2660,-2.2151
2661,-2.2201
2662,-2.2238
2663,-2.2275
2664,-2.231
2665,-2.2357
2666,-2.2391
2667,-2.2425
2668,-2.2458
2669,-2.25
2670,-2.2532
2671,-2.2562
2672,-2.2592
2673,-2.263
2674,-2.2658
2675,-2.2685
2676,-2.2711
2677,-2.2745
2678,-2.2769
2679,-2.2793
2680,-2.2822
2681,-2.2844
2682,-2.2864
2683,-2.2884
2684,-2.2909
2685,-2.2927
2686,-2.2943
2687,-2.2959
2688,-2.2978
2689,-2.2992
2690,-2.3004
2691,-2.3016
2692,-2.303
2693,-2.3039
2694,-2.3048
2695,-2.3055
2696,-2.3063
2697,-2.3068
2698,-2.3072
2699,-2.3075
2700,-2.3078
2701,-2.3078
2702,-2.3078
2703,-2.3078
2704,-2.3078
2705,-2.3078
2706,-2.3078
2707,-2.3078
2708,-2.3078
