[<text>
<title>penn traffic co &lt;pnf&gt; 4th qtr jan 31 net</title>
<dateline>    johnstown, penn., march 24 -
    </dateline>shr 33 cts vs 46 cts
    net 1,350,000 vs 1,886,000
    revs 150.1 mln vs 127.9 mln
    year
    shr 1.76 dlr vs 1.59 dlr
    net 7,300,000 vs 6,567,000
    revs 548 mln vs 510.5 mln
    note: first three quarters of 1986 have been restated to
reflect adoption in 4th qtr of new pension accounting procedure
which increased net income in first three qtrs 204,000 dlrs or
five cts per share. procedure increased fourth qtr income
73,000 dlrs or two cts per share.
 reuter
</text>]