time,value
0,-0.18992
1,-0.18992
2,-0.18992
3,-0.18992
4,-0.18992
5,-0.18992
6,-0.18992
7,-0.18992
8,-0.18992
9,-0.18992
10,-0.18992
11,-0.18992
12,-0.18992
13,-0.18992
14,-0.18992
15,-0.18992
16,-0.18992
17,-0.18992
18,-0.18992
19,-0.18992
20,-0.18992
21,-0.18992
22,-0.18992
23,-0.18992
24,-0.18992
25,-0.18992
26,-0.18992
27,-0.18992
28,-0.18992
29,-0.18992
30,-0.18992
31,-0.18992
32,-0.18992
33,-0.18992
34,-0.18992
35,-0.18992
36,-0.18992
37,7.5144
38,-0.18992
39,-0.18992
40,-0.18992
41,-0.18992
42,-0.18992
43,-0.18992
44,-0.18992
45,-0.18992
46,-0.18992
47,-0.18992
48,-0.18992
49,-0.18992
50,-0.18992
51,-0.18992
52,-0.18992
53,-0.18992
54,-0.18992
55,-0.18992
56,-0.18992
57,-0.18992
58,-0.18992
59,3.5855
60,-0.18992
61,-0.18992
62,-0.18992
63,-0.18992
64,-0.18992
65,-0.18992
66,-0.18992
67,-0.18992
68,-0.18992
69,-0.18992
70,-0.18992
71,-0.18992
72,-0.18992
73,-0.18992
74,-0.18992
75,-0.18992
76,-0.18992
77,-0.18992
78,-0.18992
79,-0.18992
80,-0.18992
81,-0.18992
82,-0.18992
83,-0.18992
84,-0.18992
85,4.1994
86,-0.18992
87,-0.18992
88,-0.18992
89,-0.18992
90,-0.18992
91,-0.18992
92,-0.18992
93,2.1736
94,-0.18992
95,-0.18992
