time,value
0,-0.74849
1,0.56479
2,1.6905
3,-0.74849
4,-0.74849
5,-0.74849
6,-0.37327
7,2.0657
8,-0.37327
9,-0.74849
10,-0.74849
11,-0.74849
12,1.6905
13,0.37718
14,-0.74849
15,-0.74849
16,-0.74849
17,0.9400200000000001
18,1.3152
19,-0.74849
20,-0.74849
21,-0.74849
22,-0.18566
23,2.0657
24,-0.18566
25,-0.74849
26,-0.74849
27,-0.74849
28,1.3152
29,0.7524
30,-0.74849
31,-0.74849
32,-0.74849
33,1.3152
34,0.9400200000000001
35,-0.74849
36,-0.74849
37,-0.74849
38,0.18957000000000002
39,1.8781
40,-0.74849
41,-0.74849
42,-0.74849
43,1.6905
44,0.56479
45,-0.74849
46,-0.74849
47,-0.74849
48,0.7524
49,1.8781
50,0.18957000000000002
51,-0.74849
52,-0.74849
53,0.0019543
54,1.8781
55,-0.18566
56,-0.74849
57,-0.74849
58,-0.74849
59,2.0657
60,0.37718
61,-0.74849
62,-0.74849
63,-0.74849
64,1.3152
65,0.9400200000000001
66,-0.74849
67,-0.74849
68,-0.74849
69,0.9400200000000001
70,1.3152
71,-0.74849
72,-0.74849
73,-0.74849
74,0.37718
75,1.8781
76,-0.74849
77,-0.74849
78,-0.74849
79,-0.18566
80,1.8781
81,-0.18566
82,-0.74849
83,-0.74849
84,0.18957000000000002
85,1.8781
86,-0.74849
87,-0.74849
88,-0.74849
89,0.18957000000000002
90,2.0657
91,-0.74849
92,-0.74849
93,-0.74849
94,0.0019543
95,1.8781
