time,value
0,9.3092
1,1.9365
2,0.21808000000000002
3,0.014821
4,-0.040612999999999996
5,-0.24386999999999998
6,-0.26235
7,-0.096046
8,-0.059091
9,-0.22539
10,-0.26235
11,-0.26235
12,-0.11452000000000001
13,0.23655
14,0.033299
15,-0.20690999999999998
16,-0.24386999999999998
17,-0.22539
18,-0.22539
19,-0.022135
20,-0.18844
21,-0.22539
22,-0.18844
23,-0.040612999999999996
24,-0.0036571
25,0.10720999999999999
26,-0.20690999999999998
27,-0.26235
28,-0.22539
29,1.0865
30,-0.16996
31,-0.022135
32,0.051775999999999996
33,0.014821
34,-0.0036571
35,-0.18844
36,-0.18844
37,0.033299
38,-0.133
39,-0.26235
40,-0.24386999999999998
41,-0.26235
42,-0.077568
43,0.18112
44,0.051775999999999996
45,-0.22539
46,-0.28081999999999996
47,-0.28081999999999996
48,-0.26235
49,-0.022135
50,-0.18844
51,-0.28081999999999996
52,-0.040612999999999996
53,-0.0036571
54,-0.077568
55,-0.040612999999999996
56,-0.15148
57,-0.26235
58,-0.28081999999999996
59,-0.28081999999999996
60,-0.26235
61,-0.0036571
62,0.070254
63,-0.059091
64,-0.096046
65,-0.24386999999999998
66,-0.28081999999999996
67,-0.040612999999999996
68,-0.15148
69,-0.26235
70,-0.28081999999999996
71,-0.20690999999999998
72,-0.0036571
73,0.18112
74,-0.077568
75,-0.28081999999999996
76,-0.26235
77,-0.24386999999999998
78,-0.2993
79,-0.059091
80,-0.133
81,-0.077568
82,-0.059091
83,-0.059091
84,-0.22539
85,-0.040612999999999996
86,-0.16996
87,-0.28081999999999996
88,-0.26235
89,-0.26235
90,-0.33626
91,0.16264
92,0.088732
93,-0.096046
94,-0.33626
95,-0.26235
