time,value
0,0.62105
1,0.52345
2,0.6429199999999999
3,0.71072
4,0.9978
5,0.84567
6,0.8227200000000001
7,0.8417399999999999
8,0.79288
9,0.84162
10,0.80269
11,0.65766
12,0.59708
13,0.56766
14,0.5488
15,0.54145
16,0.5415800000000001
17,0.49226000000000003
18,0.54948
19,0.55313
20,0.56419
21,0.60833
22,0.60158
23,0.57687
24,0.57213
25,0.5844199999999999
26,0.5954
27,0.5846600000000001
28,0.58687
29,0.60883
30,0.62772
31,0.6624
32,0.59917
33,0.5472899999999999
34,0.44687
35,0.42625
36,0.52718
37,0.24974000000000002
38,-0.10091
39,-0.52945
40,-0.8806700000000001
41,-0.89407
42,-1.0664
43,-1.2324
44,-1.4195
45,-1.6547
46,-1.8794
47,-2.0936
48,-2.1615
49,-2.4186
50,-2.7056
51,-2.8715
52,-2.7869
53,-2.7193
54,-2.3225
55,-2.1089
56,-1.8744
57,-1.609
58,-1.228
59,-1.0203
60,-1.1254
61,-0.9746
62,-0.78969
63,-0.7311
64,-0.75237
65,0.26078
66,0.38263
67,-0.6603600000000001
68,-0.6351399999999999
69,0.22637
70,-0.57212
71,-1.0469
72,-0.15606
73,0.73468
74,-0.044877
75,-1.5461
76,-1.268
77,-0.4673
78,-0.23424
79,-0.70191
80,-1.0177
81,-0.71348
82,-0.39039
83,-0.43481000000000003
84,-0.47073999999999994
85,-0.6187600000000001
86,-0.6241800000000001
87,-0.43706999999999996
88,-0.4834
89,-0.62543
90,-0.50061
91,-0.41236000000000006
92,-0.37584
93,-0.41839
94,-0.36116
95,-0.36104
96,-0.42841
97,-0.47823999999999994
98,-0.43854
99,-0.34121999999999997
100,-0.45048
101,-0.46178
102,-0.46271
103,-0.36391
104,-0.45998999999999995
105,-0.50271
106,-0.33421999999999996
107,-0.44283999999999996
108,-0.31522
109,-0.32479
110,-0.43408
111,-0.47378000000000003
112,-0.27541
113,-0.39687
114,-0.32286
115,-0.30791
116,-0.38168
117,-0.3631
118,-0.28043
119,-0.26793
120,-0.23495
121,-0.25016
122,-0.33741
123,-0.066697
124,0.027075
125,0.1243
126,0.076396
127,0.44143999999999994
128,0.31044
129,0.29253
130,-0.42481
131,-0.13014
132,-0.063079
133,0.01462
134,-0.42093
135,-0.64742
136,-0.7471300000000001
137,-0.8737299999999999
138,-1.0601
139,-1.3719
140,-1.7964
141,-2.1479
142,-2.2127
143,-2.4513
144,-2.8297
145,-2.6592
146,-2.5464
147,-2.7646
148,-2.8064
149,-2.9831
150,-2.4535
151,-2.5810000000000004
152,-2.5982
153,-2.4705
154,-1.8635
155,-1.6195
156,-1.4541
157,-1.6031
158,-1.608
159,-1.1636
160,-0.96516
161,-0.93066
162,-0.99966
163,-0.81134
164,-0.5027
165,-0.27381
166,-0.18135
167,0.026441000000000003
168,0.16832
169,0.36714
170,0.61644
171,0.5303399999999999
172,0.41423999999999994
173,0.40931
174,0.33324000000000004
175,0.47347
176,0.4876
177,0.5612199999999999
178,0.7108899999999999
179,0.67755
180,0.58095
181,0.60616
182,0.6164
183,0.62317
184,0.7431
185,0.7615
186,0.79052
187,0.68899
188,0.6483
189,0.7478600000000001
190,0.61212
191,0.59596
192,0.61497
193,0.6743
194,0.67167
195,0.65983
196,0.8513299999999999
197,0.69524
198,0.68825
199,0.66142
200,0.68865
201,0.8340200000000001
202,0.76805
203,0.86287
204,0.83741
205,0.73312
206,0.6147199999999999
207,0.7368
208,0.79137
209,0.73975
210,0.7391300000000001
211,0.83225
212,0.84391
213,0.8710700000000001
214,0.8645700000000001
215,0.76055
216,0.73359
217,0.7169399999999999
218,0.7672399999999999
219,0.62647
220,0.72865
221,0.58139
222,0.66714
223,0.75203
224,0.73485
225,0.7509600000000001
226,0.79071
227,0.7750600000000001
228,0.72963
229,0.86929
230,0.86088
231,0.86913
232,0.77161
233,0.88828
234,0.76986
235,0.7782600000000001
236,0.64342
237,0.74336
238,0.74802
239,0.88465
240,0.71675
241,0.74574
242,0.69662
243,0.63726
244,0.76532
245,0.76063
246,0.7777
247,0.76915
248,0.772
249,0.76982
250,0.7761600000000001
251,0.7729199999999999
252,0.8926799999999999
253,0.8891100000000001
254,0.7722399999999999
255,0.77089
256,0.8789799999999999
257,0.7915800000000001
258,0.69
259,0.78042
260,0.78779
261,0.79109
262,0.7822100000000001
263,0.78383
264,0.78362
265,0.77171
266,0.6826399999999999
267,0.6329899999999999
268,0.7730100000000001
269,0.77322
270,0.77091
271,0.77657
272,0.9252
273,0.8441700000000001
274,0.78785
275,0.7869
276,0.83885
277,0.83706
278,0.8302
279,0.76342
280,0.81958
281,0.77262
282,0.7709699999999999
283,0.72747
284,0.87695
285,0.7737
286,0.76718
287,0.7690899999999999
288,0.79271
289,0.7581100000000001
290,0.7442300000000001
291,0.7431399999999999
292,0.74674
293,0.76013
294,0.7649
295,0.76545
296,0.7605
297,0.62569
298,0.74831
299,0.74612
