time,value
0,-0.42302
1,0.28944000000000003
2,-0.42302
3,-0.42302
4,-0.42302
5,0.28944000000000003
6,-0.42302
7,-0.42302
8,0.28944000000000003
9,-0.42302
10,-0.42302
11,-0.42302
12,0.28944000000000003
13,-0.42302
14,-0.42302
15,-0.42302
16,0.28944000000000003
17,-0.42302
18,-0.42302
19,-0.42302
20,0.28944000000000003
21,-0.42302
22,-0.42302
23,-0.42302
24,0.28944000000000003
25,-0.42302
26,-0.42302
27,0.28944000000000003
28,-0.42302
29,-0.42302
30,-0.42302
31,0.28944000000000003
32,-0.42302
33,-0.42302
34,-0.42302
35,0.28944000000000003
36,-0.42302
37,-0.42302
38,5.2766
39,1.0019
40,-0.42302
41,0.28944000000000003
42,-0.42302
43,-0.42302
44,-0.42302
45,0.28944000000000003
46,-0.42302
47,-0.42302
48,-0.42302
49,0.28944000000000003
50,3.1393
51,4.5642
52,1.0019
53,-0.42302
54,-0.42302
55,-0.42302
56,0.28944000000000003
57,-0.42302
58,-0.42302
59,-0.42302
60,0.28944000000000003
61,-0.42302
62,-0.42302
63,-0.42302
64,0.28944000000000003
65,-0.42302
66,-0.42302
67,-0.42302
68,0.28944000000000003
69,-0.42302
70,-0.42302
71,-0.42302
72,0.28944000000000003
73,-0.42302
74,-0.42302
75,-0.42302
76,2.4268
77,3.8517
78,-0.42302
79,0.28944000000000003
80,-0.42302
81,-0.42302
82,-0.42302
83,0.28944000000000003
84,-0.42302
85,-0.42302
86,-0.42302
87,0.28944000000000003
88,-0.42302
89,-0.42302
90,-0.42302
91,0.28944000000000003
92,-0.42302
93,-0.42302
94,-0.42302
95,0.28944000000000003
