time,value
0,-2.2945
1,-2.3019
2,-2.3094
3,-2.3119
4,-2.3119
5,-2.3119
6,-2.3119
7,-2.3119
8,-2.3119
9,-2.3119
10,-2.3118
11,-2.3116
12,-2.3137
13,-2.3131
14,-2.3125
15,-2.3117
16,-2.3109
17,-2.3099
18,-2.3194
19,-2.3267
20,-2.3256
21,-2.3243
22,-2.3229
23,-2.3208
24,-2.3192
25,-2.3174
26,-2.3155
27,-2.3151
28,-2.313
29,-2.3107
30,-2.3083
31,-2.3058
32,-2.3023
33,-2.2996
34,-2.3
35,-2.3068
36,-2.3104
37,-2.3086
38,-2.3055
39,-2.3022
40,-2.2989
41,-2.2954
42,-2.2907
43,-2.2871
44,-2.2833
45,-2.2795
46,-2.2756
47,-2.2703
48,-2.2662
49,-2.2641
50,-2.2599
51,-2.2556
52,-2.2497
53,-2.2452
54,-2.2407
55,-2.2361
56,-2.2349
57,-2.241
58,-2.2431
59,-2.2383
60,-2.2333
61,-2.2284
62,-2.2216
63,-2.2165
64,-2.2114
65,-2.2062
66,-2.2026
67,-2.1955
68,-2.1902
69,-2.1847
70,-2.1793
71,-2.1719
72,-2.1663
73,-2.1607
74,-2.1551
75,-2.1494
76,-2.1402
77,-2.1344
78,-2.1302
79,-2.1244
80,-2.1185
81,-2.1106
82,-2.1047
83,-2.0987
84,-2.0927
85,-2.0867
86,-2.0786
87,-2.0726
88,-2.0705
89,-2.0685
90,-2.0679
91,-2.061
92,-2.0562
93,-2.0555
94,-2.0547
95,-2.0540000000000003
96,-2.0469
97,-2.0469
98,-2.0448
99,-2.0406
100,-2.0343
101,-2.0258
102,-2.0194
103,-2.013
104,-2.0065
105,-2.0001
106,-1.9915
107,-1.985
108,-1.9785
109,-1.972
110,-1.9666
111,-1.9567
112,-1.9513
113,-1.9447
114,-1.9381
115,-1.9292
116,-1.9226
117,-1.9159
118,-1.9093
119,-1.9026
120,-1.8937
121,-1.8869999999999998
122,-1.8802
123,-1.8735
124,-1.8668
125,-1.8578
126,-1.851
127,-1.8442
128,-1.8375
129,-1.8405
130,-1.8411
131,-1.8343
132,-1.8275
133,-1.8206
134,-1.8137
135,-1.8046
136,-1.7977
137,-1.7908
138,-1.7839
139,-1.7816
140,-1.777
141,-1.7701
142,-1.7631
143,-1.7562
144,-1.7516
145,-1.7493
146,-1.7501
147,-1.7432
148,-1.7362
149,-1.7293
150,-1.72
151,-1.713
152,-1.706
153,-1.699
154,-1.692
155,-1.6827
156,-1.6757
157,-1.6687
158,-1.6616
159,-1.6523
160,-1.6452
161,-1.6382
162,-1.6311
163,-1.6241
164,-1.6147
165,-1.6076
166,-1.6006
167,-1.5967
168,-1.5919999999999999
169,-1.5833
170,-1.5763
171,-1.5692
172,-1.5614
173,-1.5543
174,-1.5449
175,-1.5379
176,-1.534
177,-1.5293
178,-1.5253
179,-1.5159
180,-1.5089
181,-1.5018
182,-1.494
183,-1.4869
184,-1.4775
185,-1.472
186,-1.4673
187,-1.465
188,-1.4579
189,-1.4485
190,-1.4415
191,-1.4344
192,-1.4266
193,-1.4195
194,-1.4101
195,-1.403
196,-1.396
197,-1.3905
198,-1.3858
199,-1.3835
200,-1.3764
201,-1.3686
202,-1.3615
203,-1.3521
204,-1.349
205,-1.3443
206,-1.3372
207,-1.3302
208,-1.32
209,-1.3129
210,-1.3059
211,-1.3012
212,-1.2964
213,-1.2862
214,-1.2792
215,-1.2714
216,-1.2643
217,-1.2588
218,-1.2533
219,-1.2493
220,-1.2423
221,-1.2345
222,-1.2274
223,-1.2181
224,-1.2141
225,-1.2093
226,-1.2053
227,-1.1983
228,-1.1881
229,-1.1811
230,-1.1741
231,-1.1693
232,-1.1645
233,-1.1567
234,-1.1497
235,-1.1426
236,-1.1356
237,-1.1278
238,-1.1184
239,-1.1114
240,-1.1074
241,-1.1026
242,-1.0987
243,-1.0893
244,-1.0823
245,-1.0753
246,-1.0683
247,-1.0581
248,-1.0511
249,-1.044
250,-1.037
251,-1.03
252,-1.0252
253,-1.0204
254,-1.0173
255,-1.0102
256,-1.0032
257,-0.99385
258,-0.98682
259,-0.9797799999999999
260,-0.97275
261,-0.96491
262,-0.95552
263,-0.94847
264,-0.9414299999999999
265,-0.9343799999999999
266,-0.9265399999999999
267,-0.9218200000000001
268,-0.91943
269,-0.9123899999999999
270,-0.90535
271,-0.89831
272,-0.8889100000000001
273,-0.88108
274,-0.87403
275,-0.86697
276,-0.86305
277,-0.8575299999999999
278,-0.8520399999999999
279,-0.845
280,-0.83796
281,-0.83091
282,-0.8215100000000001
283,-0.81367
284,-0.80662
285,-0.79957
286,-0.79251
287,-0.7831
288,-0.77603
289,-0.7689600000000001
290,-0.76348
291,-0.75803
292,-0.7541100000000001
293,-0.7470600000000001
294,-0.74
295,-0.7329399999999999
296,-0.7235199999999999
297,-0.71568
298,-0.70862
299,-0.70155
300,-0.69448
301,-0.68505
302,-0.6804
303,-0.67572
304,-0.66788
305,-0.66082
306,-0.65063
307,-0.64356
308,-0.63731
309,-0.63262
310,-0.62871
311,-0.6193
312,-0.61146
313,-0.60441
314,-0.59735
315,-0.59499
316,-0.59264
317,-0.5848
318,-0.57932
319,-0.57619
320,-0.57305
321,-0.56286
322,-0.55503
323,-0.55189
324,-0.5495399999999999
325,-0.54719
326,-0.53777
327,-0.53071
328,-0.52364
329,-0.51581
330,-0.50874
331,-0.49931000000000003
332,-0.49223999999999996
333,-0.48516000000000004
334,-0.47808
335,-0.47343999999999997
336,-0.46878000000000003
337,-0.46093999999999996
338,-0.45388
339,-0.4468
340,-0.43737
341,-0.4303
342,-0.42322
343,-0.41538
344,-0.4083
345,-0.39886
346,-0.39178
347,-0.38469000000000003
348,-0.3776
349,-0.37374
350,-0.36835999999999997
351,-0.36288000000000004
352,-0.3558
353,-0.34872
354,-0.34164
355,-0.33144
356,-0.32436
357,-0.31727
358,-0.31018
359,-0.30309
360,-0.29363
361,-0.28579
362,-0.2787
363,-0.27396
364,-0.26938
365,-0.26477
366,-0.25769000000000003
367,-0.24985
368,-0.24276
369,-0.23492
370,-0.22634
371,-0.22408000000000003
372,-0.21625
373,-0.20840999999999998
374,-0.20378
375,-0.19835999999999998
376,-0.19129000000000002
377,-0.18422
378,-0.17638
379,-0.16695
380,-0.16147
381,-0.15682000000000001
382,-0.15215
383,-0.14508
384,-0.13647
385,-0.13179000000000002
386,-0.12709
387,-0.12004000000000001
388,-0.1122
389,-0.10670999999999999
390,-0.10198
391,-0.094139
392,-0.08709800000000001
393,-0.08470599999999999
394,-0.07914700000000001
395,-0.07446
396,-0.067428
397,-0.060394
398,-0.052555
399,-0.043174000000000004
400,-0.036132
401,-0.029091000000000002
402,-0.022805000000000002
403,-0.018059
404,-0.014106
405,-0.0062686999999999994
406,0.00076525
407,0.0077992
408,0.014836000000000002
409,0.021128
410,0.025887
411,0.02985
412,0.036877
413,0.043906
414,0.054088
415,0.06111900000000001
416,0.065075
417,0.069846
418,0.076156
419,0.08552
420,0.09335700000000001
421,0.10038
422,0.10822000000000001
423,0.11148
424,0.11779
425,0.12480999999999999
426,0.13183
427,0.13885
428,0.14903
429,0.15606
430,0.16308
431,0.17010999999999998
432,0.17254
433,0.17815
434,0.18283
435,0.18985
436,0.19687000000000002
437,0.20389000000000002
438,0.21325999999999998
439,0.22029
440,0.22812
441,0.23515
442,0.24218
443,0.25156
444,0.2586
445,0.26564
446,0.27033
447,0.27268000000000003
448,0.27502
449,0.28286
450,0.28600000000000003
451,0.28915
452,0.29464
453,0.30482
454,0.31266
455,0.31346
456,0.31581
457,0.32285
458,0.33223
459,0.34007
460,0.34712
461,0.35181
462,0.35416
463,0.35886
464,0.3667
465,0.36984
466,0.37063
467,0.38161
468,0.38944
469,0.39494
470,0.39494
471,0.39494
472,0.39728
473,0.39728
474,0.40276999999999996
475,0.40981999999999996
476,0.40981999999999996
477,0.41216
478,0.41921
479,0.42626000000000003
480,0.43331000000000003
481,0.44036000000000003
482,0.44976000000000005
483,0.45682
484,0.46387
485,0.47093
486,0.47798999999999997
487,0.48741
488,0.49446999999999997
489,0.50154
490,0.5086
491,0.51567
492,0.5251
493,0.53218
494,0.53925
495,0.54473
496,0.54709
497,0.54945
498,0.55652
499,0.5636
500,0.57068
501,0.57776
502,0.58012
503,0.58248
504,0.58173
505,0.58097
506,0.58023
507,0.57724
508,0.5765
509,0.57576
510,0.57118
511,0.56662
512,0.5595100000000001
513,0.5524100000000001
514,0.5453100000000001
515,0.5382100000000001
516,0.52874
517,0.52164
518,0.51455
519,0.50671
520,0.49962
521,0.49016000000000004
522,0.48307
523,0.47598
524,0.47373999999999994
525,0.46915
526,0.46132
527,0.45348
528,0.44891000000000003
529,0.44433999999999996
530,0.43888
531,0.4294
532,0.4223
533,0.41518999999999995
534,0.40809
535,0.40026
536,0.39079
537,0.3837
538,0.3766
539,0.36876
540,0.36655
541,0.35961
542,0.35251
543,0.34541
544,0.3383
545,0.33047
546,0.321
547,0.31390999999999997
548,0.30607
549,0.30149000000000004
550,0.29693
551,0.28672
552,0.28125
553,0.2767
554,0.27216
555,0.26505
556,0.25556
557,0.24773
558,0.24061999999999997
559,0.2368
560,0.23155
561,0.22371999999999997
562,0.21588000000000002
563,0.21208000000000002
564,0.20758000000000001
565,0.19904000000000002
566,0.19191
567,0.18479
568,0.17695
569,0.16983
570,0.16463
571,0.16253
572,0.15469000000000002
573,0.14756
574,0.14309000000000002
575,0.13795
576,0.1325
577,0.12536
578,0.11922
579,0.1148
580,0.10867
581,0.10152
582,0.093691
583,0.08654099999999999
584,0.079391
585,0.07497100000000001
586,0.07057000000000001
587,0.065127
588,0.057297
589,0.05185700000000001
590,0.046811
591,0.043105000000000004
592,0.035278
593,0.028110000000000003
594,0.026144999999999998
595,0.021158
596,0.013980000000000001
597,0.0068032
598,-0.0010217
599,-0.0081997
600,-0.016671000000000002
601,-0.018602
602,-0.024669
603,-0.031854
604,-0.041431
605,-0.048614
606,-0.056438999999999996
607,-0.06361900000000001
608,-0.070797
609,-0.079266
610,-0.08358099999999999
611,-0.08724900000000001
612,-0.09443700000000001
613,-0.10162
614,-0.11184000000000001
615,-0.11903
616,-0.12621
617,-0.13339
618,-0.14121
619,-0.14615999999999998
620,-0.14742
621,-0.15462
622,-0.16180999999999998
623,-0.16963
624,-0.17920999999999998
625,-0.18464
626,-0.18653
627,-0.1908
628,-0.198
629,-0.20759
630,-0.21541
631,-0.22261
632,-0.22865
633,-0.23292
634,-0.23895
635,-0.24677
636,-0.25218
637,-0.25640999999999997
638,-0.25822
639,-0.26844
640,-0.27625
641,-0.27803
642,-0.28461
643,-0.29002
644,-0.2906
645,-0.29233000000000003
646,-0.29405
647,-0.29816
648,-0.30522
649,-0.30928
650,-0.30928
651,-0.30983
652,-0.31145
653,-0.31251999999999996
654,-0.31305
655,-0.31358
656,-0.31515
657,-0.3167
658,-0.31873
659,-0.32023
660,-0.32171
661,-0.32316999999999996
662,-0.3246
663,-0.32068
664,-0.31338
665,-0.30608
666,-0.29877
667,-0.29193
668,-0.28219
669,-0.27488
670,-0.27047
671,-0.27182
672,-0.27315
673,-0.27202
674,-0.27202
675,-0.2647
676,-0.25738
677,-0.25049
678,-0.24156
679,-0.23465
680,-0.23221
681,-0.23018000000000002
682,-0.22774
683,-0.21796
684,-0.21552
685,-0.21552
686,-0.20818000000000003
687,-0.20085
688,-0.19107000000000002
689,-0.18374000000000001
690,-0.17681
691,-0.16947
692,-0.15969
693,-0.15235
694,-0.14501
695,-0.14012
696,-0.13767000000000001
697,-0.13562000000000002
698,-0.12867
699,-0.12172000000000001
700,-0.11721
701,-0.11514
702,-0.111
703,-0.10365
704,-0.10365
705,-0.1012
706,-0.096303
707,-0.086503
708,-0.079152
709,-0.0718
710,-0.064449
711,-0.05709500000000001
712,-0.047293
713,-0.039938999999999995
714,-0.032586000000000004
715,-0.025232
716,-0.017876
717,-0.008067699999999999
718,-0.00071475
719,0.0066422
720,0.013997999999999998
721,0.021356
722,0.031166000000000003
723,0.038523
724,0.045881
725,0.053239999999999996
726,0.060599
727,0.070411
728,0.07777200000000001
729,0.078838
730,0.082372
731,0.087641
732,0.097446
733,0.1048
734,0.11252000000000001
735,0.11987
736,0.12968
737,0.13704000000000002
738,0.14022
739,0.14377
740,0.14942
741,0.15922
742,0.16657
743,0.17392
744,0.18165
745,0.18899999999999997
746,0.1988
747,0.20615
748,0.2135
749,0.21877
750,0.22234
751,0.22593000000000002
752,0.23328000000000002
753,0.24061999999999997
754,0.24835
755,0.2557
756,0.26343
757,0.26703000000000005
758,0.27064
759,0.27798
760,0.28533000000000003
761,0.29512
762,0.30285
763,0.31019
764,0.31754
765,0.32488
766,0.33466999999999997
767,0.34202
768,0.34524
769,0.34886
770,0.3521
771,0.36188000000000003
772,0.36923
773,0.37656999999999996
774,0.38391
775,0.39164
776,0.40143
777,0.40876999999999997
778,0.41611000000000004
779,0.42346000000000006
780,0.43325
781,0.44059
782,0.44793
783,0.45528
784,0.46262
785,0.46663000000000004
786,0.47026
787,0.4776
788,0.48494
789,0.49228
790,0.50207
791,0.50941
792,0.51675
793,0.52409
794,0.5314300000000001
795,0.54162
796,0.54896
797,0.5563
798,0.5636399999999999
799,0.57099
800,0.58078
801,0.58567
802,0.58812
803,0.58812
804,0.59341
805,0.60114
806,0.60397
807,0.60436
808,0.6121
809,0.61983
810,0.62757
811,0.63002
812,0.6349100000000001
813,0.64225
814,0.64959
815,0.65938
816,0.66673
817,0.67407
818,0.6814100000000001
819,0.68914
820,0.69894
821,0.70628
822,0.71362
823,0.72097
824,0.7307600000000001
825,0.73811
826,0.74545
827,0.7528
828,0.76015
829,0.76994
830,0.7772899999999999
831,0.78464
832,0.79199
833,0.7993399999999999
834,0.80423
835,0.80669
836,0.8095100000000001
837,0.81686
838,0.8196899999999999
839,0.82252
840,0.8278
841,0.83552
842,0.84325
843,0.8457
844,0.84739
845,0.84946
846,0.8564299999999999
847,0.86379
848,0.87151
849,0.87961
850,0.88244
851,0.88282
852,0.8901600000000001
853,0.89751
854,0.90486
855,0.9073100000000001
856,0.90976
857,0.9171100000000001
858,0.9244600000000001
859,0.9342600000000001
860,0.9419799999999999
861,0.9493299999999999
862,0.95668
863,0.9640299999999999
864,0.9664799999999999
865,0.96893
866,0.9766600000000001
867,0.9794799999999999
868,0.98231
869,0.9900399999999999
870,0.9977600000000001
871,1.0055
872,1.0059
873,1.0083
874,1.0157
875,1.023
876,1.0304
877,1.0377
878,1.0475
879,1.0549
880,1.0622
881,1.0696
882,1.0769
883,1.0807
884,1.0796
885,1.0841
886,1.0915
887,1.0988
888,1.1087
889,1.1159999999999999
890,1.1234
891,1.1307
892,1.1381
893,1.1479
894,1.1553
895,1.1626
896,1.17
897,1.1777
898,1.1812
899,1.1840000000000002
900,1.1914
901,1.1987
902,1.2061
903,1.2159
904,1.2233
905,1.2306
906,1.2355
907,1.2376
908,1.2362
909,1.2436
910,1.2506
911,1.2524
912,1.2535
913,1.258
914,1.2654
915,1.2724
916,1.2798
917,1.2896
918,1.2887
919,1.2877
920,1.2892
921,1.2882
922,1.2898
923,1.2968
924,1.2993
925,1.2984
926,1.2975
927,1.2963
928,1.2955
929,1.2946
930,1.2938
931,1.2932
932,1.2856
933,1.2804
934,1.2795
935,1.2763
936,1.2755
937,1.2745
938,1.2693
939,1.2617
940,1.2565
941,1.2557
942,1.2525
943,1.2449
944,1.2375
945,1.2346
946,1.2314
947,1.2235
948,1.2161
949,1.2087
950,1.2013
951,1.1939
952,1.1838
953,1.1764
954,1.169
955,1.1616
956,1.1537
957,1.1506
958,1.1501
959,1.1427
960,1.1353
961,1.1255
962,1.1179999999999999
963,1.1106
964,1.1032
965,1.0958
966,1.0859999999999999
967,1.0786
968,1.0711
969,1.0637
970,1.0561
971,1.0462
972,1.0388
973,1.0314
974,1.024
975,1.0166
976,1.0068
977,0.99934
978,0.9919399999999999
979,0.98454
980,0.97714
981,0.96726
982,0.95986
983,0.9524600000000001
984,0.94506
985,0.93765
986,0.9277799999999999
987,0.92038
988,0.9149799999999999
989,0.9118299999999999
990,0.90891
991,0.89904
992,0.8916299999999999
993,0.88423
994,0.87682
995,0.8694200000000001
996,0.8593200000000001
997,0.8519100000000001
998,0.84451
999,0.8371
1000,0.8272299999999999
1001,0.81983
1002,0.81242
1003,0.80502
1004,0.79761
1005,0.78774
1006,0.7803399999999999
1007,0.77294
1008,0.76553
1009,0.7579
1010,0.7522800000000001
1011,0.75162
1012,0.74422
1013,0.7368100000000001
1014,0.7294
1015,0.71953
1016,0.7119
1017,0.7045
1018,0.69709
1019,0.6896800000000001
1020,0.6795899999999999
1021,0.67443
1022,0.67132
1023,0.66842
1024,0.66101
1025,0.6511399999999999
1026,0.64373
1027,0.6361100000000001
1028,0.6287
1029,0.62129
1030,0.6136699999999999
1031,0.61305
1032,0.60998
1033,0.6025699999999999
1034,0.59516
1035,0.58527
1036,0.5776600000000001
1037,0.57025
1038,0.56284
1039,0.55543
1040,0.5521699999999999
1041,0.54666
1042,0.53925
1043,0.53183
1044,0.52195
1045,0.51453
1046,0.50712
1047,0.49971000000000004
1048,0.49228999999999995
1049,0.48222
1050,0.4748
1051,0.46738999999999997
1052,0.45998
1053,0.45256
1054,0.44268
1055,0.43527
1056,0.43223
1057,0.4292
1058,0.42408
1059,0.41418999999999995
1060,0.40678000000000003
1061,0.39918000000000003
1062,0.39176
1063,0.38435
1064,0.37446
1065,0.37163
1066,0.36864
1067,0.36583000000000004
1068,0.35841
1069,0.34852
1070,0.3411
1071,0.33368000000000003
1072,0.32626
1073,0.31884
1074,0.30895
1075,0.30154000000000003
1076,0.29395
1077,0.28653
1078,0.27910999999999997
1079,0.26921999999999996
1080,0.2618
1081,0.25438
1082,0.24697
1083,0.23955
1084,0.22966
1085,0.22224000000000002
1086,0.21483000000000002
1087,0.20758000000000001
1088,0.19999
1089,0.1901
1090,0.18268
1091,0.17527
1092,0.16785
1093,0.15796
1094,0.15055
1095,0.14313
1096,0.13571
1097,0.13289
1098,0.12972999999999998
1099,0.12462000000000001
1100,0.1172
1101,0.10979000000000001
1102,0.1022
1103,0.092311
1104,0.09182799999999999
1105,0.088891
1106,0.08379500000000001
1107,0.07637200000000001
1108,0.066475
1109,0.05890599999999999
1110,0.051483
1111,0.04857
1112,0.048154
1113,0.040595
1114,0.033038
1115,0.030300999999999998
1116,0.027451
1117,0.024737000000000002
1118,0.014833
1119,0.007408199999999999
1120,-0.00013675
1121,-0.007564699999999999
1122,-0.010269
1123,-0.013175999999999998
1124,-0.020709
1125,-0.028238
1126,-0.028432
1127,-0.028707
1128,-0.029041
1129,-0.029269
1130,-0.029477999999999997
1131,-0.029666
1132,-0.029833999999999996
1133,-0.030025
1134,-0.022591999999999998
1135,-0.015156999999999999
1136,-0.007723699999999999
1137,0.0021482
1138,0.009581200000000002
1139,0.017016999999999997
1140,0.02445
1141,0.02445
1142,0.026927999999999997
1143,0.034364
1144,0.041797
1145,0.046714
1146,0.049155000000000004
1147,0.054045
1148,0.061451
1149,0.068857
1150,0.076265
1151,0.083701
1152,0.08617899999999999
1153,0.091136
1154,0.098572
1155,0.10597999999999999
1156,0.11342
1157,0.12330999999999999
1158,0.12326
1159,0.12571
1160,0.13314
1161,0.14057999999999998
1162,0.15049
1163,0.15792
1164,0.16287000000000001
1165,0.16535
1166,0.16537000000000002
1167,0.17529
1168,0.18272
1169,0.19015
1170,0.19759000000000002
1171,0.20503000000000002
1172,0.21494000000000002
1173,0.22238000000000002
1174,0.22981
1175,0.23725
1176,0.24468
1177,0.2546
1178,0.26203000000000004
1179,0.26947
1180,0.2769
1181,0.28681
1182,0.2868
1183,0.28928000000000004
1184,0.29424
1185,0.30167
1186,0.31159000000000003
1187,0.31901999999999997
1188,0.32646
1189,0.33389
1190,0.34133
1191,0.35125
1192,0.35869
1193,0.36612
1194,0.37356
1195,0.38099
1196,0.39091
1197,0.39834
1198,0.4033
1199,0.40578000000000003
1200,0.40826
1201,0.41818
1202,0.42066000000000003
1203,0.42315
1204,0.42813
1205,0.43558
1206,0.44303000000000003
1207,0.44551999999999997
1208,0.44799999999999995
1209,0.45296000000000003
1210,0.4604
1211,0.47031000000000006
1212,0.47773999999999994
1213,0.48518
1214,0.49262
1215,0.50005
1216,0.5099899999999999
1217,0.51742
1218,0.52486
1219,0.5322899999999999
1220,0.53972
1221,0.54964
1222,0.55707
1223,0.5645100000000001
1224,0.57195
1225,0.58186
1226,0.58929
1227,0.59673
1228,0.60416
1229,0.6116
1230,0.62151
1231,0.62895
1232,0.6363800000000001
1233,0.64382
1234,0.65125
1235,0.66117
1236,0.6686
1237,0.67604
1238,0.68347
1239,0.68595
1240,0.69093
1241,0.6983699999999999
1242,0.70087
1243,0.7033699999999999
1244,0.7108300000000001
1245,0.7208
1246,0.72331
1247,0.7257899999999999
1248,0.73075
1249,0.7381800000000001
1250,0.7480899999999999
1251,0.75553
1252,0.76297
1253,0.7704
1254,0.77783
1255,0.78778
1256,0.7952199999999999
1257,0.80265
1258,0.81008
1259,0.81752
1260,0.8274
1261,0.83483
1262,0.8422700000000001
1263,0.8497100000000001
1264,0.85714
1265,0.86705
1266,0.87449
1267,0.8768799999999999
1268,0.87929
1269,0.8867
1270,0.8941399999999999
1271,0.9015799999999999
1272,0.90901
1273,0.9164399999999999
1274,0.9263600000000001
1275,0.93379
1276,0.9412299999999999
1277,0.94865
1278,0.9560799999999999
1279,0.966
1280,0.9734299999999999
1281,0.98087
1282,0.9883
1283,0.99574
1284,1.0057
1285,1.0131
1286,1.0205
1287,1.028
1288,1.0354
1289,1.0453
1290,1.0527
1291,1.0602
1292,1.0676
1293,1.0751
1294,1.085
1295,1.0924
1296,1.0998
1297,1.1073
1298,1.1147
1299,1.1197
1300,1.1223
1301,1.1298
1302,1.1372
1303,1.1446
1304,1.1545
1305,1.162
1306,1.1694
1307,1.1768
1308,1.1843
1309,1.1942
1310,1.2016
1311,1.2091
1312,1.2165
1313,1.2264
1314,1.2339
1315,1.2413
1316,1.2487
1317,1.2562
1318,1.2661
1319,1.2735
1320,1.2785
1321,1.281
1322,1.281
1323,1.2909
1324,1.2983
1325,1.3058
1326,1.3132
1327,1.3132
1328,1.3158
1329,1.3232
1330,1.3307
1331,1.3381
1332,1.3455
1333,1.3553
1334,1.3578
1335,1.3603
1336,1.3627
1337,1.3702
1338,1.3751
1339,1.3751
1340,1.3801
1341,1.3875
1342,1.395
1343,1.4049
1344,1.4123
1345,1.4197
1346,1.4272
1347,1.4346
1348,1.4445
1349,1.4519
1350,1.4519
1351,1.4543
1352,1.4617
1353,1.4716
1354,1.479
1355,1.4865
1356,1.4914
1357,1.4914
1358,1.4938
1359,1.4938
1360,1.4938
1361,1.4988
1362,1.5087
1363,1.5112
1364,1.5113
1365,1.5113
1366,1.5114
1367,1.514
1368,1.514
1369,1.5142
1370,1.5143
1371,1.5144
1372,1.5121
1373,1.5123
1374,1.5125
1375,1.5127
1376,1.5129
1377,1.508
1378,1.5007
1379,1.4958
1380,1.496
1381,1.4963
1382,1.4942
1383,1.4944
1384,1.4896
1385,1.4821
1386,1.4747
1387,1.4649
1388,1.4575
1389,1.4578
1390,1.4556
1391,1.4508
1392,1.4409999999999998
1393,1.4387
1394,1.4366
1395,1.4344
1396,1.4269
1397,1.4171
1398,1.4097
1399,1.4023
1400,1.4002
1401,1.3958
1402,1.3883
1403,1.3809
1404,1.3735
1405,1.3661
1406,1.3562
1407,1.3489
1408,1.3414
1409,1.334
1410,1.3266
1411,1.3167
1412,1.3093
1413,1.3019
1414,1.2944
1415,1.287
1416,1.2821
1417,1.2796
1418,1.2771
1419,1.2697
1420,1.2672
1421,1.2599
1422,1.2526
1423,1.2454
1424,1.2381
1425,1.2308
1426,1.2234
1427,1.2234
1428,1.2212
1429,1.2138
1430,1.2064
1431,1.1965
1432,1.1891
1433,1.1818
1434,1.1744
1435,1.1669
1436,1.1571
1437,1.1496
1438,1.1422
1439,1.1348
1440,1.1274
1441,1.1175
1442,1.1101
1443,1.1026
1444,1.0952
1445,1.0853
1446,1.0779
1447,1.0705
1448,1.0631
1449,1.0556
1450,1.0457
1451,1.0383
1452,1.0309
1453,1.0235
1454,1.0161
1455,1.0063
1456,1.0068
1457,1.0024
1458,0.99498
1459,0.98756
1460,0.9776799999999999
1461,0.97026
1462,0.9628399999999999
1463,0.95542
1464,0.94801
1465,0.9381200000000001
1466,0.9307
1467,0.9232799999999999
1468,0.9158700000000001
1469,0.90845
1470,0.89856
1471,0.89115
1472,0.8837299999999999
1473,0.87631
1474,0.8689
1475,0.85901
1476,0.85159
1477,0.84436
1478,0.8367600000000001
1479,0.8295299999999999
1480,0.8194600000000001
1481,0.81204
1482,0.8046300000000001
1483,0.7972100000000001
1484,0.78998
1485,0.7801
1486,0.77268
1487,0.76527
1488,0.75785
1489,0.74797
1490,0.74055
1491,0.73314
1492,0.72573
1493,0.71831
1494,0.70843
1495,0.70101
1496,0.6936
1497,0.6913199999999999
1498,0.68885
1499,0.6814399999999999
1500,0.67402
1501,0.66661
1502,0.6592
1503,0.65692
1504,0.65485
1505,0.64764
1506,0.64023
1507,0.63281
1508,0.6254
1509,0.61552
1510,0.61305
1511,0.61058
1512,0.60853
1513,0.60111
1514,0.59124
1515,0.5838300000000001
1516,0.5764199999999999
1517,0.56901
1518,0.5616
1519,0.55172
1520,0.5443100000000001
1521,0.53691
1522,0.5295
1523,0.5220899999999999
1524,0.51221
1525,0.50481
1526,0.4974
1527,0.48999
1528,0.48258
1529,0.47271
1530,0.4653
1531,0.45788999999999996
1532,0.45048999999999995
1533,0.44083
1534,0.43341999999999997
1535,0.42601999999999995
1536,0.41861000000000004
1537,0.41121
1538,0.40134000000000003
1539,0.3964
1540,0.39393
1541,0.39146
1542,0.38406
1543,0.37418
1544,0.36678
1545,0.36184
1546,0.36184
1547,0.35936999999999997
1548,0.3495
1549,0.3421
1550,0.33469
1551,0.32729
1552,0.31988
1553,0.31001
1554,0.30261
1555,0.29521
1556,0.28781
1557,0.2804
1558,0.27053
1559,0.26313000000000003
1560,0.25866999999999996
1561,0.25692
1562,0.25495
1563,0.24508000000000002
1564,0.23768000000000003
1565,0.23029000000000002
1566,0.22314
1567,0.21575
1568,0.20588
1569,0.19849
1570,0.19109
1571,0.1837
1572,0.18200999999999998
1573,0.18061
1574,0.17322
1575,0.16583
1576,0.15844
1577,0.14886
1578,0.14147
1579,0.13408
1580,0.1267
1581,0.12479000000000001
1582,0.12347999999999999
1583,0.11885
1584,0.11147
1585,0.10438
1586,0.09699999999999999
1587,0.08745800000000001
1588,0.08837300000000001
1589,0.086846
1590,0.07947
1591,0.07209600000000001
1592,0.067496
1593,0.067496
1594,0.067816
1595,0.068788
1596,0.069779
1597,0.070451
1598,0.070788
1599,0.07147200000000001
1600,0.072513
1601,0.073573
1602,0.07747000000000001
1603,0.083475
1604,0.090826
1605,0.09647
1606,0.10005
1607,0.10364000000000001
1608,0.11099
1609,0.11872
1610,0.11949000000000001
1611,0.12312000000000001
1612,0.1288
1613,0.13654000000000002
1614,0.14182999999999998
1615,0.14305
1616,0.14672000000000002
1617,0.1565
1618,0.16383
1619,0.17157
1620,0.1789
1621,0.18462
1622,0.18830999999999998
1623,0.19159
1624,0.19892
1625,0.20625
1626,0.21644000000000002
1627,0.22376999999999997
1628,0.22705
1629,0.23078
1630,0.23408
1631,0.24384
1632,0.25117
1633,0.25849
1634,0.26624000000000003
1635,0.27355999999999997
1636,0.28333
1637,0.28864
1638,0.29238000000000003
1639,0.29369
1640,0.30101
1641,0.31077
1642,0.31851999999999997
1643,0.32584
1644,0.33316
1645,0.34048
1646,0.35024
1647,0.35399
1648,0.35531999999999997
1649,0.36064
1650,0.36796
1651,0.37771
1652,0.38547
1653,0.39278
1654,0.4001
1655,0.40741
1656,0.41363
1657,0.41741999999999996
1658,0.42518
1659,0.43249
1660,0.4398
1661,0.45
1662,0.45731000000000005
1663,0.46462
1664,0.47193
1665,0.47572
1666,0.47998999999999997
1667,0.4873
1668,0.4946
1669,0.5019100000000001
1670,0.5121100000000001
1671,0.51942
1672,0.52673
1673,0.53404
1674,0.5373899999999999
1675,0.54167
1676,0.54701
1677,0.5543100000000001
1678,0.56161
1679,0.56892
1680,0.57912
1681,0.5864199999999999
1682,0.59373
1683,0.6010300000000001
1684,0.60834
1685,0.61808
1686,0.62539
1687,0.6327
1688,0.63849
1689,0.6423
1690,0.6481100000000001
1691,0.65541
1692,0.66271
1693,0.67001
1694,0.67732
1695,0.68706
1696,0.6943600000000001
1697,0.70213
1698,0.70944
1699,0.7167399999999999
1700,0.72648
1701,0.7337899999999999
1702,0.73958
1703,0.74341
1704,0.75164
1705,0.7613800000000001
1706,0.76868
1707,0.77645
1708,0.78375
1709,0.79105
1710,0.80079
1711,0.80462
1712,0.80603
1713,0.81137
1714,0.82111
1715,0.8284100000000001
1716,0.8357
1717,0.84301
1718,0.85031
1719,0.8600399999999999
1720,0.86734
1721,0.87465
1722,0.88195
1723,0.8897200000000001
1724,0.89946
1725,0.90676
1726,0.91407
1727,0.92137
1728,0.9252
1729,0.9266
1730,0.93437
1731,0.9416700000000001
1732,0.9489700000000001
1733,0.9562799999999999
1734,0.96601
1735,0.97331
1736,0.98062
1737,0.98792
1738,0.99523
1739,1.005
1740,1.0123
1741,1.0196
1742,1.0269
1743,1.0346
1744,1.0444
1745,1.0517
1746,1.0590000000000002
1747,1.0663
1748,1.0736
1749,1.0834
1750,1.0907
1751,1.0979999999999999
1752,1.1013
1753,1.1051
1754,1.1134
1755,1.1207
1756,1.128
1757,1.1353
1758,1.145
1759,1.1523
1760,1.1596
1761,1.167
1762,1.1747
1763,1.1845
1764,1.1918
1765,1.1991
1766,1.2053
1767,1.2067
1768,1.2169
1769,1.2242
1770,1.2315
1771,1.2393
1772,1.2466
1773,1.2563
1774,1.2636
1775,1.265
1776,1.2688
1777,1.2742
1778,1.2839
1779,1.2917
1780,1.2990000000000002
1781,1.3063
1782,1.3077
1783,1.3119999999999998
1784,1.3198
1785,1.3271
1786,1.3305
1787,1.3343
1788,1.3402
1789,1.348
1790,1.3533
1791,1.3548
1792,1.3562
1793,1.3582
1794,1.3597
1795,1.3613
1796,1.3628
1797,1.3643
1798,1.3664
1799,1.368
1800,1.3696
1801,1.3712
1802,1.3733
1803,1.3749
1804,1.376
1805,1.3693
1806,1.3621
1807,1.3613
1808,1.3630000000000002
1809,1.3623
1810,1.364
1811,1.3657
1812,1.3566
1813,1.35
1814,1.3517
1815,1.3511
1816,1.3438
1817,1.3348
1818,1.3342
1819,1.3359999999999999
1820,1.3318
1821,1.3245
1822,1.3149
1823,1.3077
1824,1.3011
1825,1.2939
1826,1.2867
1827,1.2831
1828,1.2826
1829,1.2814
1830,1.2742
1831,1.2670000000000001
1832,1.2574
1833,1.2502
1834,1.2429999999999999
1835,1.2358
1836,1.2286
1837,1.2191
1838,1.2119
1839,1.2047
1840,1.1975
1841,1.1903
1842,1.1807
1843,1.1735
1844,1.1664
1845,1.1592
1846,1.1496
1847,1.1424
1848,1.1352
1849,1.1281
1850,1.1209
1851,1.1113
1852,1.1041
1853,1.097
1854,1.0898
1855,1.0826
1856,1.073
1857,1.0659
1858,1.0587
1859,1.0515
1860,1.0444
1861,1.037
1862,1.035
1863,1.0278
1864,1.0207
1865,1.0135
1866,1.0039
1867,0.9960899999999999
1868,0.98892
1869,0.98175
1870,0.9745799999999999
1871,0.9650299999999999
1872,0.95893
1873,0.95457
1874,0.9508700000000001
1875,0.9437
1876,0.93414
1877,0.9269700000000001
1878,0.9198
1879,0.9126299999999999
1880,0.90546
1881,0.89525
1882,0.88808
1883,0.8809100000000001
1884,0.87375
1885,0.8665799999999999
1886,0.85703
1887,0.8498700000000001
1888,0.84272
1889,0.8355600000000001
1890,0.82601
1891,0.81886
1892,0.8117
1893,0.80455
1894,0.80081
1895,0.79574
1896,0.78792
1897,0.78076
1898,0.7736
1899,0.76644
1900,0.7569
1901,0.74974
1902,0.74259
1903,0.73544
1904,0.72828
1905,0.71875
1906,0.7116
1907,0.7044600000000001
1908,0.69662
1909,0.68948
1910,0.67995
1911,0.67281
1912,0.66566
1913,0.65852
1914,0.6513800000000001
1915,0.64355
1916,0.6391
1917,0.63705
1918,0.6299
1919,0.62275
1920,0.61323
1921,0.6060800000000001
1922,0.5989399999999999
1923,0.5918
1924,0.5846600000000001
1925,0.57445
1926,0.56731
1927,0.56018
1928,0.55304
1929,0.54591
1930,0.5364
1931,0.52927
1932,0.5221399999999999
1933,0.5150100000000001
1934,0.5048
1935,0.50031
1936,0.49583999999999995
1937,0.4887
1938,0.48157
1939,0.47206000000000004
1940,0.46493
1941,0.4578
1942,0.45066999999999996
1943,0.44283999999999996
1944,0.43333999999999995
1945,0.42622
1946,0.41908999999999996
1947,0.41197
1948,0.40485
1949,0.39963000000000004
1950,0.39513000000000004
1951,0.38800999999999997
1952,0.38088
1953,0.37305
1954,0.36355
1955,0.35641999999999996
1956,0.3493
1957,0.34146
1958,0.33696
1959,0.33009
1960,0.32295999999999997
1961,0.31583
1962,0.308
1963,0.30086999999999997
1964,0.29136999999999996
1965,0.28425
1966,0.27808
1967,0.27359
1968,0.26981
1969,0.2603
1970,0.25317
1971,0.24534
1972,0.23820999999999998
1973,0.23108
1974,0.22158000000000003
1975,0.21611999999999998
1976,0.214
1977,0.21022
1978,0.20001
1979,0.19288
1980,0.18575
1981,0.17862
1982,0.17149
1983,0.16199000000000002
1984,0.15487
1985,0.14775
1986,0.14063
1987,0.13351
1988,0.12402
1989,0.11690999999999999
1990,0.10979000000000001
1991,0.10268
1992,0.09557
1993,0.086092
1994,0.07825800000000001
1995,0.07115199999999999
1996,0.06477999999999999
1997,0.057678999999999994
1998,0.047475
1999,0.040376
2000,0.033277999999999995
2001,0.026185000000000003
2002,0.019091
2003,0.009636200000000001
2004,0.0025451999999999996
2005,-0.0045407
2006,-0.011627
2007,-0.018713
2008,-0.028154000000000002
2009,-0.035991
2010,-0.040612999999999996
2011,-0.047585
2012,-0.054676
2013,-0.064124
2014,-0.071211
2015,-0.078294
2016,-0.085375
2017,-0.092456
2018,-0.10189
2019,-0.10973
2020,-0.1168
2021,-0.12387999999999999
2022,-0.1333
2023,-0.14037
2024,-0.14744000000000002
2025,-0.15373
2026,-0.16079000000000002
2027,-0.1702
2028,-0.17726
2029,-0.18431
2030,-0.19136
2031,-0.19841
2032,-0.2078
2033,-0.21485
2034,-0.21245
2035,-0.21238
2036,-0.21625
2037,-0.2248
2038,-0.2255
2039,-0.22536
2040,-0.22837
2041,-0.23536999999999997
2042,-0.2447
2043,-0.25169
2044,-0.25868
2045,-0.26482
2046,-0.2718
2047,-0.28110999999999997
2048,-0.28809
2049,-0.29506
2050,-0.29247
2051,-0.29218
2052,-0.29738000000000003
2053,-0.30433000000000004
2054,-0.30629
2055,-0.30361
2056,-0.30733
2057,-0.31565
2058,-0.31523
2059,-0.31477
2060,-0.31845
2061,-0.32535
2062,-0.3336
2063,-0.34049
2064,-0.34508
2065,-0.34225
2066,-0.33845
2067,-0.33558000000000004
2068,-0.33269
2069,-0.32978
2070,-0.32686
2071,-0.32292
2072,-0.31867
2073,-0.31085999999999997
2074,-0.30533000000000005
2075,-0.30235
2076,-0.29481999999999997
2077,-0.28701
2078,-0.28021
2079,-0.27494
2080,-0.27192
2081,-0.26411999999999997
2082,-0.25733
2083,-0.25053000000000003
2084,-0.24273000000000003
2085,-0.23592
2086,-0.22685
2087,-0.22004
2088,-0.21478000000000003
2089,-0.20951
2090,-0.20397
2091,-0.19491
2092,-0.1871
2093,-0.1803
2094,-0.17249
2095,-0.16723
2096,-0.15968
2097,-0.15289
2098,-0.14609
2099,-0.13928
2100,-0.13247
2101,-0.1224
2102,-0.11559000000000001
2103,-0.10877
2104,-0.10195
2105,-0.09512799999999999
2106,-0.087621
2107,-0.084649
2108,-0.07684400000000001
2109,-0.07002799999999999
2110,-0.06094
2111,-0.05313
2112,-0.046308999999999996
2113,-0.039483
2114,-0.032655
2115,-0.026449
2116,-0.018936
2117,-0.012121
2118,-0.0052967
2119,0.0025101999999999998
2120,0.011611
2121,0.018438999999999997
2122,0.025272
2123,0.032108
2124,0.038945999999999995
2125,0.048067
2126,0.054568
2127,0.057490999999999993
2128,0.064002
2129,0.07083500000000001
2130,0.079948
2131,0.086789
2132,0.093632
2133,0.10048
2134,0.10733
2135,0.11646
2136,0.12428
2137,0.13113
2138,0.13799
2139,0.14486
2140,0.15400999999999998
2141,0.16088
2142,0.16775
2143,0.17059000000000002
2144,0.17803
2145,0.18813
2146,0.195
2147,0.20281
2148,0.20968
2149,0.21386999999999998
2150,0.21998
2151,0.22551
2152,0.23237
2153,0.24018
2154,0.24933000000000002
2155,0.25715
2156,0.2623
2157,0.26746
2158,0.27203
2159,0.28118000000000004
2160,0.28899
2161,0.29585
2162,0.30138000000000004
2163,0.30654000000000003
2164,0.31171
2165,0.31856
2166,0.32541
2167,0.33323
2168,0.34009
2169,0.34658
2170,0.35174
2171,0.35596
2172,0.36377
2173,0.37062
2174,0.37677
2175,0.37968
2176,0.38652
2177,0.39433
2178,0.39855999999999997
2179,0.40474
2180,0.41255
2181,0.42036
2182,0.42558
2183,0.43081
2184,0.43861999999999995
2185,0.44643
2186,0.45066999999999996
2187,0.45592
2188,0.46018000000000003
2189,0.47025
2190,0.47678000000000004
2191,0.47978000000000004
2192,0.48505
2193,0.48808
2194,0.49213
2195,0.49992
2196,0.50671
2197,0.511
2198,0.51631
2199,0.52287
2200,0.53067
2201,0.5362
2202,0.53927
2203,0.54564
2204,0.54874
2205,0.55185
2206,0.5596399999999999
2207,0.56743
2208,0.57385
2209,0.57698
2210,0.58014
2211,0.5833
2212,0.58648
2213,0.5907399999999999
2214,0.59396
2215,0.59718
2216,0.60042
2217,0.6036699999999999
2218,0.60802
2219,0.6113
2220,0.6146
2221,0.61569
2222,0.61014
2223,0.60572
2224,0.60907
2225,0.61022
2226,0.6136
2227,0.6169899999999999
2228,0.61151
2229,0.60605
2230,0.6061300000000001
2231,0.60737
2232,0.60747
2233,0.5987
2234,0.59212
2235,0.58554
2236,0.57898
2237,0.57357
2238,0.56483
2239,0.5582699999999999
2240,0.55172
2241,0.5451699999999999
2242,0.54299
2243,0.54081
2244,0.5342600000000001
2245,0.5299
2246,0.52773
2247,0.52337
2248,0.51684
2249,0.51031
2250,0.50379
2251,0.49606999999999996
2252,0.48738000000000004
2253,0.48086999999999996
2254,0.47413999999999995
2255,0.46838
2256,0.46165
2257,0.45296000000000003
2258,0.44525
2259,0.43873999999999996
2260,0.43223
2261,0.42646999999999996
2262,0.41952
2263,0.413
2264,0.40649
2265,0.39998
2266,0.39347
2267,0.3848
2268,0.3783
2269,0.3706
2270,0.36411
2271,0.35762
2272,0.34898
2273,0.3425
2274,0.33603
2275,0.33237
2276,0.32656999999999997
2277,0.31671
2278,0.31023
2279,0.30375
2280,0.29728000000000004
2281,0.29081999999999997
2282,0.28097
2283,0.27452
2284,0.26805999999999996
2285,0.26161
2286,0.25608000000000003
2287,0.249
2288,0.24224
2289,0.23578000000000002
2290,0.22933
2291,0.22073
2292,0.21305
2293,0.20661
2294,0.20018
2295,0.19465
2296,0.18754
2297,0.18292
2298,0.17647000000000002
2299,0.17004
2300,0.1636
2301,0.15379
2302,0.14736
2303,0.14094
2304,0.13327
2305,0.12738
2306,0.1215
2307,0.11507
2308,0.10865
2309,0.10223
2310,0.094564
2311,0.086018
2312,0.07961599999999999
2313,0.07321699999999999
2314,0.06855900000000001
2315,0.06477999999999999
2316,0.057994000000000004
2317,0.051587
2318,0.043923000000000004
2319,0.037524
2320,0.031127
2321,0.023072
2322,0.017155
2323,0.011626000000000001
2324,0.0052242
2325,-0.0011727
2326,-0.009693700000000001
2327,-0.01735
2328,-0.023732
2329,-0.03011
2330,-0.036482
2331,-0.044968
2332,-0.050493
2333,-0.056458
2334,-0.060288
2335,-0.068787
2336,-0.076435
2337,-0.0828
2338,-0.08916
2339,-0.095968
2340,-0.10322
2341,-0.10874
2342,-0.11510999999999999
2343,-0.12147000000000001
2344,-0.12782000000000002
2345,-0.13758
2346,-0.14392
2347,-0.15026
2348,-0.15578
2349,-0.16178
2350,-0.16777
2351,-0.17412
2352,-0.18045999999999998
2353,-0.1868
2354,-0.19313
2355,-0.20156
2356,-0.20918
2357,-0.2155
2358,-0.2218
2359,-0.2281
2360,-0.23494
2361,-0.24098000000000003
2362,-0.24570999999999998
2363,-0.25201999999999997
2364,-0.25832
2365,-0.26671999999999996
2366,-0.273
2367,-0.27929
2368,-0.28689000000000003
2369,-0.29317
2370,-0.30151999999999995
2371,-0.30778
2372,-0.31403000000000003
2373,-0.32028
2374,-0.32787
2375,-0.33533
2376,-0.34084000000000003
2377,-0.34843
2378,-0.35467
2379,-0.36299000000000003
2380,-0.36921
2381,-0.37679
2382,-0.38301
2383,-0.38921999999999995
2384,-0.39749
2385,-0.40368000000000004
2386,-0.40986999999999996
2387,-0.41605
2388,-0.42291999999999996
2389,-0.43049
2390,-0.43805
2391,-0.44423999999999997
2392,-0.45178999999999997
2393,-0.45796000000000003
2394,-0.46551000000000003
2395,-0.47172
2396,-0.47791999999999996
2397,-0.4841
2398,-0.49027
2399,-0.49987
2400,-0.50603
2401,-0.51218
2402,-0.51832
2403,-0.52585
2404,-0.5334899999999999
2405,-0.53833
2406,-0.54587
2407,-0.5534100000000001
2408,-0.5575899999999999
2409,-0.56792
2410,-0.57407
2411,-0.58162
2412,-0.5877600000000001
2413,-0.5938899999999999
2414,-0.60154
2415,-0.60777
2416,-0.61392
2417,-0.62005
2418,-0.62759
2419,-0.63576
2420,-0.64265
2421,-0.64891
2422,-0.6558
2423,-0.66537
2424,-0.67367
2425,-0.67991
2426,-0.68335
2427,-0.6895
2428,-0.69907
2429,-0.7052
2430,-0.71273
2431,-0.71899
2432,-0.7217899999999999
2433,-0.73137
2434,-0.73749
2435,-0.74502
2436,-0.75113
2437,-0.75803
2438,-0.76775
2439,-0.77527
2440,-0.78279
2441,-0.7889
2442,-0.795
2443,-0.8019
2444,-0.80818
2445,-0.81508
2446,-0.8226
2447,-0.82809
2448,-0.83578
2449,-0.84267
2450,-0.8487899999999999
2451,-0.85631
2452,-0.86241
2453,-0.8705200000000001
2454,-0.87479
2455,-0.88108
2456,-0.8886
2457,-0.8961100000000001
2458,-0.90423
2459,-0.9103100000000001
2460,-0.91722
2461,-0.9235200000000001
2462,-0.9284
2463,-0.93794
2464,-0.94342
2465,-0.9497200000000001
2466,-0.956
2467,-0.9641299999999999
2468,-0.9702200000000001
2469,-0.97772
2470,-0.9837899999999999
2471,-0.9886799999999999
2472,-0.9964200000000001
2473,-1.0019
2474,-1.0094
2475,-1.0149
2476,-1.0212
2477,-1.0275
2478,-1.0336
2479,-1.0397
2480,-1.0472
2481,-1.0532
2482,-1.0601
2483,-1.0665
2484,-1.0734
2485,-1.0809
2486,-1.0878
2487,-1.0955
2488,-1.101
2489,-1.1085
2490,-1.114
2491,-1.1203
2492,-1.1266
2493,-1.1341
2494,-1.1416
2495,-1.1479
2496,-1.1541
2497,-1.1617
2498,-1.1678
2499,-1.1741
2500,-1.1783
2501,-1.1838
2502,-1.1919
2503,-1.1994
2504,-1.2056
2505,-1.2116
2506,-1.2159
2507,-1.2256
2508,-1.2331
2509,-1.2393
2510,-1.2435
2511,-1.2512
2512,-1.2573
2513,-1.2648
2514,-1.2717
2515,-1.2759
2516,-1.2828
2517,-1.2903
2518,-1.2958
2519,-1.3021
2520,-1.3062
2521,-1.3158
2522,-1.3219999999999998
2523,-1.3262
2524,-1.3324
2525,-1.3379
2526,-1.3475
2527,-1.3523
2528,-1.3585
2529,-1.3633
2530,-1.3709
2531,-1.3784
2532,-1.3846
2533,-1.3908
2534,-1.3949
2535,-1.4011
2536,-1.4107
2537,-1.4169
2538,-1.4238
2539,-1.43
2540,-1.4348
2541,-1.443
2542,-1.4492
2543,-1.4568
2544,-1.4629
2545,-1.4678
2546,-1.4754
2547,-1.4808
2548,-1.4869999999999999
2549,-1.4932
2550,-1.4993
2551,-1.5089
2552,-1.515
2553,-1.5211
2554,-1.528
2555,-1.5357
2556,-1.5412
2557,-1.5473
2558,-1.5534
2559,-1.5595
2560,-1.569
2561,-1.575
2562,-1.5811
2563,-1.588
2564,-1.5943
2565,-1.6033
2566,-1.6093
2567,-1.6153
2568,-1.6213
2569,-1.6288
2570,-1.6368
2571,-1.6427
2572,-1.6492
2573,-1.6556
2574,-1.663
2575,-1.671
2576,-1.6769
2577,-1.6828
2578,-1.6887
2579,-1.6946
2580,-1.704
2581,-1.7098
2582,-1.7156
2583,-1.7195
2584,-1.7261
2585,-1.7342
2586,-1.74
2587,-1.7458
2588,-1.7516
2589,-1.7574
2590,-1.7667
2591,-1.7724
2592,-1.7781
2593,-1.7838
2594,-1.7895
2595,-1.7965
2596,-1.8032
2597,-1.8102
2598,-1.8158
2599,-1.8233
2600,-1.829
2601,-1.8362
2602,-1.8418
2603,-1.8473
2604,-1.8526
2605,-1.8595
2606,-1.8646
2607,-1.8718
2608,-1.8773
2609,-1.8847
2610,-1.8901
2611,-1.8955
2612,-1.9027
2613,-1.9080000000000001
2614,-1.9152
2615,-1.9205
2616,-1.9257
2617,-1.9327
2618,-1.9397
2619,-1.9468
2620,-1.952
2621,-1.9573
2622,-1.9625
2623,-1.9694
2624,-1.9763
2625,-1.9814
2626,-1.9864
2627,-1.9915
2628,-1.9969
2629,-2.0059
2630,-2.0109
2631,-2.016
2632,-2.0209
2633,-2.0259
2634,-2.0342
2635,-2.0391
2636,-2.0439
2637,-2.0528
2638,-2.06
2639,-2.0651
2640,-2.0699
2641,-2.0746
2642,-2.0793
2643,-2.0855
2644,-2.09
2645,-2.0965
2646,-2.101
2647,-2.1054
2648,-2.1112
2649,-2.1155
2650,-2.1197
2651,-2.1252
2652,-2.1328
2653,-2.1397
2654,-2.1439
2655,-2.148
2656,-2.1521
2657,-2.1561
2658,-2.1613
2659,-2.1652
2660,-2.1711
2661,-2.1749
2662,-2.1785
2663,-2.1833
2664,-2.1868
2665,-2.1902
2666,-2.1936
2667,-2.1969
2668,-2.2035
2669,-2.2102
2670,-2.2168
2671,-2.22
2672,-2.2231
2673,-2.2271
2674,-2.23
2675,-2.2328
2676,-2.2356
2677,-2.2382
2678,-2.2416
2679,-2.244
2680,-2.2464
2681,-2.2486
2682,-2.2508
2683,-2.2559
2684,-2.2578
2685,-2.2597
2686,-2.2614
2687,-2.2635
2688,-2.265
2689,-2.2664
2690,-2.2677
2691,-2.2689
2692,-2.2703
2693,-2.2712
2694,-2.2745
2695,-2.2822
2696,-2.2873
2697,-2.2907
2698,-2.2912
2699,-2.2916
2700,-2.2919
2701,-2.292
2702,-2.292
2703,-2.292
2704,-2.292
2705,-2.2945
2706,-2.2945
2707,-2.2945
2708,-2.2945
