time,value
0,-0.16782
1,-0.16782
2,-0.16782
3,-0.16782
4,-0.16782
5,-0.16782
6,-0.16782
7,-0.16782
8,-0.16782
9,-0.16782
10,-0.16782
11,-0.16782
12,-0.16782
13,-0.16782
14,-0.16782
15,-0.16782
16,-0.16782
17,-0.16782
18,-0.16782
19,-0.16782
20,-0.16782
21,-0.16782
22,-0.16782
23,-0.16782
24,-0.16782
25,-0.16782
26,-0.16782
27,-0.16782
28,-0.16782
29,-0.16782
30,-0.16782
31,-0.16782
32,-0.16782
33,-0.16782
34,-0.16782
35,-0.16782
36,-0.16782
37,-0.16782
38,-0.16782
39,-0.16782
40,-0.16782
41,-0.16782
42,-0.16782
43,-0.16782
44,-0.16782
45,-0.16782
46,-0.16782
47,-0.16782
48,6.1173
49,-0.16782
50,-0.16782
51,-0.16782
52,-0.16782
53,-0.16782
54,-0.16782
55,6.973
56,-0.16782
57,-0.16782
58,-0.16782
59,-0.16782
60,-0.16782
61,-0.16782
62,-0.16782
63,-0.16782
64,-0.16782
65,-0.16782
66,-0.16782
67,-0.16782
68,-0.16782
69,-0.16782
70,-0.16782
71,-0.16782
72,-0.16782
73,-0.16782
74,-0.16782
75,-0.16782
76,-0.16782
77,-0.16782
78,-0.16782
79,-0.16782
80,-0.16782
81,-0.16782
82,-0.16782
83,-0.16782
84,-0.16782
85,-0.16782
86,-0.16782
87,2.5174
88,-0.16782
89,-0.16782
90,-0.16782
91,-0.16782
92,-0.16782
93,-0.16782
94,-0.16782
95,-0.16782
