time,value
0,-0.5595
1,-0.5595
2,-0.32698
3,-0.5595
4,-0.5595
5,-0.5595
6,-0.5595
7,-0.5595
8,-0.5595
9,-0.5595
10,-0.5595
11,-0.5595
12,-0.5595
13,-0.5595
14,-0.5595
15,-0.5595
16,-0.5595
17,-0.5595
18,-0.5595
19,-0.5595
20,-0.5595
21,-0.5595
22,-0.5595
23,-0.5595
24,-0.5595
25,-0.79201
26,0.60309
27,1.9982
28,2.6958
29,2.2307
30,2.2307
31,2.2307
32,-0.32698
33,-0.32698
34,-0.5595
35,-0.5595
36,-0.5595
37,-0.32698
38,-0.5595
39,-0.5595
40,-0.5595
41,-0.5595
42,-0.32698
43,-0.5595
44,-0.5595
45,-0.5595
46,-0.5595
47,-0.5595
48,-0.5595
49,-0.5595
50,-0.5595
51,0.37058
52,1.7657
53,-0.5595
54,-0.32698
55,-0.5595
56,-0.5595
57,-0.5595
58,-0.32698
59,-0.5595
60,-0.5595
61,-0.5595
62,-0.32698
63,-0.09446
64,1.9982
65,1.9982
66,1.9982
67,-0.32698
68,-0.5595
69,-0.32698
70,-0.5595
71,-0.32698
72,1.0681
73,1.9982
74,1.9982
75,-0.09446
76,-0.5595
77,-0.32698
78,-0.5595
79,-0.5595
80,-0.32698
81,-0.5595
82,1.5332
83,1.9982
84,2.2307
85,1.9982
86,1.9982
87,1.9982
88,0.8356100000000001
89,-0.5595
90,-0.32698
91,-0.5595
92,-0.5595
93,-0.32698
94,-0.5595
95,-0.5595
