time,value
0,-0.20886
1,-0.20886
2,-0.20886
3,-0.20886
4,-0.20886
5,-0.20886
6,-0.20886
7,-0.20886
8,-0.20886
9,-0.20886
10,-0.20886
11,-0.20886
12,-0.20886
13,-0.20886
14,-0.20886
15,-0.20886
16,-0.20886
17,-0.20886
18,-0.20886
19,-0.20886
20,-0.20886
21,-0.20886
22,-0.20886
23,-0.20886
24,-0.20886
25,-0.20886
26,-0.20886
27,-0.20886
28,-0.20886
29,-0.20886
30,-0.20886
31,-0.20886
32,0.022014
33,5.3144
34,3.3608
35,0.093053
36,0.093053
37,0.075293
38,6.6108
39,2.8103
40,-0.20886
41,-0.20886
42,-0.20886
43,-0.20886
44,-0.20886
45,-0.20886
46,-0.20886
47,-0.20886
48,-0.20886
49,-0.20886
50,-0.20886
51,-0.20886
52,-0.20886
53,-0.20886
54,-0.20886
55,-0.20886
56,-0.20886
57,-0.20886
58,-0.20886
59,-0.20886
60,-0.20886
61,-0.20886
62,-0.20886
63,-0.20886
64,-0.20886
65,-0.20886
66,-0.20886
67,-0.20886
68,-0.20886
69,-0.20886
70,-0.20886
71,-0.20886
72,-0.20886
73,-0.20886
74,-0.20886
75,-0.20886
76,-0.20886
77,-0.20886
78,-0.20886
79,-0.20886
80,-0.20886
81,-0.20886
82,-0.20886
83,-0.20886
84,-0.20886
85,-0.20886
86,-0.20886
87,-0.20886
88,-0.20886
89,-0.20886
90,-0.20886
91,-0.20886
92,-0.20886
93,-0.20886
94,-0.20886
95,-0.20886
