time,value
0,-0.14087
1,-0.14087
2,-0.14087
3,-0.14087
4,-0.14087
5,-0.14087
6,-0.14087
7,-0.14087
8,-0.14087
9,-0.14087
10,-0.14087
11,-0.14087
12,-0.14087
13,-0.14087
14,-0.14087
15,-0.14087
16,-0.14087
17,-0.14087
18,-0.14087
19,-0.14087
20,-0.14087
21,-0.14087
22,-0.14087
23,-0.14087
24,-0.14087
25,-0.14087
26,-0.14087
27,-0.14087
28,-0.14087
29,-0.14087
30,-0.14087
31,-0.14087
32,-0.14087
33,-0.14087
34,-0.14087
35,-0.14087
36,-0.14087
37,-0.14087
38,-0.14087
39,-0.14087
40,-0.14087
41,-0.14087
42,-0.14087
43,-0.14087
44,-0.14087
45,-0.14087
46,-0.14087
47,8.2737
48,-0.14087
49,-0.14087
50,-0.14087
51,-0.14087
52,-0.14087
53,-0.14087
54,-0.14087
55,-0.14087
56,-0.14087
57,-0.14087
58,-0.14087
59,-0.14087
60,-0.14087
61,-0.14087
62,-0.14087
63,-0.14087
64,-0.14087
65,-0.14087
66,-0.14087
67,-0.14087
68,-0.14087
69,-0.14087
70,-0.14087
71,-0.14087
72,-0.14087
73,-0.14087
74,-0.14087
75,-0.14087
76,-0.14087
77,-0.14087
78,4.968
79,-0.14087
80,-0.14087
81,-0.14087
82,-0.14087
83,-0.14087
84,-0.14087
85,-0.14087
86,-0.14087
87,-0.14087
88,-0.14087
89,-0.14087
90,-0.14087
91,-0.14087
92,-0.14087
93,-0.14087
94,-0.14087
95,-0.14087
