time,value
0,-0.16043
1,-0.16043
2,-0.16043
3,-0.16043
4,-0.16043
5,-0.16043
6,-0.16043
7,-0.16043
8,-0.16043
9,-0.16043
10,-0.16043
11,-0.16043
12,-0.16043
13,-0.16043
14,-0.16043
15,-0.16043
16,-0.16043
17,-0.16043
18,-0.16043
19,-0.16043
20,-0.16043
21,-0.16043
22,-0.16043
23,-0.16043
24,-0.16043
25,-0.16043
26,-0.16043
27,-0.16043
28,-0.16043
29,-0.16043
30,-0.16043
31,-0.16043
32,-0.16043
33,-0.16043
34,-0.16043
35,-0.16043
36,-0.16043
37,-0.16043
38,-0.16043
39,-0.16043
40,-0.16043
41,-0.16043
42,-0.16043
43,-0.16043
44,-0.16043
45,-0.16043
46,-0.16043
47,-0.16043
48,-0.16043
49,-0.16043
50,-0.16043
51,-0.16043
52,-0.16043
53,-0.16043
54,-0.16043
55,-0.16043
56,-0.16043
57,-0.16043
58,-0.16043
59,-0.16043
60,-0.16043
61,-0.16043
62,-0.16043
63,-0.16043
64,-0.16043
65,-0.16043
66,-0.16043
67,-0.16043
68,-0.16043
69,-0.16043
70,-0.16043
71,-0.16043
72,-0.16043
73,-0.16043
74,-0.16043
75,-0.16043
76,-0.16043
77,-0.16043
78,3.3398
79,8.4736
80,3.1065
81,-0.16043
82,-0.16043
83,-0.16043
84,-0.16043
85,-0.16043
86,-0.16043
87,-0.16043
88,-0.16043
89,-0.16043
90,-0.16043
91,-0.16043
92,-0.16043
93,-0.16043
94,-0.16043
95,-0.16043
