time,value
0,-0.6883100000000001
1,-0.6883100000000001
2,-0.6883100000000001
3,-0.6883100000000001
4,-0.6883100000000001
5,-0.6883100000000001
6,-0.6883100000000001
7,-0.6883100000000001
8,-0.6883100000000001
9,-0.6883100000000001
10,-0.6883100000000001
11,-0.6883100000000001
12,-0.6883100000000001
13,-0.6883100000000001
14,-0.6883100000000001
15,-0.6883100000000001
16,-0.6883100000000001
17,-0.6883100000000001
18,-0.6883100000000001
19,-0.6883100000000001
20,-0.6883100000000001
21,-0.6883100000000001
22,-0.6883100000000001
23,-0.6883100000000001
24,-0.6883100000000001
25,-0.6883100000000001
26,-0.6883100000000001
27,-0.6883100000000001
28,-0.6883100000000001
29,-0.6883100000000001
30,-0.6883100000000001
31,-0.18898
32,0.80967
33,1.9748
34,0.97611
35,1.8083
36,1.9748
37,0.31034
38,0.31034
39,0.80967
40,-0.18898
41,0.31034
42,1.6419
43,1.8083
44,1.9748
45,0.64323
46,0.47678999999999994
47,1.8083
48,0.47678999999999994
49,1.6419
50,-0.18898
51,1.3090000000000002
52,0.80967
53,1.4754
54,-0.022539
55,-0.35541999999999996
56,-0.022539
57,-0.35541999999999996
58,-0.18898
59,-0.18898
60,1.1426
61,0.47678999999999994
62,1.3090000000000002
63,0.47678999999999994
64,-0.6883100000000001
65,-0.6883100000000001
66,0.47678999999999994
67,-0.6883100000000001
68,1.3090000000000002
69,-0.6883100000000001
70,0.64323
71,-0.6883100000000001
72,0.31034
73,-0.6883100000000001
74,-0.6883100000000001
75,-0.6883100000000001
76,-0.6883100000000001
77,-0.6883100000000001
78,-0.6883100000000001
79,-0.6883100000000001
80,-0.6883100000000001
81,-0.6883100000000001
82,-0.6883100000000001
83,-0.6883100000000001
84,-0.6883100000000001
85,-0.6883100000000001
86,3.6392
87,1.9748
88,2.807
89,1.6419
90,-0.6883100000000001
91,-0.6883100000000001
92,-0.6883100000000001
93,-0.6883100000000001
94,-0.6883100000000001
95,-0.6883100000000001
