time,value
0,-1.1273
1,-1.1273
2,0.044116
3,1.0353
4,1.0353
5,-1.1273
6,-1.1273
7,-1.1273
8,-1.1273
9,0.8551
10,1.0353
11,0.49466000000000004
12,-1.1273
13,-1.1273
14,-1.1273
15,-1.1273
16,0.94521
17,1.1254
18,0.49466000000000004
19,-1.1273
20,-1.1273
21,-1.1273
22,-1.1273
23,1.0353
24,1.0353
25,0.40455
26,-1.1273
27,-1.1273
28,-1.1273
29,0.49466000000000004
30,1.0353
31,1.0353
32,-0.67676
33,-1.1273
34,-1.1273
35,0.94521
36,1.0353
37,1.0353
38,-0.7668699999999999
39,-1.1273
40,-1.1273
41,1.0353
42,1.0353
43,0.94521
44,-0.40643
45,-1.1273
46,-1.1273
47,0.13423
48,1.0353
49,1.0353
50,-1.1273
51,-1.1273
52,-1.1273
53,0.044116
54,1.0353
55,1.0353
56,0.94521
57,0.76499
58,-1.1273
59,-1.1273
60,-0.94709
61,1.1254
62,1.0353
63,0.94521
64,0.31444
65,-1.1273
66,-1.1273
67,-0.67676
68,1.1254
69,1.0353
70,1.0353
71,-0.94709
72,-1.1273
73,-0.58665
74,1.1254
75,1.1254
76,0.94521
77,1.0353
78,0.94521
79,-0.40643
80,-1.1273
81,-1.1273
82,-0.58665
83,1.1254
84,1.0353
85,0.76499
86,-1.1273
87,-1.1273
88,-0.67676
89,1.1254
90,1.1254
91,1.0353
92,1.0353
93,1.0353
94,0.94521
95,0.94521
