time,value
0,-0.76371
1,-0.94885
2,-0.94885
3,-0.39343
4,1.4580000000000002
5,1.3654
6,-0.30086
7,-0.94885
8,-0.94885
9,-0.94885
10,1.3654
11,1.3654
12,0.162
13,-0.94885
14,-0.94885
15,-0.94885
16,0.71742
17,1.3654
18,0.9951399999999999
19,-0.94885
20,-0.94885
21,-0.94885
22,-0.11571
23,1.3654
24,1.3654
25,-0.39343
26,-0.94885
27,-0.94885
28,-0.94885
29,1.2728
30,1.3654
31,0.62485
32,-0.94885
33,-0.94885
34,-0.94885
35,0.9951399999999999
36,1.3654
37,0.81
38,-0.94885
39,-0.94885
40,-0.94885
41,0.53228
42,1.3654
43,1.1803
44,-0.94885
45,-0.94885
46,-0.94885
47,0.34714
48,1.3654
49,1.3654
50,-0.94885
51,-0.94885
52,-0.94885
53,0.25456999999999996
54,1.3654
55,1.2728
56,-0.57857
57,-0.94885
58,-0.94885
59,0.069428
60,1.3654
61,1.2728
62,-0.486
63,-0.94885
64,-0.94885
65,-0.11571
66,1.3654
67,1.3654
68,-0.30086
69,-0.94885
70,-0.94885
71,-0.20828000000000002
72,1.3654
73,1.2728
74,-0.20828000000000002
75,-0.94885
76,-0.94885
77,0.71742
78,1.2728
79,1.2728
80,-0.94885
81,-0.94885
82,-0.94885
83,0.53228
84,1.2728
85,1.1803
86,-0.94885
87,-0.94885
88,-0.94885
89,0.53228
90,1.3654
91,1.1803
92,-0.94885
93,-0.94885
94,-0.94885
95,0.25456999999999996
