time,value
0,1.4856
1,0.8979
2,-0.6693399999999999
3,-0.6693399999999999
4,-0.6693399999999999
5,-0.6693399999999999
6,2.0733
7,0.31018
8,-0.6693399999999999
9,-0.6693399999999999
10,-0.6693399999999999
11,-0.27753
12,2.0733
13,-0.081627
14,-0.6693399999999999
15,-0.6693399999999999
16,-0.6693399999999999
17,0.11427999999999999
18,2.0733
19,-0.27753
20,-0.6693399999999999
21,-0.6693399999999999
22,-0.6693399999999999
23,0.11427999999999999
24,2.0733
25,-0.6693399999999999
26,-0.6693399999999999
27,-0.6693399999999999
28,-0.6693399999999999
29,0.31018
30,2.0733
31,-0.6693399999999999
32,-0.6693399999999999
33,-0.6693399999999999
34,-0.6693399999999999
35,0.5060899999999999
36,1.8774
37,-0.6693399999999999
38,-0.6693399999999999
39,-0.6693399999999999
40,-0.6693399999999999
41,1.0938
42,1.4856
43,-0.6693399999999999
44,-0.6693399999999999
45,-0.6693399999999999
46,-0.6693399999999999
47,1.2897
48,1.0938
49,-0.6693399999999999
50,-0.6693399999999999
51,-0.6693399999999999
52,-0.6693399999999999
53,1.6815
54,0.8979
55,-0.6693399999999999
56,-0.6693399999999999
57,-0.6693399999999999
58,-0.6693399999999999
59,1.4856
60,1.0938
61,-0.6693399999999999
62,-0.6693399999999999
63,-0.6693399999999999
64,-0.6693399999999999
65,1.6815
66,0.70199
67,-0.6693399999999999
68,-0.6693399999999999
69,-0.6693399999999999
70,-0.6693399999999999
71,1.8774
72,0.70199
73,-0.6693399999999999
74,-0.6693399999999999
75,-0.6693399999999999
76,-0.6693399999999999
77,1.8774
78,0.70199
79,-0.6693399999999999
80,-0.6693399999999999
81,-0.6693399999999999
82,-0.6693399999999999
83,1.6815
84,1.6815
85,-0.6693399999999999
86,-0.6693399999999999
87,-0.6693399999999999
88,-0.6693399999999999
89,2.0733
90,0.31018
91,-0.6693399999999999
92,-0.6693399999999999
93,-0.6693399999999999
94,-0.6693399999999999
95,2.0733
