time,value
0,4.5504
1,-0.24831
2,-0.24831
3,-0.24831
4,-0.24831
5,-0.24831
6,-0.24831
7,-0.24831
8,-0.24831
9,-0.24831
10,-0.24831
11,-0.24831
12,-0.24831
13,-0.24831
14,-0.24831
15,-0.24831
16,-0.24831
17,-0.24831
18,-0.24831
19,-0.24831
20,-0.24831
21,-0.24831
22,-0.24831
23,-0.24831
24,-0.24831
25,-0.24831
26,-0.24831
27,-0.24831
28,-0.24831
29,-0.24831
30,-0.24831
31,-0.24831
32,-0.24831
33,-0.24831
34,-0.24831
35,-0.24831
36,-0.24831
37,-0.24831
38,-0.24831
39,-0.24831
40,-0.24831
41,-0.24831
42,-0.24831
43,-0.24831
44,-0.24831
45,-0.24831
46,-0.24831
47,-0.24831
48,-0.24831
49,-0.24831
50,-0.24831
51,-0.24831
52,-0.24831
53,-0.24831
54,-0.24831
55,-0.24831
56,-0.24831
57,-0.24831
58,-0.24831
59,-0.24831
60,-0.24831
61,-0.24831
62,-0.24831
63,-0.24831
64,-0.24831
65,-0.24831
66,-0.24831
67,-0.24831
68,-0.24831
69,-0.24831
70,-0.24831
71,-0.24831
72,-0.24831
73,-0.24831
74,-0.24831
75,-0.24831
76,-0.24831
77,-0.24831
78,-0.24831
79,-0.24831
80,-0.24831
81,-0.24831
82,-0.24831
83,-0.24831
84,-0.24831
85,-0.24831
86,-0.24831
87,-0.24831
88,-0.24831
89,4.0562
90,4.3943
91,2.1705
92,1.7154
93,-0.027228
94,-0.053238
95,5.0446
