time,value
0,-0.61859
1,-0.61859
2,-0.61859
3,2.3506
4,-0.024743
5,-0.61859
6,-0.61859
7,-0.61859
8,1.7568
9,0.5691
10,-0.61859
11,-0.61859
12,-0.61859
13,-0.61859
14,2.3506
15,-0.22269
16,-0.61859
17,-0.61859
18,-0.61859
19,0.37115
20,1.9547
21,-0.61859
22,-0.61859
23,-0.61859
24,-0.61859
25,1.1629
26,1.1629
27,-0.61859
28,-0.61859
29,-0.61859
30,-0.61859
31,1.7568
32,0.5691
33,-0.61859
34,-0.61859
35,-0.61859
36,-0.61859
37,2.3506
38,-0.024743
39,-0.61859
40,-0.61859
41,-0.61859
42,-0.024743
43,2.1527
44,-0.61859
45,-0.61859
46,-0.61859
47,-0.61859
48,1.7568
49,0.37115
50,-0.61859
51,-0.61859
52,-0.61859
53,-0.61859
54,2.3506
55,-0.22269
56,-0.61859
57,-0.61859
58,-0.61859
59,0.5691
60,1.7568
61,-0.61859
62,-0.61859
63,-0.61859
64,-0.61859
65,1.3609
66,0.76705
67,-0.61859
68,-0.61859
69,-0.61859
70,-0.61859
71,2.3506
72,-0.024743
73,-0.61859
74,-0.61859
75,-0.61859
76,0.37115
77,2.1527
78,-0.61859
79,-0.61859
80,-0.61859
81,-0.61859
82,0.965
83,1.3609
84,-0.61859
85,-0.61859
86,-0.61859
87,-0.61859
88,1.7568
89,0.37115
90,-0.61859
91,-0.61859
92,-0.61859
93,-0.22269
94,2.3506
95,-0.61859
