time,value
0,-2.2453
1,-2.2239
2,-2.1719
3,-2.0926
4,-2.0647
5,-1.9969999999999999
6,-1.9271
7,-1.874
8,-1.7653
9,-1.6742
10,-1.5519
11,-1.4658
12,-1.4297
13,-1.3312
14,-1.2009999999999998
15,-1.0397
16,-0.8769299999999999
17,-0.74416
18,-0.63543
19,-0.46045
20,-0.37940999999999997
21,-0.22755999999999998
22,-0.082845
23,0.082242
24,0.22059
25,0.35304
26,0.42712
27,0.48765
28,0.5916399999999999
29,0.67114
30,0.723
31,0.74922
32,0.82434
33,0.8473700000000001
34,0.80576
35,0.79235
36,0.76264
37,0.78563
38,0.9498700000000001
39,1.0601
40,1.1365
41,1.2156
42,1.228
43,1.3934
44,1.4246
45,1.4776
46,1.4980000000000002
47,1.4686
48,1.4596
49,1.4596
50,1.4596
51,1.4508
52,1.4211
53,1.3825
54,1.4037
55,1.3953
56,1.3056
57,1.2341
58,1.1484
59,1.0473
60,0.9951399999999999
61,0.99431
62,0.8374
63,0.70452
64,0.6558
65,0.59296
66,0.44025
67,0.35695
68,0.24875
69,0.18185
70,0.14562999999999998
71,0.10708
72,0.11537
73,0.10989000000000002
74,0.14285
75,0.1244
76,0.19580999999999998
77,0.26966
78,0.34675
79,0.27101
80,0.20485
81,0.0067036000000000005
82,-0.16349
83,-0.29522
84,-0.44075
85,-0.5958899999999999
86,-0.66988
87,-0.7721600000000001
88,-0.8495799999999999
89,-0.93237
90,-0.9749200000000001
91,-1.0139
92,-1.0791
93,-1.0828
94,-1.1125
95,-1.1419
96,-1.1094
97,-1.1631
98,-1.2113
99,-1.1477
100,-1.0023
101,-0.8779600000000001
102,-0.74847
103,-0.71107
104,-0.64012
105,-0.45702
106,-0.27181
107,-0.17834
108,-0.091641
109,0.037802999999999996
110,0.092253
111,0.16921
112,0.22838000000000003
113,0.25451999999999997
114,0.28347
115,0.30774
116,0.33385
117,0.29425999999999997
118,0.32254
119,0.24365
120,0.20044
121,0.13573
122,0.19283
123,0.2272
124,0.19938
125,0.22249000000000002
126,0.21406
127,0.22019
128,0.21206
129,0.11474000000000001
130,0.15029
131,0.20396
132,0.25205
133,0.32233
134,0.32492
135,0.39009
136,0.36369
137,0.36695
138,0.25451
139,0.22883
140,0.13785999999999998
141,0.15492999999999998
142,0.054808
143,-0.1646
144,-0.33218000000000003
145,-0.45702
146,-0.54064
147,-0.6527
148,-0.78433
149,-0.81511
150,-0.88365
151,-0.9477399999999999
152,-0.9824
153,-0.9900399999999999
154,-1.0546
155,-0.9988799999999999
156,-1.0003
157,-0.9732700000000001
158,-0.9697899999999999
159,-0.9343299999999999
160,-0.8625200000000001
161,-0.78583
162,-0.74043
163,-0.65262
164,-0.60129
165,-0.49262
166,-0.33971999999999997
167,-0.14213
168,0.0023476
169,0.20083
170,0.34929
171,0.45571000000000006
172,0.49826000000000004
173,0.44647
174,0.4244
175,0.37535999999999997
176,0.30074
177,0.25724
178,0.24502
179,0.20057
180,0.20754
181,0.3249
182,0.35661
183,0.50057
184,0.58463
185,0.7165600000000001
186,0.8875200000000001
187,0.9222600000000001
188,1.0209
189,1.081
190,1.1435
191,1.1995
192,1.1929
193,1.2116
194,1.2943
195,1.3548
196,1.393
197,1.4841
198,1.4841
199,1.5446
200,1.5526
201,1.5305
202,1.5305
203,1.5305
204,1.4784
205,1.4869999999999999
206,1.4655
207,1.4426
208,1.3262
209,1.2429
210,1.1663
211,1.0618
212,0.9746799999999999
213,0.83691
214,0.79601
215,0.8301799999999999
216,0.7570899999999999
217,0.71668
218,0.70292
219,0.67415
220,0.63656
221,0.5668300000000001
222,0.5057699999999999
223,0.41513999999999995
224,0.27664
225,0.2373
226,0.076525
227,-0.073652
228,-0.2147
229,-0.41258
230,-0.55599
231,-0.6975
232,-0.77863
233,-0.91356
234,-1.0291
235,-1.1256
236,-1.2318
237,-1.3593
238,-1.4782
239,-1.5686
240,-1.6406
241,-1.7183
242,-1.8089
243,-1.8704
244,-1.9055
245,-1.9796
246,-2.0419
247,-2.1232
248,-2.1303
249,-2.2027
250,-2.2272
