time,value
0,2.0316
1,9.4587
2,-0.08164
3,-0.12267
4,-0.12267
5,-0.12267
6,-0.12267
7,-0.12267
8,-0.12267
9,-0.12267
10,-0.12267
11,-0.12267
12,-0.12267
13,-0.12267
14,-0.12267
15,-0.12267
16,-0.12267
17,-0.12267
18,-0.12267
19,-0.12267
20,-0.12267
21,-0.12267
22,-0.12267
23,-0.12267
24,-0.12267
25,-0.12267
26,-0.12267
27,-0.12267
28,-0.12267
29,-0.12267
30,-0.12267
31,-0.12267
32,-0.12267
33,-0.12267
34,-0.12267
35,-0.12267
36,-0.12267
37,-0.12267
38,-0.12267
39,-0.12267
40,-0.12267
41,-0.12267
42,-0.12267
43,-0.12267
44,-0.12267
45,-0.12267
46,-0.12267
47,-0.12267
48,-0.12267
49,-0.12267
50,-0.12267
51,-0.12267
52,-0.12267
53,-0.12267
54,-0.12267
55,-0.12267
56,-0.12267
57,-0.12267
58,-0.12267
59,-0.12267
60,-0.12267
61,-0.12267
62,-0.12267
63,-0.12267
64,-0.12267
65,-0.12267
66,-0.12267
67,-0.12267
68,-0.12267
69,-0.12267
70,-0.12267
71,-0.12267
72,-0.12267
73,-0.12267
74,-0.12267
75,-0.12267
76,-0.12267
77,-0.12267
78,-0.12267
79,-0.12267
80,-0.12267
81,-0.12267
82,-0.12267
83,-0.12267
84,-0.12267
85,-0.12267
86,-0.12267
87,-0.12267
88,-0.12267
89,-0.12267
90,-0.12267
91,-0.12267
92,-0.12267
93,-0.12267
94,-0.12267
95,-0.12267
