time,value
0,-0.8215399999999999
1,-0.74831
2,-0.66509
3,-0.57529
4,-0.48489
5,-0.40275
6,-0.33696
7,-0.28751
8,-0.25103000000000003
9,-0.22205999999999998
10,-0.19876
11,-0.18075
12,-0.16817000000000001
13,-0.16226
14,-0.16374
15,-0.17449
16,-0.19372
17,-0.21966999999999998
18,-0.24813000000000002
19,-0.27463000000000004
20,-0.29666
21,-0.31396
22,-0.3302
23,-0.34645
24,-0.36536
25,-0.3821
26,-0.39611
27,-0.4082
28,-0.41784
29,-0.43191999999999997
30,-0.44387
31,-0.46191000000000004
32,-0.47943
33,-0.49943999999999994
34,-0.51941
35,-0.53509
36,-0.5505
37,-0.5603
38,-0.56953
39,-0.56923
40,-0.56228
41,-0.54699
42,-0.51527
43,-0.44568
44,-0.29877
45,-0.048018
46,0.31840999999999997
47,0.7723399999999999
48,1.2668
49,1.7413
50,2.1409
51,2.4335
52,2.6063
53,2.6784
54,2.6717
55,2.617
56,2.5318
57,2.4265
58,2.3089
59,2.1756
60,2.0365
61,1.8864
62,1.7382
63,1.5963
64,1.4686
65,1.3651
66,1.2843
67,1.2314
68,1.1963
69,1.1795
70,1.1734
71,1.1793
72,1.1979
73,1.234
74,1.2931
75,1.3746
76,1.4892
77,1.6384
78,1.8403
79,2.0934
80,2.3876
81,2.6863
82,2.9391
83,3.1049
84,3.1531
85,3.0913
86,2.9360000000000004
87,2.7217
88,2.4764
89,2.2234
90,1.9779
91,1.7374
92,1.4992
93,1.2516
94,0.9971700000000001
95,0.74053
96,0.49273
97,0.26377
98,0.059000000000000004
99,-0.11168
100,-0.2509
101,-0.35838000000000003
102,-0.44466999999999995
103,-0.51243
104,-0.56529
105,-0.60868
106,-0.64294
107,-0.67838
108,-0.70645
109,-0.73092
110,-0.74692
111,-0.75913
112,-0.77146
113,-0.7801100000000001
114,-0.78896
115,-0.7922100000000001
116,-0.79623
117,-0.79928
118,-0.80275
119,-0.80594
120,-0.80757
121,-0.81103
122,-0.81439
123,-0.81934
124,-0.82394
125,-0.82806
126,-0.8313
127,-0.8335799999999999
128,-0.8366299999999999
129,-0.8411
130,-0.8485799999999999
131,-0.85849
132,-0.8701
133,-0.88218
134,-0.8936700000000001
135,-0.9041799999999999
136,-0.9128
137,-0.9194399999999999
138,-0.9233600000000001
139,-0.9243299999999999
140,-0.92191
141,-0.91617
142,-0.90812
143,-0.89859
144,-0.8884
145,-0.87715
146,-0.86525
147,-0.8537
148,-0.8442200000000001
149,-0.8379
150,-0.8344299999999999
151,-0.83409
152,-0.8357600000000001
153,-0.83965
154,-0.8443200000000001
155,-0.8474799999999999
156,-0.84883
157,-0.84724
158,-0.8466799999999999
159,-0.8471700000000001
160,-0.8495
161,-0.85141
162,-0.85114
163,-0.8512
164,-0.85208
165,-0.85667
166,-0.8617100000000001
167,-0.86769
168,-0.8738
169,-0.8778
170,-0.8729299999999999
171,-0.8457
172,-0.78776
173,-0.69513
174,-0.57675
175,-0.44478999999999996
176,-0.3146
177,-0.19910999999999998
178,-0.10399000000000001
179,-0.030095999999999998
180,0.029954
181,0.079975
182,0.12364000000000001
183,0.15899000000000002
184,0.18442999999999998
185,0.20115
186,0.21031
187,0.21548
188,0.21524000000000001
189,0.20981999999999998
190,0.19717
191,0.17772000000000002
192,0.15314
193,0.12432
194,0.094533
195,0.06464400000000001
196,0.038779
197,0.017193
198,0.00080485
199,-0.011567000000000001
200,-0.020381
201,-0.025643
202,-0.030052999999999996
203,-0.034133
204,-0.041988
205,-0.0506
206,-0.060287
207,-0.069409
208,-0.079948
209,-0.094685
210,-0.11133
211,-0.1292
212,-0.13963
213,-0.14207
214,-0.13542
215,-0.12384
216,-0.11187000000000001
217,-0.10119
218,-0.098253
219,-0.10367
220,-0.12301
221,-0.15392
222,-0.19283
223,-0.23365
224,-0.26924000000000003
225,-0.29841
226,-0.31761999999999996
227,-0.33049
228,-0.3364
229,-0.33723000000000003
230,-0.33197
231,-0.31919000000000003
232,-0.30002
233,-0.27415
234,-0.24566999999999997
235,-0.21365
236,-0.17957
237,-0.14237
238,-0.10343
239,-0.066218
240,-0.033438
241,-0.009667700000000001
242,0.0062816
243,0.013371000000000001
244,0.013355
245,0.005060899999999999
246,-0.012232
247,-0.039182
248,-0.07702
249,-0.12401
250,-0.17895
251,-0.23690999999999998
252,-0.29507
253,-0.35099
254,-0.4034
255,-0.4498
256,-0.48558999999999997
257,-0.5107
258,-0.5271899999999999
259,-0.54145
260,-0.55691
261,-0.5782
262,-0.6109399999999999
263,-0.65737
264,-0.71324
265,-0.76425
266,-0.80392
267,-0.8349200000000001
268,-0.8670200000000001
269,-0.9003700000000001
