[<text>
<title>up-right inc &lt;upri&gt; 4th qtr oper net</title>
<dateline>    berkeley, calif., march 2 -
    </dateline>oper shr five cts vs 29 cts
    oper net 151,000 vs 867,000
    revs 12.7 mln vs 14.1 mln
    year
    oper shr 87 cts vs 52 cts
    oper net 2,650,000 vs 1,565,000
    revs 54.7 mln vs 49.1 mln
    note: oper data does not include 4th qtr 1986 extraordinary
credit of 14,000 dlrs or 4th qtr 1985 extraordinary loss of
139,000 dlrs, or five cts per shr. for year, does not include
extraordinary credit of 92,000 dlrs, or three cts per shr, in
1986 and 161,000 dlrs, or five cts per shr, in 1985.
 reuter
</text>]