[<text>
<title>banking center &lt;tbcx&gt; 1st qtr net</title>
<dateline>    waterbury, conn., april 13 -
    </dateline>shr 29 cts vs not given
    net 3,508,000 vs 2,483,000
    note: company went public in august 1986.
    1986 figures restated.
    net includes loan loss provision 550,000 dlrs vs 203,000
dlrs, gain on sale of securities of 309,000 dlrs vs 638,000
dlrs and gain on sale of loans 403,000 dlrs vs 553,000 dlrs.
 reuter
</text>]