time,value
0,-0.32694
1,-0.32694
2,-0.32694
3,-0.32694
4,-0.32694
5,-0.32694
6,-0.32694
7,-0.32694
8,-0.32694
9,-0.32694
10,-0.32694
11,-0.32694
12,-0.32694
13,-0.32694
14,-0.32694
15,-0.32694
16,-0.32694
17,-0.32694
18,-0.32694
19,-0.32694
20,-0.32694
21,-0.32694
22,-0.32694
23,-0.32694
24,-0.32694
25,-0.32694
26,-0.32694
27,-0.32694
28,-0.32694
29,-0.32694
30,-0.32694
31,-0.32694
32,-0.32694
33,-0.32694
34,-0.32694
35,-0.32694
36,-0.32694
37,-0.32694
38,-0.32694
39,-0.32694
40,-0.32694
41,-0.32694
42,-0.32694
43,-0.32694
44,-0.32694
45,-0.32694
46,-0.32694
47,-0.32694
48,-0.32694
49,-0.32694
50,-0.32694
51,-0.32694
52,-0.32694
53,-0.32694
54,-0.32694
55,-0.32694
56,-0.32694
57,-0.32694
58,-0.32694
59,-0.32694
60,-0.32694
61,-0.32694
62,-0.32694
63,-0.32694
64,-0.32694
65,3.984
66,3.4939
67,2.7737
68,3.1738
69,3.1438
70,3.2438
71,3.2538
72,2.1936
73,1.7135
74,1.1134
75,-0.29694
76,-0.32694
77,-0.32694
78,-0.32694
79,-0.32694
80,-0.32694
81,-0.32694
82,-0.32694
83,-0.32694
84,-0.32694
85,-0.32694
86,-0.32694
87,-0.32694
88,-0.32694
89,-0.32694
90,-0.32694
91,-0.32694
92,-0.32694
93,-0.32694
94,-0.32694
95,-0.32694
