time,value
0,1.8695
1,1.8509
2,1.8183
3,1.7955
4,1.7605
5,1.7156
6,1.6735
7,1.6209
8,1.5648
9,1.49
10,1.4409999999999998
11,1.3694
12,1.3119999999999998
13,1.228
14,1.1391
15,1.0477
16,0.9779100000000001
17,0.9058799999999999
18,0.8328399999999999
19,0.7452
20,0.67283
21,0.65388
22,0.64825
23,0.66973
24,0.69133
25,0.72958
26,0.77369
27,0.80362
28,0.8372700000000001
29,0.8551700000000001
30,0.8533700000000001
31,0.8521299999999999
32,0.84396
33,0.8194600000000001
34,0.7960699999999999
35,0.7528199999999999
36,0.68438
37,0.60733
38,0.5442100000000001
39,0.47901000000000005
40,0.40571
41,0.33551
42,0.26069000000000003
43,0.20999
44,0.1391
45,0.068191
46,0.017775
47,-0.050787
48,-0.11914000000000001
49,-0.17421
50,-0.23976
51,-0.29677
52,-0.35562
53,-0.4235
54,-0.49254
55,-0.55877
56,-0.62038
57,-0.69601
58,-0.7605
59,-0.82463
60,-0.88975
61,-0.9550799999999999
62,-1.0239
63,-1.0829
64,-1.1507
65,-1.2112
66,-1.2359
67,-1.2161
68,-1.1712
69,-1.1285
70,-1.0644
71,-1.0129
72,-0.92679
73,-0.8422700000000001
74,-0.78214
75,-0.69702
76,-0.6411899999999999
77,-0.58245
78,-0.52715
79,-0.50403
80,-0.46821999999999997
81,-0.39669
82,-0.34918000000000005
83,-0.32168
84,-0.31335
85,-0.31384
86,-0.31039
87,-0.30573
88,-0.30664
89,-0.31331
90,-0.33421
91,-0.3563
92,-0.391
93,-0.41667
94,-0.4543
95,-0.49125
96,-0.52754
97,-0.56985
98,-0.58426
99,-0.61511
100,-0.6331399999999999
101,-0.66245
102,-0.68701
103,-0.7120000000000001
104,-0.74146
105,-0.7729699999999999
106,-0.80392
107,-0.8443
108,-0.86782
109,-0.9296
110,-0.9462700000000001
111,-0.99513
112,-1.0499
113,-1.0967
114,-1.1665
115,-1.2138
116,-1.2748
117,-1.3152
118,-1.3538
119,-1.4069999999999998
120,-1.4646
121,-1.4979
122,-1.5147
123,-1.4744
124,-1.4122
125,-1.3484
126,-1.3264
127,-1.261
128,-1.1923
129,-1.1333
130,-1.0581
131,-0.9977600000000001
132,-0.94395
133,-0.8685
134,-0.80591
135,-0.73834
136,-0.67119
137,-0.60747
138,-0.542
139,-0.46105
140,-0.39354
141,-0.35109
142,-0.30245
143,-0.27205999999999997
144,-0.23786999999999997
145,-0.20842
146,-0.1863
147,-0.17489000000000002
148,-0.15912
149,-0.15174
150,-0.16112
151,-0.13968
152,-0.12774000000000002
153,-0.10801
154,-0.092429
155,-0.078048
156,-0.069049
157,-0.058322000000000006
158,-0.043873
159,-0.02574
160,-0.015011000000000002
161,-0.0043106
162,0.017728999999999998
163,0.036181
164,0.065558
165,0.08548
166,0.10980999999999999
167,0.11085
168,0.12528
169,0.13998
170,0.16810999999999998
171,0.18278
172,0.20661
173,0.2388
174,0.28008
175,0.33671999999999996
176,0.39277
177,0.46676000000000006
178,0.5254800000000001
179,0.60729
180,0.68797
181,0.7569899999999999
182,0.82557
183,0.9015700000000001
184,0.9889399999999999
185,1.0592
186,1.1332
187,1.2222
188,1.2913
189,1.3868
190,1.4551
191,1.5504
192,1.6192
193,1.6929
194,1.7822
195,1.8635
196,1.9449
197,2.0393
198,2.1097
199,2.1752
200,2.2018
201,2.2169
202,2.2021
203,2.1813
204,2.1109999999999998
205,2.0302
206,1.9568
207,1.8869999999999998
208,1.8172
209,1.7428
210,1.6579
211,1.5803
212,1.5112
213,1.4348
214,1.3462
215,1.2770000000000001
216,1.1833
217,1.1133
218,1.0214
219,0.9293899999999999
220,0.8627
221,0.7848
222,0.71653
223,0.67209
224,0.6369
225,0.5715600000000001
226,0.48908999999999997
227,0.46336000000000005
228,0.44371000000000005
229,0.43476000000000004
230,0.4247
231,0.4246
232,0.47288
233,0.51995
234,0.53679
235,0.5287
236,0.52081
237,0.50684
238,0.49993999999999994
239,0.50838
240,0.51332
241,0.51102
242,0.5062
243,0.49656000000000006
244,0.48654
245,0.45863999999999994
246,0.42038000000000003
247,0.38174
248,0.34576
249,0.28923000000000004
250,0.24545999999999998
251,0.16423
252,0.10152
253,0.037265
254,-0.036323
255,-0.10142999999999999
256,-0.16629000000000002
257,-0.23605
258,-0.29244000000000003
259,-0.36504000000000003
260,-0.42555
261,-0.49968999999999997
262,-0.54806
263,-0.58338
264,-0.60743
265,-0.65292
266,-0.72604
267,-0.76408
268,-0.79087
269,-0.80761
270,-0.81457
271,-0.8194600000000001
272,-0.8271799999999999
273,-0.8367100000000001
274,-0.8401200000000001
275,-0.82889
276,-0.8231700000000001
277,-0.81907
278,-0.80219
279,-0.79215
280,-0.79257
281,-0.79552
282,-0.80369
283,-0.81994
284,-0.84651
285,-0.87498
286,-0.87629
287,-0.88133
288,-0.89165
289,-0.8916700000000001
290,-0.8916
291,-0.88787
292,-0.9071799999999999
293,-0.9238700000000001
294,-0.9528200000000001
295,-0.99215
296,-1.033
297,-1.0864
298,-1.1515
299,-1.2177
300,-1.3007
301,-1.3726
302,-1.4342
303,-1.4997
304,-1.5694
305,-1.6621
306,-1.7075
307,-1.7911
308,-1.8532
309,-1.8968
310,-1.9016
311,-1.9346
312,-1.9723
313,-2.0131
314,-1.9918
315,-1.9559
316,-1.9113
317,-1.8525
318,-1.7887
319,-1.7321
320,-1.6684
321,-1.6057
322,-1.5422
323,-1.4752
324,-1.416
325,-1.3585
326,-1.2931
327,-1.2294
328,-1.1663
329,-1.0938
330,-1.0328
331,-0.9727
332,-0.9189
333,-0.84949
334,-0.79165
335,-0.7338600000000001
336,-0.67061
337,-0.61105
338,-0.55072
339,-0.49593999999999994
340,-0.42838000000000004
341,-0.36705
342,-0.33629000000000003
343,-0.3262
344,-0.29367
345,-0.2718
346,-0.22796999999999998
347,-0.17263
348,-0.096005
349,-0.024205
350,0.032326
351,0.071983
352,0.09805499999999999
353,0.11191
354,0.11238
355,0.10228999999999999
356,0.085703
357,0.069435
358,0.05372999999999999
359,0.014866999999999998
360,-0.036995
361,-0.084578
362,-0.13485
363,-0.18723
364,-0.23870999999999998
365,-0.28406
366,-0.34106
367,-0.38452
368,-0.43548000000000003
369,-0.47927
370,-0.5043
371,-0.55206
372,-0.56609
373,-0.56712
374,-0.5050399999999999
375,-0.41318999999999995
376,-0.36815
377,-0.31203000000000003
378,-0.25208
379,-0.18761
380,-0.11325999999999999
381,-0.042246
382,0.030650999999999998
383,0.099998
384,0.19380999999999998
385,0.28491
386,0.37461
387,0.42831
388,0.43601
389,0.48946000000000006
390,0.58153
391,0.67309
392,0.76557
393,0.81521
394,0.88739
395,0.9766799999999999
396,1.0393
397,1.1009
398,1.1567
399,1.1953
400,1.2186
401,1.2309
402,1.2376
403,1.2324
404,1.2063
405,1.2023
406,1.1751
407,1.175
408,1.1522
409,1.1428
410,1.1469
411,1.1902
412,1.2373
413,1.2955
414,1.3667
415,1.4241
416,1.4834
417,1.5485
418,1.6154
419,1.6656
420,1.719
421,1.7611
422,1.7941
423,1.8221
424,1.8427
425,1.8587
426,1.8769999999999998
