time,value
0,-0.45983999999999997
1,-0.45983999999999997
2,-0.45983999999999997
3,-0.45983999999999997
4,-0.45983999999999997
5,-0.45983999999999997
6,-0.45983999999999997
7,-0.45983999999999997
8,-0.45983999999999997
9,-0.45983999999999997
10,-0.45983999999999997
11,-0.45983999999999997
12,-0.45983999999999997
13,-0.45983999999999997
14,-0.45983999999999997
15,-0.45983999999999997
16,-0.45983999999999997
17,-0.45983999999999997
18,-0.45983999999999997
19,-0.45983999999999997
20,-0.45983999999999997
21,-0.45983999999999997
22,-0.45983999999999997
23,-0.45983999999999997
24,-0.45983999999999997
25,-0.45983999999999997
26,-0.45983999999999997
27,-0.45983999999999997
28,-0.45983999999999997
29,-0.45983999999999997
30,-0.45983999999999997
31,-0.45983999999999997
32,-0.45983999999999997
33,-0.45983999999999997
34,-0.45983999999999997
35,-0.45983999999999997
36,-0.45983999999999997
37,-0.45983999999999997
38,-0.45983999999999997
39,-0.45983999999999997
40,-0.45983999999999997
41,-0.45983999999999997
42,-0.45983999999999997
43,-0.45983999999999997
44,-0.45983999999999997
45,-0.45983999999999997
46,-0.45983999999999997
47,-0.45983999999999997
48,-0.45983999999999997
49,-0.45983999999999997
50,-0.45983999999999997
51,-0.45983999999999997
52,-0.45983999999999997
53,-0.45983999999999997
54,-0.45983999999999997
55,-0.45983999999999997
56,-0.45983999999999997
57,-0.45983999999999997
58,-0.45983999999999997
59,-0.45983999999999997
60,-0.45983999999999997
61,-0.45983999999999997
62,-0.45983999999999997
63,-0.45983999999999997
64,-0.45983999999999997
65,-0.45983999999999997
66,-0.45983999999999997
67,-0.45983999999999997
68,-0.45983999999999997
69,-0.45983999999999997
70,-0.45983999999999997
71,-0.45983999999999997
72,-0.45983999999999997
73,-0.45983999999999997
74,-0.45983999999999997
75,-0.45983999999999997
76,-0.45983999999999997
77,2.373
78,3.7893
79,3.0811
80,2.1369
81,2.1369
82,1.9008
83,2.373
84,1.9008
85,2.1369
86,1.9008
87,1.6648
88,1.6648
89,1.4287
90,1.6648
91,1.6648
92,1.4287
93,1.6648
94,0.9565600000000001
95,-0.45983999999999997
