time,value
0,-0.237
1,-0.237
2,-0.237
3,-0.237
4,-0.237
5,-0.237
6,-0.237
7,-0.237
8,-0.237
9,-0.237
10,-0.237
11,-0.237
12,-0.237
13,-0.237
14,-0.237
15,-0.237
16,-0.237
17,-0.237
18,-0.237
19,-0.237
20,-0.237
21,-0.237
22,-0.237
23,-0.237
24,-0.237
25,-0.237
26,-0.237
27,-0.237
28,-0.237
29,-0.237
30,3.4677
31,-0.237
32,1.0911
33,-0.237
34,-0.237
35,-0.237
36,-0.237
37,-0.237
38,-0.237
39,-0.237
40,-0.237
41,-0.237
42,-0.237
43,-0.237
44,-0.237
45,-0.237
46,-0.237
47,-0.237
48,-0.237
49,-0.237
50,-0.237
51,-0.237
52,-0.237
53,-0.237
54,-0.237
55,-0.237
56,-0.237
57,-0.237
58,-0.237
59,-0.237
60,-0.237
61,-0.237
62,-0.237
63,-0.237
64,-0.237
65,-0.237
66,-0.237
67,-0.237
68,-0.237
69,-0.237
70,3.7473
71,0.77654
72,0.14744000000000002
73,-0.237
74,-0.1671
75,-0.097204
76,-0.13215
77,-0.13215
78,6.8927
79,0.49693999999999994
80,-0.237
81,-0.237
82,-0.237
83,-0.237
84,-0.237
85,-0.237
86,-0.237
87,-0.237
88,-0.237
89,-0.237
90,3.8172
91,-0.237
92,-0.237
93,-0.237
94,-0.237
95,-0.237
