time,value
0,-1.1653
1,0.079818
2,1.2292
3,1.1334
4,0.94185
5,0.94185
6,0.8460700000000001
7,0.8460700000000001
8,0.75029
9,0.75029
10,0.8460700000000001
11,-0.30330999999999997
12,-1.1653
13,-1.1653
14,-1.1653
15,-1.1653
16,-1.1653
17,-1.1653
18,-1.1653
19,-1.1653
20,-1.1653
21,1.1334
22,1.2292
23,1.0376
24,0.8460700000000001
25,0.8460700000000001
26,0.8460700000000001
27,0.8460700000000001
28,0.079818
29,-1.1653
30,-1.1653
31,-1.1653
32,-1.1653
33,-1.1653
34,-1.1653
35,-1.1653
36,-1.1653
37,-0.97377
38,1.325
39,1.1334
40,1.0376
41,0.94185
42,0.8460700000000001
43,0.8460700000000001
44,0.75029
45,0.75029
46,0.8460700000000001
47,0.75029
48,0.55872
49,-1.1653
50,-1.1653
51,-1.1653
52,-1.1653
53,-1.1653
54,-1.1653
55,-1.1653
56,-1.1653
57,-1.1653
58,0.079818
59,1.2292
60,1.1334
61,0.94185
62,0.8460700000000001
63,0.8460700000000001
64,0.8460700000000001
65,0.75029
66,0.75029
67,0.75029
68,-1.1653
69,-1.1653
70,-1.1653
71,-1.1653
72,-1.1653
73,-1.1653
74,-1.1653
75,-1.1653
76,-1.1653
77,0.36716
78,1.2292
79,1.0376
80,0.94185
81,0.94185
82,0.75029
83,0.8460700000000001
84,0.75029
85,0.75029
86,0.75029
87,0.75029
88,0.75029
89,0.75029
90,0.75029
91,0.75029
92,0.75029
93,-0.49487
94,-1.1653
95,-1.1653
