time,value
0,-0.14599
1,-0.14599
2,-0.14599
3,-0.14599
4,-0.14599
5,-0.14599
6,-0.14599
7,-0.14599
8,-0.14599
9,-0.14599
10,-0.14599
11,-0.14599
12,-0.14599
13,-0.14599
14,-0.14599
15,-0.14599
16,-0.14599
17,-0.14599
18,-0.14599
19,-0.14599
20,-0.14599
21,-0.14599
22,-0.14599
23,-0.14599
24,-0.14599
25,-0.14599
26,-0.14599
27,-0.14599
28,-0.14599
29,-0.14599
30,-0.14599
31,-0.14599
32,-0.14599
33,-0.14599
34,-0.14599
35,-0.14599
36,-0.14599
37,-0.14599
38,-0.14599
39,-0.14599
40,-0.14599
41,-0.14599
42,-0.14599
43,-0.14599
44,-0.14599
45,-0.14599
46,-0.14599
47,-0.14599
48,-0.14599
49,-0.14599
50,-0.14599
51,-0.14599
52,-0.14599
53,-0.14599
54,-0.14599
55,-0.14599
56,-0.14599
57,-0.14599
58,-0.14599
59,-0.14599
60,-0.14599
61,-0.14599
62,-0.14599
63,-0.14599
64,-0.14599
65,-0.14599
66,-0.14599
67,-0.14599
68,-0.14599
69,-0.14599
70,-0.14599
71,-0.14599
72,6.5071
73,7.1185
74,-0.048155
75,-0.14599
76,-0.14599
77,-0.14599
78,-0.14599
79,-0.14599
80,-0.14599
81,-0.14599
82,-0.14599
83,-0.14599
84,-0.14599
85,-0.14599
86,-0.14599
87,-0.14599
88,-0.14599
89,-0.14599
90,-0.14599
91,-0.14599
92,-0.14599
93,-0.14599
94,-0.14599
95,-0.14599
