time,value
0,-2.3729
1,-2.3729
2,-2.3752
3,-2.3776
4,-2.3846
5,-2.3916
6,-2.3916
7,-2.3916
8,-2.3938
9,-2.3937
10,-2.3936
11,-2.3932
12,-2.3931
13,-2.3928
14,-2.3921
15,-2.3912
16,-2.3902
17,-2.3893
18,-2.3879
19,-2.3865
20,-2.3848
21,-2.3807
22,-2.3788
23,-2.3772
24,-2.375
25,-2.3726
26,-2.3701
27,-2.3674
28,-2.3646
29,-2.3617
30,-2.3594
31,-2.3562
32,-2.3528
33,-2.3493
34,-2.3457
35,-2.342
36,-2.3391
37,-2.3352
38,-2.3311
39,-2.3269
40,-2.3247
41,-2.3202
42,-2.3157
43,-2.3122
44,-2.3074
45,-2.3026
46,-2.2976
47,-2.301
48,-2.3075
49,-2.3036
50,-2.2983
51,-2.2928
52,-2.2873
53,-2.2818
54,-2.2761
55,-2.2703
56,-2.2659
57,-2.26
58,-2.254
59,-2.248
60,-2.2418
61,-2.2373
62,-2.231
63,-2.2263
64,-2.2199
65,-2.2134
66,-2.2068
67,-2.1986
68,-2.1919
69,-2.1869
70,-2.1801
71,-2.1733
72,-2.1664
73,-2.1584
74,-2.1502
75,-2.1433
76,-2.1381
77,-2.1312
78,-2.1227
79,-2.1156
80,-2.1085
81,-2.1014
82,-2.096
83,-2.0888
84,-2.0819
85,-2.0742
86,-2.0676
87,-2.0604
88,-2.0531
89,-2.0477
90,-2.0403
91,-2.0315
92,-2.0241
93,-2.0167
94,-2.0087
95,-2.0026
96,-1.9956
97,-1.9882
98,-1.9793
99,-1.9704
100,-1.963
101,-1.9564
102,-1.9508
103,-1.9433
104,-1.9358
105,-1.9268
106,-1.9193
107,-1.9127
108,-1.9067
109,-1.9002
110,-1.8913
111,-1.8837
112,-1.876
113,-1.8668
114,-1.8608
115,-1.8551
116,-1.8475
117,-1.8399
118,-1.8309
119,-1.8232
120,-1.8161
121,-1.8102
122,-1.8042
123,-1.7966
124,-1.7888
125,-1.7811
126,-1.7721
127,-1.7643
128,-1.7584
129,-1.7506
130,-1.7422
131,-1.7351
132,-1.7280000000000002
133,-1.7201
134,-1.7143
135,-1.7064
136,-1.6985
137,-1.6894
138,-1.6815
139,-1.6735
140,-1.6656
141,-1.6596
142,-1.6532
143,-1.6463
144,-1.6391
145,-1.6299
146,-1.6219
147,-1.6159999999999999
148,-1.6071
149,-1.5994
150,-1.5903
151,-1.5826
152,-1.5757
153,-1.5677
154,-1.5618
155,-1.5538
156,-1.5458
157,-1.5378
158,-1.5286
159,-1.5206
160,-1.5145
161,-1.5065
162,-1.4984
163,-1.4917
164,-1.4861
165,-1.4780000000000002
166,-1.47
167,-1.4639
168,-1.4546
169,-1.4465
170,-1.4404
171,-1.4338
172,-1.4282
173,-1.4222
174,-1.4129
175,-1.4048
176,-1.3967
177,-1.3885
178,-1.3824
179,-1.3792
180,-1.374
181,-1.3647
182,-1.3563
183,-1.3531
184,-1.3459
185,-1.3418
186,-1.3397
187,-1.3336
188,-1.3254
189,-1.3172
190,-1.3090000000000002
191,-1.2997
192,-1.2914
193,-1.2853
194,-1.2770000000000001
195,-1.2717
196,-1.2631
197,-1.2549
198,-1.2466
199,-1.2384
200,-1.2311
201,-1.2228
202,-1.2145
203,-1.2062
204,-1.1989
205,-1.1925
206,-1.1883
207,-1.18
208,-1.1717
209,-1.1634
210,-1.1551
211,-1.1468
212,-1.1374
213,-1.1311
214,-1.1228
215,-1.1144
216,-1.1061
217,-1.0977
218,-1.0904
219,-1.0852
220,-1.0779
221,-1.0695
222,-1.0611
223,-1.0517
224,-1.0433
225,-1.0349
226,-1.0286
227,-1.0202
228,-1.0129
229,-1.0067
230,-0.9983200000000001
231,-0.9899100000000001
232,-0.9836
233,-0.9751799999999999
234,-0.96675
235,-0.95831
236,-0.94986
237,-0.9414100000000001
238,-0.93294
239,-0.9256
240,-0.9171299999999999
241,-0.90865
242,-0.9001600000000001
243,-0.8916700000000001
244,-0.88449
245,-0.88155
246,-0.8742
247,-0.86572
248,-0.8572299999999999
249,-0.8487299999999999
250,-0.8402200000000001
251,-0.8317100000000001
252,-0.82532
253,-0.81583
254,-0.8073100000000001
255,-0.79877
256,-0.79023
257,-0.78168
258,-0.7752600000000001
259,-0.7667
260,-0.76054
261,-0.75463
262,-0.74727
263,-0.7387199999999999
264,-0.73016
265,-0.7237399999999999
266,-0.71424
267,-0.70567
268,-0.69709
269,-0.6885
270,-0.67991
271,-0.67347
272,-0.66733
273,-0.6614899999999999
274,-0.65198
275,-0.64339
276,-0.6348
277,-0.6262
278,-0.61975
279,-0.61114
280,-0.60252
281,-0.5939
282,-0.58527
283,-0.5766399999999999
284,-0.57016
285,-0.56152
286,-0.55199
287,-0.5433399999999999
288,-0.53469
289,-0.52603
290,-0.51736
291,-0.5108600000000001
292,-0.5021899999999999
293,-0.49351000000000006
294,-0.48482
295,-0.47613999999999995
296,-0.4683
297,-0.4596
298,-0.45307
299,-0.44436000000000003
300,-0.4348
301,-0.42608999999999997
302,-0.41736999999999996
303,-0.40864
304,-0.4021
305,-0.39655999999999997
306,-0.38966
307,-0.3801
308,-0.37538
309,-0.36979
310,-0.36109
311,-0.35456
312,-0.345
313,-0.33629000000000003
314,-0.32758000000000004
315,-0.31886
316,-0.31196999999999997
317,-0.30942
318,-0.29901
319,-0.29209
320,-0.28648
321,-0.27779
322,-0.26909
323,-0.25954
324,-0.25301999999999997
325,-0.24741
326,-0.24048000000000003
327,-0.23179
328,-0.22224000000000002
329,-0.21354
330,-0.20965
331,-0.20748000000000003
332,-0.19877999999999998
333,-0.18837
334,-0.17882
335,-0.16926
336,-0.16405999999999998
337,-0.16405999999999998
338,-0.15536
339,-0.15100999999999998
340,-0.1458
341,-0.13709000000000002
342,-0.1315
343,-0.12675
344,-0.11805999999999998
345,-0.10935999999999998
346,-0.09980599999999999
347,-0.091102
348,-0.08239500000000001
349,-0.075014
350,-0.070281
351,-0.063365
352,-0.053811000000000005
353,-0.048199
354,-0.039093
355,-0.030406
356,-0.023027000000000002
357,-0.014334999999999999
358,-0.005640399999999999
359,0.0030586
360,0.0091216
361,0.014734
362,0.024284
363,0.030805000000000003
364,0.039499
365,0.049054
366,0.057754999999999994
367,0.067312
368,0.07291
369,0.076804
370,0.085496
371,0.094193
372,0.10375
373,0.11245
374,0.12115999999999999
375,0.12721
376,0.13195
377,0.13802
378,0.14670999999999998
379,0.15541
380,0.16412000000000002
381,0.17368
382,0.18020999999999998
383,0.18893
384,0.19764
385,0.20369
386,0.20926
387,0.21882
388,0.22753
389,0.23406999999999997
390,0.24278000000000002
391,0.2515
392,0.26106999999999997
393,0.26979000000000003
394,0.27852
395,0.28507
396,0.29381
397,0.30067
398,0.30403
399,0.31275
400,0.32232
401,0.33104
402,0.33759
403,0.34633
404,0.35507
405,0.36380999999999997
406,0.37338000000000005
407,0.37888
408,0.38273
409,0.39147
410,0.40021
411,0.40895
412,0.41768999999999995
413,0.42644
414,0.43601
415,0.44258000000000003
416,0.45133
417,0.46008999999999994
418,0.46748
419,0.47048
420,0.47486000000000006
421,0.48363
422,0.49101000000000006
423,0.5014
424,0.51098
425,0.51399
426,0.51837
427,0.52494
428,0.52494
429,0.52713
430,0.5359
431,0.54467
432,0.55345
433,0.5622199999999999
434,0.5710000000000001
435,0.5775899999999999
436,0.58638
437,0.59517
438,0.60396
439,0.61275
440,0.61715
441,0.61935
442,0.62595
443,0.63035
444,0.63255
445,0.63695
446,0.64575
447,0.65456
448,0.66117
449,0.66998
450,0.67879
451,0.68761
452,0.68982
453,0.68982
454,0.69643
455,0.70084
456,0.70305
457,0.70967
458,0.7185
459,0.72732
460,0.73616
461,0.74355
462,0.75238
463,0.76122
464,0.7700600000000001
465,0.7781399999999999
466,0.78699
467,0.7936300000000001
468,0.80248
469,0.81058
470,0.80981
471,0.81498
472,0.82385
473,0.83199
474,0.83865
475,0.84752
476,0.8556799999999999
477,0.85572
478,0.85283
479,0.8499700000000001
480,0.8478399999999999
481,0.84501
482,0.8422
483,0.83942
484,0.83665
485,0.83081
486,0.82119
487,0.8182699999999999
488,0.8133
489,0.80523
490,0.79561
491,0.78666
492,0.77704
493,0.77276
494,0.7685
495,0.75955
496,0.7506
497,0.74097
498,0.7320300000000001
499,0.7230800000000001
500,0.7179300000000001
501,0.71522
502,0.71029
503,0.70762
504,0.70181
505,0.69285
506,0.68612
507,0.6765
508,0.67135
509,0.66778
510,0.6633
511,0.6543399999999999
512,0.64537
513,0.63865
514,0.6297
515,0.62612
516,0.62321
517,0.61425
518,0.60664
519,0.6006
520,0.59904
521,0.5968
522,0.59009
523,0.5804699999999999
524,0.57531
525,0.57172
526,0.56433
527,0.55986
528,0.55762
529,0.5479999999999999
530,0.54061
531,0.53567
532,0.52985
533,0.52313
534,0.51418
535,0.5052300000000001
536,0.4956
537,0.48665
538,0.47771
539,0.47100000000000003
540,0.46429
541,0.46206
542,0.45175
543,0.44211999999999996
544,0.43696999999999997
545,0.43113999999999997
546,0.42375
547,0.42152
548,0.41928000000000004
549,0.41034
550,0.40139
551,0.39245
552,0.38575
553,0.37613
554,0.36719
555,0.35825999999999997
556,0.35156
557,0.34657
558,0.34228000000000003
559,0.33558000000000004
560,0.32664
561,0.3177
562,0.30877
563,0.29915
564,0.29020999999999997
565,0.28352
566,0.27459
567,0.26566999999999996
568,0.25674
569,0.25465
570,0.24741999999999997
571,0.2378
572,0.23264
573,0.22766999999999998
574,0.22183000000000003
575,0.21289
576,0.20327
577,0.19433
578,0.19072
579,0.18577
580,0.17837999999999998
581,0.16944
582,0.15980999999999998
583,0.15086
584,0.14192000000000002
585,0.13522
586,0.13161
587,0.12667
588,0.11861
589,0.10965
590,0.10472999999999999
591,0.10115
592,0.091526
593,0.082565
594,0.07293999999999999
595,0.06398200000000001
596,0.055028
597,0.049208
598,0.044964
599,0.036248
600,0.026621
601,0.021741
602,0.015944
603,0.006968600000000001
604,0.00023958
605,-0.008730400000000001
606,-0.018359
607,-0.027326999999999997
608,-0.033131
609,-0.037999
610,-0.047629000000000005
611,-0.054360000000000006
612,-0.06398999999999999
613,-0.072962
614,-0.08193500000000001
615,-0.091562
616,-0.09643099999999999
617,-0.099976
618,-0.10895999999999999
619,-0.11793
620,-0.12691
621,-0.13654000000000002
622,-0.14551
623,-0.15448
624,-0.1612
625,-0.16859000000000002
626,-0.17347
627,-0.17926
628,-0.18889
629,-0.19338
630,-0.19338
631,-0.20235
632,-0.21131999999999998
633,-0.21488000000000002
634,-0.22002
635,-0.22965
636,-0.23994000000000001
637,-0.24666999999999997
638,-0.24891
639,-0.25181
640,-0.26079
641,-0.27042
642,-0.27939
643,-0.28611
644,-0.29098
645,-0.29741999999999996
646,-0.3064
647,-0.31604
648,-0.32500999999999997
649,-0.32921
650,-0.33339
651,-0.34302
652,-0.35201
653,-0.36164
654,-0.36838000000000004
655,-0.3732
656,-0.37736
657,-0.38474
658,-0.39276
659,-0.39752
660,-0.39815
661,-0.39876999999999996
662,-0.40349
663,-0.40635
664,-0.41148
665,-0.41616000000000003
666,-0.42081999999999997
667,-0.42426
668,-0.42426
669,-0.42661000000000004
670,-0.43062
671,-0.43291
672,-0.43517
673,-0.43517
674,-0.43573999999999996
675,-0.43796
676,-0.43851
677,-0.43851
678,-0.43623
679,-0.42713999999999996
680,-0.41805
681,-0.4095
682,-0.4004
683,-0.39358000000000004
684,-0.38448000000000004
685,-0.37538
686,-0.36628
687,-0.3661
688,-0.36155
689,-0.35470999999999997
690,-0.3456
691,-0.33648
692,-0.32787
693,-0.31926
694,-0.31749
695,-0.31293000000000004
696,-0.30608
697,-0.29695
698,-0.29467
699,-0.2901
700,-0.28097
701,-0.27233
702,-0.26548
703,-0.26238
704,-0.26203000000000004
705,-0.25288
706,-0.24373000000000003
707,-0.23456999999999997
708,-0.22589
709,-0.21902
710,-0.20986
711,-0.20943
712,-0.20621
713,-0.19704000000000002
714,-0.18787
715,-0.18143
716,-0.17226
717,-0.16308
718,-0.15849000000000002
719,-0.15619
720,-0.14702
721,-0.14472000000000002
722,-0.14243
723,-0.13554000000000002
724,-0.12636
725,-0.11673
726,-0.10755
727,-0.098366
728,-0.091478
729,-0.087869
730,-0.0838
731,-0.07462200000000001
732,-0.065446
733,-0.055821
734,-0.048494
735,-0.044854000000000005
736,-0.038911
737,-0.02974
738,-0.020568
739,-0.010943000000000001
740,-0.0017724
741,0.0051086000000000005
742,0.012891999999999999
743,0.014717
744,0.024344
745,0.033511
746,0.042678
747,0.052302999999999995
748,0.059178999999999995
749,0.068348
750,0.077519
751,0.087144
752,0.091267
753,0.096776
754,0.10365
755,0.11281
756,0.12244000000000001
757,0.1316
758,0.14077
759,0.14856
760,0.15042
761,0.15775999999999998
762,0.16692
763,0.17608
764,0.18571
765,0.19487000000000002
766,0.20403
767,0.2132
768,0.22007
769,0.22924
770,0.2384
771,0.24254
772,0.24852
773,0.25768
774,0.26455
775,0.27371
776,0.28286999999999995
777,0.2925
778,0.30167
779,0.31083
780,0.31999
781,0.32687
782,0.33603
783,0.33879000000000004
784,0.34383
785,0.35346
786,0.36125
787,0.36401
788,0.36905
789,0.37592
790,0.37822
791,0.38509
792,0.39425
793,0.40342
794,0.41075
795,0.41991999999999996
796,0.42908999999999997
797,0.43276000000000003
798,0.4392
799,0.44836000000000004
800,0.45523
801,0.46438999999999997
802,0.47356000000000004
803,0.48318
804,0.49235
805,0.50151
806,0.51068
807,0.51755
808,0.52672
809,0.53589
810,0.54506
811,0.54918
812,0.55515
813,0.56203
814,0.57165
815,0.58082
816,0.5854
817,0.58815
818,0.59824
819,0.60787
820,0.61063
821,0.61339
822,0.6230100000000001
823,0.6253
824,0.62989
825,0.63905
826,0.64591
827,0.65508
828,0.6642399999999999
829,0.6734
830,0.68303
831,0.69219
832,0.70136
833,0.70823
834,0.7169399999999999
835,0.72611
836,0.73574
837,0.7449100000000001
838,0.75408
839,0.7609600000000001
840,0.77013
841,0.7793
842,0.7884800000000001
843,0.79765
844,0.80683
845,0.81092
846,0.81412
847,0.82375
848,0.8329200000000001
849,0.84209
850,0.85126
851,0.86088
852,0.8677600000000001
853,0.8769399999999999
854,0.88656
855,0.8906700000000001
856,0.89617
857,0.90533
858,0.9145
859,0.92184
860,0.9309999999999999
861,0.9401799999999999
862,0.94476
863,0.94705
864,0.9548399999999999
865,0.9621700000000001
866,0.96951
867,0.97226
868,0.98234
869,0.98692
870,0.9892200000000001
871,0.9960899999999999
872,1.003
873,1.0121
874,1.0213
875,1.0309
876,1.0401
877,1.0493
878,1.0562
879,1.0621
880,1.0639
881,1.0731
882,1.0823
883,1.0914
884,1.1006
885,1.1079
886,1.1171
887,1.1263
888,1.1354
889,1.1446
890,1.1538
891,1.1561
892,1.1584
893,1.1675
894,1.1767
895,1.179
896,1.1882
897,1.1974
898,1.2042
899,1.2134
900,1.2226
901,1.2318
902,1.2409999999999999
903,1.2464
904,1.2505
905,1.2578
906,1.2670000000000001
907,1.2762
908,1.2854
909,1.2946
910,1.3037
911,1.3106
912,1.3198
913,1.329
914,1.3382
915,1.3446
916,1.3451
917,1.3512
918,1.3581
919,1.3668
920,1.376
921,1.3769999999999998
922,1.3776
923,1.3864
924,1.3933
925,1.3940000000000001
926,1.3974
927,1.4062
928,1.4092
929,1.4080000000000001
930,1.4168
931,1.4237
932,1.4221
933,1.4206
934,1.4191
935,1.4176
936,1.4161
937,1.415
938,1.4135
939,1.4121
940,1.4107
941,1.4093
942,1.4079
943,1.4066
944,1.4056
945,1.4043
946,1.401
947,1.3914
948,1.3858
949,1.3846
950,1.3813
951,1.3801
952,1.3702
953,1.3626
954,1.3591
955,1.3519
956,1.3419999999999999
957,1.3411
958,1.3356
959,1.3264
960,1.3171
961,1.3075
962,1.2982
963,1.2913
964,1.2843
965,1.2809
966,1.2754
967,1.2661
968,1.2565
969,1.2472
970,1.2403
971,1.2309999999999999
972,1.2255
973,1.2224
974,1.2128
975,1.2035
976,1.1966
977,1.1873
978,1.1777
979,1.1684
980,1.1592
981,1.1499
982,1.1465
983,1.1459
984,1.1364
985,1.1271
986,1.1178
987,1.1085
988,1.0992
989,1.0922
990,1.083
991,1.0737
992,1.0644
993,1.0551
994,1.0455
995,1.0363
996,1.0293
997,1.02
998,1.0146
999,1.0112
1000,1.0019
1001,0.9925799999999999
1002,0.9833
1003,0.9763299999999999
1004,0.96678
1005,0.95954
1006,0.9561700000000001
1007,0.951
1008,0.94171
1009,0.93474
1010,0.92545
1011,0.9161600000000001
1012,0.9068700000000001
1013,0.8973200000000001
1014,0.8880299999999999
1015,0.87874
1016,0.87177
1017,0.8624799999999999
1018,0.85319
1019,0.8457
1020,0.84234
1021,0.8327899999999999
1022,0.8258200000000001
1023,0.81653
1024,0.80698
1025,0.79769
1026,0.7884
1027,0.7860699999999999
1028,0.78117
1029,0.77395
1030,0.7644
1031,0.76157
1032,0.75667
1033,0.74945
1034,0.7471300000000001
1035,0.7448
1036,0.73551
1037,0.72621
1038,0.71692
1039,0.7073699999999999
1040,0.69807
1041,0.69293
1042,0.68987
1043,0.6847300000000001
1044,0.67543
1045,0.66613
1046,0.65684
1047,0.64754
1048,0.64032
1049,0.63102
1050,0.6217199999999999
1051,0.61659
1052,0.61331
1053,0.60378
1054,0.5944699999999999
1055,0.58726
1056,0.57796
1057,0.56866
1058,0.55912
1059,0.55587
1060,0.55077
1061,0.54379
1062,0.5344800000000001
1063,0.52518
1064,0.5158699999999999
1065,0.50657
1066,0.49704
1067,0.48773
1068,0.48076
1069,0.47145
1070,0.46424
1071,0.46102
1072,0.45592
1073,0.44661999999999996
1074,0.43964
1075,0.43033000000000005
1076,0.4208
1077,0.41148999999999997
1078,0.40219
1079,0.39288
1080,0.38800999999999997
1081,0.38503000000000004
1082,0.37973
1083,0.37041999999999997
1084,0.36111
1085,0.3518
1086,0.34249
1087,0.33551
1088,0.32598
1089,0.31668
1090,0.30735999999999997
1091,0.29805
1092,0.29297
1093,0.28981999999999997
1094,0.28495
1095,0.27564
1096,0.26633
1097,0.25701999999999997
1098,0.2477
1099,0.23818000000000003
1100,0.2312
1101,0.22189
1102,0.21681999999999998
1103,0.2137
1104,0.20419
1105,0.19487000000000002
1106,0.18555
1107,0.17837
1108,0.16906
1109,0.15974000000000002
1110,0.15042
1111,0.14110999999999999
1112,0.138
1113,0.13745
1114,0.12813
1115,0.11880999999999999
1116,0.10949
1117,0.10017000000000001
1118,0.090848
1119,0.08152999999999999
1120,0.074352
1121,0.06503400000000001
1122,0.055715
1123,0.046396
1124,0.037078
1125,0.027759
1126,0.018441
1127,0.011452
1128,0.0091216
1129,0.0040846
1130,-0.0054214
1131,-0.014924000000000002
1132,-0.017439
1133,-0.019769
1134,-0.029087000000000002
1135,-0.031418
1136,-0.038224
1137,-0.047542
1138,-0.052203
1139,-0.054717999999999996
1140,-0.057233000000000006
1141,-0.066736
1142,-0.069066
1143,-0.073727
1144,-0.08304500000000001
1145,-0.092366
1146,-0.099539
1147,-0.10885999999999998
1148,-0.11818
1149,-0.1232
1150,-0.12624000000000002
1151,-0.1334
1152,-0.14273
1153,-0.14989
1154,-0.15921
1155,-0.16205
1156,-0.16269
1157,-0.16285
1158,-0.163
1159,-0.16345
1160,-0.16359
1161,-0.16374
1162,-0.16416
1163,-0.16469
1164,-0.15535
1165,-0.14602
1166,-0.13902
1167,-0.12968
1168,-0.12035
1169,-0.11101
1170,-0.10167999999999999
1171,-0.092343
1172,-0.085466
1173,-0.076129
1174,-0.066794
1175,-0.05745700000000001
1176,-0.053262000000000004
1177,-0.048928
1178,-0.039589
1179,-0.032583999999999995
1180,-0.023352
1181,-0.014012
1182,-0.004673399999999999
1183,-0.00020842
1184,0.0017356
1185,0.0062236
1186,0.015566
1187,0.017559
1188,0.021993000000000002
1189,0.031337000000000004
1190,0.040681999999999996
1191,0.050026
1192,0.057035
1193,0.06638
1194,0.075722
1195,0.085066
1196,0.09441000000000001
1197,0.10375
1198,0.10632
1199,0.11133
1200,0.12067
1201,0.13001
1202,0.13935
1203,0.14878
1204,0.15813
1205,0.16513
1206,0.17448
1207,0.18148
1208,0.18382
1209,0.19091
1210,0.20043
1211,0.2052
1212,0.20761999999999997
1213,0.21239
1214,0.21949000000000002
1215,0.22183000000000003
1216,0.2265
1217,0.23584000000000002
1218,0.24284
1219,0.25219
1220,0.26153000000000004
1221,0.27087
1222,0.28021
1223,0.28245
1224,0.28245
1225,0.29179
1226,0.30113
1227,0.31046999999999997
1228,0.31281
1229,0.31514000000000003
1230,0.32458000000000004
1231,0.33158000000000004
1232,0.34093
1233,0.35026999999999997
1234,0.35961
1235,0.36905
1236,0.37839
1237,0.38773
1238,0.39473
1239,0.40408
1240,0.41341999999999995
1241,0.42276
1242,0.4321
1243,0.44143999999999994
1244,0.44845
1245,0.45779
1246,0.46713000000000005
1247,0.47647
1248,0.48582
1249,0.49516000000000004
1250,0.5045
1251,0.51151
1252,0.52085
1253,0.5301899999999999
1254,0.5395300000000001
1255,0.54887
1256,0.5582199999999999
1257,0.56522
1258,0.57457
1259,0.58391
1260,0.59325
1261,0.60259
1262,0.61193
1263,0.62127
1264,0.6282800000000001
1265,0.63762
1266,0.6469699999999999
1267,0.6563100000000001
1268,0.66565
1269,0.67499
1270,0.682
1271,0.69134
1272,0.7006899999999999
1273,0.71003
1274,0.71937
1275,0.72872
1276,0.73806
1277,0.7450600000000001
1278,0.75441
1279,0.76367
1280,0.7730100000000001
1281,0.78235
1282,0.7917
1283,0.7987
1284,0.80805
1285,0.81739
1286,0.82673
1287,0.8360799999999999
1288,0.8454200000000001
1289,0.8547600000000001
1290,0.86177
1291,0.8711200000000001
1292,0.88046
1293,0.8898
1294,0.89915
1295,0.9085700000000001
1296,0.91558
1297,0.9249200000000001
1298,0.9342600000000001
1299,0.9436100000000001
1300,0.95295
1301,0.96229
1302,0.97164
1303,0.97864
1304,0.9879899999999999
1305,0.9973299999999999
1306,1.0067
1307,1.016
1308,1.0254
1309,1.0323
1310,1.0416
1311,1.051
1312,1.0603
1313,1.0697
1314,1.0791
1315,1.0884
1316,1.0954
1317,1.1048
1318,1.1141
1319,1.1235
1320,1.1328
1321,1.1355
1322,1.1381
1323,1.1474
1324,1.1567
1325,1.1661
1326,1.1754
1327,1.1848
1328,1.1941
1329,1.2011
1330,1.2105
1331,1.2199
1332,1.2292
1333,1.2386
1334,1.2479
1335,1.2549
1336,1.2643
1337,1.2736
1338,1.2830000000000001
1339,1.2856
1340,1.2882
1341,1.2976
1342,1.3046
1343,1.3139
1344,1.3233
1345,1.3326
1346,1.3419999999999999
1347,1.3513
1348,1.3583
1349,1.3677
1350,1.3769999999999998
1351,1.3863
1352,1.3957
1353,1.4051
1354,1.4145
1355,1.4215
1356,1.4308
1357,1.4401
1358,1.4495
1359,1.4588
1360,1.4682
1361,1.4775
1362,1.4845
1363,1.4938
1364,1.5031
1365,1.5125
1366,1.5169
1367,1.5165
1368,1.5235
1369,1.5329
1370,1.5422
1371,1.5513
1372,1.5534
1373,1.558
1374,1.5673
1375,1.5695
1376,1.5715
1377,1.5785
1378,1.5878
1379,1.5876
1380,1.5874
1381,1.5896
1382,1.5894
1383,1.5892
1384,1.5891
1385,1.589
1386,1.5889
1387,1.5982
1388,1.6029
1389,1.6028
1390,1.6028
1391,1.6028
1392,1.6027
1393,1.6028
1394,1.6028
1395,1.5958
1396,1.5888
1397,1.5889
1398,1.589
1399,1.5891
1400,1.5869
1401,1.587
1402,1.5871
1403,1.5873
1404,1.5827
1405,1.5734
1406,1.569
1407,1.5691
1408,1.5598
1409,1.5529
1410,1.5508
1411,1.5463
1412,1.537
1413,1.5349
1414,1.5328
1415,1.5259
1416,1.5165
1417,1.5073
1418,1.4980000000000002
1419,1.496
1420,1.4939
1421,1.4845
1422,1.4752
1423,1.4658
1424,1.4565
1425,1.4472
1426,1.4379
1427,1.4309
1428,1.4216
1429,1.4122
1430,1.4029
1431,1.3935
1432,1.3865
1433,1.3845
1434,1.3824
1435,1.3732
1436,1.3639
1437,1.3545
1438,1.3452
1439,1.3358
1440,1.3288
1441,1.3196
1442,1.3103
1443,1.3009
1444,1.2916
1445,1.2822
1446,1.2752
1447,1.2659
1448,1.2567
1449,1.2548
1450,1.2503
1451,1.2409999999999999
1452,1.2317
1453,1.2247
1454,1.2153
1455,1.206
1456,1.1967
1457,1.1873
1458,1.178
1459,1.171
1460,1.1616
1461,1.1523
1462,1.143
1463,1.1336
1464,1.1243
1465,1.115
1466,1.1079999999999999
1467,1.0987
1468,1.0894
1469,1.0801
1470,1.0707
1471,1.0614
1472,1.0544
1473,1.0451
1474,1.0357
1475,1.0264
1476,1.0171
1477,1.0128
1478,1.011
1479,1.004
1480,0.9946299999999999
1481,0.98529
1482,0.97596
1483,0.9666299999999999
1484,0.95729
1485,0.94796
1486,0.94096
1487,0.93163
1488,0.9223
1489,0.91296
1490,0.9036299999999999
1491,0.8943
1492,0.8873
1493,0.87797
1494,0.86864
1495,0.8593
1496,0.8499700000000001
1497,0.8406399999999999
1498,0.83131
1499,0.82445
1500,0.81512
1501,0.80579
1502,0.7964600000000001
1503,0.7871199999999999
1504,0.77779
1505,0.77327
1506,0.77154
1507,0.76485
1508,0.75552
1509,0.7462
1510,0.73687
1511,0.72754
1512,0.72054
1513,0.71122
1514,0.70189
1515,0.6925600000000001
1516,0.68323
1517,0.67391
1518,0.6670699999999999
1519,0.65775
1520,0.64842
1521,0.6390899999999999
1522,0.6297699999999999
1523,0.62044
1524,0.61111
1525,0.60412
1526,0.5947899999999999
1527,0.5854699999999999
1528,0.57614
1529,0.56665
1530,0.55733
1531,0.55033
1532,0.54101
1533,0.53168
1534,0.52236
1535,0.51303
1536,0.50371
1537,0.49438000000000004
1538,0.48739
1539,0.47806000000000004
1540,0.46874
1541,0.45941000000000004
1542,0.45009
1543,0.44093999999999994
1544,0.43393999999999994
1545,0.42462
1546,0.4153
1547,0.40597
1548,0.39648
1549,0.38716
1550,0.37783
1551,0.37084
1552,0.36152
1553,0.35219
1554,0.34287
1555,0.33355
1556,0.32423
1557,0.31724
1558,0.30791
1559,0.29859
1560,0.28926999999999997
1561,0.27995
1562,0.27063000000000004
1563,0.26131
1564,0.25432
1565,0.24518
1566,0.23586
1567,0.22635
1568,0.21703000000000003
1569,0.20770999999999998
1570,0.20090999999999998
1571,0.19159
1572,0.18227000000000002
1573,0.17295
1574,0.16345
1575,0.15412
1576,0.14481
1577,0.13782
1578,0.1285
1579,0.11918
1580,0.11452000000000001
1581,0.10985999999999999
1582,0.10287
1583,0.10054
1584,0.095885
1585,0.08656699999999999
1586,0.077248
1587,0.068126
1588,0.058807000000000005
1589,0.049491
1590,0.042505
1591,0.033188999999999996
1592,0.02853
1593,0.026202
1594,0.016886
1595,0.0075696
1596,0.0029116
1597,0.0029116
1598,-0.0064024
1599,-0.015718
1600,-0.025032
1601,-0.034345999999999995
1602,-0.043660000000000004
1603,-0.050646
1604,-0.05996
1605,-0.063999
1606,-0.065478
1607,-0.074568
1608,-0.081105
1609,-0.083209
1610,-0.08786000000000001
1611,-0.097164
1612,-0.10624000000000001
1613,-0.11532
1614,-0.12182
1615,-0.12182
1616,-0.12647
1617,-0.13577
1618,-0.1381
1619,-0.14019
1620,-0.14948
1621,-0.1534
1622,-0.1524
1623,-0.1524
1624,-0.15214
1625,-0.15136
1626,-0.15083
1627,-0.15083
1628,-0.14824
1629,-0.14128
1630,-0.13405
1631,-0.13295
1632,-0.13183
1633,-0.12836
1634,-0.12314000000000001
1635,-0.11385999999999999
1636,-0.10661
1637,-0.097337
1638,-0.092109
1639,-0.08858400000000001
1640,-0.081327
1641,-0.07205800000000001
1642,-0.065107
1643,-0.055533000000000006
1644,-0.046264
1645,-0.036994
1646,-0.033449
1647,-0.030193
1648,-0.02093
1649,-0.013982
1650,-0.0047174
1651,0.0048606000000000005
1652,0.014126
1653,0.023391
1654,0.032656
1655,0.039606999999999996
1656,0.04286
1657,0.046452
1658,0.055713
1659,0.064973
1660,0.07423300000000001
1661,0.083813
1662,0.09076000000000001
1663,0.10002
1664,0.10362
1665,0.10924
1666,0.11849000000000001
1667,0.12775
1668,0.13469
1669,0.14428
1670,0.15353
1671,0.16279000000000002
1672,0.17205
1673,0.17733
1674,0.18097
1675,0.18592999999999998
1676,0.19518
1677,0.20443
1678,0.21402
1679,0.22326999999999997
1680,0.23253000000000001
1681,0.23947
1682,0.24871999999999997
1683,0.25435
1684,0.26033
1685,0.26958000000000004
1686,0.27883
1687,0.28841999999999995
1688,0.29536
1689,0.30461
1690,0.31386
1691,0.32311
1692,0.33071999999999996
1693,0.33441
1694,0.34169
1695,0.35093
1696,0.36018
1697,0.36977
1698,0.37901999999999997
1699,0.38861
1700,0.39231
1701,0.39533
1702,0.40457
1703,0.41381
1704,0.42305
1705,0.4323
1706,0.44154
1707,0.44882
1708,0.45807
1709,0.46731000000000006
1710,0.47655
1711,0.48383999999999994
1712,0.48755
1713,0.49518999999999996
1714,0.50212
1715,0.51137
1716,0.52061
1717,0.5302
1718,0.5394399999999999
1719,0.5486800000000001
1720,0.55793
1721,0.5613
1722,0.56505
1723,0.57428
1724,0.5835199999999999
1725,0.59312
1726,0.60235
1727,0.60928
1728,0.61852
1729,0.62776
1730,0.63736
1731,0.6411100000000001
1732,0.64876
1733,0.6579999999999999
1734,0.66492
1735,0.67452
1736,0.68376
1737,0.69299
1738,0.69677
1739,0.7048
1740,0.71172
1741,0.72095
1742,0.73018
1743,0.73941
1744,0.74865
1745,0.75825
1746,0.76748
1747,0.7744
1748,0.78364
1749,0.78862
1750,0.7924100000000001
1751,0.79777
1752,0.807
1753,0.81429
1754,0.82352
1755,0.83275
1756,0.84235
1757,0.8500200000000001
1758,0.8538399999999999
1759,0.8630700000000001
1760,0.86998
1761,0.87921
1762,0.88844
1763,0.89766
1764,0.90689
1765,0.91612
1766,0.9234100000000001
1767,0.9326399999999999
1768,0.9418700000000001
1769,0.9511
1770,0.9603299999999999
1771,0.9695600000000001
1772,0.9787899999999999
1773,0.9857100000000001
1774,0.9949399999999999
1775,1.0003
1776,1.0041
1777,1.0137
1778,1.0229
1779,1.0299
1780,1.0391
1781,1.0483
1782,1.0575
1783,1.0668
1784,1.0764
1785,1.0856
1786,1.0925
1787,1.1018
1788,1.111
1789,1.1202
1790,1.1295
1791,1.1355
1792,1.139
1793,1.1482
1794,1.1574
1795,1.1667
1796,1.1763
1797,1.1855
1798,1.1947
1799,1.2016
1800,1.2089
1801,1.2127
1802,1.2204
1803,1.2296
1804,1.2392
1805,1.2462
1806,1.2496
1807,1.2535
1808,1.2627
1809,1.2723
1810,1.2815
1811,1.2888
1812,1.2923
1813,1.2957
1814,1.3054
1815,1.3107
1816,1.3146
1817,1.3219999999999998
1818,1.3293
1819,1.3328
1820,1.3367
1821,1.3384
1822,1.3423
1823,1.3519
1824,1.3574
1825,1.3586
1826,1.3604
1827,1.3621
1828,1.3638
1829,1.3656
1830,1.3674
1831,1.3692
1832,1.3706
1833,1.3724
1834,1.3743
1835,1.3762
1836,1.3781
1837,1.38
1838,1.3815
1839,1.3733
1840,1.3674
1841,1.3694
1842,1.3691
1843,1.3711
1844,1.3676
1845,1.3608
1846,1.3522
1847,1.3430000000000002
1848,1.3372
1849,1.337
1850,1.329
1851,1.3255
1852,1.3253
1853,1.319
1854,1.31
1855,1.3014
1856,1.2923
1857,1.2945
1858,1.2933
1859,1.2842
1860,1.2751
1861,1.2661
1862,1.2575
1863,1.2484
1864,1.2416
1865,1.2326
1866,1.2235
1867,1.2144
1868,1.2053
1869,1.1963
1870,1.1872
1871,1.1804
1872,1.1713
1873,1.1622
1874,1.1532
1875,1.1441
1876,1.135
1877,1.1283
1878,1.1192
1879,1.1101
1880,1.1011
1881,1.092
1882,1.083
1883,1.0739
1884,1.0671
1885,1.0581
1886,1.0490000000000002
1887,1.04
1888,1.0309
1889,1.0219
1890,1.0184
1891,1.0138
1892,1.0042
1893,0.99513
1894,0.9860700000000001
1895,0.9770200000000001
1896,0.9679700000000001
1897,0.9606
1898,0.95155
1899,0.9425
1900,0.9334600000000001
1901,0.92442
1902,0.91419
1903,0.9074
1904,0.90455
1905,0.8999299999999999
1906,0.8908799999999999
1907,0.88184
1908,0.87279
1909,0.86375
1910,0.8563700000000001
1911,0.8473299999999999
1912,0.83829
1913,0.82865
1914,0.8240200000000001
1915,0.81605
1916,0.8092699999999999
1917,0.8002199999999999
1918,0.79118
1919,0.78214
1920,0.7725
1921,0.76346
1922,0.75442
1923,0.74764
1924,0.7386
1925,0.72956
1926,0.72053
1927,0.7148100000000001
1928,0.71016
1929,0.70505
1930,0.69601
1931,0.68697
1932,0.67793
1933,0.66889
1934,0.65986
1935,0.65022
1936,0.64345
1937,0.63441
1938,0.62538
1939,0.61636
1940,0.60733
1941,0.5983
1942,0.59154
1943,0.5825100000000001
1944,0.5734899999999999
1945,0.56448
1946,0.5554600000000001
1947,0.54808
1948,0.5433600000000001
1949,0.53763
1950,0.52861
1951,0.51958
1952,0.51056
1953,0.50154
1954,0.49253
1955,0.48351000000000005
1956,0.47613
1957,0.46712
1958,0.45811
1959,0.4491
1960,0.44009
1961,0.43108
1962,0.42433000000000004
1963,0.41695
1964,0.41218999999999995
1965,0.40644
1966,0.39743
1967,0.38842
1968,0.37879
1969,0.37203
1970,0.36302
1971,0.35727
1972,0.35252
1973,0.34514
1974,0.33613000000000004
1975,0.32937
1976,0.32036
1977,0.31135
1978,0.30172
1979,0.29270999999999997
1980,0.28371
1981,0.2747
1982,0.26795
1983,0.26219000000000003
1984,0.25743
1985,0.25005
1986,0.24104
1987,0.23203000000000001
1988,0.22528
1989,0.21628000000000003
1990,0.20728000000000002
1991,0.19764
1992,0.18864
1993,0.17965
1994,0.17065
1995,0.1665
1996,0.16172
1997,0.15272
1998,0.14371
1999,0.13471
2000,0.12508
2001,0.11832999999999999
2002,0.10934
2003,0.10034
2004,0.091351
2005,0.08655299999999999
2006,0.08240399999999999
2007,0.073403
2008,0.066653
2009,0.057655
2010,0.048023
2011,0.039027
2012,0.030032999999999997
2013,0.021041999999999998
2014,0.013658000000000002
2015,0.0088576
2016,0.0030916
2017,-0.0059074
2018,-0.014905000000000002
2019,-0.023899
2020,-0.032892000000000005
2021,-0.039635000000000004
2022,-0.049267
2023,-0.05825399999999999
2024,-0.067241
2025,-0.076225
2026,-0.08201
2027,-0.086186
2028,-0.089713
2029,-0.098705
2030,-0.1077
2031,-0.11669000000000002
2032,-0.12632000000000002
2033,-0.1353
2034,-0.14204
2035,-0.15102000000000002
2036,-0.16
2037,-0.16898
2038,-0.17795
2039,-0.18692
2040,-0.19365
2041,-0.19589
2042,-0.20104
2043,-0.20842
2044,-0.21131999999999998
2045,-0.21805
2046,-0.22701999999999997
2047,-0.2315
2048,-0.23374
2049,-0.24047
2050,-0.24495
2051,-0.2501
2052,-0.25972
2053,-0.26711
2054,-0.27002
2055,-0.27225
2056,-0.28121999999999997
2057,-0.29018
2058,-0.29913
2059,-0.30876
2060,-0.31547
2061,-0.32442
2062,-0.33337
2063,-0.34231999999999996
2064,-0.35126
2065,-0.3602
2066,-0.36913
2067,-0.37514000000000003
2068,-0.38406999999999997
2069,-0.39299999999999996
2070,-0.40192
2071,-0.41084
2072,-0.41975
2073,-0.42644
2074,-0.42582
2075,-0.42661000000000004
2076,-0.43551000000000006
2077,-0.44367
2078,-0.45256
2079,-0.46143999999999996
2080,-0.46808999999999995
2081,-0.47623000000000004
2082,-0.4851
2083,-0.49175
2084,-0.48951000000000006
2085,-0.49091999999999997
2086,-0.49755
2087,-0.50639
2088,-0.51522
2089,-0.52405
2090,-0.5321100000000001
2091,-0.54093
2092,-0.54974
2093,-0.55557
2094,-0.55461
2095,-0.55742
2096,-0.5662
2097,-0.57498
2098,-0.58295
2099,-0.5895199999999999
2100,-0.59829
2101,-0.60322
2102,-0.59992
2103,-0.60782
2104,-0.6157100000000001
2105,-0.62443
2106,-0.63097
2107,-0.62757
2108,-0.62631
2109,-0.62284
2110,-0.62239
2111,-0.63016
2112,-0.63272
2113,-0.6313
2114,-0.6368699999999999
2115,-0.63937
2116,-0.63572
2117,-0.63203
2118,-0.62832
2119,-0.62551
2120,-0.62174
2121,-0.62079
2122,-0.61129
2123,-0.6027399999999999
2124,-0.59419
2125,-0.59017
2126,-0.58424
2127,-0.5768800000000001
2128,-0.56834
2129,-0.55979
2130,-0.55123
2131,-0.54173
2132,-0.5353100000000001
2133,-0.52674
2134,-0.5181600000000001
2135,-0.50958
2136,-0.5009899999999999
2137,-0.49606999999999996
2138,-0.49113999999999997
2139,-0.48378000000000004
2140,-0.47426999999999997
2141,-0.46568999999999994
2142,-0.45618000000000003
2143,-0.45032
2144,-0.44417
2145,-0.43773999999999996
2146,-0.42916000000000004
2147,-0.42058
2148,-0.41107
2149,-0.40248
2150,-0.39388
2151,-0.38743
2152,-0.37915
2153,-0.37332
2154,-0.36811
2155,-0.35951
2156,-0.35091999999999995
2157,-0.34231999999999996
2158,-0.33586
2159,-0.32725
2160,-0.31773
2161,-0.30911
2162,-0.30049000000000003
2163,-0.29186
2164,-0.28665
2165,-0.28088
2166,-0.27260999999999996
2167,-0.26399
2168,-0.25445999999999996
2169,-0.24583000000000002
2170,-0.2372
2171,-0.23073000000000002
2172,-0.22498
2173,-0.21796
2174,-0.20934
2175,-0.20071
2176,-0.19208
2177,-0.1856
2178,-0.17695999999999998
2179,-0.16831
2180,-0.15966
2181,-0.15100999999999998
2182,-0.14147
2183,-0.13280999999999998
2184,-0.12630999999999998
2185,-0.11764000000000001
2186,-0.10897000000000001
2187,-0.10029
2188,-0.096802
2189,-0.089837
2190,-0.081173
2191,-0.073797
2192,-0.06512799999999999
2193,-0.057749
2194,-0.05207899999999999
2195,-0.045988
2196,-0.037326
2197,-0.02995
2198,-0.021283
2199,-0.015197
2200,-0.0095134
2201,2.7576999999999997e-05
2202,0.0086866
2203,0.018228
2204,0.024728
2205,0.030410000000000003
2206,0.037389
2207,0.046043
2208,0.055582000000000006
2209,0.06424099999999999
2210,0.069051
2211,0.074759
2212,0.08340700000000001
2213,0.092945
2214,0.1016
2215,0.10985999999999999
2216,0.11557
2217,0.12078
2218,0.12943
2219,0.13896
2220,0.14762
2221,0.15333
2222,0.16032000000000002
2223,0.16769
2224,0.17595999999999998
2225,0.1817
2226,0.19122999999999998
2227,0.20076
2228,0.2094
2229,0.21766
2230,0.22036
2231,0.22863000000000003
2232,0.23815999999999998
2233,0.24301999999999999
2234,0.2488
2235,0.25740999999999997
2236,0.26388
2237,0.2734
2238,0.28203
2239,0.28564
2240,0.29268
2241,0.3022
2242,0.30832
2243,0.31321
2244,0.3172
2245,0.32671
2246,0.33285
2247,0.33868000000000004
2248,0.34389000000000003
2249,0.35126
2250,0.3574
2251,0.36111
2252,0.36698000000000003
2253,0.37073
2254,0.38117
2255,0.38853000000000004
2256,0.39136
2257,0.39847
2258,0.40796
2259,0.41413
2260,0.41793
2261,0.42175
2262,0.42463999999999996
2263,0.4285
2264,0.43238000000000004
2265,0.43628999999999996
2266,0.44021000000000005
2267,0.44416000000000005
2268,0.44813000000000003
2269,0.45111999999999997
2270,0.45513000000000003
2271,0.45915
2272,0.4632
2273,0.46726999999999996
2274,0.47136000000000006
2275,0.47444
2276,0.47231000000000006
2277,0.46496000000000004
2278,0.4639
2279,0.46598999999999996
2280,0.45868000000000003
2281,0.45661999999999997
2282,0.45771000000000006
2283,0.45566999999999996
2284,0.44733999999999996
2285,0.43903000000000003
2286,0.43178999999999995
2287,0.42349
2288,0.41727
2289,0.41636000000000006
2290,0.41863999999999996
2291,0.41036999999999996
2292,0.4021
2293,0.39384
2294,0.38559
2295,0.37940999999999997
2296,0.37117
2297,0.36293000000000003
2298,0.3547
2299,0.34648
2300,0.33826
2301,0.33004
2302,0.32389
2303,0.3155
2304,0.30896999999999997
2305,0.29964
2306,0.29143
2307,0.28323000000000004
2308,0.27596
2309,0.26776
2310,0.25958000000000003
2311,0.2514
2312,0.24209
2313,0.23551
2314,0.22916
2315,0.22301999999999997
2316,0.21485
2317,0.20554
2318,0.19737000000000002
2319,0.18921
2320,0.18284
2321,0.17739000000000002
2322,0.17103
2323,0.16286
2324,0.1547
2325,0.14655
2326,0.1384
2327,0.12911
2328,0.12300000000000001
2329,0.11487
2330,0.10675
2331,0.098631
2332,0.090521
2333,0.081249
2334,0.076033
2335,0.06935
2336,0.062104999999999994
2337,0.053997
2338,0.045898
2339,0.036634
2340,0.028547000000000003
2341,0.022484
2342,0.014409
2343,0.0063426
2344,0.00078258
2345,-0.0079664
2346,-0.016043
2347,-0.022094
2348,-0.030157999999999997
2349,-0.038214
2350,-0.046264
2351,-0.054304
2352,-0.062335
2353,-0.064342
2354,-0.066348
2355,-0.069957
2356,-0.07675599999999999
2357,-0.079542
2358,-0.080327
2359,-0.088309
2360,-0.090302
2361,-0.093516
2362,-0.10072
2363,-0.11112999999999999
2364,-0.11634000000000001
2365,-0.11832999999999999
2366,-0.12430999999999999
2367,-0.13028
2368,-0.13946
2369,-0.14740999999999999
2370,-0.15309
2371,-0.15997999999999998
2372,-0.16794
2373,-0.17513
2374,-0.18308
2375,-0.19226
2376,-0.19917
2377,-0.20561
2378,-0.21355
2379,-0.22149000000000002
2380,-0.22868000000000002
2381,-0.23512
2382,-0.24204
2383,-0.24923
2384,-0.25716999999999995
2385,-0.2651
2386,-0.27104
2387,-0.2802
2388,-0.28811
2389,-0.29705
2390,-0.30474
2391,-0.31265
2392,-0.32181
2393,-0.32773
2394,-0.33543
2395,-0.34239
2396,-0.3503
2397,-0.35821
2398,-0.36735
2399,-0.37327
2400,-0.38115
2401,-0.39028
2402,-0.39603
2403,-0.40374
2404,-0.41162
2405,-0.41949
2406,-0.42665
2407,-0.43451000000000006
2408,-0.44235
2409,-0.45078
2410,-0.45586000000000004
2411,-0.46498
2412,-0.47086000000000006
2413,-0.4787
2414,-0.48653
2415,-0.49433999999999995
2416,-0.5021399999999999
2417,-0.5112300000000001
2418,-0.51902
2419,-0.52485
2420,-0.53261
2421,-0.54037
2422,-0.54811
2423,-0.55398
2424,-0.56114
2425,-0.56696
2426,-0.57277
2427,-0.5805100000000001
2428,-0.58955
2429,-0.59727
2430,-0.6049800000000001
2431,-0.6126699999999999
2432,-0.61843
2433,-0.62611
2434,-0.63377
2435,-0.64142
2436,-0.64905
2437,-0.65667
2438,-0.66428
2439,-0.66998
2440,-0.67757
2441,-0.68514
2442,-0.6927
2443,-0.70025
2444,-0.70778
2445,-0.7134199999999999
2446,-0.7209300000000001
2447,-0.72842
2448,-0.73588
2449,-0.7419399999999999
2450,-0.74944
2451,-0.75694
2452,-0.76254
2453,-0.7700100000000001
2454,-0.77887
2455,-0.78632
2456,-0.79374
2457,-0.80115
2458,-0.8067
2459,-0.81224
2460,-0.8198200000000001
2461,-0.82965
2462,-0.8384799999999999
2463,-0.8478899999999999
2464,-0.85588
2465,-0.8614299999999999
2466,-0.86882
2467,-0.8776299999999999
2468,-0.8874700000000001
2469,-0.8932
2470,-0.90059
2471,-0.90612
2472,-0.9149200000000001
2473,-0.92227
2474,-0.9295899999999999
2475,-0.93691
2476,-0.94273
2477,-0.95075
2478,-0.9577
2479,-0.96609
2480,-0.9737299999999999
2481,-0.9788399999999999
2482,-0.9861700000000001
2483,-0.9949399999999999
2484,-1.0004
2485,-1.0070000000000001
2486,-1.0146
2487,-1.023
2488,-1.0318
2489,-1.0395
2490,-1.046
2491,-1.0515
2492,-1.0603
2493,-1.0676
2494,-1.0741
2495,-1.0818
2496,-1.0888
2497,-1.0942
2498,-1.1029
2499,-1.1102
2500,-1.1183
2501,-1.1241
2502,-1.1314
2503,-1.1398
2504,-1.146
2505,-1.1523
2506,-1.1595
2507,-1.1683
2508,-1.1755
2509,-1.1821
2510,-1.1883
2511,-1.1967
2512,-1.2054
2513,-1.2126
2514,-1.2213
2515,-1.2258
2516,-1.2339
2517,-1.2408
2518,-1.2476
2519,-1.2554
2520,-1.2602
2521,-1.2674
2522,-1.2761
2523,-1.2815
2524,-1.2898
2525,-1.2976
2526,-1.3063
2527,-1.315
2528,-1.3221
2529,-1.329
2530,-1.3353
2531,-1.3434
2532,-1.3505
2533,-1.3592
2534,-1.3663
2535,-1.3726
2536,-1.3804
2537,-1.3873
2538,-1.3944
2539,-1.4023
2540,-1.4086
2541,-1.4157
2542,-1.4243
2543,-1.4296
2544,-1.4364
2545,-1.4426
2546,-1.4492
2547,-1.4562
2548,-1.4648
2549,-1.4718
2550,-1.4769
2551,-1.4831
2552,-1.4909999999999999
2553,-1.4971
2554,-1.5037
2555,-1.5107
2556,-1.5176
2557,-1.5246
2558,-1.5327
2559,-1.5407
2560,-1.5477
2561,-1.5563
2562,-1.5633
2563,-1.5685
2564,-1.5747
2565,-1.5811
2566,-1.5879
2567,-1.5965
2568,-1.6044
2569,-1.6093
2570,-1.6163
2571,-1.6248
2572,-1.6317
2573,-1.6399
2574,-1.6479
2575,-1.6547
2576,-1.6599
2577,-1.6663
2578,-1.6725
2579,-1.6805
2580,-1.6867
2581,-1.6952
2582,-1.7036
2583,-1.7115
2584,-1.7183
2585,-1.7253
2586,-1.7339
2587,-1.7408
2588,-1.7471
2589,-1.7535
2590,-1.7605
2591,-1.7688
2592,-1.7768
2593,-1.7834
2594,-1.7919
2595,-1.7985
2596,-1.8047
2597,-1.8148
2598,-1.8216
2599,-1.8296
2600,-1.8362
2601,-1.8447
2602,-1.8496
2603,-1.8575
2604,-1.8643
2605,-1.8729
2606,-1.8798
2607,-1.8868
2608,-1.8915
2609,-1.8994
2610,-1.9064
2611,-1.9133
2612,-1.9202
2613,-1.9269999999999998
2614,-1.9354
2615,-1.9405
2616,-1.9472
2617,-1.9539
2618,-1.9606
2619,-1.9688
2620,-1.9771
2621,-1.9804
2622,-1.9869999999999999
2623,-1.9936
2624,-2.0001
2625,-2.0066
2626,-2.013
2627,-2.0211
2628,-2.0259
2629,-2.0322
2630,-2.0384
2631,-2.0446
2632,-2.0507
2633,-2.0568
2634,-2.0613
2635,-2.0673
2636,-2.0742
2637,-2.0829
2638,-2.0888
2639,-2.0947
2640,-2.1006
2641,-2.1049
2642,-2.1125
2643,-2.1181
2644,-2.1237
2645,-2.1293
2646,-2.1347
2647,-2.1388
2648,-2.1478
2649,-2.1548
2650,-2.1602
2651,-2.1655
2652,-2.1707
2653,-2.1759
2654,-2.1816
2655,-2.1866
2656,-2.1916
2657,-2.1964
2658,-2.2011
2659,-2.2058
2660,-2.2151
2661,-2.2211
2662,-2.2246
2663,-2.2292
2664,-2.2336
2665,-2.238
2666,-2.2423
2667,-2.2454
2668,-2.2516
2669,-2.2555
2670,-2.2594
2671,-2.2632
2672,-2.2668
2673,-2.2704
2674,-2.2777
2675,-2.2873
2676,-2.2907
2677,-2.2941
2678,-2.2973
2679,-2.3003
2680,-2.3048
2681,-2.3076
2682,-2.3104
2683,-2.313
2684,-2.3154
2685,-2.32
2686,-2.3296
2687,-2.3347
2688,-2.3369
2689,-2.339
2690,-2.3409
2691,-2.3449
2692,-2.3465
2693,-2.3476
2694,-2.349
2695,-2.3501
2696,-2.3512
2697,-2.3521
2698,-2.3528
2699,-2.3534
2700,-2.3537
2701,-2.354
2702,-2.3542
2703,-2.3565
2704,-2.3659
2705,-2.3706
2706,-2.3706
2707,-2.3706
2708,-2.3729
