time,value
0,-0.34657
1,-0.34657
2,-0.34657
3,-0.34657
4,-0.34657
5,-0.34657
6,-0.34657
7,-0.34657
8,-0.34657
9,-0.34657
10,-0.34657
11,-0.34657
12,-0.34657
13,-0.34657
14,-0.34657
15,-0.34657
16,-0.34657
17,-0.34657
18,-0.34657
19,-0.34657
20,-0.34657
21,-0.34657
22,-0.34657
23,-0.34657
24,-0.34657
25,-0.34657
26,-0.34657
27,-0.34657
28,-0.34657
29,-0.34657
30,-0.34657
31,-0.34657
32,-0.34657
33,-0.34657
34,1.4328
35,-0.34657
36,-0.34657
37,-0.34657
38,-0.34657
39,-0.34657
40,-0.34657
41,-0.34657
42,-0.34657
43,-0.34657
44,-0.34657
45,-0.34657
46,-0.34657
47,-0.34657
48,-0.34657
49,-0.34657
50,-0.34657
51,-0.34657
52,-0.34657
53,-0.34657
54,-0.34657
55,-0.34657
56,-0.34657
57,-0.34657
58,-0.34657
59,-0.34657
60,-0.34657
61,-0.34657
62,-0.34657
63,-0.34657
64,4.5214
65,3.7996
66,2.121
67,0.52632
68,1.4831
69,2.356
70,3.4807
71,1.5671
72,3.145
73,2.1882
74,2.4903
75,-0.34657
76,-0.34657
77,-0.34657
78,-0.34657
79,-0.34657
80,-0.34657
81,-0.34657
82,-0.34657
83,-0.34657
84,-0.34657
85,-0.34657
86,-0.34657
87,-0.34657
88,-0.34657
89,-0.34657
90,-0.34657
91,-0.34657
92,-0.34657
93,-0.34657
94,-0.34657
95,-0.34657
