[<text>
<title>tuesday morning inc &lt;tues&gt; 4th qtr net</title>
<dateline>    dallas, march 2 -
    </dateline>shr 1.19 dlrs vs 1.46 dlrs
    net 3,150,185 vs 2,665,284
    revs 27.9 mln vs 24.1 mln
    avg shrs 2,653,646 vs 1,826,858
    year
    shr 1.45 dlrs vs 1.37 dlrs
    net 3,611,802 vs 2,502,443
    sales 62.2 mln vs 52.8 mln
    avg shrs 2,489,978 vs 1,826,858
 reuter
</text>]