time,value
0,-0.9605299999999999
1,-0.9338200000000001
2,-0.8923
3,-0.83875
4,-0.77796
5,-0.7138899999999999
6,-0.6483899999999999
7,-0.58278
8,-0.51917
9,-0.45907
10,-0.40468000000000004
11,-0.35886999999999997
12,-0.32191
13,-0.29254
14,-0.26971999999999996
15,-0.25299
16,-0.24147
17,-0.2354
18,-0.23626999999999998
19,-0.24273000000000003
20,-0.25304
21,-0.26661999999999997
22,-0.28215999999999997
23,-0.29823
24,-0.31465
25,-0.33195
26,-0.34862
27,-0.36344
28,-0.37740999999999997
29,-0.38927
30,-0.39837
31,-0.40524
32,-0.40984
33,-0.41081999999999996
34,-0.40786999999999995
35,-0.40247
36,-0.39399
37,-0.38236
38,-0.36955
39,-0.35454
40,-0.33614
41,-0.31501
42,-0.29204
43,-0.26643
44,-0.23897
45,-0.21285
46,-0.18615
47,-0.15832000000000002
48,-0.1319
49,-0.10615999999999999
50,-0.080038
51,-0.055177
52,-0.03388
53,-0.013524000000000001
54,0.0067149
55,0.022123
56,0.035987
57,0.049047
58,0.05849
59,0.064045
60,0.068665
61,0.073408
62,0.077136
63,0.084564
64,0.09813999999999999
65,0.11581
66,0.13959000000000002
67,0.17038
68,0.20648000000000002
69,0.24645999999999998
70,0.29129
71,0.34025
72,0.39033
73,0.4426
74,0.49678
75,0.55135
76,0.60787
77,0.66856
78,0.73482
79,0.80833
80,0.8920299999999999
81,0.9869
82,1.0915
83,1.2059
84,1.3265
85,1.4467
86,1.5599
87,1.6584
88,1.7339
89,1.7805
90,1.7961
91,1.7805
92,1.7352
93,1.6661
94,1.5787
95,1.4774
96,1.368
97,1.2552
98,1.1412
99,1.0276
100,0.91669
101,0.8083
102,0.7014
103,0.59725
104,0.4956
105,0.39515
106,0.29591
107,0.19846
108,0.10206
109,0.0057785
110,-0.087198
111,-0.17628
112,-0.26172
113,-0.34096
114,-0.41315
115,-0.47953999999999997
116,-0.5405800000000001
117,-0.5946100000000001
118,-0.6429199999999999
119,-0.68829
120,-0.7275699999999999
121,-0.7612300000000001
122,-0.792
123,-0.81858
124,-0.83909
125,-0.85545
126,-0.8716700000000001
127,-0.88351
128,-0.89192
129,-0.9022399999999999
130,-0.91135
131,-0.91696
132,-0.9214600000000001
133,-0.9273
134,-0.9300700000000001
135,-0.92947
136,-0.9330299999999999
137,-0.9346899999999999
138,-0.9328799999999999
139,-0.9312
140,-0.9294600000000001
141,-0.92448
142,-0.91705
143,-0.9112899999999999
144,-0.90274
145,-0.8896299999999999
146,-0.87549
147,-0.8567
148,-0.82986
149,-0.79423
150,-0.74829
151,-0.68613
152,-0.6037399999999999
153,-0.50098
154,-0.37258
155,-0.21545
156,-0.030307
157,0.18297
158,0.42357
159,0.6864899999999999
160,0.9631299999999999
161,1.2462
162,1.527
163,1.7946
164,2.0428
165,2.2661
166,2.4585
167,2.6151
168,2.7327
169,2.8091
170,2.8425
171,2.8364
172,2.7964
173,2.7287
174,2.6413
175,2.5415
176,2.4342
177,2.322
178,2.2068
179,2.0889
180,1.9682
181,1.8455
182,1.7222
183,1.5992
184,1.4783
185,1.361
186,1.2486
187,1.1424
188,1.0438
189,0.95325
190,0.8697799999999999
191,0.79355
192,0.7224
193,0.65322
194,0.58577
195,0.51915
196,0.45119
197,0.38155
198,0.3126
199,0.24323000000000003
200,0.17121
201,0.10197
202,0.035446
203,-0.031107
204,-0.09537899999999999
205,-0.15633
206,-0.21703000000000003
207,-0.27954
208,-0.33876999999999996
209,-0.39566999999999997
210,-0.45261999999999997
211,-0.5049
212,-0.55225
213,-0.59719
214,-0.6388199999999999
215,-0.67479
216,-0.7064199999999999
217,-0.7362
218,-0.7603
219,-0.7802899999999999
220,-0.79894
221,-0.8147
222,-0.82744
223,-0.83898
224,-0.8497299999999999
225,-0.8580899999999999
226,-0.8652
227,-0.87277
228,-0.8785299999999999
229,-0.88279
230,-0.88689
231,-0.8901
232,-0.8920899999999999
233,-0.8940600000000001
234,-0.89681
235,-0.89886
236,-0.9005799999999999
237,-0.90269
238,-0.9039200000000001
239,-0.9043200000000001
240,-0.90481
241,-0.9055200000000001
242,-0.90622
243,-0.90746
244,-0.9098200000000001
245,-0.9123700000000001
246,-0.91528
247,-0.919
248,-0.9232899999999999
249,-0.92809
250,-0.9334899999999999
251,-0.9391200000000001
252,-0.9442
253,-0.94842
254,-0.95183
255,-0.9544
256,-0.9565100000000001
257,-0.95855
258,-0.96045
259,-0.9619
260,-0.9627700000000001
261,-0.9631299999999999
262,-0.9631799999999999
263,-0.96341
264,-0.9642200000000001
265,-0.96547
266,-0.96678
267,-0.96775
268,-0.96811
269,-0.96788
