[<text>
<title>american stores co &lt;asc&gt; 4th qtr net</title>
<dateline>    salt lake city, march 6 -
    </dateline>shr 1.57 dlrs vs 1.60 dlrs
    net 55.7 mln vs 56.5 mln
    revs 3.7 billion vs 3.6 billion
    year
    shr 3.79 dlrs vs 4.11 dlrs
    net 144.5 vs 154.5 mln
    revs 14.0 billion vs 13.9 billion
    note: 1986 4th qtr and yr per shr amts includes reduction
of 15 cts per shr for establishment of reorganization reserves.
tax increase reduced 1986 yr per shr by 26 cts.
 reuter
</text>]