time,value
0,-0.23674
1,-0.34981999999999996
2,-0.34981999999999996
3,-0.10752
4,0.0055526
5,-0.31751
6,-0.34981999999999996
7,0.5063
8,1.6369999999999998
9,2.8162
10,0.10247
11,0.10247
12,0.31246
13,0.24785
14,8.5182
15,0.07016499999999999
16,-0.2529
17,-0.12367
18,-0.2852
19,-0.13982999999999998
20,-0.26905
21,-0.20444
22,-0.18828
23,-0.34981999999999996
24,-0.17213
25,-0.22059
26,-0.15598
27,-0.23674
28,-0.34981999999999996
29,-0.2529
30,-0.12367
31,1.7501
32,-0.2529
33,-0.34981999999999996
34,-0.34981999999999996
35,-0.12367
36,-0.042907
37,-0.2852
38,-0.34981999999999996
39,0.53861
40,-0.042907
41,-0.05906
42,-0.34981999999999996
43,-0.34981999999999996
44,-0.34981999999999996
45,-0.10752
46,0.0055526
47,-0.31751
48,-0.36596999999999996
49,-0.34981999999999996
50,-0.18828
51,-0.026754000000000003
52,-0.20444
53,-0.34981999999999996
54,-0.34981999999999996
55,-0.18828
56,0.0055526
57,-0.18828
58,-0.34981999999999996
59,-0.34981999999999996
60,-0.23674
61,-0.05906
62,-0.13982999999999998
63,-0.33366
64,-0.34981999999999996
65,-0.23674
66,-0.15598
67,-0.15598
68,-0.22059
69,-0.34981999999999996
70,0.47398999999999997
71,-0.15598
72,-0.22059
73,-0.15598
74,-0.33366
75,-0.10752
76,-0.026754000000000003
77,-0.12367
78,-0.22059
79,-0.34981999999999996
80,-0.26905
81,-0.12367
82,-0.13982999999999998
83,-0.22059
84,-0.34981999999999996
85,-0.2529
86,1.6209
87,-0.17213
88,-0.22059
89,-0.34981999999999996
90,-0.26905
91,-0.091366
92,-0.10752
93,-0.2852
94,-0.34981999999999996
95,-0.30136
