time,value
0,-0.42058
1,-0.42058
2,-0.42058
3,-0.42058
4,-0.42058
5,-0.42058
6,-0.42058
7,-0.42058
8,-0.42058
9,-0.42058
10,-0.42058
11,-0.42058
12,-0.42058
13,-0.42058
14,-0.42058
15,-0.42058
16,-0.42058
17,-0.42058
18,-0.42058
19,-0.42058
20,-0.42058
21,-0.42058
22,-0.42058
23,-0.42058
24,-0.42058
25,-0.42058
26,-0.42058
27,-0.42058
28,-0.42058
29,-0.42058
30,-0.42058
31,-0.42058
32,-0.42058
33,-0.42058
34,-0.42058
35,-0.42058
36,-0.42058
37,-0.42058
38,-0.42058
39,-0.42058
40,-0.42058
41,-0.42058
42,-0.42058
43,-0.42058
44,-0.42058
45,-0.42058
46,-0.42058
47,-0.42058
48,-0.42058
49,-0.42058
50,-0.42058
51,-0.42058
52,-0.42058
53,-0.42058
54,1.0017
55,2.4239
56,2.2659
57,2.3449
58,2.1868
59,2.3449
60,2.2659
61,2.2659
62,1.5547
63,-0.42058
64,-0.42058
65,-0.42058
66,-0.42058
67,-0.42058
68,-0.42058
69,-0.42058
70,-0.42058
71,-0.42058
72,-0.42058
73,-0.42058
74,-0.42058
75,-0.42058
76,-0.42058
77,-0.42058
78,-0.42058
79,-0.42058
80,2.977
81,2.8189
82,2.6609
83,2.6609
84,2.1078
85,2.1868
86,-0.42058
87,-0.42058
88,-0.42058
89,-0.42058
90,-0.42058
91,-0.42058
92,-0.42058
93,-0.42058
94,-0.42058
95,-0.42058
