time,value
0,-1.2598
1,-1.1624
2,-1.0398
3,-0.89455
4,-0.73087
5,-0.55462
6,-0.37287
7,-0.1892
8,-0.0068561
9,0.17206
10,0.34504
11,0.51044
12,0.6684399999999999
13,0.8187399999999999
14,0.9608899999999999
15,1.0925
16,1.2136
17,1.3244
18,1.4254
19,1.5163
20,1.5944
21,1.6611
22,1.7163
23,1.7603
24,1.7924
25,1.8111
26,1.8189
27,1.8178
28,1.8098
29,1.7949
30,1.7736
31,1.7483
32,1.7202
33,1.6903
34,1.6563
35,1.619
36,1.5793
37,1.5374
38,1.4929
39,1.443
40,1.3888
41,1.3305
42,1.2688
43,1.2041
44,1.1367
45,1.0698
46,1.0058
47,0.94719
48,0.89412
49,0.84719
50,0.80719
51,0.77384
52,0.7465
53,0.72255
54,0.7028300000000001
55,0.68762
56,0.67737
57,0.6724600000000001
58,0.6724399999999999
59,0.68066
60,0.69834
61,0.72656
62,0.76526
63,0.8154600000000001
64,0.87921
65,0.95583
66,1.0435
67,1.1377
68,1.2364
69,1.3359
70,1.4305
71,1.5147
72,1.5817
73,1.6317
74,1.6626
75,1.6737
76,1.6649
77,1.6376
78,1.5971
79,1.5462
80,1.4871
81,1.421
82,1.3507
83,1.2794
84,1.2075
85,1.1352
86,1.0611
87,0.9876
88,0.9153399999999999
89,0.84395
90,0.7731
91,0.70127
92,0.63147
93,0.5636399999999999
94,0.49746
95,0.43217
96,0.36756
97,0.30517
98,0.2443
99,0.18392999999999998
100,0.1222
101,0.059116999999999996
102,-0.0052316
103,-0.071738
104,-0.14094
105,-0.21374
106,-0.28765
107,-0.36125999999999997
108,-0.43363
109,-0.5039399999999999
110,-0.5724100000000001
111,-0.6362399999999999
112,-0.69547
113,-0.75061
114,-0.8028
115,-0.8523200000000001
116,-0.8976799999999999
117,-0.9393299999999999
118,-0.97782
119,-1.0147
120,-1.0488
121,-1.0791
122,-1.1066
123,-1.1323
124,-1.1587
125,-1.1833
126,-1.2059
127,-1.2268
128,-1.2468
129,-1.268
130,-1.2869
131,-1.3035
132,-1.3181
133,-1.3321
134,-1.3462
135,-1.3579
136,-1.3672
137,-1.3743
138,-1.3814
139,-1.3875
140,-1.3914
141,-1.3931
142,-1.3932
143,-1.3943
144,-1.3941
145,-1.3923
146,-1.3888
147,-1.3843
148,-1.3807
149,-1.3759
150,-1.3698
151,-1.3628
152,-1.3561
153,-1.3505
154,-1.3447
155,-1.3388
156,-1.3326
157,-1.3275
158,-1.3228
159,-1.3171
160,-1.3095
161,-1.2993
162,-1.287
163,-1.2701
164,-1.2468
165,-1.2152
166,-1.1741
167,-1.1228
168,-1.0593
169,-0.98311
170,-0.89444
171,-0.79527
172,-0.68823
173,-0.5757
174,-0.46098
175,-0.34753
176,-0.23963
177,-0.13973
178,-0.04924
179,0.031056999999999998
180,0.10103
181,0.15945
182,0.20818000000000003
183,0.2485
184,0.28176999999999996
185,0.30861
186,0.32855
187,0.34315
188,0.35316
189,0.35916
190,0.3606
191,0.35715
192,0.34972
193,0.33886
194,0.32506
195,0.30759000000000003
196,0.2872
197,0.26488
198,0.2415
199,0.21777
200,0.19314
201,0.16865
202,0.14447000000000002
203,0.12045
204,0.09574400000000001
205,0.068957
206,0.039559
207,0.006809
208,-0.02968
209,-0.070107
210,-0.11375
211,-0.15895
212,-0.20365999999999998
213,-0.24549
214,-0.28225
215,-0.31144
216,-0.3312
217,-0.34036
218,-0.33847
219,-0.32583
220,-0.3026
221,-0.26995
222,-0.22934000000000002
223,-0.1826
224,-0.13105999999999998
225,-0.07561
226,-0.018018
227,0.039795
228,0.095274
229,0.14737
230,0.19448
231,0.23439000000000002
232,0.26504
233,0.28401
234,0.29191999999999996
235,0.28819
236,0.27236
237,0.24419000000000002
238,0.2038
239,0.15367999999999998
240,0.094986
241,0.029179000000000004
242,-0.042342000000000005
243,-0.11682999999999999
244,-0.19107000000000002
245,-0.26345
246,-0.33305999999999997
247,-0.40041
248,-0.46483
249,-0.5269199999999999
250,-0.58813
251,-0.6497
252,-0.71306
253,-0.77668
254,-0.8402
255,-0.90338
256,-0.96625
257,-1.0289
258,-1.0903
259,-1.1504
260,-1.209
261,-1.2654
262,-1.3174
263,-1.3619
264,-1.3971
265,-1.4217
266,-1.4362
267,-1.4412
268,-1.4389
269,-1.4329
