time,value
0,-0.13903
1,-0.13903
2,-0.13903
3,-0.13903
4,-0.13903
5,-0.13903
6,-0.13903
7,-0.13903
8,-0.13903
9,-0.13903
10,-0.13903
11,-0.13903
12,-0.13903
13,-0.13903
14,-0.13903
15,-0.13903
16,-0.13903
17,-0.13903
18,-0.13903
19,-0.13903
20,-0.13903
21,-0.13903
22,-0.13903
23,-0.13903
24,-0.13903
25,-0.13903
26,-0.13903
27,-0.13903
28,-0.13903
29,-0.13903
30,-0.13903
31,-0.13903
32,-0.13903
33,-0.13903
34,-0.13903
35,-0.13903
36,-0.13903
37,-0.13903
38,-0.13903
39,-0.13903
40,-0.13903
41,-0.13903
42,-0.13903
43,-0.13903
44,-0.13903
45,-0.13903
46,-0.13903
47,8.508
48,-0.13903
49,-0.13903
50,-0.13903
51,-0.13903
52,-0.13903
53,-0.13903
54,-0.13903
55,-0.13903
56,-0.13903
57,-0.13903
58,-0.13903
59,4.5604
60,-0.13903
61,-0.13903
62,-0.13903
63,-0.13903
64,-0.13903
65,-0.13903
66,-0.13903
67,-0.13903
68,-0.13903
69,-0.13903
70,-0.13903
71,-0.13903
72,-0.13903
73,-0.13903
74,-0.13903
75,-0.13903
76,-0.13903
77,-0.13903
78,-0.13903
79,-0.13903
80,-0.13903
81,-0.13903
82,-0.13903
83,-0.13903
84,-0.13903
85,-0.13903
86,-0.13903
87,-0.13903
88,-0.13903
89,-0.13903
90,-0.13903
91,-0.13903
92,-0.13903
93,-0.13903
94,-0.13903
95,-0.13903
