time,value
0,1.3445
1,-1.4838
2,-0.45532
3,0.83029
4,-0.96957
5,-0.45532
6,0.83029
7,-0.96957
8,-0.1982
9,0.83029
10,-1.2267
11,-0.1982
12,1.3445
13,-1.4838
14,-0.1982
15,1.8588
16,-1.2267
17,-0.71244
18,2.1159
19,-1.2267
20,-1.2267
21,1.0874
22,-0.71244
23,-1.2267
24,1.6017
25,-0.45532
26,-0.45532
27,1.6017
28,-0.1982
29,-0.71244
30,1.8588
31,0.058924000000000004
32,-0.96957
33,2.1159
34,0.31605
35,-1.2267
36,1.0874
37,0.57317
38,-1.2267
39,1.3445
40,0.058924000000000004
41,-0.96957
42,1.0874
43,-0.1982
44,-0.71244
45,0.57317
46,-0.1982
47,-1.2267
48,1.6017
49,-0.1982
50,-1.2267
51,1.3445
52,0.31605
53,-1.2267
54,0.57317
55,0.31605
56,-1.2267
57,0.57317
58,-0.1982
59,-0.96957
60,0.31605
61,0.058924000000000004
62,-1.2267
63,0.57317
64,0.058924000000000004
65,-1.2267
66,0.83029
67,0.31605
68,-1.7409
69,0.058924000000000004
70,0.57317
71,-1.4838
72,0.31605
73,0.058924000000000004
74,-0.71244
75,0.57317
76,0.57317
77,-0.71244
78,0.31605
79,0.83029
80,-0.71244
81,1.0874
82,1.3445
83,-0.71244
84,0.058924000000000004
85,2.1159
86,-0.96957
87,0.058924000000000004
88,1.3445
89,-0.96957
90,-0.1982
91,0.57317
92,-0.71244
93,-0.1982
94,1.0874
95,-1.2267
