time,value
0,-0.058489
1,-0.49041
2,-0.058489
3,-0.49041
4,-0.058489
5,-0.49041
6,-0.058489
7,-0.49041
8,-0.058489
9,-0.49041
10,-0.058489
11,-0.49041
12,-0.058489
13,-0.49041
14,-0.058489
15,-0.49041
16,-0.058489
17,-0.49041
18,-0.058489
19,-0.058489
20,-0.49041
21,-0.058489
22,-0.49041
23,-0.058489
24,-0.49041
25,-0.058489
26,-0.49041
27,-0.058489
28,-0.49041
29,-0.058489
30,-0.49041
31,-0.058489
32,-0.49041
33,-0.058489
34,-0.49041
35,-0.058489
36,-0.49041
37,-0.058489
38,-0.49041
39,-0.058489
40,-0.49041
41,-0.058489
42,-0.49041
43,-0.058489
44,-0.49041
45,-0.058489
46,-0.49041
47,-0.058489
48,-0.49041
49,-0.058489
50,-0.49041
51,-0.058489
52,-0.49041
53,-0.058489
54,-0.49041
55,-0.058489
56,-0.49041
57,-0.058489
58,-0.49041
59,-0.058489
60,-0.49041
61,-0.058489
62,-0.49041
63,-0.058489
64,-0.49041
65,-0.058489
66,-0.49041
67,-0.058489
68,-0.49041
69,-0.058489
70,-0.49041
71,-0.058489
72,2.9649
73,3.8288
74,4.2607
75,0.37343000000000004
76,-0.49041
77,-0.058489
78,-0.49041
79,-0.058489
80,-0.49041
81,-0.058489
82,-0.49041
83,-0.058489
84,-0.49041
85,-0.058489
86,-0.49041
87,-0.058489
88,-0.49041
89,1.2373
90,3.3969
91,4.2607
92,3.3969
93,-0.058489
94,-0.49041
95,-0.058489
