time,value
0,-0.31676
1,-0.31676
2,-0.31676
3,-0.31676
4,-0.31676
5,-0.31676
6,-0.31676
7,-0.31676
8,-0.31676
9,-0.31676
10,-0.31676
11,-0.31676
12,-0.31676
13,-0.31676
14,-0.31676
15,-0.31676
16,-0.31676
17,-0.31676
18,-0.31676
19,-0.31676
20,0.0998
21,-0.31676
22,-0.31676
23,-0.31676
24,-0.31676
25,-0.31676
26,-0.31676
27,-0.31676
28,-0.31676
29,-0.31676
30,-0.31676
31,-0.31676
32,-0.31676
33,-0.31676
34,-0.31676
35,-0.31676
36,-0.31676
37,-0.31676
38,-0.31676
39,-0.31676
40,-0.31676
41,-0.31676
42,-0.31676
43,-0.31676
44,-0.31676
45,-0.31676
46,-0.31676
47,-0.31676
48,-0.31676
49,-0.31676
50,-0.31676
51,-0.31676
52,-0.31676
53,-0.31676
54,-0.31676
55,-0.31676
56,-0.31676
57,-0.31676
58,-0.31676
59,-0.31676
60,-0.31676
61,-0.31676
62,-0.31676
63,-0.31676
64,-0.31676
65,-0.31676
66,-0.31676
67,-0.31676
68,-0.31676
69,-0.31676
70,-0.31676
71,-0.31676
72,-0.31676
73,-0.31676
74,-0.31676
75,-0.31676
76,-0.31676
77,-0.31676
78,-0.31676
79,-0.31676
80,-0.31676
81,-0.31676
82,-0.31676
83,-0.31676
84,-0.31676
85,1.1412
86,3.2239999999999998
87,3.4323
88,3.2239999999999998
89,3.4323
90,3.4323
91,3.2239999999999998
92,3.4323
93,2.5991
94,-0.31676
95,-0.31676
