time,value
0,1.8439
1,1.8119999999999998
2,1.7724
3,1.7533
4,1.7198
5,1.6756
6,1.5949
7,1.5054
8,1.4744
9,1.4557
10,1.3979
11,1.3238
12,1.2455
13,1.1865
14,1.1372
15,1.0494
16,0.97309
17,0.89584
18,0.81823
19,0.74834
20,0.68066
21,0.6050300000000001
22,0.5243
23,0.45238
24,0.38805
25,0.35
26,0.34403
27,0.36861
28,0.39483
29,0.43451999999999996
30,0.47731
31,0.52737
32,0.58804
33,0.64841
34,0.70043
35,0.7461399999999999
36,0.6601199999999999
37,0.57044
38,0.49792
39,0.43933
40,0.37579
41,0.34548
42,0.27756
43,0.18059
44,0.08504099999999999
45,-0.009236200000000002
46,-0.10349000000000001
47,-0.19816
48,-0.2935
49,-0.36932
50,-0.46188999999999997
51,-0.5442899999999999
52,-0.6222
53,-0.6985899999999999
54,-0.7611600000000001
55,-0.8387100000000001
56,-0.91666
57,-0.9934299999999999
58,-1.0896
59,-1.169
60,-1.2293
61,-1.2953
62,-1.3621
63,-1.4296
64,-1.5005
65,-1.5805
66,-1.641
67,-1.7022
68,-1.7405
69,-1.7933
70,-1.8068
71,-1.7686
72,-1.7067
73,-1.6362
74,-1.571
75,-1.5113
76,-1.4408
77,-1.3696
78,-1.3058
79,-1.2368
80,-1.1745
81,-1.1037
82,-1.0317
83,-0.96521
84,-0.90035
85,-0.83775
86,-0.87379
87,-0.81918
88,-0.74858
89,-0.6773399999999999
90,-0.61445
91,-0.54215
92,-0.46731999999999996
93,-0.47053999999999996
94,-0.53522
95,-0.57523
96,-0.6351899999999999
97,-0.69784
98,-0.7599899999999999
99,-0.8153699999999999
100,-0.8675200000000001
101,-0.92355
102,-0.98113
103,-1.0304
104,-1.0607
105,-1.0522
106,-1.0898
107,-1.1389
108,-1.1902
109,-1.2349
110,-1.2846
111,-1.3235
112,-1.3552
113,-1.3775
114,-1.3921
115,-1.3995
116,-1.4021
117,-1.3936
118,-1.3763
119,-1.3565
120,-1.3336
121,-1.3049
122,-1.2729
123,-1.2348
124,-1.2076
125,-1.1849
126,-1.1222
127,-1.0527
128,-0.96901
129,-0.9100299999999999
130,-0.8554700000000001
131,-0.79945
132,-0.74936
133,-0.7067100000000001
134,-0.65801
135,-0.59575
136,-0.5493100000000001
137,-0.49476000000000003
138,-0.43346
139,-0.38858000000000004
140,-0.37756999999999996
141,-0.38084
142,-0.36855
143,-0.32771
144,-0.2973
145,-0.28213
146,-0.25893
147,-0.23598000000000002
148,-0.2054
149,-0.18109
150,-0.1562
151,-0.13372
152,-0.11245
153,-0.09123300000000001
154,-0.076887
155,-0.052926
156,-0.028933999999999998
157,0.0090854
158,0.05105
159,0.095038
160,0.13559000000000002
161,0.16105999999999998
162,0.20257
163,0.26593
164,0.33333
165,0.40171999999999997
166,0.44931000000000004
167,0.47186999999999996
168,0.49104
169,0.55093
170,0.62489
171,0.68516
172,0.74732
173,0.7992100000000001
174,0.8477100000000001
175,0.89512
176,0.92937
177,0.9735
178,1.0042
179,1.0363
180,1.0591
181,1.0812
182,1.1025
183,1.1222
184,1.1592
185,1.1909999999999998
186,1.2505
187,1.3413
188,1.4128
189,1.4796
190,1.5612
191,1.6279
192,1.706
193,1.7678
194,1.851
195,1.9127
196,1.9889
197,2.0578
198,2.1337
199,2.1999
200,2.2792
201,2.2805
202,2.2414
203,2.1666
204,2.0848
205,2.0224
206,1.9419
207,1.8772
208,1.7984
209,1.7338
210,1.6559
211,1.5742
212,1.5101
213,1.4386
214,1.3674
215,1.2945
216,1.2316
217,1.1779
218,1.1268
219,1.0897
220,1.0664
221,1.045
222,1.0165
223,1.0016
224,0.9775200000000001
225,0.94691
226,0.9178299999999999
227,0.88136
228,0.8484799999999999
229,0.80589
230,0.76879
231,0.73151
232,0.69405
233,0.6573100000000001
234,0.62544
235,0.585
236,0.5439
237,0.49867
238,0.44438
239,0.3572
240,0.30075
241,0.25295
242,0.21256
243,0.16322
244,0.13412000000000002
245,0.10459
246,0.08604400000000001
247,0.060110000000000004
248,0.036836
249,0.010423
250,0.0010934
251,-0.013394
252,-0.038161
253,-0.05708099999999999
254,-0.080665
255,-0.09943300000000001
256,-0.09665900000000001
257,-0.09022899999999999
258,-0.10277
259,-0.10504000000000001
260,-0.07226
261,-0.034023000000000005
262,-0.045986
263,-0.05126699999999999
264,-0.10730999999999999
265,-0.15815
266,-0.21765
267,-0.27801
268,-0.3291
269,-0.38326
270,-0.44158000000000003
271,-0.49849
272,-0.55777
273,-0.61442
274,-0.67819
275,-0.7500100000000001
276,-0.8416600000000001
277,-0.93211
278,-0.9975700000000001
279,-1.0547
280,-1.0864
281,-1.1174
282,-1.1384
283,-1.1629
284,-1.1849
285,-1.2053
286,-1.2163
287,-1.2151
288,-1.2104
289,-1.2011
290,-1.1815
291,-1.168
292,-1.155
293,-1.1263
294,-1.1027
295,-1.0647
296,-1.0347
297,-1.0065
298,-0.98295
299,-0.94439
300,-0.90891
301,-0.8785299999999999
302,-0.8458700000000001
303,-0.8124399999999999
304,-0.77315
305,-0.73792
306,-0.6894399999999999
307,-0.63454
308,-0.5885699999999999
309,-0.53546
310,-0.48468
311,-0.4397
312,-0.38723
313,-0.32624000000000003
314,-0.27605
315,-0.23318000000000003
316,-0.29447
317,-0.29084
318,-0.26356
319,-0.23306999999999997
320,-0.19147
321,-0.15086
322,-0.10672000000000001
323,-0.056617999999999995
324,-0.010851999999999999
325,0.043035000000000004
326,0.09639299999999999
327,0.12897
328,0.17787
329,0.22386
330,0.27737
331,0.2319
332,0.17155
333,0.10181
334,0.02812
335,-0.052933
336,-0.14868
337,-0.22152
338,-0.26915
339,-0.34743
340,-0.44191
341,-0.53896
342,-0.6158
343,-0.71057
344,-0.80637
345,-0.90123
346,-0.98455
347,-1.0262
348,-1.1026
349,-1.1895
350,-1.2757
351,-1.3537
352,-1.4161
353,-1.4508
354,-1.4526
355,-1.4466
356,-1.4348
357,-1.4151
358,-1.3859
359,-1.3341
360,-1.2833
361,-1.2156
362,-1.1548
363,-1.0888
364,-1.0286
365,-0.9606899999999999
366,-0.8944200000000001
367,-0.8215899999999999
368,-0.7500899999999999
369,-0.68333
370,-0.6106199999999999
371,-0.5495
372,-0.47203999999999996
373,-0.40758
374,-0.33299
375,-0.2628
376,-0.19698
377,-0.12218
378,-0.050081
379,0.024378
380,0.091597
381,0.17065
382,0.24251
383,0.3226
384,0.39219
385,0.47498
386,0.54751
387,0.62337
388,0.6795399999999999
389,0.73959
390,0.8146899999999999
391,0.8176800000000001
392,0.8715299999999999
393,0.93234
394,1.0212
395,1.0927
396,1.1799
397,1.2326
398,1.167
399,1.1002
400,1.0325
401,0.97516
402,0.91653
403,0.8645
404,0.81398
405,0.76217
406,0.71986
407,0.688
408,0.69128
409,0.7251
410,0.77084
411,0.8405
412,0.9036200000000001
413,0.9731299999999999
414,1.0404
415,1.1320000000000001
416,1.2262
417,1.3026
418,1.3969999999999998
419,1.4684
420,1.5627
421,1.6224
422,1.6758
423,1.7293
424,1.7692
425,1.8076
426,1.8426
