[<text>
<title>south jersey industries inc &lt;sji&gt; 1st qtr net</title>
<dateline>    folsom, n.j., april 9 -
    </dateline>oper shr 1.64 dlrs vs 1.50 dlrs
    oper net 6,200,000 vs 5,600,000
    revs not given
    12 mths
    oper shr 2.76 dlrs vs 2.58 dlrs
    oper net 10.4 mln vs 9,600,000
    note: net income including discontinued operation and, in
both 1986 periods, 1,500,000 dlr gain from change in accounting
for which results restated, 6,200,000 dlrs vs 7,200,000 dlrs in
quarter and 10.6 mln dlrs vs 11.6 mln dlrs.
 reuter
</text>]