time,value
0,-0.34868000000000005
1,-0.34868000000000005
2,-0.34868000000000005
3,-0.34868000000000005
4,-0.34868000000000005
5,-0.34868000000000005
6,-0.34868000000000005
7,-0.34868000000000005
8,-0.34868000000000005
9,-0.34868000000000005
10,-0.34868000000000005
11,-0.34868000000000005
12,0.1388
13,-0.34868000000000005
14,-0.34868000000000005
15,-0.34868000000000005
16,-0.34868000000000005
17,-0.34868000000000005
18,-0.34868000000000005
19,-0.34868000000000005
20,0.1388
21,-0.34868000000000005
22,-0.34868000000000005
23,-0.34868000000000005
24,-0.34868000000000005
25,-0.34868000000000005
26,-0.34868000000000005
27,-0.34868000000000005
28,-0.34868000000000005
29,-0.34868000000000005
30,-0.34868000000000005
31,-0.34868000000000005
32,-0.34868000000000005
33,-0.34868000000000005
34,-0.34868000000000005
35,-0.34868000000000005
36,-0.34868000000000005
37,-0.34868000000000005
38,-0.34868000000000005
39,-0.34868000000000005
40,0.1388
41,-0.34868000000000005
42,-0.34868000000000005
43,-0.34868000000000005
44,-0.34868000000000005
45,-0.34868000000000005
46,-0.34868000000000005
47,-0.34868000000000005
48,-0.34868000000000005
49,-0.34868000000000005
50,-0.34868000000000005
51,-0.34868000000000005
52,-0.34868000000000005
53,-0.34868000000000005
54,-0.34868000000000005
55,-0.34868000000000005
56,0.1388
57,-0.34868000000000005
58,-0.34868000000000005
59,-0.34868000000000005
60,-0.34868000000000005
61,-0.34868000000000005
62,-0.34868000000000005
63,-0.34868000000000005
64,-0.34868000000000005
65,-0.34868000000000005
66,-0.34868000000000005
67,-0.34868000000000005
68,-0.34868000000000005
69,-0.34868000000000005
70,-0.34868000000000005
71,-0.34868000000000005
72,-0.34868000000000005
73,-0.34868000000000005
74,-0.34868000000000005
75,-0.34868000000000005
76,-0.34868000000000005
77,-0.34868000000000005
78,-0.34868000000000005
79,-0.34868000000000005
80,-0.34868000000000005
81,-0.34868000000000005
82,0.95126
83,1.2762
84,0.62627
85,2.7387
86,3.5511
87,3.5511
88,3.5511
89,3.3886
90,3.5511
91,3.3886
92,1.1138
93,-0.34868000000000005
94,-0.34868000000000005
95,-0.34868000000000005
