time,value
0,-0.23781
1,-0.23781
2,-0.23781
3,-0.23781
4,-0.23781
5,-0.23781
6,-0.23781
7,-0.23781
8,-0.23781
9,-0.23781
10,-0.23781
11,-0.23781
12,-0.23781
13,-0.23781
14,-0.23781
15,-0.23781
16,-0.23781
17,-0.23781
18,-0.23781
19,-0.23781
20,-0.23781
21,-0.23781
22,-0.23781
23,-0.23781
24,-0.23781
25,-0.23781
26,-0.23781
27,-0.23781
28,-0.23781
29,-0.23781
30,-0.23781
31,-0.23781
32,-0.23781
33,-0.23781
34,-0.23781
35,-0.23781
36,3.0716
37,5.6701
38,2.0762
39,-0.23781
40,-0.23781
41,-0.23781
42,-0.23781
43,-0.23781
44,-0.23781
45,-0.23781
46,-0.23781
47,-0.23781
48,-0.23781
49,-0.23781
50,-0.23781
51,-0.23781
52,-0.23781
53,-0.23781
54,-0.23781
55,-0.23781
56,-0.23781
57,-0.23781
58,-0.23781
59,-0.23781
60,-0.23781
61,-0.23781
62,-0.23781
63,-0.23781
64,-0.23781
65,-0.23781
66,-0.23781
67,-0.23781
68,-0.23781
69,-0.23781
70,-0.23781
71,-0.23781
72,-0.23781
73,-0.23781
74,-0.23781
75,-0.23781
76,-0.23781
77,-0.23781
78,-0.23781
79,-0.23781
80,-0.23781
81,-0.23781
82,2.7226
83,5.6183
84,2.2443
85,-0.23781
86,-0.23781
87,-0.23781
88,-0.23781
89,-0.23781
90,-0.23781
91,-0.23781
92,-0.23781
93,-0.23781
94,-0.23781
95,-0.23781
