time,value
0,0.54719
1,0.33516
2,0.74957
3,0.93427
4,0.8192799999999999
5,0.9413100000000001
6,0.88705
7,1.2557
8,1.3061
9,0.94225
10,0.9759
11,0.88039
12,0.75739
13,0.41767
14,0.41033000000000003
15,0.5083
16,0.35201
17,0.3903
18,0.34378000000000003
19,0.24593
20,0.20462
21,0.28913
22,0.20856999999999998
23,0.23561999999999997
24,0.18185
25,0.22805
26,0.23131
27,0.27255999999999997
28,0.20123
29,0.16172999999999998
30,0.18427000000000002
31,0.19651
32,0.21205
33,0.19748
34,0.27287
35,0.26604
36,0.17273
37,0.068738
38,0.024506
39,0.02247
40,0.008358299999999999
41,-0.05274500000000001
42,0.038446
43,-0.013228
44,-0.14012
45,-0.20377
46,-0.30981
47,-0.36033000000000004
48,-0.31234
49,-0.27002
50,-0.35181999999999997
51,-0.38314000000000004
52,-0.45311
53,-0.49012
54,-0.47768999999999995
55,-0.38903000000000004
56,-0.56435
57,-0.54937
58,-0.39507
59,-0.29327
60,-0.5155
61,-0.57739
62,-0.77762
63,-0.65942
64,-0.8408899999999999
65,-0.76254
66,-0.79872
67,-0.92861
68,-0.73897
69,-0.5554
70,-0.58244
71,-0.7994399999999999
72,-0.8735799999999999
73,-0.88229
74,-1.0388
75,-0.9662799999999999
76,-0.8035800000000001
77,-0.83095
78,-0.9026200000000001
79,-1.0766
80,-1.025
81,-1.2056
82,-1.3903
83,-1.4612
84,-1.6563
85,-1.6404
86,-1.7021
87,-1.8876
88,-1.8278
89,-1.5191
90,-1.5451
91,-1.6155
92,-1.6952
93,-1.4819
94,-1.1466
95,-1.0273
96,-1.1117
97,-0.98649
98,-0.66972
99,-0.46979
100,-0.38592
101,-0.30323
102,-0.19268
103,-0.27615
104,-0.2419
105,-0.2738
106,-0.02621
107,-0.31774
108,-0.23304
109,-0.62459
110,-0.8578100000000001
111,-0.97341
112,-1.0857
113,-1.0991
114,-1.2048
115,-1.1791
116,-1.3662
117,-1.9073
118,-1.6015
119,-1.7241
120,-1.6387
121,-1.5691
122,-1.5141
123,-1.3894
124,-1.2354
125,-1.4140000000000001
126,-1.2305
127,-1.3108
128,-1.386
129,-1.2713
130,-1.2529
131,-1.2981
132,-1.3464
133,-1.4104
134,-1.3294
135,-1.3564
136,-1.4838
137,-1.401
138,-1.0627
139,-1.1193
140,-1.501
141,-1.3745
142,-1.0805
143,-1.0709
144,-0.92624
145,-0.72669
146,-0.20393
147,0.37878
148,0.5260100000000001
149,1.7037
150,1.2388
151,0.93437
152,1.0488
153,1.5785
154,0.60139
155,0.57663
156,0.37389
157,0.29154
158,0.085117
159,0.20138
160,0.16638
161,-0.41853999999999997
162,-1.2073
163,-2.5159
164,-2.3646
165,-2.2933
166,-2.3211
167,-1.4571
168,-1.0076
169,-1.0502
170,-0.17082999999999998
171,-0.0057323
172,-0.5645600000000001
173,-0.3761
174,0.69062
175,1.2995
176,2.5737
177,0.67737
178,0.44158000000000003
179,0.76241
180,0.88569
181,0.62154
182,1.4023
183,1.2823
184,0.46246000000000004
185,0.9092600000000001
186,1.2479
187,0.20726
188,-0.097319
189,2.0344
190,2.1537
191,0.72727
192,0.18375999999999998
193,0.80796
194,1.2239
195,0.4805
196,0.18765
197,0.51773
198,0.15345999999999999
199,4.9201
200,3.1476
201,0.8170000000000001
202,-1.2136
203,-2.2981
204,-1.8259
205,0.15614
206,0.5489999999999999
207,0.64354
208,0.43654
209,0.5213
210,0.22207
211,-0.19299000000000002
212,0.19455999999999998
213,0.5402399999999999
214,2.2378
215,2.6089
216,1.885
217,1.3026
218,0.70044
219,0.79766
220,1.0447
221,1.1724
222,1.275
223,0.88976
224,0.64673
225,0.1965
226,0.019628
227,-0.0027126
228,0.093463
229,0.23296
230,0.24706999999999998
231,0.54519
232,0.5755600000000001
233,0.76822
234,0.76861
235,0.62133
236,0.44569
237,0.25174
238,0.25651999999999997
239,0.26728
240,0.39088
241,0.44226000000000004
242,0.35570999999999997
243,0.46713999999999994
244,0.45593999999999996
245,0.5988399999999999
246,0.80255
247,0.8042
248,0.80907
249,0.81095
250,0.96136
251,0.85088
252,0.65449
253,0.65123
254,0.47738
255,0.34728000000000003
256,0.48372
257,0.67215
258,0.9490000000000001
259,0.8856299999999999
260,0.6696
261,0.67145
262,0.65855
263,0.4936
264,0.49423999999999996
265,0.48053999999999997
266,0.46182
267,0.64318
268,0.64944
269,0.56288
270,0.47625
271,0.56797
272,0.66494
273,0.6610699999999999
274,0.67297
275,0.67202
276,0.66546
277,0.66876
278,0.6645800000000001
279,0.64098
280,0.59949
281,0.7247600000000001
282,0.5896899999999999
283,0.64758
284,0.6555300000000001
285,0.65855
286,0.8249299999999999
287,0.8262200000000001
288,0.81909
289,0.63646
290,0.44653999999999994
291,0.58945
292,0.45228999999999997
293,0.47133
294,0.64586
295,0.6473
296,0.97696
297,0.8124
298,0.7999
299,0.79473
