time,value
0,-1.0677
1,-0.8749299999999999
2,-1.1138
3,-1.3056
4,-1.3564
5,-1.4012
6,-1.2468
7,-1.3594
8,-1.1902
9,-1.2393
10,-1.2437
11,-1.085
12,-0.88835
13,-0.8466100000000001
14,-0.56835
15,-0.34865
16,-0.27549
17,-0.27933
18,0.71314
19,0.7984899999999999
20,1.3928
21,2.0792
22,1.9167
23,2.3175
24,1.7469
25,1.0645
26,-0.4174
27,0.041887
28,-0.16088
29,0.19297
30,-0.26747
31,0.022798
32,0.17323
33,0.17222
34,0.16746
35,0.23936999999999997
36,0.39673
37,0.27223
38,0.3843
39,0.48443
40,0.43951999999999997
41,0.5504899999999999
42,0.79964
43,0.82473
44,0.97946
45,1.2355
46,1.2811
47,1.3494
48,1.1079
49,1.2592
50,1.1805
51,1.2356
52,1.2785
53,1.3796
54,1.4378
55,1.5236
56,1.4503
57,1.4142
58,1.3522
59,1.3783
60,1.2930000000000001
61,1.2705
62,1.2723
63,1.2990000000000002
64,1.3387
65,1.2739
66,1.3553
67,1.2811
68,1.2561
69,1.2041
70,1.1656
71,1.1962
72,1.1836
73,1.2214
74,1.2219
75,1.2391
76,1.2392
77,1.2036
78,1.251
79,1.2104
80,1.1835
81,1.1553
82,1.1931
83,1.1892
84,1.1908
85,1.2106
86,1.1975
87,1.2502
88,1.3153
89,1.3015
90,1.2978
91,1.2805
92,1.3354
93,1.2707
94,1.2845
95,1.3358
96,1.3102
97,1.2881
98,1.2788
99,1.3194
100,1.2976
101,1.3
102,1.2666
103,1.3496
104,1.365
105,1.4017
106,1.4555
107,1.4734
108,1.5218
109,1.5483
110,1.5775
111,1.5692
112,1.5502
113,1.4369999999999998
114,1.492
115,1.2433
116,1.0117
117,1.125
118,1.1
119,1.0927
120,1.1087
121,1.1976
122,1.0045
123,1.1095
124,0.74212
125,0.3524
126,0.22174000000000002
127,0.11035
128,-0.20654
129,-0.1821
130,-0.044965
131,0.057039
132,0.11984000000000002
133,0.085249
134,0.096493
135,0.15805999999999998
136,0.18041
137,-0.0095456
138,0.09013099999999999
139,0.44503000000000004
140,0.6595
141,0.7741399999999999
142,1.0342
143,1.2007
144,1.5831
145,2.5578
146,0.80333
147,0.15141
148,-0.11055999999999999
149,0.51145
150,0.30998000000000003
151,0.6592100000000001
152,0.1931
153,0.089408
154,0.018871000000000002
155,-0.15698
156,-0.025539
157,0.047314
158,-0.0049427
159,-0.087674
160,-0.26421
161,0.10567
162,0.094111
163,0.082873
164,-0.22810999999999998
165,-0.25384
166,-0.29635
167,-0.0476
168,-0.15170999999999998
169,-0.22423
170,-0.23814000000000002
171,-0.22535
172,-0.31759
173,-0.2488
174,-0.23518000000000003
175,-0.23181999999999997
176,-0.26255
177,-0.2686
178,-0.34329
179,-0.27137
180,-0.29898
181,-0.33657
182,-0.33150999999999997
183,-0.3169
184,-0.35701
185,-0.41476999999999997
186,-0.50926
187,-0.46705
188,-0.50727
189,-0.59941
190,-0.4452
191,-0.54737
192,-0.5687399999999999
193,-0.6220100000000001
194,-0.53359
195,-0.62825
196,-0.5727300000000001
197,-0.63088
198,-0.75772
199,-0.60452
200,-0.63648
201,-0.7701899999999999
202,-0.6963199999999999
203,-0.68707
204,-0.77123
205,-0.72329
206,-0.75936
207,-0.80367
208,-0.7995800000000001
209,-0.8753700000000001
210,-0.8823700000000001
211,-0.89705
212,-0.9164899999999999
213,-0.91694
214,-0.8802700000000001
215,-0.96705
216,-0.99298
217,-0.9249799999999999
218,-0.89585
219,-0.93985
220,-0.87177
221,-0.86075
222,-0.8450799999999999
223,-0.8215899999999999
224,-0.92989
225,-0.87676
226,-0.83145
227,-0.81152
228,-0.8960100000000001
229,-0.8927200000000001
230,-0.88176
231,-0.9111600000000001
232,-0.94424
233,-0.9265899999999999
234,-0.92895
235,-0.9821
236,-1.0067
237,-1.0428
238,-1.0697
239,-1.1069
240,-1.0532
241,-1.0695
242,-1.0012
243,-1.0497
244,-1.0757
245,-1.0012
246,-1.0322
247,-1.0226
248,-1.0527
249,-1.12
250,-1.0459
251,-1.0485
252,-1.0453
253,-1.0647
254,-1.1283
255,-1.0566
256,-1.1349
257,-1.1338
258,-1.0435
259,-1.052
260,-1.0593
261,-1.0502
262,-1.0493
263,-0.98679
264,-1.0504
265,-1.0619
266,-1.0799
267,-1.0653
268,-1.0621
269,-1.0578
270,-1.0484
271,-1.0639
272,-1.0689
273,-1.0647
274,-1.0699
275,-1.0712
276,-1.0588
277,-1.0804
278,-1.0878
279,-1.0903
280,-1.083
281,-1.0833
282,-1.0928
283,-1.0901
284,-1.1
285,-1.0965
286,-1.1672
287,-1.0791
288,-1.0772
289,-1.0884
290,-1.0837
291,-1.1632
292,-1.088
293,-1.0905
294,-1.172
295,-1.0897
296,-1.0922
297,-1.1786
298,-1.1740000000000002
299,-1.0849
