time,value
0,-0.48625
1,-0.35906
2,-0.48625
3,-0.48625
4,-0.48625
5,-0.48625
6,-0.35906
7,-0.48625
8,-0.48625
9,-0.48625
10,-0.35906
11,-0.48625
12,-0.23187
13,-0.48625
14,-0.48625
15,-0.48625
16,-0.48625
17,-0.35906
18,-0.48625
19,-0.48625
20,-0.48625
21,-0.48625
22,-0.48625
23,-0.48625
24,-0.48625
25,-0.48625
26,-0.35906
27,-0.48625
28,-0.48625
29,-0.48625
30,-0.48625
31,-0.48625
32,-0.48625
33,-0.48625
34,-0.35906
35,-0.48625
36,-0.48625
37,-0.48625
38,-0.48625
39,-0.48625
40,-0.35906
41,-0.48625
42,-0.48625
43,-0.48625
44,-0.48625
45,-0.48625
46,-0.35906
47,-0.48625
48,-0.48625
49,-0.48625
50,-0.48625
51,-0.35906
52,-0.48625
53,-0.48625
54,-0.48625
55,-0.48625
56,-0.48625
57,-0.35906
58,-0.48625
59,-0.48625
60,-0.48625
61,-0.48625
62,-0.48625
63,-0.48625
64,-0.48625
65,-0.35906
66,-0.48625
67,-0.48625
68,-0.48625
69,-0.48625
70,-0.10467
71,2.5664
72,0.022524000000000002
73,2.0576
74,2.5664
75,2.4392
76,2.5664
77,2.5664
78,2.5664
79,2.8208
80,0.27691
81,0.14972
82,0.022524000000000002
83,0.91289
84,2.5664
85,2.5664
86,2.5664
87,2.5664
88,1.0401
89,-0.10467
90,0.14972
91,0.14972
92,0.022524000000000002
93,0.14972
94,-0.23187
95,-0.48625
