time,value
0,-0.038906
1,-0.14562
2,-0.14562
3,-0.14562
4,-0.038906
5,-0.14562
6,-0.57247
7,-0.57247
8,-0.57247
9,-0.46576000000000006
10,-0.57247
11,-0.57247
12,-0.35905
13,-0.57247
14,-0.57247
15,-0.57247
16,-0.46576000000000006
17,-0.57247
18,-0.57247
19,-0.57247
20,-0.46576000000000006
21,-0.57247
22,-0.57247
23,-0.57247
24,-0.57247
25,-0.46576000000000006
26,-0.57247
27,-0.57247
28,-0.57247
29,-0.57247
30,-0.46576000000000006
31,-0.57247
32,-0.57247
33,-0.57247
34,-0.57247
35,-0.46576000000000006
36,-0.57247
37,-0.57247
38,-0.57247
39,-0.57247
40,-0.46576000000000006
41,-0.57247
42,-0.57247
43,-0.57247
44,-0.57247
45,-0.46576000000000006
46,-0.57247
47,-0.57247
48,-0.57247
49,-0.57247
50,-0.57247
51,-0.57247
52,-0.57247
53,-0.46576000000000006
54,-0.57247
55,-0.57247
56,-0.57247
57,-0.57247
58,-0.57247
59,-0.46576000000000006
60,-0.57247
61,-0.57247
62,-0.57247
63,-0.57247
64,-0.57247
65,-0.57247
66,-0.57247
67,-0.57247
68,-0.038906
69,1.8819
70,1.9887
71,1.9887
72,1.9887
73,1.9887
74,1.9887
75,1.8819
76,1.9887
77,-0.14562
78,-0.57247
79,-0.46576000000000006
80,-0.57247
81,-0.46576000000000006
82,1.9887
83,1.9887
84,1.9887
85,1.9887
86,1.8819
87,1.9887
88,1.9887
89,1.9887
90,1.8819
91,1.9887
92,1.8819
93,1.0282
94,-0.57247
95,-0.57247
