time,value
0,-2.3057
1,-2.3057
2,-2.3057
3,-2.3057
4,-2.3057
5,-2.3057
6,-2.3057
7,-2.3082
8,-2.3082
9,-2.3082
10,-2.3080000000000003
11,-2.3076
12,-2.3072
13,-2.3067
14,-2.3061
15,-2.3051
16,-2.3043
17,-2.3033
18,-2.3023
19,-2.3008
20,-2.2999
21,-2.307
22,-2.314
23,-2.3145
24,-2.3129
25,-2.3113
26,-2.3095
27,-2.307
28,-2.305
29,-2.3029
30,-2.3008
31,-2.2977
32,-2.2953
33,-2.2929
34,-2.2903
35,-2.2891
36,-2.2863
37,-2.2835
38,-2.2805
39,-2.2765
40,-2.2733
41,-2.2701
42,-2.2668
43,-2.2623
44,-2.2589
45,-2.2554
46,-2.2517
47,-2.2571
48,-2.2625
49,-2.2621
50,-2.2583
51,-2.253
52,-2.249
53,-2.2449
54,-2.2407
55,-2.2351
56,-2.2308
57,-2.2265
58,-2.222
59,-2.2161
60,-2.2115
61,-2.2069
62,-2.2022
63,-2.1975
64,-2.1912
65,-2.1863
66,-2.1815
67,-2.1765
68,-2.1699
69,-2.1649
70,-2.1598
71,-2.1547
72,-2.1478
73,-2.1425
74,-2.1373
75,-2.1319999999999997
76,-2.1248
77,-2.1194
78,-2.114
79,-2.1085
80,-2.0997
81,-2.0926
82,-2.0854
83,-2.0799
84,-2.0725
85,-2.0669
86,-2.0613
87,-2.0557
88,-2.0482
89,-2.0425
90,-2.0367
91,-2.031
92,-2.0232
93,-2.0174
94,-2.0116
95,-2.0057
96,-1.9978
97,-1.9903
98,-1.9843
99,-1.9784
100,-1.9704
101,-1.9643
102,-1.9583
103,-1.9522
104,-1.944
105,-1.9379
106,-1.9318
107,-1.9256
108,-1.9173
109,-1.9111
110,-1.9049
111,-1.8999
112,-1.8958
113,-1.8937
114,-1.8874
115,-1.8811
116,-1.8727
117,-1.865
118,-1.8594
119,-1.8559
120,-1.8482
121,-1.8419
122,-1.8355
123,-1.8291
124,-1.827
125,-1.8249
126,-1.8171
127,-1.8107
128,-1.8043
129,-1.7957
130,-1.7893
131,-1.7815
132,-1.775
133,-1.7663
134,-1.7598
135,-1.7542
136,-1.7482
137,-1.7421
138,-1.7356
139,-1.7291
140,-1.7226
141,-1.7126
142,-1.7091
143,-1.7031
144,-1.7005
145,-1.6906
146,-1.6840000000000002
147,-1.6762
148,-1.6697
149,-1.6628
150,-1.6568
151,-1.652
152,-1.6455
153,-1.6368
154,-1.629
155,-1.6225
156,-1.6177
157,-1.6104
158,-1.6026
159,-1.5961
160,-1.5883
161,-1.5796
162,-1.5739
163,-1.5679
164,-1.5641
165,-1.5554
166,-1.5476
167,-1.541
168,-1.5345
169,-1.5276
170,-1.5216
171,-1.5147
172,-1.5081
173,-1.4981
174,-1.4916
175,-1.4837
176,-1.4778
177,-1.4696
178,-1.463
179,-1.4552
180,-1.4487
181,-1.4421
182,-1.4361
183,-1.4302
184,-1.4223
185,-1.4158
186,-1.4058
187,-1.3992
188,-1.3935
189,-1.3876
190,-1.3816
191,-1.3751
192,-1.3685
193,-1.3619
194,-1.3519
195,-1.3453
196,-1.3387
197,-1.3321
198,-1.3271
199,-1.3224
200,-1.3146
201,-1.308
202,-1.2992
203,-1.2914
204,-1.2847
205,-1.2781
206,-1.2692
207,-1.2656
208,-1.2597
209,-1.2519
210,-1.2429999999999999
211,-1.2364
212,-1.2285
213,-1.2219
214,-1.213
215,-1.2063
216,-1.2017
217,-1.1981
218,-1.1913
219,-1.1846
220,-1.178
221,-1.1713
222,-1.1624
223,-1.1557
224,-1.1478
225,-1.1411
226,-1.1322
227,-1.1255
228,-1.1209
229,-1.1174
230,-1.1106
231,-1.1039
232,-1.0972
233,-1.0905
234,-1.0815
235,-1.0748
236,-1.0669
237,-1.0602
238,-1.0512
239,-1.0444
240,-1.0421
241,-1.0364
242,-1.0296
243,-1.0207
244,-1.0139
245,-1.0072
246,-1.0004
247,-0.99141
248,-0.98465
249,-0.97788
250,-0.9699700000000001
251,-0.96093
252,-0.95414
253,-0.94735
254,-0.94055
255,-0.93148
256,-0.9258299999999999
257,-0.9202299999999999
258,-0.9146200000000001
259,-0.90556
260,-0.89876
261,-0.8919600000000001
262,-0.8851399999999999
263,-0.8749600000000001
264,-0.86813
265,-0.86131
266,-0.8544799999999999
267,-0.84536
268,-0.8421
269,-0.83654
270,-0.82862
271,-0.8195100000000001
272,-0.8126800000000001
273,-0.80585
274,-0.799
275,-0.78987
276,-0.78194
277,-0.77509
278,-0.76823
279,-0.75907
280,-0.7522
281,-0.74533
282,-0.73844
283,-0.72926
284,-0.7248600000000001
285,-0.7194
286,-0.7127
287,-0.70353
288,-0.69665
289,-0.68871
290,-0.68182
291,-0.6726300000000001
292,-0.66574
293,-0.66135
294,-0.65591
295,-0.6469199999999999
296,-0.64003
297,-0.6331399999999999
298,-0.62624
299,-0.6170399999999999
300,-0.61014
301,-0.60323
302,-0.59528
303,-0.58837
304,-0.57914
305,-0.57222
306,-0.56529
307,-0.5583600000000001
308,-0.54911
309,-0.5421600000000001
310,-0.53522
311,-0.52827
312,-0.52062
313,-0.51759
314,-0.51195
315,-0.5050100000000001
316,-0.49575
317,-0.48881
318,-0.48185
319,-0.4749
320,-0.46462
321,-0.45766
322,-0.4507
323,-0.44373
324,-0.43542
325,-0.42844
326,-0.42048
327,-0.4135
328,-0.40418000000000004
329,-0.39719
330,-0.39019000000000004
331,-0.3832
332,-0.37385999999999997
333,-0.36823
334,-0.363
335,-0.36009
336,-0.35076999999999997
337,-0.34376999999999996
338,-0.33676999999999996
339,-0.32977
340,-0.32043
341,-0.31246999999999997
342,-0.30546
343,-0.29844
344,-0.28909
345,-0.28484
346,-0.27964
347,-0.27539
348,-0.26604
349,-0.25808000000000003
350,-0.25106999999999996
351,-0.24405
352,-0.23885
353,-0.23363
354,-0.22566999999999998
355,-0.21866
356,-0.20931999999999998
357,-0.20231
358,-0.19434
359,-0.18733
360,-0.17797000000000002
361,-0.17095
362,-0.16392
363,-0.15829000000000001
364,-0.15311
365,-0.14792
366,-0.1409
367,-0.13389
368,-0.12686
369,-0.11656
370,-0.10953
371,-0.1025
372,-0.094532
373,-0.08841399999999999
374,-0.081836
375,-0.074817
376,-0.06779500000000001
377,-0.058424000000000004
378,-0.050456
379,-0.043426
380,-0.036394
381,-0.030766
382,-0.025602
383,-0.020426
384,-0.013404
385,-0.0040359
386,0.0039350999999999995
387,0.010965
388,0.017997
389,0.027377999999999996
390,0.033003
391,0.038159
392,0.040985
393,0.051297
394,0.058324
395,0.061157
396,0.066346
397,0.076653
398,0.083673
399,0.090695
400,0.097717
401,0.10803
402,0.11506
403,0.12209
404,0.12630999999999998
405,0.13243
406,0.13572
407,0.14274
408,0.14977000000000001
409,0.15913
410,0.16616
411,0.1732
412,0.18023
413,0.18962
414,0.19666
415,0.2037
416,0.21075
417,0.22014
418,0.2272
419,0.23517
420,0.24223000000000003
421,0.25164000000000003
422,0.2587
423,0.26576
424,0.27282
425,0.2808
426,0.2868
427,0.29099
428,0.29805
429,0.30511
430,0.31451999999999997
431,0.3225
432,0.32957
433,0.33663000000000004
434,0.34606
435,0.35313
436,0.36021
437,0.36436999999999997
438,0.37035
439,0.37596999999999997
440,0.38304
441,0.39011
442,0.39954
443,0.40662
444,0.41458999999999996
445,0.42167
446,0.43111000000000005
447,0.43818999999999997
448,0.44527
449,0.44796
450,0.45392
451,0.461
452,0.46807
453,0.47515
454,0.48458999999999997
455,0.49168
456,0.49876000000000004
457,0.50585
458,0.5153
459,0.5223899999999999
460,0.52949
461,0.53659
462,0.54605
463,0.55315
464,0.56025
465,0.5673600000000001
466,0.5768399999999999
467,0.58395
468,0.59106
469,0.59817
470,0.60852
471,0.61564
472,0.6227600000000001
473,0.62988
474,0.6393800000000001
475,0.64347
476,0.6484300000000001
477,0.65404
478,0.6635300000000001
479,0.67065
480,0.67777
481,0.6849
482,0.69202
483,0.70152
484,0.70865
485,0.7061
486,0.70595
487,0.71225
488,0.71225
489,0.7097399999999999
490,0.70724
491,0.70394
492,0.7014699999999999
493,0.69903
494,0.69821
495,0.69262
496,0.68861
497,0.6838
498,0.6774
499,0.66782
500,0.66065
501,0.65347
502,0.64548
503,0.6359199999999999
504,0.62874
505,0.62473
506,0.61992
507,0.61352
508,0.60634
509,0.59916
510,0.59118
511,0.5808
512,0.57839
513,0.5712
514,0.56321
515,0.55523
516,0.5504399999999999
517,0.54807
518,0.54088
519,0.5312899999999999
520,0.52409
521,0.5161100000000001
522,0.5089199999999999
523,0.49933
524,0.49215
525,0.48736
526,0.48498
527,0.4746
528,0.46662
529,0.46425
530,0.4595
531,0.45152
532,0.44432
533,0.43633
534,0.42913
535,0.42036
536,0.41562
537,0.41167
538,0.40446
539,0.39485
540,0.38765
541,0.37966
542,0.37246
543,0.36525
544,0.35727
545,0.35252
546,0.34779
547,0.34299
548,0.3326
549,0.3302
550,0.32942
551,0.32384
552,0.31345
553,0.30546999999999996
554,0.3047
555,0.30151999999999995
556,0.29354
557,0.28873000000000004
558,0.28631999999999996
559,0.28392
560,0.27431
561,0.26632
562,0.25911
563,0.25190999999999997
564,0.2464
565,0.24169000000000002
566,0.23939000000000002
567,0.23711999999999997
568,0.23079000000000002
569,0.2228
570,0.21648
571,0.21181999999999998
572,0.20551
573,0.19827
574,0.19103
575,0.1838
576,0.1734
577,0.16617
578,0.15894
579,0.15337
580,0.14795999999999998
581,0.14165
582,0.13441
583,0.12717
584,0.11677
585,0.10954000000000001
586,0.10489000000000001
587,0.10025
588,0.09227300000000001
589,0.08429099999999999
590,0.077047
591,0.069803
592,0.062761
593,0.058142
594,0.052579999999999995
595,0.045328
596,0.03493
597,0.027681
598,0.020434
599,0.01655
600,0.013637
601,0.005655100000000001
602,-0.0015989
603,-0.0095809
604,-0.016835
605,-0.024089
606,-0.026506000000000002
607,-0.032070999999999995
608,-0.040053
609,-0.050450999999999996
610,-0.053597000000000006
611,-0.056742999999999995
612,-0.064724
613,-0.067868
614,-0.067868
615,-0.071012
616,-0.073171
617,-0.077736
618,-0.085715
619,-0.092984
620,-0.10096000000000001
621,-0.11065
622,-0.1145
623,-0.11905
624,-0.12287999999999999
625,-0.13258
626,-0.13985999999999998
627,-0.14712999999999998
628,-0.1544
629,-0.16409
630,-0.17135
631,-0.17862
632,-0.18588
633,-0.19555999999999998
634,-0.2004
635,-0.20282
636,-0.20524
637,-0.21491
638,-0.21491
639,-0.21733000000000002
640,-0.2229
641,-0.23256999999999997
642,-0.23644
643,-0.24103000000000002
644,-0.2473
645,-0.2577
646,-0.26084
647,-0.26298
648,-0.26509
649,-0.27031
650,-0.27237
651,-0.27442
652,-0.27645
653,-0.27846
654,-0.27912
655,-0.27912
656,-0.2811
657,-0.27997
658,-0.27997
659,-0.27818000000000004
660,-0.27086
661,-0.26418
662,-0.2661
663,-0.26555
664,-0.25821
665,-0.25087
666,-0.24109
667,-0.23435999999999998
668,-0.22701999999999997
669,-0.21966999999999998
670,-0.20986999999999997
671,-0.20252
672,-0.19577999999999998
673,-0.19088
674,-0.19083
675,-0.18957000000000002
676,-0.1822
677,-0.17482999999999999
678,-0.1656
679,-0.15822999999999998
680,-0.15750999999999998
681,-0.15675999999999998
682,-0.14994000000000002
683,-0.14256
684,-0.13517
685,-0.12779000000000001
686,-0.11849000000000001
687,-0.11110999999999999
688,-0.10372
689,-0.10125
690,-0.098787
691,-0.09139299999999999
692,-0.086465
693,-0.084
694,-0.081536
695,-0.07414
696,-0.06674400000000001
697,-0.059349
698,-0.049483
699,-0.041542
700,-0.034144
701,-0.026746
702,-0.016878
703,-0.0094749
704,-0.0059318999999999995
705,-0.0018369
706,0.0041881
707,0.011581000000000001
708,0.018977
709,0.026918
710,0.036781
711,0.040339
712,0.041997
713,0.048037
714,0.057887
715,0.065275
716,0.07322200000000001
717,0.08061
718,0.090465
719,0.097856
720,0.10142999999999999
721,0.10445
722,0.10937000000000001
723,0.11675999999999999
724,0.12415
725,0.13209
726,0.14004
727,0.14854
728,0.14854
729,0.151
730,0.15839
731,0.16332
732,0.16577999999999998
733,0.17071
734,0.1781
735,0.18796
736,0.19535
737,0.20275
738,0.21069000000000002
739,0.22055
740,0.22795
741,0.23534000000000002
742,0.24274
743,0.24739
744,0.24905
745,0.25644
746,0.26383
747,0.27423000000000003
748,0.28163
749,0.28711
750,0.29124
751,0.29538000000000003
752,0.30276
753,0.31015
754,0.31754
755,0.32739
756,0.33476999999999996
757,0.34215999999999996
758,0.34955
759,0.35448
760,0.35695
761,0.36186999999999997
762,0.36927
763,0.37173
764,0.37419
765,0.38159
766,0.38898
767,0.39884000000000003
768,0.40624
769,0.41418
770,0.42158
771,0.43144
772,0.43883999999999995
773,0.44623999999999997
774,0.44978999999999997
775,0.45443999999999996
776,0.45992
777,0.46731000000000006
778,0.4747
779,0.48456000000000005
780,0.49196000000000006
781,0.49936
782,0.50675
783,0.51415
784,0.5240199999999999
785,0.53142
786,0.53882
787,0.5462199999999999
788,0.55609
789,0.5634899999999999
790,0.5709
791,0.5783
792,0.58818
793,0.59558
794,0.60352
795,0.61092
796,0.6208
797,0.62821
798,0.63562
799,0.64303
800,0.65291
801,0.66032
802,0.66773
803,0.67514
804,0.68503
805,0.69245
806,0.69986
807,0.70728
808,0.71716
809,0.72458
810,0.732
811,0.73942
812,0.74931
813,0.75178
814,0.75426
815,0.7592
816,0.76961
817,0.7750600000000001
818,0.77804
819,0.7835
820,0.7939
821,0.80183
822,0.80976
823,0.81223
824,0.8147
825,0.81965
826,0.8270700000000001
827,0.83449
828,0.8443799999999999
829,0.8518
830,0.8592200000000001
831,0.86665
832,0.87654
833,0.8839600000000001
834,0.89139
835,0.89881
836,0.9087200000000001
837,0.91366
838,0.91564
839,0.91812
840,0.92555
841,0.9329799999999999
842,0.9404
843,0.94783
844,0.95031
845,0.95526
846,0.9607100000000001
847,0.96814
848,0.97557
849,0.9854799999999999
850,0.9929100000000001
851,1.0003
852,1.0078
853,1.0177
854,1.0251
855,1.0326
856,1.04
857,1.0499
858,1.0544
859,1.053
860,1.054
861,1.0639
862,1.0714
863,1.0788
864,1.0863
865,1.0962
866,1.1037
867,1.1111
868,1.1185
869,1.1285
870,1.1359
871,1.1434
872,1.1468
873,1.1511
874,1.1565
875,1.1640000000000001
876,1.1714
877,1.1814
878,1.1888
879,1.1963
880,1.2037
881,1.2136
882,1.2211
883,1.2285
884,1.2329999999999999
885,1.2337
886,1.2378
887,1.2452
888,1.2522
889,1.2622
890,1.2696
891,1.2683
892,1.2670000000000001
893,1.2653
894,1.264
895,1.2627
896,1.2615
897,1.2598
898,1.2586
899,1.2574
900,1.2562
901,1.2546
902,1.2535
903,1.2477
904,1.2402
905,1.2328
906,1.2228
907,1.2153
908,1.2078
909,1.1999
910,1.1899
911,1.1825
912,1.175
913,1.1675
914,1.1575
915,1.155
916,1.1525
917,1.1471
918,1.1364
919,1.1285
920,1.1281
921,1.1252
922,1.1149
923,1.1124
924,1.1099
925,1.1049
926,1.0949
927,1.087
928,1.0796
929,1.0721
930,1.068
931,1.0673
932,1.0594
933,1.0519
934,1.0419
935,1.0345
936,1.0270000000000001
937,1.0195
938,1.0091
939,1.0016
940,0.9941399999999999
941,0.98665
942,0.9766600000000001
943,0.9691700000000001
944,0.9659200000000001
945,0.9647899999999999
946,0.95655
947,0.94906
948,0.94157
949,0.9340799999999999
950,0.92371
951,0.91622
952,0.9087299999999999
953,0.90549
954,0.9015200000000001
955,0.8961600000000001
956,0.88866
957,0.8808
958,0.8708
959,0.86331
960,0.86331
961,0.86045
962,0.85009
963,0.8422299999999999
964,0.8368700000000001
965,0.8343700000000001
966,0.82937
967,0.8218799999999999
968,0.8193799999999999
969,0.81688
970,0.80938
971,0.7993899999999999
972,0.79689
973,0.7965300000000001
974,0.79366
975,0.7833100000000001
976,0.78081
977,0.7783100000000001
978,0.77081
979,0.7608199999999999
980,0.75332
981,0.7458199999999999
982,0.73833
983,0.72797
984,0.72048
985,0.7129800000000001
986,0.70549
987,0.69976
988,0.69617
989,0.69296
990,0.6854600000000001
991,0.6754600000000001
992,0.66796
993,0.66046
994,0.6529699999999999
995,0.64261
996,0.6351100000000001
997,0.62761
998,0.62012
999,0.61012
1000,0.60263
1001,0.5969
1002,0.59333
1003,0.58763
1004,0.58012
1005,0.57262
1006,0.56512
1007,0.55477
1008,0.54727
1009,0.53977
1010,0.53441
1011,0.53051
1012,0.52732
1013,0.51982
1014,0.51231
1015,0.5019600000000001
1016,0.49446
1017,0.49127
1018,0.48776
1019,0.47958
1020,0.47207
1021,0.46456000000000003
1022,0.45705
1023,0.44703999999999994
1024,0.43953000000000003
1025,0.43203
1026,0.42452
1027,0.41701000000000005
1028,0.40667
1029,0.39916
1030,0.39165
1031,0.38415
1032,0.37414000000000003
1033,0.36663
1034,0.35913
1035,0.35163
1036,0.3481
1037,0.34459
1038,0.33925
1039,0.33174000000000003
1040,0.3214
1041,0.31389
1042,0.30638000000000004
1043,0.30539
1044,0.3016
1045,0.29408
1046,0.28657
1047,0.27905
1048,0.26904
1049,0.26152
1050,0.25401
1051,0.2465
1052,0.23648000000000002
1053,0.22865
1054,0.22113000000000002
1055,0.21361999999999998
1056,0.20360999999999999
1057,0.1961
1058,0.18859
1059,0.18358
1060,0.17977
1061,0.17663
1062,0.1688
1063,0.16128
1064,0.15125999999999998
1065,0.14375
1066,0.13623
1067,0.12872
1068,0.1187
1069,0.11087000000000001
1070,0.10335
1071,0.095841
1072,0.08582100000000001
1073,0.07831
1074,0.070798
1075,0.063286
1076,0.060780999999999995
1077,0.057953
1078,0.05262000000000001
1079,0.044785000000000005
1080,0.034448
1081,0.03413
1082,0.031307
1083,0.025981
1084,0.018463999999999998
1085,0.01596
1086,0.013455000000000002
1087,0.0059381
1088,-0.0018919
1089,-0.011914
1090,-0.019428
1091,-0.022875
1092,-0.026304
1093,-0.034129
1094,-0.041951
1095,-0.047266
1096,-0.048155
1097,-0.05404400000000001
1098,-0.061855999999999994
1099,-0.06715800000000001
1100,-0.06800199999999999
1101,-0.06882200000000001
1102,-0.069093
1103,-0.069358
1104,-0.070146
1105,-0.070406
1106,-0.070406
1107,-0.065381
1108,-0.057844000000000007
1109,-0.048049
1110,-0.040514999999999995
1111,-0.032975
1112,-0.025438
1113,-0.015387999999999999
1114,-0.013371000000000001
1115,-0.014096000000000001
1116,-0.012055
1117,-0.0019979
1118,0.0053141
1119,0.012856
1120,0.020401
1121,0.024975999999999998
1122,0.02683
1123,0.03143
1124,0.038768000000000004
1125,0.043384
1126,0.045295
1127,0.044900999999999996
1128,0.052453
1129,0.062526
1130,0.069886
1131,0.07743799999999999
1132,0.084993
1133,0.095065
1134,0.10243
1135,0.1044
1136,0.10387
1137,0.11395
1138,0.1215
1139,0.12905999999999998
1140,0.13662
1141,0.14669000000000001
1142,0.15425
1143,0.16180999999999998
1144,0.16937
1145,0.17693
1146,0.17995999999999998
1147,0.1805
1148,0.18572
1149,0.19327
1150,0.20335
1151,0.2109
1152,0.21846
1153,0.22601
1154,0.23609000000000002
1155,0.24364
1156,0.2512
1157,0.25875
1158,0.26883
1159,0.27638
1160,0.28394
1161,0.28394
1162,0.28646
1163,0.29384
1164,0.2987
1165,0.30105
1166,0.30609000000000003
1167,0.31365
1168,0.3212
1169,0.32389
1170,0.32659
1171,0.33432
1172,0.33935
1173,0.34187
1174,0.34943
1175,0.35699000000000003
1176,0.36455
1177,0.3721
1178,0.38218
1179,0.38974000000000003
1180,0.39729000000000003
1181,0.40485
1182,0.41493
1183,0.42249
1184,0.43005
1185,0.4376
1186,0.44768
1187,0.45524
1188,0.46296000000000004
1189,0.47035
1190,0.4806
1191,0.48816000000000004
1192,0.49572
1193,0.50327
1194,0.51335
1195,0.52091
1196,0.52847
1197,0.53603
1198,0.5461
1199,0.55366
1200,0.5612199999999999
1201,0.5687800000000001
1202,0.57886
1203,0.5864199999999999
1204,0.5939800000000001
1205,0.60154
1206,0.6091
1207,0.6191800000000001
1208,0.62674
1209,0.6343
1210,0.64185
1211,0.65177
1212,0.65933
1213,0.66689
1214,0.67445
1215,0.68453
1216,0.69209
1217,0.69981
1218,0.70721
1219,0.71745
1220,0.72501
1221,0.7325699999999999
1222,0.7401300000000001
1223,0.75021
1224,0.75762
1225,0.76518
1226,0.77274
1227,0.78282
1228,0.79038
1229,0.79794
1230,0.80535
1231,0.80995
1232,0.81247
1233,0.8200299999999999
1234,0.8276
1235,0.83768
1236,0.84524
1237,0.8526600000000001
1238,0.86008
1239,0.8624700000000001
1240,0.86751
1241,0.8750700000000001
1242,0.88264
1243,0.8876799999999999
1244,0.8902
1245,0.8927200000000001
1246,0.90028
1247,0.9103700000000001
1248,0.9179299999999999
1249,0.9255
1250,0.93306
1251,0.94315
1252,0.95071
1253,0.9582799999999999
1254,0.9658399999999999
1255,0.97593
1256,0.98349
1257,0.99106
1258,0.9986200000000001
1259,1.0087
1260,1.0163
1261,1.0238
1262,1.0242
1263,1.0248
1264,1.0252
1265,1.0282
1266,1.0284
1267,1.0284
1268,1.0284
1269,1.0359
1270,1.0435
1271,1.0511
1272,1.0511
1273,1.0511
1274,1.0507
1275,1.0503
1276,1.0522
1277,1.0518
1278,1.0516
1279,1.0591
1280,1.0692
1281,1.0768
1282,1.0844
1283,1.0919
1284,1.102
1285,1.1094
1286,1.117
1287,1.1246
1288,1.1348
1289,1.1424
1290,1.1499
1291,1.1575
1292,1.1674
1293,1.175
1294,1.1826
1295,1.1901
1296,1.2002
1297,1.2078
1298,1.2154
1299,1.2229
1300,1.2329999999999999
1301,1.2406
1302,1.2481
1303,1.2507
1304,1.2532
1305,1.2608
1306,1.2658
1307,1.2683
1308,1.2708
1309,1.2784
1310,1.286
1311,1.2935
1312,1.3036
1313,1.3112
1314,1.3188
1315,1.3263
1316,1.3311
1317,1.3333
1318,1.3356
1319,1.3432
1320,1.3533
1321,1.3608
1322,1.3684
1323,1.376
1324,1.3861
1325,1.3936
1326,1.4012
1327,1.4088
1328,1.4163
1329,1.4265
1330,1.4294
1331,1.4323
1332,1.4373
1333,1.4474
1334,1.455
1335,1.4625
1336,1.4701
1337,1.4802
1338,1.4877
1339,1.4953
1340,1.5029
1341,1.5130000000000001
1342,1.5126
1343,1.5148
1344,1.5198
1345,1.5297
1346,1.5319999999999998
1347,1.5342
1348,1.5339
1349,1.5336
1350,1.5334
1351,1.5333
1352,1.5333
1353,1.5330000000000001
1354,1.5328
1355,1.5326
1356,1.5326
1357,1.5324
1358,1.5323
1359,1.5296
1360,1.5294
1361,1.5292
1362,1.5216
1363,1.514
1364,1.5114
1365,1.5087
1366,1.5037
1367,1.4961
1368,1.4885
1369,1.4784
1370,1.4708
1371,1.4682
1372,1.4681
1373,1.4605
1374,1.4529
1375,1.4454
1376,1.4378
1377,1.4277
1378,1.4201
1379,1.4125
1380,1.4049
1381,1.3948
1382,1.3873
1383,1.3797
1384,1.3721
1385,1.3695
1386,1.3695
1387,1.3669
1388,1.3669
1389,1.3669
1390,1.3568
1391,1.3492
1392,1.3417
1393,1.3341
1394,1.3291
1395,1.3266
1396,1.3215
1397,1.314
1398,1.3039
1399,1.2963
1400,1.2887
1401,1.2811
1402,1.271
1403,1.2635
1404,1.2559
1405,1.2483
1406,1.2382
1407,1.2306
1408,1.2231
1409,1.2155
1410,1.2054
1411,1.1978
1412,1.1902
1413,1.1827
1414,1.1726
1415,1.1675
1416,1.165
1417,1.1625
1418,1.1524
1419,1.1448
1420,1.1423
1421,1.1398
1422,1.1322
1423,1.1247
1424,1.1171
1425,1.1096
1426,1.1045
1427,1.1045
1428,1.097
1429,1.0894
1430,1.0793
1431,1.0717
1432,1.0641
1433,1.0566
1434,1.0465
1435,1.0389
1436,1.0313
1437,1.0238
1438,1.0137
1439,1.0061
1440,0.9985
1441,0.99093
1442,0.98083
1443,0.9732799999999999
1444,0.9657100000000001
1445,0.9581299999999999
1446,0.9505600000000001
1447,0.9404600000000001
1448,0.9328799999999999
1449,0.9253100000000001
1450,0.9254100000000001
1451,0.92051
1452,0.91294
1453,0.9053700000000001
1454,0.8978299999999999
1455,0.88774
1456,0.8853
1457,0.8827799999999999
1458,0.8777299999999999
1459,0.8676299999999999
1460,0.86011
1461,0.8525799999999999
1462,0.84506
1463,0.8400700000000001
1464,0.8376
1465,0.83255
1466,0.8249799999999999
1467,0.8249799999999999
1468,0.82245
1469,0.81488
1470,0.8073100000000001
1471,0.7972100000000001
1472,0.78964
1473,0.7820600000000001
1474,0.77449
1475,0.76439
1476,0.7568199999999999
1477,0.74925
1478,0.74173
1479,0.73158
1480,0.7240000000000001
1481,0.71643
1482,0.70886
1483,0.69876
1484,0.69119
1485,0.68362
1486,0.67604
1487,0.66594
1488,0.65837
1489,0.6508
1490,0.64323
1491,0.63313
1492,0.62556
1493,0.61798
1494,0.61041
1495,0.60031
1496,0.5927399999999999
1497,0.58517
1498,0.5775899999999999
1499,0.5675
1500,0.55992
1501,0.5524100000000001
1502,0.54484
1503,0.53474
1504,0.52717
1505,0.5196
1506,0.51203
1507,0.50445
1508,0.49954
1509,0.49954
1510,0.49449
1511,0.48691999999999996
1512,0.47696000000000005
1513,0.46946000000000004
1514,0.46197
1515,0.457
1516,0.45447
1517,0.44943
1518,0.44185
1519,0.44185
1520,0.43933
1521,0.43176000000000003
1522,0.42418999999999996
1523,0.41662
1524,0.40652
1525,0.39895
1526,0.39138
1527,0.38389
1528,0.3738
1529,0.36623
1530,0.35865
1531,0.35108
1532,0.34099
1533,0.33342
1534,0.32585
1535,0.31828
1536,0.30818
1537,0.30061
1538,0.30078
1539,0.29825999999999997
1540,0.28817
1541,0.2806
1542,0.27303
1543,0.26546
1544,0.25536
1545,0.25284
1546,0.25014000000000003
1547,0.24256999999999998
1548,0.23246999999999998
1549,0.2249
1550,0.21733000000000002
1551,0.20976
1552,0.19967000000000001
1553,0.1921
1554,0.18453
1555,0.17695999999999998
1556,0.16677999999999998
1557,0.15921
1558,0.15164
1559,0.14406
1560,0.13397
1561,0.1264
1562,0.11882999999999999
1563,0.11377999999999999
1564,0.11126
1565,0.10620999999999998
1566,0.09864099999999999
1567,0.096118
1568,0.093593
1569,0.083501
1570,0.075931
1571,0.068449
1572,0.060878999999999996
1573,0.058738
1574,0.059049000000000004
1575,0.059377
1576,0.05720599999999999
1577,0.049883
1578,0.042316
1579,0.037399
1580,0.037399
1581,0.037528
1582,0.037925
1583,0.038341
1584,0.038778
1585,0.039235
1586,0.039235
1587,0.041755
1588,0.049471
1589,0.059551
1590,0.067114
1591,0.074674
1592,0.080029
1593,0.083203
1594,0.088412
1595,0.09614099999999999
1596,0.1017
1597,0.10747000000000001
1598,0.11502000000000001
1599,0.12276
1600,0.13032
1601,0.14057999999999998
1602,0.14347000000000001
1603,0.14658
1604,0.15433
1605,0.1644
1606,0.17195
1607,0.1795
1608,0.18705
1609,0.19712000000000002
1610,0.20486999999999997
1611,0.21241999999999997
1612,0.21996999999999997
1613,0.23004000000000002
1614,0.23759
1615,0.24515
1616,0.2527
1617,0.26277
1618,0.27032
1619,0.27787
1620,0.28543
1621,0.28873000000000004
1622,0.28935
1623,0.2969
1624,0.30445
1625,0.31451
1626,0.32206
1627,0.32961
1628,0.33716
1629,0.34471
1630,0.35478000000000004
1631,0.36233000000000004
1632,0.36988000000000004
1633,0.37743000000000004
1634,0.38247
1635,0.38498000000000004
1636,0.39002
1637,0.39757
1638,0.40764
1639,0.41015
1640,0.41015
1641,0.4179
1642,0.42796999999999996
1643,0.42858
1644,0.43173
1645,0.43696999999999997
1646,0.44703999999999994
1647,0.45458999999999994
1648,0.46213000000000004
1649,0.46968000000000004
1650,0.47975
1651,0.48728999999999995
1652,0.49483999999999995
1653,0.50239
1654,0.51246
1655,0.5200100000000001
1656,0.52756
1657,0.5351100000000001
1658,0.5451699999999999
1659,0.55272
1660,0.56048
1661,0.56803
1662,0.57789
1663,0.58544
1664,0.59319
1665,0.60054
1666,0.6108100000000001
1667,0.61836
1668,0.62571
1669,0.63325
1670,0.64353
1671,0.65108
1672,0.65863
1673,0.66618
1674,0.67625
1675,0.6838
1676,0.69135
1677,0.6989
1678,0.70897
1679,0.7118899999999999
1680,0.71502
1681,0.7204699999999999
1682,0.73054
1683,0.7380800000000001
1684,0.74563
1685,0.7531800000000001
1686,0.76094
1687,0.7710100000000001
1688,0.77855
1689,0.7861
1690,0.79386
1691,0.79723
1692,0.80019
1693,0.8077300000000001
1694,0.81528
1695,0.82534
1696,0.83311
1697,0.84065
1698,0.8482
1699,0.85826
1700,0.8658100000000001
1701,0.87335
1702,0.8765299999999999
1703,0.87995
1704,0.88749
1705,0.89504
1706,0.9025799999999999
1707,0.91264
1708,0.9201799999999999
1709,0.9277299999999999
1710,0.9355
1711,0.9455600000000001
1712,0.9531
1713,0.96065
1714,0.96819
1715,0.97825
1716,0.97893
1717,0.98214
1718,0.9848899999999999
1719,0.99495
1720,1.0025
1721,1.01
1722,1.0178
1723,1.0279
1724,1.0354
1725,1.0407
1726,1.0439
1727,1.0471
1728,1.0547
1729,1.0622
1730,1.0698
1731,1.0798
1732,1.0876
1733,1.0951
1734,1.1027
1735,1.1127
1736,1.1203
1737,1.1233
1738,1.1265
1739,1.1321
1740,1.1396
1741,1.1471
1742,1.1547
1743,1.1647
1744,1.1725
1745,1.18
1746,1.1876
1747,1.1951
1748,1.2052
1749,1.2052
1750,1.2077
1751,1.2127
1752,1.2202
1753,1.2228
1754,1.2255
1755,1.2308
1756,1.2411
1757,1.2489
1758,1.2564
1759,1.264
1760,1.2665
1761,1.2670000000000001
1762,1.2703
1763,1.2711
1764,1.2744
1765,1.2819
1766,1.2894
1767,1.297
1768,1.3073
1769,1.3148
1770,1.3223
1771,1.3299
1772,1.3399
1773,1.3474
1774,1.3505
1775,1.3538
1776,1.3594
1777,1.3669
1778,1.3747
1779,1.3822
1780,1.3923
1781,1.3931
1782,1.3940000000000001
1783,1.3973
1784,1.3985
1785,1.3991
1786,1.3994
1787,1.3994
1788,1.4003
1789,1.4012
1790,1.4021
1791,1.4021
1792,1.4028
1793,1.4037
1794,1.4047
1795,1.4031
1796,1.4045
1797,1.3998
1798,1.3923
1799,1.3848
1800,1.3748
1801,1.3676
1802,1.3601
1803,1.3526
1804,1.3486
1805,1.3472
1806,1.3425
1807,1.3354
1808,1.3307
1809,1.3322
1810,1.3308
1811,1.3319
1812,1.3330000000000002
1813,1.3259
1814,1.3184
1815,1.3109
1816,1.3034
1817,1.2938
1818,1.2863
1819,1.2788
1820,1.2763
1821,1.2738
1822,1.2663
1823,1.2589
1824,1.2514
1825,1.2497
1826,1.2476
1827,1.2405
1828,1.2334
1829,1.2238
1830,1.2188
1831,1.2163
1832,1.2138
1833,1.2088
1834,1.2014
1835,1.1939
1836,1.1864
1837,1.1764
1838,1.1689
1839,1.1615
1840,1.1540000000000001
1841,1.1499
1842,1.1474
1843,1.1399
1844,1.1324
1845,1.1225
1846,1.115
1847,1.1071
1848,1.0992
1849,1.0942
1850,1.0942
1851,1.0868
1852,1.0793
1853,1.0718
1854,1.0693
1855,1.0668
1856,1.0594
1857,1.0494
1858,1.0419
1859,1.0344
1860,1.0270000000000001
1861,1.0170000000000001
1862,1.0091
1863,1.0016
1864,0.99415
1865,0.98419
1866,0.9771299999999999
1867,0.9696600000000001
1868,0.9621799999999999
1869,0.9547100000000001
1870,0.94475
1871,0.9372799999999999
1872,0.92981
1873,0.9223399999999999
1874,0.9173600000000001
1875,0.9148700000000001
1876,0.9128
1877,0.90576
1878,0.89623
1879,0.89417
1880,0.89212
1881,0.8896299999999999
1882,0.8796799999999999
1883,0.8792399999999999
1884,0.8763200000000001
1885,0.8684299999999999
1886,0.8584799999999999
1887,0.8535
1888,0.8535
1889,0.85145
1890,0.84193
1891,0.83491
1892,0.82789
1893,0.8204299999999999
1894,0.81794
1895,0.81297
1896,0.80552
1897,0.79806
1898,0.7881199999999999
1899,0.78066
1900,0.7732100000000001
1901,0.76575
1902,0.75581
1903,0.7549100000000001
1904,0.7511
1905,0.74569
1906,0.73574
1907,0.72828
1908,0.72082
1909,0.71337
1910,0.7034199999999999
1911,0.69552
1912,0.68807
1913,0.68061
1914,0.67067
1915,0.66322
1916,0.65576
1917,0.64831
1918,0.63837
1919,0.63092
1920,0.62347
1921,0.61602
1922,0.6060800000000001
1923,0.59863
1924,0.59118
1925,0.58373
1926,0.5738
1927,0.56995
1928,0.5685899999999999
1929,0.5606800000000001
1930,0.55323
1931,0.5432899999999999
1932,0.53584
1933,0.5283899999999999
1934,0.52094
1935,0.511
1936,0.50355
1937,0.4961
1938,0.49748000000000003
1939,0.49438999999999994
1940,0.48695
1941,0.47951000000000005
1942,0.47207
1943,0.46215
1944,0.45471000000000006
1945,0.44727
1946,0.43983
1947,0.42991999999999997
1948,0.42248
1949,0.41503999999999996
1950,0.40761
1951,0.3977
1952,0.39026
1953,0.38283
1954,0.3754
1955,0.36549
1956,0.35806
1957,0.35063
1958,0.3432
1959,0.33329000000000003
1960,0.32587
1961,0.31844
1962,0.31349
1963,0.31349
1964,0.30606
1965,0.29864
1966,0.29120999999999997
1967,0.28081
1968,0.28031
1969,0.27734000000000003
1970,0.26941
1971,0.25951
1972,0.25209000000000004
1973,0.24466
1974,0.23724
1975,0.23476
1976,0.23129
1977,0.22584
1978,0.21841
1979,0.20851
1980,0.20109000000000002
1981,0.19366
1982,0.18624000000000002
1983,0.17635
1984,0.16892000000000001
1985,0.16151
1986,0.15408
1987,0.14615999999999998
1988,0.13627
1989,0.12885
1990,0.12143
1991,0.11400999999999999
1992,0.10413
1993,0.096709
1994,0.09424
1995,0.09176799999999999
1996,0.084354
1997,0.07889299999999999
1998,0.075903
1999,0.075388
2000,0.064472
2001,0.056544000000000004
2002,0.051087
2003,0.048615
2004,0.046141
2005,0.038723
2006,0.031307
2007,0.023891
2008,0.014003
2009,0.0065891000000000005
2010,-0.00082393
2011,-0.0082379
2012,-0.018119999999999997
2013,-0.025531
2014,-0.03294
2015,-0.040348
2016,-0.050226
2017,-0.057634000000000005
2018,-0.06504
2019,-0.072443
2020,-0.082316
2021,-0.082316
2022,-0.084783
2023,-0.09164800000000001
2024,-0.10042999999999999
2025,-0.10480999999999999
2026,-0.10672999999999999
2027,-0.10864000000000001
2028,-0.11794
2029,-0.11794
2030,-0.1204
2031,-0.12779000000000001
2032,-0.13764
2033,-0.14558
2034,-0.15297
2035,-0.16035
2036,-0.16963
2037,-0.17701
2038,-0.18193
2039,-0.18439
2040,-0.18685
2041,-0.19422999999999999
2042,-0.19669
2043,-0.19914
2044,-0.20651999999999998
2045,-0.21389
2046,-0.22127
2047,-0.22864
2048,-0.23601
2049,-0.24584
2050,-0.25321
2051,-0.26056999999999997
2052,-0.26794
2053,-0.27776
2054,-0.28453
2055,-0.29189
2056,-0.29925
2057,-0.30906
2058,-0.31640999999999997
2059,-0.32377
2060,-0.33111999999999997
2061,-0.34093
2062,-0.34828000000000003
2063,-0.35256
2064,-0.35316
2065,-0.35372
2066,-0.36106
2067,-0.36776
2068,-0.37509000000000003
2069,-0.38486
2070,-0.38537
2071,-0.38585
2072,-0.39007
2073,-0.39982
2074,-0.40712
2075,-0.41376
2076,-0.42107
2077,-0.41905
2078,-0.41943
2079,-0.4236
2080,-0.43088999999999994
2081,-0.4406
2082,-0.44719
2083,-0.45446000000000003
2084,-0.46174
2085,-0.47143999999999997
2086,-0.47173000000000004
2087,-0.47200000000000003
2088,-0.47611000000000003
2089,-0.48578000000000005
2090,-0.4923
2091,-0.4923
2092,-0.4923
2093,-0.48935
2094,-0.48711000000000004
2095,-0.48485
2096,-0.48256000000000004
2097,-0.48256000000000004
2098,-0.47939
2099,-0.47708
2100,-0.47234
2101,-0.46436000000000005
2102,-0.45715
2103,-0.44995
2104,-0.44273999999999997
2105,-0.43235
2106,-0.42513999999999996
2107,-0.41791999999999996
2108,-0.41071
2109,-0.40349
2110,-0.3955
2111,-0.3908
2112,-0.38606999999999997
2113,-0.37886
2114,-0.36925
2115,-0.36203
2116,-0.35481999999999997
2117,-0.34683
2118,-0.33721
2119,-0.32999
2120,-0.32276
2121,-0.31554
2122,-0.31085
2123,-0.30615
2124,-0.30056
2125,-0.29335
2126,-0.28373000000000004
2127,-0.27651
2128,-0.26852
2129,-0.2613
2130,-0.25167
2131,-0.24444000000000002
2132,-0.23722
2133,-0.22923000000000002
2134,-0.22379000000000002
2135,-0.21986
2136,-0.21264
2137,-0.20542
2138,-0.19502
2139,-0.1878
2140,-0.18058
2141,-0.17335
2142,-0.16460999999999998
2143,-0.15992
2144,-0.15839
2145,-0.15117
2146,-0.14155
2147,-0.13432
2148,-0.1271
2149,-0.11987
2150,-0.10948
2151,-0.10225
2152,-0.095024
2153,-0.087793
2154,-0.07814700000000001
2155,-0.070911
2156,-0.063674
2157,-0.056435
2158,-0.046779
2159,-0.039535
2160,-0.032291
2161,-0.027458
2162,-0.022090000000000002
2163,-0.015030000000000002
2164,-0.0077929
2165,-0.00055593
2166,0.0090991
2167,0.016341
2168,0.024322
2169,0.031567000000000005
2170,0.038813
2171,0.048477
2172,0.055726
2173,0.059609
2174,0.064235
2175,0.07295900000000001
2176,0.080201
2177,0.08744199999999999
2178,0.095427
2179,0.10507999999999999
2180,0.11233
2181,0.11957999999999999
2182,0.1242
2183,0.12958
2184,0.13682
2185,0.14406
2186,0.15204
2187,0.1617
2188,0.16727
2189,0.17190999999999998
2190,0.17656
2191,0.18621
2192,0.19344
2193,0.20068
2194,0.20792
2195,0.21832
2196,0.22555999999999998
2197,0.23113000000000003
2198,0.23576999999999998
2199,0.24284
2200,0.25082
2201,0.25715
2202,0.26182
2203,0.26575
2204,0.27297
2205,0.28096
2206,0.28818
2207,0.29782
2208,0.30174
2209,0.30643000000000004
2210,0.30796999999999997
2211,0.31759
2212,0.32556999999999997
2213,0.33028
2214,0.3326
2215,0.34376
2216,0.35175
2217,0.35649000000000003
2218,0.35884
2219,0.36922
2220,0.37401999999999996
2221,0.37878
2222,0.38356
2223,0.38915
2224,0.39713000000000004
2225,0.40271999999999997
2226,0.40751
2227,0.41471
2228,0.42268999999999995
2229,0.42828
2230,0.43071000000000004
2231,0.43315
2232,0.43642
2233,0.44128
2234,0.44377
2235,0.44627
2236,0.44878999999999997
2237,0.44964
2238,0.44964
2239,0.45218
2240,0.45558999999999994
2241,0.4573
2242,0.45816
2243,0.45902
2244,0.46248999999999996
2245,0.4651
2246,0.46774
2247,0.46802
2248,0.47157
2249,0.47426
2250,0.47368999999999994
2251,0.46752
2252,0.46045
2253,0.46318000000000004
2254,0.46356
2255,0.4607
2256,0.4513
2257,0.4508
2258,0.44845
2259,0.44376000000000004
2260,0.43437
2261,0.42827
2262,0.42217
2263,0.41608999999999996
2264,0.4133
2265,0.41096000000000005
2266,0.40862
2267,0.4016
2268,0.39926
2269,0.39692
2270,0.39225
2271,0.38524
2272,0.37493000000000004
2273,0.36791999999999997
2274,0.36091999999999996
2275,0.35391999999999996
2276,0.34459
2277,0.33759
2278,0.33469
2279,0.32947
2280,0.32245999999999997
2281,0.31546
2282,0.30846
2283,0.30146
2284,0.29214
2285,0.28515
2286,0.27816
2287,0.27116999999999997
2288,0.26419000000000004
2289,0.25488
2290,0.2479
2291,0.24093
2292,0.23396
2293,0.22466999999999998
2294,0.2177
2295,0.20974
2296,0.20278
2297,0.19351
2298,0.18655
2299,0.1796
2300,0.17265
2301,0.16339
2302,0.15645
2303,0.14951
2304,0.14619000000000001
2305,0.13852
2306,0.13389
2307,0.12696
2308,0.12002
2309,0.11077999999999999
2310,0.10385
2311,0.09692100000000001
2312,0.08999800000000001
2313,0.08871799999999999
2314,0.090781
2315,0.084905
2316,0.077999
2317,0.06879500000000001
2318,0.061897
2319,0.055004
2320,0.04811
2321,0.038926999999999996
2322,0.032044
2323,0.025166
2324,0.018288
2325,0.0091241
2326,0.0022561
2327,-0.0046069
2328,-0.011470000000000001
2329,-0.02061
2330,-0.027462999999999998
2331,-0.034312999999999996
2332,-0.041158999999999994
2333,-0.050279000000000004
2334,-0.057116999999999994
2335,-0.063949
2336,-0.07077699999999999
2337,-0.079877
2338,-0.086697
2339,-0.094615
2340,-0.10019
2341,-0.10802
2342,-0.11485
2343,-0.12167
2344,-0.12849000000000002
2345,-0.13868
2346,-0.14549
2347,-0.1523
2348,-0.15684
2349,-0.1591
2350,-0.16364
2351,-0.17155
2352,-0.17493
2353,-0.17604
2354,-0.18622
2355,-0.19413
2356,-0.19977999999999999
2357,-0.20315999999999998
2358,-0.20769
2359,-0.21449000000000001
2360,-0.22128
2361,-0.22807
2362,-0.23711
2363,-0.24389
2364,-0.25179
2365,-0.25856
2366,-0.26758000000000004
2367,-0.27434000000000003
2368,-0.2811
2369,-0.28785
2370,-0.29464
2371,-0.30032
2372,-0.3071
2373,-0.31386
2374,-0.32287
2375,-0.32961999999999997
2376,-0.33636
2377,-0.3431
2378,-0.35324
2379,-0.35996999999999996
2380,-0.3667
2381,-0.37342
2382,-0.38238
2383,-0.38909
2384,-0.3958
2385,-0.4025
2386,-0.41036999999999996
2387,-0.41391000000000006
2388,-0.41966000000000003
2389,-0.42636999999999997
2390,-0.43531000000000003
2391,-0.44201
2392,-0.4487
2393,-0.45538999999999996
2394,-0.46431000000000006
2395,-0.47098
2396,-0.47885
2397,-0.48552
2398,-0.49441
2399,-0.5010600000000001
2400,-0.50771
2401,-0.51436
2402,-0.5232100000000001
2403,-0.52985
2404,-0.53647
2405,-0.54309
2406,-0.55191
2407,-0.55852
2408,-0.56512
2409,-0.57172
2410,-0.57831
2411,-0.58328
2412,-0.58919
2413,-0.5958
2414,-0.6024
2415,-0.61119
2416,-0.6177699999999999
2417,-0.62435
2418,-0.63218
2419,-0.64094
2420,-0.64751
2421,-0.6540600000000001
2422,-0.66061
2423,-0.6693399999999999
2424,-0.67715
2425,-0.68315
2426,-0.68914
2427,-0.69787
2428,-0.7044100000000001
2429,-0.71223
2430,-0.7187600000000001
2431,-0.72746
2432,-0.73397
2433,-0.7408899999999999
2434,-0.74692
2435,-0.75384
2436,-0.76036
2437,-0.76688
2438,-0.7733899999999999
2439,-0.78335
2440,-0.78985
2441,-0.7963399999999999
2442,-0.80197
2443,-0.80934
2444,-0.81409
2445,-0.8206
2446,-0.82709
2447,-0.83704
2448,-0.84352
2449,-0.85
2450,-0.85646
2451,-0.8620899999999999
2452,-0.86819
2453,-0.87644
2454,-0.8829100000000001
2455,-0.89285
2456,-0.89931
2457,-0.90576
2458,-0.9118799999999999
2459,-0.9193
2460,-0.92361
2461,-0.9300700000000001
2462,-0.93653
2463,-0.94645
2464,-0.95289
2465,-0.9593299999999999
2466,-0.96575
2467,-0.97405
2468,-0.98019
2469,-0.9858100000000001
2470,-0.99225
2471,-1.0
2472,-1.0086
2473,-1.0128
2474,-1.0190000000000001
2475,-1.0252
2476,-1.0308
2477,-1.0386
2478,-1.045
2479,-1.0514
2480,-1.0613
2481,-1.0675
2482,-1.0736
2483,-1.08
2484,-1.0886
2485,-1.0963
2486,-1.1027
2487,-1.1091
2488,-1.1176
2489,-1.1211
2490,-1.1273
2491,-1.1356
2492,-1.1442
2493,-1.1519
2494,-1.1583
2495,-1.1646
2496,-1.1708
2497,-1.1771
2498,-1.1827
2499,-1.1891
2500,-1.1989
2501,-1.2053
2502,-1.2095
2503,-1.2157
2504,-1.2233
2505,-1.2297
2506,-1.2361
2507,-1.2438
2508,-1.2522
2509,-1.2578
2510,-1.262
2511,-1.2682
2512,-1.2781
2513,-1.2858
2514,-1.2899
2515,-1.2962
2516,-1.3047
2517,-1.3124
2518,-1.3187
2519,-1.3251
2520,-1.3334
2521,-1.3397
2522,-1.3432
2523,-1.3495
2524,-1.3594
2525,-1.3657
2526,-1.3719999999999999
2527,-1.3783
2528,-1.3859
2529,-1.3937
2530,-1.4
2531,-1.4063
2532,-1.4125
2533,-1.4224
2534,-1.4301
2535,-1.4364
2536,-1.4427
2537,-1.4511
2538,-1.4574
2539,-1.4651
2540,-1.4728
2541,-1.4791
2542,-1.4853
2543,-1.4909999999999999
2544,-1.4987
2545,-1.507
2546,-1.5133
2547,-1.521
2548,-1.5287
2549,-1.5363
2550,-1.5425
2551,-1.5468
2552,-1.5545
2553,-1.5629
2554,-1.569
2555,-1.5725
2556,-1.5789
2557,-1.5888
2558,-1.5952
2559,-1.6016
2560,-1.6078
2561,-1.6175
2562,-1.6239
2563,-1.6302
2564,-1.6380000000000001
2565,-1.6465
2566,-1.6548
2567,-1.6589
2568,-1.6666
2569,-1.6751
2570,-1.6829
2571,-1.6892
2572,-1.6955
2573,-1.704
2574,-1.7082
2575,-1.7145
2576,-1.7207
2577,-1.7306
2578,-1.7369
2579,-1.7432
2580,-1.7494
2581,-1.7592
2582,-1.7655
2583,-1.7717
2584,-1.7779
2585,-1.7862
2586,-1.7911
2587,-1.7976
2588,-1.8046
2589,-1.8108
2590,-1.819
2591,-1.8252
2592,-1.8314
2593,-1.839
2594,-1.8471
2595,-1.8532
2596,-1.8593
2597,-1.8653
2598,-1.8734
2599,-1.8794
2600,-1.8845
2601,-1.8911
2602,-1.9002
2603,-1.9062
2604,-1.9121
2605,-1.9181
2606,-1.926
2607,-1.9319
2608,-1.9378
2609,-1.9453
2610,-1.9531
2611,-1.9589
2612,-1.9647
2613,-1.9705
2614,-1.9781
2615,-1.9838
2616,-1.9892
2617,-1.9961
2618,-2.0049
2619,-2.0106
2620,-2.0163
2621,-2.0219
2622,-2.0311
2623,-2.0367
2624,-2.0422
2625,-2.0478
2626,-2.0551
2627,-2.0605
2628,-2.0659
2629,-2.0713
2630,-2.0784
2631,-2.0837
2632,-2.0889
2633,-2.0941
2634,-2.101
2635,-2.1061
2636,-2.1112
2637,-2.1162
2638,-2.1229
2639,-2.1278
2640,-2.1327
2641,-2.1375
2642,-2.1443
2643,-2.1501
2644,-2.1576
2645,-2.1624
2646,-2.1688
2647,-2.1735
2648,-2.1781
2649,-2.1827
2650,-2.1873
2651,-2.1933
2652,-2.1997
2653,-2.2041
2654,-2.2085
2655,-2.2141
2656,-2.2183
2657,-2.2225
2658,-2.2265
2659,-2.2297
2660,-2.2336
2661,-2.2374
2662,-2.2412
2663,-2.2461
2664,-2.2497
2665,-2.2532
2666,-2.2477
2667,-2.2432
2668,-2.2442
2669,-2.2474
2670,-2.2506
2671,-2.2547
2672,-2.2576
2673,-2.2605
2674,-2.2633
2675,-2.267
2676,-2.2696
2677,-2.2721
2678,-2.2746
2679,-2.2777
2680,-2.28
2681,-2.2821
2682,-2.2842
2683,-2.2868
2684,-2.2887
2685,-2.2904
2686,-2.2921
2687,-2.2942
2688,-2.2957
2689,-2.2969999999999997
2690,-2.2983
2691,-2.2998
2692,-2.3008
2693,-2.3018
2694,-2.3026
2695,-2.3036
2696,-2.3042
2697,-2.3047
2698,-2.3026
2699,-2.3055
2700,-2.3056
2701,-2.3032
2702,-2.3057
2703,-2.3057
2704,-2.3057
2705,-2.3057
2706,-2.3057
2707,-2.3057
2708,-2.3057
