time,value
0,-0.99631
1,-0.99631
2,-0.99631
3,-0.99631
4,0.24989
5,1.3403
6,1.1845
7,1.0288
8,1.1845
9,1.0288
10,1.0288
11,1.0288
12,1.0288
13,0.8729899999999999
14,-0.52899
15,-0.99631
16,-0.99631
17,-0.99631
18,-0.99631
19,-0.99631
20,0.71721
21,1.3403
22,1.0288
23,1.0288
24,1.0288
25,-0.52899
26,-0.99631
27,-0.99631
28,-0.99631
29,-0.99631
30,-0.68476
31,1.4961
32,1.1845
33,1.0288
34,1.0288
35,-0.37321
36,-0.99631
37,-0.99631
38,-0.99631
39,-0.99631
40,-0.99631
41,-0.061661
42,1.4961
43,1.0288
44,1.0288
45,-0.37321
46,-0.99631
47,-0.99631
48,-0.99631
49,-0.99631
50,-0.99631
51,0.40565999999999997
52,1.3403
53,1.0288
54,1.0288
55,0.71721
56,-0.99631
57,-0.99631
58,-0.99631
59,-0.99631
60,-0.99631
61,-0.99631
62,1.4961
63,1.1845
64,1.0288
65,1.0288
66,0.24989
67,-0.99631
68,-0.99631
69,-0.99631
70,-0.99631
71,-0.99631
72,-0.21744000000000002
73,1.3403
74,1.1845
75,1.0288
76,1.0288
77,0.24989
78,-0.99631
79,-0.99631
80,-0.99631
81,-0.99631
82,-0.99631
83,0.71721
84,1.3403
85,1.0288
86,1.1845
87,1.0288
88,1.0288
89,0.8729899999999999
90,1.0288
91,-0.37321
92,-0.99631
93,-0.99631
94,-0.99631
95,-0.99631
