time,value
0,-0.29491
1,-0.29491
2,-0.29491
3,-0.29491
4,-0.29491
5,-0.29491
6,-0.29491
7,-0.29491
8,-0.29491
9,-0.29491
10,-0.29491
11,-0.29491
12,-0.29491
13,-0.29491
14,-0.29491
15,-0.29491
16,-0.29491
17,-0.29491
18,-0.29491
19,-0.29491
20,-0.29491
21,-0.29491
22,-0.29491
23,-0.29491
24,-0.29491
25,-0.29491
26,-0.29491
27,-0.29491
28,-0.29491
29,-0.29491
30,-0.29491
31,-0.29491
32,-0.29491
33,3.1522
34,2.022
35,-0.29491
36,-0.29491
37,0.77879
38,-0.29491
39,-0.29491
40,-0.29491
41,-0.29491
42,-0.29491
43,-0.29491
44,-0.29491
45,-0.29491
46,3.9999
47,-0.29491
48,-0.29491
49,-0.29491
50,-0.29491
51,-0.29491
52,-0.29491
53,-0.29491
54,-0.29491
55,-0.29491
56,-0.29491
57,-0.29491
58,-0.29491
59,-0.29491
60,-0.29491
61,-0.29491
62,-0.29491
63,-0.29491
64,-0.29491
65,2.9827
66,-0.29491
67,-0.29491
68,-0.29491
69,6.1473
70,-0.29491
71,1.4004
72,-0.29491
73,-0.29491
74,-0.29491
75,1.8525
76,1.8525
77,-0.29491
78,-0.29491
79,-0.29491
80,-0.29491
81,-0.29491
82,1.1744
83,-0.29491
84,-0.29491
85,-0.29491
86,-0.29491
87,-0.29491
88,-0.29491
89,-0.29491
90,-0.29491
91,-0.29491
92,-0.29491
93,-0.29491
94,-0.29491
95,-0.29491
