[<text>
<title>calstar inc &lt;csar.o&gt; year april 30 net</title>
<dateline>    edina, minn., june 18 -
    </dateline>shr primary 66 cts vs 1.17 dlrs
    shr diluted 66 cts vs 81 cts
    net 1,220,691 vs 1,302,999
    revs 13.7 mln vs 13.1 mln
    avg shrs primary 1,859,421 vs 1,112,400
    avg shrs diluted 1,859,421 vs 1,826,303
    note: latest net includes tax credits of 565,000 dlrs vs
620,000 dlrs.
 reuter
</text>]