time,value
0,2.0072
1,1.9873
2,1.9678
3,1.9319
4,1.901
5,1.8608
6,1.8159
7,1.7719999999999998
8,1.7284
9,1.6855
10,1.643
11,1.6002
12,1.558
13,1.5154
14,1.4734
15,1.4311
16,1.389
17,1.3473
18,1.3055
19,1.264
20,1.2225
21,1.1812
22,1.14
23,1.099
24,1.0581
25,1.0175
26,0.9768100000000001
27,0.93665
28,0.8966799999999999
29,0.8566600000000001
30,0.8170000000000001
31,0.77781
32,0.73834
33,0.69865
34,0.6593
35,0.6201300000000001
36,0.58011
37,0.5412100000000001
38,0.5025
39,0.46278
40,0.4244
41,0.38488
42,0.34623000000000004
43,0.30756
44,0.26838
45,0.22929000000000002
46,0.19030999999999998
47,0.15144000000000002
48,0.11332
49,0.075866
50,0.035563
51,-0.0028022
52,-0.041024
53,-0.079095
54,-0.11700999999999999
55,-0.15475
56,-0.19232
57,-0.2321
58,-0.26937
59,-0.30643000000000004
60,-0.3459
61,-0.38261
62,-0.41965
63,-0.45816999999999997
64,-0.49716000000000005
65,-0.5330199999999999
66,-0.57172
67,-0.60707
68,-0.64542
69,-0.68362
70,-0.7172
71,-0.75554
72,-0.78974
73,-0.82311
74,-0.85598
75,-0.8907200000000001
76,-0.92419
77,-0.95576
78,-0.9864200000000001
79,-1.0212
80,-1.0207
81,-1.0051
82,-0.9909399999999999
83,-0.9754200000000001
84,-0.9578
85,-0.94039
86,-0.91866
87,-0.89449
88,-0.8750100000000001
89,-0.8503799999999999
90,-0.82725
91,-0.79937
92,-0.77079
93,-0.74154
94,-0.71167
95,-0.68156
96,-0.65465
97,-0.62442
98,-0.5989300000000001
99,-0.5685399999999999
100,-0.54415
101,-0.51669
102,-0.49496
103,-0.48463999999999996
104,-0.50673
105,-0.51956
106,-0.53147
107,-0.56303
108,-0.6134
109,-0.66117
110,-0.69994
111,-0.74005
112,-0.78498
113,-0.8281700000000001
114,-0.87272
115,-0.9177200000000001
116,-0.96281
117,-1.0067
118,-1.0512
119,-1.0928
120,-1.1199
121,-1.1534
122,-1.1946
123,-1.2345
124,-1.2646
125,-1.3008
126,-1.3347
127,-1.3658
128,-1.3965
129,-1.4312
130,-1.4615
131,-1.4861
132,-1.5119
133,-1.5453
134,-1.5753
135,-1.5964
136,-1.5747
137,-1.5469
138,-1.5178
139,-1.4927
140,-1.4617
141,-1.4291
142,-1.3958
143,-1.3617
144,-1.3317
145,-1.2963
146,-1.2605
147,-1.2283
148,-1.1914
149,-1.1543
150,-1.1168
151,-1.0791
152,-1.0415
153,-1.0062
154,-0.96775
155,-0.9291
156,-0.8902899999999999
157,-0.8513299999999999
158,-0.81224
159,-0.77303
160,-0.7337100000000001
161,-0.69429
162,-0.65477
163,-0.61516
164,-0.57377
165,-0.53335
166,-0.4913
167,-0.45003000000000004
168,-0.40875
169,-0.36514
170,-0.3227
171,-0.28285
172,-0.23895999999999998
173,-0.19396
174,-0.14949
175,-0.1034
176,-0.054858000000000004
177,-0.0061367
178,0.040133999999999996
179,0.08859600000000001
180,0.12703
181,0.17348
182,0.2256
183,0.26666999999999996
184,0.31927
185,0.37212
186,0.41373000000000004
187,0.46698
188,0.51218
189,0.56586
190,0.61152
191,0.6656
192,0.71168
193,0.7660899999999999
194,0.8125600000000001
195,0.8672799999999999
196,0.92214
197,0.9771200000000001
198,1.0322
199,1.0835
200,1.129
201,1.1583
202,1.1771
203,1.1944
204,1.2095
205,1.2148
206,1.2126
207,1.2034
208,1.1886
209,1.1743
210,1.1604
211,1.1385
212,1.117
213,1.1044
214,1.0837
215,1.0635
216,1.0386
217,1.0070000000000001
218,0.9806799999999999
219,0.9479700000000001
220,0.91565
221,0.88371
222,0.8555200000000001
223,0.8210700000000001
224,0.78162
225,0.74749
226,0.73837
227,0.73227
228,0.72673
229,0.7129300000000001
230,0.73016
231,0.75858
232,0.79655
233,0.8356600000000001
234,0.87515
235,0.9152399999999999
236,0.9555299999999999
237,0.9960399999999999
238,1.037
239,1.0781
240,1.1195
241,1.1609
242,1.2025
243,1.2126
244,1.2436
245,1.2699
246,1.2992
247,1.304
248,1.3148
249,1.3189
250,1.3331
251,1.3461
252,1.3516
253,1.3576
254,1.364
255,1.3496
256,1.315
257,1.2777
258,1.2356
259,1.1951
260,1.1529
261,1.109
262,1.0657
263,1.023
264,0.9808100000000001
265,0.937
266,0.8932200000000001
267,0.8494799999999999
268,0.80577
269,0.7621
270,0.7184699999999999
271,0.67579
272,0.6313300000000001
273,0.58782
274,0.5457
275,0.50238
276,0.45883999999999997
277,0.41675
278,0.37340999999999996
279,0.33082
280,0.28807
281,0.24600999999999998
282,0.20396
283,0.16191
284,0.11987
285,0.078717
286,0.03597
287,-0.006217100000000001
288,-0.048234
289,-0.089173
290,-0.13119
291,-0.17213
292,-0.21305
293,-0.25395999999999996
294,-0.29367
295,-0.33453
296,-0.37535999999999997
297,-0.41618
298,-0.45564
299,-0.49199
300,-0.5326
301,-0.57319
302,-0.61206
303,-0.65076
304,-0.69113
305,-0.73146
306,-0.77075
307,-0.80785
308,-0.8473700000000001
309,-0.88466
310,-0.9229999999999999
311,-0.95015
312,-0.93729
313,-0.9232299999999999
314,-0.8869299999999999
315,-0.85908
316,-0.8420700000000001
317,-0.80838
318,-0.77762
319,-0.75046
320,-0.71486
321,-0.69407
322,-0.6724399999999999
323,-0.65186
324,-0.64783
325,-0.64579
326,-0.66686
327,-0.69895
328,-0.73633
329,-0.76761
330,-0.8043399999999999
331,-0.83468
332,-0.87065
333,-0.91254
334,-0.94784
335,-0.98919
336,-1.0303
337,-1.0651
338,-1.1048
339,-1.1404
340,-1.1774
341,-1.2164
342,-1.2549
343,-1.2928
344,-1.3264
345,-1.3665
346,-1.3942
347,-1.4207
348,-1.4457
349,-1.4774
350,-1.4993
351,-1.5106
352,-1.5283
353,-1.5438
354,-1.548
355,-1.5496
356,-1.5397
357,-1.5272
358,-1.5158
359,-1.4818
360,-1.4413
361,-1.3991
362,-1.3553
363,-1.3188
364,-1.2706
365,-1.2269
366,-1.1922
367,-1.1656
368,-1.1506
369,-1.1343
370,-1.1166
371,-1.1055
372,-1.0853
373,-1.0639
374,-1.0414
375,-1.0189
376,-1.0217
377,-1.0026
378,-0.99556
379,-0.9844200000000001
380,-0.96344
381,-0.93932
382,-0.9142600000000001
383,-0.8939299999999999
384,-0.85157
385,-0.81801
386,-0.77969
387,-0.74636
388,-0.71262
389,-0.6686300000000001
390,-0.63432
391,-0.59373
392,-0.54637
393,-0.5110399999999999
394,-0.47600000000000003
395,-0.44068
396,-0.40063000000000004
397,-0.36049000000000003
398,-0.32463000000000003
399,-0.28855
400,-0.25226
401,-0.21578000000000003
402,-0.17995
403,-0.14624
404,-0.10917
405,-0.071948
406,-0.034579
407,-0.00072751
408,0.036972000000000005
409,0.074795
410,0.11274
411,0.15420999999999999
412,0.19230999999999998
413,0.23051
414,0.26882
415,0.30721
416,0.3457
417,0.38427
418,0.41985
419,0.45576000000000005
420,0.49451999999999996
421,0.5334800000000001
422,0.5725
423,0.61159
424,0.65074
425,0.6872199999999999
426,0.7265199999999999
427,0.76853
428,0.8079
429,0.84993
430,0.8893700000000001
431,0.92885
432,0.9683700000000001
433,1.0079
434,1.0475
435,1.0872
436,1.1269
437,1.1642
438,1.204
439,1.2439
440,1.2837
441,1.3236
442,1.3635
443,1.4013
444,1.4413
445,1.4813
446,1.5193
447,1.5573
448,1.5955
449,1.6317
450,1.6701
451,1.7081
452,1.7452
453,1.7838
454,1.8223
455,1.8595
456,1.9
457,1.9406
458,1.9681
459,2.0009
460,2.0205
461,2.0142
462,2.0083
