time,value
0,-0.2315
1,-0.2315
2,-0.2315
3,-0.2315
4,-0.2315
5,-0.2315
6,-0.2315
7,-0.2315
8,-0.2315
9,-0.2315
10,-0.2315
11,-0.2315
12,-0.2315
13,-0.2315
14,-0.2315
15,-0.2315
16,-0.2315
17,-0.2315
18,-0.2315
19,-0.2315
20,-0.2315
21,-0.2315
22,-0.2315
23,-0.2315
24,-0.2315
25,-0.2315
26,-0.2315
27,-0.2315
28,-0.2315
29,-0.2315
30,-0.2315
31,-0.2315
32,6.4538
33,-0.2315
34,-0.2315
35,-0.2315
36,-0.2315
37,-0.2315
38,-0.2315
39,-0.2315
40,-0.2315
41,-0.2315
42,-0.2315
43,3.2015
44,0.76227
45,-0.2315
46,-0.2315
47,-0.2315
48,-0.2315
49,-0.2315
50,-0.2315
51,-0.2315
52,3.1112
53,-0.2315
54,-0.2315
55,-0.2315
56,-0.2315
57,-0.2315
58,4.4663
59,-0.2315
60,-0.2315
61,-0.2315
62,2.8401
63,-0.2315
64,-0.2315
65,-0.2315
66,-0.2315
67,-0.2315
68,-0.2315
69,-0.2315
70,-0.2315
71,-0.2315
72,-0.2315
73,-0.2315
74,-0.2315
75,-0.2315
76,-0.2315
77,-0.2315
78,-0.2315
79,-0.2315
80,-0.2315
81,-0.2315
82,-0.2315
83,-0.2315
84,-0.2315
85,-0.2315
86,-0.2315
87,-0.2315
88,-0.2315
89,-0.2315
90,-0.2315
91,-0.2315
92,-0.2315
93,-0.2315
94,-0.2315
95,-0.2315
