time,value
0,1.2827
1,0.54202
2,-0.9393799999999999
3,-0.9393799999999999
4,-0.9393799999999999
5,-0.9393799999999999
6,1.1901
7,1.2827
8,0.44943999999999995
9,-0.9393799999999999
10,-0.9393799999999999
11,-0.9393799999999999
12,-0.9393799999999999
13,0.91238
14,1.2827
15,1.005
16,-0.9393799999999999
17,-0.9393799999999999
18,-0.9393799999999999
19,-0.9393799999999999
20,-0.10609
21,1.2827
22,1.2827
23,0.079085
24,-0.9393799999999999
25,-0.9393799999999999
26,-0.9393799999999999
27,-0.9393799999999999
28,1.3753
29,1.2827
30,0.81979
31,-0.9393799999999999
32,-0.9393799999999999
33,-0.9393799999999999
34,-0.9393799999999999
35,0.7272
36,1.2827
37,1.1901
38,-0.9393799999999999
39,-0.9393799999999999
40,-0.7542
41,1.3753
42,1.1901
43,0.26426
44,-0.9393799999999999
45,-0.9393799999999999
46,-0.9393799999999999
47,0.63461
48,1.2827
49,0.91238
50,-0.9393799999999999
51,-0.9393799999999999
52,-0.9393799999999999
53,0.44943999999999995
54,1.2827
55,1.1901
56,-0.56903
57,-0.9393799999999999
58,-0.9393799999999999
59,-0.9393799999999999
60,0.44943999999999995
61,1.1901
62,1.2827
63,-0.7542
64,-0.9393799999999999
65,-0.9393799999999999
66,-0.9393799999999999
67,-0.56903
68,1.2827
69,1.2827
70,0.26426
71,-0.9393799999999999
72,-0.9393799999999999
73,-0.9393799999999999
74,-0.10609
75,1.3753
76,1.3753
77,1.0976
78,-0.9393799999999999
79,-0.9393799999999999
80,-0.29127
81,1.3753
82,1.3753
83,0.91238
84,-0.9393799999999999
85,-0.9393799999999999
86,-0.9393799999999999
87,1.1901
88,1.3753
89,1.005
90,-0.9393799999999999
91,-0.9393799999999999
92,-0.9393799999999999
93,0.079085
94,1.3753
95,1.2827
