time,value
0,-1.157
1,-1.157
2,-1.157
3,-1.157
4,-1.157
5,-1.157
6,-1.157
7,-1.157
8,-1.157
9,-1.157
10,-1.157
11,-1.157
12,-1.157
13,-1.157
14,-1.157
15,-1.157
16,-1.157
17,-1.157
18,-1.157
19,-1.157
20,-1.157
21,-1.157
22,-1.157
23,-1.157
24,-1.157
25,-1.157
26,-1.157
27,-1.157
28,0.63278
29,1.7909
30,1.0539
31,0.5275
32,1.1592
33,0.63278
34,0.73806
35,1.475
36,2.1067
37,2.3173
38,1.5803
39,2.1067
40,2.1067
41,1.6856
42,1.8961
43,1.2645
44,1.2645
45,1.3697
46,0.94862
47,1.1592
48,0.63278
49,0.73806
50,0.5275
51,0.42222
52,0.63278
53,0.21166
54,0.73806
55,0.10638
56,0.5275
57,0.21166
58,0.10638
59,0.5275
60,0.42222
61,0.73806
62,0.31694
63,0.42222
64,0.31694
65,0.42222
66,0.42222
67,0.0010967000000000001
68,0.10638
69,0.10638
70,0.10638
71,0.10638
72,0.10638
73,0.10638
74,0.21166
75,0.10638
76,0.10638
77,0.10638
78,0.10638
79,0.10638
80,0.10638
81,0.10638
82,0.21166
83,0.10638
84,0.10638
85,0.10638
86,0.10638
87,0.21166
88,0.5275
89,0.10638
90,-1.157
91,-1.157
92,-1.157
93,-1.157
94,-1.157
95,-1.157
