time,value
0,-0.94195
1,-0.94195
2,1.0615
3,1.2436
4,0.97041
5,-0.94195
6,-0.94195
7,-0.94195
8,-0.94195
9,-0.94195
10,1.3347
11,1.2436
12,1.0615
13,-0.94195
14,-0.94195
15,-0.94195
16,-0.94195
17,-0.94195
18,-0.12237
19,1.2436
20,1.2436
21,0.69722
22,-0.94195
23,-0.94195
24,-0.94195
25,-0.94195
26,-0.94195
27,-0.94195
28,1.0615
29,1.2436
30,1.2436
31,0.15083
32,-0.94195
33,-0.94195
34,-0.94195
35,-0.66876
36,1.3347
37,1.2436
38,1.1525
39,-0.3045
40,-0.94195
41,-0.94195
42,-0.94195
43,1.1525
44,1.3347
45,0.87935
46,-0.94195
47,-0.94195
48,-0.94195
49,-0.94195
50,1.2436
51,1.2436
52,1.2436
53,-0.5776899999999999
54,-0.94195
55,-0.94195
56,0.15083
57,1.3347
58,1.2436
59,0.78828
60,-0.94195
61,-0.94195
62,-0.94195
63,0.69722
64,1.3347
65,1.1525
66,-0.48663
67,-0.94195
68,-0.94195
69,-0.21343
70,1.2436
71,1.2436
72,1.2436
73,1.1525
74,1.0615
75,0.87935
76,-0.94195
77,-0.94195
78,-0.94195
79,0.059761
80,1.2436
81,1.1525
82,0.24189000000000002
83,-0.94195
84,-0.94195
85,-0.94195
86,-0.94195
87,1.0615
88,1.2436
89,1.1525
90,-0.94195
91,-0.94195
92,-0.94195
93,-0.94195
94,0.15083
95,1.2436
