time,value
0,0.91659
1,0.82032
2,0.91659
3,0.050142
4,-1.0089
5,-1.0089
6,-1.0089
7,-1.0089
8,-1.0089
9,-1.0089
10,-1.0089
11,-1.0089
12,-1.0089
13,-1.0089
14,0.72405
15,1.3980000000000001
16,1.2054
17,1.1091
18,1.0129
19,0.91659
20,0.91659
21,-1.0089
22,-1.0089
23,-1.0089
24,-1.0089
25,-1.0089
26,-1.0089
27,-1.0089
28,-1.0089
29,-1.0089
30,-0.33495
31,1.3980000000000001
32,1.2054
33,1.1091
34,1.0129
35,1.0129
36,0.91659
37,0.91659
38,0.91659
39,-0.52749
40,-1.0089
41,-1.0089
42,-1.0089
43,-1.0089
44,-1.0089
45,-1.0089
46,-1.0089
47,-1.0089
48,-0.23867
49,1.3980000000000001
50,1.3017
51,1.1091
52,1.1091
53,1.0129
54,0.91659
55,1.0129
56,0.91659
57,0.91659
58,0.33896
59,-1.0089
60,-1.0089
61,-1.0089
62,-1.0089
63,-1.0089
64,-1.0089
65,-1.0089
66,-1.0089
67,-1.0089
68,0.72405
69,1.3017
70,1.2054
71,1.0129
72,1.0129
73,0.91659
74,1.0129
75,0.82032
76,0.91659
77,0.91659
78,0.91659
79,0.82032
80,0.91659
81,0.82032
82,-0.52749
83,-1.0089
84,-1.0089
85,-1.0089
86,-1.0089
87,-1.0089
88,-1.0089
89,-1.0089
90,-1.0089
91,-0.62376
92,1.3980000000000001
93,1.3017
94,1.1091
95,1.0129
