time,value
0,-0.19504000000000002
1,-0.15739
2,-0.19162
3,-0.16766
4,-0.17793
5,-0.18477000000000002
6,-0.15054
7,-0.19504000000000002
8,-0.15397
9,-0.18135
10,-0.16766
11,-0.17451
12,-0.17451
13,-0.16080999999999998
14,-0.19162
15,-0.14712
16,-0.19162
17,-0.17793
18,-0.17107999999999998
19,-0.1882
20,-0.15739
21,-0.19847
22,-0.15739
23,-0.19162
24,-0.17451
25,-0.15397
26,-0.18477000000000002
27,-0.14712
28,-0.1882
29,-0.16766
30,-0.17793
31,-0.18135
32,-0.1437
33,-0.19847
34,-0.15739
35,-0.1882
36,-0.16766
37,-0.14712
38,-0.16080999999999998
39,-0.15739
40,-0.18477000000000002
41,-0.13685
42,-0.18477000000000002
43,-0.16080999999999998
44,-0.17451
45,-0.18135
46,-0.17451
47,-0.19162
48,-0.15739
49,-0.19847
50,-0.15739
51,-0.1882
52,-0.18135
53,-0.17451
54,-0.19162
55,-0.16766
56,-0.19504000000000002
57,-0.16080999999999998
58,-0.1882
59,-0.17107999999999998
60,-0.16766
61,-0.18477000000000002
62,-0.17107999999999998
63,-0.1882
64,-0.16424
65,-0.19847
66,5.8467
67,7.1646
68,2.6119
69,-0.11974000000000001
70,-0.13685
71,-0.11289
72,-0.15397
73,-0.1437
74,-0.11631
75,-0.16766
76,-0.14027
77,-0.13001
78,-0.16766
79,-0.13685
80,-0.16424
81,-0.16080999999999998
82,-0.11974000000000001
83,-0.17451
84,-0.1437
85,-0.16766
86,-0.16424
87,-0.15054
88,-0.19504000000000002
89,-0.13685
90,-0.16766
91,-0.17793
92,-0.17107999999999998
93,-0.19504000000000002
94,-0.14027
95,-0.17107999999999998
