time,value
0,1.7321
1,1.7208
2,1.6895
3,1.6213
4,1.5316
5,1.4399
6,1.3469
7,1.2557
8,1.1638
9,1.0719
10,0.9822700000000001
11,0.8923399999999999
12,0.80402
13,0.71546
14,0.62902
15,0.53976
16,0.45288999999999996
17,0.36594
18,0.27999
19,0.19474
20,0.10758
21,0.034542
22,-0.048375
23,-0.13355
24,-0.21800999999999998
25,-0.30163
26,-0.39044
27,-0.47715
28,-0.56824
29,-0.6534
30,-0.74198
31,-0.8252200000000001
32,-0.90381
33,-0.9817899999999999
34,-1.0558
35,-1.1219
36,-1.1785
37,-1.22
38,-1.2449
39,-1.2704
40,-1.2787
41,-1.2787
42,-1.2673
43,-1.2866
44,-1.3018
45,-1.3195
46,-1.3335
47,-1.3371
48,-1.3230000000000002
49,-1.2926
50,-1.2529
51,-1.2124
52,-1.1503
53,-1.0753
54,-0.9944799999999999
55,-0.91348
56,-0.83104
57,-0.74058
58,-0.6525
59,-0.56487
60,-0.47753999999999996
61,-0.39684
62,-0.31577
63,-0.23360999999999998
64,-0.15049
65,-0.066527
66,0.014953999999999999
67,0.10617
68,0.17789000000000002
69,0.26399
70,0.3506
71,0.43691
72,0.51155
73,0.5977600000000001
74,0.68248
75,0.76985
76,0.85769
77,0.94747
78,1.0389
79,1.1301
80,1.2219
81,1.3108
82,1.3988
83,1.4881
84,1.5649
85,1.6271
86,1.6562
87,1.6654
88,1.6656
89,1.6552
90,1.5884
91,1.5013
92,1.4109
93,1.3179
94,1.2242
95,1.1312
96,1.0402
97,0.9483
98,0.85754
99,0.7669199999999999
100,0.68003
101,0.59048
102,0.50066
103,0.4128
104,0.32742
105,0.24086
106,0.15264
107,0.0624
108,-0.019941999999999998
109,-0.10121000000000001
110,-0.18662
111,-0.26829000000000003
112,-0.30541999999999997
113,-0.3778
114,-0.4576
115,-0.53179
116,-0.61564
117,-0.69982
118,-0.78789
119,-0.87525
120,-0.95626
121,-1.0295
122,-1.0996
123,-1.1784
124,-1.2349
125,-1.25
126,-1.2925
127,-1.2951
128,-1.3089
129,-1.3124
130,-1.3091
131,-1.3053
132,-1.3016
133,-1.288
134,-1.2752
135,-1.2682
136,-1.2481
137,-1.2314
138,-1.2088
139,-1.1776
140,-1.1792
141,-1.119
142,-1.0609
143,-0.9916200000000001
144,-0.91348
145,-0.8441
146,-0.7519399999999999
147,-0.66911
148,-0.5852
149,-0.50039
150,-0.41481
151,-0.32466
152,-0.23801999999999998
153,-0.15404
154,-0.066775
155,0.014563
156,0.09499400000000001
157,0.18161
158,0.2687
159,0.35691999999999996
160,0.44221000000000005
161,0.5261100000000001
162,0.615
163,0.7037
164,0.79122
165,0.8777200000000001
166,0.96583
167,1.0562
168,1.1467
169,1.2363
170,1.3272
171,1.4187
172,1.5087
173,1.5975
174,1.6771
175,1.7205
