d3mIndex,type,repeat,fold
0,TRAIN,0,0
1,TRAIN,0,0
2,TRAIN,0,0
3,TRAIN,0,0
4,TRAIN,0,0
5,TRAIN,0,0
6,TRAIN,0,0
7,TRAIN,0,0
8,TRAIN,0,0
9,TRAIN,0,0
10,TRAIN,0,0
11,TRAIN,0,0
12,TRAIN,0,0
13,TRAIN,0,0
14,TRAIN,0,0
15,TRAIN,0,0
16,TRAIN,0,0
17,TRAIN,0,0
18,TRAIN,0,0
19,TRAIN,0,0
20,TRAIN,0,0
21,TRAIN,0,0
22,TRAIN,0,0
23,TRAIN,0,0
24,TRAIN,0,0
25,TRAIN,0,0
26,TRAIN,0,0
27,TRAIN,0,0
28,TRAIN,0,0
29,TRAIN,0,0
30,TRAIN,0,0
31,TRAIN,0,0
32,TRAIN,0,0
33,TRAIN,0,0
34,TRAIN,0,0
35,TRAIN,0,0
36,TRAIN,0,0
37,TRAIN,0,0
38,TRAIN,0,0
39,TRAIN,0,0
40,TRAIN,0,0
41,TRAIN,0,0
42,TRAIN,0,0
43,TRAIN,0,0
44,TRAIN,0,0
45,TRAIN,0,0
46,TRAIN,0,0
47,TRAIN,0,0
48,TRAIN,0,0
49,TRAIN,0,0
50,TRAIN,0,0
51,TRAIN,0,0
52,TRAIN,0,0
53,TRAIN,0,0
54,TRAIN,0,0
55,TRAIN,0,0
56,TRAIN,0,0
57,TRAIN,0,0
58,TRAIN,0,0
59,TRAIN,0,0
60,TRAIN,0,0
61,TRAIN,0,0
62,TRAIN,0,0
63,TRAIN,0,0
64,TRAIN,0,0
65,TRAIN,0,0
66,TRAIN,0,0
67,TRAIN,0,0
68,TRAIN,0,0
69,TRAIN,0,0
70,TRAIN,0,0
71,TRAIN,0,0
72,TRAIN,0,0
73,TRAIN,0,0
74,TRAIN,0,0
75,TRAIN,0,0
76,TRAIN,0,0
77,TRAIN,0,0
78,TRAIN,0,0
79,TRAIN,0,0
80,TRAIN,0,0
81,TRAIN,0,0
82,TRAIN,0,0
83,TRAIN,0,0
84,TRAIN,0,0
85,TRAIN,0,0
86,TRAIN,0,0
87,TRAIN,0,0
88,TRAIN,0,0
89,TRAIN,0,0
90,TRAIN,0,0
91,TRAIN,0,0
92,TRAIN,0,0
93,TRAIN,0,0
94,TRAIN,0,0
95,TRAIN,0,0
96,TRAIN,0,0
97,TRAIN,0,0
98,TRAIN,0,0
99,TRAIN,0,0
100,TRAIN,0,0
101,TRAIN,0,0
102,TRAIN,0,0
103,TRAIN,0,0
104,TRAIN,0,0
105,TRAIN,0,0
106,TRAIN,0,0
107,TRAIN,0,0
108,TRAIN,0,0
109,TRAIN,0,0
110,TRAIN,0,0
111,TRAIN,0,0
112,TRAIN,0,0
113,TRAIN,0,0
114,TRAIN,0,0
115,TRAIN,0,0
116,TRAIN,0,0
117,TRAIN,0,0
118,TRAIN,0,0
119,TRAIN,0,0
120,TRAIN,0,0
121,TRAIN,0,0
122,TRAIN,0,0
123,TRAIN,0,0
124,TRAIN,0,0
125,TRAIN,0,0
126,TRAIN,0,0
127,TRAIN,0,0
128,TRAIN,0,0
129,TRAIN,0,0
130,TRAIN,0,0
131,TRAIN,0,0
132,TRAIN,0,0
133,TRAIN,0,0
134,TRAIN,0,0
135,TRAIN,0,0
136,TRAIN,0,0
137,TRAIN,0,0
138,TRAIN,0,0
139,TRAIN,0,0
140,TRAIN,0,0
141,TRAIN,0,0
142,TRAIN,0,0
143,TRAIN,0,0
144,TRAIN,0,0
145,TRAIN,0,0
146,TRAIN,0,0
147,TRAIN,0,0
148,TRAIN,0,0
149,TRAIN,0,0
150,TRAIN,0,0
151,TRAIN,0,0
152,TRAIN,0,0
153,TRAIN,0,0
154,TRAIN,0,0
155,TRAIN,0,0
156,TRAIN,0,0
157,TRAIN,0,0
158,TRAIN,0,0
159,TRAIN,0,0
160,TRAIN,0,0
161,TRAIN,0,0
162,TRAIN,0,0
163,TRAIN,0,0
164,TRAIN,0,0
165,TRAIN,0,0
166,TRAIN,0,0
167,TRAIN,0,0
168,TRAIN,0,0
169,TRAIN,0,0
170,TRAIN,0,0
171,TRAIN,0,0
172,TRAIN,0,0
173,TRAIN,0,0
174,TRAIN,0,0
175,TRAIN,0,0
176,TRAIN,0,0
177,TRAIN,0,0
178,TRAIN,0,0
179,TRAIN,0,0
180,TRAIN,0,0
181,TRAIN,0,0
182,TRAIN,0,0
183,TRAIN,0,0
184,TRAIN,0,0
185,TRAIN,0,0
186,TRAIN,0,0
187,TRAIN,0,0
188,TRAIN,0,0
189,TRAIN,0,0
190,TRAIN,0,0
191,TRAIN,0,0
192,TRAIN,0,0
193,TRAIN,0,0
194,TRAIN,0,0
195,TRAIN,0,0
196,TRAIN,0,0
197,TRAIN,0,0
198,TRAIN,0,0
199,TRAIN,0,0
200,TEST,0,0
201,TEST,0,0
202,TEST,0,0
203,TEST,0,0
204,TEST,0,0
205,TEST,0,0
206,TEST,0,0
207,TEST,0,0
208,TEST,0,0
209,TEST,0,0
210,TEST,0,0
211,TEST,0,0
212,TEST,0,0
213,TEST,0,0
214,TEST,0,0
215,TEST,0,0
216,TEST,0,0
217,TEST,0,0
218,TEST,0,0
219,TEST,0,0
220,TEST,0,0
221,TEST,0,0
222,TEST,0,0
223,TEST,0,0
224,TEST,0,0
225,TEST,0,0
226,TEST,0,0
227,TEST,0,0
228,TEST,0,0
229,TEST,0,0
230,TEST,0,0
231,TEST,0,0
232,TEST,0,0
233,TEST,0,0
234,TEST,0,0
235,TEST,0,0
236,TEST,0,0
237,TEST,0,0
238,TEST,0,0
239,TEST,0,0
240,TEST,0,0
241,TEST,0,0
242,TEST,0,0
243,TEST,0,0
244,TEST,0,0
245,TEST,0,0
246,TEST,0,0
247,TEST,0,0
248,TEST,0,0
249,TEST,0,0
250,TEST,0,0
251,TEST,0,0
252,TEST,0,0
253,TEST,0,0
254,TEST,0,0
255,TEST,0,0
256,TEST,0,0
257,TEST,0,0
258,TEST,0,0
259,TEST,0,0
260,TEST,0,0
261,TEST,0,0
262,TEST,0,0
263,TEST,0,0
264,TEST,0,0
265,TEST,0,0
266,TEST,0,0
267,TEST,0,0
268,TEST,0,0
269,TEST,0,0
270,TEST,0,0
271,TEST,0,0
272,TEST,0,0
273,TEST,0,0
274,TEST,0,0
275,TEST,0,0
276,TEST,0,0
277,TEST,0,0
278,TEST,0,0
279,TEST,0,0
280,TEST,0,0
281,TEST,0,0
282,TEST,0,0
283,TEST,0,0
284,TEST,0,0
285,TEST,0,0
286,TEST,0,0
287,TEST,0,0
288,TEST,0,0
289,TEST,0,0
290,TEST,0,0
291,TEST,0,0
292,TEST,0,0
293,TEST,0,0
294,TEST,0,0
295,TEST,0,0
296,TEST,0,0
297,TEST,0,0
298,TEST,0,0
299,TEST,0,0
300,TEST,0,0
301,TEST,0,0
302,TEST,0,0
303,TEST,0,0
304,TEST,0,0
305,TEST,0,0
306,TEST,0,0
307,TEST,0,0
308,TEST,0,0
309,TEST,0,0
310,TEST,0,0
311,TEST,0,0
312,TEST,0,0
313,TEST,0,0
314,TEST,0,0
315,TEST,0,0
316,TEST,0,0
317,TEST,0,0
318,TEST,0,0
319,TEST,0,0
320,TEST,0,0
321,TEST,0,0
322,TEST,0,0
323,TEST,0,0
324,TEST,0,0
325,TEST,0,0
326,TEST,0,0
327,TEST,0,0
328,TEST,0,0
329,TEST,0,0
330,TEST,0,0
331,TEST,0,0
332,TEST,0,0
333,TEST,0,0
334,TEST,0,0
335,TEST,0,0
336,TEST,0,0
337,TEST,0,0
338,TEST,0,0
339,TEST,0,0
340,TEST,0,0
341,TEST,0,0
342,TEST,0,0
343,TEST,0,0
344,TEST,0,0
345,TEST,0,0
346,TEST,0,0
347,TEST,0,0
348,TEST,0,0
349,TEST,0,0
350,TEST,0,0
351,TEST,0,0
352,TEST,0,0
353,TEST,0,0
354,TEST,0,0
355,TEST,0,0
356,TEST,0,0
357,TEST,0,0
358,TEST,0,0
359,TEST,0,0
360,TEST,0,0
361,TEST,0,0
362,TEST,0,0
363,TEST,0,0
364,TEST,0,0
365,TEST,0,0
366,TEST,0,0
367,TEST,0,0
368,TEST,0,0
369,TEST,0,0
370,TEST,0,0
371,TEST,0,0
372,TEST,0,0
373,TEST,0,0
374,TEST,0,0
375,TEST,0,0
376,TEST,0,0
377,TEST,0,0
378,TEST,0,0
379,TEST,0,0
380,TEST,0,0
381,TEST,0,0
382,TEST,0,0
383,TEST,0,0
384,TEST,0,0
385,TEST,0,0
386,TEST,0,0
387,TEST,0,0
388,TEST,0,0
389,TEST,0,0
390,TEST,0,0
391,TEST,0,0
392,TEST,0,0
393,TEST,0,0
394,TEST,0,0
395,TEST,0,0
396,TEST,0,0
397,TEST,0,0
398,TEST,0,0
399,TEST,0,0
400,TEST,0,0
401,TEST,0,0
402,TEST,0,0
403,TEST,0,0
404,TEST,0,0
405,TEST,0,0
406,TEST,0,0
407,TEST,0,0
408,TEST,0,0
409,TEST,0,0
410,TEST,0,0
411,TEST,0,0
412,TEST,0,0
413,TEST,0,0
414,TEST,0,0
415,TEST,0,0
416,TEST,0,0
417,TEST,0,0
418,TEST,0,0
419,TEST,0,0
420,TEST,0,0
421,TEST,0,0
422,TEST,0,0
423,TEST,0,0
424,TEST,0,0
425,TEST,0,0
426,TEST,0,0
427,TEST,0,0
428,TEST,0,0
429,TEST,0,0
430,TEST,0,0
431,TEST,0,0
432,TEST,0,0
433,TEST,0,0
434,TEST,0,0
435,TEST,0,0
436,TEST,0,0
437,TEST,0,0
438,TEST,0,0
439,TEST,0,0
440,TEST,0,0
441,TEST,0,0
