time,value
0,-0.1893
1,-0.1893
2,-0.1893
3,-0.1893
4,-0.1893
5,-0.1893
6,-0.1893
7,-0.1893
8,-0.1893
9,-0.1893
10,-0.1893
11,-0.1893
12,-0.1893
13,-0.1893
14,-0.1893
15,-0.1893
16,-0.1893
17,-0.1893
18,-0.1893
19,-0.1893
20,-0.1893
21,-0.1893
22,-0.1893
23,-0.1893
24,-0.1893
25,-0.1893
26,-0.1893
27,-0.1893
28,-0.1893
29,-0.1893
30,-0.1893
31,-0.1893
32,-0.1893
33,-0.1893
34,-0.1893
35,-0.1893
36,-0.1893
37,-0.1893
38,-0.1893
39,-0.1893
40,-0.1893
41,-0.1893
42,-0.1893
43,-0.1893
44,-0.1893
45,-0.1893
46,-0.1893
47,-0.1893
48,-0.1893
49,-0.1893
50,-0.1893
51,-0.1893
52,-0.1893
53,5.5249
54,-0.1893
55,-0.1893
56,-0.1893
57,-0.1893
58,-0.1893
59,-0.1893
60,-0.1893
61,-0.1893
62,-0.1893
63,-0.1893
64,-0.1893
65,-0.1893
66,-0.1893
67,4.4008
68,1.1222
69,-0.1893
70,-0.1893
71,-0.1893
72,-0.1893
73,-0.1893
74,-0.1893
75,-0.1893
76,-0.1893
77,-0.1893
78,-0.1893
79,-0.1893
80,-0.1893
81,-0.1893
82,-0.1893
83,-0.1893
84,-0.1893
85,-0.1893
86,-0.1893
87,-0.1893
88,6.367999999999999
89,-0.1893
90,-0.1893
91,-0.1893
92,-0.1893
93,-0.1893
94,-0.1893
95,-0.1893
