time,value
0,-0.29475
1,-0.51581
2,-0.5895
3,0.073687
4,0.44211999999999996
5,0.44211999999999996
6,-0.44211999999999996
7,-0.51581
8,-0.44211999999999996
9,0.44211999999999996
10,0.14737
11,0.36844
12,-0.51581
13,-0.5895
14,0.073687
15,0.14737
16,0.0
17,0.29475
18,-0.51581
19,-0.5895
20,0.51581
21,-0.29475
22,0.14737
23,0.22105999999999998
24,-0.5895
25,-0.073687
26,0.29475
27,-0.51581
28,0.14737
29,0.14737
30,-0.51581
31,0.36844
32,-0.22105999999999998
33,-0.51581
34,0.14737
35,0.14737
36,-0.22105999999999998
37,0.44211999999999996
38,-0.51581
39,-0.5895
40,0.22105999999999998
41,0.14737
42,0.22105999999999998
43,0.0
44,-0.5895
45,-0.51581
46,0.22105999999999998
47,0.29475
48,0.44211999999999996
49,-0.44211999999999996
50,-0.51581
51,-0.5895
52,0.29475
53,8.3267
54,0.14737
55,-0.5895
56,-0.51581
57,-0.5895
58,0.36844
59,1.1053
60,-0.29475
61,-0.5895
62,-0.51581
63,-0.51581
64,0.95793
65,0.5895
66,-0.51581
67,-0.5895
68,-0.51581
69,-0.29475
70,1.4001
71,-0.14737
72,-0.51581
73,-0.5895
74,-0.51581
75,0.36844
76,1.179
77,-0.51581
78,-0.5895
79,-0.51581
80,-0.5895
81,1.0316
82,0.5895
83,-0.51581
84,-0.5895
85,-0.51581
86,-0.29475
87,1.2527
88,0.073687
89,-0.5895
90,-0.51581
91,-0.5895
92,0.22105999999999998
93,1.0316
94,-0.14737
95,-0.51581
