time,value
0,-0.38266999999999995
1,-0.38266999999999995
2,-0.38266999999999995
3,-0.38266999999999995
4,-0.38266999999999995
5,-0.38266999999999995
6,-0.38266999999999995
7,-0.38266999999999995
8,-0.38266999999999995
9,-0.38266999999999995
10,-0.38266999999999995
11,-0.38266999999999995
12,-0.38266999999999995
13,-0.38266999999999995
14,-0.38266999999999995
15,-0.38266999999999995
16,-0.38266999999999995
17,-0.38266999999999995
18,-0.38266999999999995
19,-0.38266999999999995
20,-0.38266999999999995
21,-0.38266999999999995
22,-0.38266999999999995
23,-0.38266999999999995
24,-0.38266999999999995
25,-0.38266999999999995
26,-0.38266999999999995
27,-0.38266999999999995
28,-0.38266999999999995
29,-0.38266999999999995
30,1.6118
31,4.1188
32,3.0939
33,-0.035804
34,-0.051571000000000006
35,-0.11464
36,-0.067337
37,-0.035804
38,-0.012154
39,0.59487
40,4.0478
41,3.969
42,-0.12252
43,-0.13829
44,-0.16982
45,-0.16982
46,-0.11464
47,0.058797
48,-0.38266999999999995
49,-0.38266999999999995
50,-0.38266999999999995
51,-0.38266999999999995
52,-0.38266999999999995
53,-0.38266999999999995
54,-0.38266999999999995
55,-0.38266999999999995
56,-0.38266999999999995
57,-0.38266999999999995
58,-0.38266999999999995
59,-0.38266999999999995
60,2.3056
61,1.2334
62,-0.13829
63,-0.26442
64,-0.34326
65,-0.23289
66,3.6615
67,0.24011999999999997
68,-0.38266999999999995
69,-0.38266999999999995
70,-0.31172
71,-0.16194
72,-0.19347
73,1.7301
74,0.4845
75,-0.17770999999999998
76,-0.18559
77,-0.38266999999999995
78,-0.38266999999999995
79,-0.38266999999999995
80,-0.38266999999999995
81,-0.38266999999999995
82,-0.38266999999999995
83,-0.38266999999999995
84,-0.38266999999999995
85,-0.38266999999999995
86,-0.38266999999999995
87,-0.38266999999999995
88,-0.38266999999999995
89,-0.38266999999999995
90,-0.38266999999999995
91,-0.38266999999999995
92,-0.38266999999999995
93,-0.38266999999999995
94,-0.38266999999999995
95,-0.38266999999999995
