time,value
0,-1.8244
1,0.5424
2,0.5424
3,0.5424
4,0.5424
5,-1.8244
6,0.5424
7,0.5424
8,0.5424
9,-1.8244
10,0.5424
11,0.5424
12,0.5424
13,0.5424
14,-1.8244
15,0.5424
16,0.5424
17,0.5424
18,-1.8244
19,0.5424
20,0.5424
21,0.5424
22,0.5424
23,-1.8244
24,0.5424
25,0.5424
26,0.5424
27,-1.8244
28,0.5424
29,0.5424
30,0.5424
31,0.5424
32,-1.8244
33,0.5424
34,0.5424
35,0.5424
36,-1.8244
37,0.5424
38,0.5424
39,0.5424
40,0.5424
41,-1.8244
42,0.5424
43,0.5424
44,0.5424
45,-1.8244
46,0.5424
47,0.5424
48,0.5424
49,0.5424
50,-1.8244
51,0.5424
52,0.5424
53,0.5424
54,-1.8244
55,0.5424
56,0.5424
57,0.5424
58,0.5424
59,-1.8244
60,0.5424
61,0.5424
62,0.5424
63,-1.8244
64,0.5424
65,0.5424
66,0.5424
67,-1.8244
68,0.5424
69,0.5424
70,0.5424
71,0.5424
72,-1.8244
73,0.5424
74,0.5424
75,0.5424
76,-1.8244
77,0.5424
78,0.5424
79,0.5424
80,0.5424
81,-1.8244
82,0.5424
83,0.5424
84,0.5424
85,0.5424
86,-1.8244
87,0.5424
88,0.5424
89,0.5424
90,-1.8244
91,0.5424
92,0.5424
93,0.5424
94,0.5424
95,-1.8244
