time,value
0,1.8969
1,1.8033
2,1.6789
3,1.5558
4,1.4316
5,1.3066
6,1.2006
7,1.0967
8,0.99972
9,0.9093399999999999
10,0.78987
11,0.69716
12,0.6520600000000001
13,0.6889
14,0.74415
15,0.77454
16,0.80169
17,0.77247
18,0.75107
19,0.7562399999999999
20,0.75469
21,0.75808
22,0.78933
23,0.80095
24,0.8065100000000001
25,0.80155
26,0.7763800000000001
27,0.75846
28,0.74287
29,0.65093
30,0.55092
31,0.46192
32,0.45978
33,0.48166000000000003
34,0.5172800000000001
35,0.55745
36,0.61001
37,0.62325
38,0.6539
39,0.64958
40,0.65387
41,0.66704
42,0.66341
43,0.65158
44,0.64218
45,0.62579
46,0.6049
47,0.56398
48,0.5249
49,0.47523999999999994
50,0.38555
51,0.2774
52,0.17059000000000002
53,0.07682
54,-0.039853
55,-0.15041
56,-0.22014
57,-0.28969
58,-0.37114
59,-0.46399999999999997
60,-0.5763199999999999
61,-0.6847300000000001
62,-0.80176
63,-0.91589
64,-1.0202
65,-1.0883
66,-1.1835
67,-1.2841
68,-1.3486
69,-1.3693
70,-1.453
71,-1.4407
72,-1.4998
73,-1.493
74,-1.4423
75,-1.3939
76,-1.3624
77,-1.3219
78,-1.2697
79,-1.1872
80,-1.1163
81,-1.0333
82,-0.9941200000000001
83,-0.8874299999999999
84,-0.8271799999999999
85,-0.74162
86,-0.6491899999999999
87,-0.5526800000000001
88,-0.45458999999999994
89,-0.35625
90,-0.25451
91,-0.19324000000000002
92,-0.12600999999999998
93,-0.044404
94,0.027552999999999998
95,0.088018
96,0.16121
97,0.23201999999999998
98,0.30414
99,0.39246
100,0.46238
101,0.53535
102,0.60742
103,0.67875
104,0.74308
105,0.80684
106,0.8476600000000001
107,0.8788299999999999
108,0.8912200000000001
109,0.8895
110,0.8599700000000001
111,0.8276899999999999
112,0.81462
113,0.8325
114,0.8640000000000001
115,0.90154
116,0.93186
117,0.9478700000000001
118,0.9529
119,0.92443
120,0.88646
121,0.82655
122,0.72151
123,0.6146199999999999
124,0.50963
125,0.4055
126,0.25928
127,0.11072
128,0.010059
129,-0.089779
130,-0.1746
131,-0.28278000000000003
132,-0.37531
133,-0.49004
134,-0.56088
135,-0.70806
136,-0.8340700000000001
137,-0.95752
138,-1.0441
139,-1.1663
140,-1.1882
141,-1.2455
142,-1.3649
143,-1.4703
144,-1.5946
145,-1.5507
146,-1.6416
147,-1.7353
148,-1.8387
149,-1.9312
150,-1.9974
151,-2.0427
152,-2.1074
153,-2.1972
154,-2.2628
155,-2.2453
156,-2.1448
157,-2.0502
158,-1.9368
159,-1.8391
160,-1.7255
161,-1.6135
162,-1.506
163,-1.3993
164,-1.2955
165,-1.1859
166,-1.0783
167,-0.97265
168,-0.8541700000000001
169,-0.75315
170,-0.64323
171,-0.52489
172,-0.41913999999999996
173,-0.30977
174,-0.20770999999999998
175,-0.091781
176,0.021425
177,0.13699
178,0.26629
179,0.37979
180,0.48606000000000005
181,0.6103
182,0.73205
183,0.8276399999999999
184,0.8937700000000001
185,0.9548
186,0.96586
187,0.95801
188,0.9459299999999999
189,0.9091100000000001
190,0.8433299999999999
191,0.75742
192,0.6733600000000001
193,0.5959
194,0.50794
195,0.42278000000000004
196,0.32719000000000004
197,0.23898000000000003
198,0.14381
199,0.06863999999999999
200,0.12414000000000001
201,0.22324000000000002
202,0.33829000000000004
203,0.48303999999999997
204,0.5964
205,0.70839
206,0.83791
207,0.94104
208,1.0307
209,1.1034
210,1.1966
211,1.2718
212,1.3377
213,1.3901
214,1.4578
215,1.5174
216,1.5464
217,1.5481
218,1.5057
219,1.4506
220,1.3733
221,1.2911
222,1.2018
223,1.1082
224,1.0154
225,1.0281
226,1.0903
227,1.1481
228,1.216
229,1.2676
230,1.2628
231,1.2221
232,1.1618
233,1.0994
234,1.0272
235,0.9492299999999999
236,0.8443299999999999
237,0.7346699999999999
238,0.62622
239,0.5234300000000001
240,0.41172
241,0.2735
242,0.15767
243,0.00913
244,-0.13581
245,-0.28306
246,-0.42153
247,-0.56619
248,-0.68693
249,-0.83536
250,-0.95757
251,-1.0822
252,-1.2048
253,-1.3351
254,-1.4732
255,-1.5871
256,-1.7112
257,-1.8523
258,-1.8806
259,-1.8246
260,-1.7528
261,-1.6592
262,-1.5589
263,-1.5011
264,-1.3977
265,-1.2890000000000001
266,-1.2312
267,-1.1717
268,-1.0911
269,-1.0111
270,-0.89938
271,-0.79355
272,-0.7179300000000001
273,-0.6738
274,-0.61325
275,-0.49727
276,-0.39816999999999997
277,-0.28162
278,-0.18269000000000002
279,-0.066988
280,0.032146
281,0.14172
282,0.27171999999999996
283,0.33248
284,0.44561999999999996
285,0.53375
286,0.61883
287,0.7279100000000001
288,0.84765
289,0.97567
290,1.0843
291,1.1281
292,1.1921
293,1.2005
294,1.199
295,1.1695
296,1.1308
297,1.0806
298,1.0025
299,0.9270299999999999
300,0.8344299999999999
301,0.74478
302,0.6614
303,0.56535
304,0.47723999999999994
305,0.38914
306,0.36577
307,0.40535
308,0.44451
309,0.45275
310,0.43818
311,0.38076
312,0.29513
313,0.21528000000000003
314,0.12470999999999999
315,0.039415
316,-0.033523000000000004
317,-0.11484000000000001
318,-0.1996
319,-0.29598
320,-0.37699
321,-0.4697
322,-0.55491
323,-0.65046
324,-0.73047
325,-0.81423
326,-0.8915200000000001
327,-0.9719399999999999
328,-1.05
329,-1.1372
330,-1.2124
331,-1.2946
332,-1.3855
333,-1.4727
334,-1.5549
335,-1.6232
336,-1.6941
337,-1.7583
338,-1.8198
339,-1.8789
340,-1.9272
341,-1.9583
342,-1.9976
343,-2.0241
344,-2.0331
345,-1.9338
346,-1.8339
347,-1.7156
348,-1.6207
349,-1.5279
350,-1.4227
351,-1.3174
352,-1.2106
353,-1.1255
354,-0.99731
355,-0.9150799999999999
356,-0.80823
357,-0.66576
358,-0.51549
359,-0.38627
360,-0.24051
361,-0.11465
362,0.01259
363,0.12532000000000001
364,0.24134
365,0.33052
366,0.39705999999999997
367,0.44427
368,0.45083999999999996
369,0.45985
370,0.45706
371,0.45103000000000004
372,0.43223
373,0.41158999999999996
374,0.40047
375,0.37466
376,0.34096
377,0.31344
378,0.28672
379,0.25106
380,0.2055
381,0.13954
382,0.099147
383,0.037125
384,-0.024771
385,-0.097978
386,-0.093797
387,0.021025
388,0.12988
389,0.24619000000000002
390,0.31454
391,0.3738
392,0.39854
393,0.42443000000000003
394,0.43821000000000004
395,0.44896
396,0.44405
397,0.44387
398,0.44075
399,0.43654
400,0.42446000000000006
401,0.42986
402,0.43701999999999996
403,0.43827
404,0.44616999999999996
405,0.46395
406,0.47523999999999994
407,0.46238999999999997
408,0.50867
409,0.57107
410,0.63767
411,0.70421
412,0.77722
413,0.83905
414,0.8834200000000001
415,0.9444
416,1.0191
417,1.1718
418,1.2953
419,1.4216
420,1.5483
421,1.6579
422,1.7818
423,1.8918
424,1.9172
425,1.9254
426,1.9351
