time,value
0,-0.36594
1,-0.36594
2,-0.36594
3,-0.36594
4,-0.36594
5,-0.36594
6,-0.36594
7,-0.36594
8,-0.36594
9,-0.36594
10,-0.36594
11,-0.36594
12,-0.36594
13,-0.36594
14,-0.36594
15,-0.36594
16,-0.36594
17,-0.36594
18,-0.36594
19,-0.36594
20,-0.36594
21,-0.36594
22,-0.36594
23,-0.36594
24,-0.36594
25,-0.36594
26,-0.36594
27,-0.36594
28,-0.36594
29,-0.36594
30,-0.36594
31,-0.36594
32,-0.36594
33,-0.36594
34,-0.36594
35,-0.36594
36,-0.36594
37,-0.36594
38,-0.36594
39,-0.36594
40,-0.36594
41,-0.36594
42,-0.36594
43,-0.36594
44,-0.36594
45,-0.36594
46,-0.36594
47,-0.36594
48,-0.36594
49,-0.36594
50,-0.36594
51,-0.36594
52,-0.36594
53,-0.36594
54,-0.36594
55,-0.36594
56,-0.36594
57,-0.36594
58,-0.36594
59,-0.36594
60,-0.36594
61,-0.36594
62,-0.36594
63,-0.36594
64,-0.36594
65,-0.36594
66,-0.36594
67,-0.36594
68,-0.36594
69,-0.36594
70,-0.36594
71,-0.36594
72,-0.36594
73,-0.36594
74,-0.36594
75,-0.36594
76,-0.36594
77,-0.36594
78,1.483
79,3.0401
80,2.9428
81,2.9428
82,2.9428
83,2.9428
84,2.6508
85,2.5535
86,2.5535
87,2.7481
88,3.0401
89,0.89915
90,-0.36594
91,-0.36594
92,-0.36594
93,-0.36594
94,-0.36594
95,-0.36594
