[<text>
<title>hooper holmes sherlock inc &lt;hoop&gt; 4th qtr net</title>
<dateline>    basking ridge, n.j., march 5 -
    </dateline>shr 22 cts vs 25 cts
    net 472,000 vs 454,000
    revs 16.2 mln vs 15.2 mln
    avg shrs 2,135,315 vs 1,835,325
    12 mths
    shr 71 cts vs 70 cts
    net 1,393,000 vs 1,285,000
    rwevs 61,805,000 vs 55,367,000
    avg shares 1,960,319 vs 1,835,325
 reuter
</text>]