{
  "about": {
    "datasetID": "LL1_50words_dataset",
    "datasetName": "LL1_50words",
    "description": "one of UCR datasets for timeseries classification",
    "citation": " @misc{UCRArchive2018,        title = {The UCR Time Series Classification Archive},        author = {Dau, Hoang Anh and Keogh, Eamonn and Kamgar, Kaveh and Yeh, Chin-Chia Michael and Zhu, Yan                   and Gharghabi, Shaghayegh and Ratanamahatana, Chotirat Ann and Yanping and Hu, Bing                   and Begum, Nurjahan and Bagnall, Anthony and Mueen, Abdullah and Batista, Gustavo},        year = {2018},        month = {October},        note = {url{https://www.cs.ucr.edu/~eamonn/time_series_data_2018/}}    } ",
    "license": "Unknown public",
    "source": "UCR",
    "sourceURI": "http://www.cs.ucr.edu/~eamonn/time_series_data/",
    "datasetSchemaVersion": "4.0.0",
    "redacted": false,
    "datasetVersion": "4.0.0",
    "digest": "90aaff57e7ad9ecd6eb6ddc3988f21b6aff1cc19ae768f1c65d0403b3d8bd4ed"
  },
  "dataResources": [
    {
      "resID": "0",
      "resPath": "timeseries/",
      "resType": "timeseries",
      "resFormat": {
        "text/csv": [
          "csv"
        ]
      },
      "isCollection": true
    },
    {
      "resID": "learningData",
      "resPath": "tables/learningData.csv",
      "resType": "table",
      "resFormat": {
        "text/csv": [
          "csv"
        ]
      },
      "isCollection": false,
      "columns": [
        {
          "colIndex": 0,
          "colName": "d3mIndex",
          "colType": "integer",
          "role": [
            "index"
          ]
        },
        {
          "colIndex": 1,
          "colName": "timeseries_file",
          "colType": "string",
          "role": [
            "attribute"
          ],
          "refersTo": {
            "resID": "0",
            "resObject": "item"
          }
        },
        {
          "colIndex": 2,
          "colName": "label",
          "colType": "categorical",
          "role": [
            "suggestedTarget"
          ]
        }
      ],
      "columnsCount": 3
    }
  ]
}