time,value
0,-2.0072
1,-1.9888
2,-1.9644
3,-1.9340000000000002
4,-1.8975
5,-1.8549
6,-1.8066
7,-1.7530000000000001
8,-1.6945
9,-1.6319
10,-1.5669
11,-1.4992
12,-1.4295
13,-1.3582
14,-1.2856
15,-1.2123
16,-1.1385
17,-1.0645
18,-0.9908
19,-0.9188
20,-0.84798
21,-0.77861
22,-0.7109
23,-0.6450600000000001
24,-0.58121
25,-0.5195
26,-0.45998
27,-0.40271
28,-0.34891
29,-0.29752
30,-0.24825999999999998
31,-0.20076
32,-0.15459
33,-0.10926
34,-0.06429
35,-0.019244
36,0.026235
37,0.071131
38,0.11663
39,0.16293
40,0.21014000000000002
41,0.25829
42,0.30734
43,0.35712
44,0.40739000000000003
45,0.4578
46,0.50671
47,0.5546800000000001
48,0.60138
49,0.64653
50,0.68989
51,0.73125
52,0.7704300000000001
53,0.8072600000000001
54,0.84157
55,0.872
56,0.89936
57,0.9236
58,0.9447399999999999
59,0.9628399999999999
60,0.97796
61,0.99016
62,0.9994799999999999
63,1.0059
64,1.0083
65,1.0076
66,1.0039
67,0.99724
68,0.9878600000000001
69,0.9759
70,0.96152
71,0.94486
72,0.92605
73,0.90386
74,0.87945
75,0.85306
76,0.82496
77,0.79548
78,0.7649699999999999
79,0.73378
80,0.70223
81,0.67064
82,0.63783
83,0.6052
84,0.57316
85,0.5421
86,0.51243
87,0.48455
88,0.45878
89,0.43538999999999994
90,0.41458
91,0.39495
92,0.37773
93,0.36305
94,0.35102
95,0.34174
96,0.33528
97,0.33166
98,0.33084
99,0.33271999999999996
100,0.33564
101,0.34069
102,0.34778000000000003
103,0.35683000000000004
104,0.36776
105,0.38049
106,0.39492
107,0.41093
108,0.42833000000000004
109,0.44538
110,0.46331000000000006
111,0.48198
112,0.50127
113,0.52105
114,0.54118
115,0.56148
116,0.5817899999999999
117,0.60188
118,0.6199600000000001
119,0.63735
120,0.65388
121,0.6693600000000001
122,0.6835899999999999
123,0.6963600000000001
124,0.70744
125,0.71662
126,0.7236899999999999
127,0.72695
128,0.72787
129,0.72637
130,0.72245
131,0.7161
132,0.7074
133,0.6964600000000001
134,0.68347
135,0.66868
136,0.6509699999999999
137,0.63238
138,0.61335
139,0.59435
140,0.57582
141,0.55819
142,0.54189
143,0.5273
144,0.51478
145,0.5033
146,0.49481
147,0.48956000000000005
148,0.48771000000000003
149,0.48931
150,0.49435
151,0.50275
152,0.5144
153,0.5291899999999999
154,0.54573
155,0.5655
156,0.58837
157,0.6141
158,0.64244
159,0.67308
160,0.7056899999999999
161,0.73992
162,0.77542
163,0.81077
164,0.84705
165,0.88389
166,0.92081
167,0.9572700000000001
168,0.99272
169,1.0266
170,1.0582
171,1.0871
172,1.112
173,1.1335
174,1.1514
175,1.1654
176,1.175
177,1.1802
178,1.1807
179,1.1765
180,1.1677
181,1.1536
182,1.1356
183,1.114
184,1.0892
185,1.0616
186,1.0314
187,0.9989399999999999
188,0.9646
189,0.9286700000000001
190,0.89061
191,0.8518
192,0.81245
193,0.77267
194,0.73248
195,0.69185
196,0.65071
197,0.6089600000000001
198,0.56652
199,0.52246
200,0.47791000000000006
201,0.43283
202,0.38711999999999996
203,0.34071999999999997
204,0.29352
205,0.24547
206,0.19654000000000002
207,0.14673
208,0.095197
209,0.043275
210,-0.008933499999999999
211,-0.061364999999999996
212,-0.11398
213,-0.16674
214,-0.21961
215,-0.27253
216,-0.32544
217,-0.37916
218,-0.43227
219,-0.48465
220,-0.53625
221,-0.58709
222,-0.6371899999999999
223,-0.6866300000000001
224,-0.73549
225,-0.78386
226,-0.8327200000000001
227,-0.8808600000000001
228,-0.92832
229,-0.9752299999999999
230,-1.0217
231,-1.0678
232,-1.1137
233,-1.1594
234,-1.2049
235,-1.251
236,-1.2964
237,-1.3408
238,-1.3841
239,-1.4264
240,-1.4674
241,-1.5071
242,-1.5456
243,-1.5828
244,-1.6196
245,-1.6547
246,-1.6881
247,-1.72
248,-1.7504
249,-1.7795
250,-1.8073
251,-1.8339
252,-1.8592
253,-1.8841
254,-1.9071
255,-1.9281
256,-1.9469
257,-1.9635
258,-1.9777
259,-1.9896
260,-1.9992
261,-2.0065
262,-2.0129
263,-2.0168
264,-2.0187
265,-2.0188
266,-2.0175
267,-2.0152
268,-2.0125
269,-2.0097
