time,value
0,-0.18375
1,-0.18375
2,-0.18375
3,-0.18375
4,-0.18375
5,-0.18375
6,-0.18375
7,-0.18375
8,-0.18375
9,-0.18375
10,-0.18375
11,-0.18375
12,-0.18375
13,-0.18375
14,-0.18375
15,-0.18375
16,-0.18375
17,-0.18375
18,-0.18375
19,-0.18375
20,-0.18375
21,-0.18375
22,-0.18375
23,-0.18375
24,-0.18375
25,-0.18375
26,-0.18375
27,-0.18375
28,-0.18375
29,-0.18375
30,-0.18375
31,-0.18375
32,-0.18375
33,-0.18375
34,-0.18375
35,-0.18375
36,-0.18375
37,-0.18375
38,-0.18375
39,-0.18375
40,-0.18375
41,-0.18375
42,-0.18375
43,-0.18375
44,-0.18375
45,-0.18375
46,-0.18375
47,-0.18375
48,0.037075
49,6.441
50,0.64759
51,0.037075
52,0.050064
53,0.024085
54,6.7268
55,2.2064
56,-0.18375
57,-0.18375
58,-0.18375
59,-0.18375
60,-0.18375
61,-0.18375
62,-0.18375
63,-0.18375
64,-0.18375
65,-0.18375
66,-0.18375
67,-0.18375
68,-0.18375
69,-0.18375
70,-0.18375
71,-0.18375
72,-0.18375
73,-0.18375
74,-0.18375
75,-0.18375
76,-0.18375
77,-0.18375
78,-0.18375
79,-0.18375
80,-0.18375
81,-0.18375
82,-0.18375
83,-0.18375
84,-0.18375
85,-0.18375
86,-0.18375
87,-0.18375
88,-0.18375
89,-0.18375
90,-0.18375
91,-0.18375
92,-0.18375
93,-0.18375
94,-0.18375
95,-0.18375
