time,value
0,-0.12137
1,-0.12137
2,-0.12137
3,-0.12137
4,-0.12137
5,-0.12137
6,-0.12137
7,-0.12137
8,-0.12137
9,-0.12137
10,-0.12137
11,-0.12137
12,-0.12137
13,-0.12137
14,-0.12137
15,-0.12137
16,-0.12137
17,-0.12137
18,-0.12137
19,-0.12137
20,-0.12137
21,-0.12137
22,-0.12137
23,-0.12137
24,-0.12137
25,-0.12137
26,-0.12137
27,-0.12137
28,-0.12137
29,-0.12137
30,9.4817
31,-0.12137
32,-0.12137
33,-0.12137
34,-0.12137
35,-0.12137
36,-0.12137
37,-0.12137
38,-0.12137
39,-0.12137
40,-0.12137
41,-0.12137
42,-0.12137
43,-0.12137
44,-0.12137
45,-0.12137
46,-0.12137
47,-0.12137
48,-0.12137
49,-0.12137
50,-0.12137
51,-0.12137
52,-0.12137
53,-0.12137
54,-0.12137
55,-0.12137
56,-0.12137
57,-0.12137
58,-0.12137
59,-0.12137
60,-0.12137
61,-0.12137
62,-0.12137
63,-0.12137
64,-0.12137
65,-0.12137
66,-0.12137
67,1.9267
68,-0.12137
69,-0.12137
70,-0.12137
71,-0.12137
72,-0.12137
73,-0.12137
74,-0.12137
75,-0.12137
76,-0.12137
77,-0.12137
78,-0.12137
79,-0.12137
80,-0.12137
81,-0.12137
82,-0.12137
83,-0.12137
84,-0.12137
85,-0.12137
86,-0.12137
87,-0.12137
88,-0.12137
89,-0.12137
90,-0.12137
91,-0.12137
92,-0.12137
93,-0.12137
94,-0.12137
95,-0.12137
