time,value
0,-0.27926999999999996
1,-0.27926999999999996
2,-0.27926999999999996
3,-0.27926999999999996
4,-0.27926999999999996
5,-0.27926999999999996
6,-0.27926999999999996
7,-0.27926999999999996
8,-0.27926999999999996
9,-0.27926999999999996
10,-0.27926999999999996
11,-0.27926999999999996
12,-0.27926999999999996
13,-0.27926999999999996
14,-0.27926999999999996
15,-0.27926999999999996
16,-0.27926999999999996
17,-0.27926999999999996
18,-0.27926999999999996
19,-0.27926999999999996
20,-0.27926999999999996
21,-0.27926999999999996
22,-0.27926999999999996
23,-0.27926999999999996
24,-0.27926999999999996
25,-0.27926999999999996
26,-0.27926999999999996
27,-0.27926999999999996
28,-0.27926999999999996
29,-0.27926999999999996
30,-0.27926999999999996
31,-0.27926999999999996
32,-0.27926999999999996
33,-0.27926999999999996
34,-0.27926999999999996
35,3.0362
36,-0.27926999999999996
37,-0.27926999999999996
38,4.5915
39,-0.27926999999999996
40,-0.27926999999999996
41,-0.27926999999999996
42,-0.27926999999999996
43,-0.27926999999999996
44,-0.27926999999999996
45,-0.27926999999999996
46,-0.27926999999999996
47,-0.27926999999999996
48,2.3813
49,-0.27926999999999996
50,1.8492
51,-0.27926999999999996
52,-0.27926999999999996
53,-0.27926999999999996
54,-0.27926999999999996
55,-0.27926999999999996
56,-0.27926999999999996
57,1.7673
58,-0.27926999999999996
59,-0.27926999999999996
60,-0.27926999999999996
61,-0.27926999999999996
62,5.0009
63,-0.27926999999999996
64,-0.27926999999999996
65,-0.27926999999999996
66,-0.27926999999999996
67,-0.27926999999999996
68,-0.27926999999999996
69,-0.27926999999999996
70,-0.27926999999999996
71,-0.27926999999999996
72,1.7673
73,-0.27926999999999996
74,-0.27926999999999996
75,-0.27926999999999996
76,-0.27926999999999996
77,-0.27926999999999996
78,-0.27926999999999996
79,-0.27926999999999996
80,-0.27926999999999996
81,-0.27926999999999996
82,-0.27926999999999996
83,-0.27926999999999996
84,-0.27926999999999996
85,4.1822
86,-0.27926999999999996
87,-0.27926999999999996
88,-0.27926999999999996
89,-0.27926999999999996
90,-0.27926999999999996
91,-0.27926999999999996
92,-0.27926999999999996
93,-0.27926999999999996
94,-0.27926999999999996
95,-0.27926999999999996
