{
  "about": {
    "problemID": "LL1_penn_fudan_pedestrian_problem",
    "problemName": "LL1_penn_fudan_pedestrian",
    "problemDescription": "Given an image, find the position of all of the pedestrians in the image. Each detection should be denoted using a bounding box [x_min, y_min, x_max, y_max].",
    "problemSchemaVersion": "4.0.0",
    "problemVersion": "4.0.0",
    "taskKeywords": [
      "objectDetection",
      "image"
    ]
  },
  "inputs": {
    "data": [
      {
        "datasetID": "LL1_penn_fudan_pedestrian_dataset",
        "targets": [
          {
            "targetIndex": 0,
            "resID": "learningData",
            "colIndex": 2,
            "colName": "bounding_box"
          }
        ]
      }
    ],
    "dataSplits": {
      "method": "holdOut",
      "testSize": 0.3,
      "stratified": false,
      "numRepeats": 0,
      "randomSeed": 0,
      "splitsFile": "dataSplits.csv",
      "datasetViewMaps": {
        "train": [
          {
            "from": "LL1_penn_fudan_pedestrian_dataset",
            "to": "LL1_penn_fudan_pedestrian_dataset_TRAIN"
          }
        ],
        "test": [
          {
            "from": "LL1_penn_fudan_pedestrian_dataset",
            "to": "LL1_penn_fudan_pedestrian_dataset_TEST"
          }
        ],
        "score": [
          {
            "from": "LL1_penn_fudan_pedestrian_dataset",
            "to": "LL1_penn_fudan_pedestrian_dataset_SCORE"
          }
        ]
      }
    },
    "performanceMetrics": [
      {
        "metric": "objectDetectionAP"
      }
    ]
  },
  "expectedOutputs": {
    "predictionsFile": "predictions.csv"
  }
}