time,value
0,-0.83491
1,-0.8236899999999999
2,-0.80632
3,-0.78587
4,-0.7669600000000001
5,-0.74965
6,-0.73245
7,-0.71478
8,-0.69465
9,-0.6721
10,-0.6489
11,-0.62435
12,-0.59833
13,-0.5717
14,-0.54433
15,-0.51781
16,-0.49396999999999996
17,-0.47217
18,-0.45131000000000004
19,-0.42912
20,-0.40199
21,-0.36819
22,-0.32735
23,-0.28023000000000003
24,-0.23001999999999997
25,-0.18
26,-0.1329
27,-0.091644
28,-0.05745700000000001
29,-0.030366000000000004
30,-0.010246
31,0.004358
32,0.014750999999999998
33,0.020991
34,0.023328
35,0.021399
36,0.014563999999999999
37,0.0034436999999999996
38,-0.011622
39,-0.030664999999999998
40,-0.052964
41,-0.078337
42,-0.10615999999999999
43,-0.13438
44,-0.16209
45,-0.18884
46,-0.21405
47,-0.23935
48,-0.26578
49,-0.29301
50,-0.32206999999999997
51,-0.35219
52,-0.3818
53,-0.41153
54,-0.43973999999999996
55,-0.46491000000000005
56,-0.4881
57,-0.5074
58,-0.52237
59,-0.53572
60,-0.5462199999999999
61,-0.55452
62,-0.56318
63,-0.5695100000000001
64,-0.57286
65,-0.57362
66,-0.56802
67,-0.55503
68,-0.5345300000000001
69,-0.504
70,-0.46438
71,-0.41778000000000004
72,-0.36529
73,-0.31104
74,-0.2585
75,-0.20905
76,-0.16485
77,-0.12605
78,-0.091912
79,-0.06365599999999999
80,-0.04154
81,-0.025377
82,-0.015262999999999999
83,-0.008632700000000002
84,-0.0027099
85,0.0033566000000000004
86,0.010352
87,0.017325999999999998
88,0.022036
89,0.024329
90,0.024138999999999997
91,0.020666999999999998
92,0.014256999999999999
93,0.0038485
94,-0.012171
95,-0.033319999999999995
96,-0.058925
97,-0.08795499999999999
98,-0.11824000000000001
99,-0.14916
100,-0.18094000000000002
101,-0.21308000000000002
102,-0.24602
103,-0.27923000000000003
104,-0.3111
105,-0.34169
106,-0.37056999999999995
107,-0.39724
108,-0.42278999999999994
109,-0.44613
110,-0.46593
111,-0.48308999999999996
112,-0.49700000000000005
113,-0.50812
114,-0.51904
115,-0.52864
116,-0.53606
117,-0.54301
118,-0.5474399999999999
119,-0.54923
120,-0.55229
121,-0.5535800000000001
122,-0.5522199999999999
123,-0.55267
124,-0.55032
125,-0.54472
126,-0.54182
127,-0.5362
128,-0.52768
129,-0.52245
130,-0.5151
131,-0.50653
132,-0.50168
133,-0.49413
134,-0.4842
135,-0.47439
136,-0.45818000000000003
137,-0.43688
138,-0.41205
139,-0.37847
140,-0.33868000000000004
141,-0.29285
142,-0.23535
143,-0.1665
144,-0.080626
145,0.032791
146,0.17893
147,0.36764
148,0.60677
149,0.8934
150,1.2243
151,1.5894
152,1.9691
153,2.3454
154,2.6962
155,2.9974
156,3.2344
157,3.4004
158,3.4981
159,3.5422
160,3.5485
161,3.5282
162,3.489
163,3.4317
164,3.3558
165,3.2643
166,3.1602
167,3.0460000000000003
168,2.9234
169,2.7894
170,2.6412
171,2.4781
172,2.3001
173,2.112
174,1.9199
175,1.7283
176,1.5438
177,1.3702
178,1.2072
179,1.058
180,0.92205
181,0.79573
182,0.6834600000000001
183,0.5829
184,0.49116000000000004
185,0.41348
186,0.34578000000000003
187,0.28578000000000003
188,0.23776999999999998
189,0.19577999999999998
190,0.15824000000000002
191,0.12809
192,0.09917000000000001
193,0.071993
194,0.048925
195,0.024197
196,-0.00013032
197,-0.022533
198,-0.047968000000000004
199,-0.072628
200,-0.09517300000000001
201,-0.11977
202,-0.14244
203,-0.16335999999999998
204,-0.18671
205,-0.20865999999999998
206,-0.22949
207,-0.25224
208,-0.27312
209,-0.29273000000000005
210,-0.31359000000000004
211,-0.33223
212,-0.34956
213,-0.36748000000000003
214,-0.38361
215,-0.39895
216,-0.41394
217,-0.42585
218,-0.43506000000000006
219,-0.44193999999999994
220,-0.44598000000000004
221,-0.44953000000000004
222,-0.45361999999999997
223,-0.45781000000000005
224,-0.46315
225,-0.46895
226,-0.47423000000000004
227,-0.47968999999999995
228,-0.4843
229,-0.48732
230,-0.48963
231,-0.49068999999999996
232,-0.49091
233,-0.49175
234,-0.49266000000000004
235,-0.49396999999999996
236,-0.49676000000000003
237,-0.50051
238,-0.50585
239,-0.51345
240,-0.52204
241,-0.5313899999999999
242,-0.54155
243,-0.55156
244,-0.56181
245,-0.57238
246,-0.58226
247,-0.59143
248,-0.5998100000000001
249,-0.60735
250,-0.61521
251,-0.62397
252,-0.63351
253,-0.64384
254,-0.6540199999999999
255,-0.66345
256,-0.67292
257,-0.6831699999999999
258,-0.69522
259,-0.70997
260,-0.72655
261,-0.74387
262,-0.7613800000000001
263,-0.77812
264,-0.79394
265,-0.80871
266,-0.82085
267,-0.82934
268,-0.8341200000000001
269,-0.8353799999999999
