time,value
0,-0.12791
1,1.3127
2,0.0092896
3,-1.0883
4,-0.74531
5,1.4499
6,0.35229
7,-1.0883
8,-1.0883
9,1.2441
10,0.90109
11,-1.0883
12,-1.0883
13,0.83249
14,1.2441
15,-1.0883
16,-1.0883
17,0.28369
18,1.3127
19,-0.67671
20,-1.0883
21,-0.19651
22,1.3127
23,-0.19651
24,-1.0883
25,-0.81391
26,1.3813
27,0.21509
28,-1.0883
29,-1.0883
30,1.3813
31,1.2441
32,-0.95111
33,-1.0883
34,0.077889
35,1.3127
36,-0.26511
37,-1.0883
38,-0.88251
39,1.4499
40,0.76389
41,-1.0883
42,-1.0883
43,0.69529
44,1.2441
45,-0.53951
46,-1.0883
47,-0.53951
48,1.3813
49,0.55809
50,-1.0883
51,-1.0883
52,1.0383
53,1.2441
54,-0.81391
55,-1.0883
56,0.0092896
57,1.3127
58,0.21509
59,-1.0883
60,-1.0883
61,1.2441
62,1.2441
63,-0.81391
64,-1.0883
65,0.0092896
66,1.2441
67,0.76389
68,-1.0883
69,-1.0883
70,0.76389
71,1.2441
72,0.0092896
73,-1.0883
74,-0.95111
75,1.3813
76,1.2441
77,-0.40231
78,-1.0883
79,-0.47091000000000005
80,1.3127
81,1.2441
82,-0.95111
83,-1.0883
84,0.21509
85,1.3127
86,0.42089
87,-1.0883
88,-1.0883
89,1.0383
90,1.2441
91,-0.33371
92,-1.0883
93,-0.47091000000000005
94,1.3127
95,0.76389
