time,value
0,-0.40357
1,-0.40357
2,-0.40357
3,-0.40357
4,-0.40357
5,-0.40357
6,-0.40357
7,-0.40357
8,-0.40357
9,-0.40357
10,-0.40357
11,-0.40357
12,-0.40357
13,-0.40357
14,-0.40357
15,-0.40357
16,-0.40357
17,-0.40357
18,-0.40357
19,-0.40357
20,-0.40357
21,-0.40357
22,-0.40357
23,-0.40357
24,-0.40357
25,-0.40357
26,-0.40357
27,-0.40357
28,-0.40357
29,-0.40357
30,-0.40357
31,-0.40357
32,-0.40357
33,-0.40357
34,-0.40357
35,-0.40357
36,-0.40357
37,-0.40357
38,-0.40357
39,-0.40357
40,-0.40357
41,-0.40357
42,-0.40357
43,-0.40357
44,-0.40357
45,-0.40357
46,-0.40357
47,-0.40357
48,-0.40357
49,-0.40357
50,-0.40357
51,-0.40357
52,-0.40357
53,-0.40357
54,0.9885299999999999
55,0.60887
56,3.3509
57,1.3598
58,1.4188
59,2.33
60,2.2625
61,1.925
62,2.1613
63,2.2878
64,2.4988
65,2.1275
66,3.14
67,3.8824
68,2.3469
69,-0.40357
70,-0.40357
71,-0.40357
72,-0.40357
73,-0.40357
74,-0.40357
75,-0.40357
76,-0.40357
77,-0.40357
78,-0.40357
79,-0.40357
80,-0.40357
81,-0.40357
82,-0.40357
83,-0.40357
84,-0.40357
85,-0.40357
86,-0.40357
87,-0.40357
88,-0.40357
89,-0.40357
90,-0.40357
91,-0.40357
92,-0.40357
93,-0.40357
94,-0.40357
95,-0.40357
