{
  "about": {
    "datasetID": "124_188_usps_dataset",
    "datasetName": "usps",
    "description": "Image recognition dataset consisting of 9298 16x16 images of 10 handwritten digits.",
    "citation": " @article{Cai11SRKDA, author = {Deng Cai and Xiaofei He and Jiawei Han}, title = {Speed Up Kernel Discriminant Analysis}, journal = {The VLDB Journal}, volume = {20}, number = {1},year = {2011},  pages = {21-33}} || @ARTICLE{Cai11SRKDA, AUTHOR = {Deng Cai and Xiaofei He and Jiawei Han}, TITLE = {Speed Up Kernel Discriminant Analysis}, JOURNAL = {The VLDB Journal}, YEAR = {2011}, volume = {20}, number = {1}, pages = {21-33}, } ",
    "license": " CC Public Domain Mark 1.0 ",
    "source": "USPS",
    "sourceURI": "http://www.cad.zju.edu.cn/home/dengcai/Data/MLData.html",
    "datasetSchemaVersion": "4.0.0",
    "redacted": false,
    "datasetVersion": "4.0.0",
    "digest": "47f887b0c335aa2b84e17b8912b226c8d98aa0fe49086075cf3ca23c84f3dd09"
  },
  "dataResources": [
    {
      "resID": "0",
      "resPath": "media/",
      "resType": "image",
      "resFormat": {
        "image/png": [
          "png"
        ]
      },
      "isCollection": true
    },
    {
      "resID": "learningData",
      "resPath": "tables/learningData.csv",
      "resType": "table",
      "resFormat": {
        "text/csv": [
          "csv"
        ]
      },
      "isCollection": false,
      "columns": [
        {
          "colIndex": 0,
          "colName": "d3mIndex",
          "colType": "integer",
          "role": [
            "index"
          ]
        },
        {
          "colIndex": 1,
          "colName": "image",
          "colType": "string",
          "role": [
            "attribute"
          ],
          "refersTo": {
            "resID": "0",
            "resObject": "item"
          }
        },
        {
          "colIndex": 2,
          "colName": "label",
          "colType": "categorical",
          "role": [
            "suggestedTarget"
          ]
        }
      ],
      "columnsCount": 3
    }
  ]
}