time,value
0,-0.13714
1,-0.13714
2,-0.13714
3,-0.13714
4,-0.13714
5,-0.13714
6,-0.13714
7,-0.13714
8,-0.13714
9,-0.13714
10,-0.13714
11,-0.13714
12,-0.13714
13,-0.13714
14,-0.13714
15,-0.13714
16,-0.13714
17,-0.13714
18,-0.13714
19,-0.13714
20,-0.13714
21,-0.13714
22,-0.13714
23,-0.13714
24,-0.13714
25,-0.13714
26,-0.13714
27,-0.13714
28,-0.13714
29,-0.13714
30,-0.13714
31,-0.13714
32,-0.13714
33,-0.13714
34,-0.13714
35,-0.13714
36,-0.13714
37,-0.13714
38,-0.13714
39,-0.13714
40,-0.13714
41,-0.13714
42,-0.13714
43,-0.13714
44,-0.13714
45,-0.13714
46,-0.13714
47,-0.13714
48,-0.13714
49,-0.13714
50,-0.13714
51,-0.13714
52,-0.13714
53,-0.13714
54,-0.13714
55,-0.13714
56,-0.13714
57,-0.13714
58,-0.13714
59,-0.13714
60,-0.13714
61,-0.13714
62,-0.13714
63,-0.13714
64,-0.13714
65,-0.13714
66,-0.13714
67,-0.13714
68,-0.13714
69,-0.13714
70,-0.13714
71,-0.13714
72,-0.13714
73,-0.13714
74,-0.13714
75,-0.13714
76,9.4775
77,0.8217399999999999
78,0.95132
79,1.3659999999999999
80,-0.13714
81,-0.13714
82,-0.13714
83,-0.13714
84,-0.13714
85,-0.13714
86,-0.13714
87,-0.13714
88,-0.13714
89,-0.13714
90,-0.13714
91,-0.13714
92,-0.13714
93,-0.13714
94,-0.13714
95,-0.13714
