time,value
0,0.9344299999999999
1,0.9344299999999999
2,0.9344299999999999
3,0.9344299999999999
4,-1.0590000000000002
5,0.9344299999999999
6,-1.0590000000000002
7,0.9344299999999999
8,-1.0590000000000002
9,0.9344299999999999
10,-1.0590000000000002
11,0.9344299999999999
12,-1.0590000000000002
13,0.9344299999999999
14,-1.0590000000000002
15,0.9344299999999999
16,0.9344299999999999
17,-1.0590000000000002
18,0.9344299999999999
19,-1.0590000000000002
20,0.9344299999999999
21,-1.0590000000000002
22,0.9344299999999999
23,-1.0590000000000002
24,0.9344299999999999
25,-1.0590000000000002
26,0.9344299999999999
27,-1.0590000000000002
28,0.9344299999999999
29,-1.0590000000000002
30,0.9344299999999999
31,-1.0590000000000002
32,0.9344299999999999
33,-1.0590000000000002
34,0.9344299999999999
35,-1.0590000000000002
36,0.9344299999999999
37,-1.0590000000000002
38,0.9344299999999999
39,-1.0590000000000002
40,0.9344299999999999
41,-1.0590000000000002
42,0.9344299999999999
43,-1.0590000000000002
44,0.9344299999999999
45,-1.0590000000000002
46,0.9344299999999999
47,-1.0590000000000002
48,0.9344299999999999
49,-1.0590000000000002
50,0.9344299999999999
51,-1.0590000000000002
52,0.9344299999999999
53,-1.0590000000000002
54,0.9344299999999999
55,0.9344299999999999
56,-1.0590000000000002
57,0.9344299999999999
58,-1.0590000000000002
59,0.9344299999999999
60,-1.0590000000000002
61,0.9344299999999999
62,-1.0590000000000002
63,0.9344299999999999
64,-1.0590000000000002
65,0.9344299999999999
66,-1.0590000000000002
67,0.9344299999999999
68,-1.0590000000000002
69,0.9344299999999999
70,-1.0590000000000002
71,0.9344299999999999
72,-1.0590000000000002
73,0.9344299999999999
74,-1.0590000000000002
75,0.9344299999999999
76,-1.0590000000000002
77,0.9344299999999999
78,-1.0590000000000002
79,0.9344299999999999
80,-1.0590000000000002
81,0.9344299999999999
82,-1.0590000000000002
83,0.9344299999999999
84,-1.0590000000000002
85,0.9344299999999999
86,-1.0590000000000002
87,0.9344299999999999
88,-1.0590000000000002
89,0.9344299999999999
90,-1.0590000000000002
91,0.9344299999999999
92,-1.0590000000000002
93,0.9344299999999999
94,0.9344299999999999
95,-1.0590000000000002
