time,value
0,1.1887
1,1.1374
2,1.1887
3,1.1374
4,1.1887
5,1.1887
6,0.93195
7,-1.0197
8,-0.9683299999999999
9,-0.9683299999999999
10,-0.9683299999999999
11,-0.9683299999999999
12,-0.86561
13,-1.0197
14,-0.9683299999999999
15,-0.9683299999999999
16,-0.9683299999999999
17,-0.9683299999999999
18,-0.9683299999999999
19,-0.9683299999999999
20,-0.9169700000000001
21,-0.9683299999999999
22,-0.9683299999999999
23,-0.9683299999999999
24,-1.0197
25,-0.9683299999999999
26,-0.9683299999999999
27,-0.9683299999999999
28,-1.0197
29,-0.9683299999999999
30,-0.9683299999999999
31,-0.9683299999999999
32,-0.6088100000000001
33,1.1887
34,1.1887
35,1.1887
36,1.0347
37,0.98331
38,0.98331
39,0.93195
40,1.1374
41,0.93195
42,0.98331
43,0.93195
44,0.93195
45,0.93195
46,0.98331
47,0.93195
48,0.98331
49,0.93195
50,0.93195
51,0.98331
52,0.98331
53,0.93195
54,0.93195
55,0.98331
56,1.0347
57,0.93195
58,0.93195
59,0.93195
60,0.98331
61,-0.19795
62,-0.9683299999999999
63,-0.9683299999999999
64,-0.9683299999999999
65,-0.9683299999999999
66,-0.9169700000000001
67,0.93195
68,0.98331
69,0.98331
70,0.93195
71,0.62379
72,-0.9683299999999999
73,-1.0197
74,-0.9683299999999999
75,-0.9683299999999999
76,-0.9683299999999999
77,-0.9683299999999999
78,-0.9683299999999999
79,-0.9683299999999999
80,-1.0197
81,-0.9683299999999999
82,-0.9683299999999999
83,-0.9683299999999999
84,-0.9683299999999999
85,-1.0197
86,-0.9683299999999999
87,-0.9683299999999999
88,-0.9683299999999999
89,-0.86561
90,1.1887
91,1.1887
92,1.1887
93,1.2401
94,1.1887
95,1.1887
