time,value
0,-0.36007
1,-0.36007
2,-0.36007
3,-0.36007
4,-0.36007
5,-0.36007
6,-0.36007
7,-0.36007
8,-0.36007
9,-0.36007
10,-0.36007
11,-0.36007
12,-0.36007
13,-0.36007
14,-0.36007
15,-0.36007
16,-0.36007
17,-0.36007
18,-0.36007
19,-0.36007
20,-0.36007
21,-0.36007
22,-0.36007
23,-0.36007
24,-0.36007
25,-0.36007
26,-0.36007
27,-0.36007
28,-0.36007
29,-0.36007
30,-0.36007
31,-0.36007
32,-0.36007
33,-0.36007
34,-0.36007
35,-0.36007
36,-0.36007
37,-0.36007
38,-0.36007
39,-0.36007
40,-0.36007
41,-0.36007
42,-0.36007
43,1.9993
44,3.4539
45,0.77382
46,3.2936
47,-0.16535999999999998
48,-0.18827
49,1.3236
50,3.6028
51,-0.36007
52,-0.36007
53,-0.36007
54,-0.36007
55,-0.36007
56,-0.36007
57,-0.36007
58,-0.36007
59,-0.36007
60,-0.36007
61,-0.36007
62,-0.36007
63,-0.36007
64,-0.36007
65,-0.36007
66,-0.36007
67,-0.36007
68,-0.36007
69,-0.36007
70,-0.36007
71,-0.36007
72,-0.36007
73,-0.36007
74,-0.36007
75,-0.36007
76,-0.36007
77,-0.36007
78,-0.36007
79,-0.36007
80,2.7438
81,3.8777
82,1.5756
83,1.713
84,-0.16535999999999998
85,-0.18827
86,3.3279
87,1.8275
88,-0.36007
89,-0.36007
90,-0.36007
91,-0.36007
92,-0.36007
93,-0.36007
94,-0.36007
95,-0.36007
