time,value
0,-0.31735
1,-0.31735
2,-0.31735
3,-0.31735
4,-0.31735
5,-0.31735
6,-0.31735
7,-0.31735
8,-0.31735
9,-0.31735
10,-0.31735
11,-0.31735
12,-0.31735
13,-0.31735
14,-0.31735
15,-0.31735
16,-0.31735
17,-0.31735
18,-0.31735
19,-0.31735
20,-0.31735
21,-0.31735
22,-0.31735
23,-0.31735
24,-0.31735
25,-0.31735
26,-0.31735
27,-0.31735
28,-0.31735
29,-0.31735
30,-0.31735
31,-0.31735
32,-0.31735
33,4.0778
34,4.2348
35,0.061998000000000004
36,-0.042649
37,-0.042649
38,-0.06881
39,-0.31735
40,-0.31735
41,-0.31735
42,-0.29118
43,4.7972
44,1.5794
45,-0.016487
46,-0.055729999999999995
47,-0.055729999999999995
48,-0.2127
49,-0.31735
50,3.5415
51,2.7697
52,0.035836
53,-0.055729999999999995
54,-0.029568
55,1.357
56,2.2727
57,-0.055729999999999995
58,-0.31735
59,-0.31735
60,-0.31735
61,-0.31735
62,-0.31735
63,-0.31735
64,-0.31735
65,-0.31735
66,-0.31735
67,-0.31735
68,-0.31735
69,-0.31735
70,-0.31735
71,-0.31735
72,-0.31735
73,-0.31735
74,-0.31735
75,-0.31735
76,-0.31735
77,-0.31735
78,-0.31735
79,-0.31735
80,-0.31735
81,-0.31735
82,-0.31735
83,-0.31735
84,-0.31735
85,-0.31735
86,-0.31735
87,-0.31735
88,-0.31735
89,-0.31735
90,-0.31735
91,-0.31735
92,-0.31735
93,-0.31735
94,-0.31735
95,-0.31735
