time,value
0,-0.82009
1,-0.82009
2,-0.82009
3,-0.82009
4,-0.82009
5,1.6164
6,1.3118
7,1.1595
8,-0.82009
9,-0.82009
10,-0.82009
11,-0.82009
12,-0.82009
13,-0.82009
14,1.3118
15,1.3118
16,1.3118
17,-0.51553
18,-0.82009
19,-0.82009
20,-0.82009
21,-0.82009
22,-0.82009
23,0.8549899999999999
24,1.3118
25,1.3118
26,1.1595
27,0.8549899999999999
28,-0.82009
29,-0.82009
30,-0.82009
31,-0.82009
32,-0.82009
33,-0.058691
34,1.6164
35,1.1595
36,1.1595
37,-0.058691
38,-0.82009
39,-0.82009
40,-0.82009
41,-0.82009
42,-0.82009
43,1.4641
44,1.3118
45,1.1595
46,1.1595
47,-0.51553
48,-0.82009
49,-0.82009
50,-0.82009
51,-0.82009
52,-0.82009
53,1.4641
54,1.3118
55,1.1595
56,0.093589
57,-0.82009
58,-0.82009
59,-0.82009
60,-0.82009
61,-0.82009
62,0.55043
63,1.4641
64,1.3118
65,1.0073
66,-0.82009
67,-0.82009
68,-0.82009
69,-0.82009
70,-0.82009
71,-0.82009
72,1.4641
73,1.4641
74,1.1595
75,1.1595
76,1.1595
77,-0.82009
78,-0.82009
79,-0.82009
80,-0.82009
81,-0.82009
82,-0.82009
83,1.4641
84,1.3118
85,1.1595
86,-0.36325
87,-0.82009
88,-0.82009
89,-0.82009
90,-0.82009
91,-0.82009
92,-0.36325
93,1.6164
94,1.3118
95,1.1595
