time,value
0,0.20876999999999998
1,0.5383899999999999
2,0.42326
3,0.29636
4,0.26185
5,0.28751
6,0.11120999999999999
7,0.33108000000000004
8,0.37847
9,0.094644
10,0.39860999999999996
11,0.45016000000000006
12,0.54683
13,0.62371
14,0.6867300000000001
15,0.70207
16,0.99336
17,1.1178
18,1.2211
19,1.18
20,1.3261
21,1.5012
22,1.5803
23,1.5782
24,1.3526
25,1.4144
26,1.6156
27,1.6762
28,1.5511
29,1.3298
30,1.7099
31,1.4352
32,0.9224600000000001
33,0.34486
34,-0.4088
35,-0.9808100000000001
36,-1.2158
37,-1.2427
38,-1.5189
39,-1.5919
40,-1.3202
41,-1.4432
42,-1.5217
43,-1.3894
44,-1.1057
45,-0.4936
46,-0.16305
47,-0.14327
48,-0.23565
49,-0.24328000000000002
50,-0.36673
51,-0.20648000000000002
52,-0.021636000000000002
53,-0.29266
54,-0.12559
55,-0.25544
56,-0.43668
57,-0.17687999999999998
58,-0.45876000000000006
59,-0.39174000000000003
60,-0.2041
61,-0.40943
62,-0.11366
63,-0.25082
64,-0.5656800000000001
65,-0.97326
66,-1.045
67,-1.0454
68,-1.7389
69,-1.671
70,-1.6229
71,-1.8682
72,-2.0214
73,-2.0749
74,-1.9880000000000002
75,-2.2632
76,-2.3435
77,-2.0954
78,-2.2586
79,-2.0369
80,-1.6372
81,-1.7123
82,-1.6305
83,-1.6926
84,-1.7915
85,-1.7895
86,-1.7456
87,-1.7728
88,-1.7543
89,-1.6054
90,-1.6377
91,-1.5115
92,-1.6714
93,-1.4601
94,-1.2212
95,-1.5512
96,-1.5161
97,-1.5636
98,-1.5151
99,-1.6414
100,-1.5123
101,-1.5066
102,-1.4425
103,-1.5435
104,-1.4648
105,-1.4633
106,-1.4313
107,-1.4151
108,-1.1739
109,-1.1637
110,-0.9884799999999999
111,-0.5434399999999999
112,-0.61865
113,-0.58487
114,0.17457999999999999
115,-0.27366999999999997
116,-0.44987
117,0.5542600000000001
118,-0.20919000000000001
119,-0.55247
120,0.045966
121,0.13758
122,-0.69899
123,-0.73387
124,-0.44226000000000004
125,-0.81758
126,-1.4852
127,-0.88674
128,-0.8743200000000001
129,-1.9011
130,-0.8648399999999999
131,-0.82362
132,-1.8925
133,-1.2551
134,-0.7811600000000001
135,-1.2498
136,-1.9709999999999999
137,-1.4124
138,-1.2192
139,-1.4497
140,-1.4052
141,-0.5093300000000001
142,0.43483
143,0.45998
144,-0.019818000000000002
145,-2.6175
146,1.4273
147,2.9765
148,1.3501
149,0.9496899999999999
150,1.7935
151,1.9499
152,1.1658
153,0.12974000000000002
154,0.58513
155,0.8988700000000001
156,0.88797
157,1.1340000000000001
158,1.2606
159,1.1697
160,0.9963299999999999
161,0.82125
162,0.68583
163,0.73869
164,1.0554
165,1.1441
166,0.99759
167,1.0614
168,1.0111
169,0.80491
170,0.94509
171,0.9144100000000001
172,0.8341700000000001
173,1.0814
174,1.1481
175,1.0671
176,0.8382799999999999
177,0.82645
178,0.77656
179,0.84701
180,0.99182
181,1.1318
182,1.0932
183,0.8216700000000001
184,0.69986
185,0.73705
186,1.0282
187,1.0045
188,0.79486
189,0.8420000000000001
190,0.8879799999999999
191,0.6077
192,0.58613
193,0.73759
194,0.60495
195,0.7825
196,0.9714
197,0.75031
198,0.58377
199,0.78315
200,0.78713
201,0.77484
202,0.5963
203,0.48791
204,0.39576999999999996
205,0.38952
206,0.51132
207,0.58152
208,0.34743
209,0.45474
210,0.2644
211,0.32411999999999996
212,0.48427
213,0.22293000000000002
214,0.22537
215,0.46313999999999994
216,0.6228
217,0.6437
218,0.64271
219,0.61257
220,0.39283
221,0.42386999999999997
222,0.54982
223,0.5534899999999999
224,0.42148
225,0.4716
226,0.6100800000000001
227,0.61053
228,0.69186
229,0.66513
230,0.66832
231,0.6410399999999999
232,0.61906
233,0.6172
234,0.5350699999999999
235,0.34918000000000005
236,0.3857
237,0.54189
238,0.39469
239,0.21486999999999998
240,0.25672
241,0.45796000000000003
242,0.47808
243,0.47236000000000006
244,0.27384000000000003
245,0.49337
246,0.23903000000000002
247,0.24199
248,0.50425
249,0.48633000000000004
250,0.2206
251,0.21902
252,0.48923
253,0.24921999999999997
254,0.21586
255,0.19983
256,0.2117
257,0.4969
258,0.49517
259,0.2652
260,0.26949
261,-0.021953
262,-0.030021
263,0.4221
264,0.48722
265,0.19387000000000001
266,0.17991
267,0.45118
268,0.46101000000000003
269,0.20085
270,0.47462
271,0.46307
272,0.46403999999999995
273,0.20002999999999999
274,0.46936000000000005
275,0.19867
276,0.19303
277,0.18188
278,0.16716
279,0.43016000000000004
280,0.4356
281,0.16709000000000002
282,0.15295
283,0.41922
284,0.24005
285,0.16196
286,0.16147999999999998
287,0.43632
288,0.43346999999999997
289,0.35472
290,0.14211
291,0.13312000000000002
292,0.13232
293,-0.11118
294,-0.072719
295,0.41953999999999997
296,0.41081000000000006
297,0.40278
298,0.13161
299,0.13563
