time,value
0,-1.2754
1,-1.2754
2,-1.2754
3,-1.2754
4,-1.2754
5,-1.2754
6,-1.2754
7,-0.7197100000000001
8,1.6883
9,1.6883
10,0.6695399999999999
11,0.94739
12,0.6695399999999999
13,0.48431
14,0.8547799999999999
15,0.57693
16,0.48431
17,0.7621600000000001
18,0.57693
19,0.39169
20,-0.44186000000000003
21,-1.2754
22,-1.2754
23,-1.2754
24,-1.2754
25,-1.2754
26,-1.2754
27,-1.2754
28,-1.2754
29,-1.2754
30,-1.2754
31,-1.2754
32,1.5957
33,1.2252
34,0.57693
35,0.94739
36,0.6695399999999999
37,0.57693
38,0.7621600000000001
39,0.57693
40,0.39169
41,0.7621600000000001
42,0.6695399999999999
43,0.39169
44,0.57693
45,0.6695399999999999
46,0.57693
47,0.29908
48,0.7621600000000001
49,0.48431
50,0.29908
51,0.57693
52,0.11384000000000001
53,0.57693
54,0.48431
55,2.0588
56,0.6695399999999999
57,0.48431
58,0.7621600000000001
59,0.94739
60,0.021225
61,-1.2754
62,-1.2754
63,-1.2754
64,-1.2754
65,-1.2754
66,-1.2754
67,1.2252
68,1.1326
69,0.7621600000000001
70,0.8547799999999999
71,0.8547799999999999
72,0.48431
73,0.57693
74,0.8547799999999999
75,0.7621600000000001
76,0.6695399999999999
77,0.57693
78,0.6695399999999999
79,0.8547799999999999
80,0.7621600000000001
81,0.57693
82,0.57693
83,0.7621600000000001
84,0.8547799999999999
85,0.94739
86,-0.81233
87,-1.2754
88,-1.2754
89,-1.2754
90,-1.2754
91,-1.2754
92,-1.2754
93,-1.2754
94,-1.2754
95,-1.2754
