[<text>
<title>republic american corp &lt;rawc.o&gt; 3rd qtr net</title>
<dateline>    encino, calif., oct 20 -
    </dateline>shr 36 cts vs 35 cts
    net 7,100,000 vs 8,000,000
    net premiums 61.2 mln vs 58.0 mln
    avg shrs 19,950,000 vs 22,760,000
    nine mths
    shr 1.03 dlrs vs 1.81 dlrs
    net 21.3 mln vs 37.8 mln
    net premiums 176.3 mln vs 141.8 mln
    avg shrs 20,682,000 vs 20,920,000
 reuter
</text>]