time,value
0,-0.38438
1,-0.38438
2,-0.38438
3,-0.38438
4,-0.38438
5,-0.38438
6,-0.38438
7,-0.38438
8,-0.38438
9,-0.38438
10,-0.38438
11,-0.38438
12,-0.38438
13,-0.38438
14,-0.38438
15,-0.38438
16,-0.38438
17,-0.38438
18,-0.38438
19,-0.38438
20,-0.38438
21,-0.38438
22,-0.38438
23,-0.38438
24,-0.38438
25,-0.38438
26,-0.38438
27,-0.38438
28,-0.38438
29,-0.38438
30,-0.38438
31,-0.38438
32,-0.38438
33,-0.38438
34,-0.38438
35,-0.38438
36,-0.38438
37,-0.38438
38,-0.38438
39,-0.38438
40,-0.38438
41,-0.38438
42,-0.38438
43,-0.38438
44,-0.38438
45,-0.38438
46,-0.38438
47,-0.38438
48,-0.38438
49,-0.38438
50,-0.38438
51,-0.38438
52,-0.38438
53,-0.38438
54,-0.38438
55,-0.38438
56,-0.38438
57,-0.38438
58,-0.38438
59,-0.38438
60,-0.38438
61,-0.38438
62,-0.38438
63,-0.38438
64,-0.38438
65,-0.38438
66,-0.38438
67,-0.38438
68,-0.38438
69,-0.38438
70,-0.38438
71,-0.38438
72,-0.38438
73,-0.38438
74,-0.38438
75,-0.38438
76,-0.38438
77,-0.38438
78,-0.38438
79,-0.38438
80,2.7466
81,2.7466
82,2.6348
83,2.7466
84,2.7466
85,2.8584
86,2.7466
87,2.8584
88,0.622
89,0.062899
90,-0.048922
91,2.523
92,2.8584
93,2.6348
94,0.39836
95,-0.38438
