time,value
0,-1.1434
1,-1.1434
2,0.29279
3,1.1819
4,0.42957
5,-1.1434
6,-1.1434
7,0.9083
8,1.1819
9,-0.3911
10,-1.1434
11,-0.73305
12,1.3186
13,1.1135
14,-1.1434
15,-1.1434
16,0.36118
17,1.2503
18,-0.18592999999999998
19,-1.1434
20,-0.8014399999999999
21,1.2503
22,0.77152
23,-1.1434
24,-1.1434
25,0.49796
26,1.1819
27,-0.52788
28,-1.1434
29,-0.45948999999999995
30,1.2503
31,0.36118
32,-1.1434
33,-1.1434
34,0.9083
35,1.1135
36,-0.52788
37,-1.1434
38,-0.3911
39,1.2503
40,0.97669
41,-1.1434
42,-1.1434
43,0.36118
44,1.1819
45,0.15600999999999998
46,-1.1434
47,-1.1434
48,1.3186
49,1.1819
50,0.49796
51,-1.1434
52,-1.1434
53,0.70313
54,1.1819
55,1.1135
56,-1.1434
57,-1.1434
58,0.019235
59,1.2503
60,0.70313
61,-1.1434
62,-1.1434
63,0.49796
64,1.1819
65,1.1135
66,-0.45948999999999995
67,-1.1434
68,-0.3911
69,1.2503
70,1.0451
71,1.0451
72,-0.73305
73,-1.1434
74,-0.3911
75,1.2503
76,1.1135
77,-0.18592999999999998
78,-1.1434
79,-0.8014399999999999
80,1.3186
81,1.1135
82,-0.11755
83,-1.1434
84,-1.0066
85,1.3869999999999998
86,1.1135
87,-0.11755
88,-1.1434
89,-0.8698299999999999
90,1.3186
91,1.1819
92,-0.32271
93,-1.1434
94,-0.8014399999999999
95,1.3186
