time,value
0,0.1135
1,1.7479
2,-0.068102
3,-0.79452
4,-0.79452
5,-0.24971
6,1.7479
7,0.1135
8,-0.79452
9,-0.79452
10,-0.79452
11,1.7479
12,0.47671
13,-0.79452
14,-0.79452
15,-0.79452
16,1.3847
17,1.0215
18,-0.79452
19,-0.79452
20,-0.79452
21,0.47671
22,1.7479
23,-0.79452
24,-0.79452
25,-0.79452
26,-0.43131
27,1.7479
28,0.29511
29,-0.79452
30,-0.79452
31,-0.79452
32,1.0215
33,1.2031
34,-0.79452
35,-0.79452
36,-0.79452
37,-0.068102
38,1.7479
39,-0.068102
40,-0.79452
41,-0.79452
42,-0.24971
43,1.7479
44,0.1135
45,-0.79452
46,-0.79452
47,-0.79452
48,1.2031
49,1.0215
50,-0.79452
51,-0.79452
52,-0.79452
53,1.9296
54,0.8399200000000001
55,-0.79452
56,-0.79452
57,-0.79452
58,1.0215
59,1.5663
60,-0.79452
61,-0.79452
62,-0.79452
63,1.5663
64,0.8399200000000001
65,-0.79452
66,-0.79452
67,-0.79452
68,1.2031
69,1.3847
70,-0.79452
71,-0.79452
72,-0.79452
73,0.29511
74,1.7479
75,1.0215
76,-0.79452
77,-0.79452
78,-0.79452
79,1.2031
80,1.3847
81,-0.79452
82,-0.79452
83,-0.79452
84,0.29511
85,1.7479
86,-0.43131
87,-0.79452
88,-0.79452
89,-0.79452
90,1.9296
91,0.65832
92,-0.79452
93,-0.79452
94,-0.79452
95,1.5663
