time,value
0,0.63834
1,0.63834
2,-1.5502
3,0.63834
4,0.63834
5,-1.5502
6,0.63834
7,0.63834
8,-1.5502
9,0.63834
10,0.63834
11,-1.5502
12,0.63834
13,0.63834
14,0.63834
15,-1.5502
16,0.63834
17,0.63834
18,0.63834
19,0.63834
20,-1.5502
21,0.63834
22,0.63834
23,0.63834
24,-1.5502
25,0.63834
26,0.63834
27,0.63834
28,-1.5502
29,0.63834
30,0.63834
31,0.63834
32,0.63834
33,-1.5502
34,0.63834
35,0.63834
36,0.63834
37,-1.5502
38,0.63834
39,-1.5502
40,0.63834
41,-1.5502
42,0.63834
43,-1.5502
44,0.63834
45,0.63834
46,-1.5502
47,0.63834
48,0.63834
49,0.63834
50,-1.5502
51,0.63834
52,0.63834
53,0.63834
54,0.63834
55,-1.5502
56,0.63834
57,0.63834
58,0.63834
59,0.63834
60,-1.5502
61,0.63834
62,0.63834
63,0.63834
64,0.63834
65,-1.5502
66,0.63834
67,0.63834
68,-1.5502
69,0.63834
70,-1.5502
71,0.63834
72,-1.5502
73,0.63834
74,0.63834
75,0.63834
76,-1.5502
77,0.63834
78,0.63834
79,0.63834
80,-1.5502
81,0.63834
82,0.63834
83,-1.5502
84,0.63834
85,-1.5502
86,0.63834
87,-1.5502
88,0.63834
89,0.63834
90,-1.5502
91,0.63834
92,0.63834
93,-1.5502
94,0.63834
95,0.63834
