time,value
0,-0.23842
1,-0.23842
2,-0.23842
3,-0.23842
4,-0.23842
5,-0.23842
6,-0.23842
7,-0.23842
8,-0.23842
9,-0.23842
10,-0.23842
11,-0.23842
12,-0.23842
13,-0.23842
14,-0.23842
15,-0.23842
16,-0.23842
17,-0.23842
18,-0.23842
19,-0.23842
20,-0.23842
21,-0.23842
22,-0.23842
23,-0.23842
24,-0.23842
25,-0.23842
26,-0.23842
27,-0.23842
28,-0.23842
29,-0.23842
30,-0.23842
31,-0.23842
32,-0.23842
33,-0.23842
34,-0.23842
35,-0.23842
36,-0.23842
37,-0.23842
38,-0.23842
39,-0.23842
40,-0.23842
41,-0.23842
42,-0.23842
43,-0.23842
44,-0.23842
45,-0.23842
46,-0.23842
47,-0.23842
48,-0.23842
49,-0.23842
50,-0.23842
51,-0.23842
52,-0.23842
53,-0.23842
54,-0.23842
55,-0.23842
56,-0.23842
57,-0.23842
58,-0.23842
59,-0.23842
60,-0.23842
61,-0.23842
62,-0.23842
63,-0.23842
64,-0.23842
65,-0.23842
66,-0.23842
67,-0.23842
68,-0.23842
69,-0.23842
70,-0.23842
71,4.1451
72,4.7591
73,0.30417
74,4.5021
75,-0.0099654
76,-0.024243999999999998
77,2.4031
78,4.9019
79,-0.23842
80,-0.23842
81,-0.23842
82,-0.23842
83,-0.23842
84,-0.23842
85,-0.23842
86,-0.23842
87,-0.23842
88,-0.23842
89,-0.23842
90,-0.23842
91,-0.23842
92,-0.23842
93,-0.23842
94,-0.23842
95,-0.23842
