time,value
0,-0.91446
1,-0.89392
2,-0.90148
3,-0.8819299999999999
4,-0.8582799999999999
5,-0.8448399999999999
6,-0.8235399999999999
7,-0.7846
8,-0.70921
9,-0.5545899999999999
10,-0.2903
11,0.081233
12,0.53095
13,0.99484
14,1.3945
15,1.6811
16,1.8477
17,1.9177
18,1.9085
19,1.8104
20,1.6261
21,1.4065
22,1.2045
23,1.0237
24,0.83542
25,0.62403
26,0.40126999999999996
27,0.18877
28,0.0050927
29,-0.1369
30,-0.23659000000000002
31,-0.30887
32,-0.35614
33,-0.38435
34,-0.40669
35,-0.42089
36,-0.43056000000000005
37,-0.4417
38,-0.45035
39,-0.45919
40,-0.46742
41,-0.47796000000000005
42,-0.49283999999999994
43,-0.49613
44,-0.49358
45,-0.48717
46,-0.47084
47,-0.4512
48,-0.42026
49,-0.36827
50,-0.29298
51,-0.17986
52,-0.0039055
53,0.29499000000000003
54,0.7700899999999999
55,1.3906
56,2.0604
57,2.6630000000000003
58,3.1075
59,3.3843
60,3.5541
61,3.6689999999999996
62,3.725
63,3.7044
64,3.6157
65,3.4632
66,3.2585
67,3.0357
68,2.8122
69,2.5952
70,2.3876
71,2.147
72,1.8368
73,1.4918
74,1.1331
75,0.78599
76,0.5492199999999999
77,0.41531
78,0.25183
79,0.035772000000000005
80,-0.15780999999999998
81,-0.31254
82,-0.45153999999999994
83,-0.55307
84,-0.59407
85,-0.59299
86,-0.5561
87,-0.48578000000000005
88,-0.41101000000000004
89,-0.34859
90,-0.30244
91,-0.27555
92,-0.25674
93,-0.24581999999999998
94,-0.24868
95,-0.26168
96,-0.28638
97,-0.32686
98,-0.37796
99,-0.43173999999999996
100,-0.48393
101,-0.53609
102,-0.58744
103,-0.63021
104,-0.66478
105,-0.69294
106,-0.7137600000000001
107,-0.73126
108,-0.74533
109,-0.75631
110,-0.76281
111,-0.7498100000000001
112,-0.70316
113,-0.60528
114,-0.44168999999999997
115,-0.22926999999999997
116,0.0016247
117,0.23206
118,0.44986000000000004
119,0.63865
120,0.77596
121,0.84939
122,0.8667299999999999
123,0.84655
124,0.81295
125,0.78185
126,0.7516
127,0.71241
128,0.65386
129,0.5697399999999999
130,0.4656
131,0.35554
132,0.24924000000000002
133,0.14751
134,0.04518
135,-0.057259000000000004
136,-0.14962
137,-0.22978
138,-0.30030999999999997
139,-0.36065
140,-0.41335
141,-0.45546000000000003
142,-0.48778999999999995
143,-0.5151100000000001
144,-0.5355300000000001
145,-0.5521199999999999
146,-0.5676399999999999
147,-0.57987
148,-0.59419
149,-0.61275
150,-0.6301399999999999
151,-0.64251
152,-0.64712
153,-0.6472399999999999
154,-0.64244
155,-0.62792
156,-0.60905
157,-0.58827
158,-0.56701
159,-0.5469
160,-0.52294
161,-0.49693000000000004
162,-0.46629
163,-0.4219
164,-0.37437
165,-0.32721999999999996
166,-0.24655
167,-0.09206900000000001
168,0.1408
169,0.40938
170,0.63822
171,0.76598
172,0.7951
173,0.77486
174,0.73418
175,0.6695800000000001
176,0.58486
177,0.49383999999999995
178,0.39602
179,0.28428000000000003
180,0.16005999999999998
181,0.028941
182,-0.097247
183,-0.20815
184,-0.30123
185,-0.3852
186,-0.47126999999999997
187,-0.55189
188,-0.61382
189,-0.65825
190,-0.68067
191,-0.67756
192,-0.65213
193,-0.5987600000000001
194,-0.50998
195,-0.37563
196,-0.19211
197,0.017754
198,0.21066999999999997
199,0.34233
200,0.39764
201,0.39913000000000004
202,0.36773
203,0.31287
204,0.248
205,0.17912999999999998
206,0.10107999999999999
207,0.014321
208,-0.06989400000000001
209,-0.14398
210,-0.21335
211,-0.28321999999999997
212,-0.34526
213,-0.39015
214,-0.41788000000000003
215,-0.43107
216,-0.43718
217,-0.44628
218,-0.46301000000000003
219,-0.4869
220,-0.50759
221,-0.51964
222,-0.53245
223,-0.55261
224,-0.5785600000000001
225,-0.6030800000000001
226,-0.6232
227,-0.64532
228,-0.669
229,-0.69015
230,-0.70806
231,-0.72008
232,-0.72664
233,-0.7290000000000001
234,-0.7256100000000001
235,-0.7157399999999999
236,-0.69447
237,-0.65003
238,-0.57622
239,-0.47889
240,-0.37371
241,-0.28631
242,-0.24086
243,-0.24556999999999998
244,-0.29439
245,-0.37908000000000003
246,-0.48841
247,-0.60307
248,-0.70811
249,-0.80078
250,-0.87825
251,-0.9374399999999999
252,-0.9797
253,-1.0084
254,-1.0270000000000001
255,-1.038
256,-1.0423
257,-1.0433
258,-1.0421
259,-1.0296
260,-0.9910399999999999
261,-0.91871
262,-0.83099
263,-0.76188
264,-0.73147
265,-0.74144
266,-0.78015
267,-0.8350799999999999
268,-0.9073700000000001
269,-0.98926
