time,value
0,-0.16249
1,-0.16249
2,-0.16249
3,-0.16249
4,-0.16249
5,-0.16249
6,-0.16249
7,-0.16249
8,-0.16249
9,-0.16249
10,-0.16249
11,-0.16249
12,-0.16249
13,-0.16249
14,-0.16249
15,-0.16249
16,-0.16249
17,-0.16249
18,-0.16249
19,-0.16249
20,-0.16249
21,-0.16249
22,-0.16249
23,-0.16249
24,-0.16249
25,-0.16249
26,-0.16249
27,-0.16249
28,-0.16249
29,-0.16249
30,-0.16249
31,-0.16249
32,-0.16249
33,-0.16249
34,-0.16249
35,-0.16249
36,-0.16249
37,-0.16249
38,-0.16249
39,-0.16249
40,-0.16249
41,-0.16249
42,-0.16249
43,-0.16249
44,-0.16249
45,-0.16249
46,-0.16249
47,-0.16249
48,-0.16249
49,-0.16249
50,-0.16249
51,-0.16249
52,-0.16249
53,-0.16249
54,-0.16249
55,-0.16249
56,-0.16249
57,-0.16249
58,-0.16249
59,-0.16249
60,-0.16249
61,-0.16249
62,-0.16249
63,-0.16249
64,-0.16249
65,-0.16249
66,-0.16249
67,-0.16249
68,-0.16249
69,-0.16249
70,-0.16249
71,-0.16249
72,-0.16249
73,-0.16249
74,-0.16249
75,-0.16249
76,7.699
77,-0.16249
78,-0.16249
79,-0.16249
80,-0.16249
81,-0.16249
82,5.4086
83,2.0041
84,-0.16249
85,-0.16249
86,-0.16249
87,-0.16249
88,-0.16249
89,-0.16249
90,-0.16249
91,-0.16249
92,-0.16249
93,-0.16249
94,-0.16249
95,-0.16249
