time,value
0,-0.30339
1,-0.30743000000000004
2,-0.28315
3,-0.30541
4,-0.30946
5,-0.27910999999999997
6,-0.30136
7,-0.30946
8,-0.27505999999999997
9,-0.29529
10,-0.30946
11,-0.28518000000000004
12,-0.29327
13,-0.30743000000000004
14,-0.28315
15,-0.29327
16,-0.30339
17,-0.2872
18,-0.29529
19,-0.3135
20,-0.28922
21,-0.29125
22,-0.31148000000000003
23,-0.29529
24,-0.28922
25,-0.30541
26,-0.2872
27,-0.28315
28,-0.30339
29,-0.27304
30,-0.27101
31,-0.29934
32,-0.28113
33,-0.26697
34,-0.29732
35,-0.28518000000000004
36,-0.28518000000000004
37,-0.29732
38,-0.29125
39,-0.28518000000000004
40,-0.30339
41,-0.2872
42,-0.2872
43,-0.30743000000000004
44,-0.29732
45,-0.28922
46,-0.30743000000000004
47,-0.29529
48,-0.29327
49,-0.30541
50,-0.29125
51,-0.29327
52,-0.30541
53,-0.28315
54,-0.29529
55,-0.30743000000000004
56,-0.28315
57,-0.29327
58,-0.30743000000000004
59,-0.28113
60,-0.30136
61,-0.30136
62,-0.28315
63,-0.30541
64,-0.30339
65,-0.27910999999999997
66,-0.30946
67,-0.30339
68,-0.29125
69,-0.31148000000000003
70,-0.30339
71,-0.29529
72,-0.27505999999999997
73,4.0426
74,3.5226
75,3.3567
76,3.4255
77,3.2819
78,3.3082
79,3.472
80,1.38
81,-0.2609
82,-0.25078
83,-0.26292
84,-0.27505999999999997
85,-0.27304
86,-0.2872
87,-0.29732
88,-0.28315
89,-0.30541
90,-0.29732
91,-0.2872
92,-0.31148000000000003
93,-0.28922
94,-0.28922
95,-0.3135
