time,value
0,-0.13639
1,-0.9347799999999999
2,-0.9347799999999999
3,-0.9347799999999999
4,-0.9347799999999999
5,-0.9347799999999999
6,0.34264
7,1.4604
8,1.3007
9,1.141
10,0.34264
11,-0.9347799999999999
12,-0.9347799999999999
13,-0.9347799999999999
14,-0.9347799999999999
15,-0.9347799999999999
16,-0.45575
17,1.6201
18,1.141
19,1.141
20,0.023286
21,-0.9347799999999999
22,-0.9347799999999999
23,-0.9347799999999999
24,-0.9347799999999999
25,-0.9347799999999999
26,0.50232
27,1.4604
28,1.141
29,1.141
30,-0.45575
31,-0.9347799999999999
32,-0.9347799999999999
33,-0.9347799999999999
34,-0.9347799999999999
35,-0.9347799999999999
36,1.3007
37,1.3007
38,1.141
39,1.141
40,0.34264
41,-0.9347799999999999
42,-0.9347799999999999
43,-0.9347799999999999
44,-0.9347799999999999
45,-0.9347799999999999
46,0.18295999999999998
47,1.4604
48,1.141
49,1.141
50,1.141
51,0.023286
52,-0.9347799999999999
53,-0.9347799999999999
54,-0.9347799999999999
55,-0.9347799999999999
56,-0.9347799999999999
57,0.34264
58,1.4604
59,1.3007
60,1.141
61,1.141
62,1.141
63,0.023286
64,-0.9347799999999999
65,-0.9347799999999999
66,-0.9347799999999999
67,-0.9347799999999999
68,-0.9347799999999999
69,0.18295999999999998
70,1.4604
71,1.141
72,1.3007
73,1.141
74,0.98135
75,-0.45575
76,-0.9347799999999999
77,-0.9347799999999999
78,-0.9347799999999999
79,-0.9347799999999999
80,-0.9347799999999999
81,0.66199
82,1.4604
83,1.141
84,1.141
85,0.50232
86,-0.9347799999999999
87,-0.9347799999999999
88,-0.9347799999999999
89,-0.9347799999999999
90,-0.9347799999999999
91,-0.9347799999999999
92,1.6201
93,1.3007
94,1.141
95,-0.29607
