time,value
0,-0.24186
1,-0.24186
2,-0.24186
3,-0.24186
4,-0.24186
5,-0.24186
6,-0.24186
7,-0.24186
8,-0.24186
9,-0.24186
10,-0.24186
11,-0.24186
12,-0.24186
13,-0.24186
14,-0.24186
15,-0.24186
16,-0.24186
17,-0.24186
18,-0.24186
19,-0.24186
20,-0.24186
21,-0.24186
22,-0.24186
23,-0.24186
24,-0.24186
25,-0.24186
26,-0.24186
27,-0.24186
28,-0.24186
29,-0.24186
30,-0.24186
31,-0.24186
32,-0.24186
33,-0.24186
34,-0.24186
35,-0.24186
36,4.5278
37,-0.06187
38,-0.24186
39,-0.24186
40,3.8978
41,-0.24186
42,-0.24186
43,-0.24186
44,-0.24186
45,0.74807
46,3.8528
47,-0.24186
48,-0.24186
49,-0.24186
50,-0.24186
51,-0.24186
52,-0.24186
53,-0.24186
54,-0.24186
55,-0.24186
56,-0.24186
57,-0.24186
58,-0.24186
59,-0.24186
60,-0.24186
61,-0.24186
62,5.2927
63,-0.24186
64,-0.24186
65,-0.24186
66,-0.24186
67,-0.24186
68,-0.24186
69,-0.24186
70,-0.24186
71,-0.24186
72,-0.24186
73,-0.24186
74,-0.24186
75,-0.24186
76,-0.24186
77,-0.24186
78,-0.24186
79,-0.24186
80,-0.24186
81,-0.24186
82,-0.24186
83,3.2679
84,-0.24186
85,-0.24186
86,-0.24186
87,-0.24186
88,-0.24186
89,-0.24186
90,-0.24186
91,-0.24186
92,-0.24186
93,-0.24186
94,-0.24186
95,-0.24186
