time,value
0,0.29768
1,1.2316
2,-1.5701
3,-0.075879
4,1.4183
5,-1.1965
6,0.1109
7,0.85801
8,-0.63621
9,0.29768
10,1.0448
11,-1.0098
12,0.85801
13,1.0448
14,-1.1965
15,0.48446000000000006
16,1.7919
17,-1.0098
18,-0.075879
19,1.0448
20,-1.0098
21,0.1109
22,1.0448
23,-0.44943
24,0.29768
25,0.48446000000000006
26,-1.1965
27,1.2316
28,0.85801
29,0.29768
30,1.7919
31,1.0448
32,-1.0098
33,1.6051
34,0.67123
35,-0.075879
36,3.2861
37,0.67123
38,-0.63621
39,1.4183
40,-0.44943
41,-0.26266
42,1.6051
43,-1.1965
44,-0.26266
45,1.0448
46,-1.0098
47,0.1109
48,0.1109
49,-1.1965
50,0.29768
51,-0.26266
52,-1.7569
53,1.6051
54,-0.82299
55,-1.1965
56,1.0448
57,-0.82299
58,-1.0098
59,0.48446000000000006
60,-1.5701
61,-0.26266
62,0.1109
63,-1.7569
64,0.48446000000000006
65,-0.44943
66,-1.7569
67,0.48446000000000006
68,-0.26266
69,-0.075879
70,1.2316
71,-1.1965
72,-0.075879
73,0.48446000000000006
74,-1.3833
75,0.29768
76,0.48446000000000006
77,-1.3833
78,0.48446000000000006
79,-0.26266
80,-0.44943
81,1.0448
82,-0.82299
83,0.1109
84,0.48446000000000006
85,-0.26266
86,1.2316
87,-0.82299
88,-0.82299
89,0.48446000000000006
90,-1.3833
91,-0.26266
92,-0.075879
93,-1.7569
94,0.1109
95,-0.63621
