time,value
0,-0.15991
1,-0.15991
2,-0.15991
3,-0.15991
4,-0.15991
5,-0.15991
6,-0.15991
7,-0.15991
8,-0.15991
9,-0.15991
10,-0.15991
11,-0.15991
12,-0.15991
13,-0.15991
14,-0.15991
15,-0.15991
16,-0.15991
17,-0.15991
18,-0.15991
19,-0.15991
20,-0.15991
21,-0.15991
22,-0.15991
23,-0.15991
24,-0.15991
25,-0.15991
26,-0.15991
27,-0.15991
28,-0.15991
29,-0.15991
30,-0.15991
31,-0.15991
32,-0.15991
33,-0.15991
34,-0.15991
35,-0.15991
36,-0.15991
37,-0.15991
38,-0.15991
39,-0.15991
40,5.7267
41,-0.15991
42,-0.15991
43,-0.15991
44,-0.15991
45,-0.15991
46,-0.15991
47,-0.15991
48,-0.15991
49,-0.15991
50,-0.15991
51,-0.15991
52,-0.15991
53,-0.15991
54,-0.15991
55,-0.15991
56,-0.15991
57,-0.15991
58,-0.15991
59,-0.15991
60,-0.15991
61,-0.15991
62,-0.15991
63,-0.15991
64,-0.15991
65,-0.15991
66,-0.15991
67,-0.15991
68,-0.15991
69,-0.15991
70,-0.15991
71,-0.15991
72,-0.15991
73,-0.15991
74,-0.15991
75,-0.15991
76,-0.15991
77,-0.15991
78,7.5735
79,1.5714
80,-0.15991
81,-0.15991
82,-0.15991
83,-0.15991
84,-0.15991
85,-0.15991
86,-0.15991
87,-0.15991
88,-0.15991
89,-0.15991
90,-0.15991
91,-0.15991
92,-0.15991
93,-0.15991
94,-0.15991
95,-0.15991
