time,value
0,-0.17687
1,-0.17687
2,-0.17687
3,-0.17687
4,-0.17687
5,-0.17687
6,-0.17687
7,-0.17687
8,-0.17687
9,-0.17687
10,-0.17687
11,-0.17687
12,-0.17687
13,-0.17687
14,-0.17687
15,-0.17687
16,-0.17687
17,-0.17687
18,-0.17687
19,-0.17687
20,-0.17687
21,-0.17687
22,-0.17687
23,-0.17687
24,-0.17687
25,-0.17687
26,-0.17687
27,-0.17687
28,-0.17687
29,5.2485
30,-0.17687
31,-0.17687
32,-0.17687
33,-0.17687
34,-0.17687
35,-0.17687
36,-0.17687
37,-0.17687
38,-0.17687
39,-0.17687
40,-0.17687
41,-0.17687
42,-0.17687
43,-0.17687
44,-0.17687
45,-0.17687
46,-0.17687
47,-0.17687
48,-0.17687
49,-0.17687
50,-0.17687
51,-0.17687
52,-0.17687
53,-0.17687
54,-0.17687
55,-0.17687
56,-0.17687
57,-0.17687
58,-0.17687
59,-0.17687
60,-0.17687
61,-0.17687
62,-0.17687
63,-0.17687
64,-0.17687
65,-0.17687
66,-0.17687
67,-0.17687
68,-0.17687
69,-0.17687
70,-0.17687
71,-0.17687
72,-0.17687
73,6.5546
74,-0.17687
75,-0.17687
76,-0.17687
77,-0.17687
78,-0.17687
79,-0.17687
80,-0.17687
81,-0.17687
82,-0.17687
83,-0.17687
84,-0.17687
85,-0.17687
86,-0.17687
87,-0.17687
88,-0.17687
89,-0.17687
90,-0.17687
91,4.6457
92,-0.17687
93,-0.17687
94,-0.17687
95,-0.17687
