time,value
0,-0.15832000000000002
1,-0.40748
2,-0.15832000000000002
3,-0.15832000000000002
4,-0.15832000000000002
5,-0.15832000000000002
6,-0.40748
7,-0.15832000000000002
8,-0.15832000000000002
9,-0.15832000000000002
10,-0.40748
11,-0.15832000000000002
12,-0.15832000000000002
13,-0.15832000000000002
14,-0.40748
15,-0.15832000000000002
16,-0.15832000000000002
17,-0.15832000000000002
18,-0.40748
19,-0.15832000000000002
20,-0.15832000000000002
21,-0.15832000000000002
22,-0.15832000000000002
23,-0.40748
24,-0.15832000000000002
25,-0.15832000000000002
26,-0.15832000000000002
27,-0.40748
28,-0.15832000000000002
29,-0.15832000000000002
30,-0.15832000000000002
31,-0.40748
32,-0.15832000000000002
33,-0.15832000000000002
34,-0.15832000000000002
35,-0.40748
36,-0.15832000000000002
37,-0.15832000000000002
38,-0.15832000000000002
39,-0.40748
40,-0.15832000000000002
41,-0.15832000000000002
42,-0.15832000000000002
43,-0.40748
44,-0.15832000000000002
45,-0.15832000000000002
46,-0.15832000000000002
47,-0.40748
48,-0.15832000000000002
49,-0.15832000000000002
50,-0.15832000000000002
51,-0.40748
52,-0.15832000000000002
53,-0.15832000000000002
54,-0.15832000000000002
55,-0.40748
56,-0.15832000000000002
57,-0.15832000000000002
58,-0.15832000000000002
59,-0.40748
60,-0.15832000000000002
61,-0.15832000000000002
62,-0.15832000000000002
63,-0.15832000000000002
64,-0.40748
65,-0.15832000000000002
66,-0.15832000000000002
67,-0.15832000000000002
68,-0.40748
69,-0.15832000000000002
70,-0.15832000000000002
71,-0.15832000000000002
72,-0.40748
73,-0.15832000000000002
74,-0.15832000000000002
75,-0.15832000000000002
76,-0.40748
77,-0.15832000000000002
78,-0.15832000000000002
79,-0.15832000000000002
80,-0.40748
81,-0.15832000000000002
82,-0.15832000000000002
83,-0.15832000000000002
84,-0.40748
85,-0.15832000000000002
86,2.0841
87,5.0741
88,5.0741
89,5.3232
90,2.3333
91,-0.15832000000000002
92,-0.15832000000000002
93,-0.15832000000000002
94,-0.40748
95,-0.15832000000000002
