time,value
0,-0.34047
1,-0.34047
2,-0.34047
3,-0.34047
4,-0.34047
5,-0.34047
6,-0.34047
7,-0.34047
8,-0.34047
9,-0.34047
10,-0.34047
11,-0.34047
12,-0.34047
13,-0.34047
14,-0.34047
15,-0.34047
16,-0.34047
17,-0.34047
18,-0.34047
19,-0.34047
20,-0.34047
21,-0.34047
22,-0.34047
23,-0.34047
24,-0.34047
25,-0.34047
26,-0.34047
27,-0.34047
28,-0.34047
29,-0.34047
30,-0.34047
31,-0.34047
32,-0.34047
33,-0.34047
34,-0.34047
35,-0.34047
36,-0.34047
37,-0.34047
38,-0.34047
39,-0.34047
40,-0.34047
41,-0.34047
42,4.2646
43,2.7602
44,3.6867
45,4.0261
46,1.7786
47,0.76035
48,-0.028572000000000004
49,-0.34047
50,-0.34047
51,3.0445
52,0.40258
53,-0.34047
54,-0.34047
55,-0.34047
56,-0.34047
57,-0.34047
58,-0.34047
59,-0.34047
60,-0.34047
61,-0.34047
62,-0.34047
63,-0.34047
64,-0.34047
65,-0.34047
66,-0.34047
67,-0.34047
68,-0.34047
69,-0.34047
70,2.9803
71,2.7877
72,0.18242
73,0.20994000000000002
74,0.18242
75,-0.18452000000000002
76,-0.34047
77,-0.34047
78,-0.34047
79,-0.34047
80,0.38424
81,-0.34047
82,-0.34047
83,-0.34047
84,-0.34047
85,-0.34047
86,-0.34047
87,-0.34047
88,-0.34047
89,-0.34047
90,-0.34047
91,-0.34047
92,-0.34047
93,-0.34047
94,-0.34047
95,-0.34047
