time,value
0,1.0337
1,0.8989
2,0.4944
3,0.4944
4,0.4944
5,0.35956
6,0.4944
7,0.35956
8,0.35956
9,0.35956
10,0.35956
11,0.35956
12,0.35956
13,0.35956
14,0.4944
15,-1.7978
16,-2.472
17,-2.472
18,-2.472
19,-2.472
20,-2.472
21,-2.472
22,-2.472
23,0.76407
24,1.0337
25,0.6292300000000001
26,0.6292300000000001
27,0.35956
28,0.4944
29,0.35956
30,0.35956
31,0.35956
32,0.35956
33,0.35956
34,0.35956
35,0.35956
36,0.35956
37,0.35956
38,0.35956
39,0.35956
40,0.35956
41,0.22473
42,0.35956
43,0.35956
44,0.22473
45,0.35956
46,0.22473
47,-1.1236
48,-2.472
49,-2.472
50,-2.472
51,-2.472
52,-2.472
53,-0.98879
54,1.0337
55,0.76407
56,0.6292300000000001
57,0.4944
58,0.35956
59,0.4944
60,0.35956
61,0.4944
62,0.35956
63,0.35956
64,0.35956
65,0.4944
66,0.35956
67,0.35956
68,0.35956
69,0.35956
70,0.35956
71,0.35956
72,0.35956
73,0.22473
74,0.35956
75,0.35956
76,0.35956
77,0.35956
78,0.35956
79,0.35956
80,0.35956
81,0.35956
82,0.35956
83,0.35956
84,0.35956
85,0.22473
86,0.35956
87,0.35956
88,0.22473
89,0.35956
90,0.35956
91,0.22473
92,0.35956
93,0.35956
94,0.35956
95,0.22473
