time,value
0,-1.3888
1,-1.3377
2,-1.2889
3,-1.2524
4,-1.2254
5,-1.2031
6,-1.1833
7,-1.1688
8,-1.1613
9,-1.1549
10,-1.1514
11,-1.1431
12,-1.1312
13,-1.1008
14,-1.0557
15,-0.9934200000000001
16,-0.92691
17,-0.8550700000000001
18,-0.7864899999999999
19,-0.7247399999999999
20,-0.6713100000000001
21,-0.61887
22,-0.55734
23,-0.48307
24,-0.3805
25,-0.21525
26,0.067453
27,0.4904
28,1.0168
29,1.5389
30,1.9458
31,2.1715
32,2.2326
33,2.1857
34,2.0888
35,1.9704
36,1.8403
37,1.7039
38,1.5657
39,1.4269
40,1.2822
41,1.1312
42,0.97855
43,0.8359200000000001
44,0.70624
45,0.59305
46,0.49462
47,0.41791000000000006
48,0.35627
49,0.30046
50,0.23523000000000002
51,0.16592
52,0.097496
53,0.038403
54,-0.019642
55,-0.07938400000000001
56,-0.14102
57,-0.2063
58,-0.27578
59,-0.3529
60,-0.42123
61,-0.47556000000000004
62,-0.50452
63,-0.5218
64,-0.53109
65,-0.5453899999999999
66,-0.56395
67,-0.58894
68,-0.61348
69,-0.63212
70,-0.64751
71,-0.66217
72,-0.6865
73,-0.71405
74,-0.74585
75,-0.76732
76,-0.78256
77,-0.78256
78,-0.77249
79,-0.74642
80,-0.70901
81,-0.66267
82,-0.60965
83,-0.54287
84,-0.44493
85,-0.29936
86,-0.085674
87,0.1994
88,0.53886
89,0.86993
90,1.1273
91,1.2697
92,1.3196
93,1.318
94,1.2972
95,1.2602
96,1.2077
97,1.1479
98,1.0913
99,1.0417
100,0.99545
101,0.9536899999999999
102,0.91612
103,0.8836799999999999
104,0.84706
105,0.80272
106,0.7437
107,0.6754100000000001
108,0.59677
109,0.5129100000000001
110,0.42228999999999994
111,0.33276999999999995
112,0.24644000000000002
113,0.16832
114,0.093688
115,0.019096000000000002
116,-0.054166
117,-0.12385999999999998
118,-0.18053
119,-0.22776
120,-0.25829
121,-0.28019
122,-0.28422
123,-0.2809
124,-0.27194
125,-0.27111999999999997
126,-0.27795
127,-0.2923
128,-0.30699
129,-0.31764000000000003
130,-0.32016999999999995
131,-0.30874
132,-0.2829
133,-0.24059
134,-0.1883
135,-0.12314000000000001
136,-0.04824
137,0.042253
138,0.14084000000000002
139,0.24125
140,0.32854
141,0.39468000000000003
142,0.43213999999999997
143,0.43946999999999997
144,0.41563
145,0.36407
146,0.29298
147,0.21256999999999998
148,0.13147999999999999
149,0.047775
150,-0.041036
151,-0.13987
152,-0.24136
153,-0.34204
154,-0.43599
155,-0.5252600000000001
156,-0.60661
157,-0.67965
158,-0.74268
159,-0.79925
160,-0.85125
161,-0.89848
162,-0.94091
163,-0.97744
164,-1.0124
165,-1.0414
166,-1.0672
167,-1.0798
168,-1.0849
169,-1.0797
170,-1.073
171,-1.0638
172,-1.0524
173,-1.0365
174,-1.0134
175,-0.9883299999999999
176,-0.9601200000000001
177,-0.93734
178,-0.91371
179,-0.8957200000000001
180,-0.87595
181,-0.8638100000000001
182,-0.85172
183,-0.83539
184,-0.79003
185,-0.6916899999999999
186,-0.52117
187,-0.27817
188,0.015787
189,0.33295
190,0.6391899999999999
191,0.9178
192,1.1514
193,1.3452
194,1.4963
195,1.6212
196,1.7197
197,1.7978
198,1.838
199,1.8286
200,1.7683
201,1.6811
202,1.6011
203,1.5509
204,1.5386
205,1.5562
206,1.5951
207,1.6389
208,1.6828
209,1.7328
210,1.8132
211,1.9285
212,2.0618
213,2.165
214,2.2081
215,2.1786
216,2.0980000000000003
217,1.9838
218,1.8514
219,1.6975
220,1.5193
221,1.3204
222,1.1133
223,0.9143399999999999
224,0.72078
225,0.52863
226,0.32395
227,0.12099000000000001
228,-0.06980399999999999
229,-0.22726
230,-0.35436
231,-0.45133
232,-0.5283399999999999
233,-0.58198
234,-0.6146699999999999
235,-0.62825
236,-0.63355
237,-0.6410600000000001
238,-0.65261
239,-0.6691600000000001
240,-0.6801699999999999
241,-0.68997
242,-0.6935
243,-0.7016399999999999
244,-0.7117399999999999
245,-0.72863
246,-0.7465
247,-0.7679199999999999
248,-0.79193
249,-0.82173
250,-0.85495
251,-0.88823
252,-0.91999
253,-0.95155
254,-0.98672
255,-1.0237
256,-1.0603
257,-1.0907
258,-1.1153
259,-1.1347
260,-1.1539
261,-1.1738
262,-1.1958
263,-1.2189
264,-1.2496
265,-1.2961
266,-1.3585
267,-1.4192
268,-1.4552
269,-1.4611
