time,value
0,-0.8948299999999999
1,-0.8948299999999999
2,-0.8948299999999999
3,-0.8948299999999999
4,-0.8948299999999999
5,-0.8948299999999999
6,-0.8948299999999999
7,-0.8948299999999999
8,-0.8948299999999999
9,-0.8948299999999999
10,-0.8948299999999999
11,-0.8948299999999999
12,-0.8948299999999999
13,-0.8948299999999999
14,-0.8948299999999999
15,-0.8948299999999999
16,-0.8948299999999999
17,-0.8948299999999999
18,-0.8948299999999999
19,-0.8948299999999999
20,-0.8948299999999999
21,-0.8948299999999999
22,-0.8948299999999999
23,-0.8948299999999999
24,-0.8948299999999999
25,-0.8948299999999999
26,-0.8948299999999999
27,1.2981
28,2.0608
29,-0.7994899999999999
30,-0.8948299999999999
31,-0.8948299999999999
32,-0.8948299999999999
33,-0.8948299999999999
34,-0.8948299999999999
35,-0.8948299999999999
36,-0.8948299999999999
37,-0.8948299999999999
38,-0.8948299999999999
39,-0.8948299999999999
40,-0.8948299999999999
41,-0.8948299999999999
42,-0.8948299999999999
43,-0.8948299999999999
44,-0.8948299999999999
45,-0.8948299999999999
46,-0.8948299999999999
47,-0.8948299999999999
48,-0.8948299999999999
49,-0.8948299999999999
50,-0.8948299999999999
51,-0.8948299999999999
52,-0.7994899999999999
53,2.0608
54,1.9655
55,1.9655
56,1.8701
57,2.0608
58,1.8701
59,1.4887
60,0.9166799999999999
61,0.82134
62,0.82134
63,0.726
64,0.82134
65,0.82134
66,0.726
67,0.82134
68,0.82134
69,0.726
70,0.82134
71,0.82134
72,0.82134
73,0.726
74,0.82134
75,0.82134
76,0.82134
77,0.82134
78,0.82134
79,0.82134
80,0.82134
81,0.726
82,0.82134
83,0.82134
84,0.726
85,0.82134
86,0.82134
87,0.82134
88,0.726
89,0.82134
90,0.82134
91,0.82134
92,0.726
93,0.82134
94,0.82134
95,0.726
