time,value
0,-0.7118800000000001
1,-0.7118800000000001
2,-0.7118800000000001
3,-0.7118800000000001
4,1.8006
5,1.6331
6,0.46063000000000004
7,-0.7118800000000001
8,-0.7118800000000001
9,-0.7118800000000001
10,-0.7118800000000001
11,-0.7118800000000001
12,1.2981
13,1.6331
14,0.46063000000000004
15,-0.7118800000000001
16,-0.7118800000000001
17,-0.7118800000000001
18,-0.7118800000000001
19,-0.7118800000000001
20,0.7956300000000001
21,1.8006
22,0.7956300000000001
23,-0.7118800000000001
24,-0.7118800000000001
25,-0.7118800000000001
26,-0.7118800000000001
27,-0.7118800000000001
28,-0.20938
29,1.8006
30,1.4656
31,-0.7118800000000001
32,-0.7118800000000001
33,-0.7118800000000001
34,-0.7118800000000001
35,-0.7118800000000001
36,0.12563
37,1.8006
38,1.4656
39,-0.7118800000000001
40,-0.7118800000000001
41,-0.7118800000000001
42,-0.7118800000000001
43,-0.7118800000000001
44,-0.20938
45,1.9681
46,1.4656
47,-0.7118800000000001
48,-0.7118800000000001
49,-0.7118800000000001
50,-0.7118800000000001
51,-0.7118800000000001
52,-0.7118800000000001
53,1.2981
54,1.6331
55,0.12563
56,-0.7118800000000001
57,-0.7118800000000001
58,-0.7118800000000001
59,-0.7118800000000001
60,1.4656
61,1.6331
62,0.9631299999999999
63,-0.7118800000000001
64,-0.7118800000000001
65,-0.7118800000000001
66,-0.7118800000000001
67,-0.7118800000000001
68,1.9681
69,1.6331
70,0.12563
71,-0.7118800000000001
72,-0.7118800000000001
73,-0.7118800000000001
74,-0.7118800000000001
75,-0.7118800000000001
76,1.6331
77,1.4656
78,1.2981
79,-0.7118800000000001
80,-0.7118800000000001
81,-0.7118800000000001
82,-0.7118800000000001
83,-0.7118800000000001
84,0.9631299999999999
85,1.8006
86,0.9631299999999999
87,-0.7118800000000001
88,-0.7118800000000001
89,-0.7118800000000001
90,-0.7118800000000001
91,-0.7118800000000001
92,0.9631299999999999
93,1.6331
94,0.7956300000000001
95,-0.7118800000000001
