time,value
0,-1.3547
1,0.10655
2,0.10655
3,0.10655
4,-1.3547
5,0.10655
6,0.10655
7,0.10655
8,-1.3547
9,0.10655
10,0.10655
11,0.10655
12,-1.3547
13,0.10655
14,0.10655
15,0.10655
16,0.10655
17,-1.3547
18,0.10655
19,0.10655
20,0.10655
21,-1.3547
22,0.10655
23,0.10655
24,0.10655
25,-1.3547
26,0.10655
27,0.10655
28,0.10655
29,-1.3547
30,0.10655
31,0.10655
32,0.10655
33,0.10655
34,-1.3547
35,0.10655
36,0.10655
37,0.10655
38,-1.3547
39,0.10655
40,0.10655
41,0.10655
42,-1.3547
43,0.10655
44,0.10655
45,0.10655
46,-1.3547
47,0.10655
48,0.10655
49,0.10655
50,-1.3547
51,0.10655
52,0.10655
53,0.10655
54,-1.3547
55,0.10655
56,0.10655
57,0.10655
58,-1.3547
59,0.10655
60,0.10655
61,0.10655
62,-1.3547
63,0.10655
64,0.10655
65,0.10655
66,-1.3547
67,0.10655
68,0.10655
69,0.10655
70,-1.3547
71,0.10655
72,0.10655
73,0.10655
74,-1.3547
75,0.10655
76,0.10655
77,0.10655
78,0.10655
79,0.10655
80,3.0291
81,1.5678
82,3.0291
83,3.0291
84,1.5678
85,3.0291
86,1.5678
87,3.0291
88,1.5678
89,0.10655
90,0.10655
91,-1.3547
92,0.10655
93,0.10655
94,0.10655
95,-1.3547
