[<text>
<title>ceradyne inc &lt;crdn&gt; 4th qtr loss</title>
<dateline>    costa mesa, calif., march 18 -
    </dateline>shr loss 22 cts vs profit 10 cts
    net loss 1,056,000 vs profit 427,000
    sales 5,440,000 vs 4,982,000
    avg shrs 5,229,542 vs 4,435,691
    year
    shr profit one ct vs profit 26 cts
    net profit 29,000 vs profit 993,000
    sasles 19.1 mln vs 16.6 mln
    avg shrs 4,947,632 vs 3,780,543
 reuter
</text>]