time,value
0,-1.29
1,-1.29
2,-1.29
3,0.9502299999999999
4,0.9502299999999999
5,-0.3043
6,-1.29
7,-1.29
8,-1.29
9,0.054139
10,1.0398
11,0.5917899999999999
12,-1.29
13,-1.29
14,-1.29
15,-1.29
16,0.86062
17,1.0398
18,-0.03547
19,-1.29
20,-1.29
21,-1.29
22,-0.75234
23,1.0398
24,0.9502299999999999
25,-0.48352
26,-1.29
27,-1.29
28,-1.29
29,-0.12508
30,0.9502299999999999
31,1.0398
32,-0.39391
33,-1.29
34,-1.29
35,0.054139
36,1.0398
37,0.9502299999999999
38,0.9502299999999999
39,0.86062
40,-1.29
41,-1.29
42,-0.75234
43,1.2191
44,1.0398
45,0.9502299999999999
46,0.9502299999999999
47,1.0398
48,1.0398
49,0.9502299999999999
50,0.86062
51,0.9502299999999999
52,0.86062
53,0.86062
54,0.86062
55,0.7710100000000001
56,0.86062
57,0.7710100000000001
58,0.7710100000000001
59,-1.29
60,-1.29
61,-1.29
62,-1.29
63,-0.21469000000000002
64,0.9502299999999999
65,0.9502299999999999
66,-0.03547
67,-1.29
68,-1.29
69,-0.12508
70,0.9502299999999999
71,0.9502299999999999
72,0.86062
73,0.86062
74,0.9502299999999999
75,0.86062
76,0.86062
77,0.7710100000000001
78,0.7710100000000001
79,0.86062
80,0.6814
81,0.7710100000000001
82,0.7710100000000001
83,-0.66273
84,-1.29
85,-1.29
86,-1.29
87,-0.48352
88,0.9502299999999999
89,0.86062
90,-0.39391
91,-1.29
92,-1.29
93,0.23335999999999998
94,0.9502299999999999
95,0.86062
