time,value
0,-0.39553
1,-0.39553
2,-0.39553
3,-0.39553
4,-0.39553
5,-0.39553
6,-0.39553
7,-0.39553
8,-0.39553
9,-0.39553
10,-0.39553
11,-0.39553
12,-0.39553
13,-0.39553
14,-0.39553
15,-0.39553
16,-0.39553
17,-0.39553
18,-0.39553
19,-0.39553
20,-0.39553
21,-0.39553
22,-0.39553
23,-0.39553
24,-0.39553
25,-0.39553
26,-0.39553
27,-0.39553
28,-0.39553
29,-0.39553
30,-0.39553
31,-0.39553
32,-0.39553
33,-0.39553
34,-0.39553
35,-0.39553
36,-0.39553
37,-0.39553
38,-0.39553
39,-0.39553
40,-0.39553
41,-0.39553
42,-0.39553
43,-0.39553
44,-0.39553
45,-0.39553
46,-0.39553
47,-0.39553
48,0.62636
49,0.8818299999999999
50,-0.39553
51,-0.39553
52,-0.39553
53,-0.39553
54,-0.39553
55,-0.39553
56,-0.39553
57,-0.39553
58,-0.092747
59,-0.39553
60,-0.39553
61,1.1657
62,-0.39553
63,-0.39553
64,-0.39553
65,2.197
66,2.7931
67,1.8564
68,1.5819999999999999
69,1.8186
70,1.8848
71,2.0078
72,3.2757
73,3.1338
74,3.1716
75,4.3449
76,0.9953700000000001
77,-0.39553
78,-0.39553
79,-0.39553
80,-0.39553
81,-0.39553
82,-0.39553
83,-0.39553
84,-0.39553
85,-0.39553
86,-0.39553
87,-0.39553
88,-0.39553
89,-0.39553
90,-0.39553
91,-0.39553
92,-0.39553
93,-0.39553
94,-0.39553
95,-0.39553
