time,value
0,-0.25711
1,-0.25711
2,-0.25711
3,-0.25711
4,-0.25711
5,-0.25711
6,-0.25711
7,-0.25711
8,-0.25711
9,-0.25711
10,-0.25711
11,-0.25711
12,-0.25711
13,-0.25711
14,-0.25711
15,-0.25711
16,-0.25711
17,-0.25711
18,-0.25711
19,-0.25711
20,-0.25711
21,-0.25711
22,-0.25711
23,-0.25711
24,-0.25711
25,-0.25711
26,-0.25711
27,-0.25711
28,-0.25711
29,-0.25711
30,-0.25711
31,-0.25711
32,3.7172
33,-0.25711
34,-0.25711
35,0.82362
36,1.8346
37,-0.25711
38,3.3686
39,-0.25711
40,-0.25711
41,-0.25711
42,-0.25711
43,-0.25711
44,-0.25711
45,-0.25711
46,3.7172
47,-0.25711
48,-0.25711
49,-0.25711
50,-0.25711
51,-0.25711
52,-0.25711
53,-0.25711
54,-0.25711
55,-0.25711
56,-0.25711
57,-0.25711
58,-0.25711
59,-0.25711
60,-0.25711
61,-0.25711
62,-0.25711
63,-0.25711
64,3.7869
65,-0.25711
66,-0.25711
67,-0.25711
68,-0.25711
69,-0.25711
70,-0.25711
71,-0.25711
72,-0.25711
73,-0.25711
74,-0.25711
75,-0.25711
76,-0.25711
77,-0.25711
78,-0.25711
79,-0.25711
80,-0.25711
81,5.6346
82,-0.25711
83,-0.25711
84,-0.25711
85,-0.25711
86,-0.25711
87,-0.25711
88,-0.25711
89,-0.25711
90,-0.25711
91,-0.25711
92,-0.25711
93,-0.25711
94,-0.25711
95,-0.25711
