time,value
0,-0.33644
1,-0.33644
2,-0.33644
3,-0.33644
4,-0.33644
5,-0.33644
6,-0.33644
7,-0.33644
8,-0.33644
9,-0.33644
10,-0.33644
11,-0.33644
12,-0.33644
13,-0.33644
14,-0.33644
15,-0.33644
16,-0.33644
17,-0.33644
18,-0.33644
19,-0.33644
20,-0.33644
21,-0.33644
22,-0.33644
23,-0.33644
24,-0.33644
25,-0.33644
26,-0.33644
27,-0.33644
28,-0.33644
29,-0.33644
30,-0.33644
31,-0.33644
32,-0.33644
33,-0.33644
34,-0.33644
35,-0.33644
36,-0.33644
37,-0.33644
38,-0.33644
39,-0.33644
40,-0.33644
41,-0.33644
42,0.78963
43,3.2207
44,1.9157
45,3.0418
46,-0.15753
47,-0.16806
48,-0.10490999999999999
49,5.0519
50,-0.33644
51,-0.33644
52,-0.33644
53,-0.33644
54,-0.33644
55,-0.33644
56,-0.33644
57,-0.33644
58,-0.33644
59,-0.33644
60,-0.33644
61,-0.33644
62,-0.33644
63,-0.33644
64,-0.33644
65,-0.33644
66,-0.33644
67,-0.33644
68,-0.33644
69,-0.33644
70,-0.33644
71,-0.33644
72,-0.33644
73,-0.33644
74,-0.33644
75,-0.33644
76,-0.33644
77,-0.33644
78,-0.33644
79,-0.33644
80,-0.33644
81,2.7366
82,3.4522
83,0.5160100000000001
84,2.4945
85,-0.16806
86,-0.17858
87,2.7261
88,1.7473
89,-0.33644
90,-0.33644
91,-0.33644
92,-0.33644
93,-0.33644
94,-0.33644
95,-0.33644
