time,value
0,-0.18112
1,-0.18112
2,-0.18112
3,-0.18112
4,-0.18112
5,-0.18112
6,-0.18112
7,-0.18112
8,-0.18112
9,-0.18112
10,-0.18112
11,-0.18112
12,-0.18112
13,-0.18112
14,-0.18112
15,-0.18112
16,-0.18112
17,-0.18112
18,-0.18112
19,-0.18112
20,-0.18112
21,-0.18112
22,-0.18112
23,-0.18112
24,-0.18112
25,-0.18112
26,-0.18112
27,-0.18112
28,-0.18112
29,-0.18112
30,-0.18112
31,-0.18112
32,-0.18112
33,-0.18112
34,-0.18112
35,-0.18112
36,-0.18112
37,-0.18112
38,-0.18112
39,-0.18112
40,-0.18112
41,-0.18112
42,7.5627
43,0.95854
44,-0.18112
45,-0.18112
46,-0.18112
47,-0.18112
48,-0.18112
49,-0.18112
50,-0.18112
51,-0.18112
52,-0.18112
53,-0.18112
54,-0.18112
55,-0.18112
56,-0.18112
57,-0.18112
58,-0.18112
59,-0.18112
60,-0.18112
61,-0.18112
62,-0.18112
63,-0.18112
64,-0.18112
65,-0.18112
66,-0.18112
67,-0.18112
68,-0.18112
69,-0.18112
70,-0.18112
71,5.5464
72,1.5430000000000001
73,0.8708799999999999
74,-0.18112
75,-0.18112
76,-0.18112
77,-0.18112
78,-0.18112
79,-0.18112
80,-0.18112
81,-0.18112
82,-0.18112
83,-0.18112
84,-0.18112
85,-0.18112
86,-0.18112
87,-0.18112
88,-0.18112
89,-0.18112
90,-0.18112
91,-0.18112
92,-0.18112
93,-0.18112
94,-0.18112
95,-0.18112
