time,value
0,1.7583
1,1.6681
2,1.5668
3,1.4759
4,1.3802
5,1.2878
6,1.175
7,1.0835
8,0.97944
9,0.8901100000000001
10,0.7903899999999999
11,0.6958300000000001
12,0.59926
13,0.49978
14,0.40894
15,0.30695
16,0.2154
17,0.11610999999999999
18,0.015035
19,-0.07499199999999999
20,-0.16998
21,-0.27039
22,-0.35312
23,-0.4267
24,-0.5233300000000001
25,-0.6203
26,-0.7158
27,-0.80823
28,-0.9071899999999999
29,-1.0022
30,-1.1028
31,-1.1938
32,-1.2872
33,-1.3954
34,-1.4823
35,-1.5697
36,-1.5056
37,-1.4562
38,-1.364
39,-1.263
40,-1.1875
41,-1.0702
42,-0.98749
43,-0.92535
44,-0.8916700000000001
45,-0.83293
46,-0.77933
47,-0.7236600000000001
48,-0.68019
49,-0.62022
50,-0.58862
51,-0.5513
52,-0.49945
53,-0.47017
54,-0.486
55,-0.56426
56,-0.64803
57,-0.7530600000000001
58,-0.85001
59,-0.90315
60,-0.8819799999999999
61,-0.81008
62,-0.76242
63,-0.70206
64,-0.6398699999999999
65,-0.56623
66,-0.5421600000000001
67,-0.456
68,-0.38103000000000004
69,-0.30149000000000004
70,-0.21404
71,-0.1461
72,-0.090837
73,-0.030773000000000002
74,0.026449
75,0.10515999999999999
76,0.16933
77,0.23329
78,0.28896
79,0.3489
80,0.31747
81,0.27079000000000003
82,0.26009
83,0.24534
84,0.3138
85,0.38533
86,0.46733
87,0.54806
88,0.62729
89,0.70223
90,0.77775
91,0.83741
92,0.89818
93,0.9711200000000001
94,1.0758
95,1.1592
96,1.2252
97,1.3037
98,1.3752
99,1.421
100,1.4709999999999999
101,1.5339
102,1.5949
103,1.5984
104,1.5304
105,1.4380000000000002
106,1.3494
107,1.2694
108,1.172
109,1.0938
110,0.99356
111,0.90241
112,0.81228
113,0.72153
114,0.62574
115,0.53618
116,0.47658
117,0.42795
118,0.34593
119,0.2669
120,0.18349000000000001
121,0.080738
122,-0.009209899999999998
123,-0.11560999999999999
124,-0.21869
125,-0.31711999999999996
126,-0.4268
127,-0.52205
128,-0.63421
129,-0.7286
130,-0.8342799999999999
131,-0.93778
132,-1.026
133,-1.1398
134,-1.2345
135,-1.3421
136,-1.4418
137,-1.5382
138,-1.6263
139,-1.6883
140,-1.7854
141,-1.8693
142,-1.8792
143,-1.7769
144,-1.6827
145,-1.5817
146,-1.4769
147,-1.3788
148,-1.2898
149,-1.2241
150,-1.1273
151,-1.0275
152,-0.92438
153,-0.8212799999999999
154,-0.7205
155,-0.61495
156,-0.53537
157,-0.43988999999999995
158,-0.34824
159,-0.24766
160,-0.15454
161,-0.018076
162,0.058562
163,0.13615
164,0.21431999999999998
165,0.28354
166,0.34792
167,0.43311000000000005
168,0.5030399999999999
169,0.5671
170,0.5774
171,0.5188699999999999
172,0.49351999999999996
173,0.4485
174,0.3996
175,0.3487
176,0.36211
177,0.35047
178,0.42362
179,0.51342
180,0.60028
181,0.67924
182,0.73569
183,0.78857
184,0.85625
185,0.93922
186,1.0275
187,1.1175
188,1.1447
189,1.139
190,1.1567
191,1.1964
192,1.2605
193,1.3494
194,1.4241
195,1.4964
196,1.5381
197,1.5868
198,1.6089
199,1.5567
200,1.511
201,1.4402
202,1.369
203,1.2612
204,1.186
205,1.1623
206,1.1039
207,0.9897
208,0.8916799999999999
209,0.79193
210,0.7359100000000001
211,0.6310399999999999
212,0.53227
213,0.44218
214,0.34365999999999997
215,0.31124
216,0.32081
217,0.35497
218,0.40496
219,0.44535
220,0.44045
221,0.38515
222,0.30030999999999997
223,0.21419000000000002
224,0.12070999999999998
225,0.042193
226,-0.04072
227,-0.13564
228,-0.22801
229,-0.31261
230,-0.40139
231,-0.48491000000000006
232,-0.5738
233,-0.67013
234,-0.7629199999999999
235,-0.85731
236,-0.9338299999999999
237,-1.0088
238,-1.0916
239,-1.1753
240,-1.2506
241,-1.3497
242,-1.4329
243,-1.5145
244,-1.5969
245,-1.6782
246,-1.7683
247,-1.8538
248,-1.9343
249,-1.993
250,-2.0461
251,-2.0881
252,-2.0598
253,-1.9931
254,-1.8555
255,-1.7617
256,-1.6691
257,-1.5514
258,-1.4508
259,-1.3128
260,-1.2112
261,-1.131
262,-1.0198
263,-0.8955799999999999
264,-0.80178
265,-0.67364
266,-0.58019
267,-0.47673000000000004
268,-0.3888
269,-0.27078
270,-0.17262
271,-0.068156
272,0.019078
273,0.10248
274,0.18157
275,0.2856
276,0.355
277,0.43178
278,0.52759
279,0.6155
280,0.72844
281,0.8324299999999999
282,0.92779
283,1.0183
284,1.1095
285,1.1855
286,1.2635
287,1.3739
288,1.4704
289,1.5702
290,1.6616
291,1.7571
292,1.8599
293,1.9364
294,1.9616
295,1.9092
296,1.8354
297,1.7709
298,1.7015
299,1.6535
300,1.5781
301,1.5289
302,1.4801
303,1.4711
304,1.4344
305,1.3823
306,1.3135
307,1.2672
308,1.2247
309,1.1774
310,1.1589
311,1.1405
312,1.1391
313,1.0996
314,1.0301
315,0.9460200000000001
316,0.8854
317,0.79997
318,0.75954
319,0.67692
320,0.61859
321,0.54389
322,0.46308999999999995
323,0.36603
324,0.27948
325,0.23419
326,0.23836999999999997
327,0.26404
328,0.32316999999999996
329,0.38238
330,0.4411
331,0.4605
332,0.43366000000000005
333,0.39497
334,0.32145
335,0.25638
336,0.25221
337,0.22158000000000003
338,0.16854
339,0.1374
340,0.1033
341,0.031007
342,-0.042068
343,-0.11625999999999999
344,-0.18742999999999999
345,-0.26544
346,-0.33898
347,-0.41841999999999996
348,-0.49888999999999994
349,-0.57004
350,-0.62613
351,-0.68238
352,-0.72915
353,-0.6856
354,-0.6623100000000001
355,-0.5913
356,-0.49686
357,-0.41801000000000005
358,-0.31185999999999997
359,-0.22841999999999998
360,-0.14769000000000002
361,-0.07889700000000001
362,-0.018099
363,-0.0044571
364,-0.046348
365,-0.10047
366,-0.17707
367,-0.24709
368,-0.30025999999999997
369,-0.37966
370,-0.43993000000000004
371,-0.46697
372,-0.51469
373,-0.60396
374,-0.69591
375,-0.78365
376,-0.86777
377,-0.9555100000000001
378,-1.0619
379,-1.1493
380,-1.2184
381,-1.2728
382,-1.3609
383,-1.4394
384,-1.5419999999999998
385,-1.6309
386,-1.715
387,-1.7836
388,-1.817
389,-1.8705
390,-1.7929
391,-1.686
392,-1.5888
393,-1.4994
394,-1.4
395,-1.2917
396,-1.203
397,-1.1062
398,-1.0094
399,-0.9103899999999999
400,-0.80705
401,-0.71478
402,-0.61808
403,-0.52668
404,-0.42601000000000006
405,-0.32753000000000004
406,-0.22891999999999998
407,-0.13121
408,-0.027731
409,0.056833
410,0.16000999999999999
411,0.24841999999999997
412,0.35266
413,0.44651
414,0.55103
415,0.64553
416,0.7450399999999999
417,0.84755
418,0.93976
419,1.0432
420,1.136
421,1.2366
422,1.3373
423,1.4269
424,1.528
425,1.6225
426,1.7144
