time,value
0,-0.65842
1,-0.65842
2,-0.65842
3,-0.8590700000000001
4,-0.65842
5,-0.8590700000000001
6,-0.65842
7,-0.8590700000000001
8,-0.65842
9,-0.8590700000000001
10,-0.65842
11,-0.8590700000000001
12,-0.65842
13,-0.8590700000000001
14,-0.65842
15,-0.8590700000000001
16,-0.65842
17,-0.8590700000000001
18,-0.65842
19,-0.8590700000000001
20,-0.8590700000000001
21,-0.65842
22,-0.8590700000000001
23,-0.65842
24,-0.8590700000000001
25,-0.65842
26,-0.8590700000000001
27,-0.65842
28,-0.8590700000000001
29,0.14422000000000001
30,1.3482
31,1.1475
32,0.34488
33,-0.65842
34,-0.65842
35,-0.45776000000000006
36,1.1475
37,1.5488
38,1.3482
39,1.3482
40,1.3482
41,1.3482
42,1.3482
43,1.3482
44,1.3482
45,1.1475
46,1.3482
47,1.3482
48,1.1475
49,-0.65842
50,1.1475
51,1.1475
52,1.3482
53,1.3482
54,1.1475
55,1.1475
56,1.3482
57,1.1475
58,1.1475
59,1.1475
60,-0.056436
61,-1.0597
62,-1.0597
63,-1.0597
64,-1.2604
65,-1.0597
66,-1.0597
67,-1.0597
68,0.5455399999999999
69,1.1475
70,1.1475
71,1.3482
72,-0.45776000000000006
73,-1.0597
74,-0.056436
75,1.3482
76,0.7462
77,-0.8590700000000001
78,0.7462
79,1.1475
80,1.1475
81,1.1475
82,0.94686
83,0.94686
84,0.94686
85,-0.65842
86,-1.0597
87,-0.8590700000000001
88,-1.0597
89,-1.0597
90,-1.0597
91,-1.0597
92,-1.0597
93,-1.0597
94,-1.0597
95,-1.0597
