time,value
0,-0.8333200000000001
1,-0.8333200000000001
2,0.57291
3,1.5104
4,1.1979
5,-0.8333200000000001
6,-0.8333200000000001
7,-0.8333200000000001
8,-0.8333200000000001
9,0.26041
10,1.6666
11,1.1979
12,1.0416
13,-0.8333200000000001
14,-0.8333200000000001
15,-0.8333200000000001
16,-0.8333200000000001
17,-0.8333200000000001
18,0.10415999999999999
19,1.6666
20,1.1979
21,-0.36458
22,-0.8333200000000001
23,-0.8333200000000001
24,-0.8333200000000001
25,-0.8333200000000001
26,-0.8333200000000001
27,0.72915
28,1.5104
29,0.8854
30,-0.8333200000000001
31,-0.8333200000000001
32,-0.8333200000000001
33,-0.8333200000000001
34,-0.8333200000000001
35,-0.8333200000000001
36,1.0416
37,1.5104
38,1.1979
39,-0.52082
40,-0.8333200000000001
41,-0.8333200000000001
42,-0.8333200000000001
43,-0.8333200000000001
44,-0.36458
45,1.5104
46,1.3541
47,1.1979
48,-0.8333200000000001
49,-0.8333200000000001
50,-0.8333200000000001
51,-0.8333200000000001
52,-0.8333200000000001
53,1.6666
54,1.3541
55,1.1979
56,1.1979
57,1.1979
58,0.10415999999999999
59,-0.8333200000000001
60,-0.8333200000000001
61,-0.8333200000000001
62,-0.8333200000000001
63,-0.8333200000000001
64,0.26041
65,1.5104
66,1.3541
67,1.0416
68,0.72915
69,-0.8333200000000001
70,-0.8333200000000001
71,-0.8333200000000001
72,-0.8333200000000001
73,-0.8333200000000001
74,-0.8333200000000001
75,1.6666
76,1.3541
77,0.8854
78,-0.8333200000000001
79,-0.8333200000000001
80,-0.8333200000000001
81,-0.8333200000000001
82,-0.8333200000000001
83,-0.8333200000000001
84,1.0416
85,1.5104
86,1.1979
87,0.26041
88,-0.8333200000000001
89,-0.8333200000000001
90,-0.8333200000000001
91,-0.8333200000000001
92,-0.36458
93,1.6666
94,1.1979
95,1.1979
