time,value
0,0.76562
1,0.08126699999999999
2,-0.87682
3,0.08126699999999999
4,0.76562
5,-0.87682
6,-0.6030800000000001
7,1.45
8,-0.87682
9,-0.87682
10,1.5868
11,-0.87682
12,-0.87682
13,1.3131
14,-0.6030800000000001
15,-0.87682
16,0.76562
17,0.08126699999999999
18,-0.87682
19,0.08126699999999999
20,0.62875
21,-0.87682
22,-0.6030800000000001
23,1.3131
24,-0.87682
25,-0.87682
26,1.5868
27,-0.87682
28,-0.87682
29,1.0394
30,-0.32934
31,-0.87682
32,0.35501
33,0.49188000000000004
34,-0.87682
35,0.35501
36,0.76562
37,-0.87682
38,-0.87682
39,1.8606
40,-0.87682
41,-0.87682
42,1.7237
43,-0.87682
44,-0.87682
45,1.45
46,-0.46621
47,-0.87682
48,0.35501
49,0.62875
50,-0.87682
51,-0.6030800000000001
52,1.45
53,-0.87682
54,-0.87682
55,1.7237
56,-0.87682
57,-0.87682
58,1.1762
59,-0.19247
60,-0.87682
61,0.21814
62,0.76562
63,-0.87682
64,-0.46621
65,1.45
66,-0.87682
67,-0.87682
68,1.8606
69,-0.87682
70,-0.87682
71,1.3131
72,-0.19247
73,-0.87682
74,1.5868
75,-0.87682
76,-0.87682
77,0.90249
78,0.21814
79,-0.87682
80,-0.055603
81,0.90249
82,-0.87682
83,1.7237
84,0.21814
85,-0.87682
86,0.35501
87,2.2712
88,-0.87682
89,-0.87682
90,1.9974
91,0.49188000000000004
92,-0.87682
93,-0.46621
94,2.1343
95,-0.87682
