time,value
0,-0.24941
1,-0.24941
2,-0.24941
3,-0.24941
4,-0.24941
5,-0.24941
6,-0.24941
7,-0.24941
8,-0.24941
9,-0.24941
10,-0.24941
11,-0.24941
12,-0.24941
13,-0.24941
14,-0.24941
15,-0.24941
16,-0.24941
17,-0.24941
18,-0.24941
19,-0.24941
20,-0.24941
21,-0.24941
22,-0.24941
23,-0.24941
24,-0.24941
25,-0.24941
26,-0.24941
27,-0.24941
28,-0.24941
29,-0.24941
30,-0.24941
31,-0.24941
32,-0.24941
33,-0.24941
34,-0.24941
35,-0.24941
36,-0.24941
37,-0.24941
38,-0.24941
39,-0.24941
40,-0.24941
41,-0.24941
42,-0.24941
43,-0.24941
44,-0.24941
45,-0.24941
46,-0.24941
47,-0.24941
48,-0.24941
49,-0.24941
50,-0.24941
51,-0.24941
52,-0.24941
53,-0.24941
54,-0.24941
55,-0.24941
56,-0.24941
57,-0.24941
58,-0.24941
59,-0.24941
60,-0.24941
61,-0.24941
62,-0.24941
63,-0.24941
64,-0.24941
65,-0.24941
66,-0.24941
67,-0.24941
68,-0.24941
69,-0.24941
70,4.2078
71,5.1069
72,3.6811
73,3.3729
74,4.0922
75,1.9856
76,-0.24941
77,-0.24941
78,-0.24941
79,-0.24941
80,-0.24941
81,-0.24941
82,-0.24941
83,-0.24941
84,-0.24941
85,-0.24941
86,-0.24941
87,-0.24941
88,-0.24941
89,-0.24941
90,-0.24941
91,-0.24941
92,-0.24941
93,-0.24941
94,-0.24941
95,-0.24941
