time,value
0,-0.14405
1,-0.14405
2,-0.14405
3,-0.14405
4,-0.14405
5,-0.14405
6,-0.14405
7,-0.14405
8,-0.14405
9,-0.14405
10,-0.14405
11,-0.14405
12,-0.14405
13,-0.14405
14,-0.14405
15,-0.14405
16,-0.14405
17,-0.14405
18,-0.14405
19,-0.14405
20,-0.14405
21,-0.14405
22,-0.14405
23,-0.14405
24,5.9405
25,-0.14405
26,-0.14405
27,-0.14405
28,-0.14405
29,-0.14405
30,-0.14405
31,-0.14405
32,-0.14405
33,-0.14405
34,-0.14405
35,-0.14405
36,-0.14405
37,-0.14405
38,-0.14405
39,-0.14405
40,-0.14405
41,-0.14405
42,-0.14405
43,-0.14405
44,-0.14405
45,-0.14405
46,-0.14405
47,-0.14405
48,-0.14405
49,7.6
50,-0.14405
51,-0.14405
52,-0.14405
53,-0.14405
54,-0.14405
55,-0.14405
56,-0.14405
57,-0.14405
58,-0.14405
59,-0.14405
60,-0.14405
61,-0.14405
62,-0.14405
63,-0.14405
64,-0.14405
65,-0.14405
66,-0.14405
67,-0.14405
68,-0.14405
69,-0.14405
70,-0.14405
71,-0.14405
72,-0.14405
73,-0.14405
74,-0.14405
75,-0.14405
76,-0.14405
77,-0.14405
78,-0.14405
79,-0.14405
80,-0.14405
81,-0.14405
82,-0.14405
83,-0.14405
84,-0.14405
85,-0.14405
86,-0.14405
87,-0.14405
88,-0.14405
89,-0.14405
90,-0.14405
91,-0.14405
92,-0.14405
93,-0.14405
94,-0.14405
95,-0.14405
