time,value
0,-0.45213000000000003
1,-0.45213000000000003
2,-0.45213000000000003
3,-0.45213000000000003
4,-0.45213000000000003
5,-0.45213000000000003
6,-0.45213000000000003
7,-0.45213000000000003
8,-0.45213000000000003
9,-0.45213000000000003
10,-0.45213000000000003
11,-0.45213000000000003
12,-0.45213000000000003
13,-0.45213000000000003
14,-0.45213000000000003
15,-0.45213000000000003
16,-0.45213000000000003
17,-0.45213000000000003
18,-0.45213000000000003
19,-0.45213000000000003
20,-0.45213000000000003
21,-0.45213000000000003
22,-0.45213000000000003
23,-0.45213000000000003
24,-0.45213000000000003
25,-0.45213000000000003
26,-0.45213000000000003
27,-0.45213000000000003
28,-0.45213000000000003
29,-0.45213000000000003
30,-0.45213000000000003
31,-0.45213000000000003
32,-0.45213000000000003
33,-0.45213000000000003
34,-0.45213000000000003
35,-0.45213000000000003
36,-0.45213000000000003
37,-0.45213000000000003
38,-0.45213000000000003
39,-0.45213000000000003
40,-0.45213000000000003
41,-0.45213000000000003
42,-0.45213000000000003
43,-0.45213000000000003
44,-0.45213000000000003
45,-0.45213000000000003
46,-0.45213000000000003
47,-0.45213000000000003
48,-0.45213000000000003
49,0.39441
50,2.2414
51,1.7796
52,-0.22125
53,-0.22125
54,-0.1443
55,-0.22125
56,-0.22125
57,-0.22125
58,-0.1443
59,-0.22125
60,-0.22125
61,-0.22125
62,-0.45213000000000003
63,-0.45213000000000003
64,-0.45213000000000003
65,-0.45213000000000003
66,-0.45213000000000003
67,-0.45213000000000003
68,-0.45213000000000003
69,-0.45213000000000003
70,-0.45213000000000003
71,-0.45213000000000003
72,-0.45213000000000003
73,-0.45213000000000003
74,-0.45213000000000003
75,-0.45213000000000003
76,-0.45213000000000003
77,-0.45213000000000003
78,-0.45213000000000003
79,1.6257
80,2.2414
81,2.5492
82,2.7031
83,2.6262
84,2.6262
85,2.7031
86,2.7031
87,2.6262
88,2.3953
89,2.1644
90,2.1644
91,0.16354000000000002
92,-0.45213000000000003
93,-0.45213000000000003
94,-0.45213000000000003
95,-0.45213000000000003
