time,value
0,-0.27619
1,-0.27619
2,-0.27619
3,-0.27619
4,-0.27619
5,-0.27619
6,-0.27619
7,-0.27619
8,-0.27619
9,-0.27619
10,-0.27619
11,-0.27619
12,-0.27619
13,-0.27619
14,-0.27619
15,-0.27619
16,-0.27619
17,-0.27619
18,-0.27619
19,-0.27619
20,-0.27619
21,-0.27619
22,-0.27619
23,-0.27619
24,-0.27619
25,-0.27619
26,-0.27619
27,-0.27619
28,-0.27619
29,-0.27619
30,-0.27619
31,-0.27619
32,-0.27619
33,-0.27619
34,-0.27619
35,-0.27619
36,1.7952
37,-0.27619
38,-0.27619
39,-0.27619
40,5.1371
41,6.0209
42,-0.27619
43,-0.27619
44,-0.27619
45,-0.27619
46,-0.27619
47,1.8781
48,-0.27619
49,-0.27619
50,-0.27619
51,-0.27619
52,-0.27619
53,-0.27619
54,-0.27619
55,-0.27619
56,-0.27619
57,-0.27619
58,2.5962
59,-0.27619
60,-0.27619
61,-0.27619
62,-0.27619
63,-0.27619
64,-0.27619
65,0.55238
66,1.3809
67,-0.27619
68,-0.27619
69,-0.27619
70,-0.27619
71,-0.27619
72,-0.27619
73,-0.27619
74,-0.27619
75,-0.27619
76,-0.27619
77,-0.27619
78,-0.27619
79,-0.27619
80,-0.16571
81,-0.27619
82,-0.19333
83,2.0162
84,-0.27619
85,-0.27619
86,-0.27619
87,2.4581
88,-0.27619
89,-0.27619
90,-0.27619
91,-0.27619
92,-0.27619
93,-0.27619
94,-0.27619
95,-0.27619
