time,value
0,-0.63593
1,-0.63593
2,-0.63593
3,-0.63593
4,-0.63593
5,1.0185
6,1.6803
7,1.6803
8,-0.63593
9,-0.63593
10,-0.63593
11,-0.63593
12,-0.63593
13,-0.63593
14,2.0112
15,1.6803
16,0.35674
17,-0.63593
18,-0.63593
19,-0.63593
20,-0.63593
21,-0.63593
22,0.5221899999999999
23,1.8458
24,1.5149
25,-0.63593
26,-0.63593
27,-0.63593
28,-0.63593
29,-0.63593
30,-0.63593
31,1.8458
32,1.6803
33,0.68763
34,-0.63593
35,-0.63593
36,-0.63593
37,-0.63593
38,-0.63593
39,-0.63593
40,2.0112
41,1.6803
42,-0.30504000000000003
43,-0.63593
44,-0.63593
45,-0.63593
46,-0.63593
47,-0.63593
48,-0.13959000000000002
49,1.8458
50,1.5149
51,-0.63593
52,-0.63593
53,-0.63593
54,-0.63593
55,-0.63593
56,-0.63593
57,1.8458
58,1.6803
59,-0.63593
60,-0.63593
61,-0.63593
62,-0.63593
63,-0.63593
64,-0.63593
65,-0.63593
66,1.8458
67,1.6803
68,-0.30504000000000003
69,-0.63593
70,-0.63593
71,-0.63593
72,-0.63593
73,-0.63593
74,-0.63593
75,2.0112
76,1.5149
77,0.1913
78,-0.63593
79,-0.63593
80,-0.63593
81,-0.63593
82,-0.63593
83,-0.63593
84,1.6803
85,1.6803
86,0.025851
87,-0.63593
88,-0.63593
89,-0.63593
90,-0.63593
91,-0.63593
92,-0.63593
93,1.3494
94,1.8458
95,0.5221899999999999
