time,value
0,-0.31444
1,-0.31444
2,-0.31444
3,-0.31444
4,-0.31444
5,-0.31444
6,-0.31444
7,-0.31444
8,-0.31444
9,-0.31444
10,-0.31444
11,-0.31444
12,-0.31444
13,-0.31444
14,-0.31444
15,-0.31444
16,-0.31444
17,-0.31444
18,-0.31444
19,-0.31444
20,-0.31444
21,-0.31444
22,-0.31444
23,-0.31444
24,-0.31444
25,-0.31444
26,-0.31444
27,-0.31444
28,-0.31444
29,-0.31444
30,-0.31444
31,-0.31444
32,-0.31444
33,-0.31444
34,-0.31444
35,-0.31444
36,-0.31444
37,-0.31444
38,-0.31444
39,-0.31444
40,-0.31444
41,-0.31444
42,-0.31444
43,-0.31444
44,-0.31444
45,-0.31444
46,-0.31444
47,-0.31444
48,-0.31444
49,-0.31444
50,-0.31444
51,-0.31444
52,-0.31444
53,-0.31444
54,-0.31444
55,-0.31444
56,-0.31444
57,-0.31444
58,-0.31444
59,-0.31444
60,-0.31444
61,-0.31444
62,-0.31444
63,-0.31444
64,-0.31444
65,-0.31444
66,-0.31444
67,-0.31444
68,-0.31444
69,-0.31444
70,-0.31444
71,0.8275899999999999
72,5.2722
73,2.6332
74,2.5252
75,2.3246
76,3.5438
77,3.1888
78,3.1116
79,2.3091
80,1.2597
81,-0.26815
82,-0.31444
83,-0.31444
84,-0.31444
85,-0.31444
86,-0.31444
87,-0.31444
88,-0.31444
89,-0.31444
90,-0.31444
91,-0.31444
92,-0.31444
93,-0.31444
94,-0.31444
95,-0.31444
