time,value
0,-0.13955
1,-0.13955
2,-0.13955
3,-0.13955
4,-0.13955
5,-0.13955
6,-0.13955
7,-0.13955
8,-0.13955
9,-0.13955
10,-0.13955
11,-0.13955
12,-0.13955
13,-0.13955
14,-0.13955
15,-0.13955
16,-0.13955
17,-0.13955
18,-0.13955
19,-0.13955
20,-0.13955
21,-0.13955
22,-0.13955
23,-0.13955
24,-0.13955
25,-0.13955
26,-0.13955
27,-0.13955
28,-0.13955
29,-0.13955
30,-0.13955
31,-0.13955
32,-0.13955
33,-0.13955
34,-0.13955
35,-0.13955
36,-0.13955
37,-0.13955
38,-0.13955
39,-0.13955
40,4.6694
41,-0.13955
42,-0.13955
43,-0.13955
44,-0.13955
45,-0.13955
46,-0.13955
47,-0.13955
48,-0.13955
49,-0.13955
50,-0.13955
51,-0.13955
52,-0.13955
53,8.4479
54,-0.13955
55,-0.13955
56,-0.13955
57,-0.13955
58,-0.13955
59,-0.13955
60,-0.13955
61,-0.13955
62,-0.13955
63,-0.13955
64,-0.13955
65,-0.13955
66,-0.13955
67,-0.13955
68,-0.13955
69,-0.13955
70,-0.13955
71,-0.13955
72,-0.13955
73,-0.13955
74,-0.13955
75,-0.13955
76,-0.13955
77,-0.13955
78,-0.13955
79,-0.13955
80,-0.13955
81,-0.13955
82,-0.13955
83,-0.13955
84,-0.13955
85,-0.13955
86,-0.13955
87,-0.13955
88,-0.13955
89,-0.13955
90,-0.13955
91,-0.13955
92,-0.13955
93,-0.13955
94,-0.13955
95,-0.13955
