time,value
0,-0.8751399999999999
1,1.6001
2,-0.14712
3,-0.8751399999999999
4,0.72651
5,0.5809
6,-0.8751399999999999
7,-0.0015167
8,1.3089
9,-0.8751399999999999
10,-0.8751399999999999
11,2.0369
12,-0.8751399999999999
13,-0.8751399999999999
14,1.8913
15,-0.8751399999999999
16,-0.8751399999999999
17,1.7457
18,-0.8751399999999999
19,-0.8751399999999999
20,1.7457
21,-0.8751399999999999
22,-0.8751399999999999
23,1.3089
24,-0.43833
25,-0.8751399999999999
26,1.0177
27,-0.14712
28,-0.8751399999999999
29,1.0177
30,-0.14712
31,-0.8751399999999999
32,0.72651
33,0.14409
34,-0.8751399999999999
35,1.0177
36,-0.0015167
37,-0.8751399999999999
38,0.72651
39,0.14409
40,-0.8751399999999999
41,0.4353
42,0.4353
43,-0.8751399999999999
44,-0.0015167
45,0.87211
46,-0.8751399999999999
47,-0.14712
48,1.0177
49,-0.8751399999999999
50,-0.29273000000000005
51,1.1633
52,-0.8751399999999999
53,-0.5839300000000001
54,1.4545
55,-0.8751399999999999
56,-0.8751399999999999
57,1.7457
58,-0.8751399999999999
59,-0.8751399999999999
60,1.3089
61,-0.43833
62,-0.8751399999999999
63,0.4353
64,0.4353
65,-0.8751399999999999
66,-0.29273000000000005
67,1.1633
68,-0.8751399999999999
69,-0.8751399999999999
70,1.7457
71,-0.8751399999999999
72,-0.8751399999999999
73,1.3089
74,-0.43833
75,-0.8751399999999999
76,1.0177
77,-0.14712
78,-0.8751399999999999
79,0.28969
80,0.72651
81,-0.8751399999999999
82,1.6001
83,-0.5839300000000001
84,-0.8751399999999999
85,1.8913
86,-0.8751399999999999
87,-0.8751399999999999
88,1.7457
89,-0.8751399999999999
90,-0.8751399999999999
91,1.8913
92,-0.8751399999999999
93,-0.8751399999999999
94,1.8913
95,-0.8751399999999999
