time,value
0,-0.32456
1,-0.32456
2,-0.32456
3,-0.32456
4,-0.32456
5,-0.32456
6,-0.32456
7,-0.32456
8,-0.32456
9,-0.32456
10,-0.32456
11,-0.32456
12,0.10226
13,-0.32456
14,-0.32456
15,-0.32456
16,-0.32456
17,-0.32456
18,-0.32456
19,-0.32456
20,0.10226
21,-0.32456
22,-0.32456
23,-0.32456
24,-0.32456
25,-0.32456
26,-0.32456
27,-0.32456
28,-0.32456
29,-0.32456
30,-0.32456
31,-0.32456
32,-0.32456
33,-0.32456
34,-0.32456
35,-0.32456
36,-0.32456
37,-0.32456
38,-0.32456
39,-0.32456
40,0.10226
41,-0.32456
42,-0.32456
43,-0.32456
44,-0.32456
45,-0.32456
46,-0.32456
47,-0.32456
48,-0.32456
49,-0.32456
50,-0.32456
51,-0.32456
52,-0.32456
53,-0.32456
54,-0.32456
55,-0.32456
56,0.10226
57,-0.32456
58,-0.32456
59,-0.32456
60,-0.32456
61,-0.32456
62,-0.32456
63,-0.32456
64,-0.32456
65,-0.32456
66,-0.32456
67,-0.32456
68,-0.32456
69,-0.32456
70,-0.32456
71,-0.32456
72,-0.32456
73,1.5961
74,0.31566
75,-0.32456
76,-0.32456
77,-0.32456
78,-0.32456
79,-0.32456
80,-0.32456
81,-0.32456
82,-0.32456
83,-0.32456
84,0.10226
85,3.5168
86,3.5168
87,3.3034
88,3.5168
89,3.5168
90,3.3034
91,3.5168
92,-0.32456
93,-0.32456
94,-0.32456
95,-0.32456
