time,value
0,-0.30426
1,-0.30426
2,-0.30426
3,-0.30426
4,-0.30426
5,-0.30426
6,-0.30426
7,-0.30426
8,-0.30426
9,-0.30426
10,-0.30426
11,-0.30426
12,-0.30426
13,-0.30426
14,-0.30426
15,-0.30426
16,-0.30426
17,-0.30426
18,-0.30426
19,-0.30426
20,-0.30426
21,-0.30426
22,-0.30426
23,-0.30426
24,-0.30426
25,-0.30426
26,-0.30426
27,1.3047
28,3.5325
29,3.4087
30,3.5325
31,3.0374
32,3.78
33,3.78
34,3.1612
35,0.9334
36,-0.30426
37,-0.30426
38,-0.30426
39,-0.30426
40,-0.30426
41,-0.30426
42,-0.30426
43,-0.30426
44,-0.30426
45,-0.30426
46,-0.30426
47,-0.30426
48,-0.30426
49,-0.30426
50,-0.30426
51,-0.30426
52,-0.30426
53,-0.30426
54,-0.30426
55,-0.30426
56,-0.30426
57,-0.30426
58,-0.30426
59,-0.30426
60,-0.30426
61,-0.30426
62,-0.30426
63,-0.30426
64,-0.30426
65,-0.30426
66,-0.30426
67,-0.30426
68,-0.30426
69,-0.30426
70,-0.30426
71,-0.30426
72,-0.30426
73,-0.30426
74,-0.30426
75,-0.30426
76,-0.30426
77,-0.30426
78,-0.30426
79,-0.30426
80,-0.30426
81,-0.30426
82,-0.30426
83,-0.30426
84,-0.30426
85,-0.30426
86,-0.30426
87,-0.30426
88,-0.30426
89,-0.30426
90,-0.30426
91,-0.30426
92,-0.30426
93,-0.30426
94,-0.30426
95,-0.30426
