time,value
0,1.4315
1,1.1213
2,0.96616
3,-0.89507
4,-0.89507
5,-0.89507
6,-0.89507
7,-0.89507
8,0.65596
9,1.4315
10,1.1213
11,-0.42976000000000003
12,-0.89507
13,-0.89507
14,-0.89507
15,-0.89507
16,-0.27466
17,1.5866
18,1.2764
19,0.34575
20,-0.89507
21,-0.89507
22,-0.89507
23,-0.89507
24,-0.89507
25,0.81106
26,1.4315
27,1.1213
28,-0.89507
29,-0.89507
30,-0.89507
31,-0.89507
32,-0.89507
33,0.035544
34,1.4315
35,1.2764
36,-0.27466
37,-0.89507
38,-0.89507
39,-0.89507
40,-0.89507
41,-0.89507
42,1.2764
43,1.4315
44,1.1213
45,-0.89507
46,-0.89507
47,-0.89507
48,-0.89507
49,-0.89507
50,0.035544
51,1.5866
52,1.1213
53,1.2764
54,1.1213
55,1.1213
56,0.34575
57,-0.89507
58,-0.89507
59,-0.89507
60,-0.89507
61,-0.11955999999999999
62,1.5866
63,1.2764
64,1.1213
65,0.96616
66,-0.58487
67,-0.89507
68,-0.89507
69,-0.89507
70,-0.27466
71,1.5866
72,1.1213
73,1.2764
74,1.1213
75,-0.89507
76,-0.89507
77,-0.89507
78,-0.89507
79,-0.89507
80,0.81106
81,1.4315
82,1.1213
83,1.1213
84,-0.89507
85,-0.89507
86,-0.89507
87,-0.89507
88,-0.89507
89,0.34575
90,1.4315
91,1.1213
92,1.1213
93,-0.11955999999999999
94,-0.89507
95,-0.89507
