time,value
0,-0.1262
1,-0.1262
2,-0.1262
3,-0.1262
4,-0.1262
5,-0.1262
6,-0.1262
7,-0.1262
8,-0.1262
9,-0.1262
10,-0.1262
11,-0.1262
12,-0.1262
13,-0.1262
14,-0.1262
15,-0.1262
16,-0.1262
17,-0.1262
18,-0.1262
19,-0.1262
20,-0.1262
21,-0.1262
22,-0.1262
23,-0.1262
24,-0.1262
25,-0.1262
26,-0.1262
27,-0.1262
28,-0.1262
29,-0.1262
30,-0.1262
31,-0.1262
32,-0.1262
33,-0.1262
34,-0.1262
35,-0.1262
36,-0.1262
37,-0.1262
38,-0.1262
39,-0.1262
40,-0.1262
41,-0.1262
42,-0.1262
43,-0.1262
44,0.06858
45,9.613
46,0.78928
47,0.4971
48,0.51658
49,-0.1262
50,-0.1262
51,-0.1262
52,-0.1262
53,-0.1262
54,-0.1262
55,-0.1262
56,-0.1262
57,-0.1262
58,-0.1262
59,-0.1262
60,-0.1262
61,-0.1262
62,-0.1262
63,-0.1262
64,-0.1262
65,-0.1262
66,-0.1262
67,-0.1262
68,-0.1262
69,-0.1262
70,-0.1262
71,-0.1262
72,-0.1262
73,-0.1262
74,-0.1262
75,-0.1262
76,-0.1262
77,-0.1262
78,-0.1262
79,-0.1262
80,-0.1262
81,-0.1262
82,-0.1262
83,-0.1262
84,-0.1262
85,-0.1262
86,-0.1262
87,-0.1262
88,-0.1262
89,-0.1262
90,-0.1262
91,-0.1262
92,-0.1262
93,-0.1262
94,-0.1262
95,-0.1262
