time,value
0,1.0806
1,1.5612
2,1.0757
3,0.12625999999999998
4,-0.20248
5,-0.4562
6,-0.63798
7,-0.39676
8,0.47708999999999996
9,2.3889
10,2.1173
11,2.0984
12,2.0952
13,1.2113
14,0.66764
15,-0.5113300000000001
16,-0.58399
17,-0.91812
18,-1.2984
19,-1.7377
20,-1.5130000000000001
21,-1.1374
22,-0.97234
23,-0.7965399999999999
24,-0.82665
25,-0.92406
26,-0.9707399999999999
27,-0.97211
28,-0.8307899999999999
29,-0.61124
30,-0.60847
31,-0.66061
32,-0.43688
33,-0.15957000000000002
34,0.14128
35,0.25163
36,0.64347
37,0.66932
38,0.8912700000000001
39,0.8269799999999999
40,0.74637
41,0.67543
42,0.59611
43,0.5778300000000001
44,0.72634
45,0.65135
46,0.42326
47,0.30551
48,0.36284
49,0.40692
50,0.083906
51,-0.2078
52,-0.25325
53,-0.38006
54,-0.36879
55,-0.8499200000000001
56,-1.1074
57,-1.0026
58,-1.0838
59,-1.2905
60,-1.4074
61,-1.4178
62,-0.9029799999999999
63,-0.9902
64,-1.2977
65,-1.2056
66,-1.2442
67,-0.9737899999999999
68,-1.2302
69,-1.1745
70,-1.0286
71,-0.9742200000000001
72,-1.0919
73,-1.2633
74,-1.1687
75,-1.3863
76,-1.4191
77,-1.1233
78,-1.1356
79,-0.6965600000000001
80,-0.11705
81,0.1007
82,0.11748
83,0.3003
84,0.44638999999999995
85,-0.010413
86,-0.057335000000000004
87,-0.11599999999999999
88,-0.055169
89,-0.26886
90,-1.0251
91,-0.95791
92,-1.4414
93,-1.1953
94,-1.2219
95,-2.1507
96,-1.8469
97,-1.757
98,-2.2296
99,-2.3372
100,-1.6975
101,-1.7196
102,-1.9549
103,-2.0968
104,-1.6547
105,-1.3889
106,-1.4583
107,-1.7729
108,-1.1908
109,-0.66228
110,-0.9495399999999999
111,-0.68797
112,-0.58659
113,-0.33316
114,-0.088956
115,0.06421900000000001
116,0.61429
117,0.46392
118,0.57065
119,0.96391
120,1.2085
121,1.2498
122,1.5457
123,1.4140000000000001
124,1.2738
125,1.5422
126,1.4057
127,1.2851
128,0.78956
129,0.5387
130,0.5413
131,0.9181600000000001
132,1.3244
133,1.7865
134,1.5609
135,0.8993200000000001
136,0.42381
137,0.88756
138,0.9225700000000001
139,1.3973
140,1.8266
141,2.2098
142,1.9156
143,1.6761
144,1.0466
145,1.1378
146,1.1488
147,0.93606
148,1.0476
149,1.3449
150,1.5735
151,1.624
152,1.0178
153,0.79791
154,0.95493
155,1.1691
156,1.2667
157,1.4348
158,1.6894
159,1.8049
160,1.4327
161,0.87555
162,0.73285
163,0.75256
164,0.86877
165,0.99679
166,1.1733
167,1.3459999999999999
168,1.2675
169,1.0871
170,0.87965
171,0.73243
172,0.64478
173,0.43465
174,0.54797
175,0.73819
176,0.74174
177,0.8337100000000001
178,0.9352600000000001
179,1.0395
180,1.103
181,1.0034
182,0.85825
183,0.66106
184,0.63283
185,0.35835
186,0.46723000000000003
187,0.44911
188,0.59287
189,0.52863
190,0.51342
191,0.5955
192,0.30503
193,0.060313
194,0.10765
195,-0.0097569
196,0.11695
197,0.14390999999999998
198,0.27596
199,0.38756
200,0.73533
201,0.63063
202,0.15509
203,0.17657
204,-0.17019
205,-0.21846
206,-0.23631
207,-0.15725999999999998
208,-0.044329
209,0.39458000000000004
210,0.33399
211,0.09434
212,-0.63053
213,-0.8736799999999999
214,0.011551
215,0.26777
216,0.76964
217,0.74038
218,-0.42877
219,-1.0116
220,-1.493
221,-0.89233
222,-0.1062
223,0.33459
224,-0.1914
225,-0.36333000000000004
226,-0.76869
227,-0.51295
228,0.09046900000000001
229,0.31324
230,0.33718000000000004
231,-0.20363
232,-1.0254
233,-1.8277
234,-1.6376
235,-1.1515
236,0.13932
237,1.4276
238,1.7222
239,0.71329
240,-0.9581200000000001
241,-1.0527
242,-1.9483
243,-0.8617299999999999
244,-0.21406
245,1.1982
246,1.4598
247,0.17153
248,-0.73732
249,-1.3159999999999998
250,-1.6001
251,-0.59726
252,0.24276
253,1.1866
254,1.7241
255,0.82399
256,-0.22954000000000002
257,-1.2044
258,-0.9143399999999999
259,-1.3397
260,-0.91799
261,-0.21114000000000002
262,0.33771
263,0.90169
264,1.1809
265,0.035601999999999995
266,-0.94178
267,-1.0912
268,-1.0805
269,-1.3575
270,-0.39232
271,0.31062
272,0.31056
273,0.31426
274,0.04156
275,-0.25019
276,-0.058659
277,-0.54508
278,-0.56272
279,-1.122
280,-0.8487899999999999
281,-0.84909
282,-0.30255
283,-0.01425
284,-0.29974
285,-0.0021639
286,-0.0015597000000000002
287,0.0064247
288,-0.23818000000000003
289,-0.061478
290,-0.6158600000000001
291,-0.8773799999999999
292,-0.59337
293,-0.020941
294,-0.011134999999999999
295,-0.59664
296,-1.1518
297,-0.5856
298,0.24056999999999998
299,0.2449
