time,value
0,-0.6470199999999999
1,-0.59487
2,-0.6470199999999999
3,-0.6470199999999999
4,0.9175700000000001
5,1.5956
6,1.7519999999999998
7,1.5956
8,1.6477
9,1.5956
10,1.5956
11,1.5956
12,-0.28195
13,-0.6470199999999999
14,-0.6470199999999999
15,-0.6470199999999999
16,-0.6470199999999999
17,-0.6470199999999999
18,-0.6470199999999999
19,-0.59487
20,-0.43841
21,-0.49057
22,-0.59487
23,-0.6470199999999999
24,-0.6470199999999999
25,-0.6470199999999999
26,-0.6470199999999999
27,-0.6470199999999999
28,-0.6470199999999999
29,-0.6470199999999999
30,-0.6470199999999999
31,-0.6470199999999999
32,-0.6470199999999999
33,-0.6470199999999999
34,-0.6470199999999999
35,-0.6470199999999999
36,-0.6470199999999999
37,-0.6470199999999999
38,-0.6470199999999999
39,-0.6470199999999999
40,-0.6470199999999999
41,-0.6470199999999999
42,-0.6470199999999999
43,-0.6470199999999999
44,-0.6470199999999999
45,-0.6470199999999999
46,-0.6470199999999999
47,-0.54272
48,-0.49057
49,1.1783
50,1.7519999999999998
51,1.8042
52,1.7519999999999998
53,1.7519999999999998
54,1.7519999999999998
55,1.6999
56,1.6999
57,1.6999
58,1.4391
59,1.4913
60,1.4391
61,1.4913
62,1.4391
63,1.4913
64,1.5956
65,1.5956
66,1.5956
67,1.5956
68,0.08311900000000001
69,-0.54272
70,-0.6470199999999999
71,-0.6470199999999999
72,-0.6470199999999999
73,-0.59487
74,-0.69918
75,-0.6470199999999999
76,-0.6470199999999999
77,-0.59487
78,-0.6470199999999999
79,-0.6470199999999999
80,-0.6470199999999999
81,-0.6470199999999999
82,-0.6470199999999999
83,-0.6470199999999999
84,-0.6470199999999999
85,-0.6470199999999999
86,-0.6470199999999999
87,-0.6470199999999999
88,-0.6470199999999999
89,-0.6470199999999999
90,-0.59487
91,-0.6470199999999999
92,-0.6470199999999999
93,-0.6470199999999999
94,-0.6470199999999999
95,-0.6470199999999999
