time,value
0,-1.1227
1,-1.1227
2,-1.1227
3,-1.1227
4,-1.1227
5,-1.1227
6,-1.1227
7,-1.1227
8,-1.1227
9,-1.1227
10,-1.1227
11,-1.1227
12,-1.1227
13,-1.1227
14,-1.1227
15,-1.1227
16,-1.1227
17,-1.1227
18,-1.1227
19,-1.1227
20,-1.1227
21,-1.1227
22,-1.1227
23,-1.1227
24,-1.1227
25,-1.1227
26,-1.1227
27,-1.1227
28,1.288
29,1.5893
30,1.0871
31,1.288
32,0.8862200000000001
33,0.8862200000000001
34,1.0871
35,0.8862200000000001
36,0.78577
37,0.8862200000000001
38,1.0871
39,0.98666
40,0.68533
41,0.78577
42,0.8862200000000001
43,0.98666
44,0.78577
45,0.68533
46,0.78577
47,0.98666
48,0.8862200000000001
49,1.5893
50,0.38399
51,1.288
52,1.1876
53,0.8862200000000001
54,0.48444
55,0.5848800000000001
56,0.68533
57,0.5848800000000001
58,0.78577
59,0.38399
60,0.8862200000000001
61,-0.92179
62,-1.1227
63,-1.1227
64,-1.1227
65,-1.1227
66,-1.1227
67,-1.1227
68,1.8907
69,1.0871
70,0.78577
71,0.98666
72,0.8862200000000001
73,0.38399
74,0.78577
75,0.38399
76,0.5848800000000001
77,0.5848800000000001
78,0.8862200000000001
79,0.48444
80,0.8862200000000001
81,0.28355
82,0.5848800000000001
83,0.5848800000000001
84,0.68533
85,0.48444
86,0.68533
87,0.48444
88,0.8862200000000001
89,0.5848800000000001
90,-1.1227
91,-1.1227
92,-1.1227
93,-1.1227
94,-1.1227
95,-1.1227
