time,value
0,-0.15623
1,-0.15623
2,-0.15623
3,-0.15623
4,-0.15623
5,-0.15623
6,-0.15623
7,-0.15623
8,-0.15623
9,-0.15623
10,-0.15623
11,-0.15623
12,-0.15623
13,-0.15623
14,-0.15623
15,-0.15623
16,-0.15623
17,-0.15623
18,-0.15623
19,-0.15623
20,-0.15623
21,-0.15623
22,-0.15623
23,-0.15623
24,-0.15623
25,-0.15623
26,-0.15623
27,-0.15623
28,-0.15623
29,-0.15623
30,-0.15623
31,-0.15623
32,-0.15623
33,-0.15623
34,-0.15623
35,-0.15623
36,-0.15623
37,-0.15623
38,-0.15623
39,-0.15623
40,-0.15623
41,-0.15623
42,-0.15623
43,-0.15623
44,-0.15623
45,-0.15623
46,-0.15623
47,-0.15623
48,-0.15623
49,-0.15623
50,-0.15623
51,-0.15623
52,-0.15623
53,-0.15623
54,-0.15623
55,-0.15623
56,-0.15623
57,-0.15623
58,-0.15623
59,-0.15623
60,-0.15623
61,-0.15623
62,-0.15623
63,-0.15623
64,-0.15623
65,-0.15623
66,-0.15623
67,-0.15623
68,-0.15623
69,-0.15623
70,-0.15623
71,-0.15623
72,-0.15623
73,-0.15623
74,-0.15623
75,-0.15623
76,-0.15623
77,-0.15623
78,-0.15623
79,7.9132
80,5.4417
81,0.56199
82,0.45637
83,-0.15623
84,-0.15623
85,-0.15623
86,-0.15623
87,-0.15623
88,-0.15623
89,-0.15623
90,-0.15623
91,-0.15623
92,-0.15623
93,-0.15623
94,-0.15623
95,-0.15623
