{
  "about": {
    "problemID": "4550_MiceProtein_problem",
    "problemName": "MiceProtein_problem",
    "problemDescription": "**Author**: Clara Higuera, Katheleen J. Gardiner, Krzysztof J. Cios  \n**Source**: [UCI](https://archive.ics.uci.edu/ml/datasets/Mice+Protein+Expression) - 2015   \n**Please cite**: Higuera C, Gardiner KJ, Cios KJ (2015) Self-Organizing Feature Maps Identify Proteins Critical to Learning in a Mouse Model of Down Syndrome. PLoS ONE 10(6): e0129126.\n\n**Deactivated because the attributes Genotype, Treatment and Behavior should be ignored. They leak information about the target. Use version 4 instead.** \n\nExpression levels of 77 proteins measured in the cerebral cortex of 8 classes of control and Down syndrome mice exposed to context fear conditioning, a task used to assess associative learning.\n\n### Source:\n```\nClara Higuera Department of Software Engineering and Artificial Intelligence, Faculty of Informatics and the Department of Biochemistry and Molecular Biology, Faculty of Chemistry, University Complutense, Madrid, Spain. \nEmail: clarahiguera '@' ucm.es \n\nKatheleen J. Gardiner, creator and owner of the protein expression data, is currently with the Linda Crnic Institute for Down Syndrome, Department of Pediatrics, Department of Biochemistry and Molecular Genetics, Human Medical Genetics and Genomics, and Neuroscience Programs, University of Colorado, School of Medicine, Aurora, Colorado, USA. \nEmail: katheleen.gardiner '@' ucdenver.edu \n\nKrzysztof J. Cios is currently with the Department of Computer Science, Virginia Commonwealth University, Richmond, Virginia, USA, and IITiS Polish Academy of Sciences, Poland. \nEmail: kcios '@' vcu.edu \n```\n\n### Data Set Information\n\nThe data set consists of the expression levels of 77 proteins/protein modifications that produced detectable signals in the nuclear fraction of cortex. There are 38 control mice and 34 trisomic mice (Down syndrome), for a total of 72 mice. In the experiments, 15 measurements were registered of each protein per sample/mouse. Therefore, for control mice, there are 38x15, or 570 measurements, and for trisomic mice, there are 34x15, or 510 measurements. The dataset contains a total of 1080 measurements per protein. Each measurement can be considered as an independent sample/mouse. \n\nThe eight classes of mice are described based on features such as genotype, behavior and treatment. According to genotype, mice can be control or trisomic. According to behavior, some mice have been stimulated to learn (context-shock) and others have not (shock-context) and in order to assess the effect of the drug memantine in recovering the ability to learn in trisomic mice, some mice have been injected with the drug and others have not. \n\nClasses: \n```\n* c-CS-s: control mice, stimulated to learn, injected with saline (9 mice) \n* c-CS-m: control mice, stimulated to learn, injected with memantine (10 mice) \n* c-SC-s: control mice, not stimulated to learn, injected with saline (9 mice) \n* c-SC-m: control mice, not stimulated to learn, injected with memantine (10 mice) \n* t-CS-s: trisomy mice, stimulated to learn, injected with saline (7 mice) \n* t-CS-m: trisomy mice, stimulated to learn, injected with memantine (9 mice) \n* t-SC-s: trisomy mice, not stimulated to learn, injected with saline (9 mice) \n* t-SC-m: trisomy mice, not stimulated to learn, injected with memantine (9 mice) \n```\n\nThe aim is to identify subsets of proteins that are discriminant between the classes. \n\n### Attribute Information:\n\n```\n1 Mouse ID \n2..78 Values of expression levels of 77 proteins; the names of proteins are followed by &acirc;&euro;&oelig;_n&acirc;&euro; indicating that they were measured in the nuclear fraction. For example: DYRK1A_n \n79 Genotype: control (c) or trisomy (t) \n80 Treatment type: memantine (m) or saline (s) \n81 Behavior: context-shock (CS) or shock-context (SC) \n82 Class: c-CS-s, c-CS-m, c-SC-s, c-SC-m, t-CS-s, t-CS-m, t-SC-s, t-SC-m \n```\n\n### Relevant Papers:\n\nHiguera C, Gardiner KJ, Cios KJ (2015) Self-Organizing Feature Maps Identify Proteins Critical to Learning in a Mouse Model of Down Syndrome. PLoS ONE 10(6): e0129126. [Web Link] journal.pone.0129126 \n\nAhmed MM, Dhanasekaran AR, Block A, Tong S, Costa ACS, Stasko M, et al. (2015) Protein Dynamics Associated with Failed and Rescued Learning in the Ts65Dn Mouse Model of Down Syndrome. PLoS ONE 10(3): e0119491.",
    "problemVersion": "4.0.0",
    "problemSchemaVersion": "4.0.0",
    "taskKeywords": [
      "classification",
      "multiClass",
      "tabular"
    ]
  },
  "inputs": {
    "data": [
      {
        "datasetID": "4550_MiceProtein_dataset",
        "targets": [
          {
            "targetIndex": 0,
            "resID": "learningData",
            "colIndex": 82,
            "colName": "class"
          }
        ]
      }
    ],
    "dataSplits": {
      "splitsFile": "dataSplits.csv",
      "splitScript": "splitData.py",
      "datasetViewMaps": {
        "train": [
          {
            "from": "4550_MiceProtein_dataset",
            "to": "4550_MiceProtein_dataset_TRAIN"
          }
        ],
        "test": [
          {
            "from": "4550_MiceProtein_dataset",
            "to": "4550_MiceProtein_dataset_TEST"
          }
        ],
        "score": [
          {
            "from": "4550_MiceProtein_dataset",
            "to": "4550_MiceProtein_dataset_SCORE"
          }
        ]
      }
    },
    "performanceMetrics": [
      {
        "metric": "f1Macro"
      }
    ]
  },
  "expectedOutputs": {
    "predictionsFile": "predictions.csv"
  }
}