time,value
0,-0.30564
1,-0.30564
2,-0.30564
3,-0.30564
4,-0.30564
5,-0.30564
6,-0.30564
7,-0.30564
8,-0.30564
9,-0.30564
10,-0.30564
11,-0.30564
12,-0.30564
13,-0.30564
14,-0.30564
15,-0.30564
16,-0.30564
17,-0.30564
18,-0.30564
19,-0.30564
20,-0.30564
21,-0.30564
22,-0.30564
23,-0.30564
24,-0.30564
25,-0.30564
26,-0.30564
27,-0.30564
28,-0.30564
29,5.0334
30,3.9838
31,-0.30564
32,-0.30564
33,-0.30564
34,-0.30564
35,-0.30564
36,-0.30564
37,-0.30564
38,-0.30564
39,2.5236
40,-0.30564
41,-0.30564
42,-0.30564
43,-0.30564
44,2.0216
45,-0.30564
46,-0.30564
47,-0.30564
48,-0.30564
49,-0.30564
50,2.2041
51,-0.30564
52,-0.30564
53,-0.30564
54,-0.30564
55,-0.30564
56,-0.30564
57,-0.30564
58,-0.30564
59,-0.30564
60,-0.30564
61,-0.30564
62,-0.30564
63,-0.30564
64,-0.30564
65,-0.30564
66,-0.30564
67,-0.30564
68,-0.16874
69,3.8469
70,-0.30564
71,-0.30564
72,-0.30564
73,2.3409999999999997
74,2.3409999999999997
75,-0.30564
76,-0.30564
77,-0.30564
78,-0.30564
79,-0.30564
80,2.1585
81,-0.30564
82,-0.30564
83,-0.30564
84,-0.30564
85,-0.30564
86,-0.30564
87,-0.30564
88,-0.30564
89,-0.30564
90,-0.30564
91,-0.30564
92,-0.30564
93,-0.30564
94,-0.30564
95,-0.30564
