time,value
0,0.5263899999999999
1,0.5263899999999999
2,0.5263899999999999
3,-1.88
4,0.5263899999999999
5,0.5263899999999999
6,0.5263899999999999
7,0.5263899999999999
8,-1.88
9,0.5263899999999999
10,0.5263899999999999
11,0.5263899999999999
12,-1.88
13,0.5263899999999999
14,0.5263899999999999
15,0.5263899999999999
16,0.5263899999999999
17,-1.88
18,0.5263899999999999
19,0.5263899999999999
20,0.5263899999999999
21,-1.88
22,0.5263899999999999
23,0.5263899999999999
24,0.5263899999999999
25,0.5263899999999999
26,-1.88
27,0.5263899999999999
28,0.5263899999999999
29,0.5263899999999999
30,-1.88
31,0.5263899999999999
32,0.5263899999999999
33,0.5263899999999999
34,0.5263899999999999
35,-1.88
36,0.5263899999999999
37,0.5263899999999999
38,0.5263899999999999
39,-1.88
40,0.5263899999999999
41,0.5263899999999999
42,0.5263899999999999
43,-1.88
44,0.5263899999999999
45,0.5263899999999999
46,0.5263899999999999
47,0.5263899999999999
48,-1.88
49,0.5263899999999999
50,0.5263899999999999
51,0.5263899999999999
52,-1.88
53,0.5263899999999999
54,0.5263899999999999
55,0.5263899999999999
56,0.5263899999999999
57,-1.88
58,0.5263899999999999
59,0.5263899999999999
60,0.5263899999999999
61,-1.88
62,0.5263899999999999
63,0.5263899999999999
64,0.5263899999999999
65,-1.88
66,0.5263899999999999
67,0.5263899999999999
68,0.5263899999999999
69,0.5263899999999999
70,-1.88
71,0.5263899999999999
72,0.5263899999999999
73,0.5263899999999999
74,-1.88
75,0.5263899999999999
76,0.5263899999999999
77,0.5263899999999999
78,0.5263899999999999
79,-1.88
80,0.5263899999999999
81,0.5263899999999999
82,0.5263899999999999
83,-1.88
84,0.5263899999999999
85,0.5263899999999999
86,0.5263899999999999
87,0.5263899999999999
88,-1.88
89,0.5263899999999999
90,0.5263899999999999
91,0.5263899999999999
92,-1.88
93,0.5263899999999999
94,0.5263899999999999
95,0.5263899999999999
