time,value
0,0.9374899999999999
1,0.98357
2,1.0757
3,-0.16849
4,-1.0441
5,-1.0441
6,-1.1362
7,-1.1362
8,-0.90581
9,-1.0441
10,-1.1362
11,-1.1362
12,-1.0441
13,-1.1362
14,-1.1362
15,-1.1362
16,-1.1362
17,-1.1362
18,-1.1362
19,-1.1362
20,-1.0441
21,-1.0901
22,-1.1362
23,-1.1362
24,-1.1362
25,-1.1362
26,-1.1362
27,-1.1362
28,-1.1362
29,-1.1362
30,-1.1362
31,-1.1362
32,-1.0441
33,-1.1362
34,-1.1362
35,-1.1362
36,-1.1362
37,-1.1362
38,-1.1362
39,-1.1362
40,-1.0441
41,-1.1362
42,-1.1362
43,-1.0901
44,-1.1362
45,-1.1362
46,-0.030242
47,0.98357
48,0.79924
49,0.75316
50,0.70708
51,0.75316
52,0.75316
53,0.70708
54,0.8453200000000001
55,0.98357
56,1.0297
57,0.89141
58,0.89141
59,0.9374899999999999
60,0.89141
61,0.9374899999999999
62,0.8453200000000001
63,0.70708
64,0.79924
65,0.79924
66,0.70708
67,0.70708
68,0.9374899999999999
69,0.98357
70,0.9374899999999999
71,0.9374899999999999
72,0.9374899999999999
73,0.98357
74,0.9374899999999999
75,0.89141
76,0.9374899999999999
77,0.9374899999999999
78,0.98357
79,0.9374899999999999
80,0.9374899999999999
81,0.9374899999999999
82,0.9374899999999999
83,0.9374899999999999
84,0.98357
85,0.9374899999999999
86,0.9374899999999999
87,0.9374899999999999
88,0.98357
89,0.9374899999999999
90,0.98357
91,0.9374899999999999
92,0.9374899999999999
93,0.9374899999999999
94,0.98357
95,0.9374899999999999
