time,value
0,-0.17163
1,-0.17163
2,-0.17163
3,-0.17163
4,-0.17163
5,-0.17163
6,-0.17163
7,-0.17163
8,-0.17163
9,-0.17163
10,-0.17163
11,-0.17163
12,-0.17163
13,-0.17163
14,-0.17163
15,-0.17163
16,-0.17163
17,-0.17163
18,-0.17163
19,-0.17163
20,-0.17163
21,-0.17163
22,-0.17163
23,-0.17163
24,-0.17163
25,-0.17163
26,-0.17163
27,-0.17163
28,-0.17163
29,-0.17163
30,-0.17163
31,-0.17163
32,-0.17163
33,-0.17163
34,-0.17163
35,-0.17163
36,-0.17163
37,-0.17163
38,-0.17163
39,-0.17163
40,-0.17163
41,-0.17163
42,-0.17163
43,-0.17163
44,-0.17163
45,-0.17163
46,-0.17163
47,-0.17163
48,-0.17163
49,-0.17163
50,0.6392
51,0.10405999999999999
52,-0.17163
53,-0.17163
54,-0.17163
55,-0.17163
56,-0.17163
57,-0.17163
58,-0.17163
59,-0.17163
60,-0.17163
61,-0.17163
62,-0.17163
63,-0.17163
64,-0.17163
65,-0.17163
66,-0.17163
67,-0.17163
68,-0.17163
69,-0.17163
70,8.1151
71,4.6447
72,2.1149
73,-0.17163
74,-0.17163
75,-0.17163
76,-0.17163
77,-0.17163
78,-0.17163
79,-0.17163
80,-0.17163
81,-0.17163
82,-0.17163
83,-0.17163
84,-0.17163
85,-0.17163
86,-0.17163
87,-0.17163
88,-0.17163
89,-0.17163
90,-0.17163
91,-0.17163
92,-0.17163
93,-0.17163
94,-0.17163
95,-0.17163
