time,value
0,1.6269999999999998
1,0.61716
2,-0.72937
3,-0.72937
4,-0.72937
5,-0.72937
6,-0.72937
7,0.78547
8,1.7954
9,1.4587
10,-0.22441999999999998
11,-0.72937
12,-0.72937
13,-0.72937
14,-0.72937
15,-0.72937
16,1.9637
17,1.4587
18,0.44883999999999996
19,-0.72937
20,-0.72937
21,-0.72937
22,-0.72937
23,-0.72937
24,0.61716
25,1.7954
26,1.1221
27,-0.72937
28,-0.72937
29,-0.72937
30,-0.72937
31,-0.72937
32,-0.72937
33,1.9637
34,1.6269999999999998
35,-0.056104999999999995
36,-0.72937
37,-0.72937
38,-0.72937
39,-0.72937
40,-0.72937
41,1.7954
42,1.4587
43,0.44883999999999996
44,-0.72937
45,-0.72937
46,-0.72937
47,-0.72937
48,-0.72937
49,0.28053
50,1.7954
51,1.2904
52,-0.72937
53,-0.72937
54,-0.72937
55,-0.72937
56,-0.72937
57,-0.22441999999999998
58,1.7954
59,1.6269999999999998
60,-0.22441999999999998
61,-0.72937
62,-0.72937
63,-0.72937
64,-0.72937
65,-0.72937
66,0.78547
67,1.7954
68,1.2904
69,-0.72937
70,-0.72937
71,-0.72937
72,-0.72937
73,-0.72937
74,-0.72937
75,1.6269999999999998
76,1.4587
77,0.61716
78,-0.72937
79,-0.72937
80,-0.72937
81,-0.72937
82,-0.72937
83,0.44883999999999996
84,1.7954
85,1.4587
86,-0.056104999999999995
87,-0.72937
88,-0.72937
89,-0.72937
90,-0.72937
91,0.11220999999999999
92,1.7954
93,1.4587
94,-0.056104999999999995
95,-0.72937
