time,value
0,-0.25605
1,-0.25605
2,-0.25605
3,-0.25605
4,-0.25605
5,-0.25605
6,-0.25605
7,-0.25605
8,-0.25605
9,-0.25605
10,-0.25605
11,-0.25605
12,-0.25605
13,-0.25605
14,-0.25605
15,-0.25605
16,-0.25605
17,-0.25605
18,-0.25605
19,-0.25605
20,-0.25605
21,-0.25605
22,-0.25605
23,-0.25605
24,-0.25605
25,-0.25605
26,-0.25605
27,-0.25605
28,-0.25605
29,-0.25605
30,-0.25605
31,-0.25605
32,-0.25605
33,-0.25605
34,-0.25605
35,-0.25605
36,-0.25605
37,-0.25605
38,-0.25605
39,-0.25605
40,-0.25605
41,-0.25605
42,-0.25605
43,-0.25605
44,-0.25605
45,-0.25605
46,-0.25605
47,-0.25605
48,-0.25605
49,-0.25605
50,-0.25605
51,-0.25605
52,-0.25605
53,-0.25605
54,-0.25605
55,-0.25605
56,-0.25605
57,-0.25605
58,-0.25605
59,-0.25605
60,-0.25605
61,-0.25605
62,-0.25605
63,-0.25605
64,-0.25605
65,-0.25605
66,-0.25605
67,-0.25605
68,-0.25605
69,-0.25605
70,-0.25605
71,-0.25605
72,-0.25605
73,-0.25605
74,-0.25605
75,-0.25605
76,-0.25605
77,-0.25605
78,-0.25605
79,-0.25605
80,-0.25605
81,-0.25605
82,-0.25605
83,3.2006
84,4.0968
85,4.0968
86,3.9688
87,3.9688
88,3.7127
89,-0.25605
90,-0.25605
91,-0.25605
92,-0.25605
93,-0.25605
94,-0.25605
95,-0.25605
