time,value
0,-0.28506
1,-0.097625
2,0.27725
3,-0.65994
4,0.27725
5,-1.0348
6,1.7768
7,-1.2223
8,1.0270000000000001
9,-0.28506
10,-0.097625
11,-0.28506
12,-0.097625
13,0.65213
14,-1.2223
15,1.9642
16,-0.65994
17,1.0270000000000001
18,-0.4725
19,0.27725
20,0.27725
21,-1.2223
22,1.4019
23,-1.2223
24,1.0270000000000001
25,0.08981499999999999
26,0.65213
27,1.2145
28,-0.28506
29,3.4637
30,1.2145
31,0.46468999999999994
32,1.9642
33,0.83957
34,0.46468999999999994
35,1.9642
36,-0.28506
37,0.27725
38,1.0270000000000001
39,-1.0348
40,0.65213
41,0.46468999999999994
42,-1.0348
43,1.4019
44,-0.097625
45,-1.2223
46,1.4019
47,-0.4725
48,-0.8473799999999999
49,0.83957
50,-0.8473799999999999
51,-0.65994
52,0.46468999999999994
53,-1.0348
54,-0.097625
55,0.27725
56,-0.8473799999999999
57,0.08981499999999999
58,0.08981499999999999
59,-1.4097
60,0.83957
61,-0.28506
62,-1.2223
63,1.0270000000000001
64,-0.65994
65,-1.2223
66,1.4019
67,-1.0348
68,-0.28506
69,2.1517
70,-1.0348
71,0.08981499999999999
72,1.0270000000000001
73,-1.4097
74,0.27725
75,-0.097625
76,-1.0348
77,0.46468999999999994
78,-0.65994
79,-0.28506
80,0.27725
81,-1.2223
82,-0.097625
83,-0.097625
84,-1.2223
85,0.65213
86,-0.65994
87,-1.0348
88,0.46468999999999994
89,-1.2223
90,-0.097625
91,0.27725
92,-1.7846
93,0.27725
94,-1.4097
95,-1.4097
