time,value
0,0.47885
1,1.8424
2,-0.68987
3,-0.68987
4,-0.68987
5,-0.68987
6,2.0371
7,0.28406
8,-0.68987
9,-0.68987
10,-0.68987
11,0.8684200000000001
12,1.258
13,-0.68987
14,-0.68987
15,-0.68987
16,-0.3003
17,2.0371
18,-0.10550999999999999
19,-0.68987
20,-0.68987
21,-0.68987
22,1.258
23,0.8684200000000001
24,-0.68987
25,-0.68987
26,-0.68987
27,0.089277
28,2.2319
29,-0.68987
30,-0.68987
31,-0.68987
32,0.089277
33,2.0371
34,-0.68987
35,-0.68987
36,-0.68987
37,-0.68987
38,1.6476
39,0.47885
40,-0.68987
41,-0.68987
42,-0.68987
43,0.47885
44,1.8424
45,-0.68987
46,-0.68987
47,-0.68987
48,-0.68987
49,1.6476
50,0.67364
51,-0.68987
52,-0.68987
53,-0.68987
54,0.089277
55,2.2319
56,-0.68987
57,-0.68987
58,-0.68987
59,-0.68987
60,1.4528
61,0.67364
62,-0.68987
63,-0.68987
64,-0.68987
65,-0.10550999999999999
66,2.0371
67,-0.68987
68,-0.68987
69,-0.68987
70,-0.68987
71,1.4528
72,0.8684200000000001
73,-0.68987
74,-0.68987
75,-0.68987
76,0.28406
77,2.0371
78,-0.10550999999999999
79,-0.68987
80,-0.68987
81,-0.68987
82,1.258
83,1.4528
84,-0.68987
85,-0.68987
86,-0.68987
87,-0.68987
88,2.2319
89,0.089277
90,-0.68987
91,-0.68987
92,-0.68987
93,2.0371
94,0.28406
95,-0.68987
