time,value
0,-0.47021999999999997
1,-0.31668
2,-0.31668
3,-0.31668
4,-0.47021999999999997
5,-0.31668
6,-0.31668
7,-0.31668
8,-0.47021999999999997
9,-0.31668
10,-0.31668
11,-0.31668
12,-0.47021999999999997
13,-0.31668
14,-0.31668
15,-0.31668
16,-0.31668
17,-0.47021999999999997
18,-0.31668
19,-0.31668
20,-0.31668
21,-0.47021999999999997
22,-0.31668
23,-0.31668
24,-0.31668
25,-0.47021999999999997
26,-0.31668
27,-0.31668
28,-0.31668
29,-0.47021999999999997
30,-0.31668
31,-0.31668
32,-0.31668
33,-0.47021999999999997
34,-0.31668
35,-0.31668
36,-0.31668
37,-0.47021999999999997
38,-0.31668
39,-0.31668
40,-0.31668
41,-0.47021999999999997
42,-0.31668
43,-0.31668
44,-0.31668
45,-0.47021999999999997
46,-0.31668
47,-0.31668
48,-0.31668
49,-0.31668
50,-0.47021999999999997
51,-0.31668
52,-0.31668
53,-0.31668
54,-0.47021999999999997
55,-0.31668
56,-0.31668
57,-0.31668
58,-0.47021999999999997
59,-0.31668
60,-0.31668
61,-0.31668
62,-0.47021999999999997
63,-0.31668
64,-0.31668
65,-0.31668
66,-0.47021999999999997
67,-0.31668
68,-0.31668
69,-0.31668
70,-0.31668
71,-0.31668
72,-0.31668
73,-0.31668
74,-0.31668
75,-0.31668
76,-0.31668
77,-0.31668
78,-0.31668
79,-0.31668
80,1.8329
81,3.0613
82,3.0613
83,3.0613
84,2.9077
85,2.9077
86,2.9077
87,2.7542
88,3.0613
89,3.0613
90,1.0652
91,-0.31668
92,-0.31668
93,-0.31668
94,-0.47021999999999997
95,-0.31668
