time,value
0,1.0617
1,-0.45952
2,-0.96659
3,1.3997
4,-0.96659
5,0.89264
6,-0.2905
7,-0.96659
8,1.5687
9,-0.96659
10,0.5546
11,-0.12147999999999999
12,-0.96659
13,1.5687
14,-0.96659
15,0.38558000000000003
16,0.21656
17,-0.96659
18,1.5687
19,-0.96659
20,0.047537
21,0.38558000000000003
22,-0.96659
23,1.5687
24,-0.96659
25,-0.12147999999999999
26,0.5546
27,-0.96659
28,1.5687
29,-0.96659
30,-0.2905
31,0.89264
32,-0.96659
33,1.3997
34,-0.96659
35,-0.45952
36,1.0617
37,-0.96659
38,1.2307
39,-0.96659
40,-0.96659
41,1.3997
42,-0.96659
43,1.2307
44,-0.96659
45,-0.96659
46,1.5687
47,-0.96659
48,0.89264
49,-0.45952
50,-0.96659
51,1.5687
52,-0.96659
53,0.38558000000000003
54,0.047537
55,-0.96659
56,1.5687
57,-0.96659
58,0.047537
59,0.5546
60,-0.96659
61,1.3997
62,-0.96659
63,-0.12147999999999999
64,0.5546
65,-0.96659
66,1.5687
67,-0.96659
68,-0.45952
69,0.89264
70,-0.96659
71,1.3997
72,-0.96659
73,-0.96659
74,1.2307
75,-0.96659
76,1.0617
77,-0.45952
78,-0.96659
79,1.3997
80,-0.96659
81,0.89264
82,-0.2905
83,-0.96659
84,1.5687
85,-0.96659
86,0.21656
87,0.21656
88,-0.96659
89,1.5687
90,-0.96659
91,-0.12147999999999999
92,0.5546
93,-0.96659
94,1.5687
95,-0.96659
