time,value
0,0.04865
1,0.036927
2,0.05003
3,0.20749
4,0.20688
5,0.20573000000000002
6,0.21356999999999998
7,0.22130999999999998
8,0.048043
9,0.05276
10,0.052614999999999995
11,0.056144000000000006
12,0.075548
13,-0.17138
14,-0.14943
15,-0.79756
16,-1.6487
17,-2.8672
18,-2.6879
19,-3.4153
20,-4.2753
21,-4.6967
22,-4.5955
23,-4.2362
24,-3.7478
25,-3.0096
26,-2.1778
27,-1.1112
28,-0.26069000000000003
29,0.4503
30,1.1186
31,1.4175
32,1.4904
33,1.744
34,2.0909999999999997
35,2.0808
36,2.222
37,2.0837
38,1.9087
39,1.7062
40,2.2418
41,2.3217
42,1.9159
43,1.8453
44,1.8836
45,1.8919
46,1.7827
47,1.7323
48,1.8279
49,2.2464
50,2.3016
51,2.501
52,2.3869
53,2.0744
54,1.5647
55,1.088
56,0.49688000000000004
57,-0.033179
58,-0.61232
59,-0.73342
60,-0.88784
61,-0.8502700000000001
62,-0.52722
63,-0.37955
64,-0.06799
65,0.19791
66,0.57485
67,0.7501399999999999
68,0.85193
69,1.0285
70,1.0615
71,0.6339199999999999
72,0.19357
73,-0.24074
74,-0.63718
75,-0.62769
76,-0.79101
77,-0.99467
78,-1.3818
79,-1.3927
80,-1.1613
81,-1.0747
82,-0.8637600000000001
83,-0.84378
84,-0.75736
85,-0.8154100000000001
86,-0.8876200000000001
87,-1.0955
88,-1.2065
89,-1.2091
90,-1.31
91,-1.2396
92,-1.1748
93,-0.96231
94,-0.65988
95,-0.53168
96,-0.12359
97,0.083014
98,0.29241999999999996
99,0.46595
100,0.7148
101,0.77876
102,0.65069
103,0.56592
104,0.133
105,1.3403
106,0.49273999999999996
107,-0.23923000000000003
108,-0.25106999999999996
109,-0.50516
110,-0.39428
111,-0.12613
112,0.057869000000000004
113,-0.05929500000000001
114,-0.14336
115,-0.12224000000000002
116,-0.0029674
117,0.26408000000000004
118,0.36961
119,0.3
120,0.21178000000000002
121,0.20007
122,0.29106
123,-0.032875
124,0.072483
125,-0.21538000000000002
126,-0.38652
127,-0.48063
128,-0.9527399999999999
129,-1.587
130,-1.5006
131,-1.3083
132,-1.2786
133,-1.5031
134,-1.5005
135,-1.2890000000000001
136,-1.1045
137,-0.99511
138,-0.8115100000000001
139,-0.6610199999999999
140,-0.36654000000000003
141,-0.052952
142,0.31164000000000003
143,0.20315
144,0.09977799999999999
145,0.19125
146,0.31994
147,0.5318
148,0.43177
149,0.33557
150,0.14527
151,0.074287
152,0.10178
153,0.080682
154,0.21868
155,0.18955
156,0.19634000000000001
157,0.15957000000000002
158,0.18078
159,0.26032
160,0.37636
161,0.4281
162,0.54182
163,0.80062
164,0.40859
165,0.18667999999999998
166,-0.20287
167,-0.21172
168,-0.047889
169,0.06614
170,0.15554
171,0.23721
172,0.24806
173,0.080799
174,0.15822999999999998
175,0.15373
176,0.06321399999999999
177,0.056815
178,0.032465
179,0.029483
180,0.13910999999999998
181,0.24479
182,0.27591
183,0.26971999999999996
184,0.3206
185,0.2698
186,0.045685
187,-0.10962000000000001
188,-0.017991
189,-0.17562
190,0.21816
191,0.24414
192,0.29181999999999997
193,0.3895
194,0.33802
195,0.31889
196,0.40134000000000003
197,0.27825
198,0.48518999999999995
199,0.33214
200,0.28749
201,0.34163000000000004
202,0.2993
203,0.24697
204,0.24094000000000002
205,0.21771999999999997
206,0.1937
207,0.2421
208,0.22224000000000002
209,0.2136
210,0.22429000000000002
211,0.24051
212,0.38282
213,0.35201
214,0.17492
215,0.17844000000000002
216,0.17037
217,0.17040999999999998
218,0.021726
219,0.0005212999999999999
220,0.01799
221,0.017728999999999998
222,-0.096412
223,-0.41185
224,-0.41067
225,-0.38311999999999996
226,-0.36716
227,-0.088983
228,-0.097513
229,-0.10833
230,-0.40515
231,-0.12100999999999999
232,-0.12888
233,-0.12605999999999998
234,-0.046355
235,-0.13208
236,0.0017811
237,-0.017646000000000002
238,0.041461000000000005
239,0.12018
240,0.10032999999999999
241,0.11277999999999999
242,-0.0631
243,-0.13079000000000002
244,-0.014652000000000002
245,0.023837
246,0.14497000000000002
247,-0.025998
248,-0.024375
249,0.13526
250,0.13731
251,0.15661
252,-0.028201
253,-0.010003
254,0.13389
255,0.12755999999999998
256,0.13438
257,0.14979
258,0.31054
259,0.30864
260,0.30085
261,0.3198
262,0.14143
263,0.14422000000000001
264,0.00019908
265,0.12593
266,0.11369000000000001
267,0.12082000000000001
268,0.08296
269,0.1292
270,0.13128
271,0.12955999999999998
272,0.13274
273,0.13295
274,0.1374
275,0.23526999999999998
276,0.036157
277,-0.044704
278,-0.052713
279,0.11058
280,0.11697
281,0.11707999999999999
282,0.11125
283,0.1074
284,0.11199999999999999
285,0.11588
286,0.11215
287,0.064551
288,-0.011837
289,0.10119
290,0.092821
291,0.089089
292,0.090781
293,-0.070022
294,0.084812
295,0.08834600000000001
296,-0.05549199999999999
297,-0.064864
298,0.091397
299,0.09159400000000001
