time,value
0,-0.97051
1,-0.22813000000000003
2,1.4422
3,1.2566
4,0.23586
5,-0.97051
6,-0.97051
7,-0.97051
8,-0.32093
9,1.3494
10,1.3494
11,0.32866
12,-0.97051
13,-0.97051
14,-0.97051
15,-0.78492
16,1.4422
17,1.3494
18,0.79265
19,-0.97051
20,-0.97051
21,-0.97051
22,-0.97051
23,1.071
24,1.3494
25,1.1638
26,-0.97051
27,-0.97051
28,-0.97051
29,-0.97051
30,0.42146000000000006
31,1.3494
32,1.2566
33,-0.22813000000000003
34,-0.97051
35,-0.97051
36,-0.97051
37,0.14306
38,1.2566
39,1.3494
40,0.14306
41,-0.97051
42,-0.97051
43,-0.97051
44,-0.042532
45,1.3494
46,1.3494
47,0.23586
48,-0.97051
49,-0.97051
50,-0.97051
51,-0.13533
52,1.3494
53,1.2566
54,0.32866
55,-0.97051
56,-0.97051
57,-0.97051
58,0.050266000000000005
59,1.3494
60,1.2566
61,0.23586
62,-0.97051
63,-0.97051
64,-0.97051
65,0.14306
66,1.3494
67,1.2566
68,0.050266000000000005
69,-0.97051
70,-0.97051
71,-0.97051
72,0.32866
73,1.3494
74,1.2566
75,-0.22813000000000003
76,-0.97051
77,-0.97051
78,-0.97051
79,0.60705
80,1.3494
81,1.3494
82,-0.50652
83,-0.97051
84,-0.97051
85,-0.97051
86,0.88545
87,1.3494
88,1.2566
89,-0.78492
90,-0.97051
91,-0.97051
92,-0.97051
93,1.071
94,1.3494
95,1.2566
