time,value
0,0.6551100000000001
1,0.6551100000000001
2,0.6551100000000001
3,0.91825
4,0.6551100000000001
5,0.6551100000000001
6,0.6551100000000001
7,0.91825
8,0.6551100000000001
9,0.6551100000000001
10,0.6551100000000001
11,0.91825
12,0.6551100000000001
13,0.6551100000000001
14,0.6551100000000001
15,-0.13430999999999998
16,-0.39745
17,-0.39745
18,-0.13430999999999998
19,-0.39745
20,-0.39745
21,-0.39745
22,-0.13430999999999998
23,-0.39745
24,-0.39745
25,-0.39745
26,-0.39745
27,-0.39745
28,-0.39745
29,-0.13430999999999998
30,-0.39745
31,-0.39745
32,-0.39745
33,-0.39745
34,-0.39745
35,-0.39745
36,-0.39745
37,-0.39745
38,-0.13430999999999998
39,-0.39745
40,-0.39745
41,-0.39745
42,-0.39745
43,-0.39745
44,-0.39745
45,-0.13430999999999998
46,-0.39745
47,-0.39745
48,-0.39745
49,-0.39745
50,-0.39745
51,-0.39745
52,-0.39745
53,-0.39745
54,-0.39745
55,-0.39745
56,-0.39745
57,-0.39745
58,-0.39745
59,-0.39745
60,-0.39745
61,-0.39745
62,-0.39745
63,-0.39745
64,-0.13430999999999998
65,-0.39745
66,-0.39745
67,-0.39745
68,-0.39745
69,-0.39745
70,-0.39745
71,0.39197
72,0.6551100000000001
73,1.7077
74,5.9179
75,5.6548
76,2.4971
77,-0.39745
78,-0.13430999999999998
79,-0.39745
80,-0.39745
81,-0.39745
82,-0.39745
83,-0.39745
84,-0.39745
85,-0.13430999999999998
86,-0.39745
87,-0.39745
88,-0.39745
89,-0.39745
90,-0.39745
91,-0.39745
92,-0.39745
93,-0.39745
94,-0.39745
95,-0.39745
