time,value
0,-0.72359
1,-0.72359
2,-0.72359
3,-0.72359
4,-0.72359
5,-0.72359
6,-0.72359
7,-0.72359
8,-0.72359
9,-0.72359
10,-0.72359
11,-0.72359
12,-0.72359
13,-0.72359
14,-0.72359
15,-0.72359
16,-0.72359
17,-0.72359
18,-0.72359
19,-0.72359
20,-0.72359
21,-0.72359
22,-0.72359
23,-0.35012
24,0.21006999999999998
25,2.2641
26,2.2641
27,2.2641
28,2.2641
29,2.0774
30,2.2641
31,2.0774
32,1.5172
33,0.77027
34,1.3305
35,1.8907
36,0.77027
37,0.023341
38,1.7039
39,1.8907
40,1.3305
41,1.7039
42,0.023341
43,-0.16339
44,-0.35012
45,-0.16339
46,-0.72359
47,0.21006999999999998
48,0.77027
49,0.9570000000000001
50,2.0774
51,1.7039
52,0.9570000000000001
53,0.77027
54,0.58354
55,0.39681
56,0.77027
57,0.39681
58,0.21006999999999998
59,0.77027
60,0.21006999999999998
61,0.39681
62,0.023341
63,0.21006999999999998
64,-0.35012
65,0.023341
66,-0.72359
67,-0.35012
68,-0.72359
69,-0.72359
70,-0.72359
71,-0.72359
72,-0.72359
73,-0.72359
74,-0.72359
75,-0.72359
76,-0.72359
77,-0.72359
78,-0.72359
79,-0.72359
80,-0.72359
81,-0.72359
82,-0.72359
83,-0.72359
84,-0.72359
85,-0.72359
86,-0.72359
87,-0.72359
88,-0.72359
89,-0.72359
90,-0.72359
91,-0.72359
92,-0.72359
93,-0.72359
94,-0.72359
95,-0.72359
