time,value
0,-1.3135
1,-1.3135
2,-1.3135
3,-1.3135
4,-1.3135
5,-1.3135
6,-1.3135
7,-1.3135
8,-1.3135
9,-1.1122
10,1.3030000000000002
11,1.2024
12,0.90046
13,0.90046
14,0.79983
15,0.79983
16,0.69919
17,0.79983
18,0.69919
19,0.69919
20,0.69919
21,0.69919
22,0.69919
23,0.69919
24,0.69919
25,0.69919
26,0.69919
27,0.69919
28,0.59856
29,0.69919
30,0.59856
31,0.69919
32,0.59856
33,-1.3135
34,-1.3135
35,-1.3135
36,-1.3135
37,-1.3135
38,-1.3135
39,-1.3135
40,-1.3135
41,-1.3135
42,-1.3135
43,-0.50841
44,1.2024
45,1.2024
46,0.90046
47,0.79983
48,0.79983
49,0.69919
50,0.79983
51,0.69919
52,0.69919
53,0.59856
54,0.69919
55,0.79983
56,0.59856
57,0.69919
58,0.69919
59,0.59856
60,0.69919
61,-1.3135
62,-1.3135
63,-1.3135
64,-1.3135
65,-1.3135
66,-1.3135
67,-1.3135
68,-1.3135
69,-1.3135
70,-1.3135
71,-1.3135
72,0.79983
73,1.2024
74,1.0011
75,0.79983
76,0.79983
77,0.69919
78,0.79983
79,0.69919
80,0.69919
81,0.59856
82,0.69919
83,0.69919
84,0.69919
85,0.59856
86,0.69919
87,0.69919
88,0.59856
89,0.69919
90,0.59856
91,0.69919
92,-0.6090399999999999
93,-1.3135
94,-1.3135
95,-1.3135
