time,value
0,0.42156000000000005
1,0.42156000000000005
2,0.42156000000000005
3,0.42156000000000005
4,0.42156000000000005
5,0.42156000000000005
6,0.42156000000000005
7,0.29704
8,0.42156000000000005
9,0.42156000000000005
10,0.42156000000000005
11,0.54608
12,0.29704
13,0.54608
14,0.42156000000000005
15,0.29704
16,0.42156000000000005
17,0.42156000000000005
18,0.42156000000000005
19,-2.0689
20,-2.0689
21,-2.0689
22,-2.0689
23,-2.0689
24,-2.0689
25,-2.0689
26,-2.0689
27,-2.0689
28,-2.0689
29,-1.0727
30,1.1687
31,0.91965
32,0.6706
33,0.54608
34,0.54608
35,0.54608
36,0.54608
37,0.54608
38,0.54608
39,0.42156000000000005
40,0.54608
41,0.42156000000000005
42,0.42156000000000005
43,0.42156000000000005
44,0.54608
45,0.42156000000000005
46,0.42156000000000005
47,0.42156000000000005
48,0.54608
49,0.42156000000000005
50,0.42156000000000005
51,0.42156000000000005
52,0.54608
53,0.42156000000000005
54,0.54608
55,0.54608
56,0.42156000000000005
57,0.42156000000000005
58,0.42156000000000005
59,0.42156000000000005
60,-0.4501
61,-2.0689
62,-2.0689
63,-2.0689
64,-2.0689
65,-2.0689
66,-2.0689
67,-2.0689
68,-0.8236600000000001
69,1.1687
70,0.79513
71,0.6706
72,0.6706
73,0.54608
74,0.54608
75,0.54608
76,0.54608
77,0.42156000000000005
78,0.54608
79,0.42156000000000005
80,0.54608
81,0.54608
82,0.42156000000000005
83,0.42156000000000005
84,0.42156000000000005
85,0.54608
86,0.42156000000000005
87,0.42156000000000005
88,0.42156000000000005
89,0.42156000000000005
90,0.42156000000000005
91,0.42156000000000005
92,0.42156000000000005
93,0.42156000000000005
94,0.42156000000000005
95,0.42156000000000005
