[<text>
<title>templeton energy inc &lt;tmpl&gt; 4th qtr net</title>
<dateline>    houston, march 30 -
    </dateline>shr profit four cts vs loss six cts
    net profit 967,000 vs loss 1,219,000
    revs 10.1 mln vs 4.5 mln
    year
    shr profit three cts vs loss five cts
    net profit 688,000 vs 982,000
    revs 24.6 mln vs 16.3 mln
    note: 1986 includes results of louisiana energy and
development corp acquired in november 1986.
 reuter
</text>]