time,value
0,-0.7018800000000001
1,-0.5877600000000001
2,-0.43982
3,-0.25629
4,-0.040302
5,0.19962
6,0.44842
7,0.68683
8,0.8971399999999999
9,1.0663
10,1.1874
11,1.2612
12,1.2932
13,1.2915
14,1.265
15,1.2205
16,1.162
17,1.0911
18,1.0086
19,0.91485
20,0.8115399999999999
21,0.7008
22,0.58439
23,0.46431999999999995
24,0.34283
25,0.22266999999999998
26,0.10735
27,-0.00016567
28,-0.098634
29,-0.18821
30,-0.26976999999999995
31,-0.34393
32,-0.40981000000000006
33,-0.46671999999999997
34,-0.51541
35,-0.5562600000000001
36,-0.5917899999999999
37,-0.62451
38,-0.65199
39,-0.6741699999999999
40,-0.69243
41,-0.70415
42,-0.71236
43,-0.72092
44,-0.72639
45,-0.72958
46,-0.73254
47,-0.7319
48,-0.73033
49,-0.7327600000000001
50,-0.7361300000000001
51,-0.74082
52,-0.75024
53,-0.75868
54,-0.76478
55,-0.7737
56,-0.78023
57,-0.78276
58,-0.7873100000000001
59,-0.78883
60,-0.78575
61,-0.7853399999999999
62,-0.78358
63,-0.7790100000000001
64,-0.77892
65,-0.7784
66,-0.77452
67,-0.774
68,-0.77222
69,-0.76703
70,-0.76567
71,-0.76346
72,-0.7558
73,-0.74397
74,-0.7165600000000001
75,-0.6614399999999999
76,-0.5726100000000001
77,-0.43666000000000005
78,-0.24505
79,-0.0010887
80,0.29127
81,0.61917
82,0.95942
83,1.2921
84,1.5987
85,1.8642
86,2.086
87,2.2682
88,2.4181
89,2.5468
90,2.6636
91,2.7724
92,2.8752
93,2.9699
94,3.0505
95,3.1112
96,3.1459
97,3.1482
98,3.1157
99,3.0478
100,2.9457
101,2.8148
102,2.6621
103,2.4942
104,2.3187
105,2.1409
106,1.9614
107,1.7802
108,1.595
109,1.4029
110,1.2066
111,1.0108
112,0.82101
113,0.64753
114,0.4941
115,0.3582
116,0.24090999999999999
117,0.13613
118,0.037686000000000004
119,-0.048688999999999996
120,-0.12297999999999999
121,-0.18729
122,-0.23540999999999998
123,-0.27126
124,-0.30109
125,-0.31955
126,-0.32968000000000003
127,-0.33660999999999996
128,-0.33526
129,-0.33116999999999996
130,-0.33171999999999996
131,-0.33171999999999996
132,-0.33342
133,-0.33959
134,-0.34302
135,-0.34615
136,-0.35423000000000004
137,-0.36403
138,-0.37835
139,-0.39939
140,-0.42078999999999994
141,-0.44201
142,-0.46468999999999994
143,-0.48651000000000005
144,-0.5101600000000001
145,-0.5380699999999999
146,-0.56671
147,-0.59404
148,-0.61827
149,-0.6361100000000001
150,-0.6487
151,-0.6591
152,-0.6681699999999999
153,-0.67716
154,-0.68598
155,-0.69194
156,-0.69439
157,-0.69468
158,-0.69402
159,-0.69514
160,-0.7001
161,-0.70732
162,-0.71536
163,-0.72387
164,-0.73095
165,-0.73707
166,-0.74474
167,-0.7524
168,-0.75954
169,-0.76852
170,-0.77758
171,-0.7865
172,-0.79769
173,-0.80784
174,-0.81496
175,-0.8213
176,-0.82542
177,-0.8276899999999999
178,-0.83135
179,-0.83394
180,-0.83368
181,-0.83268
182,-0.82981
183,-0.82544
184,-0.82235
185,-0.81771
186,-0.8082199999999999
187,-0.79306
188,-0.76758
189,-0.72809
190,-0.67375
191,-0.6001
192,-0.50492
193,-0.3917
194,-0.26381
195,-0.12822999999999998
196,0.004586600000000001
197,0.12846
198,0.23873000000000003
199,0.33082
200,0.40489
201,0.4619
202,0.5020100000000001
203,0.52845
204,0.54428
205,0.55082
206,0.55056
207,0.54503
208,0.5342100000000001
209,0.5193800000000001
210,0.50159
211,0.48107
212,0.45932
213,0.43793000000000004
214,0.41799
215,0.40143
216,0.38926
217,0.38054
218,0.37389
219,0.36679
220,0.35605
221,0.34016
222,0.31811
223,0.28911
224,0.25443000000000005
225,0.21477
226,0.17029
227,0.12352
228,0.074723
229,0.0228
230,-0.030386
231,-0.085539
232,-0.14346
233,-0.20024
234,-0.25479
235,-0.30696999999999997
236,-0.35341999999999996
237,-0.39483
238,-0.43273999999999996
239,-0.46485
240,-0.49218999999999996
241,-0.5164300000000001
242,-0.53583
243,-0.5521
244,-0.56745
245,-0.58029
246,-0.5917899999999999
247,-0.60336
248,-0.6129899999999999
249,-0.62174
250,-0.6313
251,-0.6398199999999999
252,-0.6479600000000001
253,-0.65642
254,-0.66278
255,-0.66818
256,-0.67515
257,-0.68361
258,-0.69514
259,-0.71014
260,-0.72547
261,-0.74082
262,-0.75795
263,-0.77763
264,-0.80148
265,-0.8282700000000001
266,-0.85211
267,-0.86813
268,-0.87459
269,-0.8728100000000001
