time,value
0,-0.14778
1,-0.14778
2,-0.14778
3,-0.14778
4,-0.14778
5,-0.14778
6,-0.14778
7,-0.14778
8,-0.14778
9,-0.14778
10,-0.14778
11,-0.14778
12,-0.14778
13,-0.14778
14,-0.14778
15,-0.14778
16,-0.14778
17,-0.14778
18,-0.14778
19,-0.14778
20,-0.14778
21,-0.14778
22,-0.14778
23,-0.14778
24,-0.14778
25,-0.14778
26,-0.14778
27,-0.14778
28,-0.14778
29,-0.14778
30,-0.14778
31,-0.14778
32,-0.14778
33,-0.14778
34,-0.14778
35,-0.14778
36,-0.14778
37,-0.14778
38,-0.14778
39,-0.14778
40,-0.14778
41,-0.14778
42,-0.14778
43,-0.14778
44,-0.14778
45,-0.14778
46,-0.14778
47,-0.14778
48,-0.14778
49,-0.14778
50,-0.14778
51,-0.14778
52,-0.14778
53,-0.14778
54,-0.14778
55,-0.14778
56,-0.14778
57,-0.14778
58,-0.14778
59,-0.14778
60,-0.14778
61,-0.14778
62,-0.14778
63,-0.14778
64,-0.14778
65,-0.14778
66,-0.14778
67,-0.14778
68,-0.14778
69,-0.14778
70,4.9114
71,-0.06167
72,-0.14778
73,-0.14778
74,-0.14778
75,-0.14778
76,0.3689
77,8.2914
78,-0.06167
79,-0.14778
80,-0.14778
81,-0.14778
82,-0.14778
83,-0.14778
84,-0.14778
85,-0.14778
86,-0.14778
87,-0.14778
88,-0.14778
89,-0.14778
90,-0.14778
91,-0.14778
92,-0.14778
93,-0.14778
94,-0.14778
95,-0.14778
