time,value
0,1.6534
1,1.6489
2,1.6244
3,1.5801
4,1.5385
5,1.4672
6,1.3732
7,1.3024
8,1.2028
9,1.1027
10,1.0026
11,0.90261
12,0.79875
13,0.6988300000000001
14,0.59901
15,0.49928999999999996
16,0.42621000000000003
17,0.32689
18,0.23104
19,0.13393
20,0.045821
21,-0.029539
22,-0.11617000000000001
23,-0.20415999999999998
24,-0.29052
25,-0.37513
26,-0.45782
27,-0.53825
28,-0.60561
29,-0.66825
30,-0.73557
31,-0.81829
32,-0.8813
33,-0.9328799999999999
34,-1.0059
35,-1.0585
36,-1.105
37,-1.1527
38,-1.1974
39,-1.2416
40,-1.2616
41,-1.2926
42,-1.3154
43,-1.3295
44,-1.3344
45,-1.3302
46,-1.3172
47,-1.2952
48,-1.2649
49,-1.2411
50,-1.2022
51,-1.1502
52,-1.1171
53,-1.0745
54,-1.0281
55,-0.95645
56,-0.8884700000000001
57,-0.8348700000000001
58,-0.76757
59,-0.6966399999999999
60,-0.62863
61,-0.5542199999999999
62,-0.47651000000000004
63,-0.39719
64,-0.31521
65,-0.23131
66,-0.14562999999999998
67,-0.055997000000000005
68,0.034165
69,0.12536
70,0.22324000000000002
71,0.31583
72,0.41439
73,0.51315
74,0.6120800000000001
75,0.71118
76,0.81043
77,0.9098
78,1.0093
79,1.1047
80,1.2046
81,1.2971
82,1.3896
83,1.4819
84,1.557
85,1.5983
86,1.62
87,1.6325
88,1.631
89,1.6095
90,1.6064
91,1.5843
92,1.5241
93,1.454
94,1.36
95,1.2649
96,1.1681
97,1.068
98,0.96796
99,0.868
100,0.77181
101,0.672
102,0.57053
103,0.47376
104,0.37453000000000003
105,0.28055
106,0.2091
107,0.11659000000000001
108,0.024735
109,-0.065613
110,-0.15154
111,-0.23747
112,-0.3217
113,-0.40385
114,-0.4791
115,-0.53922
116,-0.61716
117,-0.6923600000000001
118,-0.75738
119,-0.8333
120,-0.88
121,-0.94219
122,-0.9985799999999999
123,-1.0496
124,-1.1126
125,-1.1518
126,-1.1911
127,-1.2284
128,-1.266
129,-1.2959
130,-1.3176
131,-1.3306
132,-1.3344
133,-1.3291
134,-1.3148
135,-1.2919
136,-1.2607
137,-1.2422
138,-1.1959
139,-1.1434
140,-1.1032
141,-1.0479
142,-0.98779
143,-0.9158299999999999
144,-0.8585299999999999
145,-0.7894
146,-0.72048
147,-0.6482100000000001
148,-0.57294
149,-0.5010100000000001
150,-0.42301000000000005
151,-0.36233000000000004
152,-0.27225
153,-0.19187
154,-0.10439000000000001
155,-0.015608000000000002
156,0.07433
157,0.1653
158,0.25776
159,0.34994000000000003
160,0.44856999999999997
161,0.5473899999999999
162,0.6463899999999999
163,0.74554
164,0.84483
165,0.9474799999999999
166,1.0482
167,1.1434
168,1.2392
169,1.3141
170,1.4096
171,1.4957
172,1.5627
173,1.5973
174,1.6144
175,1.6322
