time,value
0,-0.64689
1,-0.64689
2,-0.64689
3,-0.64689
4,-0.64689
5,-0.64689
6,-0.64689
7,-0.64689
8,-0.64689
9,-0.64689
10,-0.64689
11,-0.64689
12,-0.64689
13,-0.64689
14,-0.64689
15,-0.64689
16,-0.64689
17,-0.64689
18,-0.64689
19,-0.64689
20,-0.64689
21,-0.64689
22,-0.64689
23,-0.64689
24,-0.64689
25,-0.64689
26,-0.64689
27,-0.64689
28,-0.64689
29,-0.64689
30,-0.64689
31,-0.64689
32,-0.64689
33,-0.64689
34,-0.64689
35,-0.64689
36,-0.64689
37,-0.64689
38,-0.64689
39,-0.11792000000000001
40,1.5748
41,1.5748
42,1.6806
43,1.5748
44,1.6806
45,1.6806
46,1.7864
47,1.6806
48,0.72844
49,1.6806
50,1.7864
51,0.41106000000000004
52,-0.64689
53,-0.64689
54,-0.64689
55,-0.64689
56,-0.64689
57,-0.64689
58,1.6806
59,1.7864
60,1.5748
61,1.2574
62,1.6806
63,0.19947
64,-0.64689
65,-0.64689
66,-0.64689
67,-0.64689
68,-0.64689
69,-0.64689
70,-0.64689
71,-0.64689
72,-0.64689
73,-0.64689
74,-0.64689
75,-0.64689
76,-0.64689
77,-0.012121999999999999
78,1.5748
79,1.469
80,1.6806
81,1.6806
82,1.6806
83,1.6806
84,1.5748
85,1.6806
86,1.5748
87,1.5748
88,-0.012121999999999999
89,-0.64689
90,-0.64689
91,-0.64689
92,-0.64689
93,-0.64689
94,-0.64689
95,-0.64689
