time,value
0,1.6464
1,1.6396
2,1.6098
3,1.5549
4,1.4838
5,1.4053
6,1.3244
7,1.2436
8,1.1627
9,1.0811
10,1.0005
11,0.91999
12,0.83959
13,0.75825
14,0.67694
15,0.59529
16,0.51569
17,0.43585
18,0.3549
19,0.27917
20,0.19443
21,0.11732000000000001
22,0.036344
23,-0.045413
24,-0.13014
25,-0.20826999999999998
26,-0.28803
27,-0.37208
28,-0.45387
29,-0.5292600000000001
30,-0.6100300000000001
31,-0.6874
32,-0.76579
33,-0.85103
34,-0.9274100000000001
35,-1.0027
36,-1.0782
37,-1.1537
38,-1.228
39,-1.2888
40,-1.3534
41,-1.4177
42,-1.4684
43,-1.5067
44,-1.528
45,-1.5368
46,-1.5241
47,-1.4826
48,-1.4346
49,-1.3746
50,-1.3130000000000002
51,-1.2455
52,-1.1764
53,-1.0979999999999999
54,-1.0241
55,-0.94878
56,-0.8695700000000001
57,-0.79105
58,-0.71314
59,-0.6349600000000001
60,-0.55304
61,-0.47256000000000004
62,-0.3919
63,-0.31239
64,-0.23259000000000002
65,-0.15142
66,-0.070167
67,0.01116
68,0.09255
69,0.17307
70,0.25373
71,0.33534
72,0.4162
73,0.4979
74,0.5789300000000001
75,0.66005
76,0.74125
77,0.8225299999999999
78,0.9038799999999999
79,0.9857799999999999
80,1.0669
81,1.1487
82,1.2307
83,1.3122
84,1.3942
85,1.4762
86,1.5573
87,1.6377
88,1.6773
89,1.6744
90,1.6282
91,1.5509
92,1.47
93,1.3885
94,1.3062
95,1.2242
96,1.1419
97,1.06
98,0.9787799999999999
99,0.89731
100,0.81581
101,0.7340399999999999
102,0.6530199999999999
103,0.5713199999999999
104,0.49046000000000006
105,0.40884000000000004
106,0.32816
107,0.24666
108,0.1662
109,0.085531
110,0.00466
111,-0.075311
112,-0.15759
113,-0.23725
114,-0.31661
115,-0.3964
116,-0.47593
117,-0.5577300000000001
118,-0.63685
119,-0.71526
120,-0.79214
121,-0.8713700000000001
122,-0.95083
123,-1.0252
124,-1.0978
125,-1.1717
126,-1.2475
127,-1.3159999999999998
128,-1.3771
129,-1.4355
130,-1.4977
131,-1.5348
132,-1.5455
133,-1.5418
134,-1.517
135,-1.4755
136,-1.4167
137,-1.3558
138,-1.2937
139,-1.227
140,-1.1469
141,-1.0692
142,-0.9959399999999999
143,-0.9191
144,-0.8368200000000001
145,-0.75643
146,-0.6822699999999999
147,-0.6010800000000001
148,-0.52104
149,-0.44192
150,-0.36191999999999996
151,-0.28009
152,-0.19977999999999999
153,-0.1193
154,-0.037232
155,0.042082999999999995
156,0.12165999999999999
157,0.20146
158,0.28468000000000004
159,0.36493000000000003
160,0.44616000000000006
161,0.52641
162,0.6058399999999999
163,0.68733
164,0.76885
165,0.84956
166,0.9288200000000001
167,1.0105
168,1.0917
169,1.1727
170,1.2545
171,1.3357
172,1.4164
173,1.4964
174,1.5698
175,1.624
