time,value
0,-1.6674
1,0.71526
2,1.0402
3,0.82357
4,0.71526
5,0.71526
6,0.60696
7,0.71526
8,0.60696
9,0.49865
10,0.60696
11,0.60696
12,0.60696
13,0.60696
14,0.49865
15,0.60696
16,0.60696
17,0.49865
18,0.60696
19,0.49865
20,0.60696
21,0.60696
22,0.49865
23,0.49865
24,0.60696
25,0.49865
26,0.60696
27,0.49865
28,-0.47608999999999996
29,-1.6674
30,-1.6674
31,-1.6674
32,-1.6674
33,-1.6674
34,-1.6674
35,-1.6674
36,-1.6674
37,-0.8009999999999999
38,1.1485
39,0.9318700000000001
40,0.71526
41,0.71526
42,0.60696
43,0.60696
44,0.60696
45,0.60696
46,0.60696
47,0.49865
48,0.60696
49,0.49865
50,0.60696
51,0.49865
52,0.60696
53,0.49865
54,-0.25948000000000004
55,-1.6674
56,-1.6674
57,-1.6674
58,-1.6674
59,-1.6674
60,-1.6674
61,-1.6674
62,-1.6674
63,0.39035
64,1.1485
65,0.82357
66,0.71526
67,0.71526
68,0.60696
69,0.60696
70,0.60696
71,0.60696
72,0.60696
73,0.49865
74,0.60696
75,0.49865
76,0.60696
77,0.60696
78,0.49865
79,0.49865
80,0.60696
81,0.49865
82,0.60696
83,0.49865
84,0.49865
85,0.60696
86,0.49865
87,0.49865
88,-0.36778
89,-1.6674
90,-1.6674
91,-1.6674
92,-1.6674
93,-1.6674
94,-1.6674
95,-1.6674
