time,value
0,-1.268
1,-1.268
2,-1.268
3,-1.268
4,-1.268
5,-1.268
6,-1.268
7,-1.268
8,-1.268
9,-1.268
10,-1.268
11,-1.268
12,-1.268
13,-1.268
14,-1.268
15,-1.268
16,-1.268
17,-1.268
18,-1.268
19,-1.268
20,-1.268
21,-1.268
22,-1.268
23,-1.268
24,-1.268
25,-1.268
26,-1.268
27,-1.268
28,-1.268
29,-1.268
30,-1.268
31,-1.268
32,-1.268
33,-1.268
34,-1.268
35,-1.268
36,-0.7620399999999999
37,0.8063100000000001
38,0.75572
39,0.8063100000000001
40,0.8063100000000001
41,0.75572
42,0.8063100000000001
43,0.8063100000000001
44,0.75572
45,0.8063100000000001
46,0.75572
47,0.75572
48,0.75572
49,0.75572
50,0.8063100000000001
51,0.75572
52,0.8063100000000001
53,0.75572
54,0.75572
55,0.8063100000000001
56,0.75572
57,0.8063100000000001
58,0.75572
59,0.8063100000000001
60,0.8063100000000001
61,0.75572
62,0.8063100000000001
63,0.8063100000000001
64,0.8063100000000001
65,0.75572
66,0.8063100000000001
67,0.8063100000000001
68,0.8063100000000001
69,0.75572
70,0.8063100000000001
71,0.75572
72,0.8063100000000001
73,0.8063100000000001
74,0.75572
75,0.8063100000000001
76,0.75572
77,0.8063100000000001
78,0.8063100000000001
79,0.8063100000000001
80,0.75572
81,0.8063100000000001
82,0.75572
83,0.75572
84,0.8063100000000001
85,0.75572
86,0.8063100000000001
87,0.8063100000000001
88,0.8063100000000001
89,0.8063100000000001
90,0.8063100000000001
91,0.8063100000000001
92,0.8063100000000001
93,0.8063100000000001
94,0.75572
95,0.8063100000000001
