time,value
0,-0.22202
1,-0.22202
2,-0.22202
3,-0.22202
4,-0.22202
5,-0.22202
6,-0.22202
7,-0.22202
8,-0.22202
9,-0.22202
10,-0.22202
11,-0.22202
12,-0.22202
13,-0.22202
14,-0.22202
15,-0.22202
16,-0.22202
17,-0.22202
18,-0.22202
19,-0.22202
20,-0.22202
21,-0.22202
22,-0.22202
23,-0.22202
24,-0.22202
25,-0.22202
26,-0.22202
27,-0.22202
28,-0.22202
29,-0.22202
30,-0.22202
31,-0.22202
32,-0.22202
33,-0.22202
34,-0.22202
35,-0.22202
36,-0.22202
37,-0.22202
38,-0.22202
39,-0.22202
40,-0.22202
41,-0.22202
42,-0.22202
43,-0.22202
44,-0.22202
45,-0.22202
46,-0.22202
47,-0.22202
48,-0.22202
49,-0.22202
50,-0.22202
51,-0.22202
52,-0.22202
53,-0.22202
54,1.6873
55,3.8853
56,-0.17761
57,-0.22202
58,-0.22202
59,-0.22202
60,-0.22202
61,-0.22202
62,-0.22202
63,-0.22202
64,-0.22202
65,-0.22202
66,-0.22202
67,-0.22202
68,-0.22202
69,-0.22202
70,-0.22202
71,-0.22202
72,3.7077
73,5.7059
74,5.1286
75,-0.17761
76,-0.22202
77,-0.22202
78,-0.22202
79,-0.22202
80,-0.22202
81,-0.22202
82,-0.22202
83,-0.22202
84,-0.22202
85,-0.22202
86,-0.22202
87,-0.22202
88,-0.22202
89,-0.22202
90,-0.22202
91,-0.22202
92,-0.22202
93,-0.22202
94,-0.22202
95,-0.22202
