time,value
0,2.2721
1,2.2035
2,2.1432
3,2.1212
4,2.0668
5,1.9951
6,1.9119
7,1.8609
8,1.7829
9,1.7488
10,1.6955
11,1.6588
12,1.6867
13,1.6440000000000001
14,1.594
15,1.527
16,1.4595
17,1.3938
18,1.3081
19,1.2218
20,1.1499
21,1.0573
22,0.98803
23,0.9180799999999999
24,0.8537899999999999
25,0.78678
26,0.71895
27,0.64907
28,0.59667
29,0.53568
30,0.48578000000000005
31,0.46886000000000005
32,0.43951
33,0.41236999999999996
34,0.37364
35,0.34719
36,0.29091
37,0.2558
38,0.22398
39,0.1768
40,0.15289
41,0.061251
42,0.004125899999999999
43,-0.096292
44,-0.19760999999999998
45,-0.30716
46,-0.37318
47,-0.44891000000000003
48,-0.5044
49,-0.5463100000000001
50,-0.58635
51,-0.62252
52,-0.67471
53,-0.71113
54,-0.73055
55,-0.76835
56,-0.84073
57,-0.85987
58,-0.8866200000000001
59,-0.91607
60,-0.9554600000000001
61,-0.97391
62,-0.9842799999999999
63,-0.9999100000000001
64,-1.0223
65,-1.0342
66,-1.0434
67,-1.0353
68,-1.0487
69,-1.0474
70,-1.0263
71,-1.0263
72,-0.97303
73,-0.96025
74,-0.9561200000000001
75,-0.92127
76,-0.9282299999999999
77,-0.90638
78,-0.9152100000000001
79,-0.8983700000000001
80,-0.8839799999999999
81,-0.87682
82,-0.8745200000000001
83,-0.86308
84,-0.8542299999999999
85,-0.8687
86,-0.8491799999999999
87,-0.8764799999999999
88,-0.9011100000000001
89,-0.89387
90,-0.8730600000000001
91,-0.86113
92,-0.79493
93,-0.75865
94,-0.74875
95,-0.70987
96,-0.64358
97,-0.62384
98,-0.56725
99,-0.5350600000000001
100,-0.51018
101,-0.48313
102,-0.45525
103,-0.42641999999999997
104,-0.40886999999999996
105,-0.37808
106,-0.35494000000000003
107,-0.34969
108,-0.33532
109,-0.31863
110,-0.31389
111,-0.31984
112,-0.34648
113,-0.36339
114,-0.39774
115,-0.45433
116,-0.51573
117,-0.61887
118,-0.68061
119,-0.7641399999999999
120,-0.84246
121,-0.90102
122,-0.9393799999999999
123,-0.9073200000000001
124,-0.8655700000000001
125,-0.79905
126,-0.74817
127,-0.68828
128,-0.63467
129,-0.57565
130,-0.51782
131,-0.45747
132,-0.39935
133,-0.33744
134,-0.29227
135,-0.23895
136,-0.17995999999999998
137,-0.13168
138,-0.069611
139,-0.020425
140,0.041068
141,0.093372
142,0.15489
143,0.22939
144,0.29181999999999997
145,0.34118000000000004
146,0.41678999999999994
147,0.46946000000000004
148,0.54465
149,0.59473
150,0.67171
151,0.73512
152,0.79996
153,0.86367
154,0.90785
155,0.93129
156,0.95096
157,0.94604
158,0.93519
159,0.86719
160,0.79503
161,0.72329
162,0.62661
163,0.57539
164,0.47626
165,0.42931
166,0.35203
167,0.28065999999999997
168,0.19235
169,0.16483
170,0.14424
171,0.20157
172,0.26179
173,0.3405
174,0.43083
175,0.49996999999999997
176,0.59751
177,0.65536
178,0.7537699999999999
179,0.84762
180,0.93591
181,1.0224
182,1.0938
183,1.1417
184,1.1982
185,1.2341
186,1.2805
187,1.3193
188,1.3215
189,1.3507
190,1.3573
191,1.3334
192,1.3019999999999998
193,1.2893
194,1.2557
195,1.2049
196,1.1546
197,1.0934
198,1.0339
199,0.97231
200,0.91064
201,0.85203
202,0.7871600000000001
203,0.7337
204,0.6692600000000001
205,0.61938
206,0.55469
207,0.49727
208,0.4484
209,0.37101
210,0.30338000000000004
211,0.22858
212,0.16267
213,0.0915
214,0.013266
215,-0.056343
216,-0.13365
217,-0.21713000000000002
218,-0.28836
219,-0.3562
220,-0.42439
221,-0.49341
222,-0.48036
223,-0.41813
224,-0.33664
225,-0.25492
226,-0.19430999999999998
227,-0.089871
228,0.014537999999999999
229,0.076624
230,0.13777
231,0.2375
232,0.30189
233,0.36625
234,0.42877
235,0.49672
236,0.59055
237,0.66093
238,0.72453
239,0.78503
240,0.85344
241,0.91766
242,0.9750700000000001
243,1.024
244,1.0807
245,1.1359
246,1.177
247,1.1555
248,1.1583
249,1.1347
250,1.0959
251,1.0624
252,1.0204
253,0.9663299999999999
254,0.9154200000000001
255,0.8621200000000001
256,0.79719
257,0.73
258,0.6709999999999999
259,0.6137100000000001
260,0.5477
261,0.46883
262,0.41339
263,0.32156999999999997
264,0.22391
265,0.16817000000000001
266,0.076709
267,-0.019673
268,-0.11202999999999999
269,-0.16388
270,-0.25609
271,-0.30558
272,-0.3685
273,-0.42921000000000004
274,-0.49548000000000003
275,-0.5687800000000001
276,-0.6579699999999999
277,-0.7247100000000001
278,-0.81677
279,-0.9093200000000001
280,-1.0012
281,-1.0919
282,-1.1868
283,-1.2467
284,-1.3333
285,-1.4173
286,-1.4948
287,-1.5725
288,-1.6503
289,-1.7267
290,-1.7972
291,-1.8659
292,-1.9347
293,-1.9967
294,-2.0496
295,-2.1103
296,-2.1705
297,-2.208
298,-2.2383
299,-2.204
300,-2.1475
301,-2.1195
302,-2.0884
303,-2.0381
304,-2.0061
305,-1.9444
306,-1.8714
307,-1.7919
308,-1.7005
309,-1.6223
310,-1.5481
311,-1.4755
312,-1.3996
313,-1.3311
314,-1.2307
315,-1.1606
316,-1.0811
317,-1.0038
318,-0.9046200000000001
319,-0.8339799999999999
320,-0.74908
321,-0.66501
322,-0.56047
323,-0.46291000000000004
324,-0.41313
325,-0.35681
326,-0.27443
327,-0.22365
328,-0.16955
329,-0.16346
330,-0.16172999999999998
331,-0.17415
332,-0.20185
333,-0.22803
334,-0.2645
335,-0.29095
336,-0.32215
337,-0.3492
338,-0.38314000000000004
339,-0.418
340,-0.45028
341,-0.47378000000000003
342,-0.50758
343,-0.5414399999999999
344,-0.55877
345,-0.58538
346,-0.612
347,-0.62488
348,-0.64746
349,-0.66689
350,-0.68734
351,-0.71436
352,-0.7357899999999999
353,-0.76131
354,-0.78358
355,-0.80189
356,-0.81421
357,-0.83004
358,-0.84662
359,-0.8643299999999999
360,-0.8784700000000001
361,-0.8973899999999999
362,-0.90953
363,-0.91669
364,-0.92343
365,-0.92922
366,-0.93066
367,-0.92965
368,-0.9174
369,-0.90776
370,-0.8934700000000001
371,-0.8712799999999999
372,-0.84472
373,-0.82173
374,-0.78967
375,-0.7590399999999999
376,-0.7064600000000001
377,-0.64963
378,-0.58341
379,-0.51782
380,-0.44533999999999996
381,-0.3712
382,-0.29484
383,-0.22651999999999997
384,-0.14970999999999998
385,-0.07993600000000001
386,0.0098938
387,0.08236900000000001
388,0.15055
389,0.23925
390,0.32038
391,0.37921
392,0.42861000000000005
393,0.46458999999999995
394,0.54872
395,0.63776
396,0.7280800000000001
397,0.8163
398,0.9037299999999999
399,0.97916
400,1.032
401,1.0813
402,1.1654
403,1.2546
404,1.3213
405,1.3876
406,1.4305
407,1.5023
408,1.5559
409,1.6035
410,1.6446
411,1.682
412,1.7183
413,1.7333
414,1.7399
415,1.719
416,1.7139
417,1.7259
418,1.7862
419,1.895
420,1.9669999999999999
421,2.0654
422,2.141
423,2.2084
424,2.2843
425,2.3059
426,2.3226
