time,value
0,-0.22759000000000001
1,-0.22759000000000001
2,-0.22759000000000001
3,-0.22759000000000001
4,-0.22759000000000001
5,-0.22759000000000001
6,-0.22759000000000001
7,-0.22759000000000001
8,-0.22759000000000001
9,-0.22759000000000001
10,-0.22759000000000001
11,-0.22759000000000001
12,-0.22759000000000001
13,-0.22759000000000001
14,-0.22759000000000001
15,-0.22759000000000001
16,-0.22759000000000001
17,-0.22759000000000001
18,-0.22759000000000001
19,-0.22759000000000001
20,-0.22759000000000001
21,-0.22759000000000001
22,-0.22759000000000001
23,-0.22759000000000001
24,-0.22759000000000001
25,-0.22759000000000001
26,-0.22759000000000001
27,-0.22759000000000001
28,-0.22759000000000001
29,-0.22759000000000001
30,-0.22759000000000001
31,-0.22759000000000001
32,-0.22759000000000001
33,-0.22759000000000001
34,6.156000000000001
35,3.3874
36,0.37196999999999997
37,0.3367
38,-0.22759000000000001
39,-0.22759000000000001
40,-0.22759000000000001
41,-0.22759000000000001
42,-0.22759000000000001
43,-0.22759000000000001
44,-0.22759000000000001
45,-0.22759000000000001
46,-0.22759000000000001
47,-0.22759000000000001
48,-0.22759000000000001
49,-0.22759000000000001
50,-0.22759000000000001
51,-0.22759000000000001
52,-0.22759000000000001
53,-0.22759000000000001
54,-0.22759000000000001
55,-0.22759000000000001
56,-0.22759000000000001
57,-0.22759000000000001
58,-0.22759000000000001
59,-0.22759000000000001
60,-0.22759000000000001
61,-0.22759000000000001
62,-0.22759000000000001
63,-0.22759000000000001
64,-0.22759000000000001
65,-0.22759000000000001
66,-0.22759000000000001
67,-0.22759000000000001
68,-0.22759000000000001
69,-0.22759000000000001
70,-0.22759000000000001
71,-0.22759000000000001
72,-0.22759000000000001
73,-0.22759000000000001
74,-0.22759000000000001
75,-0.22759000000000001
76,4.8863
77,4.0751
78,0.35434
79,0.46013999999999994
80,-0.22759000000000001
81,-0.22759000000000001
82,-0.22759000000000001
83,-0.22759000000000001
84,-0.22759000000000001
85,-0.22759000000000001
86,-0.22759000000000001
87,-0.22759000000000001
88,-0.22759000000000001
89,-0.22759000000000001
90,-0.22759000000000001
91,-0.22759000000000001
92,-0.22759000000000001
93,-0.22759000000000001
94,-0.22759000000000001
95,-0.22759000000000001
