time,value
0,-0.23776
1,-0.23776
2,-0.23776
3,-0.23776
4,-0.23776
5,-0.23776
6,-0.23776
7,-0.23776
8,-0.23776
9,-0.23776
10,-0.23776
11,-0.23776
12,-0.23776
13,-0.23776
14,-0.23776
15,-0.23776
16,-0.23776
17,-0.23776
18,-0.23776
19,-0.23776
20,-0.23776
21,-0.23776
22,-0.23776
23,-0.23776
24,-0.23776
25,-0.23776
26,-0.23776
27,-0.23776
28,-0.23776
29,-0.23776
30,-0.23776
31,-0.23776
32,-0.23776
33,-0.23776
34,-0.23776
35,-0.23776
36,1.5882
37,-0.048864
38,-0.23776
39,-0.23776
40,-0.23776
41,-0.23776
42,-0.23776
43,-0.23776
44,-0.23776
45,-0.23776
46,-0.23776
47,-0.23776
48,-0.23776
49,-0.23776
50,6.6884
51,3.3355
52,3.9652
53,2.8318
54,2.8003
55,-0.23776
56,-0.23776
57,-0.23776
58,-0.23776
59,-0.23776
60,-0.23776
61,-0.23776
62,-0.23776
63,-0.23776
64,-0.23776
65,-0.23776
66,-0.23776
67,-0.23776
68,-0.23776
69,-0.23776
70,-0.23776
71,-0.23776
72,-0.23776
73,-0.23776
74,-0.23776
75,-0.23776
76,-0.23776
77,-0.23776
78,-0.23776
79,-0.23776
80,-0.23776
81,-0.23776
82,-0.23776
83,-0.23776
84,-0.23776
85,-0.23776
86,-0.23776
87,-0.23776
88,-0.23776
89,-0.23776
90,-0.23776
91,-0.23776
92,-0.23776
93,-0.23776
94,-0.23776
95,-0.23776
