time,value
0,-0.39586
1,-0.39586
2,-0.39586
3,-0.39586
4,-0.39586
5,-0.39586
6,-0.39586
7,-0.39586
8,-0.39586
9,-0.39586
10,-0.39586
11,-0.39586
12,-0.39586
13,-0.39586
14,-0.39586
15,-0.39586
16,-0.39586
17,-0.39586
18,-0.39586
19,-0.39586
20,-0.39586
21,-0.39586
22,-0.39586
23,-0.39586
24,-0.39586
25,-0.39586
26,-0.39586
27,-0.39586
28,-0.39586
29,-0.39586
30,-0.39586
31,-0.39586
32,-0.39586
33,-0.39586
34,-0.39586
35,-0.39586
36,-0.39586
37,-0.39586
38,-0.39586
39,-0.39586
40,-0.39586
41,-0.39586
42,-0.39586
43,-0.39586
44,-0.39586
45,-0.39586
46,-0.39586
47,0.09917999999999999
48,-0.39586
49,-0.39586
50,-0.39586
51,-0.39586
52,3.5562
53,1.6173
54,1.6998
55,1.2873
56,-0.39586
57,-0.39586
58,-0.39586
59,-0.39586
60,-0.39586
61,-0.39586
62,-0.39586
63,-0.39586
64,-0.39586
65,-0.39586
66,1.0068
67,2.8962
68,3.8615
69,3.1602
70,0.47046000000000004
71,0.5282100000000001
72,3.1189
73,1.3533
74,2.2031
75,2.3764
76,2.4094
77,-0.37111
78,-0.39586
79,-0.39586
80,-0.39586
81,-0.39586
82,-0.39586
83,-0.39586
84,-0.39586
85,-0.39586
86,-0.39586
87,-0.39586
88,-0.39586
89,-0.39586
90,-0.39586
91,-0.39586
92,-0.39586
93,-0.39586
94,-0.39586
95,-0.39586
