[<text>
<title>fairfield communities inc &lt;fci&gt; 10 mos dec 31</title>
<dateline>    little rock, ark, march 5 -
    </dateline>shr loss 1.62 dlrs vs profit 83 cts
    net loss 17.2 mln vs profit 8.3 mln
    revs 264.0 mln vs 338.0 mln
    note:year ago figures based on 12 months ended february 28,
1986 because company changed reporting period to end december
31.
   1986 10 months loss includes 10.3 mln dlrs writedown of
certain assets.
                        
 reuter
</text>]