time,value
0,-1.8351
1,-1.5018
2,1.1640000000000001
3,0.94183
4,0.71968
5,0.6086
6,0.49751999999999996
7,0.6086
8,0.49751999999999996
9,0.6086
10,0.49751999999999996
11,0.49751999999999996
12,0.49751999999999996
13,-0.39108000000000004
14,-1.8351
15,-1.8351
16,-1.8351
17,-1.8351
18,-1.8351
19,-1.8351
20,-0.16893
21,1.0529
22,0.83075
23,0.71968
24,0.6086
25,0.49751999999999996
26,0.6086
27,0.49751999999999996
28,0.49751999999999996
29,0.49751999999999996
30,0.49751999999999996
31,0.49751999999999996
32,0.49751999999999996
33,0.49751999999999996
34,0.6086
35,0.49751999999999996
36,0.49751999999999996
37,0.49751999999999996
38,0.49751999999999996
39,-0.7243
40,-1.8351
41,-1.8351
42,-1.8351
43,-1.8351
44,-1.8351
45,-1.8351
46,0.053224
47,1.0529
48,0.83075
49,0.6086
50,0.6086
51,0.49751999999999996
52,0.6086
53,0.49751999999999996
54,0.49751999999999996
55,0.6086
56,0.49751999999999996
57,0.38645
58,0.49751999999999996
59,0.49751999999999996
60,-0.16893
61,-1.8351
62,-1.8351
63,-1.8351
64,-1.8351
65,-1.8351
66,-1.8351
67,0.1643
68,1.0529
69,0.83075
70,0.71968
71,0.6086
72,0.49751999999999996
73,0.6086
74,0.49751999999999996
75,0.49751999999999996
76,0.6086
77,0.49751999999999996
78,0.49751999999999996
79,0.6086
80,0.49751999999999996
81,0.49751999999999996
82,0.38645
83,0.49751999999999996
84,0.49751999999999996
85,0.49751999999999996
86,0.49751999999999996
87,0.49751999999999996
88,0.49751999999999996
89,0.49751999999999996
90,0.38645
91,0.49751999999999996
92,0.49751999999999996
93,0.38645
94,0.053224
95,-1.8351
