time,value
0,-1.0009
1,-1.0009
2,-1.0009
3,0.058322000000000006
4,1.4202
5,0.96626
6,1.1176
7,0.96626
8,0.96626
9,0.96626
10,0.96626
11,-1.0009
12,-1.0009
13,-1.0009
14,-1.0009
15,-1.0009
16,-1.0009
17,0.96626
18,1.2689
19,0.96626
20,0.96626
21,0.66361
22,-1.0009
23,-1.0009
24,-1.0009
25,-1.0009
26,-1.0009
27,0.36096999999999996
28,1.2689
29,1.1176
30,0.96626
31,0.96626
32,0.66361
33,-1.0009
34,-1.0009
35,-1.0009
36,-1.0009
37,-1.0009
38,-1.0009
39,1.1176
40,1.2689
41,0.96626
42,0.96626
43,0.36096999999999996
44,-1.0009
45,-1.0009
46,-1.0009
47,-1.0009
48,-1.0009
49,-1.0009
50,1.4202
51,1.2689
52,0.96626
53,0.96626
54,0.96626
55,-0.69829
56,-1.0009
57,-1.0009
58,-1.0009
59,-1.0009
60,-1.0009
61,0.66361
62,1.2689
63,1.1176
64,0.96626
65,0.96626
66,0.96626
67,-0.09300000000000001
68,-1.0009
69,-1.0009
70,-1.0009
71,-1.0009
72,-1.0009
73,-0.39565
74,1.4202
75,1.1176
76,0.96626
77,1.1176
78,0.96626
79,0.96626
80,0.96626
81,0.96626
82,-1.0009
83,-1.0009
84,-1.0009
85,-1.0009
86,-1.0009
87,-1.0009
88,-0.24431999999999998
89,1.4202
90,0.96626
91,0.96626
92,0.81494
93,-1.0009
94,-1.0009
95,-1.0009
