time,value
0,-0.58632
1,-0.42306000000000005
2,-0.22153
3,-0.0014027
4,0.19630999999999998
5,0.33824
6,0.41996000000000006
7,0.45174
8,0.44465
9,0.41468
10,0.37683
11,0.32932
12,0.26571999999999996
13,0.19047999999999998
14,0.10901
15,0.022895
16,-0.063291
17,-0.13655
18,-0.18857000000000002
19,-0.22293000000000002
20,-0.24089000000000002
21,-0.24169000000000002
22,-0.23231
23,-0.21393
24,-0.18503
25,-0.14418
26,-0.08455700000000001
27,-0.004940399999999999
28,0.09396399999999999
29,0.20155
30,0.29396
31,0.35466
32,0.37828
33,0.37535
34,0.36925
35,0.37790999999999997
36,0.40401
37,0.43509
38,0.4562
39,0.46207
40,0.44921000000000005
41,0.41357
42,0.35823
43,0.28864
44,0.20619
45,0.11077000000000001
46,0.0050968
47,-0.098919
48,-0.19202
49,-0.27451
50,-0.34592
51,-0.40336
52,-0.44505
53,-0.47906000000000004
54,-0.51554
55,-0.54784
56,-0.57057
57,-0.58837
58,-0.6018399999999999
59,-0.61126
60,-0.61848
61,-0.62567
62,-0.63288
63,-0.63627
64,-0.63693
65,-0.63643
66,-0.63427
67,-0.63189
68,-0.63029
69,-0.62997
70,-0.62947
71,-0.62557
72,-0.61845
73,-0.61053
74,-0.60406
75,-0.60116
76,-0.59968
77,-0.5980800000000001
78,-0.59811
79,-0.59925
80,-0.60126
81,-0.59844
82,-0.59378
83,-0.5941
84,-0.59259
85,-0.5837
86,-0.56042
87,-0.5144
88,-0.44363
89,-0.3503
90,-0.23364000000000001
91,-0.074624
92,0.1552
93,0.45105
94,0.7528
95,0.9781799999999999
96,1.0902
97,1.113
98,1.0812
99,1.0108
100,0.91181
101,0.7905800000000001
102,0.64535
103,0.47966000000000003
104,0.3125
105,0.16442
106,0.039978
107,-0.068949
108,-0.16660999999999998
109,-0.25458000000000003
110,-0.3358
111,-0.40743
112,-0.46799999999999997
113,-0.51408
114,-0.54674
115,-0.57105
116,-0.58426
117,-0.5927600000000001
118,-0.60051
119,-0.60219
120,-0.59625
121,-0.57909
122,-0.54624
123,-0.49203
124,-0.41523999999999994
125,-0.32056999999999997
126,-0.21081999999999998
127,-0.095
128,0.011103
129,0.094515
130,0.14151
131,0.14536
132,0.11722
133,0.074548
134,0.024356
135,-0.035113
136,-0.10305
137,-0.17307
138,-0.23915
139,-0.29872
140,-0.35188
141,-0.4002
142,-0.44383999999999996
143,-0.48061000000000004
144,-0.51108
145,-0.53706
146,-0.5615
147,-0.58621
148,-0.60833
149,-0.62661
150,-0.63974
151,-0.64889
152,-0.65735
153,-0.66351
154,-0.66745
155,-0.67062
156,-0.67224
157,-0.6731199999999999
158,-0.67453
159,-0.67577
160,-0.6756
161,-0.67374
162,-0.6696300000000001
163,-0.66342
164,-0.6601
165,-0.66557
166,-0.6745399999999999
167,-0.68262
168,-0.6896100000000001
169,-0.69348
170,-0.6967
171,-0.69921
172,-0.70067
173,-0.7006100000000001
174,-0.69723
175,-0.6915399999999999
176,-0.67352
177,-0.6230899999999999
178,-0.52178
179,-0.35778000000000004
180,-0.13814
181,0.10802
182,0.34262
183,0.53557
184,0.6734600000000001
185,0.74748
186,0.7509999999999999
187,0.69289
188,0.59935
189,0.50316
190,0.42449
191,0.35574
192,0.27767
193,0.18479
194,0.08692000000000001
195,-0.0036591
196,-0.08128400000000001
197,-0.14699
198,-0.20277
199,-0.2528
200,-0.29794
201,-0.33138
202,-0.3578
203,-0.3704
204,-0.37111
205,-0.36518
206,-0.34444
207,-0.31845
208,-0.2864
209,-0.25034
210,-0.22023
211,-0.17728
212,-0.093088
213,0.089075
214,0.42971000000000004
215,0.94355
216,1.5968
217,2.3102
218,2.9974
219,3.588
220,4.02
221,4.2747
222,4.3975
223,4.4491
224,4.4372
225,4.3181
226,4.0639
227,3.6981
228,3.265
229,2.8056
230,2.3541
231,1.9187
232,1.4836
233,1.0529
234,0.6590699999999999
235,0.34085
236,0.10082999999999999
237,-0.086329
238,-0.22951
239,-0.3472
240,-0.44726000000000005
241,-0.51849
242,-0.56402
243,-0.5887399999999999
244,-0.6073
245,-0.62117
246,-0.6231399999999999
247,-0.6258100000000001
248,-0.63076
249,-0.63415
250,-0.63883
251,-0.64294
252,-0.6461600000000001
253,-0.647
254,-0.64573
255,-0.64563
256,-0.64615
257,-0.64644
258,-0.64685
259,-0.6462399999999999
260,-0.64426
261,-0.6426
262,-0.64359
263,-0.65025
264,-0.6632
265,-0.6784
266,-0.69372
267,-0.7114
268,-0.7276600000000001
269,-0.7336699999999999
