time,value
0,0.42746999999999996
1,0.42746999999999996
2,0.42746999999999996
3,0.42746999999999996
4,0.53899
5,0.42746999999999996
6,0.42746999999999996
7,0.42746999999999996
8,0.53899
9,0.42746999999999996
10,0.42746999999999996
11,0.42746999999999996
12,0.42746999999999996
13,0.53899
14,0.42746999999999996
15,0.42746999999999996
16,0.42746999999999996
17,0.53899
18,0.42746999999999996
19,0.42746999999999996
20,0.42746999999999996
21,0.42746999999999996
22,0.42746999999999996
23,0.53899
24,0.42746999999999996
25,0.42746999999999996
26,0.42746999999999996
27,0.53899
28,0.42746999999999996
29,0.42746999999999996
30,0.42746999999999996
31,0.42746999999999996
32,0.42746999999999996
33,0.53899
34,0.42746999999999996
35,0.42746999999999996
36,0.42746999999999996
37,0.42746999999999996
38,0.65051
39,0.65051
40,1.0966
41,1.2081
42,0.76202
43,0.42746999999999996
44,0.42746999999999996
45,0.42746999999999996
46,0.42746999999999996
47,0.53899
48,0.42746999999999996
49,0.42746999999999996
50,0.42746999999999996
51,0.42746999999999996
52,0.53899
53,0.42746999999999996
54,0.42746999999999996
55,0.42746999999999996
56,0.42746999999999996
57,0.42746999999999996
58,0.53899
59,0.42746999999999996
60,1.8772
61,2.3232
62,0.65051
63,3.2154
64,0.65051
65,0.53899
66,0.53899
67,0.42746999999999996
68,0.42746999999999996
69,-0.79919
70,-1.4683
71,-1.4683
72,-1.4683
73,-1.5798
74,-1.4683
75,-1.4683
76,-1.4683
77,-1.4683
78,-1.5798
79,-1.4683
80,-1.4683
81,-1.4683
82,-1.5798
83,-1.4683
84,-1.4683
85,-1.4683
86,-1.5798
87,-1.4683
88,-1.4683
89,-1.4683
90,-1.5798
91,-1.4683
92,-1.4683
93,-1.4683
94,-1.5798
95,-1.4683
