time,value
0,1.7662
1,1.7517
2,1.692
3,1.601
4,1.5085
5,1.415
6,1.3215
7,1.2281
8,1.1348
9,1.0424
10,0.95039
11,0.86654
12,0.7831600000000001
13,0.6927
14,0.60207
15,0.51302
16,0.43096999999999996
17,0.34237
18,0.255
19,0.16864
20,0.081118
21,-0.0046095
22,-0.090026
23,-0.17312
24,-0.25625
25,-0.33942
26,-0.41927
27,-0.4918
28,-0.5697
29,-0.6509
30,-0.72334
31,-0.80045
32,-0.87131
33,-0.9435899999999999
34,-1.0125
35,-1.073
36,-1.1339
37,-1.1895
38,-1.2391
39,-1.2884
40,-1.3232
41,-1.3562
42,-1.3719999999999999
43,-1.3849
44,-1.3869999999999998
45,-1.3781
46,-1.3662
47,-1.3367
48,-1.307
49,-1.2627
50,-1.216
51,-1.1629
52,-1.1041
53,-1.0407
54,-0.97657
55,-0.9133600000000001
56,-0.84383
57,-0.77422
58,-0.70255
59,-0.62283
60,-0.55124
61,-0.47362
62,-0.39928
63,-0.31873
64,-0.23671999999999999
65,-0.15139
66,-0.069025
67,0.010621
68,0.09819800000000001
69,0.18365
70,0.26983
71,0.35291999999999996
72,0.43396
73,0.5224300000000001
74,0.60523
75,0.69539
76,0.7862600000000001
77,0.8776299999999999
78,0.9697899999999999
79,1.0547
80,1.1475
81,1.2326
82,1.3259999999999998
83,1.42
84,1.5129
85,1.6056
86,1.6904
87,1.7361
88,1.7506
89,1.73
90,1.6487
91,1.5573
92,1.4643
93,1.3717
94,1.286
95,1.1926
96,1.1074
97,1.023
98,0.9303
99,0.8384799999999999
100,0.74752
101,0.65625
102,0.5661
103,0.47616
104,0.3872
105,0.29818
106,0.21053000000000002
107,0.13025
108,0.043536
109,-0.035868000000000004
110,-0.12087
111,-0.19837
112,-0.28131999999999996
113,-0.36411
114,-0.44301999999999997
115,-0.52256
116,-0.59506
117,-0.6718
118,-0.74085
119,-0.81157
120,-0.88536
121,-0.953
122,-1.0168
123,-1.0816
124,-1.1322
125,-1.1859
126,-1.2413
127,-1.2769
128,-1.3176
129,-1.3426
130,-1.3652
131,-1.3775
132,-1.3791
133,-1.3699
134,-1.3502
135,-1.328
136,-1.2895
137,-1.2499
138,-1.2028
139,-1.1506
140,-1.0959
141,-1.0385
142,-0.97151
143,-0.9096299999999999
144,-0.83872
145,-0.77362
146,-0.6977899999999999
147,-0.6229
148,-0.5515800000000001
149,-0.47353
150,-0.40203
151,-0.31984
152,-0.2375
153,-0.15284
154,-0.06879400000000001
155,0.009009999999999999
156,0.09468
157,0.18158
158,0.26139
159,0.34947
160,0.43168999999999996
161,0.51973
162,0.60938
163,0.69962
164,0.79019
165,0.8811200000000001
166,0.97305
167,1.065
168,1.1574
169,1.2503
170,1.3438
171,1.4373
172,1.5306
173,1.6151
174,1.7025
175,1.7393
