time,value
0,-0.12838
1,-0.12838
2,-0.12838
3,-0.12838
4,-0.12838
5,-0.12838
6,-0.12838
7,-0.12838
8,-0.12838
9,-0.12838
10,-0.12838
11,-0.12838
12,-0.12838
13,-0.12838
14,-0.12838
15,-0.12838
16,-0.12838
17,-0.12838
18,-0.12838
19,-0.12838
20,-0.12838
21,-0.12838
22,-0.12838
23,-0.12838
24,-0.12838
25,-0.12838
26,-0.12838
27,-0.12838
28,-0.12838
29,-0.12838
30,-0.12838
31,-0.12838
32,-0.12838
33,-0.12838
34,-0.12838
35,-0.12838
36,-0.12838
37,-0.12838
38,-0.12838
39,-0.12838
40,-0.12838
41,-0.12838
42,-0.12838
43,-0.12838
44,-0.12838
45,-0.12838
46,-0.12838
47,-0.12838
48,-0.12838
49,-0.12838
50,-0.12838
51,-0.12838
52,-0.12838
53,-0.12838
54,-0.12838
55,-0.12838
56,-0.12838
57,-0.12838
58,-0.12838
59,-0.12838
60,-0.12838
61,-0.12838
62,-0.12838
63,-0.12838
64,-0.12838
65,-0.12838
66,-0.12838
67,-0.12838
68,-0.12838
69,-0.12838
70,-0.12838
71,-0.12838
72,-0.12838
73,-0.12838
74,-0.12838
75,-0.12838
76,-0.12838
77,-0.12838
78,-0.12838
79,-0.12838
80,9.246
81,2.8216
82,-0.12838
83,-0.12838
84,-0.12838
85,-0.12838
86,-0.12838
87,-0.12838
88,-0.12838
89,-0.12838
90,-0.12838
91,-0.12838
92,-0.12838
93,-0.12838
94,-0.12838
95,-0.12838
