time,value
0,2.0804
1,-0.94906
2,-0.94906
3,-0.38804
4,0.50959
5,-0.94906
6,-0.94906
7,0.8462
8,0.39739
9,1.8559999999999999
10,-0.94906
11,-0.94906
12,-0.38804
13,0.39739
14,-0.94906
15,-0.38804
16,0.6218
17,1.6316
18,1.295
19,-0.94906
20,-0.94906
21,0.39739
22,-0.16363
23,-0.94906
24,-0.94906
25,0.7340000000000001
26,2.0804
27,0.28519
28,-0.94906
29,-0.94906
30,1.0706
31,-0.94906
32,-0.94906
33,1.1828
34,1.1828
35,0.8462
36,-0.94906
37,-0.94906
38,0.95841
39,-0.94906
40,-0.94906
41,0.95841
42,0.39739
43,1.9682
44,-0.38804
45,-0.94906
46,-0.94906
47,1.0706
48,-0.94906
49,-0.94906
50,-0.94906
51,1.295
52,2.0804
53,0.17298
54,-0.94906
55,-0.94906
56,0.95841
57,-0.94906
58,-0.94906
59,-0.38804
60,0.50959
61,1.1828
62,0.7340000000000001
63,-0.94906
64,-0.94906
65,0.95841
66,-0.94906
67,-0.94906
68,-0.38804
69,0.28519
70,-0.72465
71,2.0804
72,-0.38804
73,-0.94906
74,0.8462
75,-0.94906
76,-0.94906
77,0.39739
78,-0.16363
79,0.28519
80,1.1828
81,-0.94906
82,1.0706
83,-0.94906
84,-0.94906
85,0.17298
86,-0.16363
87,1.295
88,0.50959
89,-0.94906
90,1.0706
91,-0.94906
92,-0.94906
93,0.50959
94,0.39739
95,2.0804
