time,value
0,-0.47567
1,-0.47567
2,-0.47567
3,-0.47567
4,-0.47567
5,-0.47567
6,-0.47567
7,-0.47567
8,-0.47567
9,-0.47567
10,-0.47567
11,-0.47567
12,-0.47567
13,-0.47567
14,-0.47567
15,-0.47567
16,-0.47567
17,-0.47567
18,-0.47567
19,-0.47567
20,-0.47567
21,-0.47567
22,-0.47567
23,-0.47567
24,-0.47567
25,-0.47567
26,-0.47567
27,-0.47567
28,-0.47567
29,-0.47567
30,-0.47567
31,-0.47567
32,-0.47567
33,-0.47567
34,-0.47567
35,-0.47567
36,-0.47567
37,-0.47567
38,-0.47567
39,-0.47567
40,-0.47567
41,-0.47567
42,-0.47567
43,-0.47567
44,-0.47567
45,-0.47567
46,-0.47567
47,-0.47567
48,-0.47567
49,-0.47567
50,-0.47567
51,-0.47567
52,-0.47567
53,-0.47567
54,-0.47567
55,-0.47567
56,-0.47567
57,-0.47567
58,-0.47567
59,-0.47567
60,-0.47567
61,-0.47567
62,-0.47567
63,-0.47567
64,-0.47567
65,-0.47567
66,2.2371
67,2.2371
68,2.6892
69,1.3328
70,2.2371
71,1.7849
72,2.2371
73,1.7849
74,2.6892
75,1.3328
76,0.8807
77,1.3328
78,2.2371
79,2.2371
80,2.2371
81,2.6892
82,1.7849
83,2.2371
84,0.42858
85,-0.47567
86,-0.47567
87,-0.47567
88,-0.47567
89,-0.47567
90,-0.47567
91,-0.47567
92,-0.47567
93,-0.47567
94,-0.47567
95,-0.47567
