time,value
0,-0.30414
1,-0.30414
2,-0.30414
3,-0.30414
4,-0.30414
5,-0.30414
6,-0.30414
7,-0.30414
8,-0.30414
9,-0.30414
10,-0.30414
11,-0.30414
12,-0.30414
13,-0.30414
14,-0.30414
15,-0.30414
16,-0.30414
17,-0.30414
18,-0.30414
19,-0.30414
20,-0.30414
21,-0.30414
22,-0.30414
23,-0.30414
24,-0.30414
25,-0.30414
26,-0.30414
27,-0.30414
28,-0.30414
29,-0.30414
30,-0.30414
31,-0.30414
32,-0.30414
33,-0.30414
34,-0.30414
35,-0.30414
36,-0.30414
37,2.8053
38,4.5084
39,1.4119
40,1.9796
41,1.9280000000000002
42,1.1409
43,1.2312
44,-0.30414
45,-0.30414
46,-0.30414
47,-0.30414
48,-0.30414
49,-0.30414
50,-0.30414
51,-0.30414
52,-0.30414
53,-0.30414
54,-0.30414
55,-0.30414
56,-0.30414
57,-0.30414
58,-0.30414
59,-0.30414
60,-0.30414
61,-0.30414
62,-0.30414
63,-0.30414
64,-0.30414
65,-0.30414
66,-0.30414
67,-0.30414
68,-0.30414
69,0.5087
70,-0.30414
71,1.8763
72,6.1083
73,2.3279
74,-0.27834000000000003
75,-0.30414
76,-0.30414
77,-0.30414
78,-0.30414
79,-0.30414
80,-0.30414
81,-0.30414
82,-0.30414
83,-0.30414
84,-0.30414
85,-0.30414
86,-0.30414
87,-0.30414
88,-0.30414
89,-0.30414
90,-0.30414
91,-0.30414
92,-0.30414
93,-0.30414
94,-0.30414
95,-0.30414
