time,value
0,-0.4733
1,-0.33307
2,-0.4733
3,-0.33307
4,-0.4733
5,-0.33307
6,-0.33307
7,-0.4733
8,-0.33307
9,-0.4733
10,-0.33307
11,-0.4733
12,-0.33307
13,-0.4733
14,-0.33307
15,-0.4733
16,-0.33307
17,-0.4733
18,-0.33307
19,-0.4733
20,-0.33307
21,-0.4733
22,-0.33307
23,-0.4733
24,-0.33307
25,-0.4733
26,-0.33307
27,-0.4733
28,-0.33307
29,-0.4733
30,-0.33307
31,-0.4733
32,-0.33307
33,-0.4733
34,-0.33307
35,-0.33307
36,-0.4733
37,-0.33307
38,-0.4733
39,-0.33307
40,-0.4733
41,-0.33307
42,-0.4733
43,-0.33307
44,-0.4733
45,-0.33307
46,-0.4733
47,-0.33307
48,-0.4733
49,-0.33307
50,-0.4733
51,-0.33307
52,-0.4733
53,-0.33307
54,-0.4733
55,-0.33307
56,-0.4733
57,-0.33307
58,-0.4733
59,-0.33307
60,-0.4733
61,-0.33307
62,-0.4733
63,-0.33307
64,-0.4733
65,-0.33307
66,-0.4733
67,-0.33307
68,-0.4733
69,-0.33307
70,-0.4733
71,-0.33307
72,-0.4733
73,-0.33307
74,2.051
75,2.7522
76,2.7522
77,2.6119
78,2.7522
79,2.7522
80,2.8924
81,2.8924
82,2.3315
83,0.6486
84,2.8924
85,3.0326
86,0.9290799999999999
87,-0.052589
88,-0.052589
89,-0.052589
90,-0.19283
91,-0.33307
92,-0.19283
93,-0.33307
94,-0.19283
95,-0.19283
