time,value
0,-0.19741
1,-0.19741
2,-0.19741
3,-0.19741
4,-0.19741
5,-0.19741
6,-0.19741
7,-0.19741
8,-0.19741
9,-0.19741
10,-0.19741
11,-0.19741
12,-0.19741
13,-0.19741
14,-0.19741
15,-0.19741
16,-0.19741
17,-0.19741
18,-0.19741
19,-0.19741
20,-0.19741
21,-0.19741
22,-0.19741
23,-0.19741
24,-0.19741
25,-0.19741
26,-0.19741
27,-0.19741
28,-0.19741
29,-0.19741
30,-0.19741
31,-0.19741
32,-0.19741
33,-0.19741
34,-0.19741
35,-0.19741
36,-0.19741
37,-0.19741
38,-0.19741
39,-0.19741
40,-0.19741
41,-0.19741
42,-0.19741
43,-0.19741
44,-0.19741
45,-0.19741
46,-0.19741
47,-0.19741
48,-0.19741
49,-0.19741
50,-0.19741
51,-0.19741
52,-0.19741
53,-0.19741
54,-0.19741
55,-0.19741
56,-0.19741
57,-0.19741
58,-0.19741
59,-0.19741
60,-0.19741
61,-0.19741
62,-0.19741
63,-0.19741
64,-0.19741
65,-0.19741
66,0.26003000000000004
67,7.0955
68,1.8284
69,0.024778
70,0.011708
71,2.9655
72,5.3834
73,-0.19741
74,-0.19741
75,-0.19741
76,-0.19741
77,-0.19741
78,-0.19741
79,-0.19741
80,-0.19741
81,-0.19741
82,-0.19741
83,-0.19741
84,-0.19741
85,-0.19741
86,-0.19741
87,-0.19741
88,-0.19741
89,-0.19741
90,-0.19741
91,-0.19741
92,-0.19741
93,-0.19741
94,-0.19741
95,-0.19741
