time,value
0,-0.34593
1,-0.34593
2,-0.34593
3,-0.34593
4,-0.34593
5,-0.34593
6,-0.34593
7,-0.34593
8,-0.34593
9,-0.34593
10,-0.34593
11,-0.34593
12,-0.34593
13,-0.34593
14,-0.34593
15,-0.34593
16,-0.34593
17,-0.34593
18,-0.34593
19,-0.34593
20,-0.34593
21,-0.34593
22,-0.34593
23,-0.34593
24,-0.34593
25,-0.34593
26,-0.34593
27,-0.34593
28,-0.34593
29,-0.34593
30,-0.34593
31,-0.34593
32,-0.34593
33,-0.34593
34,-0.34593
35,-0.34593
36,-0.34593
37,-0.34593
38,-0.34593
39,-0.34593
40,-0.34593
41,-0.34593
42,-0.34593
43,-0.34593
44,-0.34593
45,-0.34593
46,-0.34593
47,-0.34593
48,-0.34593
49,-0.34593
50,-0.34593
51,-0.34593
52,-0.34593
53,-0.34593
54,-0.34593
55,-0.34593
56,-0.34593
57,-0.34593
58,-0.34593
59,-0.34593
60,-0.34593
61,-0.34593
62,-0.34593
63,-0.34593
64,-0.34593
65,-0.34593
66,-0.34593
67,-0.34593
68,-0.34593
69,-0.34593
70,-0.34593
71,-0.34593
72,-0.34593
73,-0.34593
74,0.11531
75,2.8827
76,0.11531
77,-0.34593
78,1.2223
79,3.5284
80,3.344
81,3.1595
82,2.975
83,3.0672
84,2.7905
85,2.7905
86,2.7905
87,-0.069185
88,-0.34593
89,-0.34593
90,-0.34593
91,-0.34593
92,-0.34593
93,-0.34593
94,-0.34593
95,-0.34593
