[<text>
<title>equion corp &lt;equi&gt; 2nd qtr jan 31 net</title>
<dateline>    harrodsburg, ky., march 17 - 
    </dateline>oper shr 19 cts vs 18 cts
    oper net 951,902 vs 987,860
    revs 19.0 mln vs 17.1 mln
    six mths
    oper shr 26 cts vs 35 cts
    oper net 1,332,273 vs 2,502,868
    revs 33.6 mln vs 29.2 mln
    note: oper net excludes tax credits of 897,925 dlrs vs
841,511,dlrs for qtr and 1,306,860 dlrs vs 2,132,073 dlrs for
six mths.
    note: year-ago results restated to reflect change in
accounting principle effective august one, 1985.
 reuter
</text>]