time,value
0,-0.59205
1,-0.59205
2,-0.59205
3,-0.59205
4,-0.59205
5,-0.59205
6,-0.59205
7,-0.59205
8,-0.59205
9,-0.59205
10,-0.59205
11,-0.59205
12,-0.59205
13,-0.59205
14,-0.59205
15,-0.59205
16,-0.59205
17,-0.59205
18,-0.59205
19,-0.59205
20,-0.59205
21,-0.59205
22,-0.59205
23,-0.59205
24,-0.59205
25,-0.59205
26,-0.59205
27,-0.59205
28,-0.59205
29,-0.59205
30,-0.59205
31,-0.59205
32,-0.59205
33,-0.040236
34,2.7188
35,2.4429
36,1.8911
37,1.8911
38,1.6152
39,2.4429
40,2.9947
41,2.167
42,1.6152
43,1.6152
44,2.9947
45,1.3393
46,0.23567
47,-0.040236
48,-0.040236
49,-0.59205
50,1.0634
51,1.8911
52,2.4429
53,-0.040236
54,-0.040236
55,0.51158
56,-0.040236
57,0.7874800000000001
58,-0.040236
59,0.51158
60,-0.040236
61,-0.040236
62,-0.040236
63,0.51158
64,0.7874800000000001
65,-0.59205
66,-0.59205
67,-0.59205
68,-0.59205
69,-0.59205
70,-0.59205
71,0.23567
72,-0.040236
73,-0.59205
74,-0.59205
75,-0.59205
76,-0.59205
77,-0.59205
78,-0.59205
79,-0.59205
80,-0.59205
81,-0.59205
82,-0.59205
83,-0.59205
84,-0.59205
85,-0.59205
86,-0.59205
87,-0.59205
88,-0.59205
89,0.51158
90,1.3393
91,-0.59205
92,-0.59205
93,-0.59205
94,-0.59205
95,-0.59205
