time,value
0,-0.17733
1,-0.17733
2,-0.17733
3,-0.17733
4,-0.17733
5,-0.17733
6,-0.17733
7,-0.17733
8,-0.17733
9,-0.17733
10,-0.17733
11,-0.17733
12,-0.17733
13,-0.17733
14,-0.17733
15,-0.17733
16,-0.17733
17,-0.17733
18,-0.17733
19,-0.17733
20,-0.17733
21,-0.17733
22,-0.17733
23,-0.17733
24,-0.17733
25,-0.17733
26,-0.17733
27,-0.17733
28,-0.17733
29,-0.17733
30,6.1083
31,-0.17733
32,-0.17733
33,-0.17733
34,-0.17733
35,-0.17733
36,-0.17733
37,-0.17733
38,-0.17733
39,-0.17733
40,-0.17733
41,-0.17733
42,-0.17733
43,-0.17733
44,-0.17733
45,-0.17733
46,-0.17733
47,-0.17733
48,-0.17733
49,-0.17733
50,-0.17733
51,-0.17733
52,-0.17733
53,-0.17733
54,-0.17733
55,-0.17733
56,-0.17733
57,-0.17733
58,-0.17733
59,-0.17733
60,-0.17733
61,-0.17733
62,-0.17733
63,-0.17733
64,-0.17733
65,-0.17733
66,-0.17733
67,-0.17733
68,-0.17733
69,-0.17733
70,-0.17733
71,-0.17733
72,-0.17733
73,5.8464
74,-0.17733
75,-0.17733
76,-0.17733
77,-0.17733
78,-0.17733
79,-0.17733
80,-0.17733
81,-0.17733
82,-0.17733
83,4.5369
84,-0.17733
85,-0.17733
86,-0.17733
87,-0.17733
88,-0.17733
89,-0.17733
90,-0.17733
91,-0.17733
92,-0.17733
93,-0.17733
94,-0.17733
95,-0.17733
