time,value
0,-2.3505
1,-2.3505
2,-2.3505
3,-2.3505
4,-2.3529
5,-2.3529
6,-2.3529
7,-2.3529
8,-2.3551
9,-2.3622
10,-2.3668
11,-2.3688
12,-2.3683
13,-2.3676
14,-2.367
15,-2.3661
16,-2.365
17,-2.3638
18,-2.3625
19,-2.3614
20,-2.3597
21,-2.358
22,-2.3561
23,-2.3541
24,-2.3542
25,-2.3524
26,-2.35
27,-2.3475
28,-2.3448
29,-2.3501
30,-2.3569
31,-2.3561
32,-2.353
33,-2.3498
34,-2.3464
35,-2.3438
36,-2.3403
37,-2.3366
38,-2.3327
39,-2.3288
40,-2.3248
41,-2.3216
42,-2.3174
43,-2.313
44,-2.3106
45,-2.3061
46,-2.3025
47,-2.2978
48,-2.2929
49,-2.2880000000000003
50,-2.2829
51,-2.2778
52,-2.2738
53,-2.2685
54,-2.2631
55,-2.2577
56,-2.2521
57,-2.2479
58,-2.2422
59,-2.2364
60,-2.2305
61,-2.2246
62,-2.2183
63,-2.2122
64,-2.2061
65,-2.1999
66,-2.1937
67,-2.1874
68,-2.1826
69,-2.1762
70,-2.1697
71,-2.1632
72,-2.1582
73,-2.1515
74,-2.1414
75,-2.1349
76,-2.1282
77,-2.1215
78,-2.1165
79,-2.1097
80,-2.1012
81,-2.0943
82,-2.0874
83,-2.0805
84,-2.0736
85,-2.0655
86,-2.0589
87,-2.0519
88,-2.0448
89,-2.0395
90,-2.0324
91,-2.0253
92,-2.0166
93,-2.0093
94,-2.0021
95,-1.9966
96,-1.9893
97,-1.9819
98,-1.9749
99,-1.9672
100,-1.9624
101,-1.955
102,-1.9476
103,-1.9402
104,-1.9313
105,-1.9257
106,-1.9182
107,-1.9106
108,-1.9031
109,-1.8955
110,-1.8869
111,-1.8809
112,-1.8724
113,-1.8647
114,-1.8557
115,-1.8481
116,-1.8439
117,-1.8365
118,-1.8288
119,-1.8212
120,-1.8121
121,-1.8064
122,-1.7986
123,-1.7928
124,-1.7855
125,-1.7756
126,-1.7679
127,-1.7607
128,-1.7530000000000001
129,-1.7451
130,-1.7377
131,-1.73
132,-1.7242
133,-1.7151
134,-1.7079
135,-1.7006
136,-1.694
137,-1.6863
138,-1.6804
139,-1.6713
140,-1.6641
141,-1.6568
142,-1.6503
143,-1.6444
144,-1.6353
145,-1.6275
146,-1.6209
147,-1.6137
148,-1.6084
149,-1.6006
150,-1.5915
151,-1.5823
152,-1.5764
153,-1.5685
154,-1.5627
155,-1.5548
156,-1.5469
157,-1.5378
158,-1.5299
159,-1.5239
160,-1.516
161,-1.5068
162,-1.4997
163,-1.4912
164,-1.4852
165,-1.476
166,-1.4680000000000002
167,-1.4601
168,-1.4508
169,-1.443
170,-1.4373
171,-1.4293
172,-1.4213
173,-1.4133
174,-1.4040000000000001
175,-1.3980000000000001
176,-1.3899
177,-1.3819
178,-1.3738
179,-1.3657
180,-1.3604
181,-1.3548
182,-1.345
183,-1.337
184,-1.3289
185,-1.3195
186,-1.3134
187,-1.3053
188,-1.2972
189,-1.2890000000000001
190,-1.2814
191,-1.2757
192,-1.2684
193,-1.2603
194,-1.2521
195,-1.2439
196,-1.2357
197,-1.2284
198,-1.2202
199,-1.212
200,-1.2037
201,-1.1955
202,-1.1893
203,-1.181
204,-1.1727
205,-1.1645
206,-1.1561
207,-1.1499
208,-1.1416
209,-1.1333
210,-1.1259
211,-1.1194
212,-1.113
213,-1.1067
214,-1.0984
215,-1.0901
216,-1.0806
217,-1.0723
218,-1.0659999999999998
219,-1.0576
220,-1.0492
221,-1.0408
222,-1.0324
223,-1.024
224,-1.0177
225,-1.0092
226,-1.0008
227,-0.99234
228,-0.98388
229,-0.9775299999999999
230,-0.96906
231,-0.9638200000000001
232,-0.95752
233,-0.9511700000000001
234,-0.94483
235,-0.9363600000000001
236,-0.9278799999999999
237,-0.9193899999999999
238,-0.9098700000000001
239,-0.9013700000000001
240,-0.89499
241,-0.8864700000000001
242,-0.87795
243,-0.8694200000000001
244,-0.86088
245,-0.8544700000000001
246,-0.8459200000000001
247,-0.8385100000000001
248,-0.83337
249,-0.82696
250,-0.8205399999999999
251,-0.81198
252,-0.8034100000000001
253,-0.79385
254,-0.7864300000000001
255,-0.7833
256,-0.7811600000000001
257,-0.77258
258,-0.76399
259,-0.76184
260,-0.7597
261,-0.75325
262,-0.74464
263,-0.73507
264,-0.72646
265,-0.7178399999999999
266,-0.71041
267,-0.7053699999999999
268,-0.69816
269,-0.68955
270,-0.68093
271,-0.67135
272,-0.66488
273,-0.65625
274,-0.64761
275,-0.6389699999999999
276,-0.63032
277,-0.62383
278,-0.61517
279,-0.6065
280,-0.59783
281,-0.58915
282,-0.5804699999999999
283,-0.57395
284,-0.56526
285,-0.55656
286,-0.54785
287,-0.53915
288,-0.53261
289,-0.52389
290,-0.5151600000000001
291,-0.50643
292,-0.4977
293,-0.49113999999999997
294,-0.4824
295,-0.47365
296,-0.46488999999999997
297,-0.45613000000000004
298,-0.44737
299,-0.44078999999999996
300,-0.43201999999999996
301,-0.42323999999999995
302,-0.41446000000000005
303,-0.40701
304,-0.40441
305,-0.39741
306,-0.38863000000000003
307,-0.37899
308,-0.37021
309,-0.36322
310,-0.35841
311,-0.35096
312,-0.34218000000000004
313,-0.33341
314,-0.32376
315,-0.31718
316,-0.30839
317,-0.29875
318,-0.2891
319,-0.28298
320,-0.27819
321,-0.2694
322,-0.26061999999999996
323,-0.25096999999999997
324,-0.24218
325,-0.23338000000000003
326,-0.22726999999999997
327,-0.22163000000000002
328,-0.21418
329,-0.20539000000000002
330,-0.19574
331,-0.18915
332,-0.18035
333,-0.17155
334,-0.16679000000000002
335,-0.16115
336,-0.15675
337,-0.14795999999999998
338,-0.13917000000000002
339,-0.12952
340,-0.12072000000000001
341,-0.11105999999999999
342,-0.10715
343,-0.10153
344,-0.09493099999999999
345,-0.086136
346,-0.07648300000000001
347,-0.069882
348,-0.061079999999999995
349,-0.052272000000000006
350,-0.047519
351,-0.0419
352,-0.035304
353,-0.027849000000000002
354,-0.019051
355,-0.010248
356,-0.0032882
357,0.0023398000000000004
358,0.008933799999999999
359,0.018586000000000002
360,0.027382
361,0.034837
362,0.040466
363,0.044388
364,0.053174
365,0.061967999999999995
366,0.07162
367,0.080415
368,0.089216
369,0.095324
370,0.10095
371,0.1084
372,0.1172
373,0.12685
374,0.13345
375,0.13822
376,0.14386
377,0.15265
378,0.16144
379,0.16802999999999998
380,0.17683
381,0.18648
382,0.19528
383,0.20409000000000002
384,0.21375
385,0.2185
386,0.22326
387,0.23206
388,0.24086
389,0.24966999999999998
390,0.25627
391,0.26508000000000004
392,0.2739
393,0.28356
394,0.29238000000000003
395,0.3012
396,0.30782
397,0.31665
398,0.32327
399,0.32882
400,0.33796
401,0.34457
402,0.3534
403,0.36223
404,0.37106
405,0.38072
406,0.38735
407,0.39619
408,0.40365
409,0.40918000000000004
410,0.41526
411,0.42408999999999997
412,0.43072
413,0.44038
414,0.44922
415,0.45806
416,0.46331000000000006
417,0.46552
418,0.46993999999999997
419,0.47878999999999994
420,0.48763999999999996
421,0.49428
422,0.49649
423,0.49788999999999994
424,0.50594
425,0.50875
426,0.50552
427,0.50454
428,0.50216
429,0.50502
430,0.5131399999999999
431,0.5130100000000001
432,0.5099
433,0.5098199999999999
434,0.50675
435,0.50598
436,0.50522
437,0.5021899999999999
438,0.4992
439,0.4992
440,0.49396999999999996
441,0.48503
442,0.47828999999999994
443,0.47305
444,0.46634
445,0.45738999999999996
446,0.44769
447,0.43873999999999996
448,0.42978999999999995
449,0.42308999999999997
450,0.41415
451,0.40521
452,0.39628
453,0.38735
454,0.37765
455,0.37095
456,0.36719
457,0.36191
458,0.35297
459,0.34404
460,0.33658000000000005
461,0.32764
462,0.31871
463,0.31201999999999996
464,0.30672
465,0.30221
466,0.29327
467,0.28357
468,0.27464
469,0.26718000000000003
470,0.2619
471,0.25815
472,0.24845
473,0.24170999999999998
474,0.23424
475,0.22454000000000002
476,0.21930999999999998
477,0.21409
478,0.20813
479,0.19917
480,0.19021
481,0.18125
482,0.17379
483,0.16483
484,0.15812
485,0.15067
486,0.14171
487,0.13499
488,0.12603
489,0.11632999999999999
490,0.10737000000000001
491,0.09841699999999999
492,0.09170299999999999
493,0.084241
494,0.07900900000000001
495,0.073041
496,0.06333899999999999
497,0.057373
498,0.052915
499,0.046958
500,0.037988
501,0.028283
502,0.019318000000000002
503,0.015599000000000002
504,0.010421
505,0.0029588
506,-0.0060171999999999995
507,-0.014987
508,-0.022451
509,-0.031419
510,-0.040385000000000004
511,-0.049348
512,-0.058307000000000005
513,-0.062774
514,-0.067227
515,-0.072448
516,-0.08215399999999999
517,-0.09112200000000001
518,-0.10009
519,-0.10380999999999999
520,-0.10898
521,-0.11869
522,-0.12766
523,-0.13737
524,-0.14634
525,-0.15307
526,-0.16277
527,-0.16571
528,-0.1739
529,-0.18288
530,-0.18961
531,-0.19932
532,-0.20829
533,-0.21725
534,-0.22395
535,-0.22839
536,-0.23585
537,-0.24556
538,-0.25071
539,-0.25736
540,-0.26636
541,-0.2731
542,-0.28208
543,-0.29179
544,-0.30077
545,-0.30671
546,-0.31113
547,-0.31706
548,-0.32605
549,-0.33576
550,-0.34475
551,-0.34844
552,-0.35131
553,-0.35414
554,-0.3592
555,-0.36198
556,-0.36472
557,-0.36676
558,-0.36944
559,-0.37531
560,-0.38503000000000004
561,-0.38994
562,-0.39191
563,-0.3945
564,-0.39705999999999997
565,-0.39959
566,-0.40209
567,-0.40455
568,-0.40638
569,-0.40879
570,-0.41116
571,-0.40776
572,-0.3992
573,-0.39233
574,-0.38318
575,-0.37403000000000003
576,-0.36544
577,-0.35628000000000004
578,-0.34941
579,-0.3431
580,-0.34534000000000004
581,-0.34415
582,-0.34525
583,-0.3412
584,-0.33485
585,-0.3262
586,-0.32497
587,-0.31861
588,-0.31401
589,-0.31171
590,-0.30533000000000005
591,-0.29612
592,-0.29589
593,-0.29281999999999997
594,-0.28641
595,-0.2828
596,-0.28478000000000003
597,-0.28442
598,-0.28633000000000003
599,-0.27755
600,-0.27061999999999997
601,-0.26136
602,-0.25258
603,-0.24331999999999998
604,-0.23406
605,-0.23267
606,-0.23215999999999998
607,-0.22566
608,-0.21639
609,-0.20711999999999997
610,-0.19785
611,-0.19089
612,-0.18162
613,-0.17234000000000002
614,-0.16305999999999998
615,-0.15378
616,-0.14682
617,-0.139
618,-0.13492
619,-0.12984
620,-0.12057000000000001
621,-0.11360999999999999
622,-0.1039
623,-0.094624
624,-0.085352
625,-0.076075
626,-0.0668
627,-0.061724
628,-0.059404
629,-0.050129
630,-0.040416
631,-0.030701999999999997
632,-0.027943
633,-0.025187
634,-0.017349
635,-0.0080742
636,-0.0034391999999999995
637,-0.0011202
638,0.0035178000000000006
639,0.012793
640,0.022506
641,0.031783
642,0.038181
643,0.039519
644,0.048789
645,0.058057000000000004
646,0.067327
647,0.076599
648,0.083552
649,0.09282699999999999
650,0.10254
651,0.11182
652,0.12109
653,0.13036
654,0.13732
655,0.1466
656,0.15588
657,0.16516
658,0.16877999999999999
659,0.17242000000000002
660,0.18214
661,0.19141
662,0.20068
663,0.20995999999999998
664,0.21735
665,0.22663000000000003
666,0.2359
667,0.24518
668,0.24694000000000002
669,0.25290999999999997
670,0.25986
671,0.26913000000000004
672,0.27885
673,0.28669
674,0.29081
675,0.29358
676,0.30284
677,0.31256
678,0.32183
679,0.33109
680,0.33804
681,0.34731
682,0.35657
683,0.36584
684,0.37511
685,0.38438
686,0.39089
687,0.40016999999999997
688,0.40944
689,0.41872
690,0.42799
691,0.43495
692,0.44466000000000006
693,0.45393999999999995
694,0.46321999999999997
695,0.4725
696,0.48178000000000004
697,0.48873999999999995
698,0.49801999999999996
699,0.5073
700,0.5128
701,0.51686
702,0.52194
703,0.5312100000000001
704,0.5404899999999999
705,0.54977
706,0.55905
707,0.56601
708,0.57572
709,0.585
710,0.59428
711,0.60356
712,0.6128399999999999
713,0.6198100000000001
714,0.6290899999999999
715,0.6383800000000001
716,0.64766
717,0.65695
718,0.66391
719,0.6732
720,0.6824899999999999
721,0.6917800000000001
722,0.70107
723,0.70804
724,0.71733
725,0.7266199999999999
726,0.73592
727,0.74521
728,0.7545
729,0.76147
730,0.77077
731,0.7800699999999999
732,0.78977
733,0.79524
734,0.79881
735,0.80619
736,0.8154899999999999
737,0.82478
738,0.8340700000000001
739,0.8433700000000001
740,0.85075
741,0.8600399999999999
742,0.86934
743,0.87864
744,0.8879299999999999
745,0.8949
746,0.9042
747,0.9135
748,0.9228
749,0.92745
750,0.9297700000000001
751,0.9390700000000001
752,0.94837
753,0.95768
754,0.9623299999999999
755,0.9623299999999999
756,0.9693
757,0.97821
758,0.9770200000000001
759,0.97545
760,0.9762299999999999
761,0.97509
762,0.9747100000000001
763,0.9747100000000001
764,0.9817
765,0.9910200000000001
766,0.9956799999999999
767,0.9980100000000001
768,1.0073
769,1.0151
770,1.0166
771,1.0181
772,1.0216
773,1.0224
774,1.0224
775,1.0271
776,1.034
777,1.034
778,1.0387
779,1.048
780,1.0519
781,1.0542
782,1.0635
783,1.0705
784,1.0798
785,1.0891
786,1.0938
787,1.0965
788,1.0969
789,1.0973
790,1.1043
791,1.1089
792,1.1112
793,1.1159
794,1.1252
795,1.1345
796,1.1438
797,1.1532
798,1.1625
799,1.1695
800,1.1788
801,1.1881
802,1.1974
803,1.2067
804,1.2137
805,1.2229999999999999
806,1.2323
807,1.2417
808,1.251
809,1.258
810,1.2673
811,1.2766
812,1.2819999999999998
813,1.2859
814,1.2909
815,1.2979
816,1.3072
817,1.3165
818,1.3258
819,1.3352
820,1.3422
821,1.3515
822,1.355
823,1.3586
824,1.3675
825,1.3769
826,1.3839
827,1.3882
828,1.3905
829,1.3921
830,1.3934
831,1.3957
832,1.3947
833,1.3933
834,1.3922
835,1.3896
836,1.3862
837,1.3832
838,1.3809
839,1.3785
840,1.3692
841,1.3595
842,1.3525
843,1.3431
844,1.3338
845,1.3265
846,1.3228
847,1.3198
848,1.3104
849,1.3011
850,1.2917
851,1.2821
852,1.2751
853,1.2657
854,1.2564
855,1.2484
856,1.2447
857,1.2377
858,1.2307
859,1.2213
860,1.212
861,1.2026
862,1.1933
863,1.1863
864,1.1766
865,1.1673
866,1.1579
867,1.1486
868,1.1392
869,1.1342
870,1.1309
871,1.1262
872,1.1169
873,1.1075
874,1.1005
875,1.0905
876,1.0808
877,1.0785
878,1.0715
879,1.0645
880,1.0575
881,1.0571
882,1.0545
883,1.0545
884,1.0475
885,1.0404
886,1.0311
887,1.0241
888,1.0217
889,1.0197
890,1.0131
891,1.0061
892,1.0037
893,0.9990399999999999
894,0.9897
895,0.98269
896,0.98269
897,0.98236
898,0.9787
899,0.9774
900,0.9761200000000001
901,0.9751700000000001
902,0.9658200000000001
903,0.9564600000000001
904,0.94711
905,0.93775
906,0.93042
907,0.92106
908,0.91171
909,0.90235
910,0.893
911,0.88365
912,0.88365
913,0.87897
914,0.8696200000000001
915,0.8672799999999999
916,0.8672799999999999
917,0.86026
918,0.85091
919,0.8415600000000001
920,0.83221
921,0.82286
922,0.81585
923,0.8065
924,0.79714
925,0.78981
926,0.78618
927,0.78087
928,0.77385
929,0.7645
930,0.7551399999999999
931,0.74579
932,0.73612
933,0.7291
934,0.71975
935,0.7104
936,0.70105
937,0.69339
938,0.6924399999999999
939,0.68479
940,0.6754399999999999
941,0.66608
942,0.65672
943,0.64705
944,0.6400399999999999
945,0.63068
946,0.62133
947,0.6157
948,0.61212
949,0.60511
950,0.59575
951,0.58639
952,0.57672
953,0.5673600000000001
954,0.5579999999999999
955,0.55708
956,0.55353
957,0.54651
958,0.53714
959,0.52778
960,0.52076
961,0.5110899999999999
962,0.50173
963,0.49237
964,0.48301000000000005
965,0.48006000000000004
966,0.47653
967,0.46687
968,0.4575
969,0.44814
970,0.43848000000000004
971,0.43145
972,0.42208999999999997
973,0.41272
974,0.4057
975,0.40218000000000004
976,0.40131
977,0.39897
978,0.39868000000000003
979,0.39137
980,0.38611999999999996
981,0.3835
982,0.37619
983,0.36654000000000003
984,0.36157
985,0.35923
986,0.34985
987,0.34254
988,0.33316999999999997
989,0.32352
990,0.32008000000000003
991,0.31485
992,0.30782
993,0.29844
994,0.28906
995,0.27969
996,0.27004
997,0.26066
998,0.25361999999999996
999,0.24425
1000,0.23487
1001,0.22549
1002,0.21611999999999998
1003,0.20908000000000002
1004,0.19971
1005,0.19005999999999998
1006,0.18663
1007,0.17907
1008,0.17203
1009,0.16265
1010,0.15327000000000002
1011,0.14389000000000002
1012,0.13451
1013,0.12487000000000001
1014,0.11782999999999999
1015,0.10845
1016,0.099074
1017,0.08969500000000001
1018,0.080319
1019,0.07535800000000001
1020,0.07195
1021,0.06439099999999999
1022,0.055008
1023,0.045627
1024,0.03859
1025,0.029209
1026,0.019828
1027,0.010182
1028,0.00080081
1029,-0.008580200000000001
1030,-0.015615
1031,-0.020304
1032,-0.024996
1033,-0.034374
1034,-0.036719999999999996
1035,-0.039063
1036,-0.048975
1037,-0.058617999999999996
1038,-0.068263
1039,-0.077644
1040,-0.07998999999999999
1041,-0.08076900000000001
1042,-0.087806
1043,-0.09719
1044,-0.10657
1045,-0.11622
1046,-0.12325
1047,-0.13264
1048,-0.14202
1049,-0.1514
1050,-0.15452
1051,-0.15528
1052,-0.15788
1053,-0.15812
1054,-0.16541
1055,-0.17035
1056,-0.17294
1057,-0.18022
1058,-0.19009
1059,-0.19503
1060,-0.19503
1061,-0.19807
1062,-0.19875
1063,-0.20624
1064,-0.21564
1065,-0.22526
1066,-0.23465999999999998
1067,-0.23765999999999998
1068,-0.24086
1069,-0.25026
1070,-0.25987
1071,-0.26222
1072,-0.26283
1073,-0.26342
1074,-0.26418
1075,-0.26491
1076,-0.26543
1077,-0.2656
1078,-0.26106
1079,-0.25936
1080,-0.25495999999999996
1081,-0.2457
1082,-0.24158000000000002
1083,-0.23729
1084,-0.23035
1085,-0.22591
1086,-0.22405
1087,-0.21475
1088,-0.20531999999999997
1089,-0.19825
1090,-0.18882000000000002
1091,-0.17939000000000002
1092,-0.17008
1093,-0.16065
1094,-0.15358
1095,-0.14415
1096,-0.13472
1097,-0.13259
1098,-0.13302
1099,-0.13105
1100,-0.13132
1101,-0.12451
1102,-0.11515
1103,-0.11546
1104,-0.11337
1105,-0.11356
1106,-0.11137000000000001
1107,-0.10192999999999999
1108,-0.092543
1109,-0.083105
1110,-0.078435
1111,-0.076254
1112,-0.071612
1113,-0.062172000000000005
1114,-0.052735000000000004
1115,-0.043295
1116,-0.036215
1117,-0.026777
1118,-0.017373
1119,-0.0079002
1120,0.0015048
1121,0.0085848
1122,0.018022
1123,0.027462
1124,0.036902
1125,0.04634
1126,0.05342
1127,0.055779999999999996
1128,0.06285700000000001
1129,0.072297
1130,0.077017
1131,0.081737
1132,0.08881499999999999
1133,0.098255
1134,0.10769000000000001
1135,0.11713
1136,0.12657000000000002
1137,0.13365
1138,0.14309000000000002
1139,0.15253
1140,0.16197
1141,0.17140999999999998
1142,0.18085
1143,0.18792
1144,0.19735999999999998
1145,0.2068
1146,0.21624000000000002
1147,0.22568000000000002
1148,0.23276
1149,0.2422
1150,0.24456
1151,0.25164000000000003
1152,0.26108000000000003
1153,0.2658
1154,0.26816
1155,0.27524
1156,0.28468000000000004
1157,0.29411
1158,0.30355
1159,0.31063
1160,0.3201
1161,0.32954
1162,0.33898
1163,0.34842
1164,0.3555
1165,0.36491
1166,0.37438
1167,0.38379
1168,0.39326
1169,0.4027
1170,0.40976999999999997
1171,0.41921
1172,0.42865
1173,0.43809
1174,0.44753000000000004
1175,0.45461
1176,0.45697
1177,0.46405
1178,0.46876999999999996
1179,0.47348999999999997
1180,0.48057
1181,0.49001000000000006
1182,0.49945
1183,0.50889
1184,0.5183
1185,0.52774
1186,0.53481
1187,0.54425
1188,0.55369
1189,0.56313
1190,0.57257
1191,0.57965
1192,0.58909
1193,0.59853
1194,0.60797
1195,0.61741
1196,0.62449
1197,0.63395
1198,0.64339
1199,0.65283
1200,0.66227
1201,0.67168
1202,0.67876
1203,0.6882
1204,0.6976399999999999
1205,0.70708
1206,0.71413
1207,0.71642
1208,0.71873
1209,0.72817
1210,0.73761
1211,0.7470399999999999
1212,0.75648
1213,0.76356
1214,0.77299
1215,0.7824300000000001
1216,0.79187
1217,0.8013100000000001
1218,0.8083899999999999
1219,0.8178300000000001
1220,0.8272700000000001
1221,0.8367100000000001
1222,0.84615
1223,0.8532299999999999
1224,0.86267
1225,0.86503
1226,0.86975
1227,0.8791899999999999
1228,0.8886299999999999
1229,0.88861
1230,0.89095
1231,0.90038
1232,0.90981
1233,0.91925
1234,0.92161
1235,0.92399
1236,0.9310799999999999
1237,0.94052
1238,0.94996
1239,0.95704
1240,0.9641200000000001
1241,0.96649
1242,0.9735799999999999
1243,0.9830200000000001
1244,0.99246
1245,0.99954
1246,1.0090000000000001
1247,1.0184
1248,1.0279
1249,1.0373
1250,1.0444
1251,1.0538
1252,1.0633
1253,1.0727
1254,1.0822
1255,1.0916
1256,1.0987
1257,1.1081
1258,1.1176
1259,1.127
1260,1.1364
1261,1.1435
1262,1.153
1263,1.153
1264,1.1577
1265,1.1671
1266,1.1742
1267,1.1836
1268,1.186
1269,1.1884
1270,1.1883
1271,1.1906
1272,1.1977
1273,1.2072
1274,1.2166
1275,1.226
1276,1.2355
1277,1.2426
1278,1.2473
1279,1.2497
1280,1.2497
1281,1.2497
1282,1.2568
1283,1.2615
1284,1.2615
1285,1.2638
1286,1.2638
1287,1.2709
1288,1.278
1289,1.2874
1290,1.2969
1291,1.304
1292,1.3063
1293,1.3087
1294,1.3181
1295,1.3276
1296,1.337
1297,1.3465
1298,1.3559
1299,1.3630000000000002
1300,1.3724
1301,1.3819
1302,1.3913
1303,1.396
1304,1.396
1305,1.4054
1306,1.4148
1307,1.4243
1308,1.4337
1309,1.4408
1310,1.4502
1311,1.455
1312,1.4597
1313,1.4692
1314,1.4786
1315,1.4857
1316,1.4951
1317,1.5046
1318,1.5117
1319,1.5141
1320,1.5165
1321,1.5259
1322,1.5353
1323,1.5448
1324,1.5542
1325,1.5613
1326,1.5636
1327,1.5683
1328,1.5777
1329,1.5872
1330,1.5966
1331,1.6013
1332,1.6036
1333,1.6084
1334,1.6131
1335,1.6131
1336,1.6131
1337,1.6131
1338,1.6132
1339,1.6132
1340,1.6133
1341,1.6063
1342,1.6039
1343,1.6017
1344,1.5923
1345,1.5828
1346,1.5734
1347,1.5664
1348,1.5642
1349,1.5595
1350,1.5501
1351,1.5407
1352,1.5336
1353,1.5241
1354,1.5147
1355,1.5053
1356,1.4958
1357,1.4933
1358,1.4908
1359,1.4814
1360,1.472
1361,1.4625
1362,1.4531
1363,1.446
1364,1.4366
1365,1.4271
1366,1.4177
1367,1.4154
1368,1.4132
1369,1.4062
1370,1.3967
1371,1.3873
1372,1.3779
1373,1.3685
1374,1.3614
1375,1.3569
1376,1.3523
1377,1.3429
1378,1.3334
1379,1.3264
1380,1.317
1381,1.3075
1382,1.2981
1383,1.2887
1384,1.2841
1385,1.2819999999999998
1386,1.2749
1387,1.2655
1388,1.2631
1389,1.2608
1390,1.2537
1391,1.2514
1392,1.2514
1393,1.249
1394,1.2466
1395,1.2396
1396,1.2301
1397,1.2278
1398,1.2229999999999999
1399,1.2137
1400,1.2092
1401,1.2071
1402,1.1977
1403,1.1882
1404,1.1788
1405,1.1694
1406,1.1623
1407,1.153
1408,1.1435
1409,1.1341
1410,1.1246
1411,1.1176
1412,1.1081
1413,1.0987
1414,1.0893
1415,1.0798
1416,1.0703
1417,1.0633
1418,1.0538
1419,1.0444
1420,1.0349
1421,1.0256
1422,1.0185
1423,1.0091
1424,0.99965
1425,0.99021
1426,0.98314
1427,0.9807799999999999
1428,0.9737
1429,0.96898
1430,0.9666299999999999
1431,0.9596399999999999
1432,0.9503799999999999
1433,0.9434
1434,0.93396
1435,0.92689
1436,0.9246200000000001
1437,0.91774
1438,0.91066
1439,0.90123
1440,0.8919
1441,0.8824700000000001
1442,0.87303
1443,0.8687299999999999
1444,0.86669
1445,0.85726
1446,0.84783
1447,0.8384
1448,0.8289700000000001
1449,0.8219
1450,0.81258
1451,0.80315
1452,0.79372
1453,0.7842899999999999
1454,0.77733
1455,0.77545
1456,0.77098
1457,0.76155
1458,0.75212
1459,0.7427
1460,0.73575
1461,0.72633
1462,0.7169
1463,0.7074699999999999
1464,0.70289
1465,0.70053
1466,0.69818
1467,0.68875
1468,0.67933
1469,0.6699
1470,0.66781
1471,0.66559
1472,0.6561600000000001
1473,0.64674
1474,0.63731
1475,0.62789
1476,0.62553
1477,0.62595
1478,0.61653
1479,0.6071
1480,0.59768
1481,0.5906100000000001
1482,0.58134
1483,0.57191
1484,0.5624899999999999
1485,0.55307
1486,0.54365
1487,0.5365800000000001
1488,0.5271600000000001
1489,0.51774
1490,0.50832
1491,0.49888999999999994
1492,0.49699
1493,0.49478999999999995
1494,0.48536999999999997
1495,0.47595
1496,0.46653
1497,0.45947
1498,0.45005
1499,0.44533999999999996
1500,0.44016000000000005
1501,0.43059
1502,0.42117
1503,0.41411000000000003
1504,0.40469
1505,0.39526999999999995
1506,0.38585
1507,0.37643000000000004
1508,0.36935999999999997
1509,0.35979
1510,0.35052
1511,0.3411
1512,0.33168000000000003
1513,0.32226
1514,0.3152
1515,0.30578
1516,0.29636
1517,0.28946
1518,0.2871
1519,0.28239000000000003
1520,0.27297
1521,0.26355
1522,0.25649
1523,0.25414000000000003
1524,0.25161999999999995
1525,0.2422
1526,0.23279
1527,0.22336999999999999
1528,0.21395
1529,0.20453
1530,0.19747
1531,0.18789
1532,0.17847000000000002
1533,0.16905
1534,0.15964
1535,0.15257
1536,0.14315999999999998
1537,0.13374
1538,0.12432
1539,0.1149
1540,0.10784
1541,0.098425
1542,0.089008
1543,0.079592
1544,0.070176
1545,0.060759
1546,0.053698
1547,0.04899
1548,0.046635
1549,0.039574
1550,0.030157
1551,0.025449
1552,0.023096000000000002
1553,0.016035
1554,0.0066188
1555,-0.0027952
1556,-0.012039
1557,-0.019098
1558,-0.028512
1559,-0.032687
1560,-0.034301
1561,-0.04371
1562,-0.050769
1563,-0.060177999999999995
1564,-0.069396
1565,-0.078803
1566,-0.08546799999999999
1567,-0.084868
1568,-0.091302
1569,-0.10049
1570,-0.10432999999999999
1571,-0.11093
1572,-0.12032999999999999
1573,-0.12715
1574,-0.13654000000000002
1575,-0.1382
1576,-0.13959000000000002
1577,-0.14662999999999998
1578,-0.15342999999999998
1579,-0.15503
1580,-0.15635
1581,-0.15529
1582,-0.15655
1583,-0.16358
1584,-0.16743
1585,-0.16627999999999998
1586,-0.1651
1587,-0.16389
1588,-0.16265
1589,-0.1617
1590,-0.1604
1591,-0.15339
1592,-0.14371
1593,-0.13437000000000002
1594,-0.12736
1595,-0.1237
1596,-0.12035
1597,-0.11067
1598,-0.10532000000000001
1599,-0.1016
1600,-0.09424500000000001
1601,-0.084911
1602,-0.075223
1603,-0.065889
1604,-0.062498000000000005
1605,-0.061422000000000004
1606,-0.053702
1607,-0.044373
1608,-0.040579000000000004
1609,-0.037131
1610,-0.030139999999999997
1611,-0.020818
1612,-0.011124
1613,-0.0037601999999999996
1614,-0.0022451999999999997
1615,0.0016248
1616,0.0027998000000000003
1617,0.0063168
1618,0.015622
1619,0.024925
1620,0.034629
1621,0.041608
1622,0.050913
1623,0.058288
1624,0.061411
1625,0.066064
1626,0.073041
1627,0.082745
1628,0.092848
1629,0.10255
1630,0.10488
1631,0.10953
1632,0.11650999999999999
1633,0.11882999999999999
1634,0.12347999999999999
1635,0.13279000000000002
1636,0.14209000000000002
1637,0.14907
1638,0.15877
1639,0.16808
1640,0.17739000000000002
1641,0.1867
1642,0.19253
1643,0.19605999999999998
1644,0.20576
1645,0.21506999999999998
1646,0.22436999999999999
1647,0.23367
1648,0.24065
1649,0.24995
1650,0.25926
1651,0.26896
1652,0.27826999999999996
1653,0.28525
1654,0.29456
1655,0.30387
1656,0.3101
1657,0.31828
1658,0.32798
1659,0.33496
1660,0.34426
1661,0.35053
1662,0.35408
1663,0.36338000000000004
1664,0.37035
1665,0.37964000000000003
1666,0.38894
1667,0.39824
1668,0.40795
1669,0.41491999999999996
1670,0.42422
1671,0.43351999999999996
1672,0.44282
1673,0.45211999999999997
1674,0.46183
1675,0.46536000000000005
1676,0.46891000000000005
1677,0.47821
1678,0.48751000000000005
1679,0.49681000000000003
1680,0.50378
1681,0.51308
1682,0.52278
1683,0.53208
1684,0.54138
1685,0.5506800000000001
1686,0.55766
1687,0.56161
1688,0.56748
1689,0.5767800000000001
1690,0.58608
1691,0.59305
1692,0.60234
1693,0.61205
1694,0.62135
1695,0.63065
1696,0.6357
1697,0.63967
1698,0.6451399999999999
1699,0.6544399999999999
1700,0.66373
1701,0.6734399999999999
1702,0.6804100000000001
1703,0.6897
1704,0.69517
1705,0.69917
1706,0.70655
1707,0.7135199999999999
1708,0.7228100000000001
1709,0.73252
1710,0.7418100000000001
1711,0.7511
1712,0.75426
1713,0.75827
1714,0.76798
1715,0.77727
1716,0.78698
1717,0.7962600000000001
1718,0.80323
1719,0.81252
1720,0.8165399999999999
1721,0.82204
1722,0.83175
1723,0.8387100000000001
1724,0.8479899999999999
1725,0.8572700000000001
1726,0.86656
1727,0.8762700000000001
1728,0.88556
1729,0.8925200000000001
1730,0.90181
1731,0.91109
1732,0.92038
1733,0.9277700000000001
1734,0.9313600000000001
1735,0.93729
1736,0.94657
1737,0.95585
1738,0.96514
1739,0.9721
1740,0.98139
1741,0.99067
1742,1.0004
1743,1.0097
1744,1.0190000000000001
1745,1.0259
1746,1.0352
1747,1.0445
1748,1.0538
1749,1.0616
1750,1.0652
1751,1.0707
1752,1.08
1753,1.0892
1754,1.0985
1755,1.1055
1756,1.1148
1757,1.1245
1758,1.1338
1759,1.1431
1760,1.1524
1761,1.1593
1762,1.1686
1763,1.176
1764,1.18
1765,1.1855
1766,1.1925
1767,1.2018
1768,1.2109999999999999
1769,1.2208
1770,1.23
1771,1.2355
1772,1.2368
1773,1.247
1774,1.2562
1775,1.2659
1776,1.2752
1777,1.2788
1778,1.2825
1779,1.2922
1780,1.3015
1781,1.3107
1782,1.3177
1783,1.327
1784,1.3367
1785,1.3459999999999999
1786,1.3552
1787,1.3645
1788,1.3715
1789,1.3808
1790,1.3901
1791,1.3993
1792,1.4086
1793,1.4156
1794,1.4249
1795,1.4342
1796,1.4434
1797,1.4527
1798,1.4597
1799,1.4652
1800,1.4669
1801,1.4709
1802,1.4727
1803,1.4801
1804,1.4851
1805,1.4865
1806,1.4882
1807,1.49
1808,1.4918
1809,1.4932
1810,1.4946
1811,1.4904
1812,1.4844
1813,1.484
1814,1.4752
1815,1.4683
1816,1.4595
1817,1.4503
1818,1.4485
1819,1.4462
1820,1.4392
1821,1.43
1822,1.4207
1823,1.4166
1824,1.4148
1825,1.413
1826,1.4037
1827,1.3945
1828,1.3853
1829,1.3783
1830,1.3765
1831,1.3752
1832,1.3659999999999999
1833,1.3573
1834,1.348
1835,1.3449
1836,1.3441
1837,1.3354
1838,1.3262
1839,1.317
1840,1.3078
1841,1.3009
1842,1.2917
1843,1.2830000000000001
1844,1.2738
1845,1.2646
1846,1.2554
1847,1.2485
1848,1.2393
1849,1.237
1850,1.2347
1851,1.2278
1852,1.2232
1853,1.2214
1854,1.215
1855,1.2063
1856,1.1982
1857,1.189
1858,1.1844
1859,1.1816
1860,1.1747
1861,1.1655
1862,1.1563
1863,1.1494
1864,1.1403
1865,1.1334
1866,1.1293
1867,1.1224
1868,1.115
1869,1.1053
1870,1.0955
1871,1.0904
1872,1.0876
1873,1.0807
1874,1.0761
1875,1.0738
1876,1.0692
1877,1.06
1878,1.0503
1879,1.0434
1880,1.0372
1881,1.0327
1882,1.0235
1883,1.0143
1884,1.0074
1885,0.99823
1886,0.98905
1887,0.97987
1888,0.9706899999999999
1889,0.9615100000000001
1890,0.95462
1891,0.94545
1892,0.9385600000000001
1893,0.93627
1894,0.92709
1895,0.9248
1896,0.92251
1897,0.91904
1898,0.91043
1899,0.9012600000000001
1900,0.89097
1901,0.8835299999999999
1902,0.8812399999999999
1903,0.87666
1904,0.8697799999999999
1905,0.86749
1906,0.86118
1907,0.85315
1908,0.8440000000000001
1909,0.8342700000000001
1910,0.8285399999999999
1911,0.82625
1912,0.8216700000000001
1913,0.8148
1914,0.81252
1915,0.80565
1916,0.7964899999999999
1917,0.78963
1918,0.78047
1919,0.77132
1920,0.76217
1921,0.75302
1922,0.74616
1923,0.73701
1924,0.72787
1925,0.71872
1926,0.70958
1927,0.70272
1928,0.69358
1929,0.68445
1930,0.6753100000000001
1931,0.6661699999999999
1932,0.65704
1933,0.6501899999999999
1934,0.6410600000000001
1935,0.63193
1936,0.6228
1937,0.61368
1938,0.60683
1939,0.5977100000000001
1940,0.5879800000000001
1941,0.57886
1942,0.5697399999999999
1943,0.56062
1944,0.55379
1945,0.54467
1946,0.53556
1947,0.52645
1948,0.52066
1949,0.5183800000000001
1950,0.51154
1951,0.5018199999999999
1952,0.49208999999999997
1953,0.48173999999999995
1954,0.47718999999999995
1955,0.47429
1956,0.46518000000000004
1957,0.46062
1958,0.46062
1959,0.45152
1960,0.44468
1961,0.43558
1962,0.42646999999999996
1963,0.41736999999999996
1964,0.40764
1965,0.40081999999999995
1966,0.39171999999999996
1967,0.38261999999999996
1968,0.37353000000000003
1969,0.36873
1970,0.36458
1971,0.35548
1972,0.34638
1973,0.33728
1974,0.32818
1975,0.31908000000000003
1976,0.31226
1977,0.30316
1978,0.29407
1979,0.28499
1980,0.27526
1981,0.26844
1982,0.25936
1983,0.25028
1984,0.24119000000000002
1985,0.23635
1986,0.2299
1987,0.22308000000000003
1988,0.21399
1989,0.20426
1990,0.19518
1991,0.18609
1992,0.17864000000000002
1993,0.17381
1994,0.16799
1995,0.1589
1996,0.14981
1997,0.14236
1998,0.13327
1999,0.12418
2000,0.1151
2001,0.10602
2002,0.09954600000000001
2003,0.095359
2004,0.087906
2005,0.078178
2006,0.06909
2007,0.060002
2008,0.058089999999999996
2009,0.05392
2010,0.044192
2011,0.035097
2012,0.026004000000000003
2013,0.018549
2014,0.009457799999999999
2015,0.00036681
2016,-0.0019062
2017,-0.0070882
2018,-0.016812999999999998
2019,-0.024269
2020,-0.027813
2021,-0.030718000000000002
2022,-0.040445999999999996
2023,-0.042719
2024,-0.044994
2025,-0.054085
2026,-0.063175
2027,-0.072261
2028,-0.081347
2029,-0.090431
2030,-0.09723899999999999
2031,-0.10632
2032,-0.11539
2033,-0.12447000000000001
2034,-0.13419
2035,-0.141
2036,-0.15007
2037,-0.15847999999999998
2038,-0.16754000000000002
2039,-0.1766
2040,-0.18339
2041,-0.19245
2042,-0.2015
2043,-0.21055
2044,-0.2196
2045,-0.22864
2046,-0.23543000000000003
2047,-0.24445999999999998
2048,-0.2535
2049,-0.26254
2050,-0.27157
2051,-0.27834000000000003
2052,-0.28736999999999996
2053,-0.29639
2054,-0.30541999999999997
2055,-0.31443000000000004
2056,-0.32119000000000003
2057,-0.33021
2058,-0.33921999999999997
2059,-0.34893
2060,-0.35723
2061,-0.36623
2062,-0.37298000000000003
2063,-0.38198000000000004
2064,-0.39097
2065,-0.39996
2066,-0.40894
2067,-0.41568
2068,-0.42466000000000004
2069,-0.43363999999999997
2070,-0.44261000000000006
2071,-0.45158000000000004
2072,-0.46055
2073,-0.46726999999999996
2074,-0.47623000000000004
2075,-0.47846000000000005
2076,-0.47544
2077,-0.48438000000000003
2078,-0.49108
2079,-0.49923999999999996
2080,-0.5081600000000001
2081,-0.51708
2082,-0.52522
2083,-0.52366
2084,-0.52273
2085,-0.53162
2086,-0.5405
2087,-0.5485800000000001
2088,-0.55443
2089,-0.552
2090,-0.55398
2091,-0.56283
2092,-0.57084
2093,-0.57968
2094,-0.58021
2095,-0.58126
2096,-0.58701
2097,-0.59496
2098,-0.60375
2099,-0.61034
2100,-0.60907
2101,-0.61083
2102,-0.61959
2103,-0.62834
2104,-0.6362
2105,-0.63749
2106,-0.6339
2107,-0.6302800000000001
2108,-0.62662
2109,-0.62293
2110,-0.6201399999999999
2111,-0.6164
2112,-0.6089600000000001
2113,-0.60059
2114,-0.59465
2115,-0.58843
2116,-0.581
2117,-0.57477
2118,-0.56879
2119,-0.56137
2120,-0.55178
2121,-0.5489
2122,-0.54385
2123,-0.53427
2124,-0.52566
2125,-0.51608
2126,-0.50961
2127,-0.50098
2128,-0.49233999999999994
2129,-0.48636999999999997
2130,-0.48133000000000004
2131,-0.47271
2132,-0.46528
2133,-0.45665
2134,-0.44922
2135,-0.44323
2136,-0.43483999999999995
2137,-0.42838000000000004
2138,-0.41878999999999994
2139,-0.41016
2140,-0.40201
2141,-0.39697
2142,-0.39050999999999997
2143,-0.38189
2144,-0.3723
2145,-0.36488000000000004
2146,-0.35886999999999997
2147,-0.35264
2148,-0.34618000000000004
2149,-0.33755999999999997
2150,-0.32797
2151,-0.31935
2152,-0.31072
2153,-0.30545
2154,-0.29946
2155,-0.29323
2156,-0.28365
2157,-0.27502
2158,-0.26639
2159,-0.26232
2160,-0.25632
2161,-0.24889
2162,-0.24026999999999998
2163,-0.23069
2164,-0.22421999999999997
2165,-0.21823
2166,-0.21103000000000002
2167,-0.20240999999999998
2168,-0.19283
2169,-0.18636
2170,-0.17893
2171,-0.17293
2172,-0.16454000000000002
2173,-0.15592
2174,-0.14634
2175,-0.13987
2176,-0.13268
2177,-0.12236
2178,-0.11375
2179,-0.10415999999999999
2180,-0.0977
2181,-0.089074
2182,-0.080443
2183,-0.075417
2184,-0.069413
2185,-0.062951
2186,-0.054329999999999996
2187,-0.044744
2188,-0.036116
2189,-0.030126
2190,-0.02508
2191,-0.018619
2192,-0.0099982
2193,-0.0013722
2194,0.0082118
2195,0.016845
2196,0.023323
2197,0.028342000000000003
2198,0.033372000000000006
2199,0.042955
2200,0.051586
2201,0.061172000000000004
2202,0.0674
2203,0.073392
2204,0.08177999999999999
2205,0.090401
2206,0.096407
2207,0.09931
2208,0.10792
2209,0.1175
2210,0.12611
2211,0.1345
2212,0.13955
2213,0.14579
2214,0.15537
2215,0.16043
2216,0.16863
2217,0.17723
2218,0.18465
2219,0.19325
2220,0.20068
2221,0.20672
2222,0.21297
2223,0.22039
2224,0.22664
2225,0.23271
2226,0.24013
2227,0.24969
2228,0.25381
2229,0.25775
2230,0.26731
2231,0.27571999999999997
2232,0.28183
2233,0.29024
2234,0.29765
2235,0.30491999999999997
2236,0.31319
2237,0.32274
2238,0.32789
2239,0.3309
2240,0.33708
2241,0.34114
2242,0.34855
2243,0.3591
2244,0.36530999999999997
2245,0.36948000000000003
2246,0.37901
2247,0.38634
2248,0.39258000000000004
2249,0.4021
2250,0.40847
2251,0.41471
2252,0.41994
2253,0.42946000000000006
2254,0.43577
2255,0.441
2256,0.44943999999999995
2257,0.45895
2258,0.46312
2259,0.46942
2260,0.47362
2261,0.4789
2262,0.4884
2263,0.49473
2264,0.49896999999999997
2265,0.5032300000000001
2266,0.50644
2267,0.51073
2268,0.51505
2269,0.5193800000000001
2270,0.52374
2271,0.5270199999999999
2272,0.53141
2273,0.53582
2274,0.54025
2275,0.5351199999999999
2276,0.52791
2277,0.5291899999999999
2278,0.53161
2279,0.52332
2280,0.51617
2281,0.5079
2282,0.5049
2283,0.5074
2284,0.50351
2285,0.49527
2286,0.48703
2287,0.4788
2288,0.47263
2289,0.46441000000000004
2290,0.4562
2291,0.44771000000000005
2292,0.44101
2293,0.43573999999999996
2294,0.42751999999999996
2295,0.41815
2296,0.40993999999999997
2297,0.40174
2298,0.39559
2299,0.38915
2300,0.38242
2301,0.3751
2302,0.36691
2303,0.35754
2304,0.3514
2305,0.34321999999999997
2306,0.33504
2307,0.32828
2308,0.32066
2309,0.31335
2310,0.30603
2311,0.29929
2312,0.29285
2313,0.28348
2314,0.27734000000000003
2315,0.26915
2316,0.26271
2317,0.25597
2318,0.24865
2319,0.24045999999999998
2320,0.23315
2321,0.22496999999999998
2322,0.21616
2323,0.21059
2324,0.20240999999999998
2325,0.19627
2326,0.18809
2327,0.17874
2328,0.17057999999999998
2329,0.16327
2330,0.15649000000000002
2331,0.15004
2332,0.14187
2333,0.13252
2334,0.12437000000000001
2335,0.11672
2336,0.11317
2337,0.10586
2338,0.09769800000000001
2339,0.089542
2340,0.08139500000000001
2341,0.07409299999999999
2342,0.065956
2343,0.057823
2344,0.0497
2345,0.042033
2346,0.038433999999999996
2347,0.031137
2348,0.023007
2349,0.014886000000000002
2350,0.0067748
2351,-0.0025432
2352,-0.008617200000000002
2353,-0.016712
2354,-0.024797
2355,-0.032496
2356,-0.037351999999999996
2357,-0.043425
2358,-0.05151699999999999
2359,-0.060820000000000006
2360,-0.068898
2361,-0.07696900000000001
2362,-0.085031
2363,-0.089503
2364,-0.094403
2365,-0.10167999999999999
2366,-0.10975
2367,-0.11780999999999998
2368,-0.12508
2369,-0.13313
2370,-0.14117000000000002
2371,-0.15014
2372,-0.15585
2373,-0.1639
2374,-0.17117000000000002
2375,-0.17920999999999998
2376,-0.18771
2377,-0.19466
2378,-0.20317000000000002
2379,-0.2092
2380,-0.21693
2381,-0.22185
2382,-0.22991
2383,-0.23795999999999998
2384,-0.24399
2385,-0.25326
2386,-0.26129
2387,-0.26931
2388,-0.27731999999999996
2389,-0.28531999999999996
2390,-0.28907
2391,-0.29807
2392,-0.30608
2393,-0.31534
2394,-0.32334
2395,-0.32859
2396,-0.3356
2397,-0.34210999999999997
2398,-0.35011
2399,-0.35936
2400,-0.36535
2401,-0.37185999999999997
2402,-0.37888
2403,-0.38813000000000003
2404,-0.39611999999999997
2405,-0.4041
2406,-0.41134
2407,-0.41931
2408,-0.42853
2409,-0.4356
2410,-0.44211000000000006
2411,-0.44809
2412,-0.45732
2413,-0.46526999999999996
2414,-0.47179
2415,-0.47886000000000006
2416,-0.4861
2417,-0.49333
2418,-0.50129
2419,-0.50922
2420,-0.51631
2421,-0.5241
2422,-0.5300699999999999
2423,-0.53801
2424,-0.54594
2425,-0.55515
2426,-0.56306
2427,-0.56899
2428,-0.57612
2429,-0.58394
2430,-0.59185
2431,-0.5997600000000001
2432,-0.60895
2433,-0.6148600000000001
2434,-0.62274
2435,-0.63058
2436,-0.63774
2437,-0.64563
2438,-0.65154
2439,-0.66071
2440,-0.66857
2441,-0.67642
2442,-0.68557
2443,-0.69148
2444,-0.6973699999999999
2445,-0.70522
2446,-0.71306
2447,-0.7208899999999999
2448,-0.73002
2449,-0.73588
2450,-0.7436699999999999
2451,-0.75146
2452,-0.7599600000000001
2453,-0.76725
2454,-0.7744300000000001
2455,-0.7822100000000001
2456,-0.79132
2457,-0.79907
2458,-0.8063899999999999
2459,-0.81235
2460,-0.81818
2461,-0.82594
2462,-0.83504
2463,-0.84278
2464,-0.85051
2465,-0.85765
2466,-0.8650100000000001
2467,-0.87159
2468,-0.87931
2469,-0.88839
2470,-0.89417
2471,-0.90075
2472,-0.90812
2473,-0.91527
2474,-0.9229700000000001
2475,-0.93066
2476,-0.9378
2477,-0.94547
2478,-0.9531200000000001
2479,-0.96109
2480,-0.96852
2481,-0.9742700000000001
2482,-0.98193
2483,-0.99095
2484,-0.9966700000000001
2485,-1.0041
2486,-1.0083
2487,-1.0159
2488,-1.0236
2489,-1.0326
2490,-1.0402
2491,-1.0478
2492,-1.0535
2493,-1.061
2494,-1.0676
2495,-1.0766
2496,-1.0842
2497,-1.0912
2498,-1.0964
2499,-1.104
2500,-1.1125
2501,-1.12
2502,-1.129
2503,-1.1346
2504,-1.1427
2505,-1.1483
2506,-1.1559
2507,-1.1634
2508,-1.1705
2509,-1.178
2510,-1.1855
2511,-1.1944
2512,-1.202
2513,-1.2068
2514,-1.2143
2515,-1.2232
2516,-1.2306
2517,-1.2373
2518,-1.2449
2519,-1.252
2520,-1.2594
2521,-1.2683
2522,-1.2772
2523,-1.2849
2524,-1.2896
2525,-1.2971
2526,-1.3059
2527,-1.3133
2528,-1.32
2529,-1.3262
2530,-1.3328
2531,-1.3402
2532,-1.3491
2533,-1.3565
2534,-1.3646
2535,-1.369
2536,-1.376
2537,-1.3834
2538,-1.3907
2539,-1.3995
2540,-1.401
2541,-1.4088
2542,-1.4154
2543,-1.4242
2544,-1.4315
2545,-1.4388
2546,-1.4437
2547,-1.4515
2548,-1.4584
2549,-1.4657
2550,-1.4745
2551,-1.4799
2552,-1.4863
2553,-1.4941
2554,-1.5014
2555,-1.5102
2556,-1.5156
2557,-1.5228
2558,-1.5307
2559,-1.5389
2560,-1.5476
2561,-1.5573
2562,-1.5636
2563,-1.5709
2564,-1.5796
2565,-1.5868
2566,-1.5934
2567,-1.5998
2568,-1.6065
2569,-1.6152
2570,-1.6234
2571,-1.6295
2572,-1.6349
2573,-1.6436
2574,-1.6515
2575,-1.6579
2576,-1.6651
2577,-1.6738
2578,-1.6792
2579,-1.6845
2580,-1.6925
2581,-1.7007
2582,-1.7094
2583,-1.7143
2584,-1.7222
2585,-1.7324
2586,-1.7393
2587,-1.7473
2588,-1.7539
2589,-1.7608
2590,-1.7690000000000001
2591,-1.7769
2592,-1.7857
2593,-1.7926
2594,-1.7990000000000002
2595,-1.8072
2596,-1.8159
2597,-1.8223
2598,-1.8301
2599,-1.8356
2600,-1.8443
2601,-1.8515
2602,-1.8601
2603,-1.8681
2604,-1.8765
2605,-1.8819
2606,-1.8906
2607,-1.8977
2608,-1.9059
2609,-1.9121
2610,-1.9174
2611,-1.9245
2612,-1.9315
2613,-1.9401
2614,-1.9471
2615,-1.9523
2616,-1.9592
2617,-1.966
2618,-1.9726
2619,-1.9792
2620,-1.9877
2621,-1.9928
2622,-1.9996
2623,-2.0064
2624,-2.0131
2625,-2.0197
2626,-2.0247
2627,-2.0313
2628,-2.0378
2629,-2.0443
2630,-2.0507
2631,-2.057
2632,-2.0618
2633,-2.0698
2634,-2.0761
2635,-2.0822
2636,-2.0907
2637,-2.0976
2638,-2.104
2639,-2.1101
2640,-2.1161
2641,-2.1221
2642,-2.1266
2643,-2.1343
2644,-2.1401
2645,-2.1459
2646,-2.1516
2647,-2.1572
2648,-2.1614
2649,-2.1668
2650,-2.1723
2651,-2.1776
2652,-2.1829
2653,-2.1867
2654,-2.1946
2655,-2.2038
2656,-2.2096
2657,-2.2147
2658,-2.2184
2659,-2.2233
2660,-2.2281
2661,-2.2329
2662,-2.2396
2663,-2.2421
2664,-2.2454
2665,-2.2519
2666,-2.2562
2667,-2.2604
2668,-2.2645
2669,-2.2675
2670,-2.2714
2671,-2.2752
2672,-2.2789
2673,-2.2825
2674,-2.2838
2675,-2.2863
2676,-2.2895
2677,-2.2949
2678,-2.2979
2679,-2.3008
2680,-2.3029
2681,-2.3056
2682,-2.3082
2683,-2.3106
2684,-2.313
2685,-2.3146
2686,-2.3167
2687,-2.3246
2688,-2.3348
2689,-2.3367
2690,-2.3384
2691,-2.3396
2692,-2.3411
2693,-2.3425
2694,-2.3437
2695,-2.3447
2696,-2.3454
2697,-2.3463
2698,-2.3469
2699,-2.3475
2700,-2.3478
2701,-2.3480000000000003
2702,-2.3482
2703,-2.3482
2704,-2.3482
2705,-2.3482
2706,-2.3482
2707,-2.3505
2708,-2.3505
