time,value
0,-0.8888299999999999
1,-0.92132
2,-0.9385100000000001
3,-0.90645
4,-0.90522
5,-0.8729899999999999
6,-0.8802
7,-0.9381799999999999
8,-0.95775
9,-0.9582
10,-0.9606399999999999
11,-0.96547
12,-0.9689200000000001
13,-0.95957
14,-0.9738100000000001
15,-0.9397700000000001
16,-0.91669
17,-0.3079
18,2.0141
19,2.8424
20,2.6313
21,2.3743
22,2.0076
23,1.6465
24,0.93394
25,0.11039000000000002
26,-0.3779
27,-0.58682
28,-0.6941
29,-0.77489
30,-0.8775700000000001
31,-0.8779899999999999
32,-0.86375
33,-0.21731999999999999
34,1.008
35,1.534
36,1.5190000000000001
37,1.2162
38,0.76098
39,0.38831
40,0.19444
41,-0.03565
42,-0.36359
43,-0.58078
44,-0.6517
45,-0.61711
46,-0.43625
47,-0.33696
48,-0.33124000000000003
49,-0.36007
50,-0.46616
51,-0.56125
52,-0.50555
53,-0.41876
54,-0.42961000000000005
55,-0.47413
56,-0.40239
57,-0.1916
58,0.15843
59,0.6191399999999999
60,1.3741
61,1.7456
62,1.5158
63,1.374
64,1.1641
65,0.98372
66,0.59292
67,0.17933
68,-0.067101
69,-0.26011999999999996
70,-0.41158
71,-0.55188
72,-0.63935
73,-0.72319
74,-0.79907
75,-0.87645
76,-0.92529
77,-0.94358
78,-0.91866
79,-0.9302
80,-0.88797
81,-0.88799
82,-0.16038
83,0.94415
84,1.3436
85,1.4604
86,1.0933
87,0.3286
88,-0.21904
89,-0.37045
90,-0.38311
91,-0.41825
92,-0.37243000000000004
93,-0.40383
94,-0.52232
95,-0.78172
96,-0.13652999999999998
97,1.3361
98,1.6438
99,1.6983
100,1.3711
101,0.55848
102,-0.18930999999999998
103,-0.51785
104,-0.62487
105,-0.63664
106,-0.6532899999999999
107,-0.6729
108,-0.7036
109,-0.74062
110,-0.73912
111,-0.60948
112,-0.5352100000000001
113,-0.56543
114,-0.60512
115,-0.7137399999999999
116,-0.6641699999999999
117,-0.49858
118,0.31861
119,1.6019
120,1.8005
121,1.5379
122,1.1909999999999998
123,0.62867
124,0.0064247
125,-0.39135
126,-0.62421
127,-0.74656
128,-0.73088
129,-0.6997899999999999
130,-0.24706999999999998
131,0.70049
132,0.85198
133,0.61165
134,0.14556
135,-0.31175
136,-0.53413
137,-0.63236
138,-0.6452600000000001
139,-0.6711600000000001
140,-0.71331
141,-0.75994
142,-0.7531800000000001
143,-0.77063
144,-0.32526
145,0.8032
146,1.3148
147,1.5729
148,1.3994
149,0.6825899999999999
150,0.0058735
151,-0.34291
152,-0.47117
153,-0.49101999999999996
154,-0.48328999999999994
155,-0.4484
156,-0.46766
157,-0.39029
158,0.12183
159,2.4339
160,4.5913
161,4.6638
162,4.21
163,2.6965
164,0.8224
165,-0.2226
166,-0.58006
167,-0.7147899999999999
168,-0.78145
169,-0.78725
170,-0.72326
171,-0.67167
172,-0.6248600000000001
173,-0.49241
174,-0.26015
175,0.46723000000000003
176,0.5139199999999999
177,0.102
178,-0.18828
179,0.28873000000000004
180,1.0612
181,1.054
182,0.8859799999999999
183,0.39475
184,-0.1811
185,-0.56487
186,-0.68523
187,-0.73163
188,-0.73945
189,-0.70726
190,-0.6570600000000001
191,-0.58524
192,-0.503
193,-0.25795
194,0.51867
195,1.5806
196,2.0072
197,2.001
198,1.5365
199,0.57804
200,-0.1892
201,-0.46821
202,-0.53999
203,-0.57438
204,-0.63231
205,-0.63048
206,-0.59483
207,-0.5522600000000001
208,-0.47998
209,-0.44787
210,-0.48761000000000004
211,-0.38802
212,-0.11889000000000001
213,0.08093
214,0.44137
215,0.9839100000000001
216,1.4480000000000002
217,1.6348
218,1.5019999999999998
219,0.9066200000000001
220,0.30530999999999997
221,-0.032997000000000005
222,-0.22234
223,-0.33029000000000003
224,-0.361
225,-0.24586999999999998
226,-0.23943000000000003
227,0.07221699999999999
228,0.76775
229,1.3353
230,1.6559
231,1.6669999999999998
232,1.1559
233,0.29554
234,-0.32769000000000004
235,-0.59738
236,-0.69331
237,-0.7426
238,-0.7754300000000001
239,-0.79814
240,-0.7762100000000001
241,-0.7218100000000001
242,-0.58616
243,-0.45735
244,-0.2189
245,0.014325
246,-0.010648000000000001
247,-0.015088999999999998
248,-0.15034
249,-0.48886
250,-0.767
251,-0.63577
252,-0.39681
253,-0.35298
254,-0.26779000000000003
255,-0.1888
256,-0.25445
257,-0.43085
258,-0.69017
259,-0.88569
260,-0.9593299999999999
261,-0.9700799999999999
262,-0.9708200000000001
263,-0.9625600000000001
264,-0.89025
265,-0.7299100000000001
266,-0.6995399999999999
267,-0.77862
268,-0.8442799999999999
269,-0.89986
