time,value
0,1.1617
1,1.2276
2,1.1658
3,1.2468
4,1.2465
5,1.1523
6,1.1596
7,1.162
8,1.2492
9,1.1802
10,1.2505
11,1.2483
12,1.2529
13,1.2032
14,1.2533
15,1.2392
16,1.3113
17,1.2814
18,1.3528
19,1.3702
20,1.3888
21,1.4123
22,1.4311
23,1.4228
24,1.3935
25,1.4339
26,1.4447
27,1.4421
28,1.4265
29,1.4599
30,1.4724
31,1.4763
32,1.4397
33,1.4469999999999998
34,1.4459
35,1.4194
36,1.4240000000000002
37,1.3826
38,1.3561
39,1.3459
40,1.2373
41,1.222
42,0.9667100000000001
43,1.0031
44,0.92375
45,0.58933
46,0.38479
47,0.42512
48,0.16054000000000002
49,-0.14802
50,-0.24124
51,-0.27543
52,-0.36967
53,-0.2018
54,0.10869000000000001
55,0.16932
56,0.26975
57,0.47566
58,0.5438
59,0.6852199999999999
60,0.62866
61,0.42096000000000006
62,0.41006000000000004
63,0.52732
64,0.6277699999999999
65,0.63236
66,0.52573
67,0.48008999999999996
68,0.44506999999999997
69,0.51673
70,0.33299
71,0.13523
72,0.1692
73,0.22834000000000002
74,0.061944000000000006
75,-0.12647
76,0.12832000000000002
77,-0.028194
78,-0.1821
79,-0.10151
80,-0.13367
81,-0.096434
82,-0.068099
83,-0.15504
84,-0.146
85,-0.14211
86,-0.29281999999999997
87,-0.26628
88,-0.15522
89,-0.091656
90,-0.1727
91,0.04398
92,0.01225
93,0.010386
94,0.34495
95,0.4888
96,0.37818
97,0.079956
98,0.0092286
99,0.50734
100,0.30669
101,-0.017218
102,0.43927
103,0.07082000000000001
104,-0.08437
105,0.13519
106,0.21791
107,0.42786
108,0.5962
109,0.60278
110,0.61955
111,0.59868
112,0.50736
113,0.42375
114,0.30516
115,-0.068498
116,-0.014888
117,0.1754
118,0.10167000000000001
119,-0.41181999999999996
120,-0.44217
121,-0.23244
122,-0.26729
123,-0.16971
124,-0.13091
125,0.09283999999999999
126,0.59267
127,0.48212
128,-0.080465
129,0.17525
130,-0.23869
131,-0.46075
132,-0.34294
133,-0.3891
134,-0.46303
135,-0.44181000000000004
136,-0.41441000000000006
137,-0.37138000000000004
138,-0.26628
139,-0.6399199999999999
140,-0.40558
141,-0.21155
142,-0.4061
143,-0.28544
144,-0.07425599999999999
145,0.026124
146,-0.013441999999999999
147,-0.0057386
148,0.24120999999999998
149,0.44908000000000003
150,0.31901999999999997
151,0.10743
152,0.59048
153,0.44865
154,0.37009000000000003
155,1.148
156,0.15300999999999998
157,-0.9923299999999999
158,-0.27218000000000003
159,0.53279
160,0.34275
161,0.43992
162,0.54475
163,-0.050437
164,0.38126
165,0.43951
166,0.14049
167,0.30241
168,0.021941
169,-1.0448
170,-1.3929
171,-0.48025
172,-0.75988
173,-0.66988
174,-0.92137
175,-1.0705
176,-0.71395
177,-0.46246000000000004
178,-0.52272
179,-0.67478
180,-0.38039
181,-0.21744000000000002
182,-0.71314
183,-0.66333
184,-1.1572
185,-1.9213
186,-1.4057
187,-1.3793
188,-1.6434
189,-1.8063
190,-1.6842
191,-1.6528
192,-1.3825
193,-1.4632
194,-1.5978
195,-1.2433
196,-0.80453
197,-0.66871
198,-0.61582
199,0.028843
200,0.3656
201,0.58781
202,1.105
203,0.65985
204,0.39046
205,0.25659
206,0.237
207,-0.6127
208,-1.2873
209,-1.061
210,-2.3174
211,-2.1755
212,-2.1796
213,-2.8618
214,-2.3487
215,-1.9863
216,-1.7213
217,-1.499
218,-1.7289
219,-1.7016
220,-1.9142
221,-1.7317
222,-1.4837
223,-1.5041
224,-1.5271
225,-1.3979
226,-1.3578
227,-1.2179
228,-1.3087
229,-1.3304
230,-1.5041
231,-1.6829
232,-1.4984
233,-1.5578
234,-1.6156
235,-1.455
236,-1.6058
237,-1.7502
238,-1.7264
239,-1.5907
240,-1.7929
241,-1.7135
242,-1.9007
243,-1.5984
244,-1.8191
245,-1.8099
246,-1.5166
247,-1.432
248,-1.946
249,-1.4361
250,-1.008
251,-1.1014
252,-1.1059999999999999
253,-0.82806
254,-0.65269
255,-0.57833
256,-0.56166
257,-0.31466
258,-0.13360999999999998
259,-0.035162
260,-0.1128
261,-0.12326
262,0.053908000000000005
263,0.14747000000000002
264,0.23121
265,0.28407
266,0.39534
267,0.48701000000000005
268,0.34376999999999996
269,0.31494
270,0.40669
271,0.4905
272,0.5768300000000001
273,0.57844
274,0.57815
275,0.6693100000000001
276,0.8469899999999999
277,1.1537
278,1.3806
279,1.5533
280,1.5583
281,1.3455
282,1.1355
283,1.0129
284,1.0151
285,1.0173
286,1.016
287,1.0181
288,1.0168
289,1.0101
290,1.0939
291,1.0917
292,1.0924
293,1.1779
294,1.1012
295,1.1008
296,1.0977
297,1.1822
298,1.1846
299,1.1833
