time,value
0,1.8268
1,0.98525
2,-0.6977399999999999
3,-0.6977399999999999
4,-0.6977399999999999
5,-0.6977399999999999
6,-0.6977399999999999
7,-0.19284
8,1.8268
9,1.6585
10,0.48035
11,-0.6977399999999999
12,-0.6977399999999999
13,-0.6977399999999999
14,-0.6977399999999999
15,-0.19284
16,1.9951
17,1.4902
18,-0.36114
19,-0.6977399999999999
20,-0.6977399999999999
21,-0.6977399999999999
22,-0.6977399999999999
23,-0.024544
24,1.9951
25,1.3219
26,-0.6977399999999999
27,-0.6977399999999999
28,-0.6977399999999999
29,-0.6977399999999999
30,-0.6977399999999999
31,-0.36114
32,1.8268
33,1.6585
34,-0.6977399999999999
35,-0.6977399999999999
36,-0.6977399999999999
37,-0.6977399999999999
38,-0.6977399999999999
39,-0.024544
40,1.8268
41,1.4902
42,-0.36114
43,-0.6977399999999999
44,-0.6977399999999999
45,-0.6977399999999999
46,-0.6977399999999999
47,-0.6977399999999999
48,1.9951
49,1.6585
50,-0.024544
51,-0.6977399999999999
52,-0.6977399999999999
53,-0.6977399999999999
54,-0.6977399999999999
55,1.3219
56,1.8268
57,0.64865
58,-0.6977399999999999
59,-0.6977399999999999
60,-0.6977399999999999
61,-0.6977399999999999
62,-0.6977399999999999
63,1.4902
64,1.6585
65,0.31206
66,-0.6977399999999999
67,-0.6977399999999999
68,-0.6977399999999999
69,-0.6977399999999999
70,-0.6977399999999999
71,1.1536
72,1.6585
73,0.81695
74,-0.6977399999999999
75,-0.6977399999999999
76,-0.6977399999999999
77,-0.6977399999999999
78,-0.6977399999999999
79,-0.024544
80,1.8268
81,1.3219
82,-0.6977399999999999
83,-0.6977399999999999
84,-0.6977399999999999
85,-0.6977399999999999
86,-0.6977399999999999
87,0.48035
88,1.8268
89,1.3219
90,-0.6977399999999999
91,-0.6977399999999999
92,-0.6977399999999999
93,-0.6977399999999999
94,-0.6977399999999999
95,-0.36114
