time,value
0,1.0584
1,0.9165200000000001
2,1.0902
3,1.1888
4,1.2138
5,1.1914
6,1.1677
7,1.1954
8,1.1062
9,1.1751
10,0.94078
11,1.0774
12,1.0236
13,0.9807899999999999
14,1.0694
15,1.0852
16,0.9428799999999999
17,0.95334
18,0.8474
19,0.8593799999999999
20,0.8805
21,0.95376
22,0.94294
23,0.86275
24,0.82834
25,0.88146
26,0.77877
27,0.57224
28,0.5394100000000001
29,0.18928
30,-0.29684
31,-0.45047
32,-0.58122
33,-0.82345
34,-0.9456600000000001
35,-1.1119
36,-1.4502
37,-1.4946
38,-1.5908
39,-1.9469999999999998
40,-1.9821
41,-1.9445
42,-1.8808
43,-1.6619
44,-1.6074
45,-1.4924
46,-1.3894
47,-0.78288
48,-0.9247
49,-0.8680100000000001
50,-0.6711
51,-0.71621
52,-0.75202
53,-0.37842
54,-0.32792
55,0.02017
56,0.12307
57,0.099754
58,0.53828
59,0.73237
60,0.8324299999999999
61,0.80218
62,1.124
63,1.4511
64,1.5243
65,1.193
66,1.0849
67,0.85411
68,0.84211
69,0.64827
70,0.54378
71,0.73897
72,0.48855
73,0.69206
74,0.9812700000000001
75,0.69595
76,0.7119800000000001
77,0.43965
78,0.26264
79,0.22465
80,0.29439
81,0.20372
82,0.40836999999999996
83,0.32206999999999997
84,0.44778999999999997
85,0.48948
86,0.46861
87,0.67072
88,0.46138
89,0.52552
90,0.6846399999999999
91,0.52888
92,0.66592
93,0.76642
94,0.77169
95,0.8412200000000001
96,0.69567
97,0.76312
98,0.7892399999999999
99,0.69923
100,0.7477600000000001
101,0.70339
102,0.7689
103,0.63981
104,0.61905
105,0.78955
106,0.80609
107,0.89789
108,1.1056
109,1.0259
110,1.192
111,1.1908
112,1.1688
113,1.1174
114,1.2056
115,1.2797
116,1.3712
117,1.5588
118,1.1655
119,1.2889
120,1.3172
121,1.1215
122,1.1988
123,1.2738
124,1.1308
125,0.9875700000000001
126,0.89899
127,0.22866999999999998
128,0.51057
129,0.27045
130,-0.94985
131,-0.85864
132,-1.9874
133,-3.8284
134,-3.6546
135,-3.2551
136,-4.3882
137,-3.8809
138,-2.9057
139,-3.0249
140,-2.9197
141,-1.7802
142,-1.2039
143,-1.159
144,0.36067
145,-2.6582
146,-4.6645
147,-3.5381
148,-2.3245
149,-1.0662
150,-0.35828000000000004
151,0.17165999999999998
152,0.11846
153,0.30108
154,0.54267
155,0.8422
156,1.5781
157,0.72275
158,-0.14418
159,-0.11384000000000001
160,0.093348
161,0.41681
162,0.96883
163,1.2590000000000001
164,1.1513
165,1.1748
166,1.068
167,0.6823600000000001
168,0.34289000000000003
169,-0.12949000000000002
170,-0.41944
171,-0.21474000000000001
172,-0.22305
173,-0.20046
174,-0.20005
175,-0.20918
176,-0.33454
177,-0.34337
178,-0.37984
179,-0.37248000000000003
180,-0.32131
181,-0.21266999999999997
182,-0.24264000000000002
183,-0.14240999999999998
184,0.062718
185,0.24450999999999998
186,0.27738
187,0.2158
188,0.18145999999999998
189,0.15114
190,0.14967
191,0.075259
192,-0.088762
193,-0.064623
194,-0.048247000000000005
195,-0.055635000000000004
196,-0.042323
197,0.09892100000000001
198,0.012866999999999998
199,-0.18165
200,-0.038613
201,0.15995
202,0.16421
203,0.05637
204,0.053914
205,0.015622
206,-0.15687
207,-0.12758
208,-0.15835
209,-0.175
210,-0.18058
211,-0.12336
212,-0.16697
213,-0.024484
214,-0.18561
215,-0.24181999999999998
216,-0.24178000000000002
217,-0.23364000000000001
218,-0.072045
219,0.032149000000000004
220,-0.090572
221,-0.060574
222,0.012899
223,-0.073804
224,-0.042819
225,-0.11016
226,-0.18692
227,-0.18972999999999998
228,-0.20005
229,-0.21314
230,-0.21333000000000002
231,-0.050628
232,-0.12114000000000001
233,-0.2346
234,-0.23671
235,-0.18675
236,-0.26649
237,-0.10339000000000001
238,-0.16378
239,-0.13815999999999998
240,-0.30979
241,-0.14812999999999998
242,-0.3137
243,-0.11075
244,-0.099766
245,-0.10890999999999999
246,-0.11045
247,-0.1135
248,-0.11152999999999999
249,-0.12532000000000001
250,-0.12093
251,-0.32091
252,-0.31116
253,-0.29479
254,-0.31937
255,-0.32893
256,-0.3203
257,-0.30309
258,-0.11155
259,-0.082307
260,-0.27347
261,-0.30357
262,-0.31205
263,-0.30831
264,-0.31142
265,-0.33196
266,-0.14995
267,-0.14225
268,-0.059441999999999995
269,-0.05248099999999999
270,-0.12816
271,-0.13201
272,-0.12896
273,-0.12821
274,-0.32128
275,-0.12555999999999998
276,-0.13083
277,-0.22641
278,-0.34449
279,-0.35272
280,-0.34674
281,-0.22300999999999999
282,-0.15658
283,-0.22714
284,-0.35408
285,-0.34914
286,-0.35201
287,-0.34725
288,-0.30394
289,-0.16763
290,-0.13577
291,0.025794
292,0.027842000000000002
293,0.041595
294,-0.15977
295,-0.1794
296,-0.36559
297,-0.37198000000000003
298,-0.37636
299,-0.17825
