time,value
0,-0.28611
1,-0.28611
2,-0.28611
3,-0.28611
4,-0.28611
5,-0.28611
6,-0.28611
7,-0.28611
8,-0.28611
9,-0.28611
10,-0.28611
11,-0.28611
12,-0.28611
13,-0.28611
14,-0.28611
15,-0.28611
16,-0.28611
17,-0.28611
18,-0.28611
19,-0.28611
20,-0.28611
21,-0.28611
22,-0.28611
23,-0.28611
24,-0.28611
25,-0.28611
26,-0.28611
27,-0.28611
28,-0.28611
29,-0.28611
30,-0.28611
31,-0.28611
32,-0.28611
33,-0.28611
34,-0.28611
35,-0.28611
36,-0.28611
37,-0.28611
38,-0.28611
39,-0.28611
40,-0.17897000000000002
41,4.8664
42,1.6716
43,-0.12053
44,-0.13027
45,0.9606100000000001
46,4.8469
47,-0.28611
48,-0.28611
49,-0.28611
50,-0.28611
51,-0.28611
52,-0.28611
53,-0.28611
54,-0.28611
55,-0.28611
56,-0.28611
57,-0.28611
58,-0.28611
59,-0.28611
60,-0.28611
61,-0.28611
62,-0.28611
63,-0.28611
64,-0.28611
65,-0.28611
66,-0.28611
67,-0.28611
68,-0.28611
69,-0.28611
70,-0.28611
71,-0.28611
72,-0.28611
73,-0.28611
74,-0.28611
75,-0.28611
76,0.49309
77,4.3307
78,1.1554
79,-0.11079000000000001
80,-0.14001
81,3.0645
82,2.7528
83,-0.28611
84,-0.28611
85,-0.28611
86,-0.28611
87,-0.28611
88,-0.28611
89,-0.28611
90,-0.28611
91,-0.28611
92,-0.28611
93,-0.28611
94,-0.28611
95,-0.28611
