time,value
0,-0.13492
1,-0.13492
2,-0.13492
3,-0.13492
4,-0.13492
5,-0.13492
6,-0.13492
7,-0.13492
8,-0.13492
9,-0.13492
10,-0.13492
11,-0.13492
12,-0.13492
13,-0.13492
14,-0.13492
15,-0.13492
16,-0.13492
17,-0.13492
18,-0.13492
19,-0.13492
20,-0.13492
21,-0.13492
22,-0.13492
23,-0.13492
24,-0.13492
25,-0.13492
26,-0.13492
27,-0.13492
28,-0.13492
29,-0.13492
30,-0.13492
31,-0.13492
32,-0.13492
33,-0.13492
34,-0.13492
35,-0.13492
36,-0.13492
37,-0.13492
38,-0.13492
39,-0.13492
40,-0.13492
41,-0.13492
42,-0.13492
43,-0.13492
44,-0.13492
45,-0.13492
46,-0.13492
47,-0.13492
48,-0.13492
49,-0.13492
50,-0.13492
51,-0.13492
52,-0.13492
53,-0.13492
54,-0.13492
55,-0.13492
56,-0.13492
57,-0.13492
58,-0.13492
59,-0.13492
60,-0.13492
61,-0.13492
62,-0.13492
63,-0.13492
64,-0.13492
65,-0.13492
66,-0.13492
67,-0.13492
68,-0.13492
69,-0.13492
70,-0.13492
71,-0.13492
72,-0.13492
73,-0.13492
74,-0.09543
75,9.5594
76,0.69433
77,0.6745899999999999
78,0.95101
79,0.35868
80,-0.13492
81,-0.13492
82,-0.13492
83,-0.13492
84,-0.13492
85,-0.13492
86,-0.13492
87,-0.13492
88,-0.13492
89,-0.13492
90,-0.13492
91,-0.13492
92,-0.13492
93,-0.13492
94,-0.13492
95,-0.13492
