time,value
0,1.6706
1,1.6559
2,1.6101
3,1.5259
4,1.4407
5,1.3562
6,1.2719
7,1.1877
8,1.1025
9,1.0196
10,0.93574
11,0.85206
12,0.76715
13,0.68521
14,0.60196
15,0.51942
16,0.43846
17,0.35622
18,0.27375
19,0.19027
20,0.10889000000000001
21,0.026284
22,-0.055478
23,-0.13565
24,-0.21853000000000003
25,-0.29769
26,-0.37984
27,-0.45769
28,-0.53885
29,-0.61948
30,-0.69949
31,-0.77875
32,-0.85711
33,-0.93435
34,-1.0102
35,-1.0773
36,-1.1486
37,-1.2169
38,-1.2813
39,-1.339
40,-1.3822
41,-1.4251
42,-1.4572
43,-1.4763
44,-1.4804
45,-1.4696
46,-1.4447
47,-1.4076
48,-1.3606
49,-1.3057
50,-1.2448
51,-1.1794
52,-1.1104
53,-1.0387
54,-0.96475
55,-0.88915
56,-0.81218
57,-0.73411
58,-0.65512
59,-0.5753699999999999
60,-0.49499
61,-0.41408999999999996
62,-0.33273
63,-0.26744
64,-0.18867
65,-0.10603
66,-0.026212
67,0.056997000000000006
68,0.14038
69,0.22019
70,0.30259
71,0.38425
72,0.4684
73,0.5505399999999999
74,0.6329600000000001
75,0.71745
76,0.80199
77,0.88307
78,0.9664200000000001
79,1.0491
80,1.1324
81,1.2147
82,1.2975
83,1.3818
84,1.4657
85,1.5493
86,1.6338
87,1.6986
88,1.6972
89,1.6897
90,1.6117
91,1.5285
92,1.4449
93,1.3597
94,1.2745
95,1.1902
96,1.1052
97,1.0225
98,0.9389799999999999
99,0.8556299999999999
100,0.7711600000000001
101,0.68939
102,0.60525
103,0.52359
104,0.44258000000000003
105,0.36098
106,0.2792
107,0.19875
108,0.11675
109,0.035586
110,-0.046987
111,-0.12995
112,-0.20929
113,-0.2916
114,-0.37358
115,-0.45519
116,-0.53635
117,-0.617
118,-0.69703
119,-0.77633
120,-0.85472
121,-0.9319799999999999
122,-1.0079
123,-1.082
124,-1.1540000000000001
125,-1.2231
126,-1.2884
127,-1.3487
128,-1.4025
129,-1.4477
130,-1.4817
131,-1.5019999999999998
132,-1.4937
133,-1.4832
134,-1.4581
135,-1.4178
136,-1.3621
137,-1.3075
138,-1.2378
139,-1.1732
140,-1.105
141,-1.0339
142,-0.96057
143,-0.8854799999999999
144,-0.80895
145,-0.73126
146,-0.64755
147,-0.5635100000000001
148,-0.48394
149,-0.40813
150,-0.3272
151,-0.24584
152,-0.16782
153,-0.09239
154,-0.012776000000000001
155,0.070333
156,0.1565
157,0.23984
158,0.31805
159,0.39705999999999997
160,0.4738
161,0.55592
162,0.63985
163,0.72446
164,0.8074899999999999
165,0.88999
166,0.97185
167,1.0553
168,1.1381
169,1.2229
170,1.3073
171,1.3918
172,1.4613
173,1.5459
174,1.6299
175,1.671
