time,value
0,-0.23535
1,-0.23535
2,-0.23535
3,-0.23535
4,-0.23535
5,-0.23535
6,-0.23535
7,-0.23535
8,-0.23535
9,-0.23535
10,-0.23535
11,-0.23535
12,-0.23535
13,-0.23535
14,-0.23535
15,-0.23535
16,-0.23535
17,-0.23535
18,-0.23535
19,-0.23535
20,-0.23535
21,-0.23535
22,-0.23535
23,-0.23535
24,-0.23535
25,-0.23535
26,-0.23535
27,-0.23535
28,-0.23535
29,-0.23535
30,-0.23535
31,-0.23535
32,-0.23535
33,-0.23535
34,-0.23535
35,-0.23535
36,-0.23535
37,-0.23535
38,2.5779
39,4.6186
40,2.0532
41,4.6186
42,-0.0021257
43,-0.0021257
44,0.85788
45,5.9888
46,-0.23535
47,-0.23535
48,-0.23535
49,-0.23535
50,-0.23535
51,-0.23535
52,-0.23535
53,-0.23535
54,-0.23535
55,-0.23535
56,-0.23535
57,-0.23535
58,-0.23535
59,-0.23535
60,-0.23535
61,-0.23535
62,-0.23535
63,-0.23535
64,-0.23535
65,-0.23535
66,-0.23535
67,-0.23535
68,-0.23535
69,-0.23535
70,-0.23535
71,-0.23535
72,-0.23535
73,-0.23535
74,-0.23535
75,-0.23535
76,-0.23535
77,-0.23535
78,-0.23535
79,-0.23535
80,-0.23535
81,-0.23535
82,-0.23535
83,-0.23535
84,-0.23535
85,-0.23535
86,-0.23535
87,-0.23535
88,-0.23535
89,-0.23535
90,-0.23535
91,-0.23535
92,-0.23535
93,-0.23535
94,-0.23535
95,-0.23535
