time,value
0,1.7992
1,1.7561
2,1.663
3,1.5692
4,1.4619
5,1.3530000000000002
6,1.245
7,1.1371
8,1.03
9,0.92406
10,0.81803
11,0.7139
12,0.60951
13,0.50612
14,0.40599
15,0.30346999999999996
16,0.20382
17,0.11520999999999999
18,0.016502
19,-0.07891799999999999
20,-0.16378
21,-0.25985
22,-0.33956
23,-0.43333999999999995
24,-0.5254
25,-0.6103
26,-0.69665
27,-0.7712100000000001
28,-0.8497
29,-0.9255200000000001
30,-0.9901
31,-1.0595
32,-1.1186
33,-1.1736
34,-1.2235
35,-1.2605
36,-1.2976
37,-1.3265
38,-1.3416
39,-1.355
40,-1.3691
41,-1.3527
42,-1.348
43,-1.331
44,-1.2908
45,-1.2624
46,-1.2273
47,-1.1642
48,-1.111
49,-1.0655
50,-0.99611
51,-0.92235
52,-0.86295
53,-0.78537
54,-0.72178
55,-0.6443399999999999
56,-0.56405
57,-0.49073
58,-0.41458
59,-0.33588
60,-0.2634
61,-0.18175
62,-0.10772999999999999
63,-0.025906000000000002
64,0.055254
65,0.12453
66,0.21534
67,0.28345
68,0.36613
69,0.44627
70,0.52036
71,0.59731
72,0.66569
73,0.7411399999999999
74,0.80557
75,0.8516799999999999
76,0.89023
77,0.9321
78,0.98477
79,1.0628
80,1.1618
81,1.2641
82,1.361
83,1.4668
84,1.5582
85,1.6101
86,1.6318
87,1.6304
88,1.6248
89,1.5873
90,1.4869999999999999
91,1.3803
92,1.2715
93,1.1713
94,1.0728
95,0.98535
96,0.90827
97,0.8608299999999999
98,0.83006
99,0.78171
100,0.74317
101,0.6862199999999999
102,0.6129899999999999
103,0.54761
104,0.46953
105,0.39476
106,0.32142
107,0.24511999999999998
108,0.15825
109,0.081915
110,-0.0025866
111,-0.06711
112,-0.1476
113,-0.23394
114,-0.31006
115,-0.39221999999999996
116,-0.47207
117,-0.54937
118,-0.62474
119,-0.70672
120,-0.77573
121,-0.8620399999999999
122,-0.9237299999999999
123,-0.992
124,-1.0558
125,-1.1266
126,-1.1801
127,-1.2275
128,-1.2714
129,-1.3123
130,-1.3491
131,-1.3709
132,-1.4061
133,-1.4136
134,-1.4122
135,-1.4074
136,-1.3931
137,-1.3613
138,-1.3373
139,-1.2936
140,-1.2477
141,-1.2037
142,-1.1372
143,-1.0698
144,-1.0052
145,-0.93665
146,-0.8590399999999999
147,-0.77978
148,-0.69687
149,-0.61302
150,-0.5350600000000001
151,-0.44017
152,-0.34723000000000004
153,-0.25495
154,-0.15736
155,-0.060412
156,0.037685
157,0.13914
158,0.23981
159,0.33869
160,0.43942
161,0.53932
162,0.6426
163,0.74541
164,0.8370200000000001
165,0.94252
166,1.0489
167,1.1572
168,1.2641
169,1.374
170,1.4809999999999999
171,1.5752
172,1.6799
173,1.7627
174,1.8117
175,1.8259
