time,value
0,0.71583
1,0.71583
2,0.96978
3,0.76662
4,0.76662
5,0.66504
6,0.66504
7,0.8174100000000001
8,0.8174100000000001
9,0.8174100000000001
10,0.8174100000000001
11,0.76662
12,0.91899
13,0.71583
14,0.71583
15,0.71583
16,0.66504
17,0.66504
18,-0.5031399999999999
19,-1.5697
20,-1.4682
21,-1.5697
22,-1.6205
23,-1.5697
24,-1.5697
25,-1.6205
26,-1.5697
27,-1.6205
28,-1.5697
29,-1.6205
30,-1.5697
31,-1.6205
32,-1.4682
33,-1.4682
34,-1.4682
35,-1.5697
36,-1.5697
37,-1.5697
38,-1.5697
39,-1.5697
40,-1.5190000000000001
41,-1.6205
42,-1.5697
43,-1.6205
44,-1.5697
45,-1.5190000000000001
46,-0.14761
47,0.5634600000000001
48,0.5634600000000001
49,0.61425
50,0.51267
51,0.51267
52,0.46188
53,0.51267
54,0.46188
55,0.5634600000000001
56,0.66504
57,0.46188
58,0.46188
59,0.46188
60,0.51267
61,0.46188
62,0.46188
63,0.61425
64,0.46188
65,0.46188
66,0.46188
67,0.41108999999999996
68,0.46188
69,0.46188
70,0.41108999999999996
71,0.51267
72,0.46188
73,0.71583
74,0.66504
75,0.71583
76,0.66504
77,0.66504
78,0.71583
79,0.66504
80,0.66504
81,0.71583
82,0.66504
83,0.66504
84,0.71583
85,0.66504
86,0.71583
87,0.66504
88,0.71583
89,0.66504
90,0.8174100000000001
91,0.71583
92,0.66504
93,0.8174100000000001
94,0.71583
95,0.8174100000000001
