time,value
0,-2.2078
1,-2.2078
2,-2.2078
3,-2.2078
4,-2.2078
5,-2.2078
6,-2.2078
7,-2.2078
8,-2.2078
9,-2.2107
10,-2.2077
11,-2.2103
12,-2.2099
13,-2.2095
14,-2.2089
15,-2.2084
16,-2.2076
17,-2.2067
18,-2.2057
19,-2.2045
20,-2.2033
21,-2.2024
22,-2.2009
23,-2.1994
24,-2.1977
25,-2.1959
26,-2.1975
27,-2.2052
28,-2.2135
29,-2.2115
30,-2.2093
31,-2.207
32,-2.2055
33,-2.2030000000000003
34,-2.2004
35,-2.1978
36,-2.195
37,-2.1921
38,-2.1902
39,-2.1871
40,-2.184
41,-2.1808
42,-2.1801
43,-2.1766
44,-2.1743
45,-2.1707
46,-2.167
47,-2.1633
48,-2.1594
49,-2.1568
50,-2.1528
51,-2.1487
52,-2.1445
53,-2.1403
54,-2.136
55,-2.133
56,-2.1301
57,-2.1286
58,-2.1271
59,-2.124
60,-2.1194
61,-2.1194
62,-2.1179
63,-2.1156
64,-2.1132
65,-2.1106
66,-2.108
67,-2.1069999999999998
68,-2.1019
69,-2.1019
70,-2.1025
71,-2.1013
72,-2.0978
73,-2.0925
74,-2.0871
75,-2.0817
76,-2.0762
77,-2.0707
78,-2.0669999999999997
79,-2.0614
80,-2.0557
81,-2.0499
82,-2.0442
83,-2.0383
84,-2.0344
85,-2.0285
86,-2.0225
87,-2.0165
88,-2.0105
89,-2.0064
90,-2.0003
91,-1.9941
92,-1.9879
93,-1.9817
94,-1.9754
95,-1.9711
96,-1.9648
97,-1.9584
98,-1.952
99,-1.9455
100,-1.939
101,-1.9346
102,-1.9281
103,-1.9215
104,-1.9167
105,-1.91
106,-1.9033
107,-1.8988
108,-1.8903
109,-1.8835
110,-1.8767
111,-1.8699
112,-1.8653
113,-1.8584
114,-1.8515
115,-1.8452
116,-1.8378
117,-1.8303
118,-1.8258
119,-1.8189
120,-1.8102
121,-1.8033
122,-1.7963
123,-1.7913
124,-1.7856
125,-1.7799
126,-1.7730000000000001
127,-1.766
128,-1.7574
129,-1.7504
130,-1.7457
131,-1.7407
132,-1.7334
133,-1.7271
134,-1.7201
135,-1.7154
136,-1.7084
137,-1.6998
138,-1.6927
139,-1.6856
140,-1.6786
141,-1.6746
142,-1.6674
143,-1.6641
144,-1.6554
145,-1.6483
146,-1.6412
147,-1.6365
148,-1.6294
149,-1.6222
150,-1.6151
151,-1.6079
152,-1.5991
153,-1.5943
154,-1.5871
155,-1.5799
156,-1.5726
157,-1.5654
158,-1.5605
159,-1.5532
160,-1.5453
161,-1.5384
162,-1.5329
163,-1.5256
164,-1.5207
165,-1.5119
166,-1.5046
167,-1.4958
168,-1.4913
169,-1.4843
170,-1.4795
171,-1.4722
172,-1.4633
173,-1.456
174,-1.4487
175,-1.4433
176,-1.4378
177,-1.4348
178,-1.426
179,-1.4187
180,-1.4099
181,-1.405
182,-1.3976
183,-1.3922
184,-1.3853
185,-1.3798
186,-1.3725
187,-1.3676
188,-1.3603
189,-1.3515
190,-1.3441
191,-1.3367
192,-1.3293
193,-1.3244
194,-1.3176
195,-1.3132
196,-1.3068
197,-1.2994
198,-1.2906
199,-1.2856
200,-1.2782
201,-1.2704
202,-1.2635
203,-1.2581
204,-1.2532
205,-1.2458
206,-1.2384
207,-1.2296
208,-1.2222
209,-1.2153
210,-1.2124
211,-1.207
212,-1.1997
213,-1.1923
214,-1.1834
215,-1.176
216,-1.171
217,-1.1636
218,-1.1561
219,-1.1487
220,-1.1412
221,-1.1362
222,-1.1284
223,-1.1217
224,-1.1164
225,-1.1089
226,-1.1014
227,-1.0965
228,-1.0876
229,-1.0801
230,-1.0726
231,-1.0651
232,-1.0573
233,-1.0545
234,-1.0478
235,-1.0403
236,-1.0328
237,-1.0253
238,-1.0164
239,-1.0114
240,-1.0038
241,-0.99631
242,-0.98877
243,-0.98121
244,-0.9761700000000001
245,-0.9686
246,-0.96201
247,-0.9592799999999999
248,-0.9517200000000001
249,-0.9428
250,-0.93776
251,-0.92884
252,-0.9212600000000001
253,-0.9136799999999999
254,-0.90609
255,-0.89849
256,-0.8934200000000001
257,-0.88581
258,-0.8781899999999999
259,-0.87056
260,-0.86292
261,-0.8539700000000001
262,-0.8488700000000001
263,-0.8412200000000001
264,-0.8335600000000001
265,-0.82589
266,-0.81822
267,-0.8131
268,-0.8054100000000001
269,-0.79772
270,-0.7926
271,-0.7861899999999999
272,-0.7785
273,-0.7733800000000001
274,-0.7657
275,-0.7580100000000001
276,-0.75032
277,-0.74134
278,-0.73364
279,-0.7285
280,-0.72078
281,-0.71306
282,-0.70533
283,-0.69899
284,-0.6926399999999999
285,-0.6888
286,-0.68109
287,-0.67337
288,-0.66565
289,-0.65792
290,-0.65276
291,-0.6450199999999999
292,-0.63603
293,-0.6282800000000001
294,-0.62052
295,-0.6127600000000001
296,-0.60758
297,-0.5998100000000001
298,-0.5920300000000001
299,-0.58424
300,-0.57645
301,-0.56866
302,-0.56745
303,-0.56123
304,-0.5523899999999999
305,-0.54462
306,-0.53683
307,-0.52783
308,-0.52264
309,-0.51503
310,-0.50879
311,-0.50117
312,-0.49338999999999994
313,-0.4882
314,-0.48041999999999996
315,-0.47263
316,-0.46483
317,-0.45583
318,-0.44802
319,-0.44282
320,-0.435
321,-0.42718
322,-0.4184
323,-0.41481
324,-0.40581
325,-0.40060999999999997
326,-0.3928
327,-0.38498000000000004
328,-0.37716
329,-0.36934
330,-0.36151
331,-0.35629
332,-0.34845
333,-0.3406
334,-0.33276
335,-0.3249
336,-0.3185
337,-0.3118
338,-0.30278
339,-0.29491999999999996
340,-0.28704
341,-0.28031
342,-0.27505
343,-0.26716999999999996
344,-0.25927
345,-0.25138
346,-0.24235
347,-0.23445
348,-0.22918000000000002
349,-0.22127
350,-0.21336
351,-0.20544
352,-0.19752
353,-0.19222999999999998
354,-0.1843
355,-0.17834
356,-0.175
357,-0.16597
358,-0.15805999999999998
359,-0.15167
360,-0.14375
361,-0.13582
362,-0.12832000000000002
363,-0.12498
364,-0.12011
365,-0.11484000000000001
366,-0.10692
367,-0.099008
368,-0.089977
369,-0.082057
370,-0.074132
371,-0.068847
372,-0.060916
373,-0.05496
374,-0.051627
375,-0.042597
376,-0.037318000000000004
377,-0.028287
378,-0.020365
379,-0.012439
380,-0.0064732
381,-0.0004902
382,0.0032648000000000004
383,0.011177
384,0.019093000000000002
385,0.028125
386,0.036045
387,0.042435
388,0.044661
389,0.05065
390,0.057042999999999996
391,0.064952
392,0.072866
393,0.08078300000000001
394,0.086062
395,0.093985
396,0.10191
397,0.10985
398,0.11778
399,0.12307
400,0.13101
401,0.13896
402,0.1469
403,0.15486
404,0.16016
405,0.16016
406,0.16546
407,0.17342
408,0.17715999999999998
409,0.17715999999999998
410,0.17715999999999998
411,0.17932
412,0.18523
413,0.18850999999999998
414,0.19180999999999998
415,0.19513
416,0.20153
417,0.20792
418,0.21584
419,0.21916999999999998
420,0.22516
421,0.22854000000000002
422,0.2308
423,0.23421
424,0.2406
425,0.24849000000000002
426,0.25638
427,0.26427
428,0.27066999999999997
429,0.27856
430,0.28646
431,0.29436999999999997
432,0.30227
433,0.31018
434,0.31546
435,0.32145
436,0.32746
437,0.33385
438,0.34175
439,0.34965999999999997
440,0.35493
441,0.36396
442,0.37187
443,0.37979
444,0.38771
445,0.39257
446,0.39855999999999997
447,0.40383
448,0.41286000000000006
449,0.42189
450,0.42981
451,0.43509
452,0.44301
453,0.45093
454,0.45886000000000005
455,0.46679
456,0.47472
457,0.48001000000000005
458,0.48795
459,0.49481
460,0.50167
461,0.50697
462,0.50481
463,0.50531
464,0.50955
465,0.51646
466,0.51965
467,0.51648
468,0.5143800000000001
469,0.5112399999999999
470,0.50812
471,0.50503
472,0.50195
473,0.49888000000000005
474,0.49686
475,0.49383
476,0.49082
477,0.48513999999999996
478,0.47608999999999996
479,0.46703999999999996
480,0.46505
481,0.46208999999999995
482,0.45646000000000003
483,0.45353000000000004
484,0.45158999999999994
485,0.44523
486,0.43715
487,0.42906000000000005
488,0.42098
489,0.41192
490,0.40384000000000003
491,0.39846
492,0.39038
493,0.38573
494,0.38011999999999996
495,0.37549
496,0.3674
497,0.36201
498,0.35295
499,0.34486999999999995
500,0.33582
501,0.33291
502,0.32731
503,0.32192
504,0.31285999999999997
505,0.30554000000000003
506,0.29996999999999996
507,0.29536999999999997
508,0.28997
509,0.28186
510,0.27281
511,0.2647
512,0.2566
513,0.2566
514,0.25390999999999997
515,0.25121
516,0.24311
517,0.23501999999999998
518,0.22963000000000003
519,0.22693000000000002
520,0.22693000000000002
521,0.21788000000000002
522,0.20881999999999998
523,0.20074
524,0.19265
525,0.18457
526,0.17919000000000002
527,0.17110999999999998
528,0.16842000000000001
529,0.16646
530,0.16085
531,0.15891
532,0.15603
533,0.15316
534,0.14506
535,0.136
536,0.13045
537,0.12855999999999998
538,0.12127
539,0.11220999999999999
540,0.10409000000000002
541,0.10128
542,0.095778
543,0.09214299999999999
544,0.084012
545,0.07588500000000001
546,0.066825
547,0.058702
548,0.053285
549,0.048711000000000004
550,0.04593
551,0.041372000000000006
552,0.033238
553,0.025103
554,0.019681
555,0.011551
556,0.0024938000000000004
557,-0.0056342
558,-0.013758000000000001
559,-0.019173
560,-0.023749
561,-0.026532999999999998
562,-0.031089
563,-0.039225
564,-0.047359
565,-0.055491
566,-0.06091
567,-0.069967
568,-0.07809400000000001
569,-0.086217
570,-0.09163099999999999
571,-0.09714
572,-0.098995
573,-0.10355
574,-0.11260999999999999
575,-0.12075
576,-0.12622
577,-0.12804000000000001
578,-0.13258
579,-0.14073
580,-0.14887
581,-0.15793
582,-0.16608
583,-0.17151
584,-0.17332999999999998
585,-0.17877
586,-0.18329
587,-0.19145
588,-0.20051
589,-0.2023
590,-0.2077
591,-0.21219000000000002
592,-0.22125
593,-0.23031
594,-0.23295
595,-0.23742
596,-0.24375
597,-0.2528
598,-0.25913
599,-0.26445
600,-0.26616999999999996
601,-0.26702
602,-0.26787
603,-0.26955999999999997
604,-0.27207
605,-0.27455999999999997
606,-0.27621
607,-0.27865
608,-0.27865
609,-0.27946
610,-0.28107
611,-0.2807
612,-0.28228000000000003
613,-0.27402
614,-0.26575
615,-0.25748000000000004
616,-0.24921
617,-0.24447
618,-0.23619
619,-0.22791
620,-0.21963000000000002
621,-0.22191
622,-0.2214
623,-0.21936999999999998
624,-0.21106999999999998
625,-0.20277
626,-0.19446
627,-0.18616
628,-0.17858
629,-0.17304
630,-0.16472
631,-0.15641
632,-0.14809
633,-0.13977
634,-0.13145
635,-0.1259
636,-0.11757999999999999
637,-0.10926
638,-0.10092999999999999
639,-0.0926
640,-0.087047
641,-0.078716
642,-0.070383
643,-0.062049
644,-0.053713
645,-0.048155
646,-0.045376
647,-0.042597
648,-0.034257
649,-0.031477
650,-0.028697000000000004
651,-0.025916
652,-0.020355
653,-0.012010999999999999
654,-0.0036672
655,0.0046798000000000005
656,0.013028
657,0.022055
658,0.027620999999999996
659,0.03597
660,0.044323
661,0.052675
662,0.061028
663,0.066599
664,0.07495399999999999
665,0.081863
666,0.08667000000000001
667,0.093596
668,0.10194
669,0.10751
670,0.11585
671,0.12420999999999999
672,0.13255999999999998
673,0.14157999999999998
674,0.14993
675,0.15550999999999998
676,0.16385999999999998
677,0.17222
678,0.18057
679,0.18893
680,0.19796
681,0.19929000000000002
682,0.20409000000000002
683,0.21034
684,0.21869
685,0.22771
686,0.23328000000000002
687,0.24163
688,0.24786999999999998
689,0.25269
690,0.25753000000000004
691,0.26587
692,0.27143
693,0.28046
694,0.2888
695,0.29715
696,0.30198
697,0.30406
698,0.31032
699,0.31865
700,0.32699
701,0.33533
702,0.34367
703,0.35200000000000004
704,0.35825
705,0.3666
706,0.37494
707,0.38328
708,0.39163000000000003
709,0.39719
710,0.40554
711,0.41389
712,0.42223999999999995
713,0.43059
714,0.43893999999999994
715,0.44451
716,0.45286000000000004
717,0.4591
718,0.46391000000000004
719,0.46595
720,0.4743
721,0.47986
722,0.48821000000000003
723,0.49656000000000006
724,0.50558
725,0.51393
726,0.52228
727,0.52785
728,0.53266
729,0.5375
730,0.54375
731,0.55209
732,0.55765
733,0.5660000000000001
734,0.57434
735,0.5826899999999999
736,0.59103
737,0.59938
738,0.60495
739,0.6133
740,0.62165
741,0.6300100000000001
742,0.63836
743,0.64671
744,0.6522899999999999
745,0.66064
746,0.669
747,0.6773600000000001
748,0.68639
749,0.69196
750,0.7003199999999999
751,0.70868
752,0.71705
753,0.72541
754,0.73377
755,0.73935
756,0.7477199999999999
757,0.7560899999999999
758,0.75888
759,0.76167
760,0.7651100000000001
761,0.7713399999999999
762,0.78036
763,0.78938
764,0.79282
765,0.7962600000000001
766,0.80528
767,0.80807
768,0.80807
769,0.81365
770,0.82201
771,0.8303799999999999
772,0.83596
773,0.8443299999999999
774,0.8527
775,0.8610700000000001
776,0.86944
777,0.8778100000000001
778,0.88339
779,0.8917700000000001
780,0.9001399999999999
781,0.9085200000000001
782,0.9169
783,0.92527
784,0.93086
785,0.93924
786,0.94762
787,0.956
788,0.9643799999999999
789,0.97277
790,0.97836
791,0.98674
792,0.9923299999999999
793,0.99513
794,0.99513
795,1.0007
796,1.0091
797,1.0091
798,1.0119
799,1.0175
800,1.0259
801,1.0315
802,1.0399
803,1.0489
804,1.0545
805,1.0563
806,1.061
807,1.0672
808,1.0756
809,1.084
810,1.0924
811,1.1008
812,1.1091
813,1.1147
814,1.1231
815,1.1315
816,1.1399
817,1.1483
818,1.1539
819,1.1623
820,1.1707
821,1.1757
822,1.1785
823,1.1785
824,1.1841
825,1.1925
826,1.2009
827,1.2093
828,1.2149
829,1.2149
830,1.2176
831,1.2267
832,1.2351
833,1.2435
834,1.2519
835,1.2603
836,1.2659
837,1.2743
838,1.2827
839,1.2911
840,1.2995
841,1.3051
842,1.3135
843,1.3219
844,1.3303
845,1.3387
846,1.3471
847,1.3527
848,1.3544
849,1.3526
850,1.3509
851,1.3492
852,1.3475
853,1.3492
854,1.3475
855,1.3459
856,1.3443
857,1.3427
858,1.3411
859,1.3372
860,1.3356
861,1.3341
862,1.3326
863,1.331
864,1.33
865,1.3234
866,1.3145
867,1.3083
868,1.304
869,1.3026
870,1.2969
871,1.2885
872,1.28
873,1.2715
874,1.263
875,1.2546
876,1.2489
877,1.2405
878,1.2315
879,1.2229999999999999
880,1.2146
881,1.2089
882,1.2005
883,1.192
884,1.1835
885,1.1751
886,1.1689
887,1.168
888,1.1637
889,1.1547
890,1.1458
891,1.1420000000000001
892,1.1377
893,1.1368
894,1.1278
895,1.1194
896,1.1165
897,1.1137
898,1.1081
899,1.1024
900,1.0939
901,1.0883
902,1.0855
903,1.0826
904,1.077
905,1.0685
906,1.0605
907,1.052
908,1.0436
909,1.0407
910,1.0407
911,1.0323
912,1.0266
913,1.0238
914,1.021
915,1.0125
916,1.0069
917,0.9984
918,0.98993
919,0.98146
920,0.9729899999999999
921,0.9640299999999999
922,0.95839
923,0.9499200000000001
924,0.9414600000000001
925,0.93581
926,0.93153
927,0.93056
928,0.92395
929,0.91501
930,0.90653
931,0.8980600000000001
932,0.88959
933,0.88628
934,0.88203
935,0.8782700000000001
936,0.8693200000000001
937,0.86085
938,0.8523700000000001
939,0.84672
940,0.83824
941,0.82976
942,0.82129
943,0.81234
944,0.80387
945,0.7982199999999999
946,0.78974
947,0.78127
948,0.7728
949,0.7699699999999999
950,0.76715
951,0.76432
952,0.75537
953,0.74642
954,0.7403
955,0.737
956,0.73653
957,0.73041
958,0.72146
959,0.72146
960,0.71864
961,0.71016
962,0.7045100000000001
963,0.6955600000000001
964,0.68708
965,0.67861
966,0.67484
967,0.6706300000000001
968,0.66688
969,0.6584
970,0.6499199999999999
971,0.64144
972,0.63249
973,0.62684
974,0.62264
975,0.6213
976,0.61519
977,0.6067
978,0.59821
979,0.59255
980,0.58407
981,0.57558
982,0.56665
983,0.55816
984,0.54967
985,0.54402
986,0.5355300000000001
987,0.5318
988,0.52764
989,0.5211
990,0.51261
991,0.50694
992,0.49801999999999996
993,0.48951999999999996
994,0.48103
995,0.47253999999999996
996,0.46688
997,0.46078
998,0.45664
999,0.45578
1000,0.44685
1001,0.43836
1002,0.43268999999999996
1003,0.4242
1004,0.4157
1005,0.4072
1006,0.39828
1007,0.38978
1008,0.38411999999999996
1009,0.37563
1010,0.36713
1011,0.36344
1012,0.36216
1013,0.35565
1014,0.34998
1015,0.34148
1016,0.33298
1017,0.32448
1018,0.31598000000000004
1019,0.31032
1020,0.30182
1021,0.29331999999999997
1022,0.28481999999999996
1023,0.27633
1024,0.26783
1025,0.26174000000000003
1026,0.25324
1027,0.24475
1028,0.23625
1029,0.22776
1030,0.21925999999999998
1031,0.2136
1032,0.20511
1033,0.20098
1034,0.1997
1035,0.19362000000000001
1036,0.18795
1037,0.17945
1038,0.17095
1039,0.16245
1040,0.15395
1041,0.14545999999999998
1042,0.13979
1043,0.13129000000000002
1044,0.12889
1045,0.12605999999999998
1046,0.12322999999999999
1047,0.11473
1048,0.10907
1049,0.10057999999999999
1050,0.092083
1051,0.089253
1052,0.086423
1053,0.08315499999999999
1054,0.07749199999999999
1055,0.068564
1056,0.06486900000000001
1057,0.060761
1058,0.057089
1059,0.051421
1060,0.042919
1061,0.034002
1062,0.025501
1063,0.016999
1064,0.015755
1065,0.012103000000000001
1066,0.0084618
1067,-4.7196999999999996e-05
1068,-0.0085552
1069,-0.017465
1070,-0.025973000000000003
1071,-0.031645
1072,-0.032445
1073,-0.036462
1074,-0.040073000000000004
1075,-0.040456
1076,-0.040456
1077,-0.041212
1078,-0.042324
1079,-0.043410000000000004
1080,-0.044471
1081,-0.045163
1082,-0.045163
1083,-0.045163
1084,-0.039817
1085,-0.031284
1086,-0.023088
1087,-0.020906
1088,-0.018712
1089,-0.016505000000000002
1090,-0.0079642
1091,0.0005767999999999999
1092,0.0091178
1093,0.01766
1094,0.023354
1095,0.031897
1096,0.040129000000000005
1097,0.048674
1098,0.057218
1099,0.065459
1100,0.067708
1101,0.06968099999999999
1102,0.075098
1103,0.083648
1104,0.092198
1105,0.097898
1106,0.10617
1107,0.11472
1108,0.12328
1109,0.13183
1110,0.13387000000000002
1111,0.13619
1112,0.13852
1113,0.14683
1114,0.15539
1115,0.15464
1116,0.15678
1117,0.1594
1118,0.16797
1119,0.17653
1120,0.1851
1121,0.19366
1122,0.20223
1123,0.20794
1124,0.2165
1125,0.22507
1126,0.23363
1127,0.2422
1128,0.24791
1129,0.25648000000000004
1130,0.26505
1131,0.27360999999999996
1132,0.28218000000000004
1133,0.28503
1134,0.28811
1135,0.2912
1136,0.29999000000000003
1137,0.30879
1138,0.31473
1139,0.31782
1140,0.31782
1141,0.32661999999999997
1142,0.33233
1143,0.33518000000000003
1144,0.33804
1145,0.3466
1146,0.35231
1147,0.36086999999999997
1148,0.36944
1149,0.37799999999999995
1150,0.3868
1151,0.39250999999999997
1152,0.40107
1153,0.40963999999999995
1154,0.4182
1155,0.42677
1156,0.43533
1157,0.44104
1158,0.44961
1159,0.45816999999999997
1160,0.46674
1161,0.4753
1162,0.48386999999999997
1163,0.48958
1164,0.49815
1165,0.50671
1166,0.5155
1167,0.5190600000000001
1168,0.51954
1169,0.52549
1170,0.53405
1171,0.54261
1172,0.55118
1173,0.55974
1174,0.56545
1175,0.57401
1176,0.58257
1177,0.58828
1178,0.59043
1179,0.5926
1180,0.59809
1181,0.60665
1182,0.61522
1183,0.62379
1184,0.63236
1185,0.64093
1186,0.64664
1187,0.6552
1188,0.66356
1189,0.6721199999999999
1190,0.68069
1191,0.6864100000000001
1192,0.69519
1193,0.70376
1194,0.71211
1195,0.72068
1196,0.72925
1197,0.73497
1198,0.74354
1199,0.7521100000000001
1200,0.76068
1201,0.76925
1202,0.77782
1203,0.7835300000000001
1204,0.7921
1205,0.80067
1206,0.80924
1207,0.81781
1208,0.8263799999999999
1209,0.8321
1210,0.84067
1211,0.8435299999999999
1212,0.8435299999999999
1213,0.8521
1214,0.8578100000000001
1215,0.8578100000000001
1216,0.8635200000000001
1217,0.8721
1218,0.8804700000000001
1219,0.8890399999999999
1220,0.89475
1221,0.9033200000000001
1222,0.9119
1223,0.9204700000000001
1224,0.92904
1225,0.93437
1226,0.9339799999999999
1227,0.93647
1228,0.94504
1229,0.95362
1230,0.9622
1231,0.97077
1232,0.97649
1233,0.98506
1234,0.99364
1235,1.0022
1236,1.0108
1237,1.0165
1238,1.0251
1239,1.0337
1240,1.0422
1241,1.0508
1242,1.0594
1243,1.0649
1244,1.0735
1245,1.0821
1246,1.0907
1247,1.0992
1248,1.1078
1249,1.1135
1250,1.1221
1251,1.1307
1252,1.1364
1253,1.1393
1254,1.145
1255,1.1507
1256,1.1536
1257,1.1564
1258,1.165
1259,1.1736
1260,1.1793
1261,1.1879
1262,1.1964
1263,1.205
1264,1.2136
1265,1.2222
1266,1.2279
1267,1.2366
1268,1.2452
1269,1.2536
1270,1.2622
1271,1.2708
1272,1.2765
1273,1.2851
1274,1.2937
1275,1.3022
1276,1.3108
1277,1.3194
1278,1.3251
1279,1.3337
1280,1.3421
1281,1.3447
1282,1.3442
1283,1.3469
1284,1.3555
1285,1.3641
1286,1.3725
1287,1.3811
1288,1.3897
1289,1.3954
1290,1.4040000000000001
1291,1.4095
1292,1.412
1293,1.4116
1294,1.4201
1295,1.4259
1296,1.4345
1297,1.443
1298,1.4516
1299,1.4602
1300,1.4659
1301,1.4745
1302,1.4831
1303,1.4917
1304,1.5001
1305,1.5087
1306,1.5144
1307,1.5230000000000001
1308,1.5316
1309,1.5402
1310,1.5458
1311,1.5483
1312,1.548
1313,1.5537
1314,1.5621
1315,1.5675
1316,1.5701
1317,1.57
1318,1.5699
1319,1.5727
1320,1.5753
1321,1.5779
1322,1.5805
1323,1.5834
1324,1.5862
1325,1.5859999999999999
1326,1.5887
1327,1.5886
1328,1.5886
1329,1.5885
1330,1.5883
1331,1.5853
1332,1.5851
1333,1.585
1334,1.5849
1335,1.5848
1336,1.5847
1337,1.5847
1338,1.5789
1339,1.5703
1340,1.5674
1341,1.5674
1342,1.5645
1343,1.5645
1344,1.5645
1345,1.5588
1346,1.5531
1347,1.5445
1348,1.5417
1349,1.5417
1350,1.5332
1351,1.5246
1352,1.5189
1353,1.5103
1354,1.5017
1355,1.4989
1356,1.4961
1357,1.4933
1358,1.4876
1359,1.479
1360,1.4704
1361,1.4618
1362,1.4532
1363,1.4446
1364,1.4389
1365,1.4303
1366,1.4217
1367,1.4131
1368,1.4045
1369,1.3988
1370,1.3902
1371,1.3816
1372,1.3730000000000002
1373,1.3644
1374,1.3558
1375,1.3501
1376,1.3415
1377,1.3329
1378,1.3243
1379,1.3157
1380,1.3071
1381,1.3014
1382,1.2928
1383,1.2842
1384,1.2756
1385,1.2671
1386,1.2585
1387,1.2527
1388,1.2441
1389,1.2412
1390,1.2382
1391,1.2353
1392,1.2296
1393,1.2209999999999999
1394,1.2124
1395,1.2038
1396,1.1952
1397,1.1866
1398,1.1809
1399,1.1723
1400,1.1637
1401,1.1551
1402,1.1465
1403,1.1379
1404,1.1322
1405,1.1264
1406,1.1235
1407,1.1206
1408,1.112
1409,1.1034
1410,1.0977
1411,1.0891
1412,1.0805
1413,1.0719
1414,1.0633
1415,1.0633
1416,1.0605
1417,1.0547
1418,1.0461
1419,1.0375
1420,1.0290000000000001
1421,1.0233
1422,1.0147
1423,1.0119
1424,1.0090000000000001
1425,1.0061
1426,0.99754
1427,0.9946799999999999
1428,0.9918100000000001
1429,0.98895
1430,0.98035
1431,0.9717600000000001
1432,0.9660299999999999
1433,0.95744
1434,0.94885
1435,0.94025
1436,0.93166
1437,0.9231
1438,0.91737
1439,0.9087799999999999
1440,0.9001899999999999
1441,0.89159
1442,0.883
1443,0.88013
1444,0.8772700000000001
1445,0.8772700000000001
1446,0.87154
1447,0.86295
1448,0.85439
1449,0.85156
1450,0.8487299999999999
1451,0.84304
1452,0.83449
1453,0.8259
1454,0.8172699999999999
1455,0.8115399999999999
1456,0.8086300000000001
1457,0.8086
1458,0.80283
1459,0.7942100000000001
1460,0.78565
1461,0.78279
1462,0.77996
1463,0.77999
1464,0.77144
1465,0.76289
1466,0.75434
1467,0.74862
1468,0.7428899999999999
1469,0.74002
1470,0.74002
1471,0.73148
1472,0.7228899999999999
1473,0.71716
1474,0.70857
1475,0.69997
1476,0.69138
1477,0.68279
1478,0.67707
1479,0.66847
1480,0.65988
1481,0.6512899999999999
1482,0.64556
1483,0.6427
1484,0.6427
1485,0.63697
1486,0.62838
1487,0.62838
1488,0.62551
1489,0.61692
1490,0.61119
1491,0.6026
1492,0.59401
1493,0.5854199999999999
1494,0.5768300000000001
1495,0.56823
1496,0.5625100000000001
1497,0.55391
1498,0.54532
1499,0.53673
1500,0.5281899999999999
1501,0.52246
1502,0.5138699999999999
1503,0.5052800000000001
1504,0.49668999999999996
1505,0.4881
1506,0.47951000000000005
1507,0.47378000000000003
1508,0.46805
1509,0.46518999999999994
1510,0.46518999999999994
1511,0.45658999999999994
1512,0.44799999999999995
1513,0.44228
1514,0.43941
1515,0.43655
1516,0.43368999999999996
1517,0.42508999999999997
1518,0.4165
1519,0.41076999999999997
1520,0.40213000000000004
1521,0.39354
1522,0.39354
1523,0.39066999999999996
1524,0.38495
1525,0.37635
1526,0.36776
1527,0.35917
1528,0.35339
1529,0.35048
1530,0.34757
1531,0.33893
1532,0.33029000000000003
1533,0.3217
1534,0.31311
1535,0.30451999999999996
1536,0.30165
1537,0.30165
1538,0.29871
1539,0.29012
1540,0.28152
1541,0.27293
1542,0.2672
1543,0.25861
1544,0.25001999999999996
1545,0.24143
1546,0.2328
1547,0.22707
1548,0.21848
1549,0.20988
1550,0.20129
1551,0.1927
1552,0.18411
1553,0.17837999999999998
1554,0.16979
1555,0.16405999999999998
1556,0.16119
1557,0.15833
1558,0.14974
1559,0.14687
1560,0.14401
1561,0.14114000000000002
1562,0.13255
1563,0.12395999999999999
1564,0.11827
1565,0.10968
1566,0.10113
1567,0.10126
1568,0.098563
1569,0.089972
1570,0.084244
1571,0.075653
1572,0.06706000000000001
1573,0.05853
1574,0.04994
1575,0.04135
1576,0.035621
1577,0.03296
1578,0.030322
1579,0.024676
1580,0.016087999999999998
1581,0.007497800000000001
1582,0.0017718
1583,-0.006732200000000001
1584,-0.015321000000000001
1585,-0.018184
1586,-0.018184
1587,-0.018004
1588,-0.017712000000000002
1589,-0.017394
1590,-0.01705
1591,-0.016805
1592,-0.016805
1593,-0.016805
1594,-0.011082
1595,-0.0023712
1596,0.0062128
1597,0.0093338
1598,0.009743799999999999
1599,0.010032
1600,0.013345
1601,0.013824000000000001
1602,0.017016999999999997
1603,0.025596
1604,0.034174
1605,0.039892000000000004
1606,0.04847
1607,0.057218
1608,0.065794
1609,0.07437300000000001
1610,0.080093
1611,0.08347
1612,0.084012
1613,0.089915
1614,0.098677
1615,0.10478
1616,0.10803
1617,0.1115
1618,0.12007000000000001
1619,0.12885
1620,0.12949000000000002
1621,0.13302
1622,0.1361
1623,0.14489000000000002
1624,0.15369000000000002
1625,0.1544
1626,0.15799000000000002
1627,0.1668
1628,0.17251
1629,0.17872000000000002
1630,0.18235
1631,0.18573
1632,0.19429000000000002
1633,0.19999
1634,0.20855
1635,0.2171
1636,0.22566
1637,0.23421999999999998
1638,0.24276999999999999
1639,0.24848
1640,0.25704
1641,0.26559
1642,0.27415
1643,0.28271
1644,0.29127
1645,0.29696999999999996
1646,0.30553
1647,0.31123
1648,0.31409000000000004
1649,0.31409000000000004
1650,0.32265
1651,0.32835
1652,0.33691
1653,0.33976
1654,0.34262
1655,0.35117
1656,0.35688000000000003
1657,0.36544
1658,0.374
1659,0.38256
1660,0.39111999999999997
1661,0.39968000000000004
1662,0.40539000000000003
1663,0.41395
1664,0.42251000000000005
1665,0.43132
1666,0.43988
1667,0.44843999999999995
1668,0.45415
1669,0.4627
1670,0.47126999999999997
1671,0.47983000000000003
1672,0.48839
1673,0.49695
1674,0.50266
1675,0.51122
1676,0.51978
1677,0.5283399999999999
1678,0.53691
1679,0.54286
1680,0.5464600000000001
1681,0.55007
1682,0.55578
1683,0.56434
1684,0.5729
1685,0.5786
1686,0.5874199999999999
1687,0.59597
1688,0.60453
1689,0.6130899999999999
1690,0.6167199999999999
1691,0.62011
1692,0.6229600000000001
1693,0.63152
1694,0.64007
1695,0.64863
1696,0.65433
1697,0.66289
1698,0.67171
1699,0.68053
1700,0.68338
1701,0.68338
1702,0.68624
1703,0.69479
1704,0.70335
1705,0.70905
1706,0.7119
1707,0.71475
1708,0.72046
1709,0.72928
1710,0.7326699999999999
1711,0.73634
1712,0.73975
1713,0.7483
1714,0.7540100000000001
1715,0.76256
1716,0.7711100000000001
1717,0.77966
1718,0.78822
1719,0.79392
1720,0.80275
1721,0.8113
1722,0.81985
1723,0.8284100000000001
1724,0.83696
1725,0.8426600000000001
1726,0.8489200000000001
1727,0.85262
1728,0.85605
1729,0.8646
1730,0.8731399999999999
1731,0.87884
1732,0.88739
1733,0.89594
1734,0.90449
1735,0.91304
1736,0.9215899999999999
1737,0.92729
1738,0.93584
1739,0.94439
1740,0.95294
1741,0.9615
1742,0.9672
1743,0.97575
1744,0.9843
1745,0.99285
1746,1.0017
1747,1.0102
1748,1.0159
1749,1.0245
1750,1.033
1751,1.0416
1752,1.0501
1753,1.0587
1754,1.0644
1755,1.0727
1756,1.0815
1757,1.0901
1758,1.0986
1759,1.1072
1760,1.1129
1761,1.1214
1762,1.13
1763,1.1385
1764,1.1471
1765,1.1476
1766,1.1513
1767,1.1576
1768,1.1661
1769,1.1747
1770,1.1832
1771,1.1892
1772,1.1978
1773,1.2063
1774,1.2149
1775,1.2183
1776,1.222
1777,1.2226
1778,1.2312
1779,1.24
1780,1.2434
1781,1.2472
1782,1.2478
1783,1.2535
1784,1.2624
1785,1.2709
1786,1.2795
1787,1.2883
1788,1.2912
1789,1.2921
1790,1.2959
1791,1.3044
1792,1.3048
1793,1.3054
1794,1.3061
1795,1.3071
1796,1.3081
1797,1.3092
1798,1.3102
1799,1.3106
1800,1.3109
1801,1.3028
1802,1.3039
1803,1.305
1804,1.3061
1805,1.3044
1806,1.3052
1807,1.3064
1808,1.3076
1809,1.3055
1810,1.297
1811,1.2914
1812,1.2829
1813,1.2748
1814,1.2663
1815,1.2663
1816,1.2634
1817,1.2638
1818,1.2557
1819,1.2477
1820,1.2396
1821,1.24
1822,1.2376
1823,1.2348
1824,1.2267
1825,1.2239
1826,1.2209999999999999
1827,1.2182
1828,1.2101
1829,1.2045
1830,1.2025
1831,1.2009999999999998
1832,1.1962
1833,1.1878
1834,1.1821
1835,1.1736
1836,1.1656
1837,1.1599
1838,1.1571
1839,1.1543
1840,1.1486
1841,1.1401
1842,1.1321
1843,1.1326
1844,1.1302
1845,1.125
1846,1.1194
1847,1.1114
1848,1.1024
1849,1.0935
1850,1.093
1851,1.0897
1852,1.0864
1853,1.0779
1854,1.0695
1855,1.0638
1856,1.061
1857,1.061
1858,1.0525
1859,1.044
1860,1.0355
1861,1.0271
1862,1.0186
1863,1.0129
1864,1.0045
1865,0.9955200000000001
1866,0.98705
1867,0.97857
1868,0.9701
1869,0.96445
1870,0.9559799999999999
1871,0.9475
1872,0.9390299999999999
1873,0.93056
1874,0.92491
1875,0.9164399999999999
1876,0.90797
1877,0.89999
1878,0.8915200000000001
1879,0.88305
1880,0.87741
1881,0.8689399999999999
1882,0.8604799999999999
1883,0.85201
1884,0.84355
1885,0.84073
1886,0.84073
1887,0.83791
1888,0.82944
1889,0.8209799999999999
1890,0.81534
1891,0.81252
1892,0.81252
1893,0.80688
1894,0.7984100000000001
1895,0.78995
1896,0.78149
1897,0.77585
1898,0.7674
1899,0.75894
1900,0.74997
1901,0.74152
1902,0.73306
1903,0.72742
1904,0.71896
1905,0.7105100000000001
1906,0.70205
1907,0.6936
1908,0.68514
1909,0.6795100000000001
1910,0.67106
1911,0.6626
1912,0.65415
1913,0.6457
1914,0.63725
1915,0.63162
1916,0.62317
1917,0.6147199999999999
1918,0.60628
1919,0.59783
1920,0.5922
1921,0.58375
1922,0.57531
1923,0.56686
1924,0.55842
1925,0.54998
1926,0.54435
1927,0.53591
1928,0.5280100000000001
1929,0.51903
1930,0.51059
1931,0.50215
1932,0.49653
1933,0.48863999999999996
1934,0.47966000000000003
1935,0.47121999999999997
1936,0.46333
1937,0.4549
1938,0.44873
1939,0.4403
1940,0.43187
1941,0.42344
1942,0.41501000000000005
1943,0.40939000000000003
1944,0.40096
1945,0.39253000000000005
1946,0.38411
1947,0.37568
1948,0.36725
1949,0.36164
1950,0.35322
1951,0.34479
1952,0.34085
1953,0.33636
1954,0.32963000000000003
1955,0.32400999999999996
1956,0.31558
1957,0.30715
1958,0.29872
1959,0.29029
1960,0.28187
1961,0.27625
1962,0.26726
1963,0.25884
1964,0.25040999999999997
1965,0.24199
1966,0.23636999999999997
1967,0.22795
1968,0.22345
1969,0.21896
1970,0.21279
1971,0.20435999999999999
1972,0.19874
1973,0.18975
1974,0.18132
1975,0.17289000000000002
1976,0.16446
1977,0.15604
1978,0.15042
1979,0.14199
1980,0.13357
1981,0.12907000000000002
1982,0.1246
1983,0.12124000000000001
1984,0.11281
1985,0.10437
1986,0.095942
1987,0.087512
1988,0.079082
1989,0.073462
1990,0.065032
1991,0.056604999999999996
1992,0.048178
1993,0.043125
1994,0.040888
1995,0.040888
1996,0.032467
1997,0.024046
1998,0.015627000000000002
1999,0.0072088000000000005
2000,-0.0012082
2001,-0.006819199999999999
2002,-0.006819199999999999
2003,-0.010202
2004,-0.016390000000000002
2005,-0.024808
2006,-0.030418999999999998
2007,-0.039413
2008,-0.047829
2009,-0.053439999999999994
2010,-0.056245
2011,-0.061854
2012,-0.067464
2013,-0.070268
2014,-0.073072
2015,-0.07868
2016,-0.087092
2017,-0.095502
2018,-0.10111
2019,-0.10952
2020,-0.11792000000000001
2021,-0.12633
2022,-0.13473
2023,-0.14314000000000002
2024,-0.14874
2025,-0.15714
2026,-0.16554000000000002
2027,-0.17394
2028,-0.18234
2029,-0.18794
2030,-0.19633
2031,-0.20473
2032,-0.21311999999999998
2033,-0.22150999999999998
2034,-0.2299
2035,-0.2327
2036,-0.2355
2037,-0.2355
2038,-0.24388
2039,-0.24948
2040,-0.25227
2041,-0.25165
2042,-0.26003000000000004
2043,-0.26841
2044,-0.2693
2045,-0.27015
2046,-0.27507
2047,-0.28065
2048,-0.28835
2049,-0.28981
2050,-0.28779
2051,-0.29199
2052,-0.29755
2053,-0.3052
2054,-0.30588000000000004
2055,-0.30654000000000003
2056,-0.3086
2057,-0.3162
2058,-0.32101999999999997
2059,-0.32159
2060,-0.32288
2061,-0.33043
2062,-0.33797
2063,-0.34626
2064,-0.35179
2065,-0.35931
2066,-0.35701
2067,-0.35743
2068,-0.35743
2069,-0.35664
2070,-0.35586
2071,-0.36332
2072,-0.37078
2073,-0.37822
2074,-0.37742
2075,-0.38016
2076,-0.3821
2077,-0.38952
2078,-0.39226
2079,-0.39418000000000003
2080,-0.39966999999999997
2081,-0.40515
2082,-0.41253999999999996
2083,-0.41003
2084,-0.40748
2085,-0.40764
2086,-0.40504
2087,-0.40328
2088,-0.40064
2089,-0.39796
2090,-0.39616
2091,-0.39525
2092,-0.39525
2093,-0.39344
2094,-0.39069
2095,-0.39069
2096,-0.38798
2097,-0.38526
2098,-0.37984
2099,-0.37169
2100,-0.36264
2101,-0.35449
2102,-0.34634000000000004
2103,-0.3436
2104,-0.33905
2105,-0.33721
2106,-0.32907
2107,-0.32094
2108,-0.3128
2109,-0.30466
2110,-0.29923
2111,-0.29017
2112,-0.28203
2113,-0.27388
2114,-0.26573
2115,-0.26029
2116,-0.25213
2117,-0.24941999999999998
2118,-0.24397
2119,-0.23761999999999997
2120,-0.22948000000000002
2121,-0.22405
2122,-0.21499000000000001
2123,-0.20685
2124,-0.20051
2125,-0.19505
2126,-0.18957000000000002
2127,-0.18415
2128,-0.17601
2129,-0.16787
2130,-0.15972999999999998
2131,-0.15068
2132,-0.14253
2133,-0.1371
2134,-0.12895
2135,-0.12622
2136,-0.12075
2137,-0.11169000000000001
2138,-0.10626
2139,-0.098126
2140,-0.089985
2141,-0.081841
2142,-0.07369500000000001
2143,-0.06554600000000001
2144,-0.060112
2145,-0.051958000000000004
2146,-0.043802
2147,-0.035643
2148,-0.027482
2149,-0.019318000000000002
2150,-0.013874000000000001
2151,-0.0057062
2152,0.0024648000000000005
2153,0.011522
2154,0.019694999999999997
2155,0.02787
2156,0.033324
2157,0.041500999999999996
2158,0.049685
2159,0.057867999999999996
2160,0.06605499999999999
2161,0.071514
2162,0.07598300000000001
2163,0.081336
2164,0.085825
2165,0.094
2166,0.10217999999999999
2167,0.10762999999999999
2168,0.11669000000000002
2169,0.12487000000000001
2170,0.13305999999999998
2171,0.14124
2172,0.14757
2173,0.14931
2174,0.15467999999999998
2175,0.16101
2176,0.17007
2177,0.17728
2178,0.18267
2179,0.18445999999999999
2180,0.19263
2181,0.20079
2182,0.20985
2183,0.21802
2184,0.22346
2185,0.22885999999999998
2186,0.23426999999999998
2187,0.24061999999999997
2188,0.24966999999999998
2189,0.25601
2190,0.26054
2191,0.26327
2192,0.26961999999999997
2193,0.27867
2194,0.28502
2195,0.29049
2196,0.29234
2197,0.30139
2198,0.31045
2199,0.31501999999999997
2200,0.31782
2201,0.32335
2202,0.32524000000000003
2203,0.3281
2204,0.33271
2205,0.34081
2206,0.34986999999999996
2207,0.35178000000000004
2208,0.35738000000000003
2209,0.36201
2210,0.37106
2211,0.38011999999999996
2212,0.38573
2213,0.38769000000000003
2214,0.39674
2215,0.4058
2216,0.41046000000000005
2217,0.41341999999999995
2218,0.4164
2219,0.4184
2220,0.42141000000000006
2221,0.42445
2222,0.4275
2223,0.43058
2224,0.43367
2225,0.43575
2226,0.43888
2227,0.44201999999999997
2228,0.44519
2229,0.44837
2230,0.45051
2231,0.45373
2232,0.45696000000000003
2233,0.46021999999999996
2234,0.46348999999999996
2235,0.46679
2236,0.46261
2237,0.45579
2238,0.45161999999999997
2239,0.45233999999999996
2240,0.45195
2241,0.44518
2242,0.44105
2243,0.4407
2244,0.4415
2245,0.43856000000000006
2246,0.43185
2247,0.42777
2248,0.43127
2249,0.43217
2250,0.42433999999999994
2251,0.41651000000000005
2252,0.40868000000000004
2253,0.40346
2254,0.39564
2255,0.38783
2256,0.38001999999999997
2257,0.37221
2258,0.3644
2259,0.3592
2260,0.35141
2261,0.34362
2262,0.33582
2263,0.32804
2264,0.32181
2265,0.3168
2266,0.31179
2267,0.30399
2268,0.2962
2269,0.2872
2270,0.28201
2271,0.27421999999999996
2272,0.26644
2273,0.25866999999999996
2274,0.25226
2275,0.24602
2276,0.24359
2277,0.23719
2278,0.2294
2279,0.22161999999999998
2280,0.21384
2281,0.20485
2282,0.19967000000000001
2283,0.1919
2284,0.18413
2285,0.17637
2286,0.16862
2287,0.16087
2288,0.1557
2289,0.14795999999999998
2290,0.14022
2291,0.13249
2292,0.12476
2293,0.12218
2294,0.11585
2295,0.10953
2296,0.10055
2297,0.092811
2298,0.085077
2299,0.079924
2300,0.072199
2301,0.064479
2302,0.056763
2303,0.049055
2304,0.04135
2305,0.036213999999999996
2306,0.027243
2307,0.019548
2308,0.011857
2309,0.004171800000000001
2310,-0.0035082
2311,-0.008625200000000001
2312,-0.015028999999999999
2313,-0.021447
2314,-0.027851
2315,-0.035539
2316,-0.040662000000000004
2317,-0.048342
2318,-0.056015999999999996
2319,-0.063685
2320,-0.071349
2321,-0.07900700000000001
2322,-0.084109
2323,-0.093064
2324,-0.10071000000000001
2325,-0.10835
2326,-0.11599000000000001
2327,-0.12362000000000001
2328,-0.1288
2329,-0.13527999999999998
2330,-0.14045
2331,-0.14809
2332,-0.15573
2333,-0.16335999999999998
2334,-0.16845
2335,-0.17739000000000002
2336,-0.18500999999999998
2337,-0.19263
2338,-0.20035999999999998
2339,-0.20555
2340,-0.21205
2341,-0.21968000000000001
2342,-0.2273
2343,-0.23625
2344,-0.24386
2345,-0.24893
2346,-0.25545999999999996
2347,-0.25943
2348,-0.26583
2349,-0.27345
2350,-0.28107
2351,-0.28615
2352,-0.29375999999999997
2353,-0.3027
2354,-0.31029
2355,-0.31789
2356,-0.32697
2357,-0.32964
2358,-0.33484
2359,-0.34245
2360,-0.35005
2361,-0.35765
2362,-0.36271
2363,-0.37164
2364,-0.37922
2365,-0.3868
2366,-0.3932
2367,-0.39978
2368,-0.40247
2369,-0.40886999999999996
2370,-0.41646000000000005
2371,-0.42404
2372,-0.43296999999999997
2373,-0.44054
2374,-0.44558000000000003
2375,-0.45314
2376,-0.4607
2377,-0.46595
2378,-0.47255
2379,-0.47526
2380,-0.48283000000000004
2381,-0.4904
2382,-0.49795
2383,-0.5055
2384,-0.51305
2385,-0.51945
2386,-0.52698
2387,-0.53451
2388,-0.54203
2389,-0.5495399999999999
2390,-0.55733
2391,-0.56011
2392,-0.56676
2393,-0.57429
2394,-0.58181
2395,-0.58933
2396,-0.59683
2397,-0.60183
2398,-0.61073
2399,-0.61822
2400,-0.6257
2401,-0.63317
2402,-0.63815
2403,-0.64561
2404,-0.65449
2405,-0.66337
2406,-0.66833
2407,-0.67367
2408,-0.67652
2409,-0.6854
2410,-0.69286
2411,-0.70173
2412,-0.70917
2413,-0.7166
2414,-0.72196
2415,-0.72625
2416,-0.73159
2417,-0.7390399999999999
2418,-0.74649
2419,-0.75392
2420,-0.7588699999999999
2421,-0.76774
2422,-0.77515
2423,-0.78256
2424,-0.7904
2425,-0.79578
2426,-0.8025800000000001
2427,-0.81
2428,-0.82031
2429,-0.82711
2430,-0.8339
2431,-0.83886
2432,-0.84629
2433,-0.85372
2434,-0.8625799999999999
2435,-0.8699899999999999
2436,-0.87739
2437,-0.8823200000000001
2438,-0.8872399999999999
2439,-0.8940899999999999
2440,-0.89845
2441,-0.9023700000000001
2442,-0.9073100000000001
2443,-0.91225
2444,-0.92111
2445,-0.9285
2446,-0.9358799999999999
2447,-0.94227
2448,-0.9452
2449,-0.95204
2450,-0.9584299999999999
2451,-0.96583
2452,-0.9746799999999999
2453,-0.98206
2454,-0.9869700000000001
2455,-0.9948299999999999
2456,-1.0017
2457,-1.0071
2458,-1.0145
2459,-1.0233
2460,-1.0282
2461,-1.0356
2462,-1.043
2463,-1.0474
2464,-1.0543
2465,-1.0607
2466,-1.0656
2467,-1.0729
2468,-1.0818
2469,-1.0891
2470,-1.0955
2471,-1.0985
2472,-1.1054
2473,-1.1093
2474,-1.1181
2475,-1.127
2476,-1.1314
2477,-1.1368
2478,-1.1407
2479,-1.1481
2480,-1.1555
2481,-1.1628
2482,-1.1717
2483,-1.1766
2484,-1.1839
2485,-1.1913
2486,-1.1952
2487,-1.2021
2488,-1.2115
2489,-1.2164
2490,-1.2252
2491,-1.2321
2492,-1.239
2493,-1.2454
2494,-1.2503
2495,-1.2591
2496,-1.266
2497,-1.2704
2498,-1.2792
2499,-1.2866
2500,-1.2930000000000001
2501,-1.3004
2502,-1.3092
2503,-1.3161
2504,-1.3254
2505,-1.3328
2506,-1.3377
2507,-1.3466
2508,-1.3539
2509,-1.3627
2510,-1.3696
2511,-1.3726
2512,-1.3814
2513,-1.3903
2514,-1.3957
2515,-1.4025
2516,-1.4055
2517,-1.4104
2518,-1.4178
2519,-1.4266
2520,-1.4340000000000002
2521,-1.4414
2522,-1.4468
2523,-1.4497
2524,-1.4566
2525,-1.464
2526,-1.4728
2527,-1.4782
2528,-1.485
2529,-1.4904
2530,-1.4978
2531,-1.5067
2532,-1.5141
2533,-1.5214
2534,-1.5278
2535,-1.5322
2536,-1.5391
2537,-1.5479
2538,-1.5568
2539,-1.5636
2540,-1.569
2541,-1.5729
2542,-1.5803
2543,-1.5892
2544,-1.5966
2545,-1.604
2546,-1.6089
2547,-1.6133
2548,-1.6201
2549,-1.6265
2550,-1.6353
2551,-1.6428
2552,-1.6477
2553,-1.6551
2554,-1.6629
2555,-1.6673
2556,-1.6727
2557,-1.6776
2558,-1.685
2559,-1.6924
2560,-1.6998
2561,-1.7071
2562,-1.7144
2563,-1.7193
2564,-1.7281
2565,-1.7354
2566,-1.7427
2567,-1.7499
2568,-1.7572
2569,-1.7619999999999998
2570,-1.7692
2571,-1.7763
2572,-1.7835
2573,-1.7906
2574,-1.7978
2575,-1.8025
2576,-1.8096
2577,-1.8166
2578,-1.8236
2579,-1.8306
2580,-1.8353
2581,-1.8423
2582,-1.8492
2583,-1.8561
2584,-1.8630000000000002
2585,-1.8699
2586,-1.8744
2587,-1.8812
2588,-1.8880000000000001
2589,-1.893
2590,-1.8997
2591,-1.9064
2592,-1.9108
2593,-1.9174
2594,-1.9240000000000002
2595,-1.9306
2596,-1.9371
2597,-1.9436
2598,-1.9479
2599,-1.9543
2600,-1.9607
2601,-1.9629
2602,-1.965
2603,-1.963
2604,-1.9674
2605,-1.9717
2606,-1.9759
2607,-1.9739
2608,-1.974
2609,-1.976
2610,-1.9801
2611,-1.9821
2612,-1.9841
2613,-1.9881
2614,-1.9941
2615,-1.9981
2616,-2.004
2617,-2.0098
2618,-2.0157
2619,-2.0214
2620,-2.0271
2621,-2.0309
2622,-2.0365
2623,-2.0421
2624,-2.0476
2625,-2.0531
2626,-2.0567
2627,-2.0621
2628,-2.0674
2629,-2.0726
2630,-2.0761
2631,-2.0778
2632,-2.0795
2633,-2.0847
2634,-2.088
2635,-2.088
2636,-2.093
2637,-2.0980000000000003
2638,-2.1012
2639,-2.106
2640,-2.1108
2641,-2.1155
2642,-2.1177
2643,-2.1207
2644,-2.1252
2645,-2.1296
2646,-2.1339
2647,-2.1381
2648,-2.1423
2649,-2.145
2650,-2.145
2651,-2.1464
2652,-2.1504
2653,-2.1543
2654,-2.1555
2655,-2.1555
2656,-2.1542
2657,-2.1541
2658,-2.1551
2659,-2.156
2660,-2.1567
2661,-2.1590000000000003
2662,-2.1590000000000003
2663,-2.16
2664,-2.1595
2665,-2.1627
2666,-2.1647
2667,-2.1677
2668,-2.1705
2669,-2.1733
2670,-2.176
2671,-2.1786
2672,-2.1802
2673,-2.1827
2674,-2.185
2675,-2.1872
2676,-2.1892
2677,-2.1912
2678,-2.1925
2679,-2.1943
2680,-2.1959999999999997
2681,-2.1976
2682,-2.1991
2683,-2.2004
2684,-2.2013
2685,-2.1996
2686,-2.2007
2687,-2.2016
2688,-2.2024
2689,-2.2027
2690,-2.2029
2691,-2.2029
2692,-2.2036
2693,-2.2041
2694,-2.2045
2695,-2.2045
2696,-2.2046
2697,-2.2048
2698,-2.2049
2699,-2.205
2700,-2.205
2701,-2.205
2702,-2.205
2703,-2.205
2704,-2.2078
2705,-2.2078
2706,-2.2078
2707,-2.2078
2708,-2.2078
