time,value
0,-0.19025
1,-0.19025
2,-0.19025
3,-0.19025
4,-0.19025
5,-0.19025
6,-0.19025
7,-0.19025
8,-0.19025
9,-0.19025
10,-0.19025
11,-0.19025
12,-0.19025
13,-0.19025
14,-0.19025
15,-0.19025
16,-0.19025
17,-0.19025
18,-0.19025
19,-0.19025
20,-0.19025
21,-0.19025
22,-0.19025
23,-0.19025
24,-0.19025
25,-0.19025
26,-0.19025
27,-0.19025
28,-0.19025
29,-0.19025
30,-0.19025
31,-0.19025
32,-0.19025
33,-0.19025
34,-0.19025
35,-0.19025
36,-0.19025
37,-0.19025
38,-0.19025
39,-0.19025
40,-0.19025
41,-0.19025
42,-0.19025
43,-0.19025
44,-0.19025
45,-0.19025
46,-0.19025
47,-0.19025
48,-0.19025
49,-0.19025
50,-0.19025
51,-0.19025
52,-0.19025
53,-0.19025
54,-0.19025
55,-0.19025
56,-0.19025
57,-0.19025
58,-0.19025
59,-0.19025
60,-0.19025
61,-0.19025
62,-0.19025
63,-0.19025
64,-0.19025
65,-0.19025
66,-0.19025
67,-0.19025
68,-0.19025
69,-0.19025
70,-0.19025
71,-0.19025
72,-0.19025
73,-0.19025
74,-0.19025
75,-0.19025
76,-0.19025
77,-0.19025
78,-0.19025
79,-0.19025
80,-0.19025
81,-0.19025
82,-0.19025
83,-0.19025
84,-0.13177
85,0.12162
86,6.7293
87,0.14110999999999999
88,0.14110999999999999
89,0.10213
90,4.7996
91,4.8386
92,-0.19025
93,-0.19025
94,-0.19025
95,-0.19025
