time,value
0,1.0027
1,1.0027
2,-1.0063
3,-1.181
4,-1.181
5,0.74062
6,0.9153100000000001
7,-0.39488
8,-1.181
9,-1.181
10,-0.045493
11,1.0027
12,0.21655
13,-1.181
14,-1.181
15,-0.91895
16,1.09
17,1.0027
18,-1.181
19,-1.181
20,-1.181
21,-0.045493
22,1.0027
23,0.30389
24,-1.181
25,-1.181
26,-1.181
27,0.65328
28,1.0027
29,-0.56957
30,-1.181
31,-1.181
32,0.65328
33,1.0027
34,1.09
35,1.1774
36,0.74062
37,-1.181
38,-1.181
39,-1.181
40,0.9153100000000001
41,1.09
42,1.0027
43,-0.91895
44,-1.181
45,-1.181
46,1.1774
47,1.09
48,1.0027
49,-1.181
50,-1.181
51,-1.181
52,1.09
53,1.09
54,1.09
55,0.47858
56,-1.181
57,-1.181
58,-1.0063
59,1.1774
60,1.09
61,1.0027
62,1.0027
63,0.9153100000000001
64,0.9153100000000001
65,0.9153100000000001
66,0.8279700000000001
67,0.8279700000000001
68,0.8279700000000001
69,0.8279700000000001
70,0.8279700000000001
71,0.74062
72,0.8279700000000001
73,0.74062
74,0.56593
75,-1.181
76,-1.181
77,-1.181
78,-1.181
79,0.65328
80,1.0027
81,0.8279700000000001
82,0.56593
83,-1.181
84,-1.181
85,-1.181
86,0.47858
87,0.9153100000000001
88,0.8279700000000001
89,-1.181
90,-1.181
91,-0.30753
92,1.0027
93,1.0027
94,-0.56957
95,-1.181
