[<text>
<title>mayfair industries inc &lt;mayf&gt; 4th qtr net</title>
<dateline>    new york, feb 26 - 
    </dateline>oper shr 21 cts vs 18 cts
    oper net 659,000 vs 523,000
    revs 7,866,000 vs 5,503,000
    avg shrs 3,141,217 vs 2,925,294
    12 mths
    oper shr 70 cts vs 46 cts
    oper net 2,075,000 vs 1,358,000
    revs 25.9 mln vs 19.3 mln
    avg shrs 2,980,247 vs 2,925,294
    note: excludes tax gain of 295,000 dlrs for qtr and year.
 reuter
</text>]