time,value
0,1.8791
1,-0.8938
2,-0.8938
3,1.4169
4,-0.43166000000000004
5,-0.8938
6,1.1088
7,-0.12355999999999999
8,-0.8938
9,0.64668
10,0.33858
11,-0.8938
12,0.33858
13,0.49263
14,-0.8938
15,0.030489
16,0.95478
17,-0.8938
18,-0.5857
19,1.4169
20,-0.8938
21,-0.8938
22,1.8791
23,-0.8938
24,-0.8938
25,1.725
26,-0.8938
27,-0.8938
28,1.725
29,-0.8938
30,-0.8938
31,1.2629
32,-0.43166000000000004
33,-0.8938
34,1.1088
35,-0.12355999999999999
36,-0.8938
37,0.49263
38,0.33858
39,-0.8938
40,0.030489
41,0.95478
42,-0.8938
43,0.18454
44,0.80073
45,-0.8938
46,-0.27760999999999997
47,1.2629
48,-0.8938
49,-0.8938
50,1.8791
51,-0.8938
52,-0.8938
53,1.8791
54,-0.8938
55,-0.8938
56,1.725
57,-0.8938
58,-0.8938
59,1.2629
60,-0.27760999999999997
61,-0.8938
62,0.80073
63,0.030489
64,-0.8938
65,0.18454
66,0.80073
67,-0.8938
68,-0.12355999999999999
69,1.1088
70,-0.8938
71,-0.8938
72,1.725
73,-0.8938
74,0.80073
75,0.33858
76,-0.8938
77,0.64668
78,0.49263
79,-0.8938
80,0.030489
81,1.1088
82,-0.8938
83,-0.5857
84,1.725
85,-0.8938
86,-0.8938
87,2.1872
88,-0.8938
89,-0.8938
90,1.725
91,-0.5857
92,-0.8938
93,1.4169
94,-0.27760999999999997
95,-0.8938
