[<text>
<title>unr industries inc &lt;unriq&gt; 4th qtr net</title>
<dateline>    chicago, march 12 -
    </dateline>shr profit 75 cts vs profit 25 cts
    net profit 2,742,962 vs profit 936,333
    sales 74.9 mln vs 70.1 mln
    year
    shr profit 1.05 dlrs vs loss 1.07 dlrs
    net profit 3,868,888 vs loss 3,931,580
    sales 299.3 mln vs 281.1 mln
 reuter
</text>]