time,value
0,-0.15497
1,-0.17665
2,-0.19472
3,-0.15858
4,-0.19472
5,-0.17665
6,-0.18388
7,-0.18388
8,-0.15858
9,-0.20195
10,-0.17304
11,-0.18388
12,-0.18026
13,-0.16942000000000002
14,-0.20195
15,-0.15497
16,-0.18026
17,-0.18388
18,-0.17665
19,-0.20195
20,-0.14413
21,-0.19833
22,-0.18388
23,-0.18026
24,-0.18749000000000002
25,-0.14051
26,-0.19833
27,-0.16580999999999999
28,-0.18026
29,-0.17665
30,-0.15136
31,-0.19472
32,-0.15136
33,-0.16580999999999999
34,-0.17304
35,-0.14413
36,-0.18388
37,-0.14051
38,-0.1622
39,-0.19472
40,-0.1369
41,-0.16942000000000002
42,-0.15858
43,-0.15497
44,-0.1911
45,-0.14051
46,-0.18026
47,-0.18026
48,-0.1622
49,-0.18388
50,-0.15497
51,-0.18026
52,-0.16942000000000002
53,-0.1369
54,-0.19833
55,-0.14774
56,-0.18026
57,-0.15497
58,-0.15858
59,-0.19472
60,-0.14774
61,-0.17665
62,-0.16942000000000002
63,-0.16580999999999999
64,-0.19472
65,-0.14051
66,-0.18388
67,-0.17304
68,-0.16942000000000002
69,-0.18388
70,-0.15136
71,-0.19472
72,-0.16580999999999999
73,-0.15497
74,-0.17665
75,-0.14413
76,-0.19472
77,-0.14774
78,6.3241
79,6.877000000000001
80,2.2553
81,-0.10438
82,-0.050176
83,-0.11882999999999999
84,-0.13329000000000002
85,-0.12605999999999998
86,-0.14774
87,-0.11882999999999999
88,-0.17304
89,-0.14774
90,-0.13329000000000002
91,-0.1911
92,-0.15497
93,-0.16580999999999999
94,-0.18026
95,-0.13329000000000002
