time,value
0,-0.23001999999999997
1,-0.23001999999999997
2,-0.23001999999999997
3,-0.23001999999999997
4,-0.23001999999999997
5,-0.23001999999999997
6,-0.23001999999999997
7,-0.23001999999999997
8,-0.23001999999999997
9,-0.23001999999999997
10,-0.23001999999999997
11,-0.23001999999999997
12,-0.23001999999999997
13,-0.23001999999999997
14,-0.23001999999999997
15,-0.23001999999999997
16,-0.23001999999999997
17,-0.23001999999999997
18,-0.23001999999999997
19,-0.23001999999999997
20,-0.23001999999999997
21,-0.23001999999999997
22,-0.23001999999999997
23,-0.23001999999999997
24,-0.23001999999999997
25,-0.23001999999999997
26,-0.23001999999999997
27,-0.23001999999999997
28,-0.23001999999999997
29,-0.23001999999999997
30,-0.23001999999999997
31,-0.23001999999999997
32,-0.23001999999999997
33,-0.23001999999999997
34,-0.23001999999999997
35,-0.23001999999999997
36,-0.23001999999999997
37,3.6718
38,6.9956
39,3.2094
40,-0.23001999999999997
41,-0.23001999999999997
42,-0.23001999999999997
43,-0.23001999999999997
44,-0.23001999999999997
45,-0.23001999999999997
46,-0.23001999999999997
47,-0.23001999999999997
48,-0.23001999999999997
49,-0.23001999999999997
50,-0.23001999999999997
51,-0.23001999999999997
52,-0.23001999999999997
53,-0.23001999999999997
54,-0.23001999999999997
55,-0.23001999999999997
56,-0.23001999999999997
57,-0.23001999999999997
58,-0.23001999999999997
59,-0.23001999999999997
60,-0.23001999999999997
61,-0.23001999999999997
62,-0.23001999999999997
63,-0.23001999999999997
64,2.7469
65,1.1284
66,2.9493
67,-0.23001999999999997
68,-0.23001999999999997
69,-0.23001999999999997
70,-0.23001999999999997
71,-0.23001999999999997
72,-0.23001999999999997
73,-0.23001999999999997
74,-0.23001999999999997
75,-0.23001999999999997
76,-0.23001999999999997
77,-0.23001999999999997
78,-0.23001999999999997
79,-0.23001999999999997
80,-0.23001999999999997
81,-0.23001999999999997
82,-0.23001999999999997
83,-0.23001999999999997
84,-0.23001999999999997
85,-0.23001999999999997
86,-0.23001999999999997
87,-0.23001999999999997
88,-0.23001999999999997
89,-0.23001999999999997
90,-0.23001999999999997
91,-0.23001999999999997
92,-0.23001999999999997
93,-0.23001999999999997
94,-0.23001999999999997
95,-0.23001999999999997
