time,value
0,1.2367
1,1.1581
2,1.0763
3,1.0109
4,0.93891
5,0.85526
6,0.80842
7,0.73944
8,0.6702600000000001
9,0.60922
10,0.57581
11,0.52263
12,0.47447
13,0.39266999999999996
14,0.31192
15,0.24516999999999997
16,0.17657
17,0.13474
18,0.089275
19,0.03298
20,0.029137
21,0.079606
22,0.10674000000000002
23,0.058176
24,-0.0075803
25,-0.068767
26,-0.09146599999999999
27,-0.15361
28,-0.22882
29,-0.30209
30,-0.3759
31,-0.46376999999999996
32,-0.5301899999999999
33,-0.61666
34,-0.7085600000000001
35,-0.78098
36,-0.8468100000000001
37,-0.93425
38,-1.0296
39,-1.1194
40,-1.175
41,-1.0834
42,-1.0392
43,-0.9491200000000001
44,-0.8481200000000001
45,-0.75776
46,-0.6792199999999999
47,-0.58105
48,-0.48558999999999997
49,-0.41215
50,-0.42232
51,-0.45951000000000003
52,-0.51174
53,-0.6280399999999999
54,-0.6925100000000001
55,-0.71638
56,-0.78737
57,-0.8734200000000001
58,-0.87923
59,-0.90241
60,-0.9810399999999999
61,-1.0732
62,-1.1039
63,-1.1171
64,-1.0979
65,-1.1331
66,-1.2116
67,-1.2788
68,-1.3458
69,-1.4165
70,-1.4966
71,-1.4902
72,-1.4127
73,-1.3149
74,-1.2414
75,-1.1586
76,-1.0459
77,-0.94957
78,-0.87907
79,-0.83
80,-0.70423
81,-0.59996
82,-0.49062
83,-0.42778
84,-0.30259
85,-0.22388000000000002
86,-0.13723
87,-0.041437
88,0.0018459
89,0.10234
90,0.16480999999999998
91,0.23496999999999998
92,0.28568000000000005
93,0.37851999999999997
94,0.47812
95,0.59211
96,0.64681
97,0.69971
98,0.79467
99,0.8461299999999999
100,0.9521799999999999
101,1.0307
102,1.1266
103,1.2476
104,1.3234
105,1.4093
106,1.5351
107,1.6341
108,1.6717
109,1.7479
110,1.8573
111,1.9593
112,2.0299
113,2.0867
114,2.1709
115,2.131
116,2.0445
117,1.9459
118,1.8217
119,1.6953
120,1.6272
121,1.5025
122,1.3797
123,1.2812
124,1.1745
125,1.0678
126,0.96425
127,0.85075
128,0.7348600000000001
129,0.62739
130,0.51412
131,0.40449
132,0.29786
133,0.1929
134,0.070033
135,-0.042699
136,-0.14677
137,-0.24979
138,-0.36772
139,-0.48313
140,-0.54889
141,-0.64979
142,-0.7459399999999999
143,-0.83898
144,-0.9569799999999999
145,-1.0693
146,-1.173
147,-1.2852
148,-1.3609
149,-1.3437
150,-1.3071
151,-1.2521
152,-1.2161
153,-1.1042
154,-1.0205
155,-0.9225
156,-0.8442200000000001
157,-0.7906
158,-0.7751
159,-0.81238
160,-0.8805799999999999
161,-0.94409
162,-0.9626100000000001
163,-0.93795
164,-0.9044
165,-0.84451
166,-0.7712899999999999
167,-0.6784899999999999
168,-0.59713
169,-0.51371
170,-0.44273
171,-0.37759000000000004
172,-0.33149
173,-0.33258000000000004
174,-0.39455
175,-0.44513
176,-0.39884000000000003
177,-0.33304
178,-0.30007
179,-0.26288
180,-0.20726
181,-0.13741
182,-0.068469
183,-0.024222
184,0.035837
185,0.13357
186,0.2337
187,0.3156
188,0.39089
189,0.47108
190,0.51354
191,0.5886100000000001
192,0.69707
193,0.8123100000000001
194,0.9103600000000001
195,0.90854
196,0.80523
197,0.70004
198,0.59913
199,0.49375
200,0.3987
201,0.29472
202,0.19037
203,0.081903
204,0.021417
205,-0.069364
206,-0.17231
207,-0.27836
208,-0.38771
209,-0.50054
210,-0.6059
211,-0.71343
212,-0.81188
213,-0.91254
214,-0.96119
215,-0.9794799999999999
216,-0.99918
217,-0.9540700000000001
218,-0.91045
219,-0.86159
220,-0.77284
221,-0.66235
222,-0.55348
223,-0.46203
224,-0.37598000000000004
225,-0.30817
226,-0.23986
227,-0.18719
228,-0.098923
229,0.003993099999999999
230,0.12130999999999999
231,0.21026
232,0.25313
233,0.29393
234,0.37856999999999996
235,0.44928999999999997
236,0.5078699999999999
237,0.5582199999999999
238,0.61893
239,0.70045
240,0.7075899999999999
241,0.64304
242,0.60916
243,0.5724899999999999
244,0.54964
245,0.5646800000000001
246,0.60292
247,0.6502
248,0.71108
249,0.79172
250,0.81289
251,0.85883
252,0.9284600000000001
253,0.96393
254,1.0285
255,1.0928
256,1.1540000000000001
257,1.2315
258,1.2822
259,1.3349
260,1.4211
261,1.4621
262,1.409
263,1.2958
264,1.1838
265,1.0623
266,0.9436200000000001
267,0.84321
268,0.73221
269,0.61302
270,0.49949
271,0.38871
272,0.28135
273,0.16972
274,0.07120599999999999
275,-0.039827999999999995
276,-0.14412
277,-0.25085999999999997
278,-0.36032
279,-0.46385
280,-0.56703
281,-0.67265
282,-0.7760100000000001
283,-0.88229
284,-0.9859600000000001
285,-1.0906
286,-1.1947
287,-1.2981
288,-1.3992
289,-1.5078
290,-1.609
291,-1.7164
292,-1.8027
293,-1.8544
294,-1.8659999999999999
295,-1.8823
296,-1.818
297,-1.7256
298,-1.6169
299,-1.5379
300,-1.4445
301,-1.334
302,-1.2255
303,-1.1183
304,-0.98962
305,-0.87154
306,-0.74897
307,-0.63234
308,-0.51343
309,-0.38718
310,-0.26106
311,-0.14098
312,-0.035422
313,0.062707
314,0.14826
315,0.26698
316,0.36529
317,0.45176000000000005
318,0.54197
319,0.60185
320,0.69815
321,0.81102
322,0.9148299999999999
323,0.87734
324,0.81104
325,0.73944
326,0.6872
327,0.7095600000000001
328,0.80491
329,0.90349
330,0.9938899999999999
331,1.084
332,1.2076
333,1.3204
334,1.4057
335,1.4556
336,1.5267
337,1.6159999999999999
338,1.7011
339,1.7762
340,1.8475
341,1.9265
342,2.0227
343,2.1042
344,2.1441
345,2.069
346,2.0061
347,1.9411
348,1.8647
349,1.8025
350,1.7356
351,1.6542
352,1.5648
353,1.4906
354,1.4404
355,1.426
356,1.3599
357,1.2654
358,1.1588
359,1.0718
360,0.96535
361,0.88087
362,0.79466
363,0.69889
364,0.6362
365,0.60293
366,0.6228
367,0.67786
368,0.67891
369,0.57549
370,0.44075
371,0.30826
372,0.18256
373,0.061234000000000004
374,-0.028332999999999997
375,-0.1097
376,-0.2287
377,-0.34534000000000004
378,-0.44465
379,-0.54128
380,-0.6648
381,-0.78525
382,-0.87785
383,-0.9684299999999999
384,-1.0732
385,-1.1765
386,-1.2932
387,-1.3647
388,-1.4758
389,-1.5845
390,-1.6880000000000002
391,-1.7964
392,-1.902
393,-2.0087
394,-2.0972
395,-2.1008
396,-1.9938
397,-1.8856
398,-1.7806
399,-1.6783
400,-1.57
401,-1.4675
402,-1.3639
403,-1.2615
404,-1.1517
405,-1.0481
406,-0.94615
407,-0.84199
408,-0.7309
409,-0.6267199999999999
410,-0.5159
411,-0.43288999999999994
412,-0.33153
413,-0.22058000000000003
414,-0.11690999999999999
415,-0.002318
416,0.10708
417,0.15505
418,0.25939
419,0.37340999999999996
420,0.49382
421,0.60168
422,0.71763
423,0.8376399999999999
424,0.9554299999999999
425,1.0777
426,1.199
