time,value
0,-1.1761
1,-1.1565
2,-1.1308
3,-1.0999
4,-1.0655
5,-1.0291
6,-0.99255
7,-0.9575600000000001
8,-0.9255399999999999
9,-0.8970100000000001
10,-0.87211
11,-0.8504700000000001
12,-0.83136
13,-0.81386
14,-0.79718
15,-0.78058
16,-0.76339
17,-0.74532
18,-0.72641
19,-0.70698
20,-0.6875399999999999
21,-0.66891
22,-0.65157
23,-0.63589
24,-0.6220899999999999
25,-0.61023
26,-0.60022
27,-0.59185
28,-0.58521
29,-0.57985
30,-0.57555
31,-0.57217
32,-0.5696100000000001
33,-0.56788
34,-0.56707
35,-0.5674399999999999
36,-0.56879
37,-0.57106
38,-0.57411
39,-0.57775
40,-0.5818
41,-0.58622
42,-0.59095
43,-0.59567
44,-0.60024
45,-0.60455
46,-0.60853
47,-0.61217
48,-0.6158100000000001
49,-0.6194
50,-0.62284
51,-0.6260899999999999
52,-0.6291
53,-0.6318199999999999
54,-0.63421
55,-0.63676
56,-0.6390899999999999
57,-0.64113
58,-0.64277
59,-0.64395
60,-0.64462
61,-0.64493
62,-0.64528
63,-0.64545
64,-0.64548
65,-0.6454300000000001
66,-0.64541
67,-0.64552
68,-0.64622
69,-0.64777
70,-0.6500199999999999
71,-0.65295
72,-0.6564800000000001
73,-0.6605
74,-0.66485
75,-0.66995
76,-0.6754100000000001
77,-0.68085
78,-0.68607
79,-0.69085
80,-0.69507
81,-0.6986399999999999
82,-0.70236
83,-0.70554
84,-0.70816
85,-0.71025
86,-0.7118399999999999
87,-0.713
88,-0.71404
89,-0.7155600000000001
90,-0.71695
91,-0.71812
92,-0.7189800000000001
93,-0.7194
94,-0.71926
95,-0.71896
96,-0.71849
97,-0.7171
98,-0.7146
99,-0.71078
100,-0.70552
101,-0.6987800000000001
102,-0.69157
103,-0.6834600000000001
104,-0.67416
105,-0.66367
106,-0.652
107,-0.6392
108,-0.62539
109,-0.61216
110,-0.59832
111,-0.5838300000000001
112,-0.56862
113,-0.55265
114,-0.53595
115,-0.51903
116,-0.5030899999999999
117,-0.48715
118,-0.47123999999999994
119,-0.45538
120,-0.4396
121,-0.42396000000000006
122,-0.40951
123,-0.39664
124,-0.38444
125,-0.37269
126,-0.36116
127,-0.34962
128,-0.33797
129,-0.32781
130,-0.31848000000000004
131,-0.30935
132,-0.30022
133,-0.29091999999999996
134,-0.28133
135,-0.2715
136,-0.26400999999999997
137,-0.25699
138,-0.25026
139,-0.24359
140,-0.23671999999999999
141,-0.22951
142,-0.22249000000000002
143,-0.21727
144,-0.21216999999999997
145,-0.20688
146,-0.20103
147,-0.19422
148,-0.18611
149,-0.1776
150,-0.16889
151,-0.15853
152,-0.14598
153,-0.1307
154,-0.11225999999999998
155,-0.09041
156,-0.06672
157,-0.040651
158,-0.011762
159,0.019871
160,0.054091999999999994
161,0.090647
162,0.12916
163,0.16733
164,0.20625
165,0.24573000000000003
166,0.28570999999999996
167,0.32619000000000004
168,0.3672
169,0.40844
170,0.4491
171,0.49025
172,0.5321199999999999
173,0.57496
174,0.61902
175,0.6644899999999999
176,0.71097
177,0.75843
178,0.80743
179,0.8579899999999999
180,0.91004
181,0.96349
182,1.0181
183,1.0732
184,1.1288
185,1.1851
186,1.2417
187,1.2988
188,1.3562
189,1.4141
190,1.472
191,1.5308
192,1.5907
193,1.6519
194,1.7144
195,1.778
196,1.8422
197,1.9065
198,1.9706
199,2.0336
200,2.0946
201,2.1525
202,2.2063
203,2.2547
204,2.2969999999999997
205,2.3329
206,2.3618
207,2.3831
208,2.3967
209,2.4023
210,2.3998
211,2.3896
212,2.3723
213,2.3481
214,2.3174
215,2.2806
216,2.2384
217,2.1906
218,2.1388
219,2.0832
220,2.0245
221,1.963
222,1.8989
223,1.8322
224,1.7628
225,1.6914
226,1.6176
227,1.5413
228,1.4621
229,1.3798
230,1.2937
231,1.2041
232,1.1115
233,1.0161
234,0.91824
235,0.8184899999999999
236,0.71753
237,0.6156699999999999
238,0.51452
239,0.41518999999999995
240,0.31838
241,0.22458000000000003
242,0.1341
243,0.047084
244,-0.037263
245,-0.11775
246,-0.19453
247,-0.26784
248,-0.33785
249,-0.40459
250,-0.4682
251,-0.5286
252,-0.58434
253,-0.63515
254,-0.6809999999999999
255,-0.72216
256,-0.7591399999999999
257,-0.7933399999999999
258,-0.82525
259,-0.85515
260,-0.8842399999999999
261,-0.91365
262,-0.9442299999999999
263,-0.9763200000000001
264,-1.0108
265,-1.0454
266,-1.0788
267,-1.1096
268,-1.1367
269,-1.1591
