time,value
0,-0.27116999999999997
1,-0.46839
2,-0.27116999999999997
3,-0.27116999999999997
4,-0.27116999999999997
5,-0.46839
6,-0.27116999999999997
7,-0.27116999999999997
8,-0.27116999999999997
9,-0.27116999999999997
10,-0.46839
11,-0.27116999999999997
12,-0.27116999999999997
13,-0.27116999999999997
14,-0.46839
15,-0.27116999999999997
16,-0.27116999999999997
17,-0.27116999999999997
18,-0.46839
19,-0.27116999999999997
20,-0.27116999999999997
21,-0.27116999999999997
22,-0.46839
23,-0.27116999999999997
24,-0.27116999999999997
25,-0.27116999999999997
26,-0.46839
27,-0.27116999999999997
28,-0.27116999999999997
29,-0.27116999999999997
30,-0.27116999999999997
31,-0.46839
32,-0.27116999999999997
33,-0.27116999999999997
34,-0.27116999999999997
35,-0.46839
36,-0.27116999999999997
37,-0.27116999999999997
38,-0.27116999999999997
39,-0.46839
40,-0.27116999999999997
41,-0.27116999999999997
42,-0.27116999999999997
43,-0.46839
44,-0.27116999999999997
45,-0.27116999999999997
46,-0.27116999999999997
47,-0.46839
48,-0.27116999999999997
49,-0.27116999999999997
50,-0.27116999999999997
51,-0.46839
52,-0.27116999999999997
53,-0.27116999999999997
54,-0.27116999999999997
55,-0.46839
56,-0.27116999999999997
57,-0.27116999999999997
58,-0.27116999999999997
59,-0.46839
60,-0.27116999999999997
61,-0.27116999999999997
62,-0.27116999999999997
63,-0.46839
64,-0.27116999999999997
65,-0.27116999999999997
66,-0.27116999999999997
67,-0.46839
68,-0.27116999999999997
69,-0.27116999999999997
70,-0.27116999999999997
71,-0.46839
72,-0.27116999999999997
73,-0.27116999999999997
74,-0.27116999999999997
75,-0.27116999999999997
76,-0.46839
77,-0.27116999999999997
78,0.32048000000000004
79,0.12326
80,1.8982
81,3.6732
82,3.6732
83,3.6732
84,3.6732
85,3.6732
86,3.6732
87,1.3066
88,-0.073956
89,-0.073956
90,-0.073956
91,-0.073956
92,-0.073956
93,-0.27116999999999997
94,-0.073956
95,-0.073956
