time,value
0,0.89685
1,0.78859
2,0.6836800000000001
3,0.58412
4,0.51294
5,0.44661999999999996
6,0.38376
7,0.32892
8,0.2931
9,0.23496
10,0.18495999999999999
11,0.13149
12,0.068087
13,0.055090999999999994
14,-0.0043663
15,-0.043532999999999995
16,-0.10294
17,-0.13627
18,-0.17808
19,-0.22458000000000003
20,-0.25061
21,-0.28794000000000003
22,-0.33468000000000003
23,-0.34474
24,-0.36846
25,-0.39773000000000003
26,-0.40981000000000006
27,-0.42705
28,-0.46655
29,-0.45506
30,-0.4838
31,-0.50233
32,-0.5087
33,-0.50946
34,-0.5289
35,-0.52282
36,-0.51884
37,-0.50554
38,-0.52862
39,-0.5219
40,-0.51866
41,-0.51639
42,-0.51737
43,-0.5128
44,-0.48848
45,-0.48666000000000004
46,-0.46525
47,-0.43713
48,-0.43812
49,-0.4114
50,-0.37904
51,-0.3618
52,-0.33802
53,-0.28951
54,-0.27237
55,-0.23089
56,-0.18364
57,-0.14745
58,-0.10357999999999999
59,-0.068375
60,-0.017998
61,0.038829
62,0.06931799999999999
63,0.12918
64,0.17395
65,0.22505
66,0.26811
67,0.31911999999999996
68,0.37569
69,0.43737
70,0.47971
71,0.5303100000000001
72,0.61855
73,0.71101
74,0.81529
75,0.93176
76,1.0582
77,1.1867
78,1.3191
79,1.4542
80,1.5494
81,1.6041
82,1.6433
83,1.6671
84,1.6939
85,1.693
86,1.6665
87,1.6107
88,1.5278
89,1.426
90,1.3165
91,1.2048
92,1.0872
93,0.97326
94,0.85006
95,0.737
96,0.6143
97,0.49183000000000004
98,0.38017
99,0.26931
100,0.14800000000000002
101,0.033527999999999995
102,-0.081798
103,-0.20167000000000002
104,-0.30867
105,-0.4143
106,-0.51853
107,-0.63494
108,-0.73626
109,-0.8354799999999999
110,-0.9479700000000001
111,-1.043
112,-1.1519
113,-1.2416
114,-1.3287
115,-1.4283
116,-1.5079
117,-1.5993
118,-1.6669999999999998
119,-1.7278
120,-1.7811
121,-1.8259
122,-1.8618
123,-1.8963
124,-1.9067
125,-1.9163
126,-1.9263
127,-1.8849
128,-1.8578
129,-1.8209
130,-1.7749
131,-1.7206
132,-1.6544
133,-1.5704
134,-1.4821
135,-1.4044
136,-1.3172
137,-1.2265
138,-1.124
139,-1.0314
140,-0.9205700000000001
141,-0.82329
142,-0.7094
143,-0.60844
144,-0.49218999999999996
145,-0.3883
146,-0.27024000000000004
147,-0.15336
148,-0.044515
149,0.06367
150,0.18425999999999998
151,0.29403
152,0.41551000000000005
153,0.5363399999999999
154,0.64881
155,0.77122
156,0.89384
157,1.0068
158,1.1299
159,1.2437
160,1.3579
161,1.4638
162,1.5454
163,1.6069
164,1.617
165,1.6314
166,1.6371
167,1.6449
168,1.6208
169,1.5752
170,1.5187
171,1.4419
172,1.3681
173,1.2456
174,1.1171
175,1.015
