time,value
0,-0.95815
1,-0.95815
2,-0.95815
3,-0.40292
4,1.2628
5,1.2628
6,0.1523
7,-0.95815
8,-0.95815
9,-0.95815
10,-0.95815
11,-0.95815
12,0.42991
13,1.2628
14,1.2628
15,-0.31039
16,-0.95815
17,-0.95815
18,-0.95815
19,-0.95815
20,-0.95815
21,0.70753
22,1.2628
23,1.2628
24,-0.40292
25,-0.95815
26,-0.95815
27,-0.95815
28,-0.95815
29,0.33738
30,1.2628
31,1.1702
32,0.33738
33,-0.95815
34,-0.95815
35,-0.95815
36,1.3553
37,1.2628
38,1.1702
39,-0.77308
40,-0.95815
41,-0.95815
42,-0.12531
43,1.2628
44,1.2628
45,-0.032774
46,-0.95815
47,-0.95815
48,-0.31039
49,1.2628
50,1.2628
51,-0.12531
52,-0.95815
53,-0.95815
54,-0.95815
55,0.98514
56,1.3553
57,0.6149899999999999
58,-0.95815
59,-0.95815
60,-0.95815
61,-0.6805399999999999
62,1.3553
63,1.4478
64,1.1702
65,0.98514
66,-0.95815
67,-0.95815
68,-0.77308
69,1.3553
70,1.3553
71,1.2628
72,1.2628
73,-0.21785
74,-0.95815
75,-0.95815
76,0.52245
77,1.3553
78,1.2628
79,0.52245
80,-0.95815
81,-0.95815
82,-0.95815
83,0.80007
84,1.2628
85,1.3553
86,-0.588
87,-0.95815
88,-0.95815
89,-0.95815
90,0.1523
91,1.3553
92,1.2628
93,1.1702
94,-0.95815
95,-0.95815
