time,value
0,0.81112
1,1.9251
2,-0.97125
3,-0.97125
4,-0.97125
5,0.031331
6,0.031331
7,-0.97125
8,-0.52566
9,0.58832
10,1.4795
11,0.47691999999999996
12,-0.97125
13,-0.97125
14,0.69972
15,-0.97125
16,-0.97125
17,-0.97125
18,1.1453
19,0.25413
20,1.4795
21,-0.97125
22,-0.97125
23,-0.97125
24,0.9225200000000001
25,-0.97125
26,-0.97125
27,0.14273
28,0.36551999999999996
29,2.0365
30,-0.52566
31,-0.97125
32,0.25413
33,-0.19147
34,-0.97125
35,0.9225200000000001
36,1.1453
37,-0.41426
38,0.47691999999999996
39,-0.97125
40,-0.97125
41,0.9225200000000001
42,-0.97125
43,1.0339
44,1.0339
45,-0.97125
46,-0.97125
47,0.9225200000000001
48,-0.97125
49,-0.97125
50,0.9225200000000001
51,1.0339
52,1.8137
53,-0.97125
54,-0.97125
55,-0.19147
56,0.25413
57,-0.97125
58,-0.97125
59,0.9225200000000001
60,0.81112
61,1.9251
62,-0.97125
63,-0.97125
64,-0.74846
65,0.81112
66,-0.97125
67,-0.97125
68,0.47691999999999996
69,0.25413
70,2.1479
71,-0.19147
72,-0.97125
73,-0.97125
74,0.58832
75,-0.30286
76,-0.97125
77,2.2593
78,0.36551999999999996
79,0.36551999999999996
80,-0.19147
81,-0.97125
82,0.36551999999999996
83,-0.080067
84,2.2593
85,0.36551999999999996
86,-0.97125
87,0.36551999999999996
88,-0.30286
89,-0.97125
90,-0.97125
91,1.3681
92,2.0365
93,-0.080067
94,-0.97125
95,0.81112
