time,value
0,-0.2586
1,-0.2586
2,-0.2586
3,-0.2586
4,-0.2586
5,-0.2586
6,-0.2586
7,-0.2586
8,-0.2586
9,-0.2586
10,-0.2586
11,-0.2586
12,-0.2586
13,-0.2586
14,-0.2586
15,-0.2586
16,-0.2586
17,-0.2586
18,-0.2586
19,-0.2586
20,-0.2586
21,-0.2586
22,-0.2586
23,-0.2586
24,-0.2586
25,-0.2586
26,-0.2586
27,-0.2586
28,-0.2586
29,4.2332
30,1.0938
31,-0.2586
32,-0.2586
33,-0.2586
34,-0.2586
35,-0.2586
36,-0.2586
37,-0.2586
38,-0.2586
39,-0.2586
40,-0.2586
41,-0.2586
42,-0.2586
43,-0.2586
44,-0.2586
45,-0.2586
46,-0.2586
47,-0.2586
48,-0.2586
49,-0.2586
50,-0.2586
51,-0.2586
52,-0.2586
53,-0.2586
54,-0.2586
55,-0.2586
56,-0.2586
57,-0.2586
58,-0.2586
59,-0.2586
60,-0.2586
61,-0.2586
62,-0.2586
63,-0.2586
64,-0.2586
65,-0.2586
66,-0.2586
67,-0.2586
68,5.4407
69,-0.2586
70,-0.2586
71,-0.2586
72,-0.2586
73,-0.2586
74,-0.2586
75,-0.2586
76,3.2672
77,1.8183
78,-0.2586
79,-0.2586
80,-0.017106
81,4.5713
82,-0.2586
83,-0.2586
84,-0.2586
85,-0.2586
86,-0.2586
87,-0.2586
88,-0.2586
89,-0.2586
90,-0.2586
91,-0.2586
92,2.3495
93,-0.2586
94,-0.2586
95,-0.2586
