time,value
0,-0.14428
1,-0.14428
2,-0.14428
3,-0.14428
4,-0.14428
5,-0.14428
6,-0.14428
7,-0.14428
8,-0.14428
9,-0.14428
10,-0.14428
11,-0.14428
12,-0.14428
13,-0.14428
14,-0.14428
15,-0.14428
16,6.0459
17,-0.14428
18,-0.14428
19,-0.14428
20,-0.14428
21,-0.14428
22,-0.14428
23,-0.14428
24,-0.14428
25,-0.14428
26,-0.14428
27,7.516
28,-0.14428
29,-0.14428
30,-0.14428
31,-0.14428
32,-0.14428
33,-0.14428
34,-0.14428
35,-0.14428
36,-0.14428
37,-0.14428
38,-0.14428
39,-0.14428
40,-0.14428
41,-0.14428
42,-0.14428
43,-0.14428
44,-0.14428
45,-0.14428
46,-0.14428
47,-0.14428
48,-0.14428
49,-0.14428
50,-0.14428
51,-0.14428
52,-0.14428
53,-0.14428
54,-0.14428
55,-0.14428
56,-0.14428
57,-0.14428
58,-0.14428
59,-0.14428
60,-0.14428
61,-0.14428
62,-0.14428
63,-0.14428
64,-0.14428
65,-0.14428
66,-0.14428
67,-0.14428
68,-0.14428
69,-0.14428
70,-0.14428
71,-0.14428
72,-0.14428
73,-0.14428
74,-0.14428
75,-0.14428
76,-0.14428
77,-0.14428
78,-0.14428
79,-0.14428
80,-0.14428
81,-0.14428
82,-0.14428
83,-0.14428
84,-0.14428
85,-0.14428
86,-0.14428
87,-0.14428
88,-0.14428
89,-0.14428
90,-0.14428
91,-0.14428
92,-0.14428
93,-0.14428
94,-0.14428
95,-0.14428
