[<text>
<title>gts corp &lt;gtsc&gt; 4th qtr dec 31 loss</title>
<dateline>    houston, march 13 -
    </dateline>shr loss 48 cts vs loss 10 cts
    net loss 1,234,000 vs loss 259,000
    revs 715,000 vs 1,941,000
    year
    shr loss 1.26 dlrs vs loss 34 cts
    net loss 3,229,000 vs loss 870,000
    revs 3,001,000 vs 9,767,000
    note: 1986 net both periods includes 672,300 dlr writedown
of value of seismic laboratory and 165,000 dlr increase in
reserve for doubtful accounts.
 reuter
</text>]