time,value
0,-0.46353
1,0.9416899999999999
2,-0.46353
3,-0.9319299999999999
4,0.9416899999999999
5,-0.46353
6,-0.9319299999999999
7,0.9416899999999999
8,-0.46353
9,-0.9319299999999999
10,0.9416899999999999
11,-0.46353
12,-0.9319299999999999
13,0.47329
14,0.0048792
15,-0.9319299999999999
16,0.47329
17,0.0048792
18,-0.9319299999999999
19,0.47329
20,-0.46353
21,-0.46353
22,0.47329
23,-0.46353
24,-0.46353
25,0.47329
26,-0.9319299999999999
27,-0.46353
28,0.9416899999999999
29,-1.8687
30,0.0048792
31,0.47329
32,-1.8687
33,0.47329
34,0.9416899999999999
35,0.0048792
36,-1.8687
37,0.9416899999999999
38,0.47329
39,-1.8687
40,0.9416899999999999
41,0.47329
42,-1.8687
43,0.9416899999999999
44,0.9416899999999999
45,0.9416899999999999
46,-1.8687
47,0.9416899999999999
48,0.9416899999999999
49,0.9416899999999999
50,-1.8687
51,0.47329
52,0.9416899999999999
53,0.9416899999999999
54,-0.9319299999999999
55,0.0048792
56,0.9416899999999999
57,0.9416899999999999
58,-0.46353
59,-0.46353
60,0.9416899999999999
61,0.9416899999999999
62,0.0048792
63,-0.9319299999999999
64,0.9416899999999999
65,0.9416899999999999
66,0.47329
67,-1.8687
68,0.9416899999999999
69,0.9416899999999999
70,0.9416899999999999
71,-1.8687
72,0.47329
73,0.9416899999999999
74,0.9416899999999999
75,-1.8687
76,0.47329
77,0.9416899999999999
78,0.9416899999999999
79,-1.8687
80,0.0048792
81,0.9416899999999999
82,0.9416899999999999
83,-1.8687
84,0.47329
85,0.47329
86,0.9416899999999999
87,-1.8687
88,0.9416899999999999
89,0.9416899999999999
90,0.47329
91,-1.8687
92,0.47329
93,0.9416899999999999
94,-0.9319299999999999
95,0.0048792
