time,value
0,-0.13928
1,-0.13928
2,-0.13928
3,-0.13928
4,-0.13928
5,-0.13928
6,-0.13928
7,-0.13928
8,-0.13928
9,-0.13928
10,-0.13928
11,-0.13928
12,-0.13928
13,-0.13928
14,-0.13928
15,-0.13928
16,-0.13928
17,-0.13928
18,-0.13928
19,-0.13928
20,-0.13928
21,-0.13928
22,-0.13928
23,-0.13928
24,-0.13928
25,-0.13928
26,-0.13928
27,-0.13928
28,-0.13928
29,-0.13928
30,-0.13928
31,-0.13928
32,-0.13928
33,-0.13928
34,-0.13928
35,-0.13928
36,-0.13928
37,-0.13928
38,-0.13928
39,-0.13928
40,-0.13928
41,-0.13928
42,-0.13928
43,-0.13928
44,-0.13928
45,-0.13928
46,-0.13928
47,-0.13928
48,-0.13928
49,-0.13928
50,-0.13928
51,-0.13928
52,-0.13928
53,-0.13928
54,-0.13928
55,-0.13928
56,-0.13928
57,-0.13928
58,-0.13928
59,-0.13928
60,-0.13928
61,-0.13928
62,-0.13928
63,-0.13928
64,-0.13928
65,-0.13928
66,-0.13928
67,-0.13928
68,-0.13928
69,-0.13928
70,-0.13928
71,-0.13928
72,-0.13928
73,-0.13928
74,-0.13928
75,-0.13928
76,-0.13928
77,-0.13928
78,-0.13928
79,-0.13928
80,-0.13928
81,8.4787
82,4.6139
83,-0.13928
84,-0.13928
85,-0.13928
86,-0.13928
87,-0.13928
88,-0.13928
89,-0.13928
90,-0.13928
91,-0.13928
92,-0.13928
93,-0.13928
94,-0.13928
95,-0.13928
