time,value
0,2.2817
1,-0.20743000000000003
2,-0.20743000000000003
3,-0.20743000000000003
4,-0.20743000000000003
5,2.2817
6,-0.20743000000000003
7,-0.20743000000000003
8,-0.20743000000000003
9,2.2817
10,-0.20743000000000003
11,-0.20743000000000003
12,2.2817
13,-0.20743000000000003
14,-0.20743000000000003
15,-0.20743000000000003
16,2.2817
17,-0.20743000000000003
18,-0.20743000000000003
19,2.2817
20,-0.20743000000000003
21,-0.20743000000000003
22,-0.20743000000000003
23,-0.20743000000000003
24,-0.20743000000000003
25,-0.20743000000000003
26,-0.20743000000000003
27,2.2817
28,-0.20743000000000003
29,-0.20743000000000003
30,-0.20743000000000003
31,-2.6965
32,-0.20743000000000003
33,-0.20743000000000003
34,-0.20743000000000003
35,-0.20743000000000003
36,2.2817
37,-0.20743000000000003
38,-0.20743000000000003
39,-0.20743000000000003
40,-0.20743000000000003
41,-0.20743000000000003
42,-0.20743000000000003
43,-0.20743000000000003
44,-0.20743000000000003
45,-0.20743000000000003
46,-0.20743000000000003
47,-2.6965
48,-0.20743000000000003
49,-0.20743000000000003
50,-0.20743000000000003
51,-0.20743000000000003
52,-0.20743000000000003
53,-0.20743000000000003
54,-0.20743000000000003
55,-0.20743000000000003
56,-0.20743000000000003
57,-0.20743000000000003
58,-0.20743000000000003
59,-0.20743000000000003
60,-0.20743000000000003
61,-0.20743000000000003
62,-0.20743000000000003
63,-0.20743000000000003
64,-0.20743000000000003
65,-2.6965
66,-0.20743000000000003
67,-0.20743000000000003
68,-0.20743000000000003
69,-0.20743000000000003
70,2.2817
71,-0.20743000000000003
72,-0.20743000000000003
73,-2.6965
74,-0.20743000000000003
75,2.2817
76,-0.20743000000000003
77,-0.20743000000000003
78,-0.20743000000000003
79,-0.20743000000000003
80,-0.20743000000000003
81,2.2817
82,2.2817
83,-0.20743000000000003
84,-0.20743000000000003
85,-0.20743000000000003
86,-0.20743000000000003
87,-0.20743000000000003
88,-0.20743000000000003
89,-0.20743000000000003
90,-0.20743000000000003
91,-0.20743000000000003
92,-0.20743000000000003
93,-0.20743000000000003
94,-0.20743000000000003
95,-0.20743000000000003
