time,value
0,1.1401
1,1.033
2,1.1639
3,1.234
4,1.4327
5,1.2473
6,1.234
7,1.4
8,1.3642
9,1.2272
10,1.1913
11,1.1554
12,1.119
13,1.09
14,1.1475
15,1.0734
16,1.1932
17,1.2025
18,1.1315
19,1.1194
20,1.0495
21,0.91976
22,0.9540299999999999
23,1.0637
24,0.86088
25,0.07045499999999999
26,-0.27434000000000003
27,-0.44261999999999996
28,-0.47861000000000004
29,-0.57026
30,-1.0669
31,-1.1121
32,-1.5716
33,-2.1393
34,-2.4972
35,-2.6313
36,-2.7433
37,-2.6726
38,-2.8032
39,-2.6776
40,-2.1455
41,-2.0949
42,-2.1178
43,-1.7983
44,-1.3908
45,-1.3417
46,-1.068
47,-0.52581
48,-0.50581
49,-0.49412
50,-0.12984
51,-0.22009
52,-0.042165
53,0.37978
54,0.29425999999999997
55,-0.20081
56,-0.10131
57,-0.21566
58,-0.30009
59,-0.53066
60,-0.6618
61,0.071779
62,-0.34712
63,-0.93505
64,-0.8948
65,-0.57714
66,-0.4949
67,-0.70634
68,-0.83081
69,-0.8542299999999999
70,-0.90846
71,-0.7319899999999999
72,-0.62142
73,-0.74827
74,-0.80896
75,-0.86887
76,-0.9806299999999999
77,-0.88569
78,-0.89395
79,-0.8725
80,-0.69502
81,-0.82255
82,-0.8215600000000001
83,-0.7518699999999999
84,-0.703
85,-0.7763
86,-0.8519200000000001
87,-0.9371200000000001
88,-0.9101299999999999
89,-0.7420100000000001
90,-0.6884
91,-0.6267199999999999
92,-0.66968
93,-0.60736
94,-0.48844
95,-0.56753
96,-0.6141
97,-0.66676
98,-0.60464
99,-0.5415300000000001
100,-0.53963
101,-0.56279
102,-0.59446
103,-0.63743
104,-0.5384899999999999
105,-0.5475800000000001
106,-0.48168999999999995
107,-0.50538
108,-0.52858
109,-0.61742
110,-0.55281
111,-0.6097
112,-0.47373000000000004
113,-0.52049
114,-0.44622
115,-0.48508
116,-0.77533
117,-0.40814
118,-0.24153000000000002
119,-0.18639
120,-0.045781999999999996
121,0.10814000000000001
122,0.39035
123,0.3441
124,-0.22596999999999998
125,-0.13863
126,-0.069222
127,-0.35349
128,-0.2966
129,-0.71281
130,-1.4722
131,-1.8881
132,-2.0252
133,-1.5809
134,-1.41
135,-1.6854
136,-2.1859
137,-3.2319
138,-3.5359
139,-3.3894
140,-2.8927
141,-3.0601
142,-2.7682
143,-2.045
144,-1.7104
145,-1.4309
146,-1.4358
147,-1.2585
148,-1.0459
149,-1.0821
150,-0.9051799999999999
151,-0.6630199999999999
152,-0.43858
153,-0.22896999999999998
154,0.0043244
155,0.21325
156,0.62622
157,0.8157399999999999
158,0.56506
159,0.27301
160,0.06335
161,0.49601999999999996
162,0.68648
163,0.70282
164,0.5828399999999999
165,0.52179
166,0.58987
167,0.6672600000000001
168,0.71365
169,0.61866
170,0.38956999999999997
171,0.44601
172,0.35775999999999997
173,0.37383
174,0.37094
175,0.36117
176,0.35502
177,0.34818000000000005
178,0.32213
179,0.31894
180,0.3385
181,0.37225
182,0.43805
183,0.52932
184,0.59753
185,0.6372800000000001
186,0.9276700000000001
187,0.90309
188,0.7508699999999999
189,0.78154
190,0.64303
191,0.6707
192,0.66195
193,0.56802
194,0.57804
195,0.56934
196,0.58307
197,0.63615
198,0.66627
199,0.59723
200,0.68043
201,0.7935399999999999
202,0.78377
203,0.82819
204,0.8378200000000001
205,0.80613
206,0.64374
207,0.69982
208,0.64652
209,0.67519
210,0.67183
211,0.69519
212,0.6969
213,0.66394
214,0.49799
215,0.47828000000000004
216,0.48915
217,0.63188
218,0.5989
219,0.6009800000000001
220,0.63567
221,0.6320100000000001
222,0.61016
223,0.74667
224,0.64891
225,0.6543
226,0.6486
227,0.63918
228,0.64968
229,0.6460100000000001
230,0.6514300000000001
231,0.6460899999999999
232,0.79277
233,0.6572399999999999
234,0.65591
235,0.65715
236,0.77683
237,0.6142
238,0.77066
239,0.76337
240,0.60337
241,0.7572
242,0.56224
243,0.48405
244,0.44822
245,0.44043999999999994
246,0.49341999999999997
247,0.5645600000000001
248,0.61985
249,0.78354
250,0.78772
251,0.7833600000000001
252,0.79237
253,0.97434
254,0.7836
255,0.77851
256,0.6846899999999999
257,0.8032199999999999
258,0.7964399999999999
259,0.7904100000000001
260,0.7961199999999999
261,0.8027
262,0.70623
263,0.79593
264,0.62154
265,0.60446
266,0.76321
267,0.77242
268,0.7790600000000001
269,0.78067
270,0.6090300000000001
271,0.60875
272,0.6773899999999999
273,0.61264
274,0.6181800000000001
275,0.61666
276,0.61161
277,0.78362
278,0.7762100000000001
279,0.7632
280,0.72548
281,0.59682
282,0.59128
283,0.62583
284,0.7674300000000001
285,0.7713899999999999
286,0.73388
287,0.5947899999999999
288,0.73783
289,0.7542300000000001
290,0.74232
291,0.5858
292,0.7239300000000001
293,0.74002
294,0.5870000000000001
295,0.5978100000000001
296,0.58054
297,0.7497199999999999
298,0.74305
299,0.74225
