time,value
0,-0.77444
1,0.21905
2,1.7093
3,1.5437
4,0.38463
5,-0.77444
6,-0.77444
7,-0.77444
8,-0.77444
9,-0.77444
10,1.3781
11,1.5437
12,1.047
13,-0.77444
14,-0.77444
15,-0.77444
16,-0.77444
17,-0.77444
18,-0.11210999999999999
19,1.8749
20,1.3781
21,-0.44327
22,-0.77444
23,-0.77444
24,-0.77444
25,-0.77444
26,-0.77444
27,1.2125
28,1.5437
29,0.38463
30,-0.77444
31,-0.77444
32,-0.77444
33,-0.77444
34,-0.77444
35,0.053469
36,1.7093
37,1.3781
38,-0.11210999999999999
39,-0.77444
40,-0.77444
41,-0.77444
42,-0.77444
43,-0.77444
44,1.047
45,1.7093
46,0.8813700000000001
47,-0.77444
48,-0.77444
49,-0.77444
50,-0.77444
51,-0.77444
52,-0.77444
53,1.8749
54,1.5437
55,1.3781
56,-0.11210999999999999
57,-0.77444
58,-0.77444
59,-0.77444
60,-0.77444
61,-0.77444
62,1.8749
63,1.5437
64,0.38463
65,-0.77444
66,-0.77444
67,-0.77444
68,-0.77444
69,-0.77444
70,0.5502100000000001
71,1.7093
72,1.047
73,-0.77444
74,-0.77444
75,-0.77444
76,-0.77444
77,-0.77444
78,0.7157899999999999
79,1.7093
80,1.3781
81,0.38463
82,-0.77444
83,-0.77444
84,-0.77444
85,-0.77444
86,0.8813700000000001
87,1.5437
88,1.3781
89,0.053469
90,-0.77444
91,-0.77444
92,-0.77444
93,-0.77444
94,0.8813700000000001
95,1.5437
