time,value
0,-0.25389
1,-0.25389
2,-0.25389
3,-0.25389
4,-0.25389
5,-0.25389
6,-0.25389
7,-0.25389
8,-0.25389
9,-0.25389
10,-0.25389
11,-0.25389
12,-0.25389
13,-0.25389
14,-0.25389
15,-0.25389
16,-0.25389
17,-0.25389
18,-0.25389
19,-0.25389
20,-0.25389
21,-0.25389
22,-0.25389
23,-0.25389
24,-0.25389
25,-0.25389
26,-0.25389
27,-0.25389
28,-0.25389
29,-0.25389
30,-0.25389
31,-0.25389
32,-0.25389
33,-0.25389
34,-0.25389
35,-0.25389
36,-0.25389
37,-0.25389
38,-0.25389
39,-0.25389
40,6.0607
41,0.24886
42,0.14831
43,-0.25389
44,-0.25389
45,-0.25389
46,-0.25389
47,-0.25389
48,-0.25389
49,-0.25389
50,-0.25389
51,-0.25389
52,-0.25389
53,-0.25389
54,-0.25389
55,-0.25389
56,-0.25389
57,-0.25389
58,-0.25389
59,-0.25389
60,2.8028
61,1.556
62,0.5102899999999999
63,-0.25389
64,-0.25389
65,-0.25389
66,-0.25389
67,-0.25389
68,-0.25389
69,-0.25389
70,-0.25389
71,-0.25389
72,-0.25389
73,-0.25389
74,-0.25389
75,-0.25389
76,-0.25389
77,-0.25389
78,5.1959
79,0.40973999999999994
80,0.10809
81,-0.25389
82,-0.25389
83,-0.25389
84,-0.25389
85,-0.25389
86,3.8687
87,0.18853
88,0.22875
89,-0.25389
90,-0.25389
91,-0.25389
92,-0.25389
93,-0.25389
94,-0.25389
95,-0.25389
