time,value
0,-0.46258
1,-0.27831
2,-0.27831
3,-0.27831
4,-0.46258
5,-0.27831
6,-0.27831
7,-0.27831
8,-0.46258
9,-0.27831
10,-0.27831
11,-0.27831
12,-0.46258
13,-0.27831
14,-0.27831
15,-0.27831
16,-0.27831
17,-0.46258
18,-0.27831
19,-0.27831
20,-0.27831
21,-0.46258
22,-0.27831
23,-0.27831
24,-0.27831
25,-0.46258
26,-0.27831
27,-0.27831
28,-0.27831
29,-0.27831
30,-0.46258
31,-0.27831
32,-0.27831
33,-0.27831
34,-0.46258
35,-0.27831
36,-0.27831
37,-0.27831
38,-0.46258
39,-0.27831
40,-0.27831
41,-0.27831
42,-0.46258
43,-0.27831
44,-0.27831
45,-0.27831
46,-0.46258
47,-0.27831
48,-0.27831
49,-0.27831
50,-0.46258
51,-0.27831
52,-0.27831
53,-0.27831
54,-0.46258
55,-0.27831
56,-0.27831
57,-0.27831
58,-0.46258
59,-0.27831
60,-0.27831
61,-0.27831
62,-0.46258
63,-0.27831
64,-0.27831
65,-0.27831
66,-0.46258
67,-0.27831
68,-0.27831
69,-0.27831
70,-0.27831
71,-0.27831
72,-0.27831
73,-0.27831
74,-0.27831
75,-0.27831
76,-0.27831
77,-0.27831
78,-0.27831
79,-0.27831
80,1.5643
81,3.5912
82,3.407
83,3.407
84,3.407
85,1.3801
86,0.090212
87,0.27448
88,3.7755
89,3.7755
90,2.3014
91,-0.27831
92,-0.27831
93,-0.46258
94,-0.27831
95,-0.27831
