time,value
0,-0.36025
1,-0.36025
2,-0.36025
3,-0.36025
4,-0.36025
5,-0.36025
6,-0.36025
7,-0.36025
8,-0.36025
9,-0.36025
10,-0.36025
11,-0.36025
12,-0.36025
13,-0.36025
14,-0.36025
15,-0.36025
16,-0.36025
17,-0.36025
18,-0.36025
19,-0.36025
20,-0.36025
21,-0.36025
22,-0.36025
23,-0.36025
24,-0.36025
25,-0.36025
26,-0.36025
27,-0.36025
28,-0.36025
29,-0.36025
30,-0.36025
31,-0.36025
32,-0.36025
33,-0.36025
34,-0.36025
35,-0.36025
36,-0.36025
37,-0.36025
38,-0.36025
39,-0.36025
40,-0.36025
41,-0.36025
42,-0.36025
43,-0.36025
44,-0.36025
45,-0.36025
46,1.1246
47,-0.33374000000000004
48,-0.36025
49,-0.36025
50,-0.36025
51,-0.36025
52,-0.36025
53,-0.36025
54,-0.36025
55,-0.36025
56,-0.36025
57,-0.36025
58,-0.36025
59,-0.36025
60,0.13469
61,-0.36025
62,-0.36025
63,-0.36025
64,2.9453
65,1.5223
66,1.0715
67,1.0185
68,1.0008
69,4.0589
70,2.1852
71,3.0955
72,5.8707
73,2.1852
74,0.22307
75,-0.086265
76,0.11700999999999999
77,-0.095103
78,-0.10394
79,0.072824
80,-0.086265
81,-0.095103
82,-0.015559
83,0.0021175
84,-0.11277999999999999
85,-0.12162
86,-0.36025
87,-0.36025
88,-0.36025
89,-0.36025
90,-0.36025
91,-0.36025
92,-0.36025
93,-0.36025
94,-0.36025
95,-0.36025
