time,value
0,-1.3564
1,-1.3564
2,-1.3564
3,-1.3564
4,-1.3564
5,-1.3564
6,-1.3564
7,-1.3564
8,0.92806
9,1.1267
10,1.0274
11,0.8287399999999999
12,0.72941
13,0.8287399999999999
14,0.6300899999999999
15,0.72941
16,0.72941
17,0.6300899999999999
18,0.72941
19,0.6300899999999999
20,0.6300899999999999
21,0.72941
22,0.6300899999999999
23,0.6300899999999999
24,-0.5618
25,-1.3564
26,-1.3564
27,-1.3564
28,-1.3564
29,-1.3564
30,-1.3564
31,-1.3564
32,-1.3564
33,-0.16451
34,1.226
35,1.0274
36,0.8287399999999999
37,0.8287399999999999
38,0.72941
39,0.72941
40,0.72941
41,0.72941
42,0.6300899999999999
43,0.72941
44,0.6300899999999999
45,0.6300899999999999
46,0.6300899999999999
47,0.72941
48,0.6300899999999999
49,0.6300899999999999
50,0.6300899999999999
51,0.6300899999999999
52,0.6300899999999999
53,0.72941
54,0.6300899999999999
55,-0.065182
56,-1.3564
57,-1.3564
58,-1.3564
59,-1.3564
60,-1.3564
61,-1.3564
62,-1.3564
63,-1.3564
64,-0.9591
65,1.226
66,1.1267
67,0.8287399999999999
68,0.8287399999999999
69,0.72941
70,0.72941
71,0.72941
72,0.6300899999999999
73,0.72941
74,0.6300899999999999
75,0.6300899999999999
76,0.72941
77,0.6300899999999999
78,0.72941
79,0.6300899999999999
80,0.6300899999999999
81,0.6300899999999999
82,-1.0584
83,-1.3564
84,-1.3564
85,-1.3564
86,-1.3564
87,-1.3564
88,-1.3564
89,-1.3564
90,0.034143
91,1.1267
92,1.0274
93,0.8287399999999999
94,0.8287399999999999
95,0.72941
