time,value
0,-0.26589
1,-0.26589
2,-0.26589
3,-0.26589
4,-0.26589
5,-0.26589
6,-0.26589
7,-0.26589
8,-0.26589
9,-0.26589
10,-0.26589
11,-0.26589
12,-0.26589
13,-0.26589
14,-0.26589
15,-0.26589
16,-0.26589
17,-0.26589
18,-0.26589
19,-0.26589
20,-0.26589
21,-0.26589
22,-0.26589
23,-0.26589
24,-0.26589
25,-0.26589
26,-0.26589
27,-0.26589
28,-0.26589
29,-0.26589
30,-0.26589
31,-0.26589
32,-0.26589
33,-0.26589
34,-0.26589
35,-0.26589
36,-0.26589
37,-0.26589
38,-0.26589
39,-0.26589
40,-0.26589
41,-0.26589
42,-0.26589
43,-0.26589
44,-0.26589
45,-0.26589
46,-0.26589
47,-0.26589
48,0.20139
49,-0.26589
50,-0.26589
51,-0.26589
52,-0.26589
53,-0.26589
54,-0.26589
55,-0.26589
56,-0.26589
57,-0.26589
58,-0.26589
59,-0.26589
60,-0.26589
61,-0.26589
62,-0.26589
63,-0.26589
64,-0.26589
65,3.3702
66,5.5752
67,3.7352
68,3.633
69,3.487
70,2.4794
71,0.9169200000000001
72,-0.26589
73,-0.26589
74,-0.26589
75,-0.26589
76,-0.26589
77,-0.26589
78,-0.26589
79,-0.26589
80,-0.26589
81,-0.26589
82,-0.26589
83,-0.26589
84,-0.26589
85,-0.26589
86,-0.26589
87,-0.26589
88,-0.26589
89,-0.26589
90,-0.26589
91,-0.26589
92,-0.26589
93,-0.26589
94,-0.26589
95,-0.26589
