time,value
0,-1.2479
1,1.4956
2,-0.5163
3,-0.8820899999999999
4,0.9468700000000001
5,-1.6137
6,0.032388
7,0.39818000000000003
8,-1.2479
9,1.1298
10,-0.5163
11,-0.69919
12,1.1298
13,-0.8820899999999999
14,-0.15050999999999998
15,0.21528000000000003
16,-1.065
17,0.7639699999999999
18,-0.69919
19,-1.065
20,0.58107
21,-1.2479
22,-0.15050999999999998
23,0.39818000000000003
24,-1.2479
25,0.9468700000000001
26,0.032388
27,-1.065
28,1.4956
29,0.58107
30,0.21528000000000003
31,2.0442
32,-0.69919
33,1.4956
34,0.21528000000000003
35,-0.69919
36,1.8613
37,-0.5163
38,-0.5163
39,1.4956
40,-1.065
41,0.032388
42,1.3127
43,-0.8820899999999999
44,0.39818000000000003
45,0.21528000000000003
46,-1.2479
47,0.7639699999999999
48,-0.69919
49,-0.8820899999999999
50,0.9468700000000001
51,-1.2479
52,-0.15050999999999998
53,0.032388
54,-1.4308
55,0.21528000000000003
56,-0.5163
57,-1.065
58,0.39818000000000003
59,-1.065
60,-0.3334
61,0.032388
62,-1.2479
63,0.21528000000000003
64,-0.15050999999999998
65,-1.2479
66,0.032388
67,-0.3334
68,-1.2479
69,0.39818000000000003
70,-0.69919
71,-0.8820899999999999
72,1.6784
73,-0.69919
74,-0.15050999999999998
75,0.032388
76,-0.5163
77,0.7639699999999999
78,-0.15050999999999998
79,-0.5163
80,1.6784
81,3.8732
82,0.21528000000000003
83,1.3127
84,1.4956
85,-0.5163
86,1.4956
87,0.58107
88,-0.5163
89,1.4956
90,-0.69919
91,0.7639699999999999
92,-0.15050999999999998
93,-0.69919
94,0.7639699999999999
95,-0.8820899999999999
