time,value
0,1.7224
1,1.66
2,1.5848
3,1.4865
4,1.3984
5,1.3197
6,1.3730000000000002
7,1.2847
8,1.3306
9,1.2789
10,1.2245
11,1.1458
12,1.0606
13,1.0343
14,0.94227
15,0.8978700000000001
16,0.8739299999999999
17,0.8234899999999999
18,0.78435
19,0.74421
20,0.70065
21,0.63394
22,0.59122
23,0.54819
24,0.4705
25,0.41223000000000004
26,0.38813000000000003
27,0.40712
28,0.34858
29,0.24875
30,0.14661
31,0.06829199999999999
32,0.01215
33,0.087848
34,0.13765
35,0.17187
36,0.19644
37,0.26934
38,0.34848
39,0.43188999999999994
40,0.56011
41,0.6785899999999999
42,0.74765
43,0.77341
44,0.70792
45,0.63344
46,0.56685
47,0.50873
48,0.43299
49,0.34037
50,0.24750999999999998
51,0.15656
52,0.052135
53,-0.042366
54,-0.10162
55,-0.20162
56,-0.32111
57,-0.46116999999999997
58,-0.58826
59,-0.61285
60,-0.70429
61,-0.80024
62,-0.76125
63,-0.80523
64,-0.8432299999999999
65,-0.92463
66,-0.93063
67,-0.893
68,-0.79542
69,-0.6655399999999999
70,-0.52556
71,-0.40301
72,-0.27093
73,-0.11441
74,0.041158999999999994
75,0.17167000000000002
76,0.30498000000000003
77,0.41976
78,0.56545
79,0.74359
80,0.8973899999999999
81,1.0447
82,1.0745
83,1.0219
84,0.95847
85,0.93176
86,0.8658399999999999
87,0.8214100000000001
88,0.77868
89,0.7265699999999999
90,0.66984
91,0.60726
92,0.5667399999999999
93,0.53952
94,0.52667
95,0.47258
96,0.41862
97,0.34029
98,0.24786
99,0.16718
100,0.086202
101,0.010811
102,-0.044644
103,-0.020441
104,-0.02331
105,-0.087548
106,-0.12618
107,-0.15521
108,-0.17667
109,-0.2152
110,-0.34026999999999996
111,-0.39424000000000003
112,-0.40794
113,-0.45842
114,-0.57128
115,-0.7038399999999999
116,-0.84244
117,-0.94242
118,-0.9487
119,-0.99634
120,-1.0788
121,-1.2074
122,-1.3358
123,-1.4621
124,-1.5762
125,-1.6927
126,-1.746
127,-1.8179
128,-1.8089
129,-1.699
130,-1.56
131,-1.4653
132,-1.339
133,-1.2011
134,-1.0777
135,-0.93845
136,-0.80678
137,-0.66586
138,-0.54813
139,-0.41122
140,-0.28608
141,-0.1489
142,-0.01618
143,0.10824
144,0.24174
145,0.37377
146,0.51567
147,0.63961
148,0.78
149,0.90365
150,1.0349
151,1.1634
152,1.2938
153,1.4291
154,1.5543
155,1.6886
156,1.8133
157,1.9468
158,2.0272
159,1.9423
160,1.8213
161,1.6846
162,1.5629
163,1.4247
164,1.3028
165,1.1673
166,1.041
167,0.90653
168,0.77965
169,0.6421600000000001
170,0.5218
171,0.39224000000000003
172,0.26048000000000004
173,0.13608
174,0.0015133
175,-0.13229000000000002
176,-0.25545999999999996
177,-0.39173
178,-0.52465
179,-0.6470199999999999
180,-0.78919
181,-0.91265
182,-1.0464
183,-1.1825
184,-1.1567
185,-1.0693
186,-0.9823
187,-0.95099
188,-0.9496899999999999
189,-1.0259
190,-1.0779
191,-1.0799
192,-0.9137700000000001
193,-0.77256
194,-0.6490600000000001
195,-0.54657
196,-0.44938
197,-0.35669
198,-0.26052
199,-0.17634
200,-0.12707000000000002
201,-0.11890999999999999
202,-0.09452999999999999
203,-0.065428
204,-0.015489
205,0.051036
206,0.14285
207,0.20854
208,0.29661
209,0.33936
210,0.40695
211,0.46798
212,0.54571
213,0.63035
214,0.69207
215,0.55448
216,0.38118
217,0.20781999999999998
218,0.067083
219,-0.081041
220,-0.23068000000000002
221,-0.37184
222,-0.5247
223,-0.67525
224,-0.81189
225,-0.87916
226,-0.8567299999999999
227,-0.75244
228,-0.6970000000000001
229,-0.65935
230,-0.59895
231,-0.5353100000000001
232,-0.43053
233,-0.33388
234,-0.21874000000000002
235,-0.10187
236,-0.00024098
237,0.11110999999999999
238,0.18596
239,0.21721
240,0.32355
241,0.40993
242,0.48123
243,0.55745
244,0.63549
245,0.7400800000000001
246,0.65599
247,0.54081
248,0.41648999999999997
249,0.29193
250,0.17588
251,0.18332
252,0.25504
253,0.34658
254,0.41062
255,0.50643
256,0.6131300000000001
257,0.6862699999999999
258,0.70867
259,0.76185
260,0.82211
261,0.9036799999999999
262,0.9639
263,1.0403
264,1.1508
265,1.2363
266,1.1572
267,1.0196
268,0.89556
269,0.7661600000000001
270,0.64472
271,0.54027
272,0.43435
273,0.30862
274,0.17686
275,0.038337
276,-0.078177
277,-0.14904
278,-0.21391999999999997
279,-0.27495
280,-0.41012
281,-0.56539
282,-0.69453
283,-0.8318
284,-0.9475399999999999
285,-1.1236
286,-1.2791
287,-1.4340000000000002
288,-1.5548
289,-1.6754
290,-1.7339
291,-1.7779
292,-1.8935
293,-1.8971
294,-1.9463
295,-1.9687
296,-1.9367
297,-1.8736
298,-1.8007
299,-1.6858
300,-1.556
301,-1.4347
302,-1.2981
303,-1.1749
304,-1.0518
305,-0.937
306,-0.84306
307,-0.72529
308,-0.6120399999999999
309,-0.48636999999999997
310,-0.36051
311,-0.23355
312,-0.13205999999999998
313,-0.0078686
314,0.10057
315,0.20481
316,0.302
317,0.32023
318,0.26743
319,0.19971
320,0.14609
321,0.13801
322,0.24428000000000002
323,0.34331
324,0.45563000000000003
325,0.55624
326,0.6484300000000001
327,0.72392
328,0.8410700000000001
329,0.9450299999999999
330,1.0505
331,1.1428
332,1.2481
333,1.3108
334,1.3751
335,1.4695
336,1.5663
337,1.6768
338,1.7721
339,1.8915
340,2.0137
341,2.1281
342,2.1457
343,2.0328
344,1.9139
345,1.8004
346,1.6556
347,1.5131
348,1.3875
349,1.3058
350,1.1949
351,1.0871
352,1.0298
353,0.9545100000000001
354,0.84625
355,0.7169399999999999
356,0.59911
357,0.48482
358,0.36259
359,0.23992
360,0.10570999999999998
361,-0.020069999999999998
362,-0.10438
363,-0.16323
364,-0.12845
365,-0.065838
366,-0.033263
367,-0.088507
368,-0.18462
369,-0.30353
370,-0.40464
371,-0.51418
372,-0.63398
373,-0.75062
374,-0.8698299999999999
375,-0.97831
376,-1.0957
377,-1.2146
378,-1.3215
379,-1.4391
380,-1.6007
381,-1.7135
382,-1.74
383,-1.7529
384,-1.8371
385,-1.9423
386,-2.0765
387,-2.2099
388,-2.314
389,-2.4167
390,-2.4534
391,-2.4601
392,-2.5327
393,-2.4312
394,-2.3232
395,-2.1682
396,-2.0136
397,-1.8822
398,-1.729
399,-1.577
400,-1.3987
401,-1.2501
402,-1.0822
403,-0.9196
404,-0.77094
405,-0.59237
406,-0.46943999999999997
407,-0.32215
408,-0.23044
409,-0.18628
410,-0.14468
411,-0.12819
412,-0.034618
413,0.090485
414,0.21525
415,0.3356
416,0.4775
417,0.61787
418,0.7419600000000001
419,0.83472
420,0.91896
421,1.0316
422,1.1533
423,1.2819
424,1.4124
425,1.5405
426,1.6737
