time,value
0,-0.7073
1,-0.7073
2,1.34
3,1.6812
4,1.5106
5,1.1693
6,-0.7073
7,-0.7073
8,-0.7073
9,-0.7073
10,-0.7073
11,-0.7073
12,-0.7073
13,-0.7073
14,-0.7073
15,0.48693000000000003
16,1.6812
17,1.5106
18,1.5106
19,-0.19548
20,-0.7073
21,-0.7073
22,-0.7073
23,-0.7073
24,-0.7073
25,-0.7073
26,-0.7073
27,-0.7073
28,-0.7073
29,1.34
30,1.5106
31,1.6812
32,1.34
33,-0.36609
34,-0.7073
35,-0.7073
36,-0.7073
37,-0.7073
38,-0.7073
39,-0.7073
40,-0.7073
41,-0.7073
42,1.6812
43,1.6812
44,1.5106
45,-0.19548
46,-0.7073
47,-0.7073
48,-0.7073
49,-0.7073
50,-0.7073
51,-0.7073
52,-0.7073
53,1.1693
54,1.6812
55,1.5106
56,0.65754
57,-0.7073
58,-0.7073
59,-0.7073
60,-0.7073
61,-0.7073
62,-0.7073
63,-0.7073
64,-0.36609
65,1.6812
66,1.6812
67,1.5106
68,-0.024880000000000003
69,-0.7073
70,-0.7073
71,-0.7073
72,-0.7073
73,-0.7073
74,-0.7073
75,-0.7073
76,0.14572000000000002
77,1.6812
78,1.6812
79,1.5106
80,0.31633
81,-0.7073
82,-0.7073
83,-0.7073
84,-0.7073
85,-0.7073
86,-0.7073
87,-0.7073
88,-0.7073
89,1.6812
90,1.5106
91,1.5106
92,1.5106
93,-0.19548
94,-0.7073
95,-0.7073
