time,value
0,-0.16423
1,-0.28438
2,-0.1371
3,-0.053001
4,0.1523
5,-0.044787
6,0.10338
7,-0.039057999999999995
8,-0.09773899999999999
9,-0.07460900000000001
10,0.049937
11,-0.14804
12,-0.05789299999999999
13,-0.091504
14,-0.15483
15,-0.14139000000000002
16,-0.25101
17,-0.25388
18,-0.16848
19,-0.1584
20,-0.22335
21,-0.2086
22,-0.26276
23,-0.3543
24,-0.7854300000000001
25,-1.0501
26,-0.74451
27,-1.0366
28,-0.3772
29,-0.63775
30,-0.63886
31,-0.25398000000000004
32,-0.37761999999999996
33,-1.2605
34,-1.5412
35,-1.3523
36,-1.7398
37,-2.2546
38,-2.3811
39,-2.3661
40,-2.542
41,-2.7265
42,-2.535
43,-2.0675
44,-1.3247
45,-1.0789
46,-0.40542
47,0.31934
48,0.58353
49,0.47289
50,0.40771
51,0.99792
52,1.0424
53,0.91605
54,0.82596
55,0.95096
56,0.88036
57,0.7347199999999999
58,0.8855799999999999
59,1.18
60,1.3319
61,1.6243
62,1.4477
63,1.4104
64,1.2557
65,0.8126800000000001
66,1.1713
67,1.1381
68,4.7779
69,-0.9612200000000001
70,1.4239
71,0.6966399999999999
72,0.8959600000000001
73,1.5723
74,1.7374
75,2.1047
76,1.8254
77,1.1184
78,1.1401
79,0.76582
80,0.52825
81,1.0163
82,1.6107
83,1.8144
84,-1.5278
85,0.7729
86,0.39079
87,0.56097
88,1.0328
89,1.6141
90,1.5948
91,1.2444
92,1.7712
93,1.7148
94,0.99418
95,1.3162
96,1.5412
97,1.1546
98,1.5233
99,1.7008
100,3.0104
101,-0.8075899999999999
102,1.1762
103,1.3246
104,1.5714
105,1.3496
106,1.4751
107,1.621
108,1.4359
109,1.3243
110,0.73922
111,0.64735
112,0.31556
113,0.14507
114,-0.19269
115,-0.38453000000000004
116,-0.33744
117,-0.43163
118,-0.86045
119,-1.1366
120,-1.673
121,-2.0785
122,-2.1894
123,-2.2061
124,-1.9526
125,-1.7422
126,-1.9902
127,-2.0809
128,-2.2030000000000003
129,-2.6069
130,-2.642
131,-2.9139
132,-1.8328
133,-0.782
134,-0.8269700000000001
135,-1.3287
136,-1.4046
137,-0.8231
138,-0.00043547
139,-0.30457
140,-1.0733
141,-1.7819
142,-2.3379
143,-2.2275
144,-2.1288
145,-1.209
146,2.0146
147,1.3286
148,-0.28163
149,-1.8439
150,-1.2323
151,-0.84673
152,-0.035322000000000006
153,-0.25165
154,-0.47107
155,-0.2869
156,-0.25747
157,-0.28195
158,-0.23126
159,0.043592
160,0.39271
161,0.29375
162,0.19985
163,-0.13104000000000002
164,-0.17926
165,-0.21843
166,-0.39521
167,-0.44856999999999997
168,-0.25272
169,-0.31003000000000003
170,-0.07489
171,0.16997
172,0.2626
173,-0.022947
174,-0.41962
175,-0.7942600000000001
176,-0.8864799999999999
177,-0.70629
178,-0.5508
179,-0.38850999999999997
180,-0.38888
181,-0.30144
182,-0.2725
183,-0.1841
184,-0.028899
185,-0.071021
186,-0.092808
187,-0.093028
188,-0.2446
189,-0.038793
190,-0.1753
191,-0.2261
192,-0.082243
193,0.12199000000000002
194,-0.10144
195,-0.11613
196,-0.097143
197,0.018945
198,-0.035155
199,-0.20326
200,-0.33374000000000004
201,-0.18049
202,-0.029886000000000003
203,0.055865
204,0.24181
205,0.089876
206,0.049027999999999995
207,-0.02065
208,0.068587
209,0.13681
210,0.28315999999999997
211,0.17302
212,0.027161
213,-0.011316
214,-0.022009
215,0.17323
216,0.1355
217,0.041167
218,0.072761
219,0.097215
220,0.12805999999999998
221,0.085874
222,-0.10707
223,0.040018
224,0.13471
225,0.035836
226,0.0049601
227,0.058038
228,0.12539
229,0.068975
230,-0.023862
231,-0.016253999999999998
232,0.0013126
233,0.11242
234,0.1857
235,0.28826
236,0.24800999999999998
237,-0.012513
238,0.087538
239,0.16504000000000002
240,0.021815
241,0.1633
242,0.15525
243,0.29406
244,0.12174000000000001
245,0.17959
246,0.20405
247,0.13145
248,0.19608
249,0.35962
250,0.20315999999999998
251,0.1992
252,0.20835
253,0.20672
254,0.19807
255,0.074058
256,0.078903
257,0.22336
258,0.2123
259,0.37603000000000003
260,0.2637
261,0.22273
262,0.21122
263,0.33885
264,0.21311999999999998
265,0.19871
266,0.18132
267,0.23065
268,0.36773
269,0.23459000000000002
270,0.056378
271,0.20513
272,0.21305
273,0.21039000000000002
274,0.38871
275,0.24685
276,0.23969000000000001
277,0.38334
278,0.37840999999999997
279,0.35754
280,0.2235
281,0.37051
282,0.36979
283,0.19305
284,0.20005
285,0.20337
286,0.19457
287,0.36516
288,0.19097
289,0.19541
290,0.010895
291,0.33139
292,0.33676999999999996
293,0.19369
294,0.192
295,0.19287
296,0.35153
297,0.34963
298,0.33916
299,0.33545
