time,value
0,-0.3377
1,-0.07625499999999999
2,-0.3377
3,-0.07625499999999999
4,-0.3377
5,-0.07625499999999999
6,-0.3377
7,-0.07625499999999999
8,-0.3377
9,-0.07625499999999999
10,-0.3377
11,-0.07625499999999999
12,-0.3377
13,-0.07625499999999999
14,-0.3377
15,-0.07625499999999999
16,-0.3377
17,-0.3377
18,-0.07625499999999999
19,-0.3377
20,-0.3377
21,-0.07625499999999999
22,-0.3377
23,-0.07625499999999999
24,-0.3377
25,-0.07625499999999999
26,-0.3377
27,-0.07625499999999999
28,-0.3377
29,-0.07625499999999999
30,-0.3377
31,-0.07625499999999999
32,-0.3377
33,-0.07625499999999999
34,-0.3377
35,-0.07625499999999999
36,-0.3377
37,-0.07625499999999999
38,-0.3377
39,-0.07625499999999999
40,-0.3377
41,-0.07625499999999999
42,-0.3377
43,-0.3377
44,-0.07625499999999999
45,-0.3377
46,-0.3377
47,-0.07625499999999999
48,-0.3377
49,-0.3377
50,-0.07625499999999999
51,-0.3377
52,-0.3377
53,-0.07625499999999999
54,-0.3377
55,-0.3377
56,-0.07625499999999999
57,-0.3377
58,-0.07625499999999999
59,-0.3377
60,-0.3377
61,-0.07625499999999999
62,-0.3377
63,-0.07625499999999999
64,-0.3377
65,-0.3377
66,-0.07625499999999999
67,-0.3377
68,-0.07625499999999999
69,-0.3377
70,-0.3377
71,2.0153
72,2.7996
73,0.44664
74,-0.3377
75,-0.3377
76,-0.3377
77,-0.07625499999999999
78,-0.3377
79,-0.3377
80,-0.07625499999999999
81,-0.3377
82,-0.3377
83,-0.3377
84,-0.07625499999999999
85,0.44664
86,4.3683
87,4.1069
88,2.7996
89,2.5382
90,2.7996
91,2.7996
92,-0.3377
93,-1.9064
94,-1.9064
95,-1.9064
