time,value
0,1.7249
1,1.7264
2,1.6993
3,1.6525
4,1.5832
5,1.4946
6,1.4069
7,1.3071
8,1.2212
9,1.1185
10,1.0161
11,0.9155
12,0.81692
13,0.7155600000000001
14,0.61583
15,0.51235
16,0.41541999999999996
17,0.32156
18,0.23328000000000002
19,0.14324
20,0.049384
21,-0.041009
22,-0.13182
23,-0.21866
24,-0.29284
25,-0.38017
26,-0.45624
27,-0.5330699999999999
28,-0.60621
29,-0.67176
30,-0.74054
31,-0.80591
32,-0.86011
33,-0.92453
34,-0.9818399999999999
35,-1.0256
36,-1.0663
37,-1.1134
38,-1.1479
39,-1.1755
40,-1.2113
41,-1.2248
42,-1.2464
43,-1.2607
44,-1.2675
45,-1.2667
46,-1.2583
47,-1.258
48,-1.2347
49,-1.2195
50,-1.2017
51,-1.1588
52,-1.1377
53,-1.0866
54,-1.0473
55,-0.99326
56,-0.9466200000000001
57,-0.88945
58,-0.82931
59,-0.7650899999999999
60,-0.69598
61,-0.62735
62,-0.56038
63,-0.47603999999999996
64,-0.41123000000000004
65,-0.32447
66,-0.23771
67,-0.14859
68,-0.061320000000000006
69,0.03017
70,0.12478
71,0.21796999999999997
72,0.31340999999999997
73,0.41463
74,0.51523
75,0.616
76,0.71472
77,0.81819
78,0.9237299999999999
79,1.0271
80,1.1321
81,1.2331
82,1.3392
83,1.4417
84,1.537
85,1.6267
86,1.6875
87,1.7257
88,1.725
89,1.7272
90,1.7228
91,1.6934
92,1.6341
93,1.5437
94,1.4567
95,1.3562
96,1.2575
97,1.1571
98,1.0703
99,0.96595
100,0.8673
101,0.7629600000000001
102,0.66103
103,0.5626899999999999
104,0.46581999999999996
105,0.36562
106,0.26845
107,0.17585
108,0.07811799999999999
109,-0.012851
110,-0.10387
111,-0.1847
112,-0.27591
113,-0.36280999999999997
114,-0.43616000000000005
115,-0.52113
116,-0.59283
117,-0.67124
118,-0.7348600000000001
119,-0.8054399999999999
120,-0.8699399999999999
121,-0.9213
122,-0.9684
123,-1.02
124,-1.0658
125,-1.0913
126,-1.1243
127,-1.1654
128,-1.1848
129,-1.197
130,-1.2174
131,-1.2148
132,-1.2363
133,-1.2346
134,-1.2254
135,-1.2245
136,-1.2007
137,-1.2001
138,-1.1621
139,-1.1423
140,-1.0994
141,-1.0652
142,-1.026
143,-0.98424
144,-0.9249299999999999
145,-0.8674200000000001
146,-0.80274
147,-0.74017
148,-0.67482
149,-0.60239
150,-0.5291600000000001
151,-0.45556
152,-0.36948000000000003
153,-0.28608
154,-0.21122
155,-0.12730999999999998
156,-0.029470999999999997
157,0.061974
158,0.15455
159,0.25256999999999996
160,0.35283000000000003
161,0.4453
162,0.5371600000000001
163,0.63517
164,0.73733
165,0.84099
166,0.9422
167,1.0453
168,1.1501
169,1.2501
170,1.3542
171,1.4411
172,1.5368
173,1.6182
174,1.6715
175,1.7103
