time,value
0,-0.47788
1,-0.47788
2,-0.47788
3,-0.47788
4,2.0708
5,-0.47788
6,-0.47788
7,-0.47788
8,-0.47788
9,2.0708
10,-0.47788
11,-0.47788
12,-0.47788
13,-0.47788
14,2.0708
15,-0.47788
16,-0.47788
17,-0.47788
18,-0.47788
19,2.0708
20,-0.47788
21,-0.47788
22,-0.47788
23,-0.47788
24,2.0708
25,-0.47788
26,-0.47788
27,-0.47788
28,2.0708
29,-0.47788
30,-0.47788
31,-0.47788
32,2.0708
33,-0.47788
34,-0.47788
35,-0.47788
36,-0.47788
37,2.0708
38,-0.47788
39,-0.47788
40,-0.47788
41,-0.47788
42,2.0708
43,-0.47788
44,-0.47788
45,-0.47788
46,-0.47788
47,-0.47788
48,2.0708
49,-0.47788
50,-0.47788
51,-0.47788
52,-0.47788
53,2.0708
54,-0.47788
55,-0.47788
56,-0.47788
57,-0.47788
58,-0.47788
59,-0.47788
60,-0.47788
61,2.0708
62,-0.47788
63,-0.47788
64,-0.47788
65,-0.47788
66,-0.47788
67,2.0708
68,-0.47788
69,-0.47788
70,-0.47788
71,-0.47788
72,2.0708
73,-0.47788
74,-0.47788
75,-0.47788
76,-0.47788
77,2.0708
78,-0.47788
79,-0.47788
80,-0.47788
81,2.0708
82,-0.47788
83,-0.47788
84,-0.47788
85,2.0708
86,-0.47788
87,-0.47788
88,-0.47788
89,-0.47788
90,-0.47788
91,2.0708
92,-0.47788
93,-0.47788
94,-0.47788
95,-0.47788
