time,value
0,-0.16735
1,-0.16735
2,-0.16735
3,-0.16735
4,-0.16735
5,-0.16735
6,-0.16735
7,-0.16735
8,-0.16735
9,-0.16735
10,-0.16735
11,-0.16735
12,-0.16735
13,-0.16735
14,-0.16735
15,-0.16735
16,-0.16735
17,-0.16735
18,-0.16735
19,-0.16735
20,-0.16735
21,-0.16735
22,-0.16735
23,-0.16735
24,-0.16735
25,-0.16735
26,-0.16735
27,-0.16735
28,-0.16735
29,-0.16735
30,-0.16735
31,-0.16735
32,-0.16735
33,-0.16735
34,-0.16735
35,-0.16735
36,5.8574
37,7.1962
38,2.5103
39,-0.16735
40,-0.16735
41,-0.16735
42,-0.16735
43,-0.16735
44,-0.16735
45,-0.16735
46,-0.16735
47,-0.16735
48,-0.16735
49,-0.16735
50,-0.16735
51,-0.16735
52,-0.16735
53,-0.16735
54,-0.16735
55,-0.16735
56,-0.16735
57,-0.16735
58,-0.16735
59,-0.16735
60,-0.16735
61,-0.16735
62,-0.16735
63,-0.16735
64,-0.16735
65,-0.16735
66,-0.16735
67,-0.16735
68,-0.16735
69,-0.16735
70,-0.16735
71,-0.16735
72,-0.16735
73,-0.16735
74,-0.16735
75,-0.16735
76,-0.16735
77,-0.16735
78,-0.16735
79,-0.16735
80,-0.16735
81,-0.16735
82,-0.16735
83,-0.16735
84,-0.16735
85,-0.16735
86,-0.16735
87,-0.16735
88,-0.16735
89,-0.16735
90,-0.16735
91,-0.16735
92,-0.16735
93,-0.16735
94,-0.16735
95,-0.16735
