time,value
0,-0.14154
1,-0.46507
2,-0.14154
3,-0.14154
4,-0.14154
5,-0.46507
6,-0.14154
7,-0.14154
8,-0.14154
9,-0.46507
10,-0.14154
11,-0.14154
12,-0.14154
13,-0.46507
14,-0.14154
15,-0.14154
16,-0.14154
17,-0.46507
18,-0.14154
19,-0.14154
20,-0.14154
21,-0.14154
22,-0.46507
23,-0.14154
24,-0.14154
25,-0.14154
26,-0.46507
27,-0.14154
28,-0.14154
29,-0.14154
30,-0.46507
31,-0.14154
32,-0.14154
33,-0.14154
34,-0.46507
35,-0.14154
36,-0.14154
37,-0.14154
38,-0.46507
39,-0.14154
40,-0.14154
41,-0.14154
42,-0.46507
43,-0.14154
44,-0.14154
45,-0.14154
46,-0.46507
47,-0.14154
48,-0.14154
49,-0.14154
50,-0.46507
51,-0.14154
52,-0.14154
53,-0.14154
54,-0.46507
55,-0.14154
56,-0.14154
57,-0.14154
58,-0.46507
59,-0.14154
60,-0.14154
61,-0.14154
62,-0.14154
63,-0.46507
64,-0.14154
65,-0.14154
66,-0.14154
67,-0.46507
68,-0.14154
69,-0.14154
70,0.18198
71,-0.14154
72,-0.14154
73,-0.14154
74,-0.14154
75,-0.14154
76,-0.14154
77,-0.14154
78,-0.14154
79,-0.14154
80,-0.14154
81,-0.14154
82,-0.14154
83,-0.14154
84,0.8290299999999999
85,0.50551
86,0.50551
87,0.50551
88,5.6819
89,6.6525
90,3.4172
91,-0.14154
92,-0.46507
93,-0.14154
94,-0.14154
95,-0.14154
