time,value
0,1.4311
1,1.4311
2,1.4311
3,1.3787
4,1.4311
5,1.4311
6,1.4311
7,1.4311
8,1.3787
9,1.4311
10,1.4311
11,1.4311
12,1.3787
13,1.4311
14,1.4311
15,1.3787
16,1.4311
17,0.8547299999999999
18,-0.71719
19,-0.71719
20,-0.71719
21,-0.71719
22,-0.71719
23,-0.71719
24,-0.71719
25,-0.71719
26,-0.71719
27,-0.71719
28,-0.71719
29,-0.71719
30,-0.71719
31,-0.71719
32,-0.71719
33,-0.71719
34,-0.71719
35,-0.71719
36,-0.71719
37,-0.71719
38,1.2215
39,1.4311
40,1.4311
41,1.3787
42,1.3787
43,1.0643
44,-0.71719
45,-0.71719
46,-0.71719
47,-0.71719
48,-0.71719
49,-0.71719
50,-0.71719
51,-0.71719
52,-0.71719
53,-0.71719
54,-0.71719
55,-0.71719
56,-0.71719
57,-0.71719
58,-0.71719
59,-0.71719
60,-0.71719
61,-0.71719
62,-0.71719
63,-0.71719
64,-0.71719
65,-0.71719
66,-0.71719
67,-0.71719
68,-0.71719
69,-0.71719
70,-0.71719
71,-0.71719
72,-0.71719
73,-0.71719
74,-0.71719
75,-0.71719
76,-0.71719
77,-0.71719
78,-0.71719
79,-0.71719
80,-0.71719
81,-0.71719
82,-0.71719
83,-0.71719
84,-0.71719
85,-0.71719
86,-0.71719
87,0.8547299999999999
88,1.4311
89,1.4311
90,1.4311
91,1.4311
92,1.4311
93,1.4311
94,1.4311
95,1.4311
