time,value
0,0.39216999999999996
1,0.38026
2,0.39358000000000004
3,0.37706999999999996
4,0.54568
5,0.55176
6,0.55972
7,0.4051
8,0.40489
9,0.39635
10,0.3962
11,0.39979000000000003
12,0.43698000000000004
13,0.57189
14,0.54803
15,0.50325
16,0.56696
17,0.6191
18,0.82794
19,0.9433
20,0.57422
21,-0.7599899999999999
22,-2.0427
23,-2.8758
24,-3.1039999999999996
25,-3.6946
26,-4.2444
27,-4.6131
28,-4.6789
29,-4.3471
30,-3.7776
31,-3.365
32,-3.0712
33,-2.7397
34,-2.4737
35,-1.8705
36,-1.4567
37,-0.6994
38,-0.21116
39,0.32983
40,0.9424899999999999
41,1.4469999999999998
42,1.3644
43,1.6303
44,1.5549
45,1.7768
46,1.8194
47,1.4809999999999999
48,2.3832
49,1.1411
50,-0.96357
51,0.77476
52,0.50692
53,0.4624
54,0.81088
55,0.53815
56,0.44325
57,0.47418000000000005
58,0.51855
59,0.29097
60,0.23779
61,0.27288
62,0.51593
63,0.304
64,0.27436
65,0.32077
66,0.27973000000000003
67,0.050581
68,0.06968200000000001
69,0.21798
70,0.20731
71,0.11488
72,0.054116
73,0.072153
74,0.13718
75,0.24648
76,0.48253
77,0.531
78,-0.10477
79,-0.35646
80,-0.35405
81,-0.5546800000000001
82,-0.65668
83,-0.76883
84,-0.6348199999999999
85,-0.6811
86,-1.0619
87,-1.2267
88,-1.2562
89,-1.4213
90,-1.7089
91,-1.8759
92,-2.3298
93,-2.3522
94,-1.9633
95,-2.3769
96,-2.3862
97,-2.1754
98,-2.2316
99,-2.3402
100,-2.2305
101,-1.9766
102,-1.2764
103,-1.0524
104,-0.90527
105,-0.9307799999999999
106,-0.8658799999999999
107,-0.64277
108,-0.2915
109,0.065332
110,0.51635
111,0.8072
112,0.65283
113,0.62129
114,0.20365999999999998
115,0.5788800000000001
116,0.028257
117,0.13157
118,-0.0062564
119,0.25595999999999997
120,0.59759
121,0.31933
122,0.48156000000000004
123,0.37479
124,0.7561399999999999
125,0.11492000000000001
126,0.21449000000000001
127,0.22989
128,0.25179
129,0.2768
130,0.28694000000000003
131,0.29686
132,0.29266
133,0.28509
134,0.26871999999999996
135,0.35563
136,0.39044
137,0.38999
138,0.37767
139,0.40010999999999997
140,0.42148
141,0.42486999999999997
142,0.41998
143,0.40743
144,0.3832
145,0.35923
146,0.38216
147,0.38106999999999996
148,0.37994
149,0.38321
150,0.38769000000000003
151,0.41822
152,0.38177
153,0.39642
154,0.40673000000000004
155,0.40609
156,0.40899
157,0.43901
158,0.52641
159,0.32908000000000004
160,0.34669
161,0.32953000000000005
162,0.48721000000000003
163,0.49956000000000006
164,0.47667
165,0.49181
166,0.43037
167,0.44538
168,0.43732
169,0.40562
170,0.41644
171,0.40755
172,0.22438000000000002
173,0.37609000000000004
174,0.42208999999999997
175,0.41281
176,0.40697
177,0.40047
178,0.37573
179,0.3727
180,0.4097
181,0.5160100000000001
182,0.52554
183,0.51664
184,0.43265
185,0.4032
186,0.38916
187,0.37146
188,0.34491
189,0.39841
190,0.40763
191,0.36457
192,0.3371
193,0.35736
194,0.37111
195,0.36491
196,0.37608
197,0.37039
198,0.41996000000000006
199,0.25709
200,0.25798000000000004
201,0.27485
202,0.28471
203,0.33093
204,0.30954
205,0.29246
206,0.26332
207,0.30451999999999996
208,0.27869
209,0.26471
210,0.40425
211,0.42177
212,0.2895
213,0.26349
214,0.21344000000000002
215,0.23195
216,0.33409
217,0.21549000000000001
218,0.20808000000000001
219,0.19637000000000002
220,0.21259
221,0.21731999999999999
222,0.21928000000000003
223,0.21033000000000002
224,0.22821
225,0.2471
226,0.2547
227,0.25235
228,0.24368
229,0.2327
230,0.23254
231,0.21982
232,0.21181
233,0.21468
234,0.21291999999999997
235,0.20856999999999998
236,0.18791
237,0.16887
238,0.15349000000000002
239,0.13489
240,0.12063
241,0.12571
242,0.1242
243,0.22708000000000003
244,0.16862
245,0.16068
246,0.15631
247,0.23108
248,0.15624000000000002
249,0.14637
250,0.14656
251,0.22601
252,0.22864
253,0.15367999999999998
254,0.14353
255,0.1355
256,0.14275
257,0.32173
258,0.24958000000000002
259,0.14648
260,0.24771999999999997
261,0.32131
262,0.21166
263,0.31673
264,0.31440999999999997
265,0.29749000000000003
266,0.28574
267,0.18154
268,0.29856
269,0.2505
270,0.30403
271,0.3008
272,0.30336
273,0.13885
274,0.14193
275,0.18141
276,0.30179
277,0.25945
278,0.2529
279,0.11553
280,0.12055
281,0.1206
282,0.11337
283,0.11035999999999999
284,0.1144
285,0.11854
286,0.11613
287,0.12013
288,0.11759000000000001
289,0.12283
290,0.099288
291,0.10912000000000001
292,0.095501
293,0.11667000000000001
294,0.2775
295,0.26892
296,0.2648
297,0.10395
298,0.098596
299,0.096857
