time,value
0,-0.06513200000000001
1,-0.05782999999999999
2,-0.068455
3,-0.10655999999999999
4,-0.11742000000000001
5,-0.090242
6,-0.088306
7,-0.086589
8,-0.07868
9,-0.078622
10,-0.07092000000000001
11,-0.19015
12,-0.18037
13,0.004887300000000001
14,0.019883
15,0.19708
16,0.31048000000000003
17,0.40907
18,0.52376
19,0.56134
20,0.54389
21,0.54618
22,0.43403
23,0.21602
24,0.17135999999999998
25,0.099275
26,0.21143
27,0.25621
28,0.20772
29,0.044975
30,-0.48022
31,-0.80765
32,-1.459
33,-2.1247
34,-2.1239
35,-2.2245
36,-2.7124
37,-2.3666
38,-2.3936
39,-2.4165
40,-2.0033
41,-1.6505
42,-1.5388
43,-1.4287
44,-0.77625
45,-0.40201
46,-0.38844
47,0.010245
48,0.26056
49,0.36625
50,0.44356999999999996
51,0.12884
52,0.37625
53,0.62537
54,0.36913
55,0.7199399999999999
56,0.9900100000000001
57,0.78351
58,1.213
59,1.3971
60,1.3167
61,1.4375
62,1.2806
63,1.3364
64,1.2344
65,1.2079
66,1.1305
67,0.8042
68,0.89792
69,0.9074
70,0.74366
71,0.88807
72,0.44295
73,0.39574000000000004
74,0.069242
75,0.22185
76,0.38926
77,0.25527
78,0.43148000000000003
79,0.5088
80,0.32115
81,0.42207
82,0.5714
83,0.6721600000000001
84,0.75641
85,0.8437100000000001
86,0.50105
87,0.6460199999999999
88,0.98698
89,0.81515
90,0.73552
91,0.94396
92,1.0155
93,0.87256
94,1.0165
95,0.8769899999999999
96,0.5486
97,0.96183
98,0.7870199999999999
99,0.9551299999999999
100,1.0463
101,0.90885
102,0.81197
103,1.52
104,1.517
105,0.7630600000000001
106,1.6487
107,0.8890100000000001
108,0.50937
109,2.0242
110,1.0801
111,0.74693
112,0.98469
113,0.022984
114,-0.6160100000000001
115,-0.28246
116,-1.171
117,-1.7024
118,-1.8598
119,-2.8354
120,-3.3699
121,-2.7321
122,-2.8936
123,-3.5859
124,-3.0025
125,-3.5786
126,-3.7822
127,-3.083
128,-2.7445
129,-2.6133
130,-1.8005
131,-2.9139999999999997
132,-3.6365
133,-3.3776
134,-2.3846
135,-1.3322
136,-0.7812100000000001
137,-0.2705
138,-0.23217
139,-0.098703
140,-0.16944
141,0.038114999999999996
142,0.30089
143,0.68815
144,0.90271
145,1.2848
146,1.4432
147,1.3106
148,1.1565
149,1.244
150,1.1321
151,0.778
152,0.33036
153,0.11635
154,0.12809
155,0.12736
156,-0.0023848000000000003
157,0.010954
158,0.025943
159,0.039699
160,0.18978
161,0.21025
162,0.28481
163,0.23375
164,0.2077
165,0.22493000000000002
166,0.155
167,0.17207999999999998
168,0.24894000000000002
169,0.2191
170,0.2381
171,0.28609
172,0.23401
173,0.24934
174,0.29836
175,0.28494
176,0.33616
177,0.32945
178,0.25799
179,0.1897
180,0.21611999999999998
181,0.14698
182,0.26333
183,0.2916
184,0.35268
185,0.24255
186,0.14240999999999998
187,0.17912999999999998
188,0.057714
189,0.11861
190,0.12912
191,0.080101
192,0.048829000000000004
193,0.071892
194,0.08753999999999999
195,0.08048
196,0.21991
197,0.086719
198,-0.005557899999999999
199,-0.04225
200,-0.041468
201,-0.022035
202,-0.010804000000000001
203,0.30295
204,0.11882999999999999
205,0.16495
206,0.11802
207,0.14673
208,-0.01766
209,0.13004000000000002
210,0.12525999999999998
211,0.1452
212,0.1428
213,0.15664
214,0.28636
215,0.043623
216,-0.042253
217,-0.089602
218,-0.09802999999999999
219,-0.11137000000000001
220,-0.024696
221,0.075761
222,-0.015349000000000002
223,-0.095476
224,0.0060726999999999995
225,0.10918
226,0.11306
227,0.10797000000000001
228,0.10730999999999999
229,0.09836900000000001
230,-0.07019700000000001
231,-0.084676
232,-0.093787
233,0.026129000000000003
234,-0.036930000000000004
235,0.08043600000000001
236,0.057317999999999994
237,-0.0106
238,0.019571
239,0.0016314
240,-0.16236
241,-0.0078967
242,-0.19351
243,-0.15567999999999999
244,-0.12193
245,0.23904
246,0.20811999999999997
247,-0.15863
248,-0.17059000000000002
249,-0.92819
250,-0.7468899999999999
251,-0.18223
252,0.5929399999999999
253,1.1791
254,1.3549
255,1.5497
256,1.1964
257,0.64136
258,0.25539
259,0.21545999999999998
260,0.021831
261,0.03085
262,-0.16451
263,-0.74034
264,-0.79748
265,-0.6279899999999999
266,-0.5791
267,-0.066819
268,0.1303
269,0.40152
270,0.40297
271,0.20509000000000002
272,0.010422
273,0.31495
274,0.41286000000000006
275,0.60006
276,0.59439
277,0.59172
278,0.3939
279,0.10081
280,-0.008546600000000001
281,-0.079444
282,-0.015967
283,-0.20926999999999998
284,-0.20467
285,-0.19996
286,-0.2027
287,-0.15001
288,0.033803
289,0.41173000000000004
290,0.51051
291,-0.039361
292,-0.037925
293,-0.1893
294,-0.019015999999999998
295,-0.019775
296,-0.011406999999999999
297,0.36584
298,0.54786
299,0.547
