time,value
0,-0.053983
1,-0.1168
2,-0.1168
3,-0.085391
4,-0.1168
5,-0.085391
6,-0.1168
7,-0.1168
8,-0.085391
9,-0.085391
10,-0.1168
11,-0.1168
12,-0.1168
13,-0.1168
14,-0.1168
15,-0.1168
16,-0.1168
17,-0.085391
18,-0.1168
19,-0.1168
20,-0.1168
21,-0.1168
22,-0.1168
23,-0.1168
24,-0.1168
25,-0.085391
26,-0.14820999999999998
27,-0.1168
28,-0.1168
29,-0.1168
30,3.3381
31,-0.21101999999999999
32,-0.17961
33,-0.14820999999999998
34,-0.21101999999999999
35,-0.14820999999999998
36,-0.17961
37,-0.17961
38,-0.14820999999999998
39,-0.21101999999999999
40,-0.14820999999999998
41,-0.21101999999999999
42,-0.14820999999999998
43,-0.17961
44,-0.17961
45,-0.17961
46,-0.17961
47,-0.17961
48,-0.17961
49,-0.21101999999999999
50,-0.14820999999999998
51,-0.17961
52,-0.17961
53,-0.17961
54,-0.17961
55,-0.14820999999999998
56,-0.17961
57,-0.17961
58,-0.17961
59,-0.21101999999999999
60,-0.14820999999999998
61,-0.17961
62,-0.17961
63,-0.17961
64,-0.17961
65,-0.17961
66,0.040242
67,-0.30525
68,-0.30525
69,-0.30525
70,-0.30525
71,-0.30525
72,3.6522
73,7.8294
74,-0.30525
75,-0.30525
76,-0.24243
77,-0.30525
78,-0.24243
79,-0.30525
80,-0.30525
81,-0.24243
82,-0.30525
83,-0.30525
84,-0.24243
85,-0.30525
86,-0.30525
87,2.333
88,-0.30525
89,-0.30525
90,-0.30525
91,-0.30525
92,-0.30525
93,-0.30525
94,-0.30525
95,-0.30525
