time,value
0,1.3204
1,1.2208
2,1.1075
3,1.0186
4,0.90102
5,0.80594
6,0.68242
7,0.57965
8,0.47157
9,0.34803
10,0.18857000000000002
11,0.029098000000000002
12,-0.08945399999999999
13,-0.068255
14,-0.033922
15,-0.099888
16,-0.22171999999999997
17,-0.3462
18,-0.50575
19,-0.65938
20,-0.78555
21,-0.9077
22,-1.0285
23,-1.185
24,-1.266
25,-1.3841
26,-1.4163
27,-1.4915
28,-1.4872
29,-1.4039
30,-1.3385
31,-1.2638
32,-1.1802
33,-1.1533
34,-1.0592
35,-0.9846
36,-0.88866
37,-0.8041699999999999
38,-0.72415
39,-0.73165
40,-0.6297
41,-0.52266
42,-0.41315
43,-0.31797
44,-0.23408
45,-0.12194
46,-0.029702999999999997
47,0.068913
48,0.15603
49,0.16366
50,0.097738
51,0.047632
52,-0.021237
53,-0.027880000000000002
54,0.082926
55,0.18642
56,0.29496
57,0.31196999999999997
58,0.42953
59,0.5242
60,0.64241
61,0.75757
62,0.74892
63,0.7418600000000001
64,0.76675
65,0.8784
66,0.99625
67,1.1279
68,1.2507
69,1.3086
70,1.3814
71,1.4929
72,1.5959
73,1.7063
74,1.8265
75,1.944
76,2.0249
77,1.9488
78,1.8474
79,1.7366
80,1.6409
81,1.54
82,1.4305
83,1.3457
84,1.2283
85,1.131
86,1.0284
87,0.9385700000000001
88,0.8371299999999999
89,0.8418899999999999
90,0.88899
91,0.81006
92,0.72032
93,0.64193
94,0.51559
95,0.42041999999999996
96,0.3233
97,0.28647
98,0.28049
99,0.19147999999999998
100,0.083924
101,-0.011076
102,-0.10124
103,-0.12903
104,-0.080044
105,-0.030277999999999996
106,0.01592
107,0.083878
108,0.13443
109,0.068964
110,-0.021580000000000002
111,-0.12045
112,-0.19488
113,-0.29772
114,-0.38663000000000003
115,-0.43144
116,-0.54503
117,-0.6667
118,-0.7884
119,-0.81592
120,-0.8729299999999999
121,-0.89484
122,-0.8962899999999999
123,-1.02
124,-1.1483
125,-1.2842
126,-1.3977
127,-1.4341
128,-1.5556
129,-1.5267
130,-1.5915
131,-1.6651
132,-1.6995
133,-1.6245
134,-1.6049
135,-1.5379
136,-1.4313
137,-1.3384
138,-1.2342
139,-1.1143
140,-0.9929600000000001
141,-0.94006
142,-0.8415299999999999
143,-0.7204
144,-0.58921
145,-0.46862
146,-0.35702
147,-0.2291
148,-0.11936
149,-0.029613
150,-0.013066
151,0.028743
152,0.10117000000000001
153,0.19383
154,0.31327
155,0.42553
156,0.5392600000000001
157,0.6459199999999999
158,0.7478
159,0.8652299999999999
160,1.0102
161,1.1206
162,1.2651
163,1.3954
164,1.4823
165,1.5052
166,1.4692
167,1.4159
168,1.3417
169,1.2989
170,1.2277
171,1.1425
172,1.0515
173,0.9350799999999999
174,0.80085
175,0.76759
176,0.71513
177,0.62807
178,0.5113300000000001
179,0.39731
180,0.27836
181,0.31179
182,0.35994
183,0.28758
184,0.18298
185,0.09832
186,0.032993
187,0.054602
188,0.022826
189,-0.080565
190,-0.17686
191,-0.27315
192,-0.23256999999999997
193,-0.14013
194,-0.025332
195,0.065437
196,0.038028
197,-0.038241000000000004
198,-0.075339
199,-0.16637000000000002
200,-0.20018
201,-0.26164
202,-0.34244
203,-0.42799
204,-0.4379
205,-0.47641000000000006
206,-0.55071
207,-0.62817
208,-0.69515
209,-0.8022
210,-0.8690000000000001
211,-0.8965200000000001
212,-0.8273
213,-0.70875
214,-0.61783
215,-0.5091
216,-0.43366000000000005
217,-0.30245
218,-0.21677
219,-0.231
220,-0.24231
221,-0.2215
222,-0.28133
223,-0.32761
224,-0.38161999999999996
225,-0.2987
226,-0.28133
227,-0.34399
228,-0.41226999999999997
229,-0.49385
230,-0.56535
231,-0.53773
232,-0.61795
233,-0.6873600000000001
234,-0.76947
235,-0.7449399999999999
236,-0.78672
237,-0.8385600000000001
238,-0.8824299999999999
239,-0.93129
240,-0.95883
241,-0.99939
242,-1.0544
243,-1.1178
244,-1.1872
245,-1.2493
246,-1.3063
247,-1.3565
248,-1.4127
249,-1.4709999999999999
250,-1.5219999999999998
251,-1.5758
252,-1.6286
253,-1.6709
254,-1.59
255,-1.4713
256,-1.3634
257,-1.2813
258,-1.1707
259,-1.0575
260,-0.93234
261,-0.8183199999999999
262,-0.74325
263,-0.66371
264,-0.5653199999999999
265,-0.45248999999999995
266,-0.33956
267,-0.2178
268,-0.11413
269,0.010898
270,0.13157
271,0.18508
272,0.30827
273,0.42928999999999995
274,0.54045
275,0.6671699999999999
276,0.68572
277,0.7912899999999999
278,0.8998
279,1.016
280,1.139
281,1.2445
282,1.3558
283,1.4879
284,1.5921
285,1.726
286,1.7653
287,1.8311
288,1.9479
289,2.0657
290,2.1829
291,2.2922
292,2.4074
293,2.5333
294,2.6612
295,2.7914
296,2.7554
297,2.6752
298,2.5696
299,2.4596
300,2.3292
301,2.2096
302,2.0928
303,1.9775
304,1.8516
305,1.7466
306,1.6206
307,1.5036
308,1.3961
309,1.2787
310,1.1546
311,1.0516
312,0.9329700000000001
313,0.8114100000000001
314,0.70367
315,0.5958
316,0.45741000000000004
317,0.35306
318,0.24291
319,0.11205999999999999
320,0.012863999999999999
321,-0.126
322,-0.23285999999999998
323,-0.33935
324,-0.47473999999999994
325,-0.58187
326,-0.69238
327,-0.80045
328,-0.92958
329,-0.96362
330,-1.0539
331,-1.1617
332,-1.1526
333,-1.2472
334,-1.2895
335,-1.3659
336,-1.4805
337,-1.5926
338,-1.6878
339,-1.7571
340,-1.7231
341,-1.6967
342,-1.6488
343,-1.6016
344,-1.5416
345,-1.4731
346,-1.4116
347,-1.3289
348,-1.2518
349,-1.1685
350,-1.0897
351,-1.0133
352,-0.92576
353,-0.8497899999999999
354,-0.8125399999999999
355,-0.76198
356,-0.71392
357,-0.67504
358,-0.77088
359,-0.7460899999999999
360,-0.6650699999999999
361,-0.5976199999999999
362,-0.5018699999999999
363,-0.44133
364,-0.34563
365,-0.2712
366,-0.22773000000000002
367,-0.28723000000000004
368,-0.21883000000000002
369,-0.13412000000000002
370,-0.10658
371,-0.04385
372,0.021811
373,0.062297000000000005
374,0.018905
375,-0.071158
376,-0.16157
377,-0.23460999999999999
378,-0.30755
379,-0.41108
380,-0.49851
381,-0.61419
382,-0.55872
383,-0.48363
384,-0.42144
385,-0.37823
386,-0.36709
387,-0.35448
388,-0.36056
389,-0.39849
390,-0.32361999999999996
391,-0.24556
392,-0.17908
393,-0.17885
394,-0.090046
395,-0.052877
396,0.0001791
397,0.07092899999999999
398,0.10111
399,-0.011611
400,-0.046385
401,-0.11300999999999999
402,-0.069643
403,-0.015859
404,0.065554
405,0.14090999999999998
406,0.1557
407,0.24952
408,0.33049
409,0.3982
410,0.43992
411,0.37035
412,0.41652
413,0.49146000000000006
414,0.58724
415,0.66761
416,0.74655
417,0.8416799999999999
418,0.90691
419,0.9372
420,1.0119
421,1.0763
422,1.1234
423,1.1781
424,1.2413
425,1.2919999999999998
426,1.3318
