time,value
0,-2.2474
1,-2.2474
2,-2.2474
3,-2.2474
4,-2.2499
5,-2.2499
6,-2.2499
7,-2.2499
8,-2.2499
9,-2.2497
10,-2.252
11,-2.2593
12,-2.2665
13,-2.2662
14,-2.2656
15,-2.265
16,-2.2644
17,-2.2637
18,-2.2627
19,-2.2618
20,-2.2608
21,-2.2594
22,-2.2583
23,-2.2569999999999997
24,-2.2557
25,-2.2563
26,-2.2548
27,-2.2532
28,-2.2516
29,-2.2493
30,-2.2475
31,-2.248
32,-2.2544
33,-2.2602
34,-2.2581
35,-2.2559
36,-2.2537
37,-2.2506
38,-2.2482
39,-2.2458
40,-2.2432
41,-2.2397
42,-2.2393
43,-2.2366
44,-2.2305
45,-2.2276
46,-2.2246
47,-2.2238
48,-2.2196
49,-2.2164
50,-2.2132
51,-2.2099
52,-2.2053
53,-2.2019
54,-2.1984
55,-2.1948
56,-2.19
57,-2.1896
58,-2.1947
59,-2.2011
60,-2.1959
61,-2.1919999999999997
62,-2.1881
63,-2.1827
64,-2.1787
65,-2.1746
66,-2.1704
67,-2.1648
68,-2.1625
69,-2.1581
70,-2.1538
71,-2.1478
72,-2.1434
73,-2.1388
74,-2.1343
75,-2.1281
76,-2.1234
77,-2.1187
78,-2.114
79,-2.1076
80,-2.1028
81,-2.0979
82,-2.0913
83,-2.0864
84,-2.0814
85,-2.0764
86,-2.0696
87,-2.0645
88,-2.0594
89,-2.0542
90,-2.0473
91,-2.049
92,-2.0524
93,-2.0541
94,-2.0469
95,-2.0416
96,-2.0362
97,-2.0307
98,-2.0234
99,-2.0180000000000002
100,-2.0124
101,-2.005
102,-1.9994
103,-1.9938
104,-1.9882
105,-1.9807
106,-1.975
107,-1.9693
108,-1.9636
109,-1.9559
110,-1.9501
111,-1.9443
112,-1.9385
113,-1.9307
114,-1.9248
115,-1.9189
116,-1.913
117,-1.9066
118,-1.9006
119,-1.8946
120,-1.8886
121,-1.8806
122,-1.8780000000000001
123,-1.8822
124,-1.8823
125,-1.8762
126,-1.8701
127,-1.8639
128,-1.8557
129,-1.8495
130,-1.8433
131,-1.8371
132,-1.8288
133,-1.8226
134,-1.8163
135,-1.81
136,-1.8017
137,-1.7953
138,-1.7890000000000001
139,-1.7827
140,-1.7755
141,-1.7691
142,-1.7628
143,-1.7542
144,-1.7478
145,-1.7414
146,-1.735
147,-1.7264
148,-1.72
149,-1.7135
150,-1.7071
151,-1.7051
152,-1.7064
153,-1.7065
154,-1.7
155,-1.6912
156,-1.6847
157,-1.6781
158,-1.6715
159,-1.6628
160,-1.6562
161,-1.6496
162,-1.6407
163,-1.6341
164,-1.6275
165,-1.6209
166,-1.6119999999999999
167,-1.6053
168,-1.5987
169,-1.5909
170,-1.5845
171,-1.5779
172,-1.5713
173,-1.5646
174,-1.5547
175,-1.547
176,-1.5438
177,-1.5384
178,-1.5285
179,-1.5207
180,-1.5153
181,-1.5099
182,-1.5032
183,-1.4966
184,-1.49
185,-1.48
186,-1.4734
187,-1.4667
188,-1.4601
189,-1.4536
190,-1.4482
191,-1.4416
192,-1.4349
193,-1.425
194,-1.4183
195,-1.415
196,-1.4096
197,-1.4042
198,-1.3976
199,-1.3909
200,-1.3843
201,-1.3743
202,-1.3677
203,-1.361
204,-1.3543
205,-1.3489
206,-1.3458
207,-1.3381
208,-1.3292
209,-1.3225
210,-1.3158
211,-1.3081
212,-1.2992
213,-1.2925
214,-1.2858
215,-1.2791
216,-1.2726
217,-1.2673
218,-1.2607
219,-1.254
220,-1.2451
221,-1.2384
222,-1.2307
223,-1.2217
224,-1.215
225,-1.2107
226,-1.2054
227,-1.1967
228,-1.19
229,-1.1833
230,-1.1765
231,-1.1676
232,-1.1598
233,-1.1531
234,-1.1464
235,-1.1374
236,-1.1319
237,-1.1266
238,-1.1236
239,-1.1147
240,-1.1079
241,-1.1012
242,-1.0912
243,-1.0845
244,-1.0777
245,-1.071
246,-1.0619
247,-1.0552
248,-1.05
249,-1.0448
250,-1.0348
251,-1.028
252,-1.0212
253,-1.0145
254,-1.0055
255,-0.99772
256,-0.9909399999999999
257,-0.98416
258,-0.9751200000000001
259,-0.96995
260,-0.9647700000000001
261,-0.9547700000000001
262,-0.948
263,-0.9412200000000001
264,-0.93347
265,-0.92442
266,-0.91763
267,-0.91084
268,-0.90796
269,-0.9018200000000001
270,-0.89504
271,-0.88826
272,-0.8814799999999999
273,-0.8714700000000001
274,-0.8646799999999999
275,-0.85788
276,-0.85108
277,-0.84272
278,-0.83854
279,-0.8307899999999999
280,-0.8240000000000001
281,-0.81494
282,-0.80814
283,-0.8003899999999999
284,-0.79132
285,-0.78451
286,-0.7777
287,-0.77088
288,-0.76257
289,-0.75971
290,-0.7529100000000001
291,-0.74611
292,-0.73703
293,-0.73022
294,-0.7234
295,-0.71658
296,-0.70655
297,-0.69973
298,-0.6929
299,-0.68607
300,-0.67695
301,-0.67011
302,-0.66506
303,-0.66228
304,-0.65452
305,-0.64769
306,-0.64086
307,-0.63174
308,-0.6249
309,-0.61806
310,-0.6103
311,-0.60117
312,-0.59432
313,-0.58746
314,-0.5806100000000001
315,-0.5714600000000001
316,-0.5687399999999999
317,-0.56372
318,-0.55824
319,-0.54911
320,-0.5422600000000001
321,-0.5354
322,-0.52625
323,-0.51849
324,-0.51162
325,-0.50476
326,-0.4956
327,-0.48872
328,-0.48185
329,-0.47496000000000005
330,-0.46579
331,-0.4589
332,-0.45255
333,-0.4476
334,-0.43893999999999994
335,-0.43117
336,-0.4262
337,-0.42122
338,-0.41345
339,-0.40659
340,-0.39971999999999996
341,-0.39195
342,-0.38419000000000003
343,-0.37921
344,-0.3765
345,-0.36735
346,-0.36048
347,-0.35272
348,-0.34585
349,-0.33948
350,-0.33448
351,-0.33038
352,-0.32353000000000004
353,-0.31438
354,-0.30751999999999996
355,-0.29975
356,-0.29289
357,-0.28373000000000004
358,-0.27914
359,-0.27416999999999997
360,-0.26918000000000003
361,-0.26141
362,-0.25455
363,-0.24768
364,-0.23763
365,-0.23076
366,-0.22389
367,-0.21700999999999998
368,-0.21114000000000002
369,-0.20615999999999998
370,-0.19929000000000002
371,-0.19243
372,-0.18237
373,-0.1755
374,-0.16863
375,-0.16175
376,-0.1531
377,-0.14812
378,-0.14404
379,-0.13717000000000001
380,-0.12800999999999998
381,-0.12114000000000001
382,-0.11425999999999999
383,-0.1042
384,-0.09732400000000001
385,-0.09044400000000001
386,-0.083561
387,-0.073496
388,-0.07084299999999999
389,-0.06358899999999999
390,-0.056711000000000004
391,-0.046651
392,-0.039773
393,-0.032889999999999996
394,-0.028825
395,-0.022969999999999997
396,-0.015202
397,-0.008328700000000001
398,-0.0014537
399,0.007718399999999999
400,0.015487
401,0.022369
402,0.031549
403,0.034201999999999996
404,0.039162
405,0.044638
406,0.05380599999999999
407,0.061574000000000004
408,0.068452
409,0.075335
410,0.08451399999999999
411,0.091402
412,0.096345
413,0.1013
414,0.11135999999999999
415,0.11824000000000001
416,0.12600999999999998
417,0.13289
418,0.14207
419,0.14895999999999998
420,0.15585
421,0.16078
422,0.16662000000000002
423,0.1735
424,0.18037999999999998
425,0.19044
426,0.19733
427,0.20422
428,0.21111
429,0.21888000000000002
430,0.22380999999999998
431,0.22646
432,0.23335
433,0.24253000000000002
434,0.24941
435,0.2563
436,0.26319000000000004
437,0.27239
438,0.27928000000000003
439,0.28618000000000005
440,0.29308
441,0.30229
442,0.30919
443,0.3161
444,0.32616999999999996
445,0.33309
446,0.33914
447,0.34606
448,0.35528000000000004
449,0.3622
450,0.36913
451,0.3769
452,0.38614
453,0.39305999999999996
454,0.39999
455,0.40692
456,0.41617
457,0.42311000000000004
458,0.42857
459,0.4334
460,0.44055
461,0.44747
462,0.45441000000000004
463,0.46365
464,0.47058999999999995
465,0.47752
466,0.48446000000000006
467,0.49372
468,0.50066
469,0.5076
470,0.51059
471,0.50962
472,0.51577
473,0.52273
474,0.52969
475,0.53898
476,0.54595
477,0.55291
478,0.55989
479,0.56838
480,0.57536
481,0.58234
482,0.5916399999999999
483,0.59863
484,0.60561
485,0.6126
486,0.6219100000000001
487,0.6289
488,0.63589
489,0.64288
490,0.6522100000000001
491,0.65298
492,0.65065
493,0.6483399999999999
494,0.64528
495,0.643
496,0.64073
497,0.63847
498,0.63549
499,0.63327
500,0.6310600000000001
501,0.6288699999999999
502,0.62597
503,0.62145
504,0.6144
505,0.60427
506,0.59722
507,0.59017
508,0.58638
509,0.58115
510,0.57338
511,0.5656100000000001
512,0.5625399999999999
513,0.55734
514,0.5512199999999999
515,0.54415
516,0.53709
517,0.52696
518,0.5199
519,0.51542
520,0.51095
521,0.50554
522,0.49846999999999997
523,0.49068999999999996
524,0.48127
525,0.47585
526,0.47139
527,0.46693999999999997
528,0.45682
529,0.45071000000000006
530,0.44628
531,0.44255
532,0.43241
533,0.42768999999999996
534,0.42533000000000004
535,0.42463999999999996
536,0.41451000000000005
537,0.40674
538,0.40133
539,0.39829000000000003
540,0.39524000000000004
541,0.38747
542,0.38511
543,0.38275
544,0.37801999999999997
545,0.37094
546,0.36385
547,0.35441
548,0.34664
549,0.33956
550,0.33248
551,0.32638
552,0.32195
553,0.31586
554,0.30878
555,0.29933000000000004
556,0.29224
557,0.28447
558,0.27739
559,0.26795
560,0.2649
561,0.26284
562,0.25776
563,0.25573
564,0.25372
565,0.24595999999999998
566,0.23649
567,0.22871999999999998
568,0.22161999999999998
569,0.21622
570,0.21119000000000002
571,0.20513
572,0.19802999999999998
573,0.19092
574,0.18079
575,0.17368
576,0.16658
577,0.15947999999999998
578,0.15408
579,0.15209
580,0.14774
581,0.14578
582,0.14082
583,0.1378
584,0.13068
585,0.12054000000000001
586,0.11342999999999999
587,0.10565999999999999
588,0.10136
589,0.09707
590,0.08994400000000001
591,0.08282
592,0.075696
593,0.065557
594,0.058436
595,0.051315
596,0.044196
597,0.039258
598,0.034977
599,0.027214
600,0.020087
601,0.018194
602,0.013940000000000001
603,0.0085594
604,-0.0015787000000000002
605,-0.0051987
606,-0.0094257
607,-0.013031000000000001
608,-0.02317
609,-0.028544999999999997
610,-0.032744999999999996
611,-0.034548
612,-0.044088999999999996
613,-0.051842
614,-0.058995000000000006
615,-0.066149
616,-0.072119
617,-0.076295
618,-0.07986499999999999
619,-0.08702599999999999
620,-0.095367
621,-0.09951499999999999
622,-0.10365
623,-0.11320999999999999
624,-0.12037
625,-0.12812
626,-0.13529000000000002
627,-0.13942000000000002
628,-0.14353
629,-0.14889000000000002
630,-0.15606
631,-0.1662
632,-0.17338
633,-0.18055
634,-0.18225999999999998
635,-0.18691
636,-0.1941
637,-0.20184000000000002
638,-0.2048
639,-0.20940999999999999
640,-0.21531
641,-0.22305
642,-0.22839
643,-0.23296
644,-0.23589000000000002
645,-0.24363
646,-0.25323
647,-0.26095999999999997
648,-0.26816
649,-0.27164
650,-0.27376
651,-0.27773000000000003
652,-0.27928000000000003
653,-0.28081999999999996
654,-0.28131999999999996
655,-0.28183
656,-0.28333
657,-0.28481
658,-0.28675
659,-0.28770999999999997
660,-0.28770999999999997
661,-0.28529
662,-0.27612
663,-0.26888
664,-0.26164
665,-0.25198000000000004
666,-0.2505
667,-0.25188
668,-0.25037
669,-0.2407
670,-0.23345
671,-0.22664
672,-0.21939
673,-0.20970999999999998
674,-0.20246
675,-0.19762000000000002
676,-0.19651
677,-0.19580999999999998
678,-0.18855
679,-0.18128
680,-0.17401
681,-0.16432
682,-0.15705
683,-0.14978
684,-0.14009000000000002
685,-0.13282
686,-0.12555
687,-0.12429000000000001
688,-0.11818
689,-0.11049
690,-0.10236
691,-0.10106
692,-0.09490499999999999
693,-0.087648
694,-0.08039099999999999
695,-0.073132
696,-0.063453
697,-0.05619400000000001
698,-0.048933
699,-0.041236
700,-0.031557
701,-0.024296
702,-0.017034
703,-0.007350700000000001
704,-0.0016427
705,0.0020874
706,0.007809399999999999
707,0.017486
708,0.024742
709,0.032442
710,0.039698000000000004
711,0.049377
712,0.056636
713,0.059934
714,0.063686
715,0.069418
716,0.076672
717,0.083924
718,0.091178
719,0.10085
720,0.10811
721,0.11535999999999999
722,0.12262
723,0.1323
724,0.13955
725,0.14681
726,0.15649000000000002
727,0.16375
728,0.17145
729,0.17870999999999998
730,0.18839
731,0.19565
732,0.20290999999999998
733,0.21016999999999997
734,0.21986
735,0.22712
736,0.23438
737,0.24165
738,0.25133
739,0.2586
740,0.26586
741,0.27313000000000004
742,0.28281999999999996
743,0.29009
744,0.29736
745,0.30705
746,0.31432
747,0.32159
748,0.32886
749,0.33855
750,0.34581999999999996
751,0.3531
752,0.36036999999999997
753,0.37006999999999995
754,0.37734
755,0.38461
756,0.39189
757,0.39596
758,0.39964
759,0.4069
760,0.41417
761,0.42386999999999997
762,0.43113999999999997
763,0.43841
764,0.44852
765,0.45579
766,0.46306
767,0.47033
768,0.48003
769,0.4873
770,0.49298000000000003
771,0.49665
772,0.50233
773,0.5096
774,0.5168699999999999
775,0.5241399999999999
776,0.53383
777,0.5411
778,0.54879
779,0.55606
780,0.56534
781,0.5726100000000001
782,0.57989
783,0.58958
784,0.59727
785,0.60454
786,0.6118100000000001
787,0.62151
788,0.62879
789,0.6360600000000001
790,0.6433399999999999
791,0.6510199999999999
792,0.65385
793,0.65628
794,0.66355
795,0.67407
796,0.68175
797,0.6894399999999999
798,0.69671
799,0.6995399999999999
800,0.70439
801,0.71167
802,0.71368
803,0.71853
804,0.7254
805,0.73227
806,0.74117
807,0.74805
808,0.7529100000000001
809,0.7529100000000001
810,0.75979
811,0.76708
812,0.77436
813,0.78164
814,0.79135
815,0.79864
816,0.80553
817,0.81282
818,0.8225299999999999
819,0.8302
820,0.83749
821,0.84477
822,0.85449
823,0.86177
824,0.86906
825,0.8787799999999999
826,0.88607
827,0.89335
828,0.90064
829,0.9046
830,0.90781
831,0.91548
832,0.92276
833,0.93247
834,0.93976
835,0.94705
836,0.9543299999999999
837,0.96405
838,0.9713299999999999
839,0.97862
840,0.9859100000000001
841,0.9956299999999999
842,1.0029
843,1.0102
844,1.0199
845,1.0272
846,1.0345
847,1.0418
848,1.0515
849,1.0588
850,1.0661
851,1.0734
852,1.0831
853,1.0904
854,1.0977
855,1.1022
856,1.1035
857,1.1049
858,1.1121
859,1.1194
860,1.1292
861,1.1365
862,1.1438
863,1.1532
864,1.1605
865,1.1678
866,1.1751
867,1.1848
868,1.1921
869,1.199
870,1.198
871,1.2018
872,1.2091
873,1.2165
874,1.2238
875,1.2335
876,1.2408
877,1.2478
878,1.2548
879,1.2534
880,1.2549
881,1.2539
882,1.253
883,1.2597
884,1.2667
885,1.2685
886,1.2673
887,1.2664
888,1.2655
889,1.2646
890,1.2635
891,1.2627
892,1.2618
893,1.261
894,1.2575
895,1.2526
896,1.245
897,1.2418
898,1.2408
899,1.2376
900,1.2368
901,1.2339
902,1.2239
903,1.2187
904,1.2156
905,1.2124
906,1.2051
907,1.1977
908,1.1904
909,1.1804
910,1.173
911,1.1657
912,1.1581
913,1.1547
914,1.1518
915,1.1445
916,1.1372
917,1.1274
918,1.12
919,1.1127
920,1.1051
921,1.0953
922,1.088
923,1.0806
924,1.0773
925,1.0719
926,1.0644
927,1.057
928,1.0472
929,1.0397
930,1.0323
931,1.025
932,1.0172
933,1.0141
934,1.0088
935,1.0014
936,0.9916200000000001
937,0.9842700000000001
938,0.9769200000000001
939,0.96957
940,0.9597700000000001
941,0.95242
942,0.94486
943,0.9375100000000001
944,0.92771
945,0.9203600000000001
946,0.91791
947,0.91546
948,0.91056
949,0.903
950,0.89544
951,0.8925799999999999
952,0.88992
953,0.8872700000000001
954,0.8797200000000001
955,0.87726
956,0.8748100000000001
957,0.86746
958,0.86011
959,0.85031
960,0.84295
961,0.8354
962,0.82805
963,0.81824
964,0.81519
965,0.81215
966,0.80706
967,0.7997
968,0.79235
969,0.78499
970,0.7751899999999999
971,0.76764
972,0.7602899999999999
973,0.75293
974,0.7431300000000001
975,0.7378399999999999
976,0.73482
977,0.72955
978,0.7197399999999999
979,0.71238
980,0.70503
981,0.69767
982,0.6876800000000001
983,0.68032
984,0.67297
985,0.6631600000000001
986,0.6580699999999999
987,0.6550699999999999
988,0.64982
989,0.63983
990,0.63247
991,0.62511
992,0.61758
993,0.60777
994,0.60041
995,0.59778
996,0.59482
997,0.59187
998,0.5845100000000001
999,0.57715
1000,0.56979
1001,0.55997
1002,0.55245
1003,0.54509
1004,0.53527
1005,0.52791
1006,0.52055
1007,0.51777
1008,0.51469
1009,0.50963
1010,0.50226
1011,0.4949
1012,0.48508
1013,0.47772
1014,0.47021
1015,0.46284
1016,0.45303000000000004
1017,0.44566000000000006
1018,0.43815
1019,0.43525
1020,0.43004
1021,0.42253999999999997
1022,0.41517
1023,0.40781
1024,0.39799
1025,0.39061999999999997
1026,0.38311999999999996
1027,0.3733
1028,0.36593000000000003
1029,0.35841999999999996
1030,0.35556
1031,0.35036999999999996
1032,0.34288
1033,0.33551
1034,0.32800999999999997
1035,0.31819000000000003
1036,0.31781
1037,0.31499
1038,0.3075
1039,0.29768
1040,0.29031
1041,0.28281999999999996
1042,0.27545
1043,0.26563000000000003
1044,0.25826
1045,0.25792
1046,0.25268
1047,0.2452
1048,0.23783
1049,0.23046
1050,0.22063000000000002
1051,0.21316
1052,0.20579
1053,0.19831
1054,0.19546
1055,0.19282
1056,0.18545
1057,0.17808
1058,0.16825
1059,0.16088
1060,0.15341
1061,0.14604
1062,0.13621
1063,0.12884
1064,0.12147000000000001
1065,0.1162
1066,0.11596
1067,0.10859
1068,0.10121000000000001
1069,0.091382
1070,0.08401
1071,0.07663500000000001
1072,0.069263
1073,0.059432000000000006
1074,0.05206
1075,0.044606
1076,0.037233999999999996
1077,0.027402999999999997
1078,0.020028
1079,0.012656
1080,0.0052824
1081,0.00021335
1082,-0.0024566999999999996
1083,-0.0050457
1084,-0.0051097
1085,-0.0051687
1086,-0.0053417000000000004
1087,-0.0054917
1088,-0.0056657
1089,-0.0057396999999999995
1090,-0.0057396999999999995
1091,-0.0057396999999999995
1092,0.0040624
1093,0.011439
1094,0.018813999999999997
1095,0.026191000000000002
1096,0.036026999999999997
1097,0.035938
1098,0.038326
1099,0.043224
1100,0.053061000000000004
1101,0.060438
1102,0.067815
1103,0.075192
1104,0.08502799999999999
1105,0.092405
1106,0.09978200000000001
1107,0.10962000000000001
1108,0.11699999999999999
1109,0.12437000000000001
1110,0.13175
1111,0.14157999999999998
1112,0.14895999999999998
1113,0.15634
1114,0.16372
1115,0.1687
1116,0.17123
1117,0.17618
1118,0.18356
1119,0.19339
1120,0.20077
1121,0.20815
1122,0.21552
1123,0.22536
1124,0.23273000000000002
1125,0.24011
1126,0.24995
1127,0.25732
1128,0.2647
1129,0.27208000000000004
1130,0.28194
1131,0.28931999999999997
1132,0.2967
1133,0.30407
1134,0.31390999999999997
1135,0.32128
1136,0.32866
1137,0.33604
1138,0.34586999999999996
1139,0.35325
1140,0.36063
1141,0.368
1142,0.37781
1143,0.38518
1144,0.39255999999999996
1145,0.40239
1146,0.40976999999999997
1147,0.40968999999999994
1148,0.41208999999999996
1149,0.41945
1150,0.42683000000000004
1151,0.4342
1152,0.44158000000000003
1153,0.4514
1154,0.45878
1155,0.46616
1156,0.47353
1157,0.48336999999999997
1158,0.49075
1159,0.49812
1160,0.5055
1161,0.5153399999999999
1162,0.52271
1163,0.5251600000000001
1164,0.53004
1165,0.53249
1166,0.53987
1167,0.54725
1168,0.55708
1169,0.5644600000000001
1170,0.57184
1171,0.57921
1172,0.58905
1173,0.59643
1174,0.6038
1175,0.6111800000000001
1176,0.62102
1177,0.6284
1178,0.63577
1179,0.64315
1180,0.65299
1181,0.6603600000000001
1182,0.66774
1183,0.6751199999999999
1184,0.68495
1185,0.69233
1186,0.69971
1187,0.70954
1188,0.71692
1189,0.7243
1190,0.7316699999999999
1191,0.74151
1192,0.74889
1193,0.75626
1194,0.76364
1195,0.7734800000000001
1196,0.78086
1197,0.78823
1198,0.79561
1199,0.80545
1200,0.81282
1201,0.8202
1202,0.82758
1203,0.83741
1204,0.8447899999999999
1205,0.8521700000000001
1206,0.862
1207,0.8693799999999999
1208,0.87676
1209,0.88413
1210,0.89397
1211,0.90135
1212,0.9087299999999999
1213,0.9161
1214,0.92594
1215,0.93332
1216,0.9406899999999999
1217,0.9480700000000001
1218,0.95791
1219,0.9652799999999999
1220,0.9726600000000001
1221,0.9800399999999999
1222,0.98987
1223,0.99725
1224,1.0046
1225,1.0145
1226,1.0194
1227,1.0194
1228,1.0219
1229,1.0317
1230,1.0391
1231,1.0465
1232,1.0538
1233,1.0637
1234,1.0711
1235,1.0784
1236,1.0858
1237,1.0956
1238,1.103
1239,1.1104
1240,1.1178
1241,1.1276
1242,1.1325
1243,1.135
1244,1.135
1245,1.1448
1246,1.1522
1247,1.1595
1248,1.1694
1249,1.1768
1250,1.1768
1251,1.1792
1252,1.1891
1253,1.1915
1254,1.194
1255,1.1989
1256,1.2087
1257,1.2161
1258,1.2235
1259,1.2309
1260,1.2358
1261,1.2383
1262,1.2456
1263,1.253
1264,1.2629
1265,1.2702
1266,1.2776
1267,1.2875
1268,1.2948
1269,1.3022
1270,1.3096
1271,1.3194
1272,1.3268
1273,1.3342
1274,1.3416
1275,1.3514
1276,1.3539
1277,1.3564
1278,1.3638
1279,1.3736
1280,1.381
1281,1.3884
1282,1.3958
1283,1.4056
1284,1.413
1285,1.4204
1286,1.4302
1287,1.4376
1288,1.445
1289,1.4524
1290,1.4549
1291,1.4599
1292,1.4673
1293,1.4747
1294,1.4845
1295,1.4919
1296,1.492
1297,1.4946
1298,1.4948
1299,1.4949
1300,1.4975
1301,1.5048
1302,1.5147
1303,1.5221
1304,1.5295
1305,1.5321
1306,1.5323
1307,1.5325
1308,1.5327
1309,1.5330000000000001
1310,1.5332
1311,1.5335
1312,1.5337
1313,1.524
1314,1.5166
1315,1.5169
1316,1.5147
1317,1.5151
1318,1.5154
1319,1.5132
1320,1.5059
1321,1.4988
1322,1.4991
1323,1.4969999999999999
1324,1.4974
1325,1.4979
1326,1.4906
1327,1.4833
1328,1.4788
1329,1.4793
1330,1.472
1331,1.4647
1332,1.4548
1333,1.4476
1334,1.4403
1335,1.4329
1336,1.4232
1337,1.4237
1338,1.4241
1339,1.4222
1340,1.4204
1341,1.4132
1342,1.406
1343,1.4040000000000001
1344,1.4046
1345,1.3974
1346,1.39
1347,1.3802
1348,1.3729
1349,1.3655
1350,1.3582
1351,1.3485
1352,1.3412
1353,1.3338
1354,1.3265
1355,1.3167
1356,1.3095
1357,1.31
1358,1.3082
1359,1.2984
1360,1.291
1361,1.2837
1362,1.2763
1363,1.2665
1364,1.2592
1365,1.2518
1366,1.2422
1367,1.2348
1368,1.2275
1369,1.2201
1370,1.2103
1371,1.2028
1372,1.1954
1373,1.1883
1374,1.1783
1375,1.1709
1376,1.1636
1377,1.1562
1378,1.1464
1379,1.1393
1380,1.1319
1381,1.1246
1382,1.1148
1383,1.1074
1384,1.1001
1385,1.0903
1386,1.0829
1387,1.0756
1388,1.0682
1389,1.0584
1390,1.0564
1391,1.0546
1392,1.0501
1393,1.0403
1394,1.033
1395,1.0256
1396,1.0183
1397,1.0085
1398,1.0013
1399,0.9940000000000001
1400,0.98665
1401,0.9768600000000001
1402,0.96952
1403,0.9621700000000001
1404,0.9548200000000001
1405,0.9450299999999999
1406,0.9401299999999999
1407,0.93768
1408,0.9354600000000001
1409,0.92835
1410,0.92124
1411,0.91658
1412,0.9143600000000001
1413,0.9121600000000001
1414,0.90505
1415,0.9026
1416,0.9001600000000001
1417,0.8952600000000001
1418,0.88792
1419,0.8805799999999999
1420,0.87079
1421,0.86345
1422,0.85611
1423,0.84877
1424,0.83898
1425,0.8316399999999999
1426,0.82455
1427,0.81476
1428,0.80742
1429,0.80008
1430,0.79274
1431,0.78566
1432,0.78372
1433,0.78372
1434,0.7763800000000001
1435,0.7666
1436,0.75926
1437,0.75192
1438,0.74459
1439,0.7421399999999999
1440,0.7391800000000001
1441,0.7340399999999999
1442,0.7267
1443,0.71692
1444,0.70958
1445,0.70224
1446,0.6924600000000001
1447,0.68512
1448,0.67779
1449,0.67045
1450,0.66067
1451,0.65333
1452,0.6459999999999999
1453,0.63866
1454,0.62888
1455,0.62154
1456,0.61421
1457,0.60958
1458,0.60821
1459,0.60387
1460,0.59654
1461,0.58921
1462,0.57943
1463,0.57238
1464,0.56505
1465,0.55528
1466,0.54795
1467,0.54062
1468,0.5332899999999999
1469,0.53199
1470,0.53287
1471,0.52554
1472,0.51822
1473,0.50846
1474,0.50113
1475,0.49381
1476,0.48649
1477,0.47672
1478,0.4694
1479,0.46208
1480,0.45476000000000005
1481,0.4453
1482,0.43798000000000004
1483,0.43066000000000004
1484,0.42303
1485,0.41326999999999997
1486,0.40626
1487,0.39894
1488,0.38918
1489,0.38186
1490,0.37454
1491,0.36723
1492,0.35746999999999995
1493,0.35015
1494,0.34283
1495,0.34103
1496,0.33987
1497,0.33532
1498,0.32800999999999997
1499,0.3207
1500,0.31095
1501,0.30364
1502,0.29633000000000004
1503,0.28902
1504,0.27928000000000003
1505,0.27197
1506,0.26466
1507,0.25945
1508,0.25701999999999997
1509,0.25458000000000003
1510,0.24727
1511,0.23753000000000002
1512,0.23021999999999998
1513,0.22501
1514,0.22224000000000002
1515,0.2146
1516,0.20695999999999998
1517,0.19965
1518,0.19234
1519,0.18259
1520,0.17772000000000002
1521,0.17772000000000002
1522,0.17462
1523,0.16487000000000002
1524,0.15755999999999998
1525,0.15025
1526,0.14051
1527,0.13285999999999998
1528,0.12555999999999998
1529,0.11825
1530,0.1085
1531,0.10119
1532,0.093888
1533,0.08657999999999999
1534,0.076837
1535,0.06919199999999999
1536,0.061884
1537,0.059449
1538,0.057012
1539,0.049706
1540,0.042401
1541,0.035095
1542,0.027788999999999998
1543,0.027788999999999998
1544,0.027788999999999998
1545,0.026392000000000002
1546,0.027804000000000002
1547,0.026087
1548,0.018791
1549,0.0094274
1550,0.0069964
1551,0.0069964
1552,0.007731399999999999
1553,0.0092234
1554,0.010364
1555,0.011525
1556,0.011916
1557,0.012306999999999998
1558,0.015526
1559,0.016725999999999998
1560,0.019959
1561,0.030069
1562,0.037342
1563,0.038572
1564,0.042241
1565,0.049928
1566,0.057616999999999995
1567,0.06373
1568,0.067866
1569,0.075128
1570,0.08239199999999999
1571,0.089654
1572,0.09977000000000001
1573,0.10703
1574,0.1143
1575,0.11914000000000001
1576,0.12328
1577,0.12944
1578,0.1367
1579,0.14395
1580,0.15363
1581,0.1609
1582,0.16815
1583,0.17585
1584,0.18553
1585,0.19279000000000002
1586,0.20006
1587,0.20974
1588,0.217
1589,0.22228
1590,0.226
1591,0.23215
1592,0.23940999999999998
1593,0.24666999999999997
1594,0.25393000000000004
1595,0.2636
1596,0.27087
1597,0.27856
1598,0.28581999999999996
1599,0.2955
1600,0.30276
1601,0.30649
1602,0.30781
1603,0.31793000000000005
1604,0.32519000000000003
1605,0.33245
1606,0.34212
1607,0.34938
1608,0.35708
1609,0.36434
1610,0.37401
1611,0.38127
1612,0.38500999999999996
1613,0.38876
1614,0.39647
1615,0.40371999999999997
1616,0.41097
1617,0.41867
1618,0.42835
1619,0.4356
1620,0.44286000000000003
1621,0.44616999999999996
1622,0.45038999999999996
1623,0.45326000000000005
1624,0.4605
1625,0.46821
1626,0.47788
1627,0.48513
1628,0.48891
1629,0.49317
1630,0.50041
1631,0.50766
1632,0.5149
1633,0.52456
1634,0.53227
1635,0.53952
1636,0.54677
1637,0.55056
1638,0.55437
1639,0.55967
1640,0.56691
1641,0.57657
1642,0.58428
1643,0.5915199999999999
1644,0.59877
1645,0.60843
1646,0.61177
1647,0.61559
1648,0.62136
1649,0.6286
1650,0.63584
1651,0.64308
1652,0.6532100000000001
1653,0.66045
1654,0.66769
1655,0.67298
1656,0.67729
1657,0.68066
1658,0.6879
1659,0.69513
1660,0.7047800000000001
1661,0.71202
1662,0.71973
1663,0.72697
1664,0.7366199999999999
1665,0.7438600000000001
1666,0.7511
1667,0.7549399999999999
1668,0.75879
1669,0.7640899999999999
1670,0.77132
1671,0.7809699999999999
1672,0.7882100000000001
1673,0.79592
1674,0.80316
1675,0.81281
1676,0.81665
1677,0.82052
1678,0.8258200000000001
1679,0.83547
1680,0.8427
1681,0.84993
1682,0.85765
1683,0.86729
1684,0.8745200000000001
1685,0.88176
1686,0.89141
1687,0.89671
1688,0.9005700000000001
1689,0.9020299999999999
1690,0.9116700000000001
1691,0.9189
1692,0.9261299999999999
1693,0.93385
1694,0.9434899999999999
1695,0.95073
1696,0.95796
1697,0.96519
1698,0.97483
1699,0.97725
1700,0.9796600000000001
1701,0.9844799999999999
1702,0.9922
1703,0.9950899999999999
1704,0.99798
1705,1.0057
1706,1.0163
1707,1.0192
1708,1.0216
1709,1.0313
1710,1.0385
1711,1.0457
1712,1.053
1713,1.0626
1714,1.0698
1715,1.0771
1716,1.0843
1717,1.094
1718,1.1012
1719,1.1084
1720,1.1157
1721,1.1258
1722,1.133
1723,1.1403
1724,1.1475
1725,1.1572
1726,1.1644
1727,1.1716
1728,1.1755
1729,1.1793
1730,1.187
1731,1.1943
1732,1.2039
1733,1.2116
1734,1.2189
1735,1.2261
1736,1.2362
1737,1.2372
1738,1.2409999999999999
1739,1.2463
1740,1.2565
1741,1.2603
1742,1.2642
1743,1.2695
1744,1.2797
1745,1.2831
1746,1.287
1747,1.288
1748,1.2957
1749,1.3029
1750,1.3106
1751,1.3208
1752,1.3256
1753,1.3266
1754,1.3305
1755,1.3326
1756,1.3341
1757,1.3394
1758,1.3472
1759,1.3535
1760,1.3551
1761,1.3567
1762,1.3583
1763,1.3628
1764,1.3645
1765,1.3661
1766,1.3683
1767,1.37
1768,1.3716
1769,1.3733
1770,1.3756
1771,1.3773
1772,1.3767
1773,1.3784
1774,1.3807
1775,1.3825
1776,1.3813
1777,1.3748
1778,1.3688
1779,1.3682
1780,1.3671
1781,1.3599
1782,1.3534
1783,1.3552
1784,1.3547
1785,1.3505
1786,1.3417
1787,1.3405
1788,1.34
1789,1.3366
1790,1.3294
1791,1.3229
1792,1.3158
1793,1.3063
1794,1.3059
1795,1.3078
1796,1.3037
1797,1.2942
1798,1.2871
1799,1.28
1800,1.2729
1801,1.2641
1802,1.2570000000000001
1803,1.2499
1804,1.2428
1805,1.2333
1806,1.2262
1807,1.2191
1808,1.2144
1809,1.215
1810,1.2086
1811,1.2022
1812,1.1958
1813,1.1941
1814,1.1917
1815,1.1846
1816,1.1822
1817,1.1792
1818,1.1738
1819,1.166
1820,1.1559
1821,1.1552
1822,1.1529
1823,1.1481
1824,1.1387
1825,1.1316
1826,1.1245
1827,1.115
1828,1.1079999999999999
1829,1.1009
1830,1.0931
1831,1.0837
1832,1.0766
1833,1.0695
1834,1.0624
1835,1.053
1836,1.0459
1837,1.0405
1838,1.0361
1839,1.0293
1840,1.0222
1841,1.0151
1842,1.008
1843,0.9985799999999999
1844,0.9915
1845,0.9837299999999999
1846,0.97665
1847,0.9672200000000001
1848,0.96014
1849,0.9530700000000001
1850,0.9436399999999999
1851,0.9365600000000001
1852,0.9294899999999999
1853,0.92242
1854,0.9129999999999999
1855,0.9059299999999999
1856,0.8988700000000001
1857,0.8918
1858,0.8823799999999999
1859,0.8753200000000001
1860,0.86755
1861,0.86377
1862,0.85624
1863,0.8491700000000001
1864,0.8421
1865,0.83504
1866,0.82562
1867,0.8185600000000001
1868,0.8114899999999999
1869,0.80208
1870,0.7943100000000001
1871,0.78725
1872,0.7801899999999999
1873,0.77079
1874,0.76373
1875,0.75668
1876,0.74963
1877,0.74023
1878,0.73318
1879,0.72613
1880,0.71909
1881,0.7096899999999999
1882,0.70265
1883,0.6956100000000001
1884,0.68857
1885,0.67918
1886,0.67215
1887,0.6651100000000001
1888,0.65573
1889,0.6487
1890,0.64167
1891,0.63464
1892,0.6323
1893,0.62995
1894,0.6221800000000001
1895,0.6190899999999999
1896,0.61525
1897,0.60748
1898,0.5997
1899,0.5919300000000001
1900,0.58958
1901,0.58958
1902,0.58255
1903,0.57552
1904,0.56615
1905,0.55913
1906,0.5521
1907,0.54274
1908,0.53572
1909,0.52794
1910,0.52168
1911,0.51156
1912,0.50455
1913,0.49753000000000003
1914,0.49051999999999996
1915,0.48117
1916,0.47416
1917,0.46715
1918,0.46015
1919,0.45081000000000004
1920,0.4438
1921,0.4368
1922,0.42981
1923,0.42046999999999995
1924,0.41348
1925,0.40648
1926,0.39949
1927,0.39016999999999996
1928,0.38394
1929,0.37926
1930,0.37304
1931,0.36604000000000003
1932,0.35904
1933,0.35205
1934,0.34273000000000003
1935,0.33574
1936,0.32875
1937,0.32097
1938,0.31166
1939,0.30468
1940,0.29769
1941,0.29070999999999997
1942,0.28141
1943,0.27443
1944,0.26585
1945,0.26114
1946,0.2549
1947,0.24791
1948,0.24093
1949,0.23163000000000003
1950,0.22385
1951,0.21686999999999998
1952,0.2099
1953,0.2006
1954,0.19363
1955,0.18585
1956,0.18424000000000001
1957,0.17873
1958,0.17174
1959,0.16477
1960,0.15779
1961,0.14849
1962,0.14072
1963,0.13375
1964,0.12678
1965,0.11749000000000001
1966,0.11052000000000001
1967,0.10507000000000001
1968,0.099514
1969,0.095585
1970,0.088611
1971,0.08164
1972,0.07153999999999999
1973,0.064571
1974,0.057509000000000005
1975,0.055107
1976,0.047331
1977,0.040352
1978,0.033378
1979,0.026405
1980,0.017112
1981,0.010143000000000001
1982,0.0031774
1983,-0.0037866999999999996
1984,-0.013069999999999998
1985,-0.020031999999999998
1986,-0.026987999999999998
1987,-0.036261
1988,-0.043216000000000004
1989,-0.050167
1990,-0.057114
1991,-0.06637699999999999
1992,-0.07331900000000001
1993,-0.080261
1994,-0.088034
1995,-0.09644900000000001
1996,-0.10338
1997,-0.11030999999999999
1998,-0.11724000000000001
1999,-0.12648
2000,-0.1334
2001,-0.14032999999999998
2002,-0.1481
2003,-0.15732000000000002
2004,-0.16424
2005,-0.17115
2006,-0.17807
2007,-0.18728
2008,-0.19418
2009,-0.20108
2010,-0.21029
2011,-0.21718
2012,-0.22408000000000003
2013,-0.23009000000000002
2014,-0.23928000000000002
2015,-0.24616
2016,-0.25215
2017,-0.24948
2018,-0.25136
2019,-0.25822
2020,-0.26508000000000004
2021,-0.27193
2022,-0.28015999999999996
2023,-0.287
2024,-0.29385
2025,-0.30069
2026,-0.29791
2027,-0.2974
2028,-0.30101
2029,-0.3101
2030,-0.31597
2031,-0.32278
2032,-0.32958000000000004
2033,-0.32671999999999995
2034,-0.32611
2035,-0.32966999999999996
2036,-0.33645
2037,-0.34451
2038,-0.35129
2039,-0.35805
2040,-0.35511
2041,-0.35439
2042,-0.36014
2043,-0.36689
2044,-0.37363
2045,-0.3816
2046,-0.38833
2047,-0.39057
2048,-0.39057
2049,-0.38752
2050,-0.38445999999999997
2051,-0.38139
2052,-0.37726
2053,-0.37726
2054,-0.37622
2055,-0.37191
2056,-0.36551
2057,-0.36224
2058,-0.35451
2059,-0.34784
2060,-0.34142
2061,-0.33825
2062,-0.33159
2063,-0.32493
2064,-0.31498000000000004
2065,-0.30831
2066,-0.30282
2067,-0.29638000000000003
2068,-0.29205
2069,-0.28433
2070,-0.27662
2071,-0.27016
2072,-0.26581
2073,-0.25916
2074,-0.25251
2075,-0.24256999999999998
2076,-0.23590999999999998
2077,-0.23158
2078,-0.22618000000000002
2079,-0.2174
2080,-0.20968
2081,-0.20427
2082,-0.19884000000000002
2083,-0.19113
2084,-0.18342
2085,-0.17678
2086,-0.17013
2087,-0.16135
2088,-0.15592999999999999
2089,-0.14936
2090,-0.13944
2091,-0.134
2092,-0.12855999999999998
2093,-0.12305999999999999
2094,-0.11314
2095,-0.10877
2096,-0.10332000000000001
2097,-0.098937
2098,-0.090112
2099,-0.08349
2100,-0.075783
2101,-0.069156
2102,-0.06262000000000001
2103,-0.057152999999999995
2104,-0.050539
2105,-0.043919
2106,-0.034004
2107,-0.027379
2108,-0.020799
2109,-0.014253
2110,-0.006548699999999999
2111,0.0011554
2112,0.0055354
2113,0.012105
2114,0.017603999999999998
2115,0.025303
2116,0.030801
2117,0.037389
2118,0.041788
2119,0.048386
2120,0.054986
2121,0.063794
2122,0.071496
2123,0.078106
2124,0.084718
2125,0.093512
2126,0.09898799999999999
2127,0.10338
2128,0.11219000000000001
2129,0.11989000000000001
2130,0.1265
2131,0.13312000000000002
2132,0.13859000000000002
2133,0.14407
2134,0.15177000000000002
2135,0.15947
2136,0.16496
2137,0.17046
2138,0.17595
2139,0.18255
2140,0.19245
2141,0.19906
2142,0.20676
2143,0.21005
2144,0.21555
2145,0.22214
2146,0.22984000000000002
2147,0.23644
2148,0.24525
2149,0.25075
2150,0.25403000000000003
2151,0.26173
2152,0.26943
2153,0.27603
2154,0.27933
2155,0.28595
2156,0.29254
2157,0.30023
2158,0.30575
2159,0.31239
2160,0.32008000000000003
2161,0.32666
2162,0.33219
2163,0.33885
2164,0.34654
2165,0.35311
2166,0.35866
2167,0.36533000000000004
2168,0.36971
2169,0.37739
2170,0.38402
2171,0.3874
2172,0.39297
2173,0.39638
2174,0.40094
2175,0.40644
2176,0.41297
2177,0.41961000000000004
2178,0.42636
2179,0.43403
2180,0.44171000000000005
2181,0.44618
2182,0.45077
2183,0.45641000000000004
2184,0.45988
2185,0.46553999999999995
2186,0.47536000000000006
2187,0.48202
2188,0.48552
2189,0.4902
2190,0.49588000000000004
2191,0.50158
2192,0.5092300000000001
2193,0.51688
2194,0.52042
2195,0.5239699999999999
2196,0.52754
2197,0.5323100000000001
2198,0.5359
2199,0.5395
2200,0.5431199999999999
2201,0.54796
2202,0.55374
2203,0.55525
2204,0.55892
2205,0.56383
2206,0.56752
2207,0.57122
2208,0.57618
2209,0.57992
2210,0.5836600000000001
2211,0.5874199999999999
2212,0.59244
2213,0.59285
2214,0.58778
2215,0.58273
2216,0.5857100000000001
2217,0.58406
2218,0.57905
2219,0.57614
2220,0.58129
2221,0.58307
2222,0.58696
2223,0.59086
2224,0.5838300000000001
2225,0.57758
2226,0.57265
2227,0.5664100000000001
2228,0.56489
2229,0.5667800000000001
2230,0.5673600000000001
2231,0.55908
2232,0.55288
2233,0.54668
2234,0.5404800000000001
2235,0.53223
2236,0.52605
2237,0.5198699999999999
2238,0.5137
2239,0.50547
2240,0.49931000000000003
2241,0.49315
2242,0.48700000000000004
2243,0.4788
2244,0.47266
2245,0.46652
2246,0.46038999999999997
2247,0.45221999999999996
2248,0.44606
2249,0.44197
2250,0.43446999999999997
2251,0.42833000000000004
2252,0.42083999999999994
2253,0.41471
2254,0.40585
2255,0.39969
2256,0.39491
2257,0.38878
2258,0.38061999999999996
2259,0.37313
2260,0.36701999999999996
2261,0.35881
2262,0.35128000000000004
2263,0.34515999999999997
2264,0.33904
2265,0.33293
2266,0.32341
2267,0.31731
2268,0.31121
2269,0.30235
2270,0.29616
2271,0.29136
2272,0.28388
2273,0.27501
2274,0.26883
2275,0.26608000000000004
2276,0.25997
2277,0.25183
2278,0.24435
2279,0.23826
2280,0.23142
2281,0.22385
2282,0.2184
2283,0.21091999999999997
2284,0.20546999999999999
2285,0.19791
2286,0.19311
2287,0.18700999999999998
2288,0.17749
2289,0.17139000000000001
2290,0.1653
2291,0.1605
2292,0.15292
2293,0.14544
2294,0.13935
2295,0.13326
2296,0.12376
2297,0.11767999999999999
2298,0.11160999999999999
2299,0.10554000000000001
2300,0.09932
2301,0.093106
2302,0.087662
2303,0.081588
2304,0.072101
2305,0.066039
2306,0.059983
2307,0.055773
2308,0.048152
2309,0.044107
2310,0.038043
2311,0.028561000000000003
2312,0.022507
2313,0.01646
2314,0.012237999999999999
2315,0.004605399999999999
2316,-0.0014537
2317,-0.0075077
2318,-0.014963999999999998
2319,-0.023022
2320,-0.029873
2321,-0.036116
2322,-0.042964999999999996
2323,-0.051026
2324,-0.058476
2325,-0.064511
2326,-0.070538
2327,-0.07821499999999999
2328,-0.084466
2329,-0.090505
2330,-0.099963
2331,-0.10599000000000001
2332,-0.11200999999999998
2333,-0.11685999999999999
2334,-0.12454000000000001
2335,-0.13199
2336,-0.13801
2337,-0.14403
2338,-0.15347
2339,-0.15947999999999998
2340,-0.16548
2341,-0.17147
2342,-0.17777
2343,-0.18406
2344,-0.18949000000000002
2345,-0.19549
2346,-0.20490999999999998
2347,-0.2109
2348,-0.21688000000000002
2349,-0.22264
2350,-0.22894
2351,-0.23493000000000003
2352,-0.24235
2353,-0.25009000000000003
2354,-0.25638
2355,-0.26238
2356,-0.26837
2357,-0.27779
2358,-0.28376999999999997
2359,-0.28720999999999997
2360,-0.29352
2361,-0.30382
2362,-0.3098
2363,-0.31578
2364,-0.32319000000000003
2365,-0.33114
2366,-0.33548
2367,-0.34181
2368,-0.34922
2369,-0.35664
2370,-0.36296
2371,-0.36927
2372,-0.37669
2373,-0.38266999999999995
2374,-0.39008000000000004
2375,-0.39605
2376,-0.40491
2377,-0.40925
2378,-0.41412
2379,-0.42153999999999997
2380,-0.42949
2381,-0.43383999999999995
2382,-0.44015
2383,-0.44756999999999997
2384,-0.45698
2385,-0.46293999999999996
2386,-0.4689
2387,-0.47431999999999996
2388,-0.48211000000000004
2389,-0.48699
2390,-0.49295
2391,-0.50089
2392,-0.5083
2393,-0.5142399999999999
2394,-0.52059
2395,-0.5283899999999999
2396,-0.5343399999999999
2397,-0.5402899999999999
2398,-0.5476800000000001
2399,-0.5555899999999999
2400,-0.56101
2401,-0.5673699999999999
2402,-0.57175
2403,-0.57967
2404,-0.58706
2405,-0.59299
2406,-0.5989
2407,-0.6077600000000001
2408,-0.61216
2409,-0.61707
2410,-0.6249600000000001
2411,-0.63235
2412,-0.63825
2413,-0.64415
2414,-0.6520100000000001
2415,-0.65937
2416,-0.66478
2417,-0.67119
2418,-0.67808
2419,-0.68396
2420,-0.6913199999999999
2421,-0.69719
2422,-0.7065
2423,-0.7109800000000001
2424,-0.7174
2425,-0.72327
2426,-0.73109
2427,-0.7369399999999999
2428,-0.74428
2429,-0.7520600000000001
2430,-0.75789
2431,-0.76522
2432,-0.76975
2433,-0.7781600000000001
2434,-0.78398
2435,-0.7898
2436,-0.79713
2437,-0.80486
2438,-0.80984
2439,-0.8163199999999999
2440,-0.82129
2441,-0.8290299999999999
2442,-0.83635
2443,-0.84214
2444,-0.8479200000000001
2445,-0.8544299999999999
2446,-0.8609399999999999
2447,-0.8663200000000001
2448,-0.87211
2449,-0.88134
2450,-0.8871
2451,-0.8944
2452,-0.9009299999999999
2453,-0.9055200000000001
2454,-0.9113
2455,-0.91706
2456,-0.92627
2457,-0.93201
2458,-0.93547
2459,-0.94201
2460,-0.95047
2461,-0.9577600000000001
2462,-0.9635
2463,-0.9681299999999999
2464,-0.9781200000000001
2465,-0.98388
2466,-0.99116
2467,-0.9969
2468,-1.0045
2469,-1.0095
2470,-1.0161
2471,-1.023
2472,-1.0303
2473,-1.0357
2474,-1.0422
2475,-1.0488
2476,-1.0545
2477,-1.0618
2478,-1.0675
2479,-1.0751
2480,-1.0836
2481,-1.0883
2482,-1.0955
2483,-1.1047
2484,-1.1113
2485,-1.1159
2486,-1.1232
2487,-1.1324
2488,-1.1381
2489,-1.1438
2490,-1.1523
2491,-1.1589
2492,-1.1642
2493,-1.1715
2494,-1.1784
2495,-1.185
2496,-1.19
2497,-1.1957
2498,-1.2049
2499,-1.2106
2500,-1.2162
2501,-1.2213
2502,-1.2294
2503,-1.2367
2504,-1.2439
2505,-1.249
2506,-1.2571
2507,-1.2644
2508,-1.2716
2509,-1.2798
2510,-1.2864
2511,-1.2921
2512,-1.2978
2513,-1.3069
2514,-1.3126
2515,-1.3179
2516,-1.3226
2517,-1.3311
2518,-1.3384
2519,-1.344
2520,-1.3488
2521,-1.3569
2522,-1.3626
2523,-1.3699
2524,-1.3749
2525,-1.3831
2526,-1.3884
2527,-1.3957
2528,-1.4026
2529,-1.4108
2530,-1.4142
2531,-1.4215
2532,-1.4287
2533,-1.4353
2534,-1.44
2535,-1.4473
2536,-1.4564
2537,-1.4611
2538,-1.4677
2539,-1.4731
2540,-1.4807
2541,-1.4857
2542,-1.4923
2543,-1.4973
2544,-1.5049
2545,-1.5122
2546,-1.5178
2547,-1.5235
2548,-1.5319999999999998
2549,-1.5367
2550,-1.5421
2551,-1.5496
2552,-1.5569
2553,-1.5625
2554,-1.5682
2555,-1.5745
2556,-1.5811
2557,-1.5868
2558,-1.5924
2559,-1.6015
2560,-1.6071
2561,-1.614
2562,-1.6207
2563,-1.6276
2564,-1.6332
2565,-1.6388
2566,-1.6444
2567,-1.6534
2568,-1.6589
2569,-1.6645
2570,-1.6714
2571,-1.6781
2572,-1.6851
2573,-1.6906
2574,-1.6979
2575,-1.705
2576,-1.7105
2577,-1.7159
2578,-1.7231
2579,-1.7318
2580,-1.7368
2581,-1.7439
2582,-1.7511
2583,-1.7564
2584,-1.7635
2585,-1.7688
2586,-1.7759
2587,-1.7812
2588,-1.7863
2589,-1.7949
2590,-1.8002
2591,-1.8055
2592,-1.8108
2593,-1.8178
2594,-1.8247
2595,-1.8299
2596,-1.8351
2597,-1.8419
2598,-1.847
2599,-1.8522
2600,-1.8576
2601,-1.8663
2602,-1.8714
2603,-1.8765
2604,-1.8815
2605,-1.89
2606,-1.895
2607,-1.9
2608,-1.9049
2609,-1.9115
2610,-1.9163
2611,-1.9216
2612,-1.9306
2613,-1.9374
2614,-1.9422
2615,-1.9469999999999998
2616,-1.9534
2617,-1.9582
2618,-1.9629
2619,-1.9676
2620,-1.9737
2621,-1.9803
2622,-1.9848
2623,-1.9894
2624,-1.9954
2625,-1.9998
2626,-2.0042
2627,-2.0086
2628,-2.0144
2629,-2.0207
2630,-2.0247
2631,-2.0341
2632,-2.0384
2633,-2.0427
2634,-2.0469
2635,-2.0525
2636,-2.0566
2637,-2.0607
2638,-2.0647
2639,-2.07
2640,-2.074
2641,-2.0779
2642,-2.0838
2643,-2.0889
2644,-2.0926
2645,-2.0963
2646,-2.1
2647,-2.1048
2648,-2.1083
2649,-2.1118
2650,-2.1163
2651,-2.124
2652,-2.1317
2653,-2.1361
2654,-2.1406
2655,-2.1439
2656,-2.1471
2657,-2.1503
2658,-2.1544
2659,-2.1574
2660,-2.1604
2661,-2.1633
2662,-2.1694
2663,-2.1722
2664,-2.1749
2665,-2.1753
2666,-2.1787
2667,-2.1813
2668,-2.186
2669,-2.1892
2670,-2.1915
2671,-2.1937
2672,-2.1959
2673,-2.1987
2674,-2.2007
2675,-2.2027
2676,-2.2045
2677,-2.2069
2678,-2.2086
2679,-2.2103
2680,-2.2119
2681,-2.2138
2682,-2.2153
2683,-2.2166
2684,-2.2178
2685,-2.2194
2686,-2.2229
2687,-2.2257
2688,-2.2333
2689,-2.2392
2690,-2.2401
2691,-2.2409
2692,-2.2419
2693,-2.2426
2694,-2.2456
2695,-2.2461
2696,-2.2467
2697,-2.247
2698,-2.2472
2699,-2.2474
2700,-2.2474
2701,-2.2474
2702,-2.2474
2703,-2.2474
2704,-2.2474
2705,-2.2474
2706,-2.2474
2707,-2.2474
2708,-2.2474
