time,value
0,-0.15805
1,-0.15805
2,-0.15805
3,-0.15805
4,-0.15805
5,-0.15805
6,-0.15805
7,-0.15805
8,-0.15805
9,-0.15805
10,-0.15805
11,-0.15805
12,-0.15805
13,-0.15805
14,-0.15805
15,-0.15805
16,-0.15805
17,-0.15805
18,-0.15805
19,-0.15805
20,-0.15805
21,-0.15805
22,-0.15805
23,-0.15805
24,-0.15805
25,-0.15805
26,-0.15805
27,-0.15805
28,-0.15805
29,-0.15805
30,-0.15805
31,-0.15805
32,-0.15805
33,-0.15805
34,-0.15805
35,0.083427
36,6.4155
37,0.21758000000000002
38,0.056596
39,0.070011
40,0.043181
41,7.1801
42,-0.15805
43,-0.15805
44,-0.15805
45,-0.15805
46,-0.15805
47,-0.15805
48,-0.15805
49,-0.15805
50,-0.15805
51,-0.15805
52,-0.15805
53,-0.15805
54,-0.15805
55,-0.15805
56,-0.15805
57,-0.15805
58,-0.15805
59,-0.15805
60,-0.15805
61,-0.15805
62,-0.15805
63,-0.15805
64,-0.15805
65,-0.15805
66,-0.15805
67,-0.15805
68,-0.15805
69,-0.15805
70,-0.15805
71,-0.15805
72,-0.15805
73,-0.15805
74,-0.15805
75,-0.15805
76,-0.15805
77,-0.15805
78,-0.15805
79,-0.15805
80,-0.15805
81,-0.15805
82,-0.15805
83,-0.15805
84,-0.15805
85,-0.15805
86,-0.15805
87,-0.15805
88,-0.15805
89,-0.15805
90,-0.15805
91,-0.15805
92,-0.15805
93,-0.15805
94,-0.15805
95,-0.15805
