time,value
0,1.5835
1,1.5752
2,1.5439
3,1.4846
4,1.4188
5,1.3857
6,1.3032
7,1.2107
8,1.1228
9,1.0243
10,0.92263
11,0.83149
12,0.72777
13,0.6270600000000001
14,0.528
15,0.42586999999999997
16,0.33126
17,0.24195999999999998
18,0.14388
19,0.047751
20,-0.035674000000000004
21,-0.12538
22,-0.21191999999999997
23,-0.30014
24,-0.39479000000000003
25,-0.47498999999999997
26,-0.55902
27,-0.6431600000000001
28,-0.7259399999999999
29,-0.79079
30,-0.8609399999999999
31,-0.92079
32,-0.9863700000000001
33,-1.0463
34,-1.0978
35,-1.1486
36,-1.1927
37,-1.2297
38,-1.2591
39,-1.2898
40,-1.3124
41,-1.3166
42,-1.3218
43,-1.3181
44,-1.3056
45,-1.2942
46,-1.2676
47,-1.2309999999999999
48,-1.1961
49,-1.1540000000000001
50,-1.1042
51,-1.0555
52,-0.99541
53,-0.93009
54,-0.8679
55,-0.79894
56,-0.72783
57,-0.6521399999999999
58,-0.57301
59,-0.48532
60,-0.40891
61,-0.32522
62,-0.2434
63,-0.14994000000000002
64,-0.06603300000000001
65,0.025356999999999998
66,0.12115
67,0.21458000000000002
68,0.30764
69,0.41162
70,0.5027699999999999
71,0.60202
72,0.6977399999999999
73,0.79157
74,0.88497
75,0.9442200000000001
76,1.0347
77,1.1337
78,1.2357
79,1.3304
80,1.4262
81,1.5166
82,1.5927
83,1.6486
84,1.6691
85,1.6917
86,1.7013
87,1.6925
88,1.6742
89,1.6137
90,1.5857
91,1.4966
92,1.4268
93,1.3268
94,1.2252
95,1.129
96,1.0273
97,0.92045
98,0.8189
99,0.71332
100,0.61436
101,0.50984
102,0.41152
103,0.30426
104,0.21996999999999997
105,0.1212
106,0.023708
107,-0.06827000000000001
108,-0.16335999999999998
109,-0.25508000000000003
110,-0.34001
111,-0.42773999999999995
112,-0.52235
113,-0.5997600000000001
114,-0.6794600000000001
115,-0.75254
116,-0.8351700000000001
117,-0.8989
118,-0.9799399999999999
119,-1.0345
120,-1.105
121,-1.146
122,-1.2105
123,-1.2491
124,-1.2948
125,-1.3143
126,-1.3536
127,-1.354
128,-1.376
129,-1.3709
130,-1.3957
131,-1.3552
132,-1.3636
133,-1.3259999999999998
134,-1.2809
135,-1.2632
136,-1.2411
137,-1.1578
138,-1.1168
139,-1.0628
140,-1.0006
141,-0.93785
142,-0.87165
143,-0.79062
144,-0.71987
145,-0.63468
146,-0.55735
147,-0.47298999999999997
148,-0.37731
149,-0.29128000000000004
150,-0.19839
151,-0.11417000000000001
152,-0.023356000000000002
153,0.084689
154,0.16330999999999998
155,0.1838
156,0.28394
157,0.37538
158,0.36513
159,0.34296
160,0.43696
161,0.44642
162,0.54181
163,0.6041
164,0.7138800000000001
165,0.81362
166,0.91837
167,1.0209
168,1.1225
169,1.2236
170,1.3123
171,1.4071
172,1.4603
173,1.5071
174,1.5474
175,1.5843
