time,value
0,2.0662
1,2.0251
2,1.9842
3,1.9437
4,1.9033
5,1.8630000000000002
6,1.8230000000000002
7,1.7832
8,1.7435
9,1.7042
10,1.6651
11,1.626
12,1.587
13,1.5483
14,1.5097
15,1.4713
16,1.4332
17,1.3949
18,1.3574
19,1.3182
20,1.2808
21,1.2434
22,1.2054
23,1.1677
24,1.13
25,1.0925
26,1.0562
27,1.0178
28,0.9807
29,0.94378
30,0.9053899999999999
31,0.8675200000000001
32,0.83099
33,0.79464
34,0.75637
35,0.71919
36,0.6833
37,0.64685
38,0.60849
39,0.57311
40,0.53496
41,0.49904
42,0.4609
43,0.42544
44,0.3867
45,0.35236
46,0.31377
47,0.27984000000000003
48,0.24143
49,0.20574
50,0.16985999999999998
51,0.13419
52,0.098709
53,0.060801
54,0.028183
55,-0.0091859
56,-0.046744
57,-0.081887
58,-0.11632
59,-0.15267999999999998
60,-0.1897
61,-0.2266
62,-0.25675
63,-0.29324
64,-0.32958000000000004
65,-0.36030999999999996
66,-0.39654
67,-0.43013999999999997
68,-0.4656
69,-0.50085
70,-0.53072
71,-0.56242
72,-0.59675
73,-0.6308
74,-0.6645300000000001
75,-0.68883
76,-0.72167
77,-0.7541399999999999
78,-0.7762899999999999
79,-0.8076800000000001
80,-0.8280799999999999
81,-0.8582299999999999
82,-0.87669
83,-0.90541
84,-0.9173899999999999
85,-0.93673
86,-0.95034
87,-0.96499
88,-0.9864
89,-0.99593
90,-1.0176
91,-1.0281
92,-1.0437
93,-1.0473
94,-1.0641
95,-1.0646
96,-1.0613
97,-1.0603
98,-1.0556
99,-1.0492
100,-1.0562
101,-1.0475
102,-1.0365
103,-1.0397
104,-1.0412
105,-1.0333
106,-1.0733
107,-1.1134
108,-1.1532
109,-1.1934
110,-1.2339
111,-1.2737
112,-1.3118
113,-1.3477
114,-1.3833
115,-1.3954
116,-1.3855
117,-1.3855
118,-1.3748
119,-1.359
120,-1.3414
121,-1.3243
122,-1.3101
123,-1.2929
124,-1.2693
125,-1.2562
126,-1.2307
127,-1.2035
128,-1.1754
129,-1.1573
130,-1.1274
131,-1.0967
132,-1.0696
133,-1.0423
134,-1.0104
135,-0.98506
136,-0.95239
137,-0.91819
138,-0.8891600000000001
139,-0.85657
140,-0.82119
141,-0.7873399999999999
142,-0.75673
143,-0.72043
144,-0.68394
145,-0.65159
146,-0.61139
147,-0.57728
148,-0.5414899999999999
149,-0.49893000000000004
150,-0.4615
151,-0.41825
152,-0.3807
153,-0.33745
154,-0.30529
155,-0.27513000000000004
156,-0.25921
157,-0.27088
158,-0.28179
159,-0.28549
160,-0.25203000000000003
161,-0.21331
162,-0.17413
163,-0.13824
164,-0.09892999999999999
165,-0.06046699999999999
166,-0.023232
167,0.019195
168,0.060830999999999996
169,0.1017
170,0.14568
171,0.18921
172,0.23178
173,0.27482
174,0.31911
175,0.36314
176,0.40793
177,0.45246000000000003
178,0.48315
179,0.5300199999999999
180,0.57901
181,0.6240899999999999
182,0.6713899999999999
183,0.70398
184,0.74825
185,0.79819
186,0.84357
187,0.88899
188,0.93445
189,0.9799399999999999
190,1.024
191,1.071
192,1.1166
193,1.1623
194,1.2079
195,1.25
196,1.2638
197,1.2515
198,1.2241
199,1.1971
200,1.1704
201,1.1440000000000001
202,1.1181
203,1.0925
204,1.0672
205,1.0501
206,1.0338
207,1.0098
208,1.0021
209,0.9949
210,0.9882
211,0.98201
212,0.97631
213,0.96544
214,0.96645
215,0.96229
216,0.9586399999999999
217,0.9555100000000001
218,0.93674
219,0.9346399999999999
220,0.9214399999999999
221,0.91581
222,0.91527
223,0.91525
224,0.92611
225,0.93296
226,0.93452
227,0.9365899999999999
228,0.94826
229,0.95842
230,0.96204
231,0.9662200000000001
232,0.98687
233,0.97652
234,0.9976200000000001
235,1.0037
236,1.0104
237,1.0175
238,1.0352
239,1.0356
240,1.0576
241,1.0666
242,1.0918
243,1.1295
244,1.1629
245,1.1551
246,1.1209
247,1.0824
248,1.0393
249,1.0008
250,0.95775
251,0.9119299999999999
252,0.8667600000000001
253,0.81979
254,0.7881600000000001
255,0.743
256,0.69411
257,0.6493800000000001
258,0.60093
259,0.5564100000000001
260,0.51174
261,0.48141000000000006
262,0.45166999999999996
263,0.41367
264,0.37911999999999996
265,0.33283
266,0.28872
267,0.24315
268,0.19937
269,0.15456
270,0.1117
271,0.069418
272,0.026468000000000002
273,-0.014256999999999999
274,-0.056579
275,-0.097264
276,-0.13935
277,-0.17985
278,-0.22113000000000002
279,-0.26114
280,-0.30235
281,-0.3236
282,-0.34336
283,-0.36228
284,-0.36389
285,-0.38341
286,-0.40096
287,-0.41941000000000006
288,-0.45176000000000005
289,-0.48488000000000003
290,-0.51888
291,-0.5574899999999999
292,-0.59602
293,-0.63447
294,-0.67282
295,-0.71109
296,-0.748
297,-0.72415
298,-0.6743600000000001
299,-0.62662
300,-0.5917
301,-0.54907
302,-0.5203
303,-0.54013
304,-0.5644
305,-0.57576
306,-0.5777
307,-0.5924699999999999
308,-0.59859
309,-0.5896899999999999
310,-0.6203
311,-0.6665800000000001
312,-0.71317
313,-0.75975
314,-0.79461
315,-0.8456100000000001
316,-0.88771
317,-0.9285100000000001
318,-0.9756
319,-1.0195
320,-1.0688
321,-1.1022
322,-1.1488
323,-1.1839
324,-1.216
325,-1.2456
326,-1.271
327,-1.2969
328,-1.3255
329,-1.3531
330,-1.3796
331,-1.4049
332,-1.4288
333,-1.4512
334,-1.4719
335,-1.4766
336,-1.4374
337,-1.3969999999999998
338,-1.3696
339,-1.3277
340,-1.2985
341,-1.2666
342,-1.2443
343,-1.2498
344,-1.2596
345,-1.2793
346,-1.2975
347,-1.3253
348,-1.3594
349,-1.3841
350,-1.4007
351,-1.4215
352,-1.435
353,-1.4512
354,-1.4628
355,-1.4788
356,-1.4941
357,-1.4908
358,-1.4851
359,-1.4769
360,-1.4666
361,-1.4539
362,-1.4393
363,-1.4227
364,-1.4043
365,-1.3841
366,-1.3625
367,-1.3263
368,-1.2895
369,-1.2647
370,-1.229
371,-1.2
372,-1.1724
373,-1.1441
374,-1.1149
375,-1.0829
376,-1.0441
377,-1.0133
378,-0.97544
379,-0.9401700000000001
380,-0.9079999999999999
381,-0.8753799999999999
382,-0.84234
383,-0.8004100000000001
384,-0.7664300000000001
385,-0.73252
386,-0.69829
387,-0.66376
388,-0.62895
389,-0.5938899999999999
390,-0.55858
391,-0.5230600000000001
392,-0.48732
393,-0.44528
394,-0.40823000000000004
395,-0.37076
396,-0.33089
397,-0.29256
398,-0.25606999999999996
399,-0.21943000000000001
400,-0.18265
401,-0.14135
402,-0.10357999999999999
403,-0.065464
404,-0.028323
405,0.0089274
406,0.046277
407,0.083726
408,0.12125999999999999
409,0.15592
410,0.19117
411,0.22643000000000002
412,0.26193
413,0.29993000000000003
414,0.33809
415,0.37631
416,0.41458999999999996
417,0.45003000000000004
418,0.48733000000000004
419,0.5252
420,0.56376
421,0.60236
422,0.6409999999999999
423,0.67969
424,0.71841
425,0.75717
426,0.79597
427,0.8348
428,0.8736700000000001
429,0.9125700000000001
430,0.9500799999999999
431,0.9900399999999999
432,1.0257
433,1.0648
434,1.1039
435,1.1394
436,1.1786
437,1.2178
438,1.2537
439,1.2897
440,1.3277
441,1.3653
442,1.4017
443,1.4387
444,1.4768
445,1.5146
446,1.5515
447,1.5885
448,1.625
449,1.6613
450,1.6999
451,1.7365
452,1.7736
453,1.8102
454,1.8492
455,1.8864
456,1.9223
457,1.9587
458,1.9955
459,2.0328
460,2.0382
461,2.0601
462,2.0624
