time,value
0,-0.33451
1,-0.33451
2,-0.14336
3,-0.33451
4,-0.33451
5,-0.33451
6,-0.33451
7,-0.33451
8,-0.33451
9,-0.14336
10,-0.33451
11,-0.33451
12,-0.33451
13,-0.33451
14,-0.14336
15,-0.33451
16,-0.33451
17,-0.33451
18,-0.33451
19,-0.33451
20,-0.14336
21,-0.33451
22,-0.33451
23,-0.33451
24,-0.14336
25,-0.33451
26,-0.33451
27,-0.33451
28,-0.33451
29,-0.14336
30,-0.33451
31,-0.33451
32,-0.33451
33,-0.14336
34,-0.33451
35,-0.33451
36,-0.33451
37,-0.33451
38,-0.33451
39,-0.14336
40,-0.33451
41,-0.33451
42,-0.33451
43,-0.33451
44,-0.33451
45,-0.14336
46,-0.33451
47,-0.33451
48,-0.33451
49,-0.33451
50,-0.14336
51,-0.33451
52,-0.33451
53,-0.33451
54,-0.33451
55,-0.33451
56,-0.33451
57,-0.33451
58,-0.33451
59,-0.33451
60,-0.33451
61,-0.14336
62,-0.33451
63,-0.33451
64,-0.33451
65,-0.33451
66,-0.33451
67,-0.14336
68,-0.33451
69,-0.33451
70,-0.33451
71,-0.14336
72,-0.33451
73,-0.33451
74,-0.33451
75,-0.33451
76,-0.14336
77,-0.33451
78,-0.33451
79,-0.33451
80,1.577
81,3.6796
82,3.4885
83,3.4885
84,3.2973
85,3.2973
86,3.4885
87,3.4885
88,0.43009
89,-0.33451
90,-0.33451
91,-0.33451
92,-0.33451
93,-0.33451
94,-0.14336
95,-0.33451
