time,value
0,0.15987
1,0.15987
2,0.15987
3,0.15987
4,0.15987
5,0.15987
6,0.15987
7,0.15987
8,0.15987
9,0.15987
10,0.15987
11,0.15987
12,-0.22380999999999998
13,0.15987
14,0.15987
15,0.15987
16,0.15987
17,0.15987
18,0.15987
19,0.15987
20,0.15987
21,0.15987
22,-0.22380999999999998
23,0.15987
24,0.15987
25,0.15987
26,0.15987
27,0.15987
28,0.15987
29,0.15987
30,0.15987
31,0.15987
32,0.15987
33,0.15987
34,0.15987
35,0.54355
36,0.54355
37,0.15987
38,0.15987
39,0.15987
40,0.15987
41,0.15987
42,0.15987
43,0.15987
44,0.15987
45,0.15987
46,0.15987
47,0.15987
48,-0.22380999999999998
49,0.15987
50,0.15987
51,0.15987
52,0.15987
53,0.15987
54,0.15987
55,0.15987
56,0.15987
57,-0.22380999999999998
58,0.15987
59,0.15987
60,0.15987
61,0.15987
62,0.15987
63,0.15987
64,-0.22380999999999998
65,0.15987
66,0.15987
67,0.15987
68,0.15987
69,0.15987
70,0.15987
71,0.15987
72,0.15987
73,0.15987
74,0.15987
75,0.54355
76,0.15987
77,0.15987
78,0.54355
79,0.15987
80,0.15987
81,0.15987
82,0.15987
83,0.15987
84,0.15987
85,0.15987
86,0.15987
87,0.15987
88,0.15987
89,0.15987
90,0.15987
91,0.15987
92,-0.22380999999999998
93,-0.60749
94,-6.7464
95,-6.7464
