time,value
0,-0.15161
1,-0.15161
2,-0.15161
3,-0.15161
4,-0.15161
5,-0.15161
6,-0.15161
7,-0.15161
8,-0.15161
9,-0.15161
10,-0.15161
11,-0.15161
12,-0.15161
13,-0.15161
14,-0.15161
15,-0.15161
16,-0.15161
17,-0.15161
18,-0.15161
19,-0.15161
20,-0.15161
21,-0.15161
22,-0.15161
23,-0.15161
24,-0.15161
25,-0.15161
26,-0.15161
27,-0.15161
28,-0.15161
29,-0.15161
30,-0.15161
31,-0.15161
32,-0.15161
33,-0.15161
34,-0.15161
35,2.0008
36,9.3121
37,0.94168
38,1.01
39,0.53169
40,-0.15161
41,-0.15161
42,-0.15161
43,-0.15161
44,-0.15161
45,-0.15161
46,-0.15161
47,-0.15161
48,-0.15161
49,-0.15161
50,-0.15161
51,-0.15161
52,-0.15161
53,-0.15161
54,-0.15161
55,-0.15161
56,-0.15161
57,-0.15161
58,-0.15161
59,-0.15161
60,-0.15161
61,-0.15161
62,-0.15161
63,-0.15161
64,-0.15161
65,-0.15161
66,-0.15161
67,-0.15161
68,-0.15161
69,-0.15161
70,-0.15161
71,-0.15161
72,-0.15161
73,-0.15161
74,-0.15161
75,-0.15161
76,-0.15161
77,-0.15161
78,-0.15161
79,-0.15161
80,-0.15161
81,-0.15161
82,-0.15161
83,-0.15161
84,-0.15161
85,-0.15161
86,-0.15161
87,-0.15161
88,-0.15161
89,-0.15161
90,-0.15161
91,-0.15161
92,-0.15161
93,-0.15161
94,-0.15161
95,-0.15161
