{
  "about": {
    "problemID": "313_spectrometer_problem",
    "problemName": "spectrometer_problem",
    "problemDescription": "**Author**:   \n  \n**Source**: Unknown - 1988  \n**Please cite**:   \n\n1. Title: Part of the IRAS Low Resolution Spectrometer Database\n \n2. Sources:\n(a) Originator: Infra-Red Astronomy Satellite Project Database\n(b) Donor: John Stutz <STUTZ@pluto.arc.nasa.gov> \n(c) Date: March 1988 (approximately)\n\n3. Past Usage: unknown\n-- A NASA-Ames research group concerned with unsupervised learning tasks may have used this database during their empirical studies of their algorithm/system (AUTOCLASS II).  See the 1988 Machine Learning Conference Proceedings, 54-64, for a description of their algorithm.\n\n4. Relevant Information: (from John Stutz)\n The Infra-Red Astronomy Satellite (IRAS) was the first attempt to map the full sky at infra-red wavelengths.  This could not be done from ground observatories because large portions of the infra-red spectrum is absorbed by the atmosphere.  The primary observing program was the full high resolution sky mapping performed by scanning at 4 frequencies. The Low Resolution Observation (IRAS-LRS) program observed high intensity sources over two continuous spectral bands.  This database derives from a subset of the higher quality LRS observations taken between 12h and 24h right ascension. \nThis database contains 531 high quality spectra derived from the IRAS-LRS database.  The original data contained 100 spectral measurements in each of two overlapping bands.  Of these, 44 blue band and 49 red band channels contain usable flux measurements.  Only these are included here.  The original spectral intensities values are compressed to 4-digits, and each spectrum includes 5 rescaling parameters.  We have used the LRS specified algorithm to rescale these to units of spectral intensity (Janskys).  Total intensity differences have been eliminated by normalizing each spectrum to a mean value of 5000.\nThis database was originally obtained for use in development and testing of our AutoClass system for Bayesian classification.  We have not retained any results from this development, having concentrated our efforts of a 5425 element version of the same data.  Our classifications were based upon simultaneous modeling of all 93 spectral intensities. With the larger database we were able to find classes that correspond well with known spectral types associated with particular stellar types. We also found classes that match with the spectra expected of certain stellar processes under investigation by Ames astronomers.  These classes have considerably enlarged the set of stars being investigated by those researchers.  \n\nOriginal Data\nThe original fortran data file is given in spectra-2.data.  The file spectra-2.head contains information about the .data file contents and how to rescale the compressed spectral intensities. \n\n5. Number of Instances: 531\n \n6. Number of Attributes: 103 (including the 10-attribute \"header\")\n \n7. Attribute Information: \n1. LRS-name: (Suspected format: 5 digits, \"+\" or \"-\", 4 digits)\n2. LRS-class: integer - The LRS-class values range from 0 - 99 with\nthe 10's digit giving the basic class and the 1's digit giving the subclass. These classes are based on features (peaks, valleys, and trends) of the spectral curves.  \n3. ID-type: integer\n4. Right-Ascension: float - Astronomical longitude. 1h = 15deg\n5. Declination: float - Astronomical lattitude. -90 <= Dec <= 90\n6. Scale Factor: float - Proportional to source strength\n7. Blue base 1: integer - linear rescaling coefficient\n8. Blue base 2: integer - linear rescaling coefficient\n9. Red base 1: integer - linear rescaling coefficient\n10. Red base 2: integer - linear rescaling coefficient\n11-54: fluxes from the following 44 blue-band channel wavelengths: \n(all given as floating point numerals)\n55-103: fluxes from the following 49 red-band channel wavelengths:  (all given as floating point numerals)\n\nUCI: http://archive.ics.uci.edu/ml/datasets/Low+Resolution+Spectrometer",
    "problemVersion": "4.0.0",
    "problemSchemaVersion": "4.0.0",
    "taskKeywords": [
      "classification",
      "multiClass",
      "tabular"
    ]
  },
  "inputs": {
    "data": [
      {
        "datasetID": "313_spectrometer_dataset",
        "targets": [
          {
            "targetIndex": 0,
            "resID": "learningData",
            "colIndex": 2,
            "colName": "LRS-class"
          }
        ]
      }
    ],
    "dataSplits": {
      "method": "holdOut",
      "testSize": 0.2,
      "stratified": true,
      "numRepeats": 0,
      "randomSeed": 42,
      "splitsFile": "dataSplits.csv",
      "datasetViewMaps": {
        "train": [
          {
            "from": "313_spectrometer_dataset",
            "to": "313_spectrometer_dataset_TRAIN"
          }
        ],
        "test": [
          {
            "from": "313_spectrometer_dataset",
            "to": "313_spectrometer_dataset_TEST"
          }
        ],
        "score": [
          {
            "from": "313_spectrometer_dataset",
            "to": "313_spectrometer_dataset_SCORE"
          }
        ]
      }
    },
    "performanceMetrics": [
      {
        "metric": "f1Macro"
      }
    ]
  },
  "expectedOutputs": {
    "predictionsFile": "predictions.csv"
  }
}