time,value
0,-1.9746
1,-1.9746
2,-1.9746
3,-1.9746
4,-1.9746
5,0.11742999999999999
6,1.0472
7,0.81477
8,0.58233
9,0.58233
10,0.58233
11,0.4661
12,0.58233
13,0.4661
14,0.4661
15,0.58233
16,0.4661
17,0.4661
18,0.4661
19,0.58233
20,0.4661
21,0.4661
22,0.4661
23,0.4661
24,0.4661
25,0.4661
26,0.4661
27,0.4661
28,0.34988
29,0.4661
30,0.4661
31,0.4661
32,0.34988
33,0.4661
34,-0.34746
35,-1.9746
36,-1.9746
37,-1.9746
38,-1.9746
39,-1.9746
40,-1.9746
41,-1.9746
42,-0.11500999999999999
43,1.0472
44,0.69855
45,0.69855
46,0.58233
47,0.4661
48,0.4661
49,0.4661
50,0.58233
51,0.4661
52,0.4661
53,0.4661
54,0.4661
55,0.4661
56,0.4661
57,0.4661
58,0.34988
59,0.4661
60,-1.9746
61,-1.9746
62,-1.9746
63,-1.9746
64,-1.9746
65,-1.9746
66,-1.9746
67,0.58233
68,1.0472
69,0.69855
70,0.58233
71,0.4661
72,0.58233
73,0.4661
74,0.4661
75,0.58233
76,0.4661
77,0.4661
78,0.4661
79,0.4661
80,0.4661
81,0.4661
82,0.4661
83,0.4661
84,0.34988
85,0.4661
86,0.4661
87,0.34988
88,0.4661
89,0.4661
90,0.4661
91,0.34988
92,0.4661
93,0.4661
94,0.34988
95,0.4661
