time,value
0,-0.14581
1,-0.14581
2,-0.14581
3,-0.14581
4,-0.14581
5,-0.14581
6,-0.14581
7,-0.14581
8,-0.14581
9,-0.14581
10,-0.14581
11,-0.14581
12,-0.14581
13,-0.14581
14,-0.14581
15,-0.14581
16,-0.14581
17,-0.14581
18,-0.14581
19,-0.14581
20,-0.14581
21,-0.14581
22,-0.14581
23,-0.14581
24,-0.14581
25,-0.14581
26,-0.14581
27,-0.14581
28,-0.14581
29,-0.14581
30,-0.14581
31,-0.14581
32,-0.14581
33,-0.14581
34,-0.14581
35,-0.14581
36,-0.14581
37,-0.14581
38,-0.14581
39,-0.14581
40,-0.14581
41,-0.14581
42,-0.14581
43,-0.14581
44,-0.14581
45,-0.14581
46,-0.14581
47,-0.14581
48,-0.14581
49,-0.14581
50,-0.14581
51,-0.14581
52,-0.14581
53,-0.14581
54,0.26129
55,8.1528
56,5.1465
57,-0.14581
58,-0.14581
59,-0.14581
60,-0.14581
61,-0.14581
62,-0.14581
63,-0.14581
64,-0.14581
65,-0.14581
66,-0.14581
67,-0.14581
68,-0.14581
69,-0.14581
70,-0.14581
71,-0.14581
72,-0.14581
73,-0.14581
74,-0.14581
75,-0.14581
76,-0.14581
77,-0.14581
78,-0.14581
79,-0.14581
80,-0.14581
81,-0.14581
82,-0.14581
83,-0.14581
84,-0.14581
85,-0.14581
86,-0.14581
87,-0.14581
88,-0.14581
89,-0.14581
90,-0.14581
91,-0.14581
92,-0.14581
93,-0.14581
94,-0.14581
95,-0.14581
