time,value
0,-0.2244
1,-0.2244
2,-0.2244
3,-0.2244
4,-0.2244
5,-0.2244
6,-0.2244
7,-0.2244
8,-0.2244
9,-0.2244
10,-0.2244
11,-0.2244
12,-0.2244
13,-0.2244
14,-0.2244
15,-0.2244
16,-0.2244
17,-0.2244
18,-0.2244
19,-0.2244
20,-0.2244
21,-0.2244
22,-0.2244
23,-0.2244
24,-0.2244
25,-0.2244
26,-0.2244
27,-0.2244
28,-0.2244
29,-0.2244
30,-0.2244
31,-0.2244
32,-0.2244
33,-0.2244
34,-0.2244
35,-0.2244
36,-0.2244
37,-0.2244
38,-0.2244
39,-0.2244
40,-0.2244
41,-0.2244
42,-0.2244
43,-0.2244
44,-0.2244
45,-0.2244
46,-0.2244
47,-0.2244
48,-0.2244
49,-0.2244
50,-0.2244
51,-0.2244
52,-0.2244
53,-0.2244
54,-0.2244
55,-0.2244
56,-0.2244
57,2.0193
58,5.3013
59,2.7831
60,-0.2244
61,-0.2244
62,-0.2244
63,-0.2244
64,-0.2244
65,-0.2244
66,-0.2244
67,-0.2244
68,-0.2244
69,-0.2244
70,-0.2244
71,-0.2244
72,-0.2244
73,-0.2244
74,-0.2244
75,-0.2244
76,-0.2244
77,-0.2244
78,-0.2244
79,-0.2244
80,-0.2244
81,-0.2244
82,-0.2244
83,-0.2244
84,-0.2244
85,-0.2244
86,4.7762
87,5.2655
88,0.050101
89,-0.2244
90,-0.2244
91,-0.2244
92,-0.2244
93,-0.2244
94,-0.2244
95,-0.2244
