time,value
0,-0.7966
1,-0.46697
2,1.6756
3,-0.7966
4,-0.7966
5,1.6756
6,-0.7966
7,-0.7966
8,2.0052
9,-0.7966
10,-0.7966
11,1.8404
12,-0.7966
13,-0.7966
14,1.3459999999999999
15,-0.30216
16,-0.7966
17,0.52191
18,0.68672
19,-0.7966
20,-0.7966
21,1.8404
22,-0.7966
23,-0.7966
24,1.6756
25,-0.7966
26,-0.7966
27,0.19228
28,1.0164
29,-0.7966
30,-0.7966
31,1.8404
32,-0.7966
33,-0.7966
34,-0.30216
35,1.5108
36,-0.7966
37,-0.7966
38,1.5108
39,-0.30216
40,-0.7966
41,-0.7966
42,2.0052
43,-0.7966
44,-0.7966
45,-0.13734000000000002
46,1.3459999999999999
47,-0.7966
48,-0.7966
49,0.52191
50,0.85154
51,-0.7966
52,-0.7966
53,1.3459999999999999
54,-0.13734000000000002
55,-0.7966
56,-0.7966
57,1.8404
58,-0.46697
59,-0.7966
60,-0.7966
61,1.8404
62,-0.46697
63,-0.7966
64,-0.7966
65,1.3459999999999999
66,-0.13734000000000002
67,-0.7966
68,-0.7966
69,0.85154
70,0.52191
71,-0.7966
72,-0.7966
73,0.85154
74,0.3571
75,-0.7966
76,-0.7966
77,1.8404
78,-0.7966
79,-0.7966
80,0.85154
81,0.19228
82,-0.7966
83,0.85154
84,0.19228
85,-0.7966
86,1.8404
87,-0.7966
88,-0.30216
89,1.1812
90,-0.7966
91,0.85154
92,0.19228
93,-0.7966
94,1.5108
95,-0.46697
