time,value
0,-0.8423299999999999
1,-0.79929
2,-0.7467
3,-0.71759
4,-0.70196
5,-0.68519
6,-0.66735
7,-0.64223
8,-0.61132
9,-0.5787
10,-0.52713
11,-0.42915
12,-0.26058000000000003
13,-0.026333
14,0.20993
15,0.37009000000000003
16,0.44245
17,0.46966
18,0.47205
19,0.43878
20,0.37166
21,0.28770999999999997
22,0.19654000000000002
23,0.10102
24,0.0074069999999999995
25,-0.075392
26,-0.14389000000000002
27,-0.20581
28,-0.26916999999999996
29,-0.33199
30,-0.38921
31,-0.43715
32,-0.47153999999999996
33,-0.49951
34,-0.53062
35,-0.56819
36,-0.6077600000000001
37,-0.6399
38,-0.66162
39,-0.66883
40,-0.65988
41,-0.6475
42,-0.6412100000000001
43,-0.64351
44,-0.6521
45,-0.66395
46,-0.67706
47,-0.68471
48,-0.68511
49,-0.6783899999999999
50,-0.6552899999999999
51,-0.61217
52,-0.55057
53,-0.46266999999999997
54,-0.33907
55,-0.1928
56,-0.061763
57,0.025371
58,0.068469
59,0.07484500000000001
60,0.049712
61,0.0099631
62,-0.023403
63,-0.04629
64,-0.075278
65,-0.13174
66,-0.21955999999999998
67,-0.31879
68,-0.40599
69,-0.47489
70,-0.53072
71,-0.57528
72,-0.6069899999999999
73,-0.6288100000000001
74,-0.64262
75,-0.65037
76,-0.65761
77,-0.66422
78,-0.6714
79,-0.67972
80,-0.68845
81,-0.69745
82,-0.70243
83,-0.70367
84,-0.7023199999999999
85,-0.6905899999999999
86,-0.6647
87,-0.62162
88,-0.5566399999999999
89,-0.47016
90,-0.36921
91,-0.27104
92,-0.18983
93,-0.13183
94,-0.10299000000000001
95,-0.09826499999999999
96,-0.1001
97,-0.090019
98,-0.054822
99,0.011974
100,0.10389000000000001
101,0.19677999999999998
102,0.26521
103,0.30401
104,0.31939
105,0.30864
106,0.26381
107,0.18692
108,0.09046699999999999
109,-0.013584
110,-0.12527
111,-0.24376
112,-0.35373000000000004
113,-0.44047
114,-0.5008199999999999
115,-0.5415399999999999
116,-0.57192
117,-0.59275
118,-0.60243
119,-0.60373
120,-0.6025
121,-0.6061300000000001
122,-0.61074
123,-0.60841
124,-0.60272
125,-0.59695
126,-0.59335
127,-0.59178
128,-0.5909399999999999
129,-0.5928899999999999
130,-0.59021
131,-0.58035
132,-0.5706
133,-0.55562
134,-0.53627
135,-0.51631
136,-0.50098
137,-0.48935
138,-0.45633999999999997
139,-0.37997
140,-0.2503
141,-0.058455999999999994
142,0.18679
143,0.46618999999999994
144,0.76682
145,1.0963
146,1.4463
147,1.75
148,1.9446
149,2.0441
150,2.092
151,2.0968
152,2.0476
153,1.9464
154,1.8002
155,1.607
156,1.3647
157,1.0869
158,0.79809
159,0.51998
160,0.27099
161,0.061571
162,-0.10579000000000001
163,-0.23262
164,-0.33109
165,-0.40592
166,-0.46098
167,-0.50571
168,-0.5410699999999999
169,-0.57311
170,-0.6007899999999999
171,-0.6127100000000001
172,-0.61164
173,-0.60112
174,-0.58496
175,-0.56721
176,-0.55147
177,-0.54525
178,-0.54619
179,-0.54915
180,-0.55111
181,-0.5448
182,-0.53161
183,-0.51577
184,-0.49237
185,-0.46428
186,-0.44046
187,-0.42258999999999997
188,-0.40918000000000004
189,-0.39049
190,-0.36539
191,-0.3381
192,-0.31456
193,-0.30443000000000003
194,-0.29265
195,-0.26839
196,-0.22884000000000002
197,-0.15617
198,-0.036028
199,0.18315
200,0.56385
201,1.0589
202,1.5377
203,1.9311
204,2.2856
205,2.6657
206,3.0416
207,3.3385
208,3.5119
209,3.5542
210,3.4930000000000003
211,3.3758
212,3.2452
213,3.1161
214,2.9787
215,2.8344
216,2.7108
217,2.6302
218,2.5732
219,2.4891
220,2.3325
221,2.1054
222,1.8342
223,1.5286
224,1.2066
225,0.89046
226,0.59627
227,0.33934000000000003
228,0.1237
229,-0.039952999999999995
230,-0.15698
231,-0.25153000000000003
232,-0.32145
233,-0.37048000000000003
234,-0.41471
235,-0.45303999999999994
236,-0.48402
237,-0.50853
238,-0.52682
239,-0.5413399999999999
240,-0.54687
241,-0.54797
242,-0.54987
243,-0.5521699999999999
244,-0.55666
245,-0.5604
246,-0.5623
247,-0.5665399999999999
248,-0.5753699999999999
249,-0.5905600000000001
250,-0.61045
251,-0.62851
252,-0.63794
253,-0.63652
254,-0.62975
255,-0.62292
256,-0.61611
257,-0.61217
258,-0.61506
259,-0.62103
260,-0.6250600000000001
261,-0.63108
262,-0.6458
263,-0.66461
264,-0.68016
265,-0.70089
266,-0.72837
267,-0.74636
268,-0.76353
269,-0.80285
