time,value
0,-0.38215
1,-0.38215
2,-0.38215
3,-0.38215
4,-0.38215
5,-0.38215
6,-0.38215
7,-0.38215
8,-0.38215
9,-0.38215
10,-0.38215
11,-0.38215
12,-0.38215
13,-0.38215
14,-0.38215
15,-0.38215
16,-0.38215
17,-0.38215
18,-0.38215
19,-0.38215
20,-0.38215
21,-0.38215
22,-0.38215
23,-0.38215
24,-0.38215
25,-0.38215
26,-0.38215
27,-0.38215
28,-0.38215
29,-0.38215
30,-0.38215
31,2.1859
32,1.4522
33,2.1859
34,2.5528
35,2.5528
36,2.9197
37,2.9197
38,2.9197
39,2.1859
40,3.6534
41,2.9197
42,-0.38215
43,-0.38215
44,-0.38215
45,-0.38215
46,-0.38215
47,-0.38215
48,-0.38215
49,-0.38215
50,-0.38215
51,-0.38215
52,-0.38215
53,-0.38215
54,-0.38215
55,-0.38215
56,-0.38215
57,-0.38215
58,-0.38215
59,-0.38215
60,-0.38215
61,-0.38215
62,-0.38215
63,-0.38215
64,-0.38215
65,-0.38215
66,-0.38215
67,-0.38215
68,-0.38215
69,-0.38215
70,-0.38215
71,-0.38215
72,2.1859
73,1.0853
74,-0.38215
75,-0.38215
76,-0.38215
77,-0.38215
78,-0.38215
79,-0.38215
80,-0.38215
81,-0.38215
82,-0.38215
83,-0.38215
84,-0.38215
85,-0.38215
86,-0.38215
87,-0.38215
88,-0.38215
89,-0.38215
90,-0.38215
91,-0.38215
92,-0.38215
93,-0.38215
94,-0.38215
95,-0.38215
