time,value
0,-0.19451
1,-0.19451
2,-0.19451
3,-0.19451
4,-0.19451
5,-0.19451
6,-0.19451
7,-0.19451
8,-0.19451
9,-0.19451
10,-0.19451
11,-0.19451
12,-0.19451
13,-0.19451
14,-0.19451
15,-0.19451
16,-0.19451
17,-0.19451
18,-0.19451
19,-0.19451
20,-0.19451
21,-0.19451
22,-0.19451
23,-0.19451
24,-0.19451
25,-0.19451
26,-0.19451
27,-0.19451
28,-0.19451
29,-0.19451
30,-0.19451
31,-0.19451
32,-0.19451
33,-0.19451
34,-0.19451
35,-0.19451
36,-0.19451
37,-0.19451
38,-0.19451
39,-0.19451
40,-0.19451
41,-0.19451
42,-0.19451
43,-0.19451
44,-0.19451
45,-0.19451
46,-0.19451
47,-0.19451
48,-0.19451
49,-0.19451
50,-0.19451
51,-0.19451
52,-0.19451
53,-0.19451
54,-0.19451
55,-0.19451
56,-0.19451
57,-0.19451
58,-0.19451
59,-0.19451
60,-0.19451
61,-0.19451
62,-0.19451
63,-0.19451
64,-0.19451
65,-0.19451
66,-0.19451
67,-0.19451
68,-0.19451
69,-0.19451
70,-0.19451
71,-0.19451
72,-0.19451
73,-0.19451
74,-0.19451
75,-0.19451
76,-0.19451
77,-0.19451
78,-0.19451
79,-0.19451
80,-0.19451
81,-0.19451
82,-0.19451
83,-0.19451
84,0.1293
85,5.8716
86,0.97121
87,0.19405999999999998
88,0.15089
89,3.2379
90,6.7567
91,-0.19451
92,-0.19451
93,-0.19451
94,-0.19451
95,-0.19451
