time,value
0,-0.67324
1,-0.67324
2,-0.67324
3,0.10311
4,1.8499
5,-0.28507
6,-0.67324
7,-0.67324
8,-0.67324
9,-0.67324
10,2.044
11,0.49128
12,-0.67324
13,-0.67324
14,-0.67324
15,-0.67324
16,1.0735
17,1.2676
18,-0.67324
19,-0.67324
20,-0.67324
21,-0.67324
22,0.2972
23,2.044
24,-0.67324
25,-0.67324
26,-0.67324
27,-0.67324
28,-0.67324
29,2.2381
30,0.2972
31,-0.67324
32,-0.67324
33,-0.67324
34,-0.67324
35,1.0735
36,1.2676
37,-0.67324
38,-0.67324
39,-0.67324
40,-0.67324
41,1.0735
42,1.6558
43,-0.67324
44,-0.67324
45,-0.67324
46,-0.67324
47,2.2381
48,0.49128
49,-0.67324
50,-0.67324
51,-0.67324
52,-0.090978
53,2.044
54,-0.090978
55,-0.67324
56,-0.67324
57,-0.67324
58,-0.090978
59,2.044
60,0.68537
61,-0.67324
62,-0.67324
63,-0.67324
64,-0.090978
65,2.044
66,-0.28507
67,-0.67324
68,-0.67324
69,-0.67324
70,0.87946
71,1.8499
72,-0.67324
73,-0.67324
74,-0.67324
75,-0.67324
76,1.6558
77,2.044
78,-0.67324
79,-0.67324
80,-0.67324
81,0.49128
82,2.044
83,-0.28507
84,-0.67324
85,-0.67324
86,0.2972
87,2.044
88,-0.090978
89,-0.67324
90,-0.67324
91,-0.090978
92,2.044
93,0.10311
94,-0.67324
95,-0.67324
