time,value
0,-0.3981
1,-0.3981
2,-0.3981
3,-0.3981
4,-0.3981
5,-0.3981
6,-0.3981
7,-0.3981
8,-0.3981
9,-0.3981
10,-0.3981
11,-0.3981
12,-0.3981
13,-0.3981
14,-0.3981
15,-0.3981
16,-0.3981
17,-0.3981
18,-0.3981
19,-0.3981
20,-0.3981
21,-0.3981
22,-0.3981
23,-0.3981
24,-0.3981
25,-0.3981
26,-0.3981
27,-0.3981
28,2.7567
29,-0.3981
30,-0.3981
31,-0.3981
32,-0.3981
33,2.306
34,-0.3981
35,-0.3981
36,-0.3981
37,-0.3981
38,-0.3981
39,2.6665
40,0.4582
41,-0.3981
42,-0.3981
43,-0.3981
44,-0.3981
45,1.8553
46,-0.3981
47,-0.3981
48,1.9004
49,-0.3981
50,-0.3981
51,-0.3981
52,-0.3981
53,-0.3981
54,-0.3981
55,3.3876
56,-0.3981
57,-0.3981
58,0.9088799999999999
59,1.9455
60,1.8102
61,3.1172
62,-0.3981
63,-0.3981
64,-0.3981
65,-0.3981
66,-0.3981
67,-0.3981
68,-0.3981
69,2.7567
70,-0.3981
71,-0.3981
72,2.9819999999999998
73,-0.3981
74,0.36806
75,-0.3981
76,-0.3981
77,3.0271
78,-0.3981
79,-0.3981
80,-0.3981
81,-0.3981
82,-0.3981
83,-0.3981
84,-0.3981
85,-0.3981
86,-0.3981
87,-0.3981
88,-0.3981
89,-0.3981
90,-0.3981
91,-0.3981
92,-0.3981
93,-0.3981
94,-0.3981
95,-0.3981
