time,value
0,-0.42916000000000004
1,-0.34
2,-0.37715
3,-0.42173
4,-0.34
5,-0.34743
6,-0.35486
7,-0.33257
8,-0.38458000000000003
9,-0.42916000000000004
10,-0.43659
11,-0.42916000000000004
12,-0.43659
13,-0.32514
14,-0.28799
15,-0.27313000000000004
16,-0.28056
17,-0.42916000000000004
18,-0.43659
19,-0.34
20,-0.37715
21,-0.43659
22,-0.42916000000000004
23,-0.42916000000000004
24,-0.31771
25,-0.23598000000000002
26,-0.27313000000000004
27,-0.31771
28,0.49959
29,0.48473
30,0.18753
31,0.59618
32,-0.27313000000000004
33,-0.36972
34,-0.28056
35,0.35099
36,-0.35486
37,-0.35486
38,0.024069999999999998
39,-0.25827
40,-0.37715
41,-0.19883
42,2.1045
43,3.4344
44,4.6083
45,-0.1171
46,-0.35486
47,0.42528999999999995
48,-0.42173
49,-0.19883
50,3.0183
51,1.4432
52,3.9397
53,0.09836900000000001
54,-0.28799
55,-0.24341
56,-0.31028
57,-0.35486
58,-0.35486
59,-0.35486
60,-0.30285
61,-0.31771
62,-0.42916000000000004
63,-0.43659
64,-0.42916000000000004
65,-0.43659
66,-0.34743
67,-0.2657
68,-0.34743
69,-0.35486
70,-0.34743
71,-0.4143
72,0.38071
73,-0.33257
74,2.1565
75,3.8505
76,-0.37715
77,-0.28056
78,-0.23598000000000002
79,-0.31771
80,-0.35486
81,-0.4143
82,-0.4143
83,-0.34
84,-0.34743
85,-0.42173
86,-0.4143
87,-0.32514
88,-0.32514
89,-0.24341
90,-0.29541999999999996
91,-0.4143
92,-0.4143
93,-0.4143
94,-0.43659
95,-0.34
