time,value
0,-0.20488
1,-0.20488
2,-0.20488
3,-0.20488
4,-0.20488
5,-0.20488
6,-0.20488
7,-0.20488
8,-0.20488
9,-0.20488
10,-0.20488
11,-0.20488
12,-0.20488
13,-0.20488
14,-0.20488
15,-0.20488
16,-0.20488
17,-0.20488
18,-0.20488
19,-0.20488
20,-0.20488
21,-0.20488
22,-0.20488
23,-0.20488
24,-0.20488
25,-0.20488
26,-0.20488
27,-0.20488
28,-0.20488
29,-0.20488
30,-0.20488
31,-0.20488
32,-0.20488
33,-0.20488
34,-0.20488
35,-0.20488
36,-0.20488
37,-0.20488
38,-0.20488
39,-0.20488
40,-0.20488
41,-0.20488
42,-0.20488
43,-0.20488
44,-0.20488
45,-0.20488
46,-0.20488
47,-0.20488
48,-0.20488
49,-0.20488
50,-0.20488
51,-0.20488
52,-0.20488
53,-0.20488
54,-0.20488
55,-0.20488
56,-0.20488
57,-0.20488
58,-0.20488
59,-0.20488
60,-0.20488
61,-0.20488
62,-0.20488
63,-0.20488
64,-0.20488
65,-0.20488
66,-0.20488
67,3.7171
68,5.7074
69,-0.20488
70,-0.20488
71,-0.20488
72,-0.20488
73,-0.20488
74,5.122000000000001
75,-0.20488
76,-0.20488
77,-0.20488
78,-0.20488
79,-0.20488
80,-0.20488
81,-0.20488
82,-0.20488
83,-0.20488
84,-0.20488
85,-0.20488
86,-0.20488
87,-0.20488
88,4.3025
89,-0.20488
90,-0.20488
91,-0.20488
92,-0.20488
93,-0.20488
94,-0.20488
95,-0.20488
