time,value
0,0.8506600000000001
1,-1.1342
2,-1.1342
3,-1.1342
4,-0.28355
5,1.1342
6,1.1342
7,-0.18904
8,-1.1342
9,-1.1342
10,-1.1342
11,-0.47258999999999995
12,1.1342
13,1.1342
14,0.0
15,-1.1342
16,-1.1342
17,-1.1342
18,-1.1342
19,1.0397
20,1.1342
21,0.66162
22,-1.1342
23,-1.1342
24,-1.1342
25,-1.1342
26,0.18904
27,1.1342
28,1.1342
29,-0.7561399999999999
30,-1.1342
31,-1.1342
32,-0.18904
33,1.1342
34,1.1342
35,-0.37806999999999996
36,-1.1342
37,-1.1342
38,0.9451799999999999
39,1.1342
40,0.7561399999999999
41,-0.8506600000000001
42,-0.47258999999999995
43,1.2287
44,1.1342
45,1.0397
46,0.8506600000000001
47,-1.1342
48,-1.1342
49,-0.47258999999999995
50,1.2287
51,1.1342
52,-0.56711
53,-1.1342
54,-1.1342
55,0.28355
56,1.2287
57,0.56711
58,-1.1342
59,-1.1342
60,-1.1342
61,0.56711
62,1.2287
63,0.37806999999999996
64,-1.1342
65,-1.1342
66,-1.1342
67,-0.09451799999999999
68,1.2287
69,1.1342
70,-0.66162
71,-1.1342
72,-0.56711
73,1.1342
74,1.1342
75,-0.47258999999999995
76,-1.1342
77,-0.9451799999999999
78,1.2287
79,1.2287
80,1.0397
81,1.1342
82,1.1342
83,1.0397
84,0.9451799999999999
85,1.0397
86,0.9451799999999999
87,0.9451799999999999
88,0.9451799999999999
89,-0.18904
90,-1.1342
91,-1.1342
92,-1.1342
93,-0.09451799999999999
94,1.1342
95,1.0397
