time,value
0,-0.21311
1,-0.21311
2,-0.21311
3,-0.21311
4,-0.21311
5,-0.21311
6,-0.21311
7,-0.21311
8,-0.21311
9,-0.21311
10,-0.21311
11,-0.21311
12,-0.21311
13,-0.21311
14,-0.21311
15,-0.21311
16,-0.21311
17,-0.21311
18,-0.21311
19,-0.21311
20,-0.21311
21,-0.21311
22,-0.21311
23,-0.21311
24,-0.21311
25,-0.21311
26,-0.21311
27,-0.21311
28,-0.21311
29,-0.21311
30,-0.21311
31,-0.21311
32,-0.21311
33,-0.21311
34,-0.21311
35,-0.21311
36,-0.21311
37,-0.21311
38,-0.21311
39,-0.21311
40,-0.21311
41,-0.21311
42,-0.21311
43,-0.21311
44,-0.21311
45,-0.21311
46,-0.21311
47,-0.21311
48,-0.21311
49,-0.21311
50,-0.21311
51,-0.21311
52,-0.21311
53,0.34741
54,4.8316
55,4.5513
56,4.8316
57,4.8316
58,-0.21311
59,-0.21311
60,-0.21311
61,-0.21311
62,-0.21311
63,-0.21311
64,-0.21311
65,-0.21311
66,-0.21311
67,-0.21311
68,-0.21311
69,-0.21311
70,-0.21311
71,-0.21311
72,-0.21311
73,-0.21311
74,-0.21311
75,-0.21311
76,-0.21311
77,-0.21311
78,-0.21311
79,-0.21311
80,-0.21311
81,-0.21311
82,-0.21311
83,-0.21311
84,-0.21311
85,-0.21311
86,-0.21311
87,-0.21311
88,-0.21311
89,-0.21311
90,-0.21311
91,-0.21311
92,-0.21311
93,-0.21311
94,-0.21311
95,-0.21311
