time,value
0,-0.79042
1,-0.76517
2,-0.73354
3,-0.69963
4,-0.66774
5,-0.63863
6,-0.6118100000000001
7,-0.58728
8,-0.5643
9,-0.54438
10,-0.52935
11,-0.5175
12,-0.5088699999999999
13,-0.5022800000000001
14,-0.49418999999999996
15,-0.48777
16,-0.48244
17,-0.47508999999999996
18,-0.47222
19,-0.46985
20,-0.46458999999999995
21,-0.46352
22,-0.46143
23,-0.45761
24,-0.45908999999999994
25,-0.46013999999999994
26,-0.45923
27,-0.45788
28,-0.44819
29,-0.43071000000000004
30,-0.40776
31,-0.3747
32,-0.33276
33,-0.2768
34,-0.19645
35,-0.090298
36,0.047421
37,0.2205
38,0.4261
39,0.67133
40,0.9624799999999999
41,1.3002
42,1.6832
43,2.0961
44,2.5103
45,2.8951
46,3.2194
47,3.4628
48,3.6210000000000004
49,3.6996
50,3.7129
51,3.6775
52,3.6059
53,3.5102
54,3.3997
55,3.2801
56,3.1584
57,3.0381
58,2.9193
59,2.8006
60,2.676
61,2.5378
62,2.3817
63,2.2061
64,2.0162
65,1.8208
66,1.6266
67,1.4393
68,1.2597
69,1.0847
70,0.91676
71,0.75766
72,0.6080800000000001
73,0.47629
74,0.36106
75,0.25887
76,0.17309000000000002
77,0.096471
78,0.026894
79,-0.032236
80,-0.08730700000000001
81,-0.1369
82,-0.17931
83,-0.22133000000000003
84,-0.25955
85,-0.29338000000000003
86,-0.32834
87,-0.35884
88,-0.38534
89,-0.41341999999999995
90,-0.43700000000000006
91,-0.45785
92,-0.48018999999999995
93,-0.49755
94,-0.51223
95,-0.52641
96,-0.536
97,-0.54405
98,-0.5516399999999999
99,-0.55638
100,-0.56113
101,-0.5654899999999999
102,-0.5675899999999999
103,-0.5695899999999999
104,-0.56966
105,-0.56603
106,-0.5602600000000001
107,-0.54948
108,-0.5322
109,-0.5099600000000001
110,-0.48015
111,-0.44343
112,-0.4024
113,-0.35675
114,-0.30783
115,-0.2563
116,-0.20004
117,-0.13875
118,-0.0727
119,-0.0028484
120,0.06636900000000001
121,0.13059
122,0.18612
123,0.22915
124,0.25895
125,0.2759
126,0.27963000000000005
127,0.27232
128,0.25625
129,0.23374
130,0.20940999999999999
131,0.18572
132,0.16234
133,0.13869
134,0.11209000000000001
135,0.08064400000000001
136,0.045686000000000004
137,0.007817600000000001
138,-0.0317
139,-0.070879
140,-0.10997
141,-0.14719000000000002
142,-0.18032
143,-0.20995
144,-0.23490999999999998
145,-0.2559
146,-0.27537
147,-0.29212
148,-0.30676
149,-0.32039
150,-0.33221
151,-0.34381
152,-0.35484
153,-0.36277
154,-0.36673
155,-0.36361
156,-0.35115999999999997
157,-0.33013000000000003
158,-0.29944
159,-0.26041
160,-0.21724000000000002
161,-0.1718
162,-0.12815
163,-0.090836
164,-0.059735
165,-0.036372
166,-0.021981
167,-0.01589
168,-0.020298
169,-0.036849
170,-0.064752
171,-0.10372999999999999
172,-0.1509
173,-0.20149
174,-0.25293000000000004
175,-0.30208
176,-0.34683
177,-0.38841
178,-0.4262
179,-0.45982
180,-0.49066000000000004
181,-0.51698
182,-0.53882
183,-0.55823
184,-0.57462
185,-0.5884199999999999
186,-0.59955
187,-0.60572
188,-0.60698
189,-0.60415
190,-0.5977100000000001
191,-0.58913
192,-0.57675
193,-0.5577300000000001
194,-0.53128
195,-0.49612
196,-0.4541
197,-0.40953
198,-0.36356
199,-0.31831
200,-0.27612
201,-0.23686999999999997
202,-0.20282
203,-0.1761
204,-0.15669
205,-0.1454
206,-0.142
207,-0.14501
208,-0.15405
209,-0.16792
210,-0.18515
211,-0.20586
212,-0.22969
213,-0.25636
214,-0.28638
215,-0.31836
216,-0.35074
217,-0.38311999999999996
218,-0.41367
219,-0.44168999999999997
220,-0.4673
221,-0.48928
222,-0.50759
223,-0.52279
224,-0.53471
225,-0.54438
226,-0.55209
227,-0.55728
228,-0.5603100000000001
229,-0.56033
230,-0.5569
231,-0.55111
232,-0.5423600000000001
233,-0.5311899999999999
234,-0.51937
235,-0.50656
236,-0.49433999999999995
237,-0.48418999999999995
238,-0.47553
239,-0.46873000000000004
240,-0.46286000000000005
241,-0.45629
242,-0.4493
243,-0.44203000000000003
244,-0.43526000000000004
245,-0.43086
246,-0.42918999999999996
247,-0.43046999999999996
248,-0.43509
249,-0.44231000000000004
250,-0.45208000000000004
251,-0.46455
252,-0.47856000000000004
253,-0.49294
254,-0.50625
255,-0.51695
256,-0.52585
257,-0.5354
258,-0.5484399999999999
259,-0.5674
260,-0.59232
261,-0.62175
262,-0.65471
263,-0.6903199999999999
264,-0.72764
265,-0.76425
266,-0.79486
267,-0.8147300000000001
268,-0.82271
269,-0.8213299999999999
