[<text>
<title>continental general insurance &lt;cgic&gt; 4th qtr net</title>
<dateline>    omaha, neb., march 3 - 
    </dateline>shr 20 cts vs 21 cts
    net 783,564 vs 806,278
    year
    shr 89 cts vs 86 cts
    net 3,443,392 vs 3,242,588
    note:full company name is continental general insurance co
    net includes profit from sale of securities of 155,410
dlrs, or four cts a share, and 192,896 dlrs, or five cts a
share, respectively, in 1986 qtr and year, and of 12,879 dlrs,
or nil per share, in 1985 qtr. net for 1985 year includes loss
from sale of securities of 315,763 dlrs, or eight cts a share.
 reuter
</text>]