time,value
0,0.45526000000000005
1,-0.9228299999999999
2,-0.9228299999999999
3,-0.9228299999999999
4,0.94744
5,-0.9228299999999999
6,-0.9228299999999999
7,-0.9228299999999999
8,0.8490000000000001
9,0.75057
10,1.6365
11,1.1443
12,-0.9228299999999999
13,-0.9228299999999999
14,-0.9228299999999999
15,0.45526000000000005
16,-0.33221999999999996
17,-0.9228299999999999
18,-0.9228299999999999
19,-0.9228299999999999
20,0.94744
21,0.65213
22,1.6365
23,0.65213
24,-0.9228299999999999
25,-0.9228299999999999
26,-0.72596
27,0.94744
28,-0.9228299999999999
29,-0.9228299999999999
30,-0.9228299999999999
31,0.8490000000000001
32,0.35683000000000004
33,1.7349
34,1.6365
35,-0.43065
36,-0.9228299999999999
37,-0.9228299999999999
38,-0.9228299999999999
39,0.45526000000000005
40,-0.33221999999999996
41,-0.9228299999999999
42,-0.9228299999999999
43,0.65213
44,0.25839
45,1.8333
46,0.35683000000000004
47,-0.9228299999999999
48,-0.9228299999999999
49,0.75057
50,-0.62752
51,-0.9228299999999999
52,-0.9228299999999999
53,0.25839
54,1.8333
55,1.2427
56,-0.9228299999999999
57,0.8490000000000001
58,-0.9228299999999999
59,-0.9228299999999999
60,-0.9228299999999999
61,0.45526000000000005
62,0.15996
63,1.8333
64,0.8490000000000001
65,-0.9228299999999999
66,-0.9228299999999999
67,0.65213
68,-0.33221999999999996
69,0.35683000000000004
70,1.9318
71,0.45526000000000005
72,-0.9228299999999999
73,-0.9228299999999999
74,0.94744
75,-0.9228299999999999
76,-0.9228299999999999
77,1.9318
78,1.4396
79,-0.9228299999999999
80,0.75057
81,-0.62752
82,-0.9228299999999999
83,-0.13535
84,1.9318
85,1.7349
86,-0.52909
87,-0.9228299999999999
88,-0.9228299999999999
89,1.0459
90,-0.72596
91,0.45526000000000005
92,1.7349
93,0.75057
94,-0.9228299999999999
95,-0.9228299999999999
