time,value
0,-0.35261
1,-0.35261
2,-0.35261
3,-0.35261
4,-0.35261
5,-0.35261
6,-0.35261
7,-0.35261
8,-0.35261
9,-0.35261
10,-0.35261
11,-0.35261
12,-0.35261
13,-0.35261
14,-0.35261
15,-0.35261
16,-0.35261
17,-0.35261
18,-0.35261
19,-0.35261
20,-0.35261
21,-0.35261
22,-0.35261
23,-0.35261
24,-0.35261
25,-0.35261
26,-0.35261
27,-0.35261
28,-0.35261
29,-0.35261
30,-0.35261
31,-0.35261
32,-0.35261
33,-0.35261
34,-0.35261
35,-0.35261
36,-0.35261
37,-0.35261
38,-0.35261
39,-0.35261
40,-0.35261
41,-0.35261
42,-0.35261
43,-0.35261
44,-0.35261
45,-0.35261
46,-0.35261
47,-0.35261
48,-0.35261
49,-0.35261
50,-0.35261
51,-0.35261
52,-0.35261
53,2.5655
54,3.7328
55,2.0792
56,1.301
57,0.9119200000000001
58,3.7328
59,2.6628
60,-0.35261
61,-0.35261
62,-0.35261
63,-0.35261
64,-0.35261
65,-0.35261
66,-0.35261
67,-0.35261
68,-0.35261
69,-0.35261
70,-0.35261
71,-0.35261
72,-0.35261
73,-0.35261
74,-0.35261
75,-0.35261
76,-0.35261
77,-0.35261
78,-0.35261
79,-0.35261
80,-0.35261
81,-0.35261
82,-0.35261
83,-0.35261
84,-0.35261
85,-0.35261
86,-0.15807000000000002
87,3.0519
88,3.0519
89,2.9546
90,2.9546
91,0.42556000000000005
92,-0.35261
93,-0.35261
94,-0.35261
95,-0.35261
