time,value
0,-2.1597
1,-2.1756
2,-2.1656
3,-2.101
4,-2.0227
5,-2.0029
6,-1.9155
7,-1.8727
8,-1.8772
9,-1.82
10,-1.7907
11,-1.751
12,-1.6942
13,-1.5696
14,-1.4396
15,-1.3792
16,-1.2745
17,-1.1677
18,-1.1082
19,-1.011
20,-0.9737399999999999
21,-0.9171299999999999
22,-0.8466100000000001
23,-0.80362
24,-0.75171
25,-0.68689
26,-0.62339
27,-0.5777100000000001
28,-0.59165
29,-0.52387
30,-0.47003
31,-0.45723
32,-0.40154
33,-0.39243
34,-0.40764
35,-0.47135
36,-0.5340600000000001
37,-0.45158000000000004
38,-0.43723999999999996
39,-0.30789
40,-0.2334
41,-0.039883999999999996
42,0.07259700000000001
43,0.13924
44,0.2677
45,0.34662
46,0.3731
47,0.47888000000000003
48,0.56035
49,0.67681
50,0.6403300000000001
51,0.69367
52,0.64482
53,0.67188
54,0.60441
55,0.6879
56,0.6419699999999999
57,0.6099
58,0.49218
59,0.44703000000000004
60,0.32658000000000004
61,0.1671
62,0.1597
63,0.039300999999999996
64,0.013741999999999999
65,-0.043238
66,-0.025573
67,-0.084375
68,-0.08973500000000001
69,-0.1244
70,-0.08049400000000001
71,0.015907
72,0.13533
73,0.29141
74,0.50247
75,0.63841
76,0.8607600000000001
77,1.0219
78,1.1207
79,1.2207
80,1.3584
81,1.6403
82,1.8162
83,1.9815
84,1.9326
85,1.9187
86,1.7545
87,1.6791
88,1.5091
89,1.2443
90,1.1146
91,1.0179
92,0.88656
93,0.6582
94,0.62058
95,0.39483
96,0.22178
97,0.087594
98,-0.031778
99,-0.15714
100,-0.32272
101,-0.3203
102,-0.49418999999999996
103,-0.6540199999999999
104,-0.7246199999999999
105,-0.76512
106,-0.76317
107,-0.75124
108,-0.72797
109,-0.73587
110,-0.69547
111,-0.70941
112,-0.68781
113,-0.58035
114,-0.42741999999999997
115,-0.2137
116,-0.21172
117,0.021611000000000002
118,0.069191
119,0.061771000000000006
120,-0.026418
121,-0.069087
122,-0.2456
123,-0.28454
124,-0.28243
125,-0.25389
126,-0.20551999999999998
127,-0.25336
128,-0.29785
129,-0.33326
130,-0.42665
131,-0.35663
132,-0.29241
133,-0.30316
134,-0.16689
135,-0.12945
136,-0.080019
137,0.08102000000000001
138,0.15054
139,0.18792999999999999
140,0.36653
141,0.47831999999999997
142,0.56903
143,0.74169
144,0.9126299999999999
145,0.9348200000000001
146,1.103
147,1.2768
148,1.294
149,1.48
150,1.67
151,1.766
152,1.9793
153,2.032
154,2.2476
155,2.3109
156,2.4316
157,2.431
158,2.4237
159,2.5540000000000003
160,2.2451
161,2.1029
162,1.8201
163,1.4725
164,1.2424
165,0.9880700000000001
166,0.76183
167,0.6531899999999999
168,0.55698
169,0.60646
170,0.65594
171,0.6571100000000001
172,0.48249
173,0.30828
174,0.27644
175,0.18056
176,0.057362
177,0.031855
178,-0.057125999999999996
179,-0.083504
180,-0.057469000000000006
181,-0.093564
182,-0.031778
183,0.016145
184,0.0080126
185,0.0028902
186,0.1409
187,0.14262
188,0.073864
189,0.10676
190,0.10676
191,0.052740999999999996
192,0.07423400000000001
193,0.047777
194,0.047777
195,0.086591
196,0.060740999999999996
197,0.035156
198,0.0098873
199,0.0098873
200,-0.039805
201,-0.08028300000000001
202,-0.10452
203,-0.077642
204,-0.22683000000000003
205,-0.10727
206,-0.11374000000000001
207,-0.063622
208,0.15112
209,0.3114
210,0.41608999999999996
211,0.56397
212,0.61139
213,0.69208
214,0.87785
215,0.8621
216,0.74339
217,0.56882
218,0.47095
219,0.33384
220,0.2142
221,0.16522
222,0.093958
223,0.023908000000000002
224,0.001834
225,-0.074791
226,-0.19033
227,-0.27376999999999996
228,-0.29648
229,-0.37296999999999997
230,-0.50708
231,-0.56738
232,-0.66965
233,-0.8239
234,-0.885
235,-0.9427200000000001
236,-1.0945
237,-1.1369
238,-1.2432
239,-1.2916
240,-1.375
241,-1.4652
242,-1.5956
243,-1.6959
244,-1.7689
245,-1.885
246,-1.9688
247,-2.0088
248,-2.0832
249,-2.1211
250,-2.0965
