time,value
0,0.0316
1,-0.30546999999999996
2,-0.30546999999999996
3,-0.30546999999999996
4,-0.30546999999999996
5,-0.30546999999999996
6,-0.30546999999999996
7,-0.64254
8,-0.30546999999999996
9,-0.30546999999999996
10,-0.30546999999999996
11,-0.64254
12,-0.30546999999999996
13,-0.30546999999999996
14,-0.30546999999999996
15,-0.64254
16,-0.30546999999999996
17,-0.30546999999999996
18,-0.30546999999999996
19,-0.30546999999999996
20,-0.64254
21,-0.30546999999999996
22,-0.30546999999999996
23,-0.30546999999999996
24,-0.64254
25,-0.30546999999999996
26,-0.30546999999999996
27,-0.30546999999999996
28,-0.64254
29,-0.30546999999999996
30,-0.30546999999999996
31,-0.30546999999999996
32,-0.64254
33,-0.30546999999999996
34,-0.30546999999999996
35,-0.30546999999999996
36,-0.64254
37,-0.30546999999999996
38,-0.30546999999999996
39,-0.30546999999999996
40,-0.64254
41,-0.30546999999999996
42,-0.30546999999999996
43,-0.30546999999999996
44,-0.64254
45,-0.30546999999999996
46,-0.30546999999999996
47,-0.30546999999999996
48,-0.64254
49,-0.30546999999999996
50,-0.30546999999999996
51,-0.30546999999999996
52,-0.30546999999999996
53,-0.64254
54,-0.30546999999999996
55,-0.30546999999999996
56,-0.30546999999999996
57,-0.64254
58,-0.30546999999999996
59,-0.30546999999999996
60,-0.30546999999999996
61,-0.64254
62,-0.30546999999999996
63,-0.30546999999999996
64,-0.30546999999999996
65,-0.64254
66,-0.30546999999999996
67,-0.30546999999999996
68,-0.30546999999999996
69,-0.64254
70,-0.30546999999999996
71,-0.30546999999999996
72,1.7169
73,1.7169
74,-0.30546999999999996
75,0.0316
76,-0.30546999999999996
77,2.3911
78,3.4023
79,3.4023
80,3.4023
81,3.0652
82,1.7169
83,-0.30546999999999996
84,-0.30546999999999996
85,-0.30546999999999996
86,-0.30546999999999996
87,-0.30546999999999996
88,1.3799
89,3.0652
90,3.0652
91,1.7169
92,0.0316
93,-0.30546999999999996
94,-0.30546999999999996
95,-0.30546999999999996
