time,value
0,-0.29119
1,-0.29119
2,-0.29119
3,-0.29119
4,-0.29119
5,-0.29119
6,-0.29119
7,-0.29119
8,-0.29119
9,-0.29119
10,-0.29119
11,-0.29119
12,0.043591000000000005
13,-0.29119
14,-0.29119
15,-0.29119
16,-0.29119
17,-0.29119
18,-0.29119
19,-0.29119
20,0.043591000000000005
21,-0.29119
22,-0.29119
23,-0.29119
24,-0.29119
25,-0.29119
26,-0.29119
27,-0.29119
28,-0.29119
29,-0.29119
30,-0.29119
31,-0.29119
32,-0.29119
33,-0.29119
34,-0.29119
35,-0.29119
36,-0.29119
37,-0.29119
38,-0.29119
39,-0.29119
40,-0.29119
41,-0.29119
42,-0.29119
43,-0.29119
44,-0.29119
45,-0.29119
46,-0.29119
47,-0.29119
48,-0.29119
49,-0.29119
50,-0.29119
51,-0.29119
52,-0.29119
53,-0.29119
54,-0.29119
55,-0.29119
56,-0.29119
57,-0.29119
58,-0.29119
59,-0.29119
60,-0.29119
61,-0.29119
62,-0.29119
63,-0.29119
64,-0.29119
65,-0.29119
66,-0.29119
67,-0.29119
68,-0.29119
69,-0.29119
70,-0.29119
71,-0.29119
72,-0.29119
73,-0.29119
74,-0.29119
75,-0.29119
76,-0.29119
77,-0.29119
78,-0.29119
79,-0.29119
80,-0.29119
81,-0.29119
82,-0.29119
83,-0.29119
84,-0.29119
85,3.2239999999999998
86,3.7262
87,3.5588
88,3.5588
89,3.5588
90,3.7262
91,3.3914
92,0.21098000000000003
93,-0.29119
94,-0.29119
95,-0.29119
