time,value
0,-2.0218
1,-2.0277
2,-2.0337
3,-2.0396
4,-2.0425
5,-2.0425
6,-2.0425
7,-2.0425
8,-2.0425
9,-2.0425
10,-2.0425
11,-2.0425
12,-2.0425
13,-2.0455
14,-2.0454
15,-2.0452
16,-2.045
17,-2.0447
18,-2.0442
19,-2.0438
20,-2.0433
21,-2.0427
22,-2.0483
23,-2.0539
24,-2.0598
25,-2.062
26,-2.0613
27,-2.0604
28,-2.0595
29,-2.0615
30,-2.06
31,-2.0589
32,-2.0589
33,-2.0583
34,-2.0583
35,-2.0571
36,-2.0559
37,-2.0552
38,-2.0545
39,-2.0545
40,-2.0539
41,-2.0525
42,-2.0502
43,-2.0487
44,-2.0471
45,-2.0454
46,-2.0437
47,-2.0419
48,-2.0401
49,-2.0382
50,-2.0363
51,-2.0343
52,-2.0322
53,-2.0301
54,-2.0269
55,-2.0258
56,-2.0301
57,-2.0356
58,-2.0399
59,-2.0426
60,-2.0402
61,-2.0378
62,-2.0353
63,-2.0328
64,-2.0302
65,-2.0276
66,-2.0262
67,-2.0234
68,-2.0206
69,-2.0177
70,-2.0148
71,-2.0119
72,-2.0089
73,-2.0059
74,-2.0028
75,-1.9997
76,-1.9966
77,-1.9934
78,-1.9885
79,-1.9852
80,-1.9819
81,-1.9785
82,-1.9751
83,-1.9717
84,-1.9682
85,-1.9647
86,-1.9677
87,-1.9724
88,-1.9752
89,-1.9757
90,-1.9702
91,-1.9665
92,-1.9627
93,-1.9589
94,-1.9551
95,-1.9512
96,-1.9473
97,-1.9434
98,-1.9394
99,-1.9355
100,-1.9314
101,-1.9274
102,-1.9213
103,-1.9172
104,-1.9131
105,-1.9089
106,-1.9047
107,-1.9005
108,-1.8963
109,-1.8921
110,-1.8878
111,-1.8835
112,-1.8792
113,-1.8748
114,-1.8683
115,-1.8639
116,-1.8595
117,-1.855
118,-1.8506
119,-1.8461
120,-1.8416
121,-1.8371
122,-1.8325
123,-1.828
124,-1.8234
125,-1.8188
126,-1.8119
127,-1.8073
128,-1.8026
129,-1.798
130,-1.7933
131,-1.7886
132,-1.7839
133,-1.7792
134,-1.7744
135,-1.7697
136,-1.7649
137,-1.7601
138,-1.7529
139,-1.7481
140,-1.7432
141,-1.7401
142,-1.7335
143,-1.7287
144,-1.7238
145,-1.7189
146,-1.714
147,-1.709
148,-1.7041
149,-1.6992
150,-1.6917
151,-1.6867
152,-1.6817
153,-1.6768
154,-1.6717
155,-1.6667
156,-1.6617
157,-1.6567
158,-1.6516
159,-1.6466
160,-1.6415
161,-1.6364
162,-1.6288
163,-1.6237
164,-1.6186
165,-1.6134
166,-1.6083
167,-1.6032
168,-1.5991
169,-1.5962
170,-1.5907
171,-1.5892
172,-1.5826
173,-1.5774
174,-1.5698
175,-1.5646
176,-1.5595
177,-1.5543
178,-1.5492
179,-1.544
180,-1.5389
181,-1.5337
182,-1.5285
183,-1.5233
184,-1.5181
185,-1.5129
186,-1.5051
187,-1.4998
188,-1.4946
189,-1.4894
190,-1.4841
191,-1.4775
192,-1.4722
193,-1.4669999999999999
194,-1.4617
195,-1.4564
196,-1.4512
197,-1.4459
198,-1.4379
199,-1.4326
200,-1.4273
201,-1.422
202,-1.4167
203,-1.4114
204,-1.4061
205,-1.4007
206,-1.3954
207,-1.39
208,-1.3847
209,-1.3793
210,-1.3713
211,-1.3659
212,-1.3606
213,-1.3552
214,-1.3498
215,-1.3444
216,-1.339
217,-1.3336
218,-1.3282
219,-1.3228
220,-1.3174
221,-1.3135
222,-1.3072
223,-1.3047
224,-1.3008
225,-1.2954
226,-1.29
227,-1.2846
228,-1.2792
229,-1.2738
230,-1.2684
231,-1.2618
232,-1.2564
233,-1.251
234,-1.2429
235,-1.2374
236,-1.232
237,-1.2266
238,-1.2211
239,-1.2157
240,-1.2102
241,-1.2048
242,-1.1993
243,-1.1943
244,-1.1931
245,-1.1904
246,-1.185
247,-1.1795
248,-1.1741
249,-1.1675
250,-1.1609
251,-1.1554
252,-1.1488
253,-1.1422
254,-1.1395
255,-1.1395
256,-1.1367
257,-1.1340000000000001
258,-1.1258
259,-1.1231
260,-1.1203
261,-1.1203
262,-1.1176
263,-1.1121
264,-1.1066
265,-1.1012
266,-1.0957
267,-1.0902
268,-1.0847
269,-1.0792
270,-1.0699
271,-1.0644
272,-1.0589
273,-1.0534
274,-1.0478
275,-1.0423
276,-1.0368
277,-1.0313
278,-1.0258
279,-1.0203
280,-1.0147
281,-1.012
282,-1.0092
283,-1.0092
284,-1.0037
285,-0.9981399999999999
286,-0.9926
287,-0.9870700000000001
288,-0.98325
289,-0.98221
290,-0.97944
291,-0.97839
292,-0.9718100000000001
293,-0.9662700000000001
294,-0.9569200000000001
295,-0.95034
296,-0.9448
297,-0.93927
298,-0.93927
299,-0.9365
300,-0.9365
301,-0.93268
302,-0.92714
303,-0.9216
304,-0.91606
305,-0.91051
306,-0.9011600000000001
307,-0.89561
308,-0.8928299999999999
309,-0.8907700000000001
310,-0.8859299999999999
311,-0.8838299999999999
312,-0.88002
313,-0.8744799999999999
314,-0.86895
315,-0.86341
316,-0.85787
317,-0.8523299999999999
318,-0.84401
319,-0.83846
320,-0.83291
321,-0.82735
322,-0.8218
323,-0.81624
324,-0.8106800000000001
325,-0.80511
326,-0.79955
327,-0.79398
328,-0.78841
329,-0.78284
330,-0.7744800000000001
331,-0.7689
332,-0.7689
333,-0.7661100000000001
334,-0.7661100000000001
335,-0.76053
336,-0.75495
337,-0.75215
338,-0.74936
339,-0.74936
340,-0.74936
341,-0.7437699999999999
342,-0.73539
343,-0.7298
344,-0.7242
345,-0.7186100000000001
346,-0.71301
347,-0.70645
348,-0.70085
349,-0.69525
350,-0.68965
351,-0.68405
352,-0.6784399999999999
353,-0.67283
354,-0.6644100000000001
355,-0.66067
356,-0.6559699999999999
357,-0.6540600000000001
358,-0.6521399999999999
359,-0.64654
360,-0.64095
361,-0.63535
362,-0.62974
363,-0.6241399999999999
364,-0.61854
365,-0.61293
366,-0.6035699999999999
367,-0.59796
368,-0.59235
369,-0.5867399999999999
370,-0.58486
371,-0.58015
372,-0.57824
373,-0.57448
374,-0.56888
375,-0.56328
376,-0.5576800000000001
377,-0.5511199999999999
378,-0.54272
379,-0.5371100000000001
380,-0.53241
381,-0.52769
382,-0.52575
383,-0.5191899999999999
384,-0.5136
385,-0.5080100000000001
386,-0.50241
387,-0.49585
388,-0.49026000000000003
389,-0.48466000000000004
390,-0.47993
391,-0.4752
392,-0.47325
393,-0.46947
394,-0.46388999999999997
395,-0.45733
396,-0.45174
397,-0.44978
398,-0.44501
399,-0.44301999999999997
400,-0.43923999999999996
401,-0.43367
402,-0.42531
403,-0.41973
404,-0.41316
405,-0.40759
406,-0.40201
407,-0.39921999999999996
408,-0.39445
409,-0.39246
410,-0.38766999999999996
411,-0.38666
412,-0.3811
413,-0.37553000000000003
414,-0.36718
415,-0.3616
416,-0.35603
417,-0.34946
418,-0.34389000000000003
419,-0.33831
420,-0.33273
421,-0.32715
422,-0.32337
423,-0.3186
424,-0.31661
425,-0.31182
426,-0.30246
427,-0.2969
428,-0.29311
429,-0.28831
430,-0.28628000000000003
431,-0.28424
432,-0.27869
433,-0.27313000000000004
434,-0.26757
435,-0.26200999999999997
436,-0.25544
437,-0.24988000000000002
438,-0.24051999999999998
439,-0.23849
440,-0.23367
441,-0.23162
442,-0.22607
443,-0.22052
444,-0.21495999999999998
445,-0.20940999999999999
446,-0.20385
447,-0.1983
448,-0.19274000000000002
449,-0.18616
450,-0.17782
451,-0.17226
452,-0.16669
453,-0.16113
454,-0.15556
455,-0.14999
456,-0.14442
457,-0.14240999999999998
458,-0.13762
459,-0.13559000000000002
460,-0.12902
461,-0.12345999999999999
462,-0.11512
463,-0.10955
464,-0.10298
465,-0.097416
466,-0.091849
467,-0.086281
468,-0.080712
469,-0.075141
470,-0.06956799999999999
471,-0.06757
472,-0.062777
473,-0.061767999999999997
474,-0.056204
475,-0.050638
476,-0.044066
477,-0.037493
478,-0.031927
479,-0.02636
480,-0.02079
481,-0.015219
482,-0.009646700000000001
483,-0.004072699999999999
484,0.0015023
485,0.007079300000000001
486,0.015447
487,0.021027
488,0.02661
489,0.032193
490,0.036801
491,0.041417
492,0.047008999999999995
493,0.052601999999999996
494,0.052601999999999996
495,0.053474
496,0.051559
497,0.056213
498,0.063679
499,0.069289
500,0.067413
501,0.068358
502,0.06650700000000001
503,0.068398
504,0.074026
505,0.07874
506,0.084372
507,0.082558
508,0.080755
509,0.078965
510,0.076301
511,0.07454
512,0.072791
513,0.07105399999999999
514,0.069328
515,0.067615
516,0.065914
517,0.064225
518,0.062547
519,0.060882000000000006
520,0.059227999999999996
521,0.057587
522,0.055148
523,0.053538
524,0.051939
525,0.050352
526,0.046711
527,0.041006
528,0.035302999999999994
529,0.0296
530,0.023105
531,0.017402
532,0.0117
533,0.0052053
534,0.0028373
535,0.0012743000000000001
536,-0.0031327
537,-0.0046717
538,-0.0061987
539,-0.010575
540,-0.011328
541,-0.017053
542,-0.022775999999999998
543,-0.028499
544,-0.03422
545,-0.039941000000000004
546,-0.049281
547,-0.055001
548,-0.060721000000000004
549,-0.066439
550,-0.072156
551,-0.07578
552,-0.080162
553,-0.081673
554,-0.088897
555,-0.094624
556,-0.1011
557,-0.10471
558,-0.10979000000000001
559,-0.11126
560,-0.11485999999999999
561,-0.12059
562,-0.12633
563,-0.13205999999999998
564,-0.1378
565,-0.14353
566,-0.14927
567,-0.15573
568,-0.16147
569,-0.1672
570,-0.17579
571,-0.18152000000000001
572,-0.18725
573,-0.19297999999999998
574,-0.19871
575,-0.20443
576,-0.21015999999999999
577,-0.21588000000000002
578,-0.22161
579,-0.22596999999999998
580,-0.22746999999999998
581,-0.23181
582,-0.23828000000000002
583,-0.24475
584,-0.25048000000000004
585,-0.25408000000000003
586,-0.25841
587,-0.25986
588,-0.26416
589,-0.26416
590,-0.26487
591,-0.26487
592,-0.26628
593,-0.26768000000000003
594,-0.26975
595,-0.26975
596,-0.26975
597,-0.26975
598,-0.26975
599,-0.26975
600,-0.26975
601,-0.264
602,-0.25824
603,-0.25248000000000004
604,-0.2496
605,-0.24672
606,-0.24384
607,-0.23806999999999998
608,-0.23231
609,-0.22655
610,-0.22078000000000003
611,-0.21502
612,-0.20925
613,-0.20349
614,-0.19772
615,-0.19195
616,-0.18617999999999998
617,-0.18041
618,-0.17464000000000002
619,-0.17595
620,-0.17436
621,-0.17564000000000002
622,-0.17564000000000002
623,-0.17339000000000002
624,-0.1676
625,-0.16182
626,-0.15667
627,-0.15088
628,-0.14570999999999998
629,-0.13993
630,-0.13414
631,-0.13124
632,-0.13124
633,-0.12835
634,-0.12255999999999999
635,-0.11677
636,-0.11098
637,-0.10457000000000001
638,-0.09878300000000001
639,-0.09299099999999999
640,-0.09299099999999999
641,-0.09009500000000001
642,-0.08659
643,-0.08079800000000001
644,-0.07500599999999999
645,-0.069213
646,-0.062813
647,-0.05702
648,-0.051226999999999995
649,-0.045433999999999995
650,-0.044217
651,-0.040094
652,-0.038853
653,-0.032443
654,-0.023763999999999997
655,-0.017978
656,-0.012191
657,-0.006403699999999999
658,-0.00061566
659,0.0051733000000000005
660,0.010962000000000001
661,0.016752
662,0.022542
663,0.028332999999999997
664,0.034736
665,0.040527
666,0.049214
667,0.05500599999999999
668,0.060798000000000005
669,0.066591
670,0.072385
671,0.07818
672,0.08397400000000001
673,0.08977
674,0.095566
675,0.10136
676,0.10715999999999999
677,0.11295999999999999
678,0.12165
679,0.12285
680,0.12695
681,0.12817
682,0.13457
683,0.14035999999999998
684,0.14615
685,0.15194000000000002
686,0.15774000000000002
687,0.16353
688,0.16932
689,0.17512
690,0.18381
691,0.1896
692,0.1954
693,0.20119
694,0.20699
695,0.21279
696,0.21859
697,0.22438000000000002
698,0.23018000000000002
699,0.23598000000000002
700,0.24178000000000002
701,0.24758000000000002
702,0.25628
703,0.26209
704,0.26789
705,0.27021
706,0.26905
707,0.2679
708,0.26677
709,0.26565
710,0.26745
711,0.26635
712,0.26526
713,0.26816999999999996
714,0.27637
715,0.28219
716,0.28404
717,0.28299
718,0.28196
719,0.28093
720,0.27992
721,0.27892
722,0.27793
723,0.27695
724,0.27598
725,0.27503
726,0.27362
727,0.27269
728,0.27178
729,0.27088
730,0.26999
731,0.26911
732,0.26825
733,0.26739
734,0.26655
735,0.26571999999999996
736,0.2649
737,0.2641
738,0.26291
739,0.25959
740,0.25372
741,0.24745999999999999
742,0.2416
743,0.24083000000000002
744,0.23713
745,0.23639000000000002
746,0.23308
747,0.22721
748,0.22096999999999997
749,0.2151
750,0.21106999999999998
751,0.21036
752,0.20673000000000002
753,0.20379
754,0.19755999999999999
755,0.19168
756,0.18805999999999998
757,0.18739
758,0.18379
759,0.18052
760,0.17464000000000002
761,0.16843
762,0.16810999999999998
763,0.16748
764,0.16685999999999998
765,0.16625
766,0.16566
767,0.16507
768,0.1645
769,0.16394
770,0.1634
771,0.16287000000000001
772,0.16235
773,0.16235
774,0.17119
775,0.17709
776,0.18298
777,0.18888
778,0.19478
779,0.20068
780,0.20656999999999998
781,0.21247
782,0.21836999999999998
783,0.22426
784,0.22991
785,0.23581
786,0.24466
787,0.25056
788,0.25645
789,0.26235
790,0.26825
791,0.27415
792,0.28005
793,0.28595
794,0.29185
795,0.29431999999999997
796,0.29385
797,0.29635
798,0.29908
799,0.30498000000000003
800,0.31088000000000005
801,0.31678
802,0.32269000000000003
803,0.32859
804,0.33449
805,0.34039
806,0.3463
807,0.3522
808,0.3581
809,0.36401
810,0.37264
811,0.37855
812,0.38445
813,0.39036
814,0.39626
815,0.40216
816,0.40807
817,0.41397
818,0.41988000000000003
819,0.42578
820,0.43168
821,0.43443000000000004
822,0.43678
823,0.43638999999999994
824,0.44211000000000006
825,0.44802
826,0.45374
827,0.45651
828,0.45615
829,0.45876000000000006
830,0.45843
831,0.46434
832,0.47025
833,0.47616
834,0.47911000000000004
835,0.48207
836,0.48207
837,0.48798
838,0.49388999999999994
839,0.49683999999999995
840,0.49683999999999995
841,0.49683999999999995
842,0.49683999999999995
843,0.49717
844,0.49751000000000006
845,0.5008199999999999
846,0.50137
847,0.50174
848,0.5021399999999999
849,0.50254
850,0.50844
851,0.51435
852,0.52025
853,0.5261600000000001
854,0.5320600000000001
855,0.53797
856,0.54387
857,0.54978
858,0.5586300000000001
859,0.5645399999999999
860,0.57044
861,0.57655
862,0.5824600000000001
863,0.58836
864,0.59427
865,0.60017
866,0.60588
867,0.61198
868,0.61769
869,0.6236
870,0.63245
871,0.63836
872,0.64427
873,0.65017
874,0.65608
875,0.66198
876,0.66789
877,0.6738
878,0.6797
879,0.68561
880,0.69152
881,0.69409
882,0.6965
883,0.69615
884,0.6991
885,0.70501
886,0.71092
887,0.71683
888,0.72273
889,0.72864
890,0.73455
891,0.74029
892,0.7462
893,0.7521100000000001
894,0.76097
895,0.76688
896,0.77279
897,0.7787
898,0.78461
899,0.7872399999999999
900,0.78988
901,0.78957
902,0.79533
903,0.80125
904,0.80716
905,0.81602
906,0.8219299999999999
907,0.82785
908,0.8337600000000001
909,0.83967
910,0.8455799999999999
911,0.85149
912,0.85741
913,0.8633200000000001
914,0.86923
915,0.8751399999999999
916,0.88105
917,0.88992
918,0.89569
919,0.9016
920,0.90751
921,0.9134200000000001
922,0.9193399999999999
923,0.92525
924,0.93116
925,0.9370700000000001
926,0.94299
927,0.9489
928,0.95481
929,0.96368
930,0.96959
931,0.9755
932,0.9814200000000001
933,0.9873299999999999
934,0.99324
935,0.99916
936,1.0051
937,1.011
938,1.0169
939,1.0228
940,1.0287
941,1.0376
942,1.0435
943,1.0495
944,1.0555
945,1.0614
946,1.0671
947,1.0731
948,1.079
949,1.0849
950,1.0908
951,1.0967
952,1.1026
953,1.1115
954,1.1174
955,1.1233
956,1.1292
957,1.1351
958,1.1411
959,1.147
960,1.1529
961,1.1588
962,1.1647
963,1.1706
964,1.1765
965,1.1854
966,1.1913
967,1.1972
968,1.2033
969,1.2092
970,1.2151
971,1.2209999999999999
972,1.2269
973,1.2328
974,1.2388
975,1.2447
976,1.2506
977,1.2594
978,1.2654
979,1.2713
980,1.2772
981,1.2831
982,1.2890000000000001
983,1.2948
984,1.3007
985,1.3066
986,1.3125
987,1.3185
988,1.3244
989,1.3332
990,1.3392
991,1.3451
992,1.351
993,1.3538
994,1.3536
995,1.3563
996,1.3561
997,1.3619999999999999
998,1.3679
999,1.3738
1000,1.3797
1001,1.3886
1002,1.3945
1003,1.4003
1004,1.4062
1005,1.4122
1006,1.4122
1007,1.4122
1008,1.412
1009,1.4118
1010,1.4116
1011,1.4114
1012,1.4142
1013,1.4169
1014,1.4197
1015,1.4196
1016,1.4225
1017,1.4224
1018,1.4224
1019,1.4224
1020,1.4193
1021,1.4192
1022,1.4162
1023,1.4162
1024,1.4132
1025,1.4102
1026,1.4071
1027,1.4069999999999998
1028,1.4040000000000001
1029,1.401
1030,1.401
1031,1.401
1032,1.3980000000000001
1033,1.3980000000000001
1034,1.3980000000000001
1035,1.3980000000000001
1036,1.3980000000000001
1037,1.3979
1038,1.3978
1039,1.3978
1040,1.3978
1041,1.3978
1042,1.3978
1043,1.3978
1044,1.3978
1045,1.3978
1046,1.4037
1047,1.4037
1048,1.4037
1049,1.4037
1050,1.4037
1051,1.4037
1052,1.4038
1053,1.4038
1054,1.4039
1055,1.4039
1056,1.4039
1057,1.4040000000000001
1058,1.4040000000000001
1059,1.401
1060,1.3951
1061,1.3862
1062,1.3803
1063,1.3744
1064,1.3685
1065,1.3626
1066,1.3567
1067,1.3508
1068,1.3448
1069,1.3389
1070,1.3330000000000002
1071,1.33
1072,1.3271
1073,1.3241
1074,1.3182
1075,1.3123
1076,1.3064
1077,1.3005
1078,1.3005
1079,1.2976
1080,1.2976
1081,1.2947
1082,1.2888
1083,1.2829
1084,1.2770000000000001
1085,1.2682
1086,1.2623
1087,1.2593
1088,1.2563
1089,1.2562
1090,1.2562
1091,1.2503
1092,1.2444
1093,1.2384
1094,1.2325
1095,1.2266
1096,1.2207
1097,1.2118
1098,1.2059
1099,1.2059
1100,1.2059
1101,1.2028
1102,1.1998
1103,1.1939
1104,1.188
1105,1.1821
1106,1.1762
1107,1.1702
1108,1.1643
1109,1.1554
1110,1.1495
1111,1.1436
1112,1.1377
1113,1.1318
1114,1.1259
1115,1.1199
1116,1.114
1117,1.1081
1118,1.1022
1119,1.0963
1120,1.0903
1121,1.0814
1122,1.0755
1123,1.0696
1124,1.0637
1125,1.0578
1126,1.0518
1127,1.0459
1128,1.04
1129,1.0341
1130,1.0282
1131,1.0222
1132,1.0163
1133,1.0075
1134,1.0015
1135,0.9956200000000001
1136,0.9897
1137,0.9837799999999999
1138,0.9778600000000001
1139,0.9719399999999999
1140,0.9660200000000001
1141,0.96011
1142,0.95419
1143,0.9482700000000001
1144,0.94235
1145,0.93347
1146,0.92756
1147,0.92164
1148,0.9157200000000001
1149,0.9098
1150,0.9038799999999999
1151,0.8979600000000001
1152,0.89205
1153,0.88613
1154,0.88021
1155,0.87429
1156,0.8683700000000001
1157,0.8595
1158,0.8535799999999999
1159,0.8476600000000001
1160,0.8417399999999999
1161,0.8358200000000001
1162,0.8299
1163,0.82399
1164,0.81807
1165,0.81215
1166,0.80623
1167,0.8003100000000001
1168,0.7944399999999999
1169,0.78556
1170,0.77964
1171,0.77373
1172,0.76781
1173,0.76189
1174,0.75597
1175,0.75005
1176,0.7441300000000001
1177,0.73822
1178,0.73831
1179,0.73546
1180,0.73558
1181,0.72677
1182,0.72085
1183,0.7149300000000001
1184,0.70901
1185,0.7031
1186,0.69718
1187,0.69126
1188,0.68534
1189,0.6794899999999999
1190,0.6735800000000001
1191,0.66766
1192,0.66174
1193,0.65286
1194,0.64695
1195,0.64103
1196,0.6351100000000001
1197,0.6292
1198,0.6232800000000001
1199,0.62032
1200,0.61736
1201,0.61736
1202,0.6144
1203,0.60849
1204,0.6025699999999999
1205,0.5936899999999999
1206,0.59073
1207,0.58777
1208,0.58777
1209,0.58482
1210,0.5789
1211,0.57298
1212,0.56706
1213,0.56115
1214,0.55523
1215,0.5493100000000001
1216,0.5434
1217,0.53452
1218,0.52854
1219,0.52262
1220,0.5167
1221,0.51078
1222,0.5048699999999999
1223,0.49895
1224,0.49303
1225,0.48711000000000004
1226,0.4812
1227,0.47528000000000004
1228,0.47218999999999994
1229,0.47201000000000004
1230,0.47191000000000005
1231,0.46895
1232,0.46895
1233,0.46895
1234,0.46895
1235,0.46303
1236,0.45711
1237,0.45415
1238,0.45415
1239,0.45119
1240,0.44823
1241,0.43935
1242,0.43343999999999994
1243,0.42751999999999996
1244,0.4216
1245,0.41568999999999995
1246,0.40976999999999997
1247,0.40686
1248,0.40401
1249,0.40414
1250,0.40426999999999996
1251,0.39836
1252,0.39244
1253,0.38356
1254,0.37772
1255,0.3718
1256,0.36589
1257,0.35996999999999996
1258,0.36013
1259,0.35733000000000004
1260,0.35752
1261,0.35465
1262,0.34873000000000004
1263,0.34292
1264,0.337
1265,0.33436
1266,0.33458000000000004
1267,0.33481
1268,0.3289
1269,0.32299
1270,0.31706999999999996
1271,0.31116
1272,0.30524
1273,0.29945
1274,0.29354
1275,0.28763
1276,0.28467
1277,0.28467
1278,0.28467
1279,0.28493
1280,0.2852
1281,0.28548
1282,0.28576999999999997
1283,0.28607
1284,0.28639000000000003
1285,0.28655
1286,0.28655
1287,0.28655
1288,0.28951
1289,0.29854
1290,0.30445
1291,0.31035999999999997
1292,0.31348000000000004
1293,0.31382
1294,0.31418
1295,0.31455
1296,0.31788
1297,0.31827
1298,0.31867
1299,0.31909
1300,0.32204
1301,0.3309
1302,0.33701
1303,0.34292
1304,0.34881999999999996
1305,0.35472
1306,0.36063
1307,0.36063
1308,0.36358
1309,0.36358
1310,0.36653
1311,0.36948000000000003
1312,0.3756
1313,0.38171
1314,0.38488
1315,0.38488
1316,0.3851
1317,0.39121999999999996
1318,0.39713000000000004
1319,0.40325
1320,0.40938
1321,0.41233000000000003
1322,0.41528000000000004
1323,0.41528000000000004
1324,0.41823
1325,0.42731
1326,0.43321000000000004
1327,0.43663
1328,0.44005
1329,0.44053000000000003
1330,0.44668
1331,0.45257
1332,0.45847
1333,0.46437
1334,0.47052
1335,0.47641999999999995
1336,0.48231
1337,0.48576
1338,0.48627
1339,0.48973999999999995
1340,0.49001000000000006
1341,0.4959
1342,0.5018
1343,0.50769
1344,0.51359
1345,0.51975
1346,0.52564
1347,0.53154
1348,0.53743
1349,0.54628
1350,0.5521699999999999
1351,0.55833
1352,0.55833
1353,0.56128
1354,0.56128
1355,0.56423
1356,0.57012
1357,0.57602
1358,0.58191
1359,0.58781
1360,0.5937
1361,0.5996
1362,0.5996
1363,0.60255
1364,0.60228
1365,0.60818
1366,0.61407
1367,0.61997
1368,0.6258699999999999
1369,0.63176
1370,0.63766
1371,0.64356
1372,0.64945
1373,0.6583
1374,0.6642
1375,0.67009
1376,0.67599
1377,0.68189
1378,0.6877800000000001
1379,0.69368
1380,0.69958
1381,0.70009
1382,0.7035600000000001
1383,0.70409
1384,0.71025
1385,0.71909
1386,0.7249800000000001
1387,0.73115
1388,0.7370399999999999
1389,0.7429399999999999
1390,0.74883
1391,0.74938
1392,0.7528699999999999
1393,0.75344
1394,0.75962
1395,0.76551
1396,0.7714
1397,0.7802399999999999
1398,0.78641
1399,0.7923
1400,0.79819
1401,0.80409
1402,0.80998
1403,0.81587
1404,0.82204
1405,0.82262
1406,0.82615
1407,0.82676
1408,0.8297
1409,0.8385299999999999
1410,0.8444200000000001
1411,0.85031
1412,0.8562
1413,0.86208
1414,0.8682700000000001
1415,0.87416
1416,0.88005
1417,0.88594
1418,0.8918299999999999
1419,0.89771
1420,0.9036
1421,0.9124399999999999
1422,0.9186200000000001
1423,0.9189200000000001
1424,0.9224700000000001
1425,0.92309
1426,0.92929
1427,0.9351700000000001
1428,0.94106
1429,0.94695
1430,0.95283
1431,0.9587200000000001
1432,0.9646
1433,0.9734299999999999
1434,0.9793200000000001
1435,0.98521
1436,0.9910899999999999
1437,0.99698
1438,1.0029
1439,1.0088
1440,1.0146
1441,1.0205
1442,1.0264
1443,1.0323
1444,1.0382
1445,1.047
1446,1.0532
1447,1.0591
1448,1.065
1449,1.0709
1450,1.0768
1451,1.0827
1452,1.0885
1453,1.0944
1454,1.1003
1455,1.1062
1456,1.1065
1457,1.1104
1458,1.1139
1459,1.1172
1460,1.1231
1461,1.129
1462,1.1348
1463,1.1407
1464,1.1466
1465,1.1525
1466,1.1584
1467,1.1643
1468,1.1702
1469,1.179
1470,1.1849
1471,1.1908
1472,1.1966
1473,1.2025
1474,1.2084
1475,1.2143
1476,1.2202
1477,1.2261
1478,1.232
1479,1.2379
1480,1.2437
1481,1.2526
1482,1.2585
1483,1.2643
1484,1.2705
1485,1.2764
1486,1.2823
1487,1.2882
1488,1.2941
1489,1.3
1490,1.3059
1491,1.3118
1492,1.3176
1493,1.3209
1494,1.3244
1495,1.3251
1496,1.3286
1497,1.3316
1498,1.3375
1499,1.3433
1500,1.3492
1501,1.3551
1502,1.3613
1503,1.3672
1504,1.3731
1505,1.3819
1506,1.3878
1507,1.3937
1508,1.3969
1509,1.3976
1510,1.4012
1511,1.4018
1512,1.4018
1513,1.4021
1514,1.4021
1515,1.4025
1516,1.4031
1517,1.4042
1518,1.4049
1519,1.4052
1520,1.4052
1521,1.4056
1522,1.4063
1523,1.4069999999999998
1524,1.4077
1525,1.4084
1526,1.4092
1527,1.4099
1528,1.4107
1529,1.4118
1530,1.4126
1531,1.4134
1532,1.4113
1533,1.4121
1534,1.4129
1535,1.4137
1536,1.4146
1537,1.4154
1538,1.4163
1539,1.4171
1540,1.4180000000000001
1541,1.4193
1542,1.4202
1543,1.4211
1544,1.4186
1545,1.4128
1546,1.4069
1547,1.4011
1548,1.3952
1549,1.3894
1550,1.3835
1551,1.3777
1552,1.3718
1553,1.3630000000000002
1554,1.3577
1555,1.3518
1556,1.3459999999999999
1557,1.3401
1558,1.3343
1559,1.3284
1560,1.3226
1561,1.3167
1562,1.3109
1563,1.308
1564,1.308
1565,1.305
1566,1.2992
1567,1.2934
1568,1.2875
1569,1.2817
1570,1.2788
1571,1.2788
1572,1.2758
1573,1.2729
1574,1.2671
1575,1.2612
1576,1.2554
1577,1.2466
1578,1.2408
1579,1.2349
1580,1.2291
1581,1.2233
1582,1.2174
1583,1.2116
1584,1.2057
1585,1.1999
1586,1.194
1587,1.1882
1588,1.1824
1589,1.1731
1590,1.1673
1591,1.1614
1592,1.1556
1593,1.1498
1594,1.1439
1595,1.1381
1596,1.1323
1597,1.1264
1598,1.1206
1599,1.1143
1600,1.1138
1601,1.1094
1602,1.1084
1603,1.1055
1604,1.0997
1605,1.0938
1606,1.088
1607,1.0822
1608,1.0763
1609,1.0705
1610,1.0646
1611,1.0583
1612,1.0525
1613,1.0437
1614,1.0379
1615,1.032
1616,1.0262
1617,1.0204
1618,1.0145
1619,1.0087
1620,1.0028
1621,0.997
1622,0.9911700000000001
1623,0.9853299999999999
1624,0.97949
1625,0.97073
1626,0.9648899999999999
1627,0.95906
1628,0.9532200000000001
1629,0.9473799999999999
1630,0.94155
1631,0.93571
1632,0.9298799999999999
1633,0.92404
1634,0.9182100000000001
1635,0.9123700000000001
1636,0.90654
1637,0.89779
1638,0.89195
1639,0.88612
1640,0.88029
1641,0.87446
1642,0.8686200000000001
1643,0.86279
1644,0.85696
1645,0.8511299999999999
1646,0.8453
1647,0.83947
1648,0.83363
1649,0.82489
1650,0.81906
1651,0.81323
1652,0.8074
1653,0.80157
1654,0.79574
1655,0.78991
1656,0.78409
1657,0.7782600000000001
1658,0.7724300000000001
1659,0.7666
1660,0.76078
1661,0.7520399999999999
1662,0.74621
1663,0.74039
1664,0.73456
1665,0.72873
1666,0.72291
1667,0.71709
1668,0.71126
1669,0.70544
1670,0.6996100000000001
1671,0.69379
1672,0.68797
1673,0.67924
1674,0.6734100000000001
1675,0.66759
1676,0.66177
1677,0.65595
1678,0.65013
1679,0.64431
1680,0.63849
1681,0.63267
1682,0.62685
1683,0.62103
1684,0.61521
1685,0.60649
1686,0.60012
1687,0.59667
1688,0.5956
1689,0.59215
1690,0.58924
1691,0.5834199999999999
1692,0.5776
1693,0.5717800000000001
1694,0.56596
1695,0.56014
1696,0.55432
1697,0.54505
1698,0.53923
1699,0.53287
1700,0.52996
1701,0.52705
1702,0.52705
1703,0.52468
1704,0.51886
1705,0.51359
1706,0.50832
1707,0.50251
1708,0.50016
1709,0.50071
1710,0.49546
1711,0.48965
1712,0.48731
1713,0.4844
1714,0.4844
1715,0.4815
1716,0.47568999999999995
1717,0.46988
1718,0.46407
1719,0.45826999999999996
1720,0.45246000000000003
1721,0.44375
1722,0.43793999999999994
1723,0.43213999999999997
1724,0.42633000000000004
1725,0.42053
1726,0.4153
1727,0.4095
1728,0.4037
1729,0.3979
1730,0.39209
1731,0.38629
1732,0.38049
1733,0.37179
1734,0.36599
1735,0.36019
1736,0.3544
1737,0.3486
1738,0.34979
1739,0.3481
1740,0.34933000000000003
1741,0.34705
1742,0.34126
1743,0.33609
1744,0.3303
1745,0.32741
1746,0.32741
1747,0.32741
1748,0.32161999999999996
1749,0.31584
1750,0.31005
1751,0.3049
1752,0.30264
1753,0.30264
1754,0.30039
1755,0.30103
1756,0.29525
1757,0.28723000000000004
1758,0.28210999999999997
1759,0.27699
1760,0.27121
1761,0.26544
1762,0.26544
1763,0.26544
1764,0.26544
1765,0.26388
1766,0.26521999999999996
1767,0.26655999999999996
1768,0.26504
1769,0.25709
1770,0.25133
1771,0.24915
1772,0.25054
1773,0.24906999999999999
1774,0.25048000000000004
1775,0.24474
1776,0.23970999999999998
1777,0.23396
1778,0.23254
1779,0.23112
1780,0.22971999999999998
1781,0.2276
1782,0.22261
1783,0.21688000000000002
1784,0.21477
1785,0.21628000000000003
1786,0.21493
1787,0.21646999999999997
1788,0.21075
1789,0.20581
1790,0.2001
1791,0.19724
1792,0.1988
1793,0.19831
1794,0.1999
1795,0.1942
1796,0.18930999999999998
1797,0.18361
1798,0.18157
1799,0.1832
1800,0.18199
1801,0.18364
1802,0.17795999999999998
1803,0.17228
1804,0.1666
1805,0.15891
1806,0.15324000000000002
1807,0.14756
1808,0.14189000000000002
1809,0.14357999999999999
1810,0.14245
1811,0.14134000000000002
1812,0.1422
1813,0.13654000000000002
1814,0.13176
1815,0.12697999999999998
1816,0.12962
1817,0.1314
1818,0.13318
1819,0.13217
1820,0.13398
1821,0.1358
1822,0.13109
1823,0.12547
1824,0.12077
1825,0.11796
1826,0.11982000000000001
1827,0.11889000000000001
1828,0.12172000000000001
1829,0.11612
1830,0.11051
1831,0.10490999999999999
1832,0.09930599999999999
1833,0.094666
1834,0.08906900000000001
1835,0.083473
1836,0.083473
1837,0.08541
1838,0.087358
1839,0.089318
1840,0.092279
1841,0.09426799999999999
1842,0.09626799999999999
1843,0.09827999999999999
1844,0.1003
1845,0.10234
1846,0.10438
1847,0.10438
1848,0.10994000000000001
1849,0.11549000000000001
1850,0.12105
1851,0.1266
1852,0.13596
1853,0.14152
1854,0.14708
1855,0.15264
1856,0.1582
1857,0.16377
1858,0.16477999999999998
1859,0.16958
1860,0.17439000000000002
1861,0.17920999999999998
1862,0.18477000000000002
1863,0.19032000000000002
1864,0.19968
1865,0.20524
1866,0.2108
1867,0.21636
1868,0.22116999999999998
1869,0.22321
1870,0.22803
1871,0.23184000000000002
1872,0.23739000000000002
1873,0.24294000000000002
1874,0.24849000000000002
1875,0.25405
1876,0.2634
1877,0.26896
1878,0.27451
1879,0.28007
1880,0.28563
1881,0.29220999999999997
1882,0.29600000000000004
1883,0.30082
1884,0.30286
1885,0.30666
1886,0.31221
1887,0.31777
1888,0.32711999999999997
1889,0.33268000000000003
1890,0.33823000000000003
1891,0.34379
1892,0.34759
1893,0.34963
1894,0.35446
1895,0.35652
1896,0.36206
1897,0.36865
1898,0.37419
1899,0.37903000000000003
1900,0.38491
1901,0.387
1902,0.39254
1903,0.39808000000000004
1904,0.40362
1905,0.40915999999999997
1906,0.4147
1907,0.42128000000000004
1908,0.42683000000000004
1909,0.43237
1910,0.43792
1911,0.44347
1912,0.45282
1913,0.45766
1914,0.45973
1915,0.46458
1916,0.47012
1917,0.47566
1918,0.48121
1919,0.48675
1920,0.4923
1921,0.49783999999999995
1922,0.50339
1923,0.50997
1924,0.5183
1925,0.52385
1926,0.5294
1927,0.53496
1928,0.54051
1929,0.5460699999999999
1930,0.55089
1931,0.55293
1932,0.55777
1933,0.56435
1934,0.56989
1935,0.57544
1936,0.58377
1937,0.58932
1938,0.59488
1939,0.60043
1940,0.6059899999999999
1941,0.61257
1942,0.61812
1943,0.62368
1944,0.6292399999999999
1945,0.6348
1946,0.64037
1947,0.64593
1948,0.6489699999999999
1949,0.65378
1950,0.65582
1951,0.66138
1952,0.66693
1953,0.6724899999999999
1954,0.67805
1955,0.68361
1956,0.68916
1957,0.6947300000000001
1958,0.70029
1959,0.70686
1960,0.71521
1961,0.72077
1962,0.72634
1963,0.7319100000000001
1964,0.73748
1965,0.74405
1966,0.75062
1967,0.7561899999999999
1968,0.76176
1969,0.76454
1970,0.7693300000000001
1971,0.77412
1972,0.7807
1973,0.7862600000000001
1974,0.79183
1975,0.7974
1976,0.80297
1977,0.8085399999999999
1978,0.81411
1979,0.81968
1980,0.82526
1981,0.83083
1982,0.8374
1983,0.84298
1984,0.85135
1985,0.8569200000000001
1986,0.8625
1987,0.86808
1988,0.8736700000000001
1989,0.87925
1990,0.8848299999999999
1991,0.8868
1992,0.89156
1993,0.89354
1994,0.8973200000000001
1995,0.9029
1996,0.9112600000000001
1997,0.91684
1998,0.92242
1999,0.9279999999999999
2000,0.9345700000000001
2001,0.94015
2002,0.94573
2003,0.95132
2004,0.9569
2005,0.96067
2006,0.9626399999999999
2007,0.9674
2008,0.9721700000000001
2009,0.97775
2010,0.9833299999999999
2011,0.9889100000000001
2012,0.9954700000000001
2013,1.0011
2014,1.0066
2015,1.0122
2016,1.0142
2017,1.0162
2018,1.0182
2019,1.0229
2020,1.0259
2021,1.028
2022,1.03
2023,1.0356
2024,1.0421
2025,1.0477
2026,1.0525
2027,1.0545
2028,1.0566
2029,1.0586
2030,1.0607
2031,1.0628
2032,1.0659
2033,1.068
2034,1.0701
2035,1.0722
2036,1.0743
2037,1.0764
2038,1.0786
2039,1.0807
2040,1.0828
2041,1.0812
2042,1.0757
2043,1.0701
2044,1.0619
2045,1.0564
2046,1.0509
2047,1.0454
2048,1.0399
2049,1.0344
2050,1.0289
2051,1.0234
2052,1.0179
2053,1.0151
2054,1.0129
2055,1.008
2056,1.0058
2057,1.0003
2058,0.9948100000000001
2059,0.98931
2060,0.9838100000000001
2061,0.97831
2062,0.9728100000000001
2063,0.96731
2064,0.9618200000000001
2065,0.9552200000000001
2066,0.94973
2067,0.9442299999999999
2068,0.9359999999999999
2069,0.9305100000000001
2070,0.9250200000000001
2071,0.9195399999999999
2072,0.91405
2073,0.9085700000000001
2074,0.9030799999999999
2075,0.8976
2076,0.89213
2077,0.88665
2078,0.8811700000000001
2079,0.87682
2080,0.8686200000000001
2081,0.86314
2082,0.8576799999999999
2083,0.85108
2084,0.8456100000000001
2085,0.84014
2086,0.83468
2087,0.83036
2088,0.8249
2089,0.81944
2090,0.81399
2091,0.80853
2092,0.7992
2093,0.79375
2094,0.7883
2095,0.78285
2096,0.7774
2097,0.77195
2098,0.76651
2099,0.76107
2100,0.75563
2101,0.7501899999999999
2102,0.74475
2103,0.74241
2104,0.73621
2105,0.73117
2106,0.72572
2107,0.72027
2108,0.71483
2109,0.71483
2110,0.71483
2111,0.71211
2112,0.71211
2113,0.7066600000000001
2114,0.70122
2115,0.6985
2116,0.6985
2117,0.6957800000000001
2118,0.69034
2119,0.68491
2120,0.67947
2121,0.67911
2122,0.67876
2123,0.67843
2124,0.67962
2125,0.6742
2126,0.66879
2127,0.66337
2128,0.6552600000000001
2129,0.64985
2130,0.64444
2131,0.6390399999999999
2132,0.63363
2133,0.6282300000000001
2134,0.62283
2135,0.61743
2136,0.6120399999999999
2137,0.60664
2138,0.60125
2139,0.59464
2140,0.5895100000000001
2141,0.58437
2142,0.58195
2143,0.57655
2144,0.57115
2145,0.56575
2146,0.5603600000000001
2147,0.55496
2148,0.54835
2149,0.54296
2150,0.53757
2151,0.53218
2152,0.5241
2153,0.51872
2154,0.51626
2155,0.51381
2156,0.50868
2157,0.50476
2158,0.49937
2159,0.49398000000000003
2160,0.48858999999999997
2161,0.48197
2162,0.47658
2163,0.4712
2164,0.46336000000000005
2165,0.45821999999999996
2166,0.45578
2167,0.45187
2168,0.44647
2169,0.44108
2170,0.43568999999999997
2171,0.4303
2172,0.42491
2173,0.41952
2174,0.41291000000000005
2175,0.40752
2176,0.39945
2177,0.39407
2178,0.39015
2179,0.38768
2180,0.38253000000000004
2181,0.38009
2182,0.3747
2183,0.36930999999999997
2184,0.36391999999999997
2185,0.35854
2186,0.35316
2187,0.34776999999999997
2188,0.33971
2189,0.33309
2190,0.32771999999999996
2191,0.32234
2192,0.31697
2193,0.3116
2194,0.30624
2195,0.30086999999999997
2196,0.29551
2197,0.29301
2198,0.28783000000000003
2199,0.28535
2200,0.27604
2201,0.27066999999999997
2202,0.2653
2203,0.25993
2204,0.25456999999999996
2205,0.2492
2206,0.24384
2207,0.23848000000000003
2208,0.23312
2209,0.22776999999999997
2210,0.22241
2211,0.2158
2212,0.20776999999999998
2213,0.20243
2214,0.19708
2215,0.19174000000000002
2216,0.1864
2217,0.18106
2218,0.17572000000000002
2219,0.17039
2220,0.16505999999999998
2221,0.15972999999999998
2222,0.1544
2223,0.14908
2224,0.1411
2225,0.13577999999999998
2226,0.13046
2227,0.12515
2228,0.11984000000000002
2229,0.11452999999999999
2230,0.11452999999999999
2231,0.11188
2232,0.10923
2233,0.10393
2234,0.098623
2235,0.098623
2236,0.095974
2237,0.09332599999999999
2238,0.088031
2239,0.082738
2240,0.077448
2241,0.07216
2242,0.066876
2243,0.061594
2244,0.056313999999999996
2245,0.051037
2246,0.045763
2247,0.040492
2248,0.03259
2249,0.027326
2250,0.022064
2251,0.016805
2252,0.011549
2253,0.0062953
2254,0.0010452999999999999
2255,-0.0042027
2256,-0.0094467
2257,-0.014812
2258,-0.020171
2259,-0.022896
2260,-0.032141
2261,-0.037395
2262,-0.042645999999999996
2263,-0.047894
2264,-0.053139
2265,-0.059756
2266,-0.064998
2267,-0.070237
2268,-0.075473
2269,-0.080707
2270,-0.085937
2271,-0.08870499999999999
2272,-0.095458
2273,-0.098202
2274,-0.10345
2275,-0.10869000000000001
2276,-0.11392999999999999
2277,-0.11917
2278,-0.12578
2279,-0.13102
2280,-0.13625
2281,-0.14147
2282,-0.1467
2283,-0.15192
2284,-0.15974000000000002
2285,-0.16254000000000002
2286,-0.16793
2287,-0.17071
2288,-0.17471
2289,-0.17994000000000002
2290,-0.18517
2291,-0.19178
2292,-0.19701
2293,-0.20223
2294,-0.20745
2295,-0.21406
2296,-0.22086
2297,-0.22363000000000002
2298,-0.22763000000000003
2299,-0.23285999999999998
2300,-0.23809
2301,-0.24331
2302,-0.24853000000000003
2303,-0.25375
2304,-0.26036
2305,-0.26558000000000004
2306,-0.27078
2307,-0.27599
2308,-0.28379
2309,-0.28922
2310,-0.29203
2311,-0.29744
2312,-0.30145
2313,-0.30666
2314,-0.31188
2315,-0.31708000000000003
2316,-0.32229
2317,-0.32749
2318,-0.33268000000000003
2319,-0.3393
2320,-0.34709
2321,-0.35226999999999997
2322,-0.35746
2323,-0.36264
2324,-0.36782
2325,-0.37299
2326,-0.37816
2327,-0.38363
2328,-0.38909
2329,-0.39195
2330,-0.39597
2331,-0.40115
2332,-0.40892
2333,-0.4141
2334,-0.41927
2335,-0.42588000000000004
2336,-0.43104
2337,-0.43621000000000004
2338,-0.44136000000000003
2339,-0.44652
2340,-0.45166999999999996
2341,-0.45716
2342,-0.46263999999999994
2343,-0.46553999999999995
2344,-0.47215
2345,-0.47731
2346,-0.48246999999999995
2347,-0.48763
2348,-0.49278
2349,-0.49793000000000004
2350,-0.50307
2351,-0.50968
2352,-0.5148199999999999
2353,-0.51995
2354,-0.52509
2355,-0.5302100000000001
2356,-0.53789
2357,-0.54301
2358,-0.54961
2359,-0.55515
2360,-0.55811
2361,-0.56107
2362,-0.5662
2363,-0.57133
2364,-0.57645
2365,-0.58305
2366,-0.58817
2367,-0.59328
2368,-0.6039399999999999
2369,-0.6069100000000001
2370,-0.61244
2371,-0.61392
2372,-0.6190399999999999
2373,-0.62417
2374,-0.6292800000000001
2375,-0.6344
2376,-0.6409999999999999
2377,-0.6461100000000001
2378,-0.6512100000000001
2379,-0.6563100000000001
2380,-0.66395
2381,-0.66904
2382,-0.6741199999999999
2383,-0.67715
2384,-0.6801699999999999
2385,-0.68572
2386,-0.68977
2387,-0.69488
2388,-0.69997
2389,-0.70657
2390,-0.7116600000000001
2391,-0.71675
2392,-0.72437
2393,-0.72843
2394,-0.73146
2395,-0.73703
2396,-0.74259
2397,-0.74769
2398,-0.75429
2399,-0.75938
2400,-0.76239
2401,-0.7654
2402,-0.77094
2403,-0.77499
2404,-0.78265
2405,-0.78776
2406,-0.79285
2407,-0.79794
2408,-0.80303
2409,-0.8096300000000001
2410,-0.81471
2411,-0.81979
2412,-0.82486
2413,-0.8299200000000001
2414,-0.83399
2415,-0.83704
2416,-0.8416
2417,-0.8471700000000001
2418,-0.8501799999999999
2419,-0.8531700000000001
2420,-0.85615
2421,-0.8602
2422,-0.86531
2423,-0.8704299999999999
2424,-0.8755299999999999
2425,-0.8821399999999999
2426,-0.8872399999999999
2427,-0.89233
2428,-0.90044
2429,-0.90599
2430,-0.9089799999999999
2431,-0.9130299999999999
2432,-0.91814
2433,-0.92475
2434,-0.93284
2435,-0.9358200000000001
2436,-0.94134
2437,-0.9453799999999999
2438,-0.95199
2439,-0.9571200000000001
2440,-0.9652
2441,-0.97072
2442,-0.97365
2443,-0.98026
2444,-0.9854
2445,-0.99054
2446,-0.99567
2447,-1.0023
2448,-1.0074
2449,-1.0125
2450,-1.018
2451,-1.0236
2452,-1.028
2453,-1.0331
2454,-1.0397
2455,-1.0449
2456,-1.0489
2457,-1.0544
2458,-1.0573
2459,-1.0602
2460,-1.0654
2461,-1.0706
2462,-1.0772
2463,-1.0812
2464,-1.0881
2465,-1.091
2466,-1.095
2467,-1.1002
2468,-1.1054
2469,-1.112
2470,-1.1172
2471,-1.1223
2472,-1.1275
2473,-1.1341
2474,-1.137
2475,-1.1425
2476,-1.1453
2477,-1.1505
2478,-1.1557
2479,-1.1608
2480,-1.1674
2481,-1.1726
2482,-1.1777
2483,-1.1829
2484,-1.1869
2485,-1.1899
2486,-1.1953
2487,-1.1982
2488,-1.206
2489,-1.2111
2490,-1.2163
2491,-1.2214
2492,-1.2266
2493,-1.2317
2494,-1.2368
2495,-1.2419
2496,-1.247
2497,-1.2537
2498,-1.2588
2499,-1.2639
2500,-1.2715
2501,-1.2766
2502,-1.2816
2503,-1.2867
2504,-1.2918
2505,-1.2968
2506,-1.3019
2507,-1.3069
2508,-1.3119
2509,-1.3185
2510,-1.3242
2511,-1.3273
2512,-1.3329
2513,-1.3379
2514,-1.3430000000000002
2515,-1.348
2516,-1.3530000000000002
2517,-1.358
2518,-1.3631
2519,-1.3681
2520,-1.3731
2521,-1.3796
2522,-1.3846
2523,-1.3896
2524,-1.3971
2525,-1.402
2526,-1.4069999999999998
2527,-1.4119
2528,-1.4168
2529,-1.4218
2530,-1.4267
2531,-1.4316
2532,-1.4365
2533,-1.4413
2534,-1.4462
2535,-1.4511
2536,-1.4584
2537,-1.4632
2538,-1.4680000000000002
2539,-1.4722
2540,-1.4756
2541,-1.4814
2542,-1.4872
2543,-1.4921
2544,-1.4969
2545,-1.5017
2546,-1.5066
2547,-1.5114
2548,-1.5186
2549,-1.5234
2550,-1.5281
2551,-1.5329
2552,-1.5377
2553,-1.5424
2554,-1.5489
2555,-1.5536
2556,-1.5584
2557,-1.5631
2558,-1.5677
2559,-1.5724
2560,-1.5794
2561,-1.5841
2562,-1.5887
2563,-1.5933
2564,-1.5956
2565,-1.6016
2566,-1.6053
2567,-1.6113
2568,-1.6178
2569,-1.6224
2570,-1.6269999999999998
2571,-1.6316
2572,-1.6385
2573,-1.6431
2574,-1.6476
2575,-1.6522
2576,-1.6586
2577,-1.6631
2578,-1.6676
2579,-1.6721
2580,-1.6766
2581,-1.681
2582,-1.6855
2583,-1.6899
2584,-1.6965
2585,-1.7009
2586,-1.7069999999999999
2587,-1.7132
2588,-1.7172
2589,-1.7235
2590,-1.7279
2591,-1.7323
2592,-1.7367
2593,-1.7409999999999999
2594,-1.7453
2595,-1.7496
2596,-1.756
2597,-1.7603
2598,-1.7645
2599,-1.7687
2600,-1.7729
2601,-1.7771
2602,-1.7833
2603,-1.7875
2604,-1.7916
2605,-1.7957
2606,-1.7998
2607,-1.8038
2608,-1.8098
2609,-1.8138
2610,-1.8178
2611,-1.8217
2612,-1.8257
2613,-1.8295
2614,-1.8334
2615,-1.8373
2616,-1.8411
2617,-1.8449
2618,-1.8486
2619,-1.8523
2620,-1.8579
2621,-1.8616
2622,-1.8652
2623,-1.8688
2624,-1.8724
2625,-1.8759
2626,-1.8794
2627,-1.8829
2628,-1.8864
2629,-1.8898
2630,-1.8932
2631,-1.8965
2632,-1.9015
2633,-1.9048
2634,-1.9080000000000001
2635,-1.9112
2636,-1.9144
2637,-1.9175
2638,-1.9206
2639,-1.9211
2640,-1.9241
2641,-1.9297
2642,-1.93
2643,-1.9329
2644,-1.9372
2645,-1.94
2646,-1.9428
2647,-1.9455
2648,-1.9482
2649,-1.9508
2650,-1.9534
2651,-1.9559
2652,-1.9584
2653,-1.9609
2654,-1.9633
2655,-1.9657
2656,-1.9691
2657,-1.9714
2658,-1.9736
2659,-1.9757
2660,-1.9779
2661,-1.9799
2662,-1.9819
2663,-1.9839
2664,-1.9858
2665,-1.9877
2666,-1.9895
2667,-1.9913
2668,-1.9938
2669,-1.9955
2670,-1.9971
2671,-1.9986
2672,-2.0029
2673,-2.0015
2674,-2.0029
2675,-2.0042
2676,-2.0054
2677,-2.0066
2678,-2.0078
2679,-2.0089
2680,-2.0104
2681,-2.0114
2682,-2.0123
2683,-2.0131
2684,-2.0139
2685,-2.0147
2686,-2.0153
2687,-2.0159
2688,-2.0165
2689,-2.017
2690,-2.0174
2691,-2.0178
2692,-2.0183
2693,-2.0185
2694,-2.0187
2695,-2.0188
2696,-2.0189
2697,-2.0189
2698,-2.0189
2699,-2.0189
2700,-2.0189
2701,-2.0189
2702,-2.0189
2703,-2.0189
2704,-2.0189
2705,-2.0189
2706,-2.0218
2707,-2.0218
2708,-2.0218
