time,value
0,-1.0458
1,-1.3605
2,0.92122
3,0.76386
4,0.76386
5,-1.7539
6,-0.49503
7,0.84254
8,0.84254
9,0.76386
10,-1.3605
11,-0.73107
12,0.84254
13,0.84254
14,-0.022948
15,-1.7539
16,0.13441
17,0.84254
18,0.76386
19,-0.80975
20,-1.4392
21,0.92122
22,0.84254
23,-0.57371
24,-1.7539
25,0.84254
26,0.84254
27,0.76386
28,-0.6523899999999999
29,0.055732000000000004
30,0.76386
31,0.76386
32,-0.96711
33,-1.7539
34,0.84254
35,0.84254
36,-0.41635
37,-1.7539
38,0.52781
39,0.76386
40,0.84254
41,-0.57371
42,-1.7539
43,0.92122
44,0.84254
45,0.68518
46,-1.7539
47,-0.10163
48,0.76386
49,0.76386
50,-0.25899
51,-1.7539
52,0.21309
53,0.84254
54,0.76386
55,-0.41635
56,-1.7539
57,0.52781
58,0.84254
59,0.84254
60,0.29177
61,-1.7539
62,0.055732000000000004
63,0.84254
64,0.76386
65,0.76386
66,-1.7539
67,-0.57371
68,0.84254
69,0.76386
70,0.84254
71,-1.3605
72,-1.2818
73,0.84254
74,0.76386
75,0.76386
76,-0.73107
77,-1.5179
78,0.9999
79,0.76386
80,0.76386
81,-0.41635
82,-1.7539
83,0.68518
84,0.84254
85,0.76386
86,-0.33766999999999997
87,-1.7539
88,0.37045
89,0.76386
90,0.84254
91,0.68518
92,-1.7539
93,-0.6523899999999999
94,0.92122
95,0.76386
