time,value
0,-0.86234
1,-0.75243
2,-0.60518
3,-0.41011000000000003
4,-0.16766
5,0.11002
6,0.39866999999999997
7,0.6763899999999999
8,0.9277
9,1.1406
10,1.307
11,1.4193
12,1.4751
13,1.4803
14,1.4452
15,1.3847
16,1.3112
17,1.2337
18,1.1582
19,1.0862
20,1.0168
21,0.94555
22,0.86539
23,0.77145
24,0.6622600000000001
25,0.5423399999999999
26,0.41838000000000003
27,0.29475
28,0.17509
29,0.060438
30,-0.044295999999999995
31,-0.13439
32,-0.21113
33,-0.27482
34,-0.33321
35,-0.38693
36,-0.43288000000000004
37,-0.47402
38,-0.5048
39,-0.5321199999999999
40,-0.55902
41,-0.58409
42,-0.61126
43,-0.63421
44,-0.65349
45,-0.66911
46,-0.6764
47,-0.67735
48,-0.66691
49,-0.6421
50,-0.60006
51,-0.53254
52,-0.4406
53,-0.32736
54,-0.20215
55,-0.07948200000000001
56,0.032129000000000005
57,0.12289000000000001
58,0.18778
59,0.22546999999999998
60,0.23629
61,0.22644
62,0.20142000000000002
63,0.16626
64,0.12515
65,0.079833
66,0.033461000000000005
67,-0.012797
68,-0.060377
69,-0.11159000000000001
70,-0.16958
71,-0.23324
72,-0.29818
73,-0.35985
74,-0.4148
75,-0.46455
76,-0.51227
77,-0.5605600000000001
78,-0.61069
79,-0.65983
80,-0.7058800000000001
81,-0.7468
82,-0.78137
83,-0.81209
84,-0.83844
85,-0.8617299999999999
86,-0.8828299999999999
87,-0.8992399999999999
88,-0.91254
89,-0.92148
90,-0.92635
91,-0.9304399999999999
92,-0.93227
93,-0.93466
94,-0.93794
95,-0.9396100000000001
96,-0.94257
97,-0.94271
98,-0.93948
99,-0.93789
100,-0.93274
101,-0.9285399999999999
102,-0.9241299999999999
103,-0.9148299999999999
104,-0.90875
105,-0.90048
106,-0.89264
107,-0.8870899999999999
108,-0.8770100000000001
109,-0.86916
110,-0.8586299999999999
111,-0.8456100000000001
112,-0.83321
113,-0.81398
114,-0.78686
115,-0.74311
116,-0.67028
117,-0.55553
118,-0.37546
119,-0.11110999999999999
120,0.24791999999999997
121,0.69391
122,1.1922
123,1.6966
124,2.1579
125,2.5395
126,2.824
127,3.0053
128,3.0903
129,3.0943
130,3.04
131,2.9569
132,2.8656
133,2.7735
134,2.6712
135,2.5398
136,2.3668
137,2.1503
138,1.9018
139,1.6393
140,1.3786
141,1.1328
142,0.90969
143,0.7149300000000001
144,0.5514
145,0.41596000000000005
146,0.30445
147,0.20881999999999998
148,0.12668
149,0.058588999999999995
150,0.00072818
151,-0.044747
152,-0.087354
153,-0.1316
154,-0.17569
155,-0.22569
156,-0.27504
157,-0.32645
158,-0.38245999999999997
159,-0.43443000000000004
160,-0.4852
161,-0.52859
162,-0.56358
163,-0.5985199999999999
164,-0.62567
165,-0.64925
166,-0.66919
167,-0.68111
168,-0.69293
169,-0.7008
170,-0.70614
171,-0.7141
172,-0.7198
173,-0.7276699999999999
174,-0.73558
175,-0.7408399999999999
176,-0.74879
177,-0.75445
178,-0.75869
179,-0.7589899999999999
180,-0.74897
181,-0.7310300000000001
182,-0.69735
183,-0.6402800000000001
184,-0.5476300000000001
185,-0.40339
186,-0.20788
187,0.030132
188,0.29225
189,0.55815
190,0.81902
191,1.0637
192,1.2809
193,1.4594
194,1.5876
195,1.6671
196,1.7024
197,1.6998
198,1.6677
199,1.6129
200,1.5462
201,1.472
202,1.3868
203,1.286
204,1.1701
205,1.0528
206,0.9515899999999999
207,0.87616
208,0.8245399999999999
209,0.7865300000000001
210,0.7559600000000001
211,0.73246
212,0.7166899999999999
213,0.70607
214,0.69007
215,0.66079
216,0.6140800000000001
217,0.54925
218,0.47431999999999996
219,0.38885
220,0.29451
221,0.19102
222,0.074246
223,-0.047718
224,-0.17112
225,-0.28788
226,-0.38934
227,-0.47776
228,-0.5511699999999999
229,-0.61373
230,-0.66842
231,-0.71122
232,-0.7448899999999999
233,-0.76825
234,-0.78365
235,-0.79651
236,-0.8045
237,-0.81042
238,-0.8135
239,-0.81419
240,-0.81717
241,-0.82096
242,-0.8275100000000001
243,-0.83545
244,-0.8419399999999999
245,-0.8487600000000001
246,-0.85406
247,-0.8593299999999999
248,-0.8657
249,-0.8710200000000001
250,-0.87571
251,-0.8774799999999999
252,-0.8756700000000001
253,-0.8718299999999999
254,-0.866
255,-0.8597100000000001
256,-0.85285
257,-0.8458700000000001
258,-0.84157
259,-0.8426100000000001
260,-0.85072
261,-0.86424
262,-0.8801399999999999
263,-0.8983899999999999
264,-0.9213600000000001
265,-0.95096
266,-0.98344
267,-1.0097
268,-1.0227
269,-1.0227
