time,value
0,-0.28624
1,-0.28624
2,-0.28624
3,-0.28624
4,-0.28624
5,-0.28624
6,-0.28624
7,-0.28624
8,-0.28624
9,-0.28624
10,-0.28624
11,-0.28624
12,-0.28624
13,-0.28624
14,-0.28624
15,-0.28624
16,-0.28624
17,-0.28624
18,-0.28624
19,-0.28624
20,-0.28624
21,-0.28624
22,-0.28624
23,-0.28624
24,-0.28624
25,-0.28624
26,-0.28624
27,-0.28624
28,-0.28624
29,-0.28624
30,-0.28624
31,-0.28624
32,-0.28624
33,-0.28624
34,-0.28624
35,-0.28624
36,-0.28624
37,-0.28624
38,-0.28624
39,-0.28624
40,-0.28624
41,-0.28624
42,-0.28624
43,-0.28624
44,-0.28624
45,-0.28624
46,-0.28624
47,-0.28624
48,-0.28624
49,-0.28624
50,-0.28624
51,-0.28624
52,-0.28624
53,-0.28624
54,-0.28624
55,-0.28624
56,-0.28624
57,-0.28624
58,-0.28624
59,-0.28624
60,-0.28624
61,-0.28624
62,-0.28624
63,-0.28624
64,-0.28624
65,-0.28624
66,-0.28624
67,-0.28624
68,4.1698
69,4.5411
70,4.5411
71,3.7984
72,3.0558
73,1.9418
74,0.8277700000000001
75,0.8277700000000001
76,0.45643
77,0.45643
78,-0.28624
79,-0.28624
80,-0.28624
81,-0.28624
82,-0.28624
83,-0.28624
84,-0.28624
85,-0.28624
86,-0.28624
87,-0.28624
88,-0.28624
89,-0.28624
90,-0.28624
91,-0.28624
92,-0.28624
93,-0.28624
94,-0.28624
95,-0.28624
