time,value
0,-0.31485
1,-0.31485
2,-0.31485
3,-0.31485
4,-0.31485
5,-0.31485
6,-0.31485
7,-0.31485
8,-0.31485
9,-0.31485
10,-0.31485
11,-0.31485
12,0.35189000000000004
13,-0.31485
14,-0.31485
15,-0.31485
16,-0.31485
17,-0.31485
18,-0.31485
19,-0.31485
20,0.35189000000000004
21,-0.31485
22,-0.31485
23,-0.31485
24,-0.31485
25,-0.31485
26,-0.31485
27,-0.31485
28,-0.31485
29,-0.31485
30,-0.31485
31,-0.31485
32,-0.31485
33,-0.31485
34,-0.31485
35,-0.31485
36,-0.31485
37,-0.31485
38,-0.31485
39,-0.31485
40,0.35189000000000004
41,-0.31485
42,-0.31485
43,-0.31485
44,-0.31485
45,-0.31485
46,-0.31485
47,-0.31485
48,-0.31485
49,-0.31485
50,-0.31485
51,-0.31485
52,-0.31485
53,-0.31485
54,-0.31485
55,-0.31485
56,0.35189000000000004
57,-0.31485
58,-0.31485
59,-0.31485
60,-0.31485
61,-0.31485
62,-0.31485
63,-0.31485
64,-0.31485
65,-0.31485
66,-0.31485
67,-0.31485
68,-0.31485
69,-0.31485
70,-0.31485
71,-0.31485
72,-0.31485
73,-0.31485
74,-0.31485
75,-0.31485
76,-0.31485
77,-0.31485
78,-0.31485
79,-0.31485
80,-0.31485
81,-0.31485
82,-0.31485
83,-0.31485
84,1.0186
85,3.6856
86,3.6856
87,3.6856
88,3.6856
89,3.6856
90,3.6856
91,1.9076
92,-0.31485
93,-0.31485
94,-0.31485
95,-0.31485
