time,value
0,-0.72436
1,-0.6247199999999999
2,-0.52284
3,-0.42348
4,-0.33455999999999997
5,-0.2698
6,-0.22508000000000003
7,-0.19205999999999998
8,-0.16117
9,-0.13652
10,-0.11222
11,-0.092142
12,-0.070721
13,-0.057762
14,-0.046117
15,-0.040045
16,-0.031418
17,-0.027522
18,-0.024878
19,-0.02729
20,-0.022761
21,-0.0047835
22,0.03978
23,0.1123
24,0.21789
25,0.36194
26,0.56915
27,0.86774
28,1.2692
29,1.7338
30,2.1802
31,2.5185
32,2.695
33,2.7039999999999997
34,2.5822
35,2.3868
36,2.1736
37,1.9778
38,1.8042
39,1.6357
40,1.4584
41,1.2715
42,1.0901
43,0.92776
44,0.78909
45,0.6699
46,0.5652
47,0.47594
48,0.40081999999999995
49,0.34191
50,0.29512
51,0.26818000000000003
52,0.26273
53,0.31645
54,0.49168
55,0.8728600000000001
56,1.4580000000000002
57,2.1437
58,2.7548
59,3.1812
60,3.4031
61,3.4831
62,3.4779
63,3.4286
64,3.333
65,3.1851
66,2.9747
67,2.718
68,2.4279
69,2.12
70,1.7953
71,1.4636
72,1.1349
73,0.83668
74,0.60112
75,0.45883999999999997
76,0.40576
77,0.40781
78,0.41818
79,0.41508
80,0.39611
81,0.37322
82,0.34494
83,0.30796999999999997
84,0.25358
85,0.18268
86,0.097623
87,0.0066598
88,-0.085038
89,-0.174
90,-0.26269000000000003
91,-0.35067
92,-0.43162
93,-0.49654
94,-0.5446300000000001
95,-0.58239
96,-0.6137199999999999
97,-0.63715
98,-0.65156
99,-0.66376
100,-0.67847
101,-0.6942699999999999
102,-0.70172
103,-0.6971
104,-0.68188
105,-0.6626
106,-0.64054
107,-0.61833
108,-0.59945
109,-0.5901
110,-0.5897399999999999
111,-0.59623
112,-0.60811
113,-0.62717
114,-0.6508
115,-0.67465
116,-0.69543
117,-0.7128899999999999
118,-0.7247600000000001
119,-0.73
120,-0.7309399999999999
121,-0.73218
122,-0.73336
123,-0.73135
124,-0.72487
125,-0.7175600000000001
126,-0.71223
127,-0.70911
128,-0.7054699999999999
129,-0.70085
130,-0.6956899999999999
131,-0.6924
132,-0.6916
133,-0.6947800000000001
134,-0.70192
135,-0.71313
136,-0.72605
137,-0.74019
138,-0.7548199999999999
139,-0.77155
140,-0.78725
141,-0.8013899999999999
142,-0.81084
143,-0.8192200000000001
144,-0.82581
145,-0.83375
146,-0.8390299999999999
147,-0.8418899999999999
148,-0.83806
149,-0.83193
150,-0.8243
151,-0.8201299999999999
152,-0.8157300000000001
153,-0.80898
154,-0.78835
155,-0.74164
156,-0.65209
157,-0.5172
158,-0.34651
159,-0.16489
160,0.003815
161,0.13853
162,0.23619
163,0.30538000000000004
164,0.36285
165,0.4128
166,0.45401
167,0.48203
168,0.49751000000000006
169,0.4951
170,0.47301000000000004
171,0.43668
172,0.39896
173,0.36251
174,0.32318
175,0.28101
176,0.24836999999999998
177,0.23819
178,0.25511
179,0.29553
180,0.34713
181,0.39528
182,0.42656000000000005
183,0.44147
184,0.44151999999999997
185,0.42793000000000003
186,0.39484
187,0.3469
188,0.28936
189,0.23096999999999998
190,0.17019
191,0.10930999999999999
192,0.044561
193,-0.023561000000000002
194,-0.098437
195,-0.17228
196,-0.23823000000000003
197,-0.28686999999999996
198,-0.32155
199,-0.34748
200,-0.37709000000000004
201,-0.41336000000000006
202,-0.45671999999999996
203,-0.49709
204,-0.53277
205,-0.56184
206,-0.58833
207,-0.6089399999999999
208,-0.62561
209,-0.63873
210,-0.6512
211,-0.66003
212,-0.66684
213,-0.67369
214,-0.68209
215,-0.68718
216,-0.68797
217,-0.68853
218,-0.69399
219,-0.70308
220,-0.71307
221,-0.7239800000000001
222,-0.73777
223,-0.7541100000000001
224,-0.77152
225,-0.78887
226,-0.80492
227,-0.81796
228,-0.82758
229,-0.83499
230,-0.8408200000000001
231,-0.8452299999999999
232,-0.8493200000000001
233,-0.8538600000000001
234,-0.85806
235,-0.8598100000000001
236,-0.86044
237,-0.86145
238,-0.8630200000000001
239,-0.86218
240,-0.8591799999999999
241,-0.8564799999999999
242,-0.85613
243,-0.8560399999999999
244,-0.85426
245,-0.8514200000000001
246,-0.8487899999999999
247,-0.84077
248,-0.81423
249,-0.75698
250,-0.6684
251,-0.56004
252,-0.44781000000000004
253,-0.34507
254,-0.26095
255,-0.20145
256,-0.17012
257,-0.16799
258,-0.19216
259,-0.23454
260,-0.28421
261,-0.33391
262,-0.38543
263,-0.44688
264,-0.52177
265,-0.6015699999999999
266,-0.6729999999999999
267,-0.73254
268,-0.7860699999999999
269,-0.8333
