time,value
0,-0.33026
1,-0.33026
2,-0.33026
3,-0.33026
4,-0.33026
5,-0.33026
6,-0.33026
7,-0.33026
8,-0.33026
9,-0.33026
10,-0.33026
11,-0.33026
12,-0.33026
13,-0.33026
14,-0.33026
15,-0.33026
16,-0.33026
17,-0.33026
18,-0.33026
19,-0.33026
20,-0.33026
21,-0.33026
22,-0.33026
23,-0.33026
24,-0.33026
25,-0.33026
26,-0.33026
27,-0.33026
28,-0.33026
29,-0.33026
30,-0.33026
31,-0.33026
32,-0.33026
33,-0.33026
34,-0.33026
35,-0.33026
36,-0.33026
37,-0.33026
38,-0.33026
39,-0.33026
40,-0.33026
41,-0.33026
42,-0.33026
43,-0.33026
44,-0.33026
45,-0.33026
46,-0.33026
47,-0.33026
48,-0.33026
49,-0.33026
50,-0.33026
51,1.656
52,1.7463
53,-0.33026
54,-0.33026
55,-0.33026
56,-0.33026
57,-0.33026
58,-0.33026
59,-0.33026
60,-0.33026
61,-0.33026
62,-0.33026
63,-0.33026
64,-0.33026
65,-0.33026
66,-0.33026
67,-0.33026
68,-0.33026
69,-0.33026
70,-0.33026
71,-0.33026
72,-0.33026
73,-0.33026
74,5.2674
75,2.4234
76,2.303
77,2.4084
78,1.656
79,3.7777
80,3.2661
81,2.5739
82,0.9638100000000001
83,-0.30016
84,-0.33026
85,-0.33026
86,-0.33026
87,-0.33026
88,-0.33026
89,-0.33026
90,-0.33026
91,-0.33026
92,-0.33026
93,-0.33026
94,-0.33026
95,-0.33026
