time,value
0,1.7681
1,1.7398
2,1.7175
3,1.6822
4,1.6409
5,1.5962
6,1.5543
7,1.5069
8,1.4667
9,1.4201
10,1.3726
11,1.327
12,1.2803
13,1.2326
14,1.1909999999999998
15,1.1514
16,1.1103
17,1.0644
18,1.0198
19,0.97531
20,0.93681
21,0.8926200000000001
22,0.8478600000000001
23,0.80394
24,0.76544
25,0.72135
26,0.6781699999999999
27,0.63475
28,0.59243
29,0.5508
30,0.53152
31,0.49566000000000004
32,0.45341000000000004
33,0.41178000000000003
34,0.37041999999999997
35,0.32946
36,0.28869
37,0.24813000000000002
38,0.2078
39,0.16779000000000002
40,0.12797999999999998
41,0.0886
42,0.049319
43,0.010519
44,-0.028444
45,-0.06691699999999999
46,-0.10504000000000001
47,-0.1433
48,-0.18105
49,-0.21928000000000003
50,-0.25676
51,-0.29333000000000004
52,-0.32953000000000005
53,-0.36594
54,-0.40223000000000003
55,-0.43783
56,-0.47242
57,-0.50753
58,-0.54109
59,-0.5755600000000001
60,-0.60854
61,-0.6413399999999999
62,-0.67245
63,-0.70443
64,-0.73433
65,-0.76539
66,-0.7933899999999999
67,-0.82084
68,-0.84914
69,-0.87379
70,-0.90025
71,-0.91815
72,-0.93721
73,-0.9481200000000001
74,-0.9418799999999999
75,-0.94237
76,-0.95165
77,-0.9345399999999999
78,-0.9264899999999999
79,-0.9128799999999999
80,-0.9016799999999999
81,-0.88879
82,-0.87605
83,-0.85813
84,-0.84321
85,-0.83245
86,-0.83288
87,-0.8106300000000001
88,-0.78851
89,-0.77003
90,-0.7538
91,-0.74647
92,-0.73545
93,-0.74205
94,-0.78062
95,-0.8287899999999999
96,-0.8780700000000001
97,-0.91612
98,-0.9515100000000001
99,-0.99174
100,-1.0304
101,-1.0687
102,-1.102
103,-1.139
104,-1.1758
105,-1.2177
106,-1.2521
107,-1.2848
108,-1.3165
109,-1.3297
110,-1.3172
111,-1.3031
112,-1.2875
113,-1.2649
114,-1.2465
115,-1.2269
116,-1.206
117,-1.1840000000000002
118,-1.1609
119,-1.1369
120,-1.1079
121,-1.0859
122,-1.0592
123,-1.0317
124,-1.0034
125,-0.97919
126,-0.94957
127,-0.9193600000000001
128,-0.89304
129,-0.86169
130,-0.83415
131,-0.80602
132,-0.7731899999999999
133,-0.73998
134,-0.7104
135,-0.67643
136,-0.6421399999999999
137,-0.6046600000000001
138,-0.56676
139,-0.52496
140,-0.48023999999999994
141,-0.43764
142,-0.39860999999999996
143,-0.36305
144,-0.32727
145,-0.29946
146,-0.29598
147,-0.29965
148,-0.3114
149,-0.29278000000000004
150,-0.25809
151,-0.2232
152,-0.19099000000000002
153,-0.15566
154,-0.12015
155,-0.084476
156,-0.048639999999999996
157,-0.012651
158,0.021011000000000002
159,0.064583
160,0.10895
161,0.15432
162,0.19701
163,0.2389
164,0.27996
165,0.31819000000000003
166,0.36178
167,0.40676
168,0.45335
169,0.50021
170,0.54655
171,0.58803
172,0.6280399999999999
173,0.6794100000000001
174,0.72763
175,0.7770199999999999
176,0.8235600000000001
177,0.8728799999999999
178,0.9195399999999999
179,0.96534
180,1.0076
181,1.0516
182,1.0983
183,1.145
184,1.1875
185,1.2309999999999999
186,1.2719
187,1.3130000000000002
188,1.3517
189,1.3931
190,1.4319
191,1.4342
192,1.3879
193,1.36
194,1.3394
195,1.3184
196,1.2832
197,1.2619
198,1.2519
199,1.2269
200,1.2055
201,1.1912
202,1.1717
203,1.1581
204,1.145
205,1.1323
206,1.1257
207,1.1061
208,1.0855
209,1.0574
210,1.0354
211,1.0138
212,1.0041
213,1.0064
214,1.0216
215,1.0416
216,1.056
217,1.0617
218,1.0609
219,1.0607
220,1.0731
221,1.0909
222,1.0981
223,1.0999
224,1.1161
225,1.1285
226,1.1320000000000001
227,1.1065
228,1.1387
229,1.1781
230,1.2177
231,1.2087
232,1.1684
233,1.1281
234,1.0878
235,1.0476
236,1.0074
237,0.9672700000000001
238,0.92715
239,0.8871899999999999
240,0.8471799999999999
241,0.80712
242,0.7674
243,0.72795
244,0.68833
245,0.64866
246,0.60931
247,0.57004
248,0.5310600000000001
249,0.49183999999999994
250,0.45314
251,0.41426
252,0.37535
253,0.33653
254,0.29782
255,0.25913
256,0.21995
257,0.18074
258,0.14187
259,0.10418
260,0.065197
261,0.027997
262,-0.009634700000000001
263,-0.04677
264,-0.083641
265,-0.1209
266,-0.16035
267,-0.19989
268,-0.24058000000000002
269,-0.28053
270,-0.32039
271,-0.33589
272,-0.34948
273,-0.36641
274,-0.38602
275,-0.39139
276,-0.39002
277,-0.38776
278,-0.39642
279,-0.41013
280,-0.43165
281,-0.44848999999999994
282,-0.46375
283,-0.4798
284,-0.49936
285,-0.5183
286,-0.5303399999999999
287,-0.55392
288,-0.57533
289,-0.57877
290,-0.57108
291,-0.57047
292,-0.57431
293,-0.59032
294,-0.6271800000000001
295,-0.66199
296,-0.70027
297,-0.73933
298,-0.7804300000000001
299,-0.8224100000000001
300,-0.86439
301,-0.9083200000000001
302,-0.95224
303,-0.99616
304,-1.0381
305,-1.0783
306,-1.1222
307,-1.1673
308,-1.2117
309,-1.2572
310,-1.3045
311,-1.3479
312,-1.3833
313,-1.4143
314,-1.4416
315,-1.4691
316,-1.4975
317,-1.5273
318,-1.5527
319,-1.5762
320,-1.5938
321,-1.6166
322,-1.633
323,-1.6468
324,-1.6543
325,-1.6653
326,-1.675
327,-1.6764
328,-1.6435
329,-1.5994
330,-1.5576
331,-1.52
332,-1.4801
333,-1.4421
334,-1.4057
335,-1.3672
336,-1.3286
337,-1.2898
338,-1.2524
339,-1.2375
340,-1.2175
341,-1.178
342,-1.1434
343,-1.1488
344,-1.1595
345,-1.1846
346,-1.2035
347,-1.2244
348,-1.2423
349,-1.262
350,-1.2737
351,-1.2438
352,-1.2295
353,-1.2196
354,-1.2159
355,-1.2286
356,-1.2414
357,-1.2611
358,-1.2899
359,-1.319
360,-1.3327
361,-1.2921
362,-1.2509
363,-1.2096
364,-1.1754
365,-1.1396
366,-1.1061
367,-1.077
368,-1.0332
369,-0.98906
370,-0.95211
371,-0.92032
372,-0.8872399999999999
373,-0.8469700000000001
374,-0.80995
375,-0.77664
376,-0.73307
377,-0.69202
378,-0.65083
379,-0.61321
380,-0.57575
381,-0.53791
382,-0.4999
383,-0.46173000000000003
384,-0.42728999999999995
385,-0.38813000000000003
386,-0.34171
387,-0.30401999999999996
388,-0.25944
389,-0.23034000000000002
390,-0.20569
391,-0.16918
392,-0.1237
393,-0.08254600000000001
394,-0.042473000000000004
395,-0.0051807
396,0.037709
397,0.07496
398,0.11532
399,0.15705
400,0.19622
401,0.23674
402,0.27731999999999996
403,0.3201
404,0.36164
405,0.40233
406,0.44059
407,0.48383000000000004
408,0.52761
409,0.56843
410,0.60636
411,0.64146
412,0.6767
413,0.71472
414,0.75316
415,0.7914899999999999
416,0.82988
417,0.8656
418,0.90143
419,0.9373600000000001
420,0.97605
421,1.0122
422,1.0484
423,1.0847
424,1.1236
425,1.1626
426,1.2016
427,1.2357
428,1.2724
429,1.3091
430,1.3459999999999999
431,1.3805
432,1.4152
433,1.4523
434,1.4872
435,1.5243
436,1.5573
437,1.5932
438,1.63
439,1.6654
440,1.6967
441,1.7324
442,1.7625
443,1.7928
444,1.7872
445,1.7546
446,1.7126
447,1.6744
448,1.6329
449,1.5962
450,1.5601
451,1.5201
452,1.482
453,1.4884
454,1.5227
455,1.558
456,1.5935
457,1.63
458,1.6702
459,1.7086
460,1.7469999999999999
461,1.7682
462,1.7653
