time,value
0,-0.20669
1,-0.20669
2,-0.20669
3,-0.20669
4,-0.20669
5,-0.20669
6,-0.20669
7,-0.20669
8,-0.20669
9,-0.20669
10,-0.20669
11,-0.20669
12,-0.20669
13,-0.20669
14,-0.20669
15,-0.20669
16,-0.20669
17,-0.20669
18,-0.20669
19,-0.20669
20,-0.20669
21,-0.20669
22,-0.20669
23,-0.20669
24,-0.20669
25,-0.20669
26,-0.20669
27,-0.20669
28,-0.20669
29,-0.20669
30,-0.20669
31,-0.20669
32,-0.20669
33,-0.20669
34,-0.20669
35,-0.20669
36,-0.20669
37,-0.20669
38,-0.20669
39,-0.20669
40,-0.20669
41,-0.20669
42,-0.20669
43,-0.20669
44,-0.20669
45,-0.20669
46,-0.20669
47,-0.20669
48,-0.20669
49,-0.20669
50,-0.20669
51,-0.20669
52,-0.20669
53,-0.20669
54,-0.20669
55,-0.20669
56,-0.20669
57,-0.20669
58,-0.20669
59,-0.20669
60,-0.20669
61,-0.20669
62,-0.20669
63,-0.20669
64,-0.20669
65,-0.20669
66,-0.20669
67,-0.20669
68,-0.20669
69,-0.20669
70,-0.20669
71,-0.20669
72,-0.20669
73,-0.20669
74,-0.20669
75,-0.20669
76,-0.20669
77,-0.20669
78,-0.20669
79,4.0733
80,5.2661
81,5.2379999999999995
82,4.396
83,-0.16459000000000001
84,-0.20669
85,-0.20669
86,-0.20669
87,-0.20669
88,-0.20669
89,-0.20669
90,-0.20669
91,-0.20669
92,-0.20669
93,-0.20669
94,-0.20669
95,-0.20669
