time,value
0,-0.7613300000000001
1,-0.7613300000000001
2,-0.7613300000000001
3,1.162
4,1.4826
5,1.3223
6,0.36063
7,-0.7613300000000001
8,-0.7613300000000001
9,-0.7613300000000001
10,-0.7613300000000001
11,-0.7613300000000001
12,1.4826
13,1.6429
14,1.3223
15,-0.7613300000000001
16,-0.7613300000000001
17,-0.7613300000000001
18,-0.7613300000000001
19,-0.7613300000000001
20,-0.28049
21,1.8031
22,1.4826
23,0.52091
24,-0.7613300000000001
25,-0.7613300000000001
26,-0.7613300000000001
27,-0.7613300000000001
28,-0.7613300000000001
29,0.68119
30,1.6429
31,1.3223
32,-0.7613300000000001
33,-0.7613300000000001
34,-0.7613300000000001
35,-0.7613300000000001
36,-0.7613300000000001
37,-0.28049
38,1.8031
39,1.3223
40,0.20035
41,-0.7613300000000001
42,-0.7613300000000001
43,-0.7613300000000001
44,-0.7613300000000001
45,-0.7613300000000001
46,1.0017
47,1.6429
48,1.162
49,-0.7613300000000001
50,-0.7613300000000001
51,-0.7613300000000001
52,-0.7613300000000001
53,-0.7613300000000001
54,0.04007
55,1.8031
56,1.3223
57,0.36063
58,-0.7613300000000001
59,-0.7613300000000001
60,-0.7613300000000001
61,-0.7613300000000001
62,-0.7613300000000001
63,1.4826
64,1.4826
65,1.4826
66,-0.7613300000000001
67,-0.7613300000000001
68,-0.7613300000000001
69,-0.7613300000000001
70,-0.7613300000000001
71,0.04007
72,1.8031
73,1.4826
74,1.3223
75,-0.44077
76,-0.7613300000000001
77,-0.7613300000000001
78,-0.7613300000000001
79,-0.7613300000000001
80,0.20035
81,1.6429
82,1.4826
83,0.36063
84,-0.7613300000000001
85,-0.7613300000000001
86,-0.7613300000000001
87,-0.7613300000000001
88,-0.7613300000000001
89,1.0017
90,1.4826
91,1.4826
92,-0.7613300000000001
93,-0.7613300000000001
94,-0.7613300000000001
95,-0.7613300000000001
