time,value
0,-0.20138
1,-0.20138
2,-0.20138
3,-0.20138
4,-0.20138
5,-0.20138
6,-0.20138
7,-0.20138
8,-0.20138
9,-0.20138
10,-0.20138
11,-0.20138
12,-0.20138
13,-0.20138
14,-0.20138
15,-0.20138
16,-0.20138
17,-0.20138
18,-0.20138
19,-0.20138
20,-0.20138
21,-0.20138
22,-0.20138
23,-0.20138
24,-0.20138
25,-0.20138
26,-0.20138
27,-0.20138
28,-0.20138
29,-0.20138
30,-0.20138
31,-0.20138
32,-0.20138
33,-0.20138
34,-0.20138
35,-0.20138
36,-0.20138
37,-0.20138
38,-0.20138
39,-0.20138
40,4.3568
41,-0.20138
42,-0.20138
43,-0.20138
44,-0.20138
45,-0.20138
46,-0.20138
47,-0.20138
48,-0.20138
49,-0.20138
50,-0.20138
51,-0.20138
52,-0.20138
53,-0.20138
54,-0.20138
55,-0.20138
56,3.4137
57,-0.20138
58,-0.20138
59,-0.20138
60,-0.20138
61,-0.20138
62,-0.20138
63,-0.20138
64,-0.20138
65,-0.20138
66,-0.20138
67,-0.20138
68,-0.20138
69,-0.20138
70,-0.20138
71,4.1996
72,6.5573
73,-0.20138
74,-0.20138
75,-0.20138
76,-0.20138
77,-0.20138
78,-0.20138
79,-0.20138
80,-0.20138
81,-0.20138
82,-0.20138
83,-0.20138
84,-0.20138
85,-0.20138
86,-0.20138
87,-0.20138
88,-0.20138
89,-0.20138
90,-0.20138
91,-0.20138
92,-0.20138
93,-0.20138
94,-0.20138
95,-0.20138
