[<text>
<title>acs enterprises inc &lt;acse&gt; 4th qtr loss</title>
<dateline>    bensalem, pa., march 13 -
    </dateline>shr loss two cts vs profit three cts
    net loss 80,333 vs profit 67,967
    revs 1,162,678 vs 1,009,731
    avg shrs 3,317,104 vs 2,494.049
    year
    shr loss 21 cts vs profit four cts
    net loss 679,520 vs profit 96,724
    revs 4,191,540 vs 4,702,999
    avg shrs 3,242,641 vs 2,525,677
    notes: revenues exclude hospital television rental business
sold dec 29, 1986
    1986 losses in both periods include gain of 530,000 dlrs on
sale of discontinued business
 reuter
</text>]