time,value
0,-0.45591000000000004
1,-0.45591000000000004
2,-0.45591000000000004
3,-0.18904
4,-0.45591000000000004
5,-0.45591000000000004
6,-0.45591000000000004
7,-0.45591000000000004
8,-0.45591000000000004
9,-0.45591000000000004
10,-0.45591000000000004
11,-0.45591000000000004
12,-0.45591000000000004
13,-0.45591000000000004
14,-0.45591000000000004
15,-0.45591000000000004
16,-0.45591000000000004
17,-0.45591000000000004
18,-0.45591000000000004
19,-0.45591000000000004
20,-0.45591000000000004
21,-0.45591000000000004
22,-0.45591000000000004
23,-0.45591000000000004
24,-0.45591000000000004
25,-0.45591000000000004
26,-0.45591000000000004
27,-0.45591000000000004
28,-0.45591000000000004
29,-0.45591000000000004
30,-0.45591000000000004
31,-0.45591000000000004
32,-0.45591000000000004
33,-0.45591000000000004
34,-0.45591000000000004
35,-0.45591000000000004
36,-0.45591000000000004
37,-0.45591000000000004
38,-0.45591000000000004
39,-0.45591000000000004
40,-0.45591000000000004
41,-0.45591000000000004
42,-0.45591000000000004
43,-0.45591000000000004
44,-0.45591000000000004
45,-0.45591000000000004
46,-0.45591000000000004
47,-0.45591000000000004
48,-0.45591000000000004
49,-0.45591000000000004
50,-0.45591000000000004
51,-0.45591000000000004
52,-0.45591000000000004
53,-0.45591000000000004
54,-0.45591000000000004
55,-0.45591000000000004
56,-0.45591000000000004
57,-0.45591000000000004
58,-0.45591000000000004
59,-0.45591000000000004
60,-0.45591000000000004
61,-0.45591000000000004
62,-0.45591000000000004
63,-0.45591000000000004
64,0.8784700000000001
65,2.7466
66,2.7466
67,2.7466
68,2.4797
69,2.4797
70,2.2129
71,1.6791
72,0.34471999999999997
73,2.4797
74,2.4797
75,1.1453
76,-0.18904
77,-0.45591000000000004
78,-0.45591000000000004
79,-0.45591000000000004
80,-0.18904
81,-0.45591000000000004
82,-0.45591000000000004
83,-0.45591000000000004
84,2.4797
85,1.946
86,2.2129
87,2.4797
88,1.1453
89,-0.45591000000000004
90,-0.18904
91,-0.45591000000000004
92,-0.45591000000000004
93,-0.45591000000000004
94,-0.18904
95,-0.45591000000000004
