time,value
0,-0.26636
1,-0.26636
2,-0.26636
3,-0.26636
4,-0.26636
5,-0.26636
6,-0.26636
7,-0.26636
8,-0.26636
9,-0.26636
10,-0.26636
11,-0.26636
12,-0.26636
13,-0.26636
14,-0.26636
15,-0.26636
16,-0.26636
17,-0.26636
18,-0.26636
19,-0.26636
20,-0.26636
21,-0.26636
22,-0.26636
23,-0.26636
24,-0.26636
25,-0.26636
26,-0.26636
27,-0.26636
28,-0.26636
29,-0.26636
30,-0.26636
31,-0.26636
32,-0.26636
33,-0.26636
34,-0.26636
35,-0.26636
36,-0.26636
37,-0.26636
38,-0.26636
39,-0.26636
40,-0.26636
41,-0.26636
42,-0.26636
43,-0.26636
44,-0.26636
45,-0.26636
46,-0.26636
47,-0.26636
48,-0.26636
49,-0.26636
50,-0.26636
51,-0.26636
52,-0.26636
53,-0.26636
54,-0.26636
55,-0.26636
56,-0.26636
57,-0.26636
58,-0.26636
59,-0.26636
60,-0.26636
61,-0.26636
62,-0.26636
63,-0.26636
64,-0.26636
65,-0.26636
66,-0.26636
67,-0.26636
68,-0.26636
69,-0.26636
70,-0.26636
71,-0.26636
72,-0.26636
73,-0.26636
74,-0.26636
75,4.2461
76,4.9982
77,4.2461
78,1.9899
79,1.9899
80,3.4939999999999998
81,2.7419
82,-0.26636
83,-0.26636
84,-0.26636
85,-0.26636
86,-0.26636
87,-0.26636
88,-0.26636
89,-0.26636
90,-0.26636
91,-0.26636
92,-0.26636
93,-0.26636
94,-0.26636
95,-0.26636
