time,value
0,-0.13616
1,-0.13616
2,-0.13616
3,-0.13616
4,-0.13616
5,-0.13616
6,-0.13616
7,-0.13616
8,-0.13616
9,-0.13616
10,-0.13616
11,-0.13616
12,-0.13616
13,-0.13616
14,-0.13616
15,-0.13616
16,-0.13616
17,-0.13616
18,-0.13616
19,-0.13616
20,-0.13616
21,-0.13616
22,-0.13616
23,-0.13616
24,-0.13616
25,-0.13616
26,-0.13616
27,-0.13616
28,-0.13616
29,-0.13616
30,-0.13616
31,-0.13616
32,-0.13616
33,-0.13616
34,-0.13616
35,-0.13616
36,-0.13616
37,-0.13616
38,-0.13616
39,-0.13616
40,-0.13616
41,-0.13616
42,-0.13616
43,-0.13616
44,-0.13616
45,-0.13616
46,-0.13616
47,-0.13616
48,-0.13616
49,-0.13616
50,-0.13616
51,-0.13616
52,-0.13616
53,-0.13616
54,-0.13616
55,-0.13616
56,-0.13616
57,-0.13616
58,-0.13616
59,-0.13616
60,-0.13616
61,-0.13616
62,-0.13616
63,-0.13616
64,-0.13616
65,-0.13616
66,-0.13616
67,-0.13616
68,-0.13616
69,-0.13616
70,-0.13616
71,-0.13616
72,-0.13616
73,-0.13616
74,-0.13616
75,-0.13616
76,-0.13616
77,-0.13616
78,-0.13616
79,0.84551
80,9.2802
81,2.5376
82,-0.13616
83,-0.13616
84,-0.13616
85,-0.13616
86,-0.13616
87,-0.13616
88,-0.13616
89,-0.13616
90,-0.13616
91,-0.13616
92,-0.13616
93,-0.13616
94,-0.13616
95,-0.13616
