time,value
0,-0.8552
1,-0.8552
2,1.2724
3,-0.8552
4,-0.8552
5,1.3975
6,-0.8552
7,-0.8552
8,1.2724
9,-0.8552
10,-0.8552
11,0.77176
12,-0.22944
13,-0.8552
14,0.27116
15,0.14601
16,-0.8552
17,-0.10429000000000001
18,0.64661
19,-0.8552
20,-0.8552
21,1.1472
22,-0.8552
23,-0.8552
24,1.3975
25,-0.8552
26,-0.8552
27,1.0221
28,-0.6049
29,-0.8552
30,0.39631
31,0.020859
32,-0.8552
33,-0.35459
34,0.77176
35,-0.8552
36,0.27116
37,0.27116
38,-0.8552
39,1.0221
40,-0.6049
41,-0.8552
42,0.89692
43,-0.47975
44,-0.8552
45,0.64661
46,0.27116
47,-0.8552
48,0.14601
49,1.5227
50,-0.8552
51,1.2724
52,-0.8552
53,1.2724
54,-0.8552
55,0.39631
56,-0.10429000000000001
57,-0.8552
58,1.1472
59,-0.8552
60,0.39631
61,0.020859
62,-0.8552
63,1.1472
64,-0.8552
65,-0.35459
66,0.77176
67,-0.8552
68,0.27116
69,0.020859
70,-0.8552
71,3.2748
72,3.9005
73,-0.10429000000000001
74,-0.8552
75,0.52146
76,1.1472
77,-0.8552
78,-0.8552
79,1.7730000000000001
80,0.020859
81,-0.8552
82,0.020859
83,1.2724
84,-0.8552
85,-0.8552
86,1.7730000000000001
87,-0.8552
88,-0.8552
89,1.1472
90,-0.35459
91,-0.8552
92,1.1472
93,-0.35459
94,-0.8552
95,1.2724
