time,value
0,-0.13794
1,-0.13794
2,-0.13794
3,-0.13794
4,-0.13794
5,-0.13794
6,-0.13794
7,-0.13794
8,-0.13794
9,-0.13794
10,-0.13794
11,-0.13794
12,-0.13794
13,-0.13794
14,-0.13794
15,-0.13794
16,-0.13794
17,-0.13794
18,-0.13794
19,-0.13794
20,-0.13794
21,-0.13794
22,-0.13794
23,-0.13794
24,-0.13794
25,-0.13794
26,-0.13794
27,-0.13794
28,-0.13794
29,-0.13794
30,-0.13794
31,-0.13794
32,-0.13794
33,-0.13794
34,-0.13794
35,-0.13794
36,-0.13794
37,-0.13794
38,-0.13794
39,-0.13794
40,-0.13794
41,-0.13794
42,-0.13794
43,-0.13794
44,-0.13794
45,-0.13794
46,-0.13794
47,-0.13794
48,-0.13794
49,-0.13794
50,-0.13794
51,-0.13794
52,-0.13794
53,-0.13794
54,-0.13794
55,-0.13794
56,8.6221
57,-0.13794
58,-0.13794
59,-0.13794
60,-0.13794
61,-0.13794
62,-0.13794
63,-0.13794
64,-0.13794
65,-0.13794
66,-0.13794
67,-0.13794
68,-0.13794
69,-0.13794
70,-0.13794
71,-0.13794
72,-0.13794
73,-0.13794
74,-0.13794
75,-0.13794
76,-0.13794
77,4.343999999999999
78,-0.13794
79,-0.13794
80,-0.13794
81,-0.13794
82,-0.13794
83,-0.13794
84,-0.13794
85,-0.13794
86,-0.13794
87,-0.13794
88,-0.13794
89,-0.13794
90,-0.13794
91,-0.13794
92,-0.13794
93,-0.13794
94,-0.13794
95,-0.13794
