time,value
0,-0.024972
1,-1.2236
2,-1.2236
3,-1.2236
4,-1.2236
5,-1.2236
6,-1.2236
7,-1.2236
8,-1.2236
9,-1.2236
10,-1.2236
11,-1.2236
12,-1.2236
13,-1.2236
14,-1.2236
15,-1.2236
16,-1.2236
17,-1.2236
18,-1.2236
19,-1.2236
20,-1.2236
21,-1.2236
22,-1.2236
23,-1.2236
24,-1.2236
25,-1.2236
26,-1.2236
27,-1.2236
28,-1.2236
29,-1.2236
30,-1.2236
31,-1.2236
32,-1.2236
33,-1.2236
34,-1.2236
35,-1.2236
36,-1.2236
37,2.3724
38,1.4134
39,0.9339700000000001
40,0.9339700000000001
41,0.69423
42,0.69423
43,0.9339700000000001
44,0.69423
45,0.69423
46,0.9339700000000001
47,0.69423
48,0.69423
49,0.69423
50,0.9339700000000001
51,0.69423
52,0.69423
53,0.69423
54,0.69423
55,0.69423
56,0.9339700000000001
57,0.69423
58,0.69423
59,0.69423
60,0.9339700000000001
61,0.69423
62,0.69423
63,0.69423
64,0.69423
65,0.69423
66,0.9339700000000001
67,0.69423
68,0.69423
69,0.69423
70,0.69423
71,0.69423
72,0.9339700000000001
73,0.69423
74,0.9339700000000001
75,0.9339700000000001
76,0.69423
77,0.69423
78,0.9339700000000001
79,0.69423
80,0.69423
81,0.9339700000000001
82,0.69423
83,0.69423
84,0.69423
85,0.69423
86,0.69423
87,0.69423
88,0.69423
89,0.9339700000000001
90,0.69423
91,0.69423
92,0.69423
93,0.69423
94,-0.024972
95,-1.2236
