time,value
0,0.57452
1,-1.0184
2,-1.0184
3,-0.42103999999999997
4,0.37540999999999997
5,1.2714
6,1.5701
7,0.57452
8,-1.0184
9,-1.0184
10,-1.0184
11,-1.0184
12,-0.32148000000000004
13,0.1763
14,-1.0184
15,-1.0184
16,-0.42103999999999997
17,0.1763
18,0.9727399999999999
19,1.5701
20,0.67408
21,-1.0184
22,-1.0184
23,-1.0184
24,0.076741
25,-0.12237
26,-1.0184
27,-1.0184
28,-1.0184
29,0.8731899999999999
30,-0.022815000000000002
31,1.6696
32,1.5701
33,-0.32148000000000004
34,-1.0184
35,-1.0184
36,-1.0184
37,-0.32148000000000004
38,0.1763
39,-1.0184
40,-1.0184
41,-0.12237
42,0.076741
43,1.7692
44,1.7692
45,1.7692
46,1.8687
47,1.6696
48,0.27585
49,1.4705
50,-0.52059
51,0.37540999999999997
52,0.77363
53,0.77363
54,1.5701
55,-1.0184
56,-0.22193000000000002
57,0.37540999999999997
58,-1.0184
59,-1.0184
60,1.8687
61,0.57452
62,-1.0184
63,-1.0184
64,-0.42103999999999997
65,0.37540999999999997
66,-0.32148000000000004
67,1.7692
68,-0.32148000000000004
69,-1.0184
70,0.9727399999999999
71,-1.0184
72,-1.0184
73,-0.022815000000000002
74,1.6696
75,0.67408
76,-1.0184
77,-1.0184
78,0.67408
79,-0.52059
80,0.47496000000000005
81,1.7692
82,0.37540999999999997
83,-1.0184
84,-1.0184
85,-0.42103999999999997
86,0.37540999999999997
87,-1.0184
88,0.9727399999999999
89,1.4705
90,-1.0184
91,-1.0184
92,0.77363
93,-1.0184
94,-1.0184
95,-0.12237
