{
  "about": {
    "problemID": "LL1_ECG200_problem",
    "problemName": "LL1 ECG200 problem",
    "problemDescription": "A time series classification problem.",
    "problemSchemaVersion": "4.0.0",
    "problemVersion": "4.0.0",
    "taskKeywords": [
      "classification",
      "binary",
      "timeSeries"
    ]
  },
  "inputs": {
    "data": [
      {
        "datasetID": "LL1_ECG200_dataset",
        "targets": [
          {
            "targetIndex": 0,
            "resID": "learningData",
            "colIndex": 2,
            "colName": "label"
          }
        ]
      }
    ],
    "dataSplits": {
      "method": "holdOut",
      "testSize": 0.5,
      "stratified": true,
      "numRepeats": 0,
      "splitsFile": "dataSplits.csv",
      "datasetViewMaps": {
        "train": [
          {
            "from": "LL1_ECG200_dataset",
            "to": "LL1_ECG200_dataset_TRAIN"
          }
        ],
        "test": [
          {
            "from": "LL1_ECG200_dataset",
            "to": "LL1_ECG200_dataset_TEST"
          }
        ],
        "score": [
          {
            "from": "LL1_ECG200_dataset",
            "to": "LL1_ECG200_dataset_SCORE"
          }
        ]
      }
    },
    "performanceMetrics": [
      {
        "metric": "f1",
        "posLabel": "1"
      }
    ]
  },
  "expectedOutputs": {
    "predictionsFile": "predictions.csv"
  }
}