time,value
0,-0.18157
1,-0.18157
2,-0.18157
3,-0.18157
4,-0.18157
5,-0.18157
6,-0.18157
7,-0.18157
8,-0.18157
9,-0.18157
10,-0.18157
11,-0.18157
12,-0.18157
13,-0.18157
14,-0.18157
15,-0.18157
16,-0.18157
17,-0.18157
18,-0.18157
19,-0.18157
20,-0.18157
21,-0.18157
22,-0.18157
23,-0.18157
24,-0.18157
25,-0.18157
26,-0.18157
27,-0.18157
28,-0.18157
29,-0.18157
30,-0.18157
31,-0.18157
32,-0.18157
33,-0.18157
34,-0.18157
35,-0.18157
36,-0.18157
37,-0.18157
38,-0.18157
39,-0.18157
40,-0.18157
41,-0.18157
42,-0.18157
43,-0.18157
44,-0.18157
45,-0.18157
46,-0.18157
47,-0.18157
48,-0.18157
49,-0.18157
50,-0.18157
51,-0.18157
52,-0.18157
53,-0.18157
54,-0.18157
55,-0.18157
56,-0.18157
57,-0.18157
58,-0.18157
59,-0.18157
60,-0.18157
61,-0.18157
62,-0.18157
63,-0.18157
64,-0.18157
65,-0.18157
66,-0.18157
67,-0.18157
68,-0.18157
69,-0.18157
70,-0.18157
71,-0.18157
72,-0.18157
73,-0.18157
74,-0.18157
75,-0.088852
76,4.6794
77,3.633
78,0.043598000000000005
79,0.030352999999999998
80,0.32175
81,7.5403
82,-0.18157
83,-0.18157
84,-0.18157
85,-0.18157
86,-0.18157
87,-0.18157
88,-0.18157
89,-0.18157
90,-0.18157
91,-0.18157
92,-0.18157
93,-0.18157
94,-0.18157
95,-0.18157
