time,value
0,-0.22171999999999997
1,-0.22171999999999997
2,-0.22171999999999997
3,-0.22171999999999997
4,-0.22171999999999997
5,-0.22171999999999997
6,-0.22171999999999997
7,-0.22171999999999997
8,-0.22171999999999997
9,-0.22171999999999997
10,-0.22171999999999997
11,-0.22171999999999997
12,-0.22171999999999997
13,-0.22171999999999997
14,-0.22171999999999997
15,-0.22171999999999997
16,-0.22171999999999997
17,-0.22171999999999997
18,-0.22171999999999997
19,-0.22171999999999997
20,-0.22171999999999997
21,-0.22171999999999997
22,-0.22171999999999997
23,-0.22171999999999997
24,-0.22171999999999997
25,-0.22171999999999997
26,-0.22171999999999997
27,-0.22171999999999997
28,-0.22171999999999997
29,-0.22171999999999997
30,-0.22171999999999997
31,-0.22171999999999997
32,-0.22171999999999997
33,-0.22171999999999997
34,-0.22171999999999997
35,-0.22171999999999997
36,-0.22171999999999997
37,-0.22171999999999997
38,-0.22171999999999997
39,-0.22171999999999997
40,-0.22171999999999997
41,-0.22171999999999997
42,-0.22171999999999997
43,-0.22171999999999997
44,-0.22171999999999997
45,-0.22171999999999997
46,-0.22171999999999997
47,-0.22171999999999997
48,-0.22171999999999997
49,-0.22171999999999997
50,-0.22171999999999997
51,-0.22171999999999997
52,-0.22171999999999997
53,-0.22171999999999997
54,-0.22171999999999997
55,-0.22171999999999997
56,-0.22171999999999997
57,-0.22171999999999997
58,-0.22171999999999997
59,-0.22171999999999997
60,-0.22171999999999997
61,-0.22171999999999997
62,-0.22171999999999997
63,-0.22171999999999997
64,-0.22171999999999997
65,-0.22171999999999997
66,-0.22171999999999997
67,-0.22171999999999997
68,-0.22171999999999997
69,-0.22171999999999997
70,-0.22171999999999997
71,-0.22171999999999997
72,-0.22171999999999997
73,-0.22171999999999997
74,-0.22171999999999997
75,-0.22171999999999997
76,-0.22171999999999997
77,-0.22171999999999997
78,-0.22171999999999997
79,-0.22171999999999997
80,-0.22171999999999997
81,-0.22171999999999997
82,-0.22171999999999997
83,0.39975
84,3.3517
85,5.2162
86,5.0608
87,5.0608
88,0.86585
89,-0.22171999999999997
90,-0.22171999999999997
91,-0.22171999999999997
92,-0.22171999999999997
93,-0.22171999999999997
94,-0.22171999999999997
95,-0.22171999999999997
