time,value
0,-0.085656
1,-0.085656
2,-0.085656
3,-0.085656
4,-0.085656
5,-0.085656
6,-0.085656
7,0.030160000000000003
8,-0.085656
9,-0.085656
10,-0.085656
11,-0.085656
12,-0.085656
13,-0.31729
14,-0.54892
15,-0.54892
16,-0.54892
17,-0.54892
18,-0.4331
19,-0.54892
20,-0.54892
21,-0.54892
22,-0.54892
23,-0.54892
24,-0.54892
25,-0.54892
26,-0.54892
27,-0.54892
28,-0.4331
29,-0.54892
30,-0.54892
31,-0.54892
32,-0.54892
33,-0.54892
34,-0.54892
35,-0.54892
36,-0.54892
37,-0.54892
38,-0.54892
39,-0.54892
40,-0.54892
41,-0.54892
42,-0.54892
43,-0.54892
44,-0.54892
45,-0.54892
46,-0.4331
47,-0.54892
48,-0.54892
49,-0.54892
50,-0.54892
51,-0.54892
52,-0.54892
53,-0.54892
54,-0.54892
55,-0.4331
56,-0.54892
57,-0.54892
58,-0.54892
59,-0.54892
60,-0.54892
61,-0.54892
62,-0.54892
63,-0.54892
64,-0.54892
65,-0.54892
66,-0.54892
67,-0.54892
68,-0.54892
69,-0.31729
70,2.2307
71,2.1148
72,0.72506
73,0.60924
74,2.2307
75,2.2307
76,2.2307
77,2.2307
78,2.2307
79,2.3465
80,2.2307
81,2.2307
82,2.3465
83,2.2307
84,2.2307
85,2.2307
86,2.1148
87,0.8408700000000001
88,-0.54892
89,-0.54892
90,-0.54892
91,-0.54892
92,-0.54892
93,-0.4331
94,-0.54892
95,-0.54892
