time,value
0,-2.2397
1,-2.2397
2,-2.2397
3,-2.2397
4,-2.2397
5,-2.2421
6,-2.2421
7,-2.2421
8,-2.2421
9,-2.2421
10,-2.2419
11,-2.2417
12,-2.2412
13,-2.2407
14,-2.2402
15,-2.2395
16,-2.2385
17,-2.2377
18,-2.2421
19,-2.2489
20,-2.2529
21,-2.2518
22,-2.2506
23,-2.2493
24,-2.248
25,-2.246
26,-2.2444
27,-2.245
28,-2.2433
29,-2.2408
30,-2.2388
31,-2.2345
32,-2.2324
33,-2.2324
34,-2.2271
35,-2.2269
36,-2.2222
37,-2.2197
38,-2.2161
39,-2.2134
40,-2.2106
41,-2.2077
42,-2.2048
43,-2.2007
44,-2.1976
45,-2.1944
46,-2.1911
47,-2.1867
48,-2.1833
49,-2.1821
50,-2.1789
51,-2.1745
52,-2.1677
53,-2.162
54,-2.1588
55,-2.1555
56,-2.1485
57,-2.1485
58,-2.1473
59,-2.1448
60,-2.1397
61,-2.1359
62,-2.1319
63,-2.128
64,-2.1239
65,-2.1185
66,-2.1143
67,-2.1101
68,-2.1059
69,-2.1002
70,-2.0958
71,-2.0914
72,-2.0869999999999997
73,-2.0825
74,-2.0764
75,-2.0718
76,-2.0672
77,-2.0625
78,-2.0562
79,-2.0515
80,-2.0467
81,-2.0418
82,-2.0369
83,-2.0304
84,-2.0254
85,-2.0204
86,-2.0154
87,-2.0069999999999997
88,-2.0019
89,-1.9968
90,-1.9916
91,-1.9864
92,-1.9795
93,-1.9742
94,-1.9689
95,-1.9636
96,-1.9565
97,-1.9511
98,-1.9457
99,-1.9403
100,-1.933
101,-1.9275
102,-1.922
103,-1.9165
104,-1.9109
105,-1.9035
106,-1.8979
107,-1.8922
108,-1.8866
109,-1.879
110,-1.8733
111,-1.8676
112,-1.8619
113,-1.8561
114,-1.8484
115,-1.844
116,-1.8381
117,-1.8323
118,-1.8245
119,-1.8186
120,-1.8127
121,-1.8068
122,-1.8008
123,-1.7916
124,-1.7856
125,-1.7796
126,-1.7736
127,-1.7656
128,-1.7596
129,-1.7535
130,-1.7475
131,-1.7436
132,-1.7365
133,-1.7305
134,-1.7244
135,-1.7184
136,-1.709
137,-1.7029
138,-1.6968
139,-1.6907
140,-1.6817
141,-1.6771
142,-1.6718
143,-1.6657
144,-1.6596
145,-1.6515
146,-1.6441
147,-1.6380000000000001
148,-1.6318
149,-1.6253
150,-1.6216
151,-1.6175
152,-1.6114
153,-1.604
154,-1.5946
155,-1.5884
156,-1.5823
157,-1.5749
158,-1.5707
159,-1.5683
160,-1.5627
161,-1.5582
162,-1.5519999999999998
163,-1.5438
164,-1.5376
165,-1.5314
166,-1.5252
167,-1.5169
168,-1.5107
169,-1.5044
170,-1.4982
171,-1.4898
172,-1.4835
173,-1.4761
174,-1.4698
175,-1.4635
176,-1.4551
177,-1.4488
178,-1.4424
179,-1.4369
180,-1.4283
181,-1.422
182,-1.4157
183,-1.4083
184,-1.4019
185,-1.3975
186,-1.392
187,-1.3857
188,-1.3794
189,-1.3698
190,-1.3635
191,-1.3582
192,-1.3548
193,-1.3493
194,-1.3409
195,-1.3346
196,-1.3272
197,-1.3208
198,-1.3124
199,-1.3061
200,-1.2997
201,-1.2964
202,-1.2909
203,-1.2814
204,-1.274
205,-1.2676
206,-1.2613
207,-1.2548
208,-1.2494
209,-1.2451
210,-1.2387
211,-1.2303
212,-1.2239
213,-1.2176
214,-1.2101
215,-1.2038
216,-1.1963
217,-1.1909
218,-1.1855
219,-1.1792
220,-1.1695
221,-1.1641
222,-1.1597
223,-1.1534
224,-1.1471
225,-1.1386
226,-1.1312
227,-1.1248
228,-1.1184
229,-1.111
230,-1.1056
231,-1.1034
232,-1.0959
233,-1.0896
234,-1.0811
235,-1.0736
236,-1.0673
237,-1.0609
238,-1.0513
239,-1.0459
240,-1.0427
241,-1.0363
242,-1.0299
243,-1.0214
244,-1.014
245,-1.0076
246,-1.0012
247,-0.99264
248,-0.9862299999999999
249,-0.97982
250,-0.9734299999999999
251,-0.96704
252,-0.95957
253,-0.9531700000000001
254,-0.9457
255,-0.93929
256,-0.93076
257,-0.92543
258,-0.92117
259,-0.9147700000000001
260,-0.9051600000000001
261,-0.89875
262,-0.8923399999999999
263,-0.8891399999999999
264,-0.8838299999999999
265,-0.87636
266,-0.8699600000000001
267,-0.86355
268,-0.85608
269,-0.8475299999999999
270,-0.8411
271,-0.83468
272,-0.8283
273,-0.823
274,-0.8166100000000001
275,-0.81019
276,-0.80272
277,-0.7962899999999999
278,-0.78772
279,-0.7824300000000001
280,-0.77927
281,-0.77393
282,-0.76752
283,-0.7589600000000001
284,-0.75253
285,-0.7461
286,-0.73966
287,-0.7300300000000001
288,-0.72359
289,-0.71714
290,-0.71068
291,-0.70207
292,-0.6956100000000001
293,-0.6914
294,-0.68617
295,-0.68195
296,-0.67335
297,-0.66689
298,-0.6604300000000001
299,-0.65396
300,-0.64432
301,-0.63784
302,-0.63137
303,-0.62489
304,-0.6184
305,-0.60974
306,-0.60325
307,-0.59675
308,-0.59024
309,-0.5815600000000001
310,-0.5764199999999999
311,-0.5734199999999999
312,-0.56809
313,-0.5616
314,-0.55193
315,-0.54543
316,-0.53892
317,-0.53377
318,-0.5276
319,-0.5211100000000001
320,-0.51461
321,-0.5071100000000001
322,-0.49843999999999994
323,-0.49193000000000003
324,-0.48541999999999996
325,-0.47891000000000006
326,-0.47376999999999997
327,-0.46646000000000004
328,-0.45896000000000003
329,-0.45245
330,-0.44593999999999995
331,-0.43725
332,-0.43073
333,-0.42421000000000003
334,-0.4167
335,-0.41017
336,-0.40146
337,-0.39493
338,-0.38838
339,-0.38306
340,-0.37699
341,-0.37069
342,-0.36416
343,-0.35762
344,-0.35109
345,-0.34236
346,-0.33582
347,-0.3283
348,-0.32175
349,-0.31301999999999996
350,-0.30646
351,-0.29989
352,-0.29333000000000004
353,-0.28676
354,-0.278
355,-0.27142
356,-0.26484
357,-0.25826
358,-0.24948
359,-0.24289000000000002
360,-0.2363
361,-0.22971
362,-0.22091
363,-0.21594000000000002
364,-0.21095
365,-0.20343
366,-0.19684000000000001
367,-0.18805
368,-0.18053
369,-0.17393
370,-0.16733
371,-0.15761
372,-0.15484
373,-0.14986
374,-0.14327
375,-0.13668
376,-0.12695
377,-0.12035
378,-0.11503
379,-0.11005999999999999
380,-0.10507999999999999
381,-0.098489
382,-0.091895
383,-0.085297
384,-0.077776
385,-0.068976
386,-0.062373000000000005
387,-0.055765999999999996
388,-0.050811
389,-0.048041
390,-0.04052
391,-0.033922
392,-0.027322000000000003
393,-0.020719
394,-0.010993000000000001
395,-0.0043882
396,0.0022218000000000003
397,0.0088348
398,0.017656
399,0.023884
400,0.028827
401,0.032861
402,0.041673
403,0.048283
404,0.055805999999999994
405,0.062421000000000004
406,0.069038
407,0.077865
408,0.084088
409,0.089021
410,0.09525499999999999
411,0.10497999999999999
412,0.10901
413,0.11397
414,0.11800999999999999
415,0.12460999999999998
416,0.13342
417,0.14002
418,0.14755
419,0.15416
420,0.16297999999999999
421,0.16739
422,0.17012
423,0.17507
424,0.18039000000000002
425,0.1892
426,0.19580999999999998
427,0.20334000000000002
428,0.20995
429,0.21269000000000002
430,0.21764
431,0.22296
432,0.22956999999999997
433,0.23838
434,0.24499
435,0.2516
436,0.25822
437,0.26483
438,0.27455999999999997
439,0.28119
440,0.28781
441,0.29443
442,0.30327
443,0.30818
444,0.3131
445,0.31842
446,0.32504
447,0.33387
448,0.3405
449,0.34713
450,0.35465
451,0.3635
452,0.37013
453,0.37677
454,0.38341
455,0.39005
456,0.39891
457,0.4029
458,0.406
459,0.40821
460,0.41707
461,0.42371000000000003
462,0.43036
463,0.43701
464,0.44367
465,0.44588
466,0.4481
467,0.45476000000000005
468,0.46142
469,0.4703
470,0.47696000000000005
471,0.48362
472,0.49028999999999995
473,0.49251000000000006
474,0.49733999999999995
475,0.50265
476,0.50932
477,0.51685
478,0.52574
479,0.53327
480,0.5381
481,0.54206
482,0.55181
483,0.55848
484,0.56514
485,0.57181
486,0.57848
487,0.58824
488,0.59491
489,0.60159
490,0.60826
491,0.61717
492,0.62385
493,0.62916
494,0.63395
495,0.63876
496,0.64766
497,0.65433
498,0.66101
499,0.66769
500,0.6774600000000001
501,0.68414
502,0.69083
503,0.6975100000000001
504,0.7042
505,0.7098300000000001
506,0.71462
507,0.7213
508,0.7279800000000001
509,0.7369
510,0.74358
511,0.75027
512,0.7569600000000001
513,0.76588
514,0.76951
515,0.76699
516,0.76672
517,0.7734300000000001
518,0.7793100000000001
519,0.77683
520,0.77437
521,0.77191
522,0.76867
523,0.7662399999999999
524,0.76383
525,0.76144
526,0.75905
527,0.7500600000000001
528,0.74331
529,0.73577
530,0.72902
531,0.72439
532,0.7197600000000001
533,0.71222
534,0.70468
535,0.70085
536,0.69545
537,0.6886899999999999
538,0.68115
539,0.6743899999999999
540,0.6653899999999999
541,0.65863
542,0.65109
543,0.6443399999999999
544,0.63759
545,0.62858
546,0.6225
547,0.61788
548,0.61405
549,0.6050399999999999
550,0.5975
551,0.59075
552,0.584
553,0.5785899999999999
554,0.57477
555,0.56723
556,0.56047
557,0.55371
558,0.54392
559,0.5371600000000001
560,0.53041
561,0.52366
562,0.5191600000000001
563,0.5191600000000001
564,0.51241
565,0.50566
566,0.49812
567,0.49508
568,0.49203
569,0.48449
570,0.47695
571,0.46715
572,0.46266
573,0.46266
574,0.46186000000000005
575,0.45723
576,0.45408000000000004
577,0.44878999999999997
578,0.44204
579,0.43449
580,0.42549
581,0.41873
582,0.41412
583,0.41176999999999997
584,0.40197
585,0.39443
586,0.38766999999999996
587,0.38090999999999997
588,0.37562
589,0.37024
590,0.36643000000000003
591,0.35966
592,0.3529
593,0.34388
594,0.33634000000000003
595,0.32958000000000004
596,0.32282
597,0.31528
598,0.3099
599,0.30608
600,0.29932
601,0.29255
602,0.28276
603,0.27599
604,0.27296
605,0.26837
606,0.26379
607,0.25476
608,0.248
609,0.24123000000000003
610,0.23446999999999998
611,0.22466999999999998
612,0.21791
613,0.21115
614,0.20439000000000002
615,0.19763
616,0.19302
617,0.18843
618,0.18011
619,0.17334000000000002
620,0.16876
621,0.16419
622,0.1589
623,0.15213
624,0.14232999999999998
625,0.13555999999999999
626,0.12879000000000002
627,0.12724000000000002
628,0.12268
629,0.11663
630,0.10985
631,0.10231
632,0.09553099999999999
633,0.085729
634,0.083432
635,0.07889
636,0.07210599999999999
637,0.065322
638,0.056281
639,0.049504
640,0.041961
641,0.035184
642,0.026152999999999996
643,0.02159
644,0.017041
645,0.009497799999999999
646,0.0027158
647,-0.0070882
648,-0.013868
649,-0.017656
650,-0.022195
651,-0.02823
652,-0.035019
653,-0.041806
654,-0.048589999999999994
655,-0.055372000000000005
656,-0.065176
657,-0.07195599999999999
658,-0.078733
659,-0.085507
660,-0.094539
661,-0.099104
662,-0.10139
663,-0.10668
664,-0.11572
665,-0.12326
666,-0.13004000000000002
667,-0.13682
668,-0.13910999999999998
669,-0.1444
670,-0.15119000000000002
671,-0.15798
672,-0.16552
673,-0.17457
674,-0.18061
675,-0.18513
676,-0.1889
677,-0.19569
678,-0.20324
679,-0.20548000000000002
680,-0.2077
681,-0.21218
682,-0.2151
683,-0.21882
684,-0.22564
685,-0.23246
686,-0.23546
687,-0.23546
688,-0.23761999999999997
689,-0.23976999999999998
690,-0.24189000000000002
691,-0.2447
692,-0.2447
693,-0.2454
694,-0.24748
695,-0.24725999999999998
696,-0.24108000000000002
697,-0.23421999999999998
698,-0.23193000000000003
699,-0.23031999999999997
700,-0.22346
701,-0.21955
702,-0.22021999999999997
703,-0.2163
704,-0.20845
705,-0.20223
706,-0.20059000000000002
707,-0.19829000000000002
708,-0.1937
709,-0.18452000000000002
710,-0.17762999999999998
711,-0.17074
712,-0.16449
713,-0.1553
714,-0.1484
715,-0.1461
716,-0.1438
717,-0.1392
718,-0.13293
719,-0.13355999999999998
720,-0.13189
721,-0.12561
722,-0.11700999999999999
723,-0.11302000000000001
724,-0.11364
725,-0.11133
726,-0.10672000000000001
727,-0.097497
728,-0.090576
729,-0.083656
730,-0.076734
731,-0.067504
732,-0.060578999999999994
733,-0.053652
734,-0.046725
735,-0.038082
736,-0.030558999999999996
737,-0.023625999999999998
738,-0.016694
739,-0.009762200000000002
740,-0.0005162000000000001
741,0.0064208
742,0.013356999999999999
743,0.020294
744,0.029547000000000004
745,0.036487
746,0.043427999999999994
747,0.048636
748,0.050387
749,0.059086
750,0.06602100000000001
751,0.07295499999999999
752,0.07989199999999999
753,0.089143
754,0.096664
755,0.1036
756,0.11054000000000001
757,0.11748
758,0.12674000000000002
759,0.13368
760,0.14063
761,0.14584
762,0.15047
763,0.15625999999999998
764,0.1632
765,0.17014
766,0.17765999999999998
767,0.18691
768,0.18867
769,0.19275
770,0.19796
771,0.20720999999999998
772,0.21414
773,0.22107
774,0.22801
775,0.23726
776,0.2442
777,0.25114000000000003
778,0.25866
779,0.2656
780,0.27485
781,0.28179
782,0.28874
783,0.29568
784,0.30378
785,0.30784
786,0.31132
787,0.31825
788,0.32519000000000003
789,0.33445
790,0.34197
791,0.34891
792,0.35585
793,0.36336999999999997
794,0.36743000000000003
795,0.37381
796,0.38075
797,0.38769000000000003
798,0.39694
799,0.40388
800,0.41081999999999996
801,0.41776
802,0.42758999999999997
803,0.43453
804,0.44148000000000004
805,0.44842
806,0.45536000000000004
807,0.46462
808,0.47157
809,0.47852
810,0.48023999999999994
811,0.48718999999999996
812,0.49412
813,0.50107
814,0.5080100000000001
815,0.51727
816,0.5242100000000001
817,0.5311600000000001
818,0.53868
819,0.54562
820,0.55488
821,0.56183
822,0.5687800000000001
823,0.57573
824,0.585
825,0.59195
826,0.59772
827,0.59943
828,0.6028899999999999
829,0.61215
830,0.6191
831,0.62605
832,0.633
833,0.64226
834,0.6492100000000001
835,0.6561600000000001
836,0.66368
837,0.6706300000000001
838,0.6799
839,0.68685
840,0.69381
841,0.70076
842,0.70948
843,0.71699
844,0.72395
845,0.73035
846,0.73731
847,0.7466
848,0.75356
849,0.76107
850,0.76803
851,0.77677
852,0.78373
853,0.7907
854,0.79767
855,0.8075
856,0.81447
857,0.82144
858,0.8284100000000001
859,0.8353799999999999
860,0.84467
861,0.85164
862,0.85861
863,0.8602299999999999
864,0.86706
865,0.87402
866,0.8809899999999999
867,0.8879600000000001
868,0.89492
869,0.90422
870,0.9111899999999999
871,0.9187
872,0.9256700000000001
873,0.93496
874,0.9419299999999999
875,0.94891
876,0.95588
877,0.96285
878,0.97215
879,0.97608
880,0.98003
881,0.98521
882,0.9945
883,1.0015
884,1.0084
885,1.0154
886,1.0247
887,1.0317
888,1.0387
889,1.0456
890,1.0526
891,1.0619
892,1.0689
893,1.0759
894,1.0828
895,1.0922
896,1.0991
897,1.1061
898,1.1131
899,1.1201
900,1.1294
901,1.1312
902,1.1335
903,1.1359
904,1.1452
905,1.1521
906,1.1591
907,1.1638
908,1.1661
909,1.1713
910,1.1783
911,1.1853
912,1.1923
913,1.2016
914,1.2086
915,1.2156
916,1.2225
917,1.2295
918,1.2389
919,1.2425
920,1.2433
921,1.247
922,1.2563
923,1.2633
924,1.2698
925,1.2768
926,1.2862
927,1.2932
928,1.2945
929,1.2931
930,1.2917
931,1.2921
932,1.2930000000000001
933,1.2996
934,1.3061
935,1.3043
936,1.3029
937,1.3015
938,1.3002
939,1.2988
940,1.2971
941,1.2958
942,1.2945
943,1.2932
944,1.2915
945,1.2902
946,1.2890000000000001
947,1.2815
948,1.2741
949,1.2705
950,1.2669
951,1.2595
952,1.2524
953,1.2429999999999999
954,1.236
955,1.2285
956,1.2215
957,1.2144
958,1.205
959,1.198
960,1.1933
961,1.1909
962,1.1862
963,1.1792
964,1.1721
965,1.1693
966,1.1666
967,1.1638
968,1.1564
969,1.1489
970,1.1415
971,1.1344
972,1.1344
973,1.1316
974,1.1246
975,1.1148
976,1.1077
977,1.1007
978,1.0952
979,1.094
980,1.0861
981,1.0787
982,1.0736
983,1.07
984,1.0642
985,1.0571
986,1.05
987,1.043
988,1.0359
989,1.0261
990,1.0190000000000001
991,1.012
992,1.0049
993,0.99551
994,0.99434
995,0.9908299999999999
996,0.9833799999999999
997,0.9763200000000001
998,0.9669
999,0.9598399999999999
1000,0.95278
1001,0.9457200000000001
1002,0.93591
1003,0.92885
1004,0.92179
1005,0.9147299999999999
1006,0.9053200000000001
1007,0.8982600000000001
1008,0.8912
1009,0.8841399999999999
1010,0.87708
1011,0.86767
1012,0.86061
1013,0.85356
1014,0.8465
1015,0.83709
1016,0.8300299999999999
1017,0.8229799999999999
1018,0.8194299999999999
1019,0.81826
1020,0.81081
1021,0.80375
1022,0.79669
1023,0.78963
1024,0.78022
1025,0.7731600000000001
1026,0.7661
1027,0.75865
1028,0.75159
1029,0.7421800000000001
1030,0.73512
1031,0.72807
1032,0.72101
1033,0.7116
1034,0.7065
1035,0.70296
1036,0.69943
1037,0.69002
1038,0.68296
1039,0.6759
1040,0.66884
1041,0.66178
1042,0.65198
1043,0.6449199999999999
1044,0.63786
1045,0.6308
1046,0.6214
1047,0.61434
1048,0.60924
1049,0.6057
1050,0.60492
1051,0.59512
1052,0.58806
1053,0.581
1054,0.57355
1055,0.56413
1056,0.55707
1057,0.55002
1058,0.54885
1059,0.5453399999999999
1060,0.5379
1061,0.53083
1062,0.52377
1063,0.51671
1064,0.50729
1065,0.50022
1066,0.49278
1067,0.48572
1068,0.47865
1069,0.47158999999999995
1070,0.46808999999999995
1071,0.46695
1072,0.4595
1073,0.45008000000000004
1074,0.44301
1075,0.43556999999999996
1076,0.42851000000000006
1077,0.41908
1078,0.41202
1079,0.40495
1080,0.39789
1081,0.39242
1082,0.38856
1083,0.38348000000000004
1084,0.37640999999999997
1085,0.36934
1086,0.35991999999999996
1087,0.35285
1088,0.34578000000000003
1089,0.33834000000000003
1090,0.33127
1091,0.32185
1092,0.31478
1093,0.30772
1094,0.30065
1095,0.29123000000000004
1096,0.28415999999999997
1097,0.2771
1098,0.27596
1099,0.27249
1100,0.26505
1101,0.25798000000000004
1102,0.25090999999999997
1103,0.24347
1104,0.23404
1105,0.22696999999999998
1106,0.21991
1107,0.21755
1108,0.21755
1109,0.20813
1110,0.20106
1111,0.19399
1112,0.19399
1113,0.18928
1114,0.18222
1115,0.17515
1116,0.16808
1117,0.15867
1118,0.1516
1119,0.14454
1120,0.13747
1121,0.13041
1122,0.121
1123,0.11392999999999999
1124,0.10687
1125,0.10375
1126,0.097511
1127,0.09006900000000001
1128,0.083003
1129,0.075937
1130,0.068872
1131,0.059451
1132,0.052006
1133,0.044941
1134,0.037877
1135,0.028457
1136,0.025342
1137,0.021856999999999998
1138,0.018756000000000002
1139,0.011687999999999999
1140,0.0018908000000000002
1141,-0.0004662
1142,-0.0004662
1143,-0.0015682
1144,-0.0030122
1145,-0.0040732
1146,-0.0051152
1147,-0.0051152
1148,-0.0054592
1149,-0.0037771999999999997
1150,-0.0047842
1151,-0.0030832
1152,0.0040058
1153,0.013133
1154,0.020222999999999998
1155,0.027312
1156,0.031401
1157,0.032510000000000004
1158,0.039297000000000006
1159,0.045785
1160,0.047255
1161,0.048741
1162,0.058213
1163,0.06502899999999999
1164,0.064179
1165,0.065716
1166,0.074921
1167,0.081493
1168,0.080701
1169,0.082299
1170,0.087041
1171,0.096528
1172,0.10364000000000001
1173,0.11076
1174,0.11788
1175,0.12736
1176,0.13448
1177,0.14135
1178,0.14872
1179,0.15583
1180,0.16508
1181,0.17244
1182,0.17956
1183,0.18667999999999998
1184,0.19617
1185,0.20329
1186,0.2104
1187,0.21728000000000003
1188,0.22676999999999997
1189,0.23389000000000001
1190,0.24101
1191,0.24814
1192,0.25526
1193,0.26499
1194,0.27211
1195,0.27923000000000003
1196,0.28635
1197,0.29584
1198,0.30296
1199,0.30606
1200,0.30606
1201,0.3108
1202,0.32029
1203,0.32766
1204,0.33502
1205,0.34238
1206,0.34736999999999996
1207,0.34975
1208,0.35212
1209,0.35923
1210,0.36161
1211,0.36398
1212,0.3711
1213,0.37822
1214,0.38534
1215,0.39483
1216,0.40195
1217,0.40907
1218,0.41618999999999995
1219,0.42331
1220,0.4328
1221,0.43992
1222,0.44703999999999994
1223,0.45416000000000006
1224,0.46366
1225,0.47078000000000003
1226,0.4779
1227,0.48502
1228,0.49451999999999996
1229,0.50164
1230,0.50876
1231,0.51588
1232,0.523
1233,0.53273
1234,0.53962
1235,0.54674
1236,0.55387
1237,0.5633600000000001
1238,0.5704899999999999
1239,0.5776100000000001
1240,0.58473
1241,0.59186
1242,0.60135
1243,0.60848
1244,0.6156
1245,0.6227199999999999
1246,0.63222
1247,0.63935
1248,0.64647
1249,0.6536
1250,0.66072
1251,0.6702199999999999
1252,0.67735
1253,0.68447
1254,0.6916
1255,0.7011
1256,0.70822
1257,0.71535
1258,0.72247
1259,0.7296
1260,0.7391
1261,0.7462300000000001
1262,0.75335
1263,0.76048
1264,0.76998
1265,0.7771100000000001
1266,0.7842399999999999
1267,0.7913600000000001
1268,0.80108
1269,0.80821
1270,0.81512
1271,0.82225
1272,0.82937
1273,0.83888
1274,0.84601
1275,0.8531299999999999
1276,0.86026
1277,0.86977
1278,0.8771100000000001
1279,0.8842399999999999
1280,0.89136
1281,0.89849
1282,0.90799
1283,0.91512
1284,0.92225
1285,0.9293799999999999
1286,0.93889
1287,0.9460200000000001
1288,0.95314
1289,0.9602700000000001
1290,0.9674
1291,0.9769100000000001
1292,0.9840399999999999
1293,0.9890000000000001
1294,0.99179
1295,0.9941700000000001
1296,1.0013
1297,1.0084
1298,1.0156
1299,1.0251
1300,1.0322
1301,1.0322
1302,1.0342
1303,1.0387
1304,1.0482
1305,1.0553
1306,1.0625
1307,1.0696
1308,1.0791
1309,1.0862
1310,1.0934
1311,1.1005
1312,1.1076
1313,1.1171
1314,1.1241
1315,1.1312
1316,1.1383
1317,1.1478
1318,1.155
1319,1.1621
1320,1.1694
1321,1.1766
1322,1.1861
1323,1.1932
1324,1.2003
1325,1.2075
1326,1.217
1327,1.2241
1328,1.2313
1329,1.2384
1330,1.2455
1331,1.255
1332,1.2622
1333,1.2693
1334,1.2762
1335,1.2857
1336,1.2929
1337,1.3
1338,1.3072
1339,1.3167
1340,1.3185
1341,1.3179
1342,1.3249
1343,1.3319999999999999
1344,1.3415
1345,1.3487
1346,1.3558
1347,1.3630000000000002
1348,1.3725
1349,1.3796
1350,1.3867
1351,1.3939
1352,1.401
1353,1.4105
1354,1.4177
1355,1.4246
1356,1.4318
1357,1.4413
1358,1.4484
1359,1.4556
1360,1.4627
1361,1.4673
1362,1.469
1363,1.4734
1364,1.4806
1365,1.4876
1366,1.4971
1367,1.5041
1368,1.506
1369,1.5055
1370,1.5125
1371,1.5219999999999998
1372,1.5216
1373,1.5236
1374,1.5258
1375,1.5352
1376,1.5398
1377,1.5394
1378,1.5390000000000001
1379,1.5385
1380,1.5405
1381,1.5402
1382,1.5399
1383,1.5395
1384,1.5391
1385,1.5388
1386,1.5385
1387,1.5383
1388,1.5379
1389,1.5377
1390,1.5374
1391,1.5348
1392,1.5346
1393,1.5344
1394,1.5342
1395,1.534
1396,1.5315
1397,1.5243
1398,1.5171
1399,1.5146
1400,1.5121
1401,1.5072
1402,1.4977
1403,1.4975
1404,1.4951
1405,1.4903
1406,1.4807
1407,1.4782
1408,1.4758
1409,1.4709999999999999
1410,1.4638
1411,1.4543
1412,1.4471
1413,1.4399
1414,1.4399
1415,1.4351
1416,1.4279
1417,1.4208
1418,1.4136
1419,1.4041
1420,1.3969
1421,1.3898
1422,1.3826
1423,1.3754
1424,1.3659
1425,1.3587
1426,1.3516
1427,1.3444
1428,1.3349
1429,1.3277
1430,1.3206
1431,1.3134
1432,1.3063
1433,1.2967
1434,1.2896
1435,1.2824
1436,1.2752
1437,1.2657
1438,1.2585
1439,1.2514
1440,1.2442
1441,1.2371
1442,1.2275
1443,1.2204
1444,1.2132
1445,1.2061
1446,1.1965
1447,1.1894
1448,1.1822
1449,1.1751
1450,1.1655
1451,1.1584
1452,1.1512
1453,1.1441
1454,1.1369
1455,1.1274
1456,1.1202
1457,1.113
1458,1.1059
1459,1.0963
1460,1.0892
1461,1.082
1462,1.0772
1463,1.0748
1464,1.0725
1465,1.0653
1466,1.0581
1467,1.051
1468,1.0414
1469,1.0343
1470,1.0271
1471,1.02
1472,1.0128
1473,1.0033
1474,0.9961200000000001
1475,0.9889700000000001
1476,0.9818100000000001
1477,0.9722700000000001
1478,0.96511
1479,0.95796
1480,0.9508
1481,0.9436399999999999
1482,0.9341
1483,0.92695
1484,0.91979
1485,0.9126299999999999
1486,0.90309
1487,0.89594
1488,0.8887799999999999
1489,0.8816200000000001
1490,0.87208
1491,0.86492
1492,0.85777
1493,0.8506100000000001
1494,0.84346
1495,0.83391
1496,0.82676
1497,0.8196
1498,0.81245
1499,0.8029
1500,0.79575
1501,0.79099
1502,0.78863
1503,0.78388
1504,0.7743399999999999
1505,0.76718
1506,0.76003
1507,0.7528699999999999
1508,0.74333
1509,0.73617
1510,0.72902
1511,0.72188
1512,0.71472
1513,0.70518
1514,0.69802
1515,0.69087
1516,0.68371
1517,0.6741699999999999
1518,0.66701
1519,0.65986
1520,0.6527
1521,0.64553
1522,0.636
1523,0.62883
1524,0.62167
1525,0.61452
1526,0.6049800000000001
1527,0.59782
1528,0.59067
1529,0.5835100000000001
1530,0.57397
1531,0.56681
1532,0.55966
1533,0.5525
1534,0.5453399999999999
1535,0.5358
1536,0.52864
1537,0.5215
1538,0.5143300000000001
1539,0.50481
1540,0.49765
1541,0.49049
1542,0.48333999999999994
1543,0.47618
1544,0.46663999999999994
1545,0.45948999999999995
1546,0.45233
1547,0.44516999999999995
1548,0.43563
1549,0.42846999999999996
1550,0.42846999999999996
1551,0.4237
1552,0.41655
1553,0.40701
1554,0.40462
1555,0.40223000000000003
1556,0.39985
1557,0.39031
1558,0.38315
1559,0.376
1560,0.36884
1561,0.36168
1562,0.35214
1563,0.34499
1564,0.33783
1565,0.33066999999999996
1566,0.32113
1567,0.31398000000000004
1568,0.3068
1569,0.29965
1570,0.2901
1571,0.28295
1572,0.27579000000000004
1573,0.26864
1574,0.26148000000000005
1575,0.25192
1576,0.2495
1577,0.2471
1578,0.23994000000000001
1579,0.2304
1580,0.22324000000000002
1581,0.21609
1582,0.20893
1583,0.20177
1584,0.19222999999999998
1585,0.18508
1586,0.17792
1587,0.17076
1588,0.16122
1589,0.16124000000000002
1590,0.15889
1591,0.15414
1592,0.14698
1593,0.13746
1594,0.1303
1595,0.12315
1596,0.12319000000000001
1597,0.1233
1598,0.12102
1599,0.12114000000000001
1600,0.12122999999999999
1601,0.11173
1602,0.10457999999999999
1603,0.097425
1604,0.09031900000000001
1605,0.083165
1606,0.073626
1607,0.066524
1608,0.066694
1609,0.06688200000000001
1610,0.066949
1611,0.066949
1612,0.067161
1613,0.067311
1614,0.067311
1615,0.067311
1616,0.074463
1617,0.081693
1618,0.08884700000000001
1619,0.098384
1620,0.10323
1621,0.10586
1622,0.10613
1623,0.11327999999999999
1624,0.12301
1625,0.1233
1626,0.126
1627,0.13325
1628,0.14289000000000002
1629,0.14562
1630,0.14836
1631,0.1555
1632,0.16265
1633,0.17218
1634,0.17933
1635,0.18647
1636,0.19362000000000001
1637,0.20315
1638,0.2103
1639,0.21745
1640,0.22459
1641,0.23412
1642,0.24126999999999998
1643,0.24841999999999997
1644,0.25556999999999996
1645,0.26272
1646,0.27236
1647,0.27951
1648,0.28665999999999997
1649,0.2938
1650,0.30333000000000004
1651,0.31048000000000003
1652,0.31763
1653,0.32478
1654,0.33193
1655,0.34146
1656,0.34861
1657,0.35349
1658,0.35623
1659,0.35899000000000003
1660,0.36613
1661,0.37328
1662,0.38042
1663,0.38756999999999997
1664,0.39723
1665,0.40437
1666,0.41152
1667,0.41867
1668,0.42832
1669,0.43546999999999997
1670,0.44273999999999997
1671,0.44988999999999996
1672,0.45253000000000004
1673,0.45532
1674,0.46247
1675,0.46961
1676,0.47676
1677,0.48628000000000005
1678,0.49343000000000004
1679,0.50057
1680,0.50771
1681,0.5172399999999999
1682,0.5243899999999999
1683,0.5315300000000001
1684,0.53881
1685,0.54596
1686,0.55548
1687,0.56263
1688,0.56977
1689,0.57692
1690,0.5842
1691,0.5846100000000001
1692,0.58743
1693,0.5945699999999999
1694,0.6017100000000001
1695,0.61124
1696,0.61838
1697,0.62552
1698,0.63267
1699,0.6421899999999999
1700,0.64933
1701,0.6564800000000001
1702,0.66362
1703,0.67076
1704,0.68029
1705,0.68757
1706,0.69472
1707,0.70186
1708,0.71139
1709,0.71853
1710,0.72567
1711,0.73282
1712,0.73787
1713,0.74069
1714,0.74575
1715,0.7529
1716,0.7600399999999999
1717,0.76956
1718,0.7767
1719,0.78384
1720,0.79098
1721,0.80066
1722,0.8078
1723,0.81494
1724,0.8220799999999999
1725,0.8292299999999999
1726,0.83875
1727,0.8458899999999999
1728,0.8531799999999999
1729,0.85349
1730,0.85888
1731,0.8660200000000001
1732,0.87316
1733,0.8803
1734,0.88744
1735,0.8969600000000001
1736,0.9041
1737,0.9112399999999999
1738,0.91838
1739,0.9279
1740,0.93505
1741,0.9421799999999999
1742,0.9493299999999999
1743,0.95647
1744,0.96599
1745,0.9731299999999999
1746,0.9802700000000001
1747,0.98741
1748,0.9969299999999999
1749,1.0041
1750,1.0112
1751,1.0184
1752,1.0279
1753,1.0352
1754,1.0423
1755,1.0495
1756,1.0566
1757,1.0661
1758,1.0733
1759,1.0804
1760,1.0831
1761,1.0861
1762,1.091
1763,1.0982
1764,1.1053
1765,1.1124
1766,1.122
1767,1.1291
1768,1.1364
1769,1.1435
1770,1.1531
1771,1.1602
1772,1.1631
1773,1.1636
1774,1.1685
1775,1.178
1776,1.1852
1777,1.1923
1778,1.1994
1779,1.2091
1780,1.2163
1781,1.2234
1782,1.2305
1783,1.2377
1784,1.2384
1785,1.2413
1786,1.2484
1787,1.2556
1788,1.2652
1789,1.2724
1790,1.2775
1791,1.2804
1792,1.2879
1793,1.2951
1794,1.3024
1795,1.3095
1796,1.3167
1797,1.3174
1798,1.318
1799,1.321
1800,1.3216
1801,1.3268
1802,1.3341
1803,1.3391
1804,1.3397
1805,1.3404
1806,1.3412
1807,1.3419
1808,1.3426
1809,1.3433
1810,1.3443
1811,1.345
1812,1.3457
1813,1.3465
1814,1.3473
1815,1.3483
1816,1.3438
1817,1.337
1818,1.3325
1819,1.3336
1820,1.3321
1821,1.3329
1822,1.3338
1823,1.3293
1824,1.3201
1825,1.3186
1826,1.3172
1827,1.3104
1828,1.3015
1829,1.3001
1830,1.301
1831,1.2939
1832,1.2844
1833,1.2773
1834,1.2702
1835,1.2635
1836,1.2564
1837,1.2469
1838,1.2452
1839,1.2438
1840,1.2397
1841,1.2303
1842,1.2232
1843,1.2161
1844,1.209
1845,1.2019
1846,1.1925
1847,1.1854
1848,1.1783
1849,1.1712
1850,1.1618
1851,1.1547
1852,1.1476
1853,1.1405
1854,1.1334
1855,1.124
1856,1.1169
1857,1.1098
1858,1.1027
1859,1.0933
1860,1.0862
1861,1.0791
1862,1.072
1863,1.0626
1864,1.0555
1865,1.0484
1866,1.0414
1867,1.0343
1868,1.0248
1869,1.0178
1870,1.0107
1871,1.0036
1872,0.99416
1873,0.98744
1874,0.98036
1875,0.9732799999999999
1876,0.9662
1877,0.9567700000000001
1878,0.9496899999999999
1879,0.9426100000000001
1880,0.9355399999999999
1881,0.9261
1882,0.9190299999999999
1883,0.91195
1884,0.9048799999999999
1885,0.89781
1886,0.8883700000000001
1887,0.8813
1888,0.87387
1889,0.86679
1890,0.85736
1891,0.85029
1892,0.8432200000000001
1893,0.83614
1894,0.8290700000000001
1895,0.8196399999999999
1896,0.81257
1897,0.8055
1898,0.79843
1899,0.789
1900,0.78193
1901,0.77487
1902,0.7678
1903,0.75837
1904,0.75168
1905,0.74424
1906,0.73717
1907,0.7301
1908,0.72068
1909,0.7136100000000001
1910,0.7069300000000001
1911,0.69986
1912,0.6904399999999999
1913,0.68338
1914,0.67632
1915,0.66925
1916,0.66219
1917,0.65277
1918,0.64571
1919,0.63865
1920,0.6312
1921,0.6221800000000001
1922,0.61511
1923,0.60806
1924,0.601
1925,0.5939399999999999
1926,0.58453
1927,0.57707
1928,0.57002
1929,0.56296
1930,0.55355
1931,0.5464899999999999
1932,0.5394399999999999
1933,0.53238
1934,0.52532
1935,0.5159199999999999
1936,0.5088600000000001
1937,0.5018100000000001
1938,0.49475
1939,0.48535
1940,0.4783
1941,0.47125
1942,0.46418999999999994
1943,0.45478999999999997
1944,0.45243999999999995
1945,0.45009
1946,0.44498000000000004
1947,0.43753000000000003
1948,0.43477
1949,0.42966000000000004
1950,0.42221000000000003
1951,0.41475
1952,0.40963999999999995
1953,0.40729
1954,0.40024
1955,0.39318000000000003
1956,0.38613000000000003
1957,0.37673
1958,0.36968
1959,0.36262
1960,0.35557
1961,0.34617
1962,0.33912
1963,0.33207
1964,0.32461
1965,0.31756
1966,0.30816
1967,0.30112
1968,0.29407
1969,0.28702
1970,0.27763000000000004
1971,0.27058000000000004
1972,0.26354
1973,0.26035
1974,0.25677
1975,0.2489
1976,0.24185
1977,0.2348
1978,0.22775
1979,0.21835
1980,0.2113
1981,0.20425
1982,0.19679000000000002
1983,0.18739
1984,0.18034
1985,0.1733
1986,0.16625
1987,0.1592
1988,0.14981
1989,0.14277
1990,0.13572
1991,0.12868
1992,0.12230999999999999
1993,0.11872
1994,0.11167
1995,0.10462
1996,0.097571
1997,0.088175
1998,0.081126
1999,0.07407899999999999
2000,0.067035
2001,0.057221
2002,0.050177
2003,0.04313
2004,0.036086
2005,0.029042000000000002
2006,0.01965
2007,0.012606000000000001
2008,0.005563800000000001
2009,-0.0014782
2010,-0.010864
2011,-0.017906000000000002
2012,-0.024946
2013,-0.031985
2014,-0.041369
2015,-0.048406
2016,-0.05544400000000001
2017,-0.062480999999999995
2018,-0.069518
2019,-0.078458
2020,-0.085491
2021,-0.092525
2022,-0.09955499999999999
2023,-0.10893
2024,-0.11596
2025,-0.12299000000000002
2026,-0.13002
2027,-0.13705
2028,-0.14642
2029,-0.15345
2030,-0.16047
2031,-0.1675
2032,-0.17686
2033,-0.18389
2034,-0.19091
2035,-0.19839
2036,-0.20542
2037,-0.21431999999999998
2038,-0.22134
2039,-0.22835
2040,-0.23536999999999997
2041,-0.24473000000000003
2042,-0.25175
2043,-0.25876
2044,-0.26578
2045,-0.26716999999999996
2046,-0.26758000000000004
2047,-0.26942
2048,-0.27643
2049,-0.28343
2050,-0.29277
2051,-0.29977
2052,-0.30627
2053,-0.31327
2054,-0.31693000000000005
2055,-0.31773
2056,-0.31903000000000004
2057,-0.3255
2058,-0.33196
2059,-0.33216999999999997
2060,-0.33628
2061,-0.34271999999999997
2062,-0.34969
2063,-0.35898
2064,-0.36594
2065,-0.37290999999999996
2066,-0.37988
2067,-0.38684
2068,-0.39611999999999997
2069,-0.40308
2070,-0.40771999999999997
2071,-0.41003999999999996
2072,-0.41236000000000006
2073,-0.41931999999999997
2074,-0.42163999999999996
2075,-0.42396000000000006
2076,-0.4234
2077,-0.4234
2078,-0.42283999999999994
2079,-0.42113999999999996
2080,-0.41941000000000006
2081,-0.41708999999999996
2082,-0.41591000000000006
2083,-0.41531999999999997
2084,-0.41413
2085,-0.41002
2086,-0.4065
2087,-0.39897
2088,-0.39205
2089,-0.39021999999999996
2090,-0.38545
2091,-0.37854
2092,-0.37163
2093,-0.3641
2094,-0.35488000000000003
2095,-0.34842
2096,-0.34425
2097,-0.33902
2098,-0.33211
2099,-0.3229
2100,-0.31599
2101,-0.30909000000000003
2102,-0.30217
2103,-0.29296
2104,-0.28543
2105,-0.27851
2106,-0.2716
2107,-0.26468
2108,-0.25545999999999996
2109,-0.25193000000000004
2110,-0.24778000000000003
2111,-0.24423000000000003
2112,-0.23501999999999998
2113,-0.22810999999999998
2114,-0.2212
2115,-0.21428000000000003
2116,-0.20675
2117,-0.19752999999999998
2118,-0.19062
2119,-0.1837
2120,-0.17678
2121,-0.17264000000000002
2122,-0.16849
2123,-0.16326
2124,-0.15635
2125,-0.14944000000000002
2126,-0.14022
2127,-0.1333
2128,-0.12639
2129,-0.11947
2130,-0.11025
2131,-0.10332999999999999
2132,-0.09640399999999999
2133,-0.08948099999999999
2134,-0.080247
2135,-0.07272100000000001
2136,-0.06579600000000001
2137,-0.058869000000000005
2138,-0.051941999999999995
2139,-0.042703
2140,-0.035773
2141,-0.028841000000000002
2142,-0.021909
2143,-0.012662999999999999
2144,-0.0057292
2145,-0.0022392
2146,-0.0004572
2147,0.0030478000000000002
2148,0.012284
2149,0.019214
2150,0.026143
2151,0.033073000000000005
2152,0.042317
2153,0.049839999999999995
2154,0.056775
2155,0.063707
2156,0.07064400000000001
2157,0.07989199999999999
2158,0.08682899999999999
2159,0.091455
2160,0.095526
2161,0.1002
2162,0.10712999999999999
2163,0.11465999999999998
2164,0.12159
2165,0.13083
2166,0.13664
2167,0.14074
2168,0.14194
2169,0.14886
2170,0.1587
2171,0.16563
2172,0.17255
2173,0.17837
2174,0.18309
2175,0.19062
2176,0.19754000000000002
2177,0.20506999999999997
2178,0.21199
2179,0.21952
2180,0.22134
2181,0.22549
2182,0.23240999999999998
2183,0.24163
2184,0.24915
2185,0.25606999999999996
2186,0.26191
2187,0.26605999999999996
2188,0.26961
2189,0.27651
2190,0.28405
2191,0.29096
2192,0.30017
2193,0.30371
2194,0.30789
2195,0.31374
2196,0.32127
2197,0.32713000000000003
2198,0.33133
2199,0.3349
2200,0.34244
2201,0.34997
2202,0.35189000000000004
2203,0.35613
2204,0.35808
2205,0.36071
2206,0.36595
2207,0.37349
2208,0.3794
2209,0.38368
2210,0.3896
2211,0.39714
2212,0.40306
2213,0.40508
2214,0.41008999999999995
2215,0.41215
2216,0.41422
2217,0.41631
2218,0.41841000000000006
2219,0.42438000000000003
2220,0.43191999999999997
2221,0.43561000000000005
2222,0.43773999999999996
2223,0.4406
2224,0.44277
2225,0.44495
2226,0.44714
2227,0.44935
2228,0.45231000000000005
2229,0.44551999999999997
2230,0.43946999999999997
2231,0.44172
2232,0.44475
2233,0.44478
2234,0.44709
2235,0.44638
2236,0.44038
2237,0.4344
2238,0.43449
2239,0.43686
2240,0.43011000000000005
2241,0.4219
2242,0.42205
2243,0.42446000000000006
2244,0.42078000000000004
2245,0.4118
2246,0.40507
2247,0.39835
2248,0.39161999999999997
2249,0.3849
2250,0.37594
2251,0.36922
2252,0.3625
2253,0.35578000000000004
2254,0.34683
2255,0.34012
2256,0.33341
2257,0.3267
2258,0.32
2259,0.31106
2260,0.30435999999999996
2261,0.29766
2262,0.29515
2263,0.28958
2264,0.28286999999999995
2265,0.27616999999999997
2266,0.26863000000000004
2267,0.26193
2268,0.25439
2269,0.24965
2270,0.24716
2271,0.24045
2272,0.23151
2273,0.2248
2274,0.21809
2275,0.21139000000000002
2276,0.20469
2277,0.19576
2278,0.18822
2279,0.18152000000000001
2280,0.17482999999999999
2281,0.16591
2282,0.15922
2283,0.15254
2284,0.14585
2285,0.13694
2286,0.13026
2287,0.12359
2288,0.11690999999999999
2289,0.11024
2290,0.10135
2291,0.094682
2292,0.088017
2293,0.081355
2294,0.073351
2295,0.06669800000000001
2296,0.060045
2297,0.053397
2298,0.046749
2299,0.037892
2300,0.030361000000000003
2301,0.023719999999999998
2302,0.017081
2303,0.0082358
2304,0.0016018
2305,-0.0050272
2306,-0.011654000000000001
2307,-0.018278
2308,-0.020485
2309,-0.0249
2310,-0.032425999999999996
2311,-0.035539
2312,-0.03865
2313,-0.046176
2314,-0.053704999999999996
2315,-0.059022000000000005
2316,-0.062135
2317,-0.068757
2318,-0.075376
2319,-0.081991
2320,-0.08860599999999999
2321,-0.09742
2322,-0.10494
2323,-0.11155
2324,-0.11815
2325,-0.12695
2326,-0.13355
2327,-0.14015
2328,-0.14765999999999999
2329,-0.15172
2330,-0.15761
2331,-0.16421
2332,-0.17081
2333,-0.17740999999999998
2334,-0.1862
2335,-0.19279000000000002
2336,-0.19937
2337,-0.20596
2338,-0.21254
2339,-0.22225
2340,-0.22882
2341,-0.2354
2342,-0.24197
2343,-0.25072
2344,-0.25728
2345,-0.26384
2346,-0.2704
2347,-0.27695
2348,-0.28568000000000005
2349,-0.29223000000000005
2350,-0.29877
2351,-0.30530999999999997
2352,-0.31401999999999997
2353,-0.32055
2354,-0.32708000000000004
2355,-0.33241
2356,-0.33849
2357,-0.34260999999999997
2358,-0.34914
2359,-0.35568
2360,-0.36221
2361,-0.37091
2362,-0.37743000000000004
2363,-0.38395
2364,-0.39046
2365,-0.40013000000000004
2366,-0.40664
2367,-0.41315
2368,-0.41965
2369,-0.42613999999999996
2370,-0.4348
2371,-0.44128999999999996
2372,-0.44546
2373,-0.45064
2374,-0.4548
2375,-0.4613
2376,-0.46779
2377,-0.47429
2378,-0.48077
2379,-0.48941999999999997
2380,-0.4959
2381,-0.50339
2382,-0.5098600000000001
2383,-0.51849
2384,-0.52495
2385,-0.53141
2386,-0.53787
2387,-0.54432
2388,-0.55291
2389,-0.5581699999999999
2390,-0.5634100000000001
2391,-0.5665899999999999
2392,-0.5752
2393,-0.58165
2394,-0.5881
2395,-0.59454
2396,-0.60313
2397,-0.61061
2398,-0.6170399999999999
2399,-0.62347
2400,-0.62989
2401,-0.63845
2402,-0.64486
2403,-0.65127
2404,-0.65767
2405,-0.6662
2406,-0.6715399999999999
2407,-0.67473
2408,-0.6822
2409,-0.6886
2410,-0.69714
2411,-0.70353
2412,-0.7099300000000001
2413,-0.71739
2414,-0.7259
2415,-0.73228
2416,-0.73865
2417,-0.74398
2418,-0.74724
2419,-0.75473
2420,-0.7611100000000001
2421,-0.76749
2422,-0.77386
2423,-0.7834399999999999
2424,-0.78981
2425,-0.7961699999999999
2426,-0.80252
2427,-0.8069
2428,-0.81229
2429,-0.81866
2430,-0.8250200000000001
2431,-0.8313799999999999
2432,-0.84095
2433,-0.8473
2434,-0.85365
2435,-0.8599899999999999
2436,-0.8654200000000001
2437,-0.87084
2438,-0.8761700000000001
2439,-0.8836200000000001
2440,-0.89005
2441,-0.89654
2442,-0.904
2443,-0.9103600000000001
2444,-0.9167200000000001
2445,-0.92629
2446,-0.9326399999999999
2447,-0.9389799999999999
2448,-0.94532
2449,-0.94965
2450,-0.9561700000000001
2451,-0.96362
2452,-0.9710700000000001
2453,-0.97539
2454,-0.98188
2455,-0.98721
2456,-0.9935799999999999
2457,-0.9999399999999999
2458,-1.0063
2459,-1.0147
2460,-1.0222
2461,-1.0285
2462,-1.0349
2463,-1.0433
2464,-1.0496
2465,-1.0559
2466,-1.0622
2467,-1.0687
2468,-1.0742
2469,-1.0785
2470,-1.0848
2471,-1.0911
2472,-1.1007
2473,-1.107
2474,-1.1113
2475,-1.1168
2476,-1.1212
2477,-1.1275
2478,-1.1338
2479,-1.1412
2480,-1.1475
2481,-1.1540000000000001
2482,-1.1595
2483,-1.1638
2484,-1.1701
2485,-1.1797
2486,-1.186
2487,-1.1923
2488,-1.1978
2489,-1.2033
2490,-1.2128
2491,-1.2191
2492,-1.2265
2493,-1.2328
2494,-1.2393
2495,-1.2448
2496,-1.2491
2497,-1.2554
2498,-1.2617
2499,-1.2713
2500,-1.2776
2501,-1.2819
2502,-1.2874
2503,-1.2939
2504,-1.3002
2505,-1.3076
2506,-1.3139
2507,-1.3234
2508,-1.3269
2509,-1.3323
2510,-1.3386
2511,-1.3461
2512,-1.3537
2513,-1.357
2514,-1.3656
2515,-1.3719
2516,-1.3795
2517,-1.3828
2518,-1.3903
2519,-1.3977
2520,-1.4032
2521,-1.4118
2522,-1.4192
2523,-1.4267
2524,-1.4321
2525,-1.4396
2526,-1.446
2527,-1.4534
2528,-1.4598
2529,-1.4661
2530,-1.4715
2531,-1.4769
2532,-1.4823
2533,-1.4897
2534,-1.4961
2535,-1.5015
2536,-1.5058
2537,-1.5122
2538,-1.5196
2539,-1.5281
2540,-1.5345
2541,-1.5388
2542,-1.5442
2543,-1.5506
2544,-1.557
2545,-1.5634
2546,-1.5708
2547,-1.5793
2548,-1.5857
2549,-1.5919999999999999
2550,-1.5974
2551,-1.6006
2552,-1.6082
2553,-1.6145
2554,-1.6209
2555,-1.6272
2556,-1.6357
2557,-1.6431
2558,-1.6495
2559,-1.6558
2560,-1.6621
2561,-1.6705
2562,-1.676
2563,-1.6815
2564,-1.6889
2565,-1.6973
2566,-1.7036
2567,-1.7099
2568,-1.7162
2569,-1.7224
2570,-1.7308
2571,-1.7369999999999999
2572,-1.7432
2573,-1.7495
2574,-1.7577
2575,-1.7639
2576,-1.7701
2577,-1.7763
2578,-1.7844
2579,-1.7906
2580,-1.7967
2581,-1.8028
2582,-1.8101
2583,-1.8183
2584,-1.8243
2585,-1.8304
2586,-1.8364
2587,-1.8444
2588,-1.8504
2589,-1.8564
2590,-1.8623
2591,-1.8683
2592,-1.8762
2593,-1.8821
2594,-1.8880000000000001
2595,-1.8939
2596,-1.9017
2597,-1.9075
2598,-1.9133
2599,-1.9191
2600,-1.9248
2601,-1.9325
2602,-1.9382
2603,-1.9439
2604,-1.9496
2605,-1.9571
2606,-1.9627
2607,-1.9683
2608,-1.9739
2609,-1.9794
2610,-1.9868
2611,-1.9923
2612,-1.9977
2613,-2.0032
2614,-2.0104
2615,-2.0141
2616,-2.0195
2617,-2.0248
2618,-2.0318
2619,-2.037
2620,-2.0422
2621,-2.0474
2622,-2.0491
2623,-2.0441
2624,-2.0458
2625,-2.049
2626,-2.0540000000000003
2627,-2.0605
2628,-2.0654
2629,-2.0703
2630,-2.075
2631,-2.0798
2632,-2.0861
2633,-2.0925
2634,-2.0956
2635,-2.0972
2636,-2.1002
2637,-2.1048
2638,-2.1093
2639,-2.1138
2640,-2.1167
2641,-2.1178
2642,-2.1192
2643,-2.1236
2644,-2.1278
2645,-2.1335
2646,-2.1376
2647,-2.1417
2648,-2.1458
2649,-2.1498
2650,-2.1551
2651,-2.1589
2652,-2.1628
2653,-2.1665
2654,-2.1715
2655,-2.1751
2656,-2.1786
2657,-2.1821
2658,-2.1867
2659,-2.19
2660,-2.1933
2661,-2.1965
2662,-2.1997
2663,-2.2038
2664,-2.2067
2665,-2.2096
2666,-2.2125
2667,-2.2161
2668,-2.2188
2669,-2.2191
2670,-2.2216
2671,-2.224
2672,-2.2271
2673,-2.2294
2674,-2.2315
2675,-2.2336
2676,-2.2362
2677,-2.2381
2678,-2.2398
2679,-2.2415
2680,-2.2431
2681,-2.2451
2682,-2.2465
2683,-2.2478
2684,-2.2491
2685,-2.2505
2686,-2.2515
2687,-2.2525
2688,-2.2533
2689,-2.2535
2690,-2.2538
2691,-2.2518
2692,-2.2501
2693,-2.2482
2694,-2.2436
2695,-2.2413
2696,-2.2392
2697,-2.2394
2698,-2.2395
2699,-2.2395
2700,-2.2397
2701,-2.2397
2702,-2.2397
2703,-2.2397
2704,-2.2397
2705,-2.2397
2706,-2.2397
2707,-2.2397
2708,-2.2397
