time,value
0,-0.056322000000000004
1,-0.056322000000000004
2,-0.056322000000000004
3,0.48436999999999997
4,-0.056322000000000004
5,-0.056322000000000004
6,-0.056322000000000004
7,-0.056322000000000004
8,-0.056322000000000004
9,-0.056322000000000004
10,-0.056322000000000004
11,0.48436999999999997
12,-0.056322000000000004
13,-0.056322000000000004
14,-0.056322000000000004
15,-0.056322000000000004
16,-0.056322000000000004
17,-0.056322000000000004
18,0.48436999999999997
19,-0.056322000000000004
20,-0.056322000000000004
21,-0.056322000000000004
22,-0.056322000000000004
23,-0.056322000000000004
24,-0.056322000000000004
25,-0.056322000000000004
26,0.48436999999999997
27,-0.056322000000000004
28,2.1064
29,6.432
30,5.8913
31,2.1064
32,-0.056322000000000004
33,-0.59701
34,-0.056322000000000004
35,-0.056322000000000004
36,-0.59701
37,-0.056322000000000004
38,-0.59701
39,-0.056322000000000004
40,-0.59701
41,-0.056322000000000004
42,-0.056322000000000004
43,-0.59701
44,-0.056322000000000004
45,-0.056322000000000004
46,-0.59701
47,-0.056322000000000004
48,-0.59701
49,-0.056322000000000004
50,-0.59701
51,-0.056322000000000004
52,-0.056322000000000004
53,-0.59701
54,-0.056322000000000004
55,-0.59701
56,-0.056322000000000004
57,-0.056322000000000004
58,-0.59701
59,-0.056322000000000004
60,-0.59701
61,-0.056322000000000004
62,-0.056322000000000004
63,-0.59701
64,-0.056322000000000004
65,-0.056322000000000004
66,-0.59701
67,-0.056322000000000004
68,-0.056322000000000004
69,-0.056322000000000004
70,-0.59701
71,-0.056322000000000004
72,-0.056322000000000004
73,-0.59701
74,-0.056322000000000004
75,-0.59701
76,-0.056322000000000004
77,-0.056322000000000004
78,-0.59701
79,-0.056322000000000004
80,-0.59701
81,-0.056322000000000004
82,-0.056322000000000004
83,-0.59701
84,-0.056322000000000004
85,-0.59701
86,-0.056322000000000004
87,-0.056322000000000004
88,-0.59701
89,-0.056322000000000004
90,-0.59701
91,-0.056322000000000004
92,-0.056322000000000004
93,-0.59701
94,-0.056322000000000004
95,-0.59701
