time,value
0,0.96459
1,-0.94189
2,-0.94189
3,-0.94189
4,-0.94189
5,-0.94189
6,-0.94189
7,-0.21561
8,1.3277
9,1.3277
10,1.1462
11,1.0554
12,0.60145
13,-0.94189
14,-0.94189
15,-0.94189
16,-0.94189
17,-0.94189
18,-0.94189
19,-0.034044
20,1.4185
21,1.3277
22,1.0554
23,1.0554
24,0.32909
25,-0.94189
26,-0.94189
27,-0.94189
28,-0.94189
29,-0.94189
30,-0.76032
31,1.4185
32,1.3277
33,1.1462
34,1.0554
35,1.0554
36,0.7830199999999999
37,-0.94189
38,-0.94189
39,-0.94189
40,-0.94189
41,-0.94189
42,-0.94189
43,0.14753
44,1.3277
45,1.3277
46,1.0554
47,1.0554
48,0.41988000000000003
49,-0.94189
50,-0.94189
51,-0.94189
52,-0.94189
53,-0.94189
54,-0.94189
55,0.60145
56,1.3277
57,1.2369
58,1.1462
59,1.0554
60,-0.3064
61,-0.94189
62,-0.94189
63,-0.94189
64,-0.94189
65,-0.94189
66,-0.48796999999999996
67,1.4185
68,1.3277
69,1.0554
70,1.0554
71,0.32909
72,-0.94189
73,-0.94189
74,-0.94189
75,-0.94189
76,-0.94189
77,-0.94189
78,0.69223
79,1.4185
80,1.1462
81,1.0554
82,1.0554
83,-0.39718000000000003
84,-0.94189
85,-0.94189
86,-0.94189
87,-0.94189
88,-0.94189
89,-0.94189
90,1.4185
91,1.4185
92,1.1462
93,1.0554
94,1.0554
95,-0.21561
