time,value
0,-0.5739
1,-0.38944
2,-0.50832
3,-0.71367
4,-0.74407
5,-0.61859
6,-0.57867
7,-0.59373
8,-0.5483899999999999
9,-0.47891999999999996
10,-0.44415
11,-0.48856000000000005
12,-0.42196000000000006
13,-0.35703
14,-0.30128
15,-0.28418000000000004
16,-0.12531
17,-0.054035
18,0.007372399999999999
19,0.056115
20,0.11018
21,0.11369000000000001
22,0.20009000000000002
23,0.24952
24,0.21381999999999998
25,0.23624
26,0.28876
27,0.26447
28,0.27634000000000003
29,0.28918
30,0.30368
31,0.27441
32,0.3134
33,0.29709
34,0.32928
35,0.31744
36,0.36194
37,0.39419
38,0.36446
39,0.4905
40,0.90465
41,1.2887
42,2.0858
43,2.2758
44,1.597
45,1.189
46,0.9464600000000001
47,0.69455
48,0.20158
49,0.38833
50,0.38905
51,0.37958000000000003
52,0.67832
53,0.48878
54,0.42788000000000004
55,0.52803
56,0.44576000000000005
57,0.49578
58,0.55308
59,0.63684
60,0.42085
61,0.60725
62,0.5535800000000001
63,0.70235
64,0.65986
65,0.6763899999999999
66,0.78704
67,0.76853
68,0.86398
69,0.9421200000000001
70,0.89617
71,1.0079
72,1.0462
73,0.98577
74,1.0287
75,1.0058
76,0.97765
77,0.90928
78,0.9632
79,0.92515
80,0.89476
81,0.9657600000000001
82,1.068
83,1.0792
84,1.0424
85,1.1321
86,1.1535
87,1.1638
88,1.204
89,1.1936
90,1.2867
91,1.2479
92,1.3452
93,1.2615
94,1.2591
95,1.2916
96,1.2705
97,1.2329999999999999
98,1.2716
99,1.3059
100,1.2941
101,1.3164
102,1.2562
103,1.3349
104,1.3014
105,1.3725
106,1.3819
107,1.4031
108,1.4606
109,1.4276
110,1.4691
111,1.4815
112,1.4812
113,1.4082
114,1.3909
115,1.5063
116,1.5074
117,1.5869
118,1.5684
119,1.5205
120,1.5430000000000001
121,1.6558
122,1.6474
123,1.6731
124,1.6314
125,1.6205
126,1.6438
127,1.6314
128,1.5394
129,1.4937
130,1.4978
131,1.5162
132,1.5393
133,1.4115
134,1.2976
135,1.2461
136,1.2735
137,1.4754
138,1.3248
139,1.3378
140,1.0466
141,0.8416899999999999
142,0.6704600000000001
143,0.39071999999999996
144,0.30519
145,0.22841
146,-0.016438
147,-0.16455999999999998
148,-0.26700999999999997
149,-0.54472
150,-0.49446
151,-0.52056
152,-0.49628999999999995
153,-0.35785
154,-0.28845
155,-0.35243
156,-0.1493
157,-0.17307999999999998
158,-0.10589000000000001
159,0.027098
160,0.030256
161,0.28949
162,0.7846
163,0.57991
164,0.51849
165,0.43033000000000005
166,0.68589
167,0.82862
168,0.82495
169,0.33707
170,0.93209
171,1.9201
172,0.91485
173,1.198
174,-0.14037
175,-1.4923
176,0.040195999999999996
177,0.19584000000000001
178,-0.24054
179,-0.502
180,-0.6035699999999999
181,-0.46436000000000005
182,-0.41323000000000004
183,-0.44164
184,-0.52217
185,-0.71654
186,-0.88797
187,-0.7742399999999999
188,-0.52675
189,-0.5567300000000001
190,-0.54133
191,-0.60758
192,-0.67786
193,-0.70211
194,-0.6271
195,-0.67027
196,-0.67132
197,-0.65718
198,-0.77662
199,-0.7535
200,-0.76788
201,-0.8156
202,-0.79347
203,-0.78403
204,-0.7843899999999999
205,-0.8159
206,-0.80374
207,-0.81225
208,-0.9307200000000001
209,-0.96109
210,-1.0201
211,-0.9446399999999999
212,-0.99672
213,-0.95232
214,-0.9547399999999999
215,-0.9928600000000001
216,-0.9597
217,-0.9284600000000001
218,-0.98745
219,-0.98946
220,-1.0325
221,-0.9856600000000001
222,-0.9406700000000001
223,-0.9533
224,-0.9730700000000001
225,-0.96486
226,-0.92345
227,-0.8277200000000001
228,-0.93924
229,-0.88956
230,-0.96773
231,-1.0359
232,-0.98041
233,-0.9951700000000001
234,-0.99751
235,-1.0656
236,-1.1191
237,-1.0345
238,-1.15
239,-1.1858
240,-1.078
241,-1.1619
242,-1.0818
243,-1.1769
244,-1.0958
245,-1.0687
246,-1.1299
247,-1.0883
248,-1.1216
249,-1.1957
250,-1.2037
251,-1.2066
252,-1.1388
253,-1.1319
254,-1.11
255,-1.0915
256,-1.143
257,-1.1122
258,-1.1067
259,-1.141
260,-1.2161
261,-1.2065
262,-1.1829
263,-1.1096
264,-1.1359
265,-1.1479
266,-1.1271
267,-1.1299
268,-1.1794
269,-1.1412
270,-1.2068
271,-1.2219
272,-1.2264
273,-1.2223
274,-1.2267
275,-1.2125
276,-1.1340000000000001
277,-1.1426
278,-1.246
279,-1.2382
280,-1.2417
281,-1.2419
282,-1.2517
283,-1.1649
284,-1.1645
285,-1.2467
286,-1.2421
287,-1.23
288,-1.1492
289,-1.1535
290,-1.1455
291,-1.246
292,-1.1546
293,-1.2505
294,-1.247
295,-1.1569
296,-1.1593
297,-1.1612
298,-1.1573
299,-1.1521
