[<text>
<title>eateries inc &lt;eats&gt; year net</title>
<dateline>    oklahoma city, march 31 -
    </dateline>shr profit 10 cts vs loss two cts
    net profit 140,332 vs loss 21,290
    revs 4,202,305 vs 1,692,976
    avg shrs 1,400,945 vs 1,106,500
 reuter
</text>]