time,value
0,-2.3427
1,-2.3427
2,-2.3427
3,-2.3427
4,-2.3427
5,-2.345
6,-2.345
7,-2.3472
8,-2.3563
9,-2.3607
10,-2.3603
11,-2.3598
12,-2.3591
13,-2.3583
14,-2.3597
15,-2.3586
16,-2.3574
17,-2.3561
18,-2.3546
19,-2.353
20,-2.3513
21,-2.3494
22,-2.3475
23,-2.3454
24,-2.3431
25,-2.3408
26,-2.3383
27,-2.3357
28,-2.333
29,-2.3302
30,-2.3272
31,-2.3241
32,-2.3209999999999997
33,-2.3177
34,-2.3143
35,-2.3219
36,-2.3265
37,-2.3228
38,-2.319
39,-2.3151
40,-2.3112
41,-2.3071
42,-2.3029
43,-2.2986
44,-2.2942
45,-2.2897
46,-2.2852
47,-2.2805
48,-2.2758
49,-2.2709
50,-2.266
51,-2.261
52,-2.2559
53,-2.2508
54,-2.2455
55,-2.2402
56,-2.2348
57,-2.2294
58,-2.2248
59,-2.2147
60,-2.2068
61,-2.2013
62,-2.197
63,-2.1914
64,-2.1856
65,-2.1798
66,-2.1739
67,-2.168
68,-2.1602
69,-2.1542
70,-2.1481
71,-2.1419
72,-2.1357
73,-2.1294
74,-2.1228
75,-2.1145
76,-2.1098
77,-2.1035
78,-2.0972
79,-2.0892
80,-2.0827
81,-2.0762
82,-2.0697
83,-2.0631
84,-2.0567
85,-2.0486
86,-2.042
87,-2.0354
88,-2.0272
89,-2.0205
90,-2.0138
91,-2.0057
92,-1.9978
93,-1.9909999999999999
94,-1.9843
95,-1.9775
96,-1.9691
97,-1.9623
98,-1.9556
99,-1.9478
100,-1.943
101,-1.9361
102,-1.9292
103,-1.9208
104,-1.9138
105,-1.9068
106,-1.8971
107,-1.8894
108,-1.8824
109,-1.8753
110,-1.8683
111,-1.8597
112,-1.8526
113,-1.8462
114,-1.8385
115,-1.83
116,-1.8229
117,-1.8157
118,-1.8071
119,-1.7999
120,-1.7930000000000001
121,-1.7855
122,-1.7791
123,-1.7719
124,-1.7646
125,-1.7559
126,-1.7487
127,-1.7414
128,-1.7321
129,-1.7261
130,-1.7188
131,-1.7101
132,-1.7028
133,-1.6963
134,-1.6889
135,-1.6821
136,-1.6747
137,-1.666
138,-1.6586
139,-1.6513
140,-1.6453
141,-1.6379
142,-1.6292
143,-1.6218
144,-1.6154
145,-1.608
146,-1.6030000000000002
147,-1.5956
148,-1.5868
149,-1.5794
150,-1.5719
151,-1.5645
152,-1.5586
153,-1.5513
154,-1.5425
155,-1.5351
156,-1.5276
157,-1.5193
158,-1.5121
159,-1.5052
160,-1.4977
161,-1.4902
162,-1.4813
163,-1.4738
164,-1.4662
165,-1.4591
166,-1.4514
167,-1.4438
168,-1.4363
169,-1.4287
170,-1.4198
171,-1.4122
172,-1.4046
173,-1.3969
174,-1.3912
175,-1.3841
176,-1.3765
177,-1.3689
178,-1.3599
179,-1.3523
180,-1.3446
181,-1.3363
182,-1.3293
183,-1.3204
184,-1.3127
185,-1.3057
186,-1.298
187,-1.2902
188,-1.2813
189,-1.2743
190,-1.268
191,-1.2603
192,-1.2513
193,-1.2435
194,-1.2358
195,-1.228
196,-1.2202
197,-1.2112
198,-1.2037
199,-1.1961
200,-1.1883
201,-1.1793
202,-1.1715
203,-1.1637
204,-1.1546
205,-1.1503
206,-1.1435
207,-1.1356
208,-1.1278
209,-1.12
210,-1.1109
211,-1.1031
212,-1.0952
213,-1.0873
214,-1.0822
215,-1.0735
216,-1.0652
217,-1.0573
218,-1.0494
219,-1.0404
220,-1.0324
221,-1.0245
222,-1.0166
223,-1.0075
224,-1.0008
225,-0.99456
226,-0.98662
227,-0.9786799999999999
228,-0.97072
229,-0.9616100000000001
230,-0.95363
231,-0.94565
232,-0.93766
233,-0.93225
234,-0.92569
235,-0.91771
236,-0.9097200000000001
237,-0.9017299999999999
238,-0.89259
239,-0.8845799999999999
240,-0.87656
241,-0.8685200000000001
242,-0.8613799999999999
243,-0.8549
244,-0.8466299999999999
245,-0.8386100000000001
246,-0.83057
247,-0.82252
248,-0.8144600000000001
249,-0.8064
250,-0.79723
251,-0.78915
252,-0.7810600000000001
253,-0.7729600000000001
254,-0.76486
255,-0.75675
256,-0.75241
257,-0.7451
258,-0.737
259,-0.7288899999999999
260,-0.72078
261,-0.7126600000000001
262,-0.70452
263,-0.69638
264,-0.68824
265,-0.68008
266,-0.67192
267,-0.66269
268,-0.65452
269,-0.6463399999999999
270,-0.63815
271,-0.62995
272,-0.62175
273,-0.61453
274,-0.60832
275,-0.60012
276,-0.59192
277,-0.58268
278,-0.57447
279,-0.56625
280,-0.55803
281,-0.5498
282,-0.5415800000000001
283,-0.53541
284,-0.52822
285,-0.51999
286,-0.51176
287,-0.50352
288,-0.49528
289,-0.48702
290,-0.47876
291,-0.47663999999999995
292,-0.47856000000000004
293,-0.47334
294,-0.46503999999999995
295,-0.45674
296,-0.44843
297,-0.44011000000000006
298,-0.43178999999999995
299,-0.42346000000000006
300,-0.41512
301,-0.40902
302,-0.40304
303,-0.39582
304,-0.38749
305,-0.37916
306,-0.36985
307,-0.36151
308,-0.35525
309,-0.35026999999999997
310,-0.34431
311,-0.33805999999999997
312,-0.32875
313,-0.32041
314,-0.31206999999999996
315,-0.30612
316,-0.29904000000000003
317,-0.2907
318,-0.2814
319,-0.27305
320,-0.26471
321,-0.25635
322,-0.25138
323,-0.24543
324,-0.23613
325,-0.2289
326,-0.22294
327,-0.21683000000000002
328,-0.2085
329,-0.20016
330,-0.19086
331,-0.18250999999999998
332,-0.17415999999999998
333,-0.16613
334,-0.15905999999999998
335,-0.15072
336,-0.14140999999999998
337,-0.13307
338,-0.12809
339,-0.12212999999999999
340,-0.11282
341,-0.10463
342,-0.09865800000000001
343,-0.091438
344,-0.083111
345,-0.074776
346,-0.065472
347,-0.05712999999999999
348,-0.048783999999999994
349,-0.040433
350,-0.032077999999999995
351,-0.028235000000000003
352,-0.022286
353,-0.0184
354,-0.011309
355,-0.0029858000000000003
356,0.006317100000000001
357,0.014649
358,0.021731
359,0.025638
360,0.033957
361,0.042152999999999996
362,0.048152999999999994
363,0.054276
364,0.062588
365,0.070904
366,0.080201
367,0.088524
368,0.096852
369,0.10519
370,0.11352999999999999
371,0.12157000000000001
372,0.12865
373,0.13698
374,0.14004
375,0.14212
376,0.15143
377,0.15448
378,0.15754
379,0.16781
380,0.17712
381,0.18017
382,0.18225
383,0.19059
384,0.1999
385,0.20824
386,0.21739
387,0.22544
388,0.23376999999999998
389,0.24211
390,0.25142
391,0.25977
392,0.26811999999999997
393,0.27648
394,0.28484
395,0.29189
396,0.29782
397,0.30617
398,0.31451999999999997
399,0.32384
400,0.3322
401,0.34057
402,0.3478
403,0.3537
404,0.3598
405,0.36816
406,0.37651999999999997
407,0.38584
408,0.39421
409,0.40259
410,0.40753
411,0.41552
412,0.42483999999999994
413,0.43093000000000004
414,0.43685
415,0.44711999999999996
416,0.45435
417,0.45643999999999996
418,0.46271
419,0.47107
420,0.47944
421,0.48362
422,0.48571000000000003
423,0.49313999999999997
424,0.49754
425,0.49378
426,0.49213999999999997
427,0.49121000000000004
428,0.49541
429,0.5038199999999999
430,0.5122399999999999
431,0.5122399999999999
432,0.5122399999999999
433,0.5122399999999999
434,0.51805
435,0.52108
436,0.52622
437,0.53205
438,0.5379
439,0.54376
440,0.5447
441,0.5465899999999999
442,0.55248
443,0.55971
444,0.56808
445,0.5764600000000001
446,0.5848399999999999
447,0.59322
448,0.6016100000000001
449,0.61001
450,0.6184
451,0.6268
452,0.6361399999999999
453,0.64454
454,0.65295
455,0.6613600000000001
456,0.66978
457,0.6782
458,0.6866300000000001
459,0.6903100000000001
460,0.6973
461,0.70572
462,0.71413
463,0.72348
464,0.7319
465,0.74033
466,0.74638
467,0.75217
468,0.75941
469,0.76875
470,0.77718
471,0.7856
472,0.78863
473,0.79074
474,0.7991699999999999
475,0.80338
476,0.80338
477,0.80338
478,0.80156
479,0.79791
480,0.79701
481,0.79399
482,0.79037
483,0.7834399999999999
484,0.77498
485,0.76562
486,0.75717
487,0.75113
488,0.74542
489,0.74029
490,0.73093
491,0.7240000000000001
492,0.72043
493,0.71195
494,0.7025899999999999
495,0.69412
496,0.68687
497,0.68118
498,0.67516
499,0.66669
500,0.65732
501,0.64885
502,0.6410399999999999
503,0.63625
504,0.6277699999999999
505,0.61841
506,0.60993
507,0.60302
508,0.59522
509,0.58586
510,0.57895
511,0.5733
512,0.56481
513,0.5584399999999999
514,0.55632
515,0.54996
516,0.54572
517,0.5436
518,0.5351199999999999
519,0.52787
520,0.52575
521,0.5194
522,0.51093
523,0.5067
524,0.5067
525,0.50189
526,0.49833
527,0.49478999999999995
528,0.49127
529,0.4849
530,0.47553
531,0.46703
532,0.45855
533,0.45502
534,0.44814
535,0.43964
536,0.43115
537,0.42265
538,0.41417
539,0.4048
540,0.39631
541,0.38783
542,0.37936
543,0.37089
544,0.36396999999999996
545,0.3583
546,0.34981999999999996
547,0.34045
548,0.33197
549,0.32473
550,0.31905
551,0.31303000000000003
552,0.30366
553,0.29588000000000003
554,0.28899
555,0.28262
556,0.27325
557,0.26476
558,0.25787
559,0.25223
560,0.24285
561,0.2356
562,0.2321
563,0.22398
564,0.2146
565,0.20773000000000003
566,0.20213
567,0.19275
568,0.18377000000000002
569,0.1782
570,0.16881
571,0.16197999999999999
572,0.15642999999999999
573,0.14789000000000002
574,0.13935
575,0.13082
576,0.12143
577,0.1129
578,0.10565
579,0.10222
580,0.09411
581,0.08472
582,0.079179
583,0.072366
584,0.063817
585,0.055274000000000004
586,0.046732
587,0.03734
588,0.028806000000000002
589,0.020276
590,0.011748
591,0.0057651
592,0.00020715
593,-0.0070488
594,-0.016439
595,-0.024971
596,-0.034361
597,-0.039914
598,-0.045888
599,-0.054426999999999996
600,-0.062962
601,-0.072351
602,-0.080881
603,-0.089409
604,-0.097929
605,-0.10645
606,-0.11117
607,-0.11887
608,-0.12825999999999999
609,-0.13424
610,-0.13979
611,-0.14918
612,-0.15857000000000002
613,-0.16710999999999998
614,-0.17522000000000001
615,-0.18076
616,-0.18802
617,-0.19655999999999998
618,-0.20595
619,-0.21449000000000001
620,-0.21789
621,-0.22471
622,-0.2341
623,-0.24265
624,-0.25204
625,-0.25801
626,-0.26353000000000004
627,-0.27292
628,-0.28102
629,-0.28651
630,-0.29591999999999996
631,-0.30448000000000003
632,-0.31388
633,-0.32113
634,-0.32661999999999997
635,-0.33471
636,-0.34412
637,-0.34958
638,-0.35419
639,-0.3636
640,-0.37035999999999997
641,-0.37577
642,-0.38518
643,-0.39326
644,-0.39864
645,-0.40591
646,-0.41398
647,-0.41933000000000004
648,-0.42251000000000005
649,-0.42782
650,-0.4337
651,-0.44313
652,-0.44978999999999997
653,-0.45506
654,-0.46448999999999996
655,-0.47036000000000006
656,-0.47342
657,-0.47645
658,-0.47946000000000005
659,-0.48243
660,-0.48536999999999997
661,-0.48828
662,-0.49116000000000004
663,-0.49112
664,-0.48236999999999997
665,-0.47431999999999996
666,-0.46557
667,-0.46258999999999995
668,-0.46535
669,-0.4659
670,-0.4686
671,-0.4598
672,-0.45166999999999996
673,-0.44287
674,-0.43406999999999996
675,-0.42526
676,-0.41645
677,-0.40829
678,-0.40168000000000004
679,-0.40206
680,-0.40176999999999996
681,-0.39293
682,-0.38409
683,-0.37525
684,-0.36704000000000003
685,-0.35819
686,-0.34934
687,-0.34049
688,-0.33605999999999997
689,-0.33225
690,-0.32461
691,-0.31635
692,-0.31474
693,-0.30869
694,-0.30485
695,-0.30485
696,-0.305
697,-0.30512
698,-0.29623
699,-0.28733000000000003
700,-0.27843
701,-0.2701
702,-0.2612
703,-0.25788
704,-0.2579
705,-0.24953000000000003
706,-0.24061
707,-0.23223000000000002
708,-0.22554000000000002
709,-0.22548
710,-0.22261999999999998
711,-0.21368
712,-0.20473
713,-0.19577999999999998
714,-0.18684
715,-0.17789000000000002
716,-0.16893
717,-0.15997999999999998
718,-0.15103
719,-0.14207
720,-0.13310999999999998
721,-0.12415
722,-0.11519000000000001
723,-0.10622999999999999
724,-0.097265
725,-0.088301
726,-0.081067
727,-0.076776
728,-0.069023
729,-0.060063
730,-0.051102999999999996
731,-0.042144
732,-0.033181999999999996
733,-0.024217
734,-0.014743000000000001
735,-0.0057758
736,0.0031912
737,0.012157
738,0.021126
739,0.030601
740,0.034874
741,0.040381
742,0.049343
743,0.058308000000000006
744,0.067272
745,0.07674700000000001
746,0.085713
747,0.094682
748,0.10365
749,0.11017
750,0.11394000000000001
751,0.1229
752,0.13187000000000001
753,0.14134000000000002
754,0.15031
755,0.15927
756,0.16824
757,0.1772
758,0.18219000000000002
759,0.18444000000000002
760,0.19116
761,0.20064
762,0.21011
763,0.21561
764,0.21836
765,0.2256
766,0.23456
767,0.23904
768,0.24129
769,0.24800999999999998
770,0.25698000000000004
771,0.26646
772,0.27542
773,0.27745
774,0.28347
775,0.29243
776,0.3014
777,0.31087
778,0.31984
779,0.3288
780,0.33482
781,0.33912
782,0.34808
783,0.35704
784,0.366
785,0.37496
786,0.38392
787,0.39288
788,0.40185
789,0.41133000000000003
790,0.42028999999999994
791,0.42926000000000003
792,0.43823
793,0.44546
794,0.44974
795,0.45748
796,0.46645
797,0.47541000000000005
798,0.48438000000000003
799,0.49333999999999995
800,0.50231
801,0.5090399999999999
802,0.5180100000000001
803,0.52698
804,0.53595
805,0.54492
806,0.5539
807,0.56287
808,0.57185
809,0.58132
810,0.5898100000000001
811,0.59928
812,0.60826
813,0.61724
814,0.62573
815,0.63472
816,0.6437
817,0.65269
818,0.66168
819,0.67067
820,0.67966
821,0.68865
822,0.6976399999999999
823,0.70711
824,0.7161
825,0.72509
826,0.7340899999999999
827,0.73777
828,0.7442
829,0.7531800000000001
830,0.76217
831,0.7711600000000001
832,0.78015
833,0.78915
834,0.79814
835,0.80761
836,0.8166
837,0.8256
838,0.8345899999999999
839,0.84359
840,0.84904
841,0.8532
842,0.8581700000000001
843,0.8671700000000001
844,0.87664
845,0.8856299999999999
846,0.8915700000000001
847,0.89575
848,0.90474
849,0.9137200000000001
850,0.92271
851,0.9317
852,0.9406899999999999
853,0.94968
854,0.95867
855,0.9676600000000001
856,0.9766600000000001
857,0.9747600000000001
858,0.97288
859,0.9710200000000001
860,0.9714299999999999
861,0.96962
862,0.97277
863,0.98135
864,0.9818399999999999
865,0.98096
866,0.98321
867,0.9854700000000001
868,0.9945
869,1.0035
870,1.0035
871,1.0035
872,1.0053
873,1.0070000000000001
874,1.0111
875,1.0129
876,1.0147
877,1.0166
878,1.0184
879,1.0261
880,1.0356
881,1.0379
882,1.0446
883,1.0536
884,1.0626
885,1.0671
886,1.0694
887,1.0784
888,1.0874
889,1.0964
890,1.1054
891,1.1144
892,1.1234
893,1.1324
894,1.1414
895,1.1504
896,1.1594
897,1.1684
898,1.1774
899,1.1864
900,1.1955
901,1.2045
902,1.2135
903,1.2225
904,1.2315
905,1.2405
906,1.2496
907,1.2586
908,1.2676
909,1.2734
910,1.2775
911,1.2865
912,1.2955
913,1.3045
914,1.3136
915,1.3226
916,1.3316
917,1.3406
918,1.3411
919,1.3419999999999999
920,1.3416
921,1.3412
922,1.3394
923,1.3377
924,1.3364
925,1.3359999999999999
926,1.3337
927,1.3243
928,1.3152
929,1.3136
930,1.3078
931,1.2983
932,1.2926
933,1.2887
934,1.2796
935,1.2706
936,1.2615
937,1.2525
938,1.2434
939,1.2344
940,1.2249
941,1.2159
942,1.2068
943,1.1997
944,1.1957
945,1.1904
946,1.1814
947,1.1719
948,1.1629
949,1.1538
950,1.1443
951,1.1409
952,1.1351
953,1.1261
954,1.1166
955,1.1076
956,1.1018
957,1.0979999999999999
958,1.0889
959,1.0795
960,1.0704
961,1.0632
962,1.061
963,1.0542
964,1.0451
965,1.0361
966,1.0315
967,1.0293
968,1.0229
969,1.0142
970,1.012
971,1.0097
972,1.0007
973,0.99161
974,0.99161
975,0.98854
976,0.98693
977,0.97935
978,0.9695
979,0.96567
980,0.9581
981,0.9490299999999999
982,0.93958
983,0.9305200000000001
984,0.92671
985,0.9233
986,0.9142299999999999
987,0.9051600000000001
988,0.8961
989,0.8870299999999999
990,0.87797
991,0.8689
992,0.85945
993,0.85039
994,0.8413299999999999
995,0.83226
996,0.8232
997,0.81414
998,0.80508
999,0.79602
1000,0.78696
1001,0.7779
1002,0.76884
1003,0.75978
1004,0.75073
1005,0.74541
1006,0.74158
1007,0.73439
1008,0.72533
1009,0.71627
1010,0.70721
1011,0.69776
1012,0.6887
1013,0.6796399999999999
1014,0.6705800000000001
1015,0.66902
1016,0.66333
1017,0.6542600000000001
1018,0.64481
1019,0.63575
1020,0.6281800000000001
1021,0.62666
1022,0.61721
1023,0.60815
1024,0.5987
1025,0.58963
1026,0.5805600000000001
1027,0.573
1028,0.56924
1029,0.56433
1030,0.5552600000000001
1031,0.54581
1032,0.53674
1033,0.5333600000000001
1034,0.52963
1035,0.52055
1036,0.51147
1037,0.50239
1038,0.49295
1039,0.48386999999999997
1040,0.47634
1041,0.47262
1042,0.46545
1043,0.45637
1044,0.44728999999999997
1045,0.43821000000000004
1046,0.42877
1047,0.42196000000000006
1048,0.41288
1049,0.4038
1050,0.39471999999999996
1051,0.38564
1052,0.38229
1053,0.37859
1054,0.3695
1055,0.36041999999999996
1056,0.35134
1057,0.3419
1058,0.33281
1059,0.32373
1060,0.31465
1061,0.30748000000000003
1062,0.30379
1063,0.29855
1064,0.28946
1065,0.28037
1066,0.27129000000000003
1067,0.2622
1068,0.25311999999999996
1069,0.24403000000000002
1070,0.23495
1071,0.22587
1072,0.21641999999999997
1073,0.20734
1074,0.19826
1075,0.18918
1076,0.1801
1077,0.17675
1078,0.1708
1079,0.16171
1080,0.15263
1081,0.14354
1082,0.13446
1083,0.12537
1084,0.11592999999999999
1085,0.10685
1086,0.09776699999999999
1087,0.088683
1088,0.079601
1089,0.07052
1090,0.061440999999999996
1091,0.052361000000000005
1092,0.043282
1093,0.034203
1094,0.025126
1095,0.016049
1096,0.0069721
1097,-0.0021048
1098,-0.011179999999999999
1099,-0.020252000000000003
1100,-0.029327
1101,-0.038399
1102,-0.044049
1103,-0.050048
1104,-0.059128
1105,-0.068205
1106,-0.07764700000000001
1107,-0.086726
1108,-0.095803
1109,-0.10107000000000001
1110,-0.10478
1111,-0.10967
1112,-0.11912
1113,-0.12506
1114,-0.13064
1115,-0.13973
1116,-0.14462
1117,-0.14689000000000002
1118,-0.15019000000000002
1119,-0.15607000000000001
1120,-0.15933
1121,-0.16193
1122,-0.16549
1123,-0.1658
1124,-0.16871
1125,-0.16766
1126,-0.16827
1127,-0.16885999999999998
1128,-0.17003
1129,-0.17089000000000001
1130,-0.17089000000000001
1131,-0.16660999999999998
1132,-0.15749000000000002
1133,-0.15604
1134,-0.15256
1135,-0.14369
1136,-0.13938
1137,-0.13813
1138,-0.13407
1139,-0.12517999999999999
1140,-0.11604
1141,-0.1069
1142,-0.10329
1143,-0.099426
1144,-0.09051000000000001
1145,-0.089128
1146,-0.090004
1147,-0.088563
1148,-0.0846
1149,-0.07544
1150,-0.066483
1151,-0.057323
1152,-0.05562
1153,-0.05179500000000001
1154,-0.042631
1155,-0.038231
1156,-0.035942
1157,-0.026775
1158,-0.017611
1159,-0.015319
1160,-0.010918
1161,-0.0019278
1162,0.007062100000000001
1163,0.01623
1164,0.025397
1165,0.034566
1166,0.036685
1167,0.040764999999999996
1168,0.049934
1169,0.059105
1170,0.065983
1171,0.075154
1172,0.084325
1173,0.09349600000000001
1174,0.1025
1175,0.11184000000000001
1176,0.12100999999999999
1177,0.13018
1178,0.13935
1179,0.14852
1180,0.15769
1181,0.16687000000000002
1182,0.17604
1183,0.18520999999999999
1184,0.19422999999999999
1185,0.2034
1186,0.21256999999999998
1187,0.22175
1188,0.23092
1189,0.23551
1190,0.2378
1191,0.24666999999999997
1192,0.2557
1193,0.25784
1194,0.25999
1195,0.26916999999999996
1196,0.27146
1197,0.2739
1198,0.28336999999999996
1199,0.29269
1200,0.29514
1201,0.29743
1202,0.3066
1203,0.31578
1204,0.32495
1205,0.33413000000000004
1206,0.3433
1207,0.35248
1208,0.36165
1209,0.36624
1210,0.36839
1211,0.37742
1212,0.38631
1213,0.3886
1214,0.39319
1215,0.40007
1216,0.40237
1217,0.40953
1218,0.41871
1219,0.4233
1220,0.42773999999999995
1221,0.43664
1222,0.44568
1223,0.45473
1224,0.45702
1225,0.46161
1226,0.47079
1227,0.47997
1228,0.48915
1229,0.49833
1230,0.50751
1231,0.51669
1232,0.52586
1233,0.5330199999999999
1234,0.53586
1235,0.5451699999999999
1236,0.55435
1237,0.56353
1238,0.5727
1239,0.5818800000000001
1240,0.59106
1241,0.60024
1242,0.60942
1243,0.61859
1244,0.6277699999999999
1245,0.63695
1246,0.64613
1247,0.6553
1248,0.6644800000000001
1249,0.67366
1250,0.68284
1251,0.69202
1252,0.70119
1253,0.71037
1254,0.71955
1255,0.72873
1256,0.73063
1257,0.7347100000000001
1258,0.7438899999999999
1259,0.75307
1260,0.76226
1261,0.77144
1262,0.78062
1263,0.78968
1264,0.79886
1265,0.80804
1266,0.81722
1267,0.8264100000000001
1268,0.8355899999999999
1269,0.8399399999999999
1270,0.8417899999999999
1271,0.8508600000000001
1272,0.8600399999999999
1273,0.86923
1274,0.87841
1275,0.8876
1276,0.8967799999999999
1277,0.90596
1278,0.91504
1279,0.9242299999999999
1280,0.9334100000000001
1281,0.9426
1282,0.95178
1283,0.96096
1284,0.97015
1285,0.9793299999999999
1286,0.9885200000000001
1287,0.9977
1288,1.0069
1289,1.0161
1290,1.0253
1291,1.0344
1292,1.0436
1293,1.0505
1294,1.0597
1295,1.0689
1296,1.0781
1297,1.0873
1298,1.0964
1299,1.1056
1300,1.1148
1301,1.124
1302,1.1332
1303,1.1424
1304,1.1516
1305,1.1607
1306,1.1699
1307,1.1791
1308,1.1883
1309,1.1975
1310,1.2067
1311,1.2159
1312,1.225
1313,1.2342
1314,1.2433
1315,1.2452
1316,1.2497
1317,1.2588
1318,1.2609
1319,1.2651
1320,1.2743
1321,1.2788
1322,1.2834
1323,1.2926
1324,1.2995
1325,1.3018
1326,1.3018
1327,1.3044
1328,1.3047
1329,1.314
1330,1.3209
1331,1.3232
1332,1.3301
1333,1.3393
1334,1.3485
1335,1.3531
1336,1.3554
1337,1.3622
1338,1.3714
1339,1.3806
1340,1.3897
1341,1.3989
1342,1.4081
1343,1.4172
1344,1.4264
1345,1.4285
1346,1.4282
1347,1.4374
1348,1.4465
1349,1.4557
1350,1.4649
1351,1.4741
1352,1.4833
1353,1.4925
1354,1.5017
1355,1.5109
1356,1.5201
1357,1.5293
1358,1.5384
1359,1.5476
1360,1.5568
1361,1.5594
1362,1.5666
1363,1.5757
1364,1.5849
1365,1.5941
1366,1.6033
1367,1.6125
1368,1.6217
1369,1.6309
1370,1.6401
1371,1.6469
1372,1.6489
1373,1.6533
1374,1.6624
1375,1.6645
1376,1.6643
1377,1.6640000000000001
1378,1.6638
1379,1.6636
1380,1.6634
1381,1.6632
1382,1.6586
1383,1.6493
1384,1.6469
1385,1.6422
1386,1.633
1387,1.6238
1388,1.6146
1389,1.6054
1390,1.5962
1391,1.587
1392,1.5778
1393,1.5686
1394,1.5594
1395,1.5503
1396,1.5411
1397,1.5319
1398,1.5227
1399,1.5135
1400,1.5043
1401,1.4951
1402,1.4859
1403,1.4767
1404,1.4675
1405,1.4583
1406,1.4491
1407,1.4445
1408,1.4421
1409,1.4352
1410,1.426
1411,1.4168
1412,1.4076
1413,1.3984
1414,1.3892
1415,1.3868
1416,1.3845
1417,1.3776
1418,1.3684
1419,1.3592
1420,1.3523
1421,1.35
1422,1.3454
1423,1.3362
1424,1.327
1425,1.3201
1426,1.3178
1427,1.3132
1428,1.304
1429,1.2994
1430,1.2971
1431,1.288
1432,1.2788
1433,1.2696
1434,1.2627
1435,1.2604
1436,1.2603
1437,1.258
1438,1.2534
1439,1.2442
1440,1.235
1441,1.2258
1442,1.2166
1443,1.2074
1444,1.1982
1445,1.189
1446,1.1798
1447,1.1707
1448,1.1615
1449,1.1523
1450,1.1431
1451,1.1339
1452,1.1247
1453,1.1178
1454,1.1155
1455,1.1086
1456,1.0994
1457,1.0902
1458,1.0811
1459,1.0719
1460,1.0627
1461,1.0535
1462,1.0443
1463,1.0351
1464,1.0259
1465,1.0213
1466,1.0190000000000001
1467,1.0098
1468,1.0006
1469,0.9913700000000001
1470,0.9821700000000001
1471,0.97298
1472,0.96378
1473,0.9545899999999999
1474,0.9454
1475,0.9362
1476,0.92701
1477,0.91781
1478,0.9086200000000001
1479,0.89943
1480,0.8948299999999999
1481,0.89255
1482,0.88797
1483,0.87877
1484,0.8695799999999999
1485,0.8603799999999999
1486,0.85119
1487,0.84201
1488,0.83281
1489,0.82362
1490,0.81442
1491,0.80523
1492,0.80066
1493,0.79843
1494,0.78925
1495,0.7800600000000001
1496,0.7708699999999999
1497,0.76167
1498,0.7525
1499,0.74331
1500,0.73411
1501,0.72722
1502,0.72492
1503,0.71802
1504,0.71343
1505,0.71113
1506,0.70428
1507,0.69511
1508,0.68595
1509,0.67678
1510,0.67219
1511,0.66995
1512,0.66306
1513,0.65386
1514,0.64467
1515,0.63548
1516,0.6262800000000001
1517,0.6170899999999999
1518,0.6079
1519,0.5987399999999999
1520,0.58955
1521,0.58035
1522,0.57116
1523,0.56197
1524,0.55277
1525,0.5435800000000001
1526,0.5343899999999999
1527,0.5251600000000001
1528,0.5159699999999999
1529,0.5067699999999999
1530,0.49758
1531,0.49291999999999997
1532,0.4905
1533,0.48131
1534,0.47212
1535,0.46292
1536,0.45373
1537,0.44451
1538,0.43532
1539,0.43072
1540,0.43072
1541,0.42152
1542,0.41923
1543,0.41693
1544,0.40774
1545,0.39854
1546,0.38935
1547,0.38015
1548,0.37094
1549,0.36174
1550,0.35255
1551,0.34336
1552,0.33416
1553,0.32724000000000003
1554,0.32487
1555,0.31794
1556,0.30875
1557,0.29955
1558,0.29036
1559,0.28115
1560,0.27196
1561,0.26277
1562,0.25356999999999996
1563,0.24438000000000001
1564,0.23518000000000003
1565,0.22599
1566,0.2168
1567,0.2076
1568,0.19841
1569,0.18921
1570,0.18002
1571,0.17082999999999998
1572,0.16163
1573,0.15244000000000002
1574,0.14324
1575,0.14095
1576,0.13404000000000002
1577,0.12483
1578,0.12022999999999999
1579,0.11792000000000001
1580,0.11332
1581,0.10643
1582,0.10413
1583,0.10182999999999999
1584,0.09263400000000001
1585,0.08344
1586,0.074246
1587,0.065052
1588,0.055857000000000004
1589,0.048962
1590,0.046676999999999996
1591,0.039811
1592,0.030617000000000002
1593,0.021434
1594,0.012242
1595,0.007714100000000001
1596,0.0054891
1597,-0.0037048000000000003
1598,-0.012899
1599,-0.022093
1600,-0.031285
1601,-0.040451999999999995
1602,-0.049645999999999996
1603,-0.058838
1604,-0.06803200000000001
1605,-0.077226
1606,-0.081727
1607,-0.081575
1608,-0.08369
1609,-0.083478
1610,-0.083239
1611,-0.082968
1612,-0.082897
1613,-0.08282300000000001
1614,-0.082511
1615,-0.08216799999999999
1616,-0.082079
1617,-0.08189199999999999
1618,-0.081499
1619,-0.081076
1620,-0.080626
1621,-0.08014500000000001
1622,-0.079635
1623,-0.079097
1624,-0.076236
1625,-0.07564
1626,-0.075015
1627,-0.07436
1628,-0.07367699999999999
1629,-0.06662799999999999
1630,-0.057284
1631,-0.048117
1632,-0.038951
1633,-0.035942
1634,-0.030802999999999997
1635,-0.021452000000000002
1636,-0.01839
1637,-0.013216
1638,-0.0040568
1639,0.005303100000000001
1640,0.014463
1641,0.021533
1642,0.024645
1643,0.031932
1644,0.041298
1645,0.050454
1646,0.057322000000000005
1647,0.060471000000000004
1648,0.065709
1649,0.07486
1650,0.084233
1651,0.09338400000000001
1652,0.098866
1653,0.10413
1654,0.11352000000000001
1655,0.11652
1656,0.12205999999999999
1657,0.1312
1658,0.14034000000000002
1659,0.14948
1660,0.15863
1661,0.16777
1662,0.17715999999999998
1663,0.18400999999999998
1664,0.19315
1665,0.2023
1666,0.21144000000000002
1667,0.22059
1668,0.22973000000000002
1669,0.23886999999999997
1670,0.24802
1671,0.25716
1672,0.26426
1673,0.26750999999999997
1674,0.27258000000000004
1675,0.28171999999999997
1676,0.29086
1677,0.3
1678,0.30939
1679,0.31853000000000004
1680,0.32156
1681,0.3246
1682,0.33399999999999996
1683,0.34313
1684,0.35226999999999997
1685,0.36166
1686,0.3708
1687,0.37790999999999997
1688,0.38123
1689,0.38861
1690,0.39774
1691,0.40687
1692,0.41601000000000005
1693,0.42513999999999996
1694,0.43454
1695,0.44367
1696,0.45281000000000005
1697,0.46193999999999996
1698,0.47108
1699,0.48021
1700,0.48961000000000005
1701,0.49294
1702,0.49804
1703,0.50718
1704,0.51631
1705,0.52544
1706,0.53457
1707,0.5437
1708,0.55284
1709,0.56223
1710,0.5713699999999999
1711,0.5805
1712,0.58963
1713,0.59877
1714,0.6079
1715,0.6170399999999999
1716,0.62011
1717,0.6231899999999999
1718,0.6326
1719,0.64173
1720,0.65086
1721,0.6602600000000001
1722,0.6693899999999999
1723,0.6765100000000001
1724,0.67988
1725,0.68728
1726,0.6964
1727,0.70553
1728,0.7149399999999999
1729,0.72406
1730,0.73319
1731,0.7343
1732,0.7377199999999999
1733,0.73888
1734,0.7420399999999999
1735,0.75116
1736,0.76057
1737,0.76969
1738,0.77484
1739,0.77833
1740,0.78774
1741,0.79686
1742,0.8062699999999999
1743,0.81539
1744,0.8245
1745,0.83194
1746,0.83545
1747,0.84259
1748,0.8517
1749,0.8608100000000001
1750,0.87023
1751,0.87935
1752,0.88845
1753,0.8975700000000001
1754,0.9066799999999999
1755,0.9101899999999999
1756,0.91341
1757,0.9225200000000001
1758,0.93163
1759,0.94105
1760,0.95016
1761,0.9592700000000001
1762,0.9638200000000001
1763,0.9661
1764,0.97293
1765,0.9820399999999999
1766,0.98659
1767,0.98887
1768,0.9957
1769,1.0048
1770,1.0139
1771,1.023
1772,1.0321
1773,1.0413
1774,1.0504
1775,1.0558
1776,1.0591
1777,1.0685
1778,1.0776
1779,1.0867
1780,1.0958
1781,1.1052
1782,1.1143
1783,1.1234
1784,1.1326
1785,1.1417
1786,1.1485
1787,1.1520000000000001
1788,1.1552
1789,1.1644
1790,1.1735
1791,1.1826
1792,1.192
1793,1.2011
1794,1.2102
1795,1.2193
1796,1.2245
1797,1.2258
1798,1.2293
1799,1.2307
1800,1.2401
1801,1.2492
1802,1.2583
1803,1.2677
1804,1.2768
1805,1.2859
1806,1.295
1807,1.3022
1808,1.3058
1809,1.3155
1810,1.325
1811,1.3341
1812,1.3412
1813,1.3448
1814,1.3501
1815,1.3592
1816,1.3683
1817,1.3773
1818,1.3864
1819,1.3955
1820,1.4046
1821,1.4137
1822,1.4228
1823,1.4319
1824,1.4409999999999998
1825,1.4501
1826,1.4592
1827,1.4686
1828,1.4777
1829,1.4868
1830,1.4924
1831,1.496
1832,1.5054
1833,1.5061
1834,1.5075
1835,1.5089
1836,1.5103
1837,1.5118
1838,1.5129
1839,1.5087
1840,1.5026
1841,1.5018
1842,1.4954
1843,1.4867
1844,1.4776
1845,1.469
1846,1.4667
1847,1.4622
1848,1.4531
1849,1.444
1850,1.4368
1851,1.4346
1852,1.4278
1853,1.4187
1854,1.4096
1855,1.4002
1856,1.3911
1857,1.3821
1858,1.3787
1859,1.3764
1860,1.3673
1861,1.3583
1862,1.3492
1863,1.3401
1864,1.3401
1865,1.3368
1866,1.3281
1867,1.3243
1868,1.3237
1869,1.3154
1870,1.3113
1871,1.3084
1872,1.3024
1873,1.2934
1874,1.2844
1875,1.2753
1876,1.2663
1877,1.2576
1878,1.2486
1879,1.2396
1880,1.2305
1881,1.2219
1882,1.2197
1883,1.2151
1884,1.2061
1885,1.1971
1886,1.1903
1887,1.188
1888,1.1831
1889,1.1741
1890,1.165
1891,1.156
1892,1.147
1893,1.1375
1894,1.1285
1895,1.1194
1896,1.1104
1897,1.1014
1898,1.0923
1899,1.0833
1900,1.0743
1901,1.0653
1902,1.0594
1903,1.0555
1904,1.046
1905,1.0406
1906,1.0367
1907,1.0272
1908,1.0182
1909,1.0114
1910,1.0023
1911,0.99331
1912,0.9842799999999999
1913,0.97524
1914,0.96621
1915,0.9571799999999999
1916,0.94815
1917,0.94363
1918,0.94137
1919,0.9346
1920,0.9300799999999999
1921,0.9278299999999999
1922,0.9188
1923,0.9097700000000001
1924,0.90074
1925,0.89171
1926,0.8826799999999999
1927,0.87366
1928,0.86419
1929,0.8551700000000001
1930,0.84614
1931,0.8371200000000001
1932,0.8281
1933,0.81907
1934,0.8105
1935,0.80148
1936,0.79246
1937,0.7834399999999999
1938,0.7744300000000001
1939,0.76541
1940,0.7631600000000001
1941,0.75865
1942,0.74964
1943,0.74738
1944,0.74062
1945,0.73161
1946,0.7226
1947,0.71359
1948,0.70412
1949,0.69511
1950,0.6861
1951,0.67709
1952,0.67571
1953,0.6712100000000001
1954,0.6622
1955,0.65273
1956,0.64326
1957,0.6338
1958,0.6310899999999999
1959,0.62883
1960,0.6198199999999999
1961,0.61757
1962,0.61532
1963,0.60631
1964,0.5973
1965,0.58783
1966,0.57882
1967,0.56982
1968,0.56439
1969,0.5603100000000001
1970,0.5531
1971,0.54408
1972,0.5350699999999999
1973,0.5260600000000001
1974,0.51705
1975,0.5080399999999999
1976,0.49903000000000003
1977,0.48957
1978,0.48056000000000004
1979,0.47155
1980,0.46255
1981,0.45353999999999994
1982,0.44454
1983,0.43506999999999996
1984,0.43096
1985,0.42554
1986,0.41653
1987,0.40752
1988,0.39852
1989,0.38905
1990,0.38004
1991,0.37104000000000004
1992,0.36203
1993,0.35303
1994,0.34403
1995,0.33813000000000004
1996,0.33628
1997,0.32727
1998,0.31827
1999,0.30926
2000,0.30025
2001,0.29125
2002,0.28178000000000003
2003,0.27278
2004,0.26377
2005,0.25477
2006,0.24577
2007,0.23676999999999998
2008,0.22955
2009,0.22543000000000002
2010,0.21775
2011,0.20874
2012,0.19974
2013,0.19072999999999998
2014,0.18127000000000001
2015,0.17226
2016,0.16326
2017,0.15425999999999998
2018,0.15014
2019,0.14426
2020,0.13525
2021,0.12624000000000002
2022,0.11723
2023,0.10777
2024,0.09876
2025,0.08975599999999999
2026,0.08075299999999999
2027,0.074393
2028,0.068511
2029,0.059501
2030,0.050493
2031,0.041485
2032,0.034729
2033,0.025723000000000003
2034,0.016256
2035,0.007250100000000001
2036,-0.0017527999999999999
2037,-0.010757
2038,-0.019758
2039,-0.028758999999999996
2040,-0.037758
2041,-0.046757
2042,-0.055753
2043,-0.064748
2044,-0.073742
2045,-0.082736
2046,-0.091728
2047,-0.10072
2048,-0.10970999999999999
2049,-0.11869
2050,-0.12768
2051,-0.13618
2052,-0.14515999999999998
2053,-0.15414
2054,-0.16312000000000001
2055,-0.1721
2056,-0.18108
2057,-0.19005
2058,-0.19902999999999998
2059,-0.20800000000000002
2060,-0.21696999999999997
2061,-0.22594
2062,-0.2344
2063,-0.23459000000000002
2064,-0.23803000000000002
2065,-0.24698
2066,-0.25593
2067,-0.26488
2068,-0.27383
2069,-0.28278000000000003
2070,-0.29119
2071,-0.30014
2072,-0.30906999999999996
2073,-0.31801
2074,-0.32695
2075,-0.33588
2076,-0.34481999999999996
2077,-0.35375
2078,-0.36268
2079,-0.37161
2080,-0.38053000000000003
2081,-0.38946
2082,-0.39838
2083,-0.4073
2084,-0.41622
2085,-0.42513999999999996
2086,-0.4279
2087,-0.42783000000000004
2088,-0.43673
2089,-0.44505
2090,-0.45393999999999995
2091,-0.45721000000000006
2092,-0.45705
2093,-0.46311
2094,-0.47198999999999997
2095,-0.48025
2096,-0.4885
2097,-0.48826
2098,-0.49143000000000003
2099,-0.5002800000000001
2100,-0.50849
2101,-0.5173300000000001
2102,-0.51984
2103,-0.51946
2104,-0.52828
2105,-0.5371
2106,-0.54525
2107,-0.55406
2108,-0.56286
2109,-0.56593
2110,-0.56543
2111,-0.57134
2112,-0.58012
2113,-0.5889
2114,-0.59767
2115,-0.60575
2116,-0.61452
2117,-0.6232800000000001
2118,-0.6320399999999999
2119,-0.64079
2120,-0.64883
2121,-0.64599
2122,-0.64891
2123,-0.65764
2124,-0.66564
2125,-0.67435
2126,-0.67724
2127,-0.67645
2128,-0.6822199999999999
2129,-0.69015
2130,-0.68928
2131,-0.68915
2132,-0.69703
2133,-0.6998
2134,-0.69665
2135,-0.69348
2136,-0.69242
2137,-0.68918
2138,-0.6859
2139,-0.68425
2140,-0.68342
2141,-0.68009
2142,-0.67673
2143,-0.67588
2144,-0.6712
2145,-0.66777
2146,-0.65838
2147,-0.65113
2148,-0.64555
2149,-0.63743
2150,-0.62892
2151,-0.61953
2152,-0.611
2153,-0.60247
2154,-0.5939399999999999
2155,-0.59137
2156,-0.5836600000000001
2157,-0.57514
2158,-0.56576
2159,-0.55723
2160,-0.55125
2161,-0.54566
2162,-0.53841
2163,-0.52989
2164,-0.52051
2165,-0.51198
2166,-0.50345
2167,-0.49491999999999997
2168,-0.49149
2169,-0.48463999999999996
2170,-0.47612
2171,-0.46758999999999995
2172,-0.4582
2173,-0.44966999999999996
2174,-0.44114
2175,-0.43686
2176,-0.43132
2177,-0.42448
2178,-0.41595
2179,-0.40742
2180,-0.39888
2181,-0.38949
2182,-0.38095
2183,-0.3724
2184,-0.36385
2185,-0.35917
2186,-0.35363
2187,-0.3451
2188,-0.33655
2189,-0.32800999999999997
2190,-0.31861
2191,-0.31006
2192,-0.3028
2193,-0.29728000000000004
2194,-0.29131
2195,-0.28276999999999997
2196,-0.27337
2197,-0.26482
2198,-0.25716
2199,-0.25034
2200,-0.2418
2201,-0.23240999999999998
2202,-0.22386
2203,-0.21918
2204,-0.21363000000000001
2205,-0.2051
2206,-0.19655999999999998
2207,-0.18802
2208,-0.17862
2209,-0.17007
2210,-0.16366
2211,-0.15814
2212,-0.15345
2213,-0.14490999999999998
2214,-0.13552
2215,-0.12697
2216,-0.121
2217,-0.11546
2218,-0.10607
2219,-0.09753400000000001
2220,-0.088142
2221,-0.080886
2222,-0.07534199999999999
2223,-0.06723
2224,-0.057839999999999996
2225,-0.054403999999999994
2226,-0.047552
2227,-0.039034
2228,-0.029649000000000002
2229,-0.021123
2230,-0.014278
2231,-0.0095518
2232,-0.00016985
2233,0.0079491
2234,0.013555000000000001
2235,0.02168
2236,0.030187000000000002
2237,0.038696
2238,0.048079000000000004
2239,0.051561
2240,0.060563
2241,0.069938
2242,0.074696
2243,0.080346
2244,0.088835
2245,0.09820599999999999
2246,0.1067
2247,0.11483
2248,0.12047999999999999
2249,0.12772999999999998
2250,0.1371
2251,0.14277
2252,0.14756
2253,0.15692
2254,0.16295
2255,0.16864
2256,0.17589000000000002
2257,0.18525
2258,0.18795
2259,0.19368
2260,0.19730999999999999
2261,0.20097
2262,0.21031999999999998
2263,0.21848
2264,0.22637
2265,0.2315
2266,0.24176999999999998
2267,0.24756999999999998
2268,0.25363
2269,0.26297
2270,0.26786
2271,0.2737
2272,0.27745
2273,0.28331999999999996
2274,0.29055
2275,0.29873
2276,0.30251999999999996
2277,0.30843000000000004
2278,0.31227
2279,0.3174
2280,0.32671999999999995
2281,0.33266
2282,0.33653
2283,0.34042
2284,0.34433
2285,0.34826999999999997
2286,0.35222
2287,0.35827
2288,0.36019
2289,0.36421
2290,0.36825
2291,0.37231
2292,0.37638
2293,0.38048000000000004
2294,0.37637
2295,0.37125
2296,0.37335
2297,0.37751999999999997
2298,0.37966
2299,0.37973
2300,0.37156
2301,0.36445
2302,0.3563
2303,0.35435
2304,0.3566
2305,0.35158
2306,0.34453
2307,0.34683
2308,0.35009
2309,0.342
2310,0.33391
2311,0.32582
2312,0.31775
2313,0.30967
2314,0.30161
2315,0.29355
2316,0.28822
2317,0.28179
2318,0.27371999999999996
2319,0.26566
2320,0.25649
2321,0.25045
2322,0.24401
2323,0.23868000000000003
2324,0.22951
2325,0.22016
2326,0.21374
2327,0.20456
2328,0.19833
2329,0.19193
2330,0.18477000000000002
2331,0.17669
2332,0.16751
2333,0.15943
2334,0.15412
2335,0.14770999999999998
2336,0.13853
2337,0.1323
2338,0.12591
2339,0.11767000000000001
2340,0.10957
2341,0.10319
2342,0.09790900000000001
2343,0.08871799999999999
2344,0.080468
2345,0.078443
2346,0.072366
2347,0.062089
2348,0.052904
2349,0.043719
2350,0.038582
2351,0.034536000000000004
2352,0.02847
2353,0.026447000000000002
2354,0.020388
2355,0.012311
2356,0.0031401999999999997
2357,-0.004924800000000001
2358,-0.008232799999999998
2359,-0.015569999999999999
2360,-0.024744
2361,-0.032813999999999996
2362,-0.040877
2363,-0.050041
2364,-0.058096
2365,-0.064341
2366,-0.070784
2367,-0.077934
2368,-0.085993
2369,-0.094045
2370,-0.1032
2371,-0.11124
2372,-0.11928
2373,-0.1273
2374,-0.13645
2375,-0.14294
2376,-0.1512
2377,-0.15922999999999998
2378,-0.16725
2379,-0.17639000000000002
2380,-0.1844
2381,-0.1924
2382,-0.19693
2383,-0.20631999999999998
2384,-0.21433000000000002
2385,-0.22233000000000003
2386,-0.23146
2387,-0.23945999999999998
2388,-0.24744000000000002
2389,-0.25286
2390,-0.2614
2391,-0.27053
2392,-0.27679000000000004
2393,-0.28331999999999996
2394,-0.29045
2395,-0.29846
2396,-0.30759000000000003
2397,-0.31672
2398,-0.32325
2399,-0.33152
2400,-0.33952
2401,-0.34865
2402,-0.35464
2403,-0.36005
2404,-0.36858
2405,-0.37658
2406,-0.38571
2407,-0.3937
2408,-0.39997
2409,-0.40651
2410,-0.41363999999999995
2411,-0.42163999999999996
2412,-0.42962
2413,-0.43873999999999996
2414,-0.44671000000000005
2415,-0.45466999999999996
2416,-0.46126000000000006
2417,-0.46668000000000004
2418,-0.47466
2419,-0.48263
2420,-0.49173999999999995
2421,-0.49968999999999997
2422,-0.50764
2423,-0.51508
2424,-0.52053
2425,-0.52964
2426,-0.5375800000000001
2427,-0.54668
2428,-0.55462
2429,-0.5625399999999999
2430,-0.57081
2431,-0.5774600000000001
2432,-0.58457
2433,-0.59249
2434,-0.60041
2435,-0.60949
2436,-0.61739
2437,-0.62529
2438,-0.63317
2439,-0.64105
2440,-0.64776
2441,-0.65525
2442,-0.66313
2443,-0.67101
2444,-0.67888
2445,-0.6867300000000001
2446,-0.6957800000000001
2447,-0.70362
2448,-0.71145
2449,-0.72018
2450,-0.7277
2451,-0.73554
2452,-0.74337
2453,-0.7511899999999999
2454,-0.76021
2455,-0.76802
2456,-0.77581
2457,-0.78359
2458,-0.7913600000000001
2459,-0.7991199999999999
2460,-0.80476
2461,-0.8135600000000001
2462,-0.8213299999999999
2463,-0.8290799999999999
2464,-0.83683
2465,-0.8458100000000001
2466,-0.85354
2467,-0.8598899999999999
2468,-0.8668
2469,-0.87385
2470,-0.8815799999999999
2471,-0.8893
2472,-0.8982600000000001
2473,-0.90596
2474,-0.91364
2475,-0.91743
2476,-0.92312
2477,-0.9320799999999999
2478,-0.9397700000000001
2479,-0.94745
2480,-0.95639
2481,-0.96405
2482,-0.9723299999999999
2483,-0.9793299999999999
2484,-0.98635
2485,-0.9940100000000001
2486,-1.0029
2487,-1.0106
2488,-1.0163
2489,-1.0233
2490,-1.031
2491,-1.0399
2492,-1.0475
2493,-1.0539
2494,-1.0609
2495,-1.068
2496,-1.0756
2497,-1.0845
2498,-1.0921
2499,-1.0973
2500,-1.1049
2501,-1.1125
2502,-1.1214
2503,-1.129
2504,-1.1341
2505,-1.1412
2506,-1.1476
2507,-1.1552
2508,-1.1641
2509,-1.1717
2510,-1.1775
2511,-1.1846
2512,-1.1921
2513,-1.1997
2514,-1.2086
2515,-1.2162
2516,-1.2237
2517,-1.232
2518,-1.2391
2519,-1.2461
2520,-1.255
2521,-1.2625
2522,-1.2713
2523,-1.2785
2524,-1.2868
2525,-1.2937
2526,-1.3013
2527,-1.3088
2528,-1.3146
2529,-1.3218
2530,-1.3293
2531,-1.3381
2532,-1.3456
2533,-1.3526
2534,-1.3598
2535,-1.3681
2536,-1.3756
2537,-1.3844
2538,-1.3918
2539,-1.3991
2540,-1.4068
2541,-1.4143
2542,-1.4231
2543,-1.4305
2544,-1.4364
2545,-1.4437
2546,-1.4511
2547,-1.4586
2548,-1.4673
2549,-1.4747
2550,-1.4821
2551,-1.4904
2552,-1.4977
2553,-1.5046
2554,-1.5119999999999998
2555,-1.5207
2556,-1.528
2557,-1.534
2558,-1.5414
2559,-1.5469
2560,-1.5556
2561,-1.5630000000000002
2562,-1.5698
2563,-1.5772
2564,-1.5855
2565,-1.5928
2566,-1.6015
2567,-1.6088
2568,-1.6144
2569,-1.6223
2570,-1.6295
2571,-1.6382
2572,-1.6455
2573,-1.6519
2574,-1.6594
2575,-1.6681
2576,-1.6753
2577,-1.6839
2578,-1.6908
2579,-1.6983
2580,-1.7065
2581,-1.7137
2582,-1.7224
2583,-1.7295
2584,-1.7371
2585,-1.7432
2586,-1.7518
2587,-1.7615
2588,-1.7690000000000001
2589,-1.7744
2590,-1.7830000000000001
2591,-1.7902
2592,-1.7984
2593,-1.806
2594,-1.8146
2595,-1.8232
2596,-1.8303
2597,-1.8385
2598,-1.8462
2599,-1.8547
2600,-1.8618
2601,-1.8703
2602,-1.8756
2603,-1.8833
2604,-1.8895
2605,-1.8965
2606,-1.905
2607,-1.9121
2608,-1.92
2609,-1.9277
2610,-1.9347
2611,-1.9417
2612,-1.9502
2613,-1.9571
2614,-1.964
2615,-1.9707
2616,-1.9785
2617,-1.9867
2618,-1.9936
2619,-2.0004
2620,-2.0072
2621,-2.0155
2622,-2.0222
2623,-2.0288
2624,-2.0371
2625,-2.0451
2626,-2.0533
2627,-2.0599
2628,-2.0665
2629,-2.073
2630,-2.0795
2631,-2.0859
2632,-2.0923
2633,-2.1003
2634,-2.1066
2635,-2.1128
2636,-2.119
2637,-2.1252
2638,-2.1313
2639,-2.1390000000000002
2640,-2.1475
2641,-2.1555
2642,-2.1615
2643,-2.1674
2644,-2.1733
2645,-2.1791
2646,-2.1849
2647,-2.1906
2648,-2.1948
2649,-2.2004
2650,-2.2059
2651,-2.2113
2652,-2.2167
2653,-2.222
2654,-2.2272
2655,-2.2324
2656,-2.2374
2657,-2.2424
2658,-2.2473
2659,-2.2521
2660,-2.2588
2661,-2.2615
2662,-2.2661
2663,-2.2706
2664,-2.2749
2665,-2.2792
2666,-2.2834
2667,-2.2875
2668,-2.2915
2669,-2.2954
2670,-2.2992
2671,-2.3029
2672,-2.3065
2673,-2.31
2674,-2.3134
2675,-2.3167
2676,-2.3198
2677,-2.3199
2678,-2.312
2679,-2.3091
2680,-2.3119
2681,-2.3146
2682,-2.3172
2683,-2.3196
2684,-2.322
2685,-2.3242
2686,-2.3263
2687,-2.3283
2688,-2.3301
2689,-2.3318
2690,-2.3312
2691,-2.3327
2692,-2.334
2693,-2.3352
2694,-2.3363
2695,-2.3373
2696,-2.3381
2697,-2.3388
2698,-2.3394
2699,-2.3398
2700,-2.3402
2701,-2.3403
2702,-2.3404
2703,-2.3404
2704,-2.3404
2705,-2.3404
2706,-2.3404
2707,-2.3404
2708,-2.3427
