time,value
0,-0.19963
1,-0.19963
2,-0.19963
3,-0.19963
4,-0.19963
5,-0.19963
6,-0.19963
7,-0.19963
8,-0.19963
9,-0.19963
10,-0.19963
11,-0.19963
12,-0.19963
13,-0.19963
14,-0.19963
15,-0.19963
16,-0.19963
17,-0.19963
18,-0.19963
19,-0.19963
20,-0.19963
21,-0.19963
22,-0.19963
23,-0.19963
24,-0.19963
25,-0.19963
26,-0.19963
27,-0.19963
28,-0.19963
29,-0.19963
30,-0.19963
31,-0.19963
32,-0.19963
33,-0.19963
34,-0.19963
35,-0.19963
36,-0.19963
37,-0.19963
38,-0.19963
39,-0.19963
40,-0.19963
41,-0.19963
42,-0.19963
43,-0.19963
44,-0.19963
45,-0.19963
46,-0.19963
47,-0.19963
48,-0.19963
49,-0.19963
50,-0.19963
51,-0.19963
52,-0.19963
53,-0.19963
54,-0.19963
55,-0.19963
56,-0.19963
57,-0.19963
58,-0.19963
59,-0.19963
60,-0.19963
61,-0.19963
62,-0.19963
63,-0.19963
64,-0.19963
65,-0.19963
66,-0.19963
67,-0.19963
68,-0.19963
69,-0.19963
70,-0.19963
71,-0.19963
72,-0.19963
73,-0.19963
74,-0.19963
75,-0.19963
76,-0.19963
77,-0.19963
78,-0.19963
79,5.9342
80,5.7288
81,3.9972
82,2.7059
83,-0.19963
84,-0.19963
85,-0.19963
86,-0.19963
87,-0.19963
88,-0.19963
89,-0.19963
90,-0.19963
91,-0.19963
92,-0.19963
93,-0.19963
94,-0.19963
95,-0.19963
