time,value
0,-0.73698
1,-0.83511
2,-0.83511
3,-0.83511
4,-0.73698
5,-0.83511
6,-0.83511
7,-0.83511
8,-0.73698
9,-0.83511
10,-0.83511
11,-0.83511
12,-0.73698
13,-0.83511
14,-0.83511
15,-0.83511
16,-0.73698
17,-0.83511
18,-0.83511
19,-0.83511
20,-0.73698
21,-0.83511
22,-0.83511
23,-0.83511
24,-0.73698
25,-0.83511
26,-0.83511
27,-0.83511
28,-0.73698
29,-0.83511
30,-0.83511
31,-0.83511
32,-0.63885
33,-0.63885
34,-0.83511
35,-0.73698
36,1.0293
37,1.3237
38,1.3237
39,1.4218
40,0.048042
41,1.2256
42,1.2256
43,1.2256
44,1.2256
45,1.2256
46,1.2256
47,-0.14820999999999998
48,1.4218
49,1.4218
50,0.63681
51,-0.73698
52,0.34242
53,1.4218
54,1.4218
55,1.2256
56,-0.83511
57,-0.73698
58,-0.83511
59,-0.73698
60,0.83306
61,1.52
62,1.4218
63,1.2256
64,1.3237
65,1.4218
66,1.4218
67,1.4218
68,1.3237
69,1.52
70,1.52
71,1.52
72,0.7349399999999999
73,-0.73698
74,0.83306
75,1.4218
76,1.4218
77,1.3237
78,1.2256
79,1.2256
80,0.34242
81,-0.83511
82,-0.73698
83,-0.83511
84,-0.73698
85,-0.83511
86,-0.73698
87,-0.83511
88,-0.73698
89,-0.83511
90,-0.73698
91,-0.83511
92,-0.73698
93,-0.83511
94,-0.73698
95,-0.83511
