time,value
0,1.3908
1,1.2342
2,0.13859000000000002
3,-0.8005399999999999
4,-0.8005399999999999
5,-0.8005399999999999
6,-0.8005399999999999
7,-0.8005399999999999
8,1.2342
9,1.5473
10,1.0777
11,-0.8005399999999999
12,-0.8005399999999999
13,-0.8005399999999999
14,-0.8005399999999999
15,-0.8005399999999999
16,-0.017935
17,1.5473
18,1.3908
19,-0.017935
20,-0.8005399999999999
21,-0.8005399999999999
22,-0.8005399999999999
23,-0.8005399999999999
24,-0.17446
25,1.7038
26,1.2342
27,1.2342
28,-0.8005399999999999
29,-0.8005399999999999
30,-0.8005399999999999
31,-0.8005399999999999
32,-0.8005399999999999
33,0.13859000000000002
34,1.7038
35,1.2342
36,-0.33098
37,-0.8005399999999999
38,-0.8005399999999999
39,-0.8005399999999999
40,-0.8005399999999999
41,-0.8005399999999999
42,1.3908
43,1.3908
44,1.0777
45,-0.8005399999999999
46,-0.8005399999999999
47,-0.8005399999999999
48,-0.8005399999999999
49,-0.8005399999999999
50,0.92119
51,1.5473
52,1.2342
53,0.45163000000000003
54,-0.8005399999999999
55,-0.8005399999999999
56,-0.8005399999999999
57,-0.8005399999999999
58,-0.8005399999999999
59,0.76467
60,1.5473
61,1.2342
62,-0.8005399999999999
63,-0.8005399999999999
64,-0.8005399999999999
65,-0.8005399999999999
66,-0.8005399999999999
67,-0.8005399999999999
68,1.7038
69,1.3908
70,0.45163000000000003
71,-0.8005399999999999
72,-0.8005399999999999
73,-0.8005399999999999
74,-0.8005399999999999
75,-0.8005399999999999
76,0.60815
77,1.5473
78,1.2342
79,-0.8005399999999999
80,-0.8005399999999999
81,-0.8005399999999999
82,-0.8005399999999999
83,-0.8005399999999999
84,1.7038
85,1.3908
86,1.2342
87,1.2342
88,1.0777
89,-0.8005399999999999
90,-0.8005399999999999
91,-0.8005399999999999
92,-0.8005399999999999
93,-0.8005399999999999
94,1.2342
95,1.3908
