time,value
0,-0.9595299999999999
1,-0.9595299999999999
2,-0.9595299999999999
3,-0.9595299999999999
4,-1.1721
5,-1.1721
6,-0.9595299999999999
7,-0.9595299999999999
8,-0.90638
9,-0.9595299999999999
10,-0.9595299999999999
11,-1.0127
12,-0.9595299999999999
13,-0.9595299999999999
14,-1.0127
15,-1.1721
16,-1.119
17,-1.1721
18,-1.2253
19,-1.1721
20,-1.1721
21,-1.1721
22,-1.2253
23,-1.1721
24,-1.1721
25,-1.1721
26,-1.2253
27,-1.1721
28,-1.1721
29,-1.2253
30,-1.1721
31,0.36930999999999997
32,0.7945300000000001
33,0.7945300000000001
34,0.7945300000000001
35,0.7945300000000001
36,0.8476899999999999
37,0.7945300000000001
38,0.74138
39,0.7945300000000001
40,0.74138
41,0.8476899999999999
42,0.7945300000000001
43,0.74138
44,0.7945300000000001
45,0.7945300000000001
46,0.74138
47,0.7945300000000001
48,0.7945300000000001
49,0.7945300000000001
50,0.8476899999999999
51,0.7945300000000001
52,0.8476899999999999
53,-1.0127
54,-1.1721
55,-1.2253
56,-1.1721
57,-1.1721
58,-1.1721
59,-1.2253
60,-1.1721
61,-1.1721
62,-1.1721
63,-1.2253
64,-0.26854
65,0.7945300000000001
66,0.7945300000000001
67,0.7945300000000001
68,0.7945300000000001
69,0.8476899999999999
70,0.7945300000000001
71,0.7945300000000001
72,1.0603
73,1.0071
74,1.0603
75,1.0071
76,1.0071
77,1.0071
78,1.0071
79,1.0603
80,1.0603
81,1.0071
82,1.0071
83,1.0603
84,1.0071
85,1.0071
86,1.0603
87,1.0603
88,0.7945300000000001
89,1.0071
90,0.8476899999999999
91,0.9540000000000001
92,1.0603
93,1.0603
94,1.0071
95,1.0603
