time,value
0,-0.082051
1,-0.052249000000000004
2,-0.090838
3,-0.15288
4,-0.17012
5,-0.38138
6,-0.5454399999999999
7,-0.55507
8,-0.51645
9,-0.53358
10,-0.099243
11,-0.07599299999999999
12,-0.02427
13,0.016876
14,0.044782
15,0.14372000000000001
16,0.24993
17,0.33323
18,0.42983999999999994
19,0.48086
20,0.53076
21,0.5944
22,0.8264600000000001
23,1.1643
24,1.1204
25,1.8438
26,2.7611
27,2.8323
28,2.0257
29,1.0189
30,1.1054
31,0.043955
32,-0.8756799999999999
33,-1.2348
34,-1.4494
35,-2.0753
36,-1.9588
37,-1.8918
38,-2.235
39,-2.4085
40,-2.4237
41,-2.918
42,-3.1029
43,-2.1228
44,-2.2544
45,-2.1777
46,-1.8238
47,-1.4166
48,-0.76564
49,-0.40599
50,-0.098324
51,0.69388
52,1.1468
53,1.4004
54,1.0218
55,0.79085
56,1.1811
57,1.035
58,0.80535
59,0.87059
60,1.1358
61,0.55386
62,0.08336
63,0.6584
64,0.37714000000000003
65,1.2409999999999999
66,0.7740199999999999
67,1.1366
68,1.2701
69,1.3139
70,0.82668
71,0.21406999999999998
72,0.37298000000000003
73,0.72644
74,0.7930699999999999
75,0.23121
76,0.12971
77,1.0023
78,0.95999
79,0.029334
80,2.2233
81,0.34863
82,0.90925
83,1.0268
84,0.82658
85,0.80692
86,0.74308
87,0.87756
88,0.48558999999999997
89,-0.02505
90,0.40862
91,1.5219
92,1.7233
93,1.6726
94,1.2285
95,1.0908
96,0.75139
97,0.9339700000000001
98,0.93227
99,0.80371
100,0.7589199999999999
101,1.4717
102,1.4969
103,1.4518
104,1.4963
105,1.6839
106,1.6002
107,1.5691
108,1.1064
109,1.115
110,0.7972899999999999
111,-0.17944000000000002
112,-0.65986
113,-0.30823
114,-1.4309
115,-1.9892
116,-1.1793
117,-1.4658
118,-2.6779
119,-2.3234
120,-2.4119
121,-3.6194
122,-4.0843
123,-3.0458
124,-3.3585
125,-3.2989
126,-1.7452
127,-1.6965
128,-2.2754
129,-0.80992
130,-0.004895
131,0.022515
132,-0.37076
133,0.061980999999999994
134,0.70181
135,1.1307
136,1.2605
137,1.3095
138,0.3957
139,1.2092
140,1.7874
141,1.6149
142,0.38514
143,-0.22696
144,-0.027562
145,0.4002
146,0.58486
147,0.57962
148,0.51615
149,0.58615
150,0.76889
151,0.60902
152,0.2835
153,0.028009
154,-0.10532000000000001
155,-0.09232699999999999
156,-0.015746
157,0.08367999999999999
158,0.13798
159,0.21759
160,0.37834
161,0.40503
162,0.41541000000000006
163,0.43085
164,0.40221999999999997
165,0.42116000000000003
166,0.3443
167,0.2016
168,0.15893
169,0.10515999999999999
170,0.10363
171,0.31575
172,0.31828
173,0.33738
174,0.33394
175,0.43007
176,0.42628
177,0.30689
178,0.27595
179,0.27216
180,0.29539
181,0.097508
182,0.10959
183,0.16111
184,0.34715999999999997
185,0.31031
186,0.29275
187,0.27061
188,0.23739000000000002
189,0.30430999999999997
190,0.31586
191,-0.020991
192,-0.07120800000000001
193,-0.062163
194,-0.039667
195,-0.044844999999999996
196,-0.033213
197,-0.049788
198,-0.17388
199,-0.18664
200,-0.18339
201,-0.19341
202,0.16209
203,0.2199
204,-0.1546
205,-0.16783
206,-0.21020999999999998
207,-0.16865
208,0.15455
209,0.13707
210,0.13121
211,0.15035
212,0.1455
213,0.11132
214,0.072931
215,-0.32766
216,-0.31733
217,-0.30029
218,-0.30109
219,-0.32566
220,-0.30929
221,-0.29056
222,-0.27536
223,0.06903200000000001
224,0.091402
225,0.11503
226,0.12455
227,0.1216
228,0.11076
229,0.09701699999999999
230,-0.28021999999999997
231,-0.49905
232,-0.5210199999999999
233,-0.52515
234,-0.52798
235,-0.33451
236,-0.36123
237,-0.38326
238,-0.40753
239,-0.43811000000000005
240,-0.44853999999999994
241,-0.036822
242,-0.038706
243,0.0028667
244,0.01686
245,-0.40266
246,-0.41600000000000004
247,-0.41503
248,-0.41117
249,-0.010975
250,-0.43066000000000004
251,-0.4362
252,-0.42618
253,-0.42075
254,-0.43391
255,-0.44595
256,-0.015509
257,0.0025608000000000002
258,-0.0010632
259,-0.010836
260,-0.0085223
261,0.0020636999999999995
262,-0.006840000000000001
263,-0.0029197
264,-0.00618
265,-0.027752999999999996
266,-0.041644
267,-0.034477
268,-0.026508999999999998
269,-0.022992
270,-0.018277
271,-0.4475
272,-0.44671000000000005
273,-0.44443
274,-0.55348
275,-0.66299
276,-0.44937
277,-0.45756
278,-0.040906
279,-0.049551
280,-0.043272000000000005
281,-0.0045449
282,-0.052263
283,-0.056028999999999995
284,-0.47898
285,-0.045792
286,-0.048802
287,-0.043805000000000004
288,-0.47162
289,-0.4888
290,-0.4924
291,-0.4992
292,-0.49928999999999996
293,-0.48883999999999994
294,-0.48144
295,-0.48298
296,-0.4901
297,-0.49663999999999997
298,-0.49958
299,-0.49693000000000004
