time,value
0,-0.16935
1,-0.16935
2,-0.16935
3,-0.16935
4,-0.16935
5,-0.16935
6,-0.16935
7,-0.16935
8,-0.16935
9,-0.16935
10,-0.16935
11,-0.16935
12,-0.16935
13,-0.16935
14,-0.16935
15,-0.16935
16,-0.16935
17,-0.16935
18,-0.16935
19,-0.16935
20,-0.16935
21,-0.16935
22,-0.16935
23,-0.16935
24,-0.16935
25,-0.16935
26,-0.16935
27,-0.16935
28,-0.16935
29,-0.16935
30,-0.16935
31,-0.16935
32,-0.16935
33,-0.16935
34,-0.16935
35,-0.16935
36,-0.16935
37,-0.16935
38,-0.16935
39,-0.16935
40,-0.16935
41,-0.16935
42,-0.16935
43,-0.16935
44,-0.16935
45,-0.16935
46,-0.16935
47,-0.16935
48,-0.16935
49,-0.16935
50,-0.16935
51,-0.16935
52,-0.16935
53,-0.16935
54,-0.16935
55,-0.16935
56,-0.16935
57,-0.16935
58,-0.16935
59,-0.16935
60,-0.16935
61,-0.16935
62,-0.16935
63,-0.16935
64,-0.16935
65,-0.16935
66,-0.16935
67,-0.16935
68,-0.16935
69,-0.16935
70,-0.16935
71,-0.16935
72,-0.16935
73,-0.16935
74,-0.16935
75,-0.16935
76,-0.16935
77,-0.16935
78,-0.16935
79,-0.16935
80,-0.16935
81,-0.16935
82,-0.16935
83,-0.16935
84,0.038466
85,3.2197
86,3.0118
87,0.10240999999999999
88,0.1184
89,0.038466
90,8.543
91,-0.16935
92,-0.16935
93,-0.16935
94,-0.16935
95,-0.16935
