time,value
0,0.35651
1,0.47908
2,0.57907
3,0.52735
4,0.53303
5,0.52262
6,0.62302
7,0.63875
8,0.5909800000000001
9,0.5173
10,0.29536
11,0.26485
12,0.25605
13,0.17672000000000002
14,0.23231999999999997
15,0.24076
16,0.35219
17,0.3679
18,0.37746
19,0.31235
20,0.25631
21,0.26843
22,0.34196
23,0.31112
24,0.34223000000000003
25,0.34201
26,0.35498
27,0.35048
28,0.37961
29,0.41841999999999996
30,0.45593
31,0.48348
32,0.45848
33,0.37344
34,0.35191
35,0.38305
36,0.36308
37,0.38644
38,0.32787
39,0.31126
40,0.24793
41,0.26028
42,0.22953
43,0.20834
44,0.11285999999999999
45,0.05864400000000001
46,-0.07588500000000001
47,-0.11979000000000001
48,-0.3019
49,-0.42618
50,-0.59248
51,-0.8608899999999999
52,-1.0622
53,-1.1638
54,-1.5295
55,-1.864
56,-1.9486
57,-2.1236
58,-2.1412
59,-2.0313
60,-1.9949
61,-1.9001
62,-1.5190000000000001
63,-1.3977
64,-1.3885
65,-1.1104
66,-0.97924
67,-0.75271
68,-0.6637
69,-0.54446
70,-0.33501
71,-0.13291
72,0.15328
73,0.20332999999999998
74,0.32535
75,0.5732
76,0.52376
77,0.37240999999999996
78,1.2323
79,1.1302
80,0.75488
81,0.42903
82,0.31863
83,0.29896
84,0.4139
85,0.44948999999999995
86,0.30863
87,0.49933999999999995
88,0.7612399999999999
89,0.97101
90,0.9998600000000001
91,1.1461
92,1.3063
93,0.98711
94,0.76183
95,0.62752
96,0.45278999999999997
97,0.33303
98,-0.04311
99,-0.22413000000000002
100,-0.29251
101,-0.53071
102,-0.7028
103,-0.70262
104,-0.7265199999999999
105,-0.8807799999999999
106,-0.8698299999999999
107,-0.94583
108,-0.80262
109,-0.80267
110,-0.66577
111,-0.43871000000000004
112,-0.20769
113,-0.11092
114,0.10479000000000001
115,0.17065999999999998
116,0.1412
117,0.51221
118,0.33898
119,0.36116
120,0.49943000000000004
121,0.2616
122,0.32975
123,0.10520999999999998
124,0.34768000000000004
125,-0.048085
126,-0.27651
127,-0.20324
128,-0.6117600000000001
129,-0.83901
130,-0.72613
131,-1.2405
132,-1.4789
133,-1.3558
134,-1.3419999999999999
135,-1.3951
136,-1.1578
137,-1.1421
138,-1.1586
139,-1.0142
140,-1.1495
141,-1.2967
142,-1.3716
143,-1.4158
144,-1.5149
145,-1.2855
146,-1.2108
147,-1.0986
148,-0.8982700000000001
149,-0.6236
150,-0.5938100000000001
151,-0.3657
152,-0.13193
153,-0.029613
154,0.43838
155,0.83255
156,0.39155999999999996
157,0.68829
158,1.1363
159,1.0351
160,1.2065
161,2.0796
162,2.0071
163,0.15764
164,0.052858
165,0.33388
166,0.3473
167,0.25472
168,0.51283
169,0.50898
170,0.53761
171,1.0386
172,0.6938
173,0.7127
174,0.9941200000000001
175,0.79305
176,0.51425
177,0.38791
178,-0.06955599999999999
179,-1.0490000000000002
180,-1.4064
181,-1.764
182,-2.8488
183,-2.7462
184,-2.6662
185,-3.207
186,-3.1574
187,-2.4169
188,-2.5124
189,-2.596
190,-2.927
191,-3.6269
192,-3.2601
193,-3.4855
194,-3.1236
195,-2.1296
196,-1.4278
197,-1.2783
198,-0.91646
199,-0.40062
200,0.22328
201,1.1341
202,1.6347
203,1.8638
204,1.4335
205,0.92906
206,0.68852
207,0.66801
208,0.8974
209,1.16
210,1.4097
211,1.3947
212,1.2049
213,0.97106
214,0.8193799999999999
215,0.78541
216,0.76032
217,0.7442300000000001
218,0.91706
219,1.0035
220,0.9613
221,0.8943200000000001
222,0.7911600000000001
223,0.44938
224,0.42406000000000005
225,0.5463899999999999
226,0.50836
227,0.4984
228,0.73332
229,0.64252
230,0.48396000000000006
231,0.45231000000000005
232,0.58152
233,0.37743000000000004
234,0.67366
235,0.6906899999999999
236,0.5727800000000001
237,0.45075
238,0.55886
239,0.6671199999999999
240,0.6399600000000001
241,0.77881
242,0.62739
243,0.5744100000000001
244,0.46705
245,0.45487
246,0.56839
247,0.56024
248,0.57622
249,0.6837300000000001
250,0.68896
251,0.59639
252,0.69231
253,0.6916
254,0.57534
255,0.65649
256,0.5778399999999999
257,0.47342
258,0.46787
259,0.46471
260,0.5870000000000001
261,0.59009
262,0.6241300000000001
263,0.65241
264,0.62893
265,0.5062399999999999
266,0.44683
267,0.45377
268,0.34676
269,0.34757
270,0.45782
271,0.46053999999999995
272,0.52773
273,0.58102
274,0.46853
275,0.46767
276,0.46406000000000003
277,0.53688
278,0.45916
279,0.44896
280,0.41835
281,0.3432
282,0.22185
283,0.2186
284,0.13913
285,0.34324
286,0.33926
287,0.31618
288,0.33836
289,0.42378000000000005
290,0.32313000000000003
291,0.32141
292,0.32348000000000005
293,0.31961
294,0.19655999999999998
295,0.2186
296,0.21461999999999998
297,0.21081999999999998
298,0.20654
299,0.20601999999999998
