time,value
0,-1.1246
1,-1.1246
2,-1.1246
3,-1.2091
4,-1.1246
5,-1.1246
6,-1.1246
7,-1.2091
8,-1.1246
9,-1.1246
10,-1.1246
11,-1.2091
12,-1.1246
13,-1.1246
14,-1.1246
15,-1.2091
16,-1.1246
17,-1.1246
18,-1.1246
19,-1.2091
20,-1.1246
21,-1.1246
22,-1.1246
23,-1.2091
24,-1.1246
25,-1.1246
26,-1.1246
27,-1.2091
28,-1.1246
29,-1.1246
30,-1.1246
31,-1.2091
32,-1.1246
33,-1.1246
34,-1.1246
35,-1.2091
36,-1.1246
37,-1.1246
38,0.98731
39,0.98731
40,0.9028299999999999
41,0.81835
42,1.9165
43,1.5786
44,2.3389
45,1.7476
46,0.9028299999999999
47,0.9028299999999999
48,0.81835
49,0.9028299999999999
50,0.56493
51,0.98731
52,0.9028299999999999
53,0.73388
54,0.73388
55,0.81835
56,0.9028299999999999
57,0.9028299999999999
58,0.73388
59,0.39598
60,0.3115
61,0.3115
62,0.3115
63,0.6494
64,0.98731
65,0.9028299999999999
66,1.8321
67,1.0718
68,1.9165
69,0.6494
70,0.39598
71,0.73388
72,0.9028299999999999
73,0.48045
74,0.39598
75,0.3115
76,0.3115
77,0.39598
78,0.3115
79,0.39598
80,0.6494
81,0.9028299999999999
82,0.9028299999999999
83,0.6494
84,0.6494
85,0.3115
86,0.39598
87,0.3115
88,0.3115
89,0.3115
90,0.39598
91,0.3115
92,0.3115
93,0.3115
94,0.3115
95,0.39598
