time,value
0,-0.26061
1,-0.26061
2,-0.26061
3,-0.26061
4,-0.26061
5,-0.26061
6,-0.26061
7,-0.26061
8,-0.26061
9,-0.26061
10,-0.26061
11,-0.26061
12,-0.26061
13,-0.26061
14,-0.26061
15,-0.26061
16,-0.26061
17,-0.26061
18,-0.26061
19,-0.26061
20,-0.26061
21,-0.26061
22,-0.26061
23,-0.26061
24,-0.26061
25,-0.26061
26,-0.26061
27,-0.26061
28,-0.26061
29,-0.26061
30,2.6306
31,0.70314
32,-0.26061
33,-0.26061
34,-0.26061
35,-0.26061
36,-0.26061
37,-0.26061
38,-0.26061
39,-0.26061
40,-0.26061
41,-0.26061
42,-0.26061
43,-0.26061
44,-0.26061
45,-0.26061
46,-0.26061
47,-0.26061
48,-0.26061
49,-0.26061
50,-0.26061
51,-0.26061
52,-0.26061
53,-0.26061
54,-0.26061
55,-0.26061
56,3.5173
57,-0.26061
58,-0.26061
59,-0.26061
60,-0.26061
61,-0.26061
62,3.2089
63,-0.26061
64,-0.26061
65,-0.26061
66,-0.26061
67,-0.26061
68,3.2474
69,-0.26061
70,-0.26061
71,-0.26061
72,-0.26061
73,5.252000000000001
74,-0.26061
75,-0.26061
76,-0.26061
77,-0.26061
78,-0.26061
79,-0.26061
80,-0.26061
81,-0.26061
82,-0.26061
83,-0.26061
84,4.5581
85,-0.18350999999999998
86,-0.26061
87,-0.26061
88,-0.26061
89,-0.26061
90,-0.26061
91,-0.26061
92,-0.26061
93,-0.26061
94,-0.26061
95,-0.26061
