time,value
0,-0.37884
1,-0.37884
2,-0.37884
3,-0.37884
4,-0.37884
5,-0.37884
6,-0.37884
7,-0.37884
8,-0.37884
9,-0.37884
10,-0.37884
11,-0.37884
12,-0.029142
13,-0.37884
14,-0.37884
15,-0.37884
16,-0.37884
17,-0.37884
18,-0.37884
19,-0.37884
20,-0.029142
21,-0.37884
22,-0.37884
23,-0.37884
24,-0.37884
25,-0.37884
26,-0.37884
27,-0.37884
28,-0.37884
29,-0.37884
30,-0.37884
31,-0.37884
32,-0.37884
33,-0.37884
34,-0.37884
35,-0.37884
36,-0.37884
37,-0.37884
38,-0.37884
39,-0.37884
40,-0.029142
41,-0.37884
42,-0.37884
43,-0.37884
44,-0.37884
45,-0.37884
46,-0.37884
47,-0.37884
48,-0.37884
49,-0.37884
50,-0.37884
51,-0.37884
52,-0.37884
53,-0.37884
54,-0.37884
55,-0.37884
56,-0.029142
57,-0.37884
58,-0.37884
59,-0.37884
60,-0.37884
61,-0.37884
62,-0.37884
63,-0.37884
64,-0.37884
65,-0.37884
66,-0.37884
67,-0.37884
68,-0.37884
69,0.84511
70,0.49541
71,-0.37884
72,-0.37884
73,-0.37884
74,-0.37884
75,-0.37884
76,0.14570999999999998
77,0.6702600000000001
78,0.6702600000000001
79,0.84511
80,0.6702600000000001
81,0.84511
82,-0.37884
83,-0.37884
84,-0.37884
85,2.4188
86,3.8176
87,3.8176
88,3.8176
89,3.6427
90,3.1182
91,2.7685
92,0.32056
93,-0.37884
94,-0.37884
95,-0.37884
