time,value
0,-0.17559
1,-0.17559
2,-0.17559
3,-0.17559
4,-0.17559
5,-0.17559
6,-0.17559
7,-0.17559
8,-0.17559
9,-0.17559
10,-0.17559
11,-0.17559
12,-0.17559
13,-0.17559
14,-0.17559
15,-0.17559
16,-0.17559
17,-0.17559
18,-0.17559
19,-0.17559
20,-0.17559
21,-0.17559
22,-0.17559
23,-0.17559
24,-0.17559
25,-0.17559
26,-0.17559
27,-0.17559
28,-0.17559
29,-0.17559
30,-0.17559
31,-0.17559
32,-0.17559
33,-0.17559
34,-0.17559
35,-0.17559
36,-0.17559
37,-0.17559
38,-0.17559
39,-0.17559
40,-0.17559
41,-0.17559
42,-0.17559
43,-0.17559
44,-0.17559
45,-0.17559
46,-0.17559
47,-0.17559
48,-0.17559
49,-0.17559
50,-0.17559
51,-0.17559
52,-0.17559
53,-0.17559
54,-0.17559
55,-0.17559
56,-0.17559
57,-0.17559
58,-0.17559
59,-0.17559
60,-0.17559
61,-0.17559
62,-0.17559
63,-0.17559
64,-0.17559
65,-0.17559
66,-0.17559
67,-0.17559
68,-0.17559
69,-0.17559
70,-0.17559
71,-0.17559
72,-0.17559
73,-0.17559
74,-0.17559
75,-0.17559
76,-0.17559
77,-0.17559
78,-0.17559
79,-0.17559
80,4.9777
81,6.8842
82,4.468
83,-0.17559
84,-0.17559
85,-0.17559
86,-0.17559
87,-0.17559
88,-0.17559
89,-0.17559
90,-0.17559
91,-0.17559
92,-0.17559
93,-0.17559
94,-0.17559
95,-0.17559
