time,value
0,-0.6058100000000001
1,-0.6058100000000001
2,-0.7290300000000001
3,-0.6058100000000001
4,-0.6058100000000001
5,-0.6058100000000001
6,-0.7290300000000001
7,-0.6058100000000001
8,-0.6058100000000001
9,-0.6058100000000001
10,-0.7290300000000001
11,-0.6058100000000001
12,-0.6058100000000001
13,-0.6058100000000001
14,-0.7290300000000001
15,-0.6058100000000001
16,-0.6058100000000001
17,-0.6058100000000001
18,-0.7290300000000001
19,-0.6058100000000001
20,-0.6058100000000001
21,-0.6058100000000001
22,-0.7290300000000001
23,-0.6058100000000001
24,-0.6058100000000001
25,-0.6058100000000001
26,-0.7290300000000001
27,-0.6058100000000001
28,-0.6058100000000001
29,-0.6058100000000001
30,-0.7290300000000001
31,-0.6058100000000001
32,-0.6058100000000001
33,-0.6058100000000001
34,-0.6058100000000001
35,1.8585
36,2.5978
37,1.4889
38,1.4889
39,1.4889
40,1.4889
41,1.4889
42,1.4889
43,1.4889
44,1.4889
45,1.7353
46,2.2282
47,1.4889
48,1.4889
49,1.4889
50,1.6121
51,1.4889
52,1.4889
53,1.4889
54,1.4889
55,1.4889
56,1.6121
57,1.4889
58,1.4889
59,1.4889
60,1.4889
61,0.13348
62,-0.6058100000000001
63,0.37992
64,0.37992
65,-0.35938000000000003
66,-0.7290300000000001
67,-0.6058100000000001
68,-0.6058100000000001
69,-0.6058100000000001
70,-0.7290300000000001
71,-0.6058100000000001
72,-0.6058100000000001
73,-0.6058100000000001
74,-0.7290300000000001
75,-0.6058100000000001
76,-0.6058100000000001
77,-0.6058100000000001
78,-0.7290300000000001
79,-0.6058100000000001
80,-0.6058100000000001
81,-0.6058100000000001
82,-0.7290300000000001
83,-0.6058100000000001
84,-0.6058100000000001
85,-0.6058100000000001
86,-0.7290300000000001
87,-0.6058100000000001
88,-0.6058100000000001
89,-0.6058100000000001
90,-0.7290300000000001
91,-0.6058100000000001
92,-0.6058100000000001
93,-0.6058100000000001
94,-0.7290300000000001
95,-0.6058100000000001
