time,value
0,-0.6201800000000001
1,1.921
2,1.0135
3,-0.6201800000000001
4,-0.6201800000000001
5,-0.6201800000000001
6,-0.6201800000000001
7,0.10588
8,2.1026
9,0.10588
10,-0.6201800000000001
11,-0.6201800000000001
12,-0.6201800000000001
13,-0.6201800000000001
14,0.83195
15,1.921
16,-0.6201800000000001
17,-0.6201800000000001
18,-0.6201800000000001
19,-0.6201800000000001
20,-0.6201800000000001
21,1.0135
22,1.7395
23,-0.6201800000000001
24,-0.6201800000000001
25,-0.6201800000000001
26,-0.6201800000000001
27,-0.6201800000000001
28,1.921
29,1.558
30,-0.6201800000000001
31,-0.6201800000000001
32,-0.6201800000000001
33,-0.6201800000000001
34,-0.6201800000000001
35,1.921
36,1.0135
37,-0.6201800000000001
38,-0.6201800000000001
39,-0.6201800000000001
40,-0.6201800000000001
41,-0.6201800000000001
42,1.921
43,1.0135
44,-0.6201800000000001
45,-0.6201800000000001
46,-0.6201800000000001
47,-0.6201800000000001
48,-0.6201800000000001
49,2.1026
50,0.83195
51,-0.6201800000000001
52,-0.6201800000000001
53,-0.6201800000000001
54,-0.6201800000000001
55,-0.6201800000000001
56,1.921
57,0.83195
58,-0.6201800000000001
59,-0.6201800000000001
60,-0.6201800000000001
61,-0.6201800000000001
62,-0.6201800000000001
63,2.1026
64,1.0135
65,-0.6201800000000001
66,-0.6201800000000001
67,-0.6201800000000001
68,-0.6201800000000001
69,-0.6201800000000001
70,2.1026
71,1.0135
72,-0.6201800000000001
73,-0.6201800000000001
74,-0.6201800000000001
75,-0.6201800000000001
76,-0.6201800000000001
77,2.1026
78,1.0135
79,-0.6201800000000001
80,-0.6201800000000001
81,-0.6201800000000001
82,-0.6201800000000001
83,-0.6201800000000001
84,2.1026
85,1.0135
86,-0.6201800000000001
87,-0.6201800000000001
88,-0.6201800000000001
89,-0.6201800000000001
90,-0.25715
91,2.1026
92,0.83195
93,-0.6201800000000001
94,-0.6201800000000001
95,-0.6201800000000001
