time,value
0,-0.23906999999999998
1,-0.23906999999999998
2,-0.23906999999999998
3,-0.23906999999999998
4,-0.23906999999999998
5,-0.23906999999999998
6,-0.23906999999999998
7,-0.23906999999999998
8,-0.23906999999999998
9,-0.23906999999999998
10,-0.23906999999999998
11,-0.23906999999999998
12,-0.23906999999999998
13,-0.23906999999999998
14,-0.23906999999999998
15,-0.23906999999999998
16,-0.23906999999999998
17,-0.23906999999999998
18,-0.23906999999999998
19,-0.23906999999999998
20,-0.23906999999999998
21,-0.23906999999999998
22,-0.23906999999999998
23,-0.23906999999999998
24,-0.23906999999999998
25,-0.23906999999999998
26,-0.23906999999999998
27,-0.23906999999999998
28,-0.23906999999999998
29,-0.23906999999999998
30,-0.23906999999999998
31,-0.23906999999999998
32,-0.23906999999999998
33,5.8904
34,0.1757
35,-0.23906999999999998
36,-0.23906999999999998
37,-0.23906999999999998
38,2.7104
39,0.037445
40,-0.23906999999999998
41,-0.23906999999999998
42,-0.23906999999999998
43,-0.23906999999999998
44,-0.23906999999999998
45,-0.23906999999999998
46,-0.23906999999999998
47,-0.23906999999999998
48,-0.23906999999999998
49,-0.23906999999999998
50,-0.23906999999999998
51,-0.23906999999999998
52,-0.23906999999999998
53,-0.23906999999999998
54,-0.23906999999999998
55,-0.23906999999999998
56,-0.23906999999999998
57,-0.23906999999999998
58,-0.23906999999999998
59,5.4756
60,-0.23906999999999998
61,-0.23906999999999998
62,-0.23906999999999998
63,-0.23906999999999998
64,-0.23906999999999998
65,1.6044
66,0.22179000000000001
67,-0.23906999999999998
68,-0.23906999999999998
69,-0.23906999999999998
70,-0.23906999999999998
71,-0.23906999999999998
72,-0.23906999999999998
73,-0.054727
74,-0.10081
75,-0.23906999999999998
76,-0.1469
77,-0.1469
78,-0.23906999999999998
79,-0.1469
80,-0.1469
81,-0.23906999999999998
82,-0.1469
83,-0.1469
84,-0.1469
85,3.9548
86,-0.23906999999999998
87,-0.23906999999999998
88,-0.23906999999999998
89,-0.23906999999999998
90,-0.23906999999999998
91,-0.23906999999999998
92,-0.23906999999999998
93,-0.23906999999999998
94,-0.23906999999999998
95,-0.23906999999999998
