time,value
0,-0.18137
1,-0.18137
2,-0.18137
3,-0.18137
4,-0.18137
5,-0.18137
6,-0.18137
7,-0.18137
8,-0.18137
9,-0.18137
10,-0.18137
11,-0.18137
12,-0.18137
13,-0.18137
14,-0.18137
15,-0.18137
16,-0.18137
17,-0.18137
18,-0.18137
19,-0.18137
20,-0.18137
21,-0.18137
22,-0.18137
23,-0.18137
24,-0.18137
25,-0.18137
26,-0.18137
27,-0.18137
28,-0.18137
29,-0.18137
30,-0.18137
31,-0.18137
32,-0.18137
33,-0.18137
34,-0.18137
35,-0.18137
36,-0.18137
37,-0.18137
38,-0.18137
39,-0.18137
40,-0.18137
41,7.1935
42,6.0612
43,1.0733
44,1.0733
45,1.1039
46,-0.18137
47,-0.18137
48,-0.18137
49,-0.18137
50,-0.18137
51,-0.18137
52,-0.18137
53,-0.18137
54,-0.18137
55,-0.18137
56,-0.18137
57,-0.18137
58,-0.18137
59,-0.18137
60,-0.18137
61,-0.18137
62,-0.18137
63,-0.18137
64,-0.18137
65,-0.18137
66,-0.18137
67,-0.18137
68,-0.18137
69,-0.18137
70,-0.18137
71,-0.18137
72,-0.18137
73,-0.18137
74,-0.18137
75,-0.18137
76,-0.18137
77,-0.18137
78,-0.18137
79,-0.18137
80,-0.18137
81,-0.18137
82,-0.18137
83,-0.18137
84,-0.18137
85,-0.18137
86,-0.18137
87,-0.18137
88,-0.18137
89,-0.18137
90,-0.18137
91,-0.18137
92,-0.18137
93,-0.18137
94,-0.18137
95,-0.18137
