time,value
0,-0.25364000000000003
1,-0.25488
2,-0.25490999999999997
3,-0.25801999999999997
4,-0.25975
5,-0.25943
6,-0.26226
7,-0.26518
8,-0.2635
9,-0.2601
10,-0.25864000000000004
11,-0.25969000000000003
12,-0.26271
13,-0.26621999999999996
14,-0.26898
15,-0.27207
16,-0.27433
17,-0.27189
18,-0.26846
19,-0.27073
20,-0.27325
21,-0.27285
22,-0.27537
23,-0.27825
24,-0.28139000000000003
25,-0.28644000000000003
26,-0.28556
27,-0.28624
28,-0.28774
29,-0.27701
30,-0.28553
31,-0.30141999999999997
32,-0.24322
33,-0.30934
34,-0.32135
35,-0.29369
36,-0.30561
37,-0.30983
38,-0.30016
39,-0.30551999999999996
40,-0.3072
41,-0.30101999999999995
42,-0.30044
43,-0.30082
44,-0.29827
45,-0.29527
46,-0.29491999999999996
47,-0.29812
48,-0.30041
49,-0.3002
50,-0.30130999999999997
51,-0.30614
52,-0.30935999999999997
53,-0.30703
54,-0.30385
55,-0.3009
56,-0.29656
57,-0.29621
58,-0.29988000000000004
59,-0.30067
60,-0.30004000000000003
61,-0.3003
62,-0.29771
63,-0.29457
64,-0.29563
65,-0.29655
66,-0.29448
67,-0.29575
68,-0.29985
69,-0.29865
70,-0.29564
71,-0.29595
72,-0.29381
73,-0.29106
74,-0.2915
75,-0.28881999999999997
76,-0.2867
77,-0.29027
78,-0.29005
79,-0.28603
80,-0.28611
81,-0.28685
82,-0.28658
83,-0.28684
84,-0.28434
85,-0.28156
86,-0.28189000000000003
87,-0.28193
88,-0.2825
89,-0.28602
90,-0.28781999999999996
91,-0.28526999999999997
92,-0.28226999999999997
93,-0.28160999999999997
94,-0.28219
95,-0.28210999999999997
96,-0.28179
97,-0.28217
98,-0.28210999999999997
99,-0.2817
100,-0.2824
101,-0.28206
102,-0.27887
103,-0.27663000000000004
104,-0.27763000000000004
105,-0.27801
106,-0.27662
107,-0.27783
108,-0.28121999999999997
109,-0.28226999999999997
110,-0.28208
111,-0.28233
112,-0.28021999999999997
113,-0.27706
114,-0.27705
115,-0.27809
116,-0.27719
117,-0.27715
118,-0.27838
119,-0.27657
120,-0.27328
121,-0.27294
122,-0.27235
123,-0.26892
124,-0.26747
125,-0.2689
126,-0.26861
127,-0.2677
128,-0.26905
129,-0.26864
130,-0.26502
131,-0.26371999999999995
132,-0.26396
133,-0.26097
134,-0.25849
135,-0.25942
136,-0.25969000000000003
137,-0.25893
138,-0.25944
139,-0.25973
140,-0.25799
141,-0.25437
142,-0.2509
143,-0.2499
144,-0.25033
145,-0.25029
146,-0.25022
147,-0.25025
148,-0.25021
149,-0.25035999999999997
150,-0.25016
151,-0.25012
152,-0.25077
153,-0.24955
154,-0.24623
155,-0.24499
156,-0.24605
157,-0.24589
158,-0.24523000000000003
159,-0.24614
160,-0.24597
161,-0.24281999999999998
162,-0.24059
163,-0.24117
164,-0.24151
165,-0.2408
166,-0.24122
167,-0.24395999999999998
168,-0.24691999999999997
169,-0.24566
170,-0.24184
171,-0.24143
172,-0.24099
173,-0.23485
174,-0.22989
175,-0.23275
176,-0.23661
177,-0.23493000000000003
178,-0.23178
179,-0.23174
180,-0.23253000000000001
181,-0.23196999999999998
182,-0.23201999999999998
183,-0.23117
184,-0.22601999999999997
185,-0.22271
186,-0.22604000000000002
187,-0.22710999999999998
188,-0.22341999999999998
189,-0.22441999999999998
190,-0.22874
191,-0.22805999999999998
192,-0.22457
193,-0.22207
194,-0.21883000000000002
195,-0.21715
196,-0.2202
197,-0.22304000000000002
198,-0.22276999999999997
199,-0.2237
200,-0.22309
201,-0.21678000000000003
202,-0.21261999999999998
203,-0.21406999999999998
204,-0.21445
205,-0.21352
206,-0.21405
207,-0.21429
208,-0.21274
209,-0.20884
210,-0.20523000000000002
211,-0.20519
212,-0.20447
213,-0.20092000000000002
214,-0.20131
215,-0.20574
216,-0.20584000000000002
217,-0.20177
218,-0.20035999999999998
219,-0.20063
220,-0.19805999999999999
221,-0.19524
222,-0.1956
223,-0.19627999999999998
224,-0.19548
225,-0.19569
226,-0.19634000000000001
227,-0.19529000000000002
228,-0.19566
229,-0.19717
230,-0.19325
231,-0.18691
232,-0.18596
233,-0.18708
234,-0.18675999999999998
235,-0.18686
236,-0.18628
237,-0.18687
238,-0.19042
239,-0.19058
240,-0.18634
241,-0.18316
242,-0.18029
243,-0.1774
244,-0.1773
245,-0.17801
246,-0.17756
247,-0.17752
248,-0.17797000000000002
249,-0.17731
250,-0.17411
251,-0.17144
252,-0.1744
253,-0.17778
254,-0.17498
255,-0.1733
256,-0.17707
257,-0.1786
258,-0.17726
259,-0.17762999999999998
260,-0.17611
261,-0.17094
262,-0.16852999999999999
263,-0.17128
264,-0.17388
265,-0.17318
266,-0.17254
267,-0.1738
268,-0.1731
269,-0.16974
270,-0.16812
271,-0.16862
272,-0.16865
273,-0.1686
274,-0.16856
275,-0.1684
276,-0.16905
277,-0.16827999999999999
278,-0.16499
279,-0.16333
280,-0.16424
281,-0.16427999999999998
282,-0.16368
283,-0.16423
284,-0.16426
285,-0.16355
286,-0.16443
287,-0.16451
288,-0.16128
289,-0.15929000000000001
290,-0.15963
291,-0.15732000000000002
292,-0.15415
293,-0.15477
294,-0.15578
295,-0.15432
296,-0.15483
297,-0.15642
298,-0.15237
299,-0.14601
300,-0.1429
301,-0.13943
302,-0.13681
303,-0.13752999999999999
304,-0.13416
305,-0.12738
306,-0.12432
307,-0.12049000000000001
308,-0.11334000000000001
309,-0.10722000000000001
310,-0.1011
311,-0.09526
312,-0.092382
313,-0.088344
314,-0.080785
315,-0.074473
316,-0.071109
317,-0.067928
318,-0.064827
319,-0.062440999999999997
320,-0.058116999999999995
321,-0.05170399999999999
322,-0.047587
323,-0.04505
324,-0.038406
325,-0.028393
326,-0.021515
327,-0.019058000000000002
328,-0.014688
329,-0.0061251000000000005
330,-0.00076383
331,0.0010249
332,0.0073102
333,0.012978
334,0.012332
335,0.015366
336,0.022233000000000003
337,0.025086
338,0.029537
339,0.036044
340,0.038824000000000004
341,0.043365
342,0.049892
343,0.052828
344,0.055995
345,0.058346
346,0.055054
347,0.052478
348,0.054217999999999995
349,0.05436799999999999
350,0.051495000000000006
351,0.04852
352,0.045486
353,0.042102
354,0.039377999999999996
355,0.036351
356,0.032533
357,0.03083
358,0.031183999999999996
359,0.029327
360,0.024352000000000002
361,0.018159
362,0.011728
363,0.0060325000000000005
364,-0.00019251
365,-0.01111
366,-0.025836
367,-0.036874000000000004
368,-0.042927999999999994
369,-0.050324
370,-0.060020000000000004
371,-0.071438
372,-0.08691
373,-0.10153
374,-0.11307
375,-0.12936
376,-0.14801
377,-0.16052
378,-0.17132
379,-0.18441
380,-0.19393
381,-0.1996
382,-0.20656999999999998
383,-0.21291999999999997
384,-0.21600000000000003
385,-0.2197
386,-0.22296
387,-0.22215
388,-0.22482
389,-0.23483
390,-0.24299
391,-0.24719000000000002
392,-0.25371
393,-0.26289
394,-0.27164
395,-0.27729000000000004
396,-0.27815
397,-0.27719
398,-0.27755
399,-0.2757
400,-0.27026999999999995
401,-0.26848
402,-0.2699
403,-0.26434
404,-0.25447
405,-0.24831
406,-0.24101
407,-0.23137
408,-0.22498
409,-0.21941
410,-0.21325999999999998
411,-0.20995999999999998
412,-0.20874
413,-0.20986999999999997
414,-0.21335
415,-0.21319000000000002
416,-0.20819000000000001
417,-0.2049
418,-0.20651999999999998
419,-0.21048000000000003
420,-0.21359
421,-0.21454
422,-0.21338000000000001
423,-0.21019000000000002
424,-0.2049
425,-0.19745
426,-0.188
427,-0.17818
428,-0.17024
429,-0.16445
430,-0.1605
431,-0.15928
432,-0.15950999999999999
433,-0.15943
434,-0.15967
435,-0.15950999999999999
436,-0.15909
437,-0.16022
438,-0.15935
439,-0.15571
440,-0.15523
441,-0.15466
442,-0.14852
443,-0.14306
444,-0.14109000000000002
445,-0.1381
446,-0.13466
447,-0.1317
448,-0.12852
449,-0.12611
450,-0.12192
451,-0.11549000000000001
452,-0.11137000000000001
453,-0.10882
454,-0.10565
455,-0.10290999999999999
456,-0.099152
457,-0.09608
458,-0.096466
459,-0.09485199999999999
460,-0.091521
461,-0.093431
462,-0.097458
463,-0.1003
464,-0.10192000000000001
465,-0.098322
466,-0.09590599999999999
467,-0.099843
468,-0.09907300000000001
469,-0.09597
470,-0.10163
471,-0.10753
472,-0.1098
473,-0.11604
474,-0.12035
475,-0.11840999999999999
476,-0.11805
477,-0.11945
478,-0.11844
479,-0.11809000000000001
480,-0.12075
481,-0.12362999999999999
482,-0.12377
483,-0.12124000000000001
484,-0.11789000000000001
485,-0.11474000000000001
486,-0.11335
487,-0.11463
488,-0.11463
489,-0.11126
490,-0.10945
491,-0.10974
492,-0.10726
493,-0.10439000000000001
494,-0.10496
495,-0.10385
496,-0.097508
497,-0.091627
498,-0.090808
499,-0.09185900000000001
500,-0.091433
501,-0.091011
502,-0.0926
503,-0.09604
504,-0.097255
505,-0.093776
506,-0.091365
507,-0.089492
508,-0.081945
509,-0.0779
510,-0.08176900000000001
511,-0.080871
512,-0.077666
513,-0.078429
514,-0.07396799999999999
515,-0.068124
516,-0.068673
517,-0.067018
518,-0.063824
519,-0.064333
520,-0.061984000000000004
521,-0.059685
522,-0.063516
523,-0.06390900000000001
524,-0.057422
525,-0.054911
526,-0.056675
527,-0.052904999999999994
528,-0.046417
529,-0.045549
530,-0.045742000000000005
531,-0.04175
532,-0.038117000000000005
533,-0.036032999999999996
534,-0.032438
535,-0.029084
536,-0.026772000000000004
537,-0.023198
538,-0.022002
539,-0.026198000000000003
540,-0.027727999999999996
541,-0.024118999999999998
542,-0.024791999999999998
543,-0.028049
544,-0.02537
545,-0.02085
546,-0.018494
547,-0.015645
548,-0.011238
549,-0.0032989000000000004
550,0.006093199999999999
551,0.013559
552,0.025856999999999998
553,0.044677999999999995
554,0.064463
555,0.088777
556,0.11377000000000001
557,0.1282
558,0.14015999999999998
559,0.15966
560,0.1828
561,0.21005
562,0.24147
563,0.27731
564,0.32541
565,0.37429
566,0.40317
567,0.41903999999999997
568,0.43068999999999996
569,0.42813999999999997
570,0.40996000000000005
571,0.38416
572,0.36166
573,0.3579
574,0.37323
575,0.39178
576,0.40543
577,0.41294
578,0.41711000000000004
579,0.43473
580,0.48134
581,0.54851
582,0.62448
583,0.7147100000000001
584,0.8114899999999999
585,0.89236
586,0.9708600000000001
587,1.083
588,1.2212
589,1.3385
590,1.4057
591,1.4259
592,1.4142
593,1.3779
594,1.3102
595,1.2004
596,1.0456
597,0.84536
598,0.6028
599,0.32466
600,-0.0036229999999999995
601,-0.40700000000000003
602,-0.8658
603,-1.3337
604,-1.786
605,-2.1992
606,-2.5606
607,-2.887
608,-3.1878
609,-3.4665
610,-3.7365
611,-4.0003
612,-4.2687
613,-4.5619
614,-4.8685
615,-5.1718
616,-5.4588
617,-5.6881
618,-5.8565
619,-6.0121
620,-6.1438
621,-6.1994
622,-6.172999999999999
623,-6.0847
624,-5.9688
625,-5.8708
626,-5.7962
627,-5.7277
628,-5.6651
629,-5.6064
630,-5.5438
631,-5.4705
632,-5.3743
633,-5.257000000000001
634,-5.1509
635,-5.0831
636,-5.0348
637,-4.9859
638,-4.9495
639,-4.9142
640,-4.852
641,-4.7657
642,-4.6591
643,-4.532
644,-4.4038
645,-4.2798
646,-4.1452
647,-3.9986
648,-3.8397
649,-3.6674
650,-3.4938
651,-3.3219
652,-3.1498
653,-2.989
654,-2.8393
655,-2.6865
656,-2.5352
657,-2.3969
658,-2.2603
659,-2.1151
660,-1.9705
661,-1.8316
662,-1.6973
663,-1.5752
664,-1.4651
665,-1.358
666,-1.2567
667,-1.1649
668,-1.077
669,-0.99293
670,-0.91601
671,-0.8440700000000001
672,-0.77483
673,-0.7089
674,-0.64664
675,-0.58723
676,-0.52967
677,-0.4717
678,-0.41096000000000005
679,-0.34957
680,-0.29124
681,-0.23421999999999998
682,-0.17419
683,-0.11247
684,-0.057097
685,-0.013396000000000002
686,0.022935
687,0.056251999999999996
688,0.084069
689,0.10801
690,0.13444
691,0.16362000000000002
692,0.19434
693,0.22615
694,0.25445999999999996
695,0.27844
696,0.29917
697,0.3124
698,0.32109
699,0.33297
700,0.34387
701,0.34891
702,0.35388000000000003
703,0.36159
704,0.36723
705,0.3699
706,0.37306
707,0.37635
708,0.37878
709,0.38339
710,0.39054
711,0.39657
712,0.40179000000000004
713,0.40915
714,0.41828000000000004
715,0.42638000000000004
716,0.43107
717,0.43377
718,0.43867
719,0.44566999999999996
720,0.45174
721,0.45742
722,0.46396000000000004
723,0.47016
724,0.47594
725,0.48227
726,0.48862
727,0.49449
728,0.50048
729,0.50703
730,0.51513
731,0.5251600000000001
732,0.53461
733,0.54294
734,0.55286
735,0.5623199999999999
736,0.56796
737,0.57457
738,0.58545
739,0.5952
740,0.60009
741,0.60342
742,0.60885
743,0.6157
744,0.6219
745,0.62772
746,0.63295
747,0.63468
748,0.6341
749,0.6362899999999999
750,0.6396
751,0.63943
752,0.63821
753,0.63965
754,0.64293
755,0.64491
756,0.64195
757,0.63562
758,0.63138
759,0.62873
760,0.62584
761,0.62671
762,0.63171
763,0.63477
764,0.63435
765,0.63425
766,0.6349199999999999
767,0.63441
768,0.63402
769,0.63502
770,0.63688
771,0.64135
772,0.64893
773,0.65762
774,0.66581
775,0.67152
776,0.6742100000000001
777,0.67662
778,0.68078
779,0.6864600000000001
780,0.69315
781,0.69904
782,0.70193
783,0.70396
784,0.70819
785,0.7113
786,0.7126899999999999
787,0.7178100000000001
788,0.72119
789,0.71723
790,0.7167899999999999
791,0.72067
792,0.72002
793,0.7219399999999999
794,0.72568
795,0.72007
796,0.71478
797,0.71649
798,0.71403
799,0.71012
800,0.71204
801,0.71245
802,0.71037
803,0.71221
804,0.71317
805,0.7075899999999999
806,0.70294
807,0.70517
808,0.70778
809,0.70735
810,0.7068800000000001
811,0.70662
812,0.70753
813,0.70778
814,0.70408
815,0.70299
816,0.70649
817,0.7055100000000001
818,0.7022
819,0.70549
820,0.7108399999999999
821,0.71124
822,0.71121
823,0.71448
824,0.71605
825,0.71608
826,0.71905
827,0.7201
828,0.71675
829,0.71726
830,0.72259
831,0.7256100000000001
832,0.72526
833,0.7246600000000001
834,0.7257100000000001
835,0.72819
836,0.72995
837,0.73033
838,0.73205
839,0.73626
840,0.73943
841,0.74151
842,0.74556
843,0.74837
844,0.7477699999999999
845,0.7478899999999999
846,0.74802
847,0.7471300000000001
848,0.75108
849,0.75831
850,0.76107
851,0.76393
852,0.77305
853,0.77947
854,0.77858
855,0.78104
856,0.78788
857,0.79102
858,0.79487
859,0.80178
860,0.8051
861,0.80828
862,0.81553
863,0.82186
864,0.82652
865,0.82996
866,0.8315899999999999
867,0.8366
868,0.84373
869,0.84634
870,0.8494
871,0.8576600000000001
872,0.86429
873,0.8657299999999999
874,0.8665
875,0.86887
876,0.87171
877,0.8759299999999999
878,0.88174
879,0.8862899999999999
880,0.8893700000000001
881,0.8949
882,0.9027200000000001
883,0.90743
884,0.90994
885,0.9156299999999999
886,0.9214100000000001
887,0.92414
888,0.9288
889,0.93581
890,0.94201
891,0.9484299999999999
892,0.9527100000000001
893,0.95249
894,0.9535100000000001
895,0.9580799999999999
896,0.96136
897,0.96535
898,0.97309
899,0.97551
900,0.97245
901,0.9787
902,0.9890700000000001
903,0.98903
904,0.9883700000000001
905,0.9937799999999999
906,0.99644
907,0.99834
908,1.0029
909,1.0053
910,1.0087
911,1.0171
912,1.0236
913,1.0243
914,1.0253
915,1.0282
916,1.0306
917,1.0351
918,1.0413
919,1.0465
920,1.0541
921,1.0605
922,1.0617
923,1.0683
924,1.0784
925,1.0794
926,1.0799
927,1.0876
928,1.0917
929,1.0936
930,1.1015
931,1.1089
932,1.1106
933,1.1115
934,1.1137
935,1.1155
936,1.1163
937,1.1199
938,1.1287
939,1.1344
940,1.1357
941,1.1416
942,1.1481
943,1.15
944,1.1542
945,1.1566
946,1.1549
947,1.1614
948,1.1713
949,1.1736
950,1.1777
951,1.1848
952,1.1873
953,1.1917
954,1.1985
955,1.2012
956,1.2051
957,1.2129
958,1.2192
959,1.2244
960,1.2308
961,1.2375
962,1.2437
963,1.2478
964,1.2517
965,1.2593
966,1.2682
967,1.2748
968,1.2822
969,1.2917
970,1.2979
971,1.3017
972,1.3108
973,1.3208
974,1.3259
975,1.3318
976,1.339
977,1.3441
978,1.3506
979,1.3571
980,1.3619
981,1.3714
982,1.3798
983,1.382
984,1.3871
985,1.3931
986,1.3924
987,1.3943
988,1.4041
989,1.4135
990,1.4199
991,1.4251
992,1.4283
993,1.4327
994,1.4395
995,1.4426
996,1.4433
997,1.4487
998,1.452
999,1.4495
1000,1.4535
1001,1.4611
1002,1.4602
1003,1.4607
1004,1.4659
1005,1.465
1006,1.4647
1007,1.4705
1008,1.4734
1009,1.473
1010,1.4747
1011,1.4745
1012,1.4709999999999999
1013,1.4698
1014,1.4697
1015,1.4666
1016,1.465
1017,1.4652
1018,1.4621
1019,1.4601
1020,1.4575
1021,1.4480000000000002
1022,1.4407
1023,1.4386
1024,1.4324
1025,1.4271
1026,1.425
1027,1.4185
1028,1.4131
1029,1.4114
1030,1.4034
1031,1.3911
1032,1.3801
1033,1.3692
1034,1.361
1035,1.3525
1036,1.3389
1037,1.3278
1038,1.3203
1039,1.3078
1040,1.2926
1041,1.2785
1042,1.265
1043,1.2538
1044,1.2413
1045,1.2224
1046,1.2036
1047,1.1912
1048,1.1792
1049,1.1622
1050,1.1436
1051,1.1252
1052,1.1062
1053,1.0885
1054,1.0703
1055,1.0503
1056,1.0339
1057,1.0192
1058,0.99879
1059,0.97624
1060,0.95547
1061,0.93532
1062,0.91851
1063,0.90041
1064,0.87515
1065,0.85224
1066,0.8356299999999999
1067,0.81704
1068,0.79781
1069,0.7805300000000001
1070,0.75925
1071,0.73568
1072,0.71611
1073,0.6977
1074,0.67661
1075,0.6560699999999999
1076,0.63734
1077,0.61815
1078,0.60109
1079,0.58596
1080,0.56771
1081,0.5505
1082,0.5384899999999999
1083,0.52351
1084,0.5032300000000001
1085,0.48751000000000005
1086,0.47861000000000004
1087,0.46771999999999997
1088,0.45205
1089,0.43796
1090,0.42691999999999997
1091,0.41472
1092,0.40147
1093,0.39034
1094,0.3817
1095,0.3731
1096,0.36188000000000003
1097,0.34984
1098,0.34207
1099,0.33683
1100,0.32685
1101,0.31544
1102,0.31031
1103,0.30364
1104,0.29004
1105,0.28215999999999997
1106,0.28073000000000004
1107,0.27482
1108,0.26752
1109,0.26213000000000003
1110,0.25561
1111,0.25006
1112,0.24327
1113,0.23329
1114,0.22784000000000001
1115,0.22558000000000003
1116,0.21921
1117,0.21361999999999998
1118,0.21234
1119,0.2094
1120,0.20338
1121,0.19735999999999998
1122,0.19129000000000002
1123,0.18473
1124,0.17925
1125,0.1765
1126,0.17603
1127,0.17619
1128,0.17639000000000002
1129,0.1747
1130,0.16894
1131,0.16310999999999998
1132,0.16015
1133,0.15538
1134,0.14935
1135,0.14824
1136,0.14869000000000002
1137,0.14465999999999998
1138,0.14028
1139,0.14018
1140,0.13999
1141,0.13439
1142,0.1262
1143,0.12165
1144,0.11887
1145,0.11416
1146,0.11304000000000002
1147,0.11655
1148,0.11623
1149,0.11200999999999998
1150,0.10897000000000001
1151,0.1058
1152,0.10336
1153,0.10363
1154,0.10221000000000001
1155,0.097865
1156,0.09487000000000001
1157,0.09429900000000001
1158,0.094625
1159,0.09466799999999999
1160,0.094526
1161,0.094192
1162,0.09077
1163,0.086014
1164,0.08594199999999999
1165,0.085893
1166,0.07968099999999999
1167,0.0752
1168,0.076514
1169,0.074874
1170,0.068377
1171,0.062902
1172,0.059377
1173,0.057428
1174,0.058490999999999994
1175,0.059334000000000005
1176,0.055058
1177,0.048749
1178,0.04539
1179,0.043043
1180,0.039655
1181,0.03639
1182,0.034682
1183,0.035994
1184,0.036420999999999995
1185,0.03247
1186,0.031469
1187,0.035235
1188,0.032971
1189,0.023926
1190,0.018012
1191,0.015666
1192,0.010976999999999999
1193,0.0047051
1194,0.00059005
1195,-0.0012048
1196,-0.00081978
1197,0.00031087
1198,-0.0027072
1199,-0.009290399999999999
1200,-0.013559
1201,-0.014661000000000002
1202,-0.01426
1203,-0.013722999999999999
1204,-0.015854
1205,-0.018809
1206,-0.018992
1207,-0.019711000000000003
1208,-0.023615999999999998
1209,-0.027116
1210,-0.029241000000000003
1211,-0.032902
1212,-0.03652
1213,-0.037077
1214,-0.037062
1215,-0.037351
1216,-0.036083
1217,-0.037843
1218,-0.044376
1219,-0.048924
1220,-0.05128099999999999
1221,-0.054575
1222,-0.055701
1223,-0.055060000000000005
1224,-0.055153
1225,-0.05494500000000001
1226,-0.05549
1227,-0.055387
1228,-0.053797000000000005
1229,-0.057367999999999995
1230,-0.063808
1231,-0.06463300000000001
1232,-0.064952
1233,-0.06855
1234,-0.069379
1235,-0.06865299999999999
1236,-0.068731
1237,-0.066088
1238,-0.063189
1239,-0.064251
1240,-0.067483
1241,-0.06982200000000001
1242,-0.068504
1243,-0.06500399999999999
1244,-0.064249
1245,-0.06401699999999999
1246,-0.060871
1247,-0.058789
1248,-0.060016999999999994
1249,-0.063013
1250,-0.067037
1251,-0.068691
1252,-0.065505
1253,-0.061475999999999996
1254,-0.05915599999999999
1255,-0.055996000000000004
1256,-0.053609000000000004
1257,-0.056474
1258,-0.05973200000000001
1259,-0.05731699999999999
1260,-0.054787
1261,-0.055185000000000005
1262,-0.053136
1263,-0.049286
1264,-0.046345
1265,-0.042986
1266,-0.041263
1267,-0.041519
1268,-0.039123000000000005
1269,-0.035894999999999996
1270,-0.036910000000000005
1271,-0.038224
1272,-0.034983999999999994
1273,-0.032382999999999995
1274,-0.032928
1275,-0.030855
1276,-0.027752999999999996
1277,-0.028004
1278,-0.026657999999999998
1279,-0.02301
1280,-0.022829
1281,-0.024175
1282,-0.022997999999999998
1283,-0.019998
1284,-0.01646
1285,-0.013833000000000002
1286,-0.010939
1287,-0.0065052999999999995
1288,-0.0056164
1289,-0.009131100000000001
1290,-0.010433
1291,-0.009646700000000001
1292,-0.0098286
1293,-0.0080088
1294,-0.0038001
1295,-0.00086072
1296,-0.00031166
1297,-0.0010545
1298,-0.00075248
1299,0.00013561
1300,-0.0022579
1301,-0.005143399999999999
1302,-0.0029181
1303,0.00046113
1304,-0.00060623
1305,-0.0039241
1306,-0.0067036000000000005
1307,-0.0098599
1308,-0.013338
1309,-0.014959
1310,-0.014155000000000001
1311,-0.013766999999999998
1312,-0.016128999999999998
1313,-0.019099
1314,-0.019354
1315,-0.018171
1316,-0.019254
1317,-0.022455000000000003
1318,-0.025457
1319,-0.028756
1320,-0.032114
1321,-0.031473
1322,-0.026562
1323,-0.02348
1324,-0.023750999999999998
1325,-0.022999000000000002
1326,-0.022888
1327,-0.028038
1328,-0.034446
1329,-0.036891
1330,-0.037266
1331,-0.036475
1332,-0.032798
1333,-0.028862
1334,-0.027982
1335,-0.02791
1336,-0.025274
1337,-0.022422
1338,-0.023329
1339,-0.024534999999999998
1340,-0.021381
1341,-0.018765
1342,-0.019441999999999997
1343,-0.016354
1344,-0.009078600000000001
1345,-0.0053895
1346,-0.0056605
1347,-0.0049539
1348,-0.0020326
1349,0.0016269000000000001
1350,0.0042513
1351,0.0069876999999999995
1352,0.01259
1353,0.018588999999999998
1354,0.021504
1355,0.023754
1356,0.027645999999999997
1357,0.030768
1358,0.031191000000000003
1359,0.031278
1360,0.034707
1361,0.041007
1362,0.046144
1363,0.048971
1364,0.051891
1365,0.054453999999999995
1366,0.053965
1367,0.052775999999999997
1368,0.055178
1369,0.058352
1370,0.058464999999999996
1371,0.058202
1372,0.058401
1373,0.057834
1374,0.059564
1375,0.063083
1376,0.063578
1377,0.061049
1378,0.058098000000000004
1379,0.057378
1380,0.060465
1381,0.06300700000000001
1382,0.062645
1383,0.06432
1384,0.06792999999999999
1385,0.068034
1386,0.06509
1387,0.062126
1388,0.05898099999999999
1389,0.057098
1390,0.059190999999999994
1391,0.06249299999999999
1392,0.063051
1393,0.062764
1394,0.062912
1395,0.06251
1396,0.06313099999999999
1397,0.063113
1398,0.060008000000000006
1399,0.057242999999999995
1400,0.054140999999999995
1401,0.049594
1402,0.050366
1403,0.053847000000000006
1404,0.051255999999999996
1405,0.048135000000000004
1406,0.049346
1407,0.0474
1408,0.040704000000000004
1409,0.03542
1410,0.032314999999999997
1411,0.028908
1412,0.026412
1413,0.026238
1414,0.026764
1415,0.026367
1416,0.023465
1417,0.018856
1418,0.017534
1419,0.017948
1420,0.014847999999999998
1421,0.012821
1422,0.013336
1423,0.0089391
1424,0.0021517
1425,-0.00044177
1426,-0.0025597
1427,-0.0066736
1428,-0.0094609
1429,-0.011874
1430,-0.016035
1431,-0.01873
1432,-0.018631
1433,-0.019769
1434,-0.023125
1435,-0.026335
1436,-0.029580000000000002
1437,-0.032373
1438,-0.03266
1439,-0.033201999999999995
1440,-0.037072
1441,-0.038452999999999994
1442,-0.035141000000000006
1443,-0.03746
1444,-0.044853
1445,-0.045647
1446,-0.046696
1447,-0.056473
1448,-0.062030999999999996
1449,-0.05915
1450,-0.058979
1451,-0.060683
1452,-0.059301
1453,-0.059116999999999996
1454,-0.061949000000000004
1455,-0.06495
1456,-0.067967
1457,-0.071552
1458,-0.073681
1459,-0.073421
1460,-0.073062
1461,-0.073475
1462,-0.07334500000000001
1463,-0.072973
1464,-0.07399299999999999
1465,-0.07741100000000001
1466,-0.081195
1467,-0.083151
1468,-0.086629
1469,-0.091237
1470,-0.090107
1471,-0.086876
1472,-0.08932000000000001
1473,-0.09333999999999999
1474,-0.096086
1475,-0.099595
1476,-0.10072
1477,-0.10062
1478,-0.10377
1479,-0.10593
1480,-0.10490999999999999
1481,-0.10482999999999999
1482,-0.10532000000000001
1483,-0.10499000000000001
1484,-0.10489000000000001
1485,-0.10630999999999999
1486,-0.11072
1487,-0.1141
1488,-0.11335
1489,-0.11512
1490,-0.11865
1491,-0.11624000000000001
1492,-0.11425999999999999
1493,-0.11804
1494,-0.11946
1495,-0.11877
1496,-0.12251
1497,-0.12691
1498,-0.12780999999999998
1499,-0.12772
1500,-0.12789
1501,-0.12762
1502,-0.12772
1503,-0.12802
1504,-0.12736
1505,-0.12774000000000002
1506,-0.1307
1507,-0.1339
1508,-0.13696
1509,-0.13805
1510,-0.13422
1511,-0.13241
1512,-0.13593
1513,-0.1367
1514,-0.13725
1515,-0.1436
1516,-0.14873
1517,-0.15089
1518,-0.15422
1519,-0.15546
1520,-0.15494000000000002
1521,-0.15511
1522,-0.15417
1523,-0.15611
1524,-0.16274
1525,-0.16722
1526,-0.16934000000000002
1527,-0.17264000000000002
1528,-0.17411
1529,-0.1722
1530,-0.16901
1531,-0.16541
1532,-0.16405
1533,-0.16809000000000002
1534,-0.17478
1535,-0.17929
1536,-0.18211
1537,-0.18539
1538,-0.18733
1539,-0.18674000000000002
1540,-0.18639
1541,-0.18703
1542,-0.18674000000000002
1543,-0.18869
1544,-0.19565
1545,-0.20056
1546,-0.20025
1547,-0.20187
1548,-0.20523000000000002
1549,-0.20523000000000002
1550,-0.20464000000000002
1551,-0.20489000000000002
1552,-0.20464000000000002
1553,-0.20661
1554,-0.21022
1555,-0.21318
1556,-0.2166
1557,-0.21882
1558,-0.21859
1559,-0.2185
1560,-0.21835
1561,-0.2183
1562,-0.22091999999999998
1563,-0.22371999999999997
1564,-0.22321999999999997
1565,-0.22244
1566,-0.2235
1567,-0.22316999999999998
1568,-0.22209
1569,-0.22465
1570,-0.2276
1571,-0.22516999999999998
1572,-0.22168000000000002
1573,-0.22314
1574,-0.22662
1575,-0.22791
1576,-0.22758
1577,-0.22741999999999998
1578,-0.22773000000000002
1579,-0.22755
1580,-0.22735
1581,-0.22791
1582,-0.22744
1583,-0.22715
1584,-0.22843000000000002
1585,-0.22705999999999998
1586,-0.22637
1587,-0.23273000000000002
1588,-0.23674
1589,-0.23298000000000002
1590,-0.23148000000000002
1591,-0.23181
1592,-0.22819
1593,-0.22810999999999998
1594,-0.23424
1595,-0.2369
1596,-0.23381999999999997
1597,-0.23169
1598,-0.23208
1599,-0.23215999999999998
1600,-0.23210999999999998
1601,-0.23215999999999998
1602,-0.23185
1603,-0.23242
1604,-0.23218000000000003
1605,-0.23117
1606,-0.23405
1607,-0.23668000000000003
1608,-0.23363
1609,-0.23138000000000003
1610,-0.23218000000000003
1611,-0.23193000000000003
1612,-0.23334000000000002
1613,-0.2371
1614,-0.24006
1615,-0.2434
1616,-0.24595
1617,-0.2458
1618,-0.24593
1619,-0.24533000000000002
1620,-0.24188
1621,-0.24165999999999999
1622,-0.2473
1623,-0.25055
1624,-0.24753000000000003
1625,-0.24583000000000002
1626,-0.24948
1627,-0.25184
1628,-0.24886
1629,-0.24588000000000002
1630,-0.24581
1631,-0.24536
1632,-0.24555
1633,-0.24866999999999997
1634,-0.25064000000000003
1635,-0.25032
1636,-0.25039
1637,-0.2498
1638,-0.2503
