time,value
0,1.7197
1,-0.8934700000000001
2,-0.43232
3,1.4123
4,-0.8934700000000001
5,-0.43232
6,1.2585
7,-0.8934700000000001
8,-0.43232
9,1.2585
10,-0.8934700000000001
11,-0.27860999999999997
12,0.95111
13,-0.8934700000000001
14,0.028821
15,0.7973899999999999
16,-0.8934700000000001
17,0.028821
18,0.64368
19,-0.8934700000000001
20,0.18254
21,0.64368
22,-0.8934700000000001
23,0.028821
24,0.64368
25,-0.8934700000000001
26,-0.12489000000000001
27,0.7973899999999999
28,-0.8934700000000001
29,-0.27860999999999997
30,0.95111
31,-0.8934700000000001
32,-0.58604
33,1.2585
34,-0.8934700000000001
35,-0.8934700000000001
36,1.5659999999999998
37,-0.8934700000000001
38,-0.8934700000000001
39,1.5659999999999998
40,-0.8934700000000001
41,-0.12489000000000001
42,0.95111
43,-0.8934700000000001
44,0.028821
45,0.95111
46,-0.8934700000000001
47,-0.27860999999999997
48,1.1048
49,-0.8934700000000001
50,-0.12489000000000001
51,0.95111
52,-0.8934700000000001
53,0.18254
54,0.64368
55,-0.8934700000000001
56,0.18254
57,0.64368
58,-0.8934700000000001
59,-0.27860999999999997
60,1.1048
61,-0.8934700000000001
62,-0.8934700000000001
63,1.7197
64,-0.8934700000000001
65,-0.8934700000000001
66,1.7197
67,-0.8934700000000001
68,-0.8934700000000001
69,1.7197
70,-0.8934700000000001
71,-0.58604
72,1.8734
73,-0.8934700000000001
74,-0.8934700000000001
75,2.0271
76,-0.8934700000000001
77,-0.8934700000000001
78,2.0271
79,-0.8934700000000001
80,-0.8934700000000001
81,1.8734
82,-0.8934700000000001
83,-0.8934700000000001
84,2.0271
85,-0.8934700000000001
86,-0.8934700000000001
87,1.8734
88,-0.8934700000000001
89,-0.43232
90,1.4123
91,-0.8934700000000001
92,0.028821
93,0.95111
94,-0.8934700000000001
95,0.18254
