time,value
0,0.024671000000000002
1,0.018922
2,0.025596999999999998
3,0.12299000000000002
4,0.01135
5,0.01299
6,0.022033
7,0.025124
8,0.024265000000000002
9,0.22516999999999998
10,0.0020114
11,0.029695
12,-0.14453
13,-0.24531999999999998
14,-0.5726100000000001
15,-0.79909
16,-1.0255
17,-1.4455
18,-2.1827
19,-2.1965
20,-2.0567
21,-2.4052
22,-2.4693
23,-1.9232
24,-1.4566
25,-1.2067
26,-0.78977
27,-0.70135
28,-0.45708000000000004
29,0.35285
30,1.956
31,2.3785
32,2.7547
33,2.5269
34,2.5051
35,2.6579
36,2.7682
37,2.4751
38,1.7787
39,1.0398
40,0.89561
41,0.88644
42,1.0583
43,0.42052
44,-0.051977999999999996
45,-0.20636
46,-0.78738
47,-1.2873
48,-1.1558
49,-1.2789
50,-0.9188
51,-1.0699
52,-1.0034
53,-1.1913
54,-1.1793
55,-1.1787
56,-1.1908
57,-1.0027
58,-0.7182
59,-0.50448
60,-0.13566
61,-0.017355000000000002
62,0.38711
63,0.60729
64,0.7567
65,0.90991
66,1.6789
67,1.9429
68,2.5901
69,3.5008
70,3.4705
71,2.9146
72,2.5636
73,2.1531
74,1.8178
75,1.5799
76,1.3012
77,0.8619899999999999
78,0.7256100000000001
79,0.43437
80,0.3186
81,0.13085
82,-0.13888
83,-0.31542
84,-0.46131000000000005
85,-0.6754600000000001
86,-0.87092
87,-0.92611
88,-1.0351
89,-1.0198
90,-1.1315
91,-1.119
92,-1.0753
93,-0.65805
94,-0.77854
95,-1.0527
96,-0.89549
97,-0.9008200000000001
98,-0.79611
99,-0.71624
100,-0.44923
101,-0.15114
102,-0.0031184
103,0.16307
104,0.40675
105,0.6171
106,0.7833100000000001
107,1.0948
108,1.5741
109,1.8817
110,2.2515
111,2.6821
112,3.0458
113,2.9599
114,2.7508
115,2.6105
116,2.3378
117,2.3067
118,2.0455
119,1.6854
120,1.4481
121,1.4058
122,1.0699
123,0.99344
124,0.87008
125,0.84372
126,0.66695
127,0.33871
128,0.30580999999999997
129,0.45913999999999994
130,0.43768999999999997
131,0.21622
132,0.10216
133,-0.098308
134,-0.11126
135,-0.30071
136,-0.37124
137,-0.25306999999999996
138,-0.10727
139,-0.048602
140,0.04401
141,0.19108
142,0.24147
143,0.45993
144,0.55611
145,0.60018
146,0.61575
147,0.67976
148,0.48268999999999995
149,-0.030119
150,-0.5032800000000001
151,-0.69468
152,-0.63732
153,-0.55709
154,-0.57329
155,-0.80979
156,-1.1406
157,-1.3449
158,-1.3898
159,-1.0471
160,-0.79797
161,-0.69702
162,-0.46525
163,-0.28786
164,-0.31514000000000003
165,-0.5584100000000001
166,-0.5443600000000001
167,-0.15424000000000002
168,0.11239
169,0.25901
170,-0.13564
171,0.20875
172,-0.08913099999999999
173,-0.1837
174,-0.25139
175,-0.30673
176,-0.26825
177,-0.16054000000000002
178,-0.17288
179,0.059514
180,0.14976
181,0.059102999999999996
182,0.051544000000000006
183,-0.049546
184,-0.083649
185,-0.10902
186,-0.12480999999999999
187,-0.13501
188,-0.15103
189,-0.12567
190,-0.028676999999999998
191,0.045698
192,0.065121
193,0.08267999999999999
194,0.010771
195,0.0066790999999999994
196,-0.14925
197,-0.19247
198,-0.22345
199,-0.31516
200,-0.25625
201,-0.29816
202,-0.3105
203,-0.21215
204,-0.28514
205,-0.22025999999999998
206,-0.24261
207,-0.23665
208,-0.24145999999999998
209,-0.25411
210,-0.25785
211,-0.25076
212,-0.25572
213,-0.27201
214,-0.29558
215,-0.30456
216,-0.29911
217,-0.29012
218,-0.29055
219,-0.30351
220,-0.30906
221,-0.36858
222,-0.27697
223,-0.28403
224,-0.28323000000000004
225,-0.26477
226,-0.25406999999999996
227,-0.25275
228,-0.26942
229,-0.28091
230,-0.27954
231,-0.29125999999999996
232,-0.30072
233,-0.30151
234,-0.30289
235,-0.30817
236,-0.32227
237,-0.33389
238,-0.34669
239,-0.36282
240,-0.36832
241,-0.36996999999999997
242,-0.46858999999999995
243,-0.4241
244,-0.33852
245,-0.34412
246,-0.35115999999999997
247,-0.35064
248,-0.35007
249,-0.35777
250,-0.35889
251,-0.36180999999999996
252,-0.35652
253,-0.35366
254,-0.3606
255,-0.36695
256,-0.36196
257,-0.35323000000000004
258,-0.35397
259,-0.35980999999999996
260,-0.35977
261,-0.35346
262,-0.35754
263,-0.35528000000000004
264,-0.35739
265,-0.36922
266,-0.37567
267,-0.37288000000000004
268,-0.36866
269,-0.36638000000000004
270,-0.36280999999999997
271,-0.36777
272,-0.36735
273,-0.36615
274,-0.36507
275,-0.36621
276,-0.36876
277,-0.37306999999999996
278,-0.37916
279,-0.38192
280,-0.37958000000000003
281,-0.37959
282,-0.38523
283,-0.38661999999999996
284,-0.38437
285,-0.38151
286,-0.38218
287,-0.37927
288,-0.38049
289,-0.38955
290,-0.39146
291,-0.39504
292,-0.39509
293,-0.38958000000000004
294,-0.38566999999999996
295,-0.38649
296,-0.39024000000000003
297,-0.39369
298,-0.39524000000000004
299,-0.39384
