time,value
0,-0.36208
1,-0.36208
2,-0.36208
3,-0.36208
4,-0.36208
5,-0.36208
6,-0.36208
7,-0.36208
8,-0.36208
9,-0.36208
10,-0.36208
11,-0.36208
12,-0.36208
13,-0.36208
14,-0.36208
15,-0.36208
16,-0.36208
17,-0.36208
18,-0.36208
19,-0.36208
20,-0.36208
21,-0.36208
22,-0.36208
23,-0.36208
24,-0.36208
25,-0.36208
26,-0.36208
27,-0.36208
28,-0.36208
29,-0.66969
30,-0.36208
31,-0.36208
32,-0.36208
33,-0.36208
34,-0.36208
35,-0.36208
36,-0.36208
37,-0.36208
38,-0.36208
39,-0.36208
40,-0.36208
41,-0.36208
42,-0.36208
43,-0.36208
44,-0.36208
45,-0.36208
46,-0.36208
47,-0.36208
48,-0.36208
49,-0.36208
50,-0.36208
51,-0.36208
52,-0.36208
53,-0.36208
54,-0.36208
55,-0.36208
56,-0.36208
57,-0.36208
58,-0.36208
59,-0.36208
60,-0.36208
61,-0.36208
62,-0.36208
63,-0.36208
64,-0.36208
65,-0.36208
66,-0.36208
67,-0.36208
68,-0.36208
69,-0.36208
70,-0.36208
71,1.7912
72,1.176
73,-0.36208
74,-0.054472
75,2.714
76,3.6368
77,3.3292
78,2.4064
79,-0.36208
80,-0.054472
81,-0.054472
82,3.0216
83,3.0216
84,2.714
85,2.714
86,3.0216
87,-0.36208
88,-0.054472
89,-0.36208
90,-0.36208
91,-0.36208
92,-0.054472
93,-0.36208
94,-0.36208
95,-0.36208
