time,value
0,0.15794
1,0.59113
2,-1.1417
3,1.2409
4,-0.49186
5,-1.3582
6,1.2409
7,-1.7914
8,-0.27526
9,0.15794
10,-1.7914
11,0.8077300000000001
12,-0.92505
13,-1.3582
14,1.2409
15,-1.7914
16,-0.49186
17,0.59113
18,-1.7914
19,0.37453000000000003
20,-0.49186
21,-1.5748
22,0.8077300000000001
23,-1.1417
24,-0.27526
25,0.59113
26,-0.70845
27,1.0243
28,-0.058662
29,0.37453000000000003
30,2.1073
31,-0.49186
32,1.0243
33,1.8907
34,-0.27526
35,2.1073
36,0.15794
37,-0.49186
38,2.5405
39,-0.70845
40,0.37453000000000003
41,1.4575
42,-0.92505
43,1.2409
44,-0.058662
45,-0.70845
46,1.0243
47,-0.92505
48,1.2409
49,0.59113
50,-0.70845
51,1.0243
52,-0.27526
53,-0.70845
54,0.59113
55,-1.1417
56,0.59113
57,0.15794
58,-1.3582
59,1.0243
60,-0.70845
61,-0.70845
62,1.0243
63,-1.5748
64,-0.058662
65,-0.058662
66,-1.3582
67,0.8077300000000001
68,-0.92505
69,-0.70845
70,0.8077300000000001
71,-0.70845
72,0.8077300000000001
73,0.8077300000000001
74,-0.058662
75,1.2409
76,-1.1417
77,0.59113
78,0.8077300000000001
79,-0.49186
80,1.4575
81,-0.058662
82,-0.058662
83,1.2409
84,-0.49186
85,0.59113
86,0.59113
87,-0.70845
88,0.59113
89,-1.1417
90,-0.27526
91,-0.27526
92,-1.3582
93,0.8077300000000001
94,-0.27526
95,-1.1417
