time,value
0,0.19844
1,0.22989
2,0.39181
3,0.30868
4,0.33143
5,0.29905
6,0.28303
7,0.30551999999999996
8,0.2873
9,0.47093999999999997
10,0.42586
11,0.37987
12,0.32968000000000003
13,0.28981
14,0.13479000000000002
15,0.2543
16,0.17649
17,0.19369
18,0.16546
19,0.17662
20,0.23185999999999998
21,0.2781
22,0.33579000000000003
23,0.22415
24,0.18886
25,0.23695
26,0.32741
27,0.24059
28,0.21193
29,0.15774000000000002
30,0.050493
31,-0.10622999999999999
32,-0.47347
33,-0.8577600000000001
34,-0.91312
35,-1.1466
36,-1.6203
37,-1.7647
38,-1.8049
39,-2.2640000000000002
40,-2.4724
41,-2.3767
42,-2.4566
43,-2.5895
44,-2.4627
45,-2.4784
46,-2.5546
47,-2.3582
48,-2.3585
49,-2.3556
50,-1.8512
51,-1.5191
52,-1.1613
53,-0.92438
54,-0.46392
55,-0.43925
56,-0.34776999999999997
57,-0.38022
58,-0.22435
59,0.15800999999999998
60,0.20672
61,0.1233
62,0.1517
63,0.082746
64,0.074289
65,-0.090835
66,0.26065
67,-0.050358
68,0.043258
69,0.092481
70,-0.07808
71,-0.12939
72,-0.12039000000000001
73,-0.31661
74,-0.44233999999999996
75,-0.30798000000000003
76,-0.11429
77,-0.21983000000000003
78,-0.043266000000000006
79,-0.15945
80,-0.37661999999999995
81,-0.25161
82,-0.070783
83,-0.39000999999999997
84,-0.19155
85,0.09843500000000001
86,-0.0526
87,0.053065999999999995
88,0.10427
89,0.10126
90,0.20248
91,0.11673
92,0.14110999999999999
93,0.24163
94,0.26749
95,0.10558
96,0.031855
97,0.32450999999999997
98,0.10754000000000001
99,-0.07179400000000001
100,0.21874000000000002
101,0.081323
102,-0.48183000000000004
103,-0.1428
104,-0.32668
105,-1.1918
106,-1.1953
107,-0.7985399999999999
108,-1.2166
109,-1.1808
110,-2.0089
111,-2.1577
112,-1.3425
113,-2.9866
114,-2.8096
115,-2.2745
116,-3.4009
117,-3.1016
118,-3.0702
119,-3.3176
120,-2.7203
121,-2.8739
122,-2.9279
123,-2.0807
124,-1.8761
125,-2.0615
126,-1.0214
127,-1.4348
128,-2.5668
129,-2.714
130,-2.3942
131,-1.3507
132,-0.4329
133,-0.31818
134,-0.082344
135,0.16569
136,0.027469999999999998
137,0.07784400000000001
138,0.14570999999999998
139,0.28773000000000004
140,0.24916999999999997
141,0.24499
142,0.31527
143,0.32765
144,0.44697
145,0.29801
146,0.3777
147,0.17777
148,0.10037
149,0.014440999999999999
150,0.11702
151,0.07990499999999999
152,0.0046879
153,-0.032255
154,-0.11863
155,-0.20007
156,-0.10769000000000001
157,-0.066713
158,0.052351
159,0.13527999999999998
160,0.18058
161,0.27975
162,0.32045999999999997
163,0.29924
164,0.26221
165,0.36291
166,0.18684
167,0.22721
168,0.43778999999999996
169,0.3877
170,0.47343
171,0.44973
172,0.46035
173,0.35256
174,0.37781
175,0.31039
176,0.38406
177,0.28109
178,0.3173
179,0.33714
180,0.30756999999999995
181,0.23364000000000001
182,0.28254
183,0.36505
184,0.42452
185,0.43692
186,0.4709
187,0.47073000000000004
188,0.51761
189,0.53403
190,0.47558999999999996
191,0.5794
192,0.61925
193,0.71412
194,0.69021
195,0.55462
196,0.57643
197,0.60798
198,0.60883
199,0.59846
200,0.5886399999999999
201,0.60555
202,0.5614
203,0.60265
204,0.49706999999999996
205,0.44919
206,0.43786
207,0.51905
208,0.51549
209,0.52305
210,0.39463000000000004
211,0.55945
212,0.74455
213,0.70101
214,0.6922
215,0.78269
216,0.68966
217,0.6632100000000001
218,0.51468
219,0.64783
220,0.68153
221,0.63543
222,0.49646999999999997
223,0.42244
224,0.5164
225,0.49695
226,0.62947
227,0.60502
228,0.76927
229,0.6986100000000001
230,0.6872
231,0.76076
232,0.72118
233,0.56435
234,0.6874
235,0.70386
236,0.73858
237,0.71025
238,0.66974
239,0.72192
240,0.67643
241,0.7200300000000001
242,0.61698
243,0.53885
244,0.5577
245,0.55135
246,0.40761
247,0.75168
248,0.93548
249,0.93452
250,0.9452
251,0.9365399999999999
252,0.76925
253,0.76746
254,0.75802
255,0.92035
256,0.76354
257,0.78564
258,0.61365
259,0.7701
260,0.7811
261,0.7418
262,0.7723899999999999
263,0.77441
264,0.95683
265,0.94145
266,0.9217299999999999
267,1.0627
268,0.9433799999999999
269,0.8306399999999999
270,0.9379799999999999
271,0.76573
272,0.7743800000000001
273,0.77147
274,0.96631
275,0.96514
276,0.8708799999999999
277,0.77563
278,0.76985
279,0.93225
280,1.0228
281,0.94642
282,0.76037
283,0.81448
284,0.9453
285,0.94883
286,0.9384600000000001
287,0.94058
288,0.79346
289,0.78155
290,0.9042399999999999
291,0.9036799999999999
292,0.90955
293,0.92947
294,0.9359200000000001
295,0.9370799999999999
296,0.9303
297,0.9343100000000001
298,0.9121600000000001
299,0.90812
