time,value
0,-0.38486
1,-0.38311999999999996
2,-0.36571
3,-0.39009
4,-0.38138
5,-0.36745
6,-0.38835
7,-0.37442
8,-0.37616
9,-0.38486
10,-0.36919
11,-0.38138
12,-0.38486
13,-0.35875
14,-0.38486
15,-0.37964000000000003
16,-0.36571
17,-0.38311999999999996
18,-0.3779
19,-0.37268
20,-0.3866
21,-0.36396999999999996
22,-0.36919
23,-0.38486
24,-0.36745
25,-0.37093000000000004
26,-0.37442
27,-0.36049000000000003
28,-0.36919
29,-0.37616
30,-0.36049000000000003
31,-0.37616
32,-0.37093000000000004
33,-0.36396999999999996
34,-0.38138
35,-0.37093000000000004
36,-0.36223
37,-0.38486
38,-0.37268
39,-0.37442
40,0.9244700000000001
41,3.1096
42,0.33945
43,-0.36223
44,-0.34133
45,-0.36745
46,-0.37093000000000004
47,-0.34308
48,-0.37442
49,-0.37093000000000004
50,-0.36049000000000003
51,-0.3779
52,-0.36919
53,-0.36919
54,-0.38311999999999996
55,-0.36223
56,-0.37093000000000004
57,-0.38486
58,-0.36049000000000003
59,-0.37442
60,-0.38138
61,-0.36571
62,-0.38138
63,-0.37964000000000003
64,-0.37093000000000004
65,-0.38835
66,-0.37093000000000004
67,-0.37616
68,-0.3866
69,-0.36049000000000003
70,-0.3483
71,-0.36745
72,-0.38138
73,-0.0732
74,3.3133
75,2.9128
76,2.7544
77,2.8310000000000004
78,2.7213
79,2.7701
80,2.7474
81,2.6795
82,2.7666
83,0.6946399999999999
84,-0.34656
85,-0.3779
86,-0.35700000000000004
87,-0.35700000000000004
88,-0.37442
89,-0.35700000000000004
90,-0.36396999999999996
91,-0.3779
92,-0.36571
93,-0.37093000000000004
94,-0.3866
95,-0.35875
