time,value
0,-0.1781
1,-0.1781
2,-0.1781
3,-0.1781
4,-0.1781
5,-0.1781
6,-0.1781
7,-0.1781
8,-0.1781
9,-0.1781
10,-0.1781
11,-0.1781
12,-0.1781
13,-0.1781
14,-0.1781
15,-0.1781
16,-0.1781
17,-0.1781
18,-0.1781
19,-0.1781
20,-0.1781
21,-0.1781
22,-0.1781
23,-0.1781
24,-0.1781
25,-0.1781
26,-0.1781
27,-0.1781
28,-0.1781
29,-0.1781
30,-0.1781
31,-0.1781
32,-0.1781
33,5.5864
34,0.017302
35,-0.1781
36,-0.1781
37,-0.1781
38,-0.1781
39,-0.1781
40,-0.1781
41,-0.1781
42,-0.1781
43,-0.1781
44,6.5634
45,-0.1781
46,-0.1781
47,-0.1781
48,-0.1781
49,-0.1781
50,-0.1781
51,-0.1781
52,-0.1781
53,4.2185
54,-0.1781
55,-0.1781
56,-0.1781
57,-0.1781
58,-0.1781
59,-0.1781
60,-0.1781
61,-0.1781
62,-0.1781
63,-0.1781
64,-0.1781
65,-0.1781
66,-0.1781
67,-0.1781
68,-0.1781
69,-0.1781
70,-0.1781
71,-0.1781
72,-0.1781
73,-0.1781
74,-0.1781
75,-0.1781
76,-0.1781
77,-0.1781
78,-0.1781
79,-0.1781
80,-0.1781
81,-0.1781
82,-0.1781
83,-0.1781
84,-0.1781
85,-0.1781
86,-0.1781
87,-0.1781
88,-0.1781
89,-0.1781
90,-0.1781
91,-0.1781
92,-0.1781
93,-0.1781
94,-0.1781
95,-0.1781
