time,value
0,2.5809
1,2.5322
2,2.443
3,2.3223
4,2.221
5,2.1263
6,2.049
7,1.9689
8,1.8940000000000001
9,1.7955
10,1.7133
11,1.6156
12,1.5203
13,1.4206
14,1.3183
15,1.2277
16,1.1228
17,1.0263
18,0.9219200000000001
19,0.82047
20,0.7259
21,0.6171
22,0.50815
23,0.38527
24,0.29929
25,0.18714
26,0.076821
27,-0.045954
28,-0.13764
29,-0.24636999999999998
30,-0.35319
31,-0.4757
32,-0.5976
33,-0.70523
34,-0.8266899999999999
35,-0.9336399999999999
36,-1.0544
37,-1.1754
38,-1.2859
39,-1.4044
40,-1.511
41,-1.5701
42,-1.6187
43,-1.5987
44,-1.5721
45,-1.5094
46,-1.449
47,-1.3806
48,-1.3067
49,-1.2298
50,-1.1526
51,-1.0823
52,-1.0051
53,-0.9582200000000001
54,-0.8846200000000001
55,-0.80723
56,-0.72785
57,-0.69571
58,-0.63526
59,-0.5917600000000001
60,-0.53969
61,-0.45488
62,-0.37342
63,-0.3148
64,-0.26005
65,-0.22438000000000002
66,-0.19638
67,-0.18028
68,-0.19841
69,-0.26949
70,-0.3373
71,-0.41881
72,-0.50375
73,-0.5917100000000001
74,-0.68088
75,-0.77108
76,-0.81309
77,-0.88465
78,-0.9600700000000001
79,-1.0022
80,-1.0233
81,-1.0616
82,-1.03
83,-0.9897299999999999
84,-0.9500700000000001
85,-0.89759
86,-0.8601
87,-0.80807
88,-0.74895
89,-0.67018
90,-0.60019
91,-0.52082
92,-0.45626000000000005
93,-0.38282
94,-0.30473
95,-0.23345
96,-0.16441
97,-0.11367999999999999
98,-0.06648899999999999
99,-0.0014277
100,0.060663
101,0.12774000000000002
102,0.21236
103,0.28531999999999996
104,0.3562
105,0.41517
106,0.45808999999999994
107,0.46356
108,0.42423
109,0.3775
110,0.35379
111,0.33308000000000004
112,0.29728000000000004
113,0.29869
114,0.31463
115,0.36530999999999997
116,0.42901999999999996
117,0.47165
118,0.53501
119,0.60634
120,0.6704
121,0.72602
122,0.7915
123,0.86198
124,0.9082600000000001
125,0.94494
126,0.9930700000000001
127,1.0658
128,1.15
129,1.219
130,1.2652
131,1.3286
132,1.412
133,1.4773
134,1.5598
135,1.5564
136,1.5018
137,1.4142
138,1.33
139,1.2443
140,1.1579
141,1.0686
142,0.99284
143,0.90445
144,0.8209200000000001
145,0.73714
146,0.65084
147,0.56989
148,0.5106
149,0.4565
150,0.37899
151,0.29874
152,0.21806999999999999
153,0.13175
154,0.04668
155,-0.036443
156,-0.12322000000000001
157,-0.20858000000000002
158,-0.29234
159,-0.38306
160,-0.47056000000000003
161,-0.55491
162,-0.6452899999999999
163,-0.73075
164,-0.8193600000000001
165,-0.90795
166,-0.9948
167,-1.0787
168,-1.1395
169,-1.2027
170,-1.2278
171,-1.2118
172,-1.245
173,-1.1547
174,-1.0783
175,-1.0199
176,-0.9324399999999999
177,-0.8145100000000001
178,-0.73354
179,-0.63368
180,-0.55596
181,-0.45307
182,-0.36998000000000003
183,-0.30182
184,-0.21563000000000002
185,-0.12475
186,-0.021183
187,0.082134
188,0.15428
189,0.25922
190,0.36135
191,0.42753
192,0.49359
193,0.54302
194,0.53066
195,0.50608
196,0.50592
197,0.5218
198,0.5745100000000001
199,0.6431899999999999
200,0.67753
201,0.74225
202,0.81238
203,0.89759
204,0.9629200000000001
205,1.0328
206,1.0765
207,1.1441
208,1.2011
209,1.2433
210,1.3008
211,1.3656
212,1.4433
213,1.5106
214,1.5744
215,1.6289
216,1.6953
217,1.7597
218,1.8187
219,1.7727
220,1.671
221,1.5843
222,1.5095
223,1.4295
224,1.3336
225,1.258
226,1.2229
227,1.1823
228,1.1065
229,1.0089
230,0.9156200000000001
231,0.81915
232,0.75173
233,0.6452100000000001
234,0.5412600000000001
235,0.47623999999999994
236,0.43676000000000004
237,0.41617
238,0.41257
239,0.41805
240,0.38274
241,0.28755
242,0.20164
243,0.1127
244,0.024239
245,-0.067211
246,-0.15508
247,-0.23835
248,-0.32666999999999996
249,-0.41568
250,-0.49838000000000005
251,-0.5825600000000001
252,-0.67204
253,-0.7551399999999999
254,-0.83815
255,-0.9209999999999999
256,-1.0022
257,-1.0877
258,-1.1768
259,-1.2536
260,-1.3372
261,-1.4192
262,-1.4637
263,-1.5414
264,-1.6272
265,-1.6862
266,-1.6463
267,-1.6043
268,-1.5772
269,-1.4863
270,-1.4646
271,-1.4017
272,-1.3649
273,-1.2791
274,-1.2366
275,-1.153
276,-1.0456
277,-0.9590799999999999
278,-0.8704200000000001
279,-0.8377399999999999
280,-0.7542
281,-0.65589
282,-0.58092
283,-0.4856
284,-0.38997
285,-0.35179
286,-0.23665999999999998
287,-0.12575
288,-0.066472
289,0.018744
290,0.1183
291,0.2226
292,0.32968000000000003
293,0.41173999999999994
294,0.50064
295,0.60178
296,0.7178100000000001
297,0.80615
298,0.9152299999999999
299,0.98856
300,1.0051
301,0.9345700000000001
302,0.8750600000000001
303,0.81594
304,0.75884
305,0.70316
306,0.64876
307,0.58463
308,0.5182399999999999
309,0.45415
310,0.41916000000000003
311,0.37686
312,0.3214
313,0.26205
314,0.20229
315,0.13472
316,0.088523
317,0.039997000000000005
318,-0.0066436
319,-0.06428099999999999
320,-0.11017
321,-0.11255
322,-0.05914
323,0.0039177
324,0.068163
325,0.13239
326,0.15258
327,0.1064
328,0.043166
329,-0.0098095
330,-0.064277
331,-0.065861
332,-0.14012
333,-0.16834000000000002
334,-0.23919
335,-0.32211999999999996
336,-0.42016000000000003
337,-0.49186
338,-0.58782
339,-0.672
340,-0.75527
341,-0.81423
342,-0.8901700000000001
343,-0.9577600000000001
344,-0.9850399999999999
345,-1.0409
346,-0.99871
347,-0.91715
348,-0.8261799999999999
349,-0.73887
350,-0.64972
351,-0.55583
352,-0.46173000000000003
353,-0.36793000000000003
354,-0.30507
355,-0.33578
356,-0.37638
357,-0.42754
358,-0.49958
359,-0.55061
360,-0.5603600000000001
361,-0.6138399999999999
362,-0.6502899999999999
363,-0.67328
364,-0.74245
365,-0.8214
366,-0.88055
367,-0.90986
368,-0.9807
369,-1.0256
370,-1.0488
371,-1.1177
372,-1.1443
373,-1.197
374,-1.2484
375,-1.3169
376,-1.3435
377,-1.4208
378,-1.4549
379,-1.4865
380,-1.5516
381,-1.5678
382,-1.6284
383,-1.6361
384,-1.6459
385,-1.7341
386,-1.7143
387,-1.6058
388,-1.4967
389,-1.3863
390,-1.2652
391,-1.1573
392,-1.0344
393,-0.9264399999999999
394,-0.80356
395,-0.69548
396,-0.57247
397,-0.46465
398,-0.34981
399,-0.23376
400,-0.11105999999999999
401,-0.0027026999999999997
402,0.11840999999999999
403,0.22864
404,0.33705
405,0.44564
406,0.55432
407,0.6632100000000001
408,0.7720199999999999
409,0.88145
410,0.97609
411,1.0847
412,1.181
413,1.2761
414,1.3844
415,1.4805
416,1.5763
417,1.6732
418,1.7785
419,1.8773
420,1.9724
421,2.0816
422,2.1776
423,2.2734
424,2.3957
425,2.4981
426,2.5485
