time,value
0,-1.4361
1,-1.4026
2,-1.3567
3,-1.3056
4,-1.2563
5,-1.2119
6,-1.1761
7,-1.1485
8,-1.1314
9,-1.1243
10,-1.1229
11,-1.1256
12,-1.1215
13,-1.1116
14,-1.0922
15,-1.0624
16,-1.0295
17,-0.98816
18,-0.94915
19,-0.91027
20,-0.87445
21,-0.84567
22,-0.81613
23,-0.78919
24,-0.75557
25,-0.71462
26,-0.66572
27,-0.60451
28,-0.53457
29,-0.44669
30,-0.3328
31,-0.17084000000000002
32,0.067264
33,0.39997
34,0.83101
35,1.3242
36,1.8214
37,2.2526
38,2.5646
39,2.7438
40,2.8069
41,2.7941
42,2.7375
43,2.6543
44,2.5489
45,2.4209
46,2.2779
47,2.1266
48,1.9742
49,1.8223
50,1.67
51,1.5197
52,1.3701
53,1.2229999999999999
54,1.0767
55,0.9325399999999999
56,0.7945399999999999
57,0.6612600000000001
58,0.53362
59,0.40383
60,0.27296
61,0.14261
62,0.016547
63,-0.094838
64,-0.19619
65,-0.2799
66,-0.35181
67,-0.41518
68,-0.46851000000000004
69,-0.52128
70,-0.5645899999999999
71,-0.6029399999999999
72,-0.6345
73,-0.6582899999999999
74,-0.6827
75,-0.70075
76,-0.7187399999999999
77,-0.73361
78,-0.74452
79,-0.7551399999999999
80,-0.7581100000000001
81,-0.7598600000000001
82,-0.75763
83,-0.7518199999999999
84,-0.7448899999999999
85,-0.72724
86,-0.70515
87,-0.67577
88,-0.64379
89,-0.61425
90,-0.5807100000000001
91,-0.54928
92,-0.51445
93,-0.48176
94,-0.45501
95,-0.43093000000000004
96,-0.41043
97,-0.38148000000000004
98,-0.33814
99,-0.27111999999999997
100,-0.17249
101,-0.041094
102,0.12788
103,0.32992
104,0.56245
105,0.8157800000000001
106,1.0725
107,1.3128
108,1.5085
109,1.6431
110,1.7081
111,1.7105
112,1.6677
113,1.5922
114,1.4973
115,1.3862
116,1.2648
117,1.1392
118,1.0116
119,0.88661
120,0.75979
121,0.63358
122,0.51048
123,0.39405
124,0.29151
125,0.19985
126,0.12299000000000002
127,0.058967
128,0.0097295
129,-0.021955000000000002
130,-0.043848000000000005
131,-0.056309000000000005
132,-0.070686
133,-0.086113
134,-0.10240999999999999
135,-0.12236
136,-0.13969
137,-0.15980999999999998
138,-0.17176
139,-0.17137
140,-0.1565
141,-0.12539
142,-0.09095700000000001
143,-0.053024
144,-0.019058000000000002
145,0.0097613
146,0.034821
147,0.052501
148,0.070029
149,0.085847
150,0.10219
151,0.11829
152,0.13168
153,0.14687999999999998
154,0.16315
155,0.18384
156,0.2053
157,0.22107
158,0.22674
159,0.21563000000000002
160,0.19163
161,0.15682000000000001
162,0.11569000000000002
163,0.071563
164,0.021567
165,-0.032373
166,-0.094551
167,-0.16463
168,-0.24093
169,-0.32054
170,-0.39505
171,-0.46531999999999996
172,-0.5305
173,-0.59335
174,-0.65309
175,-0.70148
176,-0.7409
177,-0.77013
178,-0.79596
179,-0.82085
180,-0.8372
181,-0.8496799999999999
182,-0.85309
183,-0.85636
184,-0.8623299999999999
185,-0.86554
186,-0.87036
187,-0.86875
188,-0.8678299999999999
189,-0.86703
190,-0.8628
191,-0.85634
192,-0.8377100000000001
193,-0.80972
194,-0.76444
195,-0.6946
196,-0.59351
197,-0.44856
198,-0.2651
199,-0.048107
200,0.18315
201,0.40921
202,0.62207
203,0.81712
204,1.0068
205,1.1971
206,1.3885
207,1.5699
208,1.7156
209,1.8063
210,1.8289
211,1.7924
212,1.7185
213,1.6313
214,1.5519
215,1.4844
216,1.4263
217,1.3653
218,1.2894
219,1.196
220,1.09
221,0.98735
222,0.89718
223,0.82263
224,0.7581
225,0.69709
226,0.64057
227,0.58497
228,0.53059
229,0.46773000000000003
230,0.39061
231,0.30071
232,0.19849
233,0.097389
234,-0.0020964000000000004
235,-0.09542300000000001
236,-0.18338
237,-0.27288
238,-0.36
239,-0.45021000000000005
240,-0.53684
241,-0.61656
242,-0.68597
243,-0.7390800000000001
244,-0.78141
245,-0.81212
246,-0.8383
247,-0.8624799999999999
248,-0.8843
249,-0.9081799999999999
250,-0.9309799999999999
251,-0.9566600000000001
252,-0.9827799999999999
253,-1.0072
254,-1.0314
255,-1.0525
256,-1.0752
257,-1.0979
258,-1.1213
259,-1.1474
260,-1.1754
261,-1.2073
262,-1.2397
263,-1.2737
264,-1.3129
265,-1.3591
266,-1.4091
267,-1.4493
268,-1.4699
269,-1.4709
