[<text>
<title>laser precision corp &lt;lasr&gt; 4th qtr net</title>
<dateline>    irvine, calif., march 2 -
    </dateline>shr profit 14 cts vs profit two cts
    net profit 452,723 vs profit 50,581
    revs 5,065,543 vs 2,898,363
    year
    shr profit 45 cts vs loss 15 cts
    net profit 1,276,472 vs loss 340,081
    revs 16.0 mln vs 9,304,466
 reuter
</text>]