time,value
0,-0.28922
1,-0.31778
2,-0.39393
3,-0.39393
4,-0.36537
5,-0.27019
6,-0.27019
7,-0.36537
8,-0.39393
9,-0.38441
10,-0.35585
11,-0.26066999999999996
12,-0.27019
13,-0.39393
14,-0.39393
15,-0.39393
16,-0.3273
17,-0.2797
18,-0.2797
19,-0.38441
20,-0.39393
21,1.605
22,3.7276
23,3.8418
24,1.2147
25,-0.37489
26,-0.39393
27,-0.39393
28,-0.30826
29,-0.33681
30,-0.28922
31,-0.34633
32,-0.39393
33,-0.39393
34,-0.30826
35,-0.33681
36,-0.34633
37,-0.28922
38,-0.39393
39,-0.39393
40,-0.31778
41,-0.3273
42,-0.39393
43,-0.28922
44,-0.34633
45,-0.39393
46,-0.3273
47,-0.31778
48,-0.060779
49,-0.3273
50,-0.28922
51,-0.39393
52,-0.28922
53,-0.35585
54,1.348
55,1.0624
56,0.13910999999999998
57,-0.12741
58,-0.070298
59,-0.13693
60,-0.38441
61,-0.39393
62,-0.33681
63,0.31044
64,-0.2797
65,-0.35585
66,-0.39393
67,-0.39393
68,-0.39393
69,-0.30826
70,-0.25115
71,-0.33681
72,-0.39393
73,-0.38441
74,-0.39393
75,0.043924
76,-0.27019
77,-0.33681
78,-0.31778
79,-0.29874
80,-0.29874
81,-0.23210999999999998
82,-0.10837000000000001
83,-0.26066999999999996
84,-0.29874
85,-0.29874
86,2.2998
87,5.2886
88,3.2802
89,2.4807
90,-0.12741
91,-0.27019
92,-0.39393
93,-0.39393
94,-0.30826
95,-0.18452000000000002
