time,value
0,-1.2111
1,-1.2111
2,-1.2111
3,-1.2111
4,-0.54455
5,1.2647
6,1.0742
7,0.9790000000000001
8,0.78855
9,0.8837700000000001
10,-0.54455
11,-1.2111
12,-1.2111
13,-1.2111
14,-1.2111
15,-1.2111
16,-1.2111
17,-0.3541
18,1.1694
19,1.1694
20,0.9790000000000001
21,0.78855
22,0.8837700000000001
23,-1.0207
24,-1.2111
25,-1.2111
26,-1.2111
27,-1.2111
28,-1.2111
29,-1.2111
30,0.59811
31,1.1694
32,0.9790000000000001
33,0.8837700000000001
34,0.8837700000000001
35,0.122
36,-1.2111
37,-1.2111
38,-1.2111
39,-1.2111
40,-1.2111
41,-1.2111
42,-1.2111
43,1.2647
44,1.1694
45,0.9790000000000001
46,0.78855
47,0.8837700000000001
48,-0.63977
49,-1.2111
50,-1.2111
51,-1.2111
52,-1.2111
53,-1.2111
54,-1.2111
55,0.50289
56,1.1694
57,1.0742
58,0.9790000000000001
59,0.8837700000000001
60,0.8837700000000001
61,0.78855
62,0.78855
63,-0.63977
64,-1.2111
65,-1.2111
66,-1.2111
67,-1.2111
68,-1.2111
69,-1.2111
70,0.59811
71,1.1694
72,0.9790000000000001
73,0.8837700000000001
74,0.78855
75,0.78855
76,0.78855
77,0.78855
78,0.69333
79,0.69333
80,0.78855
81,0.69333
82,0.69333
83,0.69333
84,0.69333
85,0.69333
86,0.69333
87,0.69333
88,0.69333
89,0.69333
90,0.69333
91,0.69333
92,0.69333
93,0.69333
94,0.69333
95,0.69333
