time,value
0,0.126
1,0.8670899999999999
2,1.1435
3,1.0554
4,1.0915
5,1.3337
6,1.6891
7,1.1814
8,0.45313000000000003
9,0.48333000000000004
10,0.8234
11,0.98959
12,0.55218
13,0.80096
14,0.60275
15,0.29684
16,0.59249
17,0.5624
18,0.30628
19,0.34544
20,0.53772
21,0.40607
22,0.51953
23,0.47925
24,0.37148000000000003
25,0.35804
26,0.41378000000000004
27,0.34579
28,0.28323000000000004
29,0.40615999999999997
30,0.37746999999999997
31,0.33886
32,0.41503999999999996
33,0.30728
34,0.20277
35,0.38216999999999995
36,0.33287
37,0.29495
38,0.15933
39,0.066237
40,-0.15187
41,-0.43201000000000006
42,-0.85269
43,-1.3765
44,-1.7042
45,-1.791
46,-1.7639
47,-1.9462
48,-2.5759
49,-2.3667
50,-2.5232
51,-2.8741
52,-2.8519
53,-2.6906
54,-2.8059
55,-2.8029
56,-2.6977
57,-2.5689
58,-1.8074
59,-1.3642
60,-0.9934200000000001
61,-0.57035
62,-0.26318
63,0.16182
64,0.59653
65,0.23404
66,0.005887699999999999
67,0.15682000000000001
68,0.83799
69,0.65678
70,0.4924
71,0.48695
72,0.73821
73,1.0536
74,0.87145
75,1.2136
76,1.2278
77,0.79259
78,1.2433
79,0.9947
80,0.66152
81,0.45983
82,0.30946
83,0.9858600000000001
84,0.57781
85,0.8264299999999999
86,1.2770000000000001
87,1.0597
88,1.3719999999999999
89,1.3198
90,1.0001
91,1.0387
92,1.1174
93,2.404
94,-1.1634
95,1.5922
96,0.77494
97,1.1593
98,1.4997
99,1.2477
100,1.2313
101,1.4179
102,0.8751899999999999
103,1.2091
104,1.2301
105,2.9589
106,-1.3643
107,1.8953
108,1.3272
109,1.6458
110,1.3951
111,1.7005
112,1.5014
113,1.2479
114,0.78779
115,0.75402
116,0.32109
117,0.14774
118,0.17192000000000002
119,-0.37645
120,-0.43049
121,-0.64866
122,-1.0773
123,-1.3083
124,-1.6758
125,-1.7355
126,-1.7717
127,-1.8778
128,-2.2772
129,-2.3961
130,-2.696
131,-2.6603
132,-2.5545
133,-2.5372
134,-2.5508
135,-2.2554
136,-2.2030000000000003
137,-2.2998
138,-2.2878
139,-2.26
140,-2.1993
141,-1.9204
142,-1.6488
143,-1.1671
144,-1.2009999999999998
145,-0.98724
146,-0.9516399999999999
147,-0.8574
148,-0.63295
149,-0.51422
150,-0.36643000000000003
151,-0.42258999999999997
152,-0.36012
153,-0.25518
154,-0.3185
155,-0.22150999999999998
156,-0.31056999999999996
157,-0.24946999999999997
158,-0.19005999999999998
159,-0.10679000000000001
160,-0.15564
161,-0.17625
162,-0.11724000000000001
163,-0.24735
164,-0.30774
165,-0.19316
166,-0.26209
167,-0.29577
168,-0.19108
169,-0.27476999999999996
170,-0.20269
171,-0.14762
172,-0.1586
173,-0.04264
174,-0.16921
175,-0.17014
176,-0.08391599999999999
177,-0.056093
178,-0.061852
179,-0.086168
180,-0.11500999999999999
181,-0.059345
182,-0.0050163000000000004
183,0.004224800000000001
184,-0.067503
185,0.0019100999999999999
186,0.11325
187,0.077659
188,-0.027513
189,0.183
190,0.05063
191,-0.022269999999999998
192,-0.096614
193,-0.043919
194,0.08720599999999999
195,0.30128
196,0.2523
197,0.14299
198,0.067588
199,0.074294
200,0.067978
201,0.27854
202,0.14529
203,0.17493
204,0.21283000000000002
205,0.064679
206,0.091886
207,0.23116
208,0.11231
209,0.11774000000000001
210,0.23826999999999998
211,0.31273
212,0.27688
213,0.15791
214,0.23926999999999998
215,0.355
216,0.23744
217,0.095526
218,0.06804
219,0.083992
220,0.10693
221,0.19848
222,0.27384000000000003
223,0.045462999999999996
224,0.20551999999999998
225,0.21911999999999998
226,0.1942
227,0.061811000000000005
228,0.2295
229,0.33404
230,0.23567
231,0.026514
232,0.16103
233,0.24819000000000002
234,0.27684000000000003
235,0.38429
236,0.14102
237,0.22482
238,0.22710999999999998
239,0.23326
240,0.22793000000000002
241,0.25926
242,0.18045999999999998
243,0.14658
244,0.27639
245,0.27205
246,0.29124
247,0.282
248,0.26154
249,0.2836
250,0.17598
251,0.28744000000000003
252,0.31543000000000004
253,0.51888
254,0.14937
255,0.14805
256,0.30961
257,0.3064
258,0.41013
259,0.29524
260,0.30314
261,0.16773
262,0.15908
263,0.14462
264,0.29836999999999997
265,0.40312
266,0.40417
267,0.41478000000000004
268,0.27373000000000003
269,0.16449
270,0.28539000000000003
271,0.27881
272,0.29830999999999996
273,0.16989
274,0.30387
275,0.30298
276,0.29827
277,0.29921
278,0.29505
279,0.40259
280,0.15869
281,0.14974
282,0.28824
283,0.28261
284,0.28811
285,0.42363999999999996
286,0.41618999999999995
287,0.28549
288,0.40231999999999996
289,0.27971999999999997
290,0.26031
291,0.38736
292,0.39200999999999997
293,0.27715
294,0.14223
295,0.28247
296,0.27588
297,0.40552
298,0.39810999999999996
299,0.53308
