time,value
0,1.6952
1,1.6855
2,1.6584
3,1.6258
4,1.5938
5,1.5599
6,1.525
7,1.4881
8,1.4523
9,1.4145
10,1.3776
11,1.3409
12,1.3219999999999998
13,1.2855
14,1.2508
15,1.2262
16,1.1949
17,1.1628
18,1.1284
19,1.0925
20,1.0534
21,1.0123
22,0.9666799999999999
23,0.9263899999999999
24,0.8890100000000001
25,0.8501299999999999
26,0.8128
27,0.77449
28,0.73665
29,0.6994
30,0.6605800000000001
31,0.6217600000000001
32,0.58295
33,0.54579
34,0.50867
35,0.4699
36,0.43365
37,0.39755999999999997
38,0.36061
39,0.32372
40,0.28688
41,0.2501
42,0.21336999999999998
43,0.17542
44,0.13818
45,0.099677
46,0.061194000000000005
47,0.022732
48,-0.015708
49,-0.054124
50,-0.094286
51,-0.13222
52,-0.12252
53,-0.11400999999999999
54,-0.09378099999999999
55,-0.083979
56,-0.068074
57,-0.062367
58,-0.05879500000000001
59,-0.064541
60,-0.089816
61,-0.1205
62,-0.14672000000000002
63,-0.17478
64,-0.20445
65,-0.24266
66,-0.2766
67,-0.3148
68,-0.3469
69,-0.37875
70,-0.41391999999999995
71,-0.45738
72,-0.49751000000000006
73,-0.53577
74,-0.57034
75,-0.6047
76,-0.64541
77,-0.69138
78,-0.73653
79,-0.77793
80,-0.81925
81,-0.86075
82,-0.9075
83,-0.95424
84,-0.99926
85,-1.0442
86,-1.0904
87,-1.1358
88,-1.1798
89,-1.2261
90,-1.2757
91,-1.3157
92,-1.3499
93,-1.3817
94,-1.4128
95,-1.4461
96,-1.444
97,-1.4353
98,-1.4239
99,-1.416
100,-1.41
101,-1.4009
102,-1.4003
103,-1.4061
104,-1.4117
105,-1.3942
106,-1.379
107,-1.3725
108,-1.3834
109,-1.4097
110,-1.3947
111,-1.3721
112,-1.3554
113,-1.341
114,-1.3722
115,-1.3757
116,-1.3481
117,-1.3227
118,-1.3076
119,-1.2996
120,-1.3068
121,-1.3017
122,-1.272
123,-1.2452
124,-1.2207
125,-1.2162
126,-1.2288
127,-1.2042
128,-1.1788
129,-1.182
130,-1.1661
131,-1.1491
132,-1.1241
133,-1.1066
134,-1.0988
135,-1.0819
136,-1.0572
137,-1.0304
138,-1.02
139,-0.99825
140,-0.9682200000000001
141,-0.9425600000000001
142,-0.9226
143,-0.8967299999999999
144,-0.8675799999999999
145,-0.83075
146,-0.8042
147,-0.78363
148,-0.75512
149,-0.7219800000000001
150,-0.68999
151,-0.66755
152,-0.63713
153,-0.6005699999999999
154,-0.5754600000000001
155,-0.54577
156,-0.5123
157,-0.4785
158,-0.44572
159,-0.41521
160,-0.38079
161,-0.34776
162,-0.3148
163,-0.28458
164,-0.25319
165,-0.21796999999999997
166,-0.1825
167,-0.14619000000000001
168,-0.13137000000000001
169,-0.14694000000000002
170,-0.16779000000000002
171,-0.20597
172,-0.23736999999999997
173,-0.25005
174,-0.22630999999999998
175,-0.18778
176,-0.14984
177,-0.11245
178,-0.074713
179,-0.037139
180,-0.005227000000000001
181,0.033317
182,0.07233300000000001
183,0.11160999999999999
184,0.15111
185,0.19097999999999998
186,0.23139
187,0.27113000000000004
188,0.31053000000000003
189,0.35089000000000004
190,0.39142
191,0.43271000000000004
192,0.47361000000000003
193,0.51465
194,0.55511
195,0.59434
196,0.63447
197,0.67528
198,0.7159300000000001
199,0.75662
200,0.7965300000000001
201,0.83646
202,0.87677
203,0.91635
204,0.9551200000000001
205,0.99279
206,1.033
207,1.0733
208,1.1126
209,1.1523
210,1.1908
211,1.2308
212,1.2664
213,1.3029
214,1.3412
215,1.3795
216,1.4147
217,1.4424
218,1.4647
219,1.4635
220,1.4707
221,1.4804
222,1.4984
223,1.5047
224,1.5089
225,1.5194
226,1.5329
227,1.5418
228,1.5635
229,1.561
230,1.5544
231,1.5554
232,1.5618
233,1.5706
234,1.5847
235,1.5873
236,1.5903
237,1.6055
238,1.6033
239,1.6097
240,1.6119999999999999
241,1.611
242,1.6103
243,1.5824
244,1.5479
245,1.5127
246,1.4801
247,1.4458
248,1.4088
249,1.3709
250,1.3329
251,1.2961
252,1.2594
253,1.2215
254,1.1837
255,1.1458
256,1.1079999999999999
257,1.0702
258,1.0312
259,0.99467
260,0.95693
261,0.9197799999999999
262,0.8828299999999999
263,0.8451700000000001
264,0.8075399999999999
265,0.76993
266,0.73235
267,0.69479
268,0.65727
269,0.61833
270,0.58085
271,0.54193
272,0.50449
273,0.46708
274,0.42818999999999996
275,0.39084
276,0.35352
277,0.31624
278,0.27899999999999997
279,0.24019000000000001
280,0.19977
281,0.15935
282,0.12054000000000001
283,0.08173899999999999
284,0.041316000000000005
285,0.00089415
286,-0.037899
287,-0.076682
288,-0.11545
289,-0.15253
290,-0.18954000000000001
291,-0.22621
292,-0.23415
293,-0.26245
294,-0.29698
295,-0.33336
296,-0.36546999999999996
297,-0.40371999999999997
298,-0.43976000000000004
299,-0.4757
300,-0.51151
301,-0.5472
302,-0.58038
303,-0.61329
304,-0.64083
305,-0.67299
306,-0.7021
307,-0.73632
308,-0.77032
309,-0.80408
310,-0.8375799999999999
311,-0.8677
312,-0.8973399999999999
313,-0.92317
314,-0.9550799999999999
315,-0.9900899999999999
316,-1.0248
317,-1.0557
318,-1.0859999999999999
319,-1.1159
320,-1.1412
321,-1.1693
322,-1.1976
323,-1.2247
324,-1.2466
325,-1.2719
326,-1.301
327,-1.3245
328,-1.3469
329,-1.3682
330,-1.3881
331,-1.4067
332,-1.4238
333,-1.4393
334,-1.4532
335,-1.4693
336,-1.4814
337,-1.4897
338,-1.4961
339,-1.5064
340,-1.5145
341,-1.5146
342,-1.5125
343,-1.5142
344,-1.5078
345,-1.4993
346,-1.4907
347,-1.4821
348,-1.4678
349,-1.4571
350,-1.4403
351,-1.4272
352,-1.4095
353,-1.3921
354,-1.3685
355,-1.3530000000000002
356,-1.331
357,-1.3087
358,-1.2808
359,-1.2561
360,-1.2267
361,-1.2003
362,-1.1719
363,-1.1418
364,-1.1133
365,-1.0759
366,-1.044
367,-1.0165
368,-0.9817299999999999
369,-0.9404600000000001
370,-0.89002
371,-0.8458200000000001
372,-0.81612
373,-0.7822100000000001
374,-0.7570399999999999
375,-0.7331300000000001
376,-0.7078
377,-0.6716300000000001
378,-0.63848
379,-0.60528
380,-0.5718300000000001
381,-0.53233
382,-0.49568
383,-0.45243
384,-0.41357
385,-0.37955
386,-0.3481
387,-0.31636
388,-0.27378
389,-0.24436999999999998
390,-0.21456
391,-0.17698
392,-0.1418
393,-0.1089
394,-0.073439
395,-0.037873000000000004
396,-0.0022038
397,0.035072000000000006
398,0.071636
399,0.10755
400,0.14140999999999998
401,0.17543
402,0.21165
403,0.24795
404,0.28431999999999996
405,0.31814000000000003
406,0.34959
407,0.3821
408,0.41752
409,0.43305
410,0.4581
411,0.4909
412,0.5176
413,0.5545899999999999
414,0.59575
415,0.63294
416,0.6674
417,0.6955
418,0.72295
419,0.72529
420,0.73402
421,0.73164
422,0.7180300000000001
423,0.70489
424,0.6864899999999999
425,0.68306
426,0.64076
427,0.5970300000000001
428,0.58832
429,0.6170100000000001
430,0.6560699999999999
431,0.69444
432,0.73215
433,0.77045
434,0.8083100000000001
435,0.8455
436,0.88249
437,0.9196
438,0.95636
439,0.99284
440,1.03
441,1.0679
442,1.1054
443,1.1432
444,1.1744
445,1.2122
446,1.2501
447,1.2882
448,1.3264
449,1.365
450,1.4037
451,1.4426
452,1.4816
453,1.5091
454,1.5371
455,1.5714
456,1.6061
457,1.6404
458,1.6611
459,1.6763
460,1.6799
461,1.6898
462,1.6941
