time,value
0,-0.54032
1,-0.54032
2,-0.54032
3,-0.54032
4,-0.54032
5,-0.54032
6,-0.54032
7,-0.54032
8,-0.54032
9,-0.54032
10,-0.54032
11,-0.54032
12,-0.54032
13,-0.54032
14,-0.54032
15,-0.54032
16,-0.54032
17,-0.54032
18,-0.54032
19,-0.54032
20,-0.54032
21,-0.54032
22,-0.54032
23,-0.54032
24,-0.54032
25,-0.54032
26,-0.54032
27,-0.54032
28,-0.54032
29,-0.54032
30,-0.54032
31,-0.54032
32,-0.54032
33,-0.54032
34,-0.54032
35,-0.54032
36,-0.54032
37,-0.54032
38,-0.54032
39,-0.54032
40,-0.54032
41,-0.54032
42,-0.54032
43,-0.54032
44,-0.54032
45,-0.54032
46,-0.54032
47,-0.54032
48,-0.54032
49,-0.54032
50,-0.10805999999999999
51,0.18011
52,0.32419000000000003
53,0.18011
54,0.32419000000000003
55,0.18011
56,0.32419000000000003
57,0.18011
58,0.32419000000000003
59,-0.10805999999999999
60,-0.54032
61,-0.54032
62,-0.54032
63,-0.54032
64,-0.54032
65,-0.54032
66,-0.54032
67,1.0446
68,0.32419000000000003
69,2.7736
70,2.7736
71,1.1887
72,0.036021
73,-0.10805999999999999
74,0.036021
75,-0.10805999999999999
76,0.036021
77,-0.10805999999999999
78,0.036021
79,-0.10805999999999999
80,0.036021
81,-0.10805999999999999
82,0.036021
83,-0.10805999999999999
84,0.036021
85,-0.10805999999999999
86,0.036021
87,2.0532
88,2.9177
89,2.7736
90,3.0618
91,3.0618
92,2.9177
93,3.0618
94,1.621
95,-0.10805999999999999
