time,value
0,-0.9225399999999999
1,0.9618
2,-0.9225399999999999
3,-0.9225399999999999
4,1.0665
5,0.54306
6,1.7993
7,-0.5038
8,-0.9225399999999999
9,-0.9225399999999999
10,1.0665
11,-0.9225399999999999
12,-0.9225399999999999
13,-0.18974000000000002
14,2.0087
15,-0.29443
16,-0.9225399999999999
17,0.75243
18,-0.71317
19,-0.9225399999999999
20,-0.9225399999999999
21,0.9618
22,0.75243
23,1.6946
24,-0.9225399999999999
25,-0.9225399999999999
26,0.54306
27,-0.39910999999999996
28,-0.9225399999999999
29,-0.9225399999999999
30,1.9040000000000001
31,1.2759
32,-0.9225399999999999
33,-0.9225399999999999
34,-0.5038
35,0.75243
36,-0.9225399999999999
37,0.54306
38,1.9040000000000001
39,-0.71317
40,-0.5038
41,0.64774
42,-0.9225399999999999
43,-0.9225399999999999
44,0.85711
45,-0.5038
46,2.0087
47,0.22899999999999998
48,-0.9225399999999999
49,-0.9225399999999999
50,0.9618
51,-0.9225399999999999
52,-0.9225399999999999
53,-0.18974000000000002
54,0.33369
55,1.6946
56,0.9618
57,-0.9225399999999999
58,-0.9225399999999999
59,-0.9225399999999999
60,0.75243
61,-0.60848
62,-0.9225399999999999
63,-0.9225399999999999
64,1.6946
65,0.33369
66,0.12430999999999999
67,0.019629
68,-0.9225399999999999
69,-0.5038
70,0.64774
71,-0.9225399999999999
72,1.6946
73,0.85711
74,-0.9225399999999999
75,-0.71317
76,1.0665
77,-0.9225399999999999
78,-0.9225399999999999
79,1.3805
80,2.0087
81,-0.39910999999999996
82,-0.9225399999999999
83,0.64774
84,-0.39910999999999996
85,-0.9225399999999999
86,0.43837
87,1.9040000000000001
88,0.64774
89,-0.9225399999999999
90,-0.9225399999999999
91,0.019629
92,0.12430999999999999
93,-0.9225399999999999
94,-0.29443
95,1.9040000000000001
