time,value
0,0.91571
1,0.85256
2,0.85256
3,0.85256
4,0.7894100000000001
5,0.28419
6,-1.2946
7,-1.2946
8,-1.2946
9,-1.2946
10,0.5368
11,0.9788600000000001
12,0.91571
13,0.85256
14,0.7894100000000001
15,0.85256
16,0.59995
17,-1.2946
18,-1.2946
19,-1.2946
20,-1.2946
21,0.031576
22,1.042
23,0.85256
24,0.85256
25,0.72625
26,0.7894100000000001
27,-0.031576
28,-1.2946
29,-1.2946
30,-1.2946
31,-1.2946
32,0.85256
33,0.91571
34,0.85256
35,0.7894100000000001
36,0.7894100000000001
37,-0.28419
38,-1.2946
39,-1.2946
40,-1.2946
41,-1.2946
42,0.7894100000000001
43,0.9788600000000001
44,0.85256
45,0.85256
46,0.7894100000000001
47,0.7894100000000001
48,0.031576
49,-1.2946
50,-1.2946
51,-1.2946
52,-1.2946
53,0.47363999999999995
54,0.9788600000000001
55,0.91571
56,0.7894100000000001
57,0.85256
58,0.7894100000000001
59,-0.031576
60,-1.2946
61,-1.2946
62,-1.2946
63,-1.2946
64,0.59995
65,0.9788600000000001
66,0.85256
67,0.85256
68,0.7894100000000001
69,0.7894100000000001
70,0.7894100000000001
71,-1.1683
72,-1.2946
73,-1.2946
74,-1.2946
75,-0.5368
76,1.1052
77,0.91571
78,0.85256
79,0.85256
80,0.7894100000000001
81,0.7894100000000001
82,-0.28419
83,-1.2946
84,-1.2946
85,-1.2946
86,-1.2946
87,0.7894100000000001
88,0.9788600000000001
89,0.91571
90,0.85256
91,0.7894100000000001
92,0.85256
93,0.47363999999999995
94,-1.2946
95,-1.2946
