time,value
0,-0.15163
1,-0.15163
2,-0.15163
3,-0.15163
4,-0.15163
5,-0.15163
6,-0.15163
7,-0.15163
8,-0.15163
9,-0.15163
10,-0.15163
11,-0.15163
12,-0.15163
13,-0.15163
14,-0.15163
15,-0.15163
16,-0.15163
17,-0.15163
18,-0.15163
19,-0.15163
20,-0.15163
21,-0.15163
22,-0.15163
23,-0.15163
24,-0.15163
25,-0.15163
26,-0.15163
27,-0.15163
28,-0.15163
29,-0.15163
30,-0.15163
31,-0.15163
32,-0.15163
33,-0.15163
34,-0.15163
35,-0.15163
36,-0.08693200000000001
37,8.6898
38,4.0966
39,0.5168699999999999
40,0.58157
41,-0.15163
42,-0.15163
43,-0.15163
44,-0.15163
45,-0.15163
46,-0.15163
47,-0.15163
48,-0.15163
49,-0.15163
50,-0.15163
51,-0.15163
52,-0.15163
53,-0.15163
54,-0.15163
55,-0.15163
56,-0.15163
57,-0.15163
58,-0.15163
59,-0.15163
60,-0.15163
61,-0.15163
62,-0.15163
63,-0.15163
64,-0.15163
65,-0.15163
66,-0.15163
67,-0.15163
68,-0.15163
69,-0.15163
70,-0.15163
71,-0.15163
72,-0.15163
73,-0.15163
74,-0.15163
75,-0.15163
76,-0.15163
77,-0.15163
78,-0.15163
79,-0.15163
80,-0.15163
81,-0.15163
82,-0.15163
83,-0.15163
84,-0.15163
85,-0.15163
86,-0.15163
87,-0.15163
88,-0.15163
89,-0.15163
90,-0.15163
91,-0.15163
92,-0.15163
93,-0.15163
94,-0.15163
95,-0.15163
