time,value
0,0.71997
1,-1.3745
2,0.71997
3,0.71997
4,-1.3745
5,0.71997
6,-1.3745
7,0.71997
8,0.71997
9,0.71997
10,-1.3745
11,0.71997
12,0.71997
13,0.71997
14,-1.3745
15,0.71997
16,0.71997
17,0.71997
18,-1.3745
19,0.71997
20,0.71997
21,0.71997
22,-1.3745
23,0.71997
24,0.71997
25,-1.3745
26,0.71997
27,0.71997
28,0.71997
29,-1.3745
30,0.71997
31,0.71997
32,-1.3745
33,0.71997
34,0.71997
35,-1.3745
36,0.71997
37,0.71997
38,-1.3745
39,0.71997
40,0.71997
41,-1.3745
42,0.71997
43,-1.3745
44,0.71997
45,0.71997
46,-1.3745
47,0.71997
48,-1.3745
49,0.71997
50,-1.3745
51,0.71997
52,0.71997
53,-1.3745
54,0.71997
55,0.71997
56,-1.3745
57,0.71997
58,0.71997
59,0.71997
60,-1.3745
61,0.71997
62,0.71997
63,-1.3745
64,0.71997
65,0.71997
66,0.71997
67,-1.3745
68,0.71997
69,0.71997
70,-1.3745
71,0.71997
72,-1.3745
73,0.71997
74,-1.3745
75,0.71997
76,-1.3745
77,0.71997
78,0.71997
79,0.71997
80,-1.3745
81,0.71997
82,0.71997
83,0.71997
84,-1.3745
85,0.71997
86,0.71997
87,-1.3745
88,0.71997
89,-1.3745
90,0.71997
91,-1.3745
92,0.71997
93,-1.3745
94,0.71997
95,-1.3745
