time,value
0,-0.15919
1,-0.15919
2,-0.15919
3,-0.15919
4,-0.15919
5,-0.15919
6,-0.15919
7,-0.15919
8,-0.15919
9,-0.15919
10,-0.15919
11,-0.15919
12,-0.15919
13,-0.15919
14,-0.15919
15,-0.15919
16,-0.15919
17,-0.15919
18,-0.15919
19,-0.15919
20,-0.15919
21,-0.15919
22,-0.15919
23,-0.15919
24,-0.15919
25,-0.15919
26,-0.15919
27,-0.15919
28,-0.15919
29,-0.15919
30,-0.15919
31,-0.15919
32,-0.15919
33,-0.15919
34,-0.15919
35,-0.15919
36,-0.15919
37,-0.15919
38,-0.15919
39,-0.15919
40,-0.15919
41,-0.15919
42,-0.15919
43,-0.15919
44,-0.15919
45,-0.15919
46,-0.15919
47,-0.15919
48,-0.15919
49,-0.15919
50,-0.15919
51,-0.15919
52,-0.15919
53,-0.15919
54,-0.15919
55,-0.15919
56,-0.15919
57,-0.15919
58,-0.15919
59,-0.15919
60,-0.15919
61,-0.15919
62,-0.15919
63,-0.15919
64,-0.15919
65,-0.15919
66,-0.15919
67,-0.15919
68,-0.15919
69,-0.15919
70,-0.15919
71,-0.15919
72,-0.15919
73,-0.15919
74,-0.15919
75,-0.15919
76,-0.15919
77,-0.15919
78,-0.15919
79,-0.15919
80,-0.15919
81,-0.15919
82,-0.15919
83,-0.15919
84,-0.08491599999999999
85,0.17505
86,6.1544
87,0.17505
88,0.17505
89,0.17505
90,7.3985
91,-0.15919
92,-0.15919
93,-0.15919
94,-0.15919
95,-0.15919
