time,value
0,1.7738
1,1.7506
2,1.7425
3,1.7362
4,1.7032
5,1.6688
6,1.6252
7,1.5838
8,1.5397
9,1.4959
10,1.4524
11,1.4088
12,1.3654
13,1.3224
14,1.2795
15,1.2367
16,1.1941
17,1.1518
18,1.1097
19,1.0675
20,1.0266
21,0.9865
22,0.94478
23,0.9032
24,0.8618100000000001
25,0.82068
26,0.77965
27,0.7388600000000001
28,0.69826
29,0.65796
30,0.6179100000000001
31,0.57812
32,0.53846
33,0.49926000000000004
34,0.46316999999999997
35,0.42451000000000005
36,0.38659
37,0.34836999999999996
38,0.31066
39,0.2755
40,0.23784
41,0.20077
42,0.16405
43,0.12713
44,0.09286
45,0.056665999999999994
46,0.020327
47,-0.015969
48,-0.051882000000000005
49,-0.086648
50,-0.12178
51,-0.15621
52,-0.1909
53,-0.22569
54,-0.25423
55,-0.28752
56,-0.32437
57,-0.35413
58,-0.38582
59,-0.41922
60,-0.45103000000000004
61,-0.48023999999999994
62,-0.50984
63,-0.53928
64,-0.56868
65,-0.6002
66,-0.62569
67,-0.64982
68,-0.67787
69,-0.71425
70,-0.73182
71,-0.7541899999999999
72,-0.77763
73,-0.7982899999999999
74,-0.80938
75,-0.83625
76,-0.8399200000000001
77,-0.8413200000000001
78,-0.84072
79,-0.8356600000000001
80,-0.83076
81,-0.82836
82,-0.8230799999999999
83,-0.81421
84,-0.8031699999999999
85,-0.79655
86,-0.78822
87,-0.77467
88,-0.76051
89,-0.74469
90,-0.72992
91,-0.71391
92,-0.71677
93,-0.6916100000000001
94,-0.69303
95,-0.73765
96,-0.77753
97,-0.82025
98,-0.86436
99,-0.9079299999999999
100,-0.95099
101,-0.99323
102,-1.0347
103,-1.0743
104,-1.1122
105,-1.151
106,-1.1893
107,-1.2268
108,-1.2648
109,-1.2756
110,-1.2668
111,-1.2561
112,-1.2452
113,-1.2327
114,-1.2186
115,-1.2015
116,-1.185
117,-1.1653
118,-1.1458
119,-1.1251
120,-1.1052
121,-1.0834
122,-1.0602
123,-1.0351
124,-1.0111
125,-0.98614
126,-0.9588899999999999
127,-0.93363
128,-0.90543
129,-0.8762200000000001
130,-0.84725
131,-0.81953
132,-0.7898
133,-0.75864
134,-0.72583
135,-0.6926
136,-0.65312
137,-0.60621
138,-0.55889
139,-0.51237
140,-0.46888
141,-0.42854
142,-0.39144
143,-0.35843
144,-0.32886
145,-0.31548000000000004
146,-0.30355
147,-0.33147
148,-0.35882
149,-0.32324
150,-0.28807
151,-0.25172
152,-0.2158
153,-0.1821
154,-0.14994000000000002
155,-0.10797000000000001
156,-0.070264
157,-0.030310000000000004
158,0.011434
159,0.056287000000000004
160,0.10027
161,0.14497000000000002
162,0.18791
163,0.23085
164,0.27466999999999997
165,0.31849
166,0.36056
167,0.40365999999999996
168,0.44733999999999996
169,0.49116000000000004
170,0.53498
171,0.57881
172,0.62437
173,0.67011
174,0.7147100000000001
175,0.75722
176,0.80207
177,0.84782
178,0.89269
179,0.93827
180,0.9838899999999999
181,1.0286
182,1.0733
183,1.1179
184,1.1619
185,1.2066
186,1.2513
187,1.2951
188,1.3389
189,1.3819
190,1.4248
191,1.4659
192,1.4858
193,1.4664
194,1.4432
195,1.4177
196,1.3976
197,1.3704
198,1.3449
199,1.3193
200,1.2929
201,1.2646
202,1.2418
203,1.2221
204,1.1973
205,1.1714
206,1.1517
207,1.1227
208,1.0885
209,1.0687
210,1.0593
211,1.0247
212,0.9963799999999999
213,0.97259
214,0.98739
215,1.0079
216,1.0252
217,1.0366
218,1.0464
219,1.0582
220,1.0682
221,1.0766
222,1.0839
223,1.0816
224,1.0825
225,1.1085
226,1.1189
227,1.1241
228,1.1298
229,1.1387
230,1.1531
231,1.1718
232,1.1989
233,1.1772
234,1.136
235,1.0941
236,1.0517
237,1.0093
238,0.96659
239,0.9235200000000001
240,0.87982
241,0.83619
242,0.79293
243,0.74942
244,0.706
245,0.6624800000000001
246,0.61903
247,0.5756899999999999
248,0.5323100000000001
249,0.48883999999999994
250,0.44611000000000006
251,0.40342
252,0.36298
253,0.32097
254,0.27881999999999996
255,0.23651999999999998
256,0.19463
257,0.15282
258,0.11117
259,0.069811
260,0.031150999999999998
261,-0.010203
262,-0.051123
263,-0.09187200000000001
264,-0.13235
265,-0.17288
266,-0.21366
267,-0.25494
268,-0.29664
269,-0.33843
270,-0.36835999999999997
271,-0.38811999999999997
272,-0.3975
273,-0.40335
274,-0.42228999999999994
275,-0.42823
276,-0.42832
277,-0.43018999999999996
278,-0.44168999999999997
279,-0.44728999999999997
280,-0.44888999999999996
281,-0.45486000000000004
282,-0.46246000000000004
283,-0.46895
284,-0.48467
285,-0.49981000000000003
286,-0.51558
287,-0.5250100000000001
288,-0.52293
289,-0.5273
290,-0.5353600000000001
291,-0.542
292,-0.56709
293,-0.60263
294,-0.64394
295,-0.68757
296,-0.73187
297,-0.77781
298,-0.8264100000000001
299,-0.8730899999999999
300,-0.9131799999999999
301,-0.9684799999999999
302,-1.0175
303,-1.0571
304,-1.1048
305,-1.1511
306,-1.1984
307,-1.2491
308,-1.2963
309,-1.3363
310,-1.3658
311,-1.3983
312,-1.4272
313,-1.4555
314,-1.4837
315,-1.5117
316,-1.5384
317,-1.5653
318,-1.5906
319,-1.6142
320,-1.6379
321,-1.6551
322,-1.6672
323,-1.6775
324,-1.6718
325,-1.6274
326,-1.5836
327,-1.5406
328,-1.4951
329,-1.4489
330,-1.4027
331,-1.3754
332,-1.3886
333,-1.4004
334,-1.4166
335,-1.4412
336,-1.4749
337,-1.5067
338,-1.4661
339,-1.425
340,-1.3840000000000001
341,-1.3428
342,-1.3013
343,-1.2597
344,-1.2179
345,-1.1759
346,-1.1339
347,-1.0913
348,-1.0532
349,-1.0548
350,-1.0576
351,-1.0813
352,-1.1073
353,-1.1346
354,-1.1649
355,-1.1967
356,-1.2282
357,-1.2594
358,-1.2895
359,-1.3197
360,-1.3532
361,-1.3728
362,-1.3594
363,-1.3231
364,-1.2899
365,-1.2576
366,-1.2246
367,-1.1909999999999998
368,-1.1564
369,-1.1177
370,-1.0778
371,-1.046
372,-1.013
373,-0.97582
374,-0.941
375,-0.90396
376,-0.8681700000000001
377,-0.82699
378,-0.78104
379,-0.75236
380,-0.71865
381,-0.68145
382,-0.64179
383,-0.60482
384,-0.5684600000000001
385,-0.52609
386,-0.48639
387,-0.44377
388,-0.40818000000000004
389,-0.37181
390,-0.33491
391,-0.2973
392,-0.25953000000000004
393,-0.22030999999999998
394,-0.17765
395,-0.13763
396,-0.095663
397,-0.051138
398,-0.014094
399,0.023109
400,0.06286900000000001
401,0.10705999999999999
402,0.14498
403,0.1826
404,0.2215
405,0.26504
406,0.3086
407,0.34778000000000003
408,0.38203000000000004
409,0.42017
410,0.45948
411,0.49708
412,0.53673
413,0.57887
414,0.62363
415,0.6580600000000001
416,0.69977
417,0.73949
418,0.77876
419,0.82196
420,0.86011
421,0.89895
422,0.93785
423,0.9749200000000001
424,1.013
425,1.0531
426,1.0914
427,1.1261
428,1.162
429,1.2061
430,1.234
431,1.2688
432,1.3049
433,1.3396
434,1.3693
435,1.4078
436,1.4406
437,1.4709
438,1.5053
439,1.5385
440,1.5719999999999998
441,1.6072
442,1.6432
443,1.68
444,1.7176
445,1.7565
446,1.7790000000000001
447,1.7909
448,1.7807
449,1.7415
450,1.702
451,1.662
452,1.6211
453,1.5802
454,1.5388
455,1.5266
456,1.5637
457,1.6005
458,1.641
459,1.6813
460,1.722
461,1.7532
462,1.7604
