time,value
0,-0.38186
1,-0.38186
2,-0.38186
3,-0.38186
4,-0.38186
5,-0.38186
6,-0.38186
7,-0.38186
8,-0.38186
9,-0.38186
10,-0.38186
11,-0.38186
12,0.13935
13,-0.38186
14,-0.38186
15,-0.38186
16,-0.38186
17,-0.38186
18,-0.38186
19,-0.38186
20,0.13935
21,-0.38186
22,-0.38186
23,-0.38186
24,-0.38186
25,-0.38186
26,-0.38186
27,-0.38186
28,-0.38186
29,-0.38186
30,-0.38186
31,-0.38186
32,-0.38186
33,-0.38186
34,-0.38186
35,-0.38186
36,-0.38186
37,-0.38186
38,-0.38186
39,-0.38186
40,-0.034386
41,-0.38186
42,-0.38186
43,-0.38186
44,-0.38186
45,-0.38186
46,-0.38186
47,-0.38186
48,-0.38186
49,-0.38186
50,-0.38186
51,-0.38186
52,-0.38186
53,-0.38186
54,-0.38186
55,-0.38186
56,-0.38186
57,-0.38186
58,-0.38186
59,-0.38186
60,-0.38186
61,-0.38186
62,-0.38186
63,-0.38186
64,-0.38186
65,-0.38186
66,-0.38186
67,-0.38186
68,-0.38186
69,-0.38186
70,-0.38186
71,-0.38186
72,-0.38186
73,-0.38186
74,-0.38186
75,-0.38186
76,-0.38186
77,-0.38186
78,-0.38186
79,-0.38186
80,0.83431
81,0.83431
82,0.66057
83,0.66057
84,0.66057
85,0.66057
86,0.66057
87,3.0929
88,3.6141
89,3.7879
90,3.6141
91,3.6141
92,3.7879
93,1.3555
94,0.66057
95,0.66057
