[<text>
<title>&lt;birdsboro corp&gt; 4th qtr loss</title>
<dateline>    miami, april 17 -
    </dateline>shr loss 24 cts vs loss 20 cts
    net loss 1,718,000 vs loss 1,483,000
    sales 7,266,000 vs 6,490,000
    year
    shr loss 1.83 dlrs vs loss 53 cts
    net loss 13.2 mln vs loss 3,833,000
    sales 19.1 mln vs 29.5 mln
    note: 1986 year net includes pretax realized loss on
secureity transaction of 4,124,000 dlrs.
    net includes tax credits of 751,000 dlrs vs 606,000 dlrs in
quarter and 1,163,000 dlrs vs 2,289,000 dlrs in year.
    1986 net both periods includes gain 1,887,000 dlrs from
pension plan termination.
 reuter
</text>]