time,value
0,0.49415
1,0.49415
2,0.49415
3,-2.0026
4,0.49415
5,0.49415
6,0.49415
7,-2.0026
8,0.49415
9,0.49415
10,0.49415
11,0.49415
12,-2.0026
13,0.49415
14,0.49415
15,0.49415
16,0.49415
17,-2.0026
18,0.49415
19,0.49415
20,0.49415
21,0.49415
22,-2.0026
23,0.49415
24,0.49415
25,0.49415
26,0.49415
27,-2.0026
28,0.49415
29,0.49415
30,0.49415
31,0.49415
32,0.49415
33,-2.0026
34,0.49415
35,0.49415
36,0.49415
37,0.49415
38,-2.0026
39,0.49415
40,0.49415
41,0.49415
42,-2.0026
43,0.49415
44,0.49415
45,0.49415
46,0.49415
47,-2.0026
48,0.49415
49,0.49415
50,0.49415
51,0.49415
52,-2.0026
53,0.49415
54,0.49415
55,0.49415
56,0.49415
57,-2.0026
58,0.49415
59,0.49415
60,0.49415
61,-2.0026
62,0.49415
63,0.49415
64,0.49415
65,0.49415
66,-2.0026
67,0.49415
68,0.49415
69,0.49415
70,0.49415
71,-2.0026
72,0.49415
73,0.49415
74,0.49415
75,0.49415
76,-2.0026
77,0.49415
78,0.49415
79,0.49415
80,0.49415
81,-2.0026
82,0.49415
83,0.49415
84,0.49415
85,0.49415
86,-2.0026
87,0.49415
88,0.49415
89,0.49415
90,0.49415
91,-2.0026
92,0.49415
93,0.49415
94,0.49415
95,0.49415
