time,value
0,-0.47081000000000006
1,-0.47081000000000006
2,-0.47081000000000006
3,-0.47081000000000006
4,-0.47081000000000006
5,-0.47081000000000006
6,-0.47081000000000006
7,-0.47081000000000006
8,-0.47081000000000006
9,-0.47081000000000006
10,-0.47081000000000006
11,-0.47081000000000006
12,-0.47081000000000006
13,-0.47081000000000006
14,-0.47081000000000006
15,-0.47081000000000006
16,-0.47081000000000006
17,-0.47081000000000006
18,-0.47081000000000006
19,-0.47081000000000006
20,-0.47081000000000006
21,-0.47081000000000006
22,-0.47081000000000006
23,-0.47081000000000006
24,-0.47081000000000006
25,-0.47081000000000006
26,0.8392700000000001
27,2.8044
28,-0.47081000000000006
29,-0.47081000000000006
30,-0.47081000000000006
31,-0.47081000000000006
32,-0.47081000000000006
33,-0.47081000000000006
34,-0.47081000000000006
35,-0.47081000000000006
36,-0.47081000000000006
37,-0.47081000000000006
38,-0.47081000000000006
39,-0.47081000000000006
40,-0.47081000000000006
41,-0.47081000000000006
42,-0.47081000000000006
43,-0.47081000000000006
44,-0.47081000000000006
45,-0.47081000000000006
46,-0.47081000000000006
47,-0.47081000000000006
48,-0.47081000000000006
49,-0.47081000000000006
50,-0.47081000000000006
51,-0.47081000000000006
52,-0.47081000000000006
53,-0.47081000000000006
54,-0.47081000000000006
55,-0.47081000000000006
56,-0.47081000000000006
57,-0.47081000000000006
58,-0.47081000000000006
59,-0.47081000000000006
60,-0.47081000000000006
61,-0.47081000000000006
62,-0.47081000000000006
63,-0.47081000000000006
64,-0.47081000000000006
65,-0.47081000000000006
66,-0.47081000000000006
67,-0.47081000000000006
68,-0.47081000000000006
69,2.8044
70,2.8044
71,3.4594
72,2.8044
73,1.4943
74,2.1493
75,1.4943
76,1.4943
77,1.4943
78,1.4943
79,1.4943
80,1.4943
81,1.4943
82,2.1493
83,1.4943
84,1.4943
85,1.4943
86,-0.47081000000000006
87,-0.47081000000000006
88,-0.47081000000000006
89,-0.47081000000000006
90,-0.47081000000000006
91,-0.47081000000000006
92,-0.47081000000000006
93,-0.47081000000000006
94,-0.47081000000000006
95,-0.47081000000000006
