time,value
0,-0.34959
1,-0.34959
2,-0.34959
3,-0.34959
4,-0.34959
5,-0.34959
6,-0.34959
7,-0.34959
8,-0.34959
9,-0.34959
10,-0.34959
11,-0.34959
12,0.18312
13,-0.34959
14,-0.34959
15,-0.34959
16,-0.34959
17,-0.34959
18,-0.34959
19,-0.34959
20,0.0055491
21,-0.34959
22,-0.34959
23,-0.34959
24,-0.34959
25,-0.34959
26,-0.34959
27,-0.34959
28,-0.34959
29,-0.34959
30,-0.34959
31,-0.34959
32,-0.34959
33,-0.34959
34,-0.34959
35,-0.34959
36,-0.34959
37,-0.34959
38,-0.34959
39,-0.34959
40,0.0055491
41,-0.34959
42,-0.34959
43,-0.34959
44,-0.34959
45,-0.34959
46,-0.34959
47,-0.34959
48,-0.34959
49,-0.34959
50,-0.34959
51,-0.34959
52,-0.34959
53,-0.34959
54,-0.34959
55,-0.34959
56,0.0055491
57,-0.34959
58,-0.34959
59,-0.34959
60,-0.34959
61,-0.34959
62,-0.34959
63,-0.34959
64,-0.34959
65,-0.34959
66,-0.34959
67,-0.34959
68,-0.34959
69,-0.34959
70,-0.34959
71,0.18312
72,2.8467
73,-0.34959
74,-0.34959
75,-0.34959
76,-0.34959
77,-0.34959
78,-0.34959
79,-0.34959
80,-0.34959
81,-0.34959
82,0.0055491
83,0.8934
84,1.4261
85,3.9121
86,3.9121
87,3.7345
88,2.8467
89,2.8467
90,2.8467
91,2.314
92,-0.34959
93,-0.34959
94,-0.34959
95,-0.34959
