time,value
0,-0.74732
1,-0.74732
2,-0.74732
3,-0.74732
4,-0.74732
5,-0.74732
6,-0.74732
7,-0.74732
8,-0.74732
9,-0.74732
10,-0.74732
11,-0.74732
12,-0.74732
13,-0.74732
14,-0.74732
15,-0.74732
16,-0.74732
17,-0.74732
18,-0.74732
19,-0.74732
20,-0.74732
21,-0.74732
22,-0.74732
23,-0.74732
24,-0.74732
25,-0.74732
26,-0.74732
27,-0.74732
28,-0.74732
29,-0.74732
30,-0.74732
31,-0.74732
32,-0.74732
33,-0.74732
34,-0.74732
35,-0.74732
36,-0.74732
37,-0.74732
38,-0.74732
39,-0.74732
40,-0.74732
41,-0.74732
42,-0.74732
43,-0.74732
44,-0.74732
45,-0.74732
46,-0.74732
47,-0.74732
48,-0.74732
49,-0.74732
50,-0.74732
51,-0.74732
52,-0.74732
53,-0.74732
54,-0.74732
55,-0.74732
56,-0.74732
57,-0.74732
58,-0.74732
59,1.8965
60,1.7763
61,1.2956
62,0.81491
63,1.0553
64,1.5359
65,1.0553
66,0.6947399999999999
67,1.6561
68,1.4158
69,1.6561
70,1.6561
71,1.4158
72,1.4158
73,1.2956
74,1.2956
75,1.4158
76,1.5359
77,1.4158
78,1.2956
79,1.4158
80,1.5359
81,1.6561
82,1.5359
83,1.4158
84,1.5359
85,1.4158
86,1.0553
87,0.9350799999999999
88,0.9350799999999999
89,0.9350799999999999
90,0.6947399999999999
91,0.81491
92,0.6947399999999999
93,0.6947399999999999
94,-0.026288
95,-0.74732
