time,value
0,-0.42065
1,-0.32579
2,-0.44373999999999997
3,-0.54568
4,-0.57287
5,-0.46213999999999994
6,-0.51284
7,-0.52794
8,-0.48531
9,-0.50681
10,-0.4688
11,-0.42458
12,-0.35335
13,-0.29672
14,-0.24191999999999997
15,-0.16763
16,-0.07511
17,-0.007553100000000001
18,0.096399
19,0.10325
20,0.14814000000000002
21,0.19441
22,0.23221999999999998
23,0.24189000000000002
24,0.24741
25,0.26732
26,0.28683000000000003
27,0.26383
28,0.27566
29,0.31673
30,0.32978
31,0.33098
32,0.33907
33,0.32563000000000003
34,0.33129000000000003
35,0.34508
36,0.33015
37,0.35697
38,0.40752
39,0.40701
40,0.36474
41,0.5886399999999999
42,1.1258
43,1.3464
44,1.8715
45,1.1322
46,1.275
47,0.97854
48,0.7461800000000001
49,-0.093849
50,0.41923
51,0.47146000000000005
52,-0.090384
53,-0.28741
54,-0.68281
55,-0.48927
56,-0.5817100000000001
57,-0.8016800000000001
58,-0.94681
59,-0.87315
60,-0.72007
61,-0.75195
62,-0.57218
63,-0.50555
64,-0.51554
65,-0.53815
66,-0.59704
67,-0.40412
68,-0.32261
69,-0.092205
70,-0.06055
71,0.21405
72,0.15314
73,0.5221899999999999
74,0.6076199999999999
75,0.43625
76,0.59521
77,1.0325
78,0.67386
79,-0.018448
80,-0.086042
81,0.18374000000000001
82,0.51308
83,0.46308999999999995
84,0.28720999999999997
85,0.2282
86,0.35534
87,0.43327
88,0.30391
89,0.28919
90,0.45566999999999996
91,0.49713
92,0.40868000000000004
93,0.40003
94,0.47647
95,0.43471000000000004
96,0.42672
97,0.36859000000000003
98,0.40576999999999996
99,0.46708
100,0.43851
101,0.42761000000000005
102,0.46515
103,0.52745
104,0.47796000000000005
105,0.46646000000000004
106,0.47355
107,0.4865
108,0.5415
109,0.48688000000000003
110,0.46088
111,0.46128
112,0.5393600000000001
113,0.47046000000000004
114,0.44121000000000005
115,0.5283100000000001
116,0.53689
117,0.53017
118,0.53223
119,0.5204
120,0.6218
121,0.60378
122,0.53884
123,0.57857
124,0.63584
125,0.6701600000000001
126,0.65589
127,0.65177
128,0.66373
129,0.69201
130,0.67633
131,0.6855899999999999
132,0.68989
133,0.64471
134,0.6410899999999999
135,0.6944100000000001
136,0.6887
137,0.67109
138,0.64832
139,0.74338
140,0.7392
141,0.69343
142,0.72548
143,0.75153
144,0.68615
145,0.6584800000000001
146,0.68355
147,0.70215
148,0.71526
149,0.75584
150,0.75203
151,0.76944
152,0.73473
153,0.7512
154,0.77772
155,0.75713
156,0.71613
157,0.7710600000000001
158,0.8122699999999999
159,0.79499
160,0.7782399999999999
161,0.86167
162,0.9024700000000001
163,0.77747
164,0.79586
165,0.8723700000000001
166,0.7832399999999999
167,0.72629
168,0.7935
169,0.86774
170,0.88485
171,0.8034899999999999
172,0.91789
173,0.8970799999999999
174,0.77093
175,0.8074
176,0.9098
177,0.8622799999999999
178,0.8585799999999999
179,0.7954
180,0.9721299999999999
181,1.0656
182,0.84511
183,1.0401
184,1.2836
185,1.6934
186,1.5004
187,1.2177
188,0.9928899999999999
189,1.0547
190,0.6268600000000001
191,0.42025
192,-0.045355
193,-0.31761999999999996
194,-0.40314
195,-1.4137
196,-2.2847
197,-1.8016
198,-2.0996
199,-3.7182
200,-3.5791
201,-4.0396
202,-3.6539
203,-3.2617
204,-3.6501
205,-3.5198
206,-4.0502
207,-3.7969999999999997
208,-3.3267
209,-1.9393
210,-0.9027700000000001
211,-1.6088
212,-0.027353
213,-0.45906
214,-0.92817
215,0.0077241
216,0.85372
217,-0.36274
218,-0.44855
219,0.65113
220,0.8523799999999999
221,1.6894
222,2.7864
223,4.562
224,1.2622
225,0.43333999999999995
226,-0.27464
227,-0.42708
228,-0.29268
229,-0.11420999999999999
230,-0.19005999999999998
231,-0.07614
232,-0.28481
233,-1.2123
234,-1.2889
235,-0.29015
236,-0.28424
237,-0.32506
238,-0.32238
239,-0.56348
240,-0.50351
241,-0.77581
242,-0.43617
243,-0.45126000000000005
244,-0.50264
245,-0.44156000000000006
246,-0.54169
247,-0.53669
248,-0.53732
249,-0.46363999999999994
250,-0.62531
251,-0.55419
252,-0.5504600000000001
253,-0.46241000000000004
254,-0.48123
255,-0.5603600000000001
256,-0.55583
257,-0.55153
258,-0.62448
259,-0.55515
260,-0.55878
261,-0.55161
262,-0.47936999999999996
263,-0.55052
264,-0.4692
265,-0.48938999999999994
266,-0.56622
267,-0.56716
268,-0.56381
269,-0.55209
270,-0.56333
271,-0.64478
272,-0.5666899999999999
273,-0.5641
274,-0.55892
275,-0.49671000000000004
276,-0.48362
277,-0.66455
278,-0.67096
279,-0.5775600000000001
280,-0.57876
281,-0.5789
282,-0.59129
283,-0.59022
284,-0.58475
285,-0.58212
286,-0.57981
287,-0.66609
288,-0.57623
289,-0.58557
290,-0.58128
291,-0.67475
292,-0.6745399999999999
293,-0.58863
294,-0.58354
295,-0.67327
296,-0.58772
297,-0.59014
298,-0.5042399999999999
299,-0.5855600000000001
