time,value
0,-0.48125
1,-0.48125
2,-0.48125
3,-0.48125
4,-0.48125
5,-0.48125
6,-0.48125
7,-0.48125
8,-0.48125
9,-0.48125
10,-0.48125
11,-0.48125
12,-0.48125
13,-0.48125
14,-0.48125
15,-0.48125
16,-0.48125
17,-0.48125
18,-0.48125
19,-0.48125
20,-0.48125
21,-0.48125
22,-0.48125
23,-0.48125
24,-0.48125
25,-0.48125
26,-0.48125
27,-0.48125
28,-0.48125
29,-0.48125
30,-0.48125
31,-0.48125
32,-0.48125
33,-0.48125
34,-0.48125
35,-0.48125
36,-0.48125
37,-0.48125
38,-0.48125
39,-0.48125
40,-0.48125
41,-0.48125
42,-0.48125
43,-0.48125
44,-0.48125
45,-0.48125
46,-0.48125
47,-0.48125
48,-0.48125
49,-0.48125
50,-0.48125
51,-0.48125
52,-0.48125
53,-0.48125
54,-0.48125
55,-0.48125
56,-0.48125
57,-0.48125
58,-0.48125
59,-0.48125
60,-0.48125
61,-0.48125
62,-0.48125
63,-0.48125
64,-0.48125
65,-0.48125
66,-0.48125
67,-0.48125
68,-0.48125
69,-0.48125
70,-0.48125
71,-0.48125
72,-0.48125
73,-0.15967
74,1.8769999999999998
75,1.9842
76,2.0914
77,2.0914
78,2.1985
79,2.0914
80,2.0914
81,2.1985
82,2.0914
83,2.1985
84,2.0914
85,2.0914
86,2.0914
87,2.1985
88,1.8769999999999998
89,2.0914
90,1.9842
91,1.8769999999999998
92,-0.48125
93,-0.48125
94,-0.48125
95,-0.48125
