time,value
0,-0.1501
1,-0.1501
2,-0.1501
3,-0.1501
4,-0.1501
5,-0.1501
6,-0.1501
7,-0.1501
8,-0.1501
9,-0.1501
10,-0.1501
11,-0.1501
12,-0.1501
13,-0.1501
14,-0.1501
15,-0.1501
16,-0.1501
17,-0.1501
18,-0.1501
19,-0.1501
20,-0.1501
21,-0.1501
22,-0.1501
23,-0.1501
24,-0.1501
25,-0.1501
26,-0.1501
27,-0.1501
28,-0.1501
29,-0.1501
30,-0.1501
31,-0.1501
32,-0.1501
33,-0.1501
34,-0.1501
35,-0.1501
36,-0.1501
37,-0.1501
38,-0.1501
39,-0.1501
40,-0.0021195999999999997
41,8.507
42,4.5114
43,0.42333999999999994
44,0.21986
45,-0.1501
46,-0.1501
47,-0.1501
48,-0.1501
49,-0.1501
50,-0.1501
51,-0.1501
52,-0.1501
53,-0.1501
54,-0.1501
55,-0.1501
56,-0.1501
57,-0.1501
58,-0.1501
59,-0.1501
60,-0.1501
61,-0.1501
62,-0.1501
63,-0.1501
64,-0.1501
65,-0.1501
66,-0.1501
67,-0.1501
68,-0.1501
69,-0.1501
70,-0.1501
71,-0.1501
72,-0.1501
73,-0.1501
74,-0.1501
75,-0.1501
76,-0.1501
77,-0.1501
78,-0.1501
79,-0.1501
80,-0.1501
81,-0.1501
82,-0.1501
83,-0.1501
84,-0.1501
85,-0.1501
86,-0.1501
87,-0.1501
88,-0.1501
89,-0.1501
90,-0.1501
91,-0.1501
92,-0.1501
93,-0.1501
94,-0.1501
95,-0.1501
