[<text type="unproc">
stratus computer inc &lt;stra.o&gt; 3rd qtr net
    shr 26 cts vs 18 cts
    net 5,281,000 vs 3,496,000
    rev 48.8 mln vs 32.1 mln
    nine mos
    shr 64 cts vs 51 cts
    net 12,852,000 vs 9,822,000
    rev 129.0 mln vs 89.2 mln            
 reuter


</text>]