time,value
0,0.083505
1,0.079466
2,0.07554
3,0.083133
4,0.0796
5,0.061685000000000004
6,0.060065
7,0.078609
8,0.095152
9,0.10465999999999999
10,0.10122
11,0.083843
12,0.081827
13,0.10073
14,0.10772000000000001
15,0.089041
16,0.057475
17,0.045298000000000005
18,0.079391
19,-0.70692
20,-0.7568600000000001
21,-0.60978
22,-0.68577
23,-0.70658
24,-0.6231
25,-0.61988
26,-0.6272399999999999
27,-0.61397
28,-0.6196699999999999
29,-0.61725
30,-0.63088
31,-0.66385
32,-0.66859
33,-0.65622
34,-0.64063
35,-0.6111
36,-0.58495
37,-0.57568
38,-0.57433
39,-0.57658
40,-0.57565
41,-0.57301
42,-0.5795100000000001
43,-0.5748300000000001
44,-0.54415
45,-0.52485
46,-0.53259
47,-0.52351
48,-0.49238999999999994
49,-0.48932
50,-0.49767
51,-0.46195
52,-0.42151000000000005
53,-0.42135
54,-0.41547
55,-0.4011
56,-0.42658999999999997
57,-0.46205
58,-0.46611
59,-0.46324
60,-0.47336000000000006
61,-0.48998
62,-0.50565
63,-0.5125
64,-0.50958
65,-0.49633999999999995
66,-0.47518
67,-0.46693
68,-0.48131
69,-0.49296999999999996
70,-0.48783000000000004
71,-0.49772
72,-0.5294800000000001
73,-0.52936
74,-0.49576000000000003
75,-0.48703
76,-0.48676
77,-0.45656
78,-0.43196999999999997
79,-0.4207
80,-0.39114
81,-0.36464
82,-0.35636
83,-0.34197
84,-0.32776
85,-0.33909
86,-0.38139
87,-0.43183
88,-0.44269
89,-0.41118000000000005
90,-0.39300999999999997
91,-0.40291
92,-0.4052
93,-0.38622
94,-0.35067
95,-0.30535999999999996
96,-0.27337
97,-0.27154
98,-0.28688
99,-0.29708
100,-0.28885
101,-0.26
102,-0.22405999999999998
103,-0.20219
104,-0.20144
105,-0.21366999999999997
106,-0.22871999999999998
107,-0.23085
108,-0.20773000000000003
109,-0.17834
110,-0.17642
111,-0.20307
112,-0.23091
113,-0.24569000000000002
114,-0.25153000000000003
115,-0.24524
116,-0.21615
117,-0.17831
118,-0.15812
119,-0.14436
120,-0.12912
121,-0.14626
122,-0.18007
123,-0.16884000000000002
124,-0.13212000000000002
125,-0.11863
126,-0.10943
127,-0.091322
128,-0.07732699999999999
129,-0.061546000000000003
130,-0.050192
131,-0.050606
132,-0.058404
133,-0.078907
134,-0.08090599999999999
135,-0.043073
136,-0.033663
137,-0.068147
138,-0.069082
139,-0.049232
140,-0.066741
141,-0.084252
142,-0.06729
143,-0.05168300000000001
144,-0.061091999999999994
145,-0.075932
146,-0.06054299999999999
147,-0.019953
148,-0.011252
149,-0.044274
150,-0.06806799999999999
151,-0.07622999999999999
152,-0.092342
153,-0.095082
154,-0.060633000000000006
155,-0.015295
156,0.008572399999999999
157,0.014731999999999999
158,0.014749000000000002
159,0.0042619
160,-0.012453
161,-0.011738
162,0.014957
163,0.041437
164,0.039101
165,0.018680000000000002
166,0.016233
167,0.033329000000000004
168,0.032191000000000004
169,0.0038384
170,-0.0099891
171,0.014218999999999999
172,0.041962
173,0.038676
174,0.019135
175,0.015272999999999998
176,0.032284
177,0.043849
178,0.026782
179,-0.0037530000000000003
180,-0.030679
181,-0.06454700000000001
182,-0.09378600000000001
183,-0.08880199999999999
184,-0.066241
185,-0.053586
186,-0.032833
187,0.006629
188,0.034011
189,0.036441
190,0.036243
191,0.036449
192,0.022690000000000002
193,0.013038
194,0.032116000000000006
195,0.04761
196,0.02213
197,-0.006905
198,-0.0068545
199,-0.013415999999999999
200,-0.029575
201,-0.019551
202,-0.0045653
203,-0.007934
204,0.00050232
205,0.020279
206,0.015549
207,-0.0030570999999999997
208,-0.010218999999999999
209,-0.027308
210,-0.053097000000000005
211,-0.041244
212,-0.0097433
213,-0.006702199999999999
214,-0.0042608
215,0.012749
216,0.014643000000000002
217,0.015706
218,0.014908000000000001
219,-0.014842
220,-0.031721
221,-0.010027
222,0.009192299999999999
223,0.015985
224,0.014161000000000002
225,0.0077209999999999996
226,0.023724000000000002
227,0.035898
228,0.018425999999999998
229,0.016734
230,0.014865999999999999
231,-0.021786
232,-0.018558
233,0.033804
234,0.035829
235,-0.0033986999999999993
236,-0.0087348
237,0.008559899999999999
238,0.015257
239,0.013768
240,0.0031989
241,-0.021001
242,-0.051164999999999995
243,-0.080819
244,-0.10717
245,-0.11742000000000001
246,-0.10583
247,-0.084114
248,-0.05229299999999999
249,-0.017902
250,-0.0036835
251,0.013469
252,0.058841
253,0.088619
254,0.079096
255,0.072555
256,0.091266
257,0.12308
258,0.15571
259,0.17154
260,0.16634000000000002
261,0.16272999999999999
262,0.17397
263,0.18853
264,0.19174000000000002
265,0.18231
266,0.16592
267,0.13945
268,0.10355
269,0.078669
270,0.075927
271,0.084468
272,0.10192999999999999
273,0.13172
274,0.15342
275,0.14349
276,0.11331
277,0.089698
278,0.078782
279,0.07731299999999999
280,0.08114400000000001
281,0.078887
282,0.086197
283,0.12828
284,0.16785
285,0.16897
286,0.16982
287,0.18966
288,0.19469
289,0.17385
290,0.14219
291,0.122
292,0.1318
293,0.14470999999999998
294,0.13028
295,0.12129000000000001
296,0.14778
297,0.16912
298,0.15473
299,0.14513
300,0.16168
301,0.16357
302,0.14257999999999998
303,0.13860999999999998
304,0.15650999999999998
305,0.16648
306,0.15398
307,0.12929000000000002
308,0.12445
309,0.16529000000000002
310,0.22046
311,0.22991
312,0.19813
313,0.18252000000000002
314,0.18873
315,0.17643
316,0.15044000000000002
317,0.1456
318,0.16061
319,0.17515999999999998
320,0.19125
321,0.22024000000000002
322,0.24841
323,0.25315
324,0.25056
325,0.26455
326,0.27623000000000003
327,0.27499
328,0.27883
329,0.27268000000000003
330,0.24220999999999998
331,0.21821999999999997
332,0.20828000000000002
333,0.19247999999999998
334,0.18880999999999998
335,0.21638000000000002
336,0.24818
337,0.25665
338,0.25374
339,0.26671999999999996
340,0.29786
341,0.32209
342,0.32277
343,0.30853
344,0.29558
345,0.29467
346,0.30714
347,0.32138
348,0.32216
349,0.30858
350,0.29561
351,0.29551
352,0.30093000000000003
353,0.29469
354,0.27844
355,0.27823000000000003
356,0.30389
357,0.32069000000000003
358,0.30672
359,0.29786
360,0.31385
361,0.33032
362,0.3449
363,0.36068
364,0.36363
365,0.36269
366,0.34995
367,0.30589
368,0.26984
369,0.25774
370,0.23724
371,0.23565999999999998
372,0.26784
373,0.29399000000000003
374,0.33195
375,0.38006999999999996
376,0.37222
377,0.33188
378,0.31923
379,0.31856999999999996
380,0.3203
381,0.32128
382,0.3099
383,0.3311
384,0.39471
385,0.42278999999999994
386,0.39685
387,0.36785
388,0.34226999999999996
389,0.31017
390,0.29581999999999997
391,0.31573
392,0.35134
393,0.37974
394,0.4065
395,0.43595
396,0.43448000000000003
397,0.39131
398,0.35493
399,0.34315
400,0.32732
401,0.32056
402,0.35359
403,0.40434000000000003
404,0.4345
405,0.43188000000000004
406,0.40481
407,0.3768
408,0.36377
409,0.36154000000000003
410,0.36345
411,0.36328
412,0.36124
413,0.36412
414,0.3638
415,0.35848
416,0.36867
417,0.38458000000000003
418,0.36741999999999997
419,0.32784
420,0.3174
421,0.33534
422,0.34023000000000003
423,0.33966999999999997
424,0.35635
425,0.36118
426,0.3436
427,0.32794
428,0.31443000000000004
429,0.3168
430,0.34094
431,0.32954
432,0.28023000000000003
433,0.26561999999999997
434,0.28098
435,0.27721
436,0.26384
437,0.24174
438,0.17612
439,0.08053300000000001
440,0.017763
441,0.012458
442,0.021199000000000003
443,0.0029527
444,-0.027639999999999998
445,-0.045545999999999996
446,-0.056380999999999994
447,-0.071909
448,-0.097228
449,-0.13233
450,-0.15965
451,-0.17165999999999998
452,-0.19727999999999998
453,-0.24505
454,-0.27271
455,-0.26408000000000004
456,-0.26816
457,-0.32029
458,-0.37856
459,-0.38109
460,-0.34541
461,-0.3375
462,-0.35668
463,-0.36112
464,-0.35333000000000003
465,-0.33701
466,-0.29703
467,-0.24758000000000002
468,-0.20601
469,-0.19216
470,-0.21964
471,-0.22728
472,-0.19922
473,-0.22801
474,-0.29095
475,-0.29691999999999996
476,-0.29452
477,-0.31363
478,-0.31177
479,-0.32421
480,-0.35718
481,-0.36885999999999997
482,-0.39849
483,-0.44463
484,-0.44815
485,-0.45038999999999996
486,-0.48846999999999996
487,-0.5009100000000001
488,-0.46998999999999996
489,-0.44485
490,-0.44176000000000004
491,-0.44883
492,-0.46698
493,-0.49666000000000005
494,-0.51726
495,-0.51013
496,-0.50236
497,-0.52267
498,-0.53193
499,-0.5031
500,-0.47622
501,-0.46656000000000003
502,-0.47363
503,-0.5068
504,-0.5093
505,-0.46938
506,-0.48657
507,-0.55667
508,-0.60092
509,-0.64863
510,-0.70906
511,-0.7286600000000001
512,-0.72844
513,-0.7280399999999999
514,-0.69967
515,-0.6744600000000001
516,-0.68601
517,-0.68133
518,-0.63065
519,-0.59712
520,-0.61078
521,-0.62274
522,-0.6192300000000001
523,-0.61944
524,-0.6157100000000001
525,-0.62068
526,-0.64
527,-0.62438
528,-0.57135
529,-0.54806
530,-0.56539
531,-0.5760000000000001
532,-0.5854
533,-0.61795
534,-0.64291
535,-0.67528
536,-0.77073
537,-0.8664799999999999
538,-0.89631
539,-0.9198200000000001
540,-0.94855
541,-0.94625
542,-0.95926
543,-0.9935
544,-0.9948
545,-0.99036
546,-1.0164
547,-1.0357
548,-1.0216
549,-0.98465
550,-0.92845
551,-0.85595
552,-0.78486
553,-0.72565
554,-0.67537
555,-0.6359199999999999
556,-0.59527
557,-0.5310600000000001
558,-0.45531000000000005
559,-0.38416999999999996
560,-0.29785
561,-0.18562
562,-0.066821
563,0.030816000000000003
564,0.08552
565,0.11255
566,0.15066
567,0.19469
568,0.21031999999999998
569,0.21225
570,0.23856
571,0.27051
572,0.28042
573,0.3055
574,0.36653
575,0.40746
576,0.40525
577,0.41635
578,0.46178
579,0.49937
580,0.52555
581,0.57509
582,0.6362300000000001
583,0.67993
584,0.7129
585,0.7381300000000001
586,0.75176
587,0.76736
588,0.77812
589,0.763
590,0.7394
591,0.73422
592,0.735
593,0.7297899999999999
594,0.73721
595,0.75333
596,0.75579
597,0.75646
598,0.75751
599,0.74878
600,0.76213
601,0.7945399999999999
602,0.7999
603,0.80275
604,0.8345799999999999
605,0.8579200000000001
606,0.8684700000000001
607,0.89915
608,0.9285200000000001
609,0.92837
610,0.9280700000000001
611,0.93156
612,0.89405
613,0.8466
614,0.85129
615,0.8658899999999999
616,0.8629399999999999
617,0.8798600000000001
618,0.88289
619,0.8636799999999999
620,0.89384
621,0.9374
622,0.9177799999999999
623,0.8783
624,0.86054
625,0.84559
626,0.8388200000000001
627,0.8442700000000001
628,0.8433799999999999
629,0.8477899999999999
630,0.8733700000000001
631,0.888
632,0.8712700000000001
633,0.8678899999999999
634,0.9012700000000001
635,0.92919
636,0.92653
637,0.9109200000000001
638,0.90297
639,0.91306
640,0.9284100000000001
641,0.9384600000000001
642,0.9619200000000001
643,0.99303
644,0.9915
645,0.9657600000000001
646,0.96934
647,1.0044
648,1.0153
649,0.981
650,0.9419
651,0.9275899999999999
652,0.9293600000000001
653,0.9404299999999999
654,0.9572799999999999
655,0.9555
656,0.9175200000000001
657,0.8723299999999999
658,0.86306
659,0.8815200000000001
660,0.8831600000000001
661,0.8662
662,0.87067
663,0.89417
664,0.89005
665,0.85683
666,0.8396100000000001
667,0.84283
668,0.84129
669,0.84839
670,0.88245
671,0.91081
672,0.89843
673,0.8673299999999999
674,0.85787
675,0.87093
676,0.88584
677,0.8896
678,0.8835799999999999
679,0.8859299999999999
680,0.89331
681,0.87469
682,0.8446600000000001
683,0.84065
684,0.8397600000000001
685,0.8223799999999999
686,0.82589
687,0.85551
688,0.8656799999999999
689,0.84895
690,0.84399
691,0.86364
692,0.87374
693,0.85145
694,0.82262
695,0.80715
696,0.7909
697,0.77798
698,0.77798
699,0.77459
700,0.7771
701,0.79547
702,0.7943100000000001
703,0.7781
704,0.7781100000000001
705,0.7712100000000001
706,0.75617
707,0.75667
708,0.7507
709,0.75522
710,0.7996800000000001
711,0.82839
712,0.8216
713,0.8220200000000001
714,0.81208
715,0.77828
716,0.74765
717,0.7203
718,0.71225
719,0.72164
720,0.6856300000000001
721,0.62502
722,0.62415
723,0.6735899999999999
724,0.7345
725,0.78884
726,0.79184
727,0.75563
728,0.75641
729,0.80579
730,0.86624
731,0.92579
732,0.9737299999999999
733,0.99646
734,1.0087
735,1.0279
736,1.0398
737,1.0266
738,1.0128
739,1.0417
740,1.1029
741,1.1435
742,1.1487
743,1.1345
744,1.1225
745,1.1517
746,1.2148
747,1.25
748,1.2585
749,1.2554
750,1.1892
751,1.0769
752,1.0088
753,0.98487
754,0.94896
755,0.88218
756,0.7874
757,0.6822699999999999
758,0.56077
759,0.39025
760,0.19443
761,0.018361000000000002
762,-0.14636
763,-0.30573
764,-0.45926999999999996
765,-0.65165
766,-0.9077299999999999
767,-1.1849
768,-1.4561
769,-1.7408
770,-2.0225
771,-2.2657
772,-2.5022
773,-2.7644
774,-3.0118
775,-3.2178
776,-3.4048
777,-3.6002
778,-3.8385
779,-4.1056
780,-4.3289
781,-4.5061
782,-4.6939
783,-4.8795
784,-5.0247
785,-5.1419
786,-5.2405
787,-5.2952
788,-5.2860000000000005
789,-5.2218
790,-5.1216
791,-4.9922
792,-4.8379
793,-4.6456
794,-4.3634
795,-3.9912
796,-3.6185
797,-3.2838
798,-2.9531
799,-2.6448
800,-2.3841
801,-2.1201
802,-1.8367
803,-1.5971
804,-1.4378
805,-1.349
806,-1.318
807,-1.3338
808,-1.3644
809,-1.3337
810,-1.1607
811,-0.82826
812,-0.37993000000000005
813,0.13543
814,0.6953600000000001
815,1.28
816,1.8414
817,2.3354
818,2.7584
819,3.133
820,3.4617
821,3.7113
822,3.8927
823,4.0704
824,4.2222
825,4.2764
826,4.2679
827,4.2413
828,4.166
829,4.0812
830,4.067
831,4.0908
832,4.0945
833,4.0947
834,4.0816
835,4.0046
836,3.8985
837,3.8255
838,3.7412
839,3.6205
840,3.5258
841,3.4315
842,3.2673
843,3.0936
844,2.9753
845,2.8607
846,2.7211
847,2.6047
848,2.5211
849,2.4219999999999997
850,2.2849
851,2.1236
852,1.9637
853,1.8351
854,1.7358
855,1.6438
856,1.5613
857,1.4893
858,1.4364
859,1.4374
860,1.4714
861,1.4725
862,1.4449
863,1.4325
864,1.4266
865,1.3978
866,1.3526
867,1.324
868,1.3243
869,1.3251
870,1.3098
871,1.2991
872,1.3009
873,1.3018
874,1.3009
875,1.3019
876,1.2919999999999998
877,1.2741
878,1.2775
879,1.2759
880,1.2016
881,1.0957
882,1.042
883,0.99751
884,0.91994
885,0.8620700000000001
886,0.83388
887,0.8204600000000001
888,0.84126
889,0.87564
890,0.9042600000000001
891,0.93132
892,0.9183100000000001
893,0.8701700000000001
894,0.84764
895,0.83583
896,0.8035899999999999
897,0.7812600000000001
898,0.77555
899,0.7762600000000001
900,0.80003
901,0.82995
902,0.8246600000000001
903,0.78437
904,0.73926
905,0.7137
906,0.70155
907,0.67909
908,0.6494300000000001
909,0.6230600000000001
910,0.5849300000000001
911,0.54057
912,0.52822
913,0.5434399999999999
914,0.53933
915,0.51853
916,0.5173300000000001
917,0.51689
918,0.49687
919,0.50059
920,0.53533
921,0.54575
922,0.531
923,0.5362399999999999
924,0.55556
925,0.55597
926,0.53878
927,0.52194
928,0.5120899999999999
929,0.51508
930,0.53099
931,0.53656
932,0.51707
933,0.49591999999999997
934,0.49708
935,0.5149100000000001
936,0.53136
937,0.54195
938,0.55865
939,0.57718
940,0.58049
941,0.58111
942,0.5854600000000001
943,0.57194
944,0.5593899999999999
945,0.5739
946,0.5796399999999999
947,0.55987
948,0.5429
949,0.53281
950,0.5374
951,0.56708
952,0.58657
953,0.58135
954,0.57914
955,0.5815899999999999
956,0.58132
957,0.58204
958,0.57835
959,0.5814
960,0.59841
961,0.59937
962,0.58108
963,0.57597
964,0.58844
965,0.60337
966,0.60719
967,0.5966199999999999
968,0.60378
969,0.63655
970,0.64541
971,0.62431
972,0.6195
973,0.62905
974,0.62455
975,0.6199399999999999
976,0.63431
977,0.64674
978,0.62433
979,0.5735100000000001
980,0.5365300000000001
981,0.53279
982,0.54388
983,0.5606899999999999
984,0.5888800000000001
985,0.61705
986,0.62446
987,0.59992
988,0.55269
989,0.51373
990,0.49645
991,0.49428
992,0.51854
993,0.5528
994,0.55843
995,0.56048
996,0.57834
997,0.5767100000000001
998,0.58406
999,0.6424
1000,0.6906899999999999
1001,0.68925
1002,0.6862199999999999
1003,0.69429
1004,0.68966
1005,0.6975899999999999
1006,0.7420899999999999
1007,0.77961
1008,0.7685
1009,0.73442
1010,0.70987
1011,0.69335
1012,0.6918
1013,0.71617
1014,0.74773
1015,0.76083
1016,0.7543
1017,0.7401399999999999
1018,0.7185699999999999
1019,0.6856899999999999
1020,0.66519
1021,0.6886800000000001
1022,0.74121
1023,0.77458
1024,0.77277
1025,0.75159
1026,0.7097399999999999
1027,0.65293
1028,0.62338
1029,0.63717
1030,0.66388
1031,0.69655
1032,0.7423
1033,0.76776
1034,0.75137
1035,0.73352
1036,0.73859
1037,0.72987
1038,0.69729
1039,0.6904399999999999
1040,0.7167
1041,0.7195
1042,0.69311
1043,0.69388
1044,0.7257
1045,0.74033
1046,0.73164
1047,0.7185600000000001
1048,0.68665
1049,0.63745
1050,0.61943
1051,0.64799
1052,0.66888
1053,0.63937
1054,0.59286
1055,0.58234
1056,0.5986100000000001
1057,0.61132
1058,0.62961
1059,0.64654
1060,0.6370600000000001
1061,0.62229
1062,0.60974
1063,0.57812
1064,0.55743
1065,0.56016
1066,0.54827
1067,0.5367
1068,0.53964
1069,0.51837
1070,0.48828999999999995
1071,0.47648999999999997
1072,0.44498000000000004
1073,0.3956
1074,0.3816
1075,0.39869
1076,0.40673000000000004
1077,0.40554
1078,0.41563
1079,0.4318
1080,0.43200000000000005
1081,0.40845
1082,0.37694
1083,0.36313
1084,0.36069
1085,0.32715
1086,0.26526
1087,0.2319
1088,0.23260999999999998
1089,0.21773
1090,0.17545
1091,0.13397
1092,0.1058
1093,0.085659
1094,0.079606
1095,0.096414
1096,0.11124
1097,0.091461
1098,0.060538999999999996
1099,0.055925
1100,0.054163
1101,0.022366
1102,-0.023972999999999998
1103,-0.062862
1104,-0.09137100000000001
1105,-0.10880999999999999
1106,-0.12172000000000001
1107,-0.1372
1108,-0.1357
1109,-0.10637
1110,-0.092861
1111,-0.1209
1112,-0.14218
1113,-0.13837
1114,-0.16299
1115,-0.22843000000000002
1116,-0.28556
1117,-0.31792
1118,-0.34387
1119,-0.3571
1120,-0.35559
1121,-0.35894000000000004
1122,-0.35798
1123,-0.36604000000000003
1124,-0.42873999999999995
1125,-0.48673999999999995
1126,-0.46501000000000003
1127,-0.44473999999999997
1128,-0.48336
1129,-0.49054
1130,-0.45478
1131,-0.47986
1132,-0.5445
1133,-0.5451699999999999
1134,-0.52942
1135,-0.5804199999999999
1136,-0.63435
1137,-0.65889
1138,-0.71459
1139,-0.7591600000000001
1140,-0.7326600000000001
1141,-0.72038
1142,-0.77604
1143,-0.8153
1144,-0.80952
1145,-0.82804
1146,-0.85888
1147,-0.83983
1148,-0.80066
1149,-0.7744800000000001
1150,-0.74984
1151,-0.76127
1152,-0.81193
1153,-0.84745
1154,-0.8648
1155,-0.8613299999999999
1156,-0.82721
1157,-0.81633
1158,-0.8367
1159,-0.83945
1160,-0.83719
1161,-0.8381799999999999
1162,-0.8287399999999999
1163,-0.8581799999999999
1164,-0.94209
1165,-1.0122
1166,-1.0459
1167,-1.0763
1168,-1.1083
1169,-1.1262
1170,-1.1223
1171,-1.0957
1172,-1.0631
1173,-1.0558
1174,-1.0715
1175,-1.0771
1176,-1.0778
1177,-1.0916
1178,-1.1032
1179,-1.121
1180,-1.1539
1181,-1.1654
1182,-1.1652
1183,-1.1827
1184,-1.1772
1185,-1.1438
1186,-1.1458
1187,-1.1836
1188,-1.2091
1189,-1.2117
1190,-1.2006
1191,-1.1872
1192,-1.1948
1193,-1.2209999999999999
1194,-1.2309
1195,-1.2258
1196,-1.2388
1197,-1.2527
1198,-1.238
1199,-1.228
1200,-1.2535
1201,-1.2955
1202,-1.3413
1203,-1.3846
1204,-1.3931
1205,-1.367
1206,-1.3624
1207,-1.3814
1208,-1.3741
1209,-1.3618
1210,-1.3667
1211,-1.3394
1212,-1.2949
1213,-1.29
1214,-1.2967
1215,-1.2967
1216,-1.3231
1217,-1.3489
1218,-1.3389
1219,-1.3428
1220,-1.3877
1221,-1.4044
1222,-1.3712
1223,-1.3601
1224,-1.3856
1225,-1.4123
1226,-1.4472
1227,-1.4714
1228,-1.4666
1229,-1.4884
1230,-1.5401
1231,-1.5596
1232,-1.5493
1233,-1.5348
1234,-1.5181
1235,-1.5076
1236,-1.4901
1237,-1.4686
1238,-1.4845
1239,-1.5166
1240,-1.5181
1241,-1.5057
1242,-1.4902
1243,-1.4709999999999999
1244,-1.4773
1245,-1.493
1246,-1.479
1247,-1.4571
1248,-1.4479
1249,-1.445
1250,-1.4582
1251,-1.4704
1252,-1.4433
1253,-1.3984
1254,-1.3835
1255,-1.3980000000000001
1256,-1.4101
1257,-1.4029
1258,-1.3859
1259,-1.3844
1260,-1.41
1261,-1.4413
1262,-1.4527
1263,-1.4471
1264,-1.4327
1265,-1.4135
1266,-1.4046
1267,-1.4056
1268,-1.3969
1269,-1.3805
1270,-1.3663
1271,-1.3451
1272,-1.3107
1273,-1.2670000000000001
1274,-1.2191
1275,-1.1811
1276,-1.1653
1277,-1.1648
1278,-1.1642
1279,-1.1633
1280,-1.1672
1281,-1.1625
1282,-1.147
1283,-1.1333
1284,-1.1179
1285,-1.1153
1286,-1.1383
1287,-1.1394
1288,-1.1196
1289,-1.1420000000000001
1290,-1.1642
1291,-1.1179
1292,-1.0638
1293,-1.0567
1294,-1.0585
1295,-1.0392
1296,-1.003
1297,-0.9721299999999999
1298,-0.96626
1299,-0.96799
1300,-0.96701
1301,-0.9726
1302,-0.9638100000000001
1303,-0.94644
1304,-0.95804
1305,-0.96652
1306,-0.9349299999999999
1307,-0.89923
1308,-0.87439
1309,-0.84465
1310,-0.81581
1311,-0.78555
1312,-0.76942
1313,-0.79368
1314,-0.81903
1315,-0.8165600000000001
1316,-0.8174100000000001
1317,-0.80955
1318,-0.76272
1319,-0.7172
1320,-0.70445
1321,-0.69023
1322,-0.66571
1323,-0.66589
1324,-0.68266
1325,-0.68562
1326,-0.68421
1327,-0.67065
1328,-0.61749
1329,-0.56296
1330,-0.5523899999999999
1331,-0.55714
1332,-0.5512600000000001
1333,-0.5521199999999999
1334,-0.55893
1335,-0.54696
1336,-0.5161899999999999
1337,-0.48562
1338,-0.45671999999999996
1339,-0.42738000000000004
1340,-0.4068
1341,-0.40065
1342,-0.41766000000000003
1343,-0.44404
1344,-0.43816000000000005
1345,-0.42178000000000004
1346,-0.44603000000000004
1347,-0.46929
1348,-0.4495
1349,-0.42688999999999994
1350,-0.42177
1351,-0.42227
1352,-0.42622
1353,-0.41723999999999994
1354,-0.40188
1355,-0.40258
1356,-0.3959
1357,-0.38004
1358,-0.38205
1359,-0.36949
1360,-0.32077
1361,-0.28041
1362,-0.26697
1363,-0.26875
1364,-0.28351
1365,-0.29304
1366,-0.29131999999999997
1367,-0.31046999999999997
1368,-0.34936999999999996
1369,-0.35938000000000003
1370,-0.33084
1371,-0.30771
1372,-0.31221
1373,-0.32749
1374,-0.33876
1375,-0.3371
1376,-0.31194
1377,-0.28226999999999997
1378,-0.28926
1379,-0.31451
1380,-0.30545
1381,-0.29162
1382,-0.29993000000000003
1383,-0.27657
1384,-0.24808000000000002
1385,-0.27532
1386,-0.29186999999999996
1387,-0.27124000000000004
1388,-0.27109
1389,-0.25978
1390,-0.22744
1391,-0.2443
1392,-0.28447
1393,-0.29215
1394,-0.29283000000000003
1395,-0.28323000000000004
1396,-0.23065
1397,-0.16399
1398,-0.12662
1399,-0.11734000000000001
1400,-0.1254
1401,-0.15506
1402,-0.20234000000000002
1403,-0.24986999999999998
1404,-0.28039000000000003
1405,-0.27162
1406,-0.21716
1407,-0.1588
1408,-0.13924
1409,-0.14065999999999998
1410,-0.13795
1411,-0.15985
1412,-0.2097
1413,-0.22791999999999998
1414,-0.20525
1415,-0.18767999999999999
1416,-0.17674
1417,-0.16126
1418,-0.14711
1419,-0.13185
1420,-0.13899
1421,-0.17378
1422,-0.17679
1423,-0.13929
1424,-0.11739000000000001
1425,-0.12063
1426,-0.13935
1427,-0.17187
1428,-0.18367
1429,-0.1607
1430,-0.12936
1431,-0.1089
1432,-0.11782999999999999
1433,-0.1502
1434,-0.1639
1435,-0.1611
1436,-0.17421
1437,-0.18764
1438,-0.18256
1439,-0.17032
1440,-0.14295
1441,-0.09375499999999999
1442,-0.067082
1443,-0.091143
1444,-0.11784000000000001
1445,-0.11690999999999999
1446,-0.12383
1447,-0.13952
1448,-0.12911
1449,-0.10145
1450,-0.07189
1451,-0.039654
1452,-0.02525
1453,-0.030333999999999996
1454,-0.03034
1455,-0.033682
1456,-0.053278
1457,-0.060577
1458,-0.029084
1459,0.016285
1460,0.02433
1461,-0.0039167
1462,-0.006224100000000001
1463,0.038538
1464,0.070713
1465,0.054876999999999995
1466,0.035247
1467,0.040237
1468,0.033444999999999996
1469,0.0022168
1470,-0.014128
1471,-0.007368
1472,-0.006558400000000001
1473,-0.0059288000000000006
1474,0.016709
1475,0.035815
1476,0.030895
1477,0.037620999999999995
1478,0.056525
1479,0.051767999999999995
1480,0.061089
1481,0.10914000000000001
1482,0.12599000000000002
1483,0.097037
1484,0.080121
1485,0.07849500000000001
1486,0.080025
1487,0.094421
1488,0.11097
1489,0.12462000000000001
1490,0.12852
1491,0.10379000000000001
1492,0.076889
1493,0.07681900000000001
1494,0.080688
1495,0.079124
1496,0.080101
1497,0.075649
1498,0.081985
1499,0.11225999999999998
1500,0.13662
1501,0.14623
1502,0.1611
1503,0.17247
1504,0.16334
1505,0.13466
1506,0.098967
1507,0.076413
1508,0.063046
1509,0.043503
1510,0.036116
1511,0.051094
1512,0.072438
1513,0.11001
1514,0.15793
1515,0.16638
1516,0.13968
1517,0.13788
1518,0.16196
1519,0.16418
1520,0.147
1521,0.14987999999999999
1522,0.17035999999999998
1523,0.17193
1524,0.14628
1525,0.11757000000000001
1526,0.10259000000000001
1527,0.10059
1528,0.1
1529,0.08504500000000001
1530,0.069506
1531,0.0852
1532,0.10332000000000001
1533,0.079867
1534,0.054349
1535,0.057485
1536,0.042961
1537,0.0050051
1538,-0.010129
1539,0.0079232
1540,0.045535
1541,0.076563
1542,0.072644
1543,0.053689
1544,0.054792999999999994
1545,0.062353
1546,0.053572
1547,0.038113
1548,0.031883
1549,0.038433999999999996
1550,0.053905999999999996
1551,0.063135
1552,0.053522
1553,0.051722000000000004
1554,0.097084
1555,0.15859
1556,0.15657000000000001
1557,0.084096
1558,0.024811
1559,0.029462000000000002
1560,0.05524199999999999
1561,0.054083000000000006
1562,0.038239999999999996
1563,0.025893
1564,0.007148399999999999
1565,-0.0085096
1566,0.009314200000000002
1567,0.04458
1568,0.041725
1569,0.0048066
1570,-0.008297200000000001
1571,-0.006121
1572,-0.024842
1573,-0.025013
1574,0.008451799999999999
1575,0.021891
1576,0.008316
1577,-0.0063426
1578,-0.007187000000000001
1579,0.029463999999999997
1580,0.05947
1581,0.013739
1582,-0.041759
1583,-0.017597
1584,0.039102
1585,0.059996
1586,0.057372
1587,0.06514199999999999
1588,0.087609
1589,0.10113
1590,0.091079
1591,0.073291
1592,0.059328
1593,0.04406
1594,0.032841
1595,0.034644
1596,0.038727
1597,0.031501
1598,0.016047
1599,-0.008269499999999999
1600,-0.042602999999999995
1601,-0.053671
1602,-0.025516999999999998
1603,-0.0034731000000000002
1604,-0.0074652
1605,-0.0092209
1606,-0.0087029
1607,-0.0089595
1608,0.004411399999999999
1609,0.018162
1610,0.032967
1611,0.063338
1612,0.086132
1613,0.099517
1614,0.10962000000000001
1615,0.089496
1616,0.077502
1617,0.11168
1618,0.11673
1619,0.080968
1620,0.08584
1621,0.10503
1622,0.081732
1623,0.058797
1624,0.056549
1625,0.037699
1626,0.0046222
1627,-0.012623
1628,-0.0088666
1629,0.0039165
1630,0.023833
1631,0.0554
1632,0.07913300000000001
1633,0.073154
1634,0.05773
1635,0.056222
1636,0.056939
1637,0.057024
1638,0.07018300000000001
