{
  "about": {
    "datasetID": "49_facebook_dataset",
    "datasetName": "Facebook graph data",
    "description": "Data for 49_facebook consists of two graphs G1 and G2 with a known mapping (both matches and mismatches) which is provided in the learningData.csv",
    "citation": " @inproceedings{viswanath-2009-activity, author = {Bimal Viswanath and Alan Mislove and Meeyoung Cha and Krishna P. Gummadi}, title = {On the Evolution of User Interaction in Facebook},  booktitle = {Proceedings of the 2nd ACM SIGCOMM Workshop on Social Ne ",
    "license": "public dataset (unknown license)",
    "source": "The Max Plank Institute",
    "datasetVersion": "4.0.0",
    "datasetSchemaVersion": "4.0.0",
    "redacted": false,
    "digest": "cf55d683ef7868c84cc456607718f5d5d946d7789e3a4aae507c1daf3607a09a"
  },
  "dataResources": [
    {
      "resID": "0",
      "resPath": "graphs/G1.gml",
      "resType": "graph",
      "resFormat": {
        "text/vnd.gml": [
          "gml"
        ]
      },
      "isCollection": false
    },
    {
      "resID": "1",
      "resPath": "graphs/G2.gml",
      "resType": "graph",
      "resFormat": {
        "text/vnd.gml": [
          "gml"
        ]
      },
      "isCollection": false
    },
    {
      "resID": "learningData",
      "resPath": "tables/learningData.csv",
      "resType": "table",
      "resFormat": {
        "text/csv": [
          "csv"
        ]
      },
      "isCollection": false,
      "columns": [
        {
          "colIndex": 0,
          "colName": "d3mIndex",
          "colType": "integer",
          "role": [
            "index"
          ]
        },
        {
          "colIndex": 1,
          "colName": "G1.nodeID",
          "colType": "integer",
          "role": [
            "attribute"
          ],
          "refersTo": {
            "resID": "0",
            "resObject": {
              "nodeAttribute": "nodeID"
            }
          }
        },
        {
          "colIndex": 2,
          "colName": "G2.nodeID",
          "colType": "string",
          "role": [
            "attribute"
          ],
          "refersTo": {
            "resID": "1",
            "resObject": {
              "nodeAttribute": "nodeID"
            }
          }
        },
        {
          "colIndex": 3,
          "colName": "match",
          "colType": "categorical",
          "role": [
            "suggestedTarget"
          ]
        }
      ],
      "columnsCount": 4
    }
  ]
}