time,value
0,-0.29689
1,-0.29689
2,-0.29689
3,-0.29689
4,-0.29689
5,-0.29689
6,-0.29689
7,-0.29689
8,-0.29689
9,-0.29689
10,-0.29689
11,-0.29689
12,-0.29689
13,-0.29689
14,-0.29689
15,-0.29689
16,-0.29689
17,-0.29689
18,-0.29689
19,-0.29689
20,-0.29689
21,-0.29689
22,-0.29689
23,-0.29689
24,-0.29689
25,-0.29689
26,-0.29689
27,-0.29689
28,-0.29689
29,-0.29689
30,-0.29689
31,-0.29689
32,-0.29689
33,-0.29689
34,3.1430000000000002
35,3.7982
36,3.6344
37,3.4706
38,3.4706
39,3.6344
40,2.6516
41,-0.29689
42,-0.29689
43,-0.29689
44,2.324
45,-0.29689
46,-0.29689
47,-0.29689
48,-0.29689
49,-0.29689
50,-0.29689
51,-0.29689
52,-0.29689
53,-0.29689
54,-0.29689
55,-0.29689
56,-0.29689
57,-0.29689
58,-0.29689
59,-0.29689
60,-0.29689
61,-0.29689
62,-0.29689
63,-0.29689
64,-0.29689
65,-0.29689
66,-0.29689
67,-0.29689
68,-0.29689
69,-0.29689
70,-0.29689
71,-0.29689
72,-0.29689
73,-0.29689
74,-0.29689
75,-0.29689
76,-0.29689
77,-0.29689
78,-0.29689
79,-0.29689
80,-0.29689
81,-0.29689
82,-0.29689
83,-0.29689
84,-0.29689
85,-0.29689
86,-0.29689
87,-0.29689
88,-0.29689
89,-0.29689
90,-0.29689
91,-0.29689
92,-0.29689
93,-0.29689
94,-0.29689
95,-0.29689
