time,value
0,-0.42888000000000004
1,-0.42888000000000004
2,-0.42888000000000004
3,-0.42888000000000004
4,-0.42888000000000004
5,-0.42888000000000004
6,-0.42888000000000004
7,-0.42888000000000004
8,-0.42888000000000004
9,-0.42888000000000004
10,-0.42888000000000004
11,-0.42888000000000004
12,-0.42888000000000004
13,-0.42888000000000004
14,-0.42888000000000004
15,-0.42888000000000004
16,-0.42888000000000004
17,-0.42888000000000004
18,-0.42888000000000004
19,-0.42888000000000004
20,-0.42888000000000004
21,-0.42888000000000004
22,-0.42888000000000004
23,-0.42888000000000004
24,-0.42888000000000004
25,-0.42888000000000004
26,-0.42888000000000004
27,-0.42888000000000004
28,-0.42888000000000004
29,-0.42888000000000004
30,-0.42888000000000004
31,-0.42888000000000004
32,-0.42888000000000004
33,-0.42888000000000004
34,-0.42888000000000004
35,-0.42888000000000004
36,-0.42888000000000004
37,-0.42888000000000004
38,-0.42888000000000004
39,-0.42888000000000004
40,-0.42888000000000004
41,-0.42888000000000004
42,-0.42888000000000004
43,-0.42888000000000004
44,-0.42888000000000004
45,-0.42888000000000004
46,-0.42888000000000004
47,-0.42888000000000004
48,-0.42888000000000004
49,-0.42888000000000004
50,-0.42888000000000004
51,-0.42888000000000004
52,-0.42888000000000004
53,-0.42888000000000004
54,-0.42888000000000004
55,-0.42888000000000004
56,-0.42888000000000004
57,-0.42888000000000004
58,-0.42888000000000004
59,-0.42888000000000004
60,-0.42888000000000004
61,-0.42888000000000004
62,-0.42888000000000004
63,-0.42888000000000004
64,-0.42888000000000004
65,-0.42888000000000004
66,-0.42888000000000004
67,-0.42888000000000004
68,-0.42888000000000004
69,-0.42888000000000004
70,-0.42888000000000004
71,-0.42888000000000004
72,-0.42888000000000004
73,-0.42888000000000004
74,-0.42888000000000004
75,-0.42888000000000004
76,-0.42888000000000004
77,-0.42888000000000004
78,-0.42888000000000004
79,0.55423
80,1.2227
81,1.1048
82,1.1048
83,1.1048
84,1.0654
85,0.6722
86,2.7171
87,2.6778
88,2.7564
89,2.7564
90,2.8351
91,2.8351
92,2.9530000000000003
93,2.5991
94,2.4418
95,2.4811
