time,value
0,-1.0001
1,-0.87659
2,-0.72883
3,-0.54092
4,-0.31728
5,-0.088155
6,0.10590999999999999
7,0.24481
8,0.33199
9,0.38393
10,0.4175
11,0.44193999999999994
12,0.46353999999999995
13,0.48075
14,0.48565
15,0.46851000000000004
16,0.42333999999999994
17,0.35525
18,0.27296
19,0.18494000000000002
20,0.095354
21,0.0045776
22,-0.08441599999999999
23,-0.16876
24,-0.24344000000000002
25,-0.30585
26,-0.3569
27,-0.39784
28,-0.43277
29,-0.46051000000000003
30,-0.48335
31,-0.50222
32,-0.51865
33,-0.53645
34,-0.5505899999999999
35,-0.56319
36,-0.5727399999999999
37,-0.5808300000000001
38,-0.59267
39,-0.60288
40,-0.61329
41,-0.61865
42,-0.61792
43,-0.61516
44,-0.60706
45,-0.59909
46,-0.58878
47,-0.57692
48,-0.56558
49,-0.55116
50,-0.53589
51,-0.5152800000000001
52,-0.48913999999999996
53,-0.45795
54,-0.41989
55,-0.37527
56,-0.31675
57,-0.23885
58,-0.13637
59,-0.0094382
60,0.13357
61,0.28181999999999996
62,0.4207
63,0.53992
64,0.63212
65,0.6928
66,0.72068
67,0.71348
68,0.67267
69,0.60078
70,0.50356
71,0.39092
72,0.27084
73,0.15203
74,0.036123
75,-0.080441
76,-0.20023
77,-0.32608000000000004
78,-0.45109
79,-0.56926
80,-0.67613
81,-0.76891
82,-0.85091
83,-0.91812
84,-0.9714299999999999
85,-1.0108
86,-1.0379
87,-1.0617
88,-1.0786
89,-1.0907
90,-1.0915
91,-1.0738
92,-1.0387
93,-0.97888
94,-0.9026799999999999
95,-0.81398
96,-0.72087
97,-0.63642
98,-0.5604899999999999
99,-0.50058
100,-0.45193
101,-0.41167
102,-0.38124
103,-0.35423000000000004
104,-0.33346
105,-0.30672
106,-0.25843
107,-0.17139000000000001
108,-0.024869
109,0.17684
110,0.42158
111,0.67699
112,0.9066200000000001
113,1.0905
114,1.215
115,1.2943
116,1.3432
117,1.3767
118,1.4082
119,1.4318
120,1.4511
121,1.4601
122,1.4614
123,1.4627
124,1.4629
125,1.4713
126,1.4838
127,1.5024
128,1.5272
129,1.5529
130,1.5815
131,1.6074
132,1.6357
133,1.67
134,1.7156
135,1.7795
136,1.8599
137,1.9601
138,2.0723
139,2.1925
140,2.3142
141,2.428
142,2.5297
143,2.6021
144,2.6342
145,2.6141
146,2.5397
147,2.4219
148,2.265
149,2.0776
150,1.8594
151,1.6166
152,1.3652
153,1.1171
154,0.8882399999999999
155,0.67652
156,0.47752
157,0.2855
158,0.09173200000000001
159,-0.097852
160,-0.28208
161,-0.4499
162,-0.59314
163,-0.7138800000000001
164,-0.80904
165,-0.88951
166,-0.9544299999999999
167,-1.0053
168,-1.0464
169,-1.0748
170,-1.1018
171,-1.1251
172,-1.1472
173,-1.1685
174,-1.1832
175,-1.197
176,-1.2055
177,-1.2113
178,-1.2147
179,-1.2135
180,-1.2124
181,-1.2094
182,-1.2071
183,-1.2044
184,-1.1997
185,-1.1953
186,-1.1915
187,-1.1922
188,-1.1977
189,-1.2055
190,-1.2132
191,-1.2164
192,-1.2159
193,-1.214
194,-1.2118
195,-1.2124
196,-1.2125
197,-1.2117
198,-1.2105
199,-1.2079
200,-1.2081
201,-1.2079
202,-1.2082
203,-1.2082
204,-1.2059
205,-1.2048
206,-1.2015
207,-1.1981
208,-1.1933
209,-1.1849
210,-1.1723
211,-1.1449
212,-1.0946
213,-1.0079
214,-0.8771
215,-0.70622
216,-0.50557
217,-0.29846999999999996
218,-0.10255
219,0.069374
220,0.21428000000000003
221,0.34126999999999996
222,0.45487
223,0.56303
224,0.66338
225,0.74946
226,0.81785
227,0.86116
228,0.88241
229,0.88223
230,0.86413
231,0.83455
232,0.79583
233,0.75357
234,0.70607
235,0.65086
236,0.58696
237,0.51652
238,0.44993999999999995
239,0.39766999999999997
240,0.37148000000000003
241,0.37928
242,0.42621000000000003
243,0.51127
244,0.62162
245,0.73993
246,0.8415799999999999
247,0.9118299999999999
248,0.94395
249,0.93935
250,0.9072600000000001
251,0.8487
252,0.76735
253,0.66287
254,0.5395800000000001
255,0.40815
256,0.27074000000000004
257,0.13185
258,-0.0088867
259,-0.14542
260,-0.27028
261,-0.38964
262,-0.50949
263,-0.63202
264,-0.73952
265,-0.8135399999999999
266,-0.86445
267,-0.92294
268,-1.0170000000000001
269,-1.1301
