time,value
0,0.49415
1,0.49415
2,-2.0026
3,0.49415
4,0.49415
5,0.49415
6,0.49415
7,-2.0026
8,0.49415
9,0.49415
10,0.49415
11,0.49415
12,-2.0026
13,0.49415
14,0.49415
15,0.49415
16,-2.0026
17,0.49415
18,0.49415
19,0.49415
20,0.49415
21,-2.0026
22,0.49415
23,0.49415
24,0.49415
25,0.49415
26,-2.0026
27,0.49415
28,0.49415
29,0.49415
30,0.49415
31,0.49415
32,-2.0026
33,0.49415
34,0.49415
35,0.49415
36,0.49415
37,-2.0026
38,0.49415
39,0.49415
40,0.49415
41,0.49415
42,-2.0026
43,0.49415
44,0.49415
45,0.49415
46,-2.0026
47,0.49415
48,0.49415
49,0.49415
50,0.49415
51,-2.0026
52,0.49415
53,0.49415
54,0.49415
55,-2.0026
56,0.49415
57,0.49415
58,0.49415
59,-2.0026
60,0.49415
61,0.49415
62,0.49415
63,0.49415
64,-2.0026
65,0.49415
66,0.49415
67,0.49415
68,-2.0026
69,0.49415
70,0.49415
71,0.49415
72,0.49415
73,-2.0026
74,0.49415
75,0.49415
76,0.49415
77,0.49415
78,0.49415
79,-2.0026
80,0.49415
81,0.49415
82,0.49415
83,0.49415
84,0.49415
85,0.49415
86,-2.0026
87,0.49415
88,0.49415
89,0.49415
90,-2.0026
91,0.49415
92,0.49415
93,0.49415
94,0.49415
95,0.49415
