time,value
0,-0.20606999999999998
1,-0.39449
2,-0.20606999999999998
3,-0.39449
4,-0.20606999999999998
5,-0.39449
6,-0.20606999999999998
7,-0.39449
8,-0.20606999999999998
9,-0.39449
10,-0.20606999999999998
11,-0.39449
12,-0.20606999999999998
13,-0.39449
14,-0.20606999999999998
15,-0.39449
16,-0.20606999999999998
17,-0.39449
18,-0.20606999999999998
19,-0.39449
20,-0.20606999999999998
21,-0.39449
22,-0.20606999999999998
23,-0.39449
24,-0.20606999999999998
25,-0.39449
26,-0.20606999999999998
27,-0.39449
28,-0.20606999999999998
29,-0.39449
30,-0.20606999999999998
31,-0.39449
32,-0.20606999999999998
33,-0.39449
34,-0.20606999999999998
35,-0.39449
36,-0.20606999999999998
37,-0.39449
38,-0.20606999999999998
39,-0.20606999999999998
40,-0.39449
41,-0.20606999999999998
42,-0.39449
43,-0.20606999999999998
44,-0.39449
45,-0.20606999999999998
46,-0.39449
47,-0.20606999999999998
48,-0.39449
49,-0.20606999999999998
50,-0.39449
51,-0.20606999999999998
52,-0.39449
53,-0.20606999999999998
54,-0.39449
55,-0.20606999999999998
56,-0.39449
57,-0.20606999999999998
58,-0.39449
59,-0.20606999999999998
60,-0.39449
61,-0.20606999999999998
62,-0.39449
63,-0.20606999999999998
64,-0.39449
65,-0.20606999999999998
66,-0.39449
67,-0.20606999999999998
68,-0.39449
69,-0.20606999999999998
70,-0.39449
71,-0.20606999999999998
72,-0.39449
73,-0.20606999999999998
74,-0.39449
75,-0.20606999999999998
76,-0.39449
77,-0.20606999999999998
78,-0.39449
79,-0.20606999999999998
80,3.9389999999999996
81,4.1274
82,3.7506
83,3.5621
84,0.17075
85,0.35916
86,0.35916
87,0.73598
88,3.5621
89,3.5621
90,1.1128
91,-0.39449
92,-0.20606999999999998
93,-0.39449
94,-0.20606999999999998
95,-0.20606999999999998
