time,value
0,-0.28665
1,-0.46193
2,-0.28665
3,-0.28665
4,-0.28665
5,-0.46193
6,-0.28665
7,-0.28665
8,-0.28665
9,-0.46193
10,-0.28665
11,-0.28665
12,-0.28665
13,-0.46193
14,-0.28665
15,-0.28665
16,-0.28665
17,-0.46193
18,-0.28665
19,-0.28665
20,-0.28665
21,-0.28665
22,-0.46193
23,-0.28665
24,-0.28665
25,-0.28665
26,-0.46193
27,-0.28665
28,-0.28665
29,-0.28665
30,-0.46193
31,-0.28665
32,-0.28665
33,-0.28665
34,-0.46193
35,-0.28665
36,-0.28665
37,-0.28665
38,-0.46193
39,-0.28665
40,-0.28665
41,-0.28665
42,-0.46193
43,-0.28665
44,-0.28665
45,-0.28665
46,-0.46193
47,-0.28665
48,-0.28665
49,-0.28665
50,-0.46193
51,-0.28665
52,-0.28665
53,-0.28665
54,-0.46193
55,-0.28665
56,-0.28665
57,-0.28665
58,-0.46193
59,-0.28665
60,-0.28665
61,-0.28665
62,-0.28665
63,-0.46193
64,-0.28665
65,-0.28665
66,-0.28665
67,-0.46193
68,-0.28665
69,-0.28665
70,-0.28665
71,-0.46193
72,-0.28665
73,-0.28665
74,-0.28665
75,-0.46193
76,-0.28665
77,-0.28665
78,-0.28665
79,-0.28665
80,-0.11137000000000001
81,1.992
82,3.2189
83,3.0436
84,3.3942
85,3.3942
86,3.2189
87,0.7650100000000001
88,3.5694
89,3.2189
90,2.1672
91,-0.28665
92,-0.28665
93,-0.28665
94,-0.28665
95,-0.46193
