d3mIndex,type,fold,repeat
1036,TEST,0,0
1037,TEST,0,0
1038,TEST,0,0
1039,TEST,0,0
1040,TEST,0,0
1041,TEST,0,0
1042,TEST,0,0
1043,TEST,0,0
1044,TEST,0,0
1045,TEST,0,0
1046,TEST,0,0
1047,TEST,0,0
1048,TEST,0,0
1049,TEST,0,0
1050,TEST,0,0
1051,TEST,0,0
1052,TEST,0,0
1053,TEST,0,0
1054,TEST,0,0
1055,TEST,0,0
1056,TEST,0,0
1057,TEST,0,0
1058,TEST,0,0
3755,TEST,0,0
3756,TEST,0,0
3757,TEST,0,0
3758,TEST,0,0
3759,TEST,0,0
3760,TEST,0,0
3761,TEST,0,0
3762,TEST,0,0
3763,TEST,0,0
3764,TEST,0,0
3765,TEST,0,0
3766,TEST,0,0
3767,TEST,0,0
3768,TEST,0,0
3769,TEST,0,0
3770,TEST,0,0
3771,TEST,0,0
3772,TEST,0,0
3773,TEST,0,0
3774,TEST,0,0
3775,TEST,0,0
3776,TEST,0,0
3777,TEST,0,0
6474,TEST,0,0
6475,TEST,0,0
6476,TEST,0,0
6477,TEST,0,0
6478,TEST,0,0
6479,TEST,0,0
6480,TEST,0,0
6481,TEST,0,0
6482,TEST,0,0
6483,TEST,0,0
6484,TEST,0,0
6485,TEST,0,0
6486,TEST,0,0
6487,TEST,0,0
6488,TEST,0,0
6489,TEST,0,0
6490,TEST,0,0
6491,TEST,0,0
6492,TEST,0,0
6493,TEST,0,0
6494,TEST,0,0
6495,TEST,0,0
6496,TEST,0,0
8806,TEST,0,0
8807,TEST,0,0
8808,TEST,0,0
8809,TEST,0,0
8810,TEST,0,0
8811,TEST,0,0
8812,TEST,0,0
8813,TEST,0,0
8814,TEST,0,0
8815,TEST,0,0
8816,TEST,0,0
8817,TEST,0,0
8818,TEST,0,0
8819,TEST,0,0
8820,TEST,0,0
8821,TEST,0,0
8822,TEST,0,0
8823,TEST,0,0
8824,TEST,0,0
8825,TEST,0,0
8826,TEST,0,0
8827,TEST,0,0
8828,TEST,0,0
12832,TEST,0,0
12833,TEST,0,0
12834,TEST,0,0
12835,TEST,0,0
12836,TEST,0,0
12837,TEST,0,0
12838,TEST,0,0
12839,TEST,0,0
12840,TEST,0,0
12841,TEST,0,0
12842,TEST,0,0
12843,TEST,0,0
12844,TEST,0,0
12845,TEST,0,0
12846,TEST,0,0
12847,TEST,0,0
12848,TEST,0,0
12849,TEST,0,0
12850,TEST,0,0
12851,TEST,0,0
12852,TEST,0,0
12853,TEST,0,0
12854,TEST,0,0
14952,TEST,0,0
14953,TEST,0,0
14954,TEST,0,0
14955,TEST,0,0
14956,TEST,0,0
14957,TEST,0,0
14958,TEST,0,0
14959,TEST,0,0
14960,TEST,0,0
14961,TEST,0,0
14962,TEST,0,0
14963,TEST,0,0
14964,TEST,0,0
14965,TEST,0,0
14966,TEST,0,0
14967,TEST,0,0
14968,TEST,0,0
14969,TEST,0,0
14970,TEST,0,0
14971,TEST,0,0
14972,TEST,0,0
14973,TEST,0,0
14974,TEST,0,0
17590,TEST,0,0
17591,TEST,0,0
17592,TEST,0,0
17593,TEST,0,0
17594,TEST,0,0
17595,TEST,0,0
17596,TEST,0,0
17597,TEST,0,0
17598,TEST,0,0
17599,TEST,0,0
17600,TEST,0,0
17601,TEST,0,0
17602,TEST,0,0
17603,TEST,0,0
17604,TEST,0,0
17605,TEST,0,0
17606,TEST,0,0
17607,TEST,0,0
17608,TEST,0,0
17609,TEST,0,0
17610,TEST,0,0
17611,TEST,0,0
17612,TEST,0,0
17801,TEST,0,0
17802,TEST,0,0
17803,TEST,0,0
17804,TEST,0,0
17805,TEST,0,0
17806,TEST,0,0
17807,TEST,0,0
17808,TEST,0,0
17809,TEST,0,0
17810,TEST,0,0
17811,TEST,0,0
17812,TEST,0,0
17813,TEST,0,0
17814,TEST,0,0
17815,TEST,0,0
17816,TEST,0,0
17817,TEST,0,0
17818,TEST,0,0
17819,TEST,0,0
17820,TEST,0,0
17821,TEST,0,0
17822,TEST,0,0
29694,TEST,0,0
29695,TEST,0,0
29696,TEST,0,0
29697,TEST,0,0
29698,TEST,0,0
29699,TEST,0,0
29700,TEST,0,0
29701,TEST,0,0
29702,TEST,0,0
29703,TEST,0,0
29704,TEST,0,0
29705,TEST,0,0
29706,TEST,0,0
29707,TEST,0,0
29708,TEST,0,0
29709,TEST,0,0
29710,TEST,0,0
29711,TEST,0,0
29712,TEST,0,0
29713,TEST,0,0
29714,TEST,0,0
29715,TEST,0,0
29716,TEST,0,0
30235,TEST,0,0
30236,TEST,0,0
30237,TEST,0,0
30238,TEST,0,0
30239,TEST,0,0
30240,TEST,0,0
30241,TEST,0,0
30242,TEST,0,0
30243,TEST,0,0
30244,TEST,0,0
30245,TEST,0,0
30246,TEST,0,0
30247,TEST,0,0
30248,TEST,0,0
30249,TEST,0,0
30250,TEST,0,0
30251,TEST,0,0
30252,TEST,0,0
30253,TEST,0,0
30254,TEST,0,0
30255,TEST,0,0
30256,TEST,0,0
30257,TEST,0,0
