time,value
0,1.0958
1,1.014
2,0.9322
3,0.8504
4,-1.1947
5,-0.86744
6,1.014
7,0.9322
8,1.0958
9,1.0958
10,0.9322
11,0.9322
12,0.8504
13,-1.031
14,-1.1947
15,0.19598
16,0.9322
17,1.014
18,1.0958
19,1.014
20,0.8504
21,0.8504
22,0.27779
23,-1.1947
24,-0.94924
25,1.014
26,1.014
27,1.0958
28,1.0958
29,0.9322
30,0.8504
31,0.8504
32,0.27779
33,-1.1947
34,0.03238
35,1.1776
36,1.0958
37,1.0958
38,0.27779
39,-1.1947
40,-1.1947
41,-1.1947
42,-0.54023
43,1.014
44,1.014
45,0.9322
46,0.5231899999999999
47,-1.1947
48,-1.1947
49,-1.1947
50,-1.1947
51,-1.1947
52,0.7686
53,0.6049899999999999
54,0.03238
55,1.0958
56,0.7686
57,-1.1947
58,-1.1947
59,-1.1947
60,-1.1947
61,-1.1947
62,0.6868
63,0.27779
64,0.35959
65,1.014
66,0.35959
67,-1.1947
68,-1.1947
69,-1.1947
70,-1.1947
71,-1.1947
72,-1.1947
73,-1.031
74,1.1776
75,1.1776
76,1.014
77,-0.86744
78,-1.1947
79,-1.1947
80,-1.1947
81,0.35959
82,1.1776
83,-0.13122
84,-1.1947
85,-1.1947
86,-1.1947
87,-0.049422
88,0.9322
89,-0.21303000000000002
90,1.014
91,1.014
92,-1.1947
93,-1.1947
94,-1.1947
95,-1.1947
