time,value
0,2.1337
1,-0.60024
2,-0.60024
3,-0.60024
4,-0.60024
5,0.24097
6,2.344
7,-0.60024
8,-0.60024
9,-0.60024
10,-0.60024
11,-0.17964000000000002
12,2.344
13,-0.60024
14,-0.60024
15,-0.60024
16,-0.60024
17,-0.60024
18,2.1337
19,0.45128
20,-0.60024
21,-0.60024
22,-0.60024
23,-0.60024
24,1.2925
25,1.0822
26,-0.60024
27,-0.60024
28,-0.60024
29,-0.60024
30,0.45128
31,2.1337
32,-0.60024
33,-0.60024
34,-0.60024
35,-0.60024
36,-0.60024
37,2.1337
38,0.24097
39,-0.60024
40,-0.60024
41,-0.60024
42,-0.60024
43,1.5028
44,0.8718899999999999
45,-0.60024
46,-0.60024
47,-0.60024
48,-0.60024
49,0.6615800000000001
50,1.9234
51,-0.60024
52,-0.60024
53,-0.60024
54,-0.60024
55,-0.60024
56,2.344
57,0.030669
58,-0.60024
59,-0.60024
60,-0.60024
61,-0.60024
62,1.5028
63,1.0822
64,-0.60024
65,-0.60024
66,-0.60024
67,-0.60024
68,0.24097
69,2.1337
70,-0.60024
71,-0.60024
72,-0.60024
73,-0.60024
74,-0.60024
75,2.344
76,0.030669
77,-0.60024
78,-0.60024
79,-0.60024
80,-0.60024
81,1.5028
82,1.0822
83,-0.60024
84,-0.60024
85,-0.60024
86,-0.60024
87,0.45128
88,2.1337
89,-0.60024
90,-0.60024
91,-0.60024
92,-0.60024
93,-0.60024
94,2.1337
95,0.24097
