[<text>
<title>entre computer centers inc &lt;etre&gt; 2nd qtr loss</title>
<dateline>    vienna, va., april 13 -
    </dateline>shr loss 29 cts vs profit 10 cts
    net loss 2,733,000 vs profit 911,000
    revs 21.5 mln vs 18.5 mln
    1st half
    shr loss 23 cts vs profit 26 cts
    net loss 2,154,000 vs profit 2,445,000
    revs 37.8 mln vs 37.7 mln
    note: current year net both periods includes 6,705,000 dlr
pretax provision for closing overseas operations and tax
credits 2,511,000 dlrs in quarter and 1,977,000 dlrs in half.
 reuter
</text>]