time,value
0,-0.014013999999999999
1,-0.68667
2,-0.68667
3,-0.014013999999999999
4,-0.68667
5,-0.68667
6,-0.014013999999999999
7,-0.68667
8,-0.014013999999999999
9,-0.68667
10,-0.68667
11,-0.014013999999999999
12,-0.68667
13,-0.014013999999999999
14,-0.68667
15,-0.68667
16,-0.014013999999999999
17,-0.68667
18,-0.68667
19,-0.014013999999999999
20,-0.68667
21,-0.014013999999999999
22,-0.68667
23,-0.68667
24,-0.014013999999999999
25,-0.68667
26,-0.014013999999999999
27,-0.68667
28,-0.68667
29,-0.014013999999999999
30,-0.68667
31,-0.014013999999999999
32,-0.68667
33,-0.68667
34,-0.014013999999999999
35,-0.68667
36,-0.014013999999999999
37,-0.68667
38,0.65865
39,-0.68667
40,-0.68667
41,-0.014013999999999999
42,-0.68667
43,-0.014013999999999999
44,-0.68667
45,-0.68667
46,-0.014013999999999999
47,-0.68667
48,-0.014013999999999999
49,-0.68667
50,2.6766
51,4.0219
52,4.0219
53,2.6766
54,4.0219
55,1.3313
56,-0.014013999999999999
57,-0.68667
58,-0.014013999999999999
59,-0.014013999999999999
60,-0.68667
61,-0.014013999999999999
62,-0.014013999999999999
63,-0.68667
64,-0.014013999999999999
65,-0.68667
66,-0.014013999999999999
67,-0.014013999999999999
68,0.65865
69,2.004
70,-0.014013999999999999
71,0.65865
72,0.65865
73,-0.014013999999999999
74,-0.68667
75,-0.014013999999999999
76,-0.014013999999999999
77,-0.014013999999999999
78,-0.014013999999999999
79,-0.014013999999999999
80,-0.014013999999999999
81,2.6766
82,-0.014013999999999999
83,-0.014013999999999999
84,-0.014013999999999999
85,-0.014013999999999999
86,-0.68667
87,-0.014013999999999999
88,-0.014013999999999999
89,-0.014013999999999999
90,-0.68667
91,-0.014013999999999999
92,-0.014013999999999999
93,-0.014013999999999999
94,-0.014013999999999999
95,-0.014013999999999999
