time,value
0,-0.31749
1,-0.31749
2,-0.31749
3,-0.31749
4,-0.31749
5,-0.31749
6,-0.31749
7,-0.31749
8,-0.31749
9,-0.31749
10,-0.31749
11,-0.31749
12,-0.31749
13,-0.31749
14,-0.31749
15,-0.31749
16,-0.31749
17,-0.31749
18,-0.31749
19,-0.31749
20,-0.31749
21,-0.31749
22,-0.31749
23,-0.31749
24,-0.31749
25,-0.31749
26,-0.31749
27,-0.31749
28,-0.31749
29,-0.31749
30,-0.31749
31,-0.31749
32,-0.31749
33,-0.31749
34,-0.31749
35,-0.31749
36,-0.31749
37,-0.31749
38,-0.31749
39,-0.31749
40,-0.31749
41,-0.31749
42,-0.31749
43,-0.31749
44,-0.31749
45,3.3434
46,3.017
47,0.22171
48,-0.31749
49,-0.31749
50,-0.31749
51,-0.31749
52,1.5271
53,4.5069
54,0.2359
55,5.1738
56,0.09400499999999999
57,0.22171
58,-0.31749
59,-0.31749
60,2.5346
61,0.7609100000000001
62,0.12237999999999999
63,-0.31749
64,-0.31749
65,-0.31749
66,-0.31749
67,-0.31749
68,-0.31749
69,-0.31749
70,3.0738
71,0.68996
72,0.19333
73,-0.31749
74,-0.31749
75,-0.31749
76,-0.31749
77,-0.31749
78,-0.31749
79,-0.31749
80,-0.31749
81,-0.31749
82,-0.31749
83,-0.31749
84,-0.31749
85,-0.31749
86,-0.31749
87,-0.31749
88,-0.31749
89,-0.31749
90,-0.31749
91,-0.31749
92,-0.31749
93,-0.31749
94,-0.31749
95,-0.31749
