time,value
0,-0.45141000000000003
1,-0.52437
2,-0.45141000000000003
3,0.27814
4,-0.013678999999999998
5,0.49701000000000006
6,-0.15959
7,-0.45141000000000003
8,-0.52437
9,-0.013678999999999998
10,0.3511
11,-0.23255
12,0.49701000000000006
13,-0.3055
14,-0.52437
15,-0.45141000000000003
16,0.49701000000000006
17,-0.23255
18,-0.15959
19,0.49701000000000006
20,-0.45141000000000003
21,-0.52437
22,0.20519
23,0.13223
24,-0.52437
25,0.059276999999999996
26,0.3511
27,-0.45141000000000003
28,-0.3055
29,0.49701000000000006
30,-0.45141000000000003
31,-0.45141000000000003
32,0.059276999999999996
33,0.27814
34,-0.52437
35,0.3511
36,-0.086635
37,-0.45141000000000003
38,-0.52437
39,0.27814
40,0.13223
41,-0.15959
42,0.42406000000000005
43,-0.45141000000000003
44,-0.52437
45,-0.45141000000000003
46,0.20519
47,0.059276999999999996
48,0.49701000000000006
49,-0.086635
50,-0.52437
51,-0.45141000000000003
52,-0.52437
53,0.42406000000000005
54,0.3511
55,0.3511
56,-0.45141000000000003
57,-0.45141000000000003
58,-0.52437
59,-0.45141000000000003
60,0.49701000000000006
61,0.78883
62,-0.15959
63,-0.52437
64,-0.45141000000000003
65,-0.52437
66,-0.37846
67,1.0077
68,0.49701000000000006
69,-0.52437
70,-0.45141000000000003
71,-0.52437
72,-0.45141000000000003
73,-0.086635
74,1.4454
75,-0.15959
76,-0.52437
77,-0.45141000000000003
78,-0.52437
79,-0.45141000000000003
80,0.86179
81,0.78883
82,-0.45141000000000003
83,-0.52437
84,-0.45141000000000003
85,8.4492
86,1.4454
87,0.059276999999999996
88,-0.45141000000000003
89,-0.52437
90,-0.45141000000000003
91,-0.52437
92,1.1536
93,0.56997
94,-0.52437
95,-0.45141000000000003
