time,value
0,0.037931
1,1.4034
2,1.3124
3,0.22
4,-0.87241
5,-0.87241
6,-0.87241
7,-0.87241
8,0.7662100000000001
9,1.3124
10,1.2214
11,-0.41723999999999994
12,-0.87241
13,-0.87241
14,-0.87241
15,-0.87241
16,1.2214
17,1.4034
18,1.2214
19,-0.87241
20,-0.87241
21,-0.87241
22,-0.87241
23,-0.69035
24,1.4034
25,1.4034
26,0.85724
27,-0.87241
28,-0.87241
29,-0.87241
30,-0.87241
31,-0.5082800000000001
32,1.4034
33,1.4034
34,0.85724
35,-0.87241
36,-0.87241
37,-0.87241
38,-0.87241
39,1.1303
40,1.3124
41,1.2214
42,-0.87241
43,-0.87241
44,-0.87241
45,-0.87241
46,-0.053103
47,1.4034
48,1.3124
49,0.22
50,-0.87241
51,-0.87241
52,-0.87241
53,-0.87241
54,0.31103000000000003
55,1.4034
56,1.3124
57,0.037931
58,-0.87241
59,-0.87241
60,-0.87241
61,-0.87241
62,0.40207
63,1.4034
64,1.3124
65,-0.053103
66,-0.87241
67,-0.87241
68,-0.87241
69,-0.59931
70,1.4034
71,1.3124
72,1.0393
73,-0.87241
74,-0.87241
75,-0.87241
76,-0.87241
77,1.4945
78,1.3124
79,0.9482799999999999
80,-0.87241
81,-0.87241
82,-0.87241
83,-0.87241
84,1.4034
85,1.3124
86,0.9482799999999999
87,-0.87241
88,-0.87241
89,-0.87241
90,-0.87241
91,1.1303
92,1.3124
93,1.2214
94,-0.87241
95,-0.87241
