time,value
0,-0.25243000000000004
1,-0.25243000000000004
2,-0.25243000000000004
3,-0.25243000000000004
4,-0.25243000000000004
5,-0.25243000000000004
6,-0.25243000000000004
7,-0.25243000000000004
8,-0.25243000000000004
9,-0.25243000000000004
10,-0.25243000000000004
11,-0.25243000000000004
12,-0.25243000000000004
13,-0.25243000000000004
14,-0.25243000000000004
15,-0.25243000000000004
16,-0.25243000000000004
17,-0.25243000000000004
18,-0.25243000000000004
19,-0.25243000000000004
20,-0.25243000000000004
21,-0.25243000000000004
22,-0.25243000000000004
23,-0.25243000000000004
24,-0.25243000000000004
25,-0.25243000000000004
26,-0.25243000000000004
27,-0.25243000000000004
28,-0.25243000000000004
29,-0.25243000000000004
30,-0.25243000000000004
31,-0.25243000000000004
32,-0.25243000000000004
33,-0.25243000000000004
34,2.6941
35,-0.25243000000000004
36,-0.25243000000000004
37,-0.25243000000000004
38,-0.25243000000000004
39,4.523
40,-0.25243000000000004
41,-0.25243000000000004
42,-0.25243000000000004
43,4.6754
44,-0.25243000000000004
45,-0.25243000000000004
46,-0.25243000000000004
47,-0.25243000000000004
48,-0.25243000000000004
49,-0.25243000000000004
50,-0.25243000000000004
51,3.0497
52,-0.25243000000000004
53,-0.25243000000000004
54,-0.25243000000000004
55,-0.25243000000000004
56,-0.25243000000000004
57,-0.25243000000000004
58,-0.25243000000000004
59,-0.25243000000000004
60,-0.25243000000000004
61,-0.25243000000000004
62,-0.25243000000000004
63,-0.25243000000000004
64,-0.25243000000000004
65,-0.25243000000000004
66,-0.25243000000000004
67,-0.25243000000000004
68,-0.25243000000000004
69,-0.25243000000000004
70,-0.25243000000000004
71,-0.25243000000000004
72,-0.25243000000000004
73,4.1674
74,-0.25243000000000004
75,-0.25243000000000004
76,-0.25243000000000004
77,-0.25243000000000004
78,-0.25243000000000004
79,-0.25243000000000004
80,-0.25243000000000004
81,3.6086
82,-0.25243000000000004
83,-0.25243000000000004
84,-0.25243000000000004
85,-0.25243000000000004
86,-0.25243000000000004
87,-0.25243000000000004
88,-0.25243000000000004
89,-0.25243000000000004
90,-0.25243000000000004
91,-0.25243000000000004
92,-0.25243000000000004
93,-0.25243000000000004
94,-0.25243000000000004
95,-0.25243000000000004
