time,value
0,-0.6893199999999999
1,-0.6893199999999999
2,1.0075
3,1.6862
4,1.1772
5,-0.6893199999999999
6,-0.6893199999999999
7,-0.6893199999999999
8,-0.6893199999999999
9,-0.6893199999999999
10,0.66811
11,1.8559
12,1.5165
13,-0.6893199999999999
14,-0.6893199999999999
15,-0.6893199999999999
16,-0.6893199999999999
17,-0.6893199999999999
18,-0.6893199999999999
19,1.6862
20,1.6862
21,0.15907000000000002
22,-0.6893199999999999
23,-0.6893199999999999
24,-0.6893199999999999
25,-0.6893199999999999
26,-0.6893199999999999
27,-0.18028
28,1.8559
29,1.6862
30,-0.6893199999999999
31,-0.6893199999999999
32,-0.6893199999999999
33,-0.6893199999999999
34,-0.6893199999999999
35,-0.6893199999999999
36,0.15907000000000002
37,1.8559
38,1.3468
39,-0.6893199999999999
40,-0.6893199999999999
41,-0.6893199999999999
42,-0.6893199999999999
43,-0.6893199999999999
44,-0.6893199999999999
45,1.8559
46,1.6862
47,0.15907000000000002
48,-0.6893199999999999
49,-0.6893199999999999
50,-0.6893199999999999
51,-0.6893199999999999
52,-0.6893199999999999
53,0.8377899999999999
54,1.8559
55,0.8377899999999999
56,-0.6893199999999999
57,-0.6893199999999999
58,-0.6893199999999999
59,-0.6893199999999999
60,-0.6893199999999999
61,-0.6893199999999999
62,1.6862
63,1.6862
64,-0.010605
65,-0.6893199999999999
66,-0.6893199999999999
67,-0.6893199999999999
68,-0.6893199999999999
69,0.8377899999999999
70,1.6862
71,1.5165
72,-0.18028
73,-0.6893199999999999
74,-0.6893199999999999
75,-0.6893199999999999
76,-0.6893199999999999
77,-0.6893199999999999
78,1.8559
79,1.6862
80,-0.18028
81,-0.6893199999999999
82,-0.6893199999999999
83,-0.6893199999999999
84,-0.6893199999999999
85,-0.6893199999999999
86,0.8377899999999999
87,1.8559
88,0.66811
89,-0.6893199999999999
90,-0.6893199999999999
91,-0.6893199999999999
92,-0.6893199999999999
93,-0.6893199999999999
94,-0.010605
95,2.0255
