time,value
0,1.6771
1,1.3618
2,1.2041
3,0.8886700000000001
4,-0.8459700000000001
5,-0.8459700000000001
6,-0.8459700000000001
7,-0.8459700000000001
8,-0.8459700000000001
9,0.57329
10,1.5195
11,1.2041
12,0.57329
13,-0.8459700000000001
14,-0.8459700000000001
15,-0.8459700000000001
16,-0.8459700000000001
17,-0.8459700000000001
18,0.73098
19,1.5195
20,1.2041
21,-0.37288000000000004
22,-0.8459700000000001
23,-0.8459700000000001
24,-0.8459700000000001
25,-0.8459700000000001
26,-0.8459700000000001
27,1.6771
28,1.3618
29,0.73098
30,-0.8459700000000001
31,-0.8459700000000001
32,-0.8459700000000001
33,-0.8459700000000001
34,-0.8459700000000001
35,0.41558999999999996
36,1.5195
37,1.2041
38,-0.21519000000000002
39,-0.8459700000000001
40,-0.8459700000000001
41,-0.8459700000000001
42,-0.8459700000000001
43,-0.8459700000000001
44,1.2041
45,1.3618
46,1.2041
47,-0.21519000000000002
48,-0.8459700000000001
49,-0.8459700000000001
50,-0.8459700000000001
51,-0.37288000000000004
52,1.5195
53,1.3618
54,1.2041
55,0.8886700000000001
56,-0.8459700000000001
57,-0.8459700000000001
58,-0.8459700000000001
59,-0.8459700000000001
60,-0.8459700000000001
61,0.8886700000000001
62,1.3618
63,1.2041
64,1.2041
65,-0.37288000000000004
66,-0.8459700000000001
67,-0.8459700000000001
68,-0.8459700000000001
69,-0.8459700000000001
70,-0.8459700000000001
71,1.5195
72,1.3618
73,1.2041
74,-0.53058
75,-0.8459700000000001
76,-0.8459700000000001
77,-0.8459700000000001
78,-0.8459700000000001
79,-0.8459700000000001
80,1.6771
81,1.3618
82,0.73098
83,-0.8459700000000001
84,-0.8459700000000001
85,-0.8459700000000001
86,-0.8459700000000001
87,-0.8459700000000001
88,0.2579
89,1.5195
90,1.2041
91,1.2041
92,0.41558999999999996
93,-0.8459700000000001
94,-0.8459700000000001
95,-0.8459700000000001
