time,value
0,-1.0077
1,-1.0077
2,0.8799299999999999
3,1.1945
4,1.1945
5,1.0372
6,1.0372
7,-1.0077
8,-1.0077
9,-1.0077
10,-1.0077
11,-1.0077
12,-1.0077
13,0.7226199999999999
14,1.3518
15,1.0372
16,1.0372
17,0.0934
18,-1.0077
19,-1.0077
20,-1.0077
21,-1.0077
22,-1.0077
23,-0.53582
24,1.5091
25,1.1945
26,1.0372
27,0.8799299999999999
28,-0.53582
29,-1.0077
30,-1.0077
31,-1.0077
32,-1.0077
33,-1.0077
34,0.5653199999999999
35,1.3518
36,1.0372
37,1.0372
38,1.0372
39,1.0372
40,-0.22121
41,-1.0077
42,-1.0077
43,-1.0077
44,-1.0077
45,-1.0077
46,-0.06390499999999999
47,1.3518
48,1.1945
49,1.0372
50,1.0372
51,0.40801
52,-1.0077
53,-1.0077
54,-1.0077
55,-1.0077
56,-1.0077
57,0.5653199999999999
58,1.3518
59,1.0372
60,1.0372
61,1.0372
62,1.0372
63,1.0372
64,1.0372
65,0.8799299999999999
66,-0.06390499999999999
67,-1.0077
68,-1.0077
69,-1.0077
70,-1.0077
71,-1.0077
72,-0.37851999999999997
73,1.5091
74,1.1945
75,1.0372
76,0.8799299999999999
77,1.0372
78,1.0372
79,-0.69313
80,-1.0077
81,-1.0077
82,-1.0077
83,-1.0077
84,-1.0077
85,0.25071
86,1.3518
87,1.0372
88,1.0372
89,1.0372
90,0.0934
91,-1.0077
92,-1.0077
93,-1.0077
94,-1.0077
95,-1.0077
