time,value
0,-1.2453
1,0.28298
2,-0.0699
3,-1.252
4,-2.1092
5,-2.1069999999999998
6,-1.5204
7,-1.0113
8,-0.98634
9,-1.3444
10,-1.7056
11,-1.7757
12,-1.5694
13,-1.3412
14,-1.2987
15,-1.4309
16,-1.5901
17,-1.6446
18,-1.5748
19,-1.4801
20,-1.4575
21,-1.5024
22,-1.5602
23,-1.5893
24,-1.5721
25,-1.5401
26,-1.5356
27,-1.5474
28,-1.5568
29,-1.5664
30,-1.5646
31,-1.5567
32,-1.5645
33,-1.5609
34,-1.5483
35,-1.5543
36,-1.5498
37,-1.5351
38,-1.5404
39,-1.5353
40,-1.5185
41,-1.5188
42,-1.5119
43,-1.4945
44,-1.4923
45,-1.4847
46,-1.4638
47,-1.4535
48,-1.4408
49,-1.4183
50,-1.4087
51,-1.4031
52,-1.3876
53,-1.379
54,-1.3731
55,-1.3553
56,-1.3425
57,-1.3376
58,-1.3227
59,-1.3102
60,-1.3072
61,-1.2933
62,-1.2789
63,-1.2771
64,-1.2647
65,-1.2485
66,-1.2463
67,-1.2326
68,-1.2123
69,-1.2091
70,-1.1951
71,-1.1716
72,-1.1669
73,-1.1512
74,-1.1244
75,-1.1175
76,-1.1017
77,-1.0749
78,-1.0658
79,-1.0505
80,-1.0246
81,-1.0146
82,-1.0018
83,-0.97893
84,-0.96939
85,-0.9600200000000001
86,-0.94066
87,-0.93225
88,-0.9268299999999999
89,-0.9111
90,-0.90307
91,-0.90022
92,-0.8868
93,-0.8783200000000001
94,-0.87774
95,-0.8664299999999999
96,-0.8568600000000001
97,-0.8573700000000001
98,-0.84703
99,-0.83593
100,-0.83811
101,-0.83006
102,-0.81875
103,-0.8231299999999999
104,-0.8171
105,-0.80503
106,-0.8115600000000001
107,-0.8086800000000001
108,-0.79802
109,-0.80906
110,-0.81075
111,-0.80279
112,-0.81542
113,-0.82032
114,-0.81597
115,-0.83045
116,-0.84005
117,-0.83959
118,-0.8546100000000001
119,-0.8672
120,-0.8701
121,-0.8865200000000001
122,-0.90312
123,-0.90875
124,-0.92385
125,-0.9414299999999999
126,-0.94862
127,-0.9632
128,-0.98224
129,-0.9887100000000001
130,-0.9983
131,-1.0166
132,-1.0273
133,-1.0436
134,-1.0726
135,-1.0887
136,-1.0979
137,-1.1138
138,-1.1146
139,-1.111
140,-1.1259
141,-1.1328
142,-1.1335
143,-1.151
144,-1.1549
145,-1.1476
146,-1.1616
147,-1.167
148,-1.1636
149,-1.1794
150,-1.1846
151,-1.1763
152,-1.1838
153,-1.1872
154,-1.1832
155,-1.1969
156,-1.209
157,-1.2091
158,-1.2196
159,-1.2309
160,-1.2347
161,-1.2516
162,-1.2727
163,-1.2792
164,-1.2848
165,-1.2895
166,-1.2805
167,-1.2773
168,-1.2867
169,-1.2876
170,-1.2881
171,-1.296
172,-1.2898
173,-1.2809
174,-1.2871
175,-1.284
176,-1.2759
177,-1.2819
178,-1.2747
179,-1.2585
180,-1.2613
181,-1.2547
182,-1.2386
183,-1.2439
184,-1.2385
185,-1.2222
186,-1.2249
187,-1.2204
188,-1.2055
189,-1.2072
190,-1.2043
191,-1.1909
192,-1.1919
193,-1.1917
194,-1.1805
195,-1.1799
196,-1.1787
197,-1.1652
198,-1.1593
199,-1.1576
200,-1.1463
201,-1.1416
202,-1.1425
203,-1.1298
204,-1.1165
205,-1.11
206,-1.0927
207,-1.0779
208,-1.0775
209,-1.0672
210,-1.0526
211,-1.0494
212,-1.0329
213,-1.0099
214,-1.0046
215,-0.9898899999999999
216,-0.96767
217,-0.96498
218,-0.95189
219,-0.9289
220,-0.9280200000000001
221,-0.91879
222,-0.8997799999999999
223,-0.8996299999999999
224,-0.89292
225,-0.8760899999999999
226,-0.87621
227,-0.8732200000000001
228,-0.85995
229,-0.86024
230,-0.8595200000000001
231,-0.84867
232,-0.8500200000000001
233,-0.8546600000000001
234,-0.8496299999999999
235,-0.85293
236,-0.8598399999999999
237,-0.85459
238,-0.85387
239,-0.8606299999999999
240,-0.85785
241,-0.8594799999999999
242,-0.8724299999999999
243,-0.8746
244,-0.8753700000000001
245,-0.88712
246,-0.8865799999999999
247,-0.8823700000000001
248,-0.8937700000000001
249,-0.89494
250,-0.8903
251,-0.90309
252,-0.9040600000000001
253,-0.89492
254,-0.90515
255,-0.9040100000000001
256,-0.89146
257,-0.89892
258,-0.89597
259,-0.88125
260,-0.8847700000000001
261,-0.8824
262,-0.8698899999999999
263,-0.87345
264,-0.8721
265,-0.85675
266,-0.85115
267,-0.8421299999999999
268,-0.8207899999999999
269,-0.81028
270,-0.80283
271,-0.78451
272,-0.77347
273,-0.7669600000000001
274,-0.7491899999999999
275,-0.73717
276,-0.7346
277,-0.72208
278,-0.71211
279,-0.71307
280,-0.7028399999999999
281,-0.69172
282,-0.69438
283,-0.68581
284,-0.67272
285,-0.6752600000000001
286,-0.6663399999999999
287,-0.65041
288,-0.65355
289,-0.64568
290,-0.62721
291,-0.6291800000000001
292,-0.61941
293,-0.5976199999999999
294,-0.5965
295,-0.58635
296,-0.56429
297,-0.55992
298,-0.54876
299,-0.52498
300,-0.51595
301,-0.50315
302,-0.47765
303,-0.46407
304,-0.44965
305,-0.42253
306,-0.40464
307,-0.38916
308,-0.36103
309,-0.33907
310,-0.32234
311,-0.29289
312,-0.26671
313,-0.24896
314,-0.21869
315,-0.18853
316,-0.16927999999999999
317,-0.13699
318,-0.10124
319,-0.079183
320,-0.044645
321,-0.0044575000000000005
322,0.018101
323,0.05185700000000001
324,0.09337000000000001
325,0.11377999999999999
326,0.14454
327,0.18544000000000002
328,0.20199999999999999
329,0.22821999999999998
330,0.26539
331,0.28044
332,0.30366
333,0.33907
334,0.35591999999999996
335,0.37797
336,0.41195
337,0.42991999999999997
338,0.4502
339,0.48325
340,0.5041800000000001
341,0.52473
342,0.55771
343,0.5808300000000001
344,0.6000300000000001
345,0.63193
346,0.65763
347,0.67655
348,0.70738
349,0.7337199999999999
350,0.74907
351,0.77594
352,0.80176
353,0.81382
354,0.8368
355,0.86103
356,0.8685299999999999
357,0.88825
358,0.91445
359,0.92219
360,0.9407399999999999
361,0.9653799999999999
362,0.96521
363,0.9743299999999999
364,0.99444
365,0.9908
366,0.9994200000000001
367,1.0201
368,1.0183
369,1.0237
370,1.0401
371,1.0376
372,1.0404
373,1.055
374,1.0528
375,1.0515
376,1.0609
377,1.0562
378,1.0494
379,1.0538
380,1.047
381,1.0343
382,1.0322
383,1.0213
384,1.0017
385,0.99323
386,0.9796799999999999
387,0.9544100000000001
388,0.93985
389,0.92301
390,0.89159
391,0.87174
392,0.8537600000000001
393,0.8185399999999999
394,0.79419
395,0.77396
396,0.73356
397,0.70558
398,0.6874399999999999
399,0.6480899999999999
400,0.6208199999999999
401,0.60412
402,0.56311
403,0.53455
404,0.52076
405,0.48999
406,0.47089
407,0.46512
408,0.44072
409,0.4206
410,0.41253
411,0.39044
412,0.37255
413,0.36869
414,0.35320999999999997
415,0.33644
416,0.33147
417,0.31686
418,0.29808
419,0.29189
420,0.27945
421,0.25932
422,0.25111999999999995
423,0.23929
424,0.21650999999999998
425,0.20572
426,0.19467
427,0.17
428,0.1578
429,0.14914000000000002
430,0.12435999999999998
431,0.11199
432,0.10611
433,0.081073
434,0.06842100000000001
435,0.06579700000000001
436,0.041629
437,0.029653
438,0.029410000000000002
439,0.0068495000000000006
440,-0.004688800000000001
441,-0.0035521
442,-0.021308
443,-0.030858999999999998
444,-0.027844
445,-0.041462
446,-0.050223000000000004
447,-0.045928
448,-0.054779999999999995
449,-0.06163099999999999
450,-0.055629
451,-0.060435
452,-0.066692
453,-0.059551
454,-0.059132000000000004
455,-0.062439
456,-0.05229299999999999
457,-0.046587
458,-0.048785
459,-0.038147
460,-0.028636
461,-0.029517
462,-0.017315
463,-0.0033404000000000003
464,-0.0033336
465,0.0092795
466,0.027126
467,0.029002999999999998
468,0.044343
469,0.068624
470,0.073951
471,0.091794
472,0.12074000000000001
473,0.12724000000000002
474,0.14559
475,0.17640999999999998
476,0.1855
477,0.20459000000000002
478,0.2364
479,0.24908000000000002
480,0.26825
481,0.29980999999999997
482,0.31463
483,0.33221999999999996
484,0.36178
485,0.37716
486,0.39184
487,0.41846000000000005
488,0.43406999999999996
489,0.44605
490,0.47031999999999996
491,0.48715
492,0.4978
493,0.52144
494,0.54151
495,0.55285
496,0.57744
497,0.6017600000000001
498,0.61424
499,0.63995
500,0.66879
501,0.68303
502,0.71055
503,0.74438
504,0.76026
505,0.78864
506,0.8257700000000001
507,0.84114
508,0.86792
509,0.90575
510,0.91817
511,0.9411700000000001
512,0.9758700000000001
513,0.9871200000000001
514,1.0069
515,1.0394
516,1.052
517,1.0702
518,1.1013
519,1.1153
520,1.1317
521,1.1613
522,1.1777
523,1.194
524,1.2243
525,1.2451
526,1.2626
527,1.2942
528,1.3195
529,1.3379
530,1.3699
531,1.3981
532,1.4157
533,1.4464
534,1.4769
535,1.494
536,1.5249
537,1.5594
538,1.5772
539,1.608
540,1.6448
541,1.6608
542,1.6889
543,1.726
544,1.7393
545,1.7644
546,1.8016
547,1.8116
548,1.8326
549,1.8658
550,1.8751
551,1.8925
552,1.9224
553,1.9317
554,1.9454
555,1.9715
556,1.9798
557,1.9895
558,2.0124
559,2.0217
560,2.0299
561,2.0516
562,2.0628
563,2.0688
564,2.0875
565,2.0983
566,2.1002
567,2.1147
568,2.1247
569,2.1225
570,2.1325
571,2.1409
572,2.1331
573,2.1372
574,2.1428
575,2.129
576,2.127
577,2.1301
578,2.1107
579,2.1031
580,2.1043
581,2.0805
582,2.0687
583,2.069
584,2.0426
585,2.0279
586,2.0259
587,2.0008
588,1.9846
589,1.9817
590,1.9593
591,1.9427
592,1.9399
593,1.9211
594,1.9049
595,1.9028
596,1.8879
597,1.8719999999999999
598,1.8701
599,1.8586
600,1.8425
601,1.8405
602,1.8323
603,1.8164
604,1.8147
605,1.8102
606,1.7942
607,1.7917
608,1.7890000000000001
609,1.771
610,1.7662
611,1.7643
612,1.744
613,1.7365
614,1.7352
615,1.712
616,1.7011
617,1.6995
618,1.6727
619,1.6577
620,1.6541
621,1.6247
622,1.6059999999999999
623,1.5993
624,1.5703
625,1.5489
626,1.5398
627,1.5115
628,1.4878
629,1.4771
630,1.4512
631,1.4273
632,1.4168
633,1.3943
634,1.3705
635,1.3603
636,1.3417
637,1.3188
638,1.31
639,1.2957
640,1.2732
641,1.2638
642,1.2513
643,1.2268
644,1.2147
645,1.2025
646,1.1744
647,1.1582
648,1.1447
649,1.112
650,1.091
651,1.0763
652,1.0398
653,1.0155
654,1.0015
655,0.96321
656,0.9374899999999999
657,0.92391
658,0.88731
659,0.8619100000000001
660,0.8495299999999999
661,0.8173699999999999
662,0.7931699999999999
663,0.78218
664,0.75489
665,0.73351
666,0.7269100000000001
667,0.7076399999999999
668,0.69005
669,0.68518
670,0.66884
671,0.65075
672,0.64732
673,0.6380899999999999
674,0.62497
675,0.62513
676,0.61971
677,0.60483
678,0.60314
679,0.6009
680,0.58759
681,0.58654
682,0.58468
683,0.5646100000000001
684,0.5548
685,0.54903
686,0.52623
687,0.5176
688,0.5181100000000001
689,0.49817
690,0.49056000000000005
691,0.49423
692,0.47513999999999995
693,0.46942
694,0.47686000000000006
695,0.46313999999999994
696,0.45906
697,0.46685
698,0.45553
699,0.45071000000000006
700,0.45836000000000005
701,0.44993999999999995
702,0.44422
703,0.44974
704,0.44082
705,0.43094
706,0.43282
707,0.42426
708,0.41242
709,0.4124
710,0.4044
711,0.38947
712,0.38664
713,0.38005
714,0.36486999999999997
715,0.3626
716,0.35936
717,0.34333
718,0.33905
719,0.33682
720,0.31978
721,0.31537
722,0.31548000000000004
723,0.29469
724,0.2813
725,0.27103
726,0.23609000000000002
727,0.21235
728,0.20237
729,0.17259000000000002
730,0.15769
731,0.15567999999999999
732,0.13205999999999998
733,0.11599999999999999
734,0.11187000000000001
735,0.091421
736,0.079709
737,0.083389
738,0.074452
739,0.06982999999999999
740,0.07854900000000001
741,0.075831
742,0.073214
743,0.082997
744,0.083143
745,0.079162
746,0.08685599999999999
747,0.087813
748,0.081913
749,0.08789
750,0.090127
751,0.082513
752,0.08692799999999999
753,0.091012
754,0.08258099999999999
755,0.085958
756,0.09160399999999999
757,0.081604
758,0.083342
759,0.090418
760,0.07855
761,0.07685399999999999
762,0.081764
763,0.06409
764,0.056696
765,0.059386
766,0.038404
767,0.025593
768,0.020205
769,-0.0089634
770,-0.033335000000000004
771,-0.047307999999999996
772,-0.0774
773,-0.10092999999999999
774,-0.11180999999999999
775,-0.13715
776,-0.16186
777,-0.1765
778,-0.20357
779,-0.23159000000000002
780,-0.24695999999999999
781,-0.26976999999999995
782,-0.29555
783,-0.30891
784,-0.32765
785,-0.35291
786,-0.36574
787,-0.38061
788,-0.40460999999999997
789,-0.41635
790,-0.42785
791,-0.45205
792,-0.46437
793,-0.47331000000000006
794,-0.49738000000000004
795,-0.50936
796,-0.51489
797,-0.53818
798,-0.5491199999999999
799,-0.55018
800,-0.57155
801,-0.58148
802,-0.58098
803,-0.60245
804,-0.6139100000000001
805,-0.6137199999999999
806,-0.63154
807,-0.64181
808,-0.6412100000000001
809,-0.65775
810,-0.67103
811,-0.6732199999999999
812,-0.6883
813,-0.70115
814,-0.70155
815,-0.71177
816,-0.72296
817,-0.72178
818,-0.72729
819,-0.7363
820,-0.73297
821,-0.7340899999999999
822,-0.74249
823,-0.73934
824,-0.7383
825,-0.7478899999999999
826,-0.7466
827,-0.74495
828,-0.75646
829,-0.7561399999999999
830,-0.75136
831,-0.76217
832,-0.76266
833,-0.75842
834,-0.77476
835,-0.7815
836,-0.77892
837,-0.7964
838,-0.80188
839,-0.79593
840,-0.8106
841,-0.81695
842,-0.81292
843,-0.82678
844,-0.8337399999999999
845,-0.8283799999999999
846,-0.83701
847,-0.84135
848,-0.8338200000000001
849,-0.8385299999999999
850,-0.84265
851,-0.83524
852,-0.8373200000000001
853,-0.8414200000000001
854,-0.8336100000000001
855,-0.8323200000000001
856,-0.83609
857,-0.82852
858,-0.8255399999999999
859,-0.8314799999999999
860,-0.8266600000000001
861,-0.82326
862,-0.83019
863,-0.8242200000000001
864,-0.8145899999999999
865,-0.81699
866,-0.8071699999999999
867,-0.79293
868,-0.79624
869,-0.78966
870,-0.7764800000000001
871,-0.78286
872,-0.7782100000000001
873,-0.76298
874,-0.76953
875,-0.76552
876,-0.7504
877,-0.75542
878,-0.75165
879,-0.73558
880,-0.7361800000000001
881,-0.73021
882,-0.71133
883,-0.70634
884,-0.69827
885,-0.67802
886,-0.66897
887,-0.65876
888,-0.63472
889,-0.6186
890,-0.60636
891,-0.58402
892,-0.5686899999999999
893,-0.5573100000000001
894,-0.5284300000000001
895,-0.49646
896,-0.47048
897,-0.43425
898,-0.40254
899,-0.38574
900,-0.35608
901,-0.3202
902,-0.29794
903,-0.26764
904,-0.23740999999999998
905,-0.22643000000000002
906,-0.19621
907,-0.14182999999999998
908,-0.093907
909,-0.032688999999999996
910,0.026693
911,0.039682999999999996
912,0.041913
913,0.045694
914,0.031311
915,0.033019
916,0.052762
917,0.054545
918,0.056662
919,0.067991
920,0.067156
921,0.07587999999999999
922,0.10613
923,0.13109
924,0.1566
925,0.19247
926,0.21616999999999997
927,0.23305
928,0.26185
929,0.28636999999999996
930,0.30596999999999996
931,0.33996
932,0.37195
933,0.39268000000000003
934,0.42363
935,0.45265
936,0.46643
937,0.49108999999999997
938,0.5183399999999999
939,0.52863
940,0.55037
941,0.57827
942,0.58703
943,0.60797
944,0.63877
945,0.6477
946,0.6681699999999999
947,0.70038
948,0.7087100000000001
949,0.72751
950,0.75852
951,0.7691899999999999
952,0.78819
953,0.8201700000000001
954,0.83444
955,0.85244
956,0.8811399999999999
957,0.8928
958,0.9038700000000001
959,0.9259299999999999
960,0.9351299999999999
961,0.94175
962,0.9595299999999999
963,0.9664799999999999
964,0.96619
965,0.9758399999999999
966,0.9776
967,0.97025
968,0.9748399999999999
969,0.9767600000000001
970,0.96804
971,0.97165
972,0.9749700000000001
973,0.9631299999999999
974,0.96186
975,0.9623
976,0.94466
977,0.93871
978,0.9394299999999999
979,0.9208200000000001
980,0.9144899999999999
981,0.91743
982,0.89691
983,0.8872399999999999
984,0.88825
985,0.86546
986,0.8527399999999999
987,0.8507600000000001
988,0.82609
989,0.80552
990,0.79299
991,0.75938
992,0.72847
993,0.71005
994,0.6785800000000001
995,0.6503899999999999
996,0.63567
997,0.6091
998,0.5798399999999999
999,0.5623
1000,0.5361
1001,0.5059100000000001
1002,0.48983000000000004
1003,0.46979
1004,0.44297
1005,0.42967
1006,0.41468999999999995
1007,0.38924000000000003
1008,0.37714000000000003
1009,0.36663
1010,0.34274
1011,0.33209
1012,0.32604
1013,0.30356
1014,0.2942
1015,0.29249
1016,0.27111999999999997
1017,0.26205
1018,0.26295
1019,0.24104
1020,0.23143000000000002
1021,0.23394
1022,0.21493
1023,0.20655
1024,0.21039000000000002
1025,0.19542
1026,0.18841
1027,0.19447
1028,0.18478
1029,0.17883
1030,0.18373
1031,0.17336
1032,0.16257
1033,0.16365
1034,0.1545
1035,0.14322000000000001
1036,0.14307
1037,0.13287000000000002
1038,0.11423
1039,0.10513
1040,0.090048
1041,0.066622
1042,0.056147
1043,0.044828
1044,0.022318
1045,0.01141
1046,0.0011417999999999999
1047,-0.024073
1048,-0.037406
1049,-0.045688
1050,-0.07004500000000001
1051,-0.081336
1052,-0.084373
1053,-0.10754000000000001
1054,-0.12004000000000001
1055,-0.12339000000000001
1056,-0.15036
1057,-0.16576
1058,-0.16864
1059,-0.19105999999999998
1060,-0.20319
1061,-0.20331
1062,-0.20606999999999998
1063,-0.20693000000000003
1064,-0.22714
1065,-0.27597
1066,-0.30304000000000003
1067,-0.27855
1068,-0.22708000000000003
1069,-0.19355999999999998
1070,-0.2359
1071,-0.35148
1072,-0.42663999999999996
1073,-0.36175999999999997
1074,-0.19205
1075,-0.065224
1076,-0.13608
1077,-0.39791
1078,-0.60841
1079,-0.50449
1080,-0.10197
1081,0.26047
1082,0.17912
1083,-0.41353999999999996
1084,-1.0331
1085,-0.9719200000000001
1086,0.0026087
1087,1.2368
1088,1.4512
1089,-0.43553000000000003
1090,-4.4153
1091,-9.2054
