time,value
0,-0.2497
1,-0.2497
2,-0.2497
3,-0.2497
4,-0.2497
5,-0.2497
6,-0.2497
7,-0.2497
8,-0.2497
9,-0.2497
10,-0.2497
11,-0.2497
12,-0.2497
13,-0.2497
14,-0.2497
15,-0.2497
16,-0.2497
17,-0.2497
18,-0.2497
19,-0.2497
20,-0.2497
21,-0.2497
22,-0.2497
23,-0.2497
24,-0.2497
25,-0.2497
26,-0.2497
27,-0.2497
28,-0.2497
29,-0.2497
30,-0.2497
31,-0.2497
32,-0.2497
33,-0.2497
34,-0.2497
35,-0.2497
36,-0.2497
37,-0.2497
38,-0.2497
39,-0.2497
40,-0.2497
41,-0.2497
42,-0.2497
43,-0.2497
44,-0.2497
45,-0.2497
46,-0.2497
47,-0.05669400000000001
48,3.1343
49,1.1785
50,-0.018094
51,-0.030961000000000002
52,1.0241
53,5.3345
54,-0.2497
55,-0.2497
56,-0.2497
57,-0.2497
58,-0.2497
59,-0.2497
60,-0.2497
61,-0.2497
62,-0.2497
63,-0.2497
64,-0.2497
65,-0.2497
66,-0.2497
67,-0.2497
68,-0.2497
69,-0.2497
70,-0.2497
71,-0.2497
72,-0.2497
73,-0.2497
74,-0.2497
75,-0.2497
76,-0.2497
77,-0.2497
78,-0.2497
79,-0.2497
80,-0.2497
81,-0.2497
82,-0.2497
83,-0.2497
84,-0.2497
85,-0.19823
86,-0.030961000000000002
87,4.125
88,-0.030961000000000002
89,-0.018094
90,-0.030961000000000002
91,5.669
92,0.17490999999999998
93,-0.2497
94,-0.2497
95,-0.2497
