time,value
0,-0.82285
1,1.2026
2,-0.82285
3,1.2026
4,-0.82285
5,1.2026
6,-0.82285
7,-0.82285
8,1.2026
9,-0.82285
10,1.2026
11,-0.82285
12,1.2026
13,-0.82285
14,-0.82285
15,1.2026
16,-0.82285
17,1.2026
18,-0.82285
19,-0.82285
20,1.2026
21,-0.82285
22,1.2026
23,-0.82285
24,-0.82285
25,1.2026
26,-0.82285
27,1.2026
28,-0.82285
29,-0.82285
30,1.2026
31,-0.82285
32,1.2026
33,-0.82285
34,1.2026
35,-0.82285
36,-0.82285
37,1.2026
38,-0.82285
39,1.2026
40,-0.82285
41,1.2026
42,-0.82285
43,-0.82285
44,1.2026
45,-0.82285
46,1.2026
47,-0.82285
48,-0.82285
49,1.2026
50,-0.82285
51,-0.82285
52,1.2026
53,-0.82285
54,1.2026
55,-0.82285
56,-0.82285
57,1.2026
58,-0.82285
59,-0.82285
60,1.2026
61,-0.82285
62,1.2026
63,-0.82285
64,-0.82285
65,1.2026
66,-0.82285
67,1.2026
68,-0.82285
69,-0.82285
70,1.2026
71,-0.82285
72,1.2026
73,-0.82285
74,1.2026
75,-0.82285
76,-0.82285
77,1.2026
78,-0.82285
79,1.2026
80,-0.82285
81,1.2026
82,-0.82285
83,-0.82285
84,1.2026
85,-0.82285
86,1.2026
87,-0.82285
88,-0.82285
89,1.2026
90,-0.82285
91,-0.82285
92,1.2026
93,-0.82285
94,1.2026
95,-0.82285
