{
  "about": {
    "datasetID": "299_libras_move_dataset_SCORE",
    "datasetName": "libras_move",
    "description": "**Author**: Daniel Baptista Dias, Sarajane Marques Peres, Helton Hideraldo Biscaro  \nUniversity of Sao Paulo, School of Art, Sciences and Humanities, Sao Paulo, SP, Brazil  \n**Source**: Unknown - November 2008  \n**Please cite**:   \n\n### LIBRAS Movement Database\nLIBRAS, acronym of the Portuguese name \"LIngua BRAsileira de Sinais\", is the official brazilian sign language. The dataset (movement_libras) contains 15 classes of 24 instances each, where each class references to a hand movement type in LIBRAS. The hand movement is represented as a bidimensional curve performed by the hand in a period of time. The curves were obtained from videos of hand movements, with the Libras performance from 4 different people, during 2 sessions. Each video corresponds to only one hand movement and has about $7$ seconds. Each video corresponds to a function F in a functions space which is the continual version of the input dataset. In the video pre-processing, a time normalization is carried out selecting 45 frames from each video, in according to an uniform distribution. In each frame, the centroid pixels of the segmented objects (the hand) are found, which compose the discrete version of the curve F with 45 points. All curves are normalized in the unitary space.\nIn order to prepare these movements to be analysed by algorithms, we have carried out a mapping operation, that is, each curve F is mapped in a representation with 90 features, with representing the coordinates of movement. \nEach instance represents 45 points on a bi-dimensional space, which can be plotted in an ordered way (from 1 through 45 as the X coordinate) in order to draw the path of the movement.",
    "citation": "\n\t\t\t\t@article{OpenML2013,\n\t\t\t\tauthor = {Vanschoren, Joaquin and van Rijn, Jan N. and Bischl, Bernd and Torgo, Luis},\n\t\t\t\ttitle = {OpenML: Networked Science in Machine Learning},\n\t\t\t\tjournal = {SIGKDD Explorations},\n\t\t\t\tvolume = {15},\n\t\t\t\tnumber = {2},\n\t\t\t\tyear = {2013},\n\t\t\t\tpages = {49--60},\n\t\t\t\turl = {http://doi.acm.org/10.1145/2641190.2641198},\n\t\t\t\tdoi = {10.1145/2641190.2641198},\n\t\t\t\tpublisher = {ACM},\n\t\t\t\taddress = {New York, NY, USA},\n\t\t\t\t}",
    "license": "CC-BY license",
    "source": "OpenML",
    "sourceURI": "http://www.openml.org/d/299",
    "approximateSize": "",
    "datasetVersion": "4.0.0",
    "datasetSchemaVersion": "4.0.0",
    "redacted": false,
    "digest": "ae77c8af0a84667ff40808c08cb65ea9d428fcf951e2a04babfea2084e6c5f4e"
  },
  "dataResources": [
    {
      "resID": "learningData",
      "resPath": "tables/learningData.csv",
      "resType": "table",
      "resFormat": {
        "text/csv": [
          "csv"
        ]
      },
      "isCollection": false,
      "columns": [
        {
          "colIndex": 0,
          "colName": "d3mIndex",
          "colType": "integer",
          "role": [
            "index"
          ]
        },
        {
          "colIndex": 1,
          "colName": "xcoord1",
          "colType": "real",
          "role": [
            "attribute"
          ]
        },
        {
          "colIndex": 2,
          "colName": "ycoord1",
          "colType": "real",
          "role": [
            "attribute"
          ]
        },
        {
          "colIndex": 3,
          "colName": "xcoord2",
          "colType": "real",
          "role": [
            "attribute"
          ]
        },
        {
          "colIndex": 4,
          "colName": "ycoord2",
          "colType": "real",
          "role": [
            "attribute"
          ]
        },
        {
          "colIndex": 5,
          "colName": "xcoord3",
          "colType": "real",
          "role": [
            "attribute"
          ]
        },
        {
          "colIndex": 6,
          "colName": "ycoord3",
          "colType": "real",
          "role": [
            "attribute"
          ]
        },
        {
          "colIndex": 7,
          "colName": "xcoord4",
          "colType": "real",
          "role": [
            "attribute"
          ]
        },
        {
          "colIndex": 8,
          "colName": "ycoord4",
          "colType": "real",
          "role": [
            "attribute"
          ]
        },
        {
          "colIndex": 9,
          "colName": "xcoord5",
          "colType": "real",
          "role": [
            "attribute"
          ]
        },
        {
          "colIndex": 10,
          "colName": "ycoord5",
          "colType": "real",
          "role": [
            "attribute"
          ]
        },
        {
          "colIndex": 11,
          "colName": "xcoord6",
          "colType": "real",
          "role": [
            "attribute"
          ]
        },
        {
          "colIndex": 12,
          "colName": "ycoord6",
          "colType": "real",
          "role": [
            "attribute"
          ]
        },
        {
          "colIndex": 13,
          "colName": "xcoord7",
          "colType": "real",
          "role": [
            "attribute"
          ]
        },
        {
          "colIndex": 14,
          "colName": "ycoord7",
          "colType": "real",
          "role": [
            "attribute"
          ]
        },
        {
          "colIndex": 15,
          "colName": "xcoord8",
          "colType": "real",
          "role": [
            "attribute"
          ]
        },
        {
          "colIndex": 16,
          "colName": "ycoord8",
          "colType": "real",
          "role": [
            "attribute"
          ]
        },
        {
          "colIndex": 17,
          "colName": "xcoord9",
          "colType": "real",
          "role": [
            "attribute"
          ]
        },
        {
          "colIndex": 18,
          "colName": "ycoord9",
          "colType": "real",
          "role": [
            "attribute"
          ]
        },
        {
          "colIndex": 19,
          "colName": "xcoord10",
          "colType": "real",
          "role": [
            "attribute"
          ]
        },
        {
          "colIndex": 20,
          "colName": "ycoord10",
          "colType": "real",
          "role": [
            "attribute"
          ]
        },
        {
          "colIndex": 21,
          "colName": "xcoord11",
          "colType": "real",
          "role": [
            "attribute"
          ]
        },
        {
          "colIndex": 22,
          "colName": "ycoord11",
          "colType": "real",
          "role": [
            "attribute"
          ]
        },
        {
          "colIndex": 23,
          "colName": "xcoord12",
          "colType": "real",
          "role": [
            "attribute"
          ]
        },
        {
          "colIndex": 24,
          "colName": "ycoord12",
          "colType": "real",
          "role": [
            "attribute"
          ]
        },
        {
          "colIndex": 25,
          "colName": "xcoord13",
          "colType": "real",
          "role": [
            "attribute"
          ]
        },
        {
          "colIndex": 26,
          "colName": "ycoord13",
          "colType": "real",
          "role": [
            "attribute"
          ]
        },
        {
          "colIndex": 27,
          "colName": "xcoord14",
          "colType": "real",
          "role": [
            "attribute"
          ]
        },
        {
          "colIndex": 28,
          "colName": "ycoord14",
          "colType": "real",
          "role": [
            "attribute"
          ]
        },
        {
          "colIndex": 29,
          "colName": "xcoord15",
          "colType": "real",
          "role": [
            "attribute"
          ]
        },
        {
          "colIndex": 30,
          "colName": "ycoord15",
          "colType": "real",
          "role": [
            "attribute"
          ]
        },
        {
          "colIndex": 31,
          "colName": "xcoord16",
          "colType": "real",
          "role": [
            "attribute"
          ]
        },
        {
          "colIndex": 32,
          "colName": "ycoord16",
          "colType": "real",
          "role": [
            "attribute"
          ]
        },
        {
          "colIndex": 33,
          "colName": "xcoord17",
          "colType": "real",
          "role": [
            "attribute"
          ]
        },
        {
          "colIndex": 34,
          "colName": "ycoord17",
          "colType": "real",
          "role": [
            "attribute"
          ]
        },
        {
          "colIndex": 35,
          "colName": "xcoord18",
          "colType": "real",
          "role": [
            "attribute"
          ]
        },
        {
          "colIndex": 36,
          "colName": "ycoord18",
          "colType": "real",
          "role": [
            "attribute"
          ]
        },
        {
          "colIndex": 37,
          "colName": "xcoord19",
          "colType": "real",
          "role": [
            "attribute"
          ]
        },
        {
          "colIndex": 38,
          "colName": "ycoord19",
          "colType": "real",
          "role": [
            "attribute"
          ]
        },
        {
          "colIndex": 39,
          "colName": "xcoord20",
          "colType": "real",
          "role": [
            "attribute"
          ]
        },
        {
          "colIndex": 40,
          "colName": "ycoord20",
          "colType": "real",
          "role": [
            "attribute"
          ]
        },
        {
          "colIndex": 41,
          "colName": "xcoord21",
          "colType": "real",
          "role": [
            "attribute"
          ]
        },
        {
          "colIndex": 42,
          "colName": "ycoord21",
          "colType": "real",
          "role": [
            "attribute"
          ]
        },
        {
          "colIndex": 43,
          "colName": "xcoord22",
          "colType": "real",
          "role": [
            "attribute"
          ]
        },
        {
          "colIndex": 44,
          "colName": "ycoord22",
          "colType": "real",
          "role": [
            "attribute"
          ]
        },
        {
          "colIndex": 45,
          "colName": "xcoord23",
          "colType": "real",
          "role": [
            "attribute"
          ]
        },
        {
          "colIndex": 46,
          "colName": "ycoord23",
          "colType": "real",
          "role": [
            "attribute"
          ]
        },
        {
          "colIndex": 47,
          "colName": "xcoord24",
          "colType": "real",
          "role": [
            "attribute"
          ]
        },
        {
          "colIndex": 48,
          "colName": "ycoord24",
          "colType": "real",
          "role": [
            "attribute"
          ]
        },
        {
          "colIndex": 49,
          "colName": "xcoord25",
          "colType": "real",
          "role": [
            "attribute"
          ]
        },
        {
          "colIndex": 50,
          "colName": "ycoord25",
          "colType": "real",
          "role": [
            "attribute"
          ]
        },
        {
          "colIndex": 51,
          "colName": "xcoord26",
          "colType": "real",
          "role": [
            "attribute"
          ]
        },
        {
          "colIndex": 52,
          "colName": "ycoord26",
          "colType": "real",
          "role": [
            "attribute"
          ]
        },
        {
          "colIndex": 53,
          "colName": "xcoord27",
          "colType": "real",
          "role": [
            "attribute"
          ]
        },
        {
          "colIndex": 54,
          "colName": "ycoord27",
          "colType": "real",
          "role": [
            "attribute"
          ]
        },
        {
          "colIndex": 55,
          "colName": "xcoord28",
          "colType": "real",
          "role": [
            "attribute"
          ]
        },
        {
          "colIndex": 56,
          "colName": "ycoord28",
          "colType": "real",
          "role": [
            "attribute"
          ]
        },
        {
          "colIndex": 57,
          "colName": "xcoord29",
          "colType": "real",
          "role": [
            "attribute"
          ]
        },
        {
          "colIndex": 58,
          "colName": "ycoord29",
          "colType": "real",
          "role": [
            "attribute"
          ]
        },
        {
          "colIndex": 59,
          "colName": "xcoord30",
          "colType": "real",
          "role": [
            "attribute"
          ]
        },
        {
          "colIndex": 60,
          "colName": "ycoord30",
          "colType": "real",
          "role": [
            "attribute"
          ]
        },
        {
          "colIndex": 61,
          "colName": "xcoord31",
          "colType": "real",
          "role": [
            "attribute"
          ]
        },
        {
          "colIndex": 62,
          "colName": "ycoord31",
          "colType": "real",
          "role": [
            "attribute"
          ]
        },
        {
          "colIndex": 63,
          "colName": "xcoord32",
          "colType": "real",
          "role": [
            "attribute"
          ]
        },
        {
          "colIndex": 64,
          "colName": "ycoord32",
          "colType": "real",
          "role": [
            "attribute"
          ]
        },
        {
          "colIndex": 65,
          "colName": "xcoord33",
          "colType": "real",
          "role": [
            "attribute"
          ]
        },
        {
          "colIndex": 66,
          "colName": "ycoord33",
          "colType": "real",
          "role": [
            "attribute"
          ]
        },
        {
          "colIndex": 67,
          "colName": "xcoord34",
          "colType": "real",
          "role": [
            "attribute"
          ]
        },
        {
          "colIndex": 68,
          "colName": "ycoord34",
          "colType": "real",
          "role": [
            "attribute"
          ]
        },
        {
          "colIndex": 69,
          "colName": "xcoord35",
          "colType": "real",
          "role": [
            "attribute"
          ]
        },
        {
          "colIndex": 70,
          "colName": "ycoord35",
          "colType": "real",
          "role": [
            "attribute"
          ]
        },
        {
          "colIndex": 71,
          "colName": "xcoord36",
          "colType": "real",
          "role": [
            "attribute"
          ]
        },
        {
          "colIndex": 72,
          "colName": "ycoord36",
          "colType": "real",
          "role": [
            "attribute"
          ]
        },
        {
          "colIndex": 73,
          "colName": "xcoord37",
          "colType": "real",
          "role": [
            "attribute"
          ]
        },
        {
          "colIndex": 74,
          "colName": "ycoord37",
          "colType": "real",
          "role": [
            "attribute"
          ]
        },
        {
          "colIndex": 75,
          "colName": "xcoord38",
          "colType": "real",
          "role": [
            "attribute"
          ]
        },
        {
          "colIndex": 76,
          "colName": "ycoord38",
          "colType": "real",
          "role": [
            "attribute"
          ]
        },
        {
          "colIndex": 77,
          "colName": "xcoord39",
          "colType": "real",
          "role": [
            "attribute"
          ]
        },
        {
          "colIndex": 78,
          "colName": "ycoord39",
          "colType": "real",
          "role": [
            "attribute"
          ]
        },
        {
          "colIndex": 79,
          "colName": "xcoord40",
          "colType": "real",
          "role": [
            "attribute"
          ]
        },
        {
          "colIndex": 80,
          "colName": "ycoord40",
          "colType": "real",
          "role": [
            "attribute"
          ]
        },
        {
          "colIndex": 81,
          "colName": "xcoord41",
          "colType": "real",
          "role": [
            "attribute"
          ]
        },
        {
          "colIndex": 82,
          "colName": "ycoord41",
          "colType": "real",
          "role": [
            "attribute"
          ]
        },
        {
          "colIndex": 83,
          "colName": "xcoord42",
          "colType": "real",
          "role": [
            "attribute"
          ]
        },
        {
          "colIndex": 84,
          "colName": "ycoord42",
          "colType": "real",
          "role": [
            "attribute"
          ]
        },
        {
          "colIndex": 85,
          "colName": "xcoord43",
          "colType": "real",
          "role": [
            "attribute"
          ]
        },
        {
          "colIndex": 86,
          "colName": "ycoord43",
          "colType": "real",
          "role": [
            "attribute"
          ]
        },
        {
          "colIndex": 87,
          "colName": "xcoord44",
          "colType": "real",
          "role": [
            "attribute"
          ]
        },
        {
          "colIndex": 88,
          "colName": "ycoord44",
          "colType": "real",
          "role": [
            "attribute"
          ]
        },
        {
          "colIndex": 89,
          "colName": "xcoord45",
          "colType": "real",
          "role": [
            "attribute"
          ]
        },
        {
          "colIndex": 90,
          "colName": "ycoord45",
          "colType": "real",
          "role": [
            "attribute"
          ]
        },
        {
          "colIndex": 91,
          "colName": "class",
          "colType": "categorical",
          "role": [
            "suggestedTarget"
          ]
        }
      ],
      "columnsCount": 92
    }
  ]
}