time,value
0,-1.0242
1,0.38971999999999996
2,-0.58912
3,-1.0242
4,0.49848000000000003
5,-0.69787
6,1.151
7,1.9124
8,-0.26284
9,-1.0242
10,0.1722
11,-0.3716
12,-1.0242
13,0.063443
14,-0.26284
15,0.38971999999999996
16,1.9124
17,0.60724
18,-1.0242
19,-0.69787
20,0.49848000000000003
21,-1.0242
22,-1.0242
23,0.716
24,-1.0242
25,1.3686
26,1.9124
27,-0.3716
28,-1.0242
29,-0.48036
30,0.1722
31,-1.0242
32,-0.3716
33,0.1722
34,1.8036
35,1.0423
36,-1.0242
37,-0.69787
38,0.38971999999999996
39,-1.0242
40,-1.0242
41,0.716
42,-0.48036
43,1.9124
44,0.063443
45,-1.0242
46,0.716
47,-1.0242
48,-1.0242
49,0.60724
50,0.28096
51,1.9124
52,-0.3716
53,-1.0242
54,0.28096
55,-0.58912
56,-1.0242
57,0.1722
58,-0.48036
59,1.5861
60,1.6948
61,-0.58912
62,-1.0242
63,-0.8066300000000001
64,0.49848000000000003
65,-1.0242
66,-0.15408
67,-0.045317
68,-1.0242
69,1.5861
70,1.8036
71,-0.8066300000000001
72,-1.0242
73,-0.045317
74,-0.15408
75,-1.0242
76,0.82476
77,0.1722
78,2.0211
79,-0.15408
80,-1.0242
81,0.716
82,-1.0242
83,-1.0242
84,0.716
85,-0.48036
86,2.0211
87,1.4773
88,-1.0242
89,-1.0242
90,0.82476
91,-1.0242
92,-1.0242
93,0.60724
94,0.28096
95,2.0211
