time,value
0,1.8542
1,1.8359
2,1.8094
3,1.7778
4,1.7466
5,1.7127
6,1.6812
7,1.6485
8,1.6183
9,1.5857
10,1.5533
11,1.5156
12,1.4837
13,1.4463
14,1.409
15,1.3719
16,1.3348
17,1.2978
18,1.261
19,1.2242
20,1.1877
21,1.1513
22,1.1152
23,1.0791
24,1.0433
25,1.0073
26,0.97152
27,0.9358200000000001
28,0.9
29,0.86388
30,0.82814
31,0.79275
32,0.7570899999999999
33,0.7217100000000001
34,0.68615
35,0.6507
36,0.61562
37,0.58016
38,0.5456300000000001
39,0.51035
40,0.47533000000000003
41,0.44064
42,0.40553
43,0.37116
44,0.33695
45,0.30354000000000003
46,0.26761999999999997
47,0.23315
48,0.19884000000000002
49,0.16468
50,0.13034
51,0.096014
52,0.061614
53,0.027076999999999997
54,-0.0065078
55,-0.041253
56,-0.074277
57,-0.10901
58,-0.14261
59,-0.17705
60,-0.21135
61,-0.24549
62,-0.27948
63,-0.31329
64,-0.34691
65,-0.38147
66,-0.41357
67,-0.44658000000000003
68,-0.47936000000000006
69,-0.51203
70,-0.5454899999999999
71,-0.57791
72,-0.60921
73,-0.6406
74,-0.6701600000000001
75,-0.7008
76,-0.72946
77,-0.7543300000000001
78,-0.77205
79,-0.78393
80,-0.79511
81,-0.80191
82,-0.8106300000000001
83,-0.81592
84,-0.8195399999999999
85,-0.8205
86,-0.82225
87,-0.82219
88,-0.82034
89,-0.81421
90,-0.80419
91,-0.79393
92,-0.78157
93,-0.7702
94,-0.75794
95,-0.74439
96,-0.7320800000000001
97,-0.7191
98,-0.71039
99,-0.70323
100,-0.69403
101,-0.69067
102,-0.6942699999999999
103,-0.70249
104,-0.71248
105,-0.7259899999999999
106,-0.76367
107,-0.79825
108,-0.83555
109,-0.87226
110,-0.9096700000000001
111,-0.9455899999999999
112,-0.9821
113,-1.0175
114,-1.0516
115,-1.0851
116,-1.1172
117,-1.1385
118,-1.1605
119,-1.1781
120,-1.1962
121,-1.2127
122,-1.2239
123,-1.2379
124,-1.2472
125,-1.268
126,-1.2936
127,-1.301
128,-1.3376
129,-1.3734
130,-1.4041
131,-1.4237
132,-1.4437
133,-1.4624
134,-1.4703
135,-1.4864
136,-1.4965
137,-1.5087
138,-1.52
139,-1.5343
140,-1.5491
141,-1.5515
142,-1.5457
143,-1.5393
144,-1.5274
145,-1.5172
146,-1.5031
147,-1.4859
148,-1.4666
149,-1.4474
150,-1.4242
151,-1.3996
152,-1.3753
153,-1.348
154,-1.3211
155,-1.2933
156,-1.2631
157,-1.2334
158,-1.2018
159,-1.1706
160,-1.1382
161,-1.1056
162,-1.0729
163,-1.0402
164,-1.0062
165,-0.97224
166,-0.9376700000000001
167,-0.9026799999999999
168,-0.8678600000000001
169,-0.83278
170,-0.79747
171,-0.76195
172,-0.72631
173,-0.69055
174,-0.65428
175,-0.61807
176,-0.58172
177,-0.54524
178,-0.5083
179,-0.47135
180,-0.43436
181,-0.39708000000000004
182,-0.35962
183,-0.32186
184,-0.28383
185,-0.2458
186,-0.2075
187,-0.16864
188,-0.13004000000000002
189,-0.091396
190,-0.052685
191,-0.013859999999999999
192,0.024788
193,0.063444
194,0.10196000000000001
195,0.14073
196,0.17945999999999998
197,0.21815
198,0.2571
199,0.29591
200,0.33498
201,0.3743
202,0.41357
203,0.4531
204,0.49226000000000003
205,0.53184
206,0.57148
207,0.6110899999999999
208,0.65076
209,0.69042
210,0.7298100000000001
211,0.76898
212,0.8082600000000001
213,0.84755
214,0.88638
215,0.92568
216,0.9645100000000001
217,1.0033
218,1.0422
219,1.081
220,1.1198
221,1.1582
222,1.1965
223,1.2344
224,1.2708
225,1.3078
226,1.3448
227,1.3808
228,1.4145
229,1.3967
230,1.3776
231,1.3645
232,1.3387
233,1.3111
234,1.2907
235,1.2538
236,1.2226
237,1.2172
238,1.215
239,1.1946
240,1.1586
241,1.1232
242,1.0981
243,1.0629
244,1.0277
245,0.99826
246,0.96049
247,0.94325
248,0.9709
249,1.0064
250,1.0443
251,1.0824
252,1.113
253,1.1522
254,1.1921
255,1.2231
256,1.2479
257,1.2833
258,1.3215
259,1.3517
260,1.369
261,1.3712
262,1.3823
263,1.3712
264,1.3405
265,1.307
266,1.2704
267,1.2334
268,1.196
269,1.1578
270,1.1216
271,1.0849
272,1.0471
273,1.0099
274,0.9737899999999999
275,0.93663
276,0.89917
277,0.86119
278,0.8234799999999999
279,0.78401
280,0.74783
281,0.70895
282,0.67065
283,0.6317699999999999
284,0.59404
285,0.55516
286,0.5162800000000001
287,0.47798
288,0.44025
289,0.39894
290,0.35796
291,0.31736
292,0.27858
293,0.23949
294,0.20047
295,0.16360999999999998
296,0.12639
297,0.08920299999999999
298,0.054891999999999996
299,0.017986000000000002
300,-0.018545
301,-0.054276
302,-0.089905
303,-0.12542999999999999
304,-0.16084
305,-0.19685
306,-0.20979
307,-0.17478
308,-0.18291
309,-0.20475
310,-0.23663
311,-0.27078
312,-0.30738000000000004
313,-0.34367
314,-0.37041999999999997
315,-0.40066
316,-0.43441
317,-0.46845
318,-0.51075
319,-0.54769
320,-0.58334
321,-0.61765
322,-0.65176
323,-0.68716
324,-0.72592
325,-0.75954
326,-0.79289
327,-0.8302
328,-0.8668600000000001
329,-0.9015700000000001
330,-0.9354899999999999
331,-0.9691200000000001
332,-1.0024
333,-1.037
334,-1.0697
335,-1.1019
336,-1.1283
337,-1.1538
338,-1.1803
339,-1.2054
340,-1.2303
341,-1.2524
342,-1.2736
343,-1.2944
344,-1.3159999999999998
345,-1.3363
346,-1.3549
347,-1.3719
348,-1.3869999999999998
349,-1.3974
350,-1.4056
351,-1.4171
352,-1.4235
353,-1.4276
354,-1.4263
355,-1.4239
356,-1.4186
357,-1.4107
358,-1.4027
359,-1.3897
360,-1.3747
361,-1.3553
362,-1.338
363,-1.3192
364,-1.2954
365,-1.2712
366,-1.2442
367,-1.2139
368,-1.1879
369,-1.1641
370,-1.1417
371,-1.111
372,-1.0828
373,-1.0537
374,-1.0268
375,-0.99455
376,-0.9648700000000001
377,-0.9354299999999999
378,-0.90149
379,-0.87035
380,-0.84036
381,-0.80688
382,-0.77462
383,-0.7429899999999999
384,-0.7120000000000001
385,-0.6788
386,-0.64402
387,-0.61168
388,-0.57919
389,-0.5461699999999999
390,-0.51064
391,-0.47498999999999997
392,-0.44038999999999995
393,-0.40515
394,-0.37074
395,-0.33788
396,-0.30103
397,-0.2653
398,-0.22991999999999999
399,-0.19513
400,-0.15985
401,-0.12598
402,-0.091015
403,-0.055288
404,-0.019308000000000002
405,0.01845
406,0.052861
407,0.089894
408,0.12696
409,0.15987
410,0.19466
411,0.20824
412,0.24220999999999998
413,0.27844
414,0.31532
415,0.35196
416,0.39007
417,0.42643000000000003
418,0.46368000000000004
419,0.49041999999999997
420,0.52595
421,0.5606300000000001
422,0.59772
423,0.63464
424,0.6753399999999999
425,0.7129
426,0.75179
427,0.79001
428,0.8281
429,0.86387
430,0.8916700000000001
431,0.9292799999999999
432,0.9669
433,1.0032
434,1.0382
435,1.0756
436,1.1121
437,1.1475
438,1.1836
439,1.2197
440,1.2563
441,1.2939
442,1.3324
443,1.3698
444,1.4072
445,1.4455
446,1.4832
447,1.5199
448,1.5568
449,1.5961
450,1.6339
451,1.6655
452,1.7024
453,1.7408
454,1.7747
455,1.7930000000000001
456,1.7961
457,1.8023
458,1.8275
459,1.8364
460,1.8348
461,1.8505
462,1.8544
