time,value
0,-0.20349
1,-0.20349
2,-0.20349
3,-0.20349
4,-0.20349
5,-0.20349
6,-0.20349
7,-0.20349
8,-0.20349
9,-0.20349
10,-0.20349
11,-0.20349
12,-0.20349
13,-0.20349
14,-0.20349
15,-0.20349
16,-0.20349
17,-0.20349
18,-0.20349
19,-0.20349
20,-0.20349
21,-0.20349
22,-0.20349
23,-0.20349
24,-0.20349
25,-0.20349
26,-0.20349
27,-0.20349
28,-0.20349
29,-0.20349
30,-0.20349
31,-0.20349
32,-0.20349
33,0.91094
34,3.1234
35,-0.20349
36,-0.20349
37,-0.20349
38,-0.20349
39,1.9926
40,0.239
41,-0.20349
42,-0.20349
43,-0.20349
44,-0.20349
45,-0.20349
46,-0.20349
47,-0.20349
48,-0.20349
49,-0.20349
50,-0.20349
51,-0.20349
52,-0.20349
53,-0.20349
54,-0.20349
55,-0.20349
56,-0.20349
57,1.4026
58,1.9762
59,-0.20349
60,-0.20349
61,-0.20349
62,-0.20349
63,-0.20349
64,-0.20349
65,-0.20349
66,-0.20349
67,-0.20349
68,-0.20349
69,-0.20349
70,-0.20349
71,-0.20349
72,-0.20349
73,-0.20349
74,-0.20349
75,-0.20349
76,-0.20349
77,-0.20349
78,-0.20349
79,-0.20349
80,-0.20349
81,-0.20349
82,-0.20349
83,-0.20349
84,-0.20349
85,-0.20349
86,-0.20349
87,-0.15433
88,8.417
89,-0.20349
90,-0.20349
91,-0.20349
92,-0.20349
93,-0.20349
94,-0.20349
95,-0.20349
