time,value
0,-1.1789
1,-1.1789
2,-1.1789
3,-1.1789
4,-1.1789
5,-1.1789
6,-1.1789
7,-1.1789
8,-1.1789
9,-1.1789
10,-1.1789
11,-1.1789
12,-1.1789
13,-1.1789
14,-1.1789
15,-1.1789
16,-1.1789
17,-1.1789
18,-1.1789
19,-1.1789
20,-1.1789
21,-1.1789
22,-1.1789
23,-1.1789
24,-1.1789
25,-1.1789
26,-1.1789
27,-1.1789
28,-1.1789
29,-1.1789
30,-1.1789
31,-1.1789
32,1.726
33,1.4936
34,1.0288
35,1.2612
36,1.6098
37,1.145
38,1.3774
39,0.91264
40,0.91264
41,1.145
42,1.2612
43,1.145
44,1.0288
45,1.0288
46,1.0288
47,1.3774
48,1.4936
49,1.145
50,1.145
51,1.2612
52,1.4936
53,1.145
54,1.145
55,0.7964399999999999
56,0.21545
57,-0.016946
58,-0.016946
59,0.099253
60,-0.13314
61,-0.13314
62,-0.13314
63,-0.24934
64,-0.13314
65,0.7964399999999999
66,0.56405
67,0.44785
68,0.44785
69,0.56405
70,0.44785
71,0.44785
72,0.44785
73,0.44785
74,0.56405
75,0.44785
76,0.44785
77,0.44785
78,0.44785
79,0.44785
80,0.68024
81,0.68024
82,0.68024
83,0.7964399999999999
84,0.7964399999999999
85,0.68024
86,0.68024
87,0.68024
88,0.56405
89,0.099253
90,0.21545
91,-0.13314
92,-1.1789
93,-1.1789
94,-1.1789
95,-1.1789
