[<text>
<title>frost and sullivan inc &lt;frsl.o&gt; 3rd qtr</title>
<dateline>    new york, june 18 - </dateline>qtr ends april 30
    shr loss 10 cts vs profit nine cts
    net loss 163,465 vs profit 131,815
    revs 3,672,731 vs 3,763,829
    nine mths
    shr profit four cts vs profit one ct
    net profit 57,911 vs profit 11,380
    revs 11,753,950 vs 10,794,822
 reuter
</text>]