time,value
0,-0.18616
1,-0.18616
2,-0.18616
3,-0.18616
4,-0.18616
5,-0.18616
6,-0.18616
7,-0.18616
8,-0.18616
9,-0.18616
10,-0.18616
11,-0.18616
12,-0.18616
13,-0.18616
14,-0.18616
15,-0.18616
16,-0.18616
17,-0.18616
18,-0.18616
19,-0.18616
20,-0.18616
21,-0.18616
22,-0.18616
23,-0.18616
24,-0.18616
25,-0.18616
26,-0.18616
27,-0.18616
28,-0.18616
29,-0.18616
30,-0.18616
31,-0.18616
32,-0.18616
33,7.87
34,-0.18616
35,-0.18616
36,-0.18616
37,-0.18616
38,-0.18616
39,-0.18616
40,-0.18616
41,-0.18616
42,-0.18616
43,-0.18616
44,-0.18616
45,-0.18616
46,-0.18616
47,-0.18616
48,-0.18616
49,-0.18616
50,-0.18616
51,-0.18616
52,-0.18616
53,-0.18616
54,-0.18616
55,-0.18616
56,-0.18616
57,-0.18616
58,-0.18616
59,-0.18616
60,-0.18616
61,-0.18616
62,-0.18616
63,-0.18616
64,-0.18616
65,-0.18616
66,-0.18616
67,-0.18616
68,-0.18616
69,-0.18616
70,-0.18616
71,-0.18616
72,-0.18616
73,-0.18616
74,-0.18616
75,3.9808
76,-0.18616
77,-0.18616
78,-0.18616
79,-0.18616
80,-0.18616
81,-0.18616
82,-0.18616
83,-0.18616
84,2.4066
85,2.8696
86,-0.18616
87,-0.18616
88,-0.18616
89,-0.18616
90,-0.18616
91,-0.18616
92,-0.18616
93,-0.18616
94,-0.18616
95,-0.18616
