time,value
0,-0.33787
1,-0.33787
2,-0.33787
3,-0.33787
4,-0.33787
5,-0.33787
6,-0.33787
7,-0.33787
8,-0.33787
9,-0.33787
10,-0.33787
11,-0.33787
12,-0.33787
13,-0.33787
14,-0.33787
15,-0.33787
16,-0.33787
17,-0.33787
18,-0.33787
19,-0.33787
20,-0.33787
21,-0.33787
22,-0.33787
23,-0.33787
24,-0.33787
25,-0.33787
26,-0.33787
27,-0.33787
28,-0.33787
29,-0.33787
30,-0.33787
31,-0.33787
32,-0.33787
33,-0.33787
34,-0.33787
35,-0.33787
36,-0.33787
37,-0.33787
38,2.8836
39,0.25525
40,5.5933
41,3.2324
42,1.8601
43,0.34828000000000003
44,-0.33787
45,-0.33787
46,-0.33787
47,-0.33787
48,2.3021
49,2.5812
50,0.8716200000000001
51,0.84836
52,-0.24483000000000002
53,-0.33787
54,-0.33787
55,-0.33787
56,-0.33787
57,-0.33787
58,-0.33787
59,-0.33787
60,-0.33787
61,-0.33787
62,-0.33787
63,-0.33787
64,-0.33787
65,-0.33787
66,-0.33787
67,-0.33787
68,-0.33787
69,-0.33787
70,-0.33787
71,-0.33787
72,2.8254
73,1.4647
74,2.8836
75,-0.33787
76,-0.33787
77,-0.33787
78,-0.33787
79,-0.33787
80,-0.33787
81,-0.33787
82,-0.33787
83,-0.33787
84,-0.33787
85,-0.33787
86,-0.33787
87,-0.33787
88,-0.33787
89,-0.33787
90,-0.33787
91,-0.33787
92,-0.33787
93,-0.33787
94,-0.33787
95,-0.33787
