time,value
0,-0.22009
1,-0.22009
2,-0.22009
3,-0.22009
4,-0.22009
5,-0.22009
6,-0.22009
7,-0.22009
8,-0.22009
9,-0.22009
10,-0.22009
11,-0.22009
12,-0.22009
13,-0.22009
14,-0.22009
15,-0.22009
16,-0.22009
17,-0.22009
18,-0.22009
19,-0.22009
20,-0.22009
21,-0.22009
22,-0.22009
23,-0.22009
24,-0.22009
25,-0.22009
26,-0.22009
27,-0.22009
28,-0.22009
29,-0.22009
30,-0.22009
31,-0.22009
32,-0.22009
33,-0.22009
34,-0.22009
35,-0.22009
36,-0.22009
37,-0.22009
38,-0.22009
39,-0.22009
40,-0.22009
41,-0.22009
42,-0.22009
43,-0.22009
44,-0.22009
45,-0.22009
46,-0.22009
47,-0.22009
48,-0.22009
49,-0.22009
50,-0.22009
51,-0.22009
52,-0.22009
53,-0.22009
54,-0.22009
55,-0.22009
56,-0.22009
57,-0.22009
58,-0.22009
59,-0.22009
60,-0.22009
61,-0.22009
62,-0.22009
63,-0.22009
64,-0.22009
65,7.3678
66,0.65209
67,-0.089262
68,2.1348
69,3.4867
70,0.80472
71,-0.22009
72,-0.22009
73,-0.22009
74,-0.22009
75,4.2934
76,0.5212600000000001
77,-0.023849000000000002
78,-0.22009
79,-0.22009
80,-0.22009
81,-0.22009
82,-0.22009
83,-0.22009
84,-0.22009
85,-0.22009
86,-0.22009
87,-0.22009
88,-0.22009
89,-0.22009
90,-0.22009
91,-0.22009
92,-0.22009
93,-0.22009
94,-0.22009
95,-0.22009
