time,value
0,-0.51031
1,-0.51031
2,1.9392
3,-0.51031
4,-0.51031
5,1.9392
6,-0.51031
7,-0.51031
8,-0.51031
9,1.9392
10,-0.51031
11,-0.51031
12,-0.51031
13,1.9392
14,-0.51031
15,-0.51031
16,-0.51031
17,1.9392
18,-0.51031
19,-0.51031
20,-0.51031
21,1.9392
22,-0.51031
23,-0.51031
24,-0.51031
25,1.9392
26,-0.51031
27,-0.51031
28,-0.51031
29,1.9392
30,-0.51031
31,-0.51031
32,-0.51031
33,-0.51031
34,-0.51031
35,-0.51031
36,-0.51031
37,-0.51031
38,-0.51031
39,-0.51031
40,-0.51031
41,-0.51031
42,-0.51031
43,-0.51031
44,-0.51031
45,-0.51031
46,-0.51031
47,-0.51031
48,-0.51031
49,-0.51031
50,-0.51031
51,1.9392
52,-0.51031
53,-0.51031
54,-0.51031
55,1.9392
56,-0.51031
57,-0.51031
58,-0.51031
59,1.9392
60,-0.51031
61,-0.51031
62,1.9392
63,-0.51031
64,-0.51031
65,-0.51031
66,1.9392
67,-0.51031
68,-0.51031
69,-0.51031
70,1.9392
71,-0.51031
72,-0.51031
73,-0.51031
74,1.9392
75,-0.51031
76,-0.51031
77,-0.51031
78,1.9392
79,-0.51031
80,-0.51031
81,-0.51031
82,1.9392
83,-0.51031
84,-0.51031
85,-0.51031
86,1.9392
87,-0.51031
88,-0.51031
89,-0.51031
90,1.9392
91,-0.51031
92,-0.51031
93,1.9392
94,-0.51031
95,-0.51031
