time,value
0,1.3203
1,0.39936
2,-0.71541
3,-0.86082
4,-0.86082
5,-0.86082
6,-0.9092899999999999
7,-0.86082
8,-0.9092899999999999
9,-0.86082
10,-0.9092899999999999
11,-0.86082
12,-0.81235
13,-0.86082
14,-0.9092899999999999
15,-0.9092899999999999
16,-0.86082
17,-0.9092899999999999
18,-0.9092899999999999
19,-0.86082
20,-0.81235
21,-0.86082
22,-0.86082
23,-0.9092899999999999
24,-0.9092899999999999
25,-0.86082
26,-0.9092899999999999
27,-0.9092899999999999
28,-0.86082
29,-0.9092899999999999
30,-0.9092899999999999
31,-0.86082
32,-0.9092899999999999
33,-0.9092899999999999
34,-0.86082
35,-0.86082
36,-0.085325
37,1.0779
38,1.0294
39,1.0779
40,1.1264
41,1.0779
42,1.0779
43,1.1264
44,1.0294
45,-0.61848
46,-0.86082
47,-0.9092899999999999
48,-0.86082
49,-0.9092899999999999
50,-0.9092899999999999
51,-0.86082
52,-0.81235
53,-0.81235
54,-0.76388
55,-0.9092899999999999
56,-0.81235
57,-0.86082
58,-0.9092899999999999
59,-0.86082
60,-0.71541
61,-0.57001
62,1.2718
63,1.2718
64,1.3203
65,1.2233
66,1.0779
67,1.0779
68,1.0294
69,1.0779
70,1.0294
71,1.0779
72,1.0294
73,1.0779
74,1.0294
75,1.0294
76,1.2718
77,1.2233
78,1.3203
79,1.2718
80,1.2718
81,1.2718
82,1.2718
83,1.2718
84,1.2718
85,1.3203
86,1.2718
87,1.2718
88,1.3203
89,1.3203
90,1.2718
91,1.2718
92,-0.085325
93,-0.86082
94,-0.86082
95,-0.86082
