time,value
0,-0.80842
1,-0.80842
2,-0.80842
3,-0.80842
4,-0.80842
5,1.69
6,1.3777
7,0.59696
8,-0.80842
9,-0.80842
10,-0.80842
11,-0.80842
12,-0.80842
13,0.59696
14,1.5339
15,1.3777
16,-0.027652
17,-0.80842
18,-0.80842
19,-0.80842
20,-0.80842
21,-0.80842
22,1.5339
23,1.3777
24,1.2216
25,-0.80842
26,-0.80842
27,-0.80842
28,-0.80842
29,-0.80842
30,-0.33996
31,1.69
32,1.2216
33,0.44081000000000004
34,-0.80842
35,-0.80842
36,-0.80842
37,-0.80842
38,-0.80842
39,1.69
40,1.3777
41,1.0654
42,-0.80842
43,-0.80842
44,-0.80842
45,-0.80842
46,-0.80842
47,0.28465999999999997
48,1.5339
49,1.2216
50,0.28465999999999997
51,-0.80842
52,-0.80842
53,-0.80842
54,-0.80842
55,-0.80842
56,1.8462
57,1.3777
58,1.2216
59,0.44081000000000004
60,-0.80842
61,-0.80842
62,-0.80842
63,-0.80842
64,-0.80842
65,1.0654
66,1.5339
67,1.2216
68,-0.49611000000000005
69,-0.80842
70,-0.80842
71,-0.80842
72,-0.80842
73,0.1285
74,1.5339
75,1.3777
76,1.2216
77,0.28465999999999997
78,-0.80842
79,-0.80842
80,-0.80842
81,-0.80842
82,-0.80842
83,1.2216
84,1.5339
85,1.2216
86,-0.80842
87,-0.80842
88,-0.80842
89,-0.80842
90,-0.80842
91,0.44081000000000004
92,1.5339
93,1.3777
94,1.2216
95,0.59696
