[<text>
<title>southern national corp &lt;snat.o&gt; 1st qtr net</title>
<dateline>    lumberton, n.c., april 17 -
    </dateline>shr 47 cts vs 46 cts
    net 3,470,859 vs 3,454,577
   
 reuter
</text>]