[<text>
<title>john fairfax ltd &lt;ffxa.s&gt; first half</title>
<dateline>    sydney, march 19 - </dateline>26 weeks ended dec 28
    net shr 25.9 cents vs 28.2
    int div 5.5 cents vs 5.0
    pre-tax 48.30 mln dlrs vs 44.29 mln
    net 25.94 mln vs 25.35 mln
    turnover 453.28 mln vs 407.35 mln
    other income 4.48 mln vs 3.18 mln
    shrs 100 mln vs 90 mln.
    note - div pay may 8. reg april 14.
    net is after tax 22.09 mln dlrs vs 18.60 mln, interest
11.60 mln vs 13.92 mln, depreciation 8.52 mln vs 7.06 mln and
minorities 267,000 vs 346,000 but before net extraordinary
profit 89.32 rpt 89.32 mln dlrs vs nil.
 reuter
</text>]