time,value
0,1.5963
1,0.10848
2,-0.76668
3,-0.76668
4,-0.76668
5,-0.76668
6,-0.76668
7,-0.76668
8,-0.76668
9,0.80862
10,1.7713
11,1.6838
12,-0.24158000000000002
13,-0.76668
14,-0.76668
15,-0.76668
16,-0.76668
17,-0.76668
18,1.6838
19,0.45855
20,1.3337
21,1.5963
22,0.80862
23,-0.76668
24,-0.76668
25,-0.76668
26,-0.76668
27,-0.76668
28,-0.76668
29,-0.76668
30,0.63358
31,1.7713
32,0.89613
33,-0.76668
34,-0.76668
35,-0.76668
36,-0.76668
37,0.020967
38,1.5087
39,-0.41661000000000004
40,1.5963
41,1.5963
42,0.5460699999999999
43,-0.76668
44,-0.76668
45,-0.76668
46,-0.76668
47,-0.76668
48,-0.76668
49,-0.76668
50,0.63358
51,1.6838
52,1.6838
53,0.10848
54,-0.76668
55,-0.76668
56,-0.76668
57,-0.76668
58,-0.76668
59,-0.76668
60,0.89613
61,1.6838
62,1.5963
63,0.98365
64,-0.76668
65,-0.76668
66,-0.76668
67,-0.76668
68,-0.76668
69,-0.76668
70,-0.76668
71,-0.76668
72,0.45855
73,1.7713
74,1.2462
75,-0.76668
76,-0.76668
77,-0.76668
78,-0.76668
79,1.2462
80,0.89613
81,0.5460699999999999
82,1.5963
83,1.5087
84,-0.15407
85,-0.76668
86,-0.76668
87,-0.76668
88,-0.76668
89,-0.76668
90,-0.76668
91,-0.76668
92,1.2462
93,1.6838
94,1.6838
95,-0.59165
