time,value
0,-0.98188
1,-0.98188
2,-0.98188
3,-0.98188
4,-0.98188
5,-0.98188
6,-0.98188
7,-0.98188
8,-0.98188
9,-0.98188
10,-0.98188
11,-0.98188
12,-0.98188
13,-0.98188
14,-0.98188
15,-0.98188
16,-0.98188
17,-0.98188
18,-0.98188
19,-0.98188
20,-0.98188
21,-0.98188
22,-0.98188
23,-0.98188
24,-0.98188
25,-0.98188
26,-0.98188
27,-0.98188
28,-0.98188
29,0.20093
30,1.6567
31,1.5657
32,1.6567
33,1.5657
34,1.6567
35,1.5657
36,1.5657
37,1.5657
38,1.3837
39,1.2018
40,-0.07203
41,0.65585
42,-0.52695
43,0.74684
44,1.4747
45,1.4747
46,-0.43596999999999997
47,-0.07203
48,-0.16301
49,-0.6179399999999999
50,0.29191
51,1.1108
52,1.4747
53,-0.254
54,-0.52695
55,0.018955
56,-0.98188
57,0.3829
58,-0.34498
59,1.4747
60,0.74684
61,-0.98188
62,-0.34498
63,-0.16301
64,-0.98188
65,0.10994000000000001
66,-0.52695
67,1.4747
68,1.3837
69,-0.79991
70,-0.98188
71,-0.6179399999999999
72,0.018955
73,-0.98188
74,-0.34498
75,-0.07203
76,1.3837
77,1.6567
78,0.56487
79,0.8378200000000001
80,0.20093
81,0.29191
82,-0.254
83,1.2018
84,1.5657
85,0.20093
86,0.9288
87,-0.98188
88,0.65585
89,-0.98188
90,1.3837
91,1.4747
92,1.4747
93,-0.43596999999999997
94,0.018955
95,-0.34498
