time,value
0,-0.31205
1,-0.31205
2,-0.31205
3,-0.31205
4,-0.31205
5,-0.31205
6,-0.31205
7,-0.31205
8,-0.31205
9,-0.31205
10,-0.31205
11,-0.31205
12,-0.31205
13,-0.31205
14,-0.31205
15,-0.31205
16,-0.31205
17,-0.31205
18,-0.31205
19,-0.31205
20,-0.31205
21,-0.31205
22,-0.31205
23,-0.31205
24,-0.31205
25,-0.31205
26,1.4952
27,0.8519100000000001
28,-0.31205
29,-0.31205
30,-0.31205
31,-0.31205
32,-0.31205
33,2.0159
34,-0.31205
35,-0.18953
36,0.45371000000000006
37,-0.31205
38,-0.31205
39,-0.31205
40,-0.31205
41,-0.31205
42,1.8933
43,-0.31205
44,-0.31205
45,-0.31205
46,-0.31205
47,-0.31205
48,-0.31205
49,-0.31205
50,-0.31205
51,-0.31205
52,-0.31205
53,-0.31205
54,-0.31205
55,-0.31205
56,-0.31205
57,-0.31205
58,-0.31205
59,-0.31205
60,-0.31205
61,-0.31205
62,-0.31205
63,-0.31205
64,-0.31205
65,-0.31205
66,-0.31205
67,-0.31205
68,-0.31205
69,2.3834
70,-0.097635
71,-0.31205
72,-0.31205
73,2.0771
74,7.1005
75,2.3528
76,-0.31205
77,0.9438
78,-0.31205
79,2.0159
80,-0.31205
81,-0.31205
82,-0.31205
83,-0.31205
84,2.2915
85,-0.31205
86,-0.31205
87,-0.31205
88,-0.31205
89,-0.31205
90,-0.31205
91,-0.31205
92,-0.31205
93,-0.31205
94,-0.31205
95,-0.31205
