time,value
0,0.62759
1,0.62759
2,0.52281
3,0.62759
4,0.52281
5,0.31325
6,-1.4680000000000002
7,-1.4680000000000002
8,-1.4680000000000002
9,-1.4680000000000002
10,-1.4680000000000002
11,-1.4680000000000002
12,-1.4680000000000002
13,-1.4680000000000002
14,-1.4680000000000002
15,-1.4680000000000002
16,1.2563
17,1.0467
18,0.9419299999999999
19,0.73237
20,0.73237
21,0.73237
22,0.62759
23,0.62759
24,0.62759
25,0.73237
26,0.62759
27,0.62759
28,0.52281
29,0.62759
30,0.62759
31,0.62759
32,0.52281
33,0.62759
34,0.62759
35,0.62759
36,0.52281
37,0.62759
38,0.62759
39,0.31325
40,-1.4680000000000002
41,-1.4680000000000002
42,-1.4680000000000002
43,-1.4680000000000002
44,-1.4680000000000002
45,-1.4680000000000002
46,-1.4680000000000002
47,-1.4680000000000002
48,-1.4680000000000002
49,-1.4680000000000002
50,0.73237
51,1.0467
52,0.9419299999999999
53,0.83715
54,0.73237
55,0.73237
56,0.62759
57,0.62759
58,0.73237
59,0.62759
60,0.62759
61,0.62759
62,0.52281
63,0.62759
64,0.62759
65,0.52281
66,0.62759
67,0.52281
68,0.62759
69,0.52281
70,0.52281
71,0.62759
72,-1.2585
73,-1.4680000000000002
74,-1.4680000000000002
75,-1.4680000000000002
76,-1.4680000000000002
77,-1.4680000000000002
78,-1.4680000000000002
79,-1.4680000000000002
80,-1.4680000000000002
81,-1.4680000000000002
82,0.31325
83,1.0467
84,1.0467
85,0.83715
86,0.73237
87,0.62759
88,0.73237
89,0.62759
90,0.62759
91,0.62759
92,0.62759
93,0.62759
94,0.62759
95,0.62759
