time,value
0,-0.59029
1,-0.59029
2,1.6764
3,-0.59029
4,-0.59029
5,-0.59029
6,1.6764
7,-0.59029
8,-0.59029
9,-0.59029
10,1.6764
11,-0.59029
12,-0.59029
13,-0.59029
14,1.6764
15,-0.59029
16,-0.59029
17,1.6764
18,-0.59029
19,-0.59029
20,-0.59029
21,1.6764
22,-0.59029
23,-0.59029
24,-0.59029
25,1.6764
26,-0.59029
27,-0.59029
28,-0.59029
29,1.6764
30,-0.59029
31,-0.59029
32,-0.59029
33,1.6764
34,-0.59029
35,-0.59029
36,-0.59029
37,1.6764
38,-0.59029
39,-0.59029
40,-0.59029
41,1.6764
42,-0.59029
43,-0.59029
44,-0.59029
45,1.6764
46,-0.59029
47,-0.59029
48,1.6764
49,-0.59029
50,-0.59029
51,-0.59029
52,1.6764
53,-0.59029
54,-0.59029
55,-0.59029
56,1.6764
57,-0.59029
58,-0.59029
59,-0.59029
60,1.6764
61,-0.59029
62,-0.59029
63,-0.59029
64,1.6764
65,-0.59029
66,-0.59029
67,-0.59029
68,1.6764
69,-0.59029
70,-0.59029
71,-0.59029
72,1.6764
73,-0.59029
74,-0.59029
75,1.6764
76,-0.59029
77,-0.59029
78,-0.59029
79,1.6764
80,-0.59029
81,-0.59029
82,-0.59029
83,1.6764
84,-0.59029
85,-0.59029
86,-0.59029
87,1.6764
88,-0.59029
89,-0.59029
90,-0.59029
91,1.6764
92,-0.59029
93,-0.59029
94,-0.59029
95,1.6764
