[<text>
<title>fhlbb changes short-term discount note rates</title>
<dateline>    washington, april 3 - </dateline>the federal home loan bank board
adjusted the rates on its short-term discount notes as follows:
    maturity   new rate  old rate  maturity
  30-273 days  5.00 pct  5.00 pct    30-89 days
 274-294 days  5.92 pct  5.83 pct   90-100 days
 295-344 days  5.00 pct  5.00 pct  101-181 days
 345-360 days  5.93 pct  5.82 pct  182-195 days
                         5.00 pct  196-274 days
                         5.90 pct  275-295 days
                         5.00 pct  296-360 days
 reuter
</text>]