time,value
0,-0.35167
1,-0.19569
2,-0.28343
3,-0.35167
4,-0.33216999999999997
5,-0.32242
6,-0.31268
7,-0.1177
8,-0.14694000000000002
9,-0.28343
10,-0.36141999999999996
11,-0.32242
12,-0.32242
13,-0.29318
14,-0.22494
15,-0.32242
16,-0.32242
17,-0.22494
18,-0.21519000000000002
19,-0.26393
20,-0.23468000000000003
21,-0.31268
22,-0.32242
23,0.39899
24,-0.34192
25,-0.32242
26,-0.15669
27,-0.17619
28,-0.21519000000000002
29,-0.30293000000000003
30,-0.36141999999999996
31,-0.32242
32,-0.25418
33,-0.24443
34,-0.34192
35,-0.31268
36,-0.20544
37,-0.24443
38,-0.24443
39,-0.20544
40,-0.34192
41,-0.33216999999999997
42,-0.34192
43,-0.35167
44,-0.36141999999999996
45,-0.14694000000000002
46,-0.16644
47,-0.26393
48,-0.28343
49,-0.34192
50,-0.37117
51,-0.26393
52,-0.25418
53,-0.34192
54,0.51598
55,0.29175999999999996
56,-0.068953
57,4.8445
58,3.5576
59,-0.14694000000000002
60,-0.15669
61,-0.12745
62,-0.029958
63,0.048034
64,-0.35167
65,-0.22494
66,-0.21519000000000002
67,-0.14694000000000002
68,-0.25418
69,-0.34192
70,-0.33216999999999997
71,-0.37117
72,-0.34192
73,-0.22494
74,-0.29318
75,-0.22494
76,-0.21519000000000002
77,-0.26393
78,-0.38092
79,4.6983
80,4.0743
81,3.5186
82,0.85719
83,-0.25418
84,-0.10795
85,-0.12745
86,-0.30293000000000003
87,-0.31268
88,-0.34192
89,-0.26393
90,-0.20544
91,-0.35167
92,-0.28343
93,-0.22494
94,-0.22494
95,-0.23468000000000003
