time,value
0,-0.43243000000000004
1,-0.43243000000000004
2,-0.43243000000000004
3,-0.43243000000000004
4,-0.43243000000000004
5,-0.43243000000000004
6,-0.43243000000000004
7,-0.43243000000000004
8,-0.43243000000000004
9,-0.43243000000000004
10,-0.43243000000000004
11,-0.43243000000000004
12,-0.43243000000000004
13,-0.43243000000000004
14,-0.43243000000000004
15,-0.43243000000000004
16,-0.43243000000000004
17,-0.43243000000000004
18,-0.43243000000000004
19,-0.43243000000000004
20,-0.43243000000000004
21,-0.43243000000000004
22,-0.43243000000000004
23,-0.43243000000000004
24,-0.43243000000000004
25,-0.43243000000000004
26,-0.43243000000000004
27,-0.43243000000000004
28,-0.43243000000000004
29,-0.43243000000000004
30,-0.43243000000000004
31,-0.43243000000000004
32,-0.43243000000000004
33,-0.43243000000000004
34,-0.43243000000000004
35,-0.43243000000000004
36,-0.43243000000000004
37,-0.43243000000000004
38,-0.43243000000000004
39,-0.43243000000000004
40,-0.43243000000000004
41,-0.43243000000000004
42,-0.43243000000000004
43,-0.43243000000000004
44,-0.43243000000000004
45,-0.43243000000000004
46,-0.43243000000000004
47,-0.43243000000000004
48,-0.43243000000000004
49,-0.43243000000000004
50,-0.43243000000000004
51,-0.43243000000000004
52,-0.43243000000000004
53,-0.43243000000000004
54,-0.43243000000000004
55,-0.43243000000000004
56,-0.43243000000000004
57,-0.43243000000000004
58,-0.43243000000000004
59,-0.43243000000000004
60,-0.43243000000000004
61,-0.43243000000000004
62,-0.43243000000000004
63,-0.43243000000000004
64,-0.43243000000000004
65,-0.43243000000000004
66,-0.43243000000000004
67,-0.43243000000000004
68,-0.43243000000000004
69,-0.43243000000000004
70,-0.43243000000000004
71,-0.43243000000000004
72,-0.43243000000000004
73,-0.43243000000000004
74,-0.43243000000000004
75,-0.43243000000000004
76,-0.43243000000000004
77,2.2195
78,2.3215
79,2.4235
80,1.6075
81,-0.024437
82,-0.024437
83,2.5255
84,2.4235
85,2.5255
86,2.4235
87,2.4235
88,2.5255
89,2.4235
90,2.4235
91,2.4235
92,2.4235
93,1.0975
94,-0.43243000000000004
95,-0.43243000000000004
