time,value
0,0.059516
1,-0.13094
2,-0.32139
3,-0.32139
4,-0.32139
5,-0.32139
6,-0.32139
7,-0.32139
8,-0.32139
9,-0.32139
10,-0.32139
11,-0.32139
12,-0.32139
13,-0.32139
14,-0.32139
15,-0.32139
16,-0.32139
17,-0.32139
18,-0.32139
19,-0.32139
20,-0.32139
21,-0.32139
22,-0.32139
23,-0.32139
24,-0.32139
25,-0.32139
26,-0.32139
27,-0.32139
28,-0.32139
29,-0.32139
30,-0.32139
31,-0.32139
32,-0.32139
33,-0.32139
34,-0.32139
35,-0.32139
36,-0.32139
37,-0.32139
38,-0.32139
39,-0.32139
40,-0.32139
41,-0.32139
42,-0.32139
43,-0.32139
44,-0.32139
45,-0.32139
46,-0.32139
47,-0.32139
48,-0.32139
49,-0.32139
50,-0.32139
51,-0.32139
52,-0.32139
53,2.5354
54,3.2972
55,4.059
56,3.6781
57,-0.32139
58,-0.32139
59,-0.32139
60,-0.32139
61,-0.32139
62,-0.32139
63,-0.32139
64,-0.32139
65,-0.32139
66,-0.32139
67,-0.32139
68,-0.32139
69,-0.32139
70,-0.32139
71,-0.32139
72,-0.32139
73,-0.32139
74,-0.32139
75,-0.32139
76,-0.32139
77,-0.32139
78,-0.32139
79,-0.32139
80,-0.32139
81,-0.32139
82,-0.32139
83,2.7258
84,3.1067
85,3.0115
86,2.9163
87,2.0593
88,-0.32139
89,-0.32139
90,-0.32139
91,-0.32139
92,-0.32139
93,-0.32139
94,-0.32139
95,-0.32139
