time,value
0,-0.72644
1,1.5476
2,0.78961
3,-0.72644
4,-0.72644
5,-0.72644
6,0.031584
7,1.9266
8,-0.34743
9,-0.72644
10,-0.72644
11,-0.72644
12,1.1686
13,1.1686
14,-0.72644
15,-0.72644
16,-0.72644
17,-0.72644
18,1.9266
19,0.22109
20,-0.72644
21,-0.72644
22,-0.72644
23,0.4106
24,1.9266
25,-0.72644
26,-0.72644
27,-0.72644
28,-0.72644
29,0.78961
30,1.5476
31,-0.72644
32,-0.72644
33,-0.72644
34,-0.72644
35,1.5476
36,0.78961
37,-0.72644
38,-0.72644
39,-0.72644
40,-0.72644
41,1.9266
42,0.4106
43,-0.72644
44,-0.72644
45,-0.72644
46,0.031584
47,1.9266
48,-0.34743
49,-0.72644
50,-0.72644
51,-0.72644
52,0.78961
53,1.9266
54,-0.72644
55,-0.72644
56,-0.72644
57,0.78961
58,1.5476
59,-0.72644
60,-0.72644
61,-0.72644
62,0.97911
63,1.5476
64,-0.72644
65,-0.72644
66,-0.72644
67,-0.34743
68,1.9266
69,0.22109
70,-0.72644
71,-0.72644
72,-0.72644
73,0.6001
74,1.9266
75,-0.72644
76,-0.72644
77,-0.72644
78,-0.72644
79,1.3581
80,1.1686
81,-0.72644
82,-0.72644
83,-0.72644
84,1.5476
85,0.97911
86,-0.72644
87,-0.72644
88,-0.72644
89,2.1161
90,0.4106
91,-0.72644
92,-0.72644
93,-0.34743
94,2.1161
95,0.031584
