time,value
0,-0.64783
1,-0.5839300000000001
2,-0.53269
3,-0.48931
4,-0.44883
5,-0.41095
6,-0.38114000000000003
7,-0.36180999999999996
8,-0.34839000000000003
9,-0.33785
10,-0.32686
11,-0.31779
12,-0.31667
13,-0.32216
14,-0.33276999999999995
15,-0.34567
16,-0.35653
17,-0.36805
18,-0.3791
19,-0.38950999999999997
20,-0.40212
21,-0.4149
22,-0.42901000000000006
23,-0.44511999999999996
24,-0.45982
25,-0.47218999999999994
26,-0.47553999999999996
27,-0.46228
28,-0.42733999999999994
29,-0.36419
30,-0.27214
31,-0.15377000000000002
32,-0.01385
33,0.13684000000000002
34,0.28952
35,0.43462
36,0.5635
37,0.67332
38,0.76078
39,0.82535
40,0.8692200000000001
41,0.89266
42,0.90154
43,0.9009799999999999
44,0.8929
45,0.88118
46,0.8635
47,0.8366
48,0.79985
49,0.7494
50,0.68776
51,0.6179899999999999
52,0.54066
53,0.46142
54,0.38234
55,0.3056
56,0.23635
57,0.17385
58,0.12187
59,0.082485
60,0.05268200000000001
61,0.038574000000000004
62,0.04013
63,0.058041999999999996
64,0.09635099999999999
65,0.14544
66,0.20365
67,0.26646
68,0.32397
69,0.3829
70,0.44147
71,0.4986
72,0.5584600000000001
73,0.6099
74,0.65277
75,0.68603
76,0.70103
77,0.70717
78,0.7085100000000001
79,0.7138800000000001
80,0.74266
81,0.8032100000000001
82,0.90707
83,1.0573
84,1.2412
85,1.4489
86,1.6603
87,1.8559999999999999
88,2.0283
89,2.1732
90,2.2983
91,2.4118
92,2.5139
93,2.6073
94,2.6931
95,2.7793
96,2.8768
97,2.9853
98,3.0929
99,3.1738
100,3.2006
101,3.1624
102,3.0605
103,2.912
104,2.7377
105,2.5527
106,2.3703
107,2.1955
108,2.0281
109,1.8695
110,1.715
111,1.5631
112,1.4122
113,1.2574
114,1.1008
115,0.94101
116,0.77698
117,0.6160100000000001
118,0.45647
119,0.30168
120,0.15465
121,0.01184
122,-0.11971
123,-0.23847
124,-0.34526999999999997
125,-0.43163999999999997
126,-0.5028100000000001
127,-0.55952
128,-0.60264
129,-0.64083
130,-0.6703100000000001
131,-0.69298
132,-0.71414
133,-0.7286699999999999
134,-0.7421399999999999
135,-0.75439
136,-0.7629100000000001
137,-0.77136
138,-0.77665
139,-0.7803
140,-0.78603
141,-0.78971
142,-0.7931
143,-0.79538
144,-0.79537
145,-0.79625
146,-0.79723
147,-0.7985399999999999
148,-0.80093
149,-0.80189
150,-0.80197
151,-0.8015
152,-0.80062
153,-0.80057
154,-0.80118
155,-0.80218
156,-0.80345
157,-0.8043100000000001
158,-0.80504
159,-0.80599
160,-0.80719
161,-0.80852
162,-0.80933
163,-0.8092199999999999
164,-0.80845
165,-0.80762
166,-0.80737
167,-0.8078
168,-0.80834
169,-0.80842
170,-0.80787
171,-0.80705
172,-0.8065
173,-0.80633
174,-0.80621
175,-0.8057300000000001
176,-0.80467
177,-0.80325
178,-0.80181
179,-0.8005399999999999
180,-0.7994100000000001
181,-0.7982
182,-0.79682
183,-0.79542
184,-0.79423
185,-0.79359
186,-0.79371
187,-0.79445
188,-0.79551
189,-0.7964
190,-0.79685
191,-0.7971600000000001
192,-0.7972100000000001
193,-0.79732
194,-0.79756
195,-0.79695
196,-0.79656
197,-0.7963600000000001
198,-0.7962
199,-0.79771
200,-0.79911
201,-0.80011
202,-0.8013100000000001
203,-0.80102
204,-0.8006800000000001
205,-0.79986
206,-0.7975800000000001
207,-0.79561
208,-0.79297
209,-0.79033
210,-0.789
211,-0.78766
212,-0.78562
213,-0.77971
214,-0.76535
215,-0.73895
216,-0.69521
217,-0.6302399999999999
218,-0.54292
219,-0.436
220,-0.31874
221,-0.20276
222,-0.096799
223,-0.00359
224,0.080791
225,0.15974000000000002
226,0.2308
227,0.28651
228,0.31839
229,0.32366
230,0.30635999999999997
231,0.27284
232,0.22888000000000003
233,0.17724
234,0.11939000000000001
235,0.058127
236,-0.0037634
237,-0.06431100000000001
238,-0.12317
239,-0.1812
240,-0.23824
241,-0.29291999999999996
242,-0.34306
243,-0.38666999999999996
244,-0.42276
245,-0.4511
246,-0.47267
247,-0.4891
248,-0.50137
249,-0.51162
250,-0.52048
251,-0.5283899999999999
252,-0.53688
253,-0.5444399999999999
254,-0.55104
255,-0.5572
256,-0.56082
257,-0.56372
258,-0.5664
259,-0.57003
260,-0.5787800000000001
261,-0.5936899999999999
262,-0.61587
263,-0.64461
264,-0.67485
265,-0.7044199999999999
266,-0.7318899999999999
267,-0.7569100000000001
268,-0.77994
269,-0.79819
