time,value
0,-1.2843
1,0.77055
2,0.77055
3,-1.2843
4,0.77055
5,0.77055
6,0.77055
7,-1.2843
8,0.77055
9,0.77055
10,0.77055
11,0.77055
12,0.77055
13,0.77055
14,0.77055
15,-1.2843
16,0.77055
17,0.77055
18,0.77055
19,0.77055
20,-1.2843
21,0.77055
22,0.77055
23,0.77055
24,0.77055
25,-1.2843
26,0.77055
27,0.77055
28,0.77055
29,-1.2843
30,0.77055
31,0.77055
32,-1.2843
33,0.77055
34,0.77055
35,-1.2843
36,0.77055
37,-1.2843
38,0.77055
39,-1.2843
40,0.77055
41,0.77055
42,-1.2843
43,0.77055
44,-1.2843
45,0.77055
46,-1.2843
47,0.77055
48,-1.2843
49,-1.2843
50,0.77055
51,-1.2843
52,0.77055
53,0.77055
54,0.77055
55,-1.2843
56,0.77055
57,-1.2843
58,0.77055
59,-1.2843
60,0.77055
61,0.77055
62,-1.2843
63,0.77055
64,-1.2843
65,0.77055
66,0.77055
67,-1.2843
68,0.77055
69,0.77055
70,-1.2843
71,0.77055
72,-1.2843
73,0.77055
74,-1.2843
75,0.77055
76,-1.2843
77,0.77055
78,0.77055
79,-1.2843
80,0.77055
81,-1.2843
82,0.77055
83,0.77055
84,-1.2843
85,-1.2843
86,0.77055
87,-1.2843
88,-1.2843
89,0.77055
90,-1.2843
91,0.77055
92,-1.2843
93,0.77055
94,0.77055
95,-1.2843
