time,value
0,-0.26232
1,-0.26232
2,-0.26232
3,-0.26232
4,-0.26232
5,-0.26232
6,-0.26232
7,-0.26232
8,-0.26232
9,-0.26232
10,-0.26232
11,-0.26232
12,-0.26232
13,-0.26232
14,-0.26232
15,-0.26232
16,-0.26232
17,-0.26232
18,-0.26232
19,-0.26232
20,-0.26232
21,-0.26232
22,-0.26232
23,-0.26232
24,-0.26232
25,-0.26232
26,-0.26232
27,-0.26232
28,-0.26232
29,-0.26232
30,-0.26232
31,-0.26232
32,-0.26232
33,-0.26232
34,5.3813
35,-0.26232
36,-0.26232
37,-0.26232
38,-0.26232
39,-0.26232
40,-0.26232
41,2.1564
42,-0.26232
43,-0.26232
44,-0.26232
45,-0.26232
46,-0.26232
47,-0.26232
48,-0.26232
49,-0.26232
50,4.6699
51,1.7295
52,-0.26232
53,-0.26232
54,-0.26232
55,-0.26232
56,-0.26232
57,-0.26232
58,-0.26232
59,-0.26232
60,-0.26232
61,-0.26232
62,-0.26232
63,2.9152
64,-0.26232
65,-0.26232
66,-0.26232
67,-0.26232
68,-0.26232
69,3.9111
70,-0.26232
71,-0.26232
72,-0.26232
73,-0.26232
74,-0.26232
75,-0.26232
76,-0.26232
77,-0.26232
78,-0.26232
79,-0.26232
80,-0.26232
81,-0.26232
82,-0.26232
83,2.5832
84,-0.26232
85,-0.26232
86,-0.26232
87,-0.26232
88,-0.26232
89,-0.26232
90,-0.26232
91,-0.26232
92,-0.26232
93,-0.26232
94,-0.26232
95,-0.26232
