time,value
0,1.8513
1,1.8142
2,1.7344
3,1.6747
4,1.5836
5,1.4701
6,1.3629
7,1.2445
8,1.1265
9,1.0102
10,0.8963
11,0.78669
12,0.68425
13,0.58582
14,0.50117
15,0.41593
16,0.33323
17,0.2414
18,0.14937
19,0.069685
20,-0.011082999999999999
21,-0.09858099999999999
22,-0.18761
23,-0.26426
24,-0.33245
25,-0.40984
26,-0.49559
27,-0.57029
28,-0.64554
29,-0.7135199999999999
30,-0.76947
31,-0.83173
32,-0.8822
33,-0.94219
34,-1.0069
35,-1.0457
36,-1.1034
37,-1.1558
38,-1.1845
39,-1.2219
40,-1.2438
41,-1.2716
42,-1.2939
43,-1.2812
44,-1.2957
45,-1.2904
46,-1.2788
47,-1.2439
48,-1.2262
49,-1.1832
50,-1.1565
51,-1.1125
52,-1.0721
53,-1.0236
54,-0.96849
55,-0.9191799999999999
56,-0.8683700000000001
57,-0.80693
58,-0.74149
59,-0.6854899999999999
60,-0.60737
61,-0.53699
62,-0.46307
63,-0.39326
64,-0.32213
65,-0.23803000000000002
66,-0.16888
67,-0.086931
68,0.0032210999999999997
69,0.10329
70,0.17488
71,0.26879000000000003
72,0.36252
73,0.43688999999999995
74,0.51494
75,0.5904699999999999
76,0.6631
77,0.73948
78,0.8453200000000001
79,0.95785
80,1.073
81,1.1893
82,1.3083
83,1.4253
84,1.5408
85,1.6412
86,1.7134
87,1.8024
88,1.8412
89,1.8117
90,1.774
91,1.7038
92,1.5997
93,1.4868
94,1.369
95,1.2504
96,1.1332
97,1.0169
98,0.90369
99,0.7943899999999999
100,0.69042
101,0.6100300000000001
102,0.53932
103,0.46299999999999997
104,0.36496
105,0.26893
106,0.17432999999999998
107,0.10107999999999999
108,0.0060426
109,-0.079999
110,-0.16689
111,-0.2531
112,-0.33102
113,-0.41677
114,-0.49126000000000003
115,-0.55901
116,-0.6347
117,-0.71257
118,-0.77693
119,-0.84277
120,-0.90786
121,-0.96001
122,-1.0226
123,-1.0645
124,-1.1166
125,-1.1296
126,-1.1886
127,-1.2127
128,-1.2472
129,-1.2691
130,-1.2673
131,-1.2805
132,-1.2837
133,-1.2753
134,-1.2604
135,-1.2377
136,-1.2094
137,-1.1794
138,-1.1349
139,-1.1022
140,-1.0537
141,-1.0078
142,-0.9600299999999999
143,-0.8880100000000001
144,-0.8238200000000001
145,-0.77255
146,-0.71278
147,-0.64469
148,-0.5669
149,-0.488
150,-0.41336000000000006
151,-0.33505
152,-0.2534
153,-0.16871
154,-0.08507999999999999
155,0.00050388
156,0.088007
157,0.17403
158,0.26525
159,0.35620999999999997
160,0.44866999999999996
161,0.53459
162,0.60797
163,0.69686
164,0.79022
165,0.89841
166,1.0112
167,1.1263
168,1.2452
169,1.3632
170,1.4813
171,1.5956
172,1.6740000000000002
173,1.7126
174,1.7651
175,1.8118
