time,value
0,0.42373999999999995
1,0.5364300000000001
2,0.5364300000000001
3,0.42373999999999995
4,-1.3792
5,-1.83
6,-1.83
7,-1.83
8,-1.83
9,-1.83
10,-1.83
11,-1.83
12,0.31106
13,1.0999
14,0.7618
15,0.7618
16,0.64912
17,0.5364300000000001
18,0.64912
19,0.5364300000000001
20,0.5364300000000001
21,0.5364300000000001
22,0.5364300000000001
23,0.5364300000000001
24,0.5364300000000001
25,0.5364300000000001
26,0.5364300000000001
27,0.5364300000000001
28,0.5364300000000001
29,0.5364300000000001
30,0.42373999999999995
31,0.5364300000000001
32,0.42373999999999995
33,0.5364300000000001
34,0.42373999999999995
35,0.42373999999999995
36,0.5364300000000001
37,0.42373999999999995
38,0.31106
39,-1.83
40,-1.83
41,-1.83
42,-1.83
43,-1.83
44,-1.83
45,-1.83
46,-0.92848
47,1.0999
48,0.9871700000000001
49,0.64912
50,0.64912
51,0.5364300000000001
52,0.5364300000000001
53,0.5364300000000001
54,0.5364300000000001
55,0.64912
56,0.5364300000000001
57,0.5364300000000001
58,0.5364300000000001
59,0.5364300000000001
60,0.5364300000000001
61,0.42373999999999995
62,0.5364300000000001
63,0.5364300000000001
64,0.5364300000000001
65,0.5364300000000001
66,0.42373999999999995
67,0.5364300000000001
68,0.5364300000000001
69,0.42373999999999995
70,0.5364300000000001
71,-0.25237
72,-1.83
73,-1.83
74,-1.83
75,-1.83
76,-1.83
77,-0.8158
78,1.0999
79,0.87449
80,0.7618
81,0.64912
82,0.5364300000000001
83,0.5364300000000001
84,0.5364300000000001
85,0.5364300000000001
86,0.5364300000000001
87,0.5364300000000001
88,0.5364300000000001
89,0.5364300000000001
90,0.5364300000000001
91,0.42373999999999995
92,0.5364300000000001
93,0.5364300000000001
94,-0.25237
95,-1.83
