time,value
0,-0.19092
1,-0.19092
2,-0.19092
3,-0.19092
4,-0.19092
5,-0.19092
6,-0.19092
7,-0.19092
8,-0.19092
9,-0.19092
10,-0.19092
11,-0.19092
12,-0.19092
13,-0.19092
14,-0.19092
15,-0.19092
16,-0.19092
17,-0.19092
18,-0.19092
19,-0.19092
20,-0.19092
21,-0.19092
22,-0.19092
23,-0.19092
24,-0.19092
25,-0.19092
26,-0.19092
27,-0.19092
28,-0.19092
29,-0.19092
30,-0.19092
31,-0.19092
32,-0.19092
33,-0.19092
34,-0.19092
35,-0.19092
36,-0.19092
37,-0.19092
38,-0.19092
39,-0.19092
40,-0.19092
41,-0.19092
42,-0.19092
43,-0.19092
44,-0.19092
45,-0.19092
46,-0.19092
47,-0.19092
48,-0.19092
49,-0.19092
50,-0.19092
51,-0.19092
52,-0.19092
53,-0.19092
54,-0.19092
55,-0.19092
56,-0.19092
57,-0.19092
58,-0.19092
59,-0.19092
60,-0.19092
61,-0.19092
62,-0.19092
63,-0.19092
64,-0.19092
65,-0.19092
66,-0.19092
67,-0.19092
68,-0.19092
69,-0.19092
70,-0.19092
71,-0.19092
72,-0.19092
73,-0.19092
74,-0.19092
75,-0.19092
76,-0.19092
77,-0.19092
78,-0.19092
79,-0.19092
80,-0.19092
81,-0.19092
82,-0.19092
83,-0.19092
84,-0.19092
85,0.14307999999999998
86,6.2803
87,0.39358000000000004
88,0.18483
89,0.1222
90,3.6292
91,6.2385
92,-0.19092
93,-0.19092
94,-0.19092
95,-0.19092
