time,value
0,-0.18759
1,-0.18759
2,-0.18759
3,-0.18759
4,-0.18759
5,-0.18759
6,-0.18759
7,-0.18759
8,-0.18759
9,-0.18759
10,-0.18759
11,-0.18759
12,-0.18759
13,-0.18759
14,-0.18759
15,-0.18759
16,-0.18759
17,-0.18759
18,-0.18759
19,-0.18759
20,-0.18759
21,-0.18759
22,-0.18759
23,-0.18759
24,-0.18759
25,-0.18759
26,-0.18759
27,-0.18759
28,-0.18759
29,-0.18759
30,-0.18759
31,-0.18759
32,-0.18759
33,-0.026244999999999997
34,6.8123
35,1.8975
36,0.0234
37,0.010989
38,1.7486
39,6.229
40,-0.18759
41,-0.18759
42,-0.18759
43,-0.18759
44,-0.18759
45,-0.18759
46,-0.18759
47,-0.18759
48,-0.18759
49,-0.18759
50,-0.18759
51,-0.18759
52,-0.18759
53,-0.18759
54,-0.18759
55,-0.18759
56,-0.18759
57,-0.18759
58,-0.18759
59,-0.18759
60,-0.18759
61,-0.18759
62,-0.18759
63,-0.18759
64,-0.18759
65,-0.18759
66,-0.18759
67,-0.18759
68,-0.18759
69,-0.18759
70,-0.18759
71,-0.18759
72,-0.18759
73,-0.18759
74,-0.18759
75,-0.18759
76,-0.18759
77,-0.18759
78,-0.18759
79,-0.18759
80,-0.18759
81,-0.18759
82,-0.18759
83,-0.18759
84,-0.18759
85,-0.18759
86,-0.18759
87,-0.18759
88,-0.18759
89,-0.18759
90,-0.18759
91,-0.18759
92,-0.18759
93,-0.18759
94,-0.18759
95,-0.18759
