time,value
0,-1.2616
1,-1.2091
2,-1.1459
3,-1.0727
4,-0.9904299999999999
5,-0.90059
6,-0.80475
7,-0.7048
8,-0.60239
9,-0.49875
10,-0.39501
11,-0.29212
12,-0.19091
13,-0.092185
14,0.0029717
15,0.09399099999999999
16,0.18007
17,0.2604
18,0.33421
19,0.40078
20,0.45932
21,0.50948
22,0.5512
23,0.5845600000000001
24,0.6098
25,0.6272399999999999
26,0.63715
27,0.63967
28,0.63532
29,0.62445
30,0.60746
31,0.5847600000000001
32,0.55688
33,0.52412
34,0.48741
35,0.44773
36,0.40612
37,0.36365
38,0.32129
39,0.2797
40,0.23936
41,0.20081
42,0.16426
43,0.12965
44,0.096743
45,0.06515800000000001
46,0.033956
47,0.0029803
48,-0.028151999999999996
49,-0.059741999999999996
50,-0.092011
51,-0.12512
52,-0.15947
53,-0.19518
54,-0.23196
55,-0.26961
56,-0.30782
57,-0.34626
58,-0.3846
59,-0.42296999999999996
60,-0.46052
61,-0.49676000000000003
62,-0.5312399999999999
63,-0.5635899999999999
64,-0.59364
65,-0.62192
66,-0.64841
67,-0.67307
68,-0.69607
69,-0.71758
70,-0.73777
71,-0.7570899999999999
72,-0.7761
73,-0.794
74,-0.8106
75,-0.82568
76,-0.83904
77,-0.85056
78,-0.86145
79,-0.87064
80,-0.8780100000000001
81,-0.88374
82,-0.88808
83,-0.89131
84,-0.89445
85,-0.8977799999999999
86,-0.90022
87,-0.90171
88,-0.9022
89,-0.9016299999999999
90,-0.89995
91,-0.89907
92,-0.8968
93,-0.8930799999999999
94,-0.8880100000000001
95,-0.88175
96,-0.8745299999999999
97,-0.86779
98,-0.86124
99,-0.8539399999999999
100,-0.8458100000000001
101,-0.8367700000000001
102,-0.82675
103,-0.81599
104,-0.80604
105,-0.79482
106,-0.7821100000000001
107,-0.76775
108,-0.75169
109,-0.7340300000000001
110,-0.71675
111,-0.69913
112,-0.6804600000000001
113,-0.66072
114,-0.6398699999999999
115,-0.61798
116,-0.5959800000000001
117,-0.57547
118,-0.55462
119,-0.53327
120,-0.51126
121,-0.4885
122,-0.46508999999999995
123,-0.4438
124,-0.42318
125,-0.40278
126,-0.38245
127,-0.36208
128,-0.34164
129,-0.32245999999999997
130,-0.30557
131,-0.28945
132,-0.27387
133,-0.25859
134,-0.24338
135,-0.22821
136,-0.21581999999999998
137,-0.20414000000000002
138,-0.19291
139,-0.18185
140,-0.17065
141,-0.15907000000000002
142,-0.14828
143,-0.13821
144,-0.12766
145,-0.11612
146,-0.10312
147,-0.08822100000000001
148,-0.071427
149,-0.054194000000000006
150,-0.034991
151,-0.013609999999999999
152,0.010117000000000001
153,0.036291000000000004
154,0.064921
155,0.094783
156,0.12625999999999998
157,0.15993
158,0.19613
159,0.23526
160,0.27784000000000003
161,0.324
162,0.3736
163,0.42799
164,0.48768
165,0.55308
166,0.62437
167,0.70148
168,0.7832399999999999
169,0.86975
170,0.9605
171,1.0547
172,1.1516
173,1.2501
174,1.3492
175,1.4477
176,1.5455
177,1.6418
178,1.736
179,1.8274
180,1.9151
181,1.9978
182,2.0753
183,2.1467
184,2.2109
185,2.2672
186,2.3145
187,2.3518
188,2.3789
189,2.3959
190,2.4026
191,2.3993
192,2.3862
193,2.364
194,2.333
195,2.2948
196,2.2503
197,2.2004
198,2.146
199,2.0879
200,2.0267
201,1.9636
202,1.8995
203,1.8349
204,1.7702
205,1.7053
206,1.6401
207,1.5743
208,1.5081
209,1.4411
210,1.3726
211,1.3021
212,1.2289
213,1.1523
214,1.0728
215,0.99065
216,0.90595
217,0.81907
218,0.73052
219,0.64065
220,0.55043
221,0.46121
222,0.37369
223,0.28841999999999995
224,0.20583
225,0.12623
226,0.049066000000000005
227,-0.024334
228,-0.094051
229,-0.16036
230,-0.22364
231,-0.28431999999999996
232,-0.34338
233,-0.40054
234,-0.45548999999999995
235,-0.50861
236,-0.5602600000000001
237,-0.61075
238,-0.66052
239,-0.71029
240,-0.75839
241,-0.80484
242,-0.8497100000000001
243,-0.8930899999999999
244,-0.9349700000000001
245,-0.97639
246,-1.0157
247,-1.0522
248,-1.0859
249,-1.1171
250,-1.1462
251,-1.1739
252,-1.2008
253,-1.2253
254,-1.2476
255,-1.2682
256,-1.2875
257,-1.3057
258,-1.3244
259,-1.341
260,-1.3551
261,-1.3665
262,-1.3755
263,-1.3821
264,-1.3873
265,-1.3911
266,-1.3923
267,-1.3915
268,-1.3895
269,-1.3871
