[<text>
<title>general development corp &lt;cdv&gt; 3rd qtr net</title>
<dateline>    miami, oct 20 -
    </dateline>shr 66 cts vs 61 cts
    net 5,928,000 vs 5,447,000
    revs 126.0 mln vs 89.8 mln
    avg shrs 8,948,000 vs 8,947,000
    nine mths
    shr 1.96 dlrs vs 1.96 dlrs
    net 17.5 mln vs 16.3 mln
    revs 343.9 mln vs 286.9 mln
    avg shrs 8,948,000 vs 8,300,000
 reuter
</text>]