time,value
0,-1.3327
1,-1.3327
2,-1.3327
3,-1.3327
4,-1.3327
5,-1.3327
6,0.80472
7,1.2118
8,1.0083
9,0.9065
10,0.80472
11,0.80472
12,0.70294
13,0.70294
14,0.80472
15,0.70294
16,0.70294
17,0.70294
18,0.70294
19,0.70294
20,0.70294
21,0.70294
22,0.70294
23,0.70294
24,0.09224
25,-1.3327
26,-1.3327
27,-1.3327
28,-1.3327
29,-1.3327
30,-1.3327
31,-1.3327
32,-1.3327
33,-1.3327
34,-1.3327
35,0.70294
36,1.2118
37,1.0083
38,0.9065
39,0.80472
40,0.80472
41,0.70294
42,0.70294
43,0.70294
44,0.70294
45,0.70294
46,0.70294
47,0.70294
48,0.70294
49,0.60115
50,0.70294
51,-0.62024
52,-1.3327
53,-1.3327
54,-1.3327
55,-1.3327
56,-1.3327
57,-1.3327
58,-1.3327
59,-1.3327
60,0.29581
61,1.2118
62,1.0083
63,0.9065
64,0.80472
65,0.70294
66,0.80472
67,0.70294
68,0.70294
69,0.70294
70,0.70294
71,0.70294
72,0.60115
73,0.70294
74,0.70294
75,0.70294
76,0.60115
77,0.70294
78,0.70294
79,0.60115
80,0.70294
81,0.60115
82,0.70294
83,0.70294
84,0.60115
85,-0.72202
86,-1.3327
87,-1.3327
88,-1.3327
89,-1.3327
90,-1.3327
91,-1.3327
92,-1.3327
93,-1.3327
94,-1.3327
95,0.9065
