time,value
0,-1.1861
1,0.38133
2,-0.81416
3,-2.0593
4,-1.8652
5,-1.0597
6,-0.9410700000000001
7,-1.4489
8,-1.7353
9,-1.4979
10,-1.2478
11,-1.3405
12,-1.5485
13,-1.5676
14,-1.4318
15,-1.3865
16,-1.4433
17,-1.4896
18,-1.4589
19,-1.4169
20,-1.4163
21,-1.4187
22,-1.4161
23,-1.3962
24,-1.4008
25,-1.3877
26,-1.3874
27,-1.3814
28,-1.3748
29,-1.3749
30,-1.3609
31,-1.3656
32,-1.3517
33,-1.3543
34,-1.3462
35,-1.3415
36,-1.339
37,-1.3279
38,-1.3330000000000002
39,-1.321
40,-1.3301
41,-1.325
42,-1.3285
43,-1.3303
44,-1.3276
45,-1.3358
46,-1.3265
47,-1.3396
48,-1.3336
49,-1.3393
50,-1.3375
51,-1.3347
52,-1.3378
53,-1.327
54,-1.3348
55,-1.3241
56,-1.3308
57,-1.3267
58,-1.3265
59,-1.3278
60,-1.3196
61,-1.3258
62,-1.3132
63,-1.3214
64,-1.3139
65,-1.3146
66,-1.3123
67,-1.3049
68,-1.3076
69,-1.2928
70,-1.3008
71,-1.2899
72,-1.2915
73,-1.2854
74,-1.2791
75,-1.2786
76,-1.2644
77,-1.2679
78,-1.2514
79,-1.2517
80,-1.2401
81,-1.2329
82,-1.2266
83,-1.2078
84,-1.1962
85,-1.1563
86,-1.1317
87,-1.0908
88,-1.0641
89,-1.0402
90,-1.0148
91,-1.0002
92,-0.97016
93,-0.9667100000000001
94,-0.94886
95,-0.94645
96,-0.9355
97,-0.92332
98,-0.9171600000000001
99,-0.9002100000000001
100,-0.90394
101,-0.88936
102,-0.8924200000000001
103,-0.88307
104,-0.87885
105,-0.87556
106,-0.8631200000000001
107,-0.8650100000000001
108,-0.84925
109,-0.85716
110,-0.8474
111,-0.8444799999999999
112,-0.83616
113,-0.82519
114,-0.8266600000000001
115,-0.81219
116,-0.81926
117,-0.80608
118,-0.80778
119,-0.80229
120,-0.79783
121,-0.79757
122,-0.78362
123,-0.78798
124,-0.7733399999999999
125,-0.77795
126,-0.76948
127,-0.7661899999999999
128,-0.76276
129,-0.75036
130,-0.75139
131,-0.7327199999999999
132,-0.73745
133,-0.7246100000000001
134,-0.72167
135,-0.71378
136,-0.70175
137,-0.69898
138,-0.67942
139,-0.68228
140,-0.6652100000000001
141,-0.66237
142,-0.64991
143,-0.63864
144,-0.63274
145,-0.61512
146,-0.61568
147,-0.59601
148,-0.59558
149,-0.58227
150,-0.5761
151,-0.56989
152,-0.55492
153,-0.55314
154,-0.5333100000000001
155,-0.5395
156,-0.5284800000000001
157,-0.5273899999999999
158,-0.52054
159,-0.5115
160,-0.51293
161,-0.49903000000000003
162,-0.50703
163,-0.49586
164,-0.50142
165,-0.49878
166,-0.49885
167,-0.50358
168,-0.49813999999999997
169,-0.51178
170,-0.5070100000000001
171,-0.52274
172,-0.52574
173,-0.53766
174,-0.55002
175,-0.55556
176,-0.57436
177,-0.5768399999999999
178,-0.6071300000000001
179,-0.62153
180,-0.6480600000000001
181,-0.66887
182,-0.6865100000000001
183,-0.70839
184,-0.71025
185,-0.73329
186,-0.74564
187,-0.7862600000000001
188,-0.8228
189,-0.85734
190,-0.88505
191,-0.8960899999999999
192,-0.92465
193,-0.9373
194,-0.97006
195,-0.98556
196,-1.0074
197,-1.0302
198,-1.0502
199,-1.0818
200,-1.0908
201,-1.1209
202,-1.1351
203,-1.1668
204,-1.1944
205,-1.216
206,-1.2373
207,-1.2405
208,-1.2664
209,-1.2776
210,-1.3068
211,-1.3247
212,-1.3447
213,-1.3673
214,-1.38
215,-1.4081
216,-1.4167
217,-1.4444
218,-1.4564
219,-1.4748
220,-1.4912
221,-1.5016
222,-1.5215
223,-1.5187
224,-1.5352
225,-1.5315
226,-1.5414
227,-1.5471
228,-1.5508
229,-1.5576
230,-1.5451
231,-1.5485
232,-1.5311
233,-1.5295
234,-1.5181
235,-1.5111
236,-1.5072
237,-1.4929
238,-1.4934
239,-1.4747
240,-1.4759
241,-1.4611
242,-1.4515
243,-1.4375
244,-1.4147
245,-1.3993
246,-1.3616
247,-1.3444
248,-1.3093
249,-1.2894
250,-1.266
251,-1.2421
252,-1.2249
253,-1.1947
254,-1.186
255,-1.1607
256,-1.1523
257,-1.1337
258,-1.1196
259,-1.11
260,-1.092
261,-1.0893
262,-1.0672
263,-1.0661
264,-1.0512
265,-1.0459
266,-1.0393
267,-1.0270000000000001
268,-1.0247
269,-1.0036
270,-1.0053
271,-0.9879100000000001
272,-0.9822799999999999
273,-0.9685600000000001
274,-0.95314
275,-0.94378
276,-0.9205399999999999
277,-0.9165700000000001
278,-0.8933700000000001
279,-0.88754
280,-0.8707799999999999
281,-0.8590200000000001
282,-0.85
283,-0.8320799999999999
284,-0.82919
285,-0.80719
286,-0.8074100000000001
287,-0.79297
288,-0.78901
289,-0.78366
290,-0.77449
291,-0.77625
292,-0.76079
293,-0.7690899999999999
294,-0.75937
295,-0.7639
296,-0.76149
297,-0.75969
298,-0.76455
299,-0.75745
300,-0.77031
301,-0.76455
302,-0.7762899999999999
303,-0.7754800000000001
304,-0.78045
305,-0.78935
306,-0.7925
307,-0.81021
308,-0.80576
309,-0.8203
310,-0.81907
311,-0.83231
312,-0.84735
313,-0.86077
314,-0.8836
315,-0.8884
316,-0.91579
317,-0.92422
318,-0.9470299999999999
319,-0.96283
320,-0.98111
321,-1.0049
322,-1.013
323,-1.0344
324,-1.0322
325,-1.0466
326,-1.048
327,-1.0539
328,-1.0591
329,-1.0547
330,-1.0638
331,-1.0534
332,-1.0648
333,-1.0578
334,-1.0598
335,-1.0575
336,-1.052
337,-1.0561
338,-1.0426
339,-1.0507
340,-1.0392
341,-1.0423
342,-1.0369
343,-1.0316
344,-1.03
345,-1.0146
346,-1.0161
347,-0.99671
348,-0.9947600000000001
349,-0.9792700000000001
350,-0.9696299999999999
351,-0.9606299999999999
352,-0.94253
353,-0.9364399999999999
354,-0.9092
355,-0.9043399999999999
356,-0.88189
357,-0.8695
358,-0.8522700000000001
359,-0.8307100000000001
360,-0.8183600000000001
361,-0.7896
362,-0.78384
363,-0.7590600000000001
364,-0.74933
365,-0.73087
366,-0.71402
367,-0.70275
368,-0.6791699999999999
369,-0.67325
370,-0.64625
371,-0.63759
372,-0.61452
373,-0.59691
374,-0.57886
375,-0.55189
376,-0.53841
377,-0.505
378,-0.49573
379,-0.46735
380,-0.44893999999999995
381,-0.42577
382,-0.39966
383,-0.38216
384,-0.34528000000000003
385,-0.3287
386,-0.29236
387,-0.27453
388,-0.24943
389,-0.22563000000000002
390,-0.20435999999999999
391,-0.16908
392,-0.15252000000000002
393,-0.11655
394,-0.10167999999999999
395,-0.072368
396,-0.051031
397,-0.03311
398,-0.012637
399,-0.010579999999999999
400,0.010724
401,0.009072799999999999
402,0.031999
403,0.048371
404,0.073258
405,0.10167999999999999
406,0.11994
407,0.15407
408,0.1648
409,0.19627999999999998
410,0.21049
411,0.23388
412,0.25309
413,0.26621
414,0.2906
415,0.29596999999999996
416,0.32238
417,0.32683
418,0.34718000000000004
419,0.36089
420,0.37675
421,0.40095
422,0.41134
423,0.44246
424,0.44693999999999995
425,0.47336000000000006
426,0.48868
427,0.51062
428,0.53415
429,0.5484399999999999
430,0.58032
431,0.5898899999999999
432,0.62011
433,0.63054
434,0.65108
435,0.66828
436,0.6806
437,0.70153
438,0.69976
439,0.71716
440,0.71157
441,0.7230300000000001
442,0.72553
443,0.72842
444,0.73788
445,0.7348
446,0.7539899999999999
447,0.7461899999999999
448,0.75978
449,0.7601600000000001
450,0.76822
451,0.77846
452,0.78114
453,0.80097
454,0.79899
455,0.81918
456,0.82057
457,0.83347
458,0.84111
459,0.8440200000000001
460,0.85582
461,0.84746
462,0.85835
463,0.84311
464,0.84211
465,0.8285600000000001
466,0.8144899999999999
467,0.80399
468,0.7790100000000001
469,0.7729
470,0.7387600000000001
471,0.7256
472,0.6987399999999999
473,0.68077
474,0.6642600000000001
475,0.64081
476,0.633
477,0.60365
478,0.59641
479,0.57045
480,0.55748
481,0.53932
482,0.51846
483,0.5071899999999999
484,0.47858
485,0.47116
486,0.44001
487,0.42703
488,0.40471999999999997
489,0.38626
490,0.37301999999999996
491,0.34739000000000003
492,0.34024
493,0.30609000000000003
494,0.29275
495,0.26471
496,0.24488000000000001
497,0.2245
498,0.19741
499,0.18583
500,0.15507
501,0.14740999999999999
502,0.12180999999999999
503,0.11032
504,0.094711
505,0.079148
506,0.074629
507,0.054777
508,0.055258
509,0.030797
510,0.022949
511,0.004466899999999999
512,-0.0104
513,-0.020723
514,-0.042358
515,-0.045592
516,-0.073646
517,-0.080318
518,-0.1007
519,-0.11147
520,-0.12197999999999999
521,-0.1381
522,-0.13969
523,-0.16047999999999998
524,-0.15952
525,-0.17745
526,-0.18257
527,-0.19376
528,-0.20595
529,-0.20795999999999998
530,-0.22443000000000002
531,-0.22036
532,-0.24058000000000002
533,-0.24259
534,-0.25332
535,-0.25829
536,-0.25766999999999995
537,-0.26688
538,-0.2566
539,-0.26891
540,-0.25903000000000004
541,-0.26308000000000004
542,-0.25771
543,-0.25228
544,-0.2519
545,-0.23708
546,-0.24136999999999997
547,-0.22404000000000002
548,-0.22553
549,-0.21300999999999998
550,-0.20614000000000002
551,-0.20026
552,-0.18467
553,-0.18239
554,-0.15682000000000001
555,-0.15331
556,-0.13017
557,-0.11682999999999999
558,-0.09855
559,-0.074909
560,-0.060762000000000004
561,-0.028189999999999996
562,-0.019923
563,0.0087269
564,0.021483000000000002
565,0.042177
566,0.060610000000000004
567,0.073064
568,0.10029
569,0.10920999999999999
570,0.13902
571,0.14686
572,0.16735999999999998
573,0.18183
574,0.1964
575,0.22011999999999998
576,0.22851
577,0.25801999999999997
578,0.26261999999999996
579,0.28636
580,0.29865
581,0.31536
582,0.33641
583,0.34783000000000003
584,0.37756999999999996
585,0.38299999999999995
586,0.41008999999999995
587,0.42208999999999997
588,0.44498000000000004
589,0.46671999999999997
590,0.4829
591,0.51261
592,0.52315
593,0.55597
594,0.5674600000000001
595,0.59338
596,0.61156
597,0.62841
598,0.65262
599,0.6610199999999999
600,0.69087
601,0.69405
602,0.71687
603,0.7269
604,0.74165
605,0.75988
606,0.76856
607,0.79608
608,0.7996300000000001
609,0.82573
610,0.83529
611,0.8561799999999999
612,0.87549
613,0.89
614,0.91784
615,0.9254600000000001
616,0.95481
617,0.96101
618,0.9832200000000001
619,0.99835
620,1.0142
621,1.0382
622,1.047
623,1.0787
624,1.0833
625,1.1101
626,1.1244
627,1.145
628,1.1692
629,1.1847
630,1.2196
631,1.2305
632,1.2645
633,1.2799
634,1.3058
635,1.3276
636,1.3436
637,1.3724
638,1.3814
639,1.4137
640,1.422
641,1.4466
642,1.4624
643,1.4792
644,1.5046
645,1.516
646,1.5509
647,1.557
648,1.5859
649,1.6016
650,1.6248
651,1.6507
652,1.6675
653,1.7025
654,1.7117
655,1.7416
656,1.7487
657,1.7654
658,1.7773
659,1.785
660,1.8055
661,1.8068
662,1.8326
663,1.8351
664,1.8566
665,1.869
666,1.883
667,1.9032
668,1.9062
669,1.9276
670,1.9153
671,1.9244
672,1.919
673,1.9213
674,1.9246
675,1.9198
676,1.9367
677,1.9324
678,1.9518
679,1.9469
680,1.952
681,1.9527
682,1.952
683,1.9642
684,1.955
685,1.9673
686,1.9535
687,1.9606
688,1.9597
689,1.9621
690,1.972
691,1.9699
692,1.9932
693,1.9868
694,2.0014
695,2.0003
696,2.0151
697,2.0415
698,2.0627
699,2.0919
700,2.0824
701,2.0906
702,2.0819
703,2.0933
704,2.0979
705,2.0918
706,2.0914
707,2.0727
708,2.0818
709,2.0669999999999997
710,2.0715
711,2.0646
712,2.0615
713,2.0654
714,2.0566
715,2.0684
716,2.0488
717,2.0491
718,2.0299
719,2.0179
720,2.005
721,1.984
722,1.9788
723,1.95
724,1.9453
725,1.9199
726,1.9102
727,1.8955
728,1.8793
729,1.8736
730,1.8489
731,1.8459999999999999
732,1.8145
733,1.8015
734,1.7762
735,1.7551
736,1.7394
737,1.7114
738,1.704
739,1.6686
740,1.6577
741,1.6315
742,1.6165
743,1.6013
744,1.5801
745,1.5755
746,1.5499
747,1.5486
748,1.5254
749,1.5165
750,1.5006
751,1.4829
752,1.4742
753,1.4474
754,1.4428
755,1.4117
756,1.4016
757,1.3807
758,1.3653
759,1.3548
760,1.3333
761,1.3321
762,1.3041
763,1.2984
764,1.2751
765,1.2619
766,1.2479
767,1.2284
768,1.2234
769,1.1964
770,1.1915
771,1.1646
772,1.1531
773,1.1345
774,1.1148
775,1.103
776,1.0739
777,1.0659
778,1.0307
779,1.0155
780,0.9882700000000001
781,0.96639
782,0.94845
783,0.9203899999999999
784,0.9118200000000001
785,0.87803
786,0.8666200000000001
787,0.83845
788,0.8216600000000001
789,0.80481
790,0.7846
791,0.77946
792,0.75446
793,0.75208
794,0.7286100000000001
795,0.7218
796,0.7089
797,0.69628
798,0.69166
799,0.6715
800,0.67386
801,0.6510699999999999
802,0.64984
803,0.63723
804,0.63069
805,0.6282800000000001
806,0.61705
807,0.62533
808,0.6101300000000001
809,0.61802
810,0.6100399999999999
811,0.61353
812,0.61522
813,0.61203
814,0.6218
815,0.61197
816,0.6239
817,0.61366
818,0.61831
819,0.61503
820,0.61197
821,0.6166699999999999
822,0.60648
823,0.6168600000000001
824,0.5999800000000001
825,0.60283
826,0.59282
827,0.58765
828,0.58372
829,0.56942
830,0.57238
831,0.55204
832,0.55309
833,0.5364899999999999
834,0.53088
835,0.5233300000000001
836,0.5121399999999999
837,0.51268
838,0.4935
839,0.49517
840,0.47467
841,0.46925
842,0.45466000000000006
843,0.44051
844,0.43393999999999994
845,0.41434
846,0.41505
847,0.38759
848,0.37936
849,0.35843
850,0.34467
851,0.33305999999999997
852,0.31251
853,0.30823
854,0.28158
855,0.2766
856,0.25415
857,0.24273000000000003
858,0.22774
859,0.20938
860,0.20253
861,0.17800000000000002
862,0.17428
863,0.14819000000000002
864,0.13772
865,0.11873
866,0.10177
867,0.091306
868,0.06755499999999999
869,0.06287000000000001
870,0.030893
871,0.019546
872,-0.0037405
873,-0.019234
874,-0.033813
875,-0.057504999999999994
876,-0.0669
877,-0.097945
878,-0.10801
879,-0.13684000000000002
880,-0.15748
881,-0.18533
882,-0.21593
883,-0.23192
884,-0.25961999999999996
885,-0.26447
886,-0.29178000000000004
887,-0.30401999999999996
888,-0.32471
889,-0.34241
890,-0.35444000000000003
891,-0.37886
892,-0.38339
893,-0.41252
894,-0.42202
895,-0.44719
896,-0.4677
897,-0.48746999999999996
898,-0.51168
899,-0.51748
900,-0.54152
901,-0.5440699999999999
902,-0.56342
903,-0.56975
904,-0.5786399999999999
905,-0.58885
906,-0.5886
907,-0.60422
908,-0.5988
909,-0.61379
910,-0.61124
911,-0.6169899999999999
912,-0.6204
913,-0.61846
914,-0.6276
915,-0.61715
916,-0.63089
917,-0.62451
918,-0.6310399999999999
919,-0.62946
920,-0.62629
921,-0.62943
922,-0.6177
923,-0.62529
924,-0.61102
925,-0.61315
926,-0.60346
927,-0.59891
928,-0.5965199999999999
929,-0.58277
930,-0.58377
931,-0.56493
932,-0.56886
933,-0.55453
934,-0.54628
935,-0.53478
936,-0.52055
937,-0.51965
938,-0.49673999999999996
939,-0.4908
940,-0.45866999999999997
941,-0.43978
942,-0.41748999999999997
943,-0.39885
944,-0.38795
945,-0.36094
946,-0.35202
947,-0.32159
948,-0.30963
949,-0.2856
950,-0.2654
951,-0.24495999999999998
952,-0.21199
953,-0.19355999999999998
954,-0.15534
955,-0.14181
956,-0.11184000000000001
957,-0.09228
958,-0.072491
959,-0.05139
960,-0.042983
961,-0.013036
962,-0.004221
963,0.025601
964,0.037602
965,0.053742
966,0.06907999999999999
967,0.080136
968,0.10786
969,0.11404
970,0.13827
971,0.14314000000000002
972,0.16637000000000002
973,0.18939
974,0.20945
975,0.23525
976,0.24895
977,0.29581
978,0.3229
979,0.35486
980,0.35945
981,0.37401999999999996
982,0.42573
983,0.49321000000000004
984,0.57053
985,0.5861
986,0.5949
987,0.5895699999999999
988,0.60853
989,0.63169
990,0.6401600000000001
991,0.65605
992,0.65433
993,0.67901
994,0.68197
995,0.69439
996,0.6994
997,0.70563
998,0.72238
999,0.72263
1000,0.74366
1001,0.7400800000000001
1002,0.7566
1003,0.76161
1004,0.77042
1005,0.78304
1006,0.78504
1007,0.80471
1008,0.79813
1009,0.812
1010,0.80857
1011,0.81388
1012,0.8158
1013,0.8104399999999999
1014,0.81724
1015,0.80347
1016,0.81092
1017,0.79655
1018,0.79683
1019,0.78991
1020,0.78265
1021,0.78294
1022,0.76784
1023,0.77389
1024,0.75393
1025,0.7532
1026,0.73855
1027,0.7267399999999999
1028,0.71563
1029,0.6940000000000001
1030,0.6897
1031,0.65996
1032,0.64895
1033,0.6189899999999999
1034,0.60021
1035,0.58007
1036,0.5532600000000001
1037,0.5329999999999999
1038,0.4893
1039,0.46903999999999996
1040,0.43386
1041,0.41884
1042,0.39525
1043,0.36965
1044,0.3513
1045,0.32164
1046,0.31439
1047,0.28010999999999997
1048,0.26485
1049,0.23713
1050,0.21556999999999998
1051,0.19513
1052,0.16548
1053,0.15450999999999998
1054,0.12245999999999999
1055,0.11107
1056,0.080103
1057,0.05980599999999999
1058,0.038895
1059,0.015402
1060,0.001438
1061,-0.033727999999999994
1062,-0.046146
1063,-0.074338
1064,-0.08164500000000001
1065,-0.096111
1066,-0.11085999999999999
1067,-0.11802
1068,-0.13521
1069,-0.12830999999999998
1070,-0.12170999999999998
1071,-0.12796
1072,-0.17985
1073,-0.1838
1074,-0.11092
1075,-0.059592
1076,-0.14705
1077,-0.26921999999999996
1078,-0.16575
1079,0.067009
1080,0.05825
1081,-0.28815
1082,-0.4161
1083,0.042655
1084,0.47436000000000006
1085,0.039367
1086,-0.83865
1087,-0.59354
1088,1.0153
1089,1.6633
1090,-1.3251
1091,-7.4303
