time,value
0,-0.2689
1,-0.2689
2,-0.2689
3,-0.2689
4,-0.2689
5,-0.2689
6,-0.2689
7,-0.2689
8,-0.2689
9,-0.2689
10,-0.2689
11,-0.2689
12,-0.2689
13,-0.2689
14,-0.2689
15,-0.2689
16,-0.2689
17,-0.2689
18,-0.2689
19,-0.2689
20,-0.2689
21,-0.2689
22,-0.2689
23,-0.2689
24,-0.2689
25,-0.2689
26,-0.2689
27,3.6884
28,-0.2689
29,-0.2689
30,-0.2689
31,-0.2689
32,-0.2689
33,-0.2689
34,-0.2689
35,3.5043
36,2.1699
37,-0.2689
38,-0.2689
39,-0.2689
40,-0.2689
41,-0.2689
42,2.0319
43,-0.2689
44,-0.2689
45,4.6547
46,-0.2689
47,-0.2689
48,-0.2689
49,-0.2689
50,-0.2689
51,-0.2689
52,-0.2689
53,-0.2689
54,-0.2689
55,-0.2689
56,-0.2689
57,-0.2689
58,-0.2689
59,-0.2689
60,-0.2689
61,-0.2689
62,-0.2689
63,-0.2689
64,-0.2689
65,-0.2689
66,-0.2689
67,-0.2689
68,-0.2689
69,-0.2689
70,-0.2689
71,1.7097
72,0.51336
73,-0.2689
74,-0.2689
75,-0.2689
76,-0.2689
77,-0.2689
78,-0.2689
79,-0.2689
80,-0.2689
81,5.391
82,-0.2689
83,-0.2689
84,-0.2689
85,-0.2689
86,-0.2689
87,-0.2689
88,-0.2689
89,-0.2689
90,-0.2689
91,-0.2689
92,-0.2689
93,-0.2689
94,-0.2689
95,-0.2689
