time,value
0,-1.1254
1,0.37538
2,-0.16207
3,-1.3864
4,-2.0098
5,-1.702
6,-1.0672
7,-0.83334
8,-1.1287
9,-1.5528
10,-1.6926
11,-1.5037
12,-1.2807
13,-1.2664
14,-1.4203
15,-1.5607
16,-1.5582
17,-1.4534
18,-1.3908
19,-1.4118
20,-1.4627
21,-1.4898
22,-1.4647
23,-1.4232
24,-1.4116
25,-1.4144
26,-1.416
27,-1.4138
28,-1.4003
29,-1.3994
30,-1.3969
31,-1.3834
32,-1.3882
33,-1.3867
34,-1.3769
35,-1.3877
36,-1.3882
37,-1.3858
38,-1.3987
39,-1.4009
40,-1.4053
41,-1.4188
42,-1.4199
43,-1.4273
44,-1.4367
45,-1.4329
46,-1.4405
47,-1.4441
48,-1.4341
49,-1.4401
50,-1.4353
51,-1.4191
52,-1.4195
53,-1.4067
54,-1.3895
55,-1.385
56,-1.3676
57,-1.3515
58,-1.3419999999999999
59,-1.3191
60,-1.3032
61,-1.2891
62,-1.2628
63,-1.2503
64,-1.2346
65,-1.2073
66,-1.1991
67,-1.1817
68,-1.1559
69,-1.1482
70,-1.1289
71,-1.1073
72,-1.0992
73,-1.0802
74,-1.0651
75,-1.0577
76,-1.0379
77,-1.026
78,-1.0147
79,-0.9909
80,-0.98165
81,-0.9688100000000001
82,-0.9452200000000001
83,-0.9423799999999999
84,-0.9305100000000001
85,-0.9123600000000001
86,-0.9128200000000001
87,-0.90325
88,-0.89391
89,-0.89831
90,-0.89228
91,-0.8917299999999999
92,-0.8985299999999999
93,-0.8942399999999999
94,-0.9009999999999999
95,-0.90953
96,-0.9072399999999999
97,-0.9213399999999999
98,-0.93053
99,-0.92809
100,-0.9461
101,-0.95263
102,-0.95231
103,-0.96816
104,-0.9716600000000001
105,-0.9739200000000001
106,-0.98618
107,-0.9850399999999999
108,-0.9880899999999999
109,-0.9960399999999999
110,-0.992
111,-0.9989899999999999
112,-1.0047
113,-0.99734
114,-1.0055
115,-1.0078
116,-1.0002
117,-1.0141
118,-1.0146
119,-1.0069
120,-1.0133
121,-1.0092
122,-1.0097
123,-1.0236
124,-1.0258
125,-1.0322
126,-1.0417
127,-1.0407
128,-1.0547
129,-1.0688
130,-1.0697
131,-1.0853
132,-1.0941
133,-1.0969
134,-1.1247
135,-1.1416
136,-1.1504
137,-1.1695
138,-1.1765
139,-1.1894
140,-1.2163
141,-1.2309999999999999
142,-1.2467
143,-1.2586
144,-1.2553
145,-1.2662
146,-1.2779
147,-1.2784
148,-1.294
149,-1.2984
150,-1.2928
151,-1.3081
152,-1.3128
153,-1.3121
154,-1.3219999999999998
155,-1.3175
156,-1.3155
157,-1.3241
158,-1.3224
159,-1.3286
160,-1.3361
161,-1.3306
162,-1.3385
163,-1.3436
164,-1.3368
165,-1.3476
166,-1.3481
167,-1.3392
168,-1.3486
169,-1.3464
170,-1.3409
171,-1.3476
172,-1.341
173,-1.3358
174,-1.337
175,-1.3252
176,-1.3214
177,-1.3196
178,-1.3061
179,-1.3063
180,-1.3016
181,-1.2836
182,-1.284
183,-1.2749
184,-1.2588
185,-1.2605
186,-1.249
187,-1.2329
188,-1.2274
189,-1.2104
190,-1.1995
191,-1.1985
192,-1.1865
193,-1.1832
194,-1.1793
195,-1.1624
196,-1.1607
197,-1.1549
198,-1.1374
199,-1.1398
200,-1.1318
201,-1.117
202,-1.1194
203,-1.1094
204,-1.0965
205,-1.0938
206,-1.0791
207,-1.0702
208,-1.069
209,-1.0561
210,-1.0523
211,-1.047
212,-1.0284
213,-1.0254
214,-1.0172
215,-0.9973299999999999
216,-0.9980700000000001
217,-0.98665
218,-0.96834
219,-0.9662200000000001
220,-0.9522
221,-0.9377700000000001
222,-0.93421
223,-0.91853
224,-0.90866
225,-0.9046
226,-0.88899
227,-0.8852700000000001
228,-0.8815
229,-0.8663299999999999
230,-0.8688299999999999
231,-0.86569
232,-0.85221
233,-0.8599700000000001
234,-0.85596
235,-0.8461200000000001
236,-0.85131
237,-0.84395
238,-0.83686
239,-0.83972
240,-0.83011
241,-0.82663
242,-0.8272
243,-0.81567
244,-0.81725
245,-0.81876
246,-0.80997
247,-0.82032
248,-0.82365
249,-0.8164
250,-0.82857
251,-0.8281799999999999
252,-0.8229700000000001
253,-0.83241
254,-0.82924
255,-0.82689
256,-0.83295
257,-0.82604
258,-0.8264799999999999
259,-0.83062
260,-0.8229799999999999
261,-0.82891
262,-0.8324299999999999
263,-0.82399
264,-0.83416
265,-0.8356100000000001
266,-0.82731
267,-0.8379700000000001
268,-0.8363
269,-0.8309799999999999
270,-0.83936
271,-0.8348899999999999
272,-0.83229
273,-0.8376899999999999
274,-0.8307
275,-0.83188
276,-0.8346
277,-0.8240000000000001
278,-0.8276399999999999
279,-0.8299799999999999
280,-0.82347
281,-0.83801
282,-0.84149
283,-0.8331700000000001
284,-0.8425299999999999
285,-0.84395
286,-0.8505
287,-0.87623
288,-0.88905
289,-0.8982600000000001
290,-0.90659
291,-0.89828
292,-0.9005299999999999
293,-0.90776
294,-0.9037
295,-0.91202
296,-0.91228
297,-0.89896
298,-0.9072399999999999
299,-0.90685
300,-0.89823
301,-0.90484
302,-0.8962200000000001
303,-0.8846700000000001
304,-0.8867200000000001
305,-0.8780100000000001
306,-0.87424
307,-0.87664
308,-0.8653799999999999
309,-0.8636299999999999
310,-0.86266
311,-0.8494200000000001
312,-0.85201
313,-0.84877
314,-0.83245
315,-0.8365600000000001
316,-0.8285299999999999
317,-0.81255
318,-0.813
319,-0.8
320,-0.78463
321,-0.77983
322,-0.76149
323,-0.74758
324,-0.73932
325,-0.718
326,-0.70709
327,-0.6954899999999999
328,-0.67073
329,-0.66243
330,-0.64786
331,-0.6211
332,-0.61639
333,-0.5998
334,-0.57701
335,-0.57105
336,-0.55257
337,-0.53382
338,-0.5263399999999999
339,-0.5065
340,-0.49308
341,-0.48527
342,-0.46468999999999994
343,-0.45602
344,-0.44653999999999994
345,-0.42462
346,-0.42103
347,-0.41063
348,-0.38861
349,-0.38771
350,-0.37421
351,-0.35491999999999996
352,-0.35165
353,-0.33538
354,-0.31923
355,-0.31285
356,-0.29285
357,-0.27934000000000003
358,-0.26978
359,-0.24653000000000003
360,-0.2357
361,-0.22238000000000002
362,-0.19567
363,-0.18804
364,-0.17234000000000002
365,-0.14592
366,-0.14098
367,-0.12389000000000001
368,-0.10265999999999999
369,-0.09779199999999999
370,-0.080424
371,-0.06518600000000001
372,-0.060309
373,-0.042588
374,-0.032974
375,-0.026241000000000004
376,-0.0047326
377,0.0037506
378,0.015675
379,0.040753
380,0.045281999999999996
381,0.05996699999999999
382,0.086896
383,0.095412
384,0.11848
385,0.14585
386,0.15782000000000002
387,0.18323
388,0.20695999999999998
389,0.2231
390,0.2539
391,0.27564
392,0.29406
393,0.32533
394,0.34053
395,0.3594
396,0.39145
397,0.40123000000000003
398,0.4207
399,0.4488
400,0.45598999999999995
401,0.47581
402,0.49778
403,0.50437
404,0.52352
405,0.53822
406,0.54461
407,0.56515
408,0.57596
409,0.58549
410,0.6086199999999999
411,0.61459
412,0.6252
413,0.64922
414,0.65072
415,0.66413
416,0.6859
417,0.68784
418,0.70287
419,0.71935
420,0.72218
421,0.73844
422,0.74908
423,0.75163
424,0.76677
425,0.7691
426,0.76993
427,0.7834899999999999
428,0.77823
429,0.77823
430,0.7903
431,0.77723
432,0.77576
433,0.7804300000000001
434,0.76585
435,0.7646
436,0.76378
437,0.75074
438,0.75165
439,0.74636
440,0.73519
441,0.73765
442,0.72749
443,0.71855
444,0.72343
445,0.70954
446,0.70253
447,0.70662
448,0.68575
449,0.67709
450,0.6735399999999999
451,0.6519
452,0.64304
453,0.63193
454,0.6079899999999999
455,0.5963
456,0.57613
457,0.55061
458,0.5379999999999999
459,0.51077
460,0.48455
461,0.47076
462,0.43686
463,0.41155
464,0.39773000000000003
465,0.3614
466,0.3383
467,0.31984
468,0.28539000000000003
469,0.26574000000000003
470,0.2456
471,0.21631
472,0.20099
473,0.17758
474,0.15174
475,0.14184000000000002
476,0.12061
477,0.10511
478,0.10409000000000002
479,0.08301900000000001
480,0.071686
481,0.07153999999999999
482,0.051569000000000004
483,0.046409
484,0.045771
485,0.030108999999999997
486,0.028288
487,0.024174
488,0.011334
489,0.01168
490,0.0021355999999999997
491,-0.010532
492,-0.0096097
493,-0.022816
494,-0.031177999999999997
495,-0.026541000000000002
496,-0.043693
497,-0.052004999999999996
498,-0.052041
499,-0.072563
500,-0.07971900000000001
501,-0.083699
502,-0.10186
503,-0.10672000000000001
504,-0.11503
505,-0.13109
506,-0.1332
507,-0.14424
508,-0.15598
509,-0.1534
510,-0.16565
511,-0.17256
512,-0.16613
513,-0.18073
514,-0.1836
515,-0.17705
516,-0.18912
517,-0.1878
518,-0.18413
519,-0.19309
520,-0.18724000000000002
521,-0.18420999999999998
522,-0.18792999999999999
523,-0.17872000000000002
524,-0.18051
525,-0.18216
526,-0.16788
527,-0.16776
528,-0.16163
529,-0.14442
530,-0.1523
531,-0.1488
532,-0.1346
533,-0.13407
534,-0.1161
535,-0.095233
536,-0.08809700000000001
537,-0.06905900000000001
538,-0.055598
539,-0.047934
540,-0.025702999999999997
541,-0.014944999999999998
542,-0.005417
543,0.0165
544,0.020603
545,0.032099
546,0.058159
547,0.060979
548,0.07545700000000001
549,0.095474
550,0.097496
551,0.1153
552,0.13813
553,0.15337
554,0.1844
555,0.20911999999999997
556,0.22673000000000001
557,0.2573
558,0.27636
559,0.29812
560,0.33496
561,0.3537
562,0.37971
563,0.41808999999999996
564,0.43393999999999994
565,0.46268000000000004
566,0.49621000000000004
567,0.5099
568,0.5335300000000001
569,0.5533399999999999
570,0.55961
571,0.57805
572,0.58804
573,0.59145
574,0.60614
575,0.60427
576,0.6016699999999999
577,0.61117
578,0.6000800000000001
579,0.59741
580,0.60646
581,0.59317
582,0.5935199999999999
583,0.5998
584,0.59054
585,0.59616
586,0.60128
587,0.59718
588,0.6085699999999999
589,0.61342
590,0.61628
591,0.63474
592,0.63951
593,0.64845
594,0.67262
595,0.67686
596,0.69206
597,0.71885
598,0.72436
599,0.74432
600,0.7692399999999999
601,0.77899
602,0.80308
603,0.82416
604,0.8352799999999999
605,0.86019
606,0.87513
607,0.8867200000000001
608,0.91151
609,0.91876
610,0.92858
611,0.9510299999999999
612,0.9497899999999999
613,0.95811
614,0.97478
615,0.96852
616,0.97475
617,0.98336
618,0.97667
619,0.98444
620,0.9887100000000001
621,0.9844799999999999
622,0.9947600000000001
623,0.99471
624,0.99351
625,1.0078
626,1.0058
627,1.0098
628,1.0285
629,1.0237
630,1.0314
631,1.0489
632,1.0465
633,1.0593
634,1.0753
635,1.0778
636,1.0956
637,1.1093
638,1.1159999999999999
639,1.1379
640,1.1485
641,1.1587
642,1.1843
643,1.1917
644,1.2059
645,1.2348
646,1.2384
647,1.2552
648,1.2803
649,1.2856
650,1.306
651,1.3282
652,1.3372
653,1.3612
654,1.3793
655,1.3906
656,1.4172
657,1.4314
658,1.4465
659,1.4767
660,1.4868
661,1.5036
662,1.534
663,1.5383
664,1.5567
665,1.5827
666,1.5896
667,1.6112
668,1.633
669,1.6418
670,1.6658
671,1.683
672,1.6944
673,1.7208
674,1.7327
675,1.7455
676,1.7733
677,1.7801
678,1.7959
679,1.8256
680,1.8305
681,1.85
682,1.876
683,1.8835
684,1.9062
685,1.9281
686,1.9382
687,1.9635
688,1.98
689,1.9909
690,2.0158
691,2.0234
692,2.0318
693,2.0534
694,2.0508
695,2.0565
696,2.0731
697,2.0647
698,2.0709
699,2.0821
700,2.0755
701,2.0836
702,2.089
703,2.0843
704,2.0965
705,2.1007
706,2.1023
707,2.1182
708,2.115
709,2.1129
710,2.1237
711,2.1099
712,2.1066
713,2.1129
714,2.0942
715,2.0885
716,2.0851
717,2.0641
718,2.0576
719,2.0466
720,2.0254
721,2.0191
722,2.0017
723,1.9822
724,1.9782
725,1.9565
726,1.9405
727,1.9401
728,1.9162
729,1.9057
730,1.9056
731,1.8839
732,1.8779
733,1.8751
734,1.8579
735,1.8566
736,1.8505
737,1.8362
738,1.8371
739,1.8259
740,1.8135
741,1.8155
742,1.7974
743,1.7845
744,1.7847
745,1.7589
746,1.746
747,1.7412
748,1.715
749,1.7032
750,1.6918
751,1.6657
752,1.6543
753,1.6364
754,1.6114
755,1.6011
756,1.5777
757,1.5542
758,1.5452
759,1.5166
760,1.4959
761,1.4896
762,1.4581
763,1.4411
764,1.4317
765,1.4036
766,1.3918
767,1.3816
768,1.3593
769,1.3516
770,1.3364
771,1.3159
772,1.3113
773,1.294
774,1.2775
775,1.2727
776,1.2448
777,1.2243
778,1.2187
779,1.1914
780,1.1805
781,1.175
782,1.1488
783,1.1351
784,1.1198
785,1.094
786,1.084
787,1.0662
788,1.0434
789,1.0349
790,1.0123
791,0.99295
792,0.98826
793,0.9626299999999999
794,0.94606
795,0.9415600000000001
796,0.9143
797,0.9021899999999999
798,0.89594
799,0.8735
800,0.8667
801,0.85936
802,0.8429700000000001
803,0.8420200000000001
804,0.8328399999999999
805,0.8205399999999999
806,0.8231200000000001
807,0.81105
808,0.80265
809,0.80797
810,0.7915399999999999
811,0.7853399999999999
812,0.79051
813,0.77415
814,0.7719199999999999
815,0.77312
816,0.7580399999999999
817,0.75749
818,0.7548699999999999
819,0.74355
820,0.74627
821,0.73907
822,0.72983
823,0.7358899999999999
824,0.72688
825,0.72135
826,0.72744
827,0.7107100000000001
828,0.70686
829,0.71617
830,0.70598
831,0.7056
832,0.69971
833,0.67162
834,0.65594
835,0.64152
836,0.62671
837,0.63049
838,0.6231800000000001
839,0.6107899999999999
840,0.60946
841,0.59178
842,0.58123
843,0.58465
844,0.56404
845,0.5525399999999999
846,0.54757
847,0.52273
848,0.5121399999999999
849,0.50338
850,0.48058
851,0.47073999999999994
852,0.45566
853,0.43401999999999996
854,0.42662
855,0.40823000000000004
856,0.38955
857,0.38411
858,0.36135
859,0.34512
860,0.34206
861,0.31628
862,0.30303
863,0.29653
864,0.27121999999999996
865,0.2591
866,0.24745
867,0.22382
868,0.2138
869,0.19766
870,0.17532
871,0.16574
872,0.14347000000000001
873,0.12144
874,0.11191
875,0.083816
876,0.062222
877,0.05227999999999999
878,0.018866
879,-0.0017031
880,-0.016497
881,-0.048638
882,-0.067829
883,-0.08791
884,-0.11918
885,-0.13701
886,-0.1611
887,-0.18916
888,-0.20345
889,-0.22996999999999998
890,-0.25421
891,-0.2651
892,-0.29379
893,-0.31395
894,-0.32241
895,-0.35203
896,-0.36788000000000004
897,-0.37773
898,-0.40251
899,-0.4134
900,-0.42517
901,-0.44638
902,-0.45383
903,-0.46793
904,-0.48486999999999997
905,-0.48831
906,-0.5047699999999999
907,-0.51831
908,-0.5188
909,-0.5378
910,-0.54796
911,-0.54819
912,-0.56947
913,-0.57828
914,-0.58285
915,-0.60178
916,-0.60726
917,-0.61445
918,-0.6302800000000001
919,-0.63276
920,-0.64273
921,-0.6547
922,-0.6531100000000001
923,-0.66489
924,-0.67291
925,-0.66806
926,-0.68233
927,-0.6869
928,-0.68175
929,-0.69592
930,-0.69725
931,-0.69503
932,-0.7066100000000001
933,-0.70517
934,-0.7063699999999999
935,-0.71563
936,-0.71181
937,-0.71638
938,-0.72214
939,-0.71391
940,-0.71934
941,-0.72002
942,-0.7075100000000001
943,-0.71417
944,-0.70868
945,-0.69217
946,-0.69311
947,-0.6814
948,-0.6675300000000001
949,-0.66625
950,-0.64925
951,-0.6321
952,-0.62045
953,-0.59712
954,-0.58712
955,-0.58154
956,-0.56306
957,-0.5576399999999999
958,-0.5446300000000001
959,-0.51799
960,-0.51368
961,-0.49972
962,-0.47812
963,-0.47466
964,-0.45881000000000005
965,-0.44167
966,-0.43656999999999996
967,-0.41523999999999994
968,-0.39323
969,-0.37389
970,-0.34066
971,-0.32053000000000004
972,-0.30419
973,-0.27598
974,-0.26327
975,-0.24306
976,-0.20928000000000002
977,-0.1986
978,-0.17676
979,-0.14757
980,-0.13558
981,-0.11105999999999999
982,-0.087389
983,-0.078286
984,-0.057754
985,-0.042801
986,-0.032916
987,-0.008806999999999999
988,0.0039146
989,0.017027
990,0.043719
991,0.053108
992,0.069524
993,0.098089
994,0.10322
995,0.1204
996,0.14400000000000002
997,0.15067
998,0.17038
999,0.18933
1000,0.19599
1001,0.21545
1002,0.2282
1003,0.2359
1004,0.25714000000000004
1005,0.26505
1006,0.27399
1007,0.29643
1008,0.29977
1009,0.31103000000000003
1010,0.33374000000000004
1011,0.33357
1012,0.34546
1013,0.36211
1014,0.36255
1015,0.37756
1016,0.39255999999999996
1017,0.39711
1018,0.41365
1019,0.42094
1020,0.42483999999999994
1021,0.44486000000000003
1022,0.45303999999999994
1023,0.46331999999999995
1024,0.48458999999999997
1025,0.48601000000000005
1026,0.50203
1027,0.5363
1028,0.5523899999999999
1029,0.57629
1030,0.59601
1031,0.60006
1032,0.62934
1033,0.67051
1034,0.70181
1035,0.7206100000000001
1036,0.68933
1037,0.6230100000000001
1038,0.5652699999999999
1039,0.5142
1040,0.4953
1041,0.50346
1042,0.48556000000000005
1043,0.46421
1044,0.44416000000000005
1045,0.40644
1046,0.38821
1047,0.37435
1048,0.34165
1049,0.31663
1050,0.28628000000000003
1051,0.2504
1052,0.23009000000000002
1053,0.1986
1054,0.16203
1055,0.13574
1056,0.093132
1057,0.057102999999999994
1058,0.035094
1059,-0.0089204
1060,-0.042499
1061,-0.068142
1062,-0.11192
1063,-0.13932
1064,-0.15592
1065,-0.16748
1066,-0.18466
1067,-0.23208
1068,-0.27194
1069,-0.25793
1070,-0.21191999999999997
1071,-0.18886
1072,-0.25316
1073,-0.38177
1074,-0.42225
1075,-0.30016
1076,-0.13563
1077,-0.12619
1078,-0.36424
1079,-0.6383300000000001
1080,-0.59753
1081,-0.20360999999999999
1082,0.15175999999999998
1083,-0.0050042
1084,-0.66719
1085,-1.1354
1086,-0.6682100000000001
1087,0.58641
1088,1.3826
1089,0.18542
1090,-3.4793
1091,-8.3686
