time,value
0,0.72624
1,0.653
2,-1.7637
3,-1.7637
4,-1.7637
5,-0.44551
6,0.79947
7,0.72624
8,0.2136
9,-1.7637
10,-1.7637
11,-1.7637
12,-0.0061028
13,0.79947
14,0.653
15,-0.6652100000000001
16,-1.7637
17,-1.7637
18,-1.7637
19,0.94594
20,0.72624
21,0.50653
22,-1.7637
23,-1.7637
24,-1.7637
25,-0.29904000000000003
26,0.79947
27,0.653
28,-1.1046
29,-1.7637
30,-1.7637
31,-1.1046
32,0.8727
33,0.72624
34,0.653
35,0.653
36,-1.2511
37,-1.7637
38,-1.7637
39,-0.8849100000000001
40,0.8727
41,0.653
42,0.72624
43,0.653
44,0.72624
45,0.653
46,0.653
47,0.653
48,0.653
49,0.653
50,0.57977
51,0.653
52,0.653
53,0.653
54,0.653
55,0.57977
56,0.653
57,0.653
58,0.57977
59,0.653
60,0.57977
61,0.653
62,0.57977
63,0.653
64,0.57977
65,0.653
66,0.57977
67,0.57977
68,0.57977
69,0.57977
70,0.57977
71,0.57977
72,0.57977
73,0.57977
74,0.57977
75,0.57977
76,0.57977
77,0.653
78,0.57977
79,0.57977
80,0.57977
81,0.50653
82,0.57977
83,0.57977
84,-0.0061028
85,-1.7637
86,-1.7637
87,0.14035999999999998
88,0.79947
89,0.653
90,0.57977
91,-0.2258
92,-1.7637
93,-1.7637
94,-0.079337
95,0.72624
