time,value
0,1.348
1,1.2822
2,1.194
3,1.1254
4,1.0397
5,0.9606299999999999
6,0.8846799999999999
7,0.80374
8,0.72847
9,0.64508
10,0.56099
11,0.48203
12,0.40646
13,0.32955
14,0.25193000000000004
15,0.17355
16,0.09349099999999999
17,0.017656
18,-0.070495
19,-0.14608
20,-0.24176999999999998
21,-0.32759
22,-0.40902
23,-0.49754
24,-0.58922
25,-0.68328
26,-0.76889
27,-0.85944
28,-0.94519
29,-1.0333
30,-1.1209
31,-1.2098
32,-1.296
33,-1.3635
34,-1.2777
35,-1.1799
36,-1.054
37,-0.9283899999999999
38,-0.80281
39,-0.69933
40,-0.58315
41,-0.48496000000000006
42,-0.38833
43,-0.29022
44,-0.19334
45,-0.11379
46,-0.043673000000000003
47,0.031912
48,0.093252
49,0.15943
50,0.21452
51,0.26306
52,0.30294
53,0.25753000000000004
54,0.21166999999999997
55,0.16952
56,0.12205
57,0.06990299999999999
58,0.017177
59,-0.034406
60,-0.083557
61,-0.11254000000000002
62,-0.097025
63,-0.11320999999999999
64,-0.14329
65,-0.17862999999999998
66,-0.20884
67,-0.24585
68,-0.28013000000000005
69,-0.32643
70,-0.37204
71,-0.42063
72,-0.46543999999999996
73,-0.52488
74,-0.57639
75,-0.6291800000000001
76,-0.6856800000000001
77,-0.7481399999999999
78,-0.8133600000000001
79,-0.87284
80,-0.93805
81,-1.0077
82,-1.0634
83,-1.1156
84,-1.1743
85,-1.2328
86,-1.2898
87,-1.3409
88,-1.3794
89,-1.4293
90,-1.5015
91,-1.4938
92,-1.4143
93,-1.3297
94,-1.2329999999999999
95,-1.1454
96,-1.0571
97,-0.9655600000000001
98,-0.8771100000000001
99,-0.78255
100,-0.7024699999999999
101,-0.63477
102,-0.60129
103,-0.5465
104,-0.5204300000000001
105,-0.50135
106,-0.47781999999999997
107,-0.47877
108,-0.45529
109,-0.44603000000000004
110,-0.44223
111,-0.4384
112,-0.42321000000000003
113,-0.41673000000000004
114,-0.41048
115,-0.40526
116,-0.39760999999999996
117,-0.38871
118,-0.38836
119,-0.37654
120,-0.37461
121,-0.37626
122,-0.37351
123,-0.36727
124,-0.36139
125,-0.35468
126,-0.35216
127,-0.35186999999999996
128,-0.34358
129,-0.33118000000000003
130,-0.34303
131,-0.30938000000000004
132,-0.21
133,-0.1346
134,-0.034503
135,0.068204
136,0.14623
137,0.21324
138,0.27476
139,0.32519000000000003
140,0.36269
141,0.40688
142,0.46842
143,0.52444
144,0.5856899999999999
145,0.64674
146,0.71719
147,0.79215
148,0.85574
149,0.93199
150,0.9829700000000001
151,1.0546
152,1.1047
153,1.15
154,1.1991
155,1.2352
156,1.2601
157,1.2793
158,1.2856
159,1.2782
160,1.2588
161,1.2432
162,1.2438
163,1.254
164,1.285
165,1.3575
166,1.4329
167,1.5257
168,1.6137
169,1.7033
170,1.7907
171,1.8829
172,1.9732
173,2.0672
174,2.1595
175,2.2509
176,2.3515
177,2.4226
178,2.5043
179,2.5372
180,2.4974
181,2.3994
182,2.3055
183,2.2079
184,2.1312
185,2.0353
186,1.9513
187,1.8572
188,1.7694
189,1.6755
190,1.5858
191,1.496
192,1.3988
193,1.3096
194,1.2704
195,1.2532
196,1.2558
197,1.2138
198,1.1806
199,1.1043
200,1.0307
201,0.99259
202,0.9558399999999999
203,0.9173
204,0.8722
205,0.83154
206,0.7570399999999999
207,0.72617
208,0.68099
209,0.62292
210,0.57907
211,0.51032
212,0.45912
213,0.41339
214,0.3689
215,0.32966999999999996
216,0.27216
217,0.23820999999999998
218,0.17695
219,0.10346
220,0.037481
221,-0.041188999999999996
222,-0.11148
223,-0.18523
224,-0.24964
225,-0.33947
226,-0.42236999999999997
227,-0.52535
228,-0.61114
229,-0.6388199999999999
230,-0.63456
231,-0.62836
232,-0.60218
233,-0.575
234,-0.54364
235,-0.51179
236,-0.47447
237,-0.44273
238,-0.40508
239,-0.38387
240,-0.35969
241,-0.36019
242,-0.32442
243,-0.32089
244,-0.3073
245,-0.30079
246,-0.28431
247,-0.2802
248,-0.25766999999999995
249,-0.23479
250,-0.22018000000000001
251,-0.20693000000000003
252,-0.17619
253,-0.1774
254,-0.15711
255,-0.15169000000000002
256,-0.14911
257,-0.15236
258,-0.1501
259,-0.14837999999999998
260,-0.16130999999999998
261,-0.17670999999999998
262,-0.26243
263,-0.35967
264,-0.46348
265,-0.55396
266,-0.64678
267,-0.7408100000000001
268,-0.8314
269,-0.9185
270,-1.0088
271,-1.0925
272,-1.1833
273,-1.2603
274,-1.3468
275,-1.4285
276,-1.4957
277,-1.5711
278,-1.6515
279,-1.7262
280,-1.8055
281,-1.8798
282,-1.9497
283,-2.0177
284,-2.0843
285,-2.1478
286,-2.1658
287,-2.158
288,-2.1172
289,-2.0709999999999997
290,-2.0232
291,-1.9658
292,-1.9123
293,-1.8479
294,-1.7806
295,-1.7067
296,-1.6323
297,-1.5637
298,-1.4745
299,-1.4051
300,-1.3084
301,-1.2229
302,-1.1345
303,-1.0455
304,-0.95199
305,-0.86871
306,-0.76475
307,-0.6822699999999999
308,-0.58392
309,-0.50135
310,-0.42599
311,-0.35213
312,-0.26728
313,-0.19677999999999998
314,-0.12355999999999999
315,-0.083444
316,-0.044995
317,-0.019566
318,-0.0018614
319,-0.028707
320,-0.088309
321,-0.15718
322,-0.23048000000000002
323,-0.26143
324,-0.20806
325,-0.14422000000000001
326,-0.06151
327,-0.0037781
328,0.060177999999999995
329,0.14651
330,0.22355999999999998
331,0.29484
332,0.36175999999999997
333,0.43163
334,0.49196000000000006
335,0.54274
336,0.6059399999999999
337,0.65952
338,0.7016399999999999
339,0.7449100000000001
340,0.77705
341,0.7420100000000001
342,0.68491
343,0.6107
344,0.53657
345,0.46976999999999997
346,0.39211
347,0.31238
348,0.22737
349,0.13405
350,0.031363999999999996
351,-0.048307
352,-0.1371
353,-0.22255999999999998
354,-0.32388
355,-0.40807
356,-0.49941
357,-0.5999800000000001
358,-0.69503
359,-0.77872
360,-0.87218
361,-0.96296
362,-1.0416
363,-1.1327
364,-1.2078
365,-1.2816
366,-1.3678
367,-1.4249
368,-1.3669
369,-1.296
370,-1.2074
371,-1.1293
372,-1.0484
373,-0.96196
374,-0.88015
375,-0.7912899999999999
376,-0.71118
377,-0.6198600000000001
378,-0.53461
379,-0.44718
380,-0.36246999999999996
381,-0.28175
382,-0.19705
383,-0.10934
384,-0.032782
385,0.061482
386,0.13709000000000002
387,0.21302
388,0.30285
389,0.38076
390,0.45956
391,0.53688
392,0.6167600000000001
393,0.6867
394,0.77182
395,0.8397399999999999
396,0.91853
397,0.9955299999999999
398,1.0687
399,1.1411
400,1.2173
401,1.2885
402,1.3519
403,1.4036
404,1.4665
405,1.5087
406,1.5297
407,1.5563
408,1.5639
409,1.546
410,1.4998
411,1.4553
412,1.3992
413,1.3363
414,1.2752
415,1.2081
416,1.1761
417,1.1521
418,1.185
419,1.2439
420,1.3096
421,1.3763
422,1.4392
423,1.4923
424,1.5295
425,1.4878
426,1.4211
