time,value
0,-2.3962
1,-2.3962
2,-2.3962
3,-2.3962
4,-2.3962
5,-2.3962
6,-2.3962
7,-2.3961
8,-2.3959
9,-2.3955
10,-2.395
11,-2.3944
12,-2.3935
13,-2.3926
14,-2.3916
15,-2.3901
16,-2.3889
17,-2.3875
18,-2.3859
19,-2.3839
20,-2.3821
21,-2.3802
22,-2.3776
23,-2.3755
24,-2.3732
25,-2.3702
26,-2.3697
27,-2.371
28,-2.3675
29,-2.3646
30,-2.3616
31,-2.3585
32,-2.3545
33,-2.3512
34,-2.344
35,-2.3396
36,-2.336
37,-2.3323
38,-2.3276
39,-2.3237
40,-2.3197
41,-2.3157
42,-2.3105
43,-2.3062
44,-2.3019
45,-2.2964
46,-2.2919
47,-2.2873
48,-2.2815
49,-2.2768
50,-2.272
51,-2.2671
52,-2.2609
53,-2.2559
54,-2.2492
55,-2.2428
56,-2.2376
57,-2.2323
58,-2.2257
59,-2.2203
60,-2.2149
61,-2.208
62,-2.2024
63,-2.1968
64,-2.1912
65,-2.184
66,-2.1783
67,-2.1709
68,-2.1621
69,-2.1563
70,-2.1505
71,-2.1432
72,-2.1373
73,-2.1313
74,-2.1253
75,-2.1177
76,-2.1117
77,-2.1055
78,-2.0978
79,-2.0916
80,-2.0854
81,-2.0775
82,-2.0712
83,-2.0649
84,-2.0569
85,-2.0504
86,-2.044
87,-2.0375
88,-2.0294
89,-2.0228
90,-2.0163
91,-2.008
92,-2.0014
93,-1.9947
94,-1.9851
95,-1.9784
96,-1.9717
97,-1.9649
98,-1.9564
99,-1.9496
100,-1.9428
101,-1.9354
102,-1.9285
103,-1.9216
104,-1.9118
105,-1.9049
106,-1.899
107,-1.8903
108,-1.8833
109,-1.8751
110,-1.8681
111,-1.8593
112,-1.8522
113,-1.8451
114,-1.8351
115,-1.8291
116,-1.8234
117,-1.8145
118,-1.8074
119,-1.7992
120,-1.7921
121,-1.7831
122,-1.7759
123,-1.7695
124,-1.7625
125,-1.7543
126,-1.7472
127,-1.7371
128,-1.7299
129,-1.7227
130,-1.7181
131,-1.7112
132,-1.7048
133,-1.6965
134,-1.6875
135,-1.6811
136,-1.6752
137,-1.6678
138,-1.6605
139,-1.6533
140,-1.6433
141,-1.636
142,-1.6286
143,-1.6227
144,-1.6135
145,-1.607
146,-1.6012
147,-1.5937
148,-1.5865
149,-1.5783
150,-1.5692
151,-1.5619
152,-1.5545
153,-1.5487
154,-1.5404
155,-1.5322
156,-1.5249
157,-1.5165
158,-1.5107
159,-1.5034
160,-1.4943
161,-1.4861
162,-1.4788
163,-1.4697
164,-1.4631
165,-1.4591
166,-1.4518
167,-1.4417
168,-1.4344
169,-1.4288
170,-1.4221
171,-1.4148
172,-1.4075
173,-1.3984
174,-1.3901
175,-1.3828
176,-1.3755
177,-1.3663
178,-1.3597
179,-1.3522
180,-1.3430000000000002
181,-1.3347
182,-1.3274
183,-1.3207
184,-1.3151
185,-1.3078
186,-1.2986
187,-1.2913
188,-1.2830000000000001
189,-1.2756
190,-1.2664
191,-1.2590000000000001
192,-1.2534
193,-1.2432
194,-1.2358
195,-1.2284
196,-1.2192
197,-1.2109
198,-1.2035
199,-1.1961
200,-1.1887
201,-1.1822
202,-1.1748
203,-1.1655
204,-1.1572
205,-1.1497
206,-1.1405
207,-1.1349
208,-1.1284
209,-1.121
210,-1.1117
211,-1.1043
212,-1.0959999999999999
213,-1.0867
214,-1.0792
215,-1.0709
216,-1.0635
217,-1.0561
218,-1.0486
219,-1.0384
220,-1.031
221,-1.0226
222,-1.0171
223,-1.0097
224,-1.0023
225,-0.9948
226,-0.9845700000000001
227,-0.97709
228,-0.9697
229,-0.96335
230,-0.95588
231,-0.9484100000000001
232,-0.9409299999999999
233,-0.93158
234,-0.9232
235,-0.9157
236,-0.90633
237,-0.8988200000000001
238,-0.8913
239,-0.8831700000000001
240,-0.87766
241,-0.87016
242,-0.86077
243,-0.85325
244,-0.84486
245,-0.83734
246,-0.8279200000000001
247,-0.8222700000000001
248,-0.81694
249,-0.81057
250,-0.80218
251,-0.79465
252,-0.78437
253,-0.77903
254,-0.77353
255,-0.7660100000000001
256,-0.7566
257,-0.7490600000000001
258,-0.74152
259,-0.73209
260,-0.72453
261,-0.71697
262,-0.70667
263,-0.6991
264,-0.69153
265,-0.6824899999999999
266,-0.67806
267,-0.6705
268,-0.66293
269,-0.65346
270,-0.64588
271,-0.63747
272,-0.62798
273,-0.62039
274,-0.61279
275,-0.60329
276,-0.59568
277,-0.58916
278,-0.58643
279,-0.58073
280,-0.5723
281,-0.56386
282,-0.55271
283,-0.54999
284,-0.54618
285,-0.53856
286,-0.53666
287,-0.53285
288,-0.52522
289,-0.51568
290,-0.5080399999999999
291,-0.5004
292,-0.49005
293,-0.4824
294,-0.47475
295,-0.46518000000000004
296,-0.45752
297,-0.45064
298,-0.44027
299,-0.43337
300,-0.4257
301,-0.41723999999999994
302,-0.40763
303,-0.39994
304,-0.39225
305,-0.38261999999999996
306,-0.37492
307,-0.36838000000000004
308,-0.36262
309,-0.35609
310,-0.34839000000000003
311,-0.34069
312,-0.3303
313,-0.32259
314,-0.31529
315,-0.30954
316,-0.30184
317,-0.29338000000000003
318,-0.28375
319,-0.27837
320,-0.27338
321,-0.26492
322,-0.25722
323,-0.24875999999999998
324,-0.24105
325,-0.23142
326,-0.22528
327,-0.21836999999999998
328,-0.20798000000000003
329,-0.20027999999999999
330,-0.19258
331,-0.18759
332,-0.18144000000000002
333,-0.17375
334,-0.16527999999999998
335,-0.15566
336,-0.15144000000000002
337,-0.14451
338,-0.1349
339,-0.1272
340,-0.11874000000000001
341,-0.11180999999999999
342,-0.10565
343,-0.097964
344,-0.08757899999999999
345,-0.079885
346,-0.07488099999999999
347,-0.068714
348,-0.059108
349,-0.050647000000000005
350,-0.042956
351,-0.037168
352,-0.029852999999999998
353,-0.021394999999999997
354,-0.015578
355,-0.0082591
356,0.00019486
357,0.007869899999999999
358,0.016326
359,0.021372
360,0.026775
361,0.036362
362,0.044035000000000005
363,0.052490999999999996
364,0.062089
365,0.06977
366,0.077456
367,0.083221
368,0.089017
369,0.094414
370,0.10287
371,0.10983
372,0.1141
373,0.12255
374,0.12987
375,0.13302999999999998
376,0.14148
377,0.15106
378,0.15872
379,0.16639
380,0.17485
381,0.18444000000000002
382,0.19212
383,0.19638
384,0.20334000000000002
385,0.21101
386,0.21946999999999997
387,0.22905999999999999
388,0.23331999999999997
389,0.23838
390,0.24605
391,0.25564000000000003
392,0.26409
393,0.27176
394,0.28136
395,0.28562
396,0.29259
397,0.30217
398,0.30985
399,0.31831
400,0.3279
401,0.33558000000000004
402,0.34062
403,0.34488
404,0.35525
405,0.36293000000000003
406,0.37061
407,0.37756
408,0.38183
409,0.3895
410,0.39987
411,0.40755
412,0.41373000000000004
413,0.41878000000000004
414,0.42645
415,0.4349
416,0.44258000000000003
417,0.44876000000000005
418,0.45574
419,0.4634
420,0.47298999999999997
421,0.48066000000000003
422,0.48912
423,0.49871000000000004
424,0.50639
425,0.51407
426,0.52176
427,0.53022
428,0.53332
429,0.5383600000000001
430,0.54228
431,0.54881
432,0.55648
433,0.56607
434,0.5737399999999999
435,0.5814199999999999
436,0.5891
437,0.5987
438,0.60639
439,0.6140800000000001
440,0.62369
441,0.63139
442,0.6390899999999999
443,0.64947
444,0.65718
445,0.66488
446,0.6725899999999999
447,0.68106
448,0.68603
449,0.6906399999999999
450,0.70104
451,0.7087399999999999
452,0.71645
453,0.72685
454,0.73339
455,0.73835
456,0.74566
457,0.75336
458,0.76107
459,0.76878
460,0.77842
461,0.78614
462,0.79386
463,0.7931
464,0.7901
465,0.7871199999999999
466,0.78342
467,0.7812
468,0.7812
469,0.77272
470,0.7630399999999999
471,0.7569600000000001
472,0.75208
473,0.74433
474,0.73659
475,0.7281
476,0.7227600000000001
477,0.71983
478,0.71692
479,0.7133
480,0.7084699999999999
481,0.7056100000000001
482,0.6978300000000001
483,0.6874
484,0.67962
485,0.67502
486,0.6695
487,0.66295
488,0.65517
489,0.64474
490,0.6381899999999999
491,0.63339
492,0.62542
493,0.61622
494,0.61145
495,0.60295
496,0.59251
497,0.58472
498,0.5794100000000001
499,0.57394
500,0.57115
501,0.57115
502,0.56139
503,0.55289
504,0.5443899999999999
505,0.5352
506,0.53325
507,0.52935
508,0.5235
509,0.5228
510,0.51875
511,0.51402
512,0.50426
513,0.49576000000000003
514,0.48795
515,0.48266000000000003
516,0.47918999999999995
517,0.47138
518,0.46357
519,0.45382
520,0.44601
521,0.43751
522,0.42776000000000003
523,0.41996000000000006
524,0.41217
525,0.40437
526,0.39696
527,0.38971
528,0.38192
529,0.37146999999999997
530,0.36422
531,0.35948
532,0.35097
533,0.34248
534,0.33466999999999997
535,0.32743
536,0.32269000000000003
537,0.31419
538,0.30638000000000004
539,0.29593
540,0.28799
541,0.28523000000000004
542,0.27476999999999996
543,0.26948
544,0.26478
545,0.25364000000000003
546,0.24836
547,0.24368
548,0.23713
549,0.22666
550,0.21884
551,0.21229
552,0.2089
553,0.20425
554,0.20158
555,0.1924
556,0.18517999999999998
557,0.17861
558,0.17206
559,0.16421
560,0.15636
561,0.14784
562,0.13802999999999999
563,0.13344
564,0.12883
565,0.12162
566,0.11375999999999999
567,0.10525
568,0.096736
569,0.09213500000000001
570,0.084928
571,0.077069
572,0.066588
573,0.060038
574,0.057415999999999995
575,0.046279
576,0.038415
577,0.030556
578,0.020076
579,0.012218000000000001
580,0.0076319000000000005
581,0.0023889
582,-0.0041621
583,-0.012025
584,-0.019887000000000002
585,-0.030367
586,-0.038224
587,-0.04608
588,-0.055897
589,-0.061146000000000006
590,-0.065743
591,-0.074259
592,-0.082773
593,-0.09063099999999999
594,-0.09784
595,-0.10504000000000001
596,-0.11291
597,-0.12142
598,-0.13125
599,-0.13518
600,-0.13974
601,-0.14958
602,-0.15745
603,-0.16597
604,-0.17185
605,-0.18231
606,-0.19018
607,-0.1987
608,-0.20722
609,-0.21176999999999999
610,-0.21896
611,-0.22945
612,-0.23733
613,-0.24388
614,-0.24905
615,-0.25756999999999997
616,-0.26609
617,-0.27397
618,-0.2818
619,-0.28631
620,-0.29483000000000004
621,-0.30399
622,-0.3065
623,-0.31501999999999997
624,-0.32552
625,-0.33342
626,-0.33862
627,-0.34309
628,-0.35224
629,-0.3594
630,-0.36582
631,-0.37694
632,-0.38273
633,-0.38515
634,-0.39566
635,-0.40281
636,-0.4052
637,-0.41631
638,-0.4169
639,-0.41926
640,-0.42158999999999996
641,-0.42446999999999996
642,-0.42873999999999995
643,-0.43243000000000004
644,-0.43299
645,-0.43067
646,-0.43088000000000004
647,-0.42796999999999996
648,-0.4276
649,-0.42721000000000003
650,-0.4252
651,-0.42373
652,-0.41572
653,-0.40771
654,-0.39769
655,-0.39726
656,-0.39732
657,-0.38728
658,-0.37926
659,-0.37122
660,-0.36169
661,-0.35365
662,-0.34561
663,-0.33757
664,-0.33355
665,-0.32953000000000005
666,-0.3235
667,-0.32149
668,-0.31644
669,-0.30888000000000004
670,-0.29930999999999996
671,-0.29125
672,-0.28924
673,-0.28665
674,-0.27657
675,-0.26850999999999997
676,-0.26092
677,-0.25083
678,-0.24276999999999999
679,-0.24261
680,-0.23794
681,-0.22985999999999998
682,-0.22177
683,-0.21369000000000002
684,-0.20403
685,-0.19595
686,-0.18786
687,-0.17774
688,-0.16965
689,-0.16605
690,-0.15953
691,-0.15144000000000002
692,-0.14335
693,-0.13771
694,-0.13569
695,-0.12961
696,-0.12150999999999999
697,-0.11139
698,-0.10328
699,-0.094747
700,-0.084619
701,-0.082593
702,-0.080567
703,-0.072461
704,-0.070435
705,-0.066381
706,-0.058275
707,-0.048141
708,-0.040031
709,-0.031921
710,-0.021358000000000002
711,-0.013247
712,-0.005135100000000001
713,0.0050069
714,0.0099059
715,0.013635
716,0.02217
717,0.030277999999999996
718,0.038386
719,0.046495999999999996
720,0.056635000000000005
721,0.065169
722,0.073282
723,0.083422
724,0.091536
725,0.099651
726,0.1098
727,0.1135
728,0.11681
729,0.12491
730,0.13505
731,0.14359
732,0.1517
733,0.16184
734,0.16555999999999998
735,0.16887
736,0.17901
737,0.18711
738,0.19522
739,0.20579
740,0.21389
741,0.222
742,0.23054000000000002
743,0.2347
744,0.24324
745,0.25134
746,0.26148000000000005
747,0.27001
748,0.27812
749,0.28826
750,0.29636999999999997
751,0.29967
752,0.30341999999999997
753,0.31355
754,0.32166
755,0.32976
756,0.3399
757,0.348
758,0.35654
759,0.36668
760,0.37041999999999997
761,0.37374
762,0.38184
763,0.39197
764,0.40007
765,0.40818000000000004
766,0.41873999999999995
767,0.42685
768,0.43496
769,0.44509
770,0.4532
771,0.46131000000000005
772,0.47145
773,0.47956000000000004
774,0.48403999999999997
775,0.48777
776,0.49471000000000004
777,0.5032399999999999
778,0.5069899999999999
779,0.5143800000000001
780,0.52248
781,0.53058
782,0.5407
783,0.54881
784,0.55691
785,0.56502
786,0.57515
787,0.58326
788,0.59136
789,0.6015
790,0.60961
791,0.6177199999999999
792,0.6278600000000001
793,0.63597
794,0.6440899999999999
795,0.65423
796,0.6623399999999999
797,0.6704600000000001
798,0.6785800000000001
799,0.68914
800,0.69725
801,0.7053699999999999
802,0.7155199999999999
803,0.72364
804,0.7317600000000001
805,0.7419100000000001
806,0.75003
807,0.7581600000000001
808,0.7662800000000001
809,0.77644
810,0.78456
811,0.79269
812,0.80284
813,0.81097
814,0.8191
815,0.82926
816,0.8345299999999999
817,0.83616
818,0.84631
819,0.85444
820,0.8625700000000001
821,0.8711
822,0.88125
823,0.88938
824,0.89751
825,0.9076700000000001
826,0.9162
827,0.91985
828,0.92879
829,0.93691
830,0.94504
831,0.95316
832,0.9633200000000001
833,0.97145
834,0.9795799999999999
835,0.98974
836,0.99787
837,1.006
838,1.0162
839,1.0243
840,1.0324
841,1.0365
842,1.0406
843,1.0487
844,1.0491
845,1.0499
846,1.0535
847,1.0596
848,1.0698
849,1.0779
850,1.0864
851,1.0966
852,1.1047
853,1.1068
854,1.1129
855,1.119
856,1.1226
857,1.1304
858,1.1398
859,1.1475
860,1.1516
861,1.1528
862,1.161
863,1.1691
864,1.1773
865,1.1874
866,1.1956
867,1.2037
868,1.2139
869,1.2221
870,1.2302
871,1.2404
872,1.2452
873,1.2488
874,1.2573
875,1.2654
876,1.2736
877,1.2817
878,1.2919
879,1.3001
880,1.3082
881,1.3184
882,1.3265
883,1.3319
884,1.3321
885,1.3402
886,1.3484
887,1.3562
888,1.3629
889,1.3638
890,1.3716
891,1.3746
892,1.3732
893,1.3729
894,1.3718
895,1.3704
896,1.3698
897,1.3698
898,1.3612
899,1.3548
900,1.3514
901,1.3446
902,1.3357
903,1.3344
904,1.3307
905,1.3294
906,1.3230000000000002
907,1.3127
908,1.3045
909,1.2964
910,1.2882
911,1.2779
912,1.2698
913,1.2616
914,1.2513
915,1.2432
916,1.2347
917,1.2244
918,1.2162
919,1.2081
920,1.1999
921,1.1965
922,1.1915
923,1.1833
924,1.173
925,1.1645
926,1.1564
927,1.1478
928,1.1466
929,1.1398
930,1.1292
931,1.1272
932,1.1248
933,1.1159999999999999
934,1.1075
935,1.1048
936,1.0984
937,1.0922
938,1.0899
939,1.0817
940,1.0769
941,1.0728
942,1.0647
943,1.0558
944,1.0453
945,1.0385
946,1.0365
947,1.0262
948,1.0242
949,1.0198
950,1.0092
951,1.0059
952,1.0012
953,0.9909899999999999
954,0.9828
955,0.9746
956,0.96641
957,0.95616
958,0.9479700000000001
959,0.9397700000000001
960,0.92953
961,0.9213399999999999
962,0.91314
963,0.90291
964,0.89471
965,0.8865200000000001
966,0.8783299999999999
967,0.8680899999999999
968,0.8599
969,0.8514
970,0.84116
971,0.8329700000000001
972,0.82478
973,0.8145399999999999
974,0.8095
975,0.80416
976,0.79392
977,0.78573
978,0.77722
979,0.76903
980,0.75848
981,0.7551899999999999
982,0.74843
983,0.73819
984,0.7299899999999999
985,0.72149
986,0.71125
987,0.70305
988,0.69486
989,0.68984
990,0.68248
991,0.67428
992,0.66608
993,0.6555300000000001
994,0.6473399999999999
995,0.6391399999999999
996,0.62889
997,0.62244
998,0.6191800000000001
999,0.61449
1000,0.60424
1001,0.59604
1002,0.58754
1003,0.57729
1004,0.5705399999999999
1005,0.56731
1006,0.55852
1007,0.55208
1008,0.54887
1009,0.54215
1010,0.53394
1011,0.52573
1012,0.51753
1013,0.50727
1014,0.49877
1015,0.49057
1016,0.48031
1017,0.47211000000000003
1018,0.4639
1019,0.45364
1020,0.44896
1021,0.44782
1022,0.43933
1023,0.42907
1024,0.42057
1025,0.41236999999999996
1026,0.40210999999999997
1027,0.39921
1028,0.39632
1029,0.38605
1030,0.37784
1031,0.36963
1032,0.35936999999999997
1033,0.35115999999999997
1034,0.34705
1035,0.34614
1036,0.33998
1037,0.33178
1038,0.32356999999999997
1039,0.31332
1040,0.30511
1041,0.30101
1042,0.29546999999999995
1043,0.28726
1044,0.27905
1045,0.27085
1046,0.26059
1047,0.25238
1048,0.24389
1049,0.23392
1050,0.22571999999999998
1051,0.21750999999999998
1052,0.20697
1053,0.19876
1054,0.19055999999999998
1055,0.18031
1056,0.1721
1057,0.1639
1058,0.1557
1059,0.14867
1060,0.14574
1061,0.13725
1062,0.12699000000000002
1063,0.11879
1064,0.11058
1065,0.10004
1066,0.091833
1067,0.083629
1068,0.07542599999999999
1069,0.06517200000000001
1070,0.05697000000000001
1071,0.048767000000000005
1072,0.038517
1073,0.033825
1074,0.030610000000000002
1075,0.020063
1076,0.011858
1077,0.0036539000000000003
1078,-0.004551100000000001
1079,-0.015097
1080,-0.023301
1081,-0.031506
1082,-0.041760000000000005
1083,-0.050256
1084,-0.053463
1085,-0.060189
1086,-0.068397
1087,-0.07660399999999999
1088,-0.087148
1089,-0.095356
1090,-0.10151
1091,-0.1047
1092,-0.11169000000000001
1093,-0.11990999999999999
1094,-0.12812
1095,-0.13838
1096,-0.14687
1097,-0.15508
1098,-0.16534000000000001
1099,-0.17001
1100,-0.17110999999999998
1101,-0.17424
1102,-0.17555
1103,-0.18377000000000002
1104,-0.19225
1105,-0.20253
1106,-0.20715999999999998
1107,-0.21023000000000003
1108,-0.21871
1109,-0.22693000000000002
1110,-0.23540999999999998
1111,-0.24231999999999998
1112,-0.24329
1113,-0.24353000000000002
1114,-0.24401
1115,-0.24470999999999998
1116,-0.24470999999999998
1117,-0.24059
1118,-0.23029000000000002
1119,-0.22205999999999998
1120,-0.21381999999999998
1121,-0.20375
1122,-0.19552
1123,-0.18728
1124,-0.18132
1125,-0.18035
1126,-0.1746
1127,-0.16883
1128,-0.16985
1129,-0.1616
1130,-0.15335
1131,-0.14324
1132,-0.13499
1133,-0.13369
1134,-0.13013
1135,-0.12188
1136,-0.11362
1137,-0.10537
1138,-0.09523200000000001
1139,-0.086979
1140,-0.078723
1141,-0.07271
1142,-0.069281
1143,-0.065492
1144,-0.055335
1145,-0.053923
1146,-0.052332000000000004
1147,-0.044068
1148,-0.033895
1149,-0.025631
1150,-0.024015
1151,-0.020465
1152,-0.012197
1153,-0.0040720999999999995
1154,0.0062629
1155,0.0098509
1156,0.013591999999999998
1157,0.021861000000000002
1158,0.032198000000000004
1159,0.04047
1160,0.04874
1161,0.059079
1162,0.067349
1163,0.07562
1164,0.085958
1165,0.094229
1166,0.1025
1167,0.11284000000000001
1168,0.12111
1169,0.12938
1170,0.13765
1171,0.14799
1172,0.15625999999999998
1173,0.16454000000000002
1174,0.17488
1175,0.18315
1176,0.19142
1177,0.20176
1178,0.20990999999999999
1179,0.21818
1180,0.22646
1181,0.2368
1182,0.24506999999999998
1183,0.25334
1184,0.26368
1185,0.27195
1186,0.28023000000000003
1187,0.29057
1188,0.29884
1189,0.30712
1190,0.31745999999999996
1191,0.32573
1192,0.33399999999999996
1193,0.34228000000000003
1194,0.35274
1195,0.36101
1196,0.36928
1197,0.37961999999999996
1198,0.3879
1199,0.39616999999999997
1200,0.40651
1201,0.41478999999999994
1202,0.42306000000000005
1203,0.43133
1204,0.44168
1205,0.44995
1206,0.45821999999999996
1207,0.46857
1208,0.47684
1209,0.48316000000000003
1210,0.48581
1211,0.49213
1212,0.5004
1213,0.51074
1214,0.51902
1215,0.5272899999999999
1216,0.53556
1217,0.5459
1218,0.5541699999999999
1219,0.56245
1220,0.5727899999999999
1221,0.58106
1222,0.58933
1223,0.59968
1224,0.60795
1225,0.61622
1226,0.6245
1227,0.63484
1228,0.6431100000000001
1229,0.6513800000000001
1230,0.66173
1231,0.67
1232,0.6782699999999999
1233,0.68862
1234,0.69689
1235,0.70309
1236,0.70516
1237,0.71137
1238,0.7155100000000001
1239,0.7175699999999999
1240,0.72585
1241,0.73412
1242,0.7424
1243,0.75274
1244,0.7610100000000001
1245,0.7692899999999999
1246,0.77963
1247,0.78573
1248,0.78737
1249,0.7913
1250,0.80165
1251,0.80992
1252,0.8182
1253,0.8285399999999999
1254,0.83672
1255,0.845
1256,0.85534
1257,0.86362
1258,0.8719
1259,0.8801700000000001
1260,0.8905200000000001
1261,0.8988
1262,0.9005700000000001
1263,0.9043399999999999
1264,0.9126200000000001
1265,0.9209
1266,0.93125
1267,0.93953
1268,0.9478
1269,0.95806
1270,0.96634
1271,0.97462
1272,0.9829
1273,0.99325
1274,1.0015
1275,1.0098
1276,1.0202
1277,1.0284
1278,1.0367
1279,1.0471
1280,1.0553
1281,1.0636
1282,1.0719
1283,1.0823
1284,1.0905
1285,1.0988
1286,1.1092
1287,1.1175
1288,1.1258
1289,1.1362
1290,1.1444
1291,1.1527
1292,1.1631
1293,1.1713
1294,1.1796
1295,1.1879
1296,1.1982
1297,1.2065
1298,1.2147
1299,1.2251
1300,1.2334
1301,1.2416
1302,1.2478
1303,1.2499
1304,1.254
1305,1.2603
1306,1.2603
1307,1.2626
1308,1.265
1309,1.2713
1310,1.2796
1311,1.2879
1312,1.2982
1313,1.3065
1314,1.3148
1315,1.3230000000000002
1316,1.3312
1317,1.3330000000000002
1318,1.3369
1319,1.3473
1320,1.3555
1321,1.3638
1322,1.3741
1323,1.3802
1324,1.382
1325,1.3881
1326,1.3964
1327,1.4046
1328,1.4129
1329,1.4233
1330,1.4315
1331,1.4398
1332,1.4502
1333,1.4585
1334,1.4608
1335,1.4673
1336,1.4755
1337,1.4838
1338,1.4921
1339,1.5025
1340,1.5107
1341,1.5190000000000001
1342,1.5293
1343,1.5311
1344,1.5371
1345,1.5475
1346,1.5558
1347,1.564
1348,1.5743
1349,1.5826
1350,1.5868
1351,1.5866
1352,1.5863
1353,1.5861
1354,1.5858
1355,1.5857
1356,1.5794
1357,1.5792
1358,1.579
1359,1.5788
1360,1.5766
1361,1.5765
1362,1.5682
1363,1.5599
1364,1.5516
1365,1.5432
1366,1.541
1367,1.5348
1368,1.5245
1369,1.5162
1370,1.5079
1371,1.4975
1372,1.4892
1373,1.4809999999999999
1374,1.4727
1375,1.4623
1376,1.4622
1377,1.4580000000000002
1378,1.4477
1379,1.4394
1380,1.4311
1381,1.4207
1382,1.4125
1383,1.4042
1384,1.3959
1385,1.3937
1386,1.3875
1387,1.3792
1388,1.3689
1389,1.3627
1390,1.3606
1391,1.3523
1392,1.3461
1393,1.344
1394,1.3337
1395,1.3254
1396,1.3171
1397,1.3130000000000002
1398,1.3088
1399,1.3005
1400,1.2923
1401,1.2902
1402,1.284
1403,1.2757
1404,1.2736
1405,1.2695
1406,1.2632
1407,1.2612
1408,1.2529
1409,1.2446
1410,1.2363
1411,1.2301
1412,1.2261
1413,1.2199
1414,1.2095
1415,1.2012
1416,1.1929
1417,1.1846
1418,1.1743
1419,1.166
1420,1.1577
1421,1.1474
1422,1.1432
1423,1.141
1424,1.1348
1425,1.1265
1426,1.1183
1427,1.1079
1428,1.0996
1429,1.0913
1430,1.083
1431,1.0727
1432,1.0644
1433,1.0561
1434,1.0457
1435,1.0375
1436,1.0292
1437,1.0188
1438,1.0105
1439,1.0022
1440,0.9939600000000001
1441,0.9836
1442,0.98157
1443,0.97956
1444,0.9692
1445,0.9609200000000001
1446,0.95263
1447,0.9422799999999999
1448,0.93401
1449,0.9257200000000001
1450,0.9153700000000001
1451,0.9070799999999999
1452,0.89879
1453,0.89051
1454,0.8822399999999999
1455,0.8802700000000001
1456,0.87618
1457,0.86582
1458,0.8575299999999999
1459,0.84925
1460,0.8389200000000001
1461,0.83063
1462,0.82235
1463,0.81406
1464,0.80371
1465,0.7996300000000001
1466,0.79769
1467,0.78737
1468,0.77909
1469,0.77081
1470,0.76045
1471,0.75216
1472,0.74388
1473,0.73356
1474,0.72528
1475,0.71699
1476,0.7087100000000001
1477,0.7004199999999999
1478,0.69835
1479,0.69007
1480,0.68178
1481,0.67971
1482,0.67557
1483,0.6653
1484,0.65701
1485,0.64873
1486,0.64044
1487,0.6342300000000001
1488,0.63234
1489,0.62411
1490,0.61375
1491,0.60547
1492,0.59718
1493,0.58683
1494,0.5785399999999999
1495,0.57026
1496,0.56198
1497,0.55162
1498,0.5433399999999999
1499,0.53505
1500,0.53077
1501,0.52852
1502,0.52023
1503,0.50988
1504,0.50159
1505,0.49331
1506,0.48295
1507,0.47467
1508,0.46638
1509,0.4581
1510,0.4477
1511,0.43942
1512,0.43113
1513,0.42078000000000004
1514,0.41452
1515,0.41436999999999996
1516,0.40815
1517,0.39987
1518,0.39158000000000004
1519,0.3833
1520,0.37294
1521,0.3688
1522,0.36688000000000004
1523,0.35657
1524,0.34829
1525,0.34
1526,0.32965
1527,0.32136
1528,0.31308
1529,0.30272
1530,0.29854
1531,0.29646999999999996
1532,0.28818
1533,0.27783
1534,0.26954
1535,0.26743
1536,0.26321
1537,0.25488
1538,0.2466
1539,0.23624
1540,0.2321
1541,0.22999
1542,0.22374000000000002
1543,0.21339
1544,0.2051
1545,0.19682
1546,0.18642
1547,0.17814000000000002
1548,0.16985
1549,0.1595
1550,0.15118
1551,0.14694000000000002
1552,0.14272
1553,0.13443
1554,0.12615
1555,0.11785999999999999
1556,0.1075
1557,0.099218
1558,0.090933
1559,0.080576
1560,0.07228899999999999
1561,0.070332
1562,0.06421900000000001
1563,0.055934000000000005
1564,0.047648
1565,0.039401
1566,0.029043
1567,0.020799
1568,0.018895
1569,0.012773
1570,0.0044889
1571,-0.0037930999999999998
1572,-0.014099
1573,-0.022383
1574,-0.028546
1575,-0.030398
1576,-0.030093
1577,-0.029822
1578,-0.037959
1579,-0.043942
1580,-0.045852
1581,-0.054132000000000007
1582,-0.064314
1583,-0.072594
1584,-0.07664800000000001
1585,-0.076287
1586,-0.078073
1587,-0.077973
1588,-0.082013
1589,-0.092153
1590,-0.096187
1591,-0.09815
1592,-0.097933
1593,-0.097933
1594,-0.09782300000000001
1595,-0.097245
1596,-0.097245
1597,-0.090923
1598,-0.082649
1599,-0.07620199999999999
1600,-0.075701
1601,-0.073107
1602,-0.07035
1603,-0.062082000000000005
1604,-0.053674
1605,-0.043341000000000005
1606,-0.038775
1607,-0.038179000000000005
1608,-0.027697000000000003
1609,-0.019433000000000002
1610,-0.011170000000000001
1611,-0.0067301
1612,-0.0038721
1613,0.0043879
1614,0.012648999999999999
1615,0.023137
1616,0.027593
1617,0.028265
1618,0.031198000000000004
1619,0.031919
1620,0.040172
1621,0.048425
1622,0.058926
1623,0.063421
1624,0.066236
1625,0.072617
1626,0.080868
1627,0.089309
1628,0.09775299999999999
1629,0.1006
1630,0.10718
1631,0.11769
1632,0.12594
1633,0.13253
1634,0.13542
1635,0.14387
1636,0.15212
1637,0.16057000000000002
1638,0.17087
1639,0.17912
1640,0.18387
1641,0.18885
1642,0.19709000000000002
1643,0.20533
1644,0.21356999999999998
1645,0.22386999999999999
1646,0.23212
1647,0.24056999999999998
1648,0.25087
1649,0.25911999999999996
1650,0.26736
1651,0.27766
1652,0.28406
1653,0.28698
1654,0.29154
1655,0.30184
1656,0.31008
1657,0.31854
1658,0.32884
1659,0.33708
1660,0.34531999999999996
1661,0.35422
1662,0.35512
1663,0.36336
1664,0.37365
1665,0.38211
1666,0.39035
1667,0.39859
1668,0.40888
1669,0.41712
1670,0.42008999999999996
1671,0.42696000000000006
1672,0.43518999999999997
1673,0.44343
1674,0.45371999999999996
1675,0.46195
1676,0.47042
1677,0.47865
1678,0.48735
1679,0.49035
1680,0.49676000000000003
1681,0.50705
1682,0.51552
1683,0.52375
1684,0.53404
1685,0.54227
1686,0.55051
1687,0.56103
1688,0.56926
1689,0.5717899999999999
1690,0.57481
1691,0.58304
1692,0.59127
1693,0.5995
1694,0.6100300000000001
1695,0.61826
1696,0.62649
1697,0.63678
1698,0.6450100000000001
1699,0.6534800000000001
1700,0.6562600000000001
1701,0.66317
1702,0.6713899999999999
1703,0.67962
1704,0.68991
1705,0.69814
1706,0.7063699999999999
1707,0.7168899999999999
1708,0.72512
1709,0.73335
1710,0.74364
1711,0.7518699999999999
1712,0.75647
1713,0.75951
1714,0.76593
1715,0.7744
1716,0.78263
1717,0.78905
1718,0.7941600000000001
1719,0.79879
1720,0.8093199999999999
1721,0.8175399999999999
1722,0.8257700000000001
1723,0.8267899999999999
1724,0.8337399999999999
1725,0.84196
1726,0.85044
1727,0.85893
1728,0.8640899999999999
1729,0.86874
1730,0.8790100000000001
1731,0.88723
1732,0.89544
1733,0.9039299999999999
1734,0.9142
1735,0.92242
1736,0.92885
1737,0.93225
1738,0.94073
1739,0.94895
1740,0.9592200000000001
1741,0.9674299999999999
1742,0.97565
1743,0.98592
1744,0.99413
1745,1.0026
1746,1.0108
1747,1.0211
1748,1.0293
1749,1.0375
1750,1.046
1751,1.0492
1752,1.0538
1753,1.0641
1754,1.0723
1755,1.0805
1756,1.0887
1757,1.0993
1758,1.1075
1759,1.1157
1760,1.126
1761,1.1303
1762,1.1324
1763,1.1385
1764,1.1468
1765,1.155
1766,1.1611
1767,1.1609
1768,1.1691
1769,1.1773
1770,1.1876
1771,1.1958
1772,1.204
1773,1.2125
1774,1.2156
1775,1.2223
1776,1.2326
1777,1.2411
1778,1.2475
1779,1.2507
1780,1.2574
1781,1.2659
1782,1.2690000000000001
1783,1.276
1784,1.2842
1785,1.2925
1786,1.3027
1787,1.3109
1788,1.3194
1789,1.3297
1790,1.3379
1791,1.3461
1792,1.354
1793,1.3643
1794,1.3725
1795,1.3807
1796,1.391
1797,1.3945
1798,1.3963
1799,1.4045
1800,1.4127
1801,1.421
1802,1.4292
1803,1.4312
1804,1.4361
1805,1.4444
1806,1.4549
1807,1.4631
1808,1.4680000000000002
1809,1.4712
1810,1.4797
1811,1.4844
1812,1.4855
1813,1.4869
1814,1.4881
1815,1.4893
1816,1.4908
1817,1.492
1818,1.4932
1819,1.4856
1820,1.4798
1821,1.479
1822,1.4735
1823,1.4657
1824,1.4649
1825,1.4638
1826,1.4536
1827,1.4454
1828,1.4376
1829,1.4274
1830,1.4192
1831,1.4181
1832,1.4140000000000001
1833,1.4059
1834,1.3977
1835,1.3895
1836,1.3834
1837,1.3807
1838,1.3742
1839,1.364
1840,1.3558
1841,1.3476
1842,1.3374
1843,1.3292
1844,1.3211
1845,1.3108
1846,1.3051
1847,1.3044
1848,1.301
1849,1.2911
1850,1.2830000000000001
1851,1.2752
1852,1.2749
1853,1.2691
1854,1.261
1855,1.2511
1856,1.2429999999999999
1857,1.2348
1858,1.2291
1859,1.2274
1860,1.2213
1861,1.2135
1862,1.204
1863,1.1963
1864,1.1926
1865,1.1885
1866,1.1816
1867,1.1792
1868,1.1731
1869,1.1649
1870,1.1612
1871,1.1572
1872,1.149
1873,1.1466
1874,1.1401
1875,1.1292
1876,1.1268
1877,1.1247
1878,1.1207
1879,1.1125
1880,1.104
1881,1.0958
1882,1.0857
1883,1.0775
1884,1.0697
1885,1.0595
1886,1.0514
1887,1.0494
1888,1.0453
1889,1.0371
1890,1.0290000000000001
1891,1.0270000000000001
1892,1.0209
1893,1.0127
1894,1.0046
1895,0.9944
1896,0.98587
1897,0.9777299999999999
1898,0.96755
1899,0.95941
1900,0.9512700000000001
1901,0.9411
1902,0.93296
1903,0.9248299999999999
1904,0.91669
1905,0.9065200000000001
1906,0.89838
1907,0.89025
1908,0.88008
1909,0.87195
1910,0.86382
1911,0.85405
1912,0.8459200000000001
1913,0.8377899999999999
1914,0.8296600000000001
1915,0.8195
1916,0.81138
1917,0.80325
1918,0.79309
1919,0.78497
1920,0.77684
1921,0.76669
1922,0.75857
1923,0.75451
1924,0.75044
1925,0.74232
1926,0.73623
1927,0.73623
1928,0.72811
1929,0.71999
1930,0.7118800000000001
1931,0.70173
1932,0.6932
1933,0.68508
1934,0.67493
1935,0.66682
1936,0.65871
1937,0.65059
1938,0.64045
1939,0.63234
1940,0.6242300000000001
1941,0.6140899999999999
1942,0.60598
1943,0.60226
1944,0.59491
1945,0.5868
1946,0.57868
1947,0.5685399999999999
1948,0.56043
1949,0.5519
1950,0.54378
1951,0.53365
1952,0.52554
1953,0.52063
1954,0.51649
1955,0.50838
1956,0.50027
1957,0.49012
1958,0.48158999999999996
1959,0.47348
1960,0.46537
1961,0.45523
1962,0.44948
1963,0.44619
1964,0.43605
1965,0.42794
1966,0.41981999999999997
1967,0.40926
1968,0.40115
1969,0.39947
1970,0.39702
1971,0.38687
1972,0.37876
1973,0.37064
1974,0.36008
1975,0.35358
1976,0.35155
1977,0.34343
1978,0.33532
1979,0.33126
1980,0.32678
1981,0.31867
1982,0.31538
1983,0.31169
1984,0.30357
1985,0.29504
1986,0.28692
1987,0.27676999999999996
1988,0.26865
1989,0.2646
1990,0.26256999999999997
1991,0.25404
1992,0.24914
1993,0.2467
1994,0.23571999999999999
1995,0.22921999999999998
1996,0.22719
1997,0.21907
1998,0.21095
1999,0.20242000000000002
2000,0.19227
2001,0.18415
2002,0.17843
2003,0.17110999999999998
2004,0.16297999999999999
2005,0.15486
2006,0.14633
2007,0.13618
2008,0.12765
2009,0.12397000000000001
2010,0.11706
2011,0.10894000000000001
2012,0.10082
2013,0.090254
2014,0.082129
2015,0.074009
2016,0.065886
2017,0.059796
2018,0.057766
2019,0.051677
2020,0.047617
2021,0.045587
2022,0.037471
2023,0.026907999999999998
2024,0.018789
2025,0.010673
2026,0.00094886
2027,-0.005135100000000001
2028,-0.0071631
2029,-0.013247
2030,-0.017304
2031,-0.021358000000000002
2032,-0.029468
2033,-0.039604
2034,-0.047712
2035,-0.05582
2036,-0.065952
2037,-0.07362300000000001
2038,-0.081727
2039,-0.089827
2040,-0.09749
2041,-0.097749
2042,-0.1009
2043,-0.11101
2044,-0.1191
2045,-0.12719
2046,-0.13729
2047,-0.14538
2048,-0.15345999999999999
2049,-0.16154000000000002
2050,-0.17165
2051,-0.17972
2052,-0.1878
2053,-0.1979
2054,-0.20597
2055,-0.21405
2056,-0.22366999999999998
2057,-0.23174
2058,-0.23981
2059,-0.24989
2060,-0.25795
2061,-0.26602
2062,-0.27408000000000005
2063,-0.28415999999999997
2064,-0.28722
2065,-0.28728000000000004
2066,-0.29735
2067,-0.30539
2068,-0.31344
2069,-0.3235
2070,-0.33104
2071,-0.33707
2072,-0.33908
2073,-0.34712
2074,-0.34913
2075,-0.35315
2076,-0.36319
2077,-0.37071
2078,-0.37874
2079,-0.38069000000000003
2080,-0.38114000000000003
2081,-0.38915
2082,-0.39864
2083,-0.40665
2084,-0.40905
2085,-0.4089
2086,-0.41834
2087,-0.42068999999999995
2088,-0.41847
2089,-0.42844
2090,-0.43585
2091,-0.44382
2092,-0.4461
2093,-0.44778
2094,-0.45573
2095,-0.4631
2096,-0.47303999999999996
2097,-0.47266
2098,-0.47681999999999997
2099,-0.48673999999999995
2100,-0.49406000000000005
2101,-0.50198
2102,-0.50151
2103,-0.50362
2104,-0.51152
2105,-0.52077
2106,-0.52867
2107,-0.52678
2108,-0.52423
2109,-0.52298
2110,-0.52299
2111,-0.5302
2112,-0.53214
2113,-0.5314399999999999
2114,-0.5386
2115,-0.5431199999999999
2116,-0.5403899999999999
2117,-0.53959
2118,-0.53681
2119,-0.5432100000000001
2120,-0.54445
2121,-0.54161
2122,-0.53803
2123,-0.53514
2124,-0.53222
2125,-0.5300199999999999
2126,-0.52153
2127,-0.5173800000000001
2128,-0.51248
2129,-0.50207
2130,-0.49596
2131,-0.49103
2132,-0.48136999999999996
2133,-0.47365
2134,-0.46592
2135,-0.45551
2136,-0.44778
2137,-0.44004
2138,-0.43036
2139,-0.42262
2140,-0.41413999999999995
2141,-0.40925
2142,-0.40003
2143,-0.39229
2144,-0.38455
2145,-0.37485999999999997
2146,-0.36711
2147,-0.35936
2148,-0.34893
2149,-0.34117
2150,-0.33341
2151,-0.32564
2152,-0.31593000000000004
2153,-0.30815
2154,-0.30038000000000004
2155,-0.29485
2156,-0.29146
2157,-0.28369
2158,-0.27398
2159,-0.26621
2160,-0.25843
2161,-0.24799000000000002
2162,-0.24020999999999998
2163,-0.23242
2164,-0.22464
2165,-0.2149
2166,-0.2071
2167,-0.20126
2168,-0.19735999999999998
2169,-0.18886
2170,-0.17966
2171,-0.17115999999999998
2172,-0.16781
2173,-0.16126
2174,-0.15345999999999999
2175,-0.14761
2176,-0.14565999999999998
2177,-0.13785999999999998
2178,-0.1281
2179,-0.1196
2180,-0.11569000000000002
2181,-0.10983
2182,-0.10202
2183,-0.094202
2184,-0.086966
2185,-0.086278
2186,-0.077775
2187,-0.06995599999999999
2188,-0.06018300000000001
2189,-0.054315999999999996
2190,-0.052361000000000005
2191,-0.044443
2192,-0.036621
2193,-0.028797000000000003
2194,-0.018333000000000002
2195,-0.010506999999999999
2196,-0.0026761
2197,0.0019969000000000002
2198,0.009912899999999999
2199,0.017737
2200,0.025561
2201,0.036025
2202,0.043855
2203,0.051686
2204,0.06147999999999999
2205,0.066746
2206,0.071413
2207,0.079921
2208,0.08970700000000001
2209,0.098215
2210,0.10605
2211,0.11652
2212,0.1205
2213,0.12645
2214,0.13692000000000001
2215,0.14475
2216,0.15325
2217,0.15989
2218,0.16712
2219,0.17494
2220,0.18345
2221,0.19264
2222,0.19732
2223,0.20388
2224,0.21365
2225,0.22216
2226,0.22871
2227,0.23409000000000002
2228,0.24064000000000002
2229,0.24914
2230,0.25695999999999997
2231,0.26547
2232,0.27016999999999997
2233,0.27741
2234,0.28718
2235,0.29568
2236,0.30223
2237,0.30764
2238,0.31419
2239,0.322
2240,0.33245
2241,0.33901
2242,0.34373000000000004
2243,0.35097
2244,0.36017
2245,0.36491999999999997
2246,0.37093000000000004
2247,0.38206999999999997
2248,0.38685
2249,0.39605
2250,0.40402
2251,0.40881999999999996
2252,0.41658999999999996
2253,0.42386
2254,0.42744
2255,0.43033000000000005
2256,0.43518
2257,0.43883999999999995
2258,0.44178
2259,0.44475
2260,0.44773
2261,0.44847
2262,0.44997
2263,0.45374
2264,0.45526000000000005
2265,0.45602
2266,0.45906
2267,0.46097
2268,0.46406000000000003
2269,0.45985
2270,0.45452
2271,0.45574
2272,0.45078
2273,0.44471000000000005
2274,0.44598000000000004
2275,0.44376000000000004
2276,0.43612
2277,0.42738000000000004
2278,0.41975
2279,0.42108
2280,0.41972
2281,0.41211000000000003
2282,0.4045
2283,0.395
2284,0.38822
2285,0.38061999999999996
2286,0.37303000000000003
2287,0.36354000000000003
2288,0.35596
2289,0.34754
2290,0.33805999999999997
2291,0.33049
2292,0.32291
2293,0.31534
2294,0.31345
2295,0.30967
2296,0.304
2297,0.30126
2298,0.29285
2299,0.28444
2300,0.2733
2301,0.26574000000000003
2302,0.26385
2303,0.25648000000000004
2304,0.24893
2305,0.24136999999999997
2306,0.23194
2307,0.2244
2308,0.21686
2309,0.20931999999999998
2310,0.19991
2311,0.19238
2312,0.1905
2313,0.18673
2314,0.17922000000000002
2315,0.17445
2316,0.17432
2317,0.16957
2318,0.16383
2319,0.15447
2320,0.14984
2321,0.14807
2322,0.13969
2323,0.13033
2324,0.12284
2325,0.11535999999999999
2326,0.11349000000000001
2327,0.10975
2328,0.10228
2329,0.092941
2330,0.085477
2331,0.07801699999999999
2332,0.072424
2333,0.070562
2334,0.06311
2335,0.055663
2336,0.046360000000000005
2337,0.042641000000000005
2338,0.040781
2339,0.033377
2340,0.025942000000000003
2341,0.018512
2342,0.0092289
2343,0.0018109000000000003
2344,-0.0065321
2345,-0.013944
2346,-0.023203
2347,-0.030607
2348,-0.038005000000000004
2349,-0.047244
2350,-0.05463099999999999
2351,-0.062014
2352,-0.068527
2353,-0.074127
2354,-0.075974
2355,-0.083364
2356,-0.093533
2357,-0.10091
2358,-0.11018
2359,-0.1194
2360,-0.12407
2361,-0.13149
2362,-0.14071
2363,-0.14808
2364,-0.15545
2365,-0.16280999999999998
2366,-0.17295
2367,-0.18031
2368,-0.18765
2369,-0.19683
2370,-0.19866
2371,-0.20049
2372,-0.21061999999999997
2373,-0.21341999999999997
2374,-0.21718
2375,-0.22730999999999998
2376,-0.23474
2377,-0.23656999999999997
2378,-0.24024
2379,-0.24939
2380,-0.25671
2381,-0.265
2382,-0.27413000000000004
2383,-0.28059
2384,-0.28631999999999996
2385,-0.29375
2386,-0.30106
2387,-0.30837
2388,-0.31566
2389,-0.32577
2390,-0.33305
2391,-0.34033
2392,-0.34776999999999997
2393,-0.35354
2394,-0.36182
2395,-0.37091999999999997
2396,-0.37819
2397,-0.38545999999999997
2398,-0.39454
2399,-0.4028
2400,-0.41005
2401,-0.4173
2402,-0.42633999999999994
2403,-0.43356999999999996
2404,-0.4408
2405,-0.44982
2406,-0.45625
2407,-0.46213000000000004
2408,-0.46957
2409,-0.47678999999999994
2410,-0.484
2411,-0.49121000000000004
2412,-0.5002
2413,-0.50739
2414,-0.51458
2415,-0.52354
2416,-0.53071
2417,-0.53891
2418,-0.54786
2419,-0.555
2420,-0.56214
2421,-0.57105
2422,-0.57817
2423,-0.58529
2424,-0.59239
2425,-0.60127
2426,-0.60836
2427,-0.61544
2428,-0.6242800000000001
2429,-0.63134
2430,-0.6384
2431,-0.6472
2432,-0.6542399999999999
2433,-0.66127
2434,-0.66828
2435,-0.67705
2436,-0.6832199999999999
2437,-0.6882699999999999
2438,-0.69705
2439,-0.70406
2440,-0.71217
2441,-0.72091
2442,-0.7278899999999999
2443,-0.73487
2444,-0.7429600000000001
2445,-0.75029
2446,-0.75665
2447,-0.76362
2448,-0.77344
2449,-0.78091
2450,-0.78714
2451,-0.79697
2452,-0.80393
2453,-0.81201
2454,-0.8206899999999999
2455,-0.82762
2456,-0.8327600000000001
2457,-0.8390200000000001
2458,-0.84883
2459,-0.85456
2460,-0.8608100000000001
2461,-0.86716
2462,-0.87523
2463,-0.8821700000000001
2464,-0.89138
2465,-0.89764
2466,-0.90571
2467,-0.91265
2468,-0.9224399999999999
2469,-0.9293600000000001
2470,-0.93626
2471,-0.94315
2472,-0.94945
2473,-0.95636
2474,-0.96614
2475,-0.97303
2476,-0.9787799999999999
2477,-0.98624
2478,-0.9931399999999999
2479,-1.0012
2480,-1.0081
2481,-1.0155
2482,-1.0219
2483,-1.0282
2484,-1.0368
2485,-1.0448
2486,-1.0511
2487,-1.0586
2488,-1.065
2489,-1.073
2490,-1.0798
2491,-1.0879
2492,-1.0942
2493,-1.1
2494,-1.1097
2495,-1.1166
2496,-1.1258
2497,-1.135
2498,-1.1419
2499,-1.1499
2500,-1.1584
2501,-1.1636
2502,-1.17
2503,-1.1752
2504,-1.1849
2505,-1.1917
2506,-1.198
2507,-1.2056
2508,-1.2102
2509,-1.217
2510,-1.2267
2511,-1.2335
2512,-1.2399
2513,-1.2452
2514,-1.2537
2515,-1.2617
2516,-1.2684
2517,-1.2778
2518,-1.2835
2519,-1.2903
2520,-1.3
2521,-1.308
2522,-1.3144
2523,-1.3202
2524,-1.3287
2525,-1.3366
2526,-1.3417
2527,-1.3494
2528,-1.3552
2529,-1.3619
2530,-1.3716
2531,-1.3783
2532,-1.3865
2533,-1.3935
2534,-1.4014
2535,-1.4079
2536,-1.4132
2537,-1.4217
2538,-1.4296
2539,-1.4363
2540,-1.445
2541,-1.4515
2542,-1.4595
2543,-1.4664
2544,-1.4729
2545,-1.4809
2546,-1.4884
2547,-1.4977
2548,-1.5045
2549,-1.5124
2550,-1.5209
2551,-1.5262
2552,-1.5327
2553,-1.5423
2554,-1.5481
2555,-1.5546
2556,-1.5637
2557,-1.57
2558,-1.5765
2559,-1.5822
2560,-1.5919
2561,-1.5967
2562,-1.6036
2563,-1.6133
2564,-1.6186
2565,-1.625
2566,-1.6347
2567,-1.6416
2568,-1.6497
2569,-1.6577
2570,-1.6664
2571,-1.6711
2572,-1.6779
2573,-1.6865
2574,-1.6929
2575,-1.7009
2576,-1.7095
2577,-1.7175
2578,-1.7232
2579,-1.7325
2580,-1.7394
2581,-1.7473
2582,-1.7542
2583,-1.764
2584,-1.7692
2585,-1.776
2586,-1.7845
2587,-1.7925
2588,-1.7993
2589,-1.8084
2590,-1.8149
2591,-1.8212
2592,-1.8279
2593,-1.8363
2594,-1.8442
2595,-1.8509
2596,-1.8593
2597,-1.8659
2598,-1.8733
2599,-1.8829
2600,-1.8895
2601,-1.8961
2602,-1.9027
2603,-1.9109
2604,-1.9174
2605,-1.9252
2606,-1.9334
2607,-1.9398
2608,-1.9462
2609,-1.9542
2610,-1.9603
2611,-1.9672
2612,-1.9763
2613,-1.9826
2614,-1.989
2615,-1.9953
2616,-2.0031
2617,-2.0107
2618,-2.017
2619,-2.0247
2620,-2.0308
2621,-2.0365
2622,-2.0467
2623,-2.0529
2624,-2.059
2625,-2.065
2626,-2.0726
2627,-2.08
2628,-2.086
2629,-2.0934
2630,-2.0992
2631,-2.1066
2632,-2.1153
2633,-2.1212
2634,-2.127
2635,-2.1342
2636,-2.14
2637,-2.1472
2638,-2.1528
2639,-2.1598
2640,-2.1653
2641,-2.1708
2642,-2.1776
2643,-2.1830000000000003
2644,-2.1883
2645,-2.1949
2646,-2.2001
2647,-2.2052
2648,-2.2103
2649,-2.2166
2650,-2.2216
2651,-2.2264
2652,-2.2308
2653,-2.2355
2654,-2.2402
2655,-2.2459
2656,-2.2522
2657,-2.2567
2658,-2.2621
2659,-2.2664
2660,-2.2714
2661,-2.2796
2662,-2.2863
2663,-2.2905
2664,-2.2946
2665,-2.2996
2666,-2.3035
2667,-2.3091
2668,-2.3138
2669,-2.3174
2670,-2.3209999999999997
2671,-2.3245
2672,-2.3287
2673,-2.3319
2674,-2.3351
2675,-2.3389
2676,-2.3418
2677,-2.3446
2678,-2.3481
2679,-2.3507
2680,-2.3532
2681,-2.3556
2682,-2.3584
2683,-2.3606
2684,-2.3626
2685,-2.365
2686,-2.3655
2687,-2.3664
2688,-2.3721
2689,-2.3746
2690,-2.3778
2691,-2.3837
2692,-2.3861
2693,-2.3868
2694,-2.3881
2695,-2.3895
2696,-2.3905
2697,-2.3914
2698,-2.3923
2699,-2.395
2700,-2.3955
2701,-2.3959
2702,-2.3961
2703,-2.3962
2704,-2.3962
2705,-2.3962
2706,-2.3962
2707,-2.3962
2708,-2.3962
