time,value
0,-0.4746
1,-0.48385
2,-0.4746
3,-0.48385
4,-0.38216999999999995
5,-0.40065
6,-0.4746
7,-0.48385
8,-0.43763
9,-0.35444000000000003
10,-0.27124000000000004
11,-0.28049
12,-0.36368
13,-0.44687
14,-0.43763
15,-0.37292
16,-0.33595
17,-0.40065
18,-0.48385
19,-0.4746
20,-0.4746
21,-0.48385
22,-0.37292
23,-0.262
24,-0.31745999999999996
25,-0.33595
26,-0.33595
27,0.49598000000000003
28,0.5514399999999999
29,0.22791
30,0.043041
31,0.8102600000000001
32,-0.19729000000000002
33,-0.40065
34,-0.35444000000000003
35,-0.37292
36,-0.4746
37,-0.42838999999999994
38,-0.34519
39,-0.36368
40,0.5976600000000001
41,0.14472000000000002
42,0.70858
43,-0.35444000000000003
44,-0.37292
45,-0.21578000000000003
46,-0.33595
47,-0.34519
48,-0.45611999999999997
49,0.31111
50,-0.32671
51,-0.27124000000000004
52,-0.20654
53,-0.262
54,-0.31745999999999996
55,-0.36368
56,-0.33595
57,-0.21578000000000003
58,-0.19729000000000002
59,4.3876
60,3.3338
61,4.1657
62,1.5128
63,0.61615
64,4.2766
65,2.585
66,2.3817
67,-0.33595
68,-0.23426999999999998
69,-0.29896999999999996
70,-0.37292
71,-0.38216999999999995
72,0.61615
73,-0.22503
74,-0.31745999999999996
75,-0.45611999999999997
76,-0.45611999999999997
77,-0.45611999999999997
78,-0.44687
79,-0.33595
80,-0.40065
81,-0.45611999999999997
82,-0.45611999999999997
83,-0.45611999999999997
84,-0.29896999999999996
85,-0.21578000000000003
86,-0.22503
87,0.57917
88,-0.16956
89,-0.40065
90,-0.33595
91,-0.38216999999999995
92,-0.45611999999999997
93,-0.46536000000000005
94,-0.4746
95,-0.41913999999999996
