time,value
0,-0.7570399999999999
1,0.19922
2,0.99611
3,-0.7570399999999999
4,-0.7570399999999999
5,1.9524
6,-0.7570399999999999
7,-0.7570399999999999
8,0.83673
9,0.3586
10,-0.7570399999999999
11,-0.7570399999999999
12,1.9524
13,-0.7570399999999999
14,-0.7570399999999999
15,0.67735
16,0.51798
17,-0.7570399999999999
18,-0.7570399999999999
19,1.9524
20,-0.7570399999999999
21,-0.7570399999999999
22,-0.11953
23,1.3149
24,-0.7570399999999999
25,-0.7570399999999999
26,0.83673
27,0.3586
28,-0.7570399999999999
29,-0.7570399999999999
30,1.9524
31,-0.7570399999999999
32,-0.7570399999999999
33,-0.11953
34,1.1555
35,-0.7570399999999999
36,-0.7570399999999999
37,1.9524
38,-0.7570399999999999
39,-0.7570399999999999
40,0.039844
41,1.1555
42,-0.7570399999999999
43,-0.7570399999999999
44,1.1555
45,0.039844
46,-0.7570399999999999
47,-0.7570399999999999
48,2.1117
49,-0.7570399999999999
50,-0.7570399999999999
51,-0.7570399999999999
52,1.9524
53,-0.7570399999999999
54,-0.7570399999999999
55,-0.11953
56,1.4742
57,-0.7570399999999999
58,-0.7570399999999999
59,0.19922
60,1.1555
61,-0.7570399999999999
62,-0.7570399999999999
63,0.3586
64,0.83673
65,-0.7570399999999999
66,-0.7570399999999999
67,0.67735
68,0.67735
69,-0.7570399999999999
70,-0.7570399999999999
71,0.83673
72,0.3586
73,-0.7570399999999999
74,-0.7570399999999999
75,1.6336
76,-0.43828999999999996
77,-0.7570399999999999
78,-0.7570399999999999
79,1.9524
80,-0.7570399999999999
81,-0.7570399999999999
82,1.4742
83,0.19922
84,-0.7570399999999999
85,-0.7570399999999999
86,2.4305
87,-0.7570399999999999
88,-0.7570399999999999
89,0.99611
90,0.67735
91,-0.7570399999999999
92,-0.7570399999999999
93,2.2711
94,-0.7570399999999999
95,-0.7570399999999999
