time,value
0,-2.1774
1,-2.1774
2,-2.1774
3,-2.1774
4,-2.1774
5,-2.1774
6,-2.1774
7,-2.1774
8,-2.1774
9,-2.1774
10,-2.1774
11,-2.1774
12,-2.1774
13,-2.1774
14,-2.1774
15,-2.1774
16,-1.0461
17,1.2164
18,1.0907
19,0.8392700000000001
20,0.71358
21,0.71358
22,0.5878800000000001
23,0.5878800000000001
24,0.5878800000000001
25,0.46219
26,0.5878800000000001
27,0.46219
28,0.5878800000000001
29,0.46219
30,0.46219
31,0.46219
32,0.46219
33,0.46219
34,0.46219
35,0.46219
36,0.46219
37,0.33649
38,0.46219
39,0.33649
40,0.46219
41,0.46219
42,0.33649
43,0.46219
44,0.33649
45,0.46219
46,0.33649
47,0.33649
48,0.46219
49,0.33649
50,0.33649
51,0.46219
52,0.33649
53,0.46219
54,0.33649
55,0.46219
56,0.33649
57,0.46219
58,0.33649
59,0.46219
60,0.33649
61,0.46219
62,0.33649
63,0.46219
64,0.46219
65,0.33649
66,0.46219
67,0.33649
68,0.46219
69,0.33649
70,0.46219
71,0.33649
72,0.33649
73,0.46219
74,0.46219
75,0.33649
76,0.46219
77,0.33649
78,0.46219
79,0.46219
80,0.33649
81,0.46219
82,0.46219
83,0.46219
84,0.33649
85,0.46219
86,0.33649
87,0.46219
88,0.33649
89,0.46219
90,0.33649
91,0.46219
92,0.33649
93,0.46219
94,0.46219
95,0.33649
