time,value
0,-1.1334
1,-1.1334
2,1.1601
3,-0.12155999999999999
4,-1.1334
5,-0.52628
6,1.2275
7,-0.9309999999999999
8,-1.1334
9,0.01335
10,0.9577
11,-1.1334
12,-1.1334
13,0.8227899999999999
14,0.080804
15,-1.1334
16,-0.99845
17,1.3624
18,-0.59373
19,-1.1334
20,-0.52628
21,1.295
22,-0.99845
23,-1.1334
24,0.080804
25,0.75534
26,-1.1334
27,-1.1334
28,0.48552
29,0.41807
30,-1.1334
31,-1.1334
32,1.0252
33,-0.12155999999999999
34,-1.1334
35,-0.99845
36,1.295
37,-0.66118
38,-1.1334
39,-0.054103
40,1.2275
41,-0.99845
42,-1.1334
43,0.48552
44,1.1601
45,-1.1334
46,-1.1334
47,0.48552
48,1.1601
49,-1.1334
50,-1.1334
51,1.3624
52,1.1601
53,1.0926
54,1.0926
55,-0.25645999999999997
56,-1.1334
57,-0.32392
58,1.1601
59,1.1601
60,0.8227899999999999
61,-1.1334
62,-1.1334
63,0.89025
64,1.0926
65,1.0926
66,1.0252
67,1.0926
68,0.14826
69,-1.1334
70,-0.66118
71,1.2275
72,1.1601
73,1.0926
74,0.75534
75,-1.1334
76,-1.1334
77,0.8227899999999999
78,1.0926
79,0.41807
80,-1.1334
81,-1.1334
82,1.0252
83,1.1601
84,1.0252
85,-0.99845
86,-1.1334
87,0.55298
88,1.0926
89,1.0926
90,1.0252
91,-1.1334
92,-1.1334
93,0.41807
94,1.1601
95,1.0926
