time,value
0,-0.91243
1,-0.91243
2,0.6801699999999999
3,1.2423
4,1.3359999999999999
5,-0.91243
6,-0.91243
7,-0.91243
8,-0.91243
9,-0.91243
10,0.30544
11,1.3359999999999999
12,1.3359999999999999
13,-0.25665
14,-0.91243
15,-0.91243
16,-0.91243
17,-0.91243
18,-0.72506
19,1.3359999999999999
20,1.3359999999999999
21,0.77386
22,-0.91243
23,-0.91243
24,-0.91243
25,-0.91243
26,-0.35033000000000003
27,1.4296
28,1.2423
29,0.58649
30,-0.91243
31,-0.91243
32,-0.91243
33,-0.25665
34,1.3359999999999999
35,1.3359999999999999
36,-0.16297
37,-0.91243
38,-0.91243
39,-0.91243
40,-0.91243
41,0.9612200000000001
42,1.4296
43,1.2423
44,-0.72506
45,-0.91243
46,-0.91243
47,-0.91243
48,-0.5377
49,1.4296
50,1.3359999999999999
51,0.21176
52,-0.91243
53,-0.91243
54,-0.91243
55,-0.72506
56,1.4296
57,1.3359999999999999
58,0.86754
59,-0.91243
60,-0.91243
61,-0.91243
62,0.024396
63,1.3359999999999999
64,1.3359999999999999
65,-0.35033000000000003
66,-0.91243
67,-0.91243
68,-0.91243
69,0.86754
70,1.3359999999999999
71,1.3359999999999999
72,-0.91243
73,-0.91243
74,-0.91243
75,0.86754
76,1.3359999999999999
77,1.2423
78,1.2423
79,1.2423
80,1.1486
81,1.1486
82,1.1486
83,0.58649
84,-0.91243
85,-0.91243
86,-0.91243
87,-0.72506
88,1.3359999999999999
89,1.2423
90,-0.44401999999999997
91,-0.91243
92,-0.91243
93,-0.91243
94,-0.91243
95,0.77386
