time,value
0,-2.2685
1,-2.2685
2,-2.2685
3,-2.2685
4,-2.2708
5,-2.2708
6,-2.2708
7,-2.2801
8,-2.2871
9,-2.2871
10,-2.287
11,-2.2868
12,-2.2887
13,-2.2882
14,-2.2878
15,-2.2871
16,-2.2862
17,-2.2906
18,-2.2997
19,-2.3012
20,-2.3004
21,-2.2991
22,-2.2978
23,-2.2967
24,-2.2951
25,-2.2957
26,-2.2943
27,-2.2924
28,-2.2903
29,-2.2887
30,-2.2864
31,-2.2863
32,-2.2924
33,-2.2979
34,-2.2952
35,-2.2932
36,-2.2903
37,-2.2874
38,-2.2851
39,-2.2819
40,-2.2808
41,-2.2783
42,-2.2748
43,-2.2713
44,-2.2746
45,-2.2822
46,-2.2804
47,-2.2775
48,-2.2757
49,-2.2716
50,-2.2685
51,-2.2643
52,-2.26
53,-2.2567
54,-2.2522
55,-2.2497
56,-2.2462
57,-2.2414
58,-2.2366
59,-2.2329
60,-2.228
61,-2.2332
62,-2.2371
63,-2.2339
64,-2.2286
65,-2.2246
66,-2.2192
67,-2.2137
68,-2.2095
69,-2.2039
70,-2.1983
71,-2.1939
72,-2.1881
73,-2.1841
74,-2.1796
75,-2.1736
76,-2.1675
77,-2.1612
78,-2.1568
79,-2.1506
80,-2.1458
81,-2.1395
82,-2.1331
83,-2.1283
84,-2.1218
85,-2.1153
86,-2.1104
87,-2.1037
88,-2.0971
89,-2.092
90,-2.0853
91,-2.0802
92,-2.0734
93,-2.0665
94,-2.0613
95,-2.0544
96,-2.0474
97,-2.0421
98,-2.035
99,-2.0297
100,-2.0324
101,-2.0348
102,-2.0275
103,-2.0221
104,-2.0148
105,-2.0089
106,-2.0033
107,-1.9959
108,-1.9885
109,-1.9829
110,-1.9754
111,-1.9679
112,-1.9622
113,-1.9546
114,-1.9469999999999998
115,-1.9413
116,-1.9337
117,-1.926
118,-1.9189
119,-1.9112
120,-1.9034
121,-1.8976
122,-1.8898
123,-1.8834
124,-1.8776
125,-1.8711
126,-1.8634
127,-1.8575
128,-1.8497
129,-1.8406
130,-1.8347
131,-1.8268
132,-1.819
133,-1.8130000000000002
134,-1.8061
135,-1.8004
136,-1.7945
137,-1.7866
138,-1.7787
139,-1.7715
140,-1.7636
141,-1.7556
142,-1.7496
143,-1.7416
144,-1.7361
145,-1.7305
146,-1.7213
147,-1.7121
148,-1.7061
149,-1.6981
150,-1.6913
151,-1.6877
152,-1.6797
153,-1.6705
154,-1.6645
155,-1.6565
156,-1.6498
157,-1.6442
158,-1.6362
159,-1.6282
160,-1.621
161,-1.6129
162,-1.6049
163,-1.5977
164,-1.591
165,-1.5826
166,-1.5765
167,-1.5673
168,-1.5592
169,-1.5549
170,-1.5482
171,-1.5390000000000001
172,-1.5329
173,-1.5237
174,-1.5156
175,-1.5096
176,-1.5014
177,-1.4948
178,-1.4893
179,-1.4812
180,-1.4731
181,-1.4671
182,-1.4578
183,-1.4497
184,-1.4436
185,-1.4381
186,-1.4315
187,-1.4254
188,-1.4162
189,-1.4080000000000001
190,-1.4019
191,-1.3933
192,-1.3858
193,-1.3797
194,-1.3716
195,-1.3635
196,-1.3573
197,-1.348
198,-1.3399
199,-1.3337
200,-1.3255
201,-1.319
202,-1.3136
203,-1.3055
204,-1.2962
205,-1.29
206,-1.2817
207,-1.2752
208,-1.2679
209,-1.2597
210,-1.2515
211,-1.2454
212,-1.2371
213,-1.2278
214,-1.2216
215,-1.2134
216,-1.2051
217,-1.1989
218,-1.1906
219,-1.1842
220,-1.1769
221,-1.1687
222,-1.1604
223,-1.1531
224,-1.1448
225,-1.1366
226,-1.1324
227,-1.126
228,-1.1187
229,-1.1125
230,-1.1042
231,-1.0959
232,-1.0897
233,-1.0803
234,-1.072
235,-1.0658
236,-1.0585
237,-1.0522
238,-1.048
239,-1.0397
240,-1.0314
241,-1.0252
242,-1.0158
243,-1.0074
244,-1.0012
245,-0.9928100000000001
246,-0.9834200000000001
247,-0.9803299999999999
248,-0.97306
249,-0.9647100000000001
250,-0.95844
251,-0.9500700000000001
252,-0.94068
253,-0.9344
254,-0.92601
255,-0.9176200000000001
256,-0.91132
257,-0.90191
258,-0.8935
259,-0.8904
260,-0.8842700000000001
261,-0.8769600000000001
262,-0.87066
263,-0.86125
264,-0.8528399999999999
265,-0.8465299999999999
266,-0.8381
267,-0.8338899999999999
268,-0.83178
269,-0.82545
270,-0.81926
271,-0.81616
272,-0.80884
273,-0.80152
274,-0.79632
275,-0.79322
276,-0.7911100000000001
277,-0.78267
278,-0.77422
279,-0.76788
280,-0.75845
281,-0.7499899999999999
282,-0.74364
283,-0.73516
284,-0.72668
285,-0.7216600000000001
286,-0.7156600000000001
287,-0.70719
288,-0.70084
289,-0.6923600000000001
290,-0.68388
291,-0.6775100000000001
292,-0.66902
293,-0.66052
294,-0.6531899999999999
295,-0.64468
296,-0.63617
297,-0.62978
298,-0.62125
299,-0.6127199999999999
300,-0.60632
301,-0.59778
302,-0.58923
303,-0.58282
304,-0.57426
305,-0.5656899999999999
306,-0.56172
307,-0.55588
308,-0.54855
309,-0.54213
310,-0.53357
311,-0.5250100000000001
312,-0.51767
313,-0.5091
314,-0.50053
315,-0.49409
316,-0.48675
317,-0.48096000000000005
318,-0.47698999999999997
319,-0.46842
320,-0.45893999999999996
321,-0.45251
322,-0.44425
323,-0.43845
324,-0.43325
325,-0.42468999999999996
326,-0.41611000000000004
327,-0.40876999999999997
328,-0.40019
329,-0.39161
330,-0.38641
331,-0.38063
332,-0.37238000000000004
333,-0.36594
334,-0.35646
335,-0.34788
336,-0.34392
337,-0.33812
338,-0.33078
339,-0.32435
340,-0.31578
341,-0.3072
342,-0.30075999999999997
343,-0.29217
344,-0.28268000000000004
345,-0.27623000000000003
346,-0.26764
347,-0.25903000000000004
348,-0.25258
349,-0.24397
350,-0.23535
351,-0.23535
352,-0.23319
353,-0.228
354,-0.22065
355,-0.21761
356,-0.21368
357,-0.20633
358,-0.19683
359,-0.19252
360,-0.19252
361,-0.1839
362,-0.17528
363,-0.16793
364,-0.1593
365,-0.15714
366,-0.15714
367,-0.14762999999999998
368,-0.14459
369,-0.14156
370,-0.13117
371,-0.12165999999999999
372,-0.11863
373,-0.11647
374,-0.10999
375,-0.10352
376,-0.09400499999999999
377,-0.085363
378,-0.080587
379,-0.074922
380,-0.072765
381,-0.065413
382,-0.056782000000000006
383,-0.046395
384,-0.039919
385,-0.031281
386,-0.022639
387,-0.021769999999999998
388,-0.013954
389,-0.0053189
390,0.0011591
391,0.0098041
392,0.018451
393,0.024939
394,0.033593
395,0.043111000000000003
396,0.049606
397,0.058267
398,0.066932
399,0.073436
400,0.082109
401,0.08900000000000001
402,0.093735
403,0.10109
404,0.10976
405,0.11625999999999999
406,0.12493
407,0.1336
408,0.14012
409,0.1488
410,0.15833
411,0.16484000000000001
412,0.17353
413,0.18222
414,0.18875
415,0.19745
416,0.20615
417,0.21268
418,0.22139
419,0.2301
420,0.23476
421,0.24026
422,0.24979
423,0.25632
424,0.26183
425,0.26652
426,0.27304
427,0.28174
428,0.29044000000000003
429,0.29696
430,0.30566
431,0.31437
432,0.32173
433,0.33044
434,0.33916
435,0.3457
436,0.35441
437,0.36314
438,0.36832
439,0.3716
440,0.37709000000000004
441,0.37709000000000004
442,0.37926
443,0.38797
444,0.39450999999999997
445,0.40321999999999997
446,0.40758
447,0.40758
448,0.4133
449,0.42203
450,0.42858
451,0.43731000000000003
452,0.44386000000000003
453,0.45258999999999994
454,0.46133
455,0.46789
456,0.47663
457,0.48538000000000003
458,0.49194
459,0.49872
460,0.50413
461,0.51069
462,0.5194300000000001
463,0.52818
464,0.53474
465,0.5434899999999999
466,0.55304
467,0.55961
468,0.5683600000000001
469,0.57433
470,0.57892
471,0.5848899999999999
472,0.59364
473,0.60101
474,0.6097600000000001
475,0.6187199999999999
476,0.6211300000000001
477,0.63068
478,0.63943
479,0.64599
480,0.65474
481,0.6635
482,0.67006
483,0.67225
484,0.6714600000000001
485,0.66908
486,0.66594
487,0.66281
488,0.66203
489,0.6612600000000001
490,0.65751
491,0.6551899999999999
492,0.65146
493,0.64266
494,0.6352899999999999
495,0.6265
496,0.61771
497,0.6132
498,0.6101300000000001
499,0.60133
500,0.59473
501,0.58517
502,0.5763699999999999
503,0.5697800000000001
504,0.56098
505,0.55647
506,0.55197
507,0.5446
508,0.5358
509,0.5292100000000001
510,0.51964
511,0.51085
512,0.50426
513,0.49832
514,0.49304
515,0.48788000000000004
516,0.47908
517,0.46951000000000004
518,0.46292
519,0.45698
520,0.45171999999999995
521,0.44655
522,0.43699
523,0.42954
524,0.42506000000000005
525,0.41548999999999997
526,0.40958
527,0.40512
528,0.39921
529,0.39038
530,0.38377
531,0.3742
532,0.36538000000000004
533,0.35877
534,0.3514
535,0.34839000000000003
536,0.34615
537,0.34097
538,0.33434
539,0.32771
540,0.31887
541,0.30929
542,0.30488000000000004
543,0.30267
544,0.29605
545,0.29163
546,0.28868
547,0.28131
548,0.27395
549,0.26511999999999997
550,0.25704
551,0.25338
552,0.25117
553,0.24456
554,0.23719
555,0.23424
556,0.22612
557,0.21875
558,0.21139000000000002
559,0.20918
560,0.20477
561,0.19595
562,0.18638
563,0.17978
564,0.17386
565,0.16864
566,0.16128
567,0.15245
568,0.14288
569,0.13627
570,0.1296
571,0.12662
572,0.12
573,0.11042
574,0.10745
575,0.10524000000000001
576,0.1001
577,0.097197
578,0.090556
579,0.080975
580,0.075873
581,0.073723
582,0.064854
583,0.055991
584,0.048623
585,0.039041
586,0.033963
587,0.030322
588,0.020736
589,0.014882
590,0.010545
591,0.0046981
592,-0.0041869
593,-0.011553
594,-0.020435
595,-0.026284
596,-0.030608
597,-0.038673
598,-0.047562
599,-0.054227
600,-0.063114
601,-0.071996
602,-0.079362
603,-0.08824
604,-0.097117
605,-0.10227
606,-0.10730999999999999
607,-0.11537
608,-0.12274000000000002
609,-0.12705999999999998
610,-0.12982
611,-0.13051
612,-0.13274
613,-0.13719
614,-0.14386
615,-0.14609
616,-0.15192
617,-0.15928
618,-0.16887
619,-0.17845999999999998
620,-0.18514
621,-0.18736
622,-0.19097
623,-0.19764
624,-0.20723000000000003
625,-0.20998000000000003
626,-0.21425
627,-0.22093000000000002
628,-0.23053
629,-0.23721
630,-0.24611999999999998
631,-0.25039
632,-0.25465
633,-0.26200999999999997
634,-0.2687
635,-0.27762
636,-0.28653
637,-0.2939
638,-0.30280999999999997
639,-0.3093
640,-0.31356
641,-0.32092
642,-0.32829
643,-0.33253
644,-0.33742
645,-0.34412
646,-0.35081999999999997
647,-0.35975
648,-0.36934
649,-0.37604
650,-0.38495999999999997
651,-0.39076
652,-0.39499
653,-0.40078
654,-0.41038
655,-0.41235
656,-0.41495
657,-0.41752
658,-0.41943
659,-0.42195
660,-0.42443000000000003
661,-0.42627
662,-0.41728000000000004
663,-0.40889000000000003
664,-0.40214
665,-0.39599
666,-0.39611999999999997
667,-0.39279000000000003
668,-0.38436
669,-0.38216
670,-0.38387
671,-0.37483
672,-0.36579
673,-0.35901
674,-0.35053
675,-0.34148
676,-0.33469
677,-0.33237
678,-0.32947
679,-0.32266999999999996
680,-0.31413
681,-0.30507
682,-0.30159
683,-0.30141999999999997
684,-0.29512
685,-0.28831
686,-0.27973000000000003
687,-0.27064
688,-0.26887
689,-0.26861
690,-0.26278
691,-0.25595
692,-0.24684
693,-0.23773000000000002
694,-0.23139
695,-0.22227
696,-0.21316
697,-0.20631999999999998
698,-0.19997
699,-0.19959000000000002
700,-0.19777
701,-0.18865
702,-0.17952
703,-0.17267000000000002
704,-0.16354000000000002
705,-0.15441
706,-0.14756
707,-0.14207
708,-0.13792000000000001
709,-0.13107
710,-0.12194
711,-0.11282
712,-0.10597000000000001
713,-0.096838
714,-0.087243
715,-0.08039400000000001
716,-0.07126
717,-0.062126
718,-0.055275
719,-0.047965
720,-0.043828
721,-0.040611
722,-0.031013
723,-0.025036000000000003
724,-0.021322999999999998
725,-0.016284
726,-0.007165899999999999
727,-0.00032694
728,0.0087931
729,0.01839
730,0.025232
731,0.034354
732,0.043476999999999995
733,0.05126699999999999
734,0.055462
735,0.065059
736,0.071896
737,0.081014
738,0.090134
739,0.096973
740,0.10657
741,0.11569000000000002
742,0.12253
743,0.12805
744,0.13225
745,0.13957
746,0.14868
747,0.1578
748,0.16464
749,0.17376
750,0.18288
751,0.19019
752,0.19931
753,0.20843000000000003
754,0.21528000000000003
755,0.2244
756,0.23351999999999998
757,0.24036999999999997
758,0.24949000000000002
759,0.25861999999999996
760,0.26547
761,0.27459
762,0.28371999999999997
763,0.29057
764,0.2997
765,0.30884
766,0.31158
767,0.31573
768,0.32123
769,0.32808000000000004
770,0.3372
771,0.34633
772,0.35318
773,0.36230999999999997
774,0.37144
775,0.37828
776,0.38742
777,0.39655
778,0.4034
779,0.41253999999999996
780,0.42167
781,0.42853
782,0.43767
783,0.44726000000000005
784,0.45411
785,0.46325
786,0.47239
787,0.47925
788,0.48839
789,0.49753000000000003
790,0.50439
791,0.51354
792,0.52268
793,0.52954
794,0.5364
795,0.53869
796,0.54098
797,0.55057
798,0.55374
799,0.55419
800,0.5637800000000001
801,0.5733699999999999
802,0.57611
803,0.58068
804,0.58982
805,0.59668
806,0.60583
807,0.61497
808,0.62184
809,0.63098
810,0.64013
811,0.64471
812,0.64699
813,0.64928
814,0.6584300000000001
815,0.6675800000000001
816,0.66987
817,0.67445
818,0.6836
819,0.6904600000000001
820,0.69962
821,0.70877
822,0.7156399999999999
823,0.7248
824,0.73395
825,0.74082
826,0.74998
827,0.7591399999999999
828,0.7660100000000001
829,0.77288
830,0.77517
831,0.77975
832,0.78892
833,0.79579
834,0.79579
835,0.80037
836,0.80953
837,0.8164100000000001
838,0.82599
839,0.8337100000000001
840,0.8372700000000001
841,0.845
842,0.85416
843,0.86103
844,0.87019
845,0.87935
846,0.8862200000000001
847,0.89538
848,0.90455
849,0.9114200000000001
850,0.92058
851,0.92975
852,0.9366200000000001
853,0.94037
854,0.94266
855,0.9495399999999999
856,0.9587100000000001
857,0.96788
858,0.9747600000000001
859,0.97934
860,0.98393
861,0.98705
862,0.9966299999999999
863,1.0012
864,1.0035
865,1.0081
866,1.015
867,1.0173
868,1.0196
869,1.0287
870,1.0356
871,1.0448
872,1.0535
873,1.0604
874,1.0696
875,1.0788
876,1.0857
877,1.0864
878,1.092
879,1.0989
880,1.1081
881,1.1173
882,1.1242
883,1.1334
884,1.1426
885,1.1495
886,1.1586
887,1.1678
888,1.1747
889,1.182
890,1.1859
891,1.1889
892,1.1981
893,1.2073
894,1.2146
895,1.2238
896,1.2329999999999999
897,1.2402
898,1.2414
899,1.2449
900,1.2518
901,1.261
902,1.2702
903,1.2770000000000001
904,1.2862
905,1.2954
906,1.3023
907,1.3115
908,1.3207
909,1.3276
910,1.3287
911,1.3294
912,1.3363
913,1.3452
914,1.3459
915,1.3471
916,1.3468
917,1.3459999999999999
918,1.3449
919,1.3435
920,1.3421
921,1.3417
922,1.3391
923,1.3354
924,1.3324
925,1.3228
926,1.3172
927,1.3138
928,1.3066
929,1.2974
930,1.2905
931,1.2809
932,1.2717
933,1.2648
934,1.2555
935,1.2463
936,1.2417
937,1.2394
938,1.2302
939,1.2279
940,1.2256
941,1.2164
942,1.2095
943,1.2002
944,1.1909999999999998
945,1.1841
946,1.1749
947,1.1657
948,1.1588
949,1.1496
950,1.1403
951,1.1334
952,1.1278
953,1.1264
954,1.1195
955,1.1099
956,1.1007
957,1.0938
958,1.0882
959,1.0868
960,1.0799
961,1.0704
962,1.0612
963,1.0542
964,1.0509
965,1.045
966,1.0381
967,1.0305
968,1.0269
969,1.024
970,1.0148
971,1.0055
972,0.9986
973,0.9893700000000001
974,0.97982
975,0.9729
976,0.96367
977,0.95444
978,0.9534799999999999
979,0.9476100000000001
980,0.9383799999999999
981,0.93145
982,0.92191
983,0.9143600000000001
984,0.91343
985,0.9059
986,0.89666
987,0.8897299999999999
988,0.88049
989,0.87125
990,0.8643299999999999
991,0.8547799999999999
992,0.84555
993,0.83862
994,0.8293799999999999
995,0.8224600000000001
996,0.81692
997,0.8134
998,0.8061699999999999
999,0.79894
1000,0.79545
1001,0.79256
1002,0.7833100000000001
1003,0.7740600000000001
1004,0.76713
1005,0.75789
1006,0.74864
1007,0.7417100000000001
1008,0.73247
1009,0.72322
1010,0.71629
1011,0.70675
1012,0.6975100000000001
1013,0.69058
1014,0.68134
1015,0.67209
1016,0.66718
1017,0.66369
1018,0.6584899999999999
1019,0.65155
1020,0.64231
1021,0.6330600000000001
1022,0.62613
1023,0.6168899999999999
1024,0.60735
1025,0.60042
1026,0.59117
1027,0.5819300000000001
1028,0.57499
1029,0.56575
1030,0.5565100000000001
1031,0.54957
1032,0.54033
1033,0.53483
1034,0.53165
1035,0.52183
1036,0.51432
1037,0.51117
1038,0.5059899999999999
1039,0.49673
1040,0.48978999999999995
1041,0.48053999999999997
1042,0.47101000000000004
1043,0.46408
1044,0.45482
1045,0.44556999999999997
1046,0.43863
1047,0.43521000000000004
1048,0.4344
1049,0.42718999999999996
1050,0.41793
1051,0.41456000000000004
1052,0.41376999999999997
1053,0.40451
1054,0.39526
1055,0.38831
1056,0.37879
1057,0.36953
1058,0.36259
1059,0.35924
1060,0.35386
1061,0.34665999999999997
1062,0.33921
1063,0.33593
1064,0.32874000000000003
1065,0.31947
1066,0.3102
1067,0.30301
1068,0.29374
1069,0.28447
1070,0.28168000000000004
1071,0.27843
1072,0.27124000000000004
1073,0.26429
1074,0.25479
1075,0.24550999999999998
1076,0.23856
1077,0.22929000000000002
1078,0.21978000000000003
1079,0.2126
1080,0.20565
1081,0.20242000000000002
1082,0.19525
1083,0.18597
1084,0.1767
1085,0.16974
1086,0.16046
1087,0.15119000000000002
1088,0.14423
1089,0.13473
1090,0.12546
1091,0.1185
1092,0.10923
1093,0.099955
1094,0.092999
1095,0.083954
1096,0.074683
1097,0.067727
1098,0.05845499999999999
1099,0.049184
1100,0.042227999999999995
1101,0.040854
1102,0.036947
1103,0.029998
1104,0.020732
1105,0.011467
1106,0.004518100000000001
1107,-0.0047479
1108,-0.014013
1109,-0.020959000000000002
1110,-0.030224
1111,-0.0356
1112,-0.038647
1113,-0.045838
1114,-0.055107
1115,-0.062058
1116,-0.071325
1117,-0.080834
1118,-0.087785
1119,-0.090581
1120,-0.091515
1121,-0.092195
1122,-0.093076
1123,-0.093928
1124,-0.094545
1125,-0.09534400000000001
1126,-0.090897
1127,-0.08412599999999999
1128,-0.08255599999999999
1129,-0.083275
1130,-0.081472
1131,-0.079818
1132,-0.070685
1133,-0.066354
1134,-0.064639
1135,-0.057814
1136,-0.050986000000000004
1137,-0.046898
1138,-0.042651
1139,-0.035802999999999995
1140,-0.031407
1141,-0.029567000000000003
1142,-0.022704
1143,-0.013397999999999998
1144,-0.004205899999999999
1145,0.0027761
1146,0.004879100000000001
1147,0.0067851
1148,0.013666
1149,0.022975
1150,0.032284
1151,0.039267
1152,0.048576
1153,0.057885
1154,0.064868
1155,0.07417699999999999
1156,0.08348799999999999
1157,0.09047000000000001
1158,0.09978
1159,0.10909
1160,0.11607
1161,0.12538
1162,0.13469
1163,0.13954
1164,0.14228
1165,0.14704
1166,0.15402000000000002
1167,0.16344
1168,0.17275
1169,0.17973
1170,0.18903
1171,0.19624
1172,0.1989
1173,0.20146
1174,0.20844000000000001
1175,0.21775
1176,0.22718000000000002
1177,0.23415
1178,0.24345999999999998
1179,0.25277
1180,0.25975
1181,0.26905
1182,0.27836
1183,0.28546
1184,0.29035
1185,0.29318
1186,0.30016
1187,0.30946
1188,0.31877
1189,0.32575
1190,0.33505
1191,0.34435
1192,0.35133000000000003
1193,0.36063
1194,0.36994
1195,0.37692
1196,0.38132
1197,0.38597
1198,0.39295
1199,0.40226
1200,0.41156000000000004
1201,0.41853999999999997
1202,0.42086999999999997
1203,0.42111000000000004
1204,0.42344
1205,0.42357
1206,0.43287
1207,0.43751999999999996
1208,0.43985
1209,0.44683
1210,0.4538
1211,0.46311
1212,0.47229
1213,0.47927
1214,0.48857
1215,0.49066000000000004
1216,0.49263
1217,0.49706000000000006
1218,0.50637
1219,0.51335
1220,0.52266
1221,0.5319699999999999
1222,0.53895
1223,0.54815
1224,0.5574600000000001
1225,0.5645399999999999
1226,0.57385
1227,0.58305
1228,0.59003
1229,0.59934
1230,0.60865
1231,0.61563
1232,0.62505
1233,0.63435
1234,0.64123
1235,0.65054
1236,0.65985
1237,0.66683
1238,0.67614
1239,0.6854399999999999
1240,0.69243
1241,0.6967800000000001
1242,0.6964899999999999
1243,0.70338
1244,0.7126899999999999
1245,0.722
1246,0.7289800000000001
1247,0.73829
1248,0.7476
1249,0.75458
1250,0.76389
1251,0.7732100000000001
1252,0.7801899999999999
1253,0.7895
1254,0.79881
1255,0.80579
1256,0.8151
1257,0.8244100000000001
1258,0.8314
1259,0.8407100000000001
1260,0.84993
1261,0.8569200000000001
1262,0.8662299999999999
1263,0.87554
1264,0.8825200000000001
1265,0.8918299999999999
1266,0.90115
1267,0.90822
1268,0.91753
1269,0.92684
1270,0.9338200000000001
1271,0.9431299999999999
1272,0.95236
1273,0.95934
1274,0.96865
1275,0.9779700000000001
1276,0.98495
1277,0.99426
1278,1.0036
1279,1.0106
1280,1.0129
1281,1.0197
1282,1.0266
1283,1.0335
1284,1.0358
1285,1.0403
1286,1.0473
1287,1.0496
1288,1.0566
1289,1.0659
1290,1.0752
1291,1.0822
1292,1.0915
1293,1.1008
1294,1.1078
1295,1.1171
1296,1.1264
1297,1.1334
1298,1.1427
1299,1.1453
1300,1.1479
1301,1.1572
1302,1.1665
1303,1.1735
1304,1.1828
1305,1.1921
1306,1.1991
1307,1.2084
1308,1.2178
1309,1.2247
1310,1.234
1311,1.2434
1312,1.2503
1313,1.2597
1314,1.2690000000000001
1315,1.2713
1316,1.2736
1317,1.2806
1318,1.2876
1319,1.2944
1320,1.2967
1321,1.2989
1322,1.3082
1323,1.3173
1324,1.3243
1325,1.329
1326,1.3313
1327,1.3383
1328,1.3476
1329,1.3569
1330,1.3638
1331,1.3659
1332,1.3681
1333,1.375
1334,1.3844
1335,1.3937
1336,1.4007
1337,1.41
1338,1.4193
1339,1.4263
1340,1.4356
1341,1.4449
1342,1.4519
1343,1.4612
1344,1.4705
1345,1.4775
1346,1.4823
1347,1.4826
1348,1.4896
1349,1.4989
1350,1.5083
1351,1.5153
1352,1.5246
1353,1.534
1354,1.5364
1355,1.5389
1356,1.5412
1357,1.5505
1358,1.5599
1359,1.5668
1360,1.5762
1361,1.5855
1362,1.5877
1363,1.5921
1364,1.6014
1365,1.6059999999999999
1366,1.608
1367,1.6126
1368,1.6195
1369,1.6195
1370,1.6193
1371,1.6191
1372,1.6189
1373,1.6188
1374,1.6187
1375,1.6163
1376,1.607
1377,1.6069
1378,1.6045
1379,1.5951
1380,1.5881
1381,1.5857
1382,1.5787
1383,1.5717
1384,1.5624
1385,1.5531
1386,1.5461
1387,1.5368
1388,1.5275
1389,1.5205
1390,1.5112
1391,1.5018
1392,1.4949
1393,1.4855
1394,1.4762
1395,1.4692
1396,1.4599
1397,1.4506
1398,1.4436
1399,1.4343
1400,1.425
1401,1.4203
1402,1.4179
1403,1.4086
1404,1.4016
1405,1.3923
1406,1.383
1407,1.383
1408,1.3784
1409,1.369
1410,1.3621
1411,1.3527
1412,1.3458
1413,1.3458
1414,1.3459
1415,1.3436
1416,1.3414
1417,1.3321
1418,1.3228
1419,1.3158
1420,1.3064
1421,1.2971
1422,1.2901
1423,1.2809
1424,1.2715
1425,1.2646
1426,1.2552
1427,1.2459
1428,1.2389
1429,1.2343
1430,1.2321
1431,1.2252
1432,1.2159
1433,1.2066
1434,1.1996
1435,1.1903
1436,1.181
1437,1.1740000000000002
1438,1.1647
1439,1.1554
1440,1.1484
1441,1.1391
1442,1.1297
1443,1.1228
1444,1.1134
1445,1.1041
1446,1.0971
1447,1.0878
1448,1.0856
1449,1.0834
1450,1.0837
1451,1.0839
1452,1.0793
1453,1.07
1454,1.0607
1455,1.0537
1456,1.0444
1457,1.0351
1458,1.0281
1459,1.0188
1460,1.0095
1461,1.0025
1462,0.99321
1463,0.9838899999999999
1464,0.9769100000000001
1465,0.96759
1466,0.9582799999999999
1467,0.9560200000000001
1468,0.9536899999999999
1469,0.9490299999999999
1470,0.9421200000000001
1471,0.9328700000000001
1472,0.92363
1473,0.9237
1474,0.9192
1475,0.9098799999999999
1476,0.9029
1477,0.9005700000000001
1478,0.8982399999999999
1479,0.89126
1480,0.88195
1481,0.8726299999999999
1482,0.86565
1483,0.85641
1484,0.8471
1485,0.8401200000000001
1486,0.8308
1487,0.82639
1488,0.8243299999999999
1489,0.81743
1490,0.80812
1491,0.80114
1492,0.79192
1493,0.78261
1494,0.77563
1495,0.7709699999999999
1496,0.76864
1497,0.76166
1498,0.757
1499,0.75235
1500,0.74537
1501,0.73605
1502,0.72675
1503,0.7197600000000001
1504,0.71045
1505,0.70114
1506,0.69416
1507,0.68485
1508,0.6755399999999999
1509,0.66856
1510,0.65925
1511,0.65964
1512,0.65762
1513,0.64832
1514,0.6390100000000001
1515,0.63203
1516,0.62283
1517,0.61352
1518,0.60654
1519,0.60455
1520,0.60269
1521,0.5957100000000001
1522,0.5864
1523,0.57722
1524,0.57024
1525,0.56842
1526,0.56415
1527,0.55718
1528,0.54788
1529,0.53857
1530,0.5316
1531,0.5222899999999999
1532,0.51299
1533,0.50602
1534,0.49685
1535,0.48755
1536,0.48057
1537,0.47126999999999997
1538,0.46429
1539,0.45732
1540,0.45498999999999995
1541,0.45033999999999996
1542,0.44351
1543,0.44147
1544,0.43449
1545,0.42518999999999996
1546,0.42053999999999997
1547,0.42053999999999997
1548,0.41561000000000003
1549,0.40615999999999997
1550,0.40384000000000003
1551,0.40165
1552,0.39715
1553,0.39032
1554,0.38101999999999997
1555,0.37156999999999996
1556,0.36445
1557,0.36430999999999997
1558,0.35966
1559,0.35283000000000003
1560,0.35065
1561,0.3463
1562,0.33948
1563,0.33018000000000003
1564,0.32785
1565,0.32538
1566,0.31578
1567,0.30633
1568,0.29921
1569,0.29456
1570,0.29224
1571,0.28526
1572,0.27596
1573,0.26666
1574,0.25969000000000003
1575,0.25024
1576,0.24094000000000002
1577,0.23396999999999998
1578,0.22466999999999998
1579,0.21536999999999998
1580,0.2084
1581,0.1991
1582,0.1898
1583,0.18282
1584,0.17991
1585,0.17717
1586,0.17019
1587,0.16075
1588,0.15145
1589,0.14447000000000002
1590,0.14160999999999999
1591,0.1389
1592,0.13192
1593,0.12262
1594,0.11331
1595,0.10634
1596,0.09703200000000001
1597,0.087728
1598,0.080751
1599,0.071447
1600,0.064598
1601,0.062672
1602,0.058437
1603,0.049135000000000005
1604,0.042161000000000004
1605,0.032861
1606,0.02356
1607,0.016730000000000002
1608,0.007428100000000001
1609,-0.0018709
1610,-0.0088459
1611,-0.0082449
1612,-0.012424
1613,-0.019396
1614,-0.023719999999999998
1615,-0.023051
1616,-0.024852000000000003
1617,-0.024132
1618,-0.025702
1619,-0.02512
1620,-0.024318
1621,-0.033599000000000004
1622,-0.038034
1623,-0.037193000000000004
1624,-0.03632
1625,-0.035647000000000005
1626,-0.034724
1627,-0.033770999999999995
1628,-0.033038
1629,-0.029972000000000002
1630,-0.020456000000000002
1631,-0.017887
1632,-0.016852000000000002
1633,-0.013475
1634,-0.012657
1635,-0.0095119
1636,1.8058e-05
1637,0.0052081
1638,0.01098
1639,0.015896
1640,0.022828
1641,0.032074
1642,0.041319999999999996
1643,0.048543
1644,0.057789
1645,0.067035
1646,0.07396699999999999
1647,0.081191
1648,0.082363
1649,0.08557100000000001
1650,0.086791
1651,0.09233999999999999
1652,0.099266
1653,0.1085
1654,0.11805
1655,0.12497
1656,0.13421
1657,0.14113
1658,0.14344
1659,0.15037
1660,0.1596
1661,0.16422
1662,0.16652999999999998
1663,0.17115
1664,0.17808
1665,0.18731
1666,0.19625
1667,0.20318
1668,0.21241999999999997
1669,0.22165
1670,0.22858
1671,0.23753000000000002
1672,0.23865999999999998
1673,0.2404
1674,0.24965
1675,0.25889
1676,0.26583
1677,0.27508
1678,0.28431999999999996
1679,0.29125999999999996
1680,0.30051
1681,0.30976
1682,0.3167
1683,0.32364
1684,0.32595
1685,0.32826
1686,0.33751
1687,0.34704
1688,0.34731999999999996
1689,0.34992
1690,0.35945
1691,0.36667
1692,0.3762
1693,0.38083
1694,0.38314000000000004
1695,0.39036
1696,0.39960999999999997
1697,0.40654
1698,0.41578999999999994
1699,0.42504
1700,0.43198000000000003
1701,0.44151
1702,0.45076000000000005
1703,0.45769
1704,0.46695
1705,0.47416
1706,0.47502
1707,0.48051000000000005
1708,0.48975
1709,0.49668
1710,0.50593
1711,0.51518
1712,0.5221100000000001
1713,0.53165
1714,0.54089
1715,0.54783
1716,0.55072
1717,0.5539
1718,0.55911
1719,0.56835
1720,0.57529
1721,0.58453
1722,0.59377
1723,0.6007100000000001
1724,0.60995
1725,0.61949
1726,0.62642
1727,0.63567
1728,0.64491
1729,0.65184
1730,0.66109
1731,0.66688
1732,0.66777
1733,0.67701
1734,0.68625
1735,0.69319
1736,0.70243
1737,0.71167
1738,0.7186
1739,0.72785
1740,0.7370899999999999
1741,0.74432
1742,0.75326
1743,0.7628
1744,0.76973
1745,0.77898
1746,0.78822
1747,0.7951600000000001
1748,0.8044
1749,0.81365
1750,0.8168300000000001
1751,0.81802
1752,0.82726
1753,0.83419
1754,0.84373
1755,0.8529700000000001
1756,0.8529700000000001
1757,0.8578899999999999
1758,0.8677299999999999
1759,0.8749600000000001
1760,0.8798799999999999
1761,0.88481
1762,0.8920399999999999
1763,0.89435
1764,0.8992700000000001
1765,0.9062
1766,0.9154399999999999
1767,0.92468
1768,0.9296
1769,0.9325200000000001
1770,0.93714
1771,0.9440700000000001
1772,0.9536100000000001
1773,0.96315
1774,0.97039
1775,0.97301
1776,0.9753200000000001
1777,0.98193
1778,0.98625
1779,0.98795
1780,0.9945799999999999
1781,1.0035
1782,1.0078
1783,1.0101
1784,1.0171
1785,1.0263
1786,1.0333
1787,1.0425
1788,1.0517
1789,1.0587
1790,1.0679
1791,1.0772
1792,1.0841
1793,1.0933
1794,1.1026
1795,1.1095
1796,1.1147
1797,1.1182
1798,1.1254
1799,1.1347
1800,1.1442
1801,1.1512
1802,1.1604
1803,1.1696
1804,1.1728
1805,1.1807
1806,1.1902
1807,1.1971
1808,1.2064
1809,1.2159
1810,1.2229
1811,1.2301
1812,1.2336
1813,1.2412
1814,1.2504
1815,1.2599
1816,1.2669
1817,1.2704
1818,1.276
1819,1.2829
1820,1.2921
1821,1.3014
1822,1.3083
1823,1.3175
1824,1.3268
1825,1.3337
1826,1.3429
1827,1.3522
1828,1.3591
1829,1.3683
1830,1.3776
1831,1.3848
1832,1.3940000000000001
1833,1.4033
1834,1.4102
1835,1.4194
1836,1.423
1837,1.4262
1838,1.4358
1839,1.4364
1840,1.4374
1841,1.4387
1842,1.44
1843,1.4409999999999998
1844,1.4424
1845,1.4404
1846,1.4338
1847,1.4303
1848,1.4317
1849,1.4248
1850,1.4159
1851,1.4067
1852,1.3998
1853,1.3986
1854,1.3943
1855,1.3874
1856,1.3782
1857,1.369
1858,1.3621
1859,1.3529
1860,1.3483
1861,1.3459999999999999
1862,1.3414
1863,1.3322
1864,1.3253
1865,1.3161
1866,1.3069
1867,1.3069
1868,1.308
1869,1.3095
1870,1.3107
1871,1.3099
1872,1.3115
1873,1.3096
1874,1.3004
1875,1.2916
1876,1.2847
1877,1.2782
1878,1.2775
1879,1.2761
1880,1.2669
1881,1.2581
1882,1.2513
1883,1.2448
1884,1.2442
1885,1.2404
1886,1.2312
1887,1.2221
1888,1.2152
1889,1.206
1890,1.1969
1891,1.19
1892,1.1809
1893,1.1717
1894,1.1648
1895,1.1561
1896,1.1469
1897,1.1401
1898,1.1309
1899,1.1241
1900,1.1149
1901,1.1057
1902,1.1012
1903,1.0989
1904,1.092
1905,1.0874
1906,1.0852
1907,1.0787
1908,1.0723
1909,1.0636
1910,1.0549
1911,1.048
1912,1.048
1913,1.0471
1914,1.0425
1915,1.0334
1916,1.0243
1917,1.0174
1918,1.0083
1919,0.99913
1920,0.99274
1921,0.98361
1922,0.9744700000000001
1923,0.96762
1924,0.95849
1925,0.94936
1926,0.9425100000000001
1927,0.94163
1928,0.94124
1929,0.9344
1930,0.9252799999999999
1931,0.9161600000000001
1932,0.9093200000000001
1933,0.9002
1934,0.8910899999999999
1935,0.88425
1936,0.87513
1937,0.8660200000000001
1938,0.8591799999999999
1939,0.8500700000000001
1940,0.84096
1941,0.8341299999999999
1942,0.8255100000000001
1943,0.8164
1944,0.80957
1945,0.8004600000000001
1946,0.7913600000000001
1947,0.7845300000000001
1948,0.7804800000000001
1949,0.7782
1950,0.77137
1951,0.76277
1952,0.7541800000000001
1953,0.7501399999999999
1954,0.74888
1955,0.74485
1956,0.73803
1957,0.72843
1958,0.72564
1959,0.7228600000000001
1960,0.71275
1961,0.70315
1962,0.69633
1963,0.69405
1964,0.6912699999999999
1965,0.68445
1966,0.6753600000000001
1967,0.66627
1968,0.65945
1969,0.65037
1970,0.6412800000000001
1971,0.63447
1972,0.62538
1973,0.6163
1974,0.60949
1975,0.6004
1976,0.59132
1977,0.5845100000000001
1978,0.58103
1979,0.58089
1980,0.57689
1981,0.56782
1982,0.55875
1983,0.55196
1984,0.54289
1985,0.53383
1986,0.52703
1987,0.5179699999999999
1988,0.5089199999999999
1989,0.50212
1990,0.49307
1991,0.48401000000000005
1992,0.47777
1993,0.46871999999999997
1994,0.45968000000000003
1995,0.45288999999999996
1996,0.44383999999999996
1997,0.4348
1998,0.42801000000000006
1999,0.41897
2000,0.40993
2001,0.40315
2002,0.39411
2003,0.38508000000000003
2004,0.3783
2005,0.36927
2006,0.36023
2007,0.35346
2008,0.34443
2009,0.3354
2010,0.32863000000000003
2011,0.31961
2012,0.31058
2013,0.30382
2014,0.29479
2015,0.28578000000000003
2016,0.27901
2017,0.27
2018,0.26098000000000005
2019,0.25422
2020,0.24461999999999998
2021,0.2362
2022,0.22944
2023,0.22044
2024,0.21083000000000002
2025,0.20407999999999998
2026,0.19508
2027,0.18607
2028,0.17933
2029,0.17197
2030,0.16732
2031,0.16387000000000002
2032,0.15487
2033,0.14586
2034,0.1391
2035,0.1301
2036,0.1211
2037,0.11435
2038,0.10475
2039,0.09575
2040,0.089004
2041,0.08001
2042,0.071016
2043,0.064274
2044,0.055285
2045,0.046298
2046,0.039559
2047,0.030574
2048,0.021594
2049,0.014859
2050,0.0065051
2051,-0.0024679000000000003
2052,-0.0098269
2053,-0.018165999999999998
2054,-0.027135000000000003
2055,-0.03386
2056,-0.043460000000000006
2057,-0.051785000000000005
2058,-0.058505999999999996
2059,-0.068106
2060,-0.07642
2061,-0.083136
2062,-0.092086
2063,-0.10103999999999999
2064,-0.10775
2065,-0.11669000000000002
2066,-0.12563
2067,-0.13234
2068,-0.14128
2069,-0.14351
2070,-0.14575
2071,-0.15467999999999998
2072,-0.15692
2073,-0.15915
2074,-0.16808
2075,-0.17701
2076,-0.1837
2077,-0.19263
2078,-0.19932
2079,-0.20824
2080,-0.21716
2081,-0.22384
2082,-0.22984000000000002
2083,-0.22933
2084,-0.23016999999999999
2085,-0.23906
2086,-0.24795
2087,-0.25461999999999996
2088,-0.2635
2089,-0.27239
2090,-0.27905
2091,-0.28792
2092,-0.29608
2093,-0.30345
2094,-0.31232
2095,-0.32047
2096,-0.32711
2097,-0.33597
2098,-0.34483
2099,-0.35146
2100,-0.36030999999999996
2101,-0.36548
2102,-0.36546999999999996
2103,-0.3684
2104,-0.37722
2105,-0.38308000000000003
2106,-0.3919
2107,-0.39402
2108,-0.39392
2109,-0.39974
2110,-0.40775
2111,-0.41434
2112,-0.42233000000000004
2113,-0.42356000000000005
2114,-0.42416000000000004
2115,-0.43291
2116,-0.44166000000000005
2117,-0.44741000000000003
2118,-0.45315
2119,-0.45206999999999997
2120,-0.45261
2121,-0.46132
2122,-0.4692
2123,-0.47573000000000004
2124,-0.48141000000000006
2125,-0.48022
2126,-0.48286
2127,-0.49153
2128,-0.49933
2129,-0.50583
2130,-0.50843
2131,-0.5071
2132,-0.51054
2133,-0.50878
2134,-0.50612
2135,-0.50345
2136,-0.49986
2137,-0.49623999999999996
2138,-0.49441999999999997
2139,-0.49136
2140,-0.48646999999999996
2141,-0.48157
2142,-0.47423000000000004
2143,-0.46567
2144,-0.45925
2145,-0.45068
2146,-0.44211000000000006
2147,-0.43567
2148,-0.42618999999999996
2149,-0.4176
2150,-0.41116
2151,-0.40256
2152,-0.39397
2153,-0.38750999999999997
2154,-0.37890999999999997
2155,-0.37029
2156,-0.36383000000000004
2157,-0.35686
2158,-0.35329
2159,-0.34684
2160,-0.33823000000000003
2161,-0.32961999999999997
2162,-0.32227
2163,-0.31365
2164,-0.30503
2165,-0.30111
2166,-0.2954
2167,-0.28806
2168,-0.2816
2169,-0.27209
2170,-0.26348
2171,-0.25955
2172,-0.25384
2173,-0.24649000000000001
2174,-0.24003000000000002
2175,-0.23142
2176,-0.2228
2177,-0.21634
2178,-0.20683
2179,-0.19821
2180,-0.19174000000000002
2181,-0.1831
2182,-0.17447000000000001
2183,-0.16798
2184,-0.16233
2185,-0.15323
2186,-0.14675
2187,-0.13812
2188,-0.12947999999999998
2189,-0.12300000000000001
2190,-0.11348
2191,-0.10482999999999999
2192,-0.098345
2193,-0.09099299999999999
2194,-0.085363
2195,-0.079299
2196,-0.07065700000000001
2197,-0.06201
2198,-0.054654999999999995
2199,-0.046004
2200,-0.037347000000000005
2201,-0.033019
2202,-0.027402999999999997
2203,-0.020477000000000002
2204,-0.013992
2205,-0.0053419
2206,0.0041761
2207,0.0093661
2208,0.014994
2209,0.023216999999999998
2210,0.0297
2211,0.039216
2212,0.047863
2213,0.05176
2214,0.057402
2215,0.06475700000000001
2216,0.071235
2217,0.07987999999999999
2218,0.089393
2219,0.095881
2220,0.10453
2221,0.11059000000000001
2222,0.11535
2223,0.12140999999999999
2224,0.13093
2225,0.13483
2226,0.14049
2227,0.14872
2228,0.15519000000000002
2229,0.15999000000000002
2230,0.16568
2231,0.17303
2232,0.18253
2233,0.18824000000000002
2234,0.19217
2235,0.20167000000000002
2236,0.20776
2237,0.2126
2238,0.21869
2239,0.22729000000000002
2240,0.23464000000000002
2241,0.24324
2242,0.24933000000000002
2243,0.25417
2244,0.26242
2245,0.27191
2246,0.27676999999999996
2247,0.28253
2248,0.29202
2249,0.29813
2250,0.30391999999999997
2251,0.31432
2252,0.32166
2253,0.32533
2254,0.33115
2255,0.33393
2256,0.33886
2257,0.34833000000000003
2258,0.35353
2259,0.35727
2260,0.36008
2261,0.36599
2262,0.37308
2263,0.38040999999999997
2264,0.38656999999999997
2265,0.39037
2266,0.39324000000000003
2267,0.39709
2268,0.40096
2269,0.40387
2270,0.40778000000000003
2271,0.4117
2272,0.40847
2273,0.40102
2274,0.39978
2275,0.40276999999999996
2276,0.39636
2277,0.39519
2278,0.39821999999999996
2279,0.39295
2280,0.38559
2281,0.38344
2282,0.38545999999999997
2283,0.37815
2284,0.37188000000000004
2285,0.36354000000000003
2286,0.3552
2287,0.34895
2288,0.34063000000000004
2289,0.3323
2290,0.32606
2291,0.31979
2292,0.31456999999999996
2293,0.30833
2294,0.3
2295,0.29168
2296,0.28545
2297,0.27608
2298,0.26777
2299,0.26154
2300,0.25324
2301,0.24486
2302,0.24067
2303,0.23339000000000001
2304,0.22508000000000003
2305,0.21886
2306,0.21056999999999998
2307,0.20228
2308,0.19607
2309,0.18779
2310,0.17844000000000002
2311,0.17224
2312,0.16397
2313,0.15572
2314,0.14953
2315,0.14117000000000002
2316,0.13479000000000002
2317,0.12958
2318,0.12132000000000001
2319,0.11307
2320,0.10689000000000001
2321,0.09864099999999999
2322,0.090404
2323,0.084231
2324,0.07600599999999999
2325,0.067787
2326,0.061626
2327,0.05341900000000001
2328,0.049317
2329,0.047267
2330,0.043167000000000004
2331,0.037022
2332,0.034974
2333,0.031992
2334,0.024929
2335,0.019921
2336,0.012884
2337,0.0047301
2338,0.0026941
2339,0.0040551
2340,-0.004077900000000001
2341,-0.010173999999999999
2342,-0.018294
2343,-0.026407999999999997
2344,-0.03249
2345,-0.040592
2346,-0.048685
2347,-0.054751
2348,-0.062834
2349,-0.070908
2350,-0.076958
2351,-0.086187
2352,-0.09287100000000001
2353,-0.097215
2354,-0.10529000000000001
2355,-0.11335
2356,-0.11939000000000001
2357,-0.12862
2358,-0.13667
2359,-0.1427
2360,-0.15073
2361,-0.15875999999999998
2362,-0.16477
2363,-0.17278
2364,-0.18154
2365,-0.18711
2366,-0.19312
2367,-0.20114
2368,-0.20714000000000002
2369,-0.21515
2370,-0.22434
2371,-0.23033
2372,-0.23831
2373,-0.24628000000000003
2374,-0.25226
2375,-0.26021
2376,-0.26816
2377,-0.27412
2378,-0.28205
2379,-0.28998
2380,-0.29591999999999996
2381,-0.3028
2382,-0.30846
2383,-0.3144
2384,-0.32233
2385,-0.33024000000000003
2386,-0.33741
2387,-0.34531
2388,-0.3532
2389,-0.35911
2390,-0.36699
2391,-0.37485999999999997
2392,-0.38075
2393,-0.38718
2394,-0.39415
2395,-0.39933
2396,-0.40719
2397,-0.41505
2398,-0.42093
2399,-0.43003
2400,-0.43786
2401,-0.44373
2402,-0.45153999999999994
2403,-0.45866999999999997
2404,-0.46443
2405,-0.47018999999999994
2406,-0.47801000000000005
2407,-0.48386
2408,-0.49167
2409,-0.49945
2410,-0.50529
2411,-0.5130600000000001
2412,-0.52082
2413,-0.52663
2414,-0.53437
2415,-0.5421
2416,-0.54789
2417,-0.5556
2418,-0.5633
2419,-0.56907
2420,-0.57807
2421,-0.5857399999999999
2422,-0.59148
2423,-0.59913
2424,-0.60677
2425,-0.61249
2426,-0.62011
2427,-0.6260399999999999
2428,-0.6319600000000001
2429,-0.63902
2430,-0.64664
2431,-0.65235
2432,-0.65995
2433,-0.6675300000000001
2434,-0.6732100000000001
2435,-0.68078
2436,-0.68833
2437,-0.69398
2438,-0.7015100000000001
2439,-0.7085199999999999
2440,-0.71603
2441,-0.72353
2442,-0.72914
2443,-0.73661
2444,-0.74453
2445,-0.74869
2446,-0.75569
2447,-0.76317
2448,-0.76876
2449,-0.7762100000000001
2450,-0.78364
2451,-0.7892100000000001
2452,-0.79803
2453,-0.80543
2454,-0.81097
2455,-0.81834
2456,-0.8267200000000001
2457,-0.8328399999999999
2458,-0.8393700000000001
2459,-0.8467399999999999
2460,-0.85226
2461,-0.8596
2462,-0.8683700000000001
2463,-0.8738600000000001
2464,-0.88116
2465,-0.88845
2466,-0.8939
2467,-0.90154
2468,-0.90954
2469,-0.915
2470,-0.92227
2471,-0.93099
2472,-0.93642
2473,-0.94365
2474,-0.95201
2475,-0.9582299999999999
2476,-0.9647899999999999
2477,-0.97201
2478,-0.9774200000000001
2479,-0.98461
2480,-0.9932700000000001
2481,-0.99864
2482,-1.0058
2483,-1.0129
2484,-1.0183
2485,-1.0261
2486,-1.0323
2487,-1.0377
2488,-1.0448
2489,-1.0534
2490,-1.0587
2491,-1.0658
2492,-1.0728
2493,-1.0792
2494,-1.087
2495,-1.0941
2496,-1.1009
2497,-1.1079
2498,-1.1149
2499,-1.1202
2500,-1.1287
2501,-1.1366
2502,-1.1414
2503,-1.1484
2504,-1.1569
2505,-1.1621
2506,-1.1689
2507,-1.1768
2508,-1.1817
2509,-1.1886
2510,-1.1956
2511,-1.2007
2512,-1.2092
2513,-1.2161
2514,-1.2212
2515,-1.2292
2516,-1.2357
2517,-1.2408
2518,-1.2492
2519,-1.2561
2520,-1.2612
2521,-1.2692
2522,-1.2757
2523,-1.2808
2524,-1.2876
2525,-1.296
2526,-1.3011
2527,-1.3092
2528,-1.3157
2529,-1.3207
2530,-1.3275
2531,-1.3358
2532,-1.3409
2533,-1.3476
2534,-1.3542
2535,-1.3591
2536,-1.3673
2537,-1.374
2538,-1.3806
2539,-1.3872
2540,-1.3938
2541,-1.4004
2542,-1.4103
2543,-1.4169
2544,-1.4235
2545,-1.4301
2546,-1.4366
2547,-1.4432
2548,-1.4498
2549,-1.4581
2550,-1.4647
2551,-1.4745
2552,-1.4811
2553,-1.486
2554,-1.4942
2555,-1.5007
2556,-1.5074
2557,-1.514
2558,-1.5222
2559,-1.5288
2560,-1.5371
2561,-1.5453
2562,-1.5501
2563,-1.5568
2564,-1.5651
2565,-1.5716
2566,-1.5798
2567,-1.5881
2568,-1.5947
2569,-1.6029
2570,-1.6128
2571,-1.6194
2572,-1.6276
2573,-1.6342
2574,-1.6408
2575,-1.649
2576,-1.6588
2577,-1.6655
2578,-1.6721
2579,-1.6803
2580,-1.6835
2581,-1.6918
2582,-1.7001
2583,-1.7066
2584,-1.7115
2585,-1.7199
2586,-1.7248
2587,-1.7313
2588,-1.7379
2589,-1.7445
2590,-1.7512
2591,-1.7593
2592,-1.7643
2593,-1.7726
2594,-1.7808
2595,-1.7873
2596,-1.794
2597,-1.8039
2598,-1.8087
2599,-1.8152
2600,-1.8233
2601,-1.8298
2602,-1.8382
2603,-1.8464
2604,-1.8511
2605,-1.8575
2606,-1.8638
2607,-1.8702
2608,-1.8765
2609,-1.8848
2610,-1.8915
2611,-1.8979
2612,-1.9041
2613,-1.9088
2614,-1.9166
2615,-1.9227
2616,-1.9272
2617,-1.9356
2618,-1.9439
2619,-1.9502
2620,-1.9562
2621,-1.9607
2622,-1.9666
2623,-1.9724
2624,-1.9768
2625,-1.9843
2626,-1.99
2627,-1.9943
2628,-1.9999
2629,-2.0054
2630,-2.0096
2631,-2.0174
2632,-2.0264
2633,-2.0305
2634,-2.0378
2635,-2.0431
2636,-2.0471
2637,-2.0523
2638,-2.0575
2639,-2.0614
2640,-2.0684
2641,-2.0734
2642,-2.0771
2643,-2.082
2644,-2.0868
2645,-2.0904
2646,-2.0951
2647,-2.0997
2648,-2.1058
2649,-2.113
2650,-2.1196
2651,-2.123
2652,-2.1275
2653,-2.1319
2654,-2.1351
2655,-2.1393
2656,-2.1456
2657,-2.1486
2658,-2.1527
2659,-2.1566
2660,-2.1595
2661,-2.1633
2662,-2.167
2663,-2.1697
2664,-2.1732
2665,-2.1827
2666,-2.1892
2667,-2.1927
2668,-2.1959999999999997
2669,-2.1985
2670,-2.2017
2671,-2.2048
2672,-2.2071
2673,-2.21
2674,-2.2151
2675,-2.2171
2676,-2.2198
2677,-2.2224
2678,-2.2242
2679,-2.2266
2680,-2.2265
2681,-2.2282
2682,-2.2325
2683,-2.2344
2684,-2.2358
2685,-2.2376
2686,-2.2392
2687,-2.2404
2688,-2.2457
2689,-2.2553
2690,-2.2583
2691,-2.2596
2692,-2.2608
2693,-2.2616
2694,-2.2626
2695,-2.2635
2696,-2.2640000000000002
2697,-2.2647
2698,-2.2652
2699,-2.2656
2700,-2.2659
2701,-2.2661
2702,-2.2661
2703,-2.2661
2704,-2.2661
2705,-2.2685
2706,-2.2685
2707,-2.2685
2708,-2.2685
