time,value
0,0.28465999999999997
1,1.1806
2,1.1806
3,-0.25293000000000004
4,-0.9697100000000001
5,-0.9697100000000001
6,-0.9697100000000001
7,-0.9697100000000001
8,1.091
9,1.1806
10,1.1806
11,-0.70091
12,-0.9697100000000001
13,-0.9697100000000001
14,-0.9697100000000001
15,-0.9697100000000001
16,-0.9697100000000001
17,0.46385
18,1.3598
19,1.1806
20,0.64305
21,-0.9697100000000001
22,-0.9697100000000001
23,-0.9697100000000001
24,-0.9697100000000001
25,-0.9697100000000001
26,-0.9697100000000001
27,0.19505999999999998
28,1.2702
29,1.1806
30,1.1806
31,-0.79051
32,-0.9697100000000001
33,-0.9697100000000001
34,-0.9697100000000001
35,-0.9697100000000001
36,1.0014
37,1.2702
38,1.1806
39,0.64305
40,-0.9697100000000001
41,-0.9697100000000001
42,-0.9697100000000001
43,0.10545999999999998
44,1.1806
45,1.1806
46,1.0014
47,-0.9697100000000001
48,-0.9697100000000001
49,-0.9697100000000001
50,-0.9697100000000001
51,1.1806
52,1.2702
53,1.1806
54,1.091
55,0.10545999999999998
56,-0.9697100000000001
57,-0.9697100000000001
58,-0.9697100000000001
59,1.2702
60,1.1806
61,1.091
62,-0.70091
63,-0.9697100000000001
64,-0.9697100000000001
65,-0.9697100000000001
66,1.3598
67,1.1806
68,1.1806
69,-0.70091
70,-0.9697100000000001
71,-0.9697100000000001
72,0.46385
73,1.1806
74,1.1806
75,0.015865999999999998
76,-0.9697100000000001
77,-0.9697100000000001
78,-0.9697100000000001
79,1.2702
80,1.1806
81,1.1806
82,-0.9697100000000001
83,-0.9697100000000001
84,-0.9697100000000001
85,-0.9697100000000001
86,0.64305
87,1.1806
88,1.1806
89,-0.16333
90,-0.9697100000000001
91,-0.9697100000000001
92,-0.79051
93,0.73265
94,1.1806
95,1.1806
