time,value
0,-0.1446
1,-0.18977
2,-0.15213
3,-0.18977
4,-0.14836
5,-0.17095
6,-0.17471
7,-0.15965
8,-0.18977
9,-0.14836
10,-0.19729000000000002
11,-0.15965
12,-0.15965
13,-0.18600000000000003
14,-0.15213
15,-0.18600000000000003
16,-0.13330999999999998
17,-0.18600000000000003
18,-0.16342
19,-0.15965
20,-0.18600000000000003
21,-0.14082999999999998
22,-0.18600000000000003
23,-0.16342
24,-0.15589
25,-0.17471
26,-0.14082999999999998
27,-0.18224
28,-0.11825
29,-0.16718
30,-0.16718
31,-0.15589
32,-0.17847000000000002
33,-0.14082999999999998
34,-0.18600000000000003
35,-0.12954000000000002
36,-0.13707
37,-0.16718
38,-0.12201
39,-0.18600000000000003
40,-0.13330999999999998
41,-0.17471
42,-0.17095
43,-0.16342
44,-0.18224
45,-0.12954000000000002
46,-0.17095
47,-0.15213
48,-0.16718
49,5.4110000000000005
50,7.6919
51,2.0121
52,-0.054264
53,-0.14082999999999998
54,-0.12201
55,-0.14836
56,-0.14082999999999998
57,-0.11825
58,-0.15213
59,-0.13330999999999998
60,-0.17471
61,-0.15213
62,-0.17095
63,-0.17095
64,-0.13330999999999998
65,-0.16342
66,-0.1446
67,-0.17471
68,-0.14836
69,-0.17471
70,-0.17095
71,-0.15965
72,-0.18600000000000003
73,-0.14082999999999998
74,-0.18977
75,-0.14082999999999998
76,-0.17847000000000002
77,-0.17471
78,-0.16718
79,-0.18224
80,-0.14836
81,-0.19729000000000002
82,-0.15589
83,-0.17847000000000002
84,-0.17471
85,-0.17095
86,-0.18600000000000003
87,-0.14836
88,-0.20106
89,-0.16342
90,-0.19729000000000002
91,-0.17471
92,-0.18600000000000003
93,-0.19353
94,-0.16718
95,-0.18224
