time,value
0,1.3233
1,0.06758099999999999
2,-1.1881
3,-0.1417
4,0.90471
5,-0.1417
6,1.3233
7,-0.97883
8,-1.1881
9,0.69543
10,0.06758099999999999
11,0.90471
12,0.48615
13,-1.1881
14,-1.1881
15,1.3233
16,-0.5602699999999999
17,1.5326
18,-0.1417
19,-1.1881
20,-0.5602699999999999
21,1.5326
22,-0.76955
23,1.5326
24,-0.76955
25,-1.1881
26,0.06758099999999999
27,0.69543
28,-0.1417
29,1.3233
30,-0.97883
31,-1.1881
32,0.90471
33,-0.1417
34,0.06758099999999999
35,1.3233
36,-1.1881
37,-1.1881
38,1.5326
39,-0.76955
40,0.69543
41,0.69543
42,-1.1881
43,-0.1417
44,0.90471
45,-1.1881
46,0.90471
47,0.27686
48,-1.1881
49,0.69543
50,0.27686
51,-1.3974
52,0.90471
53,0.27686
54,-1.1881
55,1.3233
56,-0.5602699999999999
57,-1.3974
58,0.90471
59,0.27686
60,-0.76955
61,1.3233
62,-0.76955
63,-1.1881
64,0.90471
65,0.27686
66,-0.1417
67,1.114
68,-1.1881
69,-1.1881
70,0.90471
71,0.27686
72,0.48615
73,0.48615
74,-1.1881
75,-1.6067
76,0.69543
77,0.48615
78,0.90471
79,0.06758099999999999
80,-1.1881
81,-1.1881
82,0.48615
83,0.69543
84,1.5326
85,-0.5602699999999999
86,-1.1881
87,-1.1881
88,0.27686
89,1.5326
90,1.3233
91,-0.97883
92,-1.3974
93,-1.1881
94,0.06758099999999999
95,2.3697
