time,value
0,-0.48003
1,-0.48003
2,-0.48003
3,-0.48003
4,-0.48003
5,-0.48003
6,-0.48003
7,-0.48003
8,-0.48003
9,-0.48003
10,-0.48003
11,-0.48003
12,-0.48003
13,-0.48003
14,-0.48003
15,-0.48003
16,-0.48003
17,-0.48003
18,-0.48003
19,-0.48003
20,-0.48003
21,-0.48003
22,-0.48003
23,-0.48003
24,-0.48003
25,-0.48003
26,-0.48003
27,-0.48003
28,-0.48003
29,-0.48003
30,-0.48003
31,-0.48003
32,-0.48003
33,-0.48003
34,-0.48003
35,-0.48003
36,-0.48003
37,-0.48003
38,-0.48003
39,-0.48003
40,-0.48003
41,-0.48003
42,-0.48003
43,-0.48003
44,-0.48003
45,-0.48003
46,-0.48003
47,-0.48003
48,-0.48003
49,-0.48003
50,-0.48003
51,-0.48003
52,-0.48003
53,-0.48003
54,-0.48003
55,-0.48003
56,-0.48003
57,-0.48003
58,-0.48003
59,-0.48003
60,-0.48003
61,-0.48003
62,-0.48003
63,-0.48003
64,-0.48003
65,-0.48003
66,-0.48003
67,-0.48003
68,-0.48003
69,-0.48003
70,-0.48003
71,-0.48003
72,-0.48003
73,-0.48003
74,-0.48003
75,0.34583
76,3.3189
77,2.8234
78,1.9976
79,1.9976
80,1.8324
81,1.8324
82,1.6672
83,1.8324
84,1.9976
85,1.8324
86,1.6672
87,1.5019999999999998
88,1.1717
89,1.8324
90,2.3279
91,1.8324
92,2.4931
93,2.3279
94,-0.14969000000000002
95,-0.48003
