time,value
0,-1.2789
1,-1.1642
2,-0.96175
3,-0.67289
4,-0.31993
5,0.05532
6,0.40831999999999996
7,0.71755
8,0.9830899999999999
9,1.2247
10,1.4442
11,1.6341
12,1.7694
13,1.8503
14,1.8865
15,1.9018
16,1.9080000000000001
17,1.8997
18,1.8679
19,1.7990000000000002
20,1.6982
21,1.5686
22,1.4279
23,1.2855
24,1.1576
25,1.0489
26,0.96467
27,0.9084200000000001
28,0.8915799999999999
29,0.925
30,1.0154
31,1.1589
32,1.3433
33,1.5539
34,1.761
35,1.9393
36,2.0534
37,2.0944
38,2.0537
39,1.9435
40,1.7747
41,1.5717
42,1.3576
43,1.1475
44,0.9484899999999999
45,0.75111
46,0.5552199999999999
47,0.34779
48,0.13454000000000002
49,-0.079934
50,-0.27132
51,-0.42403
52,-0.53455
53,-0.6117100000000001
54,-0.66927
55,-0.70534
56,-0.7297899999999999
57,-0.73965
58,-0.75268
59,-0.76025
60,-0.7678699999999999
61,-0.76771
62,-0.7618
63,-0.74064
64,-0.68748
65,-0.5915
66,-0.44701
67,-0.27364
68,-0.08576900000000001
69,0.093257
70,0.26568
71,0.43796999999999997
72,0.62607
73,0.8276600000000001
74,1.0225
75,1.1865
76,1.3087
77,1.3987
78,1.4632
79,1.5019999999999998
80,1.5031
81,1.4638
82,1.3851
83,1.2739
84,1.1382
85,0.9904700000000001
86,0.8397600000000001
87,0.68545
88,0.52242
89,0.35202
90,0.19058
91,0.050263999999999996
92,-0.061905999999999996
93,-0.15558
94,-0.23376
95,-0.30448000000000003
96,-0.37088000000000004
97,-0.44058
98,-0.51251
99,-0.5777100000000001
100,-0.63621
101,-0.6828
102,-0.7328
103,-0.77684
104,-0.8201799999999999
105,-0.85188
106,-0.8771700000000001
107,-0.89605
108,-0.90843
109,-0.9115700000000001
110,-0.89675
111,-0.87056
112,-0.8313200000000001
113,-0.79033
114,-0.7373
115,-0.66981
116,-0.5667
117,-0.40113000000000004
118,-0.14327
119,0.20621
120,0.59553
121,0.95019
122,1.2127
123,1.3797
124,1.4729
125,1.5202
126,1.5331
127,1.5259
128,1.5127
129,1.5038
130,1.4973
131,1.4845
132,1.4584
133,1.4145
134,1.3512
135,1.2648
136,1.1556
137,1.0232
138,0.87331
139,0.71113
140,0.54433
141,0.37445
142,0.20331
143,0.032551
144,-0.12924000000000002
145,-0.27203
146,-0.39511
147,-0.49746999999999997
148,-0.58948
149,-0.6661600000000001
150,-0.7328
151,-0.78667
152,-0.83614
153,-0.8795299999999999
154,-0.91625
155,-0.94321
156,-0.96044
157,-0.9737299999999999
158,-0.98141
159,-0.99031
160,-0.9965799999999999
161,-1.0062
162,-1.0146
163,-1.0231
164,-1.0295
165,-1.0357
166,-1.0422
167,-1.0475
168,-1.0534
169,-1.0596
170,-1.0697
171,-1.0811
172,-1.0949
173,-1.1094
174,-1.1239
175,-1.1342
176,-1.1364
177,-1.1308
178,-1.1188
179,-1.1021
180,-1.0778
181,-1.0494
182,-1.0212
183,-1.0018
184,-0.99077
185,-0.9868
186,-0.98919
187,-0.9973200000000001
188,-1.0125
189,-1.0252
190,-1.0341
191,-1.0327
192,-1.0293
193,-1.0235
194,-1.0205
195,-1.0189
196,-1.0175
197,-1.0137
198,-1.0008
199,-0.9748700000000001
200,-0.9280299999999999
201,-0.85541
202,-0.7392
203,-0.56183
204,-0.30754000000000004
205,0.0063653
206,0.33701
207,0.63015
208,0.8518700000000001
209,0.99721
210,1.0741
211,1.0936
212,1.0590000000000002
213,0.9822299999999999
214,0.87544
215,0.75864
216,0.64279
217,0.53589
218,0.43798000000000004
219,0.34824
220,0.26816
221,0.20221
222,0.15684
223,0.13343
224,0.13095
225,0.1435
226,0.16698
227,0.19178
228,0.21208000000000002
229,0.21986
230,0.21834
231,0.20664000000000002
232,0.18617
233,0.1512
234,0.097887
235,0.027478
236,-0.061126
237,-0.16050999999999999
238,-0.26976999999999995
239,-0.37629
240,-0.47798999999999997
241,-0.57057
242,-0.6572100000000001
243,-0.73417
244,-0.79856
245,-0.84985
246,-0.8917299999999999
247,-0.9285399999999999
248,-0.9566100000000001
249,-0.9749899999999999
250,-0.98029
251,-0.97913
252,-0.97293
253,-0.9667
254,-0.9598899999999999
255,-0.9555
256,-0.9544600000000001
257,-0.95737
258,-0.96544
259,-0.9783200000000001
260,-1.0012
261,-1.0335
262,-1.0745
263,-1.1179
264,-1.1639
265,-1.215
266,-1.2711
267,-1.3206
268,-1.3485
269,-1.3525
