time,value
0,-0.33575
1,-0.33575
2,-0.33575
3,-0.33575
4,-0.33575
5,-0.33575
6,-0.33575
7,-0.33575
8,-0.33575
9,-0.33575
10,-0.33575
11,-0.33575
12,-0.33575
13,-0.33575
14,-0.33575
15,-0.33575
16,-0.33575
17,-0.33575
18,-0.33575
19,-0.33575
20,-0.33575
21,-0.33575
22,-0.33575
23,-0.33575
24,-0.33575
25,-0.33575
26,-0.33575
27,-0.33575
28,-0.33575
29,-0.33575
30,-0.33575
31,-0.065083
32,0.10409000000000002
33,-0.33575
34,-0.24553000000000003
35,1.7056
36,-0.15531
37,-0.33575
38,-0.33575
39,-0.33575
40,-0.33575
41,-0.33575
42,-0.33575
43,-0.33575
44,-0.33575
45,-0.33575
46,-0.33575
47,-0.33575
48,0.32965
49,-0.33575
50,-0.33575
51,-0.33575
52,-0.33575
53,-0.33575
54,-0.33575
55,-0.33575
56,-0.33575
57,-0.33575
58,-0.33575
59,-0.33575
60,-0.33575
61,-0.33575
62,-0.33575
63,-0.33575
64,-0.33575
65,-0.33575
66,0.18303
67,5.5965
68,3.2055
69,2.9236
70,2.3484
71,0.44243000000000005
72,1.8409
73,3.2281
74,2.6867
75,2.4612
76,-0.065083
77,-0.33575
78,-0.33575
79,-0.33575
80,-0.33575
81,-0.33575
82,-0.33575
83,-0.33575
84,-0.33575
85,-0.33575
86,-0.33575
87,-0.33575
88,-0.33575
89,-0.33575
90,-0.33575
91,-0.33575
92,-0.33575
93,-0.33575
94,-0.33575
95,-0.33575
