time,value
0,-0.4185
1,-1.5599
2,0.95114
3,0.95114
4,0.87505
5,-1.0272
6,-1.1033
7,1.0272
8,0.95114
9,0.19022999999999998
10,-1.5599
11,0.19022999999999998
12,1.0272
13,0.95114
14,-0.72287
15,-1.5599
16,1.0272
17,0.87505
18,0.26632
19,-1.5599
20,0.26632
21,0.95114
22,0.57068
23,-1.5599
24,-0.34241
25,0.95114
26,0.87505
27,-1.1033
28,-0.95114
29,1.0272
30,0.87505
31,-0.72287
32,-1.5599
33,1.1033
34,0.87505
35,0.11414
36,-1.5599
37,0.4185
38,0.95114
39,-0.34241
40,-1.5599
41,0.79896
42,0.95114
43,0.26632
44,-1.5599
45,0.038045999999999996
46,0.95114
47,0.34241
48,-1.5599
49,-0.038045999999999996
50,1.0272
51,0.34241
52,-1.5599
53,-0.11414
54,0.95114
55,0.87505
56,-1.4077
57,-0.49459
58,0.95114
59,0.95114
60,-1.0272
61,-1.1794
62,1.0272
63,0.95114
64,-0.19022999999999998
65,-1.5599
66,0.57068
67,0.87505
68,0.4185
69,-1.5599
70,-0.038045999999999996
71,0.95114
72,0.57068
73,-1.5599
74,-0.038045999999999996
75,0.95114
76,0.64677
77,-1.5599
78,-0.11414
79,0.95114
80,0.95114
81,-1.5599
82,0.49459
83,0.95114
84,0.87505
85,-0.79896
86,-1.2555
87,1.0272
88,0.95114
89,-0.49459
90,-1.5599
91,0.79896
92,0.95114
93,-0.87505
94,-1.4077
95,1.1033
