time,value
0,-1.2296
1,-1.1348
2,-0.9930899999999999
3,-0.80623
4,-0.58158
5,-0.3299
6,-0.060822
7,0.2158
8,0.48938999999999994
9,0.75024
10,0.99021
11,1.2032
12,1.3855
13,1.5391
14,1.6686
15,1.7790000000000001
16,1.8742
17,1.956
18,2.0239
19,2.075
20,2.1068
21,2.1178
22,2.1076
23,2.0755
24,2.0227
25,1.9505
26,1.8607
27,1.7551
28,1.6366
29,1.5075
30,1.3682
31,1.2191
32,1.0603
33,0.8927299999999999
34,0.7185199999999999
35,0.54247
36,0.37041999999999997
37,0.20783000000000001
38,0.059011
39,-0.072999
40,-0.18717
41,-0.28467
42,-0.36582
43,-0.43238999999999994
44,-0.48718
45,-0.5332399999999999
46,-0.57143
47,-0.60463
48,-0.6362
49,-0.66464
50,-0.68803
51,-0.70607
52,-0.72097
53,-0.72846
54,-0.73001
55,-0.72932
56,-0.72878
57,-0.72636
58,-0.7240300000000001
59,-0.7255199999999999
60,-0.72863
61,-0.7324
62,-0.73822
63,-0.74973
64,-0.76169
65,-0.77413
66,-0.78864
67,-0.8052600000000001
68,-0.8209299999999999
69,-0.83624
70,-0.8537
71,-0.8710899999999999
72,-0.8869
73,-0.90122
74,-0.9162899999999999
75,-0.9288
76,-0.9383799999999999
77,-0.9456100000000001
78,-0.95021
79,-0.9490799999999999
80,-0.94085
81,-0.92724
82,-0.90733
83,-0.88049
84,-0.8482299999999999
85,-0.81697
86,-0.7851100000000001
87,-0.75279
88,-0.72249
89,-0.69692
90,-0.67285
91,-0.6489
92,-0.6289100000000001
93,-0.6116
94,-0.59482
95,-0.5783699999999999
96,-0.56667
97,-0.55571
98,-0.54319
99,-0.5292
100,-0.51361
101,-0.49248000000000003
102,-0.46474
103,-0.43528999999999995
104,-0.40507
105,-0.37538
106,-0.34842
107,-0.32804
108,-0.31046
109,-0.2916
110,-0.26782
111,-0.23313000000000003
112,-0.17749
113,-0.091049
114,0.032598
115,0.20204
116,0.42125
117,0.68672
118,0.9855799999999999
119,1.3013
120,1.6112
121,1.8899
122,2.1171
123,2.2816
124,2.3821
125,2.4244
126,2.4248
127,2.3999
128,2.3631
129,2.3209999999999997
130,2.2769999999999997
131,2.2295
132,2.1741
133,2.1101
134,2.0395
135,1.965
136,1.8871
137,1.8081
138,1.7272
139,1.6419
140,1.5509
141,1.4564
142,1.3612
143,1.2669
144,1.177
145,1.0928
146,1.0136
147,0.93681
148,0.86315
149,0.79175
150,0.7209300000000001
151,0.64966
152,0.57791
153,0.50436
154,0.42706000000000005
155,0.34924
156,0.27334
157,0.2008
158,0.13180999999999998
159,0.071327
160,0.018344
161,-0.030361000000000003
162,-0.073882
163,-0.11059000000000001
164,-0.14271
165,-0.17504
166,-0.20494
167,-0.23401999999999998
168,-0.26513000000000003
169,-0.29966
170,-0.33205
171,-0.36141
172,-0.38884
173,-0.41208
174,-0.43005
175,-0.44546
176,-0.46301000000000003
177,-0.48018
178,-0.49771000000000004
179,-0.51735
180,-0.5399
181,-0.5622199999999999
182,-0.58491
183,-0.6098600000000001
184,-0.6350600000000001
185,-0.6584800000000001
186,-0.67993
187,-0.70127
188,-0.71941
189,-0.7348600000000001
190,-0.74956
191,-0.76481
192,-0.77858
193,-0.79094
194,-0.8033
195,-0.81419
196,-0.8222299999999999
197,-0.8276
198,-0.8333
199,-0.83691
200,-0.83846
201,-0.8392700000000001
202,-0.8408899999999999
203,-0.8415100000000001
204,-0.84135
205,-0.84314
206,-0.8465299999999999
207,-0.85021
208,-0.8535799999999999
209,-0.8587299999999999
210,-0.86166
211,-0.86061
212,-0.8556600000000001
213,-0.84783
214,-0.83598
215,-0.8211799999999999
216,-0.80695
217,-0.79377
218,-0.7811899999999999
219,-0.76862
220,-0.75631
221,-0.74059
222,-0.7194699999999999
223,-0.69226
224,-0.65869
225,-0.61833
226,-0.57192
227,-0.52062
228,-0.46397
229,-0.40171
230,-0.33388
231,-0.26071
232,-0.18224
233,-0.09979
234,-0.015271999999999999
235,0.069758
236,0.15342
237,0.23296999999999998
238,0.305
239,0.36679
240,0.4155
241,0.44937
242,0.46858999999999995
243,0.4755
244,0.47257
245,0.46171999999999996
246,0.44433
247,0.42035
248,0.3886
249,0.34749
250,0.29639
251,0.23384000000000002
252,0.15762
253,0.065448
254,-0.043764
255,-0.16942000000000002
256,-0.30772
257,-0.45096
258,-0.5905100000000001
259,-0.71963
260,-0.8355
261,-0.9379
262,-1.0296
263,-1.1129
264,-1.1867
265,-1.2466
266,-1.2886
267,-1.3112
268,-1.3158
269,-1.3088
