time,value
0,-1.0874
1,-1.0874
2,-1.0874
3,-1.0874
4,-1.0874
5,-1.0874
6,-1.0874
7,-1.0874
8,-1.0874
9,-1.0874
10,-1.0874
11,-1.0874
12,-1.0874
13,-1.0874
14,-1.0874
15,-1.0874
16,-1.0874
17,-1.0874
18,-1.0874
19,-1.0874
20,-1.0874
21,-1.0874
22,-1.0874
23,-1.0874
24,0.9773200000000001
25,1.6380000000000001
26,1.2251
27,0.81214
28,0.81214
29,0.9773200000000001
30,0.72955
31,0.6469600000000001
32,0.81214
33,1.0599
34,0.81214
35,0.6469600000000001
36,0.72955
37,0.81214
38,0.9773200000000001
39,1.1425
40,0.6469600000000001
41,-0.9222600000000001
42,1.7206
43,1.5554
44,1.3903
45,1.1425
46,1.3903
47,1.3077
48,0.81214
49,0.72955
50,0.8947299999999999
51,1.1425
52,0.81214
53,0.6469600000000001
54,0.6469600000000001
55,0.81214
56,-0.9222600000000001
57,-0.9222600000000001
58,-1.0874
59,-1.0874
60,-1.0874
61,-1.0874
62,-1.0874
63,-1.0874
64,-1.0874
65,-1.0874
66,1.0599
67,1.2251
68,1.1425
69,0.81214
70,0.48178000000000004
71,0.72955
72,0.8947299999999999
73,0.5643699999999999
74,0.5643699999999999
75,0.72955
76,0.72955
77,0.5643699999999999
78,0.48178000000000004
79,0.72955
80,0.81214
81,0.48178000000000004
82,0.48178000000000004
83,0.72955
84,0.72955
85,0.48178000000000004
86,0.5643699999999999
87,0.81214
88,-1.0874
89,-1.0874
90,-1.0874
91,-1.0874
92,-1.0874
93,-1.0874
94,-1.0874
95,-1.0874
