time,value
0,1.1911
1,1.0616
2,0.60838
3,-1.1399
4,-1.1399
5,-1.1399
6,0.41413
7,1.1264
8,0.9968799999999999
9,-0.36286999999999997
10,-1.1399
11,-1.1399
12,-0.75137
13,1.2559
14,1.0616
15,0.47888000000000003
16,-1.1399
17,-1.1399
18,-1.1399
19,0.73788
20,1.0616
21,0.9968799999999999
22,-0.81612
23,-1.1399
24,-1.1399
25,-0.55712
26,1.1911
27,1.0616
28,0.5436300000000001
29,-1.1399
30,-1.1399
31,-1.1399
32,0.41413
33,1.1264
34,0.9968799999999999
35,0.21988000000000002
36,-1.1399
37,-1.1399
38,-1.1399
39,0.9321299999999999
40,1.0616
41,0.9968799999999999
42,0.9321299999999999
43,-1.1399
44,-1.1399
45,-1.1399
46,0.02563
47,1.1264
48,1.0616
49,0.9968799999999999
50,-0.88087
51,-1.1399
52,-1.1399
53,-0.23337
54,1.1911
55,1.0616
56,0.9968799999999999
57,-0.68662
58,-1.1399
59,-1.1399
60,-0.68662
61,1.2559
62,1.0616
63,0.9968799999999999
64,-0.16862
65,-1.1399
66,-1.1399
67,-1.1399
68,1.1911
69,1.0616
70,0.9968799999999999
71,0.5436300000000001
72,-1.1399
73,-1.1399
74,-1.1399
75,0.5436300000000001
76,1.0616
77,0.9968799999999999
78,0.5436300000000001
79,-1.1399
80,-1.1399
81,-1.1399
82,0.34938
83,1.0616
84,1.1264
85,0.9968799999999999
86,0.9968799999999999
87,0.8026300000000001
88,-1.1399
89,-1.1399
90,-1.1399
91,-0.03912
92,1.1911
93,0.9968799999999999
94,0.9321299999999999
95,-0.55712
