time,value
0,-0.16696
1,-0.16696
2,-0.16696
3,-0.16696
4,-0.16696
5,-0.16696
6,-0.16696
7,-0.16696
8,-0.16696
9,-0.16696
10,-0.16696
11,-0.16696
12,-0.16696
13,-0.16696
14,-0.16696
15,-0.16696
16,-0.16696
17,-0.16696
18,-0.16696
19,-0.16696
20,-0.16696
21,-0.16696
22,-0.16696
23,-0.16696
24,-0.16696
25,-0.16696
26,-0.16696
27,-0.16696
28,-0.16696
29,-0.16696
30,-0.16696
31,-0.16696
32,-0.16696
33,-0.16696
34,-0.16696
35,-0.16696
36,-0.16696
37,-0.16696
38,-0.16696
39,-0.16696
40,-0.16696
41,-0.16696
42,-0.16696
43,-0.16696
44,-0.16696
45,-0.16696
46,-0.16696
47,-0.16696
48,-0.16696
49,-0.16696
50,-0.16696
51,-0.16696
52,-0.16696
53,-0.16696
54,-0.16696
55,-0.16696
56,-0.16696
57,-0.16696
58,-0.16696
59,-0.16696
60,-0.16696
61,-0.16696
62,-0.16696
63,-0.16696
64,-0.16696
65,-0.16696
66,-0.16696
67,-0.16696
68,-0.16696
69,-0.16696
70,-0.16696
71,-0.16696
72,-0.16696
73,-0.16696
74,-0.16696
75,-0.16696
76,-0.16696
77,-0.16696
78,-0.16696
79,-0.16696
80,-0.16696
81,-0.16696
82,-0.16696
83,-0.16696
84,-0.16696
85,-0.16696
86,-0.16696
87,-0.16696
88,-0.16696
89,-0.16696
90,3.6619
91,8.0072
92,3.8578
93,-0.16696
94,-0.16696
95,-0.16696
