time,value
0,-0.31348000000000004
1,-0.31348000000000004
2,-0.31348000000000004
3,-0.31348000000000004
4,-0.31348000000000004
5,-0.31348000000000004
6,-0.31348000000000004
7,-0.31348000000000004
8,0.9949600000000001
9,-0.31348000000000004
10,-0.31348000000000004
11,-0.31348000000000004
12,2.3034
13,-0.31348000000000004
14,-0.31348000000000004
15,0.9949600000000001
16,-0.31348000000000004
17,-0.31348000000000004
18,-0.31348000000000004
19,-0.31348000000000004
20,0.9949600000000001
21,-0.31348000000000004
22,-0.31348000000000004
23,-0.31348000000000004
24,-0.31348000000000004
25,-0.31348000000000004
26,0.9949600000000001
27,-0.31348000000000004
28,-0.31348000000000004
29,-0.31348000000000004
30,-0.31348000000000004
31,-0.31348000000000004
32,-0.31348000000000004
33,-0.31348000000000004
34,-0.31348000000000004
35,-0.31348000000000004
36,-0.31348000000000004
37,-0.31348000000000004
38,-0.31348000000000004
39,-0.31348000000000004
40,-0.31348000000000004
41,-0.31348000000000004
42,-0.31348000000000004
43,-0.31348000000000004
44,-0.31348000000000004
45,-0.31348000000000004
46,-0.31348000000000004
47,-0.31348000000000004
48,-0.31348000000000004
49,-0.31348000000000004
50,-0.31348000000000004
51,-0.31348000000000004
52,-0.31348000000000004
53,0.9949600000000001
54,-0.31348000000000004
55,-0.31348000000000004
56,-0.31348000000000004
57,-0.31348000000000004
58,-0.31348000000000004
59,-0.31348000000000004
60,-0.31348000000000004
61,-0.31348000000000004
62,-0.31348000000000004
63,0.9949600000000001
64,4.9203
65,6.2288
66,-0.31348000000000004
67,-0.31348000000000004
68,-0.31348000000000004
69,-0.31348000000000004
70,-0.31348000000000004
71,-0.31348000000000004
72,2.3034
73,2.3034
74,-0.31348000000000004
75,-0.31348000000000004
76,-0.31348000000000004
77,-0.31348000000000004
78,-0.31348000000000004
79,-0.31348000000000004
80,0.9949600000000001
81,-0.31348000000000004
82,-0.31348000000000004
83,-0.31348000000000004
84,-0.31348000000000004
85,-0.31348000000000004
86,-0.31348000000000004
87,-0.31348000000000004
88,0.9949600000000001
89,-0.31348000000000004
90,-0.31348000000000004
91,-0.31348000000000004
92,-0.31348000000000004
93,-0.31348000000000004
94,-0.31348000000000004
95,-0.31348000000000004
