time,value
0,-0.16868
1,-0.16868
2,-0.16868
3,-0.16868
4,-0.16868
5,-0.16868
6,-0.16868
7,-0.16868
8,-0.16868
9,-0.16868
10,-0.16868
11,-0.16868
12,-0.16868
13,-0.16868
14,-0.16868
15,-0.16868
16,-0.16868
17,-0.16868
18,-0.16868
19,-0.16868
20,-0.16868
21,-0.16868
22,-0.16868
23,-0.16868
24,-0.16868
25,-0.16868
26,-0.16868
27,-0.16868
28,-0.16868
29,-0.16868
30,-0.16868
31,-0.16868
32,-0.16868
33,-0.16868
34,-0.16868
35,-0.16868
36,-0.16868
37,-0.16868
38,-0.16868
39,-0.16868
40,-0.16868
41,-0.16868
42,-0.16868
43,-0.16868
44,-0.16868
45,-0.16868
46,-0.16868
47,-0.16868
48,-0.16868
49,-0.16868
50,-0.16868
51,-0.16868
52,-0.16868
53,-0.16868
54,-0.16868
55,-0.019509000000000002
56,1.7373
57,4.8201
58,0.12966
59,0.11308
60,0.096509
61,8.1349
62,-0.16868
63,-0.16868
64,-0.16868
65,-0.16868
66,-0.16868
67,-0.16868
68,-0.16868
69,-0.16868
70,-0.16868
71,-0.16868
72,-0.16868
73,-0.16868
74,-0.16868
75,-0.16868
76,-0.16868
77,-0.16868
78,-0.16868
79,-0.16868
80,-0.16868
81,-0.16868
82,-0.16868
83,-0.16868
84,-0.16868
85,-0.16868
86,-0.16868
87,-0.16868
88,-0.16868
89,-0.16868
90,-0.16868
91,-0.16868
92,-0.16868
93,-0.16868
94,-0.16868
95,-0.16868
