time,value
0,0.8642299999999999
1,0.8642299999999999
2,-0.007059
3,-1.4592
4,-1.4592
5,-1.4592
6,-0.78154
7,0.96104
8,0.8642299999999999
9,0.76742
10,-1.4592
11,-1.4592
12,-1.4592
13,-1.4592
14,-0.3943
15,0.96104
16,0.8642299999999999
17,0.76742
18,-1.4592
19,-1.4592
20,-1.4592
21,-1.4592
22,-1.4592
23,0.76742
24,0.8642299999999999
25,0.8642299999999999
26,-0.007059
27,-1.4592
28,-1.4592
29,-1.4592
30,-1.4592
31,0.8642299999999999
32,0.8642299999999999
33,0.8642299999999999
34,-0.20068
35,-1.4592
36,-0.87834
37,1.0578
38,0.8642299999999999
39,0.8642299999999999
40,0.76742
41,-0.78154
42,-1.4592
43,-1.4592
44,-0.20068
45,0.96104
46,0.8642299999999999
47,0.8642299999999999
48,-1.1688
49,-1.4592
50,-1.4592
51,0.96104
52,0.96104
53,0.8642299999999999
54,0.8642299999999999
55,0.76742
56,-1.4592
57,-1.4592
58,-1.4592
59,0.08975
60,0.8642299999999999
61,0.8642299999999999
62,0.18656
63,-1.4592
64,-1.4592
65,-1.4592
66,0.47698999999999997
67,0.8642299999999999
68,0.76742
69,0.76742
70,0.76742
71,0.76742
72,0.67061
73,0.67061
74,0.67061
75,0.67061
76,0.5738
77,0.67061
78,0.67061
79,0.67061
80,0.67061
81,0.67061
82,0.67061
83,0.5738
84,0.67061
85,0.5738
86,0.5738
87,0.5738
88,0.5738
89,0.5738
90,0.5738
91,0.5738
92,0.67061
93,0.5738
94,0.5738
95,0.38018
