time,value
0,1.6498
1,1.6524
2,1.6579
3,1.6325
4,1.5838
5,1.5335
6,1.4906
7,1.3911
8,1.2867
9,1.1806
10,1.0762
11,0.96406
12,0.8626299999999999
13,0.76317
14,0.65498
15,0.55866
16,0.4654
17,0.36280999999999997
18,0.29904000000000003
19,0.20488
20,0.12125999999999999
21,0.023811000000000002
22,-0.07197100000000001
23,-0.14645
24,-0.23695
25,-0.3245
26,-0.40179000000000004
27,-0.46965
28,-0.5451
29,-0.61029
30,-0.68893
31,-0.72902
32,-0.79733
33,-0.85813
34,-0.9305
35,-0.98745
36,-1.0301
37,-1.0873
38,-1.1299
39,-1.1505
40,-1.1891
41,-1.2146
42,-1.2099
43,-1.2273
44,-1.2376
45,-1.2401
46,-1.2352
47,-1.2232
48,-1.2271
49,-1.2125
50,-1.1786
51,-1.1573
52,-1.1246
53,-1.0711
54,-1.0275
55,-0.97915
56,-0.93237
57,-0.87626
58,-0.8142199999999999
59,-0.74933
60,-0.67914
61,-0.6293300000000001
62,-0.5502100000000001
63,-0.49265
64,-0.41334
65,-0.32584
66,-0.25517
67,-0.17992
68,-0.083725
69,-0.0018386
70,0.083829
71,0.18656
72,0.27734000000000003
73,0.37119
74,0.47883000000000003
75,0.5766899999999999
76,0.68682
77,0.79764
78,0.9003200000000001
79,1.0049
80,1.1105
81,1.2126
82,1.3208
83,1.4246
84,1.5326
85,1.6335
86,1.6535
87,1.6874
88,1.6871
89,1.6899
90,1.6958
91,1.6676
92,1.6516
93,1.5551
94,1.484
95,1.3857
96,1.281
97,1.1757
98,1.0723
99,0.9608
100,0.86031
101,0.7509100000000001
102,0.64226
103,0.54683
104,0.44083999999999995
105,0.34873000000000004
106,0.24675
107,0.14520999999999998
108,0.061276
109,-0.036132
110,-0.13183
111,-0.22358000000000003
112,-0.30007
113,-0.37844
114,-0.46161
115,-0.54537
116,-0.6047
117,-0.67847
118,-0.75059
119,-0.79176
120,-0.85355
121,-0.91081
122,-0.96047
123,-1.0265
124,-1.0813
125,-1.1104
126,-1.1596
127,-1.203
128,-1.2395
129,-1.2548
130,-1.2551
131,-1.2695
132,-1.2765
133,-1.2762
134,-1.2677
135,-1.252
136,-1.2601
137,-1.2342
138,-1.2015
139,-1.1866
140,-1.1354
141,-1.0806
142,-1.0479
143,-1.0102
144,-0.95929
145,-0.91199
146,-0.8379200000000001
147,-0.77337
148,-0.7102
149,-0.62253
150,-0.5476300000000001
151,-0.48186
152,-0.39533
153,-0.31140999999999996
154,-0.226
155,-0.13771
156,-0.046794999999999996
157,0.042359
158,0.12877
159,0.2259
160,0.32611
161,0.43013999999999997
162,0.53145
163,0.63518
164,0.7350800000000001
165,0.84046
166,0.94929
167,1.0543
168,1.1609
169,1.2691
170,1.3732
171,1.4792
172,1.5551
173,1.6056
174,1.6544
175,1.6506
