time,value
0,-0.16358
1,-0.16358
2,-0.16358
3,-0.16358
4,-0.16358
5,-0.16358
6,-0.16358
7,-0.16358
8,-0.16358
9,-0.16358
10,-0.16358
11,-0.16358
12,-0.16358
13,-0.16358
14,-0.16358
15,-0.16358
16,-0.16358
17,-0.16358
18,-0.16358
19,-0.16358
20,-0.16358
21,-0.16358
22,-0.16358
23,-0.16358
24,-0.16358
25,-0.16358
26,-0.16358
27,-0.16358
28,-0.16358
29,-0.16358
30,1.5881
31,1.0042
32,0.78909
33,-0.16358
34,-0.16358
35,-0.16358
36,-0.16358
37,-0.16358
38,-0.16358
39,-0.16358
40,-0.16358
41,-0.16358
42,-0.16358
43,-0.16358
44,-0.16358
45,-0.16358
46,-0.16358
47,-0.16358
48,-0.16358
49,-0.16358
50,-0.16358
51,-0.16358
52,-0.16358
53,-0.16358
54,-0.16358
55,-0.16358
56,-0.16358
57,-0.16358
58,-0.16358
59,-0.16358
60,-0.16358
61,-0.16358
62,-0.16358
63,-0.16358
64,-0.16358
65,-0.16358
66,-0.16358
67,9.0866
68,-0.16358
69,-0.16358
70,-0.16358
71,-0.16358
72,-0.16358
73,-0.16358
74,2.4179
75,-0.16358
76,-0.16358
77,-0.16358
78,-0.16358
79,-0.16358
80,-0.16358
81,-0.16358
82,-0.16358
83,-0.16358
84,-0.16358
85,-0.16358
86,-0.16358
87,-0.16358
88,-0.16358
89,-0.16358
90,-0.16358
91,-0.16358
92,-0.16358
93,-0.16358
94,-0.16358
95,-0.16358
