time,value
0,-0.9757100000000001
1,-0.9511700000000001
2,-0.9103
3,-0.85224
4,-0.7783399999999999
5,-0.69118
6,-0.58897
7,-0.46998999999999996
8,-0.3345
9,-0.18257
10,-0.014405000000000001
11,0.16826
12,0.36148
13,0.56366
14,0.77274
15,0.9856799999999999
16,1.1981
17,1.4057
18,1.6033
19,1.7852
20,1.9473
21,2.0872
22,2.2041
23,2.2976
24,2.3685
25,2.4176
26,2.4451
27,2.4512
28,2.4359
29,2.3996
30,2.3427
31,2.2662
32,2.1724
33,2.0641
34,1.9446
35,1.8175
36,1.6862
37,1.5530000000000002
38,1.4189
39,1.2842
40,1.1485
41,1.0109
42,0.8714799999999999
43,0.73092
44,0.59044
45,0.45187
46,0.31828
47,0.19186
48,0.073715
49,-0.034047
50,-0.13036
51,-0.21572
52,-0.29222
53,-0.35822
54,-0.41527
55,-0.46595
56,-0.51143
57,-0.5503399999999999
58,-0.58455
59,-0.6170100000000001
60,-0.64547
61,-0.66951
62,-0.69082
63,-0.71265
64,-0.7307899999999999
65,-0.74661
66,-0.76244
67,-0.77757
68,-0.78893
69,-0.7974100000000001
70,-0.8053600000000001
71,-0.81014
72,-0.81165
73,-0.81152
74,-0.81187
75,-0.80907
76,-0.80379
77,-0.79769
78,-0.79078
79,-0.78264
80,-0.77536
81,-0.77153
82,-0.77031
83,-0.77171
84,-0.7761
85,-0.78366
86,-0.79251
87,-0.80266
88,-0.81466
89,-0.8281299999999999
90,-0.8423700000000001
91,-0.8571200000000001
92,-0.87218
93,-0.8862200000000001
94,-0.89864
95,-0.90943
96,-0.91894
97,-0.9271
98,-0.9344399999999999
99,-0.94153
100,-0.94829
101,-0.95424
102,-0.95914
103,-0.9631200000000001
104,-0.96591
105,-0.9676799999999999
106,-0.96893
107,-0.9703
108,-0.9715299999999999
109,-0.9724700000000001
110,-0.9733700000000001
111,-0.97421
112,-0.9746
113,-0.97456
114,-0.97524
115,-0.9762
116,-0.9770700000000001
117,-0.9778399999999999
118,-0.97916
119,-0.9797299999999999
120,-0.9789
121,-0.97719
122,-0.97469
123,-0.9706
124,-0.96488
125,-0.9594799999999999
126,-0.95399
127,-0.94842
128,-0.94329
129,-0.9396700000000001
130,-0.9362299999999999
131,-0.9318
132,-0.9261799999999999
133,-0.9185399999999999
134,-0.9075200000000001
135,-0.89271
136,-0.87595
137,-0.85721
138,-0.8368
139,-0.81502
140,-0.79201
141,-0.76576
142,-0.73433
143,-0.69703
144,-0.6532
145,-0.60238
146,-0.5451199999999999
147,-0.48361000000000004
148,-0.41863999999999996
149,-0.35146
150,-0.28393
151,-0.21841
152,-0.15621
153,-0.098732
154,-0.047817
155,-0.0040081
156,0.033089999999999994
157,0.063967
158,0.088257
159,0.10682
160,0.1201
161,0.12791
162,0.13003
163,0.12738
164,0.12086
165,0.11052999999999999
166,0.097343
167,0.082286
168,0.06575299999999999
169,0.047041
170,0.026942
171,0.0059836
172,-0.015851
173,-0.038398
174,-0.060532
175,-0.081661
176,-0.10275999999999999
177,-0.12344000000000001
178,-0.14345
179,-0.16297999999999999
180,-0.18295
181,-0.20188
182,-0.21899000000000002
183,-0.23493000000000003
184,-0.24983000000000002
185,-0.26293
186,-0.27431
187,-0.28646
188,-0.29756
189,-0.30665
190,-0.31395
191,-0.32104
192,-0.32549
193,-0.32705
194,-0.32864
195,-0.33025
196,-0.32966
197,-0.32594
198,-0.32363000000000003
199,-0.3185
200,-0.30924
201,-0.29718
202,-0.2857
203,-0.27212
204,-0.25645
205,-0.24266
206,-0.23073000000000002
207,-0.21848
208,-0.20481
209,-0.19292
210,-0.1779
211,-0.15775
212,-0.1327
213,-0.10411
214,-0.069876
215,-0.029764999999999996
216,0.014341
217,0.06368
218,0.11972999999999999
219,0.18278
220,0.25117
221,0.32666
222,0.40996000000000005
223,0.50215
224,0.60605
225,0.72592
226,0.8644200000000001
227,1.0214
228,1.195
229,1.3798
230,1.5672
231,1.7472
232,1.9117
233,2.0525
234,2.1638
235,2.2425
236,2.2878
237,2.3006
238,2.2833
239,2.2412
240,2.1789
241,2.1008
242,2.0099
243,1.9089
244,1.7982
245,1.6772
246,1.5463
247,1.4059
248,1.2563
249,1.0976
250,0.93232
251,0.76266
252,0.59148
253,0.4231
254,0.26286
255,0.11379
256,-0.023508
257,-0.1486
258,-0.2626
259,-0.36693000000000003
260,-0.46224
261,-0.54504
262,-0.61453
263,-0.6725899999999999
264,-0.72247
265,-0.76775
266,-0.8135899999999999
267,-0.86298
268,-0.9107200000000001
269,-0.95062
