time,value
0,-0.6482
1,-0.6482
2,-0.6482
3,-0.6482
4,2.3056
5,0.33641
6,-0.6482
7,-0.6482
8,-0.6482
9,0.92717
10,1.5179
11,-0.6482
12,-0.6482
13,-0.6482
14,-0.6482
15,2.1087
16,0.33641
17,-0.6482
18,-0.6482
19,-0.6482
20,-0.057435
21,2.1087
22,-0.25436
23,-0.6482
24,-0.6482
25,-0.6482
26,0.33641
27,2.1087
28,-0.6482
29,-0.6482
30,-0.6482
31,-0.6482
32,0.73025
33,1.7149
34,-0.6482
35,-0.6482
36,-0.6482
37,0.13949
38,2.1087
39,-0.25436
40,-0.6482
41,-0.6482
42,-0.6482
43,0.33641
44,2.1087
45,-0.6482
46,-0.6482
47,-0.6482
48,-0.6482
49,0.92717
50,2.1087
51,-0.6482
52,-0.6482
53,-0.6482
54,-0.6482
55,0.73025
56,1.5179
57,-0.6482
58,-0.6482
59,-0.6482
60,-0.6482
61,1.5179
62,0.92717
63,-0.6482
64,-0.6482
65,-0.6482
66,-0.6482
67,2.3056
68,0.33641
69,-0.6482
70,-0.6482
71,-0.6482
72,-0.057435
73,2.1087
74,-0.25436
75,-0.6482
76,-0.6482
77,-0.6482
78,0.33641
79,2.1087
80,-0.6482
81,-0.6482
82,-0.6482
83,-0.6482
84,1.1241
85,2.1087
86,-0.6482
87,-0.6482
88,-0.6482
89,-0.6482
90,1.7149
91,0.73025
92,-0.6482
93,-0.6482
94,-0.6482
95,-0.057435
