time,value
0,-0.13806
1,-0.13806
2,-0.13806
3,-0.13806
4,-0.13806
5,-0.13806
6,-0.13806
7,-0.13806
8,-0.13806
9,-0.13806
10,-0.13806
11,-0.13806
12,-0.13806
13,-0.13806
14,-0.13806
15,-0.13806
16,-0.13806
17,-0.13806
18,-0.13806
19,-0.13806
20,-0.13806
21,-0.13806
22,-0.13806
23,-0.13806
24,-0.13806
25,-0.13806
26,-0.13806
27,-0.13806
28,-0.13806
29,-0.13806
30,-0.13806
31,-0.13806
32,-0.13806
33,1.6008
34,9.4837
35,0.5574899999999999
36,0.57681
37,0.34496
38,-0.13806
39,-0.13806
40,-0.13806
41,-0.13806
42,-0.13806
43,-0.13806
44,-0.13806
45,-0.13806
46,-0.13806
47,-0.13806
48,-0.13806
49,-0.13806
50,-0.13806
51,-0.13806
52,-0.13806
53,-0.13806
54,-0.13806
55,-0.13806
56,-0.13806
57,-0.13806
58,-0.13806
59,-0.13806
60,-0.13806
61,-0.13806
62,-0.13806
63,-0.13806
64,-0.13806
65,-0.13806
66,-0.13806
67,-0.13806
68,-0.13806
69,-0.13806
70,-0.13806
71,-0.13806
72,-0.13806
73,-0.13806
74,-0.13806
75,-0.13806
76,-0.13806
77,-0.13806
78,-0.13806
79,-0.13806
80,-0.13806
81,-0.13806
82,-0.13806
83,-0.13806
84,-0.13806
85,-0.13806
86,-0.13806
87,-0.13806
88,-0.13806
89,-0.13806
90,-0.13806
91,-0.13806
92,-0.13806
93,-0.13806
94,-0.13806
95,-0.13806
