time,value
0,-0.35386999999999996
1,-0.35386999999999996
2,-0.35386999999999996
3,-0.35386999999999996
4,-0.35386999999999996
5,-0.35386999999999996
6,-0.35386999999999996
7,-0.35386999999999996
8,-0.35386999999999996
9,-0.35386999999999996
10,-0.35386999999999996
11,-0.35386999999999996
12,-0.35386999999999996
13,-0.35386999999999996
14,-0.35386999999999996
15,-0.35386999999999996
16,-0.35386999999999996
17,-0.35386999999999996
18,-0.35386999999999996
19,-0.35386999999999996
20,-0.35386999999999996
21,-0.35386999999999996
22,-0.35386999999999996
23,-0.35386999999999996
24,-0.35386999999999996
25,-0.35386999999999996
26,-0.35386999999999996
27,-0.35386999999999996
28,-0.35386999999999996
29,-0.35386999999999996
30,-0.35386999999999996
31,-0.35386999999999996
32,-0.35386999999999996
33,-0.35386999999999996
34,-0.35386999999999996
35,-0.35386999999999996
36,-0.35386999999999996
37,-0.35386999999999996
38,-0.35386999999999996
39,-0.35386999999999996
40,-0.35386999999999996
41,-0.35386999999999996
42,-0.35386999999999996
43,-0.35386999999999996
44,-0.35386999999999996
45,-0.35386999999999996
46,-0.35386999999999996
47,-0.35386999999999996
48,3.2472
49,3.6818
50,1.7985
51,1.1155
52,-0.18830999999999998
53,-0.19866
54,3.8577
55,1.3432
56,-0.35386999999999996
57,-0.35386999999999996
58,-0.35386999999999996
59,-0.35386999999999996
60,-0.35386999999999996
61,-0.35386999999999996
62,-0.35386999999999996
63,-0.35386999999999996
64,-0.35386999999999996
65,-0.35386999999999996
66,-0.35386999999999996
67,-0.35386999999999996
68,-0.35386999999999996
69,-0.35386999999999996
70,-0.35386999999999996
71,-0.35386999999999996
72,-0.35386999999999996
73,-0.35386999999999996
74,-0.35386999999999996
75,-0.35386999999999996
76,-0.35386999999999996
77,-0.35386999999999996
78,-0.35386999999999996
79,-0.35386999999999996
80,-0.35386999999999996
81,2.4193
82,3.154
83,0.7223
84,3.0092
85,-0.17795999999999998
86,-0.18830999999999998
87,1.1155
88,3.5989999999999998
89,-0.35386999999999996
90,-0.35386999999999996
91,-0.35386999999999996
92,-0.35386999999999996
93,-0.35386999999999996
94,-0.35386999999999996
95,-0.35386999999999996
