time,value
0,-0.47418999999999994
1,-0.47418999999999994
2,-0.47418999999999994
3,-0.47418999999999994
4,-0.47418999999999994
5,-0.47418999999999994
6,-0.47418999999999994
7,-0.47418999999999994
8,-0.47418999999999994
9,-0.47418999999999994
10,-0.47418999999999994
11,-0.47418999999999994
12,-0.47418999999999994
13,-0.47418999999999994
14,-0.47418999999999994
15,-0.47418999999999994
16,-0.47418999999999994
17,-0.47418999999999994
18,-0.47418999999999994
19,-0.47418999999999994
20,-0.47418999999999994
21,-0.47418999999999994
22,-0.47418999999999994
23,-0.47418999999999994
24,-0.47418999999999994
25,-0.47418999999999994
26,-0.47418999999999994
27,-0.47418999999999994
28,-0.47418999999999994
29,-0.47418999999999994
30,-0.47418999999999994
31,-0.47418999999999994
32,-0.47418999999999994
33,-0.47418999999999994
34,-0.47418999999999994
35,-0.47418999999999994
36,-0.47418999999999994
37,-0.47418999999999994
38,-0.47418999999999994
39,-0.47418999999999994
40,-0.47418999999999994
41,-0.47418999999999994
42,-0.47418999999999994
43,-0.47418999999999994
44,-0.47418999999999994
45,-0.47418999999999994
46,-0.47418999999999994
47,-0.47418999999999994
48,-0.47418999999999994
49,-0.47418999999999994
50,-0.47418999999999994
51,-0.47418999999999994
52,-0.47418999999999994
53,-0.47418999999999994
54,-0.47418999999999994
55,-0.47418999999999994
56,-0.47418999999999994
57,-0.47418999999999994
58,-0.47418999999999994
59,-0.47418999999999994
60,-0.47418999999999994
61,-0.47418999999999994
62,-0.47418999999999994
63,-0.47418999999999994
64,-0.47418999999999994
65,-0.47418999999999994
66,-0.47418999999999994
67,-0.47418999999999994
68,-0.47418999999999994
69,-0.47418999999999994
70,-0.47418999999999994
71,2.2821
72,2.5488
73,2.6377
74,1.304
75,-0.20745999999999998
76,-0.11855
77,2.6377
78,2.1931
79,2.1042
80,2.1931
81,2.0153
82,2.1042
83,2.371
84,2.1931
85,2.1931
86,2.1042
87,2.1931
88,2.1042
89,-0.20745999999999998
90,-0.11855
91,-0.20745999999999998
92,-0.11855
93,-0.20745999999999998
94,-0.11855
95,-0.20745999999999998
