time,value
0,-0.17160999999999998
1,-0.17160999999999998
2,-0.17160999999999998
3,-0.17160999999999998
4,-0.17160999999999998
5,-0.17160999999999998
6,-0.17160999999999998
7,-0.17160999999999998
8,-0.17160999999999998
9,-0.17160999999999998
10,-0.17160999999999998
11,-0.17160999999999998
12,-0.17160999999999998
13,-0.17160999999999998
14,-0.17160999999999998
15,-0.17160999999999998
16,-0.17160999999999998
17,-0.17160999999999998
18,-0.17160999999999998
19,-0.17160999999999998
20,-0.17160999999999998
21,-0.17160999999999998
22,-0.17160999999999998
23,-0.17160999999999998
24,-0.17160999999999998
25,-0.17160999999999998
26,-0.17160999999999998
27,-0.17160999999999998
28,-0.17160999999999998
29,-0.17160999999999998
30,-0.17160999999999998
31,-0.17160999999999998
32,-0.17160999999999998
33,-0.17160999999999998
34,-0.17160999999999998
35,-0.17160999999999998
36,-0.17160999999999998
37,-0.17160999999999998
38,-0.17160999999999998
39,-0.17160999999999998
40,-0.17160999999999998
41,-0.17160999999999998
42,-0.17160999999999998
43,-0.17160999999999998
44,-0.17160999999999998
45,-0.17160999999999998
46,-0.17160999999999998
47,-0.17160999999999998
48,-0.17160999999999998
49,-0.17160999999999998
50,-0.17160999999999998
51,-0.17160999999999998
52,-0.17160999999999998
53,-0.17160999999999998
54,-0.17160999999999998
55,-0.17160999999999998
56,-0.17160999999999998
57,-0.17160999999999998
58,-0.17160999999999998
59,-0.17160999999999998
60,-0.17160999999999998
61,-0.17160999999999998
62,-0.17160999999999998
63,-0.17160999999999998
64,-0.17160999999999998
65,-0.17160999999999998
66,0.66103
67,7.3816
68,5.8115
69,1.8981
70,-0.13592
71,-0.17160999999999998
72,-0.17160999999999998
73,-0.17160999999999998
74,-0.17160999999999998
75,-0.17160999999999998
76,-0.17160999999999998
77,-0.17160999999999998
78,-0.17160999999999998
79,-0.17160999999999998
80,-0.17160999999999998
81,-0.17160999999999998
82,-0.17160999999999998
83,-0.17160999999999998
84,-0.17160999999999998
85,-0.17160999999999998
86,-0.17160999999999998
87,-0.17160999999999998
88,-0.17160999999999998
89,-0.17160999999999998
90,-0.17160999999999998
91,-0.17160999999999998
92,-0.17160999999999998
93,-0.17160999999999998
94,-0.17160999999999998
95,-0.17160999999999998
