time,value
0,-0.81704
1,-0.7331
2,-0.6278199999999999
3,-0.49572
4,-0.33489
5,-0.14328
6,0.077817
7,0.32273
8,0.58623
9,0.8620200000000001
10,1.1402
11,1.409
12,1.6562
13,1.8708
14,2.0462
15,2.1814
16,2.2777
17,2.3369999999999997
18,2.3604
19,2.3474
20,2.2983
21,2.2156
22,2.1047
23,1.9732
24,1.8298
25,1.6821
26,1.5356
27,1.3929
28,1.2539
29,1.1168
30,0.97972
31,0.8413299999999999
32,0.70163
33,0.5619
34,0.42341000000000006
35,0.28756
36,0.15633
37,0.030907
38,-0.086822
39,-0.19325
40,-0.28775
41,-0.37099
42,-0.44154
43,-0.50288
44,-0.55919
45,-0.60734
46,-0.64944
47,-0.68914
48,-0.7208399999999999
49,-0.74642
50,-0.7710199999999999
51,-0.7890699999999999
52,-0.8015800000000001
53,-0.81462
54,-0.8237399999999999
55,-0.82926
56,-0.8372299999999999
57,-0.8436100000000001
58,-0.84646
59,-0.85046
60,-0.85335
61,-0.85325
62,-0.8547
63,-0.8565299999999999
64,-0.8551
65,-0.8531799999999999
66,-0.851
67,-0.8454299999999999
68,-0.8397100000000001
69,-0.8360299999999999
70,-0.8301299999999999
71,-0.82232
72,-0.81317
73,-0.79532
74,-0.76505
75,-0.72024
76,-0.65066
77,-0.5499
78,-0.41673999999999994
79,-0.24633000000000002
80,-0.041712
81,0.18475999999999998
82,0.42318999999999996
83,0.65994
84,0.87865
85,1.0726
86,1.2386
87,1.3741
88,1.4852
89,1.5787
90,1.6588
91,1.733
92,1.8066
93,1.8804
94,1.9567
95,2.0361
96,2.1164
97,2.1965
98,2.2737
99,2.3417
100,2.3937
101,2.423
102,2.423
103,2.3918
104,2.3322
105,2.2493
106,2.1508
107,2.0448
108,1.9357
109,1.8261
110,1.7169
111,1.6057
112,1.4913
113,1.3738
114,1.2522
115,1.1282
116,1.0045
117,0.88026
118,0.75705
119,0.63776
120,0.52154
121,0.4105
122,0.30946
123,0.2178
124,0.1357
125,0.065827
126,0.0046436
127,-0.050112000000000004
128,-0.095075
129,-0.13226
130,-0.16305999999999998
131,-0.18265
132,-0.19389
133,-0.2013
134,-0.20165
135,-0.19899
136,-0.1988
137,-0.19646
138,-0.19444
139,-0.19683
140,-0.19914
141,-0.20288
142,-0.21124
143,-0.21988000000000002
144,-0.22919
145,-0.24159
146,-0.25397
147,-0.26735
148,-0.28502
149,-0.30541
150,-0.32869
151,-0.35593
152,-0.38403000000000004
153,-0.41136999999999996
154,-0.43885
155,-0.46553
156,-0.49128999999999995
157,-0.5170899999999999
158,-0.54114
159,-0.56133
160,-0.57814
161,-0.5922
162,-0.60425
163,-0.61673
164,-0.63031
165,-0.64285
166,-0.65415
167,-0.66523
168,-0.67607
169,-0.68919
170,-0.70681
171,-0.72626
172,-0.74562
173,-0.76412
174,-0.77858
175,-0.7893
176,-0.79904
177,-0.80675
178,-0.81274
179,-0.8185899999999999
180,-0.8218
181,-0.8217
182,-0.8194799999999999
183,-0.81255
184,-0.79947
185,-0.7802
186,-0.75171
187,-0.71234
188,-0.66291
189,-0.60334
190,-0.53546
191,-0.46369
192,-0.39121999999999996
193,-0.32103000000000004
194,-0.25638
195,-0.19821
196,-0.1464
197,-0.10157999999999999
198,-0.063726
199,-0.033104
200,-0.011303
201,0.00062289
202,0.0025969
203,-0.005029100000000001
204,-0.020475999999999998
205,-0.040994
206,-0.064514
207,-0.089478
208,-0.11464
209,-0.13947
210,-0.16332
211,-0.18513
212,-0.2045
213,-0.22161999999999998
214,-0.23703000000000002
215,-0.25179
216,-0.26669
217,-0.28171999999999997
218,-0.29704
219,-0.31318
220,-0.3306
221,-0.35055
222,-0.37401
223,-0.40028
224,-0.42898000000000003
225,-0.45986000000000005
226,-0.49117
227,-0.5230199999999999
228,-0.55609
229,-0.5886
230,-0.62042
231,-0.65188
232,-0.68096
233,-0.7076600000000001
234,-0.73273
235,-0.75464
236,-0.77372
237,-0.79142
238,-0.8072199999999999
239,-0.82178
240,-0.8360299999999999
241,-0.8484
242,-0.85811
243,-0.86577
244,-0.8711200000000001
245,-0.87518
246,-0.87965
247,-0.8841200000000001
248,-0.8879
249,-0.8910600000000001
250,-0.893
251,-0.8938
252,-0.8946299999999999
253,-0.8953899999999999
254,-0.89555
255,-0.8955700000000001
256,-0.89569
257,-0.89623
258,-0.8982100000000001
259,-0.9015700000000001
260,-0.90536
261,-0.90961
262,-0.91489
263,-0.9218200000000001
264,-0.93115
265,-0.9421299999999999
266,-0.9522
267,-0.95905
268,-0.9617399999999999
269,-0.96086
