time,value
0,-0.16997
1,-0.16997
2,-0.16997
3,-0.16997
4,-0.16997
5,-0.16997
6,-0.16997
7,-0.16997
8,-0.16997
9,-0.16997
10,-0.16997
11,-0.16997
12,-0.16997
13,-0.16997
14,-0.16997
15,-0.16997
16,-0.16997
17,-0.16997
18,-0.16997
19,-0.16997
20,-0.16997
21,-0.16997
22,-0.16997
23,-0.16997
24,-0.16997
25,-0.16997
26,-0.16997
27,-0.16997
28,-0.16997
29,7.7167
30,3.9093
31,-0.16997
32,4.1813
33,-0.16997
34,-0.16997
35,-0.16997
36,-0.16997
37,-0.16997
38,-0.16997
39,-0.16997
40,-0.16997
41,-0.16997
42,-0.16997
43,-0.16997
44,-0.16997
45,-0.16997
46,-0.16997
47,-0.16997
48,-0.16997
49,-0.16997
50,-0.16997
51,-0.16997
52,-0.16997
53,-0.16997
54,-0.16997
55,-0.16997
56,-0.16997
57,-0.16997
58,-0.16997
59,-0.16997
60,-0.16997
61,-0.16997
62,-0.16997
63,-0.16997
64,-0.16997
65,-0.16997
66,-0.16997
67,-0.16997
68,-0.16997
69,-0.16997
70,-0.16997
71,-0.16997
72,-0.16997
73,-0.16997
74,-0.16997
75,-0.16997
76,-0.16997
77,-0.16997
78,-0.16997
79,-0.16997
80,-0.16997
81,-0.16997
82,-0.16997
83,-0.16997
84,-0.16997
85,-0.16997
86,-0.16997
87,-0.16997
88,-0.16997
89,-0.16997
90,-0.16997
91,-0.16997
92,-0.16997
93,-0.16997
94,-0.16997
95,-0.16997
