time,value
0,-0.40016999999999997
1,-0.40016999999999997
2,-0.40016999999999997
3,-0.40016999999999997
4,-0.40016999999999997
5,-0.40016999999999997
6,-0.40016999999999997
7,-0.40016999999999997
8,-0.40016999999999997
9,-0.40016999999999997
10,-0.40016999999999997
11,-0.40016999999999997
12,-0.40016999999999997
13,-0.40016999999999997
14,-0.40016999999999997
15,-0.40016999999999997
16,-0.40016999999999997
17,-0.40016999999999997
18,-0.40016999999999997
19,-0.40016999999999997
20,-0.40016999999999997
21,-0.40016999999999997
22,-0.40016999999999997
23,-0.40016999999999997
24,-0.40016999999999997
25,-0.40016999999999997
26,-0.40016999999999997
27,-0.40016999999999997
28,-0.40016999999999997
29,-0.40016999999999997
30,-0.40016999999999997
31,-0.40016999999999997
32,-0.40016999999999997
33,-0.40016999999999997
34,-0.40016999999999997
35,-0.40016999999999997
36,-0.40016999999999997
37,-0.40016999999999997
38,-0.40016999999999997
39,-0.40016999999999997
40,-0.40016999999999997
41,-0.40016999999999997
42,-0.40016999999999997
43,-0.40016999999999997
44,-0.40016999999999997
45,-0.40016999999999997
46,-0.40016999999999997
47,-0.40016999999999997
48,1.9281
49,4.2563
50,2.3161
51,5.0324
52,1.9281
53,1.9281
54,3.0922
55,1.1520000000000001
56,1.9281
57,1.1520000000000001
58,1.1520000000000001
59,0.37592
60,0.7639600000000001
61,-0.40016999999999997
62,1.54
63,1.1520000000000001
64,0.7639600000000001
65,0.37592
66,0.37592
67,-0.40016999999999997
68,-0.40016999999999997
69,-0.40016999999999997
70,-0.40016999999999997
71,-0.40016999999999997
72,-0.40016999999999997
73,-0.40016999999999997
74,-0.40016999999999997
75,-0.40016999999999997
76,-0.40016999999999997
77,-0.40016999999999997
78,-0.40016999999999997
79,-0.40016999999999997
80,-0.40016999999999997
81,-0.40016999999999997
82,-0.40016999999999997
83,-0.40016999999999997
84,-0.40016999999999997
85,-0.40016999999999997
86,-0.40016999999999997
87,-0.40016999999999997
88,-0.40016999999999997
89,-0.40016999999999997
90,-0.40016999999999997
91,-0.40016999999999997
92,-0.40016999999999997
93,-0.40016999999999997
94,-0.40016999999999997
95,-0.40016999999999997
