time,value
0,0.5040399999999999
1,0.5040399999999999
2,0.60015
3,0.5040399999999999
4,0.45598999999999995
5,0.5040399999999999
6,0.60015
7,0.6482
8,0.55209
9,0.45598999999999995
10,0.45598999999999995
11,0.5040399999999999
12,0.55209
13,-0.072578
14,-1.6583
15,-1.7063
16,-1.7063
17,-1.6583
18,-1.7063
19,-1.7063
20,-1.5622
21,-1.7063
22,-1.7063
23,-1.6583
24,-1.7063
25,-1.7063
26,-1.7063
27,-1.7063
28,-1.7063
29,-1.7063
30,-1.7063
31,-1.7063
32,-1.6102
33,-1.6583
34,-1.7063
35,-1.7063
36,-1.7063
37,-1.7063
38,-0.60115
39,0.45598999999999995
40,0.55209
41,0.45598999999999995
42,0.35989
43,0.26378
44,0.21573
45,0.21573
46,0.21573
47,0.21573
48,0.26378
49,0.31184
50,0.26378
51,0.60015
52,0.6482
53,0.79235
54,0.88846
55,0.79235
56,0.88846
57,0.79235
58,0.69625
59,0.6482
60,0.69625
61,0.6482
62,0.45598999999999995
63,0.45598999999999995
64,0.40794
65,0.45598999999999995
66,0.45598999999999995
67,0.60015
68,0.69625
69,0.69625
70,0.69625
71,0.69625
72,0.69625
73,0.69625
74,0.69625
75,0.69625
76,0.6482
77,0.6482
78,0.69625
79,0.69625
80,0.6482
81,0.7443
82,0.69625
83,0.69625
84,0.69625
85,0.69625
86,0.69625
87,0.7443
88,0.69625
89,0.7443
90,0.7443
91,0.69625
92,0.69625
93,0.7443
94,0.69625
95,0.7443
