time,value
0,-0.50056
1,-0.50056
2,-0.50056
3,-0.50056
4,-0.50056
5,-0.50056
6,-0.50056
7,-0.50056
8,-0.50056
9,-0.50056
10,-0.50056
11,-0.50056
12,-0.50056
13,-0.50056
14,-0.50056
15,-0.50056
16,-0.50056
17,-0.50056
18,-0.50056
19,-0.50056
20,-0.50056
21,-0.50056
22,-0.50056
23,-0.50056
24,-0.50056
25,-0.50056
26,-0.50056
27,-0.50056
28,-0.50056
29,-0.50056
30,-0.50056
31,-0.50056
32,-0.50056
33,-0.50056
34,-0.50056
35,-0.50056
36,-0.50056
37,-0.50056
38,-0.50056
39,-0.50056
40,-0.50056
41,-0.50056
42,-0.50056
43,1.8022
44,-0.50056
45,2.5082
46,2.0194
47,1.4980000000000002
48,1.9542
49,0.25978
50,-0.1747
51,-0.1747
52,-0.1747
53,-0.1747
54,-0.1747
55,-0.1747
56,-0.20728000000000002
57,-0.20728000000000002
58,2.8232
59,3.3772
60,1.9434
61,2.0846
62,2.0737
63,2.0737
64,2.0194
65,2.291
66,0.8789100000000001
67,-0.055215
68,-0.10952
69,0.075129
70,-0.50056
71,-0.50056
72,-0.50056
73,-0.50056
74,-0.50056
75,-0.50056
76,1.1287
77,3.3772
78,0.0099568
79,-0.21814
80,-0.19642
81,-0.20728000000000002
82,-0.41366
83,-0.50056
84,-0.50056
85,-0.50056
86,-0.50056
87,-0.50056
88,-0.50056
89,-0.50056
90,-0.50056
91,-0.50056
92,-0.50056
93,-0.50056
94,-0.50056
95,-0.50056
