time,value
0,2.8463
1,2.7475
2,2.6496
3,2.5584
4,2.4624
5,2.3672
6,2.2804
7,2.1846
8,2.0922
9,2.0014
10,1.9104
11,1.8167
12,1.7221
13,1.6316
14,1.5397
15,1.4451
16,1.348
17,1.2578
18,1.166
19,1.0759
20,0.9841200000000001
21,0.8932700000000001
22,0.7972100000000001
23,0.70718
24,0.60673
25,0.51594
26,0.43298000000000003
27,0.37614000000000003
28,0.27612
29,0.18987
30,0.09328
31,0.0031764
32,-0.085372
33,-0.17406
34,-0.27215
35,-0.37222
36,-0.46083999999999997
37,-0.55248
38,-0.64367
39,-0.7339399999999999
40,-0.84086
41,-0.9288
42,-1.0179
43,-1.1092
44,-1.216
45,-1.3093
46,-1.3980000000000001
47,-1.4851
48,-1.5741
49,-1.68
50,-1.7223
51,-1.7966
52,-1.8432
53,-1.7939
54,-1.6934
55,-1.6284
56,-1.5544
57,-1.5624
58,-1.4937
59,-1.4238
60,-1.4269999999999998
61,-1.3675
62,-1.3202
63,-1.2354
64,-1.2086
65,-1.1474
66,-1.1061
67,-1.0537
68,-0.98849
69,-0.94675
70,-0.95576
71,-0.91041
72,-0.83057
73,-0.76458
74,-0.69601
75,-0.63817
76,-0.63088
77,-0.70014
78,-0.6453800000000001
79,-0.56916
80,-0.52789
81,-0.51085
82,-0.43918999999999997
83,-0.3949
84,-0.42011000000000004
85,-0.54232
86,-0.6661100000000001
87,-0.78774
88,-0.8488600000000001
89,-0.76466
90,-0.77933
91,-0.7086100000000001
92,-0.63088
93,-0.59816
94,-0.5231
95,-0.45038999999999996
96,-0.37344
97,-0.29336999999999996
98,-0.23267
99,-0.30591
100,-0.33871
101,-0.25613
102,-0.15945
103,-0.080024
104,-0.0046146
105,0.00055489
106,0.057948
107,0.13492
108,0.07216399999999999
109,-0.027859
110,-0.11327999999999999
111,-0.086153
112,0.0037648000000000004
113,0.07583
114,0.16602999999999998
115,0.1642
116,0.26626
117,0.37593000000000004
118,0.46616
119,0.5048
120,0.45846000000000003
121,0.54779
122,0.6299
123,0.7029
124,0.74128
125,0.82795
126,0.88989
127,0.9493299999999999
128,0.9005299999999999
129,0.8113100000000001
130,0.7239899999999999
131,0.62688
132,0.56408
133,0.47101000000000004
134,0.36515
135,0.26621999999999996
136,0.17545999999999998
137,0.06804099999999999
138,-0.011583
139,-0.069884
140,-0.039604
141,-0.036491
142,-0.11422
143,-0.21945
144,-0.32464
145,-0.40076
146,-0.49906000000000006
147,-0.51451
148,-0.58475
149,-0.6775
150,-0.77828
151,-0.8571200000000001
152,-0.95862
153,-1.0646
154,-1.1109
155,-1.0488
156,-0.98395
157,-0.9149299999999999
158,-0.83041
159,-0.73895
160,-0.67177
161,-0.58381
162,-0.54724
163,-0.46183
164,-0.37643000000000004
165,-0.36296
166,-0.27953
167,-0.18555
168,-0.14598
169,-0.20423
170,-0.28348
171,-0.23068000000000002
172,-0.15136
173,-0.070809
174,0.025754000000000003
175,0.10962999999999999
176,0.19892
177,0.26669
178,0.34752
179,0.33710999999999997
180,0.30579
181,0.38997
182,0.43068999999999996
183,0.48778
184,0.56601
185,0.61154
186,0.5504899999999999
187,0.43827
188,0.35155
189,0.29775999999999997
190,0.35777
191,0.43588999999999994
192,0.52691
193,0.61355
194,0.69085
195,0.7893899999999999
196,0.8796
197,0.9557700000000001
198,0.9375600000000001
199,0.9480799999999999
200,1.0459
201,1.1252
202,1.22
203,1.2682
204,1.349
205,1.4329
206,1.4739
207,1.5647
208,1.6092
209,1.5523
210,1.4680000000000002
211,1.3642
212,1.3298
213,1.2666
214,1.1734
215,1.0773
216,0.9912700000000001
217,0.89769
218,0.80693
219,0.87974
220,0.9264899999999999
221,0.8899799999999999
222,0.79933
223,0.70372
224,0.6238100000000001
225,0.53962
226,0.49596
227,0.40936999999999996
228,0.32798
229,0.24341999999999997
230,0.19255
231,0.26156999999999997
232,0.3326
233,0.40173000000000003
234,0.44906
235,0.49088000000000004
236,0.5853
237,0.64873
238,0.5776100000000001
239,0.49963
240,0.43816000000000005
241,0.35370999999999997
242,0.27394
243,0.18524000000000002
244,0.18557
245,0.2102
246,0.13149
247,0.042262
248,-0.055713
249,-0.15575999999999998
250,-0.24255
251,-0.3501
252,-0.44669
253,-0.46643
254,-0.39181
255,-0.39046
256,-0.46326000000000006
257,-0.5312399999999999
258,-0.61592
259,-0.70803
260,-0.77518
261,-0.8528
262,-0.9263600000000001
263,-1.0145
264,-1.0937
265,-1.1702
266,-1.2374
267,-1.2638
268,-1.1622
269,-1.0303
270,-0.94247
271,-0.86485
272,-0.77666
273,-0.6862199999999999
274,-0.55935
275,-0.45215
276,-0.3217
277,-0.24635
278,-0.11552
279,-0.019673
280,-0.011572
281,-0.0415
282,0.06582400000000001
283,0.19494
284,0.31435
285,0.36721
286,0.48153
287,0.6076
288,0.6916
289,0.76547
290,0.81265
291,0.91494
292,1.0271
293,1.0723
294,1.011
295,0.9668399999999999
296,0.9122600000000001
297,0.9270700000000001
298,0.8469200000000001
299,0.7552
300,0.71207
301,0.6260600000000001
302,0.5170100000000001
303,0.52169
304,0.58768
305,0.53185
306,0.42873
307,0.34584000000000004
308,0.24928000000000003
309,0.19943
310,0.12549000000000002
311,0.025131
312,0.034185
313,0.11394000000000001
314,0.19227
315,0.27756
316,0.31699
317,0.23659000000000002
318,0.14348
319,0.08158
320,-0.019729
321,-0.082379
322,-0.18036
323,-0.19663
324,-0.094206
325,-0.13383
326,-0.22474
327,-0.30471
328,-0.39655999999999997
329,-0.48571000000000003
330,-0.57675
331,-0.64722
332,-0.69504
333,-0.69922
334,-0.5987899999999999
335,-0.49728
336,-0.39858000000000005
337,-0.28342
338,-0.17502
339,-0.20163
340,-0.26546
341,-0.32795
342,-0.39623
343,-0.4489
344,-0.38086
345,-0.44823
346,-0.5334
347,-0.61649
348,-0.68147
349,-0.76035
350,-0.83857
351,-0.91671
352,-0.9620000000000001
353,-0.8923
354,-0.9180200000000001
355,-0.9832700000000001
356,-1.038
357,-1.1226
358,-1.2087
359,-1.2777
360,-1.3518
361,-1.4057
362,-1.4585
363,-1.5177
364,-1.5744
365,-1.6219999999999999
366,-1.6714
367,-1.745
368,-1.7964
369,-1.8301
370,-1.8305
371,-1.8611
372,-1.9021
373,-1.9262
374,-1.9756
375,-1.9465
376,-1.8483
377,-1.7561
378,-1.6680000000000001
379,-1.5831
380,-1.4879
381,-1.3989
382,-1.3090000000000002
383,-1.2104
384,-1.1155
385,-1.0244
386,-0.93158
387,-0.83794
388,-0.74743
389,-0.66004
390,-0.56738
391,-0.46975
392,-0.37548000000000004
393,-0.29018
394,-0.20022
395,-0.10303
396,-0.0029559
397,0.085106
398,0.17611
399,0.26957
400,0.36567
401,0.4625
402,0.55184
403,0.6431100000000001
404,0.73697
405,0.8409
406,0.92763
407,1.0185
408,1.1077
409,1.2007
410,1.2917
411,1.3869
412,1.4793
413,1.5757
414,1.6676
415,1.7581
416,1.8501
417,1.9439
418,2.0394
419,2.1335
420,2.2269
421,2.3145
422,2.4105
423,2.5028
424,2.5989999999999998
425,2.6928
426,2.7862
