time,value
0,-0.42872
1,-0.42872
2,-0.42872
3,-0.42872
4,-0.42872
5,-0.42872
6,-0.42872
7,-0.42872
8,-0.42872
9,-0.42872
10,-0.42872
11,-0.42872
12,-0.42872
13,-0.42872
14,-0.42872
15,-0.42872
16,-0.42872
17,-0.42872
18,-0.42872
19,-0.42872
20,-0.42872
21,-0.42872
22,-0.42872
23,-0.42872
24,-0.42872
25,-0.42872
26,-0.42872
27,-0.42872
28,-0.42872
29,-0.42872
30,-0.42872
31,-0.42872
32,-0.42872
33,-0.42872
34,-0.42872
35,-0.42872
36,-0.42872
37,-0.42872
38,-0.42872
39,-0.42872
40,-0.42872
41,-0.42872
42,-0.42872
43,-0.42872
44,-0.42872
45,-0.42872
46,-0.42872
47,-0.42872
48,-0.42872
49,-0.42872
50,-0.42872
51,-0.42872
52,-0.42872
53,-0.42872
54,-0.42872
55,-0.42872
56,-0.42872
57,-0.42872
58,-0.42872
59,-0.42872
60,-0.42872
61,-0.42872
62,-0.42872
63,-0.42872
64,-0.42872
65,-0.42872
66,-0.42872
67,-0.42872
68,-0.42872
69,-0.42872
70,-0.42872
71,-0.42872
72,-0.42872
73,-0.42872
74,-0.42872
75,-0.42872
76,-0.42872
77,-0.42872
78,-0.42872
79,-0.42872
80,2.5465
81,3.8688
82,3.373
83,2.5465
84,2.0506
85,2.0506
86,1.8854
87,1.7201
88,1.7201
89,1.7201
90,2.2159
91,2.0506
92,1.8854
93,1.5548
94,1.8854
95,1.2242
