time,value
0,-0.21597
1,-0.21597
2,-0.21597
3,-0.21597
4,-0.21597
5,-0.21597
6,-0.21597
7,-0.21597
8,-0.21597
9,-0.21597
10,-0.21597
11,-0.21597
12,-0.21597
13,-0.21597
14,-0.21597
15,-0.21597
16,-0.21597
17,-0.21597
18,-0.21597
19,-0.21597
20,-0.21597
21,-0.21597
22,-0.21597
23,-0.21597
24,-0.21597
25,-0.21597
26,-0.21597
27,-0.21597
28,-0.21597
29,-0.21597
30,-0.21597
31,-0.21597
32,-0.21597
33,4.0605
34,-0.21597
35,-0.21597
36,2.915
37,7.3825
38,-0.21597
39,-0.21597
40,-0.21597
41,-0.21597
42,-0.21597
43,1.8459
44,-0.21597
45,-0.21597
46,-0.21597
47,-0.21597
48,-0.21597
49,-0.21597
50,-0.21597
51,-0.21597
52,-0.21597
53,-0.21597
54,-0.21597
55,-0.21597
56,-0.21597
57,2.8387
58,-0.21597
59,-0.21597
60,-0.21597
61,-0.21597
62,-0.21597
63,-0.21597
64,-0.21597
65,-0.21597
66,-0.21597
67,-0.21597
68,-0.21597
69,-0.21597
70,-0.21597
71,-0.21597
72,-0.21597
73,-0.21597
74,-0.21597
75,-0.21597
76,-0.21597
77,-0.21597
78,-0.21597
79,-0.21597
80,-0.21597
81,-0.06324099999999999
82,-0.13960999999999998
83,-0.10142000000000001
84,-0.13960999999999998
85,-0.13960999999999998
86,-0.10142000000000001
87,-0.21597
88,-0.21597
89,-0.21597
90,-0.21597
91,-0.21597
92,-0.21597
93,-0.21597
94,-0.21597
95,-0.21597
