{
  "about": {
    "datasetID": "uu7_pima_diabetes_dataset_TRAIN",
    "datasetName": "Pima Diabetes Data Set",
    "description": "This is a a two-class classification problem to distinguish between absence and presence of diabetes.\n For LUPI processing, the features are split into two groups:\n\n - standard features (columns 2-6, 8) are physically observable properties during a routine doctor visit\n - privileged features (columns 1,7 ) are private information (number of pregnancies and diabetes pedigree function, which is the presence of diabetes among patient's relatives), which may not be available due to lack of recordkeeping.",
    "license": "CC-BY license",
    "citation": "\n@misc{Dua:2017,\nauthor = \"Dheeru, Dua and Karra Taniskidou, Efi\",\nyear = \"2017\",\ntitle = \"{UCI} Machine Learning Repository\",\nurl = \"http://archive.ics.uci.edu/ml\",\ninstitution = \"University of California, Irvine, School of Information and Computer Sciences\" }\n",
    "source": "OpenML",
    "sourceURI": "https://www.openml.org/d/37",
    "datasetSchemaVersion": "4.0.0",
    "redacted": false,
    "datasetVersion": "4.0.0",
    "digest": "15a01126bc29079cb9fbcda2440a645f76f453c668c9bea3721d2726510ca04f"
  },
  "dataResources": [
    {
      "resID": "learningData",
      "resPath": "tables/learningData.csv",
      "resType": "table",
      "resFormat": {
        "text/csv": [
          "csv"
        ]
      },
      "isCollection": false,
      "columns": [
        {
          "colIndex": 0,
          "colName": "d3mIndex",
          "colType": "integer",
          "role": [
            "index"
          ]
        },
        {
          "colIndex": 1,
          "colName": "class",
          "colType": "categorical",
          "role": [
            "suggestedTarget"
          ]
        },
        {
          "colIndex": 2,
          "colName": "preg",
          "colType": "real",
          "role": [
            "attribute",
            "suggestedPrivilegedData"
          ]
        },
        {
          "colIndex": 3,
          "colName": "plas",
          "colType": "real",
          "role": [
            "attribute"
          ]
        },
        {
          "colIndex": 4,
          "colName": "pres",
          "colType": "real",
          "role": [
            "attribute"
          ]
        },
        {
          "colIndex": 5,
          "colName": "skin",
          "colType": "real",
          "role": [
            "attribute"
          ]
        },
        {
          "colIndex": 6,
          "colName": "insu",
          "colType": "real",
          "role": [
            "attribute"
          ]
        },
        {
          "colIndex": 7,
          "colName": "mass",
          "colType": "real",
          "role": [
            "attribute"
          ]
        },
        {
          "colIndex": 8,
          "colName": "pedi",
          "colType": "real",
          "role": [
            "attribute",
            "suggestedPrivilegedData"
          ]
        },
        {
          "colIndex": 9,
          "colName": "age",
          "colType": "real",
          "role": [
            "attribute"
          ]
        }
      ],
      "columnsCount": 10
    }
  ]
}