time,value
0,-0.18967
1,-0.18967
2,-0.18967
3,-0.18967
4,-0.18967
5,-0.18967
6,-0.18967
7,-0.18967
8,-0.18967
9,-0.18967
10,-0.18967
11,-0.18967
12,-0.18967
13,-0.18967
14,-0.18967
15,-0.18967
16,-0.18967
17,-0.18967
18,-0.18967
19,-0.18967
20,-0.18967
21,-0.18967
22,-0.18967
23,-0.18967
24,-0.18967
25,-0.18967
26,-0.18967
27,-0.18967
28,-0.18967
29,-0.18967
30,-0.18967
31,-0.18967
32,-0.18967
33,-0.18967
34,-0.091046
35,4.8771
36,3.2498
37,0.019903999999999998
38,0.0075765
39,0.34043
40,7.5399
41,0.72259
42,-0.16501
43,-0.18967
44,-0.18967
45,-0.18967
46,-0.18967
47,-0.18967
48,-0.18967
49,-0.18967
50,-0.18967
51,-0.18967
52,-0.18967
53,-0.18967
54,-0.18967
55,-0.18967
56,-0.18967
57,-0.18967
58,-0.18967
59,-0.18967
60,-0.18967
61,-0.18967
62,-0.18967
63,-0.18967
64,-0.18967
65,-0.18967
66,-0.18967
67,-0.18967
68,-0.18967
69,-0.18967
70,-0.18967
71,-0.18967
72,-0.18967
73,-0.18967
74,-0.18967
75,-0.18967
76,-0.18967
77,-0.18967
78,-0.18967
79,-0.18967
80,-0.18967
81,-0.18967
82,-0.18967
83,-0.18967
84,-0.18967
85,-0.18967
86,-0.18967
87,-0.18967
88,-0.18967
89,-0.18967
90,-0.18967
91,-0.18967
92,-0.18967
93,-0.18967
94,-0.18967
95,-0.18967
