time,value
0,0.27935
1,0.27935
2,0.27935
3,0.27935
4,0.15104
5,0.27935
6,0.27935
7,0.27935
8,0.27935
9,0.27935
10,0.27935
11,0.27935
12,0.27935
13,0.27935
14,0.27935
15,0.15104
16,0.27935
17,0.27935
18,0.27935
19,0.27935
20,0.9209200000000001
21,0.53598
22,0.27935
23,0.27935
24,0.27935
25,0.15104
26,0.27935
27,0.27935
28,0.27935
29,0.27935
30,0.27935
31,0.27935
32,0.27935
33,0.15104
34,0.27935
35,0.27935
36,0.27935
37,0.27935
38,0.27935
39,0.27935
40,-1.2604
41,0.022722
42,-1.7737
43,-1.7737
44,-2.0303
45,-1.902
46,-2.0303
47,-1.902
48,-2.0303
49,-1.902
50,0.53598
51,-1.6454
52,-1.902
53,-1.902
54,-2.0303
55,-1.902
56,-2.0303
57,-1.902
58,-2.0303
59,-1.902
60,1.1775
61,1.1775
62,1.1775
63,1.3059
64,1.1775
65,2.7173
66,2.589
67,1.0492
68,1.1775
69,0.79261
70,0.27935
71,0.27935
72,0.27935
73,0.27935
74,0.27935
75,0.27935
76,0.27935
77,0.27935
78,0.27935
79,0.27935
80,0.40765999999999997
81,0.27935
82,0.27935
83,0.27935
84,0.27935
85,0.27935
86,0.27935
87,0.27935
88,0.27935
89,0.27935
90,0.27935
91,0.27935
92,0.27935
93,0.27935
94,0.27935
95,0.27935
