time,value
0,1.7315
1,-0.25611999999999996
2,-0.91866
3,-0.40335
4,1.7315
5,-0.47697
6,-0.91866
7,-0.18250999999999998
8,1.7315
9,-0.6242
10,-0.91866
11,0.25919000000000003
12,1.4369999999999998
13,-0.91866
14,-0.91866
15,0.7745
16,0.8481200000000001
17,-0.91866
18,-0.91866
19,1.2162
20,0.40642
21,-0.91866
22,-0.91866
23,1.2898
24,0.11195999999999999
25,-0.91866
26,-0.7714300000000001
27,1.7315
28,-0.32974000000000003
29,-0.91866
30,0.33281
31,1.6579
32,-0.5505899999999999
33,-0.91866
34,0.11195999999999999
35,1.4369999999999998
36,-0.91866
37,-0.91866
38,0.25919000000000003
39,1.3634
40,-0.91866
41,-0.91866
42,0.55365
43,0.9217299999999999
44,-0.91866
45,-0.91866
46,1.1426
47,0.48003999999999997
48,-0.91866
49,-0.91866
50,1.4369999999999998
51,0.038342
52,-0.91866
53,-0.69782
54,1.7315
55,-0.47697
56,-0.91866
57,-0.32974000000000003
58,1.7315
59,-0.91866
60,-0.91866
61,0.11195999999999999
62,1.4369999999999998
63,-0.91866
64,-0.91866
65,0.9217299999999999
66,0.8481200000000001
67,-0.91866
68,-0.91866
69,1.1426
70,0.7745
71,-0.91866
72,-0.91866
73,1.4369999999999998
74,0.40642
75,-0.91866
76,-0.91866
77,1.8051
78,0.11195999999999999
79,-0.91866
80,-0.69782
81,1.8051
82,-0.18250999999999998
83,-0.91866
84,-0.25611999999999996
85,1.7315
86,-0.5505899999999999
87,-0.91866
88,0.11195999999999999
89,1.7315
90,-0.91866
91,-0.91866
92,0.55365
93,1.2162
94,-0.91866
95,-0.91866
