time,value
0,-0.1491
1,-0.1491
2,-0.1491
3,-0.1491
4,-0.1491
5,-0.1491
6,-0.1491
7,-0.1491
8,-0.1491
9,-0.1491
10,-0.1491
11,-0.1491
12,-0.1491
13,-0.1491
14,-0.1491
15,-0.1491
16,-0.1491
17,-0.1491
18,-0.1491
19,-0.1491
20,-0.1491
21,-0.1491
22,-0.1491
23,-0.1491
24,-0.1491
25,-0.1491
26,-0.1491
27,-0.1491
28,1.7777
29,8.9345
30,-0.1491
31,3.154
32,-0.1491
33,-0.1491
34,-0.1491
35,-0.1491
36,-0.1491
37,-0.1491
38,-0.1491
39,-0.1491
40,-0.1491
41,-0.1491
42,-0.1491
43,-0.1491
44,-0.1491
45,-0.1491
46,-0.1491
47,-0.1491
48,-0.1491
49,-0.1491
50,-0.1491
51,-0.1491
52,-0.1491
53,-0.1491
54,-0.1491
55,-0.1491
56,-0.1491
57,-0.1491
58,-0.1491
59,-0.1491
60,-0.1491
61,-0.1491
62,-0.1491
63,-0.1491
64,-0.1491
65,-0.1491
66,-0.1491
67,-0.1491
68,-0.1491
69,-0.1491
70,-0.1491
71,-0.1491
72,-0.1491
73,-0.1491
74,-0.1491
75,-0.1491
76,-0.1491
77,-0.1491
78,-0.1491
79,-0.1491
80,-0.1491
81,-0.1491
82,-0.1491
83,-0.1491
84,-0.1491
85,-0.1491
86,-0.1491
87,-0.1491
88,-0.1491
89,-0.1491
90,-0.1491
91,-0.1491
92,-0.1491
93,-0.1491
94,-0.1491
95,-0.1491
