time,value
0,0.9173600000000001
1,-1.0397
2,-1.0397
3,-1.0397
4,-1.0397
5,-1.0397
6,-1.0397
7,-1.0397
8,-1.0397
9,0.07863099999999999
10,1.2901
11,1.1969
12,1.0106
13,1.0106
14,0.9173600000000001
15,0.9173600000000001
16,-0.85329
17,-1.0397
18,-1.0397
19,-1.0397
20,-1.0397
21,-1.0397
22,-1.0397
23,-1.0397
24,-0.014561000000000001
25,1.3833
26,1.1969
27,1.1037
28,0.9173600000000001
29,0.9173600000000001
30,0.9173600000000001
31,0.26502
32,-1.0397
33,-1.0397
34,-1.0397
35,-1.0397
36,-1.0397
37,-1.0397
38,-1.0397
39,0.4514
40,1.2901
41,1.1969
42,1.0106
43,0.9173600000000001
44,1.0106
45,0.8241700000000001
46,0.9173600000000001
47,0.8241700000000001
48,0.07863099999999999
49,-1.0397
50,-1.0397
51,-1.0397
52,-1.0397
53,-1.0397
54,-1.0397
55,-1.0397
56,1.1969
57,1.2901
58,1.1037
59,1.0106
60,1.0106
61,0.8241700000000001
62,0.26502
63,0.9173600000000001
64,0.9173600000000001
65,-0.20095
66,-1.0397
67,-1.0397
68,-1.0397
69,-1.0397
70,-1.0397
71,-0.7601
72,-1.0397
73,1.1969
74,1.2901
75,1.1037
76,1.0106
77,0.9173600000000001
78,0.9173600000000001
79,0.8241700000000001
80,0.9173600000000001
81,-0.7601
82,-1.0397
83,-1.0397
84,-1.0397
85,-1.0397
86,-1.0397
87,-1.0397
88,-1.0397
89,0.8241700000000001
90,1.2901
91,1.1037
92,1.0106
93,1.0106
94,0.9173600000000001
95,0.8241700000000001
