time,value
0,-0.46047
1,-0.17343
2,-0.46047
3,-0.17343
4,-0.46047
5,-0.46047
6,-0.17343
7,-0.46047
8,-0.46047
9,-0.46047
10,-0.17343
11,-0.46047
12,-0.46047
13,-0.17343
14,-0.46047
15,-0.46047
16,-0.46047
17,-0.17343
18,-0.46047
19,-0.46047
20,-0.46047
21,-0.17343
22,-0.46047
23,-0.46047
24,-0.46047
25,-0.17343
26,-0.46047
27,-0.46047
28,2.9841
29,3.2712
30,-0.17343
31,-0.46047
32,-0.17343
33,-0.46047
34,-0.17343
35,-0.46047
36,-0.17343
37,-0.46047
38,-0.17343
39,-0.46047
40,-0.17343
41,-0.46047
42,-0.17343
43,-0.46047
44,-0.46047
45,-0.17343
46,-0.46047
47,-0.46047
48,-0.46047
49,-0.17343
50,-0.46047
51,-0.46047
52,-0.17343
53,-0.46047
54,-0.46047
55,-0.46047
56,-0.17343
57,-0.46047
58,-0.46047
59,-0.46047
60,-0.17343
61,-0.46047
62,-0.46047
63,0.40066999999999997
64,3.2712
65,3.2712
66,3.2712
67,2.9841
68,2.6971
69,1.5489
70,-0.17343
71,-0.46047
72,-0.17343
73,-0.46047
74,-0.17343
75,2.41
76,2.6971
77,-0.17343
78,-0.17343
79,-0.17343
80,-0.46047
81,-0.17343
82,-0.17343
83,-0.17343
84,-0.46047
85,-0.17343
86,-0.17343
87,-0.17343
88,-0.46047
89,-0.17343
90,-0.17343
91,-0.17343
92,-0.46047
93,-0.17343
94,-0.46047
95,-0.46047
