time,value
0,-2.2906
1,-2.2932
2,-2.3037
3,-2.3116
4,-2.3116
5,-2.3116
6,-2.3116
7,-2.3116
8,-2.3116
9,-2.3116
10,-2.3115
11,-2.3113
12,-2.311
13,-2.3104
14,-2.3099
15,-2.3093
16,-2.3083
17,-2.31
18,-2.309
19,-2.3079
20,-2.3064
21,-2.3051
22,-2.3037
23,-2.3022
24,-2.3
25,-2.2983
26,-2.2965
27,-2.2939
28,-2.2919
29,-2.2898
30,-2.2876
31,-2.2845
32,-2.2821
33,-2.2796
34,-2.2761
35,-2.2734
36,-2.2706
37,-2.2702
38,-2.2789
39,-2.2827
40,-2.2797
41,-2.2754
42,-2.2722
43,-2.2688
44,-2.2654
45,-2.2607
46,-2.2594
47,-2.2557
48,-2.2507
49,-2.2469
50,-2.2429
51,-2.239
52,-2.2335
53,-2.2294
54,-2.2252
55,-2.2195
56,-2.2151
57,-2.2107
58,-2.2063
59,-2.2002
60,-2.1956
61,-2.191
62,-2.1863
63,-2.1799
64,-2.1751
65,-2.1702
66,-2.1636
67,-2.1586
68,-2.1535
69,-2.1484
70,-2.1416
71,-2.1364
72,-2.1311
73,-2.1241
74,-2.1187
75,-2.1152
76,-2.1172
77,-2.1247
78,-2.1192
79,-2.1136
80,-2.1061
81,-2.1005
82,-2.0948
83,-2.0891
84,-2.0814
85,-2.0756
86,-2.0698
87,-2.0619
88,-2.056
89,-2.0501
90,-2.0441
91,-2.0361
92,-2.0301
93,-2.024
94,-2.0159
95,-2.0097
96,-2.0036
97,-1.9974
98,-1.9891
99,-1.9829
100,-1.9766
101,-1.9709
102,-1.9625
103,-1.9572
104,-1.9509999999999998
105,-1.9426
106,-1.9363
107,-1.9284
108,-1.9221
109,-1.9136
110,-1.9078
111,-1.9011
112,-1.8923
113,-1.8844
114,-1.8771
115,-1.8703
116,-1.8609
117,-1.8545
118,-1.8467
119,-1.8382
120,-1.8324
121,-1.8257
122,-1.8211
123,-1.8111
124,-1.8047
125,-1.7995
126,-1.7933
127,-1.7855
128,-1.7791
129,-1.7712
130,-1.7627
131,-1.7569
132,-1.7502
133,-1.7414
134,-1.7335
135,-1.7277
136,-1.7231
137,-1.7143
138,-1.7079
139,-1.7015
140,-1.6936
141,-1.6851
142,-1.6784
143,-1.6717
144,-1.6617
145,-1.6538
146,-1.6471
147,-1.6404
148,-1.6325
149,-1.6261
150,-1.6182
151,-1.6096
152,-1.6045
153,-1.5978
154,-1.5926
155,-1.5841
156,-1.5777
157,-1.5698
158,-1.5612
159,-1.5567
160,-1.55
161,-1.5442
162,-1.5357
163,-1.5292
164,-1.5213
165,-1.5148
166,-1.5104
167,-1.5037
168,-1.4979
169,-1.4894
170,-1.4814
171,-1.4749
172,-1.4685
173,-1.4619
174,-1.4574
175,-1.4516
176,-1.443
177,-1.4365
178,-1.4286
179,-1.4221
180,-1.4140000000000001
181,-1.4074
182,-1.4009
183,-1.3923
184,-1.3858
185,-1.3778
186,-1.3713
187,-1.3626
188,-1.3568
189,-1.3502
190,-1.3415
191,-1.335
192,-1.3285
193,-1.3205
194,-1.3117
195,-1.3088
196,-1.3023
197,-1.2929
198,-1.2863
199,-1.2798
200,-1.2732
201,-1.263
202,-1.2564
203,-1.2498
204,-1.2434
205,-1.2369
206,-1.2311
207,-1.2245
208,-1.2143
209,-1.2077
210,-1.2009999999999998
211,-1.1932
212,-1.1867
213,-1.1801
214,-1.1735
215,-1.1633
216,-1.1567
217,-1.1517
218,-1.1452
219,-1.1372
220,-1.1292
221,-1.1226
222,-1.1137
223,-1.1071
224,-1.099
225,-1.0923
226,-1.0837
227,-1.0796
228,-1.0715
229,-1.0613
230,-1.0546
231,-1.0479
232,-1.0421
233,-1.0344
234,-1.0294
235,-1.0227
236,-1.0138
237,-1.0058
238,-0.9990899999999999
239,-0.99239
240,-0.98346
241,-0.9762700000000001
242,-0.9699399999999999
243,-0.9605100000000001
244,-0.95381
245,-0.94711
246,-0.94039
247,-0.9300799999999999
248,-0.92335
249,-0.9166200000000001
250,-0.91033
251,-0.90404
252,-0.8982
253,-0.8914799999999999
254,-0.8825
255,-0.8744200000000001
256,-0.8676799999999999
257,-0.86141
258,-0.85601
259,-0.84929
260,-0.8425600000000001
261,-0.83357
262,-0.8254799999999999
263,-0.81872
264,-0.81196
265,-0.80294
266,-0.7961600000000001
267,-0.78937
268,-0.7822100000000001
269,-0.7759999999999999
270,-0.7710899999999999
271,-0.76432
272,-0.75527
273,-0.74848
274,-0.74168
275,-0.7313
276,-0.72449
277,-0.71767
278,-0.71085
279,-0.7017399999999999
280,-0.69787
281,-0.6917
282,-0.6835899999999999
283,-0.67677
284,-0.66994
285,-0.6631
286,-0.65398
287,-0.64713
288,-0.64027
289,-0.63112
290,-0.62298
291,-0.61611
292,-0.60923
293,-0.60004
294,-0.59315
295,-0.58625
296,-0.5816399999999999
297,-0.57934
298,-0.5757899999999999
299,-0.5676399999999999
300,-0.55718
301,-0.5536399999999999
302,-0.55009
303,-0.54424
304,-0.53609
305,-0.53378
306,-0.5314800000000001
307,-0.52225
308,-0.51532
309,-0.50839
310,-0.50145
311,-0.49096999999999996
312,-0.48402
313,-0.47706000000000004
314,-0.46778000000000003
315,-0.46082
316,-0.45487
317,-0.45123
318,-0.44073999999999997
319,-0.43378
320,-0.42682
321,-0.41753
322,-0.41056000000000004
323,-0.40358
324,-0.3954
325,-0.38608000000000003
326,-0.37909
327,-0.37209000000000003
328,-0.36275
329,-0.35574
330,-0.34872
331,-0.3417
332,-0.33584
333,-0.32997
334,-0.32178
335,-0.31477
336,-0.30424
337,-0.29722
338,-0.29136999999999996
339,-0.28433
340,-0.27963000000000005
341,-0.27262
342,-0.26561
343,-0.25508000000000003
344,-0.24806
345,-0.24338
346,-0.23633
347,-0.23048000000000002
348,-0.22346999999999997
349,-0.21528000000000003
350,-0.20593000000000003
351,-0.1989
352,-0.19422
353,-0.18950999999999998
354,-0.18132
355,-0.17431
356,-0.1673
357,-0.15794
358,-0.14974
359,-0.14272
360,-0.13334000000000001
361,-0.1275
362,-0.12399
363,-0.1158
364,-0.10643
365,-0.099405
366,-0.09121
367,-0.08183
368,-0.074789
369,-0.067744
370,-0.064273
371,-0.057272
372,-0.050242
373,-0.043209
374,-0.036169
375,-0.025624
376,-0.018578
377,-0.011526999999999999
378,-0.0021195999999999997
379,0.0036804000000000003
380,0.0071454
381,0.015345
382,0.024738
383,0.032941000000000005
384,0.039992
385,0.046995999999999996
386,0.05280599999999999
387,0.057468
388,0.064511
389,0.073907
390,0.080958
391,0.08916
392,0.098572
393,0.10563
394,0.1127
395,0.11977
396,0.13034
397,0.13610999999999998
398,0.14074
399,0.14895
400,0.15602
401,0.16309
402,0.17015999999999998
403,0.1796
404,0.18781
405,0.1949
406,0.20435
407,0.21144000000000002
408,0.21854
409,0.22564
410,0.23274
411,0.23510999999999999
412,0.23859
413,0.24681
414,0.25851
415,0.26199
416,0.26548
417,0.27605999999999997
418,0.27843
419,0.2808
420,0.28791
421,0.29739
422,0.30451
423,0.31163
424,0.32223
425,0.32936
426,0.33649
427,0.34215999999999996
428,0.34894000000000003
429,0.35606
430,0.36318
431,0.37268
432,0.37981
433,0.38694
434,0.39516999999999997
435,0.40468000000000004
436,0.41181999999999996
437,0.41897
438,0.4285
439,0.43565
440,0.4415
441,0.44713
442,0.45515
443,0.46229
444,0.47052
445,0.48005
446,0.48721000000000003
447,0.48958999999999997
448,0.48958999999999997
449,0.49436
450,0.50152
451,0.50868
452,0.51107
453,0.51584
454,0.5230100000000001
455,0.53018
456,0.53974
457,0.54692
458,0.5541
459,0.56128
460,0.57086
461,0.57805
462,0.58525
463,0.5948399999999999
464,0.6020399999999999
465,0.60924
466,0.61644
467,0.6260600000000001
468,0.63327
469,0.64048
470,0.6501
471,0.65732
472,0.66282
473,0.66832
474,0.67657
475,0.68378
476,0.691
477,0.70062
478,0.7078399999999999
479,0.71507
480,0.72229
481,0.73193
482,0.73916
483,0.7464
484,0.75364
485,0.7632899999999999
486,0.7671100000000001
487,0.7640899999999999
488,0.76351
489,0.76251
490,0.76052
491,0.75755
492,0.7536
493,0.7536
494,0.75262
495,0.74969
496,0.7467699999999999
497,0.74143
498,0.73854
499,0.73322
500,0.72592
501,0.7186100000000001
502,0.70791
503,0.7006100000000001
504,0.69382
505,0.69094
506,0.68171
507,0.6744100000000001
508,0.66614
509,0.6564
510,0.6491
511,0.6418
512,0.6345
513,0.62821
514,0.6229
515,0.61559
516,0.6048899999999999
517,0.59759
518,0.59029
519,0.5844600000000001
520,0.57818
521,0.56992
522,0.56165
523,0.55435
524,0.54365
525,0.53686
526,0.53155
527,0.52477
528,0.51746
529,0.51015
530,0.50188
531,0.49213999999999997
532,0.48483999999999994
533,0.47753
534,0.4717
535,0.46638999999999997
536,0.46108000000000005
537,0.45621000000000006
538,0.44646
539,0.43916000000000005
540,0.43088999999999994
541,0.42116000000000003
542,0.41386000000000006
543,0.40656
544,0.40365999999999996
545,0.39739
546,0.39009
547,0.38278
548,0.37304
549,0.36574
550,0.35845
551,0.35018
552,0.34046
553,0.33316
554,0.32588
555,0.3181
556,0.31276
557,0.30596999999999996
558,0.29867
559,0.29091
560,0.2856
561,0.27976999999999996
562,0.2715
563,0.26376
564,0.25848000000000004
565,0.25265
566,0.24289000000000002
567,0.23462
568,0.22730999999999998
569,0.22
570,0.21619000000000002
571,0.21091999999999997
572,0.20265
573,0.19194
574,0.18667999999999998
575,0.18387
576,0.17653
577,0.16488
578,0.15964
579,0.15779
580,0.14707
581,0.13973
582,0.13239
583,0.12412000000000001
584,0.1183
585,0.11306
586,0.10785
587,0.097125
588,0.091304
589,0.08609800000000001
590,0.08336
591,0.073546
592,0.066188
593,0.057918
594,0.048111
595,0.044742000000000004
596,0.039547000000000006
597,0.034365
598,0.024547
599,0.017185
600,0.0089144
601,0.0015544
602,-0.0036326
603,-0.008804600000000001
604,-0.011506
605,-0.015075999999999999
606,-0.019313
607,-0.026701999999999997
608,-0.034088
609,-0.043931
610,-0.05131
611,-0.059583000000000004
612,-0.06941900000000001
613,-0.076129
614,-0.08127000000000001
615,-0.085507
616,-0.095356
617,-0.10274000000000001
618,-0.11012000000000001
619,-0.12085
620,-0.12822999999999998
621,-0.1356
622,-0.14232
623,-0.14835
624,-0.15416
625,-0.16155
626,-0.17139000000000001
627,-0.17877
628,-0.18614
629,-0.19442
630,-0.20425
631,-0.21161
632,-0.21898
633,-0.22725
634,-0.23242
635,-0.24004
636,-0.24741
637,-0.25724
638,-0.26550999999999997
639,-0.27288
640,-0.27715
641,-0.28073000000000004
642,-0.28655
643,-0.29481999999999997
644,-0.30241
645,-0.30753
646,-0.31334
647,-0.32161
648,-0.3283
649,-0.33339
650,-0.34006
651,-0.35081
652,-0.35414
653,-0.35674
654,-0.35931
655,-0.36016
656,-0.36101
657,-0.36354000000000003
658,-0.36522
659,-0.36522
660,-0.36771
661,-0.37019
662,-0.36355
663,-0.35609
664,-0.34863
665,-0.33866999999999997
666,-0.3312
667,-0.32373
668,-0.31626
669,-0.30709000000000003
670,-0.29961
671,-0.29213
672,-0.28215
673,-0.27466
674,-0.27701
675,-0.27684000000000003
676,-0.2701
677,-0.2626
678,-0.25585
679,-0.24833000000000002
680,-0.24231999999999998
681,-0.24206
682,-0.23851999999999998
683,-0.22848000000000002
684,-0.22094
685,-0.2134
686,-0.20586
687,-0.1958
688,-0.18898
689,-0.18143
690,-0.17137
691,-0.16382
692,-0.15625999999999998
693,-0.14870999999999998
694,-0.13863
695,-0.13107
696,-0.12351
697,-0.11272
698,-0.10515999999999999
699,-0.097596
700,-0.09003
701,-0.07994
702,-0.072371
703,-0.065234
704,-0.059894
705,-0.052336
706,-0.044774
707,-0.037212999999999996
708,-0.026424
709,-0.01886
710,-0.011294
711,-0.0030285999999999998
712,-0.00092161
713,0.0030154
714,0.011283
715,0.021359
716,0.029626999999999997
717,0.037186000000000004
718,0.042934
719,0.048297
720,0.057282000000000007
721,0.064835
722,0.074907
723,0.08246
724,0.090019
725,0.097578
726,0.10835999999999998
727,0.11592000000000001
728,0.12349
729,0.13064
730,0.1353
731,0.14357
732,0.15112
733,0.1612
734,0.16875
735,0.17631
736,0.18639
737,0.19466
738,0.20222
739,0.20978000000000002
740,0.21986999999999998
741,0.22744
742,0.23501
743,0.24033000000000002
744,0.24245
745,0.25001
746,0.25756999999999997
747,0.26765
748,0.27521
749,0.28278000000000003
750,0.29286
751,0.30113
752,0.3087
753,0.31627
754,0.32636
755,0.33393
756,0.3415
757,0.34908
758,0.35849000000000003
759,0.36607
760,0.37365
761,0.38376
762,0.39134
763,0.39893
764,0.40719
765,0.4173
766,0.42422
767,0.43181
768,0.44193000000000005
769,0.44952
770,0.45711
771,0.46537
772,0.4755
773,0.48308999999999996
774,0.49068999999999996
775,0.5008199999999999
776,0.50842
777,0.51602
778,0.52363
779,0.52879
780,0.53012
781,0.53838
782,0.5485
783,0.5561
784,0.5637
785,0.57129
786,0.58143
787,0.58903
788,0.59663
789,0.60677
790,0.61437
791,0.62198
792,0.62958
793,0.63466
794,0.6371899999999999
795,0.64226
796,0.64987
797,0.65241
798,0.65495
799,0.66256
800,0.67271
801,0.68032
802,0.68794
803,0.69555
804,0.7057100000000001
805,0.71333
806,0.7146
807,0.7146399999999999
808,0.71911
809,0.7267399999999999
810,0.73437
811,0.74455
812,0.7521800000000001
813,0.75981
814,0.76999
815,0.77763
816,0.7852600000000001
817,0.78842
818,0.7934100000000001
819,0.79719
820,0.80482
821,0.81499
822,0.82263
823,0.83026
824,0.8378899999999999
825,0.8480700000000001
826,0.8563200000000001
827,0.86395
828,0.8741399999999999
829,0.88177
830,0.88941
831,0.89705
832,0.9072399999999999
833,0.9148799999999999
834,0.9225200000000001
835,0.93016
836,0.94035
837,0.948
838,0.9556399999999999
839,0.9658399999999999
840,0.97349
841,0.97782
842,0.9803700000000001
843,0.98801
844,0.99566
845,1.0033
846,1.0135
847,1.0212
848,1.0237
849,1.0257
850,1.0321
851,1.0398
852,1.0475
853,1.0577
854,1.0653
855,1.0724
856,1.0801
857,1.0903
858,1.0979
859,1.1056
860,1.1158
861,1.1235
862,1.1218
863,1.1226
864,1.1298
865,1.1374
866,1.1451
867,1.1553
868,1.163
869,1.1707
870,1.1784
871,1.1886
872,1.1963
873,1.204
874,1.2116
875,1.2219
876,1.2296
877,1.2372
878,1.2475
879,1.2552
880,1.2629
881,1.2705
882,1.2808
883,1.2879
884,1.2956
885,1.3059
886,1.3136
887,1.3212
888,1.3253
889,1.3232
890,1.3304
891,1.3376
892,1.3381
893,1.3366
894,1.3351
895,1.3336
896,1.3316
897,1.3302
898,1.3287
899,1.3268
900,1.3254
901,1.3219
902,1.3137
903,1.3046
904,1.3007
905,1.2919999999999998
906,1.2808
907,1.2794
908,1.276
909,1.2678
910,1.2575
911,1.2497
912,1.242
913,1.2343
914,1.224
915,1.2162
916,1.2085
917,1.1982
918,1.1904
919,1.1827
920,1.175
921,1.1642
922,1.1565
923,1.1487
924,1.1384
925,1.1307
926,1.123
927,1.1152
928,1.1049
929,1.0972
930,1.0911
931,1.0867
932,1.0785
933,1.0708
934,1.0631
935,1.0523
936,1.0446
937,1.0368
938,1.0261
939,1.0222
940,1.0182
941,1.0105
942,1.0002
943,0.99244
944,0.9847100000000001
945,0.97439
946,0.96665
947,0.95847
948,0.9507399999999999
949,0.94042
950,0.93269
951,0.92495
952,0.91935
953,0.9149799999999999
954,0.9089299999999999
955,0.9011899999999999
956,0.8904299999999999
957,0.88269
958,0.87495
959,0.8723700000000001
960,0.8723700000000001
961,0.86464
962,0.8569
963,0.84872
964,0.8456899999999999
965,0.84525
966,0.8370700000000001
967,0.8258700000000001
968,0.81813
969,0.8103899999999999
970,0.80781
971,0.80479
972,0.79705
973,0.7893100000000001
974,0.77899
975,0.77125
976,0.76351
977,0.7532
978,0.74546
979,0.73727
980,0.72954
981,0.71922
982,0.71149
983,0.70375
984,0.69344
985,0.6857
986,0.6843600000000001
987,0.68045
988,0.67227
989,0.6645300000000001
990,0.65679
991,0.64905
992,0.6382899999999999
993,0.63055
994,0.6228100000000001
995,0.61249
996,0.6047600000000001
997,0.5987100000000001
998,0.5948
999,0.58619
1000,0.57845
1001,0.5707
1002,0.56038
1003,0.5526399999999999
1004,0.54446
1005,0.53672
1006,0.5264
1007,0.51867
1008,0.51093
1009,0.50061
1010,0.49287
1011,0.48896000000000006
1012,0.48765
1013,0.47947
1014,0.47173000000000004
1015,0.46356
1016,0.45323
1017,0.44763000000000003
1018,0.44376000000000004
1019,0.44248999999999994
1020,0.43216000000000004
1021,0.42441
1022,0.41666000000000003
1023,0.40633
1024,0.39816
1025,0.39041
1026,0.38266
1027,0.37234
1028,0.36459
1029,0.36115
1030,0.3573
1031,0.35129
1032,0.34355
1033,0.33538
1034,0.32504
1035,0.31729
1036,0.30954
1037,0.30179
1038,0.29578000000000004
1039,0.29196
1040,0.28855
1041,0.27821
1042,0.27005
1043,0.26229
1044,0.25454
1045,0.25033
1046,0.24395999999999998
1047,0.2362
1048,0.22545
1049,0.21769000000000002
1050,0.20993
1051,0.20655
1052,0.2024
1053,0.19723
1054,0.18946
1055,0.17911
1056,0.17134000000000002
1057,0.16358
1058,0.15581
1059,0.14545999999999998
1060,0.1377
1061,0.13631
1062,0.13493
1063,0.12718
1064,0.11942
1065,0.11167
1066,0.10132999999999999
1067,0.09357599999999999
1068,0.085823
1069,0.078071
1070,0.067735
1071,0.06215
1072,0.05915
1073,0.056567
1074,0.048815
1075,0.041062
1076,0.03331
1077,0.022558
1078,0.01439
1079,0.01139
1080,0.0083934
1081,0.00022739
1082,-0.007524600000000001
1083,-0.015280000000000002
1084,-0.023032
1085,-0.025618000000000002
1086,-0.030787000000000002
1087,-0.041123
1088,-0.048875999999999996
1089,-0.056625
1090,-0.064794
1091,-0.07513
1092,-0.082879
1093,-0.086714
1094,-0.093519
1095,-0.10128
1096,-0.10903
1097,-0.11679
1098,-0.12713
1099,-0.13012
1100,-0.13012
1101,-0.13053
1102,-0.13172999999999999
1103,-0.13213
1104,-0.13252
1105,-0.13369
1106,-0.13484000000000002
1107,-0.13004000000000002
1108,-0.12227
1109,-0.11191
1110,-0.1045
1111,-0.09673
1112,-0.086363
1113,-0.07859
1114,-0.077085
1115,-0.075559
1116,-0.065532
1117,-0.057751
1118,-0.050312
1119,-0.039932
1120,-0.038016
1121,-0.039019
1122,-0.037401
1123,-0.038676
1124,-0.037006
1125,-0.029513
1126,-0.022313
1127,-0.020596
1128,-0.021172
1129,-0.013366999999999999
1130,-0.0029596
1131,0.0048474
1132,0.012652
1133,0.023061
1134,0.030588
1135,0.038395
1136,0.046202999999999994
1137,0.056612
1138,0.06442200000000001
1139,0.072229
1140,0.08264099999999999
1141,0.090723
1142,0.09853300000000001
1143,0.10634
1144,0.11675
1145,0.12455999999999999
1146,0.13237000000000002
1147,0.14018
1148,0.15059
1149,0.15841
1150,0.16622
1151,0.17663
1152,0.18444000000000002
1153,0.19225
1154,0.20006
1155,0.21048000000000003
1156,0.21829
1157,0.2261
1158,0.23651999999999998
1159,0.24433000000000002
1160,0.25214000000000003
1161,0.25995
1162,0.27037
1163,0.27819
1164,0.28600000000000003
1165,0.29641999999999996
1166,0.30423
1167,0.30501
1168,0.30761
1169,0.31543000000000004
1170,0.32324
1171,0.33105
1172,0.34147
1173,0.34928000000000003
1174,0.35189000000000004
1175,0.35423000000000004
1176,0.36154000000000003
1177,0.36935
1178,0.37717
1179,0.38759
1180,0.39541
1181,0.40321999999999997
1182,0.41103999999999996
1183,0.42146000000000006
1184,0.42928
1185,0.43709
1186,0.44491
1187,0.45533
1188,0.46315
1189,0.47097
1190,0.48139
1191,0.48921000000000003
1192,0.49703
1193,0.50485
1194,0.51527
1195,0.5230899999999999
1196,0.53091
1197,0.54133
1198,0.54915
1199,0.55697
1200,0.56455
1201,0.57498
1202,0.5828
1203,0.59062
1204,0.60105
1205,0.60887
1206,0.61669
1207,0.62167
1208,0.6236
1209,0.6288100000000001
1210,0.63664
1211,0.64707
1212,0.65489
1213,0.66272
1214,0.67032
1215,0.67771
1216,0.68032
1217,0.68032
1218,0.69075
1219,0.69858
1220,0.7037899999999999
1221,0.7064
1222,0.71162
1223,0.71945
1224,0.72727
1225,0.7348899999999999
1226,0.74532
1227,0.75315
1228,0.76098
1229,0.77141
1230,0.7792399999999999
1231,0.7870699999999999
1232,0.79489
1233,0.80533
1234,0.81316
1235,0.82099
1236,0.83142
1237,0.83925
1238,0.8470799999999999
1239,0.8549100000000001
1240,0.86534
1241,0.8731700000000001
1242,0.8809999999999999
1243,0.89144
1244,0.8992700000000001
1245,0.9071
1246,0.9149299999999999
1247,0.92537
1248,0.9329999999999999
1249,0.93261
1250,0.93763
1251,0.9454600000000001
1252,0.95329
1253,0.9611299999999999
1254,0.97157
1255,0.9794
1256,0.9872299999999999
1257,0.9898399999999999
1258,0.99245
1259,1.0003
1260,1.0081
1261,1.0186
1262,1.0264
1263,1.0342
1264,1.0368
1265,1.0391
1266,1.0441
1267,1.0519
1268,1.0624
1269,1.0702
1270,1.0781
1271,1.0859
1272,1.0963
1273,1.1042
1274,1.112
1275,1.1224
1276,1.1303
1277,1.1381
1278,1.1459
1279,1.1564
1280,1.1642
1281,1.1721
1282,1.1825
1283,1.1903
1284,1.1982
1285,1.206
1286,1.2165
1287,1.2243
1288,1.2321
1289,1.2424
1290,1.2502
1291,1.2581
1292,1.2659
1293,1.2763
1294,1.2842
1295,1.2865
1296,1.2884
1297,1.2935
1298,1.3013
1299,1.3092
1300,1.3195
1301,1.3273
1302,1.3351
1303,1.3430000000000002
1304,1.3479
1305,1.3501
1306,1.355
1307,1.3655
1308,1.3733
1309,1.3811
1310,1.389
1311,1.3994
1312,1.4073
1313,1.4151
1314,1.4257
1315,1.4286
1316,1.4312
1317,1.4364
1318,1.4469
1319,1.4547
1320,1.4626
1321,1.473
1322,1.473
1323,1.4754
1324,1.4804
1325,1.4909
1326,1.4987
1327,1.5066
1328,1.5169
1329,1.5247
1330,1.5326
1331,1.5349
1332,1.537
1333,1.5447
1334,1.5525
1335,1.5547
1336,1.5544
1337,1.554
1338,1.5537
1339,1.5533
1340,1.5530000000000002
1341,1.5528
1342,1.5525
1343,1.5522
1344,1.5519
1345,1.544
1346,1.5335
1347,1.5333
1348,1.5331
1349,1.5303
1350,1.5301
1351,1.5247
1352,1.5169
1353,1.5064
1354,1.4986
1355,1.4907
1356,1.4829
1357,1.4724
1358,1.4645
1359,1.4567
1360,1.4462
1361,1.4383
1362,1.4305
1363,1.4226
1364,1.4122
1365,1.4043
1366,1.3965
1367,1.386
1368,1.3833
1369,1.3831
1370,1.3752
1371,1.3647
1372,1.3619999999999999
1373,1.3593
1374,1.3514
1375,1.3436
1376,1.3409
1377,1.3408
1378,1.3304
1379,1.3225
1380,1.3147
1381,1.3068
1382,1.2963
1383,1.2885
1384,1.2806
1385,1.278
1386,1.2754
1387,1.2675
1388,1.2597
1389,1.2544
1390,1.2518
1391,1.2492
1392,1.2387
1393,1.2387
1394,1.2361
1395,1.2283
1396,1.2178
1397,1.2099
1398,1.2021
1399,1.1916
1400,1.1838
1401,1.1759
1402,1.1681
1403,1.1576
1404,1.1497
1405,1.1419
1406,1.1314
1407,1.1236
1408,1.1157
1409,1.1079
1410,1.0974
1411,1.0895
1412,1.0817
1413,1.0738
1414,1.0634
1415,1.0555
1416,1.0477
1417,1.0372
1418,1.0293
1419,1.0294
1420,1.0268
1421,1.0189
1422,1.0111
1423,1.0032
1424,0.9927799999999999
1425,0.9849399999999999
1426,0.97708
1427,0.9692299999999999
1428,0.96667
1429,0.9641299999999999
1430,0.95631
1431,0.94584
1432,0.93799
1433,0.93014
1434,0.9222899999999999
1435,0.9118200000000001
1436,0.90397
1437,0.89612
1438,0.88565
1439,0.8778299999999999
1440,0.86998
1441,0.8621
1442,0.8516299999999999
1443,0.84377
1444,0.83593
1445,0.8254600000000001
1446,0.8176
1447,0.80979
1448,0.80193
1449,0.79147
1450,0.78361
1451,0.77576
1452,0.76791
1453,0.75744
1454,0.75483
1455,0.75483
1456,0.74698
1457,0.73912
1458,0.73127
1459,0.73127
1460,0.72869
1461,0.72088
1462,0.71306
1463,0.7026
1464,0.69475
1465,0.68689
1466,0.67904
1467,0.67381
1468,0.67132
1469,0.66352
1470,0.65305
1471,0.6452
1472,0.63735
1473,0.6295
1474,0.61903
1475,0.6111800000000001
1476,0.60333
1477,0.59286
1478,0.58496
1479,0.58496
1480,0.58235
1481,0.57188
1482,0.56403
1483,0.55618
1484,0.54833
1485,0.54571
1486,0.5431
1487,0.5352899999999999
1488,0.52482
1489,0.5169699999999999
1490,0.50912
1491,0.50127
1492,0.49081
1493,0.48295
1494,0.47516
1495,0.46468999999999994
1496,0.45683999999999997
1497,0.44893999999999995
1498,0.44114
1499,0.43067
1500,0.42282
1501,0.41497
1502,0.4045
1503,0.39666
1504,0.3888
1505,0.38095
1506,0.37049
1507,0.36264
1508,0.35479
1509,0.34431999999999996
1510,0.33647
1511,0.32861999999999997
1512,0.32077
1513,0.31577
1514,0.31329
1515,0.30544
1516,0.29496999999999995
1517,0.28712
1518,0.27926999999999996
1519,0.27143
1520,0.26095999999999997
1521,0.25311
1522,0.25035999999999997
1523,0.24506
1524,0.23721
1525,0.22935999999999998
1526,0.22150999999999998
1527,0.21105
1528,0.20314000000000002
1529,0.19523
1530,0.19255
1531,0.18993
1532,0.1847
1533,0.17685
1534,0.16639
1535,0.16639
1536,0.16377
1537,0.15853
1538,0.14807
1539,0.14022
1540,0.13230999999999998
1541,0.12185
1542,0.11399000000000001
1543,0.10614000000000001
1544,0.10342
1545,0.10061
1546,0.095337
1547,0.08748500000000001
1548,0.077016
1549,0.069125
1550,0.061276
1551,0.053424
1552,0.042957
1553,0.04034
1554,0.037723
1555,0.032488
1556,0.024636
1557,0.024636
1558,0.022019
1559,0.014169999999999999
1560,0.0063184
1561,-0.0014915999999999998
1562,-0.011959000000000001
1563,-0.017103999999999998
1564,-0.019566999999999998
1565,-0.022072
1566,-0.032538
1567,-0.040326999999999995
1568,-0.048177
1569,-0.056026
1570,-0.058376
1571,-0.060765999999999994
1572,-0.063302
1573,-0.063302
1574,-0.063046
1575,-0.06276799999999999
1576,-0.062470000000000005
1577,-0.06204
1578,-0.06204
1579,-0.061925
1580,-0.059075
1581,-0.056090999999999995
1582,-0.050475
1583,-0.042497
1584,-0.03424
1585,-0.031188
1586,-0.023349
1587,-0.012898
1588,-0.0050596
1589,0.0027824
1590,0.01077
1591,0.021221
1592,0.029058999999999998
1593,0.036898
1594,0.044739999999999995
1595,0.047805
1596,0.048277999999999995
1597,0.048773000000000004
1598,0.052076
1599,0.057659
1600,0.065673
1601,0.07145399999999999
1602,0.074645
1603,0.080063
1604,0.087891
1605,0.09833099999999999
1606,0.10636
1607,0.11419000000000001
1608,0.1168
1609,0.1168
1610,0.12462999999999999
1611,0.12985
1612,0.13246
1613,0.13505999999999999
1614,0.1429
1615,0.15072
1616,0.16116
1617,0.16899999999999998
1618,0.17682
1619,0.18725999999999998
1620,0.1951
1621,0.20293
1622,0.21076
1623,0.21878000000000003
1624,0.21936999999999998
1625,0.22259
1626,0.23303000000000001
1627,0.24086
1628,0.24868
1629,0.25651
1630,0.26695
1631,0.27498
1632,0.28281
1633,0.29325
1634,0.30107
1635,0.3041
1636,0.30734
1637,0.31038000000000004
1638,0.3182
1639,0.32603000000000004
1640,0.33646
1641,0.34429
1642,0.35211
1643,0.35994
1644,0.37059000000000003
1645,0.37840999999999997
1646,0.38624
1647,0.39405999999999997
1648,0.4045
1649,0.40993
1650,0.41318999999999995
1651,0.41648
1652,0.4243
1653,0.43212
1654,0.43993999999999994
1655,0.45037
1656,0.45842
1657,0.46624
1658,0.47667
1659,0.4845
1660,0.49232
1661,0.49538000000000004
1662,0.49892
1663,0.50437
1664,0.51218
1665,0.52261
1666,0.53067
1667,0.5384899999999999
1668,0.5463100000000001
1669,0.5567300000000001
1670,0.56266
1671,0.5634
1672,0.5714600000000001
1673,0.57928
1674,0.58709
1675,0.59516
1676,0.60558
1677,0.6134
1678,0.62122
1679,0.62643
1680,0.62903
1681,0.6371
1682,0.63995
1683,0.64281
1684,0.65088
1685,0.65894
1686,0.66701
1687,0.66987
1688,0.67248
1689,0.68029
1690,0.69071
1691,0.69853
1692,0.7066
1693,0.71441
1694,0.72483
1695,0.73055
1696,0.7339399999999999
1697,0.73968
1698,0.74749
1699,0.7553
1700,0.7631100000000001
1701,0.77353
1702,0.7813399999999999
1703,0.78915
1704,0.79983
1705,0.80765
1706,0.8154600000000001
1707,0.8232700000000001
1708,0.83368
1709,0.8370799999999999
1710,0.8405
1711,0.8485799999999999
1712,0.85639
1713,0.8642
1714,0.8720100000000001
1715,0.88269
1716,0.8905
1717,0.89831
1718,0.9087200000000001
1719,0.91653
1720,0.92201
1721,0.9254399999999999
1722,0.9288799999999999
1723,0.9366899999999999
1724,0.9445
1725,0.9523
1726,0.96299
1727,0.9708
1728,0.9786
1729,0.98669
1730,0.99015
1731,0.9910200000000001
1732,0.99882
1733,1.0092
1734,1.0170000000000001
1735,1.0248
1736,1.0355
1737,1.0433
1738,1.0511
1739,1.0589
1740,1.0693
1741,1.0771
1742,1.0849
1743,1.0904
1744,1.0939
1745,1.1
1746,1.1078
1747,1.1182
1748,1.1263
1749,1.1341
1750,1.1445
1751,1.1523
1752,1.1578
1753,1.1613
1754,1.1648
1755,1.1726
1756,1.1804
1757,1.1911
1758,1.1989
1759,1.2047
1760,1.2057
1761,1.2141
1762,1.2219
1763,1.2297
1764,1.2375
1765,1.2479
1766,1.256
1767,1.2638
1768,1.2742
1769,1.2819999999999998
1770,1.2878
1771,1.2913
1772,1.2972
1773,1.3053
1774,1.3108
1775,1.3147
1776,1.318
1777,1.3258
1778,1.3339
1779,1.3443
1780,1.3521
1781,1.3553
1782,1.3593
1783,1.3648
1784,1.3726
1785,1.3804
1786,1.3911
1787,1.3989
1788,1.3999
1789,1.4039
1790,1.4117
1791,1.4195
1792,1.4276
1793,1.4380000000000002
1794,1.4435
1795,1.4446
1796,1.446
1797,1.4497
1798,1.4508
1799,1.452
1800,1.4535
1801,1.4568
1802,1.462
1803,1.4624
1804,1.464
1805,1.4652
1806,1.4664
1807,1.4680000000000002
1808,1.4692
1809,1.4696
1810,1.4645
1811,1.4635
1812,1.4597
1813,1.4523
1814,1.445
1815,1.4437
1816,1.4451
1817,1.4373
1818,1.4274
1819,1.4197
1820,1.412
1821,1.4077
1822,1.4065
1823,1.4044
1824,1.3971
1825,1.3868
1826,1.379
1827,1.3713
1828,1.3615
1829,1.3538
1830,1.3491
1831,1.3495
1832,1.3444
1833,1.3367
1834,1.3294
1835,1.3201
1836,1.3128
1837,1.3056
1838,1.3030000000000002
1839,1.3004
1840,1.2927
1841,1.2901
1842,1.2876
1843,1.2799
1844,1.2721
1845,1.2644
1846,1.2541
1847,1.2464
1848,1.2387
1849,1.2309999999999999
1850,1.2207
1851,1.213
1852,1.2053
1853,1.195
1854,1.1873
1855,1.1796
1856,1.1719
1857,1.1616
1858,1.1539
1859,1.1462
1860,1.1359
1861,1.1282
1862,1.1205
1863,1.1128
1864,1.1025
1865,1.0989
1866,1.0949
1867,1.0887
1868,1.081
1869,1.0733
1870,1.0656
1871,1.0553
1872,1.0476
1873,1.0399
1874,1.0296
1875,1.0219
1876,1.0142
1877,1.006
1878,0.99575
1879,0.98805
1880,0.98035
1881,0.97264
1882,0.9623700000000001
1883,0.95467
1884,0.95211
1885,0.9469700000000001
1886,0.93927
1887,0.93671
1888,0.93414
1889,0.92285
1890,0.91464
1891,0.9064200000000001
1892,0.8961600000000001
1893,0.88897
1894,0.88949
1895,0.88744
1896,0.87769
1897,0.8694799999999999
1898,0.86126
1899,0.8525299999999999
1900,0.84945
1901,0.84893
1902,0.84072
1903,0.8304600000000001
1904,0.82532
1905,0.82532
1906,0.82019
1907,0.8125
1908,0.8048
1909,0.7971
1910,0.78684
1911,0.77915
1912,0.77145
1913,0.7612
1914,0.75298
1915,0.74529
1916,0.73759
1917,0.72734
1918,0.71965
1919,0.71196
1920,0.70427
1921,0.69402
1922,0.68633
1923,0.6786399999999999
1924,0.6684
1925,0.66071
1926,0.65303
1927,0.6453399999999999
1928,0.64022
1929,0.63766
1930,0.63766
1931,0.62634
1932,0.62324
1933,0.6201399999999999
1934,0.61448
1935,0.6037
1936,0.59548
1937,0.59292
1938,0.59035
1939,0.58267
1940,0.57498
1941,0.5673
1942,0.55705
1943,0.54937
1944,0.54115
1945,0.5309
1946,0.52322
1947,0.51554
1948,0.5078600000000001
1949,0.49762
1950,0.48995
1951,0.48227
1952,0.47203
1953,0.46436000000000005
1954,0.45613000000000004
1955,0.45046
1956,0.44571000000000005
1957,0.44005
1958,0.43237
1959,0.42468999999999996
1960,0.41445
1961,0.40676999999999996
1962,0.39909
1963,0.38886
1964,0.38118
1965,0.37351
1966,0.36528
1967,0.35505
1968,0.34736999999999996
1969,0.3397
1970,0.32947
1971,0.3218
1972,0.31413
1973,0.30703
1974,0.2968
1975,0.28914
1976,0.28091
1977,0.27069
1978,0.26302
1979,0.25536
1980,0.2477
1981,0.23748000000000002
1982,0.22981999999999997
1983,0.22216
1984,0.21986999999999998
1985,0.21561999999999998
1986,0.20795
1987,0.20027999999999999
1988,0.19005999999999998
1989,0.1824
1990,0.17415999999999998
1991,0.16395
1992,0.15628
1993,0.14862
1994,0.14096
1995,0.13471
1996,0.13045
1997,0.12677
1998,0.1191
1999,0.10887000000000001
2000,0.10121000000000001
2001,0.092974
2002,0.082753
2003,0.07509
2004,0.066856
2005,0.058624
2006,0.048404
2007,0.047271
2008,0.040471
2009,0.030243
2010,0.022576
2011,0.014908000000000001
2012,0.0072423999999999995
2013,-0.0029785999999999997
2014,-0.011212999999999999
2015,-0.018876
2016,-0.029094
2017,-0.036757
2018,-0.044418
2019,-0.05207899999999999
2020,-0.06229199999999999
2021,-0.06995
2022,-0.077606
2023,-0.087813
2024,-0.09546900000000001
2025,-0.10312
2026,-0.11077000000000001
2027,-0.12097000000000001
2028,-0.12862
2029,-0.13627
2030,-0.14587
2031,-0.15350999999999998
2032,-0.16116
2033,-0.1688
2034,-0.17899
2035,-0.18663
2036,-0.19427
2037,-0.19243
2038,-0.19249000000000002
2039,-0.20012
2040,-0.20774
2041,-0.2179
2042,-0.22551999999999997
2043,-0.23314000000000001
2044,-0.24076
2045,-0.25090999999999997
2046,-0.25851999999999997
2047,-0.26614
2048,-0.27628
2049,-0.28389000000000003
2050,-0.2915
2051,-0.29911
2052,-0.30859000000000003
2053,-0.31619
2054,-0.32379
2055,-0.33392
2056,-0.34152
2057,-0.34911
2058,-0.35670999999999997
2059,-0.36683000000000004
2060,-0.37121
2061,-0.37171
2062,-0.37217
2063,-0.37975
2064,-0.38661999999999996
2065,-0.39419
2066,-0.40428000000000003
2067,-0.40468000000000004
2068,-0.40505
2069,-0.41439
2070,-0.42121000000000003
2071,-0.41975
2072,-0.42003999999999997
2073,-0.42357
2074,-0.43109
2075,-0.43861999999999995
2076,-0.44538
2077,-0.4554
2078,-0.4531
2079,-0.45328
2080,-0.4625
2081,-0.4692
2082,-0.47668999999999995
2083,-0.48417
2084,-0.48836
2085,-0.48845
2086,-0.48851000000000006
2087,-0.49846
2088,-0.50592
2089,-0.51255
2090,-0.5150399999999999
2091,-0.5150399999999999
2092,-0.5150399999999999
2093,-0.5133800000000001
2094,-0.51088
2095,-0.51088
2096,-0.51088
2097,-0.51088
2098,-0.5026
2099,-0.49516000000000004
2100,-0.48772
2101,-0.47944
2102,-0.47693
2103,-0.47192
2104,-0.46448999999999996
2105,-0.45458000000000004
2106,-0.44714
2107,-0.43971000000000005
2108,-0.42895
2109,-0.42151000000000005
2110,-0.41406000000000004
2111,-0.40660999999999997
2112,-0.39668000000000003
2113,-0.39254
2114,-0.38756999999999997
2115,-0.38093
2116,-0.37101
2117,-0.36357
2118,-0.35529
2119,-0.34536999999999995
2120,-0.33792
2121,-0.33047
2122,-0.3255
2123,-0.31968
2124,-0.31224
2125,-0.3048
2126,-0.29488000000000003
2127,-0.28743
2128,-0.27915999999999996
2129,-0.27171
2130,-0.26177
2131,-0.25681
2132,-0.2543
2133,-0.24355
2134,-0.23526999999999998
2135,-0.22783
2136,-0.22039
2137,-0.21128000000000002
2138,-0.20876999999999998
2139,-0.20212
2140,-0.19221
2141,-0.18478
2142,-0.17734
2143,-0.16906
2144,-0.15914
2145,-0.15169000000000002
2146,-0.14754
2147,-0.14171
2148,-0.13343
2149,-0.126
2150,-0.11772
2151,-0.10780999999999999
2152,-0.10449000000000001
2153,-0.099486
2154,-0.09199
2155,-0.082086
2156,-0.074656
2157,-0.067223
2158,-0.056468
2159,-0.049033
2160,-0.041594
2161,-0.034152999999999996
2162,-0.024231
2163,-0.016784999999999998
2164,-0.014284999999999999
2165,-0.008445600000000001
2166,-0.0010096
2167,0.006423399999999999
2168,0.013861000000000002
2169,0.024618
2170,0.032059
2171,0.0395
2172,0.049427
2173,0.051927
2174,0.056923
2175,0.06272
2176,0.072635
2177,0.080073
2178,0.088349
2179,0.098271
2180,0.10570999999999998
2181,0.11316
2182,0.11814000000000001
2183,0.12397999999999999
2184,0.12893
2185,0.13637
2186,0.14629
2187,0.15456
2188,0.162
2189,0.16945
2190,0.17937
2191,0.18435
2192,0.18935
2193,0.19514
2194,0.20506
2195,0.2125
2196,0.22077
2197,0.22905
2198,0.23405
2199,0.23906
2200,0.24649000000000001
2201,0.2564
2202,0.26468
2203,0.27211
2204,0.28203
2205,0.28947
2206,0.29278000000000004
2207,0.29778000000000004
2208,0.3028
2209,0.31106999999999996
2210,0.3185
2211,0.32352
2212,0.32855999999999996
2213,0.33436
2214,0.34178000000000003
2215,0.35253
2216,0.35995
2217,0.36738000000000004
2218,0.37079
2219,0.37585
2220,0.38326
2221,0.39154
2222,0.39659
2223,0.40166
2224,0.40747
2225,0.41822
2226,0.42241999999999996
2227,0.42505
2228,0.4277
2229,0.43371000000000004
2230,0.43638000000000005
2231,0.44466000000000006
2232,0.45203999999999994
2233,0.45808000000000004
2234,0.46325
2235,0.46597
2236,0.46962
2237,0.47544
2238,0.48371000000000003
2239,0.48953
2240,0.49322
2241,0.496
2242,0.4988
2243,0.50255
2244,0.50539
2245,0.5082399999999999
2246,0.5111
2247,0.51495
2248,0.51785
2249,0.52077
2250,0.52469
2251,0.52764
2252,0.52037
2253,0.5140899999999999
2254,0.51566
2255,0.51867
2256,0.51928
2257,0.5233399999999999
2258,0.51713
2259,0.5109199999999999
2260,0.51057
2261,0.5123
2262,0.50854
2263,0.50133
2264,0.49518
2265,0.48558999999999997
2266,0.47839
2267,0.48156000000000004
2268,0.48102
2269,0.47384
2270,0.46668000000000004
2271,0.45951000000000003
2272,0.44996
2273,0.44281000000000004
2274,0.43565
2275,0.42612
2276,0.41897
2277,0.41291000000000005
2278,0.40468000000000004
2279,0.39516999999999997
2280,0.38804
2281,0.3809
2282,0.3714
2283,0.36428
2284,0.35716
2285,0.34894000000000003
2286,0.34325
2287,0.33758
2288,0.33045
2289,0.32095999999999997
2290,0.31384
2291,0.30672
2292,0.29961
2293,0.28902
2294,0.28191
2295,0.27481
2296,0.26535
2297,0.26298
2298,0.26061
2299,0.25825
2300,0.24879
2301,0.24643
2302,0.24170999999999998
2303,0.23463
2304,0.22519
2305,0.21811
2306,0.21104
2307,0.20162
2308,0.19455999999999998
2309,0.1875
2310,0.18045
2311,0.17104
2312,0.16399999999999998
2313,0.15696
2314,0.14758
2315,0.14054
2316,0.13352
2317,0.12649000000000002
2318,0.11713
2319,0.11012000000000001
2320,0.10311
2321,0.093764
2322,0.086765
2323,0.07976699999999999
2324,0.072776
2325,0.063459
2326,0.056476
2327,0.049498
2328,0.040201
2329,0.033231000000000004
2330,0.026269
2331,0.01931
2332,0.01004
2333,0.0018714000000000003
2334,-0.0028816
2335,-0.010051000000000001
2336,-0.017013
2337,-0.023969
2338,-0.030920999999999997
2339,-0.040181
2340,-0.047125
2341,-0.054060000000000004
2342,-0.062221000000000005
2343,-0.07146
2344,-0.07838300000000001
2345,-0.084235
2346,-0.091475
2347,-0.096243
2348,-0.10318
2349,-0.1101
2350,-0.12057000000000001
2351,-0.12749000000000002
2352,-0.13441
2353,-0.14362
2354,-0.14947
2355,-0.1555
2356,-0.16152
2357,-0.17074
2358,-0.1789
2359,-0.18581
2360,-0.19521
2361,-0.20123
2362,-0.20601
2363,-0.21293
2364,-0.22215
2365,-0.22905999999999999
2366,-0.23596
2367,-0.2464
2368,-0.2533
2369,-0.26018
2370,-0.26395
2371,-0.27355
2372,-0.28045
2373,-0.28735
2374,-0.29779
2375,-0.30467
2376,-0.30949
2377,-0.31554
2378,-0.32494
2379,-0.33184
2380,-0.33873000000000003
2381,-0.34561
2382,-0.35605
2383,-0.36291999999999996
2384,-0.36979
2385,-0.37588
2386,-0.38195999999999997
2387,-0.38781
2388,-0.39469
2389,-0.40385
2390,-0.41072
2391,-0.41885
2392,-0.42799
2393,-0.43483999999999995
2394,-0.43968999999999997
2395,-0.4458
2396,-0.4552
2397,-0.46206
2398,-0.46892
2399,-0.47933000000000003
2400,-0.48617
2401,-0.49301000000000006
2402,-0.49983999999999995
2403,-0.50727
2404,-0.5134
2405,-0.52025
2406,-0.52936
2407,-0.5361899999999999
2408,-0.5443100000000001
2409,-0.55114
2410,-0.5602199999999999
2411,-0.56834
2412,-0.5745100000000001
2413,-0.58067
2414,-0.5875
2415,-0.59431
2416,-0.60112
2417,-0.61019
2418,-0.6169899999999999
2419,-0.6237699999999999
2420,-0.6318699999999999
2421,-0.6409100000000001
2422,-0.64768
2423,-0.6544399999999999
2424,-0.6634399999999999
2425,-0.66928
2426,-0.6755399999999999
2427,-0.68178
2428,-0.6908
2429,-0.69755
2430,-0.7043
2431,-0.71463
2432,-0.72136
2433,-0.72809
2434,-0.73528
2435,-0.7429100000000001
2436,-0.74874
2437,-0.75548
2438,-0.76445
2439,-0.7711600000000001
2440,-0.77923
2441,-0.78594
2442,-0.79487
2443,-0.79984
2444,-0.80616
2445,-0.81335
2446,-0.82006
2447,-0.8281200000000001
2448,-0.8348200000000001
2449,-0.8437399999999999
2450,-0.85008
2451,-0.8541799999999999
2452,-0.86224
2453,-0.8689399999999999
2454,-0.8756299999999999
2455,-0.88369
2456,-0.89259
2457,-0.89925
2458,-0.90591
2459,-0.91091
2460,-0.91866
2461,-0.9244899999999999
2462,-0.93116
2463,-0.94004
2464,-0.9480799999999999
2465,-0.9547200000000001
2466,-0.96136
2467,-0.97019
2468,-0.97883
2469,-0.9830200000000001
2470,-0.9932700000000001
2471,-0.9999
2472,-1.0065
2473,-1.0131
2474,-1.0234
2475,-1.03
2476,-1.0365
2477,-1.0453
2478,-1.0519
2479,-1.0569
2480,-1.0612
2481,-1.0685
2482,-1.075
2483,-1.083
2484,-1.0918
2485,-1.0983
2486,-1.1049
2487,-1.1114
2488,-1.1194
2489,-1.1259
2490,-1.1325
2491,-1.1412
2492,-1.1477
2493,-1.1542
2494,-1.1622
2495,-1.1708
2496,-1.1773
2497,-1.181
2498,-1.1875
2499,-1.1985
2500,-1.2049
2501,-1.2114
2502,-1.2215
2503,-1.228
2504,-1.2344
2505,-1.2409
2506,-1.2481
2507,-1.2548
2508,-1.2599
2509,-1.2685
2510,-1.2765
2511,-1.2829
2512,-1.2893
2513,-1.296
2514,-1.3026
2515,-1.3105
2516,-1.3191
2517,-1.3255
2518,-1.3334
2519,-1.3398
2520,-1.3483
2521,-1.3525
2522,-1.3592
2523,-1.3696
2524,-1.376
2525,-1.3823
2526,-1.3902
2527,-1.3987
2528,-1.4039
2529,-1.4106
2530,-1.42
2531,-1.4264
2532,-1.4343
2533,-1.4406
2534,-1.4484
2535,-1.4531
2536,-1.4599
2537,-1.4662
2538,-1.4762
2539,-1.4808
2540,-1.4876
2541,-1.4955
2542,-1.5018
2543,-1.5097
2544,-1.516
2545,-1.5238
2546,-1.5306
2547,-1.5353
2548,-1.5437
2549,-1.5516
2550,-1.5562
2551,-1.5630000000000002
2552,-1.5709
2553,-1.5788
2554,-1.584
2555,-1.5923
2556,-1.598
2557,-1.6059
2558,-1.6117
2559,-1.62
2560,-1.6273
2561,-1.6352
2562,-1.6440000000000001
2563,-1.6507
2564,-1.6580000000000001
2565,-1.6644
2566,-1.6733
2567,-1.6799
2568,-1.6836
2569,-1.6921
2570,-1.7
2571,-1.7064
2572,-1.7127
2573,-1.7211
2574,-1.7274
2575,-1.7311
2576,-1.7379
2577,-1.7489
2578,-1.7552
2579,-1.7615
2580,-1.7698
2581,-1.7761
2582,-1.7823
2583,-1.7885
2584,-1.7984
2585,-1.8045
2586,-1.8107
2587,-1.8188
2588,-1.8249
2589,-1.8319
2590,-1.8389
2591,-1.8487
2592,-1.8548
2593,-1.8608
2594,-1.8689
2595,-1.8749
2596,-1.8809
2597,-1.8868
2598,-1.8947
2599,-1.9006
2600,-1.9065
2601,-1.9143
2602,-1.9219
2603,-1.9277
2604,-1.9334
2605,-1.9411
2606,-1.9468
2607,-1.9525
2608,-1.96
2609,-1.9674
2610,-1.9711
2611,-1.9784
2612,-1.9859
2613,-1.9915
2614,-1.9969999999999999
2615,-2.0026
2616,-2.0118
2617,-2.0172
2618,-2.0226
2619,-2.0298
2620,-2.0352
2621,-2.0405
2622,-2.0457
2623,-2.0527
2624,-2.0579
2625,-2.063
2626,-2.0698
2627,-2.0748
2628,-2.0798
2629,-2.0847
2630,-2.0913
2631,-2.0961
2632,-2.1009
2633,-2.1072
2634,-2.1119
2635,-2.1165
2636,-2.1211
2637,-2.1271
2638,-2.1316
2639,-2.136
2640,-2.1418
2641,-2.1461
2642,-2.1503
2643,-2.1545
2644,-2.16
2645,-2.164
2646,-2.168
2647,-2.1732
2648,-2.177
2649,-2.1808
2650,-2.1845
2651,-2.1857
2652,-2.1857
2653,-2.1893
2654,-2.194
2655,-2.1998
2656,-2.2034
2657,-2.2092
2658,-2.2138
2659,-2.2149
2660,-2.2137
2661,-2.2124
2662,-2.2143
2663,-2.2175
2664,-2.2229
2665,-2.2274
2666,-2.2308
2667,-2.2318
2668,-2.2347
2669,-2.2359999999999998
2670,-2.2345
2671,-2.233
2672,-2.2347
2673,-2.2374
2674,-2.2374
2675,-2.2407
2676,-2.249
2677,-2.2539
2678,-2.258
2679,-2.2587
2680,-2.2603
2681,-2.2625
2682,-2.2646
2683,-2.2673
2684,-2.2692
2685,-2.2736
2686,-2.2759
2687,-2.2775
2688,-2.2791
2689,-2.2805
2690,-2.2823
2691,-2.2835
2692,-2.2846
2693,-2.2857
2694,-2.2869
2695,-2.2877
2696,-2.2884
2697,-2.2866
2698,-2.2871
2699,-2.2875
2700,-2.2878
2701,-2.2880000000000003
2702,-2.2880000000000003
2703,-2.2880000000000003
2704,-2.2906
2705,-2.2906
2706,-2.2906
2707,-2.2906
2708,-2.2906
