time,value
0,0.2734
1,0.18039000000000002
2,0.29377
3,0.34917
4,0.56477
5,0.36961
6,0.34013000000000004
7,0.35917
8,0.32182
9,0.34779
10,0.31755
11,0.28808
12,0.2618
13,0.24094000000000002
14,0.20307999999999998
15,0.24247
16,0.22937
17,0.33066
18,0.30798000000000003
19,0.32576
20,0.35052
21,0.3877
22,0.41695
23,0.38974000000000003
24,0.2817
25,0.32939
26,0.27596
27,0.038022
28,-0.021509
29,-0.28828000000000004
30,-0.26068
31,-0.35877
32,-0.63457
33,-0.87013
34,-1.1287
35,-1.4891
36,-1.6246
37,-1.6043
38,-1.8699
39,-2.1891
40,-2.5117
41,-3.1010000000000004
42,-3.1814
43,-3.4153
44,-3.1962
45,-2.8134
46,-2.4911
47,-2.3956
48,-2.0597
49,-1.5205
50,-1.0087
51,-0.50144
52,-0.41886
53,-0.02206
54,0.2166
55,0.43032
56,-0.13913
57,-0.027569
58,0.3546
59,0.27134
60,0.063762
61,0.41412
62,0.90681
63,0.77452
64,0.52456
65,0.80892
66,0.55496
67,-0.71958
68,-0.9232299999999999
69,-1.9334
70,-5.3878
71,-2.5031
72,-0.9600200000000001
73,-0.60225
74,0.37496999999999997
75,2.2011
76,1.7044
77,0.62355
78,0.48499
79,-1.0755
80,-2.6281
81,-4.7663
82,-2.5747
83,-0.78047
84,-2.295
85,-1.4003
86,0.19852
87,1.21
88,0.7659
89,0.7763
90,0.091448
91,-0.8688899999999999
92,0.043245
93,-5.3406
94,-2.0478
95,1.4674
96,-0.51981
97,0.36202
98,-0.3175
99,-0.080089
100,-0.5065
101,-0.41763999999999996
102,-0.47772
103,-0.45579
104,-0.50364
105,-1.1134
106,-1.3263
107,-1.3834
108,-1.4312
109,-1.4828
110,-1.4902
111,-1.4927
112,-1.168
113,-1.2461
114,-1.0623
115,-0.88028
116,-0.80781
117,-0.78723
118,-0.71391
119,-0.65253
120,-0.67532
121,-0.69133
122,-0.69172
123,-0.46231000000000005
124,-0.1976
125,0.14107999999999998
126,0.07181599999999999
127,0.30216
128,0.73688
129,0.85134
130,0.60252
131,0.29933000000000004
132,0.49861000000000005
133,0.8840399999999999
134,1.0148
135,1.0823
136,0.8735799999999999
137,0.8096899999999999
138,0.6029
139,0.66897
140,0.61707
141,0.48128999999999994
142,0.28659
143,0.22288000000000002
144,0.28568000000000005
145,0.21706
146,0.27889
147,0.21758000000000002
148,0.13851
149,0.11374000000000001
150,0.13545
151,0.17231
152,0.028876
153,-0.015746
154,-0.01817
155,-0.023998
156,0.12969
157,0.23215999999999998
158,0.1427
159,0.16292
160,0.25215
161,0.19491
162,0.22315
163,0.21586999999999998
164,0.12616
165,0.22388000000000002
166,0.039876
167,0.16339
168,0.25651
169,0.26534
170,0.36367
171,0.30583
172,0.28431999999999996
173,0.29012
174,0.22866
175,0.21286999999999998
176,0.2755
177,0.27733
178,0.31284
179,0.1821
180,0.23468000000000003
181,0.16626
182,0.17669
183,0.28438
184,0.32825
185,0.36180999999999996
186,0.37837
187,0.44228999999999996
188,0.40376999999999996
189,0.52249
190,0.47908
191,0.43101999999999996
192,0.24819000000000002
193,0.42217
194,0.42016000000000003
195,0.5303100000000001
196,0.40854
197,0.42748
198,0.39771999999999996
199,0.28801
200,0.28239000000000003
201,0.5423100000000001
202,0.36433000000000004
203,0.40915999999999997
204,0.43638000000000005
205,0.5348
206,0.53691
207,0.6141300000000001
208,0.5803699999999999
209,0.61225
210,0.77176
211,0.64581
212,0.48167
213,0.48785
214,0.5507
215,0.80092
216,0.6513
217,0.63438
218,0.5435300000000001
219,0.56152
220,0.41757
221,0.38856
222,0.42878999999999995
223,0.42836
224,0.42826000000000003
225,0.41888000000000003
226,0.39855999999999997
227,0.38135
228,0.59729
229,0.7752399999999999
230,0.60125
231,0.6068600000000001
232,0.6227
233,0.64188
234,0.8136
235,0.8250299999999999
236,0.80515
237,0.77752
238,0.60213
239,0.60426
240,0.74128
241,0.9704799999999999
242,0.68701
243,0.26392
244,0.2651
245,0.2578
246,0.27058000000000004
247,0.26266
248,0.45293999999999995
249,0.6321100000000001
250,0.44766000000000006
251,0.44316000000000005
252,0.4529
253,0.45293
254,0.44282
255,0.4392
256,0.39955999999999997
257,0.46638
258,0.45721999999999996
259,0.60926
260,0.46003
261,0.46576999999999996
262,0.45471000000000006
263,0.45724
264,0.4563
265,0.5737300000000001
266,0.61495
267,0.5606800000000001
268,0.6342399999999999
269,0.63488
270,0.63262
271,0.63876
272,0.45161999999999997
273,0.45006
274,0.5587
275,0.5534100000000001
276,0.55302
277,0.55629
278,0.44283
279,0.42601000000000006
280,0.43654
281,0.55872
282,0.43311000000000005
283,0.42675
284,0.43337
285,0.43733999999999995
286,0.48363999999999996
287,0.43308
288,0.47361000000000003
289,0.41763999999999996
290,0.40188
291,0.39948
292,0.40339
293,0.41984
294,0.42635
295,0.42667
296,0.42002
297,0.42433999999999994
298,0.40505
299,0.59414
