time,value
0,-0.22815
1,-0.22815
2,-0.22815
3,-0.22815
4,-0.22815
5,-0.22815
6,-0.22815
7,-0.22815
8,-0.22815
9,-0.22815
10,-0.22815
11,-0.22815
12,-0.22815
13,-0.22815
14,-0.22815
15,-0.22815
16,-0.22815
17,-0.22815
18,-0.22815
19,-0.22815
20,-0.22815
21,-0.22815
22,-0.22815
23,-0.22815
24,-0.22815
25,-0.22815
26,-0.22815
27,-0.22815
28,-0.22815
29,-0.22815
30,-0.22815
31,-0.22815
32,-0.22815
33,-0.22815
34,-0.22815
35,-0.22815
36,-0.22815
37,-0.22815
38,-0.22815
39,-0.22815
40,-0.22815
41,-0.22815
42,-0.22815
43,-0.22815
44,3.8279
45,-0.22815
46,-0.22815
47,-0.22815
48,-0.22815
49,-0.22815
50,3.8279
51,-0.22815
52,-0.22815
53,5.937
54,-0.22815
55,-0.22815
56,-0.22815
57,-0.22815
58,-0.22815
59,-0.22815
60,-0.22815
61,-0.22815
62,-0.22815
63,-0.22815
64,-0.22815
65,-0.22815
66,-0.22815
67,-0.22815
68,-0.22815
69,-0.22815
70,-0.22815
71,-0.22815
72,3.6656
73,-0.22815
74,-0.22815
75,-0.22815
76,-0.22815
77,3.5034
78,-0.22815
79,-0.22815
80,-0.22815
81,-0.22815
82,-0.22815
83,-0.22815
84,-0.22815
85,-0.22815
86,-0.22815
87,-0.22815
88,-0.22815
89,-0.22815
90,-0.22815
91,-0.22815
92,-0.22815
93,-0.22815
94,-0.22815
95,-0.22815
