time,value
0,-0.22918000000000002
1,-0.22918000000000002
2,-0.22918000000000002
3,-0.22918000000000002
4,-0.22918000000000002
5,-0.22918000000000002
6,-0.22918000000000002
7,-0.22918000000000002
8,-0.22918000000000002
9,-0.22918000000000002
10,-0.22918000000000002
11,-0.22918000000000002
12,-0.22918000000000002
13,-0.22918000000000002
14,-0.22918000000000002
15,-0.22918000000000002
16,-0.22918000000000002
17,-0.22918000000000002
18,-0.22918000000000002
19,-0.22918000000000002
20,-0.22918000000000002
21,-0.22918000000000002
22,-0.22918000000000002
23,-0.22918000000000002
24,-0.22918000000000002
25,-0.22918000000000002
26,-0.22918000000000002
27,-0.22918000000000002
28,-0.22918000000000002
29,-0.22918000000000002
30,-0.22918000000000002
31,-0.22918000000000002
32,-0.22918000000000002
33,-0.22918000000000002
34,-0.22918000000000002
35,-0.22918000000000002
36,-0.22918000000000002
37,-0.22918000000000002
38,1.2111
39,4.34
40,0.78895
41,-0.22918000000000002
42,-0.22918000000000002
43,-0.22918000000000002
44,-0.22918000000000002
45,-0.22918000000000002
46,-0.22918000000000002
47,-0.22918000000000002
48,-0.22918000000000002
49,-0.22918000000000002
50,-0.22918000000000002
51,-0.22918000000000002
52,-0.22918000000000002
53,-0.22918000000000002
54,-0.22918000000000002
55,-0.22918000000000002
56,-0.22918000000000002
57,-0.22918000000000002
58,-0.22918000000000002
59,-0.22918000000000002
60,-0.22918000000000002
61,-0.22918000000000002
62,-0.22918000000000002
63,-0.22918000000000002
64,-0.22918000000000002
65,-0.22918000000000002
66,-0.22918000000000002
67,-0.22918000000000002
68,-0.22918000000000002
69,-0.22918000000000002
70,-0.22918000000000002
71,-0.22918000000000002
72,-0.22918000000000002
73,-0.22918000000000002
74,0.46612
75,6.4507
76,0.66478
77,-0.22918000000000002
78,-0.22918000000000002
79,-0.22918000000000002
80,-0.22918000000000002
81,-0.22918000000000002
82,-0.22918000000000002
83,-0.22918000000000002
84,-0.22918000000000002
85,-0.22918000000000002
86,-0.22918000000000002
87,5.1843
88,0.34196
89,0.49096000000000006
90,-0.22918000000000002
91,-0.22918000000000002
92,-0.22918000000000002
93,-0.22918000000000002
94,-0.22918000000000002
95,-0.22918000000000002
