time,value
0,-0.61806
1,-0.50329
2,-0.50329
3,-0.61806
4,-0.50329
5,-0.61806
6,-0.50329
7,-0.50329
8,-0.61806
9,-0.61806
10,-0.61806
11,-0.50329
12,-0.61806
13,-0.61806
14,-0.61806
15,-0.50329
16,-0.61806
17,-0.61806
18,-0.61806
19,-0.50329
20,-0.61806
21,-0.61806
22,-0.61806
23,-0.50329
24,-0.61806
25,-0.61806
26,-0.61806
27,-0.50329
28,-0.61806
29,-0.61806
30,-0.50329
31,-0.61806
32,-0.61806
33,-0.61806
34,-0.50329
35,-0.61806
36,-0.61806
37,-0.61806
38,-0.50329
39,-0.61806
40,-0.61806
41,-0.61806
42,1.5625
43,1.5625
44,2.0215
45,2.1363
46,-0.50329
47,-0.50329
48,-0.61806
49,-0.50329
50,1.6773
51,0.98866
52,-0.50329
53,-0.50329
54,-0.50329
55,-0.61806
56,-0.50329
57,-0.50329
58,-0.61806
59,0.75913
60,1.9068
61,2.0215
62,2.1363
63,1.9068
64,2.2511
65,2.0215
66,1.7919999999999998
67,1.9068
68,1.9068
69,1.9068
70,2.0215
71,1.9068
72,0.41483000000000003
73,-0.61806
74,-0.50329
75,-0.50329
76,-0.61806
77,-0.50329
78,0.41483000000000003
79,1.2182
80,-0.38853000000000004
81,-0.50329
82,-0.61806
83,-0.50329
84,-0.61806
85,-0.50329
86,-0.61806
87,0.64436
88,1.6773
89,1.4477
90,-0.50329
91,-0.61806
92,-0.50329
93,-0.61806
94,-0.50329
95,-0.61806
