[<text>
<title>blount inc &lt;blt&gt; 4th qtr net</title>
<dateline>    montgomery, ala., april 13 -
    </dateline>oper shr 16 cts vs three cts
    oper net 1,930,000 vs 391,000
    revs 313.9 mln vs 308.9 mln
    avg shrs 11.9 mln vs 12.0 mln
    year
    oper shr 60 cts vs 27 cts
    oper net 7,215,000 vs 3,340,000
    revs 1.23 billion vs 1.16 billion
    avg shrs 11.9 mln vs 12.0 mln
    note: prior year net excludes gains 4,896,000 dlrs in
quarter and 8,873,000 dlrs in year from termination of
overfunded pension plans.
    backlog 1.0 billion dlrs vs 942 mln dlrs.
 reuter
</text>]