time,value
0,-0.33144
1,-0.036827
2,-0.33144
3,-0.036827
4,-0.33144
5,-0.036827
6,-0.33144
7,-0.036827
8,-0.33144
9,-0.036827
10,-0.33144
11,-0.036827
12,-0.036827
13,-0.33144
14,-0.036827
15,-0.33144
16,-0.036827
17,-0.33144
18,-0.036827
19,-0.33144
20,-0.036827
21,-0.33144
22,-0.036827
23,-0.33144
24,-0.036827
25,-0.33144
26,-0.036827
27,-0.33144
28,-0.036827
29,-0.33144
30,-0.036827
31,-0.33144
32,-0.036827
33,-0.33144
34,-0.036827
35,-0.33144
36,-0.036827
37,-0.33144
38,-0.036827
39,-0.33144
40,-0.036827
41,-0.33144
42,-0.036827
43,-0.33144
44,-0.036827
45,-0.33144
46,-0.036827
47,-0.33144
48,-0.036827
49,-0.33144
50,-0.036827
51,-0.33144
52,-0.036827
53,-0.33144
54,-0.036827
55,-0.33144
56,-0.036827
57,-0.33144
58,-0.036827
59,-0.33144
60,-0.036827
61,-0.33144
62,-0.036827
63,-0.33144
64,-0.036827
65,-0.33144
66,-0.036827
67,-0.33144
68,-0.036827
69,-0.33144
70,-0.036827
71,-0.33144
72,-0.036827
73,-0.33144
74,-0.036827
75,-0.33144
76,-0.036827
77,-0.33144
78,-0.036827
79,-0.33144
80,-0.036827
81,-0.33144
82,-0.036827
83,-0.036827
84,-0.33144
85,-0.036827
86,-0.33144
87,-0.036827
88,0.5524
89,6.4447
90,6.4447
91,2.6147
92,-0.036827
93,-0.036827
94,-0.036827
95,-0.036827
