time,value
0,-0.20013
1,-0.19725
2,-0.17709
3,-0.21741
4,-0.19149000000000002
5,-0.17422
6,-0.21165
7,-0.17709
8,-0.19437000000000001
9,-0.19437000000000001
10,-0.16846
11,-0.20876999999999998
12,-0.17997
13,-0.17422
14,-0.20589000000000002
15,-0.17422
16,-0.19437000000000001
17,-0.20013
18,-0.17709
19,-0.21165
20,-0.17422
21,-0.17709
22,-0.20589000000000002
23,-0.17134000000000002
24,-0.19149000000000002
25,-0.20301
26,-0.17709
27,-0.20876999999999998
28,-0.17422
29,-0.18573
30,-0.20589000000000002
31,-0.17422
32,-0.19725
33,-0.19437000000000001
34,-0.18285
35,-0.19149000000000002
36,-0.16558
37,-0.19149000000000002
38,-0.20013
39,-0.15694
40,-0.19149000000000002
41,-0.17997
42,-0.18573
43,-0.20013
44,-0.15406
45,-0.20301
46,-0.17422
47,-0.16846
48,-0.19725
49,-0.16846
50,-0.19437000000000001
51,-0.17997
52,-0.1627
53,-0.20589000000000002
54,-0.17997
55,-0.18573
56,-0.18285
57,-0.17134000000000002
58,-0.20589000000000002
59,-0.17997
60,-0.18861
61,-0.20589000000000002
62,-0.17422
63,-0.19149000000000002
64,-0.19725
65,-0.18285
66,-0.20876999999999998
67,-0.17422
68,-0.19725
69,-0.20301
70,-0.15406
71,-0.20301
72,-0.18861
73,-0.18861
74,-0.20589000000000002
75,-0.16558
76,-0.20301
77,-0.18861
78,5.9075
79,5.6195
80,4.9918
81,0.62055
82,-0.1195
83,-0.15982000000000002
84,-0.19725
85,-0.15406
86,-0.19149000000000002
87,-0.19725
88,-0.15406
89,-0.19149000000000002
90,-0.19149000000000002
91,-0.16558
92,-0.20876999999999998
93,-0.17997
94,-0.16846
95,-0.20876999999999998
