time,value
0,-0.28135
1,-0.28135
2,-0.28135
3,-0.28135
4,-0.28135
5,-0.28135
6,-0.28135
7,-0.28135
8,-0.28135
9,-0.28135
10,-0.28135
11,-0.28135
12,-0.28135
13,-0.28135
14,-0.28135
15,-0.28135
16,-0.28135
17,-0.28135
18,-0.28135
19,-0.28135
20,-0.28135
21,-0.28135
22,-0.28135
23,-0.28135
24,-0.28135
25,-0.28135
26,-0.28135
27,-0.28135
28,-0.28135
29,-0.28135
30,-0.28135
31,-0.28135
32,5.3645
33,-0.28135
34,-0.28135
35,-0.28135
36,1.3447
37,3.8289
38,-0.28135
39,-0.28135
40,-0.28135
41,-0.28135
42,-0.28135
43,-0.28135
44,-0.28135
45,-0.28135
46,-0.28135
47,-0.28135
48,-0.28135
49,-0.28135
50,-0.28135
51,-0.28135
52,-0.28135
53,-0.28135
54,-0.28135
55,-0.28135
56,-0.28135
57,-0.10069
58,2.3383
59,-0.19102
60,-0.14585
61,-0.14585
62,-0.14585
63,4.5064
64,0.93816
65,-0.19102
66,1.6157
67,-0.10069
68,-0.14585
69,3.7385
70,-0.28135
71,-0.28135
72,-0.28135
73,-0.28135
74,-0.28135
75,-0.28135
76,-0.28135
77,-0.28135
78,-0.28135
79,-0.28135
80,-0.28135
81,-0.28135
82,-0.28135
83,-0.28135
84,-0.28135
85,-0.28135
86,-0.28135
87,-0.28135
88,-0.28135
89,-0.28135
90,-0.28135
91,-0.28135
92,-0.28135
93,-0.28135
94,-0.28135
95,-0.28135
