time,value
0,-0.16393
1,-0.16393
2,-0.16393
3,-0.16393
4,-0.16393
5,-0.16393
6,-0.16393
7,-0.16393
8,-0.16393
9,-0.16393
10,-0.16393
11,-0.16393
12,-0.16393
13,-0.16393
14,-0.16393
15,-0.16393
16,-0.16393
17,-0.16393
18,-0.16393
19,-0.16393
20,-0.16393
21,-0.16393
22,-0.16393
23,-0.16393
24,-0.16393
25,-0.16393
26,-0.16393
27,-0.16393
28,-0.16393
29,-0.16393
30,-0.16393
31,-0.16393
32,-0.16393
33,-0.16393
34,-0.16393
35,-0.16393
36,-0.16393
37,-0.16393
38,-0.16393
39,-0.16393
40,-0.16393
41,-0.16393
42,-0.16393
43,-0.16393
44,-0.16393
45,-0.16393
46,-0.16393
47,-0.16393
48,-0.16393
49,-0.16393
50,-0.16393
51,-0.16393
52,-0.16393
53,-0.16393
54,-0.16393
55,-0.16393
56,-0.16393
57,-0.16393
58,-0.16393
59,-0.16393
60,-0.16393
61,-0.16393
62,-0.16393
63,-0.16393
64,-0.16393
65,-0.16393
66,-0.16393
67,-0.16393
68,7.9587
69,-0.16393
70,-0.16393
71,-0.16393
72,-0.16393
73,-0.16393
74,2.5013
75,-0.16393
76,-0.16393
77,-0.16393
78,-0.16393
79,-0.16393
80,-0.16393
81,-0.16393
82,-0.16393
83,-0.16393
84,-0.16393
85,-0.16393
86,-0.16393
87,-0.16393
88,4.7858
89,-0.16393
90,-0.16393
91,-0.16393
92,-0.16393
93,-0.16393
94,-0.16393
95,-0.16393
