time,value
0,-0.25167
1,-0.25167
2,-0.25167
3,-0.25167
4,-0.25167
5,-0.25167
6,-0.25167
7,-0.25167
8,-0.25167
9,-0.25167
10,-0.25167
11,-0.25167
12,-0.25167
13,-0.25167
14,-0.25167
15,-0.25167
16,-0.25167
17,-0.25167
18,-0.25167
19,-0.25167
20,-0.25167
21,-0.25167
22,-0.25167
23,-0.25167
24,-0.25167
25,0.9900200000000001
26,2.6506
27,6.4954
28,2.2317
29,0.12233
30,0.09241100000000001
31,0.13729
32,-0.05719199999999999
33,-0.25167
34,-0.25167
35,-0.25167
36,-0.25167
37,5.0293
38,3.0097
39,0.28689000000000003
40,0.15225
41,-0.25167
42,-0.25167
43,-0.25167
44,-0.25167
45,-0.25167
46,-0.25167
47,-0.25167
48,-0.25167
49,-0.25167
50,-0.25167
51,-0.25167
52,-0.25167
53,-0.25167
54,-0.25167
55,-0.25167
56,-0.25167
57,-0.25167
58,-0.25167
59,-0.25167
60,-0.25167
61,-0.25167
62,-0.25167
63,-0.25167
64,-0.25167
65,-0.25167
66,-0.25167
67,-0.25167
68,-0.25167
69,-0.25167
70,-0.25167
71,-0.25167
72,-0.25167
73,-0.25167
74,-0.25167
75,-0.25167
76,-0.25167
77,-0.25167
78,-0.25167
79,-0.25167
80,-0.25167
81,-0.25167
82,-0.25167
83,-0.25167
84,-0.25167
85,-0.25167
86,-0.25167
87,-0.25167
88,-0.25167
89,-0.25167
90,-0.25167
91,-0.25167
92,-0.25167
93,-0.25167
94,-0.25167
95,-0.25167
