time,value
0,-0.3139
1,-0.3139
2,-0.3139
3,-0.3139
4,-0.3139
5,-0.3139
6,-0.3139
7,-0.3139
8,-0.3139
9,-0.3139
10,-0.3139
11,-0.3139
12,0.17477
13,-0.3139
14,-0.3139
15,-0.3139
16,-0.3139
17,-0.3139
18,-0.3139
19,-0.3139
20,0.011877
21,-0.3139
22,-0.3139
23,-0.3139
24,-0.3139
25,-0.3139
26,-0.3139
27,-0.3139
28,-0.3139
29,-0.3139
30,-0.3139
31,-0.3139
32,-0.3139
33,-0.3139
34,-0.3139
35,-0.3139
36,-0.3139
37,-0.3139
38,-0.3139
39,-0.3139
40,0.17477
41,-0.3139
42,-0.3139
43,-0.3139
44,-0.3139
45,-0.3139
46,-0.3139
47,-0.3139
48,-0.3139
49,-0.3139
50,-0.3139
51,-0.3139
52,-0.3139
53,-0.3139
54,-0.3139
55,0.011877
56,-0.3139
57,-0.3139
58,-0.3139
59,-0.3139
60,-0.3139
61,-0.3139
62,-0.3139
63,-0.3139
64,-0.3139
65,-0.3139
66,-0.3139
67,-0.3139
68,-0.3139
69,-0.3139
70,-0.3139
71,-0.3139
72,-0.3139
73,-0.3139
74,-0.3139
75,-0.3139
76,-0.3139
77,-0.3139
78,-0.3139
79,-0.3139
80,-0.3139
81,-0.3139
82,-0.3139
83,-0.3139
84,0.33765
85,3.2696
86,3.5954
87,3.5954
88,3.4325
89,3.5954
90,3.4325
91,3.5954
92,0.82632
93,-0.3139
94,-0.3139
95,-0.3139
