time,value
0,-0.21014000000000002
1,-0.21014000000000002
2,-0.21014000000000002
3,-0.21014000000000002
4,-0.21014000000000002
5,-0.21014000000000002
6,-0.21014000000000002
7,-0.21014000000000002
8,-0.21014000000000002
9,-0.21014000000000002
10,-0.21014000000000002
11,-0.21014000000000002
12,-0.21014000000000002
13,-0.21014000000000002
14,-0.21014000000000002
15,-0.21014000000000002
16,-0.21014000000000002
17,-0.21014000000000002
18,-0.21014000000000002
19,-0.21014000000000002
20,-0.21014000000000002
21,-0.21014000000000002
22,-0.21014000000000002
23,-0.21014000000000002
24,-0.21014000000000002
25,-0.21014000000000002
26,-0.21014000000000002
27,-0.21014000000000002
28,-0.21014000000000002
29,-0.21014000000000002
30,-0.21014000000000002
31,-0.21014000000000002
32,-0.21014000000000002
33,-0.21014000000000002
34,-0.11145999999999999
35,4.1882
36,3.4411
37,4.3715
38,0.029516000000000004
39,0.015419
40,0.0013216
41,6.5284
42,-0.18194000000000002
43,-0.21014000000000002
44,-0.21014000000000002
45,-0.21014000000000002
46,-0.21014000000000002
47,-0.21014000000000002
48,-0.21014000000000002
49,-0.21014000000000002
50,-0.21014000000000002
51,-0.21014000000000002
52,-0.21014000000000002
53,-0.21014000000000002
54,-0.21014000000000002
55,-0.21014000000000002
56,-0.21014000000000002
57,-0.21014000000000002
58,-0.21014000000000002
59,-0.21014000000000002
60,-0.21014000000000002
61,-0.21014000000000002
62,-0.21014000000000002
63,-0.21014000000000002
64,-0.21014000000000002
65,-0.21014000000000002
66,-0.21014000000000002
67,-0.21014000000000002
68,-0.21014000000000002
69,-0.21014000000000002
70,-0.21014000000000002
71,-0.21014000000000002
72,-0.21014000000000002
73,-0.21014000000000002
74,-0.21014000000000002
75,-0.21014000000000002
76,-0.21014000000000002
77,-0.21014000000000002
78,-0.21014000000000002
79,-0.21014000000000002
80,-0.21014000000000002
81,-0.21014000000000002
82,-0.21014000000000002
83,-0.21014000000000002
84,-0.21014000000000002
85,-0.21014000000000002
86,-0.21014000000000002
87,-0.21014000000000002
88,-0.21014000000000002
89,-0.21014000000000002
90,-0.21014000000000002
91,-0.21014000000000002
92,-0.21014000000000002
93,-0.21014000000000002
94,-0.21014000000000002
95,-0.21014000000000002
