time,value
0,0.56361
1,1.012
2,-0.18372
3,-1.4542
4,0.56361
5,1.0867
6,-0.25845
7,-1.4542
8,0.71308
9,1.012
10,-0.78158
11,-1.4542
12,1.0867
13,1.012
14,-0.78158
15,-1.4542
16,1.1615
17,1.012
18,-1.1552
19,-1.0805
20,1.1615
21,0.56361
22,-1.4542
23,-0.33318000000000003
24,1.012
25,0.11520999999999999
26,-1.4542
27,0.33941
28,0.93727
29,-1.1552
30,-0.93105
31,1.0867
32,0.11520999999999999
33,-1.4542
34,0.26468
35,1.012
36,-0.55738
37,-1.4542
38,1.012
39,0.93727
40,-0.48265
41,-1.4542
42,0.93727
43,1.012
44,-0.25845
45,-1.4542
46,0.48888000000000004
47,1.012
48,-0.33318000000000003
49,-1.4542
50,0.56361
51,1.012
52,-0.18372
53,-1.4542
54,0.48888000000000004
55,1.012
56,0.63834
57,-1.4542
58,-0.18372
59,1.0867
60,1.012
61,-1.3047
62,-1.0058
63,1.1615
64,1.012
65,-0.40792
66,-1.4542
67,0.63834
68,1.012
69,0.56361
70,-1.4542
71,-0.33318000000000003
72,1.0867
73,0.93727
74,-1.0805
75,-1.0058
76,1.0867
77,1.012
78,-0.48265
79,-1.4542
80,0.86254
81,1.012
82,0.04048
83,-1.4542
84,0.33941
85,1.0867
86,0.41413999999999995
87,-1.4542
88,-0.034253
89,1.0867
90,1.012
91,-1.4542
92,-0.70685
93,1.0867
94,1.012
95,-0.85631
