time,value
0,-0.32889
1,-0.36219
2,-0.4288
3,-0.095752
4,0.30391
5,0.0041632
6,-0.029142
7,-0.12905999999999998
8,-0.36219
9,-0.32889
10,0.070774
11,-0.26228
12,-0.46211
13,-0.32889
14,-0.36219
15,-0.26228
16,0.40383
17,0.2373
18,-0.095752
19,-0.4288
20,-0.32889
21,-0.36219
22,-0.26228
23,0.070774
24,-0.32889
25,-0.46211
26,-0.26228
27,0.070774
28,-0.062447
29,0.40383
30,-0.095752
31,-0.4288
32,-0.32889
33,-0.36219
34,-0.4288
35,-0.22896999999999998
36,3.1349
37,0.2373
38,-0.095752
39,-0.12905999999999998
40,-0.062447
41,-0.26228
42,0.17069
43,7.6311
44,1.5695
45,-0.3955
46,-0.46211
47,-0.26228
48,0.50374
49,0.070774
50,-0.16236
51,-0.3955
52,-0.4288
53,-0.36219
54,0.0041632
55,-0.36219
56,-0.46211
57,-0.32889
58,0.0041632
59,0.10407999999999999
60,3.8343
61,-0.062447
62,-0.49541
63,-0.3955
64,-0.46211
65,-0.29558
66,-0.095752
67,1.1365
68,-0.12905999999999998
69,-0.095752
70,-0.16236
71,-0.16236
72,-0.29558
73,-0.3955
74,-0.4288
75,-0.49541
76,-0.029142
77,0.43713
78,-0.062447
79,-0.32889
80,-0.36219
81,-0.49541
82,-0.22896999999999998
83,0.037468
84,-0.4288
85,-0.36219
86,0.0041632
87,-0.029142
88,0.0041632
89,-0.062447
90,-0.36219
91,-0.4288
92,-0.4288
93,-0.3955
94,-0.29558
95,0.20399
