time,value
0,-1.8644
1,-1.7862
2,-1.6503
3,-1.4623
4,-1.2332
5,-0.96275
6,-0.66219
7,-0.33407
8,0.0066852000000000005
9,0.34215999999999996
10,0.66494
11,0.9535399999999999
12,1.2027
13,1.3992
14,1.5334
15,1.611
16,1.63
17,1.6097
18,1.565
19,1.5133
20,1.473
21,1.4429
22,1.4247
23,1.4101
24,1.3966
25,1.3923
26,1.4029
27,1.4436
28,1.5219
29,1.6441
30,1.8121
31,2.0175
32,2.2485
33,2.4781
34,2.6821
35,2.8346
36,2.9188
37,2.9323
38,2.8702
39,2.7461
40,2.5695
41,2.3601
42,2.1449
43,1.9352
44,1.7462
45,1.5692
46,1.393
47,1.21
48,1.0058
49,0.78915
50,0.56311
51,0.34157
52,0.14128
53,-0.037982
54,-0.18573
55,-0.31015
56,-0.41166
57,-0.48735
58,-0.54827
59,-0.58636
60,-0.61402
61,-0.63069
62,-0.63374
63,-0.6341899999999999
64,-0.62105
65,-0.60516
66,-0.58302
67,-0.55089
68,-0.51637
69,-0.47023000000000004
70,-0.42227
71,-0.37084
72,-0.31587
73,-0.26355
74,-0.20567
75,-0.14514000000000002
76,-0.07315
77,0.016402
78,0.12220999999999999
79,0.24679
80,0.38045999999999996
81,0.51986
82,0.6601199999999999
83,0.7943600000000001
84,0.92005
85,1.0264
86,1.1075
87,1.1558
88,1.1652
89,1.1374
90,1.0729
91,0.9827899999999999
92,0.8766
93,0.76288
94,0.65089
95,0.53788
96,0.42591999999999997
97,0.31119
98,0.19187
99,0.073586
100,-0.04622
101,-0.15917
102,-0.26552
103,-0.36519
104,-0.45215
105,-0.53318
106,-0.59973
107,-0.65593
108,-0.7044600000000001
109,-0.74271
110,-0.78159
111,-0.80965
112,-0.8276
113,-0.8282200000000001
114,-0.80097
115,-0.75168
116,-0.67304
117,-0.57949
118,-0.48141999999999996
119,-0.38389
120,-0.29374
121,-0.19619
122,-0.08910499999999999
123,0.031452
124,0.16613
125,0.31004
126,0.47089
127,0.64239
128,0.8145100000000001
129,0.9693299999999999
130,1.0868
131,1.1653
132,1.2063
133,1.2215
134,1.2212
135,1.21
136,1.1962
137,1.1777
138,1.1531
139,1.1158
140,1.0571
141,0.9782299999999999
142,0.87875
143,0.76813
144,0.6532899999999999
145,0.5382
146,0.42891
147,0.32079
148,0.21703000000000003
149,0.11596
150,0.018219
151,-0.070418
152,-0.15377000000000002
153,-0.22546999999999998
154,-0.28891999999999995
155,-0.34347
156,-0.38437
157,-0.41571
158,-0.42828999999999995
159,-0.42798
160,-0.41818
161,-0.4015
162,-0.38885
163,-0.37356999999999996
164,-0.36183000000000004
165,-0.3546
166,-0.35293
167,-0.3639
168,-0.3764
169,-0.38881
170,-0.39403
171,-0.38933
172,-0.38319000000000003
173,-0.37501999999999996
174,-0.37495
175,-0.38563000000000003
176,-0.40689000000000003
177,-0.44042
178,-0.47371
179,-0.50153
180,-0.5150399999999999
181,-0.51103
182,-0.49715
183,-0.47558
184,-0.45583999999999997
185,-0.43877
186,-0.42436
187,-0.41634
188,-0.41186999999999996
189,-0.4148
190,-0.41983000000000004
191,-0.42255
192,-0.42175
193,-0.41266
194,-0.39886
195,-0.37625
196,-0.34391
197,-0.30375
198,-0.25651
199,-0.21175
200,-0.1714
201,-0.14022
202,-0.12132000000000001
203,-0.11275
204,-0.11717999999999999
205,-0.12855999999999998
206,-0.14614000000000002
207,-0.17018
208,-0.19910999999999998
209,-0.23585
210,-0.27363000000000004
211,-0.31151999999999996
212,-0.34926
213,-0.38684
214,-0.42937
215,-0.47148999999999996
216,-0.51337
217,-0.55411
218,-0.59362
219,-0.6366
220,-0.67616
221,-0.70982
222,-0.7328600000000001
223,-0.7447699999999999
224,-0.75449
225,-0.7633
226,-0.77633
227,-0.78998
228,-0.80091
229,-0.81313
230,-0.82583
231,-0.84419
232,-0.86325
233,-0.87718
234,-0.88589
235,-0.8891
236,-0.8953700000000001
237,-0.9050799999999999
238,-0.91619
239,-0.9245899999999999
240,-0.92394
241,-0.9144899999999999
242,-0.8940299999999999
243,-0.8664799999999999
244,-0.83836
245,-0.81629
246,-0.80714
247,-0.8076300000000001
248,-0.81339
249,-0.81965
250,-0.82509
251,-0.83416
252,-0.84705
253,-0.86526
254,-0.8882899999999999
255,-0.9173
256,-0.95824
257,-1.0142
258,-1.09
259,-1.1848
260,-1.2930000000000001
261,-1.4069
262,-1.5151
263,-1.6134
264,-1.7001
265,-1.7755
266,-1.8378
267,-1.8791
268,-1.8977
269,-1.8980000000000001
