time,value
0,0.085175
1,0.12065
2,0.10152
3,0.019032
4,-0.095593
5,-0.098663
6,0.016762
7,-0.073549
8,-0.20619
9,-0.11144000000000001
10,-0.10105
11,-0.085748
12,-0.10989000000000002
13,-0.11087999999999999
14,-0.12095999999999998
15,-0.087868
16,-0.12817
17,-0.09850700000000001
18,-0.016483
19,0.072711
20,0.099221
21,0.10254
22,0.043745
23,-0.037237
24,-0.049475
25,0.070948
26,0.17438
27,0.19238
28,0.15247
29,0.10107000000000001
30,0.11673
31,0.37592
32,0.5916600000000001
33,0.49838999999999994
34,0.62356
35,0.71477
36,0.40073000000000003
37,0.23697
38,0.51542
39,0.25385
40,-0.38487
41,-0.6565
42,-1.0638
43,-1.4551
44,-1.8553
45,-1.8903
46,-2.0022
47,-2.1026
48,-2.0883
49,-1.992
50,-1.9169999999999998
51,-1.8591
52,-1.7449
53,-2.0193
54,-1.7662
55,-1.5323
56,-1.4068
57,-1.1411
58,-1.1088
59,-1.0857
60,-0.95955
61,-1.0619
62,-0.97391
63,-0.90525
64,-0.79404
65,-0.65959
66,-0.46493999999999996
67,-0.37132
68,-0.17526
69,0.071681
70,0.3581
71,0.18219000000000002
72,0.38374
73,0.39781
74,0.55985
75,0.9108
76,1.1164
77,0.46246000000000004
78,0.72982
79,1.0555
80,1.8588
81,3.1507
82,2.3631
83,1.6541
84,1.4052
85,1.4158
86,1.6551
87,1.6784
88,0.9567200000000001
89,0.16933
90,0.27344
91,0.34368000000000004
92,-0.025162999999999998
93,0.077809
94,0.40678000000000003
95,0.77028
96,0.83401
97,0.87172
98,1.0014
99,1.0128
100,1.3264
101,2.1446
102,3.9876
103,1.9383
104,1.9368
105,1.8169
106,1.235
107,0.99469
108,1.0959999999999999
109,1.1573
110,0.7894100000000001
111,0.5918100000000001
112,0.7207899999999999
113,0.7763899999999999
114,0.78825
115,0.99924
116,1.2275
117,1.4715
118,2.4633
119,2.5332
120,1.1014
121,1.6823
122,2.8471
123,1.9359
124,1.6705
125,1.982
126,1.9275
127,1.4189
128,1.0234
129,1.4974
130,1.7629
131,1.0439
132,0.69867
133,0.5579
134,0.58827
135,0.46512
136,0.21201
137,0.1439
138,0.16822
139,0.027981
140,-0.42401000000000005
141,-0.5837
142,-1.0391
143,-1.2686
144,-1.2768
145,-1.3172
146,-1.4797
147,-1.5763
148,-1.8098
149,-1.8318
150,-1.8807
151,-2.2843
152,-2.2124
153,-2.5241
154,-2.4391
155,-2.5396
156,-2.6839
157,-2.8765
158,-2.7205
159,-2.3529
160,-2.4216
161,-2.1279
162,-1.5647
163,-1.2819999999999998
164,-1.5129
165,-0.65694
166,0.11954000000000001
167,-0.009068600000000001
168,-0.16889
169,0.3126
170,0.49383999999999995
171,0.30355
172,0.18658
173,0.12825999999999999
174,0.00094014
175,-0.15538
176,0.47095
177,1.3514
178,1.2885
179,0.40635
180,0.025053
181,0.059778
182,-0.21703000000000003
183,-0.27546
184,-0.084038
185,-0.11610999999999999
186,-0.16994
187,-0.10792
188,-0.03941
189,-0.0015948
190,-0.01365
191,-0.034469
192,-0.035884
193,-0.1605
194,-0.020845
195,-0.087863
196,-0.08503
197,-0.16642
198,-0.19982
199,-0.23922
200,-0.15500999999999998
201,0.065177
202,0.053694000000000006
203,0.16587000000000002
204,0.18205
205,-0.012701
206,-0.12453
207,-0.18585
208,-0.19923
209,-0.15903
210,0.068978
211,0.10720999999999999
212,0.11069000000000001
213,-0.086126
214,-0.15666
215,-0.12147999999999999
216,-0.062592
217,-0.09865
218,-0.14369
219,-0.14351
220,0.030611000000000003
221,-0.2216
222,0.042818
223,-0.057465999999999996
224,-0.023488
225,-0.070097
226,-0.12145999999999998
227,-0.078098
228,-0.07460399999999999
229,-0.019232
230,-0.022311
231,0.080166
232,0.085391
233,0.057873
234,0.019703000000000002
235,-0.012435
236,-0.025192
237,-0.011844
238,0.09035
239,0.1466
240,0.022116999999999998
241,0.05970399999999999
242,-0.07344099999999999
243,-0.032987
244,-0.030914999999999998
245,-0.024766
246,-0.029988
247,-0.033934
248,-0.032316000000000004
249,-0.036475
250,-0.034298
251,-0.14507
252,-0.13466
253,-0.030187000000000002
254,0.067966
255,0.074903
256,-0.035265
257,-0.11745
258,-0.028349
259,-0.032148
260,-0.028554000000000003
261,-0.024411000000000002
262,-0.1991
263,-0.028671
264,0.052400999999999996
265,0.074696
266,0.065116
267,0.07143300000000001
268,0.033723
269,-0.038281
270,-0.14639000000000002
271,-0.14656
272,-0.083008
273,0.018946
274,0.08511200000000001
275,0.084229
276,-0.034872
277,-0.036426
278,-0.041092000000000004
279,-0.049285
280,-0.15417999999999998
281,-0.11272
282,-0.046951
283,-0.050137
284,-0.046622000000000004
285,-0.044131000000000004
286,-0.047564999999999996
287,-0.04547
288,-0.048069
289,-0.14129
290,-0.062439
291,-0.083567
292,-0.062677
293,-0.053963
294,-0.050076999999999997
295,-0.16044
296,-0.16433
297,-0.057779
298,-0.061977
299,-0.062480999999999995
