time,value
0,-0.16716
1,-0.16716
2,-0.16716
3,-0.16716
4,-0.16716
5,-0.16716
6,-0.16716
7,-0.16716
8,-0.16716
9,-0.16716
10,-0.16716
11,-0.16716
12,-0.16716
13,-0.16716
14,-0.16716
15,-0.16716
16,-0.16716
17,-0.16716
18,-0.16716
19,-0.16716
20,-0.16716
21,-0.16716
22,-0.16716
23,-0.16716
24,-0.16716
25,-0.16716
26,-0.16716
27,-0.16716
28,-0.16716
29,-0.16716
30,-0.16716
31,-0.16716
32,-0.16716
33,-0.16716
34,-0.16716
35,-0.16716
36,-0.16716
37,-0.16716
38,-0.16716
39,-0.16716
40,-0.16716
41,-0.16716
42,-0.16716
43,-0.16716
44,-0.16716
45,-0.16716
46,-0.16716
47,-0.16716
48,-0.16716
49,-0.16716
50,-0.16716
51,-0.16716
52,-0.16716
53,-0.16716
54,-0.16716
55,-0.16716
56,3.5002
57,7.9726
58,4.0727
59,-0.16716
60,-0.16716
61,-0.16716
62,-0.16716
63,-0.16716
64,-0.16716
65,-0.16716
66,-0.16716
67,-0.16716
68,-0.16716
69,-0.16716
70,-0.16716
71,-0.16716
72,-0.16716
73,-0.16716
74,-0.16716
75,-0.16716
76,-0.16716
77,-0.16716
78,-0.16716
79,-0.16716
80,-0.16716
81,-0.16716
82,-0.16716
83,-0.16716
84,-0.16716
85,-0.16716
86,-0.16716
87,-0.16716
88,-0.16716
89,-0.16716
90,-0.16716
91,-0.16716
92,-0.16716
93,-0.16716
94,-0.16716
95,-0.16716
