time,value
0,-0.1615
1,-0.16608
2,-0.168
3,-0.17014
4,-0.17215
5,-0.17055
6,-0.16873
7,-0.16838
8,-0.16551
9,-0.16213
10,-0.15803
11,-0.15106
12,-0.14228
13,-0.1317
14,-0.12172999999999999
15,-0.11275999999999999
16,-0.10352
17,-0.097526
18,-0.092676
19,-0.089781
20,-0.08948099999999999
21,-0.092791
22,-0.10057
23,-0.10877
24,-0.11553
25,-0.11804
26,-0.11790999999999999
27,-0.1155
28,-0.11202000000000001
29,-0.10575
30,-0.096945
31,-0.087925
32,-0.07335499999999999
33,-0.058464999999999996
34,-0.043266000000000006
35,-0.023301
36,-0.0077413
37,0.0018715999999999997
38,0.0063098
39,0.006159899999999999
40,-0.0011223
41,-0.016968
42,-0.03702
43,-0.058330999999999994
44,-0.076862
45,-0.094761
46,-0.11273
47,-0.12905999999999998
48,-0.1423
49,-0.1529
50,-0.16352
51,-0.1709
52,-0.17363
53,-0.17638
54,-0.17653
55,-0.17277
56,-0.17003
57,-0.16563
58,-0.16115
59,-0.15798
60,-0.15350999999999998
61,-0.15093
62,-0.15342999999999998
63,-0.16087
64,-0.17188
65,-0.18861
66,-0.20704
67,-0.22052
68,-0.23073000000000002
69,-0.23888
70,-0.2433
71,-0.2419
72,-0.23705
73,-0.23251999999999998
74,-0.22543000000000002
75,-0.21781999999999999
76,-0.21325999999999998
77,-0.20748000000000003
78,-0.20123
79,-0.19657
80,-0.19328
81,-0.19086
82,-0.18872
83,-0.18791
84,-0.18762
85,-0.18574000000000002
86,-0.18409
87,-0.18561
88,-0.1924
89,-0.20388
90,-0.21504
91,-0.2262
92,-0.23956
93,-0.2511
94,-0.25809
95,-0.26253000000000004
96,-0.2653
97,-0.26565
98,-0.2647
99,-0.26474000000000003
100,-0.26571
101,-0.26645
102,-0.26666
103,-0.26450999999999997
104,-0.26079
105,-0.25799
106,-0.25469
107,-0.25151999999999997
108,-0.24864
109,-0.24297
110,-0.23664000000000002
111,-0.23103
112,-0.22512
113,-0.21925
114,-0.21322
115,-0.20706999999999998
116,-0.20074
117,-0.1944
118,-0.18865
119,-0.18177000000000001
120,-0.17585
121,-0.17252
122,-0.17053
123,-0.17056
124,-0.17197
125,-0.17439000000000002
126,-0.17797000000000002
127,-0.18258
128,-0.1871
129,-0.19158
130,-0.19555
131,-0.19991
132,-0.20513
133,-0.20855
134,-0.20897
135,-0.20994000000000002
136,-0.21293
137,-0.21513000000000002
138,-0.21834
139,-0.22227
140,-0.22416
141,-0.22501999999999997
142,-0.22380999999999998
143,-0.2236
144,-0.2244
145,-0.22316
146,-0.22086
147,-0.21918
148,-0.21781
149,-0.21525999999999998
150,-0.21095
151,-0.20523000000000002
152,-0.19743
153,-0.18811
154,-0.17953
155,-0.17114000000000001
156,-0.16293
157,-0.15721
158,-0.15504
159,-0.15497
160,-0.15996
161,-0.16885999999999998
162,-0.17808
163,-0.19071
164,-0.20540999999999998
165,-0.21781999999999999
166,-0.2298
167,-0.24113
168,-0.24891999999999997
169,-0.25475
170,-0.25902
171,-0.26069000000000003
172,-0.26048000000000004
173,-0.2601
174,-0.26419000000000004
175,-0.26624000000000003
176,-0.26632
177,-0.2688
178,-0.27051
179,-0.27221
180,-0.27305
181,-0.27375
182,-0.27355
183,-0.27186
184,-0.26677
185,-0.26247
186,-0.26116
187,-0.25256
188,-0.24453000000000003
189,-0.24539
190,-0.24438000000000001
191,-0.23789000000000002
192,-0.22939
193,-0.21238
194,-0.18924000000000002
195,-0.16714
196,-0.14064000000000002
197,-0.10939000000000002
198,-0.078328
199,-0.048023
200,-0.017211
201,0.010952
202,0.02661
203,0.035212
204,0.033468
205,0.016296
206,0.004164
207,-0.012639
208,-0.038461
209,-0.054951
210,-0.069529
211,-0.08444700000000001
212,-0.093735
213,-0.099107
214,-0.10307000000000001
215,-0.12571
216,-0.13952
217,-0.14645999999999998
218,-0.16441
219,-0.17175
220,-0.1841
221,-0.19989
222,-0.20115
223,-0.19108
224,-0.18644000000000002
225,-0.18111
226,-0.16665
227,-0.15619
228,-0.14607
229,-0.13468
230,-0.12747
231,-0.11515999999999998
232,-0.09942899999999999
233,-0.084189
234,-0.083739
235,-0.10887000000000001
236,-0.11231
237,-0.10709
238,-0.10904000000000001
239,-0.12502
240,-0.13217
241,-0.13649
242,-0.14985
243,-0.18975
244,-0.20715999999999998
245,-0.22576
246,-0.23023000000000002
247,-0.23125
248,-0.23176
249,-0.22158000000000003
250,-0.20748000000000003
251,-0.19205999999999998
252,-0.17964000000000002
253,-0.15696
254,-0.12666
255,-0.10084
256,-0.078026
257,-0.049066000000000005
258,-0.013755000000000002
259,0.028002999999999997
260,0.068234
261,0.10711
262,0.15883
263,0.21229
264,0.26737
265,0.31358
266,0.3556
267,0.39311
268,0.42706000000000005
269,0.46967
270,0.52268
271,0.57394
272,0.62983
273,0.68997
274,0.73651
275,0.7996800000000001
276,0.8579700000000001
277,0.9018
278,0.9414399999999999
279,1.0144
280,1.0663
281,1.115
282,1.1397
283,1.1345
284,1.1273
285,1.0956
286,1.0669
287,1.035
288,0.94705
289,0.95816
290,0.94865
291,0.93163
292,0.9334600000000001
293,0.9232100000000001
294,0.92224
295,0.94265
296,0.9482799999999999
297,0.95196
298,0.9736100000000001
299,0.99992
300,1.0249
301,1.0553
302,1.0875
303,1.1258
304,1.1694
305,1.2182
306,1.2694
307,1.3296
308,1.3940000000000001
309,1.4661
310,1.5427
311,1.6311
312,1.7284
313,1.8459
314,1.9609
315,2.0956
316,2.2152
317,2.3303
318,2.4874
319,2.6294
320,2.739
321,2.8621
322,2.9822
323,3.0818
324,3.1806
325,3.2529
326,3.2581
327,3.2064
328,3.283
329,3.3506
330,3.3243
331,3.3028
332,3.2231
333,3.0673
334,3.0156
335,2.9668
336,2.6937
337,2.6166
338,2.6115
339,2.5098
340,2.3819999999999997
341,2.2316
342,2.0697
343,1.9746
344,1.8356
345,1.6637
346,1.5345
347,1.4411
348,1.268
349,1.1705
350,1.0527
351,0.94183
352,0.81112
353,0.63305
354,0.56967
355,0.45741000000000004
356,0.34752
357,0.26419000000000004
358,0.16498
359,0.032429
360,-0.021199000000000003
361,-0.15100999999999998
362,-0.20590999999999998
363,-0.26579
364,-0.35044000000000003
365,-0.40286
366,-0.46138999999999997
367,-0.50926
368,-0.5615399999999999
369,-0.6085699999999999
370,-0.6639
371,-0.70027
372,-0.72354
373,-0.7539100000000001
374,-0.7749199999999999
375,-0.78977
376,-0.81263
377,-0.8344
378,-0.8564700000000001
379,-0.88659
380,-0.8960299999999999
381,-0.9236700000000001
382,-0.94995
383,-0.9747299999999999
384,-1.0032
385,-1.0302
386,-1.0626
387,-1.0968
388,-1.1296
389,-1.1486
390,-1.1766
391,-1.1993
392,-1.2156
393,-1.2388
394,-1.2537
395,-1.2645
396,-1.2779
397,-1.2859
398,-1.3009
399,-1.314
400,-1.3216
401,-1.3289
402,-1.3362
403,-1.3446
404,-1.35
405,-1.3579
406,-1.3637
407,-1.368
408,-1.3746
409,-1.3838
410,-1.3879
411,-1.3924
412,-1.3971
413,-1.4032
414,-1.4083
415,-1.412
416,-1.4158
417,-1.4199
418,-1.4243
419,-1.4284
420,-1.4306
421,-1.4333
422,-1.4365
423,-1.4399
424,-1.4418
425,-1.4447
426,-1.4488
427,-1.4489
428,-1.4529
429,-1.4565
430,-1.4580000000000002
431,-1.4606
432,-1.4627
433,-1.465
434,-1.4658
435,-1.4681
436,-1.4706
437,-1.4711
438,-1.4724
439,-1.4726
440,-1.4734
441,-1.4747
442,-1.4754
443,-1.4771
444,-1.4792
445,-1.4805
446,-1.4807
447,-1.4809999999999999
