time,value
0,-2.2057
1,-2.2057
2,-2.2084
3,-2.2084
4,-2.214
5,-2.2224
6,-2.228
7,-2.228
8,-2.228
9,-2.228
10,-2.2279
11,-2.2278
12,-2.2275
13,-2.2271
14,-2.2267
15,-2.2288
16,-2.2281
17,-2.2248
18,-2.2267
19,-2.2257
20,-2.2246
21,-2.2234
22,-2.2221
23,-2.2206
24,-2.2196
25,-2.218
26,-2.2163
27,-2.2145
28,-2.2192
29,-2.2267
30,-2.2321
31,-2.2301
32,-2.2279
33,-2.2257
34,-2.2233
35,-2.2208
36,-2.2183
37,-2.2165
38,-2.2138
39,-2.2136
40,-2.2106
41,-2.2076
42,-2.2045
43,-2.2012
44,-2.1991
45,-2.1957
46,-2.1922
47,-2.1986
48,-2.205
49,-2.2038
50,-2.2013
51,-2.1974
52,-2.1935
53,-2.1895
54,-2.1854
55,-2.1813
56,-2.177
57,-2.1741
58,-2.1698
59,-2.1653
60,-2.1608
61,-2.1562
62,-2.1516
63,-2.1469
64,-2.1437
65,-2.1388
66,-2.1339
67,-2.129
68,-2.124
69,-2.1189
70,-2.1155
71,-2.1103
72,-2.1072
73,-2.1019
74,-2.0965
75,-2.0911
76,-2.0856
77,-2.082
78,-2.0764
79,-2.0708
80,-2.0651
81,-2.0594
82,-2.0537
83,-2.0498
84,-2.044
85,-2.046
86,-2.048
87,-2.046
88,-2.04
89,-2.0340000000000003
90,-2.03
91,-2.0239
92,-2.0197
93,-2.0154
94,-2.011
95,-2.0089
96,-2.0089
97,-2.0047
98,-1.9984
99,-1.9921
100,-1.9899
101,-1.9878
102,-1.9814
103,-1.9771
104,-1.9707
105,-1.9642
106,-1.9577
107,-1.9511
108,-1.9446
109,-1.9396
110,-1.9352
111,-1.9286
112,-1.9219
113,-1.9151
114,-1.9084
115,-1.9016
116,-1.8948
117,-1.8903
118,-1.8889
119,-1.8914
120,-1.8922
121,-1.8852
122,-1.8783
123,-1.8736
124,-1.8666
125,-1.8596
126,-1.8525
127,-1.8455
128,-1.8384
129,-1.8327
130,-1.828
131,-1.8208
132,-1.8137
133,-1.8065
134,-1.7993
135,-1.7921
136,-1.7848
137,-1.78
138,-1.7727
139,-1.7655
140,-1.7582
141,-1.7509
142,-1.7435
143,-1.7387
144,-1.7313
145,-1.7239
146,-1.7166
147,-1.7092
148,-1.7067
149,-1.7042
150,-1.7042
151,-1.6993
152,-1.6919
153,-1.6894
154,-1.6894
155,-1.682
156,-1.6733
157,-1.6708
158,-1.6645
159,-1.6606
160,-1.6519
161,-1.6445
162,-1.6358
163,-1.6308
164,-1.6234
165,-1.6184
166,-1.6121
167,-1.6058
168,-1.5971
169,-1.5897
170,-1.5847
171,-1.5773
172,-1.5698
173,-1.5624
174,-1.5549
175,-1.5461
176,-1.5412
177,-1.5336
178,-1.5261
179,-1.5186
180,-1.5099
181,-1.5062
182,-1.5
183,-1.495
184,-1.4875
185,-1.4788
186,-1.4713
187,-1.4637
188,-1.4588
189,-1.4526
190,-1.4514
191,-1.4426
192,-1.4351
193,-1.4276
194,-1.4189
195,-1.4101
196,-1.4077
197,-1.4015
198,-1.3928
199,-1.3853
200,-1.3778
201,-1.369
202,-1.3615
203,-1.3565
204,-1.3489
205,-1.3414
206,-1.3353
207,-1.3316
208,-1.3254
209,-1.3179
210,-1.3128
211,-1.3053
212,-1.2966
213,-1.2890000000000001
214,-1.2814
215,-1.2739
216,-1.2690000000000001
217,-1.2629
218,-1.258
219,-1.2504
220,-1.2429
221,-1.2353
222,-1.2265
223,-1.2215
224,-1.2139
225,-1.2063
226,-1.2001
227,-1.1966
228,-1.1905
229,-1.1829
230,-1.1779
231,-1.1703
232,-1.1627
233,-1.1540000000000001
234,-1.1464
235,-1.1388
236,-1.1337
237,-1.13
238,-1.124
239,-1.1191
240,-1.1104
241,-1.1028
242,-1.0952
243,-1.0901
244,-1.0825
245,-1.0749
246,-1.0673
247,-1.0585
248,-1.0509
249,-1.0458
250,-1.0381
251,-1.0305
252,-1.0229
253,-1.0181
254,-1.0121
255,-1.0073
256,-1.0022
257,-0.99456
258,-0.98692
259,-0.9792700000000001
260,-0.97049
261,-0.9628399999999999
262,-0.9551799999999999
263,-0.9500700000000001
264,-0.9424
265,-0.93473
266,-0.9273899999999999
267,-0.9215
268,-0.9141600000000001
269,-0.90905
270,-0.9013899999999999
271,-0.8937200000000001
272,-0.8860399999999999
273,-0.87836
274,-0.87067
275,-0.8618899999999999
276,-0.8567600000000001
277,-0.84906
278,-0.84136
279,-0.83365
280,-0.82594
281,-0.81822
282,-0.8105
283,-0.80535
284,-0.79656
285,-0.79335
286,-0.78497
287,-0.7772600000000001
288,-0.76955
289,-0.7644
290,-0.75667
291,-0.74788
292,-0.74015
293,-0.73242
294,-0.72468
295,-0.7169300000000001
296,-0.71177
297,-0.70555
298,-0.69981
299,-0.69405
300,-0.6863199999999999
301,-0.6785800000000001
302,-0.67084
303,-0.66463
304,-0.65688
305,-0.64913
306,-0.6413800000000001
307,-0.63412
308,-0.62839
309,-0.6237
310,-0.61854
311,-0.6108
312,-0.60305
313,-0.5953
314,-0.5865
315,-0.5787399999999999
316,-0.57357
317,-0.56581
318,-0.56115
319,-0.55801
320,-0.55333
321,-0.5455800000000001
322,-0.53783
323,-0.53266
324,-0.52491
325,-0.51715
326,-0.50938
327,-0.50161
328,-0.49383999999999995
329,-0.48866000000000004
330,-0.48088000000000003
331,-0.47207
332,-0.46429
333,-0.4565
334,-0.44871000000000005
335,-0.44091
336,-0.43571000000000004
337,-0.42791
338,-0.4201
339,-0.41229
340,-0.40929
341,-0.40367
342,-0.40005999999999997
343,-0.39227
344,-0.38447
345,-0.37667
346,-0.36787
347,-0.36006
348,-0.35225
349,-0.34704
350,-0.33984000000000003
351,-0.33424
352,-0.32961999999999997
353,-0.32082
354,-0.31201
355,-0.30638000000000004
356,-0.30175
357,-0.29814
358,-0.29035
359,-0.28155
360,-0.27376
361,-0.26597
362,-0.26236
363,-0.25671
364,-0.25364000000000003
365,-0.24586999999999998
366,-0.23809
367,-0.2303
368,-0.2215
369,-0.21631
370,-0.21370999999999998
371,-0.20806
372,-0.20499
373,-0.19877999999999998
374,-0.18997
375,-0.18375999999999998
376,-0.17911
377,-0.17600000000000002
378,-0.16978
379,-0.16203
380,-0.15323
381,-0.14545999999999998
382,-0.14029
383,-0.13304000000000002
384,-0.12733
385,-0.12265999999999999
386,-0.11490999999999998
387,-0.10611
388,-0.098349
389,-0.093175
390,-0.08437599999999999
391,-0.081251
392,-0.07552400000000001
393,-0.067776
394,-0.058979
395,-0.054298
396,-0.049609
397,-0.043855
398,-0.036119
399,-0.028381
400,-0.020638999999999998
401,-0.012891999999999999
402,-0.0077264
403,0.0010686
404,0.0088216
405,0.016577
406,0.024335
407,0.032099
408,0.036763
409,0.041432
410,0.047156
411,0.054904999999999995
412,0.063704
413,0.066851
414,0.072599
415,0.076237
416,0.08503200000000001
417,0.093828
418,0.099593
419,0.1028
420,0.11159000000000001
421,0.11930999999999999
422,0.12403
423,0.12725
424,0.13307
425,0.13633
426,0.13962
427,0.1484
428,0.15609
429,0.16122
430,0.16891
431,0.1777
432,0.1854
433,0.19311
434,0.2019
435,0.20406
436,0.2099
437,0.21869
438,0.22639
439,0.23517
440,0.24286999999999997
441,0.25058
442,0.25166
443,0.25749
444,0.26224000000000003
445,0.27103
446,0.27871999999999997
447,0.28642
448,0.29521
449,0.30034
450,0.30509000000000003
451,0.30835999999999997
452,0.31312
453,0.32081
454,0.3285
455,0.33363000000000004
456,0.34131999999999996
457,0.34903
458,0.35673
459,0.36551999999999996
460,0.37322
461,0.38093
462,0.38608000000000003
463,0.39379000000000003
464,0.40151
465,0.40924
466,0.41696000000000005
467,0.42363
468,0.43136
469,0.43651999999999996
470,0.44426000000000004
471,0.452
472,0.45507
473,0.45193
474,0.45503000000000005
475,0.46021000000000006
476,0.46695
477,0.46748
478,0.46442
479,0.46137
480,0.45835
481,0.45533999999999997
482,0.45333999999999997
483,0.45036000000000004
484,0.4474
485,0.44446
486,0.44154
487,0.43863
488,0.43409
489,0.42886
490,0.42005
491,0.41455
492,0.40907
493,0.40192
494,0.39405999999999997
495,0.38787
496,0.38502
497,0.37695
498,0.36908
499,0.36025999999999997
500,0.35239000000000004
501,0.34453
502,0.33834000000000003
503,0.33288
504,0.33007
505,0.32219000000000003
506,0.31432
507,0.3055
508,0.30025
509,0.29238000000000003
510,0.28881999999999997
511,0.28338
512,0.27795
513,0.26914
514,0.26125
515,0.25939
516,0.25398000000000004
517,0.24950999999999998
518,0.24161999999999997
519,0.23373000000000002
520,0.22491
521,0.21702
522,0.21176
523,0.20899
524,0.2036
525,0.19479000000000002
526,0.18689
527,0.17899
528,0.17373
529,0.16584000000000002
530,0.15795
531,0.14914000000000002
532,0.14125
533,0.13335999999999998
534,0.12548
535,0.12022999999999999
536,0.11744
537,0.11202999999999999
538,0.10322
539,0.094402
540,0.089013
541,0.083641
542,0.080098
543,0.071283
544,0.063377
545,0.060654
546,0.05795499999999999
547,0.052636
548,0.05086
549,0.048215
550,0.042046
551,0.033231000000000004
552,0.026186
553,0.020926
554,0.016546
555,0.011244
556,0.0024286
557,-0.0019474
558,-0.007172399999999999
559,-0.014186
560,-0.02215
561,-0.030108999999999997
562,-0.03627
563,-0.044232
564,-0.050392
565,-0.055605999999999996
566,-0.060799
567,-0.068771
568,-0.07408300000000001
569,-0.082898
570,-0.090865
571,-0.09883
572,-0.10137
573,-0.10655
574,-0.11270999999999999
575,-0.11886
576,-0.12684
577,-0.12934
578,-0.13448
579,-0.14063
580,-0.14862
581,-0.15395
582,-0.16276
583,-0.17075
584,-0.1769
585,-0.17937
586,-0.18448
587,-0.19247999999999998
588,-0.19863
589,-0.20477
590,-0.20986999999999997
591,-0.21494000000000002
592,-0.22295
593,-0.23256
594,-0.23761999999999997
595,-0.24186
596,-0.24531999999999998
597,-0.25413
598,-0.26105
599,-0.26605
600,-0.27026999999999995
601,-0.27563000000000004
602,-0.28444
603,-0.28865
604,-0.29361
605,-0.2978
606,-0.3066
607,-0.30929
608,-0.31004
609,-0.31227
610,-0.31446999999999997
611,-0.31665
612,-0.31881
613,-0.32094
614,-0.32304
615,-0.32443
616,-0.32173
617,-0.31431
618,-0.31365
619,-0.31566
620,-0.31765
621,-0.31625
622,-0.31819000000000003
623,-0.31611999999999996
624,-0.30798000000000003
625,-0.30046999999999996
626,-0.29233000000000003
627,-0.28418000000000004
628,-0.27875
629,-0.28062
630,-0.27974
631,-0.27763000000000004
632,-0.26947
633,-0.2613
634,-0.25373
635,-0.24829
636,-0.24011999999999997
637,-0.23195
638,-0.22376999999999997
639,-0.2156
640,-0.20742
641,-0.20197
642,-0.19769
643,-0.19668
644,-0.19509
645,-0.18689
646,-0.1787
647,-0.17051
648,-0.16505
649,-0.15685
650,-0.14866
651,-0.14046
652,-0.13280999999999998
653,-0.12460999999999998
654,-0.11640999999999999
655,-0.1104
656,-0.10219
657,-0.09399099999999999
658,-0.085788
659,-0.077584
660,-0.069379
661,-0.063907
662,-0.0557
663,-0.051889
664,-0.047521
665,-0.043688
666,-0.035492
667,-0.027293
668,-0.021827000000000003
669,-0.013625
670,-0.0048774
671,0.0033205999999999995
672,0.011523
673,0.019724000000000002
674,0.025194
675,0.033398000000000004
676,0.039952
677,0.044331999999999996
678,0.048173
679,0.056366
680,0.064565
681,0.07058099999999999
682,0.07877999999999999
683,0.086975
684,0.091374
685,0.093064
686,0.099088
687,0.10728
688,0.11274
689,0.12093
690,0.12912
691,0.13731
692,0.14606
693,0.15425
694,0.15971
695,0.16791
696,0.1761
697,0.17939000000000002
698,0.18381
699,0.18824000000000002
700,0.19643
701,0.20188
702,0.21006999999999998
703,0.21883000000000002
704,0.22701999999999997
705,0.23521
706,0.24339
707,0.24941999999999998
708,0.25056
709,0.255
710,0.26104
711,0.26921999999999996
712,0.2774
713,0.28559
714,0.29162
715,0.2998
716,0.30798000000000003
717,0.31617
718,0.32004
719,0.32450999999999997
720,0.33054
721,0.33658000000000005
722,0.34475
723,0.35293
724,0.36111
725,0.36929
726,0.37746999999999997
727,0.38566
728,0.39111
729,0.3993
730,0.40805
731,0.41623999999999994
732,0.42441999999999996
733,0.43261000000000005
734,0.43806999999999996
735,0.44626000000000005
736,0.45443999999999996
737,0.45558000000000004
738,0.46003
739,0.46663999999999994
740,0.47481999999999996
741,0.48027
742,0.48846000000000006
743,0.49722
744,0.5054
745,0.51358
746,0.52177
747,0.52449
748,0.52722
749,0.53268
750,0.54087
751,0.54905
752,0.55235
753,0.55565
754,0.5562199999999999
755,0.56498
756,0.5737399999999999
757,0.5825
758,0.59068
759,0.59341
760,0.59614
761,0.59944
762,0.6076199999999999
763,0.6158100000000001
764,0.6239899999999999
765,0.63218
766,0.64037
767,0.64582
768,0.6540100000000001
769,0.6622
770,0.6703899999999999
771,0.6785800000000001
772,0.68677
773,0.69496
774,0.7004199999999999
775,0.70862
776,0.7168100000000001
777,0.72501
778,0.7332
779,0.7414
780,0.7496
781,0.7550600000000001
782,0.76326
783,0.7720100000000001
784,0.7802100000000001
785,0.78841
786,0.79661
787,0.80208
788,0.81028
789,0.81301
790,0.8157399999999999
791,0.81903
792,0.8277700000000001
793,0.83652
794,0.84199
795,0.8425299999999999
796,0.848
797,0.8562
798,0.85893
799,0.86167
800,0.8638600000000001
801,0.86879
802,0.87645
803,0.8841200000000001
804,0.88686
805,0.88686
806,0.89507
807,0.90054
808,0.90875
809,0.91696
810,0.92517
811,0.9333799999999999
812,0.9416
813,0.94981
814,0.95529
815,0.9635
816,0.96624
817,0.96898
818,0.97224
819,0.97824
820,0.98698
821,0.99298
822,0.99624
823,0.99951
824,1.0083
825,1.0137
826,1.0165
827,1.0165
828,1.0247
829,1.0329
830,1.0411
831,1.0493
832,1.0575
833,1.0657
834,1.0712
835,1.0794
836,1.0876
837,1.0959
838,1.1041
839,1.1123
840,1.1178
841,1.126
842,1.1282
843,1.131
844,1.1337
845,1.1419
846,1.1501
847,1.1556
848,1.1638
849,1.1666
850,1.1693
851,1.1726
852,1.1808
853,1.189
854,1.1945
855,1.2027
856,1.2109999999999999
857,1.2192
858,1.2274
859,1.2356
860,1.2411
861,1.2493
862,1.2576
863,1.2658
864,1.274
865,1.2823
866,1.2905
867,1.296
868,1.3042
869,1.3027
870,1.304
871,1.3113
872,1.3191
873,1.3204
874,1.3195
875,1.3181
876,1.3167
877,1.3154
878,1.314
879,1.3127
880,1.3118
881,1.3105
882,1.3092
883,1.308
884,1.3067
885,1.3055
886,1.3019
887,1.296
888,1.2877
889,1.2795
890,1.2708
891,1.2625
892,1.2613
893,1.2574
894,1.2542
895,1.2459
896,1.2376
897,1.2294
898,1.2211
899,1.2128
900,1.2073
901,1.199
902,1.1903
903,1.1821
904,1.1738
905,1.1655
906,1.1572
907,1.1517
908,1.1434
909,1.1352
910,1.1269
911,1.1186
912,1.1103
913,1.1048
914,1.1036
915,1.0997
916,1.091
917,1.0823
918,1.0788
919,1.0749
920,1.0741
921,1.0658
922,1.0575
923,1.0489
924,1.0406
925,1.0323
926,1.0312
927,1.0277
928,1.0218
929,1.0135
930,1.0052
931,0.9969
932,0.98861
933,0.9830899999999999
934,0.9744299999999999
935,0.96614
936,0.95785
937,0.95509
938,0.95509
939,0.9468
940,0.94127
941,0.94127
942,0.9385100000000001
943,0.93575
944,0.9274600000000001
945,0.91917
946,0.91089
947,0.90536
948,0.8967
949,0.88841
950,0.88013
951,0.87423
952,0.87034
953,0.8696
954,0.86095
955,0.8526600000000001
956,0.8443700000000001
957,0.8360799999999999
958,0.8277899999999999
959,0.8195
960,0.81397
961,0.8056800000000001
962,0.79702
963,0.78873
964,0.78045
965,0.7721600000000001
966,0.7638699999999999
967,0.75834
968,0.7500600000000001
969,0.7417699999999999
970,0.73826
971,0.73439
972,0.7309
973,0.72537
974,0.71708
975,0.70878
976,0.70013
977,0.69184
978,0.68355
979,0.6752600000000001
980,0.6693600000000001
981,0.66828
982,0.66445
983,0.6561600000000001
984,0.64786
985,0.63957
986,0.63403
987,0.62539
988,0.6170899999999999
989,0.6087899999999999
990,0.6005
991,0.59944
992,0.59564
993,0.59253
994,0.58423
995,0.57593
996,0.56763
997,0.55933
998,0.55103
999,0.54273
1000,0.5372
1001,0.52856
1002,0.5202600000000001
1003,0.5119600000000001
1004,0.50366
1005,0.49536
1006,0.48983000000000004
1007,0.48636999999999997
1008,0.48258999999999996
1009,0.47915
1010,0.47084
1011,0.46253999999999995
1012,0.4539
1013,0.44837
1014,0.44006000000000006
1015,0.43906999999999996
1016,0.43533
1017,0.4267
1018,0.41839
1019,0.41008999999999995
1020,0.40455
1021,0.39592
1022,0.38761
1023,0.3793
1024,0.37068
1025,0.36972
1026,0.36633000000000004
1027,0.36048
1028,0.35217
1029,0.34386
1030,0.33555
1031,0.32693
1032,0.31861
1033,0.31306999999999996
1034,0.30476
1035,0.29645
1036,0.28814
1037,0.27983
1038,0.27152
1039,0.26321
1040,0.25766999999999995
1041,0.2549
1042,0.2549
1043,0.24904
1044,0.24042
1045,0.2318
1046,0.22871999999999998
1047,0.22564
1048,0.22534
1049,0.21671999999999997
1050,0.21118
1051,0.20840999999999998
1052,0.20840999999999998
1053,0.20287
1054,0.19455
1055,0.18624000000000002
1056,0.17793
1057,0.16960999999999998
1058,0.1613
1059,0.15299000000000001
1060,0.14745
1061,0.13914
1062,0.13083
1063,0.12251
1064,0.1142
1065,0.10589000000000001
1066,0.10035
1067,0.092044
1068,0.083733
1069,0.07510800000000001
1070,0.066798
1071,0.058488
1072,0.05018
1073,0.044641
1074,0.036331
1075,0.032619999999999996
1076,0.028932
1077,0.023089
1078,0.014773
1079,0.0092306
1080,0.00091763
1081,-0.007397399999999999
1082,-0.01571
1083,-0.024327
1084,-0.032639999999999995
1085,-0.040952999999999996
1086,-0.046495
1087,-0.054808
1088,-0.05818400000000001
1089,-0.061844
1090,-0.06797
1091,-0.076575
1092,-0.076859
1093,-0.077419
1094,-0.078237
1095,-0.07903099999999999
1096,-0.079799
1097,-0.08054299999999999
1098,-0.081261
1099,-0.081726
1100,-0.081955
1101,-0.073844
1102,-0.068508
1103,-0.06637699999999999
1104,-0.06422
1105,-0.056079
1106,-0.050518
1107,-0.048324
1108,-0.046102
1109,-0.040719
1110,-0.032551
1111,-0.027335
1112,-0.025049000000000002
1113,-0.022585
1114,-0.014236000000000002
1115,-0.0058844
1116,0.0024656
1117,0.010661
1118,0.016081
1119,0.01857
1120,0.018152
1121,0.023587999999999998
1122,0.031943
1123,0.040295
1124,0.04865
1125,0.05700499999999999
1126,0.06244299999999999
1127,0.070798
1128,0.079153
1129,0.087508
1130,0.095863
1131,0.10409000000000002
1132,0.10385
1133,0.1064
1134,0.10897000000000001
1135,0.11732999999999999
1136,0.12568
1137,0.13404000000000002
1138,0.1424
1139,0.14797000000000002
1140,0.15632000000000001
1141,0.16468
1142,0.17304
1143,0.1814
1144,0.18975999999999998
1145,0.19810999999999998
1146,0.20368
1147,0.20926
1148,0.21204
1149,0.21483000000000002
1150,0.22318000000000002
1151,0.23154
1152,0.23722
1153,0.23731999999999998
1154,0.24022
1155,0.2459
1156,0.25437
1157,0.26284
1158,0.27132
1159,0.27689
1160,0.27967
1161,0.28524
1162,0.2936
1163,0.30196
1164,0.31031
1165,0.31867
1166,0.32424000000000003
1167,0.33259
1168,0.34095
1169,0.3493
1170,0.35778000000000004
1171,0.36613
1172,0.3717
1173,0.38006
1174,0.38841
1175,0.39676999999999996
1176,0.40513000000000005
1177,0.41348
1178,0.42183999999999994
1179,0.42741
1180,0.43322
1181,0.43637
1182,0.4422
1183,0.45056
1184,0.45891000000000004
1185,0.46726
1186,0.47283000000000003
1187,0.48118999999999995
1188,0.48967
1189,0.49801999999999996
1190,0.50638
1191,0.51473
1192,0.5203
1193,0.52335
1194,0.5261399999999999
1195,0.53171
1196,0.54006
1197,0.54855
1198,0.55704
1199,0.56275
1200,0.57124
1201,0.57417
1202,0.57696
1203,0.5825199999999999
1204,0.59073
1205,0.59059
1206,0.59338
1207,0.59602
1208,0.60437
1209,0.61273
1210,0.6183
1211,0.62122
1212,0.62136
1213,0.62985
1214,0.63542
1215,0.6382
1216,0.64099
1217,0.6493399999999999
1218,0.65769
1219,0.6632600000000001
1220,0.67161
1221,0.67997
1222,0.6883199999999999
1223,0.69667
1224,0.70502
1225,0.71338
1226,0.7189399999999999
1227,0.7273
1228,0.73565
1229,0.7441399999999999
1230,0.75249
1231,0.76071
1232,0.7662800000000001
1233,0.77477
1234,0.78298
1235,0.7913399999999999
1236,0.79969
1237,0.80818
1238,0.8164
1239,0.8219700000000001
1240,0.8303200000000001
1241,0.83867
1242,0.84703
1243,0.8553799999999999
1244,0.8637299999999999
1245,0.8693
1246,0.87765
1247,0.8860100000000001
1248,0.89436
1249,0.9027200000000001
1250,0.9112
1251,0.91956
1252,0.9251299999999999
1253,0.93348
1254,0.94183
1255,0.9501799999999999
1256,0.95854
1257,0.9668899999999999
1258,0.97525
1259,0.98082
1260,0.9891700000000001
1261,0.9975200000000001
1262,1.0059
1263,1.0142
1264,1.0226
1265,1.0282
1266,1.0365
1267,1.0449
1268,1.0532
1269,1.0616
1270,1.0699
1271,1.0783
1272,1.0839
1273,1.0922
1274,1.1006
1275,1.1089
1276,1.1173
1277,1.1256
1278,1.1340000000000001
1279,1.1395
1280,1.1479
1281,1.1563
1282,1.1646
1283,1.1702
1284,1.1734
1285,1.1736
1286,1.1795
1287,1.1878
1288,1.1962
1289,1.2045
1290,1.2129
1291,1.2212
1292,1.2268
1293,1.2351
1294,1.2435
1295,1.252
1296,1.2602
1297,1.2686
1298,1.2769
1299,1.2825
1300,1.2908
1301,1.2992
1302,1.3075
1303,1.3159
1304,1.3242
1305,1.3298
1306,1.3382
1307,1.3465
1308,1.3549
1309,1.3632
1310,1.3716
1311,1.3769999999999998
1312,1.3768
1313,1.3792
1314,1.3846
1315,1.393
1316,1.4013
1317,1.4097
1318,1.4153
1319,1.4236
1320,1.432
1321,1.4403
1322,1.4487
1323,1.4569999999999999
1324,1.4654
1325,1.4709999999999999
1326,1.4793
1327,1.4877
1328,1.4959
1329,1.5043
1330,1.5126
1331,1.521
1332,1.5266
1333,1.5349
1334,1.5433
1335,1.5516
1336,1.5541
1337,1.5566
1338,1.5619999999999998
1339,1.5703
1340,1.5758
1341,1.5755
1342,1.5752
1343,1.575
1344,1.5747
1345,1.5746
1346,1.5744
1347,1.5742
1348,1.574
1349,1.5738
1350,1.5737
1351,1.5736
1352,1.5735
1353,1.5734
1354,1.5733
1355,1.5649
1356,1.5566
1357,1.5537
1358,1.5537
1359,1.5536
1360,1.5508
1361,1.5508
1362,1.5452
1363,1.5369
1364,1.5313
1365,1.5285
1366,1.5286
1367,1.5202
1368,1.5119
1369,1.5091
1370,1.5064
1371,1.4981
1372,1.4925
1373,1.4842
1374,1.4758
1375,1.4675
1376,1.462
1377,1.4593
1378,1.4594
1379,1.4509999999999998
1380,1.4427
1381,1.4343
1382,1.4259
1383,1.4176
1384,1.4092
1385,1.4037
1386,1.3953
1387,1.3869
1388,1.3786
1389,1.3702
1390,1.3619
1391,1.3535
1392,1.3537
1393,1.351
1394,1.3455
1395,1.3372
1396,1.3288
1397,1.3204
1398,1.3149
1399,1.3065
1400,1.2981
1401,1.2898
1402,1.2814
1403,1.2731
1404,1.2647
1405,1.2591
1406,1.2508
1407,1.2424
1408,1.2341
1409,1.2257
1410,1.2174
1411,1.2118
1412,1.2034
1413,1.1951
1414,1.1867
1415,1.1784
1416,1.17
1417,1.1616
1418,1.1561
1419,1.1477
1420,1.1393
1421,1.131
1422,1.1284
1423,1.1258
1424,1.1231
1425,1.1176
1426,1.1092
1427,1.1008
1428,1.0925
1429,1.0841
1430,1.0758
1431,1.0703
1432,1.0619
1433,1.0536
1434,1.0452
1435,1.0426
1436,1.0401
1437,1.0375
1438,1.0319
1439,1.0235
1440,1.0152
1441,1.0068
1442,0.9984700000000001
1443,0.99011
1444,0.98185
1445,0.9762799999999999
1446,0.96793
1447,0.95957
1448,0.95121
1449,0.94285
1450,0.9345
1451,0.9319200000000001
1452,0.9294600000000001
1453,0.92412
1454,0.91576
1455,0.90741
1456,0.8990600000000001
1457,0.8907
1458,0.88513
1459,0.87677
1460,0.8684200000000001
1461,0.86018
1462,0.85183
1463,0.84335
1464,0.835
1465,0.8294299999999999
1466,0.8210700000000001
1467,0.81271
1468,0.8043600000000001
1469,0.7959999999999999
1470,0.78765
1471,0.78208
1472,0.77372
1473,0.76537
1474,0.7570100000000001
1475,0.74866
1476,0.7403
1477,0.73195
1478,0.72638
1479,0.71802
1480,0.70967
1481,0.70131
1482,0.69308
1483,0.6847300000000001
1484,0.67916
1485,0.67081
1486,0.66245
1487,0.6541
1488,0.64574
1489,0.63739
1490,0.62903
1491,0.62347
1492,0.6209399999999999
1493,0.61857
1494,0.61593
1495,0.6077199999999999
1496,0.59937
1497,0.59102
1498,0.58545
1499,0.5771
1500,0.56875
1501,0.5604
1502,0.55205
1503,0.5437
1504,0.53828
1505,0.52978
1506,0.52142
1507,0.51323
1508,0.5048699999999999
1509,0.49651999999999996
1510,0.48817
1511,0.48261000000000004
1512,0.47426
1513,0.46591000000000005
1514,0.45756
1515,0.44921000000000005
1516,0.44364
1517,0.44086000000000003
1518,0.43806999999999996
1519,0.42972
1520,0.42136999999999997
1521,0.41581
1522,0.41302
1523,0.40745
1524,0.40189
1525,0.39354
1526,0.38519000000000003
1527,0.37684
1528,0.36849
1529,0.36014
1530,0.35179
1531,0.34607
1532,0.33771999999999996
1533,0.32937
1534,0.32101999999999997
1535,0.31267
1536,0.30432
1537,0.29596999999999996
1538,0.2904
1539,0.28205
1540,0.28158
1541,0.27835
1542,0.27263000000000004
1543,0.26428
1544,0.25871
1545,0.25035999999999997
1546,0.24201
1547,0.23365999999999998
1548,0.22530999999999998
1549,0.21695
1550,0.20861
1551,0.20289000000000001
1552,0.19469
1553,0.18633
1554,0.17798
1555,0.16963
1556,0.16128
1557,0.15292999999999998
1558,0.14736
1559,0.13901
1560,0.13066
1561,0.12230999999999999
1562,0.11395999999999999
1563,0.1087
1564,0.10902
1565,0.10952
1566,0.10726
1567,0.10780999999999999
1568,0.10262
1569,0.094474
1570,0.089108
1571,0.08673
1572,0.087352
1573,0.079226
1574,0.071105
1575,0.06276699999999999
1576,0.054429
1577,0.04887
1578,0.046763
1579,0.044680000000000004
1580,0.04214
1581,0.04238
1582,0.042868
1583,0.043621
1584,0.044134
1585,0.044925
1586,0.045742000000000005
1587,0.045742000000000005
1588,0.046018
1589,0.049074
1590,0.0527
1591,0.053283000000000004
1592,0.059123
1593,0.067735
1594,0.07357799999999999
1595,0.07726
1596,0.078194
1597,0.083733
1598,0.092359
1599,0.098216
1600,0.09917999999999999
1601,0.10294
1602,0.10395
1603,0.10499000000000001
1604,0.10569
1605,0.11398
1606,0.12228
1607,0.13058
1608,0.13887
1609,0.14717
1610,0.15547
1611,0.161
1612,0.1693
1613,0.1776
1614,0.1859
1615,0.1942
1616,0.20249
1617,0.20803000000000002
1618,0.21633000000000002
1619,0.22463000000000002
1620,0.23293000000000003
1621,0.24156999999999998
1622,0.24953000000000003
1623,0.25816999999999996
1624,0.26371
1625,0.27201
1626,0.27997
1627,0.28826999999999997
1628,0.29658
1629,0.30488000000000004
1630,0.31318
1631,0.31872
1632,0.32703000000000004
1633,0.33533
1634,0.34054
1635,0.34265999999999996
1636,0.34265999999999996
1637,0.3482
1638,0.35651
1639,0.36482
1640,0.37313
1641,0.38143
1642,0.38974000000000003
1643,0.38974000000000003
1644,0.39283
1645,0.39901
1646,0.40731
1647,0.41562
1648,0.42425
1649,0.43256000000000006
1650,0.4381
1651,0.44641000000000003
1652,0.45471000000000006
1653,0.45748
1654,0.46025
1655,0.46302
1656,0.47133
1657,0.4741
1658,0.4741
1659,0.47718999999999995
1660,0.48582
1661,0.49444
1662,0.50308
1663,0.5113800000000001
1664,0.5169199999999999
1665,0.52523
1666,0.52523
1667,0.52864
1668,0.53451
1669,0.54281
1670,0.54835
1671,0.55666
1672,0.56496
1673,0.57327
1674,0.5819
1675,0.59021
1676,0.59851
1677,0.60405
1678,0.61235
1679,0.6151300000000001
1680,0.6178899999999999
1681,0.62066
1682,0.62929
1683,0.63238
1684,0.63548
1685,0.63858
1686,0.6472100000000001
1687,0.65585
1688,0.66171
1689,0.6644800000000001
1690,0.6644800000000001
1691,0.67002
1692,0.67832
1693,0.6866300000000001
1694,0.69493
1695,0.70323
1696,0.71154
1697,0.71708
1698,0.72538
1699,0.73401
1700,0.74232
1701,0.75062
1702,0.75893
1703,0.76723
1704,0.77277
1705,0.78108
1706,0.78938
1707,0.79557
1708,0.79933
1709,0.80277
1710,0.8083100000000001
1711,0.8166100000000001
1712,0.82491
1713,0.83321
1714,0.84152
1715,0.84982
1716,0.8581200000000001
1717,0.86366
1718,0.8719600000000001
1719,0.8802700000000001
1720,0.8885700000000001
1721,0.8972
1722,0.90551
1723,0.91381
1724,0.91935
1725,0.92765
1726,0.93596
1727,0.94426
1728,0.95257
1729,0.96088
1730,0.96641
1731,0.97472
1732,0.9830200000000001
1733,0.9913299999999999
1734,0.99964
1735,1.0079
1736,1.0163
1737,1.0166
1738,1.0203
1739,1.0241
1740,1.0324
1741,1.0407
1742,1.0490000000000002
1743,1.0545
1744,1.0628
1745,1.0711
1746,1.0794
1747,1.0881
1748,1.0964
1749,1.1047
1750,1.1102
1751,1.1185
1752,1.1268
1753,1.1351
1754,1.1434
1755,1.1517
1756,1.1601
1757,1.1656
1758,1.1739
1759,1.1822
1760,1.1905
1761,1.1988
1762,1.2071
1763,1.2127
1764,1.2185
1765,1.2219
1766,1.2229
1767,1.2267
1768,1.2277
1769,1.2288
1770,1.2343
1771,1.2426
1772,1.2509
1773,1.2592
1774,1.2675
1775,1.2758
1776,1.2841
1777,1.2896
1778,1.2979
1779,1.3066
1780,1.3149
1781,1.3232
1782,1.3315
1783,1.337
1784,1.338
1785,1.3418
1786,1.3505
1787,1.3591
1788,1.3626
1789,1.3664
1790,1.3672
1791,1.3755
1792,1.3838
1793,1.3924
1794,1.4007
1795,1.409
1796,1.4101
1797,1.4108
1798,1.412
1799,1.4131
1800,1.4143
1801,1.4155
1802,1.4166
1803,1.4174
1804,1.4187
1805,1.4199
1806,1.4212
1807,1.4165
1808,1.4086
1809,1.4040000000000001
1810,1.4049
1811,1.4062
1812,1.4047
1813,1.4061
1814,1.4042
1815,1.396
1816,1.3905
1817,1.3827
1818,1.3744
1819,1.3662
1820,1.3676
1821,1.3662
1822,1.3612
1823,1.3557
1824,1.3475
1825,1.3397
1826,1.3315
1827,1.3265
1828,1.3252
1829,1.3257
1830,1.3202
1831,1.3124
1832,1.3047
1833,1.2965
1834,1.2882
1835,1.2805
1836,1.275
1837,1.2668
1838,1.2651
1839,1.2639
1840,1.2616
1841,1.2539
1842,1.2457
1843,1.2402
1844,1.232
1845,1.2238
1846,1.2156
1847,1.2074
1848,1.1991
1849,1.1909
1850,1.1855
1851,1.1772
1852,1.169
1853,1.1608
1854,1.1526
1855,1.1444
1856,1.1389
1857,1.1307
1858,1.1225
1859,1.1143
1860,1.1061
1861,1.0979
1862,1.0897
1863,1.0842
1864,1.0759999999999998
1865,1.0678
1866,1.0596
1867,1.0514
1868,1.0432
1869,1.035
1870,1.0295
1871,1.0213
1872,1.0131
1873,1.0049
1874,0.99671
1875,0.98851
1876,0.98305
1877,0.97485
1878,0.96665
1879,0.9584600000000001
1880,0.9502700000000001
1881,0.9420700000000001
1882,0.9338799999999999
1883,0.92842
1884,0.9202299999999999
1885,0.9120299999999999
1886,0.90384
1887,0.8962200000000001
1888,0.8874700000000001
1889,0.8820100000000001
1890,0.87382
1891,0.8656299999999999
1892,0.85745
1893,0.84926
1894,0.8410799999999999
1895,0.8328899999999999
1896,0.82744
1897,0.81926
1898,0.81107
1899,0.80289
1900,0.79471
1901,0.7865300000000001
1902,0.77836
1903,0.77291
1904,0.76473
1905,0.75655
1906,0.74838
1907,0.7402
1908,0.7320300000000001
1909,0.72658
1910,0.71841
1911,0.71024
1912,0.70207
1913,0.6939
1914,0.6857300000000001
1915,0.67757
1916,0.6721199999999999
1917,0.66396
1918,0.65579
1919,0.64763
1920,0.63946
1921,0.6313
1922,0.6231399999999999
1923,0.6177
1924,0.60954
1925,0.60138
1926,0.59323
1927,0.58507
1928,0.57691
1929,0.57148
1930,0.5633199999999999
1931,0.55579
1932,0.54702
1933,0.53887
1934,0.53135
1935,0.5232
1936,0.5171399999999999
1937,0.5089899999999999
1938,0.50085
1939,0.4927
1940,0.48518999999999995
1941,0.47705
1942,0.46891000000000005
1943,0.46348
1944,0.45535
1945,0.44721000000000005
1946,0.43908
1947,0.43028999999999995
1948,0.42216000000000004
1949,0.41673000000000004
1950,0.4086
1951,0.40047
1952,0.39234
1953,0.38421
1954,0.37608
1955,0.36795
1956,0.36254000000000003
1957,0.35441
1958,0.34563
1959,0.34094
1960,0.33628
1961,0.32815
1962,0.32001
1963,0.31459000000000004
1964,0.30646
1965,0.29833000000000004
1966,0.29020999999999997
1967,0.28142
1968,0.27329000000000003
1969,0.26788
1970,0.25975
1971,0.25163
1972,0.24351
1973,0.23538
1974,0.23069
1975,0.22601
1976,0.22264
1977,0.21450999999999998
1978,0.20638
1979,0.19825
1980,0.18947
1981,0.18134
1982,0.17593
1983,0.1678
1984,0.16172
1985,0.15975999999999999
1986,0.1551
1987,0.14695999999999998
1988,0.13883
1989,0.13612
1990,0.13341
1991,0.12797999999999998
1992,0.11986
1993,0.11714000000000001
1994,0.11172
1995,0.10359000000000002
1996,0.098837
1997,0.098124
1998,0.09676
1999,0.089323
2000,0.08121
2001,0.073101
2002,0.067696
2003,0.059588999999999996
2004,0.05148200000000001
2005,0.043378
2006,0.035274
2007,0.027173000000000003
2008,0.019075
2009,0.014372
2010,0.0062756
2011,-0.0018164000000000001
2012,-0.009909399999999999
2013,-0.017999
2014,-0.026088999999999998
2015,-0.026647000000000004
2016,-0.025205
2017,-0.026449
2018,-0.034519
2019,-0.042589999999999996
2020,-0.050660000000000004
2021,-0.058725
2022,-0.06410199999999999
2023,-0.072167
2024,-0.080229
2025,-0.08829
2026,-0.0956
2027,-0.10365999999999999
2028,-0.11170999999999999
2029,-0.11782999999999999
2030,-0.12588
2031,-0.13317
2032,-0.14122
2033,-0.14926
2034,-0.15730999999999998
2035,-0.16535
2036,-0.1707
2037,-0.17874
2038,-0.18678
2039,-0.19213
2040,-0.18979000000000001
2041,-0.1901
2042,-0.19197999999999998
2043,-0.19999
2044,-0.20800000000000002
2045,-0.21600999999999998
2046,-0.22321
2047,-0.23121
2048,-0.23920999999999998
2049,-0.24454
2050,-0.24905
2051,-0.24924000000000002
2052,-0.24674000000000001
2053,-0.25472
2054,-0.26185
2055,-0.26366
2056,-0.26375
2057,-0.26203000000000004
2058,-0.26911999999999997
2059,-0.27706
2060,-0.28501
2061,-0.29207
2062,-0.29736
2063,-0.30529
2064,-0.31322
2065,-0.32115
2066,-0.31847
2067,-0.3184
2068,-0.3254
2069,-0.33066
2070,-0.33855999999999997
2071,-0.34028
2072,-0.34028
2073,-0.33843
2074,-0.33564
2075,-0.33639
2076,-0.33616999999999997
2077,-0.33593
2078,-0.33854
2079,-0.33758
2080,-0.33565
2081,-0.33011999999999997
2082,-0.32816999999999996
2083,-0.32359
2084,-0.32
2085,-0.31739
2086,-0.31181
2087,-0.30982
2088,-0.30722
2089,-0.30722
2090,-0.30201
2091,-0.29320999999999997
2092,-0.28539000000000003
2093,-0.27757
2094,-0.26975
2095,-0.26616
2096,-0.26058000000000003
2097,-0.25758000000000003
2098,-0.24978000000000003
2099,-0.24197
2100,-0.23415999999999998
2101,-0.22634
2102,-0.22014
2103,-0.21231999999999998
2104,-0.2045
2105,-0.19667
2106,-0.18884
2107,-0.18101
2108,-0.17481
2109,-0.17285999999999999
2110,-0.16729000000000002
2111,-0.15847999999999998
2112,-0.15066
2113,-0.14284000000000002
2114,-0.13501
2115,-0.12979000000000002
2116,-0.12195999999999999
2117,-0.11315
2118,-0.10530999999999999
2119,-0.097468
2120,-0.089626
2121,-0.08246
2122,-0.077904
2123,-0.072362
2124,-0.064532
2125,-0.056698
2126,-0.048862
2127,-0.04102
2128,-0.033178
2129,-0.026981
2130,-0.019136
2131,-0.011289
2132,-0.0034394
2133,0.0044166000000000006
2134,0.0089496
2135,0.010876
2136,0.019008
2137,0.02685
2138,0.034694
2139,0.042542
2140,0.050392
2141,0.058245000000000005
2142,0.063481
2143,0.072292
2144,0.080151
2145,0.088012
2146,0.095877
2147,0.10135
2148,0.10588
2149,0.11042
2150,0.11827
2151,0.12612
2152,0.13493
2153,0.14279
2154,0.15065
2155,0.15589
2156,0.16375
2157,0.16733
2158,0.1728
2159,0.17829
2160,0.18614
2161,0.19495
2162,0.20019
2163,0.20805
2164,0.21591
2165,0.22043000000000001
2166,0.22593000000000002
2167,0.23308
2168,0.23831999999999998
2169,0.24616999999999997
2170,0.25498000000000004
2171,0.26283
2172,0.26903
2173,0.27191
2174,0.27742
2175,0.28265
2176,0.29146
2177,0.29863
2178,0.30416
2179,0.30873
2180,0.31656
2181,0.32537
2182,0.33059
2183,0.33843
2184,0.34724
2185,0.35017
2186,0.35572
2187,0.35869
2188,0.36067
2189,0.36367
2190,0.37148000000000003
2191,0.38028
2192,0.38809
2193,0.3959
2194,0.40371999999999997
2195,0.40571
2196,0.40871
2197,0.41431999999999997
2198,0.41735
2199,0.4204
2200,0.42661000000000004
2201,0.43541
2202,0.44061000000000006
2203,0.44367
2204,0.44935
2205,0.45297
2206,0.46176999999999996
2207,0.46953999999999996
2208,0.4716
2209,0.47471
2210,0.47783000000000003
2211,0.48356000000000005
2212,0.48671000000000003
2213,0.49293000000000003
2214,0.50173
2215,0.50794
2216,0.51112
2217,0.51431
2218,0.51752
2219,0.52076
2220,0.524
2221,0.52618
2222,0.52946
2223,0.53275
2224,0.53606
2225,0.5393899999999999
2226,0.54274
2227,0.5461
2228,0.54835
2229,0.55175
2230,0.55516
2231,0.55858
2232,0.5558
2233,0.5493399999999999
2234,0.5465800000000001
2235,0.54637
2236,0.5473399999999999
2237,0.53976
2238,0.53335
2239,0.53437
2240,0.53794
2241,0.53409
2242,0.52654
2243,0.51899
2244,0.51144
2245,0.5039
2246,0.49636
2247,0.48882
2248,0.4838
2249,0.47626999999999997
2250,0.46875
2251,0.46123000000000003
2252,0.45377
2253,0.44761999999999996
2254,0.44268
2255,0.43766000000000005
2256,0.43013
2257,0.42139
2258,0.41386999999999996
2259,0.40391
2260,0.39775
2261,0.39282
2262,0.38529
2263,0.37776
2264,0.37024
2265,0.36272
2266,0.35398
2267,0.34647
2268,0.34146
2269,0.33523000000000003
2270,0.32905
2271,0.32539
2272,0.31786
2273,0.31035
2274,0.30283000000000004
2275,0.29783000000000004
2276,0.29031999999999997
2277,0.28281999999999996
2278,0.27532
2279,0.26783
2280,0.25909
2281,0.2541
2282,0.24661999999999998
2283,0.23914000000000002
2284,0.23165999999999998
2285,0.22419
2286,0.21671999999999997
2287,0.20926
2288,0.20551999999999998
2289,0.19926
2290,0.1955
2291,0.18803
2292,0.18056
2293,0.17309000000000002
2294,0.16563
2295,0.16066
2296,0.1532
2297,0.14575
2298,0.13831
2299,0.13087000000000001
2300,0.12344000000000001
2301,0.11848
2302,0.11105999999999999
2303,0.10364000000000001
2304,0.09622
2305,0.08881
2306,0.081403
2307,0.07270499999999999
2308,0.067771
2309,0.060375
2310,0.052985000000000004
2311,0.0456
2312,0.038221
2313,0.030847000000000003
2314,0.025932999999999998
2315,0.018567
2316,0.014612
2317,0.0082106
2318,0.0044386
2319,-0.0029404
2320,-0.010313
2321,-0.015225
2322,-0.023912
2323,-0.031277
2324,-0.038633999999999995
2325,-0.045985000000000005
2326,-0.053545
2327,-0.057521
2328,-0.06261699999999999
2329,-0.069983
2330,-0.077342
2331,-0.084695
2332,-0.093375
2333,-0.10072
2334,-0.10562
2335,-0.11295
2336,-0.12162
2337,-0.12809
2338,-0.13454000000000002
2339,-0.14188
2340,-0.14922
2341,-0.15411
2342,-0.16144
2343,-0.17010999999999998
2344,-0.17743
2345,-0.18475
2346,-0.19097
2347,-0.19746
2348,-0.20016
2349,-0.20883000000000002
2350,-0.21615
2351,-0.22346999999999997
2352,-0.23213000000000003
2353,-0.23944000000000001
2354,-0.24431
2355,-0.2516
2356,-0.25889
2357,-0.26299
2358,-0.2695
2359,-0.27571999999999997
2360,-0.28303
2361,-0.28789000000000003
2362,-0.29519
2363,-0.30246999999999996
2364,-0.31113
2365,-0.3184
2366,-0.32568
2367,-0.33294
2368,-0.33778
2369,-0.34503
2370,-0.35023000000000004
2371,-0.3568
2372,-0.3644
2373,-0.37167
2374,-0.37651
2375,-0.38376
2376,-0.391
2377,-0.39824
2378,-0.40548
2379,-0.41411000000000003
2380,-0.42133000000000004
2381,-0.42613999999999996
2382,-0.43335
2383,-0.44055
2384,-0.44773999999999997
2385,-0.45493
2386,-0.46211
2387,-0.46688999999999997
2388,-0.47406000000000004
2389,-0.48121
2390,-0.48836999999999997
2391,-0.49551000000000006
2392,-0.50264
2393,-0.5112300000000001
2394,-0.5136
2395,-0.5179699999999999
2396,-0.5247
2397,-0.52709
2398,-0.53423
2399,-0.54282
2400,-0.54995
2401,-0.55469
2402,-0.56181
2403,-0.56892
2404,-0.57602
2405,-0.57986
2406,-0.5866399999999999
2407,-0.59195
2408,-0.59815
2409,-0.60526
2410,-0.6138399999999999
2411,-0.62093
2412,-0.62802
2413,-0.63334
2414,-0.63866
2415,-0.64308
2416,-0.65018
2417,-0.65728
2418,-0.6643600000000001
2419,-0.67293
2420,-0.68
2421,-0.68471
2422,-0.69177
2423,-0.70182
2424,-0.7086600000000001
2425,-0.71635
2426,-0.72341
2427,-0.72812
2428,-0.7366699999999999
2429,-0.74371
2430,-0.75141
2431,-0.75826
2432,-0.7659600000000001
2433,-0.7730100000000001
2434,-0.77771
2435,-0.7862600000000001
2436,-0.7932899999999999
2437,-0.80099
2438,-0.80786
2439,-0.81321
2440,-0.82026
2441,-0.82495
2442,-0.8319799999999999
2443,-0.83899
2444,-0.846
2445,-0.8545299999999999
2446,-0.8615200000000001
2447,-0.86618
2448,-0.87315
2449,-0.8801200000000001
2450,-0.8863
2451,-0.8909299999999999
2452,-0.89786
2453,-0.90484
2454,-0.9110299999999999
2455,-0.91876
2456,-0.92569
2457,-0.9310799999999999
2458,-0.9380700000000001
2459,-0.94505
2460,-0.9535600000000001
2461,-0.95821
2462,-0.96439
2463,-0.97134
2464,-0.9782700000000001
2465,-0.98525
2466,-0.9922200000000001
2467,-0.99841
2468,-1.0054
2469,-1.0123
2470,-1.0177
2471,-1.0247
2472,-1.0324
2473,-1.0394
2474,-1.0456
2475,-1.0525
2476,-1.0594
2477,-1.0656
2478,-1.0726
2479,-1.0796
2480,-1.0842
2481,-1.0912
2482,-1.0997
2483,-1.1066
2484,-1.1112
2485,-1.1182
2486,-1.1252
2487,-1.1291
2488,-1.136
2489,-1.1445
2490,-1.1514
2491,-1.1583
2492,-1.166
2493,-1.1731
2494,-1.1762
2495,-1.1831
2496,-1.1916
2497,-1.197
2498,-1.204
2499,-1.2118
2500,-1.2164
2501,-1.2233
2502,-1.2302
2503,-1.2387
2504,-1.2449
2505,-1.2519
2506,-1.2589
2507,-1.2635
2508,-1.272
2509,-1.2790000000000001
2510,-1.286
2511,-1.2922
2512,-1.2991
2513,-1.306
2514,-1.3122
2515,-1.3191
2516,-1.3268
2517,-1.3339
2518,-1.3393
2519,-1.3478
2520,-1.3524
2521,-1.3578
2522,-1.3649
2523,-1.3726
2524,-1.3811
2525,-1.3888
2526,-1.3958
2527,-1.3989
2528,-1.4059
2529,-1.4128
2530,-1.4213
2531,-1.4282
2532,-1.4351
2533,-1.4398
2534,-1.4453
2535,-1.4507
2536,-1.4592
2537,-1.4661
2538,-1.4708
2539,-1.4778
2540,-1.4816
2541,-1.4886
2542,-1.4955
2543,-1.5024
2544,-1.5109
2545,-1.5178
2546,-1.5247
2547,-1.5292
2548,-1.5354
2549,-1.5402
2550,-1.5472
2551,-1.5541
2552,-1.561
2553,-1.5655
2554,-1.5724
2555,-1.5792
2556,-1.5859999999999999
2557,-1.5944
2558,-1.6012
2559,-1.6079
2560,-1.6124
2561,-1.6191
2562,-1.6258
2563,-1.6325
2564,-1.6403
2565,-1.6476
2566,-1.6531
2567,-1.6576
2568,-1.6643
2569,-1.6709
2570,-1.6776
2571,-1.6842
2572,-1.6925
2573,-1.6969
2574,-1.7034
2575,-1.71
2576,-1.7165
2577,-1.7226
2578,-1.73
2579,-1.7352
2580,-1.7396
2581,-1.7461
2582,-1.7526
2583,-1.7590000000000001
2584,-1.7655
2585,-1.7719
2586,-1.7801
2587,-1.7843
2588,-1.7907
2589,-1.797
2590,-1.8033
2591,-1.8096
2592,-1.8158
2593,-1.82
2594,-1.82
2595,-1.8219999999999998
2596,-1.8301
2597,-1.8361
2598,-1.84
2599,-1.844
2600,-1.8481
2601,-1.8561
2602,-1.8641
2603,-1.8659999999999999
2604,-1.8681
2605,-1.8742
2606,-1.8802
2607,-1.8842
2608,-1.8902
2609,-1.8962
2610,-1.9041
2611,-1.91
2612,-1.9158
2613,-1.9197
2614,-1.9255
2615,-1.9313
2616,-1.9332
2617,-1.9332
2618,-1.9389
2619,-1.9427
2620,-1.9446
2621,-1.9485
2622,-1.9543
2623,-1.962
2624,-1.9697
2625,-1.9773
2626,-1.9828
2627,-1.9847
2628,-1.9865
2629,-1.9925
2630,-1.9980000000000002
2631,-2.0034
2632,-2.0087
2633,-2.0123
2634,-2.0175
2635,-2.0228
2636,-2.0279
2637,-2.0353
2638,-2.0403
2639,-2.0454
2640,-2.0464
2641,-2.0536
2642,-2.0585
2643,-2.061
2644,-2.0657
2645,-2.0727
2646,-2.0758
2647,-2.0804
2648,-2.0849
2649,-2.0894
2650,-2.0938
2651,-2.0981
2652,-2.1024
2653,-2.1052
2654,-2.1093
2655,-2.1134
2656,-2.1174
2657,-2.1214
2658,-2.1252
2659,-2.129
2660,-2.1315
2661,-2.1351
2662,-2.1387
2663,-2.1422
2664,-2.1456
2665,-2.1489
2666,-2.1511
2667,-2.1543
2668,-2.1574
2669,-2.1604
2670,-2.1633
2671,-2.1661
2672,-2.1689
2673,-2.1707
2674,-2.1706
2675,-2.1731
2676,-2.1755
2677,-2.1778
2678,-2.18
2679,-2.1821
2680,-2.1835
2681,-2.1854
2682,-2.1873
2683,-2.189
2684,-2.1906
2685,-2.1922
2686,-2.1932
2687,-2.1945
2688,-2.1958
2689,-2.197
2690,-2.198
2691,-2.199
2692,-2.1999
2693,-2.2004
2694,-2.201
2695,-2.2016
2696,-2.2021
2697,-2.2024
2698,-2.2027
2699,-2.2028
2700,-2.2029
2701,-2.2029
2702,-2.2029
2703,-2.2029
2704,-2.2029
2705,-2.2029
2706,-2.2029
2707,-2.2029
2708,-2.2057
