time,value
0,-1.1716
1,-1.1716
2,-0.71377
3,1.2702
4,0.96495
5,0.96495
6,0.81234
7,0.81234
8,0.96495
9,0.81234
10,0.81234
11,0.81234
12,0.81234
13,0.81234
14,0.81234
15,0.81234
16,0.81234
17,-0.25594
18,-1.1716
19,-1.1716
20,-1.1716
21,-1.1716
22,-1.1716
23,-1.1716
24,0.65972
25,0.96495
26,0.96495
27,0.81234
28,0.81234
29,0.81234
30,-0.25594
31,-1.1716
32,-1.1716
33,-1.1716
34,-1.1716
35,-1.1716
36,-1.1716
37,0.049281
38,1.2702
39,0.81234
40,0.81234
41,-0.71377
42,-1.1716
43,-1.1716
44,-1.1716
45,-1.1716
46,-1.1716
47,-1.1716
48,1.2702
49,0.96495
50,0.81234
51,-0.8663799999999999
52,-1.1716
53,-1.1716
54,-1.1716
55,-1.1716
56,-1.1716
57,1.2702
58,1.1176
59,0.81234
60,0.81234
61,0.81234
62,0.81234
63,0.96495
64,0.81234
65,0.65972
66,0.81234
67,0.81234
68,-0.8663799999999999
69,-1.1716
70,-1.1716
71,-1.1716
72,-1.1716
73,-1.1716
74,-1.1716
75,1.2702
76,0.96495
77,0.81234
78,0.96495
79,0.81234
80,0.81234
81,-0.10332999999999999
82,-1.1716
83,-1.1716
84,-1.1716
85,-1.1716
86,-1.1716
87,1.4228
88,0.96495
89,0.81234
90,0.81234
91,0.96495
92,0.81234
93,0.81234
94,0.81234
95,-0.10332999999999999
