time,value
0,1.5021
1,1.604
2,1.6521
3,1.6766
4,1.6683
5,1.6285
6,1.5635
7,1.4823
8,1.3997
9,1.3147
10,1.2422
11,1.1565
12,1.0674
13,0.98006
14,0.89505
15,0.80765
16,0.72025
17,0.6353300000000001
18,0.5505
19,0.46575
20,0.38109
21,0.29654
22,0.21211999999999998
23,0.12648
24,0.041374
25,-0.043644999999999996
26,-0.12758
27,-0.21131
28,-0.2948
29,-0.37801999999999997
30,-0.46503999999999995
31,-0.54781
32,-0.63017
33,-0.71203
34,-0.7933
35,-0.87929
36,-0.9593700000000001
37,-1.0384
38,-1.1221
39,-1.1921
40,-1.2659
41,-1.3366
42,-1.4032
43,-1.4642
44,-1.5173
45,-1.5598
46,-1.5881
47,-1.5991
48,-1.5834
49,-1.5526
50,-1.5171
51,-1.4746
52,-1.4154
53,-1.3504
54,-1.2752
55,-1.1995
56,-1.1246
57,-1.0478
58,-0.9633700000000001
59,-0.88434
60,-0.80433
61,-0.71839
62,-0.63725
63,-0.55553
64,-0.46889
65,-0.39038
66,-0.30680999999999997
67,-0.22218000000000002
68,-0.14098
69,-0.05724
70,0.026698000000000003
71,0.11080999999999999
72,0.19508
73,0.27856
74,0.36123
75,0.44864
76,0.53337
77,0.61819
78,0.70309
79,0.7904899999999999
80,0.8769
81,0.9639200000000001
82,1.0509
83,1.138
84,1.225
85,1.3101
86,1.3936
87,1.4748
88,1.5546
89,1.6287
90,1.6635
91,1.6581
92,1.6436
93,1.6144
94,1.5506
95,1.4667
96,1.3844
97,1.3004
98,1.217
99,1.1335
100,1.0507
101,0.9676799999999999
102,0.88445
103,0.8028
104,0.7198399999999999
105,0.6371600000000001
106,0.5548
107,0.47395
108,0.39115
109,0.31027
110,0.22921
111,0.15191
112,0.069367
113,-0.007572800000000001
114,-0.08784299999999999
115,-0.16525
116,-0.24172
117,-0.31711
118,-0.39708000000000004
119,-0.47028000000000003
120,-0.5419
121,-0.61878
122,-0.69386
123,-0.7609199999999999
124,-0.8331200000000001
125,-0.9033
126,-0.97105
127,-1.0359
128,-1.0859999999999999
129,-1.1422
130,-1.1929
131,-1.2371
132,-1.2738
133,-1.3162
134,-1.3346
135,-1.3421
136,-1.3381
137,-1.3341
138,-1.3116
139,-1.2761
140,-1.2451
141,-1.1955
142,-1.1479
143,-1.0858
144,-1.0293
145,-0.96425
146,-0.90399
147,-0.8293200000000001
148,-0.75993
149,-0.68215
150,-0.60924
151,-0.53249
152,-0.45603
153,-0.37851
154,-0.30007
155,-0.22096
156,-0.14453
157,-0.063705
158,0.016064
159,0.099427
160,0.17945
161,0.25939
162,0.34254
163,0.42408
164,0.5071899999999999
165,0.59108
166,0.67379
167,0.7581100000000001
168,0.8428700000000001
169,0.92689
170,1.012
171,1.0969
172,1.182
173,1.2675
174,1.3527
175,1.4381
