time,value
0,-0.35675
1,-0.35675
2,-0.35675
3,-0.35675
4,-0.35675
5,-0.35675
6,-0.35675
7,-0.35675
8,-0.35675
9,-0.35675
10,-0.35675
11,-0.35675
12,-0.35675
13,-0.35675
14,-0.35675
15,-0.35675
16,-0.35675
17,-0.35675
18,-0.35675
19,-0.35675
20,-0.35675
21,-0.35675
22,-0.35675
23,-0.35675
24,-0.35675
25,-0.35675
26,1.2955
27,3.2483
28,2.1968
29,1.4458
30,-0.35675
31,-0.35675
32,-0.35675
33,-0.35675
34,-0.35675
35,-0.35675
36,-0.35675
37,-0.35675
38,-0.35675
39,-0.35675
40,-0.35675
41,-0.35675
42,-0.35675
43,-0.35675
44,-0.35675
45,-0.35675
46,-0.35675
47,-0.35675
48,-0.35675
49,-0.35675
50,-0.35675
51,-0.35675
52,-0.35675
53,-0.35675
54,-0.35675
55,-0.35675
56,-0.35675
57,-0.35675
58,-0.35675
59,-0.35675
60,-0.35675
61,-0.35675
62,-0.35675
63,-0.35675
64,-0.35675
65,-0.35675
66,-0.35675
67,-0.35675
68,-0.35675
69,-0.35675
70,-0.35675
71,-0.35675
72,-0.35675
73,-0.35675
74,-0.35675
75,-0.35675
76,-0.35675
77,-0.35675
78,-0.35675
79,-0.35675
80,-0.35675
81,-0.35675
82,-0.35675
83,-0.35675
84,-0.35675
85,-0.35675
86,-0.35675
87,2.0466
88,3.2483
89,3.2483
90,3.2483
91,3.0981
92,3.2483
93,2.9478
94,0.69472
95,-0.35675
