time,value
0,-0.27878000000000003
1,-0.27878000000000003
2,-0.27878000000000003
3,-0.27878000000000003
4,-0.27878000000000003
5,-0.27878000000000003
6,-0.27878000000000003
7,-0.27878000000000003
8,-0.27878000000000003
9,-0.27878000000000003
10,-0.27878000000000003
11,-0.27878000000000003
12,-0.27878000000000003
13,-0.27878000000000003
14,-0.27878000000000003
15,-0.27878000000000003
16,-0.27878000000000003
17,-0.27878000000000003
18,-0.27878000000000003
19,-0.27878000000000003
20,-0.27878000000000003
21,-0.27878000000000003
22,-0.27878000000000003
23,-0.27878000000000003
24,-0.27878000000000003
25,-0.27878000000000003
26,-0.27878000000000003
27,-0.27878000000000003
28,-0.27878000000000003
29,-0.27878000000000003
30,3.6617
31,-0.27878000000000003
32,-0.27878000000000003
33,3.3881
34,-0.27878000000000003
35,-0.27878000000000003
36,2.0746
37,1.3084
38,-0.27878000000000003
39,-0.27878000000000003
40,-0.27878000000000003
41,-0.27878000000000003
42,-0.27878000000000003
43,-0.27878000000000003
44,-0.27878000000000003
45,-0.27878000000000003
46,-0.27878000000000003
47,-0.27878000000000003
48,-0.27878000000000003
49,-0.27878000000000003
50,-0.27878000000000003
51,-0.27878000000000003
52,-0.27878000000000003
53,4.4827
54,-0.27878000000000003
55,-0.27878000000000003
56,3.8259
57,-0.27878000000000003
58,-0.27878000000000003
59,-0.27878000000000003
60,-0.27878000000000003
61,-0.27878000000000003
62,-0.27878000000000003
63,-0.27878000000000003
64,-0.27878000000000003
65,-0.27878000000000003
66,-0.27878000000000003
67,-0.27878000000000003
68,-0.27878000000000003
69,-0.27878000000000003
70,-0.27878000000000003
71,-0.27878000000000003
72,-0.27878000000000003
73,-0.27878000000000003
74,-0.27878000000000003
75,-0.27878000000000003
76,-0.27878000000000003
77,-0.27878000000000003
78,-0.27878000000000003
79,-0.27878000000000003
80,-0.27878000000000003
81,-0.27878000000000003
82,-0.27878000000000003
83,-0.27878000000000003
84,-0.27878000000000003
85,-0.27878000000000003
86,-0.27878000000000003
87,-0.27878000000000003
88,4.5921
89,-0.27878000000000003
90,1.1989
91,-0.27878000000000003
92,-0.27878000000000003
93,-0.27878000000000003
94,-0.27878000000000003
95,-0.27878000000000003
