time,value
0,-0.73657
1,-0.73657
2,-0.73657
3,-0.73657
4,-0.73657
5,-0.73657
6,-0.73657
7,-0.73657
8,-0.73657
9,-0.73657
10,-0.73657
11,-0.73657
12,-0.73657
13,-0.73657
14,-0.73657
15,-0.73657
16,-0.73657
17,-0.73657
18,-0.73657
19,-0.73657
20,-0.73657
21,-0.73657
22,-0.73657
23,-0.73657
24,-0.73657
25,-0.73657
26,-0.73657
27,-0.73657
28,-0.73657
29,-0.73657
30,-0.73657
31,-0.73657
32,-0.73657
33,-0.73657
34,-0.73657
35,-0.73657
36,-0.039913
37,0.54064
38,2.4565
39,2.3984
40,2.4565
41,2.1081
42,1.1792
43,1.1792
44,1.1792
45,1.1212
46,1.1792
47,1.1792
48,1.1212
49,1.1792
50,1.1792
51,1.1792
52,1.1792
53,1.1792
54,1.1792
55,1.1792
56,1.1792
57,1.1792
58,1.1792
59,1.1792
60,1.1792
61,1.1792
62,1.1792
63,1.1792
64,1.1792
65,1.1212
66,1.1792
67,1.1792
68,1.1792
69,1.1792
70,1.1212
71,0.30841999999999997
72,-0.73657
73,-0.73657
74,-0.73657
75,-0.73657
76,-0.73657
77,-0.73657
78,-0.73657
79,-0.73657
80,-0.73657
81,-0.73657
82,-0.73657
83,-0.73657
84,-0.73657
85,-0.73657
86,-0.73657
87,-0.73657
88,-0.73657
89,-0.73657
90,-0.73657
91,-0.73657
92,-0.73657
93,-0.73657
94,-0.73657
95,-0.73657
