time,value
0,-1.1389
1,-1.0191
2,-1.1908
3,-1.4231
4,-1.6237
5,-1.5722
6,-1.3594
7,-1.5138
8,-1.402
9,-1.3409
10,-1.3665
11,-1.1512
12,-1.0075
13,-0.8690100000000001
14,-0.7569100000000001
15,-0.5976100000000001
16,-0.47981
17,-0.33914
18,-0.15563
19,-0.050254
20,-0.014484
21,0.1246
22,0.19614
23,0.22401
24,0.24458000000000002
25,0.23184000000000002
26,0.30933
27,0.32784
28,0.34992
29,0.3801
30,0.386
31,0.40129000000000004
32,0.40525
33,0.39513000000000004
34,0.40865
35,0.46471999999999997
36,0.4572
37,0.48355
38,0.54903
39,0.55919
40,0.52549
41,0.51183
42,0.46686000000000005
43,0.57519
44,0.5539
45,0.59721
46,0.95815
47,0.91371
48,0.7227899999999999
49,0.79332
50,1.262
51,1.6275
52,1.5297
53,0.76568
54,0.64067
55,0.55187
56,0.409
57,0.5030399999999999
58,0.57596
59,0.6401600000000001
60,0.65374
61,0.10740999999999999
62,-0.049977
63,-0.19818
64,-0.36465
65,-0.42268
66,-0.51973
67,-0.44625
68,-0.53271
69,-0.46351000000000003
70,-0.29255
71,-0.27676
72,-0.19547
73,-0.046018
74,0.13309
75,0.024728999999999998
76,-0.17329
77,-0.10056
78,0.097443
79,0.28869
80,0.3542
81,0.54347
82,0.7742899999999999
83,0.9182899999999999
84,0.87666
85,0.9836299999999999
86,0.9129999999999999
87,0.76032
88,0.75978
89,0.74744
90,0.56975
91,0.40752
92,0.9008299999999999
93,1.0992
94,1.0348
95,1.1347
96,1.4875
97,1.3867
98,1.2742
99,1.3158
100,1.3142
101,0.97705
102,0.6626
103,-0.96155
104,1.2765
105,-0.12370999999999999
106,0.09110599999999999
107,1.1087
108,1.5294
109,1.6444
110,1.6083
111,1.4884
112,1.389
113,0.94539
114,-0.33259
115,1.8364
116,-1.0989
117,0.60638
118,1.0993
119,1.153
120,1.5393
121,1.7078
122,1.7673
123,1.6969
124,1.6979
125,-3.0308
126,1.3872
127,0.70345
128,0.13438
129,1.2805
130,1.1948
131,1.5424
132,1.9875
133,2.202
134,1.9423
135,1.9142
136,1.8261
137,-0.36995
138,-1.0094
139,-0.081054
140,2.0409
141,1.1059999999999999
142,1.5773
143,1.891
144,1.7697
145,1.185
146,1.1836
147,1.5624
148,1.4844
149,0.99703
150,0.73839
151,0.033967000000000004
152,0.17827
153,-0.041925
154,-0.029414999999999997
155,0.058675
156,0.036266
157,0.22791
158,0.35548
159,0.39154
160,0.63584
161,0.9365700000000001
162,0.8758799999999999
163,0.93068
164,1.1247
165,1.3337
166,1.1532
167,1.1223
168,1.1638
169,1.0717
170,1.0748
171,1.2203
172,1.1275
173,1.0655
174,0.83536
175,0.52118
176,0.45326000000000005
177,0.713
178,0.69093
179,0.5388
180,0.40647
181,-0.05600599999999999
182,0.37753000000000003
183,0.8705
184,0.15466
185,0.14981
186,0.8694
187,0.83188
188,1.0003
189,1.4964
190,0.75673
191,1.2958
192,1.6976
193,0.8077300000000001
194,-0.33704
195,-0.037155
196,-0.7784800000000001
197,-0.64954
198,-1.9718
199,-0.81399
200,-0.025772000000000003
201,-0.19112
202,-0.065086
203,-0.83193
204,-1.2464
205,-1.9507
206,-1.3872
207,-1.409
208,-1.2572
209,-1.0766
210,-0.74092
211,-0.63315
212,-0.63903
213,-0.53281
214,-0.59363
215,-0.85901
216,-0.73474
217,-0.6784
218,-0.65282
219,-0.6985399999999999
220,-0.7005100000000001
221,-0.5622699999999999
222,-0.49399
223,-0.50831
224,-0.56543
225,-0.5947
226,-0.51923
227,-0.55845
228,-0.64195
229,-0.71521
230,-0.66991
231,-0.7031
232,-0.73852
233,-0.7551800000000001
234,-0.6796399999999999
235,-0.7783
236,-0.79751
237,-0.80557
238,-0.8360299999999999
239,-0.87741
240,-0.8610200000000001
241,-0.89215
242,-0.82571
243,-0.99521
244,-0.96634
245,-0.91671
246,-1.0102
247,-1.0001
248,-0.93365
249,-1.0183
250,-0.96099
251,-1.0315
252,-1.0261
253,-1.0181
254,-1.1604
255,-1.042
256,-1.0348
257,-1.0297
258,-1.0231
259,-1.0343
260,-1.0419
261,-1.0298
262,-1.0306
263,-1.1598
264,-1.0794
265,-1.182
266,-1.0503
267,-1.1871
268,-1.0484
269,-1.0841
270,-1.0318
271,-1.0499
272,-1.1520000000000001
273,-1.0859999999999999
274,-1.055
275,-1.0568
276,-1.0902
277,-1.0692
278,-1.0794
279,-1.2053
280,-1.2094
281,-1.1844
282,-1.1983
283,-1.1074
284,-1.0849
285,-1.2159
286,-1.0941
287,-1.2049
288,-1.0689
289,-1.0988
290,-1.1951
291,-1.094
292,-1.2203
293,-1.2122
294,-1.0896
295,-1.2194
296,-1.2234
297,-1.2269
298,-1.2225
299,-1.3428
