time,value
0,-0.6411399999999999
1,-0.6411399999999999
2,1.1516
3,1.7491
4,-0.6411399999999999
5,-0.6411399999999999
6,-0.6411399999999999
7,-0.6411399999999999
8,2.1475
9,0.3548
10,-0.6411399999999999
11,-0.6411399999999999
12,-0.6411399999999999
13,-0.24276
14,2.1475
15,0.15562
16,-0.6411399999999999
17,-0.6411399999999999
18,-0.6411399999999999
19,-0.6411399999999999
20,2.1475
21,0.15562
22,-0.6411399999999999
23,-0.6411399999999999
24,-0.6411399999999999
25,-0.6411399999999999
26,1.7491
27,0.7531800000000001
28,-0.6411399999999999
29,-0.6411399999999999
30,-0.6411399999999999
31,-0.6411399999999999
32,1.1516
33,1.3507
34,-0.6411399999999999
35,-0.6411399999999999
36,-0.6411399999999999
37,-0.6411399999999999
38,0.3548
39,2.1475
40,-0.24276
41,-0.6411399999999999
42,-0.6411399999999999
43,-0.6411399999999999
44,-0.043572
45,2.1475
46,-0.24276
47,-0.6411399999999999
48,-0.6411399999999999
49,-0.6411399999999999
50,-0.6411399999999999
51,2.1475
52,0.15562
53,-0.6411399999999999
54,-0.6411399999999999
55,-0.6411399999999999
56,-0.6411399999999999
57,1.5499
58,1.1516
59,-0.6411399999999999
60,-0.6411399999999999
61,-0.6411399999999999
62,-0.6411399999999999
63,0.3548
64,2.1475
65,-0.6411399999999999
66,-0.6411399999999999
67,-0.6411399999999999
68,-0.6411399999999999
69,-0.24276
70,2.1475
71,-0.043572
72,-0.6411399999999999
73,-0.6411399999999999
74,-0.6411399999999999
75,-0.6411399999999999
76,2.1475
77,0.55399
78,-0.6411399999999999
79,-0.6411399999999999
80,-0.6411399999999999
81,-0.6411399999999999
82,1.3507
83,1.5499
84,-0.6411399999999999
85,-0.6411399999999999
86,-0.6411399999999999
87,-0.6411399999999999
88,0.55399
89,1.9483
90,-0.6411399999999999
91,-0.6411399999999999
92,-0.6411399999999999
93,-0.6411399999999999
94,-0.043572
95,2.1475
