time,value
0,-0.21393
1,-0.21393
2,-0.21393
3,-0.21393
4,-0.21393
5,-0.21393
6,-0.21393
7,-0.21393
8,-0.21393
9,-0.21393
10,-0.21393
11,-0.21393
12,-0.21393
13,-0.21393
14,-0.21393
15,-0.21393
16,-0.21393
17,-0.21393
18,-0.21393
19,-0.21393
20,-0.21393
21,-0.21393
22,-0.21393
23,-0.21393
24,-0.21393
25,-0.21393
26,-0.21393
27,-0.21393
28,-0.21393
29,-0.21393
30,-0.21393
31,5.9473
32,-0.21393
33,-0.21393
34,-0.21393
35,-0.21393
36,-0.21393
37,-0.21393
38,-0.21393
39,-0.21393
40,-0.21393
41,-0.21393
42,-0.21393
43,-0.21393
44,-0.21393
45,-0.21393
46,-0.21393
47,-0.21393
48,-0.21393
49,-0.21393
50,-0.21393
51,-0.21393
52,-0.21393
53,4.4293
54,1.2148
55,-0.21393
56,-0.21393
57,-0.21393
58,-0.21393
59,-0.21393
60,-0.21393
61,-0.21393
62,-0.21393
63,-0.21393
64,-0.21393
65,-0.21393
66,-0.21393
67,-0.21393
68,-0.21393
69,-0.21393
70,-0.21393
71,-0.21393
72,-0.21393
73,-0.21393
74,-0.21393
75,-0.21393
76,-0.21393
77,5.2329
78,-0.21393
79,-0.21393
80,-0.21393
81,-0.21393
82,-0.21393
83,-0.21393
84,-0.21393
85,2.6434
86,-0.21393
87,-0.21393
88,-0.21393
89,-0.21393
90,-0.21393
91,-0.21393
92,-0.21393
93,-0.21393
94,-0.21393
95,-0.21393
