time,value
0,0.93465
1,0.8387899999999999
2,0.93465
3,0.8387899999999999
4,0.93465
5,0.93465
6,0.8387899999999999
7,0.8387899999999999
8,-1.0784
9,-1.0784
10,-1.0784
11,-1.0784
12,-1.0784
13,-1.0784
14,0.8387899999999999
15,1.2222
16,1.1264
17,-0.59913
18,-1.0784
19,-1.0784
20,-0.11982999999999999
21,1.2222
22,1.1264
23,-0.50327
24,-1.0784
25,-1.0784
26,-0.023965
27,1.2222
28,1.1264
29,-0.31155
30,-1.0784
31,-1.0784
32,0.16776
33,1.2222
34,1.1264
35,-0.50327
36,-1.0784
37,-1.0784
38,0.6470600000000001
39,1.1264
40,1.2222
41,-0.8867200000000001
42,-1.0784
43,-1.0784
44,0.35948
45,1.3181
46,1.1264
47,-1.0784
48,-1.0784
49,-1.0784
50,0.35948
51,1.2222
52,0.74293
53,-1.0784
54,-1.0784
55,-1.0784
56,0.93465
57,1.2222
58,0.35948
59,-1.0784
60,-1.0784
61,-1.0784
62,1.2222
63,1.2222
64,-0.11982999999999999
65,-1.0784
66,-1.0784
67,-0.79086
68,1.3181
69,1.2222
70,1.1264
71,-0.69499
72,-1.0784
73,-0.11982999999999999
74,1.2222
75,1.1264
76,0.45533999999999997
77,-1.0784
78,-1.0784
79,-0.11982999999999999
80,1.2222
81,1.2222
82,-1.0784
83,-1.0784
84,-1.0784
85,0.16776
86,1.2222
87,1.0305
88,-1.0784
89,-1.0784
90,-1.0784
91,-0.40741
92,1.3181
93,1.3181
94,0.5512
95,-1.0784
