time,value
0,-0.24425
1,-0.24425
2,-0.24425
3,-0.24425
4,-0.24425
5,-0.24425
6,-0.24425
7,-0.24425
8,-0.24425
9,-0.24425
10,-0.24425
11,-0.24425
12,-0.24425
13,-0.24425
14,-0.24425
15,-0.24425
16,-0.24425
17,-0.24425
18,-0.24425
19,-0.24425
20,-0.24425
21,-0.24425
22,-0.24425
23,-0.24425
24,-0.24425
25,-0.24425
26,-0.24425
27,-0.24425
28,-0.24425
29,4.6462
30,-0.24425
31,-0.24425
32,-0.24425
33,-0.24425
34,-0.24425
35,-0.24425
36,-0.24425
37,-0.24425
38,-0.24425
39,-0.24425
40,-0.24425
41,-0.24425
42,-0.24425
43,-0.24425
44,-0.24425
45,-0.24425
46,-0.24425
47,-0.24425
48,-0.24425
49,-0.24425
50,-0.24425
51,-0.24425
52,-0.24425
53,-0.24425
54,-0.24425
55,-0.24425
56,-0.24425
57,-0.24425
58,-0.24425
59,-0.24425
60,-0.24425
61,-0.24425
62,-0.24425
63,-0.24425
64,-0.24425
65,-0.24425
66,-0.24425
67,-0.24425
68,5.9124
69,-0.24425
70,1.808
71,-0.06959
72,-0.15692
73,-0.15692
74,1.6333
75,-0.06959
76,-0.06959
77,-0.15692
78,-0.24425
79,-0.24425
80,-0.24425
81,-0.24425
82,-0.24425
83,-0.24425
84,-0.24425
85,-0.24425
86,4.4715
87,-0.24425
88,2.7249
89,-0.24425
90,-0.24425
91,-0.24425
92,-0.24425
93,-0.24425
94,-0.24425
95,-0.24425
