time,value
0,-0.58255
1,-0.58255
2,-0.58255
3,1.849
4,0.96478
5,-0.58255
6,-0.58255
7,-0.58255
8,-0.58255
9,-0.14046
10,2.5121
11,-0.14046
12,-0.58255
13,-0.58255
14,-0.58255
15,-0.58255
16,0.96478
17,1.849
18,-0.58255
19,-0.58255
20,-0.58255
21,-0.58255
22,-0.58255
23,1.849
24,0.96478
25,-0.58255
26,-0.58255
27,-0.58255
28,-0.58255
29,-0.58255
30,2.5121
31,0.30164
32,-0.58255
33,-0.58255
34,-0.58255
35,-0.58255
36,0.30164
37,2.2911
38,-0.58255
39,-0.58255
40,-0.58255
41,-0.58255
42,-0.58255
43,1.1858
44,1.6279
45,-0.58255
46,-0.58255
47,-0.58255
48,-0.58255
49,-0.58255
50,2.2911
51,0.52269
52,-0.58255
53,-0.58255
54,-0.58255
55,-0.58255
56,0.52269
57,2.2911
58,-0.58255
59,-0.58255
60,-0.58255
61,-0.58255
62,-0.58255
63,1.6279
64,1.4069
65,-0.58255
66,-0.58255
67,-0.58255
68,-0.58255
69,-0.58255
70,2.2911
71,0.30164
72,-0.58255
73,-0.58255
74,-0.58255
75,-0.58255
76,1.1858
77,1.849
78,-0.58255
79,-0.58255
80,-0.58255
81,-0.58255
82,-0.58255
83,2.5121
84,0.30164
85,-0.58255
86,-0.58255
87,-0.58255
88,-0.58255
89,1.1858
90,1.849
91,-0.58255
92,-0.58255
93,-0.58255
94,-0.58255
95,-0.58255
