time,value
0,-0.67813
1,-0.67813
2,-0.67813
3,-0.67813
4,-0.67813
5,-0.67813
6,-0.67813
7,-0.67813
8,-0.67813
9,-0.67813
10,-0.67813
11,-0.67813
12,-0.67813
13,-0.67813
14,-0.67813
15,-0.67813
16,-0.67813
17,-0.67813
18,-0.67813
19,-0.67813
20,-0.67813
21,-0.67813
22,-0.67813
23,-0.67813
24,-0.67813
25,-0.67813
26,-0.67813
27,-0.67813
28,-0.67813
29,-0.67813
30,-0.67813
31,-0.67813
32,-0.67813
33,-0.67813
34,-0.67813
35,-0.67813
36,-0.67813
37,-0.67813
38,1.3197
39,0.88502
40,-0.67813
41,0.9853200000000001
42,0.80143
43,3.3091
44,3.2423
45,-0.0010449
46,0.33332
47,0.3166
48,0.21629
49,-0.017763
50,0.33332
51,0.29988000000000004
52,1.8379
53,0.32495999999999997
54,0.33332
55,-0.05955800000000001
56,1.2194
57,0.29152
58,0.3166
59,0.34168000000000004
60,0.49213999999999997
61,-0.59454
62,-0.18494000000000002
63,0.22465
64,-0.17659
65,-0.18494000000000002
66,-0.18494000000000002
67,0.22465
68,1.2612
69,1.2528
70,0.6008100000000001
71,0.074187
72,0.04075
73,-0.16823
74,-0.17659
75,3.7773
76,2.1138
77,1.5119
78,1.2779
79,1.4952
80,1.6039
81,1.3197
82,-0.36048
83,2.5568
84,-0.51931
85,-0.67813
86,-0.67813
87,-0.67813
88,-0.67813
89,-0.67813
90,-0.67813
91,-0.67813
92,-0.67813
93,-0.67813
94,-0.67813
95,-0.67813
