time,value
0,-1.1044
1,0.8960299999999999
2,0.8960299999999999
3,-1.1044
4,0.8960299999999999
5,-1.1044
6,0.8960299999999999
7,0.8960299999999999
8,-1.1044
9,0.8960299999999999
10,-1.1044
11,0.8960299999999999
12,-1.1044
13,0.8960299999999999
14,-1.1044
15,0.8960299999999999
16,-1.1044
17,0.8960299999999999
18,-1.1044
19,0.8960299999999999
20,-1.1044
21,0.8960299999999999
22,-1.1044
23,0.8960299999999999
24,-1.1044
25,0.8960299999999999
26,-1.1044
27,0.8960299999999999
28,-1.1044
29,0.8960299999999999
30,-1.1044
31,0.8960299999999999
32,-1.1044
33,0.8960299999999999
34,-1.1044
35,0.8960299999999999
36,-1.1044
37,0.8960299999999999
38,-1.1044
39,0.8960299999999999
40,-1.1044
41,0.8960299999999999
42,-1.1044
43,0.8960299999999999
44,-1.1044
45,0.8960299999999999
46,-1.1044
47,0.8960299999999999
48,-1.1044
49,0.8960299999999999
50,-1.1044
51,0.8960299999999999
52,-1.1044
53,0.8960299999999999
54,0.8960299999999999
55,0.8960299999999999
56,-1.1044
57,0.8960299999999999
58,0.8960299999999999
59,-1.1044
60,0.8960299999999999
61,-1.1044
62,0.8960299999999999
63,0.8960299999999999
64,-1.1044
65,0.8960299999999999
66,0.8960299999999999
67,-1.1044
68,0.8960299999999999
69,-1.1044
70,0.8960299999999999
71,-1.1044
72,0.8960299999999999
73,-1.1044
74,0.8960299999999999
75,-1.1044
76,0.8960299999999999
77,-1.1044
78,0.8960299999999999
79,-1.1044
80,0.8960299999999999
81,-1.1044
82,0.8960299999999999
83,-1.1044
84,0.8960299999999999
85,-1.1044
86,0.8960299999999999
87,-1.1044
88,0.8960299999999999
89,0.8960299999999999
90,-1.1044
91,0.8960299999999999
92,0.8960299999999999
93,0.8960299999999999
94,-1.1044
95,0.8960299999999999
