time,value
0,-1.01
1,-1.0076
2,-1.004
3,-0.99911
4,-0.9928
5,-0.98514
6,-0.9783799999999999
7,-0.97209
8,-0.96555
9,-0.9581
10,-0.9491200000000001
11,-0.93981
12,-0.93004
13,-0.91814
14,-0.90309
15,-0.88402
16,-0.86166
17,-0.83709
18,-0.8083899999999999
19,-0.77472
20,-0.7353
21,-0.6905
22,-0.6428
23,-0.5907399999999999
24,-0.53445
25,-0.4744
26,-0.41171
27,-0.35084
28,-0.29136999999999996
29,-0.23419
30,-0.17975
31,-0.12819
32,-0.08164199999999999
33,-0.038502999999999996
34,0.0031963
35,0.045543
36,0.09062100000000001
37,0.13868
38,0.19088
39,0.24886
40,0.31325
41,0.38403000000000004
42,0.4598
43,0.53882
44,0.62079
45,0.70489
46,0.7904399999999999
47,0.87649
48,0.96165
49,1.0464
50,1.131
51,1.2156
52,1.3003
53,1.3844
54,1.4686
55,1.5531
56,1.6381
57,1.7237
58,1.8093
59,1.895
60,1.9808
61,2.0663
62,2.1509
63,2.2332
64,2.3121
65,2.3861
66,2.4534
67,2.5121
68,2.5599
69,2.5952
70,2.6169
71,2.6245
72,2.6181
73,2.5986
74,2.5673
75,2.5264
76,2.4782
77,2.4245
78,2.3668
79,2.3056
80,2.242
81,2.1757
82,2.106
83,2.0321
84,1.9526
85,1.8679
86,1.7783
87,1.6839
88,1.5854
89,1.4834
90,1.3796
91,1.2757
92,1.1727
93,1.0713
94,0.97154
95,0.8745299999999999
96,0.7811600000000001
97,0.69145
98,0.60523
99,0.52175
100,0.44082
101,0.36336
102,0.28895
103,0.21709
104,0.14712999999999998
105,0.07810399999999999
106,0.012046
107,-0.051004
108,-0.11108
109,-0.16817000000000001
110,-0.22395
111,-0.27546
112,-0.32253000000000004
113,-0.36541
114,-0.4045
115,-0.44203000000000003
116,-0.47591999999999995
117,-0.50578
118,-0.53218
119,-0.55574
120,-0.57865
121,-0.59978
122,-0.61783
123,-0.63326
124,-0.64669
125,-0.65986
126,-0.67304
127,-0.68402
128,-0.69316
129,-0.70096
130,-0.7084600000000001
131,-0.71725
132,-0.72421
133,-0.72939
134,-0.73307
135,-0.73563
136,-0.74007
137,-0.74303
138,-0.7447600000000001
139,-0.74571
140,-0.74638
141,-0.74911
142,-0.75179
143,-0.7537
144,-0.75471
145,-0.75465
146,-0.75457
147,-0.7532
148,-0.7491899999999999
149,-0.74226
150,-0.73233
151,-0.72015
152,-0.70577
153,-0.68805
154,-0.66708
155,-0.64302
156,-0.61641
157,-0.58799
158,-0.55679
159,-0.52304
160,-0.48708
161,-0.44945
162,-0.41148999999999997
163,-0.37267
164,-0.33354
165,-0.29463
166,-0.25647
167,-0.22000999999999998
168,-0.18491
169,-0.1511
170,-0.11854
171,-0.087087
172,-0.056896
173,-0.027493
174,0.0015665999999999998
175,0.030436
176,0.059142999999999994
177,0.087369
178,0.1149
179,0.14171
180,0.16741
181,0.19150999999999999
182,0.21334
183,0.2321
184,0.24756999999999998
185,0.25922
186,0.26652
187,0.26897
188,0.26582
189,0.25738
190,0.24378000000000002
191,0.2254
192,0.20285
193,0.1765
194,0.14762
195,0.11723
196,0.086167
197,0.055011000000000004
198,0.023745
199,-0.007488
200,-0.038793
201,-0.070561
202,-0.10322
203,-0.13727
204,-0.17282999999999998
205,-0.20958000000000002
206,-0.24719000000000002
207,-0.28517
208,-0.32304
209,-0.36025999999999997
210,-0.39607
211,-0.43015
212,-0.46236000000000005
213,-0.49272
214,-0.52142
215,-0.54806
216,-0.57271
217,-0.5954699999999999
218,-0.61636
219,-0.63571
220,-0.65278
221,-0.6675
222,-0.67992
223,-0.69018
224,-0.6987300000000001
225,-0.70507
226,-0.70911
227,-0.71109
228,-0.71123
229,-0.71007
230,-0.70731
231,-0.70267
232,-0.6964600000000001
233,-0.68905
234,-0.68113
235,-0.67295
236,-0.66422
237,-0.65549
238,-0.64732
239,-0.64036
240,-0.63527
241,-0.6313300000000001
242,-0.62889
243,-0.62838
244,-0.63022
245,-0.63532
246,-0.64282
247,-0.65289
248,-0.66573
249,-0.68134
250,-0.69994
251,-0.72035
252,-0.7418399999999999
253,-0.76395
254,-0.78632
255,-0.80897
256,-0.8313
257,-0.85295
258,-0.87398
259,-0.89446
260,-0.91451
261,-0.93376
262,-0.95142
263,-0.9670799999999999
264,-0.98039
265,-0.99116
266,-0.9994200000000001
267,-1.0049
268,-1.0081
269,-1.0096
