time,value
0,-0.5101
1,-0.5101
2,-0.5101
3,-0.44827
4,-0.38644
5,0.78833
6,-0.077287
7,-0.5101
8,-0.5101
9,-0.5101
10,-0.5101
11,0.23185999999999998
12,0.41735
13,-0.26278
14,-0.5101
15,-0.5101
16,-0.5101
17,0.046372000000000003
18,-0.077287
19,0.23185999999999998
20,-0.32461
21,-0.5101
22,-0.5101
23,-0.26278
24,0.17003
25,-0.32461
26,0.29369
27,-0.5101
28,-0.57193
29,-0.5101
30,0.17003
31,-0.26278
32,-0.20095
33,0.17003
34,-0.5101
35,-0.5101
36,-0.20095
37,0.1082
38,-0.5101
39,0.1082
40,-0.13912
41,-0.5101
42,-0.57193
43,0.23185999999999998
44,-0.32461
45,-0.5101
46,0.29369
47,-0.44827
48,-0.63376
49,-0.20095
50,0.046372000000000003
51,-0.5101
52,-0.44827
53,0.29369
54,-0.44827
55,-0.5101
56,0.23185999999999998
57,-0.32461
58,-0.5101
59,-0.32461
60,0.23185999999999998
61,-0.44827
62,-0.26278
63,0.1082
64,-0.57193
65,-0.57193
66,-0.26278
67,0.17003
68,-0.57193
69,0.1082
70,-0.32461
71,-0.63376
72,-0.63376
73,-0.20095
74,0.1082
75,-0.26278
76,0.17003
77,-0.63376
78,-0.077287
79,7.9606
80,3.5707
81,1.4066
82,0.91199
83,0.1082
84,0.17003
85,0.78833
86,0.41735
87,0.1082
88,0.7265
89,0.41735
90,0.1082
91,0.78833
92,0.47918
93,0.1082
94,0.35552
95,0.78833
