time,value
0,-0.20826
1,-0.20826
2,-0.20826
3,-0.20826
4,-0.20826
5,-0.20826
6,-0.20826
7,-0.20826
8,-0.20826
9,-0.20826
10,-0.20826
11,-0.20826
12,-0.20826
13,-0.20826
14,-0.20826
15,-0.20826
16,-0.20826
17,-0.20826
18,-0.20826
19,-0.20826
20,-0.20826
21,-0.20826
22,-0.20826
23,-0.20826
24,-0.20826
25,-0.20826
26,-0.20826
27,-0.20826
28,-0.20826
29,5.1359
30,-0.20826
31,-0.20826
32,-0.20826
33,-0.20826
34,-0.20826
35,-0.20826
36,-0.20826
37,-0.20826
38,-0.20826
39,5.947
40,-0.20826
41,-0.20826
42,-0.20826
43,-0.20826
44,-0.20826
45,-0.20826
46,-0.20826
47,-0.20826
48,-0.20826
49,-0.20826
50,-0.20826
51,-0.20826
52,-0.20826
53,-0.20826
54,-0.20826
55,-0.20826
56,-0.20826
57,-0.20826
58,-0.20826
59,-0.20826
60,-0.20826
61,-0.20826
62,-0.20826
63,-0.20826
64,-0.20826
65,-0.20826
66,-0.20826
67,-0.20826
68,-0.20826
69,-0.20826
70,-0.20826
71,-0.20826
72,-0.20826
73,0.2689
74,5.0404
75,-0.20826
76,-0.20826
77,1.9866
78,-0.20826
79,-0.20826
80,-0.20826
81,-0.20826
82,-0.20826
83,-0.20826
84,-0.20826
85,-0.20826
86,-0.20826
87,-0.20826
88,-0.20826
89,0.030319
90,0.030319
91,-0.11283
92,-0.20826
93,-0.20826
94,-0.20826
95,-0.20826
