time,value
0,1.8785
1,1.8375
2,1.7523
3,1.6721
4,1.5623
5,1.4534
6,1.3436
7,1.2359
8,1.1284
9,1.0237
10,0.92043
11,0.81871
12,0.7226899999999999
13,0.62483
14,0.52895
15,0.4352
16,0.34378000000000003
17,0.25314000000000003
18,0.17873
19,0.090151
20,-0.0011899
21,-0.08769199999999999
22,-0.16496
23,-0.25256999999999996
24,-0.33050999999999997
25,-0.40507
26,-0.48651000000000005
27,-0.55302
28,-0.62669
29,-0.69896
30,-0.7577
31,-0.81884
32,-0.8796700000000001
33,-0.9313
34,-0.9825
35,-1.0307
36,-1.073
37,-1.1252
38,-1.1548
39,-1.1944
40,-1.2272
41,-1.2354
42,-1.2536
43,-1.2641
44,-1.2668
45,-1.2619
46,-1.2492
47,-1.229
48,-1.2014
49,-1.1839
50,-1.1425
51,-1.111
52,-1.073
53,-1.0161
54,-0.9638100000000001
55,-0.9087700000000001
56,-0.85774
57,-0.79668
58,-0.72848
59,-0.66833
60,-0.59229
61,-0.52078
62,-0.44038
63,-0.37129
64,-0.28681999999999996
65,-0.20805
66,-0.12627
67,-0.041759
68,0.052754999999999996
69,0.1417
70,0.22618000000000002
71,0.31733
72,0.40907
73,0.50625
74,0.60002
75,0.68886
76,0.7761600000000001
77,0.87277
78,0.9734799999999999
79,1.0761
80,1.1784
81,1.2845
82,1.3938
83,1.5018
84,1.611
85,1.7199
86,1.7927
87,1.82
88,1.8426
89,1.8072
90,1.7136
91,1.6205
92,1.5105
93,1.4032
94,1.2914
95,1.1843
96,1.0784
97,0.98969
98,0.88833
99,0.78668
100,0.68675
101,0.58863
102,0.49249
103,0.39849
104,0.30682
105,0.21668
106,0.12468
107,0.033671
108,-0.055135
109,-0.14897
110,-0.21045999999999998
111,-0.29941999999999996
112,-0.3779
113,-0.44503000000000004
114,-0.52031
115,-0.59965
116,-0.67572
117,-0.74188
118,-0.81267
119,-0.8793799999999999
120,-0.9277799999999999
121,-0.99885
122,-1.0508
123,-1.0969
124,-1.1397
125,-1.1864
126,-1.2066
127,-1.2373
128,-1.2569
129,-1.2797
130,-1.2770000000000001
131,-1.2842
132,-1.2836
133,-1.2751
134,-1.2589
135,-1.2352
136,-1.2043
137,-1.1717
138,-1.1387
139,-1.1124
140,-1.0567
141,-1.0108
142,-0.9592799999999999
143,-0.9061799999999999
144,-0.8526600000000001
145,-0.78483
146,-0.71859
147,-0.6483899999999999
148,-0.58114
149,-0.50163
150,-0.42755
151,-0.35391999999999996
152,-0.28125
153,-0.20017000000000001
154,-0.11273
155,-0.044212
156,0.050214
157,0.13305999999999998
158,0.22346
159,0.31681
160,0.40213000000000004
161,0.49283999999999994
162,0.59215
163,0.68707
164,0.78251
165,0.8651700000000001
166,0.96699
167,1.0703
168,1.1751
169,1.2811
170,1.3884
171,1.4984
172,1.6075
173,1.7122
174,1.7996
175,1.8539
