time,value
0,0.22938000000000003
1,0.14637999999999998
2,0.05993
3,-0.030577999999999998
4,-0.11400999999999999
5,-0.20359000000000002
6,-0.28394
7,-0.36880999999999997
8,-0.43662
9,-0.44711000000000006
10,-0.35583000000000004
11,-0.43831000000000003
12,-0.5283
13,-0.61488
14,-0.70138
15,-0.7833
16,-0.86334
17,-0.92545
18,-0.9907600000000001
19,-1.0457
20,-1.1099
21,-1.1617
22,-1.226
23,-1.2881
24,-1.3534
25,-1.4065
26,-1.466
27,-1.5123
28,-1.5487
29,-1.5709
30,-1.5722
31,-1.5689
32,-1.5535
33,-1.5373
34,-1.4854
35,-1.4276
36,-1.3495
37,-1.2637
38,-1.1748
39,-1.0675
40,-0.9721200000000001
41,-0.89038
42,-0.81106
43,-0.7478100000000001
44,-0.67497
45,-0.60146
46,-0.51602
47,-0.42301000000000005
48,-0.31747
49,-0.2058
50,-0.099763
51,-0.023108
52,0.027698
53,0.0014876
54,-0.025565
55,-0.09407599999999999
56,-0.15254
57,-0.19361
58,-0.23843000000000003
59,-0.26553000000000004
60,-0.26375
61,-0.19713
62,-0.20013
63,-0.23237
64,-0.2617
65,-0.28465999999999997
66,-0.29338000000000003
67,-0.29861
68,-0.31432
69,-0.32414
70,-0.33255
71,-0.35272
72,-0.36315
73,-0.36506
74,-0.3621
75,-0.37033
76,-0.36322
77,-0.34035
78,-0.2995
79,-0.24375
80,-0.17659
81,-0.065233
82,0.031721
83,0.14459
84,0.26002
85,0.37706
86,0.47200000000000003
87,0.5644600000000001
88,0.62267
89,0.59602
90,0.55779
91,0.5133300000000001
92,0.47468
93,0.44023
94,0.41478999999999994
95,0.41276
96,0.44248000000000004
97,0.513
98,0.57013
99,0.63588
100,0.70858
101,0.80878
102,0.92955
103,1.0273
104,1.1184
105,1.1988
106,1.2432
107,1.2697
108,1.2935
109,1.3219
110,1.3483
111,1.3673
112,1.3817
113,1.3952
114,1.3828
115,1.359
116,1.3424
117,1.3029
118,1.2553
119,1.2055
120,1.1517
121,1.12
122,1.1306
123,1.1791
124,1.2884
125,1.2686
126,1.3861
127,1.5013
128,1.5998
129,1.521
130,1.4679
131,1.4173
132,1.3854
133,1.3835
134,1.3913
135,1.3882
136,1.3683
137,1.3371
138,1.3046
139,1.2643
140,1.228
141,1.1695
142,1.1108
143,1.0385
144,0.9744299999999999
145,0.95495
146,0.9698100000000001
147,0.99166
148,0.9408799999999999
149,0.83839
150,0.73173
151,0.62761
152,0.5433
153,0.46434
154,0.40175
155,0.32566999999999996
156,0.2681
157,0.21252
158,0.15934
159,0.11855
160,0.090018
161,0.063954
162,0.045286
163,0.03809
164,0.045016
165,0.055963
166,0.079933
167,0.096157
168,0.11632
169,0.1329
170,0.14240999999999998
171,0.16334
172,0.18279
173,0.20575
174,0.25261999999999996
175,0.31485
176,0.39438
177,0.4921
178,0.59086
179,0.6906800000000001
180,0.79609
181,0.88812
182,0.82468
183,0.73588
184,0.63183
185,0.52909
186,0.43376000000000003
187,0.33797
188,0.23196
189,0.14062
190,0.042738
191,-0.061176999999999995
192,-0.12933
193,-0.2301
194,-0.3294
195,-0.41575
196,-0.51681
197,-0.6046699999999999
198,-0.6675399999999999
199,-0.74469
200,-0.8339200000000001
201,-0.91305
202,-1.0015
203,-1.0956
204,-1.2005
205,-1.2992
206,-1.4081
207,-1.5193
208,-1.5825
209,-1.6199
210,-1.6653
211,-1.6941
212,-1.704
213,-1.7162
214,-1.7148
215,-1.7061
216,-1.6922
217,-1.6601
218,-1.6334
219,-1.6015
220,-1.5598
221,-1.5248
222,-1.4694
223,-1.4085
224,-1.3475
225,-1.2844
226,-1.2305
227,-1.1624
228,-1.0959999999999999
229,-1.0348
230,-0.9699399999999999
231,-0.90915
232,-0.84183
233,-0.77258
234,-0.6945600000000001
235,-0.61368
236,-0.53015
237,-0.43693999999999994
238,-0.35495
239,-0.26443
240,-0.17435
241,-0.08963
242,0.0036978000000000002
243,0.093515
244,0.19525
245,0.29675999999999997
246,0.40094
247,0.39313000000000003
248,0.45197
249,0.51498
250,0.45153000000000004
251,0.39113000000000003
252,0.2888
253,0.15875999999999998
254,0.029907999999999997
255,-0.097915
256,-0.20265999999999998
257,-0.27971
258,-0.28639000000000003
259,-0.26034
260,-0.36735
261,-0.48203
262,-0.58527
263,-0.69417
264,-0.8206700000000001
265,-0.9338200000000001
266,-1.0406
267,-1.1552
268,-1.2672
269,-1.3624
270,-1.4807
271,-1.5859999999999999
272,-1.676
273,-1.735
274,-1.7530000000000001
275,-1.7588
276,-1.746
277,-1.7208
278,-1.6653
279,-1.6014
280,-1.4858
281,-1.3671
282,-1.2536
283,-1.1416
284,-1.0314
285,-0.9205200000000001
286,-0.80948
287,-0.70797
288,-0.60445
289,-0.5018199999999999
290,-0.39815
291,-0.28908
292,-0.18704
293,-0.08291699999999999
294,0.022952
295,0.12385
296,0.23776999999999998
297,0.34085
298,0.43554
299,0.53072
300,0.61082
301,0.63899
302,0.6035
303,0.59332
304,0.67305
305,0.7884800000000001
306,0.89115
307,0.99666
308,1.0934
309,1.1906
310,1.2319
311,1.1438
312,1.067
313,1.0147
314,0.9696600000000001
315,0.89112
316,0.81953
317,0.75331
318,0.69693
319,0.6647
320,0.68496
321,0.72577
322,0.81497
323,0.92532
324,1.0381
325,1.1298
326,1.2431
327,1.3383
328,1.4521
329,1.5871
330,1.7232
331,1.8588
332,1.8804
333,1.8088
334,1.8005
335,1.8730000000000002
336,1.9745
337,2.0771
338,2.164
339,2.0706
340,1.954
341,1.9218
342,1.9435
343,1.8077
344,1.7529
345,1.6369
346,1.5212
347,1.3916
348,1.2904
349,1.196
350,1.0895
351,0.9917
352,0.9002399999999999
353,0.81707
354,0.7336699999999999
355,0.6641699999999999
356,0.6128
357,0.5997399999999999
358,0.635
359,0.69016
360,0.74568
361,0.80537
362,0.87064
363,0.95468
364,1.0459
365,1.1081
366,1.2124
367,1.3316
368,1.2544
369,1.1478
370,1.0461
371,0.94381
372,0.82585
373,0.72469
374,0.6854100000000001
375,0.74237
376,0.6664
377,0.56645
378,0.4667
379,0.36551
380,0.27199
381,0.16802
382,0.049464999999999995
383,-0.062053
384,-0.16825
385,-0.28349
386,-0.39458000000000004
387,-0.50384
388,-0.60568
389,-0.7219399999999999
390,-0.8347
391,-0.9405899999999999
392,-1.0444
393,-1.1589
394,-1.2805
395,-1.3776
396,-1.4764
397,-1.5539
398,-1.633
399,-1.6914
400,-1.7421
401,-1.7822
402,-1.7979
403,-1.7781
404,-1.7277
405,-1.6641
406,-1.5624
407,-1.4498
408,-1.3519999999999999
409,-1.2424
410,-1.1296
411,-1.022
412,-0.9208200000000001
413,-0.81803
414,-0.7078300000000001
415,-0.59823
416,-0.4971
417,-0.40118000000000004
418,-0.30782
419,-0.32141
420,-0.21578000000000003
421,-0.11823
422,-0.013996000000000001
423,0.08901
424,0.17272
425,0.2623
426,0.2877
