time,value
0,-0.36713
1,-0.36713
2,-0.36713
3,-0.36713
4,-0.36713
5,-0.36713
6,-0.36713
7,-0.36713
8,-0.36713
9,-0.36713
10,-0.36713
11,-0.36713
12,-0.36713
13,-0.36713
14,-0.36713
15,-0.36713
16,-0.36713
17,-0.36713
18,-0.36713
19,-0.36713
20,-0.36713
21,-0.36713
22,-0.36713
23,-0.36713
24,-0.36713
25,-0.36713
26,-0.36713
27,-0.36713
28,-0.36713
29,-0.36713
30,-0.36713
31,-0.36713
32,-0.36713
33,-0.36713
34,-0.36713
35,-0.36713
36,-0.36713
37,-0.36713
38,-0.36713
39,-0.36713
40,-0.36713
41,-0.36713
42,-0.36713
43,-0.36713
44,-0.36713
45,0.47202
46,2.9792
47,3.2146
48,2.3243
49,0.62552
50,-0.19316
51,-0.22386
52,3.3169
53,2.795
54,-0.36713
55,-0.36713
56,-0.36713
57,-0.36713
58,-0.36713
59,-0.36713
60,-0.36713
61,-0.36713
62,-0.36713
63,-0.36713
64,-0.36713
65,-0.36713
66,-0.36713
67,-0.36713
68,-0.36713
69,-0.36713
70,-0.36713
71,-0.36713
72,-0.36713
73,-0.36713
74,-0.36713
75,-0.36713
76,-0.36713
77,-0.36713
78,-0.36713
79,-0.36713
80,-0.36713
81,-0.36713
82,-0.36713
83,2.9895
84,3.5932
85,0.8404200000000001
86,1.9559
87,-0.19316
88,-0.20339000000000002
89,3.5114
90,1.1986
91,-0.36713
92,-0.36713
93,-0.36713
94,-0.36713
95,-0.36713
