time,value
0,-0.21113
1,-0.27379000000000003
2,1.7782
3,2.9529
4,0.10214
5,0.24311
6,0.27444
7,0.055149000000000004
8,6.8845
9,1.7938
10,-0.085824
11,-0.21113
12,-0.41476
13,-0.41476
14,-0.41476
15,-0.038833
16,-0.2268
17,-0.41476
18,-0.41476
19,-0.38344
20,-0.10149
21,-0.2268
22,-0.41476
23,-0.41476
24,-0.32078
25,-0.24245999999999998
26,-0.21113
27,-0.35211
28,-0.41476
29,-0.27379000000000003
30,3.6735
31,0.36841999999999997
32,0.0081582
33,0.18045999999999998
34,0.023822
35,-0.10149
36,-0.43043000000000003
37,-0.28945
38,-0.28945
39,-0.2268
40,0.44673999999999997
41,1.0576
42,-0.14848
43,-0.10149
44,-0.33644
45,-0.44609
46,-0.46175
47,-0.44609
48,-0.13282
49,-0.17981
50,-0.44609
51,-0.44609
52,-0.46175
53,-0.19547
54,-0.11715
55,-0.44609
56,-0.44609
57,-0.44609
58,-0.30512
59,-0.16414
60,-0.25813
61,-0.44609
62,-0.44609
63,-0.35211
64,-0.27379000000000003
65,-0.27379000000000003
66,-0.28945
67,-0.44609
68,-0.32078
69,-0.30512
70,-0.28945
71,-0.28945
72,-0.21113
73,0.5094
74,2.3890000000000002
75,-0.21113
76,-0.41476
77,-0.44609
78,-0.38344
79,-0.2268
80,-0.25813
81,-0.33644
82,-0.44609
83,-0.43043000000000003
84,-0.2268
85,-0.3991
86,-0.2268
87,-0.3991
88,-0.46175
89,-0.24245999999999998
90,-0.32078
91,1.6685
92,-0.21113
93,-0.41476
94,-0.28945
95,-0.32078
