time,value
0,-0.35129
1,-0.35129
2,-0.35129
3,-0.35129
4,-0.35129
5,-0.35129
6,-0.35129
7,-0.35129
8,-0.35129
9,-0.35129
10,-0.35129
11,-0.35129
12,-0.35129
13,-0.35129
14,-0.35129
15,-0.35129
16,-0.35129
17,-0.35129
18,-0.35129
19,-0.35129
20,-0.35129
21,-0.35129
22,-0.35129
23,-0.35129
24,-0.35129
25,-0.35129
26,-0.35129
27,-0.35129
28,-0.35129
29,-0.35129
30,-0.35129
31,-0.35129
32,-0.35129
33,-0.35129
34,-0.35129
35,-0.35129
36,-0.35129
37,-0.11029000000000001
38,0.8537299999999999
39,-0.35129
40,-0.35129
41,-0.35129
42,-0.35129
43,-0.35129
44,-0.35129
45,-0.35129
46,-0.35129
47,-0.35129
48,-0.35129
49,2.1502
50,4.1115
51,2.7735
52,1.8178
53,3.0062
54,3.0228
55,3.056
56,3.8788
57,3.0394
58,0.33016999999999996
59,-0.33466999999999997
60,-0.35129
61,-0.35129
62,-0.35129
63,-0.35129
64,-0.35129
65,-0.35129
66,-0.35129
67,-0.35129
68,-0.35129
69,-0.35129
70,-0.35129
71,-0.35129
72,-0.35129
73,-0.35129
74,-0.35129
75,-0.35129
76,-0.35129
77,0.22213000000000002
78,-0.10198
79,-0.10198
80,-0.10198
81,-0.11029000000000001
82,-0.35129
83,-0.35129
84,-0.35129
85,-0.35129
86,-0.35129
87,-0.35129
88,-0.35129
89,-0.35129
90,-0.35129
91,-0.35129
92,-0.35129
93,-0.35129
94,-0.35129
95,-0.35129
