time,value
0,2.4723
1,2.3645
2,2.2601
3,2.1479
4,2.0825
5,1.9767
6,1.8649
7,1.7904
8,1.7246
9,1.6237
10,1.5195
11,1.4081
12,1.4079
13,1.3429
14,1.2427
15,1.178
16,1.0661
17,1.0287
18,1.0165
19,0.9495600000000001
20,0.83819
21,0.78535
22,0.66948
23,0.64203
24,0.5795899999999999
25,0.52122
26,0.43076000000000003
27,0.38397
28,0.28028000000000003
29,0.18044000000000002
30,0.17670999999999998
31,0.2378
32,0.2362
33,0.28619
34,0.22125999999999998
35,0.13076
36,0.056305999999999995
37,-0.057498
38,-0.10101
39,-0.24097
40,-0.3613
41,-0.50375
42,-0.53676
43,-0.6633399999999999
44,-0.8006300000000001
45,-0.91661
46,-1.0416
47,-1.0959999999999999
48,-1.187
49,-1.1152
50,-1.0893
51,-0.95496
52,-0.8769399999999999
53,-0.78994
54,-0.69681
55,-0.63029
56,-0.57795
57,-0.46293
58,-0.38893
59,-0.28515
60,-0.19584000000000001
61,-0.16262000000000001
62,-0.045262000000000004
63,0.016234000000000002
64,0.11335
65,0.14307999999999998
66,0.09311799999999999
67,0.019235
68,-0.072699
69,-0.18716
70,-0.17658
71,-0.27212
72,-0.37166
73,-0.48935
74,-0.49271000000000004
75,-0.52705
76,-0.65918
77,-0.7215
78,-0.84241
79,-0.92814
80,-0.9604799999999999
81,-1.0763
82,-1.1875
83,-1.2373
84,-1.2993
85,-1.3846
86,-1.4908
87,-1.5647
88,-1.6775
89,-1.781
90,-1.8507
91,-1.9639
92,-2.0503
93,-2.1241
94,-2.2043
95,-2.2745
96,-2.3471
97,-2.4525
98,-2.5048
99,-2.5163
100,-2.4216
101,-2.3432
102,-2.2678
103,-2.1879
104,-2.1134
105,-2.0395
106,-1.9577
107,-1.8207
108,-1.743
109,-1.6624
110,-1.5706
111,-1.4599
112,-1.3803
113,-1.2868
114,-1.2082
115,-1.1256
116,-1.0287
117,-0.9208700000000001
118,-0.85159
119,-0.74851
120,-0.66781
121,-0.5735600000000001
122,-0.48241000000000006
123,-0.3711
124,-0.26424000000000003
125,-0.15846
126,-0.088326
127,0.0049621000000000005
128,0.10792
129,0.18162999999999999
130,0.2977
131,0.38371
132,0.45058000000000004
133,0.5549
134,0.64146
135,0.73038
136,0.84655
137,0.9508200000000001
138,1.0556
139,1.0564
140,0.9944799999999999
141,0.91235
142,0.8983200000000001
143,0.8343299999999999
144,0.7702399999999999
145,0.81117
146,0.7843
147,0.72739
148,0.68345
149,0.64384
150,0.7045399999999999
151,0.71328
152,0.6753600000000001
153,0.5975699999999999
154,0.5895699999999999
155,0.51342
156,0.47658
157,0.5271399999999999
158,0.55809
159,0.52037
160,0.48389
161,0.4717
162,0.41939
163,0.34455
164,0.28376999999999997
165,0.32272
166,0.37328
167,0.40268000000000004
168,0.37204
169,0.32036
170,0.30066
171,0.2031
172,0.17536
173,0.13787
174,0.048763
175,0.010570999999999999
176,0.044515
177,0.12959
178,0.17275
179,0.26341
180,0.23595
181,0.1905
182,0.19676
183,0.099665
184,0.045885
185,0.054436
186,-0.066332
187,-0.091526
188,-0.17851
189,-0.25985
190,-0.28484
191,-0.36526
192,-0.39493
193,-0.49413
194,-0.57927
195,-0.61742
196,-0.71605
197,-0.81686
198,-0.9290700000000001
199,-0.97606
200,-1.0216
201,-1.1289
202,-1.2342
203,-1.3323
204,-1.2348
205,-1.1034
206,-0.97277
207,-0.84509
208,-0.72213
209,-0.5973
210,-0.46447
211,-0.34065
212,-0.21204
213,-0.088449
214,0.043345
215,0.16504000000000002
216,0.29178000000000004
217,0.42923
218,0.56092
219,0.68665
220,0.82568
221,0.96044
222,1.0875
223,1.2246
224,1.3643
225,1.4855
226,1.617
227,1.7133
228,1.8399
229,1.9616
230,2.092
231,2.1989
232,2.2947
233,2.2352
234,2.1964
235,2.0962
236,2.0084
237,1.8828
238,1.7513
239,1.6157
240,1.4792
241,1.3401
242,1.2362
243,1.1001
244,0.9769899999999999
245,0.8446
246,0.73621
247,0.5964
248,0.46143999999999996
249,0.33416999999999997
250,0.19559
251,0.070203
252,-0.053087
253,-0.17833
254,-0.30616
255,-0.44322
256,-0.5696399999999999
257,-0.69522
258,-0.82027
259,-0.90807
260,-1.0383
261,-1.1640000000000001
262,-1.2852
263,-1.2619
264,-1.1648
265,-1.0659
266,-0.9827600000000001
267,-0.88415
268,-0.7973600000000001
269,-0.7490000000000001
270,-0.6431899999999999
271,-0.55876
272,-0.5050399999999999
273,-0.42723999999999995
274,-0.37145
275,-0.34243
276,-0.26709
277,-0.23106999999999997
278,-0.14817
279,-0.080321
280,-0.091976
281,-0.023315
282,0.044179
283,0.11020999999999999
284,0.11112999999999999
285,0.092972
286,0.10565999999999999
287,0.10752
288,0.05538099999999999
289,-0.0053671000000000005
290,-0.13341
291,-0.17917
292,-0.11574000000000001
293,-0.023791
294,0.041177
295,0.025086
296,0.11852
297,0.11285999999999999
298,0.16093
299,0.18374000000000001
300,0.10919000000000001
301,-0.015392
302,0.0071671999999999994
303,0.11193
304,0.053021000000000006
305,0.1408
306,0.13764
307,0.18337
308,0.1263
309,0.019381
310,0.053388
311,0.1409
312,0.14229
313,0.19477
314,0.23485
315,0.14015999999999998
316,0.15713
317,0.23779
318,0.24323000000000003
319,0.31656
320,0.28434
321,0.34965999999999997
322,0.39762
323,0.49425
324,0.50774
325,0.59814
326,0.65895
327,0.74643
328,0.76651
329,0.65305
330,0.51432
331,0.40046
332,0.25938
333,0.15525
334,0.088918
335,-0.053583000000000006
336,-0.16879
337,-0.26697
338,-0.38514
339,-0.45333
340,-0.58022
341,-0.66915
342,-0.79656
343,-0.89544
344,-1.0221
345,-1.1131
346,-1.1979
347,-1.3178
348,-1.3678
349,-1.3401
350,-1.301
351,-1.1608
352,-1.034
353,-0.9617700000000001
354,-0.8502200000000001
355,-0.78854
356,-0.7971
357,-0.7316600000000001
358,-0.62836
359,-0.5038199999999999
360,-0.4936
361,-0.38327
362,-0.28423000000000004
363,-0.26414
364,-0.27086
365,-0.36438000000000004
366,-0.49918999999999997
367,-0.63576
368,-0.74944
369,-0.8618100000000001
370,-0.9680700000000001
371,-1.041
372,-1.0607
373,-1.0757
374,-1.1198
375,-1.0323
376,-0.9607700000000001
377,-0.8369700000000001
378,-0.75015
379,-0.6923199999999999
380,-0.5761
381,-0.45856
382,-0.38511
383,-0.33421
384,-0.21325
385,-0.094413
386,-0.025062
387,0.075438
388,0.18101
389,0.27994
390,0.29836999999999997
391,0.26275
392,0.27726
393,0.24185
394,0.1936
395,0.29491
396,0.38366999999999996
397,0.48528999999999994
398,0.49536
399,0.59477
400,0.70014
401,0.74926
402,0.8427
403,0.8281299999999999
404,0.8184
405,0.79213
406,0.89879
407,1.0161
408,1.0421
409,1.1589
410,1.2113
411,1.285
412,1.2571
413,1.2367
414,1.354
415,1.4680000000000002
416,1.5346
417,1.6297
418,1.6243
419,1.7336
420,1.8199
421,1.8938
422,1.956
423,2.0726
424,2.1888
425,2.3183
426,2.4265
