time,value
0,-1.1334
1,-1.0312
2,-0.9008200000000001
3,-0.74751
4,-0.5786
5,-0.40469
6,-0.23033
7,-0.057712
8,0.11287
9,0.27906
10,0.44158000000000003
11,0.6008100000000001
12,0.75585
13,0.90266
14,1.0398
15,1.1682
16,1.2888
17,1.4009
18,1.5045
19,1.6009
20,1.6896
21,1.7669
22,1.8291
23,1.8756
24,1.9058
25,1.9188
26,1.9145
27,1.8972
28,1.8709
29,1.8381
30,1.8001
31,1.7606
32,1.7217
33,1.6841
34,1.6461
35,1.6096
36,1.5754
37,1.5438
38,1.5127
39,1.4838
40,1.4576
41,1.4348
42,1.4136
43,1.3961
44,1.3837
45,1.3769999999999998
46,1.3739
47,1.3757
48,1.3815
49,1.39
50,1.3973
51,1.4046
52,1.4114
53,1.4175
54,1.4204
55,1.4227
56,1.4247
57,1.4255
58,1.4219
59,1.4153
60,1.4057
61,1.3922
62,1.3727
63,1.3502
64,1.3269
65,1.3030000000000002
66,1.2767
67,1.2494
68,1.2221
69,1.1935
70,1.161
71,1.1257
72,1.0898
73,1.0533
74,1.0147
75,0.97396
76,0.93253
77,0.88881
78,0.8406
79,0.78727
80,0.73182
81,0.67464
82,0.61573
83,0.55501
84,0.49562
85,0.43686
86,0.37731
87,0.315
88,0.25298000000000004
89,0.19121
90,0.12987
91,0.067799
92,0.009324700000000002
93,-0.045619
94,-0.09788200000000001
95,-0.15016
96,-0.20006
97,-0.24841999999999997
98,-0.29632
99,-0.34575
100,-0.39352
101,-0.43893000000000004
102,-0.48223
103,-0.52508
104,-0.5651
105,-0.6018600000000001
106,-0.6360399999999999
107,-0.6690699999999999
108,-0.69858
109,-0.72323
110,-0.74346
111,-0.76126
112,-0.77644
113,-0.78957
114,-0.80304
115,-0.81965
116,-0.8391700000000001
117,-0.8598100000000001
118,-0.8809
119,-0.9021
120,-0.92176
121,-0.9374299999999999
122,-0.9493799999999999
123,-0.9589700000000001
124,-0.9671799999999999
125,-0.97309
126,-0.97782
127,-0.98269
128,-0.9888100000000001
129,-0.99471
130,-1.0008
131,-1.0076
132,-1.0159
133,-1.0235
134,-1.0304
135,-1.0368
136,-1.044
137,-1.0508
138,-1.0579
139,-1.0659
140,-1.0758
141,-1.0859999999999999
142,-1.0958
143,-1.1044
144,-1.112
145,-1.1173
146,-1.1198
147,-1.1199
148,-1.1186
149,-1.1156
150,-1.1106
151,-1.1039
152,-1.0968
153,-1.0894
154,-1.0818
155,-1.0744
156,-1.0686
157,-1.0646
158,-1.0615
159,-1.0589
160,-1.0569
161,-1.0553
162,-1.0529
163,-1.0491
164,-1.0445
165,-1.0399
166,-1.0348
167,-1.0293
168,-1.0242
169,-1.0209
170,-1.0188
171,-1.018
172,-1.0188
173,-1.0219
174,-1.0262
175,-1.0308
176,-1.0349
177,-1.0384
178,-1.0396
179,-1.0377
180,-1.0322
181,-1.0243
182,-1.0133
183,-0.9984700000000001
184,-0.97898
185,-0.9549700000000001
186,-0.9238200000000001
187,-0.8834700000000001
188,-0.83299
189,-0.7751
190,-0.71126
191,-0.64354
192,-0.5745399999999999
193,-0.5087
194,-0.44728999999999997
195,-0.38974000000000003
196,-0.33548
197,-0.28619
198,-0.24258000000000002
199,-0.20412
200,-0.17099
201,-0.14479
202,-0.12596
203,-0.11254000000000002
204,-0.10344
205,-0.099628
206,-0.10314000000000001
207,-0.11449000000000001
208,-0.13499
209,-0.16592
210,-0.20748000000000003
211,-0.25609
212,-0.30756
213,-0.35759
214,-0.40286
215,-0.43948999999999994
216,-0.46536000000000005
217,-0.4793
218,-0.48067
219,-0.46736000000000005
220,-0.43705
221,-0.38706999999999997
222,-0.31532
223,-0.22025999999999998
224,-0.10287
225,0.033227
226,0.18181
227,0.33542
228,0.48553999999999997
229,0.6242800000000001
230,0.74536
231,0.8456299999999999
232,0.92374
233,0.98013
234,1.0161
235,1.0346
236,1.0382
237,1.0293
238,1.0098
239,0.98308
240,0.95095
241,0.91355
242,0.8690399999999999
243,0.81567
244,0.75053
245,0.67072
246,0.5746600000000001
247,0.46438999999999997
248,0.34374
249,0.21665
250,0.08645900000000001
251,-0.04357
252,-0.17131
253,-0.29625999999999997
254,-0.41803999999999997
255,-0.53488
256,-0.6439199999999999
257,-0.74328
258,-0.83236
259,-0.9118
260,-0.9829700000000001
261,-1.0484
262,-1.1099
263,-1.1669
264,-1.2163
265,-1.2548
266,-1.2802
267,-1.2927
268,-1.2932
269,-1.2866
