time,value
0,-0.1727
1,-0.37488
2,-0.1727
3,-0.37488
4,-0.1727
5,-0.37488
6,-0.1727
7,-0.37488
8,-0.1727
9,-0.37488
10,-0.1727
11,-0.37488
12,-0.1727
13,-0.37488
14,-0.1727
15,-0.37488
16,-0.1727
17,-0.37488
18,-0.1727
19,-0.37488
20,-0.1727
21,-0.1727
22,-0.37488
23,-0.1727
24,-0.37488
25,-0.1727
26,-0.37488
27,-0.1727
28,-0.37488
29,-0.1727
30,-0.37488
31,-0.1727
32,-0.37488
33,-0.1727
34,-0.37488
35,-0.1727
36,-0.37488
37,-0.1727
38,-0.37488
39,-0.1727
40,-0.37488
41,-0.1727
42,-0.37488
43,-0.1727
44,-0.37488
45,-0.1727
46,-0.37488
47,-0.1727
48,-0.37488
49,-0.1727
50,-0.37488
51,-0.1727
52,-0.37488
53,-0.1727
54,-0.37488
55,-0.1727
56,-0.37488
57,-0.1727
58,-0.37488
59,-0.1727
60,-0.37488
61,-0.1727
62,-0.37488
63,-0.1727
64,-0.37488
65,-0.1727
66,-0.37488
67,-0.1727
68,-0.37488
69,-0.1727
70,-0.37488
71,-0.1727
72,-0.37488
73,-0.1727
74,-0.37488
75,-0.1727
76,-0.37488
77,-0.1727
78,-0.37488
79,-0.1727
80,-0.37488
81,-0.1727
82,-0.37488
83,-0.1727
84,3.0623
85,3.4666
86,3.6688
87,3.6688
88,4.2754
89,4.2754
90,1.6469999999999998
91,-0.1727
92,-0.37488
93,-0.1727
94,-0.37488
95,-0.1727
