time,value
0,-2.8738
1,-2.8760000000000003
2,-2.8887
3,-2.8887
4,-2.8909
5,-2.8725
6,-2.8560000000000003
7,-2.8371
8,-2.8206
9,-2.8016
10,-2.7851
11,-2.7772
12,-2.7628
13,-2.7439999999999998
14,-2.7275
15,-2.7087
16,-2.6899
17,-2.6732
18,-2.6543
19,-2.6439999999999997
20,-2.6291
21,-2.6126
22,-2.5939
23,-2.5772
24,-2.5584
25,-2.5419
26,-2.5231
27,-2.5127
28,-2.4977
29,-2.4789
30,-2.4622
31,-2.4434
32,-2.4328
33,-2.4177
34,-2.4014
35,-2.3823
36,-2.3659
37,-2.3472
38,-2.3365
39,-2.3237
40,-2.307
41,-2.2883
42,-2.2769999999999997
43,-2.2599
44,-2.2409
45,-2.2246
46,-2.2146
47,-2.1979
48,-2.1808
49,-2.1687
50,-2.1546
51,-2.1415
52,-2.1307
53,-2.1129
54,-2.1008
55,-2.0869
56,-2.0753
57,-2.0622
58,-2.0488
59,-2.0379
60,-2.0229
61,-2.0088
62,-1.9923
63,-1.9774
64,-1.9669
65,-1.9519
66,-1.9376
67,-1.9238
68,-1.9089
69,-1.8911
70,-1.8788
71,-1.8630000000000002
72,-1.8477
73,-1.8314
74,-1.8162
75,-1.8034
76,-1.7849
77,-1.7741
78,-1.7591
79,-1.7428
80,-1.7311
81,-1.7214
82,-1.7029
83,-1.6898
84,-1.6749
85,-1.6586
86,-1.6468
87,-1.6274
88,-1.6103
89,-1.5949
90,-1.5787
91,-1.5633
92,-1.5506
93,-1.5322
94,-1.5168
95,-1.5036
96,-1.4909
97,-1.4725
98,-1.4615
99,-1.4444
100,-1.4251
101,-1.4153
102,-1.3969
103,-1.382
104,-1.3688
105,-1.3535
106,-1.335
107,-1.3223
108,-1.3091
109,-1.2929
110,-1.2784
111,-1.2647
112,-1.2463
113,-1.2362
114,-1.2204
115,-1.202
116,-1.1909
117,-1.176
118,-1.1598
119,-1.1478
120,-1.136
121,-1.1176
122,-1.1065
123,-1.0916
124,-1.0754
125,-1.0579
126,-1.0469
127,-1.032
128,-1.0145
129,-0.99828
130,-0.9807600000000001
131,-0.96541
132,-0.9522200000000001
133,-0.93729
134,-0.91975
135,-0.9035
136,-0.88592
137,-0.8705200000000001
138,-0.8528899999999999
139,-0.83745
140,-0.8221700000000001
141,-0.8094399999999999
142,-0.79179
143,-0.77412
144,-0.75865
145,-0.74011
146,-0.7246
147,-0.70687
148,-0.6955399999999999
149,-0.68116
150,-0.66565
151,-0.64708
152,-0.63354
153,-0.62139
154,-0.60587
155,-0.5873
156,-0.57175
157,-0.556
158,-0.54165
159,-0.5253
160,-0.50752
161,-0.49459
162,-0.47965
163,-0.46329
164,-0.44551
165,-0.434
166,-0.41683000000000003
167,-0.40667
168,-0.38893
169,-0.3734
170,-0.35623
171,-0.34467
172,-0.32915
173,-0.31139
174,-0.29503
175,-0.27725
176,-0.26088
177,-0.24939
178,-0.23383
179,-0.21603000000000003
180,-0.19966
181,-0.18184
182,-0.16624
183,-0.14839000000000002
184,-0.13277
185,-0.1149
186,-0.097013
187,-0.081353
188,-0.0642
189,-0.048514
190,-0.044032
191,-0.028332999999999997
192,-0.021602
193,-0.005891899999999999
194,0.012075
195,0.02854
196,0.04045
197,0.056163
198,0.07336000000000001
199,0.08455700000000001
200,0.10026
201,0.11822
202,0.13468
203,0.15114
204,0.15412
205,0.1721
206,0.18334
207,0.18864
208,0.20439000000000002
209,0.22169
210,0.23521999999999998
211,0.23479
212,0.23339000000000001
213,0.22787
214,0.22448
215,0.22179000000000001
216,0.21422
217,0.2074
218,0.19280999999999998
219,0.18508
220,0.1778
221,0.16454000000000002
222,0.15402000000000002
223,0.13849
224,0.12575
225,0.11193
226,0.10042000000000001
227,0.085472
228,0.07228
229,0.061979
230,0.047075
231,0.038573
232,0.021376
233,0.011193999999999999
234,-0.0054549
235,-0.020347
236,-0.029945999999999997
237,-0.048902
238,-0.061486
239,-0.07335499999999999
240,-0.08948500000000001
241,-0.10845
242,-0.12155999999999999
243,-0.13288
244,-0.15132
245,-0.16745
246,-0.18642
247,-0.19899999999999998
248,-0.20623000000000002
249,-0.22289
250,-0.24134
251,-0.258
252,-0.26573
253,-0.28188
254,-0.30033000000000004
255,-0.31647
256,-0.3303
257,-0.34413
258,-0.35565
259,-0.36946
260,-0.38611999999999996
261,-0.39621999999999996
262,-0.4111
263,-0.42163999999999996
264,-0.4378
265,-0.45498
266,-0.46263999999999994
267,-0.48112
268,-0.49778999999999995
269,-0.5149699999999999
270,-0.52671
271,-0.54289
272,-0.56188
273,-0.57805
274,-0.59291
275,-0.60233
276,-0.62133
277,-0.6338699999999999
278,-0.64556
279,-0.6622399999999999
280,-0.68124
281,-0.6937800000000001
282,-0.70727
283,-0.72396
284,-0.73743
285,-0.75088
286,-0.7601100000000001
287,-0.77494
288,-0.79164
289,-0.8012600000000001
290,-0.81839
291,-0.8236899999999999
292,-0.8268399999999999
293,-0.83704
294,-0.84015
295,-0.8397100000000001
296,-0.83686
297,-0.8336
298,-0.83362
299,-0.8202200000000001
300,-0.81771
301,-0.80129
302,-0.7831100000000001
303,-0.78012
304,-0.76683
305,-0.75872
306,-0.7481899999999999
307,-0.73712
308,-0.71829
309,-0.70204
310,-0.68321
311,-0.66673
312,-0.6479
313,-0.63697
314,-0.62815
315,-0.60949
316,-0.60007
317,-0.58829
318,-0.57886
319,-0.56472
320,-0.54823
321,-0.52937
322,-0.5128699999999999
323,-0.49401999999999996
324,-0.47752
325,-0.45866
326,-0.44216000000000005
327,-0.42312
328,-0.40444
329,-0.38794
330,-0.3689
331,-0.3524
332,-0.33354
333,-0.31703000000000003
334,-0.29834
335,-0.28165999999999997
336,-0.2628
337,-0.24645999999999998
338,-0.22759000000000001
339,-0.21108000000000002
340,-0.20495
341,-0.18859
342,-0.17207
343,-0.1532
344,-0.13668
345,-0.12487999999999999
346,-0.11308
347,-0.10835999999999998
348,-0.091843
349,-0.072962
350,-0.05644400000000001
351,-0.037563
352,-0.021044999999999998
353,-0.0021639
354,0.014357
355,0.024364
356,0.027949
357,0.040231
358,0.059097000000000004
359,0.07560599999999999
360,0.094475
361,0.11115
362,0.13002
363,0.1423
364,0.15478
365,0.17128
366,0.19032000000000002
367,0.20681999999999998
368,0.21932
369,0.23164
370,0.2389
371,0.25304
372,0.25776
373,0.2768
374,0.29311
375,0.31196999999999997
376,0.31904
377,0.32847
378,0.34552
379,0.36475
380,0.37200000000000005
381,0.38869000000000004
382,0.40519
383,0.42423
384,0.44308000000000003
385,0.45958000000000004
386,0.47843
387,0.49493000000000004
388,0.5053
389,0.5151100000000001
390,0.53396
391,0.5504600000000001
392,0.56931
393,0.5858
394,0.60465
395,0.62115
396,0.64
397,0.6565
398,0.67535
399,0.69439
400,0.7108899999999999
401,0.72956
402,0.7460600000000001
403,0.7649199999999999
404,0.78142
405,0.80028
406,0.80499
407,0.82385
408,0.82857
409,0.8474299999999999
410,0.86393
411,0.88279
412,0.89423
413,0.90602
414,0.9248799999999999
415,0.9366700000000001
416,0.9511700000000001
417,0.96767
418,0.98654
419,1.0032
420,1.0159
421,1.028
422,1.0471
423,1.0552
424,1.0696
425,1.0861
426,1.1049
427,1.1238
428,1.1403
429,1.1591
430,1.1756
431,1.1945
432,1.2109999999999999
433,1.2195
434,1.2333
435,1.2522
436,1.2687
437,1.2875
438,1.304
439,1.3229
440,1.3418
441,1.3583
442,1.3729
443,1.3827
444,1.4016
445,1.4181
446,1.4269999999999998
447,1.4385
448,1.443
449,1.4422
450,1.4421
451,1.4409999999999998
452,1.4242
453,1.421
454,1.4021
455,1.3831
456,1.3666
457,1.3609
458,1.3444
459,1.3255
460,1.3088
461,1.29
462,1.2734
463,1.2678
464,1.2513
465,1.2322
466,1.2268
467,1.2123
468,1.2026
469,1.1837
470,1.1648
471,1.1576
472,1.1387
473,1.1222
474,1.1174
475,1.1143
476,1.1
477,1.0833
478,1.0733
479,1.0567
480,1.0378
481,1.0213
482,1.0024
483,0.9834799999999999
484,0.96686
485,0.94796
486,0.9426899999999999
487,0.9237799999999999
488,0.90717
489,0.88826
490,0.87165
491,0.86416
492,0.84762
493,0.82865
494,0.81204
495,0.80462
496,0.7880699999999999
497,0.7691100000000001
498,0.75242
499,0.74516
500,0.7331300000000001
501,0.72125
502,0.70233
503,0.68579
504,0.66685
505,0.6503
506,0.64075
507,0.6359600000000001
508,0.6170399999999999
509,0.60048
510,0.58391
511,0.5744199999999999
512,0.55787
513,0.53896
514,0.52241
515,0.50349
516,0.48694
517,0.46803
518,0.45148
519,0.43256999999999995
520,0.41602
521,0.40895
522,0.39241
523,0.3735
524,0.35695
525,0.33804
526,0.31914000000000003
527,0.31453000000000003
528,0.29562
529,0.27907
530,0.26018
531,0.24366
532,0.23440999999999998
533,0.21786
534,0.19895
535,0.1824
536,0.16349
537,0.14699
538,0.12807000000000002
539,0.10916
540,0.092706
541,0.083509
542,0.067022
543,0.053026
544,0.043848000000000005
545,0.025016999999999998
546,0.018241
547,0.0067751
548,-0.0021969000000000003
549,-0.016058000000000003
550,-0.019985
551,-0.036142
552,-0.040202
553,-0.058945000000000004
554,-0.074887
555,-0.083712
556,-0.092337
557,-0.10379000000000001
558,-0.11069000000000001
559,-0.10979000000000001
560,-0.11355
561,-0.11982999999999999
562,-0.12049000000000001
563,-0.12004000000000001
564,-0.12312999999999999
565,-0.1229
566,-0.12092
567,-0.1204
568,-0.11617999999999999
569,-0.09892100000000001
570,-0.09046699999999999
571,-0.07169299999999999
572,-0.054978
573,-0.036204
574,-0.022119999999999997
575,-0.013061000000000001
576,0.0033591000000000003
577,0.022421
578,0.036788
579,0.047961000000000004
580,0.064376
581,0.083436
582,0.095765
583,0.1028
584,0.12215999999999999
585,0.13919
586,0.14653
587,0.1559
588,0.16935999999999998
589,0.18517
590,0.1969
591,0.20540999999999998
592,0.22418000000000002
593,0.2406
594,0.25938
595,0.27581
596,0.29458
597,0.31308
598,0.32482
599,0.33629000000000003
600,0.34279
601,0.36078000000000005
602,0.36756
603,0.38636
604,0.40281
605,0.42161000000000004
606,0.43806000000000006
607,0.45686000000000004
608,0.47306000000000004
609,0.49187
610,0.51043
611,0.51367
612,0.53249
613,0.54896
614,0.5677800000000001
615,0.58402
616,0.6028399999999999
617,0.61931
618,0.6381399999999999
619,0.65461
620,0.66167
621,0.67579
622,0.69226
623,0.6993199999999999
624,0.71132
625,0.72544
626,0.73485
627,0.74662
628,0.7628699999999999
629,0.77357
630,0.78492
631,0.80376
632,0.82025
633,0.83909
634,0.84506
635,0.86175
636,0.87823
637,0.89707
638,0.9137700000000001
639,0.9326
640,0.95144
641,0.9679200000000001
642,0.97841
643,0.99061
644,1.0094
645,1.0259
646,1.045
647,1.0615
648,1.0803
649,1.0968
650,1.1156
651,1.1319
652,1.1507
653,1.1693
654,1.1728
655,1.1917
656,1.2082
657,1.227
658,1.2433
659,1.262
660,1.2679
661,1.2868
662,1.3033
663,1.3221
664,1.3347
665,1.3495
666,1.3531
667,1.3558
668,1.3723
669,1.3794
670,1.3955
671,1.399
672,1.413
673,1.4201
674,1.4295
675,1.4436
676,1.4627
677,1.4685
678,1.4852
679,1.5019
680,1.5104
681,1.5292
682,1.5457
683,1.5647
684,1.5812
685,1.6001
686,1.6166
687,1.6354
688,1.6519
689,1.6707
690,1.679
691,1.6957
692,1.6983
693,1.704
694,1.7072
695,1.7085
696,1.7026
697,1.7005
698,1.6866
699,1.6701
700,1.6513
701,1.6349
702,1.6159999999999999
703,1.5996
704,1.5808
705,1.5643
706,1.5455
707,1.5344
708,1.5237
709,1.5072
710,1.4887
711,1.4699
712,1.4589
713,1.45
714,1.4336
715,1.4148
716,1.4095
717,1.4051
718,1.4036
719,1.3942
720,1.3778
721,1.3637
722,1.3649
723,1.3646
724,1.3613
725,1.3448
726,1.3263
727,1.3122
728,1.3052
729,1.2981
730,1.2864
731,1.27
732,1.2512
733,1.2345
734,1.216
735,1.1995
736,1.1808
737,1.1643
738,1.1456
739,1.1268
740,1.1104
741,1.1051
742,1.0936
743,1.0749
744,1.0585
745,1.04
746,1.0236
747,1.0049
748,0.9940700000000001
749,0.98362
750,0.9672299999999999
751,0.94881
752,0.9300799999999999
753,0.92437
754,0.91133
755,0.8952899999999999
756,0.8880100000000001
757,0.8766700000000001
758,0.8579700000000001
759,0.8416100000000001
760,0.82291
761,0.8137800000000001
762,0.7950699999999999
763,0.77871
764,0.7600100000000001
765,0.75749
766,0.73917
767,0.72049
768,0.70452
769,0.69902
770,0.6826800000000001
771,0.6640199999999999
772,0.6543
773,0.64112
774,0.62478
775,0.60611
776,0.58978
777,0.57112
778,0.55479
779,0.53613
780,0.51981
781,0.50116
782,0.48251000000000005
783,0.4662
784,0.45921000000000006
785,0.44755
786,0.4359
787,0.4196
788,0.40096
789,0.38466
790,0.36835999999999997
791,0.35904
792,0.35014
793,0.33468000000000003
794,0.31690999999999997
795,0.31079
796,0.29452
797,0.27592
798,0.25966
799,0.24151
800,0.22480999999999998
801,0.20623000000000002
802,0.18997
803,0.17185
804,0.15561
805,0.14861
806,0.13795
807,0.11942
808,0.10368
809,0.08515
810,0.0788
811,0.065913
812,0.06250599999999999
813,0.0502
814,0.0459
815,0.030302999999999997
816,0.017558
817,0.015678
818,-0.0027149
819,-0.018248
820,-0.036625
821,-0.052134
822,-0.057874
823,-0.06640399999999999
824,-0.073773
825,-0.09146699999999999
826,-0.095885
827,-0.093204
828,-0.090677
829,-0.087476
830,-0.084882
831,-0.080937
832,-0.07398300000000001
833,-0.060627999999999994
834,-0.044769
835,-0.025967
836,-0.010094
837,0.0023301
838,0.022483000000000003
839,0.038344
840,0.056482000000000004
841,0.065052
842,0.070528
843,0.084786
844,0.10288
845,0.11872
846,0.13751
847,0.15269000000000002
848,0.17082
849,0.1867
850,0.20551
851,0.22366999999999998
852,0.23956
853,0.25319
854,0.26227
855,0.27494
856,0.28534
857,0.30482
858,0.31033
859,0.32333
860,0.33925
861,0.35063
862,0.36201
863,0.38022
864,0.39616999999999997
865,0.40554
866,0.42376
867,0.4397
868,0.45793999999999996
869,0.4739
870,0.49215
871,0.50812
872,0.51663
873,0.52805
874,0.54632
875,0.5492100000000001
876,0.5681
877,0.58409
878,0.5929300000000001
879,0.60892
880,0.62551
881,0.63237
882,0.64607
883,0.65461
884,0.6654399999999999
885,0.67687
886,0.69288
887,0.69975
888,0.71178
889,0.73068
890,0.7467
891,0.75942
892,0.77603
893,0.79493
894,0.81324
895,0.82926
896,0.84257
897,0.85859
898,0.8774799999999999
899,0.89351
900,0.91012
901,0.9182600000000001
902,0.9365600000000001
903,0.95258
904,0.9709
905,0.98692
906,1.0052
907,1.0213
908,1.0396
909,1.058
910,1.074
911,1.0924
912,1.1084
913,1.1199
914,1.1291
915,1.136
916,1.1520000000000001
917,1.171
918,1.1772
919,1.1939
920,1.1979
921,1.2025
922,1.2073
923,1.2064
924,1.198
925,1.2001
926,1.2051
927,1.2008
928,1.1826
929,1.1667
930,1.1485
931,1.1326
932,1.1144
933,1.1034
934,1.09
935,1.0735
936,1.0553
937,1.0371
938,1.0212
939,1.0031
940,0.98655
941,0.9684
942,0.9525299999999999
943,0.9344
944,0.9185399999999999
945,0.9004200000000001
946,0.8845700000000001
947,0.8664700000000001
948,0.8506299999999999
949,0.83255
950,0.81742
951,0.7993600000000001
952,0.79018
953,0.78175
954,0.76372
955,0.7479600000000001
956,0.72995
957,0.7142
958,0.70157
959,0.68887
960,0.67087
961,0.65512
962,0.63713
963,0.6214
964,0.60343
965,0.5854699999999999
966,0.56976
967,0.55108
968,0.53538
969,0.5204300000000001
970,0.51147
971,0.49203
972,0.47708
973,0.4696
974,0.46065
975,0.45021000000000005
976,0.43378
977,0.41512
978,0.39947
979,0.38522
980,0.3695
981,0.35385
982,0.33596
983,0.31955
984,0.30169
985,0.28607
986,0.26824000000000003
987,0.25264000000000003
988,0.23911999999999997
989,0.22705999999999998
990,0.20922
991,0.19363
992,0.17582
993,0.15803
994,0.14247
995,0.1247
996,0.10835
997,0.0906
998,0.07508300000000001
999,0.057361
1000,0.041868999999999996
1001,0.024178
1002,0.008709100000000001
1003,-0.0081049
1004,-0.013505000000000001
1005,-0.021922
1006,-0.036438
1007,-0.054003999999999996
1008,-0.060541
1009,-0.06969500000000001
1010,-0.08627699999999999
1011,-0.08609299999999999
1012,-0.09297000000000001
1013,-0.10728
1014,-0.12372999999999999
1015,-0.12713
1016,-0.12797
1017,-0.13013
1018,-0.14095
1019,-0.14959
1020,-0.16591
1021,-0.18100000000000002
1022,-0.19608
1023,-0.19448
1024,-0.20536999999999997
1025,-0.20576999999999998
1026,-0.21341
1027,-0.21893
1028,-0.23278000000000001
1029,-0.23709000000000002
1030,-0.24450999999999998
1031,-0.24445999999999998
1032,-0.23692
1033,-0.22821
1034,-0.2205
1035,-0.20965999999999999
1036,-0.19477
1037,-0.18197
1038,-0.16418
1039,-0.1525
1040,-0.13649
1041,-0.12368
1042,-0.10991
1043,-0.09421900000000001
1044,-0.077544
1045,-0.063631
1046,-0.046807
1047,-0.031092
1048,-0.01438
1049,-0.0035569000000000004
1050,0.014258000000000002
1051,0.032086
1052,0.046738999999999996
1053,0.058626
1054,0.073268
1055,0.090028
1056,0.1058
1057,0.1226
1058,0.13122
1059,0.147
1060,0.1617
1061,0.17961
1062,0.19435
1063,0.21122
1064,0.22810999999999998
1065,0.2429
1066,0.25984
1067,0.27466999999999997
1068,0.29051
1069,0.30637
1070,0.32333
1071,0.33385
1072,0.35183000000000003
1073,0.35923
1074,0.37828
1075,0.3931
1076,0.4005
1077,0.41003
1078,0.42277
1079,0.43643000000000004
1080,0.45232
1081,0.46388999999999997
1082,0.47872
1083,0.49461000000000005
1084,0.50302
1085,0.5210100000000001
1086,0.5369
1087,0.55389
1088,0.56543
1089,0.5824
1090,0.5983
1091,0.61421
1092,0.62469
1093,0.64168
1094,0.65869
1095,0.6735899999999999
1096,0.69165
1097,0.70658
1098,0.72365
1099,0.73078
1100,0.7390100000000001
1101,0.74627
1102,0.74936
1103,0.74195
1104,0.74835
1105,0.7495
1106,0.7326699999999999
1107,0.71586
1108,0.70117
1109,0.68523
1110,0.67256
1111,0.65469
1112,0.64294
1113,0.62607
1114,0.6114
1115,0.59355
1116,0.5789
1117,0.56602
1118,0.5523600000000001
1119,0.53563
1120,0.5210100000000001
1121,0.5043300000000001
1122,0.48767
1123,0.47311000000000003
1124,0.45648999999999995
1125,0.44083999999999995
1126,0.42426
1127,0.41256000000000004
1128,0.4014
1129,0.39065
1130,0.37404
1131,0.35952
1132,0.34181999999999996
1133,0.32734
1134,0.31082
1135,0.29291
1136,0.28210999999999997
1137,0.2656
1138,0.25001999999999996
1139,0.23624
1140,0.22336
1141,0.20689000000000002
1142,0.19133
1143,0.17490999999999998
1144,0.1623
1145,0.14822000000000002
1146,0.13385999999999998
1147,0.1163
1148,0.10199
1149,0.087349
1150,0.073228
1151,0.058931
1152,0.04142
1153,0.027168
1154,0.012555
1155,0.00042908
1156,-0.015841
1157,-0.03005
1158,-0.047481
1159,-0.06164
1160,-0.077792
1161,-0.091897
1162,-0.10799
1163,-0.12203
1164,-0.13805
1165,-0.15403
1166,-0.16799
1167,-0.1839
1168,-0.1965
1169,-0.21233000000000002
1170,-0.22221
1171,-0.23009000000000002
1172,-0.23600000000000002
1173,-0.25173
1174,-0.26546
1175,-0.28110999999999997
1176,-0.29611
1177,-0.31168
1178,-0.32721
1179,-0.34076999999999996
1180,-0.35620999999999997
1181,-0.36883
1182,-0.38506999999999997
1183,-0.39854
1184,-0.4139
1185,-0.42728999999999995
1186,-0.44255
1187,-0.45726999999999995
1188,-0.47243999999999997
1189,-0.48568
1190,-0.5022300000000001
1191,-0.5164
1192,-0.53146
1193,-0.54647
1194,-0.561
1195,-0.57591
1196,-0.59024
1197,-0.60658
1198,-0.61956
1199,-0.63434
1200,-0.64722
1201,-0.66188
1202,-0.6761699999999999
1203,-0.69071
1204,-0.70339
1205,-0.7178100000000001
1206,-0.73217
1207,-0.7446699999999999
1208,-0.75889
1209,-0.77128
1210,-0.7865800000000001
1211,-0.7981699999999999
1212,-0.81224
1213,-0.82449
1214,-0.83842
1215,-0.8505299999999999
1216,-0.86431
1217,-0.8762200000000001
1218,-0.8796299999999999
1219,-0.88815
1220,-0.8998799999999999
1221,-0.91505
1222,-0.92684
1223,-0.9369200000000001
1224,-0.9486399999999999
1225,-0.96196
1226,-0.9735299999999999
1227,-0.9883799999999999
1228,-0.9998
1229,-1.0163
1230,-1.0281
1231,-1.041
1232,-1.0522
1233,-1.0667
1234,-1.0781
1235,-1.0917
1236,-1.1043
1237,-1.1152
1238,-1.1294
1239,-1.1401
1240,-1.1544
1241,-1.1681
1242,-1.1802
1243,-1.1925
1244,-1.207
1245,-1.2203
1246,-1.2321
1247,-1.2442
1248,-1.2558
1249,-1.2701
1250,-1.2819
1251,-1.2933
1252,-1.3051
1253,-1.3162
1254,-1.3288
1255,-1.3448
1256,-1.3543
1257,-1.365
1258,-1.3763
1259,-1.3907
1260,-1.4012
1261,-1.4135
1262,-1.4224
1263,-1.4324
1264,-1.4423
1265,-1.4507
1266,-1.4602
1267,-1.4704
1268,-1.4796
1269,-1.4894
1270,-1.5054
1271,-1.5131
1272,-1.5217
1273,-1.5291
1274,-1.5363
1275,-1.5394
1276,-1.5369
1277,-1.5383
1278,-1.538
1279,-1.5455
1280,-1.5519
1281,-1.5568
1282,-1.5627
1283,-1.5694
1284,-1.575
1285,-1.5811
1286,-1.5722
1287,-1.5727
1288,-1.5753
1289,-1.5807
1290,-1.5851
1291,-1.59
1292,-1.5757
1293,-1.5796
1294,-1.5838
1295,-1.5873
1296,-1.591
1297,-1.594
1298,-1.5973
1299,-1.5975
1300,-1.6003
1301,-1.6024
1302,-1.6046
1303,-1.5962
1304,-1.5905
1305,-1.5921
1306,-1.5909
1307,-1.5919999999999999
1308,-1.5927
1309,-1.5812
1310,-1.5646
1311,-1.5458
1312,-1.5293
1313,-1.5103
1314,-1.4938
1315,-1.4749
1316,-1.4583
1317,-1.4394
1318,-1.4229
1319,-1.4040000000000001
1320,-1.3851
1321,-1.3685
1322,-1.3496
1323,-1.3331
1324,-1.3142
1325,-1.2976
1326,-1.2787
1327,-1.2622
1328,-1.2433
1329,-1.2267
1330,-1.2078
1331,-1.1913
1332,-1.1724
1333,-1.1558
1334,-1.1369
1335,-1.1179999999999999
1336,-1.1014
1337,-1.0825
1338,-1.0659999999999998
1339,-1.0471
1340,-1.0305
1341,-1.0116
1342,-0.9950700000000001
1343,-0.98798
1344,-0.9877299999999999
1345,-0.9873200000000001
1346,-0.99205
1347,-1.011
1348,-1.0299
1349,-1.0464
1350,-1.0653
1351,-1.0818
1352,-1.1007
1353,-1.1173
1354,-1.1362
1355,-1.1527
1356,-1.1716
1357,-1.1882
1358,-1.2071
1359,-1.2236
1360,-1.2425
1361,-1.2590000000000001
1362,-1.2779
1363,-1.2968
1364,-1.3134
1365,-1.3323
1366,-1.3488
1367,-1.3677
1368,-1.3842
1369,-1.4031
1370,-1.4197
1371,-1.4387
1372,-1.4552
1373,-1.4741
1374,-1.4906
1375,-1.5095
1376,-1.5284
1377,-1.5449
1378,-1.5638
1379,-1.568
1380,-1.5669
1381,-1.568
1382,-1.5664
1383,-1.5748
1384,-1.5804
1385,-1.5784
1386,-1.5759
1387,-1.5735
1388,-1.5728
1389,-1.5699
1390,-1.5664
1391,-1.5627
1392,-1.5592
1393,-1.5549
1394,-1.5562
1395,-1.5653
1396,-1.5611
1397,-1.556
1398,-1.5513
1399,-1.5458
1400,-1.5430000000000001
1401,-1.537
1402,-1.5316
1403,-1.5455
1404,-1.5398
1405,-1.5330000000000001
1406,-1.526
1407,-1.5197
1408,-1.5145
1409,-1.5078
1410,-1.4999
1411,-1.4929
1412,-1.4847
1413,-1.4815
1414,-1.4762
1415,-1.473
1416,-1.4643
1417,-1.4565
1418,-1.4454
1419,-1.4362
1420,-1.4279
1421,-1.4183
1422,-1.4098
1423,-1.3999
1424,-1.391
1425,-1.3733
1426,-1.3643
1427,-1.3519999999999999
1428,-1.3428
1429,-1.3322
1430,-1.3159
1431,-1.3051
1432,-1.2937
1433,-1.2826
1434,-1.2691
1435,-1.2554
1436,-1.2441
1437,-1.2323
1438,-1.2199
1439,-1.2062
1440,-1.1947
1441,-1.1826
1442,-1.1708
1443,-1.1582
1444,-1.1431
1445,-1.1308
1446,-1.1187
1447,-1.1039
1448,-1.0909
1449,-1.0786
1450,-1.0678
1451,-1.0536
1452,-1.0426
1453,-1.03
1454,-1.0185
1455,-1.0034
1456,-0.99223
1457,-0.97935
1458,-0.96629
1459,-0.95324
1460,-0.94175
1461,-0.9285
1462,-0.9134
1463,-0.9018
1464,-0.88846
1465,-0.87505
1466,-0.86156
1467,-0.8496799999999999
1468,-0.8360299999999999
1469,-0.8228700000000001
1470,-0.8092
1471,-0.7971699999999999
1472,-0.78335
1473,-0.7711899999999999
1474,-0.75722
1475,-0.74336
1476,-0.72926
1477,-0.71509
1478,-0.70263
1479,-0.68833
1480,-0.67575
1481,-0.66062
1482,-0.6470199999999999
1483,-0.63258
1484,-0.61988
1485,-0.60532
1486,-0.5925199999999999
1487,-0.57634
1488,-0.56345
1489,-0.54866
1490,-0.53382
1491,-0.52078
1492,-0.50522
1493,-0.49195
1494,-0.47698999999999997
1495,-0.46385
1496,-0.44736000000000004
1497,-0.43415
1498,-0.42278000000000004
1499,-0.41238
1500,-0.39626999999999996
1501,-0.38635
1502,-0.38064000000000003
1503,-0.36730999999999997
1504,-0.35203
1505,-0.33669
1506,-0.32324
1507,-0.30782
1508,-0.29429
1509,-0.27743
1510,-0.26384
1511,-0.24825
1512,-0.23973000000000003
1513,-0.22801999999999997
1514,-0.21431999999999998
1515,-0.20451
1516,-0.19732
1517,-0.18156
1518,-0.16576
1519,-0.15319000000000002
1520,-0.13731
1521,-0.12337999999999999
1522,-0.10743
1523,-0.093443
1524,-0.077423
1525,-0.063378
1526,-0.047292
1527,-0.031952999999999995
1528,-0.01581
1529,-0.0024549
1530,0.01299
1531,0.027138
1532,0.044555000000000004
1533,0.060779999999999994
1534,0.073353
1535,0.087533
1536,0.10175
1537,0.11922
1538,0.13348
1539,0.14811
1540,0.16021
1541,0.17652
1542,0.19201
1543,0.20836999999999997
1544,0.22301999999999997
1545,0.23711999999999997
1546,0.25351
1547,0.26904
1548,0.284
1549,0.29983000000000004
1550,0.31625
1551,0.33065
1552,0.34712
1553,0.36272
1554,0.37923
1555,0.39095
1556,0.40224
1557,0.41307
1558,0.43071000000000004
1559,0.44333
1560,0.45571000000000006
1561,0.47223999999999994
1562,0.47844
1563,0.49065
1564,0.50517
1565,0.52179
1566,0.53635
1567,0.55301
1568,0.56501
1569,0.5816600000000001
1570,0.59625
1571,0.61406
1572,0.62868
1573,0.64061
1574,0.65523
1575,0.67305
1576,0.68498
1577,0.6995899999999999
1578,0.71742
1579,0.73207
1580,0.74883
1581,0.7541100000000001
1582,0.7741600000000001
1583,0.78264
1584,0.7921199999999999
1585,0.80471
1586,0.8215100000000001
1587,0.8362299999999999
1588,0.8530700000000001
1589,0.86993
1590,0.88471
1591,0.8920799999999999
1592,0.89633
1593,0.91328
1594,0.9281299999999999
1595,0.9451200000000001
1596,0.9577700000000001
1597,0.9715
1598,0.9863700000000001
1599,1.0044
1600,1.0193
1601,1.0299
1602,1.0406
1603,1.0491
1604,1.044
1605,1.037
1606,1.0266
1607,1.0117
1608,0.99782
1609,0.99467
1610,0.9832299999999999
1611,0.9729399999999999
1612,0.96352
1613,0.95181
1614,0.9394100000000001
1615,0.9234
1616,0.90525
1617,0.8871
1618,0.87469
1619,0.85654
1620,0.84383
1621,0.8281299999999999
1622,0.81458
1623,0.79872
1624,0.78371
1625,0.76556
1626,0.75056
1627,0.7369899999999999
1628,0.72328
1629,0.70873
1630,0.69701
1631,0.67986
1632,0.66273
1633,0.65518
1634,0.64448
1635,0.62953
1636,0.62424
1637,0.6093
1638,0.59122
1639,0.57631
1640,0.56377
1641,0.55209
1642,0.5340199999999999
1643,0.51912
1644,0.50656
1645,0.49276000000000003
1646,0.4747
1647,0.45898999999999995
1648,0.44527
1649,0.4295
1650,0.41486000000000006
1651,0.40002
1652,0.38508000000000003
1653,0.36700000000000005
1654,0.3521
1655,0.33529000000000003
1656,0.32148000000000004
1657,0.30341999999999997
1658,0.29198
1659,0.27706
1660,0.26004
1661,0.24516
1662,0.22816999999999998
1663,0.21333000000000002
1664,0.19639
1665,0.18158
1666,0.16362000000000002
1667,0.14885
1668,0.13401
1669,0.11817000000000001
1670,0.10023
1671,0.085484
1672,0.068655
1673,0.05587
1674,0.037959
1675,0.020062
1676,0.005290100000000001
1677,-0.008535899999999999
1678,-0.023237999999999998
1679,-0.041114
1680,-0.053780999999999995
1681,-0.067626
1682,-0.08230499999999999
1683,-0.10016
1684,-0.11282
1685,-0.12988
1686,-0.14373
1687,-0.15849000000000002
1688,-0.17426
1689,-0.18081
1690,-0.18945
1691,-0.19693
1692,-0.18742
1693,-0.1726
1694,-0.17670999999999998
1695,-0.18392
1696,-0.16685999999999998
1697,-0.15292
1698,-0.13581
1699,-0.12082000000000001
1700,-0.12133
1701,-0.10627
1702,-0.090022
1703,-0.07685800000000001
1704,-0.083561
1705,-0.080565
1706,-0.065371
1707,-0.048914
1708,-0.039875
1709,-0.044996
1710,-0.042942
1711,-0.025428
1712,-0.010973
1713,0.0065811
1714,0.015813
1715,0.022484999999999998
1716,0.037052999999999996
1717,0.054697
1718,0.072358
1719,0.087824
1720,0.10552
1721,0.12100999999999999
1722,0.13872
1723,0.15506
1724,0.1728
1725,0.18833
1726,0.2061
1727,0.22104000000000001
1728,0.23398000000000002
1729,0.24952
1730,0.26811
1731,0.28589000000000003
1732,0.30164
1733,0.31517
1734,0.33073
1735,0.34933000000000003
1736,0.36046
1737,0.37159000000000003
1738,0.37827
1739,0.3961
1740,0.41248999999999997
1741,0.43033999999999994
1742,0.44596
1743,0.4559
1744,0.47151000000000004
1745,0.48936
1746,0.508
1747,0.52363
1748,0.54151
1749,0.5571699999999999
1750,0.56611
1751,0.58254
1752,0.59378
1753,0.60945
1754,0.6191300000000001
1755,0.62883
1756,0.6378
1757,0.65051
1758,0.66845
1759,0.6864100000000001
1760,0.69387
1761,0.71257
1762,0.72828
1763,0.74698
1764,0.76271
1765,0.78069
1766,0.79571
1767,0.81371
1768,0.81912
1769,0.8312299999999999
1770,0.84631
1771,0.8643700000000001
1772,0.88018
1773,0.89825
1774,0.91633
1775,0.93216
1776,0.95025
1777,0.96609
1778,0.9842
1779,1.0001
1780,1.0189
1781,1.0347
1782,1.0529
1783,1.0687
1784,1.0837
1785,1.0938
1786,1.112
1787,1.1278
1788,1.1467
1789,1.1648
1790,1.1807
1791,1.1982
1792,1.2141
1793,1.2323
1794,1.2329999999999999
1795,1.2301
1796,1.2426
1797,1.2399
1798,1.2356
1799,1.2308
1800,1.2266
1801,1.222
1802,1.2174
1803,1.2134
1804,1.1992
1805,1.1895
1806,1.1746
1807,1.158
1808,1.1478
1809,1.1334
1810,1.115
1811,1.0989
1812,1.0896
1813,1.0821
1814,1.0637
1815,1.0477
1816,1.0293
1817,1.0109
1818,0.9948799999999999
1819,0.9765299999999999
1820,0.9604799999999999
1821,0.94214
1822,0.93124
1823,0.9174700000000001
1824,0.9014200000000001
1825,0.8825
1826,0.86645
1827,0.85039
1828,0.83949
1829,0.82114
1830,0.8022199999999999
1831,0.78618
1832,0.7724
1833,0.76151
1834,0.74316
1835,0.72653
1836,0.71506
1837,0.7018800000000001
1838,0.68352
1839,0.66747
1840,0.64913
1841,0.63308
1842,0.61417
1843,0.59813
1844,0.58035
1845,0.56885
1846,0.55281
1847,0.5344800000000001
1848,0.51845
1849,0.50013
1850,0.48411000000000004
1851,0.46581000000000006
1852,0.4498
1853,0.43151000000000006
1854,0.41551000000000005
1855,0.39723
1856,0.38124
1857,0.36298
1858,0.34700000000000003
1859,0.32875
1860,0.31051
1861,0.29391999999999996
1862,0.27569
1863,0.26406
1864,0.24975999999999998
1865,0.2338
1866,0.21431
1867,0.2052
1868,0.19153
1869,0.18762
1870,0.17134000000000002
1871,0.15542999999999998
1872,0.14665999999999998
1873,0.12847
1874,0.11710999999999999
1875,0.1051
1876,0.08854
1877,0.07619
1878,0.063527
1879,0.045342
1880,0.028783
1881,0.017088
1882,0.0060521
1883,-0.012789
1884,-0.022191
1885,-0.037766
1886,-0.042957999999999996
1887,-0.046129
1888,-0.048010000000000004
1889,-0.044259
1890,-0.035873
1891,-0.026229000000000002
1892,-0.0085069
1893,-0.0045499
1894,0.008059100000000001
1895,0.023554
1896,0.041919
1897,0.04602
1898,0.060473
1899,0.07658
1900,0.079746
1901,0.091489
1902,0.10046000000000001
1903,0.1067
1904,0.12007999999999999
1905,0.13809000000000002
1906,0.15429
1907,0.15837
1908,0.17412
1909,0.19266
1910,0.20889000000000002
1911,0.22698000000000002
1912,0.24366999999999997
1913,0.26223
1914,0.27847
1915,0.29704
1916,0.31561
1917,0.33186
1918,0.35
1919,0.36626
1920,0.38485
1921,0.40110999999999997
1922,0.41971
1923,0.43598000000000003
1924,0.45458000000000004
1925,0.47086000000000006
1926,0.47784
1927,0.48588000000000003
1928,0.49901
1929,0.5079100000000001
1930,0.52503
1931,0.54366
1932,0.5576300000000001
1933,0.56858
1934,0.5848800000000001
1935,0.60351
1936,0.62022
1937,0.63885
1938,0.65515
1939,0.67338
1940,0.6896899999999999
1941,0.70834
1942,0.7129800000000001
1943,0.72892
1944,0.74759
1945,0.7639199999999999
1946,0.7822100000000001
1947,0.78688
1948,0.79855
1949,0.80789
1950,0.82694
1951,0.8432799999999999
1952,0.8619600000000001
1953,0.8779299999999999
1954,0.89625
1955,0.8987700000000001
1956,0.9174700000000001
1957,0.9334899999999999
1958,0.9495100000000001
1959,0.95681
1960,0.9731799999999999
1961,0.9915700000000001
1962,1.008
1963,1.0213
1964,1.0267
1965,1.0455
1966,1.0619
1967,1.0803
1968,1.0967
1969,1.1155
1970,1.1319
1971,1.1506
1972,1.1532
1973,1.1696
1974,1.1884
1975,1.2048
1976,1.2235
1977,1.24
1978,1.2587
1979,1.2752
1980,1.2807
1981,1.2971
1982,1.3159
1983,1.32
1984,1.3385
1985,1.3549
1986,1.3737
1987,1.3925
1988,1.4066
1989,1.4118
1990,1.4283
1991,1.4469999999999998
1992,1.4535
1993,1.472
1994,1.4856
1995,1.4913
1996,1.5077
1997,1.5262
1998,1.5398
1999,1.5503
2000,1.5691
2001,1.5855
2002,1.6044
2003,1.6208
2004,1.6396
2005,1.6561
2006,1.6691
2007,1.6813
2008,1.7001
2009,1.7166
2010,1.7276
2011,1.7337
2012,1.7523
2013,1.7635
2014,1.7617
2015,1.7599
2016,1.7584
2017,1.7567
2018,1.7401
2019,1.734
2020,1.7194
2021,1.7089
2022,1.6924
2023,1.6735
2024,1.6569999999999998
2025,1.6382
2026,1.6217
2027,1.6028
2028,1.5863
2029,1.5675
2030,1.5484
2031,1.5319999999999998
2032,1.5236
2033,1.5071
2034,1.4904
2035,1.4845
2036,1.4679
2037,1.4513
2038,1.4432
2039,1.4267
2040,1.4078
2041,1.3913
2042,1.3864
2043,1.3677
2044,1.3559
2045,1.344
2046,1.3275
2047,1.3086
2048,1.2921
2049,1.2732
2050,1.2567
2051,1.238
2052,1.2344
2053,1.2155
2054,1.199
2055,1.1803
2056,1.1638
2057,1.145
2058,1.1393
2059,1.1228
2060,1.1039
2061,1.0876
2062,1.0686
2063,1.0521
2064,1.0333
2065,1.0189
2066,1.0107
2067,0.9941700000000001
2068,0.9753200000000001
2069,0.95883
2070,0.9399799999999999
2071,0.9211299999999999
2072,0.9044399999999999
2073,0.8856
2074,0.86911
2075,0.8630399999999999
2076,0.84654
2077,0.8276899999999999
2078,0.81119
2079,0.7923399999999999
2080,0.77585
2081,0.757
2082,0.74757
2083,0.7357899999999999
2084,0.72873
2085,0.7098800000000001
2086,0.69103
2087,0.6745399999999999
2088,0.65569
2089,0.6392
2090,0.63213
2091,0.6207600000000001
2092,0.61197
2093,0.59826
2094,0.58649
2095,0.57001
2096,0.55118
2097,0.5347
2098,0.5160899999999999
2099,0.49961000000000005
2100,0.48078000000000004
2101,0.46666
2102,0.45511999999999997
2103,0.44875
2104,0.43275
2105,0.42358
2106,0.40710999999999997
2107,0.3883
2108,0.37208
2109,0.35327
2110,0.33681
2111,0.318
2112,0.30154000000000003
2113,0.29629
2114,0.27749
2115,0.26105
2116,0.24251999999999999
2117,0.22608000000000003
2118,0.20729
2119,0.19085
2120,0.17206
2121,0.15563
2122,0.13685
2123,0.12040999999999999
2124,0.10135
2125,0.08492100000000001
2126,0.06614199999999999
2127,0.057432000000000004
2128,0.0381
2129,0.021388
2130,0.012752
2131,-0.0060459
2132,-0.022756000000000002
2133,-0.037374
2134,-0.048043999999999996
2135,-0.062399
2136,-0.063137
2137,-0.065014
2138,-0.065688
2139,-0.064624
2140,-0.063685
2141,-0.065184
2142,-0.051569000000000004
2143,-0.047852
2144,-0.031657
2145,-0.015143
2146,-0.011462
2147,0.004917100000000001
2148,0.0087141
2149,0.022634
2150,0.029031
2151,0.045455
2152,0.059316999999999995
2153,0.068381
2154,0.087188
2155,0.09637799999999999
2156,0.10787000000000001
2157,0.1267
2158,0.13615
2159,0.14797000000000002
2160,0.15026
2161,0.16659000000000002
2162,0.18307
2163,0.19253
2164,0.20658
2165,0.22543000000000002
2166,0.24198000000000003
2167,0.26089
2168,0.26771999999999996
2169,0.28181
2170,0.29835
2171,0.31722
2172,0.33613000000000004
2173,0.35268
2174,0.36195
2175,0.37371
2176,0.39261999999999997
2177,0.40917
2178,0.42805
2179,0.4446
2180,0.46351000000000003
2181,0.4729
2182,0.48463999999999996
2183,0.5011800000000001
2184,0.5200899999999999
2185,0.53901
2186,0.55556
2187,0.57447
2188,0.58627
2189,0.5956899999999999
2190,0.61224
2191,0.63116
2192,0.64771
2193,0.66662
2194,0.6831699999999999
2195,0.70208
2196,0.71863
2197,0.7234
2198,0.73995
2199,0.75652
2200,0.7660899999999999
2201,0.77568
2202,0.78996
2203,0.8065399999999999
2204,0.82545
2205,0.83511
2206,0.8517399999999999
2207,0.86834
2208,0.8758
2209,0.8923399999999999
2210,0.9113100000000001
2211,0.92785
2212,0.94676
2213,0.95429
2214,0.97083
2215,0.98974
2216,1.0063
2217,1.0253
2218,1.0418
2219,1.0607
2220,1.0772
2221,1.0962
2222,1.1013
2223,1.1203
2224,1.1368
2225,1.1558
2226,1.1723
2227,1.1913
2228,1.1965
2229,1.2132
2230,1.2185
2231,1.2351
2232,1.2518
2233,1.2595
2234,1.2785
2235,1.2908
2236,1.3076
2237,1.3242
2238,1.3432
2239,1.3597
2240,1.3786
2241,1.3975
2242,1.405
2243,1.4219
2244,1.4384
2245,1.4575
2246,1.4628
2247,1.4662
2248,1.4761
2249,1.4839
2250,1.485
2251,1.4863
2252,1.4875
2253,1.4815
2254,1.4652
2255,1.4534
2256,1.4416
2257,1.4299
2258,1.4204
2259,1.4039
2260,1.3849
2261,1.3684
2262,1.3539
2263,1.3435
2264,1.3247
2265,1.3082
2266,1.2893
2267,1.2728
2268,1.254
2269,1.2426
2270,1.2364
2271,1.2176
2272,1.2013
2273,1.1901
2274,1.1813
2275,1.1627
2276,1.1462
2277,1.1274
2278,1.1109
2279,1.0918
2280,1.0859
2281,1.067
2282,1.0503
2283,1.0315
2284,1.0146
2285,1.0042
2286,0.98514
2287,0.9751299999999999
2288,0.9704200000000001
2289,0.9539200000000001
2290,0.94195
2291,0.93468
2292,0.9158299999999999
2293,0.8993399999999999
2294,0.89189
2295,0.87539
2296,0.85654
2297,0.83985
2298,0.821
2299,0.80215
2300,0.78566
2301,0.76681
2302,0.75052
2303,0.7340300000000001
2304,0.72501
2305,0.71129
2306,0.70229
2307,0.69287
2308,0.67597
2309,0.65755
2310,0.6530600000000001
2311,0.63893
2312,0.62716
2313,0.61047
2314,0.59163
2315,0.57943
2316,0.56445
2317,0.54797
2318,0.52892
2319,0.51244
2320,0.49338000000000004
2321,0.48418
2322,0.46984
2323,0.45293
2324,0.44523999999999997
2325,0.42855
2326,0.41913
2327,0.40029000000000003
2328,0.3838
2329,0.36496
2330,0.35554
2331,0.34848
2332,0.332
2333,0.32729
2334,0.3108
2335,0.29197
2336,0.27526999999999996
2337,0.25644
2338,0.23974
2339,0.22671
2340,0.21023000000000003
2341,0.19118
2342,0.17232999999999998
2343,0.16055999999999998
2344,0.15093
2345,0.14346
2346,0.12872
2347,0.1191
2348,0.10732
2349,0.09063500000000001
2350,0.080249
2351,0.068093
2352,0.049236
2353,0.032552
2354,0.013696999999999999
2355,0.0057181
2356,0.0030091
2357,-0.0092949
2358,-0.014343999999999999
2359,-0.031341
2360,-0.036059
2361,-0.054602
2362,-0.07111100000000001
2363,-0.085261
2364,-0.096188
2365,-0.11505
2366,-0.13155
2367,-0.15041
2368,-0.16691
2369,-0.18575999999999998
2370,-0.20462
2371,-0.22111999999999998
2372,-0.23997
2373,-0.25647
2374,-0.27513000000000004
2375,-0.29163
2376,-0.31048000000000003
2377,-0.31264000000000003
2378,-0.33108000000000004
2379,-0.33538
2380,-0.34715999999999997
2381,-0.35464
2382,-0.37173
2383,-0.3788
2384,-0.39529000000000003
2385,-0.41413
2386,-0.43062
2387,-0.44966999999999996
2388,-0.46616
2389,-0.48478999999999994
2390,-0.5012800000000001
2391,-0.5201100000000001
2392,-0.5366
2393,-0.55543
2394,-0.57191
2395,-0.59075
2396,-0.59645
2397,-0.61268
2398,-0.6315
2399,-0.64772
2400,-0.65007
2401,-0.66108
2402,-0.67232
2403,-0.68407
2404,-0.6937300000000001
2405,-0.7078300000000001
2406,-0.71643
2407,-0.72348
2408,-0.7373
2409,-0.7403
2410,-0.75583
2411,-0.75867
2412,-0.77741
2413,-0.79082
2414,-0.79583
2415,-0.80145
2416,-0.7989
2417,-0.79583
2418,-0.7895800000000001
2419,-0.7778
2420,-0.76343
2421,-0.74439
2422,-0.7372
2423,-0.7168800000000001
2424,-0.7077
2425,-0.6886800000000001
2426,-0.67528
2427,-0.66463
2428,-0.64608
2429,-0.62938
2430,-0.6108100000000001
2431,-0.60018
2432,-0.5867399999999999
2433,-0.5705100000000001
2434,-0.5515
2435,-0.53852
2436,-0.5273899999999999
2437,-0.5107
2438,-0.49723
2439,-0.48422
2440,-0.4657
2441,-0.44669
2442,-0.43048000000000003
2443,-0.41884
2444,-0.40398
2445,-0.38499
2446,-0.37744
2447,-0.35977
2448,-0.35214
2449,-0.33366999999999997
2450,-0.3175
2451,-0.29901
2452,-0.28281999999999996
2453,-0.26384
2454,-0.24533000000000002
2455,-0.22914
2456,-0.22105999999999998
2457,-0.2072
2458,-0.18821
2459,-0.17203
2460,-0.1616
2461,-0.14543
2462,-0.12645
2463,-0.10977
2464,-0.09750700000000001
2465,-0.081343
2466,-0.062363
2467,-0.047999
2468,-0.035710000000000006
2469,-0.016735
2470,-0.0031379000000000003
2471,0.0099521
2472,0.026618
2473,0.038457
2474,0.051566999999999995
2475,0.064532
2476,0.079424
2477,0.08960900000000001
2478,0.10505999999999999
2479,0.1176
2480,0.12962
2481,0.1451
2482,0.15374000000000002
2483,0.17094
2484,0.17906
2485,0.19457
2486,0.20169
2487,0.20931999999999998
2488,0.22383000000000003
2489,0.23051
2490,0.23564000000000002
2491,0.24506
2492,0.25743
2493,0.26208000000000004
2494,0.2675
2495,0.27233
2496,0.27498
2497,0.26286
2498,0.26042
2499,0.24315
2500,0.22741
2501,0.21615
2502,0.21015999999999999
2503,0.19222999999999998
2504,0.17655
2505,0.15864
2506,0.14222
2507,0.13318
2508,0.1175
2509,0.098834
2510,0.083176
2511,0.063752
2512,0.05769199999999999
2513,0.042026999999999995
2514,0.023369
2515,0.015797
2516,-0.0021169
2517,-0.01778
2518,-0.035669
2519,-0.051311
2520,-0.069175
2521,-0.08479500000000001
2522,-0.10263
2523,-0.10709
2524,-0.12491
2525,-0.13159
2526,-0.14717
2527,-0.16495
2528,-0.1805
2529,-0.19826
2530,-0.21461
2531,-0.23234000000000002
2532,-0.24785
2533,-0.26555
2534,-0.28103
2535,-0.29267
2536,-0.30678
2537,-0.32447
2538,-0.34078
2539,-0.35845
2540,-0.37013
2541,-0.38728
2542,-0.4058
2543,-0.41525
2544,-0.43293999999999994
2545,-0.44925
2546,-0.4664
2547,-0.47944
2548,-0.49796
2549,-0.5101600000000001
2550,-0.5281399999999999
2551,-0.54362
2552,-0.56213
2553,-0.5738
2554,-0.58791
2555,-0.60643
2556,-0.62188
2557,-0.63953
2558,-0.6512399999999999
2559,-0.6675399999999999
2560,-0.68383
2561,-0.7014699999999999
2562,-0.71099
2563,-0.72729
2564,-0.7427199999999999
2565,-0.76034
2566,-0.77661
2567,-0.79419
2568,-0.81175
2569,-0.82709
2570,-0.8446100000000001
2571,-0.85783
2572,-0.87275
2573,-0.88807
2574,-0.90556
2575,-0.92084
2576,-0.9392
2577,-0.95444
2578,-0.9718399999999999
2579,-0.9833200000000001
2580,-0.9979100000000001
2581,-1.0131
2582,-1.0314
2583,-1.0488
2584,-1.0603
2585,-1.0749
2586,-1.0901
2587,-1.1083
2588,-1.1198
2589,-1.1345
2590,-1.1506
2591,-1.1652
2592,-1.1745
2593,-1.1928
2594,-1.2053
2595,-1.2189
2596,-1.2372
2597,-1.2506
2598,-1.2655
2599,-1.2826
2600,-1.2947
2601,-1.3099
2602,-1.3282
2603,-1.3369
2604,-1.3521
2605,-1.3682
2606,-1.3813
2607,-1.3965
2608,-1.4148
2609,-1.43
2610,-1.4409
2611,-1.4592
2612,-1.4709999999999999
2613,-1.4831
2614,-1.4993
2615,-1.5154
2616,-1.5275
2617,-1.5458
2618,-1.5595
2619,-1.5741
2620,-1.5902
2621,-1.6076
2622,-1.6191
2623,-1.6337
2624,-1.652
2625,-1.6653
2626,-1.6824
2627,-1.6986
2628,-1.7094
2629,-1.7256
2630,-1.7417
2631,-1.7538
2632,-1.7721
2633,-1.7861
2634,-1.796
2635,-1.8121
2636,-1.8283
2637,-1.8381
2638,-1.8565
2639,-1.8714
2640,-1.8856
2641,-1.901
2642,-1.9137
2643,-1.9321
2644,-1.944
2645,-1.9611
2646,-1.9692
2647,-1.9864
2648,-1.9958
2649,-2.0115
2650,-2.0222
2651,-2.0408
2652,-2.0565
2653,-2.0716
2654,-2.0828
2655,-2.1
2656,-2.1118
2657,-2.1252
2658,-2.1399
2659,-2.1528
2660,-2.1684
2661,-2.1766
2662,-2.1938
2663,-2.2023
2664,-2.2212
2665,-2.2356
2666,-2.2456
2667,-2.2646
2668,-2.2777
2669,-2.2911
2670,-2.3074
2671,-2.3264
2672,-2.3426
2673,-2.3584
2674,-2.369
2675,-2.3876
2676,-2.4043
2677,-2.4228
2678,-2.4363
2679,-2.4492
2680,-2.4655
2681,-2.484
2682,-2.503
2683,-2.5192
2684,-2.5308
2685,-2.5456
2686,-2.5642
2687,-2.5805
2688,-2.5989999999999998
2689,-2.6157
2690,-2.6341
2691,-2.6502
2692,-2.6634
2693,-2.6746
2694,-2.6936
2695,-2.7121
2696,-2.7282
2697,-2.7465
2698,-2.7624
2699,-2.7811
2700,-2.7944
2701,-2.8056
2702,-2.8215
2703,-2.8391
2704,-2.8536
2705,-2.8693
2706,-2.8738
2707,-2.8738
2708,-2.8738
