time,value
0,-0.13323
1,-0.13323
2,-0.13323
3,-0.13323
4,-0.13323
5,-0.13323
6,-0.13323
7,-0.13323
8,-0.13323
9,-0.13323
10,-0.13323
11,-0.13323
12,-0.13323
13,-0.13323
14,-0.13323
15,-0.13323
16,-0.13323
17,-0.13323
18,-0.13323
19,-0.13323
20,-0.13323
21,-0.13323
22,-0.13323
23,-0.13323
24,-0.13323
25,-0.13323
26,-0.13323
27,-0.13323
28,-0.13323
29,-0.13323
30,8.9921
31,-0.13323
32,-0.13323
33,3.5318
34,-0.13323
35,-0.13323
36,-0.13323
37,-0.13323
38,-0.13323
39,-0.13323
40,-0.13323
41,-0.13323
42,-0.13323
43,-0.13323
44,-0.13323
45,-0.13323
46,-0.13323
47,-0.13323
48,-0.13323
49,-0.13323
50,-0.13323
51,-0.13323
52,-0.13323
53,-0.13323
54,-0.13323
55,-0.13323
56,-0.13323
57,-0.13323
58,-0.13323
59,-0.13323
60,-0.13323
61,-0.13323
62,-0.13323
63,-0.13323
64,-0.13323
65,-0.13323
66,-0.13323
67,-0.13323
68,-0.13323
69,-0.13323
70,-0.13323
71,-0.13323
72,-0.13323
73,-0.13323
74,-0.13323
75,-0.13323
76,-0.13323
77,-0.13323
78,-0.13323
79,-0.13323
80,-0.13323
81,-0.13323
82,-0.13323
83,-0.13323
84,-0.13323
85,-0.13323
86,-0.13323
87,-0.13323
88,-0.13323
89,-0.13323
90,-0.13323
91,-0.13323
92,-0.13323
93,-0.13323
94,-0.13323
95,-0.13323
