time,value
0,0.57022
1,0.6693899999999999
2,0.6693899999999999
3,0.6693899999999999
4,0.57022
5,0.6693899999999999
6,0.57022
7,0.6693899999999999
8,-0.12395999999999999
9,-1.4131
10,-1.4131
11,-1.4131
12,-1.4131
13,-1.4131
14,-1.4131
15,-1.4131
16,-1.2148
17,1.2644
18,1.0661
19,0.86772
20,0.76855
21,0.6693899999999999
22,0.6693899999999999
23,0.6693899999999999
24,0.6693899999999999
25,0.6693899999999999
26,0.6693899999999999
27,0.57022
28,0.6693899999999999
29,0.6693899999999999
30,0.6693899999999999
31,0.57022
32,0.6693899999999999
33,0.57022
34,-0.9173100000000001
35,-1.4131
36,-1.4131
37,-1.4131
38,-1.4131
39,-1.4131
40,-1.4131
41,-1.4131
42,0.6693899999999999
43,1.0661
44,0.9668899999999999
45,0.76855
46,0.6693899999999999
47,0.6693899999999999
48,0.76855
49,0.6693899999999999
50,0.6693899999999999
51,0.57022
52,0.6693899999999999
53,0.6693899999999999
54,0.57022
55,0.6693899999999999
56,0.6693899999999999
57,0.57022
58,0.6693899999999999
59,0.57022
60,0.6693899999999999
61,0.57022
62,-0.6198
63,-1.4131
64,-1.4131
65,-1.4131
66,-1.4131
67,-1.4131
68,-1.4131
69,-1.4131
70,-1.4131
71,1.1652
72,1.0661
73,0.86772
74,0.76855
75,0.76855
76,0.6693899999999999
77,0.6693899999999999
78,0.6693899999999999
79,0.6693899999999999
80,0.6693899999999999
81,0.57022
82,0.6693899999999999
83,0.6693899999999999
84,0.57022
85,-1.2148
86,-1.4131
87,-1.4131
88,-1.4131
89,-1.4131
90,-1.4131
91,-1.4131
92,-1.0165
93,1.1652
94,1.0661
95,0.76855
