time,value
0,-0.36219
1,-0.36219
2,-0.36219
3,-0.36219
4,-0.36219
5,-0.36219
6,-0.36219
7,-0.36219
8,-0.36219
9,-0.36219
10,-0.36219
11,-0.36219
12,-0.076016
13,-0.36219
14,-0.36219
15,-0.36219
16,-0.36219
17,-0.36219
18,-0.36219
19,-0.36219
20,-0.36219
21,-0.36219
22,-0.36219
23,-0.36219
24,-0.36219
25,-0.36219
26,-0.36219
27,-0.36219
28,-0.36219
29,-0.36219
30,-0.36219
31,-0.36219
32,-0.36219
33,-0.36219
34,-0.36219
35,-0.36219
36,-0.36219
37,-0.36219
38,-0.36219
39,-0.36219
40,-0.36219
41,-0.36219
42,-0.36219
43,-0.36219
44,-0.36219
45,-0.36219
46,-0.36219
47,-0.36219
48,-0.36219
49,-0.36219
50,-0.36219
51,-0.36219
52,-0.36219
53,-0.36219
54,-0.36219
55,-0.36219
56,-0.36219
57,-0.36219
58,-0.36219
59,-0.36219
60,-0.36219
61,-0.36219
62,-0.36219
63,-0.36219
64,-0.36219
65,-0.36219
66,-0.36219
67,-0.36219
68,-0.36219
69,-0.36219
70,-0.36219
71,-0.36219
72,-0.36219
73,-0.36219
74,-0.36219
75,-0.36219
76,-0.36219
77,-0.36219
78,-0.36219
79,-0.36219
80,-0.36219
81,0.49633999999999995
82,1.3549
83,2.9289
84,3.0719
85,2.9289
86,3.0719
87,2.9289
88,2.9289
89,3.0719
90,2.9289
91,2.9289
92,1.4980000000000002
93,-0.36219
94,-0.36219
95,-0.36219
