time,value
0,1.7448
1,1.7217
2,1.6509
3,1.5659
4,1.4814
5,1.3969
6,1.3128
7,1.2287
8,1.1451
9,1.0615
10,0.97835
11,0.89464
12,0.81145
13,0.7282
14,0.6448
15,0.56152
16,0.47836000000000006
17,0.39534
18,0.31248000000000004
19,0.22978
20,0.14728
21,0.063638
22,-0.018506
23,-0.10191
24,-0.18359
25,-0.26505
26,-0.34776
27,-0.42838999999999994
28,-0.51066
29,-0.59032
30,-0.67179
31,-0.7528
32,-0.83031
33,-0.9097
34,-0.98835
35,-1.0618
36,-1.1371
37,-1.2102
38,-1.2747
39,-1.3405
40,-1.3982
41,-1.4478
42,-1.4847
43,-1.5052
44,-1.5065
45,-1.4881
46,-1.4529
47,-1.4101
48,-1.3536
49,-1.2899
50,-1.2257
51,-1.1540000000000001
52,-1.0791
53,-1.0025
54,-0.9278
55,-0.84851
56,-0.77032
57,-0.6903100000000001
58,-0.6089399999999999
59,-0.5293899999999999
60,-0.44718
61,-0.36662
62,-0.28473000000000004
63,-0.20256
64,-0.12057999999999999
65,-0.038138
66,0.044573
67,0.12693
68,0.20949
69,0.29225
70,0.37517
71,0.45825
72,0.54146
73,0.62479
74,0.70823
75,0.7911
76,0.8745299999999999
77,0.95796
78,1.0414
79,1.125
80,1.2087
81,1.2929
82,1.3771
83,1.4615
84,1.5461
85,1.6305
86,1.7142
87,1.7267
88,1.6539
89,1.5699
90,1.4856
91,1.4015
92,1.3175
93,1.2329999999999999
94,1.1491
95,1.0652
96,0.9813299999999999
97,0.89756
98,0.81387
99,0.73026
100,0.64675
101,0.56418
102,0.47918999999999995
103,0.39655
104,0.32646
105,0.28576
106,0.22179000000000001
107,0.15609
108,0.071338
109,-0.008469899999999999
110,-0.090364
111,-0.17195
112,-0.25495999999999996
113,-0.33781
114,-0.39561
115,-0.46531999999999996
116,-0.5476300000000001
117,-0.63031
118,-0.71272
119,-0.7894
120,-0.8720700000000001
121,-0.93424
122,-1.0126
123,-1.0874
124,-1.163
125,-1.2317
126,-1.3013
127,-1.3477
128,-1.4036
129,-1.4574
130,-1.4963
131,-1.5144
132,-1.5174
133,-1.5045
134,-1.4733
135,-1.4384
136,-1.3842
137,-1.3357
138,-1.2682
139,-1.2066
140,-1.1308
141,-1.0542
142,-0.9789200000000001
143,-0.9017
144,-0.82184
145,-0.74131
146,-0.66023
147,-0.58101
148,-0.49898000000000003
149,-0.41667
150,-0.33599
151,-0.25487
152,-0.17013
153,-0.090794
154,-0.0082373
155,0.048178
156,0.11939000000000001
157,0.19302
158,0.27598
159,0.35969
160,0.4432
161,0.5264
162,0.61039
163,0.69328
164,0.77686
165,0.86054
166,0.9438700000000001
167,1.0276
168,1.1116
169,1.1956
170,1.2796
171,1.3641
172,1.4479
173,1.5323
174,1.6165
175,1.7003
