time,value
0,-0.37093000000000004
1,-0.30827
2,-0.252
3,-0.22845
4,-0.34984
5,-0.22859000000000002
6,-0.35133000000000003
7,-0.34369
8,-0.3559
9,-0.34605
10,-0.24023000000000003
11,-0.25365
12,-0.26279
13,-0.34106
14,-0.33623000000000003
15,-0.25766999999999995
16,-0.23543000000000003
17,-0.21416999999999997
18,-0.26605999999999996
19,-0.24681
20,-0.22511
21,-0.1637
22,-0.19615
23,-0.34278000000000003
24,-0.52246
25,-0.71428
26,-0.85416
27,-1.3644
28,-1.1499
29,-1.2465
30,-1.5030000000000001
31,-1.9069
32,-2.0945
33,-2.0791
34,-1.9902
35,-2.0585
36,-2.0580000000000003
37,-2.011
38,-2.049
39,-1.9017
40,-1.7058
41,-1.5919
42,-1.5247
43,-1.4313
44,-1.3283
45,-1.2617
46,-0.96091
47,-0.85265
48,-0.55648
49,-0.28772
50,-0.17178
51,0.22663000000000003
52,0.69882
53,0.9128200000000001
54,0.98482
55,1.0728
56,1.0239
57,0.81007
58,1.0101
59,1.1511
60,1.115
61,1.0325
62,1.0905
63,1.0892
64,1.3005
65,1.464
66,1.7621
67,1.5206
68,1.7013
69,2.0702
70,1.7883
71,1.768
72,1.6006
73,1.4943
74,1.3667
75,1.3961
76,1.1504
77,0.98461
78,1.347
79,1.2407
80,1.1117
81,1.4232
82,1.4801
83,1.4718
84,1.6022
85,1.5319999999999998
86,1.334
87,1.263
88,1.2527
89,1.5208
90,1.4707
91,1.1355
92,1.4323
93,1.618
94,1.2686
95,1.4366
96,1.6067
97,1.2574
98,1.2104
99,1.8334
100,1.6459
101,1.5574
102,1.1857
103,1.4614
104,1.3839
105,1.6277
106,1.6786
107,1.6564
108,1.6379
109,1.577
110,1.6698
111,1.6404
112,1.6225
113,1.515
114,1.4492
115,1.6891
116,1.5727
117,1.6588
118,1.6771
119,1.4804
120,1.6339
121,1.8812
122,1.6343
123,1.5459
124,1.6312
125,1.4503
126,1.382
127,1.4552
128,1.2538
129,1.1458
130,1.0586
131,0.76847
132,0.64578
133,0.0204
134,-0.6168
135,-0.73859
136,-0.86734
137,-1.0341
138,-1.0051
139,-1.0886
140,-1.1429
141,-1.1916
142,-1.4971
143,-1.6709
144,-1.6886
145,-1.851
146,-1.9864
147,-1.8196
148,-1.6829
149,-2.0504
150,-2.0961
151,-1.9363
152,-1.7521
153,-1.6337
154,-1.4997
155,-1.4836
156,-1.4161
157,-1.3125
158,-1.2725
159,-1.3048
160,-1.2316
161,-1.1520000000000001
162,-1.021
163,-0.9259299999999999
164,-0.88595
165,-0.83157
166,-0.85655
167,-0.78901
168,-0.7165600000000001
169,-0.61875
170,-0.50536
171,-0.53786
172,-0.47834
173,-0.39795
174,-0.24706999999999998
175,-0.040708999999999995
176,-0.025863999999999998
177,-0.25440999999999997
178,-0.30285
179,-0.34296
180,-0.24795
181,-0.16076
182,-0.085741
183,-0.1515
184,-0.24423000000000003
185,-0.19869
186,-0.11462
187,-0.13179000000000002
188,-0.15522
189,-0.085906
190,-0.1837
191,-0.27071
192,-0.20058
193,-0.077163
194,-0.06602100000000001
195,-0.085136
196,-0.073338
197,-0.061415
198,-0.17361
199,-0.15064
200,-0.15275
201,-0.18177000000000001
202,-0.19174000000000002
203,-0.072947
204,-0.055809000000000004
205,-0.081513
206,-0.18650999999999998
207,-0.1435
208,-0.15166
209,-0.1523
210,-0.15386
211,-0.11208
212,-0.052648
213,-0.15522
214,-0.13812
215,-0.12299000000000002
216,-0.09916900000000001
217,-0.17744000000000001
218,-0.19457
219,-0.18880999999999998
220,-0.17189000000000002
221,-0.18665
222,-0.26021
223,-0.2617
224,-0.16448
225,-0.22053000000000003
226,-0.17712
227,-0.24140999999999999
228,-0.16324
229,-0.15962
230,-0.16369
231,-0.20521999999999999
232,-0.19829000000000002
233,-0.26306999999999997
234,-0.26385
235,-0.26178
236,-0.27529000000000003
237,-0.29067
238,-0.1791
239,-0.18185
240,-0.20231
241,-0.18538
242,-0.21220999999999998
243,-0.31513
244,-0.2677
245,0.061714
246,0.074185
247,-0.051754999999999995
248,-0.16326
249,-0.16702
250,-0.16355999999999998
251,-0.16365
252,-0.16036
253,-0.27283
254,-0.16646
255,-0.16927999999999999
256,-0.16476
257,-0.17003
258,-0.15763
259,-0.28265
260,-0.27885
261,-0.18012999999999998
262,-0.15947999999999998
263,-0.1578
264,-0.11059000000000001
265,-0.089126
266,-0.1423
267,-0.17296
268,-0.16854
269,-0.16769
270,-0.16796
271,-0.099474
272,-0.097897
273,-0.10107999999999999
274,-0.15847
275,-0.1594
276,-0.10770999999999999
277,-0.16418
278,-0.16885
279,-0.2293
280,-0.24665
281,-0.29508
282,-0.17502
283,-0.17870999999999998
284,-0.25913
285,-0.1722
286,-0.21009
287,-0.2655
288,-0.17726
289,-0.18413
290,-0.077528
291,-0.079036
292,-0.09459400000000001
293,-0.081992
294,-0.075553
295,0.049351
296,-0.1829
297,-0.1869
298,-0.19183
299,-0.19271
