time,value
0,-0.60435
1,2.2862
2,0.22152
3,-0.60435
4,-0.60435
5,-0.60435
6,-0.60435
7,1.2539
8,1.2539
9,-0.60435
10,-0.60435
11,-0.60435
12,-0.60435
13,0.015055
14,2.2862
15,-0.60435
16,-0.60435
17,-0.60435
18,-0.60435
19,-0.60435
20,1.2539
21,1.2539
22,-0.60435
23,-0.60435
24,-0.60435
25,-0.60435
26,-0.60435
27,2.2862
28,0.42799
29,-0.60435
30,-0.60435
31,-0.60435
32,-0.60435
33,0.015055
34,2.2862
35,-0.60435
36,-0.60435
37,-0.60435
38,-0.60435
39,-0.60435
40,1.2539
41,1.4603
42,-0.60435
43,-0.60435
44,-0.60435
45,-0.60435
46,-0.19141
47,2.2862
48,0.015055
49,-0.60435
50,-0.60435
51,-0.60435
52,-0.60435
53,2.0798
54,0.63446
55,-0.60435
56,-0.60435
57,-0.60435
58,-0.60435
59,1.0474
60,1.6668
61,-0.60435
62,-0.60435
63,-0.60435
64,-0.60435
65,0.42799
66,2.0798
67,-0.60435
68,-0.60435
69,-0.60435
70,-0.60435
71,0.63446
72,2.2862
73,-0.60435
74,-0.60435
75,-0.60435
76,-0.60435
77,-0.60435
78,2.2862
79,0.63446
80,-0.60435
81,-0.60435
82,-0.60435
83,0.63446
84,2.2862
85,-0.60435
86,-0.60435
87,-0.60435
88,-0.60435
89,0.015055
90,2.2862
91,0.015055
92,-0.60435
93,-0.60435
94,-0.60435
95,-0.60435
