time,value
0,-1.0839
1,-1.0839
2,-1.0839
3,-1.0839
4,-1.0839
5,-1.0839
6,-1.0839
7,-1.0839
8,-1.0839
9,-1.0839
10,-1.0839
11,-1.0839
12,-1.0839
13,-1.0839
14,-1.0839
15,-1.0839
16,-1.0839
17,-1.0839
18,-1.0839
19,-1.0839
20,-1.0839
21,-1.0839
22,-1.0839
23,-1.0839
24,-1.0839
25,-1.0839
26,-1.0839
27,-1.0839
28,-1.0839
29,-1.0839
30,-1.0839
31,1.3226
32,1.8039
33,1.2263
34,0.9375399999999999
35,0.8412700000000001
36,0.8412700000000001
37,0.9375399999999999
38,0.9375399999999999
39,1.0338
40,0.7450100000000001
41,0.7450100000000001
42,1.0338
43,1.0338
44,0.7450100000000001
45,0.64875
46,0.9375399999999999
47,0.9375399999999999
48,0.9375399999999999
49,0.64875
50,0.7450100000000001
51,0.9375399999999999
52,1.0338
53,0.8412700000000001
54,0.64875
55,0.7450100000000001
56,-1.0839
57,-1.0839
58,-1.0839
59,-1.0839
60,-1.0839
61,-1.0839
62,1.8039
63,0.9375399999999999
64,0.64875
65,0.7450100000000001
66,0.8412700000000001
67,0.7450100000000001
68,0.5524899999999999
69,0.64875
70,0.8412700000000001
71,0.7450100000000001
72,0.5524899999999999
73,0.8412700000000001
74,1.0338
75,1.0338
76,0.7450100000000001
77,0.64875
78,1.1301
79,0.9375399999999999
80,0.7450100000000001
81,0.7450100000000001
82,0.9375399999999999
83,1.0338
84,0.7450100000000001
85,0.7450100000000001
86,0.9375399999999999
87,1.0338
88,0.7450100000000001
89,0.26371
90,-1.0839
91,-1.0839
92,-1.0839
93,-1.0839
94,-1.0839
95,-1.0839
