time,value
0,-0.70022
1,2.0323
2,0.7571399999999999
3,-0.70022
4,-0.70022
5,-0.70022
6,-0.70022
7,1.8502
8,0.57497
9,-0.70022
10,-0.70022
11,-0.70022
12,-0.70022
13,2.0323
14,0.57497
15,-0.70022
16,-0.70022
17,-0.70022
18,-0.70022
19,1.8502
20,0.7571399999999999
21,-0.70022
22,-0.70022
23,-0.70022
24,-0.70022
25,1.6680000000000001
26,0.7571399999999999
27,-0.70022
28,-0.70022
29,-0.70022
30,-0.70022
31,1.6680000000000001
32,0.9393100000000001
33,-0.70022
34,-0.70022
35,-0.70022
36,-0.70022
37,1.3037
38,1.3037
39,-0.70022
40,-0.70022
41,-0.70022
42,-0.70022
43,1.3037
44,1.8502
45,-0.70022
46,-0.70022
47,-0.70022
48,-0.70022
49,1.8502
50,0.57497
51,-0.70022
52,-0.70022
53,-0.70022
54,0.21063
55,1.8502
56,0.028464
57,-0.70022
58,-0.70022
59,-0.70022
60,0.9393100000000001
61,1.6680000000000001
62,-0.70022
63,-0.70022
64,-0.70022
65,-0.70022
66,1.3037
67,1.3037
68,-0.70022
69,-0.70022
70,-0.70022
71,-0.70022
72,1.4858
73,1.4858
74,-0.70022
75,-0.70022
76,-0.70022
77,0.3928
78,1.8502
79,-0.33588
80,-0.70022
81,-0.70022
82,-0.70022
83,1.4858
84,1.1215
85,-0.70022
86,-0.70022
87,-0.70022
88,-0.70022
89,1.6680000000000001
90,0.7571399999999999
91,-0.70022
92,-0.70022
93,-0.70022
94,-0.70022
95,1.8502
