time,value
0,-0.6195
1,-0.6195
2,-0.6195
3,-0.6195
4,-0.6195
5,-0.6195
6,-0.6195
7,-0.6195
8,-0.6195
9,-0.6195
10,-0.6195
11,-0.6195
12,-0.6195
13,-0.6195
14,-0.6195
15,-0.6195
16,-0.6195
17,-0.6195
18,-0.6195
19,-0.6195
20,-0.6195
21,-0.6195
22,-0.6195
23,-0.6195
24,-0.6195
25,-0.6195
26,-0.6195
27,-0.6195
28,-0.6195
29,-0.6195
30,-0.6195
31,-0.6195
32,3.1998
33,3.0634
34,3.0634
35,2.927
36,3.0634
37,1.2902
38,-0.21029
39,-0.21029
40,-0.21029
41,-0.21029
42,-0.21029
43,-0.21029
44,-0.21029
45,-0.21029
46,-0.21029
47,-0.21029
48,-0.21029
49,-0.21029
50,-0.21029
51,-0.21029
52,-0.21029
53,-0.21029
54,-0.21029
55,-0.21029
56,-0.07388600000000001
57,-0.21029
58,-0.21029
59,-0.21029
60,-0.21029
61,-0.21029
62,-0.21029
63,-0.21029
64,-0.21029
65,-0.21029
66,-0.21029
67,-0.21029
68,-0.21029
69,-0.21029
70,-0.21029
71,-0.21029
72,-0.07388600000000001
73,0.33533
74,-0.21029
75,-0.21029
76,-0.21029
77,-0.21029
78,1.5630000000000002
79,0.47173000000000004
80,3.0634
81,3.0634
82,3.0634
83,1.0173
84,0.33533
85,0.062519
86,-0.21029
87,-0.07388600000000001
88,-0.21029
89,-0.21029
90,-0.21029
91,-0.21029
92,-0.07388600000000001
93,-0.21029
94,-0.21029
95,-0.21029
