time,value
0,-0.6924100000000001
1,-0.6924100000000001
2,2.005
3,0.65628
4,-0.6924100000000001
5,-0.6924100000000001
6,-0.6924100000000001
7,1.4269999999999998
8,1.2343
9,-0.6924100000000001
10,-0.6924100000000001
11,-0.6924100000000001
12,0.46361
13,1.8123
14,-0.6924100000000001
15,-0.6924100000000001
16,-0.6924100000000001
17,-0.1144
18,2.005
19,-0.1144
20,-0.6924100000000001
21,-0.6924100000000001
22,-0.6924100000000001
23,1.6196
24,0.65628
25,-0.6924100000000001
26,-0.6924100000000001
27,-0.6924100000000001
28,0.65628
29,1.8123
30,-0.6924100000000001
31,-0.6924100000000001
32,-0.6924100000000001
33,-0.6924100000000001
34,2.005
35,0.27094
36,-0.6924100000000001
37,-0.6924100000000001
38,-0.6924100000000001
39,0.84895
40,1.4269999999999998
41,-0.6924100000000001
42,-0.6924100000000001
43,-0.6924100000000001
44,-0.30706999999999995
45,2.1976
46,-0.30706999999999995
47,-0.6924100000000001
48,-0.6924100000000001
49,-0.6924100000000001
50,1.4269999999999998
51,0.65628
52,-0.6924100000000001
53,-0.6924100000000001
54,-0.6924100000000001
55,0.27094
56,2.1976
57,-0.6924100000000001
58,-0.6924100000000001
59,-0.6924100000000001
60,-0.6924100000000001
61,2.005
62,0.27094
63,-0.6924100000000001
64,-0.6924100000000001
65,-0.6924100000000001
66,0.65628
67,1.6196
68,-0.6924100000000001
69,-0.6924100000000001
70,-0.6924100000000001
71,-0.6924100000000001
72,2.005
73,0.27094
74,-0.6924100000000001
75,-0.6924100000000001
76,-0.6924100000000001
77,0.65628
78,1.4269999999999998
79,-0.6924100000000001
80,-0.6924100000000001
81,-0.6924100000000001
82,-0.6924100000000001
83,2.1976
84,0.07827200000000001
85,-0.6924100000000001
86,-0.6924100000000001
87,-0.6924100000000001
88,0.84895
89,1.2343
90,-0.6924100000000001
91,-0.6924100000000001
92,-0.6924100000000001
93,-0.6924100000000001
94,2.1976
95,-0.1144
