time,value
0,1.7413
1,1.7147
2,1.7146
3,1.6709
4,1.6072
5,1.5303
6,1.4237
7,1.3477
8,1.2697
9,1.1663
10,1.0574
11,0.9505299999999999
12,0.84567
13,0.7431
14,0.63445
15,0.5329999999999999
16,0.4373
17,0.34107
18,0.24009
19,0.15295
20,0.056897
21,-0.027647
22,-0.11224
23,-0.19573
24,-0.28457
25,-0.36926
26,-0.43075
27,-0.50013
28,-0.57007
29,-0.6606
30,-0.72236
31,-0.77974
32,-0.83534
33,-0.9043
34,-0.93004
35,-0.9785299999999999
36,-1.0372
37,-1.0904
38,-1.1103
39,-1.1231
40,-1.1461
41,-1.1733
42,-1.1936
43,-1.207
44,-1.213
45,-1.2362
46,-1.2411
47,-1.2274
48,-1.2066
49,-1.2126
50,-1.1776
51,-1.136
52,-1.0884
53,-1.0662
54,-1.014
55,-0.97415
56,-0.93034
57,-0.8759100000000001
58,-0.81844
59,-0.75592
60,-0.6886800000000001
61,-0.61705
62,-0.54251
63,-0.46631999999999996
64,-0.39907
65,-0.3314
66,-0.25348000000000004
67,-0.16435
68,-0.08399
69,0.00051529
70,0.10322
71,0.18742
72,0.27515
73,0.38461999999999996
74,0.48426
75,0.58658
76,0.69126
77,0.79814
78,0.90705
79,1.0179
80,1.1304
81,1.2397
82,1.3518
83,1.4624
84,1.5293
85,1.6109
86,1.6416
87,1.6719
88,1.6978
89,1.6912
90,1.683
91,1.6584
92,1.6343
93,1.556
94,1.4844
95,1.3759
96,1.2743
97,1.1649
98,1.0573
99,0.9517200000000001
100,0.83788
101,0.736
102,0.6247699999999999
103,0.5110399999999999
104,0.4042
105,0.29862
106,0.20717
107,0.11905
108,0.018284
109,-0.069086
110,-0.15916
111,-0.23351999999999998
112,-0.32302
113,-0.40291
114,-0.48241000000000006
115,-0.55808
116,-0.62962
117,-0.69671
118,-0.76232
119,-0.8237899999999999
120,-0.8952399999999999
121,-0.9420000000000001
122,-1.0122
123,-1.0473
124,-1.1066
125,-1.1285
126,-1.1757
127,-1.2168
128,-1.2512
129,-1.2788
130,-1.2675
131,-1.2773
132,-1.2826
133,-1.2806
134,-1.2711
135,-1.2544
136,-1.2304
137,-1.1994
138,-1.1617
139,-1.1178
140,-1.0679
141,-1.0433
142,-1.011
143,-0.96798
144,-0.90089
145,-0.8513799999999999
146,-0.7784
147,-0.73585
148,-0.6705
149,-0.5966
150,-0.5038199999999999
151,-0.43733999999999995
152,-0.37282
153,-0.30322
154,-0.22837
155,-0.13292
156,-0.039604
157,0.05025
158,0.15320999999999999
159,0.24419000000000002
160,0.33901
161,0.44743
162,0.55469
163,0.65866
164,0.76583
165,0.87656
166,0.98336
167,1.0922
168,1.1957
169,1.3023
170,1.395
171,1.45
172,1.5593
173,1.6124
174,1.6691
175,1.6943
