time,value
0,-1.1675
1,-1.1675
2,-1.1675
3,-1.1675
4,-1.1675
5,-1.1675
6,-1.1675
7,-1.1675
8,-1.1675
9,-1.1675
10,-1.1675
11,-1.1675
12,-1.1675
13,-1.1675
14,-1.1675
15,-1.1675
16,-1.1675
17,-1.1675
18,-1.1675
19,-1.1675
20,-1.1675
21,-1.1675
22,-1.1675
23,-1.1675
24,-1.1675
25,-1.1675
26,-1.1675
27,-1.1675
28,0.72414
29,1.8591
30,1.197
31,1.1025
32,0.72414
33,1.197
34,0.81872
35,0.53498
36,1.0079
37,0.9133
38,0.53498
39,0.81872
40,0.9133
41,0.53498
42,0.62956
43,0.81872
44,1.1025
45,1.8591
46,0.9133
47,0.81872
48,0.62956
49,0.53498
50,0.9133
51,0.81872
52,0.53498
53,0.72414
54,0.81872
55,0.62956
56,0.4404
57,0.81872
58,0.81872
59,0.4404
60,0.62956
61,0.81872
62,0.53498
63,0.53498
64,0.81872
65,0.81872
66,0.4404
67,0.62956
68,0.81872
69,0.53498
70,0.53498
71,0.9133
72,0.72414
73,0.53498
74,0.81872
75,1.4808
76,0.9133
77,0.81872
78,0.81872
79,0.72414
80,1.197
81,0.9133
82,0.72414
83,0.72414
84,-0.032512
85,-1.1675
86,-1.1675
87,-1.1675
88,-1.1675
89,-1.1675
90,-1.1675
91,-1.1675
92,-1.1675
93,-1.1675
94,-1.1675
95,-1.1675
