time,value
0,0.15179
1,-0.008340299999999998
2,0.15179
3,-0.008340299999999998
4,0.15179
5,-0.008340299999999998
6,0.15179
7,-0.008340299999999998
8,-0.008340299999999998
9,0.15179
10,-0.008340299999999998
11,0.15179
12,0.15179
13,-0.008340299999999998
14,0.15179
15,-0.008340299999999998
16,0.15179
17,-0.008340299999999998
18,0.15179
19,-0.008340299999999998
20,0.15179
21,-0.008340299999999998
22,0.15179
23,-0.008340299999999998
24,0.15179
25,-0.008340299999999998
26,0.15179
27,-0.008340299999999998
28,0.15179
29,-0.008340299999999998
30,0.15179
31,-0.008340299999999998
32,0.15179
33,-0.008340299999999998
34,0.15179
35,-0.008340299999999998
36,1.4329
37,0.15179
38,-0.008340299999999998
39,0.15179
40,-0.008340299999999998
41,0.15179
42,-0.008340299999999998
43,0.15179
44,-0.008340299999999998
45,0.15179
46,-0.008340299999999998
47,0.15179
48,-0.008340299999999998
49,0.15179
50,-0.008340299999999998
51,0.15179
52,-0.008340299999999998
53,0.15179
54,-0.008340299999999998
55,0.15179
56,-0.008340299999999998
57,-0.96914
58,-0.96914
59,-0.96914
60,-0.96914
61,-0.96914
62,-0.96914
63,-0.96914
64,-0.96914
65,-0.96914
66,-0.96914
67,-0.96914
68,-0.96914
69,-0.96914
70,-0.96914
71,-0.96914
72,-0.96914
73,-0.96914
74,-0.96914
75,-0.96914
76,-0.96914
77,-0.96914
78,-0.96914
79,-0.96914
80,-0.96914
81,-0.96914
82,-0.96914
83,-0.96914
84,2.7139
85,2.8741
86,2.7139
87,2.8741
88,2.7139
89,2.8741
90,2.7139
91,2.8741
92,1.2727
93,-0.96914
94,-0.96914
95,-0.96914
