time,value
0,-0.1758
1,-0.1758
2,-0.1758
3,-0.1758
4,-0.1758
5,-0.1758
6,-0.1758
7,-0.1758
8,-0.1758
9,-0.1758
10,-0.1758
11,-0.1758
12,-0.1758
13,-0.1758
14,-0.1758
15,-0.1758
16,-0.1758
17,-0.1758
18,-0.1758
19,-0.1758
20,-0.1758
21,-0.1758
22,-0.1758
23,-0.1758
24,-0.1758
25,-0.1758
26,-0.1758
27,-0.1758
28,-0.1758
29,-0.1758
30,-0.1758
31,-0.1758
32,-0.1758
33,-0.1758
34,-0.1758
35,-0.1758
36,-0.1758
37,-0.1758
38,-0.1758
39,-0.1758
40,-0.1758
41,-0.1758
42,-0.1758
43,-0.1758
44,-0.1758
45,-0.1758
46,-0.1758
47,-0.1758
48,-0.1758
49,-0.1758
50,-0.1758
51,-0.1758
52,-0.1758
53,-0.1758
54,-0.1758
55,-0.1758
56,-0.1758
57,-0.1758
58,-0.1758
59,-0.1758
60,-0.1758
61,-0.1758
62,-0.1758
63,-0.1758
64,-0.1758
65,-0.1758
66,-0.1758
67,-0.1758
68,-0.1758
69,-0.1758
70,-0.1758
71,-0.1758
72,-0.1758
73,-0.1758
74,-0.1758
75,-0.1758
76,-0.1758
77,-0.1758
78,-0.1758
79,-0.1758
80,-0.1758
81,-0.1758
82,-0.1758
83,-0.1758
84,-0.1758
85,-0.1758
86,-0.088446
87,0.10372999999999999
88,6.7077
89,0.1212
90,0.13867000000000002
91,0.1212
92,6.6553
93,1.7109999999999999
94,-0.1758
95,-0.1758
