time,value
0,-1.1469
1,-1.1469
2,-1.1469
3,-1.1469
4,-1.1469
5,-1.1469
6,-1.1469
7,-1.1469
8,-1.1469
9,-1.1469
10,-1.1469
11,-1.1469
12,-1.1469
13,-1.1469
14,-1.1469
15,-1.1469
16,-1.1469
17,-1.1469
18,-1.1469
19,-1.1469
20,-1.1469
21,-1.1469
22,-1.1469
23,-1.1469
24,0.32988
25,1.4785
26,1.0683
27,0.49396
28,0.7400899999999999
29,0.7400899999999999
30,0.41192
31,0.65805
32,0.7400899999999999
33,0.7400899999999999
34,0.7400899999999999
35,0.8221299999999999
36,0.49396
37,0.65805
38,0.8221299999999999
39,0.5760000000000001
40,-1.1469
41,-1.1469
42,0.32988
43,1.0683
44,0.9862200000000001
45,1.7246
46,0.24784
47,-1.1469
48,-0.4085
49,1.8887
50,2.6271
51,2.2989
52,1.3964
53,0.49396
54,-0.65463
55,0.8221299999999999
56,0.65805
57,-0.080333
58,0.41192
59,-0.4085
60,-1.1469
61,0.49396
62,1.0683
63,0.7400899999999999
64,0.8221299999999999
65,-0.90076
66,1.0683
67,0.7400899999999999
68,0.7400899999999999
69,0.49396
70,0.5760000000000001
71,0.8221299999999999
72,0.5760000000000001
73,0.49396
74,0.7400899999999999
75,0.65805
76,0.49396
77,0.65805
78,0.8221299999999999
79,0.49396
80,0.49396
81,0.7400899999999999
82,0.65805
83,0.41192
84,0.65805
85,0.7400899999999999
86,0.49396
87,0.5760000000000001
88,-1.1469
89,-1.1469
90,-1.1469
91,-1.1469
92,-1.1469
93,-1.1469
94,-1.1469
95,-1.1469
