time,value
0,-0.69803
1,-0.69803
2,-0.69803
3,-0.69803
4,-0.69803
5,-0.69803
6,-0.69803
7,-0.69803
8,-0.69803
9,-0.69803
10,-0.69803
11,-0.69803
12,-0.69803
13,-0.69803
14,-0.69803
15,-0.69803
16,-0.69803
17,-0.69803
18,-0.69803
19,-0.69803
20,-0.69803
21,-0.69803
22,-0.69803
23,-0.69803
24,-0.69803
25,-0.69803
26,-0.69803
27,-0.69803
28,-0.69803
29,-0.69803
30,-0.69803
31,-0.69803
32,-0.69803
33,-0.69803
34,-0.69803
35,-0.69803
36,-0.69803
37,-0.35555
38,-0.12724000000000002
39,-0.013081
40,-0.013081
41,-0.12724000000000002
42,-0.013081
43,-0.12724000000000002
44,-0.013081
45,-0.12724000000000002
46,-0.013081
47,-0.12724000000000002
48,-0.013081
49,-0.12724000000000002
50,-0.013081
51,-0.12724000000000002
52,-0.013081
53,-0.12724000000000002
54,-0.013081
55,-0.12724000000000002
56,-0.013081
57,-0.12724000000000002
58,-0.013081
59,-0.12724000000000002
60,-0.013081
61,1.2427
62,2.3842
63,2.3842
64,2.2701
65,2.2701
66,1.6993
67,-0.69803
68,-0.69803
69,-0.69803
70,-0.69803
71,-0.69803
72,-0.69803
73,-0.69803
74,-0.69803
75,-0.69803
76,0.7860199999999999
77,1.8134
78,1.0143
79,0.32939
80,1.9276
81,1.9276
82,1.9276
83,1.9276
84,1.9276
85,1.8134
86,1.9276
87,1.8134
88,1.8134
89,1.9276
90,1.8134
91,-0.12724000000000002
92,-0.69803
93,-0.69803
94,-0.69803
95,-0.69803
