time,value
0,-0.32928
1,-0.028224000000000003
2,-0.32928
3,-0.028224000000000003
4,-0.028224000000000003
5,-0.32928
6,-0.028224000000000003
7,-0.32928
8,-0.028224000000000003
9,-0.32928
10,-0.028224000000000003
11,-0.32928
12,-0.028224000000000003
13,-0.32928
14,-0.028224000000000003
15,-0.32928
16,-0.028224000000000003
17,-0.028224000000000003
18,-0.32928
19,-0.028224000000000003
20,-0.32928
21,-0.028224000000000003
22,-0.32928
23,-0.028224000000000003
24,-0.32928
25,-0.028224000000000003
26,-0.32928
27,-0.028224000000000003
28,-0.32928
29,-0.028224000000000003
30,-0.32928
31,-0.028224000000000003
32,-0.32928
33,-0.028224000000000003
34,-0.32928
35,-0.028224000000000003
36,-0.32928
37,-0.028224000000000003
38,-0.32928
39,-0.028224000000000003
40,-0.32928
41,-0.028224000000000003
42,-0.32928
43,-0.028224000000000003
44,-0.32928
45,-0.028224000000000003
46,-0.32928
47,-0.028224000000000003
48,-0.32928
49,-0.028224000000000003
50,-0.32928
51,-0.028224000000000003
52,-0.32928
53,-0.028224000000000003
54,-0.028224000000000003
55,-0.32928
56,-0.028224000000000003
57,-0.32928
58,-0.028224000000000003
59,-0.32928
60,-0.028224000000000003
61,-0.32928
62,-0.028224000000000003
63,-0.32928
64,-0.028224000000000003
65,-0.32928
66,-0.028224000000000003
67,-0.32928
68,-0.028224000000000003
69,-0.32928
70,-0.028224000000000003
71,-0.32928
72,-0.028224000000000003
73,-0.32928
74,-0.028224000000000003
75,-0.32928
76,-0.028224000000000003
77,-0.32928
78,-0.028224000000000003
79,-0.32928
80,-0.028224000000000003
81,-0.32928
82,-0.028224000000000003
83,0.27283
84,6.294
85,6.294
86,3.2834
87,-0.32928
88,-0.028224000000000003
89,-0.32928
90,-0.028224000000000003
91,-0.32928
92,-0.028224000000000003
93,-0.32928
94,-0.028224000000000003
95,-0.32928
