time,value
0,-0.8901600000000001
1,-0.61247
2,-0.82725
3,-1.1215
4,-1.1707
5,-1.0158
6,-0.94984
7,-0.97806
8,-0.9064200000000001
9,-1.0461
10,-0.98364
11,-0.7944
12,-0.6714899999999999
13,-0.57377
14,-0.47636999999999996
15,-0.42746999999999996
16,-0.20859
17,-0.1002
18,-0.0053933
19,0.079016
20,0.10443
21,0.22095
22,0.29068
23,0.29973
24,0.3257
25,0.38792
26,0.4165
27,0.3832
28,0.44641000000000003
29,0.42841999999999997
30,0.47823999999999994
31,0.52248
32,0.53523
33,0.493
34,0.5293899999999999
35,0.54929
36,0.67087
37,0.78584
38,1.0493
39,1.3721
40,1.8544
41,2.0131
42,2.1012
43,1.1309
44,0.8620700000000001
45,-0.25456
46,0.42793000000000003
47,0.60296
48,0.47135
49,0.18545
50,-0.13323
51,-0.31828
52,-0.38566999999999996
53,-0.48683999999999994
54,-0.39381
55,-0.54999
56,-0.6301899999999999
57,-0.57311
58,-0.63357
59,-0.6448
60,-0.47691000000000006
61,-0.34342
62,-0.23473000000000002
63,-0.1669
64,-0.15425999999999998
65,-0.049332
66,0.035348000000000004
67,0.21716999999999997
68,0.085575
69,0.10662
70,0.2999
71,0.36249000000000003
72,0.42165
73,0.42191000000000006
74,0.50133
75,0.5875
76,0.45611999999999997
77,0.43588999999999994
78,0.33483
79,0.58067
80,0.6351600000000001
81,0.67573
82,0.84677
83,0.89344
84,0.8355299999999999
85,1.0611
86,1.234
87,1.3583
88,1.1714
89,1.2083
90,1.3931
91,1.489
92,0.7219399999999999
93,1.2672
94,0.36246
95,0.10724000000000002
96,0.33194
97,0.33809
98,0.59873
99,1.2184
100,1.3604
101,1.2491
102,1.1072
103,1.3378
104,1.3063
105,0.50871
106,-2.7118
107,1.8243
108,-0.29383000000000004
109,1.1149
110,1.3274
111,1.7946
112,1.5209
113,1.3453
114,1.1951
115,-1.2428
116,0.35184
117,0.31351
118,0.30633
119,1.0462
120,1.1889
121,1.5146
122,1.7292
123,1.6385
124,1.4654
125,0.7457199999999999
126,-0.29366
127,-0.40146
128,0.7319899999999999
129,1.0869
130,0.9037299999999999
131,1.1386
132,1.5015
133,1.76
134,1.9301
135,1.8693
136,-1.4175
137,0.8887299999999999
138,2.3014
139,1.1043
140,1.1464
141,0.80877
142,0.66195
143,0.75817
144,0.8783799999999999
145,1.2855
146,1.3202
147,0.99295
148,0.9500200000000001
149,0.99093
150,1.0952
151,1.0245
152,0.6763100000000001
153,0.6340100000000001
154,0.8215600000000001
155,0.91254
156,0.43005
157,0.23776999999999998
158,0.24169000000000002
159,0.38716
160,0.71721
161,1.0079
162,1.0414
163,1.1213
164,1.0353
165,1.1901
166,1.1419
167,1.2052
168,1.3186
169,1.3181
170,1.3659999999999999
171,1.2945
172,1.1174
173,1.3552
174,1.6561
175,1.1214
176,0.8622799999999999
177,1.1874
178,0.9615299999999999
179,0.63815
180,0.55293
181,0.55061
182,0.19659000000000001
183,0.09790399999999999
184,0.14167000000000002
185,0.47756000000000004
186,0.59509
187,0.58467
188,0.92153
189,0.24423000000000003
190,0.23619
191,1.3395
192,1.2006
193,1.5915
194,1.296
195,-0.4261
196,-0.95563
197,-2.9619999999999997
198,-1.6219
199,-0.7018800000000001
200,-0.43767
201,-0.53617
202,-0.83681
203,-1.3251
204,-1.6538
205,-1.2491
206,-1.026
207,-1.1346
208,-0.8055
209,-0.92574
210,-0.84119
211,-0.85398
212,-0.88781
213,-0.88008
214,-1.0173
215,-0.8861899999999999
216,-0.9160299999999999
217,-0.79465
218,-0.7491399999999999
219,-0.81307
220,-0.8968700000000001
221,-0.86198
222,-0.80902
223,-0.8021
224,-0.82094
225,-0.8375
226,-0.78875
227,-0.76827
228,-0.76058
229,-0.79843
230,-0.85706
231,-0.8897200000000001
232,-0.8557899999999999
233,-0.87318
234,-0.8759299999999999
235,-0.89615
236,-0.9134399999999999
237,-0.9195
238,-1.0554
239,-1.0551
240,-1.0772
241,-1.0032
242,-0.9349700000000001
243,-0.9133600000000001
244,-0.90175
245,-0.9597
246,-0.99249
247,-0.98285
248,-1.0409
249,-1.0553
250,-1.0084
251,-1.0656
252,-1.0071
253,-0.9997799999999999
254,-1.0084
255,-0.95701
256,-1.0149
257,-1.0109
258,-1.0045
259,-1.0599
260,-1.0219
261,-1.011
262,-1.0113
263,-1.0485
264,-1.0124
265,-1.0273
266,-1.0284
267,-0.9551200000000001
268,-1.0626
269,-1.0565
270,-1.0894
271,-1.1079999999999999
272,-1.1453
273,-1.0292
274,-1.0627
275,-1.1474
276,-1.1484
277,-1.1334
278,-1.1684
279,-1.1592
280,-1.0513
281,-1.1636
282,-1.1751
283,-1.0792
284,-1.0784
285,-1.1693
286,-1.1639
287,-1.1448
288,-1.1573
289,-1.1715
290,-1.1503
291,-1.2752
292,-1.1723
293,-1.1737
294,-1.1632
295,-1.1721
296,-1.1757
297,-1.2967
298,-1.2919999999999998
299,-1.286
