time,value
0,-0.65898
1,-0.65898
2,-0.65898
3,-0.65898
4,-0.65898
5,-0.65898
6,-0.65898
7,-0.65898
8,-0.65898
9,-0.65898
10,-0.65898
11,-0.65898
12,-0.65898
13,-0.65898
14,-0.65898
15,-0.65898
16,-0.65898
17,-0.65898
18,-0.65898
19,-0.65898
20,-0.65898
21,-0.65898
22,-0.65898
23,-0.65898
24,-0.65898
25,-0.65898
26,-0.65898
27,-0.65898
28,0.09955900000000001
29,0.8581
30,2.0718
31,2.0718
32,2.0718
33,2.0718
34,2.0718
35,2.0718
36,2.0718
37,1.9201
38,1.7684
39,1.6166
40,1.7684
41,1.7684
42,1.7684
43,1.7684
44,1.3132
45,2.0718
46,0.8581
47,1.7684
48,0.8581
49,1.7684
50,1.0098
51,1.0098
52,-0.20385999999999999
53,0.09955900000000001
54,-0.35557
55,-0.65898
56,0.5546800000000001
57,0.70639
58,0.40298
59,-0.20385999999999999
60,-0.65898
61,-0.35557
62,-0.20385999999999999
63,-0.05215
64,-0.20385999999999999
65,-0.20385999999999999
66,-0.35557
67,-0.65898
68,-0.65898
69,-0.65898
70,-0.65898
71,-0.35557
72,-0.65898
73,-0.65898
74,-0.65898
75,-0.20385999999999999
76,-0.65898
77,-0.65898
78,-0.65898
79,-0.65898
80,-0.65898
81,-0.65898
82,-0.65898
83,-0.65898
84,-0.65898
85,-0.65898
86,-0.65898
87,-0.65898
88,-0.65898
89,-0.65898
90,-0.65898
91,-0.65898
92,-0.65898
93,-0.65898
94,-0.65898
95,-0.65898
