time,value
0,-0.80003
1,1.4022
2,-0.80003
3,-0.80003
4,1.5398
5,-0.80003
6,-0.80003
7,1.5398
8,-0.80003
9,-0.80003
10,1.6775
11,-0.80003
12,-0.80003
13,1.2646
14,-0.52475
15,-0.80003
16,0.85164
17,0.025807
18,-0.80003
19,0.16345
20,0.57636
21,-0.80003
22,-0.38711
23,1.1269
24,-0.80003
25,-0.80003
26,1.5398
27,-0.80003
28,-0.80003
29,1.5398
30,-0.80003
31,-0.80003
32,1.4022
33,-0.80003
34,-0.80003
35,1.5398
36,-0.80003
37,0.025807
38,0.57636
39,-0.80003
40,0.57636
41,0.16345
42,-0.80003
43,0.9892799999999999
44,-0.24946999999999997
45,-0.80003
46,1.5398
47,-0.80003
48,-0.80003
49,1.6775
50,-0.80003
51,-0.80003
52,1.5398
53,-0.80003
54,-0.80003
55,1.6775
56,-0.80003
57,-0.80003
58,1.4022
59,-0.80003
60,-0.38711
61,1.2646
62,-0.80003
63,-0.11183
64,0.9892799999999999
65,-0.80003
66,-0.24946999999999997
67,1.1269
68,-0.80003
69,-0.38711
70,1.2646
71,-0.80003
72,-0.52475
73,1.6775
74,-0.80003
75,0.85164
76,0.025807
77,-0.80003
78,1.4022
79,-0.52475
80,-0.80003
81,1.6775
82,-0.80003
83,-0.80003
84,1.6775
85,-0.80003
86,-0.80003
87,1.6775
88,-0.80003
89,-0.80003
90,1.6775
91,-0.80003
92,-0.80003
93,1.6775
94,-0.80003
95,-0.80003
