time,value
0,1.6764
1,-0.59029
2,-0.59029
3,-0.59029
4,1.6764
5,-0.59029
6,-0.59029
7,-0.59029
8,1.6764
9,-0.59029
10,-0.59029
11,-0.59029
12,1.6764
13,-0.59029
14,-0.59029
15,1.6764
16,-0.59029
17,-0.59029
18,-0.59029
19,1.6764
20,-0.59029
21,-0.59029
22,-0.59029
23,1.6764
24,-0.59029
25,-0.59029
26,-0.59029
27,1.6764
28,-0.59029
29,-0.59029
30,-0.59029
31,1.6764
32,-0.59029
33,-0.59029
34,-0.59029
35,1.6764
36,-0.59029
37,-0.59029
38,-0.59029
39,1.6764
40,-0.59029
41,-0.59029
42,-0.59029
43,1.6764
44,-0.59029
45,-0.59029
46,-0.59029
47,1.6764
48,-0.59029
49,-0.59029
50,-0.59029
51,1.6764
52,-0.59029
53,-0.59029
54,-0.59029
55,1.6764
56,-0.59029
57,-0.59029
58,-0.59029
59,1.6764
60,-0.59029
61,-0.59029
62,-0.59029
63,1.6764
64,-0.59029
65,-0.59029
66,-0.59029
67,1.6764
68,-0.59029
69,-0.59029
70,-0.59029
71,1.6764
72,-0.59029
73,-0.59029
74,1.6764
75,-0.59029
76,-0.59029
77,-0.59029
78,1.6764
79,-0.59029
80,-0.59029
81,-0.59029
82,1.6764
83,-0.59029
84,-0.59029
85,-0.59029
86,1.6764
87,-0.59029
88,-0.59029
89,-0.59029
90,1.6764
91,-0.59029
92,-0.59029
93,-0.59029
94,1.6764
95,-0.59029
