time,value
0,-0.34059
1,-0.34059
2,-0.34059
3,-0.34059
4,-0.34059
5,-0.34059
6,-0.34059
7,-0.34059
8,-0.34059
9,-0.34059
10,-0.34059
11,-0.34059
12,-0.34059
13,-0.34059
14,-0.34059
15,-0.34059
16,-0.34059
17,-0.34059
18,-0.34059
19,-0.34059
20,-0.34059
21,-0.34059
22,-0.34059
23,-0.34059
24,-0.34059
25,-0.34059
26,-0.34059
27,-0.34059
28,-0.34059
29,-0.34059
30,1.9089
31,1.3267
32,1.6045
33,-0.34059
34,-0.34059
35,-0.34059
36,-0.34059
37,-0.34059
38,-0.34059
39,-0.34059
40,-0.34059
41,-0.34059
42,-0.34059
43,-0.34059
44,-0.11564
45,0.149
46,-0.34059
47,-0.34059
48,5.9844
49,3.9731
50,2.9277
51,1.5119
52,-0.34059
53,-0.34059
54,-0.34059
55,-0.34059
56,-0.34059
57,-0.34059
58,-0.34059
59,-0.34059
60,-0.34059
61,-0.34059
62,-0.34059
63,-0.34059
64,3.5232
65,1.062
66,-0.34059
67,0.4798
68,0.65182
69,0.34748
70,0.70475
71,0.73121
72,0.13577
73,-0.34059
74,-0.34059
75,-0.34059
76,-0.34059
77,-0.34059
78,-0.34059
79,-0.34059
80,-0.34059
81,-0.34059
82,-0.34059
83,-0.34059
84,-0.34059
85,-0.34059
86,-0.34059
87,-0.34059
88,-0.34059
89,-0.34059
90,-0.34059
91,-0.34059
92,-0.34059
93,-0.34059
94,-0.34059
95,-0.34059
