time,value
0,0.43163999999999997
1,0.43163999999999997
2,0.43163999999999997
3,0.43163999999999997
4,-2.0059
5,0.43163999999999997
6,0.43163999999999997
7,0.43163999999999997
8,0.43163999999999997
9,-2.0059
10,0.43163999999999997
11,0.43163999999999997
12,0.43163999999999997
13,0.43163999999999997
14,-2.0059
15,0.43163999999999997
16,0.43163999999999997
17,0.43163999999999997
18,0.43163999999999997
19,-2.0059
20,0.43163999999999997
21,0.43163999999999997
22,0.43163999999999997
23,0.43163999999999997
24,-2.0059
25,0.43163999999999997
26,0.43163999999999997
27,0.43163999999999997
28,0.43163999999999997
29,-2.0059
30,2.8691
31,0.43163999999999997
32,0.43163999999999997
33,0.43163999999999997
34,0.43163999999999997
35,-2.0059
36,0.43163999999999997
37,0.43163999999999997
38,0.43163999999999997
39,0.43163999999999997
40,-2.0059
41,0.43163999999999997
42,0.43163999999999997
43,0.43163999999999997
44,-2.0059
45,0.43163999999999997
46,0.43163999999999997
47,0.43163999999999997
48,0.43163999999999997
49,-2.0059
50,0.43163999999999997
51,0.43163999999999997
52,0.43163999999999997
53,0.43163999999999997
54,-2.0059
55,0.43163999999999997
56,0.43163999999999997
57,0.43163999999999997
58,0.43163999999999997
59,-2.0059
60,0.43163999999999997
61,0.43163999999999997
62,0.43163999999999997
63,-2.0059
64,0.43163999999999997
65,0.43163999999999997
66,0.43163999999999997
67,0.43163999999999997
68,0.43163999999999997
69,0.43163999999999997
70,0.43163999999999997
71,0.43163999999999997
72,0.43163999999999997
73,0.43163999999999997
74,-2.0059
75,0.43163999999999997
76,0.43163999999999997
77,0.43163999999999997
78,0.43163999999999997
79,-2.0059
80,0.43163999999999997
81,0.43163999999999997
82,0.43163999999999997
83,0.43163999999999997
84,-2.0059
85,0.43163999999999997
86,0.43163999999999997
87,0.43163999999999997
88,0.43163999999999997
89,-2.0059
90,0.43163999999999997
91,0.43163999999999997
92,0.43163999999999997
93,0.43163999999999997
94,-2.0059
95,0.43163999999999997
