time,value
0,-0.17981
1,-0.17981
2,-0.17981
3,-0.17981
4,-0.17981
5,-0.17981
6,-0.17981
7,-0.17981
8,-0.17981
9,-0.17981
10,-0.17981
11,-0.17981
12,-0.17981
13,-0.17981
14,-0.17981
15,-0.17981
16,-0.17981
17,-0.17981
18,-0.17981
19,-0.17981
20,-0.17981
21,-0.17981
22,-0.17981
23,-0.17981
24,-0.17981
25,-0.17981
26,-0.17981
27,-0.17981
28,-0.17981
29,-0.17981
30,0.056451
31,6.3175
32,1.0606
33,0.056451
34,0.07121799999999999
35,0.056451
36,7.0558
37,1.1492
38,-0.17981
39,-0.17981
40,-0.17981
41,-0.17981
42,-0.17981
43,-0.17981
44,-0.17981
45,-0.17981
46,-0.17981
47,-0.17981
48,-0.17981
49,-0.17981
50,-0.17981
51,-0.17981
52,-0.17981
53,-0.17981
54,-0.17981
55,-0.17981
56,-0.17981
57,-0.17981
58,-0.17981
59,-0.17981
60,-0.17981
61,-0.17981
62,-0.17981
63,-0.17981
64,-0.17981
65,-0.17981
66,-0.17981
67,-0.17981
68,-0.17981
69,-0.17981
70,-0.17981
71,-0.17981
72,-0.17981
73,-0.17981
74,-0.17981
75,-0.17981
76,-0.17981
77,-0.17981
78,-0.17981
79,-0.17981
80,-0.17981
81,-0.17981
82,-0.17981
83,-0.17981
84,-0.17981
85,-0.17981
86,-0.17981
87,-0.17981
88,-0.17981
89,-0.17981
90,-0.17981
91,-0.17981
92,-0.17981
93,-0.17981
94,-0.17981
95,-0.17981
