time,value
0,-0.21074
1,-0.21074
2,-0.21074
3,-0.21074
4,-0.21074
5,-0.21074
6,-0.21074
7,-0.21074
8,-0.21074
9,-0.21074
10,-0.21074
11,-0.21074
12,-0.21074
13,-0.21074
14,-0.21074
15,-0.21074
16,-0.21074
17,-0.21074
18,-0.21074
19,-0.21074
20,-0.21074
21,-0.21074
22,-0.21074
23,-0.21074
24,-0.21074
25,-0.21074
26,-0.21074
27,-0.21074
28,-0.21074
29,-0.21074
30,-0.21074
31,-0.21074
32,-0.21074
33,-0.21074
34,-0.21074
35,-0.21074
36,-0.21074
37,-0.21074
38,-0.21074
39,-0.21074
40,-0.21074
41,-0.21074
42,-0.21074
43,-0.21074
44,-0.21074
45,-0.21074
46,-0.21074
47,-0.21074
48,-0.21074
49,-0.21074
50,-0.21074
51,-0.21074
52,-0.21074
53,4.9229
54,0.69965
55,-0.059007000000000004
56,-0.21074
57,-0.21074
58,-0.21074
59,-0.21074
60,5.7574
61,0.80081
62,-0.21074
63,-0.21074
64,-0.21074
65,-0.21074
66,-0.21074
67,-0.21074
68,-0.21074
69,-0.21074
70,-0.21074
71,-0.21074
72,-0.21074
73,-0.21074
74,-0.21074
75,-0.21074
76,-0.21074
77,5.6815
78,0.26975
79,0.47206000000000004
80,-0.21074
81,-0.21074
82,-0.21074
83,-0.21074
84,-0.21074
85,-0.21074
86,-0.21074
87,-0.21074
88,-0.21074
89,-0.21074
90,-0.21074
91,-0.21074
92,-0.21074
93,-0.21074
94,-0.21074
95,-0.21074
