time,value
0,-0.24061999999999997
1,-0.24061999999999997
2,-0.24061999999999997
3,-0.24061999999999997
4,-0.24061999999999997
5,-0.24061999999999997
6,-0.24061999999999997
7,-0.24061999999999997
8,-0.24061999999999997
9,-0.24061999999999997
10,-0.24061999999999997
11,-0.24061999999999997
12,-0.24061999999999997
13,-0.24061999999999997
14,-0.24061999999999997
15,-0.24061999999999997
16,-0.24061999999999997
17,-0.24061999999999997
18,-0.24061999999999997
19,-0.24061999999999997
20,-0.24061999999999997
21,-0.24061999999999997
22,-0.24061999999999997
23,-0.24061999999999997
24,-0.24061999999999997
25,-0.24061999999999997
26,-0.24061999999999997
27,-0.24061999999999997
28,-0.24061999999999997
29,-0.24061999999999997
30,5.5504
31,2.9049
32,0.27557
33,0.30783
34,-0.24061999999999997
35,-0.24061999999999997
36,-0.24061999999999997
37,-0.24061999999999997
38,-0.24061999999999997
39,-0.24061999999999997
40,-0.24061999999999997
41,-0.24061999999999997
42,-0.24061999999999997
43,-0.24061999999999997
44,-0.24061999999999997
45,-0.24061999999999997
46,-0.15997
47,3.3727
48,0.065868
49,0.081999
50,-0.14382999999999999
51,-0.24061999999999997
52,-0.24061999999999997
53,-0.24061999999999997
54,-0.24061999999999997
55,-0.24061999999999997
56,-0.24061999999999997
57,-0.24061999999999997
58,-0.24061999999999997
59,-0.24061999999999997
60,-0.24061999999999997
61,-0.24061999999999997
62,-0.24061999999999997
63,-0.24061999999999997
64,-0.24061999999999997
65,-0.24061999999999997
66,-0.24061999999999997
67,-0.24061999999999997
68,-0.24061999999999997
69,-0.24061999999999997
70,-0.24061999999999997
71,-0.24061999999999997
72,-0.24061999999999997
73,-0.24061999999999997
74,-0.24061999999999997
75,-0.24061999999999997
76,-0.24061999999999997
77,0.71111
78,6.2118
79,0.27557
80,0.45301
81,-0.1761
82,-0.24061999999999997
83,-0.24061999999999997
84,-0.24061999999999997
85,-0.24061999999999997
86,-0.24061999999999997
87,-0.24061999999999997
88,-0.24061999999999997
89,-0.24061999999999997
90,-0.24061999999999997
91,-0.24061999999999997
92,-0.24061999999999997
93,-0.24061999999999997
94,-0.24061999999999997
95,-0.24061999999999997
