time,value
0,-0.55976
1,-0.55976
2,-0.55976
3,-0.55976
4,-0.55976
5,-0.55976
6,-0.55976
7,-0.55976
8,-0.55976
9,-0.55976
10,-0.55976
11,-0.55976
12,-0.55976
13,-0.55976
14,-0.55976
15,-0.55976
16,-0.55976
17,-0.55976
18,-0.55976
19,-0.55976
20,-0.55976
21,-0.55976
22,-0.55976
23,-0.55976
24,-0.55976
25,-0.55976
26,-0.55976
27,-0.55976
28,-0.55976
29,-0.55976
30,-0.55976
31,-0.55976
32,-0.55976
33,-0.55976
34,-0.55976
35,-0.55976
36,-0.55976
37,-0.55976
38,-0.55976
39,-0.55976
40,-0.22599
41,0.10778
42,0.10778
43,-0.0034768
44,0.10778
45,0.10778
46,0.10778
47,-0.0034768
48,0.10778
49,0.10778
50,0.10778
51,-0.0034768
52,0.10778
53,0.10778
54,0.10778
55,-0.0034768
56,-0.22599
57,-0.55976
58,-0.55976
59,-0.55976
60,-0.55976
61,-0.55976
62,-0.55976
63,-0.55976
64,-0.55976
65,-0.55976
66,-0.55976
67,-0.55976
68,-0.55976
69,-0.55976
70,-0.55976
71,-0.55976
72,-0.55976
73,-0.55976
74,-0.55976
75,-0.55976
76,1.8879
77,2.1104
78,2.1104
79,1.9991
80,1.9991
81,2.1104
82,1.9991
83,1.9991
84,2.1104
85,2.3329
86,2.2217
87,2.4442
88,2.3329
89,2.1104
90,2.4442
91,2.3329
92,-0.55976
93,-0.55976
94,-0.55976
95,-0.55976
