time,value
0,-0.39883
1,-0.23995999999999998
2,-0.39883
3,-0.39883
4,-0.39883
5,-0.23995999999999998
6,-0.39883
7,-0.39883
8,-0.39883
9,-0.23995999999999998
10,-0.39883
11,-0.39883
12,-0.39883
13,-0.23995999999999998
14,-0.39883
15,-0.39883
16,-0.23995999999999998
17,-0.39883
18,-0.39883
19,-0.39883
20,-0.23995999999999998
21,-0.39883
22,-0.39883
23,-0.39883
24,-0.23995999999999998
25,-0.39883
26,-0.39883
27,-0.39883
28,-0.23995999999999998
29,-0.39883
30,-0.39883
31,-0.39883
32,-0.23995999999999998
33,-0.39883
34,-0.39883
35,-0.39883
36,-0.23995999999999998
37,-0.39883
38,-0.39883
39,-0.39883
40,-0.23995999999999998
41,-0.39883
42,-0.39883
43,-0.23995999999999998
44,-0.39883
45,-0.39883
46,-0.39883
47,-0.23995999999999998
48,-0.39883
49,-0.39883
50,-0.39883
51,-0.23995999999999998
52,-0.39883
53,-0.39883
54,-0.39883
55,-0.23995999999999998
56,-0.39883
57,-0.39883
58,-0.39883
59,-0.23995999999999998
60,-0.39883
61,-0.39883
62,-0.39883
63,-0.23995999999999998
64,-0.39883
65,-0.39883
66,-0.39883
67,-0.23995999999999998
68,-0.39883
69,-0.39883
70,-0.39883
71,-0.23995999999999998
72,-0.39883
73,-0.39883
74,-0.23995999999999998
75,-0.39883
76,-0.23995999999999998
77,-0.39883
78,-0.23995999999999998
79,0.077779
80,2.7785
81,2.6197
82,2.6197
83,2.7785
84,3.0963
85,2.9374
86,2.7785
87,3.0963
88,3.0963
89,2.9374
90,1.031
91,-0.39883
92,-0.39883
93,-0.39883
94,-0.23995999999999998
95,-0.39883
