[<text>
<title>precision aerotech inc &lt;par&gt; 3rd qtr jan 31 net</title>
<dateline>    la jolla, calif., march 12 -
    </dateline>oper shr 16 cts vs two cts
    oper net 467,000 vs 52,000
    sales 8,954,000 vs 6,338,000
    avg shrs 2,939,459 vs 1,979,916
    nine mths
    oper shr 45 cts vs 18 cts
    oper net 1,068,000 vs 387,000
    sales 24.5 mln vs 19.6 mln
    avg shrs 2,299,764 vs 1,979,916
    note: current year net both periods excludes 176,000 dlr
gain from retirement of notes.
    backlog 30.8 mln vs 26.7 mln at start of fiscal year.
 reuter
</text>]