time,value
0,1.228
1,1.228
2,1.228
3,0.8949799999999999
4,-0.43708
5,-1.1031
6,-1.1031
7,-1.1031
8,-1.1031
9,-1.1031
10,-1.1031
11,-1.1031
12,-1.1031
13,-1.1031
14,-1.1031
15,-1.1031
16,-1.1031
17,-1.1031
18,-1.1031
19,-1.1031
20,-1.1031
21,-1.1031
22,-1.1031
23,-1.1031
24,-1.1031
25,-1.1031
26,-1.1031
27,-1.1031
28,-1.1031
29,-1.1031
30,-1.1031
31,-1.1031
32,-1.1031
33,-1.1031
34,-1.1031
35,-1.1031
36,-1.1031
37,-1.1031
38,-1.1031
39,-1.1031
40,-1.1031
41,-1.1031
42,-1.1031
43,-1.1031
44,0.22895
45,1.561
46,1.228
47,0.8949799999999999
48,1.228
49,1.228
50,0.56197
51,0.8949799999999999
52,1.228
53,1.228
54,1.228
55,1.228
56,1.228
57,1.228
58,1.228
59,1.228
60,1.228
61,1.228
62,0.8949799999999999
63,1.228
64,1.228
65,0.8949799999999999
66,1.228
67,1.228
68,0.8949799999999999
69,0.22895
70,0.22895
71,0.56197
72,0.22895
73,0.22895
74,0.56197
75,0.22895
76,0.56197
77,0.22895
78,0.22895
79,0.56197
80,0.8949799999999999
81,1.228
82,0.8949799999999999
83,0.22895
84,0.22895
85,0.56197
86,0.22895
87,0.56197
88,0.22895
89,0.22895
90,0.56197
91,0.22895
92,0.8949799999999999
93,1.228
94,0.22895
95,-1.1031
