[<text>
<title>ultramar plc &lt;umar.l&gt; 1986 year</title>
<dateline>    london, march 11 -
    </dateline>shr 8.1p loss vs 26.3p earnings
    div 3.25p making 5.25p vs 10.5p
    net loss 62.1 mln stg vs 71.6 mln profit
    operating profit before tax 73.6 mln vs 273.8 mln
    turnover 1.47 billion vs 1.74 billion
    cost of sales 1.22 billion vs 1.39 billion
    gross profit 241.8 mln vs 357.6 mln
    distribution costs and administrative expenses 152.2 mln vs
    123.1 mln
    share of profits in associates 17.1 mln vs 68.2 mln
    other operating income 15.8 mln vs 16.9 mln
    financing charges 48.9 mln vs 45.8 mln
    tax 63.9 mln vs 169.7 mln
    exceptional items 4.9 mln debit vs 5.5 mln debit
    net results of discontinued operations 15.6 mln debit vs
    20.9 mln debit
    loss on ordinary activities before minority interest 10.8
    mln vs 77.7 mln profit
    minority interest 11.3 mln vs 6.1 mln
    extraordinary debits 40.0 mln vs nil
 reuter
</text>]