time,value
0,-0.18818
1,-0.18818
2,-0.18818
3,-0.18818
4,-0.18818
5,-0.18818
6,-0.18818
7,-0.18818
8,-0.18818
9,-0.18818
10,-0.18818
11,-0.18818
12,-0.18818
13,-0.18818
14,-0.18818
15,-0.18818
16,-0.18818
17,-0.18818
18,-0.18818
19,-0.18818
20,-0.18818
21,-0.18818
22,-0.18818
23,-0.18818
24,-0.18818
25,-0.18818
26,-0.18818
27,-0.18818
28,-0.18818
29,-0.18818
30,-0.18818
31,-0.18818
32,-0.18818
33,-0.18818
34,-0.18818
35,-0.18818
36,-0.18818
37,-0.18818
38,-0.18818
39,-0.18818
40,-0.18818
41,-0.18818
42,-0.18818
43,-0.18818
44,-0.18818
45,-0.18818
46,-0.18818
47,-0.18818
48,-0.18818
49,-0.18818
50,-0.18818
51,-0.18818
52,-0.18818
53,-0.18818
54,-0.18818
55,-0.18818
56,-0.18818
57,-0.098927
58,0.097439
59,6.7917
60,0.13314
61,0.11529
62,0.079588
63,5.4707
64,3.9712
65,-0.18818
66,-0.18818
67,-0.18818
68,-0.18818
69,-0.18818
70,-0.18818
71,-0.18818
72,-0.18818
73,-0.18818
74,-0.18818
75,-0.18818
76,-0.18818
77,-0.18818
78,-0.18818
79,-0.18818
80,-0.18818
81,-0.18818
82,-0.18818
83,-0.18818
84,-0.18818
85,-0.18818
86,-0.18818
87,-0.18818
88,-0.18818
89,-0.18818
90,-0.18818
91,-0.18818
92,-0.18818
93,-0.18818
94,-0.18818
95,-0.18818
