time,value
0,-0.16668
1,-0.16668
2,-0.16668
3,-0.16668
4,-0.16668
5,-0.16668
6,-0.16668
7,-0.16668
8,-0.16668
9,-0.16668
10,-0.16668
11,-0.16668
12,-0.16668
13,-0.16668
14,-0.16668
15,-0.16668
16,-0.16668
17,-0.16668
18,-0.16668
19,-0.16668
20,-0.16668
21,-0.16668
22,-0.16668
23,-0.16668
24,-0.16668
25,-0.16668
26,-0.16668
27,-0.16668
28,-0.16668
29,-0.16668
30,-0.16668
31,-0.16668
32,-0.16668
33,-0.16668
34,-0.16668
35,-0.16668
36,-0.16668
37,-0.16668
38,-0.16668
39,-0.16668
40,-0.16668
41,-0.16668
42,-0.16668
43,-0.16668
44,-0.16668
45,-0.16668
46,-0.16668
47,-0.16668
48,-0.16668
49,-0.16668
50,-0.16668
51,-0.16668
52,-0.16668
53,-0.16668
54,-0.16668
55,-0.16668
56,-0.16668
57,-0.16668
58,-0.16668
59,-0.16668
60,-0.16668
61,-0.16668
62,-0.16668
63,-0.16668
64,-0.16668
65,-0.16668
66,-0.16668
67,-0.16668
68,-0.16668
69,-0.16668
70,-0.16668
71,-0.16668
72,-0.16668
73,-0.16668
74,-0.16668
75,-0.16668
76,-0.16668
77,-0.16668
78,-0.16668
79,-0.16668
80,-0.16668
81,-0.16668
82,-0.16668
83,-0.16668
84,-0.16668
85,-0.16668
86,-0.16668
87,-0.16668
88,-0.16668
89,-0.16668
90,-0.16668
91,-0.16668
92,-0.09954199999999999
93,7.4199
94,5.6296
95,2.3846
