[<text>
<title>american filtrona corp &lt;afil.o&gt; 3rd qtr</title>
<dateline>    richmond, va., oct 20 -
    </dateline>shr 31 cts vs 36 cts
    net 1,156,000 vs 1,358,000
    revs 31.2 mln vs 28.6 mln
    nine mths
    shr 1.10 dlrs vs 1.20 dlrs
    net 4,064,000 vs 4,525,000
    revs 91.3 mln vs 86.4 mln
    note: 1987 3rd qtr includes a charge of 700,000 dlrs or 19
cts a share for relocation costs for phase out some operations.
 reuter
</text>]