time,value
0,1.078
1,1.078
2,1.078
3,1.1852
4,1.078
5,1.078
6,1.1852
7,1.078
8,1.078
9,1.1852
10,1.078
11,1.078
12,1.078
13,1.1852
14,1.078
15,1.078
16,1.078
17,1.1852
18,1.078
19,1.078
20,1.1852
21,1.078
22,1.078
23,1.078
24,1.1852
25,1.078
26,1.078
27,1.1852
28,1.078
29,1.078
30,1.1852
31,1.078
32,1.3997
33,3.7589
34,1.5069
35,1.078
36,1.1852
37,0.3273
38,-0.7450899999999999
39,-0.7450899999999999
40,-0.8523299999999999
41,-0.7450899999999999
42,-0.7450899999999999
43,-0.7450899999999999
44,-0.8523299999999999
45,-0.7450899999999999
46,-0.7450899999999999
47,-0.7450899999999999
48,-0.8523299999999999
49,-0.7450899999999999
50,-0.7450899999999999
51,-0.7450899999999999
52,-0.8523299999999999
53,-0.7450899999999999
54,-0.7450899999999999
55,-0.7450899999999999
56,-0.8523299999999999
57,-0.7450899999999999
58,-0.7450899999999999
59,-0.7450899999999999
60,-0.8523299999999999
61,-0.7450899999999999
62,-0.7450899999999999
63,-0.7450899999999999
64,-0.7450899999999999
65,-0.8523299999999999
66,-0.7450899999999999
67,-0.7450899999999999
68,-0.7450899999999999
69,-0.8523299999999999
70,-0.7450899999999999
71,-0.7450899999999999
72,-0.7450899999999999
73,-0.8523299999999999
74,-0.7450899999999999
75,-0.7450899999999999
76,-0.7450899999999999
77,-0.8523299999999999
78,-0.7450899999999999
79,-0.7450899999999999
80,-0.7450899999999999
81,-0.8523299999999999
82,-0.7450899999999999
83,-0.7450899999999999
84,-0.7450899999999999
85,-0.8523299999999999
86,-0.7450899999999999
87,-0.7450899999999999
88,-0.7450899999999999
89,-0.8523299999999999
90,-0.7450899999999999
91,-0.7450899999999999
92,-0.7450899999999999
93,-0.8523299999999999
94,-0.7450899999999999
95,-0.7450899999999999
