time,value
0,0.68258
1,1.2363
2,1.0518
3,-0.97869
4,-0.97869
5,-0.97869
6,0.498
7,1.3286
8,1.2363
9,-0.97869
10,-0.97869
11,-0.97869
12,0.22111999999999998
13,1.3286
14,1.3286
15,-0.7941
16,-0.97869
17,-0.97869
18,0.12883
19,1.3286
20,1.3286
21,-0.70181
22,-0.97869
23,-0.97869
24,0.036532
25,1.2363
26,1.2363
27,-0.51722
28,-0.97869
29,-0.97869
30,-0.33264
31,1.2363
32,1.3286
33,-0.24035
34,-0.97869
35,-0.97869
36,-0.7941
37,1.3286
38,1.2363
39,0.12883
40,-0.97869
41,-0.97869
42,-0.97869
43,1.2363
44,1.3286
45,0.31340999999999997
46,-0.97869
47,-0.97869
48,-0.97869
49,1.3286
50,1.2363
51,0.4057
52,-0.97869
53,-0.97869
54,-0.97869
55,1.4209
56,1.2363
57,0.22111999999999998
58,-0.97869
59,-0.97869
60,-0.7941
61,1.4209
62,1.2363
63,0.22111999999999998
64,-0.97869
65,-0.97869
66,-0.51722
67,1.3286
68,1.3286
69,-0.14805
70,-0.97869
71,-0.97869
72,-0.14805
73,1.3286
74,1.2363
75,-0.42493000000000003
76,-0.97869
77,-0.97869
78,0.12883
79,1.3286
80,1.2363
81,-0.7941
82,-0.97869
83,-0.97869
84,0.22111999999999998
85,1.3286
86,1.0518
87,-0.97869
88,-0.97869
89,-0.97869
90,0.31340999999999997
91,1.3286
92,1.1440000000000001
93,-0.97869
94,-0.97869
95,-0.97869
