time,value
0,1.2172
1,-1.1163
2,1.2172
3,-1.1163
4,1.3967
5,-1.1163
6,0.49923999999999996
7,-0.39826999999999996
8,-0.21877
9,0.31974
10,-1.1163
11,1.3967
12,-1.1163
13,1.2172
14,-1.1163
15,1.0377
16,-0.75727
17,-0.21877
18,0.31974
19,-1.1163
20,1.3967
21,-1.1163
22,1.2172
23,-1.1163
24,0.49923999999999996
25,-0.21877
26,-1.1163
27,1.0377
28,-1.1163
29,1.2172
30,-1.1163
31,0.85824
32,-0.57777
33,-0.57777
34,0.67874
35,-1.1163
36,1.3967
37,-1.1163
38,1.2172
39,-1.1163
40,-0.39826999999999996
41,0.49923999999999996
42,-1.1163
43,1.3967
44,-1.1163
45,1.2172
46,-1.1163
47,1.3967
48,-1.1163
49,1.2172
50,-1.1163
51,1.2172
52,-1.1163
53,1.2172
54,-1.1163
55,1.2172
56,-1.1163
57,1.2172
58,-1.1163
59,1.0377
60,-1.1163
61,0.85824
62,-0.75727
63,0.67874
64,-0.57777
65,0.31974
66,-0.21877
67,-0.039266
68,0.14024
69,-0.57777
70,0.85824
71,-1.1163
72,1.2172
73,-1.1163
74,1.3967
75,-1.1163
76,1.2172
77,-1.1163
78,0.85824
79,-0.57777
80,0.67874
81,-0.57777
82,0.67874
83,-0.39826999999999996
84,1.2172
85,-1.1163
86,1.3967
87,-1.1163
88,1.2172
89,-0.75727
90,0.85824
91,-0.57777
92,0.67874
93,-0.57777
94,0.67874
95,-1.1163
