time,value
0,-1.0666
1,-1.0666
2,-1.0666
3,-1.1156
4,-1.0666
5,-1.0666
6,-1.0666
7,-1.0666
8,-1.0666
9,-1.0666
10,-1.1156
11,-1.0666
12,-0.96855
13,-1.1156
14,-1.0666
15,-1.0666
16,-1.0666
17,-1.1156
18,-1.0666
19,-1.0666
20,-1.0176
21,-1.0666
22,-1.1156
23,-1.0666
24,-1.0666
25,-1.0666
26,-1.1156
27,-1.0666
28,-1.0666
29,-0.6744600000000001
30,-0.1353
31,-1.0666
32,-1.1156
33,-1.0666
34,0.2078
35,0.894
36,0.894
37,0.894
38,0.894
39,0.894
40,0.99203
41,0.894
42,0.894
43,0.84499
44,0.894
45,0.011743
46,-1.0666
47,-0.96855
48,-0.91953
49,-0.8705200000000001
50,-0.8705200000000001
51,-0.8705200000000001
52,-0.96855
53,-1.0666
54,-1.0666
55,-1.0666
56,-0.4784
57,0.894
58,0.894
59,0.894
60,0.84499
61,0.894
62,0.894
63,0.99203
64,1.0901
65,1.0901
66,1.041
67,1.0901
68,0.9430200000000001
69,0.894
70,0.84499
71,0.84499
72,0.84499
73,0.84499
74,0.84499
75,1.0901
76,1.041
77,1.0901
78,1.041
79,1.0901
80,1.1391
81,1.041
82,1.1391
83,1.0901
84,1.0901
85,1.0901
86,1.1391
87,1.0901
88,1.1391
89,1.0901
90,1.1391
91,1.0901
92,1.1391
93,1.0901
94,-0.33136
95,-1.0666
