time,value
0,-0.38338
1,-0.38338
2,-0.38338
3,-0.38338
4,-0.38338
5,-0.38338
6,-0.38338
7,-0.38338
8,-0.38338
9,-0.38338
10,-0.38338
11,-0.38338
12,-0.38338
13,-0.38338
14,-0.38338
15,-0.38338
16,-0.38338
17,-0.38338
18,-0.38338
19,-0.38338
20,-0.38338
21,-0.38338
22,-0.38338
23,-0.38338
24,-0.38338
25,-0.38338
26,-0.38338
27,-0.38338
28,-0.38338
29,-0.38338
30,-0.38338
31,-0.38338
32,-0.38338
33,-0.013692
34,-0.35599000000000003
35,-0.38338
36,-0.38338
37,-0.38338
38,-0.38338
39,-0.38338
40,-0.38338
41,-0.38338
42,-0.38338
43,-0.38338
44,-0.38338
45,-0.38338
46,-0.38338
47,-0.38338
48,0.47238
49,3.0602
50,1.1912
51,1.7594
52,0.061614
53,-0.38338
54,-0.38338
55,-0.38338
56,-0.38338
57,-0.38338
58,-0.38338
59,-0.38338
60,-0.38338
61,-0.38338
62,-0.38338
63,-0.38338
64,-0.38338
65,-0.38338
66,1.157
67,0.5956100000000001
68,3.7106
69,1.3692
70,3.7311
71,2.7179
72,2.4372
73,3.156
74,3.8749
75,0.061614
76,0.034230000000000003
77,0.17115
78,-0.054768
79,-0.38338
80,-0.38338
81,-0.38338
82,-0.38338
83,-0.38338
84,-0.38338
85,-0.38338
86,-0.38338
87,-0.38338
88,-0.38338
89,-0.38338
90,-0.38338
91,-0.38338
92,-0.38338
93,-0.38338
94,-0.38338
95,-0.38338
