time,value
0,0.4646
1,0.4646
2,-1.8829
3,0.4646
4,0.4646
5,0.4646
6,-1.8829
7,2.8121
8,-1.8829
9,0.4646
10,0.4646
11,0.4646
12,0.4646
13,-1.8829
14,0.4646
15,0.4646
16,0.4646
17,-1.8829
18,0.4646
19,0.4646
20,0.4646
21,-1.8829
22,0.4646
23,0.4646
24,0.4646
25,0.4646
26,-1.8829
27,0.4646
28,0.4646
29,0.4646
30,-1.8829
31,0.4646
32,0.4646
33,0.4646
34,0.4646
35,0.4646
36,0.4646
37,0.4646
38,0.4646
39,0.4646
40,-1.8829
41,0.4646
42,0.4646
43,-1.8829
44,0.4646
45,0.4646
46,0.4646
47,-1.8829
48,0.4646
49,0.4646
50,0.4646
51,-1.8829
52,0.4646
53,0.4646
54,0.4646
55,-1.8829
56,0.4646
57,0.4646
58,0.4646
59,0.4646
60,-1.8829
61,0.4646
62,0.4646
63,0.4646
64,-1.8829
65,0.4646
66,0.4646
67,0.4646
68,0.4646
69,0.4646
70,0.4646
71,0.4646
72,0.4646
73,-1.8829
74,0.4646
75,0.4646
76,0.4646
77,0.4646
78,-1.8829
79,0.4646
80,0.4646
81,0.4646
82,-1.8829
83,0.4646
84,0.4646
85,0.4646
86,0.4646
87,-1.8829
88,0.4646
89,0.4646
90,0.4646
91,0.4646
92,-1.8829
93,0.4646
94,0.4646
95,0.4646
