time,value
0,-0.1378
1,-0.1378
2,-0.1378
3,-0.1378
4,-0.1378
5,-0.1378
6,-0.1378
7,-0.1378
8,-0.1378
9,-0.1378
10,-0.1378
11,-0.1378
12,-0.1378
13,-0.1378
14,-0.1378
15,-0.1378
16,-0.1378
17,-0.1378
18,-0.1378
19,-0.1378
20,-0.1378
21,-0.1378
22,-0.1378
23,-0.1378
24,-0.1378
25,-0.1378
26,-0.1378
27,-0.1378
28,-0.1378
29,-0.1378
30,-0.1378
31,-0.1378
32,-0.1378
33,-0.1378
34,-0.1378
35,-0.1378
36,-0.1378
37,-0.1378
38,-0.1378
39,-0.1378
40,-0.1378
41,-0.1378
42,-0.1378
43,-0.1378
44,-0.1378
45,-0.1378
46,-0.1378
47,-0.1378
48,-0.1378
49,-0.1378
50,-0.1378
51,-0.1378
52,-0.1378
53,-0.1378
54,-0.1378
55,-0.1378
56,-0.1378
57,-0.1378
58,-0.1378
59,-0.1378
60,-0.1378
61,-0.1378
62,-0.1378
63,-0.1378
64,-0.1378
65,-0.1378
66,-0.1378
67,-0.1378
68,-0.1378
69,-0.1378
70,-0.1378
71,-0.1378
72,4.0924
73,8.7456
74,-0.022433
75,-0.1378
76,-0.1378
77,-0.1378
78,-0.1378
79,-0.1378
80,-0.1378
81,-0.1378
82,-0.1378
83,-0.1378
84,-0.1378
85,-0.1378
86,-0.1378
87,-0.1378
88,-0.1378
89,-0.1378
90,-0.1378
91,-0.1378
92,-0.1378
93,-0.1378
94,-0.1378
95,-0.1378
