d3mIndex,timeseries_file,label
390,0390_test_ts.csv,7
391,0391_test_ts.csv,9
392,0392_test_ts.csv,12
393,0393_test_ts.csv,4
394,0394_test_ts.csv,6
395,0395_test_ts.csv,11
396,0396_test_ts.csv,2
397,0397_test_ts.csv,9
398,0398_test_ts.csv,1
399,0399_test_ts.csv,11
400,0400_test_ts.csv,3
401,0401_test_ts.csv,5
402,0402_test_ts.csv,5
403,0403_test_ts.csv,9
404,0404_test_ts.csv,12
405,0405_test_ts.csv,5
406,0406_test_ts.csv,5
407,0407_test_ts.csv,6
408,0408_test_ts.csv,1
409,0409_test_ts.csv,6
410,0410_test_ts.csv,4
411,0411_test_ts.csv,4
412,0412_test_ts.csv,7
413,0413_test_ts.csv,9
414,0414_test_ts.csv,5
415,0415_test_ts.csv,3
416,0416_test_ts.csv,3
417,0417_test_ts.csv,9
418,0418_test_ts.csv,11
419,0419_test_ts.csv,4
420,0420_test_ts.csv,8
421,0421_test_ts.csv,10
422,0422_test_ts.csv,10
423,0423_test_ts.csv,1
424,0424_test_ts.csv,4
425,0425_test_ts.csv,5
426,0426_test_ts.csv,12
427,0427_test_ts.csv,6
428,0428_test_ts.csv,5
429,0429_test_ts.csv,9
430,0430_test_ts.csv,7
431,0431_test_ts.csv,10
432,0432_test_ts.csv,3
433,0433_test_ts.csv,11
434,0434_test_ts.csv,9
435,0435_test_ts.csv,5
436,0436_test_ts.csv,11
437,0437_test_ts.csv,8
438,0438_test_ts.csv,11
439,0439_test_ts.csv,6
440,0440_test_ts.csv,12
441,0441_test_ts.csv,3
442,0442_test_ts.csv,3
443,0443_test_ts.csv,12
444,0444_test_ts.csv,7
445,0445_test_ts.csv,9
446,0446_test_ts.csv,5
447,0447_test_ts.csv,10
448,0448_test_ts.csv,4
449,0449_test_ts.csv,12
450,0450_test_ts.csv,11
451,0451_test_ts.csv,11
452,0452_test_ts.csv,8
453,0453_test_ts.csv,2
454,0454_test_ts.csv,8
455,0455_test_ts.csv,9
456,0456_test_ts.csv,2
457,0457_test_ts.csv,2
458,0458_test_ts.csv,5
459,0459_test_ts.csv,5
460,0460_test_ts.csv,11
461,0461_test_ts.csv,6
462,0462_test_ts.csv,9
463,0463_test_ts.csv,1
464,0464_test_ts.csv,7
465,0465_test_ts.csv,4
466,0466_test_ts.csv,12
467,0467_test_ts.csv,11
468,0468_test_ts.csv,2
469,0469_test_ts.csv,12
470,0470_test_ts.csv,12
471,0471_test_ts.csv,8
472,0472_test_ts.csv,3
473,0473_test_ts.csv,7
474,0474_test_ts.csv,5
475,0475_test_ts.csv,6
476,0476_test_ts.csv,2
477,0477_test_ts.csv,11
478,0478_test_ts.csv,4
479,0479_test_ts.csv,7
480,0480_test_ts.csv,4
481,0481_test_ts.csv,6
482,0482_test_ts.csv,11
483,0483_test_ts.csv,4
484,0484_test_ts.csv,3
485,0485_test_ts.csv,11
486,0486_test_ts.csv,2
487,0487_test_ts.csv,4
488,0488_test_ts.csv,1
489,0489_test_ts.csv,9
490,0490_test_ts.csv,8
491,0491_test_ts.csv,10
492,0492_test_ts.csv,11
493,0493_test_ts.csv,5
494,0494_test_ts.csv,10
495,0495_test_ts.csv,12
496,0496_test_ts.csv,12
497,0497_test_ts.csv,2
498,0498_test_ts.csv,2
499,0499_test_ts.csv,8
500,0500_test_ts.csv,2
501,0501_test_ts.csv,8
502,0502_test_ts.csv,4
503,0503_test_ts.csv,2
504,0504_test_ts.csv,7
505,0505_test_ts.csv,1
506,0506_test_ts.csv,7
507,0507_test_ts.csv,10
508,0508_test_ts.csv,3
509,0509_test_ts.csv,7
510,0510_test_ts.csv,1
511,0511_test_ts.csv,7
512,0512_test_ts.csv,11
513,0513_test_ts.csv,6
514,0514_test_ts.csv,12
515,0515_test_ts.csv,12
516,0516_test_ts.csv,4
517,0517_test_ts.csv,11
518,0518_test_ts.csv,9
519,0519_test_ts.csv,7
520,0520_test_ts.csv,2
521,0521_test_ts.csv,3
522,0522_test_ts.csv,6
523,0523_test_ts.csv,2
524,0524_test_ts.csv,5
525,0525_test_ts.csv,5
526,0526_test_ts.csv,8
527,0527_test_ts.csv,8
528,0528_test_ts.csv,6
529,0529_test_ts.csv,5
530,0530_test_ts.csv,9
531,0531_test_ts.csv,4
532,0532_test_ts.csv,5
533,0533_test_ts.csv,12
534,0534_test_ts.csv,11
535,0535_test_ts.csv,6
536,0536_test_ts.csv,6
537,0537_test_ts.csv,2
538,0538_test_ts.csv,4
539,0539_test_ts.csv,8
540,0540_test_ts.csv,10
541,0541_test_ts.csv,11
542,0542_test_ts.csv,1
543,0543_test_ts.csv,4
544,0544_test_ts.csv,4
545,0545_test_ts.csv,8
546,0546_test_ts.csv,6
547,0547_test_ts.csv,7
548,0548_test_ts.csv,9
549,0549_test_ts.csv,7
550,0550_test_ts.csv,2
551,0551_test_ts.csv,10
552,0552_test_ts.csv,10
553,0553_test_ts.csv,8
554,0554_test_ts.csv,3
555,0555_test_ts.csv,6
556,0556_test_ts.csv,8
557,0557_test_ts.csv,11
558,0558_test_ts.csv,9
559,0559_test_ts.csv,7
560,0560_test_ts.csv,9
561,0561_test_ts.csv,11
562,0562_test_ts.csv,7
563,0563_test_ts.csv,1
564,0564_test_ts.csv,11
565,0565_test_ts.csv,10
566,0566_test_ts.csv,5
567,0567_test_ts.csv,1
568,0568_test_ts.csv,1
569,0569_test_ts.csv,2
570,0570_test_ts.csv,9
571,0571_test_ts.csv,12
572,0572_test_ts.csv,8
573,0573_test_ts.csv,12
574,0574_test_ts.csv,10
575,0575_test_ts.csv,1
576,0576_test_ts.csv,4
577,0577_test_ts.csv,10
578,0578_test_ts.csv,2
579,0579_test_ts.csv,3
580,0580_test_ts.csv,8
581,0581_test_ts.csv,2
582,0582_test_ts.csv,2
583,0583_test_ts.csv,10
584,0584_test_ts.csv,6
585,0585_test_ts.csv,11
586,0586_test_ts.csv,8
587,0587_test_ts.csv,2
588,0588_test_ts.csv,10
589,0589_test_ts.csv,9
590,0590_test_ts.csv,5
591,0591_test_ts.csv,8
592,0592_test_ts.csv,10
593,0593_test_ts.csv,7
594,0594_test_ts.csv,8
595,0595_test_ts.csv,3
596,0596_test_ts.csv,1
597,0597_test_ts.csv,8
598,0598_test_ts.csv,9
599,0599_test_ts.csv,7
600,0600_test_ts.csv,1
601,0601_test_ts.csv,11
602,0602_test_ts.csv,6
603,0603_test_ts.csv,7
604,0604_test_ts.csv,12
605,0605_test_ts.csv,5
606,0606_test_ts.csv,8
607,0607_test_ts.csv,12
608,0608_test_ts.csv,11
609,0609_test_ts.csv,8
610,0610_test_ts.csv,10
611,0611_test_ts.csv,8
612,0612_test_ts.csv,7
613,0613_test_ts.csv,4
614,0614_test_ts.csv,3
615,0615_test_ts.csv,10
616,0616_test_ts.csv,6
617,0617_test_ts.csv,4
618,0618_test_ts.csv,7
619,0619_test_ts.csv,1
620,0620_test_ts.csv,10
621,0621_test_ts.csv,4
622,0622_test_ts.csv,12
623,0623_test_ts.csv,3
624,0624_test_ts.csv,3
625,0625_test_ts.csv,8
626,0626_test_ts.csv,3
627,0627_test_ts.csv,10
628,0628_test_ts.csv,8
629,0629_test_ts.csv,7
630,0630_test_ts.csv,6
631,0631_test_ts.csv,12
632,0632_test_ts.csv,1
633,0633_test_ts.csv,9
634,0634_test_ts.csv,1
635,0635_test_ts.csv,12
636,0636_test_ts.csv,1
637,0637_test_ts.csv,9
638,0638_test_ts.csv,1
639,0639_test_ts.csv,4
640,0640_test_ts.csv,3
641,0641_test_ts.csv,9
642,0642_test_ts.csv,11
643,0643_test_ts.csv,5
644,0644_test_ts.csv,5
645,0645_test_ts.csv,12
646,0646_test_ts.csv,7
647,0647_test_ts.csv,4
648,0648_test_ts.csv,3
649,0649_test_ts.csv,12
650,0650_test_ts.csv,12
651,0651_test_ts.csv,8
652,0652_test_ts.csv,8
653,0653_test_ts.csv,1
654,0654_test_ts.csv,9
655,0655_test_ts.csv,6
656,0656_test_ts.csv,4
657,0657_test_ts.csv,3
658,0658_test_ts.csv,1
659,0659_test_ts.csv,3
660,0660_test_ts.csv,1
661,0661_test_ts.csv,7
662,0662_test_ts.csv,10
663,0663_test_ts.csv,1
664,0664_test_ts.csv,1
665,0665_test_ts.csv,2
666,0666_test_ts.csv,7
667,0667_test_ts.csv,7
668,0668_test_ts.csv,1
669,0669_test_ts.csv,2
670,0670_test_ts.csv,2
671,0671_test_ts.csv,9
672,0672_test_ts.csv,4
673,0673_test_ts.csv,10
674,0674_test_ts.csv,7
675,0675_test_ts.csv,1
676,0676_test_ts.csv,5
677,0677_test_ts.csv,8
678,0678_test_ts.csv,9
679,0679_test_ts.csv,10
680,0680_test_ts.csv,2
681,0681_test_ts.csv,4
682,0682_test_ts.csv,1
683,0683_test_ts.csv,12
684,0684_test_ts.csv,3
685,0685_test_ts.csv,6
686,0686_test_ts.csv,4
687,0687_test_ts.csv,2
688,0688_test_ts.csv,6
689,0689_test_ts.csv,4
690,0690_test_ts.csv,7
691,0691_test_ts.csv,1
692,0692_test_ts.csv,6
693,0693_test_ts.csv,2
694,0694_test_ts.csv,5
695,0695_test_ts.csv,9
696,0696_test_ts.csv,6
697,0697_test_ts.csv,12
698,0698_test_ts.csv,7
699,0699_test_ts.csv,2
700,0700_test_ts.csv,4
701,0701_test_ts.csv,6
702,0702_test_ts.csv,11
703,0703_test_ts.csv,1
704,0704_test_ts.csv,9
705,0705_test_ts.csv,6
706,0706_test_ts.csv,11
707,0707_test_ts.csv,5
708,0708_test_ts.csv,3
709,0709_test_ts.csv,2
710,0710_test_ts.csv,10
711,0711_test_ts.csv,7
712,0712_test_ts.csv,1
713,0713_test_ts.csv,10
714,0714_test_ts.csv,6
715,0715_test_ts.csv,10
716,0716_test_ts.csv,3
717,0717_test_ts.csv,9
718,0718_test_ts.csv,2
719,0719_test_ts.csv,1
720,0720_test_ts.csv,10
721,0721_test_ts.csv,1
722,0722_test_ts.csv,9
723,0723_test_ts.csv,6
724,0724_test_ts.csv,8
725,0725_test_ts.csv,11
726,0726_test_ts.csv,6
727,0727_test_ts.csv,10
728,0728_test_ts.csv,6
729,0729_test_ts.csv,9
730,0730_test_ts.csv,1
731,0731_test_ts.csv,9
732,0732_test_ts.csv,12
733,0733_test_ts.csv,9
734,0734_test_ts.csv,9
735,0735_test_ts.csv,1
736,0736_test_ts.csv,10
737,0737_test_ts.csv,2
738,0738_test_ts.csv,5
739,0739_test_ts.csv,4
740,0740_test_ts.csv,12
741,0741_test_ts.csv,5
742,0742_test_ts.csv,6
743,0743_test_ts.csv,3
744,0744_test_ts.csv,6
745,0745_test_ts.csv,10
746,0746_test_ts.csv,4
747,0747_test_ts.csv,6
748,0748_test_ts.csv,7
749,0749_test_ts.csv,11
750,0750_test_ts.csv,12
751,0751_test_ts.csv,5
752,0752_test_ts.csv,9
753,0753_test_ts.csv,3
754,0754_test_ts.csv,11
755,0755_test_ts.csv,8
756,0756_test_ts.csv,4
757,0757_test_ts.csv,3
758,0758_test_ts.csv,11
759,0759_test_ts.csv,10
760,0760_test_ts.csv,12
761,0761_test_ts.csv,8
762,0762_test_ts.csv,1
763,0763_test_ts.csv,11
764,0764_test_ts.csv,8
765,0765_test_ts.csv,3
766,0766_test_ts.csv,5
767,0767_test_ts.csv,4
768,0768_test_ts.csv,7
769,0769_test_ts.csv,3
770,0770_test_ts.csv,7
771,0771_test_ts.csv,4
772,0772_test_ts.csv,2
773,0773_test_ts.csv,12
774,0774_test_ts.csv,11
775,0775_test_ts.csv,10
776,0776_test_ts.csv,1
777,0777_test_ts.csv,1
778,0778_test_ts.csv,10
779,0779_test_ts.csv,4
