time,value
0,-0.9041799999999999
1,-0.87718
2,-0.86106
3,-0.8357899999999999
4,-0.81572
5,-0.78874
6,-0.7638
7,-0.75351
8,-0.7520600000000001
9,-0.75275
10,-0.74203
11,-0.70403
12,-0.62617
13,-0.44001999999999997
14,-0.033163
15,0.5972
16,1.2481
17,1.7419
18,2.1229
19,2.4841
20,2.8475
21,3.1378
22,3.2474
23,3.1609
24,2.9113
25,2.5433
26,2.0857
27,1.5683
28,1.0701
29,0.6594399999999999
30,0.35656
31,0.15
32,0.014603999999999999
33,-0.07408300000000001
34,-0.13088
35,-0.1557
36,-0.15288
37,-0.13342
38,-0.11585
39,-0.1116
40,-0.10238
41,-0.08257
42,-0.06436499999999999
43,-0.069721
44,-0.11865
45,-0.18565
46,-0.23895
47,-0.26687
48,-0.24561
49,-0.13665
50,0.064776
51,0.41600000000000004
52,1.1219
53,2.2038
54,3.2115
55,3.7421
56,3.9052
57,3.9388
58,3.9104
59,3.7811
60,3.4773
61,3.028
62,2.5345
63,2.0102
64,1.4639
65,1.0011
66,0.70373
67,0.55277
68,0.4663
69,0.39282
70,0.34613
71,0.31451
72,0.24486999999999998
73,0.13304000000000002
74,0.037832
75,-0.0055055
76,-0.0022875
77,0.023669
78,0.041309
79,0.042707
80,0.029264
81,-0.011835
82,-0.077138
83,-0.1553
84,-0.25021
85,-0.34617
86,-0.43096999999999996
87,-0.5120600000000001
88,-0.58267
89,-0.63893
90,-0.6766399999999999
91,-0.68845
92,-0.68545
93,-0.67915
94,-0.66845
95,-0.65171
96,-0.62848
97,-0.5798800000000001
98,-0.46753
99,-0.24539
100,0.084239
101,0.41347
102,0.67284
103,0.89174
104,1.0524
105,1.1079999999999999
106,1.0715
107,1.0075
108,0.9443
109,0.8776299999999999
110,0.8207
111,0.7311
112,0.5639
113,0.34981999999999996
114,0.13629000000000002
115,-0.054344
116,-0.22411999999999999
117,-0.36308
118,-0.45088999999999996
119,-0.49523
120,-0.51703
121,-0.52181
122,-0.51072
123,-0.48635
124,-0.46138
125,-0.45206999999999997
126,-0.45808999999999994
127,-0.47117
128,-0.47534
129,-0.47913999999999995
130,-0.49765
131,-0.51793
132,-0.54355
133,-0.57875
134,-0.61356
135,-0.63948
136,-0.64958
137,-0.6479
138,-0.6311100000000001
139,-0.59439
140,-0.5515399999999999
141,-0.5121600000000001
142,-0.47612
143,-0.45558999999999994
144,-0.4655
145,-0.4942
146,-0.51718
147,-0.53274
148,-0.55519
149,-0.58778
150,-0.62135
151,-0.64139
152,-0.62695
153,-0.52472
154,-0.26646
155,0.10142000000000001
156,0.40813
157,0.53622
158,0.5263399999999999
159,0.4815
160,0.42628
161,0.34731
162,0.25506
163,0.16219
164,0.082991
165,0.015594
166,-0.046189999999999995
167,-0.096236
168,-0.14956
169,-0.22755999999999998
170,-0.31356
171,-0.38479
172,-0.45223
173,-0.53228
174,-0.61358
175,-0.66713
176,-0.68574
177,-0.6902
178,-0.6924600000000001
179,-0.69371
180,-0.6974899999999999
181,-0.69834
182,-0.69925
183,-0.70419
184,-0.70636
185,-0.7094
186,-0.7159399999999999
187,-0.72019
188,-0.71022
189,-0.66661
190,-0.54072
191,-0.28402
192,0.024305
193,0.21184
194,0.2238
195,0.15475999999999998
196,0.074022
197,-0.029173
198,-0.15124
199,-0.26983
200,-0.38295
201,-0.49178
202,-0.58349
203,-0.63438
204,-0.64447
205,-0.6353800000000001
206,-0.62151
207,-0.6159600000000001
208,-0.63035
209,-0.66637
210,-0.7076399999999999
211,-0.72248
212,-0.69758
213,-0.65096
214,-0.5955600000000001
215,-0.51867
216,-0.42245
217,-0.34037
218,-0.29717
219,-0.29601
220,-0.32788
221,-0.37681
222,-0.43418999999999996
223,-0.49643000000000004
224,-0.54848
225,-0.57253
226,-0.56421
227,-0.53014
228,-0.4795
229,-0.41513999999999995
230,-0.34121999999999997
231,-0.27535
232,-0.21983000000000003
233,-0.16154000000000002
234,-0.10558
235,-0.06485199999999999
236,-0.048595
237,-0.048423
238,-0.064551
239,-0.11034000000000001
240,-0.15137
241,-0.16061
242,-0.16397
243,-0.19368
244,-0.25187
245,-0.32045
246,-0.41238
247,-0.5360199999999999
248,-0.67002
249,-0.78884
250,-0.8751200000000001
251,-0.9325100000000001
252,-0.9617399999999999
253,-0.9620299999999999
254,-0.9034200000000001
255,-0.74142
256,-0.53671
257,-0.39179
258,-0.30314
259,-0.2408
260,-0.21919
261,-0.22926
262,-0.25908000000000003
263,-0.32488
264,-0.43506000000000006
265,-0.5624899999999999
266,-0.67437
267,-0.77444
268,-0.86336
269,-0.93048
