[<text>
<title>micro general corp &lt;mgen.o&gt; 4th qtr loss</title>
<dateline>    irvine, calif., april 13 - </dateline>period ended december 28.
    shr nil vs loss six cts
    net loss 6,319 vs loss 265,651
    revs 1,117,778 vs 1,090,001
    avg shrs 6,874,383 vs 4,323,614
    year
    shr nil vs loss 10 cts
    net profit 4,323 vs loss 432,458
    revs 4,711,350 vs 4,256,708
    avg shrs 6,837,871 vs 4,322,816
 reuter
</text>]