time,value
0,0.39821
1,0.26273
2,0.42828
3,0.51702
4,0.53938
5,0.51888
6,0.49966000000000005
7,0.52664
8,0.24929
9,0.2803
10,0.46306
11,0.41762
12,0.37146999999999997
13,0.33481
14,0.15495
15,0.10909
16,0.18295999999999998
17,0.25984
18,0.31329
19,0.14184000000000002
20,0.022321
21,-0.08905700000000001
22,0.02015
23,0.13798
24,0.20138
25,0.34898
26,0.37068
27,0.27083
28,0.27889
29,0.64841
30,0.83468
31,1.0053
32,2.5702
33,3.3254
34,2.2337
35,1.4562
36,1.0916
37,1.0094
38,0.65933
39,0.34176999999999996
40,0.23651
41,0.13724
42,-0.44856999999999997
43,-0.55947
44,-0.078534
45,-0.25782
46,-0.1825
47,-0.40613
48,-0.69212
49,-0.31787
50,-0.8161
51,-1.062
52,-1.23
53,-1.2083
54,-1.2807
55,-0.70729
56,-0.97921
57,-0.78959
58,-0.63789
59,-0.74957
60,-0.9235899999999999
61,-1.0311
62,-1.4322
63,-1.1208
64,-1.0183
65,-1.4534
66,-1.3701
67,-1.0698
68,-1.0243
69,-0.94821
70,-0.67582
71,-0.21971
72,0.46629
73,0.7569
74,0.5646100000000001
75,0.0368
76,-0.5071
77,-1.0708
78,-1.9157
79,-1.9347
80,-2.0225
81,-2.417
82,-2.3863
83,-2.1715
84,-2.2025
85,-1.7529
86,-2.039
87,-1.7372
88,-1.5701
89,-1.6458
90,-1.1516
91,-1.1164
92,-1.8283
93,-1.3469
94,-0.9325200000000001
95,-1.7333
96,-1.8882
97,-0.7359
98,-1.0295
99,-1.431
100,-1.2628
101,-0.38968
102,-0.36613
103,-0.0034733000000000003
104,-0.42877
105,-0.35585
106,0.1778
107,-0.20001
108,-0.32553000000000004
109,-0.57977
110,-0.5969800000000001
111,-0.63022
112,0.17869000000000002
113,-0.04427
114,-0.5586899999999999
115,-0.12299000000000002
116,0.15379
117,-0.84534
118,-1.3498
119,-0.46876
120,-1.6492
121,-1.3519
122,-0.75739
123,0.33449
124,0.23142
125,0.79267
126,1.5646
127,1.4834
128,1.0104
129,0.65761
130,-0.20940999999999999
131,-0.76913
132,-0.6028100000000001
133,-0.75741
134,-1.0036
135,-1.058
136,-1.4273
137,-1.8578
138,-1.3217
139,-1.4834
140,-2.1993
141,-0.2036
142,-0.29914
143,-0.3512
144,-1.0548
145,-1.3499
146,-1.8273
147,-2.2766
148,-1.7080000000000002
149,-1.8630000000000002
150,0.11607999999999999
151,1.0874
152,1.3085
153,1.5813
154,1.5677
155,1.9728
156,2.3855
157,2.9659
158,2.7889999999999997
159,2.0847
160,2.6868
161,2.535
162,2.3285
163,2.3077
164,1.9709
165,1.6635
166,1.4297
167,0.86187
168,1.062
169,1.1765
170,0.96575
171,0.51325
172,0.52168
173,0.76156
174,0.851
175,1.1205
176,-0.15949000000000002
177,0.0093746
178,0.16664
179,0.27454
180,0.5291
181,0.44042
182,0.076
183,-0.055498
184,0.12415999999999999
185,0.29704
186,0.5321199999999999
187,0.7247899999999999
188,0.93063
189,2.4274
190,3.4936
191,0.9031
192,-0.63288
193,-1.1688
194,-0.1437
195,-0.45921999999999996
196,0.16692
197,0.35618
198,-0.19475
199,-0.27745
200,-0.46068000000000003
201,1.056
202,1.531
203,1.9437
204,0.7872600000000001
205,-0.20049
206,-0.39516999999999997
207,0.025608999999999996
208,-0.24656
209,-0.42851000000000006
210,-0.033739
211,0.20590999999999998
212,-0.52758
213,0.19752
214,-0.1785
215,-0.14651
216,-0.17326
217,-0.11682000000000001
218,-0.19897
219,-0.26789
220,-0.23998000000000003
221,-0.1442
222,0.10639000000000001
223,0.39068
224,0.68455
225,0.8557600000000001
226,0.72051
227,0.69417
228,0.37517
229,0.18917
230,0.18145
231,-0.027925
232,-0.021746
233,-0.21268
234,-0.0085294
235,0.060288999999999995
236,0.18942
237,0.15927
238,0.15223
239,0.14699
240,-0.11317
241,-0.08622200000000001
242,-0.15922999999999998
243,-0.045883999999999994
244,0.18157
245,0.19322999999999999
246,0.20455
247,0.38175
248,0.18225999999999998
249,0.17513
250,0.1817
251,0.17626
252,0.18777
253,0.18850999999999998
254,-0.033524
255,0.17084000000000002
256,0.17943
257,0.42189
258,0.41097
259,0.40471999999999997
260,0.41431999999999997
261,0.42117
262,0.40797
263,0.25035999999999997
264,0.25333
265,0.23715
266,0.15118
267,0.012553
268,0.17225
269,0.30856
270,0.17336
271,0.17684
272,0.18375999999999998
273,0.18243
274,0.19135
275,0.072202
276,0.1827
277,0.18053
278,0.17165
279,0.15334
280,0.38627
281,0.16524
282,0.15997
283,0.15295
284,0.16045
285,0.16532
286,0.093442
287,-0.07095900000000001
288,0.1557
289,0.19024000000000002
290,0.34488
291,0.34202
292,0.34669
293,0.14498
294,0.15277000000000002
295,0.1529
296,0.145
297,0.13742000000000001
298,0.12808
299,0.12641
