time,value
0,-0.2354
1,-0.2354
2,-0.2354
3,-0.2354
4,-0.2354
5,-0.2354
6,-0.2354
7,-0.2354
8,-0.2354
9,-0.2354
10,-0.2354
11,-0.2354
12,-0.2354
13,-0.2354
14,-0.2354
15,-0.2354
16,-0.2354
17,-0.2354
18,-0.2354
19,-0.2354
20,-0.2354
21,-0.2354
22,-0.2354
23,-0.2354
24,-0.2354
25,-0.2354
26,-0.2354
27,-0.2354
28,-0.2354
29,-0.2354
30,-0.2354
31,-0.2354
32,-0.2354
33,-0.2354
34,-0.2354
35,-0.2354
36,-0.2354
37,-0.2354
38,-0.2354
39,-0.2354
40,-0.2354
41,-0.2354
42,-0.2354
43,-0.2354
44,-0.2354
45,-0.2354
46,-0.2354
47,-0.2354
48,-0.2354
49,1.3935
50,5.8407
51,0.8246899999999999
52,5.5821
53,1.0574
54,-0.2354
55,-0.2354
56,-0.2354
57,-0.2354
58,-0.2354
59,-0.2354
60,-0.2354
61,-0.2354
62,-0.2354
63,-0.2354
64,4.4445
65,1.0315
66,0.54028
67,-0.2354
68,-0.2354
69,-0.2354
70,-0.2354
71,-0.2354
72,-0.2354
73,-0.2354
74,-0.2354
75,-0.2354
76,-0.2354
77,-0.2354
78,-0.2354
79,-0.2354
80,-0.2354
81,-0.2354
82,-0.2354
83,-0.2354
84,-0.2354
85,-0.2354
86,-0.2354
87,-0.2354
88,-0.2354
89,-0.2354
90,-0.2354
91,-0.2354
92,-0.2354
93,-0.2354
94,-0.2354
95,-0.2354
