time,value
0,0.47917
1,1.5561
2,1.0946
3,1.0946
4,0.17147
5,-0.90545
6,-0.90545
7,-0.90545
8,-0.90545
9,-0.90545
10,-0.13622
11,1.5561
12,1.2484
13,1.0946
14,1.0946
15,0.32532
16,-0.90545
17,-0.90545
18,-0.90545
19,-0.90545
20,-0.90545
21,-0.90545
22,1.2484
23,1.2484
24,1.2484
25,1.0946
26,0.78686
27,-0.90545
28,-0.90545
29,-0.90545
30,-0.90545
31,-0.90545
32,-0.90545
33,0.47917
34,1.4022
35,1.2484
36,1.0946
37,0.94071
38,-0.90545
39,-0.90545
40,-0.90545
41,-0.90545
42,-0.90545
43,-0.90545
44,0.32532
45,1.5561
46,1.0946
47,1.0946
48,1.2484
49,1.0946
50,0.017628
51,-0.90545
52,-0.90545
53,-0.90545
54,-0.90545
55,-0.90545
56,-0.90545
57,0.94071
58,1.4022
59,1.0946
60,1.0946
61,-0.13622
62,-0.90545
63,-0.90545
64,-0.90545
65,-0.90545
66,-0.90545
67,-0.90545
68,1.5561
69,1.4022
70,1.0946
71,0.78686
72,-0.90545
73,-0.90545
74,-0.90545
75,-0.90545
76,-0.90545
77,0.017628
78,1.5561
79,1.2484
80,1.0946
81,1.0946
82,-0.13622
83,-0.90545
84,-0.90545
85,-0.90545
86,-0.90545
87,-0.90545
88,-0.90545
89,1.5561
90,1.2484
91,1.0946
92,-0.44391
93,-0.90545
94,-0.90545
95,-0.90545
