time,value
0,1.8395
1,-0.83839
2,-0.83839
3,1.8395
4,-0.83839
5,-0.83839
6,1.6907
7,-0.83839
8,-0.83839
9,1.5419999999999998
10,-0.83839
11,-0.39207
12,1.3932
13,-0.83839
14,-0.39207
15,1.2444
16,-0.83839
17,-0.54085
18,1.5419999999999998
19,-0.83839
20,-0.83839
21,1.6907
22,-0.83839
23,-0.83839
24,1.6907
25,-0.83839
26,-0.83839
27,1.6907
28,-0.83839
29,-0.39207
30,1.2444
31,-0.83839
32,-0.39207
33,1.2444
34,-0.83839
35,-0.54085
36,1.3932
37,-0.83839
38,-0.83839
39,1.5419999999999998
40,-0.83839
41,-0.83839
42,1.8395
43,-0.83839
44,-0.83839
45,1.6907
46,-0.83839
47,-0.83839
48,1.3932
49,-0.54085
50,-0.83839
51,0.7981
52,0.20301
53,-0.83839
54,-0.094532
55,0.9468700000000001
56,-0.83839
57,-0.83839
58,1.6907
59,-0.83839
60,-0.83839
61,1.5419999999999998
62,-0.54085
63,-0.83839
64,0.35178000000000004
65,0.50055
66,-0.83839
67,-0.83839
68,1.8395
69,-0.83839
70,-0.83839
71,1.3932
72,-0.54085
73,-0.83839
74,0.9468700000000001
75,0.05424
76,-0.83839
77,1.0956
78,-0.2433
79,-0.83839
80,1.0956
81,-0.094532
82,-0.83839
83,0.9468700000000001
84,-0.094532
85,-0.83839
86,0.50055
87,0.50055
88,-0.83839
89,0.05424
90,0.9468700000000001
91,-0.83839
92,0.05424
93,0.9468700000000001
94,-0.83839
95,-0.39207
