time,value
0,-0.15132
1,-0.15567
2,-0.15858
3,-0.15918
4,-0.15952
5,-0.15821
6,-0.15485
7,-0.15377000000000002
8,-0.15289
9,-0.14864000000000002
10,-0.14315999999999998
11,-0.13474
12,-0.12462000000000001
13,-0.11425
14,-0.10309000000000001
15,-0.093641
16,-0.084674
17,-0.075222
18,-0.069345
19,-0.068411
20,-0.072263
21,-0.079437
22,-0.087483
23,-0.09730599999999999
24,-0.10588
25,-0.109
26,-0.10747999999999999
27,-0.10564000000000001
28,-0.1028
29,-0.0962
30,-0.08753
31,-0.077831
32,-0.06583
33,-0.050388999999999996
34,-0.030636
35,-0.014629
36,-0.0013870999999999998
37,0.011792
38,0.015798
39,0.014916999999999998
40,0.0083488
41,-0.0081986
42,-0.029426
43,-0.050729
44,-0.071995
45,-0.094057
46,-0.11185999999999999
47,-0.12750999999999998
48,-0.14247
49,-0.15231
50,-0.15903
51,-0.16517
52,-0.17028
53,-0.17223
54,-0.17276
55,-0.17129
56,-0.16745
57,-0.16337000000000002
58,-0.15883
59,-0.15212
60,-0.14724
61,-0.14548
62,-0.14731
63,-0.15538
64,-0.16785
65,-0.18486
66,-0.20401
67,-0.22041
68,-0.2318
69,-0.24044000000000001
70,-0.24661
71,-0.2501
72,-0.24952
73,-0.24499
74,-0.23859
75,-0.2314
76,-0.22471
77,-0.2188
78,-0.21469000000000002
79,-0.20992
80,-0.20572
81,-0.20390999999999998
82,-0.20328
83,-0.20349
84,-0.20296
85,-0.20196
86,-0.20253
87,-0.20572
88,-0.21248000000000003
89,-0.22134
90,-0.23309000000000002
91,-0.24389
92,-0.25223
93,-0.26224000000000003
94,-0.26911
95,-0.27176999999999996
96,-0.27336
97,-0.27412
98,-0.27410999999999996
99,-0.27373000000000003
100,-0.27378
101,-0.27416999999999997
102,-0.27436
103,-0.27241
104,-0.26854
105,-0.26506
106,-0.26187
107,-0.25756999999999997
108,-0.25234
109,-0.24838000000000002
110,-0.24288
111,-0.23664000000000002
112,-0.23110999999999998
113,-0.22451999999999997
114,-0.21848
115,-0.21223000000000003
116,-0.20468
117,-0.19762000000000002
118,-0.19265
119,-0.18772
120,-0.18291
121,-0.17844000000000002
122,-0.17492
123,-0.17576
124,-0.17762999999999998
125,-0.17995999999999998
126,-0.18267
127,-0.18629
128,-0.19159
129,-0.19439
130,-0.19844
131,-0.20410999999999999
132,-0.20776
133,-0.20995999999999998
134,-0.21166999999999997
135,-0.21291
136,-0.21452
137,-0.2166
138,-0.21964
139,-0.22398
140,-0.22719
141,-0.22758
142,-0.22594
143,-0.2247
144,-0.2234
145,-0.22164
146,-0.21882
147,-0.21735
148,-0.21574000000000002
149,-0.21247
150,-0.2077
151,-0.2028
152,-0.19626
153,-0.18796
154,-0.17969000000000002
155,-0.17018
156,-0.16035
157,-0.15311
158,-0.15015
159,-0.15127000000000002
160,-0.15748
161,-0.16558
162,-0.1764
163,-0.19078
164,-0.20384000000000002
165,-0.21498
166,-0.22651999999999997
167,-0.23711
168,-0.24556
169,-0.25142
170,-0.25495999999999996
171,-0.25678
172,-0.25729
173,-0.25735
174,-0.26105
175,-0.26266
176,-0.2631
177,-0.2661
178,-0.2675
179,-0.26871
180,-0.26925
181,-0.26999
182,-0.27135
183,-0.26997
184,-0.26541
185,-0.26132
186,-0.25887
187,-0.25228
188,-0.24513000000000001
189,-0.24543
190,-0.24475999999999998
191,-0.23781999999999998
192,-0.22832
193,-0.21224
194,-0.19117
195,-0.16794
196,-0.14017000000000002
197,-0.10967
198,-0.079294
199,-0.04838
200,-0.017819
201,0.011367
202,0.028024
203,0.034825999999999996
204,0.03466
205,0.018082
206,0.004518199999999999
207,-0.014053999999999999
208,-0.040383999999999996
209,-0.056122000000000005
210,-0.069864
211,-0.08317100000000001
212,-0.091226
213,-0.09675299999999999
214,-0.10232000000000001
215,-0.1262
216,-0.13827
217,-0.14555
218,-0.16230999999999998
219,-0.16883
220,-0.1824
221,-0.19760999999999998
222,-0.19932
223,-0.18994
224,-0.18413
225,-0.18012
226,-0.16725
227,-0.15715
228,-0.14686
229,-0.13494
230,-0.12747999999999998
231,-0.11587
232,-0.10107999999999999
233,-0.088367
234,-0.086927
235,-0.11252000000000001
236,-0.1192
237,-0.11448
238,-0.11609000000000001
239,-0.13142
240,-0.13768
241,-0.14027
242,-0.15125
243,-0.18517999999999998
244,-0.20271
245,-0.21969
246,-0.22379000000000002
247,-0.22512
248,-0.22476
249,-0.21465
250,-0.20077
251,-0.18724000000000002
252,-0.17334000000000002
253,-0.14977000000000001
254,-0.12199000000000002
255,-0.094713
256,-0.069758
257,-0.0403
258,-0.005049100000000001
259,0.033992
260,0.07117000000000001
261,0.11169000000000001
262,0.16530999999999998
263,0.22075999999999998
264,0.27756
265,0.32276
266,0.36374
267,0.40331999999999996
268,0.43832
269,0.47717
270,0.5263399999999999
271,0.57845
272,0.63667
273,0.69607
274,0.74728
275,0.8083899999999999
276,0.86085
277,0.90145
278,0.9417700000000001
279,1.0173
280,1.0718
281,1.1153
282,1.1341
283,1.1296
284,1.1265
285,1.0948
286,1.0638
287,1.0312
288,0.9379
289,0.95609
290,0.9524100000000001
291,0.9388200000000001
292,0.93885
293,0.9215399999999999
294,0.91945
295,0.94253
296,0.9464799999999999
297,0.94976
298,0.9765
299,1.0048
300,1.0309
301,1.0603
302,1.0907
303,1.1294
304,1.1721
305,1.2189
306,1.2763
307,1.3395
308,1.3995
309,1.4702
310,1.5483
311,1.6425
312,1.74
313,1.8501
314,1.9661
315,2.105
316,2.2208
317,2.3264
318,2.4844
319,2.6208
320,2.7026
321,2.8285
322,2.9756
323,3.0897
324,3.1766
325,3.2639
326,3.2866
327,3.2045
328,3.2792
329,3.3828
330,3.3614
331,3.2880000000000003
332,3.17
333,3.0513
334,3.0405
335,2.9717
336,2.68
337,2.6407
338,2.6243
339,2.5037
340,2.3707
341,2.2101
342,2.0521
343,1.9566
344,1.815
345,1.6546
346,1.525
347,1.4299
348,1.2671
349,1.1707
350,1.0465
351,0.9285100000000001
352,0.79988
353,0.632
354,0.56906
355,0.45782
356,0.34279
357,0.25793
358,0.16077
359,0.02978
360,-0.024259
361,-0.15442999999999998
362,-0.21068
363,-0.27054
364,-0.35349
365,-0.40736999999999995
366,-0.46703999999999996
367,-0.51558
368,-0.5664899999999999
369,-0.61549
370,-0.67295
371,-0.70831
372,-0.73433
373,-0.76766
374,-0.79188
375,-0.8104100000000001
376,-0.83639
377,-0.86125
378,-0.8863700000000001
379,-0.9196799999999999
380,-0.93104
381,-0.96095
382,-0.98814
383,-1.0117
384,-1.0376
385,-1.0607
386,-1.0884
387,-1.1162
388,-1.143
389,-1.16
390,-1.183
391,-1.2021
392,-1.2169
393,-1.2367
394,-1.2502
395,-1.2607
396,-1.2746
397,-1.2830000000000001
398,-1.2965
399,-1.3086
400,-1.3157
401,-1.3233
402,-1.3316
403,-1.3403
404,-1.3458
405,-1.3532
406,-1.3594
407,-1.3641
408,-1.3697
409,-1.3776
410,-1.3821
411,-1.3868
412,-1.3912
413,-1.3971
414,-1.402
415,-1.4062
416,-1.4107
417,-1.4149
418,-1.4189
419,-1.4228
420,-1.4255
421,-1.4286
422,-1.4311
423,-1.4337
424,-1.4362
425,-1.4386
426,-1.442
427,-1.4442
428,-1.4478
429,-1.4504
430,-1.4525
431,-1.4547
432,-1.4566
433,-1.4588
434,-1.4604
435,-1.4627
436,-1.4646
437,-1.465
438,-1.466
439,-1.4669
440,-1.4682
441,-1.4694
442,-1.4699
443,-1.4709999999999999
444,-1.4725
445,-1.4738
446,-1.475
447,-1.4762
