time,value
0,-0.6774100000000001
1,-0.6774100000000001
2,0.6845
3,1.8762
4,1.5357
5,0.0035467
6,-0.6774100000000001
7,-0.6774100000000001
8,-0.6774100000000001
9,-0.6774100000000001
10,-0.16669
11,1.8762
12,1.7059
13,-0.33693
14,-0.6774100000000001
15,-0.6774100000000001
16,-0.6774100000000001
17,-0.6774100000000001
18,-0.6774100000000001
19,1.5357
20,1.8762
21,0.0035467
22,-0.6774100000000001
23,-0.6774100000000001
24,-0.6774100000000001
25,-0.6774100000000001
26,-0.6774100000000001
27,0.17379
28,1.8762
29,1.3655
30,-0.6774100000000001
31,-0.6774100000000001
32,-0.6774100000000001
33,-0.6774100000000001
34,-0.6774100000000001
35,-0.6774100000000001
36,2.0464
37,1.5357
38,-0.16669
39,-0.6774100000000001
40,-0.6774100000000001
41,-0.6774100000000001
42,-0.6774100000000001
43,-0.6774100000000001
44,0.8547399999999999
45,1.7059
46,0.6845
47,-0.6774100000000001
48,-0.6774100000000001
49,-0.6774100000000001
50,-0.6774100000000001
51,-0.6774100000000001
52,-0.6774100000000001
53,1.8762
54,1.7059
55,-0.33693
56,-0.6774100000000001
57,-0.6774100000000001
58,-0.6774100000000001
59,-0.6774100000000001
60,-0.6774100000000001
61,0.17379
62,1.8762
63,1.3655
64,-0.6774100000000001
65,-0.6774100000000001
66,-0.6774100000000001
67,-0.6774100000000001
68,-0.6774100000000001
69,-0.6774100000000001
70,1.7059
71,1.7059
72,0.17379
73,-0.6774100000000001
74,-0.6774100000000001
75,-0.6774100000000001
76,-0.6774100000000001
77,-0.6774100000000001
78,0.8547399999999999
79,1.7059
80,0.8547399999999999
81,-0.6774100000000001
82,-0.6774100000000001
83,-0.6774100000000001
84,-0.6774100000000001
85,-0.6774100000000001
86,-0.6774100000000001
87,1.8762
88,1.7059
89,-0.33693
90,-0.6774100000000001
91,-0.6774100000000001
92,-0.6774100000000001
93,-0.6774100000000001
94,0.34403
95,2.0464
