time,value
0,1.6501
1,1.6195
2,1.5719
3,1.5018
4,1.4208
5,1.3379
6,1.2534
7,1.1801
8,1.0945
9,1.0089
10,0.9233399999999999
11,0.83783
12,0.75236
13,0.66855
14,0.58324
15,0.49976000000000004
16,0.41465
17,0.34259
18,0.25843
19,0.17511
20,0.10380999999999999
21,0.01949
22,-0.06465599999999999
23,-0.14595
24,-0.22826
25,-0.30988000000000004
26,-0.39274000000000003
27,-0.4718
28,-0.55362
29,-0.63488
30,-0.7154699999999999
31,-0.79082
32,-0.86931
33,-0.94655
34,-1.0222
35,-1.0959
36,-1.1605
37,-1.2278
38,-1.2908
39,-1.3481
40,-1.3982
41,-1.4387
42,-1.4674
43,-1.4823
44,-1.482
45,-1.4667
46,-1.4355
47,-1.3966
48,-1.3463
49,-1.2885
50,-1.2266
51,-1.176
52,-1.1059999999999999
53,-1.0333
54,-0.9585
55,-0.8819600000000001
56,-0.80407
57,-0.72506
58,-0.6451600000000001
59,-0.56553
60,-0.48682
61,-0.40481
62,-0.32237
63,-0.24258000000000002
64,-0.15930999999999998
65,-0.075772
66,0.0073935
67,0.0895
68,0.17375
69,0.24723
70,0.32955999999999996
71,0.41225
72,0.49715
73,0.58029
74,0.6654100000000001
75,0.75061
76,0.8358700000000001
77,0.9221799999999999
78,1.0081
79,1.0951
80,1.1805
81,1.2659
82,1.3487
83,1.4194
84,1.5
85,1.5684
86,1.6095
87,1.6176
88,1.6165
89,1.597
90,1.5683
91,1.5009
92,1.4202
93,1.3372
94,1.2538
95,1.1681
96,1.0824
97,0.99682
98,0.9112299999999999
99,0.82568
100,0.74169
101,0.65628
102,0.57258
103,0.48735
104,0.40402
105,0.31901
106,0.24713000000000002
107,0.16276
108,0.080013
109,-0.0022646999999999997
110,-0.086066
111,-0.16727999999999998
112,-0.25081
113,-0.33103
114,-0.41379
115,-0.49615
116,-0.57804
117,-0.6554800000000001
118,-0.73588
119,-0.8154399999999999
120,-0.88912
121,-0.96599
122,-1.0412
123,-1.1143
124,-1.1745
125,-1.2397
126,-1.2983
127,-1.3497
128,-1.4068
129,-1.4385
130,-1.4673
131,-1.4823
132,-1.4821
133,-1.4668
134,-1.4377
135,-1.3969
136,-1.3466
137,-1.2890000000000001
138,-1.2259
139,-1.1651
140,-1.0938
141,-1.0201
142,-0.94435
143,-0.8670700000000001
144,-0.78855
145,-0.70902
146,-0.62865
147,-0.5512699999999999
148,-0.46943999999999997
149,-0.38714
150,-0.30443000000000003
151,-0.23510999999999999
152,-0.15168
153,-0.067986
154,0.013423
155,0.097625
156,0.18199
157,0.26433
158,0.34702
159,0.43191
160,0.5169
161,0.5906
162,0.67433
163,0.75959
164,0.84491
165,0.9302799999999999
166,1.0157
167,1.1027
168,1.1879
169,1.2722
170,1.3565
171,1.4396
172,1.5204
173,1.5888
174,1.6338
175,1.6519
