time,value
0,-0.62755
1,1.1762
2,1.8977
3,1.7173
4,-0.62755
5,-0.62755
6,-0.62755
7,-0.62755
8,-0.62755
9,-0.62755
10,-0.62755
11,-0.62755
12,-0.2668
13,1.8977
14,1.8977
15,0.45469
16,-0.62755
17,-0.62755
18,-0.62755
19,-0.62755
20,-0.62755
21,-0.62755
22,-0.62755
23,-0.62755
24,0.8154399999999999
25,1.8977
26,1.7173
27,-0.2668
28,-0.62755
29,-0.62755
30,-0.62755
31,-0.62755
32,-0.62755
33,-0.62755
34,-0.62755
35,0.63507
36,1.8977
37,1.7173
38,-0.08642899999999999
39,-0.62755
40,-0.62755
41,-0.62755
42,-0.62755
43,-0.62755
44,-0.62755
45,-0.62755
46,1.8977
47,1.7173
48,0.9958100000000001
49,-0.62755
50,-0.62755
51,-0.62755
52,-0.62755
53,-0.62755
54,-0.62755
55,-0.62755
56,-0.62755
57,1.8977
58,1.8977
59,0.63507
60,-0.62755
61,-0.62755
62,-0.62755
63,-0.62755
64,-0.62755
65,-0.62755
66,-0.62755
67,-0.62755
68,2.0781
69,1.7173
70,1.1762
71,-0.62755
72,-0.62755
73,-0.62755
74,-0.62755
75,-0.62755
76,-0.62755
77,0.093945
78,1.8977
79,1.7173
80,0.9958100000000001
81,-0.62755
82,-0.62755
83,-0.62755
84,-0.62755
85,-0.62755
86,-0.62755
87,-0.62755
88,1.7173
89,1.8977
90,1.3566
91,-0.62755
92,-0.62755
93,-0.62755
94,-0.62755
95,-0.62755
