time,value
0,1.7399
1,1.7128
2,1.6462
3,1.5573
4,1.4671
5,1.3765
6,1.286
7,1.1965
8,1.1083
9,1.0190000000000001
10,0.93135
11,0.8442299999999999
12,0.75734
13,0.67109
14,0.58521
15,0.50035
16,0.41600000000000004
17,0.33239
18,0.24977
19,0.16404000000000002
20,0.08127000000000001
21,-0.0020275
22,-0.084583
23,-0.1663
24,-0.25088
25,-0.33244
26,-0.41134
27,-0.49246999999999996
28,-0.57067
29,-0.64645
30,-0.72224
31,-0.78346
32,-0.8520399999999999
33,-0.93653
34,-0.9998299999999999
35,-1.0699
36,-1.1366
37,-1.1991
38,-1.2568
39,-1.2943
40,-1.3378
41,-1.3884
42,-1.4143
43,-1.4291
44,-1.4158
45,-1.4257
46,-1.4075
47,-1.3811
48,-1.3398
49,-1.2931
50,-1.2266
51,-1.1803
52,-1.1097
53,-1.0486
54,-0.97765
55,-0.90799
56,-0.8105399999999999
57,-0.73387
58,-0.6683600000000001
59,-0.61743
60,-0.54624
61,-0.46313999999999994
62,-0.38892
63,-0.30612
64,-0.22096999999999997
65,-0.13965999999999998
66,-0.060020000000000004
67,0.024
68,0.09312100000000001
69,0.17623
70,0.2595
71,0.34271
72,0.42613999999999996
73,0.51063
74,0.5957899999999999
75,0.68153
76,0.7679199999999999
77,0.8547899999999999
78,0.94211
79,1.0299
80,1.1198
81,1.2088
82,1.2990000000000002
83,1.3891
84,1.4804
85,1.5693
86,1.6566
87,1.6906
88,1.6902
89,1.6743
90,1.6195
91,1.5314
92,1.4436
93,1.3535
94,1.2766
95,1.1959
96,1.1096
97,1.0348
98,0.9466399999999999
99,0.85696
100,0.76531
101,0.67772
102,0.5904699999999999
103,0.5039
104,0.41934
105,0.33374000000000004
106,0.2482
107,0.1632
108,0.08147
109,-0.0011311
110,-0.084025
111,-0.16660999999999998
112,-0.24923
113,-0.33105999999999997
114,-0.4123
115,-0.49035
116,-0.56688
117,-0.64891
118,-0.7298899999999999
119,-0.8015100000000001
120,-0.8759399999999999
121,-0.94585
122,-1.0189
123,-1.0892
124,-1.1446
125,-1.2067
126,-1.2636
127,-1.3143
128,-1.3577
129,-1.3923
130,-1.4167
131,-1.4301
132,-1.4317
133,-1.4213
134,-1.3995
135,-1.3675
136,-1.3263
137,-1.2773
138,-1.2218
139,-1.161
140,-1.0958
141,-1.0323
142,-0.96488
143,-0.89007
144,-0.81326
145,-0.7427600000000001
146,-0.66314
147,-0.58808
148,-0.50539
149,-0.42805
150,-0.34912
151,-0.26768000000000003
152,-0.18341
153,-0.1018
154,-0.01934
155,0.061634
156,0.14670999999999998
157,0.22876999999999997
158,0.31176
159,0.39846
160,0.48317
161,0.56988
162,0.65557
163,0.74426
164,0.82996
165,0.91975
166,1.0087
167,1.0974
168,1.1861
169,1.2747
170,1.3634
171,1.4534
172,1.5416
173,1.63
174,1.7133
175,1.7402
