time,value
0,-0.25433
1,-0.25433
2,-0.25433
3,-0.25433
4,-0.25433
5,-0.25433
6,-0.25433
7,-0.25433
8,-0.25433
9,-0.25433
10,-0.25433
11,-0.25433
12,-0.25433
13,-0.25433
14,-0.25433
15,-0.25433
16,-0.25433
17,-0.25433
18,-0.25433
19,-0.25433
20,-0.25433
21,-0.25433
22,-0.25433
23,-0.25433
24,-0.25433
25,-0.25433
26,-0.25433
27,-0.25433
28,-0.25433
29,-0.25433
30,-0.25433
31,-0.25433
32,-0.25433
33,-0.25433
34,-0.25433
35,-0.25433
36,-0.25433
37,-0.25433
38,-0.25433
39,-0.25433
40,-0.25433
41,-0.25433
42,-0.25433
43,-0.25433
44,-0.25433
45,-0.25433
46,-0.25433
47,-0.25433
48,-0.25433
49,-0.25433
50,-0.25433
51,0.52342
52,-0.15711
53,-0.25433
54,-0.25433
55,-0.25433
56,0.60675
57,-0.25433
58,-0.25433
59,-0.25433
60,-0.25433
61,-0.25433
62,-0.25433
63,5.6066
64,4.2594
65,4.3011
66,3.69
67,2.5372
68,-0.25433
69,-0.25433
70,-0.25433
71,-0.25433
72,-0.25433
73,-0.25433
74,0.75952
75,-0.25433
76,-0.25433
77,-0.25433
78,-0.25433
79,-0.25433
80,-0.25433
81,-0.25433
82,-0.25433
83,-0.25433
84,-0.25433
85,-0.25433
86,-0.25433
87,-0.25433
88,-0.25433
89,-0.25433
90,-0.25433
91,-0.25433
92,-0.25433
93,-0.25433
94,-0.25433
95,-0.25433
