time,value
0,-0.1964
1,-0.1964
2,-0.1964
3,-0.1964
4,-0.1964
5,-0.1964
6,-0.1964
7,-0.1964
8,-0.1964
9,-0.1964
10,-0.1964
11,-0.1964
12,-0.1964
13,-0.1964
14,-0.1964
15,-0.1964
16,-0.1964
17,-0.1964
18,-0.1964
19,-0.1964
20,-0.1964
21,-0.1964
22,-0.1964
23,-0.1964
24,-0.1964
25,-0.1964
26,-0.1964
27,-0.1964
28,-0.1964
29,-0.1964
30,-0.1964
31,-0.1964
32,-0.1964
33,-0.1964
34,-0.1964
35,-0.1964
36,-0.1964
37,-0.1964
38,-0.1964
39,-0.1964
40,-0.1964
41,-0.1964
42,-0.1964
43,-0.1964
44,-0.1964
45,-0.1964
46,-0.1964
47,-0.1964
48,-0.1964
49,-0.1964
50,-0.1964
51,-0.1964
52,-0.1964
53,-0.1964
54,-0.1964
55,-0.1964
56,6.7096
57,4.1884
58,-0.1964
59,-0.1964
60,-0.1964
61,-0.1964
62,-0.1964
63,-0.1964
64,-0.1964
65,-0.1964
66,-0.1964
67,-0.1964
68,-0.1964
69,-0.1964
70,-0.1964
71,-0.1964
72,-0.1964
73,-0.1964
74,-0.1964
75,-0.1964
76,-0.1964
77,-0.1964
78,-0.1964
79,-0.1964
80,-0.1964
81,4.8461
82,2.3248
83,-0.1964
84,-0.1964
85,-0.1964
86,-0.1964
87,-0.1964
88,-0.1964
89,-0.1964
90,-0.1964
91,-0.1964
92,-0.1964
93,-0.1964
94,-0.1964
95,-0.1964
