time,value
0,-0.66546
1,-0.66546
2,-0.66546
3,1.1715
4,1.3756
5,-0.66546
6,-0.66546
7,-0.66546
8,-0.66546
9,1.7838
10,0.55916
11,-0.66546
12,-0.66546
13,-0.66546
14,-0.25725
15,2.1919999999999997
16,-0.053152
17,-0.66546
18,-0.66546
19,-0.66546
20,0.15095
21,2.1919999999999997
22,-0.66546
23,-0.66546
24,-0.66546
25,-0.66546
26,0.76326
27,1.5797
28,-0.66546
29,-0.66546
30,-0.66546
31,-0.66546
32,1.3756
33,1.1715
34,-0.66546
35,-0.66546
36,-0.66546
37,-0.66546
38,1.5797
39,0.76326
40,-0.66546
41,-0.66546
42,-0.66546
43,-0.66546
44,1.9879
45,0.55916
46,-0.66546
47,-0.66546
48,-0.66546
49,-0.66546
50,2.3961
51,-0.053152
52,-0.66546
53,-0.66546
54,-0.66546
55,0.15095
56,2.1919999999999997
57,-0.66546
58,-0.66546
59,-0.66546
60,-0.66546
61,0.76326
62,1.7838
63,-0.66546
64,-0.66546
65,-0.66546
66,-0.66546
67,1.5797
68,0.76326
69,-0.66546
70,-0.66546
71,-0.66546
72,-0.25725
73,2.1919999999999997
74,-0.053152
75,-0.66546
76,-0.66546
77,-0.66546
78,0.55916
79,1.7838
80,-0.66546
81,-0.66546
82,-0.66546
83,0.35505
84,1.9879
85,-0.66546
86,-0.66546
87,-0.66546
88,-0.66546
89,1.7838
90,0.55916
91,-0.66546
92,-0.66546
93,-0.66546
94,0.35505
95,2.1919999999999997
