time,value
0,-0.18938
1,-0.18938
2,-0.18938
3,-0.18938
4,-0.18938
5,-0.18938
6,-0.18938
7,-0.18938
8,-0.18938
9,-0.18938
10,-0.18938
11,-0.18938
12,-0.18938
13,-0.18938
14,-0.18938
15,-0.18938
16,-0.18938
17,-0.18938
18,-0.18938
19,-0.18938
20,-0.18938
21,-0.18938
22,-0.18938
23,-0.18938
24,-0.18938
25,-0.18938
26,-0.18938
27,-0.18938
28,-0.18938
29,-0.18938
30,-0.18938
31,-0.18938
32,-0.18938
33,-0.18938
34,-0.035089999999999996
35,7.1137
36,1.7135
37,0.029197000000000004
38,0.01634
39,2.215
40,5.7765
41,-0.16367
42,-0.18938
43,-0.18938
44,-0.18938
45,-0.18938
46,-0.18938
47,-0.18938
48,-0.18938
49,-0.18938
50,-0.18938
51,-0.18938
52,-0.18938
53,-0.18938
54,-0.18938
55,-0.18938
56,-0.18938
57,-0.18938
58,-0.18938
59,-0.18938
60,-0.18938
61,-0.18938
62,-0.18938
63,-0.18938
64,-0.18938
65,-0.18938
66,-0.18938
67,-0.18938
68,-0.18938
69,-0.18938
70,-0.18938
71,-0.18938
72,-0.18938
73,-0.18938
74,-0.18938
75,-0.18938
76,-0.18938
77,-0.18938
78,-0.18938
79,-0.18938
80,-0.18938
81,-0.18938
82,-0.18938
83,-0.18938
84,-0.18938
85,-0.18938
86,-0.18938
87,-0.18938
88,-0.18938
89,-0.18938
90,-0.18938
91,-0.18938
92,-0.18938
93,-0.18938
94,-0.18938
95,-0.18938
