time,value
0,-2.1881
1,-2.1881
2,-2.1881
3,-2.1881
4,-2.1881
5,-2.1881
6,-2.1906
7,-2.1906
8,-2.1905
9,-2.1905
10,-2.1902
11,-2.1899
12,-2.1896
13,-2.1895
14,-2.1893
15,-2.1888
16,-2.1886
17,-2.1909
18,-2.1927
19,-2.1941
20,-2.1957
21,-2.1971
22,-2.1957
23,-2.1953
24,-2.2002
25,-2.1985
26,-2.1972
27,-2.1957
28,-2.1937
29,-2.1919999999999997
30,-2.1897
31,-2.1878
32,-2.1859
33,-2.1832
34,-2.1811
35,-2.1789
36,-2.1781
37,-2.1757
38,-2.1732
39,-2.1698
40,-2.1671
41,-2.1644
42,-2.1606
43,-2.1577
44,-2.1547
45,-2.1528
46,-2.1585
47,-2.1564
48,-2.1531
49,-2.1498
50,-2.1452
51,-2.1417
52,-2.1403
53,-2.1388
54,-2.141
55,-2.1397
56,-2.1347
57,-2.1309
58,-2.1283
59,-2.127
60,-2.1257
61,-2.1217
62,-2.1163
63,-2.1122
64,-2.1067
65,-2.1025
66,-2.1002
67,-2.0944
68,-2.09
69,-2.0855
70,-2.0795
71,-2.0749
72,-2.0703
73,-2.0621
74,-2.0574
75,-2.0526
76,-2.0462
77,-2.0414
78,-2.0365
79,-2.0299
80,-2.0249
81,-2.0198
82,-2.013
83,-2.0079
84,-2.001
85,-1.9958
86,-1.9906
87,-1.9835
88,-1.9782
89,-1.9729
90,-1.9657
91,-1.9603
92,-1.9548
93,-1.9480000000000002
94,-1.9461
95,-1.9425
96,-1.9352
97,-1.9296
98,-1.9241
99,-1.9166
100,-1.9147
101,-1.9145
102,-1.9107
103,-1.905
104,-1.8974
105,-1.8917
106,-1.886
107,-1.8783
108,-1.8744
109,-1.8694
110,-1.8644
111,-1.8586
112,-1.8527
113,-1.845
114,-1.8391
115,-1.8332
116,-1.8253
117,-1.8193
118,-1.8218
119,-1.8241
120,-1.8181
121,-1.81
122,-1.8039
123,-1.7978
124,-1.7897
125,-1.7836
126,-1.7774
127,-1.7692
128,-1.7644
129,-1.7581
130,-1.7498
131,-1.7436
132,-1.7373
133,-1.729
134,-1.7227
135,-1.7163
136,-1.716
137,-1.7177
138,-1.7104
139,-1.704
140,-1.6976
141,-1.689
142,-1.6825
143,-1.6761
144,-1.6686
145,-1.6621
146,-1.6556
147,-1.6469
148,-1.6404
149,-1.6338
150,-1.6251
151,-1.6185
152,-1.6119999999999999
153,-1.6043
154,-1.6043
155,-1.6043
156,-1.5977
157,-1.5911
158,-1.5822
159,-1.5755
160,-1.5688
161,-1.5599
162,-1.5577
163,-1.5523
164,-1.5457
165,-1.5390000000000001
166,-1.5323
167,-1.5234
168,-1.5167
169,-1.51
170,-1.501
171,-1.4932
172,-1.4843
173,-1.4775
174,-1.4708
175,-1.4618
176,-1.455
177,-1.4482
178,-1.4437
179,-1.4414
180,-1.4392
181,-1.4324
182,-1.4256
183,-1.4211
184,-1.4188
185,-1.4133
186,-1.4055
187,-1.3954
188,-1.3886
189,-1.3818
190,-1.3727
191,-1.3682
192,-1.3607
193,-1.3575
194,-1.3506
195,-1.3415
196,-1.3347
197,-1.3279
198,-1.3187
199,-1.3109
200,-1.3041
201,-1.2949
202,-1.2881
203,-1.2812
204,-1.272
205,-1.2670000000000001
206,-1.2619
207,-1.2564
208,-1.2495
209,-1.2403
210,-1.2335
211,-1.2266
212,-1.2174
213,-1.2105
214,-1.2036
215,-1.1944
216,-1.1875
217,-1.1806
218,-1.1714
219,-1.1645
220,-1.1575
221,-1.1474
222,-1.1405
223,-1.1336
224,-1.1243
225,-1.1174
226,-1.1124
227,-1.1098
228,-1.1043
229,-1.0951
230,-1.0881
231,-1.0812
232,-1.072
233,-1.065
234,-1.0572
235,-1.0479
236,-1.041
237,-1.034
238,-1.0247
239,-1.0178
240,-1.0137
241,-1.008
242,-1.0025
243,-0.9955700000000001
244,-0.98629
245,-0.9784799999999999
246,-0.9692
247,-0.9622299999999999
248,-0.95526
249,-0.94596
250,-0.9389799999999999
251,-0.93499
252,-0.93266
253,-0.92801
254,-0.9202
255,-0.9100600000000001
256,-0.9022399999999999
257,-0.89443
258,-0.88894
259,-0.8866200000000001
260,-0.8796299999999999
261,-0.87498
262,-0.87265
263,-0.8648399999999999
264,-0.85785
265,-0.8555200000000001
266,-0.85319
267,-0.84852
268,-0.8415299999999999
269,-0.8322
270,-0.8322
271,-0.82986
272,-0.82052
273,-0.8135100000000001
274,-0.8073
275,-0.79795
276,-0.79719
277,-0.7972
278,-0.79171
279,-0.78467
280,-0.77527
281,-0.76822
282,-0.76193
283,-0.75252
284,-0.74621
285,-0.74608
286,-0.74593
287,-0.7388399999999999
288,-0.7317600000000001
289,-0.72231
290,-0.71522
291,-0.70812
292,-0.6986600000000001
293,-0.6915600000000001
294,-0.6844600000000001
295,-0.6783
296,-0.67379
297,-0.66998
298,-0.6605300000000001
299,-0.6534399999999999
300,-0.64398
301,-0.6361600000000001
302,-0.62907
303,-0.6196
304,-0.6125
305,-0.6054
306,-0.59758
307,-0.59545
308,-0.5909399999999999
309,-0.58148
310,-0.57438
311,-0.56729
312,-0.55782
313,-0.55001
314,-0.54291
315,-0.5334300000000001
316,-0.52633
317,-0.51685
318,-0.50974
319,-0.50262
320,-0.49649
321,-0.49201000000000006
322,-0.48823
323,-0.47805
324,-0.47093999999999997
325,-0.46384
326,-0.45436000000000004
327,-0.45225
328,-0.44773999999999997
329,-0.43993000000000004
330,-0.43212
331,-0.42975
332,-0.42738999999999994
333,-0.42194
334,-0.41413
335,-0.40323000000000003
336,-0.40015
337,-0.3947
338,-0.38689
339,-0.38689
340,-0.38144
341,-0.37435
342,-0.36725
343,-0.36436999999999997
344,-0.36218
345,-0.35761
346,-0.35463
347,-0.34917
348,-0.34210999999999997
349,-0.33194
350,-0.32487
351,-0.3178
352,-0.31556
353,-0.3133
354,-0.30791
355,-0.30561
356,-0.30171
357,-0.29233000000000003
358,-0.28451
359,-0.27746
360,-0.2673
361,-0.26264
362,-0.26031
363,-0.25015
364,-0.24311
365,-0.23842
366,-0.23526999999999998
367,-0.22825
368,-0.22121999999999997
369,-0.21106
370,-0.20403
371,-0.19777
372,-0.19305999999999998
373,-0.18913
374,-0.17977
375,-0.17275
376,-0.16493
377,-0.15557
378,-0.15164
379,-0.14926
380,-0.14064000000000002
381,-0.13363
382,-0.12580999999999998
383,-0.11645
384,-0.11018
385,-0.10544
386,-0.096819
387,-0.089005
388,-0.084243
389,-0.07865
390,-0.071654
391,-0.06150599999999999
392,-0.054508
393,-0.047507
394,-0.041213
395,-0.036427999999999995
396,-0.030126
397,-0.019981
398,-0.016005000000000002
399,-0.011193
400,-0.0048756
401,0.0029364
402,0.009257399999999999
403,0.014934000000000001
404,0.022746000000000002
405,0.030558
406,0.037735000000000005
407,0.04028
408,0.050413
409,0.057374
410,0.06518600000000001
411,0.074474
412,0.077642
413,0.08251
414,0.089709
415,0.096666
416,0.10447999999999999
417,0.11375999999999999
418,0.12157000000000001
419,0.12412999999999999
420,0.13134
421,0.13829
422,0.14524
423,0.15452
424,0.16233
425,0.17160999999999998
426,0.17857
427,0.18553
428,0.19482
429,0.20179
430,0.20432999999999998
431,0.20773000000000003
432,0.21261999999999998
433,0.21520999999999998
434,0.22388000000000002
435,0.23169
436,0.23574
437,0.24154
438,0.24704
439,0.25398000000000004
440,0.2641
441,0.27103
442,0.27884000000000003
443,0.28234000000000004
444,0.28729
445,0.29083000000000003
446,0.29351
447,0.30041999999999996
448,0.30964
449,0.31745
450,0.32436
451,0.33359
452,0.34052
453,0.34744
454,0.35329
455,0.35825999999999997
456,0.36518
457,0.37529
458,0.38221
459,0.38913000000000003
460,0.39729000000000003
461,0.40226999999999996
462,0.40919
463,0.4161
464,0.42302
465,0.43223999999999996
466,0.44005
467,0.44697
468,0.45621000000000006
469,0.46313000000000004
470,0.47006000000000003
471,0.47644
472,0.47875
473,0.48568
474,0.49491999999999997
475,0.5018600000000001
476,0.5088
477,0.51574
478,0.51574
479,0.51545
480,0.5128699999999999
481,0.5103
482,0.51788
483,0.52167
484,0.5191399999999999
485,0.51579
486,0.5133
487,0.5108199999999999
488,0.50753
489,0.5050899999999999
490,0.50266
491,0.49637
492,0.48936
493,0.48541000000000006
494,0.47986999999999996
495,0.47439
496,0.46738
497,0.45721999999999996
498,0.45021000000000005
499,0.4432
500,0.44078999999999996
501,0.43841
502,0.4329
503,0.43055
504,0.42663999999999996
505,0.41726
506,0.41023000000000004
507,0.40241
508,0.39304
509,0.39147
510,0.38679
511,0.3782
512,0.37038000000000004
513,0.36648000000000003
514,0.36106
515,0.35324
516,0.34308
517,0.34308
518,0.34073000000000003
519,0.33215
520,0.32433
521,0.31651999999999997
522,0.3134
523,0.31029
524,0.30246999999999996
525,0.30012
526,0.29777
527,0.28996
528,0.28056
529,0.27668000000000004
530,0.27439
531,0.26582
532,0.25877
533,0.2486
534,0.24154
535,0.23608
536,0.2307
537,0.22684
538,0.21903000000000003
539,0.21197
540,0.20972
541,0.20749
542,0.20218
543,0.19998
544,0.19617
545,0.18672
546,0.17890999999999999
547,0.17182
548,0.16165
549,0.1571
550,0.15494000000000002
551,0.14476
552,0.13767000000000001
553,0.13244
554,0.12793
555,0.1232
556,0.11302000000000001
557,0.1109
558,0.10642
559,0.09624400000000001
560,0.088434
561,0.08132400000000001
562,0.071844
563,0.067373
564,0.062915
565,0.055105999999999995
566,0.047296
567,0.043542000000000004
568,0.038426999999999996
569,0.032995
570,0.02281
571,0.016024
572,0.011625
573,0.0061984
574,-0.00093957
575,-0.0087466
576,-0.018259
577,-0.023686000000000002
578,-0.025695
579,-0.034829
580,-0.042634
581,-0.048058
582,-0.053068
583,-0.059136
584,-0.066941
585,-0.073651
586,-0.075576
587,-0.080501
588,-0.08238200000000001
589,-0.08602
590,-0.096209
591,-0.10223
592,-0.10647000000000001
593,-0.11248
594,-0.12027
595,-0.12567
596,-0.13047999999999998
597,-0.13407
598,-0.14185999999999999
599,-0.14965
600,-0.15142
601,-0.15317
602,-0.15788
603,-0.15959
604,-0.16497
605,-0.17515
606,-0.17869000000000002
607,-0.18332
608,-0.1911
609,-0.19833
610,-0.20851
611,-0.21574000000000002
612,-0.22296
613,-0.23259000000000002
614,-0.23981999999999998
615,-0.24148000000000003
616,-0.2485
617,-0.25573
618,-0.26350999999999997
619,-0.26808000000000004
620,-0.2721
621,-0.27987
622,-0.28764
623,-0.28922
624,-0.29128000000000004
625,-0.29281
626,-0.29674
627,-0.29872
628,-0.30017
629,-0.30356
630,-0.30404000000000003
631,-0.30404000000000003
632,-0.30545
633,-0.30730999999999997
634,-0.30868
635,-0.31001999999999996
636,-0.31001999999999996
637,-0.30759000000000003
638,-0.3003
639,-0.29102
640,-0.28946
641,-0.28831
642,-0.28429
643,-0.27699
644,-0.26724000000000003
645,-0.25994
646,-0.25263
647,-0.24288
648,-0.23556999999999997
649,-0.22826
650,-0.21852
651,-0.2112
652,-0.20389000000000002
653,-0.19414
654,-0.18683
655,-0.17952
656,-0.16976
657,-0.16245
658,-0.15513
659,-0.14538
660,-0.1397
661,-0.13563
662,-0.13035
663,-0.12304000000000001
664,-0.11329000000000002
665,-0.10597999999999999
666,-0.098663
667,-0.08891399999999999
668,-0.081193
669,-0.07388
670,-0.06412799999999999
671,-0.05681699999999999
672,-0.049502
673,-0.039747000000000005
674,-0.036097000000000004
675,-0.034864
676,-0.027141000000000002
677,-0.019833
678,-0.010086
679,-0.0027756
680,0.0045354
681,0.014284
682,0.021597
683,0.029317000000000003
684,0.039067000000000005
685,0.046379000000000004
686,0.053692
687,0.063444
688,0.070759
689,0.078074
690,0.082135
691,0.08581
692,0.09312000000000001
693,0.10287
694,0.11018
695,0.1179
696,0.12765
697,0.13496
698,0.14268
699,0.14636
700,0.14762
701,0.15736
702,0.16466
703,0.17197
704,0.18213
705,0.18944
706,0.19674
707,0.20489000000000002
708,0.2086
709,0.21433000000000002
710,0.22405999999999998
711,0.23135999999999998
712,0.23909
713,0.24883000000000002
714,0.25613
715,0.26629
716,0.27002
717,0.27376
718,0.28348
719,0.29122
720,0.29852
721,0.30825
722,0.30956
723,0.31332
724,0.32106
725,0.32835
726,0.33565
727,0.34581
728,0.35311
729,0.3604
730,0.37013
731,0.37146
732,0.37524
733,0.38298000000000004
734,0.39027
735,0.39999
736,0.40773000000000004
737,0.41502
738,0.42473999999999995
739,0.43203
740,0.43582
741,0.43764
742,0.44493
743,0.45221000000000006
744,0.46193
745,0.46921
746,0.4765
747,0.48622
748,0.4935
749,0.50125
750,0.5109600000000001
751,0.51825
752,0.5279699999999999
753,0.5352600000000001
754,0.54255
755,0.5522699999999999
756,0.55605
757,0.55742
758,0.56516
759,0.57291
760,0.58019
761,0.58991
762,0.59522
763,0.5966
764,0.6008899999999999
765,0.60231
766,0.6037399999999999
767,0.61392
768,0.6211899999999999
769,0.63089
770,0.63864
771,0.6459199999999999
772,0.65562
773,0.66094
774,0.66481
775,0.66868
776,0.67595
777,0.6832199999999999
778,0.69292
779,0.70019
780,0.7074600000000001
781,0.71716
782,0.72491
783,0.73218
784,0.74188
785,0.74915
786,0.75885
787,0.76613
788,0.7734
789,0.78163
790,0.7854899999999999
791,0.7913
792,0.8009999999999999
793,0.8082699999999999
794,0.8155399999999999
795,0.8257200000000001
796,0.83299
797,0.8402700000000001
798,0.84996
799,0.85724
800,0.8630399999999999
801,0.8674
802,0.87515
803,0.8824200000000001
804,0.8921100000000001
805,0.8993899999999999
806,0.90956
807,0.91684
808,0.92411
809,0.9338
810,0.9410799999999999
811,0.9444600000000001
812,0.9488200000000001
813,0.95609
814,0.96336
815,0.97306
816,0.9803200000000001
817,0.9876
818,0.99777
819,1.005
820,1.0099
821,1.0123
822,1.0172
823,1.0244
824,1.0244
825,1.0269
826,1.0346
827,1.0419
828,1.0443
829,1.0467
830,1.0545
831,1.0622
832,1.0705
833,1.0734
834,1.0763
835,1.0859999999999999
836,1.0865
837,1.0889
838,1.0962
839,1.1034
840,1.1131
841,1.1204
842,1.1277
843,1.1374
844,1.1446
845,1.1519
846,1.1616
847,1.1689
848,1.1766
849,1.1863
850,1.1936
851,1.2009
852,1.2106
853,1.2179
854,1.2252
855,1.2349
856,1.2421
857,1.2494
858,1.2591
859,1.2616
860,1.264
861,1.2713
862,1.2786
863,1.2858
864,1.2883
865,1.2883
866,1.2878
867,1.2878
868,1.2864
869,1.2846
870,1.2837
871,1.2837
872,1.2833
873,1.2819
874,1.2806
875,1.2764
876,1.2752
877,1.2670000000000001
878,1.2593
879,1.2556
880,1.2539
881,1.2502
882,1.249
883,1.2433
884,1.236
885,1.2283
886,1.2185
887,1.2112
888,1.21
889,1.206
890,1.1986
891,1.1913
892,1.1812
893,1.1739
894,1.1682
895,1.1646
896,1.1613
897,1.1516
898,1.1443
899,1.1366
900,1.1268
901,1.1256
902,1.122
903,1.1119
904,1.1046
905,1.0972
906,1.0875
907,1.0801
908,1.0728
909,1.0627
910,1.0554
911,1.048
912,1.0383
913,1.0309
914,1.0257
915,1.0221
916,1.0185
917,1.0087
918,1.001
919,0.9937
920,0.98393
921,0.9828
922,0.97925
923,0.97155
924,0.9642200000000001
925,0.95688
926,0.9467399999999999
927,0.9394100000000001
928,0.9320799999999999
929,0.9223100000000001
930,0.91876
931,0.91486
932,0.9075200000000001
933,0.9001899999999999
934,0.89005
935,0.88271
936,0.87674
937,0.8728799999999999
938,0.8679899999999999
939,0.86065
940,0.8508600000000001
941,0.8435299999999999
942,0.83583
943,0.82605
944,0.81871
945,0.8155600000000001
946,0.81417
947,0.80893
948,0.8015800000000001
949,0.79145
950,0.7841100000000001
951,0.77642
952,0.77295
953,0.76949
954,0.7597
955,0.75236
956,0.7446699999999999
957,0.73488
958,0.73388
959,0.73044
960,0.72277
961,0.71542
962,0.70775
963,0.69795
964,0.69272
965,0.6893100000000001
966,0.68591
967,0.67855
968,0.66875
969,0.6613899999999999
970,0.65373
971,0.6439199999999999
972,0.63657
973,0.63135
974,0.62765
975,0.62458
976,0.6172300000000001
977,0.60742
978,0.59975
979,0.5924
980,0.58658
981,0.58568
982,0.58048
983,0.5706600000000001
984,0.5633
985,0.55319
986,0.54583
987,0.53847
988,0.52836
989,0.52503
990,0.52171
991,0.51189
992,0.50453
993,0.49716000000000005
994,0.48733999999999994
995,0.47968999999999995
996,0.47233
997,0.46251000000000003
998,0.45515
999,0.44778
1000,0.44418
1001,0.44361999999999996
1002,0.43598000000000003
1003,0.42615
1004,0.41878999999999994
1005,0.40897
1006,0.40131999999999995
1007,0.39395
1008,0.38413
1009,0.37676
1010,0.3694
1011,0.36338000000000004
1012,0.36256
1013,0.35519
1014,0.34536
1015,0.33799
1016,0.33061999999999997
1017,0.32053000000000004
1018,0.31316
1019,0.30579
1020,0.30498000000000003
1021,0.30173
1022,0.29164
1023,0.28426999999999997
1024,0.27664
1025,0.26681
1026,0.26384
1027,0.26061999999999996
1028,0.2552
1029,0.24783000000000002
1030,0.24045
1031,0.23060999999999998
1032,0.22324000000000002
1033,0.21561
1034,0.20578000000000002
1035,0.1984
1036,0.19103
1037,0.1834
1038,0.18020999999999998
1039,0.17457
1040,0.16719
1041,0.15980999999999998
1042,0.14973
1043,0.14212
1044,0.14142000000000002
1045,0.13582
1046,0.12844
1047,0.12105
1048,0.11098
1049,0.1036
1050,0.1007
1051,0.097371
1052,0.092235
1053,0.084641
1054,0.07950800000000001
1055,0.076436
1056,0.07338099999999999
1057,0.06598899999999999
1058,0.058598000000000004
1059,0.048549
1060,0.041157
1061,0.038501
1062,0.035285000000000004
1063,0.032458
1064,0.025064
1065,0.015206
1066,0.007631399999999999
1067,0.00023743
1068,-0.0050466
1069,-0.005562600000000001
1070,-0.0083636
1071,-0.018227
1072,-0.025789
1073,-0.033186
1074,-0.043049000000000004
1075,-0.043373
1076,-0.046462
1077,-0.05154500000000001
1078,-0.05909400000000001
1079,-0.06446
1080,-0.064875
1081,-0.067734
1082,-0.068228
1083,-0.073398
1084,-0.080805
1085,-0.088323
1086,-0.088323
1087,-0.088323
1088,-0.088758
1089,-0.089059
1090,-0.089341
1091,-0.089601
1092,-0.089685
1093,-0.089917
1094,-0.087661
1095,-0.082787
1096,-0.07296799999999999
1097,-0.065557
1098,-0.058146
1099,-0.050852999999999995
1100,-0.051019
1101,-0.046175
1102,-0.036289999999999996
1103,-0.028877999999999997
1104,-0.021463999999999997
1105,-0.011626000000000001
1106,-0.0042136000000000005
1107,0.0032004
1108,0.0080194
1109,0.010389
1110,0.015302000000000001
1111,0.025188
1112,0.032602
1113,0.042487
1114,0.049899
1115,0.057313
1116,0.06717100000000001
1117,0.074585
1118,0.081999
1119,0.09188400000000001
1120,0.099298
1121,0.10670999999999999
1122,0.1091
1123,0.10905999999999999
1124,0.11647
1125,0.12636
1126,0.13377
1127,0.14119
1128,0.15107
1129,0.15847999999999998
1130,0.16837
1131,0.17578
1132,0.1832
1133,0.19308
1134,0.2005
1135,0.20790999999999998
1136,0.2178
1137,0.2252
1138,0.23262
1139,0.2425
1140,0.24991
1141,0.25733
1142,0.26721
1143,0.27463000000000004
1144,0.28204
1145,0.29193
1146,0.29934
1147,0.30923
1148,0.31664000000000003
1149,0.32405
1150,0.33394
1151,0.34135
1152,0.34876999999999997
1153,0.35865
1154,0.36608
1155,0.37349
1156,0.38338
1157,0.39079
1158,0.3982
1159,0.40809
1160,0.4155
1161,0.42291999999999996
1162,0.4328
1163,0.44022
1164,0.44763000000000003
1165,0.45752
1166,0.45998
1167,0.46248
1168,0.46991000000000005
1169,0.47734
1170,0.4823
1171,0.48478999999999994
1172,0.49222
1173,0.49717
1174,0.49964
1175,0.50458
1176,0.51447
1177,0.52188
1178,0.5292899999999999
1179,0.53918
1180,0.5465899999999999
1181,0.5539999999999999
1182,0.56391
1183,0.57133
1184,0.58121
1185,0.58863
1186,0.59604
1187,0.60592
1188,0.61334
1189,0.62075
1190,0.63064
1191,0.63563
1192,0.6381899999999999
1193,0.6432
1194,0.65061
1195,0.6580199999999999
1196,0.66791
1197,0.67532
1198,0.6827300000000001
1199,0.69262
1200,0.70003
1201,0.70992
1202,0.71733
1203,0.7197399999999999
1204,0.7221
1205,0.72949
1206,0.7369
1207,0.74678
1208,0.7542
1209,0.76161
1210,0.7715
1211,0.77891
1212,0.78632
1213,0.7962100000000001
1214,0.80362
1215,0.81104
1216,0.81361
1217,0.81618
1218,0.8235899999999999
1219,0.83347
1220,0.8408899999999999
1221,0.85077
1222,0.8581799999999999
1223,0.8656
1224,0.8754799999999999
1225,0.87789
1226,0.88028
1227,0.88765
1228,0.8950600000000001
1229,0.9024700000000001
1230,0.9123600000000001
1231,0.9197700000000001
1232,0.92719
1233,0.9370700000000001
1234,0.94447
1235,0.95188
1236,0.9617600000000001
1237,0.9691799999999999
1238,0.97906
1239,0.9864799999999999
1240,0.9938899999999999
1241,1.0038
1242,1.0112
1243,1.0186
1244,1.0285
1245,1.0359
1246,1.0433
1247,1.0532
1248,1.0606
1249,1.068
1250,1.0779
1251,1.0853
1252,1.0927
1253,1.1026
1254,1.11
1255,1.1175
1256,1.1273
1257,1.1348
1258,1.1446
1259,1.1521
1260,1.1595
1261,1.1694
1262,1.1768
1263,1.1842
1264,1.1941
1265,1.1965
1266,1.1965
1267,1.2063
1268,1.2137
1269,1.2212
1270,1.2309999999999999
1271,1.2384
1272,1.2459
1273,1.2533
1274,1.2533
1275,1.2557
1276,1.2557
1277,1.2557
1278,1.2632
1279,1.2681
1280,1.2681
1281,1.2681
1282,1.2706
1283,1.2706
1284,1.2706
1285,1.2706
1286,1.2731
1287,1.2830000000000001
1288,1.2904
1289,1.2978
1290,1.3077
1291,1.3126
1292,1.3151
1293,1.32
1294,1.3274
1295,1.3373
1296,1.3447
1297,1.3521
1298,1.3619999999999999
1299,1.3694
1300,1.3768
1301,1.3867
1302,1.3941
1303,1.4016
1304,1.4114
1305,1.4189
1306,1.4263
1307,1.4362
1308,1.4436
1309,1.4509999999999998
1310,1.4609
1311,1.4683
1312,1.4782
1313,1.4856
1314,1.493
1315,1.5029
1316,1.5054
1317,1.5079
1318,1.5128
1319,1.5203
1320,1.5277
1321,1.5376
1322,1.545
1323,1.5524
1324,1.5623
1325,1.5697
1326,1.5721
1327,1.5746
1328,1.5819999999999999
1329,1.5894
1330,1.5918
1331,1.5943
1332,1.6042
1333,1.6092
1334,1.6092
1335,1.6092
1336,1.6093
1337,1.6094
1338,1.6095
1339,1.6096
1340,1.6097
1341,1.6098
1342,1.61
1343,1.6076
1344,1.5978
1345,1.5929
1346,1.5907
1347,1.5883
1348,1.5809
1349,1.571
1350,1.5637
1351,1.5563
1352,1.5538
1353,1.5514
1354,1.5465
1355,1.5367
1356,1.5294
1357,1.5294
1358,1.527
1359,1.5195
1360,1.5146
1361,1.5121
1362,1.5071
1363,1.4997
1364,1.4898
1365,1.4874
1366,1.4875
1367,1.4802
1368,1.4752
1369,1.4728
1370,1.4703
1371,1.4629
1372,1.453
1373,1.4456
1374,1.4383
1375,1.4284
1376,1.421
1377,1.4161
1378,1.4140000000000001
1379,1.4117
1380,1.4043
1381,1.3944
1382,1.3869999999999998
1383,1.3771
1384,1.3698
1385,1.3624
1386,1.3525
1387,1.3451
1388,1.3377
1389,1.3355
1390,1.3355
1391,1.3281
1392,1.3182
1393,1.3109
1394,1.3036
1395,1.2964
1396,1.2939
1397,1.2914
1398,1.2815
1399,1.2791
1400,1.2766
1401,1.2717
1402,1.2643
1403,1.2544
1404,1.247
1405,1.2396
1406,1.2297
1407,1.2223
1408,1.2149
1409,1.205
1410,1.1976
1411,1.1902
1412,1.1803
1413,1.1729
1414,1.1655
1415,1.1556
1416,1.1482
1417,1.1408
1418,1.1309
1419,1.1235
1420,1.1138
1421,1.1064
1422,1.0989
1423,1.0891
1424,1.0817
1425,1.0743
1426,1.0644
1427,1.062
1428,1.0599
1429,1.0578
1430,1.0504
1431,1.043
1432,1.0331
1433,1.0257
1434,1.0184
1435,1.0085
1436,1.0011
1437,0.9912700000000001
1438,0.98387
1439,0.9817899999999999
1440,0.9823200000000001
1441,0.9749200000000001
1442,0.96752
1443,0.95765
1444,0.95025
1445,0.94284
1446,0.9329700000000001
1447,0.9255700000000001
1448,0.91817
1449,0.9083
1450,0.9009
1451,0.89349
1452,0.8836299999999999
1453,0.8762200000000001
1454,0.86635
1455,0.85895
1456,0.85155
1457,0.84183
1458,0.83442
1459,0.8270200000000001
1460,0.81715
1461,0.80975
1462,0.80235
1463,0.7924800000000001
1464,0.78508
1465,0.77768
1466,0.76781
1467,0.76041
1468,0.7530100000000001
1469,0.7431399999999999
1470,0.73575
1471,0.72834
1472,0.72649
1473,0.7245
1474,0.7146399999999999
1475,0.70724
1476,0.69984
1477,0.68997
1478,0.68258
1479,0.67518
1480,0.6653100000000001
1481,0.65808
1482,0.65069
1483,0.64066
1484,0.63326
1485,0.6258600000000001
1486,0.616
1487,0.6086
1488,0.60121
1489,0.59134
1490,0.58395
1491,0.57408
1492,0.5666899999999999
1493,0.55929
1494,0.54943
1495,0.54203
1496,0.53463
1497,0.52477
1498,0.5173800000000001
1499,0.50998
1500,0.50029
1501,0.4929
1502,0.4855
1503,0.47563999999999995
1504,0.46825
1505,0.46066999999999997
1506,0.45081000000000004
1507,0.44342
1508,0.4362
1509,0.42616000000000004
1510,0.41877
1511,0.40909
1512,0.40151
1513,0.3943
1514,0.38444
1515,0.37686
1516,0.36946999999999997
1517,0.35961
1518,0.35222
1519,0.34481999999999996
1520,0.33496
1521,0.32757
1522,0.32018
1523,0.3105
1524,0.30311
1525,0.29571
1526,0.28586
1527,0.27846
1528,0.26861
1529,0.26121
1530,0.25667
1531,0.25253000000000003
1532,0.25026
1533,0.24286999999999997
1534,0.23301999999999998
1535,0.22563000000000002
1536,0.21845
1537,0.2086
1538,0.20121
1539,0.19917
1540,0.19757
1541,0.19287
1542,0.18549000000000002
1543,0.17565
1544,0.16849
1545,0.15864
1546,0.15125999999999998
1547,0.14388
1548,0.13965
1549,0.13790999999999998
1550,0.13324
1551,0.12389000000000001
1552,0.12465
1553,0.12297000000000001
1554,0.11314
1555,0.10575999999999999
1556,0.09839099999999999
1557,0.088563
1558,0.08146
1559,0.074088
1560,0.064262
1561,0.056892
1562,0.049523000000000005
1563,0.047889
1564,0.04873
1565,0.046560000000000004
1566,0.046846
1567,0.047136000000000004
1568,0.048313999999999996
1569,0.048313999999999996
1570,0.048612999999999996
1571,0.049219
1572,0.050145999999999996
1573,0.051087
1574,0.054826
1575,0.055812
1576,0.056817999999999994
1577,0.05819
1578,0.063432
1579,0.070772
1580,0.080558
1581,0.088246
1582,0.096286
1583,0.09979299999999999
1584,0.10295
1585,0.11274
1586,0.12043
1587,0.12775999999999998
1588,0.1351
1589,0.13863
1590,0.14218
1591,0.14743
1592,0.15514
1593,0.1604
1594,0.16435
1595,0.16756
1596,0.17488
1597,0.18503
1598,0.19236
1599,0.19968
1600,0.20328
1601,0.2069
1602,0.21705
1603,0.22436999999999999
1604,0.23208
1605,0.24184
1606,0.24791
1607,0.24911999999999998
1608,0.25684
1609,0.26415
1610,0.27146
1611,0.28162
1612,0.28894000000000003
1613,0.29625
1614,0.306
1615,0.30966
1616,0.31089
1617,0.32105
1618,0.32835
1619,0.3381
1620,0.34541
1621,0.35272
1622,0.36288000000000004
1623,0.37019
1624,0.37751
1625,0.38726
1626,0.39457
1627,0.40188
1628,0.40676
1629,0.4092
1630,0.41407
1631,0.42139
1632,0.42139
1633,0.42423
1634,0.43438000000000004
1635,0.4421
1636,0.45226000000000005
1637,0.45957
1638,0.46688999999999997
1639,0.46688999999999997
1640,0.47055
1641,0.47786000000000006
1642,0.48761000000000004
1643,0.49491999999999997
1644,0.5022399999999999
1645,0.51198
1646,0.5193
1647,0.5270199999999999
1648,0.53677
1649,0.54408
1650,0.5514
1651,0.56115
1652,0.56603
1653,0.56847
1654,0.57335
1655,0.58107
1656,0.5839
1657,0.58675
1658,0.59202
1659,0.60259
1660,0.60787
1661,0.61031
1662,0.6151800000000001
1663,0.6225
1664,0.62981
1665,0.63956
1666,0.64688
1667,0.6541899999999999
1668,0.66435
1669,0.67166
1670,0.67898
1671,0.6887300000000001
1672,0.69605
1673,0.7033699999999999
1674,0.70701
1675,0.7106600000000001
1676,0.72082
1677,0.72813
1678,0.73585
1679,0.7456
1680,0.7488600000000001
1681,0.75253
1682,0.76067
1683,0.76798
1684,0.7752899999999999
1685,0.78503
1686,0.7923399999999999
1687,0.80006
1688,0.80981
1689,0.81712
1690,0.8268700000000001
1691,0.8301299999999999
1692,0.8338200000000001
1693,0.84196
1694,0.8492700000000001
1695,0.8569899999999999
1696,0.86674
1697,0.87245
1698,0.87616
1699,0.88189
1700,0.8891899999999999
1701,0.89649
1702,0.90665
1703,0.91395
1704,0.9212600000000001
1705,0.93099
1706,0.9342799999999999
1707,0.93845
1708,0.94375
1709,0.95104
1710,0.96078
1711,0.9680700000000001
1712,0.9758100000000001
1713,0.98554
1714,0.99284
1715,1.0001
1716,1.0099
1717,1.0152
1718,1.0189
1719,1.0226
1720,1.0299
1721,1.0372
1722,1.047
1723,1.0547
1724,1.062
1725,1.0717
1726,1.077
1727,1.0812
1728,1.0845
1729,1.0918
1730,1.102
1731,1.1093
1732,1.1166
1733,1.1228
1734,1.1241
1735,1.1319
1736,1.1416
1737,1.1489
1738,1.1562
1739,1.1659
1740,1.1732
1741,1.1805
1742,1.1907
1743,1.1979
1744,1.2077
1745,1.215
1746,1.2223
1747,1.232
1748,1.2393
1749,1.2406
1750,1.2448
1751,1.2497
1752,1.2570000000000001
1753,1.2667
1754,1.2744
1755,1.2817
1756,1.2915
1757,1.2987
1758,1.3016
1759,1.3041
1760,1.3113
1761,1.3211
1762,1.3284
1763,1.3356
1764,1.339
1765,1.3394
1766,1.3472
1767,1.3569
1768,1.3642
1769,1.3715
1770,1.3812
1771,1.3836
1772,1.3869
1773,1.3967
1774,1.4040000000000001
1775,1.4117
1776,1.4219
1777,1.4256
1778,1.4269999999999998
1779,1.4367
1780,1.442
1781,1.4463
1782,1.4477
1783,1.4491
1784,1.4509999999999998
1785,1.4524
1786,1.4538
1787,1.4558
1788,1.4573
1789,1.4588
1790,1.4578
1791,1.4506
1792,1.4438
1793,1.4429
1794,1.4444
1795,1.4401
1796,1.4305
1797,1.4232
1798,1.4135
1799,1.4063
1800,1.399
1801,1.3894
1802,1.3821
1803,1.3749
1804,1.3658
1805,1.3585
1806,1.3513
1807,1.3416
1808,1.3344
1809,1.3271
1810,1.3175
1811,1.3102
1812,1.3030000000000002
1813,1.2939
1814,1.2931
1815,1.2923
1816,1.2827
1817,1.2754
1818,1.2658
1819,1.2586
1820,1.2513
1821,1.2423
1822,1.235
1823,1.2278
1824,1.2182
1825,1.2109
1826,1.2037
1827,1.2013
1828,1.1989
1829,1.1922
1830,1.1838
1831,1.1795
1832,1.1777
1833,1.1729
1834,1.1657
1835,1.1627
1836,1.1627
1837,1.1579
1838,1.1483
1839,1.141
1840,1.1416
1841,1.135
1842,1.1284
1843,1.1284
1844,1.126
1845,1.1187
1846,1.1115
1847,1.1014
1848,1.0942
1849,1.0869
1850,1.0773
1851,1.0701
1852,1.0642
1853,1.06
1854,1.0522
1855,1.0426
1856,1.0354
1857,1.0282
1858,1.0186
1859,1.0114
1860,1.0042
1861,0.99461
1862,0.9898100000000001
1863,0.98741
1864,0.98501
1865,0.9778100000000001
1866,0.9706100000000001
1867,0.9658100000000001
1868,0.96342
1869,0.95862
1870,0.9484299999999999
1871,0.94304
1872,0.94304
1873,0.93584
1874,0.92805
1875,0.91786
1876,0.91007
1877,0.9094700000000001
1878,0.90349
1879,0.8962899999999999
1880,0.8890899999999999
1881,0.88489
1882,0.8830899999999999
1883,0.88129
1884,0.87231
1885,0.86572
1886,0.85914
1887,0.8537399999999999
1888,0.8507399999999999
1889,0.8447399999999999
1890,0.83755
1891,0.83036
1892,0.82078
1893,0.8135899999999999
1894,0.8088
1895,0.8058
1896,0.8004
1897,0.7932100000000001
1898,0.78364
1899,0.77645
1900,0.76927
1901,0.7597
1902,0.7519
1903,0.7447199999999999
1904,0.73515
1905,0.72797
1906,0.7184
1907,0.71122
1908,0.70936
1909,0.7045100000000001
1910,0.69733
1911,0.69015
1912,0.68057
1913,0.6733899999999999
1914,0.6662100000000001
1915,0.65664
1916,0.64885
1917,0.64167
1918,0.6321
1919,0.62493
1920,0.61775
1921,0.60819
1922,0.60102
1923,0.59385
1924,0.58429
1925,0.57712
1926,0.56757
1927,0.55977
1928,0.5526
1929,0.55008
1930,0.54643
1931,0.5392600000000001
1932,0.5297
1933,0.52253
1934,0.51473
1935,0.50517
1936,0.498
1937,0.49259
1938,0.48768999999999996
1939,0.48405
1940,0.47686999999999996
1941,0.46731000000000006
1942,0.45951000000000003
1943,0.44995
1944,0.44568
1945,0.44143000000000004
1946,0.43363999999999997
1947,0.42646000000000006
1948,0.41928000000000004
1949,0.40971
1950,0.40191
1951,0.39474000000000004
1952,0.38516999999999996
1953,0.38090999999999997
1954,0.37906
1955,0.36887
1956,0.36169
1957,0.35451
1958,0.34431999999999996
1959,0.33715
1960,0.32758000000000004
1961,0.3204
1962,0.31322
1963,0.30543000000000003
1964,0.30179
1965,0.29994
1966,0.2951
1967,0.29329
1968,0.29209
1969,0.2825
1970,0.27531
1971,0.26811999999999997
1972,0.25853000000000004
1973,0.25134
1974,0.24355
1975,0.23396999999999998
1976,0.22678
1977,0.2196
1978,0.21001999999999998
1979,0.20284000000000002
1980,0.19326
1981,0.18608
1982,0.1789
1983,0.16933
1984,0.16216
1985,0.15498
1986,0.14604
1987,0.13887
1988,0.1317
1989,0.12150999999999999
1990,0.11498
1991,0.10782
1992,0.098263
1993,0.091101
1994,0.083939
1995,0.074392
1996,0.067235
1997,0.057692999999999994
1998,0.049891000000000005
1999,0.043384
2000,0.033197000000000004
2001,0.026698000000000003
2002,0.01955
2003,0.010020999999999999
2004,0.0028744
2005,-0.0042706
2006,-0.013793000000000001
2007,-0.020935
2008,-0.028075
2009,-0.037592
2010,-0.045399
2011,-0.051864
2012,-0.062048
2013,-0.06917999999999999
2014,-0.07869
2015,-0.08581699999999999
2016,-0.092947
2017,-0.10245
2018,-0.10957
2019,-0.11669000000000002
2020,-0.12619
2021,-0.13330999999999998
2022,-0.14043
2023,-0.14991
2024,-0.15703
2025,-0.16414
2026,-0.17362
2027,-0.18073
2028,-0.18783
2029,-0.19730999999999999
2030,-0.20440999999999998
2031,-0.21151
2032,-0.22096999999999997
2033,-0.22735
2034,-0.23681
2035,-0.2439
2036,-0.25099
2037,-0.26043
2038,-0.26752
2039,-0.27224
2040,-0.2746
2041,-0.28095
2042,-0.28728000000000004
2043,-0.29286
2044,-0.29447
2045,-0.29607
2046,-0.30549
2047,-0.30473
2048,-0.30708
2049,-0.31414000000000003
2050,-0.32119000000000003
2051,-0.32982
2052,-0.33687
2053,-0.34079
2054,-0.34002
2055,-0.34079
2056,-0.34781
2057,-0.35717
2058,-0.3634
2059,-0.37041
2060,-0.37976
2061,-0.38677
2062,-0.39063000000000003
2063,-0.3897
2064,-0.39271
2065,-0.39887
2066,-0.40101
2067,-0.4008
2068,-0.40606
2069,-0.41302
2070,-0.41362
2071,-0.41246000000000005
2072,-0.41621
2073,-0.42313999999999996
2074,-0.43238000000000004
2075,-0.4393
2076,-0.44533999999999996
2077,-0.45456
2078,-0.46147
2079,-0.46838
2080,-0.47758
2081,-0.48128000000000004
2082,-0.47855
2083,-0.47488
2084,-0.4721
2085,-0.46931000000000006
2086,-0.46555
2087,-0.46271
2088,-0.45888
2089,-0.45598999999999995
2090,-0.4482
2091,-0.43814
2092,-0.43523
2093,-0.43004
2094,-0.42225
2095,-0.41447
2096,-0.40926
2097,-0.40531999999999996
2098,-0.40008
2099,-0.39708000000000004
2100,-0.3883
2101,-0.38151999999999997
2102,-0.37374
2103,-0.3647
2104,-0.35918
2105,-0.35291999999999996
2106,-0.34865
2107,-0.34088
2108,-0.33536
2109,-0.33007
2110,-0.32252
2111,-0.31351
2112,-0.30674
2113,-0.29996999999999996
2114,-0.28994000000000003
2115,-0.28315999999999997
2116,-0.27638
2117,-0.26986
2118,-0.26459
2119,-0.26032
2120,-0.25129
2121,-0.24352
2122,-0.23674
2123,-0.2267
2124,-0.22369
2125,-0.21615
2126,-0.20938
2127,-0.20260999999999998
2128,-0.19358
2129,-0.18681
2130,-0.18002
2131,-0.16998
2132,-0.16319
2133,-0.15641
2134,-0.14735
2135,-0.14055
2136,-0.13375
2137,-0.12725
2138,-0.12202
2139,-0.12004000000000001
2140,-0.10999
2141,-0.1032
2142,-0.096963
2143,-0.09396499999999999
2144,-0.087186
2145,-0.078141
2146,-0.071355
2147,-0.063572
2148,-0.05452100000000001
2149,-0.047725
2150,-0.040928
2151,-0.034707999999999996
2152,-0.029463999999999997
2153,-0.022678
2154,-0.013625
2155,-0.0068306
2156,-3.2566999999999995e-05
2157,0.010018
2158,0.016819999999999998
2159,0.025892000000000002
2160,0.032702999999999996
2161,0.04049
2162,0.046676
2163,0.050912
2164,0.057710000000000004
2165,0.06678300000000001
2166,0.07457000000000001
2167,0.08137899999999999
2168,0.086586
2169,0.091805
2170,0.095057
2171,0.10412
2172,0.11092
2173,0.11871
2174,0.12552
2175,0.13072999999999999
2176,0.13595
2177,0.14147
2178,0.14926
2179,0.15575999999999998
2180,0.15874000000000002
2181,0.163
2182,0.17204
2183,0.17883
2184,0.18562
2185,0.19567
2186,0.20247
2187,0.20926
2188,0.21705
2189,0.22227
2190,0.22525
2191,0.2343
2192,0.2411
2193,0.24888000000000002
2194,0.25794
2195,0.26474000000000003
2196,0.2748
2197,0.2813
2198,0.28652
2199,0.2943
2200,0.30209
2201,0.30633
2202,0.31256
2203,0.31808000000000003
2204,0.32586
2205,0.33338
2206,0.33863000000000004
2207,0.34415999999999997
2208,0.35419
2209,0.36172
2210,0.36474
2211,0.37251999999999996
2212,0.38029
2213,0.38558000000000003
2214,0.38861999999999997
2215,0.39168000000000003
2216,0.39578
2217,0.40112
2218,0.40423000000000003
2219,0.40839000000000003
2220,0.41511000000000003
2221,0.42288000000000003
2222,0.42823999999999995
2223,0.43138000000000004
2224,0.43454
2225,0.43877
2226,0.44195
2227,0.44515
2228,0.44943999999999995
2229,0.4549
2230,0.45592
2231,0.46026999999999996
2232,0.46355
2233,0.46795
2234,0.47125
2235,0.47458
2236,0.47903
2237,0.48239
2238,0.48575
2239,0.48028000000000004
2240,0.47368999999999994
2241,0.4671
2242,0.45945
2243,0.45621000000000006
2244,0.45743999999999996
2245,0.4587
2246,0.45214
2247,0.44559
2248,0.43685
2249,0.43031
2250,0.42158999999999996
2251,0.41505
2252,0.40851
2253,0.39981
2254,0.39328
2255,0.38676
2256,0.37806999999999996
2257,0.37156
2258,0.36506
2259,0.35638000000000003
2260,0.35184
2261,0.34612
2262,0.33942
2263,0.3329
2264,0.32521
2265,0.31654
2266,0.30885
2267,0.30194
2268,0.2974
2269,0.28970999999999997
2270,0.28202
2271,0.27847
2272,0.27276999999999996
2273,0.26408000000000004
2274,0.25756
2275,0.25105
2276,0.24238
2277,0.23469
2278,0.22819
2279,0.21953000000000003
2280,0.21304
2281,0.20656
2282,0.19792
2283,0.19144
2284,0.18472
2285,0.17775
2286,0.17439000000000002
2287,0.16575
2288,0.15927
2289,0.1528
2290,0.14417
2291,0.13771
2292,0.13004000000000002
2293,0.12143
2294,0.11498
2295,0.10854000000000001
2296,0.099951
2297,0.093515
2298,0.087087
2299,0.07852200000000001
2300,0.072101
2301,0.065688
2302,0.057145
2303,0.05127999999999999
2304,0.046327
2305,0.039909
2306,0.033494
2307,0.023702
2308,0.017297
2309,0.010893
2310,0.0023674
2311,-0.0052766
2312,-0.0077796
2313,-0.014903
2314,-0.021306
2315,-0.027704000000000003
2316,-0.037481
2317,-0.043869
2318,-0.050638
2319,-0.057771
2320,-0.063286
2321,-0.073062
2322,-0.077694
2323,-0.08143
2324,-0.088189
2325,-0.094595
2326,-0.10225
2327,-0.11077999999999999
2328,-0.11717000000000001
2329,-0.12305999999999999
2330,-0.13017
2331,-0.13658
2332,-0.14298
2333,-0.15275999999999998
2334,-0.15915
2335,-0.16466
2336,-0.1718
2337,-0.17643
2338,-0.18283
2339,-0.19135
2340,-0.19774
2341,-0.20751
2342,-0.21388000000000001
2343,-0.22025999999999998
2344,-0.22703
2345,-0.23294
2346,-0.23758
2347,-0.24735
2348,-0.25286
2349,-0.25876
2350,-0.26465
2351,-0.27104
2352,-0.27743
2353,-0.28719
2354,-0.29357
2355,-0.29994
2356,-0.30841999999999997
2357,-0.3152
2358,-0.32027
2359,-0.32578
2360,-0.33215
2361,-0.33978
2362,-0.3419
2363,-0.34402
2364,-0.3525
2365,-0.35462
2366,-0.35462
2367,-0.3614
2368,-0.36903
2369,-0.37665
2370,-0.38511
2371,-0.39145
2372,-0.39566999999999997
2373,-0.39907
2374,-0.40375
2375,-0.41218999999999995
2376,-0.41852
2377,-0.42483999999999994
2378,-0.43455
2379,-0.44086000000000003
2380,-0.44716000000000006
2381,-0.45397
2382,-0.45997
2383,-0.46466999999999997
2384,-0.47308
2385,-0.47938000000000003
2386,-0.48568
2387,-0.49406000000000005
2388,-0.50034
2389,-0.50661
2390,-0.5162899999999999
2391,-0.52255
2392,-0.5288
2393,-0.53713
2394,-0.5433600000000001
2395,-0.55167
2396,-0.55789
2397,-0.5641
2398,-0.5723699999999999
2399,-0.57857
2400,-0.5826399999999999
2401,-0.59011
2402,-0.59632
2403,-0.60253
2404,-0.61215
2405,-0.61834
2406,-0.6251899999999999
2407,-0.63268
2408,-0.63817
2409,-0.64437
2410,-0.65398
2411,-0.6601600000000001
2412,-0.66771
2413,-0.6718
2414,-0.67794
2415,-0.6875600000000001
2416,-0.6937399999999999
2417,-0.6978300000000001
2418,-0.70531
2419,-0.70945
2420,-0.71701
2421,-0.72385
2422,-0.72997
2423,-0.73474
2424,-0.74437
2425,-0.7498600000000001
2426,-0.75598
2427,-0.76208
2428,-0.76831
2429,-0.77452
2430,-0.78415
2431,-0.79035
2432,-0.79648
2433,-0.8026
2434,-0.80809
2435,-0.8163699999999999
2436,-0.8239299999999999
2437,-0.8301299999999999
2438,-0.83768
2439,-0.8438200000000001
2440,-0.84995
2441,-0.8595700000000001
2442,-0.86641
2443,-0.87254
2444,-0.8793700000000001
2445,-0.88559
2446,-0.8931399999999999
2447,-0.90141
2448,-0.9076
2449,-0.9151
2450,-0.9191600000000001
2451,-0.9253600000000001
2452,-0.93499
2453,-0.9411200000000001
2454,-0.94516
2455,-0.9548
2456,-0.96101
2457,-0.9685600000000001
2458,-0.97682
2459,-0.9816
2460,-0.98774
2461,-0.9945799999999999
2462,-1.0021
2463,-1.0076
2464,-1.013
2465,-1.0170000000000001
2466,-1.0245
2467,-1.0284
2468,-1.0347
2469,-1.043
2470,-1.0506
2471,-1.0568
2472,-1.0637
2473,-1.0698
2474,-1.0766
2475,-1.0862
2476,-1.0923
2477,-1.0984
2478,-1.1073
2479,-1.1135
2480,-1.1196
2481,-1.127
2482,-1.1332
2483,-1.1395
2484,-1.1492
2485,-1.1554
2486,-1.1636
2487,-1.1696
2488,-1.1731
2489,-1.1827
2490,-1.1882
2491,-1.1922
2492,-1.1982
2493,-1.2045
2494,-1.2121
2495,-1.2181
2496,-1.2241
2497,-1.2317
2498,-1.2393
2499,-1.2454
2500,-1.2492
2501,-1.2565
2502,-1.2603
2503,-1.265
2504,-1.2714
2505,-1.2790000000000001
2506,-1.2874
2507,-1.2938
2508,-1.2985
2509,-1.3057
2510,-1.3112
2511,-1.3188
2512,-1.3269
2513,-1.3307
2514,-1.3345
2515,-1.3416
2516,-1.3441
2517,-1.3505
2518,-1.3603
2519,-1.3667
2520,-1.3752
2521,-1.3798
2522,-1.3857
2523,-1.3937
2524,-1.4001
2525,-1.4069
2526,-1.4140000000000001
2527,-1.4195
2528,-1.4272
2529,-1.4339
2530,-1.4398
2531,-1.4444
2532,-1.4542
2533,-1.4621
2534,-1.4679
2535,-1.4756
2536,-1.4833
2537,-1.4891
2538,-1.496
2539,-1.5025
2540,-1.5124
2541,-1.5188
2542,-1.5253
2543,-1.5319999999999998
2544,-1.5378
2545,-1.5424
2546,-1.5522
2547,-1.5589
2548,-1.5647
2549,-1.5714
2550,-1.5779
2551,-1.5844
2552,-1.5942
2553,-1.6007
2554,-1.6071
2555,-1.6169
2556,-1.6203
2557,-1.6273
2558,-1.6328
2559,-1.6393
2560,-1.6479
2561,-1.6543
2562,-1.662
2563,-1.6705
2564,-1.6769
2565,-1.6816
2566,-1.6887
2567,-1.6963
2568,-1.7027
2569,-1.7113
2570,-1.7177
2571,-1.7253
2572,-1.7338
2573,-1.7414
2574,-1.7486
2575,-1.7554
2576,-1.7617
2577,-1.7702
2578,-1.7766
2579,-1.7829
2580,-1.7926
2581,-1.7989
2582,-1.8052
2583,-1.8135
2584,-1.8198
2585,-1.8259999999999998
2586,-1.8343
2587,-1.8405
2588,-1.8466
2589,-1.8548
2590,-1.861
2591,-1.8671
2592,-1.8752
2593,-1.8813
2594,-1.8893
2595,-1.8953
2596,-1.9013
2597,-1.9093
2598,-1.9138
2599,-1.9197
2600,-1.9275
2601,-1.9334
2602,-1.9392
2603,-1.9412
2604,-1.9431
2605,-1.9454
2606,-1.9515
2607,-1.9557
2608,-1.9541
2609,-1.9528
2610,-1.9568
2611,-1.9606
2612,-1.9624
2613,-1.9680000000000002
2614,-1.9754
2615,-1.9809
2616,-1.9864
2617,-1.9936
2618,-1.999
2619,-2.0044
2620,-2.0098
2621,-2.015
2622,-2.0203
2623,-2.0272
2624,-2.0324
2625,-2.0375
2626,-2.0443
2627,-2.046
2628,-2.0458
2629,-2.049
2630,-2.052
2631,-2.0534
2632,-2.0532
2633,-2.0545
2634,-2.0574
2635,-2.0574
2636,-2.059
2637,-2.0652
2638,-2.0699
2639,-2.0745
2640,-2.0805
2641,-2.0831
2642,-2.0875
2643,-2.0933
2644,-2.0976
2645,-2.1019
2646,-2.1074
2647,-2.1116
2648,-2.117
2649,-2.121
2650,-2.1249
2651,-2.1301
2652,-2.1338
2653,-2.1376
2654,-2.1425
2655,-2.1449
2656,-2.146
2657,-2.1472
2658,-2.1507
2659,-2.1541
2660,-2.1519999999999997
2661,-2.1509
2662,-2.1519
2663,-2.1539
2664,-2.1547
2665,-2.1554
2666,-2.1564
2667,-2.1587
2668,-2.1602
2669,-2.1630000000000003
2670,-2.1657
2671,-2.1692
2672,-2.1717
2673,-2.1742
2674,-2.1773
2675,-2.1796
2676,-2.1818
2677,-2.1846
2678,-2.1866
2679,-2.1885
2680,-2.1909
2681,-2.1926
2682,-2.1947
2683,-2.1962
2684,-2.1976
2685,-2.1969
2686,-2.1981
2687,-2.1992
2688,-2.2006
2689,-2.2015
2690,-2.2023
2691,-2.2028
2692,-2.2030000000000003
2693,-2.201
2694,-2.1967
2695,-2.1947
2696,-2.1924
2697,-2.1901
2698,-2.1903
2699,-2.1879
2700,-2.188
2701,-2.1881
2702,-2.1881
2703,-2.1881
2704,-2.1881
2705,-2.1881
2706,-2.1881
2707,-2.1881
2708,-2.1881
