time,value
0,-0.18986
1,-0.18986
2,-0.18986
3,-0.18986
4,-0.18986
5,-0.18986
6,-0.18986
7,-0.18986
8,-0.18986
9,-0.18986
10,-0.18986
11,-0.18986
12,-0.18986
13,-0.18986
14,-0.18986
15,-0.18986
16,-0.18986
17,-0.18986
18,-0.18986
19,-0.18986
20,-0.18986
21,-0.18986
22,-0.18986
23,-0.18986
24,-0.18986
25,-0.18986
26,-0.18986
27,-0.18986
28,-0.18986
29,-0.18986
30,-0.18986
31,-0.18986
32,7.6773
33,-0.18986
34,-0.18986
35,-0.18986
36,-0.18986
37,-0.18986
38,-0.18986
39,-0.18986
40,-0.18986
41,-0.18986
42,-0.18986
43,-0.18986
44,-0.18986
45,-0.18986
46,-0.18986
47,-0.18986
48,-0.18986
49,-0.18986
50,-0.18986
51,-0.18986
52,2.5364
53,-0.18986
54,-0.18986
55,-0.18986
56,-0.18986
57,-0.18986
58,-0.18986
59,-0.18986
60,3.6269
61,-0.18986
62,-0.18986
63,-0.18986
64,-0.18986
65,-0.18986
66,-0.18986
67,-0.18986
68,-0.18986
69,-0.18986
70,-0.18986
71,-0.18986
72,-0.18986
73,-0.18986
74,-0.18986
75,-0.18986
76,-0.18986
77,-0.18986
78,-0.18986
79,-0.18986
80,-0.18986
81,-0.18986
82,-0.18986
83,-0.18986
84,-0.18986
85,-0.18986
86,3.6269
87,-0.18986
88,-0.18986
89,-0.18986
90,-0.18986
91,-0.18986
92,-0.18986
93,-0.18986
94,-0.18986
95,-0.18986
