time,value
0,-0.25372
1,-0.25372
2,-0.25372
3,-0.25372
4,-0.25372
5,-0.25372
6,-0.25372
7,-0.25372
8,-0.25372
9,-0.25372
10,-0.25372
11,-0.25372
12,-0.25372
13,-0.25372
14,-0.25372
15,-0.25372
16,-0.25372
17,-0.25372
18,-0.25372
19,-0.25372
20,-0.25372
21,-0.25372
22,-0.25372
23,-0.25372
24,-0.25372
25,-0.25372
26,-0.25372
27,-0.25372
28,-0.25372
29,-0.25372
30,-0.25372
31,-0.25372
32,-0.25372
33,-0.25372
34,-0.25372
35,-0.25372
36,-0.25372
37,-0.25372
38,2.5977
39,-0.25372
40,-0.25372
41,-0.25372
42,0.75894
43,7.4479
44,-0.25372
45,-0.25372
46,-0.25372
47,-0.25372
48,-0.25372
49,2.8909
50,-0.25372
51,-0.25372
52,1.5318
53,0.73229
54,-0.25372
55,0.70565
56,-0.25372
57,-0.25372
58,-0.25372
59,-0.25372
60,-0.25372
61,-0.25372
62,-0.25372
63,-0.25372
64,-0.25372
65,-0.25372
66,-0.25372
67,-0.25372
68,2.3579
69,-0.25372
70,-0.25372
71,-0.25372
72,-0.25372
73,-0.25372
74,-0.25372
75,-0.25372
76,-0.25372
77,-0.25372
78,-0.25372
79,-0.25372
80,-0.25372
81,-0.25372
82,-0.25372
83,-0.25372
84,-0.25372
85,-0.25372
86,-0.25372
87,-0.25372
88,-0.25372
89,-0.25372
90,-0.25372
91,-0.25372
92,3.0508
93,-0.25372
94,-0.25372
95,-0.25372
