time,value
0,-0.8836
1,-0.22103000000000003
2,-1.6071
3,-0.44603000000000004
4,-1.158
5,-0.91651
6,-0.87726
7,-1.0728
8,-0.9078700000000001
9,-1.0229
10,-0.9913200000000001
11,-1.0047
12,-1.0262
13,-1.0386
14,-1.0462
15,-1.0488
16,-1.0562
17,-1.0692
18,-1.0783
19,-1.0827
20,-1.0814
21,-1.0806
22,-1.0874
23,-1.0895
24,-1.0882
25,-1.0834
26,-1.0765
27,-1.0811
28,-1.0832
29,-1.0818
30,-1.0766
31,-1.0685
32,-1.0728
33,-1.0744
34,-1.0731
35,-1.0673
36,-1.0568
37,-1.0568
38,-1.0571
39,-1.0539
40,-1.0476
41,-1.0377
42,-1.0349
43,-1.0366
44,-1.0361
45,-1.0324
46,-1.026
47,-1.0257
48,-1.0321
49,-1.0356
50,-1.0353
51,-1.031
52,-1.0286
53,-1.0364
54,-1.0412
55,-1.0417
56,-1.0381
57,-1.0345
58,-1.0448
59,-1.052
60,-1.0568
61,-1.0581
62,-1.0569
63,-1.0692
64,-1.0804
65,-1.0905
66,-1.0972
67,-1.0982
68,-1.1109
69,-1.1269
70,-1.1379
71,-1.1469
72,-1.1523
73,-1.1591
74,-1.1712
75,-1.1853
76,-1.196
77,-1.2009
78,-1.2058
79,-1.2141
80,-1.2194
81,-1.2219
82,-1.2205
83,-1.2191
84,-1.2258
85,-1.2295
86,-1.2309
87,-1.2271
88,-1.2198
89,-1.2269
90,-1.2317
91,-1.2325
92,-1.2304
93,-1.2259
94,-1.2329
95,-1.2407
96,-1.2446
97,-1.2463
98,-1.2467
99,-1.2538
100,-1.2621
101,-1.2674
102,-1.2699
103,-1.2670000000000001
104,-1.2669
105,-1.2749
106,-1.2814
107,-1.2822
108,-1.2785
109,-1.2770000000000001
110,-1.2842
111,-1.2885
112,-1.2884
113,-1.2835
114,-1.2784
115,-1.2855
116,-1.2889
117,-1.2878
118,-1.2832
119,-1.2766
120,-1.2830000000000001
121,-1.2868
122,-1.2881
123,-1.2857
124,-1.2793
125,-1.2844
126,-1.2901
127,-1.2909
128,-1.2878
129,-1.2803
130,-1.2779
131,-1.2785
132,-1.2755
133,-1.2669
134,-1.2541
135,-1.2458
136,-1.2438
137,-1.239
138,-1.2312
139,-1.2193
140,-1.2097
141,-1.2122
142,-1.2128
143,-1.2105
144,-1.2073
145,-1.2046
146,-1.2147
147,-1.2217
148,-1.2245
149,-1.2214
150,-1.2142
151,-1.2202
152,-1.2239
153,-1.2226
154,-1.2185
155,-1.2103
156,-1.2097
157,-1.2099
158,-1.2067
159,-1.1983
160,-1.1891
161,-1.1845
162,-1.1802
163,-1.1792
164,-1.1644
165,-1.145
166,-1.1224
167,-1.0776
168,-1.0583
169,-1.0512
170,-1.0094
171,-0.97314
172,-0.9534100000000001
173,-0.92409
174,-0.89441
175,-0.86095
176,-0.82473
177,-0.80719
178,-0.7875300000000001
179,-0.76156
180,-0.7330300000000001
181,-0.7029
182,-0.6843100000000001
183,-0.66371
184,-0.6413800000000001
185,-0.61768
186,-0.59272
187,-0.57963
188,-0.57075
189,-0.56145
190,-0.54942
191,-0.53613
192,-0.53315
193,-0.5341600000000001
194,-0.53245
195,-0.53071
196,-0.5260699999999999
197,-0.52541
198,-0.5352100000000001
199,-0.54283
200,-0.54551
201,-0.54335
202,-0.54135
203,-0.5506800000000001
204,-0.55658
205,-0.5576
206,-0.55308
207,-0.54362
208,-0.54627
209,-0.54477
210,-0.5373399999999999
211,-0.52544
212,-0.5131100000000001
213,-0.51297
214,-0.51179
215,-0.50649
216,-0.49541999999999997
217,-0.47868999999999995
218,-0.46948
219,-0.46303
220,-0.45524
221,-0.44666000000000006
222,-0.43281000000000003
223,-0.42283000000000004
224,-0.42121000000000003
225,-0.4163
226,-0.40851
227,-0.39815
228,-0.38868
229,-0.38959
230,-0.38856999999999997
231,-0.38553000000000004
232,-0.38211999999999996
233,-0.38117
234,-0.39584
235,-0.4087
236,-0.41851000000000005
237,-0.42526
238,-0.42823999999999995
239,-0.44355
240,-0.45508000000000004
241,-0.46126000000000006
242,-0.46183
243,-0.45603999999999995
244,-0.46
245,-0.48654
246,-0.53552
247,-0.55166
248,-0.54277
249,-0.56914
250,-0.59972
251,-0.62046
252,-0.6450899999999999
253,-0.6595300000000001
254,-0.68134
255,-0.71318
256,-0.72714
257,-0.74038
258,-0.76435
259,-0.78759
260,-0.81238
261,-0.82242
262,-0.82696
263,-0.8327
264,-0.83221
265,-0.84214
266,-0.84825
267,-0.84831
268,-0.84273
269,-0.8322700000000001
270,-0.8334
271,-0.8347
272,-0.8334299999999999
273,-0.8277
274,-0.81798
275,-0.81843
276,-0.8216100000000001
277,-0.821
278,-0.81782
279,-0.8118
280,-0.8122199999999999
281,-0.8194799999999999
282,-0.8221799999999999
283,-0.8202200000000001
284,-0.8154100000000001
285,-0.8134399999999999
286,-0.82011
287,-0.8241
288,-0.8264600000000001
289,-0.82471
290,-0.8204299999999999
291,-0.8276
292,-0.8292
293,-0.8242799999999999
294,-0.81447
295,-0.7985899999999999
296,-0.7947
297,-0.78622
298,-0.77174
299,-0.7516
300,-0.7276199999999999
301,-0.7149399999999999
302,-0.7034199999999999
303,-0.6925899999999999
304,-0.67898
305,-0.66508
306,-0.66168
307,-0.6594
308,-0.66179
309,-0.6558
310,-0.6269600000000001
311,-0.60839
312,-0.60017
313,-0.5774
314,-0.57427
315,-0.59315
316,-0.60338
317,-0.61903
318,-0.6318699999999999
319,-0.63418
320,-0.63331
321,-0.6320399999999999
322,-0.64294
323,-0.65333
324,-0.65998
325,-0.66146
326,-0.6581600000000001
327,-0.6653899999999999
328,-0.6691699999999999
329,-0.66613
330,-0.6564300000000001
331,-0.64488
332,-0.64458
333,-0.64579
334,-0.6451100000000001
335,-0.6420100000000001
336,-0.63641
337,-0.63907
338,-0.64742
339,-0.65398
340,-0.65952
341,-0.66177
342,-0.67028
343,-0.6882
344,-0.70013
345,-0.71514
346,-0.71592
347,-0.72073
348,-0.7689600000000001
349,-0.79267
350,-0.79065
351,-0.79156
352,-0.79775
353,-0.82606
354,-0.83757
355,-0.8731200000000001
356,-0.9169799999999999
357,-0.9072899999999999
358,-0.9073899999999999
359,-0.9207700000000001
360,-0.92037
361,-0.91664
362,-0.91709
363,-0.91955
364,-0.9222100000000001
365,-0.94831
366,-0.97221
367,-0.97252
368,-0.9774200000000001
369,-0.98416
370,-0.98905
371,-0.9897
372,-0.9805200000000001
373,-0.97856
374,-0.98254
375,-0.97885
376,-0.9722700000000001
377,-0.9615
378,-0.95021
379,-0.9486100000000001
380,-0.9438
381,-0.938
382,-0.9283
383,-0.9164200000000001
384,-0.9232600000000001
385,-0.92735
386,-0.92671
387,-0.92281
388,-0.91396
389,-0.9175399999999999
390,-0.92322
391,-0.9260799999999999
392,-0.9268799999999999
393,-0.92506
394,-0.92937
395,-0.9329799999999999
396,-0.9290200000000001
397,-0.9159700000000001
398,-0.8956200000000001
399,-0.8769100000000001
400,-0.85777
401,-0.8239299999999999
402,-0.76613
403,-0.69518
404,-0.63227
405,-0.57536
406,-0.51232
407,-0.45608000000000004
408,-0.40779
409,-0.36619
410,-0.34426
411,-0.33003000000000005
412,-0.32411999999999996
413,-0.32051
414,-0.31312
415,-0.31865
416,-0.31893
417,-0.31135999999999997
418,-0.29911
419,-0.28415999999999997
420,-0.28176999999999996
421,-0.28384000000000004
422,-0.28486
423,-0.28335
424,-0.27769
425,-0.27835
426,-0.28311
427,-0.28304
428,-0.28115
429,-0.27878000000000003
430,-0.2805
431,-0.29016
432,-0.29636
433,-0.29935
434,-0.29999000000000003
435,-0.30249000000000004
436,-0.31693000000000005
437,-0.32734
438,-0.33352
439,-0.33799999999999997
440,-0.34067
441,-0.35514
442,-0.36554000000000003
443,-0.37342
444,-0.38313
445,-0.39344
446,-0.41644
447,-0.43565
448,-0.44783
449,-0.45808999999999994
450,-0.48246000000000006
451,-0.4997
452,-0.4765
453,-0.47368000000000005
454,-0.48395
455,-0.47531
456,-0.49812
457,-0.5221399999999999
458,-0.50822
459,-0.49262
460,-0.48327
461,-0.47284
462,-0.47526999999999997
463,-0.48385
464,-0.48738000000000004
465,-0.48523
466,-0.48277
467,-0.49296
468,-0.50712
469,-0.5184
470,-0.5241
471,-0.53233
472,-0.55715
473,-0.56939
474,-0.55712
475,-0.5309699999999999
476,-0.50443
477,-0.49018
478,-0.47901000000000005
479,-0.47098
480,-0.46421999999999997
481,-0.45719
482,-0.46006
483,-0.46486000000000005
484,-0.46074
485,-0.44928
486,-0.43417
487,-0.42089
488,-0.41186000000000006
489,-0.40142
490,-0.38445
491,-0.36751999999999996
492,-0.36102
493,-0.35834
494,-0.34654
495,-0.32888
496,-0.30906999999999996
497,-0.29302
498,-0.28819
499,-0.2778
500,-0.25801
501,-0.23876999999999998
502,-0.20357999999999998
503,-0.16359
504,-0.1486
505,-0.13837
506,-0.10676
507,-0.080321
508,-0.06793400000000001
509,-0.049500999999999996
510,-0.025450999999999998
511,-3.5817e-05
512,0.022688
513,0.040425
514,0.059869000000000006
515,0.07679
516,0.09451699999999999
517,0.11928
518,0.13643
519,0.14836
520,0.16960999999999998
521,0.18675999999999998
522,0.21575999999999998
523,0.24575999999999998
524,0.24950999999999998
525,0.2654
526,0.26644
527,0.29721
528,0.30896
529,0.29509
530,0.47966000000000003
531,0.62016
532,0.5959399999999999
533,0.63259
534,0.6482100000000001
535,0.6542
536,0.68677
537,0.70963
538,0.74297
539,0.76094
540,0.77308
541,0.7862100000000001
542,0.80508
543,0.8260799999999999
544,0.83441
545,0.84745
546,0.86185
547,0.87798
548,0.90428
549,0.92404
550,0.93876
551,0.9582200000000001
552,0.9791
553,1.0048
554,1.0258
555,1.0307
556,1.0367
557,1.0444
558,1.0536
559,1.0626
560,1.0546
561,1.0497
562,1.0503
563,1.0575
564,1.0699
565,1.069
566,1.0708
567,1.0772
568,1.0859999999999999
569,1.0968
570,1.0937
571,1.0856
572,1.0824
573,1.0799
574,1.0847
575,1.0941
576,1.0972
577,1.1015
578,1.1092
579,1.1171
580,1.1237
581,1.1239
582,1.1265
583,1.1325
584,1.1411
585,1.1467
586,1.1365
587,1.1277
588,1.1241
589,1.1252
590,1.129
591,1.1178
592,1.1103
593,1.1084
594,1.1127
595,1.1209
596,1.1168
597,1.1121
598,1.1106
599,1.1138
600,1.1207
601,1.1182
602,1.1147
603,1.1162
604,1.12
605,1.1262
606,1.1238
607,1.1105
608,1.1003
609,1.0941
610,1.0905
611,1.0826
612,1.0634
613,1.0439
614,1.0079
615,0.955
616,0.8882700000000001
617,0.79794
618,0.72677
619,0.6764399999999999
620,0.6398699999999999
621,0.61656
622,0.57834
623,0.54908
624,0.51344
625,0.48828999999999995
626,0.45543999999999996
627,0.41142
628,0.38663000000000003
629,0.30239
630,0.30564
631,0.21593
632,-0.11854
633,-0.21949000000000002
634,-0.19994
635,-0.26971
636,-0.27123
637,-0.28989000000000004
638,-0.31888
639,-0.32883
640,-0.34455
641,-0.34423000000000004
642,-0.34796
643,-0.35914
644,-0.36143000000000003
645,-0.35871
646,-0.35086999999999996
647,-0.34016
648,-0.34225
649,-0.33851
650,-0.33174000000000003
651,-0.32414
652,-0.31334
653,-0.31764000000000003
654,-0.32350999999999996
655,-0.3257
656,-0.32505
657,-0.32192
658,-0.32795
659,-0.33647
660,-0.34002
661,-0.33551
662,-0.32464
663,-0.31905
664,-0.31737
665,-0.31116
666,-0.29964
667,-0.28131
668,-0.26435
669,-0.25718
670,-0.24854
671,-0.23624
672,-0.22102
673,-0.20744
674,-0.20661
675,-0.20335
676,-0.19378
677,-0.17887
678,-0.16353
679,-0.16166
680,-0.1549
681,-0.1485
682,-0.1322
683,-0.11105
684,-0.093248
685,-0.055485
686,-0.049488
687,-0.056105999999999996
688,-0.032542
689,-0.029053
690,-0.028477
691,-0.008371600000000002
692,0.015750999999999998
693,0.046727
694,0.072131
695,0.090988
696,0.11528
697,0.13359000000000001
698,0.1556
699,0.17736
700,0.174
701,0.18108
702,0.20545
703,0.23201999999999998
704,0.25771
705,0.26261999999999996
706,0.26759
707,0.27681999999999995
708,0.28505
709,0.30028
710,0.29845
711,0.2914
712,0.29336
713,0.28452
714,0.28981
715,0.32819
716,0.34376999999999996
717,0.34323000000000004
718,0.38335
719,0.43013
720,0.4519
721,0.47963999999999996
722,0.51154
723,0.53877
724,0.57157
725,0.59802
726,0.61858
727,0.6462
728,0.67961
729,0.72283
730,0.7692399999999999
731,0.8052199999999999
732,0.84473
733,0.89287
734,0.94457
735,0.98518
736,1.0033
737,1.0264
738,1.0458
739,1.0599
740,1.0756
741,1.0733
742,1.0725
743,1.0759
744,1.0796
745,1.0857
746,1.0813
747,1.0755
748,1.0742
749,1.0776
750,1.0854
751,1.0862
752,1.0826
753,1.0831
754,1.0874
755,1.0955
756,1.1
757,1.0959
758,1.0956
759,1.0993
760,1.1062
761,1.1102
762,1.1004
763,1.0964
764,1.1
765,1.1122
766,1.1266
767,1.1301
768,1.1517
769,1.1762
770,1.2174
771,1.2984
772,1.3766
773,1.4515
774,1.5258
775,1.5889
776,1.6363
777,1.6622
778,1.6825
779,1.7032
780,1.7271
781,1.7601
782,1.7853
783,1.8002
784,1.8216
785,1.8382
786,1.8479
787,1.8633
788,1.8751
789,1.8878
790,1.9061
791,1.9294
792,1.9482
793,1.9569999999999999
794,1.9723
795,1.9775
796,2.0053
797,2.0552
798,2.0557
799,2.0517
800,2.0611
801,2.0676
802,2.079
803,2.0771
804,2.0738
805,2.0772
806,2.086
807,2.0996
808,2.1011
809,2.0966
810,2.1004
811,2.1068
812,2.1263
813,2.1373
814,2.1334
815,2.1898
816,2.2722
817,2.3322
818,2.3958
819,2.4349
820,2.4497
821,2.4498
822,2.4637
823,2.4937
824,2.4928
825,2.4996
826,2.5128
827,2.5209
828,2.5369
829,2.5302
830,2.5206
831,2.5161
832,2.5171
833,2.5229
834,2.5127
835,2.5017
836,2.4952
837,2.4926
838,2.4946
839,2.4849
840,2.4674
841,2.4528
842,2.4426
843,2.4388
844,2.4322
845,2.4189
846,2.4114
847,2.4085
848,2.4083
849,2.406
850,2.3894
851,2.375
852,2.365
853,2.3324
854,2.26
855,2.1511
856,2.0414
857,1.9624
858,1.9264
859,1.91
860,1.8869999999999998
861,1.8646
862,1.8289
863,1.7930000000000001
864,1.757
865,1.7053
866,1.6574
867,1.5982
868,1.5643
869,1.5171
870,1.4725
871,1.4632
872,1.2798
873,1.1026
874,1.1149
875,1.0984
876,1.0688
877,1.0619
878,1.0547
879,1.056
880,1.0567
881,1.0479
882,0.9642799999999999
883,0.8881399999999999
884,0.86235
885,0.8113100000000001
886,0.76486
887,0.7387199999999999
888,0.71867
889,0.71418
890,0.7037100000000001
891,0.67904
892,0.65358
893,0.63453
894,0.62097
895,0.61175
896,0.5958100000000001
897,0.56924
898,0.5512699999999999
899,0.54081
900,0.53028
901,0.51771
902,0.49505
903,0.47731999999999997
904,0.47257
905,0.47318999999999994
906,0.47371
907,0.46343999999999996
908,0.44985
909,0.44068999999999997
910,0.4318
911,0.41658
912,0.39042
913,0.34415999999999997
914,0.26077
915,0.18921
916,0.13616
917,0.065005
918,0.036532
919,0.024501
920,0.028147000000000002
921,0.018299
922,-0.016153999999999998
923,-0.036505
924,-0.13233
925,-0.08634299999999999
926,-0.18575
927,-0.65054
928,-0.7707
929,-0.7135
930,-0.7891100000000001
931,-0.7739199999999999
932,-0.78889
933,-0.81316
934,-0.8137300000000001
935,-0.8312799999999999
936,-0.8325799999999999
937,-0.84244
938,-0.8593799999999999
939,-0.87374
940,-0.8852399999999999
941,-0.8904
942,-0.8951899999999999
943,-0.91005
944,-0.9192100000000001
945,-0.92268
946,-0.9201799999999999
947,-0.91328
948,-0.91545
949,-0.91343
950,-0.9058700000000001
951,-0.88951
952,-0.8667799999999999
953,-0.8518
954,-0.83341
955,-0.81233
956,-0.77813
957,-0.74361
958,-0.71816
959,-0.69329
960,-0.68355
961,-0.60654
962,-0.50748
963,-0.48499
964,-0.43965
965,-0.38492
966,-0.34865999999999997
967,-0.27507
968,-0.20229
969,-0.15553
970,-0.10815
971,-0.045665
972,0.011103
973,0.050812
974,0.07947
975,0.095002
976,0.10280999999999998
977,0.12941
978,0.14013
979,0.13765
980,0.15274000000000001
981,0.13124
982,0.19096
983,0.32071
984,0.33128
985,0.32693
986,0.3573
987,0.36746999999999996
988,0.41018999999999994
989,0.47258
990,0.53084
991,0.5954
992,0.64594
993,0.66406
994,0.6661199999999999
995,0.66603
996,0.67296
997,0.70018
998,0.73436
999,0.76671
1000,0.78789
1001,0.79907
1002,0.84675
1003,0.90476
1004,0.92296
1005,0.93084
1006,0.938
1007,0.94416
1008,0.97191
1009,0.9931200000000001
1010,0.99972
1011,1.0198
1012,1.0371
1013,1.0566
1014,1.0723
1015,1.0892
1016,1.1439
1017,1.1722
1018,1.1777
1019,1.2073
1020,1.2241
1021,1.2401
1022,1.2596
1023,1.2754
1024,1.3069
1025,1.3352
1026,1.3459
1027,1.351
1028,1.3582
1029,1.3552
1030,1.3583
1031,1.3475
1032,1.3115
1033,1.3286
1034,1.287
1035,1.3007
1036,1.3236
1037,0.9556399999999999
1038,0.69621
1039,0.75144
1040,0.6902
1041,0.63367
1042,0.5877100000000001
1043,0.5103800000000001
1044,0.47795
1045,0.43801999999999996
1046,0.39205
1047,0.34212
1048,0.29272
1049,0.25196999999999997
1050,0.21868
1051,0.17785
1052,0.12262
1053,0.074522
1054,0.033572000000000005
1055,-0.0022136
1056,-0.038514
1057,-0.081147
1058,-0.10389000000000001
1059,-0.12354000000000001
1060,-0.14340999999999998
1061,-0.14986
1062,-0.17153
1063,-0.19317
1064,-0.20903000000000002
1065,-0.22275
1066,-0.23339000000000001
1067,-0.25573
1068,-0.27482
1069,-0.28661
1070,-0.29194000000000003
1071,-0.29086999999999996
1072,-0.29602
1073,-0.30162
1074,-0.30144
1075,-0.29574
1076,-0.28294
1077,-0.27221
1078,-0.26609
1079,-0.25468
1080,-0.21618
1081,-0.22182
1082,-0.19535
1083,-0.09499400000000001
1084,-0.28202
1085,0.061222000000000006
1086,-0.23943000000000003
1087,-0.1125
1088,0.40236
1089,-0.81103
1090,1.494
1091,-1.8658
