time,value
0,0.77144
1,0.14324
2,0.35264
3,-0.13597
4,-0.55477
5,0.21304
6,0.073436
7,0.14324
8,0.073436
9,-0.55477
10,0.073436
11,0.14324
12,-0.13597
13,0.28284000000000004
14,-0.62457
15,-0.066165
16,0.35264
17,-0.48496999999999996
18,0.49223999999999996
19,-0.41517
20,-0.48496999999999996
21,0.42244
22,-0.27557
23,0.21304
24,-0.13597
25,-0.55477
26,0.073436
27,0.14324
28,-0.13597
29,0.28284000000000004
30,-0.55477
31,-0.55477
32,0.42244
33,-0.27557
34,0.35264
35,-0.27557
36,-0.55477
37,-0.13597
38,0.28284000000000004
39,0.0036354
40,0.14324
41,-0.62457
42,-0.55477
43,0.21304
44,0.14324
45,0.35264
46,-0.41517
47,-0.62457
48,-0.55477
49,0.42244
50,0.56204
51,-0.13597
52,-0.55477
53,-0.62457
54,-0.27557
55,0.77144
56,1.3996
57,-0.55477
58,-0.62457
59,-0.55477
60,0.0036354
61,1.1204
62,-0.27557
63,-0.62457
64,-0.55477
65,-0.62457
66,0.77144
67,0.63184
68,-0.55477
69,-0.62457
70,-0.55477
71,-0.48496999999999996
72,8.3797
73,0.0036354
74,-0.55477
75,-0.62457
76,-0.55477
77,0.28284000000000004
78,1.0506
79,-0.55477
80,-0.62457
81,-0.55477
82,-0.62457
83,1.0506
84,0.35264
85,-0.55477
86,-0.62457
87,-0.55477
88,-0.066165
89,0.9808399999999999
90,-0.13597
91,-0.55477
92,-0.62457
93,-0.48496999999999996
94,0.49223999999999996
95,0.56204
