time,value
0,-0.042112000000000004
1,1.1557
2,-0.79077
3,-0.79077
4,1.7547
5,-0.79077
6,-0.79077
7,0.55681
8,0.40708
9,-0.79077
10,-0.79077
11,1.7547
12,-0.79077
13,-0.79077
14,1.1557
15,-0.19184
16,-0.79077
17,-0.4913
18,1.4552
19,-0.79077
20,-0.79077
21,1.006
22,-0.042112000000000004
23,-0.79077
24,-0.79077
25,1.7547
26,-0.79077
27,-0.79077
28,0.40708
29,0.55681
30,-0.79077
31,-0.79077
32,1.7547
33,-0.79077
34,-0.79077
35,-0.042112000000000004
36,1.1557
37,-0.79077
38,-0.79077
39,1.6049
40,-0.79077
41,-0.79077
42,1.006
43,-0.042112000000000004
44,-0.79077
45,0.25735
46,0.70654
47,-0.79077
48,-0.79077
49,1.7547
50,-0.79077
51,-0.79077
52,1.7547
53,-0.79077
54,-0.79077
55,1.4552
56,-0.4913
57,-0.79077
58,0.70654
59,0.25735
60,-0.79077
61,-0.19184
62,1.3055
63,-0.79077
64,-0.79077
65,1.9044
66,-0.79077
67,-0.79077
68,1.3055
69,-0.19184
70,-0.79077
71,1.6049
72,-0.79077
73,-0.79077
74,2.0541
75,-0.79077
76,-0.79077
77,1.3055
78,-0.19184
79,-0.79077
80,0.40708
81,0.8562700000000001
82,-0.79077
83,-0.79077
84,1.9044
85,-0.79077
86,-0.79077
87,1.9044
88,-0.79077
89,-0.79077
90,1.7547
91,-0.4913
92,-0.79077
93,1.6049
94,-0.34157
95,-0.79077
