time,value
0,-0.55476
1,-0.74361
2,-0.55476
3,-0.74361
4,-0.74361
5,-0.74361
6,-0.74361
7,-0.74361
8,-0.74361
9,-0.74361
10,-0.74361
11,-0.74361
12,-0.74361
13,-0.74361
14,-0.74361
15,-0.74361
16,-0.74361
17,-0.74361
18,-0.74361
19,-0.74361
20,-0.74361
21,-0.74361
22,-0.74361
23,-0.74361
24,-0.74361
25,-0.74361
26,-0.74361
27,1.1449
28,1.7115
29,1.5226
30,1.5226
31,1.3338
32,1.1449
33,1.5226
34,1.5226
35,-0.3659
36,-0.74361
37,-0.55476
38,-0.74361
39,-0.74361
40,-0.74361
41,-0.55476
42,-0.74361
43,-0.74361
44,-0.9324600000000001
45,-1.6879
46,-1.6879
47,-1.1213
48,1.1449
49,1.1449
50,1.1449
51,1.1449
52,1.1449
53,1.1449
54,1.3338
55,1.1449
56,1.1449
57,1.1449
58,1.1449
59,1.1449
60,0.20065999999999998
61,-1.1213
62,-0.9324600000000001
63,-0.74361
64,1.3338
65,1.3338
66,1.3338
67,1.1449
68,1.3338
69,1.3338
70,1.3338
71,1.3338
72,0.57836
73,-0.55476
74,-0.74361
75,-0.55476
76,-0.74361
77,-0.55476
78,-0.74361
79,0.20065999999999998
80,1.5226
81,1.5226
82,1.5226
83,1.5226
84,1.3338
85,0.57836
86,-0.74361
87,-0.74361
88,-0.74361
89,-0.55476
90,-0.74361
91,-0.74361
92,-0.74361
93,-0.74361
94,-0.55476
95,-0.74361
