time,value
0,3.2337
1,1.3072
2,-0.44423
3,-0.5318
4,-0.44423
5,-0.44423
6,-0.44423
7,-0.093955
8,-0.0063853
9,-0.093955
10,-0.093955
11,-0.093955
12,-0.093955
13,-0.18152000000000001
14,-0.093955
15,-0.093955
16,-0.35666
17,-0.44423
18,-0.5318
19,-0.44423
20,-0.44423
21,-0.44423
22,-0.5318
23,-0.44423
24,-0.44423
25,-0.44423
26,-0.5318
27,-0.44423
28,2.0077
29,2.8834
30,2.7958
31,2.7958
32,2.7083
33,2.7958
34,2.7958
35,2.7958
36,2.971
37,1.3947
38,-0.44423
39,-0.44423
40,-0.5318
41,-0.44423
42,-0.44423
43,-0.44423
44,-0.5318
45,-0.44423
46,-0.44423
47,-0.44423
48,-0.5318
49,-0.44423
50,-0.44423
51,-0.44423
52,-0.35666
53,-0.5318
54,-0.44423
55,-0.44423
56,-0.44423
57,-0.5318
58,-0.44423
59,-0.44423
60,-0.44423
61,-0.5318
62,-0.44423
63,-0.44423
64,-0.44423
65,-0.5318
66,-0.44423
67,-0.44423
68,-0.5318
69,-0.44423
70,-0.44423
71,-0.44423
72,-0.5318
73,-0.44423
74,-0.44423
75,-0.26909
76,-0.093955
77,-0.093955
78,-0.18152000000000001
79,-0.093955
80,-0.093955
81,-0.093955
82,-0.18152000000000001
83,-0.093955
84,-0.093955
85,-0.18152000000000001
86,-0.093955
87,-0.093955
88,-0.093955
89,-0.18152000000000001
90,-0.35666
91,-0.5318
92,-0.44423
93,-0.44423
94,-0.44423
95,-0.5318
