time,value
0,-0.15799000000000002
1,-0.24656999999999998
2,-0.28745
3,-0.34196
4,-0.32833
5,-0.28063
6,-0.26700999999999997
7,-0.32151
8,-0.33514
9,-0.32151
10,-0.23294
11,-0.20568000000000003
12,-0.23294
13,-0.32151
14,-0.33514
15,-0.34196
16,-0.32833
17,-0.29425999999999997
18,-0.25338
19,-0.32151
20,-0.23975
21,-0.26019000000000003
22,-0.28745
23,-0.32151
24,-0.24656999999999998
25,-0.30107
26,-0.34196
27,-0.33514
28,-0.32151
29,-0.32151
30,-0.17162
31,0.59832
32,-0.26700999999999997
33,-0.24656999999999998
34,-0.32833
35,-0.23975
36,-0.18524000000000002
37,-0.23294
38,-0.28745
39,-0.26700999999999997
40,-0.25338
41,-0.25338
42,-0.23975
43,-0.28063
44,-0.32151
45,3.2011
46,3.535
47,4.8772
48,-0.042158999999999995
49,-0.21930999999999998
50,-0.23975
51,-0.29425999999999997
52,-0.26700999999999997
53,-0.26019000000000003
54,-0.34876999999999997
55,-0.34196
56,-0.32833
57,-0.26700999999999997
58,2.5538
59,3.7257
60,4.5842
61,0.12137
62,-0.22612
63,0.28489000000000003
64,-0.20568000000000003
65,-0.32151
66,-0.32833
67,-0.27382
68,-0.24656999999999998
69,-0.17162
70,-0.19205999999999998
71,-0.3147
72,-0.2125
73,-0.2125
74,-0.21930999999999998
75,-0.19205999999999998
76,-0.24656999999999998
77,-0.26700999999999997
78,-0.21930999999999998
79,-0.24656999999999998
80,-0.25338
81,-0.17843
82,-0.29425999999999997
83,-0.34196
84,-0.33514
85,-0.32833
86,-0.32833
87,-0.26019000000000003
88,-0.27382
89,-0.23975
90,-0.24656999999999998
91,-0.23975
92,-0.28745
93,-0.24656999999999998
94,-0.27382
95,-0.34196
