time,value
0,-0.17471
1,-0.17471
2,-0.17471
3,-0.17471
4,-0.17471
5,-0.17471
6,-0.17471
7,-0.17471
8,-0.17471
9,-0.17471
10,-0.17471
11,-0.17471
12,-0.17471
13,-0.17471
14,-0.17471
15,-0.17471
16,-0.17471
17,-0.17471
18,-0.17471
19,-0.17471
20,-0.17471
21,-0.17471
22,-0.17471
23,-0.17471
24,-0.17471
25,6.3768
26,3.7562
27,-0.17471
28,-0.17471
29,-0.17471
30,-0.17471
31,-0.17471
32,-0.17471
33,-0.17471
34,-0.17471
35,-0.17471
36,-0.17471
37,-0.17471
38,-0.17471
39,-0.17471
40,-0.17471
41,-0.17471
42,-0.17471
43,-0.17471
44,-0.17471
45,-0.17471
46,-0.17471
47,-0.17471
48,-0.17471
49,-0.17471
50,6.1147
51,-0.17471
52,-0.17471
53,-0.17471
54,-0.17471
55,-0.17471
56,-0.17471
57,-0.17471
58,-0.17471
59,-0.17471
60,-0.17471
61,-0.17471
62,-0.17471
63,-0.17471
64,-0.17471
65,-0.17471
66,-0.17471
67,-0.17471
68,-0.17471
69,-0.17471
70,-0.17471
71,-0.17471
72,-0.17471
73,-0.17471
74,-0.17471
75,-0.17471
76,-0.17471
77,-0.17471
78,-0.17471
79,-0.17471
80,-0.17471
81,-0.17471
82,-0.17471
83,-0.17471
84,-0.17471
85,-0.17471
86,-0.17471
87,-0.17471
88,-0.17471
89,-0.17471
90,-0.17471
91,-0.17471
92,-0.17471
93,-0.17471
94,-0.17471
95,-0.17471
