time,value
0,-0.5989
1,-0.5989
2,-0.5989
3,-0.5989
4,-0.5989
5,-0.5989
6,-0.5989
7,-0.5989
8,-0.5989
9,-0.5989
10,-0.5989
11,0.18334
12,0.18334
13,0.31371
14,0.18334
15,0.31371
16,0.18334
17,-0.5989
18,-0.5989
19,-0.5989
20,-0.20778000000000002
21,-0.5989
22,-0.5989
23,-0.5989
24,-0.5989
25,-0.5989
26,-0.5989
27,-0.5989
28,-0.5989
29,-0.5989
30,-0.5989
31,-0.5989
32,-0.5989
33,-0.5989
34,-0.5989
35,-0.5989
36,-0.5989
37,-0.5989
38,-0.5989
39,-0.5989
40,-0.077409
41,-0.5989
42,-0.5989
43,-0.5989
44,-0.33816
45,0.7048300000000001
46,-0.5989
47,-0.5989
48,-0.5989
49,-0.5989
50,-0.5989
51,-0.5989
52,-0.5989
53,-0.5989
54,-0.5989
55,-0.5989
56,-0.20778000000000002
57,-0.5989
58,-0.5989
59,-0.077409
60,0.31371
61,0.18334
62,0.31371
63,0.18334
64,0.31371
65,0.18334
66,0.31371
67,0.18334
68,0.052964
69,-0.5989
70,-0.5989
71,-0.5989
72,0.18334
73,2.1389
74,2.3997
75,2.5301
76,2.3997
77,0.44408000000000003
78,-0.5989
79,-0.5989
80,-0.5989
81,-0.5989
82,-0.5989
83,-0.5989
84,-0.5989
85,2.0086
86,2.5301
87,2.5301
88,2.5301
89,2.3997
90,2.5301
91,2.5301
92,2.3997
93,1.4871
94,0.18334
95,0.31371
