time,value
0,-0.32189
1,-0.32189
2,-0.32189
3,-0.32189
4,-0.32189
5,-0.32189
6,-0.32189
7,-0.32189
8,-0.32189
9,-0.32189
10,-0.32189
11,-0.32189
12,-0.32189
13,-0.32189
14,-0.32189
15,-0.32189
16,-0.32189
17,-0.32189
18,-0.32189
19,-0.32189
20,-0.32189
21,-0.32189
22,-0.32189
23,-0.32189
24,-0.32189
25,-0.32189
26,-0.32189
27,-0.32189
28,-0.32189
29,-0.32189
30,-0.32189
31,-0.32189
32,-0.32189
33,-0.32189
34,-0.32189
35,-0.32189
36,-0.32189
37,-0.32189
38,-0.32189
39,-0.32189
40,0.89684
41,2.9918
42,1.9645
43,2.8609
44,-0.14059000000000002
45,-0.15066
46,0.34287
47,4.3113
48,-0.32189
49,-0.32189
50,-0.32189
51,-0.32189
52,-0.32189
53,-0.32189
54,-0.32189
55,-0.32189
56,-0.32189
57,-0.32189
58,-0.32189
59,-0.32189
60,-0.32189
61,-0.32189
62,-0.32189
63,-0.32189
64,-0.32189
65,-0.32189
66,-0.32189
67,-0.32189
68,-0.32189
69,-0.32189
70,-0.32189
71,-0.32189
72,-0.32189
73,-0.32189
74,-0.32189
75,-0.32189
76,-0.32189
77,-0.32189
78,-0.32189
79,-0.32189
80,-0.22116999999999998
81,3.0422
82,2.6292
83,2.9113
84,-0.13052
85,-0.15066
86,-0.18087999999999999
87,4.6336
88,-0.18087999999999999
89,-0.32189
90,-0.32189
91,-0.32189
92,-0.32189
93,-0.32189
94,-0.32189
95,-0.32189
