time,value
0,-0.17961
1,-0.17961
2,-0.17961
3,-0.17961
4,-0.17961
5,-0.17961
6,-0.17961
7,-0.17961
8,-0.17961
9,-0.17961
10,-0.17961
11,-0.17961
12,-0.17961
13,-0.17961
14,-0.17961
15,-0.17961
16,-0.17961
17,-0.17961
18,-0.17961
19,-0.17961
20,-0.17961
21,-0.17961
22,-0.17961
23,-0.17961
24,-0.17961
25,-0.17961
26,-0.17961
27,-0.17961
28,-0.17961
29,-0.17961
30,-0.17961
31,-0.17961
32,-0.17961
33,-0.17961
34,-0.17961
35,-0.17961
36,-0.17961
37,-0.17961
38,-0.17961
39,-0.17961
40,-0.17961
41,-0.17961
42,-0.17961
43,-0.17961
44,-0.17961
45,-0.17961
46,-0.17961
47,7.9278
48,0.49043000000000003
49,0.22241
50,-0.17961
51,-0.17961
52,-0.17961
53,-0.17961
54,-0.17961
55,-0.17961
56,-0.17961
57,-0.17961
58,-0.17961
59,-0.17961
60,-0.17961
61,-0.17961
62,-0.17961
63,-0.17961
64,-0.17961
65,-0.17961
66,-0.17961
67,-0.17961
68,-0.17961
69,-0.17961
70,-0.17961
71,-0.17961
72,-0.17961
73,-0.17961
74,-0.17961
75,-0.17961
76,1.6965
77,5.0467
78,0.78078
79,-0.17961
80,-0.17961
81,-0.17961
82,-0.17961
83,-0.17961
84,-0.17961
85,-0.17961
86,-0.17961
87,-0.17961
88,-0.17961
89,-0.17961
90,-0.17961
91,-0.17961
92,-0.17961
93,-0.17961
94,-0.17961
95,-0.17961
