time,value
0,-0.35864
1,-0.35864
2,-0.33166999999999996
3,-0.35864
4,-0.35504
5,-0.33347
6,-0.36223
7,-0.35145
8,-0.33886
9,-0.35684
10,-0.34785
11,-0.34785
12,-0.35864
13,-0.34785
14,-0.34965
15,-0.36043000000000003
16,-0.34785
17,-0.35684
18,-0.36403
19,-0.33526999999999996
20,-0.35504
21,-0.36403
22,-0.33166999999999996
23,-0.35864
24,-0.35864
25,-0.33526999999999996
26,-0.35324
27,-0.35684
28,-0.33526999999999996
29,-0.35684
30,-0.35324
31,-0.33707
32,-0.35864
33,-0.34965
34,-0.33526999999999996
35,-0.36043000000000003
36,-0.35324
37,-0.33347
38,-0.36223
39,-0.34965
40,-0.33707
41,-0.34785
42,-0.34426
43,-0.33707
44,-0.35684
45,-0.34605
46,0.78637
47,3.7504
48,2.5371
49,-0.29393
50,-0.32269000000000003
51,-0.32089
52,-0.33707
53,-0.34785
54,-0.32269000000000003
55,-0.34426
56,-0.34965
57,-0.32448
58,-0.35145
59,-0.35145
60,-0.32448
61,-0.34965
62,-0.33166999999999996
63,-0.34246
64,-0.34785
65,-0.32988
66,-0.34246
67,-0.34246
68,-0.33886
69,-0.34246
70,-0.36043000000000003
71,-0.34246
72,-0.33886
73,-0.35324
74,3.2399
75,2.9829
76,2.9523
77,2.8966
78,2.9919
79,2.8822
80,2.8786
81,1.3292
82,-0.32628
83,-0.3155
84,-0.31909
85,-0.34605
86,-0.32448
87,-0.32988
88,-0.35324
89,-0.33707
90,-0.33886
91,-0.34605
92,-0.32628
93,-0.33347
94,-0.35504
95,-0.33347
