time,value
0,-2.2497
1,-2.2497
2,-2.2523
3,-2.2523
4,-2.2523
5,-2.2601
6,-2.2705
7,-2.2705
8,-2.2705
9,-2.2703
10,-2.2701
11,-2.2697
12,-2.2692
13,-2.2686
14,-2.2705
15,-2.2696
16,-2.2683
17,-2.2672
18,-2.266
19,-2.2647
20,-2.2633
21,-2.2643
22,-2.2694
23,-2.2764
24,-2.2784
25,-2.2766
26,-2.2741
27,-2.2721
28,-2.27
29,-2.2677
30,-2.2654
31,-2.263
32,-2.2604
33,-2.2578
34,-2.2575
35,-2.2546
36,-2.2507
37,-2.2476
38,-2.2444
39,-2.2412
40,-2.2379
41,-2.2344
42,-2.2379
43,-2.2436
44,-2.2458
45,-2.2421
46,-2.2383
47,-2.2331
48,-2.2291
49,-2.225
50,-2.2208
51,-2.2166
52,-2.2123
53,-2.2101
54,-2.2056
55,-2.2011
56,-2.1965
57,-2.1903
58,-2.1856
59,-2.1808
60,-2.1759
61,-2.173
62,-2.177
63,-2.1813
64,-2.1799
65,-2.1747
66,-2.1695
67,-2.1625
68,-2.1572
69,-2.1519
70,-2.1464
71,-2.1428
72,-2.1373
73,-2.1317
74,-2.1261
75,-2.1205
76,-2.1148
77,-2.1071
78,-2.1013
79,-2.1028
80,-2.106
81,-2.1054
82,-2.0994
83,-2.0934
84,-2.0874
85,-2.0813
86,-2.0752
87,-2.0706
88,-2.0624
89,-2.0561
90,-2.0499
91,-2.0436
92,-2.0373
93,-2.0309
94,-2.0288
95,-2.0288
96,-2.0239
97,-2.0211
98,-2.0204
99,-2.0154
100,-2.0104
101,-2.0074
102,-2.0066
103,-2.0044
104,-2.0001
105,-1.9935
106,-1.9868
107,-1.9816
108,-1.9727
109,-1.966
110,-1.9593
111,-1.9574
112,-1.9589
113,-1.9592
114,-1.9524
115,-1.9455
116,-1.9387
117,-1.9318
118,-1.9249
119,-1.9157
120,-1.91
121,-1.903
122,-1.8961
123,-1.8891
124,-1.8821
125,-1.8762
126,-1.875
127,-1.876
128,-1.8758
129,-1.8664
130,-1.8593
131,-1.8522
132,-1.845
133,-1.8379
134,-1.8308
135,-1.8236
136,-1.8165
137,-1.8093
138,-1.8021
139,-1.7925
140,-1.7853
141,-1.7781
142,-1.7709
143,-1.7656
144,-1.7626
145,-1.7568
146,-1.7496
147,-1.7424
148,-1.7352
149,-1.7256
150,-1.7184
151,-1.7102
152,-1.703
153,-1.6957
154,-1.6885
155,-1.6812
156,-1.6740000000000002
157,-1.6667
158,-1.6615
159,-1.6562
160,-1.6480000000000001
161,-1.6408
162,-1.6335
163,-1.6263
164,-1.6181
165,-1.6108
166,-1.6035
167,-1.5983
168,-1.5931
169,-1.5873
170,-1.5776
171,-1.5704
172,-1.5631
173,-1.5558
174,-1.5476
175,-1.5404
176,-1.5355
177,-1.5327
178,-1.5275
179,-1.5217
180,-1.5119999999999998
181,-1.5048
182,-1.4975
183,-1.4902
184,-1.482
185,-1.4747
186,-1.4675
187,-1.4602
188,-1.4529
189,-1.4495
190,-1.4434
191,-1.4392
192,-1.4319
193,-1.4246
194,-1.4173
195,-1.4091
196,-1.4018
197,-1.3945
198,-1.3872
199,-1.383
200,-1.3778
201,-1.3711
202,-1.3639
203,-1.3557
204,-1.3484
205,-1.3411
206,-1.3368
207,-1.3316
208,-1.3249
209,-1.3177
210,-1.3104
211,-1.2998
212,-1.2925
213,-1.2882
214,-1.2854
215,-1.2787
216,-1.2715
217,-1.2642
218,-1.256
219,-1.2487
220,-1.2444
221,-1.2383
222,-1.2325
223,-1.2252
224,-1.218
225,-1.2098
226,-1.2025
227,-1.1952
228,-1.188
229,-1.1807
230,-1.1755
231,-1.1717
232,-1.1645
233,-1.1572
234,-1.1499
235,-1.1427
236,-1.1345
237,-1.1272
238,-1.1199
239,-1.1151
240,-1.1108
241,-1.1079999999999999
242,-1.1013
243,-1.094
244,-1.0868
245,-1.0786
246,-1.0713
247,-1.064
248,-1.0567
249,-1.0494
250,-1.0467
251,-1.0415
252,-1.0309
253,-1.0236
254,-1.0163
255,-1.0090000000000001
256,-1.0017
257,-0.99354
258,-0.98625
259,-0.97895
260,-0.97165
261,-0.96345
262,-0.95739
263,-0.9531299999999999
264,-0.94584
265,-0.93855
266,-0.93035
267,-0.92305
268,-0.9172799999999999
269,-0.91212
270,-0.9093600000000001
271,-0.9020799999999999
272,-0.8923700000000001
273,-0.88508
274,-0.87779
275,-0.8705
276,-0.8632
277,-0.855
278,-0.8476899999999999
279,-0.84039
280,-0.8330799999999999
281,-0.82576
282,-0.81845
283,-0.81179
284,-0.80667
285,-0.8024399999999999
286,-0.79514
287,-0.78783
288,-0.78052
289,-0.7732100000000001
290,-0.765
291,-0.75768
292,-0.75036
293,-0.74526
294,-0.7401399999999999
295,-0.7319399999999999
296,-0.72463
297,-0.71732
298,-0.71001
299,-0.7026899999999999
300,-0.6953699999999999
301,-0.68804
302,-0.68071
303,-0.67094
304,-0.6636
305,-0.6562600000000001
306,-0.6489199999999999
307,-0.64158
308,-0.6342300000000001
309,-0.62602
310,-0.6186699999999999
311,-0.61131
312,-0.60396
313,-0.59414
314,-0.58678
315,-0.5826399999999999
316,-0.57763
317,-0.57347
318,-0.56612
319,-0.55877
320,-0.55056
321,-0.5432
322,-0.53745
323,-0.5324300000000001
324,-0.5274
325,-0.5200600000000001
326,-0.51271
327,-0.50536
328,-0.49801000000000006
329,-0.49065
330,-0.4833
331,-0.47594
332,-0.46773000000000003
333,-0.46036000000000005
334,-0.45053999999999994
335,-0.44317
336,-0.4358
337,-0.43251000000000006
338,-0.42753
339,-0.42253999999999997
340,-0.41763999999999996
341,-0.41026999999999997
342,-0.40291
343,-0.39554
344,-0.38572
345,-0.37834
346,-0.37096999999999997
347,-0.36359
348,-0.35620999999999997
349,-0.34883000000000003
350,-0.34062
351,-0.33323
352,-0.32584
353,-0.31845
354,-0.31106
355,-0.3012
356,-0.2938
357,-0.28725
358,-0.28234000000000004
359,-0.27578
360,-0.26839
361,-0.26018
362,-0.25279
363,-0.2454
364,-0.2413
365,-0.23555
366,-0.22734000000000001
367,-0.21996
368,-0.21256999999999998
369,-0.20437
370,-0.19698
371,-0.18959
372,-0.1822
373,-0.17645
374,-0.17399
375,-0.1666
376,-0.15839
377,-0.15100999999999998
378,-0.14852
379,-0.14355
380,-0.1378
381,-0.13043
382,-0.12305999999999999
383,-0.11485999999999999
384,-0.10747999999999999
385,-0.10167999999999999
386,-0.094238
387,-0.086874
388,-0.078667
389,-0.074522
390,-0.07197
391,-0.0694
392,-0.065227
393,-0.065227
394,-0.060330999999999996
395,-0.052124000000000004
396,-0.041469
397,-0.033261
398,-0.025054
399,-0.021745
400,-0.019296999999999998
401,-0.014399
402,-0.0070509
403,-0.0045999
404,-0.0045999
405,0.0036071
406,0.013408000000000002
407,0.020761
408,0.02812
409,0.034726
410,0.039741000000000005
411,0.043912
412,0.051258000000000005
413,0.05860599999999999
414,0.066813
415,0.074164
416,0.080778
417,0.08580800000000001
418,0.092432
419,0.10064
420,0.1064
421,0.11145
422,0.11652
423,0.12472000000000001
424,0.13205
425,0.13469
426,0.13823
427,0.14334000000000002
428,0.14603
429,0.1518
430,0.16
431,0.16731
432,0.17461
433,0.18192
434,0.18924000000000002
435,0.19744
436,0.20476
437,0.21450999999999998
438,0.22183000000000003
439,0.22915
440,0.23648000000000002
441,0.2438
442,0.24889
443,0.25154
444,0.25731
445,0.26463000000000003
446,0.27195
447,0.28171
448,0.28991999999999996
449,0.29724
450,0.30457
451,0.31033
452,0.31540999999999997
453,0.31806999999999996
454,0.32539
455,0.33271
456,0.34091
457,0.35068
458,0.358
459,0.36533000000000004
460,0.37266
461,0.38018
462,0.38283
463,0.39103000000000004
464,0.39835
465,0.40568000000000004
466,0.41388
467,0.42208
468,0.42718
469,0.42985
470,0.43716000000000005
471,0.44447
472,0.45178999999999997
473,0.45911
474,0.46731999999999996
475,0.47463999999999995
476,0.48197
477,0.48773
478,0.49371000000000004
479,0.50036
480,0.50768
481,0.51588
482,0.5232
483,0.53052
484,0.53473
485,0.53984
486,0.5465
487,0.55381
488,0.5635600000000001
489,0.57088
490,0.5782
491,0.5855199999999999
492,0.5928399999999999
493,0.60017
494,0.60837
495,0.6157
496,0.62303
497,0.63036
498,0.6401399999999999
499,0.64748
500,0.65482
501,0.659
502,0.66406
503,0.6682600000000001
504,0.6755899999999999
505,0.68292
506,0.69025
507,0.6975899999999999
508,0.7073699999999999
509,0.7147100000000001
510,0.72205
511,0.7294
512,0.73674
513,0.7440899999999999
514,0.75144
515,0.75879
516,0.76369
517,0.76359
518,0.76351
519,0.7692
520,0.7692
521,0.76669
522,0.7642
523,0.76173
524,0.75927
525,0.75683
526,0.75521
527,0.7544
528,0.747
529,0.74131
530,0.7389100000000001
531,0.7307
532,0.72329
533,0.71843
534,0.71358
535,0.70785
536,0.70043
537,0.69302
538,0.6856
539,0.67492
540,0.66751
541,0.6601
542,0.65357
543,0.64871
544,0.6421899999999999
545,0.63477
546,0.62657
547,0.61915
548,0.61173
549,0.6068899999999999
550,0.60206
551,0.59632
552,0.5889
553,0.58148
554,0.57406
555,0.5666399999999999
556,0.55923
557,0.55181
558,0.5444
559,0.53698
560,0.5271
561,0.5197
562,0.5122899999999999
563,0.50489
564,0.49995
565,0.49748000000000003
566,0.49173999999999995
567,0.48433999999999994
568,0.48433999999999994
569,0.48433999999999994
570,0.48273
571,0.48033000000000003
572,0.47794
573,0.47557
574,0.47073999999999994
575,0.4684
576,0.46608
577,0.46378
578,0.45633999999999997
579,0.44813000000000003
580,0.44011999999999996
581,0.43536
582,0.4304
583,0.42295
584,0.41473999999999994
585,0.40729
586,0.39985
587,0.39509
588,0.39283
589,0.38711
590,0.37966
591,0.36972
592,0.36152
593,0.35406
594,0.34661
595,0.33916999999999997
596,0.33344
597,0.33118000000000003
598,0.32644
599,0.31899
600,0.31078
601,0.30357
602,0.30135
603,0.29315
604,0.28494
605,0.28098
606,0.2763
607,0.27235
608,0.26415
609,0.25667
610,0.25201
611,0.24914
612,0.24165
613,0.23417
614,0.22596999999999998
615,0.21848
616,0.21100000000000002
617,0.20956999999999998
618,0.20493000000000003
619,0.20281
620,0.20071
621,0.19543
622,0.19043
623,0.18292
624,0.17473
625,0.16722
626,0.15972
627,0.15764
628,0.15308
629,0.14488
630,0.13668
631,0.13214
632,0.12694
633,0.11942
634,0.1119
635,0.10438
636,0.096183
637,0.088663
638,0.08114600000000001
639,0.073629
640,0.06794
641,0.063408
642,0.056384000000000004
643,0.048859
644,0.041333999999999996
645,0.033143
646,0.02562
647,0.022441
648,0.017932
649,0.014098
650,0.0084171
651,0.00088709
652,-0.0091529
653,-0.016681
654,-0.024872
655,-0.0324
656,-0.039924
657,-0.043099
658,-0.0476
659,-0.052082
660,-0.057104999999999996
661,-0.065294
662,-0.069761
663,-0.074213
664,-0.082399
665,-0.090586
666,-0.093101
667,-0.09561599999999999
668,-0.10128999999999999
669,-0.10947
670,-0.11765999999999999
671,-0.12080999999999999
672,-0.12397000000000001
673,-0.12964
674,-0.13782
675,-0.13782
676,-0.14034000000000002
677,-0.14789000000000002
678,-0.15607000000000001
679,-0.16362000000000002
680,-0.17117000000000002
681,-0.17872000000000002
682,-0.18315
683,-0.18819
684,-0.19637000000000002
685,-0.20455
686,-0.20642
687,-0.21078000000000002
688,-0.2126
689,-0.2144
690,-0.22065
691,-0.22882
692,-0.23446999999999998
693,-0.23934
694,-0.24555
695,-0.25372
696,-0.25878
697,-0.26050999999999996
698,-0.2622
699,-0.26276
700,-0.26332
701,-0.26498
702,-0.26608000000000004
703,-0.26608000000000004
704,-0.26608000000000004
705,-0.259
706,-0.25139
707,-0.24885
708,-0.24631
709,-0.24377
710,-0.23615
711,-0.23360999999999998
712,-0.23106999999999997
713,-0.22853
714,-0.21836999999999998
715,-0.21075
716,-0.20312
717,-0.1955
718,-0.18788
719,-0.18025
720,-0.17262
721,-0.16499
722,-0.15737
723,-0.14974
724,-0.13956
725,-0.13193
726,-0.12735
727,-0.12633
728,-0.12528
729,-0.11764000000000001
730,-0.10999
731,-0.10235
732,-0.095191
733,-0.087541
734,-0.077343
735,-0.070654
736,-0.069525
737,-0.06790800000000001
738,-0.060248
739,-0.052586
740,-0.044924
741,-0.037261
742,-0.029595999999999997
743,-0.021931
744,-0.011712
745,-0.0040479
746,0.0036201000000000002
747,0.011287
748,0.018955
749,0.026625
750,0.034292
751,0.041963
752,0.045872
753,0.049799
754,0.05536900000000001
755,0.06604700000000001
756,0.07255199999999999
757,0.076521
758,0.079547
759,0.087202
760,0.094856
761,0.10250999999999999
762,0.11017
763,0.11782999999999999
764,0.12596
765,0.13617
766,0.14382999999999999
767,0.15149
768,0.15498
769,0.15895
770,0.16501
771,0.17267000000000002
772,0.18032
773,0.18845
774,0.1961
775,0.2001
776,0.20410999999999999
777,0.2097
778,0.21735
779,0.22499
780,0.23313000000000003
781,0.24078000000000002
782,0.24841999999999997
783,0.25606999999999996
784,0.26371999999999995
785,0.26823
786,0.27226999999999996
787,0.27991
788,0.28755
789,0.29519
790,0.30333000000000004
791,0.31098000000000003
792,0.31861999999999996
793,0.32626
794,0.32981
795,0.33385
796,0.3425
797,0.35013
798,0.35777
799,0.36541
800,0.37355
801,0.3812
802,0.38883
803,0.39443
804,0.39849
805,0.40257
806,0.41273999999999994
807,0.42038000000000003
808,0.42801000000000006
809,0.43616000000000005
810,0.44378999999999996
811,0.45143
812,0.45907
813,0.46671
814,0.47434
815,0.47994
816,0.48452
817,0.48808999999999997
818,0.49573
819,0.50336
820,0.5109899999999999
821,0.5191399999999999
822,0.52677
823,0.53441
824,0.54204
825,0.5496800000000001
826,0.5573100000000001
827,0.56597
828,0.57005
829,0.57363
830,0.58125
831,0.5888899999999999
832,0.5970300000000001
833,0.6046600000000001
834,0.61027
835,0.61437
836,0.61849
837,0.62611
838,0.63374
839,0.64136
840,0.64899
841,0.65662
842,0.66425
843,0.67188
844,0.6795100000000001
845,0.68714
846,0.69529
847,0.7054600000000001
848,0.71309
849,0.72072
850,0.72835
851,0.7359899999999999
852,0.74362
853,0.75126
854,0.7568600000000001
855,0.76094
856,0.7650399999999999
857,0.7752100000000001
858,0.78284
859,0.79047
860,0.7981
861,0.8057300000000001
862,0.8133699999999999
863,0.821
864,0.82915
865,0.83678
866,0.84441
867,0.85205
868,0.8622299999999999
869,0.8698600000000001
870,0.8775
871,0.8851399999999999
872,0.8927799999999999
873,0.9004200000000001
874,0.90296
875,0.90702
876,0.90856
877,0.9141600000000001
878,0.9243399999999999
879,0.9319700000000001
880,0.9396
881,0.94724
882,0.95539
883,0.9630200000000001
884,0.9706600000000001
885,0.97829
886,0.98593
887,0.99356
888,1.0038
889,1.0114
890,1.0190000000000001
891,1.0267
892,1.0302
893,1.0343
894,1.0379
895,1.0455
896,1.0531
897,1.0613
898,1.0714
899,1.075
900,1.0781
901,1.0806
902,1.0882
903,1.0959
904,1.1035
905,1.1112
906,1.1188
907,1.1218
908,1.1249
909,1.1305
910,1.1381
911,1.1458
912,1.1534
913,1.1585
914,1.161
915,1.1641
916,1.1717
917,1.1794
918,1.187
919,1.1972
920,1.2048
921,1.2125
922,1.2201
923,1.2277
924,1.2354
925,1.2429999999999999
926,1.2507
927,1.2583
928,1.2659
929,1.2665
930,1.2676
931,1.2753
932,1.2794
933,1.2805
934,1.2816
935,1.2868
936,1.2939
937,1.2981
938,1.2967
939,1.3035
940,1.3107
941,1.3154
942,1.314
943,1.3127
944,1.3114
945,1.3101
946,1.3088
947,1.3075
948,1.3063
949,1.305
950,1.3034
951,1.3022
952,1.2967
953,1.2886
954,1.2826
955,1.2815
956,1.2803
957,1.2766
958,1.2754
959,1.2699
960,1.2593
961,1.2556
962,1.2519
963,1.2438
964,1.2361
965,1.2284
966,1.2203
967,1.2126
968,1.2049
969,1.1972
970,1.1909999999999998
971,1.1873
972,1.1793
973,1.1712
974,1.1676
975,1.1639
976,1.1588
977,1.1507
978,1.143
979,1.1353
980,1.125
981,1.1169
982,1.1092
983,1.1015
984,1.0938
985,1.0861
986,1.0828
987,1.0792
988,1.0734
989,1.0657
990,1.0579
991,1.0476
992,1.0399
993,1.0322
994,1.0241
995,1.0164
996,1.0087
997,1.001
998,0.9974
999,0.9938100000000001
1000,0.9857600000000001
1001,0.97546
1002,0.9677399999999999
1003,0.95968
1004,0.95196
1005,0.94424
1006,0.93652
1007,0.93394
1008,0.93137
1009,0.9284600000000001
1010,0.9204
1011,0.9097799999999999
1012,0.9068700000000001
1013,0.90396
1014,0.9010600000000001
1015,0.8930100000000001
1016,0.89044
1017,0.88786
1018,0.8852899999999999
1019,0.87756
1020,0.86984
1021,0.8617799999999999
1022,0.8514799999999999
1023,0.84826
1024,0.8447100000000001
1025,0.83893
1026,0.8312
1027,0.82347
1028,0.8157399999999999
1029,0.80769
1030,0.79996
1031,0.7922399999999999
1032,0.78387
1033,0.78036
1034,0.77459
1035,0.76685
1036,0.75912
1037,0.75139
1038,0.74335
1039,0.7356199999999999
1040,0.7278899999999999
1041,0.72016
1042,0.7166600000000001
1043,0.71575
1044,0.70772
1045,0.69998
1046,0.69195
1047,0.6842199999999999
1048,0.67648
1049,0.6755899999999999
1050,0.67215
1051,0.6641199999999999
1052,0.6538
1053,0.6460600000000001
1054,0.63832
1055,0.6303
1056,0.62256
1057,0.61482
1058,0.6070800000000001
1059,0.59934
1060,0.59131
1061,0.5878800000000001
1062,0.5847399999999999
1063,0.57414
1064,0.56639
1065,0.55865
1066,0.55091
1067,0.5431699999999999
1068,0.5354300000000001
1069,0.52769
1070,0.51967
1071,0.5119199999999999
1072,0.5041800000000001
1073,0.49386
1074,0.48612
1075,0.4827
1076,0.48188000000000003
1077,0.47386999999999996
1078,0.46612
1079,0.45837
1080,0.45036000000000004
1081,0.44261999999999996
1082,0.43487
1083,0.42455
1084,0.42168999999999995
1085,0.41831
1086,0.41495
1087,0.4072
1088,0.39945
1089,0.3917
1090,0.38395999999999997
1091,0.37595
1092,0.3682
1093,0.35761
1094,0.35425999999999996
1095,0.35093
1096,0.34318000000000004
1097,0.33543
1098,0.32768
1099,0.31968
1100,0.31193000000000004
1101,0.30418
1102,0.29643
1103,0.29335
1104,0.28981
1105,0.2844
1106,0.27665
1107,0.26889
1108,0.26114
1109,0.25338
1110,0.24563000000000001
1111,0.23786999999999997
1112,0.23012
1113,0.22236
1114,0.21203000000000002
1115,0.20427
1116,0.19652
1117,0.18877
1118,0.18101
1119,0.17326
1120,0.16551
1121,0.15775
1122,0.14976
1123,0.14201
1124,0.13167
1125,0.12392
1126,0.11615999999999999
1127,0.10840999999999999
1128,0.10558
1129,0.10228
1130,0.10181
1131,0.093823
1132,0.08606799999999999
1133,0.078312
1134,0.06774
1135,0.059984
1136,0.052228
1137,0.044473
1138,0.041199
1139,0.03795
1140,0.032559
1141,0.0248
1142,0.017039
1143,0.0090631
1144,0.0013050999999999998
1145,-0.0019219
1146,-0.0051269
1147,-0.013290999999999999
1148,-0.021054
1149,-0.024229
1150,-0.024791999999999998
1151,-0.024975999999999998
1152,-0.025155
1153,-0.025334
1154,-0.025852999999999998
1155,-0.026022000000000003
1156,-0.026022000000000003
1157,-0.023597999999999997
1158,-0.015827
1159,-0.008054899999999999
1160,-0.0085379
1161,-0.0064039000000000006
1162,-0.0013719000000000001
1163,0.0064051
1164,0.014178999999999999
1165,0.024401
1166,0.032174
1167,0.039951
1168,0.047725
1169,0.052767999999999995
1170,0.054953999999999996
1171,0.05457000000000001
1172,0.062346000000000006
1173,0.070125
1174,0.07778
1175,0.088152
1176,0.095928
1177,0.10371
1178,0.11137000000000001
1179,0.11373
1180,0.11599000000000001
1181,0.12107000000000001
1182,0.12886
1183,0.13664
1184,0.14432
1185,0.1521
1186,0.15459
1187,0.15719
1188,0.16237000000000001
1189,0.17015
1190,0.17793
1191,0.18572
1192,0.19091
1193,0.1935
1194,0.19619
1195,0.20138
1196,0.21175
1197,0.21953000000000003
1198,0.22732
1199,0.2351
1200,0.24288
1201,0.25066
1202,0.25844
1203,0.26632
1204,0.2741
1205,0.28188
1206,0.29225999999999996
1207,0.30004000000000003
1208,0.30782
1209,0.3156
1210,0.32338
1211,0.33116999999999996
1212,0.33895
1213,0.34673000000000004
1214,0.35451
1215,0.36229
1216,0.37267
1217,0.37786
1218,0.37786
1219,0.38045
1220,0.38823
1221,0.39601
1222,0.40379
1223,0.40639000000000003
1224,0.40639000000000003
1225,0.41158
1226,0.41936
1227,0.42973
1228,0.43751
1229,0.4453
1230,0.45308000000000004
1231,0.46086000000000005
1232,0.46863999999999995
1233,0.47641999999999995
1234,0.48421000000000003
1235,0.49199
1236,0.49977
1237,0.51015
1238,0.51793
1239,0.52571
1240,0.5334899999999999
1241,0.54127
1242,0.54897
1243,0.55675
1244,0.56453
1245,0.57231
1246,0.5801
1247,0.5904699999999999
1248,0.59826
1249,0.6060399999999999
1250,0.61382
1251,0.62169
1252,0.62938
1253,0.63717
1254,0.64495
1255,0.65273
1256,0.66052
1257,0.6683
1258,0.6786800000000001
1259,0.6864600000000001
1260,0.69424
1261,0.70202
1262,0.70981
1263,0.71759
1264,0.72537
1265,0.73316
1266,0.7409399999999999
1267,0.7487199999999999
1268,0.7591
1269,0.76688
1270,0.77466
1271,0.78245
1272,0.79023
1273,0.79801
1274,0.80579
1275,0.81358
1276,0.8213600000000001
1277,0.82914
1278,0.83952
1279,0.84731
1280,0.85509
1281,0.86287
1282,0.87065
1283,0.87844
1284,0.8862200000000001
1285,0.894
1286,0.90179
1287,0.9095700000000001
1288,0.91995
1289,0.9223899999999999
1290,0.92476
1291,0.92722
1292,0.935
1293,0.94279
1294,0.95057
1295,0.95836
1296,0.96614
1297,0.97393
1298,0.9817100000000001
1299,0.9920899999999999
1300,0.99987
1301,1.0076
1302,1.0154
1303,1.0232
1304,1.0309
1305,1.0387
1306,1.0465
1307,1.0543
1308,1.0621
1309,1.0725
1310,1.0802
1311,1.088
1312,1.0958
1313,1.1036
1314,1.1114
1315,1.1192
1316,1.127
1317,1.1348
1318,1.1426
1319,1.153
1320,1.1608
1321,1.1685
1322,1.1763
1323,1.1841
1324,1.1919
1325,1.1997
1326,1.2075
1327,1.2077
1328,1.2131
1329,1.2235
1330,1.2313
1331,1.2391
1332,1.2469
1333,1.2546
1334,1.2624
1335,1.2702
1336,1.278
1337,1.2858
1338,1.2936
1339,1.3013
1340,1.3117
1341,1.3169
1342,1.3169
1343,1.3195
1344,1.3272
1345,1.3323
1346,1.3349
1347,1.3374
1348,1.3451
1349,1.3528
1350,1.358
1351,1.3606
1352,1.3657
1353,1.3735
1354,1.3813
1355,1.3891
1356,1.3969
1357,1.4047
1358,1.4124
1359,1.4202
1360,1.4306
1361,1.4384
1362,1.4461
1363,1.4539
1364,1.4617
1365,1.4615
1366,1.464
1367,1.4717
1368,1.4795
1369,1.4819
1370,1.4844
1371,1.4895
1372,1.4973
1373,1.5025
1374,1.5024
1375,1.5023
1376,1.5049
1377,1.5048
1378,1.5074
1379,1.5152
1380,1.5230000000000001
1381,1.5230000000000001
1382,1.5230000000000001
1383,1.5230000000000001
1384,1.5231
1385,1.5231
1386,1.5232
1387,1.5233
1388,1.5234
1389,1.5235
1390,1.5236
1391,1.5238
1392,1.5239
1393,1.5214
1394,1.5137
1395,1.5059
1396,1.5061
1397,1.5037
1398,1.5012
1399,1.4935
1400,1.4857
1401,1.486
1402,1.4837
1403,1.476
1404,1.4682
1405,1.4658
1406,1.4635
1407,1.4559
1408,1.4482
1409,1.4433
1410,1.4436
1411,1.4359
1412,1.4281
1413,1.4204
1414,1.4126
1415,1.4049
1416,1.3971
1417,1.3893
1418,1.3843
1419,1.382
1420,1.3797
1421,1.3719999999999999
1422,1.3617
1423,1.3539
1424,1.3461
1425,1.3383
1426,1.3305
1427,1.3228
1428,1.315
1429,1.3072
1430,1.2994
1431,1.2917
1432,1.2813
1433,1.2735
1434,1.2657
1435,1.258
1436,1.2502
1437,1.2424
1438,1.2346
1439,1.2268
1440,1.2191
1441,1.2114
1442,1.2009999999999998
1443,1.1933
1444,1.1855
1445,1.1777
1446,1.1699
1447,1.1622
1448,1.1544
1449,1.1466
1450,1.1388
1451,1.1311
1452,1.1207
1453,1.1129
1454,1.1051
1455,1.0974
1456,1.0896
1457,1.0818
1458,1.0739
1459,1.0661
1460,1.0583
1461,1.0506
1462,1.0428
1463,1.0324
1464,1.0246
1465,1.0169
1466,1.0091
1467,1.0015
1468,0.9936799999999999
1469,0.9859100000000001
1470,0.9781299999999999
1471,0.97035
1472,0.9625799999999999
1473,0.95221
1474,0.9499
1475,0.94775
1476,0.9454600000000001
1477,0.9376899999999999
1478,0.92991
1479,0.92214
1480,0.9143700000000001
1481,0.90659
1482,0.8988200000000001
1483,0.88861
1484,0.88084
1485,0.8730700000000001
1486,0.86529
1487,0.8575200000000001
1488,0.84975
1489,0.84198
1490,0.83421
1491,0.8264299999999999
1492,0.81866
1493,0.81089
1494,0.80053
1495,0.79275
1496,0.78498
1497,0.7772100000000001
1498,0.76944
1499,0.76167
1500,0.7539
1501,0.74612
1502,0.74387
1503,0.74127
1504,0.7335
1505,0.72573
1506,0.71796
1507,0.71019
1508,0.7024199999999999
1509,0.69724
1510,0.69724
1511,0.6943199999999999
1512,0.68655
1513,0.67877
1514,0.6684100000000001
1515,0.66064
1516,0.65287
1517,0.6451
1518,0.6373300000000001
1519,0.62939
1520,0.62162
1521,0.61385
1522,0.6060800000000001
1523,0.59848
1524,0.58812
1525,0.58035
1526,0.57258
1527,0.56481
1528,0.55704
1529,0.54927
1530,0.5415
1531,0.53632
1532,0.53373
1533,0.53132
1534,0.52372
1535,0.51373
1536,0.51132
1537,0.5089199999999999
1538,0.50393
1539,0.49616000000000005
1540,0.49616000000000005
1541,0.49358
1542,0.48581
1543,0.47803999999999996
1544,0.47028000000000003
1545,0.45992
1546,0.45216000000000006
1547,0.44438999999999995
1548,0.43663
1549,0.42886
1550,0.4211
1551,0.41333000000000003
1552,0.40557
1553,0.3978
1554,0.39004
1555,0.37969
1556,0.37192
1557,0.36416
1558,0.35639
1559,0.34863
1560,0.34087
1561,0.3331
1562,0.32534
1563,0.31756999999999996
1564,0.30981
1565,0.30424
1566,0.30107
1567,0.2981
1568,0.29033000000000003
1569,0.28256
1570,0.2748
1571,0.26703000000000005
1572,0.25927
1573,0.2515
1574,0.24373000000000003
1575,0.23578000000000002
1576,0.22541999999999998
1577,0.21766
1578,0.20989000000000002
1579,0.20213
1580,0.19435999999999998
1581,0.18659
1582,0.17864000000000002
1583,0.17808
1584,0.17495
1585,0.16977
1586,0.15941
1587,0.15164
1588,0.14387
1589,0.13610999999999998
1590,0.12834
1591,0.12057000000000001
1592,0.1128
1593,0.10503
1594,0.10004
1595,0.1006
1596,0.098789
1597,0.099399
1598,0.10003
1599,0.095069
1600,0.087311
1601,0.07977100000000001
1602,0.07201
1603,0.064251
1604,0.062338
1605,0.060449
1606,0.050345999999999995
1607,0.042593
1608,0.034839999999999996
1609,0.027327999999999998
1610,0.019575
1611,0.01699
1612,0.01699
1613,0.017483000000000002
1614,0.018239
1615,0.019017
1616,0.019814
1617,0.020359
1618,0.020359
1619,0.025522
1620,0.033264999999999996
1621,0.041007
1622,0.049025
1623,0.05676799999999999
1624,0.064513
1625,0.072256
1626,0.080002
1627,0.08570900000000001
1628,0.089125
1629,0.094854
1630,0.10288
1631,0.10862000000000001
1632,0.1095
1633,0.11299000000000001
1634,0.11391
1635,0.11485999999999999
1636,0.12032999999999999
1637,0.13063
1638,0.13835999999999998
1639,0.14609
1640,0.15382
1641,0.16155
1642,0.16927999999999999
1643,0.17701
1644,0.18474000000000002
1645,0.19278
1646,0.20051
1647,0.21081
1648,0.21854
1649,0.22628
1650,0.23401
1651,0.24174
1652,0.24946999999999997
1653,0.2572
1654,0.26493
1655,0.27266
1656,0.2804
1657,0.28813
1658,0.29844
1659,0.30617
1660,0.31390999999999997
1661,0.32164
1662,0.32937
1663,0.33710999999999997
1664,0.34484000000000004
1665,0.35258
1666,0.36061
1667,0.3641
1668,0.36761
1669,0.37534
1670,0.38306999999999997
1671,0.3908
1672,0.39853
1673,0.40626
1674,0.41398999999999997
1675,0.42203
1676,0.42977
1677,0.4375
1678,0.44781000000000004
1679,0.45553999999999994
1680,0.46326999999999996
1681,0.46935
1682,0.47029
1683,0.47576
1684,0.48349
1685,0.49122
1686,0.49895
1687,0.50668
1688,0.5173
1689,0.52503
1690,0.53275
1691,0.5404800000000001
1692,0.5482100000000001
1693,0.55174
1694,0.55528
1695,0.55818
1696,0.56591
1697,0.57363
1698,0.58136
1699,0.5916600000000001
1700,0.59939
1701,0.60711
1702,0.6148399999999999
1703,0.62257
1704,0.63062
1705,0.63834
1706,0.64607
1707,0.6538
1708,0.6615300000000001
1709,0.67183
1710,0.67956
1711,0.68729
1712,0.69502
1713,0.69823
1714,0.70177
1715,0.705
1716,0.71272
1717,0.72045
1718,0.72817
1719,0.7388
1720,0.74652
1721,0.75425
1722,0.7623
1723,0.7632899999999999
1724,0.7668699999999999
1725,0.7720100000000001
1726,0.77974
1727,0.78746
1728,0.79518
1729,0.8029
1730,0.8132
1731,0.82125
1732,0.8289799999999999
1733,0.8367
1734,0.8444200000000001
1735,0.85214
1736,0.85987
1737,0.86759
1738,0.86859
1739,0.87218
1740,0.8802399999999999
1741,0.8879600000000001
1742,0.8956799999999999
1743,0.9034
1744,0.91112
1745,0.91884
1746,0.92656
1747,0.9342799999999999
1748,0.94234
1749,0.9497200000000001
1750,0.9600200000000001
1751,0.9677399999999999
1752,0.9758
1753,0.9835200000000001
1754,0.99124
1755,0.9989600000000001
1756,1.0067
1757,1.0144
1758,1.0221
1759,1.0299
1760,1.035
1761,1.0379
1762,1.0456
1763,1.0511
1764,1.054
1765,1.0595
1766,1.0676
1767,1.0756
1768,1.0785
1769,1.0811
1770,1.0862
1771,1.0965
1772,1.1043
1773,1.112
1774,1.1197
1775,1.1274
1776,1.1355
1777,1.1432
1778,1.1509
1779,1.1586
1780,1.1664
1781,1.1767
1782,1.1822
1783,1.1832
1784,1.1868
1785,1.1945
1786,1.2022
1787,1.2103
1788,1.218
1789,1.226
1790,1.2271
1791,1.2307
1792,1.2384
1793,1.2461
1794,1.2538
1795,1.2619
1796,1.2696
1797,1.2773
1798,1.285
1799,1.288
1800,1.2916
1801,1.2930000000000001
1802,1.2967
1803,1.2978
1804,1.3033
1805,1.3114
1806,1.3143
1807,1.318
1808,1.3192
1809,1.3203
1810,1.3215
1811,1.3227
1812,1.3243
1813,1.3255
1814,1.3268
1815,1.328
1816,1.3293
1817,1.3306
1818,1.3319
1819,1.3332
1820,1.3345
1821,1.3358
1822,1.3376
1823,1.339
1824,1.3378
1825,1.3306
1826,1.3234
1827,1.3248
1828,1.3237
1829,1.3161
1830,1.3084
1831,1.3012
1832,1.291
1833,1.2869
1834,1.2858
1835,1.2843
1836,1.2771
1837,1.2695
1838,1.271
1839,1.27
1840,1.2654
1841,1.2578
1842,1.2476
1843,1.24
1844,1.2323
1845,1.2247
1846,1.2171
1847,1.2099
1848,1.2023
1849,1.1947
1850,1.1871
1851,1.1794
1852,1.1718
1853,1.1616
1854,1.1540000000000001
1855,1.1459
1856,1.1382
1857,1.1306
1858,1.123
1859,1.1154
1860,1.1083
1861,1.1001
1862,1.0925
1863,1.0824
1864,1.0747
1865,1.0671
1866,1.0595
1867,1.0519
1868,1.0443
1869,1.0366
1870,1.0290000000000001
1871,1.0234
1872,1.0209
1873,1.0183
1874,1.0107
1875,1.0026
1876,0.99441
1877,0.98625
1878,0.9831700000000001
1879,0.9826299999999999
1880,0.9770200000000001
1881,0.9694
1882,0.96178
1883,0.95924
1884,0.9567
1885,0.95163
1886,0.94401
1887,0.9364
1888,0.9287799999999999
1889,0.92117
1890,0.91301
1891,0.9054
1892,0.89779
1893,0.89018
1894,0.88003
1895,0.8724200000000001
1896,0.8648100000000001
1897,0.85721
1898,0.8496
1899,0.84199
1900,0.83495
1901,0.82678
1902,0.81918
1903,0.81157
1904,0.8014399999999999
1905,0.79384
1906,0.7862399999999999
1907,0.77864
1908,0.77104
1909,0.76344
1910,0.75584
1911,0.74825
1912,0.74065
1913,0.73305
1914,0.7229300000000001
1915,0.71534
1916,0.7077399999999999
1917,0.70015
1918,0.6925600000000001
1919,0.68497
1920,0.6773899999999999
1921,0.6698
1922,0.6622100000000001
1923,0.65462
1924,0.64704
1925,0.63693
1926,0.6301100000000001
1927,0.62836
1928,0.62019
1929,0.6126
1930,0.60501
1931,0.59742
1932,0.5898399999999999
1933,0.58225
1934,0.5746600000000001
1935,0.56396
1936,0.55638
1937,0.5488
1938,0.5412100000000001
1939,0.53363
1940,0.52605
1941,0.51847
1942,0.51089
1943,0.50836
1944,0.50271
1945,0.49261000000000005
1946,0.48949
1947,0.48889
1948,0.48072
1949,0.47253999999999996
1950,0.46437
1951,0.46125
1952,0.46125
1953,0.45366999999999996
1954,0.44609
1955,0.43598000000000003
1956,0.4284
1957,0.42081999999999997
1958,0.41325
1959,0.40567
1960,0.3981
1961,0.39052
1962,0.38295
1963,0.37538
1964,0.36780999999999997
1965,0.35963
1966,0.34953
1967,0.34197
1968,0.3344
1969,0.32683
1970,0.31926
1971,0.3117
1972,0.30414
1973,0.30162
1974,0.29909
1975,0.29405
1976,0.28525
1977,0.28212
1978,0.27898
1979,0.2708
1980,0.26261999999999996
1981,0.25695999999999997
1982,0.25444
1983,0.25444
1984,0.24686999999999998
1985,0.23931
1986,0.22921999999999998
1987,0.22166
1988,0.2141
1989,0.20654
1990,0.19835999999999998
1991,0.1908
1992,0.18324000000000001
1993,0.17568
1994,0.16813
1995,0.16057000000000002
1996,0.15553
1997,0.15302000000000002
1998,0.14545999999999998
1999,0.14043
2000,0.13790999999999998
2001,0.13727999999999999
2002,0.1291
2003,0.12090999999999999
2004,0.11273
2005,0.10454000000000001
2006,0.09698999999999999
2007,0.091954
2008,0.089437
2009,0.085655
2010,0.078102
2011,0.070551
2012,0.063
2013,0.055449
2014,0.047901
2015,0.040353
2016,0.032808
2017,0.022106
2018,0.014561000000000001
2019,0.007018099999999999
2020,-0.00052491
2021,-0.008065899999999999
2022,-0.015603
2023,-0.023141
2024,-0.030679
2025,-0.038214
2026,-0.045745999999999995
2027,-0.055789
2028,-0.063321
2029,-0.070849
2030,-0.078376
2031,-0.085903
2032,-0.093428
2033,-0.10095
2034,-0.10847000000000001
2035,-0.11599000000000001
2036,-0.12351
2037,-0.13352999999999998
2038,-0.14105
2039,-0.14787999999999998
2040,-0.15607000000000001
2041,-0.16289
2042,-0.1704
2043,-0.17790999999999998
2044,-0.18541
2045,-0.19291
2046,-0.20040999999999998
2047,-0.20790999999999998
2048,-0.21791
2049,-0.2254
2050,-0.23289
2051,-0.24038
2052,-0.24466
2053,-0.24500999999999998
2054,-0.24283000000000002
2055,-0.24957
2056,-0.25704
2057,-0.25805
2058,-0.25755
2059,-0.26425
2060,-0.27093
2061,-0.27189
2062,-0.27205
2063,-0.27545
2064,-0.28286999999999995
2065,-0.2903
2066,-0.29693
2067,-0.30434
2068,-0.30689
2069,-0.30448000000000003
2070,-0.3086
2071,-0.31599
2072,-0.32256
2073,-0.32995
2074,-0.33733
2075,-0.33814
2076,-0.33809
2077,-0.34131
2078,-0.35113
2079,-0.35273000000000004
2080,-0.35273000000000004
2081,-0.35186999999999996
2082,-0.3493
2083,-0.34844
2084,-0.34757
2085,-0.3467
2086,-0.34408
2087,-0.34144
2088,-0.33878
2089,-0.33519
2090,-0.32699
2091,-0.31968
2092,-0.31148000000000003
2093,-0.30417
2094,-0.29596999999999996
2095,-0.29084
2096,-0.28569
2097,-0.27839
2098,-0.27019
2099,-0.26045999999999997
2100,-0.25315
2101,-0.24558000000000002
2102,-0.24286
2103,-0.23465999999999998
2104,-0.22735999999999998
2105,-0.21916
2106,-0.21186
2107,-0.20365999999999998
2108,-0.19942000000000001
2109,-0.19333
2110,-0.18605
2111,-0.17876
2112,-0.17147
2113,-0.16326
2114,-0.15597
2115,-0.14867
2116,-0.14137
2117,-0.13713
2118,-0.13197
2119,-0.12286
2120,-0.11557
2121,-0.10737000000000001
2122,-0.10007
2123,-0.092774
2124,-0.09005099999999999
2125,-0.084878
2126,-0.079105
2127,-0.07181900000000001
2128,-0.06453099999999999
2129,-0.05724
2130,-0.047514
2131,-0.039312
2132,-0.032014999999999995
2133,-0.024714
2134,-0.017412
2135,-0.0092079
2136,-0.0049719
2137,0.00017809
2138,0.008383100000000001
2139,0.015677
2140,0.026313999999999997
2141,0.033612
2142,0.039383
2143,0.044532
2144,0.047268
2145,0.05455700000000001
2146,0.06275900000000001
2147,0.06701599999999999
2148,0.072199
2149,0.076471
2150,0.086174
2151,0.093457
2152,0.10166
2153,0.10894000000000001
2154,0.1132
2155,0.1184
2156,0.12268
2157,0.12995
2158,0.13722
2159,0.14451
2160,0.15179
2161,0.16242
2162,0.1697
2163,0.17699
2164,0.18428
2165,0.19157000000000002
2166,0.19734000000000002
2167,0.20008
2168,0.20526
2169,0.21254
2170,0.22074000000000002
2171,0.22593000000000002
2172,0.23113000000000003
2173,0.23690999999999998
2174,0.24418
2175,0.25239
2176,0.25966
2177,0.26694
2178,0.27214
2179,0.27735
2180,0.2807
2181,0.29131999999999997
2182,0.29803
2183,0.30085
2184,0.30515
2185,0.3124
2186,0.3206
2187,0.3249
2188,0.33016
2189,0.33448
2190,0.34267
2191,0.35181999999999997
2192,0.3571
2193,0.36143000000000003
2194,0.36962
2195,0.37686
2196,0.37974
2197,0.38505
2198,0.38842
2199,0.39662
2200,0.40143
2201,0.40675
2202,0.41546000000000005
2203,0.42268
2204,0.43087
2205,0.4338
2206,0.43675
2207,0.44211999999999996
2208,0.44509
2209,0.44809
2210,0.45528
2211,0.46346000000000004
2212,0.46886000000000005
2213,0.47186999999999996
2214,0.4773
2215,0.48034
2216,0.48578999999999994
2217,0.49396999999999996
2218,0.50215
2219,0.50522
2220,0.50831
2221,0.51141
2222,0.51557
2223,0.51871
2224,0.52186
2225,0.52503
2226,0.52822
2227,0.53142
2228,0.53463
2229,0.53786
2230,0.5411
2231,0.54437
2232,0.54873
2233,0.55203
2234,0.54843
2235,0.5413899999999999
2236,0.5343399999999999
2237,0.52841
2238,0.5213800000000001
2239,0.51435
2240,0.50732
2241,0.5003
2242,0.50021
2243,0.50472
2244,0.5011899999999999
2245,0.49418999999999996
2246,0.48718999999999996
2247,0.4802
2248,0.47321
2249,0.46623000000000003
2250,0.45924
2251,0.45226000000000005
2252,0.44528999999999996
2253,0.43599
2254,0.42903
2255,0.42207
2256,0.41511000000000003
2257,0.4093
2258,0.40349
2259,0.39769
2260,0.39071999999999996
2261,0.38376
2262,0.3768
2263,0.36635999999999996
2264,0.35941
2265,0.35246
2266,0.34551
2267,0.34199
2268,0.33616999999999997
2269,0.33037
2270,0.32341
2271,0.31645999999999996
2272,0.30951
2273,0.30025999999999997
2274,0.29214
2275,0.2852
2276,0.27826999999999996
2277,0.27134
2278,0.26441
2279,0.25749
2280,0.25058
2281,0.24247
2282,0.23659000000000002
2283,0.23301999999999998
2284,0.22379000000000002
2285,0.21686999999999998
2286,0.20995
2287,0.20304
2288,0.19614
2289,0.18923
2290,0.18112999999999999
2291,0.17423
2292,0.16734000000000002
2293,0.16045
2294,0.15127000000000002
2295,0.14439000000000002
2296,0.13967000000000002
2297,0.13373
2298,0.12900999999999999
2299,0.12212999999999999
2300,0.11402999999999999
2301,0.10715
2302,0.10027
2303,0.094467
2304,0.087311
2305,0.082595
2306,0.075706
2307,0.068825
2308,0.060729
2309,0.053850999999999996
2310,0.046832
2311,0.040891000000000004
2312,0.036172
2313,0.029286000000000003
2314,0.020113
2315,0.012017
2316,0.0051441
2317,0.00041409
2318,-0.0055299
2319,-0.012543
2320,-0.019427
2321,-0.027522
2322,-0.034401
2323,-0.041272
2324,-0.046002999999999995
2325,-0.053162
2326,-0.058963
2327,-0.065847
2328,-0.072723
2329,-0.079596
2330,-0.087687
2331,-0.094552
2332,-0.10141
2333,-0.10827
2334,-0.11195999999999999
2335,-0.11914000000000001
2336,-0.12600999999999998
2337,-0.13288
2338,-0.14096
2339,-0.14782
2340,-0.15591
2341,-0.1596
2342,-0.16555999999999998
2343,-0.17243
2344,-0.17929
2345,-0.18843
2346,-0.19528
2347,-0.20337
2348,-0.21020999999999998
2349,-0.21705
2350,-0.22305
2351,-0.22904000000000002
2352,-0.23484000000000002
2353,-0.24169000000000002
2354,-0.24853000000000003
2355,-0.25889
2356,-0.26697
2357,-0.27298
2358,-0.27668000000000004
2359,-0.28353
2360,-0.29038
2361,-0.29722
2362,-0.3053
2363,-0.31213
2364,-0.31895999999999997
2365,-0.32578
2366,-0.33408000000000004
2367,-0.3401
2368,-0.3459
2369,-0.35273000000000004
2370,-0.35955
2371,-0.36637
2372,-0.37444
2373,-0.38125
2374,-0.38806
2375,-0.39611999999999997
2376,-0.40344
2377,-0.40821999999999997
2378,-0.41503
2379,-0.42183999999999994
2380,-0.42863999999999997
2381,-0.43543999999999994
2382,-0.4435
2383,-0.45028
2384,-0.45707
2385,-0.45932
2386,-0.46158000000000005
2387,-0.4661
2388,-0.47415
2389,-0.47543
2390,-0.47897
2391,-0.48702
2392,-0.49506999999999995
2393,-0.50312
2394,-0.50441
2395,-0.50666
2396,-0.51117
2397,-0.52147
2398,-0.52823
2399,-0.53497
2400,-0.54301
2401,-0.54915
2402,-0.55303
2403,-0.55978
2404,-0.5665399999999999
2405,-0.57328
2406,-0.58002
2407,-0.5903
2408,-0.59702
2409,-0.6037399999999999
2410,-0.6099100000000001
2411,-0.6160800000000001
2412,-0.62187
2413,-0.6286
2414,-0.63663
2415,-0.64335
2416,-0.6500600000000001
2417,-0.6598
2418,-0.66372
2419,-0.6682100000000001
2420,-0.67493
2421,-0.68165
2422,-0.6896800000000001
2423,-0.69638
2424,-0.70308
2425,-0.70978
2426,-0.7177899999999999
2427,-0.72533
2428,-0.73244
2429,-0.74047
2430,-0.7489
2431,-0.75508
2432,-0.7631100000000001
2433,-0.76982
2434,-0.77653
2435,-0.78455
2436,-0.7912399999999999
2437,-0.79792
2438,-0.80682
2439,-0.81306
2440,-0.8192799999999999
2441,-0.82284
2442,-0.82952
2443,-0.83754
2444,-0.8442200000000001
2445,-0.85088
2446,-0.85801
2447,-0.86425
2448,-0.8691399999999999
2449,-0.87582
2450,-0.88249
2451,-0.8905
2452,-0.8971600000000001
2453,-0.90381
2454,-0.91046
2455,-0.91845
2456,-0.9255899999999999
2457,-0.92965
2458,-0.9398700000000001
2459,-0.9465100000000001
2460,-0.9545
2461,-0.9611299999999999
2462,-0.9682799999999999
2463,-0.97456
2464,-0.97949
2465,-0.98613
2466,-0.9927600000000001
2467,-1.0008
2468,-1.0096
2469,-1.0181
2470,-1.0222
2471,-1.0302
2472,-1.0382
2473,-1.0431
2474,-1.0494
2475,-1.0543
2476,-1.0609
2477,-1.0676
2478,-1.0756
2479,-1.0844
2480,-1.0893
2481,-1.0956
2482,-1.1006
2483,-1.1072
2484,-1.1138
2485,-1.1218
2486,-1.1284
2487,-1.1342
2488,-1.1383
2489,-1.1468
2490,-1.1535
2491,-1.1601
2492,-1.1681
2493,-1.1747
2494,-1.1804
2495,-1.1846
2496,-1.1909
2497,-1.1975
2498,-1.2055
2499,-1.2131
2500,-1.2194
2501,-1.2261
2502,-1.2341
2503,-1.2403
2504,-1.2466
2505,-1.2524
2506,-1.2590000000000001
2507,-1.2657
2508,-1.2737
2509,-1.2825
2510,-1.2866
2511,-1.2929
2512,-1.2987
2513,-1.3067
2514,-1.3138
2515,-1.3201
2516,-1.325
2517,-1.3330000000000002
2518,-1.341
2519,-1.3472
2520,-1.3557
2521,-1.3637
2522,-1.3708
2523,-1.3748
2524,-1.3797
2525,-1.3864
2526,-1.3931
2527,-1.4011
2528,-1.4078
2529,-1.4144
2530,-1.422
2531,-1.426
2532,-1.4327
2533,-1.4407
2534,-1.4474
2535,-1.4541
2536,-1.4621
2537,-1.4661
2538,-1.4723
2539,-1.4768
2540,-1.4857
2541,-1.4923
2542,-1.499
2543,-1.5056
2544,-1.5122
2545,-1.5189
2546,-1.5255
2547,-1.5319999999999998
2548,-1.5386
2549,-1.5466
2550,-1.5553
2551,-1.5618
2552,-1.5683
2553,-1.5748
2554,-1.5813
2555,-1.5878
2556,-1.5936
2557,-1.6001
2558,-1.6065
2559,-1.6130000000000002
2560,-1.6195
2561,-1.6281
2562,-1.6345
2563,-1.6409
2564,-1.6473
2565,-1.6552
2566,-1.6616
2567,-1.6680000000000001
2568,-1.6743
2569,-1.6806
2570,-1.6869
2571,-1.6953
2572,-1.7016
2573,-1.7078
2574,-1.714
2575,-1.7218
2576,-1.7275
2577,-1.7343
2578,-1.7415
2579,-1.7478
2580,-1.7539
2581,-1.7622
2582,-1.7683
2583,-1.7744
2584,-1.7805
2585,-1.7882
2586,-1.7943
2587,-1.8003
2588,-1.8063
2589,-1.8123
2590,-1.8182
2591,-1.8261
2592,-1.8319999999999999
2593,-1.834
2594,-1.8359
2595,-1.8416
2596,-1.8491
2597,-1.8528
2598,-1.8565
2599,-1.864
2600,-1.8715
2601,-1.8771
2602,-1.8791
2603,-1.8849
2604,-1.8906
2605,-1.8963
2606,-1.902
2607,-1.9076
2608,-1.9133
2609,-1.9188
2610,-1.9262
2611,-1.9317
2612,-1.9391
2613,-1.9445
2614,-1.9499
2615,-1.9553
2616,-1.9606
2617,-1.9659
2618,-1.9715
2619,-1.979
2620,-1.9845
2621,-1.9898
2622,-1.9969
2623,-2.0021
2624,-2.0072
2625,-2.0124
2626,-2.0174
2627,-2.0225
2628,-2.0275
2629,-2.0344
2630,-2.0393
2631,-2.0442
2632,-2.049
2633,-2.0553
2634,-2.06
2635,-2.0647
2636,-2.0693
2637,-2.0738
2638,-2.0795
2639,-2.0874
2640,-2.0946
2641,-2.0991
2642,-2.1036
2643,-2.1094
2644,-2.1137
2645,-2.1179
2646,-2.1221
2647,-2.1262
2648,-2.1325
2649,-2.1365
2650,-2.1404
2651,-2.1442
2652,-2.148
2653,-2.153
2654,-2.1566
2655,-2.1601
2656,-2.1636
2657,-2.167
2658,-2.1703
2659,-2.1735
2660,-2.1757
2661,-2.1767
2662,-2.1767
2663,-2.1832
2664,-2.1866
2665,-2.19
2666,-2.1943
2667,-2.1997
2668,-2.2049
2669,-2.2083
2670,-2.2092
2671,-2.2085
2672,-2.2087
2673,-2.2088
2674,-2.2119999999999997
2675,-2.2143
2676,-2.219
2677,-2.2236
2678,-2.2261
2679,-2.2268
2680,-2.2288
2681,-2.2307
2682,-2.2325
2683,-2.2325
2684,-2.2331
2685,-2.2348
2686,-2.2363
2687,-2.2378
2688,-2.2392
2689,-2.2404
2690,-2.2416
2691,-2.2426
2692,-2.2435
2693,-2.247
2694,-2.2453
2695,-2.2459
2696,-2.2464
2697,-2.2467
2698,-2.247
2699,-2.2471
2700,-2.2472
2701,-2.2471
2702,-2.2471
2703,-2.2471
2704,-2.2471
2705,-2.2471
2706,-2.2471
2707,-2.2471
2708,-2.2497
