time,value
0,0.74774
1,0.6580600000000001
2,0.58932
3,0.51978
4,0.46092
5,0.41501000000000005
6,0.37149
7,0.44481000000000004
8,0.41977
9,0.37403000000000003
10,0.32428
11,0.28015999999999996
12,0.24084
13,0.22121999999999997
14,0.20733000000000001
15,0.19347
16,0.18269000000000002
17,0.18161
18,0.18172
19,0.19179000000000002
20,0.21625
21,0.23903000000000002
22,0.25658000000000003
23,0.2794
24,0.3184
25,0.44915
26,0.55733
27,0.65665
28,0.75329
29,0.8392
30,0.9297200000000001
31,1.0388
32,1.1475
33,1.2529
34,1.2061
35,1.1289
36,1.1276
37,1.1408
38,1.1447
39,1.1696
40,1.1937
41,1.2175
42,1.2563
43,1.3056
44,1.3519999999999999
45,1.3968
46,1.4288
47,1.4518
48,1.4683
49,1.4741
50,1.4752
51,1.459
52,1.4367
53,1.4256
54,1.4417
55,1.5286
56,1.6087
57,1.4983
58,1.6447
59,1.6271
60,1.5075
61,1.4127
62,1.3495
63,1.3541
64,1.3935
65,1.4329
66,1.456
67,1.4662
68,1.4846
69,1.5045
70,1.515
71,1.5134
72,1.5015
73,1.4905
74,1.4775
75,1.4642
76,1.4636
77,1.4657
78,1.3762
79,1.3112
80,1.2175
81,1.1098
82,0.9964700000000001
83,0.9100299999999999
84,0.87408
85,0.85635
86,0.82837
87,0.81767
88,0.78259
89,0.7590100000000001
90,0.7619199999999999
91,0.7711
92,0.79108
93,0.81321
94,0.84105
95,0.80958
96,0.80698
97,0.8364
98,0.8611700000000001
99,0.8918799999999999
100,0.93325
101,0.9123700000000001
102,0.84499
103,0.75585
104,0.65457
105,0.56587
106,0.47584
107,0.37719
108,0.28518000000000004
109,0.20251
110,0.10772999999999999
111,0.022031
112,-0.076456
113,-0.18114
114,-0.29761
115,-0.41786999999999996
116,-0.5098699999999999
117,-0.59809
118,-0.64544
119,-0.6957899999999999
120,-0.71578
121,-0.75088
122,-0.77965
123,-0.79983
124,-0.80274
125,-0.80583
126,-0.79496
127,-0.78885
128,-0.78025
129,-0.76462
130,-0.74444
131,-0.71338
132,-0.67689
133,-0.64447
134,-0.61361
135,-0.57001
136,-0.52335
137,-0.4599
138,-0.39064
139,-0.31897
140,-0.23831
141,-0.16068
142,-0.070625
143,-0.11606
144,-0.21633000000000002
145,-0.2178
146,-0.17095
147,-0.10893
148,-0.047501999999999996
149,0.022506
150,0.10353
151,0.2072
152,0.29688000000000003
153,0.37617
154,0.49941
155,0.59854
156,0.58221
157,0.43341999999999997
158,0.28473000000000004
159,0.16092
160,0.048944999999999995
161,-0.063202
162,-0.20936999999999997
163,-0.26229
164,-0.35956
165,-0.45765
166,-0.55762
167,-0.67602
168,-0.79787
169,-0.9210299999999999
170,-1.0683
171,-1.2048
172,-1.3362
173,-1.4339
174,-1.5659
175,-1.6874
176,-1.7678
177,-1.8465
178,-1.9075
179,-1.9477
180,-1.9591
181,-1.9368
182,-1.8844
183,-1.8394
184,-1.8013
185,-1.7279
186,-1.6533
187,-1.5757
188,-1.4941
189,-1.4044
190,-1.3109
191,-1.2124
192,-1.1242
193,-1.0328
194,-0.92729
195,-0.8320799999999999
196,-0.72932
197,-0.62716
198,-0.53158
199,-0.423
200,-0.32241
201,-0.21616999999999997
202,-0.11385999999999999
203,-0.081995
204,-0.17013
205,-0.15079
206,-0.050076
207,0.06263400000000001
208,0.1659
209,0.27474
210,0.38316
211,0.48885
212,0.6017100000000001
213,0.60234
214,0.49717
215,0.39384
216,0.29286999999999996
217,0.22651999999999997
218,0.12705999999999998
219,0.01877
220,-0.086699
221,-0.18361
222,-0.28891999999999995
223,-0.38726
224,-0.47743
225,-0.57857
226,-0.66147
227,-0.73765
228,-0.7842399999999999
229,-0.7764300000000001
230,-0.73112
231,-0.66866
232,-0.58378
233,-0.47193999999999997
234,-0.35794000000000004
235,-0.21409
236,-0.072315
237,0.073304
238,0.19128
239,0.27288
240,0.39866
241,0.49912
242,0.6228600000000001
243,0.74645
244,0.89176
245,1.0004
246,1.1088
247,1.2131
248,1.3036
249,1.2312
250,1.161
251,1.0858
252,1.0293
253,1.0393
254,1.127
255,1.2525
256,1.399
257,1.5242
258,1.6726
259,1.7592
260,1.805
261,1.7889
262,1.6796
263,1.6578
264,1.5523
265,1.4272
266,1.3236
267,1.2238
268,1.1322
269,1.0531
270,1.0342
271,1.1054
272,1.2029
273,1.3012
274,1.3431
275,1.2219
276,1.1211
277,0.9925700000000001
278,0.84388
279,0.73734
280,0.6218
281,0.50146
282,0.40088
283,0.27860999999999997
284,0.15632000000000001
285,0.053232
286,-0.062499
287,-0.18275
288,-0.26047
289,-0.3112
290,-0.32111
291,-0.28481999999999996
292,-0.22988000000000003
293,-0.14503
294,-0.060535000000000005
295,0.027408
296,0.11678
297,0.2129
298,0.31188
299,0.42135
300,0.52461
301,0.6114
302,0.72702
303,0.83667
304,0.9461299999999999
305,1.0427
306,0.92614
307,0.78418
308,0.6622399999999999
309,0.5397
310,0.39632
311,0.27412
312,0.14114000000000002
313,0.13575
314,0.23504
315,0.21128000000000002
316,0.090318
317,-0.016686000000000003
318,-0.12945
319,-0.24686999999999998
320,-0.36395
321,-0.4748
322,-0.58049
323,-0.69258
324,-0.81062
325,-0.92396
326,-1.0362
327,-1.1535
328,-1.2766
329,-1.3983
330,-1.5125
331,-1.6324
332,-1.7436
333,-1.8501
334,-1.9569
335,-2.0743
336,-2.1869
337,-2.2868
338,-2.4032
339,-2.4704
340,-2.5084
341,-2.4855
342,-2.4185
343,-2.2856
344,-2.2159999999999997
345,-2.0975
346,-1.9837
347,-1.8693
348,-1.7687
349,-1.6542
350,-1.55
351,-1.4342
352,-1.3266
353,-1.2264
354,-1.1152
355,-1.0044
356,-0.88634
357,-0.78415
358,-0.67904
359,-0.57284
360,-0.46993
361,-0.45505
362,-0.34741
363,-0.2418
364,-0.13719
365,-0.040921
366,0.070466
367,0.16955
368,0.26815
369,0.16583
370,0.075351
371,0.024492
372,-0.07032000000000001
373,-0.16237000000000001
374,-0.24923
375,-0.32961999999999997
376,-0.40642
377,-0.48253
378,-0.48741
379,-0.38576
380,-0.25965
381,-0.29636999999999997
382,-0.40651
383,-0.48652
384,-0.5141399999999999
385,-0.58734
386,-0.6612600000000001
387,-0.73892
388,-0.81209
389,-0.88084
390,-0.9389700000000001
391,-0.99784
392,-1.0503
393,-1.1031
394,-1.1507
395,-1.1876
396,-1.2215
397,-1.2534
398,-1.2732
399,-1.2955
400,-1.3214
401,-1.3256
402,-1.3322
403,-1.3223
404,-1.3173
405,-1.3123
406,-1.3027
407,-1.2766
408,-1.1977
409,-1.094
410,-0.9879100000000001
411,-0.87528
412,-0.77456
413,-0.66356
414,-0.56158
415,-0.45508000000000004
416,-0.33042
417,-0.24381999999999998
418,-0.1413
419,-0.050277999999999996
420,0.070462
421,0.168
422,0.29619
423,0.38904
424,0.48144
425,0.57849
426,0.67924
