time,value
0,1.7905
1,1.8191
2,1.7590000000000001
3,1.7023
4,1.6491
5,1.5533
6,1.4766
7,1.3979
8,1.2864
9,1.1708
10,1.0569
11,0.94495
12,0.8347700000000001
13,0.7269
14,0.6211899999999999
15,0.51795
16,0.41746000000000005
17,0.30285
18,0.20701
19,0.11439
20,0.020738
21,-0.081389
22,-0.16408
23,-0.24195
24,-0.31551
25,-0.38377
26,-0.44673999999999997
27,-0.50731
28,-0.58699
29,-0.66418
30,-0.70767
31,-0.76872
32,-0.81201
33,-0.88687
34,-0.91933
35,-0.9587899999999999
36,-0.98101
37,-1.0271
38,-1.0424
39,-1.0852
40,-1.121
41,-1.1508
42,-1.1733
43,-1.1889
44,-1.1975
45,-1.1983
46,-1.1923
47,-1.1786
48,-1.1909999999999998
49,-1.1752
50,-1.1401
51,-1.099
52,-1.051
53,-0.9976799999999999
54,-0.97915
55,-0.91401
56,-0.88259
57,-0.82284
58,-0.79345
59,-0.72246
60,-0.65842
61,-0.5999
62,-0.53132
63,-0.45752
64,-0.39324000000000003
65,-0.3238
66,-0.24946
67,-0.15807000000000002
68,-0.065593
69,0.020703
70,0.11054000000000001
71,0.20392000000000002
72,0.30064
73,0.40013000000000004
74,0.50855
75,0.62087
76,0.72725
77,0.8358700000000001
78,0.9464799999999999
79,1.0592
80,1.1735
81,1.2761
82,1.3618
83,1.4746
84,1.5932
85,1.71
86,1.7524
87,1.7469
88,1.7445
89,1.7454
90,1.7034
91,1.6921
92,1.6380000000000001
93,1.53
94,1.4140000000000001
95,1.3434
96,1.2266
97,1.1114
98,0.99797
99,0.88638
100,0.77675
101,0.66262
102,0.55047
103,0.44693
104,0.34594
105,0.23106999999999997
106,0.13497
107,0.041924
108,-0.055393
109,-0.15416
110,-0.23674
111,-0.3148
112,-0.41398999999999997
113,-0.48344
114,-0.54786
115,-0.6146
116,-0.7115
117,-0.74069
118,-0.81439
119,-0.8527
120,-0.9194
121,-0.97188
122,-0.9990700000000001
123,-1.031
124,-1.0912
125,-1.1286
126,-1.1503
127,-1.1913
128,-1.2255
129,-1.2532
130,-1.2729
131,-1.2466
132,-1.2447
133,-1.2422
134,-1.2325
135,-1.2149
136,-1.1908
137,-1.1591
138,-1.1318
139,-1.1363
140,-1.0868
141,-1.032
142,-0.9712
143,-0.93621
144,-0.91101
145,-0.85605
146,-0.7893600000000001
147,-0.7483
148,-0.67929
149,-0.6191800000000001
150,-0.54351
151,-0.48378000000000004
152,-0.39461999999999997
153,-0.32734
154,-0.25461
155,-0.16069
156,-0.07369099999999999
157,0.010955
158,0.09914500000000001
159,0.19128
160,0.28654
161,0.3849
162,0.48621000000000003
163,0.58995
164,0.69643
165,0.80498
166,0.9263600000000001
167,1.0381
168,1.1516
169,1.2670000000000001
170,1.3838
171,1.4941
172,1.6076
173,1.6736
174,1.73
175,1.7896
