time,value
0,1.5857
1,1.4899
2,1.3946
3,1.2997
4,1.2057
5,1.1117
6,1.0191
7,0.92743
8,0.84219
9,0.75803
10,0.66752
11,0.57781
12,0.49116000000000004
13,0.40599
14,0.32242
15,0.2375
16,0.16569
17,0.08044
18,0.0030969
19,-0.080082
20,-0.15737
21,-0.23749
22,-0.31065
23,-0.38582
24,-0.45876000000000006
25,-0.5262399999999999
26,-0.5898
27,-0.65041
28,-0.71302
29,-0.77185
30,-0.82245
31,-0.8765
32,-0.91517
33,-0.96345
34,-0.99765
35,-1.0433
36,-1.0739
37,-1.0976
38,-1.1261
39,-1.1351
40,-1.1488
41,-1.1547
42,-1.1527
43,-1.143
44,-1.1379
45,-1.1226
46,-1.0927
47,-1.0703
48,-1.0376
49,-0.9875799999999999
50,-0.93274
51,-0.87361
52,-0.82485
53,-0.78269
54,-0.7337100000000001
55,-0.67491
56,-0.6181
57,-0.55319
58,-0.48661000000000004
59,-0.41344
60,-0.34852
61,-0.26637
62,-0.19111
63,-0.10982
64,-0.029869
65,0.049111
66,0.1345
67,0.21777
68,0.3012
69,0.3881
70,0.47498999999999997
71,0.56288
72,0.6514800000000001
73,0.73963
74,0.83026
75,0.92158
76,1.0135
77,1.1051
78,1.1975
79,1.2908
80,1.3848
81,1.4796
82,1.5751
83,1.671
84,1.735
85,1.7429
86,1.7369
87,1.6916
88,1.62
89,1.5284
90,1.439
91,1.347
92,1.2557
93,1.1636
94,1.0844
95,0.9919399999999999
96,0.9030799999999999
97,0.80929
98,0.71848
99,0.62507
100,0.53184
101,0.44073999999999997
102,0.34924
103,0.26021
104,0.16812
105,0.076335
106,-0.015106999999999999
107,-0.10403
108,-0.19252
109,-0.28246
110,-0.35546
111,-0.44506
112,-0.535
113,-0.6242
114,-0.7104
115,-0.79543
116,-0.87907
117,-0.95635
118,-1.034
119,-1.1113
120,-1.1775
121,-1.2479
122,-1.3141
123,-1.3753
124,-1.4196
125,-1.4554
126,-1.4933
127,-1.5215
128,-1.5388
129,-1.5511
130,-1.5512
131,-1.5335
132,-1.5049
133,-1.4664
134,-1.4193
135,-1.3749
136,-1.3063
137,-1.2564
138,-1.1865
139,-1.1207
140,-1.0437
141,-0.96436
142,-0.8838799999999999
143,-0.79985
144,-0.7153
145,-0.62954
146,-0.54273
147,-0.45502
148,-0.36654000000000003
149,-0.27737
150,-0.18762
151,-0.09734
152,-0.0066038
153,0.080698
154,0.17235
155,0.26431
156,0.36001
157,0.44937
158,0.5289
159,0.61946
160,0.7126600000000001
161,0.80318
162,0.8967799999999999
163,0.9905299999999999
164,1.0793
165,1.171
166,1.2635
167,1.3552
168,1.4447
169,1.534
170,1.6206
171,1.6952
172,1.7339
173,1.7436
174,1.6974
175,1.6346
