time,value
0,-0.45056
1,-0.45056
2,-0.45056
3,-0.45056
4,-0.45056
5,-0.45056
6,-0.45056
7,-0.45056
8,-0.45056
9,-0.45056
10,-0.45056
11,-0.45056
12,-0.026504000000000003
13,-0.45056
14,-0.45056
15,-0.45056
16,-0.45056
17,-0.45056
18,-0.45056
19,-0.45056
20,-0.026504000000000003
21,-0.45056
22,-0.45056
23,-0.45056
24,-0.45056
25,-0.45056
26,-0.45056
27,-0.45056
28,-0.45056
29,-0.45056
30,-0.45056
31,-0.45056
32,-0.45056
33,-0.45056
34,-0.45056
35,-0.45056
36,-0.45056
37,-0.45056
38,-0.45056
39,-0.16785999999999998
40,-0.026504000000000003
41,-0.45056
42,-0.45056
43,-0.45056
44,-0.45056
45,-0.45056
46,-0.45056
47,-0.45056
48,-0.45056
49,-0.45056
50,-0.45056
51,-0.45056
52,-0.45056
53,-0.45056
54,-0.45056
55,-0.45056
56,-0.026504000000000003
57,-0.45056
58,-0.45056
59,-0.45056
60,-0.45056
61,-0.45056
62,-0.45056
63,-0.45056
64,-0.45056
65,-0.45056
66,-0.45056
67,-0.45056
68,-0.45056
69,-0.45056
70,-0.45056
71,2.6592
72,2.8005
73,2.9419
74,2.3765
75,0.8216100000000001
76,0.39755
77,0.53891
78,0.39755
79,0.39755
80,-0.45056
81,-0.45056
82,-0.45056
83,-0.45056
84,0.96296
85,2.5178
86,2.9419
87,2.8005
88,2.9419
89,2.8005
90,2.0938
91,2.0938
92,0.6802600000000001
93,-0.45056
94,-0.45056
95,-0.45056
