{
  "about": {
    "problemID": "LL1_VTXC_1369_synthetic_problem",
    "problemName": "Synthetic Vertex Classification Problem",
    "problemDescription": "Synthetic data Vertex Classification task",
    "problemSchemaVersion": "4.0.0",
    "problemVersion": "4.0.0",
    "taskKeywords": [
      "vertexClassification",
      "multiClass",
      "graph"
    ]
  },
  "inputs": {
    "data": [
      {
        "datasetID": "LL1_VTXC_1369_synthetic_dataset",
        "targets": [
          {
            "targetIndex": 0,
            "resID": "learningData",
            "colIndex": 102,
            "colName": "label"
          }
        ]
      }
    ],
    "dataSplits": {
      "splitsFile": "dataSplits.csv",
      "splitScript": "splitScript.py",
      "datasetViewMaps": {
        "train": [
          {
            "from": "LL1_VTXC_1369_synthetic_dataset",
            "to": "LL1_VTXC_1369_synthetic_dataset_TRAIN"
          }
        ],
        "test": [
          {
            "from": "LL1_VTXC_1369_synthetic_dataset",
            "to": "LL1_VTXC_1369_synthetic_dataset_TEST"
          }
        ],
        "score": [
          {
            "from": "LL1_VTXC_1369_synthetic_dataset",
            "to": "LL1_VTXC_1369_synthetic_dataset_SCORE"
          }
        ]
      }
    },
    "performanceMetrics": [
      {
        "metric": "f1Macro"
      }
    ]
  },
  "expectedOutputs": {
    "predictionsFile": "predictions.csv"
  }
}