time,value
0,0.54802
1,1.4903
2,1.1762
3,-0.39424000000000003
4,-0.8653700000000001
5,-0.8653700000000001
6,-0.8653700000000001
7,-0.8653700000000001
8,-0.8653700000000001
9,1.8044
10,1.3332
11,1.1762
12,1.1762
13,1.1762
14,1.1762
15,1.1762
16,-0.8653700000000001
17,-0.8653700000000001
18,-0.8653700000000001
19,-0.8653700000000001
20,-0.8653700000000001
21,-0.2372
22,1.6473
23,1.3332
24,1.1762
25,0.8621
26,-0.8653700000000001
27,-0.8653700000000001
28,-0.8653700000000001
29,-0.8653700000000001
30,-0.8653700000000001
31,-0.39424000000000003
32,1.6473
33,1.1762
34,0.8621
35,-0.8653700000000001
36,-0.8653700000000001
37,-0.8653700000000001
38,-0.8653700000000001
39,-0.8653700000000001
40,-0.39424000000000003
41,1.6473
42,1.3332
43,0.39097
44,-0.8653700000000001
45,-0.8653700000000001
46,-0.8653700000000001
47,-0.8653700000000001
48,-0.8653700000000001
49,0.076886
50,1.4903
51,1.3332
52,0.54802
53,-0.8653700000000001
54,-0.8653700000000001
55,-0.8653700000000001
56,-0.8653700000000001
57,-0.8653700000000001
58,0.23393000000000003
59,1.4903
60,1.3332
61,1.1762
62,-0.2372
63,-0.8653700000000001
64,-0.8653700000000001
65,-0.8653700000000001
66,-0.8653700000000001
67,-0.8653700000000001
68,1.3332
69,1.3332
70,1.1762
71,-0.080157
72,-0.8653700000000001
73,-0.8653700000000001
74,-0.8653700000000001
75,-0.8653700000000001
76,-0.8653700000000001
77,0.70506
78,1.4903
79,1.1762
80,-0.39424000000000003
81,-0.8653700000000001
82,-0.8653700000000001
83,-0.8653700000000001
84,-0.8653700000000001
85,0.23393000000000003
86,1.4903
87,1.3332
88,1.1762
89,-0.080157
90,-0.8653700000000001
91,-0.8653700000000001
92,-0.8653700000000001
93,-0.8653700000000001
94,-0.8653700000000001
95,1.1762
