time,value
0,0.48207
1,-0.97716
2,-0.97716
3,0.48207
4,1.9413
5,0.16937
6,-0.97716
7,-0.14332
8,0.2736
9,-0.97716
10,-0.97716
11,0.2736
12,1.8371
13,-0.35178000000000004
14,-0.97716
15,1.0032
16,-0.97716
17,-0.97716
18,-0.66447
19,0.89899
20,1.0032
21,1.5244
22,-0.97716
23,-0.97716
24,-0.66447
25,0.89899
26,-0.97716
27,-0.97716
28,0.69053
29,1.8371
30,-0.7687
31,-0.45601
32,0.69053
33,-0.97716
34,-0.97716
35,0.2736
36,0.16937
37,1.8371
38,0.2736
39,-0.97716
40,-0.97716
41,0.69053
42,-0.56024
43,-0.97716
44,-0.97716
45,0.48207
46,1.8371
47,-0.7687
48,-0.66447
49,0.5863
50,-0.97716
51,-0.97716
52,0.06514400000000001
53,0.16937
54,1.8371
55,-0.039086
56,-0.97716
57,-0.97716
58,0.79476
59,-0.7687
60,-0.97716
61,-0.97716
62,1.7328
63,0.79476
64,-0.7687
65,1.3159
66,-0.97716
67,-0.97716
68,0.16937
69,1.8371
70,1.5244
71,-0.97716
72,-0.97716
73,-0.45601
74,0.69053
75,-0.14332
76,2.0455
77,-0.56024
78,-0.97716
79,0.16937
80,-0.039086
81,1.7328
82,0.5863
83,-0.97716
84,-0.97716
85,1.2117
86,-0.97716
87,1.6286
88,0.48207
89,-0.97716
90,0.89899
91,-0.97716
92,-0.97716
93,1.4201
94,0.37784
95,0.37784
