time,value
0,1.6176
1,1.6
2,1.5759999999999998
3,1.5309
4,1.5065
5,1.4529
6,1.3885
7,1.3034
8,1.2014
9,1.0974
10,0.99429
11,0.89579
12,0.79064
13,0.68548
14,0.58382
15,0.48208
16,0.37711999999999996
17,0.27754
18,0.17448
19,0.077567
20,-0.015276
21,-0.11417999999999999
22,-0.20243
23,-0.29144000000000003
24,-0.37215
25,-0.4496
26,-0.5234300000000001
27,-0.59316
28,-0.66785
29,-0.72888
30,-0.78446
31,-0.84411
32,-0.91
33,-0.95814
34,-0.9999299999999999
35,-1.053
36,-1.1097
37,-1.1479
38,-1.1792
39,-1.2027
40,-1.2545
41,-1.2772
42,-1.281
43,-1.2779
44,-1.2813
45,-1.2871
46,-1.273
47,-1.2507
48,-1.2208
49,-1.1836
50,-1.1565
51,-1.1221
52,-1.081
53,-1.0196
54,-0.9665100000000001
55,-0.9223600000000001
56,-0.85964
57,-0.79286
58,-0.7416
59,-0.6744100000000001
60,-0.60352
61,-0.53809
62,-0.4761
63,-0.39436
64,-0.318
65,-0.23642
66,-0.14755
67,-0.062061
68,0.035108
69,0.13125
70,0.22411
71,0.32543
72,0.43057
73,0.5285
74,0.63366
75,0.7388100000000001
76,0.8439700000000001
77,0.94821
78,1.0543
79,1.1553
80,1.2546
81,1.3515
82,1.4461
83,1.5152
84,1.5576
85,1.5822
86,1.6221
87,1.6205
88,1.6206
89,1.6272
90,1.6045
91,1.5726
92,1.5306
93,1.4816
94,1.3906
95,1.2938
96,1.1919
97,1.0867
98,0.98155
99,0.8764
100,0.7712399999999999
101,0.66938
102,0.5642199999999999
103,0.46246000000000004
104,0.36444
105,0.2607
106,0.16585999999999998
107,0.064968
108,-0.028535
109,-0.11497
110,-0.20464000000000002
111,-0.28129
112,-0.365
113,-0.44788
114,-0.51173
115,-0.58805
116,-0.65613
117,-0.71195
118,-0.78474
119,-0.84572
120,-0.90671
121,-0.95347
122,-1.0098
123,-1.0727
124,-1.1168
125,-1.1526
126,-1.1846
127,-1.225
128,-1.2582
129,-1.2839
130,-1.3014
131,-1.2914
132,-1.2918
133,-1.3025
134,-1.2855
135,-1.2605
136,-1.2278
137,-1.188
138,-1.1694
139,-1.1304
140,-1.0799
141,-1.0279
142,-0.96752
143,-0.93006
144,-0.86145
145,-0.80062
146,-0.73528
147,-0.67576
148,-0.6111800000000001
149,-0.53375
150,-0.4611
151,-0.38472
152,-0.30499
153,-0.22215
154,-0.12669
155,-0.035279000000000005
156,0.057214
157,0.1581
158,0.25527
159,0.35664
160,0.45815
161,0.5633
162,0.66845
163,0.77398
164,0.87876
165,0.9839100000000001
166,1.0891
167,1.1907
168,1.2899
169,1.3864
170,1.4751
171,1.5317
172,1.5913
173,1.6174
174,1.6215
175,1.6183
