time,value
0,-0.14927
1,-0.14927
2,-0.14927
3,-0.14927
4,-0.14927
5,-0.14927
6,-0.14927
7,-0.14927
8,-0.14927
9,-0.14927
10,-0.14927
11,-0.14927
12,-0.14927
13,-0.14927
14,-0.14927
15,-0.14927
16,-0.14927
17,-0.14927
18,-0.14927
19,-0.14927
20,-0.14927
21,-0.14927
22,-0.14927
23,-0.14927
24,-0.14927
25,-0.14927
26,-0.14927
27,-0.14927
28,-0.14927
29,-0.14927
30,-0.14927
31,-0.14927
32,-0.14927
33,-0.14927
34,-0.14927
35,-0.14927
36,8.9973
37,2.5947
38,2.2898
39,-0.14927
40,-0.14927
41,-0.14927
42,-0.14927
43,-0.14927
44,-0.14927
45,-0.14927
46,-0.14927
47,-0.14927
48,-0.14927
49,-0.14927
50,-0.14927
51,-0.14927
52,-0.14927
53,-0.14927
54,-0.14927
55,-0.14927
56,-0.14927
57,-0.14927
58,-0.14927
59,-0.14927
60,-0.14927
61,-0.14927
62,-0.14927
63,-0.14927
64,-0.14927
65,-0.14927
66,-0.14927
67,-0.14927
68,-0.14927
69,-0.14927
70,-0.14927
71,-0.14927
72,-0.14927
73,-0.14927
74,-0.14927
75,-0.14927
76,-0.14927
77,-0.14927
78,-0.14927
79,-0.14927
80,-0.14927
81,-0.14927
82,-0.14927
83,-0.14927
84,-0.14927
85,-0.14927
86,-0.14927
87,-0.14927
88,-0.14927
89,-0.14927
90,-0.14927
91,-0.14927
92,-0.14927
93,-0.14927
94,-0.14927
95,-0.14927
