time,value
0,-2.3148
1,-2.3148
2,-2.3148
3,-2.3148
4,-2.3148
5,-2.3148
6,-2.3148
7,-2.3148
8,-2.3148
9,-2.3146
10,-2.3144
11,-2.3141
12,-2.3135
13,-2.313
14,-2.3121
15,-2.3114
16,-2.3106
17,-2.3093
18,-2.3083
19,-2.3067
20,-2.3055
21,-2.3041
22,-2.3022
23,-2.3006
24,-2.2984
25,-2.2967
26,-2.2949
27,-2.2923
28,-2.2902
29,-2.2874
30,-2.2852
31,-2.2829
32,-2.282
33,-2.2795
34,-2.2769
35,-2.2734
36,-2.2706
37,-2.2668
38,-2.2639
39,-2.2609
40,-2.2568
41,-2.2536
42,-2.2493
43,-2.246
44,-2.2493
45,-2.2569
46,-2.2568
47,-2.252
48,-2.2484
49,-2.2446
50,-2.2396
51,-2.2358
52,-2.2305
53,-2.2265
54,-2.2225
55,-2.217
56,-2.2128
57,-2.2072
58,-2.2049
59,-2.2005
60,-2.1946
61,-2.1901
62,-2.1841
63,-2.1795
64,-2.1748
65,-2.1686
66,-2.1638
67,-2.1574
68,-2.1526
69,-2.1477
70,-2.1411
71,-2.1361
72,-2.1276
73,-2.1243
74,-2.1192
75,-2.1123
76,-2.1071
77,-2.1002
78,-2.0949
79,-2.0896
80,-2.0824
81,-2.0771
82,-2.0698
83,-2.0644
84,-2.0589
85,-2.0499
86,-2.046
87,-2.0385
88,-2.0329
89,-2.0272
90,-2.0197
91,-2.0139
92,-2.0063
93,-2.0005
94,-1.9947
95,-1.9869999999999999
96,-1.9811
97,-1.9753
98,-1.9674
99,-1.9615
100,-1.964
101,-1.9664
102,-1.9618
103,-1.9538
104,-1.9477
105,-1.9396
106,-1.9335
107,-1.9273
108,-1.9191
109,-1.913
110,-1.9061
111,-1.8999
112,-1.8936
113,-1.8853
114,-1.8777
115,-1.8706
116,-1.8643
117,-1.858
118,-1.8495
119,-1.8432
120,-1.8347
121,-1.8283
122,-1.8219
123,-1.8134
124,-1.8069
125,-1.7983
126,-1.7919
127,-1.7888
128,-1.7914
129,-1.7895
130,-1.7807
131,-1.7742
132,-1.7676
133,-1.7588
134,-1.7523
135,-1.7435
136,-1.7368
137,-1.7302
138,-1.7214
139,-1.7158
140,-1.7113
141,-1.7047
142,-1.6981
143,-1.6892
144,-1.6826
145,-1.6737
146,-1.6671
147,-1.6604
148,-1.6504
149,-1.6437
150,-1.6348
151,-1.6281
152,-1.6214
153,-1.6125
154,-1.6057
155,-1.6035
156,-1.6013
157,-1.5945
158,-1.5855
159,-1.5788
160,-1.5732
161,-1.5699
162,-1.5667
163,-1.5566
164,-1.5499
165,-1.5431
166,-1.5341
167,-1.5295
168,-1.5263
169,-1.5219999999999998
170,-1.5152
171,-1.5061
172,-1.4994
173,-1.4903
174,-1.4835
175,-1.4767
176,-1.4666
177,-1.4598
178,-1.4507
179,-1.4438
180,-1.4369999999999998
181,-1.4278
182,-1.421
183,-1.4164
184,-1.4141
185,-1.4096
186,-1.4017
187,-1.3985
188,-1.392
189,-1.3842
190,-1.3764
191,-1.3709
192,-1.3709
193,-1.3617
194,-1.3548
195,-1.348
196,-1.3388
197,-1.331
198,-1.3218
199,-1.3149
200,-1.308
201,-1.2979
202,-1.2928
203,-1.2877
204,-1.2808
205,-1.2739
206,-1.2647
207,-1.2578
208,-1.2477
209,-1.2408
210,-1.2339
211,-1.2247
212,-1.2177
213,-1.2085
214,-1.2016
215,-1.1946
216,-1.1854
217,-1.1784
218,-1.1691
219,-1.1622
220,-1.1596
221,-1.1537
222,-1.1468
223,-1.1398
224,-1.1306
225,-1.1236
226,-1.1143
227,-1.1074
228,-1.0995
229,-1.0903
230,-1.0833
231,-1.074
232,-1.067
233,-1.06
234,-1.0507
235,-1.0437
236,-1.0344
237,-1.0274
238,-1.0204
239,-1.0111
240,-1.0041
241,-0.9947
242,-0.9900200000000001
243,-0.9852299999999999
244,-0.97957
245,-0.97491
246,-0.96557
247,-0.95857
248,-0.9515600000000001
249,-0.94221
250,-0.93519
251,-0.9258299999999999
252,-0.91881
253,-0.9117799999999999
254,-0.90241
255,-0.8953700000000001
256,-0.8859899999999999
257,-0.87816
258,-0.8711200000000001
259,-0.8617299999999999
260,-0.8546799999999999
261,-0.8452799999999999
262,-0.8382299999999999
263,-0.8311700000000001
264,-0.82176
265,-0.8147
266,-0.80528
267,-0.7982100000000001
268,-0.79114
269,-0.78171
270,-0.77464
271,-0.7652
272,-0.75812
273,-0.7510399999999999
274,-0.74159
275,-0.7345
276,-0.72504
277,-0.71795
278,-0.71085
279,-0.70139
280,-0.69755
281,-0.69223
282,-0.68676
283,-0.67967
284,-0.6702100000000001
285,-0.6631199999999999
286,-0.6560199999999999
287,-0.64656
288,-0.63946
289,-0.6299899999999999
290,-0.62216
291,-0.61505
292,-0.60558
293,-0.59847
294,-0.5889800000000001
295,-0.58187
296,-0.57497
297,-0.5697
298,-0.5626
299,-0.55312
300,-0.54601
301,-0.53891
302,-0.52942
303,-0.52231
304,-0.5121
305,-0.5049899999999999
306,-0.49787
307,-0.48836999999999997
308,-0.48125
309,-0.47175
310,-0.46462
311,-0.45748999999999995
312,-0.44798999999999994
313,-0.44085
314,-0.43568
315,-0.43356000000000006
316,-0.42644
317,-0.41694
318,-0.40981999999999996
319,-0.40031
320,-0.39318000000000003
321,-0.38605
322,-0.37654
323,-0.3694
324,-0.35989
325,-0.35275
326,-0.34561
327,-0.3354
328,-0.32825
329,-0.31873
330,-0.31158
331,-0.30443000000000003
332,-0.2949
333,-0.28774
334,-0.28163
335,-0.27721
336,-0.27108000000000004
337,-0.26155
338,-0.25440999999999997
339,-0.2442
340,-0.23705
341,-0.2299
342,-0.21969
343,-0.21766
344,-0.21322
345,-0.20608
346,-0.19894
347,-0.18873
348,-0.18159
349,-0.17444
350,-0.16491
351,-0.15775999999999998
352,-0.15266
353,-0.1506
354,-0.14346
355,-0.13325
356,-0.12611
357,-0.11659000000000001
358,-0.10977
359,-0.10769000000000001
360,-0.097482
361,-0.090347
362,-0.08014
363,-0.073003
364,-0.06854299999999999
365,-0.060992
366,-0.053864999999999996
367,-0.043660000000000004
368,-0.03653
369,-0.0294
370,-0.024218
371,-0.019721000000000002
372,-0.010228000000000001
373,-0.0031033000000000002
374,0.0047257
375,0.014227000000000002
376,0.018012
377,0.02323
378,0.028687
379,0.035805000000000003
380,0.046007
381,0.053127
382,0.060955999999999996
383,0.06547
384,0.06763
385,0.07710800000000001
386,0.084221
387,0.093707
388,0.10153999999999999
389,0.10865
390,0.11814000000000001
391,0.12289000000000001
392,0.12525999999999998
393,0.12764
394,0.13476
395,0.14426
396,0.15208
397,0.15754
398,0.16062
399,0.16608
400,0.17628
401,0.18341
402,0.1929
403,0.20002999999999999
404,0.20002999999999999
405,0.20381
406,0.20594
407,0.21116999999999997
408,0.21425999999999998
409,0.22138000000000002
410,0.23158
411,0.23869
412,0.24581
413,0.25033
414,0.2525
415,0.25540999999999997
416,0.25998000000000004
417,0.26145
418,0.27091
419,0.27801
420,0.28747
421,0.29531
422,0.3024
423,0.31187
424,0.31897
425,0.32845
426,0.33318000000000003
427,0.33774
428,0.3454
429,0.3525
430,0.36196999999999996
431,0.36907
432,0.37617
433,0.38637
434,0.39347
435,0.40295
436,0.41005
437,0.41716000000000003
438,0.42006000000000004
439,0.42462
440,0.43409
441,0.44118999999999997
442,0.4483
443,0.45848999999999995
444,0.4656
445,0.47508
446,0.48126
447,0.48272
448,0.48982
449,0.49693000000000004
450,0.5064
451,0.51351
452,0.52062
453,0.5301
454,0.53484
455,0.5350699999999999
456,0.5391
457,0.54551
458,0.54815
459,0.54605
460,0.54566
461,0.5436
462,0.54223
463,0.54155
464,0.54155
465,0.53884
466,0.53817
467,0.5351100000000001
468,0.5331100000000001
469,0.53112
470,0.5233
471,0.51613
472,0.50897
473,0.49876000000000004
474,0.4916
475,0.48444
476,0.4749
477,0.4729
478,0.46787
479,0.4631
480,0.45593
481,0.44638
482,0.43856000000000006
483,0.42901000000000006
484,0.42185
485,0.41468999999999995
486,0.40792
487,0.40595
488,0.39573
489,0.38791
490,0.38075
491,0.37053
492,0.36683000000000004
493,0.36184
494,0.35706
495,0.34989000000000003
496,0.33966999999999997
497,0.3325
498,0.32706999999999997
499,0.32273
500,0.31840999999999997
501,0.31059000000000003
502,0.30341
503,0.29846
504,0.29417
505,0.28698
506,0.2774
507,0.27021
508,0.26
509,0.25282
510,0.24564
511,0.23845999999999998
512,0.23606
513,0.23367
514,0.22585
515,0.22282
516,0.21978000000000003
517,0.21436
518,0.20351
519,0.19569
520,0.1933
521,0.1909
522,0.18308
523,0.17526
524,0.17336
525,0.17148
526,0.1666
527,0.16476
528,0.15695
529,0.14975
530,0.14254
531,0.13233
532,0.12513
533,0.11553
534,0.10772000000000001
535,0.10347
536,0.096843
537,0.089639
538,0.08243500000000001
539,0.07222100000000001
540,0.06501900000000001
541,0.055416
542,0.048214
543,0.044587
544,0.039757
545,0.034345999999999995
546,0.024736
547,0.017529
548,0.009717700000000001
549,0.00011071
550,-0.0070942999999999996
551,-0.016699000000000002
552,-0.018525
553,-0.022736000000000003
554,-0.028144
555,-0.035354000000000003
556,-0.045568
557,-0.052779999999999994
558,-0.059986000000000005
559,-0.06479
560,-0.066569
561,-0.07619400000000001
562,-0.08341
563,-0.09121900000000001
564,-0.10084
565,-0.10443
566,-0.10919000000000001
567,-0.11218
568,-0.1194
569,-0.12962
570,-0.13684000000000002
571,-0.14465
572,-0.14822000000000002
573,-0.15236
574,-0.16017
575,-0.16797
576,-0.17209000000000002
577,-0.1762
578,-0.18159
579,-0.1918
580,-0.19904000000000002
581,-0.20869000000000001
582,-0.21166999999999997
583,-0.21575999999999998
584,-0.22466
585,-0.23246
586,-0.23894
587,-0.24298000000000003
588,-0.25077
589,-0.26098000000000005
590,-0.26259
591,-0.26711999999999997
592,-0.26868000000000003
593,-0.27021999999999996
594,-0.27851
595,-0.28629
596,-0.29265
597,-0.29414
598,-0.30241
599,-0.31261
600,-0.3165
601,-0.32037
602,-0.33057
603,-0.33443
604,-0.33871999999999997
605,-0.34009
606,-0.34145
607,-0.34321999999999997
608,-0.34452
609,-0.34623000000000004
610,-0.34748
611,-0.34872
612,-0.35033000000000003
613,-0.35151
614,-0.35306
615,-0.3542
616,-0.35531
617,-0.35677
618,-0.35783000000000004
619,-0.35641999999999996
620,-0.34906
621,-0.3417
622,-0.33189
623,-0.32452
624,-0.31471
625,-0.30768
626,-0.30032
627,-0.2905
628,-0.28313
629,-0.27331
630,-0.26595
631,-0.26415
632,-0.26297
633,-0.25590999999999997
634,-0.24608000000000002
635,-0.23870999999999998
636,-0.23164
637,-0.22180999999999998
638,-0.21443
639,-0.20765999999999998
640,-0.2061
641,-0.20175
642,-0.19191
643,-0.18453
644,-0.17469
645,-0.1673
646,-0.15992
647,-0.15008
648,-0.14297
649,-0.13313
650,-0.12574000000000002
651,-0.11835999999999999
652,-0.10851
653,-0.10112
654,-0.091274
655,-0.083886
656,-0.076501
657,-0.066651
658,-0.059262999999999996
659,-0.049413
660,-0.042025
661,-0.034638
662,-0.024784999999999998
663,-0.017397
664,-0.01001
665,0.00011071
666,0.0074977
667,0.017351
668,0.024741
669,0.032131
670,0.041984
671,0.049374
672,0.059226
673,0.066617
674,0.074269
675,0.084124
676,0.091515
677,0.09504
678,0.098048
679,0.10543
680,0.11528
681,0.12267
682,0.13252
683,0.14018
684,0.14756
685,0.15742
686,0.1648
687,0.17246
688,0.17575
689,0.17659
690,0.18642999999999998
691,0.19380999999999998
692,0.20365999999999998
693,0.21105
694,0.21843
695,0.22855999999999999
696,0.23594
697,0.24579
698,0.25317
699,0.26056
700,0.2704
701,0.27342
702,0.27702
703,0.28223000000000004
704,0.28961
705,0.29945
706,0.30712
707,0.31697
708,0.32435
709,0.33173
710,0.33505999999999997
711,0.3384
712,0.34853
713,0.35591
714,0.36329
715,0.37313
716,0.38051
717,0.39035
718,0.39773000000000003
719,0.40510999999999997
720,0.41523999999999994
721,0.42262
722,0.43246
723,0.43983999999999995
724,0.44722
725,0.45706
726,0.46445
727,0.47183
728,0.47429
729,0.47675
730,0.48413
731,0.48905
732,0.49151000000000006
733,0.4918
734,0.49946999999999997
735,0.50989
736,0.51727
737,0.52465
738,0.5345
739,0.5345
740,0.53784
741,0.54275
742,0.55043
743,0.55625
744,0.55962
745,0.56484
746,0.57221
747,0.5799
748,0.58973
749,0.59741
750,0.6008
751,0.60175
752,0.60912
753,0.61895
754,0.62632
755,0.63615
756,0.64352
757,0.65089
758,0.66072
759,0.66809
760,0.67792
761,0.68561
762,0.69298
763,0.70281
764,0.71019
765,0.72002
766,0.72739
767,0.73477
768,0.7446
769,0.75198
770,0.76181
771,0.76918
772,0.77656
773,0.7863899999999999
774,0.79377
775,0.80361
776,0.81098
777,0.8183600000000001
778,0.8282
779,0.83557
780,0.84541
781,0.8527899999999999
782,0.85585
783,0.8595299999999999
784,0.86721
785,0.8770399999999999
786,0.8844200000000001
787,0.89179
788,0.9016200000000001
789,0.909
790,0.91637
791,0.9262100000000001
792,0.9335899999999999
793,0.9437200000000001
794,0.9511
795,0.9584799999999999
796,0.96831
797,0.97539
798,0.9852200000000001
799,0.9926
800,0.99998
801,1.0098
802,1.0172
803,1.0270000000000001
804,1.0289
805,1.0314
806,1.0387
807,1.0461
808,1.056
809,1.0633
810,1.0707
811,1.0732
812,1.0738
813,1.0762
814,1.0762
815,1.0811
816,1.0885
817,1.0885
818,1.0984
819,1.1058
820,1.1076
821,1.1065
822,1.1087
823,1.1087
824,1.1111
825,1.1185
826,1.1284
827,1.1308
828,1.1333
829,1.133
830,1.1333
831,1.1358
832,1.1431
833,1.1456
834,1.1505
835,1.1579
836,1.168
837,1.1754
838,1.1853
839,1.1927
840,1.2
841,1.2099
842,1.2104
843,1.214
844,1.2214
845,1.2288
846,1.2386
847,1.2463
848,1.2561
849,1.2635
850,1.2709
851,1.2808
852,1.2881
853,1.2955
854,1.3054
855,1.3128
856,1.3226
857,1.3297
858,1.3371
859,1.347
860,1.3494
861,1.3494
862,1.3486
863,1.3478
864,1.3468
865,1.3459999999999999
866,1.3457
867,1.3430000000000002
868,1.3398
869,1.3366
870,1.3292
871,1.3193
872,1.3117
873,1.3043
874,1.2944
875,1.2868
876,1.2789
877,1.2782
878,1.2706
879,1.2607
880,1.2531
881,1.2432
882,1.2358
883,1.2284
884,1.2205
885,1.2174
886,1.212
887,1.2046
888,1.1972
889,1.1873
890,1.1799
891,1.17
892,1.1624
893,1.155
894,1.1451
895,1.1377
896,1.1279
897,1.1205
898,1.1202
899,1.1178
900,1.1128
901,1.103
902,1.0956
903,1.0882
904,1.0828
905,1.0825
906,1.0749
907,1.0675
908,1.0601
909,1.0502
910,1.0428
911,1.0404
912,1.035
913,1.0274
914,1.0197
915,1.0166
916,1.016
917,1.0061
918,0.9986799999999999
919,0.9888100000000001
920,0.98141
921,0.9740000000000001
922,0.9641299999999999
923,0.9565100000000001
924,0.9466399999999999
925,0.9392299999999999
926,0.9318299999999999
927,0.92196
928,0.91456
929,0.90469
930,0.89728
931,0.8898799999999999
932,0.8800100000000001
933,0.87261
934,0.86274
935,0.8553299999999999
936,0.84793
937,0.84031
938,0.8371799999999999
939,0.8340700000000001
940,0.8266700000000001
941,0.81926
942,0.8093899999999999
943,0.80177
944,0.7919
945,0.7844899999999999
946,0.77935
947,0.77604
948,0.77317
949,0.7632899999999999
950,0.75589
951,0.74848
952,0.7386
953,0.7309899999999999
954,0.72112
955,0.7137100000000001
956,0.7063
957,0.6986899999999999
958,0.69809
959,0.69257
960,0.68516
961,0.67775
962,0.66767
963,0.66027
964,0.65722
965,0.6542
966,0.64907
967,0.6391899999999999
968,0.63178
969,0.62171
970,0.6143
971,0.6068899999999999
972,0.59701
973,0.59647
974,0.5933
975,0.5858899999999999
976,0.5784699999999999
977,0.5685899999999999
978,0.56117
979,0.5535899999999999
980,0.5437
981,0.5362899999999999
982,0.5264
983,0.51881
984,0.51354
985,0.51041
986,0.5029899999999999
987,0.49294
988,0.48553
989,0.47811000000000003
990,0.47517
991,0.47223999999999994
992,0.4622
993,0.45478
994,0.44736000000000004
995,0.43746999999999997
996,0.43005
997,0.42016000000000003
998,0.41273999999999994
999,0.40531999999999996
1000,0.39543
1001,0.38800999999999997
1002,0.37811999999999996
1003,0.3707
1004,0.36329
1005,0.35339
1006,0.34598
1007,0.33608000000000005
1008,0.32852
1009,0.3211
1010,0.31121
1011,0.30379
1012,0.2939
1013,0.28648
1014,0.27906
1015,0.26916999999999996
1016,0.26175
1017,0.25186
1018,0.24444000000000002
1019,0.23703000000000002
1020,0.22714
1021,0.21971999999999997
1022,0.20983000000000002
1023,0.20240999999999998
1024,0.195
1025,0.18511
1026,0.17753
1027,0.17444
1028,0.16921
1029,0.16179000000000002
1030,0.15189
1031,0.14447000000000002
1032,0.13458
1033,0.12716
1034,0.1196
1035,0.10970999999999999
1036,0.10228999999999999
1037,0.092394
1038,0.084974
1039,0.077408
1040,0.074507
1041,0.07409600000000001
1042,0.066674
1043,0.056778999999999996
1044,0.049359
1045,0.039327999999999995
1046,0.031908
1047,0.024486
1048,0.016801
1049,0.013944
1050,0.008751700000000001
1051,0.0013287000000000002
1052,-0.0060953000000000005
1053,-0.016112
1054,-0.023536
1055,-0.033434
1056,-0.040858
1057,-0.043569
1058,-0.04649
1059,-0.051546
1060,-0.061551999999999996
1061,-0.064327
1062,-0.067084
1063,-0.072126
1064,-0.07964199999999999
1065,-0.084845
1066,-0.085075
1067,-0.087766
1068,-0.088018
1069,-0.09060700000000001
1070,-0.10057
1071,-0.10557000000000001
1072,-0.10572000000000001
1073,-0.10835
1074,-0.10845
1075,-0.10854000000000001
1076,-0.11352000000000001
1077,-0.11352000000000001
1078,-0.11356
1079,-0.11358
1080,-0.11358
1081,-0.11356
1082,-0.11352000000000001
1083,-0.1135
1084,-0.10852
1085,-0.098612
1086,-0.09118
1087,-0.088655
1088,-0.088531
1089,-0.08594
1090,-0.085759
1091,-0.083178
1092,-0.075691
1093,-0.068204
1094,-0.06554299999999999
1095,-0.062863
1096,-0.055433
1097,-0.048003
1098,-0.038099
1099,-0.030597000000000003
1100,-0.020692
1101,-0.013262999999999999
1102,-0.0082363
1103,-0.0054463
1104,-0.0028033000000000003
1105,0.0047137
1106,0.01223
1107,0.014985
1108,0.017759999999999998
1109,0.025187
1110,0.032612
1111,0.042615
1112,0.050043000000000004
1113,0.052949
1114,0.058127
1115,0.06566799999999999
1116,0.075565
1117,0.083106
1118,0.09300599999999999
1119,0.095845
1120,0.098702
1121,0.10873
1122,0.11615
1123,0.12605
1124,0.13347
1125,0.14089000000000002
1126,0.15079
1127,0.15821
1128,0.1681
1129,0.17553
1130,0.18295
1131,0.19284
1132,0.20026
1133,0.21015999999999999
1134,0.21758000000000002
1135,0.22501
1136,0.2349
1137,0.24233000000000002
1138,0.25222
1139,0.25977
1140,0.26707
1141,0.27709
1142,0.28451
1143,0.29441
1144,0.30183000000000004
1145,0.30926
1146,0.31915
1147,0.32658000000000004
1148,0.33647
1149,0.34389000000000003
1150,0.35131999999999997
1151,0.36121
1152,0.36864
1153,0.37853000000000003
1154,0.38595999999999997
1155,0.39338
1156,0.40328
1157,0.4107
1158,0.4206
1159,0.42801999999999996
1160,0.43533
1161,0.44522
1162,0.45265
1163,0.46255
1164,0.46997
1165,0.47739
1166,0.48728999999999995
1167,0.4946
1168,0.49673999999999996
1169,0.49888999999999994
1170,0.50631
1171,0.51622
1172,0.52364
1173,0.5310699999999999
1174,0.54097
1175,0.5484
1176,0.55819
1177,0.56572
1178,0.57305
1179,0.58295
1180,0.59037
1181,0.60027
1182,0.6077
1183,0.6151300000000001
1184,0.62503
1185,0.63246
1186,0.64236
1187,0.64978
1188,0.6572100000000001
1189,0.6671100000000001
1190,0.67197
1191,0.6744399999999999
1192,0.6793899999999999
1193,0.68682
1194,0.69672
1195,0.70415
1196,0.7091
1197,0.71157
1198,0.71643
1199,0.72634
1200,0.7337600000000001
1201,0.74366
1202,0.7510899999999999
1203,0.75852
1204,0.76842
1205,0.7708
1206,0.77294
1207,0.77789
1208,0.7853100000000001
1209,0.7952199999999999
1210,0.80265
1211,0.81255
1212,0.8199799999999999
1213,0.8273299999999999
1214,0.8372299999999999
1215,0.8446600000000001
1216,0.85456
1217,0.8619899999999999
1218,0.8694200000000001
1219,0.87933
1220,0.88675
1221,0.89674
1222,0.90417
1223,0.91159
1224,0.9215
1225,0.9289299999999999
1226,0.9388299999999999
1227,0.94626
1228,0.9536899999999999
1229,0.96359
1230,0.9710200000000001
1231,0.97845
1232,0.98835
1233,0.9957799999999999
1234,1.0057
1235,1.0131
1236,1.0205
1237,1.0304
1238,1.0379
1239,1.0478
1240,1.0552
1241,1.0626
1242,1.0725
1243,1.08
1244,1.0899
1245,1.0973
1246,1.1047
1247,1.1146
1248,1.1221
1249,1.1320000000000001
1250,1.1394
1251,1.1468
1252,1.1567
1253,1.1642
1254,1.1741
1255,1.1815
1256,1.1889
1257,1.1988
1258,1.2063
1259,1.2162
1260,1.2236
1261,1.2309999999999999
1262,1.2409
1263,1.2484
1264,1.2583
1265,1.2657
1266,1.2731
1267,1.2806
1268,1.2833
1269,1.2885
1270,1.296
1271,1.3012
1272,1.304
1273,1.3116
1274,1.3215
1275,1.324
1276,1.324
1277,1.3339
1278,1.3413
1279,1.3463
1280,1.3487
1281,1.3537
1282,1.3635
1283,1.3657
1284,1.3654
1285,1.3678
1286,1.3678
1287,1.3728
1288,1.3801
1289,1.3825
1290,1.3849
1291,1.3923
1292,1.4021
1293,1.4095
1294,1.4169
1295,1.4244
1296,1.4269999999999998
1297,1.4321
1298,1.4395
1299,1.4469
1300,1.4568
1301,1.4593
1302,1.4618
1303,1.4668
1304,1.4742
1305,1.4841
1306,1.4916
1307,1.5015
1308,1.5089
1309,1.5164
1310,1.5263
1311,1.5337
1312,1.5436
1313,1.551
1314,1.5584
1315,1.5684
1316,1.5758
1317,1.5857
1318,1.5932
1319,1.6006
1320,1.6105
1321,1.6179
1322,1.6278
1323,1.6353
1324,1.6379
1325,1.6382
1326,1.6383
1327,1.6384
1328,1.6387
1329,1.6389
1330,1.639
1331,1.6391
1332,1.6395
1333,1.6372
1334,1.6299
1335,1.6226
1336,1.6204
1337,1.6158
1338,1.6084
1339,1.601
1340,1.5911
1341,1.5837
1342,1.5739
1343,1.5665
1344,1.5590000000000002
1345,1.5491
1346,1.5444
1347,1.5425
1348,1.5376
1349,1.5302
1350,1.5205
1351,1.5130000000000001
1352,1.5058
1353,1.5037
1354,1.5016
1355,1.4918
1356,1.4843
1357,1.4769
1358,1.4669999999999999
1359,1.4597
1360,1.4499
1361,1.4424
1362,1.435
1363,1.4251
1364,1.4177
1365,1.4080000000000001
1366,1.4081
1367,1.4056
1368,1.3982
1369,1.3908
1370,1.3811
1371,1.3738
1372,1.374
1373,1.3716
1374,1.3693
1375,1.3619
1376,1.3545
1377,1.3495
1378,1.3471
1379,1.3446
1380,1.3349
1381,1.3303
1382,1.3283
1383,1.3237
1384,1.3163
1385,1.3064
1386,1.2990000000000002
1387,1.2916
1388,1.2817
1389,1.2743
1390,1.2644
1391,1.2570000000000001
1392,1.2495
1393,1.2397
1394,1.237
1395,1.2339
1396,1.2287
1397,1.2212
1398,1.2113
1399,1.2039
1400,1.194
1401,1.1866
1402,1.1791
1403,1.1693
1404,1.1618
1405,1.1520000000000001
1406,1.1445
1407,1.1373
1408,1.1325
1409,1.1306
1410,1.126
1411,1.1186
1412,1.1112
1413,1.1013
1414,1.0941
1415,1.0842
1416,1.0768
1417,1.0694
1418,1.0595
1419,1.0547
1420,1.0528
1421,1.0509
1422,1.0435
1423,1.0336
1424,1.0262
1425,1.0190000000000001
1426,1.0092
1427,1.0017
1428,0.99721
1429,0.99536
1430,0.9933200000000001
1431,0.98345
1432,0.97604
1433,0.9661700000000001
1434,0.9587600000000001
1435,0.95136
1436,0.9414899999999999
1437,0.9343
1438,0.92443
1439,0.9170200000000001
1440,0.9096200000000001
1441,0.89975
1442,0.89235
1443,0.8824799999999999
1444,0.8750700000000001
1445,0.86767
1446,0.8629600000000001
1447,0.8611700000000001
1448,0.85446
1449,0.84706
1450,0.8396600000000001
1451,0.8298
1452,0.8224
1453,0.81253
1454,0.80513
1455,0.79774
1456,0.7881100000000001
1457,0.78071
1458,0.77085
1459,0.76345
1460,0.7560600000000001
1461,0.74644
1462,0.74422
1463,0.74275
1464,0.73561
1465,0.72821
1466,0.71836
1467,0.71097
1468,0.70111
1469,0.69372
1470,0.6863199999999999
1471,0.67647
1472,0.66908
1473,0.65922
1474,0.65183
1475,0.64444
1476,0.63459
1477,0.6316
1478,0.62812
1479,0.6229399999999999
1480,0.61554
1481,0.60569
1482,0.59829
1483,0.5909
1484,0.58104
1485,0.5736399999999999
1486,0.56379
1487,0.5563899999999999
1488,0.5489999999999999
1489,0.5465399999999999
1490,0.5440699999999999
1491,0.53422
1492,0.53175
1493,0.5292899999999999
1494,0.52436
1495,0.5169699999999999
1496,0.5071100000000001
1497,0.49972
1498,0.49233000000000005
1499,0.48248
1500,0.47508999999999996
1501,0.46523000000000003
1502,0.45783999999999997
1503,0.45045
1504,0.4406
1505,0.43321000000000004
1506,0.42308999999999997
1507,0.4157
1508,0.40831
1509,0.39846
1510,0.39107
1511,0.38122
1512,0.37383
1513,0.37303000000000003
1514,0.36707
1515,0.35968
1516,0.34981999999999996
1517,0.34243
1518,0.33504
1519,0.32518
1520,0.31779
1521,0.30794
1522,0.30055
1523,0.29315
1524,0.28823000000000004
1525,0.28576
1526,0.27591
1527,0.27344
1528,0.27098
1529,0.26632
1530,0.2592
1531,0.24961
1532,0.2425
1533,0.23510999999999999
1534,0.23019
1535,0.228
1536,0.22116999999999998
1537,0.21379
1538,0.2064
1539,0.19684000000000001
1540,0.18946
1541,0.17962
1542,0.17252
1543,0.17094
1544,0.16937
1545,0.162
1546,0.15462
1547,0.14509
1548,0.13771
1549,0.13618
1550,0.13467
1551,0.13008
1552,0.12057999999999999
1553,0.11878
1554,0.11765
1555,0.11308
1556,0.10572000000000001
1557,0.096246
1558,0.088886
1559,0.082219
1560,0.080825
1561,0.076638
1562,0.067196
1563,0.065477
1564,0.066963
1565,0.06565
1566,0.06680499999999999
1567,0.06553400000000001
1568,0.058196000000000005
1569,0.048413
1570,0.041476
1571,0.03414
1572,0.032909
1573,0.03414
1574,0.035808
1575,0.034641000000000005
1576,0.035934
1577,0.037685
1578,0.039021
1579,0.034595999999999995
1580,0.035047
1581,0.036414
1582,0.038265
1583,0.039675
1584,0.041582
1585,0.042549000000000003
1586,0.042549000000000003
1587,0.052751
1588,0.060042
1589,0.067813
1590,0.06927699999999999
1591,0.070759
1592,0.075186
1593,0.07671
1594,0.084491
1595,0.092275
1596,0.095726
1597,0.10022
1598,0.10801
1599,0.1177
1600,0.12548
1601,0.13275
1602,0.13812
1603,0.14211
1604,0.14801
1605,0.1558
1606,0.16305999999999998
1607,0.17327
1608,0.18053
1609,0.18454
1610,0.1867
1611,0.19395
1612,0.20362
1613,0.21088
1614,0.21813000000000002
1615,0.22834000000000002
1616,0.2356
1617,0.24527
1618,0.25253000000000003
1619,0.25979
1620,0.26381
1621,0.26785
1622,0.27806
1623,0.28531
1624,0.29257
1625,0.30224
1626,0.30949
1627,0.31917
1628,0.32696
1629,0.33421999999999996
1630,0.34389000000000003
1631,0.35115
1632,0.36083000000000004
1633,0.36809000000000003
1634,0.37535999999999997
1635,0.38314000000000004
1636,0.38716
1637,0.39118
1638,0.39844
1639,0.40569
1640,0.41536999999999996
1641,0.42263
1642,0.43231
1643,0.43956000000000006
1644,0.44683
1645,0.45651
1646,0.46376999999999996
1647,0.47345
1648,0.48123999999999995
1649,0.48851000000000006
1650,0.49818999999999997
1651,0.50546
1652,0.51515
1653,0.52241
1654,0.52968
1655,0.53937
1656,0.54283
1657,0.5473399999999999
1658,0.55271
1659,0.55997
1660,0.56966
1661,0.57692
1662,0.5866100000000001
1663,0.5944
1664,0.6016600000000001
1665,0.61135
1666,0.61862
1667,0.6245
1668,0.62849
1669,0.63197
1670,0.64165
1671,0.64891
1672,0.65618
1673,0.66586
1674,0.67313
1675,0.68281
1676,0.69008
1677,0.69734
1678,0.70755
1679,0.71482
1680,0.72451
1681,0.73178
1682,0.73905
1683,0.74874
1684,0.7560100000000001
1685,0.7638
1686,0.76777
1687,0.77123
1688,0.7814399999999999
1689,0.7887
1690,0.7984
1691,0.80618
1692,0.81345
1693,0.82314
1694,0.8266
1695,0.83111
1696,0.8364799999999999
1697,0.8437399999999999
1698,0.8534299999999999
1699,0.86069
1700,0.8709
1701,0.87816
1702,0.8854299999999999
1703,0.8923700000000001
1704,0.89395
1705,0.90364
1706,0.91089
1707,0.9181600000000001
1708,0.92784
1709,0.9351
1710,0.94479
1711,0.95257
1712,0.9598399999999999
1713,0.9695299999999999
1714,0.9767899999999999
1715,0.9864799999999999
1716,0.9899399999999999
1717,0.9939399999999999
1718,1.0023
1719,1.0095
1720,1.0192
1721,1.0265
1722,1.0337
1723,1.0434
1724,1.0512
1725,1.0609
1726,1.0682
1727,1.0754
1728,1.0851
1729,1.091
1730,1.0955
1731,1.1033
1732,1.1111
1733,1.117
1734,1.117
1735,1.1218
1736,1.1320000000000001
1737,1.1398
1738,1.15
1739,1.1578
1740,1.1608
1741,1.1632
1742,1.168
1743,1.1753
1744,1.1777
1745,1.1801
1746,1.1904
1747,1.1952
1748,1.1976
1749,1.1981
1750,1.2059
1751,1.2161
1752,1.2215
1753,1.225
1754,1.228
1755,1.2352
1756,1.2376
1757,1.24
1758,1.2497
1759,1.2575
1760,1.2648
1761,1.2745
1762,1.2785
1763,1.2830000000000001
1764,1.2903
1765,1.2975
1766,1.3078
1767,1.315
1768,1.3209
1769,1.325
1770,1.3309
1771,1.3406
1772,1.3478
1773,1.3575
1774,1.3653
1775,1.3725
1776,1.3822
1777,1.3895
1778,1.3991
1779,1.4026
1780,1.4043
1781,1.4078
1782,1.4083
1783,1.4094
1784,1.4111
1785,1.4111
1786,1.4116
1787,1.4109
1788,1.4131
1789,1.4083
1790,1.4011
1791,1.3914
1792,1.3848
1793,1.3751
1794,1.3679
1795,1.3607
1796,1.351
1797,1.3438
1798,1.3366
1799,1.327
1800,1.3197
1801,1.3101
1802,1.3029
1803,1.2957
1804,1.286
1805,1.2818
1806,1.2818
1807,1.2781
1808,1.2709
1809,1.2619
1810,1.2547
1811,1.2487
1812,1.2481
1813,1.2445
1814,1.2349
1815,1.2277
1816,1.2181
1817,1.2109
1818,1.2037
1819,1.1941
1820,1.187
1821,1.1791
1822,1.1749
1823,1.1706
1824,1.161
1825,1.1538
1826,1.1442
1827,1.1364
1828,1.1292
1829,1.1196
1830,1.1124
1831,1.1028
1832,1.0974
1833,1.0956
1834,1.0889
1835,1.0817
1836,1.0721
1837,1.0643
1838,1.0571
1839,1.0547
1840,1.0523
1841,1.0451
1842,1.0379
1843,1.0301
1844,1.0271
1845,1.0217
1846,1.0108
1847,1.003
1848,0.99582
1849,0.9934200000000001
1850,0.9910200000000001
1851,0.98383
1852,0.9766299999999999
1853,0.96944
1854,0.95985
1855,0.95265
1856,0.9424399999999999
1857,0.93525
1858,0.93045
1859,0.92806
1860,0.9215
1861,0.91671
1862,0.9155700000000001
1863,0.9114200000000001
1864,0.90248
1865,0.89595
1866,0.89659
1867,0.89181
1868,0.8846299999999999
1869,0.8750600000000001
1870,0.8678899999999999
1871,0.86072
1872,0.85116
1873,0.84399
1874,0.8350799999999999
1875,0.8279200000000001
1876,0.82075
1877,0.8112
1878,0.80404
1879,0.7944899999999999
1880,0.78799
1881,0.78322
1882,0.78084
1883,0.77845
1884,0.76891
1885,0.76175
1886,0.7546
1887,0.74983
1888,0.74745
1889,0.742
1890,0.73485
1891,0.7277
1892,0.71817
1893,0.71102
1894,0.70149
1895,0.69434
1896,0.6872
1897,0.67767
1898,0.6705300000000001
1899,0.66101
1900,0.65387
1901,0.64673
1902,0.63653
1903,0.62939
1904,0.61988
1905,0.61274
1906,0.60561
1907,0.5961
1908,0.5930300000000001
1909,0.5930300000000001
1910,0.5859
1911,0.57807
1912,0.56786
1913,0.56003
1914,0.54913
1915,0.54913
1916,0.54437
1917,0.53487
1918,0.53557
1919,0.5346
1920,0.52985
1921,0.52273
1922,0.5132399999999999
1923,0.51015
1924,0.50944
1925,0.5009100000000001
1926,0.49616000000000005
1927,0.49378
1928,0.49141
1929,0.48428999999999994
1930,0.47408
1931,0.46696000000000004
1932,0.45747
1933,0.45533999999999997
1934,0.45085
1935,0.44301999999999997
1936,0.43588999999999994
1937,0.42639
1938,0.41927
1939,0.41215
1940,0.40266
1941,0.39554
1942,0.38534
1943,0.37822
1944,0.3711
1945,0.36162
1946,0.35616
1947,0.35236
1948,0.34998
1949,0.34287
1950,0.33339
1951,0.32555
1952,0.31463
1953,0.30917
1954,0.30917
1955,0.30443000000000003
1956,0.29732
1957,0.29495
1958,0.29258
1959,0.28784
1960,0.27836
1961,0.27125
1962,0.26178
1963,0.25395
1964,0.24685
1965,0.23738
1966,0.23519
1967,0.22993000000000002
1968,0.22282
1969,0.21570999999999999
1970,0.20623000000000002
1971,0.19912
1972,0.18965
1973,0.18255
1974,0.17545
1975,0.16598
1976,0.15889
1977,0.14943
1978,0.14234000000000002
1979,0.13524
1980,0.13512000000000002
1981,0.13501
1982,0.12869
1983,0.12162
1984,0.11454
1985,0.10511
1986,0.098048
1987,0.09097899999999999
1988,0.08156000000000001
1989,0.07527
1990,0.065859
1991,0.0588
1992,0.051745000000000006
1993,0.042343
1994,0.035289999999999995
1995,0.025893
1996,0.018847
1997,0.011801
1998,0.0024116999999999997
1999,-0.0046293
2000,-0.014011000000000001
2001,-0.021047
2002,-0.02808
2003,-0.0272
2004,-0.027101
2005,-0.034117
2006,-0.041131
2007,-0.048142000000000004
2008,-0.057489
2009,-0.06449500000000001
2010,-0.073835
2011,-0.080836
2012,-0.087003
2013,-0.097165
2014,-0.10415999999999999
2015,-0.11348
2016,-0.12047000000000001
2017,-0.12746
2018,-0.13677
2019,-0.14375
2020,-0.15306
2021,-0.16004000000000002
2022,-0.16701
2023,-0.17544
2024,-0.18327000000000002
2025,-0.19255999999999998
2026,-0.19865
2027,-0.20648000000000002
2028,-0.21488000000000002
2029,-0.22183000000000003
2030,-0.23109000000000002
2031,-0.23804
2032,-0.24498000000000003
2033,-0.25424
2034,-0.26116999999999996
2035,-0.27042
2036,-0.27735
2037,-0.28426999999999997
2038,-0.29351
2039,-0.30043000000000003
2040,-0.30965
2041,-0.31565
2042,-0.31935
2043,-0.31797
2044,-0.32163
2045,-0.33082
2046,-0.33771
2047,-0.34459
2048,-0.35375999999999996
2049,-0.36063
2050,-0.36751
2051,-0.37666
2052,-0.38353000000000004
2053,-0.39268000000000003
2054,-0.39953
2055,-0.40639000000000003
2056,-0.41552
2057,-0.42236
2058,-0.43149
2059,-0.43832
2060,-0.44418
2061,-0.45328999999999997
2062,-0.46011
2063,-0.4692
2064,-0.47602
2065,-0.47531
2066,-0.47357
2067,-0.47808999999999996
2068,-0.48613
2069,-0.49291
2070,-0.49968
2071,-0.50543
2072,-0.5046
2073,-0.5059899999999999
2074,-0.51169
2075,-0.51513
2076,-0.5131600000000001
2077,-0.51103
2078,-0.51891
2079,-0.52561
2080,-0.5223899999999999
2081,-0.52028
2082,-0.52587
2083,-0.53476
2084,-0.53146
2085,-0.5281399999999999
2086,-0.52589
2087,-0.52253
2088,-0.52468
2089,-0.5312899999999999
2090,-0.53676
2091,-0.54555
2092,-0.55215
2093,-0.54973
2094,-0.5462600000000001
2095,-0.55282
2096,-0.55165
2097,-0.54814
2098,-0.54343
2099,-0.53987
2100,-0.5363
2101,-0.53151
2102,-0.53151
2103,-0.52381
2104,-0.52141
2105,-0.51562
2106,-0.50672
2107,-0.49901999999999996
2108,-0.49323
2109,-0.48741999999999996
2110,-0.47852
2111,-0.46988
2112,-0.46623000000000003
2113,-0.46256
2114,-0.4555
2115,-0.45178999999999997
2116,-0.44503000000000004
2117,-0.43859
2118,-0.43306000000000006
2119,-0.42596000000000006
2120,-0.42222
2121,-0.41366
2122,-0.40723000000000004
2123,-0.40079000000000004
2124,-0.3922
2125,-0.38452
2126,-0.37590999999999997
2127,-0.36945
2128,-0.36299000000000003
2129,-0.35436
2130,-0.3507
2131,-0.34365
2132,-0.33719
2133,-0.33073
2134,-0.32089
2135,-0.31442
2136,-0.30888000000000004
2137,-0.30307
2138,-0.2994
2139,-0.28956
2140,-0.2831
2141,-0.27604
2142,-0.27021
2143,-0.26375
2144,-0.25392
2145,-0.24745999999999999
2146,-0.23884
2147,-0.23517
2148,-0.22934000000000002
2149,-0.2195
2150,-0.21304
2151,-0.20442000000000002
2152,-0.19795
2153,-0.19025999999999998
2154,-0.18162
2155,-0.17514000000000002
2156,-0.16648
2157,-0.15997999999999998
2158,-0.15637
2159,-0.14937
2160,-0.14289000000000002
2161,-0.13424
2162,-0.12654
2163,-0.12004000000000001
2164,-0.1133
2165,-0.10752
2166,-0.10078
2167,-0.093082
2168,-0.087548
2169,-0.080542
2170,-0.073793
2171,-0.06515399999999999
2172,-0.058669000000000006
2173,-0.05218
2174,-0.043519
2175,-0.037021
2176,-0.030514999999999997
2177,-0.020640000000000002
2178,-0.014127
2179,-0.0054393
2180,0.0010837
2181,0.007611700000000001
2182,0.016323
2183,0.022858
2184,0.031581
2185,0.038129
2186,0.044679
2187,0.053422000000000004
2188,0.05998200000000001
2189,0.06683
2190,0.072525
2191,0.079073
2192,0.087813
2193,0.094374
2194,0.10428
2195,0.11085
2196,0.11742000000000001
2197,0.12528
2198,0.13095
2199,0.14085999999999999
2200,0.14859
2201,0.15516
2202,0.16392
2203,0.16958
2204,0.1786
2205,0.18633
2206,0.19289
2207,0.19973
2208,0.20324
2209,0.21314
2210,0.22086
2211,0.22436999999999999
2212,0.23444
2213,0.24099
2214,0.25089
2215,0.25744
2216,0.264
2217,0.27086
2218,0.27656
2219,0.28428000000000003
2220,0.29081999999999997
2221,0.29434
2222,0.30123
2223,0.30777
2224,0.31767
2225,0.3212
2226,0.32693
2227,0.33464
2228,0.34235
2229,0.34808
2230,0.35381999999999997
2231,0.35935
2232,0.36924
2233,0.37498000000000004
2234,0.38193
2235,0.38552
2236,0.38913000000000003
2237,0.39587
2238,0.40357
2239,0.4079
2240,0.41488
2241,0.41851000000000005
2242,0.42716000000000004
2243,0.43486
2244,0.43849
2245,0.44335
2246,0.44701
2247,0.45191000000000003
2248,0.4556
2249,0.4593
2250,0.46426000000000006
2251,0.46798999999999996
2252,0.47298999999999997
2253,0.47675
2254,0.48052
2255,0.48557
2256,0.48936
2257,0.49445
2258,0.49828
2259,0.50212
2260,0.50726
2261,0.51112
2262,0.50267
2263,0.49633
2264,0.49
2265,0.48157
2266,0.47525
2267,0.46683
2268,0.46052
2269,0.45421000000000006
2270,0.44582
2271,0.43951999999999997
2272,0.43113999999999997
2273,0.42485
2274,0.41857
2275,0.41041000000000005
2276,0.40644
2277,0.39674
2278,0.39046
2279,0.38285
2280,0.37449
2281,0.37106999999999996
2282,0.36367
2283,0.35683000000000004
2284,0.35055
2285,0.34086
2286,0.33459
2287,0.32566
2288,0.31958000000000003
2289,0.31274
2290,0.30438000000000004
2291,0.29811
2292,0.28976
2293,0.2835
2294,0.27725
2295,0.26758000000000004
2296,0.26134
2297,0.25303000000000003
2298,0.2468
2299,0.24056999999999998
2300,0.23228000000000001
2301,0.22607
2302,0.21986
2303,0.21164000000000002
2304,0.20756
2305,0.19791
2306,0.1917
2307,0.1855
2308,0.17724
2309,0.17105
2310,0.1628
2311,0.15662
2312,0.14907
2313,0.14084000000000002
2314,0.13468
2315,0.12647
2316,0.12032000000000001
2317,0.11417999999999999
2318,0.106
2319,0.099866
2320,0.090298
2321,0.08404500000000001
2322,0.079202
2323,0.071671
2324,0.065544
2325,0.057386
2326,0.051272000000000005
2327,0.045167
2328,0.037034
2329,0.029522000000000003
2330,0.021406
2331,0.015324
2332,0.009251700000000002
2333,0.0011607000000000002
2334,-0.0048963
2335,-0.012968
2336,-0.018438
2337,-0.024773
2338,-0.033119
2339,-0.039174
2340,-0.048677
2341,-0.054720000000000005
2342,-0.060757000000000005
2343,-0.068548
2344,-0.072869
2345,-0.082372
2346,-0.08985900000000001
2347,-0.096196
2348,-0.10253
2349,-0.10858
2350,-0.11664000000000001
2351,-0.12412999999999999
2352,-0.13016
2353,-0.13819
2354,-0.14420999999999998
2355,-0.15259
2356,-0.15895
2357,-0.16442
2358,-0.17244
2359,-0.17991
2360,-0.18792999999999999
2361,-0.19339
2362,-0.19977
2363,-0.20815
2364,-0.21416
2365,-0.22016
2366,-0.22962
2367,-0.23560999999999999
2368,-0.24347
2369,-0.24986
2370,-0.25586
2371,-0.26385
2372,-0.26983
2373,-0.27926999999999996
2374,-0.28524
2375,-0.2912
2376,-0.29814
2377,-0.30456
2378,-0.31149
2379,-0.31745999999999996
2380,-0.3249
2381,-0.33284
2382,-0.33878
2383,-0.34671
2384,-0.34967
2385,-0.35711
2386,-0.36504000000000003
2387,-0.37098000000000003
2388,-0.37889
2389,-0.38481
2390,-0.39223
2391,-0.4001
2392,-0.406
2393,-0.41385
2394,-0.41884
2395,-0.42336999999999997
2396,-0.43228
2397,-0.43817
2398,-0.44753000000000004
2399,-0.45341000000000004
2400,-0.45928
2401,-0.46708999999999995
2402,-0.47447
2403,-0.48253
2404,-0.48753
2405,-0.49338999999999994
2406,-0.5011800000000001
2407,-0.50702
2408,-0.5163300000000001
2409,-0.5221600000000001
2410,-0.5279699999999999
2411,-0.53571
2412,-0.5415
2413,-0.5504
2414,-0.55699
2415,-0.56202
2416,-0.5697399999999999
2417,-0.57552
2418,-0.58478
2419,-0.59055
2420,-0.59524
2421,-0.6034
2422,-0.60918
2423,-0.6168600000000001
2424,-0.6241899999999999
2425,-0.6299399999999999
2426,-0.63848
2427,-0.6451
2428,-0.65051
2429,-0.65818
2430,-0.66392
2431,-0.67313
2432,-0.67885
2433,-0.6845600000000001
2434,-0.69216
2435,-0.69693
2436,-0.70518
2437,-0.7108899999999999
2438,-0.71818
2439,-0.72675
2440,-0.73341
2441,-0.7407100000000001
2442,-0.748
2443,-0.75466
2444,-0.7609899999999999
2445,-0.76672
2446,-0.7759199999999999
2447,-0.78162
2448,-0.7873100000000001
2449,-0.7927
2450,-0.79938
2451,-0.80795
2452,-0.81523
2453,-0.8206200000000001
2454,-0.82889
2455,-0.83396
2456,-0.84316
2457,-0.84854
2458,-0.8552200000000001
2459,-0.86188
2460,-0.86759
2461,-0.87677
2462,-0.88246
2463,-0.88813
2464,-0.8967200000000001
2465,-0.90151
2466,-0.90879
2467,-0.91607
2468,-0.9211600000000001
2469,-0.92943
2470,-0.9367200000000001
2471,-0.94589
2472,-0.95068
2473,-0.95735
2474,-0.9662299999999999
2475,-0.9719200000000001
2476,-0.9786
2477,-0.9852700000000001
2478,-0.99066
2479,-0.99985
2480,-1.0049
2481,-1.0151
2482,-1.0186
2483,-1.0259
2484,-1.0344
2485,-1.0411
2486,-1.0484
2487,-1.0541
2488,-1.0614
2489,-1.069
2490,-1.0743
2491,-1.081
2492,-1.0877
2493,-1.095
2494,-1.1039
2495,-1.1106
2496,-1.1156
2497,-1.1248
2498,-1.1302
2499,-1.1385
2500,-1.1436
2501,-1.1508
2502,-1.1597
2503,-1.1664
2504,-1.1753
2505,-1.1826
2506,-1.1911
2507,-1.1994
2508,-1.2032
2509,-1.2108
2510,-1.2181
2511,-1.2238
2512,-1.2342
2513,-1.239
2514,-1.2482
2515,-1.2571
2516,-1.2619
2517,-1.2704
2518,-1.2761
2519,-1.2853
2520,-1.291
2521,-1.2966
2522,-1.3052
2523,-1.31
2524,-1.3192
2525,-1.3264
2526,-1.3313
2527,-1.3396
2528,-1.3452
2529,-1.3559999999999999
2530,-1.3627
2531,-1.3675
2532,-1.3767
2533,-1.3823
2534,-1.3906
2535,-1.3973
2536,-1.4046
2537,-1.4135
2538,-1.4201
2539,-1.429
2540,-1.4363
2541,-1.443
2542,-1.4496
2543,-1.4569
2544,-1.4661
2545,-1.4709
2546,-1.4776
2547,-1.4864
2548,-1.4921
2549,-1.5004
2550,-1.5051
2551,-1.5118
2552,-1.518
2553,-1.5254
2554,-1.5327
2555,-1.5428
2556,-1.5513
2557,-1.5606
2558,-1.5656
2559,-1.5722
2560,-1.5792
2561,-1.5865
2562,-1.5935
2563,-1.6001
2564,-1.6051
2565,-1.6144
2566,-1.6198
2567,-1.6279
2568,-1.633
2569,-1.6388
2570,-1.6465
2571,-1.6538
2572,-1.6615
2573,-1.6662
2574,-1.6728
2575,-1.6821
2576,-1.6878
2577,-1.6971
2578,-1.7028
2579,-1.7085
2580,-1.7161
2581,-1.7214
2582,-1.7297
2583,-1.7348
2584,-1.7405
2585,-1.7496
2586,-1.7553
2587,-1.7628
2588,-1.7695
2589,-1.7744
2590,-1.7816
2591,-1.7873
2592,-1.7947
2593,-1.8003
2594,-1.8059
2595,-1.8149
2596,-1.8204
2597,-1.8277
2598,-1.8332
2599,-1.8386
2600,-1.8458
2601,-1.8528
2602,-1.8614
2603,-1.8685
2604,-1.8739
2605,-1.8811
2606,-1.8864
2607,-1.8952
2608,-1.9005
2609,-1.9057
2610,-1.9127
2611,-1.9178
2612,-1.9267
2613,-1.9354
2614,-1.9406
2615,-1.9475
2616,-1.9526
2617,-1.9577
2618,-1.9645
2619,-1.9713
2620,-1.9779
2621,-1.9829
2622,-1.9878
2623,-1.9943
2624,-1.9991
2625,-2.0099
2626,-2.0172
2627,-2.022
2628,-2.0284
2629,-2.0331
2630,-2.0413
2631,-2.046
2632,-2.0506
2633,-2.0567
2634,-2.0613
2635,-2.0678
2636,-2.0752
2637,-2.0811
2638,-2.0871
2639,-2.0915
2640,-2.0974
2641,-2.1018
2642,-2.1061
2643,-2.1118
2644,-2.1180000000000003
2645,-2.1236
2646,-2.1277
2647,-2.1317
2648,-2.137
2649,-2.141
2650,-2.1461
2651,-2.1499
2652,-2.1537
2653,-2.1586
2654,-2.1651
2655,-2.1728
2656,-2.1786
2657,-2.1822
2658,-2.187
2659,-2.1904
2660,-2.195
2661,-2.1983
2662,-2.2016
2663,-2.2059
2664,-2.209
2665,-2.2131
2666,-2.2184
2667,-2.2213
2668,-2.2251
2669,-2.2278
2670,-2.2314
2671,-2.234
2672,-2.2418
2673,-2.2497
2674,-2.2545
2675,-2.2578
2676,-2.2601
2677,-2.2624
2678,-2.2653
2679,-2.2674
2680,-2.2695
2681,-2.272
2682,-2.2739
2683,-2.2762
2684,-2.2778
2685,-2.2794
2686,-2.2813
2687,-2.2827
2688,-2.2843
2689,-2.2855
2690,-2.289
2691,-2.2903
2692,-2.2912
2693,-2.2922
2694,-2.2928
2695,-2.2934
2696,-2.294
2697,-2.3016
2698,-2.3116
2699,-2.3119
2700,-2.3121
2701,-2.3123
2702,-2.3123
2703,-2.3123
2704,-2.3123
2705,-2.3148
2706,-2.3148
2707,-2.3148
2708,-2.3148
