time,value
0,-2.2994
1,-2.2994
2,-2.2994
3,-2.2994
4,-2.2994
5,-2.2994
6,-2.2994
7,-2.2994
8,-2.2994
9,-2.2994
10,-2.2992
11,-2.2989
12,-2.2986
13,-2.2981
14,-2.2975
15,-2.2968
16,-2.2961
17,-2.2949
18,-2.2939
19,-2.2928
20,-2.2916
21,-2.2902
22,-2.2889
23,-2.2868
24,-2.2852
25,-2.2835
26,-2.2817
27,-2.2798
28,-2.2778
29,-2.2757
30,-2.2728
31,-2.2728
32,-2.2704
33,-2.2680000000000002
34,-2.2654
35,-2.2628
36,-2.2591
37,-2.2563
38,-2.2534
39,-2.2504
40,-2.2474
41,-2.2442
42,-2.241
43,-2.2366
44,-2.2332
45,-2.2298
46,-2.2263
47,-2.2227
48,-2.219
49,-2.214
50,-2.2102
51,-2.2064
52,-2.2024
53,-2.1984
54,-2.1944
55,-2.1943
56,-2.1988
57,-2.1994
58,-2.1971
59,-2.1927
60,-2.1883
61,-2.1839
62,-2.1778
63,-2.1732
64,-2.1686
65,-2.1639
66,-2.1592
67,-2.1544
68,-2.148
69,-2.1431
70,-2.1382
71,-2.1333
72,-2.1283
73,-2.1232
74,-2.1181
75,-2.113
76,-2.1078
77,-2.1026
78,-2.0974
79,-2.0921
80,-2.0868
81,-2.0796
82,-2.0742
83,-2.0688
84,-2.0633
85,-2.0578
86,-2.0523
87,-2.0467
88,-2.0393
89,-2.0337
90,-2.0349
91,-2.0375
92,-2.0386
93,-2.0329
94,-2.0252
95,-2.0194
96,-2.0136
97,-2.0077
98,-2.0018
99,-1.9959
100,-1.99
101,-1.9821
102,-1.9761
103,-1.9701
104,-1.9641
105,-1.9581
106,-1.952
107,-1.9439
108,-1.9378
109,-1.9317
110,-1.9256
111,-1.9194
112,-1.9132
113,-1.9071
114,-1.8988
115,-1.8926
116,-1.8863
117,-1.8801
118,-1.8738
119,-1.8675
120,-1.8591
121,-1.8528
122,-1.8465
123,-1.8444
124,-1.8423
125,-1.8402
126,-1.8326
127,-1.8218
128,-1.8142
129,-1.8088
130,-1.8067
131,-1.8024
132,-1.796
133,-1.7898
134,-1.7889
135,-1.7879
136,-1.7825
137,-1.7804
138,-1.7782
139,-1.7739
140,-1.7653
141,-1.7577
142,-1.7512
143,-1.7447
144,-1.7382
145,-1.7317
146,-1.723
147,-1.7175
148,-1.7121
149,-1.7056
150,-1.6991
151,-1.6925
152,-1.6838
153,-1.6772
154,-1.6707
155,-1.6641
156,-1.6575
157,-1.6509
158,-1.6443
159,-1.6355
160,-1.6289
161,-1.6223
162,-1.6157
163,-1.609
164,-1.6024
165,-1.5935
166,-1.5868
167,-1.5802
168,-1.5735
169,-1.5658
170,-1.5592
171,-1.5525
172,-1.5435
173,-1.5368
174,-1.5301
175,-1.5234
176,-1.5167
177,-1.5099
178,-1.5009
179,-1.4942
180,-1.4874
181,-1.4807
182,-1.4739
183,-1.4662
184,-1.4595
185,-1.4504
186,-1.4464
187,-1.4414
188,-1.436
189,-1.4292
190,-1.4225
191,-1.4134
192,-1.4058
193,-1.399
194,-1.3922
195,-1.3854
196,-1.3786
197,-1.3718
198,-1.3669
199,-1.3619999999999999
200,-1.3565
201,-1.3498
202,-1.3421
203,-1.3353
204,-1.3262
205,-1.3213
206,-1.3186
207,-1.311
208,-1.3042
209,-1.2974
210,-1.2897
211,-1.2807
212,-1.2739
213,-1.2671
214,-1.2631
215,-1.2581
216,-1.2518
217,-1.2428
218,-1.2351
219,-1.2283
220,-1.2206
221,-1.218
222,-1.213
223,-1.2085
224,-1.1995
225,-1.1918
226,-1.185
227,-1.1773
228,-1.1724
229,-1.1697
230,-1.1606
231,-1.153
232,-1.1462
233,-1.1394
234,-1.1340000000000001
235,-1.1313
236,-1.1241
237,-1.1173
238,-1.1105
239,-1.1038
240,-1.097
241,-1.0902
242,-1.0825
243,-1.0735
244,-1.0708
245,-1.0658
246,-1.0604
247,-1.0536
248,-1.0469
249,-1.0378
250,-1.0311
251,-1.0234
252,-1.0166
253,-1.0098
254,-1.003
255,-0.9953200000000001
256,-0.98814
257,-0.9854700000000001
258,-0.97869
259,-0.9719
260,-0.96511
261,-0.95831
262,-0.94837
263,-0.94157
264,-0.9347700000000001
265,-0.92796
266,-0.92115
267,-0.91433
268,-0.9117299999999999
269,-0.90595
270,-0.89915
271,-0.89235
272,-0.88555
273,-0.87874
274,-0.8719299999999999
275,-0.8619700000000001
276,-0.85516
277,-0.84834
278,-0.8415100000000001
279,-0.8346899999999999
280,-0.83211
281,-0.82725
282,-0.81957
283,-0.81189
284,-0.80507
285,-0.79825
286,-0.79057
287,-0.78798
288,-0.78082
289,-0.7740199999999999
290,-0.7672100000000001
291,-0.76039
292,-0.75358
293,-0.7467600000000001
294,-0.7390800000000001
295,-0.7299800000000001
296,-0.72315
297,-0.71632
298,-0.71091
299,-0.70608
300,-0.70349
301,-0.6944
302,-0.68758
303,-0.6799
304,-0.67307
305,-0.66767
306,-0.66282
307,-0.65795
308,-0.64886
309,-0.64205
310,-0.63522
311,-0.6284
312,-0.62157
313,-0.61475
314,-0.6047899999999999
315,-0.59795
316,-0.59111
317,-0.58427
318,-0.57743
319,-0.56975
320,-0.56806
321,-0.56239
322,-0.55556
323,-0.54873
324,-0.54189
325,-0.53505
326,-0.52737
327,-0.5182399999999999
328,-0.5114
329,-0.50455
330,-0.4977
331,-0.4923
332,-0.48833999999999994
333,-0.4827
334,-0.47586000000000006
335,-0.46902
336,-0.46216999999999997
337,-0.45532
338,-0.44764
339,-0.44078999999999996
340,-0.43165
341,-0.4277
342,-0.42291999999999996
343,-0.41896000000000005
344,-0.41211000000000003
345,-0.40526
346,-0.39613000000000004
347,-0.38928
348,-0.38242
349,-0.37474
350,-0.36788000000000004
351,-0.36102
352,-0.35416
353,-0.345
354,-0.33814
355,-0.33126
356,-0.33126
357,-0.32897
358,-0.3221
359,-0.3167
360,-0.3136
361,-0.3105
362,-0.30280999999999997
363,-0.29512
364,-0.28973000000000004
365,-0.28891
366,-0.28433
367,-0.27746
368,-0.27059
369,-0.2629
370,-0.25601999999999997
371,-0.24982
372,-0.24427
373,-0.23888
374,-0.23201
375,-0.22514
376,-0.21825999999999998
377,-0.21139000000000002
378,-0.2037
379,-0.19453
380,-0.18765
381,-0.18077000000000001
382,-0.17388
383,-0.16918
384,-0.16446
385,-0.15448
386,-0.14761
387,-0.14073
388,-0.13385
389,-0.12616
390,-0.11928
391,-0.11239
392,-0.10321
393,-0.09632
394,-0.090133
395,-0.08543400000000001
396,-0.08152999999999999
397,-0.07465
398,-0.06615900000000001
399,-0.06373
400,-0.058997
401,-0.052127
402,-0.04444
403,-0.037568
404,-0.030695
405,-0.022196
406,-0.017461
407,-0.013531999999999999
408,-0.0066669
409,0.00020011
410,0.007070100000000001
411,0.017047
412,0.02392
413,0.030797
414,0.038481
415,0.04092
416,0.04795
417,0.05481799999999999
418,0.063978
419,0.071664
420,0.078537
421,0.085409
422,0.092287
423,0.099973
424,0.10550999999999999
425,0.10944000000000001
426,0.11631
427,0.12399
428,0.12645
429,0.13121
430,0.13889
431,0.14575
432,0.15344000000000002
433,0.1603
434,0.16716
435,0.17192000000000002
436,0.1744
437,0.18209
438,0.18894
439,0.19205999999999998
440,0.19434
441,0.19891
442,0.2066
443,0.20970999999999998
444,0.21283000000000002
445,0.22050999999999998
446,0.2282
447,0.2336
448,0.23671
449,0.239
450,0.24896999999999997
451,0.2552
452,0.25998000000000004
453,0.26394
454,0.27078
455,0.27847
456,0.2876
457,0.29445
458,0.2984
459,0.30091999999999997
460,0.30716
461,0.314
462,0.32085
463,0.32998
464,0.33766
465,0.34451
466,0.35136
467,0.35821
468,0.36507
469,0.37421
470,0.37815
471,0.38293
472,0.38688
473,0.39373
474,0.40142
475,0.40826999999999997
476,0.4174
477,0.42135
478,0.42386
479,0.42782
480,0.43466000000000005
481,0.44235
482,0.45027
483,0.45508999999999994
484,0.46192
485,0.46961
486,0.47644
487,0.48328000000000004
488,0.48785
489,0.49013
490,0.49468999999999996
491,0.50154
492,0.5038199999999999
493,0.5038199999999999
494,0.50983
495,0.5189699999999999
496,0.51648
497,0.5140100000000001
498,0.51155
499,0.5114
500,0.50897
501,0.5081600000000001
502,0.50575
503,0.50415
504,0.5010600000000001
505,0.50026
506,0.49788999999999994
507,0.49551999999999996
508,0.48553
509,0.47785
510,0.47548999999999997
511,0.47085
512,0.46393999999999996
513,0.45703999999999995
514,0.44783
515,0.44014
516,0.43323999999999996
517,0.42633999999999994
518,0.41943
519,0.41556000000000004
520,0.41091000000000005
521,0.40475
522,0.39705999999999997
523,0.39166999999999996
524,0.38705
525,0.38473
526,0.37781
527,0.36782
528,0.36551999999999996
529,0.36091999999999996
530,0.35554
531,0.34785
532,0.34247
533,0.33789
534,0.33332
535,0.32638
536,0.3187
537,0.31413
538,0.3119
539,0.30651999999999996
540,0.29652
541,0.28958
542,0.28264
543,0.2757
544,0.27346
545,0.26892
546,0.26355
547,0.25355
548,0.24975999999999998
549,0.24525
550,0.24379
551,0.23683
552,0.22987
553,0.21986999999999998
554,0.21291
555,0.20754
556,0.20536
557,0.20319
558,0.19871
559,0.19657
560,0.1905
561,0.18353
562,0.17584
563,0.16885999999999998
564,0.16189
565,0.15814
566,0.15299000000000001
567,0.14995999999999998
568,0.14298
569,0.136
570,0.12902
571,0.12134
572,0.11435999999999999
573,0.10505999999999999
574,0.098084
575,0.095955
576,0.091516
577,0.08616
578,0.078476
579,0.07102699999999999
580,0.06662
581,0.059628999999999995
582,0.052637
583,0.044953
584,0.037963
585,0.030279
586,0.025186
587,0.023816999999999998
588,0.016819
589,0.0098221
590,0.0028261
591,-0.0041678999999999996
592,-0.014181000000000001
593,-0.021172999999999997
594,-0.028165
595,-0.035154000000000005
596,-0.04214
597,-0.049127
598,-0.051215
599,-0.056303
600,-0.0633
601,-0.070982
602,-0.07537
603,-0.07974099999999999
604,-0.085089
605,-0.094426
606,-0.10211
607,-0.10910999999999998
608,-0.11610999999999999
609,-0.12047999999999999
610,-0.1225
611,-0.13018
612,-0.13785999999999998
613,-0.14154
614,-0.14352
615,-0.14549
616,-0.14979
617,-0.15172
618,-0.15427000000000002
619,-0.15616
620,-0.15975999999999999
621,-0.16744
622,-0.17511
623,-0.17697000000000002
624,-0.17942
625,-0.18123
626,-0.18303
627,-0.18481
628,-0.18657
629,-0.18830999999999998
630,-0.19003
631,-0.19229000000000002
632,-0.1916
633,-0.1845
634,-0.1774
635,-0.17084000000000002
636,-0.16374
637,-0.16063
638,-0.15987
639,-0.15565
640,-0.14853
641,-0.14140999999999998
642,-0.13429000000000002
643,-0.12717
644,-0.1182
645,-0.11108
646,-0.10395
647,-0.096823
648,-0.089696
649,-0.088344
650,-0.087989
651,-0.083732
652,-0.07659500000000001
653,-0.06945499999999999
654,-0.062314999999999995
655,-0.055173
656,-0.048033
657,-0.038508
658,-0.031366000000000005
659,-0.024221
660,-0.017077000000000002
661,-0.009929899999999998
662,-0.0027849
663,0.006747100000000001
664,0.013894
665,0.021044
666,0.028193
667,0.035343
668,0.042495
669,0.049173
670,0.058710000000000005
671,0.06586399999999999
672,0.073021
673,0.080175
674,0.087332
675,0.094958
676,0.1045
677,0.11166
678,0.11882000000000001
679,0.12598
680,0.13314
681,0.1403
682,0.14407
683,0.14834
684,0.15311
685,0.16025999999999999
686,0.16789
687,0.17504
688,0.1822
689,0.18600000000000003
690,0.18982000000000002
691,0.19507
692,0.20221
693,0.20936
694,0.21650999999999998
695,0.22414
696,0.23367
697,0.24083000000000002
698,0.24559
699,0.24798
700,0.24798
701,0.25561
702,0.26085
703,0.26371
704,0.27134
705,0.27897
706,0.2866
707,0.28947
708,0.29185
709,0.299
710,0.30614
711,0.31378
712,0.32092
713,0.32616999999999996
714,0.33
715,0.33385
716,0.34099
717,0.34814
718,0.35528000000000004
719,0.36241999999999996
720,0.37006
721,0.37959
722,0.38673
723,0.39388
724,0.40103
725,0.40676
726,0.4106
727,0.41397
728,0.42349
729,0.43063
730,0.43777
731,0.44492
732,0.45255
733,0.45969
734,0.46684
735,0.46921999999999997
736,0.46921999999999997
737,0.47685
738,0.48211000000000004
739,0.48496999999999996
740,0.48785
741,0.49786
742,0.50549
743,0.51075
744,0.51075
745,0.51551
746,0.52265
747,0.53218
748,0.53932
749,0.5464600000000001
750,0.55361
751,0.56124
752,0.56839
753,0.57553
754,0.58506
755,0.59221
756,0.59936
757,0.6046
758,0.60606
759,0.6099100000000001
760,0.61943
761,0.62658
762,0.63372
763,0.6408699999999999
764,0.6480100000000001
765,0.6551600000000001
766,0.6623
767,0.67232
768,0.6794600000000001
769,0.68661
770,0.69376
771,0.70091
772,0.70805
773,0.71759
774,0.7247399999999999
775,0.7318899999999999
776,0.7390399999999999
777,0.7461899999999999
778,0.75334
779,0.76097
780,0.76479
781,0.76623
782,0.7733800000000001
783,0.7805300000000001
784,0.78767
785,0.79482
786,0.8043600000000001
787,0.81198
788,0.81914
789,0.82629
790,0.83344
791,0.84059
792,0.8477399999999999
793,0.8572799999999999
794,0.8644299999999999
795,0.87159
796,0.87874
797,0.88254
798,0.8839799999999999
799,0.89161
800,0.89876
801,0.90591
802,0.91306
803,0.9202100000000001
804,0.9273600000000001
805,0.93689
806,0.94405
807,0.9512
808,0.95836
809,0.9655100000000001
810,0.9726600000000001
811,0.97982
812,0.98936
813,0.9908100000000001
814,0.9932
815,1.0004
816,1.0075
817,1.0147
818,1.0242
819,1.0314
820,1.0338
821,1.0366
822,1.0395
823,1.0466
824,1.0538
825,1.0638
826,1.071
827,1.0781
828,1.0853
829,1.0924
830,1.0924
831,1.0948
832,1.102
833,1.1068
834,1.1068
835,1.1092
836,1.1163
837,1.1235
838,1.133
839,1.1402
840,1.1474
841,1.1541
842,1.1613
843,1.1684
844,1.178
845,1.1852
846,1.1923
847,1.1995
848,1.2067
849,1.2143
850,1.2214
851,1.2309999999999999
852,1.2382
853,1.2454
854,1.2525
855,1.2597
856,1.2645
857,1.2669
858,1.2717
859,1.2788
860,1.2812
861,1.2812
862,1.2836
863,1.2832
864,1.2827
865,1.2815
866,1.2802
867,1.2789
868,1.2776
869,1.2776
870,1.2748
871,1.2736
872,1.27
873,1.2648
874,1.2576
875,1.2504
876,1.2432
877,1.2336
878,1.2264
879,1.2192
880,1.2116
881,1.2044
882,1.1973
883,1.1877
884,1.1805
885,1.1733
886,1.1661
887,1.1589
888,1.1553
889,1.1513
890,1.1441
891,1.1369
892,1.1297
893,1.1221
894,1.1149
895,1.1077
896,1.0981
897,1.0957
898,1.0933
899,1.0885
900,1.0814
901,1.079
902,1.0766
903,1.0694
904,1.0622
905,1.055
906,1.0478
907,1.0406
908,1.0335
909,1.0239
910,1.0167
911,1.0095
912,1.0023
913,0.9951399999999999
914,0.9879600000000001
915,0.97993
916,0.9786799999999999
917,0.97505
918,0.97382
919,0.9726100000000001
920,0.96501
921,0.9578200000000001
922,0.9482299999999999
923,0.94104
924,0.9334399999999999
925,0.92625
926,0.91906
927,0.9118700000000001
928,0.90228
929,0.8970799999999999
930,0.8934799999999999
931,0.89228
932,0.88508
933,0.87789
934,0.8707
935,0.8611
936,0.8539100000000001
937,0.84672
938,0.83952
939,0.83193
940,0.8247399999999999
941,0.81515
942,0.80795
943,0.80076
944,0.79357
945,0.78638
946,0.7791899999999999
947,0.77798
948,0.77398
949,0.77158
950,0.76399
951,0.7568
952,0.7496
953,0.7420100000000001
954,0.73682
955,0.73324
956,0.73006
957,0.7228600000000001
958,0.7156600000000001
959,0.70807
960,0.7008800000000001
961,0.6953
962,0.69175
963,0.68858
964,0.68138
965,0.67418
966,0.66698
967,0.65699
968,0.64979
969,0.64259
970,0.6353800000000001
971,0.6342399999999999
972,0.63071
973,0.6296
974,0.6281399999999999
975,0.62261
976,0.6154
977,0.60819
978,0.6009800000000001
979,0.5934
980,0.5837899999999999
981,0.57657
982,0.5693600000000001
983,0.56215
984,0.55494
985,0.55181
986,0.54798
987,0.54281
988,0.5356
989,0.5283800000000001
990,0.52117
991,0.5136
992,0.50638
993,0.49676000000000003
994,0.49125
995,0.48778999999999995
996,0.48228000000000004
997,0.47506000000000004
998,0.46785
999,0.45821999999999996
1000,0.45066000000000006
1001,0.44343999999999995
1002,0.43622
1003,0.43106000000000005
1004,0.42762
1005,0.4266
1006,0.41697
1007,0.40975
1008,0.40253
1009,0.39531
1010,0.38808000000000004
1011,0.38051999999999997
1012,0.37089
1013,0.36367
1014,0.35645
1015,0.3513
1016,0.34788
1017,0.34447
1018,0.33724
1019,0.32761
1020,0.32039
1021,0.31316
1022,0.30594
1023,0.29872
1024,0.29149
1025,0.28186
1026,0.27464
1027,0.26708000000000004
1028,0.25986
1029,0.25263
1030,0.24541
1031,0.23819
1032,0.22855999999999999
1033,0.22134
1034,0.21411999999999998
1035,0.2069
1036,0.19968
1037,0.19418
1038,0.19043
1039,0.18528
1040,0.17805
1041,0.1705
1042,0.16327
1043,0.15571
1044,0.15232
1045,0.14653
1046,0.1393
1047,0.13207
1048,0.12453
1049,0.1173
1050,0.11215
1051,0.10848
1052,0.10545
1053,0.097902
1054,0.090361
1055,0.089452
1056,0.08856
1057,0.086146
1058,0.085852
1059,0.083146
1060,0.075615
1061,0.07291399999999999
1062,0.070213
1063,0.065098
1064,0.055158000000000006
1065,0.047632
1066,0.047632
1067,0.042801
1068,0.035276999999999996
1069,0.028033
1070,0.02478
1071,0.021277
1072,0.018593000000000002
1073,0.018328
1074,0.017543
1075,0.01678
1076,0.016033000000000002
1077,0.015066
1078,0.014362999999999999
1079,0.014131999999999999
1080,0.018972
1081,0.018297
1082,0.020059
1083,0.027108999999999998
1084,0.034161000000000004
1085,0.041428
1086,0.048691000000000005
1087,0.055749
1088,0.05756
1089,0.056964
1090,0.06665900000000001
1091,0.073928
1092,0.08100399999999999
1093,0.088275
1094,0.092933
1095,0.092376
1096,0.09911299999999999
1097,0.10639000000000001
1098,0.11366
1099,0.12075999999999999
1100,0.12804000000000001
1101,0.13530999999999999
1102,0.14257999999999998
1103,0.14969000000000002
1104,0.15162
1105,0.15356
1106,0.15842
1107,0.16569
1108,0.17282
1109,0.18252000000000002
1110,0.18707000000000001
1111,0.1895
1112,0.19435
1113,0.20163
1114,0.20876
1115,0.2159
1116,0.22546
1117,0.23016999999999999
1118,0.23246
1119,0.23731999999999998
1120,0.2446
1121,0.2446
1122,0.24703000000000003
1123,0.25188
1124,0.25916
1125,0.26644
1126,0.27373000000000003
1127,0.28101
1128,0.28829
1129,0.298
1130,0.30528
1131,0.31256
1132,0.31984
1133,0.32711999999999997
1134,0.33441
1135,0.34412
1136,0.3514
1137,0.35868
1138,0.36354000000000003
1139,0.36596
1140,0.36839
1141,0.37567
1142,0.38053000000000003
1143,0.38295
1144,0.39037
1145,0.39778
1146,0.4052
1147,0.41262
1148,0.42246999999999996
1149,0.42489
1150,0.42732
1151,0.43245
1152,0.43973
1153,0.44701
1154,0.45428999999999997
1155,0.46399999999999997
1156,0.47128000000000003
1157,0.4787
1158,0.48599
1159,0.49327
1160,0.50055
1161,0.51025
1162,0.51753
1163,0.52482
1164,0.5321
1165,0.53938
1166,0.54666
1167,0.5538
1168,0.5635100000000001
1169,0.5707899999999999
1170,0.57808
1171,0.58536
1172,0.59277
1173,0.60006
1174,0.6097600000000001
1175,0.61705
1176,0.62433
1177,0.63161
1178,0.63889
1179,0.64617
1180,0.65588
1181,0.6631600000000001
1182,0.67045
1183,0.67773
1184,0.68501
1185,0.69229
1186,0.69958
1187,0.70928
1188,0.7165699999999999
1189,0.72385
1190,0.7311300000000001
1191,0.73828
1192,0.7457
1193,0.75541
1194,0.76256
1195,0.76984
1196,0.77712
1197,0.78441
1198,0.79169
1199,0.79897
1200,0.8086800000000001
1201,0.81597
1202,0.82325
1203,0.8305299999999999
1204,0.8378200000000001
1205,0.8451
1206,0.8548100000000001
1207,0.8620899999999999
1208,0.8668299999999999
1209,0.8688899999999999
1210,0.87097
1211,0.87826
1212,0.88554
1213,0.89525
1214,0.90254
1215,0.9098299999999999
1216,0.9171100000000001
1217,0.9243899999999999
1218,0.9315700000000001
1219,0.9412799999999999
1220,0.94857
1221,0.95585
1222,0.96314
1223,0.9704200000000001
1224,0.9777100000000001
1225,0.985
1226,0.99471
1227,1.002
1228,1.0093
1229,1.0166
1230,1.0214
1231,1.0239
1232,1.0285
1233,1.0357
1234,1.0429
1235,1.0452
1236,1.0476
1237,1.0525
1238,1.0598
1239,1.0623
1240,1.0647
1241,1.072
1242,1.0793
1243,1.0842
1244,1.0865
1245,1.0936
1246,1.0984
1247,1.1009
1248,1.1009
1249,1.1082
1250,1.1154
1251,1.1227
1252,1.1324
1253,1.1396
1254,1.1469
1255,1.1542
1256,1.1615
1257,1.1688
1258,1.176
1259,1.1782
1260,1.1803
1261,1.1875
1262,1.1948
1263,1.1946
1264,1.1943
1265,1.1965
1266,1.1965
1267,1.2014
1268,1.2087
1269,1.216
1270,1.2233
1271,1.2329999999999999
1272,1.2354
1273,1.2379
1274,1.238
1275,1.2382
1276,1.2384
1277,1.2409999999999999
1278,1.2411
1279,1.2435
1280,1.2509
1281,1.2534
1282,1.2559
1283,1.2608
1284,1.2706
1285,1.278
1286,1.2805
1287,1.2805
1288,1.2878
1289,1.2951
1290,1.3048
1291,1.3121
1292,1.3194
1293,1.3267
1294,1.334
1295,1.3413
1296,1.3486
1297,1.3507
1298,1.3554
1299,1.3626
1300,1.3699
1301,1.3771
1302,1.3844
1303,1.3942
1304,1.4014
1305,1.4087
1306,1.416
1307,1.4233
1308,1.4305
1309,1.4379
1310,1.4476
1311,1.4549
1312,1.4622
1313,1.4695
1314,1.4768
1315,1.4841
1316,1.4913
1317,1.4938
1318,1.4962
1319,1.5035
1320,1.5058
1321,1.5083
1322,1.5083
1323,1.508
1324,1.5078
1325,1.5078
1326,1.5077
1327,1.5075
1328,1.5074
1329,1.5074
1330,1.5049
1331,1.5047
1332,1.5022
1333,1.4949
1334,1.4876
1335,1.4803
1336,1.4706
1337,1.4633
1338,1.456
1339,1.4487
1340,1.4414
1341,1.4341
1342,1.4244
1343,1.4171
1344,1.4098
1345,1.4025
1346,1.3952
1347,1.3903
1348,1.3877
1349,1.3852
1350,1.3779
1351,1.3706
1352,1.3633
1353,1.3559999999999999
1354,1.3487
1355,1.339
1356,1.3341
1357,1.3316
1358,1.3291
1359,1.3266
1360,1.3193
1361,1.3096
1362,1.3023
1363,1.295
1364,1.2877
1365,1.2804
1366,1.2731
1367,1.2658
1368,1.2561
1369,1.2488
1370,1.2415
1371,1.2391
1372,1.2367
1373,1.2318
1374,1.2221
1375,1.2148
1376,1.2075
1377,1.2002
1378,1.1954
1379,1.1954
1380,1.1953
1381,1.1928
1382,1.1928
1383,1.1855
1384,1.1782
1385,1.1709
1386,1.1636
1387,1.1539
1388,1.1466
1389,1.1393
1390,1.1320000000000001
1391,1.1247
1392,1.1174
1393,1.1101
1394,1.1004
1395,1.0931
1396,1.0858
1397,1.0785
1398,1.0712
1399,1.0639
1400,1.0542
1401,1.0469
1402,1.0396
1403,1.0323
1404,1.025
1405,1.0177
1406,1.0104
1407,1.0007
1408,0.9934
1409,0.9861
1410,0.9812200000000001
1411,0.97877
1412,0.9763299999999999
1413,0.9666100000000001
1414,0.95931
1415,0.9520200000000001
1416,0.94473
1417,0.9374299999999999
1418,0.93014
1419,0.92285
1420,0.91312
1421,0.9058299999999999
1422,0.89854
1423,0.8912399999999999
1424,0.88395
1425,0.8839600000000001
1426,0.87913
1427,0.87184
1428,0.86454
1429,0.85725
1430,0.84996
1431,0.8426600000000001
1432,0.8353700000000001
1433,0.8256600000000001
1434,0.8183699999999999
1435,0.81107
1436,0.80378
1437,0.7964899999999999
1438,0.7892
1439,0.7844
1440,0.78447
1441,0.77717
1442,0.76988
1443,0.76259
1444,0.75529
1445,0.748
1446,0.73828
1447,0.7309899999999999
1448,0.7236899999999999
1449,0.7164
1450,0.70911
1451,0.70182
1452,0.6945
1453,0.69201
1454,0.69196
1455,0.68466
1456,0.67737
1457,0.67008
1458,0.66035
1459,0.6530600000000001
1460,0.64577
1461,0.63847
1462,0.63118
1463,0.6312300000000001
1464,0.6288600000000001
1465,0.6216
1466,0.61431
1467,0.60701
1468,0.59972
1469,0.59243
1470,0.58513
1471,0.5754100000000001
1472,0.56812
1473,0.56083
1474,0.55353
1475,0.54627
1476,0.53898
1477,0.53168
1478,0.5219600000000001
1479,0.51467
1480,0.50737
1481,0.50008
1482,0.49278999999999995
1483,0.4855
1484,0.47576999999999997
1485,0.47336999999999996
1486,0.47336999999999996
1487,0.46851000000000004
1488,0.46121999999999996
1489,0.45393
1490,0.44663
1491,0.44177
1492,0.43933999999999995
1493,0.43688
1494,0.42958999999999997
1495,0.4223
1496,0.415
1497,0.40528000000000003
1498,0.39799
1499,0.3907
1500,0.3834
1501,0.37611
1502,0.36882
1503,0.3615
1504,0.35176999999999997
1505,0.34448
1506,0.33719
1507,0.3299
1508,0.3226
1509,0.31534
1510,0.30561
1511,0.29832
1512,0.29103
1513,0.28374
1514,0.27645
1515,0.26915
1516,0.26186
1517,0.25211
1518,0.24484
1519,0.23755
1520,0.23026
1521,0.22296999999999997
1522,0.21568
1523,0.20595
1524,0.19866
1525,0.19137
1526,0.18411
1527,0.18422
1528,0.18191
1529,0.17462
1530,0.16495
1531,0.1651
1532,0.16527
1533,0.16545
1534,0.16566
1535,0.16345
1536,0.16378
1537,0.16404000000000002
1538,0.15927
1539,0.15208
1540,0.14742
1541,0.1453
1542,0.14065
1543,0.13337000000000002
1544,0.12608
1545,0.11890999999999999
1546,0.11162000000000001
1547,0.10434
1548,0.097051
1549,0.089999
1550,0.087933
1551,0.085757
1552,0.08346
1553,0.083591
1554,0.083997
1555,0.084566
1556,0.085013
1557,0.08548
1558,0.085964
1559,0.086131
1560,0.09114900000000001
1561,0.094088
1562,0.099468
1563,0.10674000000000002
1564,0.11402000000000001
1565,0.12147000000000001
1566,0.12874000000000002
1567,0.13153
1568,0.1347
1569,0.14217
1570,0.14944000000000002
1571,0.1569
1572,0.16417
1573,0.17144
1574,0.17203
1575,0.17526
1576,0.17589000000000002
1577,0.17654
1578,0.18183
1579,0.18909
1580,0.19415
1581,0.19657
1582,0.19657
1583,0.20164
1584,0.20911999999999997
1585,0.21661
1586,0.21925999999999998
1587,0.22191
1588,0.22721999999999998
1589,0.23448000000000002
1590,0.23448000000000002
1591,0.2369
1592,0.24415
1593,0.25140999999999997
1594,0.26109
1595,0.26836
1596,0.27560999999999997
1597,0.28286999999999995
1598,0.29013
1599,0.2974
1600,0.30465
1601,0.31456999999999996
1602,0.32182
1603,0.32909
1604,0.33635
1605,0.34360999999999997
1606,0.35086999999999996
1607,0.36055
1608,0.36780999999999997
1609,0.37023
1610,0.37265
1611,0.3753
1612,0.38279
1613,0.39028
1614,0.39535
1615,0.39799999999999996
1616,0.40065
1617,0.40815
1618,0.41057
1619,0.41298999999999997
1620,0.42025
1621,0.42751000000000006
1622,0.43476000000000004
1623,0.44201999999999997
1624,0.44952
1625,0.45678
1626,0.46403999999999995
1627,0.46935
1628,0.47248
1629,0.47781
1630,0.48506000000000005
1631,0.49232
1632,0.49956999999999996
1633,0.50925
1634,0.51651
1635,0.5240100000000001
1636,0.5312600000000001
1637,0.53852
1638,0.54578
1639,0.55545
1640,0.56271
1641,0.56779
1642,0.57094
1643,0.57411
1644,0.58136
1645,0.58862
1646,0.59854
1647,0.6057899999999999
1648,0.61305
1649,0.6203
1650,0.62756
1651,0.62997
1652,0.63239
1653,0.63481
1654,0.64207
1655,0.64957
1656,0.6522399999999999
1657,0.65491
1658,0.66242
1659,0.6723399999999999
1660,0.67985
1661,0.6871
1662,0.6871
1663,0.68952
1664,0.69219
1665,0.70186
1666,0.70911
1667,0.71637
1668,0.7236199999999999
1669,0.7311300000000001
1670,0.73838
1671,0.74563
1672,0.7490899999999999
1673,0.74988
1674,0.75712
1675,0.76437
1676,0.77189
1677,0.7791399999999999
1678,0.78665
1679,0.78746
1680,0.79284
1681,0.8003600000000001
1682,0.80761
1683,0.81485
1684,0.8221
1685,0.83204
1686,0.8392799999999999
1687,0.8465299999999999
1688,0.8537799999999999
1689,0.8610200000000001
1690,0.86613
1691,0.86965
1692,0.87235
1693,0.87987
1694,0.8871100000000001
1695,0.89436
1696,0.9016
1697,0.90885
1698,0.91851
1699,0.92575
1700,0.93327
1701,0.94052
1702,0.9477700000000001
1703,0.95501
1704,0.96467
1705,0.9679200000000001
1706,0.96878
1707,0.9738899999999999
1708,0.98114
1709,0.9883799999999999
1710,0.9956200000000001
1711,1.0053
1712,1.0125
1713,1.0198
1714,1.0270000000000001
1715,1.0345
1716,1.0418
1717,1.0514
1718,1.0587
1719,1.0659
1720,1.0732
1721,1.0804
1722,1.0831
1723,1.0864
1724,1.0897
1725,1.0969
1726,1.1041
1727,1.1114
1728,1.1186
1729,1.1259
1730,1.1355
1731,1.1428
1732,1.1503
1733,1.1575
1734,1.1648
1735,1.172
1736,1.1817
1737,1.1889
1738,1.1962
1739,1.2013
1740,1.2045
1741,1.2054
1742,1.2127
1743,1.2223
1744,1.2296
1745,1.2368
1746,1.244
1747,1.2516
1748,1.2588
1749,1.2685
1750,1.2757
1751,1.2829
1752,1.2902
1753,1.2974
1754,1.3047
1755,1.3119
1756,1.3216
1757,1.3288
1758,1.3359999999999999
1759,1.3433
1760,1.3505
1761,1.3578
1762,1.3613
1763,1.3622
1764,1.3622
1765,1.3625
1766,1.3634
1767,1.3643
1768,1.3652
1769,1.3665
1770,1.3665
1771,1.3665
1772,1.3593
1773,1.3519999999999999
1774,1.3475
1775,1.3451
1776,1.3379
1777,1.3331
1778,1.3306
1779,1.3282
1780,1.321
1781,1.3138
1782,1.3045
1783,1.2972
1784,1.29
1785,1.2828
1786,1.2755
1787,1.2711
1788,1.2724
1789,1.2734
1790,1.272
1791,1.273
1792,1.2741
1793,1.2751
1794,1.2734
1795,1.2638
1796,1.2566
1797,1.2494
1798,1.2422
1799,1.2349
1800,1.2277
1801,1.2181
1802,1.2109
1803,1.2037
1804,1.1965
1805,1.1893
1806,1.1821
1807,1.1748
1808,1.1652
1809,1.158
1810,1.1512
1811,1.1440000000000001
1812,1.1368
1813,1.1296
1814,1.1199
1815,1.1127
1816,1.1055
1817,1.1043
1818,1.1054
1819,1.0986
1820,1.0914
1821,1.0818
1822,1.0746
1823,1.0674
1824,1.0602
1825,1.053
1826,1.0458
1827,1.0362
1828,1.0290000000000001
1829,1.0218
1830,1.0166
1831,1.013
1832,1.0095
1833,1.0023
1834,0.9950700000000001
1835,0.98787
1836,0.98067
1837,0.9734700000000001
1838,0.9662700000000001
1839,0.95906
1840,0.94947
1841,0.94227
1842,0.9350700000000001
1843,0.93306
1844,0.93066
1845,0.93066
1846,0.9214600000000001
1847,0.91466
1848,0.90786
1849,0.90107
1850,0.90107
1851,0.8962700000000001
1852,0.88908
1853,0.8790899999999999
1854,0.87389
1855,0.87349
1856,0.8659
1857,0.8611
1858,0.8611
1859,0.85631
1860,0.84951
1861,0.84273
1862,0.83594
1863,0.82875
1864,0.8215600000000001
1865,0.81917
1866,0.8175899999999999
1867,0.81321
1868,0.80603
1869,0.79884
1870,0.79166
1871,0.78447
1872,0.77489
1873,0.76771
1874,0.76053
1875,0.75334
1876,0.74616
1877,0.73898
1878,0.7318
1879,0.72222
1880,0.71504
1881,0.71026
1882,0.7065899999999999
1883,0.70294
1884,0.6977300000000001
1885,0.68815
1886,0.68097
1887,0.67378
1888,0.6666
1889,0.65942
1890,0.65223
1891,0.64505
1892,0.63505
1893,0.6278699999999999
1894,0.62111
1895,0.61351
1896,0.60633
1897,0.59915
1898,0.59
1899,0.5828300000000001
1900,0.57565
1901,0.56847
1902,0.5613
1903,0.55412
1904,0.54694
1905,0.53738
1906,0.5302
1907,0.52303
1908,0.51586
1909,0.50868
1910,0.50151
1911,0.49151000000000006
1912,0.48433000000000004
1913,0.47716000000000003
1914,0.46998999999999996
1915,0.46282
1916,0.45565
1917,0.44609
1918,0.43892
1919,0.43759
1920,0.43388000000000004
1921,0.42866000000000004
1922,0.42148
1923,0.41431
1924,0.40475
1925,0.39757
1926,0.3904
1927,0.38323
1928,0.37606
1929,0.36889
1930,0.35933000000000004
1931,0.35170999999999997
1932,0.34454
1933,0.33738
1934,0.33021
1935,0.32304
1936,0.31587
1937,0.30632
1938,0.30109
1939,0.29736
1940,0.29364
1941,0.28647
1942,0.27929
1943,0.26973
1944,0.26256
1945,0.25495
1946,0.24778000000000003
1947,0.24061
1948,0.23344
1949,0.22626999999999997
1950,0.21670999999999999
1951,0.20955
1952,0.20193
1953,0.1982
1954,0.19492
1955,0.18731
1956,0.17775
1957,0.17057999999999998
1958,0.16341
1959,0.15624000000000002
1960,0.14907
1961,0.1419
1962,0.13473
1963,0.12517
1964,0.11800999999999999
1965,0.11084000000000001
1966,0.10322
1967,0.09650700000000001
1968,0.08934
1969,0.079789
1970,0.072627
1971,0.065463
1972,0.058301
1973,0.051142
1974,0.04398
1975,0.036821
1976,0.027274
1977,0.019653
1978,0.012494
1979,0.005335100000000001
1980,-0.0018219000000000002
1981,-0.0089789
1982,-0.018521
1983,-0.025675
1984,-0.03283
1985,-0.039982
1986,-0.047136000000000004
1987,-0.054288
1988,-0.061438
1989,-0.07097200000000001
1990,-0.078122
1991,-0.085271
1992,-0.092418
1993,-0.09956799999999999
1994,-0.10622999999999999
1995,-0.11575
1996,-0.12289000000000001
1997,-0.13004000000000002
1998,-0.13718
1999,-0.14432
2000,-0.14859
2001,-0.14708
2002,-0.15032
2003,-0.15745
2004,-0.16457
2005,-0.1717
2006,-0.17831
2007,-0.18544000000000002
2008,-0.19493
2009,-0.19916
2010,-0.19995
2011,-0.20071
2012,-0.20490999999999998
2013,-0.21202
2014,-0.21511999999999998
2015,-0.21581999999999998
2016,-0.21999000000000002
2017,-0.22709000000000001
2018,-0.23362
2019,-0.24070999999999998
2020,-0.24723
2021,-0.24965
2022,-0.2532
2023,-0.26028
2024,-0.26735
2025,-0.27443
2026,-0.2809
2027,-0.29033000000000003
2028,-0.2974
2029,-0.29916
2030,-0.29969
2031,-0.29786
2032,-0.29835
2033,-0.29646999999999996
2034,-0.2999
2035,-0.3063
2036,-0.30906
2037,-0.30945
2038,-0.31348000000000004
2039,-0.31984
2040,-0.32252
2041,-0.32284
2042,-0.32683
2043,-0.32848
2044,-0.3278
2045,-0.32573
2046,-0.32365
2047,-0.32084
2048,-0.31871
2049,-0.31656999999999996
2050,-0.31585
2051,-0.3112
2052,-0.30744
2053,-0.30221
2054,-0.29684
2055,-0.28988
2056,-0.28293
2057,-0.27524
2058,-0.26828
2059,-0.26132
2060,-0.25204
2061,-0.24666999999999997
2062,-0.24216999999999997
2063,-0.23998000000000003
2064,-0.23303000000000001
2065,-0.22534
2066,-0.21606999999999998
2067,-0.20911
2068,-0.20301
2069,-0.19849
2070,-0.19238
2071,-0.18544000000000002
2072,-0.17849
2073,-0.16848
2074,-0.1608
2075,-0.15858
2076,-0.15478
2077,-0.1471
2078,-0.14015
2079,-0.13015
2080,-0.1232
2081,-0.11782999999999999
2082,-0.11329000000000002
2083,-0.11104000000000001
2084,-0.1041
2085,-0.097166
2086,-0.08791399999999999
2087,-0.080971
2088,-0.073284
2089,-0.066341
2090,-0.059392999999999994
2091,-0.055596000000000007
2092,-0.050294
2093,-0.044919
2094,-0.037982999999999996
2095,-0.031043
2096,-0.024102000000000002
2097,-0.016416
2098,-0.0094729
2099,-0.00021289
2100,0.0067320999999999995
2101,0.013680000000000001
2102,0.020630000000000003
2103,0.024423
2104,0.028961
2105,0.03508
2106,0.042020999999999996
2107,0.048966
2108,0.055909
2109,0.06285700000000001
2110,0.07054400000000001
2111,0.079808
2112,0.086758
2113,0.093711
2114,0.10066
2115,0.10445
2116,0.10665999999999999
2117,0.11277999999999999
2118,0.12204000000000001
2119,0.12897999999999998
2120,0.13593
2121,0.14362
2122,0.15057
2123,0.15752
2124,0.16521
2125,0.16973
2126,0.17121
2127,0.1789
2128,0.18585
2129,0.19279000000000002
2130,0.19974
2131,0.20901
2132,0.21595999999999999
2133,0.22365
2134,0.2306
2135,0.23756
2136,0.24452
2137,0.24670999999999998
2138,0.25124
2139,0.25661
2140,0.26355
2141,0.2705
2142,0.27819
2143,0.28514
2144,0.28967
2145,0.29189
2146,0.29958
2147,0.30651999999999996
2148,0.31346999999999997
2149,0.32116
2150,0.33042
2151,0.33737
2152,0.34431999999999996
2153,0.35043
2154,0.35496
2155,0.36108
2156,0.36801999999999996
2157,0.37728
2158,0.38497
2159,0.39191
2160,0.39571
2161,0.39794
2162,0.40407
2163,0.41407
2164,0.41788000000000003
2165,0.42245
2166,0.42628
2167,0.43396
2168,0.44088999999999995
2169,0.44548000000000004
2170,0.45085
2171,0.45853
2172,0.46621999999999997
2173,0.47084
2174,0.47546000000000005
2175,0.48236999999999997
2176,0.49236
2177,0.49928
2178,0.5062
2179,0.5100399999999999
2180,0.51468
2181,0.5170100000000001
2182,0.51937
2183,0.52483
2184,0.53251
2185,0.5402
2186,0.54259
2187,0.54728
2188,0.55497
2189,0.56415
2190,0.56655
2191,0.56897
2192,0.5737
2193,0.57614
2194,0.5786
2195,0.5854699999999999
2196,0.59544
2197,0.59791
2198,0.60039
2199,0.60288
2200,0.60539
2201,0.6079100000000001
2202,0.61129
2203,0.6138399999999999
2204,0.61641
2205,0.6189899999999999
2206,0.62158
2207,0.6241899999999999
2208,0.62768
2209,0.63032
2210,0.63297
2211,0.63564
2212,0.63831
2213,0.6410100000000001
2214,0.6342300000000001
2215,0.6252
2216,0.61934
2217,0.61257
2218,0.60897
2219,0.60946
2220,0.60721
2221,0.59821
2222,0.59146
2223,0.5847100000000001
2224,0.57796
2225,0.57122
2226,0.56448
2227,0.56223
2228,0.5572
2229,0.55178
2230,0.54504
2231,0.5383
2232,0.53156
2233,0.52482
2234,0.5149100000000001
2235,0.50818
2236,0.50144
2237,0.49472
2238,0.48799
2239,0.48293
2240,0.47788
2241,0.46797
2242,0.46124
2243,0.45451
2244,0.44683999999999996
2245,0.44011999999999996
2246,0.43338999999999994
2247,0.42443000000000003
2248,0.4216
2249,0.41655
2250,0.40888
2251,0.40215
2252,0.39542
2253,0.3887
2254,0.3788
2255,0.37206999999999996
2256,0.36536
2257,0.36122
2258,0.35616
2259,0.35073000000000004
2260,0.34083
2261,0.3341
2262,0.32738
2263,0.32066999999999996
2264,0.31395
2265,0.30724
2266,0.30053
2267,0.29063
2268,0.28393
2269,0.27721999999999997
2270,0.27052
2271,0.26383
2272,0.25713
2273,0.24821
2274,0.24405
2275,0.24115
2276,0.23476999999999998
2277,0.22807
2278,0.22136999999999998
2279,0.21468
2280,0.20575
2281,0.1981
2282,0.19141
2283,0.18472
2284,0.17804
2285,0.17135999999999998
2286,0.16246
2287,0.15579
2288,0.14937999999999999
2289,0.14422000000000001
2290,0.13781
2291,0.13113
2292,0.12222999999999999
2293,0.11556
2294,0.1079
2295,0.10123
2296,0.094567
2297,0.087903
2298,0.081243
2299,0.072367
2300,0.067169
2301,0.064209
2302,0.056555999999999995
2303,0.04989
2304,0.043227
2305,0.033357
2306,0.026701
2307,0.020045
2308,0.013393
2309,0.008189100000000001
2310,0.0029941
2311,-0.0024369
2312,-0.011318
2313,-0.017974
2314,-0.024625
2315,-0.032273
2316,-0.038922000000000005
2317,-0.045568
2318,-0.051001
2319,-0.056215999999999995
2320,-0.059201
2321,-0.065857
2322,-0.072511
2323,-0.07916000000000001
2324,-0.08680800000000001
2325,-0.095666
2326,-0.10231
2327,-0.10894000000000001
2328,-0.11417000000000001
2329,-0.1194
2330,-0.12704000000000001
2331,-0.1359
2332,-0.14254
2333,-0.14918
2334,-0.15582000000000001
2335,-0.16346
2336,-0.17009000000000002
2337,-0.17672000000000002
2338,-0.18555
2339,-0.18996
2340,-0.19302
2341,-0.19827
2342,-0.2037
2343,-0.21033000000000002
2344,-0.21916
2345,-0.22579000000000002
2346,-0.23240999999999998
2347,-0.23901999999999998
2348,-0.24666
2349,-0.25327
2350,-0.25987
2351,-0.26868000000000003
2352,-0.27398
2353,-0.27926
2354,-0.28249
2355,-0.2891
2356,-0.29571
2357,-0.30451999999999996
2358,-0.31112
2359,-0.31771
2360,-0.32431
2361,-0.3309
2362,-0.33748
2363,-0.34406
2364,-0.35283000000000003
2365,-0.3594
2366,-0.36596999999999996
2367,-0.37253000000000003
2368,-0.38015
2369,-0.38671
2370,-0.39545
2371,-0.40199
2372,-0.40854
2373,-0.41508
2374,-0.41833000000000004
2375,-0.42373999999999995
2376,-0.42694
2377,-0.43568
2378,-0.44223
2379,-0.44877
2380,-0.45531000000000005
2381,-0.46184
2382,-0.46945
2383,-0.47815
2384,-0.48468
2385,-0.49118999999999996
2386,-0.49771000000000004
2387,-0.50421
2388,-0.51072
2389,-0.51835
2390,-0.52164
2391,-0.5292399999999999
2392,-0.53576
2393,-0.5433600000000001
2394,-0.54987
2395,-0.55637
2396,-0.56294
2397,-0.56621
2398,-0.5727300000000001
2399,-0.58034
2400,-0.58685
2401,-0.59335
2402,-0.60206
2403,-0.60752
2404,-0.61187
2405,-0.61839
2406,-0.6249
2407,-0.6314
2408,-0.6390100000000001
2409,-0.64767
2410,-0.6541600000000001
2411,-0.66176
2412,-0.66725
2413,-0.67162
2414,-0.6792199999999999
2415,-0.68788
2416,-0.69548
2417,-0.70197
2418,-0.70636
2419,-0.7118399999999999
2420,-0.71838
2421,-0.72488
2422,-0.73464
2423,-0.7411300000000001
2424,-0.74873
2425,-0.75422
2426,-0.7597
2427,-0.7662
2428,-0.77596
2429,-0.78245
2430,-0.78894
2431,-0.79332
2432,-0.79881
2433,-0.80535
2434,-0.81185
2435,-0.8216100000000001
2436,-0.8281
2437,-0.8345799999999999
2438,-0.8400799999999999
2439,-0.8434
2440,-0.851
2441,-0.86077
2442,-0.86726
2443,-0.87375
2444,-0.8780700000000001
2445,-0.8835700000000001
2446,-0.88689
2447,-0.8923200000000001
2448,-0.9009799999999999
2449,-0.9074700000000001
2450,-0.91507
2451,-0.92155
2452,-0.9280299999999999
2453,-0.9345
2454,-0.9443299999999999
2455,-0.94768
2456,-0.9552799999999999
2457,-0.9617600000000001
2458,-0.96935
2459,-0.97582
2460,-0.98229
2461,-0.9867799999999999
2462,-0.99444
2463,-1.0009
2464,-1.0074
2465,-1.015
2466,-1.0215
2467,-1.028
2468,-1.0335
2469,-1.0379
2470,-1.0444
2471,-1.0509
2472,-1.0573
2473,-1.0649
2474,-1.0735
2475,-1.08
2476,-1.0876
2477,-1.0931
2478,-1.0965
2479,-1.103
2480,-1.1116
2481,-1.1192
2482,-1.1256
2483,-1.1299
2484,-1.1355
2485,-1.1389
2486,-1.1465
2487,-1.1529
2488,-1.1605
2489,-1.1669
2490,-1.1734
2491,-1.1757
2492,-1.1812
2493,-1.1899
2494,-1.1964
2495,-1.204
2496,-1.2104
2497,-1.2169
2498,-1.2203
2499,-1.227
2500,-1.2345
2501,-1.2409999999999999
2502,-1.2465
2503,-1.2521
2504,-1.2575
2505,-1.2651
2506,-1.2716
2507,-1.2771
2508,-1.2837
2509,-1.2913
2510,-1.2967
2511,-1.3022
2512,-1.3098
2513,-1.3174
2514,-1.3229
2515,-1.3283
2516,-1.3338
2517,-1.3403
2518,-1.3479
2519,-1.3544
2520,-1.3598
2521,-1.3663
2522,-1.374
2523,-1.3793
2524,-1.3825
2525,-1.3902
2526,-1.3967
2527,-1.4033
2528,-1.4098
2529,-1.4174
2530,-1.4240000000000002
2531,-1.4305
2532,-1.4369999999999998
2533,-1.4424
2534,-1.4489
2535,-1.4555
2536,-1.462
2537,-1.4686
2538,-1.4773
2539,-1.4838
2540,-1.4903
2541,-1.4968
2542,-1.5033
2543,-1.5098
2544,-1.5162
2545,-1.526
2546,-1.5324
2547,-1.5389
2548,-1.5453
2549,-1.5518
2550,-1.5582
2551,-1.5658
2552,-1.5714
2553,-1.5748
2554,-1.5812
2555,-1.5877
2556,-1.5941
2557,-1.6005
2558,-1.609
2559,-1.6154
2560,-1.6218
2561,-1.6282
2562,-1.6345
2563,-1.6409
2564,-1.6493
2565,-1.6556
2566,-1.6619
2567,-1.6682
2568,-1.6745
2569,-1.6808
2570,-1.6891
2571,-1.6954
2572,-1.7029
2573,-1.7091
2574,-1.7153
2575,-1.7215
2576,-1.7277
2577,-1.7359
2578,-1.7421
2579,-1.7482
2580,-1.7544
2581,-1.7611
2582,-1.7671
2583,-1.7758
2584,-1.7819999999999998
2585,-1.7881
2586,-1.7942
2587,-1.8003
2588,-1.8064
2589,-1.8138
2590,-1.8218
2591,-1.8279
2592,-1.8339
2593,-1.8399
2594,-1.8458
2595,-1.8518
2596,-1.8597
2597,-1.8656
2598,-1.8715
2599,-1.8774
2600,-1.8833
2601,-1.8891
2602,-1.8949
2603,-1.9026
2604,-1.9084
2605,-1.9141
2606,-1.9198
2607,-1.9255
2608,-1.932
2609,-1.9384
2610,-1.9457
2611,-1.9514
2612,-1.9569999999999999
2613,-1.9627
2614,-1.9683
2615,-1.9739
2616,-1.9814
2617,-1.9885
2618,-1.994
2619,-1.9995
2620,-2.005
2621,-2.0104
2622,-2.0176
2623,-2.023
2624,-2.0284
2625,-2.0337
2626,-2.0389
2627,-2.0442
2628,-2.0494
2629,-2.0563
2630,-2.0614
2631,-2.0665
2632,-2.0716
2633,-2.0766
2634,-2.0816
2635,-2.0882
2636,-2.0931
2637,-2.0979
2638,-2.1028
2639,-2.1075
2640,-2.1123
2641,-2.117
2642,-2.1253
2643,-2.1325
2644,-2.1394
2645,-2.144
2646,-2.1486
2647,-2.1531
2648,-2.1591
2649,-2.1635
2650,-2.1679
2651,-2.1722
2652,-2.1765
2653,-2.1807
2654,-2.1849
2655,-2.1903
2656,-2.1944
2657,-2.1983
2658,-2.2022
2659,-2.2061
2660,-2.2099
2661,-2.2148
2662,-2.2184
2663,-2.222
2664,-2.2255
2665,-2.2311
2666,-2.2345
2667,-2.2388
2668,-2.242
2669,-2.2452
2670,-2.2482
2671,-2.2512
2672,-2.2541
2673,-2.2546
2674,-2.2583
2675,-2.2609
2676,-2.2634
2677,-2.2659
2678,-2.2682
2679,-2.2705
2680,-2.2734
2681,-2.2755
2682,-2.2775
2683,-2.2793
2684,-2.2811
2685,-2.2828
2686,-2.2845
2687,-2.2865
2688,-2.2879
2689,-2.2916
2690,-2.2928
2691,-2.2939
2692,-2.2949
2693,-2.2961
2694,-2.2968
2695,-2.2975
2696,-2.2981
2697,-2.2986
2698,-2.2989
2699,-2.2992
2700,-2.2994
2701,-2.2994
2702,-2.2994
2703,-2.2994
2704,-2.2994
2705,-2.2994
2706,-2.2994
2707,-2.2994
2708,-2.2994
