time,value
0,-0.19138
1,-0.20010999999999998
2,-0.17682
3,-0.20303
4,-0.18847
5,-0.17973
6,-0.21466999999999997
7,-0.17390999999999998
8,-0.19138
9,-0.21176
10,-0.16809000000000002
11,-0.20594
12,-0.19429000000000002
13,-0.171
14,-0.21466999999999997
15,-0.18264
16,-0.18847
17,-0.21176
18,-0.17390999999999998
19,-0.20303
20,-0.19138
21,-0.18847
22,-0.20885
23,-0.17973
24,-0.1972
25,-0.19138
26,-0.17390999999999998
27,-0.20885
28,-0.17390999999999998
29,-0.18264
30,-0.20594
31,-0.13897
32,-0.19138
33,-0.19138
34,-0.15935
35,-0.20303
36,-0.17390999999999998
37,-0.18264
38,-0.20303
39,-0.171
40,-0.1972
41,-0.19429000000000002
42,-0.18556
43,-0.20303
44,-0.18556
45,-0.1972
46,-0.1972
47,-0.17973
48,-0.20885
49,-0.18264
50,-0.18556
51,-0.21176
52,-0.16809000000000002
53,-0.20010999999999998
54,-0.20010999999999998
55,-0.171
56,-0.21176
57,-0.18847
58,-0.18264
59,-0.20885
60,-0.17973
61,-0.19429000000000002
62,-0.19429000000000002
63,-0.17390999999999998
64,-0.20303
65,-0.18264
66,-0.18847
67,-0.20010999999999998
68,-0.17682
69,-0.20010999999999998
70,-0.18847
71,-0.17682
72,-0.20885
73,-0.16517
74,5.9289
75,5.7396
76,4.8457
77,0.49577
78,-0.12732000000000002
79,-0.11859000000000001
80,-0.16517
81,-0.15062
82,-0.13606
83,-0.16809000000000002
84,-0.16809000000000002
85,-0.15062
86,-0.171
87,-0.17973
88,-0.16226
89,-0.17682
90,-0.20010999999999998
91,-0.17390999999999998
92,-0.171
93,-0.19429000000000002
94,-0.17973
95,-0.16226
