time,value
0,-0.5322899999999999
1,-0.5322899999999999
2,-0.5322899999999999
3,-0.5322899999999999
4,-0.5322899999999999
5,-0.5322899999999999
6,-0.5322899999999999
7,-0.5322899999999999
8,-0.5322899999999999
9,-0.5322899999999999
10,-0.5322899999999999
11,-0.5322899999999999
12,-0.5322899999999999
13,-0.5322899999999999
14,-0.5322899999999999
15,-0.5322899999999999
16,-0.5322899999999999
17,-0.5322899999999999
18,-0.5322899999999999
19,-0.5322899999999999
20,-0.5322899999999999
21,-0.5322899999999999
22,-0.5322899999999999
23,-0.5322899999999999
24,-0.5322899999999999
25,-0.5322899999999999
26,-0.5322899999999999
27,-0.5322899999999999
28,-0.5322899999999999
29,-0.5322899999999999
30,-0.5322899999999999
31,-0.5322899999999999
32,-0.5322899999999999
33,2.3723
34,3.1254
35,3.1254
36,2.9102
37,2.9102
38,0.005603
39,-0.5322899999999999
40,-0.5322899999999999
41,-0.5322899999999999
42,0.9738100000000001
43,3.2329
44,-0.10198
45,-0.20955
46,-0.10198
47,-0.20955
48,-0.10198
49,-0.20955
50,-0.10198
51,-0.20955
52,-0.10198
53,-0.20955
54,-0.10198
55,-0.20955
56,-0.10198
57,-0.20955
58,-0.10198
59,-0.20955
60,-0.10198
61,-0.20955
62,-0.10198
63,-0.20955
64,-0.10198
65,-0.20955
66,-0.10198
67,-0.20955
68,-0.10198
69,-0.20955
70,-0.10198
71,-0.20955
72,-0.10198
73,-0.20955
74,-0.10198
75,-0.20955
76,-0.10198
77,-0.20955
78,-0.10198
79,-0.20955
80,-0.10198
81,-0.20955
82,-0.10198
83,0.32834
84,2.8026
85,2.2647
86,3.1254
87,2.2647
88,-0.5322899999999999
89,-0.5322899999999999
90,-0.5322899999999999
91,-0.5322899999999999
92,-0.5322899999999999
93,-0.5322899999999999
94,-0.5322899999999999
95,-0.5322899999999999
