time,value
0,0.72785
1,0.63944
2,0.55566
3,0.47531
4,0.43446999999999997
5,0.36261
6,0.31295
7,0.24309
8,0.2059
9,0.15935
10,0.11123
11,0.055327999999999995
12,-0.0054207
13,-0.034265
14,-0.092942
15,-0.13086
16,-0.1886
17,-0.21953000000000003
18,-0.27860999999999997
19,-0.30257
20,-0.33996
21,-0.37724
22,-0.40276999999999996
23,-0.43700000000000006
24,-0.46076999999999996
25,-0.48975
26,-0.51915
27,-0.5323399999999999
28,-0.5438
29,-0.54499
30,-0.57153
31,-0.58213
32,-0.58158
33,-0.59606
34,-0.60519
35,-0.59109
36,-0.58939
37,-0.5823
38,-0.58759
39,-0.59054
40,-0.56824
41,-0.55985
42,-0.55924
43,-0.52418
44,-0.51476
45,-0.4838
46,-0.46347
47,-0.45264
48,-0.41688000000000003
49,-0.3985
50,-0.3566
51,-0.32292
52,-0.29107
53,-0.25103000000000003
54,-0.21206
55,-0.16716
56,-0.11664000000000001
57,-0.060819000000000005
58,-0.021675
59,0.030098000000000003
60,0.07760399999999999
61,0.13945
62,0.183
63,0.23595
64,0.28705
65,0.3511
66,0.41073000000000004
67,0.46701000000000004
68,0.53404
69,0.5991
70,0.67257
71,0.76335
72,0.8758299999999999
73,0.97088
74,1.0848
75,1.1977
76,1.3102
77,1.4094
78,1.5274
79,1.5981
80,1.6332
81,1.6557
82,1.6807
83,1.6739
84,1.6653
85,1.6064
86,1.5184
87,1.4129
88,1.3117
89,1.1981
90,1.0818
91,0.97444
92,0.86074
93,0.7535
94,0.63985
95,0.52994
96,0.4165
97,0.30979
98,0.19882
99,0.08999
100,-0.014116
101,-0.12022000000000001
102,-0.22784000000000001
103,-0.32548
104,-0.43812
105,-0.53452
106,-0.65383
107,-0.7501399999999999
108,-0.86106
109,-0.96362
110,-1.0561
111,-1.1561
112,-1.2548
113,-1.3415
114,-1.4355
115,-1.5276
116,-1.6036
117,-1.6881
118,-1.7675
119,-1.8098
120,-1.8736
121,-1.9152
122,-1.9577
123,-1.9751
124,-1.959
125,-1.9577
126,-1.9082
127,-1.864
128,-1.7944
129,-1.7393
130,-1.6624
131,-1.5813
132,-1.5003
133,-1.4007
134,-1.3042
135,-1.1993
136,-1.1158
137,-1.0081
138,-0.90356
139,-0.80303
140,-0.69101
141,-0.58706
142,-0.48128999999999994
143,-0.37661
144,-0.26475
145,-0.1435
146,-0.038686
147,0.06725700000000001
148,0.17307
149,0.29339
150,0.39941
151,0.49931000000000003
152,0.61968
153,0.72544
154,0.83991
155,0.95221
156,1.0590000000000002
157,1.1643
158,1.2666
159,1.3676
160,1.4671
161,1.5514
162,1.6237
163,1.6451
164,1.6622
165,1.6546
166,1.6322
167,1.6124
168,1.5504
169,1.4645
170,1.3721
171,1.2585
172,1.1462
173,1.0344
174,0.9221799999999999
175,0.81014
