time,value
0,-0.12771
1,-0.12771
2,-0.12771
3,-0.12771
4,-0.12771
5,-0.12771
6,-0.12771
7,-0.12771
8,-0.12771
9,-0.12771
10,-0.12771
11,-0.12771
12,-0.12771
13,-0.12771
14,-0.12771
15,-0.12771
16,-0.12771
17,-0.12771
18,-0.12771
19,-0.12771
20,-0.12771
21,-0.12771
22,-0.12771
23,-0.12771
24,-0.12771
25,-0.12771
26,-0.12771
27,-0.12771
28,-0.12771
29,-0.12771
30,-0.12771
31,-0.12771
32,-0.12771
33,-0.12771
34,-0.12771
35,-0.12771
36,-0.12771
37,-0.12771
38,-0.12771
39,2.7309
40,9.2741
41,-0.12771
42,-0.12771
43,-0.12771
44,-0.12771
45,-0.12771
46,-0.12771
47,-0.12771
48,-0.12771
49,-0.12771
50,-0.12771
51,-0.12771
52,-0.12771
53,-0.12771
54,-0.12771
55,-0.12771
56,-0.12771
57,-0.12771
58,-0.12771
59,-0.12771
60,-0.12771
61,-0.12771
62,-0.12771
63,-0.12771
64,-0.12771
65,-0.12771
66,-0.12771
67,-0.12771
68,-0.12771
69,-0.12771
70,-0.12771
71,-0.12771
72,-0.12771
73,-0.12771
74,-0.12771
75,-0.12771
76,-0.12771
77,-0.12771
78,-0.12771
79,-0.12771
80,-0.12771
81,-0.12771
82,-0.12771
83,-0.12771
84,-0.12771
85,-0.12771
86,-0.12771
87,-0.12771
88,-0.12771
89,-0.12771
90,-0.12771
91,-0.12771
92,-0.12771
93,-0.12771
94,-0.12771
95,-0.12771
