time,value
0,-0.96883
1,-0.96883
2,-0.96883
3,-0.96883
4,-0.96883
5,-0.96883
6,-0.96883
7,-0.96883
8,-0.96883
9,-0.96883
10,-0.96883
11,-0.96883
12,-0.96883
13,-0.96883
14,-0.96883
15,-0.96883
16,-0.96883
17,-0.96883
18,-0.96883
19,-0.96883
20,-0.96883
21,-0.96883
22,-0.96883
23,-0.96883
24,-0.96883
25,-0.96883
26,-0.96883
27,-0.40998999999999997
28,1.5061
29,1.5859
30,0.7077
31,0.7077
32,0.8673700000000001
33,1.9851
34,2.0649
35,2.0649
36,2.3044
37,2.3044
38,2.0649
39,1.6657
40,0.7077
41,0.94721
42,0.6278699999999999
43,0.7077
44,1.1069
45,1.5859
46,0.14886
47,-0.25032
48,-0.010811
49,-0.010811
50,-0.090646
51,-0.090646
52,-0.17048
53,-0.17048
54,-0.25032
55,-0.17048
56,0.14886
57,0.069024
58,0.38836
59,0.78754
60,-0.17048
61,0.6278699999999999
62,-0.25032
63,-0.17048
64,-0.090646
65,0.069024
66,0.22869
67,-0.010811
68,0.6278699999999999
69,1.5859
70,1.5859
71,0.78754
72,1.0270000000000001
73,0.8673700000000001
74,0.78754
75,0.54803
76,0.94721
77,0.6278699999999999
78,0.4682
79,0.7077
80,0.78754
81,0.7077
82,1.0270000000000001
83,-0.96883
84,-0.96883
85,-0.96883
86,-0.96883
87,-0.96883
88,-0.96883
89,-0.96883
90,-0.96883
91,-0.96883
92,-0.96883
93,-0.96883
94,-0.96883
95,-0.96883
