time,value
0,-1.1264
1,-1.0457
2,-0.90671
3,-0.70806
4,-0.46141000000000004
5,-0.17806
6,0.11974000000000001
7,0.42135
8,0.71473
9,0.98913
10,1.2408
11,1.4581
12,1.6395
13,1.7805
14,1.88
15,1.9469999999999998
16,1.9863
17,2.0129
18,2.0322
19,2.0437
20,2.0458
21,2.0279
22,1.993
23,1.9432
24,1.8856
25,1.8291
26,1.7723
27,1.7187
28,1.6649
29,1.6124
30,1.5641
31,1.5177
32,1.479
33,1.4456
34,1.4255
35,1.4208
36,1.4271
37,1.4434
38,1.4563
39,1.4696
40,1.4818
41,1.4932
42,1.508
43,1.5162
44,1.5215
45,1.5155
46,1.4933
47,1.4558
48,1.4009
49,1.3473
50,1.3039
51,1.2790000000000001
52,1.2727
53,1.272
54,1.276
55,1.2761
56,1.273
57,1.2675
58,1.255
59,1.2399
60,1.2133
61,1.1709
62,1.1059999999999999
63,1.0133
64,0.90323
65,0.7812100000000001
66,0.6593399999999999
67,0.54064
68,0.41973999999999995
69,0.29784
70,0.17019
71,0.045353
72,-0.070951
73,-0.17751
74,-0.2702
75,-0.35535
76,-0.42928
77,-0.49167
78,-0.54419
79,-0.5856899999999999
80,-0.6239399999999999
81,-0.65559
82,-0.67957
83,-0.6936399999999999
84,-0.6942
85,-0.68901
86,-0.67855
87,-0.66791
88,-0.6579
89,-0.64508
90,-0.6336
91,-0.62111
92,-0.61077
93,-0.6019800000000001
94,-0.59077
95,-0.5787100000000001
96,-0.56392
97,-0.55057
98,-0.54059
99,-0.53286
100,-0.52885
101,-0.52693
102,-0.52966
103,-0.5382
104,-0.5512600000000001
105,-0.5686399999999999
106,-0.58665
107,-0.60442
108,-0.6208
109,-0.63472
110,-0.64783
111,-0.65982
112,-0.6725800000000001
113,-0.68628
114,-0.7003699999999999
115,-0.71572
116,-0.7306199999999999
117,-0.74645
118,-0.7627
119,-0.77737
120,-0.79067
121,-0.79864
122,-0.80291
123,-0.80493
124,-0.8053
125,-0.80605
126,-0.80348
127,-0.7991199999999999
128,-0.79499
129,-0.7942100000000001
130,-0.80009
131,-0.80988
132,-0.8233600000000001
133,-0.8395600000000001
134,-0.8587899999999999
135,-0.8794700000000001
136,-0.89317
137,-0.8906299999999999
138,-0.86149
139,-0.80106
140,-0.71101
141,-0.5979399999999999
142,-0.47551000000000004
143,-0.35844000000000004
144,-0.26165
145,-0.19468
146,-0.15864
147,-0.14992
148,-0.16088
149,-0.18662
150,-0.22505999999999998
151,-0.27507
152,-0.33604
153,-0.40328
154,-0.47223999999999994
155,-0.53883
156,-0.60051
157,-0.65768
158,-0.70895
159,-0.75413
160,-0.79296
161,-0.82585
162,-0.8555200000000001
163,-0.88234
164,-0.9064399999999999
165,-0.92586
166,-0.93853
167,-0.9457899999999999
168,-0.9478700000000001
169,-0.94871
170,-0.9489700000000001
171,-0.9479700000000001
172,-0.94842
173,-0.9471
174,-0.9473
175,-0.9485399999999999
176,-0.9482
177,-0.95021
178,-0.9492799999999999
179,-0.94709
180,-0.9417200000000001
181,-0.92974
182,-0.9177799999999999
183,-0.9057
184,-0.89992
185,-0.9003899999999999
186,-0.90159
187,-0.90325
188,-0.89555
189,-0.87476
190,-0.8334299999999999
191,-0.76576
192,-0.6775899999999999
193,-0.56805
194,-0.4393
195,-0.28308
196,-0.091192
197,0.12882000000000002
198,0.36386999999999997
199,0.58831
200,0.7854800000000001
201,0.94763
202,1.0702
203,1.156
204,1.2058
205,1.2281
206,1.2354
207,1.24
208,1.2519
209,1.2718
210,1.2972
211,1.3224
212,1.3435
213,1.3599
214,1.3715
215,1.3794
216,1.381
217,1.3725
218,1.35
219,1.3092
220,1.2492
221,1.1655
222,1.0558
223,0.91879
224,0.75576
225,0.57763
226,0.39127
227,0.2079
228,0.032855
229,-0.13280999999999998
230,-0.28209
231,-0.41625
232,-0.5300600000000001
233,-0.62429
234,-0.70285
235,-0.76407
236,-0.8133100000000001
237,-0.847
238,-0.86724
239,-0.8780700000000001
240,-0.87995
241,-0.87985
242,-0.8741899999999999
243,-0.86467
244,-0.8525799999999999
245,-0.8386399999999999
246,-0.82999
247,-0.8232700000000001
248,-0.81918
249,-0.81609
250,-0.81212
251,-0.8104600000000001
252,-0.807
253,-0.8017
254,-0.7941600000000001
255,-0.7851199999999999
256,-0.77761
257,-0.7702
258,-0.76423
259,-0.76232
260,-0.76825
261,-0.78527
262,-0.81362
263,-0.8565799999999999
264,-0.9186
265,-0.9990899999999999
266,-1.0851
267,-1.1531
268,-1.1864
269,-1.1874
