time,value
0,-0.22043000000000001
1,-1.0631
2,-1.0631
3,-1.0631
4,-0.033162
5,1.2777
6,1.0904
7,-0.40769
8,-1.0631
9,-1.0631
10,-1.0631
11,-0.59496
12,1.2777
13,1.1841
14,0.24774000000000002
15,-1.0631
16,-1.0631
17,-1.0631
18,-1.0631
19,0.24774000000000002
20,1.1841
21,1.1841
22,-0.40769
23,-1.0631
24,-1.0631
25,-1.0631
26,-1.0631
27,0.34137
28,1.1841
29,1.1841
30,-0.22043000000000001
31,-1.0631
32,-1.0631
33,-1.0631
34,0.060471000000000004
35,1.1841
36,1.1841
37,0.1541
38,-1.0631
39,-1.0631
40,-1.0631
41,0.9968
42,1.1841
43,1.0904
44,-1.0631
45,-1.0631
46,-1.0631
47,-1.0631
48,1.2777
49,1.1841
50,0.435
51,-1.0631
52,-1.0631
53,-1.0631
54,-0.8758600000000001
55,1.2777
56,1.1841
57,1.1841
58,-0.8758600000000001
59,-1.0631
60,-1.0631
61,-0.50133
62,1.1841
63,1.1841
64,0.62227
65,-1.0631
66,-1.0631
67,0.1541
68,1.2777
69,1.1841
70,1.0904
71,1.0904
72,1.0904
73,0.9968
74,0.9968
75,0.9968
76,0.9968
77,0.9968
78,0.9968
79,0.90317
80,0.90317
81,-1.0631
82,-1.0631
83,-1.0631
84,-0.8758600000000001
85,1.1841
86,1.0904
87,1.0904
88,-0.12679
89,-1.0631
90,-1.0631
91,-0.12679
92,1.1841
93,1.0904
94,-0.50133
95,-1.0631
