time,value
0,-0.16831
1,-0.16831
2,-0.16831
3,-0.16831
4,-0.16831
5,-0.16831
6,-0.16831
7,-0.16831
8,-0.16831
9,-0.16831
10,-0.16831
11,-0.16831
12,-0.16831
13,-0.16831
14,-0.16831
15,-0.16831
16,-0.16831
17,-0.16831
18,-0.16831
19,-0.16831
20,-0.16831
21,-0.16831
22,-0.16831
23,-0.16831
24,-0.16831
25,-0.16831
26,-0.16831
27,-0.16831
28,-0.16831
29,-0.16831
30,-0.16831
31,-0.16831
32,-0.16831
33,-0.16831
34,-0.16831
35,-0.16831
36,-0.16831
37,-0.16831
38,-0.16831
39,-0.16831
40,-0.16831
41,-0.16831
42,-0.16831
43,-0.16831
44,-0.16831
45,-0.16831
46,-0.16831
47,-0.16831
48,-0.16831
49,-0.16831
50,-0.16831
51,-0.16831
52,-0.16831
53,-0.16831
54,-0.16831
55,-0.16831
56,-0.16831
57,-0.16831
58,-0.16831
59,-0.16831
60,-0.16831
61,-0.16831
62,-0.16831
63,-0.16831
64,-0.16831
65,-0.16831
66,-0.16831
67,-0.16831
68,-0.16831
69,-0.16831
70,-0.16831
71,-0.16831
72,-0.16831
73,-0.16831
74,-0.16831
75,-0.16831
76,-0.16831
77,-0.16831
78,-0.16831
79,-0.16831
80,-0.16831
81,-0.16831
82,-0.093329
83,0.15034
84,6.6545
85,0.15034
86,0.16909000000000002
87,0.15034
88,6.8982
89,0.73141
90,-0.16831
91,-0.16831
92,-0.16831
93,-0.16831
94,-0.16831
95,-0.16831
