time,value
0,-0.27188
1,-0.27188
2,-0.27188
3,-0.27188
4,-0.27188
5,-0.27188
6,-0.27188
7,-0.27188
8,-0.27188
9,-0.27188
10,-0.27188
11,-0.27188
12,-0.27188
13,-0.27188
14,-0.27188
15,-0.27188
16,-0.27188
17,-0.27188
18,-0.27188
19,-0.27188
20,-0.27188
21,-0.27188
22,-0.27188
23,-0.27188
24,-0.27188
25,-0.27188
26,-0.27188
27,3.1904
28,-0.27188
29,-0.27188
30,-0.27188
31,-0.27188
32,-0.27188
33,-0.27188
34,4.4332
35,-0.1831
36,-0.27188
37,-0.27188
38,-0.27188
39,-0.27188
40,-0.27188
41,2.7909
42,-0.27188
43,-0.27188
44,-0.27188
45,2.0363
46,2.924
47,-0.27188
48,-0.27188
49,-0.27188
50,-0.27188
51,-0.27188
52,-0.27188
53,-0.27188
54,-0.27188
55,-0.27188
56,-0.27188
57,-0.27188
58,-0.27188
59,-0.27188
60,-0.27188
61,-0.27188
62,-0.27188
63,-0.27188
64,-0.27188
65,-0.27188
66,-0.27188
67,-0.27188
68,-0.27188
69,-0.27188
70,-0.27188
71,-0.27188
72,-0.27188
73,-0.27188
74,-0.27188
75,-0.27188
76,4.4332
77,-0.27188
78,-0.27188
79,-0.27188
80,-0.27188
81,4.3001
82,-0.27188
83,-0.27188
84,-0.27188
85,-0.27188
86,-0.27188
87,-0.27188
88,-0.27188
89,-0.27188
90,-0.27188
91,-0.27188
92,-0.27188
93,-0.27188
94,-0.27188
95,-0.27188
