time,value
0,2.1052
1,2.0709999999999997
2,2.0414
3,2.0098
4,1.9614
5,1.915
6,1.8699
7,1.8244
8,1.7779
9,1.7327
10,1.6881
11,1.6436
12,1.5984
13,1.554
14,1.5082
15,1.4622
16,1.4157
17,1.3703
18,1.3251
19,1.2805
20,1.236
21,1.1911
22,1.1471
23,1.1025
24,1.0587
25,1.0147
26,0.9701
27,0.92574
28,0.88166
29,0.8377399999999999
30,0.79427
31,0.75116
32,0.70836
33,0.66577
34,0.62883
35,0.5867
36,0.54476
37,0.5031899999999999
38,0.46205
39,0.42146000000000006
40,0.38045
41,0.34064
42,0.30075999999999997
43,0.2613
44,0.22225
45,0.18338
46,0.14426
47,0.10588
48,0.067514
49,0.029507
50,-0.0078831
51,-0.045217
52,-0.08215
53,-0.11865999999999999
54,-0.15588
55,-0.19141
56,-0.22643000000000002
57,-0.26165
58,-0.29656
59,-0.33177
60,-0.36653
61,-0.40242
62,-0.43462
63,-0.46793
64,-0.50278
65,-0.5372600000000001
66,-0.56967
67,-0.5985199999999999
68,-0.62778
69,-0.65887
70,-0.68794
71,-0.71397
72,-0.73805
73,-0.7609899999999999
74,-0.77972
75,-0.78674
76,-0.7874899999999999
77,-0.78541
78,-0.7801600000000001
79,-0.77323
80,-0.76239
81,-0.74975
82,-0.73534
83,-0.7236600000000001
84,-0.71624
85,-0.70239
86,-0.68838
87,-0.67033
88,-0.65155
89,-0.63138
90,-0.61345
91,-0.60509
92,-0.6086699999999999
93,-0.61626
94,-0.6540600000000001
95,-0.69312
96,-0.7318399999999999
97,-0.76636
98,-0.80289
99,-0.8394
100,-0.8765799999999999
101,-0.9191600000000001
102,-0.96693
103,-1.0023
104,-1.0422
105,-1.0714
106,-1.1155
107,-1.1586
108,-1.1957
109,-1.2331
110,-1.2608
111,-1.2790000000000001
112,-1.2951
113,-1.3048
114,-1.3155
115,-1.3302
116,-1.3321
117,-1.3367
118,-1.3616
119,-1.3725
120,-1.38
121,-1.3780000000000001
122,-1.3783
123,-1.3794
124,-1.3785
125,-1.3754
126,-1.3703
127,-1.3631
128,-1.3593
129,-1.3535
130,-1.3426
131,-1.3307
132,-1.3192
133,-1.306
134,-1.286
135,-1.2645
136,-1.2466
137,-1.2271
138,-1.2109999999999999
139,-1.1809
140,-1.1536
141,-1.1276
142,-1.1023
143,-1.0759999999999998
144,-1.0487
145,-1.0165
146,-0.9876799999999999
147,-0.95785
148,-0.92395
149,-0.8930299999999999
150,-0.8615
151,-0.82785
152,-0.79328
153,-0.75343
154,-0.7157600000000001
155,-0.67306
156,-0.63229
157,-0.5855100000000001
158,-0.53835
159,-0.50069
160,-0.46279
161,-0.42467
162,-0.38633
163,-0.37235
164,-0.36180999999999996
165,-0.34289000000000003
166,-0.31865
167,-0.28553
168,-0.24975
169,-0.21179
170,-0.17524
171,-0.13879
172,-0.09991
173,-0.060885
174,-0.023847
175,0.016041
176,0.059024
177,0.10687999999999999
178,0.15649000000000002
179,0.2042
180,0.25190999999999997
181,0.299
182,0.34651
183,0.39296
184,0.43943999999999994
185,0.48696000000000006
186,0.5344800000000001
187,0.5820000000000001
188,0.62953
189,0.6772
190,0.7267399999999999
191,0.77483
192,0.8239700000000001
193,0.87249
194,0.92124
195,0.9687899999999999
196,1.0201
197,1.0723
198,1.1203
199,1.1679
200,1.2027
201,1.1767
202,1.1638
203,1.1555
204,1.1418
205,1.1294
206,1.1116
207,1.0768
208,1.0367
209,0.99284
210,0.97459
211,0.97736
212,0.9949600000000001
213,1.0312
214,1.0695
215,1.079
216,1.0394
217,0.99641
218,0.9608899999999999
219,0.93104
220,0.91205
221,0.90846
222,0.9343
223,0.9609
224,0.96959
225,0.9250299999999999
226,0.9055
227,0.909
228,0.92171
229,0.9382
230,0.9687100000000001
231,1.0103
232,1.052
233,1.0873
234,1.1283
235,1.1701
236,1.1851
237,1.1419
238,1.0991
239,1.0559
240,1.0551
241,1.0703
242,1.0759
243,1.1064
244,1.1495
245,1.1928
246,1.2362
247,1.2747
248,1.2891
249,1.2471
250,1.2051
251,1.1619
252,1.1187
253,1.0755
254,1.0321
255,0.9886799999999999
256,0.94547
257,0.90749
258,0.86429
259,0.8211700000000001
260,0.7780199999999999
261,0.735
262,0.69214
263,0.6494300000000001
264,0.60687
265,0.5645600000000001
266,0.52251
267,0.48045
268,0.43867
269,0.3971
270,0.35547
271,0.31385
272,0.27243
273,0.23068000000000002
274,0.1891
275,0.14792
276,0.10664000000000001
277,0.06590399999999999
278,0.025351
279,-0.015005000000000001
280,-0.056613
281,-0.098166
282,-0.14121
283,-0.18489
284,-0.22719
285,-0.2702
286,-0.31468
287,-0.35612
288,-0.39776999999999996
289,-0.41841999999999996
290,-0.42855
291,-0.44108
292,-0.44722
293,-0.45236000000000004
294,-0.46726999999999996
295,-0.48113999999999996
296,-0.4993
297,-0.51961
298,-0.53222
299,-0.5544600000000001
300,-0.56925
301,-0.56613
302,-0.56784
303,-0.56201
304,-0.54995
305,-0.53691
306,-0.5229199999999999
307,-0.508
308,-0.52927
309,-0.5677800000000001
310,-0.60515
311,-0.64503
312,-0.68434
313,-0.72741
314,-0.7704300000000001
315,-0.81365
316,-0.8567899999999999
317,-0.90225
318,-0.9476899999999999
319,-0.99434
320,-1.0419
321,-1.0832
322,-1.1311
323,-1.1725
324,-1.2152
325,-1.2628
326,-1.3013
327,-1.3245
328,-1.3476
329,-1.3684
330,-1.3884
331,-1.4146
332,-1.4307
333,-1.4502
334,-1.4679
335,-1.4868
336,-1.4991
337,-1.5053
338,-1.516
339,-1.5223
340,-1.5294
341,-1.494
342,-1.4535
343,-1.4112
344,-1.3673
345,-1.3217
346,-1.2776
347,-1.2338
348,-1.1971
349,-1.1577
350,-1.1197
351,-1.0823
352,-1.0441
353,-1.0068
354,-0.9746600000000001
355,-0.9420200000000001
356,-0.92955
357,-0.932
358,-0.9330700000000001
359,-0.9381700000000001
360,-0.9666
361,-0.9952200000000001
362,-1.0261
363,-1.05
364,-1.0804
365,-1.1091
366,-1.1375
367,-1.1741
368,-1.2052
369,-1.2237
370,-1.2374
371,-1.2211
372,-1.1873
373,-1.1557
374,-1.1114
375,-1.0712
376,-1.0395
377,-1.0013
378,-0.9721799999999999
379,-0.9415100000000001
380,-0.90499
381,-0.87026
382,-0.83291
383,-0.7952600000000001
384,-0.75636
385,-0.71953
386,-0.68234
387,-0.6448
388,-0.6069399999999999
389,-0.56879
390,-0.53035
391,-0.49301000000000006
392,-0.45798
393,-0.42061000000000004
394,-0.37646999999999997
395,-0.33457
396,-0.29429
397,-0.25484
398,-0.21806
399,-0.17490999999999998
400,-0.13479000000000002
401,-0.096684
402,-0.049549
403,-0.010273000000000001
404,0.023946000000000002
405,0.063867
406,0.10260999999999999
407,0.14338
408,0.18482
409,0.22635
410,0.26853
411,0.30882
412,0.34565
413,0.38185
414,0.41544
415,0.45203999999999994
416,0.48883000000000004
417,0.52846
418,0.5655399999999999
419,0.60264
420,0.63758
421,0.67514
422,0.7128399999999999
423,0.75067
424,0.78733
425,0.82429
426,0.8625299999999999
427,0.9008700000000001
428,0.9393299999999999
429,0.9778899999999999
430,1.0145
431,1.0531
432,1.092
433,1.1301
434,1.1667
435,1.2006
436,1.2393
437,1.2753
438,1.3125
439,1.3484
440,1.3863
441,1.4241
442,1.4621
443,1.4965
444,1.5329
445,1.5721
446,1.6109
447,1.6466
448,1.6819
449,1.7156
450,1.7431
451,1.7708
452,1.8058
453,1.8419999999999999
454,1.8786
455,1.9147
456,1.9505
457,1.9852
458,2.0204
459,2.0535
460,2.0769
461,2.0951
462,2.1075
