[<text>
<title>boston digital corp &lt;bost.o&gt; 4th qtr net</title>
<dateline>    milford, mass., june 19 - </dateline>period ended april 30
    shr profit nil vs loss eight cts
    net profit 4,000 vs loss 213,000
    sales 3,668,000 vs 2,602,000
    year
    shr loss 18 cts vs loss 23 cts
    net loss 482,000 vs loss 614,000
    sales 12.5 mln vs 13.6 mln
    note: 1987 earnings in each period include a provision for
unrealized loss on marketable securities of 176,000 dlrs
 reuter
</text>]