time,value
0,-0.13271
1,-0.13271
2,-0.13271
3,-0.13271
4,-0.13271
5,-0.13271
6,-0.13271
7,-0.13271
8,-0.13271
9,-0.13271
10,-0.13271
11,-0.13271
12,-0.13271
13,-0.13271
14,-0.13271
15,-0.13271
16,-0.13271
17,-0.13271
18,-0.13271
19,-0.13271
20,-0.13271
21,-0.13271
22,-0.13271
23,-0.13271
24,-0.13271
25,-0.13271
26,-0.13271
27,-0.13271
28,-0.13271
29,-0.13271
30,-0.13271
31,-0.13271
32,-0.13271
33,-0.13271
34,-0.13271
35,-0.13271
36,-0.13271
37,-0.13271
38,-0.13271
39,-0.13271
40,9.0243
41,3.4505
42,-0.13271
43,-0.13271
44,-0.13271
45,-0.13271
46,-0.13271
47,-0.13271
48,-0.13271
49,-0.13271
50,-0.13271
51,-0.13271
52,-0.13271
53,-0.13271
54,-0.13271
55,-0.13271
56,-0.13271
57,-0.13271
58,-0.13271
59,-0.13271
60,-0.13271
61,-0.13271
62,-0.13271
63,-0.13271
64,-0.13271
65,-0.13271
66,-0.13271
67,-0.13271
68,-0.13271
69,-0.13271
70,-0.13271
71,-0.13271
72,-0.13271
73,-0.13271
74,-0.13271
75,-0.13271
76,-0.13271
77,-0.13271
78,-0.13271
79,-0.13271
80,-0.13271
81,-0.13271
82,-0.13271
83,-0.13271
84,-0.13271
85,-0.13271
86,-0.13271
87,-0.13271
88,-0.13271
89,-0.13271
90,-0.13271
91,-0.13271
92,-0.13271
93,-0.13271
94,-0.13271
95,-0.13271
