time,value
0,-1.1398
1,-0.9975200000000001
2,-0.75837
3,-0.43057
4,-0.041105
5,0.37815
6,0.7935300000000001
7,1.1740000000000002
8,1.4959
9,1.744
10,1.915
11,2.0165
12,2.0607
13,2.0625
14,2.0351
15,1.9889
16,1.932
17,1.8665
18,1.788
19,1.6892
20,1.5630000000000002
21,1.4076
22,1.2281
23,1.0321
24,0.82996
25,0.63003
26,0.43683999999999995
27,0.25727
28,0.094475
29,-0.05142000000000001
30,-0.17733
31,-0.28858
32,-0.38803000000000004
33,-0.47475
34,-0.55525
35,-0.6218100000000001
36,-0.67373
37,-0.71825
38,-0.75161
39,-0.78147
40,-0.81006
41,-0.8298200000000001
42,-0.84526
43,-0.853
44,-0.8524799999999999
45,-0.8538899999999999
46,-0.8490200000000001
47,-0.83305
48,-0.79972
49,-0.7284
50,-0.60664
51,-0.42216000000000004
52,-0.16722
53,0.14590999999999998
54,0.49562
55,0.84915
56,1.1689
57,1.4329
58,1.6317
59,1.7709
60,1.8685
61,1.94
62,1.9955
63,2.0384
64,2.065
65,2.0715
66,2.0544
67,2.01
68,1.9369999999999998
69,1.8335
70,1.7001
71,1.5411
72,1.3627
73,1.1718
74,0.97431
75,0.77285
76,0.5704
77,0.37112
78,0.18024
79,0.0054555
80,-0.14920999999999998
81,-0.2848
82,-0.40328
83,-0.51134
84,-0.61093
85,-0.6997
86,-0.77973
87,-0.8474799999999999
88,-0.90356
89,-0.9544799999999999
90,-0.9952700000000001
91,-1.0266
92,-1.0518
93,-1.0658
94,-1.0743
95,-1.0789
96,-1.0769
97,-1.073
98,-1.0654
99,-1.0549
100,-1.0474
101,-1.0388
102,-1.0290000000000001
103,-1.0198
104,-1.0056
105,-0.9883700000000001
106,-0.96951
107,-0.94506
108,-0.91517
109,-0.87695
110,-0.8261200000000001
111,-0.76703
112,-0.70197
113,-0.63437
114,-0.57267
115,-0.5173800000000001
116,-0.47222
117,-0.44471000000000005
118,-0.43673999999999996
119,-0.44973
120,-0.48013999999999996
121,-0.5180100000000001
122,-0.5575
123,-0.59425
124,-0.6249
125,-0.6473800000000001
126,-0.65342
127,-0.635
128,-0.5885199999999999
129,-0.51337
130,-0.41307
131,-0.29063
132,-0.14704
133,0.014147999999999999
134,0.18514
135,0.35226999999999997
136,0.49878999999999996
137,0.61239
138,0.68688
139,0.72356
140,0.7287100000000001
141,0.70813
142,0.66688
143,0.6077199999999999
144,0.53176
145,0.44268
146,0.34353
147,0.23671999999999999
148,0.12635
149,0.013966999999999999
150,-0.09785
151,-0.20494
152,-0.30541
153,-0.39797
154,-0.48333999999999994
155,-0.56519
156,-0.64379
157,-0.71732
158,-0.7871100000000001
159,-0.84783
160,-0.89874
161,-0.94511
162,-0.98474
163,-1.0217
164,-1.0584
165,-1.0898
166,-1.1197
167,-1.1455
168,-1.1642
169,-1.1829
170,-1.1953
171,-1.2008
172,-1.2044
173,-1.2009
174,-1.1931
175,-1.1824
176,-1.1640000000000001
177,-1.1397
178,-1.1036
179,-1.0416
180,-0.9398200000000001
181,-0.77405
182,-0.53103
183,-0.22004
184,0.13790999999999998
185,0.50588
186,0.8462700000000001
187,1.1371
188,1.3642
189,1.5259
190,1.6318
191,1.6926
192,1.7258
193,1.7449
194,1.7517
195,1.7429
196,1.7109999999999999
197,1.6519
198,1.5725
199,1.4833
200,1.3946
201,1.3130000000000002
202,1.2387
203,1.172
204,1.1143
205,1.0671
206,1.0335
207,1.0136
208,1.0044
209,1.0019
210,0.9995299999999999
211,0.99174
212,0.97293
213,0.9352799999999999
214,0.8766
215,0.79243
216,0.68037
217,0.54886
218,0.4028
219,0.25263
220,0.11043
221,-0.022187000000000002
222,-0.13999
223,-0.2419
224,-0.33287
225,-0.40733
226,-0.46618000000000004
227,-0.5141899999999999
228,-0.54914
229,-0.57817
230,-0.60525
231,-0.6291100000000001
232,-0.65318
233,-0.67472
234,-0.69206
235,-0.70786
236,-0.71745
237,-0.72034
238,-0.7175600000000001
239,-0.70535
240,-0.68774
241,-0.66669
242,-0.64256
243,-0.6191800000000001
244,-0.5943
245,-0.5668300000000001
246,-0.53909
247,-0.50988
248,-0.48228000000000004
249,-0.45971000000000006
250,-0.44053000000000003
251,-0.42517
252,-0.41261000000000003
253,-0.40198
254,-0.39594
255,-0.39678
256,-0.40821999999999997
257,-0.43518999999999997
258,-0.47941999999999996
259,-0.54075
260,-0.61588
261,-0.6984100000000001
262,-0.78528
263,-0.87566
264,-0.96824
265,-1.0584
266,-1.1348
267,-1.186
268,-1.2084
269,-1.2082
