time,value
0,-0.6562
1,-0.6562
2,-0.6562
3,-0.6562
4,-0.6562
5,-0.6562
6,-0.6562
7,-0.6562
8,-0.6562
9,-0.6562
10,-0.6562
11,-0.6562
12,-0.6562
13,-0.6562
14,-0.6562
15,-0.6562
16,-0.6562
17,-0.6562
18,-0.6562
19,-0.6562
20,-0.6562
21,-0.6562
22,-0.6562
23,-0.6562
24,-0.6562
25,-0.6562
26,-0.6562
27,-0.6562
28,-0.6562
29,-0.6562
30,-0.6562
31,-0.6562
32,-0.6562
33,-0.6562
34,-0.6562
35,-0.6562
36,-0.6562
37,-0.6562
38,-0.6562
39,-0.6562
40,-0.6562
41,-0.6562
42,-0.6562
43,-0.6562
44,-0.6562
45,-0.6562
46,-0.6562
47,-0.6562
48,-0.6562
49,0.87179
50,1.7747
51,-0.10056
52,-0.6562
53,-0.6562
54,-0.6562
55,-0.6562
56,-0.6562
57,-0.6562
58,-0.6562
59,1.2191
60,1.6358
61,1.358
62,1.4969
63,1.5663
64,1.5663
65,1.4969
66,1.358
67,1.7052
68,1.7747
69,1.7747
70,1.7747
71,0.038344
72,-0.44783
73,-0.37838
74,-0.44783
75,0.5939800000000001
76,1.6358
77,1.2885
78,1.6358
79,1.4969
80,1.7052
81,1.6358
82,1.7052
83,1.4274
84,1.7747
85,1.7052
86,1.7747
87,1.7747
88,1.1496
89,-0.6562
90,-0.6562
91,-0.6562
92,-0.6562
93,-0.6562
94,-0.6562
95,-0.6562
