time,value
0,0.18158
1,-0.96147
2,-0.67571
3,1.6818
4,-0.31851
5,-0.96147
6,0.18158
7,1.2532
8,-0.96147
9,-0.96147
10,0.8245399999999999
11,0.53878
12,-0.96147
13,-0.96147
14,1.6818
15,-0.38995
16,-0.96147
17,-0.032744
18,1.3246
19,-0.96147
20,-0.96147
21,0.61022
22,0.61022
23,-0.96147
24,-0.96147
25,1.1817
26,-0.032744
27,-0.96147
28,-0.46138999999999997
29,1.5389
30,-0.96147
31,-0.96147
32,0.32445999999999997
33,0.7531
34,-0.96147
35,-0.96147
36,0.9674200000000001
37,0.11014000000000002
38,-0.96147
39,-0.8185899999999999
40,1.6818
41,-0.10418
42,-0.96147
43,0.038697
44,1.3961
45,-0.96147
46,-0.96147
47,0.8959799999999999
48,0.68166
49,-0.96147
50,-0.96147
51,1.4675
52,0.53878
53,-0.96147
54,-0.67571
55,1.6818
56,-0.31851
57,-0.96147
58,-0.032744
59,1.6104
60,-0.38995
61,-0.96147
62,0.038697
63,1.6104
64,-0.96147
65,-0.96147
66,0.8959799999999999
67,1.1103
68,-0.96147
69,-0.96147
70,1.5389
71,0.32445999999999997
72,-0.96147
73,-0.60427
74,1.6104
75,0.46734
76,-0.96147
77,-0.67571
78,1.6818
79,0.9674200000000001
80,-0.96147
81,-0.96147
82,1.6818
83,1.3961
84,-0.96147
85,-0.96147
86,1.0389
87,1.2532
88,-0.96147
89,-0.96147
90,1.1103
91,0.7531
92,-0.96147
93,-0.96147
94,1.6818
95,0.11014000000000002
