time,value
0,-1.1033
1,-1.0512
2,-1.0512
3,-1.2074
4,-1.2594
5,-1.3114
6,-1.2594
7,-1.2594
8,-0.9991700000000001
9,-1.0512
10,-1.0512
11,-1.0512
12,-1.0512
13,-1.0512
14,-1.1033
15,-1.0512
16,-0.9471299999999999
17,-1.2074
18,-1.2594
19,-1.2594
20,-1.3114
21,-1.2594
22,-1.2594
23,-1.3114
24,-1.2594
25,-1.2594
26,-1.2594
27,-1.3114
28,-1.2594
29,-1.2594
30,-1.2594
31,-1.3114
32,-1.2594
33,-1.2594
34,-1.2594
35,-1.3114
36,-1.1553
37,-1.2594
38,-0.9991700000000001
39,0.6663
40,0.71834
41,0.6663
42,0.71834
43,0.6663
44,0.6663
45,0.6663
46,0.6663
47,0.6663
48,0.6663
49,0.6663
50,0.6663
51,0.6663
52,0.7703899999999999
53,0.6663
54,0.6663
55,0.6663
56,0.6663
57,0.6663
58,0.6663
59,0.6663
60,0.6663
61,0.6663
62,0.6663
63,0.6663
64,0.61425
65,0.6663
66,0.6663
67,0.6663
68,0.8224299999999999
69,0.97857
70,1.1868
71,1.1347
72,1.1868
73,1.1347
74,1.1868
75,1.0306
76,0.9265200000000001
77,0.8744799999999999
78,0.9265200000000001
79,0.9265200000000001
80,0.9265200000000001
81,0.8744799999999999
82,0.9265200000000001
83,0.9265200000000001
84,0.9265200000000001
85,0.9265200000000001
86,0.9265200000000001
87,0.9265200000000001
88,0.8744799999999999
89,0.9265200000000001
90,0.9265200000000001
91,0.9265200000000001
92,0.9265200000000001
93,0.8744799999999999
94,0.9265200000000001
95,0.8744799999999999
