time,value
0,1.8215
1,1.6928
2,1.5321
3,1.4006
4,1.2685
5,1.1415
6,0.98035
7,0.83991
8,0.66361
9,0.5668
10,0.41496000000000005
11,0.2563
12,0.10979000000000001
13,-0.036282
14,-0.16203
15,-0.28407
16,-0.40836999999999996
17,-0.53647
18,-0.6703100000000001
19,-0.8291700000000001
20,-0.9627
21,-1.1124
22,-1.2687
23,-1.3705
24,-1.5503
25,-1.6801
26,-1.5875
27,-1.4943
28,-1.4319
29,-1.3073
30,-1.217
31,-1.1263
32,-1.0271
33,-1.0115
34,-1.005
35,-0.89536
36,-0.80783
37,-0.7105600000000001
38,-0.60611
39,-0.48906000000000005
40,-0.4638
41,-0.5552600000000001
42,-0.64289
43,-0.56517
44,-0.48483999999999994
45,-0.40360999999999997
46,-0.51546
47,-0.54266
48,-0.44351999999999997
49,-0.40053
50,-0.51579
51,-0.63347
52,-0.73968
53,-0.7943600000000001
54,-0.9615799999999999
55,-1.0772
56,-1.0984
57,-1.0005
58,-1.126
59,-1.2423
60,-1.4206
61,-1.5938
62,-1.6798
63,-1.786
64,-1.9688
65,-2.1554
66,-2.1477
67,-2.0302
68,-1.8778
69,-1.7294
70,-1.61
71,-1.4653
72,-1.3230000000000002
73,-1.1778
74,-1.1499
75,-1.1768
76,-1.0207
77,-0.87251
78,-0.7308899999999999
79,-0.59901
80,-0.44276000000000004
81,-0.30374
82,-0.15556
83,-0.09777000000000001
84,-0.077322
85,0.023119999999999998
86,0.15498
87,0.30315
88,0.45842
89,0.5897600000000001
90,0.73335
91,0.66479
92,0.78372
93,0.91832
94,1.0706
95,1.2188
96,1.3438
97,1.3351
98,1.4341
99,1.5726
100,1.6986
101,1.7711
102,1.9143
103,2.0519
104,2.1851
105,2.142
106,1.9855
107,1.8369
108,1.7271
109,1.5816
110,1.4388
111,1.4975
112,1.3829
113,1.266
114,1.1171
115,0.98105
116,0.86413
117,0.8197700000000001
118,0.93975
119,0.8284600000000001
120,0.69982
121,0.60106
122,0.49094
123,0.46396000000000004
124,0.37464000000000003
125,0.24883000000000002
126,0.14281
127,0.0068803
128,-0.10632
129,-0.20368
130,-0.11834000000000001
131,-0.21824000000000002
132,-0.33726
133,-0.44428
134,-0.55577
135,-0.6776800000000001
136,-0.76854
137,-0.78342
138,-0.8995799999999999
139,-0.9986299999999999
140,-1.0819
141,-1.1912
142,-1.2965
143,-1.3421
144,-1.1539
145,-0.9496600000000001
146,-0.79242
147,-0.70332
148,-0.49726000000000004
149,-0.29370999999999997
150,-0.15665
151,-0.062515
152,0.026927999999999997
153,0.00019487
154,0.023285
155,0.22906999999999997
156,0.37974
157,0.56181
158,0.76753
159,0.89513
160,1.0343
161,1.2303
162,1.3586
163,1.5647
164,1.5976
165,1.4967
166,1.3714
167,1.2631
168,1.1951
169,1.0653
170,0.9888600000000001
171,1.0186
172,0.9127799999999999
173,0.80015
174,0.6843199999999999
175,0.60546
176,0.48478999999999994
177,0.37216
178,0.38489
179,0.40294
180,0.31214000000000003
181,0.24398000000000003
182,0.23970999999999998
183,0.21369000000000002
184,0.14346
185,0.09888999999999999
186,0.05644
187,-0.0054458
188,-0.095359
189,-0.20153
190,-0.26802
191,-0.26835
192,-0.37449
193,-0.44236000000000003
194,-0.50446
195,-0.57601
196,-0.6752600000000001
197,-0.6562600000000001
198,-0.70625
199,-0.7509899999999999
200,-0.81708
201,-0.92065
202,-0.98377
203,-1.0741
204,-1.1267
205,-1.2485
206,-1.2719
207,-1.2252
208,-1.1256
209,-1.0393
210,-0.9506600000000001
211,-0.99797
212,-0.8746700000000001
213,-0.73511
214,-0.59607
215,-0.44354
216,-0.27421
217,-0.16276
218,-0.079444
219,-0.17907
220,-0.28189000000000003
221,-0.35647
222,-0.34703
223,-0.38079
224,-0.44159
225,-0.41894
226,-0.45443999999999996
227,-0.53985
228,-0.59215
229,-0.52169
230,-0.46186000000000005
231,-0.4921
232,-0.52412
233,-0.56979
234,-0.63002
235,-0.67667
236,-0.78012
237,-0.8586799999999999
238,-0.9401
239,-0.90436
240,-0.77936
241,-0.65763
242,-0.66383
243,-0.7649600000000001
244,-0.8092199999999999
245,-0.8438100000000001
246,-0.9412299999999999
247,-0.9741799999999999
248,-1.0667
249,-1.1717
250,-1.272
251,-1.3774
252,-1.5438
253,-1.6691
254,-1.71
255,-1.5893
256,-1.4280000000000002
257,-1.2787
258,-1.104
259,-0.9524
260,-0.7591899999999999
261,-0.60746
262,-0.40295
263,-0.27481
264,-0.078842
265,0.1255
266,0.32656999999999997
267,0.45906
268,0.66046
269,0.86088
270,1.0037
271,1.1959
272,1.3991
273,1.5976
274,1.8026
275,1.9289
276,2.0969
277,2.2858
278,2.3714
279,2.4935
280,2.5935
281,2.6741
282,2.7148
283,2.6752
284,2.544
285,2.3989
286,2.2241
287,2.0726
288,1.9005
289,1.7664
290,1.5776
291,1.4224
292,1.2569
293,1.0892
294,0.88707
295,0.75108
296,0.54751
297,0.41527
298,0.21736
299,0.01162
300,-0.11398
301,-0.31456999999999996
302,-0.44988
303,-0.65087
304,-0.78963
305,-0.98969
306,-1.1196
307,-1.3119999999999998
308,-1.234
309,-1.1011
310,-0.95852
311,-0.94309
312,-0.84604
313,-0.8270299999999999
314,-0.71737
315,-0.5908100000000001
316,-0.5314300000000001
317,-0.50084
318,-0.45383999999999997
319,-0.39541
320,-0.37617
321,-0.29846999999999996
322,-0.24908000000000002
323,-0.21591
324,-0.27839
325,-0.41968999999999995
326,-0.54633
327,-0.70863
328,-0.6871
329,-0.6086600000000001
330,-0.52832
331,-0.47248
332,-0.40321
333,-0.29395
334,-0.21909
335,-0.14261
336,-0.19630999999999998
337,-0.19863
338,-0.09957
339,-0.027323000000000004
340,0.014103000000000001
341,0.079823
342,0.11855
343,0.15325
344,0.22729000000000002
345,0.28981
346,0.35667
347,0.41512
348,0.44193999999999994
349,0.25427
350,0.050057
351,-0.075895
352,-0.26800999999999997
353,-0.2274
354,-0.32637
355,-0.46121999999999996
356,-0.61631
357,-0.79286
358,-0.81
359,-0.72578
360,-0.63462
361,-0.5516399999999999
362,-0.47107
363,-0.37551
364,-0.30483000000000005
365,-0.242
366,-0.2371
367,-0.13662
368,-0.044558999999999994
369,-0.0026550999999999996
370,0.087421
371,0.12393
372,-0.016689
373,0.043508
374,0.14202
375,0.23815
376,0.30635
377,0.41186999999999996
378,0.5100600000000001
379,0.6273
380,0.54857
381,0.53372
382,0.63735
383,0.75718
384,0.81794
385,0.9304
386,1.0589
387,1.1640000000000001
388,1.2944
389,1.3079
390,1.1285
391,0.93132
392,0.76804
393,0.68038
394,0.55256
395,0.36934
396,0.1806
397,-0.0029346999999999997
398,-0.14892
399,-0.31804
400,-0.41329
401,-0.29814
402,-0.20867
403,-0.06624400000000001
404,0.053038
405,0.15858
406,0.2239
407,0.28492
408,0.42781
409,0.50026
410,0.5754
411,0.6047399999999999
412,0.56174
413,0.6775399999999999
414,0.79069
415,0.86279
416,0.9971
417,1.0958
418,1.012
419,1.1540000000000001
420,1.2935
421,1.3079
422,1.4182
423,1.5136
424,1.6561
425,1.8261
426,1.8797
