time,value
0,-0.25978
1,-0.25978
2,-0.25978
3,-0.25978
4,-0.25978
5,-0.25978
6,-0.25978
7,-0.25978
8,-0.25978
9,-0.25978
10,-0.25978
11,-0.25978
12,-0.25978
13,-0.25978
14,-0.25978
15,-0.25978
16,-0.25978
17,-0.25978
18,-0.25978
19,-0.25978
20,-0.25978
21,-0.25978
22,-0.25978
23,-0.25978
24,-0.25978
25,-0.25978
26,-0.25978
27,-0.25978
28,-0.25978
29,-0.25978
30,-0.25978
31,-0.25978
32,-0.25978
33,-0.25978
34,-0.25978
35,-0.25978
36,-0.25978
37,-0.25978
38,-0.25978
39,-0.25978
40,-0.25978
41,5.6845
42,1.135
43,4.0241
44,1.8987
45,1.1017
46,-0.25978
47,-0.25978
48,-0.25978
49,-0.25978
50,-0.25978
51,-0.25978
52,-0.25978
53,-0.25978
54,-0.25978
55,-0.25978
56,-0.25978
57,-0.25978
58,-0.25978
59,-0.25978
60,-0.25978
61,-0.25978
62,-0.25978
63,-0.25978
64,-0.25978
65,-0.25978
66,-0.25978
67,-0.25978
68,-0.25978
69,-0.25978
70,-0.25978
71,-0.25978
72,-0.25978
73,-0.25978
74,-0.25978
75,-0.25978
76,-0.25978
77,-0.25978
78,-0.25978
79,-0.25978
80,-0.25978
81,-0.25978
82,-0.25978
83,-0.25978
84,-0.25978
85,4.8211
86,3.1939
87,1.0021
88,-0.25978
89,-0.25978
90,-0.25978
91,-0.25978
92,-0.25978
93,-0.25978
94,-0.25978
95,-0.25978
