time,value
0,1.8744
1,1.8838
2,1.8935
3,1.8994
4,1.9098
5,1.8906
6,1.8674
7,1.8447
8,1.8197
9,1.7944
10,1.7647
11,1.7328
12,1.7048
13,1.6766
14,1.6482
15,1.6215
16,1.5921
17,1.5629
18,1.5337
19,1.5018
20,1.4699
21,1.4354
22,1.4036
23,1.369
24,1.3345
25,1.3030000000000002
26,1.2686
27,1.2374
28,1.2034
29,1.171
30,1.138
31,1.1041
32,1.0733
33,1.0395
34,1.0058
35,0.9753299999999999
36,0.9418
37,0.90835
38,0.875
39,0.84175
40,0.8086
41,0.77728
42,0.74951
43,0.71668
44,0.68478
45,0.6541600000000001
46,0.6237
47,0.59007
48,0.55974
49,0.5293800000000001
50,0.49395
51,0.46221
52,0.43061000000000005
53,0.39699
54,0.36415
55,0.32946
56,0.29522
57,0.26024
58,0.22684
59,0.19476
60,0.15905999999999998
61,0.12732000000000002
62,0.091928
63,0.056688
64,0.021609
65,-0.013302000000000001
66,-0.048037
67,-0.082585
68,-0.11694
69,-0.15512
70,-0.18968
71,-0.22280999999999998
72,-0.2563
73,-0.29315
74,-0.33088
75,-0.3679
76,-0.40456
77,-0.44104
78,-0.47295
79,-0.50584
80,-0.54006
81,-0.57528
82,-0.61015
83,-0.63841
84,-0.66975
85,-0.69429
86,-0.7197100000000001
87,-0.74566
88,-0.76881
89,-0.7909999999999999
90,-0.81494
91,-0.83341
92,-0.85106
93,-0.871
94,-0.88851
95,-0.9034700000000001
96,-0.92201
97,-0.93527
98,-0.94721
99,-0.96294
100,-0.9726899999999999
101,-0.9813
102,-0.99116
103,-1.0043
104,-1.0097
105,-1.0182
106,-1.0217
107,-1.0266
108,-1.0309
109,-1.0298
110,-1.0312
111,-1.0291
112,-1.0302
113,-1.0289
114,-1.0253
115,-1.0246
116,-1.0281
117,-1.0337
118,-1.048
119,-1.0704
120,-1.0982
121,-1.1287
122,-1.1587
123,-1.1868
124,-1.207
125,-1.2234
126,-1.2333
127,-1.2441
128,-1.2573
129,-1.2691
130,-1.2836
131,-1.3005
132,-1.3173
133,-1.3412
134,-1.3656
135,-1.4043
136,-1.4469999999999998
137,-1.4481
138,-1.433
139,-1.4096
140,-1.3844
141,-1.3575
142,-1.3358
143,-1.3131
144,-1.2873
145,-1.2548
146,-1.2244
147,-1.1942
148,-1.1647
149,-1.1287
150,-1.0918
151,-1.0608
152,-1.0227
153,-0.99164
154,-0.95349
155,-0.9093700000000001
156,-0.88064
157,-0.8459700000000001
158,-0.80632
159,-0.76773
160,-0.72621
161,-0.67947
162,-0.6451399999999999
163,-0.60429
164,-0.5606899999999999
165,-0.51703
166,-0.47331000000000006
167,-0.42996999999999996
168,-0.38771
169,-0.34602
170,-0.30504000000000003
171,-0.26419000000000004
172,-0.22638000000000003
173,-0.1861
174,-0.14672000000000002
175,-0.10614000000000001
176,-0.06515399999999999
177,-0.026184
178,0.012786
179,0.051758000000000005
180,0.090258
181,0.12808
182,0.16668
183,0.20575
184,0.24464
185,0.28164
186,0.31865
187,0.35764
188,0.39501
189,0.43483999999999995
190,0.47265
191,0.51164
192,0.5484600000000001
193,0.58441
194,0.6209
195,0.6599
196,0.69699
197,0.7359899999999999
198,0.7730899999999999
199,0.81184
200,0.8497600000000001
201,0.8895700000000001
202,0.9291
203,0.96919
204,1.0090000000000001
205,1.0488
206,1.0889
207,1.1303
208,1.1721
209,1.2136
210,1.2515
211,1.2712
212,1.2857
213,1.286
214,1.2808
215,1.2919999999999998
216,1.2726
217,1.2488
218,1.2211
219,1.1981
220,1.1732
221,1.1438
222,1.117
223,1.0928
224,1.0615
225,1.0303
226,0.99926
227,0.97035
228,0.9406
229,0.91017
230,0.8813200000000001
231,0.8561799999999999
232,0.8340000000000001
233,0.81868
234,0.80811
235,0.8086
236,0.8144600000000001
237,0.8208799999999999
238,0.83549
239,0.8542799999999999
240,0.87715
241,0.90028
242,0.9236700000000001
243,0.94731
244,0.98213
245,1.0098
246,1.034
247,1.0585
248,1.0832
249,1.1074
250,1.1297
251,1.1549
252,1.1805
253,1.1967
254,1.1902
255,1.1847
256,1.1459
257,1.1088
258,1.0794
259,1.0516
260,1.0199
261,0.98026
262,0.93976
263,0.9024700000000001
264,0.85831
265,0.81784
266,0.77688
267,0.7391800000000001
268,0.6986399999999999
269,0.6595
270,0.61624
271,0.57621
272,0.53298
273,0.49162
274,0.45028999999999997
275,0.40898
276,0.36673
277,0.32359
278,0.27863000000000004
279,0.24397
280,0.20422
281,0.17122
282,0.13835999999999998
283,0.10564000000000001
284,0.069238
285,0.033745
286,-0.0020433
287,-0.034441
288,-0.073198
289,-0.11317999999999999
290,-0.15832000000000002
291,-0.19860999999999998
292,-0.23779
293,-0.2734
294,-0.3163
295,-0.35215
296,-0.39237
297,-0.4344
298,-0.46679
299,-0.5079899999999999
300,-0.55223
301,-0.58959
302,-0.62695
303,-0.65552
304,-0.6359199999999999
305,-0.61493
306,-0.5916899999999999
307,-0.56819
308,-0.55052
309,-0.5290199999999999
310,-0.50694
311,-0.48723
312,-0.4697
313,-0.44301999999999997
314,-0.41348999999999997
315,-0.38592
316,-0.35562
317,-0.34339000000000003
318,-0.34686999999999996
319,-0.35915
320,-0.40202
321,-0.43628999999999996
322,-0.47458
323,-0.5142100000000001
324,-0.55307
325,-0.5896899999999999
326,-0.62627
327,-0.6661199999999999
328,-0.70816
329,-0.7479399999999999
330,-0.78605
331,-0.82521
332,-0.8649700000000001
333,-0.9047299999999999
334,-0.9434600000000001
335,-0.98221
336,-1.0209
337,-1.0573
338,-1.0963
339,-1.1346
340,-1.1732
341,-1.2128
342,-1.2574
343,-1.3068
344,-1.3419999999999999
345,-1.3759
346,-1.4047
347,-1.4324
348,-1.4545
349,-1.4751
350,-1.5084
351,-1.5355
352,-1.5562
353,-1.5748
354,-1.5815
355,-1.581
356,-1.578
357,-1.5775
358,-1.5746
359,-1.5791
360,-1.5912
361,-1.5998
362,-1.6006
363,-1.6048
364,-1.6026
365,-1.5967
366,-1.5876
367,-1.5762
368,-1.5608
369,-1.5436
370,-1.5241
371,-1.5061
372,-1.4803
373,-1.4532
374,-1.4236
375,-1.3928
376,-1.3615
377,-1.3288
378,-1.2951
379,-1.2644
380,-1.2293
381,-1.1939
382,-1.1579
383,-1.122
384,-1.0859999999999999
385,-1.0495
386,-1.013
387,-0.9762299999999999
388,-0.9389200000000001
389,-0.90165
390,-0.8640000000000001
391,-0.82663
392,-0.78908
393,-0.75162
394,-0.71397
395,-0.67756
396,-0.64139
397,-0.60338
398,-0.5728800000000001
399,-0.53271
400,-0.49138000000000004
401,-0.45548999999999995
402,-0.41865
403,-0.37899
404,-0.33821999999999997
405,-0.29802
406,-0.25629
407,-0.2207
408,-0.17928
409,-0.14242
410,-0.10540999999999999
411,-0.061299
412,-0.028236
413,0.010495
414,0.042259
415,0.081501
416,0.11940999999999999
417,0.16359
418,0.20792
419,0.24616999999999997
420,0.28231999999999996
421,0.31668
422,0.35974
423,0.40216999999999997
424,0.44601999999999997
425,0.48881
426,0.528
427,0.5695399999999999
428,0.6129100000000001
429,0.65632
430,0.69526
431,0.7297600000000001
432,0.76883
433,0.81497
434,0.8520700000000001
435,0.8914
436,0.9332600000000001
437,0.9741799999999999
438,1.0167
439,1.0579
440,1.0979
441,1.143
442,1.1847
443,1.2284
444,1.2634
445,1.3030000000000002
446,1.3446
447,1.3815
448,1.4215
449,1.4527
450,1.4858
451,1.5175
452,1.5511
453,1.5895
454,1.6275
455,1.6695
456,1.7007
457,1.7364
458,1.7751
459,1.8081
460,1.8348
461,1.8521
462,1.8697
