time,value
0,0.66405
1,0.25277
2,-0.84398
3,1.0753
4,-0.29561
5,-0.84398
6,1.6237
7,-0.84398
8,-0.84398
9,1.6237
10,-0.84398
11,-0.56979
12,1.3495
13,-0.84398
14,-0.29561
15,0.9382299999999999
16,-0.84398
17,0.11567000000000001
18,0.66405
19,-0.84398
20,0.25277
21,0.52695
22,-0.84398
23,0.38986
24,0.25277
25,-0.84398
26,0.66405
27,0.11567000000000001
28,-0.84398
29,0.80114
30,-0.021421
31,-0.84398
32,0.80114
33,-0.021421
34,-0.84398
35,1.4866
36,-0.84398
37,-0.84398
38,1.6237
39,-0.84398
40,-0.84398
41,1.4866
42,-0.84398
43,-0.84398
44,1.6237
45,-0.84398
46,-0.84398
47,1.4866
48,-0.84398
49,-0.84398
50,1.6237
51,-0.84398
52,-0.84398
53,1.4866
54,-0.84398
55,-0.84398
56,1.4866
57,-0.84398
58,-0.84398
59,1.4866
60,-0.84398
61,-0.84398
62,1.4866
63,-0.84398
64,-0.84398
65,1.4866
66,-0.84398
67,-0.84398
68,1.6237
69,-0.84398
70,-0.84398
71,1.4866
72,-0.84398
73,-0.84398
74,1.7608
75,-0.56979
76,-0.84398
77,1.6237
78,-0.84398
79,-0.84398
80,2.1721
81,-0.84398
82,-0.4327
83,1.3495
84,-0.84398
85,0.66405
86,0.11567000000000001
87,-0.84398
88,1.6237
89,-0.84398
90,-0.021421
91,0.80114
92,-0.84398
93,0.9382299999999999
94,-0.29561
95,-0.84398
