time,value
0,1.6078
1,1.5998
2,1.5724
3,1.5481
4,1.5047
5,1.4583
6,1.4023
7,1.3197
8,1.2246
9,1.1253
10,1.0272
11,0.9307700000000001
12,0.8177399999999999
13,0.69996
14,0.59807
15,0.49596999999999997
16,0.37864000000000003
17,0.26602
18,0.15791
19,0.066861
20,-0.045018
21,-0.15107
22,-0.25690999999999997
23,-0.36251
24,-0.46784
25,-0.57284
26,-0.67201
27,-0.76873
28,-0.8656200000000001
29,-0.9581200000000001
30,-1.036
31,-1.0864
32,-1.1525
33,-1.2095
34,-1.2136
35,-1.2043
36,-1.1666
37,-1.1181
38,-1.0594
39,-0.9988799999999999
40,-0.9530799999999999
41,-0.9299700000000001
42,-0.8984
43,-0.89604
44,-0.90002
45,-0.89512
46,-0.89865
47,-0.93842
48,-0.9538
49,-0.99982
50,-1.0546
51,-1.1177
52,-1.1587
53,-1.1973
54,-1.2077
55,-1.1728
56,-1.1322
57,-1.0722
58,-0.9991399999999999
59,-0.91295
60,-0.8323
61,-0.74015
62,-0.64605
63,-0.5435
64,-0.44036000000000003
65,-0.33674
66,-0.23269
67,-0.12427
68,-0.020205
69,0.074607
70,0.18758
71,0.30056
72,0.41945
73,0.5324399999999999
74,0.65151
75,0.76452
76,0.87869
77,0.9677100000000001
78,1.0719
79,1.1694
80,1.2577
81,1.3322
82,1.4164
83,1.4606
84,1.4986
85,1.5398
86,1.5622
87,1.5688
88,1.5649
89,1.5637
90,1.5655
91,1.548
92,1.5334
93,1.5088
94,1.4464
95,1.3765
96,1.2898
97,1.2001
98,1.1027
99,1.0031
100,0.89275
101,0.8036800000000001
102,0.68928
103,0.57733
104,0.46342
105,0.35100000000000003
106,0.24308000000000002
107,0.13019
108,0.025497
109,-0.063139
110,-0.16792
111,-0.27192
112,-0.36879
113,-0.47156000000000003
114,-0.5737399999999999
115,-0.66979
116,-0.75879
117,-0.8423799999999999
118,-0.9244700000000001
119,-1.0014
120,-1.062
121,-1.1076
122,-1.1433
123,-1.1362
124,-1.1082
125,-1.0935
126,-1.0461
127,-0.98906
128,-0.96886
129,-0.94011
130,-0.92474
131,-0.92416
132,-0.9042600000000001
133,-0.92153
134,-0.9343600000000001
135,-0.9348200000000001
136,-0.94729
137,-1.0174
138,-1.0752
139,-1.1378
140,-1.1741
141,-1.1903
142,-1.1901
143,-1.1597
144,-1.1064
145,-1.0390000000000001
146,-0.9655100000000001
147,-0.87834
148,-0.78249
149,-0.68908
150,-0.59075
151,-0.48678
152,-0.38238
153,-0.27762
154,-0.16969
155,-0.06207000000000001
156,0.045617000000000005
157,0.13890999999999998
158,0.24475
159,0.36275
160,0.47563
161,0.59392
162,0.7068399999999999
163,0.82537
164,0.93832
165,1.0537
166,1.1315
167,1.2287
168,1.3221
169,1.4069999999999998
170,1.4738
171,1.5152
172,1.5569
173,1.5744
174,1.6055
175,1.6086
