time,value
0,-0.52755
1,1.6154
2,-0.45611999999999997
3,-0.9561299999999999
4,-0.027531
5,1.6154
6,-0.7418399999999999
7,-0.9561299999999999
8,0.32961999999999997
9,1.4011
10,-0.9561299999999999
11,-0.9561299999999999
12,0.90107
13,0.75821
14,-0.9561299999999999
15,-0.9561299999999999
16,1.1154
17,0.61535
18,-0.9561299999999999
19,-0.9561299999999999
20,1.3297
21,0.32961999999999997
22,-0.9561299999999999
23,-0.9561299999999999
24,1.544
25,0.11533
26,-0.9561299999999999
27,-0.9561299999999999
28,1.6868
29,-0.098962
30,-0.9561299999999999
31,-0.45611999999999997
32,1.544
33,-0.52755
34,-0.9561299999999999
35,-0.17039
36,1.544
37,-0.7418399999999999
38,-0.9561299999999999
39,-0.027531
40,1.6154
41,-0.9561299999999999
42,-0.9561299999999999
43,0.54392
44,0.9725
45,-0.9561299999999999
46,-0.9561299999999999
47,0.75821
48,0.8296399999999999
49,-0.9561299999999999
50,-0.9561299999999999
51,0.9725
52,0.90107
53,-0.9561299999999999
54,-0.9561299999999999
55,1.6154
56,0.47248999999999997
57,-0.9561299999999999
58,-0.9561299999999999
59,1.6868
60,0.8296399999999999
61,-0.9561299999999999
62,-0.5989800000000001
63,1.6154
64,0.25819000000000003
65,-0.9561299999999999
66,-0.9561299999999999
67,1.6868
68,0.18675999999999998
69,-0.9561299999999999
70,-0.8132699999999999
71,1.6154
72,0.0439
73,-0.9561299999999999
74,-0.45611999999999997
75,1.6868
76,-0.31325
77,-0.9561299999999999
78,-0.38469000000000003
79,1.6154
80,-0.38469000000000003
81,-0.9561299999999999
82,-0.098962
83,1.6154
84,-0.7418399999999999
85,-0.9561299999999999
86,0.18675999999999998
87,1.544
88,-0.9561299999999999
89,-0.9561299999999999
90,0.54392
91,1.1154
92,-0.9561299999999999
93,-0.9561299999999999
94,0.8296399999999999
95,0.75821
