time,value
0,-0.8667799999999999
1,-0.81696
2,-0.7560600000000001
3,-0.68537
4,-0.6078899999999999
5,-0.5263399999999999
6,-0.44273999999999997
7,-0.35996999999999996
8,-0.28160999999999997
9,-0.20905
10,-0.14332999999999999
11,-0.086392
12,-0.037377999999999995
13,0.0046661
14,0.039722
15,0.06823
16,0.091516
17,0.11032
18,0.12478
19,0.13676
20,0.14733
21,0.15508
22,0.16000999999999999
23,0.16135
24,0.15725999999999998
25,0.14737
26,0.1335
27,0.11744
28,0.10026
29,0.084886
30,0.07271
31,0.061390999999999994
32,0.050957
33,0.040704000000000004
34,0.028415
35,0.013486000000000001
36,-0.0025984000000000003
37,-0.019146
38,-0.036317
39,-0.051744000000000005
40,-0.064447
41,-0.07654
42,-0.08617999999999999
43,-0.09321900000000001
44,-0.099246
45,-0.10367
46,-0.10564000000000001
47,-0.10607
48,-0.1059
49,-0.10349000000000001
50,-0.09855900000000001
51,-0.092535
52,-0.082008
53,-0.066064
54,-0.045591
55,-0.019403
56,0.013040000000000001
57,0.050618
58,0.092738
59,0.14035999999999998
60,0.1921
61,0.2442
62,0.29573
63,0.34289000000000003
64,0.3811
65,0.40897
66,0.42586
67,0.43112
68,0.42553
69,0.41142
70,0.38966
71,0.3602
72,0.32611
73,0.28883000000000003
74,0.24929
75,0.21026
76,0.17342
77,0.13853
78,0.10504000000000001
79,0.072558
80,0.039309
81,0.0031940000000000002
82,-0.034687
83,-0.074337
84,-0.11602
85,-0.15816
86,-0.19983
87,-0.24105
88,-0.28109
89,-0.31842
90,-0.35297
91,-0.38593
92,-0.41612
93,-0.4446
94,-0.47301000000000004
95,-0.50012
96,-0.52515
97,-0.54842
98,-0.56948
99,-0.58729
100,-0.60313
101,-0.61944
102,-0.63458
103,-0.64935
104,-0.66514
105,-0.68029
106,-0.69408
107,-0.7072
108,-0.71936
109,-0.72909
110,-0.73673
111,-0.7437699999999999
112,-0.74848
113,-0.75155
114,-0.75465
115,-0.75721
116,-0.75908
117,-0.76117
118,-0.76374
119,-0.76555
120,-0.76658
121,-0.76789
122,-0.76759
123,-0.76551
124,-0.76261
125,-0.75855
126,-0.7530899999999999
127,-0.7469100000000001
128,-0.74061
129,-0.73335
130,-0.72536
131,-0.71844
132,-0.71202
133,-0.7064
134,-0.70272
135,-0.70034
136,-0.69776
137,-0.69487
138,-0.6926
139,-0.68907
140,-0.68343
141,-0.679
142,-0.67237
143,-0.6612899999999999
144,-0.6481
145,-0.63349
146,-0.61559
147,-0.59582
148,-0.5783
149,-0.55972
150,-0.53846
151,-0.52013
152,-0.5019399999999999
153,-0.48307
154,-0.46713999999999994
155,-0.45476000000000005
156,-0.44246
157,-0.43001000000000006
158,-0.42061000000000004
159,-0.40995
160,-0.39561
161,-0.3827
162,-0.3655
163,-0.33946
164,-0.30426
165,-0.2564
166,-0.18786
167,-0.092649
168,0.032956
169,0.19785999999999998
170,0.40601
171,0.65082
172,0.9263100000000001
173,1.2196
174,1.5119
175,1.7857
176,2.0274
177,2.2261
178,2.3743
179,2.4732
180,2.528
181,2.5459
182,2.541
183,2.5277
184,2.5185
185,2.5247
186,2.5537
187,2.6072
188,2.6812
189,2.7687
190,2.8585
191,2.9365
192,2.9913
193,3.0128
194,2.9939
195,2.9337
196,2.8355
197,2.7052
198,2.5512
199,2.3822
200,2.2054
201,2.0252
202,1.847
203,1.6734
204,1.5059
205,1.3478
206,1.2009
207,1.0637
208,0.9356399999999999
209,0.81572
210,0.6995100000000001
211,0.58162
212,0.46563000000000004
213,0.35042
214,0.23456
215,0.12407
216,0.021586
217,-0.074267
218,-0.16224
219,-0.23954
220,-0.3082
221,-0.37179
222,-0.42518999999999996
223,-0.47062
224,-0.51255
225,-0.54842
226,-0.5793699999999999
227,-0.60973
228,-0.6391899999999999
229,-0.66445
230,-0.68698
231,-0.70972
232,-0.72685
233,-0.7404
234,-0.7542399999999999
235,-0.76588
236,-0.7754300000000001
237,-0.7853600000000001
238,-0.79525
239,-0.80301
240,-0.80993
241,-0.81811
242,-0.82452
243,-0.8301200000000001
244,-0.83652
245,-0.8420000000000001
246,-0.8463200000000001
247,-0.85077
248,-0.85536
249,-0.8592799999999999
250,-0.8632299999999999
251,-0.868
252,-0.87203
253,-0.8755700000000001
254,-0.87945
255,-0.8834
256,-0.88769
257,-0.89284
258,-0.89849
259,-0.90381
260,-0.90871
261,-0.9137299999999999
262,-0.91891
263,-0.92494
264,-0.9320700000000001
265,-0.9392299999999999
266,-0.9451
267,-0.94878
268,-0.9499700000000001
269,-0.9492
