[<text>
<title>geo. a. hormel and co &lt;hrl&gt; </title>
<dateline>    austin, minn., march 23 -
    </dateline>qtly div 15 cts vs 15 cts previously
    pay may 15
    record april 18
 reuter
</text>]