time,value
0,-0.16585
1,-0.16585
2,-0.16585
3,-0.16585
4,-0.16585
5,-0.16585
6,-0.16585
7,-0.16585
8,-0.16585
9,-0.16585
10,-0.16585
11,-0.16585
12,-0.16585
13,-0.16585
14,-0.16585
15,-0.16585
16,-0.16585
17,-0.16585
18,-0.16585
19,-0.16585
20,-0.16585
21,-0.16585
22,-0.16585
23,-0.16585
24,-0.16585
25,-0.16585
26,-0.16585
27,-0.16585
28,-0.16585
29,-0.16585
30,-0.16585
31,-0.16585
32,-0.16585
33,-0.16585
34,-0.16585
35,-0.16585
36,-0.16585
37,-0.16585
38,-0.16585
39,-0.16585
40,-0.16585
41,-0.16585
42,-0.16585
43,-0.16585
44,-0.16585
45,-0.16585
46,-0.16585
47,-0.16585
48,-0.16585
49,-0.16585
50,-0.16585
51,-0.16585
52,-0.16585
53,-0.16585
54,-0.16585
55,-0.16585
56,-0.16585
57,-0.16585
58,-0.16585
59,-0.16585
60,-0.16585
61,-0.16585
62,-0.16585
63,-0.16585
64,-0.16585
65,-0.16585
66,-0.16585
67,-0.16585
68,-0.16585
69,-0.16585
70,-0.16585
71,-0.16585
72,-0.16585
73,-0.16585
74,-0.16585
75,-0.16585
76,-0.16585
77,-0.16585
78,-0.16585
79,-0.16585
80,-0.16585
81,-0.16585
82,-0.16585
83,-0.16585
84,3.3108
85,8.0712
86,4.0418
87,-0.16585
88,-0.16585
89,-0.16585
90,-0.16585
91,-0.16585
92,-0.16585
93,-0.16585
94,-0.16585
95,-0.16585
