time,value
0,-2.1771
1,-2.1771
2,-2.1771
3,-2.1771
4,-2.1771
5,-2.1802
6,-2.1802
7,-2.1802
8,-2.1802
9,-2.1802
10,-2.1802
11,-2.1895
12,-2.1956
13,-2.2018
14,-2.2016
15,-2.2015
16,-2.2011
17,-2.2006
18,-2.2003
19,-2.1996
20,-2.1988
21,-2.2013
22,-2.2003
23,-2.1992
24,-2.1984
25,-2.1971
26,-2.1957
27,-2.1947
28,-2.1931
29,-2.1914
30,-2.1902
31,-2.1956
32,-2.204
33,-2.2094
34,-2.208
35,-2.2059
36,-2.2036
37,-2.2021
38,-2.1996
39,-2.1971
40,-2.1953
41,-2.1926
42,-2.1898
43,-2.1878
44,-2.1877
45,-2.1846
46,-2.1824
47,-2.1792
48,-2.1758
49,-2.1734
50,-2.1699
51,-2.1662
52,-2.1625
53,-2.1599
54,-2.1642
55,-2.1713
56,-2.1755
57,-2.1714
58,-2.1672
59,-2.1644
60,-2.1601
61,-2.1556
62,-2.1526
63,-2.1481
64,-2.1434
65,-2.1403
66,-2.1381
67,-2.1333
68,-2.13
69,-2.125
70,-2.1199
71,-2.1165
72,-2.1113
73,-2.106
74,-2.1136
75,-2.1168
76,-2.1157
77,-2.1126
78,-2.1089
79,-2.1033
80,-2.0975
81,-2.0937
82,-2.0879
83,-2.082
84,-2.0781
85,-2.0721
86,-2.0661
87,-2.062
88,-2.0582
89,-2.052
90,-2.0478
91,-2.0416
92,-2.0352
93,-2.0288
94,-2.0246
95,-2.0181
96,-2.0181
97,-2.0203
98,-2.0224
99,-2.0178
100,-2.0133
101,-2.0066
102,-1.9998
103,-1.9952
104,-1.9883
105,-1.9814
106,-1.9768
107,-1.9718
108,-1.9648
109,-1.9601
110,-1.953
111,-1.9458
112,-1.9411
113,-1.9425
114,-1.9459
115,-1.9448
116,-1.94
117,-1.9326
118,-1.9252
119,-1.9203
120,-1.9128
121,-1.9054
122,-1.9004
123,-1.8929
124,-1.8853
125,-1.8803
126,-1.8727
127,-1.8668
128,-1.8617
129,-1.854
130,-1.8463
131,-1.8412
132,-1.8334
133,-1.8257
134,-1.8179
135,-1.8127
136,-1.8049
137,-1.797
138,-1.7918
139,-1.7892
140,-1.7892
141,-1.7839
142,-1.776
143,-1.7681
144,-1.7654
145,-1.7628
146,-1.7575
147,-1.7522
148,-1.7442
149,-1.7362
150,-1.7309
151,-1.7228
152,-1.7148
153,-1.7094
154,-1.7014
155,-1.6918
156,-1.6837
157,-1.6783
158,-1.6701
159,-1.662
160,-1.6566
161,-1.6484
162,-1.6402
163,-1.6333
164,-1.629
165,-1.6218
166,-1.6164
167,-1.6083
168,-1.6001
169,-1.5946
170,-1.585
171,-1.5768
172,-1.5713
173,-1.5631
174,-1.5548
175,-1.5478
176,-1.5422
177,-1.534
178,-1.5258
179,-1.5203
180,-1.5121
181,-1.5038
182,-1.4983
183,-1.4887
184,-1.4804
185,-1.4749
186,-1.4666
187,-1.4583
188,-1.4528
189,-1.4444
190,-1.4375
191,-1.4321
192,-1.4279
193,-1.4238
194,-1.4182
195,-1.4140000000000001
196,-1.4071
197,-1.3989
198,-1.3934
199,-1.3837
200,-1.3755
201,-1.3699
202,-1.3658
203,-1.3588
204,-1.3546
205,-1.3464
206,-1.3381
207,-1.3326
208,-1.3230000000000002
209,-1.3147
210,-1.3092
211,-1.3009
212,-1.2926
213,-1.2899
214,-1.2830000000000001
215,-1.2774
216,-1.2691
217,-1.2636
218,-1.2554
219,-1.2471
220,-1.2415
221,-1.2319
222,-1.2235
223,-1.218
224,-1.2097
225,-1.2013
226,-1.1958
227,-1.1903
228,-1.1863
229,-1.1835
230,-1.1767
231,-1.1725
232,-1.167
233,-1.1587
234,-1.1504
235,-1.1449
236,-1.1352
237,-1.1269
238,-1.1186
239,-1.1131
240,-1.1048
241,-1.1048
242,-1.102
243,-1.0965
244,-1.0868
245,-1.0854
246,-1.0813
247,-1.0716
248,-1.0647
249,-1.055
250,-1.0509
251,-1.0481
252,-1.0426
253,-1.0342
254,-1.0287
255,-1.0203
256,-1.0106
257,-1.0023
258,-0.9966799999999999
259,-0.9883
260,-0.98008
261,-0.97465
262,-0.97067
263,-0.96231
264,-0.9567399999999999
265,-0.94837
266,-0.93999
267,-0.93309
268,-0.9247
269,-0.9163100000000001
270,-0.91071
271,-0.90381
272,-0.89989
273,-0.8944700000000001
274,-0.8875700000000001
275,-0.8791899999999999
276,-0.8736
277,-0.86521
278,-0.85551
279,-0.84711
280,-0.8415
281,-0.83309
282,-0.82619
283,-0.8236
284,-0.8169
285,-0.8128
286,-0.8072
287,-0.7988
288,-0.7904
289,-0.78479
290,-0.77509
291,-0.76667
292,-0.76105
293,-0.75262
294,-0.7441800000000001
295,-0.73855
296,-0.7301
297,-0.72349
298,-0.71685
299,-0.7127600000000001
300,-0.70433
301,-0.69589
302,-0.6902699999999999
303,-0.68182
304,-0.67337
305,-0.66773
306,-0.65801
307,-0.64955
308,-0.6439
309,-0.63543
310,-0.62695
311,-0.62695
312,-0.62412
313,-0.62129
314,-0.61563
315,-0.60874
316,-0.6046699999999999
317,-0.60344
318,-0.59654
319,-0.58682
320,-0.5771
321,-0.57303
322,-0.57303
323,-0.5702
324,-0.56455
325,-0.55605
326,-0.54756
327,-0.54189
328,-0.53338
329,-0.52487
330,-0.5191899999999999
331,-0.51067
332,-0.50093
333,-0.49525
334,-0.48672
335,-0.47818
336,-0.47248
337,-0.46393999999999996
338,-0.45538999999999996
339,-0.44683
340,-0.44111999999999996
341,-0.43256000000000006
342,-0.42399
343,-0.41827
344,-0.40968999999999994
345,-0.40110999999999997
346,-0.39539
347,-0.38850999999999997
348,-0.38216
349,-0.37983
350,-0.37009000000000003
351,-0.36035
352,-0.35463
353,-0.34605
354,-0.33747
355,-0.33345
356,-0.32995
357,-0.32356999999999997
358,-0.32072
359,-0.31216
360,-0.30359
361,-0.29385
362,-0.28813
363,-0.27839
364,-0.27488
365,-0.26966999999999997
366,-0.26563000000000003
367,-0.25708000000000003
368,-0.25019
369,-0.24163
370,-0.23306
371,-0.22735
372,-0.22096999999999997
373,-0.21458000000000002
374,-0.21339
375,-0.20484000000000002
376,-0.19629000000000002
377,-0.19058
378,-0.18084
379,-0.17227
380,-0.16707
381,-0.16186
382,-0.1583
383,-0.14975
384,-0.14405
385,-0.13549
386,-0.12693
387,-0.12122999999999999
388,-0.11266
389,-0.10409000000000002
390,-0.098371
391,-0.088629
392,-0.08005
393,-0.07432799999999999
394,-0.065742
395,-0.057151
396,-0.051422
397,-0.042825
398,-0.034223
399,-0.028487000000000002
400,-0.020465
401,-0.014156
402,-0.008984200000000001
403,-0.0032582
404,0.0053348
405,0.013931
406,0.020811
407,0.029411
408,0.038586
409,0.040892000000000005
410,0.04607
411,0.054654999999999995
412,0.061537
413,0.070125
414,0.078717
415,0.085597
416,0.090768
417,0.097108
418,0.10113
419,0.10970999999999999
420,0.11829
421,0.12804000000000001
422,0.13376
423,0.14235
424,0.14582
425,0.15100999999999998
426,0.15905999999999998
427,0.16763
428,0.17335
429,0.18309
430,0.19168
431,0.19856
432,0.20142000000000002
433,0.20142000000000002
434,0.20428
435,0.21286999999999998
436,0.22261999999999998
437,0.2295
438,0.23924
439,0.24326
440,0.24611999999999998
441,0.253
442,0.26275
443,0.27134
444,0.27421
445,0.27707
446,0.27707
447,0.28281
448,0.29141
449,0.30001
450,0.30689
451,0.3155
452,0.32352
453,0.3258
454,0.33211999999999997
455,0.34071
456,0.34644
457,0.35504
458,0.36365
459,0.37051999999999996
460,0.37913
461,0.38774000000000003
462,0.39636
463,0.4021
464,0.41072
465,0.41934
466,0.42446999999999996
467,0.43073999999999996
468,0.43588000000000005
469,0.44161999999999996
470,0.45024
471,0.45885
472,0.4646
473,0.47435
474,0.48296999999999995
475,0.48872
476,0.49735
477,0.50359
478,0.50873
479,0.5138699999999999
480,0.52248
481,0.52823
482,0.53684
483,0.54547
484,0.5541
485,0.55985
486,0.5696
487,0.57823
488,0.58399
489,0.59263
490,0.60127
491,0.6070300000000001
492,0.61568
493,0.62543
494,0.62764
495,0.6338600000000001
496,0.64073
497,0.64649
498,0.65513
499,0.66377
500,0.6695399999999999
501,0.67818
502,0.68683
503,0.69548
504,0.70125
505,0.70125
506,0.70125
507,0.69906
508,0.6957899999999999
509,0.69255
510,0.69039
511,0.68718
512,0.68718
513,0.68718
514,0.68138
515,0.6727
516,0.66583
517,0.65715
518,0.64847
519,0.64268
520,0.6358199999999999
521,0.6297
522,0.62756
523,0.6207
524,0.6109399999999999
525,0.60301
526,0.5979899999999999
527,0.59192
528,0.58216
529,0.57636
530,0.57135
531,0.5653
532,0.5632199999999999
533,0.5545
534,0.54474
535,0.54079
536,0.53477
537,0.52876
538,0.52294
539,0.5142100000000001
540,0.50445
541,0.49863
542,0.48991
543,0.4839
544,0.4779
545,0.47105
546,0.46231000000000005
547,0.45358000000000004
548,0.44673
549,0.43799999999999994
550,0.43115
551,0.42908999999999997
552,0.42311000000000004
553,0.41817
554,0.41234
555,0.40257
556,0.39763000000000004
557,0.39269
558,0.38484
559,0.37609000000000004
560,0.37025
561,0.3615
562,0.35173000000000004
563,0.3459
564,0.33715
565,0.32841
566,0.32055
567,0.3156
568,0.31258
569,0.30382
570,0.29698
571,0.29014
572,0.28422
573,0.28223000000000004
574,0.27539
575,0.26661999999999997
576,0.25978
577,0.25101
578,0.24224
579,0.2354
580,0.2295
581,0.22654000000000002
582,0.22069
583,0.21091999999999997
584,0.20409000000000002
585,0.19822
586,0.19627999999999998
587,0.18944
588,0.18065
589,0.17479
590,0.16502999999999998
591,0.15624000000000002
592,0.15037999999999999
593,0.14745999999999998
594,0.14163
595,0.13773
596,0.12797
597,0.11821
598,0.11629
599,0.1105
600,0.10368
601,0.096854
602,0.087092
603,0.084268
604,0.079457
605,0.072639
606,0.063809
607,0.054983000000000004
608,0.0491
609,0.039338
610,0.030514999999999997
611,0.024635
612,0.015816999999999998
613,0.0089928
614,0.0071098
615,0.0043078000000000005
616,0.00043478
617,-0.00049222
618,-0.00049222
619,-0.0063832
620,-0.013199
621,-0.017069
622,-0.020937
623,-0.024805
624,-0.034566
625,-0.044327
626,-0.048193
627,-0.05114
628,-0.054088
629,-0.062929
630,-0.069743
631,-0.077475
632,-0.083161
633,-0.084972
634,-0.093828
635,-0.10268
636,-0.10949
637,-0.11834000000000001
638,-0.12719
639,-0.13196
640,-0.13762
641,-0.14237
642,-0.14828
643,-0.15714
644,-0.1669
645,-0.17281
646,-0.18167
647,-0.18642
648,-0.19205
649,-0.19382
650,-0.2027
651,-0.21156999999999998
652,-0.21748
653,-0.22724
654,-0.23611
655,-0.24201999999999999
656,-0.25088
657,-0.25974
658,-0.2636
659,-0.26628
660,-0.26893
661,-0.27068000000000003
662,-0.27624
663,-0.27881
664,-0.28051
665,-0.28304
666,-0.28553
667,-0.29445
668,-0.30123
669,-0.30801
670,-0.31345
671,-0.31506999999999996
672,-0.31588
673,-0.31669
674,-0.31669
675,-0.31908000000000003
676,-0.32144
677,-0.32299999999999995
678,-0.32378
679,-0.32455
680,-0.32532
681,-0.3246
682,-0.32685
683,-0.32086
684,-0.31187
685,-0.30287
686,-0.29688000000000003
687,-0.28788
688,-0.27888
689,-0.26988
690,-0.26461
691,-0.2556
692,-0.2466
693,-0.24059
694,-0.23158
695,-0.22257
696,-0.21656
697,-0.21126
698,-0.21035
699,-0.21173000000000003
700,-0.20339000000000002
701,-0.19503
702,-0.19269
703,-0.19168
704,-0.19064
705,-0.1846
706,-0.17554
707,-0.16649
708,-0.16045
709,-0.15139
710,-0.14232999999999998
711,-0.13327
712,-0.12722999999999998
713,-0.11815999999999999
714,-0.1091
715,-0.10369
716,-0.09461699999999999
717,-0.085547
718,-0.079499
719,-0.070427
720,-0.061354
721,-0.055304
722,-0.052279
723,-0.049254
724,-0.049254
725,-0.040178
726,-0.0311
727,-0.025047999999999997
728,-0.018994999999999998
729,-0.018994999999999998
730,-0.0093062
731,-0.0032531999999999995
732,0.0040228
733,0.0089038
734,0.010157
735,0.019225
736,0.028294
737,0.034341
738,0.044035000000000005
739,0.053105999999999993
740,0.057382
741,0.059283
742,0.06423
743,0.06552999999999999
744,0.06750199999999999
745,0.07184600000000001
746,0.077875
747,0.087585
748,0.09662799999999999
749,0.10265999999999999
750,0.11237
751,0.11739000000000001
752,0.12243
753,0.12544
754,0.13448
755,0.14351
756,0.14954
757,0.15858
758,0.16829000000000002
759,0.17432
760,0.18335
761,0.19239
762,0.19374
763,0.19879000000000002
764,0.20618000000000003
765,0.2122
766,0.22123
767,0.23026
768,0.23628000000000002
769,0.24531999999999998
770,0.25503000000000003
771,0.26406999999999997
772,0.27009
773,0.27913000000000004
774,0.28817
775,0.29419
776,0.29923
777,0.30128
778,0.30799
779,0.31701999999999997
780,0.32605
781,0.33207
782,0.3411
783,0.35014
784,0.35684
785,0.36587
786,0.37490999999999997
787,0.38093
788,0.38997
789,0.39666999999999997
790,0.39803
791,0.4031
792,0.40981000000000006
793,0.41883000000000004
794,0.42485
795,0.43388000000000004
796,0.44291
797,0.44893
798,0.45797
799,0.46768000000000004
800,0.4737
801,0.48273999999999995
802,0.49177
803,0.4978
804,0.50684
805,0.5158699999999999
806,0.52257
807,0.52461
808,0.52967
809,0.53569
810,0.54472
811,0.55375
812,0.56347
813,0.5694899999999999
814,0.57852
815,0.5875600000000001
816,0.59358
817,0.60028
818,0.60535
819,0.60673
820,0.61344
821,0.62246
822,0.62848
823,0.63751
824,0.64654
825,0.65255
826,0.6615800000000001
827,0.6713
828,0.67732
829,0.68635
830,0.69539
831,0.7014100000000001
832,0.71044
833,0.71948
834,0.7268600000000001
835,0.73124
836,0.7333
837,0.74233
838,0.74835
839,0.75738
840,0.76641
841,0.7724300000000001
842,0.78146
843,0.7904899999999999
844,0.79719
845,0.80623
846,0.81526
847,0.8212799999999999
848,0.8303200000000001
849,0.83935
850,0.8453799999999999
851,0.8544200000000001
852,0.86346
853,0.8725
854,0.8785299999999999
855,0.8875700000000001
856,0.89661
857,0.90264
858,0.91169
859,0.92074
860,0.9267700000000001
861,0.93581
862,0.94552
863,0.9485399999999999
864,0.9535399999999999
865,0.95555
866,0.96157
867,0.97062
868,0.9796600000000001
869,0.98569
870,0.99539
871,1.0044
872,1.0105
873,1.0195
874,1.0286
875,1.0376
876,1.0443
877,1.051
878,1.056
879,1.056
880,1.065
881,1.0741
882,1.0801
883,1.0892
884,1.0982
885,1.1042
886,1.1139
887,1.1206
888,1.1237
889,1.123
890,1.1284
891,1.1344
892,1.1428
893,1.1482
894,1.1505
895,1.1499
896,1.1583
897,1.1644
898,1.1644
899,1.1674
900,1.1734
901,1.1795
902,1.1885
903,1.1982
904,1.2043
905,1.2133
906,1.2224
907,1.2284
908,1.2375
909,1.2435
910,1.2466
911,1.2466
912,1.2526
913,1.2587
914,1.2677
915,1.2768
916,1.2859
917,1.2859
918,1.2889
919,1.2883
920,1.2943
921,1.3034
922,1.3125
923,1.3179
924,1.327
925,1.3324
926,1.3312
927,1.3324
928,1.3379
929,1.3433
930,1.3524
931,1.3507
932,1.3495
933,1.3477
934,1.3459999999999999
935,1.3443
936,1.3432
937,1.3416
938,1.3399
939,1.3388
940,1.3372
941,1.3331
942,1.327
943,1.3174
944,1.3127
945,1.3087
946,1.3046
947,1.2949
948,1.2888
949,1.2843
950,1.2797
951,1.2731
952,1.264
953,1.2548
954,1.2487
955,1.2391
956,1.23
957,1.2208
958,1.2147
959,1.2081
960,1.2036
961,1.2026
962,1.193
963,1.1838
964,1.1772
965,1.1681
966,1.1589
967,1.1549
968,1.1504
969,1.1494
970,1.1433
971,1.1342
972,1.1246
973,1.1185
974,1.1093
975,1.1032
976,1.1032
977,1.1002
978,1.0941
979,1.0844
980,1.0839
981,1.0804
982,1.0708
983,1.0642
984,1.0546
985,1.0511
986,1.0511
987,1.045
988,1.0353
989,1.0292
990,1.0252
991,1.0208
992,1.0199
993,1.0107
994,1.0016
995,0.99545
996,0.98629
997,0.97714
998,0.96798
999,0.9618700000000001
1000,0.9527200000000001
1001,0.9435600000000001
1002,0.93699
1003,0.92784
1004,0.9186799999999999
1005,0.91258
1006,0.9034200000000001
1007,0.8942700000000001
1008,0.8881600000000001
1009,0.8790100000000001
1010,0.87502
1011,0.8740899999999999
1012,0.86967
1013,0.86051
1014,0.8544
1015,0.8447899999999999
1016,0.83562
1017,0.8264600000000001
1018,0.82601
1019,0.8216
1020,0.81416
1021,0.80805
1022,0.79888
1023,0.78971
1024,0.7836
1025,0.77399
1026,0.76483
1027,0.75872
1028,0.74955
1029,0.74561
1030,0.74168
1031,0.74038
1032,0.73121
1033,0.72509
1034,0.71592
1035,0.70675
1036,0.7002
1037,0.69104
1038,0.68186
1039,0.67269
1040,0.6692100000000001
1041,0.66486
1042,0.6636
1043,0.6574800000000001
1044,0.64831
1045,0.63913
1046,0.6330100000000001
1047,0.62384
1048,0.61466
1049,0.60812
1050,0.59895
1051,0.58977
1052,0.5836600000000001
1053,0.57448
1054,0.56794
1055,0.5671
1056,0.56281
1057,0.55628
1058,0.54709
1059,0.54098
1060,0.53179
1061,0.52262
1062,0.5165
1063,0.5069
1064,0.49773
1065,0.49161000000000005
1066,0.48243
1067,0.47325
1068,0.46671999999999997
1069,0.46284
1070,0.46163000000000004
1071,0.45816999999999997
1072,0.44898000000000005
1073,0.4398
1074,0.43328
1075,0.42408999999999997
1076,0.41491000000000006
1077,0.40878000000000003
1078,0.3996
1079,0.38961999999999997
1080,0.38538
1081,0.38461
1082,0.37542
1083,0.36623
1084,0.35972
1085,0.35053
1086,0.34134000000000003
1087,0.34096
1088,0.33676
1089,0.32952
1090,0.32339
1091,0.31419
1092,0.30463
1093,0.2985
1094,0.2893
1095,0.28551
1096,0.28171999999999997
1097,0.28067
1098,0.27146
1099,0.26226
1100,0.25613
1101,0.24656999999999998
1102,0.23736999999999997
1103,0.23396
1104,0.22985999999999998
1105,0.22579000000000002
1106,0.21965
1107,0.21044000000000002
1108,0.20123
1109,0.1951
1110,0.18589
1111,0.17635
1112,0.17021
1113,0.161
1114,0.15179
1115,0.14565
1116,0.13645
1117,0.12724000000000002
1118,0.1211
1119,0.1119
1120,0.10815999999999999
1121,0.10443
1122,0.10443
1123,0.095218
1124,0.086009
1125,0.07986900000000001
1126,0.07066
1127,0.061452
1128,0.055313
1129,0.046105
1130,0.039967
1131,0.039635000000000004
1132,0.033496
1133,0.024288
1134,0.018149000000000002
1135,0.0089418
1136,-0.00026622
1137,-0.0064042000000000005
1138,-0.015609999999999999
1139,-0.015609999999999999
1140,-0.019015
1141,-0.022417
1142,-0.031625
1143,-0.041165
1144,-0.041819
1145,-0.045847000000000006
1146,-0.052612
1147,-0.059063
1148,-0.06827899999999999
1149,-0.06918400000000001
1150,-0.07284500000000001
1151,-0.073701
1152,-0.074528
1153,-0.075063
1154,-0.075584
1155,-0.07584
1156,-0.07584
1157,-0.076587
1158,-0.077304
1159,-0.077766
1160,-0.07799199999999999
1161,-0.07821399999999999
1162,-0.07556900000000001
1163,-0.07599
1164,-0.073516
1165,-0.064273
1166,-0.058306
1167,-0.055603
1168,-0.053063
1169,-0.050325
1170,-0.041076999999999995
1171,-0.031829
1172,-0.025664
1173,-0.016416
1174,-0.0073322000000000005
1175,-0.0011662
1176,0.008082800000000001
1177,0.017172
1178,0.016861
1179,0.019503
1180,0.028614999999999998
1181,0.037867000000000005
1182,0.044035000000000005
1183,0.053288
1184,0.062404999999999995
1185,0.068574
1186,0.077827
1187,0.08707999999999999
1188,0.090165
1189,0.093249
1190,0.096334
1191,0.1025
1192,0.11175999999999998
1193,0.11793
1194,0.12100999999999999
1195,0.12409
1196,0.12718
1197,0.13335
1198,0.1426
1199,0.15185
1200,0.15802
1201,0.16727999999999998
1202,0.17653
1203,0.18578
1204,0.19195
1205,0.20134000000000002
1206,0.21059
1207,0.21675999999999998
1208,0.22601
1209,0.23526999999999998
1210,0.24144000000000002
1211,0.25069
1212,0.25994
1213,0.26611
1214,0.26946
1215,0.27296
1216,0.27633
1217,0.28559
1218,0.29484
1219,0.301
1220,0.31026
1221,0.31951
1222,0.32876
1223,0.33493
1224,0.34418000000000004
1225,0.35343
1226,0.3596
1227,0.36885
1228,0.3781
1229,0.38427
1230,0.39352
1231,0.40276999999999996
1232,0.40894
1233,0.41818999999999995
1234,0.42744
1235,0.43361000000000005
1236,0.44287
1237,0.45211999999999997
1238,0.45828
1239,0.46753999999999996
1240,0.47678999999999994
1241,0.48296000000000006
1242,0.49221000000000004
1243,0.50146
1244,0.51071
1245,0.51688
1246,0.5261399999999999
1247,0.5353899999999999
1248,0.54156
1249,0.55081
1250,0.56006
1251,0.56006
1252,0.56315
1253,0.56918
1254,0.57522
1255,0.58434
1256,0.59038
1257,0.59026
1258,0.59322
1259,0.59928
1260,0.60545
1261,0.60853
1262,0.6116199999999999
1263,0.6179
1264,0.6241899999999999
1265,0.63357
1266,0.64295
1267,0.64925
1268,0.6585
1269,0.66467
1270,0.66467
1271,0.66775
1272,0.67392
1273,0.68009
1274,0.68935
1275,0.6986
1276,0.70477
1277,0.71402
1278,0.72328
1279,0.72945
1280,0.73253
1281,0.73525
1282,0.7350300000000001
1283,0.74428
1284,0.75354
1285,0.76279
1286,0.7689600000000001
1287,0.77822
1288,0.7874800000000001
1289,0.79364
1290,0.8029
1291,0.81216
1292,0.81216
1293,0.81524
1294,0.8214100000000001
1295,0.82758
1296,0.83067
1297,0.83375
1298,0.83375
1299,0.84301
1300,0.8522700000000001
1301,0.85844
1302,0.86769
1303,0.87695
1304,0.88621
1305,0.89238
1306,0.9016299999999999
1307,0.91089
1308,0.91706
1309,0.92632
1310,0.9355700000000001
1311,0.9417399999999999
1312,0.951
1313,0.96026
1314,0.9664299999999999
1315,0.9756799999999999
1316,0.9849399999999999
1317,0.99111
1318,1.0004
1319,1.0096
1320,1.0158
1321,1.0249
1322,1.0342
1323,1.0404
1324,1.0496
1325,1.0589
1326,1.0681
1327,1.0743
1328,1.0836
1329,1.0928
1330,1.099
1331,1.1083
1332,1.1175
1333,1.1237
1334,1.1329
1335,1.1422
1336,1.1484
1337,1.1576
1338,1.1669
1339,1.1731
1340,1.1823
1341,1.1916
1342,1.1977
1343,1.207
1344,1.2163
1345,1.2255
1346,1.2317
1347,1.2409999999999999
1348,1.2503
1349,1.2565
1350,1.2657
1351,1.275
1352,1.2812
1353,1.2904
1354,1.2997
1355,1.3058
1356,1.3151
1357,1.3244
1358,1.3305
1359,1.3398
1360,1.349
1361,1.3552
1362,1.3645
1363,1.3736
1364,1.3799
1365,1.3891
1366,1.3983
1367,1.4076
1368,1.4138
1369,1.423
1370,1.4323
1371,1.4384
1372,1.4477
1373,1.4569999999999999
1374,1.4631
1375,1.4724
1376,1.4816
1377,1.4878
1378,1.4971
1379,1.4968
1380,1.4997
1381,1.5027
1382,1.5119
1383,1.5181
1384,1.5274
1385,1.5365
1386,1.5458
1387,1.5457
1388,1.5455
1389,1.5515
1390,1.5577
1391,1.567
1392,1.5762
1393,1.5823
1394,1.5916
1395,1.5945
1396,1.5975
1397,1.6005
1398,1.6097
1399,1.6159
1400,1.6189
1401,1.6188
1402,1.6188
1403,1.6187
1404,1.6187
1405,1.6187
1406,1.6187
1407,1.6187
1408,1.6187
1409,1.6188
1410,1.6188
1411,1.6189
1412,1.619
1413,1.6129
1414,1.6036
1415,1.5975
1416,1.5976
1417,1.5978
1418,1.5948
1419,1.595
1420,1.5952
1421,1.5891
1422,1.5799
1423,1.5738
1424,1.5709
1425,1.5711
1426,1.5619999999999998
1427,1.5527
1428,1.5465
1429,1.5374
1430,1.5281
1431,1.5252
1432,1.5255
1433,1.5227
1434,1.5165
1435,1.5072
1436,1.4980000000000002
1437,1.4918
1438,1.4826
1439,1.4733
1440,1.4671
1441,1.4579
1442,1.4486
1443,1.4424
1444,1.4332
1445,1.4239
1446,1.4178
1447,1.4085
1448,1.3992
1449,1.39
1450,1.3838
1451,1.3747
1452,1.3654
1453,1.3593
1454,1.35
1455,1.3407
1456,1.3346
1457,1.3253
1458,1.3162
1459,1.31
1460,1.304
1461,1.3013
1462,1.3015
1463,1.2923
1464,1.2830000000000001
1465,1.2768
1466,1.2676
1467,1.2583
1468,1.2491
1469,1.2429
1470,1.2337
1471,1.2244
1472,1.2182
1473,1.209
1474,1.1997
1475,1.1936
1476,1.1843
1477,1.1751
1478,1.169
1479,1.1598
1480,1.1504
1481,1.1442
1482,1.1351
1483,1.1259
1484,1.1197
1485,1.1104
1486,1.1012
1487,1.095
1488,1.0858
1489,1.0765
1490,1.0673
1491,1.0611
1492,1.0518
1493,1.0426
1494,1.0364
1495,1.0336
1496,1.031
1497,1.0282
1498,1.0190000000000001
1499,1.0097
1500,1.0036
1501,0.9943200000000001
1502,0.9850700000000001
1503,0.9789100000000001
1504,0.9696600000000001
1505,0.96041
1506,0.9544100000000001
1507,0.94516
1508,0.93591
1509,0.92666
1510,0.9205
1511,0.91125
1512,0.902
1513,0.89584
1514,0.88659
1515,0.87734
1516,0.87118
1517,0.86193
1518,0.85251
1519,0.84635
1520,0.8371
1521,0.82785
1522,0.8216899999999999
1523,0.8124399999999999
1524,0.80319
1525,0.79703
1526,0.78778
1527,0.77853
1528,0.77236
1529,0.76312
1530,0.7538699999999999
1531,0.74462
1532,0.73846
1533,0.72921
1534,0.71996
1535,0.7138
1536,0.70455
1537,0.69531
1538,0.68914
1539,0.6799
1540,0.67065
1541,0.6644899999999999
1542,0.6552399999999999
1543,0.64617
1544,0.6400100000000001
1545,0.63076
1546,0.62152
1547,0.61535
1548,0.60611
1549,0.5968600000000001
1550,0.58762
1551,0.58145
1552,0.57221
1553,0.56296
1554,0.5568
1555,0.54755
1556,0.5383100000000001
1557,0.53215
1558,0.5229
1559,0.51693
1560,0.51731
1561,0.51484
1562,0.50888
1563,0.50272
1564,0.49348000000000003
1565,0.48423999999999995
1566,0.47808
1567,0.46884
1568,0.4596
1569,0.45343999999999995
1570,0.44441
1571,0.43517
1572,0.42593000000000003
1573,0.41978000000000004
1574,0.41053999999999996
1575,0.4013
1576,0.39514
1577,0.3859
1578,0.37666
1579,0.3705
1580,0.36127
1581,0.35203
1582,0.34586999999999996
1583,0.33663000000000004
1584,0.32739
1585,0.32123
1586,0.312
1587,0.30276
1588,0.2966
1589,0.28736
1590,0.27813000000000004
1591,0.26889
1592,0.26273
1593,0.25349
1594,0.24425999999999998
1595,0.2381
1596,0.22885999999999998
1597,0.21963000000000002
1598,0.21347
1599,0.20423
1600,0.195
1601,0.18884
1602,0.17961
1603,0.17037
1604,0.16421
1605,0.15498
1606,0.14574
1607,0.13959000000000002
1608,0.13035
1609,0.12112
1610,0.11495999999999999
1611,0.10572999999999999
1612,0.09649400000000001
1613,0.087261
1614,0.081105
1615,0.071872
1616,0.062638
1617,0.056483000000000005
1618,0.04725
1619,0.038017
1620,0.031861
1621,0.025952999999999997
1622,0.023637000000000002
1623,0.02416
1624,0.0152
1625,0.0062438
1626,0.0037218000000000004
1627,0.0015018
1628,-0.0040582
1629,-0.010204000000000001
1630,-0.019122999999999998
1631,-0.018203999999999998
1632,-0.020326
1633,-0.020003
1634,-0.029213999999999997
1635,-0.028886000000000002
1636,-0.028556
1637,-0.027545
1638,-0.026505
1639,-0.025795
1640,-0.024706
1641,-0.023589
1642,-0.022827
1643,-0.022827
1644,-0.0167
1645,-0.010189
1646,-0.0010002000000000001
1647,0.008189799999999999
1648,0.011637999999999999
1649,0.015872
1650,0.020132
1651,0.026253
1652,0.035436
1653,0.045022
1654,0.054203999999999995
1655,0.060326
1656,0.06379
1657,0.068078
1658,0.068911
1659,0.07850800000000001
1660,0.08810499999999999
1661,0.094221
1662,0.1034
1663,0.11257
1664,0.11605
1665,0.12039000000000001
1666,0.12125999999999999
1667,0.12780999999999998
1668,0.13698
1669,0.14615
1670,0.15225999999999998
1671,0.16143
1672,0.1706
1673,0.17977
1674,0.18588
1675,0.19505
1676,0.20422
1677,0.21034
1678,0.21950999999999998
1679,0.22869
1680,0.2348
1681,0.24397
1682,0.25315
1683,0.25926
1684,0.26844
1685,0.27762
1686,0.28373000000000004
1687,0.29291
1688,0.30251
1689,0.30862
1690,0.3178
1691,0.32697
1692,0.33309
1693,0.34226999999999996
1694,0.35145
1695,0.36063
1696,0.3641
1697,0.36841999999999997
1698,0.37275
1699,0.37581
1700,0.38498000000000004
1701,0.39415
1702,0.40026999999999996
1703,0.40944
1704,0.41861000000000004
1705,0.42473
1706,0.43391
1707,0.4435
1708,0.44961999999999996
1709,0.45879
1710,0.46797
1711,0.47408999999999996
1712,0.48326
1713,0.48938000000000004
1714,0.4937
1715,0.49456000000000006
1716,0.50154
1717,0.51071
1718,0.51683
1719,0.526
1720,0.53517
1721,0.54171
1722,0.55088
1723,0.56005
1724,0.56617
1725,0.57534
1726,0.5845100000000001
1727,0.59105
1728,0.59541
1729,0.5998
1730,0.6059100000000001
1731,0.61507
1732,0.62424
1733,0.63035
1734,0.63952
1735,0.64868
1736,0.65785
1737,0.66396
1738,0.67357
1739,0.68274
1740,0.68885
1741,0.69802
1742,0.70719
1743,0.7133
1744,0.72247
1745,0.73164
1746,0.73775
1747,0.74168
1748,0.74605
1749,0.75
1750,0.75917
1751,0.7683300000000001
1752,0.77444
1753,0.7836
1754,0.79277
1755,0.80194
1756,0.8084899999999999
1757,0.81765
1758,0.8268200000000001
1759,0.83293
1760,0.8421
1761,0.8512700000000001
1762,0.8573799999999999
1763,0.86655
1764,0.87572
1765,0.8818299999999999
1766,0.89143
1767,0.89581
1768,0.8967
1769,0.9063100000000001
1770,0.91548
1771,0.9215899999999999
1772,0.93075
1773,0.9399200000000001
1774,0.9460299999999999
1775,0.95519
1776,0.96436
1777,0.9739700000000001
1778,0.98008
1779,0.98924
1780,0.99841
1781,1.0045
1782,1.0137
1783,1.0229
1784,1.0290000000000001
1785,1.0381
1786,1.0425
1787,1.0465
1788,1.0504
1789,1.0596
1790,1.0657
1791,1.0748
1792,1.084
1793,1.0901
1794,1.0993
1795,1.1084
1796,1.1176
1797,1.1237
1798,1.1329
1799,1.1421
1800,1.1486
1801,1.1578
1802,1.1669
1803,1.173
1804,1.1822
1805,1.1914
1806,1.1923
1807,1.1967
1808,1.2006
1809,1.2067
1810,1.2159
1811,1.2251
1812,1.2312
1813,1.2403
1814,1.2495
1815,1.256
1816,1.2652
1817,1.2744
1818,1.2835
1819,1.2896
1820,1.2932
1821,1.2976
1822,1.2985
1823,1.305
1824,1.3142
1825,1.3203
1826,1.3299
1827,1.3391
1828,1.3452
1829,1.3496
1830,1.351
1831,1.3576
1832,1.3672
1833,1.3738
1834,1.3748
1835,1.3762
1836,1.3807
1837,1.3822
1838,1.3832
1839,1.3868
1840,1.3873
1841,1.3878
1842,1.3893
1843,1.3909
1844,1.392
1845,1.3935
1846,1.3941
1847,1.3946
1848,1.3916
1849,1.3932
1850,1.3943
1851,1.3929
1852,1.3946
1853,1.3957
1854,1.3908
1855,1.3823
1856,1.3762
1857,1.3779
1858,1.3767
1859,1.3712
1860,1.3651
1861,1.3566
1862,1.3476
1863,1.3415
1864,1.3354
1865,1.3342
1866,1.3354
1867,1.3336
1868,1.3252
1869,1.3191
1870,1.3143
1871,1.3132
1872,1.3144
1873,1.3054
1874,1.2963
1875,1.2903
1876,1.2812
1877,1.2722
1878,1.2631
1879,1.2571
1880,1.248
1881,1.239
1882,1.2329
1883,1.2239
1884,1.2148
1885,1.2088
1886,1.1997
1887,1.1907
1888,1.1846
1889,1.1756
1890,1.1665
1891,1.1605
1892,1.1515
1893,1.1424
1894,1.1364
1895,1.1273
1896,1.1183
1897,1.1123
1898,1.1032
1899,1.0942
1900,1.0851
1901,1.0791
1902,1.0701
1903,1.061
1904,1.055
1905,1.046
1906,1.0369
1907,1.0309
1908,1.0219
1909,1.0129
1910,1.0085
1911,1.0034
1912,0.9967299999999999
1913,0.9900399999999999
1914,0.981
1915,0.97196
1916,0.96593
1917,0.9569
1918,0.94786
1919,0.9388299999999999
1920,0.9328
1921,0.9237700000000001
1922,0.91474
1923,0.9087200000000001
1924,0.89969
1925,0.89066
1926,0.88464
1927,0.87561
1928,0.86659
1929,0.8605700000000001
1930,0.85155
1931,0.8425299999999999
1932,0.8365100000000001
1933,0.82749
1934,0.81777
1935,0.81176
1936,0.80274
1937,0.79372
1938,0.78771
1939,0.77869
1940,0.76968
1941,0.76066
1942,0.75466
1943,0.74564
1944,0.73663
1945,0.73063
1946,0.7216199999999999
1947,0.7126100000000001
1948,0.7066100000000001
1949,0.6976
1950,0.6886
1951,0.6826
1952,0.6736
1953,0.6646
1954,0.65933
1955,0.65033
1956,0.6406
1957,0.63461
1958,0.62635
1959,0.61662
1960,0.60763
1961,0.60163
1962,0.59264
1963,0.5844
1964,0.5776600000000001
1965,0.56868
1966,0.5597
1967,0.5544600000000001
1968,0.54548
1969,0.53651
1970,0.52976
1971,0.52078
1972,0.51257
1973,0.50659
1974,0.49762
1975,0.48865
1976,0.48267
1977,0.47293
1978,0.46474
1979,0.45876000000000006
1980,0.4498
1981,0.44083999999999995
1982,0.43109
1983,0.42512
1984,0.41616000000000003
1985,0.4072
1986,0.40123000000000003
1987,0.39228
1988,0.38333
1989,0.37736
1990,0.36841
1991,0.35946
1992,0.35489
1993,0.34953
1994,0.34498
1995,0.33901
1996,0.33005
1997,0.32109
1998,0.31511999999999996
1999,0.30617
2000,0.29721
2001,0.28826
2002,0.2823
2003,0.27335
2004,0.26441
2005,0.25844
2006,0.2495
2007,0.24056
2008,0.2346
2009,0.22485
2010,0.21591
2011,0.20995
2012,0.20102
2013,0.19208
2014,0.18613
2015,0.1772
2016,0.16827
2017,0.16232
2018,0.1577
2019,0.15228
2020,0.14849
2021,0.13874
2022,0.1298
2023,0.12087
2024,0.11490999999999998
2025,0.10597999999999999
2026,0.097049
2027,0.091097
2028,0.082169
2029,0.073244
2030,0.06729500000000001
2031,0.058373
2032,0.049453
2033,0.043508
2034,0.034591000000000004
2035,0.025677
2036,0.019736
2037,0.010825
2038,0.0019168
2039,-0.0040212
2040,-0.012925999999999998
2041,-0.022680000000000002
2042,-0.027762000000000002
2043,-0.036661
2044,-0.045557
2045,-0.054451
2046,-0.060378999999999995
2047,-0.06926900000000001
2048,-0.078157
2049,-0.08408099999999999
2050,-0.09296499999999999
2051,-0.10185
2052,-0.10777
2053,-0.11752
2054,-0.1264
2055,-0.13232
2056,-0.14119
2057,-0.15006
2058,-0.15598
2059,-0.16484000000000001
2060,-0.17371
2061,-0.17961
2062,-0.18847
2063,-0.19733
2064,-0.20618000000000003
2065,-0.21209
2066,-0.22094
2067,-0.22978
2068,-0.23568000000000003
2069,-0.24452
2070,-0.25336
2071,-0.25925
2072,-0.26716
2073,-0.27599
2074,-0.28187
2075,-0.29069
2076,-0.29951
2077,-0.30539
2078,-0.31421
2079,-0.32302
2080,-0.325
2081,-0.32211999999999996
2082,-0.32214
2083,-0.32799
2084,-0.33678
2085,-0.34556
2086,-0.35334
2087,-0.35919
2088,-0.36795
2089,-0.37671
2090,-0.38255
2091,-0.38929
2092,-0.38623
2093,-0.38709
2094,-0.39582
2095,-0.40454
2096,-0.41035
2097,-0.41802
2098,-0.42673
2099,-0.42462
2100,-0.42433000000000004
2101,-0.42507
2102,-0.43086
2103,-0.43953000000000003
2104,-0.44711000000000006
2105,-0.45577
2106,-0.46155
2107,-0.46443
2108,-0.46731999999999996
2109,-0.46731999999999996
2110,-0.46688
2111,-0.46641000000000005
2112,-0.46703
2113,-0.46876
2114,-0.4705
2115,-0.4705
2116,-0.46992
2117,-0.46761
2118,-0.46761
2119,-0.46645
2120,-0.4601
2121,-0.45488999999999996
2122,-0.4485
2123,-0.44209
2124,-0.43968999999999997
2125,-0.43608
2126,-0.43487
2127,-0.43203
2128,-0.42635
2129,-0.41662
2130,-0.40809
2131,-0.4024
2132,-0.39387
2133,-0.38533
2134,-0.38129
2135,-0.37485
2136,-0.36839
2137,-0.3627
2138,-0.35418
2139,-0.34565
2140,-0.33996
2141,-0.33021999999999996
2142,-0.32168
2143,-0.31599
2144,-0.30744
2145,-0.30221
2146,-0.29578000000000004
2147,-0.29053
2148,-0.282
2149,-0.27347
2150,-0.26777
2151,-0.25804
2152,-0.24949000000000002
2153,-0.24379
2154,-0.23524
2155,-0.22668000000000002
2156,-0.22432
2157,-0.2179
2158,-0.21266999999999997
2159,-0.20697
2160,-0.19843
2161,-0.18869
2162,-0.183
2163,-0.17445
2164,-0.17040999999999998
2165,-0.16518
2166,-0.1616
2167,-0.15187
2168,-0.14213
2169,-0.13809000000000002
2170,-0.13163
2171,-0.12516
2172,-0.11947999999999999
2173,-0.11095999999999999
2174,-0.10244
2175,-0.095549
2176,-0.087019
2177,-0.08176900000000001
2178,-0.076512
2179,-0.07003200000000001
2180,-0.061517999999999996
2181,-0.05584
2182,-0.047319
2183,-0.037587
2184,-0.031902999999999994
2185,-0.023374000000000002
2186,-0.014838999999999998
2187,-0.0051052
2188,-0.0027061999999999998
2189,0.0037548
2190,0.010645
2191,0.017536000000000003
2192,0.026057999999999998
2193,0.03253
2194,0.034963
2195,0.040242
2196,0.048747000000000006
2197,0.05442
2198,0.064149
2199,0.072663
2200,0.078341
2201,0.083607
2202,0.0901
2203,0.09538300000000001
2204,0.10511
2205,0.11484000000000001
2206,0.12012
2207,0.12665
2208,0.13072
2209,0.1392
2210,0.14486
2211,0.15459
2212,0.16309
2213,0.16875
2214,0.17527
2215,0.18181
2216,0.1887
2217,0.19842
2218,0.20496999999999999
2219,0.21029
2220,0.21561
2221,0.22408000000000003
2222,0.23098000000000002
2223,0.23505
2224,0.24163
2225,0.24415
2226,0.25387
2227,0.26358000000000004
2228,0.27019
2229,0.27554
2230,0.2809
2231,0.29061
2232,0.29623
2233,0.30159
2234,0.30543000000000003
2235,0.31081
2236,0.31468
2237,0.31856999999999996
2238,0.32118
2239,0.32957
2240,0.33926999999999996
2241,0.34337
2242,0.35009
2243,0.35402
2244,0.35961
2245,0.3693
2246,0.37751999999999997
2247,0.38016
2248,0.38413
2249,0.38811999999999997
2250,0.39213000000000003
2251,0.39759
2252,0.40164
2253,0.4057
2254,0.40842
2255,0.41252
2256,0.41663999999999995
2257,0.41663999999999995
2258,0.4208
2259,0.42496999999999996
2260,0.42777
2261,0.43198000000000003
2262,0.43622
2263,0.43073
2264,0.42391999999999996
2265,0.41986999999999997
2266,0.42273
2267,0.4243
2268,0.41755
2269,0.40936999999999996
2270,0.40537
2271,0.3972
2272,0.38904
2273,0.38778
2274,0.38506
2275,0.38506
2276,0.37963
2277,0.37148000000000003
2278,0.36334
2279,0.35791
2280,0.34978000000000004
2281,0.34707
2282,0.34707
2283,0.34018000000000004
2284,0.33205
2285,0.32664
2286,0.31853000000000004
2287,0.30893000000000004
2288,0.30353
2289,0.29543
2290,0.28733000000000003
2291,0.28044
2292,0.27744
2293,0.27025
2294,0.26335
2295,0.25795
2296,0.24985
2297,0.24025
2298,0.23485999999999999
2299,0.22676999999999997
2300,0.21957
2301,0.21656
2302,0.21086999999999997
2303,0.20277
2304,0.19737000000000002
2305,0.18928
2306,0.17969000000000002
2307,0.1743
2308,0.16623
2309,0.15816
2310,0.15009
2311,0.14705
2312,0.13982
2313,0.13142
2314,0.12603
2315,0.11796
2316,0.10989000000000002
2317,0.10452
2318,0.096463
2319,0.08841399999999999
2320,0.083053
2321,0.07348099999999999
2322,0.065447
2323,0.060095
2324,0.052073
2325,0.044058
2326,0.038718999999999996
2327,0.029161000000000003
2328,0.021838999999999997
2329,0.018747999999999997
2330,0.011856
2331,0.0038388000000000007
2332,-0.0041712
2333,-0.011059999999999999
2334,-0.019062
2335,-0.027056999999999998
2336,-0.032382
2337,-0.040364
2338,-0.047251
2339,-0.050383
2340,-0.057728999999999996
2341,-0.064618
2342,-0.06994600000000001
2343,-0.077933
2344,-0.08748099999999999
2345,-0.092799
2346,-0.10077
2347,-0.10873
2348,-0.11404
2349,-0.12197999999999999
2350,-0.12939
2351,-0.13412000000000002
2352,-0.141
2353,-0.15054
2354,-0.15743
2355,-0.16323
2356,-0.16794
2357,-0.17482999999999999
2358,-0.18015
2359,-0.18812
2360,-0.19609000000000001
2361,-0.20297
2362,-0.21093
2363,-0.21888000000000002
2364,-0.22416999999999998
2365,-0.23210999999999998
2366,-0.24003000000000002
2367,-0.24531
2368,-0.25483
2369,-0.26227
2370,-0.26546
2371,-0.27499
2372,-0.28292
2373,-0.29243
2374,-0.29771
2375,-0.30562
2376,-0.31146999999999997
2377,-0.31732
2378,-0.32211
2379,-0.33004
2380,-0.33532
2381,-0.34484000000000004
2382,-0.35274
2383,-0.35801
2384,-0.36489
2385,-0.37235
2386,-0.3782
2387,-0.38508000000000003
2388,-0.39299
2389,-0.39826
2390,-0.40615
2391,-0.41565
2392,-0.42353
2393,-0.42878
2394,-0.43664
2395,-0.44416000000000005
2396,-0.45003000000000004
2397,-0.45853
2398,-0.46641000000000005
2399,-0.47165
2400,-0.47951000000000005
2401,-0.489
2402,-0.49423
2403,-0.50207
2404,-0.5099
2405,-0.51512
2406,-0.52007
2407,-0.52762
2408,-0.5344899999999999
2409,-0.54233
2410,-0.55181
2411,-0.55702
2412,-0.56484
2413,-0.5733699999999999
2414,-0.5809300000000001
2415,-0.5868399999999999
2416,-0.59206
2417,-0.59988
2418,-0.6051
2419,-0.6129
2420,-0.6207
2421,-0.62589
2422,-0.63367
2423,-0.64144
2424,-0.6482899999999999
2425,-0.65605
2426,-0.66379
2427,-0.66895
2428,-0.67667
2429,-0.68438
2430,-0.68866
2431,-0.6963600000000001
2432,-0.7014600000000001
2433,-0.7092
2434,-0.71434
2435,-0.72206
2436,-0.7297600000000001
2437,-0.73661
2438,-0.7443
2439,-0.75197
2440,-0.75708
2441,-0.76474
2442,-0.7723800000000001
2443,-0.77747
2444,-0.78606
2445,-0.79384
2446,-0.7955800000000001
2447,-0.80497
2448,-0.81261
2449,-0.8177
2450,-0.82531
2451,-0.83468
2452,-0.83975
2453,-0.84734
2454,-0.8549100000000001
2455,-0.8609899999999999
2456,-0.86706
2457,-0.8706
2458,-0.8799600000000001
2459,-0.88502
2460,-0.8943700000000001
2461,-0.90194
2462,-0.9069799999999999
2463,-0.9138
2464,-0.9216700000000001
2465,-0.9252299999999999
2466,-0.93206
2467,-0.93963
2468,-0.94466
2469,-0.9540000000000001
2470,-0.9615299999999999
2471,-0.96655
2472,-0.9719399999999999
2473,-0.97983
2474,-0.9891700000000001
2475,-0.99419
2476,-1.0017
2477,-1.011
2478,-1.016
2479,-1.0247
2480,-1.0326
2481,-1.0362
2482,-1.0437
2483,-1.0512
2484,-1.058
2485,-1.0655
2486,-1.073
2487,-1.0773
2488,-1.0853
2489,-1.0907
2490,-1.0957
2491,-1.1032
2492,-1.1107
2493,-1.1175
2494,-1.125
2495,-1.1318
2496,-1.1372
2497,-1.1434
2498,-1.1502
2499,-1.1577
2500,-1.1626
2501,-1.1719
2502,-1.1793
2503,-1.1843
2504,-1.1923
2505,-1.1978
2506,-1.2046
2507,-1.212
2508,-1.2195
2509,-1.2263
2510,-1.2337
2511,-1.2404
2512,-1.2466
2513,-1.2522
2514,-1.2590000000000001
2515,-1.2682
2516,-1.2732
2517,-1.2769
2518,-1.2849
2519,-1.2886
2520,-1.296
2521,-1.3053
2522,-1.3102
2523,-1.3176
2524,-1.325
2525,-1.3293
2526,-1.3374
2527,-1.3454
2528,-1.3504
2529,-1.3596
2530,-1.3701
2531,-1.3738
2532,-1.38
2533,-1.3874
2534,-1.3923
2535,-1.4016
2536,-1.4089
2537,-1.4182
2538,-1.4219
2539,-1.43
2540,-1.4368
2541,-1.4417
2542,-1.4509
2543,-1.459
2544,-1.4627
2545,-1.4689
2546,-1.4763
2547,-1.4812
2548,-1.4905
2549,-1.4978
2550,-1.5027
2551,-1.5089
2552,-1.517
2553,-1.5207
2554,-1.5281
2555,-1.5373
2556,-1.5446
2557,-1.5495
2558,-1.5568
2559,-1.565
2560,-1.5712
2561,-1.5774
2562,-1.5847
2563,-1.5915
2564,-1.5988
2565,-1.6059999999999999
2566,-1.6108
2567,-1.6171
2568,-1.6253
2569,-1.6291
2570,-1.6364
2571,-1.6436
2572,-1.6484
2573,-1.6576
2574,-1.6648
2575,-1.6695
2576,-1.6767
2577,-1.6838
2578,-1.6925
2579,-1.6964
2580,-1.7071
2581,-1.7142
2582,-1.7189
2583,-1.726
2584,-1.7331
2585,-1.7377
2586,-1.7468
2587,-1.7537
2588,-1.7584
2589,-1.7653
2590,-1.7722
2591,-1.7788
2592,-1.785
2593,-1.7935
2594,-1.7981
2595,-1.805
2596,-1.8118
2597,-1.8186
2598,-1.8232
2599,-1.8299
2600,-1.8366
2601,-1.8411
2602,-1.8477
2603,-1.8544
2604,-1.8587
2605,-1.8653
2606,-1.8718
2607,-1.8761
2608,-1.8826
2609,-1.889
2610,-1.8932
2611,-1.8995
2612,-1.9058
2613,-1.91
2614,-1.9162
2615,-1.9223
2616,-1.9264
2617,-1.9348
2618,-1.9408
2619,-1.9468
2620,-1.9508
2621,-1.9567
2622,-1.9625
2623,-1.9664
2624,-1.9722
2625,-1.9779
2626,-1.9817
2627,-1.9873
2628,-1.9928
2629,-1.9971
2630,-2.0015
2631,-2.0033
2632,-2.0069
2633,-2.0124
2634,-2.0177
2635,-2.0213
2636,-2.0265
2637,-2.0317
2638,-2.0317
2639,-2.0334
2640,-2.03
2641,-2.035
2642,-2.0383
2643,-2.0433
2644,-2.0481
2645,-2.0513
2646,-2.0561
2647,-2.0608
2648,-2.0638
2649,-2.0684
2650,-2.0729
2651,-2.0758
2652,-2.0801
2653,-2.0844
2654,-2.0872
2655,-2.0913
2656,-2.0954
2657,-2.0980000000000003
2658,-2.1019
2659,-2.1058
2660,-2.1095
2661,-2.1119
2662,-2.1155
2663,-2.119
2664,-2.1213
2665,-2.1246
2666,-2.1279
2667,-2.13
2668,-2.1331
2669,-2.1361
2670,-2.138
2671,-2.1408
2672,-2.1436
2673,-2.1453
2674,-2.1479
2675,-2.1504
2676,-2.1519
2677,-2.1542
2678,-2.1564
2679,-2.1585
2680,-2.1598
2681,-2.1617
2682,-2.1635
2683,-2.1647
2684,-2.1663
2685,-2.1678
2686,-2.1687
2687,-2.17
2688,-2.1713
2689,-2.1719999999999997
2690,-2.173
2691,-2.1739
2692,-2.1745
2693,-2.1752
2694,-2.1758
2695,-2.1761
2696,-2.1766
2697,-2.1769
2698,-2.177
2699,-2.1771
2700,-2.1771
2701,-2.1771
2702,-2.1771
2703,-2.1771
2704,-2.1771
2705,-2.1771
2706,-2.1771
2707,-2.1771
2708,-2.1771
