time,value
0,-1.1721
1,-0.83237
2,1.274
3,0.050962
4,-1.1721
5,-0.69647
6,1.2061
7,-0.016987000000000002
8,-1.1721
9,-0.35673
10,1.1381
11,-0.35673
12,-1.1721
13,-0.016987000000000002
14,1.1381
15,-0.76442
16,-1.1721
17,0.45865
18,1.0702
19,-1.1721
20,-1.1721
21,0.6625
22,0.7984
23,-1.1721
24,-1.1721
25,1.0702
26,0.39071
27,-1.1721
28,-1.1721
29,1.274
30,0.11890999999999999
31,-1.1721
32,-0.83237
33,1.2061
34,-0.22083000000000003
35,-1.1721
36,-0.28878000000000004
37,1.1381
38,-0.69647
39,-1.1721
40,0.18686
41,1.1381
42,-1.1721
43,-1.1721
44,0.6625
45,0.86635
46,-1.1721
47,-1.1721
48,0.9343
49,0.9343
50,-1.1721
51,-1.1721
52,0.73045
53,1.0022
54,-1.1721
55,-1.1721
56,0.7984
57,0.86635
58,-1.1721
59,-1.1721
60,1.1381
61,0.7984
62,-1.1721
63,-1.0362
64,1.274
65,1.0702
66,0.11890999999999999
67,-1.1721
68,-0.084936
69,1.1381
70,0.32276
71,-1.1721
72,-0.83237
73,1.2061
74,0.86635
75,-1.1721
76,-0.76442
77,1.274
78,1.0702
79,-0.69647
80,-1.1721
81,1.1381
82,1.2061
83,1.2061
84,1.1381
85,1.0702
86,1.0702
87,1.0702
88,1.0022
89,1.0702
90,1.0022
91,1.0022
92,0.7984
93,-1.1721
94,-1.1721
95,0.6625
