time,value
0,-0.25084
1,-0.25084
2,-0.25084
3,-0.25084
4,-0.25084
5,-0.25084
6,-0.25084
7,-0.25084
8,-0.25084
9,-0.25084
10,-0.25084
11,-0.25084
12,-0.25084
13,-0.25084
14,-0.25084
15,-0.25084
16,-0.25084
17,-0.25084
18,-0.25084
19,-0.25084
20,-0.25084
21,-0.25084
22,-0.25084
23,-0.25084
24,-0.25084
25,-0.25084
26,-0.25084
27,-0.25084
28,-0.25084
29,-0.25084
30,-0.25084
31,-0.25084
32,-0.25084
33,-0.25084
34,-0.25084
35,-0.25084
36,-0.25084
37,-0.25084
38,-0.25084
39,-0.25084
40,-0.25084
41,-0.25084
42,-0.25084
43,-0.25084
44,-0.25084
45,-0.25084
46,-0.25084
47,-0.25084
48,-0.25084
49,-0.25084
50,-0.25084
51,-0.25084
52,-0.25084
53,-0.25084
54,-0.25084
55,-0.25084
56,-0.25084
57,-0.25084
58,-0.25084
59,-0.25084
60,-0.25084
61,-0.25084
62,-0.25084
63,-0.25084
64,-0.25084
65,-0.25084
66,-0.25084
67,-0.25084
68,-0.25084
69,3.9811
70,5.3917
71,2.3215
72,2.7862
73,0.014694
74,-0.0019015999999999998
75,4.9436
76,2.6368
77,-0.25084
78,-0.25084
79,-0.25084
80,-0.25084
81,-0.25084
82,-0.25084
83,-0.25084
84,-0.25084
85,-0.25084
86,-0.25084
87,-0.25084
88,-0.25084
89,-0.25084
90,-0.25084
91,-0.25084
92,-0.25084
93,-0.25084
94,-0.25084
95,-0.25084
