time,value
0,-0.29994
1,-0.29994
2,-0.29994
3,-0.29994
4,3.2993
5,-0.29994
6,-0.29994
7,-0.29994
8,-0.29994
9,-0.29994
10,3.2993
11,-0.29994
12,-0.29994
13,-0.29994
14,-0.29994
15,-0.29994
16,-0.29994
17,-0.29994
18,-0.29994
19,-0.29994
20,-0.29994
21,-0.29994
22,-0.29994
23,3.2993
24,-0.29994
25,-0.29994
26,-0.29994
27,-0.29994
28,-0.29994
29,-0.29994
30,-0.29994
31,3.2993
32,-0.29994
33,-0.29994
34,-0.29994
35,-0.29994
36,-0.29994
37,-0.29994
38,-0.29994
39,-0.29994
40,-0.29994
41,-0.29994
42,-0.29994
43,-0.29994
44,3.2993
45,-0.29994
46,-0.29994
47,-0.29994
48,-0.29994
49,-0.29994
50,-0.29994
51,-0.29994
52,-0.29994
53,-0.29994
54,-0.29994
55,-0.29994
56,-0.29994
57,-0.29994
58,-0.29994
59,-0.29994
60,-0.29994
61,-0.29994
62,-0.29994
63,-0.29994
64,-0.29994
65,-0.29994
66,3.2993
67,-0.29994
68,-0.29994
69,-0.29994
70,-0.29994
71,-0.29994
72,-0.29994
73,-0.29994
74,-0.29994
75,-0.29994
76,-0.29994
77,-0.29994
78,-0.29994
79,-0.29994
80,3.2993
81,-0.29994
82,-0.29994
83,-0.29994
84,-0.29994
85,-0.29994
86,-0.29994
87,-0.29994
88,-0.29994
89,-0.29994
90,3.2993
91,-0.29994
92,-0.29994
93,-0.29994
94,-0.29994
95,-0.29994
