time,value
0,-0.22860999999999998
1,-0.2196
2,-0.19858
3,-0.23761999999999997
4,-0.21059
5,-0.20459000000000002
6,-0.23761999999999997
7,-0.20459000000000002
8,-0.20158
9,-0.23462
10,-0.18957000000000002
11,-0.2166
12,-0.2166
13,-0.19558
14,-0.23160999999999998
15,-0.19558
16,-0.20459000000000002
17,-0.23160999999999998
18,-0.18657
19,-0.2136
20,-0.22860999999999998
21,-0.19257
22,-0.22560999999999998
23,-0.2136
24,-0.19558
25,-0.22261
26,-0.18657
27,-0.20459000000000002
28,-0.2136
29,-0.17155
30,-0.2136
31,-0.21059
32,-0.18657
33,-0.2166
34,-0.19858
35,-0.21059
36,-0.22560999999999998
37,-0.18957000000000002
38,-0.22560999999999998
39,-0.2166
40,-0.18657
41,-0.22860999999999998
42,-0.20759
43,-0.2166
44,-0.23160999999999998
45,-0.19858
46,-0.22860999999999998
47,-0.2196
48,-0.19558
49,-0.23462
50,-0.20459000000000002
51,-0.20158
52,-0.23160999999999998
53,-0.18957000000000002
54,-0.22261
55,-0.2136
56,-0.20158
57,-0.22860999999999998
58,-0.19257
59,-0.20759
60,-0.22261
61,-0.18957000000000002
62,-0.2196
63,-0.2166
64,-0.20459000000000002
65,-0.22560999999999998
66,-0.20459000000000002
67,-0.2196
68,-0.22860999999999998
69,-0.18356
70,-0.2166
71,-0.20459000000000002
72,-0.18657
73,-0.2136
74,-0.17456
75,-0.19257
76,-0.18657
77,1.9246
78,5.7806
79,5.3932
80,4.9788
81,0.43506999999999996
82,-0.11149
83,-0.17155
84,-0.12951
85,-0.15353
86,-0.17756
87,-0.12650999999999998
88,-0.19257
89,-0.18356
90,-0.18056
91,-0.21059
92,-0.16254000000000002
93,-0.20759
94,-0.18356
95,-0.18056
