time,value
0,-0.16114
1,-0.16114
2,-0.16114
3,-0.16114
4,-0.16114
5,-0.16114
6,-0.16114
7,-0.16114
8,-0.16114
9,-0.16114
10,-0.16114
11,-0.16114
12,-0.16114
13,-0.16114
14,-0.16114
15,-0.16114
16,-0.16114
17,-0.16114
18,-0.16114
19,-0.16114
20,-0.16114
21,-0.16114
22,-0.16114
23,-0.16114
24,-0.16114
25,-0.16114
26,-0.16114
27,-0.16114
28,-0.16114
29,-0.16114
30,-0.16114
31,-0.16114
32,-0.16114
33,-0.16114
34,-0.16114
35,-0.16114
36,-0.16114
37,-0.16114
38,-0.16114
39,-0.16114
40,-0.16114
41,-0.16114
42,-0.16114
43,-0.16114
44,-0.16114
45,-0.16114
46,-0.16114
47,-0.16114
48,-0.16114
49,-0.16114
50,-0.033995
51,6.1116
52,1.181
53,0.064899
54,7.3407
55,-0.16114
56,-0.16114
57,-0.16114
58,-0.16114
59,-0.16114
60,-0.16114
61,-0.16114
62,-0.16114
63,-0.16114
64,-0.16114
65,-0.16114
66,-0.16114
67,-0.16114
68,-0.16114
69,-0.16114
70,-0.16114
71,-0.16114
72,-0.16114
73,-0.16114
74,-0.16114
75,-0.16114
76,-0.16114
77,-0.16114
78,-0.16114
79,-0.16114
80,-0.16114
81,-0.16114
82,-0.16114
83,-0.16114
84,-0.16114
85,-0.16114
86,-0.16114
87,-0.16114
88,-0.16114
89,-0.16114
90,-0.16114
91,-0.16114
92,-0.16114
93,-0.16114
94,-0.16114
95,-0.16114
