time,value
0,-1.3804
1,0.19876
2,-1.1005
3,-2.2369
4,-1.83
5,-1.0578
6,-1.1508
7,-1.6962
8,-1.7978
9,-1.4715
10,-1.3613
11,-1.5635
12,-1.7114
13,-1.6209
14,-1.5234
15,-1.5624
16,-1.6276
17,-1.6183
18,-1.568
19,-1.5612
20,-1.5625
21,-1.5606
22,-1.5385
23,-1.5396
24,-1.5219
25,-1.5214
26,-1.5119
27,-1.5091
28,-1.5053
29,-1.4994
30,-1.5027
31,-1.4934
32,-1.5001
33,-1.4864
34,-1.496
35,-1.4863
36,-1.49
37,-1.4823
38,-1.4799
39,-1.4764
40,-1.4679
41,-1.4665
42,-1.4509999999999998
43,-1.4521
44,-1.4314
45,-1.4316
46,-1.4112
47,-1.4042
48,-1.3862
49,-1.3718
50,-1.3553
51,-1.3332
52,-1.319
53,-1.2899
54,-1.2769
55,-1.2417
56,-1.2283
57,-1.1959
58,-1.1776
59,-1.1498
60,-1.1275
61,-1.1066
62,-1.0834
63,-1.0724
64,-1.0504
65,-1.0494
66,-1.0304
67,-1.0363
68,-1.0258
69,-1.0307
70,-1.0274
71,-1.0292
72,-1.0314
73,-1.0278
74,-1.0325
75,-1.0216
76,-1.0290000000000001
77,-1.0154
78,-1.0223
79,-1.0075
80,-1.0029
81,-0.9890200000000001
82,-0.9818100000000001
83,-0.9770700000000001
84,-0.96673
85,-0.96506
86,-0.9498
87,-0.9566
88,-0.94573
89,-0.958
90,-0.95283
91,-0.96224
92,-0.96514
93,-0.9742200000000001
94,-0.98561
95,-0.9927600000000001
96,-1.0109
97,-1.015
98,-1.0395
99,-1.0454
100,-1.0742
101,-1.0852
102,-1.1087
103,-1.1251
104,-1.1478
105,-1.1724
106,-1.1889
107,-1.2125
108,-1.2203
109,-1.2488
110,-1.2573
111,-1.2854
112,-1.2937
113,-1.3133
114,-1.3244
115,-1.3379
116,-1.3509
117,-1.3559999999999999
118,-1.3713
119,-1.3712
120,-1.3911
121,-1.3903
122,-1.4099
123,-1.4119
124,-1.4248
125,-1.4283
126,-1.4324
127,-1.4369
128,-1.4339
129,-1.4411
130,-1.4302
131,-1.4372
132,-1.4223
133,-1.4274
134,-1.4158
135,-1.4141
136,-1.4032
137,-1.3929
138,-1.3838
139,-1.3668
140,-1.3609
141,-1.3391
142,-1.3388
143,-1.3195
144,-1.3211
145,-1.3081
146,-1.3074
147,-1.3019
148,-1.2998
149,-1.3018
150,-1.2969
151,-1.3043
152,-1.2949
153,-1.306
154,-1.2962
155,-1.3054
156,-1.2982
157,-1.3008
158,-1.2959
159,-1.2913
160,-1.2891
161,-1.2783
162,-1.2796
163,-1.2633
164,-1.268
165,-1.2519
166,-1.2553
167,-1.2435
168,-1.2418
169,-1.2339
170,-1.2271
171,-1.2244
172,-1.2136
173,-1.2156
174,-1.1988
175,-1.2024
176,-1.1842
177,-1.1846
178,-1.1694
179,-1.1631
180,-1.1503
181,-1.1375
182,-1.1284
183,-1.1103
184,-1.1052
185,-1.0817
186,-1.0794
187,-1.0554
188,-1.0492
189,-1.0281
190,-1.0171
191,-1.0015
192,-0.9869100000000001
193,-0.9778399999999999
194,-0.96154
195,-0.96142
196,-0.94557
197,-0.9543200000000001
198,-0.94439
199,-0.95486
200,-0.9525399999999999
201,-0.9606100000000001
202,-0.96434
203,-0.9683700000000001
204,-0.9769100000000001
205,-0.9754200000000001
206,-0.98714
207,-0.9796600000000001
208,-0.9943200000000001
209,-0.98761
210,-0.9987799999999999
211,-0.99613
212,-1.0032
213,-1.0059
214,-1.008
215,-1.0149
216,-1.0126
217,-1.0258
218,-1.0209
219,-1.04
220,-1.0389
221,-1.0568
222,-1.0616
223,-1.0754
224,-1.0849
225,-1.0935
226,-1.1069
227,-1.1087
228,-1.1233
229,-1.1165
230,-1.1315
231,-1.1239
232,-1.1323
233,-1.1257
234,-1.1264
235,-1.1228
236,-1.1179
237,-1.1186
238,-1.1082
239,-1.1129
240,-1.0979
241,-1.1069
242,-1.0945
243,-1.0985
244,-1.0887
245,-1.0863
246,-1.0794
247,-1.0693
248,-1.064
249,-1.0465
250,-1.044
251,-1.0202
252,-1.0195
253,-0.99682
254,-0.9906799999999999
255,-0.9719200000000001
256,-0.96054
257,-0.94615
258,-0.9298799999999999
259,-0.9209700000000001
260,-0.9010799999999999
261,-0.89828
262,-0.8759299999999999
263,-0.87956
264,-0.8628899999999999
265,-0.8630899999999999
266,-0.85131
267,-0.8470799999999999
268,-0.84052
269,-0.83105
270,-0.828
271,-0.81196
272,-0.81176
273,-0.7895300000000001
274,-0.79178
275,-0.7723
276,-0.76883
277,-0.75315
278,-0.7443
279,-0.7339399999999999
280,-0.7218899999999999
281,-0.7186899999999999
282,-0.7034
283,-0.70544
284,-0.68643
285,-0.69329
286,-0.67956
287,-0.6818
288,-0.67178
289,-0.66775
290,-0.6615800000000001
291,-0.65141
292,-0.64812
293,-0.63022
294,-0.62915
295,-0.60638
296,-0.60852
297,-0.58901
298,-0.5846899999999999
299,-0.56938
300,-0.56099
301,-0.5504899999999999
302,-0.5341100000000001
303,-0.5254
304,-0.50497
305,-0.5055
306,-0.48452
307,-0.48608999999999997
308,-0.46479
309,-0.45901000000000003
310,-0.44303000000000003
311,-0.43293999999999994
312,-0.42138000000000003
313,-0.40583
314,-0.40069
315,-0.38261999999999996
316,-0.38379
317,-0.36305
318,-0.36743000000000003
319,-0.35162
320,-0.35096
321,-0.33866
322,-0.33055999999999996
323,-0.32069000000000003
324,-0.30509000000000003
325,-0.29854
326,-0.27696
327,-0.27442
328,-0.24914
329,-0.24824000000000002
330,-0.22710999999999998
331,-0.2214
332,-0.20529
333,-0.19376
334,-0.18123
335,-0.16263
336,-0.15336
337,-0.12830999999999998
338,-0.12279000000000001
339,-0.094662
340,-0.090818
341,-0.066444
342,-0.056590999999999995
343,-0.036963
344,-0.023157
345,-0.010763
346,0.006796300000000001
347,0.014062
348,0.03727
349,0.039536
350,0.063095
351,0.060594
352,0.07646
353,0.076461
354,0.085174
355,0.0887
356,0.091259
357,0.1001
358,0.09799400000000001
359,0.11205999999999999
360,0.10527
361,0.12230999999999999
362,0.11646
363,0.13138
364,0.1326
365,0.1444
366,0.15397
367,0.16429000000000002
368,0.18241
369,0.18972
370,0.21488000000000002
371,0.2195
372,0.24781
373,0.25142
374,0.27355999999999997
375,0.28086
376,0.29714
377,0.30967
378,0.32009
379,0.33692
380,0.34129
381,0.36327
382,0.36322
383,0.3863
384,0.38518
385,0.40368000000000004
386,0.40952
387,0.42531
388,0.43855
389,0.45018
390,0.47011000000000003
391,0.47851000000000005
392,0.50566
393,0.5101100000000001
394,0.53751
395,0.5405399999999999
396,0.56195
397,0.56906
398,0.58336
399,0.59335
400,0.5997600000000001
401,0.61352
402,0.61395
403,0.63249
404,0.62745
405,0.64591
406,0.6413300000000001
407,0.65617
408,0.65842
409,0.66903
410,0.6772100000000001
411,0.68287
412,0.69708
413,0.69772
414,0.7163
415,0.71011
416,0.72645
417,0.71883
418,0.72878
419,0.7248899999999999
420,0.7278399999999999
421,0.72759
422,0.72318
423,0.72613
424,0.71415
425,0.7205199999999999
426,0.7023199999999999
427,0.70694
428,0.68774
429,0.68577
430,0.67098
431,0.66367
432,0.6543899999999999
433,0.64157
434,0.63761
435,0.61968
436,0.6213
437,0.5988899999999999
438,0.60044
439,0.58011
440,0.57773
441,0.56323
442,0.55585
443,0.54701
444,0.53469
445,0.53167
446,0.51412
447,0.5158699999999999
448,0.49251000000000006
449,0.4918
450,0.4682
451,0.46065
452,0.44018999999999997
453,0.42528
454,0.40828000000000003
455,0.3868
456,0.37496
457,0.34888
458,0.3433
459,0.31421
460,0.31006999999999996
461,0.28669
462,0.28153
463,0.26585
464,0.25661
465,0.24720999999999999
466,0.23490999999999998
467,0.23385
468,0.21774000000000002
469,0.21950999999999998
470,0.19399
471,0.19029000000000001
472,0.16596
473,0.15737
474,0.1364
475,0.11927
476,0.10091
477,0.07802100000000001
478,0.06559
479,0.037681
480,0.029548
481,-0.0034225
482,-0.01293
483,-0.041639999999999996
484,-0.05404400000000001
485,-0.075748
486,-0.090976
487,-0.10447999999999999
488,-0.12125
489,-0.12566
490,-0.14388
491,-0.14038
492,-0.16089
493,-0.158
494,-0.17414000000000002
495,-0.17511
496,-0.18578
497,-0.19169
498,-0.19714
499,-0.20849
500,-0.20945
501,-0.22664
502,-0.22330999999999998
503,-0.24547
504,-0.24575999999999998
505,-0.26587
506,-0.27229000000000003
507,-0.28808
508,-0.29952
509,-0.30927
510,-0.32395
511,-0.32544
512,-0.34136
513,-0.3347
514,-0.35214
515,-0.34496
516,-0.35383000000000003
517,-0.34700000000000003
518,-0.34786999999999996
519,-0.34426999999999996
520,-0.33791
521,-0.33775
522,-0.32582
523,-0.33053
524,-0.31190999999999997
525,-0.31714000000000003
526,-0.29886999999999997
527,-0.29905
528,-0.28553
529,-0.27791
530,-0.2638
531,-0.24458000000000002
532,-0.23087
533,-0.20309000000000002
534,-0.19063
535,-0.1541
536,-0.14329
537,-0.11035999999999999
538,-0.095549
539,-0.06758600000000001
540,-0.04747
541,-0.027019
542,-0.0077039000000000005
543,0.00036096
544,0.020392
545,0.023
546,0.04877
547,0.047876999999999996
548,0.070738
549,0.077471
550,0.096424
551,0.10617
552,0.11734000000000001
553,0.13476
554,0.14899
555,0.18044000000000002
556,0.19363
557,0.22785999999999998
558,0.23340999999999998
559,0.26075
560,0.27076
561,0.29298
562,0.30766
563,0.3231
564,0.3411
565,0.3496
566,0.37214
567,0.37601999999999997
568,0.4035
569,0.40447
570,0.42803
571,0.43456999999999996
572,0.45277
573,0.46343
574,0.47447
575,0.48875
576,0.49291999999999997
577,0.51076
578,0.5079199999999999
579,0.52759
580,0.51998
581,0.53451
582,0.5323899999999999
583,0.5424800000000001
584,0.54673
585,0.55261
586,0.5636899999999999
587,0.56558
588,0.5834600000000001
589,0.5822
590,0.6060800000000001
591,0.60443
592,0.6254
593,0.62956
594,0.64489
595,0.65417
596,0.66437
597,0.68
598,0.6853899999999999
599,0.70658
600,0.70743
601,0.7333
602,0.73339
603,0.75539
604,0.76076
605,0.77774
606,0.7902399999999999
607,0.8036
608,0.8222799999999999
609,0.8295799999999999
610,0.8535799999999999
611,0.85708
612,0.8852899999999999
613,0.88655
614,0.9085700000000001
615,0.9139799999999999
616,0.93
617,0.9406100000000001
618,0.95062
619,0.9668899999999999
620,0.97229
621,0.9952799999999999
622,0.99641
623,1.0222
624,1.0221
625,1.0446
626,1.0526
627,1.0721
628,1.0874
629,1.1023
630,1.1246
631,1.1355
632,1.1640000000000001
633,1.1695
634,1.2002
635,1.2048
636,1.2295
637,1.2378
638,1.2579
639,1.276
640,1.2922
641,1.3132
642,1.3227
643,1.3554
644,1.3644
645,1.3902
646,1.3854
647,1.4135
648,1.4471
649,1.4969999999999999
650,1.5262
651,1.5317
652,1.5391
653,1.5423
654,1.5715
655,1.5737
656,1.5969
657,1.5961
658,1.6211
659,1.6327
660,1.6519
661,1.6668
662,1.6806
663,1.7028
664,1.7099
665,1.7354
666,1.736
667,1.7625
668,1.7626
669,1.7830000000000001
670,1.7889
671,1.8044
672,1.8174
673,1.8281
674,1.8481
675,1.8544
676,1.8819
677,1.8851
678,1.9153
679,1.9203
680,1.9455
681,1.9556
682,1.9737
683,1.9885
684,1.9995
685,2.0186
686,2.0212
687,2.043
688,2.0381
689,2.0592
690,2.0553
691,2.0716
692,2.0736
693,2.0839
694,2.0919
695,2.0965
696,2.1104
697,2.1081
698,2.1256
699,2.1153
700,2.13
701,2.1186
702,2.1258
703,2.1178
704,2.1171
705,2.1141
706,2.1074
707,2.1106
708,2.0980000000000003
709,2.1066
710,2.088
711,2.0953
712,2.0778
713,2.0797
714,2.0681
715,2.0642
716,2.0584
717,2.0476
718,2.0462
719,2.0283
720,2.0319
721,2.0076
722,2.0078
723,1.9823
724,1.9752
725,1.955
726,1.9409999999999998
727,1.9241
728,1.9021
729,1.8927
730,1.8698
731,1.8701
732,1.8421
733,1.8388
734,1.8123
735,1.8057
736,1.787
737,1.7739
738,1.7586
739,1.7384
740,1.73
741,1.7048
742,1.6996
743,1.6640000000000001
744,1.6541
745,1.624
746,1.6155
747,1.5964
748,1.5824
749,1.5665
750,1.5454
751,1.5373
752,1.5136
753,1.5123
754,1.4833
755,1.4813
756,1.4599
757,1.4584
758,1.4461
759,1.4386
760,1.4309
761,1.419
762,1.421
763,1.4067
764,1.4141
765,1.3919
766,1.3942
767,1.3756
768,1.3746
769,1.3621
770,1.3522
771,1.3401
772,1.3205
773,1.3130000000000002
774,1.288
775,1.2847
776,1.2518
777,1.2431
778,1.2134
779,1.1994
780,1.1748
781,1.156
782,1.1414
783,1.1234
784,1.1193
785,1.0974
786,1.0988
787,1.0738
788,1.0754
789,1.0577
790,1.0558
791,1.0444
792,1.0378
793,1.0329
794,1.0208
795,1.0208
796,1.0022
797,1.0065
798,0.9822200000000001
799,0.9816600000000001
800,0.96005
801,0.9519299999999999
802,0.9339799999999999
803,0.9202600000000001
804,0.9088799999999999
805,0.88913
806,0.8801200000000001
807,0.8517
808,0.8481700000000001
809,0.81915
810,0.8155600000000001
811,0.79172
812,0.7804800000000001
813,0.76044
814,0.74515
815,0.7336199999999999
816,0.71506
817,0.71017
818,0.68762
819,0.68982
820,0.66423
821,0.66254
822,0.64166
823,0.63398
824,0.618
825,0.60518
826,0.59549
827,0.5776100000000001
828,0.57302
829,0.54953
830,0.54979
831,0.52198
832,0.5166
833,0.49266000000000004
834,0.4832
835,0.46924
836,0.46071999999999996
837,0.45686000000000004
838,0.44466000000000006
839,0.44687
840,0.43200000000000005
841,0.44276000000000004
842,0.42773999999999995
843,0.4352
844,0.42418999999999996
845,0.4249
846,0.4181
847,0.41291000000000005
848,0.41041000000000005
849,0.39755999999999997
850,0.39715
851,0.37639
852,0.37788
853,0.35163
854,0.34549
855,0.3211
856,0.30894
857,0.29100000000000004
858,0.27403
859,0.25886
860,0.23331999999999997
861,0.22382
862,0.19875
863,0.19919
864,0.17399
865,0.16910999999999998
866,0.14737999999999998
867,0.13752
868,0.12155999999999999
869,0.10642
870,0.09523999999999999
871,0.074905
872,0.069404
873,0.044373
874,0.041496
875,0.012761
876,0.0043815
877,-0.019912
878,-0.032969
879,-0.052239999999999995
880,-0.072241
881,-0.089016
882,-0.11494000000000001
883,-0.12412000000000001
884,-0.15234
885,-0.1607
886,-0.1969
887,-0.21297
888,-0.24033000000000002
889,-0.25254
890,-0.26809
891,-0.28388
892,-0.29545
893,-0.31669
894,-0.32250999999999996
895,-0.34781999999999996
896,-0.35059
897,-0.37640999999999997
898,-0.38228
899,-0.40309
900,-0.41397
901,-0.42923
902,-0.44436000000000003
903,-0.45469
904,-0.47526
905,-0.47995
906,-0.5042300000000001
907,-0.5078699999999999
908,-0.53561
909,-0.54337
910,-0.56409
911,-0.5773699999999999
912,-0.5989399999999999
913,-0.62193
914,-0.63563
915,-0.65681
916,-0.66474
917,-0.69722
918,-0.7081
919,-0.73663
920,-0.7425
921,-0.7625
922,-0.77542
923,-0.79092
924,-0.8045800000000001
925,-0.81109
926,-0.82945
927,-0.83141
928,-0.85241
929,-0.8509399999999999
930,-0.87072
931,-0.8686799999999999
932,-0.8757299999999999
933,-0.87436
934,-0.8769100000000001
935,-0.8755200000000001
936,-0.8585799999999999
937,-0.85434
938,-0.8455
939,-0.8604700000000001
940,-0.8314799999999999
941,-0.7934899999999999
942,-0.73059
943,-0.7038300000000001
944,-0.69631
945,-0.69609
946,-0.6865399999999999
947,-0.66299
948,-0.6560600000000001
949,-0.63558
950,-0.63345
951,-0.60575
952,-0.59993
953,-0.57609
954,-0.55883
955,-0.5297
956,-0.50413
957,-0.48544
958,-0.45818000000000003
959,-0.43859
960,-0.3976
961,-0.37897
962,-0.34044
963,-0.32450999999999997
964,-0.29222
965,-0.27154
966,-0.24226
967,-0.21204
968,-0.18424000000000001
969,-0.15106
970,-0.13664
971,-0.10854000000000001
972,-0.10509
973,-0.080151
974,-0.077873
975,-0.060826
976,-0.057103999999999995
977,-0.048118
978,-0.041451999999999996
979,-0.039185000000000005
980,-0.028013999999999997
981,-0.03034
982,-0.013066999999999999
983,-0.018244
984,0.00059388
985,-0.00050803
986,0.016413999999999998
987,0.023521
988,0.0389
989,0.055013
990,0.067495
991,0.089394
992,0.097861
993,0.12916
994,0.14035
995,0.17677
996,0.19122999999999998
997,0.22033000000000003
998,0.23761999999999997
999,0.26206999999999997
1000,0.28754
1001,0.30924
1002,0.34086
1003,0.35735
1004,0.39342
1005,0.40331999999999996
1006,0.43313
1007,0.43835
1008,0.45757
1009,0.46588999999999997
1010,0.48035
1011,0.49353
1012,0.49883999999999995
1013,0.51108
1014,0.5060600000000001
1015,0.52084
1016,0.51039
1017,0.52199
1018,0.51153
1019,0.51618
1020,0.51049
1021,0.51068
1022,0.51068
1023,0.5049100000000001
1024,0.5092399999999999
1025,0.49816000000000005
1026,0.50769
1027,0.4911
1028,0.49596
1029,0.47865
1030,0.47567
1031,0.46151000000000003
1032,0.45185
1033,0.44137
1034,0.4247
1035,0.41812
1036,0.39553
1037,0.39352
1038,0.36591999999999997
1039,0.36104
1040,0.33503
1041,0.32189
1042,0.29617
1043,0.27426999999999996
1044,0.25342
1045,0.22816999999999998
1046,0.21353000000000003
1047,0.18143
1048,0.16857
1049,0.12991
1050,0.11463
1051,0.079877
1052,0.058382
1053,0.025724
1054,-0.0023120999999999997
1055,-0.029175
1056,-0.063221
1057,-0.089099
1058,-0.1316
1059,-0.14899
1060,-0.18741
1061,-0.20322
1062,-0.24258000000000002
1063,-0.27111999999999997
1064,-0.30741999999999997
1065,-0.33621
1066,-0.36239
1067,-0.3955
1068,-0.41661000000000004
1069,-0.45236000000000004
1070,-0.46426999999999996
1071,-0.47558
1072,-0.50117
1073,-0.56663
1074,-0.5625100000000001
1075,-0.49101000000000006
1076,-0.47763
1077,-0.6137199999999999
1078,-0.67728
1079,-0.48335
1080,-0.31075
1081,-0.5200600000000001
1082,-0.84405
1083,-0.60269
1084,-0.024229
1085,-0.13021
1086,-1.04
1087,-1.1811
1088,0.30687
1089,1.3338
1090,-1.2709
1091,-7.4221
