time,value
0,-0.35969
1,-0.35969
2,-0.35969
3,-0.35969
4,-0.35969
5,-0.35969
6,-0.35969
7,-0.35969
8,-0.35969
9,-0.35969
10,-0.35969
11,-0.35969
12,-0.35969
13,-0.35969
14,-0.35969
15,-0.35969
16,-0.35969
17,-0.35969
18,-0.35969
19,-0.35969
20,-0.35969
21,-0.35969
22,-0.35969
23,-0.35969
24,-0.35969
25,-0.35969
26,-0.35969
27,-0.35969
28,-0.35969
29,-0.35969
30,-0.35969
31,-0.35969
32,-0.35969
33,1.7488
34,0.9228200000000001
35,1.3358
36,0.12941
37,-0.35969
38,-0.35969
39,-0.35969
40,-0.35969
41,-0.35969
42,-0.35969
43,-0.35969
44,-0.35969
45,-0.35969
46,-0.35969
47,-0.35969
48,-0.30534
49,5.3681
50,3.2379
51,1.4228
52,3.1074
53,1.2489
54,0.32504
55,-0.35969
56,-0.35969
57,-0.35969
58,-0.35969
59,-0.35969
60,-0.35969
61,-0.35969
62,-0.35969
63,-0.35969
64,0.49893999999999994
65,2.1619
66,4.0204
67,-0.35969
68,-0.35969
69,-0.35969
70,-0.35969
71,-0.35969
72,-0.35969
73,0.020718
74,1.2598
75,1.9119
76,-0.35969
77,-0.35969
78,-0.35969
79,-0.35969
80,-0.35969
81,-0.35969
82,-0.35969
83,-0.35969
84,-0.35969
85,-0.35969
86,-0.35969
87,-0.35969
88,-0.35969
89,-0.35969
90,-0.35969
91,-0.35969
92,-0.35969
93,-0.35969
94,-0.35969
95,-0.35969
