time,value
0,-0.8762700000000001
1,0.34731999999999996
2,0.50027
3,-0.8762700000000001
4,0.19437000000000001
5,0.8061699999999999
6,-0.8762700000000001
7,-0.26447
8,1.1121
9,-0.8762700000000001
10,-0.8762700000000001
11,1.7239
12,-0.8762700000000001
13,-0.8762700000000001
14,1.7239
15,-0.8762700000000001
16,-0.8762700000000001
17,1.7239
18,-0.8762700000000001
19,-0.8762700000000001
20,1.1121
21,-0.26447
22,-0.8762700000000001
23,0.65322
24,0.19437000000000001
25,-0.8762700000000001
26,0.19437000000000001
27,0.65322
28,-0.8762700000000001
29,0.65322
30,0.19437000000000001
31,-0.8762700000000001
32,0.65322
33,0.19437000000000001
34,-0.8762700000000001
35,0.50027
36,0.50027
37,-0.8762700000000001
38,0.8061699999999999
39,0.041424
40,-0.8762700000000001
41,0.8061699999999999
42,0.19437000000000001
43,-0.8762700000000001
44,0.65322
45,0.34731999999999996
46,-0.8762700000000001
47,0.19437000000000001
48,0.65322
49,-0.8762700000000001
50,-0.5703699999999999
51,1.5709
52,-0.8762700000000001
53,-0.8762700000000001
54,1.8768
55,-0.8762700000000001
56,-0.8762700000000001
57,1.7239
58,-0.8762700000000001
59,-0.8762700000000001
60,1.265
61,-0.41741999999999996
62,-0.8762700000000001
63,0.65322
64,0.19437000000000001
65,-0.8762700000000001
66,0.19437000000000001
67,0.8061699999999999
68,-0.8762700000000001
69,-0.8762700000000001
70,1.5709
71,-0.8762700000000001
72,-0.8762700000000001
73,2.4886
74,-0.8762700000000001
75,-0.8762700000000001
76,2.0298
77,-0.41741999999999996
78,-0.8762700000000001
79,0.19437000000000001
80,1.5709
81,-0.8762700000000001
82,-0.8762700000000001
83,2.6416
84,-0.8762700000000001
85,-0.8762700000000001
86,1.4180000000000001
87,0.041424
88,-0.8762700000000001
89,0.34731999999999996
90,1.265
91,-0.8762700000000001
92,-0.8762700000000001
93,2.1827
94,-0.8762700000000001
95,-0.8762700000000001
