time,value
0,-1.8758
1,-1.5774
2,-1.2168
3,-0.82201
4,-0.43255
5,-0.089283
6,0.16953
7,0.33975
8,0.43151999999999996
9,0.47553999999999996
10,0.5041100000000001
11,0.53683
12,0.59068
13,0.64827
14,0.6926399999999999
15,0.69967
16,0.66152
17,0.59335
18,0.5081
19,0.42611000000000004
20,0.34994000000000003
21,0.28288
22,0.22485
23,0.17346
24,0.1367
25,0.12183
26,0.14795999999999998
27,0.22760999999999998
28,0.37145
29,0.57957
30,0.8423299999999999
31,1.1424
32,1.4389
33,1.6939
34,1.8629
35,1.9282
36,1.896
37,1.787
38,1.6353
39,1.4569999999999999
40,1.2704
41,1.0782
42,0.8826700000000001
43,0.68816
44,0.48811000000000004
45,0.28994000000000003
46,0.089994
47,-0.10493
48,-0.28723000000000004
49,-0.45343999999999995
50,-0.5927899999999999
51,-0.71102
52,-0.80555
53,-0.8839899999999999
54,-0.95189
55,-1.0083
56,-1.0627
57,-1.1049
58,-1.1436
59,-1.1752
60,-1.2009
61,-1.2237
62,-1.2274
63,-1.2166
64,-1.1765
65,-1.1131
66,-1.0332
67,-0.9379
68,-0.8434200000000001
69,-0.7419899999999999
70,-0.64336
71,-0.54594
72,-0.44872
73,-0.35499
74,-0.25426
75,-0.15336
76,-0.04729
77,0.060029
78,0.16869
79,0.28575
80,0.40925
81,0.5463899999999999
82,0.69388
83,0.8535799999999999
84,1.0216
85,1.1852
86,1.3335
87,1.4505
88,1.5384
89,1.5999
90,1.64
91,1.6585
92,1.6445
93,1.5952
94,1.504
95,1.3807
96,1.2352
97,1.0783
98,0.92245
99,0.76331
100,0.6081300000000001
101,0.45083
102,0.29551
103,0.14752
104,0.0052439999999999995
105,-0.12012
106,-0.23626
107,-0.33332
108,-0.4131
109,-0.47551000000000004
110,-0.5152
111,-0.5443
112,-0.55269
113,-0.55178
114,-0.5364
115,-0.5040399999999999
116,-0.45566999999999996
117,-0.37817
118,-0.28604
119,-0.17331
120,-0.049726
121,0.087037
122,0.24688000000000002
123,0.42146999999999996
124,0.61423
125,0.80414
126,0.98372
127,1.1434
128,1.2727
129,1.3736
130,1.4382
131,1.4832
132,1.5204
133,1.5658
134,1.6279
135,1.6968
136,1.7638
137,1.8096
138,1.8297
139,1.8233
140,1.7963
141,1.7593
142,1.7126
143,1.6635
144,1.6074
145,1.5435
146,1.4651
147,1.3626
148,1.236
149,1.0832
150,0.9207
151,0.7538600000000001
152,0.5876600000000001
153,0.42258999999999997
154,0.25373
155,0.094532
156,-0.058237
157,-0.20085999999999998
158,-0.34084000000000003
159,-0.48002
160,-0.6045699999999999
161,-0.71312
162,-0.79279
163,-0.85562
164,-0.9073200000000001
165,-0.95115
166,-0.9946
167,-1.0290000000000001
168,-1.0664
169,-1.103
170,-1.14
171,-1.1707
172,-1.1782
173,-1.1665
174,-1.1294
175,-1.0824
176,-1.0319
177,-0.98029
178,-0.9335100000000001
179,-0.8836700000000001
180,-0.83635
181,-0.78413
182,-0.7265
183,-0.66635
184,-0.60095
185,-0.53943
186,-0.47193
187,-0.39957
188,-0.32163
189,-0.23836999999999997
190,-0.15961
191,-0.081735
192,-0.015252000000000002
193,0.038745999999999996
194,0.07492
195,0.089406
196,0.091012
197,0.078355
198,0.06267
199,0.044610000000000004
200,0.031032999999999998
201,0.031798
202,0.051311
203,0.098219
204,0.16482
205,0.24935
206,0.34412
207,0.44625
208,0.55712
209,0.66959
210,0.78061
211,0.8750600000000001
212,0.9476
213,0.99605
214,1.0242
215,1.0392
216,1.0331
217,1.0032
218,0.9391
219,0.8449200000000001
220,0.73215
221,0.60942
222,0.48754
223,0.35991999999999996
224,0.22851999999999997
225,0.09347000000000001
226,-0.038243
227,-0.15747
228,-0.26993
229,-0.37514000000000003
230,-0.48326
231,-0.59092
232,-0.6928300000000001
233,-0.7849
234,-0.86034
235,-0.92595
236,-0.97539
237,-1.0092
238,-1.0218
239,-1.0134
240,-0.9978100000000001
241,-0.98146
242,-0.9783700000000001
243,-0.98375
244,-0.99536
245,-1.0094
246,-1.0229
247,-1.0406
248,-1.0548
249,-1.0663
250,-1.0743
251,-1.0854
252,-1.1075
253,-1.1385
254,-1.1784
255,-1.2206
256,-1.265
257,-1.3109
258,-1.36
259,-1.4219
260,-1.5026
261,-1.6068
262,-1.7252
263,-1.8455
264,-1.9606
265,-2.0662
266,-2.1594
267,-2.2262
268,-2.2587
269,-2.2607
