time,value
0,-0.21925
1,-0.21925
2,-0.21925
3,-0.21925
4,-0.21925
5,-0.21925
6,-0.21925
7,-0.21925
8,-0.21925
9,-0.21925
10,-0.21925
11,-0.21925
12,-0.21925
13,-0.21925
14,-0.21925
15,-0.21925
16,-0.21925
17,-0.21925
18,-0.21925
19,-0.21925
20,-0.21925
21,-0.21925
22,-0.21925
23,-0.21925
24,-0.21925
25,-0.21925
26,-0.21925
27,-0.21925
28,-0.21925
29,-0.21925
30,-0.21925
31,-0.21925
32,-0.21925
33,-0.21925
34,-0.21925
35,-0.21925
36,-0.21925
37,1.796
38,8.5652
39,0.4525
40,0.57307
41,0.71086
42,0.021889
43,2.6572
44,2.3299
45,0.55584
46,0.57307
47,0.40081999999999995
48,-0.21925
49,-0.21925
50,-0.21925
51,-0.21925
52,-0.21925
53,-0.21925
54,-0.21925
55,-0.21925
56,-0.21925
57,-0.21925
58,-0.21925
59,-0.21925
60,-0.21925
61,-0.21925
62,-0.21925
63,-0.21925
64,-0.21925
65,-0.21925
66,-0.21925
67,-0.21925
68,-0.21925
69,-0.21925
70,-0.21925
71,-0.21925
72,-0.21925
73,-0.21925
74,-0.21925
75,-0.21925
76,-0.21925
77,-0.21925
78,-0.21925
79,-0.21925
80,-0.21925
81,-0.21925
82,-0.21925
83,-0.21925
84,-0.21925
85,-0.21925
86,-0.21925
87,-0.21925
88,-0.21925
89,-0.21925
90,-0.21925
91,-0.21925
92,-0.21925
93,-0.21925
94,-0.21925
95,-0.21925
