time,value
0,-0.17379
1,-0.17379
2,-0.17379
3,-0.17379
4,-0.17379
5,-0.17379
6,-0.17379
7,-0.17379
8,-0.17379
9,-0.17379
10,-0.17379
11,-0.17379
12,-0.17379
13,-0.17379
14,-0.17379
15,-0.17379
16,-0.17379
17,-0.17379
18,-0.17379
19,-0.17379
20,-0.17379
21,-0.17379
22,-0.17379
23,-0.17379
24,-0.17379
25,-0.17379
26,-0.17379
27,-0.17379
28,-0.17379
29,-0.17379
30,6.9865
31,-0.17379
32,-0.17379
33,-0.17379
34,-0.17379
35,-0.17379
36,-0.17379
37,-0.17379
38,-0.17379
39,-0.17379
40,-0.17379
41,-0.17379
42,-0.17379
43,-0.17379
44,-0.17379
45,-0.17379
46,-0.17379
47,-0.17379
48,-0.17379
49,-0.17379
50,-0.17379
51,-0.17379
52,-0.17379
53,-0.17379
54,-0.17379
55,-0.17379
56,-0.17379
57,-0.17379
58,-0.17379
59,-0.17379
60,-0.17379
61,-0.17379
62,-0.17379
63,-0.17379
64,-0.17379
65,3.7887
66,-0.17379
67,-0.17379
68,-0.17379
69,-0.17379
70,-0.17379
71,-0.17379
72,-0.17379
73,-0.17379
74,-0.17379
75,-0.17379
76,-0.17379
77,-0.17379
78,-0.17379
79,-0.17379
80,-0.17379
81,-0.17379
82,-0.17379
83,-0.17379
84,-0.17379
85,5.3876
86,-0.17379
87,-0.17379
88,-0.17379
89,-0.17379
90,-0.17379
91,-0.17379
92,-0.17379
93,-0.17379
94,-0.17379
95,-0.17379
