time,value
0,0.56458
1,0.55042
2,0.71204
3,0.8101
4,0.70367
5,0.80909
6,0.66243
7,0.67937
8,0.75497
9,0.6691600000000001
10,0.74412
11,0.69604
12,0.63762
13,0.59119
14,0.53887
15,0.5293800000000001
16,0.50546
17,0.55965
18,0.48122
19,0.47153999999999996
20,0.47178000000000003
21,0.48248
22,0.44093999999999994
23,0.46108000000000005
24,0.4293
25,0.4626
26,0.46936000000000005
27,0.50467
28,0.45533999999999997
29,0.43515
30,0.39435
31,0.30251
32,0.18023
33,0.014203
34,-0.77513
35,-1.0254
36,-1.0554
37,-2.04
38,-2.0895
39,-2.1483
40,-2.32
41,-2.9064
42,-2.9505
43,-2.8145
44,-2.8502
45,-2.6796
46,-2.6058
47,-2.4504
48,-2.1394
49,-1.8945
50,-1.5633
51,-1.3158
52,-1.0777
53,-0.6269899999999999
54,-0.59412
55,-0.37836
56,-0.25111
57,-0.14957
58,-0.30439
59,-0.17313
60,-0.081232
61,-0.27915
62,-0.38843
63,0.47783000000000003
64,-0.42808
65,-0.58027
66,-0.33816
67,-0.19689
68,-0.56107
69,-0.81822
70,-0.5082
71,-0.20894000000000001
72,-0.46476000000000006
73,-0.60165
74,-0.51852
75,-0.47767
76,-0.44051999999999997
77,-0.45853999999999995
78,-0.60468
79,-0.6370600000000001
80,-0.43713
81,-0.47403
82,-0.52356
83,-0.53117
84,-0.44356
85,-0.42093
86,-0.54974
87,-0.5263899999999999
88,-0.49459
89,-0.31772
90,-0.46331999999999995
91,-0.5429999999999999
92,-0.47143
93,-0.2954
94,-0.40549
95,-0.5007
96,-0.40557
97,-0.34033
98,-0.35283000000000003
99,-0.32824000000000003
100,-0.30425
101,-0.31898000000000004
102,-0.42728
103,-0.36887
104,-0.34833000000000003
105,-0.34324
106,-0.35720999999999997
107,-0.34034000000000003
108,-0.18984
109,-0.23600000000000002
110,-0.31790999999999997
111,-0.40154
112,-0.37183
113,-0.35858
114,-0.32871
115,-0.31190999999999997
116,-0.17920999999999998
117,-0.14163
118,-0.090616
119,-0.22471
120,-0.13664
121,-0.15031
122,-0.018453
123,0.49161000000000005
124,0.6738
125,0.7017899999999999
126,0.58992
127,0.19577
128,-0.02364
129,0.067858
130,-0.28585
131,-1.2229999999999999
132,-1.3147
133,-0.789
134,-1.5195
135,-3.0958
136,-2.065
137,-1.8779
138,-2.3346
139,-2.5789
140,-2.6919999999999997
141,-2.6784
142,-3.0633
143,-3.0476
144,-2.8828
145,-2.4863
146,-2.3969
147,-2.2333
148,-1.8913
149,-1.7564
150,-1.5408
151,-1.3697
152,-1.1946
153,-1.2606
154,-1.2193
155,-1.0185
156,-0.73422
157,-0.51325
158,-0.29966
159,-0.23538
160,-0.21748
161,-0.22353
162,-0.21524000000000001
163,-0.20828000000000002
164,-0.17512
165,-0.047564999999999996
166,-0.046258999999999995
167,-0.018264
168,0.0397
169,0.10529000000000001
170,0.023772
171,0.58419
172,0.44546
173,0.37261
174,0.40576999999999996
175,0.33516
176,0.28573000000000004
177,0.34981
178,0.34581
179,0.32074
180,0.37035999999999997
181,0.32402
182,0.3309
183,0.4694
184,0.47242
185,0.44787
186,0.55796
187,0.63695
188,0.5471699999999999
189,0.60572
190,0.49473
191,0.48432
192,0.51122
193,0.67215
194,0.66494
195,0.7415
196,0.8242
197,0.78805
198,0.77679
199,0.5937600000000001
200,0.5864
201,0.63337
202,0.56888
203,0.5959899999999999
204,0.80897
205,0.76708
206,0.7021
207,0.7659699999999999
208,0.76998
209,0.78098
210,0.7358600000000001
211,0.7434
212,0.93509
213,0.7925800000000001
214,0.7904100000000001
215,0.70182
216,0.7369899999999999
217,0.8759100000000001
218,0.7326600000000001
219,0.75665
220,0.83383
221,0.68921
222,0.59297
223,0.54182
224,0.66875
225,0.76169
226,0.8915799999999999
227,0.8145600000000001
228,0.82616
229,0.73738
230,0.6672100000000001
231,0.79446
232,0.69431
233,0.76602
234,0.8336399999999999
235,0.84546
236,0.70926
237,0.6896100000000001
238,0.7445
239,0.8279799999999999
240,0.6682100000000001
241,0.7004199999999999
242,0.6914899999999999
243,0.84875
244,0.8849
245,0.8368200000000001
246,0.81355
247,0.72173
248,0.7247399999999999
249,0.85245
250,0.86039
251,0.81555
252,0.9871700000000001
253,0.98477
254,0.8563200000000001
255,0.72735
256,0.89689
257,0.8768299999999999
258,0.9900899999999999
259,0.86579
260,0.87456
261,0.74647
262,0.7702600000000001
263,0.77063
264,0.86877
265,0.85865
266,0.8448200000000001
267,0.8553700000000001
268,0.86
269,0.88475
270,0.97809
271,0.9876
272,0.8707600000000001
273,0.8903
274,0.87646
275,1.0001
276,0.8907
277,0.8918799999999999
278,0.8695799999999999
279,0.85314
280,0.8629899999999999
281,0.8633
282,0.8632700000000001
283,0.9820700000000001
284,0.87608
285,0.9901700000000001
286,0.98213
287,0.86955
288,0.8542299999999999
289,0.85835
290,0.83354
291,0.8334799999999999
292,0.8442
293,0.8518399999999999
294,0.85619
295,0.7299800000000001
296,0.8525200000000001
297,0.84795
298,0.9638899999999999
299,0.96044
