time,value
0,-0.24608000000000002
1,-0.24608000000000002
2,-0.24608000000000002
3,-0.24608000000000002
4,-0.24608000000000002
5,-0.24608000000000002
6,-0.24608000000000002
7,-0.24608000000000002
8,-0.24608000000000002
9,-0.24608000000000002
10,-0.24608000000000002
11,-0.24608000000000002
12,-0.24608000000000002
13,-0.24608000000000002
14,-0.24608000000000002
15,-0.24608000000000002
16,-0.24608000000000002
17,-0.24608000000000002
18,-0.24608000000000002
19,-0.24608000000000002
20,-0.24608000000000002
21,-0.24608000000000002
22,-0.24608000000000002
23,-0.24608000000000002
24,-0.24608000000000002
25,-0.24608000000000002
26,-0.24608000000000002
27,-0.24608000000000002
28,-0.24608000000000002
29,-0.24608000000000002
30,-0.24608000000000002
31,-0.24608000000000002
32,3.553
33,-0.24608000000000002
34,-0.24608000000000002
35,-0.24608000000000002
36,5.1687
37,-0.24608000000000002
38,-0.24608000000000002
39,-0.24608000000000002
40,-0.24608000000000002
41,-0.24608000000000002
42,-0.24608000000000002
43,-0.24608000000000002
44,-0.24608000000000002
45,3.2910000000000004
46,-0.24608000000000002
47,-0.24608000000000002
48,-0.24608000000000002
49,-0.24608000000000002
50,-0.24608000000000002
51,-0.24608000000000002
52,-0.24608000000000002
53,-0.24608000000000002
54,-0.24608000000000002
55,-0.24608000000000002
56,-0.24608000000000002
57,-0.24608000000000002
58,-0.24608000000000002
59,-0.24608000000000002
60,2.2430000000000003
61,-0.24608000000000002
62,-0.24608000000000002
63,-0.24608000000000002
64,-0.24608000000000002
65,-0.24608000000000002
66,-0.24608000000000002
67,-0.24608000000000002
68,-0.24608000000000002
69,-0.24608000000000002
70,-0.24608000000000002
71,2.6796
72,-0.24608000000000002
73,-0.24608000000000002
74,-0.24608000000000002
75,-0.24608000000000002
76,-0.24608000000000002
77,-0.24608000000000002
78,-0.24608000000000002
79,-0.24608000000000002
80,5.2124
81,-0.24608000000000002
82,-0.24608000000000002
83,-0.24608000000000002
84,-0.24608000000000002
85,-0.24608000000000002
86,-0.24608000000000002
87,-0.24608000000000002
88,-0.24608000000000002
89,-0.24608000000000002
90,-0.24608000000000002
91,-0.24608000000000002
92,-0.24608000000000002
93,-0.24608000000000002
94,-0.24608000000000002
95,-0.24608000000000002
