time,value
0,1.2185
1,-0.55813
2,-0.93216
3,-0.93216
4,-0.93216
5,-0.93216
6,0.84449
7,1.2185
8,1.3119999999999998
9,-0.55813
10,-0.93216
11,-0.93216
12,-0.93216
13,-0.93216
14,0.0029221
15,1.3119999999999998
16,1.3119999999999998
17,0.47046000000000004
18,-0.93216
19,-0.93216
20,-0.93216
21,-0.93216
22,-0.93216
23,0.56397
24,1.3119999999999998
25,1.2185
26,0.56397
27,-0.93216
28,-0.93216
29,-0.93216
30,-0.55813
31,1.4055
32,1.2185
33,1.3119999999999998
34,-0.090586
35,-0.93216
36,-0.93216
37,-0.46462
38,1.4055
39,1.3119999999999998
40,0.84449
41,-0.93216
42,-0.93216
43,-0.93216
44,0.18994
45,1.3119999999999998
46,1.3119999999999998
47,-0.37111
48,-0.93216
49,-0.93216
50,-0.93216
51,-0.46462
52,1.3119999999999998
53,1.4055
54,1.125
55,-0.93216
56,-0.93216
57,-0.93216
58,-0.7451399999999999
59,1.4055
60,1.3119999999999998
61,0.7509899999999999
62,-0.93216
63,-0.93216
64,-0.93216
65,0.7509899999999999
66,1.3119999999999998
67,1.3119999999999998
68,0.09643
69,-0.93216
70,-0.93216
71,-0.2776
72,1.4055
73,1.3119999999999998
74,-0.7451399999999999
75,-0.93216
76,-0.93216
77,-0.93216
78,1.3119999999999998
79,1.4055
80,1.3119999999999998
81,-0.93216
82,-0.93216
83,-0.93216
84,0.7509899999999999
85,1.4055
86,0.56397
87,-0.93216
88,-0.93216
89,-0.93216
90,0.18994
91,1.4055
92,1.3119999999999998
93,0.09643
94,-0.93216
95,-0.93216
