time,value
0,1.9702
1,1.9556
2,1.9345
3,1.9196
4,1.8943
5,1.8535
6,1.8133
7,1.7734
8,1.7335
9,1.6937
10,1.6542
11,1.6149
12,1.5757
13,1.5366
14,1.4975
15,1.4585
16,1.4194
17,1.3806
18,1.3419
19,1.3032
20,1.2644
21,1.2256
22,1.1869
23,1.1482
24,1.1099
25,1.0716
26,1.033
27,0.9948799999999999
28,0.9559799999999999
29,0.9179999999999999
30,0.88028
31,0.84234
32,0.8037
33,0.76582
34,0.7280800000000001
35,0.68958
36,0.652
37,0.61454
38,0.5772
39,0.53996
40,0.50184
41,0.46483
42,0.42685
43,0.39007
44,0.35226
45,0.31496
46,0.2781
47,0.24055
48,0.20442000000000002
49,0.16708
50,0.12984
51,0.092695
52,0.05611699999999999
53,0.020072
54,-0.016498
55,-0.053147
56,-0.089667
57,-0.12583
58,-0.16105999999999998
59,-0.19652999999999998
60,-0.23396
61,-0.27007
62,-0.30565
63,-0.34105
64,-0.37821
65,-0.4134
66,-0.45043999999999995
67,-0.4851
68,-0.52108
69,-0.55606
70,-0.59246
71,-0.6261800000000001
72,-0.66218
73,-0.69762
74,-0.7308899999999999
75,-0.76622
76,-0.79843
77,-0.83319
78,-0.86767
79,-0.89556
80,-0.9257
81,-0.93991
82,-0.9521
83,-0.9547200000000001
84,-0.9515399999999999
85,-0.94204
86,-0.9308799999999999
87,-0.9182600000000001
88,-0.9061100000000001
89,-0.88859
90,-0.87329
91,-0.8564200000000001
92,-0.8417
93,-0.82296
94,-0.79985
95,-0.77703
96,-0.75302
97,-0.7278
98,-0.70927
99,-0.6894600000000001
100,-0.67028
101,-0.6553899999999999
102,-0.64198
103,-0.64546
104,-0.65383
105,-0.6563
106,-0.70194
107,-0.7441399999999999
108,-0.7882
109,-0.83052
110,-0.87245
111,-0.90266
112,-0.93742
113,-0.9728100000000001
114,-1.0127
115,-1.0458
116,-1.084
117,-1.1147
118,-1.1317
119,-1.1549
120,-1.1747
121,-1.1984
122,-1.2288
123,-1.249
124,-1.2521
125,-1.2586
126,-1.2683
127,-1.2913
128,-1.3087
129,-1.3086
130,-1.3231
131,-1.3497
132,-1.3752
133,-1.4078
134,-1.4531
135,-1.4845
136,-1.5234
137,-1.5185
138,-1.4903
139,-1.4664
140,-1.4423
141,-1.4108
142,-1.3821
143,-1.3491
144,-1.3187
145,-1.2875
146,-1.2557
147,-1.2232
148,-1.1902
149,-1.1567
150,-1.1227
151,-1.0883
152,-1.0535
153,-1.0184
154,-0.98295
155,-0.9472200000000001
156,-0.9110799999999999
157,-0.8740899999999999
158,-0.8368700000000001
159,-0.80124
160,-0.7650100000000001
161,-0.7279800000000001
162,-0.69079
163,-0.6532600000000001
164,-0.6146699999999999
165,-0.57711
166,-0.53943
167,-0.50047
168,-0.46261
169,-0.42356000000000005
170,-0.38448000000000004
171,-0.34642
172,-0.30624
173,-0.26607
174,-0.22589
175,-0.18507
176,-0.14451
177,-0.10355
178,-0.062059
179,-0.020817
180,0.020435
181,0.061707000000000005
182,0.10297
183,0.1444
184,0.18634
185,0.22714
186,0.26931
187,0.3111
188,0.35317
189,0.39698
190,0.43961000000000006
191,0.48181
192,0.52393
193,0.5663699999999999
194,0.6091
195,0.64918
196,0.6912
197,0.7269800000000001
198,0.76183
199,0.80411
200,0.84659
201,0.88846
202,0.9299299999999999
203,0.97139
204,1.0129
205,1.0529
206,1.0943
207,1.1344
208,1.1733
209,1.213
210,1.2502
211,1.2889
212,1.329
213,1.3663
214,1.4024
215,1.4276
216,1.4137
217,1.4061
218,1.3869999999999998
219,1.3657
220,1.344
221,1.3116
222,1.2801
223,1.2481
224,1.2106
225,1.178
226,1.1556
227,1.128
228,1.0884
229,1.0492
230,1.0227
231,1.0132
232,0.99597
233,0.99319
234,0.99772
235,1.0103
236,1.0287
237,1.063
238,1.0974
239,1.1205
240,1.1497
241,1.1796
242,1.2099
243,1.2349
244,1.2718
245,1.2908
246,1.3014
247,1.3123
248,1.3177
249,1.3056
250,1.2816
251,1.2456
252,1.2054
253,1.1663
254,1.1261
255,1.0859999999999999
256,1.0458
257,1.0056
258,0.9660799999999999
259,0.9252799999999999
260,0.8840600000000001
261,0.8428399999999999
262,0.8016300000000001
263,0.76021
264,0.71924
265,0.67772
266,0.636
267,0.59431
268,0.55269
269,0.51103
270,0.47048
271,0.4294
272,0.38833
273,0.34726999999999997
274,0.30623
275,0.26521
276,0.22376
277,0.18312
278,0.14147
279,0.10111
280,0.060369000000000006
281,0.019464
282,-0.022755
283,-0.062274
284,-0.10174
285,-0.14119
286,-0.18135
287,-0.22150999999999998
288,-0.26095999999999997
289,-0.30112
290,-0.34267
291,-0.38144
292,-0.41896000000000005
293,-0.44775
294,-0.43553000000000003
295,-0.40908
296,-0.37418
297,-0.33276999999999995
298,-0.3026
299,-0.26466
300,-0.22466
301,-0.18136
302,-0.16771
303,-0.1541
304,-0.17490999999999998
305,-0.2026
306,-0.23501999999999998
307,-0.26733
308,-0.30164
309,-0.33815
310,-0.37451
311,-0.41323999999999994
312,-0.45148
313,-0.49048
314,-0.53158
315,-0.57526
316,-0.6137199999999999
317,-0.65384
318,-0.69308
319,-0.7340300000000001
320,-0.77315
321,-0.81834
322,-0.85683
323,-0.89492
324,-0.9385399999999999
325,-0.9791200000000001
326,-1.0224
327,-1.0612
328,-1.0961
329,-1.1396
330,-1.171
331,-1.2017
332,-1.2421
333,-1.2783
334,-1.3031
335,-1.3291
336,-1.3421
337,-1.3479
338,-1.3672
339,-1.3668
340,-1.3729
341,-1.3629
342,-1.3298
343,-1.3063
344,-1.2984
345,-1.291
346,-1.3035
347,-1.3119
348,-1.3244
349,-1.3351
350,-1.3457
351,-1.3742
352,-1.3809
353,-1.3963
354,-1.4166
355,-1.4405
356,-1.4623
357,-1.4649
358,-1.4629
359,-1.4599
360,-1.4438
361,-1.4303
362,-1.4157
363,-1.3994
364,-1.3761
365,-1.3478
366,-1.3155
367,-1.2847
368,-1.2593
369,-1.2282
370,-1.2035
371,-1.1731
372,-1.1383
373,-1.1105
374,-1.0753
375,-1.0387
376,-1.006
377,-0.9728100000000001
378,-0.9432299999999999
379,-0.91309
380,-0.88245
381,-0.8513299999999999
382,-0.81976
383,-0.78423
384,-0.75049
385,-0.71587
386,-0.6796
387,-0.64313
388,-0.60973
389,-0.57605
390,-0.5421
391,-0.50484
392,-0.47046000000000004
393,-0.43585
394,-0.40103
395,-0.36601
396,-0.3308
397,-0.29541
398,-0.25986
399,-0.22676
400,-0.19084
401,-0.15479
402,-0.1186
403,-0.084708
404,-0.048229
405,-0.011637
406,0.022772999999999998
407,0.057375
408,0.094347
409,0.12712
410,0.16224
411,0.19827999999999998
412,0.23458
413,0.27051
414,0.30619
415,0.342
416,0.37795
417,0.41401000000000004
418,0.44919
419,0.48455
420,0.51956
421,0.55615
422,0.5928399999999999
423,0.62962
424,0.6664899999999999
425,0.70495
426,0.7419600000000001
427,0.78051
428,0.81909
429,0.8562799999999999
430,0.89355
431,0.93089
432,0.9676799999999999
433,1.0058
434,1.0433
435,1.0809
436,1.1198
437,1.1587
438,1.1953
439,1.2331
440,1.2721
441,1.3094
442,1.3447
443,1.3817
444,1.4198
445,1.459
446,1.4962
447,1.5335
448,1.5728
449,1.6111
450,1.6489
451,1.686
452,1.7238
453,1.7615
454,1.7993
455,1.8376
456,1.8758
457,1.8993
458,1.9298
459,1.9671
460,1.9712
461,1.9739
462,1.9709
