time,value
0,1.6495
1,1.6353
2,1.6022
3,1.5703
4,1.5328
5,1.4926
6,1.4523
7,1.4118
8,1.3711
9,1.3308
10,1.2911
11,1.2544
12,1.2135
13,1.1757
14,1.1362
15,1.0965
16,1.0567
17,1.0168
18,0.97729
19,0.9378
20,0.8981399999999999
21,0.85857
22,0.81871
23,0.7793
24,0.7400899999999999
25,0.70075
26,0.66163
27,0.62274
28,0.5836899999999999
29,0.54394
30,0.50522
31,0.46713999999999994
32,0.42868
33,0.39002
34,0.35218
35,0.31478
36,0.27776
37,0.24031
38,0.20304
39,0.16597
40,0.12924000000000002
41,0.093076
42,0.057163
43,0.02071
44,-0.013843000000000001
45,-0.048036
46,-0.082764
47,-0.11603
48,-0.14927
49,-0.18494000000000002
50,-0.21696999999999997
51,-0.24949000000000002
52,-0.28261
53,-0.31584
54,-0.34868000000000005
55,-0.38113
56,-0.41405
57,-0.44653000000000004
58,-0.47995
59,-0.51164
60,-0.5424100000000001
61,-0.57508
62,-0.60593
63,-0.63667
64,-0.6676
65,-0.69686
66,-0.72721
67,-0.75702
68,-0.78273
69,-0.8094600000000001
70,-0.8352200000000001
71,-0.85683
72,-0.8755299999999999
73,-0.8861399999999999
74,-0.8879799999999999
75,-0.88535
76,-0.89256
77,-0.89336
78,-0.88756
79,-0.88366
80,-0.8780899999999999
81,-0.8683299999999999
82,-0.85755
83,-0.85014
84,-0.8444299999999999
85,-0.8379700000000001
86,-0.8328399999999999
87,-0.82355
88,-0.8229200000000001
89,-0.8145399999999999
90,-0.80104
91,-0.79183
92,-0.80256
93,-0.8463
94,-0.88792
95,-0.92996
96,-0.9723799999999999
97,-1.0151
98,-1.0581
99,-1.1008
100,-1.1436
101,-1.1858
102,-1.2288
103,-1.271
104,-1.3129
105,-1.3546
106,-1.3961
107,-1.4378
108,-1.479
109,-1.5163
110,-1.517
111,-1.5199
112,-1.5149
113,-1.5049
114,-1.4883
115,-1.4763
116,-1.4632
117,-1.4508
118,-1.4332
119,-1.4156
120,-1.3956
121,-1.3765
122,-1.3537
123,-1.3296
124,-1.3081
125,-1.2823
126,-1.2556
127,-1.2283
128,-1.2009999999999998
129,-1.1727
130,-1.1436
131,-1.1138
132,-1.084
133,-1.052
134,-1.0205
135,-0.99008
136,-0.95654
137,-0.92161
138,-0.8864799999999999
139,-0.8510200000000001
140,-0.8136800000000001
141,-0.77432
142,-0.73338
143,-0.69191
144,-0.6492
145,-0.60764
146,-0.5664600000000001
147,-0.5256
148,-0.48622
149,-0.44933
150,-0.42041999999999996
151,-0.39526999999999995
152,-0.40352
153,-0.43198000000000003
154,-0.42894
155,-0.39355999999999997
156,-0.35588000000000003
157,-0.31873
158,-0.28081999999999996
159,-0.24275
160,-0.20398
161,-0.16552999999999998
162,-0.12644
163,-0.087257
164,-0.047155
165,-0.0075282
166,0.034048
167,0.07672799999999999
168,0.12054000000000001
169,0.1638
170,0.20743000000000003
171,0.25093000000000004
172,0.29486999999999997
173,0.33859
174,0.38215
175,0.42613
176,0.4695
177,0.51352
178,0.55755
179,0.60272
180,0.64766
181,0.69204
182,0.7370899999999999
183,0.78149
184,0.8266100000000001
185,0.8719100000000001
186,0.91838
187,0.9636100000000001
188,1.0083
189,1.0526
190,1.0957
191,1.1404
192,1.1847
193,1.2283
194,1.2704
195,1.3132
196,1.3552
197,1.3980000000000001
198,1.4369
199,1.445
200,1.406
201,1.3991
202,1.4011
203,1.3924
204,1.3765
205,1.3659
206,1.3575
207,1.3364
208,1.3112
209,1.2843
210,1.2689
211,1.2484
212,1.2314
213,1.2213
214,1.2181
215,1.2198
216,1.2198
217,1.2179
218,1.2065
219,1.1854
220,1.17
221,1.158
222,1.1522
223,1.1555
224,1.157
225,1.1636
226,1.1853
227,1.217
228,1.2208
229,1.2225
230,1.2118
231,1.1989
232,1.1923
233,1.1919
234,1.1948
235,1.2067
236,1.2219
237,1.2432
238,1.2622
239,1.2813
240,1.2954
241,1.3043
242,1.3004
243,1.2621
244,1.2175
245,1.177
246,1.136
247,1.0904
248,1.044
249,0.99841
250,0.9523299999999999
251,0.90736
252,0.86185
253,0.81657
254,0.77161
255,0.7260800000000001
256,0.6816399999999999
257,0.63807
258,0.59412
259,0.54877
260,0.50326
261,0.45848999999999995
262,0.41401000000000004
263,0.37006999999999995
264,0.32532
265,0.28071999999999997
266,0.23705
267,0.19345
268,0.14961
269,0.10622000000000001
270,0.062921
271,0.019597
272,-0.023863
273,-0.06478300000000001
274,-0.10761
275,-0.14928
276,-0.19084
277,-0.23239
278,-0.27373000000000003
279,-0.31486
280,-0.35575999999999997
281,-0.39687
282,-0.43773999999999996
283,-0.4787
284,-0.50951
285,-0.52493
286,-0.54096
287,-0.56102
288,-0.58833
289,-0.6148399999999999
290,-0.64255
291,-0.66589
292,-0.69511
293,-0.72135
294,-0.75195
295,-0.77446
296,-0.78898
297,-0.79838
298,-0.7932899999999999
299,-0.7820699999999999
300,-0.78969
301,-0.8029
302,-0.82315
303,-0.8597899999999999
304,-0.8976299999999999
305,-0.93189
306,-0.96834
307,-1.0047
308,-1.0411
309,-1.0819
310,-1.1229
311,-1.1659
312,-1.2072
313,-1.2501
314,-1.2909
315,-1.3342
316,-1.3757
317,-1.4024
318,-1.4148
319,-1.4214
320,-1.4388
321,-1.452
322,-1.4657
323,-1.4799
324,-1.4923
325,-1.5026
326,-1.508
327,-1.5104
328,-1.5090000000000001
329,-1.5021
330,-1.5076
331,-1.5066
332,-1.4857
333,-1.4445
334,-1.4032
335,-1.3613
336,-1.3267
337,-1.3137
338,-1.2895
339,-1.2668
340,-1.2602
341,-1.2607
342,-1.2628
343,-1.2662
344,-1.2611
345,-1.255
346,-1.2501
347,-1.2511
348,-1.2467
349,-1.2418
350,-1.2386
351,-1.2348
352,-1.2222
353,-1.2125
354,-1.2081
355,-1.2131
356,-1.1811
357,-1.158
358,-1.137
359,-1.1169
360,-1.0809
361,-1.048
362,-1.0147
363,-0.98336
364,-0.9530200000000001
365,-0.91991
366,-0.8874
367,-0.8534299999999999
368,-0.8172699999999999
369,-0.7891199999999999
370,-0.75871
371,-0.72592
372,-0.69643
373,-0.66642
374,-0.6359199999999999
375,-0.60148
376,-0.5667399999999999
377,-0.5301
378,-0.49477
379,-0.46305
380,-0.42825
381,-0.39374000000000003
382,-0.3605
383,-0.32545
384,-0.2872
385,-0.25174
386,-0.21606
387,-0.18018
388,-0.14376
389,-0.11994
390,-0.090389
391,-0.060229
392,-0.029293
393,0.0031899999999999997
394,0.039146
395,0.076454
396,0.11076
397,0.14436
398,0.18011
399,0.21619000000000002
400,0.25232
401,0.28681999999999996
402,0.32243
403,0.35914
404,0.39519
405,0.43041
406,0.46588
407,0.50237
408,0.53819
409,0.5733699999999999
410,0.60932
411,0.64388
412,0.6802600000000001
413,0.71706
414,0.75349
415,0.79042
416,0.82673
417,0.8624700000000001
418,0.8982
419,0.9339299999999999
420,0.97101
421,1.0096
422,1.0482
423,1.0863
424,1.1237
425,1.161
426,1.1986
427,1.2365
428,1.2739
429,1.3117
430,1.35
431,1.3883
432,1.4267
433,1.4653
434,1.5053
435,1.5343
436,1.5716
437,1.6037
438,1.6362
439,1.6101
440,1.5787
441,1.5388
442,1.4994
443,1.4597
444,1.4197
445,1.38
446,1.3397
447,1.2994
448,1.2593
449,1.2184
450,1.2027
451,1.2184
452,1.2572
453,1.2937
454,1.3332
455,1.37
456,1.4099
457,1.4508
458,1.4918
459,1.5328
460,1.574
461,1.6095
462,1.6437
