time,value
0,-0.17432
1,-0.17432
2,-0.17432
3,-0.17432
4,-0.17432
5,-0.17432
6,-0.17432
7,-0.17432
8,-0.17432
9,-0.17432
10,-0.17432
11,-0.17432
12,-0.17432
13,-0.17432
14,-0.17432
15,-0.17432
16,-0.17432
17,-0.17432
18,-0.17432
19,-0.17432
20,-0.17432
21,-0.17432
22,-0.17432
23,-0.17432
24,-0.17432
25,-0.17432
26,-0.17432
27,-0.17432
28,-0.17432
29,-0.17432
30,-0.17432
31,-0.17432
32,-0.17432
33,-0.17432
34,-0.17432
35,-0.17432
36,-0.17432
37,-0.17432
38,-0.17432
39,-0.17432
40,-0.17432
41,-0.17432
42,-0.17432
43,-0.17432
44,-0.17432
45,-0.17432
46,-0.17432
47,-0.17432
48,-0.17432
49,-0.17432
50,-0.17432
51,-0.17432
52,-0.17432
53,-0.17432
54,-0.17432
55,-0.17432
56,-0.17432
57,-0.17432
58,-0.17432
59,-0.17432
60,-0.17432
61,-0.17432
62,-0.17432
63,-0.17432
64,-0.17432
65,-0.17432
66,-0.17432
67,-0.17432
68,-0.17432
69,-0.17432
70,-0.17432
71,-0.17432
72,-0.17432
73,-0.17432
74,-0.17432
75,-0.17432
76,-0.17432
77,-0.17432
78,-0.17432
79,-0.17432
80,3.8549
81,6.9887
82,5.3369
83,-0.14344
84,-0.17432
85,-0.17432
86,-0.17432
87,-0.17432
88,-0.17432
89,-0.17432
90,-0.17432
91,-0.17432
92,-0.17432
93,-0.17432
94,-0.17432
95,-0.17432
