time,value
0,-0.19923
1,-0.19923
2,-0.19923
3,-0.19923
4,-0.19923
5,-0.19923
6,-0.19923
7,-0.19923
8,-0.19923
9,-0.19923
10,-0.19923
11,-0.19923
12,-0.19923
13,-0.19923
14,-0.19923
15,-0.19923
16,-0.19923
17,-0.19923
18,-0.19923
19,-0.19923
20,-0.19923
21,-0.19923
22,-0.19923
23,-0.19923
24,-0.19923
25,-0.19923
26,-0.19923
27,-0.19923
28,-0.19923
29,-0.19923
30,-0.19923
31,-0.19923
32,-0.19923
33,-0.19923
34,-0.19923
35,-0.19923
36,-0.19923
37,-0.19923
38,-0.19923
39,-0.19923
40,-0.19923
41,-0.19923
42,-0.19923
43,-0.19923
44,-0.19923
45,-0.19923
46,-0.19923
47,-0.19923
48,-0.19923
49,-0.19923
50,-0.19923
51,-0.19923
52,-0.19923
53,-0.19923
54,-0.19923
55,-0.19923
56,-0.19923
57,-0.19923
58,-0.19923
59,-0.19923
60,-0.19923
61,-0.19923
62,-0.19923
63,-0.19923
64,-0.19923
65,-0.19923
66,-0.19923
67,-0.19923
68,-0.19923
69,-0.19923
70,-0.19923
71,-0.19923
72,-0.19923
73,-0.19923
74,-0.19923
75,-0.19923
76,-0.19923
77,-0.19923
78,-0.19923
79,-0.19923
80,-0.19923
81,-0.19923
82,-0.19923
83,-0.19923
84,0.043151
85,3.1721
86,4.2738
87,0.19739
88,0.19739
89,2.2246
90,7.6231
91,-0.19923
92,-0.19923
93,-0.19923
94,-0.19923
95,-0.19923
