time,value
0,2.7428
1,2.6917
2,2.5522
3,2.4033
4,2.2521
5,2.1463
6,1.9948
7,1.8908
8,1.7404
9,1.6348
10,1.4834
11,1.4167
12,1.3079
13,1.1702
14,1.0206
15,0.9151100000000001
16,0.8205899999999999
17,0.71015
18,0.56053
19,0.41275
20,0.26499
21,0.11764000000000001
22,-0.029366000000000003
23,-0.17559
24,-0.32137
25,-0.46652
26,-0.5815600000000001
27,-0.71314
28,-0.8546299999999999
29,-0.95095
30,-1.0345
31,-0.9962
32,-0.9908600000000001
33,-0.97514
34,-0.92035
35,-0.8521200000000001
36,-0.77617
37,-0.70885
38,-0.68212
39,-0.6110899999999999
40,-0.5424800000000001
41,-0.47873000000000004
42,-0.45095
43,-0.4251
44,-0.40652
45,-0.33757
46,-0.2792
47,-0.33564
48,-0.35134
49,-0.34338
50,-0.24386
51,-0.14754
52,-0.13626
53,-0.12884
54,-0.06217999999999999
55,-0.022642
56,0.035052999999999994
57,0.043726999999999995
58,-0.010093000000000001
59,-0.11064
60,-0.12903
61,-0.083284
62,-0.038189999999999995
63,0.015678
64,0.053095
65,0.041178
66,0.00015575
67,-0.014473
68,-0.0046139
69,-0.0014215
70,0.021476
71,0.010206999999999999
72,-0.039945999999999995
73,-0.1559
74,-0.26195999999999997
75,-0.37285
76,-0.49588000000000004
77,-0.57643
78,-0.7156399999999999
79,-0.79892
80,-0.86315
81,-0.85851
82,-0.8454299999999999
83,-0.82019
84,-0.7844899999999999
85,-0.74678
86,-0.71343
87,-0.6611100000000001
88,-0.58218
89,-0.526
90,-0.50583
91,-0.5251100000000001
92,-0.49323
93,-0.46271999999999996
94,-0.40801
95,-0.36482
96,-0.3338
97,-0.38125
98,-0.34234000000000003
99,-0.28915
100,-0.24911
101,-0.24824000000000002
102,-0.35741
103,-0.45881000000000005
104,-0.5501199999999999
105,-0.5476800000000001
106,-0.4849
107,-0.42006000000000004
108,-0.36125999999999997
109,-0.3076
110,-0.24841
111,-0.19833
112,-0.15766
113,-0.097249
114,-0.047534
115,-0.055796000000000005
116,-0.045375
117,0.027066000000000003
118,0.098455
119,0.2033
120,0.27021
121,0.36149000000000003
122,0.45676000000000005
123,0.54952
124,0.62717
125,0.7079300000000001
126,0.73116
127,0.67748
128,0.5727399999999999
129,0.45785
130,0.35497
131,0.24871999999999997
132,0.13280999999999998
133,0.031137
134,-0.075353
135,-0.19004000000000001
136,-0.28708
137,-0.39943
138,-0.50198
139,-0.6070800000000001
140,-0.61136
141,-0.69652
142,-0.8181
143,-0.91771
144,-1.0239
145,-1.1395
146,-1.2473
147,-1.3437
148,-1.4577
149,-1.5633
150,-1.6403
151,-1.6879
152,-1.7483
153,-1.8228
154,-1.8966
155,-1.94
156,-1.891
157,-1.8312
158,-1.7914
159,-1.7158
160,-1.6793
161,-1.5887
162,-1.5161
163,-1.459
164,-1.3865
165,-1.3069
166,-1.2117
167,-1.1141
168,-1.0482
169,-1.0785
170,-1.1614
171,-1.2458
172,-1.1726
173,-1.0589
174,-0.9643200000000001
175,-0.8342700000000001
176,-0.74725
177,-0.64382
178,-0.55365
179,-0.46093
180,-0.5310600000000001
181,-0.44511000000000006
182,-0.31575
183,-0.23196999999999998
184,-0.12082999999999999
185,0.023176
186,0.12294000000000001
187,0.22588000000000003
188,0.2472
189,0.20454
190,0.18895
191,0.23505
192,0.26881
193,0.36725
194,0.49415
195,0.49141999999999997
196,0.56893
197,0.66171
198,0.72277
199,0.82709
200,0.9771200000000001
201,1.0809
202,1.2306
203,1.318
204,1.3223
205,1.2881
206,1.3831
207,1.4917
208,1.5979
209,1.7043
210,1.8107
211,1.9184
212,1.9961
213,2.0947
214,2.2005
215,2.299
216,2.3847
217,2.4678
218,2.5582
219,2.5696
220,2.6264
221,2.5807
222,2.4691
223,2.3585
224,2.2142
225,2.0687
226,1.9259
227,1.8633
228,1.7849
229,1.724
230,1.6046
231,1.5053
232,1.4038
233,1.3321
234,1.276
235,1.2670000000000001
236,1.1994
237,1.1292
238,1.0204
239,0.9111
240,0.8588399999999999
241,0.75436
242,0.67165
243,0.58936
244,0.48
245,0.49287
246,0.5788800000000001
247,0.65282
248,0.7481399999999999
249,0.79274
250,0.80001
251,0.75213
252,0.65609
253,0.58111
254,0.46443999999999996
255,0.40841
256,0.3304
257,0.24750999999999998
258,0.19751
259,0.12334
260,0.017149
261,-0.10380999999999999
262,-0.22849
263,-0.32783
264,-0.44026000000000004
265,-0.55315
266,-0.64854
267,-0.6482899999999999
268,-0.60122
269,-0.65312
270,-0.75759
271,-0.84944
272,-0.9377700000000001
273,-1.0547
274,-1.1354
275,-1.2292
276,-1.3138
277,-1.3938
278,-1.4737
279,-1.4708
280,-1.3596
281,-1.2570000000000001
282,-1.1456
283,-1.0451
284,-0.9084200000000001
285,-0.77127
286,-0.7048
287,-0.66079
288,-0.55233
289,-0.40325
290,-0.2963
291,-0.16375
292,-0.043996
293,0.057316
294,0.16793
295,0.28768
296,0.40074
297,0.48077
298,0.50174
299,0.46133
300,0.40638
301,0.33152
302,0.24670999999999998
303,0.18334
304,0.20279
305,0.1421
306,0.07913300000000001
307,0.022113
308,-0.042575999999999996
309,-0.10518
310,-0.066024
311,-0.073518
312,-0.13479000000000002
313,-0.18452000000000002
314,-0.22628
315,-0.27809
316,-0.31740999999999997
317,-0.34957
318,-0.3441
319,-0.24433000000000002
320,-0.16702999999999998
321,-0.099993
322,-0.14422000000000001
323,-0.1614
324,-0.20699
325,-0.25976
326,-0.30882
327,-0.27971999999999997
328,-0.32511999999999996
329,-0.41355
330,-0.48457
331,-0.56472
332,-0.63831
333,-0.55535
334,-0.58794
335,-0.63757
336,-0.69066
337,-0.7521100000000001
338,-0.8134600000000001
339,-0.8478600000000001
340,-0.88379
341,-0.9212
342,-0.94234
343,-0.9446399999999999
344,-0.8376600000000001
345,-0.7294
346,-0.63003
347,-0.50284
348,-0.40909
349,-0.29813
350,-0.27243
351,-0.28731
352,-0.28263
353,-0.281
354,-0.23503000000000002
355,-0.19967000000000001
356,-0.21381
357,-0.23244
358,-0.19134
359,-0.079958
360,-0.058106
361,-0.0992
362,-0.11874000000000001
363,-0.16128
364,-0.15386
365,-0.19535999999999998
366,-0.24086999999999997
367,-0.28171
368,-0.31621
369,-0.30324
370,-0.20893
371,-0.19315
372,-0.21921
373,-0.24241999999999997
374,-0.31322
375,-0.36751
376,-0.43605
377,-0.49972
378,-0.5292
379,-0.5643600000000001
380,-0.6029800000000001
381,-0.6763399999999999
382,-0.70773
383,-0.7390800000000001
384,-0.7925300000000001
385,-0.8367700000000001
386,-0.8654700000000001
387,-0.9174200000000001
388,-0.8550200000000001
389,-0.90005
390,-0.9296700000000001
391,-0.9708200000000001
392,-1.0182
393,-0.99456
394,-1.0605
395,-1.0490000000000002
396,-1.1205
397,-0.9899700000000001
398,-0.8813700000000001
399,-0.73287
400,-0.6306
401,-0.48331999999999997
402,-0.33491
403,-0.18656
404,-0.037721
405,0.11120999999999999
406,0.26016999999999996
407,0.40895
408,0.55857
409,0.6454
410,0.74612
411,0.86865
412,1.0179
413,1.1671
414,1.3168
415,1.4213
416,1.5707
417,1.7204
418,1.8395
419,1.9746
420,2.1242
421,2.249
422,2.3788
423,2.5279
424,2.6735
425,2.7347
426,2.765
