time,value
0,-1.0219
1,0.45742
2,-1.0455
3,-1.9012
4,-1.1598
5,-0.6229100000000001
6,-1.0476
7,-1.4134
8,-1.1453
9,-0.90279
10,-1.0615
11,-1.2269
12,-1.1332
13,-1.0434
14,-1.1066
15,-1.175
16,-1.1517
17,-1.1287
18,-1.1451
19,-1.1581
20,-1.1520000000000001
21,-1.1566
22,-1.1529
23,-1.1582
24,-1.155
25,-1.1588
26,-1.1559
27,-1.1584
28,-1.1554
29,-1.1568
30,-1.1547
31,-1.1555
32,-1.1536
33,-1.1525
34,-1.1498
35,-1.146
36,-1.1418
37,-1.1352
38,-1.13
39,-1.1214
40,-1.1158
41,-1.1051
42,-1.099
43,-1.0871
44,-1.0818
45,-1.0694
46,-1.0651
47,-1.0527
48,-1.0506
49,-1.0393
50,-1.0393
51,-1.0279
52,-1.0287
53,-1.0171
54,-1.0192
55,-1.0072
56,-1.0101
57,-0.998
58,-1.0029
59,-0.99172
60,-0.9988
61,-0.98846
62,-0.9978600000000001
63,-0.98846
64,-0.9996799999999999
65,-0.99036
66,-1.0025
67,-0.9924299999999999
68,-1.0048
69,-0.9941
70,-1.0062
71,-0.9950200000000001
72,-1.0048
73,-0.9930700000000001
74,-1.0022
75,-0.9918100000000001
76,-1.0009
77,-0.9917799999999999
78,-1.0012
79,-0.99355
80,-1.0024
81,-0.99536
82,-1.0038
83,-0.99765
84,-1.0053
85,-1.0
86,-1.0079
87,-1.0044
88,-1.0118
89,-1.0082
90,-1.0138
91,-1.0101
92,-1.0143
93,-1.011
94,-1.0144
95,-1.0113
96,-1.0129
97,-1.0094
98,-1.0097
99,-1.0068
100,-1.0056
101,-1.0018
102,-0.99813
103,-0.9937799999999999
104,-0.98829
105,-0.98321
106,-0.97557
107,-0.97041
108,-0.9619700000000001
109,-0.95815
110,-0.95016
111,-0.9485
112,-0.9411299999999999
113,-0.94132
114,-0.9343299999999999
115,-0.93639
116,-0.92979
117,-0.93345
118,-0.9269700000000001
119,-0.93216
120,-0.92555
121,-0.9314100000000001
122,-0.92366
123,-0.9299299999999999
124,-0.92174
125,-0.92935
126,-0.92111
127,-0.92975
128,-0.92132
129,-0.93225
130,-0.9259200000000001
131,-0.9397399999999999
132,-0.93335
133,-0.94881
134,-0.94575
135,-0.96701
136,-0.96425
137,-0.98129
138,-0.97341
139,-0.9893700000000001
140,-0.9845799999999999
141,-1.0006
142,-0.9937600000000001
143,-1.0056
144,-0.99692
145,-1.0061
146,-0.99603
147,-1.0028
148,-0.99197
149,-0.99656
150,-0.98506
151,-0.9881700000000001
152,-0.9770399999999999
153,-0.9791799999999999
154,-0.9687100000000001
155,-0.9706600000000001
156,-0.9617
157,-0.9636899999999999
158,-0.9565299999999999
159,-0.9596299999999999
160,-0.9553
161,-0.95904
162,-0.9557100000000001
163,-0.95862
164,-0.9563299999999999
165,-0.95925
166,-0.95837
167,-0.9607
168,-0.95985
169,-0.96014
170,-0.95883
171,-0.95799
172,-0.95773
173,-0.9568200000000001
174,-0.9580700000000001
175,-0.9568399999999999
176,-0.95788
177,-0.95337
178,-0.9525399999999999
179,-0.9466899999999999
180,-0.9479
181,-0.94255
182,-0.94442
183,-0.93805
184,-0.94153
185,-0.93614
186,-0.9414399999999999
187,-0.93511
188,-0.9402299999999999
189,-0.93255
190,-0.9385899999999999
191,-0.9310799999999999
192,-0.9387200000000001
193,-0.9308200000000001
194,-0.9392799999999999
195,-0.93106
196,-0.94053
197,-0.93109
198,-0.9402299999999999
199,-0.9294399999999999
200,-0.9380700000000001
201,-0.92274
202,-0.9252600000000001
203,-0.9025200000000001
204,-0.9015299999999999
205,-0.87584
206,-0.8718
207,-0.8413700000000001
208,-0.83105
209,-0.79691
210,-0.78265
211,-0.74615
212,-0.72834
213,-0.6905100000000001
214,-0.67178
215,-0.63666
216,-0.62112
217,-0.59165
218,-0.58087
219,-0.55783
220,-0.55142
221,-0.53242
222,-0.52699
223,-0.5104
224,-0.50685
225,-0.49323999999999996
226,-0.48963
227,-0.47667
228,-0.4731
229,-0.46243
230,-0.45992
231,-0.45305
232,-0.45553
233,-0.45623
234,-0.46258999999999995
235,-0.46521999999999997
236,-0.47057
237,-0.47408999999999996
238,-0.47911000000000004
239,-0.48325
240,-0.48699
241,-0.49128
242,-0.49343000000000004
243,-0.49718999999999997
244,-0.49713999999999997
245,-0.50037
246,-0.49851
247,-0.50165
248,-0.49854
249,-0.5021399999999999
250,-0.49793999999999994
251,-0.50183
252,-0.49663
253,-0.50142
254,-0.49633999999999995
255,-0.5038
256,-0.50125
257,-0.5133
258,-0.51312
259,-0.5271
260,-0.52566
261,-0.53894
262,-0.53565
263,-0.54966
264,-0.54719
265,-0.5639
266,-0.56209
267,-0.58024
268,-0.57938
269,-0.60139
270,-0.6036600000000001
271,-0.6290899999999999
272,-0.63213
273,-0.65887
274,-0.6623600000000001
275,-0.68933
276,-0.6935100000000001
277,-0.71978
278,-0.72431
279,-0.7493
280,-0.7539600000000001
281,-0.7783100000000001
282,-0.7841100000000001
283,-0.8081
284,-0.81439
285,-0.8376100000000001
286,-0.8455
287,-0.87005
288,-0.88081
289,-0.90625
290,-0.91899
291,-0.9451799999999999
292,-0.95996
293,-0.98593
294,-1.0011
295,-1.0258
296,-1.0408
297,-1.0634
298,-1.0775
299,-1.0979999999999999
300,-1.1113
301,-1.1284
302,-1.1391
303,-1.1525
304,-1.1615
305,-1.1714
306,-1.1782
307,-1.1847
308,-1.19
309,-1.1934
310,-1.1966
311,-1.1966
312,-1.1984
313,-1.1962
314,-1.1974
315,-1.1932
316,-1.1939
317,-1.1876
318,-1.1884
319,-1.1821
320,-1.1849
321,-1.179
322,-1.1833
323,-1.1777
324,-1.1838
325,-1.1777
326,-1.1837
327,-1.176
328,-1.1829
329,-1.1755
330,-1.1833
331,-1.1743
332,-1.1815
333,-1.1713
334,-1.1795
335,-1.1692
336,-1.1781
337,-1.1665
338,-1.1745
339,-1.1598
340,-1.166
341,-1.1494
342,-1.1565
343,-1.1407
344,-1.1465
345,-1.1302
346,-1.1347
347,-1.1181
348,-1.1197
349,-1.1005
350,-1.099
351,-1.0797
352,-1.0773
353,-1.0578
354,-1.0536
355,-1.0349
356,-1.0316
357,-1.0146
358,-1.0099
359,-0.99303
360,-0.98864
361,-0.9731700000000001
362,-0.9668700000000001
363,-0.95131
364,-0.9471299999999999
365,-0.9374899999999999
366,-0.9355100000000001
367,-0.9254700000000001
368,-0.9206799999999999
369,-0.9113399999999999
370,-0.9073100000000001
371,-0.89948
372,-0.8943200000000001
373,-0.8868299999999999
374,-0.88139
375,-0.8753700000000001
376,-0.86959
377,-0.86465
378,-0.8592
379,-0.8567100000000001
380,-0.85205
381,-0.8512
382,-0.84667
383,-0.84791
384,-0.84421
385,-0.84735
386,-0.84354
387,-0.84754
388,-0.8424
389,-0.8457100000000001
390,-0.8381700000000001
391,-0.8410200000000001
392,-0.8322299999999999
393,-0.8353
394,-0.8247700000000001
395,-0.8271
396,-0.81465
397,-0.81702
398,-0.8035399999999999
399,-0.80625
400,-0.79177
401,-0.79486
402,-0.77917
403,-0.78204
404,-0.76507
405,-0.76907
406,-0.75313
407,-0.75973
408,-0.74455
409,-0.7528699999999999
410,-0.73912
411,-0.75031
412,-0.73969
413,-0.75189
414,-0.74315
415,-0.75642
416,-0.75062
417,-0.76554
418,-0.7624
419,-0.7786
420,-0.7780699999999999
421,-0.79511
422,-0.79601
423,-0.81275
424,-0.81506
425,-0.83237
426,-0.83657
427,-0.8539200000000001
428,-0.85934
429,-0.8765799999999999
430,-0.88308
431,-0.89935
432,-0.9059299999999999
433,-0.9209
434,-0.9274
435,-0.9397399999999999
436,-0.9438
437,-0.9518200000000001
438,-0.9535399999999999
439,-0.9580700000000001
440,-0.9574
441,-0.9575100000000001
442,-0.9542299999999999
443,-0.95109
444,-0.9464799999999999
445,-0.94011
446,-0.9335899999999999
447,-0.9244399999999999
448,-0.91755
449,-0.90646
450,-0.8982399999999999
451,-0.8838299999999999
452,-0.8744799999999999
453,-0.85814
454,-0.84775
455,-0.8273299999999999
456,-0.81402
457,-0.79068
458,-0.77745
459,-0.75249
460,-0.7381
461,-0.7105600000000001
462,-0.69619
463,-0.66794
464,-0.65446
465,-0.62595
466,-0.61374
467,-0.58415
468,-0.57094
469,-0.53865
470,-0.52473
471,-0.49048
472,-0.47562
473,-0.43918999999999997
474,-0.42418999999999996
475,-0.38661999999999996
476,-0.37188000000000004
477,-0.33396
478,-0.3215
479,-0.28595
480,-0.27502
481,-0.24115
482,-0.23071999999999998
483,-0.19917
484,-0.18997999999999998
485,-0.16108
486,-0.15335
487,-0.12728
488,-0.12043
489,-0.09568099999999999
490,-0.088186
491,-0.064728
492,-0.058692999999999995
493,-0.039536
494,-0.035526
495,-0.016632
496,-0.0086295
497,0.012158
498,0.020669999999999997
499,0.039221
500,0.048770999999999995
501,0.068691
502,0.08064299999999999
503,0.099909
504,0.113
505,0.13380999999999998
506,0.1516
507,0.17537
508,0.1965
509,0.22074000000000002
510,0.24286999999999997
511,0.26552
512,0.28714
513,0.30791
514,0.32979
515,0.34899
516,0.37024
517,0.38737
518,0.40951
519,0.42668999999999996
520,0.45003000000000004
521,0.46647
522,0.4915
523,0.5080100000000001
524,0.53294
525,0.54643
526,0.57131
527,0.58496
528,0.611
529,0.62229
530,0.6473399999999999
531,0.6572899999999999
532,0.68302
533,0.69199
534,0.7196199999999999
535,0.73065
536,0.76161
537,0.77299
538,0.8059999999999999
539,0.8193299999999999
540,0.85569
541,0.86926
542,0.90622
543,0.91804
544,0.95257
545,0.9591200000000001
546,0.99069
547,0.9925299999999999
548,1.0151
549,1.0072
550,1.0252
551,1.0236
552,1.0464
553,1.0422
554,1.0547
555,1.0438
556,1.0519
557,1.038
558,1.0406
559,1.0238
560,1.0218
561,0.99669
562,0.97998
563,0.94553
564,0.92825
565,0.8996799999999999
566,0.88049
567,0.84545
568,0.82521
569,0.8033
570,0.79295
571,0.7653399999999999
572,0.73687
573,0.7008
574,0.67445
575,0.6414
576,0.6087
577,0.5708
578,0.5381199999999999
579,0.50434
580,0.47118999999999994
581,0.43728
582,0.4049
583,0.37511
584,0.34346
585,0.31445
586,0.28384000000000004
587,0.26056
588,0.23315999999999998
589,0.21158000000000002
590,0.18545999999999999
591,0.17146
592,0.14982
593,0.13532
594,0.1137
595,0.11166
596,0.097477
597,0.080417
598,0.036743
599,0.015691
600,0.00089394
601,0.012878
602,0.0037696999999999995
603,0.0077389
604,-0.0026016999999999998
605,0.010766
606,0.0041713
607,0.017981999999999998
608,0.014553
609,0.037768
610,0.040006
611,0.06666799999999999
612,0.07145900000000001
613,0.10354000000000001
614,0.1108
615,0.14395
616,0.15188
617,0.18639
618,0.19738
619,0.23271
620,0.24533000000000002
621,0.281
622,0.29613
623,0.33285
624,0.35023000000000004
625,0.3881
626,0.409
627,0.44859
628,0.47135
629,0.51049
630,0.53527
631,0.57596
632,0.60349
633,0.64386
634,0.6715399999999999
635,0.70994
636,0.7364
637,0.77047
638,0.79328
639,0.82271
640,0.8436
641,0.86923
642,0.88675
643,0.9076299999999999
644,0.92399
645,0.9432799999999999
646,0.95867
647,0.97414
648,0.9878899999999999
649,1.0012
650,1.0142
651,1.0241
652,1.0348
653,1.0399
654,1.0457
655,1.0432
656,1.044
657,1.0363
658,1.0336
659,1.02
660,1.0146
661,1.0003
662,0.9990700000000001
663,0.9883299999999999
664,0.99206
665,0.9843200000000001
666,0.9926299999999999
667,0.98715
668,0.9984299999999999
669,0.9942200000000001
670,1.0094
671,1.0076
672,1.025
673,1.0221
674,1.041
675,1.0403
676,1.0637
677,1.0643
678,1.0897
679,1.0915
680,1.1207
681,1.1248
682,1.1567
683,1.1613
684,1.1938
685,1.1993
686,1.2309
687,1.2366
688,1.2670000000000001
689,1.2734
690,1.3027
691,1.3088
692,1.3366
693,1.3444
694,1.374
695,1.3852
696,1.4145
697,1.4255
698,1.453
699,1.4647
700,1.4912
701,1.5027
702,1.5271
703,1.5385
704,1.5606
705,1.5699
706,1.5871
707,1.594
708,1.6083
709,1.6143
710,1.626
711,1.6315
712,1.6418
713,1.6489
714,1.6603
715,1.6711
716,1.6837
717,1.6959
718,1.7087
719,1.7251
720,1.7402
721,1.7572
722,1.7673
723,1.781
724,1.7891
725,1.8046
726,1.8118
727,1.827
728,1.8326
729,1.8492
730,1.8544
731,1.8716
732,1.8754
733,1.8940000000000001
734,1.8987
735,1.9202
736,1.9257
737,1.9499
738,1.9568
739,1.9829
740,1.9872
741,2.0104
742,2.0109
743,2.0349
744,2.0357
745,2.06
746,2.0580000000000003
747,2.0827
748,2.0826
749,2.1118
750,2.1125
751,2.1412
752,2.1394
753,2.1659
754,2.1629
755,2.1854
756,2.1798
757,2.1988
758,2.1926
759,2.2102
760,2.2045
761,2.2209
762,2.2159999999999997
763,2.2319999999999998
764,2.2274
765,2.2391
766,2.2312
767,2.242
768,2.2399
769,2.254
770,2.2509
771,2.2581
772,2.2515
773,2.2566
774,2.2489
775,2.2479
776,2.2341
777,2.2258
778,2.2061
779,2.1877
780,2.1584
781,2.131
782,2.0988
783,2.0684
784,2.0338
785,1.9988
786,1.9626
787,1.9244
788,1.8859
789,1.8454
790,1.8107
791,1.7728
792,1.7377
793,1.6964
794,1.6682
795,1.6418
796,1.63
797,1.6104
798,1.6019999999999999
799,1.5837
800,1.5772
801,1.5553
802,1.5447
803,1.5177
804,1.5041
805,1.4706
806,1.4508
807,1.4108
808,1.3892
809,1.3478
810,1.3268
811,1.2843
812,1.265
813,1.225
814,1.2119
815,1.1761
816,1.1665
817,1.1321
818,1.1275
819,1.0997
820,1.1035
821,1.0814
822,1.0861
823,1.0646
824,1.0697
825,1.052
826,1.0596
827,1.0451
828,1.0543
829,1.0441
830,1.0555
831,1.0475
832,1.0590000000000002
833,1.0537
834,1.0661
835,1.0613
836,1.0706
837,1.0644
838,1.0715
839,1.0648
840,1.0682
841,1.0583
842,1.0576
843,1.0471
844,1.0452
845,1.0345
846,1.0293
847,1.0161
848,1.0068
849,0.99182
850,0.97925
851,0.9618399999999999
852,0.94686
853,0.9317799999999999
854,0.9148
855,0.8927299999999999
856,0.86939
857,0.8508100000000001
858,0.82371
859,0.78947
860,0.75478
861,0.73766
862,0.7056
863,0.65709
864,0.61216
865,0.61733
866,0.60363
867,0.5065
868,0.32116999999999996
869,0.18746
870,0.14954
871,0.17495
872,0.15548
873,0.12165
874,0.08783300000000001
875,0.089287
876,0.06455599999999999
877,0.044885
878,0.012343000000000002
879,0.0083257
880,-0.018496000000000002
881,-0.029805
882,-0.060812
883,-0.065942
884,-0.09421900000000001
885,-0.099402
886,-0.12749000000000002
887,-0.12916
888,-0.15571
889,-0.15539
890,-0.17833
891,-0.17859
892,-0.20318
893,-0.20448
894,-0.22466
895,-0.22271
896,-0.24185
897,-0.24218
898,-0.25994
899,-0.25835
900,-0.27404
901,-0.27384000000000003
902,-0.28870999999999997
903,-0.28715999999999997
904,-0.29883000000000004
905,-0.29696999999999996
906,-0.3079
907,-0.30691999999999997
908,-0.31698000000000004
909,-0.31636
910,-0.3249
911,-0.32404
912,-0.33084
913,-0.32998
914,-0.33555
915,-0.33568000000000003
916,-0.34158
917,-0.34417
918,-0.35102
919,-0.35600000000000004
920,-0.36359
921,-0.37074
922,-0.37811
923,-0.38506
924,-0.38934
925,-0.39494
926,-0.3972
927,-0.40216999999999997
928,-0.40042
929,-0.40154
930,-0.39434
931,-0.39188
932,-0.37909
933,-0.37282
934,-0.35566
935,-0.34589000000000003
936,-0.3202
937,-0.30118
938,-0.26782
939,-0.24936
940,-0.21877
941,-0.20251
942,-0.16768
943,-0.14575
944,-0.10407000000000001
945,-0.079206
946,-0.035384
947,-0.0099962
948,0.037688
949,0.06617100000000001
950,0.11494000000000001
951,0.13746
952,0.17803
953,0.19097
954,0.22635
955,0.23884
956,0.28121
957,0.29984
958,0.34046
959,0.35581999999999997
960,0.40188
961,0.43475
962,0.49013
963,0.51471
964,0.5515800000000001
965,0.56684
966,0.6003
967,0.6096600000000001
968,0.6301800000000001
969,0.63054
970,0.64545
971,0.64159
972,0.64982
973,0.64455
974,0.65436
975,0.65149
976,0.6584
977,0.65309
978,0.6578
979,0.65293
980,0.65564
981,0.64942
982,0.64969
983,0.64388
984,0.6438
985,0.63923
986,0.63875
987,0.6360100000000001
988,0.63618
989,0.6353300000000001
990,0.6349
991,0.63485
992,0.63368
993,0.63464
994,0.6329100000000001
995,0.63565
996,0.63455
997,0.63945
998,0.63866
999,0.6459999999999999
1000,0.6459699999999999
1001,0.65495
1002,0.65499
1003,0.66751
1004,0.67047
1005,0.68705
1006,0.6932
1007,0.71662
1008,0.72614
1009,0.7492
1010,0.75748
1011,0.7903600000000001
1012,0.8114100000000001
1013,0.84751
1014,0.85567
1015,0.8809799999999999
1016,0.88976
1017,0.9203
1018,0.9255200000000001
1019,0.95329
1020,0.9600700000000001
1021,0.98869
1022,0.9919899999999999
1023,1.0274
1024,1.0367
1025,1.0548
1026,1.0375
1027,1.0594
1028,1.0604
1029,1.0515
1030,1.0024
1031,1.0212
1032,1.0518
1033,1.0155
1034,0.80834
1035,0.5824600000000001
1036,0.45508000000000004
1037,0.46346000000000004
1038,0.45468000000000003
1039,0.40629
1040,0.33554
1041,0.31190999999999997
1042,0.2803
1043,0.24038
1044,0.1795
1045,0.13934000000000002
1046,0.090222
1047,0.044851
1048,-0.00958
1049,-0.046988
1050,-0.086431
1051,-0.11752
1052,-0.15331
1053,-0.18008
1054,-0.20695
1055,-0.22516999999999998
1056,-0.24169000000000002
1057,-0.25279
1058,-0.2615
1059,-0.26739
1060,-0.27197
1061,-0.2782
1062,-0.282
1063,-0.28819
1064,-0.28993
1065,-0.29558
1066,-0.29328000000000004
1067,-0.29344000000000003
1068,-0.28281
1069,-0.27941
1070,-0.26842
1071,-0.26769
1072,-0.24791
1073,-0.22807
1074,-0.25701999999999997
1075,-0.28305
1076,-0.20778000000000002
1077,-0.14240999999999998
1078,-0.24741
1079,-0.34103
1080,-0.13858
1081,0.054509
1082,-0.19113
1083,-0.44051
1084,0.0081075
1085,0.48973999999999995
1086,-0.090352
1087,-0.83921
1088,0.17076
1089,1.7716
1090,-0.021167
1091,-6.2433
