time,value
0,-0.29364
1,-0.36068
2,-0.3942
3,-0.37185
4,-0.3495
5,-0.21543
6,-0.2266
7,-0.2266
8,-0.27129000000000003
9,-0.40537
10,-0.31598000000000004
11,-0.21543
12,-0.38301999999999997
13,-0.37185
14,-0.36068
15,-0.33833
16,-0.19308
17,-0.081353
18,-0.3495
19,-0.40537
20,-0.37185
21,-0.36068
22,-0.37185
23,-0.21543
24,-0.3495
25,-0.27129000000000003
26,-0.23776999999999998
27,-0.26011999999999996
28,0.8571700000000001
29,0.86835
30,-0.30480999999999997
31,-0.33833
32,0.17562
33,-0.1037
34,-0.23776999999999998
35,0.23149
36,-0.036661
37,-0.18191
38,-0.2266
39,-0.20426
40,-0.1037
41,-0.1037
42,-0.23776999999999998
43,-0.2266
44,-0.081353
45,-0.15955999999999998
46,-0.21543
47,-0.14839000000000002
48,-0.1037
49,-0.27129000000000003
50,-0.092526
51,-0.26011999999999996
52,-0.32716
53,-0.15955999999999998
54,-0.014315000000000001
55,0.030376
56,-0.20426
57,-0.29364
58,-0.26011999999999996
59,-0.33833
60,-0.2266
61,-0.31598000000000004
62,-0.33833
63,-0.24895
64,-0.2266
65,-0.3495
66,-0.26011999999999996
67,-0.31598000000000004
68,-0.36068
69,-0.36068
70,-0.3942
71,-0.37185
72,-0.15955999999999998
73,-0.1037
74,-0.30480999999999997
75,-0.36068
76,-0.36068
77,-0.3942
78,-0.3495
79,-0.19308
80,-0.29364
81,-0.21543
82,5.9744
83,3.6839
84,3.3487
85,3.9521
86,3.2705
87,-0.23776999999999998
88,-0.19308
89,-0.1037
90,-0.18191
91,-0.30480999999999997
92,-0.3495
93,-0.31598000000000004
94,-0.26011999999999996
95,-0.13722
