time,value
0,-0.18561
1,-0.18561
2,-0.18561
3,-0.18561
4,-0.18561
5,-0.18561
6,-0.18561
7,-0.18561
8,-0.18561
9,-0.18561
10,-0.18561
11,-0.18561
12,-0.18561
13,-0.18561
14,-0.18561
15,-0.18561
16,-0.18561
17,-0.18561
18,-0.18561
19,-0.18561
20,-0.18561
21,-0.18561
22,-0.18561
23,-0.18561
24,-0.18561
25,-0.18561
26,-0.18561
27,-0.18561
28,-0.18561
29,-0.18561
30,-0.18561
31,-0.18561
32,-0.18561
33,-0.18561
34,-0.18561
35,-0.18561
36,-0.18561
37,-0.18561
38,-0.18561
39,-0.18561
40,-0.18561
41,-0.18561
42,-0.18561
43,-0.18561
44,-0.18561
45,-0.18561
46,-0.18561
47,-0.18561
48,-0.18561
49,-0.18561
50,-0.18561
51,-0.18561
52,-0.18561
53,-0.18561
54,-0.18561
55,-0.18561
56,-0.18561
57,-0.18561
58,-0.18561
59,-0.18561
60,-0.18561
61,-0.18561
62,-0.18561
63,-0.18561
64,-0.18561
65,-0.18561
66,-0.18561
67,-0.18561
68,-0.18561
69,-0.18561
70,-0.18561
71,-0.18561
72,-0.18561
73,-0.18561
74,-0.18561
75,-0.18561
76,-0.18561
77,-0.18561
78,-0.18561
79,-0.18561
80,-0.18561
81,-0.18561
82,-0.18561
83,-0.18561
84,0.0087744
85,1.8662
86,4.9764
87,0.18156
88,0.22476
89,1.4127
90,7.849
91,-0.18561
92,-0.18561
93,-0.18561
94,-0.18561
95,-0.18561
