time,value
0,-2.1444
1,-2.1444
2,-2.1444
3,-2.1444
4,-2.1444
5,-2.1444
6,-2.1444
7,-2.147
8,-2.147
9,-2.147
10,-2.147
11,-2.1469
12,-2.1467
13,-2.1464
14,-2.1544
15,-2.1622
16,-2.1646
17,-2.1643
18,-2.1637
19,-2.1631
20,-2.1624
21,-2.1616
22,-2.1607
23,-2.1597
24,-2.1590000000000003
25,-2.1578
26,-2.1566
27,-2.1553
28,-2.1539
29,-2.1525
30,-2.1509
31,-2.1498
32,-2.1481
33,-2.1463
34,-2.1445
35,-2.1425
36,-2.1405
37,-2.1391
38,-2.1369
39,-2.1347
40,-2.1323
41,-2.1299
42,-2.1274
43,-2.1249
44,-2.1231
45,-2.1204
46,-2.1177
47,-2.1149
48,-2.1119
49,-2.109
50,-2.1059
51,-2.1038
52,-2.1007
53,-2.0974
54,-2.0941
55,-2.0908
56,-2.0873
57,-2.085
58,-2.0814
59,-2.0778
60,-2.0741
61,-2.0704
62,-2.0666
63,-2.0627
64,-2.0601
65,-2.0562
66,-2.0522
67,-2.0481
68,-2.044
69,-2.0398
70,-2.0355
71,-2.0327
72,-2.0283
73,-2.0239
74,-2.0195
75,-2.015
76,-2.0105
77,-2.0074
78,-2.0028
79,-1.9981
80,-1.9934
81,-1.9886
82,-1.9838
83,-1.979
84,-1.9757
85,-1.9708
86,-1.9658
87,-1.9608
88,-1.9558
89,-1.9507
90,-1.9455
91,-1.9421
92,-1.9369
93,-1.9316
94,-1.9263
95,-1.921
96,-1.9157
97,-1.9121
98,-1.9067
99,-1.9012
100,-1.8957
101,-1.8902
102,-1.8847
103,-1.8791
104,-1.8753
105,-1.8697
106,-1.864
107,-1.8583
108,-1.8526
109,-1.8468
110,-1.841
111,-1.8372
112,-1.8313
113,-1.8255
114,-1.8196
115,-1.8136
116,-1.8077
117,-1.8017
118,-1.7977
119,-1.7917
120,-1.7857
121,-1.7796
122,-1.7735
123,-1.7674
124,-1.7633
125,-1.7571
126,-1.751
127,-1.7448
128,-1.7386
129,-1.7323
130,-1.726
131,-1.7219
132,-1.7156
133,-1.7092
134,-1.7029
135,-1.6965
136,-1.6902
137,-1.6838
138,-1.6795
139,-1.6731
140,-1.6666
141,-1.6602
142,-1.6537
143,-1.6487
144,-1.6443
145,-1.6363
146,-1.6298
147,-1.6232
148,-1.6166
149,-1.61
150,-1.6049
151,-1.6005
152,-1.5938
153,-1.5872
154,-1.5805
155,-1.5738
156,-1.5671
157,-1.5604
158,-1.5559
159,-1.5492
160,-1.5424
161,-1.5356
162,-1.5289
163,-1.5221
164,-1.5162
165,-1.5107
166,-1.5039
167,-1.4971
168,-1.4902
169,-1.4833
170,-1.4751
171,-1.4706
172,-1.465
173,-1.4581
174,-1.4512
175,-1.4443
176,-1.4373
177,-1.4304
178,-1.4257
179,-1.4175
180,-1.4105
181,-1.4035
182,-1.3966
183,-1.3896
184,-1.3849
185,-1.3779
186,-1.3732
187,-1.3671
188,-1.361
189,-1.3574
190,-1.3504
191,-1.3457
192,-1.3387
193,-1.3317
194,-1.3234
195,-1.3164
196,-1.3093
197,-1.3023
198,-1.2976
199,-1.2905
200,-1.2845
201,-1.2784
202,-1.2701
203,-1.2631
204,-1.2548
205,-1.2501
206,-1.2429999999999999
207,-1.236
208,-1.2289
209,-1.2218
210,-1.2158
211,-1.2134
212,-1.2062
213,-1.1992
214,-1.1909
215,-1.1838
216,-1.1767
217,-1.1707
218,-1.1659
219,-1.1611
220,-1.1541
221,-1.1458
222,-1.1387
223,-1.1316
224,-1.1245
225,-1.1197
226,-1.1159999999999999
227,-1.109
228,-1.1007
229,-1.0959
230,-1.0899
231,-1.0874
232,-1.0803
233,-1.0733
234,-1.0662
235,-1.0579
236,-1.0508
237,-1.0438
238,-1.0390000000000001
239,-1.0319
240,-1.026
241,-1.0223
242,-1.014
243,-1.0070000000000001
244,-0.9986700000000001
245,-0.9939399999999999
246,-0.98685
247,-0.98087
248,-0.9748700000000001
249,-0.9665799999999999
250,-0.9595
251,-0.95478
252,-0.9476899999999999
253,-0.93939
254,-0.93229
255,-0.9251799999999999
256,-0.91806
257,-0.91212
258,-0.9097299999999999
259,-0.90259
260,-0.89549
261,-0.88839
262,-0.8800899999999999
263,-0.87297
264,-0.8682200000000001
265,-0.86346
266,-0.8598600000000001
267,-0.85277
268,-0.84567
269,-0.8385600000000001
270,-0.83026
271,-0.8255100000000001
272,-0.8184
273,-0.8112699999999999
274,-0.80296
275,-0.7994100000000001
276,-0.79347
277,-0.7863600000000001
278,-0.78161
279,-0.77449
280,-0.7661899999999999
281,-0.7590600000000001
282,-0.75192
283,-0.74478
284,-0.73763
285,-0.7353
286,-0.72939
287,-0.7246600000000001
288,-0.71753
289,-0.70922
290,-0.70208
291,-0.6973199999999999
292,-0.69017
293,-0.68428
294,-0.68075
295,-0.67482
296,-0.66769
297,-0.66055
298,-0.65579
299,-0.64865
300,-0.6415
301,-0.63434
302,-0.62602
303,-0.6188600000000001
304,-0.61169
305,-0.6069100000000001
306,-0.59973
307,-0.59255
308,-0.58422
309,-0.5784
310,-0.5761
311,-0.5677800000000001
312,-0.56299
313,-0.55581
314,-0.5486300000000001
315,-0.5414399999999999
316,-0.5331100000000001
317,-0.5259199999999999
318,-0.52112
319,-0.5139199999999999
320,-0.50671
321,-0.49949
322,-0.49612
323,-0.49033000000000004
324,-0.4844
325,-0.4796
326,-0.4724
327,-0.46518999999999994
328,-0.45798
329,-0.45077
330,-0.44243000000000005
331,-0.43521000000000004
332,-0.43038999999999994
333,-0.42316000000000004
334,-0.41593
335,-0.4113
336,-0.40556
337,-0.40092
338,-0.39611
339,-0.38888
340,-0.38165
341,-0.37442
342,-0.36719
343,-0.35884
344,-0.3516
345,-0.34676999999999997
346,-0.33952
347,-0.33226999999999995
348,-0.32500999999999997
349,-0.31775
350,-0.31048000000000003
351,-0.30480999999999997
352,-0.30021
353,-0.29561
354,-0.28835
355,-0.2811
356,-0.27384000000000003
357,-0.26657
358,-0.26064
359,-0.25338
360,-0.2461
361,-0.23883000000000001
362,-0.23154
363,-0.22426
364,-0.22183000000000003
365,-0.2194
366,-0.2194
367,-0.21211
368,-0.20481999999999997
369,-0.19752
370,-0.19508
371,-0.19508
372,-0.18916
373,-0.1808
374,-0.17349
375,-0.16619
376,-0.15888
377,-0.15156
378,-0.14668
379,-0.1418
380,-0.13727999999999999
381,-0.1317
382,-0.12682000000000002
383,-0.11846
384,-0.11288
385,-0.10834
386,-0.10135
387,-0.094054
388,-0.08675
389,-0.079441
390,-0.07108099999999999
391,-0.063769
392,-0.05889199999999999
393,-0.051575
394,-0.044252
395,-0.036927
396,-0.029599
397,-0.026487
398,-0.021963
399,-0.017434
400,-0.01012
401,-0.0028004
402,0.0045196
403,0.012886000000000002
404,0.020211
405,0.025098
406,0.032429
407,0.03835
408,0.041451999999999996
409,0.044575
410,0.050151
411,0.053309
412,0.057856
413,0.06515800000000001
414,0.07245900000000001
415,0.07976799999999999
416,0.088126
417,0.095438
418,0.10275
419,0.10762999999999999
420,0.1146
421,0.12018
422,0.12715
423,0.13446
424,0.14177
425,0.14665
426,0.15500999999999998
427,0.16232
428,0.16964
429,0.17697000000000002
430,0.18149
431,0.18706
432,0.19159
433,0.1989
434,0.20726
435,0.21040999999999999
436,0.21600999999999998
437,0.22193000000000002
438,0.22923000000000002
439,0.2341
440,0.24140999999999999
441,0.24977
442,0.25708000000000003
443,0.2644
444,0.27171999999999996
445,0.2752
446,0.28076999999999996
447,0.28393
448,0.29123000000000004
449,0.29959
450,0.30413
451,0.30974
452,0.31429
453,0.32158000000000003
454,0.32994
455,0.33724
456,0.34454
457,0.35152
458,0.35713
459,0.36168
460,0.36898000000000003
461,0.37627
462,0.38356999999999997
463,0.39193
464,0.39924
465,0.40410999999999997
466,0.41142
467,0.41839
468,0.42398
469,0.42853
470,0.43583
471,0.44313
472,0.44801
473,0.45531000000000005
474,0.46366999999999997
475,0.47098
476,0.4783
477,0.48527
478,0.49085
479,0.49538999999999994
480,0.5027
481,0.5100100000000001
482,0.51732
483,0.52463
484,0.53195
485,0.53683
486,0.54415
487,0.55147
488,0.55984
489,0.56717
490,0.5745
491,0.5818300000000001
492,0.58672
493,0.59406
494,0.6014
495,0.60874
496,0.6160899999999999
497,0.62344
498,0.62935
499,0.6314
500,0.6369100000000001
501,0.64528
502,0.65262
503,0.65997
504,0.6673100000000001
505,0.67467
506,0.67957
507,0.68692
508,0.69428
509,0.7016399999999999
510,0.7090000000000001
511,0.71636
512,0.72128
513,0.72864
514,0.73601
515,0.74339
516,0.75076
517,0.7581399999999999
518,0.76552
519,0.77045
520,0.77684
521,0.77389
522,0.77342
523,0.78082
524,0.77985
525,0.77791
526,0.7759699999999999
527,0.7730899999999999
528,0.7702100000000001
529,0.76735
530,0.76451
531,0.76356
532,0.76356
533,0.7551800000000001
534,0.74774
535,0.74031
536,0.73346
537,0.72815
538,0.7213
539,0.7154
540,0.70702
541,0.70421
542,0.69645
543,0.68899
544,0.6815399999999999
545,0.67409
546,0.66913
547,0.66074
548,0.6533
549,0.64586
550,0.63842
551,0.63098
552,0.62602
553,0.62012
554,0.61729
555,0.6119899999999999
556,0.60454
557,0.5971
558,0.58872
559,0.5837600000000001
560,0.5763199999999999
561,0.57195
562,0.56665
563,0.5623
564,0.55485
565,0.5474
566,0.5415
567,0.5340600000000001
568,0.52662
569,0.5238
570,0.51852
571,0.51261
572,0.50765
573,0.5002
574,0.49181
575,0.48436
576,0.47753
577,0.47225
578,0.46791000000000005
579,0.46293
580,0.45548
581,0.44802
582,0.43964
583,0.43218999999999996
584,0.42691
585,0.42413
586,0.42072
587,0.41234
588,0.40488
589,0.40210999999999997
590,0.39687
591,0.38849
592,0.38259
593,0.37761
594,0.37238000000000004
595,0.36966
596,0.36377
597,0.35628000000000004
598,0.3488
599,0.34381999999999996
600,0.33543
601,0.32795
602,0.32048000000000004
603,0.31301
604,0.30869
605,0.30346999999999996
606,0.29916
607,0.29168
608,0.28329
609,0.27809
610,0.27539
611,0.267
612,0.25951
613,0.25451999999999997
614,0.24613000000000002
615,0.23865
616,0.23525
617,0.23006
618,0.22489
619,0.21989
620,0.2115
621,0.20382999999999998
622,0.19868
623,0.1953
624,0.18779
625,0.18028
626,0.17528
627,0.16777999999999998
628,0.15939
629,0.15189
630,0.14439000000000002
631,0.14010999999999998
632,0.13495
633,0.13157
634,0.12318
635,0.11391
636,0.10877
637,0.10615999999999999
638,0.09863999999999999
639,0.093628
640,0.085239
641,0.077723
642,0.07020900000000001
643,0.063449
644,0.060837999999999996
645,0.051580999999999995
646,0.046567000000000004
647,0.039044999999999996
648,0.031527
649,0.023137
650,0.015621000000000001
651,0.0081066
652,0.00059363
653,-0.0036624
654,-0.0062784
655,-0.013025
656,-0.021414
657,-0.028161000000000002
658,-0.035759
659,-0.041638999999999995
660,-0.050882
661,-0.05595
662,-0.058486
663,-0.063519
664,-0.06601599999999999
665,-0.073535
666,-0.079403
667,-0.08697
668,-0.08943200000000001
669,-0.091878
670,-0.096829
671,-0.099233
672,-0.10162
673,-0.10162
674,-0.10240999999999999
675,-0.1032
676,-0.10555
677,-0.10632
678,-0.10379000000000001
679,-0.10379000000000001
680,-0.10125
681,-0.09441000000000001
682,-0.086792
683,-0.07917300000000001
684,-0.07155299999999999
685,-0.067995
686,-0.069507
687,-0.069215
688,-0.06666799999999999
689,-0.05902999999999999
690,-0.051389
691,-0.043745
692,-0.036839
693,-0.03174
694,-0.024091
695,-0.016439
696,-0.0087884
697,-0.0011344
698,0.0057986
699,0.0076316000000000005
700,0.0080376
701,0.0091766
702,0.016849
703,0.023822
704,0.021728
705,0.022219
706,0.024097999999999998
707,0.031789
708,0.038801
709,0.046498000000000005
710,0.05419500000000001
711,0.056089
712,0.056652
713,0.057899
714,0.064953
715,0.072666
716,0.079731
717,0.087449
718,0.09517
719,0.097743
720,0.097743
721,0.10289000000000001
722,0.11060999999999999
723,0.11060999999999999
724,0.11317999999999999
725,0.11769
726,0.12220999999999999
727,0.1293
728,0.13702999999999999
729,0.1454
730,0.15375999999999998
731,0.15697
732,0.15954000000000002
733,0.16212000000000001
734,0.16985
735,0.17243
736,0.17501
737,0.18016
738,0.18852
739,0.19626
740,0.20140999999999998
741,0.20915
742,0.21555
743,0.22002
744,0.22386999999999999
745,0.2316
746,0.23675
747,0.24511
748,0.25284
749,0.26056999999999997
750,0.26248
751,0.26697
752,0.27534000000000003
753,0.28049
754,0.28820999999999997
755,0.29593
756,0.30366
757,0.31201999999999996
758,0.31975
759,0.32747
760,0.33263000000000004
761,0.34035
762,0.34808
763,0.35581
764,0.36355
765,0.3687
766,0.37254
767,0.37444
768,0.38087
769,0.3886
770,0.39632
771,0.40469
772,0.41241000000000005
773,0.41756000000000004
774,0.42528999999999995
775,0.43301999999999996
776,0.4375
777,0.442
778,0.44778999999999997
779,0.45551
780,0.46066
781,0.46838
782,0.47675
783,0.48446999999999996
784,0.4922
785,0.49992
786,0.50507
787,0.5128
788,0.52053
789,0.5250199999999999
790,0.52952
791,0.5353100000000001
792,0.54303
793,0.5481699999999999
794,0.5559
795,0.56362
796,0.57199
797,0.5797100000000001
798,0.58744
799,0.59516
800,0.60031
801,0.6080399999999999
802,0.61253
803,0.61703
804,0.62539
805,0.6331100000000001
806,0.64084
807,0.64598
808,0.65371
809,0.6614300000000001
810,0.6691600000000001
811,0.67689
812,0.68462
813,0.68977
814,0.6975
815,0.70523
816,0.71296
817,0.7207
818,0.72843
819,0.73616
820,0.74132
821,0.7490600000000001
822,0.7568
823,0.76453
824,0.77227
825,0.7800199999999999
826,0.78776
827,0.79292
828,0.80066
829,0.8084
830,0.81615
831,0.8239
832,0.8316399999999999
833,0.83681
834,0.8445600000000001
835,0.8523
836,0.8606600000000001
837,0.86841
838,0.87616
839,0.8839100000000001
840,0.88908
841,0.8968299999999999
842,0.9045799999999999
843,0.9089700000000001
844,0.9133700000000001
845,0.91915
846,0.92689
847,0.93206
848,0.93981
849,0.9475600000000001
850,0.95531
851,0.96306
852,0.9708100000000001
853,0.97598
854,0.9837299999999999
855,0.99149
856,0.99924
857,1.0070000000000001
858,1.0148
859,1.0225
860,1.0277
861,1.0354
862,1.0406
863,1.0406
864,1.0458
865,1.0535
866,1.0535
867,1.0561
868,1.0613
869,1.0691
870,1.0768
871,1.0846
872,1.0924
873,1.0975
874,1.1053
875,1.1131
876,1.1208
877,1.1286
878,1.1364
879,1.1441
880,1.1493
881,1.1571
882,1.1649
883,1.1726
884,1.1804
885,1.1882
886,1.196
887,1.2011
888,1.202
889,1.203
890,1.2102
891,1.218
892,1.2258
893,1.2309
894,1.2387
895,1.2465
896,1.2543
897,1.2621
898,1.2693
899,1.2771
900,1.2823
901,1.2901
902,1.2979
903,1.3026
904,1.3036
905,1.3046
906,1.3124
907,1.317
908,1.3248
909,1.3248
910,1.3243
911,1.3228
912,1.3212
913,1.3197
914,1.3187
915,1.3172
916,1.3162
917,1.3162
918,1.3126
919,1.3085
920,1.3075
921,1.3018
922,1.2935
923,1.2878
924,1.2838
925,1.2797
926,1.2719
927,1.2667
928,1.2588
929,1.251
930,1.2432
931,1.2353
932,1.2275
933,1.2192
934,1.214
935,1.2062
936,1.1983
937,1.1905
938,1.1827
939,1.1791
940,1.1755
941,1.1741
942,1.1663
943,1.158
944,1.1554
945,1.1528
946,1.1471
947,1.1414
948,1.1331
949,1.1274
950,1.1243
951,1.1186
952,1.1108
953,1.1108
954,1.1082
955,1.1056
956,1.0982
957,1.0908
958,1.0835
959,1.0761
960,1.0709
961,1.0657
962,1.0626
963,1.0574
964,1.0495
965,1.0417
966,1.0339
967,1.0287
968,1.0208
969,1.013
970,1.0078
971,1.0047
972,1.0033
973,0.99544
974,0.9902200000000001
975,0.98239
976,0.97456
977,0.96625
978,0.9584299999999999
979,0.9506
980,0.9453799999999999
981,0.94181
982,0.9377700000000001
983,0.9316
984,0.9232899999999999
985,0.91807
986,0.91405
987,0.91312
988,0.90697
989,0.8991299999999999
990,0.8913
991,0.88346
992,0.8756200000000001
993,0.8673200000000001
994,0.8621
995,0.85426
996,0.8464200000000001
997,0.83859
998,0.83075
999,0.8229200000000001
1000,0.8177
1001,0.80986
1002,0.8084600000000001
1003,0.8044600000000001
1004,0.7961600000000001
1005,0.78832
1006,0.7804800000000001
1007,0.7752600000000001
1008,0.7669600000000001
1009,0.75912
1010,0.7512800000000001
1011,0.74344
1012,0.73945
1013,0.7380800000000001
1014,0.73502
1015,0.72717
1016,0.71933
1017,0.71149
1018,0.70365
1019,0.69535
1020,0.6875100000000001
1021,0.68228
1022,0.6766
1023,0.6726300000000001
1024,0.6712899999999999
1025,0.6634399999999999
1026,0.65559
1027,0.65037
1028,0.64252
1029,0.6342300000000001
1030,0.62638
1031,0.61854
1032,0.61069
1033,0.6098
1034,0.60629
1035,0.6028
1036,0.59451
1037,0.5866600000000001
1038,0.57881
1039,0.57096
1040,0.56267
1041,0.5574399999999999
1042,0.5495899999999999
1043,0.54174
1044,0.53389
1045,0.52604
1046,0.52255
1047,0.51905
1048,0.51818
1049,0.5099
1050,0.5020399999999999
1051,0.49376000000000003
1052,0.48591000000000006
1053,0.47805
1054,0.47718999999999995
1055,0.47329
1056,0.46983
1057,0.46197
1058,0.45411
1059,0.44625
1060,0.4384
1061,0.43316000000000004
1062,0.4253
1063,0.41702
1064,0.40915999999999997
1065,0.40131
1066,0.39345
1067,0.38821
1068,0.38036
1069,0.37251
1070,0.36903
1071,0.36514
1072,0.35907
1073,0.35120999999999997
1074,0.34597
1075,0.33810999999999997
1076,0.33025
1077,0.32239
1078,0.31411
1079,0.30625
1080,0.29839
1081,0.29315
1082,0.2853
1083,0.27744
1084,0.26958000000000004
1085,0.26173
1086,0.25387
1087,0.24864
1088,0.24078000000000002
1089,0.23293000000000003
1090,0.22507
1091,0.21721999999999997
1092,0.20936999999999997
1093,0.20152
1094,0.19802999999999998
1095,0.19413
1096,0.19067
1097,0.18281
1098,0.17495
1099,0.16667
1100,0.15880999999999998
1101,0.15315
1102,0.1519
1103,0.14804
1104,0.14017000000000002
1105,0.1319
1106,0.12887
1107,0.12504
1108,0.12425
1109,0.11598
1110,0.10772000000000001
1111,0.10430999999999999
1112,0.10053
1113,0.09452200000000001
1114,0.089269
1115,0.086643
1116,0.086266
1117,0.086266
1118,0.086266
1119,0.085146
1120,0.084414
1121,0.084414
1122,0.084414
1123,0.08405
1124,0.091936
1125,0.096833
1126,0.09576699999999999
1127,0.097353
1128,0.10260999999999999
1129,0.11051
1130,0.1184
1131,0.12629
1132,0.13419
1133,0.14174
1134,0.14701
1135,0.1549
1136,0.15687
1137,0.15852
1138,0.15788
1139,0.16546
1140,0.17305
1141,0.17538
1142,0.17709
1143,0.17912999999999998
1144,0.18674000000000002
1145,0.19465
1146,0.19378
1147,0.19557
1148,0.19501
1149,0.19419
1150,0.1934
1151,0.19842
1152,0.20608
1153,0.21086
1154,0.213
1155,0.21227
1156,0.22019
1157,0.22812
1158,0.23605
1159,0.24398000000000003
1160,0.2519
1161,0.25719000000000003
1162,0.26511999999999997
1163,0.27305
1164,0.28074
1165,0.28867
1166,0.2966
1167,0.30453
1168,0.30981
1169,0.31797
1170,0.3259
1171,0.33383
1172,0.34176
1173,0.34969
1174,0.35498
1175,0.36291
1176,0.37084
1177,0.37877
1178,0.3867
1179,0.39463000000000004
1180,0.40256
1181,0.40785
1182,0.41578000000000004
1183,0.42371000000000003
1184,0.43163999999999997
1185,0.43692
1186,0.43956999999999996
1187,0.44508000000000003
1188,0.45059
1189,0.45875
1190,0.46426999999999996
1191,0.46713999999999994
1192,0.47002
1193,0.47794
1194,0.48081999999999997
1195,0.48346000000000006
1196,0.48611000000000004
1197,0.49403
1198,0.5019600000000001
1199,0.50989
1200,0.51782
1201,0.5231100000000001
1202,0.53104
1203,0.53897
1204,0.54689
1205,0.55482
1206,0.56275
1207,0.57068
1208,0.57597
1209,0.5839
1210,0.59183
1211,0.5997600000000001
1212,0.60769
1213,0.61585
1214,0.62378
1215,0.6290600000000001
1216,0.63699
1217,0.6449199999999999
1218,0.65285
1219,0.66078
1220,0.66871
1221,0.674
1222,0.68193
1223,0.68986
1224,0.6978
1225,0.7055
1226,0.71344
1227,0.72137
1228,0.7266600000000001
1229,0.73459
1230,0.74252
1231,0.75045
1232,0.75839
1233,0.76632
1234,0.77425
1235,0.77954
1236,0.78747
1237,0.7954100000000001
1238,0.8033399999999999
1239,0.8112699999999999
1240,0.81921
1241,0.8242799999999999
1242,0.8263
1243,0.82834
1244,0.8362799999999999
1245,0.84421
1246,0.85215
1247,0.8600899999999999
1248,0.8653799999999999
1249,0.8733200000000001
1250,0.88125
1251,0.88899
1252,0.8969299999999999
1253,0.9048700000000001
1254,0.91281
1255,0.9181
1256,0.92604
1257,0.9283
1258,0.9303899999999999
1259,0.9326700000000001
1260,0.9406100000000001
1261,0.94591
1262,0.95385
1263,0.9617899999999999
1264,0.96973
1265,0.9776799999999999
1266,0.98562
1267,0.9933799999999999
1268,0.9986799999999999
1269,1.0066
1270,1.0146
1271,1.0225
1272,1.0304
1273,1.0384
1274,1.0463
1275,1.0516
1276,1.0538
1277,1.0559
1278,1.0637
1279,1.0716
1280,1.0796
1281,1.0849
1282,1.0928
1283,1.1008
1284,1.1087
1285,1.1167
1286,1.1246
1287,1.1326
1288,1.1379
1289,1.1457
1290,1.1536
1291,1.1615
1292,1.1695
1293,1.1774
1294,1.1796
1295,1.182
1296,1.1844
1297,1.1923
1298,1.2003
1299,1.2082
1300,1.2161
1301,1.2214
1302,1.2294
1303,1.2373
1304,1.2453
1305,1.2532
1306,1.2612
1307,1.2691
1308,1.2744
1309,1.2824
1310,1.2902
1311,1.2981
1312,1.3061
1313,1.314
1314,1.3219999999999998
1315,1.3273
1316,1.3352
1317,1.3432
1318,1.3482
1319,1.3505
1320,1.3555
1321,1.3635
1322,1.3688
1323,1.3768
1324,1.3847
1325,1.3925
1326,1.4005
1327,1.4084
1328,1.4137
1329,1.4217
1330,1.4296
1331,1.4323
1332,1.4349
1333,1.4376
1334,1.4455
1335,1.4482
1336,1.4508
1337,1.4507
1338,1.4586
1339,1.4664
1340,1.4742
1341,1.4822
1342,1.4875
1343,1.4955
1344,1.4955
1345,1.4979
1346,1.5031
1347,1.5109
1348,1.5161
1349,1.5185
1350,1.5182
1351,1.5262
1352,1.5261
1353,1.5259
1354,1.5256
1355,1.5255
1356,1.5253
1357,1.525
1358,1.5248
1359,1.5248
1360,1.5221
1361,1.5167
1362,1.5139
1363,1.5138
1364,1.5084
1365,1.5004
1366,1.4951
1367,1.4923
1368,1.4896
1369,1.4816
1370,1.4737
1371,1.4657
1372,1.4577
1373,1.4498
1374,1.4418
1375,1.4364
1376,1.4285
1377,1.4258
1378,1.4232
1379,1.4179
1380,1.4099
1381,1.4099
1382,1.4073
1383,1.4046
1384,1.3966
1385,1.3887
1386,1.3807
1387,1.3727
1388,1.3674
1389,1.3646
1390,1.3619
1391,1.3539
1392,1.3459999999999999
1393,1.338
1394,1.3301
1395,1.3248
1396,1.3168
1397,1.3088
1398,1.3009
1399,1.2929
1400,1.2849
1401,1.2770000000000001
1402,1.2717
1403,1.2637
1404,1.2558
1405,1.2478
1406,1.2398
1407,1.2319
1408,1.224
1409,1.2186
1410,1.2107
1411,1.2027
1412,1.1948
1413,1.1868
1414,1.1788
1415,1.1735
1416,1.1656
1417,1.1576
1418,1.1496
1419,1.1417
1420,1.1337
1421,1.1258
1422,1.1205
1423,1.1125
1424,1.1046
1425,1.0966
1426,1.0886
1427,1.0807
1428,1.0727
1429,1.0674
1430,1.0595
1431,1.0515
1432,1.0435
1433,1.0356
1434,1.0276
1435,1.0223
1436,1.0144
1437,1.0064
1438,0.99844
1439,0.99049
1440,0.9825
1441,0.97454
1442,0.96924
1443,0.9612799999999999
1444,0.9533200000000001
1445,0.9453600000000001
1446,0.94266
1447,0.93995
1448,0.93461
1449,0.9293
1450,0.9213399999999999
1451,0.9133899999999999
1452,0.90543
1453,0.8974700000000001
1454,0.88951
1455,0.8842
1456,0.87624
1457,0.8682799999999999
1458,0.8603200000000001
1459,0.85236
1460,0.84441
1461,0.83645
1462,0.83114
1463,0.8231799999999999
1464,0.81522
1465,0.80725
1466,0.79929
1467,0.79133
1468,0.78337
1469,0.7780699999999999
1470,0.7701100000000001
1471,0.76215
1472,0.7541899999999999
1473,0.75152
1474,0.74885
1475,0.74885
1476,0.7409
1477,0.7329399999999999
1478,0.72497
1479,0.71701
1480,0.70905
1481,0.7037399999999999
1482,0.7037399999999999
1483,0.70109
1484,0.6957800000000001
1485,0.68782
1486,0.68783
1487,0.68517
1488,0.6772100000000001
1489,0.67191
1490,0.66395
1491,0.6613
1492,0.65865
1493,0.65069
1494,0.6453800000000001
1495,0.6453800000000001
1496,0.64273
1497,0.63477
1498,0.6268100000000001
1499,0.61885
1500,0.61885
1501,0.6162
1502,0.6108899999999999
1503,0.60293
1504,0.60028
1505,0.60028
1506,0.59497
1507,0.58701
1508,0.57905
1509,0.5764
1510,0.5737399999999999
1511,0.57109
1512,0.56313
1513,0.56047
1514,0.55782
1515,0.55252
1516,0.5472100000000001
1517,0.53925
1518,0.5312899999999999
1519,0.5233300000000001
1520,0.51537
1521,0.50741
1522,0.5021100000000001
1523,0.49415
1524,0.48618999999999996
1525,0.47823000000000004
1526,0.47026999999999997
1527,0.46231000000000005
1528,0.45435
1529,0.44903999999999994
1530,0.44108
1531,0.43312
1532,0.42516000000000004
1533,0.41721
1534,0.40925
1535,0.40129000000000004
1536,0.39598
1537,0.38802
1538,0.38006
1539,0.3721
1540,0.36414
1541,0.35618
1542,0.35088
1543,0.34292
1544,0.33496
1545,0.327
1546,0.32169000000000003
1547,0.31905
1548,0.3164
1549,0.31109000000000003
1550,0.30313
1551,0.29517
1552,0.28720999999999997
1553,0.27925
1554,0.27129000000000003
1555,0.26333
1556,0.26068
1557,0.25801999999999997
1558,0.25536
1559,0.24741
1560,0.23945
1561,0.23149
1562,0.22618000000000002
1563,0.21823
1564,0.21026999999999998
1565,0.20231
1566,0.19967000000000001
1567,0.19705
1568,0.19178
1569,0.1865
1570,0.17856
1571,0.17865
1572,0.17876
1573,0.17623
1574,0.17638
1575,0.17384000000000002
1576,0.16859000000000002
1577,0.16064
1578,0.15818
1579,0.15574000000000002
1580,0.14786
1581,0.14255
1582,0.14255
1583,0.14255
1584,0.14263
1585,0.14288
1586,0.14306
1587,0.14306
1588,0.14306
1589,0.14315
1590,0.1458
1591,0.15375999999999998
1592,0.1566
1593,0.15955
1594,0.16507
1595,0.17313
1596,0.17578
1597,0.17613
1598,0.17914000000000002
1599,0.17952
1600,0.17993
1601,0.18300999999999998
1602,0.1833
1603,0.18375999999999998
1604,0.18424000000000001
1605,0.19219
1606,0.20013
1607,0.20806999999999998
1608,0.21602
1609,0.22130999999999998
1610,0.22926
1611,0.2372
1612,0.24515
1613,0.25326
1614,0.2612
1615,0.26914
1616,0.27444
1617,0.28221999999999997
1618,0.29017
1619,0.29812
1620,0.30606
1621,0.31417
1622,0.32211
1623,0.32741
1624,0.33535
1625,0.3433
1626,0.35124
1627,0.35919
1628,0.36713
1629,0.37243000000000004
1630,0.37290999999999996
1631,0.37606
1632,0.38151999999999997
1633,0.38946
1634,0.39741
1635,0.40535
1636,0.41063999999999995
1637,0.41858999999999996
1638,0.42653
1639,0.43446999999999997
1640,0.44259
1641,0.45053000000000004
1642,0.45847
1643,0.46376999999999996
1644,0.47171
1645,0.47965
1646,0.4876
1647,0.49554
1648,0.5010100000000001
1649,0.5010100000000001
1650,0.50365
1651,0.5116
1652,0.51971
1653,0.52782
1654,0.53594
1655,0.53876
1656,0.5414100000000001
1657,0.54423
1658,0.55235
1659,0.56029
1660,0.5655899999999999
1661,0.56823
1662,0.57088
1663,0.57618
1664,0.58412
1665,0.59206
1666,0.6
1667,0.6079399999999999
1668,0.61588
1669,0.62136
1670,0.6293
1671,0.6372399999999999
1672,0.64518
1673,0.65312
1674,0.6610699999999999
1675,0.66901
1676,0.67183
1677,0.67502
1678,0.67557
1679,0.6835100000000001
1680,0.69145
1681,0.69939
1682,0.70733
1683,0.71281
1684,0.72075
1685,0.72869
1686,0.73663
1687,0.73985
1688,0.74043
1689,0.74328
1690,0.75122
1691,0.75936
1692,0.7672899999999999
1693,0.77523
1694,0.78072
1695,0.78398
1696,0.7844
1697,0.79255
1698,0.80048
1699,0.8086300000000001
1700,0.8165600000000001
1701,0.8245
1702,0.82515
1703,0.8282299999999999
1704,0.8313200000000001
1705,0.83925
1706,0.8471799999999999
1707,0.85511
1708,0.86305
1709,0.8712
1710,0.87649
1711,0.8844200000000001
1712,0.89235
1713,0.90028
1714,0.9082100000000001
1715,0.9113100000000001
1716,0.9144100000000001
1717,0.91775
1718,0.92568
1719,0.93361
1720,0.94153
1721,0.9497
1722,0.95762
1723,0.96291
1724,0.9708399999999999
1725,0.9761200000000001
1726,0.9761200000000001
1727,0.97877
1728,0.98669
1729,0.99198
1730,0.99198
1731,0.9946200000000001
1732,1.0028
1733,1.0109
1734,1.0191
1735,1.0273
1736,1.0326
1737,1.0405
1738,1.0405
1739,1.041
1740,1.0443
1741,1.0451
1742,1.0485
1743,1.0538
1744,1.0617
1745,1.0696
1746,1.0775
1747,1.0855
1748,1.0934
1749,1.1016
1750,1.1068
1751,1.1148
1752,1.1227
1753,1.1285
1754,1.1293
1755,1.1351
1756,1.1404
1757,1.1483
1758,1.1565
1759,1.1644
1760,1.1726
1761,1.1734
1762,1.1768
1763,1.1821
1764,1.19
1765,1.1979
1766,1.2059
1767,1.2138
1768,1.2217
1769,1.2299
1770,1.2352
1771,1.2431
1772,1.251
1773,1.2592
1774,1.26
1775,1.2635
1776,1.2688
1777,1.2770000000000001
1778,1.2828
1779,1.2863
1780,1.2922
1781,1.2925
1782,1.2931
1783,1.2937
1784,1.2946
1785,1.2956
1786,1.2965
1787,1.2975
1788,1.2981
1789,1.2955
1790,1.2932
1791,1.2942
1792,1.2926
1793,1.2847
1794,1.2768
1795,1.2689
1796,1.2636
1797,1.2557
1798,1.2478
1799,1.2403
1800,1.2324
1801,1.2245
1802,1.2166
1803,1.2114
1804,1.2035
1805,1.1956
1806,1.1877
1807,1.1798
1808,1.1719
1809,1.17
1810,1.1707
1811,1.1692
1812,1.1703
1813,1.1714
1814,1.1695
1815,1.1616
1816,1.1541
1817,1.1541
1818,1.1515
1819,1.1462
1820,1.1384
1821,1.1305
1822,1.1279
1823,1.1252
1824,1.1252
1825,1.1174
1826,1.1095
1827,1.1016
1828,1.0937
1829,1.0859
1830,1.0806
1831,1.0727
1832,1.0649
1833,1.0566
1834,1.0487
1835,1.0409
1836,1.033
1837,1.0277
1838,1.0199
1839,1.012
1840,1.0041
1841,1.0003
1842,0.99655
1843,0.99354
1844,0.9856600000000001
1845,0.97778
1846,0.9695299999999999
1847,0.96165
1848,0.9564
1849,0.9537700000000001
1850,0.9537700000000001
1851,0.9459
1852,0.94065
1853,0.94065
1854,0.9380299999999999
1855,0.93015
1856,0.9222799999999999
1857,0.9170299999999999
1858,0.90915
1859,0.90128
1860,0.89341
1861,0.88554
1862,0.87766
1863,0.8724200000000001
1864,0.86454
1865,0.85667
1866,0.8488
1867,0.84093
1868,0.83306
1869,0.82519
1870,0.81995
1871,0.81208
1872,0.8042100000000001
1873,0.7963399999999999
1874,0.7884800000000001
1875,0.78061
1876,0.77274
1877,0.7675
1878,0.75963
1879,0.75176
1880,0.7439
1881,0.7360300000000001
1882,0.72817
1883,0.7229300000000001
1884,0.71506
1885,0.7072
1886,0.69934
1887,0.69148
1888,0.68361
1889,0.67575
1890,0.67051
1891,0.66265
1892,0.65479
1893,0.64693
1894,0.63907
1895,0.63121
1896,0.62335
1897,0.61811
1898,0.61026
1899,0.6024
1900,0.59454
1901,0.58668
1902,0.5788300000000001
1903,0.57798
1904,0.5741
1905,0.57148
1906,0.56362
1907,0.55576
1908,0.5479
1909,0.54004
1910,0.5348
1911,0.52695
1912,0.5190899999999999
1913,0.51689
1914,0.51818
1915,0.5133800000000001
1916,0.50553
1917,0.5003
1918,0.49245
1919,0.48458999999999997
1920,0.47673999999999994
1921,0.4689
1922,0.46105
1923,0.4532
1924,0.44797
1925,0.44011999999999996
1926,0.43228
1927,0.42443000000000003
1928,0.41658
1929,0.40874
1930,0.40351
1931,0.39566
1932,0.38782
1933,0.37998000000000004
1934,0.37214
1935,0.36429
1936,0.35645
1937,0.35122
1938,0.34338
1939,0.33555
1940,0.32771
1941,0.32509
1942,0.32509
1943,0.31726
1944,0.31203000000000003
1945,0.31203000000000003
1946,0.30942
1947,0.30112
1948,0.29281999999999997
1949,0.28452
1950,0.27883
1951,0.27099
1952,0.26316
1953,0.26316
1954,0.25963
1955,0.25394
1956,0.2461
1957,0.24088
1958,0.23304
1959,0.2252
1960,0.21736
1961,0.20951999999999998
1962,0.20122
1963,0.19338
1964,0.18816
1965,0.18032
1966,0.17248
1967,0.16465
1968,0.15680999999999998
1969,0.14898
1970,0.14376
1971,0.13545
1972,0.13452
1973,0.13052
1974,0.12484
1975,0.11699999999999999
1976,0.10916
1977,0.10393
1978,0.096096
1979,0.088256
1980,0.08041799999999999
1981,0.07258099999999999
1982,0.064746
1983,0.056912
1984,0.051688
1985,0.043852999999999996
1986,0.036018
1987,0.03483
1988,0.033665
1989,0.028933999999999998
1990,0.023721000000000003
1991,0.015897
1992,0.0080756
1993,0.00025363
1994,-0.0075654
1995,-0.015386000000000002
1996,-0.023205
1997,-0.028416000000000004
1998,-0.036233999999999995
1999,-0.044051
2000,-0.051866999999999996
2001,-0.059176
2002,-0.06698899999999999
2003,-0.0748
2004,-0.08000800000000001
2005,-0.08781900000000001
2006,-0.09562999999999999
2007,-0.10344
2008,-0.10812999999999999
2009,-0.10916
2010,-0.10758
2011,-0.11277999999999999
2012,-0.12057000000000001
2013,-0.12837
2014,-0.13616
2015,-0.14340999999999998
2016,-0.1512
2017,-0.1564
2018,-0.16419
2019,-0.16513
2020,-0.16605
2021,-0.17067000000000002
2022,-0.17844000000000002
2023,-0.18622
2024,-0.19083
2025,-0.1986
2026,-0.2032
2027,-0.20146
2028,-0.20227
2029,-0.21003000000000002
2030,-0.21719000000000002
2031,-0.22236
2032,-0.23010999999999998
2033,-0.23786
2034,-0.23923000000000003
2035,-0.23995999999999998
2036,-0.2413
2037,-0.24645999999999998
2038,-0.25356
2039,-0.25487
2040,-0.25553000000000003
2041,-0.25681
2042,-0.26387
2043,-0.27093
2044,-0.26961
2045,-0.27016999999999997
2046,-0.27463000000000004
2047,-0.28165
2048,-0.28541
2049,-0.2859
2050,-0.28706
2051,-0.29218
2052,-0.29985
2053,-0.30753
2054,-0.3152
2055,-0.32287
2056,-0.33053
2057,-0.33493
2058,-0.34259
2059,-0.3477
2060,-0.3477
2061,-0.3477
2062,-0.34553
2063,-0.34333
2064,-0.34185
2065,-0.33962
2066,-0.33812
2067,-0.33736
2068,-0.33482
2069,-0.33254
2070,-0.3277
2071,-0.32185
2072,-0.31424
2073,-0.30662
2074,-0.29823
2075,-0.29061
2076,-0.28654
2077,-0.28246
2078,-0.28013000000000005
2079,-0.27252
2080,-0.26491
2081,-0.25729
2082,-0.24891
2083,-0.24129
2084,-0.23621999999999999
2085,-0.2286
2086,-0.22021
2087,-0.21613000000000002
2088,-0.2138
2089,-0.20795
2090,-0.20034000000000002
2091,-0.19527
2092,-0.18688
2093,-0.17927
2094,-0.17342
2095,-0.16855
2096,-0.16366
2097,-0.15859
2098,-0.15099
2099,-0.14338
2100,-0.13577999999999998
2101,-0.12739
2102,-0.11979000000000001
2103,-0.11217
2104,-0.10632
2105,-0.10223
2106,-0.099875
2107,-0.091486
2108,-0.083097
2109,-0.078191
2110,-0.073267
2111,-0.069937
2112,-0.061548
2113,-0.053159000000000005
2114,-0.048213
2115,-0.043252
2116,-0.035677
2117,-0.0281
2118,-0.023046
2119,-0.015465999999999999
2120,-0.007880400000000001
2121,0.00050863
2122,0.008093600000000001
2123,0.015681999999999998
2124,0.020742
2125,0.028332
2126,0.03419
2127,0.036594
2128,0.041542
2129,0.049122000000000006
2130,0.057511
2131,0.060849
2132,0.06581000000000001
2133,0.07078999999999999
2134,0.07836
2135,0.08593200000000001
2136,0.09350399999999999
2137,0.10189
2138,0.10694000000000001
2139,0.11452000000000001
2140,0.1221
2141,0.12796
2142,0.1304
2143,0.13538
2144,0.13790999999999998
2145,0.1463
2146,0.15469000000000002
2147,0.15716
2148,0.16217
2149,0.16973
2150,0.17729
2151,0.18316
2152,0.19072
2153,0.19827999999999998
2154,0.20329
2155,0.20831
2156,0.21419000000000002
2157,0.22257
2158,0.22760999999999998
2159,0.23013000000000003
2160,0.23518000000000003
2161,0.24106
2162,0.24945
2163,0.25617
2164,0.25788
2165,0.26297
2166,0.2705
2167,0.27888
2168,0.28312
2169,0.28822
2170,0.29496999999999995
2171,0.30085
2172,0.30837
2173,0.31099
2174,0.31611999999999996
2175,0.31877
2176,0.32144
2177,0.32661
2178,0.33161
2179,0.34
2180,0.34429
2181,0.34699
2182,0.34970999999999997
2183,0.35494000000000003
2184,0.35678000000000004
2185,0.35954
2186,0.36232
2187,0.36512
2188,0.36854000000000003
2189,0.37692
2190,0.38437
2191,0.38624
2192,0.38906999999999997
2193,0.39191
2194,0.39476999999999995
2195,0.39764
2196,0.40053
2197,0.40344
2198,0.40539000000000003
2199,0.40833
2200,0.40093
2201,0.39453
2202,0.39405
2203,0.39704
2204,0.39903
2205,0.40205
2206,0.40508
2207,0.40812
2208,0.41118999999999994
2209,0.41181999999999996
2210,0.41491999999999996
2211,0.41698999999999997
2212,0.42012
2213,0.41385
2214,0.40759
2215,0.40029000000000003
2216,0.39299
2217,0.38675
2218,0.38888
2219,0.38966
2220,0.38587
2221,0.3786
2222,0.37133
2223,0.36406
2224,0.35679
2225,0.35195
2226,0.34469
2227,0.33743
2228,0.33018000000000003
2229,0.32293
2230,0.31568
2231,0.30976
2232,0.30405
2233,0.29836
2234,0.2911
2235,0.28385
2236,0.2766
2237,0.26935
2238,0.26453000000000004
2239,0.25729
2240,0.24894000000000002
2241,0.24170999999999998
2242,0.23448000000000002
2243,0.22725
2244,0.22021
2245,0.21799000000000002
2246,0.21227
2247,0.20503000000000002
2248,0.19779000000000002
2249,0.19055999999999998
2250,0.18222
2251,0.1774
2252,0.17407999999999998
2253,0.16835
2254,0.16242
2255,0.15517999999999998
2256,0.14795
2257,0.14071
2258,0.13589
2259,0.12867
2260,0.12145
2261,0.11423
2262,0.10589000000000001
2263,0.098675
2264,0.09146599999999999
2265,0.086661
2266,0.079455
2267,0.072255
2268,0.065059
2269,0.057866999999999995
2270,0.050679
2271,0.045888
2272,0.038706
2273,0.03163
2274,0.025814
2275,0.021141999999999998
2276,0.01395
2277,0.0067615999999999996
2278,0.0019725999999999997
2279,-0.0052093999999999994
2280,-0.013534000000000001
2281,-0.020708
2282,-0.027880000000000002
2283,-0.035048
2284,-0.042212
2285,-0.046985
2286,-0.054077
2287,-0.059928999999999996
2288,-0.064623
2289,-0.07179400000000001
2290,-0.080117
2291,-0.084893
2292,-0.092056
2293,-0.099214
2294,-0.10269
2295,-0.10854000000000001
2296,-0.11447
2297,-0.12164000000000001
2298,-0.12757000000000002
2299,-0.13474
2300,-0.1419
2301,-0.14545
2302,-0.1513
2303,-0.15953
2304,-0.16671
2305,-0.17149
2306,-0.17981
2307,-0.18697
2308,-0.19413
2309,-0.19999
2310,-0.20345
2311,-0.20938
2312,-0.21416
2313,-0.22133000000000003
2314,-0.2285
2315,-0.23681999999999997
2316,-0.24397
2317,-0.25113
2318,-0.2559
2319,-0.26183
2320,-0.26532
2321,-0.27118000000000003
2322,-0.27834000000000003
2323,-0.2855
2324,-0.29381999999999997
2325,-0.29859
2326,-0.30574
2327,-0.31045
2328,-0.31632
2329,-0.32341
2330,-0.33057
2331,-0.33773000000000003
2332,-0.34365999999999997
2333,-0.35081
2334,-0.35791
2335,-0.36378
2336,-0.36848000000000003
2337,-0.37564000000000003
2338,-0.38042
2339,-0.38873
2340,-0.39589
2341,-0.40304
2342,-0.40653
2343,-0.41239
2344,-0.41831999999999997
2345,-0.4231
2346,-0.43141999999999997
2347,-0.43858
2348,-0.44573
2349,-0.45283
2350,-0.45869
2351,-0.46578
2352,-0.47056000000000003
2353,-0.47772
2354,-0.48603999999999997
2355,-0.49318999999999996
2356,-0.50034
2357,-0.50748
2358,-0.5122399999999999
2359,-0.51935
2360,-0.52523
2361,-0.53233
2362,-0.5394800000000001
2363,-0.5466300000000001
2364,-0.55494
2365,-0.5597
2366,-0.56684
2367,-0.57397
2368,-0.58109
2369,-0.5858300000000001
2370,-0.5917399999999999
2371,-0.59647
2372,-0.60123
2373,-0.60837
2374,-0.6155
2375,-0.6238
2376,-0.63093
2377,-0.6380399999999999
2378,-0.64279
2379,-0.64989
2380,-0.65347
2381,-0.6594
2382,-0.66533
2383,-0.67245
2384,-0.68076
2385,-0.6855
2386,-0.69262
2387,-0.69855
2388,-0.70212
2389,-0.70804
2390,-0.71517
2391,-0.72347
2392,-0.72822
2393,-0.73534
2394,-0.74245
2395,-0.74839
2396,-0.75432
2397,-0.76025
2398,-0.765
2399,-0.77331
2400,-0.7804300000000001
2401,-0.78754
2402,-0.79347
2403,-0.79704
2404,-0.80296
2405,-0.80771
2406,-0.81484
2407,-0.82314
2408,-0.83026
2409,-0.8373700000000001
2410,-0.8421200000000001
2411,-0.84806
2412,-0.8504200000000001
2413,-0.85755
2414,-0.8658600000000001
2415,-0.87177
2416,-0.8776799999999999
2417,-0.88361
2418,-0.89075
2419,-0.8955
2420,-0.90381
2421,-0.91094
2422,-0.91806
2423,-0.92396
2424,-0.92869
2425,-0.9346200000000001
2426,-0.94176
2427,-0.94765
2428,-0.95352
2429,-0.95945
2430,-0.9666100000000001
2431,-0.9737600000000001
2432,-0.9785299999999999
2433,-0.9868399999999999
2434,-0.99398
2435,-1.0011
2436,-1.0082
2437,-1.013
2438,-1.0189
2439,-1.0212
2440,-1.0284
2441,-1.0367
2442,-1.045
2443,-1.0484
2444,-1.0544
2445,-1.0591
2446,-1.0675
2447,-1.0746
2448,-1.0818
2449,-1.0877
2450,-1.0912
2451,-1.097
2452,-1.1018
2453,-1.1101
2454,-1.1161
2455,-1.1219
2456,-1.1277
2457,-1.1349
2458,-1.1421
2459,-1.1469
2460,-1.1552
2461,-1.1635
2462,-1.1694
2463,-1.1752
2464,-1.1824
2465,-1.1883
2466,-1.1954
2467,-1.1988
2468,-1.2035
2469,-1.2107
2470,-1.2179
2471,-1.2262
2472,-1.2309999999999999
2473,-1.2382
2474,-1.2416
2475,-1.2474
2476,-1.2533
2477,-1.2616
2478,-1.2687
2479,-1.2733
2480,-1.2767
2481,-1.2839
2482,-1.2922
2483,-1.2969
2484,-1.3026
2485,-1.3048
2486,-1.3119999999999998
2487,-1.3204
2488,-1.3261
2489,-1.3317
2490,-1.3376
2491,-1.3449
2492,-1.3498
2493,-1.3581
2494,-1.3654
2495,-1.3713
2496,-1.3746
2497,-1.3802
2498,-1.3886
2499,-1.3934
2500,-1.3993
2501,-1.405
2502,-1.4106
2503,-1.4179
2504,-1.4252
2505,-1.4311
2506,-1.4384
2507,-1.4467
2508,-1.4524
2509,-1.4555
2510,-1.4628
2511,-1.4701
2512,-1.475
2513,-1.4823
2514,-1.4896
2515,-1.4979
2516,-1.5052
2517,-1.5125
2518,-1.5197
2519,-1.5246
2520,-1.5318
2521,-1.5391
2522,-1.5463
2523,-1.5544
2524,-1.5601
2525,-1.5661
2526,-1.5709
2527,-1.5781
2528,-1.5854
2529,-1.5926
2530,-1.5998
2531,-1.607
2532,-1.6130000000000002
2533,-1.6202
2534,-1.6274
2535,-1.6345
2536,-1.6417
2537,-1.6489
2538,-1.656
2539,-1.6608
2540,-1.6679
2541,-1.6751
2542,-1.681
2543,-1.6881
2544,-1.6952
2545,-1.7022
2546,-1.7069999999999999
2547,-1.7056
2548,-1.7019
2549,-1.7053
2550,-1.7123
2551,-1.7192
2552,-1.7239
2553,-1.7308
2554,-1.7365
2555,-1.7434
2556,-1.7503
2557,-1.7572
2558,-1.7641
2559,-1.7687
2560,-1.7755
2561,-1.7824
2562,-1.7892
2563,-1.796
2564,-1.8028
2565,-1.8096
2566,-1.8141
2567,-1.8208
2568,-1.8276
2569,-1.8343
2570,-1.841
2571,-1.8476
2572,-1.8521
2573,-1.8587
2574,-1.858
2575,-1.8558
2576,-1.8549
2577,-1.8615
2578,-1.868
2579,-1.8723
2580,-1.8788
2581,-1.8853
2582,-1.8917
2583,-1.8981
2584,-1.9045
2585,-1.9109
2586,-1.9151
2587,-1.9215
2588,-1.9278
2589,-1.9341
2590,-1.9387
2591,-1.9449
2592,-1.949
2593,-1.9552
2594,-1.9614
2595,-1.9675
2596,-1.9736
2597,-1.9796
2598,-1.9819
2599,-1.9804
2600,-1.9751
2601,-1.9791
2602,-1.9832
2603,-1.9891
2604,-1.9949
2605,-2.0007
2606,-2.0046
2607,-2.0103
2608,-2.0141
2609,-2.0198
2610,-2.0254
2611,-2.031
2612,-2.0271
2613,-2.0233
2614,-2.0212
2615,-2.0266
2616,-2.032
2617,-2.0374
2618,-2.0427
2619,-2.0462
2620,-2.0514
2621,-2.0566
2622,-2.0617
2623,-2.0668
2624,-2.0719
2625,-2.0748
2626,-2.0781
2627,-2.083
2628,-2.0879
2629,-2.0927
2630,-2.0974
2631,-2.1021
2632,-2.1067
2633,-2.1098
2634,-2.1033
2635,-2.0982
2636,-2.1005
2637,-2.1049
2638,-2.1092
2639,-2.112
2640,-2.1163
2641,-2.1204
2642,-2.1245
2643,-2.1263
2644,-2.1302
2645,-2.1341
2646,-2.1367
2647,-2.1405
2648,-2.1442
2649,-2.1479
2650,-2.1514
2651,-2.155
2652,-2.1513
2653,-2.1465
2654,-2.1405
2655,-2.1438
2656,-2.147
2657,-2.1502
2658,-2.1533
2659,-2.1553
2660,-2.1558
2661,-2.1587
2662,-2.1615
2663,-2.1642
2664,-2.1668
2665,-2.1635
2666,-2.1593
2667,-2.1551
2668,-2.1542
2669,-2.1565
2670,-2.1588
2671,-2.1609
2672,-2.1630000000000003
2673,-2.1644
2674,-2.1663
2675,-2.1656
2676,-2.1674
2677,-2.1691
2678,-2.1707
2679,-2.1717
2680,-2.1732
2681,-2.1715
2682,-2.1641
2683,-2.1566
2684,-2.1578
2685,-2.1590000000000003
2686,-2.1597
2687,-2.1607
2688,-2.1616
2689,-2.1597
2690,-2.1604
2691,-2.1611
2692,-2.1616
2693,-2.1619
2694,-2.1623
2695,-2.1626
2696,-2.1628
2697,-2.1576
2698,-2.1496
2699,-2.1443
2700,-2.1444
2701,-2.1444
2702,-2.1444
2703,-2.1444
2704,-2.1444
2705,-2.1444
2706,-2.1444
2707,-2.1444
2708,-2.1444
