time,value
0,-0.18781
1,-0.18781
2,-0.18781
3,-0.18781
4,-0.18781
5,-0.18781
6,-0.18781
7,-0.18781
8,-0.18781
9,-0.18781
10,-0.18781
11,-0.18781
12,-0.18781
13,-0.18781
14,-0.18781
15,-0.18781
16,-0.18781
17,-0.18781
18,-0.18781
19,-0.18781
20,-0.18781
21,-0.18781
22,-0.18781
23,-0.18781
24,-0.18781
25,-0.18781
26,-0.18781
27,-0.18781
28,-0.18781
29,-0.18781
30,-0.18781
31,-0.18781
32,-0.18781
33,-0.18781
34,-0.18781
35,-0.18781
36,-0.18781
37,-0.18781
38,-0.18781
39,-0.18781
40,-0.18781
41,-0.18781
42,-0.18781
43,-0.18781
44,-0.18781
45,-0.18781
46,-0.18781
47,-0.18781
48,-0.18781
49,-0.18781
50,-0.18781
51,-0.18781
52,-0.18781
53,-0.18781
54,-0.18781
55,-0.18781
56,-0.18781
57,-0.18781
58,-0.18781
59,-0.18781
60,-0.18781
61,-0.18781
62,-0.18781
63,-0.18781
64,-0.18781
65,-0.18781
66,-0.18781
67,-0.18781
68,-0.18781
69,-0.18781
70,-0.18781
71,-0.18781
72,-0.18781
73,-0.18781
74,-0.18781
75,-0.18781
76,-0.18781
77,-0.18781
78,-0.18781
79,-0.18781
80,-0.18781
81,-0.18781
82,0.034779000000000004
83,3.0026
84,4.1341
85,0.14607
86,0.14607
87,1.2405
88,8.0108
89,-0.18781
90,-0.18781
91,-0.18781
92,-0.18781
93,-0.18781
94,-0.18781
95,-0.18781
