time,value
0,-0.30946
1,0.0
2,-0.30946
3,-0.30946
4,-0.30946
5,0.0
6,-0.30946
7,-0.30946
8,-0.30946
9,0.0
10,-0.30946
11,-0.30946
12,-0.30946
13,0.0
14,-0.30946
15,-0.30946
16,-0.30946
17,0.0
18,-0.30946
19,-0.30946
20,-0.30946
21,0.0
22,-0.30946
23,-0.30946
24,-0.30946
25,-0.30946
26,-0.30946
27,0.0
28,-0.30946
29,-0.30946
30,-0.30946
31,-0.30946
32,0.0
33,-0.30946
34,-0.30946
35,-0.30946
36,-0.30946
37,0.0
38,-0.30946
39,-0.30946
40,-0.30946
41,-0.30946
42,0.0
43,-0.30946
44,-0.30946
45,-0.30946
46,-0.30946
47,-0.30946
48,0.0
49,-0.30946
50,-0.30946
51,-0.30946
52,-0.30946
53,-0.30946
54,-0.30946
55,-0.30946
56,-0.30946
57,0.0
58,-0.30946
59,-0.30946
60,-0.30946
61,-0.30946
62,-0.30946
63,-0.30946
64,-0.30946
65,-0.30946
66,0.0
67,-0.30946
68,-0.30946
69,-0.30946
70,-0.30946
71,-0.30946
72,-0.30946
73,0.61892
74,0.30946
75,0.30946
76,5.5703
77,6.4987
78,3.7135
79,-0.30946
80,0.0
81,-0.30946
82,0.0
83,-0.30946
84,0.0
85,0.0
86,0.30946
87,0.61892
88,0.30946
89,0.61892
90,-0.30946
91,0.0
92,0.0
93,0.30946
94,0.30946
95,0.30946
