time,value
0,1.3011
1,1.3011
2,1.2495
3,1.3011
4,1.3011
5,-0.14409
6,-0.86667
7,-0.81506
8,-0.86667
9,-0.86667
10,-0.86667
11,-0.6086
12,-0.55699
13,-0.66022
14,-0.66022
15,-0.66022
16,-0.66022
17,-0.66022
18,-0.66022
19,-0.71183
20,-0.76344
21,-0.86667
22,-0.86667
23,-0.86667
24,-0.86667
25,-0.86667
26,-0.86667
27,-0.86667
28,-0.86667
29,-0.86667
30,-0.86667
31,-0.45377
32,1.3011
33,1.2495
34,1.0946
35,1.043
36,1.043
37,1.043
38,1.0946
39,1.043
40,1.1462
41,1.043
42,1.043
43,1.0946
44,0.16559000000000001
45,-0.86667
46,-0.86667
47,-0.86667
48,-0.86667
49,-0.86667
50,-0.86667
51,-0.86667
52,-0.86667
53,-0.86667
54,-0.86667
55,-0.86667
56,-0.76344
57,-0.86667
58,-0.86667
59,-0.86667
60,-0.86667
61,-0.86667
62,-0.86667
63,-0.86667
64,-0.86667
65,-0.86667
66,-0.86667
67,-0.9182799999999999
68,-0.86667
69,-0.86667
70,-0.86667
71,-0.86667
72,-0.86667
73,-0.86667
74,-0.86667
75,0.32043
76,1.3527
77,1.3011
78,1.3011
79,1.3011
80,1.3011
81,1.3011
82,1.3011
83,1.3011
84,1.2495
85,1.2495
86,1.3011
87,1.2495
88,1.3011
89,1.3011
90,1.3011
91,1.3011
92,1.3011
93,1.3011
94,1.3011
95,1.3011
