time,value
0,1.5164
1,0.50244
2,-1.0185
3,-0.80119
4,1.5888
5,0.21275
6,-1.0185
7,-0.29422
8,1.5164
9,-0.29422
10,-1.0185
11,0.35759
12,1.444
13,-1.0185
14,-1.0185
15,0.86456
16,1.0094
17,-1.0185
18,-1.0185
19,1.2991
20,0.57487
21,-1.0185
22,-0.72877
23,1.5888
24,-0.076951
25,-1.0185
26,-0.076951
27,1.444
28,-0.80119
29,-1.0185
30,0.86456
31,0.86456
32,-1.0185
33,-1.0185
34,1.6612
35,0.6472899999999999
36,-1.0185
37,-0.8736200000000001
38,1.5888
39,-0.076951
40,-1.0185
41,-0.076951
42,1.5164
43,-0.8736200000000001
44,-1.0185
45,0.6472899999999999
46,1.0094
47,-1.0185
48,-1.0185
49,1.3715
50,0.21275
51,-1.0185
52,-0.2218
53,1.5888
54,-0.72877
55,-1.0185
56,0.57487
57,1.0818
58,-1.0185
59,-1.0185
60,1.2991
61,0.28517
62,-1.0185
63,-0.2218
64,1.5164
65,-0.29422
66,-1.0185
67,0.35759
68,1.444
69,-0.8736200000000001
70,-1.0185
71,1.1543
72,1.3715
73,-1.0185
74,-1.0185
75,1.0818
76,0.21275
77,-1.0185
78,-0.5115
79,1.5888
80,-0.72877
81,-1.0185
82,0.6472899999999999
83,0.7197100000000001
84,-1.0185
85,-1.0185
86,1.3715
87,-0.076951
88,-1.0185
89,-0.076951
90,1.3715
91,-1.0185
92,-1.0185
93,0.93699
94,0.43001999999999996
95,-1.0185
