time,value
0,-0.7218399999999999
1,-0.7218399999999999
2,-0.7218399999999999
3,-0.7218399999999999
4,-0.7218399999999999
5,-0.7218399999999999
6,-0.37535999999999997
7,1.7035
8,1.7035
9,1.5303
10,-0.7218399999999999
11,-0.7218399999999999
12,-0.7218399999999999
13,-0.7218399999999999
14,-0.7218399999999999
15,-0.7218399999999999
16,-0.7218399999999999
17,0.8373299999999999
18,1.7035
19,1.5303
20,0.31761
21,-0.7218399999999999
22,-0.7218399999999999
23,-0.7218399999999999
24,-0.7218399999999999
25,-0.7218399999999999
26,-0.7218399999999999
27,-0.20212
28,1.8768
29,1.5303
30,1.3571
31,-0.7218399999999999
32,-0.7218399999999999
33,-0.7218399999999999
34,-0.7218399999999999
35,-0.7218399999999999
36,-0.7218399999999999
37,-0.7218399999999999
38,1.0106
39,1.7035
40,1.5303
41,0.14437
42,-0.7218399999999999
43,-0.7218399999999999
44,-0.7218399999999999
45,-0.7218399999999999
46,-0.7218399999999999
47,-0.7218399999999999
48,0.49085
49,1.7035
50,1.5303
51,0.49085
52,-0.7218399999999999
53,-0.7218399999999999
54,-0.7218399999999999
55,-0.7218399999999999
56,-0.7218399999999999
57,-0.7218399999999999
58,0.14437
59,1.7035
60,1.1838
61,1.5303
62,-0.028874
63,-0.7218399999999999
64,-0.7218399999999999
65,-0.7218399999999999
66,-0.7218399999999999
67,-0.7218399999999999
68,-0.7218399999999999
69,0.66409
70,1.7035
71,1.5303
72,1.5303
73,-0.028874
74,-0.7218399999999999
75,-0.7218399999999999
76,-0.7218399999999999
77,-0.7218399999999999
78,-0.7218399999999999
79,-0.7218399999999999
80,0.66409
81,1.7035
82,1.5303
83,1.1838
84,-0.7218399999999999
85,-0.7218399999999999
86,-0.7218399999999999
87,-0.7218399999999999
88,-0.7218399999999999
89,-0.7218399999999999
90,1.8768
91,1.7035
92,1.5303
93,-0.37535999999999997
94,-0.7218399999999999
95,-0.7218399999999999
