time,value
0,-0.64675
1,-0.64675
2,-0.64675
3,1.5707
4,1.1675
5,-0.64675
6,-0.64675
7,-0.64675
8,1.3691
9,1.3691
10,-0.64675
11,-0.64675
12,-0.64675
13,0.56275
14,1.9738
15,-0.64675
16,-0.64675
17,-0.64675
18,-0.64675
19,2.1754
20,0.15959
21,-0.64675
22,-0.64675
23,-0.64675
24,0.7643399999999999
25,1.9738
26,-0.64675
27,-0.64675
28,-0.64675
29,-0.64675
30,1.3691
31,1.1675
32,-0.64675
33,-0.64675
34,-0.64675
35,-0.64675
36,1.7723
37,0.9659200000000001
38,-0.64675
39,-0.64675
40,-0.64675
41,-0.64675
42,2.1754
43,0.36117
44,-0.64675
45,-0.64675
46,-0.64675
47,-0.64675
48,2.1754
49,0.15959
50,-0.64675
51,-0.64675
52,-0.64675
53,-0.64675
54,2.377
55,0.36117
56,-0.64675
57,-0.64675
58,-0.64675
59,-0.64675
60,1.9738
61,0.56275
62,-0.64675
63,-0.64675
64,-0.64675
65,-0.64675
66,1.7723
67,0.7643399999999999
68,-0.64675
69,-0.64675
70,-0.64675
71,-0.64675
72,1.3691
73,1.1675
74,-0.64675
75,-0.64675
76,-0.64675
77,-0.64675
78,0.9659200000000001
79,1.7723
80,-0.64675
81,-0.64675
82,-0.64675
83,-0.64675
84,0.36117
85,2.1754
86,-0.64675
87,-0.64675
88,-0.64675
89,-0.64675
90,-0.041997
91,2.1754
92,-0.24358000000000002
93,-0.64675
94,-0.64675
95,-0.64675
