time,value
0,-0.13225
1,-0.18547
2,-0.16773
3,-0.1358
4,-0.2032
5,-0.18192
6,-0.15709
7,-0.19255999999999998
8,-0.18547
9,-0.15709
10,-0.19966
11,-0.17837
12,-0.15354
13,-0.20675
14,-0.17482
15,-0.1429
16,-0.2032
17,-0.18900999999999998
18,-0.14644000000000001
19,-0.19966
20,-0.18900999999999998
21,-0.15709
22,-0.19610999999999998
23,-0.19255999999999998
24,-0.15354
25,-0.2032
26,-0.17128
27,-0.15354
28,-0.2032
29,-0.17837
30,-0.1429
31,-0.20675
32,-0.17482
33,-0.16418
34,-0.18900999999999998
35,-0.16773
36,-0.16063
37,-0.19255999999999998
38,-0.1358
39,-0.15709
40,-0.18547
41,-0.12871
42,-0.16063
43,-0.17482
44,-0.13935
45,-0.18547
46,-0.17482
47,-0.15709
48,-0.17837
49,-0.14999
50,-0.15709
51,-0.19610999999999998
52,-0.15709
53,-0.17128
54,-0.19255999999999998
55,-0.14999
56,-0.18547
57,-0.17128
58,-0.14644000000000001
59,-0.19610999999999998
60,-0.17482
61,-0.14999
62,-0.19610999999999998
63,-0.16063
64,-0.17482
65,-0.18547
66,-0.14644000000000001
67,-0.18547
68,-0.18547
69,-0.1358
70,-0.2032
71,-0.18192
72,-0.17128
73,-0.19610999999999998
74,-0.16418
75,-0.18547
76,-0.19255999999999998
77,-0.13935
78,-0.19255999999999998
79,-0.15354
80,-0.14644000000000001
81,3.3585
82,7.6474
83,4.7455
84,-0.11097
85,-0.10387
86,-0.14644000000000001
87,-0.1429
88,-0.11097
89,-0.18192
90,-0.15709
91,-0.15709
92,-0.18900999999999998
93,-0.1429
94,-0.18192
95,-0.16418
