time,value
0,-0.21070999999999998
1,-0.21070999999999998
2,-0.21070999999999998
3,-0.21070999999999998
4,-0.21070999999999998
5,-0.21070999999999998
6,-0.21070999999999998
7,-0.21070999999999998
8,-0.21070999999999998
9,-0.21070999999999998
10,-0.21070999999999998
11,-0.21070999999999998
12,-0.21070999999999998
13,-0.21070999999999998
14,-0.21070999999999998
15,-0.21070999999999998
16,-0.21070999999999998
17,-0.21070999999999998
18,-0.21070999999999998
19,-0.21070999999999998
20,-0.21070999999999998
21,-0.21070999999999998
22,-0.21070999999999998
23,-0.21070999999999998
24,-0.21070999999999998
25,-0.21070999999999998
26,-0.21070999999999998
27,-0.21070999999999998
28,-0.21070999999999998
29,-0.21070999999999998
30,1.4064
31,5.3122
32,0.22784000000000001
33,0.17302
34,-0.046252999999999996
35,-0.21070999999999998
36,-0.21070999999999998
37,-0.21070999999999998
38,-0.21070999999999998
39,-0.21070999999999998
40,-0.21070999999999998
41,-0.21070999999999998
42,0.88565
43,7.6694
44,1.0501
45,0.21413000000000001
46,0.24154
47,0.37859
48,0.18672
49,-0.21070999999999998
50,-0.21070999999999998
51,-0.21070999999999998
52,-0.21070999999999998
53,-0.21070999999999998
54,-0.21070999999999998
55,-0.21070999999999998
56,-0.21070999999999998
57,-0.21070999999999998
58,-0.21070999999999998
59,-0.21070999999999998
60,-0.21070999999999998
61,-0.21070999999999998
62,-0.21070999999999998
63,-0.21070999999999998
64,-0.21070999999999998
65,-0.21070999999999998
66,-0.21070999999999998
67,-0.21070999999999998
68,-0.21070999999999998
69,-0.21070999999999998
70,-0.21070999999999998
71,-0.21070999999999998
72,-0.21070999999999998
73,-0.21070999999999998
74,-0.21070999999999998
75,-0.21070999999999998
76,-0.21070999999999998
77,-0.21070999999999998
78,-0.21070999999999998
79,-0.21070999999999998
80,-0.21070999999999998
81,-0.21070999999999998
82,-0.21070999999999998
83,-0.21070999999999998
84,-0.21070999999999998
85,-0.21070999999999998
86,-0.21070999999999998
87,-0.21070999999999998
88,-0.21070999999999998
89,-0.21070999999999998
90,-0.21070999999999998
91,-0.21070999999999998
92,-0.21070999999999998
93,-0.21070999999999998
94,-0.21070999999999998
95,-0.21070999999999998
