[<text>
<title>specialty composites corp &lt;spcm.o&gt; 3rd qtr net</title>
<dateline>    newark, del., oct 19 -
    </dateline>shr 11 cts vs nine cts
    net 105,489 vs 88,929
    revs 2,306,697 vs 2,066,636
    nine mths
    shr 17 cts vs 14 cts
    net 167,960 vs 136,856
    revs 6,714,468 vs 6,026,343
    note: 1987 qtr and nine mths includes tax gain 64,200 dlrs
and 102,200 dlrs, respectively. 1986 qtr and nine mths includes
tax gain 78,000 dlrs and 107,000 dlrs, respectively.
 reuter
</text>]