time,value
0,2.3169
1,2.2396
2,2.1597
3,2.0707
4,1.9772
5,1.8905
6,1.8063
7,1.7211
8,1.6357
9,1.5542
10,1.4635
11,1.3778
12,1.2857
13,1.2054
14,1.1212
15,1.0288
16,0.95316
17,0.8653200000000001
18,0.77509
19,0.6986100000000001
20,0.60644
21,0.51672
22,0.43899
23,0.34945
24,0.26178
25,0.17312
26,0.084234
27,0.0076545
28,-0.07534199999999999
29,-0.14598
30,-0.13471
31,-0.11659000000000001
32,-0.090616
33,-0.07180700000000001
34,-0.061138
35,-0.053841
36,-0.057027
37,-0.092296
38,-0.12097000000000001
39,-0.17624
40,-0.22128
41,-0.27603
42,-0.32997
43,-0.34975
44,-0.37144
45,-0.38469000000000003
46,-0.37983
47,-0.37401999999999996
48,-0.36915
49,-0.37175
50,-0.37177
51,-0.37731
52,-0.3859
53,-0.39923000000000003
54,-0.40908
55,-0.41853999999999997
56,-0.41258
57,-0.39485
58,-0.37432
59,-0.39061999999999997
60,-0.44018
61,-0.49258
62,-0.53732
63,-0.59558
64,-0.6663600000000001
65,-0.7245699999999999
66,-0.79423
67,-0.86419
68,-0.92271
69,-0.9945
70,-1.0679
71,-1.1881
72,-1.2501
73,-1.3013
74,-1.3264
75,-1.3409
76,-1.3343
77,-1.3183
78,-1.2861
79,-1.2655
80,-1.2281
81,-1.2005
82,-1.1732
83,-1.1417
84,-1.1075
85,-1.075
86,-1.0221
87,-0.9562700000000001
88,-0.8780100000000001
89,-0.79487
90,-0.69716
91,-0.63556
92,-0.54461
93,-0.44143000000000004
94,-0.34553
95,-0.3798
96,-0.47563
97,-0.56592
98,-0.6580199999999999
99,-0.75444
100,-0.8514799999999999
101,-0.92884
102,-1.0193
103,-1.102
104,-1.1937
105,-1.2735
106,-1.3669
107,-1.4244
108,-1.4298
109,-1.4102
110,-1.3974
111,-1.3595
112,-1.3090000000000002
113,-1.2635
114,-1.2009
115,-1.1406
116,-1.0646
117,-0.9818
118,-0.89041
119,-0.79568
120,-0.70301
121,-0.61056
122,-0.51812
123,-0.54167
124,-0.46326999999999996
125,-0.37656
126,-0.28884
127,-0.20103
128,-0.10809
129,-0.021845
130,0.05533099999999999
131,0.013246
132,-0.080011
133,-0.20132
134,-0.32245999999999997
135,-0.41608999999999996
136,-0.5090399999999999
137,-0.586
138,-0.66868
139,-0.74868
140,-0.80595
141,-0.86835
142,-0.9225700000000001
143,-0.9585600000000001
144,-0.9557100000000001
145,-0.8965700000000001
146,-0.83706
147,-0.75834
148,-0.68437
149,-0.5965199999999999
150,-0.5148
151,-0.43921000000000004
152,-0.35596
153,-0.26921999999999996
154,-0.18795
155,-0.1075
156,-0.031666
157,0.041092000000000004
158,0.12397000000000001
159,0.21761
160,0.29636
161,0.3849
162,0.46908
163,0.55379
164,0.64293
165,0.72587
166,0.8063100000000001
167,0.88465
168,0.96509
169,1.0551
170,1.0769
171,1.0849
172,0.9985299999999999
173,0.90199
174,0.80948
175,0.72826
176,0.67938
177,0.67047
178,0.73766
179,0.8214
180,0.8909799999999999
181,0.9835299999999999
182,1.0673
183,1.1445
184,1.2378
185,1.3141
186,1.4093
187,1.4929
188,1.5677
189,1.6392
190,1.6359
191,1.7187
192,1.8051
193,1.8864
194,1.9673
195,2.0147
196,1.9403
197,1.8447
198,1.7593
199,1.6835
200,1.6156
201,1.5927
202,1.5001
203,1.4191
204,1.334
205,1.2435
206,1.1612
207,1.0766
208,0.98903
209,0.8966299999999999
210,0.8186899999999999
211,0.72623
212,0.6480899999999999
213,0.55656
214,0.47603
215,0.38869000000000004
216,0.30294
217,0.21996
218,0.1466
219,0.16968
220,0.25355
221,0.35381
222,0.45485
223,0.54374
224,0.63257
225,0.70687
226,0.79071
227,0.71714
228,0.63712
229,0.55114
230,0.46536000000000005
231,0.37640999999999997
232,0.35181
233,0.2692
234,0.17564000000000002
235,0.08770499999999999
236,0.0023756999999999997
237,-0.08382300000000001
238,-0.17085999999999998
239,-0.25533
240,-0.3462
241,-0.43341999999999997
242,-0.50737
243,-0.58831
244,-0.67792
245,-0.7569899999999999
246,-0.83311
247,-0.9155200000000001
248,-0.98498
249,-1.0639
250,-1.1381
251,-1.2054
252,-1.2593
253,-1.3081
254,-1.3336
255,-1.3367
256,-1.3193
257,-1.2856
258,-1.232
259,-1.1637
260,-1.1028
261,-1.026
262,-0.9601700000000001
263,-0.8712
264,-0.7817
265,-0.69215
266,-0.60238
267,-0.51234
268,-0.40353
269,-0.30058
270,-0.17932
271,-0.057339999999999995
272,0.040038
273,0.12061
274,0.23913
275,0.32606
276,0.41317
277,0.43635
278,0.37054000000000004
279,0.28689000000000003
280,0.21391999999999997
281,0.13447
282,0.066919
283,-0.022357
284,-0.10879000000000001
285,-0.21270999999999998
286,-0.28969
287,-0.34763
288,-0.38382
289,-0.30158
290,-0.20743000000000003
291,-0.23701
292,-0.32047
293,-0.40026999999999996
294,-0.50339
295,-0.58187
296,-0.68183
297,-0.76518
298,-0.8395799999999999
299,-0.9157
300,-1.0033
301,-1.0796
302,-1.1502
303,-1.2501
304,-1.3125
305,-1.3753
306,-1.4617
307,-1.5176
308,-1.5702
309,-1.6064
310,-1.6454
311,-1.6771
312,-1.6868
313,-1.6793
314,-1.6531
315,-1.6114
316,-1.5573
317,-1.4801
318,-1.3732
319,-1.2890000000000001
320,-1.2017
321,-1.124
322,-1.0304
323,-0.9489200000000001
324,-0.8701399999999999
325,-0.7887
326,-0.7012
327,-0.63132
328,-0.54257
329,-0.4766
330,-0.39863000000000004
331,-0.32156
332,-0.24445999999999998
333,-0.17640999999999998
334,-0.10404000000000001
335,-0.099286
336,-0.18045999999999998
337,-0.24911
338,-0.31446
339,-0.36801
340,-0.42378000000000005
341,-0.47602
342,-0.52751
343,-0.57506
344,-0.6108100000000001
345,-0.64674
346,-0.67798
347,-0.69967
348,-0.7171
349,-0.74307
350,-0.75734
351,-0.75884
352,-0.75159
353,-0.7384
354,-0.70972
355,-0.67648
356,-0.63832
357,-0.5833
358,-0.53786
359,-0.48623999999999995
360,-0.45363000000000003
361,-0.38954
362,-0.33974
363,-0.28828000000000004
364,-0.25627
365,-0.23764000000000002
366,-0.21491999999999997
367,-0.20437
368,-0.19288
369,-0.17857
370,-0.17326
371,-0.17382
372,-0.1547
373,-0.10013
374,-0.18107
375,-0.1894
376,-0.10878
377,-0.017621
378,0.068347
379,0.15730999999999998
380,0.24078000000000002
381,0.32434
382,0.40567
383,0.49637
384,0.58282
385,0.67119
386,0.75837
387,0.84178
388,0.92517
389,1.0064
390,1.0992
391,1.188
392,1.2832
393,1.3589
394,1.4518
395,1.534
396,1.6273
397,1.7134
398,1.7885
399,1.8880000000000001
400,1.9744
401,2.05
402,2.1527
403,2.1841
404,2.0949
405,2.0032
406,1.9223
407,1.8295
408,1.7534
409,1.6594
410,1.5679
411,1.4965
412,1.3956
413,1.3112
414,1.2522
415,1.3348
416,1.425
417,1.5113
418,1.6034
419,1.6815
420,1.7754
421,1.8538
422,1.9463
423,2.0331
424,2.1124
425,2.1949
426,2.2921
