[<text>
<title>circus circus enterprises &lt;cir&gt; 4th qtr net</title>
<dateline>    las vegas, nev., march 16 -
    </dateline>oper shr 16 cts vs 14 cts
    oper net 5,818,000 vs 5,284,000
    revs 88.2 mln vs 69.7 mln
    year
    oper shr 96 cts vs one dlr
    oper net 36,101,000 vs 37,375,000
    revs 374.0 mln vs 307.0 mln
    note: current qtr and year figures exclude extraordinary
losses on early debt retirement of 1.7 mln dlrs, or five cts
per share and 7.9 mln dlrs, or 21 cts per share, respectively.
    full name circus circus enterprises inc.
 reuter
</text>]