time,value
0,-0.6667
1,-0.6667
2,-0.6667
3,-0.6667
4,0.90714
5,1.9564
6,0.90714
7,-0.6667
8,-0.6667
9,-0.6667
10,-0.6667
11,-0.6667
12,0.5574
13,1.9564
14,1.2569
15,-0.6667
16,-0.6667
17,-0.6667
18,-0.6667
19,-0.6667
20,-0.6667
21,1.9564
22,1.7815
23,0.20765999999999998
24,-0.6667
25,-0.6667
26,-0.6667
27,-0.6667
28,-0.6667
29,-0.14207999999999998
30,1.9564
31,1.6066
32,0.20765999999999998
33,-0.6667
34,-0.6667
35,-0.6667
36,-0.6667
37,-0.6667
38,0.90714
39,1.7815
40,1.2569
41,-0.6667
42,-0.6667
43,-0.6667
44,-0.6667
45,-0.6667
46,-0.6667
47,1.7815
48,1.7815
49,0.20765999999999998
50,-0.6667
51,-0.6667
52,-0.6667
53,-0.6667
54,-0.6667
55,0.032788
56,1.9564
57,1.4318
58,-0.6667
59,-0.6667
60,-0.6667
61,-0.6667
62,-0.6667
63,-0.6667
64,1.082
65,1.9564
66,0.73227
67,-0.6667
68,-0.6667
69,-0.6667
70,-0.6667
71,-0.6667
72,-0.31695
73,1.9564
74,1.7815
75,-0.6667
76,-0.6667
77,-0.6667
78,-0.6667
79,-0.6667
80,-0.6667
81,0.38253000000000004
82,1.9564
83,1.2569
84,-0.6667
85,-0.6667
86,-0.6667
87,-0.6667
88,-0.6667
89,1.4318
90,1.9564
91,0.90714
92,-0.6667
93,-0.6667
94,-0.6667
95,-0.6667
