time,value
0,-0.15309
1,-0.15309
2,-0.15309
3,-0.15309
4,-0.15309
5,-0.15309
6,-0.15309
7,-0.15309
8,-0.15309
9,-0.15309
10,-0.15309
11,-0.15309
12,-0.15309
13,-0.15309
14,-0.15309
15,-0.15309
16,-0.15309
17,-0.15309
18,-0.15309
19,-0.15309
20,-0.15309
21,-0.15309
22,-0.15309
23,-0.15309
24,-0.15309
25,-0.15309
26,-0.15309
27,-0.15309
28,-0.15309
29,-0.15309
30,-0.15309
31,-0.15309
32,-0.15309
33,-0.15309
34,-0.15309
35,-0.15309
36,-0.15309
37,-0.15309
38,-0.15309
39,-0.15309
40,-0.15309
41,-0.15309
42,-0.15309
43,-0.15309
44,-0.15309
45,-0.15309
46,-0.15309
47,-0.15309
48,-0.15309
49,-0.15309
50,-0.15309
51,-0.15309
52,-0.15309
53,-0.15309
54,-0.15309
55,-0.15309
56,-0.15309
57,-0.15309
58,-0.15309
59,-0.15309
60,-0.15309
61,-0.15309
62,-0.15309
63,-0.15309
64,-0.15309
65,-0.15309
66,-0.15309
67,-0.15309
68,-0.15309
69,-0.15309
70,-0.15309
71,-0.15309
72,-0.15309
73,-0.15309
74,0.91696
75,8.0395
76,5.2306
77,-0.10293
78,-0.15309
79,-0.15309
80,-0.15309
81,-0.15309
82,-0.15309
83,-0.15309
84,-0.15309
85,-0.15309
86,-0.15309
87,-0.15309
88,-0.15309
89,-0.15309
90,-0.15309
91,-0.15309
92,-0.15309
93,-0.15309
94,-0.15309
95,-0.15309
