time,value
0,-0.27898
1,-0.27898
2,-0.27898
3,-0.27898
4,-0.27898
5,-0.27898
6,-0.27898
7,-0.27898
8,-0.27898
9,-0.27898
10,-0.27898
11,-0.27898
12,-0.27898
13,-0.27898
14,-0.27898
15,-0.27898
16,-0.27898
17,-0.27898
18,-0.27898
19,-0.27898
20,-0.27898
21,-0.27898
22,-0.27898
23,-0.27898
24,-0.27898
25,-0.27898
26,-0.27898
27,-0.27898
28,-0.27898
29,-0.27898
30,-0.27898
31,3.5471
32,-0.27898
33,-0.27898
34,-0.27898
35,-0.27898
36,-0.27898
37,-0.27898
38,-0.27898
39,-0.27898
40,-0.27898
41,-0.27898
42,-0.27898
43,-0.27898
44,-0.27898
45,-0.27898
46,3.5471
47,-0.27898
48,-0.27898
49,-0.27898
50,-0.27898
51,-0.27898
52,-0.27898
53,-0.27898
54,-0.27898
55,-0.27898
56,-0.27898
57,-0.27898
58,-0.27898
59,-0.27898
60,-0.27898
61,-0.27898
62,3.5471
63,-0.27898
64,-0.27898
65,-0.27898
66,-0.27898
67,-0.27898
68,-0.27898
69,-0.27898
70,-0.27898
71,-0.27898
72,3.5471
73,-0.27898
74,-0.27898
75,-0.27898
76,-0.27898
77,-0.27898
78,-0.27898
79,3.5471
80,-0.27898
81,-0.27898
82,-0.27898
83,-0.27898
84,-0.27898
85,-0.27898
86,-0.27898
87,3.5471
88,-0.27898
89,-0.27898
90,-0.27898
91,-0.27898
92,-0.27898
93,-0.27898
94,3.5471
95,-0.27898
