time,value
0,-0.16747
1,-0.16747
2,-0.16747
3,-0.16747
4,-0.16747
5,-0.16747
6,-0.16747
7,-0.16747
8,-0.16747
9,-0.16747
10,-0.16747
11,-0.16747
12,-0.16747
13,-0.16747
14,-0.16747
15,-0.16747
16,-0.16747
17,-0.16747
18,-0.16747
19,-0.16747
20,-0.16747
21,-0.16747
22,-0.16747
23,-0.16747
24,-0.16747
25,-0.16747
26,-0.16747
27,-0.16747
28,-0.16747
29,-0.16747
30,-0.16747
31,-0.16747
32,-0.16747
33,-0.16747
34,-0.16747
35,-0.16747
36,-0.16747
37,-0.16747
38,-0.16747
39,-0.16747
40,-0.16747
41,-0.16747
42,-0.16747
43,-0.16747
44,-0.16747
45,-0.16747
46,-0.16747
47,-0.16747
48,-0.16747
49,-0.16747
50,-0.16747
51,-0.16747
52,-0.16747
53,-0.16747
54,-0.16747
55,-0.16747
56,-0.16747
57,-0.16747
58,-0.16747
59,8.1034
60,4.678999999999999
61,-0.16747
62,-0.16747
63,-0.16747
64,-0.16747
65,-0.16747
66,-0.16747
67,-0.16747
68,-0.16747
69,-0.16747
70,-0.16747
71,-0.16747
72,-0.16747
73,-0.16747
74,-0.16747
75,-0.16747
76,2.1542
77,0.47098
78,-0.16747
79,-0.16747
80,-0.16747
81,-0.16747
82,-0.16747
83,-0.16747
84,-0.16747
85,-0.16747
86,-0.16747
87,-0.16747
88,-0.16747
89,-0.16747
90,-0.16747
91,-0.16747
92,-0.16747
93,-0.16747
94,-0.16747
95,-0.16747
