time,value
0,-2.2880000000000003
1,-2.2880000000000003
2,-2.291
3,-2.294
4,-2.294
5,-2.294
6,-2.294
7,-2.294
8,-2.294
9,-2.294
10,-2.2939
11,-2.2966
12,-2.2964
13,-2.2959
14,-2.2952
15,-2.2945
16,-2.2939
17,-2.2929
18,-2.2952
19,-2.3038
20,-2.3097
21,-2.3119
22,-2.3106
23,-2.3091
24,-2.3075
25,-2.3063
26,-2.3045
27,-2.3026
28,-2.3034
29,-2.302
30,-2.2997
31,-2.2973
32,-2.2948
33,-2.2921
34,-2.2903
35,-2.2875
36,-2.2845
37,-2.2815
38,-2.2794
39,-2.2761
40,-2.2728
41,-2.2693
42,-2.2669
43,-2.2633
44,-2.2596
45,-2.2557
46,-2.2558
47,-2.2612
48,-2.2679
49,-2.2679
50,-2.2636
51,-2.2608
52,-2.2564
53,-2.2519
54,-2.2474
55,-2.2427
56,-2.2396
57,-2.2348
58,-2.2299
59,-2.225
60,-2.2216
61,-2.2165
62,-2.2114
63,-2.2061
64,-2.2008
65,-2.1972
66,-2.1918
67,-2.1863
68,-2.1807
69,-2.1769
70,-2.1713
71,-2.1655
72,-2.1597
73,-2.1558
74,-2.1499
75,-2.1439
76,-2.1378
77,-2.1318
78,-2.1277
79,-2.1215
80,-2.1152
81,-2.109
82,-2.1047
83,-2.0984
84,-2.0919
85,-2.0855
86,-2.079
87,-2.0746
88,-2.068
89,-2.0614
90,-2.0547
91,-2.0502
92,-2.0435
93,-2.0367
94,-2.0298
95,-2.023
96,-2.0184
97,-2.0134
98,-2.0064
99,-1.9994
100,-1.9947
101,-1.9876
102,-1.9805
103,-1.9734
104,-1.9686
105,-1.9614
106,-1.9542
107,-1.9469
108,-1.9396
109,-1.9348
110,-1.9274
111,-1.9201
112,-1.9127
113,-1.9078
114,-1.9003
115,-1.8912
116,-1.8837
117,-1.8763
118,-1.8712
119,-1.8637
120,-1.8562
121,-1.8486
122,-1.8435
123,-1.8359
124,-1.8283
125,-1.8206
126,-1.8155
127,-1.8088
128,-1.8041
129,-1.7967
130,-1.7891
131,-1.784
132,-1.7763
133,-1.7686
134,-1.7609
135,-1.7558
136,-1.7465
137,-1.7387
138,-1.7309999999999999
139,-1.7232
140,-1.7180000000000002
141,-1.7124
142,-1.7052
143,-1.6995
144,-1.6944
145,-1.6866
146,-1.6788
147,-1.671
148,-1.6617
149,-1.6565
150,-1.6487
151,-1.6393
152,-1.6337
153,-1.6307
154,-1.6225
155,-1.6147
156,-1.6054
157,-1.6002
158,-1.5923
159,-1.5856
160,-1.5785
161,-1.5714
162,-1.5662
163,-1.5584
164,-1.5505
165,-1.5427
166,-1.5359
167,-1.5281
168,-1.5202
169,-1.5123
170,-1.5096
171,-1.5096
172,-1.5043
173,-1.495
174,-1.4935
175,-1.4909
176,-1.4868
177,-1.4775
178,-1.4681
179,-1.4614
180,-1.4599
181,-1.4573
182,-1.452
183,-1.4441
184,-1.4388
185,-1.4294
186,-1.4214
187,-1.4134
188,-1.4081
189,-1.4001
190,-1.396
191,-1.3892
192,-1.3797
193,-1.3743
194,-1.3664
195,-1.3584
196,-1.3504
197,-1.3436
198,-1.3356
199,-1.3276
200,-1.3195
201,-1.3154
202,-1.31
203,-1.3046
204,-1.2966
205,-1.2885
206,-1.2832
207,-1.2738
208,-1.2657
209,-1.2577
210,-1.2523
211,-1.2443
212,-1.2375
213,-1.2334
214,-1.2267
215,-1.2213
216,-1.2133
217,-1.2052
218,-1.1972
219,-1.1918
220,-1.1824
221,-1.1743
222,-1.1662
223,-1.1581
224,-1.1527
225,-1.1446
226,-1.1407
227,-1.1353
228,-1.1299
229,-1.1218
230,-1.1137
231,-1.1056
232,-1.0975
233,-1.0921
234,-1.0826
235,-1.0745
236,-1.0664
237,-1.0609
238,-1.0528
239,-1.0475
240,-1.0409
241,-1.0383
242,-1.0329
243,-1.0247
244,-1.0166
245,-1.0084
246,-1.003
247,-0.99354
248,-0.9853799999999999
249,-0.9772
250,-0.97175
251,-0.9635600000000001
252,-0.95537
253,-0.94885
254,-0.94231
255,-0.9383100000000001
256,-0.93014
257,-0.92196
258,-0.9137700000000001
259,-0.9083100000000001
260,-0.89886
261,-0.89066
262,-0.88245
263,-0.87698
264,-0.8687600000000001
265,-0.86054
266,-0.85231
267,-0.8440700000000001
268,-0.83735
269,-0.83063
270,-0.82419
271,-0.81624
272,-0.81075
273,-0.80252
274,-0.7942899999999999
275,-0.78482
276,-0.77658
277,-0.77108
278,-0.7628199999999999
279,-0.75732
280,-0.75456
281,-0.7518100000000001
282,-0.74234
283,-0.7328600000000001
284,-0.72339
285,-0.71392
286,-0.71392
287,-0.70996
288,-0.70324
289,-0.69377
290,-0.68825
291,-0.6854899999999999
292,-0.6827300000000001
293,-0.6772100000000001
294,-0.67169
295,-0.66341
296,-0.6551100000000001
297,-0.64681
298,-0.63851
299,-0.63297
300,-0.62466
301,-0.61517
302,-0.60685
303,-0.6013
304,-0.5929800000000001
305,-0.5846399999999999
306,-0.5763
307,-0.5695899999999999
308,-0.5645100000000001
309,-0.56104
310,-0.55155
311,-0.54323
312,-0.53768
313,-0.5293399999999999
314,-0.521
315,-0.51266
316,-0.5070899999999999
317,-0.49873999999999996
318,-0.49038999999999994
319,-0.48202
320,-0.47366
321,-0.46808
322,-0.4597
323,-0.45133
324,-0.44183
325,-0.43735
326,-0.42786
327,-0.41946000000000006
328,-0.41107
329,-0.40267
330,-0.39707
331,-0.38866
332,-0.38025
333,-0.37183
334,-0.36622
335,-0.35953
336,-0.35625999999999997
337,-0.35018
338,-0.34178000000000003
339,-0.33616999999999997
340,-0.32666999999999996
341,-0.31826
342,-0.30985
343,-0.30705
344,-0.30424
345,-0.30424
346,-0.29581999999999997
347,-0.28912
348,-0.28804
349,-0.28415
350,-0.27746
351,-0.26796
352,-0.26126
353,-0.25456
354,-0.25456
355,-0.25176
356,-0.24615
357,-0.23773000000000002
358,-0.23103
359,-0.22823000000000002
360,-0.22541999999999998
361,-0.2198
362,-0.21311
363,-0.20922
364,-0.20814000000000002
365,-0.20145
366,-0.19194
367,-0.18244000000000002
368,-0.17855
369,-0.17575
370,-0.17575
371,-0.16733
372,-0.1589
373,-0.15047
374,-0.14485
375,-0.13642
376,-0.12797999999999998
377,-0.11954000000000001
378,-0.11284000000000001
379,-0.1044
380,-0.095951
381,-0.08749900000000001
382,-0.07904299999999999
383,-0.073404
384,-0.064943
385,-0.061799
386,-0.055816
387,-0.051940999999999994
388,-0.043495
389,-0.03399
390,-0.025541
391,-0.017088
392,-0.0104
393,-0.007232
394,-0.001227
395,0.0072120000000000005
396,0.012838999999999998
397,0.021283
398,0.029731
399,0.039236
400,0.04487
401,0.053324
402,0.06283
403,0.07057000000000001
404,0.07374299999999999
405,0.07762000000000001
406,0.08712400000000001
407,0.09769299999999999
408,0.10371
409,0.10867
410,0.1171
411,0.12553
412,0.13396
413,0.1424
414,0.14803
415,0.15647
416,0.16492
417,0.17337
418,0.179
419,0.18850999999999998
420,0.19696
421,0.20543000000000003
422,0.21389
423,0.21953000000000003
424,0.228
425,0.23646999999999999
426,0.24494000000000002
427,0.25059000000000003
428,0.25906999999999997
429,0.26755
430,0.27604
431,0.28169
432,0.29018
433,0.29867
434,0.30717
435,0.31567
436,0.32134
437,0.32984
438,0.33734000000000003
439,0.34585
440,0.35153
441,0.36004
442,0.36856
443,0.37708
444,0.38659
445,0.39227
446,0.4008
447,0.40933
448,0.41786
449,0.42355
450,0.43208
451,0.44061999999999996
452,0.44542
453,0.44737
454,0.45316999999999996
455,0.46169
456,0.47021999999999997
457,0.47875
458,0.48444
459,0.49296999999999996
460,0.50248
461,0.51102
462,0.51671
463,0.52525
464,0.5338
465,0.5433100000000001
466,0.5462199999999999
467,0.55102
468,0.55769
469,0.56622
470,0.57476
471,0.58045
472,0.58899
473,0.59753
474,0.6070399999999999
475,0.61559
476,0.62129
477,0.62983
478,0.63839
479,0.64694
480,0.65264
481,0.6612
482,0.66596
483,0.67169
484,0.67647
485,0.68502
486,0.69357
487,0.70308
488,0.71163
489,0.71829
490,0.71829
491,0.72114
492,0.72969
493,0.7354
494,0.74395
495,0.75251
496,0.75822
497,0.76107
498,0.76107
499,0.76298
500,0.76203
501,0.76015
502,0.75827
503,0.75548
504,0.7527
505,0.7499399999999999
506,0.74903
507,0.74903
508,0.74434
509,0.73875
510,0.73121
511,0.72547
512,0.71686
513,0.70825
514,0.69965
515,0.69391
516,0.6853199999999999
517,0.6758
518,0.6672100000000001
519,0.65861
520,0.65288
521,0.6442899999999999
522,0.6357
523,0.6271100000000001
524,0.62333
525,0.6177
526,0.6120899999999999
527,0.6035
528,0.5949
529,0.58825
530,0.5796600000000001
531,0.57014
532,0.5645399999999999
533,0.56272
534,0.5532100000000001
535,0.54371
536,0.53903
537,0.5343600000000001
538,0.52881
539,0.5201899999999999
540,0.51157
541,0.5029600000000001
542,0.49632
543,0.48771000000000003
544,0.48502
545,0.47948
546,0.47573000000000004
547,0.4671
548,0.45848
549,0.44986000000000004
550,0.44123999999999997
551,0.4346
552,0.42598
553,0.41736999999999996
554,0.40894
555,0.40429
556,0.39678
557,0.38727
558,0.38063
559,0.37512
560,0.37338000000000005
561,0.36386999999999997
562,0.35523000000000005
563,0.3466
564,0.34084000000000003
565,0.33133
566,0.3227
567,0.31406999999999996
568,0.30832
569,0.30369
570,0.30107
571,0.29846999999999996
572,0.29301
573,0.29131
574,0.28673000000000004
575,0.27807
576,0.26941
577,0.26364
578,0.25414000000000003
579,0.24548000000000003
580,0.23683
581,0.22818000000000002
582,0.22241
583,0.21985
584,0.21441999999999997
585,0.21069000000000002
586,0.20490999999999998
587,0.19541
588,0.18675
589,0.17809
590,0.17232
591,0.16689
592,0.16149000000000002
593,0.15775999999999998
594,0.14909
595,0.14248
596,0.13380999999999998
597,0.12514
598,0.11564
599,0.11108
600,0.10859
601,0.099083
602,0.090405
603,0.081732
604,0.07595
605,0.066447
606,0.057776
607,0.049107
608,0.043329
609,0.037936000000000004
610,0.032563999999999996
611,0.028849
612,0.020168000000000002
613,0.014383000000000002
614,0.00488
615,-0.003797
616,-0.012472
617,-0.014125
618,-0.019478
619,-0.026895999999999996
620,-0.036397000000000006
621,-0.04219
622,-0.044614999999999995
623,-0.049914
624,-0.056511
625,-0.065213
626,-0.071014
627,-0.079712
628,-0.089211
629,-0.09790800000000001
630,-0.10371
631,-0.1124
632,-0.11900000000000001
633,-0.12430999999999999
634,-0.12959
635,-0.13539
636,-0.1441
637,-0.1536
638,-0.1623
639,-0.1681
640,-0.17338
641,-0.17864000000000002
642,-0.18523
643,-0.19394
644,-0.20052999999999999
645,-0.20925
646,-0.21796
647,-0.22533000000000003
648,-0.22689
649,-0.23210999999999998
650,-0.24083000000000002
651,-0.24956
652,-0.25537
653,-0.26486
654,-0.27358000000000005
655,-0.2788
656,-0.28108
657,-0.2855
658,-0.28774
659,-0.28995
660,-0.29651
661,-0.29724
662,-0.29869
663,-0.30083000000000004
664,-0.30295
665,-0.30504000000000003
666,-0.30641
667,-0.30845
668,-0.30912
669,-0.30979
670,-0.30391999999999997
671,-0.30591
672,-0.30491999999999997
673,-0.29969
674,-0.29381
675,-0.28499
676,-0.27681
677,-0.26798
678,-0.25916
679,-0.25327
680,-0.24445
681,-0.23918000000000003
682,-0.23808
683,-0.23929
684,-0.23105
685,-0.22221
686,-0.21395
687,-0.20511
688,-0.19921
689,-0.19742
690,-0.1962
691,-0.19142
692,-0.18607
693,-0.17776
694,-0.17644
695,-0.17806
696,-0.16918
697,-0.16326
698,-0.1549
699,-0.14602
700,-0.13713
701,-0.1352
702,-0.13377
703,-0.13180999999999998
704,-0.12290999999999999
705,-0.11698
706,-0.10808
707,-0.099176
708,-0.09027400000000001
709,-0.081371
710,-0.075435
711,-0.06653099999999999
712,-0.057626
713,-0.04872
714,-0.042783
715,-0.033875999999999996
716,-0.024968
717,-0.016059999999999998
718,-0.011641
719,-0.0076939999999999995
720,-0.003735
721,0.005164
722,0.014063999999999998
723,0.019998
724,0.0289
725,0.037801999999999995
726,0.047195999999999995
727,0.053131
728,0.062033000000000005
729,0.070937
730,0.079841
731,0.086757
732,0.087746
733,0.09221900000000001
734,0.10112
735,0.11001
736,0.11594000000000002
737,0.12484
738,0.13424
739,0.14314000000000002
740,0.15203
741,0.15797
742,0.16194
743,0.1649
744,0.1649
745,0.17082999999999998
746,0.17973
747,0.18913
748,0.19852999999999998
749,0.20496
750,0.20496
751,0.20844000000000001
752,0.21486999999999998
753,0.22376999999999997
754,0.2297
755,0.23265999999999998
756,0.23561999999999997
757,0.23859
758,0.24156
759,0.25045
760,0.25935
761,0.26825
762,0.27714
763,0.28307
764,0.29198
765,0.30136999999999997
766,0.31027
767,0.3162
768,0.3251
769,0.33399999999999996
770,0.34291
771,0.35181
772,0.35774
773,0.36665
774,0.37555
775,0.38445999999999997
776,0.39039
777,0.39979000000000003
778,0.40421999999999997
779,0.40869
780,0.41462
781,0.42351000000000005
782,0.43241999999999997
783,0.44131000000000004
784,0.45071000000000006
785,0.45664
786,0.46553999999999995
787,0.47444
788,0.48335
789,0.48928
790,0.49818
791,0.50708
792,0.51599
793,0.52489
794,0.52489
795,0.52786
796,0.5338
797,0.5427
798,0.5427
799,0.54567
800,0.54864
801,0.5575399999999999
802,0.56645
803,0.57239
804,0.5813
805,0.5902
806,0.59911
807,0.60458
808,0.61349
809,0.6224
810,0.63131
811,0.63726
812,0.64617
813,0.65509
814,0.66447
815,0.67338
816,0.67932
817,0.68824
818,0.69715
819,0.70607
820,0.71201
821,0.7209300000000001
822,0.72985
823,0.7387600000000001
824,0.74768
825,0.75363
826,0.76255
827,0.76255
828,0.76552
829,0.77147
830,0.7803899999999999
831,0.7833600000000001
832,0.78382
833,0.78976
834,0.7961600000000001
835,0.8055399999999999
836,0.81492
837,0.8243
838,0.82978
839,0.8352700000000001
840,0.8377899999999999
841,0.83734
842,0.84329
843,0.85221
844,0.86113
845,0.8700600000000001
846,0.8760100000000001
847,0.8789799999999999
848,0.87854
849,0.8874700000000001
850,0.89595
851,0.90191
852,0.9108299999999999
853,0.91976
854,0.9218700000000001
855,0.9235700000000001
856,0.9227299999999999
857,0.93166
858,0.9406
859,0.9491299999999999
860,0.9550799999999999
861,0.9640200000000001
862,0.9661799999999999
863,0.9687600000000001
864,0.9687600000000001
865,0.9777
866,0.98664
867,0.99559
868,1.0045
869,1.0105
870,1.0165
871,1.0194
872,1.0232
873,1.0296
874,1.0385
875,1.0475
876,1.0568
877,1.0658
878,1.0691
879,1.0733
880,1.0738
881,1.0827
882,1.0887
883,1.0976
884,1.1065
885,1.1155
886,1.1244
887,1.1304
888,1.1363
889,1.1385
890,1.1373
891,1.1433
892,1.1522
893,1.1612
894,1.1701
895,1.1761
896,1.185
897,1.194
898,1.2029
899,1.2119
900,1.2178
901,1.2268
902,1.2327
903,1.2369
904,1.2407
905,1.2474
906,1.2564
907,1.2653
908,1.2743
909,1.2802
910,1.2892
911,1.2981
912,1.3071
913,1.3130000000000002
914,1.3219999999999998
915,1.3275
916,1.3294
917,1.3286
918,1.3342
919,1.3428
920,1.3424
921,1.3413
922,1.3405
923,1.3395
924,1.3384
925,1.3374
926,1.3367
927,1.3357
928,1.3353
929,1.3264
930,1.3171
931,1.3111
932,1.3021
933,1.2961
934,1.2932
935,1.2932
936,1.2842
937,1.2752
938,1.2662
939,1.2573
940,1.2543
941,1.2513
942,1.251
943,1.2423
944,1.2364
945,1.2274
946,1.2184
947,1.2095
948,1.2035
949,1.1945
950,1.1855
951,1.1766
952,1.1676
953,1.1616
954,1.1523
955,1.1487
956,1.1477
957,1.1413
958,1.1324
959,1.1234
960,1.1141
961,1.1051
962,1.0992
963,1.0902
964,1.0809
965,1.0779
966,1.0749
967,1.0659
968,1.057
969,1.048
970,1.0390000000000001
971,1.0361
972,1.0357
973,1.0294
974,1.0201
975,1.0138
976,1.0048
977,0.9958600000000001
978,0.9868899999999999
979,0.9809100000000001
980,0.9809100000000001
981,0.9776
982,0.97129
983,0.9623200000000001
984,0.95634
985,0.94704
986,0.9380700000000001
987,0.9314399999999999
988,0.92781
989,0.9268700000000001
990,0.9179
991,0.9089200000000001
992,0.89995
993,0.89365
994,0.8846799999999999
995,0.8757
996,0.8667299999999999
997,0.86074
998,0.85713
999,0.8532200000000001
1000,0.84664
1001,0.84065
1002,0.83167
1003,0.8226899999999999
1004,0.81371
1005,0.8047300000000001
1006,0.79845
1007,0.78947
1008,0.78049
1009,0.77151
1010,0.76553
1011,0.75954
1012,0.75954
1013,0.75655
1014,0.74727
1015,0.74098
1016,0.73769
1017,0.7344
1018,0.72513
1019,0.71914
1020,0.70987
1021,0.70658
1022,0.70658
1023,0.6976
1024,0.69162
1025,0.6826399999999999
1026,0.67365
1027,0.66438
1028,0.6583899999999999
1029,0.64941
1030,0.64043
1031,0.63657
1032,0.6330100000000001
1033,0.62946
1034,0.62048
1035,0.61149
1036,0.60251
1037,0.5965199999999999
1038,0.58753
1039,0.57827
1040,0.56928
1041,0.56329
1042,0.5543100000000001
1043,0.54532
1044,0.53878
1045,0.53497
1046,0.5344399999999999
1047,0.52545
1048,0.51647
1049,0.50747
1050,0.50148
1051,0.49249
1052,0.48323999999999995
1053,0.47425
1054,0.46826
1055,0.45926999999999996
1056,0.45028
1057,0.44128999999999996
1058,0.4323
1059,0.42605
1060,0.41706000000000004
1061,0.41328000000000004
1062,0.40952
1063,0.40352
1064,0.39453
1065,0.38554
1066,0.3763
1067,0.36730999999999997
1068,0.36130999999999996
1069,0.35231999999999997
1070,0.34331999999999996
1071,0.33958
1072,0.3391
1073,0.33563000000000004
1074,0.32664
1075,0.31764000000000003
1076,0.30864
1077,0.30264
1078,0.29365
1079,0.28442
1080,0.27542
1081,0.26942
1082,0.26573
1083,0.26506
1084,0.25885
1085,0.25285
1086,0.24385
1087,0.23485
1088,0.22585
1089,0.21685
1090,0.21063
1091,0.20163
1092,0.19263
1093,0.18363
1094,0.17762999999999998
1095,0.17140999999999998
1096,0.16841
1097,0.16841
1098,0.15941
1099,0.15319000000000002
1100,0.14398
1101,0.13477
1102,0.12855999999999998
1103,0.12835
1104,0.12214000000000001
1105,0.11314
1106,0.10414000000000001
1107,0.098136
1108,0.095137
1109,0.095137
1110,0.086134
1111,0.07712999999999999
1112,0.071128
1113,0.062126
1114,0.05291799999999999
1115,0.043914999999999996
1116,0.037913
1117,0.02891
1118,0.025505
1119,0.021919
1120,0.018542
1121,0.012537000000000001
1122,0.0035310000000000003
1123,-0.00566
1124,-0.014667
1125,-0.020672
1126,-0.024212
1127,-0.027725
1128,-0.033895999999999996
1129,-0.042907
1130,-0.048914
1131,-0.057924
1132,-0.058087
1133,-0.058401999999999996
1134,-0.05870499999999999
1135,-0.059136
1136,-0.059538
1137,-0.059912
1138,-0.060146000000000005
1139,-0.060367
1140,-0.060473
1141,-0.054563
1142,-0.051845
1143,-0.052021000000000005
1144,-0.043084
1145,-0.034063
1146,-0.025123
1147,-0.019109
1148,-0.010088
1149,-0.004293
1150,-0.0014759999999999999
1151,0.001475
1152,0.007489
1153,0.016511
1154,0.025480000000000003
1155,0.034502
1156,0.040467
1157,0.040335
1158,0.043237
1159,0.05226
1160,0.061255
1161,0.064237
1162,0.064178
1163,0.06715399999999999
1164,0.076178
1165,0.082194
1166,0.09121699999999999
1167,0.10024
1168,0.10926
1169,0.11527000000000001
1170,0.1243
1171,0.13332
1172,0.13633
1173,0.13934000000000002
1174,0.14535
1175,0.15438
1176,0.16341
1177,0.17244
1178,0.17847000000000002
1179,0.1875
1180,0.19050999999999998
1181,0.19352
1182,0.19952999999999999
1183,0.20554
1184,0.21154
1185,0.21153000000000002
1186,0.22055
1187,0.22657
1188,0.23559000000000002
1189,0.2386
1190,0.24161
1191,0.24761999999999998
1192,0.25665
1193,0.26566999999999996
1194,0.27469
1195,0.28371999999999997
1196,0.28973000000000004
1197,0.29875999999999997
1198,0.30778
1199,0.31681
1200,0.32282
1201,0.32884
1202,0.33185
1203,0.33485
1204,0.34388
1205,0.34989000000000003
1206,0.35891999999999996
1207,0.35893
1208,0.36195
1209,0.36495
1210,0.37398000000000003
1211,0.37699
1212,0.37998000000000004
1213,0.38299
1214,0.389
1215,0.39802
1216,0.40704
1217,0.40704
1218,0.41006000000000004
1219,0.41307
1220,0.4221
1221,0.43113999999999997
1222,0.43716000000000005
1223,0.44618
1224,0.44919
1225,0.4522
1226,0.45521999999999996
1227,0.46123000000000003
1228,0.47026
1229,0.47928000000000004
1230,0.48831
1231,0.49432
1232,0.50334
1233,0.51237
1234,0.5213899999999999
1235,0.5304300000000001
1236,0.53645
1237,0.54547
1238,0.5544899999999999
1239,0.56352
1240,0.56953
1241,0.5785600000000001
1242,0.58758
1243,0.5936
1244,0.5936600000000001
1245,0.59673
1246,0.6028100000000001
1247,0.61183
1248,0.6208600000000001
1249,0.6268699999999999
1250,0.6359
1251,0.6449199999999999
1252,0.65394
1253,0.65996
1254,0.66898
1255,0.67804
1256,0.68706
1257,0.69605
1258,0.70206
1259,0.71109
1260,0.72011
1261,0.7291300000000001
1262,0.73515
1263,0.74417
1264,0.7532
1265,0.76222
1266,0.7712399999999999
1267,0.7772600000000001
1268,0.78628
1269,0.7953
1270,0.80433
1271,0.81038
1272,0.8194
1273,0.82842
1274,0.83745
1275,0.84346
1276,0.85249
1277,0.8585799999999999
1278,0.86172
1279,0.8678299999999999
1280,0.87385
1281,0.88287
1282,0.89189
1283,0.90091
1284,0.9069299999999999
1285,0.91595
1286,0.9249700000000001
1287,0.934
1288,0.9430200000000001
1289,0.9490299999999999
1290,0.95806
1291,0.96106
1292,0.9640700000000001
1293,0.97009
1294,0.97911
1295,0.97911
1296,0.9821200000000001
1297,0.98808
1298,0.99405
1299,1.003
1300,1.012
1301,1.021
1302,1.0270000000000001
1303,1.0331
1304,1.0362
1305,1.0392
1306,1.0453
1307,1.0543
1308,1.0633
1309,1.0723
1310,1.0753
1311,1.0753
1312,1.0814
1313,1.0904
1314,1.0995
1315,1.0996
1316,1.1028
1317,1.1089
1318,1.1179
1319,1.1269
1320,1.133
1321,1.1420000000000001
1322,1.151
1323,1.16
1324,1.166
1325,1.1751
1326,1.1841
1327,1.1931
1328,1.1991
1329,1.2081
1330,1.2172
1331,1.2262
1332,1.2352
1333,1.2412
1334,1.2502
1335,1.2593
1336,1.2683
1337,1.2743
1338,1.2833
1339,1.2924
1340,1.3014
1341,1.3104
1342,1.3165
1343,1.3255
1344,1.3345
1345,1.3435
1346,1.3495
1347,1.3586
1348,1.3646
1349,1.3676
1350,1.3736
1351,1.3796
1352,1.3886
1353,1.3946
1354,1.3977
1355,1.3977
1356,1.4067
1357,1.4158
1358,1.4249
1359,1.4309
1360,1.4399
1361,1.4489
1362,1.4579
1363,1.4608
1364,1.4638
1365,1.4638
1366,1.4728
1367,1.4819
1368,1.4879
1369,1.4909999999999999
1370,1.4941
1371,1.4972
1372,1.5063
1373,1.5123
1374,1.5214
1375,1.5304
1376,1.5334
1377,1.5364
1378,1.5365
1379,1.5455
1380,1.5545
1381,1.5635
1382,1.5696
1383,1.5787
1384,1.5877
1385,1.5967
1386,1.6027
1387,1.6059
1388,1.6061
1389,1.6064
1390,1.6066
1391,1.6099
1392,1.6102
1393,1.6106
1394,1.6109
1395,1.6112
1396,1.6085
1397,1.6089
1398,1.6094
1399,1.6097
1400,1.61
1401,1.6009
1402,1.5919
1403,1.5831
1404,1.5771
1405,1.5681
1406,1.5654
1407,1.5629
1408,1.5602
1409,1.5513
1410,1.5423
1411,1.5429
1412,1.5402
1413,1.5376
1414,1.5286
1415,1.5196
1416,1.5106
1417,1.5046
1418,1.4956
1419,1.4866
1420,1.4775
1421,1.4717
1422,1.4627
1423,1.4537
1424,1.4447
1425,1.4357
1426,1.4297
1427,1.4207
1428,1.4117
1429,1.4027
1430,1.3999
1431,1.3975
1432,1.3981
1433,1.3891
1434,1.3801
1435,1.3741
1436,1.3651
1437,1.3563
1438,1.3473
1439,1.3413
1440,1.3323
1441,1.3293
1442,1.3263
1443,1.3203
1444,1.3113
1445,1.3113
1446,1.3083
1447,1.3023
1448,1.2963
1449,1.2873
1450,1.2783
1451,1.2693
1452,1.2633
1453,1.2543
1454,1.2453
1455,1.2363
1456,1.2337
1457,1.2342
1458,1.2289
1459,1.2199
1460,1.2109
1461,1.2049
1462,1.1959
1463,1.1869
1464,1.1779
1465,1.1719
1466,1.1629
1467,1.1539
1468,1.1449
1469,1.1362
1470,1.1302
1471,1.1212
1472,1.1122
1473,1.1032
1474,1.0972
1475,1.0882
1476,1.0792
1477,1.0702
1478,1.0677
1479,1.0652
1480,1.063
1481,1.054
1482,1.045
1483,1.0391
1484,1.0301
1485,1.0211
1486,1.0121
1487,1.0031
1488,0.9971
1489,0.98839
1490,0.9794
1491,0.97041
1492,0.96442
1493,0.9554299999999999
1494,0.94645
1495,0.9374600000000001
1496,0.93147
1497,0.9260299999999999
1498,0.9268799999999999
1499,0.92389
1500,0.91491
1501,0.9089200000000001
1502,0.89994
1503,0.89095
1504,0.88197
1505,0.87598
1506,0.867
1507,0.86101
1508,0.85716
1509,0.85088
1510,0.8448899999999999
1511,0.83591
1512,0.8269299999999999
1513,0.81794
1514,0.81195
1515,0.80269
1516,0.79371
1517,0.78472
1518,0.78173
1519,0.77873
1520,0.77574
1521,0.7670399999999999
1522,0.7643399999999999
1523,0.76135
1524,0.75865
1525,0.74967
1526,0.74069
1527,0.7347
1528,0.73141
1529,0.73112
1530,0.7218399999999999
1531,0.71586
1532,0.71286
1533,0.70987
1534,0.70089
1535,0.69191
1536,0.68592
1537,0.67694
1538,0.66796
1539,0.65898
1540,0.65
1541,0.6440100000000001
1542,0.63503
1543,0.62605
1544,0.61707
1545,0.6110899999999999
1546,0.60211
1547,0.59313
1548,0.59105
1549,0.58868
1550,0.58333
1551,0.57436
1552,0.56539
1553,0.55642
1554,0.5504399999999999
1555,0.54146
1556,0.53249
1557,0.52352
1558,0.5178699999999999
1559,0.5089
1560,0.49993000000000004
1561,0.49096000000000006
1562,0.48199
1563,0.47601000000000004
1564,0.46705
1565,0.45808000000000004
1566,0.44911
1567,0.44313
1568,0.43416000000000005
1569,0.4252
1570,0.41623000000000004
1571,0.40726
1572,0.40129000000000004
1573,0.39232
1574,0.38336
1575,0.37439
1576,0.36841
1577,0.35945
1578,0.35048
1579,0.34118000000000004
1580,0.3352
1581,0.32624000000000003
1582,0.31727
1583,0.30831
1584,0.29934
1585,0.29336999999999996
1586,0.28705
1587,0.28303
1588,0.27904
1589,0.27305999999999997
1590,0.26409
1591,0.25511999999999996
1592,0.24615
1593,0.23718000000000003
1594,0.23121
1595,0.2219
1596,0.21294000000000002
1597,0.20397
1598,0.19799
1599,0.18902
1600,0.18006
1601,0.17109000000000002
1602,0.16477
1603,0.16378
1604,0.15416
1605,0.14486
1606,0.13589
1607,0.12991
1608,0.12094
1609,0.11195999999999999
1610,0.10299000000000001
1611,0.097014
1612,0.08804400000000001
1613,0.079073
1614,0.070103
1615,0.061465
1616,0.0618
1617,0.059834000000000005
1618,0.057543
1619,0.048936
1620,0.042963
1621,0.040695999999999996
1622,0.038813
1623,0.03658
1624,0.033977
1625,0.033977
1626,0.035137
1627,0.036324
1628,0.037537
1629,0.038362
1630,0.039620999999999996
1631,0.040906
1632,0.040906
1633,0.041341
1634,0.04773
1635,0.052032
1636,0.056359000000000006
1637,0.065734
1638,0.071681
1639,0.075571
1640,0.079938
1641,0.083854
1642,0.089795
1643,0.098704
1644,0.10809
1645,0.11699999999999999
1646,0.12591
1647,0.12686
1648,0.13127
1649,0.13522
1650,0.14412
1651,0.15006
1652,0.15945
1653,0.16835999999999998
1654,0.17726
1655,0.18617
1656,0.1921
1657,0.20101
1658,0.20544
1659,0.20989000000000002
1660,0.21039000000000002
1661,0.21929
1662,0.22819
1663,0.23709000000000002
1664,0.24301999999999999
1665,0.25192
1666,0.26082
1667,0.26971999999999996
1668,0.27862
1669,0.28456
1670,0.29346
1671,0.30285
1672,0.31176
1673,0.31769000000000003
1674,0.3266
1675,0.3355
1676,0.34441
1677,0.34835
1678,0.3523
1679,0.3538
1680,0.36269
1681,0.37159000000000003
1682,0.37751999999999997
1683,0.38692
1684,0.39582
1685,0.40471999999999997
1686,0.41065
1687,0.41955
1688,0.42648
1689,0.42799
1690,0.4379
1691,0.44383
1692,0.45271999999999996
1693,0.46213000000000004
1694,0.47102
1695,0.47695
1696,0.48583999999999994
1697,0.49473999999999996
1698,0.49872
1699,0.50322
1700,0.5072300000000001
1701,0.5161100000000001
1702,0.525
1703,0.53389
1704,0.53982
1705,0.5492199999999999
1706,0.55811
1707,0.5670000000000001
1708,0.57396
1709,0.57797
1710,0.57955
1711,0.58844
1712,0.59732
1713,0.60324
1714,0.61212
1715,0.6210100000000001
1716,0.62989
1717,0.6358199999999999
1718,0.64471
1719,0.65359
1720,0.6629999999999999
1721,0.67189
1722,0.67781
1723,0.6867
1724,0.6955899999999999
1725,0.70448
1726,0.71041
1727,0.7193
1728,0.7238100000000001
1729,0.72538
1730,0.7318399999999999
1731,0.7377600000000001
1732,0.74664
1733,0.75553
1734,0.76441
1735,0.7703300000000001
1736,0.77922
1737,0.7881100000000001
1738,0.79752
1739,0.8034399999999999
1740,0.81233
1741,0.8212200000000001
1742,0.8301
1743,0.8390000000000001
1744,0.8449200000000001
1745,0.8538100000000001
1746,0.8627
1747,0.87018
1748,0.8712200000000001
1749,0.87524
1750,0.8841200000000001
1751,0.8930100000000001
1752,0.90189
1753,0.90781
1754,0.9167
1755,0.9255899999999999
1756,0.93447
1757,0.9404
1758,0.94981
1759,0.9587
1760,0.9675799999999999
1761,0.9764700000000001
1762,0.9824
1763,0.99129
1764,1.0002
1765,1.0091
1766,1.015
1767,1.0239
1768,1.0328
1769,1.0368
1770,1.0408
1771,1.0418
1772,1.0512
1773,1.0601
1774,1.069
1775,1.0749
1776,1.0838
1777,1.0932
1778,1.1021
1779,1.1079999999999999
1780,1.1169
1781,1.1258
1782,1.1347
1783,1.1347
1784,1.1377
1785,1.1411
1786,1.1505
1787,1.16
1788,1.1664
1789,1.1669
1790,1.1704
1791,1.1768
1792,1.1857
1793,1.1857
1794,1.1892
1795,1.1951
1796,1.204
1797,1.2105
1798,1.2121
1799,1.2137
1800,1.2182
1801,1.2193
1802,1.2209999999999999
1803,1.2299
1804,1.2387
1805,1.2476
1806,1.2535
1807,1.2624
1808,1.2718
1809,1.2807
1810,1.2866
1811,1.2955
1812,1.3043
1813,1.3132
1814,1.3178
1815,1.3189
1816,1.3230000000000002
1817,1.3319
1818,1.3407
1819,1.3472
1820,1.3561
1821,1.3561
1822,1.3577
1823,1.3589
1824,1.3606
1825,1.3623
1826,1.364
1827,1.3658
1828,1.367
1829,1.3682
1830,1.3629
1831,1.3582
1832,1.3594
1833,1.3554
1834,1.3472
1835,1.3383
1836,1.3402
1837,1.3385
1838,1.3368
1839,1.328
1840,1.3192
1841,1.3133
1842,1.3045
1843,1.2963
1844,1.2875
1845,1.2787
1846,1.2728
1847,1.2719
1848,1.2738
1849,1.2686
1850,1.2628
1851,1.2546
1852,1.2566
1853,1.2558
1854,1.2506
1855,1.2418
1856,1.2329999999999999
1857,1.2242
1858,1.2154
1859,1.2096
1860,1.2015
1861,1.1927
1862,1.1839
1863,1.1781
1864,1.1693
1865,1.1605
1866,1.1518
1867,1.143
1868,1.1371
1869,1.1284
1870,1.1196
1871,1.1108
1872,1.105
1873,1.0962
1874,1.0875
1875,1.0787
1876,1.0728
1877,1.0641
1878,1.0553
1879,1.0466
1880,1.0378
1881,1.032
1882,1.0232
1883,1.0144
1884,1.0057
1885,0.9998600000000001
1886,0.9911
1887,0.98235
1888,0.9728700000000001
1889,0.9641200000000001
1890,0.9582799999999999
1891,0.9495299999999999
1892,0.94079
1893,0.93204
1894,0.9262100000000001
1895,0.9174700000000001
1896,0.9087299999999999
1897,0.8999799999999999
1898,0.8912399999999999
1899,0.8854200000000001
1900,0.8766799999999999
1901,0.8679399999999999
1902,0.85921
1903,0.8533799999999999
1904,0.84465
1905,0.8359200000000001
1906,0.82719
1907,0.82137
1908,0.8134100000000001
1909,0.8046800000000001
1910,0.79596
1911,0.7872399999999999
1912,0.78142
1913,0.7727
1914,0.76399
1915,0.75527
1916,0.74946
1917,0.73997
1918,0.73125
1919,0.72254
1920,0.71383
1921,0.70802
1922,0.69931
1923,0.6906
1924,0.68111
1925,0.67953
1926,0.67428
1927,0.66769
1928,0.65897
1929,0.6502600000000001
1930,0.64445
1931,0.63574
1932,0.62703
1933,0.61832
1934,0.61251
1935,0.6038100000000001
1936,0.5951
1937,0.5864
1938,0.5806
1939,0.5719
1940,0.5632
1941,0.5545100000000001
1942,0.54581
1943,0.54001
1944,0.53132
1945,0.52263
1946,0.51394
1947,0.50815
1948,0.49946
1949,0.49078
1950,0.4821
1951,0.47342
1952,0.46763000000000005
1953,0.45895
1954,0.44945
1955,0.44077
1956,0.43499
1957,0.42632
1958,0.41765
1959,0.40898
1960,0.4032
1961,0.39453
1962,0.38587
1963,0.3772
1964,0.36854000000000003
1965,0.36277
1966,0.35412
1967,0.34953
1968,0.34412
1969,0.34245
1970,0.33378
1971,0.32511
1972,0.31644
1973,0.30778
1974,0.30201
1975,0.29335
1976,0.28469
1977,0.27603
1978,0.26941
1979,0.26076
1980,0.2521
1981,0.24345
1982,0.2348
1983,0.22904000000000002
1984,0.22039
1985,0.21175
1986,0.20310999999999998
1987,0.19735
1988,0.18871
1989,0.18208
1990,0.1766
1991,0.17488
1992,0.16537000000000002
1993,0.15672
1994,0.14808
1995,0.13943
1996,0.1328
1997,0.12415999999999999
1998,0.11552
1999,0.10689000000000001
2000,0.10515
2001,0.099682
2002,0.095086
2003,0.086435
2004,0.077784
2005,0.072019
2006,0.063373
2007,0.05472899999999999
2008,0.046088
2009,0.040327999999999996
2010,0.031691000000000004
2011,0.023056
2012,0.014422999999999998
2013,0.008669
2014,3.9986e-05
2015,-0.008587000000000001
2016,-0.018096
2017,-0.026719999999999997
2018,-0.032468000000000004
2019,-0.041088
2020,-0.049706
2021,-0.058322000000000006
2022,-0.064064
2023,-0.072675
2024,-0.08128300000000001
2025,-0.089889
2026,-0.098493
2027,-0.10330999999999999
2028,-0.11191
2029,-0.1205
2030,-0.12909
2031,-0.13482
2032,-0.14340999999999998
2033,-0.15199000000000001
2034,-0.16057000000000002
2035,-0.16915
2036,-0.17487
2037,-0.18344000000000002
2038,-0.19201
2039,-0.20058
2040,-0.20629
2041,-0.21485
2042,-0.22341
2043,-0.23196
2044,-0.23767
2045,-0.24622
2046,-0.25476
2047,-0.26331
2048,-0.27185
2049,-0.27754
2050,-0.28705
2051,-0.29461
2052,-0.30314
2053,-0.30883
2054,-0.31735
2055,-0.32587
2056,-0.33439
2057,-0.3429
2058,-0.34858
2059,-0.35709
2060,-0.36074
2061,-0.36051
2062,-0.35846
2063,-0.36694
2064,-0.37540999999999997
2065,-0.38284
2066,-0.38848
2067,-0.39694
2068,-0.39766
2069,-0.39729000000000003
2070,-0.39796
2071,-0.40358
2072,-0.41200000000000003
2073,-0.42041999999999996
2074,-0.42883999999999994
2075,-0.43445
2076,-0.44176000000000004
2077,-0.45016000000000006
2078,-0.45856
2079,-0.46695
2080,-0.47253999999999996
2081,-0.48093
2082,-0.48036
2083,-0.47697
2084,-0.48141000000000006
2085,-0.48975
2086,-0.4981
2087,-0.5052800000000001
2088,-0.51361
2089,-0.51523
2090,-0.51172
2091,-0.51095
2092,-0.51648
2093,-0.5220100000000001
2094,-0.5302899999999999
2095,-0.53737
2096,-0.54564
2097,-0.54995
2098,-0.54905
2099,-0.54811
2100,-0.55634
2101,-0.5645600000000001
2102,-0.57004
2103,-0.57427
2104,-0.57427
2105,-0.5705
2106,-0.56797
2107,-0.56416
2108,-0.5603199999999999
2109,-0.55645
2110,-0.55255
2111,-0.55255
2112,-0.54984
2113,-0.5417
2114,-0.53356
2115,-0.52684
2116,-0.51869
2117,-0.51053
2118,-0.50237
2119,-0.49708
2120,-0.49178999999999995
2121,-0.48791
2122,-0.47976
2123,-0.47161000000000003
2124,-0.46618000000000004
2125,-0.45802
2126,-0.44986000000000004
2127,-0.44041
2128,-0.43496
2129,-0.42678999999999995
2130,-0.42152
2131,-0.41496000000000005
2132,-0.40967
2133,-0.40423000000000003
2134,-0.39605999999999997
2135,-0.3879
2136,-0.37845
2137,-0.373
2138,-0.369
2139,-0.36244
2140,-0.35586999999999996
2141,-0.34770999999999996
2142,-0.34226999999999996
2143,-0.33411
2144,-0.32466
2145,-0.31649
2146,-0.31103000000000003
2147,-0.30285
2148,-0.29466
2149,-0.29086
2150,-0.28559
2151,-0.28031999999999996
2152,-0.27215
2153,-0.26397
2154,-0.25451999999999997
2155,-0.24906999999999999
2156,-0.24088
2157,-0.23561999999999997
2158,-0.2318
2159,-0.22651999999999997
2160,-0.22108000000000003
2161,-0.21291
2162,-0.20473
2163,-0.19655
2164,-0.18982000000000002
2165,-0.18164
2166,-0.17344
2167,-0.16525
2168,-0.16272999999999999
2169,-0.15621
2170,-0.15094000000000002
2171,-0.14276
2172,-0.13458
2173,-0.12912
2174,-0.12092
2175,-0.11147
2176,-0.10327
2177,-0.097798
2178,-0.089589
2179,-0.083102
2180,-0.079328
2181,-0.075335
2182,-0.067143
2183,-0.058946000000000005
2184,-0.050745
2185,-0.041288
2186,-0.035816
2187,-0.027605
2188,-0.019389
2189,-0.012668
2190,-0.010178
2191,-0.0036899999999999997
2192,0.003032
2193,0.011236
2194,0.019445
2195,0.026167000000000003
2196,0.03438
2197,0.042347
2198,0.048833
2199,0.054077
2200,0.062277
2201,0.071734
2202,0.07994
2203,0.085412
2204,0.093627
2205,0.09736900000000001
2206,0.10387
2207,0.11332
2208,0.12004000000000001
2209,0.12802
2210,0.13454000000000002
2211,0.14253
2212,0.14799
2213,0.15617
2214,0.16563
2215,0.17382
2216,0.18054
2217,0.18307
2218,0.18959
2219,0.19904000000000002
2220,0.20849
2221,0.21122
2222,0.21503000000000003
2223,0.22158000000000003
2224,0.22830999999999999
2225,0.23775
2226,0.2432
2227,0.24704
2228,0.2509
2229,0.2575
2230,0.26009
2231,0.264
2232,0.27073
2233,0.28015999999999996
2234,0.28558
2235,0.29222
2236,0.29616
2237,0.30559000000000003
2238,0.31501999999999997
2239,0.31772
2240,0.32166999999999996
2241,0.32565
2242,0.32964
2243,0.33231
2244,0.33903
2245,0.34307
2246,0.34713
2247,0.35120999999999997
2248,0.35658
2249,0.36599
2250,0.36599
2251,0.37008
2252,0.37281
2253,0.37694
2254,0.38108000000000003
2255,0.38524
2256,0.38943
2257,0.39223
2258,0.39503
2259,0.38971999999999996
2260,0.38316
2261,0.38599
2262,0.39025
2263,0.39189
2264,0.39619
2265,0.39908000000000005
2266,0.39669
2267,0.39024000000000003
2268,0.38789
2269,0.39228
2270,0.3926
2271,0.38735
2272,0.37949
2273,0.37312
2274,0.36789
2275,0.36004
2276,0.35631
2277,0.3582
2278,0.36271
2279,0.35751
2280,0.34970999999999997
2281,0.34191
2282,0.33412
2283,0.32893
2284,0.32116
2285,0.31339
2286,0.30562
2287,0.30045
2288,0.29269
2289,0.28599
2290,0.27879
2291,0.2716
2292,0.26642
2293,0.25866
2294,0.24936999999999998
2295,0.24161999999999997
2296,0.23645
2297,0.22925
2298,0.22205
2299,0.21534
2300,0.20758000000000001
2301,0.20240999999999998
2302,0.19313
2303,0.18538
2304,0.18022
2305,0.17712999999999998
2306,0.16992000000000002
2307,0.16167
2308,0.15392
2309,0.14618
2310,0.14102
2311,0.13329000000000002
2312,0.12555999999999998
2313,0.11629
2314,0.11114
2315,0.10343
2316,0.095729
2317,0.088035
2318,0.083899
2319,0.076624
2320,0.07193300000000001
2321,0.064222
2322,0.05651799999999999
2323,0.051387
2324,0.043696
2325,0.036012
2326,0.026754000000000003
2327,0.021638
2328,0.013969999999999998
2329,0.006311
2330,-0.001341
2331,-0.008985
2332,-0.012182
2333,-0.019514
2334,-0.025246
2335,-0.032906
2336,-0.038008999999999994
2337,-0.045656
2338,-0.053295
2339,-0.060926
2340,-0.066009
2341,-0.07524
2342,-0.082853
2343,-0.090459
2344,-0.09805599999999999
2345,-0.10312
2346,-0.1107
2347,-0.11827
2348,-0.12495999999999999
2349,-0.12822999999999998
2350,-0.13565
2351,-0.14486
2352,-0.15244000000000002
2353,-0.16000999999999999
2354,-0.16505999999999998
2355,-0.17426
2356,-0.18181
2357,-0.18935
2358,-0.19438
2359,-0.2019
2360,-0.20942
2361,-0.21693
2362,-0.22193000000000002
2363,-0.22776
2364,-0.23359000000000002
2365,-0.24111999999999997
2366,-0.24863000000000002
2367,-0.25364000000000003
2368,-0.26114
2369,-0.27031
2370,-0.2778
2371,-0.28279
2372,-0.29026
2373,-0.29531
2374,-0.30285
2375,-0.30951999999999996
2376,-0.31451
2377,-0.32199
2378,-0.32946
2379,-0.33692
2380,-0.34358
2381,-0.35103
2382,-0.35846999999999996
2383,-0.36341999999999997
2384,-0.37101999999999996
2385,-0.37442
2386,-0.38278
2387,-0.39023
2388,-0.39766
2389,-0.40260999999999997
2390,-0.41173999999999994
2391,-0.41916000000000003
2392,-0.42656000000000005
2393,-0.43395
2394,-0.43814
2395,-0.44578
2396,-0.45093
2397,-0.45833999999999997
2398,-0.46326999999999996
2399,-0.47066
2400,-0.47803999999999996
2401,-0.48541000000000006
2402,-0.49032
2403,-0.49942
2404,-0.50676
2405,-0.5140899999999999
2406,-0.52141
2407,-0.5262899999999999
2408,-0.53359
2409,-0.54088
2410,-0.54994
2411,-0.5534899999999999
2412,-0.56123
2413,-0.5703
2414,-0.5775899999999999
2415,-0.58486
2416,-0.5897100000000001
2417,-0.59696
2418,-0.60421
2419,-0.61144
2420,-0.61625
2421,-0.62527
2422,-0.63247
2423,-0.63966
2424,-0.64445
2425,-0.65162
2426,-0.65877
2427,-0.66591
2428,-0.67304
2429,-0.67779
2430,-0.68386
2431,-0.68939
2432,-0.69545
2433,-0.70021
2434,-0.70734
2435,-0.71445
2436,-0.72155
2437,-0.72864
2438,-0.73335
2439,-0.74229
2440,-0.74934
2441,-0.75638
2442,-0.76107
2443,-0.76808
2444,-0.77376
2445,-0.78175
2446,-0.78833
2447,-0.79302
2448,-0.80003
2449,-0.80894
2450,-0.81593
2451,-0.82058
2452,-0.8263
2453,-0.8343200000000001
2454,-0.8432200000000001
2455,-0.8478899999999999
2456,-0.85487
2457,-0.8618299999999999
2458,-0.8687799999999999
2459,-0.87764
2460,-0.88226
2461,-0.8891700000000001
2462,-0.89728
2463,-0.9053700000000001
2464,-0.9119200000000001
2465,-0.91884
2466,-0.92574
2467,-0.9345700000000001
2468,-0.94145
2469,-0.94373
2470,-0.95188
2471,-0.9577100000000001
2472,-0.96654
2473,-0.9711299999999999
2474,-0.9779899999999999
2475,-0.9868
2476,-0.99364
2477,-0.9959100000000001
2478,-1.0018
2479,-1.01
2480,-1.0188
2481,-1.0256
2482,-1.0321
2483,-1.0389
2484,-1.0457
2485,-1.0539
2486,-1.0602
2487,-1.0664
2488,-1.0732
2489,-1.08
2490,-1.0887
2491,-1.0932
2492,-1.102
2493,-1.1102
2494,-1.1185
2495,-1.123
2496,-1.1297
2497,-1.1364
2498,-1.1452
2499,-1.1519
2500,-1.1559
2501,-1.1642
2502,-1.1727
2503,-1.1794
2504,-1.1859
2505,-1.1925
2506,-1.1992
2507,-1.2077
2508,-1.2118
2509,-1.2201
2510,-1.2267
2511,-1.2334
2512,-1.242
2513,-1.2465
2514,-1.2531
2515,-1.2573
2516,-1.2657
2517,-1.2698
2518,-1.2762
2519,-1.2828
2520,-1.2915
2521,-1.298
2522,-1.3024
2523,-1.3088
2524,-1.3172
2525,-1.3256
2526,-1.33
2527,-1.3365
2528,-1.3451
2529,-1.3516
2530,-1.3581
2531,-1.3623
2532,-1.3707
2533,-1.3769999999999998
2534,-1.3835
2535,-1.3899
2536,-1.3963
2537,-1.4047
2538,-1.4132
2539,-1.4176
2540,-1.4240000000000002
2541,-1.4326
2542,-1.439
2543,-1.4475
2544,-1.4517
2545,-1.4602
2546,-1.4666
2547,-1.4752
2548,-1.4794
2549,-1.4858
2550,-1.4942
2551,-1.5028
2552,-1.5092
2553,-1.5156
2554,-1.5219
2555,-1.5304
2556,-1.5390000000000001
2557,-1.5432
2558,-1.5517
2559,-1.5602
2560,-1.5666
2561,-1.5709
2562,-1.5794
2563,-1.5836
2564,-1.59
2565,-1.5985
2566,-1.6028
2567,-1.6113
2568,-1.6198
2569,-1.6282
2570,-1.6325
2571,-1.641
2572,-1.6496
2573,-1.6581
2574,-1.6665
2575,-1.6708
2576,-1.6794
2577,-1.6857
2578,-1.6942
2579,-1.7006
2580,-1.7069999999999999
2581,-1.7134
2582,-1.7219
2583,-1.7282
2584,-1.7324
2585,-1.7409999999999999
2586,-1.7474
2587,-1.7559
2588,-1.7623
2589,-1.7686
2590,-1.7772
2591,-1.7836
2592,-1.7878
2593,-1.7941
2594,-1.8004
2595,-1.8067
2596,-1.8151
2597,-1.8192
2598,-1.8254
2599,-1.8315
2600,-1.838
2601,-1.8444
2602,-1.851
2603,-1.8572
2604,-1.8633
2605,-1.8716
2606,-1.8756
2607,-1.8816
2608,-1.8875
2609,-1.8935
2610,-1.8974
2611,-1.9062
2612,-1.915
2613,-1.9212
2614,-1.9251
2615,-1.9309
2616,-1.9367
2617,-1.9448
2618,-1.9505
2619,-1.9543
2620,-1.9599
2621,-1.9683
2622,-1.9773
2623,-1.982
2624,-1.9876
2625,-1.9932
2626,-1.9987
2627,-2.0041
2628,-2.0077
2629,-2.0155
2630,-2.0208
2631,-2.026
2632,-2.0295
2633,-2.0347
2634,-2.0397
2635,-2.0472
2636,-2.0563
2637,-2.0622
2638,-2.0673
2639,-2.0723
2640,-2.0772
2641,-2.0805
2642,-2.0853
2643,-2.09
2644,-2.0947
2645,-2.1004
2646,-2.1049
2647,-2.1094
2648,-2.1138
2649,-2.1182
2650,-2.121
2651,-2.1252
2652,-2.1294
2653,-2.1334
2654,-2.1388
2655,-2.1482
2656,-2.1563
2657,-2.1603
2658,-2.1642
2659,-2.1667
2660,-2.1705
2661,-2.1741
2662,-2.1777
2663,-2.18
2664,-2.1862
2665,-2.1895
2666,-2.1928
2667,-2.1959
2668,-2.1979
2669,-2.2009
2670,-2.2038
2671,-2.2065
2672,-2.2083
2673,-2.2178
2674,-2.2274
2675,-2.2319999999999998
2676,-2.2337
2677,-2.2361
2678,-2.2385
2679,-2.2407
2680,-2.2428
2681,-2.2442
2682,-2.2461
2683,-2.2479
2684,-2.2496
2685,-2.2507
2686,-2.2522
2687,-2.2566
2688,-2.2549
2689,-2.256
2690,-2.2597
2691,-2.2607
2692,-2.2615
2693,-2.2622
2694,-2.2627
2695,-2.2632
2696,-2.2636
2697,-2.2638
2698,-2.2639
2699,-2.2640000000000002
2700,-2.2640000000000002
2701,-2.2640000000000002
2702,-2.2640000000000002
2703,-2.267
2704,-2.276
2705,-2.285
2706,-2.285
2707,-2.285
2708,-2.2880000000000003
