[<text>
<title>olin corp &lt;oln&gt; 3rd qtr net</title>
<dateline>    stamford, conn., oct 20 -
    </dateline>shr 64 cts vs 40 cts
    net 14.9 mln vs 8,600,000
    revs 468.5 mln vs 411.7 mln
    nine mths
    shr 2.64 dlrs vs 2.96 dlrs
    net 61.6 mln vs 67.0 mln
    revs 1.43 billion vs 1.32 billion
 reuter
</text>]