time,value
0,-0.42705
1,-0.42705
2,-0.42705
3,-0.42705
4,-0.42705
5,-0.42705
6,-0.42705
7,-0.42705
8,-0.42705
9,-0.42705
10,-0.42705
11,-0.42705
12,-0.42705
13,-0.42705
14,-0.42705
15,-0.42705
16,-0.42705
17,-0.42705
18,-0.42705
19,-0.42705
20,-0.42705
21,-0.42705
22,-0.42705
23,-0.42705
24,-0.42705
25,-0.42705
26,-0.42705
27,-0.42705
28,-0.42705
29,-0.42705
30,-0.42705
31,-0.42705
32,-0.42705
33,-0.42705
34,-0.42705
35,0.7054600000000001
36,1.6115
37,1.385
38,1.1585
39,1.838
40,1.838
41,2.291
42,1.838
43,2.5175
44,2.7439999999999998
45,2.7439999999999998
46,2.7439999999999998
47,0.47896000000000005
48,-0.42705
49,-0.42705
50,-0.42705
51,-0.42705
52,-0.42705
53,-0.42705
54,-0.42705
55,-0.42705
56,-0.42705
57,-0.42705
58,-0.42705
59,-0.42705
60,-0.42705
61,-0.42705
62,-0.42705
63,-0.42705
64,-0.42705
65,-0.42705
66,-0.42705
67,-0.42705
68,1.838
69,0.025952999999999997
70,-0.42705
71,-0.42705
72,-0.42705
73,-0.42705
74,-0.42705
75,-0.42705
76,-0.42705
77,-0.42705
78,-0.42705
79,-0.42705
80,-0.42705
81,-0.42705
82,-0.42705
83,-0.42705
84,-0.42705
85,-0.42705
86,-0.42705
87,2.7439999999999998
88,4.3295
89,0.47896000000000005
90,-0.42705
91,-0.42705
92,-0.42705
93,-0.42705
94,-0.42705
95,-0.42705
