time,value
0,-0.9677
1,-0.9677
2,-0.076153
3,-0.076153
4,-0.9677
5,-0.9677
6,-0.9677
7,1.5286
8,1.4395
9,-0.6110800000000001
10,-0.9677
11,-0.9677
12,0.72624
13,-0.9677
14,-0.9677
15,-0.43277
16,0.10216
17,0.81539
18,1.3503
19,-0.25445999999999996
20,-0.9677
21,-0.9677
22,0.45876999999999996
23,-0.6110800000000001
24,-0.9677
25,-0.9677
26,0.81539
27,0.54793
28,1.4395
29,0.19130999999999998
30,-0.9677
31,-0.9677
32,-0.43277
33,0.28046
34,-0.9677
35,-0.9677
36,0.28046
37,1.4395
38,1.3503
39,-0.9677
40,-0.9677
41,-0.9677
42,-0.9677
43,0.72624
44,-0.9677
45,-0.9677
46,0.63708
47,1.5286
48,-0.9677
49,-0.9677
50,0.54793
51,-0.9677
52,-0.9677
53,0.72624
54,0.54793
55,1.5286
56,-0.6110800000000001
57,-0.9677
58,-0.34362
59,0.013002000000000001
60,-0.9677
61,-0.9677
62,-0.16530999999999998
63,1.4395
64,1.5286
65,1.5286
66,1.4395
67,1.3503
68,1.4395
69,1.2612
70,1.3503
71,1.3503
72,0.36962
73,-0.9677
74,-0.9677
75,-0.9677
76,-0.9677
77,-0.9677
78,0.72624
79,-0.9677
80,-0.6110800000000001
81,1.5286
82,1.5286
83,1.3503
84,1.4395
85,0.19130999999999998
86,-0.9677
87,-0.9677
88,-0.5219199999999999
89,0.72624
90,-0.9677
91,-0.7893899999999999
92,1.3503
93,1.4395
94,1.4395
95,-0.5219199999999999
