time,value
0,-0.9983
1,-0.9644799999999999
2,-0.92215
3,-0.8880399999999999
4,-0.86441
5,-0.84603
6,-0.82926
7,-0.81696
8,-0.8123
9,-0.80897
10,-0.80537
11,-0.7971
12,-0.78935
13,-0.77594
14,-0.75939
15,-0.73405
16,-0.70523
17,-0.6703
18,-0.6350899999999999
19,-0.5990300000000001
20,-0.55314
21,-0.47536000000000006
22,-0.34218000000000004
23,-0.14917
24,0.08953
25,0.34604
26,0.59914
27,0.83231
28,1.0385
29,1.2094
30,1.3418
31,1.4297
32,1.4738
33,1.4778
34,1.4525
35,1.4067
36,1.3448
37,1.2662
38,1.1704
39,1.0604
40,0.93976
41,0.81188
42,0.6776
43,0.53962
44,0.4005
45,0.26713000000000003
46,0.14343
47,0.035988
48,-0.057344000000000006
49,-0.1353
50,-0.20388
51,-0.26063000000000003
52,-0.30987
53,-0.35048
54,-0.38738
55,-0.42083999999999994
56,-0.45065
57,-0.47717
58,-0.49883999999999995
59,-0.52186
60,-0.54328
61,-0.56844
62,-0.58877
63,-0.6088
64,-0.6259899999999999
65,-0.64662
66,-0.66848
67,-0.69076
68,-0.70849
69,-0.71728
70,-0.71285
71,-0.69125
72,-0.65454
73,-0.60606
74,-0.55267
75,-0.49523999999999996
76,-0.43616000000000005
77,-0.37366
78,-0.30998000000000003
79,-0.24431999999999998
80,-0.17885
81,-0.11617999999999999
82,-0.064042
83,-0.030992000000000002
84,-0.023761
85,-0.042559
86,-0.07997
87,-0.12593
88,-0.17185999999999998
89,-0.21781
90,-0.26773
91,-0.32829
92,-0.39852
93,-0.47315
94,-0.54201
95,-0.59929
96,-0.64284
97,-0.67569
98,-0.70024
99,-0.71777
100,-0.72828
101,-0.73223
102,-0.7329600000000001
103,-0.7321
104,-0.7326199999999999
105,-0.73122
106,-0.73009
107,-0.7257
108,-0.72106
109,-0.71343
110,-0.7055
111,-0.6971
112,-0.68861
113,-0.67604
114,-0.65577
115,-0.63044
116,-0.60464
117,-0.58567
118,-0.57055
119,-0.55893
120,-0.54399
121,-0.52777
122,-0.50436
123,-0.47475
124,-0.43735
125,-0.39716999999999997
126,-0.35863
127,-0.3246
128,-0.29588000000000003
129,-0.26716999999999996
130,-0.23540999999999998
131,-0.19521
132,-0.14997
133,-0.09755499999999999
134,-0.038057
135,0.03609
136,0.12124000000000001
137,0.21349
138,0.30424
139,0.39434
140,0.48441999999999996
141,0.5726
142,0.65118
143,0.71417
144,0.76066
145,0.7901600000000001
146,0.80315
147,0.79488
148,0.7703300000000001
149,0.73083
150,0.68612
151,0.63143
152,0.5685899999999999
153,0.49399
154,0.4164
155,0.3409
156,0.27064
157,0.20072
158,0.12737
159,0.051721
160,-0.019237999999999998
161,-0.072505
162,-0.092855
163,-0.061486
164,0.030001
165,0.18093
166,0.36641
167,0.55748
168,0.71501
169,0.8177399999999999
170,0.85429
171,0.83704
172,0.7821600000000001
173,0.70923
174,0.6262300000000001
175,0.5343
176,0.43057
177,0.31374
178,0.18943
179,0.062412999999999996
180,-0.058588
181,-0.17346
182,-0.27662
183,-0.36907
184,-0.44636000000000003
185,-0.51051
186,-0.5614399999999999
187,-0.6016199999999999
188,-0.6290899999999999
189,-0.64375
190,-0.64813
191,-0.6460199999999999
192,-0.6443399999999999
193,-0.63865
194,-0.63697
195,-0.62948
196,-0.62851
197,-0.61926
198,-0.6062
199,-0.57675
200,-0.53186
201,-0.46965
202,-0.39544
203,-0.32341
204,-0.26032
205,-0.21286999999999998
206,-0.16435
207,-0.1045
208,-0.013456999999999998
209,0.1139
210,0.29751
211,0.55802
212,0.92771
213,1.4165
214,1.9977
215,2.5959
216,3.1187
217,3.5004
218,3.7325
219,3.85
220,3.8897
221,3.8648
222,3.7675
223,3.5947
224,3.3565
225,3.0743
226,2.763
227,2.4316
228,2.0784
229,1.7076
230,1.3294
231,0.96685
232,0.6402100000000001
233,0.36485
234,0.14178
235,-0.032206
236,-0.16787
237,-0.27601
238,-0.3663
239,-0.44677
240,-0.51149
241,-0.56807
242,-0.60865
243,-0.6481899999999999
244,-0.68013
245,-0.71319
246,-0.7377600000000001
247,-0.7611100000000001
248,-0.78035
249,-0.80024
250,-0.8166899999999999
251,-0.8281799999999999
252,-0.83657
253,-0.8446100000000001
254,-0.8569
255,-0.8683
256,-0.87751
257,-0.8808
258,-0.88251
259,-0.8837700000000001
260,-0.88833
261,-0.8963700000000001
262,-0.90741
263,-0.9175399999999999
264,-0.92719
265,-0.94206
266,-0.9668
267,-0.9953299999999999
268,-1.0142
269,-1.0176
