time,value
0,-1.1934
1,-1.1663
2,-1.1285
3,-1.0834
4,-1.0352
5,-0.98844
6,-0.94378
7,-0.90004
8,-0.85511
9,-0.80799
10,-0.75679
11,-0.70148
12,-0.64367
13,-0.58638
14,-0.5302899999999999
15,-0.47591000000000006
16,-0.42411000000000004
17,-0.37645
18,-0.33253
19,-0.29274
20,-0.25851999999999997
21,-0.2315
22,-0.21098000000000003
23,-0.19629000000000002
24,-0.18766
25,-0.18514
26,-0.18728
27,-0.19302
28,-0.20243
29,-0.21493
30,-0.22866
31,-0.24206999999999998
32,-0.25499
33,-0.26673
34,-0.27621999999999997
35,-0.28296
36,-0.28785
37,-0.29081999999999997
38,-0.29144000000000003
39,-0.28943
40,-0.28551
41,-0.27905
42,-0.26924000000000003
43,-0.2553
44,-0.2378
45,-0.21533000000000002
46,-0.18706
47,-0.15257
48,-0.11352999999999999
49,-0.069087
50,-0.019991
51,0.031826
52,0.08175
53,0.12924000000000002
54,0.17242000000000002
55,0.20867
56,0.23383
57,0.24999000000000002
58,0.25804
59,0.25771
60,0.24743
61,0.23135999999999998
62,0.21151
63,0.18758
64,0.15867
65,0.12857000000000002
66,0.09870599999999999
67,0.067412
68,0.033306
69,-0.0014305
70,-0.036639
71,-0.07505
72,-0.11714000000000001
73,-0.16003
74,-0.20178
75,-0.24311999999999998
76,-0.2817
77,-0.31367
78,-0.33671999999999996
79,-0.35204
80,-0.35729
81,-0.34963
82,-0.32676
83,-0.28893
84,-0.2315
85,-0.15033
86,-0.042476
87,0.09068
88,0.25049
89,0.43408
90,0.63551
91,0.8440200000000001
92,1.0527
93,1.2521
94,1.4335
95,1.5889
96,1.7173
97,1.8181
98,1.8927
99,1.9438
100,1.9777
101,1.9988
102,2.0096
103,2.012
104,2.0085
105,1.999
106,1.9818
107,1.9562
108,1.9226
109,1.8802
110,1.8285
111,1.7684
112,1.7019
113,1.63
114,1.5532
115,1.4734
116,1.392
117,1.3096
118,1.226
119,1.1418
120,1.0569
121,0.97024
122,0.87992
123,0.78555
124,0.6865100000000001
125,0.5824699999999999
126,0.47343
127,0.36232
128,0.25143000000000004
129,0.14265999999999998
130,0.036579
131,-0.063401
132,-0.15683
133,-0.24413
134,-0.32719000000000004
135,-0.4025
136,-0.47048999999999996
137,-0.5322100000000001
138,-0.59021
139,-0.6412100000000001
140,-0.68694
141,-0.72988
142,-0.77277
143,-0.81193
144,-0.8478100000000001
145,-0.88179
146,-0.9153100000000001
147,-0.94419
148,-0.96891
149,-0.99198
150,-1.0155
151,-1.0356
152,-1.0524
153,-1.0685
154,-1.0852
155,-1.0983
156,-1.1076
157,-1.1162
158,-1.1248
159,-1.1299
160,-1.1314
161,-1.1331
162,-1.1351
163,-1.135
164,-1.1325
165,-1.1311
166,-1.1297
167,-1.1259
168,-1.119
169,-1.1123
170,-1.1041
171,-1.0924
172,-1.0757
173,-1.0553
174,-1.0269
175,-0.98672
176,-0.9316200000000001
177,-0.8619700000000001
178,-0.77462
179,-0.66838
180,-0.54311
181,-0.40153
182,-0.24249
183,-0.06617
184,0.12675999999999998
185,0.33351
186,0.55267
187,0.7802399999999999
188,1.0102
189,1.2344
190,1.446
191,1.6379
192,1.8047
193,1.9427
194,2.052
195,2.1339
196,2.1906
197,2.2243
198,2.2377
199,2.2322
200,2.2087
201,2.1675
202,2.1096
203,2.0361
204,1.9480000000000002
205,1.8467
206,1.7346
207,1.6145
208,1.4893
209,1.3625
210,1.2377
211,1.1179
212,1.0041
213,0.8962200000000001
214,0.7931
215,0.69243
216,0.59149
217,0.48896999999999996
218,0.38444
219,0.27852
220,0.17217000000000002
221,0.068163
222,-0.031585
223,-0.12565
224,-0.21374
225,-0.29341999999999996
226,-0.36465
227,-0.42796000000000006
228,-0.4848
229,-0.53294
230,-0.5735899999999999
231,-0.60845
232,-0.6391
233,-0.66291
234,-0.68133
235,-0.6965899999999999
236,-0.70982
237,-0.71865
238,-0.7248399999999999
239,-0.73098
240,-0.73739
241,-0.74188
242,-0.74597
243,-0.75217
244,-0.76021
245,-0.76863
246,-0.7788
247,-0.79276
248,-0.80914
249,-0.8262799999999999
250,-0.8448399999999999
251,-0.86644
252,-0.88981
253,-0.9142600000000001
254,-0.94035
255,-0.96891
256,-0.9974799999999999
257,-1.0246
258,-1.05
259,-1.0746
260,-1.0976
261,-1.1194
262,-1.1407
263,-1.1619
264,-1.1809
265,-1.1959
266,-1.206
267,-1.2114
268,-1.2121
269,-1.2097
