time,value
0,-0.42096999999999996
1,-0.20601
2,-0.20601
3,-0.20601
4,-0.42096999999999996
5,-0.20601
6,-0.20601
7,-0.20601
8,-0.42096999999999996
9,-0.20601
10,-0.20601
11,-0.20601
12,-0.42096999999999996
13,-0.20601
14,-0.20601
15,-0.20601
16,-0.20601
17,-0.42096999999999996
18,-0.20601
19,-0.20601
20,-0.20601
21,-0.42096999999999996
22,-0.20601
23,-0.20601
24,-0.20601
25,-0.42096999999999996
26,-0.20601
27,-0.20601
28,-0.20601
29,-0.42096999999999996
30,-0.20601
31,-0.20601
32,-0.20601
33,-0.42096999999999996
34,-0.20601
35,-0.20601
36,-0.20601
37,-0.42096999999999996
38,-0.20601
39,-0.20601
40,-0.20601
41,-0.42096999999999996
42,-0.20601
43,-0.20601
44,-0.20601
45,-0.42096999999999996
46,-0.20601
47,-0.20601
48,-0.20601
49,-0.20601
50,-0.42096999999999996
51,-0.20601
52,-0.20601
53,-0.20601
54,-0.42096999999999996
55,-0.20601
56,-0.20601
57,-0.20601
58,-0.42096999999999996
59,-0.20601
60,-0.20601
61,-0.20601
62,-0.42096999999999996
63,-0.20601
64,-0.20601
65,-0.20601
66,-0.42096999999999996
67,-0.20601
68,-0.20601
69,-0.20601
70,-0.20601
71,-0.20601
72,-0.20601
73,-0.20601
74,-0.20601
75,-0.20601
76,-0.20601
77,-0.20601
78,-0.20601
79,-0.20601
80,-0.20601
81,3.2334
82,4.0933
83,4.0933
84,4.5232
85,4.3083
86,2.3736
87,-0.20601
88,-0.20601
89,-0.20601
90,-0.42096999999999996
91,-0.20601
92,-0.20601
93,-0.20601
94,-0.42096999999999996
95,-0.20601
