[<text>
<title>dyncorp &lt;dyn&gt; 3rd qtr net</title>
<dateline>    mclean, va., oct 20 -
    </dateline>shr 32 cts vs 35 cts
    net 3,446,000 vs 3,789,000
    revs 220.9 mln vs 186.9 mln
    nine mths
    oper shr 77 cts vs 71 cts
    oper net 8,301,000 vs 7,298,000
    revs 634.3 mln vs 535.1 mln
    note: 1987 nine mths net excludes 3,510,000 dlr charge from
antitrust litigation.
 reuter
</text>]