time,value
0,-0.16695
1,-0.16695
2,-0.16695
3,-0.16695
4,-0.16695
5,-0.16695
6,-0.16695
7,-0.16695
8,-0.16695
9,-0.16695
10,-0.16695
11,-0.16695
12,-0.16695
13,-0.16695
14,-0.16695
15,-0.16695
16,-0.16695
17,-0.16695
18,-0.16695
19,-0.16695
20,-0.16695
21,-0.16695
22,-0.16695
23,-0.16695
24,-0.16695
25,-0.16695
26,-0.16695
27,5.8897
28,-0.16695
29,-0.16695
30,-0.16695
31,-0.16695
32,-0.16695
33,-0.16695
34,-0.16695
35,-0.16695
36,-0.16695
37,-0.16695
38,-0.16695
39,-0.16695
40,-0.16695
41,-0.16695
42,-0.16695
43,-0.16695
44,-0.16695
45,-0.16695
46,-0.16695
47,-0.16695
48,-0.16695
49,-0.16695
50,-0.16695
51,-0.16695
52,-0.16695
53,-0.16695
54,-0.16695
55,-0.16695
56,-0.16695
57,-0.16695
58,-0.16695
59,-0.16695
60,-0.16695
61,-0.16695
62,-0.16695
63,-0.16695
64,-0.16695
65,-0.16695
66,-0.16695
67,-0.16695
68,-0.16695
69,-0.16695
70,-0.16695
71,-0.16695
72,-0.16695
73,-0.16695
74,-0.16695
75,-0.16695
76,-0.16695
77,-0.16695
78,-0.16695
79,-0.16695
80,2.4421
81,7.1942
82,-0.16695
83,-0.16695
84,-0.16695
85,-0.16695
86,-0.16695
87,-0.16695
88,-0.16695
89,-0.16695
90,-0.16695
91,-0.16695
92,-0.16695
93,-0.16695
94,-0.16695
95,-0.16695
