time,value
0,-0.68124
1,-0.68124
2,-0.68124
3,-0.68124
4,-0.68124
5,-0.68124
6,-0.68124
7,-0.68124
8,-0.68124
9,-0.68124
10,-0.68124
11,-0.68124
12,-0.68124
13,-0.68124
14,-0.68124
15,-0.68124
16,-0.68124
17,-0.68124
18,-0.68124
19,-0.68124
20,-0.68124
21,-0.68124
22,-0.68124
23,-0.68124
24,-0.68124
25,-0.68124
26,-0.68124
27,-0.68124
28,-0.27671
29,1.2066
30,1.7459
31,1.6111
32,1.7459
33,1.7459
34,1.6111
35,1.7459
36,1.7459
37,1.6111
38,1.7459
39,1.7459
40,1.6111
41,1.6111
42,1.6111
43,1.6111
44,1.7459
45,1.6111
46,1.7459
47,1.7459
48,1.6111
49,1.7459
50,1.6111
51,1.6111
52,1.2066
53,1.0717
54,-0.68124
55,-0.68124
56,-0.68124
57,-0.68124
58,-0.68124
59,-0.68124
60,-0.68124
61,-0.68124
62,0.26266
63,0.39751
64,-0.27671
65,-0.007023100000000001
66,-0.14187
67,-0.68124
68,-0.27671
69,-0.68124
70,-0.68124
71,-0.68124
72,-0.68124
73,0.39751
74,-0.68124
75,-0.68124
76,0.53235
77,-0.68124
78,-0.68124
79,-0.68124
80,-0.68124
81,0.12782000000000002
82,-0.27671
83,-0.68124
84,-0.68124
85,-0.68124
86,-0.68124
87,-0.68124
88,-0.68124
89,-0.68124
90,-0.68124
91,-0.68124
92,-0.68124
93,-0.68124
94,-0.68124
95,-0.68124
