time,value
0,1.1413
1,1.0706
2,0.9855200000000001
3,0.92012
4,0.81776
5,0.7427600000000001
6,0.6722600000000001
7,0.6220100000000001
8,0.535
9,0.47208999999999995
10,0.40484000000000003
11,0.32875
12,0.2653
13,0.25486
14,0.19478
15,0.11060999999999999
16,0.024394
17,-0.058866999999999996
18,-0.14912
19,-0.20543000000000003
20,-0.30199000000000004
21,-0.37289
22,-0.40039
23,-0.36145
24,-0.30527
25,-0.3264
26,-0.42788000000000004
27,-0.5404100000000001
28,-0.6748
29,-0.7915
30,-0.91796
31,-0.9917299999999999
32,-1.0601
33,-1.1472
34,-1.2465
35,-1.2531
36,-1.1998
37,-1.1103
38,-1.1547
39,-1.2373
40,-1.3309
41,-1.4268
42,-1.5175
43,-1.6122
44,-1.7042
45,-1.79
46,-1.8764
47,-1.9455
48,-1.8708
49,-1.7636
50,-1.6414
51,-1.5304
52,-1.4074
53,-1.3036
54,-1.1905
55,-1.0951
56,-0.97173
57,-0.89244
58,-0.79667
59,-0.68535
60,-0.56733
61,-0.48008
62,-0.36874
63,-0.26205
64,-0.1549
65,-0.044267
66,0.073667
67,0.19284
68,0.3077
69,0.41768
70,0.53394
71,0.66805
72,0.8022100000000001
73,0.93622
74,1.0478
75,1.1269
76,1.2733
77,1.4056
78,1.5413
79,1.6869999999999998
80,1.8075
81,1.9322
82,2.073
83,2.2057
84,2.3237
85,2.4805
86,2.6243
87,2.697
88,2.7088
89,2.6184
90,2.4658
91,2.3721
92,2.2318
93,2.0902
94,1.9398
95,1.7942
96,1.6778
97,1.6194
98,1.473
99,1.3391
100,1.2003
101,1.0695
102,0.99998
103,0.8779399999999999
104,0.7814399999999999
105,0.64966
106,0.59635
107,0.46815
108,0.34531999999999996
109,0.21945
110,0.099069
111,-0.021435
112,-0.10475
113,-0.21911
114,-0.28478000000000003
115,-0.33038
116,-0.44551999999999997
117,-0.53819
118,-0.63547
119,-0.73461
120,-0.8224600000000001
121,-0.87981
122,-1.0113
123,-1.1234
124,-1.2457
125,-1.3732
126,-1.482
127,-1.6245
128,-1.7672
129,-1.8532
130,-1.8483
131,-1.8462
132,-1.7846
133,-1.7036
134,-1.6408
135,-1.5693
136,-1.4884
137,-1.4032
138,-1.3198
139,-1.263
140,-1.266
141,-1.3209
142,-1.3035
143,-1.2206
144,-1.1358
145,-1.0617
146,-0.98634
147,-0.89849
148,-0.82555
149,-0.7260300000000001
150,-0.65115
151,-0.57629
152,-0.52942
153,-0.53851
154,-0.56257
155,-0.5323899999999999
156,-0.4223
157,-0.31890999999999997
158,-0.24625999999999998
159,-0.15550999999999998
160,-0.055012
161,-0.032527999999999994
162,0.068735
163,0.16178
164,0.23146999999999998
165,0.28829
166,0.37796
167,0.49108999999999997
168,0.58959
169,0.6662100000000001
170,0.6735800000000001
171,0.56809
172,0.44753000000000004
173,0.33599
174,0.22655
175,0.11863
176,0.010586
177,-0.098105
178,-0.2099
179,-0.32448
180,-0.4383
181,-0.55593
182,-0.68048
183,-0.7964399999999999
184,-0.91855
185,-1.0490000000000002
186,-1.172
187,-1.2976
188,-1.3748
189,-1.3942
190,-1.3546
191,-1.2347
192,-1.1261
193,-1.0048
194,-0.87524
195,-0.76948
196,-0.68634
197,-0.61069
198,-0.53674
199,-0.44648999999999994
200,-0.34046
201,-0.2527
202,-0.17365
203,-0.078377
204,0.031481999999999996
205,0.10432999999999999
206,0.16366
207,0.24504
208,0.31916
209,0.39518000000000003
210,0.49075
211,0.5844600000000001
212,0.68167
213,0.72282
214,0.62254
215,0.5152800000000001
216,0.40686
217,0.30201
218,0.20023
219,0.11719
220,0.065451
221,0.096899
222,0.19960999999999998
223,0.25008
224,0.30066
225,0.36806
226,0.43291999999999997
227,0.49777
228,0.49518999999999996
229,0.54357
230,0.6159600000000001
231,0.6937300000000001
232,0.73698
233,0.81274
234,0.90275
235,0.9990100000000001
236,0.99351
237,0.8770899999999999
238,0.75888
239,0.63226
240,0.49823
241,0.38327
242,0.29546999999999995
243,0.17501
244,0.060703999999999994
245,-0.062241
246,-0.18509
247,-0.29646999999999996
248,-0.37888
249,-0.39531
250,-0.38781
251,-0.44265
252,-0.55411
253,-0.6643100000000001
254,-0.7771100000000001
255,-0.88884
256,-0.9973299999999999
257,-0.9324600000000001
258,-0.82247
259,-0.72497
260,-0.63818
261,-0.52276
262,-0.41008999999999995
263,-0.2881
264,-0.17708
265,-0.063137
266,0.051548000000000004
267,0.16725
268,0.28155
269,0.35725999999999997
270,0.26019000000000003
271,0.16856
272,0.11295
273,0.045348
274,0.041852
275,0.13319
276,0.2489
277,0.34251
278,0.46598999999999996
279,0.58001
280,0.68471
281,0.69153
282,0.72718
283,0.79683
284,0.8845200000000001
285,0.9964700000000001
286,1.0811
287,1.1729
288,1.2935
289,1.4248
290,1.5126
291,1.4208
292,1.3218
293,1.2282
294,1.1657
295,1.0806
296,1.0002
297,0.9205
298,0.85721
299,0.84398
300,0.78947
301,0.68097
302,0.58322
303,0.49163999999999997
304,0.39224000000000003
305,0.29961
306,0.2611
307,0.31172
308,0.37587
309,0.44642
310,0.52532
311,0.60526
312,0.6833199999999999
313,0.60485
314,0.47797
315,0.35966
316,0.22032
317,0.096322
318,-0.05934299999999999
319,-0.19904000000000002
320,-0.32453000000000004
321,-0.46188999999999997
322,-0.59022
323,-0.7067899999999999
324,-0.8346100000000001
325,-0.9736799999999999
326,-1.1094
327,-1.2186
328,-1.3712
329,-1.4823
330,-1.6219
331,-1.7346
332,-1.8508
333,-1.9611
334,-2.056
335,-2.1582
336,-2.2121
337,-2.2231
338,-2.1105
339,-2.0175
340,-1.9406
341,-1.8263
342,-1.7157
343,-1.5962
344,-1.4829
345,-1.369
346,-1.2585
347,-1.1607
348,-1.0792
349,-0.95894
350,-0.8271299999999999
351,-0.7125
352,-0.5977600000000001
353,-0.48562
354,-0.37146999999999997
355,-0.25394
356,-0.13667
357,-0.098742
358,-0.06981799999999999
359,0.0079139
360,0.10941
361,0.21393
362,0.32381
363,0.43513
364,0.53999
365,0.6462399999999999
366,0.7549
367,0.82715
368,0.9269700000000001
369,1.0346
370,1.1491
371,1.2571
372,1.3673
373,1.4748
374,1.5893
375,1.6478
376,1.5321
377,1.4240000000000002
378,1.3125
379,1.2279
380,1.1619
381,1.077
382,0.99336
383,0.89361
384,0.8359200000000001
385,0.8085100000000001
386,0.72526
387,0.62605
388,0.53701
389,0.44876000000000005
390,0.3627
391,0.29789
392,0.31175
393,0.37548000000000004
394,0.43955
395,0.53386
396,0.64478
397,0.72159
398,0.8201799999999999
399,0.92258
400,1.0302
401,1.08
402,0.9795299999999999
403,0.87461
404,0.77181
405,0.66566
406,0.55638
407,0.46861
408,0.38616
409,0.30061
410,0.19974
411,0.09169400000000001
412,-0.021006999999999998
413,-0.14555
414,-0.25779
415,-0.32379
416,-0.27724
417,-0.13859000000000002
418,-0.024035
419,0.077615
420,0.22159
421,0.36572
422,0.48658
423,0.61366
424,0.75897
425,0.90896
426,1.0629
