time,value
0,0.38699
1,0.43416000000000005
2,0.40188
3,0.42211000000000004
4,0.54452
5,0.546
6,0.53961
7,0.53505
8,0.41105
9,0.42488000000000004
10,0.43276000000000003
11,0.50525
12,0.41055
13,0.47413999999999995
14,0.44914
15,0.47513999999999995
16,0.49086
17,0.43708
18,0.45227
19,0.46812
20,0.48758999999999997
21,0.51485
22,0.5364300000000001
23,0.52054
24,0.44848999999999994
25,0.50616
26,0.4939
27,0.51625
28,0.5703
29,0.61033
30,0.58031
31,0.5864
32,0.46912
33,0.30877
34,0.26600999999999997
35,-0.073212
36,-0.40381999999999996
37,-0.70252
38,-0.9192799999999999
39,-1.0456
40,-1.1861
41,-1.4348
42,-1.6366
43,-1.8335
44,-1.9998
45,-2.1984
46,-2.3496
47,-2.1887
48,-1.88
49,-1.4858
50,-1.2572
51,-0.9679
52,-0.77164
53,-0.32229
54,-0.17469
55,0.065295
56,0.38683
57,0.40875
58,0.47573999999999994
59,0.52331
60,0.76423
61,1.0595
62,0.72517
63,0.67661
64,1.6259
65,1.5249
66,0.67223
67,0.38016
68,0.49801000000000006
69,0.30069
70,0.33075
71,0.34635
72,0.41700000000000004
73,0.37041
74,0.46198
75,0.6812
76,0.45442
77,0.28683000000000003
78,0.29567
79,0.35394000000000003
80,0.36622
81,0.24711
82,0.11435999999999999
83,0.036312
84,-0.16264
85,-0.26009
86,-0.45213000000000003
87,-0.47865
88,-0.65127
89,-0.7347899999999999
90,-0.72104
91,-0.84464
92,-0.7643300000000001
93,-0.75607
94,-0.43001999999999996
95,-0.38437
96,-0.30141999999999997
97,-0.13592
98,0.07149
99,0.064475
100,0.013593000000000001
101,0.23392
102,0.09665800000000001
103,0.14615999999999998
104,0.35012
105,-0.06590399999999999
106,-0.08962300000000001
107,0.16507
108,-0.67269
109,-0.40696
110,-0.78699
111,-1.0096
112,-1.179
113,-1.5042
114,-1.5721
115,-1.7148
116,-1.7516
117,-1.9038
118,-1.8404
119,-1.7075
120,-1.7232
121,-1.6974
122,-1.6027
123,-1.6925
124,-1.5759
125,-1.2519
126,-1.2662
127,-1.3828
128,-1.2332
129,-0.9688700000000001
130,-0.9926299999999999
131,-0.9456899999999999
132,-0.67494
133,-0.5405800000000001
134,-0.43841
135,-0.26561
136,-0.13305999999999998
137,0.11242
138,0.26059
139,0.41597
140,0.70365
141,0.71229
142,0.59918
143,0.60068
144,0.8287100000000001
145,1.0137
146,1.2145
147,0.67793
148,0.222
149,0.043227
150,-0.055344000000000004
151,0.22279000000000002
152,0.28673000000000004
153,0.30469
154,0.25359
155,0.44078999999999996
156,0.22266999999999998
157,0.24184
158,0.46246000000000004
159,0.15567999999999999
160,0.016332
161,0.0036975000000000003
162,0.033346
163,-0.65063
164,-0.9155
165,-1.6516
166,-2.5154
167,-2.9578
168,-3.5059
169,-3.4378
170,-3.5786
171,-3.3192
172,-3.4204
173,-3.2027
174,-2.5587
175,-2.0222
176,-3.4232
177,-2.6453
178,-2.4761
179,-2.3112
180,-1.5101
181,-0.64678
182,-0.1064
183,0.26368
184,0.75977
185,0.8686
186,0.97735
187,0.9329799999999999
188,0.64159
189,0.78136
190,0.76169
191,0.74044
192,1.3444
193,1.483
194,1.0289
195,0.6651600000000001
196,0.4888
197,0.31794
198,0.28203
199,0.60155
200,0.59563
201,0.47106000000000003
202,0.74643
203,0.8838600000000001
204,0.51173
205,0.7660600000000001
206,0.9598
207,1.0317
208,0.85498
209,0.67938
210,0.6955899999999999
211,0.65325
212,0.5239
213,0.49891
214,0.29102
215,0.14694000000000002
216,0.33146
217,0.25438
218,0.1305
219,0.2416
220,0.30116
221,0.2491
222,0.40089
223,0.5001899999999999
224,0.5977899999999999
225,0.7024699999999999
226,0.7345
227,0.71873
228,0.66041
229,0.49428999999999995
230,0.44493
231,0.37426
232,0.41975
233,0.6191399999999999
234,0.61858
235,0.58935
236,0.49443000000000004
237,0.47776
238,0.47386000000000006
239,0.58936
240,0.5657800000000001
241,0.6894600000000001
242,0.6726
243,0.71601
244,0.60736
245,0.6027399999999999
246,0.61344
247,0.6074
248,0.60958
249,0.60629
250,0.6106
251,0.6047100000000001
252,0.61406
253,0.61407
254,0.3813
255,0.60501
256,0.59464
257,0.50178
258,0.49637
259,0.51483
260,0.6187600000000001
261,0.62255
262,0.49443000000000004
263,0.4962
264,0.52976
265,0.48393
266,0.55483
267,0.55978
268,0.60616
269,0.60682
270,0.60595
271,0.60892
272,0.61321
273,0.7402
274,0.67993
275,0.61669
276,0.61275
277,0.61206
278,0.4846
279,0.52508
280,0.60326
281,0.60344
282,0.6009899999999999
283,0.6400399999999999
284,0.73038
285,0.73293
286,0.7275699999999999
287,0.60097
288,0.59758
289,0.59078
290,0.58038
291,0.55752
292,0.5813699999999999
293,0.72104
294,0.72534
295,0.72569
296,0.59235
297,0.58811
298,0.5824699999999999
299,0.46142
