time,value
0,-0.5783
1,-0.5783
2,-0.5783
3,2.1147
4,0.87177
5,-0.5783
6,-0.5783
7,-0.5783
8,-0.5783
9,-0.16399999999999998
10,2.3218
11,0.043157
12,-0.5783
13,-0.5783
14,-0.5783
15,-0.5783
16,0.45746000000000003
17,2.3218
18,-0.5783
19,-0.5783
20,-0.5783
21,-0.5783
22,-0.5783
23,0.66461
24,2.1147
25,-0.5783
26,-0.5783
27,-0.5783
28,-0.5783
29,-0.5783
30,1.0789
31,1.7004
32,-0.5783
33,-0.5783
34,-0.5783
35,-0.5783
36,-0.5783
37,1.7004
38,1.2861
39,-0.5783
40,-0.5783
41,-0.5783
42,-0.5783
43,-0.5783
44,2.1147
45,0.66461
46,-0.5783
47,-0.5783
48,-0.5783
49,-0.5783
50,-0.5783
51,2.1147
52,0.45746000000000003
53,-0.5783
54,-0.5783
55,-0.5783
56,-0.5783
57,-0.5783
58,2.3218
59,0.45746000000000003
60,-0.5783
61,-0.5783
62,-0.5783
63,-0.5783
64,-0.5783
65,2.3218
66,0.25031
67,-0.5783
68,-0.5783
69,-0.5783
70,-0.5783
71,-0.5783
72,2.3218
73,0.45746000000000003
74,-0.5783
75,-0.5783
76,-0.5783
77,-0.5783
78,-0.5783
79,2.3218
80,0.45746000000000003
81,-0.5783
82,-0.5783
83,-0.5783
84,-0.5783
85,-0.16399999999999998
86,2.3218
87,0.25031
88,-0.5783
89,-0.5783
90,-0.5783
91,-0.5783
92,0.66461
93,2.3218
94,-0.5783
95,-0.5783
