time,value
0,1.1213
1,1.2237
2,1.1213
3,1.2237
4,1.1213
5,1.2237
6,1.1213
7,1.1213
8,1.1213
9,1.1213
10,-0.82468
11,-1.0295
12,-1.0295
13,-1.0295
14,-0.82468
15,1.4285
16,1.3261
17,1.1213
18,1.2237
19,-0.10775
20,-1.0295
21,-1.0295
22,-1.0295
23,1.3261
24,1.2237
25,0.1995
26,-1.0295
27,-1.0295
28,-1.0295
29,1.3261
30,1.2237
31,-1.0295
32,-1.0295
33,-1.0295
34,0.40434000000000003
35,1.2237
36,-0.10775
37,-1.0295
38,-1.0295
39,1.1213
40,1.2237
41,-0.41501000000000005
42,-1.0295
43,-1.0295
44,1.3261
45,0.91643
46,-1.0295
47,-1.0295
48,0.40434000000000003
49,1.2237
50,-0.51742
51,-1.0295
52,-1.0295
53,1.1213
54,0.91643
55,-1.0295
56,-1.0295
57,-0.51742
58,1.2237
59,0.30191999999999997
60,-1.0295
61,-1.0295
62,0.097084
63,1.2237
64,-0.41501000000000005
65,-1.0295
66,-1.0295
67,0.71159
68,1.2237
69,-0.31259000000000003
70,-1.0295
71,-1.0295
72,0.71159
73,1.2237
74,-0.72226
75,-1.0295
76,-0.31259000000000003
77,1.2237
78,0.097084
79,-1.0295
80,-1.0295
81,0.1995
82,1.2237
83,-0.41501000000000005
84,-1.0295
85,-1.0295
86,0.91643
87,1.1213
88,-1.0295
89,-1.0295
90,-0.82468
91,1.3261
92,0.50676
93,-1.0295
94,-1.0295
95,-0.72226
