time,value
0,0.64427
1,0.49267
2,-0.87165
3,0.94745
4,0.037898
5,-0.87165
6,1.2506
7,-0.41688000000000003
8,-0.87165
9,1.857
10,-0.87165
11,-0.87165
12,1.7054
13,-0.87165
14,-0.87165
15,1.7054
16,-0.87165
17,-0.87165
18,1.5538
19,-0.87165
20,-0.26529
21,1.099
22,-0.87165
23,0.037898
24,0.79586
25,-0.87165
26,0.18949000000000002
27,0.49267
28,-0.87165
29,0.49267
30,0.34108
31,-0.87165
32,1.099
33,-0.26529
34,-0.87165
35,1.2506
36,-0.41688000000000003
37,-0.87165
38,1.2506
39,-0.41688000000000003
40,-0.87165
41,1.099
42,-0.26529
43,-0.87165
44,0.94745
45,-0.11369000000000001
46,-0.87165
47,0.79586
48,0.037898
49,-0.87165
50,0.49267
51,0.34108
52,-0.87165
53,0.037898
54,0.94745
55,-0.87165
56,-0.56847
57,1.4022
58,-0.87165
59,-0.87165
60,1.7054
61,-0.87165
62,-0.87165
63,1.7054
64,-0.87165
65,-0.87165
66,1.2506
67,-0.41688000000000003
68,-0.87165
69,0.64427
70,0.18949000000000002
71,-0.87165
72,1.2506
73,-0.26529
74,-0.87165
75,1.7054
76,-0.87165
77,-0.87165
78,1.7054
79,-0.87165
80,-0.87165
81,1.7054
82,-0.87165
83,-0.87165
84,1.857
85,-0.87165
86,-0.87165
87,1.857
88,-0.87165
89,-0.87165
90,1.857
91,-0.87165
92,-0.87165
93,1.857
94,-0.87165
95,-0.87165
