time,value
0,-0.36943000000000004
1,-0.36943000000000004
2,-0.36943000000000004
3,-0.36943000000000004
4,-0.36943000000000004
5,-0.36943000000000004
6,-0.36943000000000004
7,-0.36943000000000004
8,-0.36943000000000004
9,-0.36943000000000004
10,-0.36943000000000004
11,-0.36943000000000004
12,-0.36943000000000004
13,-0.36943000000000004
14,-0.36943000000000004
15,-0.36943000000000004
16,-0.36943000000000004
17,-0.36943000000000004
18,-0.36943000000000004
19,-0.36943000000000004
20,-0.36943000000000004
21,-0.36943000000000004
22,-0.36943000000000004
23,-0.36943000000000004
24,-0.36943000000000004
25,-0.36943000000000004
26,-0.36943000000000004
27,-0.36943000000000004
28,-0.36943000000000004
29,-0.36943000000000004
30,-0.36943000000000004
31,-0.36943000000000004
32,-0.36943000000000004
33,-0.36943000000000004
34,-0.36943000000000004
35,-0.36943000000000004
36,-0.36943000000000004
37,-0.36943000000000004
38,-0.36943000000000004
39,-0.36943000000000004
40,-0.36943000000000004
41,-0.36943000000000004
42,-0.36943000000000004
43,-0.36943000000000004
44,-0.36943000000000004
45,-0.36943000000000004
46,-0.36943000000000004
47,-0.36943000000000004
48,-0.36943000000000004
49,-0.36943000000000004
50,-0.36943000000000004
51,-0.36943000000000004
52,-0.36943000000000004
53,-0.36943000000000004
54,-0.36943000000000004
55,-0.21786999999999998
56,-0.36943000000000004
57,-0.36943000000000004
58,-0.36943000000000004
59,-0.36943000000000004
60,-0.36943000000000004
61,-0.36943000000000004
62,-0.36943000000000004
63,-0.36943000000000004
64,-0.36943000000000004
65,-0.36943000000000004
66,-0.36943000000000004
67,-0.36943000000000004
68,-0.36943000000000004
69,-0.36943000000000004
70,-0.21786999999999998
71,-0.36943000000000004
72,-0.36943000000000004
73,-0.36943000000000004
74,-0.36943000000000004
75,-0.36943000000000004
76,-0.36943000000000004
77,2.6618
78,2.8134
79,2.9649
80,2.8134
81,2.8134
82,2.9649
83,2.5103
84,0.085254
85,-0.066309
86,-0.066309
87,1.9040000000000001
88,2.9649
89,2.9649
90,2.8134
91,-0.36943000000000004
92,-0.36943000000000004
93,-0.521
94,-0.36943000000000004
95,-0.36943000000000004
