time,value
0,-0.50876
1,-0.50876
2,-0.50876
3,-0.50876
4,-0.50876
5,-0.50876
6,-0.50876
7,-0.50876
8,-0.50876
9,-0.50876
10,-0.50876
11,-0.50876
12,-0.50876
13,-0.50876
14,-0.50876
15,-0.50876
16,-0.50876
17,-0.50876
18,-0.50876
19,-0.50876
20,-0.50876
21,-0.50876
22,-0.50876
23,-0.50876
24,-0.50876
25,-0.50876
26,-0.50876
27,-0.50876
28,-0.50876
29,-0.50876
30,-0.50876
31,-0.50876
32,-0.50876
33,-0.50876
34,-0.50876
35,-0.50876
36,-0.50876
37,-0.50876
38,-0.50876
39,-0.50876
40,-0.50876
41,-0.50876
42,-0.50876
43,-0.50876
44,-0.50876
45,-0.50876
46,-0.50876
47,-0.50876
48,-0.50876
49,-0.50876
50,-0.50876
51,-0.50876
52,-0.50876
53,-0.50876
54,-0.50876
55,-0.50876
56,-0.50876
57,-0.50876
58,-0.50876
59,-0.50876
60,-0.50876
61,-0.50876
62,-0.50876
63,-0.50876
64,0.8112699999999999
65,2.6593
66,0.15125
67,0.28326
68,0.15125
69,0.28326
70,0.15125
71,0.28326
72,0.15125
73,0.28326
74,0.15125
75,0.28326
76,0.15125
77,0.8112699999999999
78,2.6593
79,2.5273
80,0.41526
81,0.15125
82,0.28326
83,1.4713
84,2.6593
85,2.5273
86,2.6593
87,2.6593
88,2.6593
89,2.5273
90,2.5273
91,2.2633
92,-0.50876
93,-0.50876
94,-0.50876
95,-0.50876
