time,value
0,-2.355
1,-2.355
2,-2.355
3,-2.3569999999999998
4,-2.3569999999999998
5,-2.3569999999999998
6,-2.3589
7,-2.3685
8,-2.3703
9,-2.37
10,-2.3696
11,-2.369
12,-2.3682
13,-2.3675
14,-2.3665
15,-2.3653
16,-2.3642
17,-2.3646
18,-2.3611
19,-2.3593
20,-2.3578
21,-2.3577
22,-2.3555
23,-2.3536
24,-2.3536
25,-2.3624
26,-2.3616
27,-2.3594
28,-2.3565
29,-2.3535
30,-2.3509
31,-2.3477
32,-2.3442
33,-2.3407
34,-2.3378
35,-2.334
36,-2.3301
37,-2.3269
38,-2.3228
39,-2.322
40,-2.3186
41,-2.3151
42,-2.3133
43,-2.3107
44,-2.307
45,-2.3024
46,-2.2977
47,-2.2928
48,-2.2889
49,-2.2838
50,-2.2787
51,-2.2745
52,-2.2692
53,-2.2633
54,-2.2601
55,-2.2558
56,-2.2503
57,-2.2447
58,-2.2447
59,-2.246
60,-2.2402
61,-2.2343
62,-2.2296
63,-2.2236
64,-2.2176
65,-2.2127
66,-2.2065
67,-2.204
68,-2.2002
69,-2.1951
70,-2.1913
71,-2.1887
72,-2.1836
73,-2.177
74,-2.1705
75,-2.1638
76,-2.1599
77,-2.1531
78,-2.1463
79,-2.1421
80,-2.1448
81,-2.1432
82,-2.1362
83,-2.1305
84,-2.1234
85,-2.1162
86,-2.1104
87,-2.1031
88,-2.0958
89,-2.0896
90,-2.0837
91,-2.0762
92,-2.0687
93,-2.0627
94,-2.0551
95,-2.0475
96,-2.0398
97,-2.0337
98,-2.0248
99,-2.0171
100,-2.0109
101,-2.003
102,-1.9968
103,-1.9895
104,-1.9841
105,-1.9763
106,-1.9673
107,-1.9609999999999999
108,-1.9531
109,-1.9439
110,-1.9359
111,-1.9295
112,-1.9216
113,-1.9125
114,-1.9062
115,-1.8986
116,-1.8905
117,-1.8826
118,-1.8762
119,-1.8681
120,-1.859
121,-1.8526
122,-1.8445
123,-1.8359
124,-1.8257
125,-1.8193
126,-1.8101
127,-1.8027
128,-1.7979
129,-1.7898
130,-1.7806
131,-1.7731
132,-1.7672
133,-1.7603
134,-1.7511
135,-1.7446
136,-1.7376
137,-1.7308
138,-1.7226
139,-1.7161
140,-1.7069
141,-1.6988
142,-1.6922
143,-1.6854
144,-1.6768
145,-1.6686
146,-1.661
147,-1.6528
148,-1.6446
149,-1.6389
150,-1.6326
151,-1.6233
152,-1.6151
153,-1.6091
154,-1.6024
155,-1.5932
156,-1.5866
157,-1.5773
158,-1.569
159,-1.5624
160,-1.5584
161,-1.5505
162,-1.5422
163,-1.5355
164,-1.5263
165,-1.5179
166,-1.5096
167,-1.5029
168,-1.4947
169,-1.4877
170,-1.4801
171,-1.4717
172,-1.4648
173,-1.4582
174,-1.4516
175,-1.4432
176,-1.4339
177,-1.4272
178,-1.4188
179,-1.4104
180,-1.4034
181,-1.3979
182,-1.3903
183,-1.3819
184,-1.3751
185,-1.3667
186,-1.3573
187,-1.3488
188,-1.3421
189,-1.3336
190,-1.3251
191,-1.3183
192,-1.3112
193,-1.3034
194,-1.2949
195,-1.2881
196,-1.2786
197,-1.2701
198,-1.2616
199,-1.2547
200,-1.253
201,-1.2461
202,-1.2383
203,-1.2331
204,-1.2271
205,-1.2209999999999999
206,-1.2193
207,-1.2108
208,-1.2022
209,-1.1944
210,-1.1858
211,-1.1772
212,-1.1755
213,-1.1686
214,-1.1582
215,-1.1479
216,-1.1418
217,-1.1384
218,-1.1315
219,-1.1297
220,-1.1228
221,-1.1142
222,-1.1047
223,-1.0977
224,-1.0891
225,-1.0804
226,-1.0735
227,-1.0683
228,-1.0605
229,-1.0519
230,-1.0449
231,-1.0362
232,-1.0275
233,-1.0188
234,-1.0118
235,-1.0031
236,-0.9943700000000001
237,-0.98655
238,-0.9778
239,-0.96905
240,-0.9602799999999999
241,-0.95326
242,-0.9444799999999999
243,-0.9409700000000001
244,-0.93489
245,-0.9244899999999999
246,-0.91937
247,-0.91505
248,-0.9089700000000001
249,-0.9072100000000001
250,-0.8984200000000001
251,-0.89138
252,-0.8817799999999999
253,-0.87297
254,-0.8651200000000001
255,-0.86018
256,-0.8533
257,-0.84449
258,-0.83744
259,-0.82862
260,-0.81901
261,-0.81018
262,-0.80311
263,-0.7942600000000001
264,-0.78541
265,-0.77833
266,-0.76947
267,-0.7606
268,-0.7517199999999999
269,-0.74461
270,-0.73573
271,-0.72683
272,-0.7197100000000001
273,-0.71237
274,-0.70552
275,-0.69663
276,-0.6895100000000001
277,-0.68061
278,-0.6717
279,-0.66457
280,-0.65565
281,-0.64672
282,-0.63779
283,-0.63064
284,-0.6217
285,-0.61275
286,-0.60558
287,-0.59663
288,-0.58694
289,-0.57797
290,-0.5708
291,-0.5625399999999999
292,-0.55355
293,-0.5463600000000001
294,-0.53737
295,-0.52837
296,-0.52367
297,-0.52187
298,-0.51286
299,-0.50384
300,-0.49843000000000004
301,-0.49801000000000006
302,-0.49148000000000003
303,-0.48176
304,-0.47384
305,-0.46524
306,-0.46343
307,-0.45801000000000003
308,-0.45438999999999996
309,-0.44896
310,-0.43923999999999996
311,-0.43743000000000004
312,-0.43381000000000003
313,-0.42476
314,-0.42113999999999996
315,-0.4157
316,-0.40664
317,-0.39758000000000004
318,-0.39032
319,-0.38125
320,-0.37217
321,-0.36606
322,-0.36091
323,-0.35051
324,-0.34506
325,-0.34258
326,-0.33218000000000003
327,-0.32606
328,-0.3211
329,-0.31317
330,-0.3125
331,-0.30867
332,-0.30596
333,-0.29691
334,-0.28786
335,-0.28060999999999997
336,-0.27154
337,-0.26181
338,-0.25274
339,-0.2471
340,-0.23897
341,-0.22991
342,-0.22199000000000002
343,-0.21406
344,-0.20889000000000002
345,-0.20096
346,-0.19372
347,-0.18398
348,-0.17492
349,-0.16766
350,-0.16317
351,-0.15571
352,-0.14665
353,-0.1394
354,-0.12966
355,-0.12059
356,-0.11334000000000001
357,-0.10425999999999999
358,-0.097295
359,-0.090515
360,-0.083261
361,-0.074188
362,-0.064448
363,-0.057186
364,-0.049078
365,-0.043443999999999997
366,-0.033706
367,-0.029209
368,-0.023563999999999998
369,-0.014504
370,-0.007254200000000001
371,0.0024838
372,0.011551
373,0.017859
374,0.023505
375,0.032566000000000005
376,0.0423
377,0.049554
378,0.054729999999999994
379,0.063327
380,0.072385
381,0.080307
382,0.08528
383,0.087766
384,0.095014
385,0.10475
386,0.11515999999999998
387,0.12127
388,0.12308
389,0.13214
390,0.13396
391,0.13806
392,0.14648
393,0.15622
394,0.16415
395,0.16662000000000002
396,0.17570999999999998
397,0.17752
398,0.18116
399,0.19025
400,0.19934000000000002
401,0.20843000000000003
402,0.21570999999999999
403,0.22480999999999998
404,0.23390999999999998
405,0.24185
406,0.25095
407,0.26006999999999997
408,0.26918000000000003
409,0.27647
410,0.28087
411,0.28828000000000004
412,0.29556
413,0.30532
414,0.31444
415,0.32355
416,0.32849
417,0.33535
418,0.34447
419,0.3524
420,0.36151
421,0.36656
422,0.37515
423,0.38256
424,0.38946
425,0.39855999999999997
426,0.40584000000000003
427,0.41494
428,0.42405
429,0.4338
430,0.44109
431,0.4502
432,0.45932
433,0.46661
434,0.47455
435,0.47958999999999996
436,0.48999
437,0.49493000000000004
438,0.49856999999999996
439,0.50768
440,0.51498
441,0.52409
442,0.52774
443,0.53194
444,0.5392399999999999
445,0.54837
446,0.5575
447,0.56481
448,0.57395
449,0.58309
450,0.59223
451,0.59955
452,0.6087
453,0.61785
454,0.62517
455,0.63432
456,0.64348
457,0.65264
458,0.65633
459,0.66247
460,0.6716300000000001
461,0.67957
462,0.6887300000000001
463,0.69304
464,0.69857
465,0.70589
466,0.71504
467,0.72482
468,0.73214
469,0.7413
470,0.75046
471,0.75413
472,0.7559600000000001
473,0.76512
474,0.77062
475,0.77246
476,0.78163
477,0.7908
478,0.79937
479,0.80671
480,0.81345
481,0.81228
482,0.8153600000000001
483,0.82396
484,0.82099
485,0.81805
486,0.81571
487,0.81281
488,0.80992
489,0.8076399999999999
490,0.8048
491,0.79499
492,0.7901600000000001
493,0.78606
494,0.7781
495,0.7682899999999999
496,0.76089
497,0.7555
498,0.74956
499,0.74031
500,0.7329100000000001
501,0.72365
502,0.71441
503,0.70645
504,0.6972
505,0.68796
506,0.67871
507,0.67132
508,0.6633600000000001
509,0.65868
510,0.65072
511,0.64148
512,0.63167
513,0.62243
514,0.61447
515,0.6097899999999999
516,0.59941
517,0.5940300000000001
518,0.58809
519,0.57827
520,0.5717899999999999
521,0.56697
522,0.55716
523,0.55255
524,0.54589
525,0.53738
526,0.5333399999999999
527,0.5259199999999999
528,0.51741
529,0.5081399999999999
530,0.49887
531,0.4909
532,0.48163
533,0.47422
534,0.46963
535,0.46483
536,0.45555
537,0.44573
538,0.43908
539,0.43451000000000006
540,0.42523
541,0.41595
542,0.40853
543,0.39871
544,0.38943
545,0.38201999999999997
546,0.37275
547,0.36348
548,0.35420999999999997
549,0.3468
550,0.33754
551,0.32828
552,0.32087
553,0.31161
554,0.30236
555,0.29772
556,0.29106
557,0.2818
558,0.27198
559,0.26661999999999997
560,0.2607
561,0.25089
562,0.24498000000000003
563,0.24149
564,0.23221999999999998
565,0.2224
566,0.21498
567,0.2104
568,0.20375
569,0.19393
570,0.18650999999999998
571,0.1804
572,0.17584
573,0.16734000000000002
574,0.15884
575,0.15431
576,0.14449
577,0.14157
578,0.13574
579,0.12591
580,0.11847
581,0.10864000000000001
582,0.099345
583,0.092708
584,0.088746
585,0.078917
586,0.069088
587,0.059785000000000005
588,0.05583
589,0.04682
590,0.036989999999999995
591,0.029542000000000002
592,0.024777
593,0.02033
594,0.011012000000000001
595,0.0035608000000000002
596,-0.0062722
597,-0.015585
598,-0.023032
599,-0.027482999999999997
600,-0.034102
601,-0.043421
602,-0.050874
603,-0.060707000000000004
604,-0.07001900000000001
605,-0.075297
606,-0.07921399999999999
607,-0.088535
608,-0.098368
609,-0.10582000000000001
610,-0.11514
611,-0.12445
612,-0.1319
613,-0.13718
614,-0.14297
615,-0.15229
616,-0.16025999999999999
617,-0.16957
618,-0.17889000000000002
619,-0.185
620,-0.18943
621,-0.1974
622,-0.20672
623,-0.21418
624,-0.22401
625,-0.23331999999999997
626,-0.23519
627,-0.23943000000000003
628,-0.24978000000000003
629,-0.2564
630,-0.25877
631,-0.26674000000000003
632,-0.26861
633,-0.2742
634,-0.28352
635,-0.29335
636,-0.29862
637,-0.30201999999999996
638,-0.31185
639,-0.32169000000000003
640,-0.32915
641,-0.33542
642,-0.34203
643,-0.35
644,-0.35186999999999996
645,-0.36035
646,-0.37068
647,-0.37306
648,-0.37966
649,-0.38339
650,-0.38763000000000003
651,-0.3951
652,-0.4027
653,-0.40793
654,-0.4159
655,-0.41973999999999995
656,-0.42404
657,-0.42832
658,-0.43254
659,-0.44146
660,-0.44569
661,-0.45366000000000006
662,-0.46068000000000003
663,-0.46253
664,-0.46298999999999996
665,-0.46435
666,-0.46525
667,-0.4657
668,-0.45816999999999997
669,-0.45386000000000004
670,-0.44997
671,-0.44055
672,-0.43301000000000006
673,-0.42402
674,-0.41458999999999996
675,-0.41208999999999996
676,-0.41
677,-0.40055999999999997
678,-0.39111999999999997
679,-0.38356
680,-0.37451999999999996
681,-0.36508
682,-0.35752
683,-0.34807
684,-0.33860999999999997
685,-0.32916
686,-0.32389
687,-0.32587
688,-0.32592
689,-0.32746
690,-0.31798000000000004
691,-0.30888000000000004
692,-0.2994
693,-0.30089
694,-0.2963
695,-0.2868
696,-0.27957
697,-0.27233
698,-0.27221
699,-0.26496
700,-0.25735
701,-0.24784
702,-0.23833000000000001
703,-0.23071999999999998
704,-0.22121
705,-0.2117
706,-0.20219
707,-0.19891
708,-0.19216
709,-0.1823
710,-0.17469
711,-0.16518
712,-0.15567999999999999
713,-0.15048
714,-0.14562
715,-0.13610999999999998
716,-0.12625999999999998
717,-0.11984000000000002
718,-0.11615
719,-0.10665
720,-0.09715700000000001
721,-0.0892
722,-0.079702
723,-0.071384
724,-0.068036
725,-0.060076
726,-0.050582
727,-0.040726
728,-0.03313
729,-0.023635
730,-0.019912
731,-0.015380000000000001
732,-0.0058902
733,0.0039667999999999995
734,0.0096618
735,0.011559
736,0.019887000000000002
737,0.030115
738,0.032382
739,0.036922
740,0.042614
741,0.04451
742,0.052098
743,0.061956
744,0.07144500000000001
745,0.07445700000000001
746,0.079752
747,0.089233
748,0.098714
749,0.1063
750,0.11579
751,0.12527
752,0.13285999999999998
753,0.14272
754,0.15220999999999998
755,0.16169
756,0.16776
757,0.17151
758,0.18137
759,0.18896
760,0.19844
761,0.2083
762,0.21779
763,0.22538000000000002
764,0.23181
765,0.23559000000000002
766,0.24316999999999997
767,0.25265
768,0.26213000000000003
769,0.27199
770,0.27958
771,0.28906
772,0.29855
773,0.30614
774,0.31105
775,0.31674
776,0.3266
777,0.33455999999999997
778,0.34479
779,0.34858
780,0.35238
781,0.35807
782,0.36376
783,0.37325
784,0.3812
785,0.39069
786,0.40018000000000004
787,0.40776999999999997
788,0.41726
789,0.42253999999999997
790,0.42933999999999994
791,0.43693000000000004
792,0.44642
793,0.45628
794,0.46386000000000005
795,0.46956000000000003
796,0.47335
797,0.48283999999999994
798,0.4889
799,0.49154
800,0.5017699999999999
801,0.50973
802,0.51542
803,0.51959
804,0.5290699999999999
805,0.53704
806,0.54652
807,0.55601
808,0.5624399999999999
809,0.57
810,0.57949
811,0.58897
812,0.5965600000000001
813,0.6060399999999999
814,0.61553
815,0.62312
816,0.63297
817,0.64246
818,0.65195
819,0.65954
820,0.66903
821,0.67283
822,0.67853
823,0.68802
824,0.69255
825,0.70087
826,0.7088300000000001
827,0.7186899999999999
828,0.72059
829,0.72285
830,0.73234
831,0.74183
832,0.75133
833,0.7589199999999999
834,0.76841
835,0.77791
836,0.7855
837,0.795
838,0.8044899999999999
839,0.81435
840,0.82195
841,0.83145
842,0.84095
843,0.84429
844,0.8510700000000001
845,0.8605700000000001
846,0.8700600000000001
847,0.87802
848,0.88751
849,0.8970100000000001
850,0.90497
851,0.9086799999999999
852,0.91664
853,0.9265
854,0.9341
855,0.9386200000000001
856,0.94242
857,0.95001
858,0.9595100000000001
859,0.96936
860,0.9757899999999999
861,0.97995
862,0.9898100000000001
863,0.9993
864,1.0012
865,1.005
866,1.0145
867,1.024
868,1.0316
869,1.0411
870,1.0506
871,1.0582
872,1.0677
873,1.0772
874,1.0867
875,1.0943
876,1.0966
877,1.1013
878,1.1089
879,1.1184
880,1.1276
881,1.1371
882,1.1447
883,1.1542
884,1.1561
885,1.1637
886,1.1656
887,1.1713
888,1.1808
889,1.1888
890,1.1983
891,1.2078
892,1.2123
893,1.2178
894,1.2273
895,1.2369
896,1.2448
897,1.2543
898,1.26
899,1.2619
900,1.2695
901,1.2791
902,1.281
903,1.2867
904,1.2962
905,1.3057
906,1.3133
907,1.3225
908,1.3319999999999999
909,1.3393
910,1.3399
911,1.3468
912,1.3512
913,1.3537
914,1.3629
915,1.3636
916,1.3639
917,1.3627
918,1.3678
919,1.3748
920,1.3736
921,1.3721
922,1.3706
923,1.3691
924,1.368
925,1.3666
926,1.3652
927,1.364
928,1.3594
929,1.3496
930,1.3482
931,1.3471
932,1.3419999999999999
933,1.3319
934,1.3273
935,1.3224
936,1.3126
937,1.3094
938,1.3032
939,1.295
940,1.2919
941,1.284
942,1.2744
943,1.2648
944,1.2552
945,1.2475
946,1.2379
947,1.2284
948,1.2207
949,1.2111
950,1.2013
951,1.1917
952,1.1840000000000002
953,1.1744
954,1.1698
955,1.167
956,1.1571
957,1.1506
958,1.1459
959,1.1382
960,1.1286
961,1.1204
962,1.1176
963,1.1114
964,1.1018
965,1.0922
966,1.0845
967,1.0747
968,1.0651
969,1.0572
970,1.0543
971,1.0481
972,1.0385
973,1.0308
974,1.021
975,1.0114
976,1.0069
977,1.0041
978,0.99639
979,0.98679
980,0.97911
981,0.96951
982,0.95968
983,0.9500799999999999
984,0.9424
985,0.93279
986,0.92319
987,0.91551
988,0.90591
989,0.8997
990,0.89586
991,0.88818
992,0.87813
993,0.86831
994,0.8621
995,0.86018
996,0.8525
997,0.8505799999999999
998,0.8467399999999999
999,0.8371299999999999
1000,0.8275299999999999
1001,0.81985
1002,0.81003
1003,0.80042
1004,0.79082
1005,0.78801
1006,0.78351
1007,0.77369
1008,0.77177
1009,0.76557
1010,0.75575
1011,0.75148
1012,0.74742
1013,0.74144
1014,0.7376
1015,0.7299100000000001
1016,0.72009
1017,0.71048
1018,0.70087
1019,0.69468
1020,0.69171
1021,0.6821
1022,0.67442
1023,0.6646
1024,0.65499
1025,0.64537
1026,0.63769
1027,0.6313
1028,0.62663
1029,0.6189399999999999
1030,0.6091300000000001
1031,0.59951
1032,0.59659
1033,0.59042
1034,0.58081
1035,0.57119
1036,0.5635
1037,0.55388
1038,0.54427
1039,0.53445
1040,0.52676
1041,0.51715
1042,0.50753
1043,0.50368
1044,0.50156
1045,0.49155
1046,0.48539
1047,0.48327
1048,0.47538
1049,0.47153
1050,0.46768000000000004
1051,0.45807
1052,0.44845
1053,0.43883
1054,0.43094
1055,0.42133000000000004
1056,0.41152
1057,0.40881999999999996
1058,0.40074
1059,0.39111999999999997
1060,0.3815
1061,0.3738
1062,0.36419
1063,0.35438000000000003
1064,0.34668000000000004
1065,0.33705999999999997
1066,0.32744
1067,0.31782
1068,0.31532
1069,0.31265
1070,0.30284
1071,0.29844
1072,0.29386999999999996
1073,0.28425
1074,0.27462
1075,0.26692
1076,0.25711999999999996
1077,0.24749000000000002
1078,0.23979
1079,0.23506
1080,0.22928
1081,0.21930999999999998
1082,0.21161
1083,0.20198
1084,0.19218
1085,0.19025
1086,0.18748
1087,0.17944000000000002
1088,0.16981
1089,0.1621
1090,0.15231
1091,0.14268
1092,0.13497
1093,0.12727
1094,0.12534
1095,0.11731
1096,0.10943
1097,0.10525999999999999
1098,0.10107999999999999
1099,0.095302
1100,0.09353500000000001
1101,0.084066
1102,0.07459600000000001
1103,0.066728
1104,0.060622
1105,0.058697000000000006
1106,0.050828
1107,0.048902999999999995
1108,0.046975
1109,0.045049
1110,0.039269
1111,0.029637
1112,0.027710000000000002
1113,0.021931
1114,0.012462
1115,0.0028298000000000004
1116,-0.0029492
1117,-0.0048752
1118,-0.012579
1119,-0.014506
1120,-0.022211
1121,-0.032007
1122,-0.041638
1123,-0.044057
1124,-0.046623000000000005
1125,-0.047394
1126,-0.053625
1127,-0.061335
1128,-0.07097300000000001
1129,-0.080612
1130,-0.09025
1131,-0.098109
1132,-0.10775
1133,-0.11738
1134,-0.12509
1135,-0.13473
1136,-0.14437
1137,-0.15400999999999998
1138,-0.16171
1139,-0.16958
1140,-0.17224
1141,-0.17817
1142,-0.18781
1143,-0.19759000000000002
1144,-0.20338
1145,-0.20545
1146,-0.21536999999999998
1147,-0.2213
1148,-0.2235
1149,-0.23328000000000002
1150,-0.23521
1151,-0.24291999999999997
1152,-0.25077
1153,-0.26041
1154,-0.2648
1155,-0.26518
1156,-0.26531
1157,-0.2658
1158,-0.26603000000000004
1159,-0.26626
1160,-0.26488
1161,-0.25533
1162,-0.25381
1163,-0.24831
1164,-0.23865
1165,-0.22899999999999998
1166,-0.22136999999999998
1167,-0.21170999999999998
1168,-0.20206
1169,-0.19433
1170,-0.18467999999999998
1171,-0.17502
1172,-0.16535999999999998
1173,-0.15764
1174,-0.14798
1175,-0.1464
1176,-0.14279
1177,-0.13313
1178,-0.12355
1179,-0.1159
1180,-0.11427000000000001
1181,-0.10860999999999998
1182,-0.10102
1183,-0.099344
1184,-0.09173400000000001
1185,-0.086107
1186,-0.08442999999999999
1187,-0.07674700000000001
1188,-0.071038
1189,-0.06931
1190,-0.061577
1191,-0.051912
1192,-0.042247
1193,-0.032583
1194,-0.024850999999999998
1195,-0.015222
1196,-0.0055222000000000005
1197,0.0022108
1198,0.011876000000000001
1199,0.02154
1200,0.031205
1201,0.038902
1202,0.048566000000000005
1203,0.05826799999999999
1204,0.065999
1205,0.075664
1206,0.085328
1207,0.094993
1208,0.097038
1209,0.10107000000000001
1210,0.11073
1211,0.11847
1212,0.12817
1213,0.13784000000000002
1214,0.14377
1215,0.14398
1216,0.15364
1217,0.1633
1218,0.17103
1219,0.18075
1220,0.19041
1221,0.20007
1222,0.20405
1223,0.20790999999999998
1224,0.21763000000000002
1225,0.22541999999999998
1226,0.2352
1227,0.24105
1228,0.24491999999999997
1229,0.25072
1230,0.25458000000000003
1231,0.26424000000000003
1232,0.27197
1233,0.28164
1234,0.2913
1235,0.30101999999999995
1236,0.30875
1237,0.31840999999999997
1238,0.32807
1239,0.3358
1240,0.34359
1241,0.34584000000000004
1242,0.35357
1243,0.3613
1244,0.37096
1245,0.38061999999999996
1246,0.38835
1247,0.39402
1248,0.39764
1249,0.4073
1250,0.41503
1251,0.42468999999999996
1252,0.43435
1253,0.44208000000000003
1254,0.45175
1255,0.46141000000000004
1256,0.47107
1257,0.4788
1258,0.48846000000000006
1259,0.49813
1260,0.5058600000000001
1261,0.51552
1262,0.52512
1263,0.53479
1264,0.54252
1265,0.55218
1266,0.56184
1267,0.56957
1268,0.57923
1269,0.58117
1270,0.59083
1271,0.5927600000000001
1272,0.59856
1273,0.60822
1274,0.61595
1275,0.62562
1276,0.6352800000000001
1277,0.64494
1278,0.65267
1279,0.66233
1280,0.672
1281,0.6797300000000001
1282,0.68939
1283,0.69905
1284,0.70872
1285,0.71645
1286,0.72611
1287,0.7338399999999999
1288,0.73577
1289,0.74157
1290,0.74737
1291,0.7512300000000001
1292,0.7589600000000001
1293,0.76863
1294,0.7782899999999999
1295,0.7860199999999999
1296,0.79568
1297,0.80535
1298,0.81501
1299,0.8227399999999999
1300,0.8324
1301,0.8420700000000001
1302,0.8498
1303,0.85946
1304,0.8691200000000001
1305,0.87879
1306,0.8865200000000001
1307,0.89618
1308,0.90584
1309,0.91358
1310,0.92324
1311,0.9329
1312,0.94257
1313,0.9503
1314,0.95996
1315,0.96962
1316,0.97735
1317,0.9870200000000001
1318,0.9966799999999999
1319,1.0063
1320,1.0141
1321,1.0237
1322,1.0334
1323,1.0411
1324,1.0508
1325,1.0605
1326,1.0701
1327,1.0779
1328,1.0875
1329,1.0972
1330,1.1049
1331,1.1146
1332,1.1242
1333,1.1339
1334,1.1416
1335,1.1513
1336,1.161
1337,1.1687
1338,1.1784
1339,1.188
1340,1.1977
1341,1.2054
1342,1.2151
1343,1.2247
1344,1.2325
1345,1.2422
1346,1.2518
1347,1.2615
1348,1.2692
1349,1.2789
1350,1.2885
1351,1.2963
1352,1.3059
1353,1.3156
1354,1.3252
1355,1.3330000000000002
1356,1.3426
1357,1.3523
1358,1.3619999999999999
1359,1.3677
1360,1.3695
1361,1.3772
1362,1.385
1363,1.3946
1364,1.4043
1365,1.4101
1366,1.4121
1367,1.4217
1368,1.4314
1369,1.4391
1370,1.4449
1371,1.4487
1372,1.4583
1373,1.4602
1374,1.466
1375,1.4718
1376,1.4737
1377,1.4834
1378,1.4931
1379,1.5027
1380,1.5105
1381,1.5201
1382,1.5298
1383,1.5375
1384,1.5393
1385,1.545
1386,1.5547
1387,1.5624
1388,1.5681
1389,1.5699
1390,1.5757
1391,1.5834
1392,1.5872
1393,1.5968
1394,1.5987
1395,1.6045
1396,1.6141
1397,1.6141
1398,1.6141
1399,1.6159999999999999
1400,1.6159999999999999
1401,1.618
1402,1.6199
1403,1.62
1404,1.62
1405,1.6201
1406,1.6202
1407,1.6164
1408,1.6165
1409,1.6167
1410,1.6168
1411,1.615
1412,1.6153
1413,1.6155
1414,1.6098
1415,1.6022
1416,1.6024
1417,1.6008
1418,1.601
1419,1.5914
1420,1.5878
1421,1.5822
1422,1.5746
1423,1.5711
1424,1.5654
1425,1.5577
1426,1.548
1427,1.5385
1428,1.5288
1429,1.5253
1430,1.5197
1431,1.5122
1432,1.5106
1433,1.505
1434,1.4953
1435,1.4857
1436,1.4780000000000002
1437,1.4684
1438,1.4587
1439,1.4509999999999998
1440,1.4495
1441,1.442
1442,1.4324
1443,1.4246
1444,1.415
1445,1.4053
1446,1.3977
1447,1.3880000000000001
1448,1.3784
1449,1.3687
1450,1.361
1451,1.3576
1452,1.354
1453,1.3463
1454,1.3367
1455,1.327
1456,1.3174
1457,1.3096
1458,1.3
1459,1.2903
1460,1.2826
1461,1.273
1462,1.2633
1463,1.2537
1464,1.2459
1465,1.2363
1466,1.2267
1467,1.219
1468,1.2094
1469,1.1997
1470,1.1901
1471,1.1881
1472,1.1804
1473,1.1727
1474,1.1708
1475,1.1631
1476,1.1534
1477,1.1438
1478,1.136
1479,1.1264
1480,1.1166
1481,1.1089
1482,1.0994
1483,1.0897
1484,1.0801
1485,1.0724
1486,1.0669
1487,1.0616
1488,1.0539
1489,1.0443
1490,1.0346
1491,1.025
1492,1.0172
1493,1.0076
1494,0.99795
1495,0.9902299999999999
1496,0.98059
1497,0.9710700000000001
1498,0.96142
1499,0.9537100000000001
1500,0.94419
1501,0.9429200000000001
1502,0.93726
1503,0.9276200000000001
1504,0.9179799999999999
1505,0.9083399999999999
1506,0.9006200000000001
1507,0.8909799999999999
1508,0.88134
1509,0.8736200000000001
1510,0.86398
1511,0.85434
1512,0.8447
1513,0.83698
1514,0.82734
1515,0.8177
1516,0.80999
1517,0.80035
1518,0.79071
1519,0.7810600000000001
1520,0.77349
1521,0.76385
1522,0.75421
1523,0.7465
1524,0.7368600000000001
1525,0.72722
1526,0.71758
1527,0.70987
1528,0.70023
1529,0.69696
1530,0.6934100000000001
1531,0.68377
1532,0.67413
1533,0.6645
1534,0.65694
1535,0.64923
1536,0.6473
1537,0.63959
1538,0.63574
1539,0.63189
1540,0.62225
1541,0.61454
1542,0.6049100000000001
1543,0.59527
1544,0.58772
1545,0.57793
1546,0.5683
1547,0.55882
1548,0.55111
1549,0.5414800000000001
1550,0.53184
1551,0.5241399999999999
1552,0.51451
1553,0.51258
1554,0.50327
1555,0.49573
1556,0.49413999999999997
1557,0.48853
1558,0.48483999999999994
1559,0.48291999999999996
1560,0.47329
1561,0.46366
1562,0.45596000000000003
1563,0.44633
1564,0.4367
1565,0.429
1566,0.41936999999999997
1567,0.40973999999999994
1568,0.40012
1569,0.39241
1570,0.38279
1571,0.37316
1572,0.36546
1573,0.35583000000000004
1574,0.34621
1575,0.33658000000000005
1576,0.32888
1577,0.31926
1578,0.30963
1579,0.30193000000000003
1580,0.29231
1581,0.28268000000000004
1582,0.27305999999999997
1583,0.26536
1584,0.25573
1585,0.24611
1586,0.23840999999999998
1587,0.23384000000000002
1588,0.22789
1589,0.21825999999999998
1590,0.21056
1591,0.20093
1592,0.19095
1593,0.18903
1594,0.18325
1595,0.17363
1596,0.16978
1597,0.16785
1598,0.15822999999999998
1599,0.1486
1600,0.1409
1601,0.13128
1602,0.12165
1603,0.11185
1604,0.10415
1605,0.094525
1606,0.08490299999999999
1607,0.078946
1608,0.076128
1609,0.06825099999999999
1610,0.058625
1611,0.050923
1612,0.041297
1613,0.031671
1614,0.023971
1615,0.014344999999999998
1616,0.0048978
1617,0.0038888000000000004
1618,-0.0016982
1619,-0.011318
1620,-0.020749
1621,-0.024406999999999998
1622,-0.027277999999999997
1623,-0.032848
1624,-0.042261
1625,-0.049951999999999996
1626,-0.052976999999999996
1627,-0.054269000000000005
1628,-0.05405599999999999
1629,-0.05939199999999999
1630,-0.068562
1631,-0.072185
1632,-0.07366
1633,-0.081341
1634,-0.081117
1635,-0.082356
1636,-0.085266
1637,-0.094861
1638,-0.098462
1639,-0.098225
1640,-0.09701599999999999
1641,-0.095777
1642,-0.09527200000000001
1643,-0.092846
1644,-0.089633
1645,-0.079794
1646,-0.072133
1647,-0.06229199999999999
1648,-0.052716
1649,-0.044792
1650,-0.041551
1651,-0.033354
1652,-0.027069
1653,-0.024059
1654,-0.016128
1655,-0.0062842
1656,0.0013698
1657,0.0079428
1658,0.010986
1659,0.020549
1660,0.028197000000000003
1661,0.038043
1662,0.047605
1663,0.055255
1664,0.06482
1665,0.074384
1666,0.08395
1667,0.091602
1668,0.10117000000000001
1669,0.11073
1670,0.1154
1671,0.12035
1672,0.13019
1673,0.13546
1674,0.14148
1675,0.15104
1676,0.15295
1677,0.1606
1678,0.1606
1679,0.16222
1680,0.16299
1681,0.17035999999999998
1682,0.17992
1683,0.18949000000000002
1684,0.19714
1685,0.20670999999999998
1686,0.21627
1687,0.22584
1688,0.23349
1689,0.24306
1690,0.25263
1691,0.26029
1692,0.26986
1693,0.27943
1694,0.289
1695,0.29665
1696,0.30622
1697,0.3158
1698,0.32345999999999997
1699,0.33303
1700,0.3426
1701,0.34724
1702,0.35024
1703,0.35789
1704,0.36746
1705,0.37539
1706,0.38495999999999997
1707,0.39453
1708,0.4041
1709,0.41012
1710,0.4134
1711,0.42323999999999995
1712,0.4309
1713,0.44046
1714,0.45003000000000004
1715,0.45988
1716,0.46753
1717,0.4771
1718,0.48667
1719,0.49433
1720,0.50198
1721,0.50718
1722,0.51347
1723,0.52113
1724,0.53069
1725,0.5402600000000001
1726,0.54792
1727,0.55776
1728,0.56733
1729,0.5769
1730,0.58455
1731,0.59412
1732,0.60369
1733,0.61135
1734,0.61655
1735,0.62475
1736,0.63432
1737,0.6419699999999999
1738,0.65154
1739,0.6611100000000001
1740,0.66876
1741,0.67861
1742,0.68817
1743,0.6977399999999999
1744,0.7054
1745,0.71033
1746,0.7169
1747,0.72646
1748,0.73412
1749,0.7439600000000001
1750,0.75353
1751,0.76118
1752,0.7710199999999999
1753,0.77405
1754,0.78227
1755,0.78992
1756,0.79948
1757,0.80933
1758,0.81698
1759,0.8265399999999999
1760,0.83447
1761,0.8378
1762,0.8438200000000001
1763,0.8533799999999999
1764,0.8632299999999999
1765,0.8708799999999999
1766,0.88044
1767,0.89
1768,0.89956
1769,0.9072100000000001
1770,0.91706
1771,0.9266200000000001
1772,0.9291
1773,0.93406
1774,0.9436200000000001
1775,0.9531799999999999
1776,0.9611200000000001
1777,0.9706799999999999
1778,0.98024
1779,0.9878899999999999
1780,0.99745
1781,1.0070000000000001
1782,1.0166
1783,1.0242
1784,1.0338
1785,1.0434
1786,1.051
1787,1.056
1788,1.0606
1789,1.0702
1790,1.0778
1791,1.0877
1792,1.0973
1793,1.1049
1794,1.1145
1795,1.124
1796,1.1325
1797,1.1375
1798,1.1471
1799,1.1566
1800,1.1643
1801,1.1738
1802,1.1834
1803,1.1932
1804,1.2009
1805,1.2104
1806,1.22
1807,1.226
1808,1.2294
1809,1.2395
1810,1.2491
1811,1.2567
1812,1.262
1813,1.2683
1814,1.2759
1815,1.2858
1816,1.2921
1817,1.2955
1818,1.3031
1819,1.3127
1820,1.3222
1821,1.3302
1822,1.3397
1823,1.3493
1824,1.3556
1825,1.3587
1826,1.3669
1827,1.3736
1828,1.3767
1829,1.3862
1830,1.3961
1831,1.4059
1832,1.4091
1833,1.4176
1834,1.4246
1835,1.4259
1836,1.4294
1837,1.4376
1838,1.4443
1839,1.4456
1840,1.4473
1841,1.4508
1842,1.4522
1843,1.4539
1844,1.4556
1845,1.4573
1846,1.4588
1847,1.4586
1848,1.4585
1849,1.4513
1850,1.4486
1851,1.4485
1852,1.4504
1853,1.4455
1854,1.4386
1855,1.4387
1856,1.4315
1857,1.4269
1858,1.4289
1859,1.429
1860,1.4264
1861,1.4173
1862,1.4079
1863,1.403
1864,1.4031
1865,1.3937
1866,1.3846
1867,1.3771
1868,1.3754
1869,1.3705
1870,1.3630000000000002
1871,1.3536
1872,1.3441
1873,1.3347
1874,1.3276
1875,1.3181
1876,1.3087
1877,1.3012
1878,1.2917
1879,1.2892
1880,1.2872
1881,1.2797
1882,1.2702
1883,1.2608
1884,1.2533
1885,1.2439
1886,1.2345
1887,1.225
1888,1.2175
1889,1.2081
1890,1.1987
1891,1.1912
1892,1.1817
1893,1.1723
1894,1.1629
1895,1.1554
1896,1.146
1897,1.1366
1898,1.1291
1899,1.1197
1900,1.1103
1901,1.1009
1902,1.0934
1903,1.084
1904,1.0746
1905,1.0671
1906,1.0577
1907,1.0483
1908,1.0427
1909,1.0394
1910,1.0301
1911,1.0207
1912,1.0131
1913,1.0033
1914,0.9939
1915,0.98451
1916,0.977
1917,0.96715
1918,0.96298
1919,0.95501
1920,0.9456100000000001
1921,0.9357700000000001
1922,0.92637
1923,0.91886
1924,0.9094700000000001
1925,0.9000799999999999
1926,0.8925700000000001
1927,0.8831899999999999
1928,0.8738
1929,0.8644200000000001
1930,0.8569100000000001
1931,0.8475299999999999
1932,0.83815
1933,0.83065
1934,0.8212700000000001
1935,0.8119
1936,0.80252
1937,0.7955
1938,0.78613
1939,0.77676
1940,0.76927
1941,0.75942
1942,0.7500600000000001
1943,0.7407
1944,0.73321
1945,0.72385
1946,0.7195699999999999
1947,0.71487
1948,0.7055
1949,0.69613
1950,0.68677
1951,0.67928
1952,0.66992
1953,0.66056
1954,0.65308
1955,0.64323
1956,0.63388
1957,0.62452
1958,0.6170399999999999
1959,0.60818
1960,0.59883
1961,0.59135
1962,0.58201
1963,0.5726600000000001
1964,0.5633199999999999
1965,0.55535
1966,0.54601
1967,0.53667
1968,0.5292
1969,0.5221
1970,0.5182399999999999
1971,0.5089
1972,0.50143
1973,0.49208999999999997
1974,0.48275
1975,0.47528000000000004
1976,0.46595
1977,0.45661
1978,0.44728
1979,0.43982
1980,0.43049
1981,0.42116000000000003
1982,0.41371
1983,0.40438
1984,0.39505999999999997
1985,0.38574
1986,0.37777
1987,0.36846
1988,0.35915
1989,0.35169
1990,0.34238
1991,0.33307
1992,0.32406999999999997
1993,0.32013
1994,0.31082
1995,0.3015
1996,0.29405
1997,0.28475
1998,0.27491
1999,0.26561
2000,0.25816999999999996
2001,0.24886
2002,0.23956
2003,0.23345
2004,0.22896999999999998
2005,0.21914
2006,0.20984
2007,0.20239000000000001
2008,0.19309
2009,0.18325999999999998
2010,0.17582
2011,0.16652999999999998
2012,0.15723
2013,0.14794000000000002
2014,0.14051
2015,0.13122
2016,0.12194
2017,0.11450999999999999
2018,0.10522999999999999
2019,0.095408
2020,0.09085599999999999
2021,0.08660599999999999
2022,0.077318
2023,0.068035
2024,0.060069000000000004
2025,0.050788
2026,0.041507999999999996
2027,0.032232
2028,0.024812
2029,0.015538999999999999
2030,0.0062708
2031,-0.0011432
2032,-0.010408
2033,-0.016863
2034,-0.021665
2035,-0.029082999999999998
2036,-0.038354
2037,-0.047622000000000005
2038,-0.055585
2039,-0.06485199999999999
2040,-0.074112
2041,-0.083373
2042,-0.090779
2043,-0.10003
2044,-0.10872000000000001
2045,-0.11612
2046,-0.12537
2047,-0.13460999999999998
2048,-0.14385
2049,-0.15124
2050,-0.16047
2051,-0.16971
2052,-0.17709
2053,-0.18631
2054,-0.19
2055,-0.19496
2056,-0.20175
2057,-0.20611
2058,-0.20861
2059,-0.21538000000000002
2060,-0.21721999999999997
2061,-0.22458000000000003
2062,-0.23378000000000002
2063,-0.24113
2064,-0.25032
2065,-0.2595
2066,-0.26685
2067,-0.27603
2068,-0.28520999999999996
2069,-0.29438000000000003
2070,-0.30171
2071,-0.31088000000000005
2072,-0.32004
2073,-0.32737
2074,-0.33653
2075,-0.34506
2076,-0.35420999999999997
2077,-0.36152
2078,-0.36209
2079,-0.36757
2080,-0.37424
2081,-0.38209
2082,-0.39057
2083,-0.39174000000000003
2084,-0.39903
2085,-0.40268000000000004
2086,-0.40814
2087,-0.41541999999999996
2088,-0.42452
2089,-0.43361000000000005
2090,-0.44205
2091,-0.44931000000000004
2092,-0.45773
2093,-0.45801000000000003
2094,-0.46458
2095,-0.47363
2096,-0.48200000000000004
2097,-0.49104
2098,-0.49578
2099,-0.49413
2100,-0.50245
2101,-0.50895
2102,-0.5179600000000001
2103,-0.51872
2104,-0.52018
2105,-0.52736
2106,-0.53561
2107,-0.54457
2108,-0.55174
2109,-0.55565
2110,-0.55377
2111,-0.5627
2112,-0.56984
2113,-0.57801
2114,-0.5797899999999999
2115,-0.58157
2116,-0.58035
2117,-0.58239
2118,-0.57935
2119,-0.57629
2120,-0.5737399999999999
2121,-0.56966
2122,-0.5655600000000001
2123,-0.5647800000000001
2124,-0.55989
2125,-0.55401
2126,-0.54694
2127,-0.5381
2128,-0.52925
2129,-0.51962
2130,-0.51253
2131,-0.50367
2132,-0.4948
2133,-0.4877
2134,-0.47881999999999997
2135,-0.46993999999999997
2136,-0.46105
2137,-0.45698999999999995
2138,-0.44861
2139,-0.43973
2140,-0.43262
2141,-0.42373
2142,-0.41483000000000003
2143,-0.40518000000000004
2144,-0.39805
2145,-0.38914
2146,-0.38051
2147,-0.37573
2148,-0.36963
2149,-0.36072
2150,-0.35181
2151,-0.34468000000000004
2152,-0.33501
2153,-0.32609
2154,-0.31894
2155,-0.31001
2156,-0.30065
2157,-0.29412
2158,-0.28697
2159,-0.2773
2160,-0.26868000000000003
2161,-0.26393
2162,-0.25426
2163,-0.24533000000000002
2164,-0.2364
2165,-0.22851
2166,-0.21989
2167,-0.21261999999999998
2168,-0.20548000000000002
2169,-0.19654000000000002
2170,-0.18761
2171,-0.17793
2172,-0.17077
2173,-0.16182
2174,-0.15645
2175,-0.15466
2176,-0.1457
2177,-0.13602
2178,-0.13171
2179,-0.12668
2180,-0.11699000000000001
2181,-0.10947
2182,-0.10300999999999999
2183,-0.099054
2184,-0.09546
2185,-0.090068
2186,-0.087559
2187,-0.079657
2188,-0.069246
2189,-0.061345000000000004
2190,-0.054151
2191,-0.049134
2192,-0.040142000000000004
2193,-0.032945999999999996
2194,-0.023947
2195,-0.014943000000000001
2196,-0.007036199999999999
2197,0.0019728
2198,0.010986
2199,0.020699000000000002
2200,0.024597
2201,0.030302
2202,0.039311
2203,0.046523
2204,0.056236
2205,0.06525299999999999
2206,0.071648
2207,0.077351
2208,0.086362
2209,0.096074
2210,0.10397999999999999
2211,0.10928
2212,0.11899000000000001
2213,0.1287
2214,0.13591
2215,0.14232
2216,0.14983
2217,0.15703
2218,0.16604000000000002
2219,0.17575
2220,0.18477000000000002
2221,0.18867
2222,0.19507
2223,0.20549
2224,0.21011
2225,0.22052
2226,0.23021999999999998
2227,0.23922
2228,0.24314000000000002
2229,0.25137
2230,0.26178
2231,0.26642
2232,0.27324
2233,0.28185
2234,0.28723000000000004
2235,0.29513
2236,0.30267
2237,0.30808
2238,0.31525
2239,0.3228
2240,0.33000999999999997
2241,0.33897
2242,0.34686
2243,0.35581999999999997
2244,0.35945
2245,0.36417
2246,0.36784
2247,0.37825
2248,0.38478
2249,0.39058000000000004
2250,0.40024
2251,0.40679
2252,0.41258999999999996
2253,0.42046999999999995
2254,0.42599
2255,0.43153
2256,0.43456000000000006
2257,0.44319
2258,0.45003999999999994
2259,0.45308000000000004
2260,0.45691000000000004
2261,0.46253
2262,0.4664
2263,0.47326
2264,0.4809
2265,0.48657
2266,0.48971000000000003
2267,0.49365
2268,0.49761000000000005
2269,0.5016
2270,0.5048
2271,0.50883
2272,0.51288
2273,0.50843
2274,0.5038699999999999
2275,0.50797
2276,0.51034
2277,0.50934
2278,0.50145
2279,0.50563
2280,0.50725
2281,0.51147
2282,0.50363
2283,0.49495
2284,0.48886
2285,0.48968
2286,0.48621000000000003
2287,0.47928999999999994
2288,0.47151000000000004
2289,0.46287
2290,0.45424
2291,0.45252
2292,0.44733999999999996
2293,0.43872
2294,0.43527
2295,0.43355
2296,0.42494
2297,0.41545
2298,0.40857
2299,0.39997
2300,0.39044
2301,0.38519000000000003
2302,0.37831
2303,0.36971
2304,0.36023
2305,0.35336
2306,0.34478000000000003
2307,0.33862
2308,0.33169
2309,0.32222
2310,0.31363
2311,0.30491999999999997
2312,0.30055
2313,0.29196
2314,0.28248
2315,0.27562
2316,0.26704
2317,0.26011
2318,0.25394
2319,0.24879
2320,0.24020999999999998
2321,0.23075
2322,0.22389
2323,0.21533000000000002
2324,0.21003000000000002
2325,0.2022
2326,0.19535
2327,0.18678
2328,0.17823
2329,0.17139000000000001
2330,0.16284
2331,0.1534
2332,0.14486
2333,0.13804
2334,0.12951
2335,0.121
2336,0.11419000000000001
2337,0.10569
2338,0.097191
2339,0.0887
2340,0.081914
2341,0.074366
2342,0.065898
2343,0.059129999999999995
2344,0.050675
2345,0.042229
2346,0.032844
2347,0.027041000000000003
2348,0.018615
2349,0.010196
2350,0.0025128
2351,-0.0058952
2352,-0.014296000000000001
2353,-0.022688
2354,-0.029397000000000003
2355,-0.03874
2356,-0.045229000000000005
2357,-0.0529
2358,-0.061283000000000004
2359,-0.069656
2360,-0.07899199999999999
2361,-0.08567899999999999
2362,-0.094033
2363,-0.10238
2364,-0.10905
2365,-0.11738
2366,-0.1257
2367,-0.135
2368,-0.13999
2369,-0.14658
2370,-0.15423
2371,-0.16087
2372,-0.16918
2373,-0.17748
2374,-0.18575999999999998
2375,-0.19238
2376,-0.20065999999999998
2377,-0.20992
2378,-0.21653000000000003
2379,-0.22478
2380,-0.23301
2381,-0.2396
2382,-0.24124
2383,-0.24719000000000002
2384,-0.25416
2385,-0.25682
2386,-0.26708000000000004
2387,-0.27303
2388,-0.27796
2389,-0.28452
2390,-0.29272
2391,-0.30091
2392,-0.30849
2393,-0.31666
2394,-0.32482
2395,-0.3306
2396,-0.33533
2397,-0.3435
2398,-0.35166
2399,-0.35923
2400,-0.36737
2401,-0.37551
2402,-0.38364000000000004
2403,-0.38898
2404,-0.39747
2405,-0.40559
2406,-0.41208999999999996
2407,-0.4202
2408,-0.42936
2409,-0.43745
2410,-0.44392
2411,-0.45198999999999995
2412,-0.46005
2413,-0.46166
2414,-0.46595
2415,-0.47186000000000006
2416,-0.47881999999999997
2417,-0.48633000000000004
2418,-0.4933
2419,-0.49651999999999996
2420,-0.50295
2421,-0.51097
2422,-0.51898
2423,-0.52698
2424,-0.53337
2425,-0.5424399999999999
2426,-0.5504100000000001
2427,-0.55678
2428,-0.56472
2429,-0.5726600000000001
2430,-0.58058
2431,-0.5869
2432,-0.5948
2433,-0.59638
2434,-0.59796
2435,-0.6080800000000001
2436,-0.61077
2437,-0.61774
2438,-0.62517
2439,-0.62944
2440,-0.63415
2441,-0.64044
2442,-0.6482899999999999
2443,-0.6572600000000001
2444,-0.66508
2445,-0.67132
2446,-0.67912
2447,-0.68691
2448,-0.69312
2449,-0.7008800000000001
2450,-0.7078399999999999
2451,-0.71516
2452,-0.7198100000000001
2453,-0.72756
2454,-0.73646
2455,-0.74264
2456,-0.75035
2457,-0.7580399999999999
2458,-0.76654
2459,-0.77276
2460,-0.78009
2461,-0.78776
2462,-0.79508
2463,-0.80273
2464,-0.8115600000000001
2465,-0.8190000000000001
2466,-0.82478
2467,-0.83241
2468,-0.8412299999999999
2469,-0.8473200000000001
2470,-0.8549100000000001
2471,-0.86274
2472,-0.86936
2473,-0.87544
2474,-0.8842200000000001
2475,-0.89179
2476,-0.89784
2477,-0.9047799999999999
2478,-0.91232
2479,-0.9198799999999999
2480,-0.92712
2481,-0.93465
2482,-0.9425100000000001
2483,-0.94916
2484,-0.9566899999999999
2485,-0.96541
2486,-0.97291
2487,-0.9788899999999999
2488,-0.98705
2489,-0.99495
2490,-1.0009
2491,-1.0084
2492,-1.0171
2493,-1.0245
2494,-1.0299
2495,-1.0376
2496,-1.045
2497,-1.0522
2498,-1.0596
2499,-1.0675
2500,-1.0757
2501,-1.0816
2502,-1.0902
2503,-1.0972
2504,-1.1036
2505,-1.1108
2506,-1.1194
2507,-1.1267
2508,-1.1347
2509,-1.1414
2510,-1.1488
2511,-1.1559
2512,-1.1632
2513,-1.1705
2514,-1.1772
2515,-1.1852
2516,-1.1937
2517,-1.203
2518,-1.2114
2519,-1.2185
2520,-1.2257
2521,-1.2352
2522,-1.2405
2523,-1.2477
2524,-1.2562
2525,-1.2646
2526,-1.2712
2527,-1.2768
2528,-1.284
2529,-1.291
2530,-1.2982
2531,-1.3066
2532,-1.3147
2533,-1.3216
2534,-1.3299
2535,-1.3379
2536,-1.3434
2537,-1.3519
2538,-1.359
2539,-1.3671
2540,-1.3724
2541,-1.3795
2542,-1.3879
2543,-1.3949
2544,-1.403
2545,-1.4099
2546,-1.4183
2547,-1.4239
2548,-1.4308
2549,-1.4402
2550,-1.4458
2551,-1.4542
2552,-1.4611
2553,-1.4692
2554,-1.4747
2555,-1.4844
2556,-1.4924
2557,-1.4994
2558,-1.5077
2559,-1.5146
2560,-1.5228
2561,-1.5268
2562,-1.5351
2563,-1.5419
2564,-1.5487
2565,-1.5542
2566,-1.5625
2567,-1.5694
2568,-1.5748
2569,-1.5830000000000002
2570,-1.5912
2571,-1.5981
2572,-1.6049
2573,-1.6131
2574,-1.6213
2575,-1.6267
2576,-1.635
2577,-1.6445
2578,-1.65
2579,-1.6582
2580,-1.6664
2581,-1.6732
2582,-1.6801
2583,-1.6883
2584,-1.6965
2585,-1.7033
2586,-1.7129
2587,-1.7211
2588,-1.7279
2589,-1.7361
2590,-1.7444
2591,-1.7512
2592,-1.7566
2593,-1.7648
2594,-1.7744
2595,-1.7812
2596,-1.7867
2597,-1.795
2598,-1.8018
2599,-1.8086
2600,-1.8168
2601,-1.8237
2602,-1.8319
2603,-1.8359999999999999
2604,-1.8442
2605,-1.8524
2606,-1.8592
2607,-1.8659999999999999
2608,-1.8742
2609,-1.8824
2610,-1.8879
2611,-1.8946
2612,-1.9014
2613,-1.9081
2614,-1.9147
2615,-1.9242
2616,-1.9325
2617,-1.9378
2618,-1.9444
2619,-1.9523
2620,-1.9575
2621,-1.9656
2622,-1.9753
2623,-1.9818
2624,-1.9869
2625,-1.9932
2626,-2.001
2627,-2.006
2628,-2.0121
2629,-2.0191
2630,-2.0287
2631,-2.0337
2632,-2.0397
2633,-2.0458
2634,-2.0506
2635,-2.0580000000000003
2636,-2.0639
2637,-2.0697
2638,-2.0758
2639,-2.0832
2640,-2.0897
2641,-2.0943
2642,-2.0999
2643,-2.1055
2644,-2.1109999999999998
2645,-2.1169
2646,-2.1223
2647,-2.1276
2648,-2.1323
2649,-2.1415
2650,-2.1484
2651,-2.1535
2652,-2.1575
2653,-2.1625
2654,-2.1674
2655,-2.1713
2656,-2.1777
2657,-2.1824
2658,-2.1869
2659,-2.1905
2660,-2.2
2661,-2.2061
2662,-2.2096
2663,-2.2139
2664,-2.2182
2665,-2.224
2666,-2.2272
2667,-2.2312
2668,-2.235
2669,-2.239
2670,-2.2487
2671,-2.2542
2672,-2.2578
2673,-2.2605
2674,-2.2639
2675,-2.269
2676,-2.2715
2677,-2.2746
2678,-2.2775
2679,-2.286
2680,-2.2927
2681,-2.2955
2682,-2.2981
2683,-2.3001
2684,-2.3044
2685,-2.3067
2686,-2.3088
2687,-2.3104
2688,-2.3123
2689,-2.3141
2690,-2.3204
2691,-2.3287
2692,-2.3303
2693,-2.3317
2694,-2.3327
2695,-2.3357
2696,-2.3367
2697,-2.3374
2698,-2.3381
2699,-2.3387
2700,-2.3391
2701,-2.3394
2702,-2.3395
2703,-2.3454
2704,-2.3531
2705,-2.3531
2706,-2.3531
2707,-2.355
2708,-2.355
