time,value
0,1.7602
1,1.7281
2,1.6511
3,1.5598
4,1.4680000000000002
5,1.3778
6,1.2905
7,1.2065
8,1.1229
9,1.0382
10,0.9531799999999999
11,0.86919
12,0.78255
13,0.7034100000000001
14,0.61805
15,0.53919
16,0.45918000000000003
17,0.37415
18,0.28878000000000004
19,0.20521999999999999
20,0.12257
21,0.042212
22,-0.040156
23,-0.12408
24,-0.2045
25,-0.28651
26,-0.36678
27,-0.44715
28,-0.5221399999999999
29,-0.59864
30,-0.67698
31,-0.74967
32,-0.82401
33,-0.89159
34,-0.96045
35,-1.026
36,-1.0927
37,-1.1499
38,-1.2074
39,-1.2581
40,-1.304
41,-1.3392
42,-1.3681
43,-1.3872
44,-1.4026
45,-1.4069999999999998
46,-1.3978
47,-1.3826
48,-1.3521
49,-1.3235
50,-1.2785
51,-1.2321
52,-1.1725
53,-1.1142
54,-1.054
55,-0.99136
56,-0.92104
57,-0.84472
58,-0.76703
59,-0.68611
60,-0.61064
61,-0.52989
62,-0.44396
63,-0.36505
64,-0.28568000000000005
65,-0.19760999999999998
66,-0.11051
67,-0.029356999999999998
68,0.060171
69,0.14991
70,0.23870999999999998
71,0.32905
72,0.4185
73,0.50844
74,0.5940300000000001
75,0.68286
76,0.77417
77,0.8650200000000001
78,0.95635
79,1.0473
80,1.1313
81,1.2226
82,1.3072
83,1.3915
84,1.4833
85,1.5749
86,1.6579
87,1.7314
88,1.7469
89,1.7228
90,1.6319
91,1.5409
92,1.4487
93,1.3633
94,1.2722
95,1.1813
96,1.0902
97,0.99944
98,0.9082
99,0.81787
100,0.7336600000000001
101,0.64388
102,0.5592199999999999
103,0.47005
104,0.38021
105,0.29169
106,0.20151
107,0.11402000000000001
108,0.031944
109,-0.055942
110,-0.14445
111,-0.22949
112,-0.31544
113,-0.39736
114,-0.48063
115,-0.564
116,-0.64617
117,-0.72555
118,-0.8031
119,-0.8740899999999999
120,-0.9453600000000001
121,-1.0137
122,-1.0799
123,-1.1401
124,-1.1949
125,-1.2441
126,-1.2914
127,-1.3208
128,-1.3521
129,-1.3739
130,-1.3796
131,-1.3799
132,-1.3762
133,-1.3618
134,-1.3329
135,-1.3005
136,-1.2598
137,-1.2178
138,-1.1635
139,-1.104
140,-1.045
141,-0.98174
142,-0.91486
143,-0.84488
144,-0.77632
145,-0.70507
146,-0.6302
147,-0.55252
148,-0.47539
149,-0.39673
150,-0.32273
151,-0.24164000000000002
152,-0.1595
153,-0.076439
154,0.0064753
155,0.091191
156,0.17509
157,0.25893
158,0.34347
159,0.43008
160,0.51443
161,0.5995
162,0.67916
163,0.7649699999999999
164,0.84991
165,0.93422
166,1.0116
167,1.0954
168,1.1785
169,1.2549
170,1.3333
171,1.4207
172,1.5109
173,1.5958
174,1.6869999999999998
175,1.7458
