time,value
0,-0.37492
1,-0.37492
2,-0.37492
3,-0.37492
4,0.52489
5,-0.37492
6,-0.37492
7,-0.37492
8,-0.37492
9,0.52489
10,-0.37492
11,-0.37492
12,1.4247
13,-0.37492
14,-0.37492
15,-0.37492
16,0.52489
17,-0.37492
18,-0.37492
19,-0.37492
20,-0.37492
21,-0.37492
22,-0.37492
23,-0.37492
24,-0.37492
25,-0.37492
26,0.52489
27,-0.37492
28,-0.37492
29,-0.37492
30,-0.37492
31,-0.37492
32,-0.37492
33,-0.37492
34,-0.37492
35,-0.37492
36,-0.37492
37,-0.37492
38,-0.37492
39,-0.37492
40,-0.37492
41,-0.37492
42,-0.37492
43,-0.37492
44,-0.37492
45,-0.37492
46,-0.37492
47,-0.37492
48,0.52489
49,-0.37492
50,-0.37492
51,-0.37492
52,-0.37492
53,-0.37492
54,-0.37492
55,-0.37492
56,-0.37492
57,-0.37492
58,-0.37492
59,-0.37492
60,-0.37492
61,-0.37492
62,-0.37492
63,0.52489
64,3.2243
65,4.1241
66,-0.37492
67,-0.37492
68,-0.37492
69,-0.37492
70,-0.37492
71,-0.37492
72,1.4247
73,1.4247
74,-0.37492
75,-0.37492
76,-0.37492
77,-0.37492
78,-0.37492
79,-0.37492
80,4.1241
81,3.2243
82,3.2243
83,3.2243
84,0.52489
85,-0.37492
86,-0.37492
87,-0.37492
88,-0.37492
89,-0.37492
90,-0.37492
91,-0.37492
92,-0.37492
93,0.52489
94,-0.37492
95,-0.37492
