time,value
0,-0.83031
1,-0.83031
2,-0.83031
3,0.3084
4,1.5285
5,1.4471
6,-0.83031
7,-0.83031
8,-0.83031
9,-0.83031
10,-0.83031
11,-0.83031
12,1.4471
13,1.4471
14,1.4471
15,-0.42363
16,-0.83031
17,-0.83031
18,-0.83031
19,-0.83031
20,-0.83031
21,-0.83031
22,1.6098
23,1.4471
24,-0.016944999999999998
25,-0.83031
26,-0.83031
27,-0.83031
28,-0.83031
29,0.5524100000000001
30,1.0404
31,0.47108
32,1.4471
33,-0.26095999999999997
34,-0.83031
35,-0.83031
36,-0.83031
37,-0.83031
38,-0.83031
39,0.63375
40,1.4471
41,1.0404
42,-0.83031
43,-0.83031
44,-0.83031
45,-0.83031
46,-0.83031
47,0.71509
48,1.2844
49,1.4471
50,1.3658
51,-0.83031
52,-0.83031
53,-0.83031
54,-0.83031
55,-0.83031
56,-0.83031
57,0.14573
58,1.5285
59,-0.26095999999999997
60,-0.83031
61,-0.83031
62,-0.26095999999999997
63,1.2844
64,-0.09828200000000001
65,0.38974000000000003
66,1.3658
67,0.38974000000000003
68,-0.83031
69,-0.83031
70,-0.83031
71,-0.83031
72,-0.83031
73,-0.66764
74,1.6098
75,1.4471
76,1.5285
77,0.71509
78,-0.83031
79,-0.83031
80,-0.83031
81,-0.83031
82,-0.83031
83,-0.34229
84,1.5285
85,1.5285
86,1.5285
87,1.5285
88,-0.26095999999999997
89,-0.83031
90,-0.83031
91,-0.83031
92,1.1218
93,1.5285
94,1.4471
95,1.3658
