time,value
0,-1.2836
1,-1.2004
2,-1.2004
3,-1.2004
4,-1.2836
5,-1.2004
6,-1.2004
7,-1.2836
8,-1.2004
9,-1.2004
10,-1.2004
11,-1.2836
12,-1.2004
13,-1.2004
14,-1.2004
15,-1.2836
16,-1.2004
17,-1.2004
18,-1.2004
19,-1.2836
20,-1.2004
21,-1.2004
22,-1.2004
23,-1.2836
24,-1.2004
25,-1.2004
26,-1.2004
27,-1.2836
28,-1.2004
29,-1.2004
30,-0.53474
31,1.6285
32,1.3789
33,0.38047
34,0.21406999999999998
35,0.29727
36,0.29727
37,0.21406999999999998
38,0.29727
39,0.21406999999999998
40,0.29727
41,0.46366999999999997
42,0.8796799999999999
43,0.8796799999999999
44,0.79648
45,0.8796799999999999
46,2.8765
47,0.79648
48,0.79648
49,1.6285
50,3.0429
51,2.8765
52,1.8781
53,0.8796799999999999
54,0.38047
55,0.29727
56,0.79648
57,1.1293
58,0.46366999999999997
59,1.7117
60,0.54687
61,0.21406999999999998
62,0.21406999999999998
63,0.21406999999999998
64,0.29727
65,0.21406999999999998
66,0.21406999999999998
67,0.21406999999999998
68,0.29727
69,0.21406999999999998
70,0.21406999999999998
71,0.21406999999999998
72,0.21406999999999998
73,0.29727
74,0.21406999999999998
75,0.21406999999999998
76,0.21406999999999998
77,0.29727
78,0.21406999999999998
79,0.21406999999999998
80,0.21406999999999998
81,0.21406999999999998
82,0.29727
83,0.21406999999999998
84,0.21406999999999998
85,0.21406999999999998
86,0.21406999999999998
87,0.21406999999999998
88,0.21406999999999998
89,0.21406999999999998
90,0.21406999999999998
91,0.21406999999999998
92,0.29727
93,0.21406999999999998
94,0.21406999999999998
95,0.21406999999999998
