time,value
0,-0.62407
1,-0.62407
2,-0.62407
3,-0.62407
4,2.3516
5,0.16945
6,-0.62407
7,-0.62407
8,-0.62407
9,-0.22730999999999998
10,2.1532
11,-0.02893
12,-0.62407
13,-0.62407
14,-0.62407
15,-0.02893
16,2.3516
17,-0.62407
18,-0.62407
19,-0.62407
20,-0.62407
21,0.36783000000000005
22,1.9549
23,-0.62407
24,-0.62407
25,-0.62407
26,-0.62407
27,1.1613
28,1.5581
29,-0.62407
30,-0.62407
31,-0.62407
32,-0.62407
33,2.3516
34,0.16945
35,-0.62407
36,-0.62407
37,-0.62407
38,-0.22730999999999998
39,2.1532
40,-0.02893
41,-0.62407
42,-0.62407
43,-0.62407
44,-0.02893
45,2.1532
46,-0.22730999999999998
47,-0.62407
48,-0.62407
49,-0.62407
50,0.76459
51,1.5581
52,-0.62407
53,-0.62407
54,-0.62407
55,-0.62407
56,0.9629700000000001
57,1.5581
58,-0.62407
59,-0.62407
60,-0.62407
61,-0.62407
62,0.76459
63,1.7565
64,-0.62407
65,-0.62407
66,-0.62407
67,-0.62407
68,0.56621
69,1.9549
70,-0.62407
71,-0.62407
72,-0.62407
73,-0.62407
74,0.76459
75,1.9549
76,-0.62407
77,-0.62407
78,-0.62407
79,-0.62407
80,1.7565
81,0.9629700000000001
82,-0.62407
83,-0.62407
84,-0.62407
85,-0.62407
86,2.1532
87,0.16945
88,-0.62407
89,-0.62407
90,-0.62407
91,-0.62407
92,2.3516
93,-0.02893
94,-0.62407
95,-0.62407
