time,value
0,-0.52344
1,-1.1217
2,-0.65638
3,1.2712
4,0.80593
5,-1.1217
6,-1.1217
7,0.20770999999999998
8,1.1383
9,0.0083086
10,-1.1217
11,-1.1217
12,1.1383
13,1.1383
14,-1.1217
15,-1.1217
16,-0.32404
17,1.2712
18,0.27418000000000003
19,-1.1217
20,-1.1217
21,0.73946
22,1.1383
23,-0.92225
24,-1.1217
25,-0.3905
26,1.2712
27,0.0083086
28,-1.1217
29,-1.1217
30,0.8724
31,1.1383
32,-1.1217
33,-1.1217
34,-0.12462999999999999
35,1.2047
36,0.0083086
37,-1.1217
38,-1.1217
39,1.0718
40,1.1383
41,-0.65638
42,-1.1217
43,-0.45697
44,1.2712
45,1.0718
46,-0.8557799999999999
47,-1.1217
48,-0.32404
49,1.2712
50,0.73946
51,-1.1217
52,-1.1217
53,0.6729999999999999
54,1.1383
55,1.0718
56,-0.3905
57,-1.1217
58,-0.72285
59,1.2712
60,1.1383
61,-0.05816
62,-1.1217
63,-1.1217
64,1.3377
65,1.1383
66,1.0718
67,-0.72285
68,-1.1217
69,-0.3905
70,1.2047
71,1.1383
72,0.6729999999999999
73,-1.1217
74,-1.1217
75,0.6729999999999999
76,1.2712
77,1.2047
78,1.0718
79,1.0718
80,-1.1217
81,-1.1217
82,0.0083086
83,1.2047
84,0.80593
85,-1.1217
86,-1.1217
87,1.4042
88,1.0718
89,0.60653
90,-1.1217
91,-1.1217
92,0.6729999999999999
93,1.2047
94,0.20770999999999998
95,-1.1217
