time,value
0,-0.54518
1,-0.54518
2,-0.54518
3,-0.54518
4,-0.54518
5,-0.54518
6,-0.54518
7,-0.54518
8,-0.54518
9,-0.54518
10,-0.54518
11,-0.54518
12,-0.54518
13,-0.54518
14,-0.54518
15,-0.54518
16,-0.54518
17,-0.54518
18,-0.54518
19,-0.54518
20,-0.54518
21,-0.54518
22,-0.54518
23,-0.54518
24,-0.54518
25,-0.54518
26,-0.54518
27,-0.54518
28,-0.54518
29,-0.54518
30,-0.54518
31,-0.54518
32,-0.54518
33,-0.54518
34,-0.54518
35,-0.54518
36,-0.54518
37,-0.54518
38,-0.54518
39,-0.54518
40,-0.54518
41,-0.54518
42,-0.54518
43,-0.54518
44,-0.54518
45,-0.54518
46,-0.54518
47,-0.54518
48,-0.54518
49,-0.54518
50,-0.54518
51,-0.54518
52,-0.54518
53,-0.54518
54,-0.54518
55,-0.54518
56,-0.54518
57,-0.54518
58,-0.54518
59,-0.34915999999999997
60,2.1991
61,2.2971
62,2.2971
63,1.219
64,-0.15314
65,-0.25115
66,-0.15314
67,-0.25115
68,-0.15314
69,-0.25115
70,-0.15314
71,-0.25115
72,-0.15314
73,-0.25115
74,0.53293
75,1.219
76,-0.25115
77,-0.15314
78,-0.15314
79,0.9249700000000001
80,2.1011
81,2.1011
82,2.1991
83,2.2971
84,2.2971
85,2.1991
86,2.1991
87,2.0031
88,2.1991
89,2.1011
90,2.1991
91,2.1011
92,0.04288
93,-0.54518
94,-0.54518
95,-0.54518
