time,value
0,1.6869
1,1.6880000000000002
2,1.6738
3,1.6187
4,1.5309
5,1.4393
6,1.3455
7,1.2532
8,1.1601
9,1.0687
10,0.97746
11,0.90038
12,0.81025
13,0.72154
14,0.6440899999999999
15,0.55708
16,0.46852
17,0.37977
18,0.29463
19,0.20817
20,0.1243
21,0.042627
22,-0.040138
23,-0.12434
24,-0.20651
25,-0.29394000000000003
26,-0.38095
27,-0.47157
28,-0.5577300000000001
29,-0.65033
30,-0.73741
31,-0.8218200000000001
32,-0.9051600000000001
33,-0.97059
34,-1.05
35,-1.1157
36,-1.1787
37,-1.2289
38,-1.2662
39,-1.2957
40,-1.2925
41,-1.2882
42,-1.2809
43,-1.27
44,-1.2786
45,-1.2954
46,-1.2953
47,-1.3124
48,-1.3194
49,-1.3044
50,-1.2775
51,-1.2405
52,-1.1868
53,-1.1226
54,-1.0623
55,-0.9932
56,-0.91575
57,-0.8401200000000001
58,-0.75631
59,-0.6675300000000001
60,-0.58167
61,-0.49151000000000006
62,-0.40517
63,-0.31829
64,-0.23251
65,-0.15172
66,-0.076843
67,0.0044066
68,0.089776
69,0.17449
70,0.25986
71,0.33502
72,0.42051000000000005
73,0.50944
74,0.59706
75,0.6862199999999999
76,0.77499
77,0.8648399999999999
78,0.95491
79,1.0461
80,1.1364
81,1.2297
82,1.3234
83,1.4165
84,1.5071
85,1.5832
86,1.6562
87,1.6887
88,1.6993
89,1.6998
90,1.6555
91,1.5799
92,1.4895
93,1.3973
94,1.3059
95,1.2268
96,1.1340000000000001
97,1.0441
98,0.96595
99,0.8749
100,0.7854300000000001
101,0.6974899999999999
102,0.6110899999999999
103,0.5218
104,0.43273
105,0.34492
106,0.26
107,0.1785
108,0.094183
109,0.019732
110,-0.066254
111,-0.14836
112,-0.23462
113,-0.31659
114,-0.40347
115,-0.48983000000000004
116,-0.58
117,-0.67438
118,-0.75943
119,-0.8221200000000001
120,-0.8870299999999999
121,-0.9683
122,-1.0442
123,-1.1159999999999999
124,-1.1841
125,-1.2073
126,-1.2611
127,-1.2905
128,-1.3075
129,-1.3019999999999998
130,-1.2875
131,-1.2809
132,-1.2879
133,-1.2777
134,-1.2843
135,-1.2830000000000001
136,-1.3034
137,-1.2784
138,-1.2537
139,-1.2219
140,-1.1752
141,-1.1234
142,-1.0648
143,-0.99282
144,-0.90664
145,-0.8195899999999999
146,-0.7389899999999999
147,-0.65182
148,-0.55957
149,-0.47931
150,-0.39783
151,-0.31206
152,-0.22815
153,-0.14551
154,-0.08175299999999999
155,0.007956699999999999
156,0.091561
157,0.17598
158,0.2612
159,0.33902
160,0.42335
161,0.51155
162,0.6009800000000001
163,0.68906
164,0.77666
165,0.86625
166,0.9551299999999999
167,1.0453
168,1.1355
169,1.2268
170,1.3068
171,1.3995
172,1.4904
173,1.5671
174,1.6354
175,1.6754
