time,value
0,-0.31944
1,-0.31944
2,-0.47751000000000005
3,-0.31944
4,-0.31944
5,-0.31944
6,-0.47751000000000005
7,-0.31944
8,-0.31944
9,-0.31944
10,-0.47751000000000005
11,-0.31944
12,-0.31944
13,-0.31944
14,-0.31944
15,-0.47751000000000005
16,-0.31944
17,-0.31944
18,-0.31944
19,-0.47751000000000005
20,-0.31944
21,-0.31944
22,-0.31944
23,-0.47751000000000005
24,-0.31944
25,-0.31944
26,-0.31944
27,-0.47751000000000005
28,-0.31944
29,-0.31944
30,-0.31944
31,-0.47751000000000005
32,-0.31944
33,-0.31944
34,-0.31944
35,-0.31944
36,-0.47751000000000005
37,-0.31944
38,-0.31944
39,-0.31944
40,-0.47751000000000005
41,-0.31944
42,-0.31944
43,-0.31944
44,-0.47751000000000005
45,-0.31944
46,-0.31944
47,-0.31944
48,-0.47751000000000005
49,-0.31944
50,-0.31944
51,-0.31944
52,-0.47751000000000005
53,-0.31944
54,-0.31944
55,-0.31944
56,-0.47751000000000005
57,-0.31944
58,-0.31944
59,-0.31944
60,-0.47751000000000005
61,-0.31944
62,-0.31944
63,-0.31944
64,-0.47751000000000005
65,-0.31944
66,-0.31944
67,-0.31944
68,-0.47751000000000005
69,-0.31944
70,-0.31944
71,-0.31944
72,-0.47751000000000005
73,-0.31944
74,-0.31944
75,-0.31944
76,-0.47751000000000005
77,-0.31944
78,-0.31944
79,-0.0032931999999999996
80,3.0001
81,2.842
82,2.842
83,2.842
84,2.6839999999999997
85,2.842
86,2.6839999999999997
87,2.6839999999999997
88,3.0001
89,3.1582
90,1.4194
91,-0.31944
92,-0.31944
93,-0.47751000000000005
94,-0.31944
95,-0.31944
