[<text>
<title>lieberman enterprises inc 3rd qtr feb 28 net</title>
<dateline>    minneapolis, april 7 -
    </dateline>shr 51 cts vs 46 cts
    shr diluted 44 cts vs 41 cts
    net 2,267,000 vs 2,055,000
    sales 87.3 mln vs 70.4 mln
    nine mths
    shr 1.20 dlrs vs 1.12 dlrs
    shr diluted 1.07 dlrs vs 1.03 dlrs
    net 5,318,000 vs 4,958,000
    sales 243.7 mln vs 198.7 mln
 reuter
</text>]