time,value
0,-0.080093
1,-0.15647
2,-0.19466
3,-0.18193
4,4.6937
5,3.077
6,7.367000000000001
7,0.23815999999999998
8,-0.30923
9,-0.32195999999999997
10,-0.28376999999999997
11,-0.15647
12,-0.25831
13,-0.32195999999999997
14,-0.18193
15,-0.1692
16,-0.1692
17,-0.0037129
18,-0.13101
19,-0.24558000000000002
20,-0.30923
21,-0.30923
22,-0.32195999999999997
23,-0.1692
24,-0.23285
25,-0.30923
26,-0.30923
27,-0.32195999999999997
28,-0.32195999999999997
29,1.1293
30,-0.016443
31,0.22543000000000002
32,-0.18193
33,-0.19466
34,-0.28376999999999997
35,-0.24558000000000002
36,-0.15647
37,-0.30923
38,-0.32195999999999997
39,-0.32195999999999997
40,-0.32195999999999997
41,-0.28376999999999997
42,-0.15647
43,-0.23285
44,-0.1692
45,-0.1692
46,-0.19466
47,-0.18193
48,-0.067363
49,-0.25831
50,-0.33469
51,-0.33469
52,-0.33469
53,-0.33469
54,-0.19466
55,-0.23285
56,0.26361999999999997
57,-0.33469
58,-0.1692
59,-0.18193
60,-0.067363
61,-0.054633
62,-0.22011999999999998
63,-0.34742
64,-0.33469
65,-0.33469
66,-0.25831
67,-0.1692
68,-0.33469
69,-0.2965
70,-0.2965
71,1.473
72,-0.11828
73,0.034477
74,-0.10555
75,-0.14374
76,-0.19466
77,-0.2965
78,-0.28376999999999997
79,-0.13101
80,-0.20739000000000002
81,-0.2965
82,-0.28376999999999997
83,-0.27104
84,-0.11828
85,-0.22011999999999998
86,-0.14374
87,-0.13101
88,0.65825
89,0.26361999999999997
90,-0.029173
91,-0.23285
92,-0.28376999999999997
93,-0.34742
94,-0.33469
95,-0.24558000000000002
