time,value
0,-0.24061999999999997
1,-0.47396000000000005
2,-0.24061999999999997
3,-0.24061999999999997
4,-0.24061999999999997
5,-0.47396000000000005
6,-0.24061999999999997
7,-0.24061999999999997
8,-0.24061999999999997
9,-0.47396000000000005
10,-0.24061999999999997
11,-0.24061999999999997
12,-0.24061999999999997
13,-0.47396000000000005
14,-0.24061999999999997
15,-0.24061999999999997
16,-0.24061999999999997
17,-0.47396000000000005
18,-0.24061999999999997
19,-0.24061999999999997
20,-0.47396000000000005
21,-0.24061999999999997
22,-0.24061999999999997
23,-0.24061999999999997
24,-0.47396000000000005
25,-0.24061999999999997
26,-0.24061999999999997
27,-0.24061999999999997
28,-0.47396000000000005
29,-0.24061999999999997
30,-0.24061999999999997
31,-0.24061999999999997
32,-0.47396000000000005
33,-0.24061999999999997
34,-0.24061999999999997
35,-0.24061999999999997
36,-0.47396000000000005
37,-0.24061999999999997
38,-0.24061999999999997
39,-0.24061999999999997
40,-0.47396000000000005
41,-0.24061999999999997
42,-0.24061999999999997
43,-0.24061999999999997
44,-0.47396000000000005
45,-0.24061999999999997
46,-0.24061999999999997
47,-0.24061999999999997
48,-0.47396000000000005
49,-0.24061999999999997
50,-0.24061999999999997
51,-0.24061999999999997
52,-0.47396000000000005
53,-0.24061999999999997
54,-0.24061999999999997
55,-0.24061999999999997
56,-0.47396000000000005
57,-0.24061999999999997
58,-0.24061999999999997
59,-0.24061999999999997
60,-0.47396000000000005
61,-0.24061999999999997
62,-0.24061999999999997
63,-0.24061999999999997
64,-0.47396000000000005
65,-0.24061999999999997
66,-0.24061999999999997
67,-0.24061999999999997
68,-0.47396000000000005
69,-0.24061999999999997
70,-0.24061999999999997
71,-0.24061999999999997
72,-0.47396000000000005
73,-0.24061999999999997
74,-0.24061999999999997
75,-0.47396000000000005
76,-0.24061999999999997
77,-0.24061999999999997
78,0.69271
79,4.426
80,5.126
81,5.126
82,3.4927
83,0.22604000000000002
84,0.45937
85,0.69271
86,0.69271
87,0.69271
88,0.45937
89,0.45937
90,-0.0072916
91,0.22604000000000002
92,0.22604000000000002
93,0.22604000000000002
94,-0.0072916
95,0.22604000000000002
