time,value
0,-0.14299
1,-0.14299
2,-0.14299
3,-0.14299
4,-0.14299
5,-0.14299
6,-0.14299
7,-0.14299
8,-0.14299
9,-0.14299
10,-0.14299
11,-0.14299
12,-0.14299
13,-0.14299
14,-0.14299
15,-0.14299
16,-0.14299
17,-0.14299
18,-0.14299
19,-0.14299
20,-0.14299
21,-0.14299
22,-0.14299
23,-0.14299
24,-0.14299
25,-0.14299
26,-0.14299
27,-0.14299
28,-0.14299
29,-0.14299
30,-0.14299
31,7.8935
32,-0.14299
33,-0.14299
34,-0.14299
35,-0.14299
36,-0.14299
37,-0.14299
38,-0.14299
39,-0.14299
40,-0.14299
41,-0.14299
42,-0.14299
43,-0.14299
44,-0.14299
45,-0.14299
46,-0.14299
47,-0.14299
48,-0.14299
49,-0.14299
50,-0.14299
51,-0.14299
52,-0.14299
53,-0.14299
54,-0.14299
55,-0.14299
56,-0.14299
57,-0.14299
58,-0.14299
59,-0.14299
60,-0.14299
61,-0.14299
62,-0.14299
63,-0.14299
64,-0.14299
65,-0.14299
66,-0.14299
67,-0.14299
68,-0.14299
69,-0.14299
70,-0.14299
71,-0.14299
72,-0.14299
73,-0.14299
74,5.5471
75,-0.14299
76,-0.14299
77,-0.14299
78,-0.14299
79,-0.14299
80,-0.14299
81,-0.14299
82,-0.14299
83,-0.14299
84,-0.14299
85,-0.14299
86,-0.14299
87,-0.14299
88,-0.14299
89,-0.14299
90,-0.14299
91,-0.14299
92,-0.14299
93,-0.14299
94,-0.14299
95,-0.14299
