[<text>
<title>children's discovery &lt;cdcra&gt; 4th qtr loss</title>
<dateline>    new york, march 18 - 
    </dateline>shr loss 18 cts vs profit six cts
    net loss 509,471 vs profit 163,840
    revs 2,623,974 vs 1,835,580
    12 mths
    shr loss 18 cts vs profit 10 cts
    net loss 494,352 vs profit 173,948
    revs 10.1 mln vs 3,551,429
    note: 4th qtr loss reflects 290,000 dlrs of non-recurring
expenses related to senior management changes.
    full name of company is children's discovery centers of
america inc.
 reuter
</text>]