time,value
0,-0.82931
1,-0.7588
2,-0.65432
3,-0.53414
4,-0.41646000000000005
5,-0.30759000000000003
6,-0.20895
7,-0.12232
8,-0.051881
9,-0.0057488999999999995
10,0.016386
11,0.019576
12,0.0082824
13,-0.012111
14,-0.040485
15,-0.07544
16,-0.1129
17,-0.15182
18,-0.19155999999999998
19,-0.23314000000000001
20,-0.27716999999999997
21,-0.31989
22,-0.35579
23,-0.37879
24,-0.38303000000000004
25,-0.36466
26,-0.32143
27,-0.25455
28,-0.16982
29,-0.076275
30,0.015839
31,0.099251
32,0.17051
33,0.22841999999999998
34,0.27455999999999997
35,0.30666
36,0.32016
37,0.31168
38,0.27713000000000004
39,0.21832
40,0.14053
41,0.048494999999999996
42,-0.049524
43,-0.14895999999999998
44,-0.24679
45,-0.33776
46,-0.4187
47,-0.48591000000000006
48,-0.53882
49,-0.58317
50,-0.62442
51,-0.6664100000000001
52,-0.70702
53,-0.7387199999999999
54,-0.75697
55,-0.76103
56,-0.75327
57,-0.73515
58,-0.70191
59,-0.6522899999999999
60,-0.5921
61,-0.5330199999999999
62,-0.48938000000000004
63,-0.46363999999999994
64,-0.4484
65,-0.43493000000000004
66,-0.41647
67,-0.39749
68,-0.38598000000000005
69,-0.38521
70,-0.39638
71,-0.41634
72,-0.44205
73,-0.47258
74,-0.50525
75,-0.53847
76,-0.5719
77,-0.60465
78,-0.63661
79,-0.66608
80,-0.69029
81,-0.7096
82,-0.72568
83,-0.74087
84,-0.7570899999999999
85,-0.77112
86,-0.78025
87,-0.7838
88,-0.78168
89,-0.77857
90,-0.77566
91,-0.77215
92,-0.77032
93,-0.76654
94,-0.76152
95,-0.75734
96,-0.7509
97,-0.74388
98,-0.73395
99,-0.71807
100,-0.69893
101,-0.67338
102,-0.64145
103,-0.60434
104,-0.56017
105,-0.51135
106,-0.45888
107,-0.40204
108,-0.34058
109,-0.26976999999999995
110,-0.1864
111,-0.090063
112,0.018675
113,0.13697
114,0.26302
115,0.39603
116,0.53342
117,0.6713399999999999
118,0.80291
119,0.9195700000000001
120,1.0132
121,1.0764
122,1.1034
123,1.0916
124,1.0412
125,0.95794
126,0.85134
127,0.7328
128,0.61224
129,0.49422
130,0.37906999999999996
131,0.26498
132,0.15106
133,0.040902
134,-0.061723
135,-0.15427000000000002
136,-0.23628000000000002
137,-0.31076
138,-0.37821
139,-0.43818999999999997
140,-0.49258
141,-0.5391100000000001
142,-0.58004
143,-0.61725
144,-0.64757
145,-0.67394
146,-0.69489
147,-0.70912
148,-0.7249
149,-0.73557
150,-0.74138
151,-0.74578
152,-0.74169
153,-0.7350300000000001
154,-0.7269100000000001
155,-0.7136
156,-0.7041
157,-0.69182
158,-0.6756
159,-0.6593899999999999
160,-0.6342800000000001
161,-0.59925
162,-0.54996
163,-0.47668
164,-0.38305
165,-0.26485
166,-0.12272999999999999
167,0.036238
168,0.21824000000000002
169,0.42568
170,0.66269
171,0.93715
172,1.2418
173,1.5681
174,1.8989
175,2.2079
176,2.4777
177,2.6927
178,2.8459
179,2.9431
180,2.9905
181,2.9998
182,2.9811
183,2.9395
184,2.8829
185,2.8182
186,2.7539999999999996
187,2.702
188,2.6687
189,2.6566
190,2.6589
191,2.66
192,2.6442
193,2.5989999999999998
194,2.5215
195,2.4167
196,2.2897
197,2.1498
198,2.0039
199,1.86
200,1.7269
201,1.5989
202,1.4658
203,1.3142
204,1.1354
205,0.94724
206,0.7669600000000001
207,0.6076199999999999
208,0.47634
209,0.3602
210,0.25551999999999997
211,0.16315
212,0.080359
213,0.013136000000000002
214,-0.045842
215,-0.10438
216,-0.15874000000000002
217,-0.21156
218,-0.25822
219,-0.29824
220,-0.33997
221,-0.38014000000000003
222,-0.42057
223,-0.46163999999999994
224,-0.49618999999999996
225,-0.5279
226,-0.5557
227,-0.57885
228,-0.60115
229,-0.61762
230,-0.62844
231,-0.63544
232,-0.63607
233,-0.63445
234,-0.631
235,-0.62542
236,-0.6207600000000001
237,-0.61662
238,-0.61483
239,-0.61632
240,-0.6177600000000001
241,-0.61838
242,-0.6171300000000001
243,-0.61455
244,-0.613
245,-0.6119399999999999
246,-0.61144
247,-0.61239
248,-0.61531
249,-0.62225
250,-0.63284
251,-0.64485
252,-0.65658
253,-0.6665800000000001
254,-0.6754600000000001
255,-0.6842699999999999
256,-0.6926399999999999
257,-0.70073
258,-0.7090000000000001
259,-0.7186
260,-0.73087
261,-0.74546
262,-0.76177
263,-0.77977
264,-0.7992199999999999
265,-0.81971
266,-0.8385
267,-0.8517399999999999
268,-0.85767
269,-0.8572700000000001
