time,value
0,-0.25198000000000004
1,-0.10094
2,-0.31006999999999996
3,-0.37978
4,-0.37978
5,-0.3914
6,-0.3914
7,-0.28683000000000003
8,-0.27521
9,-0.37978
10,-0.3914
11,-0.3333
12,-0.22874
13,-0.22874
14,-0.17065
15,-0.36816
16,-0.37978
17,-0.3914
18,-0.3914
19,-0.3914
20,-0.28683000000000003
21,-0.27521
22,-0.37978
23,-0.3914
24,-0.24036
25,-0.24036
26,-0.26359
27,-0.21711999999999998
28,-0.32169000000000003
29,0.74721
30,-0.3914
31,-0.37978
32,-0.36816
33,-0.34492
34,-0.22874
35,-0.37978
36,0.43351000000000006
37,-0.24036
38,-0.24036
39,-0.27521
40,-0.28683000000000003
41,-0.27521
42,2.153
43,1.0725
44,0.073341
45,-0.089317
46,-0.17065
47,-0.10094
48,-0.29845
49,-0.21711999999999998
50,-0.24036
51,-0.25198000000000004
52,-0.34492
53,-0.29845
54,4.5697
55,5.8012
56,0.026868
57,-0.17065
58,-0.13579000000000002
59,-0.13579000000000002
60,0.050105000000000004
61,0.096578
62,-0.21711999999999998
63,-0.25198000000000004
64,-0.35654
65,-0.37978
66,-0.28683000000000003
67,-0.2055
68,0.46837
69,-0.3914
70,-0.37978
71,-0.34492
72,-0.24036
73,-0.054461
74,-0.18225999999999998
75,-0.18225999999999998
76,-0.31006999999999996
77,-0.31006999999999996
78,3.1871
79,3.8726
80,1.0377
81,-0.34492
82,-0.34492
83,-0.34492
84,-0.17065
85,-0.054461
86,-0.21711999999999998
87,-0.24036
88,-0.37978
89,-0.3914
90,-0.34492
91,-0.22874
92,-0.37978
93,-0.3914
94,-0.3914
95,-0.36816
