time,value
0,-0.9570000000000001
1,-0.9570000000000001
2,-0.9570000000000001
3,0.8356299999999999
4,1.1942
5,1.2838
6,-0.68811
7,-0.9570000000000001
8,-0.9570000000000001
9,-0.9570000000000001
10,-0.9570000000000001
11,0.746
12,1.2838
13,1.1942
14,-0.59848
15,-0.9570000000000001
16,-0.9570000000000001
17,-0.9570000000000001
18,-0.9570000000000001
19,0.746
20,1.1942
21,1.2838
22,-0.41921
23,-0.9570000000000001
24,-0.9570000000000001
25,-0.9570000000000001
26,-0.9570000000000001
27,0.5667300000000001
28,1.2838
29,1.1942
30,-0.41921
31,-0.9570000000000001
32,-0.9570000000000001
33,-0.9570000000000001
34,1.2838
35,1.2838
36,1.1942
37,0.11857999999999999
38,-0.9570000000000001
39,-0.9570000000000001
40,-0.9570000000000001
41,1.3734
42,1.1942
43,1.1942
44,-0.77774
45,-0.9570000000000001
46,-0.9570000000000001
47,-0.9570000000000001
48,1.2838
49,1.1942
50,1.1942
51,-0.59848
52,-0.9570000000000001
53,-0.9570000000000001
54,-0.9570000000000001
55,1.1942
56,1.1942
57,1.1942
58,-0.41921
59,-0.9570000000000001
60,-0.9570000000000001
61,-0.9570000000000001
62,-0.23995
63,1.2838
64,1.1942
65,0.746
66,-0.9570000000000001
67,-0.9570000000000001
68,-0.9570000000000001
69,0.38747
70,1.2838
71,1.2838
72,1.1942
73,0.20820999999999998
74,-0.9570000000000001
75,-0.9570000000000001
76,-0.9570000000000001
77,1.0149
78,1.2838
79,1.1942
80,1.1942
81,0.11857999999999999
82,-0.9570000000000001
83,-0.9570000000000001
84,-0.9570000000000001
85,0.11857999999999999
86,1.2838
87,1.1942
88,-0.68811
89,-0.9570000000000001
90,-0.9570000000000001
91,-0.59848
92,1.3734
93,1.1942
94,0.38747
95,-0.9570000000000001
