time,value
0,0.8122199999999999
1,0.75659
2,0.64675
3,0.64728
4,0.66799
5,0.6714399999999999
6,0.6545
7,0.66368
8,0.65253
9,0.85359
10,0.83768
11,0.7733399999999999
12,0.66068
13,0.5090899999999999
14,0.5686899999999999
15,0.72821
16,0.78992
17,0.84215
18,0.88174
19,0.9202899999999999
20,0.9613299999999999
21,1.0134
22,1.055
23,1.0365
24,1.0118
25,1.0611
26,1.0851
27,1.0568
28,1.0102
29,1.0396
30,1.1463
31,1.2173
32,1.1515
33,1.0812
34,1.0143
35,1.101
36,1.1125
37,1.1491
38,1.2072
39,1.2
40,1.1539
41,1.3185
42,1.4497
43,1.5588
44,1.3780000000000001
45,1.0995
46,0.8377700000000001
47,0.76552
48,0.6886800000000001
49,0.66432
50,0.39688
51,0.14669000000000001
52,-0.080473
53,-0.23268000000000003
54,-0.12047999999999999
55,-0.028107999999999998
56,-0.60255
57,-0.90102
58,-1.1214
59,-1.173
60,-1.0828
61,-1.0156
62,-0.46373000000000003
63,-0.48363
64,-1.01
65,-1.2407
66,-1.3509
67,-0.8756700000000001
68,-0.8343
69,-0.86075
70,-0.9351
71,-0.88064
72,-0.7035100000000001
73,-0.58553
74,-0.50854
75,-0.77361
76,-0.78691
77,-0.74555
78,-0.79937
79,-0.677
80,-0.7306600000000001
81,-0.9285399999999999
82,-0.8239200000000001
83,-0.9467399999999999
84,-0.9367200000000001
85,-1.0454
86,-1.0753
87,-1.1165
88,-1.0361
89,-1.0001
90,-0.97426
91,-1.0483
92,-1.0096
93,-0.9829899999999999
94,-0.87031
95,-1.1304
96,-1.0519
97,-0.96193
98,-0.99865
99,-0.9415
100,-0.77151
101,-0.8839899999999999
102,-0.88107
103,-0.78787
104,-0.85119
105,-0.92642
106,-0.85185
107,-0.9702
108,-0.96298
109,-1.0044
110,-1.0369
111,-1.0301
112,-0.90233
113,-0.94847
114,-0.8876200000000001
115,-0.8722799999999999
116,-0.8337700000000001
117,-0.96214
118,-0.85854
119,-0.72322
120,-0.85639
121,-0.8125899999999999
122,-0.6874399999999999
123,-0.8315600000000001
124,-0.76053
125,-0.59682
126,-0.71194
127,-0.72751
128,-0.60652
129,-0.64115
130,-0.5805100000000001
131,-0.61607
132,-0.64294
133,-0.6915899999999999
134,-0.7288
135,-0.7547699999999999
136,-0.7455
137,-0.78889
138,-0.76363
139,-0.8535799999999999
140,-0.81394
141,-0.66176
142,-0.63035
143,-0.58222
144,-0.63745
145,-0.73927
146,-0.49612
147,-0.35616
148,-0.20235
149,0.13773
150,0.048019
151,-0.081246
152,0.058926
153,0.06467
154,0.09128700000000001
155,0.10647000000000001
156,0.16737
157,0.054612
158,-0.26929000000000003
159,-0.73544
160,-1.1637
161,-1.4228
162,-1.9738
163,-2.6302
164,-2.7341
165,-2.4629
166,-2.2458
167,-2.1225
168,-2.7110000000000003
169,-3.077
170,-3.3758
171,-2.6869
172,-2.3807
173,-2.6237
174,-2.9516
175,-2.2385
176,-1.1701
177,-0.78593
178,-0.87079
179,-0.9400799999999999
180,-0.8554799999999999
181,-0.59717
182,-0.15972999999999998
183,-0.43236
184,-0.6673600000000001
185,-0.14715
186,-0.066705
187,-0.082125
188,0.14561
189,0.73327
190,0.48578999999999994
191,1.2191
192,1.0777
193,1.179
194,1.0127
195,2.5456
196,2.9002
197,2.5949
198,1.3422
199,0.64115
200,0.010882
201,0.42102
202,0.6425
203,0.85144
204,0.8534299999999999
205,0.82199
206,0.79633
207,0.8585200000000001
208,0.66479
209,0.6545300000000001
210,0.58014
211,0.19302
212,0.79299
213,0.45753999999999995
214,-0.1079
215,0.24452
216,0.24456
217,0.25253000000000003
218,0.24389
219,0.23021
220,0.24915
221,0.25467
222,0.25695999999999997
223,0.24650999999999998
224,0.26739
225,0.45645
226,0.63108
227,0.63305
228,0.64765
229,0.6271800000000001
230,0.62438
231,0.28636999999999996
232,0.24824000000000002
233,0.25159000000000004
234,-0.12084
235,-0.27005
236,-0.15512
237,-0.17568
238,0.75271
239,1.2432
240,0.8238200000000001
241,0.7880199999999999
242,1.0761
243,0.6673100000000001
244,0.38375
245,0.28889000000000004
246,0.18344000000000002
247,0.45125
248,0.76983
249,0.9513799999999999
250,0.7650399999999999
251,0.35801
252,0.56886
253,0.52173
254,0.55998
255,0.5524600000000001
256,0.56055
257,0.55032
258,0.57338
259,0.58315
260,0.7602399999999999
261,0.78052
262,0.77057
263,0.5761
264,0.56987
265,0.34829
266,0.33457
267,0.54447
268,0.7541899999999999
269,0.9482
270,0.94875
271,1.1056
272,1.209
273,1.3505
274,1.3591
275,1.2297
276,0.9542
277,0.75716
278,0.54357
279,0.53232
280,0.5399
281,0.54004
282,0.73815
283,0.92732
284,0.9335100000000001
285,0.8613200000000001
286,0.53418
287,0.33468000000000003
288,0.19877
289,0.37575
290,1.1079
291,1.5003
292,1.2617
293,0.72655
294,0.52917
295,0.52862
296,0.92043
297,1.1032
298,0.71311
299,0.9055799999999999
