[<text>
<title>kent electronics corp &lt;kec&gt; 2nd qtr sept 26 net</title>
<dateline>    houston, oct 20 -
    </dateline>shr 14 cts vs seven cts
    net 348,000 vs 135,000
    revs 6,328,000 vs 4,117,000
    avg shrs 2,558,400 vs 1,884,200
    nine mths
    shr 29 cts vs 20 cts
    net 640,000 vs 313,000
    revs 12.0 mln vs 8,719,000
    avg shrs 2,226,600 vs 1,589,6000
 reuter
</text>]