time,value
0,0.23176
1,0.094605
2,-0.044379
3,-0.078736
4,-0.036930000000000004
5,0.0060658000000000005
6,0.05998099999999999
7,0.111
8,0.11823
9,0.083289
10,0.10226
11,0.13945
12,0.21206
13,0.27810999999999997
14,0.33351
15,0.3994
16,0.36401999999999995
17,0.36178
18,0.27053
19,0.33499
20,0.39219
21,0.47967
22,0.542
23,0.5838899999999999
24,0.61774
25,0.68742
26,0.7752600000000001
27,0.8261
28,0.8629700000000001
29,0.9202799999999999
30,1.0108
31,1.0759999999999998
32,1.0805
33,0.97435
34,0.8791399999999999
35,0.7790100000000001
36,0.68417
37,0.5856600000000001
38,0.49328
39,0.40016
40,0.30391999999999997
41,0.20920999999999998
42,0.11585
43,0.027294
44,-0.07235499999999999
45,-0.18269000000000002
46,-0.27304
47,-0.38189
48,-0.45191000000000003
49,-0.52272
50,-0.6189899999999999
51,-0.71714
52,-0.8329200000000001
53,-0.92919
54,-1.0317
55,-1.1164
56,-1.2195
57,-1.3099
58,-1.4263
59,-1.5078
60,-1.6072
61,-1.6976
62,-1.8059
63,-1.8943
64,-1.9812
65,-2.083
66,-2.1838
67,-2.2708
68,-2.3628
69,-2.461
70,-2.5522
71,-2.6348
72,-2.7415
73,-2.7713
74,-2.7386
75,-2.7344
76,-2.7323
77,-2.6830000000000003
78,-2.6296
79,-2.6071
80,-2.5363
81,-2.4292
82,-2.3305
83,-2.2735
84,-2.2116
85,-2.1953
86,-2.2186
87,-2.2945
88,-2.2552
89,-2.1394
90,-2.0678
91,-1.9456
92,-1.8705
93,-1.7877
94,-1.7491
95,-1.68
96,-1.5947
97,-1.5161
98,-1.4394
99,-1.3727
100,-1.3034
101,-1.2151
102,-1.1440000000000001
103,-1.0859
104,-1.0569
105,-1.0764
106,-1.1649
107,-1.2423
108,-1.3106
109,-1.3704
110,-1.4232
111,-1.3567
112,-1.3116
113,-1.2735
114,-1.1791
115,-1.0849
116,-0.98435
117,-0.88985
118,-0.83626
119,-0.74022
120,-0.6446
121,-0.54237
122,-0.45219
123,-0.33597
124,-0.23746
125,-0.15315
126,-0.076941
127,-0.025355000000000003
128,-0.052679
129,-0.11604
130,-0.017928
131,0.066165
132,0.18419000000000002
133,0.24649000000000001
134,0.34706
135,0.43849
136,0.51744
137,0.61105
138,0.71739
139,0.8295100000000001
140,0.9013200000000001
141,1.004
142,1.0956
143,1.2171
144,1.3124
145,1.3967
146,1.5051
147,1.6048
148,1.7025
149,1.7945
150,1.867
151,1.8718
152,1.8187
153,1.7003
154,1.5795
155,1.455
156,1.3359
157,1.2125
158,1.0811
159,0.98629
160,0.85845
161,0.7468899999999999
162,0.6327
163,0.54574
164,0.5103800000000001
165,0.51583
166,0.4713
167,0.35584
168,0.27032
169,0.19029000000000001
170,0.12584
171,0.0060231
172,-0.07964299999999999
173,-0.090624
174,-0.019163
175,0.0070661000000000005
176,-0.059641
177,-0.11408
178,-0.19780999999999999
179,-0.28670999999999996
180,-0.39866999999999997
181,-0.47561000000000003
182,-0.50216
183,-0.5169600000000001
184,-0.5858800000000001
185,-0.53942
186,-0.57084
187,-0.6458699999999999
188,-0.73335
189,-0.82109
190,-0.9045799999999999
191,-0.9145200000000001
192,-0.79779
193,-0.6671600000000001
194,-0.53577
195,-0.4482
196,-0.31416
197,-0.2149
198,-0.13317
199,-0.071766
200,-0.11657999999999999
201,-0.17265999999999998
202,-0.19565
203,-0.2035
204,-0.27598
205,-0.32197
206,-0.38850999999999997
207,-0.40598
208,-0.34035
209,-0.39177
210,-0.45863999999999994
211,-0.5533399999999999
212,-0.62322
213,-0.6908
214,-0.74863
215,-0.81595
216,-0.76013
217,-0.7326199999999999
218,-0.7643
219,-0.7862399999999999
220,-0.82411
221,-0.8620700000000001
222,-0.84911
223,-0.89315
224,-0.92763
225,-0.93978
226,-0.95296
227,-0.9638899999999999
228,-0.85255
229,-0.75164
230,-0.65233
231,-0.5410699999999999
232,-0.44983
233,-0.32668
234,-0.2345
235,-0.11706
236,-0.028386
237,0.10368
238,0.19119
239,0.28731
240,0.36656
241,0.49572
242,0.58816
243,0.67757
244,0.7369600000000001
245,0.78808
246,0.91517
247,1.0009
248,1.1059
249,1.1775
250,1.1147
251,1.0748
252,1.1159
253,1.1671
254,1.2249
255,1.2723
256,1.3239
257,1.3544
258,1.3059
259,1.2042
260,1.1391
261,1.0518
262,0.9493799999999999
263,0.9179200000000001
264,0.85254
265,0.77928
266,0.72364
267,0.7068399999999999
268,0.61744
269,0.5553899999999999
270,0.5307
271,0.48449
272,0.41426999999999997
273,0.35512
274,0.32611999999999997
275,0.30371
276,0.21458000000000002
277,0.16475
278,0.10787000000000001
279,0.11506
280,0.03762
281,-0.077713
282,-0.11905999999999999
283,-0.090162
284,-0.08488
285,-0.12452
286,-0.13530999999999999
287,-0.12983
288,-0.14035
289,-0.16201
290,-0.18859
291,-0.17484
292,-0.19598
293,-0.20095
294,-0.2283
295,-0.24570999999999998
296,-0.24564
297,-0.25866999999999996
298,-0.25401
299,-0.26679
300,-0.27174
301,-0.27168000000000003
302,-0.27209
303,-0.24770999999999999
304,-0.23876
305,-0.22689
306,-0.20901
307,-0.19541
308,-0.17595999999999998
309,-0.15316
310,-0.12495999999999999
311,-0.10635
312,-0.07542599999999999
313,-0.024968
314,0.022133
315,0.041833999999999996
316,0.098503
317,0.16399999999999998
318,0.24356999999999998
319,0.28573000000000004
320,0.3314
321,0.38483
322,0.42754
323,0.49661000000000005
324,0.53374
325,0.58103
326,0.60313
327,0.66557
328,0.74843
329,0.78671
330,0.79335
331,0.76952
332,0.78908
333,0.8426799999999999
334,0.88476
335,0.91379
336,0.98036
337,1.0697
338,1.1674
339,1.1977
340,1.2244
341,1.2394
342,1.1964
343,1.1635
344,1.1475
345,1.12
346,1.1297
347,1.1283
348,1.1017
349,1.1374
350,1.1467
351,1.1739
352,1.2321
353,1.29
354,1.2991
355,1.3093
356,1.3722
357,1.4108
358,1.3953
359,1.3394
360,1.3742
361,1.354
362,1.3432
363,1.3215
364,1.2848
365,1.199
366,1.1116
367,1.1051
368,1.1227
369,1.1371
370,1.1434
371,1.1164
372,1.1033
373,1.1062
374,1.0797
375,1.025
376,0.9452200000000001
377,0.94476
378,0.96514
379,0.95745
380,0.89946
381,0.81658
382,0.8013899999999999
383,0.77381
384,0.79042
385,0.71662
386,0.62736
387,0.55935
388,0.44377
389,0.35134
390,0.24274
391,0.17475
392,0.07305199999999999
393,0.054126
394,0.07496599999999999
395,0.089621
396,0.1008
397,0.13663
398,0.1566
399,0.17874
400,0.20735
401,0.18087999999999999
402,0.19871
403,0.24381999999999998
404,0.24653000000000003
405,0.23296
406,0.26214
407,0.25742
408,0.19279000000000002
409,0.093194
410,0.023366
411,-0.009722100000000001
412,-0.019422
413,0.0022884
414,0.037418
415,0.089839
416,0.11621
417,0.16059
418,0.15365
419,0.14029
420,0.18093
421,0.22436
422,0.24861
423,0.21769000000000002
424,0.2468
425,0.25766999999999995
426,0.25655
