time,value
0,-0.18165
1,-0.18165
2,-0.18165
3,-0.18165
4,-0.18165
5,-0.18165
6,-0.18165
7,-0.18165
8,-0.18165
9,-0.18165
10,-0.18165
11,-0.18165
12,-0.18165
13,-0.18165
14,-0.18165
15,-0.18165
16,-0.18165
17,-0.18165
18,-0.18165
19,-0.18165
20,-0.18165
21,-0.18165
22,-0.18165
23,-0.18165
24,-0.18165
25,-0.18165
26,-0.18165
27,-0.18165
28,-0.18165
29,-0.18165
30,-0.18165
31,-0.18165
32,-0.18165
33,-0.18165
34,-0.18165
35,-0.18165
36,-0.18165
37,-0.18165
38,-0.18165
39,-0.18165
40,5.9399
41,0.10026
42,-0.18165
43,-0.18165
44,-0.18165
45,-0.18165
46,-0.18165
47,-0.18165
48,-0.18165
49,-0.18165
50,-0.18165
51,-0.18165
52,-0.18165
53,-0.18165
54,-0.18165
55,-0.18165
56,-0.18165
57,-0.18165
58,-0.18165
59,-0.18165
60,-0.18165
61,-0.18165
62,-0.18165
63,-0.18165
64,-0.18165
65,-0.18165
66,-0.18165
67,-0.18165
68,-0.18165
69,-0.18165
70,-0.18165
71,-0.18165
72,6.0607
73,-0.080966
74,4.4699
75,-0.14138
76,-0.18165
77,-0.18165
78,-0.18165
79,-0.18165
80,-0.18165
81,-0.18165
82,-0.18165
83,-0.18165
84,-0.18165
85,-0.18165
86,-0.18165
87,-0.18165
88,-0.18165
89,-0.18165
90,-0.18165
91,-0.18165
92,-0.18165
93,-0.18165
94,-0.18165
95,-0.18165
