time,value
0,1.6178
1,1.6074
2,1.5807
3,1.5512
4,1.5057
5,1.4634
6,1.3941
7,1.3032
8,1.2091
9,1.1121
10,1.0168
11,0.9217700000000001
12,0.82499
13,0.73235
14,0.63949
15,0.54172
16,0.45258000000000004
17,0.35685
18,0.26238
19,0.18914
20,0.097346
21,0.0071735
22,-0.081193
23,-0.14878
24,-0.23335999999999998
25,-0.31564000000000003
26,-0.40815999999999997
27,-0.48568999999999996
28,-0.56017
29,-0.64583
30,-0.71397
31,-0.79381
32,-0.8542299999999999
33,-0.9269
34,-0.9957299999999999
35,-1.0419
36,-1.101
37,-1.1549
38,-1.2029
39,-1.2166
40,-1.2525
41,-1.2815
42,-1.3030000000000002
43,-1.3167
44,-1.3226
45,-1.3204
46,-1.3103
47,-1.3053
48,-1.2879
49,-1.2547
50,-1.2146
51,-1.1854
52,-1.1349
53,-1.0766
54,-1.031
55,-0.96272
56,-0.89036
57,-0.8303200000000001
58,-0.75065
59,-0.6827
60,-0.61063
61,-0.5400699999999999
62,-0.46303
63,-0.38308000000000003
64,-0.30055
65,-0.21564
66,-0.12859
67,-0.039594
68,0.051199
69,0.14359
70,0.23747
71,0.32441
72,0.40560999999999997
73,0.49112
74,0.5903
75,0.68377
76,0.77867
77,0.87203
78,0.9671799999999999
79,1.0641
80,1.1626
81,1.2586
82,1.3556
83,1.4518
84,1.53
85,1.5867
86,1.6218
87,1.646
88,1.6618
89,1.6641
90,1.6472
91,1.6
92,1.5547
93,1.4768
94,1.3825
95,1.2888
96,1.1945
97,1.1027
98,1.0078
99,0.91435
100,0.81688
101,0.72596
102,0.62676
103,0.53632
104,0.43951999999999997
105,0.3439
106,0.24953000000000003
107,0.15658
108,0.06514400000000001
109,-0.024613
110,-0.11254000000000002
111,-0.19847
112,-0.28217
113,-0.37593000000000004
114,-0.45511999999999997
115,-0.53145
116,-0.61873
117,-0.68899
118,-0.77084
119,-0.84375
120,-0.90884
121,-0.9713700000000001
122,-1.0295
123,-1.0916
124,-1.1487
125,-1.2002
126,-1.2361
127,-1.2568
128,-1.2895
129,-1.3151
130,-1.3328
131,-1.3427
132,-1.3444
133,-1.338
134,-1.3237
135,-1.3014
136,-1.2927
137,-1.2554
138,-1.2127
139,-1.1909999999999998
140,-1.1356
141,-1.075
142,-1.0271
143,-0.9569
144,-0.89886
145,-0.8207399999999999
146,-0.75436
147,-0.66989
148,-0.5966600000000001
149,-0.5201399999999999
150,-0.42828999999999995
151,-0.36511
152,-0.28143
153,-0.19543
154,-0.11101
155,-0.037058
156,0.054346000000000005
157,0.14837999999999998
158,0.24175
159,0.32936
160,0.42668
161,0.5250600000000001
162,0.61952
163,0.7117
164,0.80833
165,0.90454
166,1.0031
167,1.1001
168,1.1986
169,1.2948
170,1.3838
171,1.4465
172,1.4907
173,1.5174
174,1.5666
175,1.5979
