time,value
0,0.5314399999999999
1,-1.4851
2,-0.47681999999999997
3,-0.27516999999999997
4,-1.4851
5,0.32979
6,-1.2834
7,-0.47681999999999997
8,0.5314399999999999
9,-1.8884
10,0.5314399999999999
11,-0.47681999999999997
12,-1.0818
13,1.338
14,-1.2834
15,-0.27516999999999997
16,0.5314399999999999
17,-1.8884
18,0.5314399999999999
19,0.12813
20,-0.88013
21,1.1364
22,-1.6867
23,-0.073519
24,0.7330899999999999
25,-1.2834
26,1.1364
27,-0.47681999999999997
28,-0.27516999999999997
29,0.7330899999999999
30,-0.88013
31,1.5397
32,0.32979
33,-0.073519
34,1.5397
35,-0.27516999999999997
36,-0.073519
37,0.32979
38,-1.0818
39,0.32979
40,-0.27516999999999997
41,-0.67848
42,0.7330899999999999
43,-0.88013
44,0.32979
45,0.5314399999999999
46,-1.4851
47,1.1364
48,-0.073519
49,-1.0818
50,1.5397
51,-0.67848
52,-0.27516999999999997
53,1.5397
54,-1.4851
55,0.5314399999999999
56,0.5314399999999999
57,-1.4851
58,1.943
59,-0.073519
60,-0.67848
61,1.5397
62,-0.88013
63,0.32979
64,1.1364
65,-1.2834
66,1.5397
67,-0.073519
68,-1.0818
69,1.7414
70,-0.67848
71,-0.47681999999999997
72,1.338
73,0.12813
74,1.338
75,1.338
76,-0.88013
77,1.1364
78,0.12813
79,-0.47681999999999997
80,1.5397
81,-0.67848
82,0.32979
83,1.338
84,-1.0818
85,1.5397
86,1.1364
87,-0.47681999999999997
88,0.93474
89,-0.27516999999999997
90,-0.88013
91,0.7330899999999999
92,-1.0818
93,-0.47681999999999997
94,0.5314399999999999
95,-1.4851
