time,value
0,-0.18267
1,-0.18267
2,-0.18267
3,-0.18267
4,-0.18267
5,-0.18267
6,-0.18267
7,-0.18267
8,-0.18267
9,-0.18267
10,-0.18267
11,-0.18267
12,-0.18267
13,-0.18267
14,-0.18267
15,-0.18267
16,-0.18267
17,-0.18267
18,-0.18267
19,-0.18267
20,-0.18267
21,-0.18267
22,-0.18267
23,-0.18267
24,-0.18267
25,-0.18267
26,-0.18267
27,-0.18267
28,-0.18267
29,-0.18267
30,-0.18267
31,6.4253
32,-0.18267
33,2.4436
34,-0.18267
35,-0.18267
36,-0.18267
37,-0.18267
38,-0.18267
39,-0.18267
40,-0.18267
41,-0.18267
42,-0.18267
43,-0.18267
44,-0.18267
45,-0.18267
46,-0.18267
47,-0.18267
48,-0.18267
49,-0.18267
50,-0.18267
51,-0.18267
52,-0.18267
53,-0.18267
54,-0.18267
55,-0.18267
56,-0.18267
57,-0.18267
58,-0.18267
59,-0.18267
60,-0.18267
61,-0.18267
62,-0.18267
63,-0.18267
64,-0.18267
65,-0.18267
66,-0.18267
67,-0.18267
68,-0.18267
69,6.6794
70,-0.18267
71,-0.18267
72,-0.18267
73,-0.18267
74,-0.18267
75,0.07148
76,0.1562
77,0.32563000000000003
78,0.1562
79,-0.18267
80,-0.18267
81,-0.18267
82,-0.18267
83,-0.18267
84,-0.18267
85,-0.18267
86,-0.18267
87,-0.18267
88,-0.18267
89,-0.18267
90,-0.18267
91,-0.18267
92,-0.18267
93,-0.18267
94,-0.18267
95,-0.18267
