time,value
0,0.7542800000000001
1,0.024332
2,-0.8516100000000001
3,1.0463
4,-0.26765
5,-0.8516100000000001
6,1.3382
7,-0.5596300000000001
8,-0.8516100000000001
9,1.4842
10,-0.8516100000000001
11,-0.8516100000000001
12,1.4842
13,-0.8516100000000001
14,-0.8516100000000001
15,1.6302
16,-0.8516100000000001
17,-0.8516100000000001
18,1.6302
19,-0.8516100000000001
20,-0.8516100000000001
21,1.6302
22,-0.8516100000000001
23,-0.8516100000000001
24,1.6302
25,-0.8516100000000001
26,-0.8516100000000001
27,1.4842
28,-0.8516100000000001
29,-0.8516100000000001
30,1.6302
31,-0.8516100000000001
32,-0.8516100000000001
33,1.6302
34,-0.8516100000000001
35,-0.8516100000000001
36,1.6302
37,-0.8516100000000001
38,-0.8516100000000001
39,1.6302
40,-0.8516100000000001
41,-0.12165999999999999
42,0.9002700000000001
43,-0.8516100000000001
44,0.024332
45,0.7542800000000001
46,-0.8516100000000001
47,-0.12165999999999999
48,0.9002700000000001
49,-0.8516100000000001
50,-0.26765
51,1.0463
52,-0.8516100000000001
53,-0.5596300000000001
54,1.4842
55,-0.8516100000000001
56,-0.8516100000000001
57,1.6302
58,-0.8516100000000001
59,-0.8516100000000001
60,1.7762
61,-0.8516100000000001
62,-0.8516100000000001
63,1.4842
64,-0.5596300000000001
65,-0.8516100000000001
66,0.9002700000000001
67,-0.12165999999999999
68,-0.8516100000000001
69,0.7542800000000001
70,0.17032
71,-0.8516100000000001
72,0.31631
73,0.4623
74,-0.8516100000000001
75,-0.12165999999999999
76,1.0463
77,-0.8516100000000001
78,-0.8516100000000001
79,1.7762
80,-0.8516100000000001
81,-0.12165999999999999
82,1.0463
83,-0.8516100000000001
84,1.0463
85,-0.12165999999999999
86,-0.8516100000000001
87,1.7762
88,-0.8516100000000001
89,-0.8516100000000001
90,1.6302
91,-0.8516100000000001
92,0.024332
93,0.7542800000000001
94,-0.8516100000000001
95,0.60829
