time,value
0,1.7001
1,1.7148
2,1.6859
3,1.6045
4,1.5186
5,1.4316
6,1.3523
7,1.2727
8,1.1865
9,1.1074
10,1.0221
11,0.93584
12,0.85078
13,0.76542
14,0.68728
15,0.60139
16,0.51608
17,0.43117
18,0.34685
19,0.26195999999999997
20,0.17934
21,0.1009
22,0.023571
23,-0.060329999999999995
24,-0.13699999999999998
25,-0.21721999999999997
26,-0.29486999999999997
27,-0.3692
28,-0.45053999999999994
29,-0.5311
30,-0.61229
31,-0.6893600000000001
32,-0.76965
33,-0.8457
34,-0.9224700000000001
35,-0.99567
36,-1.0653
37,-1.136
38,-1.1986
39,-1.2612
40,-1.3127
41,-1.3624
42,-1.4034
43,-1.4338
44,-1.4518
45,-1.4563
46,-1.4469
47,-1.4244
48,-1.3963
49,-1.3542
50,-1.3042
51,-1.2495
52,-1.189
53,-1.1238
54,-1.0549
55,-0.97967
56,-0.9088200000000001
57,-0.83291
58,-0.75526
59,-0.6763100000000001
60,-0.59815
61,-0.5242600000000001
62,-0.44292
63,-0.3619
64,-0.28564
65,-0.20351
66,-0.11979000000000001
67,-0.043599
68,0.039867
69,0.12410999999999998
70,0.20918
71,0.29373
72,0.3786
73,0.46413000000000004
74,0.54916
75,0.63555
76,0.72063
77,0.8
78,0.8860399999999999
79,0.97219
80,1.0516
81,1.1378
82,1.2244
83,1.3113
84,1.3915
85,1.4786
86,1.5657
87,1.6525
88,1.7338
89,1.7503
90,1.7003
91,1.6154
92,1.5294
93,1.4432
94,1.3563
95,1.2702
96,1.1838
97,1.0983
98,1.0189
99,0.93324
100,0.85475
101,0.77646
102,0.69042
103,0.61252
104,0.52681
105,0.44241
106,0.3571
107,0.27309
108,0.18850999999999998
109,0.10399000000000001
110,0.019759
111,-0.06299600000000001
112,-0.14764000000000002
113,-0.22368000000000002
114,-0.30365
115,-0.38177
116,-0.46318000000000004
117,-0.54382
118,-0.62355
119,-0.70222
120,-0.77962
121,-0.85867
122,-0.93295
123,-1.005
124,-1.0783
125,-1.1446
126,-1.2114
127,-1.2739
128,-1.325
129,-1.3741
130,-1.4143
131,-1.4436
132,-1.4602
133,-1.4629
134,-1.4517
135,-1.4292
136,-1.4008
137,-1.3552
138,-1.307
139,-1.2516
140,-1.186
141,-1.1206
142,-1.0516
143,-0.9797399999999999
144,-0.90549
145,-0.82935
146,-0.75165
147,-0.67266
148,-0.5939399999999999
149,-0.5138
150,-0.43196
151,-0.35131
152,-0.2689
153,-0.19246
154,-0.10895
155,-0.025921
156,0.058888
157,0.14274
158,0.22000999999999998
159,0.30563
160,0.39043
161,0.47553
162,0.56088
163,0.64646
164,0.73225
165,0.8112
166,0.89007
167,0.97608
168,1.0555
169,1.1417
170,1.2215
171,1.305
172,1.3881
173,1.4681
174,1.5551
175,1.6418
