time,value
0,-0.21661
1,-0.21661
2,-0.21661
3,-0.21661
4,-0.21661
5,-0.21661
6,-0.21661
7,-0.21661
8,-0.21661
9,-0.21661
10,-0.21661
11,-0.21661
12,-0.21661
13,-0.21661
14,-0.21661
15,-0.21661
16,-0.21661
17,-0.21661
18,-0.21661
19,-0.21661
20,-0.21661
21,-0.21661
22,-0.21661
23,-0.21661
24,-0.21661
25,-0.21661
26,-0.21661
27,-0.21661
28,-0.21661
29,-0.21661
30,-0.21661
31,-0.21661
32,-0.21661
33,-0.21661
34,-0.21661
35,-0.21661
36,-0.21661
37,-0.21661
38,-0.21661
39,-0.21661
40,-0.21661
41,-0.21661
42,-0.21661
43,-0.21661
44,-0.21661
45,-0.21661
46,-0.21661
47,-0.21661
48,-0.21661
49,-0.21661
50,-0.21661
51,-0.028502
52,4.1099
53,3.9731
54,0.091205
55,0.074104
56,0.074104
57,5.7003
58,5.0676
59,-0.21661
60,-0.21661
61,-0.21661
62,-0.21661
63,-0.21661
64,-0.21661
65,-0.21661
66,-0.21661
67,-0.21661
68,-0.21661
69,-0.21661
70,-0.21661
71,-0.21661
72,-0.21661
73,-0.21661
74,-0.21661
75,-0.21661
76,-0.21661
77,-0.21661
78,-0.21661
79,-0.21661
80,-0.21661
81,-0.21661
82,-0.21661
83,-0.21661
84,-0.21661
85,-0.21661
86,-0.21661
87,-0.21661
88,-0.21661
89,-0.21661
90,-0.21661
91,-0.21661
92,-0.21661
93,-0.21661
94,-0.21661
95,-0.21661
