time,value
0,-2.3814
1,-2.3814
2,-2.3814
3,-2.3814
4,-2.3814
5,-2.3833
6,-2.3832
7,-2.3831
8,-2.3827
9,-2.3822
10,-2.3816
11,-2.3808
12,-2.3801
13,-2.379
14,-2.3778
15,-2.3764
16,-2.3749
17,-2.3736
18,-2.3719
19,-2.3699
20,-2.3679
21,-2.3661
22,-2.3638
23,-2.3614
24,-2.3588
25,-2.3561
26,-2.352
27,-2.349
28,-2.3459
29,-2.3427
30,-2.3419
31,-2.3384
32,-2.3348
33,-2.3312
34,-2.3274
35,-2.3242
36,-2.3202
37,-2.3161
38,-2.3118
39,-2.3075
40,-2.3039
41,-2.2994
42,-2.2948
43,-2.2884
44,-2.2845
45,-2.2796
46,-2.2746
47,-2.2695
48,-2.2659
49,-2.2617
50,-2.2564
51,-2.2509
52,-2.2454
53,-2.2398
54,-2.2353
55,-2.2295
56,-2.2237
57,-2.2178
58,-2.213
59,-2.207
60,-2.1994
61,-2.1933
62,-2.1871
63,-2.1835
64,-2.1771
65,-2.1693
66,-2.1628
67,-2.1576
68,-2.151
69,-2.1444
70,-2.1377
71,-2.131
72,-2.1256
73,-2.1187
74,-2.1146
75,-2.1119
76,-2.1049
77,-2.1021
78,-2.0967
79,-2.0871
80,-2.08
81,-2.0744
82,-2.0672
83,-2.0633
84,-2.0565
85,-2.0493
86,-2.0436
87,-2.0363
88,-2.029
89,-2.0217
90,-2.0146
91,-2.0072
92,-1.9998
93,-1.9924
94,-1.9849
95,-1.9789
96,-1.9715
97,-1.9647
98,-1.9572
99,-1.9496
100,-1.9435
101,-1.9359
102,-1.9272
103,-1.9195
104,-1.9134
105,-1.9065
106,-1.8993
107,-1.8916
108,-1.8839
109,-1.8766
110,-1.8689
111,-1.8611
112,-1.8533
113,-1.8469
114,-1.841
115,-1.8332
116,-1.8253
117,-1.8164
118,-1.8101
119,-1.8022
120,-1.7943
121,-1.7890000000000001
122,-1.7821
123,-1.7758
124,-1.7679
125,-1.76
126,-1.751
127,-1.7446
128,-1.7366
129,-1.7286
130,-1.7205
131,-1.7122
132,-1.7053
133,-1.6963
134,-1.6882
135,-1.6834
136,-1.6781
137,-1.6707
138,-1.6638
139,-1.6596
140,-1.6521
141,-1.6505
142,-1.6440000000000001
143,-1.6359
144,-1.6278
145,-1.6196
146,-1.6121
147,-1.6039
148,-1.5957
149,-1.5875
150,-1.5813
151,-1.5758
152,-1.5676
153,-1.5594
154,-1.5502
155,-1.5436
156,-1.5354
157,-1.5271
158,-1.5191
159,-1.5106
160,-1.5039
161,-1.4957
162,-1.4864
163,-1.4781
164,-1.4715
165,-1.4639
166,-1.4559
167,-1.4483
168,-1.44
169,-1.4334
170,-1.425
171,-1.4157
172,-1.4074
173,-1.399
174,-1.3923
175,-1.3844
176,-1.3759
177,-1.3675
178,-1.3608
179,-1.3524
180,-1.344
181,-1.3346
182,-1.3262
183,-1.3194
184,-1.311
185,-1.3025
186,-1.294
187,-1.2872
188,-1.2787
189,-1.2702
190,-1.2617
191,-1.2532
192,-1.2463
193,-1.2446
194,-1.2361
195,-1.2275
196,-1.2181
197,-1.213
198,-1.2071
199,-1.1985
200,-1.1899
201,-1.1882
202,-1.1822
203,-1.1736
204,-1.165
205,-1.1564
206,-1.1495
207,-1.1409
208,-1.1323
209,-1.1236
210,-1.1159
211,-1.1073
212,-1.0986
213,-1.0899
214,-1.0812
215,-1.0743
216,-1.0656
217,-1.0569
218,-1.0482
219,-1.0395
220,-1.0325
221,-1.0237
222,-1.015
223,-1.0063
224,-0.99925
225,-0.99049
226,-0.9817299999999999
227,-0.9782200000000001
228,-0.96972
229,-0.96196
230,-0.95521
231,-0.9492
232,-0.94495
233,-0.9414399999999999
234,-0.93442
235,-0.92563
236,-0.91684
237,-0.90805
238,-0.90028
239,-0.8914700000000001
240,-0.88266
241,-0.87384
242,-0.86846
243,-0.86349
244,-0.8546799999999999
245,-0.84515
246,-0.8363299999999999
247,-0.8292700000000001
248,-0.8235899999999999
249,-0.8154
250,-0.8065899999999999
251,-0.79778
252,-0.79
253,-0.78117
254,-0.7723399999999999
255,-0.7635
256,-0.75889
257,-0.75321
258,-0.74438
259,-0.73483
260,-0.726
261,-0.7189300000000001
262,-0.71326
263,-0.70511
264,-0.69627
265,-0.6874399999999999
266,-0.6803600000000001
267,-0.67152
268,-0.66196
269,-0.6531100000000001
270,-0.6460199999999999
271,-0.63715
272,-0.6282800000000001
273,-0.62088
274,-0.61631
275,-0.60922
276,-0.60036
277,-0.59149
278,-0.5826100000000001
279,-0.5737300000000001
280,-0.57196
281,-0.56663
282,-0.56307
283,-0.55842
284,-0.55198
285,-0.54376
286,-0.5335
287,-0.5292600000000001
288,-0.5257
289,-0.52035
290,-0.51857
291,-0.51144
292,-0.50185
293,-0.49293000000000003
294,-0.48736
295,-0.48288000000000003
296,-0.47397
297,-0.46506000000000003
298,-0.45725
299,-0.44833
300,-0.44164
301,-0.43472
302,-0.42581
303,-0.41801000000000005
304,-0.40909
305,-0.40016
306,-0.39281
307,-0.38834
308,-0.37876
309,-0.37139
310,-0.3669
311,-0.358
312,-0.3502
313,-0.34129
314,-0.33613000000000004
315,-0.32943
316,-0.31985
317,-0.31273
318,-0.30357
319,-0.29729
320,-0.28839000000000004
321,-0.28126999999999996
322,-0.27169
323,-0.26279
324,-0.2572
325,-0.24914
326,-0.24201999999999999
327,-0.23244
328,-0.22464
329,-0.21946
330,-0.21276
331,-0.20496
332,-0.19975
333,-0.19196
334,-0.18239
335,-0.17528
336,-0.16965999999999998
337,-0.16335
338,-0.15378
339,-0.14747000000000002
340,-0.14182999999999998
341,-0.13227
342,-0.127
343,-0.11852
344,-0.1125
345,-0.10720999999999999
346,-0.09801900000000001
347,-0.091298
348,-0.08492100000000001
349,-0.076429
350,-0.068275
351,-0.062595
352,-0.053054
353,-0.044223
354,-0.03821
355,-0.032864
356,-0.025087
357,-0.015543000000000001
358,-0.008482700000000001
359,-0.0028006999999999997
360,0.0053673
361,0.014188
362,0.023731
363,0.029742
364,0.035104
365,0.042879
366,0.051698
367,0.058757000000000004
368,0.067584
369,0.077129
370,0.085964
371,0.09269
372,0.097316
373,0.10686
374,0.11569000000000002
375,0.12524000000000002
376,0.13407
377,0.14009000000000002
378,0.14542
379,0.1532
380,0.16274
381,0.16981
382,0.17725
383,0.18188
384,0.19071
385,0.20025
386,0.20731999999999998
387,0.21616
388,0.22359
389,0.23174
390,0.23881
391,0.24836
392,0.25614000000000003
393,0.26147
394,0.27173
395,0.2767
396,0.28206
397,0.2916
398,0.29729
399,0.30371
400,0.31148000000000003
401,0.31719
402,0.32361999999999996
403,0.33242
404,0.33946
405,0.349
406,0.35781
407,0.36527
408,0.37346
409,0.3805
410,0.39004
411,0.39781
412,0.4032
413,0.41346000000000005
414,0.41844
415,0.42562
416,0.43441
417,0.44321000000000005
418,0.45025
419,0.45906
420,0.46786000000000005
421,0.4774
422,0.48549
423,0.49255
424,0.50137
425,0.5109100000000001
426,0.51974
427,0.5268
428,0.53564
429,0.54448
430,0.55191
431,0.5583
432,0.5653600000000001
433,0.5742
434,0.58375
435,0.59259
436,0.59931
437,0.60392
438,0.61347
439,0.62302
440,0.6318600000000001
441,0.63647
442,0.6421399999999999
443,0.65098
444,0.66052
445,0.6665399999999999
446,0.6711600000000001
447,0.67965
448,0.6871
449,0.69421
450,0.70127
451,0.7101
452,0.71892
453,0.7277600000000001
454,0.73659
455,0.74366
456,0.7525
457,0.76135
458,0.7702
459,0.77905
460,0.7762399999999999
461,0.77275
462,0.76928
463,0.76584
464,0.7630899999999999
465,0.75968
466,0.75629
467,0.75293
468,0.74556
469,0.73843
470,0.7288399999999999
471,0.72215
472,0.71702
473,0.70743
474,0.70253
475,0.6974199999999999
476,0.6884899999999999
477,0.6789
478,0.67176
479,0.66486
480,0.65818
481,0.64925
482,0.64032
483,0.63251
484,0.62359
485,0.61736
486,0.61179
487,0.60465
488,0.59505
489,0.58791
490,0.58281
491,0.57434
492,0.56766
493,0.56258
494,0.55411
495,0.54743
496,0.54238
497,0.53522
498,0.52561
499,0.51667
500,0.51161
501,0.5072300000000001
502,0.5040100000000001
503,0.49555
504,0.48888000000000004
505,0.48389
506,0.48136
507,0.47703
508,0.46803999999999996
509,0.45906
510,0.45124
511,0.44225
512,0.43327
513,0.42428999999999994
514,0.41816000000000003
515,0.41266
516,0.40304
517,0.39809
518,0.38964
519,0.38236
520,0.37806
521,0.36961
522,0.36421
523,0.36061
524,0.35341
525,0.34621
526,0.34379
527,0.33416
528,0.32454
529,0.31735
530,0.30835999999999997
531,0.30233000000000004
532,0.29505
533,0.28606
534,0.27824
535,0.27158000000000004
536,0.26484
537,0.25585
538,0.24802
539,0.23903000000000002
540,0.2359
541,0.23098000000000002
542,0.22671
543,0.22068000000000002
544,0.21166999999999997
545,0.20204
546,0.19597
547,0.19233
548,0.18269000000000002
549,0.17664000000000002
550,0.1712
551,0.16155999999999998
552,0.15914
553,0.15432
554,0.15134
555,0.14290999999999998
556,0.1357
557,0.13153
558,0.12188
559,0.1165
560,0.11177000000000001
561,0.10945999999999999
562,0.1041
563,0.095016
564,0.085358
565,0.07876
566,0.074651
567,0.06442200000000001
568,0.056692
569,0.051355
570,0.044077
571,0.034416
572,0.026006
573,0.019551
574,0.010448
575,0.0026043000000000004
576,-0.0064967
577,-0.011125
578,-0.019528999999999998
579,-0.027222000000000003
580,-0.031256
581,-0.040927
582,-0.050043000000000004
583,-0.059713
584,-0.063742
585,-0.070313
586,-0.079984
587,-0.089107
588,-0.095678
589,-0.097865
590,-0.10754000000000001
591,-0.11721
592,-0.12634
593,-0.13034
594,-0.13379000000000002
595,-0.14293
596,-0.1526
597,-0.16045
598,-0.16261
599,-0.16712
600,-0.16976
601,-0.17890999999999999
602,-0.18494000000000002
603,-0.18912
604,-0.19933
605,-0.20588
606,-0.2119
607,-0.21608000000000002
608,-0.21975
609,-0.2289
610,-0.23859
611,-0.24695999999999999
612,-0.25089
613,-0.26058000000000003
614,-0.27026
615,-0.27994
616,-0.28438
617,-0.29275
618,-0.29928
619,-0.30367
620,-0.31285
621,-0.32019000000000003
622,-0.32988
623,-0.33906
624,-0.34742
625,-0.35181
626,-0.35915
627,-0.36618
628,-0.37004000000000004
629,-0.38023
630,-0.38724000000000003
631,-0.3929
632,-0.4021
633,-0.4118
634,-0.41831
635,-0.42027
636,-0.42454
637,-0.4283
638,-0.43799999999999994
639,-0.44173999999999997
640,-0.44547
641,-0.44778999999999997
642,-0.45426000000000005
643,-0.46211
644,-0.46211
645,-0.46303
646,-0.46438999999999997
647,-0.46618999999999994
648,-0.4684
649,-0.47015
650,-0.46816
651,-0.45931000000000005
652,-0.46141000000000004
653,-0.46163000000000004
654,-0.46326000000000006
655,-0.45582
656,-0.44691000000000003
657,-0.4376
658,-0.43546
659,-0.4329
660,-0.42358
661,-0.41425
662,-0.40531
663,-0.39784
664,-0.38850999999999997
665,-0.37917
666,-0.37881
667,-0.37321
668,-0.36386999999999997
669,-0.35452
670,-0.34518000000000004
671,-0.33957
672,-0.33659
673,-0.32874000000000003
674,-0.3194
675,-0.31006
676,-0.30071
677,-0.29324
678,-0.28389000000000003
679,-0.27454
680,-0.26519000000000004
681,-0.2603
682,-0.26022
683,-0.25085999999999997
684,-0.24185
685,-0.23248000000000002
686,-0.23248000000000002
687,-0.22685999999999998
688,-0.22124000000000002
689,-0.21971999999999997
690,-0.21256999999999998
691,-0.20354
692,-0.19383
693,-0.18752
694,-0.18564
695,-0.17815
696,-0.17627
697,-0.16877999999999999
698,-0.15905999999999998
699,-0.14969000000000002
700,-0.14526
701,-0.13979
702,-0.13042
703,-0.1207
704,-0.11320999999999999
705,-0.10959
706,-0.10327
707,-0.09391000000000001
708,-0.08419700000000001
709,-0.07670700000000001
710,-0.067343
711,-0.061833000000000006
712,-0.05363300000000001
713,-0.044275999999999996
714,-0.036432
715,-0.031256
716,-0.022686
717,-0.013335
718,-0.0058527
719,0.0035013000000000006
720,0.013216
721,0.022571
722,0.031925999999999996
723,0.039411
724,0.045743
725,0.049058
726,0.058772000000000005
727,0.06625199999999999
728,0.07596699999999999
729,0.08532000000000001
730,0.093526
731,0.097224
732,0.1047
733,0.11405
734,0.12377
735,0.13310999999999998
736,0.14246
737,0.14994000000000002
738,0.15665
739,0.16186
740,0.17157999999999998
741,0.17905
742,0.18877
743,0.19435999999999998
744,0.20034000000000002
745,0.20968
746,0.21715
747,0.22687
748,0.23621
749,0.23995
750,0.24444000000000002
751,0.25378
752,0.26311999999999997
753,0.27246
754,0.2818
755,0.28926999999999997
756,0.29898
757,0.30833
758,0.31767
759,0.32700999999999997
760,0.33037
761,0.33897
762,0.34831
763,0.35765
764,0.36549
765,0.37483
766,0.38418
767,0.39165
768,0.39539
769,0.39988
770,0.40922
771,0.41855
772,0.42788999999999994
773,0.43723
774,0.44471000000000005
775,0.45405
776,0.46338999999999997
777,0.47273000000000004
778,0.48021
779,0.48768999999999996
780,0.49143000000000003
781,0.4989
782,0.5007699999999999
783,0.50862
784,0.5153300000000001
785,0.52056
786,0.5299
787,0.53737
788,0.54672
789,0.55606
790,0.5657800000000001
791,0.57512
792,0.5826
793,0.59195
794,0.60129
795,0.61064
796,0.6199899999999999
797,0.62747
798,0.63683
799,0.6390600000000001
800,0.6469
801,0.6551100000000001
802,0.65922
803,0.66556
804,0.6693
805,0.67491
806,0.6823899999999999
807,0.6917399999999999
808,0.70145
809,0.7108
810,0.71828
811,0.72764
812,0.73246
813,0.7358
814,0.74515
815,0.75262
816,0.76234
817,0.77169
818,0.7784
819,0.7854800000000001
820,0.79295
821,0.8023
822,0.81165
823,0.821
824,0.82847
825,0.83819
826,0.84754
827,0.8550200000000001
828,0.85762
829,0.8632299999999999
830,0.8725799999999999
831,0.8819299999999999
832,0.88754
833,0.89092
834,0.89804
835,0.9055200000000001
836,0.9055200000000001
837,0.9148700000000001
838,0.9148700000000001
839,0.9152299999999999
840,0.9189200000000001
841,0.92863
842,0.93835
843,0.94583
844,0.95029
845,0.9540299999999999
846,0.96339
847,0.9708700000000001
848,0.9802200000000001
849,0.98209
850,0.9877
851,0.99705
852,1.0045
853,1.0139
854,1.0232
855,1.0262
856,1.0325
857,1.0404
858,1.0422
859,1.046
860,1.0553
861,1.0591
862,1.0632
863,1.0729
864,1.0826
865,1.0916
866,1.0987
867,1.1021
868,1.1096
869,1.119
870,1.119
871,1.1231
872,1.1328
873,1.1421
874,1.1515
875,1.159
876,1.1634
877,1.1683
878,1.1776
879,1.1873
880,1.1948
881,1.2042
882,1.209
883,1.216
884,1.2235
885,1.2329
886,1.2422
887,1.2519
888,1.2613
889,1.2688
890,1.274
891,1.2806
892,1.29
893,1.2994
894,1.3068
895,1.3162
896,1.3256
897,1.3349
898,1.3372
899,1.3418
900,1.3486
901,1.3487
902,1.347
903,1.3475
904,1.3566
905,1.3571
906,1.3555
907,1.3542
908,1.3526
909,1.351
910,1.3494
911,1.3479
912,1.34
913,1.3335
914,1.3285
915,1.3188
916,1.3138
917,1.3092
918,1.2994
919,1.2961
920,1.2861
921,1.2786
922,1.2691
923,1.2594
924,1.2516
925,1.2483
926,1.2423
927,1.2329
928,1.2235
929,1.2138
930,1.2063
931,1.1969
932,1.1887
933,1.1835
934,1.1741
935,1.1663
936,1.1566
937,1.1514
938,1.1436
939,1.1339
940,1.1264
941,1.1215
942,1.1169
943,1.1072
944,1.1061
945,1.0996
946,1.0902
947,1.0805
948,1.074
949,1.0694
950,1.0597
951,1.05
952,1.0425
953,1.0395
954,1.0331
955,1.0237
956,1.014
957,1.0045
958,0.99698
959,0.9919100000000001
960,0.98385
961,0.97415
962,0.9647100000000001
963,0.96206
964,0.9572700000000001
965,0.94783
966,0.93839
967,0.93058
968,0.92114
969,0.9149700000000001
970,0.91185
971,0.9024
972,0.89484
973,0.88515
974,0.8757
975,0.8679
976,0.86479
977,0.85888
978,0.84919
979,0.8397399999999999
980,0.83029
981,0.82273
982,0.81775
983,0.80782
984,0.79837
985,0.78892
986,0.78136
987,0.7719
988,0.76245
989,0.75276
990,0.7452
991,0.73575
992,0.72795
993,0.72487
994,0.71708
995,0.7095100000000001
996,0.69982
997,0.6903699999999999
998,0.68092
999,0.67786
1000,0.67172
1001,0.66227
1002,0.65281
1003,0.64312
1004,0.63556
1005,0.6261
1006,0.61808
1007,0.61338
1008,0.6037
1009,0.5959
1010,0.58644
1011,0.58532
1012,0.58234
1013,0.58148
1014,0.5737
1015,0.56423
1016,0.55455
1017,0.54508
1018,0.5373
1019,0.5343600000000001
1020,0.52658
1021,0.5169
1022,0.50743
1023,0.50303
1024,0.50033
1025,0.49065
1026,0.48588000000000003
1027,0.47981
1028,0.47033
1029,0.46086000000000005
1030,0.45118
1031,0.44171000000000005
1032,0.43413
1033,0.42635
1034,0.4235
1035,0.41365
1036,0.40721999999999997
1037,0.40289
1038,0.3934
1039,0.38392
1040,0.37426
1041,0.36667
1042,0.36044
1043,0.35595
1044,0.34646
1045,0.3368
1046,0.33094
1047,0.32819
1048,0.31853000000000004
1049,0.30904
1050,0.30129
1051,0.2918
1052,0.28404
1053,0.28131999999999996
1054,0.27357
1055,0.26598
1056,0.25648000000000004
1057,0.24699000000000002
1058,0.2375
1059,0.22801
1060,0.22041
1061,0.21091999999999997
1062,0.20143
1063,0.19178
1064,0.18417999999999998
1065,0.17469
1066,0.1652
1067,0.16092
1068,0.15459
1069,0.14699
1070,0.1375
1071,0.12800999999999998
1072,0.11835
1073,0.11076
1074,0.10127
1075,0.097468
1076,0.09145700000000001
1077,0.081807
1078,0.07770099999999999
1079,0.069951
1080,0.066001
1081,0.060303999999999996
1082,0.050807
1083,0.043210000000000005
1084,0.033714999999999995
1085,0.024221
1086,0.014725
1087,0.0069753
1088,-0.0025186999999999996
1089,-0.012015000000000001
1090,-0.021511000000000002
1091,-0.031004000000000004
1092,-0.038600999999999996
1093,-0.041262
1094,-0.049158
1095,-0.058655
1096,-0.06815299999999999
1097,-0.075749
1098,-0.085395
1099,-0.09489299999999999
1100,-0.10439000000000001
1101,-0.11199
1102,-0.12147999999999999
1103,-0.13097999999999999
1104,-0.14048
1105,-0.14997
1106,-0.15757000000000002
1107,-0.16182
1108,-0.1681
1109,-0.1776
1110,-0.1852
1111,-0.19484
1112,-0.20434000000000002
1113,-0.20856999999999998
1114,-0.21101999999999999
1115,-0.21115
1116,-0.21509
1117,-0.22485
1118,-0.22878
1119,-0.23284000000000002
1120,-0.24056999999999998
1121,-0.2407
1122,-0.24081999999999998
1123,-0.24333000000000002
1124,-0.24378000000000002
1125,-0.24431999999999998
1126,-0.24443
1127,-0.24473000000000003
1128,-0.24301999999999999
1129,-0.24311999999999998
1130,-0.23551
1131,-0.23008
1132,-0.22663000000000003
1133,-0.2191
1134,-0.21561999999999998
1135,-0.21204
1136,-0.20252
1137,-0.19308
1138,-0.18545999999999999
1139,-0.18391
1140,-0.17642
1141,-0.16696
1142,-0.15744
1143,-0.15571
1144,-0.15022
1145,-0.1407
1146,-0.13118
1147,-0.12355999999999999
1148,-0.11409000000000001
1149,-0.10455999999999999
1150,-0.09504299999999999
1151,-0.085521
1152,-0.077902
1153,-0.068379
1154,-0.05885700000000001
1155,-0.049333
1156,-0.039810000000000005
1157,-0.032191000000000004
1158,-0.022668999999999998
1159,-0.017096
1160,-0.015364
1161,-0.0077447
1162,0.0017793
1163,0.011303
1164,0.020788
1165,0.030312000000000002
1166,0.037933
1167,0.047455000000000004
1168,0.056942999999999994
1169,0.058849
1170,0.064563
1171,0.074087
1172,0.083611
1173,0.08544600000000001
1174,0.091125
1175,0.09877899999999999
1176,0.10834
1177,0.11794
1178,0.11984000000000002
1179,0.12746
1180,0.13127
1181,0.13699
1182,0.14651
1183,0.15603
1184,0.16366
1185,0.17318
1186,0.1827
1187,0.19222999999999998
1188,0.20175
1189,0.20936999999999997
1190,0.2189
1191,0.22841999999999998
1192,0.23794
1193,0.24556999999999998
1194,0.25509
1195,0.26461
1196,0.27414
1197,0.28365999999999997
1198,0.29128000000000004
1199,0.30080999999999997
1200,0.31033
1201,0.31986
1202,0.32938
1203,0.337
1204,0.34652
1205,0.35605
1206,0.36557
1207,0.37319
1208,0.38272
1209,0.39224000000000003
1210,0.40176999999999996
1211,0.41129
1212,0.41891000000000006
1213,0.42844
1214,0.43796
1215,0.44748999999999994
1216,0.4532
1217,0.45511
1218,0.46273000000000003
1219,0.46653999999999995
1220,0.47028000000000003
1221,0.47786999999999996
1222,0.48733000000000004
1223,0.49686
1224,0.49882
1225,0.50457
1226,0.5121899999999999
1227,0.52165
1228,0.52541
1229,0.5272899999999999
1230,0.53491
1231,0.54443
1232,0.5463399999999999
1233,0.55396
1234,0.56348
1235,0.5711
1236,0.58063
1237,0.59015
1238,0.59968
1239,0.60158
1240,0.60542
1241,0.61497
1242,0.62075
1243,0.62268
1244,0.62839
1245,0.6341100000000001
1246,0.6359600000000001
1247,0.6454300000000001
1248,0.65112
1249,0.6530199999999999
1250,0.66064
1251,0.6701699999999999
1252,0.67969
1253,0.6873100000000001
1254,0.69684
1255,0.70634
1256,0.71587
1257,0.72539
1258,0.73301
1259,0.74254
1260,0.7520600000000001
1261,0.76159
1262,0.7711100000000001
1263,0.77873
1264,0.7882600000000001
1265,0.79778
1266,0.8034600000000001
1267,0.80528
1268,0.81479
1269,0.82432
1270,0.8338399999999999
1271,0.8433700000000001
1272,0.85098
1273,0.8605
1274,0.8700399999999999
1275,0.87955
1276,0.88908
1277,0.8967200000000001
1278,0.90623
1279,0.91575
1280,0.92529
1281,0.93291
1282,0.94242
1283,0.95195
1284,0.9614799999999999
1285,0.971
1286,0.97862
1287,0.98815
1288,0.9976700000000001
1289,1.0072
1290,1.0148
1291,1.0186
1292,1.0224
1293,1.0319
1294,1.0414
1295,1.0490000000000002
1296,1.0586
1297,1.0681
1298,1.0776
1299,1.0871
1300,1.0948
1301,1.1043
1302,1.1138
1303,1.1233
1304,1.131
1305,1.1405
1306,1.15
1307,1.1520000000000001
1308,1.1577
1309,1.1653
1310,1.1749
1311,1.1844
1312,1.1939
1313,1.2015
1314,1.2111
1315,1.2206
1316,1.2301
1317,1.2396
1318,1.2473
1319,1.2568
1320,1.2663
1321,1.2758
1322,1.2854
1323,1.2930000000000001
1324,1.3025
1325,1.3119999999999998
1326,1.3216
1327,1.3292
1328,1.3387
1329,1.3482
1330,1.3578
1331,1.3673
1332,1.3749
1333,1.3825
1334,1.3844
1335,1.3939
1336,1.4034
1337,1.411
1338,1.4206
1339,1.4301
1340,1.4396
1341,1.4472
1342,1.4568
1343,1.4663
1344,1.4701
1345,1.4739
1346,1.4815
1347,1.4892
1348,1.493
1349,1.5025
1350,1.5102
1351,1.5159
1352,1.5178
1353,1.5273
1354,1.5368
1355,1.5444
1356,1.5501
1357,1.5519999999999998
1358,1.5615
1359,1.5711
1360,1.5787
1361,1.5806
1362,1.5863
1363,1.5958
1364,1.6034
1365,1.611
1366,1.6111
1367,1.6130000000000002
1368,1.6149
1369,1.6226
1370,1.6264
1371,1.6265
1372,1.6266
1373,1.6286
1374,1.6288
1375,1.629
1376,1.6291
1377,1.6291
1378,1.6293
1379,1.6295
1380,1.6295
1381,1.6297
1382,1.63
1383,1.6283
1384,1.6286
1385,1.6269999999999998
1386,1.6175
1387,1.6158
1388,1.6162
1389,1.6146
1390,1.6072
1391,1.6017
1392,1.6019999999999999
1393,1.6005
1394,1.599
1395,1.5894
1396,1.5799
1397,1.5724
1398,1.5629
1399,1.5574
1400,1.5559
1401,1.5484
1402,1.5429
1403,1.5415
1404,1.5321
1405,1.5267
1406,1.5272
1407,1.5177
1408,1.5083
1409,1.4987
1410,1.4968
1411,1.4912
1412,1.482
1413,1.4783
1414,1.4747
1415,1.4691
1416,1.4672
1417,1.4596
1418,1.4501
1419,1.4406
1420,1.433
1421,1.4236
1422,1.4141
1423,1.4046
1424,1.3969999999999998
1425,1.3875
1426,1.3780000000000001
1427,1.3767
1428,1.3693
1429,1.3617
1430,1.3522
1431,1.3427
1432,1.3332
1433,1.3257
1434,1.3162
1435,1.3067
1436,1.2972
1437,1.2879
1438,1.2865
1439,1.2811
1440,1.2716
1441,1.2621
1442,1.2526
1443,1.245
1444,1.2355
1445,1.226
1446,1.2165
1447,1.2089
1448,1.1994
1449,1.1899
1450,1.1804
1451,1.1709
1452,1.1633
1453,1.1538
1454,1.1443
1455,1.1348
1456,1.1253
1457,1.1177
1458,1.1082
1459,1.0988
1460,1.0893
1461,1.0817
1462,1.0722
1463,1.0627
1464,1.0595
1465,1.0562
1466,1.0486
1467,1.0391
1468,1.0296
1469,1.0201
1470,1.0125
1471,1.003
1472,0.99364
1473,0.98415
1474,0.97465
1475,0.96706
1476,0.9575600000000001
1477,0.9480700000000001
1478,0.93858
1479,0.9290799999999999
1480,0.9214899999999999
1481,0.91199
1482,0.9025
1483,0.8930100000000001
1484,0.88541
1485,0.87592
1486,0.8664299999999999
1487,0.8569399999999999
1488,0.84744
1489,0.83985
1490,0.83036
1491,0.8208700000000001
1492,0.81138
1493,0.80378
1494,0.7942899999999999
1495,0.78909
1496,0.78408
1497,0.77459
1498,0.767
1499,0.75751
1500,0.74802
1501,0.73853
1502,0.72905
1503,0.72163
1504,0.71215
1505,0.7026600000000001
1506,0.69318
1507,0.6855899999999999
1508,0.6761
1509,0.66887
1510,0.66599
1511,0.6565
1512,0.6489199999999999
1513,0.63944
1514,0.6299600000000001
1515,0.6206699999999999
1516,0.6111800000000001
1517,0.6036
1518,0.59412
1519,0.5846399999999999
1520,0.57516
1521,0.56758
1522,0.5581
1523,0.5486300000000001
1524,0.53915
1525,0.5294800000000001
1526,0.5219
1527,0.51242
1528,0.5029399999999999
1529,0.49346
1530,0.48588000000000003
1531,0.47641000000000006
1532,0.46693
1533,0.45745
1534,0.45177
1535,0.44968
1536,0.4421
1537,0.43981000000000003
1538,0.43183999999999995
1539,0.42218
1540,0.42198
1541,0.4163
1542,0.40681999999999996
1543,0.39734
1544,0.38976
1545,0.38028
1546,0.3708
1547,0.36512
1548,0.36322
1549,0.35564
1550,0.34615999999999997
1551,0.34426999999999996
1552,0.33858
1553,0.331
1554,0.32153000000000004
1555,0.31205
1556,0.30258
1557,0.2929
1558,0.28531999999999996
1559,0.27585
1560,0.26637
1561,0.2569
1562,0.24741999999999997
1563,0.23985
1564,0.23037
1565,0.2209
1566,0.21163
1567,0.20405
1568,0.19458
1569,0.18511
1570,0.17564000000000002
1571,0.16596
1572,0.15838
1573,0.14891
1574,0.13944
1575,0.12997
1576,0.1205
1577,0.11292999999999999
1578,0.10346
1579,0.093987
1580,0.08452
1581,0.07715599999999999
1582,0.067689
1583,0.058222
1584,0.048755
1585,0.039289
1586,0.031716
1587,0.030912000000000002
1588,0.023788
1589,0.014554
1590,0.0069863
1591,0.0013103
1592,-0.0022447
1593,-0.011474
1594,-0.014793
1595,-0.016683
1596,-0.026137999999999998
1597,-0.028027999999999997
1598,-0.035592
1599,-0.045045999999999996
1600,-0.0467
1601,-0.052133000000000006
1602,-0.055675
1603,-0.055435000000000005
1604,-0.05635
1605,-0.059385
1606,-0.068827
1607,-0.07827100000000001
1608,-0.08368400000000001
1609,-0.08557200000000001
1610,-0.08669500000000001
1611,-0.088064
1612,-0.089429
1613,-0.088367
1614,-0.08540299999999999
1615,-0.08297
1616,-0.07997699999999999
1617,-0.078092
1618,-0.072159
1619,-0.06434
1620,-0.06104
1621,-0.053219
1622,-0.046704
1623,-0.043653
1624,-0.035828
1625,-0.026123
1626,-0.016711
1627,-0.013941
1628,-0.008979700000000002
1629,0.00042629
1630,0.010134
1631,0.019542
1632,0.027067
1633,0.033614
1634,0.036714
1635,0.046116000000000004
1636,0.055518
1637,0.063042
1638,0.072749
1639,0.08215399999999999
1640,0.09156
1641,0.099084
1642,0.10849
1643,0.11158
1644,0.11815
1645,0.12755
1646,0.13507
1647,0.14478
1648,0.15417999999999998
1649,0.16358
1650,0.1711
1651,0.17609
1652,0.18078
1653,0.19018
1654,0.19958
1655,0.2071
1656,0.21681
1657,0.22621
1658,0.23560999999999999
1659,0.24500999999999998
1660,0.25096
1661,0.25439
1662,0.26222
1663,0.27162
1664,0.27913000000000004
1665,0.28853
1666,0.29824
1667,0.30764
1668,0.31704
1669,0.32456
1670,0.33396
1671,0.34337
1672,0.34679
1673,0.35117
1674,0.36057
1675,0.36996999999999997
1676,0.37936
1677,0.38908000000000004
1678,0.39659
1679,0.40599
1680,0.41539
1681,0.42196000000000006
1682,0.42885
1683,0.43637
1684,0.44576000000000005
1685,0.45547
1686,0.46487
1687,0.47239
1688,0.48178999999999994
1689,0.4868
1690,0.49338000000000004
1691,0.5027699999999999
1692,0.51061
1693,0.52
1694,0.52971
1695,0.5350600000000001
1696,0.54289
1697,0.5504
1698,0.55979
1699,0.5695
1700,0.5789
1701,0.58641
1702,0.59424
1703,0.59772
1704,0.60556
1705,0.6149399999999999
1706,0.62246
1707,0.63217
1708,0.64156
1709,0.65095
1710,0.6569
1711,0.6604
1712,0.66823
1713,0.67761
1714,0.68733
1715,0.69484
1716,0.70422
1717,0.70773
1718,0.7158899999999999
1719,0.72528
1720,0.73278
1721,0.74217
1722,0.75188
1723,0.76127
1724,0.76877
1725,0.7781600000000001
1726,0.78477
1727,0.78796
1728,0.7973399999999999
1729,0.80485
1730,0.8145600000000001
1731,0.82394
1732,0.8333299999999999
1733,0.8408399999999999
1734,0.8459
1735,0.85065
1736,0.86003
1737,0.86941
1738,0.87692
1739,0.8863
1740,0.8960100000000001
1741,0.9054
1742,0.9147799999999999
1743,0.9222899999999999
1744,0.9316700000000001
1745,0.94106
1746,0.95044
1747,0.9555
1748,0.96025
1749,0.9696299999999999
1750,0.97901
1751,0.98839
1752,0.9959
1753,1.0056
1754,1.015
1755,1.0244
1756,1.0338
1757,1.0413
1758,1.0507
1759,1.0582
1760,1.0636
1761,1.068
1762,1.0773
1763,1.0867
1764,1.0961
1765,1.1058
1766,1.1133
1767,1.1227
1768,1.1321
1769,1.1387
1770,1.1419
1771,1.1513
1772,1.161
1773,1.1704
1774,1.1798
1775,1.1857
1776,1.1893
1777,1.1971
1778,1.2065
1779,1.2162
1780,1.2237
1781,1.2331
1782,1.2366
1783,1.2448
1784,1.2523
1785,1.2617
1786,1.2714
1787,1.2808
1788,1.2843
1789,1.2906
1790,1.3
1791,1.3097
1792,1.3163
1793,1.3196
1794,1.329
1795,1.3387
1796,1.3465
1797,1.3501
1798,1.3542
1799,1.3636
1800,1.3733
1801,1.3827
1802,1.392
1803,1.3968
1804,1.4001
1805,1.4098
1806,1.4153
1807,1.4198
1808,1.4295
1809,1.4331
1810,1.4398
1811,1.4480000000000002
1812,1.4495
1813,1.4532
1814,1.4547
1815,1.4644
1816,1.4669999999999999
1817,1.4689
1818,1.4708
1819,1.4727
1820,1.4746
1821,1.474
1822,1.465
1823,1.4669999999999999
1824,1.469
1825,1.4709999999999999
1826,1.4708
1827,1.4728
1828,1.4749
1829,1.4702
1830,1.4632
1831,1.4648
1832,1.4651
1833,1.4673
1834,1.4603
1835,1.4528
1836,1.444
1837,1.4412
1838,1.4415
1839,1.4327
1840,1.4294
1841,1.4280000000000002
1842,1.4228
1843,1.4136
1844,1.4062
1845,1.3974
1846,1.3881
1847,1.3886
1848,1.3821
1849,1.3747
1850,1.3654
1851,1.3567
1852,1.3474
1853,1.34
1854,1.3308
1855,1.3216
1856,1.3123
1857,1.3031
1858,1.2957
1859,1.2865
1860,1.2773
1861,1.2736
1862,1.2714
1863,1.264
1864,1.2548
1865,1.2456
1866,1.2363
1867,1.229
1868,1.2202
1869,1.2109999999999999
1870,1.2013
1871,1.1921
1872,1.1852
1873,1.176
1874,1.1663
1875,1.1571
1876,1.1498
1877,1.1406
1878,1.1314
1879,1.1222
1880,1.113
1881,1.1073
1882,1.1003
1883,1.0911
1884,1.0819
1885,1.0727
1886,1.0654
1887,1.0557
1888,1.0465
1889,1.0373
1890,1.0299
1891,1.0207
1892,1.0171
1893,1.0111
1894,1.005
1895,1.0004
1896,0.99066
1897,0.98415
1898,0.9804700000000001
1899,0.9712799999999999
1900,0.96393
1901,0.9547399999999999
1902,0.94505
1903,0.93586
1904,0.9285200000000001
1905,0.92668
1906,0.92117
1907,0.91465
1908,0.9104700000000001
1909,0.9021100000000001
1910,0.89426
1911,0.8919100000000001
1912,0.8845700000000001
1913,0.8772200000000001
1914,0.8680399999999999
1915,0.85885
1916,0.8496799999999999
1917,0.83999
1918,0.83265
1919,0.82347
1920,0.8143
1921,0.80512
1922,0.80329
1923,0.79595
1924,0.79125
1925,0.78656
1926,0.77687
1927,0.77217
1928,0.7703399999999999
1929,0.76117
1930,0.7519899999999999
1931,0.74282
1932,0.73549
1933,0.72632
1934,0.71716
1935,0.7074699999999999
1936,0.70014
1937,0.69098
1938,0.68183
1939,0.67267
1940,0.66351
1941,0.65566
1942,0.6499
1943,0.64335
1944,0.6341899999999999
1945,0.6250399999999999
1946,0.61771
1947,0.60856
1948,0.59941
1949,0.59026
1950,0.58294
1951,0.5737899999999999
1952,0.56465
1953,0.55497
1954,0.54583
1955,0.53852
1956,0.5293800000000001
1957,0.52025
1958,0.5139
1959,0.50917
1960,0.5018600000000001
1961,0.49272
1962,0.48358
1963,0.47444
1964,0.46658999999999995
1965,0.45746000000000003
1966,0.44833
1967,0.4392
1968,0.43007
1969,0.42533000000000004
1970,0.42078999999999994
1971,0.41166
1972,0.40252
1973,0.39521999999999996
1974,0.38609
1975,0.37696999999999997
1976,0.3673
1977,0.35817
1978,0.35088
1979,0.34176
1980,0.33264
1981,0.32353000000000004
1982,0.31442
1983,0.30657
1984,0.30308
1985,0.29595
1986,0.28684
1987,0.27955
1988,0.27043
1989,0.26133
1990,0.25166
1991,0.24255
1992,0.23526999999999998
1993,0.22616999999999998
1994,0.21706999999999999
1995,0.20935
1996,0.20585
1997,0.19675
1998,0.18764
1999,0.17854
2000,0.16944
2001,0.1616
2002,0.15250999999999998
2003,0.14340999999999998
2004,0.13432
2005,0.12523
2006,0.11797
2007,0.10830999999999999
2008,0.10238
2009,0.095789
2010,0.088517
2011,0.079429
2012,0.069771
2013,0.060687
2014,0.051605
2015,0.044342
2016,0.035266000000000006
2017,0.029822
2018,0.028007
2019,0.018355
2020,0.015958
2021,0.011168
2022,0.00093529
2023,-0.0032736999999999996
2024,-0.0050887
2025,-0.014163999999999998
2026,-0.023235
2027,-0.032304
2028,-0.041371
2029,-0.04862
2030,-0.057682000000000004
2031,-0.06673899999999999
2032,-0.075795
2033,-0.083035
2034,-0.092084
2035,-0.10113
2036,-0.11017
2037,-0.11921
2038,-0.12704000000000001
2039,-0.13608
2040,-0.14511
2041,-0.15354
2042,-0.16317
2043,-0.16978
2044,-0.17879
2045,-0.18843
2046,-0.19682
2047,-0.20403
2048,-0.21365
2049,-0.22266
2050,-0.23165999999999998
2051,-0.24065999999999999
2052,-0.24785
2053,-0.25684
2054,-0.26583
2055,-0.27481
2056,-0.282
2057,-0.29097
2058,-0.2993
2059,-0.30827
2060,-0.31723
2061,-0.3244
2062,-0.33335
2063,-0.34231
2064,-0.35191
2065,-0.3602
2066,-0.36801
2067,-0.37695
2068,-0.38588
2069,-0.39481
2070,-0.40195
2071,-0.41086999999999996
2072,-0.41978999999999994
2073,-0.4287
2074,-0.43761000000000005
2075,-0.44473
2076,-0.45364
2077,-0.46253
2078,-0.47142
2079,-0.48031
2080,-0.48741999999999996
2081,-0.49628999999999995
2082,-0.50447
2083,-0.51334
2084,-0.5204300000000001
2085,-0.52928
2086,-0.53814
2087,-0.54698
2088,-0.55582
2089,-0.55793
2090,-0.55683
2091,-0.56493
2092,-0.5737399999999999
2093,-0.58005
2094,-0.58885
2095,-0.59588
2096,-0.59395
2097,-0.59948
2098,-0.60574
2099,-0.61449
2100,-0.6157199999999999
2101,-0.61617
2102,-0.6249
2103,-0.6318699999999999
2104,-0.63981
2105,-0.64851
2106,-0.6572100000000001
2107,-0.6641600000000001
2108,-0.66623
2109,-0.66906
2110,-0.67519
2111,-0.67291
2112,-0.67475
2113,-0.68175
2114,-0.67938
2115,-0.6846
2116,-0.68892
2117,-0.68647
2118,-0.69419
2119,-0.7018800000000001
2120,-0.70957
2121,-0.70786
2122,-0.70615
2123,-0.70357
2124,-0.69924
2125,-0.69489
2126,-0.69401
2127,-0.69138
2128,-0.6835899999999999
2129,-0.67427
2130,-0.66904
2131,-0.65963
2132,-0.65032
2133,-0.64188
2134,-0.63585
2135,-0.6323
2136,-0.62615
2137,-0.62166
2138,-0.6171399999999999
2139,-0.60953
2140,-0.60178
2141,-0.5955600000000001
2142,-0.58719
2143,-0.57791
2144,-0.57121
2145,-0.56591
2146,-0.55648
2147,-0.54873
2148,-0.5424899999999999
2149,-0.53714
2150,-0.53178
2151,-0.52345
2152,-0.5141899999999999
2153,-0.50659
2154,-0.50032
2155,-0.49348000000000003
2156,-0.48589
2157,-0.4796
2158,-0.47368000000000005
2159,-0.46424
2160,-0.45793
2161,-0.44961999999999996
2162,-0.44037
2163,-0.43371000000000004
2164,-0.42667
2165,-0.4189
2166,-0.40945
2167,-0.40406
2168,-0.39482
2169,-0.38558000000000003
2170,-0.37726
2171,-0.37095
2172,-0.36577
2173,-0.35559
2174,-0.34926
2175,-0.34335
2176,-0.33576999999999996
2177,-0.32747
2178,-0.31969000000000003
2179,-0.31263
2180,-0.30339
2181,-0.29893000000000003
2182,-0.2902
2183,-0.28097
2184,-0.27266999999999997
2185,-0.26489
2186,-0.25948000000000004
2187,-0.25119
2188,-0.24195
2189,-0.23364000000000001
2190,-0.22991
2191,-0.22213000000000002
2192,-0.21195999999999998
2193,-0.20561
2194,-0.19804000000000002
2195,-0.19141
2196,-0.18217
2197,-0.17605
2198,-0.17063
2199,-0.16141
2200,-0.15621
2201,-0.14985
2202,-0.14157
2203,-0.13234
2204,-0.12571
2205,-0.11864000000000001
2206,-0.11085
2207,-0.10255999999999998
2208,-0.093331
2209,-0.08669099999999999
2210,-0.07838400000000001
2211,-0.07299
2212,-0.065205
2213,-0.057629999999999994
2214,-0.052225
2215,-0.044436
2216,-0.034268
2217,-0.027908
2218,-0.023656
2219,-0.015372
2220,-0.0061446999999999995
2221,0.00070629
2222,0.007066299999999999
2223,0.014632
2224,0.022425999999999998
2225,0.029512
2226,0.038729
2227,0.044872
2228,0.051965
2229,0.060234
2230,0.069451
2231,0.076305
2232,0.081738
2233,0.090245
2234,0.0971
2235,0.10515
2236,0.11270999999999999
2237,0.11980999999999999
2238,0.12762
2239,0.13777
2240,0.14419
2241,0.15009
2242,0.15955
2243,0.16763
2244,0.17682
2245,0.18395
2246,0.19012
2247,0.19766
2248,0.20412
2249,0.21059
2250,0.21447
2251,0.22461
2252,0.23340999999999998
2253,0.2396
2254,0.2481
2255,0.25527
2256,0.26475
2257,0.27161
2258,0.2765
2259,0.28141
2260,0.28699
2261,0.29193
2262,0.2988
2263,0.30729
2264,0.31126
2265,0.31787
2266,0.32286
2267,0.33197
2268,0.33821999999999997
2269,0.34223000000000003
2270,0.34888
2271,0.35393
2272,0.359
2273,0.36485
2274,0.37333
2275,0.37842
2276,0.38351999999999997
2277,0.38864
2278,0.39276
2279,0.39791
2280,0.40309
2281,0.40828000000000003
2282,0.4135
2283,0.41768
2284,0.42293000000000003
2285,0.4282
2286,0.4282
2287,0.42291999999999996
2288,0.42558999999999997
2289,0.42935
2290,0.4347
2291,0.42898000000000003
2292,0.42799
2293,0.4334
2294,0.43725
2295,0.43738
2296,0.43223
2297,0.43348000000000003
2298,0.43366000000000005
2299,0.42589
2300,0.41812
2301,0.41191000000000005
2302,0.40415999999999996
2303,0.39753
2304,0.3898
2305,0.38208000000000003
2306,0.37479
2307,0.36708
2308,0.35938000000000003
2309,0.35169
2310,0.34524
2311,0.33766999999999997
2312,0.32998
2313,0.32116999999999996
2314,0.31277
2315,0.30673
2316,0.29946
2317,0.29065
2318,0.28299
2319,0.27426999999999996
2320,0.26894
2321,0.26014
2322,0.25248000000000004
2323,0.24448000000000003
2324,0.23842
2325,0.23076
2326,0.22196999999999997
2327,0.21472
2328,0.20598000000000002
2329,0.20179
2330,0.193
2331,0.18536
2332,0.17736
2333,0.17128
2334,0.16364
2335,0.15487
2336,0.14611
2337,0.13887
2338,0.13315
2339,0.12553
2340,0.11677
2341,0.10917
2342,0.10157000000000001
2343,0.096971
2344,0.088965
2345,0.081367
2346,0.072627
2347,0.066565
2348,0.058995000000000006
2349,0.051437000000000004
2350,0.042727
2351,0.035408999999999996
2352,0.028205
2353,0.019496
2354,0.011959000000000001
2355,0.0057903
2356,-0.00071871
2357,-0.008257700000000001
2358,-0.016953
2359,-0.024472999999999998
2360,-0.03198
2361,-0.03733
2362,-0.044694
2363,-0.052202
2364,-0.060877
2365,-0.06954400000000001
2366,-0.075751
2367,-0.083776
2368,-0.090947
2369,-0.098322
2370,-0.10400000000000001
2371,-0.11149
2372,-0.12015
2373,-0.12763
2374,-0.13509000000000002
2375,-0.13982999999999998
2376,-0.14786
2377,-0.15532
2378,-0.16395
2379,-0.1708
2380,-0.17704
2381,-0.18538
2382,-0.19459
2383,-0.20262
2384,-0.20859
2385,-0.21721999999999997
2386,-0.22436
2387,-0.2318
2388,-0.24013
2389,-0.24578000000000003
2390,-0.25322
2391,-0.26155
2392,-0.26958000000000004
2393,-0.27581999999999995
2394,-0.28446
2395,-0.29100000000000004
2396,-0.29873
2397,-0.30618
2398,-0.31333
2399,-0.32195
2400,-0.32939
2401,-0.33654
2402,-0.34515999999999997
2403,-0.3511
2404,-0.35765
2405,-0.3654
2406,-0.37401999999999996
2407,-0.37908000000000003
2408,-0.38682
2409,-0.39545
2410,-0.40286
2411,-0.41118999999999994
2412,-0.41745
2413,-0.42458
2414,-0.43318999999999996
2415,-0.44058
2416,-0.44566999999999996
2417,-0.45343
2418,-0.46321999999999997
2419,-0.47098
2420,-0.4793
2421,-0.48613999999999996
2422,-0.49362
2423,-0.50342
2424,-0.51118
2425,-0.5192100000000001
2426,-0.5263399999999999
2427,-0.53374
2428,-0.5432600000000001
2429,-0.5495399999999999
2430,-0.5554600000000001
2431,-0.56405
2432,-0.5714199999999999
2433,-0.57772
2434,-0.5857600000000001
2435,-0.59287
2436,-0.60185
2437,-0.60869
2438,-0.61727
2439,-0.62463
2440,-0.6312
2441,-0.63898
2442,-0.6463399999999999
2443,-0.6549
2444,-0.66199
2445,-0.6695300000000001
2446,-0.67662
2447,-0.68395
2448,-0.6924899999999999
2449,-0.69833
2450,-0.70685
2451,-0.71443
2452,-0.7215
2453,-0.72732
2454,-0.73583
2455,-0.74511
2456,-0.75171
2457,-0.75898
2458,-0.76602
2459,-0.7732600000000001
2460,-0.78049
2461,-0.7871
2462,-0.79496
2463,-0.80074
2464,-0.80919
2465,-0.81639
2466,-0.8240700000000001
2467,-0.83089
2468,-0.8393299999999999
2469,-0.8465
2470,-0.8531299999999999
2471,-0.8610200000000001
2472,-0.8667600000000001
2473,-0.8751700000000001
2474,-0.8835799999999999
2475,-0.89131
2476,-0.89954
2477,-0.9088700000000001
2478,-0.9155
2479,-0.92265
2480,-0.93105
2481,-0.93532
2482,-0.9445
2483,-0.9513
2484,-0.9608
2485,-0.96854
2486,-0.97282
2487,-0.98121
2488,-0.98831
2489,-0.9963799999999999
2490,-1.0015
2491,-1.0098
2492,-1.0179
2493,-1.0258
2494,-1.0329
2495,-1.0399
2496,-1.0468
2497,-1.0546
2498,-1.0628
2499,-1.0709
2500,-1.0774
2501,-1.0857
2502,-1.0951
2503,-1.1017
2504,-1.1074
2505,-1.1157
2506,-1.1227
2507,-1.1305
2508,-1.1401
2509,-1.1455
2510,-1.1533
2511,-1.1616
2512,-1.171
2513,-1.1762
2514,-1.1833
2515,-1.1916
2516,-1.1971
2517,-1.2064
2518,-1.2145
2519,-1.2213
2520,-1.2292
2521,-1.2362
2522,-1.2445
2523,-1.2501
2524,-1.2594
2525,-1.2675
2526,-1.2756
2527,-1.2822
2528,-1.2918
2529,-1.301
2530,-1.3092
2531,-1.3162
2532,-1.3231
2533,-1.3299
2534,-1.3391
2535,-1.3487
2536,-1.3554
2537,-1.3635
2538,-1.3704
2539,-1.3787
2540,-1.3854
2541,-1.392
2542,-1.4002
2543,-1.4082
2544,-1.4177
2545,-1.4258
2546,-1.4325
2547,-1.4392
2548,-1.4475
2549,-1.4543
2550,-1.4597
2551,-1.4677
2552,-1.4759
2553,-1.4853
2554,-1.492
2555,-1.4975
2556,-1.5057
2557,-1.5138
2558,-1.5218
2559,-1.5286
2560,-1.534
2561,-1.5419999999999998
2562,-1.5502
2563,-1.5569
2564,-1.5636
2565,-1.5718
2566,-1.5799
2567,-1.5867
2568,-1.5947
2569,-1.6001
2570,-1.6096
2571,-1.6176
2572,-1.6271
2573,-1.6338
2574,-1.6419
2575,-1.6487
2576,-1.6568
2577,-1.6635
2578,-1.6703
2579,-1.6783
2580,-1.6864
2581,-1.6945
2582,-1.7026
2583,-1.7080000000000002
2584,-1.7174
2585,-1.7255
2586,-1.7349
2587,-1.739
2588,-1.7457
2589,-1.7538
2590,-1.7605
2591,-1.7686
2592,-1.774
2593,-1.7819999999999998
2594,-1.7901
2595,-1.7995
2596,-1.8049
2597,-1.8131
2598,-1.8198
2599,-1.8279
2600,-1.8359999999999999
2601,-1.8427
2602,-1.8507
2603,-1.8575
2604,-1.8655
2605,-1.8737
2606,-1.8804
2607,-1.8871
2608,-1.8951
2609,-1.9032
2610,-1.91
2611,-1.9179
2612,-1.9247
2613,-1.9315
2614,-1.9381
2615,-1.9434
2616,-1.9513
2617,-1.9578
2618,-1.9644
2619,-1.9726
2620,-1.9779
2621,-1.9844
2622,-1.9922
2623,-2.0016
2624,-2.0072
2625,-2.0135
2626,-2.0198
2627,-2.0275
2628,-2.0337
2629,-2.0391
2630,-2.0476
2631,-2.0538
2632,-2.0599
2633,-2.0648
2634,-2.0708
2635,-2.0767
2636,-2.0841
2637,-2.09
2638,-2.0946
2639,-2.1004
2640,-2.108
2641,-2.1167
2642,-2.1224
2643,-2.1269
2644,-2.1324
2645,-2.1379
2646,-2.1449
2647,-2.1492
2648,-2.1544
2649,-2.1596
2650,-2.1687
2651,-2.175
2652,-2.1791
2653,-2.1841
2654,-2.1891
2655,-2.194
2656,-2.1995
2657,-2.2043
2658,-2.2089
2659,-2.2135
2660,-2.218
2661,-2.2248
2662,-2.2333
2663,-2.2377
2664,-2.242
2665,-2.2462
2666,-2.2512
2667,-2.2552
2668,-2.2591
2669,-2.2629
2670,-2.2676
2671,-2.2771
2672,-2.2825
2673,-2.286
2674,-2.2895
2675,-2.2921
2676,-2.2953
2677,-2.2984
2678,-2.3032
2679,-2.3061
2680,-2.3083
2681,-2.3109
2682,-2.3152
2683,-2.3222
2684,-2.3287
2685,-2.331
2686,-2.3332
2687,-2.3352
2688,-2.339
2689,-2.3404
2690,-2.342
2691,-2.3436
2692,-2.3482
2693,-2.356
2694,-2.3589
2695,-2.3601
2696,-2.3611
2697,-2.362
2698,-2.3626
2699,-2.3651
2700,-2.3656
2701,-2.3659
2702,-2.3661
2703,-2.3680000000000003
2704,-2.3776
2705,-2.3795
2706,-2.3795
2707,-2.3795
2708,-2.3814
