time,value
0,-0.34779
1,-0.34779
2,-0.34779
3,-0.34779
4,-0.34779
5,-0.34779
6,-0.34779
7,-0.34779
8,-0.34779
9,-0.34779
10,-0.34779
11,-0.34779
12,-0.34779
13,-0.34779
14,-0.34779
15,-0.34779
16,-0.34779
17,-0.34779
18,-0.34779
19,-0.34779
20,-0.34779
21,-0.34779
22,-0.34779
23,-0.34779
24,-0.34779
25,-0.34779
26,-0.34779
27,-0.34779
28,-0.34779
29,-0.34779
30,-0.34779
31,-0.34779
32,-0.34779
33,-0.34779
34,-0.34779
35,-0.34779
36,3.2504
37,-0.34779
38,-0.34779
39,2.6228
40,-0.34779
41,1.9952
42,-0.34779
43,-0.34779
44,2.4136
45,-0.34779
46,-0.34779
47,-0.34779
48,1.4513
49,-0.34779
50,3.878
51,-0.34779
52,-0.34779
53,-0.34779
54,-0.34779
55,2.0371
56,-0.34779
57,-0.34779
58,-0.34779
59,-0.34779
60,3.5015
61,-0.34779
62,-0.34779
63,-0.34779
64,2.3718
65,-0.34779
66,-0.34779
67,-0.34779
68,-0.34779
69,2.8739
70,-0.34779
71,-0.34779
72,-0.34779
73,-0.34779
74,-0.34779
75,-0.34779
76,-0.34779
77,3.1667
78,-0.34779
79,-0.34779
80,-0.34779
81,-0.34779
82,-0.34779
83,-0.34779
84,-0.34779
85,-0.34779
86,-0.34779
87,-0.34779
88,-0.34779
89,-0.34779
90,-0.34779
91,-0.34779
92,-0.34779
93,-0.34779
94,-0.34779
95,-0.34779
