time,value
0,-0.18449000000000002
1,-0.157
2,-0.12265
3,-0.18449000000000002
4,-0.17075
5,-0.12952
6,-0.17418
7,-0.18449000000000002
8,-0.12265
9,-0.16044
10,-0.18792999999999999
11,-0.13639
12,-0.1467
13,-0.18792999999999999
14,-0.15012999999999999
15,-0.13639
16,-0.19136
17,-0.157
18,-0.13982999999999998
19,-0.18105
20,-0.17418
21,-0.14326
22,-0.18105
23,-0.18105
24,-0.13982999999999998
25,-0.16731
26,-0.18105
27,-0.13639
28,-0.157
29,-0.18449000000000002
30,-0.14326
31,-0.15357
32,-0.16731
33,-0.12608
34,-0.14326
35,-0.17418
36,-0.12608
37,-0.14326
38,-0.17075
39,-0.1467
40,-0.15012999999999999
41,-0.17762
42,-0.1467
43,-0.15012999999999999
44,-0.17762
45,-0.16044
46,-0.15357
47,-0.18105
48,-0.16044
49,-0.15012999999999999
50,-0.17762
51,-0.16731
52,-0.12608
53,-0.17075
54,-0.16388
55,-0.13982999999999998
56,-0.15012999999999999
57,-0.12608
58,-0.157
59,-0.13982999999999998
60,7.6283
61,5.8246
62,0.80499
63,-0.095162
64,-0.07798300000000001
65,-0.15012999999999999
66,-0.13982999999999998
67,-0.095162
68,-0.157
69,-0.16044
70,-0.1089
71,-0.14326
72,-0.16044
73,-0.11578
74,-0.13982999999999998
75,-0.16388
76,-0.13295
77,-0.14326
78,-0.17075
79,-0.15012999999999999
80,-0.13295
81,-0.17075
82,-0.16044
83,-0.11234000000000001
84,-0.16044
85,-0.17075
86,-0.13639
87,-0.12608
88,-0.18792999999999999
89,-0.14326
90,-0.15357
91,-0.18792999999999999
92,-0.13982999999999998
93,-0.17075
94,-0.18792999999999999
95,-0.13982999999999998
