time,value
0,-1.6336
1,-1.6432
2,-1.6137
3,-1.5989
4,-1.5668
5,-1.5239
6,-1.4888
7,-1.4155
8,-1.3957
9,-1.3384
10,-1.2847
11,-1.2434
12,-1.1599
13,-1.1309
14,-1.0457
15,-0.9788
16,-0.8734
17,-0.79092
18,-0.74664
19,-0.6241
20,-0.58192
21,-0.48163999999999996
22,-0.44283999999999996
23,-0.34621999999999997
24,-0.28368000000000004
25,-0.18704
26,-0.092903
27,-0.035392
28,0.039436
29,0.10485
30,0.22482
31,0.24191999999999997
32,0.35549000000000003
33,0.46552
34,0.465
35,0.5628
36,0.60553
37,0.6975100000000001
38,0.75375
39,0.82739
40,0.8818799999999999
41,0.9545600000000001
42,1.0194
43,1.0548
44,1.1251
45,1.1599
46,1.2056
47,1.2519
48,1.285
49,1.3257
50,1.357
51,1.4612
52,1.4485
53,1.4766
54,1.483
55,1.4841
56,1.4787
57,1.4680000000000002
58,1.4655
59,1.4501
60,1.4627
61,1.4425
62,1.3998
63,1.4012
64,1.3702
65,1.2771
66,1.1848
67,1.0707
68,1.0445
69,1.0194
70,0.9685600000000001
71,0.8890600000000001
72,0.83749
73,0.80596
74,0.72459
75,0.67257
76,0.5926899999999999
77,0.5714100000000001
78,0.52488
79,0.5290100000000001
80,0.47473000000000004
81,0.45736000000000004
82,0.46378
83,0.43167
84,0.41636000000000006
85,0.41955
86,0.40545
87,0.35069
88,0.31025
89,0.26546
90,0.13112000000000001
91,0.072897
92,-0.052503999999999995
93,-0.11249
94,-0.20801999999999998
95,-0.27061
96,-0.39653
97,-0.45955
98,-0.56516
99,-0.66266
100,-0.70687
101,-0.8280299999999999
102,-0.8871
103,-1.0017
104,-1.0571
105,-1.1309
106,-1.187
107,-1.2005
108,-1.1966
109,-1.162
110,-1.1293
111,-1.1327
112,-1.0843
113,-1.0393
114,-0.98924
115,-0.9511200000000001
116,-0.91456
117,-0.7833899999999999
118,-0.78451
119,-0.73974
120,-0.76858
121,-0.76639
122,-0.7368
123,-0.73395
124,-0.7804300000000001
125,-0.77645
126,-0.76756
127,-0.76273
128,-0.7975300000000001
129,-0.80642
130,-0.8352299999999999
131,-0.8378700000000001
132,-0.8696
133,-0.91705
134,-0.94355
135,-0.99208
136,-0.9801799999999999
137,-1.0121
138,-1.0182
139,-1.0049
140,-0.98959
141,-0.9450200000000001
142,-0.84293
143,-0.78372
144,-0.68061
145,-0.6241
146,-0.5224300000000001
147,-0.39653
148,-0.33349
149,-0.20478
150,-0.16472
151,-0.06336599999999999
152,-0.0023023
153,0.11687
154,0.2315
155,0.28691
156,0.36001
157,0.4255
158,0.50574
159,0.5210600000000001
160,0.5392899999999999
161,0.5392899999999999
162,0.5493100000000001
163,0.58449
164,0.56124
165,0.55635
166,0.57523
167,0.61466
168,0.63525
169,0.6602899999999999
170,0.6822600000000001
171,0.7809999999999999
172,0.85695
173,0.8579200000000001
174,0.90928
175,0.95781
176,1.082
177,1.1069
178,1.1782
179,1.2627
180,1.2466
181,1.321
182,1.3614
183,1.4009
184,1.3975
185,1.4627
186,1.4811
187,1.5011
188,1.474
189,1.4737
190,1.4735
191,1.4779
192,1.4654
193,1.4569
194,1.3928
195,1.3612
196,1.3282
197,1.3179
198,1.2842
199,1.2157
200,1.1392
201,1.1548
202,1.1273
203,1.0543
204,0.94589
205,0.9080299999999999
206,0.7934100000000001
207,0.73435
208,0.6772
209,0.61466
210,0.51143
211,0.4066
212,0.34210999999999997
213,0.26022
214,0.2055
215,0.10511
216,0.07966799999999999
217,-0.048728
218,-0.11606
219,-0.2386
220,-0.34224
221,-0.40406
222,-0.5270100000000001
223,-0.5858800000000001
224,-0.6583399999999999
225,-0.69876
226,-0.79304
227,-0.90714
228,-0.94884
229,-1.046
230,-1.0883
231,-1.1467
232,-1.1966
233,-1.2839
234,-1.3072
235,-1.3556
236,-1.4337
237,-1.4684
238,-1.5113
239,-1.5198
240,-1.537
241,-1.5437
242,-1.5794
243,-1.5887
244,-1.5923
245,-1.5975
246,-1.5991
247,-1.6236
248,-1.6465
249,-1.643
250,-1.6402
