time,value
0,-0.24693
1,-0.24693
2,-0.42252
3,-0.24693
4,-0.24693
5,-0.24693
6,-0.42252
7,-0.24693
8,-0.24693
9,-0.24693
10,-0.24693
11,-0.42252
12,-0.24693
13,-0.24693
14,-0.24693
15,-0.42252
16,-0.24693
17,-0.24693
18,-0.24693
19,-0.42252
20,-0.24693
21,-0.24693
22,-0.24693
23,-0.42252
24,-0.24693
25,-0.24693
26,-0.24693
27,-0.42252
28,-0.24693
29,-0.24693
30,-0.24693
31,-0.42252
32,-0.24693
33,-0.24693
34,-0.24693
35,-0.42252
36,-0.24693
37,-0.24693
38,-0.24693
39,-0.42252
40,-0.24693
41,-0.24693
42,-0.24693
43,-0.42252
44,-0.24693
45,-0.24693
46,-0.24693
47,-0.42252
48,-0.24693
49,-0.24693
50,-0.24693
51,-0.42252
52,-0.24693
53,-0.24693
54,-0.24693
55,-0.42252
56,-0.24693
57,-0.24693
58,-0.24693
59,-0.42252
60,-0.24693
61,-0.24693
62,-0.24693
63,-0.42252
64,-0.24693
65,-0.24693
66,-0.24693
67,-0.42252
68,-0.24693
69,-0.24693
70,-0.42252
71,-0.24693
72,-0.24693
73,-0.24693
74,-0.42252
75,-0.24693
76,-0.24693
77,-0.24693
78,-0.42252
79,-0.24693
80,-0.24693
81,-0.24693
82,-0.24693
83,2.5625
84,3.6161
85,3.7917
86,3.7917
87,3.7917
88,3.4405
89,3.2649
90,1.3334
91,-0.42252
92,-0.24693
93,-0.24693
94,-0.24693
95,-0.42252
