time,value
0,-0.18534
1,-0.18534
2,-0.18534
3,-0.18534
4,-0.18534
5,-0.18534
6,-0.18534
7,-0.18534
8,-0.18534
9,-0.18534
10,-0.18534
11,-0.18534
12,-0.18534
13,-0.18534
14,-0.18534
15,-0.18534
16,-0.18534
17,-0.18534
18,-0.18534
19,-0.18534
20,-0.18534
21,-0.18534
22,-0.18534
23,-0.18534
24,-0.18534
25,-0.18534
26,-0.18534
27,-0.18534
28,-0.18534
29,-0.18534
30,-0.18534
31,-0.047414
32,6.2170000000000005
33,1.9296
34,0.010057
35,-0.012931
36,1.3779
37,6.9066
38,-0.093391
39,-0.16236
40,-0.18534
41,-0.18534
42,-0.18534
43,-0.18534
44,-0.18534
45,-0.18534
46,-0.18534
47,-0.18534
48,-0.18534
49,-0.18534
50,-0.18534
51,-0.18534
52,-0.18534
53,-0.18534
54,-0.18534
55,-0.18534
56,-0.18534
57,-0.18534
58,-0.18534
59,-0.18534
60,-0.18534
61,-0.18534
62,-0.18534
63,-0.18534
64,-0.18534
65,-0.18534
66,-0.18534
67,-0.18534
68,-0.18534
69,-0.18534
70,-0.18534
71,-0.18534
72,-0.18534
73,-0.18534
74,-0.18534
75,-0.18534
76,-0.18534
77,-0.18534
78,-0.18534
79,-0.18534
80,-0.18534
81,-0.18534
82,-0.18534
83,-0.18534
84,-0.18534
85,-0.18534
86,-0.18534
87,-0.18534
88,-0.18534
89,-0.18534
90,-0.18534
91,-0.18534
92,-0.18534
93,-0.18534
94,-0.18534
95,-0.18534
