[<text>
<title>komatsu ltd &lt;komt.t&gt; year 1986</title>
<dateline>     tokyo, march 20 -
     </dateline>group shr 17.68 yen vs 26.49
     net 14.70 billion vs 21.92 billion
     pretax 35.76 billion vs 48.85 billion
     operating 32.88 billion vs 51.90 billion
     sales 788.73 billion vs 796.24 billion
     note - company forecast for current year is group net
15.50 billion on sales of 800 billion.
 reuter
</text>]