time,value
0,-0.19955
1,-0.19955
2,-0.19955
3,-0.19955
4,-0.19955
5,-0.19955
6,-0.19955
7,-0.19955
8,-0.19955
9,-0.19955
10,-0.19955
11,-0.19955
12,-0.19955
13,-0.19955
14,-0.19955
15,-0.19955
16,-0.19955
17,-0.19955
18,-0.19955
19,-0.19955
20,-0.19955
21,-0.19955
22,-0.19955
23,-0.19955
24,-0.19955
25,-0.19955
26,-0.19955
27,-0.19955
28,-0.19955
29,-0.19955
30,-0.19955
31,-0.19955
32,-0.19955
33,-0.19955
34,-0.19955
35,-0.19955
36,-0.19955
37,-0.19955
38,-0.19955
39,-0.19955
40,-0.19955
41,-0.19955
42,0.65061
43,3.6829
44,-0.19955
45,-0.19955
46,-0.19955
47,-0.19955
48,-0.19955
49,-0.19955
50,-0.19955
51,-0.19955
52,-0.19955
53,-0.19955
54,-0.19955
55,-0.19955
56,-0.19955
57,-0.19955
58,-0.19955
59,-0.19955
60,-0.19955
61,-0.19955
62,-0.19955
63,-0.19955
64,-0.19955
65,-0.19955
66,-0.19955
67,-0.19955
68,-0.19955
69,-0.19955
70,-0.19955
71,-0.19955
72,-0.19955
73,-0.19955
74,-0.19955
75,-0.19955
76,-0.19955
77,-0.19955
78,-0.19955
79,-0.19955
80,2.521
81,7.6503
82,3.5412
83,-0.086197
84,-0.19955
85,-0.19955
86,-0.19955
87,-0.19955
88,-0.19955
89,-0.19955
90,-0.19955
91,-0.19955
92,-0.19955
93,-0.19955
94,-0.19955
95,-0.19955
