time,value
0,1.3963
1,1.3003
2,1.2195
3,1.0727
4,1.0707
5,0.9802700000000001
6,0.8628399999999999
7,0.74788
8,0.6533100000000001
9,0.72893
10,0.70276
11,0.5785100000000001
12,0.52996
13,0.40005
14,0.42501000000000005
15,0.38421
16,0.35695
17,0.36905
18,0.29197
19,0.27583
20,0.15466
21,0.041395999999999995
22,0.051655999999999994
23,-0.011014
24,-0.07272999999999999
25,-0.11342
26,-0.18769
27,-0.21541
28,-0.25535
29,-0.4338
30,-0.3473
31,-0.48655
32,-0.5159100000000001
33,-0.3498
34,-0.19194
35,0.015737
36,0.20558
37,0.39098
38,0.43059
39,0.64978
40,0.8243799999999999
41,1.028
42,1.1168
43,1.0278
44,0.9544600000000001
45,0.9114899999999999
46,0.7677
47,0.71031
48,0.65715
49,0.53943
50,0.48008
51,0.37044
52,0.52995
53,0.52264
54,0.47478000000000004
55,0.3964
56,0.30951
57,0.31031
58,0.23233
59,0.16265
60,0.042980000000000004
61,-0.031481
62,-0.16521
63,-0.2814
64,-0.33995
65,-0.27161
66,-0.10865
67,-0.15661
68,-0.31237
69,-0.41713999999999996
70,-0.46725
71,-0.5604100000000001
72,-0.68872
73,-0.80793
74,-0.8793200000000001
75,-0.91459
76,-1.0385
77,-1.1104
78,-1.2593
79,-1.3315
80,-1.5095
81,-1.2874
82,-1.5371
83,-1.4719
84,-1.2652
85,-1.0898
86,-0.9505600000000001
87,-0.71012
88,-0.44748000000000004
89,-0.18292
90,0.082647
91,0.34649
92,0.61078
93,0.87559
94,1.1412
95,1.4065
96,1.6708
97,1.9349
98,2.17
99,2.3239
100,2.5171
101,2.7075
102,2.8278
103,2.8702
104,2.8272
105,2.7287
106,2.4877
107,2.291
108,2.1464
109,2.0397
110,1.7737
111,1.5081
112,1.3487
113,1.1883
114,0.92253
115,0.72746
116,0.4619
117,0.19626
118,-0.069337
119,-0.33487
120,-0.60056
121,-0.83906
122,-0.99041
123,-1.2562
124,-1.4274
125,-1.4023
126,-1.3128
127,-1.3019999999999998
128,-1.1705
129,-1.0938
130,-1.1104
131,-0.97064
132,-0.9209999999999999
133,-0.8793700000000001
134,-0.8222700000000001
135,-0.73437
136,-0.70694
137,-0.62378
138,-0.58849
139,-0.5078699999999999
140,-0.47651000000000004
141,-0.35393
142,-0.33285
143,-0.20457999999999998
144,-0.11074
145,-0.037075
146,0.024424
147,0.055137
148,0.12308
149,0.21224
150,0.21738000000000002
151,0.2939
152,0.36873
153,0.3789
154,0.39437
155,0.42039
156,0.46767
157,0.56542
158,0.58457
159,0.65217
160,0.5866899999999999
161,0.5127
162,0.30982
163,0.10995
164,0.023325
165,-0.076178
166,-0.22125
167,-0.42896999999999996
168,-0.59454
169,-0.60902
170,-0.44893999999999995
171,-0.55086
172,-0.7005100000000001
173,-0.53552
174,-0.5967100000000001
175,-0.45885
176,-0.44325
177,-0.38344
178,-0.35126999999999997
179,-0.32058000000000003
180,-0.37335999999999997
181,-0.35198
182,-0.23596999999999999
183,-0.16485999999999998
184,-0.089424
185,-0.084037
186,0.087556
187,0.09410299999999999
188,0.22374000000000002
189,0.26689
190,0.31615
191,0.47095
192,0.44561000000000006
193,0.37113
194,0.35833000000000004
195,0.48227
196,0.55025
197,0.55569
198,0.62749
199,0.6991
200,0.7612
201,0.78663
202,0.77805
203,0.9948899999999999
204,0.9430200000000001
205,0.9887799999999999
206,0.90771
207,0.8527100000000001
208,0.73109
209,0.48563
210,0.25186
211,0.086647
212,-0.1029
213,-0.16368
214,-0.24129
215,-0.30943000000000004
216,-0.48383000000000004
217,-0.57919
218,-0.7005100000000001
219,-0.94671
220,-0.92314
221,-0.89292
222,-1.1051
223,-1.2997
224,-1.2263
225,-1.0733
226,-0.9759899999999999
227,-0.90661
228,-0.7781399999999999
229,-0.7331
230,-0.6863100000000001
231,-0.55543
232,-0.5101600000000001
233,-0.33942
234,-0.23797
235,-0.16805
236,-0.1149
237,-0.048019
238,0.082223
239,0.23699
240,0.29103
241,0.38305
242,0.20722
243,0.28429
244,0.43553000000000003
245,0.46852
246,0.4208
247,0.6028399999999999
248,0.65837
249,0.71937
250,0.85362
251,0.77093
252,0.59825
253,0.48323
254,0.6549699999999999
255,0.80243
256,0.9353600000000001
257,0.99775
258,0.9386700000000001
259,1.0205
260,1.1942
261,1.2806
262,1.4743
263,1.5793
264,1.7527
265,1.7971
266,1.9386
267,1.9022
268,1.6978
269,1.5225
270,1.3367
271,1.168
272,0.9727100000000001
273,0.88164
274,0.69848
275,0.51362
276,0.3405
277,0.16847
278,0.09273300000000001
279,-0.083453
280,-0.2748
281,-0.44282
282,-0.61407
283,-0.80667
284,-0.79773
285,-0.9748399999999999
286,-1.1378
287,-1.3235
288,-1.5124
289,-1.6896
290,-1.8634
291,-2.0544
292,-2.2282
293,-2.2715
294,-2.4077
295,-2.385
296,-2.3197
297,-2.1698
298,-1.9474
299,-1.8333
300,-1.7233
301,-1.4701
302,-1.3156
303,-1.1534
304,-1.062
305,-0.91746
306,-1.0787
307,-1.003
308,-0.82906
309,-0.6843899999999999
310,-0.55576
311,-0.47442
312,-0.34704
313,-0.16474
314,-0.024249
315,0.059401999999999996
316,0.063313
317,0.29888000000000003
318,0.44598000000000004
319,0.54756
320,0.73529
321,0.9300799999999999
322,1.078
323,0.95662
324,0.81381
325,0.58055
326,0.45568000000000003
327,0.26716999999999996
328,0.076988
329,-0.12767
330,-0.10368
331,-0.25109000000000004
332,-0.44288
333,-0.60761
334,-0.76976
335,-0.9166
336,-1.0709
337,-0.9395899999999999
338,-0.8554299999999999
339,-1.0228
340,-1.1841
341,-1.3314
342,-1.4321
343,-1.5921
344,-1.7438
345,-1.9023
346,-2.0313
347,-1.9784
348,-2.0915
349,-2.0463
350,-2.0797
351,-1.8971
352,-1.7113
353,-1.5349
354,-1.3673
355,-1.1765
356,-1.0046
357,-0.8324600000000001
358,-0.68006
359,-0.6948
360,-0.5270600000000001
361,-0.34131
362,-0.16995
363,0.0094307
364,0.22378
365,0.26402
366,0.45143999999999995
367,0.63686
368,0.83078
369,0.89302
370,1.0871
371,1.2631
372,1.4603
373,1.6361
374,1.7766
375,1.7188
376,1.6276
377,1.5342
378,1.443
379,1.2807
380,1.1742
381,1.0699
382,1.0001
383,0.91275
384,0.75648
385,0.58727
386,0.46063999999999994
387,0.31845999999999997
388,0.36009
389,0.30358
390,0.18415
391,0.31677
392,0.17407999999999998
393,0.10089
394,-0.073942
395,-0.20273
396,-0.14874
397,-0.071143
398,-0.23656999999999997
399,-0.36228
400,-0.50763
401,-0.63232
402,-0.72325
403,-0.8248200000000001
404,-0.95839
405,-1.0711
406,-1.186
407,-1.2935
408,-1.3741
409,-1.4113
410,-1.5312
411,-1.4802
412,-1.2138
413,-0.95734
414,-0.77718
415,-0.51437
416,-0.25232
417,-0.066426
418,-0.0016645
419,0.16946
420,0.35509
421,0.55165
422,0.73847
423,0.9380299999999999
424,1.2022
425,1.395
426,1.4667
