time,value
0,-0.82285
1,1.2026
2,-0.82285
3,-0.82285
4,1.2026
5,-0.82285
6,1.2026
7,-0.82285
8,1.2026
9,-0.82285
10,1.2026
11,1.2026
12,-0.82285
13,1.2026
14,-0.82285
15,1.2026
16,-0.82285
17,1.2026
18,-0.82285
19,1.2026
20,-0.82285
21,1.2026
22,-0.82285
23,1.2026
24,-0.82285
25,1.2026
26,-0.82285
27,1.2026
28,-0.82285
29,-0.82285
30,1.2026
31,-0.82285
32,-0.82285
33,-0.82285
34,1.2026
35,-0.82285
36,1.2026
37,-0.82285
38,1.2026
39,-0.82285
40,-0.82285
41,1.2026
42,-0.82285
43,-0.82285
44,1.2026
45,-0.82285
46,-0.82285
47,1.2026
48,-0.82285
49,-0.82285
50,-0.82285
51,1.2026
52,-0.82285
53,1.2026
54,-0.82285
55,-0.82285
56,1.2026
57,-0.82285
58,-0.82285
59,1.2026
60,-0.82285
61,-0.82285
62,1.2026
63,-0.82285
64,-0.82285
65,1.2026
66,-0.82285
67,-0.82285
68,-0.82285
69,1.2026
70,-0.82285
71,1.2026
72,-0.82285
73,-0.82285
74,1.2026
75,-0.82285
76,1.2026
77,-0.82285
78,1.2026
79,-0.82285
80,1.2026
81,-0.82285
82,-0.82285
83,1.2026
84,-0.82285
85,1.2026
86,-0.82285
87,1.2026
88,-0.82285
89,1.2026
90,-0.82285
91,1.2026
92,-0.82285
93,-0.82285
94,1.2026
95,-0.82285
