time,value
0,-0.64172
1,-0.039715
2,2.1676
3,-0.039715
4,-0.64172
5,-0.64172
6,-0.64172
7,-0.64172
8,2.1676
9,0.76295
10,-0.64172
11,-0.64172
12,-0.64172
13,-0.64172
14,1.365
15,1.365
16,-0.64172
17,-0.64172
18,-0.64172
19,-0.64172
20,0.56229
21,2.1676
22,-0.64172
23,-0.64172
24,-0.64172
25,-0.64172
26,-0.24038
27,2.1676
28,0.16095
29,-0.64172
30,-0.64172
31,-0.64172
32,-0.64172
33,1.9669999999999999
34,0.76295
35,-0.64172
36,-0.64172
37,-0.64172
38,-0.64172
39,1.365
40,1.365
41,-0.64172
42,-0.64172
43,-0.64172
44,-0.64172
45,0.76295
46,2.1676
47,-0.64172
48,-0.64172
49,-0.64172
50,-0.64172
51,-0.64172
52,1.9669999999999999
53,0.96362
54,-0.64172
55,-0.64172
56,-0.64172
57,-0.64172
58,0.76295
59,1.9669999999999999
60,-0.64172
61,-0.64172
62,-0.64172
63,-0.64172
64,-0.24038
65,2.1676
66,0.16095
67,-0.64172
68,-0.64172
69,-0.64172
70,-0.64172
71,1.7663
72,1.1643
73,-0.64172
74,-0.64172
75,-0.64172
76,-0.64172
77,0.96362
78,1.9669999999999999
79,-0.64172
80,-0.64172
81,-0.64172
82,-0.64172
83,0.16095
84,2.1676
85,-0.039715
86,-0.64172
87,-0.64172
88,-0.64172
89,-0.24038
90,2.1676
91,0.36162
92,-0.64172
93,-0.64172
94,-0.64172
95,-0.64172
