time,value
0,-0.45155
1,-0.3911
2,-0.29318
3,-0.2515
4,-0.2367
5,-0.2422
6,-0.2495
7,-0.23986999999999997
8,-0.27146
9,-0.24949000000000002
10,-0.26473
11,-0.3
12,-0.32223
13,-0.33988
14,-0.37191
15,-0.33859
16,-0.3075
17,-0.29652
18,-0.28317
19,-0.26813000000000003
20,-0.24718
21,-0.35284
22,-0.33273
23,-0.29115
24,-0.54981
25,-1.3011
26,-1.6717
27,-1.2789
28,-1.4207
29,-2.06
30,-2.1333
31,-1.7897
32,-2.1806
33,-2.4413
34,-2.305
35,-2.214
36,-2.407
37,-2.4793
38,-2.2338
39,-1.9355
40,-1.9138
41,-1.7323
42,-1.6821
43,-1.3181
44,-1.0108
45,-0.70438
46,-0.76263
47,-0.26871999999999996
48,-0.060765
49,0.17862999999999998
50,0.33471
51,0.52079
52,0.63744
53,0.78718
54,0.80219
55,1.0393
56,1.1814
57,1.0629
58,1.3132
59,1.2502
60,1.334
61,1.2602
62,1.0682
63,1.1494
64,1.2541
65,1.0452
66,1.1263
67,0.8484200000000001
68,0.95186
69,0.97173
70,0.9572
71,1.1840000000000002
72,1.4785
73,2.103
74,2.0281
75,2.1898
76,2.1284
77,1.6511
78,1.4754
79,0.9605600000000001
80,0.5207
81,-0.033395999999999995
82,-0.49746999999999997
83,-0.82739
84,-1.0273
85,-1.0483
86,-1.041
87,-0.81188
88,-0.5715600000000001
89,-0.48246999999999995
90,-0.26445
91,-0.21891
92,0.091955
93,0.08943999999999999
94,0.16929
95,0.073723
96,0.19610999999999998
97,0.20239000000000001
98,0.45995
99,0.9071600000000001
100,0.67361
101,0.39044
102,0.24635
103,-0.012075
104,0.052339
105,-0.029604000000000002
106,-0.19415
107,-0.5707300000000001
108,-0.58033
109,-0.67581
110,-0.85183
111,-0.9112299999999999
112,-0.9196799999999999
113,-0.76569
114,-0.7539
115,-0.66398
116,-0.5047
117,-0.2803
118,-0.06857100000000001
119,0.082196
120,0.32006
121,0.75529
122,1.0744
123,1.2519
124,1.5878
125,1.8479
126,1.8496
127,2.065
128,1.671
129,2.6589
130,1.4769999999999999
131,1.0333
132,1.1749
133,1.0385
134,0.9991200000000001
135,0.8614299999999999
136,0.8294
137,0.9827
138,1.2119
139,1.4848
140,1.4521
141,1.4955
142,1.8043
143,1.9841
144,2.2374
145,1.9162
146,1.8607
147,1.7739
148,1.3323
149,1.0046
150,0.68208
151,0.45691000000000004
152,0.16913
153,-0.16922
154,-0.6190899999999999
155,-0.9862299999999999
156,-1.0579
157,-1.0945
158,-0.95455
159,-0.94314
160,-2.4787
161,-2.2202
162,-1.8993
163,-1.5562
164,-2.0401
165,-2.5581
166,-2.4557
167,-3.3074
168,-3.6618
169,-2.1714
170,-1.6317
171,-0.90454
172,-1.1909
173,-0.72648
174,-0.7141
175,-1.0742
176,-1.3718
177,-1.5519
178,-1.7324
179,-0.69801
180,-0.52493
181,-0.42218
182,-0.073789
183,0.13898
184,0.21927
185,0.13491
186,0.5654600000000001
187,0.66576
188,0.4705
189,0.44772
190,0.19941
191,-0.025689999999999998
192,0.12824000000000002
193,-0.11640999999999999
194,0.066751
195,0.17069
196,0.03545
197,0.18203
198,0.050547
199,-0.10091
200,-0.14587
201,-0.084951
202,-0.15194000000000002
203,-0.070437
204,0.087787
205,0.047106999999999996
206,0.037476
207,0.10645999999999999
208,0.10344
209,0.10985999999999999
210,0.10915
211,0.1408
212,0.21188
213,0.11513
214,0.1052
215,0.13382
216,0.18584
217,0.16385
218,0.11567000000000001
219,0.21589
220,0.24453000000000003
221,0.13774
222,0.1638
223,0.024378999999999998
224,0.10421
225,0.020372
226,0.20029
227,0.10962999999999999
228,0.09820599999999999
229,0.18967
230,0.10347999999999999
231,0.11055
232,0.12685
233,0.14495
234,0.14454
235,0.15420999999999999
236,0.22680999999999998
237,0.26894
238,0.2069
239,0.11915999999999999
240,0.24019000000000001
241,0.27724
242,0.21361
243,0.30411
244,0.2975
245,0.13391
246,0.21148000000000003
247,0.30413
248,0.20248
249,0.30603
250,0.31424
251,0.31056999999999996
252,0.20828000000000002
253,0.10745
254,0.14727
255,0.14572000000000002
256,0.15135
257,0.33299
258,0.16013
259,0.15669
260,0.16518
261,0.16898
262,0.15875
263,0.16062
264,0.16038
265,0.14667
266,0.16783
267,0.020868
268,0.31168
269,0.14841
270,0.14574
271,0.15225999999999998
272,0.15899000000000002
273,0.29168
274,0.33
275,0.16415
276,0.15875999999999998
277,0.15919
278,0.15392
279,0.15987
280,0.14742
281,0.14770999999999998
282,0.14581
283,0.30485999999999996
284,0.29396
285,0.16524
286,0.30627
287,0.30826
288,0.12641
289,0.131
290,0.27848
291,0.27763000000000004
292,0.11790999999999999
293,0.13333
294,0.13882
295,0.30469
296,0.29896
297,0.13122999999999999
298,0.11972000000000001
299,0.11719
