time,value
0,1.2990000000000002
1,0.2598
2,-0.96835
3,-0.96835
4,-0.96835
5,0.2598
6,1.2990000000000002
7,1.2045
8,-0.96835
9,-0.96835
10,-0.96835
11,-0.96835
12,0.73217
13,1.2990000000000002
14,0.92112
15,-0.96835
16,-0.96835
17,-0.96835
18,-0.96835
19,0.44875
20,1.2990000000000002
21,1.2045
22,-0.96835
23,-0.96835
24,-0.96835
25,-0.96835
26,0.44875
27,1.2990000000000002
28,1.2045
29,-0.49599
30,-0.96835
31,-0.96835
32,0.73217
33,1.2990000000000002
34,1.2045
35,-0.96835
36,-0.96835
37,-0.96835
38,0.73217
39,1.3935
40,0.44875
41,-0.96835
42,-0.96835
43,-0.96835
44,0.16533
45,1.3935
46,1.1101
47,-0.96835
48,-0.96835
49,-0.96835
50,-0.96835
51,0.6377
52,1.3935
53,1.2990000000000002
54,-0.11809000000000001
55,-0.96835
56,-0.96835
57,-0.96835
58,1.4880000000000002
59,1.2990000000000002
60,-0.023618
61,-0.96835
62,-0.96835
63,-0.96835
64,0.6377
65,1.3935
66,1.2990000000000002
67,-0.21256999999999998
68,-0.96835
69,-0.96835
70,-0.96835
71,1.0156
72,1.3935
73,1.2990000000000002
74,1.2045
75,-0.21256999999999998
76,-0.96835
77,-0.96835
78,0.35428000000000004
79,1.3935
80,1.2990000000000002
81,-0.49599
82,-0.96835
83,-0.96835
84,0.6377
85,1.2990000000000002
86,1.2990000000000002
87,-0.77941
88,-0.96835
89,-0.96835
90,0.54322
91,1.3935
92,0.6377
93,-0.96835
94,-0.96835
95,0.070855
