[<text>
<title>carmel container systems ltd&lt;kml&gt; year oper net</title>
<dateline>    new york, march 5 -
    </dateline>oper shr 1.18 dlrs vs 58 cts
    oper net 2,266,000 vs 1,037,000
    revs 45.8 mln vs 41.4 mln
    avg shrs 1,924,000 vs 1,800,000
    note: excludes gain of 73,000 dlrs vs 290,000 dlrs from
benefit of tax loss carryforward.
    results for tel aviv, israel-based company translated at
rate of one dlr to 1.485 new israeli shekels.
 reuter
</text>]