time,value
0,-0.10941
1,-0.10941
2,-0.10941
3,-0.10941
4,-0.10941
5,-0.10941
6,-0.10941
7,-0.10941
8,-0.10941
9,-0.10941
10,-0.10941
11,-0.10941
12,-0.10941
13,-0.10941
14,-0.10941
15,-0.10941
16,-0.10941
17,-0.10941
18,-0.10941
19,-0.10941
20,-0.10941
21,-0.10941
22,-0.10941
23,-0.10941
24,-0.10941
25,-0.10941
26,-0.10941
27,-0.10941
28,-0.10941
29,-0.10941
30,-0.10941
31,-0.10941
32,-0.10941
33,-0.10941
34,-0.10941
35,-0.10941
36,-0.10941
37,-0.10941
38,-0.10941
39,-0.10941
40,-0.10941
41,-0.10941
42,-0.10941
43,-0.10941
44,-0.10941
45,-0.10941
46,-0.10941
47,-0.10941
48,-0.10941
49,9.6694
50,0.61495
51,-0.10941
52,-0.10941
53,-0.10941
54,-0.10941
55,-0.10941
56,-0.10941
57,-0.10941
58,-0.10941
59,-0.10941
60,-0.10941
61,-0.10941
62,-0.10941
63,-0.10941
64,-0.10941
65,-0.10941
66,-0.10941
67,-0.10941
68,-0.10941
69,-0.10941
70,-0.10941
71,-0.10941
72,-0.10941
73,-0.10941
74,-0.10941
75,-0.10941
76,-0.10941
77,-0.10941
78,-0.10941
79,-0.10941
80,-0.10941
81,-0.10941
82,-0.10941
83,-0.10941
84,-0.10941
85,-0.10941
86,-0.10941
87,-0.10941
88,-0.10941
89,-0.10941
90,-0.10941
91,-0.10941
92,-0.10941
93,-0.10941
94,-0.10941
95,-0.10941
