time,value
0,1.1226
1,-0.93606
2,-0.93606
3,-0.31845
4,1.8432
5,0.19622
6,-0.93606
7,0.7108899999999999
8,-0.52432
9,-0.93606
10,-0.73019
11,0.81382
12,1.2256
13,1.3285
14,-0.93606
15,-0.93606
16,-0.62725
17,0.81382
18,-0.93606
19,-0.93606
20,-0.11258
21,1.7402
22,1.1226
23,-0.93606
24,-0.93606
25,-0.11258
26,0.19622
27,-0.93606
28,-0.93606
29,-0.62725
30,1.9461
31,0.91676
32,-0.93606
33,-0.93606
34,1.0197
35,-0.93606
36,-0.93606
37,0.60795
38,1.3285
39,-0.93606
40,0.91676
41,-0.93606
42,-0.93606
43,0.7108899999999999
44,-0.31845
45,1.9461
46,0.40209
47,-0.93606
48,-0.93606
49,-0.11258
50,0.29915
51,-0.93606
52,-0.93606
53,1.7402
54,0.91676
55,-0.93606
56,0.50502
57,-0.42139
58,-0.93606
59,0.40209
60,-0.31845
61,1.4314
62,1.2256
63,-0.93606
64,-0.93606
65,0.50502
66,-0.62725
67,-0.93606
68,-0.93606
69,0.91676
70,1.8432
71,0.60795
72,-0.93606
73,-0.93606
74,-0.52432
75,0.60795
76,0.7108899999999999
77,1.9461
78,-0.73019
79,-0.73019
80,0.91676
81,-0.93606
82,-0.93606
83,0.50502
84,1.9461
85,1.2256
86,-0.93606
87,-0.93606
88,1.1226
89,-0.93606
90,-0.93606
91,0.093284
92,1.8432
93,1.1226
94,-0.93606
95,-0.93606
