time,value
0,-2.3138
1,-2.3138
2,-2.3138
3,-2.3138
4,-2.3138
5,-2.316
6,-2.316
7,-2.316
8,-2.316
9,-2.3157
10,-2.3155
11,-2.3173
12,-2.3217
13,-2.3305
14,-2.33
15,-2.3291
16,-2.3281
17,-2.3273
18,-2.326
19,-2.3246
20,-2.3253
21,-2.3241
22,-2.3223
23,-2.3203
24,-2.3183
25,-2.3166
26,-2.3143
27,-2.3119
28,-2.3093
29,-2.3073
30,-2.3045
31,-2.3015
32,-2.3014
33,-2.3071
34,-2.312
35,-2.3086
36,-2.3061
37,-2.3025
38,-2.2989
39,-2.2951
40,-2.2922
41,-2.2882
42,-2.2862
43,-2.282
44,-2.2788
45,-2.2744
46,-2.2679
47,-2.2645
48,-2.2598
49,-2.2571
50,-2.2522
51,-2.2485
52,-2.2435
53,-2.2384
54,-2.2332
55,-2.2324
56,-2.2386
57,-2.2396
58,-2.2341
59,-2.2299
60,-2.2243
61,-2.2186
62,-2.2143
63,-2.2085
64,-2.2043
65,-2.1983
66,-2.1938
67,-2.1877
68,-2.1815
69,-2.1753
70,-2.1706
71,-2.1642
72,-2.1578
73,-2.1514
74,-2.1465
75,-2.1399
76,-2.1333
77,-2.1284
78,-2.1249
79,-2.1294
80,-2.1291
81,-2.1239
82,-2.117
83,-2.1101
84,-2.1031
85,-2.0978
86,-2.0908
87,-2.0836
88,-2.0765
89,-2.0711
90,-2.0639
91,-2.0566
92,-2.0512
93,-2.0438
94,-2.0365
95,-2.0291
96,-2.0235
97,-2.0161
98,-2.0086
99,-2.0011
100,-1.9954
101,-1.9909
102,-1.9838
103,-1.9768
104,-1.9712
105,-1.9636
106,-1.956
107,-1.9491
108,-1.9414
109,-1.9338
110,-1.9261
111,-1.9198
112,-1.9128
113,-1.9058
114,-1.8981
115,-1.8924
116,-1.8834
117,-1.8757
118,-1.8679
119,-1.8635
120,-1.8566
121,-1.8477
122,-1.8419
123,-1.8329
124,-1.8251
125,-1.8173
126,-1.8115
127,-1.8047
128,-1.7952
129,-1.7874
130,-1.7815
131,-1.7725
132,-1.7647
133,-1.7568
134,-1.7517
135,-1.745
136,-1.7387
137,-1.7328
138,-1.7237
139,-1.7159
140,-1.7107
141,-1.7052
142,-1.6997
143,-1.6918
144,-1.6840000000000002
145,-1.6769
146,-1.669
147,-1.6611
148,-1.6528
149,-1.6473
150,-1.6402
151,-1.6312
152,-1.6252
153,-1.6173
154,-1.6082
155,-1.6002
156,-1.5959
157,-1.5894
158,-1.5822
159,-1.5731
160,-1.5672
161,-1.5592
162,-1.5507
163,-1.5472
164,-1.5393
165,-1.5313
166,-1.5222
167,-1.5151
168,-1.5085
169,-1.5023
170,-1.4943
171,-1.4883
172,-1.4803
173,-1.4712
174,-1.4632
175,-1.4571
176,-1.4491
177,-1.4409
178,-1.4355
179,-1.4273
180,-1.4192
181,-1.4112
182,-1.4040000000000001
183,-1.396
184,-1.3879
185,-1.3806
186,-1.3773
187,-1.3702
188,-1.3621
189,-1.3529
190,-1.3469
191,-1.3388
192,-1.3307
193,-1.3254
194,-1.319
195,-1.3109
196,-1.3029
197,-1.2968
198,-1.2887
199,-1.2795
200,-1.2713
201,-1.2652
202,-1.2571
203,-1.2519
204,-1.2435
205,-1.2374
206,-1.2293
207,-1.2201
208,-1.214
209,-1.2058
210,-1.1976
211,-1.1914
212,-1.1893
213,-1.1801
214,-1.1719
215,-1.1637
216,-1.1576
217,-1.1484
218,-1.1402
219,-1.1320000000000001
220,-1.1258
221,-1.1197
222,-1.1125
223,-1.1063
224,-1.0981
225,-1.0899
226,-1.0817
227,-1.0755
228,-1.0662
229,-1.058
230,-1.0497
231,-1.0467
232,-1.0406
233,-1.0324
234,-1.0241
235,-1.0179
236,-1.0087
237,-1.0004
238,-0.9942200000000001
239,-0.98595
240,-0.9776600000000001
241,-0.9693700000000001
242,-0.96315
243,-0.95605
244,-0.9500299999999999
245,-0.9417399999999999
246,-0.93553
247,-0.9272299999999999
248,-0.9189299999999999
249,-0.90964
250,-0.90341
251,-0.8950799999999999
252,-0.88676
253,-0.8805
254,-0.87216
255,-0.8679899999999999
256,-0.8659
257,-0.8617299999999999
258,-0.8533700000000001
259,-0.8471
260,-0.84501
261,-0.83988
262,-0.8305600000000001
263,-0.82219
264,-0.81381
265,-0.80752
266,-0.79913
267,-0.7951699999999999
268,-0.79027
269,-0.78188
270,-0.77349
271,-0.76417
272,-0.7578699999999999
273,-0.74947
274,-0.74316
275,-0.74106
276,-0.73685
277,-0.72843
278,-0.7212
279,-0.71726
280,-0.71424
281,-0.70491
282,-0.69557
283,-0.68834
284,-0.68624
285,-0.68203
286,-0.6735899999999999
287,-0.66727
288,-0.65883
289,-0.6503800000000001
290,-0.64193
291,-0.63559
292,-0.63136
293,-0.6292399999999999
294,-0.6207699999999999
295,-0.61866
296,-0.61654
297,-0.60806
298,-0.6017
299,-0.59322
300,-0.58386
301,-0.58035
302,-0.57557
303,-0.5671
304,-0.5586300000000001
305,-0.55015
306,-0.54378
307,-0.5352899999999999
308,-0.5268
309,-0.5174300000000001
310,-0.5119199999999999
311,-0.50341
312,-0.4949
313,-0.48851000000000006
314,-0.47913
315,-0.47061000000000003
316,-0.46208
317,-0.45568000000000003
318,-0.44714
319,-0.4386
320,-0.43006000000000005
321,-0.42363999999999996
322,-0.41508999999999996
323,-0.40653
324,-0.39797
325,-0.39154
326,-0.38395
327,-0.37932
328,-0.3729
329,-0.36434
330,-0.35578000000000004
331,-0.34721
332,-0.34079
333,-0.33221
334,-0.32282
335,-0.31424
336,-0.3078
337,-0.29921
338,-0.29381
339,-0.28706
340,-0.28063
341,-0.27124000000000004
342,-0.26266
343,-0.25622
344,-0.25295
345,-0.2462
346,-0.23763
347,-0.2312
348,-0.22261999999999998
349,-0.21323000000000003
350,-0.20464000000000002
351,-0.19821
352,-0.1928
353,-0.18819
354,-0.17962
355,-0.17319
356,-0.16379000000000002
357,-0.15521
358,-0.14877
359,-0.14018
360,-0.13479000000000002
361,-0.12376
362,-0.11732000000000001
363,-0.10793
364,-0.099341
365,-0.096075
366,-0.091464
367,-0.08289400000000001
368,-0.073502
369,-0.064925
370,-0.057674
371,-0.052246
372,-0.046313
373,-0.039886000000000005
374,-0.030494
375,-0.021922
376,-0.015169
377,-0.010549
378,-0.0032989000000000004
379,0.0052651
380,0.013833000000000002
381,0.020262
382,0.029656000000000002
383,0.038231
384,0.044157
385,0.046626999999999995
386,0.054701
387,0.064093
388,0.066577
389,0.072046
390,0.0806
391,0.089155
392,0.095574
393,0.10497000000000001
394,0.11352999999999999
395,0.1221
396,0.12672
397,0.13004000000000002
398,0.13859000000000002
399,0.14715
400,0.1544
401,0.16297
402,0.17153
403,0.17795999999999998
404,0.18472
405,0.1872
406,0.19659000000000001
407,0.20301
408,0.21158000000000002
409,0.22015
410,0.22871999999999998
411,0.23515
412,0.24373000000000003
413,0.25231
414,0.26089
415,0.26815
416,0.27673000000000003
417,0.28533000000000003
418,0.29043
419,0.29581999999999997
420,0.30389
421,0.31246999999999997
422,0.31890999999999997
423,0.32831
424,0.3369
425,0.3455
426,0.3498
427,0.35195
428,0.36215
429,0.37156
430,0.37235999999999997
431,0.37961
432,0.38766999999999996
433,0.38982
434,0.39493
435,0.40352
436,0.40809
437,0.41267
438,0.41991999999999996
439,0.42851000000000006
440,0.4371
441,0.44355
442,0.45215
443,0.46155
444,0.47015
445,0.47581
446,0.48441999999999996
447,0.49303
448,0.5002800000000001
449,0.5089
450,0.51752
451,0.5261399999999999
452,0.53261
453,0.54123
454,0.54986
455,0.55516
456,0.55753
457,0.56615
458,0.57477
459,0.58124
460,0.59065
461,0.59928
462,0.6079100000000001
463,0.61438
464,0.62302
465,0.6283
466,0.63497
467,0.64144
468,0.65007
469,0.6587
470,0.66733
471,0.67381
472,0.68245
473,0.69109
474,0.69757
475,0.70622
476,0.71487
477,0.71983
478,0.7197
479,0.7225199999999999
480,0.7217600000000001
481,0.71875
482,0.7165100000000001
483,0.71353
484,0.71058
485,0.70911
486,0.7062
487,0.69965
488,0.69239
489,0.68586
490,0.67642
491,0.66772
492,0.66118
493,0.65683
494,0.6473899999999999
495,0.6379600000000001
496,0.62925
497,0.6219899999999999
498,0.61692
499,0.6089399999999999
500,0.60023
501,0.5936899999999999
502,0.58425
503,0.5755399999999999
504,0.569
505,0.56392
506,0.55886
507,0.55088
508,0.5443399999999999
509,0.53562
510,0.5261899999999999
511,0.51967
512,0.5153300000000001
513,0.5051800000000001
514,0.49868
515,0.49148000000000003
516,0.48422
517,0.47697
518,0.47197
519,0.46838
520,0.45893999999999996
521,0.45316999999999996
522,0.45028999999999997
523,0.44591000000000003
524,0.43717
525,0.42772
526,0.41828000000000004
527,0.41321
528,0.41031999999999996
529,0.40814
530,0.39939
531,0.39651
532,0.39651
533,0.39292
534,0.39084
535,0.38289
536,0.37345
537,0.37069
538,0.36713
539,0.35769
540,0.34892
541,0.34016
542,0.33359
543,0.32484
544,0.31608
545,0.30663
546,0.30007
547,0.29131999999999997
548,0.28257
549,0.27601
550,0.26727
551,0.2608
552,0.25364000000000003
553,0.24708000000000002
554,0.23764000000000002
555,0.22889
556,0.22163000000000002
557,0.21736
558,0.2131
559,0.20365
560,0.1979
561,0.19366
562,0.18791
563,0.17845999999999998
564,0.17559
565,0.17069
566,0.16276
567,0.15331
568,0.1513
569,0.14645
570,0.13766
571,0.12887
572,0.12228
573,0.11283
574,0.10405
575,0.09526699999999999
576,0.08868200000000001
577,0.07990499999999999
578,0.073499
579,0.069299
580,0.064238
581,0.055453999999999996
582,0.046002
583,0.039415
584,0.034554
585,0.028173
586,0.01938
587,0.012789
588,0.0040000999999999995
589,-0.004785899999999999
590,-0.013569999999999999
591,-0.020825
592,-0.029606
593,-0.038385
594,-0.044968
595,-0.053739999999999996
596,-0.062513
597,-0.071283
598,-0.07551000000000001
599,-0.080397
600,-0.089176
601,-0.098628
602,-0.10520999999999998
603,-0.11398
604,-0.11887
605,-0.12307
606,-0.12966
607,-0.13910999999999998
608,-0.14789000000000002
609,-0.15448
610,-0.15715
611,-0.16353
612,-0.17232
613,-0.17957
614,-0.18837
615,-0.19562000000000002
616,-0.20046
617,-0.20397
618,-0.21277
619,-0.22221999999999997
620,-0.23101999999999998
621,-0.23606999999999997
622,-0.24089000000000002
623,-0.24659
624,-0.2532
625,-0.26265
626,-0.27146
627,-0.27781
628,-0.28195
629,-0.2892
630,-0.29866
631,-0.30341999999999997
632,-0.30532
633,-0.31414000000000003
634,-0.32297
635,-0.33243
636,-0.33904
637,-0.34157
638,-0.34786999999999996
639,-0.35512
640,-0.36236999999999997
641,-0.36485
642,-0.36608
643,-0.36669
644,-0.36851999999999996
645,-0.36972
646,-0.37032
647,-0.37211
648,-0.37446999999999997
649,-0.37679
650,-0.37686
651,-0.37019
652,-0.3613
653,-0.35296
654,-0.34628000000000003
655,-0.34628000000000003
656,-0.34793
657,-0.33901
658,-0.33286
659,-0.32394
660,-0.31725
661,-0.31715
662,-0.31649
663,-0.30755
664,-0.30188000000000004
665,-0.3017
666,-0.29823
667,-0.28976999999999997
668,-0.28529
669,-0.28529
670,-0.27633
671,-0.26737
672,-0.2584
673,-0.25616
674,-0.25217
675,-0.2432
676,-0.23423000000000002
677,-0.2275
678,-0.21853000000000003
679,-0.20955
680,-0.20058
681,-0.19881
682,-0.19847
683,-0.19266
684,-0.18592
685,-0.18506
686,-0.18463
687,-0.17563
688,-0.16888
689,-0.16032000000000002
690,-0.15131
691,-0.14906
692,-0.14681
693,-0.1378
694,-0.13555
695,-0.12879000000000002
696,-0.12203
697,-0.11302000000000001
698,-0.10400999999999999
699,-0.097248
700,-0.08823500000000001
701,-0.078786
702,-0.06977
703,-0.06300800000000001
704,-0.053989999999999996
705,-0.044973
706,-0.035952
707,-0.028758999999999996
708,-0.024777
709,-0.017143000000000002
710,-0.008129899999999999
711,-0.0013709000000000002
712,0.0080791
713,0.017092
714,0.023854
715,0.029231
716,0.033243
717,0.040443
718,0.047643
719,0.053485000000000005
720,0.053485000000000005
721,0.062488999999999996
722,0.069244
723,0.078695
724,0.088147
725,0.093545
726,0.09579700000000001
727,0.1003
728,0.10705
729,0.10705
730,0.1093
731,0.11830999999999998
732,0.12730999999999998
733,0.13407
734,0.14352
735,0.15253
736,0.16154000000000002
737,0.16829000000000002
738,0.1773
739,0.18313
740,0.18492
741,0.19167
742,0.20068
743,0.20968
744,0.21688000000000002
745,0.22589
746,0.2349
747,0.23849
748,0.24209
749,0.2493
750,0.2583
751,0.2673
752,0.27405
753,0.2835
754,0.2925
755,0.29925999999999997
756,0.30826
757,0.31411
758,0.32043
759,0.32716999999999996
760,0.33616999999999997
761,0.34517
762,0.35417
763,0.36091999999999996
764,0.36991999999999997
765,0.37938
766,0.38838
767,0.39513000000000004
768,0.40413000000000004
769,0.41313999999999995
770,0.4199
771,0.4244
772,0.4271
773,0.43655
774,0.44375
775,0.4487
776,0.45635
777,0.4631
778,0.46535
779,0.46985
780,0.47841000000000006
781,0.48653
782,0.49285
783,0.5018600000000001
784,0.50412
785,0.5032399999999999
786,0.51226
787,0.52127
788,0.5302899999999999
789,0.53705
790,0.5460699999999999
791,0.55509
792,0.56411
793,0.57045
794,0.57948
795,0.5885
796,0.59795
797,0.6047100000000001
798,0.61374
799,0.6227600000000001
800,0.62954
801,0.63856
802,0.64166
803,0.6456
804,0.65054
805,0.65956
806,0.66859
807,0.67761
808,0.6848
809,0.69382
810,0.70285
811,0.71187
812,0.71638
813,0.71864
814,0.72315
815,0.72992
816,0.73895
817,0.73979
818,0.74246
819,0.74965
820,0.7591
821,0.76813
822,0.77264
823,0.7749
824,0.77799
825,0.7870199999999999
826,0.79604
827,0.80281
828,0.81184
829,0.8212799999999999
830,0.82805
831,0.8370799999999999
832,0.84611
833,0.85514
834,0.8619100000000001
835,0.8709399999999999
836,0.8799600000000001
837,0.8857299999999999
838,0.8869799999999999
839,0.89643
840,0.90546
841,0.91448
842,0.92125
843,0.9302799999999999
844,0.9397200000000001
845,0.9464899999999999
846,0.95552
847,0.96455
848,0.9735799999999999
849,0.98035
850,0.9893799999999999
851,0.9984200000000001
852,1.0074
853,1.0142
854,1.0233
855,1.0323
856,1.0413
857,1.0481
858,1.0571
859,1.0662
860,1.073
861,1.082
862,1.0906
863,1.0997
864,1.1064
865,1.1087
866,1.1132
867,1.12
868,1.1223
869,1.1268
870,1.1358
871,1.1449
872,1.1521
873,1.1578
874,1.1639
875,1.1707
876,1.1797
877,1.1888
878,1.1978
879,1.2046
880,1.2136
881,1.2227
882,1.2317
883,1.2385
884,1.2475
885,1.2539
886,1.2546
887,1.2561
888,1.2651
889,1.2742
890,1.281
891,1.29
892,1.2987
893,1.3051
894,1.3062
895,1.3074
896,1.3164
897,1.3255
898,1.3319
899,1.3384
900,1.3369
901,1.3377
902,1.3367
903,1.3379
904,1.3466
905,1.3508
906,1.3494
907,1.3481
908,1.3467
909,1.3458
910,1.3445
911,1.3432
912,1.3419
913,1.341
914,1.3336
915,1.3241
916,1.3232
917,1.3223
918,1.3189
919,1.3177
920,1.3106
921,1.3012
922,1.3
923,1.2946
924,1.2878
925,1.2807
926,1.2773
927,1.2742
928,1.2674
929,1.2583
930,1.2491
931,1.24
932,1.2329
933,1.2238
934,1.2147
935,1.2078
936,1.2033
937,1.2009999999999998
938,1.1942
939,1.1871
940,1.1822
941,1.1774
942,1.1677
943,1.1609
944,1.1521
945,1.1503
946,1.146
947,1.1395
948,1.1304
949,1.1275
950,1.125
951,1.1179
952,1.1085
953,1.0991
954,1.0945
955,1.0923
956,1.0874
957,1.078
958,1.0758
959,1.0735
960,1.0638
961,1.0544
962,1.0519
963,1.0493
964,1.042
965,1.0374
966,1.0349
967,1.0257
968,1.0186
969,1.0156
970,1.0102
971,1.0011
972,0.99198
973,0.98514
974,0.9760200000000001
975,0.9669
976,0.95778
977,0.95094
978,0.9418200000000001
979,0.93269
980,0.92586
981,0.9167299999999999
982,0.90761
983,0.89849
984,0.89139
985,0.8822700000000001
986,0.87315
987,0.86403
988,0.85719
989,0.8480700000000001
990,0.83895
991,0.8336
992,0.8305299999999999
993,0.8234299999999999
994,0.8143100000000001
995,0.80747
996,0.79835
997,0.78923
998,0.7801100000000001
999,0.77327
1000,0.7641399999999999
1001,0.75502
1002,0.7459
1003,0.73906
1004,0.72995
1005,0.72082
1006,0.7117100000000001
1007,0.7046
1008,0.69548
1009,0.6863600000000001
1010,0.67952
1011,0.6704100000000001
1012,0.6612899999999999
1013,0.65217
1014,0.64936
1015,0.64374
1016,0.63664
1017,0.62752
1018,0.62068
1019,0.61129
1020,0.60217
1021,0.59305
1022,0.59227
1023,0.58694
1024,0.5775600000000001
1025,0.57072
1026,0.5616
1027,0.5522199999999999
1028,0.54309
1029,0.53625
1030,0.52713
1031,0.51775
1032,0.51446
1033,0.51169
1034,0.50256
1035,0.49318
1036,0.48406000000000005
1037,0.47925
1038,0.47600000000000003
1039,0.47096000000000005
1040,0.46411
1041,0.45498
1042,0.44585
1043,0.43648000000000003
1044,0.42963
1045,0.42278000000000004
1046,0.4205
1047,0.41546000000000005
1048,0.40836999999999996
1049,0.39901
1050,0.39649
1051,0.38918
1052,0.38461
1053,0.38233
1054,0.37548000000000004
1055,0.36863
1056,0.35949000000000003
1057,0.35013
1058,0.34099
1059,0.33414
1060,0.32911999999999997
1061,0.32593
1062,0.31886
1063,0.312
1064,0.30287
1065,0.29373
1066,0.28686999999999996
1067,0.27774
1068,0.26838
1069,0.25924
1070,0.25239
1071,0.24325
1072,0.23410999999999998
1073,0.22498
1074,0.21811999999999998
1075,0.20922
1076,0.20008
1077,0.19095
1078,0.1841
1079,0.17473
1080,0.1656
1081,0.15875
1082,0.14961
1083,0.14048
1084,0.13134
1085,0.12449
1086,0.11535999999999999
1087,0.10828
1088,0.10507999999999999
1089,0.10028
1090,0.091147
1091,0.08201
1092,0.072872
1093,0.06602100000000001
1094,0.056659
1095,0.047522
1096,0.047522
1097,0.045238
1098,0.038387
1099,0.031536
1100,0.031536
1101,0.022401
1102,0.013266
1103,0.0041311
1104,-0.0027199000000000004
1105,-0.011855
1106,-0.020988
1107,-0.030123
1108,-0.036972000000000005
1109,-0.043823
1110,-0.046106
1111,-0.050672
1112,-0.05752
1113,-0.059803999999999996
1114,-0.068937
1115,-0.075786
1116,-0.084918
1117,-0.09404900000000001
1118,-0.10342
1119,-0.11027
1120,-0.1194
1121,-0.12853
1122,-0.13175
1123,-0.13244
1124,-0.13560999999999998
1125,-0.13876
1126,-0.14583
1127,-0.15269000000000002
1128,-0.1558
1129,-0.16097
1130,-0.16783
1131,-0.17718
1132,-0.17718
1133,-0.17757
1134,-0.17814000000000002
1135,-0.17887
1136,-0.17958
1137,-0.17975
1138,-0.17992
1139,-0.17829
1140,-0.17402
1141,-0.16715
1142,-0.158
1143,-0.14899
1144,-0.13982999999999998
1145,-0.13296
1146,-0.1238
1147,-0.12439000000000001
1148,-0.12022999999999999
1149,-0.11335999999999999
1150,-0.10419
1151,-0.095029
1152,-0.085999
1153,-0.079125
1154,-0.070094
1155,-0.068315
1156,-0.06626699999999999
1157,-0.057098
1158,-0.04805
1159,-0.038881
1160,-0.034529000000000004
1161,-0.032677
1162,-0.028197000000000003
1163,-0.019025
1164,-0.01225
1165,-0.0030779
1166,0.0035040999999999996
1167,0.0031351
1168,0.010015999999999999
1169,0.019190000000000002
1170,0.028276999999999997
1171,0.035158
1172,0.0372
1173,0.039188
1174,0.048364
1175,0.055245
1176,0.064421
1177,0.073598
1178,0.082703
1179,0.089586
1180,0.098762
1181,0.10794000000000001
1182,0.11023
1183,0.11252999999999999
1184,0.1217
1185,0.12629
1186,0.12629
1187,0.13317
1188,0.14235
1189,0.15153
1190,0.15841
1191,0.16759000000000002
1192,0.17676
1193,0.18594000000000002
1194,0.19282
1195,0.20199999999999999
1196,0.21118
1197,0.22035
1198,0.22724
1199,0.23640999999999998
1200,0.24566
1201,0.25254
1202,0.26172
1203,0.27089
1204,0.28007
1205,0.28695
1206,0.28946
1207,0.29206
1208,0.30123
1209,0.30811
1210,0.31729
1211,0.32646
1212,0.33564
1213,0.34252
1214,0.35176999999999997
1215,0.36095
1216,0.36783000000000005
1217,0.37701
1218,0.38175
1219,0.38634
1220,0.39321999999999996
1221,0.4024
1222,0.41157
1223,0.42075
1224,0.42303999999999997
1225,0.42526
1226,0.43435
1227,0.44353000000000004
1228,0.45041000000000003
1229,0.45958999999999994
1230,0.46876
1231,0.47563999999999995
1232,0.48482
1233,0.4917
1234,0.49399
1235,0.50088
1236,0.51005
1237,0.51464
1238,0.51923
1239,0.5261100000000001
1240,0.53528
1241,0.54446
1242,0.5536399999999999
1243,0.5604399999999999
1244,0.56962
1245,0.5788
1246,0.58568
1247,0.59486
1248,0.6040300000000001
1249,0.6086199999999999
1250,0.6086199999999999
1251,0.61773
1252,0.62225
1253,0.62454
1254,0.63142
1255,0.6406
1256,0.64289
1257,0.64762
1258,0.6545
1259,0.6568
1260,0.6613899999999999
1261,0.66827
1262,0.67745
1263,0.68655
1264,0.6957300000000001
1265,0.7026100000000001
1266,0.7117899999999999
1267,0.71631
1268,0.71841
1269,0.723
1270,0.73217
1271,0.74135
1272,0.75053
1273,0.75741
1274,0.76647
1275,0.76876
1276,0.7710600000000001
1277,0.77794
1278,0.7871199999999999
1279,0.79171
1280,0.794
1281,0.80318
1282,0.8123600000000001
1283,0.8215399999999999
1284,0.82842
1285,0.83754
1286,0.84672
1287,0.8559
1288,0.8627799999999999
1289,0.8650700000000001
1290,0.86966
1291,0.87655
1292,0.8857299999999999
1293,0.8949
1294,0.8972
1295,0.89944
1296,0.9086200000000001
1297,0.91779
1298,0.9269700000000001
1299,0.93386
1300,0.9430299999999999
1301,0.95221
1302,0.95435
1303,0.9565100000000001
1304,0.9656899999999999
1305,0.9748600000000001
1306,0.98175
1307,0.99093
1308,1.0001
1309,1.0093
1310,1.0162
1311,1.0254
1312,1.0345
1313,1.0415
1314,1.0439
1315,1.0463
1316,1.0555
1317,1.0647
1318,1.0716
1319,1.0808
1320,1.09
1321,1.0969
1322,1.1061
1323,1.1152
1324,1.1244
1325,1.1313
1326,1.1336
1327,1.1405
1328,1.1497
1329,1.1566
1330,1.1589
1331,1.1659
1332,1.1752
1333,1.1821
1334,1.1888
1335,1.1911
1336,1.1933
1337,1.2024
1338,1.2116
1339,1.2139
1340,1.2139
1341,1.2231
1342,1.2323
1343,1.2414
1344,1.2483
1345,1.2575
1346,1.2667
1347,1.2759
1348,1.2804
1349,1.2827
1350,1.2896
1351,1.2965
1352,1.3034
1353,1.3057
1354,1.3126
1355,1.3195
1356,1.3286
1357,1.3378
1358,1.347
1359,1.3539
1360,1.3631
1361,1.3722
1362,1.3791
1363,1.3882
1364,1.3974
1365,1.4066
1366,1.4135
1367,1.4227
1368,1.4319
1369,1.4411
1370,1.4480000000000002
1371,1.4571
1372,1.4663
1373,1.4754
1374,1.4823
1375,1.4915
1376,1.5007
1377,1.5076
1378,1.5167
1379,1.5236
1380,1.5257
1381,1.5279
1382,1.5371
1383,1.5462
1384,1.5554
1385,1.5599
1386,1.5621
1387,1.5712
1388,1.5781
1389,1.578
1390,1.5825
1391,1.5917
1392,1.5963
1393,1.5962
1394,1.5984
1395,1.5984
1396,1.5984
1397,1.6007
1398,1.6030000000000002
1399,1.6077
1400,1.6077
1401,1.6077
1402,1.6077
1403,1.6078
1404,1.6055
1405,1.6033
1406,1.5988
1407,1.5988
1408,1.5989
1409,1.5991
1410,1.5992
1411,1.5994
1412,1.5973
1413,1.5975
1414,1.5977
1415,1.5979
1416,1.5911
1417,1.5819999999999999
1418,1.5823
1419,1.5802
1420,1.5806
1421,1.5786
1422,1.5717
1423,1.5626
1424,1.5535
1425,1.5467
1426,1.5446
1427,1.5403
1428,1.5312
1429,1.5219999999999998
1430,1.5152
1431,1.5109
1432,1.5090000000000001
1433,1.5
1434,1.4931
1435,1.4913
1436,1.4847
1437,1.4778
1438,1.4687
1439,1.4595
1440,1.4503
1441,1.4436
1442,1.4344
1443,1.4252
1444,1.4209
1445,1.419
1446,1.4146
1447,1.4055
1448,1.3963
1449,1.3894
1450,1.3803
1451,1.3711
1452,1.3642
1453,1.3551
1454,1.3459
1455,1.3367
1456,1.3299
1457,1.3207
1458,1.3115
1459,1.3024
1460,1.2956
1461,1.2865
1462,1.2773
1463,1.2681
1464,1.2613
1465,1.2521
1466,1.2429
1467,1.236
1468,1.2269
1469,1.2177
1470,1.2086
1471,1.2015
1472,1.1924
1473,1.1832
1474,1.1741
1475,1.1672
1476,1.158
1477,1.1488
1478,1.1420000000000001
1479,1.1397
1480,1.1351
1481,1.1282
1482,1.1259
1483,1.1236
1484,1.1145
1485,1.1053
1486,1.0984
1487,1.0893
1488,1.0801
1489,1.071
1490,1.0641
1491,1.0549
1492,1.0458
1493,1.0366
1494,1.032
1495,1.0297
1496,1.0206
1497,1.0183
1498,1.016
1499,1.0091
1500,0.9999299999999999
1501,0.99306
1502,0.9839
1503,0.9747299999999999
1504,0.96557
1505,0.9587
1506,0.9495399999999999
1507,0.94037
1508,0.93121
1509,0.9243399999999999
1510,0.9151799999999999
1511,0.90601
1512,0.8991399999999999
1513,0.8899799999999999
1514,0.88082
1515,0.87166
1516,0.86493
1517,0.85562
1518,0.8466100000000001
1519,0.83745
1520,0.8305799999999999
1521,0.8214100000000001
1522,0.81225
1523,0.80309
1524,0.79851
1525,0.79684
1526,0.79502
1527,0.78815
1528,0.779
1529,0.76984
1530,0.76068
1531,0.7538100000000001
1532,0.7448199999999999
1533,0.7356600000000001
1534,0.72651
1535,0.71964
1536,0.71048
1537,0.7013199999999999
1538,0.69217
1539,0.6853
1540,0.67614
1541,0.66699
1542,0.6601199999999999
1543,0.65096
1544,0.64181
1545,0.63265
1546,0.62579
1547,0.61663
1548,0.60748
1549,0.59832
1550,0.59655
1551,0.5948
1552,0.5858300000000001
1553,0.57668
1554,0.56981
1555,0.56066
1556,0.5515100000000001
1557,0.54465
1558,0.5355
1559,0.52635
1560,0.5172
1561,0.5103300000000001
1562,0.5011800000000001
1563,0.49203
1564,0.48288000000000003
1565,0.47602
1566,0.46687
1567,0.45771999999999996
1568,0.44856999999999997
1569,0.44171000000000005
1570,0.43256000000000006
1571,0.42341000000000006
1572,0.41655
1573,0.4074
1574,0.39825
1575,0.38911
1576,0.38225
1577,0.3731
1578,0.36395
1579,0.3567
1580,0.35384
1581,0.3489
1582,0.33974
1583,0.33041
1584,0.32355
1585,0.31439
1586,0.30524
1587,0.29838000000000003
1588,0.28923000000000004
1589,0.28008
1590,0.27093
1591,0.26406999999999997
1592,0.25492
1593,0.24577
1594,0.24274
1595,0.23990999999999998
1596,0.23075
1597,0.2216
1598,0.21227
1599,0.20540999999999998
1600,0.19625
1601,0.18903
1602,0.18623
1603,0.1836
1604,0.17444
1605,0.16529000000000002
1606,0.15842
1607,0.14926
1608,0.14010999999999998
1609,0.13078
1610,0.12392
1611,0.11475999999999999
1612,0.1056
1613,0.09644900000000001
1614,0.089581
1615,0.080428
1616,0.071273
1617,0.06440499999999999
1618,0.05982899999999999
1619,0.05754
1620,0.052961
1621,0.046097000000000006
1622,0.043808
1623,0.039229
1624,0.030076
1625,0.023385
1626,0.014232
1627,0.010014
1628,0.0084641
1629,0.0040781
1630,-0.0048798999999999995
1631,-0.0065809
1632,-0.008262899999999998
1633,-0.016996
1634,-0.023431999999999998
1635,-0.022569
1636,-0.024187
1637,-0.023271
1638,-0.027371
1639,-0.036501
1640,-0.04335
1641,-0.052242
1642,-0.061372
1643,-0.070502
1644,-0.074824
1645,-0.076116
1646,-0.08017
1647,-0.087014
1648,-0.086757
1649,-0.086757
1650,-0.08623600000000001
1651,-0.08544199999999999
1652,-0.08544199999999999
1653,-0.08544199999999999
1654,-0.08061499999999999
1655,-0.073777
1656,-0.06465900000000001
1657,-0.055273
1658,-0.052182000000000006
1659,-0.049074
1660,-0.039962
1661,-0.030848
1662,-0.023735
1663,-0.014622999999999999
1664,-0.0055089
1665,0.0018820999999999998
1666,0.0050061
1667,0.01241
1668,0.022093
1669,0.023268
1670,0.026443
1671,0.027663999999999998
1672,0.033147
1673,0.040283
1674,0.04578
1675,0.049344
1676,0.058433000000000006
1677,0.065248
1678,0.074663
1679,0.083749
1680,0.092838
1681,0.09965700000000001
1682,0.1042
1683,0.1042
1684,0.11329000000000002
1685,0.11556
1686,0.11784000000000001
1687,0.12465
1688,0.13147
1689,0.14056
1690,0.14966
1691,0.15875
1692,0.16557
1693,0.17465999999999998
1694,0.18375999999999998
1695,0.19285
1696,0.19967000000000001
1697,0.20876999999999998
1698,0.21331999999999998
1699,0.22014
1700,0.22469
1701,0.22696
1702,0.23606
1703,0.24288
1704,0.25229
1705,0.26139
1706,0.27048
1707,0.27731
1708,0.28444
1709,0.28796
1710,0.29509
1711,0.30191
1712,0.31101
1713,0.3201
1714,0.3292
1715,0.33602
1716,0.34512
1717,0.35420999999999997
1718,0.36104
1719,0.37013
1720,0.37923
1721,0.38864
1722,0.39546
1723,0.40456
1724,0.41366
1725,0.42276
1726,0.42958
1727,0.43278
1728,0.43628999999999996
1729,0.44538999999999995
1730,0.45221000000000006
1731,0.46131000000000005
1732,0.47071
1733,0.47753999999999996
1734,0.48663
1735,0.48983999999999994
1736,0.49338999999999994
1737,0.50021
1738,0.5093
1739,0.51839
1740,0.5274800000000001
1741,0.5343
1742,0.5433899999999999
1743,0.5528
1744,0.5619
1745,0.56872
1746,0.57781
1747,0.5869
1748,0.59373
1749,0.60282
1750,0.61192
1751,0.61905
1752,0.62227
1753,0.6277699999999999
1754,0.63686
1755,0.64595
1756,0.65277
1757,0.66186
1758,0.67127
1759,0.68037
1760,0.68719
1761,0.69628
1762,0.7053699999999999
1763,0.71219
1764,0.72129
1765,0.73038
1766,0.73948
1767,0.7463
1768,0.7554
1769,0.76449
1770,0.77359
1771,0.78041
1772,0.7855800000000001
1773,0.7891100000000001
1774,0.79852
1775,0.80534
1776,0.81443
1777,0.8235299999999999
1778,0.83034
1779,0.83944
1780,0.84885
1781,0.8579399999999999
1782,0.8647600000000001
1783,0.8738600000000001
1784,0.8829600000000001
1785,0.89205
1786,0.8988700000000001
1787,0.90797
1788,0.91707
1789,0.92617
1790,0.93299
1791,0.94209
1792,0.95119
1793,0.95801
1794,0.96711
1795,0.97621
1796,0.98531
1797,0.99213
1798,1.0012
1799,1.0103
1800,1.0194
1801,1.026
1802,1.0354
1803,1.0442
1804,1.0533
1805,1.0601
1806,1.0692
1807,1.0783
1808,1.0851
1809,1.0942
1810,1.1033
1811,1.1125
1812,1.1193
1813,1.1287
1814,1.1378
1815,1.1469
1816,1.1537
1817,1.1628
1818,1.1702
1819,1.1737
1820,1.1808
1821,1.1899
1822,1.199
1823,1.2059
1824,1.2153
1825,1.2244
1826,1.2335
1827,1.2403
1828,1.2454
1829,1.2489
1830,1.2583
1831,1.2654
1832,1.2689
1833,1.2721
1834,1.2812
1835,1.2884
1836,1.2975
1837,1.3066
1838,1.3134
1839,1.3228
1840,1.3263
1841,1.3338
1842,1.3409
1843,1.3441
1844,1.3477
1845,1.3568
1846,1.3617
1847,1.3675
1848,1.3708
1849,1.3802
1850,1.3854
1851,1.3868
1852,1.3882
1853,1.3892
1854,1.3906
1855,1.392
1856,1.3935
1857,1.3946
1858,1.3961
1859,1.3976
1860,1.3968
1861,1.3927
1862,1.3844
1863,1.3859
1864,1.3853
1865,1.3865
1866,1.3854
1867,1.3768
1868,1.3727
1869,1.3743
1870,1.376
1871,1.3754
1872,1.374
1873,1.365
1874,1.3564
1875,1.3473
1876,1.3433
1877,1.3427
1878,1.3369
1879,1.3278
1880,1.3215
1881,1.3125
1882,1.3116
1883,1.3107
1884,1.3044
1885,1.2954
1886,1.2868
1887,1.2801
1888,1.2765
1889,1.2784
1890,1.2698
1891,1.2631
1892,1.2541
1893,1.2451
1894,1.2361
1895,1.2294
1896,1.2209
1897,1.2119
1898,1.2051
1899,1.1962
1900,1.1872
1901,1.1782
1902,1.1742
1903,1.1739
1904,1.1704
1905,1.1614
1906,1.1547
1907,1.1457
1908,1.1367
1909,1.1278
1910,1.121
1911,1.1121
1912,1.1036
1913,1.0969
1914,1.0879
1915,1.079
1916,1.07
1917,1.0633
1918,1.0543
1919,1.0454
1920,1.0364
1921,1.0297
1922,1.0207
1923,1.0118
1924,1.0028
1925,0.9961200000000001
1926,0.98666
1927,0.9777
1928,0.9709899999999999
1929,0.96204
1930,0.9531
1931,0.94415
1932,0.9381299999999999
1933,0.93385
1934,0.9249
1935,0.91595
1936,0.9092399999999999
1937,0.8997700000000001
1938,0.8908299999999999
1939,0.8818799999999999
1940,0.8751700000000001
1941,0.8662200000000001
1942,0.8572700000000001
1943,0.85057
1944,0.84162
1945,0.83268
1946,0.8237399999999999
1947,0.81703
1948,0.80809
1949,0.79916
1950,0.79022
1951,0.78352
1952,0.77458
1953,0.76565
1954,0.75672
1955,0.75002
1956,0.7410899999999999
1957,0.73216
1958,0.72546
1959,0.71654
1960,0.7076100000000001
1961,0.6986899999999999
1962,0.69199
1963,0.68307
1964,0.67415
1965,0.66523
1966,0.65854
1967,0.64963
1968,0.64071
1969,0.63403
1970,0.62511
1971,0.6162
1972,0.60729
1973,0.6006100000000001
1974,0.5917
1975,0.5828
1976,0.57389
1977,0.56721
1978,0.5583100000000001
1979,0.5494100000000001
1980,0.54051
1981,0.53383
1982,0.52494
1983,0.5160399999999999
1984,0.50937
1985,0.50048
1986,0.49158999999999997
1987,0.4827
1988,0.47603
1989,0.46713999999999994
1990,0.45826000000000006
1991,0.44938
1992,0.44271000000000005
1993,0.43488999999999994
1994,0.43036
1995,0.42312
1996,0.41646000000000005
1997,0.40757
1998,0.39868000000000003
1999,0.39202
2000,0.38314000000000004
2001,0.37425
2002,0.36537
2003,0.35871
2004,0.34984
2005,0.34096
2006,0.33209
2007,0.32543
2008,0.31597
2009,0.3071
2010,0.29823
2011,0.29158
2012,0.28271
2013,0.27385
2014,0.27044
2015,0.26585
2016,0.25861
2017,0.24973
2018,0.24308000000000002
2019,0.23421
2020,0.22535
2021,0.21648
2022,0.20983000000000002
2023,0.20037
2024,0.19150999999999999
2025,0.18265
2026,0.17601
2027,0.16715
2028,0.1593
2029,0.15528
2030,0.14744000000000002
2031,0.13857
2032,0.12971
2033,0.12307
2034,0.11420999999999999
2035,0.10535
2036,0.09589099999999999
2037,0.089251
2038,0.08039600000000001
2039,0.071546
2040,0.062698
2041,0.056062
2042,0.047217
2043,0.038375
2044,0.031744999999999995
2045,0.029533999999999998
2046,0.025113999999999997
2047,0.016275
2048,0.0096491
2049,0.00081409
2050,-0.0036019
2051,-0.0080179
2052,-0.014639
2053,-0.023469
2054,-0.032293999999999996
2055,-0.041117
2056,-0.047734
2057,-0.05655399999999999
2058,-0.06473
2059,-0.07134
2060,-0.080151
2061,-0.08896
2062,-0.09776699999999999
2063,-0.10437
2064,-0.11317
2065,-0.12132000000000001
2066,-0.12087
2067,-0.12393
2068,-0.13271
2069,-0.14149
2070,-0.15027000000000001
2071,-0.15685
2072,-0.16562000000000002
2073,-0.17439000000000002
2074,-0.18095999999999998
2075,-0.18972
2076,-0.19848
2077,-0.20724
2078,-0.21381
2079,-0.22255999999999998
2080,-0.23131
2081,-0.23936
2082,-0.24591999999999997
2083,-0.25466
2084,-0.26339
2085,-0.27213000000000004
2086,-0.27867
2087,-0.2874
2088,-0.29613
2089,-0.30267
2090,-0.31139
2091,-0.32011
2092,-0.32882
2093,-0.33535
2094,-0.34333
2095,-0.34257
2096,-0.3476
2097,-0.35336999999999996
2098,-0.36205
2099,-0.37072
2100,-0.37203
2101,-0.37266
2102,-0.38055
2103,-0.38919000000000004
2104,-0.39566999999999997
2105,-0.40431
2106,-0.41217
2107,-0.41785
2108,-0.41763999999999996
2109,-0.41741000000000006
2110,-0.42601000000000006
2111,-0.43461000000000005
2112,-0.44025
2113,-0.44588999999999995
2114,-0.44476000000000004
2115,-0.4474
2116,-0.45383
2117,-0.46238999999999997
2118,-0.47011000000000003
2119,-0.47438
2120,-0.47315
2121,-0.47486999999999996
2122,-0.48339
2123,-0.48978
2124,-0.49828999999999996
2125,-0.50594
2126,-0.51444
2127,-0.51694
2128,-0.51767
2129,-0.5210199999999999
2130,-0.52949
2131,-0.53494
2132,-0.54128
2133,-0.5385800000000001
2134,-0.53586
2135,-0.53222
2136,-0.52854
2137,-0.52484
2138,-0.52204
2139,-0.51785
2140,-0.50946
2141,-0.5010600000000001
2142,-0.49383999999999995
2143,-0.48543000000000003
2144,-0.47611000000000003
2145,-0.4703
2146,-0.46425
2147,-0.45585
2148,-0.44745
2149,-0.44115
2150,-0.43273999999999996
2151,-0.42432
2152,-0.4159
2153,-0.40958
2154,-0.40115
2155,-0.39181
2156,-0.38337
2157,-0.37704
2158,-0.36859000000000003
2159,-0.36014
2160,-0.35169
2161,-0.349
2162,-0.34329
2163,-0.33485
2164,-0.32850999999999997
2165,-0.32006
2166,-0.31071
2167,-0.30225
2168,-0.2959
2169,-0.29112
2170,-0.28331
2171,-0.27486
2172,-0.26852
2173,-0.26006
2174,-0.25071
2175,-0.24224
2176,-0.23589000000000002
2177,-0.23021999999999998
2178,-0.22543000000000002
2179,-0.21908000000000002
2180,-0.21061999999999997
2181,-0.20215999999999998
2182,-0.19369
2183,-0.18733
2184,-0.17798
2185,-0.1695
2186,-0.16102
2187,-0.15465
2188,-0.14615999999999998
2189,-0.13929
2190,-0.13577999999999998
2191,-0.12942
2192,-0.12094
2193,-0.11245
2194,-0.10608
2195,-0.09672
2196,-0.088223
2197,-0.079722
2198,-0.073344
2199,-0.066495
2200,-0.060891999999999995
2201,-0.0524
2202,-0.046026
2203,-0.036659
2204,-0.030282999999999997
2205,-0.024685
2206,-0.019943000000000002
2207,-0.011453
2208,-0.0029609000000000003
2209,0.0034131
2210,0.012779
2211,0.021283
2212,0.029789
2213,0.032382999999999995
2214,0.040108
2215,0.048603
2216,0.05797000000000001
2217,0.064343
2218,0.071587
2219,0.077185
2220,0.085299
2221,0.09167
2222,0.10103
2223,0.10953
2224,0.11339
2225,0.11689000000000001
2226,0.1204
2227,0.12605
2228,0.13117
2229,0.14053
2230,0.1462
2231,0.15311
2232,0.15945
2233,0.1688
2234,0.17726
2235,0.18539
2236,0.18807000000000001
2237,0.19377
2238,0.19738
2239,0.20340999999999998
2240,0.21275
2241,0.21758000000000002
2242,0.22544
2243,0.23176
2244,0.2399
2245,0.24566999999999997
2246,0.25382
2247,0.26104
2248,0.26800999999999997
2249,0.27171
2250,0.28104
2251,0.28826
2252,0.29198
2253,0.29780999999999996
2254,0.30062
2255,0.30764
2256,0.31695
2257,0.32282
2258,0.32566999999999996
2259,0.33157
2260,0.3354
2261,0.33926
2262,0.34215999999999996
2263,0.34936999999999996
2264,0.35034
2265,0.35326
2266,0.35717
2267,0.36111
2268,0.36506
2269,0.36705
2270,0.36596999999999996
2271,0.36384
2272,0.36784
2273,0.37085999999999997
2274,0.37490999999999997
2275,0.37897
2276,0.38101
2277,0.38409
2278,0.38821
2279,0.38723
2280,0.38213
2281,0.38013
2282,0.38228
2283,0.37624
2284,0.37119
2285,0.3734
2286,0.37148000000000003
2287,0.36336
2288,0.35727
2289,0.34915999999999997
2290,0.34106
2291,0.33296
2292,0.32688
2293,0.3188
2294,0.31072
2295,0.30466
2296,0.29658
2297,0.28852
2298,0.28046
2299,0.27442
2300,0.26636
2301,0.25832
2302,0.25028
2303,0.24425999999999998
2304,0.23624
2305,0.22821999999999998
2306,0.22375
2307,0.21841
2308,0.21038
2309,0.20123
2310,0.19522
2311,0.18608
2312,0.18073
2313,0.17337
2314,0.16735
2315,0.15933
2316,0.15131
2317,0.14218
2318,0.13618
2319,0.12905
2320,0.12255999999999999
2321,0.11830999999999998
2322,0.1123
2323,0.1043
2324,0.096295
2325,0.0903
2326,0.08231000000000001
2327,0.07433
2328,0.066354
2329,0.059239
2330,0.051272000000000005
2331,0.043315
2332,0.035362
2333,0.029404000000000003
2334,0.023131
2335,0.016553000000000002
2336,0.01143
2337,0.0054651000000000005
2338,-0.0024819000000000004
2339,-0.010421
2340,-0.01637
2341,-0.025454
2342,-0.033377
2343,-0.041291
2344,-0.047222
2345,-0.055122000000000004
2346,-0.063015
2347,-0.070899
2348,-0.076809
2349,-0.08467999999999999
2350,-0.092543
2351,-0.1004
2352,-0.10629000000000001
2353,-0.11413
2354,-0.12195999999999999
2355,-0.12783
2356,-0.13565
2357,-0.14392
2358,-0.15068
2359,-0.15579
2360,-0.16362000000000002
2361,-0.17143
2362,-0.17924
2363,-0.1863
2364,-0.19409
2365,-0.20187
2366,-0.20965
2367,-0.21281
2368,-0.21963000000000002
2369,-0.22596
2370,-0.23301
2371,-0.24006999999999998
2372,-0.24688000000000002
2373,-0.2532
2374,-0.25905
2375,-0.26683
2376,-0.27460999999999997
2377,-0.2836
2378,-0.28941999999999996
2379,-0.29717
2380,-0.30491999999999997
2381,-0.31319
2382,-0.31882
2383,-0.32516
2384,-0.33414
2385,-0.33995
2386,-0.34768000000000004
2387,-0.35525999999999996
2388,-0.36213
2389,-0.36794
2390,-0.37567
2391,-0.3834
2392,-0.39111999999999997
2393,-0.39814
2394,-0.40585
2395,-0.40776999999999997
2396,-0.41162
2397,-0.41863999999999996
2398,-0.42499
2399,-0.42817
2400,-0.43518999999999997
2401,-0.44413
2402,-0.44923
2403,-0.45115
2404,-0.4569
2405,-0.46457
2406,-0.47222
2407,-0.47986
2408,-0.48558999999999997
2409,-0.49321000000000004
2410,-0.50083
2411,-0.50843
2412,-0.51412
2413,-0.5217
2414,-0.52927
2415,-0.53495
2416,-0.5425
2417,-0.55004
2418,-0.55757
2419,-0.5632
2420,-0.57203
2421,-0.57953
2422,-0.58702
2423,-0.59263
2424,-0.6001
2425,-0.60755
2426,-0.6149899999999999
2427,-0.62056
2428,-0.62798
2429,-0.63539
2430,-0.64093
2431,-0.64832
2432,-0.65569
2433,-0.66304
2434,-0.66855
2435,-0.67819
2436,-0.68553
2437,-0.69288
2438,-0.69839
2439,-0.7057100000000001
2440,-0.71303
2441,-0.72172
2442,-0.72719
2443,-0.73446
2444,-0.74173
2445,-0.74717
2446,-0.7544
2447,-0.76085
2448,-0.7683
2449,-0.7733399999999999
2450,-0.78057
2451,-0.78922
2452,-0.79643
2453,-0.80107
2454,-0.80855
2455,-0.81358
2456,-0.8208
2457,-0.82762
2458,-0.83481
2459,-0.84126
2460,-0.84734
2461,-0.8537899999999999
2462,-0.86241
2463,-0.8699100000000001
2464,-0.87597
2465,-0.88318
2466,-0.89038
2467,-0.89899
2468,-0.9058
2469,-0.91332
2470,-0.9212
2471,-0.9283799999999999
2472,-0.9344600000000001
2473,-0.9419700000000001
2474,-0.94916
2475,-0.95455
2476,-0.96315
2477,-0.96851
2478,-0.97605
2479,-0.98035
2480,-0.9878600000000001
2481,-0.99354
2482,-1.0008
2483,-1.0061
2484,-1.0148
2485,-1.0234
2486,-1.0309
2487,-1.0355
2488,-1.0442
2489,-1.0524
2490,-1.0567
2491,-1.0649
2492,-1.0721
2493,-1.0807
2494,-1.0861
2495,-1.0922
2496,-1.0997
2497,-1.1083
2498,-1.1137
2499,-1.1212
2500,-1.1273
2501,-1.1359
2502,-1.1413
2503,-1.1484
2504,-1.1535
2505,-1.1596
2506,-1.1675
2507,-1.176
2508,-1.1839
2509,-1.19
2510,-1.2001
2511,-1.2069
2512,-1.2144
2513,-1.2209
2514,-1.228
2515,-1.2366
2516,-1.2437
2517,-1.2484
2518,-1.256
2519,-1.266
2520,-1.2728
2521,-1.2804
2522,-1.2886
2523,-1.2957
2524,-1.3025
2525,-1.3096
2526,-1.3158
2527,-1.3234
2528,-1.3269
2529,-1.3355
2530,-1.3416
2531,-1.3492
2532,-1.3545
2533,-1.3616
2534,-1.3702
2535,-1.3755
2536,-1.3816
2537,-1.391
2538,-1.3996
2539,-1.406
2540,-1.4136
2541,-1.4204
2542,-1.429
2543,-1.4343
2544,-1.4413
2545,-1.4507
2546,-1.4587
2547,-1.4654
2548,-1.4734
2549,-1.4809999999999999
2550,-1.4863
2551,-1.4948
2552,-1.5024
2553,-1.5104
2554,-1.5171
2555,-1.5251
2556,-1.5327
2557,-1.5394
2558,-1.5448
2559,-1.5509
2560,-1.5585
2561,-1.5638
2562,-1.5709
2563,-1.5794
2564,-1.5865
2565,-1.5909
2566,-1.5985
2567,-1.6071
2568,-1.6138
2569,-1.62
2570,-1.6279
2571,-1.6365
2572,-1.6426
2573,-1.6469999999999998
2574,-1.6546
2575,-1.6603
2576,-1.6671
2577,-1.6757
2578,-1.6828
2579,-1.6914
2580,-1.6975
2581,-1.7054
2582,-1.714
2583,-1.7234
2584,-1.7277
2585,-1.7363
2586,-1.7445
2587,-1.7521
2588,-1.7553
2589,-1.7625
2590,-1.771
2591,-1.7763
2592,-1.7846
2593,-1.7922
2594,-1.7989
2595,-1.8042
2596,-1.8113
2597,-1.8183
2598,-1.8268
2599,-1.8319999999999999
2600,-1.8385
2601,-1.8462
2602,-1.8547
2603,-1.8599
2604,-1.8668
2605,-1.8737
2606,-1.8788
2607,-1.8856
2608,-1.8940000000000001
2609,-1.9007
2610,-1.9058
2611,-1.9124
2612,-1.9191
2613,-1.9257
2614,-1.9322
2615,-1.9402
2616,-1.9468
2617,-1.9533
2618,-1.9582
2619,-1.9647
2620,-1.9712
2621,-1.976
2622,-1.9824
2623,-1.9904
2624,-1.9966
2625,-2.0013
2626,-2.0075
2627,-2.0137
2628,-2.02
2629,-2.0266
2630,-2.0333
2631,-2.0394
2632,-2.0455
2633,-2.05
2634,-2.0559
2635,-2.0618
2636,-2.0662
2637,-2.072
2638,-2.0777
2639,-2.0834
2640,-2.0876
2641,-2.0932
2642,-2.1005
2643,-2.106
2644,-2.11
2645,-2.1153
2646,-2.1205
2647,-2.1269
2648,-2.1339
2649,-2.1403
2650,-2.1455
2651,-2.1493
2652,-2.1543
2653,-2.1593
2654,-2.1661
2655,-2.1697
2656,-2.1744
2657,-2.1791
2658,-2.1836
2659,-2.187
2660,-2.1914
2661,-2.1957
2662,-2.2
2663,-2.2031
2664,-2.2071
2665,-2.2111
2666,-2.214
2667,-2.2178
2668,-2.2238
2669,-2.2332
2670,-2.2371
2671,-2.2407
2672,-2.2443
2673,-2.2477
2674,-2.2502
2675,-2.2534
2676,-2.2565
2677,-2.2616
2678,-2.2638
2679,-2.2666
2680,-2.2693
2681,-2.2712
2682,-2.2736
2683,-2.276
2684,-2.2782
2685,-2.2797
2686,-2.2817
2687,-2.2917
2688,-2.2993
2689,-2.3007
2690,-2.3023
2691,-2.3038
2692,-2.3052
2693,-2.3062
2694,-2.3073
2695,-2.3083
2696,-2.309
2697,-2.3098
2698,-2.3104
2699,-2.3109
2700,-2.3111
2701,-2.3114
2702,-2.3115
2703,-2.3138
2704,-2.3138
2705,-2.3138
2706,-2.3138
2707,-2.3138
2708,-2.3138
