time,value
0,-2.2840000000000003
1,-2.2840000000000003
2,-2.2840000000000003
3,-2.2840000000000003
4,-2.2840000000000003
5,-2.2840000000000003
6,-2.2861
7,-2.2839
8,-2.2836
9,-2.2832
10,-2.2827
11,-2.282
12,-2.2833
13,-2.2824
14,-2.2814
15,-2.2803
16,-2.2787
17,-2.2774
18,-2.2759
19,-2.2743
20,-2.2722
21,-2.2704
22,-2.2684
23,-2.2644
24,-2.2617
25,-2.2594
26,-2.2569999999999997
27,-2.2565
28,-2.2513
29,-2.2505
30,-2.2457
31,-2.2428
32,-2.2398
33,-2.2359999999999998
34,-2.2327
35,-2.2294
36,-2.2261
37,-2.2217
38,-2.2181
39,-2.2144
40,-2.2107
41,-2.2059
42,-2.2019
43,-2.1979
44,-2.1938
45,-2.1896
46,-2.1843
47,-2.1817
48,-2.1773
49,-2.1728
50,-2.1671
51,-2.1625
52,-2.1578
53,-2.153
54,-2.1469
55,-2.142
56,-2.137
57,-2.1319999999999997
58,-2.1256
59,-2.1205
60,-2.1152
61,-2.11
62,-2.1046
63,-2.0979
64,-2.0924
65,-2.0869999999999997
66,-2.0814
67,-2.0832
68,-2.0864
69,-2.0807
70,-2.0749
71,-2.0677
72,-2.0618
73,-2.0559
74,-2.05
75,-2.044
76,-2.0365
77,-2.0318
78,-2.0257
79,-2.0195
80,-2.0104
81,-2.0042
82,-1.9980000000000002
83,-1.9917
84,-1.9838
85,-1.9761
86,-1.9708
87,-1.9638
88,-1.9584
89,-1.9481
90,-1.942
91,-1.9364
92,-1.9317
93,-1.9238
94,-1.9175
95,-1.9111
96,-1.9047
97,-1.9044
98,-1.9080000000000001
99,-1.9131
100,-1.9121
101,-1.9080000000000001
102,-1.9113
103,-1.9105
104,-1.9038
105,-1.8971
106,-1.8887
107,-1.8819
108,-1.8751
109,-1.8683
110,-1.8598
111,-1.8534
112,-1.8482
113,-1.8414
114,-1.8328
115,-1.8259999999999998
116,-1.8179
117,-1.8111
118,-1.8041
119,-1.7955
120,-1.7904
121,-1.7841
122,-1.7772
123,-1.7685
124,-1.7615
125,-1.7546
126,-1.7465
127,-1.7377
128,-1.7307
129,-1.7237
130,-1.7166
131,-1.7087
132,-1.7037
133,-1.6967
134,-1.6896
135,-1.6825
136,-1.6726
137,-1.6655
138,-1.6584
139,-1.6513
140,-1.6423
141,-1.6341
142,-1.6282
143,-1.6207
144,-1.6118
145,-1.6036
146,-1.5964
147,-1.5892
148,-1.5828
149,-1.5759
150,-1.5694
151,-1.5623
152,-1.554
153,-1.5458
154,-1.5399
155,-1.5325
156,-1.5253
157,-1.5153
158,-1.5081
159,-1.5008
160,-1.4934
161,-1.4847
162,-1.4775
163,-1.4703
164,-1.463
165,-1.4548
166,-1.4457
167,-1.4384
168,-1.4312
169,-1.4264
170,-1.4188
171,-1.4115
172,-1.4042
173,-1.396
174,-1.3869
175,-1.3796
176,-1.3738
177,-1.369
178,-1.3618
179,-1.3526
180,-1.3453
181,-1.337
182,-1.3297
183,-1.3206
184,-1.3132
185,-1.3085
186,-1.3028
187,-1.2937
188,-1.2863
189,-1.278
190,-1.2707
191,-1.2633
192,-1.254
193,-1.2493
194,-1.2419
195,-1.2346
196,-1.2244
197,-1.217
198,-1.2097
199,-1.205
200,-1.1975
201,-1.1902
202,-1.1828
203,-1.1754
204,-1.1662
205,-1.1588
206,-1.1504
207,-1.143
208,-1.1356
209,-1.1263
210,-1.1189
211,-1.1114
212,-1.104
213,-1.0946
214,-1.0872
215,-1.0797
216,-1.0722
217,-1.0628
218,-1.0553
219,-1.0498
220,-1.0444
221,-1.0361
222,-1.0267
223,-1.0192
224,-1.0117
225,-1.0042
226,-0.9939
227,-0.9863700000000001
228,-0.9788399999999999
229,-0.9713
230,-0.9618700000000001
231,-0.95347
232,-0.9481700000000001
233,-0.9408
234,-0.93137
235,-0.9238200000000001
236,-0.9162600000000001
237,-0.9087
238,-0.9003
239,-0.8908299999999999
240,-0.88326
241,-0.8756799999999999
242,-0.8680899999999999
243,-0.8586
244,-0.851
245,-0.84339
246,-0.83578
247,-0.82626
248,-0.8186399999999999
249,-0.81101
250,-0.80911
251,-0.80338
252,-0.79765
253,-0.79494
254,-0.7865
255,-0.7780600000000001
256,-0.76771
257,-0.76198
258,-0.75927
259,-0.7538600000000001
260,-0.7443
261,-0.7358600000000001
262,-0.7282
263,-0.72629
264,-0.72246
265,-0.71672
266,-0.7121
267,-0.70365
268,-0.6952
269,-0.68405
270,-0.6783
271,-0.67638
272,-0.67098
273,-0.6614
274,-0.65294
275,-0.64527
276,-0.63759
277,-0.62836
278,-0.62333
279,-0.61679
280,-0.60912
281,-0.60144
282,-0.5918399999999999
283,-0.58415
284,-0.5756899999999999
285,-0.568
286,-0.55837
287,-0.55067
288,-0.5453
289,-0.54032
290,-0.53378
291,-0.52608
292,-0.51762
293,-0.5099199999999999
294,-0.50222
295,-0.49258
296,-0.48486999999999997
297,-0.47833000000000003
298,-0.47338
299,-0.46415
300,-0.45643999999999996
301,-0.44873
302,-0.44101999999999997
303,-0.43137
304,-0.4229
305,-0.41517
306,-0.40744
307,-0.39778
308,-0.39361999999999997
309,-0.38677
310,-0.37904
311,-0.37132
312,-0.36165
313,-0.35318
314,-0.34544
315,-0.3377
316,-0.32923
317,-0.32508000000000004
318,-0.32092
319,-0.31319
320,-0.30351999999999996
321,-0.29504
322,-0.2873
323,-0.27956
324,-0.27155
325,-0.26666
326,-0.25892
327,-0.25044
328,-0.2427
329,-0.23395
330,-0.22979000000000002
331,-0.22132
332,-0.21522
333,-0.20836
334,-0.20064
335,-0.19217
336,-0.18445
337,-0.17565999999999998
338,-0.16955
339,-0.16108
340,-0.15614
341,-0.14808
342,-0.13769
343,-0.12997999999999998
344,-0.12344000000000001
345,-0.11656
346,-0.10733
347,-0.10003
348,-0.095052
349,-0.08774900000000001
350,-0.07812999999999999
351,-0.069668
352,-0.06313099999999999
353,-0.05814299999999999
354,-0.052759
355,-0.041608
356,-0.036598
357,-0.031206
358,-0.022751
359,-0.015024000000000001
360,-0.0096248
361,-0.0019538
362,0.0064992
363,0.016092
364,0.021128
365,0.025393000000000002
366,0.033844
367,0.039245999999999996
368,0.047014999999999994
369,0.054672000000000005
370,0.06312000000000001
371,0.07078
372,0.076973
373,0.08205
374,0.089701
375,0.098147
376,0.10772000000000001
377,0.11582999999999999
378,0.12090999999999999
379,0.12855999999999998
380,0.13892000000000002
381,0.14658
382,0.15357
383,0.15977
384,0.16822
385,0.17411
386,0.17923
387,0.18245999999999998
388,0.18789
389,0.19742
390,0.20505
391,0.21348000000000003
392,0.22111
393,0.23066
394,0.2383
395,0.24483000000000002
396,0.24994
397,0.25727
398,0.26761999999999997
399,0.27526
400,0.28339000000000003
401,0.28851
402,0.29614
403,0.30458
404,0.31222
405,0.31955
406,0.32739
407,0.33502
408,0.34345
409,0.35109
410,0.35812
411,0.36435
412,0.37198000000000003
413,0.38042
414,0.38805
415,0.39428
416,0.39942
417,0.40785
418,0.41518999999999995
419,0.42306000000000005
420,0.43149
421,0.43965
422,0.44482
423,0.45515
424,0.46141000000000004
425,0.46305
426,0.47066
427,0.47826
428,0.48777
429,0.49538000000000004
430,0.503
431,0.50137
432,0.49923999999999996
433,0.49843000000000004
434,0.50225
435,0.50988
436,0.5194300000000001
437,0.5213399999999999
438,0.5213399999999999
439,0.52294
440,0.52615
441,0.5321
442,0.53563
443,0.5394399999999999
444,0.54269
445,0.54678
446,0.55007
447,0.55007
448,0.5547
449,0.56419
450,0.5696399999999999
451,0.57484
452,0.58326
453,0.5927600000000001
454,0.60036
455,0.6079600000000001
456,0.61556
457,0.62317
458,0.6335
459,0.64112
460,0.64873
461,0.65308
462,0.66015
463,0.66776
464,0.67619
465,0.6838
466,0.69006
467,0.69523
468,0.7028399999999999
469,0.71126
470,0.71888
471,0.7270300000000001
472,0.73411
473,0.74254
474,0.7488
475,0.754
476,0.7616
477,0.7700199999999999
478,0.77762
479,0.78414
480,0.78604
481,0.79175
482,0.79555
483,0.79555
484,0.79555
485,0.79555
486,0.79474
487,0.79147
488,0.78741
489,0.7841899999999999
490,0.77766
491,0.76922
492,0.7633
493,0.75788
494,0.74944
495,0.7451300000000001
496,0.73621
497,0.72856
498,0.72012
499,0.71248
500,0.7054699999999999
501,0.69926
502,0.69081
503,0.6831699999999999
504,0.67552
505,0.67043
506,0.66422
507,0.65578
508,0.64766
509,0.64259
510,0.6341399999999999
511,0.62795
512,0.6229
513,0.61637
514,0.6071300000000001
515,0.60401
516,0.5989899999999999
517,0.59591
518,0.58668
519,0.58014
520,0.57822
521,0.5743699999999999
522,0.5632199999999999
523,0.55476
524,0.55015
525,0.54669
526,0.53708
527,0.5293899999999999
528,0.52862
529,0.52785
530,0.52285
531,0.51903
532,0.51599
533,0.5087
534,0.5009899999999999
535,0.49528
536,0.48991999999999997
537,0.4822
538,0.47448999999999997
539,0.46485
540,0.45638
541,0.44868
542,0.44097
543,0.43327
544,0.42754
545,0.42218
546,0.41447
547,0.40676
548,0.39637
549,0.38866999999999996
550,0.38097
551,0.37792
552,0.36985999999999997
553,0.3614
554,0.3572
555,0.35226
556,0.34186
557,0.3365
558,0.33157
559,0.32235
560,0.31506
561,0.30748000000000003
562,0.29901
563,0.29291999999999996
564,0.28804
565,0.27762
566,0.27155
567,0.26475
568,0.25627
569,0.24948
570,0.24659
571,0.24176999999999998
572,0.23768000000000003
573,0.22919
574,0.22336
575,0.22141999999999998
576,0.21293
577,0.20373
578,0.19524
579,0.19187
580,0.18338
581,0.17561
582,0.17365999999999998
583,0.17295
584,0.1701
585,0.16530999999999998
586,0.1625
587,0.1565
588,0.14801
589,0.14202
590,0.13924
591,0.12947999999999998
592,0.12168
593,0.11317999999999999
594,0.10538
595,0.095638
596,0.09159400000000001
597,0.086866
598,0.07906200000000001
599,0.06930700000000001
600,0.060812
601,0.053014
602,0.045218
603,0.039921
604,0.034494
605,0.02669
606,0.018192
607,0.010389
608,0.0031482
609,-0.0015748
610,-0.0081218
611,-0.016622
612,-0.026379000000000003
613,-0.032924
614,-0.037641
615,-0.042923
616,-0.051423
617,-0.05611699999999999
618,-0.062073
619,-0.069895
620,-0.077714
621,-0.088171
622,-0.095988
623,-0.1038
624,-0.10780999999999999
625,-0.11640999999999999
626,-0.12491
627,-0.12958
628,-0.13355999999999998
629,-0.14335
630,-0.15186
631,-0.15968
632,-0.16758
633,-0.17223
634,-0.1827
635,-0.18929
636,-0.19324000000000002
637,-0.20175
638,-0.20961999999999997
639,-0.21224
640,-0.22075
641,-0.22796
642,-0.23317
643,-0.23970999999999998
644,-0.24823
645,-0.25277
646,-0.25799
647,-0.26911
648,-0.27165
649,-0.27614
650,-0.27864
651,-0.28642
652,-0.29494000000000004
653,-0.29938000000000003
654,-0.30456
655,-0.31567
656,-0.3181
657,-0.32525
658,-0.33376999999999996
659,-0.33755999999999997
660,-0.34052
661,-0.34287
662,-0.34519
663,-0.34948
664,-0.35231999999999997
665,-0.35456
666,-0.35678000000000004
667,-0.35896999999999996
668,-0.36167
669,-0.36380999999999997
670,-0.36591
671,-0.36599
672,-0.36856
673,-0.37058
674,-0.36756
675,-0.35952
676,-0.35198
677,-0.34192
678,-0.34138
679,-0.3413
680,-0.33525
681,-0.32566
682,-0.31759
683,-0.31496999999999997
684,-0.3128
685,-0.3027
686,-0.29508
687,-0.287
688,-0.28431999999999996
689,-0.28431999999999996
690,-0.27421
691,-0.26611999999999997
692,-0.25803000000000004
693,-0.24995
694,-0.24748
695,-0.24254
696,-0.23446
697,-0.22637
698,-0.21625
699,-0.20815999999999998
700,-0.20007
701,-0.19197
702,-0.18185
703,-0.17376
704,-0.16971
705,-0.16971
706,-0.16161
707,-0.15149
708,-0.14945999999999998
709,-0.14744000000000002
710,-0.13934000000000002
711,-0.12921
712,-0.1211
713,-0.113
714,-0.10447000000000001
715,-0.094335
716,-0.086229
717,-0.07812000000000001
718,-0.070011
719,-0.061903
720,-0.051762999999999997
721,-0.04365
722,-0.037148
723,-0.03344
724,-0.026511
725,-0.018405
726,-0.0098738
727,-0.0017648
728,0.0083712
729,0.015295
730,0.019025999999999998
731,0.027558999999999997
732,0.037689
733,0.04622
734,0.054324000000000004
735,0.062429
736,0.067763
737,0.07354
738,0.081638
739,0.090171
740,0.098272
741,0.10362
742,0.1074
743,0.11549000000000001
744,0.12402
745,0.13414
746,0.13951
747,0.14331
748,0.1514
749,0.15993
750,0.17004
751,0.17542
752,0.17925
753,0.18733
754,0.19743
755,0.20597
756,0.21405
757,0.22214
758,0.23
759,0.23338000000000003
760,0.24145999999999998
761,0.25
762,0.25808000000000003
763,0.26596
764,0.27138
765,0.27945
766,0.28753
767,0.29809
768,0.30616
769,0.31424
770,0.3181
771,0.32554
772,0.33407
773,0.33796
774,0.3434
775,0.35349
776,0.36155
777,0.36962
778,0.37769
779,0.38622
780,0.39631
781,0.40438
782,0.41245
783,0.41943
784,0.42581
785,0.43435
786,0.43932
787,0.44323999999999997
788,0.45178
789,0.45983
790,0.4679
791,0.47643
792,0.48449
793,0.49196999999999996
794,0.4959
795,0.5019399999999999
796,0.51
797,0.52007
798,0.52813
799,0.53667
800,0.54473
801,0.5548
802,0.56287
803,0.57093
804,0.579
805,0.58955
806,0.59346
807,0.60247
808,0.61053
809,0.61859
810,0.62867
811,0.63721
812,0.64527
813,0.6533399999999999
814,0.66342
815,0.67148
816,0.67693
817,0.68084
818,0.69092
819,0.69898
820,0.70704
821,0.71558
822,0.72364
823,0.73373
824,0.74179
825,0.74569
826,0.75115
827,0.76122
828,0.7692899999999999
829,0.77735
830,0.78589
831,0.79597
832,0.80403
833,0.81257
834,0.81647
835,0.8214600000000001
836,0.8315299999999999
837,0.8400700000000001
838,0.8481299999999999
839,0.85619
840,0.8647299999999999
841,0.86865
842,0.87565
843,0.88418
844,0.89426
845,0.89876
846,0.90471
847,0.9097
848,0.9197700000000001
849,0.9278299999999999
850,0.9358799999999999
851,0.94394
852,0.9520000000000001
853,0.96255
854,0.9706100000000001
855,0.97867
856,0.9867299999999999
857,0.9968100000000001
858,1.0023
859,1.0042
860,1.0081
861,1.0121
862,1.0201
863,1.0282
864,1.0362
865,1.0448
866,1.0548
867,1.0629
868,1.0709
869,1.079
870,1.0891
871,1.0971
872,1.1052
873,1.1132
874,1.1233
875,1.1314
876,1.1394
877,1.1475
878,1.1576
879,1.1657
880,1.1731
881,1.177
882,1.1851
883,1.1952
884,1.2037
885,1.2118
886,1.2198
887,1.2262
888,1.2332
889,1.2418
890,1.2457
891,1.2532
892,1.2613
893,1.2698
894,1.2778
895,1.2859
896,1.294
897,1.296
898,1.3
899,1.306
900,1.3081
901,1.3141
902,1.3222
903,1.3297
904,1.3373
905,1.3354
906,1.3356
907,1.3337
908,1.3348
909,1.3344
910,1.3325
911,1.3307
912,1.3289
913,1.328
914,1.3251
915,1.3234
916,1.3189
917,1.3083
918,1.305
919,1.3012
920,1.2931
921,1.2830000000000001
922,1.2749
923,1.2664
924,1.2583
925,1.2533
926,1.2471
927,1.239
928,1.2309
929,1.2228
930,1.2127
931,1.2046
932,1.1961
933,1.188
934,1.1779
935,1.1698
936,1.1617
937,1.1536
938,1.1498
939,1.1444
940,1.1363
941,1.1278
942,1.1197
943,1.1159999999999999
944,1.1106
945,1.1021
946,1.0968
947,1.091
948,1.0825
949,1.0776
950,1.0739
951,1.065
952,1.0585
953,1.0548
954,1.0499
955,1.0418
956,1.0316
957,1.0235
958,1.015
959,1.0069
960,0.99672
961,0.9898100000000001
962,0.98614
963,0.98167
964,0.9711200000000001
965,0.96747
966,0.9642299999999999
967,0.95611
968,0.9479799999999999
969,0.93742
970,0.9293
971,0.92117
972,0.91914
973,0.9146799999999999
974,0.90615
975,0.8976200000000001
976,0.8891
977,0.88626
978,0.87774
979,0.86961
980,0.86555
981,0.8614799999999999
982,0.85336
983,0.8452299999999999
984,0.83711
985,0.8285799999999999
986,0.81843
987,0.8103100000000001
988,0.80218
989,0.7985399999999999
990,0.7912399999999999
991,0.7831100000000001
992,0.77459
993,0.76646
994,0.7563
995,0.74941
996,0.74578
997,0.73929
998,0.7307600000000001
999,0.72677
1000,0.7198899999999999
1001,0.71175
1002,0.70362
1003,0.69306
1004,0.68493
1005,0.6784399999999999
1006,0.67485
1007,0.67001
1008,0.6611
1009,0.65793
1010,0.65476
1011,0.64661
1012,0.6360600000000001
1013,0.6279100000000001
1014,0.62271
1015,0.61919
1016,0.609
1017,0.60048
1018,0.59233
1019,0.58715
1020,0.5816100000000001
1021,0.57309
1022,0.56494
1023,0.55642
1024,0.5492199999999999
1025,0.54406
1026,0.53554
1027,0.53004
1028,0.52695
1029,0.51674
1030,0.5082300000000001
1031,0.5000600000000001
1032,0.4919
1033,0.48373999999999995
1034,0.4803
1035,0.47518
1036,0.46701000000000004
1037,0.45646000000000003
1038,0.44828999999999997
1039,0.44487
1040,0.43773
1041,0.42922
1042,0.42346000000000006
1043,0.41871
1044,0.41053
1045,0.40235
1046,0.3918
1047,0.38363
1048,0.37512
1049,0.37208
1050,0.36701999999999996
1051,0.35884
1052,0.35065999999999997
1053,0.34215
1054,0.33193
1055,0.32375
1056,0.32245
1057,0.31944
1058,0.31126
1059,0.30103
1060,0.29253
1061,0.28434
1062,0.27616
1063,0.27111
1064,0.2678
1065,0.25961999999999996
1066,0.25143000000000004
1067,0.2412
1068,0.23301
1069,0.22451
1070,0.21631999999999998
1071,0.20814000000000002
1072,0.19791
1073,0.18972999999999998
1074,0.18563
1075,0.18154
1076,0.17477
1077,0.1724
1078,0.1639
1079,0.15508
1080,0.15068
1081,0.14658
1082,0.13839
1083,0.13021
1084,0.12202
1085,0.11179000000000001
1086,0.10329
1087,0.095106
1088,0.087241
1089,0.077014
1090,0.06883099999999999
1091,0.06065
1092,0.052146000000000005
1093,0.041921
1094,0.03374
1095,0.025561
1096,0.017381999999999998
1097,0.0071592
1098,0.0017672
1099,-0.0012388
1100,-0.009740799999999999
1101,-0.014466999999999999
1102,-0.018074
1103,-0.024215
1104,-0.032404
1105,-0.040904
1106,-0.051142
1107,-0.059329
1108,-0.06578099999999999
1109,-0.06905900000000001
1110,-0.075811
1111,-0.084307
1112,-0.092501
1113,-0.10069
1114,-0.10395
1115,-0.10893
1116,-0.11742000000000001
1117,-0.12034
1118,-0.12149000000000001
1119,-0.12493
1120,-0.1278
1121,-0.13627999999999998
1122,-0.14093
1123,-0.1443
1124,-0.15252000000000002
1125,-0.16099000000000002
1126,-0.16921
1127,-0.17589000000000002
1128,-0.17895999999999998
1129,-0.17947000000000002
1130,-0.17947000000000002
1131,-0.18045
1132,-0.18164
1133,-0.18187
1134,-0.18234
1135,-0.18324000000000001
1136,-0.18434
1137,-0.18313
1138,-0.18395
1139,-0.18475
1140,-0.17464000000000002
1141,-0.17109000000000002
1142,-0.17182999999999998
1143,-0.17049
1144,-0.17118
1145,-0.16086
1146,-0.15277000000000002
1147,-0.14452
1148,-0.14072
1149,-0.13945
1150,-0.14006
1151,-0.14065
1152,-0.13239
1153,-0.1222
1154,-0.11392999999999999
1155,-0.11020999999999999
1156,-0.10661
1157,-0.09847
1158,-0.092519
1159,-0.093002
1160,-0.084848
1161,-0.076579
1162,-0.066241
1163,-0.058085000000000005
1164,-0.049814
1165,-0.041544
1166,-0.031206
1167,-0.029574
1168,-0.023679
1169,-0.015406999999999999
1170,-0.0050658000000000005
1171,0.0032061999999999998
1172,0.011481
1173,0.019656
1174,0.027927999999999998
1175,0.038271
1176,0.046543
1177,0.054817
1178,0.06308899999999999
1179,0.07343200000000001
1180,0.081706
1181,0.085562
1182,0.08934500000000001
1183,0.09969
1184,0.10797000000000001
1185,0.11624000000000001
1186,0.12452
1187,0.13279000000000002
1188,0.14305
1189,0.15133
1190,0.15969
1191,0.16797
1192,0.17831
1193,0.18659
1194,0.19485999999999998
1195,0.20322
1196,0.20555
1197,0.20995
1198,0.21823
1199,0.2265
1200,0.23684000000000002
1201,0.24511999999999998
1202,0.2534
1203,0.26166999999999996
1204,0.26994
1205,0.28029
1206,0.28856
1207,0.29684
1208,0.30511
1209,0.31545
1210,0.32373
1211,0.33200999999999997
1212,0.34028
1213,0.35062
1214,0.3589
1215,0.36718
1216,0.37545
1217,0.38373
1218,0.39407
1219,0.40234000000000003
1220,0.41071
1221,0.41898
1222,0.42933000000000004
1223,0.43751
1224,0.44578999999999996
1225,0.45407
1226,0.46441000000000004
1227,0.47268999999999994
1228,0.48096000000000005
1229,0.48493
1230,0.48907
1231,0.49735
1232,0.50562
1233,0.5138199999999999
1234,0.51995
1235,0.52186
1236,0.5300600000000001
1237,0.5383399999999999
1238,0.54662
1239,0.55076
1240,0.5549
1241,0.56317
1242,0.57145
1243,0.5818
1244,0.59008
1245,0.59835
1246,0.60663
1247,0.6148399999999999
1248,0.6251800000000001
1249,0.63346
1250,0.64174
1251,0.6500199999999999
1252,0.6603600000000001
1253,0.6645
1254,0.66657
1255,0.67478
1256,0.68499
1257,0.687
1258,0.68894
1259,0.69715
1260,0.69922
1261,0.70543
1262,0.7137100000000001
1263,0.7219899999999999
1264,0.73027
1265,0.74062
1266,0.7489
1267,0.75712
1268,0.7654
1269,0.77575
1270,0.7840199999999999
1271,0.7923
1272,0.8005800000000001
1273,0.81093
1274,0.81507
1275,0.81921
1276,0.82749
1277,0.8337
1278,0.8378399999999999
1279,0.8461200000000001
1280,0.8544
1281,0.8626799999999999
1282,0.87303
1283,0.88131
1284,0.88959
1285,0.89574
1286,0.89754
1287,0.9057799999999999
1288,0.91406
1289,0.9223399999999999
1290,0.9306200000000001
1291,0.9409200000000001
1292,0.9492
1293,0.9574799999999999
1294,0.9657600000000001
1295,0.97611
1296,0.97809
1297,0.98016
1298,0.98844
1299,0.9987
1300,1.0069
1301,1.0151
1302,1.0172
1303,1.0255
1304,1.0276
1305,1.0296
1306,1.0379
1307,1.0462
1308,1.0566
1309,1.0648
1310,1.0731
1311,1.0814
1312,1.0917
1313,1.0938
1314,1.0979
1315,1.1062
1316,1.1145
1317,1.1166
1318,1.1228
1319,1.131
1320,1.1393
1321,1.1497
1322,1.158
1323,1.1663
1324,1.1746
1325,1.1849
1326,1.1932
1327,1.2015
1328,1.2098
1329,1.2201
1330,1.2284
1331,1.2367
1332,1.2449
1333,1.2532
1334,1.2636
1335,1.2719
1336,1.2801
1337,1.2884
1338,1.2988
1339,1.3071
1340,1.3153
1341,1.3236
1342,1.3339
1343,1.3422
1344,1.3505
1345,1.3588
1346,1.3609
1347,1.3671
1348,1.3753
1349,1.3794
1350,1.3815
1351,1.3917
1352,1.4
1353,1.4083
1354,1.4104
1355,1.4145
1356,1.4227
1357,1.431
1358,1.4393
1359,1.4497
1360,1.4579
1361,1.4621
1362,1.4643
1363,1.4727
1364,1.483
1365,1.4913
1366,1.4996
1367,1.5079
1368,1.5182
1369,1.5265
1370,1.5348
1371,1.5431
1372,1.5534
1373,1.5617
1374,1.57
1375,1.5782
1376,1.5886
1377,1.5906
1378,1.5925
1379,1.6008
1380,1.6091
1381,1.6194
1382,1.6235
1383,1.6234
1384,1.6254
1385,1.6254
1386,1.6274
1387,1.6274
1388,1.6274
1389,1.6274
1390,1.6274
1391,1.6274
1392,1.6253
1393,1.6254
1394,1.6233
1395,1.6234
1396,1.6151
1397,1.609
1398,1.607
1399,1.6008
1400,1.5926
1401,1.5906
1402,1.5845
1403,1.5762
1404,1.568
1405,1.5597
1406,1.5578
1407,1.5537
1408,1.5455
1409,1.5436
1410,1.5396
1411,1.5293
1412,1.5252
1413,1.5231
1414,1.5149
1415,1.5129
1416,1.5068
1417,1.4986
1418,1.4945
1419,1.4904
1420,1.4821
1421,1.4738
1422,1.4655
1423,1.4572
1424,1.4469
1425,1.4386
1426,1.4303
1427,1.4221
1428,1.4118
1429,1.4035
1430,1.3952
1431,1.3869
1432,1.3766
1433,1.3683
1434,1.3622
1435,1.3604
1436,1.3543
1437,1.3439
1438,1.3356
1439,1.3274
1440,1.3191
1441,1.3087
1442,1.3005
1443,1.2922
1444,1.284
1445,1.2736
1446,1.2653
1447,1.2571
1448,1.2489
1449,1.2447
1450,1.2385
1451,1.2302
1452,1.222
1453,1.2179
1454,1.2159
1455,1.2078
1456,1.1994
1457,1.1909999999999998
1458,1.1806
1459,1.1784
1460,1.1743
1461,1.1681
1462,1.166
1463,1.1598
1464,1.1515
1465,1.1432
1466,1.135
1467,1.1246
1468,1.1163
1469,1.1081
1470,1.0998
1471,1.0894
1472,1.0812
1473,1.0729
1474,1.0646
1475,1.0625
1476,1.0585
1477,1.0523
1478,1.0504
1479,1.0422
1480,1.034
1481,1.0321
1482,1.0279
1483,1.0196
1484,1.0093
1485,1.001
1486,0.9928299999999999
1487,0.98455
1488,0.97421
1489,0.96593
1490,0.9576600000000001
1491,0.9493799999999999
1492,0.94731
1493,0.94111
1494,0.9369700000000001
1495,0.9349
1496,0.9268
1497,0.9165399999999999
1498,0.9083600000000001
1499,0.90215
1500,0.9000799999999999
1501,0.89181
1502,0.8835299999999999
1503,0.87526
1504,0.8669899999999999
1505,0.85664
1506,0.85457
1507,0.85008
1508,0.8418
1509,0.8335299999999999
1510,0.8231799999999999
1511,0.81491
1512,0.8066300000000001
1513,0.7983600000000001
1514,0.7880199999999999
1515,0.77974
1516,0.77147
1517,0.7673300000000001
1518,0.76526
1519,0.7569899999999999
1520,0.75285
1521,0.75285
1522,0.7425
1523,0.73423
1524,0.72595
1525,0.71768
1526,0.7094
1527,0.69906
1528,0.69079
1529,0.6825100000000001
1530,0.67424
1531,0.6639
1532,0.65562
1533,0.64735
1534,0.63907
1535,0.62873
1536,0.62046
1537,0.6121800000000001
1538,0.6039100000000001
1539,0.60213
1540,0.59839
1541,0.59012
1542,0.5818399999999999
1543,0.57357
1544,0.56323
1545,0.55496
1546,0.54669
1547,0.53842
1548,0.52808
1549,0.5198
1550,0.51153
1551,0.50326
1552,0.49291999999999997
1553,0.48465
1554,0.47638
1555,0.46811
1556,0.45983
1557,0.4495
1558,0.44122
1559,0.43295
1560,0.42468
1561,0.41434
1562,0.40814
1563,0.40565
1564,0.40326999999999996
1565,0.39293
1566,0.38466
1567,0.37639
1568,0.36812
1569,0.35984
1570,0.3495
1571,0.34123000000000003
1572,0.33296
1573,0.32468
1574,0.31434
1575,0.30607
1576,0.2977
1577,0.28941999999999996
1578,0.27908
1579,0.27081
1580,0.26254
1581,0.2582
1582,0.25574
1583,0.24736999999999998
1584,0.2391
1585,0.23083
1586,0.22255
1587,0.21220999999999998
1588,0.20393
1589,0.19566
1590,0.18739
1591,0.17704
1592,0.16877
1593,0.1605
1594,0.15222
1595,0.14188
1596,0.13360999999999998
1597,0.12533
1598,0.11706
1599,0.10879000000000001
1600,0.09844800000000001
1601,0.090173
1602,0.086338
1603,0.084694
1604,0.07435599999999999
1605,0.066195
1606,0.058037
1607,0.054366
1608,0.048404
1609,0.040136
1610,0.031992
1611,0.023724000000000002
1612,0.015456000000000001
1613,0.0073152
1614,0.0078342
1615,0.006310199999999999
1616,0.0068762
1617,-0.00094482
1618,-0.006988800000000001
1619,-0.0063718
1620,-0.0077968
1621,-0.0069628
1622,-0.01487
1623,-0.018645
1624,-0.017922
1625,-0.016988999999999997
1626,-0.016212
1627,-0.015413
1628,-0.014591
1629,-0.01005
1630,0.00025018
1631,0.008700200000000002
1632,0.014879
1633,0.017794
1634,0.024627
1635,0.033305
1636,0.036268
1637,0.042901
1638,0.051595
1639,0.054598
1640,0.05919
1641,0.06741699999999999
1642,0.07588400000000001
1643,0.086167
1644,0.089198
1645,0.092
1646,0.10047
1647,0.10739000000000001
1648,0.11048
1649,0.1187
1650,0.12691
1651,0.13719
1652,0.14540999999999998
1653,0.15362
1654,0.16184
1655,0.17032
1656,0.18059
1657,0.18880999999999998
1658,0.19702999999999998
1659,0.20525
1660,0.21553000000000003
1661,0.22194
1662,0.22501999999999997
1663,0.23376
1664,0.24403000000000002
1665,0.25225
1666,0.26073
1667,0.26894
1668,0.27921999999999997
1669,0.28743
1670,0.29565
1671,0.30387
1672,0.3067
1673,0.31185999999999997
1674,0.32006999999999997
1675,0.32829
1676,0.3365
1677,0.34704
1678,0.35525
1679,0.36346999999999996
1680,0.37168
1681,0.37711999999999996
1682,0.38176
1683,0.38997
1684,0.39818000000000003
1685,0.40665999999999997
1686,0.41693
1687,0.42541
1688,0.42855
1689,0.43321000000000004
1690,0.44347
1691,0.45195
1692,0.46016
1693,0.46837
1694,0.47685
1695,0.48002
1696,0.48673
1697,0.49494
1698,0.50548
1699,0.5122
1700,0.5154
1701,0.52389
1702,0.53209
1703,0.5423399999999999
1704,0.5505399999999999
1705,0.55903
1706,0.56723
1707,0.57749
1708,0.5856899999999999
1709,0.5938899999999999
1710,0.59885
1711,0.60207
1712,0.61027
1713,0.61847
1714,0.62667
1715,0.6348699999999999
1716,0.64541
1717,0.65361
1718,0.66181
1719,0.67001
1720,0.68055
1721,0.68377
1722,0.68845
1723,0.69665
1724,0.70719
1725,0.71539
1726,0.72359
1727,0.7320800000000001
1728,0.73532
1729,0.74411
1730,0.75231
1731,0.7608
1732,0.769
1733,0.7792399999999999
1734,0.7842399999999999
1735,0.78955
1736,0.79805
1737,0.80481
1738,0.80685
1739,0.81505
1740,0.82385
1741,0.8344
1742,0.84116
1743,0.84321
1744,0.84935
1745,0.85344
1746,0.85549
1747,0.8636799999999999
1748,0.87218
1749,0.8803700000000001
1750,0.88713
1751,0.8904299999999999
1752,0.8968799999999999
1753,0.90507
1754,0.9153
1755,0.9238
1756,0.93199
1757,0.9384399999999999
1758,0.94175
1759,0.95058
1760,0.9587600000000001
1761,0.9669399999999999
1762,0.97545
1763,0.9856799999999999
1764,0.9938600000000001
1765,1.002
1766,1.0061
1767,1.0105
1768,1.0190000000000001
1769,1.0276
1770,1.0302
1771,1.0346
1772,1.0411
1773,1.0431
1774,1.0513
1775,1.0595
1776,1.0697
1777,1.0779
1778,1.0864
1779,1.0946
1780,1.1048
1781,1.1102
1782,1.1153
1783,1.1235
1784,1.1340000000000001
1785,1.1422
1786,1.1455
1787,1.1486
1788,1.1567
1789,1.167
1790,1.1751
1791,1.1836
1792,1.1918
1793,1.202
1794,1.2102
1795,1.2136
1796,1.2187
1797,1.2289
1798,1.2374
1799,1.2456
1800,1.2489
1801,1.254
1802,1.2622
1803,1.2704
1804,1.2789
1805,1.2871
1806,1.2976
1807,1.301
1808,1.3078
1809,1.3159999999999998
1810,1.3265
1811,1.3330000000000002
1812,1.3364
1813,1.3432
1814,1.3538
1815,1.3619999999999999
1816,1.3688
1817,1.3722
1818,1.3807
1819,1.3913
1820,1.3994
1821,1.4042
1822,1.4057
1823,1.4095
1824,1.4109
1825,1.4195
1826,1.4202
1827,1.422
1828,1.4235
1829,1.4251
1830,1.4266
1831,1.4274
1832,1.4196
1833,1.4191
1834,1.4162
1835,1.4081
1836,1.3984
1837,1.3902
1838,1.3898
1839,1.389
1840,1.3788
1841,1.3707
1842,1.3626
1843,1.3545
1844,1.3447
1845,1.3366
1846,1.3285
1847,1.3204
1848,1.3123
1849,1.3102
1850,1.3041
1851,1.3001
1852,1.2981
1853,1.2928
1854,1.2851
1855,1.2770000000000001
1856,1.2681
1857,1.2636
1858,1.2616
1859,1.2534
1860,1.2514
1861,1.2494
1862,1.2393
1863,1.2311
1864,1.2229999999999999
1865,1.2149
1866,1.2048
1867,1.1967
1868,1.1886
1869,1.1825
1870,1.1805
1871,1.1728
1872,1.1651
1873,1.1575
1874,1.1543
1875,1.1486
1876,1.1406
1877,1.1361
1878,1.1336
1879,1.1226
1880,1.1141
1881,1.1055
1882,1.1035
1883,1.0995
1884,1.0914
1885,1.0833
1886,1.0752
1887,1.0646
1888,1.0565
1889,1.0484
1890,1.0399
1891,1.0361
1892,1.0292
1893,1.0211
1894,1.013
1895,1.0049
1896,0.9947799999999999
1897,0.98625
1898,0.97815
1899,0.9705
1900,0.96039
1901,0.95186
1902,0.9437700000000001
1903,0.93568
1904,0.9275899999999999
1905,0.91748
1906,0.9093899999999999
1907,0.9060299999999999
1908,0.90065
1909,0.8901
1910,0.8820100000000001
1911,0.87392
1912,0.8658299999999999
1913,0.8552700000000001
1914,0.8471799999999999
1915,0.83909
1916,0.83101
1917,0.8220299999999999
1918,0.81822
1919,0.8096899999999999
1920,0.8016
1921,0.79351
1922,0.7834
1923,0.77531
1924,0.76722
1925,0.7591399999999999
1926,0.74903
1927,0.74095
1928,0.7328600000000001
1929,0.72478
1930,0.71468
1931,0.7066
1932,0.69807
1933,0.68999
1934,0.68191
1935,0.67181
1936,0.66374
1937,0.65768
1938,0.65566
1939,0.64868
1940,0.64015
1941,0.6351899999999999
1942,0.63272
1943,0.62216
1944,0.6201399999999999
1945,0.6140800000000001
1946,0.60601
1947,0.59591
1948,0.58738
1949,0.5793
1950,0.57123
1951,0.56315
1952,0.55571
1953,0.54984
1954,0.54176
1955,0.53368
1956,0.52359
1957,0.51551
1958,0.50744
1959,0.49936
1960,0.48928
1961,0.48121
1962,0.47313999999999995
1963,0.46507
1964,0.457
1965,0.44692
1966,0.43885
1967,0.43031
1968,0.42225
1969,0.41217
1970,0.40410999999999997
1971,0.39605
1972,0.39107
1973,0.38466999999999996
1974,0.37861999999999996
1975,0.37056
1976,0.36249000000000003
1977,0.35443
1978,0.34388
1979,0.33582
1980,0.32775
1981,0.31969000000000003
1982,0.30962
1983,0.30416
1984,0.30025
1985,0.29218
1986,0.2821
1987,0.27357
1988,0.26550999999999997
1989,0.25744
1990,0.24736999999999998
1991,0.23883000000000001
1992,0.23492
1993,0.2284
1994,0.21986
1995,0.20978000000000002
1996,0.20124
1997,0.19318
1998,0.18619000000000002
1999,0.18027
2000,0.17174
2001,0.16367
2002,0.1556
2003,0.14505
2004,0.13698
2005,0.13402999999999998
2006,0.13014
2007,0.12161
2008,0.11416
2009,0.11030999999999999
2010,0.10177
2011,0.093693
2012,0.083597
2013,0.075521
2014,0.067446
2015,0.058911
2016,0.048818
2017,0.040744999999999996
2018,0.032674
2019,0.024604
2020,0.01405
2021,0.010176000000000001
2022,0.0052172
2023,-0.0028588
2024,-0.010931999999999999
2025,-0.021024
2026,-0.029095999999999997
2027,-0.037167
2028,-0.045236
2029,-0.05532
2030,-0.063387
2031,-0.071453
2032,-0.07998999999999999
2033,-0.09007000000000001
2034,-0.098131
2035,-0.10572000000000001
2036,-0.11377000000000001
2037,-0.12183
2038,-0.1319
2039,-0.13996
2040,-0.14801
2041,-0.15655
2042,-0.16612000000000002
2043,-0.17417
2044,-0.18222
2045,-0.19025999999999998
2046,-0.20031
2047,-0.20836
2048,-0.2164
2049,-0.22444
2050,-0.23448000000000002
2051,-0.24301999999999999
2052,-0.25055
2053,-0.25859
2054,-0.26661999999999997
2055,-0.27665
2056,-0.28468000000000004
2057,-0.29270999999999997
2058,-0.29821
2059,-0.29762
2060,-0.3031
2061,-0.31111
2062,-0.31911999999999996
2063,-0.3286
2064,-0.3366
2065,-0.3446
2066,-0.3526
2067,-0.3586
2068,-0.3606
2069,-0.36859000000000003
2070,-0.37059000000000003
2071,-0.37205
2072,-0.38094
2073,-0.38837
2074,-0.3958
2075,-0.40376999999999996
2076,-0.40521
2077,-0.41006000000000004
2078,-0.41746000000000005
2079,-0.41716000000000003
2080,-0.41999
2081,-0.42933999999999994
2082,-0.42898000000000003
2083,-0.43117
2084,-0.4385
2085,-0.43943999999999994
2086,-0.4402
2087,-0.4475
2088,-0.45219
2089,-0.45103999999999994
2090,-0.45893
2091,-0.46618000000000004
2092,-0.47406000000000004
2093,-0.47608
2094,-0.47743
2095,-0.48463999999999996
2096,-0.48658999999999997
2097,-0.4859
2098,-0.4957
2099,-0.5028600000000001
2100,-0.51069
2101,-0.51452
2102,-0.51373
2103,-0.52085
2104,-0.52266
2105,-0.52374
2106,-0.53275
2107,-0.53255
2108,-0.53161
2109,-0.53864
2110,-0.54373
2111,-0.54005
2112,-0.53901
2113,-0.53601
2114,-0.54104
2115,-0.53952
2116,-0.53647
2117,-0.5333899999999999
2118,-0.5302899999999999
2119,-0.5271600000000001
2120,-0.52446
2121,-0.51984
2122,-0.51668
2123,-0.51079
2124,-0.50567
2125,-0.49915
2126,-0.49151000000000006
2127,-0.48386999999999997
2128,-0.47352
2129,-0.46588
2130,-0.46046000000000004
2131,-0.45535
2132,-0.44692
2133,-0.43848000000000004
2134,-0.43083999999999995
2135,-0.4251
2136,-0.4192
2137,-0.41376999999999997
2138,-0.40614
2139,-0.3977
2140,-0.39006
2141,-0.3805
2142,-0.37285
2143,-0.36585
2144,-0.35963
2145,-0.35039000000000003
2146,-0.34526999999999997
2147,-0.33793
2148,-0.3303
2149,-0.31995999999999997
2150,-0.31343000000000004
2151,-0.3083
2152,-0.30096
2153,-0.29334
2154,-0.28300000000000003
2155,-0.27647
2156,-0.27133
2157,-0.26399
2158,-0.25445999999999996
2159,-0.24684
2160,-0.2384
2161,-0.23076999999999998
2162,-0.22424000000000002
2163,-0.21911
2164,-0.21368
2165,-0.20606
2166,-0.19652
2167,-0.18808
2168,-0.18044000000000002
2169,-0.172
2170,-0.16689
2171,-0.15684
2172,-0.15031
2173,-0.14518
2174,-0.13974
2175,-0.12941
2176,-0.12178
2177,-0.11415
2178,-0.10901
2179,-0.10087
2180,-0.09324600000000001
2181,-0.084812
2182,-0.07718799999999999
2183,-0.072854
2184,-0.065794
2185,-0.058178
2186,-0.049748
2187,-0.042126
2188,-0.034256
2189,-0.026914999999999998
2190,-0.019299
2191,-0.011682
2192,-0.0013448
2193,0.0062792
2194,0.012808000000000002
2195,0.017950999999999998
2196,0.028009
2197,0.034535
2198,0.039699
2199,0.047042
2200,0.054651
2201,0.064984
2202,0.071509
2203,0.076681
2204,0.082123
2205,0.092449
2206,0.097636
2207,0.10201
2208,0.10960999999999999
2209,0.11993
2210,0.12753
2211,0.13107
2212,0.13627
2213,0.14469
2214,0.15287
2215,0.15809
2216,0.16460999999999998
2217,0.17303
2218,0.18250999999999998
2219,0.18903
2220,0.19425
2221,0.2016
2222,0.21001999999999998
2223,0.21525
2224,0.22155
2225,0.22996999999999998
2226,0.23626999999999998
2227,0.24531
2228,0.25372
2229,0.25625
2230,0.26154
2231,0.27183
2232,0.2773
2233,0.2826
2234,0.28911
2235,0.29836
2236,0.30179
2237,0.30523
2238,0.30869
2239,0.31492
2240,0.31842
2241,0.3268
2242,0.33505999999999997
2243,0.34045
2244,0.35158
2245,0.35709
2246,0.36063
2247,0.36418
2248,0.37051999999999996
2249,0.37411
2250,0.37772
2251,0.38049
2252,0.3832
2253,0.38684
2254,0.3905
2255,0.39419
2256,0.39697
2257,0.40343
2258,0.40528000000000003
2259,0.40715
2260,0.40904
2261,0.40814
2262,0.41002
2263,0.41284
2264,0.41379
2265,0.41663
2266,0.42043
2267,0.42241000000000006
2268,0.42625
2269,0.41708
2270,0.40976
2271,0.40243
2272,0.39511
2273,0.38877
2274,0.37964000000000003
2275,0.37135999999999997
2276,0.36406
2277,0.35675999999999997
2278,0.34765
2279,0.34037
2280,0.33309
2281,0.32649
2282,0.3189
2283,0.31162
2284,0.30335
2285,0.29607
2286,0.28947
2287,0.28006
2288,0.27278
2289,0.26450999999999997
2290,0.25724
2291,0.25046999999999997
2292,0.24470999999999998
2293,0.24079
2294,0.23518000000000003
2295,0.22508000000000003
2296,0.21934
2297,0.21459
2298,0.20729
2299,0.19899999999999998
2300,0.18988
2301,0.1861
2302,0.18037
2303,0.17209000000000002
2304,0.16296
2305,0.15566
2306,0.14837
2307,0.14009000000000002
2308,0.13099
2309,0.12370999999999999
2310,0.11893
2311,0.11499000000000001
2312,0.10826
2313,0.10350999999999999
2314,0.096205
2315,0.088906
2316,0.081611
2317,0.071515
2318,0.06423
2319,0.059453
2320,0.053704999999999996
2321,0.044588
2322,0.037299
2323,0.030017000000000002
2324,0.022741
2325,0.013651
2326,0.0053912
2327,-0.0018708
2328,-0.0091258
2329,-0.016378
2330,-0.024006
2331,-0.030628
2332,-0.038883
2333,-0.042691
2334,-0.05129500000000001
2335,-0.058563
2336,-0.065825
2337,-0.07308200000000001
2338,-0.083148
2339,-0.090393
2340,-0.097634
2341,-0.10487
2342,-0.11352000000000001
2343,-0.11915
2344,-0.1274
2345,-0.13402999999999998
2346,-0.13804
2347,-0.1471
2348,-0.15435
2349,-0.1626
2350,-0.16983
2351,-0.17887
2352,-0.18450999999999998
2353,-0.18854
2354,-0.19497
2355,-0.20423
2356,-0.21006
2357,-0.21569000000000002
2358,-0.22293000000000002
2359,-0.23016999999999999
2360,-0.24022
2361,-0.24745
2362,-0.25468
2363,-0.26053000000000004
2364,-0.26898
2365,-0.27621
2366,-0.28344
2367,-0.29167
2368,-0.30069
2369,-0.30711
2370,-0.31299
2371,-0.31863
2372,-0.32765
2373,-0.33486
2374,-0.34308
2375,-0.35028000000000004
2376,-0.35746999999999995
2377,-0.36338000000000004
2378,-0.36824
2379,-0.37646999999999997
2380,-0.38211
2381,-0.39082
2382,-0.39623
2383,-0.40343
2384,-0.41166
2385,-0.41705
2386,-0.41885
2387,-0.42527
2388,-0.43451999999999996
2389,-0.43914
2390,-0.44478999999999996
2391,-0.45301
2392,-0.45481000000000005
2393,-0.4584
2394,-0.46737
2395,-0.47453999999999996
2396,-0.48275
2397,-0.4899
2398,-0.4981
2399,-0.5040600000000001
2400,-0.51151
2401,-0.51867
2402,-0.52582
2403,-0.53475
2404,-0.54294
2405,-0.55007
2406,-0.55719
2407,-0.56608
2408,-0.57319
2409,-0.57887
2410,-0.5849
2411,-0.59485
2412,-0.60195
2413,-0.60905
2414,-0.61721
2415,-0.6260600000000001
2416,-0.63105
2417,-0.6371100000000001
2418,-0.6442
2419,-0.65128
2420,-0.66013
2421,-0.66827
2422,-0.67533
2423,-0.6823899999999999
2424,-0.69119
2425,-0.69689
2426,-0.70124
2427,-0.70938
2428,-0.71928
2429,-0.72631
2430,-0.73202
2431,-0.73814
2432,-0.74451
2433,-0.75331
2434,-0.76144
2435,-0.7678
2436,-0.77394
2437,-0.7814
2438,-0.78843
2439,-0.79655
2440,-0.80357
2441,-0.81233
2442,-0.81758
2443,-0.82375
2444,-0.83057
2445,-0.8393299999999999
2446,-0.8474299999999999
2447,-0.8555299999999999
2448,-0.86172
2449,-0.86918
2450,-0.8790399999999999
2451,-0.8860299999999999
2452,-0.89349
2453,-0.8996799999999999
2454,-0.91064
2455,-0.9163600000000001
2456,-0.92253
2457,-0.92889
2458,-0.93875
2459,-0.9457399999999999
2460,-0.9532
2461,-0.95939
2462,-0.96749
2463,-0.9762299999999999
2464,-0.9843200000000001
2465,-0.9900399999999999
2466,-0.99624
2467,-1.0072
2468,-1.0129
2469,-1.0208
2470,-1.0290000000000001
2471,-1.0377
2472,-1.0458
2473,-1.0537
2474,-1.0606
2475,-1.0687
2476,-1.0774
2477,-1.0855
2478,-1.0917
2479,-1.0991
2480,-1.1084
2481,-1.1146
2482,-1.1203
2483,-1.1273
2484,-1.1371
2485,-1.1441
2486,-1.1503
2487,-1.1571
2488,-1.1658
2489,-1.1739
2490,-1.1809
2491,-1.1871
2492,-1.194
2493,-1.2049
2494,-1.2111
2495,-1.2168
2496,-1.2238
2497,-1.2337
2498,-1.2417
2499,-1.248
2500,-1.2537
2501,-1.2624
2502,-1.2705
2503,-1.2774
2504,-1.2837
2505,-1.2905
2506,-1.3003
2507,-1.3066
2508,-1.3134
2509,-1.3204
2510,-1.3302
2511,-1.3371
2512,-1.3405
2513,-1.3467
2514,-1.3566
2515,-1.3634
2516,-1.3696
2517,-1.3766
2518,-1.3864
2519,-1.3934
2520,-1.3991
2521,-1.4053
2522,-1.4134
2523,-1.422
2524,-1.4282
2525,-1.4363
2526,-1.4444
2527,-1.4531
2528,-1.46
2529,-1.4662
2530,-1.4743
2531,-1.4817
2532,-1.4862
2533,-1.4923
2534,-1.4967
2535,-1.5048
2536,-1.5147
2537,-1.5217
2538,-1.5274
2539,-1.5336
2540,-1.5428
2541,-1.5503
2542,-1.5564
2543,-1.5645
2544,-1.5748
2545,-1.5809
2546,-1.5873
2547,-1.5959
2548,-1.6019
2549,-1.6129
2550,-1.6197
2551,-1.6257
2552,-1.6339
2553,-1.6414
2554,-1.6474
2555,-1.6538
2556,-1.662
2557,-1.6708
2558,-1.6772
2559,-1.6833
2560,-1.6889
2561,-1.6989
2562,-1.7049
2563,-1.7116
2564,-1.7198
2565,-1.7258
2566,-1.7361
2567,-1.7432
2568,-1.7514
2569,-1.7596
2570,-1.7666
2571,-1.7731
2572,-1.7812
2573,-1.7872
2574,-1.7939
2575,-1.8011
2576,-1.8082
2577,-1.8164
2578,-1.8235
2579,-1.8324
2580,-1.8384
2581,-1.8452
2582,-1.8523
2583,-1.8622
2584,-1.8693
2585,-1.8754
2586,-1.8811
2587,-1.891
2588,-1.8981
2589,-1.9052
2590,-1.9133
2591,-1.9221
2592,-1.9291
2593,-1.9354
2594,-1.9416
2595,-1.9491
2596,-1.9578
2597,-1.9648
2598,-1.9729
2599,-1.9799
2600,-1.9873
2601,-1.9908
2602,-1.9977
2603,-2.0046
2604,-2.0132
2605,-2.0183
2606,-2.02
2607,-2.0227
2608,-2.0283
2609,-2.0222
2610,-2.0215
2611,-2.0215
2612,-2.0265
2613,-2.0298
2614,-2.0331
2615,-2.0397
2616,-2.0455
2617,-2.0534
2618,-2.0583
2619,-2.0632
2620,-2.0699
2621,-2.0782
2622,-2.0849
2623,-2.0915
2624,-2.0980000000000003
2625,-2.1046
2626,-2.1127
2627,-2.1162
2628,-2.1126
2629,-2.1131
2630,-2.121
2631,-2.1273
2632,-2.1322
2633,-2.1384
2634,-2.146
2635,-2.1521
2636,-2.1538
2637,-2.1496
2638,-2.1541
2639,-2.1614
2640,-2.1672
2641,-2.173
2642,-2.1787
2643,-2.1842
2644,-2.1898
2645,-2.1953
2646,-2.2007
2647,-2.2075
2648,-2.2128
2649,-2.2077
2650,-2.2042
2651,-2.2094
2652,-2.2157
2653,-2.2207
2654,-2.2256
2655,-2.2288
2656,-2.2348
2657,-2.2395
2658,-2.2441
2659,-2.2469
2660,-2.2392
2661,-2.2408
2662,-2.2451
2663,-2.2493
2664,-2.2544
2665,-2.2584
2666,-2.2624
2667,-2.2644
2668,-2.2681
2669,-2.2727
2670,-2.2762
2671,-2.2797
2672,-2.2776
2673,-2.2697
2674,-2.2729
2675,-2.276
2676,-2.279
2677,-2.2825
2678,-2.2833
2679,-2.286
2680,-2.2885
2681,-2.2909
2682,-2.2938
2683,-2.2864
2684,-2.2814
2685,-2.2835
2686,-2.2859
2687,-2.2877
2688,-2.2893
2689,-2.2909
2690,-2.2927
2691,-2.292
2692,-2.2932
2693,-2.2942
2694,-2.2954
2695,-2.2917
2696,-2.2837
2697,-2.2821
2698,-2.2827
2699,-2.2833
2700,-2.2837
2701,-2.2819
2702,-2.282
2703,-2.282
2704,-2.282
2705,-2.282
2706,-2.282
2707,-2.282
2708,-2.2840000000000003
