time,value
0,-1.0231
1,-1.0118
2,-1.0044
3,-1.0018
4,-0.99674
5,-0.99334
6,-0.98739
7,-0.9851
8,-0.98103
9,-0.98065
10,-0.9794
11,-0.98105
12,-0.9796
13,-0.97596
14,-0.9649200000000001
15,-0.94655
16,-0.91285
17,-0.8496
18,-0.72612
19,-0.50658
20,-0.16875
21,0.27143
22,0.7559
23,1.2065
24,1.5563
25,1.7731
26,1.8589
27,1.8409
28,1.7536
29,1.6305
30,1.4907
31,1.3398
32,1.1704
33,0.9781
34,0.76656
35,0.55057
36,0.345
37,0.16133
38,0.0034419000000000003
39,-0.12978
40,-0.24278000000000002
41,-0.33983
42,-0.41823
43,-0.47741000000000006
44,-0.5150100000000001
45,-0.5411100000000001
46,-0.55699
47,-0.57028
48,-0.57627
49,-0.58315
50,-0.58795
51,-0.59856
52,-0.60583
53,-0.6168
54,-0.6211899999999999
55,-0.63059
56,-0.63161
57,-0.63463
58,-0.62849
59,-0.62602
60,-0.61785
61,-0.61064
62,-0.5919
63,-0.56635
64,-0.52533
65,-0.47096000000000005
66,-0.39146
67,-0.27725
68,-0.09802999999999999
69,0.18375
70,0.60359
71,1.1587
72,1.7988
73,2.4371
74,2.9812
75,3.3638
76,3.5594
77,3.5905
78,3.5044
79,3.3517
80,3.1613
81,2.9465
82,2.7054
83,2.4436
84,2.1718
85,1.9057
86,1.6433
87,1.3821
88,1.1297
89,0.90454
90,0.70643
91,0.52179
92,0.3514
93,0.21004
94,0.10467
95,0.012731999999999999
96,-0.074478
97,-0.15116
98,-0.19418
99,-0.21384
100,-0.22291
101,-0.23870999999999998
102,-0.24775
103,-0.25259000000000004
104,-0.25677
105,-0.28018000000000004
106,-0.31495
107,-0.35639
108,-0.3944
109,-0.43643000000000004
110,-0.47567
111,-0.51043
112,-0.53771
113,-0.5646100000000001
114,-0.59019
115,-0.61229
116,-0.6280899999999999
117,-0.64037
118,-0.6512600000000001
119,-0.6613399999999999
120,-0.6703399999999999
121,-0.67872
122,-0.68805
123,-0.6967399999999999
124,-0.7035399999999999
125,-0.7076
126,-0.71291
127,-0.72006
128,-0.72912
129,-0.7367
130,-0.74502
131,-0.7541
132,-0.76781
133,-0.78278
134,-0.79987
135,-0.81296
136,-0.8254100000000001
137,-0.8336399999999999
138,-0.8414200000000001
139,-0.84198
140,-0.8326600000000001
141,-0.7995399999999999
142,-0.73235
143,-0.62025
144,-0.47192
145,-0.30441999999999997
146,-0.14032999999999998
147,0.01008
148,0.14192000000000002
149,0.25593
150,0.35174
151,0.4325
152,0.50127
153,0.55803
154,0.59718
155,0.6119
156,0.60121
157,0.568
158,0.51949
159,0.46319
160,0.40956
161,0.35995
162,0.3118
163,0.25903000000000004
164,0.2062
165,0.15336
166,0.10135
167,0.048214
168,0.0020629000000000003
169,-0.034421
170,-0.062448000000000004
171,-0.087375
172,-0.107
173,-0.11745
174,-0.11919
175,-0.11703
176,-0.11731
177,-0.12059
178,-0.12761
179,-0.13546
180,-0.14636
181,-0.15971
182,-0.1796
183,-0.20424
184,-0.23513
185,-0.26723
186,-0.30121
187,-0.33444
188,-0.37185999999999997
189,-0.41191000000000005
190,-0.45524
191,-0.49576000000000003
192,-0.5354399999999999
193,-0.5724100000000001
194,-0.60469
195,-0.62261
196,-0.6279600000000001
197,-0.62535
198,-0.62546
199,-0.62602
200,-0.6299600000000001
201,-0.63494
202,-0.6431600000000001
203,-0.6500600000000001
204,-0.6583100000000001
205,-0.66928
206,-0.68166
207,-0.6884100000000001
208,-0.68465
209,-0.66884
210,-0.63218
211,-0.55935
212,-0.42578999999999995
213,-0.21554
214,0.077141
215,0.42568999999999996
216,0.78454
217,1.094
218,1.3183
219,1.4455
220,1.4991
221,1.515
222,1.5336
223,1.5747
224,1.6368
225,1.6974
226,1.7318
227,1.7218
228,1.6624
229,1.5558
230,1.4068
231,1.2216
232,1.0112
233,0.79584
234,0.59565
235,0.42466000000000004
236,0.27762
237,0.14649
238,0.01799
239,-0.10343
240,-0.21713000000000002
241,-0.31237
242,-0.3935
243,-0.45693999999999996
244,-0.51115
245,-0.55347
246,-0.59126
247,-0.62283
248,-0.6524
249,-0.67689
250,-0.69716
251,-0.71302
252,-0.72811
253,-0.7448899999999999
254,-0.7630899999999999
255,-0.78092
256,-0.79573
257,-0.80934
258,-0.82326
259,-0.83901
260,-0.85283
261,-0.8654200000000001
262,-0.8797
263,-0.89902
264,-0.91999
265,-0.9443
266,-0.9767899999999999
267,-1.0159
268,-1.0444
269,-1.0516
