time,value
0,-0.23834
1,-0.23834
2,-0.23834
3,-0.23834
4,-0.23834
5,-0.23834
6,-0.23834
7,-0.23834
8,-0.23834
9,-0.23834
10,-0.23834
11,-0.23834
12,-0.23834
13,-0.23834
14,-0.23834
15,-0.23834
16,-0.23834
17,-0.23834
18,-0.23834
19,-0.23834
20,-0.23834
21,-0.23834
22,-0.23834
23,-0.23834
24,-0.23834
25,-0.23834
26,-0.23834
27,3.7318
28,-0.23834
29,-0.23834
30,-0.23834
31,-0.23834
32,-0.23834
33,-0.23834
34,-0.23834
35,5.0899
36,-0.23834
37,-0.23834
38,-0.23834
39,1.5378
40,-0.23834
41,-0.23834
42,-0.23834
43,-0.23834
44,-0.23834
45,5.5079
46,-0.23834
47,-0.23834
48,-0.23834
49,-0.23834
50,-0.23834
51,1.8512
52,-0.23834
53,-0.23834
54,-0.23834
55,-0.23834
56,-0.23834
57,-0.23834
58,-0.23834
59,-0.23834
60,-0.23834
61,-0.23834
62,-0.23834
63,3.7318
64,-0.23834
65,-0.23834
66,-0.23834
67,-0.23834
68,-0.23834
69,-0.23834
70,-0.23834
71,-0.23834
72,-0.23834
73,-0.23834
74,-0.23834
75,-0.23834
76,-0.23834
77,-0.23834
78,-0.23834
79,-0.23834
80,-0.23834
81,-0.23834
82,-0.23834
83,-0.23834
84,-0.23834
85,-0.23834
86,-0.23834
87,-0.23834
88,-0.23834
89,-0.23834
90,-0.23834
91,-0.23834
92,-0.23834
93,-0.23834
94,-0.23834
95,-0.23834
