time,value
0,-0.10206
1,-0.10206
2,-0.10206
3,-0.10206
4,-0.10206
5,-0.10206
6,-0.10206
7,-0.10206
8,-0.10206
9,-0.10206
10,-0.10206
11,-0.10206
12,-0.10206
13,-0.10206
14,-0.10206
15,-0.10206
16,-0.10206
17,-0.10206
18,-0.10206
19,-0.10206
20,-0.10206
21,-0.10206
22,-0.10206
23,-0.10206
24,-0.10206
25,-0.10206
26,-0.10206
27,-0.10206
28,-0.10206
29,-0.10206
30,-0.10206
31,-0.10206
32,-0.10206
33,-0.10206
34,-0.10206
35,-0.10206
36,-0.10206
37,-0.10206
38,-0.10206
39,-0.10206
40,-0.10206
41,-0.10206
42,-0.10206
43,-0.10206
44,-0.10206
45,-0.10206
46,-0.10206
47,-0.10206
48,-0.10206
49,-0.10206
50,-0.10206
51,-0.10206
52,-0.10206
53,-0.10206
54,-0.10206
55,-0.10206
56,-0.10206
57,-0.10206
58,-0.10206
59,-0.10206
60,-0.10206
61,-0.10206
62,-0.10206
63,-0.10206
64,-0.10206
65,-0.10206
66,-0.10206
67,-0.10206
68,-0.10206
69,-0.10206
70,-0.10206
71,-0.10206
72,-0.10206
73,9.6959
74,-0.10206
75,-0.10206
76,-0.10206
77,-0.10206
78,-0.10206
79,-0.10206
80,-0.10206
81,-0.10206
82,-0.10206
83,-0.10206
84,-0.10206
85,-0.10206
86,-0.10206
87,-0.10206
88,-0.10206
89,-0.10206
90,-0.10206
91,-0.10206
92,-0.10206
93,-0.10206
94,-0.10206
95,-0.10206
