time,value
0,-0.30999
1,-0.30999
2,-0.30999
3,-0.30999
4,-0.30999
5,-0.30999
6,-0.30999
7,-0.30999
8,-0.30999
9,-0.30999
10,-0.30999
11,-0.30999
12,-0.30999
13,-0.30999
14,-0.30999
15,-0.30999
16,-0.30999
17,-0.30999
18,-0.30999
19,-0.30999
20,-0.30999
21,-0.30999
22,-0.30999
23,-0.30999
24,-0.30999
25,-0.30999
26,-0.30999
27,-0.30999
28,-0.30999
29,-0.30999
30,-0.30999
31,-0.30999
32,-0.30999
33,-0.30999
34,-0.30999
35,-0.30999
36,-0.30999
37,-0.30999
38,-0.30999
39,-0.30999
40,-0.30999
41,-0.30999
42,-0.30999
43,-0.30999
44,-0.30999
45,-0.30999
46,-0.30999
47,-0.30999
48,-0.30999
49,-0.30999
50,-0.30999
51,-0.30999
52,-0.30999
53,-0.30999
54,-0.30999
55,-0.30999
56,-0.30999
57,-0.30999
58,-0.30999
59,-0.30999
60,-0.30999
61,-0.30999
62,-0.30999
63,-0.30999
64,-0.30999
65,-0.30999
66,-0.30999
67,-0.30999
68,-0.30999
69,-0.30999
70,-0.30999
71,-0.30999
72,-0.30999
73,-0.30999
74,-0.30999
75,-0.30999
76,-0.30999
77,-0.30999
78,-0.30999
79,0.7342
80,3.4491
81,3.3447
82,3.3447
83,3.2403
84,3.2403
85,3.2403
86,3.2403
87,3.1358
88,-0.30999
89,-0.30999
90,-0.30999
91,-0.30999
92,-0.30999
93,-0.30999
94,-0.30999
95,-0.30999
