time,value
0,-0.34544
1,-0.34544
2,-0.34544
3,-0.34544
4,-0.34544
5,-0.34544
6,-0.34544
7,-0.34544
8,-0.34544
9,-0.34544
10,-0.34544
11,-0.34544
12,-0.013818
13,-0.34544
14,-0.34544
15,-0.34544
16,-0.34544
17,-0.34544
18,-0.34544
19,-0.34544
20,0.15199000000000001
21,-0.34544
22,-0.34544
23,-0.34544
24,-0.34544
25,-0.34544
26,-0.34544
27,-0.34544
28,-0.34544
29,-0.34544
30,-0.34544
31,-0.34544
32,-0.34544
33,-0.34544
34,-0.34544
35,-0.34544
36,-0.34544
37,-0.34544
38,-0.34544
39,-0.34544
40,-0.013818
41,-0.34544
42,-0.34544
43,-0.34544
44,-0.34544
45,-0.34544
46,-0.34544
47,-0.34544
48,-0.34544
49,-0.34544
50,-0.34544
51,-0.34544
52,-0.34544
53,-0.34544
54,-0.34544
55,-0.34544
56,-0.013818
57,-0.34544
58,-0.34544
59,-0.34544
60,-0.34544
61,-0.34544
62,-0.34544
63,-0.34544
64,-0.34544
65,-0.34544
66,-0.34544
67,-0.34544
68,-0.34544
69,-0.34544
70,-0.34544
71,-0.34544
72,-0.34544
73,-0.34544
74,-0.34544
75,-0.34544
76,-0.34544
77,-0.34544
78,-0.34544
79,-0.34544
80,-0.34544
81,-0.34544
82,0.15199000000000001
83,0.6494300000000001
84,0.6494300000000001
85,0.81524
86,3.6341
87,3.4682
88,3.6341
89,3.4682
90,3.6341
91,3.4682
92,2.805
93,0.6494300000000001
94,0.15199000000000001
95,-0.34544
