time,value
0,-0.28379
1,-0.28379
2,0.5976199999999999
3,2.8813
4,-0.28379
5,-0.28379
6,-0.28379
7,-0.28379
8,-0.28379
9,-0.28379
10,-0.28379
11,-0.28379
12,-0.28379
13,-0.28379
14,-0.28379
15,-0.28379
16,-0.28379
17,-0.28379
18,-0.28379
19,-0.28379
20,-0.28379
21,-0.28379
22,-0.28379
23,-0.28379
24,-0.28379
25,-0.28379
26,-0.083467
27,3.1217
28,-0.28379
29,-0.28379
30,-0.28379
31,-0.28379
32,-0.28379
33,-0.28379
34,-0.28379
35,-0.28379
36,1.9598
37,-0.28379
38,-0.28379
39,-0.28379
40,-0.28379
41,-0.28379
42,-0.28379
43,-0.28379
44,-0.28379
45,-0.28379
46,-0.28379
47,-0.28379
48,5.7659
49,0.79794
50,-0.28379
51,-0.28379
52,-0.28379
53,-0.28379
54,3.362
55,0.35724
56,4.4438
57,0.9181299999999999
58,-0.28379
59,-0.28379
60,-0.28379
61,-0.28379
62,-0.28379
63,-0.28379
64,-0.28379
65,-0.28379
66,-0.28379
67,-0.28379
68,-0.28379
69,-0.28379
70,-0.28379
71,-0.28379
72,-0.28379
73,-0.28379
74,-0.28379
75,-0.28379
76,-0.28379
77,-0.28379
78,-0.28379
79,-0.28379
80,-0.28379
81,-0.28379
82,-0.28379
83,-0.28379
84,-0.28379
85,-0.28379
86,-0.28379
87,-0.28379
88,-0.28379
89,-0.28379
90,-0.28379
91,-0.28379
92,-0.28379
93,-0.28379
94,-0.28379
95,-0.28379
