time,value
0,-0.39454
1,-0.17811
2,-0.39454
3,-0.39454
4,-0.17811
5,-0.39454
6,-0.17811
7,-0.39454
8,-0.39454
9,-0.17811
10,-0.39454
11,-0.17811
12,-0.39454
13,-0.39454
14,-0.17811
15,-0.39454
16,-0.39454
17,-0.17811
18,-0.39454
19,-0.17811
20,-0.39454
21,-0.39454
22,-0.17811
23,-0.39454
24,-0.39454
25,-0.17811
26,-0.39454
27,-0.17811
28,-0.39454
29,-0.39454
30,-0.17811
31,-0.39454
32,-0.17811
33,-0.39454
34,-0.39454
35,-0.17811
36,-0.39454
37,-0.17811
38,-0.39454
39,-0.39454
40,-0.17811
41,-0.39454
42,-0.39454
43,-0.17811
44,-0.39454
45,-0.17811
46,-0.39454
47,-0.39454
48,-0.17811
49,-0.39454
50,-0.39454
51,-0.17811
52,-0.39454
53,-0.39454
54,-0.17811
55,-0.39454
56,-0.17811
57,-0.39454
58,-0.39454
59,-0.17811
60,-0.39454
61,-0.39454
62,-0.17811
63,-0.39454
64,-0.39454
65,-0.17811
66,-0.39454
67,-0.39454
68,-0.17811
69,-0.39454
70,-0.39454
71,-0.17811
72,-0.39454
73,-0.39454
74,-0.17811
75,-0.39454
76,-0.39454
77,-0.17811
78,-0.39454
79,-0.39454
80,-0.17811
81,0.90407
82,-0.39454
83,-0.17811
84,-0.39454
85,0.4712
86,3.5013
87,3.5013
88,3.2849
89,3.5013
90,3.2849
91,3.5013
92,3.2849
93,1.7698
94,-0.39454
95,-0.17811
