time,value
0,1.9463
1,1.9343
2,1.9206
3,1.8932
4,1.8637
5,1.8257
6,1.7874
7,1.7493
8,1.7115
9,1.6738
10,1.6357
11,1.5972
12,1.5589
13,1.5205
14,1.4803
15,1.4428
16,1.4057
17,1.3687
18,1.3303
19,1.2923
20,1.2543
21,1.2161
22,1.1786
23,1.1412
24,1.1035
25,1.0661
26,1.0283
27,0.9910700000000001
28,0.95324
29,0.9161299999999999
30,0.87869
31,0.84144
32,0.80418
33,0.768
34,0.73098
35,0.69479
36,0.65833
37,0.62083
38,0.58402
39,0.5475800000000001
40,0.5101100000000001
41,0.47185
42,0.43423
43,0.39716
44,0.36030999999999996
45,0.32356999999999997
46,0.28586999999999996
47,0.25024
48,0.21353000000000003
49,0.17693
50,0.14045
51,0.1041
52,0.066857
53,0.030933999999999996
54,-0.005710600000000001
55,-0.041579000000000005
56,-0.078823
57,-0.1152
58,-0.1514
59,-0.18659
60,-0.22339
61,-0.26188
62,-0.29844
63,-0.33296
64,-0.36919
65,-0.40526
66,-0.44115
67,-0.47685
68,-0.51423
69,-0.54982
70,-0.58714
71,-0.62207
72,-0.65675
73,-0.69513
74,-0.73006
75,-0.76399
76,-0.80256
77,-0.8359200000000001
78,-0.87151
79,-0.90607
80,-0.9391799999999999
81,-0.97367
82,-1.0063
83,-1.0388
84,-1.0751
85,-1.1079999999999999
86,-1.1372
87,-1.1656
88,-1.1932
89,-1.2168
90,-1.2385
91,-1.2578
92,-1.2719
93,-1.2696
94,-1.2477
95,-1.2237
96,-1.198
97,-1.1722
98,-1.1434
99,-1.1126
100,-1.0797
101,-1.0468
102,-1.0114
103,-0.97593
104,-0.9444
105,-0.9088700000000001
106,-0.8723200000000001
107,-0.83455
108,-0.7963399999999999
109,-0.75741
110,-0.71763
111,-0.68612
112,-0.65564
113,-0.62459
114,-0.60365
115,-0.60341
116,-0.60925
117,-0.63485
118,-0.66723
119,-0.69286
120,-0.71253
121,-0.7460600000000001
122,-0.77774
123,-0.80369
124,-0.8290200000000001
125,-0.85251
126,-0.8832200000000001
127,-0.9176700000000001
128,-0.95201
129,-0.98598
130,-1.0113
131,-1.0331
132,-1.0562
133,-1.0815
134,-1.1092
135,-1.1276
136,-1.1442
137,-1.1682
138,-1.1933
139,-1.2127
140,-1.2364
141,-1.2589
142,-1.2873
143,-1.3111
144,-1.3303
145,-1.3155
146,-1.2847
147,-1.2528
148,-1.219
149,-1.186
150,-1.1518
151,-1.1183
152,-1.0827
153,-1.0482
154,-1.0127
155,-0.97675
156,-0.9412
157,-0.9040799999999999
158,-0.86859
159,-0.83188
160,-0.79487
161,-0.75795
162,-0.7217399999999999
163,-0.6834600000000001
164,-0.64593
165,-0.60742
166,-0.5695899999999999
167,-0.53089
168,-0.49291999999999997
169,-0.45458000000000004
170,-0.415
171,-0.3766
172,-0.33754
173,-0.29841999999999996
174,-0.2586
175,-0.21955
176,-0.17968
177,-0.13908
178,-0.098363
179,-0.056540999999999994
180,-0.019913
181,0.020309
182,0.060530999999999995
183,0.10205
184,0.1435
185,0.18534
186,0.22501999999999997
187,0.26579
188,0.30828
189,0.34968
190,0.3899
191,0.42951999999999996
192,0.47093
193,0.51315
194,0.55577
195,0.59796
196,0.6402100000000001
197,0.68323
198,0.72714
199,0.7709600000000001
200,0.81442
201,0.85457
202,0.8940100000000001
203,0.93485
204,0.9766
205,1.0175
206,1.0585
207,1.0986
208,1.1388
209,1.1785
210,1.2183
211,1.2576
212,1.297
213,1.3349
214,1.3728
215,1.4092
216,1.4213
217,1.4340000000000002
218,1.4335
219,1.4199
220,1.3983
221,1.3642
222,1.3319
223,1.3108
224,1.2901
225,1.2532
226,1.2209999999999999
227,1.1892
228,1.1577
229,1.1265
230,1.0911
231,1.0766
232,1.0764
233,1.0733
234,1.105
235,1.1320000000000001
236,1.1571
237,1.1903
238,1.2329
239,1.2709
240,1.3047
241,1.3398
242,1.3673
243,1.3906
244,1.4105
245,1.4203
246,1.4178
247,1.4040000000000001
248,1.3821
249,1.3899
250,1.3717
251,1.3403
252,1.3037
253,1.2676
254,1.232
255,1.1938
256,1.1548
257,1.1168
258,1.0769
259,1.0375
260,0.9972700000000001
261,0.95862
262,0.9188200000000001
263,0.87826
264,0.83639
265,0.7935800000000001
266,0.75497
267,0.71639
268,0.67786
269,0.63784
270,0.5947399999999999
271,0.5525800000000001
272,0.51285
273,0.4748
274,0.43604
275,0.39395
276,0.353
277,0.31325
278,0.2723
279,0.22998000000000002
280,0.19161
281,0.15142
282,0.11168
283,0.07195599999999999
284,0.031403
285,-0.0074343000000000005
286,-0.048364
287,-0.088021
288,-0.12894
289,-0.16985999999999998
290,-0.21206
291,-0.25425
292,-0.29259
293,-0.3329
294,-0.37215
295,-0.41261000000000003
296,-0.45483
297,-0.49299
298,-0.53105
299,-0.56902
300,-0.6069
301,-0.64466
302,-0.6823
303,-0.72141
304,-0.76036
305,-0.79942
306,-0.83831
307,-0.8758100000000001
308,-0.9141
309,-0.9526700000000001
310,-0.93758
311,-0.91022
312,-0.8716799999999999
313,-0.8279200000000001
314,-0.79243
315,-0.77277
316,-0.7522399999999999
317,-0.73852
318,-0.73356
319,-0.72404
320,-0.7196600000000001
321,-0.72724
322,-0.74536
323,-0.7762100000000001
324,-0.81642
325,-0.84183
326,-0.87651
327,-0.9143899999999999
328,-0.9494799999999999
329,-0.98275
330,-1.0207
331,-1.0681
332,-1.1117
333,-1.1519
334,-1.1877
335,-1.2201
336,-1.2628
337,-1.2975
338,-1.3437
339,-1.3849
340,-1.4231
341,-1.4459
342,-1.4856
343,-1.5112
344,-1.5219999999999998
345,-1.5294
346,-1.5318
347,-1.535
348,-1.531
349,-1.5288
350,-1.5239
351,-1.4957
352,-1.4559
353,-1.4169999999999998
354,-1.3773
355,-1.3361
356,-1.2925
357,-1.2582
358,-1.2192
359,-1.1861
360,-1.1657
361,-1.1517
362,-1.1391
363,-1.1252
364,-1.1182
365,-1.1015
366,-1.0835
367,-1.0841
368,-1.0865
369,-1.085
370,-1.0822
371,-1.0736
372,-1.0633
373,-1.058
374,-1.0568
375,-1.0504
376,-1.0332
377,-1.0228
378,-0.99598
379,-0.96255
380,-0.9287200000000001
381,-0.89686
382,-0.8622700000000001
383,-0.82739
384,-0.79222
385,-0.75679
386,-0.72112
387,-0.6877300000000001
388,-0.65304
389,-0.61882
390,-0.58365
391,-0.54742
392,-0.51005
393,-0.47893
394,-0.45852
395,-0.43493000000000004
396,-0.39662
397,-0.36004
398,-0.32034
399,-0.2794
400,-0.2408
401,-0.2073
402,-0.17399
403,-0.1403
404,-0.10553
405,-0.072123
406,-0.035824
407,-0.0015767
408,0.032606
409,0.06442
410,0.09107699999999999
411,0.11710999999999999
412,0.14862
413,0.1896
414,0.23168000000000002
415,0.27557
416,0.31540999999999997
417,0.35555
418,0.39454
419,0.43338000000000004
420,0.47225
421,0.51035
422,0.54911
423,0.58807
424,0.6261
425,0.66419
426,0.6986600000000001
427,0.73783
428,0.77655
429,0.81452
430,0.8528700000000001
431,0.89059
432,0.92753
433,0.96536
434,1.0033
435,1.042
436,1.08
437,1.1182
438,1.1557
439,1.1934
440,1.2317
441,1.2701
442,1.308
443,1.3465
444,1.3851
445,1.4238
446,1.462
447,1.5003
448,1.5384
449,1.5765
450,1.6148
451,1.6529
452,1.6917
453,1.73
454,1.7685
455,1.8019999999999998
456,1.8315
457,1.8566
458,1.8796
459,1.8886
460,1.9053
461,1.9311
462,1.9416
