time,value
0,-1.0878
1,-1.0878
2,-1.1768
3,-1.0878
4,-1.0878
5,-1.0878
6,-1.1768
7,-1.0878
8,-1.0878
9,-1.0878
10,-1.1768
11,-1.0878
12,-1.0878
13,-1.0878
14,-1.1768
15,-1.0878
16,-1.0878
17,-1.0878
18,-1.0878
19,-1.1768
20,-1.0878
21,-1.0878
22,-1.0878
23,-1.1768
24,-1.0878
25,-1.0878
26,-1.0878
27,-1.1768
28,-1.0878
29,-1.0878
30,-1.0878
31,-1.1768
32,-1.0878
33,-1.0878
34,-1.0878
35,-1.1768
36,0.51468
37,1.3159
38,1.0488
39,1.672
40,1.1379
41,1.1379
42,1.0488
43,1.0488
44,1.0488
45,3.0074
46,1.1379
47,1.9391
48,0.87079
49,0.51468
50,0.51468
51,0.42566000000000004
52,0.51468
53,0.51468
54,1.2269
55,1.494
56,0.78176
57,0.42566000000000004
58,0.51468
59,0.42566000000000004
60,0.51468
61,0.42566000000000004
62,0.51468
63,0.42566000000000004
64,0.51468
65,0.42566000000000004
66,0.51468
67,0.6037100000000001
68,1.8501
69,-1.0878
70,-1.0878
71,-0.82071
72,2.0281
73,0.6037100000000001
74,0.51468
75,0.42566000000000004
76,0.51468
77,0.42566000000000004
78,0.51468
79,0.42566000000000004
80,0.42566000000000004
81,0.51468
82,0.42566000000000004
83,0.51468
84,0.42566000000000004
85,0.51468
86,0.42566000000000004
87,0.51468
88,0.42566000000000004
89,0.51468
90,0.42566000000000004
91,0.42566000000000004
92,0.51468
93,0.42566000000000004
94,0.42566000000000004
95,0.51468
