time,value
0,-0.18778
1,-0.18778
2,-0.18778
3,-0.18778
4,-0.18778
5,-0.18778
6,-0.18778
7,-0.18778
8,-0.18778
9,-0.18778
10,-0.18778
11,-0.18778
12,-0.18778
13,-0.18778
14,-0.18778
15,-0.18778
16,-0.18778
17,-0.18778
18,-0.18778
19,-0.18778
20,-0.18778
21,-0.18778
22,-0.18778
23,-0.18778
24,-0.18778
25,-0.18778
26,-0.18778
27,-0.18778
28,3.0641
29,6.528
30,-0.18778
31,-0.18778
32,-0.18778
33,-0.18778
34,-0.18778
35,-0.18778
36,-0.18778
37,-0.18778
38,-0.18778
39,-0.18778
40,-0.18778
41,-0.18778
42,-0.18778
43,-0.18778
44,-0.18778
45,-0.18778
46,-0.18778
47,-0.18778
48,-0.18778
49,-0.18778
50,-0.18778
51,-0.18778
52,-0.18778
53,-0.18778
54,-0.18778
55,-0.18778
56,-0.18778
57,-0.18778
58,-0.18778
59,-0.18778
60,-0.18778
61,-0.18778
62,-0.18778
63,-0.18778
64,-0.18778
65,-0.18778
66,-0.18778
67,-0.18778
68,-0.18778
69,6.1039
70,-0.18778
71,1.5795
72,-0.18778
73,-0.18778
74,-0.18778
75,-0.18778
76,-0.18778
77,-0.18778
78,-0.18778
79,-0.18778
80,-0.18778
81,-0.18778
82,-0.18778
83,-0.18778
84,-0.18778
85,-0.18778
86,-0.18778
87,-0.18778
88,-0.18778
89,-0.18778
90,-0.18778
91,-0.18778
92,-0.18778
93,-0.18778
94,-0.18778
95,-0.18778
