[<text>
<title>calfed inc &lt;cal&gt; 3rd qtr net</title>
<dateline>    los angeles, oct 19 -
    </dateline>shr 1.99 dlrs vs 2.05 dlrs
    diluted shr 1.80 dlrs vs 1.75 dlrs
    net 50.0 mln vs 48.5 mln
    nine months
    shr 5.37 dlrs vs 5.69 dlrs
    diluted shr 4.87 dlrs vs 4.76 dlrs
    net 134.6 mln vs 129.6 mln
 reuter
</text>]