time,value
0,-1.3735
1,-1.3735
2,-1.3735
3,-1.3735
4,-1.3735
5,-1.3735
6,-1.3735
7,0.19739
8,1.1792
9,0.88466
10,0.88466
11,0.7864800000000001
12,0.6883
13,0.6883
14,0.6883
15,0.6883
16,0.6883
17,0.6883
18,0.59012
19,0.6883
20,0.6883
21,0.59012
22,-1.079
23,-1.3735
24,-1.3735
25,-1.3735
26,-1.3735
27,-1.3735
28,-1.3735
29,-1.3735
30,-0.39171
31,1.1792
32,0.98285
33,0.88466
34,0.7864800000000001
35,0.6883
36,0.6883
37,0.6883
38,0.6883
39,0.6883
40,0.59012
41,0.6883
42,0.59012
43,0.6883
44,0.59012
45,0.6883
46,0.59012
47,0.39375
48,-1.3735
49,-1.3735
50,-1.3735
51,-1.3735
52,-1.3735
53,-1.3735
54,-1.3735
55,-1.079
56,1.1792
57,1.081
58,0.88466
59,0.7864800000000001
60,0.6883
61,0.6883
62,0.6883
63,0.6883
64,0.59012
65,0.6883
66,0.59012
67,0.6883
68,0.59012
69,-1.1772
70,-1.3735
71,-1.3735
72,-1.3735
73,-1.3735
74,-1.3735
75,-1.3735
76,1.1792
77,1.081
78,0.88466
79,0.7864800000000001
80,0.6883
81,0.6883
82,0.6883
83,0.59012
84,0.6883
85,0.6883
86,0.6883
87,0.59012
88,0.6883
89,0.59012
90,0.6883
91,0.59012
92,0.59012
93,-1.3735
94,-1.3735
95,-1.3735
