time,value
0,-0.89895
1,-0.74234
2,-0.48608
3,-0.17245
4,0.15575
5,0.46558999999999995
6,0.73802
7,0.96857
8,1.1479
9,1.2808
10,1.3962
11,1.5141
12,1.6246
13,1.7045
14,1.7379
15,1.7183
16,1.6493
17,1.5395
18,1.3864
19,1.1863
20,0.95181
21,0.70407
22,0.45823
23,0.23428000000000002
24,0.044952
25,-0.1096
26,-0.23285999999999998
27,-0.33354
28,-0.41229
29,-0.47823000000000004
30,-0.5393100000000001
31,-0.58518
32,-0.61295
33,-0.62433
34,-0.6271800000000001
35,-0.6309100000000001
36,-0.63239
37,-0.63246
38,-0.62715
39,-0.61622
40,-0.61161
41,-0.6081300000000001
42,-0.60726
43,-0.60287
44,-0.59062
45,-0.57836
46,-0.5643
47,-0.55787
48,-0.5526
49,-0.52925
50,-0.47891000000000006
51,-0.36203
52,-0.10707
53,0.32614
54,0.8811100000000001
55,1.4373
56,1.9087
57,2.2687
58,2.5324
59,2.7262
60,2.8418
61,2.8547
62,2.7735
63,2.6301
64,2.4378
65,2.1857
66,1.8805
67,1.5579
68,1.2398
69,0.93242
70,0.65405
71,0.42378000000000005
72,0.25085
73,0.13358
74,0.051265
75,-0.024222999999999998
76,-0.10522000000000001
77,-0.16277
78,-0.18270999999999998
79,-0.18458
80,-0.16161
81,-0.11980999999999999
82,-0.070219
83,0.0048148
84,0.090952
85,0.14794000000000002
86,0.17439000000000002
87,0.18862
88,0.16318
89,0.088645
90,0.023965
91,-0.022308
92,-0.10422000000000001
93,-0.21516999999999997
94,-0.31277
95,-0.39647
96,-0.47338
97,-0.52984
98,-0.5627
99,-0.5858800000000001
100,-0.6062
101,-0.62222
102,-0.63537
103,-0.64584
104,-0.65685
105,-0.67271
106,-0.68602
107,-0.69493
108,-0.7056600000000001
109,-0.72088
110,-0.74005
111,-0.75912
112,-0.77715
113,-0.79408
114,-0.80995
115,-0.8274600000000001
116,-0.84541
117,-0.8592200000000001
118,-0.86856
119,-0.8763799999999999
120,-0.88349
121,-0.88695
122,-0.8868299999999999
123,-0.88695
124,-0.88675
125,-0.88508
126,-0.88508
127,-0.8873700000000001
128,-0.8908
129,-0.8927700000000001
130,-0.89761
131,-0.9088299999999999
132,-0.9207299999999999
133,-0.92848
134,-0.9315899999999999
135,-0.9369700000000001
136,-0.9472700000000001
137,-0.95411
138,-0.9532
139,-0.9323100000000001
140,-0.86503
141,-0.73229
142,-0.54301
143,-0.33592
144,-0.15479
145,-0.026848
146,0.046363999999999995
147,0.085018
148,0.10325
149,0.10455
150,0.099137
151,0.093707
152,0.08717000000000001
153,0.072497
154,0.047382
155,0.021305
156,0.00076697
157,-0.012629999999999999
158,-0.021072
159,-0.030397000000000004
160,-0.039893
161,-0.040112
162,-0.022795
163,0.019118
164,0.081412
165,0.14987
166,0.20206
167,0.21681
168,0.19614
169,0.15345
170,0.10189
171,0.056583
172,0.022921
173,-0.0026498
174,-0.025845
175,-0.048961000000000005
176,-0.06831799999999999
177,-0.091212
178,-0.12933
179,-0.18279
180,-0.24404
181,-0.30271
182,-0.35681
183,-0.40978000000000003
184,-0.45898999999999995
185,-0.50246
186,-0.53498
187,-0.55392
188,-0.56695
189,-0.57795
190,-0.58538
191,-0.58307
192,-0.57077
193,-0.55692
194,-0.54145
195,-0.5242
196,-0.50912
197,-0.49735
198,-0.49126000000000003
199,-0.48915
200,-0.48653
201,-0.48086999999999996
202,-0.47135
203,-0.46153999999999995
204,-0.45228999999999997
205,-0.44401
206,-0.43901
207,-0.43373
208,-0.42775
209,-0.42168
210,-0.41236999999999996
211,-0.40791
212,-0.4113
213,-0.42328000000000005
214,-0.44243000000000005
215,-0.45635
216,-0.45973
217,-0.435
218,-0.3803
219,-0.31579
220,-0.24715
221,-0.18450999999999998
222,-0.12217
223,-0.025009
224,0.1778
225,0.57247
226,1.1661
227,1.8412
228,2.4181
229,2.7795
230,2.9432
231,3.0055
232,3.0373
233,3.0467
234,3.0029
235,2.8739
236,2.6483
237,2.3412
238,1.9811
239,1.5857
240,1.1656
241,0.7500600000000001
242,0.37144
243,0.045909
244,-0.21300999999999998
245,-0.40565999999999997
246,-0.54188
247,-0.64269
248,-0.72511
249,-0.78171
250,-0.81819
251,-0.8433299999999999
252,-0.8604
253,-0.8769299999999999
254,-0.8881700000000001
255,-0.8973
256,-0.90507
257,-0.90953
258,-0.91715
259,-0.9241799999999999
260,-0.9300200000000001
261,-0.93785
262,-0.94786
263,-0.9576
264,-0.96267
265,-0.9629700000000001
266,-0.96275
267,-0.9647399999999999
268,-0.9676899999999999
269,-0.9688700000000001
