time,value
0,-0.032989
1,-0.032989
2,-0.032989
3,-0.032989
4,-0.032989
5,-0.032989
6,-0.032989
7,0.040661
8,-0.032989
9,-0.032989
10,-0.032989
11,-0.032989
12,-0.032989
13,-0.032989
14,0.040661
15,-0.032989
16,-0.032989
17,-0.032989
18,-0.032989
19,-0.032989
20,-0.032989
21,0.040661
22,-0.032989
23,-0.032989
24,-0.032989
25,-0.032989
26,-0.032989
27,0.040661
28,-0.032989
29,-0.032989
30,-0.032989
31,0.55621
32,0.18796
33,-0.032989
34,0.040661
35,-0.032989
36,0.26161
37,0.6298600000000001
38,0.55621
39,2.0292
40,1.3664
41,0.6298600000000001
42,1.5873
43,1.44
44,1.1454
45,1.2191
46,1.3664
47,1.44
48,0.8508100000000001
49,1.9556
50,0.7035100000000001
51,0.55621
52,0.55621
53,0.55621
54,0.11431
55,0.040661
56,0.99811
57,1.2191
58,1.2927
59,1.9556
60,1.0718
61,1.2191
62,2.0292
63,0.99811
64,0.55621
65,1.5137
66,1.7346
67,1.7346
68,-0.18029
69,-1.2114
70,-1.285
71,-1.285
72,-1.285
73,-1.3587
74,-1.285
75,-1.285
76,-1.3587
77,-1.285
78,-1.285
79,-1.285
80,-1.3587
81,-1.285
82,-1.285
83,-1.3587
84,-1.285
85,-1.285
86,-1.285
87,-1.3587
88,-1.285
89,-1.285
90,-1.285
91,-1.3587
92,-1.285
93,-1.285
94,-1.285
95,-1.3587
