time,value
0,-0.1915
1,-0.1915
2,-0.19478
3,-0.17512
4,-0.20788
5,-0.17512
6,-0.19805
7,-0.18167
8,-0.18495
9,-0.19805
10,-0.16202
11,-0.19805
12,-0.17185
13,-0.1915
14,-0.18495
15,-0.16202
16,-0.20133
17,-0.15874000000000002
18,-0.19805
19,-0.16857
20,-0.17512
21,-0.20133
22,-0.16529000000000002
23,-0.19478
24,-0.17185
25,-0.18167
26,-0.18495
27,-0.14236
28,-0.18167
29,-0.16857
30,-0.16202
31,-0.17512
32,-0.14236
33,-0.1784
34,-0.14892
35,-0.17512
36,-0.16529000000000002
37,-0.17512
38,-0.18167
39,-0.15547
40,-0.1784
41,-0.15547
42,-0.18823
43,-0.17512
44,-0.17185
45,-0.18823
46,-0.17512
47,-0.19805
48,-0.13909000000000002
49,-0.19478
50,-0.16202
51,-0.18167
52,-0.15874000000000002
53,-0.16529000000000002
54,-0.16857
55,-0.15547
56,-0.18167
57,-0.15874000000000002
58,-0.18495
59,-0.14892
60,-0.16529000000000002
61,-0.16529000000000002
62,-0.17185
63,-0.18495
64,-0.15874000000000002
65,-0.19478
66,-0.15874000000000002
67,-0.19805
68,-0.16529000000000002
69,-0.18823
70,-0.1784
71,-0.18167
72,-0.1784
73,4.0376
74,6.8876
75,5.3283
76,-0.12270999999999999
77,-0.14892
78,-0.14892
79,-0.18167
80,-0.14236
81,-0.1915
82,-0.16202
83,-0.16857
84,-0.18167
85,-0.15874000000000002
86,-0.1784
87,-0.16202
88,-0.19805
89,-0.16529000000000002
90,-0.1915
91,-0.16857
92,-0.20461
93,-0.1784
94,-0.1784
95,-0.1784
