time,value
0,1.7101
1,1.6814
2,1.6
3,1.5173
4,1.4354
5,1.3538
6,1.272
7,1.1904
8,1.1089
9,1.0277
10,0.94699
11,0.86715
12,0.78746
13,0.70704
14,0.6268
15,0.54605
16,0.46538999999999997
17,0.38484
18,0.3044
19,0.2232
20,0.14205
21,0.06095
22,-0.019788
23,-0.1
24,-0.18085
25,-0.2616
26,-0.34097
27,-0.42141000000000006
28,-0.50169
29,-0.5817899999999999
30,-0.66164
31,-0.74122
32,-0.81853
33,-0.8951399999999999
34,-0.97288
35,-1.05
36,-1.126
37,-1.2005
38,-1.2694
39,-1.3386
40,-1.4033
41,-1.4613
42,-1.5051
43,-1.5338
44,-1.5447
45,-1.5338
46,-1.501
47,-1.4538
48,-1.4012
49,-1.3321
50,-1.2633
51,-1.1881
52,-1.1243
53,-1.0489
54,-0.9741799999999999
55,-0.89723
56,-0.81896
57,-0.74207
58,-0.66275
59,-0.58312
60,-0.5032399999999999
61,-0.42313999999999996
62,-0.34285
63,-0.26242
64,-0.18202000000000002
65,-0.10162
66,-0.021516
67,0.059387999999999996
68,0.14035999999999998
69,0.22086
70,0.30158
71,0.38189
72,0.46234
73,0.54289
74,0.62287
75,0.70335
76,0.7833899999999999
77,0.8629899999999999
78,0.943
79,1.0236
80,1.1047
81,1.1861
82,1.2676
83,1.3493
84,1.431
85,1.5129
86,1.5955
87,1.6766
88,1.7087
89,1.6709
90,1.5889
91,1.507
92,1.4253
93,1.3435
94,1.2619
95,1.1803
96,1.0988
97,1.0175
98,0.93653
99,0.85695
100,0.7762600000000001
101,0.6957300000000001
102,0.6149899999999999
103,0.5345300000000001
104,0.45378
105,0.37313
106,0.2926
107,0.21218
108,0.13191
109,0.050817
110,-0.029197000000000004
111,-0.11010999999999999
112,-0.19095
113,-0.27048
114,-0.35104
115,-0.43007
116,-0.5102399999999999
117,-0.59021
118,-0.66924
119,-0.7475
120,-0.82639
121,-0.9048
122,-0.9809899999999999
123,-1.0569
124,-1.1324
125,-1.2064
126,-1.2783
127,-1.3426
128,-1.406
129,-1.4621
130,-1.5073
131,-1.5363
132,-1.5445
133,-1.5279
134,-1.4946
135,-1.4415
136,-1.3838
137,-1.3222
138,-1.2507
139,-1.1823
140,-1.1082
141,-1.0325
142,-0.95576
143,-0.87818
144,-0.79996
145,-0.7221
146,-0.6438699999999999
147,-0.56429
148,-0.48445
149,-0.40439
150,-0.32415
151,-0.24505
152,-0.16447
153,-0.083768
154,-0.0029768
155,0.076847
156,0.15686
157,0.23794
158,0.3182
159,0.39859
160,0.4791
161,0.55972
162,0.63978
163,0.7206199999999999
164,0.8004600000000001
165,0.8802700000000001
166,0.96055
167,1.0414
168,1.1227
169,1.2041
170,1.2857
171,1.3673
172,1.4488
173,1.5306
174,1.6124
175,1.6873
