time,value
0,0.80401
1,0.8986
2,0.80401
3,0.80401
4,0.80401
5,0.80401
6,0.80401
7,-0.23646999999999999
8,-1.0878
9,-1.0878
10,-1.0878
11,-1.0878
12,-1.0878
13,-1.0878
14,-1.0878
15,-1.0878
16,-1.0878
17,1.1824
18,1.2770000000000001
19,1.0878
20,0.99318
21,0.8986
22,0.8986
23,0.8986
24,0.8986
25,0.80401
26,0.8986
27,0.80401
28,0.8986
29,0.80401
30,0.80401
31,0.80401
32,0.80401
33,0.80401
34,0.80401
35,-0.047294
36,-1.0878
37,-1.0878
38,-1.0878
39,-1.0878
40,-1.0878
41,-1.0878
42,-1.0878
43,-1.0878
44,-0.14188
45,1.2770000000000001
46,1.1824
47,1.0878
48,0.99318
49,-0.23646999999999999
50,-1.0878
51,-1.0878
52,-1.0878
53,-1.0878
54,-1.0878
55,-1.0878
56,0.7094199999999999
57,1.3715
58,1.0878
59,0.99318
60,0.99318
61,-0.42565
62,-1.0878
63,-1.0878
64,-1.0878
65,-1.0878
66,-1.0878
67,-1.0878
68,0.14188
69,1.2770000000000001
70,1.1824
71,1.0878
72,0.8986
73,0.14188
74,-1.0878
75,-1.0878
76,-1.0878
77,-1.0878
78,-1.0878
79,-1.0878
80,0.42565
81,1.2770000000000001
82,1.1824
83,0.99318
84,0.99318
85,-0.23646999999999999
86,-1.0878
87,-1.0878
88,-1.0878
89,-1.0878
90,-1.0878
91,-1.0878
92,1.0878
93,1.3715
94,1.0878
95,0.99318
