time,value
0,0.10367
1,0.41083000000000003
2,0.77942
3,0.042235
4,-0.08063
5,-0.44922
6,-0.69495
7,-0.019198
8,-0.08063
9,-0.69495
10,-0.63352
11,-0.69495
12,-0.51066
13,0.10367
14,-0.32636
15,-0.14206
16,0.10367
17,-0.019198
18,0.41083000000000003
19,0.71799
20,0.042235
21,-0.019198
22,-0.69495
23,-0.63352
24,-0.08063
25,-0.08063
26,-0.63352
27,-0.69495
28,-0.69495
29,-0.51066
30,7.3527
31,1.0252
32,0.1651
33,0.10367
34,-0.019198
35,0.41083000000000003
36,0.77942
37,-0.26493
38,-0.69495
39,-0.63352
40,-0.69495
41,0.042235
42,-0.14206
43,-0.63352
44,-0.69495
45,-0.63352
46,-0.44922
47,0.22653
48,0.3494
49,0.10367
50,0.042235
51,0.042235
52,0.53369
53,0.71799
54,-0.63352
55,-0.63352
56,-0.63352
57,4.2811
58,0.10367
59,-0.69495
60,-0.63352
61,-0.69495
62,-0.44922
63,0.41083000000000003
64,1.0252
65,0.10367
66,0.3494
67,0.22653
68,0.71799
69,0.53369
70,-0.69495
71,-0.75639
72,-0.51066
73,-0.44922
74,0.28796
75,-0.20349
76,-0.51066
77,-0.51066
78,-0.44922
79,0.042235
80,1.0252
81,0.28796
82,0.1651
83,0.1651
84,-0.08063
85,0.28796
86,-0.08063
87,-0.51066
88,-0.51066
89,-0.51066
90,-0.32636
91,0.28796
92,-0.38779
93,-0.51066
94,-0.51066
95,0.22653
