time,value
0,-0.16741
1,-0.20536
2,-0.17909
3,-0.19368
4,-0.18785
5,-0.19077
6,-0.18785
7,-0.17617
8,-0.20244
9,-0.17325
10,-0.19952
11,-0.17617
12,-0.1966
13,-0.18200999999999998
14,-0.16449
15,-0.19077
16,-0.17909
17,-0.19368
18,-0.17033
19,-0.19368
20,-0.17909
21,-0.17617
22,-0.19368
23,-0.17909
24,-0.19368
25,-0.15866
26,-0.19077
27,-0.17325
28,-0.16741
29,-0.17325
30,-0.1499
31,-0.18492999999999998
32,-0.14406
33,-0.17325
34,-0.16741
35,-0.17033
36,-0.18785
37,-0.16449
38,-0.19368
39,-0.15866
40,-0.19077
41,-0.17909
42,-0.18200999999999998
43,-0.19077
44,-0.17909
45,-0.1966
46,-0.17617
47,-0.19368
48,-0.17909
49,-0.18492999999999998
50,-0.19077
51,-0.16741
52,-0.1966
53,-0.17617
54,-0.1966
55,-0.18785
56,-0.18785
57,-0.19368
58,-0.16741
59,-0.19368
60,-0.17325
61,-0.1966
62,-0.18492999999999998
63,-0.19368
64,-0.19077
65,-0.18200999999999998
66,-0.19368
67,-0.17617
68,-0.19952
69,-0.16158
70,-0.19952
71,-0.18200999999999998
72,-0.18785
73,-0.16158
74,-0.17617
75,6.1813
76,5.7493
77,4.5584
78,-0.088602
79,-0.10903
80,-0.13822
81,-0.13822
82,-0.15866
83,-0.13239
84,-0.16741
85,-0.15574000000000002
86,-0.14406
87,-0.17617
88,-0.16158
89,-0.19077
90,-0.16741
91,-0.18200999999999998
92,-0.17909
93,-0.16741
94,-0.20244
95,-0.17033
