[<text>
<title>jepson corp &lt;jeps.o&gt; 3rd qtr net</title>
<dateline>    chicago, oct 19 -
    </dateline>shr 22 cts vs 20 cts
    net 4,033,000 vs 3,398,000
    sales 125.3 mln vs 99.1 mln
    avg shrs 18.4 mln vs 17.5 mln
    nine mths
    shr 89 cts vs 78 cts
    net 15.9 mln vs 13.6 mln
    sales 413.7 mln vs 345.0 mln
    avg shrs 17.8 mln vs 17.5 mln
   
    note:1987 3rd qtr per share reflects issuance of two mln
shares in initial public offering. 1986 nine mth results
include extraordinary gain of 3,843,000 dlrs or 22 cts
 reuter
</text>]