time,value
0,0.25969000000000003
1,0.25969000000000003
2,0.25969000000000003
3,-1.5211
4,0.25969000000000003
5,0.25969000000000003
6,0.25969000000000003
7,-1.5211
8,0.25969000000000003
9,0.25969000000000003
10,0.25969000000000003
11,-1.5211
12,0.25969000000000003
13,0.25969000000000003
14,0.25969000000000003
15,-1.5211
16,0.25969000000000003
17,0.25969000000000003
18,0.25969000000000003
19,-1.5211
20,0.25969000000000003
21,0.25969000000000003
22,0.25969000000000003
23,0.25969000000000003
24,-1.5211
25,0.25969000000000003
26,0.25969000000000003
27,0.25969000000000003
28,-1.5211
29,0.25969000000000003
30,0.25969000000000003
31,0.25969000000000003
32,-1.5211
33,0.25969000000000003
34,0.25969000000000003
35,0.25969000000000003
36,-1.5211
37,0.25969000000000003
38,0.25969000000000003
39,0.25969000000000003
40,-1.5211
41,0.25969000000000003
42,0.25969000000000003
43,0.25969000000000003
44,-1.5211
45,0.25969000000000003
46,0.25969000000000003
47,0.25969000000000003
48,-1.5211
49,0.25969000000000003
50,0.25969000000000003
51,0.25969000000000003
52,-1.5211
53,0.25969000000000003
54,0.25969000000000003
55,0.25969000000000003
56,-1.5211
57,0.25969000000000003
58,0.25969000000000003
59,0.25969000000000003
60,0.25969000000000003
61,-1.5211
62,0.25969000000000003
63,0.25969000000000003
64,0.25969000000000003
65,-1.5211
66,0.25969000000000003
67,0.25969000000000003
68,0.25969000000000003
69,-1.5211
70,0.25969000000000003
71,0.25969000000000003
72,0.25969000000000003
73,-1.5211
74,0.25969000000000003
75,0.25969000000000003
76,0.25969000000000003
77,-1.5211
78,0.25969000000000003
79,0.25969000000000003
80,0.25969000000000003
81,-1.5211
82,0.25969000000000003
83,2.0404
84,2.0404
85,3.8212
86,3.8212
87,2.0404
88,0.25969000000000003
89,0.25969000000000003
90,0.25969000000000003
91,0.25969000000000003
92,-1.5211
93,0.25969000000000003
94,0.25969000000000003
95,0.25969000000000003
