time,value
0,-0.76483
1,0.7508
2,1.5928
3,-0.76483
4,-0.76483
5,-0.76483
6,0.7508
7,1.5928
8,2.94
9,-0.76483
10,-0.76483
11,-0.76483
12,-0.091218
13,1.5928
14,-0.091218
15,-0.76483
16,-0.76483
17,-0.76483
18,1.5928
19,0.24559
20,-0.76483
21,-0.76483
22,-0.76483
23,1.0876
24,1.0876
25,-0.76483
26,-0.76483
27,-0.76483
28,0.24559
29,1.5928
30,-0.42801999999999996
31,-0.76483
32,-0.76483
33,-0.76483
34,1.5928
35,0.58239
36,-0.76483
37,-0.76483
38,-0.76483
39,0.41398999999999997
40,1.5928
41,-0.76483
42,-0.76483
43,-0.76483
44,-0.76483
45,1.7612
46,0.077185
47,-0.76483
48,-0.76483
49,-0.76483
50,1.256
51,0.9192
52,-0.76483
53,-0.76483
54,-0.76483
55,0.24559
56,1.5928
57,-0.42801999999999996
58,-0.76483
59,-0.76483
60,-0.76483
61,1.256
62,0.9192
63,-0.76483
64,-0.76483
65,-0.76483
66,-0.091218
67,1.7612
68,-0.42801999999999996
69,-0.76483
70,-0.76483
71,-0.76483
72,1.256
73,1.5928
74,-0.091218
75,-0.76483
76,-0.42801999999999996
77,1.7612
78,1.5928
79,-0.76483
80,-0.76483
81,-0.76483
82,1.0876
83,1.5928
84,-0.76483
85,-0.76483
86,-0.76483
87,1.256
88,1.256
89,-0.76483
90,-0.76483
91,-0.76483
92,0.9192
93,1.256
94,-0.76483
95,-0.76483
