time,value
0,-0.69439
1,-0.69439
2,-0.69439
3,-0.69439
4,1.3256
5,1.6623
6,1.494
7,0.31563
8,-0.69439
9,-0.69439
10,-0.69439
11,-0.69439
12,-0.69439
13,1.8307
14,1.6623
15,0.6523
16,-0.69439
17,-0.69439
18,-0.69439
19,-0.69439
20,-0.69439
21,0.8206399999999999
22,1.8307
23,1.3256
24,-0.69439
25,-0.69439
26,-0.69439
27,-0.69439
28,-0.69439
29,-0.69439
30,1.999
31,1.494
32,-0.021041999999999998
33,-0.69439
34,-0.69439
35,-0.69439
36,-0.69439
37,-0.69439
38,0.9889700000000001
39,1.8307
40,0.9889700000000001
41,-0.69439
42,-0.69439
43,-0.69439
44,-0.69439
45,-0.69439
46,-0.69439
47,1.999
48,1.6623
49,-0.18938
50,-0.69439
51,-0.69439
52,-0.69439
53,-0.69439
54,-0.69439
55,0.48396999999999996
56,1.8307
57,1.1573
58,-0.69439
59,-0.69439
60,-0.69439
61,-0.69439
62,-0.69439
63,-0.69439
64,1.494
65,1.6623
66,0.48396999999999996
67,-0.69439
68,-0.69439
69,-0.69439
70,-0.69439
71,-0.69439
72,-0.18938
73,1.999
74,1.494
75,-0.35771
76,-0.69439
77,-0.69439
78,-0.69439
79,-0.69439
80,-0.69439
81,1.6623
82,1.6623
83,0.48396999999999996
84,-0.69439
85,-0.69439
86,-0.69439
87,-0.69439
88,-0.69439
89,0.8206399999999999
90,1.8307
91,1.494
92,-0.021041999999999998
93,-0.69439
94,-0.69439
95,-0.69439
