time,value
0,-0.29669
1,-0.29669
2,-0.29669
3,-0.29669
4,-0.29669
5,-0.29669
6,-0.29669
7,-0.29669
8,-0.29669
9,-0.29669
10,-0.29669
11,-0.29669
12,-0.29669
13,-0.29669
14,-0.29669
15,-0.29669
16,-0.29669
17,-0.29669
18,-0.29669
19,-0.29669
20,-0.29669
21,-0.29669
22,-0.29669
23,-0.29669
24,-0.29669
25,-0.29669
26,-0.29669
27,-0.29669
28,1.629
29,1.629
30,-0.29669
31,-0.29669
32,-0.29669
33,-0.29669
34,-0.29669
35,2.623
36,6.785
37,-0.29669
38,-0.29669
39,-0.29669
40,-0.29669
41,-0.29669
42,3.182
43,-0.29669
44,-0.29669
45,-0.29669
46,-0.29669
47,-0.29669
48,-0.29669
49,-0.29669
50,-0.29669
51,-0.14139000000000002
52,-0.17245
53,-0.29669
54,-0.29669
55,-0.29669
56,-0.29669
57,-0.29669
58,-0.29669
59,-0.29669
60,-0.29669
61,-0.29669
62,2.7783
63,0.94571
64,-0.29669
65,-0.29669
66,-0.29669
67,2.0949
68,0.47981
69,-0.29669
70,-0.29669
71,-0.29669
72,-0.29669
73,-0.29669
74,-0.29669
75,-0.29669
76,-0.29669
77,-0.29669
78,-0.29669
79,-0.29669
80,-0.29669
81,-0.29669
82,-0.29669
83,-0.29669
84,-0.29669
85,-0.29669
86,2.4366
87,0.35557
88,-0.29669
89,-0.29669
90,-0.29669
91,-0.29669
92,-0.29669
93,-0.29669
94,-0.29669
95,-0.29669
