{
  "about": {
    "problemID": "LL1_Haptics_problem",
    "problemName": "LL1 Haptics problem",
    "problemDescription": "A time series classification problem.",
    "problemSchemaVersion": "4.0.0",
    "problemVersion": "4.0.0",
    "taskKeywords": [
      "classification",
      "multiClass",
      "timeSeries"
    ]
  },
  "inputs": {
    "data": [
      {
        "datasetID": "LL1_Haptics_dataset",
        "targets": [
          {
            "targetIndex": 0,
            "resID": "learningData",
            "colIndex": 2,
            "colName": "label"
          }
        ]
      }
    ],
    "dataSplits": {
      "method": "holdOut",
      "testSize": 0.665,
      "stratified": true,
      "numRepeats": 0,
      "splitsFile": "dataSplits.csv",
      "datasetViewMaps": {
        "train": [
          {
            "from": "LL1_Haptics_dataset",
            "to": "LL1_Haptics_dataset_TRAIN"
          }
        ],
        "test": [
          {
            "from": "LL1_Haptics_dataset",
            "to": "LL1_Haptics_dataset_TEST"
          }
        ],
        "score": [
          {
            "from": "LL1_Haptics_dataset",
            "to": "LL1_Haptics_dataset_SCORE"
          }
        ]
      }
    },
    "performanceMetrics": [
      {
        "metric": "f1Macro"
      }
    ]
  },
  "expectedOutputs": {
    "predictionsFile": "predictions.csv"
  }
}