time,value
0,-0.5162800000000001
1,-0.60607
2,-0.5162800000000001
3,-0.5162800000000001
4,-0.5162800000000001
5,-0.60607
6,-0.5162800000000001
7,-0.5162800000000001
8,-0.5162800000000001
9,-0.60607
10,-0.5162800000000001
11,-0.5162800000000001
12,-0.5162800000000001
13,-0.60607
14,-0.5162800000000001
15,-0.5162800000000001
16,-0.5162800000000001
17,-0.60607
18,-0.5162800000000001
19,-0.5162800000000001
20,-0.5162800000000001
21,-0.60607
22,-0.5162800000000001
23,-0.5162800000000001
24,-0.5162800000000001
25,-0.5162800000000001
26,-0.60607
27,-0.5162800000000001
28,-0.5162800000000001
29,-0.5162800000000001
30,-0.60607
31,-0.5162800000000001
32,0.29181
33,1.7284
34,1.7284
35,1.6386
36,1.7284
37,2.5365
38,2.0876
39,1.6386
40,1.7284
41,2.6263
42,1.7284
43,1.6386
44,2.5365
45,1.6386
46,1.6386
47,1.3693
48,1.5488
49,2.1773
50,2.5365
51,1.3693
52,1.0999
53,1.0999
54,1.1897
55,-0.60607
56,-0.5162800000000001
57,-0.5162800000000001
58,-0.5162800000000001
59,-0.60607
60,-0.5162800000000001
61,-0.5162800000000001
62,-0.5162800000000001
63,-0.60607
64,-0.5162800000000001
65,-0.5162800000000001
66,-0.5162800000000001
67,-0.60607
68,-0.5162800000000001
69,-0.5162800000000001
70,-0.5162800000000001
71,-0.5162800000000001
72,-0.60607
73,-0.5162800000000001
74,-0.5162800000000001
75,-0.5162800000000001
76,-0.60607
77,-0.5162800000000001
78,-0.5162800000000001
79,-0.5162800000000001
80,-0.60607
81,-0.5162800000000001
82,-0.5162800000000001
83,-0.5162800000000001
84,-0.60607
85,-0.5162800000000001
86,-0.5162800000000001
87,-0.5162800000000001
88,-0.60607
89,-0.5162800000000001
90,-0.5162800000000001
91,-0.5162800000000001
92,-0.60607
93,-0.5162800000000001
94,-0.5162800000000001
95,-0.5162800000000001
