time,value
0,-0.21944
1,-0.24248000000000003
2,-0.21253000000000002
3,-0.22866
4,-0.24248000000000003
5,-0.22175
6,-0.24248000000000003
7,-0.22405
8,-0.23326
9,-0.24478000000000003
10,-0.21253000000000002
11,-0.24248000000000003
12,-0.22866
13,-0.23096
14,-0.24478000000000003
15,-0.20793000000000003
16,-0.24248000000000003
17,-0.23556999999999997
18,-0.22635
19,-0.24248000000000003
20,-0.21944
21,-0.24017
22,-0.23786999999999997
23,-0.21714
24,-0.24708000000000002
25,-0.22175
26,-0.23326
27,-0.22866
28,-0.21023000000000003
29,-0.24478000000000003
30,-0.22866
31,-0.20332
32,-0.23556999999999997
33,-0.20102
34,-0.23556999999999997
35,-0.21253000000000002
36,-0.21944
37,-0.24017
38,-0.21253000000000002
39,-0.23326
40,-0.22866
41,-0.22635
42,-0.24248000000000003
43,-0.20793000000000003
44,-0.24017
45,-0.23556999999999997
46,-0.22866
47,-0.24017
48,-0.21714
49,-0.24017
50,-0.22866
51,-0.21484
52,-0.24478000000000003
53,-0.21253000000000002
54,-0.23096
55,-0.23326
56,-0.22635
57,-0.24708000000000002
58,-0.21484
59,-0.23786999999999997
60,-0.23786999999999997
61,-0.22635
62,-0.24478000000000003
63,-0.21944
64,-0.23096
65,-0.23556999999999997
66,-0.22175
67,-0.24708000000000002
68,-0.22866
69,-0.24017
70,-0.23786999999999997
71,-0.21714
72,-0.24708000000000002
73,-0.22635
74,-0.23556999999999997
75,-0.23556999999999997
76,-0.22405
77,-0.24478000000000003
78,-0.22866
79,-0.23096
80,-0.24248000000000003
81,3.0141
82,4.9994
83,4.8751
84,4.7277
85,3.1684
86,-0.16877999999999999
87,-0.19180999999999998
88,-0.21944
89,-0.20563
90,-0.23096
91,-0.21484
92,-0.22635
93,-0.23096
94,-0.20563
95,-0.24017
