time,value
0,0.69285
1,0.69285
2,0.59729
3,0.69285
4,0.69285
5,0.69285
6,0.59729
7,0.69285
8,0.5017199999999999
9,-1.314
10,-1.314
11,-1.314
12,-1.314
13,-1.314
14,-1.314
15,-1.314
16,0.97955
17,1.0751
18,0.8839899999999999
19,0.8839899999999999
20,0.69285
21,0.78842
22,0.69285
23,0.69285
24,0.59729
25,0.69285
26,-1.314
27,-1.314
28,-1.314
29,-1.314
30,-1.314
31,-1.314
32,-1.314
33,1.0751
34,1.0751
35,0.8839899999999999
36,0.78842
37,0.78842
38,0.69285
39,0.78842
40,0.69285
41,0.69285
42,0.69285
43,0.69285
44,-0.071674
45,-1.314
46,-1.314
47,-1.314
48,-1.314
49,-1.314
50,-1.314
51,-0.16724
52,1.1707
53,0.97955
54,0.78842
55,0.78842
56,0.78842
57,0.69285
58,0.69285
59,0.69285
60,0.69285
61,0.69285
62,0.69285
63,0.69285
64,0.023891
65,-1.314
66,-1.314
67,-1.314
68,-1.314
69,-1.314
70,-1.314
71,-1.314
72,0.78842
73,1.1707
74,0.8839899999999999
75,0.78842
76,0.78842
77,0.69285
78,0.69285
79,0.78842
80,0.69285
81,0.69285
82,0.59729
83,0.69285
84,-0.16724
85,-1.314
86,-1.314
87,-1.314
88,-1.314
89,-1.314
90,-1.314
91,-1.314
92,0.8839899999999999
93,1.0751
94,0.8839899999999999
95,0.8839899999999999
