time,value
0,-0.15735
1,-0.090558
2,0.16485
3,0.11854
4,0.10309000000000001
5,0.29014
6,0.15641
7,0.14007999999999998
8,0.15666
9,0.15167
10,0.16662000000000002
11,0.18747
12,0.23384000000000002
13,0.27071999999999996
14,0.29574
15,0.38444
16,0.47965
17,0.55433
18,0.095566
19,-0.05466
20,-1.3642
21,-2.2773
22,-3.5574
23,-3.9614
24,-4.5786
25,-4.8893
26,-4.7443
27,-4.4139
28,-3.7715
29,-3.5406
30,-3.181
31,-2.7104
32,-1.8132
33,-0.9776299999999999
34,-0.9434100000000001
35,-0.48006000000000004
36,0.38774000000000003
37,0.60842
38,0.69467
39,1.2016
40,1.1244
41,1.1661
42,1.2351
43,1.218
44,1.1251
45,1.2163
46,0.9656899999999999
47,1.2027
48,0.4102
49,-0.054738999999999996
50,1.2699
51,1.746
52,1.0697
53,0.64289
54,0.7331300000000001
55,0.96154
56,0.92785
57,0.7925399999999999
58,0.66446
59,0.46488
60,0.5763
61,0.55155
62,0.62022
63,0.51127
64,0.45501
65,0.49044
66,0.4613
67,0.28449
68,0.32898
69,0.31090999999999996
70,0.35518
71,0.21044000000000002
72,0.28709
73,0.28765999999999997
74,0.33333
75,0.26728
76,0.16617
77,0.22858
78,0.31298000000000004
79,0.28189000000000003
80,0.33098
81,0.21151
82,0.39254
83,0.24024
84,0.17356
85,-0.077426
86,-0.87045
87,-0.044660000000000005
88,0.18076
89,0.23314000000000001
90,0.14190999999999998
91,-0.16875
92,-0.034807
93,-0.23218000000000003
94,-0.034991
95,-0.48281999999999997
96,-0.15565
97,-0.64313
98,-1.3633
99,-1.2275
100,-1.4253
101,-1.8485
102,-2.0839
103,-2.4555
104,-2.4994
105,-2.2308
106,-2.3098
107,-2.6964
108,-2.3537
109,-2.0297
110,-1.9853
111,-1.8902
112,-1.8283
113,-1.7782
114,-1.3327
115,-1.244
116,-0.75639
117,0.019172
118,0.13389
119,0.29148
120,0.56062
121,0.6592399999999999
122,0.76322
123,0.60439
124,0.6287699999999999
125,0.76759
126,0.7942100000000001
127,0.6973
128,0.47921
129,0.52322
130,0.59402
131,0.7718
132,0.8371700000000001
133,0.83237
134,0.75759
135,0.64987
136,0.5685899999999999
137,0.5189699999999999
138,0.50516
139,0.53032
140,0.55429
141,0.55809
142,0.6111300000000001
143,0.5385300000000001
144,0.51671
145,0.55309
146,0.6493
147,0.72187
148,0.6469199999999999
149,0.5836100000000001
150,0.51639
151,0.39699
152,0.28769
153,0.37037
154,0.31539
155,0.39209
156,0.39088
157,0.42233999999999994
158,0.35612
159,0.37068
160,0.39915
161,0.45116999999999996
162,0.43968999999999997
163,0.47501000000000004
164,0.45169
165,0.46384
166,0.56426
167,0.58109
168,0.57206
169,0.5365
170,0.64613
171,0.5658
172,0.54093
173,0.55805
174,0.55497
175,0.54456
176,0.53801
177,0.53072
178,0.50298
179,0.49958
180,0.3068
181,0.34301
182,0.56709
183,0.5543399999999999
184,0.56682
185,0.53379
186,0.51804
187,0.49818999999999997
188,0.34775
189,0.26589
190,0.29161
191,0.23678000000000002
192,0.19175999999999999
193,0.19987
194,0.22003000000000003
195,0.21539
196,0.22582
197,0.21095999999999998
198,0.24024
199,0.27291
200,0.091182
201,0.17995999999999998
202,0.4009
203,0.36696999999999996
204,0.11699000000000001
205,0.10513
206,0.06714500000000001
207,0.1044
208,0.39415
209,0.37847
210,0.37322
211,0.39038
212,0.38603000000000004
213,0.35539
214,0.32098000000000004
215,0.31556999999999996
216,0.31561
217,0.32327
218,0.31496
219,0.30183000000000004
220,0.32001999999999997
221,0.32532
222,0.32752
223,0.31748000000000004
224,0.33754
225,0.029479
226,0.047665
227,0.049908
228,0.34071
229,0.34257
230,0.34239
231,0.32811999999999997
232,0.31915
233,0.32236
234,-0.035322000000000006
235,-0.044291000000000004
236,-0.06825099999999999
237,-0.087998
238,-0.10975
239,-0.13717000000000001
240,-0.14652
241,-0.14932
242,-0.13463
243,-0.11292999999999999
244,-0.09586599999999999
245,-0.10539000000000001
246,-0.11735
247,-0.11648
248,-0.1155
249,-0.1286
250,-0.1305
251,-0.13546
252,-0.12647
253,-0.12161
254,-0.13341
255,-0.1442
256,-0.13571
257,-0.12087
258,-0.12214000000000001
259,-0.13207
260,-0.13199
261,-0.12125999999999999
262,0.24946
263,0.25298000000000004
264,0.25005
265,0.23071
266,0.21825999999999998
267,0.22469
268,-0.1471
269,-0.14323
270,-0.13715
271,-0.14559
272,0.23617
273,0.23731999999999998
274,0.24076999999999998
275,0.23895999999999998
276,0.23421
277,-0.1546
278,-0.16494
279,-0.16964
280,-0.16566
281,-0.16568
282,-0.17526
283,-0.17762999999999998
284,0.20989000000000002
285,0.21454
286,0.21184
287,0.21631999999999998
288,0.21347
289,0.19934000000000002
290,0.19295
291,0.18778
292,0.1887
293,0.19985999999999998
294,0.20647
295,0.20551999999999998
296,0.19906
297,0.19305
298,0.18892
299,0.19022999999999998
