time,value
0,-0.3868
1,-0.24614
2,-0.3868
3,-0.24614
4,-0.3868
5,-0.24614
6,-0.3868
7,-0.24614
8,-0.3868
9,-0.24614
10,-0.3868
11,-0.24614
12,-0.3868
13,-0.3868
14,-0.52745
15,-0.3868
16,-0.3868
17,-0.3868
18,-0.52745
19,-0.3868
20,-0.3868
21,-0.3868
22,-0.3868
23,-0.52745
24,-0.3868
25,-0.3868
26,-0.3868
27,-0.52745
28,-0.3868
29,-0.3868
30,-0.3868
31,-0.52745
32,-0.3868
33,-0.3868
34,-0.3868
35,-0.52745
36,-0.3868
37,-0.3868
38,-0.3868
39,-0.52745
40,-0.3868
41,-0.3868
42,-0.3868
43,-0.52745
44,-0.3868
45,-0.3868
46,-0.3868
47,-0.52745
48,-0.3868
49,-0.3868
50,-0.3868
51,-0.52745
52,-0.3868
53,-0.3868
54,-0.3868
55,-0.52745
56,-0.3868
57,-0.3868
58,-0.3868
59,-0.3868
60,-0.52745
61,-0.3868
62,-0.3868
63,-0.3868
64,-0.52745
65,-0.3868
66,-0.3868
67,-0.3868
68,-0.52745
69,-0.3868
70,-0.3868
71,-0.3868
72,-0.3868
73,-0.3868
74,-0.3868
75,-0.3868
76,-0.3868
77,0.59778
78,2.7076
79,2.5669
80,2.5669
81,2.5669
82,2.5669
83,2.5669
84,2.4263
85,2.2856
86,2.4263
87,2.4263
88,2.4263
89,2.7076
90,2.145
91,-0.3868
92,-0.3868
93,-0.52745
94,-0.3868
95,-0.3868
