time,value
0,-0.22819
1,-0.22819
2,-0.22819
3,-0.22819
4,-0.22819
5,-0.22819
6,-0.22819
7,-0.22819
8,-0.22819
9,-0.22819
10,-0.22819
11,-0.22819
12,-0.22819
13,-0.22819
14,-0.22819
15,-0.22819
16,-0.22819
17,-0.22819
18,-0.22819
19,-0.22819
20,-0.22819
21,-0.22819
22,-0.22819
23,-0.22819
24,-0.22819
25,-0.22819
26,-0.22819
27,-0.22819
28,-0.22819
29,-0.22819
30,4.902
31,1.2596
32,-0.22819
33,-0.22819
34,-0.22819
35,-0.22819
36,-0.22819
37,-0.22819
38,-0.22819
39,-0.22819
40,-0.22819
41,-0.22819
42,-0.22819
43,-0.22819
44,-0.22819
45,-0.22819
46,-0.22819
47,-0.22819
48,-0.22819
49,-0.22819
50,-0.22819
51,-0.22819
52,-0.22819
53,-0.22819
54,-0.22819
55,-0.22819
56,-0.22819
57,-0.22819
58,-0.22819
59,-0.22819
60,-0.22819
61,-0.22819
62,-0.22819
63,-0.22819
64,-0.22819
65,-0.22819
66,-0.22819
67,-0.22819
68,-0.22819
69,5.7228
70,-0.22819
71,1.5674
72,-0.22819
73,-0.22819
74,-0.22819
75,-0.22819
76,-0.22819
77,-0.074281
78,-0.22819
79,-0.12558
80,-0.12558
81,-0.12558
82,-0.22819
83,-0.12558
84,-0.22819
85,-0.22819
86,-0.22819
87,-0.22819
88,-0.22819
89,-0.22819
90,5.3124
91,1.2083
92,-0.22819
93,-0.22819
94,-0.22819
95,-0.22819
