time,value
0,-2.3038
1,-2.3038
2,-2.3038
3,-2.3038
4,-2.3038
5,-2.3059
6,-2.3059
7,-2.3059
8,-2.3058
9,-2.3054
10,-2.305
11,-2.3067
12,-2.3149
13,-2.3146
14,-2.3139
15,-2.3131
16,-2.3121
17,-2.3111
18,-2.3102
19,-2.3038
20,-2.3008
21,-2.2974
22,-2.2959
23,-2.2944
24,-2.2927
25,-2.2905
26,-2.2885
27,-2.2865
28,-2.2844
29,-2.2822
30,-2.2798
31,-2.2774
32,-2.2748
33,-2.2702
34,-2.2675
35,-2.2666
36,-2.2637
37,-2.2607
38,-2.2575
39,-2.2543
40,-2.251
41,-2.2468
42,-2.2432
43,-2.2397
44,-2.2359999999999998
45,-2.2322
46,-2.2284
47,-2.2245
48,-2.2205
49,-2.2164
50,-2.2122
51,-2.208
52,-2.2037
53,-2.1993
54,-2.1931
55,-2.1886
56,-2.184
57,-2.1794
58,-2.1752
59,-2.1704
60,-2.1656
61,-2.1606
62,-2.1557
63,-2.1506
64,-2.1455
65,-2.1404
66,-2.1352
67,-2.1299
68,-2.1246
69,-2.1192
70,-2.1138
71,-2.1083
72,-2.1012
73,-2.0957
74,-2.0887
75,-2.083
76,-2.0773
77,-2.0716
78,-2.0658
79,-2.0599
80,-2.0541
81,-2.0496
82,-2.0436
83,-2.0362
84,-2.0302
85,-2.0241
86,-2.0180000000000002
87,-2.0118
88,-2.0057
89,-1.9986
90,-1.9898
91,-1.9836
92,-1.9774
93,-1.9712
94,-1.9649
95,-1.9586
96,-1.9509
97,-1.9446
98,-1.9382
99,-1.9317
100,-1.9265
101,-1.9177
102,-1.9113
103,-1.9049
104,-1.8971
105,-1.8907
106,-1.8842
107,-1.876
108,-1.8682
109,-1.8614
110,-1.8556
111,-1.8491
112,-1.8412
113,-1.8346
114,-1.8276
115,-1.8225
116,-1.8159999999999998
117,-1.8094
118,-1.8015
119,-1.7949
120,-1.7882
121,-1.7819999999999998
122,-1.7754
123,-1.7679
124,-1.7612
125,-1.7546
126,-1.7478
127,-1.7399
128,-1.7332
129,-1.7264
130,-1.7196
131,-1.7132
132,-1.7062
133,-1.6994
134,-1.6926
135,-1.6858
136,-1.679
137,-1.671
138,-1.6641
139,-1.6555
140,-1.6486
141,-1.6406
142,-1.6343
143,-1.6297
144,-1.6216
145,-1.6147
146,-1.6078
147,-1.6009
148,-1.5928
149,-1.5858
150,-1.5788
151,-1.5718
152,-1.5648
153,-1.558
154,-1.5518
155,-1.5448
156,-1.536
157,-1.5279
158,-1.5209
159,-1.5138
160,-1.5088
161,-1.5037
162,-1.4956
163,-1.4875
164,-1.4804
165,-1.474
166,-1.4679
167,-1.4604
168,-1.4534
169,-1.4463
170,-1.4382
171,-1.4321
172,-1.4253
173,-1.4182
174,-1.4111
175,-1.403
176,-1.3959
177,-1.3888
178,-1.382
179,-1.3777
180,-1.3706
181,-1.3635
182,-1.3554
183,-1.3482
184,-1.3411
185,-1.3347
186,-1.3287
187,-1.3212
188,-1.3123
189,-1.3041
190,-1.297
191,-1.2898
192,-1.2834
193,-1.2774
194,-1.2718
195,-1.2646
196,-1.2564
197,-1.2492
198,-1.2415
199,-1.2366
200,-1.2294
201,-1.2222
202,-1.2151
203,-1.2079
204,-1.1989
205,-1.1906
206,-1.1834
207,-1.1762
208,-1.1689
209,-1.1633
210,-1.1574
211,-1.1528
212,-1.1456
213,-1.1383
214,-1.1311
215,-1.1228
216,-1.1156
217,-1.1083
218,-1.101
219,-1.0952
220,-1.0886
221,-1.0795
222,-1.0722
223,-1.065
224,-1.0567
225,-1.0494
226,-1.0421
227,-1.0348
228,-1.0290000000000001
229,-1.0243
230,-1.0170000000000001
231,-1.0096
232,-1.0023
233,-0.995
234,-0.98767
235,-0.9793700000000001
236,-0.9720200000000001
237,-0.96283
238,-0.9554600000000001
239,-0.94809
240,-0.9407200000000001
241,-0.9333299999999999
242,-0.92594
243,-0.9185399999999999
244,-0.9111299999999999
245,-0.9037200000000001
246,-0.8963
247,-0.89074
248,-0.88889
249,-0.88146
250,-0.8721899999999999
251,-0.8638399999999999
252,-0.85735
253,-0.85272
254,-0.84714
255,-0.8434200000000001
256,-0.84247
257,-0.83593
258,-0.82937
259,-0.8236899999999999
260,-0.8153199999999999
261,-0.80979
262,-0.80703
263,-0.79955
264,-0.79384
265,-0.78722
266,-0.78622
267,-0.78247
268,-0.77495
269,-0.76757
270,-0.76481
271,-0.75555
272,-0.75367
273,-0.75179
274,-0.74427
275,-0.73675
276,-0.72922
277,-0.72168
278,-0.71414
279,-0.7057399999999999
280,-0.69819
281,-0.69148
282,-0.68392
283,-0.67635
284,-0.66878
285,-0.6612
286,-0.65172
287,-0.64413
288,-0.64223
289,-0.63844
290,-0.63274
291,-0.63084
292,-0.6251399999999999
293,-0.61753
294,-0.60992
295,-0.6023
296,-0.59468
297,-0.58706
298,-0.57943
299,-0.5717899999999999
300,-0.56335
301,-0.55571
302,-0.54615
303,-0.5385
304,-0.53085
305,-0.52431
306,-0.5192100000000001
307,-0.51188
308,-0.5042300000000001
309,-0.49658
310,-0.48891999999999997
311,-0.48047
312,-0.47281000000000006
313,-0.46513999999999994
314,-0.45668000000000003
315,-0.45161
316,-0.44428
317,-0.43662
318,-0.42895
319,-0.41936999999999997
320,-0.41168999999999994
321,-0.40401
322,-0.39633
323,-0.38787
324,-0.38018
325,-0.37249
326,-0.36479
327,-0.35709
328,-0.34939000000000003
329,-0.34360999999999997
330,-0.33862
331,-0.33439
332,-0.3267
333,-0.319
334,-0.31053000000000003
335,-0.3009
336,-0.29319
337,-0.28628000000000003
338,-0.28013000000000005
339,-0.27243
340,-0.26473
341,-0.25701999999999997
342,-0.24931
343,-0.2416
344,-0.23388
345,-0.22616
346,-0.21843
347,-0.21070999999999998
348,-0.20297
349,-0.19524
350,-0.1875
351,-0.17783
352,-0.17008
353,-0.16233
354,-0.15385
355,-0.1461
356,-0.13834000000000002
357,-0.13058
358,-0.12839
359,-0.12351
360,-0.11575999999999999
361,-0.10801
362,-0.099527
363,-0.091772
364,-0.084013
365,-0.077464
366,-0.0726
367,-0.067256
368,-0.057565
369,-0.049079000000000005
370,-0.041322000000000005
371,-0.033563
372,-0.0258
373,-0.022884
374,-0.01681
375,-0.0090567
376,-0.00056874
377,0.0071883
378,0.012529
379,0.019338
380,0.023947
381,0.0317
382,0.040186
383,0.047941000000000004
384,0.053549
385,0.058898
386,0.06664400000000001
387,0.074395
388,0.082879
389,0.090634
390,0.098389
391,0.10325999999999999
392,0.10934
393,0.11709000000000001
394,0.12557000000000001
395,0.13333
396,0.13867000000000002
397,0.14356
398,0.1501
399,0.15785
400,0.16827
401,0.17482
402,0.17970999999999998
403,0.18699000000000002
404,0.19548
405,0.19845
406,0.20456
407,0.21229
408,0.22077
409,0.2285
410,0.23385999999999998
411,0.23879
412,0.24725999999999998
413,0.25499
414,0.26347
415,0.27002
416,0.27495
417,0.28224
418,0.28997
419,0.2977
420,0.30618
421,0.31390999999999997
422,0.32165
423,0.32939
424,0.33713000000000004
425,0.34203
426,0.3462
427,0.35393
428,0.36167
429,0.37015
430,0.37789
431,0.38563000000000003
432,0.39173
433,0.39545
434,0.39845
435,0.4034
436,0.40644
437,0.41065
438,0.41836
439,0.42607
440,0.43378
441,0.4415
442,0.44921000000000005
443,0.45693999999999996
444,0.45886000000000005
445,0.46273000000000003
446,0.46852
447,0.46926999999999996
448,0.47271
449,0.47841999999999996
450,0.48613999999999996
451,0.49461000000000005
452,0.50233
453,0.50845
454,0.51535
455,0.5230600000000001
456,0.53077
457,0.5384899999999999
458,0.5462100000000001
459,0.55469
460,0.5624100000000001
461,0.57014
462,0.5755
463,0.58045
464,0.58699
465,0.5947100000000001
466,0.60437
467,0.6120899999999999
468,0.62057
469,0.6283
470,0.6360399999999999
471,0.64258
472,0.6475
473,0.6548
474,0.6625300000000001
475,0.67101
476,0.67874
477,0.68098
478,0.68785
479,0.69557
480,0.7033
481,0.71103
482,0.7207
483,0.72843
484,0.73617
485,0.7439100000000001
486,0.74971
487,0.75165
488,0.75478
489,0.7598600000000001
490,0.7603300000000001
491,0.76541
492,0.77244
493,0.77559
494,0.77947
495,0.7872399999999999
496,0.7942899999999999
497,0.80206
498,0.81177
499,0.81955
500,0.8166899999999999
501,0.81385
502,0.81102
503,0.80821
504,0.8075100000000001
505,0.80681
506,0.8002600000000001
507,0.79106
508,0.78841
509,0.78576
510,0.77656
511,0.77461
512,0.77391
513,0.77183
514,0.76907
515,0.76369
516,0.7609600000000001
517,0.75825
518,0.75231
519,0.7438
520,0.7378600000000001
521,0.7358600000000001
522,0.72734
523,0.7195
524,0.71165
525,0.70381
526,0.6953
527,0.6874600000000001
528,0.67962
529,0.67306
530,0.6684100000000001
531,0.65923
532,0.65133
533,0.6467
534,0.6381899999999999
535,0.62967
536,0.6218199999999999
537,0.6146
538,0.60998
539,0.60147
540,0.5936100000000001
541,0.5851
542,0.57921
543,0.5745899999999999
544,0.57065
545,0.56213
546,0.55688
547,0.5516399999999999
548,0.54378
549,0.53591
550,0.5273899999999999
551,0.52149
552,0.51756
553,0.5156
554,0.50773
555,0.49921000000000004
556,0.49068999999999996
557,0.48413999999999996
558,0.48152
559,0.47758999999999996
560,0.46971999999999997
561,0.46971999999999997
562,0.46907
563,0.46645
564,0.46321
565,0.45866
566,0.4561
567,0.45547
568,0.45152
569,0.44364
570,0.43575
571,0.42723
572,0.42067
573,0.41741999999999996
574,0.41086999999999996
575,0.40299
576,0.3951
577,0.39116
578,0.39116
579,0.38663000000000003
580,0.38014000000000003
581,0.37162
582,0.36577
583,0.36325999999999997
584,0.35536
585,0.34746
586,0.33893
587,0.33175
588,0.32727
589,0.31874
590,0.31084
591,0.30230999999999997
592,0.29575
593,0.29128000000000004
594,0.28411
595,0.2762
596,0.2657
597,0.25779
598,0.24989
599,0.24333000000000002
600,0.23886
601,0.23367
602,0.22576
603,0.21785
604,0.20995
605,0.20142000000000002
606,0.19351
607,0.18561
608,0.17770999999999998
609,0.17188
610,0.17001
611,0.16147999999999998
612,0.1516
613,0.14307
614,0.13517
615,0.12727
616,0.12269000000000001
617,0.11821
618,0.11104000000000001
619,0.10313
620,0.094601
621,0.086697
622,0.08420599999999999
623,0.076415
624,0.068503
625,0.059973
626,0.052065
627,0.04625
628,0.043789999999999996
629,0.033893
630,0.025363
631,0.017446
632,0.012259
633,0.0078313
634,0.0012783
635,-0.0066427
636,-0.015175
637,-0.023707
638,-0.028125
639,-0.035283
640,-0.043817
641,-0.051744000000000005
642,-0.060275999999999996
643,-0.064678
644,-0.06984800000000001
645,-0.08036499999999999
646,-0.084147
647,-0.08851200000000001
648,-0.097048
649,-0.1022
650,-0.10654000000000001
651,-0.11565999999999999
652,-0.1228
653,-0.12711
654,-0.13365
655,-0.14219
656,-0.14648
657,-0.15019000000000002
658,-0.15872999999999998
659,-0.16385
660,-0.16809000000000002
661,-0.17664000000000002
662,-0.18462
663,-0.19316
664,-0.19914
665,-0.20138
666,-0.2036
667,-0.2078
668,-0.21143
669,-0.21943000000000001
670,-0.22798000000000002
671,-0.23596999999999999
672,-0.24106
673,-0.24523000000000003
674,-0.25431
675,-0.26138
676,-0.26552
677,-0.27205999999999997
678,-0.28007
679,-0.2806
680,-0.28113
681,-0.28323000000000004
682,-0.28375
683,-0.28478000000000003
684,-0.28684
685,-0.28131999999999996
686,-0.27429000000000003
687,-0.27428
688,-0.26923
689,-0.26216
690,-0.26208000000000004
691,-0.25901
692,-0.25094
693,-0.24286999999999997
694,-0.23326
695,-0.22518000000000002
696,-0.21711
697,-0.20903000000000002
698,-0.20142000000000002
699,-0.20281
700,-0.20014
701,-0.19205
702,-0.18395999999999998
703,-0.17587
704,-0.16777
705,-0.15968
706,-0.15159
707,-0.14349
708,-0.1354
709,-0.1273
710,-0.11760999999999999
711,-0.10951
712,-0.10141
713,-0.093305
714,-0.0852
715,-0.077093
716,-0.07635700000000001
717,-0.07603
718,-0.067915
719,-0.059797
720,-0.05168
721,-0.04356
722,-0.035855
723,-0.027731
724,-0.01961
725,-0.011484000000000001
726,-0.0033597
727,0.0067983
728,0.014925999999999998
729,0.023053999999999998
730,0.031181999999999998
731,0.039312
732,0.047444
733,0.055576
734,0.063708
735,0.07184199999999999
736,0.079976
737,0.08811000000000001
738,0.096246
739,0.10438
740,0.11252000000000001
741,0.12065999999999999
742,0.1288
743,0.13897
744,0.14712
745,0.15525999999999998
746,0.1634
747,0.17154
748,0.17969000000000002
749,0.18783
750,0.19635999999999998
751,0.20451
752,0.21266
753,0.2208
754,0.2273
755,0.23087
756,0.23571999999999999
757,0.24386
758,0.25201
759,0.26218
760,0.27033
761,0.27886
762,0.287
763,0.29515
764,0.3033
765,0.31144
766,0.31959
767,0.32774000000000003
768,0.32927
769,0.33411
770,0.34264
771,0.35079
772,0.35893
773,0.36708
774,0.37522
775,0.38375
776,0.39394
777,0.40208
778,0.41023000000000004
779,0.41584
780,0.41903999999999997
781,0.42718
782,0.43532
783,0.44347
784,0.45198999999999995
785,0.46013999999999994
786,0.46829
787,0.47643
788,0.48127
789,0.48486
790,0.49136
791,0.4995
792,0.50968
793,0.5182100000000001
794,0.52635
795,0.53284
796,0.5364399999999999
797,0.5413
798,0.5494399999999999
799,0.55758
800,0.56571
801,0.57385
802,0.5820000000000001
803,0.59014
804,0.59828
805,0.60439
806,0.60642
807,0.61049
808,0.6166
809,0.62029
810,0.62805
811,0.63544
812,0.6432100000000001
813,0.65136
814,0.6534
815,0.65672
816,0.66488
817,0.67303
818,0.68119
819,0.68934
820,0.6975
821,0.70565
822,0.7125100000000001
823,0.7140000000000001
824,0.71755
825,0.71946
826,0.7279899999999999
827,0.73448
828,0.73807
829,0.7449600000000001
830,0.7531
831,0.7612399999999999
832,0.7693800000000001
833,0.77752
834,0.78567
835,0.79381
836,0.80195
837,0.8104899999999999
838,0.81824
839,0.82639
840,0.8349200000000001
841,0.8451
842,0.85325
843,0.8614
844,0.86955
845,0.8777
846,0.88585
847,0.894
848,0.90215
849,0.9103
850,0.9180799999999999
851,0.9262299999999999
852,0.9343899999999999
853,0.9425399999999999
854,0.9507
855,0.95885
856,0.96701
857,0.97721
858,0.98536
859,0.9935200000000001
860,1.0017
861,1.0098
862,1.018
863,1.0262
864,1.0343
865,1.0425
866,1.0506
867,1.0592
868,1.0673
869,1.0755
870,1.0799
871,1.0834
872,1.0882
873,1.0964
874,1.1066
875,1.1151
876,1.1233
877,1.1314
878,1.1396
879,1.1478
880,1.1513
881,1.1564
882,1.1646
883,1.1728
884,1.1809
885,1.1894
886,1.1976
887,1.2058
888,1.2139
889,1.2167
890,1.2208
891,1.2289
892,1.2371
893,1.2453
894,1.2534
895,1.2555
896,1.2588
897,1.2666
898,1.2676
899,1.2682
900,1.2668
901,1.2654
902,1.2736
903,1.2814
904,1.2896
905,1.2954
906,1.2937
907,1.2924
908,1.2911
909,1.2918
910,1.2905
911,1.2893
912,1.288
913,1.2915
914,1.2912
915,1.29
916,1.2888
917,1.2876
918,1.2864
919,1.2861
920,1.2817
921,1.2806
922,1.2774
923,1.276
924,1.2749
925,1.2718
926,1.2654
927,1.2569
928,1.2486
929,1.2422
930,1.2391
931,1.2324
932,1.2242
933,1.216
934,1.2077
935,1.1995
936,1.1913
937,1.1831
938,1.1749
939,1.1687
940,1.1666
941,1.1584
942,1.1564
943,1.1502
944,1.1420000000000001
945,1.1337
946,1.1255
947,1.1173
948,1.1091
949,1.1006
950,1.0924
951,1.0842
952,1.0759
953,1.0677
954,1.0595
955,1.0492
956,1.041
957,1.0328
958,1.0246
959,1.0164
960,1.0099
961,1.0068
962,1.0001
963,0.99187
964,0.9833799999999999
965,0.97516
966,0.97204
967,0.96919
968,0.9609700000000001
969,0.95275
970,0.94426
971,0.9339799999999999
972,0.92576
973,0.92086
974,0.9180299999999999
975,0.90955
976,0.90133
977,0.8931
978,0.8848799999999999
979,0.87665
980,0.8681700000000001
981,0.8599399999999999
982,0.85172
983,0.84349
984,0.83886
985,0.8357899999999999
986,0.82936
987,0.8211299999999999
988,0.81085
989,0.80237
990,0.79414
991,0.78772
992,0.78466
993,0.77799
994,0.76976
995,0.76153
996,0.7533
997,0.74507
998,0.7368399999999999
999,0.7286100000000001
1000,0.72038
1001,0.71627
1002,0.71215
1003,0.7039300000000001
1004,0.6936399999999999
1005,0.68747
1006,0.6854100000000001
1007,0.6813
1008,0.67282
1009,0.66976
1010,0.66285
1011,0.65462
1012,0.6463899999999999
1013,0.6381600000000001
1014,0.62968
1015,0.62145
1016,0.6166
1017,0.61563
1018,0.6074
1019,0.59916
1020,0.58887
1021,0.5806399999999999
1022,0.5724100000000001
1023,0.56417
1024,0.5557
1025,0.5474600000000001
1026,0.5394800000000001
1027,0.5312399999999999
1028,0.5230100000000001
1029,0.51478
1030,0.50631
1031,0.49806999999999996
1032,0.48983999999999994
1033,0.48161000000000004
1034,0.47338
1035,0.46515
1036,0.45692
1037,0.44664
1038,0.43841
1039,0.43018
1040,0.42195
1041,0.41372
1042,0.40549
1043,0.39726999999999996
1044,0.38929
1045,0.38106999999999996
1046,0.37284
1047,0.36461
1048,0.35639
1049,0.34815999999999997
1050,0.33968000000000004
1051,0.33146
1052,0.32323
1053,0.31295
1054,0.30473
1055,0.2965
1056,0.28802
1057,0.28493
1058,0.28031
1059,0.27208000000000004
1060,0.26385
1061,0.25563
1062,0.2474
1063,0.23918000000000003
1064,0.23095
1065,0.22271999999999997
1066,0.2145
1067,0.20628000000000002
1068,0.19805
1069,0.18750999999999998
1070,0.17929
1071,0.17106
1072,0.16284
1073,0.15462
1074,0.14639000000000002
1075,0.13817000000000002
1076,0.13713
1077,0.13225
1078,0.12402
1079,0.11579
1080,0.10757
1081,0.099087
1082,0.090862
1083,0.082635
1084,0.074409
1085,0.067473
1086,0.064412
1087,0.056183000000000004
1088,0.047954000000000004
1089,0.039724
1090,0.031495
1091,0.023017
1092,0.014787
1093,0.006560300000000001
1094,0.0016963000000000002
1095,-0.0013417
1096,-0.0095727
1097,-0.017807
1098,-0.026281
1099,-0.032456
1100,-0.035474
1101,-0.038238
1102,-0.048536
1103,-0.057005999999999994
1104,-0.065241
1105,-0.070285
1106,-0.073023
1107,-0.081487
1108,-0.08627
1109,-0.08919400000000001
1110,-0.089407
1111,-0.089616
1112,-0.090443
1113,-0.090646
1114,-0.09085
1115,-0.089575
1116,-0.08583400000000001
1117,-0.07758
1118,-0.067452
1119,-0.059383000000000005
1120,-0.058052
1121,-0.052213999999999997
1122,-0.043956
1123,-0.035695
1124,-0.027611
1125,-0.019351
1126,-0.011262000000000001
1127,-0.011770000000000001
1128,-0.0081307
1129,0.00013426
1130,0.008396299999999999
1131,0.016501
1132,0.024766
1133,0.032873
1134,0.036543
1135,0.042294
1136,0.050563
1137,0.058684
1138,0.066953
1139,0.07052
1140,0.072177
1141,0.08045
1142,0.08872100000000001
1143,0.096861
1144,0.10513
1145,0.11341
1146,0.11922
1147,0.1208
1148,0.12907000000000002
1149,0.13735
1150,0.14562
1151,0.15585
1152,0.16412000000000002
1153,0.1724
1154,0.18068
1155,0.1824
1156,0.18403
1157,0.19230999999999998
1158,0.20059000000000002
1159,0.20886
1160,0.21714
1161,0.22532
1162,0.2336
1163,0.24186999999999997
1164,0.25015
1165,0.25843
1166,0.26454
1167,0.26611999999999997
1168,0.27223
1169,0.28051
1170,0.2888
1171,0.29708
1172,0.30535999999999996
1173,0.31364000000000003
1174,0.32183
1175,0.33011
1176,0.33839
1177,0.34667
1178,0.35495
1179,0.36324
1180,0.37151999999999996
1181,0.3798
1182,0.38808000000000004
1183,0.39636
1184,0.40671999999999997
1185,0.415
1186,0.42336999999999997
1187,0.43165
1188,0.43993000000000004
1189,0.44821000000000005
1190,0.4565
1191,0.46468999999999994
1192,0.47297
1193,0.48125
1194,0.48954
1195,0.49782
1196,0.5061
1197,0.5143800000000001
1198,0.52267
1199,0.53095
1200,0.5413
1201,0.5495800000000001
1202,0.55787
1203,0.56615
1204,0.57443
1205,0.5827100000000001
1206,0.591
1207,0.59928
1208,0.60756
1209,0.6158399999999999
1210,0.6241300000000001
1211,0.63241
1212,0.64069
1213,0.64898
1214,0.6572600000000001
1215,0.6655399999999999
1216,0.6759
1217,0.68418
1218,0.6924600000000001
1219,0.7008300000000001
1220,0.70911
1221,0.71739
1222,0.72568
1223,0.7339600000000001
1224,0.74025
1225,0.7426699999999999
1226,0.74698
1227,0.75527
1228,0.76355
1229,0.77183
1230,0.7801100000000001
1231,0.7883899999999999
1232,0.79452
1233,0.7961600000000001
1234,0.8023
1235,0.81058
1236,0.81886
1237,0.82715
1238,0.83535
1239,0.8436299999999999
1240,0.8519200000000001
1241,0.8602
1242,0.8684799999999999
1243,0.87677
1244,0.88505
1245,0.89333
1246,0.89533
1247,0.8974
1248,0.9056799999999999
1249,0.91604
1250,0.92225
1251,0.92432
1252,0.9285399999999999
1253,0.9368299999999999
1254,0.94511
1255,0.95339
1256,0.96168
1257,0.96996
1258,0.97825
1259,0.9865299999999999
1260,0.9948100000000001
1261,1.0031
1262,1.0092
1263,1.011
1264,1.015
1265,1.0254
1266,1.0337
1267,1.042
1268,1.0502
1269,1.0585
1270,1.0668
1271,1.0751
1272,1.0834
1273,1.0917
1274,1.0999
1275,1.1082
1276,1.1165
1277,1.1247
1278,1.133
1279,1.1413
1280,1.1431
1281,1.145
1282,1.1554
1283,1.1637
1284,1.172
1285,1.1803
1286,1.1885
1287,1.1968
1288,1.2051
1289,1.2133
1290,1.2216
1291,1.2299
1292,1.2382
1293,1.2465
1294,1.2548
1295,1.2567
1296,1.2606
1297,1.2689
1298,1.2793
1299,1.2876
1300,1.2959
1301,1.3042
1302,1.3124
1303,1.3187
1304,1.321
1305,1.3273
1306,1.3356
1307,1.3439
1308,1.3521
1309,1.3604
1310,1.3688
1311,1.3771
1312,1.3853
1313,1.3936
1314,1.4040000000000001
1315,1.4123
1316,1.4206
1317,1.4289
1318,1.4371
1319,1.4454
1320,1.4537
1321,1.4619
1322,1.4702
1323,1.4742
1324,1.4761
1325,1.4844
1326,1.4927
1327,1.5009
1328,1.5092
1329,1.5175
1330,1.5217
1331,1.5258
1332,1.5341
1333,1.5362
1334,1.5403
1335,1.5486
1336,1.5508
1337,1.5549
1338,1.5632
1339,1.5715
1340,1.5798
1341,1.5881
1342,1.5881
1343,1.5879
1344,1.5898
1345,1.5897
1346,1.5896
1347,1.5936
1348,1.6019
1349,1.6039
1350,1.6038
1351,1.6058
1352,1.6078
1353,1.6099
1354,1.6099
1355,1.6098
1356,1.6098
1357,1.6098
1358,1.614
1359,1.6161
1360,1.6181
1361,1.6182
1362,1.6182
1363,1.6162
1364,1.6142
1365,1.6122
1366,1.6122
1367,1.6124
1368,1.6125
1369,1.6126
1370,1.6084
1371,1.6065
1372,1.6025
1373,1.5942
1374,1.5859
1375,1.5776
1376,1.5693
1377,1.561
1378,1.5527
1379,1.5505
1380,1.5505
1381,1.5505
1382,1.5443
1383,1.5401
1384,1.5401
1385,1.5381
1386,1.5382
1387,1.5321
1388,1.5238
1389,1.5155
1390,1.5073
1391,1.5054
1392,1.5014
1393,1.4931
1394,1.4848
1395,1.4765
1396,1.4661
1397,1.4579
1398,1.4496
1399,1.4413
1400,1.433
1401,1.4247
1402,1.4206
1403,1.4164
1404,1.4081
1405,1.4080000000000001
1406,1.4038
1407,1.3955
1408,1.3871
1409,1.385
1410,1.3829
1411,1.3746
1412,1.3643
1413,1.3559999999999999
1414,1.3477
1415,1.3394
1416,1.3311
1417,1.3228
1418,1.3146
1419,1.3062
1420,1.2979
1421,1.2897
1422,1.2814
1423,1.2731
1424,1.2648
1425,1.2565
1426,1.2483
1427,1.24
1428,1.2296
1429,1.2255
1430,1.2234
1431,1.2152
1432,1.207
1433,1.205
1434,1.2009
1435,1.1927
1436,1.1906
1437,1.1844
1438,1.1761
1439,1.1678
1440,1.1595
1441,1.1513
1442,1.143
1443,1.1347
1444,1.1264
1445,1.1161
1446,1.11
1447,1.1061
1448,1.102
1449,1.0937
1450,1.0855
1451,1.0772
1452,1.0689
1453,1.0606
1454,1.0523
1455,1.0441
1456,1.0358
1457,1.0275
1458,1.0192
1459,1.011
1460,1.0092
1461,1.0052
1462,0.9969600000000001
1463,0.9886799999999999
1464,0.98039
1465,0.97211
1466,0.9638200000000001
1467,0.95554
1468,0.94726
1469,0.94089
1470,0.93853
1471,0.9301
1472,0.92376
1473,0.92143
1474,0.91515
1475,0.90681
1476,0.9047299999999999
1477,0.90059
1478,0.89438
1479,0.89231
1480,0.8881600000000001
1481,0.8798799999999999
1482,0.87165
1483,0.8633700000000001
1484,0.8592200000000001
1485,0.85715
1486,0.8489899999999999
1487,0.84077
1488,0.8387700000000001
1489,0.8347600000000001
1490,0.82862
1491,0.8265399999999999
1492,0.8224
1493,0.81412
1494,0.80376
1495,0.79548
1496,0.78719
1497,0.77891
1498,0.77062
1499,0.76234
1500,0.7540600000000001
1501,0.7457699999999999
1502,0.73935
1503,0.7390800000000001
1504,0.7308
1505,0.72251
1506,0.71422
1507,0.7058800000000001
1508,0.6975899999999999
1509,0.6893
1510,0.67895
1511,0.6746800000000001
1512,0.67237
1513,0.6661
1514,0.65781
1515,0.64953
1516,0.6411899999999999
1517,0.6329
1518,0.62461
1519,0.61633
1520,0.6080399999999999
1521,0.6057600000000001
1522,0.60147
1523,0.59318
1524,0.5848899999999999
1525,0.5766100000000001
1526,0.56625
1527,0.55796
1528,0.5496300000000001
1529,0.5413399999999999
1530,0.53305
1531,0.52476
1532,0.51648
1533,0.5081899999999999
1534,0.4999
1535,0.49161000000000005
1536,0.48333000000000004
1537,0.47503999999999996
1538,0.46675
1539,0.45846000000000003
1540,0.45018
1541,0.44188999999999995
1542,0.4336
1543,0.42323999999999995
1544,0.41496000000000005
1545,0.40667
1546,0.39838
1547,0.39207
1548,0.38983
1549,0.38356999999999997
1550,0.37528
1551,0.36700000000000005
1552,0.35871
1553,0.35042
1554,0.34213000000000005
1555,0.33385
1556,0.32556
1557,0.31727
1558,0.30898000000000003
1559,0.29862
1560,0.29033000000000003
1561,0.28205
1562,0.27376
1563,0.26547
1564,0.26353000000000004
1565,0.2616
1566,0.25336
1567,0.24506999999999998
1568,0.23678000000000002
1569,0.2285
1570,0.22021
1571,0.21191999999999997
1572,0.20364000000000002
1573,0.19535
1574,0.18706
1575,0.17676
1576,0.16847
1577,0.16018
1578,0.1519
1579,0.14786
1580,0.14396
1581,0.13988
1582,0.13159
1583,0.1233
1584,0.11502000000000001
1585,0.1068
1586,0.09851499999999999
1587,0.096718
1588,0.0928
1589,0.08451399999999999
1590,0.076231
1591,0.06794800000000001
1592,0.05767100000000001
1593,0.049388
1594,0.041104
1595,0.0329
1596,0.031163
1597,0.027199
1598,0.018918
1599,0.010728
1600,0.0024463
1601,-0.0013147
1602,-0.0030846999999999997
1603,-0.011364
1604,-0.019643
1605,-0.027818
1606,-0.036098000000000005
1607,-0.044375
1608,-0.05026
1609,-0.05394500000000001
1610,-0.062222
1611,-0.070381
1612,-0.07865599999999999
1613,-0.080237
1614,-0.08606
1615,-0.094333
1616,-0.09626900000000001
1617,-0.09626900000000001
1618,-0.095867
1619,-0.095591
1620,-0.09545
1621,-0.094874
1622,-0.09235800000000001
1623,-0.084092
1624,-0.07360499999999999
1625,-0.065339
1626,-0.062808
1627,-0.06010599999999999
1628,-0.051841
1629,-0.043414999999999995
1630,-0.035153
1631,-0.028789999999999996
1632,-0.028125
1633,-0.025371
1634,-0.024659999999999998
1635,-0.018101
1636,-0.0098447
1637,-0.0014037000000000001
1638,0.007037300000000001
1639,0.009853299999999999
1640,0.014362999999999999
1641,0.024874
1642,0.027725
1643,0.030392000000000002
1644,0.038642
1645,0.047096
1646,0.055346000000000006
1647,0.059879999999999996
1648,0.062779
1649,0.07145
1650,0.07785
1651,0.080782
1652,0.085347
1653,0.093587
1654,0.10205
1655,0.11029000000000001
1656,0.11325999999999999
1657,0.12219000000000001
1658,0.13066
1659,0.13889
1660,0.14507
1661,0.14807
1662,0.15084
1663,0.15908
1664,0.16731
1665,0.17578
1666,0.18402000000000002
1667,0.19225
1668,0.19867
1669,0.2017
1670,0.20836
1671,0.21659
1672,0.22507
1673,0.2338
1674,0.23686
1675,0.24123000000000003
1676,0.24946
1677,0.25769000000000003
1678,0.26591
1679,0.27439
1680,0.28262
1681,0.29085
1682,0.29907
1683,0.3019
1684,0.30499
1685,0.31321
1686,0.32144
1687,0.32966
1688,0.33788
1689,0.34636999999999996
1690,0.35665
1691,0.36486999999999997
1692,0.3731
1693,0.38132
1694,0.38595
1695,0.38905
1696,0.39754
1697,0.40576
1698,0.41398
1699,0.42221000000000003
1700,0.43068999999999996
1701,0.43891
1702,0.44714
1703,0.45536000000000004
1704,0.46358
1705,0.47181000000000006
1706,0.48208999999999996
1707,0.49031
1708,0.49854
1709,0.50317
1710,0.50627
1711,0.5127
1712,0.52093
1713,0.52915
1714,0.53737
1715,0.5455899999999999
1716,0.55381
1717,0.56204
1718,0.57026
1719,0.5787399999999999
1720,0.58697
1721,0.59519
1722,0.60547
1723,0.61369
1724,0.62192
1725,0.6301399999999999
1726,0.63837
1727,0.64659
1728,0.65482
1729,0.66304
1730,0.66947
1731,0.67256
1732,0.6772
1733,0.68542
1734,0.69391
1735,0.70213
1736,0.70498
1737,0.70811
1738,0.71427
1739,0.72454
1740,0.7330300000000001
1741,0.73974
1742,0.7428899999999999
1743,0.74933
1744,0.75754
1745,0.76576
1746,0.7739699999999999
1747,0.7821899999999999
1748,0.79068
1749,0.7989
1750,0.80711
1751,0.81533
1752,0.82355
1753,0.83176
1754,0.83998
1755,0.85026
1756,0.85669
1757,0.8598399999999999
1758,0.86245
1759,0.87066
1760,0.87915
1761,0.8873700000000001
1762,0.89231
1763,0.89549
1764,0.9037
1765,0.9119200000000001
1766,0.9204100000000001
1767,0.92685
1768,0.93005
1769,0.93473
1770,0.94294
1771,0.95349
1772,0.9617
1773,0.96991
1774,0.9781200000000001
1775,0.9813299999999999
1776,0.9863200000000001
1777,0.9945200000000001
1778,1.0027
1779,1.0109
1780,1.0194
1781,1.0276
1782,1.0358
1783,1.044
1784,1.047
1785,1.0502
1786,1.0584
1787,1.0687
1788,1.0769
1789,1.0851
1790,1.0936
1791,1.1018
1792,1.11
1793,1.1182
1794,1.1264
1795,1.1346
1796,1.1428
1797,1.151
1798,1.1592
1799,1.1674
1800,1.1756
1801,1.1838
1802,1.1921
1803,1.2003
1804,1.2105
1805,1.2134
1806,1.2187
1807,1.2269
1808,1.2351
1809,1.2433
1810,1.2518
1811,1.26
1812,1.2647
1813,1.2659
1814,1.2671
1815,1.2684
1816,1.2696
1817,1.2708
1818,1.2721
1819,1.2734
1820,1.275
1821,1.2764
1822,1.2797
1823,1.2791
1824,1.2804
1825,1.2818
1826,1.2832
1827,1.2846
1828,1.2861
1829,1.2875
1830,1.2890000000000001
1831,1.2905
1832,1.2871
1833,1.2794
1834,1.2781
1835,1.2776
1836,1.2698
1837,1.2617
1838,1.2539
1839,1.2457
1840,1.2376
1841,1.2323
1842,1.2302
1843,1.2241
1844,1.216
1845,1.2079
1846,1.1997
1847,1.1957
1848,1.1928
1849,1.1847
1850,1.1766
1851,1.1684
1852,1.1599
1853,1.1497
1854,1.1416
1855,1.1334
1856,1.1286
1857,1.125
1858,1.1185
1859,1.1099
1860,1.1018
1861,1.0929
1862,1.0893
1863,1.0848
1864,1.0767
1865,1.0685
1866,1.0604
1867,1.0523
1868,1.0437
1869,1.0335
1870,1.0254
1871,1.0173
1872,1.0091
1873,1.001
1874,0.99285
1875,0.9847100000000001
1876,0.9765799999999999
1877,0.96844
1878,0.9603
1879,0.9521700000000001
1880,0.94404
1881,0.9359
1882,0.9277700000000001
1883,0.91964
1884,0.9115
1885,0.90174
1886,0.8936200000000001
1887,0.88549
1888,0.87736
1889,0.86923
1890,0.8684299999999999
1891,0.86561
1892,0.85749
1893,0.8493700000000001
1894,0.84125
1895,0.8331299999999999
1896,0.8250200000000001
1897,0.8169
1898,0.81361
1899,0.8083
1900,0.80018
1901,0.79164
1902,0.78108
1903,0.77942
1904,0.77778
1905,0.77413
1906,0.76723
1907,0.7591
1908,0.75097
1909,0.74284
1910,0.7347100000000001
1911,0.72617
1912,0.71804
1913,0.70991
1914,0.7017800000000001
1915,0.69366
1916,0.68553
1917,0.6774
1918,0.66725
1919,0.6591199999999999
1920,0.6509999999999999
1921,0.64288
1922,0.63475
1923,0.62663
1924,0.61851
1925,0.61039
1926,0.60227
1927,0.59416
1928,0.58604
1929,0.57911
1930,0.5754100000000001
1931,0.56891
1932,0.56079
1933,0.55266
1934,0.5421
1935,0.53398
1936,0.52747
1937,0.52378
1938,0.5189
1939,0.51036
1940,0.5067
1941,0.50142
1942,0.49328999999999995
1943,0.48516000000000004
1944,0.47663
1945,0.4685
1946,0.46037
1947,0.45548999999999995
1948,0.45185
1949,0.44535
1950,0.43722
1951,0.42705
1952,0.41852
1953,0.41039
1954,0.40225
1955,0.39411999999999997
1956,0.38761999999999996
1957,0.38399
1958,0.38116
1959,0.37301999999999996
1960,0.36488000000000004
1961,0.35675
1962,0.34822
1963,0.34008
1964,0.33195
1965,0.32382
1966,0.31895
1967,0.31493000000000004
1968,0.30679
1969,0.29866
1970,0.29052
1971,0.28199
1972,0.27385
1973,0.26571999999999996
1974,0.25758000000000003
1975,0.25108
1976,0.24745999999999999
1977,0.24261
1978,0.23446999999999998
1979,0.22633000000000003
1980,0.21819000000000002
1981,0.21005
1982,0.20192000000000002
1983,0.19175
1984,0.18361
1985,0.17507999999999999
1986,0.16734000000000002
1987,0.15921
1988,0.15108
1989,0.14295
1990,0.13482
1991,0.12669
1992,0.11855999999999998
1993,0.11044000000000001
1994,0.10558
1995,0.10520999999999998
1996,0.097096
1997,0.08897999999999999
1998,0.08086499999999999
1999,0.072749
2000,0.063034
2001,0.054923
2002,0.046812
2003,0.038702999999999994
2004,0.030594999999999997
2005,0.029869999999999997
2006,0.027578
2007,0.019479
2008,0.011382
2009,0.0032883
2010,-0.0048067
2011,-0.012902
2012,-0.020994
2013,-0.029085000000000003
2014,-0.037627
2015,-0.03965
2016,-0.045717
2017,-0.05380599999999999
2018,-0.061894000000000005
2019,-0.065938
2020,-0.067958
2021,-0.07356599999999999
2022,-0.08165
2023,-0.089732
2024,-0.097813
2025,-0.10589000000000001
2026,-0.11397
2027,-0.12205
2028,-0.12966
2029,-0.13773
2030,-0.14627
2031,-0.15435
2032,-0.16444
2033,-0.1725
2034,-0.18057
2035,-0.18816
2036,-0.19623
2037,-0.20429
2038,-0.21235
2039,-0.22041
2040,-0.22596999999999998
2041,-0.22601999999999997
2042,-0.22905
2043,-0.23709000000000002
2044,-0.24464
2045,-0.25268
2046,-0.25469
2047,-0.25619000000000003
2048,-0.26371999999999995
2049,-0.27274
2050,-0.27423000000000003
2051,-0.27571999999999997
2052,-0.28323000000000004
2053,-0.28523000000000004
2054,-0.28924
2055,-0.29725999999999997
2056,-0.30528
2057,-0.3133
2058,-0.32079
2059,-0.3288
2060,-0.33681
2061,-0.34481999999999996
2062,-0.3472
2063,-0.34703
2064,-0.35447
2065,-0.35736
2066,-0.35712
2067,-0.36254000000000003
2068,-0.37051
2069,-0.37849
2070,-0.38588
2071,-0.39385
2072,-0.40124
2073,-0.40091
2074,-0.40371
2075,-0.41107
2076,-0.41126999999999997
2077,-0.41085
2078,-0.41818
2079,-0.42351000000000005
2080,-0.42303999999999997
2081,-0.42711000000000005
2082,-0.43438999999999994
2083,-0.43383999999999995
2084,-0.43849
2085,-0.44637
2086,-0.45361
2087,-0.46148999999999996
2088,-0.46086000000000005
2089,-0.46086000000000005
2090,-0.46806000000000003
2091,-0.46998999999999996
2092,-0.4673
2093,-0.46655
2094,-0.46381000000000006
2095,-0.47093999999999997
2096,-0.47611000000000003
2097,-0.47526999999999997
2098,-0.48166000000000003
2099,-0.48945
2100,-0.49651999999999996
2101,-0.50165
2102,-0.50071
2103,-0.50508
2104,-0.5121100000000001
2105,-0.50917
2106,-0.50695
2107,-0.50621
2108,-0.50471
2109,-0.50247
2110,-0.50247
2111,-0.49978
2112,-0.49206000000000005
2113,-0.48594
2114,-0.47712
2115,-0.46865
2116,-0.46443999999999996
2117,-0.45946000000000004
2118,-0.45176000000000005
2119,-0.44328999999999996
2120,-0.43558
2121,-0.43096
2122,-0.42405
2123,-0.41867
2124,-0.4102
2125,-0.4052
2126,-0.39903
2127,-0.39134
2128,-0.38365
2129,-0.37518
2130,-0.36556
2131,-0.35786
2132,-0.35363
2133,-0.3467
2134,-0.33824
2135,-0.33207
2136,-0.32511
2137,-0.31743000000000005
2138,-0.30975
2139,-0.30129
2140,-0.2936
2141,-0.2859
2142,-0.28051
2143,-0.27549
2144,-0.27087
2145,-0.26319000000000004
2146,-0.2528
2147,-0.24511
2148,-0.24201
2149,-0.23583
2150,-0.22738000000000003
2151,-0.22119
2152,-0.21614
2153,-0.20847
2154,-0.20079
2155,-0.19311
2156,-0.18466
2157,-0.17697000000000002
2158,-0.17043
2159,-0.16539
2160,-0.15999000000000002
2161,-0.15232
2162,-0.14464000000000002
2163,-0.13502999999999998
2164,-0.12734
2165,-0.11965
2166,-0.11119000000000001
2167,-0.1035
2168,-0.095796
2169,-0.08809299999999999
2170,-0.080388
2171,-0.072679
2172,-0.064968
2173,-0.057252
2174,-0.049533
2175,-0.041811
2176,-0.034087
2177,-0.026358999999999997
2178,-0.018627
2179,-0.0094007
2180,-0.0044707
2181,0.004005300000000001
2182,0.011733
2183,0.020211
2184,0.027943
2185,0.035677
2186,0.042223000000000004
2187,0.045212
2188,0.05015
2189,0.053176
2190,0.058552
2191,0.066263
2192,0.07397999999999999
2193,0.082454
2194,0.090174
2195,0.099827
2196,0.10477
2197,0.1109
2198,0.11938
2199,0.12550999999999998
2200,0.12855999999999998
2201,0.13702999999999999
2202,0.14434
2203,0.14934
2204,0.15857000000000002
2205,0.16589
2206,0.17090999999999998
2207,0.17745
2208,0.18399000000000001
2209,0.18902
2210,0.19407
2211,0.19721
2212,0.20533
2213,0.21378000000000003
2214,0.21886999999999998
2215,0.22509
2216,0.23353000000000002
2217,0.24055
2218,0.24678000000000003
2219,0.25442
2220,0.26287
2221,0.27052
2222,0.27674
2223,0.28186
2224,0.2903
2225,0.29654
2226,0.30168
2227,0.30931
2228,0.31966
2229,0.3273
2230,0.33273
2231,0.33787
2232,0.34712
2233,0.35446
2234,0.35962
2235,0.36616
2236,0.37378
2237,0.3814
2238,0.38984
2239,0.39747
2240,0.40510999999999997
2241,0.40834000000000004
2242,0.41458999999999996
2243,0.42303
2244,0.42928999999999995
2245,0.43446
2246,0.43775
2247,0.44105
2248,0.44947
2249,0.456
2250,0.45932
2251,0.46265
2252,0.466
2253,0.46937
2254,0.47275
2255,0.47615
2256,0.47957
2257,0.48301000000000005
2258,0.47633000000000003
2259,0.47155
2260,0.47313999999999995
2261,0.46548999999999996
2262,0.45798
2263,0.45047
2264,0.44297
2265,0.43546999999999997
2266,0.42796999999999996
2267,0.42048
2268,0.41298999999999997
2269,0.4055
2270,0.39802
2271,0.39054
2272,0.38216999999999995
2273,0.37672
2274,0.3712
2275,0.36372
2276,0.35535
2277,0.34600000000000003
2278,0.34055
2279,0.33601
2280,0.32852
2281,0.32015
2282,0.31267
2283,0.30625
2284,0.30080999999999997
2285,0.29333000000000004
2286,0.28585
2287,0.27748
2288,0.27
2289,0.26253000000000004
2290,0.25513
2291,0.24968
2292,0.24131
2293,0.23196
2294,0.2236
2295,0.21613000000000002
2296,0.20867
2297,0.20223
2298,0.19676
2299,0.1893
2300,0.18183
2301,0.17437
2302,0.16691
2303,0.15855
2304,0.1511
2305,0.14365
2306,0.13621
2307,0.12877
2308,0.12134
2309,0.11391
2310,0.10463
2311,0.097216
2312,0.089801
2313,0.08239199999999999
2314,0.074988
2315,0.067587
2316,0.060192999999999997
2317,0.052802999999999996
2318,0.04723
2319,0.041635000000000005
2320,0.03515
2321,0.027756
2322,0.020366
2323,0.012980000000000002
2324,0.0046563
2325,-0.0027217
2326,-0.011937999999999999
2327,-0.018412
2328,-0.024047
2329,-0.029626
2330,-0.037001
2331,-0.044372
2332,-0.052689
2333,-0.060052
2334,-0.068366
2335,-0.074907
2336,-0.079599
2337,-0.086966
2338,-0.094327
2339,-0.10264000000000001
2340,-0.10999
2341,-0.11734000000000001
2342,-0.12573
2343,-0.12955999999999998
2344,-0.13691
2345,-0.14522000000000002
2346,-0.15257
2347,-0.15904000000000001
2348,-0.16471
2349,-0.1703
2350,-0.17765
2351,-0.18596
2352,-0.19330999999999998
2353,-0.19802999999999998
2354,-0.20369
2355,-0.21104
2356,-0.2184
2357,-0.22574
2358,-0.23404
2359,-0.24320999999999998
2360,-0.24881
2361,-0.2545
2362,-0.26097
2363,-0.26831
2364,-0.27564
2365,-0.28394
2366,-0.29125999999999996
2367,-0.29858
2368,-0.3059
2369,-0.31418
2370,-0.31990999999999997
2371,-0.32552
2372,-0.33284
2373,-0.34015
2374,-0.34843
2375,-0.35756
2376,-0.36584
2377,-0.37159000000000003
2378,-0.37903000000000003
2379,-0.38633
2380,-0.39363000000000004
2381,-0.40092
2382,-0.4082
2383,-0.41547
2384,-0.42273999999999995
2385,-0.43
2386,-0.43726000000000004
2387,-0.44551999999999997
2388,-0.45276000000000005
2389,-0.46
2390,-0.46724
2391,-0.47626999999999997
2392,-0.48349
2393,-0.4907
2394,-0.4979
2395,-0.5051
2396,-0.5122899999999999
2397,-0.51947
2398,-0.52665
2399,-0.53381
2400,-0.54097
2401,-0.54813
2402,-0.5552699999999999
2403,-0.5624100000000001
2404,-0.5695399999999999
2405,-0.5766600000000001
2406,-0.58378
2407,-0.5908899999999999
2408,-0.5997600000000001
2409,-0.60685
2410,-0.61393
2411,-0.621
2412,-0.62807
2413,-0.63512
2414,-0.64217
2415,-0.6492100000000001
2416,-0.6562399999999999
2417,-0.66305
2418,-0.66919
2419,-0.67623
2420,-0.6843600000000001
2421,-0.69139
2422,-0.69886
2423,-0.70501
2424,-0.71314
2425,-0.72126
2426,-0.72828
2427,-0.73575
2428,-0.74192
2429,-0.74653
2430,-0.75465
2431,-0.75971
2432,-0.76585
2433,-0.77113
2434,-0.7792600000000001
2435,-0.78628
2436,-0.7933
2437,-0.79947
2438,-0.80628
2439,-0.8133
2440,-0.8231799999999999
2441,-0.83129
2442,-0.8346100000000001
2443,-0.8414200000000001
2444,-0.84955
2445,-0.85636
2446,-0.86251
2447,-0.86954
2448,-0.8765700000000001
2449,-0.88469
2450,-0.8917
2451,-0.89869
2452,-0.90505
2453,-0.91125
2454,-0.9187200000000001
2455,-0.9257200000000001
2456,-0.9338200000000001
2457,-0.9419200000000001
2458,-0.9481299999999999
2459,-0.95385
2460,-0.9608399999999999
2461,-0.9689399999999999
2462,-0.9759200000000001
2463,-0.9810200000000001
2464,-0.9872299999999999
2465,-0.9953299999999999
2466,-1.0028
2467,-1.0090000000000001
2468,-1.0154
2469,-1.0235
2470,-1.0305
2471,-1.0385
2472,-1.043
2473,-1.0505
2474,-1.0586
2475,-1.0656
2476,-1.0725
2477,-1.0805
2478,-1.0874
2479,-1.0943
2480,-1.1024
2481,-1.1094
2482,-1.1174
2483,-1.1225
2484,-1.1306
2485,-1.1374
2486,-1.1436
2487,-1.1489
2488,-1.157
2489,-1.1657
2490,-1.1731
2491,-1.1794
2492,-1.1875
2493,-1.1944
2494,-1.2025
2495,-1.2089
2496,-1.2151
2497,-1.2208
2498,-1.2289
2499,-1.2352
2500,-1.242
2501,-1.2501
2502,-1.2558
2503,-1.262
2504,-1.2701
2505,-1.2782
2506,-1.287
2507,-1.2938
2508,-1.3
2509,-1.3046
2510,-1.3116
2511,-1.3185
2512,-1.3229
2513,-1.3299
2514,-1.338
2515,-1.345
2516,-1.3525
2517,-1.3587
2518,-1.3661
2519,-1.3742
2520,-1.3793
2521,-1.3862
2522,-1.3971
2523,-1.4033
2524,-1.4108
2525,-1.4178
2526,-1.4259
2527,-1.4340000000000002
2528,-1.4402
2529,-1.4442
2530,-1.4523
2531,-1.4591
2532,-1.4653
2533,-1.4723
2534,-1.4804
2535,-1.4874
2536,-1.4949
2537,-1.5011
2538,-1.5103
2539,-1.5167
2540,-1.5228
2541,-1.5286
2542,-1.5367
2543,-1.5417
2544,-1.5479
2545,-1.556
2546,-1.5646
2547,-1.5707
2548,-1.5777
2549,-1.5859
2550,-1.5929
2551,-1.5993
2552,-1.6054
2553,-1.6111
2554,-1.6193
2555,-1.6254
2556,-1.6297
2557,-1.6358
2558,-1.6408
2559,-1.6479
2560,-1.656
2561,-1.6631
2562,-1.6699
2563,-1.6777
2564,-1.6859
2565,-1.6944
2566,-1.6987
2567,-1.7069
2568,-1.7133
2569,-1.7193
2570,-1.7249
2571,-1.736
2572,-1.742
2573,-1.7476
2574,-1.7548
2575,-1.7619
2576,-1.7701
2577,-1.7772
2578,-1.7843
2579,-1.7922
2580,-1.7971
2581,-1.8043
2582,-1.8114
2583,-1.8184
2584,-1.8255
2585,-1.8326
2586,-1.8396
2587,-1.8495
2588,-1.8554
2589,-1.8623
2590,-1.8704
2591,-1.8774
2592,-1.8843
2593,-1.8912
2594,-1.8981
2595,-1.9049
2596,-1.9118
2597,-1.9174
2598,-1.9242
2599,-1.931
2600,-1.9377
2601,-1.9427
2602,-1.942
2603,-1.9469999999999998
2604,-1.9524
2605,-1.9577
2606,-1.963
2607,-1.965
2608,-1.9667
2609,-1.9732
2610,-1.979
2611,-1.9819
2612,-1.9897
2613,-1.9988
2614,-2.0004
2615,-2.002
2616,-2.0084
2617,-2.0149
2618,-2.0212
2619,-2.0276
2620,-2.0355
2621,-2.0417
2622,-2.0437
2623,-2.0439
2624,-2.0485
2625,-2.0546
2626,-2.0607
2627,-2.0668
2628,-2.0698
2629,-2.0742
2630,-2.0786
2631,-2.0846
2632,-2.0906
2633,-2.0965
2634,-2.1024
2635,-2.1083
2636,-2.1155
2637,-2.1228
2638,-2.1285
2639,-2.1341
2640,-2.1397
2641,-2.1453
2642,-2.1508
2643,-2.1563
2644,-2.1617
2645,-2.167
2646,-2.1723
2647,-2.1776
2648,-2.1828
2649,-2.1879
2650,-2.1929
2651,-2.1979
2652,-2.2041
2653,-2.209
2654,-2.2138
2655,-2.2185
2656,-2.2231
2657,-2.2277
2658,-2.2322
2659,-2.2367
2660,-2.241
2661,-2.2453
2662,-2.2495
2663,-2.2536
2664,-2.2577
2665,-2.2617
2666,-2.2655
2667,-2.2693
2668,-2.273
2669,-2.2776
2670,-2.2811
2671,-2.2845
2672,-2.2878
2673,-2.2891
2674,-2.2922
2675,-2.2952
2676,-2.2981
2677,-2.301
2678,-2.3037
2679,-2.3063
2680,-2.3088
2681,-2.3112
2682,-2.3115
2683,-2.3040000000000003
2684,-2.3016
2685,-2.3041
2686,-2.306
2687,-2.3078
2688,-2.3094
2689,-2.311
2690,-2.3124
2691,-2.3137
2692,-2.3149
2693,-2.316
2694,-2.3149
2695,-2.3157
2696,-2.3165
2697,-2.3171
2698,-2.3176
2699,-2.3158
2700,-2.3076
2701,-2.3037
2702,-2.3038
2703,-2.3038
2704,-2.3038
2705,-2.3038
2706,-2.3038
2707,-2.3038
2708,-2.3038
