time,value
0,-0.69482
1,1.6996
2,-0.18172
3,0.33138
4,0.50241
5,-0.86585
6,0.50241
7,-0.52379
8,-0.52379
9,1.3576
10,-1.0369
11,-0.86585
12,1.6996
13,-1.55
14,-0.35275
15,0.84447
16,-1.379
17,-0.01069
18,-0.18172
19,-1.0369
20,0.6734399999999999
21,-0.69482
22,-1.379
23,1.5286
24,-1.0369
25,-0.52379
26,1.3576
27,-1.0369
28,-0.01069
29,0.16034
30,-0.69482
31,1.0155
32,-0.35275
33,-0.52379
34,2.2127
35,-1.2079
36,0.16034
37,1.5286
38,-0.18172
39,1.1865
40,0.16034
41,-0.01069
42,1.8707
43,-0.86585
44,0.16034
45,1.0155
46,-1.0369
47,0.6734399999999999
48,-0.35275
49,-0.35275
50,0.84447
51,-1.0369
52,0.84447
53,0.16034
54,-1.2079
55,1.0155
56,-0.35275
57,-0.52379
58,1.8707
59,2.0417
60,-1.0369
61,0.84447
62,1.0155
63,-1.379
64,0.6734399999999999
65,1.5286
66,-0.86585
67,-0.35275
68,1.3576
69,-0.35275
70,-1.379
71,1.1865
72,-0.18172
73,-1.379
74,1.0155
75,0.16034
76,-1.379
77,0.50241
78,0.50241
79,-1.55
80,0.84447
81,0.6734399999999999
82,-1.2079
83,0.33138
84,0.84447
85,-1.2079
86,-0.01069
87,0.6734399999999999
88,-1.7209999999999999
89,-0.01069
90,-0.01069
91,-1.7209999999999999
92,0.33138
93,-0.52379
94,-1.379
95,0.33138
