time,value
0,1.8041
1,1.771
2,1.7267
3,1.6836
4,1.6934
5,1.7308
6,1.7442
7,1.7399
8,1.7281
9,1.7059
10,1.6757
11,1.6417
12,1.6082
13,1.5665
14,1.5295
15,1.4886
16,1.4479
17,1.4117
18,1.3801
19,1.3404
20,1.3097
21,1.2791
22,1.2447
23,1.206
24,1.1672
25,1.128
26,1.0885
27,1.0483
28,1.0091
29,0.9698700000000001
30,0.93076
31,0.8921899999999999
32,0.8542299999999999
33,0.81589
34,0.77784
35,0.73987
36,0.7014600000000001
37,0.66379
38,0.6262800000000001
39,0.5887100000000001
40,0.55129
41,0.51408
42,0.47728999999999994
43,0.44068999999999997
44,0.40346
45,0.36767
46,0.3323
47,0.29653
48,0.26108000000000003
49,0.22485
50,0.18989
51,0.15408
52,0.11732999999999999
53,0.081912
54,0.044453
55,0.0079848
56,-0.027601
57,-0.064073
58,-0.10026
59,-0.13677999999999998
60,-0.17359000000000002
61,-0.2065
62,-0.20231
63,-0.19405999999999998
64,-0.18585
65,-0.17307
66,-0.1586
67,-0.1441
68,-0.1307
69,-0.11897
70,-0.10655
71,-0.089821
72,-0.0689
73,-0.047461
74,-0.056354999999999995
75,-0.080214
76,-0.11362
77,-0.14678
78,-0.17969000000000002
79,-0.21486
80,-0.24982
81,-0.28458
82,-0.3165
83,-0.35076999999999997
84,-0.38240999999999997
85,-0.41581999999999997
86,-0.4465
87,-0.47681
88,-0.50673
89,-0.53915
90,-0.57417
91,-0.60593
92,-0.63732
93,-0.66523
94,-0.69575
95,-0.73239
96,-0.77372
97,-0.80406
98,-0.8296600000000001
99,-0.8612799999999999
100,-0.8999799999999999
101,-0.94863
102,-0.99875
103,-1.0438
104,-1.0812
105,-1.1183
106,-1.1525
107,-1.1703
108,-1.1736
109,-1.1746
110,-1.1776
111,-1.1749
112,-1.1455
113,-1.1156
114,-1.0888
115,-1.0621
116,-1.0342
117,-1.0052
118,-0.9771
119,-0.95214
120,-0.9237
121,-0.8986299999999999
122,-0.8933200000000001
123,-0.8897
124,-0.8872200000000001
125,-0.88449
126,-0.88481
127,-0.88821
128,-0.8947
129,-0.90189
130,-0.90859
131,-0.90753
132,-0.91153
133,-0.9146299999999999
134,-0.9113
135,-0.91296
136,-0.9187
137,-0.9314399999999999
138,-0.9439200000000001
139,-0.9447399999999999
140,-0.9475100000000001
141,-0.94476
142,-0.9381200000000001
143,-0.92414
144,-0.90838
145,-0.8916700000000001
146,-0.87902
147,-0.8907700000000001
148,-0.90464
149,-0.9133600000000001
150,-0.92151
151,-0.9287200000000001
152,-0.93319
153,-0.9301
154,-0.91776
155,-0.90031
156,-0.8848799999999999
157,-0.8720899999999999
158,-0.85067
159,-0.82358
160,-0.79864
161,-0.7810199999999999
162,-0.76853
163,-0.75008
164,-0.73118
165,-0.70903
166,-0.68592
167,-0.66528
168,-0.6370100000000001
169,-0.60907
170,-0.58477
171,-0.5502199999999999
172,-0.5203300000000001
173,-0.4981
174,-0.47922
175,-0.46403
176,-0.44856
177,-0.43249
178,-0.41443
179,-0.39576
180,-0.37666
181,-0.35881
182,-0.34418000000000004
183,-0.32545999999999997
184,-0.30159
185,-0.28497
186,-0.27171999999999996
187,-0.27623000000000003
188,-0.29554
189,-0.30396
190,-0.31593000000000004
191,-0.3343
192,-0.33566999999999997
193,-0.31499
194,-0.27446
195,-0.23394
196,-0.19339
197,-0.15285
198,-0.11229000000000001
199,-0.07173500000000001
200,-0.031163
201,0.0095027
202,0.05025
203,0.09066
204,0.13112000000000001
205,0.17162
206,0.21211999999999998
207,0.2527
208,0.29324
209,0.33379000000000003
210,0.37433
211,0.41486999999999996
212,0.45541000000000004
213,0.49593000000000004
214,0.5364300000000001
215,0.57698
216,0.6175
217,0.6580199999999999
218,0.6985600000000001
219,0.73911
220,0.77966
221,0.82026
222,0.8609100000000001
223,0.9015
224,0.94204
225,0.9825799999999999
226,1.0113
227,1.0394
228,1.0798
229,1.1202
230,1.1607
231,1.2012
232,1.2416
233,1.2822
234,1.3226
235,1.3630000000000002
236,1.4035
237,1.444
238,1.4845
239,1.525
240,1.5655
241,1.6059999999999999
242,1.6465
243,1.6869999999999998
244,1.7097
245,1.7188
246,1.7223
247,1.7257
248,1.7276
249,1.7257
250,1.7242
251,1.7189
252,1.7487
253,1.7424
254,1.734
255,1.7386
256,1.7102
257,1.6755
258,1.6413
259,1.6152
260,1.5791
261,1.5403
262,1.5004
263,1.4607
264,1.4213
265,1.3826
266,1.3455
267,1.3096
268,1.2704
269,1.2309999999999999
270,1.1874
271,1.1485
272,1.1085
273,1.0679
274,1.0273
275,0.9876
276,0.9505
277,0.91264
278,0.87303
279,0.8343799999999999
280,0.79478
281,0.75502
282,0.71518
283,0.6753899999999999
284,0.63652
285,0.59675
286,0.5579999999999999
287,0.51779
288,0.47847
289,0.43918
290,0.39928
291,0.35964
292,0.31937
293,0.27910999999999997
294,0.23988
295,0.19865
296,0.15844
297,0.11803
298,0.076435
299,0.035543
300,-0.006014
301,-0.048128
302,-0.089431
303,-0.13188
304,-0.17432999999999998
305,-0.21563000000000002
306,-0.25751
307,-0.28474
308,-0.27291
309,-0.26036
310,-0.29001
311,-0.32294
312,-0.35401
313,-0.38138
314,-0.41321
315,-0.44719
316,-0.48258999999999996
317,-0.51952
318,-0.5563100000000001
319,-0.5929300000000001
320,-0.63057
321,-0.6693899999999999
322,-0.70675
323,-0.74347
324,-0.77923
325,-0.81475
326,-0.8518100000000001
327,-0.8855
328,-0.91974
329,-0.94962
330,-0.98359
331,-1.0196
332,-1.0553
333,-1.0956
334,-1.1308
335,-1.1656
336,-1.1974
337,-1.2314
338,-1.2649
339,-1.295
340,-1.3274
341,-1.3562
342,-1.3841
343,-1.4115
344,-1.4404
345,-1.4655
346,-1.4922
347,-1.5157
348,-1.5371
349,-1.5607
350,-1.5830000000000002
351,-1.6035
352,-1.6228
353,-1.6401
354,-1.6555
355,-1.6771
356,-1.6805
357,-1.6889
358,-1.6871
359,-1.6869999999999998
360,-1.6846
361,-1.6839
362,-1.6808
363,-1.6794
364,-1.6755
365,-1.6692
366,-1.6605
367,-1.6461
368,-1.6328
369,-1.6119999999999999
370,-1.5873
371,-1.5611
372,-1.5299
373,-1.4998
374,-1.4598
375,-1.416
376,-1.3729
377,-1.3338
378,-1.305
379,-1.2562
380,-1.2046
381,-1.1502
382,-1.1115
383,-1.0828
384,-1.0518
385,-1.0199
386,-0.9847600000000001
387,-0.9398
388,-0.90491
389,-0.8696
390,-0.8340299999999999
391,-0.80055
392,-0.76445
393,-0.73039
394,-0.69604
395,-0.66142
396,-0.62654
397,-0.59341
398,-0.56015
399,-0.5271100000000001
400,-0.4945
401,-0.46508
402,-0.43343999999999994
403,-0.39965
404,-0.36478
405,-0.33109
406,-0.29505
407,-0.25809
408,-0.22373
409,-0.19161
410,-0.16119
411,-0.12592
412,-0.088585
413,-0.050854
414,-0.011666
415,0.026994999999999998
416,0.065445
417,0.10527
418,0.14554
419,0.18624000000000002
420,0.22491999999999998
421,0.2636
422,0.30357
423,0.34234000000000003
424,0.38237
425,0.42213
426,0.46131000000000005
427,0.5002300000000001
428,0.5384800000000001
429,0.5771
430,0.6172
431,0.6563899999999999
432,0.69682
433,0.7379600000000001
434,0.7803899999999999
435,0.8206399999999999
436,0.8609
437,0.90117
438,0.9403600000000001
439,0.97964
440,1.0189
441,1.0582
442,1.0976
443,1.136
444,1.1754
445,1.2134
446,1.2504
447,1.2878
448,1.3258
449,1.3637
450,1.4024
451,1.4405
452,1.4792
453,1.5177
454,1.5546
455,1.5923
456,1.6311
457,1.6702
458,1.7071
459,1.735
460,1.7614
461,1.7841
462,1.8016
