time,value
0,0.23953000000000002
1,-1.8509
2,0.23953000000000002
3,0.23953000000000002
4,0.23953000000000002
5,-1.8509
6,0.23953000000000002
7,0.23953000000000002
8,-1.8509
9,0.23953000000000002
10,0.23953000000000002
11,-1.8509
12,0.23953000000000002
13,0.23953000000000002
14,-1.8509
15,0.23953000000000002
16,0.23953000000000002
17,-1.8509
18,0.23953000000000002
19,0.23953000000000002
20,-1.8509
21,0.23953000000000002
22,-1.8509
23,0.23953000000000002
24,0.23953000000000002
25,-1.8509
26,0.23953000000000002
27,0.23953000000000002
28,0.23953000000000002
29,0.23953000000000002
30,0.23953000000000002
31,-1.8509
32,0.23953000000000002
33,0.23953000000000002
34,-1.8509
35,0.23953000000000002
36,0.23953000000000002
37,0.23953000000000002
38,0.23953000000000002
39,0.23953000000000002
40,0.23953000000000002
41,0.23953000000000002
42,0.23953000000000002
43,0.23953000000000002
44,0.23953000000000002
45,0.23953000000000002
46,0.23953000000000002
47,0.23953000000000002
48,0.23953000000000002
49,0.23953000000000002
50,0.23953000000000002
51,0.23953000000000002
52,0.23953000000000002
53,0.23953000000000002
54,0.23953000000000002
55,2.33
56,2.33
57,-1.8509
58,0.23953000000000002
59,2.33
60,2.33
61,0.23953000000000002
62,0.23953000000000002
63,2.33
64,0.23953000000000002
65,0.23953000000000002
66,0.23953000000000002
67,0.23953000000000002
68,0.23953000000000002
69,-1.8509
70,0.23953000000000002
71,0.23953000000000002
72,0.23953000000000002
73,0.23953000000000002
74,0.23953000000000002
75,-1.8509
76,0.23953000000000002
77,0.23953000000000002
78,0.23953000000000002
79,0.23953000000000002
80,0.23953000000000002
81,0.23953000000000002
82,0.23953000000000002
83,0.23953000000000002
84,0.23953000000000002
85,-1.8509
86,0.23953000000000002
87,0.23953000000000002
88,-1.8509
89,0.23953000000000002
90,0.23953000000000002
91,0.23953000000000002
92,2.33
93,0.23953000000000002
94,0.23953000000000002
95,-1.8509
