time,value
0,-0.8852399999999999
1,-0.8662799999999999
2,-0.8458399999999999
3,-0.8269799999999999
4,-0.81321
5,-0.80381
6,-0.7994399999999999
7,-0.79727
8,-0.79373
9,-0.7878
10,-0.7762100000000001
11,-0.7593
12,-0.7376699999999999
13,-0.71121
14,-0.68261
15,-0.65213
16,-0.6217199999999999
17,-0.59283
18,-0.56288
19,-0.52799
20,-0.4804
21,-0.41468
22,-0.33132
23,-0.23576
24,-0.13857
25,-0.049751
26,0.023521
27,0.077231
28,0.11241
29,0.13241
30,0.14262
31,0.14781
32,0.14861
33,0.14362
34,0.12908
35,0.10300999999999999
36,0.067243
37,0.024586
38,-0.020274
39,-0.065339
40,-0.11085999999999999
41,-0.15737
42,-0.20668000000000003
43,-0.25774
44,-0.30893000000000004
45,-0.3583
46,-0.40279
47,-0.44216000000000005
48,-0.4755
49,-0.50303
50,-0.52599
51,-0.54283
52,-0.55497
53,-0.5618
54,-0.56335
55,-0.56313
56,-0.5594100000000001
57,-0.55474
58,-0.54994
59,-0.5436
60,-0.5385800000000001
61,-0.53263
62,-0.52705
63,-0.52461
64,-0.5240100000000001
65,-0.5272899999999999
66,-0.53146
67,-0.5336
68,-0.53458
69,-0.5319699999999999
70,-0.52775
71,-0.5220899999999999
72,-0.51339
73,-0.5040899999999999
74,-0.49215
75,-0.47712
76,-0.45692
77,-0.42675
78,-0.38652
79,-0.33665
80,-0.28026
81,-0.22091
82,-0.159
83,-0.097567
84,-0.040048
85,0.008759200000000002
86,0.043632
87,0.065724
88,0.076889
89,0.080715
90,0.08091
91,0.076581
92,0.070126
93,0.06151
94,0.050277999999999996
95,0.037627
96,0.020941
97,0.00050759
98,-0.023897
99,-0.053295
100,-0.085618
101,-0.12232
102,-0.1632
103,-0.20705
104,-0.25282
105,-0.29331999999999997
106,-0.3234
107,-0.33783
108,-0.33336
109,-0.31371
110,-0.28038
111,-0.24055
112,-0.20092000000000002
113,-0.16467
114,-0.13585
115,-0.11082
116,-0.08817
117,-0.069052
118,-0.052923000000000005
119,-0.043646
120,-0.039002999999999996
121,-0.035882
122,-0.034777999999999996
123,-0.032643
124,-0.032829000000000004
125,-0.035833
126,-0.038798
127,-0.045172000000000004
128,-0.050223000000000004
129,-0.054792999999999994
130,-0.060280999999999994
131,-0.06201
132,-0.064443
133,-0.06616799999999999
134,-0.067412
135,-0.071939
136,-0.07245800000000001
137,-0.071166
138,-0.066554
139,-0.054975
140,-0.043325999999999996
141,-0.021737
142,0.0082291
143,0.043131
144,0.087037
145,0.12828
146,0.17737
147,0.24051999999999998
148,0.32145
149,0.43238000000000004
150,0.5674100000000001
151,0.72475
152,0.8955299999999999
153,1.0619
154,1.2172
155,1.3522
156,1.4706
157,1.5862
158,1.7118
159,1.8669
160,2.0599
161,2.293
162,2.5627
163,2.8539
164,3.1519
165,3.4319
166,3.6661
167,3.8308
168,3.9067
169,3.8933
170,3.8017
171,3.6519
172,3.4687
173,3.2683
174,3.0627
175,2.8536
176,2.6349
177,2.4028
178,2.1512
179,1.8848
180,1.614
181,1.3493
182,1.1087
183,0.8974799999999999
184,0.7195600000000001
185,0.57406
186,0.45171999999999995
187,0.35291
188,0.27038
189,0.20096
190,0.14490999999999998
191,0.093029
192,0.0494
193,0.010043
194,-0.028526999999999997
195,-0.059896000000000005
196,-0.093093
197,-0.12492
198,-0.15662
199,-0.19444
200,-0.22764
201,-0.25992
202,-0.28831999999999997
203,-0.31172
204,-0.33744
205,-0.36083000000000004
206,-0.38485
207,-0.40943
208,-0.43136
209,-0.4547
210,-0.47725
211,-0.49938999999999995
212,-0.5214300000000001
213,-0.53892
214,-0.55276
215,-0.56207
216,-0.56806
217,-0.57492
218,-0.5817100000000001
219,-0.59001
220,-0.59864
221,-0.60544
222,-0.6109399999999999
223,-0.6129600000000001
224,-0.6120899999999999
225,-0.6088399999999999
226,-0.60268
227,-0.59563
228,-0.58765
229,-0.57986
230,-0.5736600000000001
231,-0.56842
232,-0.56529
233,-0.5639
234,-0.56382
235,-0.56528
236,-0.5664899999999999
237,-0.56793
238,-0.57016
239,-0.57394
240,-0.58012
241,-0.58715
242,-0.59412
243,-0.60063
244,-0.60733
245,-0.61612
246,-0.6271800000000001
247,-0.64031
248,-0.65491
249,-0.66972
250,-0.6842199999999999
251,-0.6967899999999999
252,-0.70662
253,-0.7148100000000001
254,-0.7228600000000001
255,-0.7330800000000001
256,-0.74532
257,-0.75807
258,-0.77079
259,-0.78318
260,-0.79632
261,-0.80987
262,-0.8227200000000001
263,-0.8359
264,-0.8511700000000001
265,-0.8703299999999999
266,-0.8914
267,-0.9083100000000001
268,-0.9168200000000001
269,-0.9167700000000001
