time,value
0,1.9092
1,-0.61201
2,-0.84121
3,-0.53561
4,1.9092
5,-0.6884100000000001
6,-0.84121
7,-0.1536
8,1.68
9,-0.84121
10,-0.84121
11,-0.1536
12,1.6036
13,-0.84121
14,-0.84121
15,0.07560599999999999
16,1.7564
17,-0.84121
18,-0.84121
19,-0.4592
20,1.9856
21,-0.53561
22,-0.84121
23,-0.84121
24,1.9092
25,-0.1536
26,-0.84121
27,-0.84121
28,1.298
29,0.22841
30,-0.84121
31,-0.84121
32,1.1452
33,0.53401
34,-0.84121
35,-0.84121
36,1.2216
37,0.38121
38,-0.84121
39,-0.84121
40,1.1452
41,0.76322
42,-0.84121
43,-0.84121
44,0.9924200000000001
45,0.83962
46,-0.84121
47,-0.84121
48,0.76322
49,0.76322
50,-0.84121
51,-0.84121
52,0.83962
53,0.76322
54,-0.84121
55,-0.84121
56,0.45761
57,1.3744
58,-0.84121
59,-0.84121
60,0.38121
61,1.4508
62,-0.84121
63,-0.84121
64,-0.00079585
65,1.8328
66,-0.84121
67,-0.84121
68,-0.6884100000000001
69,1.9856
70,-0.3828
71,-0.84121
72,-0.84121
73,1.8328
74,-0.1536
75,-0.84121
76,-0.84121
77,1.9856
78,-0.3828
79,-0.84121
80,-0.84121
81,1.5272
82,0.22841
83,-0.84121
84,-0.84121
85,1.298
86,0.45761
87,-0.84121
88,-0.84121
89,0.83962
90,0.9160200000000001
91,-0.84121
92,-0.84121
93,1.0688
94,0.61042
95,-0.84121
