time,value
0,1.6877
1,-0.8649600000000001
2,-0.26434
3,1.0871
4,-0.8649600000000001
5,0.48644
6,0.18613
7,-0.8649600000000001
8,1.3874
9,-0.56465
10,-0.8649600000000001
11,1.5375
12,-0.8649600000000001
13,-0.56465
14,1.2372
15,-0.8649600000000001
16,0.18613
17,0.6366
18,-0.8649600000000001
19,0.6366
20,0.035975
21,-0.8649600000000001
22,1.0871
23,-0.41448999999999997
24,-0.8649600000000001
25,1.3874
26,-0.8649600000000001
27,-0.8649600000000001
28,1.5375
29,-0.8649600000000001
30,-0.8649600000000001
31,1.5375
32,-0.8649600000000001
33,-0.8649600000000001
34,1.5375
35,-0.8649600000000001
36,-0.8649600000000001
37,1.6877
38,-0.8649600000000001
39,-0.26434
40,0.93691
41,-0.8649600000000001
42,0.18613
43,0.48644
44,-0.8649600000000001
45,0.18613
46,0.6366
47,-0.8649600000000001
48,0.33629000000000003
49,0.33629000000000003
50,-0.8649600000000001
51,0.33629000000000003
52,0.48644
53,-0.8649600000000001
54,0.48644
55,0.33629000000000003
56,-0.8649600000000001
57,0.93691
58,-0.11417999999999999
59,-0.8649600000000001
60,1.0871
61,-0.41448999999999997
62,-0.8649600000000001
63,1.0871
64,-0.26434
65,-0.8649600000000001
66,1.6877
67,-0.8649600000000001
68,-0.8649600000000001
69,1.5375
70,-0.8649600000000001
71,-0.8649600000000001
72,1.5375
73,-0.56465
74,-0.8649600000000001
75,1.5375
76,-0.56465
77,-0.8649600000000001
78,1.6877
79,-0.8649600000000001
80,-0.8649600000000001
81,1.6877
82,-0.8649600000000001
83,-0.8649600000000001
84,1.8378
85,-0.8649600000000001
86,-0.8649600000000001
87,1.9880000000000002
88,-0.8649600000000001
89,-0.8649600000000001
90,1.8378
91,-0.8649600000000001
92,-0.8649600000000001
93,1.8378
94,-0.8649600000000001
95,-0.8649600000000001
