time,value
0,-0.68834
1,-0.90289
2,-0.90289
3,0.9207700000000001
4,0.70622
5,1.9935
6,-0.90289
7,-0.90289
8,-0.90289
9,0.9207700000000001
10,-0.90289
11,-0.90289
12,-0.044698
13,0.16985
14,2.1008
15,0.70622
16,-0.90289
17,-0.90289
18,1.028
19,-0.90289
20,-0.90289
21,0.16985
22,-0.044698
23,1.8862
24,0.9207700000000001
25,-0.90289
26,-0.90289
27,0.9207700000000001
28,-0.90289
29,-0.90289
30,0.062577
31,0.27712
32,2.1008
33,-0.044698
34,-0.90289
35,0.3844
36,-0.25925
37,-0.90289
38,-0.90289
39,0.9207700000000001
40,1.3499
41,1.3499
42,-0.90289
43,-0.90289
44,-0.90289
45,1.028
46,-0.90289
47,-0.90289
48,-0.58107
49,1.8862
50,1.2426
51,-0.90289
52,-0.90289
53,0.27712
54,-0.25925
55,-0.90289
56,-0.90289
57,0.9207700000000001
58,0.8134899999999999
59,1.6717
60,-0.90289
61,-0.90289
62,0.8134899999999999
63,-0.90289
64,-0.90289
65,-0.25925
66,0.27712
67,-0.90289
68,1.4571
69,0.49167
70,-0.90289
71,0.9207700000000001
72,-0.90289
73,-0.90289
74,-0.15197
75,0.27712
76,2.2081
77,0.27712
78,-0.90289
79,0.27712
80,-0.15197
81,-0.90289
82,0.70622
83,1.9935
84,1.2426
85,-0.90289
86,-0.90289
87,0.70622
88,-0.47379
89,-0.90289
90,0.062577
91,2.1008
92,1.2426
93,-0.90289
94,-0.90289
95,-0.90289
