time,value
0,-0.31464000000000003
1,-0.31464000000000003
2,-0.31464000000000003
3,-0.31464000000000003
4,-0.31464000000000003
5,-0.31464000000000003
6,-0.31464000000000003
7,-0.31464000000000003
8,-0.31464000000000003
9,-0.31464000000000003
10,-0.31464000000000003
11,-0.31464000000000003
12,-0.31464000000000003
13,-0.31464000000000003
14,-0.31464000000000003
15,-0.31464000000000003
16,-0.31464000000000003
17,-0.31464000000000003
18,-0.31464000000000003
19,-0.31464000000000003
20,-0.31464000000000003
21,-0.31464000000000003
22,-0.31464000000000003
23,-0.31464000000000003
24,-0.31464000000000003
25,2.5818
26,0.7198
27,-0.31464000000000003
28,-0.31464000000000003
29,-0.31464000000000003
30,-0.31464000000000003
31,-0.31464000000000003
32,-0.31464000000000003
33,-0.31464000000000003
34,-0.31464000000000003
35,-0.31464000000000003
36,-0.31464000000000003
37,-0.31464000000000003
38,3.6163
39,-0.31464000000000003
40,-0.31464000000000003
41,-0.31464000000000003
42,-0.31464000000000003
43,-0.31464000000000003
44,-0.31464000000000003
45,-0.31464000000000003
46,-0.31464000000000003
47,-0.31464000000000003
48,-0.31464000000000003
49,-0.31464000000000003
50,-0.31464000000000003
51,-0.31464000000000003
52,2.5818
53,-0.31464000000000003
54,-0.31464000000000003
55,-0.31464000000000003
56,-0.31464000000000003
57,-0.31464000000000003
58,-0.31464000000000003
59,-0.31464000000000003
60,-0.31464000000000003
61,-0.31464000000000003
62,-0.31464000000000003
63,-0.31464000000000003
64,-0.31464000000000003
65,-0.31464000000000003
66,-0.31464000000000003
67,-0.31464000000000003
68,-0.31464000000000003
69,3.5645
70,-0.31464000000000003
71,3.4094
72,1.7025
73,1.0301
74,-0.31464000000000003
75,-0.31464000000000003
76,4.3921
77,-0.31464000000000003
78,-0.31464000000000003
79,-0.31464000000000003
80,3.4611
81,-0.31464000000000003
82,-0.31464000000000003
83,-0.31464000000000003
84,-0.31464000000000003
85,-0.31464000000000003
86,-0.31464000000000003
87,-0.31464000000000003
88,-0.31464000000000003
89,-0.31464000000000003
90,-0.31464000000000003
91,-0.31464000000000003
92,-0.31464000000000003
93,-0.31464000000000003
94,-0.31464000000000003
95,-0.31464000000000003
