time,value
0,-0.33786
1,-0.7761600000000001
2,1.5614
3,-0.7761600000000001
4,-0.7761600000000001
5,1.7075
6,-0.7761600000000001
7,-0.7761600000000001
8,1.5614
9,-0.7761600000000001
10,-0.7761600000000001
11,1.5614
12,-0.7761600000000001
13,-0.7761600000000001
14,1.5614
15,-0.7761600000000001
16,-0.7761600000000001
17,1.4153
18,-0.7761600000000001
19,-0.7761600000000001
20,0.83095
21,0.10044
22,-0.7761600000000001
23,-0.19175999999999999
24,1.1231
25,-0.7761600000000001
26,-0.7761600000000001
27,1.5614
28,-0.7761600000000001
29,-0.7761600000000001
30,0.83095
31,0.10044
32,-0.7761600000000001
33,-0.7761600000000001
34,1.4153
35,-0.7761600000000001
36,-0.7761600000000001
37,1.4153
38,-0.48396000000000006
39,-0.7761600000000001
40,1.5614
41,-0.7761600000000001
42,-0.7761600000000001
43,1.5614
44,-0.7761600000000001
45,-0.7761600000000001
46,1.4153
47,-0.7761600000000001
48,-0.7761600000000001
49,1.5614
50,-0.7761600000000001
51,-0.7761600000000001
52,1.5614
53,-0.7761600000000001
54,-0.7761600000000001
55,1.5614
56,-0.7761600000000001
57,-0.7761600000000001
58,1.4153
59,-0.7761600000000001
60,-0.7761600000000001
61,1.4153
62,-0.7761600000000001
63,-0.7761600000000001
64,1.4153
65,-0.7761600000000001
66,-0.7761600000000001
67,1.5614
68,-0.7761600000000001
69,-0.7761600000000001
70,1.5614
71,-0.7761600000000001
72,-0.7761600000000001
73,1.4153
74,-0.7761600000000001
75,-0.19175999999999999
76,0.97705
77,-0.7761600000000001
78,0.24654
79,0.68485
80,-0.7761600000000001
81,1.1231
82,-0.33786
83,-0.7761600000000001
84,1.7075
85,-0.7761600000000001
86,-0.7761600000000001
87,1.7075
88,-0.7761600000000001
89,-0.33786
90,1.2692
91,-0.7761600000000001
92,0.10044
93,0.68485
94,-0.7761600000000001
95,0.53875
