time,value
0,-0.31517
1,-0.31517
2,-0.31517
3,-0.31517
4,-0.31517
5,-0.31517
6,-0.31517
7,-0.31517
8,-0.31517
9,-0.31517
10,-0.31517
11,-0.31517
12,-0.31517
13,-0.31517
14,-0.31517
15,-0.31517
16,-0.31517
17,-0.31517
18,-0.31517
19,-0.31517
20,-0.31517
21,-0.31517
22,-0.31517
23,-0.31517
24,-0.31517
25,-0.31517
26,-0.31517
27,-0.31517
28,-0.31517
29,-0.31517
30,-0.31517
31,-0.31517
32,-0.31517
33,-0.31517
34,-0.040979
35,1.1631
36,-0.31517
37,-0.31517
38,-0.31517
39,-0.31517
40,-0.31517
41,-0.31517
42,-0.31517
43,-0.31517
44,-0.31517
45,-0.31517
46,-0.31517
47,-0.31517
48,0.65045
49,1.1631
50,-0.31517
51,-0.31517
52,-0.31517
53,0.6743
54,-0.31517
55,-0.31517
56,-0.31517
57,-0.31517
58,-0.31517
59,-0.31517
60,-0.31517
61,-0.31517
62,-0.31517
63,0.63853
64,5.4905
65,3.5116
66,3.1062
67,3.1897
68,3.44
69,2.9274
70,0.24513000000000001
71,-0.31517
72,-0.31517
73,-0.31517
74,-0.31517
75,-0.31517
76,-0.31517
77,-0.31517
78,-0.31517
79,-0.31517
80,-0.31517
81,-0.31517
82,-0.31517
83,-0.31517
84,-0.31517
85,-0.31517
86,-0.31517
87,-0.31517
88,-0.31517
89,-0.31517
90,-0.31517
91,-0.31517
92,-0.31517
93,-0.31517
94,-0.31517
95,-0.31517
