time,value
0,-0.79606
1,1.2923
2,1.0965
3,0.77022
4,-1.1224
5,-1.1224
6,-1.1224
7,0.6397
8,1.1618
9,1.0313
10,-0.6655300000000001
11,-1.1224
12,-1.1224
13,-0.27396
14,1.2271
15,1.0965
16,0.052345
17,-1.1224
18,-1.1224
19,-1.1224
20,1.2923
21,1.1618
22,0.44392
23,-1.1224
24,-1.1224
25,-1.1224
26,1.0313
27,1.0965
28,0.6397
29,-1.1224
30,-1.1224
31,-1.1224
32,0.6397
33,1.1618
34,1.0313
35,-0.012916
36,-1.1224
37,-1.1224
38,-0.7308
39,1.2923
40,1.0965
41,1.0313
42,-0.078178
43,-1.1224
44,-1.1224
45,-0.79606
46,1.2923
47,1.0965
48,1.0313
49,-0.14344
50,-1.1224
51,-1.1224
52,-0.60027
53,1.2271
54,1.0965
55,1.0313
56,-0.40449
57,-1.1224
58,-1.1224
59,-0.27396
60,1.2271
61,1.0965
62,1.0313
63,-0.46975
64,-1.1224
65,-1.1224
66,-0.27396
67,1.2271
68,1.0965
69,0.96601
70,0.37865
71,-1.1224
72,-1.1224
73,-1.1224
74,1.1618
75,1.0965
76,1.0313
77,0.96601
78,-0.53501
79,-1.1224
80,-1.1224
81,-0.2087
82,1.2271
83,1.0313
84,0.96601
85,-0.7308
86,-1.1224
87,-1.1224
88,0.052345
89,1.1618
90,1.0965
91,1.0313
92,-0.8613200000000001
93,-1.1224
94,-1.1224
95,-0.012916
