time,value
0,-0.13527
1,-0.13527
2,-0.13527
3,-0.13527
4,-0.13527
5,-0.13527
6,-0.13527
7,-0.13527
8,-0.13527
9,-0.13527
10,-0.13527
11,-0.13527
12,-0.13527
13,-0.13527
14,-0.13527
15,-0.13527
16,-0.13527
17,-0.13527
18,-0.13527
19,-0.13527
20,-0.13527
21,-0.13527
22,-0.13527
23,-0.13527
24,-0.13527
25,-0.13527
26,-0.13527
27,-0.13527
28,-0.13527
29,-0.13527
30,9.3335
31,0.9468700000000001
32,2.2996
33,-0.13527
34,-0.13527
35,-0.13527
36,-0.13527
37,-0.13527
38,-0.13527
39,-0.13527
40,-0.13527
41,-0.13527
42,-0.13527
43,-0.13527
44,-0.13527
45,-0.13527
46,-0.13527
47,-0.13527
48,-0.13527
49,-0.13527
50,-0.13527
51,-0.13527
52,-0.13527
53,-0.13527
54,-0.13527
55,-0.13527
56,-0.13527
57,-0.13527
58,-0.13527
59,-0.13527
60,-0.13527
61,-0.13527
62,-0.13527
63,-0.13527
64,-0.13527
65,-0.13527
66,-0.13527
67,-0.13527
68,-0.13527
69,-0.13527
70,-0.13527
71,-0.13527
72,-0.13527
73,-0.13527
74,-0.13527
75,-0.13527
76,-0.13527
77,-0.13527
78,-0.13527
79,-0.13527
80,-0.13527
81,-0.13527
82,-0.13527
83,-0.13527
84,-0.13527
85,-0.13527
86,-0.13527
87,-0.13527
88,-0.13527
89,-0.13527
90,-0.13527
91,-0.13527
92,-0.13527
93,-0.13527
94,-0.13527
95,-0.13527
