time,value
0,-1.2623
1,-1.2483
2,-1.2303
3,-1.2199
4,-1.2177
5,-1.2219
6,-1.2279
7,-1.2366
8,-1.2466
9,-1.255
10,-1.2612
11,-1.2641
12,-1.2678
13,-1.2652
14,-1.2468
15,-1.1938
16,-1.0979999999999999
17,-0.9617399999999999
18,-0.80028
19,-0.62661
20,-0.44415
21,-0.25458000000000003
22,-0.067678
23,0.088495
24,0.19268
25,0.24344000000000002
26,0.2605
27,0.25785
28,0.24076
29,0.21431999999999998
30,0.18796
31,0.16777
32,0.15085
33,0.13332
34,0.10555
35,0.060382000000000005
36,-0.0035772
37,-0.075389
38,-0.14544
39,-0.2149
40,-0.28593
41,-0.35938000000000003
42,-0.42044
43,-0.46985
44,-0.50539
45,-0.53874
46,-0.56598
47,-0.58418
48,-0.58828
49,-0.57662
50,-0.55183
51,-0.51277
52,-0.46368000000000004
53,-0.39705
54,-0.30892
55,-0.1835
56,-0.008018
57,0.22183000000000003
58,0.48163999999999996
59,0.71934
60,0.8806799999999999
61,0.9341799999999999
62,0.8905200000000001
63,0.7809999999999999
64,0.6441899999999999
65,0.49918
66,0.35120999999999997
67,0.19629000000000002
68,0.041238
69,-0.097496
70,-0.21313000000000001
71,-0.31548000000000004
72,-0.41805
73,-0.50957
74,-0.57519
75,-0.61141
76,-0.63788
77,-0.65796
78,-0.65462
79,-0.6228100000000001
80,-0.5905600000000001
81,-0.59455
82,-0.6237
83,-0.65549
84,-0.6762600000000001
85,-0.70503
86,-0.73612
87,-0.7569899999999999
88,-0.74803
89,-0.7016399999999999
90,-0.61735
91,-0.51156
92,-0.41091000000000005
93,-0.32537
94,-0.24853000000000003
95,-0.16219
96,-0.061417
97,0.054089
98,0.17945999999999998
99,0.31232
100,0.44361999999999996
101,0.55199
102,0.61347
103,0.61529
104,0.5695899999999999
105,0.49423999999999996
106,0.40193
107,0.28601
108,0.1427
109,-0.017539
110,-0.16951
111,-0.29215
112,-0.38285
113,-0.44799999999999995
114,-0.49955
115,-0.5391
116,-0.57123
117,-0.59508
118,-0.6155
119,-0.63263
120,-0.64166
121,-0.63821
122,-0.62103
123,-0.60339
124,-0.5896600000000001
125,-0.58848
126,-0.58482
127,-0.57649
128,-0.5536300000000001
129,-0.53181
130,-0.51923
131,-0.52363
132,-0.53945
133,-0.56037
134,-0.57689
135,-0.55987
136,-0.48493
137,-0.33111999999999997
138,-0.11399000000000001
139,0.14053
140,0.39953
141,0.6554300000000001
142,0.9219700000000001
143,1.2084
144,1.4951
145,1.7412
146,1.9240000000000002
147,2.0369
148,2.0868
149,2.076
150,2.0092
151,1.8842
152,1.6983
153,1.4582
154,1.182
155,0.8935299999999999
156,0.60987
157,0.35118
158,0.13242
159,-0.035052
160,-0.15739
161,-0.24886
162,-0.31764000000000003
163,-0.36754000000000003
164,-0.39588
165,-0.41895
166,-0.44351
167,-0.48308
168,-0.5251399999999999
169,-0.5656899999999999
170,-0.5985199999999999
171,-0.62817
172,-0.6584899999999999
173,-0.6833
174,-0.69721
175,-0.68947
176,-0.66673
177,-0.62851
178,-0.59314
179,-0.5623100000000001
180,-0.5529999999999999
181,-0.55779
182,-0.5727800000000001
183,-0.5837899999999999
184,-0.59308
185,-0.60652
186,-0.62163
187,-0.6400100000000001
188,-0.6482100000000001
189,-0.64264
190,-0.58154
191,-0.41748
192,-0.095716
193,0.38724000000000003
194,0.98406
195,1.6038
196,2.1512
197,2.5784
198,2.8979
199,3.1661
200,3.3905
201,3.5347
202,3.5572
203,3.4718
204,3.3145
205,3.1144
206,2.8891
207,2.6486
208,2.4023
209,2.1588
210,1.9448
211,1.7778
212,1.6583
213,1.5679
214,1.4776
215,1.3705
216,1.2475
217,1.1424
218,1.0417
219,0.9073399999999999
220,0.69843
221,0.45526000000000005
222,0.23646
223,0.07324
224,-0.039299
225,-0.1162
226,-0.15646
227,-0.17423
228,-0.17382
229,-0.17214000000000002
230,-0.16399999999999998
231,-0.15498
232,-0.14300000000000002
233,-0.13354000000000002
234,-0.1305
235,-0.13802
236,-0.16412000000000002
237,-0.20457999999999998
238,-0.25597
239,-0.30446999999999996
240,-0.35318
241,-0.39886
242,-0.44398999999999994
243,-0.48094
244,-0.50353
245,-0.5080899999999999
246,-0.4943
247,-0.46593999999999997
248,-0.4247
249,-0.37801999999999997
250,-0.32998
251,-0.28763
252,-0.25353000000000003
253,-0.23295
254,-0.233
255,-0.25904
256,-0.31085999999999997
257,-0.37644
258,-0.44553000000000004
259,-0.51131
260,-0.5774600000000001
261,-0.64632
262,-0.72292
263,-0.8082699999999999
264,-0.89909
265,-0.9898399999999999
266,-1.0764
267,-1.1562
268,-1.2181
269,-1.2546
