time,value
0,1.7382
1,1.7467
2,1.6784
3,1.5978
4,1.5141
5,1.4266
6,1.3394
7,1.252
8,1.1647
9,1.078
10,0.9908799999999999
11,0.9045200000000001
12,0.8186399999999999
13,0.73285
14,0.6451600000000001
15,0.5705
16,0.48502
17,0.39998
18,0.3247
19,0.23931999999999998
20,0.15425
21,0.070747
22,-0.014782
23,-0.098652
24,-0.18200999999999998
25,-0.26479
26,-0.34691
27,-0.42826000000000003
28,-0.50871
29,-0.59191
30,-0.6704100000000001
31,-0.7487699999999999
32,-0.8276100000000001
33,-0.9014200000000001
34,-0.97831
35,-1.0473
36,-1.1193
37,-1.1881
38,-1.2454
39,-1.3045
40,-1.3571
41,-1.3923
42,-1.4266
43,-1.4493
44,-1.4591
45,-1.4555
46,-1.4387
47,-1.4097
48,-1.3734
49,-1.33
50,-1.2738
51,-1.219
52,-1.1519
53,-1.0814
54,-1.0225
55,-0.9467399999999999
56,-0.87402
57,-0.7960699999999999
58,-0.71828
59,-0.6404
60,-0.56112
61,-0.4782
62,-0.39659
63,-0.31479
64,-0.23226999999999998
65,-0.14912999999999998
66,-0.065456
67,0.018696
68,0.096025
69,0.17787999999999998
70,0.26288
71,0.34867
72,0.43356000000000006
73,0.5190100000000001
74,0.60537
75,0.68835
76,0.7669600000000001
77,0.85278
78,0.92947
79,1.0158
80,1.0993
81,1.1791
82,1.2658
83,1.3531
84,1.4409999999999998
85,1.5247
86,1.6057
87,1.6933
88,1.7592
89,1.7231
90,1.6365
91,1.5489
92,1.4615
93,1.3742
94,1.2866
95,1.1994
96,1.1126
97,1.0356
98,0.9492799999999999
99,0.87369
100,0.78673
101,0.70123
102,0.62516
103,0.54022
104,0.45581000000000005
105,0.36954000000000004
106,0.28271
107,0.20975
108,0.12489000000000001
109,0.050668
110,-0.033433
111,-0.11706
112,-0.20015
113,-0.28264
114,-0.35438000000000003
115,-0.43588000000000005
116,-0.51805
117,-0.5886600000000001
118,-0.66685
119,-0.74802
120,-0.82342
121,-0.89681
122,-0.9712
123,-1.0418
124,-1.1079999999999999
125,-1.1746
126,-1.2382
127,-1.2884
128,-1.3398
129,-1.3737
130,-1.4068
131,-1.4287
132,-1.4381
133,-1.4346
134,-1.4183
135,-1.39
136,-1.3514
137,-1.3094
138,-1.2576
139,-1.2041
140,-1.1381
141,-1.0747
142,-1.0018
143,-0.94094
144,-0.8636799999999999
145,-0.7895399999999999
146,-0.71353
147,-0.6359600000000001
148,-0.55337
149,-0.4736
150,-0.39285
151,-0.31126
152,-0.2377
153,-0.15616
154,-0.07514
155,0.010101
156,0.09567300000000001
157,0.17855
158,0.26339
159,0.34923000000000004
160,0.43341999999999997
161,0.51836
162,0.5941
163,0.67945
164,0.76152
165,0.8417899999999999
166,0.9290200000000001
167,1.0153
168,1.1021
169,1.1789
170,1.2664
171,1.3537
172,1.4312
173,1.5192
174,1.6067
175,1.6937
