time,value
0,-0.32366999999999996
1,-0.47748999999999997
2,-0.32366999999999996
3,-0.32366999999999996
4,-0.32366999999999996
5,-0.32366999999999996
6,-0.47748999999999997
7,-0.32366999999999996
8,-0.32366999999999996
9,-0.32366999999999996
10,-0.47748999999999997
11,-0.32366999999999996
12,-0.32366999999999996
13,-0.32366999999999996
14,-0.47748999999999997
15,-0.32366999999999996
16,-0.32366999999999996
17,-0.32366999999999996
18,-0.47748999999999997
19,-0.32366999999999996
20,-0.32366999999999996
21,-0.32366999999999996
22,-0.32366999999999996
23,-0.47748999999999997
24,-0.32366999999999996
25,-0.32366999999999996
26,-0.32366999999999996
27,-0.47748999999999997
28,-0.32366999999999996
29,-0.32366999999999996
30,-0.32366999999999996
31,-0.47748999999999997
32,-0.32366999999999996
33,-0.32366999999999996
34,-0.32366999999999996
35,-0.47748999999999997
36,-0.32366999999999996
37,-0.32366999999999996
38,-0.32366999999999996
39,-0.47748999999999997
40,-0.32366999999999996
41,-0.32366999999999996
42,-0.32366999999999996
43,-0.47748999999999997
44,-0.32366999999999996
45,-0.32366999999999996
46,-0.32366999999999996
47,-0.47748999999999997
48,-0.32366999999999996
49,-0.32366999999999996
50,-0.32366999999999996
51,-0.47748999999999997
52,-0.32366999999999996
53,-0.32366999999999996
54,-0.32366999999999996
55,-0.47748999999999997
56,-0.32366999999999996
57,-0.32366999999999996
58,-0.32366999999999996
59,-0.32366999999999996
60,-0.47748999999999997
61,-0.32366999999999996
62,-0.32366999999999996
63,-0.32366999999999996
64,-0.47748999999999997
65,-0.32366999999999996
66,-0.32366999999999996
67,-0.32366999999999996
68,-0.47748999999999997
69,-0.32366999999999996
70,-0.32366999999999996
71,-0.32366999999999996
72,-0.32366999999999996
73,-0.32366999999999996
74,-0.32366999999999996
75,-0.32366999999999996
76,-0.32366999999999996
77,-0.32366999999999996
78,-0.32366999999999996
79,0.1378
80,2.9066
81,2.9066
82,2.9066
83,2.9066
84,2.5989999999999998
85,2.7528
86,2.9066
87,2.7528
88,2.9066
89,3.0604
90,1.3684
91,-0.47748999999999997
92,-0.32366999999999996
93,-0.32366999999999996
94,-0.32366999999999996
95,-0.47748999999999997
