time,value
0,-0.1473
1,-0.1473
2,-0.1473
3,-0.1473
4,-0.1473
5,-0.1473
6,-0.1473
7,-0.1473
8,-0.1473
9,-0.1473
10,-0.1473
11,-0.1473
12,-0.1473
13,-0.1473
14,-0.1473
15,-0.1473
16,-0.1473
17,-0.1473
18,-0.1473
19,-0.1473
20,-0.1473
21,-0.1473
22,-0.1473
23,-0.1473
24,-0.1473
25,-0.1473
26,-0.1473
27,-0.1473
28,-0.1473
29,3.0297
30,-0.1473
31,-0.1473
32,-0.1473
33,-0.1473
34,-0.1473
35,-0.1473
36,-0.1473
37,-0.1473
38,-0.1473
39,-0.1473
40,-0.1473
41,-0.1473
42,-0.1473
43,-0.1473
44,-0.1473
45,-0.1473
46,-0.1473
47,-0.1473
48,-0.1473
49,-0.1473
50,-0.1473
51,-0.1473
52,-0.1473
53,-0.1473
54,-0.1473
55,-0.1473
56,-0.1473
57,-0.1473
58,-0.1473
59,-0.1473
60,-0.1473
61,-0.1473
62,-0.1473
63,-0.1473
64,-0.1473
65,-0.1473
66,-0.1473
67,-0.1473
68,-0.1473
69,-0.1473
70,-0.1473
71,-0.1473
72,-0.1473
73,1.2543
74,9.0723
75,-0.085006
76,-0.085006
77,-0.053859000000000004
78,-0.1473
79,-0.085006
80,-0.085006
81,-0.1473
82,-0.1473
83,-0.1473
84,-0.1473
85,-0.1473
86,-0.1473
87,-0.1473
88,-0.1473
89,-0.1473
90,-0.1473
91,-0.1473
92,-0.1473
93,-0.1473
94,-0.1473
95,-0.1473
