time,value
0,-0.9252299999999999
1,-0.9252299999999999
2,-0.9252299999999999
3,-0.9252299999999999
4,-0.9252299999999999
5,-0.9252299999999999
6,-0.9252299999999999
7,-0.9252299999999999
8,-0.9252299999999999
9,-0.9252299999999999
10,-0.9252299999999999
11,-0.9252299999999999
12,-0.9252299999999999
13,-0.9252299999999999
14,-0.9252299999999999
15,-0.9252299999999999
16,-0.9252299999999999
17,-0.9252299999999999
18,-0.9252299999999999
19,-0.9252299999999999
20,-0.9252299999999999
21,-0.9252299999999999
22,-0.9252299999999999
23,-0.9252299999999999
24,0.60325
25,1.8769999999999998
26,1.4524
27,1.0278
28,1.2826
29,1.0278
30,0.858
31,0.9429200000000001
32,1.1127
33,1.1127
34,0.858
35,0.7730899999999999
36,-0.5855600000000001
37,-0.9252299999999999
38,-0.67048
39,-0.9252299999999999
40,-0.41573000000000004
41,-0.41573000000000004
42,-0.9252299999999999
43,-0.9252299999999999
44,-0.75539
45,-0.50065
46,-0.9252299999999999
47,2.1317
48,2.1317
49,0.26359
50,0.093761
51,0.26359
52,-0.67048
53,-0.67048
54,-0.9252299999999999
55,-0.67048
56,-0.75539
57,-0.67048
58,-0.9252299999999999
59,-0.9252299999999999
60,-0.75539
61,1.7921
62,2.0468
63,0.9429200000000001
64,2.4714
65,1.0278
66,0.858
67,0.858
68,0.9429200000000001
69,0.9429200000000001
70,0.68817
71,0.858
72,1.0278
73,0.7730899999999999
74,0.68817
75,1.0278
76,1.0278
77,0.60325
78,0.7730899999999999
79,1.0278
80,0.858
81,0.60325
82,0.9429200000000001
83,0.9429200000000001
84,0.60325
85,0.7730899999999999
86,1.0278
87,0.60325
88,-0.9252299999999999
89,-0.9252299999999999
90,-0.9252299999999999
91,-0.9252299999999999
92,-0.9252299999999999
93,-0.9252299999999999
94,-0.9252299999999999
95,-0.9252299999999999
