time,value
0,-1.1951
1,-1.1896
2,-1.1847
3,-1.1795
4,-1.1734
5,-1.1669
6,-1.1612
7,-1.1548
8,-1.1471
9,-1.1379
10,-1.1294
11,-1.1215
12,-1.1132
13,-1.1034
14,-1.0917
15,-1.0814
16,-1.0703
17,-1.0578
18,-1.0434
19,-1.0282
20,-1.0144
21,-1.0001
22,-0.98441
23,-0.9661799999999999
24,-0.94701
25,-0.9256200000000001
26,-0.8993
27,-0.86565
28,-0.8227
29,-0.77199
30,-0.71019
31,-0.63598
32,-0.54891
33,-0.45108000000000004
34,-0.34601
35,-0.23460999999999999
36,-0.11890999999999999
37,-0.00091219
38,0.11519000000000001
39,0.2285
40,0.33948
41,0.44865
42,0.55623
43,0.65968
44,0.76074
45,0.8598399999999999
46,0.95734
47,1.0522
48,1.1435
49,1.2328
50,1.3211
51,1.4092
52,1.4955
53,1.5802
54,1.6634
55,1.7445
56,1.8223
57,1.8938
58,1.9592
59,2.0182
60,2.0707
61,2.1157
62,2.1527
63,2.1823
64,2.2048
65,2.2203
66,2.2278
67,2.2281
68,2.2218
69,2.21
70,2.1932
71,2.1717
72,2.1472
73,2.1204
74,2.0922
75,2.0625
76,2.0314
77,1.9996
78,1.9673
79,1.9348
80,1.9014
81,1.8685
82,1.8368
83,1.8065
84,1.7773
85,1.7485
86,1.7204
87,1.6917
88,1.6603
89,1.6234
90,1.5796
91,1.5286
92,1.4694
93,1.4019
94,1.3255
95,1.2443
96,1.1605
97,1.0761
98,0.9921399999999999
99,0.9092899999999999
100,0.8304600000000001
101,0.7552300000000001
102,0.6824600000000001
103,0.60942
104,0.5365800000000001
105,0.46438999999999997
106,0.39196
107,0.31873
108,0.24245999999999998
109,0.16731
110,0.09399400000000001
111,0.022681
112,-0.047370999999999996
113,-0.11631
114,-0.18087999999999999
115,-0.24118
116,-0.29756
117,-0.35217
118,-0.40309
119,-0.44885
120,-0.48985
121,-0.52661
122,-0.56224
123,-0.59285
124,-0.61859
125,-0.64005
126,-0.65893
127,-0.6762
128,-0.68943
129,-0.69923
130,-0.7065
131,-0.71429
132,-0.72143
133,-0.72715
134,-0.73214
135,-0.7370800000000001
136,-0.74551
137,-0.7533
138,-0.76013
139,-0.76582
140,-0.7713399999999999
141,-0.77693
142,-0.77961
143,-0.77903
144,-0.77512
145,-0.7699
146,-0.76176
147,-0.74958
148,-0.73349
149,-0.7139800000000001
150,-0.69375
151,-0.67052
152,-0.64484
153,-0.61752
154,-0.59024
155,-0.56408
156,-0.5380199999999999
157,-0.51231
158,-0.48705
159,-0.46329
160,-0.43966000000000005
161,-0.41503999999999996
162,-0.3889
163,-0.36102
164,-0.33235
165,-0.3015
166,-0.26852
167,-0.23356999999999997
168,-0.19733
169,-0.16008
170,-0.12114000000000001
171,-0.080557
172,-0.03852
173,0.0038414
174,0.046599
175,0.089536
176,0.13213
177,0.17372
178,0.21294000000000002
179,0.25035999999999997
180,0.28567
181,0.31838
182,0.34713
183,0.37061
184,0.38832
185,0.39918000000000003
186,0.40225
187,0.39598
188,0.38101
189,0.35841999999999996
190,0.32961
191,0.29609
192,0.25859
193,0.21957
194,0.18024
195,0.14129
196,0.10237
197,0.06309400000000001
198,0.023565
199,-0.016709
200,-0.058158
201,-0.10178999999999999
202,-0.14684
203,-0.1927
204,-0.23872
205,-0.28425
206,-0.32878
207,-0.37058
208,-0.40886999999999996
209,-0.44319
210,-0.47362
211,-0.49971000000000004
212,-0.52103
213,-0.53774
214,-0.55002
215,-0.5584600000000001
216,-0.56202
217,-0.56057
218,-0.55424
219,-0.54343
220,-0.52855
221,-0.5090600000000001
222,-0.48566000000000004
223,-0.45929
224,-0.43133
225,-0.40195
226,-0.37155
227,-0.34144
228,-0.3131
229,-0.28878000000000004
230,-0.26842
231,-0.25335
232,-0.24491
233,-0.24425
234,-0.2516
235,-0.26526
236,-0.28461
237,-0.3089
238,-0.33781
239,-0.36963
240,-0.40310999999999997
241,-0.43803000000000003
242,-0.47431
243,-0.51252
244,-0.55109
245,-0.58986
246,-0.62898
247,-0.66889
248,-0.7097600000000001
249,-0.75093
250,-0.79262
251,-0.8349
252,-0.87779
253,-0.91999
254,-0.96026
255,-0.99787
256,-1.0323
257,-1.0639
258,-1.0919
259,-1.117
260,-1.1396
261,-1.1603
262,-1.179
263,-1.1949
264,-1.2075
265,-1.2164
266,-1.2219
267,-1.224
268,-1.2233
269,-1.2209999999999999
