time,value
0,-0.27066
1,-0.27066
2,-0.27066
3,-0.27066
4,-0.27066
5,-0.27066
6,-0.27066
7,-0.27066
8,-0.27066
9,-0.27066
10,-0.27066
11,-0.27066
12,-0.27066
13,-0.27066
14,-0.27066
15,-0.27066
16,-0.27066
17,-0.27066
18,-0.27066
19,-0.27066
20,-0.27066
21,-0.27066
22,-0.27066
23,-0.27066
24,-0.27066
25,-0.27066
26,-0.27066
27,-0.27066
28,-0.27066
29,-0.27066
30,-0.27066
31,-0.27066
32,-0.27066
33,-0.27066
34,-0.27066
35,-0.27066
36,2.8252
37,-0.27066
38,-0.27066
39,-0.27066
40,1.1114
41,-0.27066
42,-0.27066
43,-0.27066
44,2.4106
45,-0.16009
46,7.1372
47,1.1943
48,-0.27066
49,-0.27066
50,-0.27066
51,-0.27066
52,-0.27066
53,-0.27066
54,-0.27066
55,-0.27066
56,2.4382
57,0.17160999999999998
58,-0.27066
59,-0.27066
60,-0.27066
61,-0.27066
62,-0.27066
63,-0.27066
64,-0.27066
65,-0.27066
66,-0.27066
67,-0.27066
68,2.4382
69,-0.27066
70,-0.27066
71,-0.27066
72,-0.27066
73,-0.27066
74,-0.27066
75,-0.27066
76,-0.27066
77,-0.27066
78,-0.27066
79,-0.27066
80,-0.27066
81,-0.27066
82,-0.27066
83,-0.27066
84,-0.27066
85,-0.27066
86,-0.27066
87,-0.27066
88,3.0463
89,0.39274000000000003
90,-0.27066
91,-0.27066
92,-0.27066
93,-0.27066
94,-0.27066
95,-0.27066
