time,value
0,-0.14499
1,-0.14499
2,-0.14499
3,-0.14499
4,-0.14499
5,-0.14499
6,-0.14499
7,-0.14499
8,-0.14499
9,-0.14499
10,-0.14499
11,-0.14499
12,-0.14499
13,-0.14499
14,-0.14499
15,-0.14499
16,-0.14499
17,-0.14499
18,-0.14499
19,-0.14499
20,-0.14499
21,-0.14499
22,-0.14499
23,-0.14499
24,-0.14499
25,-0.14499
26,-0.14499
27,-0.14499
28,-0.14499
29,-0.14499
30,-0.14499
31,-0.14499
32,-0.14499
33,-0.14499
34,-0.14499
35,6.5434
36,-0.14499
37,-0.14499
38,-0.14499
39,-0.14499
40,-0.14499
41,-0.14499
42,-0.14499
43,-0.14499
44,-0.14499
45,-0.14499
46,-0.14499
47,-0.14499
48,-0.14499
49,-0.14499
50,-0.14499
51,-0.14499
52,-0.14499
53,-0.14499
54,-0.14499
55,-0.14499
56,-0.14499
57,-0.14499
58,-0.14499
59,-0.14499
60,-0.14499
61,-0.14499
62,-0.14499
63,-0.14499
64,-0.14499
65,-0.14499
66,-0.14499
67,-0.14499
68,-0.14499
69,-0.14499
70,-0.14499
71,-0.14499
72,-0.14499
73,-0.14499
74,-0.14499
75,-0.14499
76,-0.14499
77,-0.14499
78,-0.14499
79,-0.14499
80,-0.14499
81,7.0857
82,-0.14499
83,-0.14499
84,-0.14499
85,-0.14499
86,-0.14499
87,-0.14499
88,-0.14499
89,-0.14499
90,-0.14499
91,-0.14499
92,-0.14499
93,-0.14499
94,-0.14499
95,-0.14499
