d3mIndex,filename,start-end-time-slice-of-recording,salience,class
0,54823.wav,"9.084564,17.789814",1.0,dog_bark
1,95562.wav,"0.0,1.5279459999999998",1.0,drilling
2,155219.wav,"0.0,139.27328799999998",2.0,children_playing
3,201207.wav,"121.20705900000002,123.471765",1.0,dog_bark
4,171249.aiff,"6.670458999999999,7.433059",2.0,car_horn
5,89210.wav,"0.056222,2.144197",1.0,dog_bark
6,97317.mp3,"0.0,77.19183699999998",1.0,children_playing
7,97756.wav,"0.141727,1.290466",1.0,dog_bark
8,194962.mp3,"4.1517620000000015,12.48",1.0,engine_idling
9,165644.wav,"0.0,6.672041",1.0,drilling
10,69598.wav,"50.557406,57.376323",1.0,drilling
11,170022.mp3,"9.04285,16.117551000000002",1.0,air_conditioner
12,196077.wav,"0.0,7.44941",1.0,children_playing
13,7389.mp3,"160.76124199999995,195.690473",2.0,car_horn
14,196084.wav,"0.708236,10.35795",1.0,children_playing
15,103076.aif,"10.265534,10.717475",1.0,dog_bark
16,38231.flac,"6.142288,7.315086999999999",1.0,dog_bark
17,196064.wav,"0.0,1.243741",1.0,children_playing
18,26255.flac,"50.414747,54.63342900000001",2.0,dog_bark
19,27068.wav,"26.451322,26.66769600000001",2.0,car_horn
20,118723.aif,"0.0,2.653802",1.0,drilling
21,34621.wav,"25.863665,26.34619600000001",1.0,drilling
22,54173.wav,"3.153856,70.266054",2.0,children_playing
23,77751.wav,"0.39967,6.721719",1.0,drilling
24,69598.wav,"19.920982,26.009301",2.0,drilling
25,43802.wav,"8.044597999999999,8.287148",2.0,car_horn
26,132073.aiff,"4.41645,4.78231",2.0,car_horn
27,168037.wav,"223.445214,225.718742",1.0,drilling
28,209992.wav,"409.108897,461.335564",1.0,engine_idling
29,118587.mp3,"0.0,85.002449",1.0,dog_bark
30,14115.wav,"0.0,2.133471",1.0,drilling
31,182800.wav,"55.974271,62.38196",1.0,children_playing
32,180029.wav,"34.70171,35.72335",1.0,drilling
33,4918.wav,"7.4672,8.389333",1.0,dog_bark
34,169466.wav,"203.287355,235.367301",2.0,drilling
35,36902.wav,"0.08997999999999999,0.877307",1.0,dog_bark
36,35296.mp3,"3.591018,5.595897",2.0,dog_bark
37,160366.aiff,"0.0,33.412042",1.0,dog_bark
38,149193.flac,"0.0,14.12173",1.0,engine_idling
39,180128.flac,"102.961713,107.278431",1.0,drilling
40,56385.wav,"0.0,9.718118",2.0,air_conditioner
41,200161.wav,"68.60339599999999,84.618892",1.0,dog_bark
42,103258.wav,"0.0,42.493458",1.0,engine_idling
43,24965.wav,"0.0,0.500483",1.0,dog_bark
44,69598.wav,"34.776481,36.383798",2.0,drilling
45,197073.wav,"1.827741,3.3847059999999995",1.0,dog_bark
46,71086.wav,"6.409867,8.598236",1.0,drilling
47,26255.flac,"7.928729,8.477257",2.0,dog_bark
48,159735.wav,"0.0,249.236562",1.0,children_playing
49,156091.wav,"1.1755950000000002,2.9223",2.0,car_horn
50,87275.wav,"2.4096740000000003,2.47873",2.0,car_horn
51,72723.mp3,"0.0,1.410612",1.0,dog_bark
52,24965.wav,"3.111829,3.5946480000000003",1.0,dog_bark
53,71529.wav,"0.435671,9.314338",1.0,drilling
54,102106.wav,"2.243852,3.884477",2.0,dog_bark
55,201207.wav,"21.801569,23.79451",1.0,dog_bark
56,47160.wav,"0.056394000000000014,13.681162",1.0,air_conditioner
57,156634.wav,"0.0,28.222099",1.0,engine_idling
58,72220.wav,"51.986334,57.282776",2.0,dog_bark
59,57607.wav,"9.765042,10.262624",2.0,car_horn
60,204919.mp3,"10.451745,14.838534",2.0,dog_bark
61,7965.mp3,"172.244126,175.170082",2.0,dog_bark
62,126521.aif,"2.3219950000000003,70.310023",2.0,dog_bark
63,196086.wav,"0.0,1.048434",1.0,children_playing
64,151877.wav,"1.597715,3.007464",1.0,engine_idling
65,165567.aiff,"0.147106,4.364141",2.0,dog_bark
66,156362.wav,"309.117912,330.243958",2.0,drilling
67,165785.wav,"1.333836,2.415427",1.0,drilling
68,197243.wav,"0.407216,1.042196",1.0,dog_bark
69,17486.wav,"4.7572790000000005,5.700076",1.0,dog_bark
70,208030.wav,"2.48011,3.847929",1.0,dog_bark
71,4201.mp3,"1.818737,2.171462",2.0,dog_bark
72,35629.mp3,"32.347248,33.537806",1.0,dog_bark
73,85544.aif,"29.3351,31.241455",1.0,dog_bark
74,192123.mp3,"0.0,129.802449",1.0,children_playing
75,107842.wav,"13.811801,25.902838",1.0,drilling
76,18581.mp3,"63.71059,75.12693900000002",2.0,dog_bark
77,51022.wav,"26.742176,27.883122",2.0,dog_bark
78,118440.mp3,"8.794578,9.270119",1.0,drilling
79,84699.wav,"23.193341,24.498676",1.0,drilling
80,152588.wav,"0.386897,2.805001",1.0,dog_bark
81,162318.flac,"0.0,120.0",1.0,children_playing
82,156634.wav,"42.99745,64.18009599999999",1.0,engine_idling
83,190680.wav,"54.626558,60.401507",2.0,dog_bark
84,201207.wav,"134.13098,137.482745",1.0,dog_bark
85,204408.wav,"0.0,182.976644",2.0,children_playing
86,167464.wav,"0.0,52.568526",2.0,air_conditioner
87,106486.aiff,"0.0,8.261451",1.0,engine_idling
88,44110.wav,"35.046011,41.450781",1.0,dog_bark
89,77751.wav,"52.82907900000001,63.329495",1.0,drilling
90,84317.wav,"0.0,2.5",1.0,dog_bark
91,130961.wav,"205.313507,213.74859",1.0,drilling
92,30832.mp3,"14.801945000000002,16.250646",2.0,dog_bark
93,200161.wav,"88.79859599999996,92.576404",1.0,dog_bark
94,160575.wav,"3.450622,4.514564",2.0,dog_bark
95,180125.flac,"40.848486,70.612459",1.0,drilling
96,34621.wav,"11.130383,11.677252",1.0,drilling
97,138465.wav,"19.212259,22.962543",2.0,car_horn
98,100263.wav,"0.0,394.650317",1.0,children_playing
99,69598.wav,"5.601254,8.036582000000001",1.0,drilling
100,164627.wav,"0.306819,1.804998",1.0,car_horn
101,151359.wav,"11.322735,11.419621",1.0,car_horn
102,147764.wav,"0.441828,2.143685",1.0,drilling
103,71087.wav,"0.27331500000000003,4.231567",1.0,drilling
104,175844.wav,"0.400001,1.293813",1.0,car_horn
105,49809.wav,"18.125927,20.897162",2.0,dog_bark
106,109711.aif,"0.0,0.6278520000000001",1.0,dog_bark
107,203440.wav,"23.509202,40.294677",2.0,dog_bark
108,180128.flac,"96.646515,102.082382",1.0,drilling
109,57553.aif,"9.679885,11.932555",2.0,dog_bark
110,34621.wav,"15.617922,16.373887",1.0,drilling
111,200161.wav,"17.201086,24.033293",1.0,dog_bark
112,151005.flac,"21.705309,29.594003000000004",1.0,drilling
113,205874.wav,"20.612721,21.636955",1.0,drilling
114,27349.flac,"26.345256,39.673188",2.0,dog_bark
115,179862.wav,"0.324883,0.70578",1.0,car_horn
116,168037.wav,"173.664415,175.914261",1.0,drilling
117,175915.wav,"3.259606,19.941121",2.0,dog_bark
118,22347.mp3,"3.562067,13.387867000000002",1.0,dog_bark
119,20015.mp3,"84.946376,86.923406",2.0,dog_bark
120,7965.mp3,"6.212087,7.017358",2.0,dog_bark
121,180937.wav,"534.29791,579.343333",1.0,drilling
122,51027.wav,"38.059406,58.574257",2.0,dog_bark
123,180128.flac,"20.944075,24.861097",1.0,drilling
124,189846.wav,"28.159176,28.956887",2.0,dog_bark
125,59800.wav,"29.186686,35.691424",1.0,dog_bark
126,52633.wav,"0.0,35.552925",1.0,dog_bark
127,164311.wav,"1.001261,5.438042",1.0,dog_bark
128,103438.wav,"0.0,8.943686999999997",2.0,engine_idling
129,38121.wav,"0.05536,2.856996",1.0,dog_bark
130,170564.wav,"44.235644,117.050495",2.0,children_playing
131,52171.wav,"10.5892,10.990127",2.0,dog_bark
132,209672.wav,"17.021757,19.490962",1.0,dog_bark
133,9032.wav,"0.781671,1.403455",1.0,dog_bark
134,207214.aiff,"0.0,300.0",2.0,children_playing
135,69777.wav,"0.0,9.157308",2.0,dog_bark
136,205874.wav,"10.450393,12.402841",1.0,drilling
137,130030.wav,"0.0,2.594667",1.0,dog_bark
138,84699.wav,"29.682179,31.38479",1.0,drilling
139,194753.flac,"13.105882,13.858823999999998",2.0,dog_bark
140,51022.wav,"27.883122,28.95401",1.0,dog_bark
141,197073.wav,"0.0,0.6576",1.0,dog_bark
142,60846.wav,"0.0,10.34356",1.0,air_conditioner
143,175851.wav,"0.348692,1.791682",1.0,car_horn
144,23131.wav,"26.107336,27.328356",2.0,dog_bark
145,108187.wav,"15.751454,16.246588",2.0,dog_bark
146,95562.wav,"1.652092,4.4023949999999985",1.0,drilling
147,42324.wav,"2.509673,4.145074",1.0,drilling
148,77927.mp3,"29.236982,40.036228",2.0,dog_bark
149,144028.aiff,"4.918658,11.766021",1.0,dog_bark
150,65749.flac,"75.445545,136.237624",2.0,dog_bark
151,139948.aiff,"5.946136,8.939708",2.0,dog_bark
152,200161.wav,"29.679911,36.45183400000001",1.0,dog_bark
153,17853.wav,"15.323533,49.999322",1.0,engine_idling
154,34621.wav,"1.576268,2.444824",1.0,drilling
155,44110.wav,"16.802122,18.437973",1.0,dog_bark
156,100032.wav,"0.0,0.317551",1.0,dog_bark
157,34621.wav,"21.215282,21.826488",1.0,drilling
158,33641.wav,"8.283744,9.351237",1.0,dog_bark
159,4918.wav,"0.0,0.3744",1.0,dog_bark
160,49809.wav,"22.477792,23.791562",2.0,dog_bark
161,39533.wav,"1.133258,2.716735",1.0,drilling
162,180156.wav,"37.221566,37.432653",2.0,car_horn
163,156362.wav,"132.536049,138.714421",2.0,drilling
164,116485.wav,"0.0,18.785385",1.0,dog_bark
165,112075.mp3,"8.037355,16.601339000000007",2.0,engine_idling
166,71080.wav,"1.196632,2.628625",1.0,drilling
167,185436.mp3,"225.508316,226.923937",2.0,car_horn
168,185709.wav,"0.0,20.5",1.0,air_conditioner
169,72724.mp3,"2.607072,4.50651",1.0,dog_bark
170,203516.wav,"7.554407,9.492609",2.0,dog_bark
171,189989.flac,"0.0,9.139977",1.0,air_conditioner
172,167701.wav,"16.195316000000002,17.526438",1.0,drilling
173,9031.wav,"9.855845,11.581657",1.0,dog_bark
174,17913.wav,"9.512387,11.458753",1.0,drilling
175,151005.flac,"30.072797,38.75948",1.0,drilling
176,196062.wav,"0.0,2.413333",1.0,children_playing
177,205874.wav,"8.33791,9.058074",1.0,drilling
178,138468.wav,"0.289342,3.890508",2.0,car_horn
179,81791.aif,"44.484434,50.611033",2.0,dog_bark
180,132073.aiff,"8.310243,9.094228",2.0,car_horn
181,66622.wav,"0.0,20.536168",1.0,drilling
182,33641.wav,"5.316114,7.301651",1.0,dog_bark
183,201207.wav,"28.112549,30.467843",1.0,dog_bark
184,74950.mp3,"6.995644,8.761211",1.0,dog_bark
185,118072.wav,"0.0,1.066667",1.0,dog_bark
186,20841.flac,"7.756822,8.584532000000001",2.0,dog_bark
187,72220.wav,"62.007129000000006,64.203215",2.0,dog_bark
188,100795.mp3,"0.19179,4.463476",1.0,dog_bark
189,175849.wav,"0.035708,0.554668",1.0,car_horn
190,51022.wav,"6.520407,9.23766",2.0,dog_bark
191,190680.wav,"48.78964600000001,51.639943",2.0,dog_bark
192,58937.wav,"72.660613,105.950057",1.0,drilling
193,132073.aiff,"5.80149,7.787586",2.0,car_horn
194,23131.wav,"29.690066,30.396972",2.0,dog_bark
195,116400.flac,"12.269801,21.721944",1.0,dog_bark
196,65749.flac,"5.346535,47.524752",2.0,dog_bark
197,34871.wav,"17.869449,18.683119",1.0,dog_bark
198,204773.wav,"7.829952,8.753711000000001",1.0,dog_bark
199,59800.wav,"22.51268,24.374631",1.0,dog_bark
200,209864.wav,"1.580937,12.460501",1.0,engine_idling
201,39854.wav,"144.073254,157.993527",1.0,engine_idling
202,179866.wav,"0.14543499999999998,0.630933",1.0,car_horn
203,26256.flac,"17.625238,21.434969",2.0,dog_bark
204,159726.wav,"2.6068580000000003,4.466207",2.0,dog_bark
205,187356.wav,"64.42819,67.04572900000001",2.0,car_horn
206,204240.wav,"0.0,76.90297",1.0,air_conditioner
207,123685.wav,"3.845506,25.778503",1.0,engine_idling
208,43803.wav,"2.225494,2.404799",2.0,car_horn
209,22347.mp3,"14.420351,17.328512",1.0,dog_bark
210,113203.aif,"145.87588200000005,146.82705900000005",1.0,engine_idling
211,50415.wav,"0.0,6.098807",1.0,drilling
212,79089.wav,"9.664375,300.40099",2.0,air_conditioner
213,83488.wav,"3.788674,4.073956",1.0,car_horn
214,30832.mp3,"6.613635,7.6214270000000015",2.0,dog_bark
215,24076.wav,"38.856344,42.009706",1.0,car_horn
216,26177.wav,"2.164053,3.670195",2.0,car_horn
217,137971.aiff,"3.919268,29.798252",2.0,children_playing
218,76266.mp3,"0.0,190.693878",2.0,children_playing
219,110688.wav,"0.0,71.126508",2.0,dog_bark
220,118440.mp3,"7.115506,7.9491710000000015",1.0,drilling
221,104625.wav,"146.589168,192.135149",1.0,drilling
222,197075.wav,"58.951529,60.804292",2.0,dog_bark
223,52882.wav,"0.0,26.945306",1.0,children_playing
224,180256.wav,"0.0,10.88",1.0,dog_bark
225,135776.wav,"0.0,198.816375",2.0,children_playing
226,155320.wav,"0.084222,1.224028",1.0,dog_bark
227,59800.wav,"7.883064999999997,17.6039",1.0,dog_bark
228,31325.mp3,"20.609267000000006,28.868858000000003",1.0,dog_bark
229,155129.wav,"296.18928,298.38990099999995",2.0,car_horn
230,65381.wav,"0.8566860000000001,22.445174",1.0,dog_bark
231,7965.mp3,"103.253584,103.854342",1.0,dog_bark
232,9032.wav,"0.0,0.350864",1.0,dog_bark
233,208030.wav,"15.256437,17.270587",1.0,dog_bark
234,72538.wav,"2.101978,18.463667",1.0,dog_bark
235,143115.wav,"31.490771,32.698085",2.0,car_horn
236,201207.wav,"55.711765,59.184314",1.0,dog_bark
237,196083.wav,"0.0,4.467075",1.0,children_playing
238,50413.wav,"0.036027,10.381728",1.0,drilling
239,51022.wav,"19.015769,19.721354",2.0,dog_bark
240,30832.mp3,"294.716176,296.038903",2.0,dog_bark
241,180977.wav,"10.726049,26.209619",1.0,dog_bark
242,197075.wav,"74.531576,89.522108",2.0,dog_bark
243,81799.aif,"58.686207,61.371713",2.0,dog_bark
244,197080.wav,"0.0,20.164442",1.0,dog_bark
245,203128.mp3,"38.456384,42.819959",1.0,dog_bark
246,66587.mp3,"1.836262,2.35271",1.0,dog_bark
247,37869.flac,"15.902364000000002,18.108817",1.0,dog_bark
248,193697.wav,"0.0,284.9516040000001",2.0,children_playing
249,118440.mp3,"2.07242,2.853247",1.0,drilling
250,44110.wav,"28.613515000000003,30.582081",1.0,dog_bark
251,209992.wav,"543.038647,599.419708",2.0,engine_idling
252,203128.mp3,"21.903253,25.109533",1.0,dog_bark
253,167701.wav,"7.247219,8.393463",1.0,drilling
254,159726.wav,"1.237472,2.324186",2.0,dog_bark
255,201652.wav,"124.201485,137.355941",1.0,engine_idling
256,180134.flac,"0.0,9.847937",1.0,drilling
257,167702.wav,"60.11502900000001,63.048352",1.0,drilling
258,164797.wav,"34.169581,141.94966599999995",2.0,children_playing
259,132073.aiff,"10.871261,12.230169",2.0,car_horn
260,102103.wav,"1.97603,2.508892",2.0,dog_bark
261,181624.wav,"38.171107,40.455835",1.0,drilling
262,155283.wav,"95.455122,96.061195",2.0,car_horn
263,44831.mp3,"1.951541,7.691367",2.0,dog_bark
264,29937.wav,"0.0,47.487347",2.0,dog_bark
265,26255.flac,"0.7081,0.957431",2.0,dog_bark
266,197075.wav,"39.750174,41.097638",2.0,dog_bark
267,89211.wav,"0.0,1.892105",1.0,dog_bark
268,155311.wav,"0.0,3.691973",1.0,dog_bark
269,87275.wav,"1.613718,1.668236",2.0,car_horn
270,167750.wav,"6.617749000000001,9.117787",1.0,drilling
271,30832.mp3,"301.959682,305.046045",2.0,dog_bark
272,52171.wav,"13.041932,20.187873",2.0,dog_bark
273,89209.wav,"0.0,2.063492",1.0,dog_bark
274,155299.wav,"8.526258,18.064688",2.0,dog_bark
275,196075.wav,"0.0,3.4997050000000005",1.0,children_playing
276,171249.aiff,"13.294977,13.59818",2.0,car_horn
277,51022.wav,"44.136601,44.596982",1.0,dog_bark
278,72724.mp3,"19.702017,27.225282",1.0,dog_bark
279,58937.wav,"122.754824,138.279228",1.0,drilling
280,132073.aiff,"2.979144,4.128989",2.0,car_horn
281,85663.mp3,"0.0,2.089796",1.0,dog_bark
282,57596.wav,"0.591383,3.288668",2.0,dog_bark
283,54858.wav,"66.854743,67.739928",1.0,dog_bark
284,109711.aif,"12.001624,29.484876",1.0,dog_bark
285,4201.mp3,"0.804653,1.085731",2.0,dog_bark
286,7965.mp3,"115.424649,116.564911",2.0,dog_bark
287,127873.wav,"0.0,2.04075",1.0,air_conditioner
288,187356.wav,"48.998488,53.085522",2.0,car_horn
289,177621.flac,"0.0,299.590958",2.0,air_conditioner
290,164312.wav,"6.1822870000000005,8.171161999999999",1.0,dog_bark
291,72220.wav,"13.564059,16.738234",2.0,dog_bark
292,118496.wav,"1.394779,1.649762",2.0,car_horn
293,133494.wav,"0.0,103.594667",1.0,children_playing
294,180029.wav,"31.875172,32.794649",1.0,drilling
295,76086.mp3,"0.0,133.276735",1.0,drilling
296,180128.flac,"75.70244,80.258975",1.0,drilling
297,150341.wav,"12.834011,13.322652",1.0,dog_bark
298,12647.flac,"1.902224,3.102089",1.0,dog_bark
299,12647.flac,"5.238432,6.438297",1.0,dog_bark
300,14524.wav,"45.748852,46.598538",2.0,car_horn
301,72220.wav,"5.444078,8.489071000000001",2.0,dog_bark
302,30832.mp3,"11.085712,12.093504",2.0,dog_bark
303,51022.wav,"13.811453,14.201776999999998",1.0,dog_bark
304,209672.wav,"8.458342,9.036241",1.0,dog_bark
305,195451.wav,"2.249062,49.381587",1.0,engine_idling
306,70168.wav,"17.630392999999994,76.779274",2.0,dog_bark
307,161923.wav,"0.0,55.614051",1.0,dog_bark
308,34241.aif,"0.693691,1.988582",2.0,car_horn
309,85544.aif,"0.512155,2.247791",1.0,dog_bark
310,167701.wav,"4.104292,5.435414",1.0,drilling
311,33849.wav,"8.270967,10.162314",1.0,dog_bark
312,184575.mp3,"0.0,13.00898",1.0,dog_bark
313,111386.aif,"28.89025800000001,61.60671899999999",1.0,engine_idling
314,201652.wav,"258.809406,273.0",1.0,engine_idling
315,178520.wav,"0.0,99.67200000000001",1.0,children_playing
316,17486.wav,"1.799011,3.092953",1.0,dog_bark
317,178521.wav,"0.0,261.98400000000004",1.0,children_playing
318,175296.wav,"0.0,490.094292",1.0,children_playing
319,29721.wav,"0.0,32.658322",1.0,drilling
320,165567.aiff,"18.388235,20.251576",2.0,dog_bark
321,169466.wav,"157.140268,203.287355",2.0,drilling
322,85362.wav,"4.2755800000000015,9.012651",1.0,dog_bark
323,71700.wav,"8.156425,11.979749",2.0,dog_bark
324,33696.flac,"69.28994499999999,76.43788599999998",2.0,dog_bark
325,58937.wav,"48.013621,72.660613",1.0,drilling
326,175856.wav,"3.031496,4.156539",1.0,car_horn
327,201207.wav,"106.95451,109.702353",1.0,dog_bark
328,77751.wav,"46.034693,47.233702",1.0,drilling
329,168037.wav,"189.223875,191.047434",1.0,drilling
330,200161.wav,"7.8771330000000015,15.734171",1.0,dog_bark
331,201207.wav,"85.726667,87.78",1.0,dog_bark
332,196068.wav,"0.0,6.931066",1.0,children_playing
333,151359.wav,"5.038068,5.180168",1.0,car_horn
334,107842.wav,"1.157328,10.750972",1.0,drilling
335,9031.wav,"6.7577,9.055317",1.0,dog_bark
336,176638.wav,"6.7243520000000006,7.520133",1.0,car_horn
337,26255.flac,"5.305766,7.250547999999997",2.0,dog_bark
338,108362.wav,"0.0,65.60335400000001",1.0,children_playing
339,7965.mp3,"165.316496,167.94125",2.0,dog_bark
340,34621.wav,"18.754374,19.590761",1.0,drilling
341,66587.mp3,"3.077173,3.4286449999999995",1.0,dog_bark
342,191382.mp3,"28.636596,40.316835",1.0,dog_bark
343,110371.wav,"15.269745,22.577409",1.0,dog_bark
344,108187.wav,"24.911435,26.304000000000002",2.0,dog_bark
345,74677.mp3,"0.0,274.207347",2.0,air_conditioner
346,33849.wav,"3.233909,4.60587",1.0,dog_bark
347,165567.aiff,"29.347624,31.26",2.0,dog_bark
348,72265.wav,"72.974715,78.203888",2.0,dog_bark
349,167701.wav,"8.541364999999999,9.798536",1.0,drilling
350,85662.mp3,"0.0,1.227755",1.0,dog_bark
351,176638.wav,"0.0,9.557333",1.0,engine_idling
352,34621.wav,"25.059446,25.751074",1.0,drilling
353,46299.wav,"0.0,152.788367",2.0,children_playing
354,38236.flac,"26.29251,29.95475200000001",1.0,dog_bark
355,203128.mp3,"3.414972,5.302693",1.0,dog_bark
356,174873.wav,"121.73776,152.606978",1.0,dog_bark
357,65750.flac,"313.029703,479.524752",2.0,dog_bark
358,152588.wav,"5.4649160000000006,11.582721",1.0,dog_bark
359,125520.wav,"7.318297999999999,7.885858",1.0,car_horn
360,182800.wav,"1.405558,9.053446",1.0,children_playing
361,72567.mp3,"12.731619,15.941728",2.0,car_horn
362,32318.aif,"0.385559,6.468252",1.0,dog_bark
363,34931.wav,"0.233418,4.148033",1.0,dog_bark
364,51022.wav,"28.994044,30.104965000000004",2.0,dog_bark
365,108187.wav,"3.5587760000000004,4.7966120000000005",2.0,dog_bark
366,160575.wav,"15.901616,16.850537",2.0,dog_bark
367,12812.wav,"0.0,8.323084",1.0,engine_idling
368,180128.flac,"80.898489,86.89393000000004",1.0,drilling
369,104817.wav,"0.0,26.024508",1.0,drilling
370,180029.wav,"45.394877,48.051141",1.0,drilling
371,35296.mp3,"0.7994140000000001,1.751097",2.0,dog_bark
372,168037.wav,"346.926225,348.678737",1.0,drilling
373,104625.wav,"6.251409,144.93063",1.0,drilling
374,144028.aiff,"0.0,1.799509",1.0,dog_bark
375,43784.mp3,"2.739564,3.254543",1.0,dog_bark
376,94401.wav,"106.737529,107.836173",1.0,car_horn
377,190893.mp3,"0.0,60.029388",1.0,children_playing
378,58857.flac,"0.0,66.53458",2.0,children_playing
379,196079.wav,"0.0,2.391542",1.0,children_playing
380,34621.wav,"23.917456,24.96294",1.0,drilling
381,26255.flac,"31.405745,38.516667",2.0,dog_bark
382,129356.wav,"0.0,412.018367",2.0,children_playing
383,69883.wav,"1.6792080000000005,45.782178",2.0,dog_bark
384,72724.mp3,"29.79511,56.08929499999999",1.0,dog_bark
385,69661.mp3,"0.0,142.158367",1.0,dog_bark
386,19503.flac,"0.12673299999999998,4.087129",2.0,dog_bark
387,168037.wav,"291.9115740000001,293.900912",1.0,drilling
388,30832.mp3,"44.468823,55.93245699999999",2.0,dog_bark
389,205874.wav,"17.443995,18.804307",1.0,drilling
390,70168.wav,"6.9650940000000015,12.950721",2.0,dog_bark
391,103076.aif,"0.0,2.527184",1.0,dog_bark
392,344.wav,"7.939222999999997,9.623069",1.0,dog_bark
393,44831.mp3,"10.038318,11.313835",2.0,dog_bark
394,201988.wav,"1.671607,50.870035",1.0,engine_idling
395,33641.wav,"1.216942,3.074379",1.0,dog_bark
396,189981.flac,"0.0,38.791043",1.0,air_conditioner
397,54086.wav,"3.066229,4.353687",1.0,car_horn
398,160575.wav,"34.765015000000005,35.48389500000001",2.0,dog_bark
399,180937.wav,"0.0,46.689417",2.0,drilling
400,55020.wav,"0.351364,32.584376",1.0,drilling
401,167702.wav,"28.065751,30.492081",1.0,drilling
402,102858.wav,"0.0,6.282353",1.0,engine_idling
403,59595.mp3,"45.745538,52.035918",2.0,drilling
404,161010.wav,"123.329283,125.091034",2.0,car_horn
405,22882.flac,"0.0,7.660363999999999",1.0,engine_idling
406,24076.wav,"37.46937,38.460065",1.0,car_horn
407,7965.mp3,"184.59338,186.314531",2.0,dog_bark
408,186334.wav,"0.0,98.953447",1.0,children_playing
409,203128.mp3,"26.371176,26.940338",1.0,dog_bark
410,102842.flac,"0.0,98.013052",2.0,dog_bark
411,196059.wav,"0.0,6.8911789999999975",1.0,children_playing
412,51022.wav,"33.948152,34.248401",1.0,dog_bark
413,43786.mp3,"0.536063,1.142558",1.0,dog_bark
414,34621.wav,"21.955163,22.469863",1.0,drilling
415,41306.wav,"0.0,77.251701",2.0,dog_bark
416,189846.wav,"45.828461,47.583424",2.0,dog_bark
417,37869.flac,"26.358169,29.200716",1.0,dog_bark
418,201207.wav,"35.118039,41.066667",1.0,dog_bark
419,128465.ogg,"7.177949000000001,27.229624",2.0,car_horn
420,344.wav,"4.8839169999999985,5.409643",1.0,dog_bark
421,167702.wav,"21.257543,26.870693",1.0,drilling
422,9223.wav,"0.0,40.58394600000001",1.0,children_playing
423,100648.mp3,"16.699509,17.104837",2.0,car_horn
424,156358.wav,"5.5472160000000015,23.088",1.0,engine_idling
425,166101.wav,"13.703532,15.792038",1.0,engine_idling
426,72259.mp3,"44.887767,48.119686",2.0,car_horn
427,20285.flac,"8.837448,15.295583",1.0,dog_bark
428,165643.wav,"0.0,5.468254",1.0,drilling
429,72265.wav,"166.13579099999995,169.582955",2.0,dog_bark
430,72265.wav,"31.024479,33.127833",2.0,dog_bark
431,52171.wav,"9.321562,9.810929",2.0,dog_bark
432,179865.wav,"0.31516900000000003,1.648178",2.0,car_horn
433,206037.wav,"0.0,121.330068",2.0,children_playing
434,207962.wav,"0.4698350000000001,1.066165",1.0,dog_bark
435,187075.wav,"3.4467790000000003,24.034294",2.0,engine_idling
436,180156.wav,"15.796298,17.414627",2.0,car_horn
437,118496.wav,"1.963587,2.155369",2.0,car_horn
438,176783.wav,"53.119866,57.629549",1.0,dog_bark
439,51022.wav,"30.104965000000004,30.385197",1.0,dog_bark
440,205874.wav,"22.453142,23.893472",1.0,drilling
441,189846.wav,"26.404213,27.32158",2.0,dog_bark
442,44110.wav,"25.31408900000001,26.395413",1.0,dog_bark
443,71312.mp3,"166.815373,172.478858",2.0,dog_bark
444,180029.wav,"5.414693,8.649887",1.0,drilling
445,187356.wav,"79.720127,81.41923100000002",2.0,car_horn
446,118440.mp3,"4.591028,5.565594",1.0,drilling
447,29936.wav,"10.936539,13.11424",2.0,dog_bark
448,58937.wav,"32.409194,40.57151",1.0,drilling
449,151359.wav,"9.100818,9.255836",1.0,car_horn
450,42324.wav,"0.0,2.036538",1.0,drilling
451,7389.mp3,"0.0,19.091753",2.0,car_horn
452,196070.wav,"0.0,14.102041",1.0,children_playing
453,167701.wav,"34.831022,36.864681",1.0,drilling
454,59037.mp3,"0.0,19.951171",2.0,children_playing
455,70098.wav,"4.072417,6.626475",1.0,dog_bark
456,175917.wav,"0.0,28.394047",2.0,dog_bark
457,166931.wav,"14.031753,30.264565",1.0,drilling
458,72259.mp3,"268.249294,301.28669",2.0,car_horn
459,128470.wav,"1.711988,24.804376",1.0,dog_bark
460,50885.wav,"0.0,15.344626000000002",1.0,dog_bark
461,35628.mp3,"0.689299,6.213006",1.0,dog_bark
462,196074.wav,"0.0,2.194671",1.0,children_playing
463,155309.wav,"0.0,1.219048",1.0,dog_bark
464,70098.wav,"8.225276,10.467619",1.0,dog_bark
465,165785.wav,"5.132783,6.416934",1.0,drilling
466,47926.wav,"4.908519999999998,6.075657",1.0,dog_bark
467,175855.wav,"0.16530899999999998,0.712897",1.0,car_horn
468,58937.wav,"1.200341,32.409194",1.0,drilling
469,7389.mp3,"78.753483,90.577353",2.0,car_horn
470,204067.wav,"0.0,93.595562",1.0,children_playing
471,99500.wav,"0.0,113.260204",2.0,children_playing
472,54858.wav,"36.898228,64.385543",1.0,dog_bark
473,151977.wav,"0.466587,31.121383",1.0,air_conditioner
474,169466.wav,"0.0,39.113516",2.0,drilling
475,104625.wav,"194.176426,219.819961",1.0,drilling
476,200161.wav,"98.062264,100.895621",1.0,dog_bark
477,51022.wav,"14.201776999999998,15.292682",2.0,dog_bark
478,162702.wav,"0.0,0.105962",1.0,car_horn
479,167701.wav,"5.657268,6.766536",1.0,drilling
480,147764.wav,"23.400529,24.595101",1.0,drilling
481,34643.wav,"28.965721,38.96",1.0,drilling
482,161010.wav,"147.12408100000005,148.444179",2.0,car_horn
483,52171.wav,"0.0,1.01411",1.0,dog_bark
484,7965.mp3,"93.490738,94.631",1.0,dog_bark
485,6984.mp3,"6.005781,6.444256",2.0,car_horn
486,153261.wav,"0.0,11.145578",1.0,air_conditioner
487,142003.wav,"0.0,70.0",1.0,children_playing
488,165567.aiff,"12.111718,14.759624",2.0,dog_bark
489,34871.wav,"46.3792,56.174537",1.0,dog_bark
490,36902.wav,"1.192238,1.99831",1.0,dog_bark
491,29936.wav,"7.862139,10.071864",2.0,dog_bark
492,127443.wav,"115.015008,144.858073",1.0,drilling
493,43802.wav,"2.425507,2.627632",1.0,car_horn
494,166942.wav,"0.0,34.8",1.0,air_conditioner
495,95562.wav,"8.795241,16.711911999999998",1.0,drilling
496,46391.wav,"98.480072,99.570989",2.0,car_horn
497,89212.wav,"0.0,1.324626",1.0,dog_bark
498,61503.wav,"0.0,27.876644",1.0,children_playing
499,47926.wav,"6.593779,7.433681",1.0,dog_bark
500,26256.flac,"24.993508,28.384587",2.0,dog_bark
501,51027.wav,"0.0,24.594059",2.0,dog_bark
502,58202.wav,"0.0,1.455435",1.0,car_horn
503,17578.wav,"0.0,75.46775500000003",1.0,engine_idling
504,99812.wav,"181.142431,183.284976",2.0,car_horn
505,174873.wav,"29.999662,32.825718",1.0,dog_bark
506,76640.wav,"0.095334,4.699157",1.0,dog_bark
507,199929.wav,"3.013303,5.793434",1.0,drilling
508,15544.wav,"29.26666,72.176",1.0,engine_idling
509,172593.wav,"0.0,64.829887",1.0,children_playing
510,200161.wav,"56.807791,58.41536899999999",1.0,dog_bark
511,41918.wav,"0.525781,8.018162",1.0,dog_bark
512,185800.mp3,"7.019837,8.327131",2.0,drilling
513,54545.wav,"0.826371,9.726796",1.0,dog_bark
514,200161.wav,"2.109946,6.932681",1.0,dog_bark
515,169466.wav,"62.959037,93.151927",2.0,drilling
516,165645.wav,"5.4029669999999985,6.416511",1.0,drilling
517,180134.flac,"10.481716,39.781767",1.0,drilling
518,107842.wav,"11.634196,13.385417000000002",1.0,drilling
519,203128.mp3,"0.540704,1.811833",1.0,dog_bark
520,204765.wav,"24.327782,26.496128",2.0,car_horn
521,19026.wav,"0.012822,1.050575",1.0,car_horn
522,165645.wav,"0.8888,1.7659049999999998",1.0,drilling
523,95549.wav,"11.181689,60.975146",2.0,dog_bark
524,196081.wav,"0.0,2.939683",1.0,children_playing
525,180128.flac,"42.767482,51.800613",1.0,drilling
526,128030.wav,"3.851144,4.430814",1.0,dog_bark
527,72265.wav,"84.30945899999998,94.18354",2.0,dog_bark
528,171464.wav,"3.961007,8.19862",1.0,dog_bark
529,175917.wav,"265.260176,281.200694",2.0,dog_bark
530,85574.aif,"0.0,34.0",2.0,dog_bark
531,180029.wav,"23.32745,24.34909",1.0,drilling
532,71086.wav,"0.280432,3.78082",1.0,drilling
533,72265.wav,"0.204493,2.6584060000000003",2.0,dog_bark
534,201207.wav,"76.667843,78.992941",1.0,dog_bark
535,184355.wav,"4.08756,4.750408",2.0,car_horn
536,7913.flac,"7.00735,7.704826",1.0,dog_bark
537,7965.mp3,"44.110933,45.299666",2.0,dog_bark
538,49809.wav,"25.207971,29.498253",2.0,dog_bark
539,26255.flac,"15.927270000000002,17.632695000000005",2.0,dog_bark
540,168037.wav,"38.673666,40.236716",1.0,drilling
541,34621.wav,"13.51087,14.041654",1.0,drilling
542,95532.wav,"2.56279,7.732233",1.0,dog_bark
543,108187.wav,"10.954842,12.594974",2.0,dog_bark
544,180156.wav,"11.856019,12.454097",2.0,car_horn
545,39847.wav,"44.875273,47.679977",1.0,engine_idling
546,77509.mp3,"2.967344,3.5573080000000004",2.0,car_horn
547,180052.wav,"0.0,20.508000000000006",1.0,dog_bark
548,13577.mp3,"38.673122,39.818992",2.0,dog_bark
549,20285.flac,"1.940273,7.775255",1.0,dog_bark
550,166931.wav,"37.418008,71.259295",1.0,drilling
551,76566.wav,"231.533648,236.549592",2.0,dog_bark
552,180977.wav,"0.0,3.979018",1.0,dog_bark
553,27349.flac,"0.0,22.533242",2.0,dog_bark
554,71529.wav,"9.554708,26.470748",1.0,drilling
555,74922.wav,"0.0,18.005333",1.0,drilling
556,201207.wav,"25.123137,27.418039",1.0,dog_bark
557,205874.wav,"24.837688,25.461831",1.0,drilling
558,127872.wav,"0.0,2.498417",1.0,air_conditioner
559,180126.flac,"32.233428,38.002941",1.0,drilling
560,58382.wav,"0.224342,6.021178",1.0,dog_bark
561,158597.wav,"1.168347,177.004603",2.0,children_playing
562,43787.mp3,"11.969077,12.388657",1.0,dog_bark
563,118101.wav,"1.042871,18.250235",1.0,dog_bark
564,50629.mp3,"0.0,6.140703",1.0,drilling
565,83488.wav,"2.859771,3.44077",1.0,car_horn
566,196072.wav,"0.0,2.985714",1.0,children_playing
567,203355.wav,"47.291863,48.250863",2.0,dog_bark
568,116163.wav,"0.764195,1.036249",2.0,dog_bark
569,66587.mp3,"7.811285000000002,8.299042",1.0,dog_bark
570,4912.wav,"2.370148,2.646139",1.0,dog_bark
571,72579.mp3,"3.486718,15.950109",1.0,dog_bark
572,77674.wav,"0.130222,5.011307",1.0,dog_bark
573,59277.mp3,"0.0,19.100528",1.0,air_conditioner
574,116485.wav,"45.905436,54.58558000000001",1.0,dog_bark
575,155488.aiff,"196.635567,216.066794",2.0,dog_bark
576,174994.wav,"27.743475,40.518821",1.0,dog_bark
577,118964.wav,"0.0,1.103896",1.0,dog_bark
578,103199.mp3,"46.186699,48.720146",1.0,drilling
579,209672.wav,"37.72105300000001,39.559823",1.0,dog_bark
580,165641.wav,"0.0,7.515917999999999",1.0,drilling
581,34871.wav,"64.342534,80.490758",2.0,dog_bark
582,34621.wav,"23.241913,23.804866",1.0,drilling
583,168846.mp3,"67.019979,100.882156",2.0,engine_idling
584,103199.mp3,"50.591,51.916188",1.0,drilling
585,209992.wav,"108.409901,390.710866",1.0,engine_idling
586,200161.wav,"63.619903,66.011176",1.0,dog_bark
587,33696.flac,"27.30384500000001,29.428908000000003",2.0,dog_bark
588,113202.aif,"0.0,60.0",1.0,engine_idling
589,201207.wav,"67.276863,69.51137299999999",1.0,dog_bark
590,147764.wav,"7.641991,15.709446",1.0,drilling
591,95404.aif,"35.40120800000001,55.103432",2.0,dog_bark
592,207124.wav,"6.8460300000000025,12.050252",1.0,dog_bark
593,194753.flac,"0.0,0.752941",2.0,dog_bark
594,200161.wav,"24.736608,26.705891",1.0,dog_bark
595,14468.flac,"24.027429,26.173669",1.0,dog_bark
596,175856.wav,"0.287145,0.555461",1.0,car_horn
597,71700.wav,"1.860684,6.550629",2.0,dog_bark
598,179864.wav,"0.362889,1.166566",1.0,car_horn
599,176634.wav,"2.441912,2.70793",1.0,car_horn
600,7965.mp3,"97.793614,98.485871",2.0,dog_bark
601,200161.wav,"94.565782,96.756107",1.0,dog_bark
602,72265.wav,"99.938551,104.2329",2.0,dog_bark
603,180156.wav,"31.029699,31.645367",2.0,car_horn
604,118558.mp3,"31.128617,39.703398",1.0,engine_idling
605,144351.wav,"10.595206,17.306910000000002",1.0,drilling
606,70098.wav,"0.13072,2.272509",1.0,dog_bark
607,4911.wav,"0.008108,0.217438",1.0,dog_bark
608,103199.mp3,"0.0,16.097136",1.0,drilling
609,165640.wav,"0.0,8.740771",1.0,drilling
610,33641.wav,"20.944208,23.228643",1.0,dog_bark
611,201207.wav,"8.907843,10.719608",1.0,dog_bark
612,49809.wav,"10.469108,13.466147",2.0,dog_bark
613,71080.wav,"3.1489,4.142377",1.0,drilling
614,72265.wav,"122.578825,124.974312",2.0,dog_bark
615,160094.wav,"0.120695,0.31345300000000004",1.0,dog_bark
616,187110.wav,"0.0,73.48922900000002",1.0,children_playing
617,180156.wav,"17.977524,21.882622",2.0,car_horn
618,203128.mp3,"43.294261,48.141625",1.0,dog_bark
619,201652.wav,"0.0,10.94703",1.0,engine_idling
620,146249.wav,"0.0,1.0997709999999998",1.0,drilling
621,34621.wav,"16.373887,16.952925",1.0,drilling
622,155315.wav,"0.0,4.527891",1.0,dog_bark
623,209992.wav,"42.137425,71.61384",2.0,engine_idling
624,71700.wav,"129.865574,140.11208200000002",2.0,dog_bark
625,63261.wav,"0.0,7.015917999999999",1.0,dog_bark
626,155263.wav,"0.0,151.486984",2.0,children_playing
627,17810.wav,"2.152361,2.770263",1.0,dog_bark
628,15356.aif,"0.0,12.694717",1.0,children_playing
629,116483.wav,"17.555332999999994,25.880754",1.0,dog_bark
630,167702.wav,"47.54881500000001,53.705173",1.0,drilling
631,14110.wav,"0.0,8.615783",1.0,drilling
632,185436.mp3,"161.94696399999995,164.636643",2.0,car_horn
633,185436.mp3,"84.79565699999998,85.786591",2.0,car_horn
634,197073.wav,"6.653364999999999,7.610753",1.0,dog_bark
635,43802.wav,"1.111691,1.2936040000000002",1.0,car_horn
636,50629.mp3,"73.171322,79.63521999999998",1.0,drilling
637,72259.mp3,"143.281751,191.580988",2.0,car_horn
638,197073.wav,"41.4288,42.860047",1.0,dog_bark
639,72221.flac,"66.415842,78.415842",2.0,dog_bark
640,39532.wav,"0.01157,1.093407",1.0,drilling
641,102547.aif,"0.0,21.004854",1.0,dog_bark
642,201207.wav,"91.192157,93.487059",1.0,dog_bark
643,134717.wav,"0.0,60.0",1.0,air_conditioner
644,197075.wav,"46.066409,53.730108",2.0,dog_bark
645,76085.mp3,"0.0,220.630204",1.0,drilling
646,192269.wav,"0.0,116.011255",1.0,children_playing
647,27070.wav,"0.0,23.719184",2.0,children_playing
648,31325.mp3,"0.476515,3.1370560000000003",1.0,dog_bark
649,117536.wav,"31.064967,31.640588",2.0,car_horn
650,26185.wav,"0.007625,0.340057",1.0,car_horn
651,196058.wav,"0.0,2.797256",1.0,children_playing
652,34871.wav,"105.401583,107.185399",2.0,dog_bark
653,190894.mp3,"0.0,20.58449",1.0,children_playing
654,185436.mp3,"191.391867,195.214042",2.0,car_horn
655,30204.wav,"0.286916,32.086759",1.0,air_conditioner
656,67049.wav,"0.074989,8.07575",1.0,dog_bark
657,177742.flac,"0.0,449.69925",2.0,air_conditioner
658,144885.mp3,"0.0,0.261224",1.0,dog_bark
659,35382.wav,"0.997525,7.504455",1.0,air_conditioner
660,164626.wav,"0.811901,1.586686",1.0,car_horn
661,179868.wav,"0.232419,2.385632",1.0,car_horn
662,175917.wav,"303.367976,308.847529",2.0,dog_bark
663,203128.mp3,"10.842537,11.715253",1.0,dog_bark
664,116163.wav,"2.1397470000000003,3.258529",1.0,dog_bark
665,42371.wav,"10.54093,11.538045",2.0,dog_bark
666,177756.flac,"0.0,43.072182",1.0,children_playing
667,201207.wav,"4.982353,6.763922",1.0,dog_bark
668,118962.wav,"0.0,2.129854",1.0,dog_bark
669,179212.wav,"0.0,5.813313",1.0,drilling
670,146845.wav,"0.0,78.866576",1.0,air_conditioner
671,39532.wav,"1.741352,3.326502",1.0,drilling
672,50223.wav,"2.308086,27.295631",2.0,dog_bark
673,4201.mp3,"3.968154,4.976726",2.0,dog_bark
674,147019.wav,"0.688099,4.5951",1.0,drilling
675,128030.wav,"0.6729510000000001,1.359227",1.0,dog_bark
676,160016.wav,"0.0,91.011542",2.0,children_playing
677,74950.mp3,"30.481018,35.511219",1.0,dog_bark
678,194753.flac,"2.917647,4.729412",2.0,dog_bark
679,174873.wav,"241.301632,277.170794",1.0,dog_bark
680,7965.mp3,"113.940157,114.854518",2.0,dog_bark
681,125574.wav,"0.0,1.45068",1.0,dog_bark
682,9031.wav,"0.041586,4.87594",1.0,dog_bark
683,33696.flac,"10.303338,14.746652",2.0,dog_bark
684,190680.wav,"28.193153,32.493384000000006",2.0,dog_bark
685,164312.wav,"25.711605,27.412932",1.0,dog_bark
686,201207.wav,"32.098431,34.302745",1.0,dog_bark
687,203128.mp3,"27.224919,30.658863",1.0,dog_bark
688,18594.flac,"77.17582800000002,77.611488",1.0,car_horn
689,196057.wav,"0.0,4.927664",1.0,children_playing
690,77927.mp3,"53.666984,61.042078",2.0,dog_bark
691,167702.wav,"1.195058,6.8082080000000005",1.0,drilling
692,203128.mp3,"19.607633,21.40998",1.0,dog_bark
693,164312.wav,"22.380838,24.058202",1.0,dog_bark
694,44110.wav,"7.846536,9.759649",1.0,dog_bark
695,18933.wav,"25.63924200000001,25.944262",2.0,car_horn
696,29932.wav,"280.466103,281.910451",2.0,car_horn
697,197075.wav,"97.522673,105.102155",2.0,dog_bark
698,176787.wav,"0.0,65.63399799999999",1.0,engine_idling
699,105415.aif,"0.0,54.995146",1.0,children_playing
700,185800.mp3,"0.0,7.019837",1.0,drilling
701,113205.aif,"27.04,51.0",1.0,engine_idling
702,113216.aif,"2.693333,15.618693",1.0,engine_idling
703,36902.wav,"2.286997,5.293835",1.0,dog_bark
704,123399.wav,"0.0,266.848345",1.0,children_playing
705,46391.wav,"55.73595200000001,61.488061",2.0,car_horn
706,161922.wav,"73.295375,75.17009200000003",2.0,dog_bark
707,51022.wav,"5.099229,6.1501",2.0,dog_bark
708,137815.wav,"0.206472,25.986032",1.0,drilling
709,144068.wav,"22.794739,64.036087",1.0,engine_idling
710,185436.mp3,"18.261502,19.677122",2.0,car_horn
711,199261.wav,"0.211116,12.569501",1.0,dog_bark
712,26184.wav,"11.220864,13.819592000000002",1.0,engine_idling
713,130961.wav,"263.820677,271.537881",1.0,drilling
714,147764.wav,"5.449214,6.103774",1.0,drilling
715,183989.ogg,"15.176471,35.764706",2.0,dog_bark
716,180128.flac,"128.542263,135.097279",1.0,drilling
717,87275.wav,"1.337496,1.482876",2.0,car_horn
718,196088.wav,"0.0,2.140295",1.0,children_playing
719,47019.wav,"0.0,152.672154",1.0,children_playing
720,34241.aif,"3.653441,5.08707",2.0,car_horn
721,100648.mp3,"8.998279,10.052132",2.0,car_horn
722,203128.mp3,"12.644884,13.062269",1.0,dog_bark
723,118278.wav,"0.0,30.000021000000004",2.0,drilling
724,178825.wav,"0.0,273.965062",1.0,children_playing
725,81799.aif,"29.935495,37.676071",2.0,dog_bark
726,159176.wav,"0.0,1.184218",1.0,dog_bark
727,196069.wav,"0.0,3.1481630000000003",1.0,children_playing
728,189985.flac,"0.0,17.639955",1.0,air_conditioner
729,71439.mp3,"0.760605,2.143523",1.0,car_horn
730,69598.wav,"60.201304,65.315492",1.0,drilling
731,71309.mp3,"0.406025,21.023056",2.0,car_horn
732,82024.wav,"22.651009,42.872454",2.0,dog_bark
733,42101.wav,"69.97537,71.293747",2.0,car_horn
734,11722.wav,"0.08734299999999999,1.345883",1.0,dog_bark
735,175848.wav,"0.094818,0.632591",1.0,car_horn
736,14113.wav,"0.0,7.546485",1.0,drilling
737,178118.wav,"3.3739410000000003,4.1311849999999986",2.0,dog_bark
738,105319.mp3,"0.0,120.97306100000002",2.0,dog_bark
739,9674.flac,"1.062597,9.933544",1.0,car_horn
740,9032.wav,"1.798732,2.726967",1.0,dog_bark
741,7965.mp3,"181.620473,182.949808",2.0,dog_bark
742,202516.wav,"0.0,26.632396000000004",1.0,air_conditioner
743,74950.mp3,"0.33312600000000003,4.363949",1.0,dog_bark
744,18453.wav,"9.13085,9.937155",2.0,dog_bark
745,44110.wav,"11.31232,14.500842",1.0,dog_bark
746,28808.wav,"27.28857,33.414286",2.0,car_horn
747,71439.mp3,"58.255433,58.808601",2.0,car_horn
748,31840.wav,"0.020035,3.546214",1.0,dog_bark
749,73168.wav,"0.067329,0.724461",1.0,car_horn
750,34621.wav,"20.427148000000006,21.086607",1.0,drilling
751,192124.mp3,"0.0,34.742857",1.0,children_playing
752,125523.wav,"0.0,33.061854",1.0,dog_bark
753,100852.mp3,"0.0,64.70530600000001",1.0,air_conditioner
754,121285.wav,"0.0,22.933271",1.0,air_conditioner
755,44278.wav,"6.453018,7.489103999999997",2.0,car_horn
756,33641.wav,"15.329196,16.31129",1.0,dog_bark
757,102103.wav,"4.1796370000000005,4.568182",2.0,dog_bark
758,82811.wav,"44.333896,49.914936",1.0,dog_bark
759,59513.wav,"0.156569,19.571163",1.0,dog_bark
760,72829.mp3,"0.0,8.646531",1.0,dog_bark
761,19503.flac,"23.112871,23.809901",2.0,dog_bark
762,167701.wav,"57.82985,60.196289",1.0,drilling
763,7975.mp3,"173.049526,177.65945200000004",2.0,dog_bark
764,33641.wav,"14.368453,14.8168",1.0,dog_bark
765,30832.mp3,"129.56426100000002,131.705819",2.0,dog_bark
766,77751.wav,"15.914124,19.729154",1.0,drilling
767,70098.wav,"13.373615,14.459593",1.0,dog_bark
768,62461.wav,"10.039159,21.525404",1.0,air_conditioner
769,186935.wav,"0.0,6.067415",1.0,engine_idling
770,54187.wav,"0.189361,13.584563",1.0,car_horn
771,97193.mp3,"0.0,19.617959",1.0,dog_bark
772,201207.wav,"102.48549,105.41451",1.0,dog_bark
773,207369.wav,"34.995645,35.947188",1.0,dog_bark
774,72265.wav,"37.130049,40.226654",2.0,dog_bark
775,7965.mp3,"3.08048,4.93388",2.0,dog_bark
776,30832.mp3,"312.352537,313.864225",2.0,dog_bark
777,57105.flac,"178.452055,188.591993",2.0,dog_bark
778,155129.wav,"13.299687,13.403296",1.0,car_horn
779,105088.wav,"0.0,52.51752800000001",1.0,dog_bark
780,118963.wav,"0.0,0.519479",1.0,dog_bark
781,157695.mp3,"0.0,59.428571",1.0,dog_bark
782,193699.wav,"0.0,241.975292",2.0,children_playing
783,103076.aif,"6.788349,7.756796",1.0,dog_bark
784,33696.flac,"23.053718,24.72801",2.0,dog_bark
785,51022.wav,"0.0,1.611336",2.0,dog_bark
786,116485.wav,"27.595083,42.277913",1.0,dog_bark
787,141240.flac,"0.0,3.053869",1.0,engine_idling
788,82368.wav,"0.0,69.0",1.0,children_playing
789,169045.wav,"0.0,45.461333",1.0,children_playing
790,174032.wav,"0.0,59.217333",1.0,children_playing
791,166489.wav,"0.0,15.261001",1.0,dog_bark
792,7965.mp3,"54.617797,56.522326",2.0,dog_bark
793,61077.wav,"36.017445,39.71064000000001",1.0,dog_bark
794,34871.wav,"14.520883,16.054339000000002",1.0,dog_bark
795,58005.wav,"5.0652610000000005,180.06526100000005",1.0,drilling
796,20841.flac,"0.61487,2.766915",2.0,dog_bark
797,84359.wav,"0.0,22.082653",2.0,children_playing
798,26177.wav,"0.0,0.246102",2.0,car_horn
799,50414.wav,"0.074114,6.9379339999999985",1.0,drilling
800,72567.mp3,"49.13099,50.273571",2.0,car_horn
801,103199.mp3,"44.159941,46.186699",2.0,drilling
802,207211.wav,"0.0,300.0",1.0,children_playing
803,44110.wav,"5.517529,6.0720540000000005",1.0,dog_bark
804,29936.wav,"16.941228,19.022853",2.0,dog_bark
805,115537.wav,"1.665407,2.340997",1.0,dog_bark
806,138015.mp3,"0.0,23.353469",1.0,dog_bark
807,17009.wav,"0.0,33.671315",1.0,children_playing
808,196082.wav,"0.0,3.315397",1.0,children_playing
809,18592.mp3,"6.504182,19.991971",1.0,engine_idling
810,156362.wav,"124.563955,126.556979",2.0,drilling
811,30344.wav,"0.391161,18.3266",1.0,dog_bark
812,118440.mp3,"0.909986,1.726039",1.0,drilling
813,203355.wav,"42.985765,44.114",2.0,dog_bark
814,51022.wav,"19.916516,21.377728",2.0,dog_bark
815,34621.wav,"10.519177,11.017793",1.0,drilling
816,38231.flac,"26.338291,28.982059000000003",1.0,dog_bark
817,180029.wav,"37.766631,41.819137",1.0,drilling
818,77751.wav,"7.339391,15.260119",1.0,drilling
819,37869.flac,"18.844301,19.778565",1.0,dog_bark
820,162148.wav,"0.0,0.452781",1.0,dog_bark
821,83502.wav,"0.0,31.602086",2.0,air_conditioner
822,72567.mp3,"54.68066999999999,74.648636",2.0,car_horn
823,18581.mp3,"40.693758,56.161069",2.0,dog_bark
824,183894.flac,"102.156872,103.321053",2.0,car_horn
825,7965.mp3,"92.74672,93.462517",2.0,dog_bark
826,7965.mp3,"108.954389,110.833354",2.0,dog_bark
827,103199.mp3,"17.617205,44.159941",1.0,drilling
828,147672.mp3,"1.726745,2.188385",1.0,dog_bark
829,28284.mp3,"18.749465,19.909404",1.0,dog_bark
830,72015.wav,"0.0,15.29644",2.0,children_playing
831,518.wav,"0.242743,10.41195",1.0,drilling
832,180156.wav,"13.386395000000002,14.600142000000002",2.0,car_horn
833,107228.wav,"3.134753,22.612274",1.0,engine_idling
834,85661.mp3,"0.0,1.149388",1.0,dog_bark
835,203356.wav,"37.465647,47.807529",2.0,dog_bark
836,144068.wav,"89.564877,92.331868",1.0,engine_idling
837,175854.wav,"0.060186,0.751776",1.0,car_horn
838,57696.wav,"0.0,15.628481",1.0,drilling
839,110918.wav,"0.0,120.999979",1.0,dog_bark
840,69962.wav,"0.0,60.0",1.0,children_playing
841,137803.wav,"0.0,9.984",1.0,dog_bark
842,107090.wav,"29.715744,30.54502",2.0,car_horn
843,106487.aiff,"0.0,9.793379",1.0,engine_idling
844,77751.wav,"34.407934999999995,38.295632",1.0,drilling
845,160575.wav,"14.348836,14.780164",2.0,dog_bark
846,155314.wav,"0.0,71.971626",1.0,dog_bark
847,49809.wav,"1.416409,6.548325",2.0,dog_bark
848,7965.mp3,"99.150539,99.891899",2.0,dog_bark
849,50416.wav,"0.058704999999999986,9.083189",1.0,drilling
850,152588.wav,"19.65919,22.464192",1.0,dog_bark
851,155488.aiff,"78.992161,85.32843100000002",2.0,dog_bark
852,57584.wav,"0.0,21.097959",2.0,drilling
853,99812.wav,"253.20985,255.741948",2.0,car_horn
854,117271.wav,"0.0,10.538413",1.0,dog_bark
855,19496.flac,"41.420638,48.43578400000001",2.0,dog_bark
856,9031.wav,"5.55171,5.967569",1.0,dog_bark
857,122199.aiff,"14.647059,32.223529",2.0,dog_bark
858,143115.wav,"26.862734000000003,27.466391",2.0,car_horn
859,34621.wav,"11.677252,12.191951",1.0,drilling
860,182800.wav,"21.083366,23.687782",1.0,children_playing
861,152588.wav,"15.645137,17.893974",1.0,dog_bark
862,146343.wav,"0.0,5.865929",1.0,dog_bark
863,166931.wav,"0.0,8.804236999999997",1.0,drilling
864,65745.flac,"0.0,411.881188",2.0,dog_bark
865,57105.flac,"232.256082,244.11764",2.0,dog_bark
866,33641.wav,"9.970383,10.440079",1.0,dog_bark
867,177729.flac,"0.0,264.264",2.0,air_conditioner
868,66115.wav,"16.711448,24.153978",2.0,car_horn
869,43786.mp3,"2.926828,3.314202",1.0,dog_bark
870,201207.wav,"81.106667,82.797647",1.0,dog_bark
871,26256.flac,"12.015305,15.741305",2.0,dog_bark
872,31323.mp3,"0.492016,54.954391",2.0,dog_bark
873,344.wav,"0.213338,0.8609709999999999",1.0,dog_bark
874,114587.wav,"1.467612,19.59418",1.0,dog_bark
875,74965.wav,"17.950435,27.423837",1.0,drilling
876,95562.wav,"4.679335,8.718843",1.0,drilling
877,49312.aif,"0.0,43.71093",1.0,children_playing
878,54858.wav,"28.04638,34.056319",2.0,dog_bark
879,121286.wav,"0.0,34.406667",1.0,air_conditioner
880,181725.mp3,"0.0,82.186165",1.0,dog_bark
881,7965.mp3,"117.569506,118.566508",2.0,dog_bark
882,201652.wav,"38.967822,44.193564",1.0,engine_idling
883,143115.wav,"58.001372,58.35350500000001",2.0,car_horn
884,39856.wav,"0.0,61.07204",1.0,engine_idling
885,187356.wav,"23.052709,24.338518",2.0,car_horn
886,180029.wav,"26.494534,28.708088",1.0,drilling
887,175856.wav,"0.932044,1.230957",1.0,car_horn
888,162540.wav,"1.2556200000000002,1.618235",1.0,car_horn
889,155313.wav,"2.249546,3.021266",1.0,dog_bark
890,201207.wav,"148.323137,153.214902",1.0,dog_bark
891,175915.wav,"183.880149,196.34335",2.0,dog_bark
892,118558.mp3,"19.743613,28.606622",1.0,engine_idling
893,24965.wav,"1.304201,1.857676",1.0,dog_bark
894,30226.aiff,"5.195936,20.273549",1.0,dog_bark
895,175853.wav,"0.077038,0.360623",1.0,car_horn
896,45256.aiff,"0.0,0.275708",2.0,car_horn
897,68657.wav,"0.104608,0.853333",2.0,car_horn
898,81791.aif,"55.805323,57.13719200000001",2.0,dog_bark
899,34621.wav,"12.851411,13.382195",1.0,drilling
900,203128.mp3,"30.896014,36.426372",1.0,dog_bark
901,63095.wav,"9.99398,72.89726800000003",1.0,drilling
902,26186.wav,"0.0,0.392109",1.0,car_horn
903,175852.wav,"0.099252,1.234139",1.0,car_horn
904,208030.wav,"11.107889,14.985879",1.0,dog_bark
905,139000.wav,"0.0,8.298073",1.0,drilling
906,103199.mp3,"48.720146,50.591",2.0,drilling
907,86279.wav,"0.601813,4.083229",1.0,dog_bark
908,160575.wav,"6.096099,7.303816",2.0,dog_bark
909,33641.wav,"17.74173,19.385669",1.0,dog_bark
910,108187.wav,"34.318984,37.04222100000001",2.0,dog_bark
911,204773.wav,"1.935494,3.870988",1.0,dog_bark
912,197073.wav,"9.709271,20.55",1.0,dog_bark
913,167702.wav,"13.761272,16.730809",1.0,drilling
914,147764.wav,"24.676921,25.364209",1.0,drilling
915,63095.wav,"79.853862,160.687527",1.0,drilling
916,201207.wav,"51.544706,52.99411800000001",1.0,dog_bark
917,14358.wav,"0.0,283.02678",2.0,dog_bark
918,201207.wav,"11.776471,14.373333",1.0,dog_bark
919,96158.aif,"0.0,1.092817",1.0,drilling
920,59800.wav,"0.0,3.506271",1.0,dog_bark
921,196060.wav,"0.0,1.501723",1.0,children_playing
922,72220.wav,"28.733661,46.892891",2.0,dog_bark
923,201652.wav,"71.448515,86.810396",1.0,engine_idling
924,18594.flac,"12.833291,13.464541",1.0,car_horn
925,203962.flac,"0.0,7.561066",1.0,engine_idling
926,174873.wav,"3.912999,8.043388",1.0,dog_bark
927,65750.flac,"250.455446,270.25742599999995",2.0,dog_bark
928,101382.aif,"0.0,97.91875",1.0,children_playing
929,207213.wav,"0.0,300.0",2.0,children_playing
930,183992.flac,"0.0,24.44322",1.0,dog_bark
931,101281.mp3,"0.341333,34.474667",2.0,dog_bark
932,85569.aif,"0.0,23.681333",1.0,air_conditioner
933,151359.wav,"13.777179,13.886983",1.0,car_horn
934,180937.wav,"303.481213,442.891867",2.0,drilling
935,180126.flac,"30.012301,32.070906",1.0,drilling
936,51022.wav,"35.109115,35.419372",1.0,dog_bark
937,58937.wav,"106.510216,121.074347",1.0,drilling
938,113203.aif,"125.094118,128.351176",1.0,engine_idling
939,34871.wav,"7.0100820000000015,8.762602000000001",1.0,dog_bark
940,99812.wav,"242.691902,246.197885",2.0,car_horn
941,72537.wav,"1.31661,37.784229",1.0,dog_bark
942,35629.mp3,"15.589576,21.362661",1.0,dog_bark
943,33696.flac,"82.813076,85.64649399999998",2.0,dog_bark
944,61250.flac,"0.0,129.219048",2.0,dog_bark
945,161005.mp3,"0.0,60.212245",2.0,children_playing
946,170243.wav,"0.08280900000000001,0.186917",1.0,car_horn
947,181624.wav,"20.67794,21.116423",1.0,drilling
948,204919.mp3,"33.062846,34.093299",2.0,dog_bark
949,155317.wav,"3.031264,7.0454539999999986",1.0,dog_bark
950,112195.mp3,"0.0,166.32163300000005",1.0,dog_bark
951,109711.aif,"3.332443,5.69896",1.0,dog_bark
952,17913.wav,"8.462876,9.512387",2.0,drilling
953,184805.mp3,"0.0,250.906122",2.0,air_conditioner
954,51022.wav,"44.647024,60.65029499999999",2.0,dog_bark
955,116163.wav,"1.351097,1.7576490000000002",2.0,dog_bark
956,37869.flac,"21.567581,23.177696",1.0,dog_bark
957,7965.mp3,"95.717477,97.067061",1.0,dog_bark
958,74495.wav,"0.335018,7.1303009999999984",1.0,dog_bark
959,156418.wav,"0.0,6.2257440000000015",1.0,dog_bark
960,51022.wav,"26.301811,26.657106",1.0,dog_bark
961,165785.wav,"0.0,1.234467",1.0,drilling
962,209672.wav,"0.7355079999999999,2.25906",1.0,dog_bark
963,14468.flac,"54.127148,63.497322",1.0,dog_bark
964,85665.mp3,"0.0,1.358367",1.0,dog_bark
965,89207.wav,"0.028387,0.389303",1.0,dog_bark
966,145577.wav,"0.0,1.105569",1.0,car_horn
967,167750.wav,"14.330286,18.398976",1.0,drilling
968,72567.mp3,"32.753993,46.954645",2.0,car_horn
969,168846.mp3,"0.0,8.348148",1.0,engine_idling
970,187378.flac,"0.0,72.310295",1.0,dog_bark
971,209672.wav,"12.976463,14.237333",1.0,dog_bark
972,119067.aif,"0.0,8.466792",1.0,air_conditioner
973,71439.mp3,"3.699306,3.906744",1.0,car_horn
974,162103.wav,"0.0,39.793311",1.0,air_conditioner
975,144007.flac,"2.488552,48.854208",1.0,engine_idling
976,13577.mp3,"24.371779,26.244837",2.0,dog_bark
977,100652.mp3,"0.0,11.911837",1.0,dog_bark
978,71088.wav,"8.344424,9.1562",1.0,drilling
979,82811.wav,"25.940045,30.106174",1.0,dog_bark
980,131199.wav,"0.696078,0.990196",1.0,dog_bark
981,81799.aif,"40.598534,50.55070300000001",2.0,dog_bark
982,161922.wav,"43.118484,59.749035",2.0,dog_bark
983,38231.flac,"21.587459,23.058428",1.0,dog_bark
984,162702.wav,"0.452485,1.298459",2.0,car_horn
985,147764.wav,"17.460394,23.171433",1.0,drilling
986,160575.wav,"11.185766,12.537259",2.0,dog_bark
987,116423.wav,"0.0,13.356122",1.0,children_playing
988,33641.wav,"24.765832,25.470378",1.0,dog_bark
989,209672.wav,"31.889525,35.30438400000001",1.0,dog_bark
990,167701.wav,"61.19463,63.67199599999999",1.0,drilling
991,209992.wav,"5.143535,42.137425",1.0,engine_idling
992,94868.wav,"0.179042,0.530411",1.0,car_horn
993,146714.wav,"0.0,120.813424",2.0,air_conditioner
994,59037.mp3,"74.594507,95.816453",2.0,children_playing
995,199929.wav,"0.0,2.349659",1.0,drilling
996,14111.wav,"0.08911000000000001,19.458322",1.0,drilling
997,34643.wav,"11.962179,19.723224",1.0,drilling
998,180029.wav,"36.166061,37.119592",1.0,drilling
999,203128.mp3,"18.184728,19.275622",1.0,dog_bark
1000,77774.mp3,"10.734565,18.048",1.0,drilling
1001,117072.mp3,"1.328188,60.801506",1.0,dog_bark
1002,140824.wav,"0.0,1.150114",1.0,drilling
1003,181624.wav,"3.392474,7.915774000000001",1.0,drilling
1004,155488.aiff,"99.268224,112.785599",2.0,dog_bark
1005,185909.mp3,"0.0,270.001633",1.0,children_playing
1006,34056.mp3,"0.0,181.733878",2.0,children_playing
1007,34871.wav,"22.75147,27.320541",1.0,dog_bark
1008,125520.wav,"5.841718,6.709209",1.0,car_horn
1009,71312.mp3,"157.03298999999996,164.112346",2.0,dog_bark
1010,160575.wav,"30.480493,32.694642",2.0,dog_bark
1011,197080.wav,"31.5456,31.978579",1.0,dog_bark
1012,168037.wav,"219.65599999999998,221.929528",1.0,drilling
1013,23131.wav,"46.993205,47.619781",2.0,dog_bark
1014,4912.wav,"1.666477,1.990924",1.0,dog_bark
1015,72221.flac,"140.55445500000002,161.34653500000005",2.0,dog_bark
1016,180128.flac,"69.227363,74.503351",1.0,drilling
1017,59037.mp3,"69.702022,72.434189",2.0,children_playing
1018,165645.wav,"4.295866,5.169073",1.0,drilling
1019,180029.wav,"28.980525,30.342712",1.0,drilling
1020,24965.wav,"2.308111,2.911635",1.0,dog_bark
1021,107190.wav,"0.0,0.794875",1.0,dog_bark
1022,152588.wav,"25.124107,26.308978000000003",1.0,dog_bark
1023,180029.wav,"49.243055,54.828021",1.0,drilling
1024,22962.aiff,"0.0,9.092857",1.0,drilling
1025,84699.wav,"3.197124,4.445706",1.0,drilling
1026,147764.wav,"6.4310540000000005,7.543807000000001",1.0,drilling
1027,179725.flac,"0.8159350000000001,2.420932",1.0,drilling
1028,164312.wav,"12.364574,20.224226",1.0,dog_bark
1029,180029.wav,"57.34806700000001,59.595675",1.0,drilling
1030,118440.mp3,"0.187868,0.810181",1.0,drilling
1031,155312.wav,"0.0,5.491519",1.0,dog_bark
1032,144351.wav,"18.995389000000007,37.864142",1.0,drilling
1033,165645.wav,"0.0,0.6938880000000001",1.0,drilling
1034,128607.wav,"0.181139,12.763344",1.0,drilling
1035,178686.wav,"0.0,153.64518700000005",2.0,air_conditioner
1036,84143.wav,"0.0,90.387292",2.0,children_playing
1037,89679.wav,"22.362975,23.114454",2.0,car_horn
1038,146186.wav,"0.0,30.140426",1.0,engine_idling
1039,57596.wav,"5.921045,10.010245",2.0,dog_bark
1040,203128.mp3,"15.718359,17.70094",1.0,dog_bark
1041,96159.aif,"0.751209,4.033599",1.0,drilling
1042,52171.wav,"11.650478,12.151637",2.0,dog_bark
1043,160010.wav,"0.0,153.847528",1.0,children_playing
1044,167701.wav,"42.263119,48.696875",1.0,drilling
1045,34621.wav,"22.534201,23.064985",1.0,drilling
1046,85664.mp3,"0.0,0.653061",1.0,dog_bark
1047,19007.wav,"0.0,4.012653",2.0,drilling
1048,34871.wav,"60.868788,63.466274",1.0,dog_bark
1049,7965.mp3,"89.596636,90.586297",2.0,dog_bark
1050,7965.mp3,"105.183677,105.950602",2.0,dog_bark
1051,60591.wav,"0.0,37.899841",1.0,children_playing
1052,24074.wav,"13.060993,43.412508",1.0,car_horn
1053,174873.wav,"158.693866,182.606641",1.0,dog_bark
1054,113205.aif,"2.12,5.36",1.0,engine_idling
1055,23131.wav,"41.386153,41.996663",2.0,dog_bark
1056,177620.flac,"63.75957800000001,78.058961",2.0,dog_bark
1057,26256.flac,"49.861421,144.937229",2.0,dog_bark
1058,50612.wav,"0.0,0.7696149999999999",1.0,dog_bark
1059,196078.wav,"0.0,2.459478",1.0,children_playing
1060,160575.wav,"8.569044,9.805517",2.0,dog_bark
1061,167701.wav,"55.500387,57.127314",1.0,drilling
1062,204773.wav,"14.736146,15.527939000000002",1.0,dog_bark
1063,196067.wav,"0.0,5.70034",1.0,children_playing
1064,125520.wav,"0.175344,1.03822",1.0,car_horn
1065,100648.mp3,"4.823402,5.471927",2.0,car_horn
1066,167702.wav,"53.922456,59.644248",1.0,drilling
1067,158607.wav,"0.115242,1.131463",2.0,dog_bark
1068,113203.aif,"43.494706,64.449412",1.0,engine_idling
1069,85544.aif,"33.119357,35.85085",1.0,dog_bark
1070,23131.wav,"31.714389,34.47775",2.0,dog_bark
1071,144351.wav,"38.919441,73.913168",1.0,drilling
1072,168037.wav,"324.143576,325.967135",1.0,drilling
1073,17615.aif,"35.115512,51.330446",2.0,dog_bark
1074,103199.mp3,"16.097136,17.617205",2.0,drilling
1075,113785.wav,"0.259572,0.703092",1.0,dog_bark
1076,50901.wav,"1.006702,6.4324330000000005",1.0,air_conditioner
1077,34771.wav,"0.0,37.14966",1.0,dog_bark
1078,201988.wav,"53.567401,56.30275699999999",1.0,engine_idling
1079,180156.wav,"11.345892999999998,11.627342",2.0,car_horn
1080,37869.flac,"13.397742,14.987978",1.0,dog_bark
1081,38231.flac,"13.437498,19.679176",1.0,dog_bark
1082,204773.wav,"18.959042,20.410662",1.0,dog_bark
1083,54067.wav,"0.0,209.829021",1.0,children_playing
1084,51022.wav,"21.377728,21.978226",1.0,dog_bark
1085,72265.wav,"109.724992,114.165407",2.0,dog_bark
1086,82317.wav,"10.968053,16.862648999999998",2.0,car_horn
1087,27349.flac,"68.192705,85.558549",2.0,dog_bark
1088,72265.wav,"16.797623,21.238038",2.0,dog_bark
1089,208030.wav,"0.180372,2.119367",1.0,dog_bark
1090,197080.wav,"38.627896,39.122729",1.0,dog_bark
1091,205874.wav,"0.544125,2.6566080000000003",1.0,drilling
1092,17592.flac,"2.005174,7.493914",1.0,engine_idling
1093,110389.wav,"0.0,0.552041",1.0,dog_bark
1094,209672.wav,"62.308035,64.61963100000001",1.0,dog_bark
1095,71700.wav,"104.504191,120.562152",2.0,dog_bark
1096,197080.wav,"28.947727,29.782758",1.0,dog_bark
1097,205874.wav,"5.057158,6.833564999999999",1.0,drilling
1098,200161.wav,"67.056102,68.020649",1.0,dog_bark
1099,175917.wav,"85.929353,101.6208",2.0,dog_bark
1100,20841.flac,"32.63541,33.510417",2.0,dog_bark
1101,14468.flac,"30.570846000000003,32.141265999999995",1.0,dog_bark
1102,155130.wav,"38.257548,38.430375",1.0,car_horn
1103,208030.wav,"4.223703,5.471274",1.0,dog_bark
1104,22885.flac,"2.17286,6.4278330000000015",1.0,engine_idling
1105,34621.wav,"17.065514999999998,17.70889",1.0,drilling
1106,102104.wav,"2.429279,3.241121",2.0,dog_bark
1107,84699.wav,"16.345062,18.634128",1.0,drilling
1108,189846.wav,"13.241992000000002,14.358787",2.0,dog_bark
1109,175917.wav,"198.758329,207.226729",2.0,dog_bark
1110,99812.wav,"159.522205,163.612518",2.0,car_horn
1111,180029.wav,"42.704558,43.862417",1.0,drilling
1112,205610.wav,"0.172531,14.819523",1.0,drilling
1113,139948.aiff,"28.131374,29.361609",2.0,dog_bark
1114,177726.flac,"0.0,79.5795",2.0,air_conditioner
1115,54086.wav,"0.0,1.16194",1.0,car_horn
1116,162540.wav,"10.207327,10.672773",1.0,car_horn
1117,178826.wav,"0.0,115.564188",1.0,children_playing
1118,146690.wav,"0.0,347.68",1.0,air_conditioner
1119,26184.wav,"15.471497,25.685102",1.0,engine_idling
1120,179867.wav,"0.025482,0.566271",1.0,car_horn
1121,57553.aif,"13.063603,14.279479",2.0,dog_bark
1122,71082.wav,"2.551296,4.351435",1.0,drilling
1123,7383.mp3,"11.060839,16.253859",1.0,dog_bark
1124,171249.aiff,"11.144995,11.723836",2.0,car_horn
1125,108187.wav,"28.06791500000001,28.748725",2.0,dog_bark
1126,175850.wav,"0.528684,2.269774",1.0,car_horn
1127,23131.wav,"23.681362,24.78992",2.0,dog_bark
1128,204773.wav,"5.2346309999999985,6.466309",1.0,dog_bark
1129,71700.wav,"23.755587,27.680866",2.0,dog_bark
1130,128030.wav,"6.562935,7.08264",1.0,dog_bark
1131,23219.wav,"2.127165,33.031265999999995",1.0,engine_idling
1132,197080.wav,"34.267181,36.370221",1.0,dog_bark
1133,95549.wav,"64.178234,67.323084",2.0,dog_bark
1134,30832.mp3,"306.62072,308.447343",2.0,dog_bark
1135,71173.wav,"0.0,221.155625",2.0,children_playing
1136,39847.wav,"0.0,29.281115000000003",1.0,engine_idling
1137,196066.wav,"0.0,7.1632880000000005",1.0,children_playing
1138,41372.wav,"17.392794,128.518645",2.0,dog_bark
1139,63932.wav,"36.729332,44.26805",1.0,dog_bark
1140,155129.wav,"13.702351,13.860120000000002",1.0,car_horn
1141,196087.wav,"0.0,4.0344440000000015",1.0,children_playing
1142,118961.wav,"0.0,0.770312",1.0,dog_bark
1143,171464.wav,"11.705992,13.111154",1.0,dog_bark
1144,71312.mp3,"134.37905,149.824918",2.0,dog_bark
1145,178402.mp3,"0.122098,2.167244",1.0,car_horn
1146,122199.aiff,"2.538824,8.592941",2.0,dog_bark
1147,115411.wav,"23.161936,28.202933",2.0,dog_bark
1148,17124.wav,"0.072751,0.311441",2.0,car_horn
1149,59037.mp3,"60.488901,63.030452",2.0,children_playing
1150,35296.mp3,"11.978519,15.341133",2.0,dog_bark
1151,12647.flac,"6.682172,10.72074",1.0,dog_bark
1152,106905.aif,"55.008446,63.386907",2.0,engine_idling
1153,176714.wav,"0.0,169.65599999999995",1.0,children_playing
1154,19218.flac,"55.750425,59.84756899999999",2.0,dog_bark
1155,201207.wav,"96.17451,99.224314",1.0,dog_bark
1156,156634.wav,"32.465057,37.125882",1.0,engine_idling
1157,125520.wav,"1.87341,4.0513650000000005",1.0,car_horn
1158,54823.wav,"0.189657,4.096588",1.0,dog_bark
1159,38236.flac,"13.434856,23.804574",1.0,dog_bark
1160,180029.wav,"0.238383,2.11139",1.0,drilling
1161,23219.wav,"40.295737,49.20575",1.0,engine_idling
1162,28284.mp3,"5.678508,12.084142",1.0,dog_bark
1163,4918.wav,"4.8672,5.2832",1.0,dog_bark
1164,42324.wav,"5.811333,18.123129",1.0,drilling
1165,209672.wav,"41.083375,43.184827",1.0,dog_bark
1166,31325.mp3,"4.804858,15.804409",1.0,dog_bark
1167,72221.flac,"88.039604,92.673267",2.0,dog_bark
1168,142641.wav,"1.779107,2.162404",1.0,dog_bark
1169,39532.wav,"3.439314,4.020729",1.0,drilling
1170,189987.flac,"0.0,13.0",1.0,air_conditioner
1171,138031.wav,"0.0,98.791625",1.0,children_playing
1172,74950.mp3,"11.592781,26.983197",1.0,dog_bark
1173,22973.wav,"0.14222,9.116285",2.0,dog_bark
1174,183894.flac,"124.494593,127.186761",2.0,car_horn
1175,43787.mp3,"6.27162,7.364737",1.0,dog_bark
1176,77774.mp3,"0.0,10.734565",1.0,drilling
1177,27217.flac,"0.0,48.681406",1.0,dog_bark
1178,187863.wav,"0.0,14.186282",1.0,drilling
1179,165529.wav,"0.0,186.24",2.0,children_playing
1180,60935.wav,"0.0,35.026146000000004",1.0,children_playing
1181,128607.wav,"13.473967000000002,24.425919",1.0,drilling
1182,106014.wav,"4.4009540000000005,16.773446",1.0,engine_idling
1183,166101.wav,"19.712567,33.452739",1.0,engine_idling
1184,58806.mp3,"0.0,5.694694",1.0,air_conditioner
1185,205874.wav,"13.058991,16.403757000000002",1.0,drilling
1186,208030.wav,"7.771013000000001,10.897455",1.0,dog_bark
1187,13577.mp3,"54.781414,59.54118199999999",2.0,dog_bark
1188,163459.wav,"0.294231,1.074248",1.0,dog_bark
1189,99185.wav,"0.341411,0.950911",1.0,dog_bark
1190,78360.mp3,"0.0,50.4",1.0,drilling
1191,7913.flac,"5.540695,6.32943",1.0,dog_bark
1192,26255.flac,"27.82535,28.543424",2.0,dog_bark
1193,7965.mp3,"192.498017,194.453674",2.0,dog_bark
1194,85544.aif,"7.596966,9.617133",1.0,dog_bark
1195,207216.wav,"4.554455,300.0",2.0,children_playing
1196,161922.wav,"0.241899,18.444793",2.0,dog_bark
1197,209672.wav,"6.829717,7.670298",1.0,dog_bark
1198,161922.wav,"66.58268000000001,69.96926500000001",2.0,dog_bark
1199,71082.wav,"0.529763,1.847581",1.0,drilling
1200,74725.wav,"0.365119,7.790985000000001",1.0,dog_bark
1201,139948.aiff,"1.0662040000000002,4.182799",2.0,dog_bark
1202,30832.mp3,"59.900638,61.790248",2.0,dog_bark
1203,189846.wav,"22.535318,23.532456",2.0,dog_bark
1204,7389.mp3,"96.109623,111.9471",2.0,car_horn
1205,110371.wav,"0.290852,9.670839",1.0,dog_bark
1206,85362.wav,"12.148076,17.197332",1.0,dog_bark
1207,167701.wav,"37.160486,41.708485",1.0,drilling
1208,180029.wav,"20.77335,22.714466",1.0,drilling
1209,203128.mp3,"7.702660000000002,9.723185",1.0,dog_bark
1210,20841.flac,"29.60835800000001,30.223228",2.0,dog_bark
1211,72539.wav,"6.8048199999999985,28.273224",1.0,dog_bark
1212,33849.wav,"1.78355,2.410732",1.0,dog_bark
1213,113785.wav,"0.991278,1.592177",1.0,dog_bark
1214,207124.wav,"2.7363470000000003,5.596604",1.0,dog_bark
1215,203128.mp3,"25.432058,25.925332",1.0,dog_bark
1216,17913.wav,"0.0,8.462876",1.0,drilling
1217,197243.wav,"2.149961,2.733176",1.0,dog_bark
1218,34621.wav,"2.68609,3.82808",1.0,drilling
1219,72265.wav,"142.122494,147.702226",2.0,dog_bark
1220,202517.wav,"0.0,4.037104",1.0,air_conditioner
1221,197075.wav,"2.358061,10.442842",2.0,dog_bark
1222,144068.wav,"95.757667,99.644631",1.0,engine_idling
1223,147926.wav,"0.0,112.198821",1.0,air_conditioner
1224,20841.flac,"5.983159,6.952761",2.0,dog_bark
1225,19338.wav,"2.578426,8.292775",1.0,engine_idling
1226,87275.wav,"2.645917,2.754952",2.0,car_horn
1227,85362.wav,"0.380052,2.660361",1.0,dog_bark
1228,115411.wav,"7.417149,13.168771",2.0,dog_bark
1229,84699.wav,"14.264094,15.720772",1.0,drilling
1230,27349.flac,"41.480366,61.302841",2.0,dog_bark
1231,44110.wav,"0.249536,3.465784",1.0,dog_bark
1232,176257.flac,"45.814379,51.045588",1.0,dog_bark
1233,46668.wav,"0.30695300000000003,9.358945",1.0,drilling
1234,147764.wav,"2.143685,5.220118",1.0,drilling
1235,183989.ogg,"71.17647099999998,135.647059",2.0,dog_bark
1236,176631.wav,"28.32413,30.302215000000004",2.0,car_horn
1237,103199.mp3,"51.916188,63.453119",2.0,drilling
1238,132855.wav,"0.0,366.08",2.0,children_playing
1239,83465.wav,"1.334117,1.859058",1.0,car_horn
1240,34871.wav,"113.63217,115.3221",2.0,dog_bark
1241,107090.wav,"25.500254,26.099176",2.0,car_horn
1242,128160.wav,"0.0,34.381333000000005",1.0,engine_idling
1243,17074.wav,"3.5405269999999995,4.403714",2.0,car_horn
1244,54086.wav,"1.524149,2.725537",1.0,car_horn
1245,77751.wav,"28.013219,33.572262",1.0,drilling
1246,175845.wav,"1.667248,2.405537",1.0,car_horn
1247,14114.wav,"0.0,10.13551",1.0,drilling
1248,72567.mp3,"77.64111,81.61294000000002",2.0,car_horn
1249,74723.wav,"0.398746,8.514406",1.0,dog_bark
1250,72265.wav,"5.696585,8.354991",2.0,dog_bark
1251,13577.mp3,"2.313777,18.752608",2.0,dog_bark
1252,180126.flac,"19.285883,27.547392",1.0,drilling
1253,73524.wav,"0.0,295.984762",1.0,air_conditioner
1254,19338.wav,"43.659019,44.425578",1.0,engine_idling
1255,190680.wav,"11.227691,11.735787",2.0,dog_bark
1256,57105.flac,"259.503775,260.805157",2.0,dog_bark
1257,36429.wav,"0.0,50.543081",2.0,children_playing
1258,7965.mp3,"76.347321,78.737569",2.0,dog_bark
1259,26256.flac,"146.360644,163.274174",2.0,dog_bark
1260,181624.wav,"27.255186,27.716747",1.0,drilling
1261,100648.mp3,"17.631764,19.253075",2.0,car_horn
1262,72259.mp3,"132.867789,140.049832",2.0,car_horn
1263,50614.wav,"0.0,1.0",1.0,dog_bark
1264,31840.wav,"4.95368,5.98048",1.0,dog_bark
1265,50629.mp3,"79.63521999999998,108.334926",1.0,drilling
1266,168037.wav,"1.302542,3.362927",1.0,drilling
1267,110134.wav,"0.0,1.130113",1.0,dog_bark
1268,109703.mp3,"0.0,316.873156",2.0,children_playing
1269,72567.mp3,"0.0,7.290756",2.0,car_horn
1270,178118.wav,"0.0,0.723588",2.0,dog_bark
1271,175847.wav,"0.065415,0.881925",1.0,car_horn
1272,185801.mp3,"0.08895299999999999,8.361556",2.0,drilling
1273,50901.wav,"9.021096,16.251046",1.0,air_conditioner
1274,185436.mp3,"97.394678,99.942794",2.0,car_horn
1275,102105.wav,"2.041889,7.225822",2.0,dog_bark
1276,34621.wav,"17.837564999999994,18.529193",1.0,drilling
1277,173993.wav,"0.0,117.539896",1.0,dog_bark
1278,116400.flac,"0.0,9.072459",1.0,dog_bark
1279,194753.flac,"8.235294,9.2",2.0,dog_bark
1280,108187.wav,"31.5648,33.266824",2.0,dog_bark
1281,116483.wav,"0.0,13.094552",1.0,dog_bark
1282,152588.wav,"28.581996000000004,30.492299",1.0,dog_bark
1283,61077.wav,"28.455188,29.897293",1.0,dog_bark
1284,181624.wav,"0.161546,2.469352",1.0,drilling
1285,28808.wav,"0.0,27.28857",1.0,car_horn
1286,29932.wav,"181.725228,183.563489",2.0,car_horn
1287,197073.wav,"29.031106,40.161953",1.0,dog_bark
1288,161923.wav,"152.969333,155.179163",1.0,dog_bark
1289,174841.wav,"1.05814,2.870053",1.0,car_horn
1290,203956.flac,"14.903579,16.239276999999998",1.0,car_horn
1291,151149.wav,"0.0,119.426032",2.0,children_playing
1292,34621.wav,"12.288458,12.770989",1.0,drilling
1293,180128.flac,"120.548341,127.662931",1.0,drilling
1294,63724.wav,"0.0,36.959388",2.0,air_conditioner
1295,200161.wav,"37.617328,54.09500300000001",1.0,dog_bark
1296,99192.wav,"0.0,115.067166",1.0,drilling
1297,52441.wav,"46.843242,60.655362",1.0,dog_bark
1298,143115.wav,"39.187397,40.394711",2.0,car_horn
1299,160093.wav,"0.015691,0.135517",1.0,dog_bark
1300,167750.wav,"26.879498,28.170368",1.0,drilling
1301,52077.wav,"0.60243,45.118864",1.0,dog_bark
1302,168037.wav,"341.645008,343.089646",1.0,drilling
1303,103357.wav,"0.305227,6.966606",1.0,drilling
1304,207124.wav,"0.0,1.04291",1.0,dog_bark
1305,344.wav,"1.401936,2.666725",1.0,dog_bark
1306,32417.wav,"0.079235,0.424503",1.0,car_horn
1307,87275.wav,"2.2025080000000004,2.264294",2.0,car_horn
1308,55018.mp3,"4.041583,509.576199",1.0,air_conditioner
1309,181624.wav,"29.009118,30.739973",1.0,drilling
1310,99812.wav,"38.176254,47.330764",2.0,car_horn
1311,205874.wav,"7.137635,7.969825",1.0,drilling
1312,180128.flac,"13.989363,19.904865",1.0,drilling
1313,200161.wav,"61.730999,62.956778",1.0,dog_bark
1314,196061.wav,"0.0,2.0310200000000003",1.0,children_playing
1315,89099.wav,"0.421872,10.186178",1.0,drilling
1316,180132.flac,"28.192616,33.48396",1.0,drilling
1317,139948.aiff,"22.636325,23.825552",2.0,dog_bark
1318,180029.wav,"17.742484,20.228475",1.0,drilling
1319,9031.wav,"12.423771,13.317866",1.0,dog_bark
1320,151877.wav,"19.423205,23.730771",1.0,engine_idling
1321,200161.wav,"27.831196,28.494322",1.0,dog_bark
1322,51022.wav,"15.292682,15.773079999999998",1.0,dog_bark
1323,30832.mp3,"20.848697,21.982463",2.0,dog_bark
1324,30832.mp3,"240.988265,242.436966",2.0,dog_bark
1325,17486.wav,"0.288611,0.942797",1.0,dog_bark
1326,11722.wav,"2.02081,2.459512",1.0,dog_bark
1327,13230.mp3,"0.0,61.257143000000006",1.0,air_conditioner
1328,196561.wav,"0.0,120.999979",1.0,dog_bark
1329,43787.mp3,"1.578947,2.870812",1.0,dog_bark
1330,117048.wav,"0.0,81.972472",1.0,dog_bark
1331,161010.wav,"274.678649,277.041262",2.0,car_horn
1332,69598.wav,"73.936553,76.07964100000002",1.0,drilling
1333,157950.wav,"0.0,1.410045",1.0,dog_bark
1334,156200.wav,"0.0,2.440907",1.0,children_playing
1335,174873.wav,"85.433821,94.781542",1.0,dog_bark
1336,52102.wav,"32.140691,32.564609000000004",2.0,car_horn
1337,199769.mp3,"0.8482729999999999,41.413108",1.0,car_horn
1338,54976.aiff,"5.693949,28.937741",1.0,drilling
1339,175904.wav,"0.0,377.086667",1.0,children_playing
1340,85249.wav,"0.0,184.325805",1.0,children_playing
1341,154758.wav,"0.0,47.168211",1.0,engine_idling
1342,174840.wav,"0.89259,3.875029",1.0,car_horn
1343,165567.aiff,"7.306259,8.7528",2.0,dog_bark
1344,49313.aif,"0.0,70.242177",1.0,children_playing
1345,71087.wav,"4.427711,5.23158",1.0,drilling
1346,180029.wav,"8.820160000000003,12.872666",1.0,drilling
1347,144007.flac,"68.762626,96.398653",1.0,engine_idling
1348,209672.wav,"49.751862,52.115995",1.0,dog_bark
1349,118440.mp3,"8.195748,8.61258",1.0,drilling
1350,66587.mp3,"4.533271,5.0497190000000005",1.0,dog_bark
1351,13577.mp3,"30.916462,32.040296000000005",2.0,dog_bark
1352,190680.wav,"36.24834,41.750652",2.0,dog_bark
1353,180156.wav,"23.747218,23.993486",2.0,car_horn
1354,33849.wav,"0.0,0.264593",1.0,dog_bark
1355,49808.wav,"0.0,53.44364300000001",2.0,dog_bark
1356,166268.wav,"3.495586,3.706087",1.0,dog_bark
1357,72259.mp3,"0.0,14.364085",2.0,car_horn
1358,71088.wav,"0.426973,5.2343730000000015",1.0,drilling
1359,185436.mp3,"235.134535,238.107337",2.0,car_horn
1360,71171.wav,"91.541842,93.856981",1.0,drilling
1361,180128.flac,"88.332836,95.367487",1.0,drilling
1362,180029.wav,"33.441687,34.054671",1.0,drilling
1363,30226.aiff,"1.893093,4.2963809999999985",1.0,dog_bark
1364,187356.wav,"37.058838,40.548889",2.0,car_horn
1365,72259.mp3,"201.635848,205.585971",2.0,car_horn
1366,201207.wav,"127.638824,130.41686299999998",1.0,dog_bark
1367,34621.wav,"14.701113,15.264066",1.0,drilling
1368,204919.mp3,"25.525812,26.49738300000001",2.0,dog_bark
1369,104327.wav,"0.0,88.166167",2.0,children_playing
1370,100795.mp3,"13.059155,21.881495",1.0,dog_bark
1371,121299.aif,"49.966977,50.59947",2.0,car_horn
1372,201207.wav,"71.232549,73.346275",1.0,dog_bark
1373,201207.wav,"62.777647,65.072549",1.0,dog_bark
1374,54914.wav,"0.0,125.906213",2.0,children_playing
1375,127538.wav,"10.711639,15.898141",1.0,drilling
1376,51022.wav,"15.773079999999998,18.495337",2.0,dog_bark
1377,119420.wav,"4.9195910000000005,6.752704",1.0,dog_bark
1378,133090.wav,"0.0,161.208254",1.0,children_playing
1379,157649.wav,"14.21108,21.238538",2.0,dog_bark
1380,204919.mp3,"16.487261,21.963386",2.0,dog_bark
1381,189846.wav,"17.230544000000002,18.586652",2.0,dog_bark
1382,121888.wav,"0.0,0.749977",1.0,dog_bark
1383,108187.wav,"18.010504,19.093609",2.0,dog_bark
1384,170245.wav,"0.0,2.389546",1.0,air_conditioner
1385,192236.wav,"3.506272,23.822026",1.0,dog_bark
1386,119449.wav,"1.381958,18.568493",1.0,engine_idling
1387,106015.wav,"3.484984,48.711462",1.0,engine_idling
1388,51022.wav,"19.721354,19.916516",1.0,dog_bark
1389,156418.wav,"15.852218,16.856370000000002",1.0,dog_bark
1390,180029.wav,"13.758087,16.925172",1.0,drilling
1391,200161.wav,"55.340876,56.104476",1.0,dog_bark
1392,49974.wav,"0.0,2.588",1.0,car_horn
1393,180156.wav,"25.488681,26.086759",2.0,car_horn
1394,77751.wav,"40.475649,44.109011",1.0,drilling
1395,51022.wav,"30.385197,31.115803000000003",2.0,dog_bark
1396,113203.aif,"115.899412,120.626471",1.0,engine_idling
1397,12647.flac,"0.7121149999999999,1.443739",1.0,dog_bark
1398,30832.mp3,"270.27722,271.977869",2.0,dog_bark
1399,201207.wav,"42.787843,50.36705900000001",1.0,dog_bark
1400,54823.wav,"19.819143,27.708869",1.0,dog_bark
1401,85544.aif,"20.230123000000006,25.806921",1.0,dog_bark
1402,22347.mp3,"1.187356,2.271463",1.0,dog_bark
1403,71439.mp3,"55.904472,56.83794200000001",2.0,car_horn
1404,71171.wav,"40.233359,55.37561899999999",1.0,drilling
1405,150341.wav,"15.377819,15.823344",1.0,dog_bark
1406,344.wav,"3.565793,4.1753300000000015",1.0,dog_bark
1407,52171.wav,"1.609606,8.584563000000001",1.0,dog_bark
1408,33849.wav,"5.017459,6.712811",1.0,dog_bark
1409,26184.wav,"5.862247,6.889651",1.0,engine_idling
1410,73168.wav,"3.670782,4.524515",1.0,car_horn
1411,77751.wav,"48.687047,52.02974",1.0,drilling
1412,166421.wav,"0.0,79.12508299999998",1.0,dog_bark
1413,33641.wav,"11.955919,13.27961",1.0,dog_bark
1414,99812.wav,"89.207778,94.271975",2.0,car_horn
1415,159761.aiff,"0.0,20.0",2.0,air_conditioner
1416,162541.wav,"5.8992510000000005,6.34846",1.0,car_horn
1417,113203.aif,"141.581176,142.618824",1.0,engine_idling
1418,76566.wav,"45.358189,50.862066",2.0,dog_bark
1419,4910.wav,"0.031494,0.6477310000000001",1.0,dog_bark
1420,66619.mp3,"18.004678,66.658541",2.0,children_playing
1421,184449.wav,"0.0,72.57600000000002",1.0,children_playing
1422,71309.mp3,"45.51988,45.835677",2.0,car_horn
1423,74513.wav,"0.433328,19.355319",1.0,dog_bark
1424,4201.mp3,"0.104715,0.352725",2.0,dog_bark
1425,159439.wav,"0.0,69.43379200000001",1.0,children_playing
1426,205878.wav,"0.376207,3.385864",1.0,drilling
1427,30832.mp3,"244.956446,246.783069",2.0,dog_bark
1428,72259.mp3,"116.528642,129.63586999999998",2.0,car_horn
1429,42937.wav,"0.0,8.214876",1.0,drilling
1430,170015.wav,"1.193864,1.790795",1.0,dog_bark
1431,19503.flac,"19.152475,21.544554",2.0,dog_bark
1432,26184.wav,"8.581846,9.709976",1.0,engine_idling
1433,130961.wav,"131.01298899999998,144.293758",1.0,drilling
1434,161129.wav,"8.275687,53.49751",1.0,drilling
1435,164312.wav,"0.0,3.4505790000000003",1.0,dog_bark
1436,34872.wav,"0.0,8.007712",1.0,dog_bark
1437,130961.wav,"13.639708,16.690696",2.0,drilling
1438,119420.wav,"0.182207,3.17482",1.0,dog_bark
1439,63932.wav,"0.0,9.905524",1.0,dog_bark
1440,167702.wav,"17.67237,20.678121",1.0,drilling
1441,35296.mp3,"7.448507000000001,9.592966",2.0,dog_bark
1442,160575.wav,"17.540661,18.863399",2.0,dog_bark
1443,39533.wav,"0.0,0.8773110000000001",1.0,drilling
1444,47926.wav,"1.674351,2.6833240000000003",1.0,dog_bark
1445,162703.wav,"0.432845,1.592012",2.0,car_horn
1446,26177.wav,"0.8662780000000001,2.039362",1.0,car_horn
1447,76566.wav,"6.34312,40.029968",2.0,dog_bark
1448,135849.wav,"0.016276,0.935854",1.0,drilling
1449,197075.wav,"63.920301,69.983887",2.0,dog_bark
1450,177620.flac,"111.456836,123.405635",2.0,dog_bark
1451,180128.flac,"0.0,6.954712",1.0,drilling
1452,15564.aif,"0.0,8.808231",1.0,children_playing
1453,191382.mp3,"41.735929,43.045862",1.0,dog_bark
1454,141240.flac,"27.06407,29.914348",1.0,engine_idling
1455,165785.wav,"3.691934,4.731485",1.0,drilling
1456,179863.wav,"0.14144500000000002,0.8972889999999999",1.0,car_horn
1457,26176.wav,"0.320622,1.435087",1.0,car_horn
1458,182474.wav,"1.26501,2.605597",1.0,car_horn
1459,127538.wav,"0.258434,6.042006",1.0,drilling
1460,165645.wav,"2.888599,3.765705",1.0,drilling
1461,46669.wav,"0.0,131.86036399999998",1.0,drilling
1462,132073.aiff,"35.409997,35.775857",2.0,car_horn
1463,196076.wav,"0.0,2.355669",1.0,children_playing
1464,118070.wav,"0.392887,0.6179640000000001",1.0,car_horn
1465,180156.wav,"28.654977,30.114991",2.0,car_horn
1466,68389.wav,"1.776939,3.366492",1.0,dog_bark
1467,7389.mp3,"68.122848,72.027979",2.0,car_horn
1468,17480.aif,"0.0,100.0",2.0,children_playing
1469,197073.wav,"21.894212,22.503459",1.0,dog_bark
1470,169044.wav,"0.0,56.04666700000001",1.0,children_playing
1471,167750.wav,"24.689922,26.258574",1.0,drilling
1472,34643.wav,"0.0,2.255346",1.0,drilling
1473,118440.mp3,"5.8063,6.622352",1.0,drilling
1474,180128.flac,"107.838005,112.634358",1.0,drilling
1475,162728.wav,"2.7788060000000003,3.200719",1.0,car_horn
1476,34621.wav,"3.82808,5.372179",1.0,drilling
1477,51022.wav,"6.1501,6.5003910000000005",1.0,dog_bark
1478,344.wav,"6.483953,7.428735",1.0,dog_bark
1479,57320.wav,"0.0,101.583197",2.0,air_conditioner
1480,85362.wav,"10.057792999999998,11.035068",1.0,dog_bark
1481,43784.mp3,"0.934147,1.116784",1.0,dog_bark
1482,185800.mp3,"9.14007,17.379316",2.0,drilling
1483,39852.wav,"0.0,6.672249000000001",1.0,engine_idling
1484,157649.wav,"23.8413,29.723542",2.0,dog_bark
1485,188497.wav,"0.0,52.0",1.0,children_playing
1486,51022.wav,"40.198335,44.036518",2.0,dog_bark
1487,189991.flac,"0.0,18.08",1.0,air_conditioner
1488,34621.wav,"14.105991,14.636775",1.0,drilling
1489,167701.wav,"10.390146,15.418828",1.0,drilling
1490,19338.wav,"27.421906,33.136255",1.0,engine_idling
1491,196080.wav,"0.0,1.254739",1.0,children_playing
1492,174026.wav,"33.71608,42.464764",2.0,dog_bark
1493,156362.wav,"111.410002,122.570932",2.0,drilling
1494,208030.wav,"17.706485,18.69853",1.0,dog_bark
1495,127538.wav,"6.434112,10.453205",1.0,drilling
1496,34871.wav,"34.268033,36.615158",1.0,dog_bark
1497,155488.aiff,"147.423873,159.462785",2.0,dog_bark
1498,113201.aif,"0.0,19.25",1.0,engine_idling
1499,115411.wav,"15.322853,18.9426",2.0,dog_bark
1500,88569.wav,"0.0,174.0",2.0,children_playing
1501,197073.wav,"4.061647,4.467812",1.0,dog_bark
1502,71079.wav,"2.730519,3.2610200000000003",1.0,drilling
1503,182739.wav,"0.0,204.71275",1.0,children_playing
1504,187377.flac,"0.0,7.878630999999999",1.0,drilling
1505,175846.wav,"0.143475,1.635387",1.0,car_horn
1506,190680.wav,"21.352441,25.677456",2.0,dog_bark
1507,101415.aif,"0.0,20.852771",1.0,dog_bark
1508,175842.wav,"0.206442,0.688665",1.0,car_horn
1509,52441.wav,"0.0,34.702339",1.0,dog_bark
1510,205874.wav,"9.234115,9.95428",1.0,drilling
1511,166268.wav,"0.0,0.2392050000000001",1.0,dog_bark
1512,84699.wav,"19.485433,21.547484",1.0,drilling
1513,72265.wav,"24.422283,28.190793",2.0,dog_bark
1514,132073.aiff,"0.940782,2.404221",2.0,car_horn
1515,21187.wav,"0.0,1.22034",1.0,engine_idling
1516,125520.wav,"4.572783,5.440273",1.0,car_horn
1517,204919.mp3,"3.974607,6.064957",2.0,dog_bark
1518,201207.wav,"0.0,2.083529",1.0,dog_bark
1519,75743.mp3,"0.0,50.599184",2.0,air_conditioner
1520,155310.wav,"0.0,2.774785",1.0,dog_bark
1521,61077.wav,"44.52938,48.820521",1.0,dog_bark
1522,113203.aif,"132.93411799999998,137.891765",1.0,engine_idling
1523,180937.wav,"489.581285,510.953201",2.0,drilling
1524,14470.flac,"0.0,163.51201799999996",1.0,children_playing
1525,162541.wav,"10.228976,10.667361",1.0,car_horn
1526,201207.wav,"140.774118,146.752941",1.0,dog_bark
1527,178118.wav,"7.420988,8.523199",2.0,dog_bark
1528,176783.wav,"0.0,39.171313",1.0,dog_bark
1529,129750.wav,"0.0,135.002268",2.0,children_playing
1530,137969.aiff,"0.0,120.256145",1.0,children_playing
1531,79584.mp3,"37.833412,47.1872",1.0,dog_bark
1532,50629.mp3,"64.186504,66.57814599999999",1.0,drilling
1533,30832.mp3,"231.666189,232.925929",2.0,dog_bark
1534,184725.flac,"0.0,19.93835",1.0,dog_bark
1535,31325.mp3,"49.875221,60.16",1.0,dog_bark
1536,68389.wav,"5.356664,5.964054",1.0,dog_bark
1537,209672.wav,"5.306165,6.0942089999999975",1.0,dog_bark
1538,174906.flac,"0.0,56.14",2.0,children_playing
1539,166931.wav,"223.545085,234.82551400000003",1.0,drilling
1540,26185.wav,"0.4605260000000001,0.817357",1.0,car_horn
1541,7965.mp3,"119.97494,124.094944",2.0,dog_bark
1542,170564.wav,"11.763036,22.863366",2.0,children_playing
1543,72221.flac,"103.128713,110.376238",2.0,dog_bark
1544,72261.wav,"1.4738790000000002,64.15708000000001",1.0,dog_bark
1545,116485.wav,"22.283354,24.269854",1.0,dog_bark
1546,201207.wav,"110.88,112.842745",1.0,dog_bark
1547,19496.flac,"32.082004,37.265169",2.0,dog_bark
1548,181624.wav,"21.554906,22.108779",1.0,drilling
1549,55013.wav,"0.0,18.49505",2.0,dog_bark
1550,180125.flac,"0.0,39.514239",1.0,drilling
1551,181624.wav,"11.862122,12.508307",1.0,drilling
1552,147672.mp3,"0.644886,0.997283",1.0,dog_bark
1553,165786.wav,"0.0,4.151202",1.0,drilling
1554,174026.wav,"71.941097,77.863283",2.0,dog_bark
1555,82811.wav,"39.617524,42.093619",1.0,dog_bark
1556,73373.aif,"0.0,2.927007",1.0,dog_bark
1557,84699.wav,"27.828226,29.360575",1.0,drilling
1558,179858.wav,"0.627537,0.973626",1.0,car_horn
1559,195969.wav,"283.48561,345.69775400000015",2.0,air_conditioner
1560,180156.wav,"26.403389,26.755199",2.0,car_horn
1561,152908.wav,"0.0,30.597052",1.0,engine_idling
1562,176258.flac,"45.877825,51.282281",2.0,dog_bark
1563,85544.aif,"10.641443,11.238957",1.0,dog_bark
1564,30832.mp3,"297.991501,299.440202",2.0,dog_bark
1565,109233.mp3,"15.452386,33.168",1.0,dog_bark
1566,195063.flac,"7.749511999999997,11.866697",1.0,drilling
1567,201207.wav,"16.24549,17.513725",1.0,dog_bark
1568,164625.wav,"0.344326,0.817351",1.0,car_horn
1569,4918.wav,"1.421333,2.343467",1.0,dog_bark
1570,65472.wav,"86.356413,87.241771",2.0,car_horn
1571,20841.flac,"20.787337,22.206268",2.0,dog_bark
1572,82811.wav,"1.2183959999999998,14.974481",1.0,dog_bark
1573,7965.mp3,"91.839193,92.452733",1.0,dog_bark
1574,155238.wav,"0.0,236.924807",2.0,children_playing
1575,204773.wav,"9.589492,13.548457",1.0,dog_bark
1576,17307.wav,"11.275117,11.336696",2.0,car_horn
1577,204773.wav,"42.184968,55.689437",1.0,dog_bark
1578,94868.wav,"2.381256,2.75053",1.0,car_horn
1579,209672.wav,"54.32251899999999,56.00368",1.0,dog_bark
1580,204773.wav,"32.595476,39.633636",1.0,dog_bark
1581,196065.wav,"0.0,2.712381",1.0,children_playing
1582,175843.wav,"0.076205,0.972825",1.0,car_horn
1583,26256.flac,"30.938363,44.042162",2.0,dog_bark
1584,130961.wav,"301.688815,316.225873",1.0,drilling
1585,160575.wav,"21.3651,24.298129",2.0,dog_bark
1586,72259.mp3,"19.211964,22.982537",2.0,car_horn
1587,14468.flac,"0.837557,19.787294",1.0,dog_bark
1588,69598.wav,"11.543454,15.488685",2.0,drilling
1589,179861.wav,"0.16001600000000002,0.691407",1.0,car_horn
1590,31323.mp3,"56.089812,57.338776",2.0,dog_bark
1591,4912.wav,"0.0,0.231748",1.0,dog_bark
1592,128240.aiff,"0.0,97.395677",1.0,dog_bark
1593,26255.flac,"1.84505,4.1688160000000005",2.0,dog_bark
1594,197073.wav,"44.407341,48.942847",1.0,dog_bark
1595,72265.wav,"130.145059,134.46862099999998",2.0,dog_bark
1596,82811.wav,"20.319702,21.262977",1.0,dog_bark
1597,207962.wav,"4.0719059999999985,5.499482",1.0,dog_bark
1598,196071.wav,"0.0,1.333764",1.0,children_playing
1599,162541.wav,"1.271857,1.758951",1.0,car_horn
1600,194754.flac,"0.312357,9.554916",1.0,dog_bark
1601,204526.wav,"0.0,592.830021",1.0,children_playing
1602,130961.wav,"253.231956,262.025979",1.0,drilling
1603,115535.wav,"0.0,0.490667",1.0,dog_bark
1604,63292.wav,"0.0,7.507528",1.0,dog_bark
1605,29936.wav,"2.321813,5.075963",2.0,dog_bark
1606,77751.wav,"22.563176,26.596208",1.0,drilling
1607,7965.mp3,"8.154962,8.985797",2.0,dog_bark
1608,197080.wav,"22.422118,27.370447",1.0,dog_bark
1609,189023.wav,"0.0,30.708000000000002",1.0,air_conditioner
1610,186940.wav,"0.0,3.836599",1.0,engine_idling
1611,169043.wav,"0.0,61.012",1.0,children_playing
1612,69598.wav,"29.077814,34.776481",2.0,drilling
1613,183894.flac,"98.082239,98.955375",2.0,car_horn
1614,144351.wav,"0.802028,9.750966",1.0,drilling
1615,197075.wav,"30.06528,32.002259",2.0,dog_bark
1616,139948.aiff,"45.395673,46.420868",2.0,dog_bark
1617,71171.wav,"86.78642099999998,89.038989",1.0,drilling
1618,158593.wav,"7.320678,128.196989",2.0,children_playing
1619,85544.aif,"12.29172,14.653324",1.0,dog_bark
1620,26344.flac,"0.0,2.908546",1.0,drilling
1621,35629.mp3,"7.300594,12.489632",1.0,dog_bark
1622,34871.wav,"57.801878,58.928498",1.0,dog_bark
1623,165454.wav,"0.0,29.246479",1.0,air_conditioner
1624,81788.aif,"0.0,154.026667",2.0,children_playing
1625,155488.aiff,"31.470139,59.77214300000001",2.0,dog_bark
1626,59594.mp3,"0.0,12.133878",2.0,drilling
1627,23218.wav,"1.35891,2.882536",1.0,engine_idling
1628,155234.wav,"101.719854,103.833373",2.0,car_horn
1629,76566.wav,"140.036578,148.15577199999996",2.0,dog_bark
1630,74507.wav,"0.0,60.433129",1.0,air_conditioner
1631,71086.wav,"4.406784,6.079358",1.0,drilling
1632,34241.aif,"6.335714,10.081647",1.0,car_horn
1633,193394.flac,"0.0,27.937188",1.0,dog_bark
1634,207962.wav,"1.608282,2.3009880000000003",1.0,dog_bark
1635,20688.flac,"0.0,13.173333",1.0,children_playing
1636,81722.aif,"0.0,60.501333",2.0,dog_bark
1637,95536.mp3,"0.0,15.202774",2.0,dog_bark
1638,192382.wav,"0.0,219.074604",1.0,children_playing
1639,31325.mp3,"30.179274,48.803063",1.0,dog_bark
1640,200786.wav,"15.109316,19.784022",1.0,engine_idling
1641,49809.wav,"0.0,0.718468",2.0,dog_bark
1642,69598.wav,"37.114396,39.647137",1.0,drilling
1643,72259.mp3,"51.710707,55.66083100000001",2.0,car_horn
1644,115536.wav,"0.0,2.964396",1.0,dog_bark
1645,59037.mp3,"23.445803,36.534788",2.0,children_playing
1646,160575.wav,"1.351494,2.38668",2.0,dog_bark
1647,180156.wav,"4.837396,7.194528",2.0,car_horn
1648,146709.wav,"0.0,144.149342",1.0,air_conditioner
1649,51022.wav,"21.978226,23.65962",2.0,dog_bark
1650,143604.mp3,"3.311464,5.678107",1.0,engine_idling
1651,208030.wav,"6.1176059999999985,7.154742999999999",1.0,dog_bark
1652,160011.wav,"2.084127,78.77999399999999",2.0,children_playing
1653,119455.wav,"0.446601,19.624158",1.0,engine_idling
1654,19338.wav,"15.400867000000002,20.069908",1.0,engine_idling
1655,115411.wav,"4.352579,5.374102",2.0,dog_bark
1656,99812.wav,"332.289233,334.821332",2.0,car_horn
1657,209672.wav,"22.590603,24.009083",1.0,dog_bark
1658,81787.aif,"0.0,110.613333",2.0,children_playing
1659,52740.wav,"68.09769,79.72013199999998",2.0,dog_bark
1660,73168.wav,"2.413075,3.452636",1.0,car_horn
1661,176003.wav,"0.031344,1.1523",1.0,car_horn
1662,143115.wav,"40.69654,41.149282",2.0,car_horn
1663,167702.wav,"32.628699,35.670665",1.0,drilling
1664,7383.mp3,"3.9021,10.356701",1.0,dog_bark
1665,34621.wav,"19.73552,20.346726",1.0,drilling
1666,102857.wav,"0.0,64.47603199999999",1.0,engine_idling
1667,157649.wav,"0.312331,7.912396",2.0,dog_bark
1668,54976.aiff,"77.297309,87.437218",1.0,drilling
1669,51022.wav,"23.65962,24.019919",1.0,dog_bark
1670,125791.aif,"0.0,39.675351",1.0,dog_bark
1671,173994.wav,"0.0,112.338969",1.0,dog_bark
1672,180029.wav,"24.85991,26.085878",1.0,drilling
1673,72265.wav,"47.997381,51.911957",2.0,dog_bark
1674,85544.aif,"16.502772,17.868519",1.0,dog_bark
1675,80806.mp3,"0.0,25.991837",2.0,children_playing
1676,51022.wav,"9.262681,9.642997",1.0,dog_bark
1677,65750.flac,"302.574257,305.267327",2.0,dog_bark
1678,155299.wav,"0.0,7.393998",2.0,dog_bark
1679,51022.wav,"32.336816,32.627056",1.0,dog_bark
1680,175917.wav,"113.576188,133.999976",2.0,dog_bark
1681,51022.wav,"24.019919,26.301811",2.0,dog_bark
1682,165642.wav,"0.0,4.635601",1.0,drilling
1683,189986.flac,"0.0,5.97",1.0,air_conditioner
1684,96159.aif,"4.5344050000000005,5.107616",1.0,drilling
1685,204773.wav,"0.0,1.011735",1.0,dog_bark
1686,168037.wav,"269.010512,270.54988",1.0,drilling
1687,175917.wav,"253.304788,260.278765",2.0,dog_bark
1688,49808.wav,"56.882376,108.535011",2.0,dog_bark
1689,190680.wav,"15.428781,16.655647000000002",2.0,dog_bark
1690,179860.wav,"0.257272,1.348884",1.0,car_horn
1691,186938.wav,"2.72963,4.539396",1.0,engine_idling
1692,196073.wav,"0.0,3.788776",1.0,children_playing
1693,7965.mp3,"187.295713,188.663395",2.0,dog_bark
1694,197075.wav,"16.253779,27.286136",2.0,dog_bark
1695,26255.flac,"43.313798,47.90149",2.0,dog_bark
1696,180029.wav,"2.11139,5.17631",1.0,drilling
1697,44278.wav,"9.944179,10.282033",2.0,car_horn
1698,190680.wav,"5.960838,7.49752",2.0,dog_bark
1699,44831.mp3,"20.35725,21.81134",2.0,dog_bark
1700,39854.wav,"1.665405,6.5673520000000005",1.0,engine_idling
1701,43787.mp3,"8.866392,10.710337",1.0,dog_bark
1702,197074.wav,"0.0,29.112",1.0,dog_bark
1703,102102.wav,"1.573952,4.673824",2.0,dog_bark
1704,22347.mp3,"18.188915,25.519546",1.0,dog_bark
1705,54383.mp3,"0.0,26.226939",1.0,air_conditioner
1706,181624.wav,"13.108337,14.308395999999998",1.0,drilling
1707,160009.wav,"0.0,114.267574",1.0,children_playing
1708,37560.aiff,"0.0,15.399184",1.0,drilling
1709,165785.wav,"2.556837,3.64225",1.0,drilling
1710,193698.wav,"0.0,303.036354",2.0,children_playing
1711,186936.wav,"0.0,7.58625",1.0,engine_idling
1712,65381.wav,"30.032965,32.089012",2.0,dog_bark
1713,20015.mp3,"23.26305,80.069703",2.0,dog_bark
1714,156194.wav,"0.0,0.25208600000000003",2.0,car_horn
1715,182800.wav,"25.672099,39.355617",1.0,children_playing
1716,146244.wav,"0.0,2.046729",1.0,drilling
1717,34621.wav,"7.993931,9.859718",1.0,drilling
1718,174786.wav,"0.0,192.501625",1.0,children_playing
1719,196063.wav,"0.0,8.509184",1.0,children_playing
1720,156418.wav,"8.43488,13.040592",1.0,dog_bark
1721,50613.wav,"0.0,0.5385260000000001",1.0,dog_bark
1722,189982.flac,"0.0,99.799977",1.0,air_conditioner
1723,71309.mp3,"38.797915,39.249054",2.0,car_horn
1724,71171.wav,"75.210727,83.47014200000002",1.0,drilling
1725,151005.flac,"11.445447,20.86172",1.0,drilling
1726,178497.wav,"0.0,19.493521",1.0,dog_bark
1727,31150.wav,"0.0,101.749841",2.0,children_playing
1728,80589.wav,"0.0,12.782018",1.0,air_conditioner
1729,89213.wav,"0.0,1.612336",1.0,dog_bark
1730,79584.mp3,"0.380235,24.525176",1.0,dog_bark
1731,16692.wav,"1.209128,25.758741",1.0,engine_idling
1732,74965.wav,"3.004919,14.233825",1.0,drilling
1733,34871.wav,"21.06154,21.68744",1.0,dog_bark
1734,104421.mp3,"90.152072,103.78449",1.0,children_playing
1735,168037.wav,"123.054725,124.949332",1.0,drilling
1736,2937.wav,"0.0,0.474663",1.0,car_horn
1737,205874.wav,"2.976682,4.721081",1.0,drilling
1738,7965.mp3,"87.520498,88.56394499999998",2.0,dog_bark
1739,71088.wav,"5.366155,7.970164",1.0,drilling
1740,203128.mp3,"13.517599,15.291487",1.0,dog_bark
1741,86284.mp3,"25.548308,27.350204",2.0,dog_bark
1742,4918.wav,"3.154667,4.2293330000000005",1.0,dog_bark
1743,34621.wav,"5.7903730000000015,7.817003",1.0,drilling
1744,155280.wav,"2.112855,37.734848",2.0,children_playing
1745,18594.flac,"11.503499,11.939286",1.0,car_horn
1746,97331.mp3,"0.0,226.115918",1.0,children_playing
1747,191687.wav,"0.0,34.889841",1.0,dog_bark
1748,171464.wav,"0.7191770000000001,2.434138",1.0,dog_bark
1749,187356.wav,"20.664779,21.032153",2.0,car_horn
1750,181624.wav,"8.538881,11.192858",1.0,drilling
1751,167701.wav,"18.635706,31.503218",1.0,drilling
1752,37869.flac,"6.003142,7.4144770000000015",1.0,dog_bark
1753,173995.wav,"0.0,59.48716700000001",1.0,dog_bark
1754,174026.wav,"2.7592,6.729757000000001",2.0,dog_bark
1755,161010.wav,"148.909412,149.647969",2.0,car_horn
1756,178115.wav,"2.807855,3.269359",2.0,car_horn
1757,20841.flac,"15.560942,16.719735",2.0,dog_bark
1758,209672.wav,"27.16126,28.842421",1.0,dog_bark
1759,76221.wav,"0.0,25.406032",1.0,children_playing
1760,155294.wav,"0.0,2.680454",2.0,dog_bark
1761,165067.wav,"0.0,258.274127",2.0,children_playing
1762,52441.wav,"67.97922700000001,70.73182",1.0,dog_bark
1763,175917.wav,"148.446071,153.676553",2.0,dog_bark
1764,158607.wav,"5.835416,8.213583999999999",1.0,dog_bark
1765,201207.wav,"114.141176,115.983137",1.0,dog_bark
1766,128891.wav,"0.0,29.846327",1.0,dog_bark
1767,72265.wav,"171.627883,174.899768",2.0,dog_bark
1768,166931.wav,"85.428614,96.021212",1.0,drilling
1769,209672.wav,"20.436615,21.172123000000006",1.0,dog_bark
1770,161923.wav,"123.627703,127.679058",1.0,dog_bark
1771,144068.wav,"72.86410699999998,78.266329",1.0,engine_idling
1772,39532.wav,"4.020729,4.989753",1.0,drilling
1773,181624.wav,"35.81714500000001,37.77878",1.0,drilling
1774,47926.wav,"3.315978,3.752291000000002",1.0,dog_bark
1775,196085.wav,"0.0,13.208865",1.0,children_playing
1776,201207.wav,"117.372157,119.123529",1.0,dog_bark
1777,81117.aiff,"0.70594,15.967253",1.0,drilling
1778,190680.wav,"0.532882,1.598645",2.0,dog_bark
1779,168037.wav,"370.158844,373.78228",1.0,drilling
1780,174026.wav,"9.219766,29.072548",2.0,dog_bark
1781,180257.wav,"0.0,14.890667",1.0,dog_bark
1782,139948.aiff,"13.081499,14.39375",2.0,dog_bark
1783,74950.mp3,"37.70985,40.474795",1.0,dog_bark
1784,199929.wav,"6.5228449999999984,10.050322",1.0,drilling
1785,71171.wav,"64.823888,71.706733",1.0,drilling
1786,103249.wav,"0.0,42.493458",1.0,engine_idling
1787,52171.wav,"10.990127,11.60331",1.0,dog_bark
1788,57553.aif,"0.0,1.715423",2.0,dog_bark
1789,50629.mp3,"15.513354,48.543872",1.0,drilling
1790,179866.wav,"0.913249,1.628663",1.0,car_horn
1791,107842.wav,"26.085574,27.89771",1.0,drilling
1792,51022.wav,"31.115803000000003,31.586193",1.0,dog_bark
1793,196127.wav,"0.0,13.121198",1.0,dog_bark
1794,180128.flac,"33.73435,41.088758",1.0,drilling
1795,118440.mp3,"3.0998240000000004,4.0391650000000014",1.0,drilling
1796,77233.wav,"0.0,215.0",2.0,dog_bark
1797,125554.wav,"0.572068,2.220842",1.0,dog_bark
1798,147764.wav,"16.29855,17.329482000000002",1.0,drilling
1799,114280.wav,"0.0,6.006354",1.0,dog_bark
1800,180156.wav,"9.639612,11.064445",2.0,car_horn
1801,197554.aiff,"10.850495,210.75",1.0,children_playing
1802,102842.flac,"113.061785,166.844649",2.0,dog_bark
1803,26255.flac,"39.66359,40.252012",2.0,dog_bark
1804,94868.wav,"1.076489,1.468143",1.0,car_horn
1805,204773.wav,"21.862283,29.56027000000001",1.0,dog_bark
1806,179386.wav,"0.0,13.179937",1.0,dog_bark
1807,26255.flac,"26.159818,26.67842700000001",2.0,dog_bark
1808,144068.wav,"116.444222,138.053108",1.0,engine_idling
1809,190996.wav,"12.510494,37.152376",2.0,dog_bark
1810,158607.wav,"11.16796,13.21088",1.0,dog_bark
1811,143651.aiff,"0.0,139.13396799999998",2.0,children_playing
1812,116484.wav,"0.0,36.430068",1.0,dog_bark
1813,187356.wav,"28.471474,34.211690000000004",2.0,car_horn
1814,164194.wav,"59.864282,122.725828",1.0,children_playing
1815,17973.wav,"0.0,80.47496600000002",1.0,children_playing
1816,175915.wav,"119.071504,139.77959199999998",2.0,dog_bark
1817,118558.mp3,"47.41349500000001,58.942612",1.0,engine_idling
1818,160092.wav,"0.013784,0.142207",1.0,dog_bark
1819,26184.wav,"0.825952,2.699454",1.0,engine_idling
1820,4912.wav,"0.516166,0.859574",1.0,dog_bark
1821,35629.mp3,"2.06663,4.87455",1.0,dog_bark
1822,71171.wav,"0.813427,12.952263",1.0,drilling
1823,101729.wav,"0.0,84.580021",2.0,air_conditioner
1824,168037.wav,"109.839841,111.829179",1.0,drilling
1825,38236.flac,"0.716526,2.328708",1.0,dog_bark
1826,86284.mp3,"17.911702,22.95272000000001",2.0,dog_bark
1827,162540.wav,"5.888426,6.202331",1.0,car_horn
1828,13579.mp3,"1.619075,163.094777",1.0,children_playing
1829,155283.wav,"401.371559,402.010695",2.0,car_horn
1830,201652.wav,"182.94604,206.011386",1.0,engine_idling
1831,89679.wav,"20.28993,21.585583",2.0,car_horn
1832,24364.flac,"0.633371,29.803632",1.0,drilling
1833,97392.wav,"0.0,2.773946",1.0,dog_bark
1834,144068.wav,"152.645693,161.407833",1.0,engine_idling
1835,209672.wav,"58.788104,59.68122",1.0,dog_bark
1836,100648.mp3,"25.332994,27.197502000000004",2.0,car_horn
1837,66623.aiff,"0.0,17.791655",1.0,drilling
1838,17810.wav,"0.30895100000000003,0.689991",1.0,dog_bark
1839,104421.mp3,"0.0,73.299937",2.0,children_playing
1840,33696.flac,"88.093536,97.559728",2.0,dog_bark
1841,51022.wav,"18.520358,19.015769",1.0,dog_bark
1842,180126.flac,"38.138375,47.4021",1.0,drilling
1843,191382.mp3,"0.61858,24.197378",1.0,dog_bark
1844,72259.mp3,"224.438833,264.29917",2.0,car_horn
1845,166101.wav,"39.498414,42.722775",1.0,engine_idling
1846,61077.wav,"32.394596,34.434647",1.0,dog_bark
1847,166268.wav,"0.940874,2.382484",1.0,dog_bark
1848,189895.flac,"0.0,5.642417",1.0,dog_bark
1849,29722.wav,"0.0,16.329161",1.0,drilling
1850,113203.aif,"94.771765,97.308235",1.0,engine_idling
1851,203128.mp3,"36.805814,37.991568",1.0,dog_bark
1852,51022.wav,"9.642997,13.77142",2.0,dog_bark
1853,165645.wav,"1.882852,2.822329",1.0,drilling
1854,34621.wav,"26.34619600000001,26.925233",1.0,drilling
1855,44110.wav,"21.626494,23.151439",1.0,dog_bark
1856,151005.flac,"0.524393,11.103451",1.0,drilling
1857,13577.mp3,"62.141427,63.81616",2.0,dog_bark
1858,155262.wav,"0.0,256.626939",2.0,children_playing
1859,153057.wav,"0.284091,1.383136",1.0,car_horn
1860,180132.flac,"6.65078,10.248058",1.0,drilling
1861,30832.mp3,"29.918825,30.86363",2.0,dog_bark
1862,164311.wav,"7.1741740000000025,10.683181",1.0,dog_bark
1863,33696.flac,"5.538044,8.307066",2.0,dog_bark
1864,85544.aif,"4.324864,6.0320480000000005",1.0,dog_bark
1865,26256.flac,"5.484338,9.168473",2.0,dog_bark
1866,111386.aif,"2.784895,22.642407",1.0,engine_idling
1867,180125.flac,"72.97305,111.768848",1.0,drilling
1868,51024.wav,"0.399669,60.549909",2.0,dog_bark
1869,113203.aif,"100.507647,108.318824",1.0,engine_idling
1870,167702.wav,"30.492081,32.628699",1.0,drilling
1871,69598.wav,"80.317112,83.921397",1.0,drilling
1872,71079.wav,"0.331563,1.544694",1.0,drilling
1873,13577.mp3,"46.055171,49.647033",2.0,dog_bark
1874,197073.wav,"24.485929,28.354165",1.0,dog_bark
1875,180029.wav,"30.61515,31.398407",1.0,drilling
1876,68389.wav,"7.818533,9.227161",1.0,dog_bark
1877,62048.wav,"0.0,17.800136",1.0,dog_bark
1878,203128.mp3,"10.083655,10.529498",1.0,dog_bark
1879,209672.wav,"46.284468,47.755484",1.0,dog_bark
1880,166101.wav,"0.0,10.992138",1.0,engine_idling
1881,185436.mp3,"249.998548,251.272606",2.0,car_horn
1882,176638.wav,"4.51208,5.0611690000000005",1.0,car_horn
1883,87275.wav,"1.817251,1.871768",2.0,car_horn
1884,147672.mp3,"3.781219,4.1618080000000015",1.0,dog_bark
1885,155130.wav,"71.566281,72.244063",1.0,car_horn
1886,209672.wav,"25.059808,26.110534",1.0,dog_bark
1887,113203.aif,"79.23588199999998,88.661176",1.0,engine_idling
1888,200786.wav,"110.690351,126.467483",1.0,engine_idling
