d3mIndex,filename,start-end-time-slice-of-recording,salience,class
13,7389.mp3,"160.76124199999995,195.690473",2.0,car_horn
14,196084.wav,"0.708236,10.35795",1.0,children_playing
20,118723.aif,"0.0,2.653802",1.0,drilling
22,54173.wav,"3.153856,70.266054",2.0,children_playing
24,69598.wav,"19.920982000000002,26.009301",2.0,drilling
25,43802.wav,"8.044597999999999,8.287148",2.0,car_horn
28,209992.wav,"409.108897,461.335564",1.0,engine_idling
33,4918.wav,"7.4672,8.389333",1.0,dog_bark
37,160366.aiff,"0.0,33.412042",1.0,dog_bark
39,180128.flac,"102.961713,107.27843100000001",1.0,drilling
46,71086.wav,"6.409867,8.598236",1.0,drilling
47,26255.flac,"7.928729,8.477257",2.0,dog_bark
48,159735.wav,"0.0,249.23656200000002",1.0,children_playing
53,71529.wav,"0.43567100000000003,9.314338000000001",1.0,drilling
54,102106.wav,"2.243852,3.8844769999999995",2.0,dog_bark
65,165567.aiff,"0.147106,4.364141",2.0,dog_bark
66,156362.wav,"309.117912,330.243958",2.0,drilling
71,4201.mp3,"1.8187369999999998,2.171462",2.0,dog_bark
83,190680.wav,"54.626557999999996,60.401506999999995",2.0,dog_bark
88,44110.wav,"35.046011,41.450781",1.0,dog_bark
92,30832.mp3,"14.801945000000002,16.250646",2.0,dog_bark
97,138465.wav,"19.212259,22.962543",2.0,car_horn
99,69598.wav,"5.601254,8.036582000000001",1.0,drilling
102,147764.wav,"0.441828,2.143685",1.0,drilling
105,49809.wav,"18.125926999999997,20.897161999999998",2.0,dog_bark
106,109711.aif,"0.0,0.6278520000000001",1.0,dog_bark
110,34621.wav,"15.617922,16.373887",1.0,drilling
123,180128.flac,"20.944075,24.861097",1.0,drilling
137,130030.wav,"0.0,2.594667",1.0,dog_bark
143,175851.wav,"0.348692,1.791682",1.0,car_horn
149,144028.aiff,"4.918658,11.766021",1.0,dog_bark
150,65749.flac,"75.445545,136.237624",2.0,dog_bark
154,34621.wav,"1.576268,2.444824",1.0,drilling
156,100032.wav,"0.0,0.317551",1.0,dog_bark
158,33641.wav,"8.283744,9.351237",1.0,dog_bark
159,4918.wav,"0.0,0.3744",1.0,dog_bark
162,180156.wav,"37.221565999999996,37.432653",2.0,car_horn
177,205874.wav,"8.33791,9.058074000000001",1.0,drilling
190,51022.wav,"6.520407,9.23766",2.0,dog_bark
191,190680.wav,"48.78964600000001,51.639943",2.0,dog_bark
198,204773.wav,"7.8299520000000005,8.753711000000001",1.0,dog_bark
204,159726.wav,"2.6068580000000003,4.466207",2.0,dog_bark
206,204240.wav,"0.0,76.90297",1.0,air_conditioner
209,22347.mp3,"14.420351,17.328512",1.0,dog_bark
213,83488.wav,"3.788674,4.073956",1.0,car_horn
217,137971.aiff,"3.919268,29.798252",2.0,children_playing
231,7965.mp3,"103.253584,103.854342",1.0,dog_bark
237,196083.wav,"0.0,4.467075",1.0,children_playing
240,30832.mp3,"294.71617599999996,296.038903",2.0,dog_bark
248,193697.wav,"0.0,284.9516040000001",2.0,children_playing
260,102103.wav,"1.97603,2.508892",2.0,dog_bark
268,155311.wav,"0.0,3.6919730000000004",1.0,dog_bark
270,167750.wav,"6.617749000000001,9.117787",1.0,drilling
271,30832.mp3,"301.959682,305.046045",2.0,dog_bark
275,196075.wav,"0.0,3.4997050000000005",1.0,children_playing
286,7965.mp3,"115.424649,116.56491100000001",2.0,dog_bark
289,177621.flac,"0.0,299.590958",2.0,air_conditioner
292,118496.wav,"1.394779,1.649762",2.0,car_horn
302,30832.mp3,"11.085712,12.093504",2.0,dog_bark
314,201652.wav,"258.809406,273.0",1.0,engine_idling
317,178521.wav,"0.0,261.98400000000004",1.0,children_playing
318,175296.wav,"0.0,490.094292",1.0,children_playing
320,165567.aiff,"18.388235,20.251576",2.0,dog_bark
324,33696.flac,"69.28994499999999,76.43788599999998",2.0,dog_bark
330,200161.wav,"7.8771330000000015,15.734171",1.0,dog_bark
335,9031.wav,"6.7577,9.055317",1.0,dog_bark
336,176638.wav,"6.7243520000000006,7.520133",1.0,car_horn
337,26255.flac,"5.305766,7.2505479999999976",2.0,dog_bark
338,108362.wav,"0.0,65.60335400000001",1.0,children_playing
341,66587.mp3,"3.077173,3.4286449999999995",1.0,dog_bark
344,108187.wav,"24.911435,26.304",2.0,dog_bark
346,33849.wav,"3.233909,4.6058699999999995",1.0,dog_bark
350,85662.mp3,"0.0,1.227755",1.0,dog_bark
356,174873.wav,"121.73776000000001,152.606978",1.0,dog_bark
358,152588.wav,"5.4649160000000006,11.582721000000001",1.0,dog_bark
359,125520.wav,"7.318297999999999,7.885858",1.0,car_horn
365,108187.wav,"3.5587760000000004,4.7966120000000005",2.0,dog_bark
367,12812.wav,"0.0,8.323084",1.0,engine_idling
375,43784.mp3,"2.739564,3.254543",1.0,dog_bark
377,190893.mp3,"0.0,60.029388",1.0,children_playing
379,196079.wav,"0.0,2.391542",1.0,children_playing
383,69883.wav,"1.6792080000000005,45.782178",2.0,dog_bark
385,69661.mp3,"0.0,142.158367",1.0,dog_bark
387,168037.wav,"291.9115740000001,293.900912",1.0,drilling
388,30832.mp3,"44.468823,55.93245699999999",2.0,dog_bark
389,205874.wav,"17.443995,18.804307",1.0,drilling
397,54086.wav,"3.066229,4.353687",1.0,car_horn
399,180937.wav,"0.0,46.689417",2.0,drilling
404,161010.wav,"123.329283,125.09103400000001",2.0,car_horn
408,186334.wav,"0.0,98.953447",1.0,children_playing
411,196059.wav,"0.0,6.8911789999999975",1.0,children_playing
414,34621.wav,"21.955163,22.469863",1.0,drilling
423,100648.mp3,"16.699509,17.104837",2.0,car_horn
424,156358.wav,"5.5472160000000015,23.088",1.0,engine_idling
430,72265.wav,"31.024479,33.127833",2.0,dog_bark
432,179865.wav,"0.31516900000000003,1.648178",2.0,car_horn
434,207962.wav,"0.4698350000000001,1.066165",1.0,dog_bark
440,205874.wav,"22.453142,23.893472",1.0,drilling
445,187356.wav,"79.720127,81.41923100000002",2.0,car_horn
447,29936.wav,"10.936539,13.114239999999999",2.0,dog_bark
449,151359.wav,"9.100817999999999,9.255836",1.0,car_horn
464,70098.wav,"8.225276,10.467619000000001",1.0,dog_bark
465,165785.wav,"5.132783,6.4169339999999995",1.0,drilling
474,169466.wav,"0.0,39.113516",2.0,drilling
476,200161.wav,"98.062264,100.89562099999999",1.0,dog_bark
483,52171.wav,"0.0,1.01411",1.0,dog_bark
486,153261.wav,"0.0,11.145578",1.0,air_conditioner
487,142003.wav,"0.0,70.0",1.0,children_playing
492,127443.wav,"115.01500800000001,144.858073",1.0,drilling
504,99812.wav,"181.14243100000002,183.284976",2.0,car_horn
508,15544.wav,"29.266659999999998,72.176",1.0,engine_idling
509,172593.wav,"0.0,64.829887",1.0,children_playing
516,165645.wav,"5.402966999999999,6.416511",1.0,drilling
523,95549.wav,"11.181689,60.975145999999995",2.0,dog_bark
524,196081.wav,"0.0,2.939683",1.0,children_playing
526,128030.wav,"3.851144,4.430814",1.0,dog_bark
533,72265.wav,"0.204493,2.6584060000000003",2.0,dog_bark
543,108187.wav,"10.954842,12.594974",2.0,dog_bark
549,20285.flac,"1.940273,7.7752550000000005",1.0,dog_bark
550,166931.wav,"37.418008,71.259295",1.0,drilling
560,58382.wav,"0.224342,6.021178",1.0,dog_bark
565,83488.wav,"2.859771,3.4407699999999997",1.0,car_horn
566,196072.wav,"0.0,2.9857139999999998",1.0,children_playing
568,116163.wav,"0.764195,1.036249",2.0,dog_bark
570,4912.wav,"2.370148,2.646139",1.0,dog_bark
577,118964.wav,"0.0,1.103896",1.0,dog_bark
583,168846.mp3,"67.019979,100.88215600000001",2.0,engine_idling
585,209992.wav,"108.409901,390.710866",1.0,engine_idling
607,4911.wav,"0.008108,0.21743800000000002",1.0,dog_bark
610,33641.wav,"20.944208,23.228642999999998",1.0,dog_bark
613,71080.wav,"3.1489,4.142377",1.0,drilling
640,39532.wav,"0.01157,1.093407",1.0,drilling
643,134717.wav,"0.0,60.0",1.0,air_conditioner
649,117536.wav,"31.064967,31.640588",2.0,car_horn
650,26185.wav,"0.007625,0.340057",1.0,car_horn
657,177742.flac,"0.0,449.69925",2.0,air_conditioner
664,116163.wav,"2.1397470000000003,3.2585290000000002",1.0,dog_bark
667,201207.wav,"4.982353,6.763922",1.0,dog_bark
670,146845.wav,"0.0,78.866576",1.0,air_conditioner
674,147019.wav,"0.688099,4.5951",1.0,drilling
681,125574.wav,"0.0,1.45068",1.0,dog_bark
684,190680.wav,"28.193153000000002,32.493384000000006",2.0,dog_bark
687,203128.mp3,"27.224919,30.658863",1.0,dog_bark
689,196057.wav,"0.0,4.927664",1.0,children_playing
696,29932.wav,"280.466103,281.91045099999997",2.0,car_horn
698,176787.wav,"0.0,65.63399799999999",1.0,engine_idling
700,185800.mp3,"0.0,7.019837",1.0,drilling
702,113216.aif,"2.693333,15.618692999999999",1.0,engine_idling
705,46391.wav,"55.73595200000001,61.488061",2.0,car_horn
728,189985.flac,"0.0,17.639955",1.0,air_conditioner
730,69598.wav,"60.201304,65.315492",1.0,drilling
731,71309.mp3,"0.406025,21.023056",2.0,car_horn
748,31840.wav,"0.020035,3.546214",1.0,dog_bark
756,33641.wav,"15.329196,16.31129",1.0,dog_bark
758,82811.wav,"44.333896,49.914936",1.0,dog_bark
762,167701.wav,"57.82985,60.196289",1.0,drilling
767,70098.wav,"13.373615,14.459593",1.0,dog_bark
774,72265.wav,"37.130049,40.226653999999996",2.0,dog_bark
778,155129.wav,"13.299686999999999,13.403296",1.0,car_horn
779,105088.wav,"0.0,52.51752800000001",1.0,dog_bark
793,61077.wav,"36.017445,39.71064000000001",1.0,dog_bark
794,34871.wav,"14.520883,16.054339000000002",1.0,dog_bark
800,72567.mp3,"49.130990000000004,50.273571000000004",2.0,car_horn
803,44110.wav,"5.517529,6.0720540000000005",1.0,dog_bark
804,29936.wav,"16.941228,19.022853",2.0,dog_bark
805,115537.wav,"1.665407,2.340997",1.0,dog_bark
815,34621.wav,"10.519177,11.017793",1.0,drilling
818,77751.wav,"7.339391,15.260119",1.0,drilling
821,83502.wav,"0.0,31.602086",2.0,air_conditioner
839,110918.wav,"0.0,120.99997900000001",1.0,dog_bark
842,107090.wav,"29.715744,30.54502",2.0,car_horn
845,160575.wav,"14.348835999999999,14.780164000000001",2.0,dog_bark
847,49809.wav,"1.416409,6.548325",2.0,dog_bark
848,7965.mp3,"99.150539,99.891899",2.0,dog_bark
851,155488.aiff,"78.992161,85.32843100000002",2.0,dog_bark
855,19496.flac,"41.420638000000004,48.43578400000001",2.0,dog_bark
864,65745.flac,"0.0,411.881188",2.0,dog_bark
875,74965.wav,"17.950435,27.423837",1.0,drilling
876,95562.wav,"4.679335,8.718843",1.0,drilling
893,24965.wav,"1.304201,1.8576759999999999",1.0,dog_bark
900,203128.mp3,"30.896014,36.426372",1.0,dog_bark
906,103199.mp3,"48.720146,50.591",2.0,drilling
911,204773.wav,"1.9354939999999998,3.8709879999999997",1.0,dog_bark
918,201207.wav,"11.776471,14.373332999999999",1.0,dog_bark
922,72220.wav,"28.733660999999998,46.892891",2.0,dog_bark
924,18594.flac,"12.833291000000001,13.464541",1.0,car_horn
937,58937.wav,"106.51021599999999,121.074347",1.0,drilling
938,113203.aif,"125.094118,128.351176",1.0,engine_idling
949,155317.wav,"3.0312639999999997,7.045453999999999",1.0,dog_bark
952,17913.wav,"8.462876,9.512387",2.0,drilling
957,7965.mp3,"95.717477,97.067061",1.0,dog_bark
968,72567.mp3,"32.753993,46.954645",2.0,car_horn
971,209672.wav,"12.976463,14.237333",1.0,dog_bark
978,71088.wav,"8.344424,9.1562",1.0,drilling
986,160575.wav,"11.185766000000001,12.537258999999999",2.0,dog_bark
988,33641.wav,"24.765832,25.470378",1.0,dog_bark
992,94868.wav,"0.179042,0.530411",1.0,car_horn
1001,117072.mp3,"1.328188,60.801506",1.0,dog_bark
1004,155488.aiff,"99.268224,112.785599",2.0,dog_bark
1009,71312.mp3,"157.03298999999996,164.112346",2.0,dog_bark
1010,160575.wav,"30.480493,32.694642",2.0,dog_bark
1011,197080.wav,"31.5456,31.978578999999996",1.0,dog_bark
1012,168037.wav,"219.656,221.92952799999998",1.0,drilling
1016,180128.flac,"69.227363,74.503351",1.0,drilling
1018,165645.wav,"4.295866,5.169073",1.0,drilling
1021,107190.wav,"0.0,0.794875",1.0,dog_bark
1033,165645.wav,"0.0,0.6938880000000001",1.0,drilling
1037,89679.wav,"22.362975,23.114454000000002",2.0,car_horn
1040,203128.mp3,"15.718359,17.70094",1.0,dog_bark
1047,19007.wav,"0.0,4.012653",2.0,drilling
1050,7965.mp3,"105.183677,105.950602",2.0,dog_bark
1053,174873.wav,"158.69386599999999,182.606641",1.0,dog_bark
1056,177620.flac,"63.75957800000001,78.058961",2.0,dog_bark
1059,196078.wav,"0.0,2.459478",1.0,children_playing
1061,167701.wav,"55.500386999999996,57.127314",1.0,drilling
1069,85544.aif,"33.119357,35.85085",1.0,dog_bark
1081,38231.flac,"13.437498000000001,19.679176000000002",1.0,dog_bark
1100,20841.flac,"32.63541,33.510417",2.0,dog_bark
1105,34621.wav,"17.065514999999998,17.70889",1.0,drilling
1106,102104.wav,"2.429279,3.2411209999999997",2.0,dog_bark
1114,177726.flac,"0.0,79.5795",2.0,air_conditioner
1122,71082.wav,"2.551296,4.3514349999999995",1.0,drilling
1126,175850.wav,"0.528684,2.269774",1.0,car_horn
1128,204773.wav,"5.234630999999999,6.466309",1.0,dog_bark
1135,71173.wav,"0.0,221.155625",2.0,children_playing
1136,39847.wav,"0.0,29.281115000000003",1.0,engine_idling
1141,196087.wav,"0.0,4.0344440000000015",1.0,children_playing
1142,118961.wav,"0.0,0.770312",1.0,dog_bark
1143,171464.wav,"11.705992,13.111154",1.0,dog_bark
1150,35296.mp3,"11.978519,15.341133",2.0,dog_bark
1165,209672.wav,"41.083375,43.184827",1.0,dog_bark
1189,99185.wav,"0.341411,0.9509110000000001",1.0,dog_bark
1199,71082.wav,"0.529763,1.8475810000000001",1.0,drilling
1200,74725.wav,"0.365119,7.790985000000001",1.0,dog_bark
1209,203128.mp3,"7.7026600000000025,9.723185",1.0,dog_bark
1212,33849.wav,"1.78355,2.410732",1.0,dog_bark
1214,207124.wav,"2.7363470000000003,5.596604",1.0,dog_bark
1215,203128.mp3,"25.432057999999998,25.925332",1.0,dog_bark
1220,202517.wav,"0.0,4.037104",1.0,air_conditioner
1224,20841.flac,"5.983159,6.952761",2.0,dog_bark
1227,85362.wav,"0.380052,2.660361",1.0,dog_bark
1232,176257.flac,"45.814378999999995,51.045588",1.0,dog_bark
1236,176631.wav,"28.32413,30.302215000000004",2.0,car_horn
1242,128160.wav,"0.0,34.381333000000005",1.0,engine_idling
1243,17074.wav,"3.5405269999999995,4.403714",2.0,car_horn
1245,77751.wav,"28.013219,33.572262",1.0,drilling
1252,180126.flac,"19.285883,27.547392",1.0,drilling
1259,26256.flac,"146.360644,163.274174",2.0,dog_bark
1262,72259.mp3,"132.867789,140.049832",2.0,car_horn
1266,168037.wav,"1.302542,3.3629269999999996",1.0,drilling
1271,175847.wav,"0.065415,0.881925",1.0,car_horn
1272,185801.mp3,"0.08895299999999999,8.361556",2.0,drilling
1279,194753.flac,"8.235294,9.2",2.0,dog_bark
1291,151149.wav,"0.0,119.426032",2.0,children_playing
1316,180132.flac,"28.192615999999997,33.483959999999996",1.0,drilling
1317,139948.aiff,"22.636325,23.825552",2.0,dog_bark
1324,30832.mp3,"240.98826499999998,242.436966",2.0,dog_bark
1329,43787.mp3,"1.5789469999999999,2.870812",1.0,dog_bark
1330,117048.wav,"0.0,81.972472",1.0,dog_bark
1332,69598.wav,"73.936553,76.07964100000002",1.0,drilling
1333,157950.wav,"0.0,1.410045",1.0,dog_bark
1334,156200.wav,"0.0,2.440907",1.0,children_playing
1336,52102.wav,"32.140691,32.564609000000004",2.0,car_horn
1341,154758.wav,"0.0,47.168211",1.0,engine_idling
1345,71087.wav,"4.427711,5.23158",1.0,drilling
1346,180029.wav,"8.820160000000003,12.872666",1.0,drilling
1349,118440.mp3,"8.195748,8.61258",1.0,drilling
1350,66587.mp3,"4.533271,5.0497190000000005",1.0,dog_bark
1351,13577.mp3,"30.916462,32.040296000000005",2.0,dog_bark
1360,71171.wav,"91.541842,93.856981",1.0,drilling
1361,180128.flac,"88.332836,95.367487",1.0,drilling
1362,180029.wav,"33.441687,34.054671",1.0,drilling
1369,104327.wav,"0.0,88.166167",2.0,children_playing
1376,51022.wav,"15.773079999999998,18.495337",2.0,dog_bark
1377,119420.wav,"4.9195910000000005,6.752704",1.0,dog_bark
1378,133090.wav,"0.0,161.208254",1.0,children_playing
1386,119449.wav,"1.381958,18.568493",1.0,engine_idling
1387,106015.wav,"3.484984,48.711462",1.0,engine_idling
1399,201207.wav,"42.787843,50.36705900000001",1.0,dog_bark
1400,54823.wav,"19.819143,27.708869",1.0,dog_bark
1401,85544.aif,"20.230123000000006,25.806921",1.0,dog_bark
1405,150341.wav,"15.377819,15.823344",1.0,dog_bark
1407,52171.wav,"1.6096059999999999,8.584563000000001",1.0,dog_bark
1414,99812.wav,"89.207778,94.271975",2.0,car_horn
1418,76566.wav,"45.358189,50.862066",2.0,dog_bark
1421,184449.wav,"0.0,72.57600000000002",1.0,children_playing
1422,71309.mp3,"45.51988,45.835677000000004",2.0,car_horn
1428,72259.mp3,"116.52864199999999,129.63586999999998",2.0,car_horn
1429,42937.wav,"0.0,8.214876",1.0,drilling
1448,135849.wav,"0.016276,0.9358540000000001",1.0,drilling
1449,197075.wav,"63.920301,69.983887",2.0,dog_bark
1461,46669.wav,"0.0,131.86036399999998",1.0,drilling
1467,7389.mp3,"68.122848,72.027979",2.0,car_horn
1469,197073.wav,"21.894212,22.503459",1.0,dog_bark
1470,169044.wav,"0.0,56.04666700000001",1.0,children_playing
1479,57320.wav,"0.0,101.583197",2.0,air_conditioner
1483,39852.wav,"0.0,6.672249000000001",1.0,engine_idling
1489,167701.wav,"10.390146000000001,15.418828",1.0,drilling
1493,156362.wav,"111.410002,122.57093200000001",2.0,drilling
1496,34871.wav,"34.268033,36.615158",1.0,dog_bark
1499,115411.wav,"15.322853,18.9426",2.0,dog_bark
1503,182739.wav,"0.0,204.71275",1.0,children_playing
1504,187377.flac,"0.0,7.878630999999999",1.0,drilling
1505,175846.wav,"0.143475,1.6353870000000001",1.0,car_horn
1509,52441.wav,"0.0,34.702339",1.0,dog_bark
1513,72265.wav,"24.422283,28.190793",2.0,dog_bark
1517,204919.mp3,"3.974607,6.064957",2.0,dog_bark
1519,75743.mp3,"0.0,50.599184",2.0,air_conditioner
1521,61077.wav,"44.529379999999996,48.820521",1.0,dog_bark
1525,162541.wav,"10.228976,10.667361",1.0,car_horn
1544,72261.wav,"1.4738790000000002,64.15708000000001",1.0,dog_bark
1547,19496.flac,"32.082004,37.265169",2.0,dog_bark
1548,181624.wav,"21.554906,22.108779000000002",1.0,drilling
1555,82811.wav,"39.617523999999996,42.093619",1.0,dog_bark
1556,73373.aif,"0.0,2.927007",1.0,dog_bark
1557,84699.wav,"27.828226,29.360575",1.0,drilling
1558,179858.wav,"0.627537,0.973626",1.0,car_horn
1563,85544.aif,"10.641442999999999,11.238957000000001",1.0,dog_bark
1564,30832.mp3,"297.99150099999997,299.440202",2.0,dog_bark
1575,204773.wav,"9.589492,13.548457",1.0,dog_bark
1577,204773.wav,"42.184968,55.689437",1.0,dog_bark
1578,94868.wav,"2.381256,2.75053",1.0,car_horn
1586,72259.mp3,"19.211964000000002,22.982537",2.0,car_horn
1588,69598.wav,"11.543453999999999,15.488685",2.0,drilling
1590,31323.mp3,"56.089812,57.338776",2.0,dog_bark
1594,197073.wav,"44.407340999999995,48.942847",1.0,dog_bark
1602,130961.wav,"253.231956,262.025979",1.0,drilling
1604,63292.wav,"0.0,7.507528",1.0,dog_bark
1610,186940.wav,"0.0,3.8365989999999996",1.0,engine_idling
1613,183894.flac,"98.082239,98.955375",2.0,car_horn
1619,85544.aif,"12.29172,14.653324",1.0,dog_bark
1621,35629.mp3,"7.300594,12.489632",1.0,dog_bark
1629,76566.wav,"140.036578,148.15577199999996",2.0,dog_bark
1634,207962.wav,"1.608282,2.3009880000000003",1.0,dog_bark
1638,192382.wav,"0.0,219.074604",1.0,children_playing
1641,49809.wav,"0.0,0.718468",2.0,dog_bark
1642,69598.wav,"37.114396,39.647137",1.0,drilling
1643,72259.mp3,"51.710707,55.66083100000001",2.0,car_horn
1646,160575.wav,"1.351494,2.38668",2.0,dog_bark
1654,19338.wav,"15.400867000000002,20.069907999999998",1.0,engine_idling
1658,81787.aif,"0.0,110.61333300000001",2.0,children_playing
1660,73168.wav,"2.413075,3.452636",1.0,car_horn
1663,167702.wav,"32.628699,35.670665",1.0,drilling
1674,85544.aif,"16.502772,17.868519",1.0,dog_bark
1676,51022.wav,"9.262681,9.642997",1.0,dog_bark
1685,204773.wav,"0.0,1.011735",1.0,dog_bark
1689,190680.wav,"15.428780999999999,16.655647000000002",2.0,dog_bark
1695,26255.flac,"43.313798,47.90149",2.0,dog_bark
1696,180029.wav,"2.11139,5.17631",1.0,drilling
1697,44278.wav,"9.944179,10.282033",2.0,car_horn
1704,22347.mp3,"18.188914999999998,25.519546",1.0,dog_bark
1711,186936.wav,"0.0,7.58625",1.0,engine_idling
1713,20015.mp3,"23.26305,80.069703",2.0,dog_bark
1716,146244.wav,"0.0,2.046729",1.0,drilling
1730,79584.mp3,"0.380235,24.525176000000002",1.0,dog_bark
1731,16692.wav,"1.209128,25.758741",1.0,engine_idling
1744,155280.wav,"2.1128549999999997,37.734848",2.0,children_playing
1748,171464.wav,"0.7191770000000001,2.434138",1.0,dog_bark
1753,173995.wav,"0.0,59.48716700000001",1.0,dog_bark
1754,174026.wav,"2.7592,6.729757000000001",2.0,dog_bark
1761,165067.wav,"0.0,258.274127",2.0,children_playing
1768,166931.wav,"85.428614,96.021212",1.0,drilling
1785,71171.wav,"64.823888,71.706733",1.0,drilling
1792,51022.wav,"31.115803000000003,31.586192999999998",1.0,dog_bark
1799,114280.wav,"0.0,6.006354",1.0,dog_bark
1806,179386.wav,"0.0,13.179936999999999",1.0,dog_bark
1807,26255.flac,"26.159817999999998,26.67842700000001",2.0,dog_bark
1808,144068.wav,"116.444222,138.053108",1.0,engine_idling
1813,187356.wav,"28.471474,34.211690000000004",2.0,car_horn
1823,101729.wav,"0.0,84.580021",2.0,air_conditioner
1834,144068.wav,"152.645693,161.407833",1.0,engine_idling
1838,17810.wav,"0.30895100000000003,0.689991",1.0,dog_bark
1841,51022.wav,"18.520357999999998,19.015769",1.0,dog_bark
1853,165645.wav,"1.882852,2.822329",1.0,drilling
1862,164311.wav,"7.1741740000000025,10.683181",1.0,dog_bark
1876,68389.wav,"7.818533,9.227161",1.0,dog_bark
1882,176638.wav,"4.51208,5.0611690000000005",1.0,car_horn
1888,200786.wav,"110.690351,126.467483",1.0,engine_idling
