time,value
0,0.0028581999999999995
1,1.0539
2,0.22108000000000003
3,0.7149
4,0.00024472
5,-0.38047
6,0.10295
7,0.053153
8,-0.35945
9,0.31801
10,-0.15184
11,-0.27288
12,0.24004
13,0.17065
14,0.53893
15,-0.018587
16,0.42043
17,-0.43701999999999996
18,0.31715
19,-0.043691
20,0.61605
21,0.69328
22,-0.67351
23,0.12994
24,-0.46243999999999996
25,0.35208
26,0.022411
27,0.52251
28,-0.33045
29,-0.24655
30,-0.35394000000000003
31,1.7645
32,1.7645
33,1.7645
34,1.7645
35,1.7645
36,1.7645
37,1.7645
38,1.7645
39,1.7645
40,1.7645
41,-1.7632
42,-1.7632
43,-1.7632
44,-1.7632
45,-1.7632
46,-1.7632
47,-1.7632
48,-1.7632
49,-1.7632
50,-1.7632
51,-0.1551
52,0.074391
53,-0.30805
54,0.67918
55,-0.22314
56,-0.51803
57,-0.041592000000000004
58,-0.037076
59,-1.7632
60,-1.7632
61,-1.7632
62,-1.7632
63,-1.7632
64,-1.7632
65,-1.7632
66,-1.7632
67,-1.7632
68,1.7645
69,1.7645
70,1.7645
71,1.7645
72,1.7645
73,1.7645
74,1.7645
75,1.7645
76,-0.6220399999999999
77,0.027156
78,0.14864000000000002
79,0.5799
80,-0.5303899999999999
81,0.3223
82,0.46391000000000004
83,0.5414100000000001
84,0.09818500000000001
85,0.37806999999999996
86,-0.24814
87,-0.51584
88,-0.23243000000000003
89,0.40495
90,0.23925
91,0.24899000000000002
92,-0.44227
93,-0.006030699999999999
94,-0.048952999999999997
95,0.10500999999999999
96,0.62407
97,-0.21879
98,-0.12186
99,0.22787
100,0.15777
101,0.14344
102,0.06796100000000001
103,-0.49582
104,0.15604
105,-0.13839
106,0.0098584
107,-0.27348
108,-0.16062
109,0.22551999999999997
110,-0.5426300000000001
111,0.041391000000000004
112,-0.65908
113,0.3653
114,-0.33628
115,-0.28169
116,-0.0061405
117,-0.39239
118,-0.44377
119,0.078078
120,0.6490600000000001
121,0.24877
122,-0.011406999999999999
123,0.24818
124,-0.18975999999999998
125,0.019332
126,-0.13953
127,-0.25364000000000003
