time,value
0,-0.22849
1,-0.22849
2,-0.22849
3,-0.22849
4,-0.22849
5,-0.22849
6,-0.22849
7,-0.22849
8,-0.22849
9,-0.22849
10,-0.22849
11,-0.22849
12,-0.22849
13,-0.22849
14,-0.22849
15,-0.22849
16,-0.22849
17,-0.22849
18,-0.22849
19,-0.22849
20,-0.22849
21,-0.22849
22,-0.22849
23,-0.22849
24,-0.22849
25,-0.22849
26,-0.22849
27,-0.22849
28,-0.22849
29,-0.22849
30,-0.22849
31,-0.22849
32,-0.22849
33,-0.22849
34,-0.22849
35,-0.22849
36,-0.22849
37,-0.22849
38,-0.22849
39,-0.22849
40,-0.22849
41,-0.22849
42,-0.22849
43,-0.22849
44,-0.22849
45,-0.22849
46,-0.22849
47,-0.22849
48,-0.22849
49,-0.22849
50,-0.22849
51,-0.22849
52,-0.22849
53,-0.22849
54,-0.22849
55,-0.22849
56,-0.22849
57,-0.22849
58,-0.22849
59,-0.22849
60,-0.22849
61,-0.22849
62,-0.22849
63,-0.22849
64,-0.22849
65,-0.22849
66,-0.22849
67,-0.22849
68,-0.22849
69,-0.22849
70,-0.22849
71,-0.22849
72,-0.22849
73,-0.22849
74,-0.22849
75,-0.22849
76,-0.22849
77,-0.22849
78,-0.22849
79,-0.22849
80,-0.22849
81,-0.22849
82,-0.22849
83,-0.22849
84,-0.22849
85,-0.22849
86,-0.22849
87,-0.22849
88,-0.22849
89,-0.22849
90,-0.22849
91,-0.22849
92,-0.22849
93,-0.22849
94,-0.22849
95,-0.22849
96,-0.22849
97,-0.22849
98,-0.22849
99,-0.22849
100,-0.22849
101,-0.22849
102,-0.22849
103,-0.22849
104,-0.22849
105,-0.22849
106,-0.22849
107,-0.22849
108,-0.22849
109,-0.22849
110,-0.22849
111,-0.22849
112,-0.22849
113,-0.22849
114,-0.22849
115,-0.22849
116,-0.22849
117,-0.22849
118,-0.22849
119,-0.22849
120,-0.22849
121,-0.22849
122,-0.22849
123,-0.22849
124,-0.22849
125,-0.22849
126,-0.22849
127,-0.22849
128,-0.22849
129,-0.22849
130,-0.22849
131,-0.22849
132,-0.22849
133,-0.22849
134,-0.22849
135,-0.22849
136,-0.22849
137,-0.22849
138,-0.22849
139,-0.22849
140,-0.22849
141,-0.22849
142,-0.22849
143,-0.22849
144,-0.22849
145,-0.22849
146,-0.22849
147,-0.22849
148,-0.22849
149,-0.22849
150,-0.22849
151,-0.22849
152,-0.22849
153,-0.22849
154,-0.22849
155,-0.22849
156,-0.22849
157,-0.22849
158,-0.22849
159,-0.22849
160,-0.22849
161,-0.22849
162,-0.22849
163,-0.22849
164,-0.22849
165,-0.22849
166,-0.22849
167,-0.22849
168,-0.22849
169,-0.22849
170,-0.22849
171,-0.22849
172,-0.22849
173,-0.22849
174,-0.22849
175,-0.22849
176,-0.22849
177,-0.22849
178,-0.22849
179,-0.22849
180,-0.22849
181,-0.22849
182,-0.22849
183,-0.22849
184,-0.22849
185,-0.22849
186,-0.22849
187,-0.22849
188,-0.22849
189,-0.22849
190,-0.22849
191,-0.22849
192,-0.22849
193,-0.22849
194,-0.22849
195,-0.22849
196,-0.22849
197,-0.22849
198,-0.22849
199,-0.22849
200,-0.22849
201,-0.22849
202,-0.22849
203,-0.22849
204,-0.22849
205,-0.22849
206,-0.22849
207,-0.22849
208,-0.22849
209,-0.22849
210,-0.22849
211,-0.22849
212,-0.22849
213,-0.22849
214,-0.22849
215,-0.22849
216,-0.22849
217,-0.22849
218,-0.22849
219,-0.22849
220,-0.22849
221,-0.22849
222,-0.22849
223,-0.22849
224,-0.22849
225,-0.22849
226,-0.22849
227,-0.22849
228,-0.22849
229,-0.22849
230,-0.22849
231,-0.22849
232,-0.22849
233,-0.22849
234,-0.22849
235,-0.22849
236,-0.22849
237,-0.22849
238,-0.22849
239,-0.22849
240,-0.22849
241,-0.22849
242,-0.22849
243,-0.22849
244,-0.22849
245,-0.22849
246,-0.22849
247,-0.22849
248,-0.22849
249,-0.22849
250,-0.22849
251,-0.22849
252,-0.22849
253,-0.22849
254,-0.22849
255,-0.22849
256,-0.22849
257,-0.22849
258,-0.22849
259,-0.22849
260,-0.22849
261,-0.22849
262,-0.22849
263,-0.22849
264,-0.22849
265,-0.22849
266,-0.22849
267,-0.22849
268,-0.22849
269,-0.22849
270,-0.22849
271,-0.22849
272,-0.22849
273,-0.22849
274,-0.22849
275,-0.22849
276,-0.22849
277,-0.22849
278,-0.22849
279,-0.22849
280,-0.22849
281,-0.22849
282,-0.22849
283,-0.22849
284,-0.22849
285,-0.22849
286,-0.22849
287,-0.22849
288,-0.22849
289,-0.22849
290,-0.22849
291,-0.22849
292,-0.22849
293,-0.22849
294,-0.22849
295,-0.22849
296,-0.22849
297,-0.22849
298,-0.22849
299,-0.22849
300,-0.22849
301,-0.22849
302,-0.22849
303,-0.22849
304,-0.22849
305,-0.22849
306,-0.22849
307,-0.22849
308,-0.22849
309,-0.22849
310,-0.22849
311,-0.22849
312,-0.22849
313,-0.22849
314,-0.22849
315,-0.22849
316,-0.22849
317,-0.22849
318,-0.22849
319,-0.22849
320,-0.22849
321,-0.22849
322,-0.22849
323,-0.22849
324,-0.22849
325,-0.22849
326,-0.22849
327,-0.22849
328,-0.22849
329,-0.22849
330,-0.22849
331,-0.22849
332,-0.22849
333,-0.22849
334,-0.22849
335,-0.22849
336,-0.22849
337,-0.22849
338,-0.22849
339,-0.22849
340,-0.22849
341,-0.22849
342,-0.22849
343,-0.22849
344,-0.22849
345,-0.22849
346,-0.22849
347,-0.22849
348,-0.22849
349,-0.22849
350,-0.22849
351,-0.22849
352,-0.22849
353,-0.22849
354,-0.22849
355,-0.22849
356,-0.22849
357,-0.22849
358,-0.22849
359,-0.22849
360,-0.22849
361,-0.22849
362,-0.22849
363,-0.22849
364,-0.22849
365,-0.22849
366,-0.22849
367,-0.22849
368,-0.22849
369,-0.22849
370,-0.22849
371,-0.22849
372,-0.22849
373,-0.22849
374,-0.22849
375,-0.22849
376,-0.22849
377,-0.22849
378,-0.22849
379,-0.22849
380,-0.22849
381,-0.22849
382,-0.22849
383,-0.22849
384,-0.22849
385,-0.22849
386,-0.22849
387,-0.22849
388,-0.22849
389,-0.22849
390,-0.22849
391,-0.22849
392,-0.22849
393,-0.22849
394,-0.22849
395,-0.22849
396,-0.22849
397,-0.22849
398,-0.22849
399,-0.22849
400,-0.22849
401,-0.22849
402,-0.22849
403,-0.22849
404,-0.22849
405,-0.22849
406,-0.22849
407,-0.22849
408,-0.22849
409,-0.22849
410,-0.22849
411,-0.22849
412,-0.22849
413,-0.22849
414,-0.22849
415,-0.22849
416,-0.22849
417,-0.22849
418,-0.22849
419,-0.22849
420,-0.22849
421,-0.22849
422,-0.22849
423,-0.22849
424,-0.22849
425,-0.22849
426,-0.22849
427,-0.22849
428,-0.22849
429,-0.22849
430,-0.22849
431,-0.22849
432,-0.22849
433,-0.22849
434,-0.22849
435,-0.22849
436,-0.22849
437,-0.22849
438,-0.22849
439,-0.22849
440,-0.22849
441,-0.22849
442,-0.22849
443,-0.22849
444,-0.22849
445,-0.22849
446,-0.22849
447,-0.22849
448,-0.22849
449,-0.22849
450,-0.22849
451,-0.22849
452,-0.22849
453,-0.22849
454,-0.22849
455,-0.22849
456,-0.22849
457,-0.22849
458,-0.22849
459,-0.22849
460,-0.22849
461,-0.22849
462,-0.22849
463,-0.22849
464,-0.22849
465,-0.22849
466,-0.22849
467,-0.22849
468,-0.22849
469,-0.22849
470,-0.22849
471,-0.22849
472,-0.22849
473,-0.22849
474,-0.22849
475,-0.22849
476,-0.22849
477,-0.22849
478,-0.22849
479,-0.22849
480,-0.22849
481,-0.22849
482,-0.22849
483,-0.22849
484,-0.22849
485,-0.22849
486,-0.22849
487,-0.22849
488,-0.22849
489,-0.22849
490,-0.22849
491,-0.22849
492,-0.22849
493,-0.22849
494,-0.22849
495,-0.22849
496,-0.22849
497,-0.22849
498,-0.22849
499,-0.22849
500,-0.22849
501,-0.22849
502,-0.22849
503,-0.22849
504,-0.22849
505,-0.22849
506,-0.22849
507,-0.22849
508,-0.22849
509,-0.22849
510,-0.22849
511,-0.22849
512,-0.22849
513,-0.22849
514,-0.22849
515,-0.22849
516,-0.22849
517,-0.22849
518,-0.22849
519,-0.22849
520,-0.22849
521,-0.22849
522,-0.22849
523,-0.22849
524,-0.22849
525,-0.22849
526,-0.22849
527,-0.22849
528,-0.22849
529,-0.22849
530,-0.22849
531,-0.22849
532,0.37856999999999996
533,3.4139
534,4.628
535,4.628
536,4.628
537,4.628
538,3.4139
539,4.628
540,4.628
541,4.628
542,4.628
543,4.628
544,3.4139
545,4.628
546,4.628
547,4.628
548,4.628
549,3.4139
550,4.628
551,4.628
552,3.4139
553,4.628
554,4.628
555,4.628
556,3.4139
557,4.628
558,4.628
559,3.4139
560,4.628
561,4.628
562,3.4139
563,4.628
564,4.628
565,4.628
566,3.4139
567,4.628
568,4.628
569,-0.22849
570,-0.22849
571,-0.22849
572,-0.22849
573,-0.22849
574,-0.22849
575,-0.22849
576,-0.22849
577,-0.22849
578,-0.22849
579,-0.22849
580,-0.22849
581,-0.22849
582,-0.22849
583,-0.22849
584,-0.22849
585,-0.22849
586,-0.22849
587,-0.22849
588,-0.22849
589,-0.22849
590,-0.22849
591,-0.22849
592,-0.22849
593,-0.22849
594,-0.22849
595,-0.22849
596,-0.22849
597,-0.22849
598,-0.22849
599,-0.22849
600,-0.22849
601,-0.22849
602,-0.22849
603,-0.22849
604,-0.22849
605,-0.22849
606,-0.22849
607,-0.22849
608,-0.22849
609,-0.22849
610,-0.22849
611,-0.22849
612,-0.22849
613,-0.22849
614,-0.22849
615,-0.22849
616,-0.22849
617,-0.22849
618,-0.22849
619,-0.22849
620,-0.22849
621,-0.22849
622,-0.22849
623,-0.22849
624,-0.22849
625,-0.22849
626,-0.22849
627,-0.22849
628,-0.22849
629,-0.22849
630,-0.22849
631,-0.22849
632,-0.22849
633,-0.22849
634,-0.22849
635,-0.22849
636,-0.22849
637,-0.22849
638,-0.22849
639,-0.22849
640,-0.22849
641,-0.22849
642,-0.22849
643,-0.22849
644,-0.22849
645,-0.22849
646,-0.22849
647,-0.22849
648,-0.22849
649,-0.22849
650,-0.22849
651,-0.22849
652,-0.22849
653,-0.22849
654,-0.22849
655,-0.22849
656,-0.22849
657,-0.22849
658,-0.22849
659,-0.22849
660,-0.22849
661,-0.22849
662,-0.22849
663,-0.22849
664,-0.22849
665,-0.22849
666,-0.22849
667,-0.22849
668,-0.22849
669,-0.22849
670,-0.22849
671,-0.22849
672,-0.22849
673,-0.22849
674,-0.22849
675,-0.22849
676,-0.22849
677,-0.22849
678,-0.22849
679,-0.22849
680,-0.22849
681,-0.22849
682,-0.22849
683,-0.22849
684,-0.22849
685,-0.22849
686,-0.22849
687,-0.22849
688,-0.22849
689,-0.22849
690,-0.22849
691,-0.22849
692,-0.22849
693,-0.22849
694,-0.22849
695,-0.22849
696,-0.22849
697,-0.22849
698,-0.22849
699,-0.22849
700,-0.22849
701,-0.22849
702,-0.22849
703,-0.22849
704,-0.22849
705,-0.22849
706,-0.22849
707,-0.22849
708,-0.22849
709,-0.22849
710,-0.22849
711,-0.22849
712,-0.22849
713,-0.22849
714,-0.22849
715,-0.22849
716,-0.22849
717,-0.22849
718,-0.22849
719,-0.22849
