time,value
0,0.41618
1,0.41618
2,0.41618
3,0.41618
4,0.41618
5,0.41618
6,0.41618
7,0.41618
8,0.41618
9,0.41618
10,0.41618
11,0.41618
12,0.41618
13,0.41618
14,0.41685
15,0.42444
16,0.43895
17,0.51486
18,0.58399
19,0.60044
20,0.6148
21,0.6148
22,0.6148
23,0.6148
24,0.6148
25,0.6148
26,0.6148
27,0.6148
28,0.6148
29,0.6148
30,0.61769
31,0.6328699999999999
32,0.66035
33,0.73626
34,0.80495
35,0.8473299999999999
36,0.88625
37,0.91345
38,0.9398200000000001
39,0.96354
40,0.9908600000000001
41,1.0288
42,1.0715
43,1.1271
44,1.1864
45,1.2551
46,1.3225
47,1.3869999999999998
48,1.4435
49,1.4814
50,1.5135
51,1.5328
52,1.5478
53,1.5541
54,1.5583
55,1.5583
56,1.5578
57,1.5566
58,1.5418
59,1.5039
60,1.4608
61,1.4092
62,1.3526
63,1.288
64,1.2189
65,1.143
66,1.0671
67,0.99118
68,0.91527
69,0.83936
70,0.7672399999999999
71,0.69987
72,0.6361100000000001
73,0.57665
74,0.50948
75,0.43356999999999996
76,0.36512
77,0.30471
78,0.24602
79,0.18909
80,0.12863
81,0.06474500000000001
82,-0.01523
83,-0.11010999999999999
84,-0.19626
85,-0.27469
86,-0.35744000000000004
87,-0.44378
88,-0.5274800000000001
89,-0.6090800000000001
90,-0.66582
91,-0.7037800000000001
92,-0.74173
93,-0.77968
94,-0.8176399999999999
95,-0.85559
96,-0.89355
97,-0.9315
98,-0.96945
99,-1.0074
100,-1.0221
101,-1.0234
102,-1.0318
103,-1.0442
104,-1.0692
105,-1.1008
106,-1.1494
107,-1.2063
108,-1.2633
109,-1.3202
110,-1.3679
111,-1.4115
112,-1.446
113,-1.4767
114,-1.4989
115,-1.5179
116,-1.5369
117,-1.5558
118,-1.5748
119,-1.5938
120,-1.6065
121,-1.6173
122,-1.6197
123,-1.6197
124,-1.6197
125,-1.6197
126,-1.6197
127,-1.6197
128,-1.6272
129,-1.6363
130,-1.651
131,-1.6668
132,-1.6694
133,-1.6694
134,-1.6694
135,-1.6694
136,-1.6694
137,-1.6694
138,-1.6694
139,-1.6694
140,-1.6694
141,-1.6694
142,-1.6540000000000001
143,-1.6369999999999998
144,-1.6282
145,-1.6203
146,-1.6151
147,-1.61
148,-1.5919
149,-1.5729
150,-1.5539
151,-1.535
152,-1.5276
153,-1.5206
154,-1.5204
155,-1.5204
156,-1.5204
157,-1.5204
158,-1.5204
159,-1.5204
160,-1.5204
161,-1.5202
162,-1.5133
163,-1.5058
164,-1.4859
165,-1.4651
166,-1.4271
167,-1.3874
168,-1.3216
169,-1.2539
170,-1.1621
171,-1.0685
172,-0.9545899999999999
173,-0.84073
174,-0.72687
175,-0.613
176,-0.49914
177,-0.38528
178,-0.27142
179,-0.15835
180,-0.050181
181,0.053087
182,0.12899000000000002
183,0.2075
184,0.29923
185,0.38977
186,0.47485
187,0.55819
188,0.6341
189,0.71001
190,0.78591
191,0.85821
192,0.9173600000000001
193,0.976
194,1.0329
195,1.0899
196,1.1468
197,1.2037
198,1.2607
199,1.3176
200,1.3745
201,1.4249
202,1.4585
203,1.4844
204,1.492
205,1.4915
206,1.4726
207,1.4418
208,1.3855
209,1.329
210,1.272
211,1.2151
212,1.1582
213,1.1017
214,1.046
215,1.0038
216,0.98485
217,0.97104
218,0.96567
219,0.9653799999999999
220,0.9729700000000001
221,0.9858100000000001
222,1.0064
223,1.0342
224,1.0721
225,1.1101
226,1.1481
227,1.1709
228,1.1747
229,1.156
230,1.1104
231,1.0418
232,0.9469
233,0.8743799999999999
234,0.82599
235,0.78275
236,0.7448
237,0.7015600000000001
238,0.65317
239,0.58065
240,0.48576
241,0.39962
242,0.32118
243,0.26116
244,0.21656999999999998
245,0.18378
246,0.16037
247,0.12868
248,0.090724
249,0.0629
250,0.042341000000000004
251,0.01595
252,-0.014412999999999999
253,-0.049388999999999995
254,-0.08734299999999999
255,-0.1253
256,-0.16325
257,-0.2012
258,-0.23915999999999998
259,-0.27710999999999997
260,-0.31506999999999996
261,-0.35718
262,-0.40146
263,-0.45381000000000005
264,-0.5101
265,-0.54089
266,-0.55987
267,-0.56035
268,-0.55276
269,-0.53194
270,-0.50569
271,-0.47008
272,-0.43086
273,-0.37864000000000003
274,-0.32171
275,-0.28604
276,-0.25756999999999997
277,-0.2488
278,-0.24627
279,-0.25864000000000004
280,-0.2754
281,-0.27901
282,-0.27901
283,-0.23058
284,-0.16985999999999998
285,-0.096831
286,-0.020923
287,0.047178
288,0.1136
289,0.14038
290,0.15936
291,0.16465
292,0.1675
293,0.17661
294,0.18673
295,0.20099
296,0.21586
297,0.21755
298,0.21755
299,0.2329
300,0.24998
301,0.2587
302,0.26661
303,0.26253000000000004
304,0.25747
305,0.23938
306,0.2204
307,0.21854
308,0.21759
309,0.20599
310,0.19397
311,0.18103
312,0.16806
313,0.1679
314,0.1679
