time,value
0,-0.97252
1,-0.97252
2,-0.97252
3,-0.97252
4,-0.97252
5,-0.97252
6,-0.97252
7,-0.97252
8,-0.97252
9,-0.97252
10,-0.97252
11,-0.97252
12,-0.97252
13,-0.97252
14,-0.9890399999999999
15,-1.0155
16,-1.053
17,-1.0578
18,-1.0591
19,-1.0591
20,-1.0591
21,-1.0591
22,-1.0591
23,-1.0591
24,-1.0591
25,-1.0631
26,-1.0859
27,-1.1184
28,-1.1457
29,-1.1457
30,-1.159
31,-1.1827
32,-1.2202
33,-1.286
34,-1.358
35,-1.433
36,-1.5081
37,-1.5831
38,-1.6581
39,-1.7331
40,-1.8081
41,-1.8809
42,-1.9355
43,-1.9791
44,-2.0166
45,-2.0541
46,-2.0812
47,-2.0982
48,-2.0982
49,-2.0982
50,-2.0982
51,-2.0982
52,-2.0982
53,-2.0677
54,-1.9958
55,-1.8869
56,-1.7943
57,-1.7193
58,-1.6443
59,-1.5693
60,-1.4983
61,-1.4569999999999999
62,-1.4182
63,-1.3807
64,-1.3432
65,-1.3056
66,-1.2681
67,-1.2306
68,-1.1931
69,-1.1633
70,-1.1473
71,-1.1457
72,-1.1294
73,-1.0922
74,-1.0547
75,-1.0172
76,-0.97969
77,-0.94219
78,-0.90469
79,-0.86718
80,-0.82968
81,-0.7921699999999999
82,-0.7539600000000001
83,-0.71315
84,-0.64657
85,-0.5715600000000001
86,-0.49656000000000006
87,-0.42155
88,-0.35946999999999996
89,-0.31921
90,-0.28146
91,-0.24395999999999998
92,-0.20645
93,-0.19735999999999998
94,-0.19322
95,-0.19322
96,-0.19322
97,-0.17944000000000002
98,-0.15461
99,-0.1171
100,-0.39200999999999997
101,-0.20449
102,-0.10465
103,0.17055
104,0.35807
105,0.10792
106,0.14542
107,0.18293
108,0.22043000000000001
109,0.23369
110,0.24179
111,0.24635
112,0.28386
113,0.32136
114,0.35886
115,0.39637
116,0.5009
117,0.63989
118,0.7477199999999999
119,0.80615
120,0.8436600000000001
121,0.88116
122,0.92491
123,0.97988
124,1.0549
125,1.1095
126,1.1553
127,1.1928
128,1.2303
129,1.2593
130,1.2788
131,1.2788
132,1.2602
133,1.2264
134,1.1889
135,1.1514
136,1.1187
137,1.1085
138,1.1056
139,1.1056
140,1.1056
141,1.1225
142,1.1492
143,1.1867
144,1.1919
145,1.1922
146,1.1922
147,1.1922
148,1.1922
149,1.1919
150,1.1828
151,1.1575
152,1.1227
153,1.1101
154,1.1056
155,1.1056
156,1.1056
157,1.1193
158,1.1431
159,1.1806
160,1.246
161,1.3146
162,1.3769999999999998
163,1.4172
164,1.4669
165,1.5328
166,1.6011
167,1.6539
168,1.6893
169,1.6821
170,1.6572
171,1.6197
172,1.5822
173,1.5338
174,1.4757
175,1.4007
176,1.3495
177,1.308
178,1.2705
179,1.2329999999999999
180,1.2049
181,1.1934
182,1.1885
183,1.1696
184,1.1321
185,1.1336
186,1.1542
187,1.1874
188,1.1537
189,1.126
190,1.1056
191,1.1056
192,1.1056
193,1.1039
194,1.0962
195,1.0659
196,1.0354
197,1.0213
198,1.0177
199,1.0025
200,0.96499
201,0.9274899999999999
202,0.8899799999999999
203,0.8524799999999999
204,0.81498
205,0.77747
206,0.73997
207,0.7024699999999999
208,0.66496
209,0.62746
210,0.58995
211,0.55245
212,0.51982
213,0.50327
214,0.4995
215,0.4995
216,0.4995
217,0.51218
218,0.5359
219,0.5734100000000001
220,0.6109100000000001
221,0.64842
222,0.68592
223,0.72342
224,0.74746
225,0.75903
226,0.75627
227,0.7317
228,0.6911
229,0.63512
230,0.5656899999999999
231,0.49068
232,0.41567
233,0.34066
234,0.26566
235,0.19065
236,0.46253
237,-0.21568
238,-0.10141
239,-0.10662999999999999
240,-0.10662999999999999
241,-0.10662999999999999
242,-0.10662999999999999
243,-0.10662999999999999
244,-0.10662999999999999
245,-0.10662999999999999
246,-0.10662999999999999
247,-0.10662999999999999
248,-0.10662999999999999
249,-0.11377999999999999
250,-0.13089
251,-0.1684
252,-0.22641999999999998
253,-0.29359
254,-0.3686
255,-0.44361000000000006
256,-0.51862
257,-0.59362
258,-0.6686300000000001
259,-0.74364
260,-0.81714
261,-0.8516100000000001
262,-0.84457
263,-0.80707
264,-0.76956
265,-0.73206
266,-0.69455
267,-0.65705
268,-0.60252
269,-0.5383
270,-0.46466999999999997
271,-0.42045
272,-0.38294
273,-0.34544
274,-0.30793000000000004
275,-0.27043
276,-0.23293000000000003
277,-0.20614000000000002
278,-0.19322
279,-0.19458
280,-0.22133000000000003
281,-0.2515
282,-0.27981
283,-0.27981
284,-0.27981
285,-0.27981
286,-0.27981
287,-0.27981
288,-0.27559
289,-0.26098000000000005
290,-0.22741
291,-0.17876
292,-0.11092
293,-0.21568
294,0.05197
295,0.23949
296,0.10812999999999999
297,0.17556
298,0.2458
299,0.2833
300,0.32081
301,0.35831
302,0.39582
303,0.43332
304,0.47081999999999996
305,0.5083300000000001
306,0.54583
307,0.57491
308,0.58457
309,0.58609
310,0.58609
311,0.58609
312,0.58609
313,0.58609
314,0.58609
315,1.0503
316,1.0503
317,1.0503
318,1.0503
319,1.0503
320,1.0503
321,1.0503
322,1.0503
323,1.0503
324,1.0503
325,1.0503
326,1.0503
327,1.0503
328,1.0503
329,1.0503
330,1.0503
331,1.0503
332,1.0503
333,1.0503
334,1.0503
335,1.0503
336,1.0503
337,1.0503
338,1.0503
339,1.0503
340,1.0569
341,1.0957
342,1.1508
343,1.197
344,1.197
345,1.197
346,1.197
347,1.197
348,1.197
349,1.1895
350,1.1713
351,1.1101
352,1.0684
353,1.05
354,1.0421
355,1.0026
356,0.93534
357,0.8372
358,0.72033
359,0.6046100000000001
360,0.53872
361,0.47452
362,0.41096000000000005
363,0.34741
364,0.32484
365,0.31656999999999996
366,0.31656999999999996
367,0.31656999999999996
368,0.31656999999999996
369,0.31656999999999996
370,0.31656999999999996
371,0.31656999999999996
372,0.31401999999999997
373,0.25327
374,0.15394000000000002
375,0.17461
376,-0.17588
377,-0.10215
378,-0.16571
379,-0.22926
380,-0.25826
381,-0.26765
382,-0.25783
383,-0.20403
384,-0.12742
385,-0.13105999999999998
386,0.49063
387,0.16887
388,0.16981
389,0.16983
390,0.16983
391,0.16983
392,0.16983
393,0.16983
394,0.16983
395,0.16983
396,0.19851
397,0.24313
398,0.29546999999999995
399,0.26049
400,0.19693
401,0.13338
402,0.3551
403,0.14687
404,0.12351
405,0.15068
406,-0.18231
407,-0.5000899999999999
408,-0.16477
409,-0.22833
410,-0.29188000000000003
411,-0.35544000000000003
412,-0.39565
413,-0.41713
414,-0.41713
415,-0.41713
416,-0.42352
417,-0.45155
418,-0.50685
419,-0.5704100000000001
420,-0.6339600000000001
421,-0.69752
422,-0.76107
423,-0.82463
424,-0.88818
425,-0.9517399999999999
426,-1.0153
427,-1.0789
428,-1.1238
429,-1.1508
430,-1.1508
431,-1.1887
432,-1.246
433,-1.2857
434,-1.2976
435,-1.2976
436,-1.2976
437,-1.2976
438,-1.2976
439,-1.2976
440,-1.2976
441,-1.2976
442,-1.2976
443,-1.2976
444,-1.2976
445,-1.2976
446,-1.2976
447,-1.3607
448,-1.4732
449,-1.5807
450,-1.6602
451,-1.7156
452,-1.7329
453,-1.7445
454,-1.7677
455,-1.8312
456,-1.8662
457,-1.8845
458,-1.8845
459,-1.8298
460,-1.7774
461,-1.7395
462,-1.7378
463,-1.7378
464,-1.7378
465,-1.7378
466,-1.7378
467,-1.7378
468,-1.7378
469,-1.7378
470,-1.7378
471,-1.7378
472,-1.7378
473,-1.7378
474,-1.7378
475,-1.7378
476,-1.7228
477,-1.6798
478,-1.5621
479,-1.4349
480,-1.3078
481,-1.1807
482,-1.0536
483,-0.9300299999999999
484,-0.8786200000000001
485,-0.85734
486,-0.85734
487,-0.85734
488,-0.85734
489,-0.85734
490,-0.85734
491,-0.8976799999999999
492,-0.9545399999999999
493,-1.0181
494,-1.0817
495,-1.1611
496,-1.2686
497,-1.3812
498,-1.4443
499,-1.4443
500,-1.4443
501,-1.4443
502,-1.4406
503,-1.3804
504,-1.3181
505,-1.2546
506,-1.1909999999999998
507,-1.0935
508,-0.9798399999999999
509,-0.8658100000000001
510,-0.79005
511,-0.72649
512,-0.66294
513,-0.60173
514,-0.56386
515,-0.56386
516,-0.53689
517,-0.4919
518,-0.42833999999999994
519,-0.36479
520,-0.30123
521,-0.23767
522,-0.17412
523,-0.13868
524,-0.12229000000000001
525,-0.11341
526,-0.32718
527,-0.32953000000000005
528,0.08949299999999999
529,0.12144
530,0.12144
531,0.12144
532,0.12144
533,0.12144
534,0.12144
535,0.12144
536,0.22682
537,0.45791000000000004
538,0.28105
539,0.47172
540,0.66156
541,0.84288
542,0.95025
543,1.0191
544,1.1139
545,1.2316
546,1.3444
547,1.4136
548,1.4618
549,1.4905
550,1.4905
551,1.4080000000000001
552,1.3042
553,1.1878
554,1.1213
555,1.0577
556,0.9942
557,0.93158
558,0.9399700000000001
559,1.0035
560,1.0671
561,1.1306
562,1.1844
563,1.1943
564,1.2213
565,1.2792
566,1.4064
567,1.4639
568,1.4883
569,1.4817
570,1.425
571,1.3476
572,1.2509
573,1.125
574,1.0277
575,0.95968
576,0.87323
577,0.76332
578,0.64773
579,0.61969
580,0.61832
581,0.64089
582,0.70444
583,0.768
584,0.83155
585,0.8951100000000001
586,0.9586600000000001
587,1.0222
588,1.0858
589,1.1493
590,1.1888
591,1.1968
592,1.197
593,1.197
594,1.1947
595,1.1493
596,1.0933
597,1.0297
598,0.96614
599,0.8791100000000001
600,0.77454
601,0.6474300000000001
602,0.6127
603,0.6100399999999999
604,0.6100399999999999
605,0.6100399999999999
606,0.59116
607,0.53975
608,0.49046000000000006
609,0.46331000000000006
610,0.46331000000000006
611,0.46331000000000006
612,0.46331000000000006
613,0.46331000000000006
614,0.46331000000000006
615,0.44466000000000006
616,0.4091
617,0.34554
618,0.32129
619,0.31656999999999996
620,0.31656999999999996
621,0.31656999999999996
622,0.3023
623,0.2551
624,0.19413
625,0.13057
626,0.34108
627,0.16387000000000002
628,-0.29447
629,-0.12365
630,0.84667
631,0.84667
632,0.84667
633,0.84667
634,0.84667
635,0.84667
636,0.84667
637,0.84667
638,0.84667
639,0.84667
640,0.84667
641,0.84667
642,0.84667
643,0.84667
644,0.84667
645,0.84667
646,0.84667
647,0.84667
648,0.84667
649,0.84667
650,0.84667
651,0.84667
652,0.84667
653,0.84667
654,0.84667
655,0.85078
656,0.8747
657,0.90866
658,0.93715
659,0.93715
660,0.92325
661,0.8985299999999999
662,0.85935
663,0.8497299999999999
664,0.8420700000000001
665,0.83083
666,0.7930699999999999
667,0.75388
668,0.7145600000000001
669,0.67047
670,0.60693
671,0.53083
672,0.47378000000000003
673,0.42827
674,0.38909
675,0.3499
676,0.32158000000000003
677,0.30379
678,0.30379
679,0.27852
680,0.23848000000000003
681,0.18200999999999998
682,0.36371
683,-0.17106
684,-0.12791
685,-0.20459000000000002
686,-0.26213000000000003
687,-0.30054000000000003
688,-0.321
689,-0.32955999999999996
690,-0.32531
691,-0.29016
692,-0.24415
693,-0.18721
694,-0.10884
695,-0.14631
696,0.22024000000000002
697,0.10307000000000001
698,0.41558
699,0.17939000000000002
700,-0.12893
701,-0.10365
702,-0.18203
703,-0.2604
704,-0.30726
705,-0.32955999999999996
706,-0.3332
707,-0.39832
708,-0.47133
709,-0.54971
710,-0.62808
711,-0.7064600000000001
712,-0.78484
713,-0.8632200000000001
714,-0.9415899999999999
715,-1.0141
716,-1.0726
717,-1.1151
718,-1.1407
719,-1.1436
720,-1.1562
721,-1.1813
722,-1.2205
723,-1.23
724,-1.2382
725,-1.2476
726,-1.2868
727,-1.3259999999999998
728,-1.3652
729,-1.4044
730,-1.4436
731,-1.4788
732,-1.5007
733,-1.5058
734,-1.5161
735,-1.5499
736,-1.5789
737,-1.5963
738,-1.5963
739,-1.5963
740,-1.5963
741,-1.5963
742,-1.5963
743,-1.6077
744,-1.6303
745,-1.6695
746,-1.7086
747,-1.7454
748,-1.7699
749,-1.7772
750,-1.7772
751,-1.7772
752,-1.7707
753,-1.7524
754,-1.7133
755,-1.6954
756,-1.6859
757,-1.6839
758,-1.6469999999999998
759,-1.6166
760,-1.5963
761,-1.5963
762,-1.5768
763,-1.5427
764,-1.5156
765,-1.5058
766,-1.5058
767,-1.5058
768,-1.5058
769,-1.5058
770,-1.5058
771,-1.5058
772,-1.5058
773,-1.5058
774,-1.472
775,-1.4397
776,-1.4164
777,-1.4153
778,-1.3994
779,-1.3669
780,-1.3277
781,-1.2885
782,-1.2435
783,-1.1525
784,-1.0462
785,-0.93871
786,-0.8603299999999999
787,-0.78196
788,-0.70358
789,-0.6252
790,-0.57598
791,-0.53935
792,-0.51341
793,-0.51052
794,-0.51052
795,-0.51052
796,-0.49713999999999997
797,-0.45058000000000004
798,-0.37221
799,-0.29383000000000004
800,-0.21545
801,-0.13708
802,-0.28751
803,0.10438
804,0.49626000000000003
805,0.17643
806,0.25481
807,0.33318000000000003
808,0.41156000000000004
809,0.48994
810,0.5584899999999999
811,0.60978
812,0.64625
813,0.66571
814,0.66571
815,0.64535
816,0.615
817,0.57805
818,0.57604
819,0.57523
820,0.57523
821,0.57523
822,0.59617
823,0.6270600000000001
824,0.65818
825,0.66571
826,0.6729999999999999
827,0.6974899999999999
828,0.73429
829,0.7734800000000001
830,0.81267
831,0.86849
832,0.93542
833,1.0138
834,1.0922
835,1.1579
836,1.2086
837,1.2086
838,1.2259
839,1.2542
840,1.2824
841,1.2639
842,1.2298
843,1.2125
844,1.2086
845,1.1966
846,1.1583
847,1.1325
848,1.1181
849,1.1181
850,1.1181
851,1.1181
852,1.1181
853,1.1181
854,1.1463
855,1.1999
856,1.2783
857,1.3567
858,1.4318
859,1.4909
860,1.5359
861,1.5751
862,1.6143
863,1.6433
864,1.661
865,1.661
866,1.6101
867,1.5461
868,1.4743
869,1.4333
870,1.4053
871,1.3895
872,1.3892
873,1.3671
874,1.3279
875,1.2887
876,1.2495
877,1.2103
878,1.1711
879,1.1394
880,1.1181
881,1.1181
882,1.1181
883,1.1181
884,1.1181
885,1.1181
886,1.1181
887,1.1181
888,1.1181
889,1.0997
890,1.0623
891,1.0089
892,0.9411799999999999
893,0.86636
894,0.81852
895,0.7712600000000001
896,0.71815
897,0.63978
898,0.54361
899,0.43692
900,0.31935
901,0.20179
902,0.45868000000000003
903,-0.25695999999999997
904,-0.44311000000000006
905,-0.1682
906,-0.24656999999999998
907,-0.30254000000000003
908,-0.32955999999999996
909,-0.32955999999999996
910,-0.32955999999999996
911,-0.3265
912,-0.31688
913,-0.27769
914,-0.25298000000000004
915,-0.23908000000000001
916,-0.23908000000000001
917,-0.26757
918,-0.30593000000000004
919,-0.34512
920,-0.38431
921,-0.4235
922,-0.46269
923,-0.49377
924,-0.51052
925,-0.51052
926,-0.51052
927,-0.51052
928,-0.51052
929,-0.51052
930,-0.51052
931,-0.51052
932,-0.51052
933,-0.51052
934,-0.51052
935,-0.51052
936,-0.51052
937,-0.49291999999999997
938,-0.43472
939,-0.35953
940,-0.28115
941,-0.20278
942,-0.14536
943,-0.48057
944,-0.28462
