time,value
0,0.62102
1,0.29795
2,-0.069622
3,-0.42158999999999996
4,-0.70799
5,-0.90901
6,-1.0327
7,-1.0706
8,-1.0153
9,-0.88421
10,-0.67287
11,-0.38078
12,-0.030423000000000002
13,0.3447
14,0.68214
15,0.95442
16,1.1184
17,1.1538
18,1.0772
19,0.92286
20,0.7191
21,0.48036
22,0.2161
23,-0.069333
24,-0.39016999999999996
25,-0.72944
26,-1.0699
27,-1.3571
28,-1.5338
29,-1.5468
30,-1.3732
31,-1.0070000000000001
32,-0.5161
33,0.031007
34,0.54292
35,0.9536600000000001
36,1.2257
37,1.3554
38,1.3613
39,1.2725
40,1.1078
41,0.91402
42,0.68862
43,0.43853000000000003
44,0.17194
45,-0.095075
46,-0.34696
47,-0.56381
48,-0.71917
49,-0.81716
50,-0.85351
51,-0.83941
52,-0.7945
53,-0.72341
54,-0.62578
55,-0.50434
56,-0.36023
57,-0.20486
58,-0.045399
59,0.09904
60,0.20508
61,0.25754
62,0.27293
63,0.26339
64,0.24024
65,0.23113000000000003
66,0.26216
67,0.31299
68,0.36456
69,0.41153999999999996
70,0.42571000000000003
71,0.39499
72,0.31936
73,0.22221
74,0.11913
75,0.024427
76,-0.054065999999999996
77,-0.10509
78,-0.14645
79,-0.18391
80,-0.23573000000000002
81,-0.30017
82,-0.39357
83,-0.48626
84,-0.53262
85,-0.52273
86,-0.42378999999999994
87,-0.24416
88,0.009619299999999999
89,0.29535
90,0.56375
91,0.7701399999999999
92,0.8851
93,0.8867700000000001
94,0.78176
95,0.57799
96,0.32026
97,0.032068
98,-0.26281
99,-0.54303
100,-0.7925800000000001
101,-0.9965
102,-1.1371
103,-1.1886
104,-1.1324
105,-0.95345
106,-0.6624
107,-0.27591
108,0.14617
109,0.55923
110,0.9091799999999999
111,1.155
112,1.2802
113,1.2925
114,1.1923
115,1.0070000000000001
116,0.75832
117,0.46495
118,0.14995999999999998
119,-0.17364000000000002
120,-0.48583999999999994
121,-0.7609600000000001
122,-0.97282
123,-1.0913
124,-1.0992
125,-0.9940700000000001
126,-0.79038
127,-0.51252
128,-0.18516
129,0.14509
130,0.44086000000000003
131,0.66247
132,0.77767
133,0.78427
134,0.68143
135,0.47841999999999996
136,0.20989000000000002
137,-0.082402
138,-0.36927
139,-0.59812
140,-0.73646
141,-0.7684300000000001
142,-0.6975100000000001
143,-0.5373600000000001
144,-0.30415
145,-0.024518
146,0.2681
147,0.55599
148,0.80521
149,0.991
150,1.0787
151,1.0623
152,0.9295
153,0.68397
154,0.34883000000000003
155,-0.04385
156,-0.44215
157,-0.81403
158,-1.1255
159,-1.3371
160,-1.4349
161,-1.4112
162,-1.2616
163,-0.98359
164,-0.59647
165,-0.12005
166,0.40884000000000004
167,0.9120799999999999
168,1.3445
169,1.6323
170,1.7246
171,1.6162
172,1.3117
173,0.8780100000000001
174,0.38748
175,-0.079811
176,-0.47391000000000005
177,-0.7559999999999999
178,-0.9399799999999999
179,-1.0531
180,-1.1273
181,-1.1816
182,-1.2182
183,-1.2047
184,-1.0972
185,-0.87034
186,-0.50071
187,-3.1828e-05
188,0.5898899999999999
189,1.1801
190,1.6836
191,2.0426
192,2.1867
193,2.0996
194,1.7935
195,1.3103
196,0.7248
197,0.09350399999999999
198,-0.5173800000000001
199,-1.0744
200,-1.5508
201,-1.9248
202,-2.1865
203,-2.3248
204,-2.314
205,-2.135
206,-1.7917
207,-1.2768
208,-0.62764
209,0.10274000000000001
210,0.8427899999999999
211,1.5287
212,2.0967
213,2.4943
214,2.6852
215,2.6775
216,2.4898
217,2.1266
218,1.6172
219,0.98685
220,0.25997
221,-0.5128199999999999
222,-1.2836
223,-1.9792
224,-2.5207
225,-2.8503
226,-2.9228
227,-2.7207
228,-2.2646
229,-1.6151
230,-0.8423700000000001
231,-0.032612999999999996
232,0.74069
233,1.4152
234,1.936
235,2.2723
236,2.4194
237,2.3679
238,2.1149
239,1.6886
240,1.1188
241,0.45826999999999996
242,-0.22584
243,-0.86214
244,-1.3825
245,-1.7476
246,-1.9261
247,-1.9232
248,-1.7636
249,-1.4687
250,-1.0979999999999999
251,-0.6765100000000001
252,-0.23892
253,0.1786
254,0.5643100000000001
255,0.90595
256,1.1868
257,1.3906
258,1.5072
259,1.5214
260,1.4134
261,1.1856
262,0.85954
263,0.46587
264,0.021265
265,-0.4207
266,-0.81291
267,-1.1245
268,-1.3184
269,-1.3793
270,-1.2954
271,-1.0908
272,-0.79981
273,-0.44506999999999997
274,-0.089237
275,0.22609
276,0.46061
277,0.60696
278,0.6431399999999999
279,0.60287
280,0.51626
281,0.40756
282,0.31822
283,0.26178
284,0.2372
285,0.23263000000000003
286,0.21686
287,0.17168
288,0.075663
289,-0.065526
290,-0.21841999999999998
291,-0.34343
292,-0.43068
293,-0.44243000000000005
294,-0.39303
295,-0.31185
296,-0.22705999999999998
297,-0.18382
298,-0.19646
299,-0.2612
300,-0.34779
301,-0.41612
302,-0.42291000000000006
303,-0.34051
304,-0.16616
305,0.07144099999999999
306,0.32927
307,0.5755
308,0.76715
309,0.89345
310,0.9626
311,0.96962
312,0.91512
313,0.79573
314,0.6119600000000001
315,0.36511
316,0.059576
317,-0.28544
318,-0.63248
319,-0.93815
320,-1.1662
321,-1.2941
322,-1.3228
323,-1.2507
324,-1.1047
325,-0.90365
326,-0.64661
327,-0.33844
328,0.012212
329,0.40283
330,0.80355
331,1.168
332,1.4404
333,1.5706
334,1.5264
335,1.3106
336,0.96991
337,0.55069
338,0.12202
339,-0.26379
340,-0.57785
341,-0.7972899999999999
342,-0.95032
343,-1.0402
344,-1.0949
345,-1.1208
346,-1.0977
347,-1.0157
348,-0.8477299999999999
349,-0.5895100000000001
350,-0.27035
351,0.089163
352,0.43985
353,0.7448899999999999
354,0.9768
355,1.1191
356,1.171
357,1.145
358,1.0524
359,0.8942899999999999
360,0.67518
361,0.4187
362,0.1259
363,-0.19059
364,-0.50149
365,-0.7704300000000001
366,-0.97405
367,-1.103
368,-1.1391
369,-1.0811
370,-0.9546
371,-0.7710899999999999
372,-0.54459
373,-0.29339
374,-0.03127
375,0.22358000000000003
376,0.46083999999999997
377,0.6491600000000001
378,0.7700899999999999
379,0.83078
380,0.8262799999999999
381,0.78098
382,0.71726
383,0.64108
384,0.55629
385,0.46291000000000004
386,0.32085
387,0.12489000000000001
388,-0.13927
389,-0.45406
390,-0.7752600000000001
391,-1.0467
392,-1.2262
393,-1.271
394,-1.1821
395,-0.97629
396,-0.68906
397,-0.37251999999999996
398,-0.072228
399,0.18481
400,0.39571
401,0.56029
402,0.70403
403,0.8232799999999999
404,0.91958
405,0.98262
406,0.98656
407,0.93058
408,0.8062699999999999
409,0.62225
410,0.39535
411,0.13226
412,-0.13333
413,-0.38458000000000003
414,-0.61525
415,-0.81502
416,-0.9758899999999999
417,-1.0692
418,-1.1109
419,-1.0923
420,-1.013
421,-0.88071
422,-0.69607
423,-0.4584
424,-0.16623
425,0.1789
426,0.55308
427,0.93499
428,1.2772
429,1.5304
430,1.6357
431,1.5574
432,1.2907
433,0.8610200000000001
434,0.33189
435,-0.21444000000000002
436,-0.70681
437,-1.0856
438,-1.3183
439,-1.4051
440,-1.3676
441,-1.2156
442,-0.98918
443,-0.70415
444,-0.38123
445,-0.027401
446,0.33768000000000004
447,0.68826
448,0.9725600000000001
449,1.1533
450,1.1976
451,1.1003
452,0.87513
453,0.5629
454,0.19493
455,-0.16559000000000001
456,-0.47923999999999994
457,-0.72585
458,-0.89228
459,-0.9836
460,-0.98785
461,-0.91025
462,-0.7703
463,-0.5635
464,-0.30145
465,-0.0009086000000000001
466,0.31858000000000003
467,0.6381
468,0.93945
469,1.1754
470,1.3192
471,1.3485
472,1.239
473,0.9952700000000001
474,0.64313
475,0.20656
476,-0.26391
477,-0.7135199999999999
478,-1.0927
479,-1.3667
480,-1.5119999999999998
481,-1.5395
482,-1.4711
483,-1.3242
484,-1.1075
485,-0.82876
486,-0.5015
487,-0.09689
488,0.36522
489,0.8582299999999999
490,1.3452
491,1.7496
492,2.0058
493,2.0718
494,1.9189
495,1.5635
496,1.0378
497,0.42257
498,-0.21975
499,-0.81735
