time,value
0,-0.33324000000000004
1,0.95689
2,2.4514
3,3.7746
4,4.5698
5,4.6213
6,3.9289
7,2.7074
8,1.3102
9,0.1076
10,-0.63463
11,-0.83062
12,-0.5806100000000001
13,-0.10999
14,0.32905999999999996
15,0.5526399999999999
16,0.50107
17,0.23868000000000003
18,-0.094275
19,-0.35241
20,-0.44603000000000004
21,-0.36964
22,-0.19052
23,-0.0084265
24,0.092176
25,0.075869
26,-0.036424
27,-0.18545
28,-0.30532
29,-0.35274
30,-0.32182
31,-0.24023000000000003
32,-0.15159
33,-0.094201
34,-0.085972
35,-0.12115999999999999
36,-0.17783
37,-0.23075
38,-0.26264
39,-0.26955
40,-0.25889
41,-0.24305
42,-0.23243000000000003
43,-0.23128
44,-0.23774
45,-0.24675
46,-0.25375
47,-0.25678
48,-0.25692
49,-0.25659
50,-0.25945
51,-0.26366999999999996
52,-0.26634
53,-0.26759
54,-0.26803
55,-0.26887
56,-0.27019
57,-0.27246
58,-0.27587
59,-0.28057
60,-0.2861
61,-0.29202
62,-0.29833000000000004
63,-0.30513
64,-0.31263
65,-0.32022
66,-0.32755
67,-0.33426999999999996
68,-0.34033
69,-0.34561
70,-0.35014
71,-0.35425999999999996
72,-0.35823
73,-0.36222
74,-0.36571
75,-0.36841999999999997
76,-0.37026
77,-0.37156999999999996
78,-0.37282
79,-0.37453000000000003
80,-0.37722
81,-0.38088
82,-0.3851
83,-0.38868
84,-0.39078
85,-0.39115
86,-0.39043
87,-0.38986
88,-0.39093
89,-0.39482
90,-0.40157
91,-0.40992
92,-0.41708999999999996
93,-0.42008999999999996
94,-0.41652
95,-0.40557
96,-0.38832
97,-0.36762
98,-0.34746
