time,value
0,-1.4992
1,-1.4992
2,-1.4992
3,-1.4992
4,-1.4992
5,-1.4992
6,-1.4992
7,-1.4992
8,-1.4992
9,-1.4992
10,-1.4992
11,-1.4992
12,-1.4992
13,-1.4992
14,-1.4992
15,-1.4992
16,-1.4992
17,-1.4992
18,-1.4992
19,-1.4992
20,-1.4992
21,-1.4992
22,-1.4992
23,-1.5178
24,-1.5437
25,-1.5338
26,-1.5079
27,-1.4992
28,-1.4992
29,-1.4826
30,-1.4566
31,-1.4465
32,-1.4465
33,-1.4923
34,-1.5702
35,-1.6336
36,-1.6855
37,-1.6958
38,-1.6698
39,-1.6173
40,-1.5394
41,-1.4614
42,-1.3835
43,-1.3294
44,-1.3034
45,-1.2774
46,-1.2514
47,-1.2149
48,-1.1629
49,-1.111
50,-1.0590000000000002
51,-1.0070000000000001
52,-0.9550799999999999
53,-0.8774700000000001
54,-0.74757
55,-0.6176699999999999
56,-0.48777
57,-0.33624
58,-0.1284
59,0.38383
60,0.28728000000000004
61,0.48926000000000003
62,0.6711199999999999
63,0.85298
64,1.0348
65,1.2077
66,1.3376
67,1.4636
68,1.5675
69,1.6619
70,1.6879
71,1.7088
72,1.6828
73,1.6513
74,1.5474
75,1.4423
76,1.3124
77,1.183
78,1.0791
79,0.9751700000000001
80,0.9486899999999999
81,0.92271
82,0.94701
83,0.9729899999999999
84,0.99897
85,1.025
86,1.0033
87,0.97735
88,0.9976299999999999
89,1.0236
90,1.0496
91,1.0756
92,1.0798
93,1.0798
94,1.0798
95,1.0798
96,1.0593
97,1.0333
98,1.0271
99,1.0271
100,1.008
101,0.9820399999999999
102,0.95606
103,0.9300799999999999
104,0.9041
105,0.8781200000000001
106,0.88633
107,0.9123100000000001
108,0.93829
109,0.9642700000000001
110,1.006
111,1.058
112,1.0948
113,1.1208
114,1.1324
115,1.1324
116,1.1324
117,1.1324
118,1.1062
119,1.0543
120,1.0023
121,0.95036
122,0.91014
123,0.88415
124,0.86924
125,0.86924
126,0.85885
127,0.8328700000000001
128,0.80688
129,0.7809
130,0.75492
131,0.7289399999999999
132,0.69458
133,0.64262
134,0.59837
135,0.57239
136,0.5464100000000001
137,0.5204300000000001
138,0.48808
139,0.43612
140,0.38416
141,0.3322
142,0.27018000000000003
143,0.16626
144,0.32014000000000004
145,-0.069563
146,-0.44083
147,-0.13745
148,-0.18941
149,-0.24136999999999997
150,-0.29568
151,-0.37362
152,-0.44988999999999996
153,-0.50185
154,-0.5528
155,-0.5787800000000001
156,-0.6047600000000001
157,-0.63074
158,-0.65672
159,-0.63141
160,-0.60543
161,-0.60443
162,-0.60443
163,-0.62873
164,-0.65471
165,-0.68069
166,-0.70667
167,-0.77858
168,-0.8565200000000001
169,-0.91217
170,-0.9641299999999999
171,-1.0593
172,-1.1633
173,-1.2462
174,-1.3242
175,-1.3818
176,-1.4338
177,-1.4661
178,-1.4921
179,-1.4802
180,-1.4542
181,-1.41
182,-1.358
183,-1.3061
184,-1.2541
185,-1.2191
186,-1.1931
187,-1.1834
188,-1.1834
189,-1.1678
190,-1.1418
191,-1.1158
192,-1.0898
193,-1.0496
194,-0.99765
195,-0.9592700000000001
196,-0.93329
197,-0.9460200000000001
198,-0.99798
199,-1.0499
200,-1.1019
201,-1.1307
202,-1.1307
203,-1.1089
204,-1.057
205,-0.97435
206,-0.84445
207,-0.7336600000000001
208,-0.65572
209,-0.5777800000000001
210,-0.49983999999999995
211,-0.43011000000000005
212,-0.37815
213,-0.33373
214,-0.30775
215,-0.26802
216,-0.19008
217,-0.09974
218,0.13744
219,0.17112
220,0.35299
221,0.52513
222,0.65503
223,0.76817
224,0.79415
225,0.82365
226,0.87561
227,0.9275700000000001
228,0.9795299999999999
229,1.0315
230,1.0834
231,1.1339
232,1.1599
233,1.1833
234,1.1314
235,1.0796
236,1.0536
237,1.0276
238,1.0271
239,1.0271
240,1.0519
241,1.0779
242,1.0556
243,1.0296
244,0.95673
245,0.87879
246,0.7780600000000001
247,0.67413
248,0.61446
249,0.5625
250,0.55345
251,0.55345
252,0.57424
253,0.60022
254,0.6262
255,0.65218
256,0.67816
257,0.70414
258,0.74889
259,0.80085
260,0.8709100000000001
261,0.94885
262,1.0094
263,1.0613
264,1.063
265,1.037
266,0.9788600000000001
267,0.90092
268,0.8229799999999999
269,0.7450399999999999
270,0.68185
271,0.62988
272,0.6060800000000001
273,0.6060800000000001
274,0.61949
275,0.64547
276,0.68419
277,0.73615
278,0.77604
279,0.80202
280,0.79381
281,0.74185
282,0.67916
283,0.60122
284,0.51322
285,0.4093
286,0.32416
287,0.2722
288,0.23767
289,0.23767
290,0.24570999999999998
291,0.27169
292,0.27555
293,0.22359
294,0.17833
295,0.15235
296,0.12637
297,0.48858999999999997
298,0.41233000000000003
299,0.11112000000000001
300,0.1371
301,0.16308
302,0.18905999999999998
303,0.21504
304,0.23767
305,0.23767
306,0.24035
307,0.26633
308,0.2903
309,0.2903
310,0.28896
311,0.26298
312,0.237
313,0.21101999999999999
314,0.18504
315,-0.74534
316,-0.74534
317,-0.74534
318,-0.74534
319,-0.74534
320,-0.74534
321,-0.74534
322,-0.74534
323,-0.74534
324,-0.74534
325,-0.74534
326,-0.74534
327,-0.74534
328,-0.74534
329,-0.74534
330,-0.74534
331,-0.74534
332,-0.74534
333,-0.74534
334,-0.74534
335,-0.74534
336,-0.74534
337,-0.74534
338,-0.74534
339,-0.74534
340,-0.71882
341,-0.68038
342,-0.6674899999999999
343,-0.6674899999999999
344,-0.64295
345,-0.60451
346,-0.61319
347,-0.65162
348,-0.69005
349,-0.72849
350,-0.74534
351,-0.74534
352,-0.70419
353,-0.62732
354,-0.53088
355,-0.41558
356,-0.30029
357,-0.185
358,-0.36189
359,0.21456999999999998
360,0.14427
361,0.22113000000000002
362,0.28236999999999995
363,0.3208
364,0.35923
365,0.39766
366,0.46337
367,0.5786600000000001
368,0.69395
369,0.80925
370,0.94784
371,1.14
372,1.3108
373,1.4261
374,1.5704
375,1.801
376,2.0403
377,2.3093
378,2.5629
379,2.7551
380,2.9472
381,3.1394
382,3.3201
383,3.4354
384,3.5272
385,3.4503
386,3.3734
387,3.2966
388,3.217
389,3.1017
390,2.9847
391,2.8310000000000004
392,2.6787
393,2.6019
394,2.525
395,2.3718
396,2.218
397,2.1015
398,1.9862
399,1.8709
400,1.7556
401,1.6756
402,1.5987
403,1.5218
404,1.445
405,1.4013
406,1.3629
407,1.2922
408,1.2154
409,1.1073
410,0.99198
411,0.9371799999999999
412,0.89875
413,0.83106
414,0.7542
415,0.7056100000000001
416,0.66718
417,0.62874
418,0.59031
419,0.55188
420,0.51345
421,0.42444
422,0.30915
423,0.24245
424,0.20402
425,0.16559000000000001
426,0.12716
427,0.31871
428,-0.065603
429,-0.10862999999999999
430,-0.22393000000000002
431,-0.29855
432,-0.33699
433,-0.39476
434,-0.47162
435,-0.51178
436,-0.51178
437,-0.5291399999999999
438,-0.56757
439,-0.606
440,-0.6444300000000001
441,-0.65212
442,-0.61369
443,-0.60402
444,-0.64245
445,-0.6541
446,-0.6156699999999999
447,-0.5896399999999999
448,-0.5896399999999999
449,-0.5896399999999999
450,-0.5896399999999999
451,-0.57922
452,-0.54079
453,-0.50236
454,-0.46393
455,-0.4255
456,-0.38706999999999997
457,-0.36351999999999995
458,-0.40195
459,-0.44038
460,-0.47881
461,-0.52815
462,-0.64344
463,-0.75873
464,-0.87403
465,-0.98585
466,-1.0627
467,-1.1346
468,-1.1346
469,-1.1331
470,-1.0947
471,-1.0558
472,-0.9789100000000001
473,-0.90204
474,-0.8251799999999999
475,-0.74832
476,-0.6714600000000001
477,-0.5946
478,-0.5896399999999999
479,-0.5896399999999999
480,-0.6246
481,-0.66303
482,-0.7014600000000001
483,-0.7398899999999999
484,-0.74534
485,-0.74534
486,-0.74534
487,-0.74534
488,-0.7763399999999999
489,-0.81477
490,-0.8532
491,-0.8916299999999999
492,-0.93006
493,-0.96849
494,-0.9789100000000001
495,-0.9789100000000001
496,-0.9789100000000001
497,-0.9789100000000001
498,-0.92684
499,-0.84998
500,-0.74807
501,-0.63278
502,-0.5655899999999999
503,-0.5271600000000001
504,-0.48873
505,-0.4503
506,-0.41186000000000006
507,-0.37343000000000004
508,-0.37715
509,-0.41558
510,-0.39376
511,-0.3169
512,-0.24004
513,-0.16318
514,-0.10442
515,-0.3433
516,0.11398
517,0.12195
518,0.23724
519,0.35254
520,0.43758
521,0.47601000000000004
522,0.45791000000000004
523,0.34262
524,0.22733000000000003
525,0.11204000000000001
526,0.18836
527,-0.35320999999999997
528,-0.1002
529,-0.13007
530,0.3559
531,0.22758
532,0.37213
533,0.48741999999999996
534,0.58635
535,0.62478
536,0.64883
537,0.6104
538,0.57196
539,0.5335300000000001
540,0.4951
541,0.45666999999999996
542,0.42246000000000006
543,0.42246000000000006
544,0.42246000000000006
545,0.42246000000000006
546,0.41799
547,0.34113000000000004
548,0.26427
549,0.18741
550,0.1103
551,-0.27446
552,-0.12029000000000001
553,-0.1602
554,-0.19863
555,-0.20037
556,-0.20037
557,-0.20037
558,-0.20037
559,-0.23508
560,-0.27351
561,-0.34565999999999997
562,-0.42253
563,-0.46666
564,-0.5050899999999999
565,-0.48005
566,-0.44161999999999996
567,-0.46468000000000004
568,-0.5031100000000001
569,-0.48203
570,-0.4436
571,-0.40517
572,-0.36674
573,-0.30054000000000003
574,-0.22368000000000002
575,-0.14681
576,-0.36313
577,0.12225
578,0.40549
579,0.11104000000000001
580,0.11104000000000001
581,0.30383000000000004
582,-0.080479
583,-0.46479
584,-0.16715
585,-0.26583
586,-0.38111999999999996
587,-0.43393000000000004
588,-0.43393000000000004
589,-0.4141
590,-0.37567
591,-0.33723000000000003
592,-0.2988
593,-0.26037
594,-0.22194
595,-0.21723
596,-0.25566
597,-0.29409
598,-0.33252
599,-0.37095
600,-0.40938
601,-0.44782
602,-0.48625
603,-0.51178
604,-0.51178
605,-0.51178
606,-0.51178
607,-0.52269
608,-0.56112
609,-0.60947
610,-0.68634
611,-0.74534
612,-0.74534
613,-0.73741
614,-0.69898
615,-0.66055
616,-0.62212
617,-0.5836899999999999
618,-0.5452600000000001
619,-0.50683
620,-0.46839
621,-0.43393000000000004
622,-0.43393000000000004
623,-0.43096
624,-0.39252
625,-0.35806
626,-0.39649
627,-0.43492
628,-0.47335
629,-0.51178
630,0.52276
631,0.52276
632,0.52276
633,0.52276
634,0.52276
635,0.52276
636,0.52276
637,0.52276
638,0.52276
639,0.52276
640,0.52276
641,0.52276
642,0.52276
643,0.52276
644,0.52276
645,0.52276
646,0.52276
647,0.52276
648,0.52276
649,0.52276
650,0.52276
651,0.52276
652,0.52276
653,0.53728
654,0.5575600000000001
655,0.56384
656,0.56384
657,0.56384
658,0.56384
659,0.53794
660,0.49738000000000004
661,0.48168
662,0.48168
663,0.48168
664,0.48168
665,0.4703
666,0.45003000000000004
667,0.44061000000000006
668,0.44061000000000006
669,0.46128
670,0.50183
671,0.54238
672,0.58294
673,0.60492
674,0.60492
675,0.62245
676,0.6629999999999999
677,0.70355
678,0.74411
679,0.79238
680,0.85321
681,0.93563
682,1.0573
683,1.1789
684,1.3006
685,1.4284
686,1.5704
687,1.7067
688,1.8283
689,1.9347
690,1.9955
691,2.0655
692,2.1669
693,2.2642
694,2.3453
695,2.4123
696,2.4123
697,2.4093
698,2.3890000000000002
699,2.329
700,1.9843
701,1.6553
702,1.4728
703,1.2946
704,1.1729
705,1.0513
706,0.92961
707,0.80716
708,0.64495
709,0.48273
710,0.32051
711,0.1583
712,0.065171
713,-0.12623
714,-0.22996999999999998
715,-0.33136
716,-0.41416000000000003
717,-0.49527
718,-0.57638
719,-0.65749
720,-0.75613
721,-0.85751
722,-0.9248799999999999
723,-0.9857100000000001
724,-0.98061
725,-0.9603299999999999
726,-0.94006
727,-0.9197799999999999
728,-0.91494
729,-0.91494
730,-0.91494
731,-0.91494
732,-0.9437200000000001
733,-0.9842700000000001
734,-1.011
735,-1.0312
736,-1.0649
737,-1.1054
738,-1.1588
739,-1.2196
740,-1.2927
741,-1.3739
742,-1.4432
743,-1.504
744,-1.5536
745,-1.5942
746,-1.624
747,-1.6443
748,-1.6543
749,-1.6543
750,-1.6446
751,-1.6244
752,-1.6041
753,-1.5838
754,-1.5722
755,-1.5722
756,-1.556
757,-1.5154
758,-1.49
759,-1.49
760,-1.4971
761,-1.5174
762,-1.5246
763,-1.5043
764,-1.49
765,-1.49
766,-1.4845
767,-1.4642
768,-1.4489
769,-1.4489
770,-1.4445
771,-1.4242
772,-1.4079
773,-1.4079
774,-1.4113
775,-1.4315
776,-1.4576
777,-1.5184
778,-1.5745
779,-1.5948
780,-1.6114
781,-1.5911
782,-1.5696
783,-1.5290000000000001
784,-1.4885
785,-1.4479
786,-1.4071
787,-1.3463
788,-1.2854
789,-1.2646
790,-1.2443
791,-1.2241
792,-1.2038
793,-1.1835
794,-1.1632
795,-1.1614
796,-1.1614
797,-1.0897
798,-1.0086
799,-0.9970899999999999
800,-0.9970899999999999
801,-0.96334
802,-0.92279
803,-0.8168300000000001
804,-0.69516
805,-0.60516
806,-0.52405
807,-0.47356000000000004
808,-0.433
809,-0.40723000000000004
810,-0.38695
811,-0.36668
812,-0.3464
813,-0.33986
814,-0.33986
815,-0.32665
816,-0.30637
817,-0.24802
818,-0.16692
819,-0.44241
820,-0.26471999999999996
821,0.25224
822,0.45501
823,0.12311
824,0.14339000000000002
825,0.16366
826,0.18394000000000002
827,0.25458000000000003
828,0.37624
829,0.48836
830,0.5897399999999999
831,0.67307
832,0.7339
833,0.78623
834,0.8267899999999999
835,0.86734
836,0.90789
837,0.96336
838,1.0445
839,1.1394
840,1.2611
841,1.3699
842,1.4511
843,1.5322
844,1.6133
845,1.6729
846,1.6729
847,1.6729
848,1.6729
849,1.6729
850,1.6729
851,1.6615
852,1.6007
853,1.5301
854,1.4084
855,1.2812
856,1.119
857,0.9612700000000001
858,0.8396
859,0.72645
860,0.70617
861,0.68589
862,0.66562
863,0.64403
864,0.5832
865,0.52237
866,0.46153999999999995
867,0.40071
868,0.37965
869,0.35936999999999997
870,0.39718000000000003
871,0.43773
872,0.45945
873,0.47972
874,0.51831
875,0.55887
876,0.54605
877,0.52577
878,0.47096000000000005
879,0.41013
880,0.36604000000000003
881,0.32549
882,0.28493
883,0.24438000000000001
884,0.20382
885,0.16327
886,0.13789
887,0.11762
888,0.47333000000000003
889,0.37194
890,0.27055999999999997
891,0.16917000000000001
892,0.13581
893,0.13581
894,0.085985
895,-0.19777999999999998
896,-0.40055
897,-0.11799000000000001
898,-0.15854000000000001
899,-0.1991
900,-0.20511999999999997
901,-0.18484
902,-0.16455999999999998
903,-0.14429
904,-0.12401
905,-0.10372999999999999
906,-0.48034
907,-0.48034
908,-0.10282000000000001
909,-0.12309
910,-0.13447
911,-0.13447
912,-0.1261
913,-0.10582000000000001
914,-0.48034
915,-0.48034
916,-0.44372
917,-0.34233
918,-0.27496
919,-0.27496
920,-0.33775
921,-0.10543
922,-0.14023
923,-0.16050999999999999
924,-0.18602
925,-0.22657
926,-0.26241
927,-0.28269
928,-0.29878000000000005
929,-0.29878000000000005
930,-0.29146
931,-0.2509
932,-0.21035
933,-0.16979
934,-0.13709000000000002
935,-0.15737
936,-0.17135999999999998
937,-0.13080999999999998
938,-0.4725
939,-0.37111
940,-0.28542
941,-0.48818999999999996
942,-0.13395
943,-0.11367000000000001
944,-0.48034
