time,value
0,-0.34375
1,-0.10587
2,0.17839000000000002
3,0.4503
4,0.66985
5,0.80613
6,0.83855
7,0.75392
8,0.5745600000000001
9,0.33221999999999996
10,0.064663
11,-0.19013
12,-0.40807
13,-0.56457
14,-0.65662
15,-0.68648
16,-0.6510100000000001
17,-0.55411
18,-0.40412
19,-0.22045
20,-0.020338
21,0.17115999999999998
22,0.33314
23,0.45171999999999995
24,0.51435
25,0.5232
26,0.48931
27,0.43156000000000005
28,0.37334
29,0.3256
30,0.27408000000000005
31,0.21215
32,0.13573
33,0.028067
34,-0.11895
35,-0.28945
36,-0.45091000000000003
37,-0.58933
38,-0.68209
39,-0.71677
40,-0.6866399999999999
41,-0.6104
42,-0.49083000000000004
43,-0.34034000000000003
44,-0.17607
45,0.0016612000000000003
46,0.18358
47,0.36056
48,0.52061
49,0.64749
50,0.7182
51,0.7288600000000001
52,0.68243
53,0.58704
54,0.4556
55,0.31724
56,0.18991
57,0.078805
58,-0.0079886
59,-0.069301
60,-0.10647000000000001
61,-0.13605
62,-0.15533
63,-0.17464000000000002
64,-0.19057000000000002
65,-0.20784
66,-0.23481
67,-0.28234000000000004
68,-0.35807
69,-0.46138
70,-0.58635
71,-0.71322
72,-0.82132
73,-0.8813700000000001
74,-0.85439
75,-0.73173
76,-0.50652
77,-0.1834
78,0.21120999999999998
79,0.64282
80,1.0583
81,1.4069999999999998
82,1.6315
83,1.6898
84,1.5654
85,1.2569
86,0.80709
87,0.27896
88,-0.24303000000000002
89,-0.68092
90,-0.9834799999999999
91,-1.1231
92,-1.1033
93,-0.96473
94,-0.76457
95,-0.55558
96,-0.37624
97,-0.24406
98,-0.15158
99,-0.079237
100,0.00076759
101,0.10044
102,0.2112
103,0.31990999999999997
104,0.41858999999999996
105,0.48268
106,0.5041899999999999
107,0.4739
108,0.40012
109,0.28341
110,0.13929
111,-0.022243000000000002
112,-0.18572
113,-0.33471
114,-0.44843999999999995
115,-0.5042399999999999
116,-0.49105
117,-0.39866
118,-0.23073000000000002
119,-0.017238
120,0.21286999999999998
121,0.42127
122,0.5627
123,0.61537
124,0.57144
125,0.43932
126,0.24424
127,0.021775
128,-0.18797
129,-0.36085
130,-0.4763
131,-0.51407
132,-0.4704
133,-0.37325
134,-0.23367
135,-0.06984
136,0.09054
137,0.22324000000000002
138,0.31806999999999996
139,0.36114
140,0.35276
141,0.2996
142,0.21811999999999998
143,0.1236
144,0.036608
145,-0.021389
146,-0.045814
147,-0.035232
148,-0.01152
149,0.0055772
150,-0.014538999999999998
151,-0.093082
152,-0.23606
153,-0.43098000000000003
154,-0.6409
155,-0.81109
156,-0.88233
157,-0.79578
158,-0.52169
159,-0.07767
160,0.49254
161,1.0974
162,1.6354
163,2.0075
164,2.1483
165,2.017
166,1.6242
167,1.016
168,0.26459
169,-0.54055
170,-1.3165
171,-1.979
172,-2.4723
173,-2.7437
174,-2.7673
175,-2.5546
176,-2.1164
177,-1.4883
178,-0.73193
179,0.079848
180,0.87246
181,1.5851
182,2.1507
183,2.5293
184,2.7115
185,2.7
186,2.5157
187,2.1928
188,1.7658
189,1.2507
190,0.67424
191,0.055874
192,-0.59083
193,-1.251
194,-1.8925
195,-2.4531
196,-2.8831
197,-3.1101
198,-3.0723
199,-2.7388
200,-2.1268
201,-1.2883
202,-0.31119
203,0.6873
204,1.5919999999999999
205,2.3047
206,2.7726
207,2.9687
208,2.9013
209,2.61
210,2.1385
211,1.5265
212,0.82849
213,0.095473
214,-0.61666
215,-1.2422
216,-1.7244
217,-2.0181
218,-2.1103
219,-2.0186
220,-1.7877
221,-1.4778
222,-1.1395
223,-0.79504
224,-0.45787
225,-0.10982
226,0.27305
227,0.69539
228,1.1419
229,1.5669
230,1.9009
231,2.0773
232,2.0495
233,1.8071
234,1.3884
235,0.84335
236,0.24993
237,-0.3243
238,-0.84059
239,-1.2725
240,-1.589
241,-1.7793
242,-1.8333
243,-1.7288
244,-1.47
245,-1.0831
246,-0.62802
247,-0.17396
248,0.21245999999999998
249,0.48795
250,0.6386
251,0.69981
252,0.73556
253,0.80686
254,0.9522799999999999
255,1.1747
256,1.4174
257,1.5989
258,1.6318
259,1.4537
260,1.0561
261,0.48106000000000004
262,-0.18361
263,-0.8415
264,-1.3964
265,-1.7842
266,-1.9880000000000002
267,-2.0212
268,-1.9064
269,-1.6765
270,-1.3606
271,-0.97011
272,-0.52037
273,-0.023337
274,0.48372
275,0.9608399999999999
276,1.3572
277,1.6218
278,1.7334
279,1.6956
280,1.5291
281,1.273
282,0.96849
283,0.65555
284,0.35803
285,0.080358
286,-0.18109
287,-0.43385
288,-0.68599
289,-0.93394
290,-1.1523
291,-1.3162
292,-1.4026
293,-1.3888
294,-1.2612
295,-1.0125
296,-0.66106
297,-0.22826
298,0.24095
299,0.69219
300,1.0699
301,1.3275
302,1.4372
303,1.3907
304,1.2071
305,0.9224
306,0.5822
307,0.24031999999999998
308,-0.066298
309,-0.30609000000000003
310,-0.47073000000000004
311,-0.55758
312,-0.57157
313,-0.5355300000000001
314,-0.4702
315,-0.38795
316,-0.30873
317,-0.2466
318,-0.21103000000000002
319,-0.20185999999999998
320,-0.22328
321,-0.25156999999999996
322,-0.25961
323,-0.22973000000000002
324,-0.14801
325,-0.007254399999999999
326,0.17188
327,0.35517
328,0.51522
329,0.61575
330,0.6319
331,0.56555
332,0.44087
333,0.27781999999999996
334,0.10505
335,-0.043877
336,-0.13947
337,-0.18929
338,-0.20181
339,-0.17599
340,-0.1228
341,-0.071262
342,-0.036057
343,-0.022474
344,-0.042886
345,-0.10323
346,-0.18782000000000001
347,-0.27018000000000003
348,-0.33671999999999996
349,-0.368
350,-0.3392
351,-0.24754
352,-0.10535
353,0.078376
354,0.28428000000000003
355,0.48727
356,0.64846
357,0.74963
358,0.76781
359,0.68174
360,0.51071
361,0.26875
362,-0.015092
363,-0.30034
364,-0.54623
365,-0.72525
366,-0.82836
367,-0.84716
368,-0.79038
369,-0.6802699999999999
370,-0.52805
371,-0.34583
372,-0.14417
373,0.068768
374,0.28136
375,0.47123000000000004
376,0.60982
377,0.68792
378,0.6954199999999999
379,0.63551
380,0.52267
381,0.38976
382,0.26518
383,0.15968
384,0.07854
385,0.011415999999999999
386,-0.0694
387,-0.18069000000000002
388,-0.31695999999999996
389,-0.46083
390,-0.58023
391,-0.6413
392,-0.6165
393,-0.49696
394,-0.30121
395,-0.063204
396,0.17532999999999999
397,0.36885
398,0.4877
399,0.52975
400,0.50766
401,0.42721000000000003
402,0.30274
403,0.14661
404,-0.033311
405,-0.23
406,-0.41694
407,-0.56375
408,-0.6541600000000001
409,-0.65993
410,-0.5666800000000001
411,-0.3869
412,-0.15087
413,0.1029
414,0.33621
415,0.52875
416,0.66886
417,0.75839
418,0.8022
419,0.80634
420,0.75481
421,0.65173
422,0.49263
423,0.28522
424,0.04754
425,-0.19832
426,-0.43105
427,-0.6333
428,-0.80288
429,-0.94742
430,-1.0711
431,-1.1637
432,-1.2027
433,-1.1579
434,-0.9855200000000001
435,-0.66108
436,-0.20463
437,0.3381
438,0.89075
439,1.3719999999999999
440,1.6968
441,1.8230000000000002
442,1.7512
443,1.5096
444,1.1484
445,0.71631
446,0.25991
447,-0.20039
448,-0.65662
449,-1.0784
450,-1.4374
451,-1.6975
452,-1.7990000000000002
453,-1.6944
454,-1.3867
455,-0.9039299999999999
456,-0.31738
457,0.29184
458,0.8297200000000001
459,1.2305
460,1.4646
461,1.5199
462,1.4199
463,1.2031
464,0.90141
465,0.55073
466,0.17367
467,-0.20636
468,-0.56907
469,-0.88276
470,-1.1103
471,-1.2266
472,-1.2177
473,-1.0946
474,-0.88595
475,-0.6339100000000001
476,-0.37634
477,-0.14084000000000002
478,0.054428
479,0.22146999999999997
480,0.37464000000000003
481,0.53793
482,0.72512
483,0.9240799999999999
484,1.1079
485,1.2377
486,1.2648
487,1.1640000000000001
488,0.9186799999999999
489,0.5443600000000001
490,0.08494
491,-0.40581999999999996
492,-0.86125
493,-1.2203
494,-1.442
495,-1.5042
496,-1.4137
497,-1.1968
498,-0.88913
499,-0.5382
