time,value
0,-0.13602999999999998
1,0.0059602
2,-0.07499299999999999
3,0.30077
4,-0.46256
5,-0.41857
6,0.33657
7,1.5441
8,1.5441
9,1.5441
10,1.5441
11,1.5441
12,1.5441
13,1.5441
14,1.5441
15,1.5441
16,1.5441
17,-1.5212
18,-1.5212
19,-1.5212
20,-1.5212
21,-1.5212
22,-1.5212
23,-1.5212
24,-1.5212
25,-1.5212
26,-1.5212
27,0.27046
28,0.0020849
29,0.48138000000000003
30,0.11215
31,-0.33211
32,0.11832999999999999
33,-0.15745
34,-0.29798
35,-0.34504
36,-0.23848000000000003
37,-0.4869
38,0.14049
39,-0.17995999999999998
40,0.27452
41,0.20928000000000002
42,0.13108
43,-0.27186
44,-0.19554000000000002
45,0.31567
46,-0.023415000000000002
47,-0.0054589
48,0.10664000000000001
49,0.41681
50,-0.37293000000000004
51,0.13330999999999998
52,0.050897000000000005
53,-0.35980999999999996
54,-0.08644600000000001
55,0.18763
56,-0.09573
57,-0.0098671
58,-0.012309
59,0.24681
60,-0.33449
61,-1.5212
62,-1.5212
63,-1.5212
64,-1.5212
65,-1.5212
66,-1.5212
67,-1.5212
68,-1.5212
69,-1.5212
70,-1.5212
71,-1.5212
72,-1.5212
73,-1.5212
74,-1.5212
75,-1.5212
76,-1.5212
77,1.5441
78,1.5441
79,1.5441
80,1.5441
81,1.5441
82,1.5441
83,1.5441
84,1.5441
85,1.5441
86,1.5441
87,1.5441
88,1.5441
89,1.5441
90,1.5441
91,1.5441
92,1.5441
93,-0.013064
94,-0.14286
95,0.19399999999999998
96,0.5067
97,0.12944
98,0.50449
99,-0.14115
100,-0.25889
101,0.005272
102,-0.1179
103,-0.41573000000000004
104,0.3252
105,-0.19412000000000001
106,0.257
107,-0.42958
108,0.35255
109,-0.027239
110,0.067088
111,0.13279000000000002
112,-0.054342999999999995
113,0.13422
114,-0.2312
115,-0.0038655
116,-0.08017
117,-0.051792
118,-0.056352
119,0.25306
120,-0.19367
121,0.056652999999999995
122,-0.30346
123,0.091455
124,0.2448
125,0.12847999999999998
126,-0.53605
127,0.32937
