time,value
0,1.1786
1,1.2459
2,1.2352
3,1.1445
4,0.9847600000000001
5,0.75359
6,0.44475
7,0.06400700000000001
8,-0.37064
9,-0.82505
10,-1.2477
11,-1.5806
12,-1.7669
13,-1.7715
14,-1.5857
15,-1.2272
16,-0.74557
17,-0.19687000000000002
18,0.35133000000000003
19,0.8475799999999999
20,1.2524
21,1.5464
22,1.7122
23,1.7455
24,1.6418
25,1.3940000000000001
26,1.0116
27,0.50973
28,-0.07021799999999999
29,-0.6724399999999999
30,-1.236
31,-1.6911
32,-1.9838
33,-2.0762
34,-1.9605
35,-1.6517
36,-1.1842
37,-0.60801
38,0.022659000000000002
39,0.6523399999999999
40,1.2289
41,1.7094
42,2.0443
43,2.1961
44,2.1463
45,1.8801
46,1.4135
47,0.78447
48,0.052580999999999996
49,-0.71245
50,-1.4199
51,-1.9962
52,-2.3733
53,-2.5033
54,-2.3726
55,-1.9901
56,-1.393
57,-0.64571
58,0.17679
59,0.9795
60,1.6789
61,2.1959999999999997
62,2.476
63,2.4927
64,2.2473
65,1.7728
66,1.1219
67,0.36748000000000003
68,-0.42107
69,-1.1617
70,-1.7852
71,-2.2341
72,-2.4706
73,-2.4702
74,-2.2308
75,-1.7736
76,-1.1367
77,-0.38185
78,0.41862
79,1.1831
80,1.8338
81,2.3011
82,2.5418
83,2.5332
84,2.2814
85,1.8173
86,1.1936
87,0.47453
88,-0.26552
89,-0.96634
90,-1.5652
91,-2.0188
92,-2.2931
93,-2.3742
94,-2.258
95,-1.9593
96,-1.5015
97,-0.92238
98,-0.27352
99,0.38428
100,0.98645
101,1.4779
102,1.8107
103,1.9586
104,1.9222
105,1.7185
106,1.3855
107,0.9663299999999999
108,0.50726
109,0.054266999999999996
110,-0.36251
111,-0.71318
112,-0.9740200000000001
113,-1.1377
114,-1.1928
115,-1.1424
116,-0.99439
117,-0.76759
118,-0.49531000000000003
119,-0.21009
120,0.055015999999999995
121,0.27279000000000003
122,0.41955
123,0.49258
124,0.49809
125,0.43511000000000005
126,0.32943
127,0.1899
128,0.041224000000000004
129,-0.097006
130,-0.21318
131,-0.2922
132,-0.32406
133,-0.30439
134,-0.23471
135,-0.1227
136,0.021566
137,0.18267
138,0.34331
139,0.48495
140,0.58173
141,0.61661
142,0.5637300000000001
143,0.42465
144,0.20296
145,-0.07141900000000001
146,-0.36230999999999997
147,-0.62043
148,-0.80952
149,-0.8987700000000001
150,-0.8734700000000001
151,-0.74807
152,-0.5464
153,-0.29953
154,-0.040569
155,0.20297
156,0.42208
157,0.6027
158,0.7448899999999999
159,0.83681
160,0.8757299999999999
161,0.84155
162,0.73341
163,0.54469
164,0.28406
165,-0.024805
166,-0.34991
167,-0.6543100000000001
168,-0.9075700000000001
169,-1.0738
170,-1.1422
171,-1.1057
172,-0.9790000000000001
173,-0.77247
174,-0.5078
175,-0.20744
176,0.10533
177,0.40947
178,0.67551
179,0.88556
180,1.0205
181,1.079
182,1.0589
183,0.97239
184,0.8329
185,0.65066
186,0.43815
187,0.20090999999999998
188,-0.049968
189,-0.30853
190,-0.55783
191,-0.78285
192,-0.96419
193,-1.0859
194,-1.1389
195,-1.1165
196,-1.0170000000000001
197,-0.85201
198,-0.63265
199,-0.37254
200,-0.082835
201,0.21899000000000002
202,0.51469
203,0.78425
204,1.0061
205,1.1577
206,1.2288
207,1.2114
208,1.1103
209,0.93027
210,0.68471
211,0.39013000000000003
212,0.06165
213,-0.28458
214,-0.62433
215,-0.94005
216,-1.2009
217,-1.3871
218,-1.4749
219,-1.4518
220,-1.315
221,-1.0721
222,-0.74247
223,-0.34592
224,0.086502
225,0.51978
226,0.92725
227,1.2711
228,1.5230000000000001
229,1.6616
230,1.6680000000000001
231,1.5382
232,1.2837
233,0.92511
234,0.49888000000000005
235,0.031595
236,-0.43685
237,-0.8803700000000001
238,-1.2666
239,-1.5719
240,-1.7673
241,-1.8321
242,-1.751
243,-1.521
244,-1.1554
245,-0.68525
246,-0.15887
247,0.36607
248,0.83057
249,1.2052
250,1.464
251,1.6039
252,1.6291
253,1.5578
254,1.3952
255,1.1463
256,0.81611
257,0.41212
258,-0.046594
259,-0.52567
260,-0.9767
261,-1.3429
262,-1.5756
263,-1.6497
264,-1.5575
265,-1.325
266,-0.98964
267,-0.60365
268,-0.20931
269,0.15455
270,0.46976
271,0.72232
272,0.9113700000000001
273,1.0377
274,1.0984
275,1.0831
276,0.9908100000000001
277,0.8186899999999999
278,0.58087
279,0.30171
280,0.0086904
281,-0.2628
282,-0.49813
283,-0.67593
284,-0.79955
285,-0.86713
286,-0.88246
287,-0.84252
288,-0.74747
289,-0.5947899999999999
290,-0.38541
291,-0.12561
292,0.16089
293,0.44036000000000003
294,0.67518
295,0.8422700000000001
296,0.91151
297,0.8760399999999999
298,0.74963
299,0.55004
300,0.31634
301,0.06627000000000001
302,-0.16085
303,-0.35575
304,-0.50197
305,-0.59877
306,-0.64178
307,-0.6378199999999999
308,-0.59773
309,-0.5263399999999999
310,-0.43304
311,-0.32504
312,-0.20915
313,-0.086621
314,0.041002
315,0.17199
316,0.30116
317,0.42325
318,0.51842
319,0.5726100000000001
320,0.57485
321,0.51589
322,0.40068000000000004
323,0.24335
324,0.069721
325,-0.09174299999999999
326,-0.21856
327,-0.29283000000000003
328,-0.31125
329,-0.27799
330,-0.20903000000000002
331,-0.1279
332,-0.046763
333,0.014985
334,0.05392
335,0.051721
336,0.018013
337,-0.048595
338,-0.14311
339,-0.25509
340,-0.36177
341,-0.44745
342,-0.49137
343,-0.48096000000000005
344,-0.40931
345,-0.28269
346,-0.11732000000000001
347,0.06872
348,0.25501999999999997
349,0.43194
350,0.57582
351,0.68884
352,0.7663300000000001
353,0.80373
354,0.79237
355,0.72297
356,0.59065
357,0.39303
358,0.13828
359,-0.15347
360,-0.45768000000000003
361,-0.7457600000000001
362,-0.98724
363,-1.1540000000000001
364,-1.2288
365,-1.2075
366,-1.0834
367,-0.87039
368,-0.5795399999999999
369,-0.23615
370,0.13581
371,0.5068
372,0.84493
373,1.1207
374,1.3092
375,1.3916
376,1.3604
377,1.214
378,0.96886
379,0.64077
380,0.25221
381,-0.16496
382,-0.57868
383,-0.9477399999999999
384,-1.2434
385,-1.4326
386,-1.4968
387,-1.4295
388,-1.2383
389,-0.94042
390,-0.55991
391,-0.13660999999999998
392,0.28833000000000003
393,0.67757
394,1.0019
395,1.2266
396,1.3238
397,1.2926
398,1.1363
399,0.86861
400,0.5270199999999999
401,0.14739000000000002
402,-0.22111
403,-0.54165
404,-0.78233
405,-0.9189700000000001
406,-0.9487899999999999
407,-0.8789100000000001
408,-0.72763
409,-0.51562
410,-0.27042
411,-0.017753
412,0.21713000000000002
413,0.40968000000000004
414,0.5435300000000001
415,0.6098600000000001
416,0.6098399999999999
417,0.5454
418,0.42571000000000003
419,0.26924000000000003
420,0.09084600000000001
421,-0.09642300000000001
422,-0.27921
423,-0.44642
424,-0.5778
425,-0.6550600000000001
426,-0.66161
427,-0.58165
428,-0.41817
429,-0.18369000000000002
430,0.086326
431,0.35084
432,0.5718
433,0.71246
434,0.75949
435,0.70926
436,0.58514
437,0.40459
438,0.1951
439,-0.019001
440,-0.22464
441,-0.41773999999999994
442,-0.58986
443,-0.73009
444,-0.81728
445,-0.83185
446,-0.7521399999999999
447,-0.5717300000000001
448,-0.30095
449,0.025285
450,0.36106
451,0.6629
452,0.87979
453,0.9797600000000001
454,0.96057
455,0.83321
456,0.62988
457,0.37986
458,0.11824000000000001
459,-0.13285
460,-0.36472
461,-0.56522
462,-0.7280399999999999
463,-0.84609
464,-0.90895
465,-0.9049299999999999
466,-0.8214799999999999
467,-0.65612
468,-0.4184
469,-0.1276
470,0.18888
471,0.49755
472,0.75875
473,0.9494600000000001
474,1.0504
475,1.0516
476,0.95365
477,0.7729600000000001
478,0.52892
479,0.24241
480,-0.059329999999999994
481,-0.35493
482,-0.6236
483,-0.85004
484,-1.0161
485,-1.1156
486,-1.1355
487,-1.0702
488,-0.91901
489,-0.69007
490,-0.3941
491,-0.056340999999999995
492,0.29572
493,0.62958
494,0.91619
495,1.1258
496,1.2418
497,1.2646
498,1.1911
499,1.0309
