time,value
0,0.13183
1,0.13183
2,0.13183
3,0.13183
4,0.13183
5,0.13183
6,0.13183
7,0.13183
8,0.13183
9,0.13183
10,0.13183
11,0.13183
12,0.13183
13,0.13183
14,0.13183
15,0.13183
16,0.13183
17,0.2055
18,0.29415
19,0.39371
20,0.49327
21,0.63331
22,0.8084600000000001
23,1.0076
24,1.1189
25,1.1689
26,1.1689
27,1.1689
28,1.1529
29,1.0893
30,0.9972
31,0.89764
32,0.79808
33,0.69852
34,0.57598
35,0.42027
36,0.27486
37,0.1777
38,0.13183
39,0.13183
40,0.13183
41,0.13183
42,0.13183
43,0.16080999999999998
44,0.20783000000000001
45,0.26445
46,0.27999
47,0.29036999999999996
48,0.32954
49,0.35731
50,0.35162
51,0.28745
52,0.27999
53,0.27999
54,0.27999
55,0.27999
56,0.27999
57,0.28108
58,0.30703
59,0.37578
60,0.47265
61,0.55004
62,0.5897100000000001
63,0.62217
64,0.70333
65,0.72447
66,0.72447
67,0.72447
68,0.71404
69,0.67409
70,0.58539
71,0.5602199999999999
72,0.46616
73,0.27412
74,0.16227
75,-0.22215
76,-0.33333
77,-0.53103
78,-0.6703
79,-0.76986
80,-0.8694200000000001
81,-0.96898
82,-1.0685
83,-1.1681
84,-1.4085
85,-1.6716
86,-1.8788
87,-2.0046
88,-2.1430000000000002
89,-2.3304
90,-2.4501
91,-2.5193
92,-2.5349
93,-2.535
94,-2.4925
95,-2.4164
96,-2.3952
97,-2.3403
98,-2.2604
99,-2.1609
100,-2.0613
101,-1.9617
102,-1.8622
103,-1.7626
104,-1.6836
105,-1.6511
106,-1.6461
107,-1.6705
108,-1.7337
109,-1.7738
110,-1.7389
111,-1.6197
112,-1.4205
113,-1.2214
114,-1.0268
115,-0.8814799999999999
116,-0.73233
117,-0.58125
118,-0.43213999999999997
119,-0.31784
120,-0.22946
121,-0.17614000000000002
122,-0.16449
123,-0.16449
124,-0.16449
125,-0.16449
126,-0.16449
127,-0.16449
128,-0.12991
129,-0.32033
130,0.17747000000000002
131,0.13608
132,0.25301999999999997
133,0.38755
134,0.5574100000000001
135,0.68248
136,0.78204
137,0.88159
138,0.98115
139,1.0752
140,1.153
141,1.1689
142,1.1689
143,1.1689
144,1.1689
145,1.1689
146,1.1689
147,1.1689
148,1.1689
149,1.1689
150,1.1689
151,1.1689
152,1.1684
153,1.1637
154,1.0954
155,0.9747299999999999
156,0.77655
157,0.6503899999999999
158,0.55083
159,0.45127
160,0.35170999999999997
161,0.28524
162,0.28052
163,0.19741
164,0.1406
165,0.13210999999999998
166,0.22266
167,-0.24955
168,-0.14844000000000002
169,-0.248
170,-0.39651
171,-0.5611
172,-0.59696
173,-0.6089600000000001
174,-0.5930300000000001
175,-0.51518
176,-0.4777
177,-0.43978999999999996
178,-0.36571
179,-0.33008000000000004
180,-0.31265
181,-0.31265
182,-0.31265
183,-0.31265
184,-0.31265
185,-0.24921
186,-0.19907
187,-0.16080999999999998
188,-0.099938
189,-0.26135
190,-0.32015
191,0.23853000000000002
192,0.48073999999999995
193,0.13183
194,0.13183
195,0.17082
196,0.22183000000000003
197,0.27185
198,0.31989
199,0.36985999999999997
200,0.42365
201,0.42815
202,0.40901
203,0.36701999999999996
204,0.30764
205,0.25955
206,0.21946999999999997
207,0.15624000000000002
208,0.13183
209,0.13183
210,0.13183
211,0.15309
212,0.19308
213,0.26386
214,0.27999
215,0.27999
216,0.27999
217,0.26031
218,0.21561999999999998
219,0.1373
220,0.14983
221,0.20686
222,0.30641999999999997
223,0.40598
224,0.5130399999999999
225,0.63283
226,0.82016
227,0.9585899999999999
228,1.0817
229,1.2728
230,1.4035
231,1.5312
232,1.7261
233,1.8459999999999999
234,1.9456
235,2.0452
236,2.1447
237,2.2840000000000003
238,2.4817
239,2.499
240,2.5937
241,2.7762
242,2.6979
243,2.5056
244,2.214
245,1.8266
246,1.4322
247,1.0494
248,0.7361
249,0.49321000000000004
250,0.30301999999999996
251,0.18506
252,0.14523
253,0.10555999999999999
254,0.13575
255,-0.34864
256,-0.13745
257,-0.1634
258,-0.30191999999999997
259,-0.43832
260,-0.56397
261,-0.59558
262,-0.6089600000000001
263,-0.6015
264,-0.53733
265,-0.4908
266,-0.44901
267,-0.38861
268,-0.29943000000000003
269,-0.21541
270,-0.17247
271,-0.16449
272,-0.20185
273,-0.30754000000000004
274,-0.45116000000000006
275,-0.5995199999999999
276,-0.74815
277,-0.94586
278,-1.1218
279,-1.2729
280,-1.3724
281,-1.472
282,-1.5715
283,-1.6711
284,-1.7201
285,-1.7183
286,-1.6187
287,-1.5192
288,-1.4196
289,-1.32
290,-1.2205
291,-1.1105
292,-0.98264
293,-0.83809
294,-0.74617
295,-0.72163
296,-0.62312
297,-0.53447
298,-0.46081000000000005
299,-0.46081000000000005
300,-0.46081000000000005
301,-0.45863000000000004
302,-0.44353000000000004
303,-0.36165
304,-0.23213000000000003
305,-0.2268
306,0.37564000000000003
307,0.17570999999999998
308,0.27526999999999996
309,0.37483
310,0.47439
311,0.57395
312,0.67351
313,0.77307
314,0.8726299999999999
315,0.15907000000000002
316,0.15907000000000002
317,0.15907000000000002
318,0.15907000000000002
319,0.15907000000000002
320,0.15907000000000002
321,0.15907000000000002
322,0.15907000000000002
323,0.15907000000000002
324,0.15907000000000002
325,0.15907000000000002
326,0.20661999999999997
327,0.25185
328,0.26256
329,0.2641
330,0.2641
331,0.2641
332,0.31632
333,0.40503
334,0.52961
335,0.61759
336,0.72463
337,0.8487899999999999
338,0.98995
339,1.1
340,1.1801
341,1.2028
342,1.2094
343,1.198
344,1.1529
345,1.1223
346,1.0903
347,1.0478
348,0.9809200000000001
349,0.89405
350,0.78366
351,0.68058
352,0.59358
353,0.524
354,0.48921000000000003
355,0.47416
356,0.47416
357,0.47416
358,0.45361999999999997
359,0.42028999999999994
360,0.38015
361,0.34802
362,0.31528
363,0.27247
364,0.24284
365,0.20985
366,0.16435999999999998
367,0.1171
368,0.19209
369,-0.40164
370,-0.15167
371,-0.23215999999999998
372,-0.32306
373,-0.42741999999999997
374,-0.48103
375,-0.50456
376,-0.57514
377,-0.6267199999999999
378,-0.65127
379,-0.60678
380,-0.63007
381,-0.64727
382,-0.58706
383,-0.57614
384,-0.5789
385,-0.58659
386,-0.65073
387,-0.7235
388,-0.7991
389,-0.93514
390,-1.0381
391,-1.1087
392,-1.1792
393,-1.2498
394,-1.3109
395,-1.3112
396,-1.2649
397,-1.2245
398,-1.2891
399,-1.3582
400,-1.4097
401,-1.4154
402,-1.5222
403,-1.6082
404,-1.625
405,-1.6264
406,-1.6264
407,-1.6264
408,-1.6264
409,-1.5963
410,-1.5423
411,-1.5273
412,-1.5214
413,-1.5214
414,-1.5214
415,-1.5214
416,-1.51
417,-1.4598
418,-1.4689
419,-1.4948
420,-1.5179
421,-1.5214
422,-1.5387
423,-1.5835
424,-1.6522
425,-1.6836
426,-1.6698
427,-1.64
428,-1.605
429,-1.5597
430,-1.4509999999999998
431,-1.3679
432,-1.3056
433,-1.2701
434,-1.234
435,-1.1984
436,-1.1656
437,-1.1524
438,-1.1699
439,-1.2404
440,-1.2863
441,-1.3223
442,-1.3498
443,-1.3687
444,-1.3563
445,-1.3109
446,-1.2875
447,-1.2378
448,-1.1692
449,-1.1194
450,-1.0889
451,-1.0637
452,-1.0112
453,-0.99626
454,-0.99626
455,-0.99626
456,-0.99626
457,-1.0005
458,-1.0132
459,-1.0666
460,-1.1013
461,-1.1013
462,-1.1013
463,-1.1013
464,-1.1011
465,-1.0951
466,-1.0548
467,-0.99626
468,-0.99626
469,-0.99626
470,-0.99639
471,-0.9970600000000001
472,-1.0488
473,-1.0816
474,-1.0124
475,-0.9975700000000001
476,-0.9728100000000001
477,-0.9055799999999999
478,-0.89391
479,-0.86361
480,-0.79905
481,-0.7286699999999999
482,-0.7208399999999999
483,-0.7720100000000001
484,-0.78205
485,-0.7862
486,-0.77893
487,-0.72107
488,-0.65475
489,-0.58417
490,-0.51359
491,-0.44301
492,-0.37244
493,-0.30186
494,-0.18915
495,-0.39731
496,0.059269
497,0.12925
498,0.25808000000000003
499,0.39924
500,0.49541999999999997
501,0.57786
502,0.65104
503,0.76477
504,0.89495
505,1.0248
506,1.085
507,1.1309
508,1.1769
509,1.2475
510,1.3181
511,1.3782
512,1.4137
513,1.4477
514,1.4954
515,1.5659
516,1.6365
517,1.68
518,1.6909999999999998
519,1.6208
520,1.5502
521,1.4796
522,1.4091
523,1.3535
524,1.3109
525,1.2878
526,1.2619
527,1.2481
528,1.2778
529,1.2448
530,1.2094
531,1.2094
532,1.2094
533,1.2035
534,1.1884
535,1.1345
536,1.1043
537,1.1043
538,1.1043
539,1.1043
540,1.1051
541,1.1134
542,1.1565
543,1.2103
544,1.216
545,1.2676
546,1.3382
547,1.4087
548,1.4780000000000002
549,1.5245
550,1.5245
551,1.5245
552,1.5245
553,1.5245
554,1.5889
555,1.6583
556,1.7273
557,1.7323
558,1.6622
559,1.5325
560,1.3913
561,1.2897
562,1.2008
563,1.07
564,0.93175
565,0.8205600000000001
566,0.79447
567,0.78925
568,0.78925
569,0.78925
570,0.74221
571,0.70339
572,0.68499
573,0.63551
574,0.59948
575,0.57919
576,0.57919
577,0.55218
578,0.50788
579,0.4828
580,0.50312
581,0.5440699999999999
582,0.5718300000000001
583,0.6096699999999999
584,0.64812
585,0.67856
586,0.6842199999999999
587,0.6842199999999999
588,0.6842199999999999
589,0.65196
590,0.60093
591,0.53036
592,0.42726000000000003
593,0.32066999999999996
594,0.21359
595,0.14302
596,0.35706
597,0.14252
598,-0.18993
599,-0.26008000000000003
600,-0.26008000000000003
601,-0.26008000000000003
602,-0.1699
603,-0.1089
604,0.22391999999999998
605,0.35369
606,0.10386
607,0.15437
608,0.15907000000000002
609,0.16684000000000002
610,0.18423
611,0.23824
612,0.25637
613,0.23888
614,0.18168
615,0.16635
616,0.18529
617,0.24516999999999997
618,0.2641
619,0.2641
620,0.2641
621,0.2641
622,0.2641
623,0.2641
624,0.2641
625,0.2641
626,0.2641
627,0.2641
628,0.2641
629,0.2641
630,0.8035
631,0.8035
632,0.8035
633,0.8035
634,0.8035
635,0.8035
636,0.8035
637,0.8035
638,0.8035
639,0.8035
640,0.8035
641,0.8904
642,1.025
643,1.2087
644,1.2634
645,1.2834
646,1.2834
647,1.4743
648,1.6803
649,1.8883
650,2.0818
651,2.249
652,2.3892
653,2.4721
654,2.5717
655,2.677
656,2.7623
657,2.7723
658,2.7304
659,2.6246
660,2.5005
661,2.3715
662,2.2425
663,2.0809
664,1.933
665,1.8123
666,1.6782
667,1.5313
668,1.3717
669,1.21
670,1.0482
671,0.8897
672,0.76071
673,0.63172
674,0.5079100000000001
675,0.40674
676,0.31288
677,0.20501999999999998
678,0.24819000000000002
679,-0.11574000000000001
680,-0.25540999999999997
681,-0.33855
682,-0.40575
683,-0.5251899999999999
684,-0.71868
685,-0.9121600000000001
686,-1.1056
687,-1.2984
688,-1.4751
689,-1.6331
690,-1.7801
691,-1.9449
692,-2.0434
693,-2.1055
694,-2.1581
695,-2.1718
696,-2.1718
697,-2.1718
698,-2.1785
699,-2.2044
700,-2.2619
701,-2.2521
702,-2.1617
703,-1.9774
704,-1.9068
705,-1.8074
706,-1.6784
707,-1.5495
708,-1.4205
709,-1.3001
710,-1.2353
711,-1.1283
712,-0.9872799999999999
713,-0.79655
714,-0.64935
715,-0.53493
716,-0.46524
717,-0.35152
718,-0.26888
719,-0.25359
720,-0.20153
721,-0.16645
722,-0.15636
723,-0.10357999999999999
724,-0.099498
725,-0.14068
726,-0.20517
727,-0.23949
728,-0.25224
729,-0.25224
730,-0.25224
731,-0.26269000000000003
732,-0.30854000000000004
733,-0.3687
734,-0.41986999999999997
735,-0.44096
736,-0.4442
737,-0.42838000000000004
738,-0.38742
739,-0.36146
740,-0.34822
741,-0.34822
742,-0.34822
743,-0.34822
744,-0.3453
745,-0.31046
746,-0.27809
747,-0.24697
748,-0.21456999999999998
749,-0.15963
750,-0.10962000000000001
751,-0.10504000000000001
752,-0.13198
753,-0.14744000000000002
754,-0.11993
755,-0.42118999999999995
756,-0.30657
757,-0.30657
758,-0.19457
759,-0.22171
760,0.1753
761,0.28228000000000003
762,0.45324
763,0.12980999999999998
764,0.11085999999999999
765,0.30933
766,0.067609
767,-0.23849
768,-0.30657
769,-0.30657
770,-0.30657
771,-0.30657
772,-0.32602
773,-0.38409
774,-0.13365
775,-0.19814
776,-0.26263000000000003
777,-0.32713000000000003
778,-0.39161999999999997
779,-0.45629
780,-0.5262899999999999
781,-0.62759
782,-0.74592
783,-0.81347
784,-0.92222
785,-1.0649
786,-1.2577
787,-1.4040000000000001
788,-1.5157
789,-1.5808
790,-1.5947
791,-1.5959
792,-1.5959
793,-1.5959
794,-1.5959
795,-1.5959
796,-1.54
797,-1.4502
798,-1.3313
799,-1.2577
800,-1.1894
801,-1.1249
802,-1.0604
803,-0.9959100000000001
804,-0.95206
805,-0.9884299999999999
806,-0.97249
807,-0.92989
808,-0.86539
809,-0.7624
810,-0.64471
811,-0.51572
812,-0.30675
813,-0.10937999999999999
814,0.30688000000000004
815,0.15109
816,0.22641999999999998
817,0.2933
818,0.39721999999999996
819,0.49326000000000003
820,0.58553
821,0.68701
822,0.78288
823,0.8698299999999999
824,0.93432
825,0.97356
826,1.005
827,1.0371
828,1.0963
829,1.1608
830,1.2253
831,1.2898
832,1.3419
833,1.3792
834,1.3535
835,1.3069
836,1.2407
837,1.1526
838,1.0669
839,0.9922200000000001
840,0.9711299999999999
841,0.93373
842,0.89948
843,0.89948
844,0.8860299999999999
845,0.85898
846,0.8106899999999999
847,0.79075
848,0.75643
849,0.69194
850,0.6391
851,0.60624
852,0.59443
853,0.52994
854,0.46543999999999996
855,0.40163000000000004
856,0.34476999999999997
857,0.32361999999999996
858,0.32361999999999996
859,0.32361999999999996
860,0.32643
861,0.34464
862,0.40639000000000003
863,0.41958999999999996
864,0.4194
865,0.41878000000000004
866,0.30711
867,0.20385
868,0.13844
869,0.36435
870,0.27194
871,-0.26666
872,0.059160000000000004
873,0.14725
874,0.20271
875,0.49003
876,0.43892
877,0.23390999999999998
878,0.18653
879,0.17331
880,0.10485
881,-0.15802
882,-0.26316999999999996
883,-0.30657
884,-0.30657
885,-0.091614
886,-0.10101
887,-0.16842000000000001
888,-0.26128
889,-0.41913999999999996
890,-0.12875999999999999
891,-0.19325
892,-0.25774
893,-0.32224
894,-0.38673
895,-0.42477
896,-0.45183999999999996
897,-0.49096000000000006
898,-0.54873
899,-0.60316
900,-0.63097
901,-0.60729
902,-0.56157
903,-0.49706999999999996
904,-0.43258
905,-0.38184
906,-0.34913
907,-0.34822
908,-0.34822
909,-0.34678000000000003
910,-0.31866
911,-0.26905
912,-0.2079
913,-0.16908
914,-0.15625999999999998
915,-0.1514
916,-0.12817
917,-0.107
918,-0.09904
919,-0.12195999999999999
920,-0.44868
921,-0.27288
922,-0.18118
923,0.27407
924,0.17331
925,0.17331
926,0.17331
927,0.20865999999999998
928,0.29252
929,0.12402
930,0.19517
931,0.27555999999999997
932,0.38499
933,0.41373999999999994
934,0.39434
935,0.33718000000000004
936,0.32361999999999996
937,0.32361999999999996
938,0.32361999999999996
939,0.32053000000000004
940,0.29366
941,0.22916999999999998
942,0.16468
943,0.49578
944,0.17331
