time,value
0,-0.7528600000000001
1,-0.7538100000000001
2,-0.74632
3,-0.7288
4,-0.70344
5,-0.675
6,-0.6472
7,-0.6203
8,-0.59346
9,-0.56663
10,-0.5412100000000001
11,-0.5199699999999999
12,-0.50413
13,-0.49317
14,-0.4866
15,-0.48356000000000005
16,-0.48398
17,-0.48794
18,-0.49396
19,-0.50054
20,-0.50669
21,-0.51152
22,-0.51526
23,-0.51779
24,-0.51849
25,-0.51798
26,-0.51648
27,-0.51458
28,-0.51336
29,-0.5122
30,-0.51067
31,-0.5090399999999999
32,-0.5068
33,-0.50457
34,-0.50273
35,-0.50069
36,-0.49918
37,-0.49782
38,-0.49613999999999997
39,-0.49528999999999995
40,-0.49388999999999994
41,-0.49162
42,-0.48917
43,-0.4853
44,-0.48028999999999994
45,-0.47421
46,-0.46575
47,-0.45563000000000003
48,-0.44421000000000005
49,-0.4319
50,-0.42091999999999996
51,-0.41103
52,-0.40137
53,-0.39123
54,-0.37801999999999997
55,-0.36108
56,-0.34145
57,-0.32018
58,-0.29938000000000003
59,-0.27984000000000003
60,-0.26082
61,-0.24211
62,-0.22275999999999999
63,-0.20257
64,-0.1826
65,-0.16278
66,-0.14412
67,-0.12829000000000002
68,-0.11594000000000002
69,-0.1082
70,-0.10511
71,-0.10530999999999999
72,-0.10909
73,-0.11692000000000001
74,-0.12957
75,-0.1495
76,-0.17585
77,-0.20647
78,-0.24038
79,-0.27342
80,-0.30394
81,-0.33238
82,-0.35715
83,-0.37944
84,-0.40055999999999997
85,-0.41986
86,-0.43948999999999994
87,-0.45924
88,-0.47763
89,-0.49532
90,-0.50884
91,-0.5160899999999999
92,-0.51705
93,-0.5092
94,-0.49277
95,-0.46806000000000003
96,-0.43355
97,-0.39065
98,-0.34018000000000004
99,-0.28318000000000004
100,-0.22405
101,-0.16417
102,-0.10507000000000001
103,-0.050730000000000004
104,0.0005565
105,0.049102
106,0.094578
107,0.14032999999999998
108,0.18538
109,0.22641999999999998
110,0.26113000000000003
111,0.28369
112,0.29104
113,0.28324
114,0.25835
115,0.21925
116,0.1702
117,0.1148
118,0.06163300000000001
119,0.017235
120,-0.015262000000000001
121,-0.033754
122,-0.039652
123,-0.034627
124,-0.01926
125,0.0052255
126,0.038274
127,0.07828
128,0.12267
129,0.17042000000000002
130,0.21903000000000003
131,0.26602
132,0.31021
133,0.34954
134,0.38458000000000003
135,0.41684
136,0.44543999999999995
137,0.46993999999999997
138,0.48726
139,0.49238999999999994
140,0.4841
141,0.46007
142,0.4179
143,0.35865
144,0.28113
145,0.18644000000000002
146,0.079127
147,-0.03703
148,-0.15596
149,-0.27104
150,-0.37766
151,-0.4696
152,-0.54273
153,-0.59734
154,-0.63342
155,-0.65496
156,-0.6676
157,-0.6729
158,-0.67423
159,-0.67372
160,-0.67061
161,-0.66738
162,-0.66366
163,-0.65792
164,-0.65323
165,-0.6478
166,-0.64053
167,-0.6352899999999999
168,-0.62624
169,-0.61241
170,-0.59722
171,-0.57693
172,-0.5545899999999999
173,-0.53325
174,-0.5079600000000001
175,-0.48176
176,-0.4546
177,-0.42178999999999994
178,-0.38919000000000004
179,-0.35311
180,-0.30925
181,-0.26546
182,-0.21646999999999997
183,-0.16129000000000002
184,-0.10522000000000001
185,-0.040216
186,0.034141000000000005
187,0.11469000000000001
188,0.20701999999999998
189,0.30929
190,0.42368999999999996
191,0.55637
192,0.7040000000000001
193,0.86565
194,1.0376
195,1.2136
196,1.395
197,1.5855
198,1.7886
199,2.0068
200,2.2353
201,2.4648
202,2.6863
203,2.8930000000000002
204,3.0843
205,3.2609
206,3.4207
207,3.5605
208,3.6753
209,3.7618
210,3.818
211,3.8363
212,3.8021
213,3.6965
214,3.5029
215,3.2206
216,2.8652
217,2.4639
218,2.0508
219,1.6527
220,1.2871
221,0.9650700000000001
222,0.68662
223,0.44911999999999996
224,0.2486
225,0.07671499999999999
226,-0.068564
227,-0.18903
228,-0.28898
229,-0.3649
230,-0.41966000000000003
231,-0.46055
232,-0.48589
233,-0.50407
234,-0.51991
235,-0.5304
236,-0.54114
237,-0.5495899999999999
238,-0.5535399999999999
239,-0.56004
240,-0.56513
241,-0.57015
242,-0.58106
243,-0.59014
244,-0.5988100000000001
245,-0.6097100000000001
246,-0.61616
247,-0.6214
248,-0.6259399999999999
249,-0.62765
250,-0.62938
251,-0.63051
252,-0.6307699999999999
253,-0.632
254,-0.63336
255,-0.6352399999999999
256,-0.63868
257,-0.6428699999999999
258,-0.64808
259,-0.6543100000000001
260,-0.6606
261,-0.66674
262,-0.6723399999999999
263,-0.6775899999999999
264,-0.68381
265,-0.69205
266,-0.7028800000000001
267,-0.7158
268,-0.72851
269,-0.7387600000000001
