time,value
0,2.0180000000000002
1,2.0309
2,1.7773
3,1.5207
4,1.2612
5,1.0796
6,0.7995800000000001
7,0.57125
8,0.47426999999999997
9,0.1938
10,0.18992
11,0.10085
12,-0.12237999999999999
13,-0.056009
14,-0.20062
15,-0.12977
16,-0.28562
17,-0.22064
18,-0.26284
19,-0.44806999999999997
20,-0.4272
21,-0.50617
22,-0.56908
23,-0.5667
24,-0.6445
25,-0.68598
26,-0.75546
27,-0.8409399999999999
28,-0.8579
29,-0.91327
30,-0.95931
31,-0.92474
32,-1.0406
33,-0.9696
34,-0.9941399999999999
35,-0.89295
36,-0.88535
37,-0.94936
38,-0.85255
39,-0.7925800000000001
40,-0.73946
41,-0.73946
42,-0.7186100000000001
43,-0.6411899999999999
44,-0.53709
45,-0.49385
46,-0.39232
47,-0.29239
48,-0.12155999999999999
49,0.032277999999999994
50,0.1509
51,0.31385
52,0.42183999999999994
53,0.49477
54,0.57052
55,0.67685
56,0.7974600000000001
57,1.1279
58,1.1529
59,1.1339
60,1.4071
61,1.6823
62,1.8581
63,1.9327
64,2.0238
65,1.9547
66,2.0055
67,1.8636
68,1.7615
69,1.686
70,1.4806
71,1.4297
72,1.319
73,1.2207
74,1.0398
75,0.863
76,0.75995
77,0.64007
78,0.49305
79,0.32907
80,0.20855
81,0.022416
82,-0.027954000000000003
83,-0.19591
84,-0.30849
85,-0.48449
86,-0.52057
87,-0.5905199999999999
88,-0.7693399999999999
89,-0.86136
90,-0.88535
91,-0.9580299999999999
92,-0.9464799999999999
93,-0.9737899999999999
94,-1.0952
95,-1.1467
96,-1.1803
97,-1.1965
98,-1.2358
99,-1.2127
100,-1.1722
101,-1.3125
102,-1.2629
103,-1.2635
104,-1.1965
105,-1.1534
106,-1.1668
107,-1.0843
108,-1.1038
109,-0.97057
110,-0.8277899999999999
111,-0.7925800000000001
112,-0.71463
113,-0.8212200000000001
114,-0.72106
115,-0.6420899999999999
116,-0.54418
117,-0.48331999999999997
118,-0.29577
119,-0.034145999999999996
120,0.014675
121,0.29273000000000005
122,0.52086
123,0.7984
124,1.0814
125,1.3559
126,1.6867
127,1.9611
