time,value
0,-0.91148
1,-0.91148
2,-0.91148
3,-0.91148
4,-0.91148
5,-0.91148
6,-0.91148
7,-0.91148
8,-0.91148
9,-0.91148
10,-0.91148
11,-0.91148
12,-0.91148
13,-0.91148
14,-0.91148
15,-0.91148
16,-0.91148
17,-0.91148
18,-0.91148
19,-0.91148
20,-0.91148
21,-0.9185200000000001
22,-0.9258799999999999
23,-0.9435600000000001
24,-0.96504
25,-0.98208
26,-0.9947299999999999
27,-1.0039
28,-1.0039
29,-1.0039
30,-1.0039
31,-1.0039
32,-1.0039
33,-1.0039
34,-1.0039
35,-1.0039
36,-1.0039
37,-1.0039
38,-1.0039
39,-1.0039
40,-1.0039
41,-1.0039
42,-1.0039
43,-1.0039
44,-1.0039
45,-1.0039
46,-1.0039
47,-1.0077
48,-1.0239
49,-1.0401
50,-1.0616
51,-1.083
52,-1.0908
53,-1.0946
54,-1.0963
55,-1.0963
56,-1.0963
57,-1.0963
58,-1.0963
59,-1.0963
60,-1.0963
61,-1.1143
62,-1.1349
63,-1.1556
64,-1.1765
65,-1.1887
66,-1.1887
67,-1.1883
68,-1.1862
69,-1.1842
70,-1.1634
71,-1.1419
72,-1.1204
73,-1.0989
74,-1.0775
75,-1.056
76,-1.0359
77,-1.0194
78,-1.0039
79,-1.0039
80,-1.0039
81,-0.99851
82,-0.9920399999999999
83,-0.97652
84,-0.9550299999999999
85,-0.9365399999999999
86,-0.9229999999999999
87,-0.91148
88,-0.91148
89,-0.91148
90,-0.91148
91,-0.91148
92,-0.91148
93,-0.91148
94,-0.91148
95,-0.91148
96,-0.91148
97,-0.91148
98,-0.91166
99,-0.9240200000000001
100,-0.9363799999999999
101,-0.9559200000000001
102,-0.9774
103,-0.9833799999999999
104,-0.9772
105,-0.9659200000000001
106,-0.94444
107,-0.9262100000000001
108,-0.93534
109,-0.9444600000000001
110,-0.96445
111,-0.98593
112,-0.9855299999999999
113,-0.97346
114,-0.95739
115,-0.93591
116,-0.91805
117,-0.91481
118,-0.9115700000000001
119,-0.91148
120,-0.91148
121,-0.91148
122,-0.91148
123,-0.91148
124,-0.91148
125,-0.8991600000000001
126,-0.8567799999999999
127,-0.81452
128,-0.77391
129,-0.7333
130,-0.7266699999999999
131,-0.7266699999999999
132,-0.72506
133,-0.72241
134,-0.71255
135,-0.69107
136,-0.67023
137,-0.65286
138,-0.6355
139,-0.63427
140,-0.63427
141,-0.63427
142,-0.63427
143,-0.63427
144,-0.63427
145,-0.63252
146,-0.62546
147,-0.6180899999999999
148,-0.5966
149,-0.57512
150,-0.5536399999999999
151,-0.5321600000000001
152,-0.51067
153,-0.48918999999999996
154,-0.4643
155,-0.43282
156,-0.40003
157,-0.35706
158,-0.3141
159,-0.28131
160,-0.24982
161,-0.22493000000000002
162,-0.20345
163,-0.18197
164,-0.16047999999999998
165,-0.139
166,-0.11752
167,-0.48426
168,-0.30628
169,-0.12677
170,0.079282
171,0.29411
172,0.42553
173,0.48144
174,0.10495
175,0.10495
176,0.10619
177,0.12355
178,0.14090999999999998
179,0.16175
180,0.18323
181,0.20471
182,0.2262
183,0.24768
184,0.26916
185,0.29064
186,0.31213
187,0.33361
188,0.35509
189,0.37656999999999996
190,0.39805999999999997
191,0.41953999999999997
192,0.44101999999999997
193,0.4625
194,0.48398
195,0.50547
196,0.52695
197,0.54843
198,0.56991
199,0.5914
200,0.61288
201,0.63436
202,0.65584
203,0.67732
204,0.69881
205,0.72029
206,0.7417699999999999
207,0.76325
208,0.78474
209,0.8062199999999999
210,0.8277
211,0.8491799999999999
212,0.87067
213,0.89215
214,0.9136299999999999
215,0.93511
216,0.9565899999999999
217,0.97808
218,0.99956
219,1.021
220,1.0425
221,1.064
222,1.0855
223,1.107
224,1.1285
225,1.1499
226,1.1714
227,1.1929
228,1.2144
229,1.2359
230,1.2573
231,1.2788
232,1.2944
233,1.3008
234,1.3062
235,1.3062
236,1.3062
237,1.3373
238,1.3702
239,1.4104
240,1.4533
241,1.4787
242,1.4858
243,1.4909999999999999
244,1.4909999999999999
245,1.4909999999999999
246,1.4909999999999999
247,1.4909999999999999
248,1.4909999999999999
249,1.4909999999999999
250,1.5032
251,1.524
252,1.5448
253,1.5654
254,1.5834
255,1.5834
256,1.5834
257,1.5834
258,1.5834
259,1.5834
260,1.5834
261,1.5817
262,1.5779
263,1.5702
264,1.5487
265,1.5272
266,1.511
267,1.4948
268,1.4909999999999999
269,1.4909999999999999
270,1.4837
271,1.4702
272,1.4474
273,1.4045
274,1.3622
275,1.3275
276,1.2928
277,1.2694
278,1.2479
279,1.2264
280,1.205
281,1.1835
282,1.162
283,1.1425
284,1.1322
285,1.1219
286,1.1214
287,1.1214
288,1.1122
289,1.0996
290,1.0825
291,1.0611
292,1.0434
293,1.036
294,1.0290000000000001
295,1.0290000000000001
296,1.0290000000000001
297,1.0163
298,1.0007
299,0.98161
300,0.9601299999999999
301,0.95099
302,0.9636399999999999
303,0.97749
304,0.99897
305,1.0205
306,1.0419
307,1.0634
308,1.0849
309,1.1064
310,1.1279
311,1.1493
312,1.1708
313,1.1923
314,1.2138
315,-0.9577200000000001
316,-0.9577200000000001
317,-0.9577200000000001
318,-0.9577200000000001
319,-0.9577200000000001
320,-0.9577200000000001
321,-0.9577200000000001
322,-0.9577200000000001
323,-0.9577200000000001
324,-0.9577200000000001
325,-0.9577200000000001
326,-0.9577200000000001
327,-0.9577200000000001
328,-0.9577200000000001
329,-0.9577200000000001
330,-0.9577200000000001
331,-0.9577200000000001
332,-0.9577200000000001
333,-0.9577200000000001
334,-0.9577200000000001
335,-0.9577200000000001
336,-0.9802799999999999
337,-1.0038
338,-1.0604
339,-1.1292
340,-1.1838
341,-1.2243
342,-1.2537
343,-1.2537
344,-1.2537
345,-1.2537
346,-1.2537
347,-1.2537
348,-1.2537
349,-1.2537
350,-1.2537
351,-1.2537
352,-1.2537
353,-1.2537
354,-1.2537
355,-1.2537
356,-1.2537
357,-1.2537
358,-1.2537
359,-1.2537
360,-1.2537
361,-1.2537
362,-1.2537
363,-1.2537
364,-1.2537
365,-1.2537
366,-1.2537
367,-1.2537
368,-1.2537
369,-1.2537
370,-1.2537
371,-1.2736
372,-1.3349
373,-1.3969
374,-1.4657
375,-1.5345
376,-1.5457
377,-1.5486
378,-1.5496
379,-1.5496
380,-1.5496
381,-1.5496
382,-1.5483
383,-1.5417
384,-1.5351
385,-1.4685
386,-1.3997
387,-1.3393
388,-1.2818
389,-1.2537
390,-1.2537
391,-1.2491
392,-1.2331
393,-1.2141
394,-1.1453
395,-1.0765
396,-1.0249
397,-0.9768100000000001
398,-0.9577200000000001
399,-0.9577200000000001
400,-0.9577200000000001
401,-0.9577200000000001
402,-0.9577200000000001
403,-0.9577200000000001
404,-0.9577200000000001
405,-0.9299200000000001
406,-0.89976
407,-0.8427399999999999
408,-0.77395
409,-0.72147
410,-0.6875399999999999
411,-0.6618
412,-0.6618
413,-0.6618
414,-0.6618
415,-0.6618
416,-0.6618
417,-0.6618
418,-0.6618
419,-0.6618
420,-0.6618
421,-0.6618
422,-0.65658
423,-0.60758
424,-0.55857
425,-0.49216000000000004
426,-0.42336
427,-0.35456
428,-0.28576
429,-0.21696
430,-0.14816
431,-0.45891000000000004
432,-0.40708
433,-0.35524
434,-0.35377
435,-0.35377
436,-0.11865999999999999
437,0.19705999999999999
438,0.1063
439,0.1751
440,0.22416
441,0.22511
442,0.22599
443,0.22599
444,0.22599
445,0.22599
446,0.22599
447,0.23116
448,0.23964000000000002
449,0.27123
450,0.34002
451,0.40676
452,0.46237
453,0.5179699999999999
454,0.5219199999999999
455,0.5219199999999999
456,0.5219199999999999
457,0.5219199999999999
458,0.5219199999999999
459,0.5219199999999999
460,0.52753
461,0.55015
462,0.57375
463,0.64255
464,0.71135
465,0.75844
466,0.7999
467,0.81784
468,0.81784
469,0.82875
470,0.8608
471,0.8970100000000001
472,0.9658100000000001
473,1.0346
474,1.1034
475,1.1722
476,1.2409999999999999
477,1.3098
478,1.3607
479,1.3880000000000001
480,1.4097
481,1.4097
482,1.4097
483,1.4097
484,1.4097
485,1.4097
486,1.4097
487,1.4097
488,1.4097
489,1.4097
490,1.4097
491,1.4097
492,1.4097
493,1.4097
494,1.4097
495,1.4097
496,1.4097
497,1.4097
498,1.4097
499,1.4097
500,1.4203
501,1.4853
502,1.5504
503,1.6172
504,1.6841
505,1.6547
506,1.5859
507,1.5199
508,1.4567
509,1.4097
510,1.4097
511,1.4097
512,1.4097
513,1.4097
514,1.4097
515,1.4097
516,1.4097
517,1.4097
518,1.4097
519,1.4097
520,1.4097
521,1.4097
522,1.4097
523,1.4097
524,1.4097
525,1.3934
526,1.3689
527,1.3249
528,1.2561
529,1.1935
530,1.1539
531,1.1143
532,1.1138
533,1.1138
534,1.1138
535,1.1138
536,1.1138
537,1.1138
538,1.102
539,1.0633
540,1.0224
541,0.9535600000000001
542,0.88476
543,0.8528600000000001
544,0.8274100000000001
545,0.81784
546,0.81784
547,0.81784
548,0.81784
549,0.81784
550,0.81784
551,0.81784
552,0.81784
553,0.81784
554,0.81784
555,0.81784
556,0.81784
557,0.81784
558,0.81784
559,0.81784
560,0.81784
561,0.81784
562,0.81784
563,0.81784
564,0.81784
565,0.81784
566,0.81784
567,0.81784
568,0.81784
569,0.81784
570,0.81784
571,0.81784
572,0.81105
573,0.8035100000000001
574,0.7547
575,0.6859
576,0.62258
577,0.56603
578,0.5219199999999999
579,0.5219199999999999
580,0.5219199999999999
581,0.50507
582,0.48811000000000004
583,0.43144
584,0.36264
585,0.29384
586,0.22505
587,0.15625
588,0.43317
589,0.08917699999999999
590,-0.25482
591,-0.11895
592,-0.18775
593,-0.25654
594,-0.30571
595,-0.34341
596,-0.36587
597,-0.36587
598,-0.37222
599,-0.40803
600,-0.44383999999999996
601,-0.511
602,-0.5798
603,-0.58997
604,-0.57772
605,-0.5373899999999999
606,-0.46858999999999995
607,-0.42418
608,-0.44586000000000003
609,-0.46953999999999996
610,-0.53833
611,-0.6071300000000001
612,-0.6351899999999999
613,-0.65404
614,-0.6618
615,-0.6618
616,-0.6618
617,-0.6618
618,-0.6618
619,-0.6618
620,-0.6618
621,-0.6618
622,-0.6618
623,-0.6618
624,-0.6618
625,-0.63271
626,-0.56862
627,-0.50346
628,-0.43467
629,-0.36587
630,-0.9271299999999999
631,-0.9271299999999999
632,-0.9271299999999999
633,-0.9271299999999999
634,-0.9271299999999999
635,-0.9271299999999999
636,-0.9271299999999999
637,-0.9271299999999999
638,-0.9271299999999999
639,-0.9271299999999999
640,-0.9271299999999999
641,-0.9271299999999999
642,-0.9271299999999999
643,-0.9271299999999999
644,-0.9271299999999999
645,-0.9271299999999999
646,-0.9271299999999999
647,-0.9271299999999999
648,-0.9271299999999999
649,-0.9271299999999999
650,-0.9271299999999999
651,-0.9271299999999999
652,-0.9271299999999999
653,-0.9271299999999999
654,-0.9271299999999999
655,-0.9271299999999999
656,-0.9271299999999999
657,-0.9271299999999999
658,-0.9271299999999999
659,-0.9271299999999999
660,-0.9271299999999999
661,-0.9271299999999999
662,-0.9271299999999999
663,-0.9271299999999999
664,-0.9271299999999999
665,-0.9271299999999999
666,-0.9271299999999999
667,-0.9271299999999999
668,-0.9271299999999999
669,-0.9271299999999999
670,-0.9271299999999999
671,-0.9271299999999999
672,-0.9271299999999999
673,-0.9271299999999999
674,-0.9271299999999999
675,-0.9271299999999999
676,-0.9271299999999999
677,-0.9271299999999999
678,-0.9271299999999999
679,-0.9271299999999999
680,-0.9271299999999999
681,-0.9271299999999999
682,-0.9271299999999999
683,-0.9271299999999999
684,-0.9271299999999999
685,-0.9271299999999999
686,-0.8784200000000001
687,-0.7291300000000001
688,-0.57801
689,-0.41034
690,-0.24266999999999997
691,-0.21525
692,-0.20836
693,-0.20295
694,-0.19835999999999998
695,-0.12553
696,0.20663
697,0.20365
698,0.33916999999999997
699,0.47468
700,0.31776
701,0.15009
702,0.058823
703,-0.13735999999999998
704,-0.20592
705,-0.20592
706,-0.20592
707,-0.20592
708,-0.20592
709,-0.20592
710,-0.20592
711,-0.16399
712,-0.11345999999999999
713,0.22335
714,0.17536
715,0.29641
716,0.34005
717,0.35222
718,0.18455
719,0.08030599999999999
720,-0.08039299999999999
721,-0.18375
722,0.36741
723,0.24197
724,0.40963999999999995
725,0.57731
726,0.74498
727,0.91265
728,1.0789
729,1.1502
730,1.2214
731,1.2365
732,1.2365
733,1.2365
734,1.2365
735,1.2365
736,1.2365
737,1.2365
738,1.2365
739,1.2365
740,1.2365
741,1.2365
742,1.2365
743,1.2365
744,1.2365
745,1.2365
746,1.2648
747,1.4072
748,1.5496
749,1.7165
750,1.8842
751,1.8227
752,1.6826
753,1.5282
754,1.3605
755,1.1929
756,1.0252
757,0.85811
758,0.69963
759,0.54114
760,0.5152899999999999
761,0.5152899999999999
762,0.5152899999999999
763,0.5152899999999999
764,0.5152899999999999
765,0.5152899999999999
766,0.5152899999999999
767,0.5152899999999999
768,0.5152899999999999
769,0.5152899999999999
770,0.5152899999999999
771,0.5152899999999999
772,0.5152899999999999
773,0.5152899999999999
774,0.5152899999999999
775,0.5152899999999999
776,0.5152899999999999
777,0.5152899999999999
778,0.5152899999999999
779,0.5152899999999999
780,0.46238
781,0.39576999999999996
782,0.27183
783,0.10415999999999999
784,-0.055795000000000004
785,-0.11322
786,-0.06899
787,0.15469000000000002
788,0.32236
789,0.49003
790,0.6577
791,0.82537
792,0.9930399999999999
793,1.117
794,1.1836
795,1.2365
796,1.2365
797,1.2365
798,1.2365
799,1.2365
800,1.2365
801,1.2365
802,1.1714
803,1.0474
804,0.91035
805,0.74268
806,0.58462
807,0.5524600000000001
808,0.52031
809,0.5152899999999999
810,0.5152899999999999
811,0.5152899999999999
812,0.5152899999999999
813,0.5152899999999999
814,0.5152899999999999
815,0.5152899999999999
816,0.5152899999999999
817,0.5152899999999999
818,0.5152899999999999
819,0.5152899999999999
820,0.5152899999999999
821,0.5152899999999999
822,0.50865
823,0.49487
824,0.44178999999999996
825,0.27412
826,0.10717
827,-0.18025
828,-0.17764000000000002
829,-0.20592
830,-0.20592
831,-0.22703
832,-0.26378
833,-0.34603
834,-0.5137
835,-0.67555
836,-0.79499
837,-0.9144200000000001
838,-0.9271299999999999
839,-0.9271299999999999
840,-0.9271299999999999
841,-0.9271299999999999
842,-0.9271299999999999
843,-0.9271299999999999
844,-0.9271299999999999
845,-0.9271299999999999
846,-0.9271299999999999
847,-0.9271299999999999
848,-0.9271299999999999
849,-0.98988
850,-1.0726
851,-1.2005
852,-1.3681
853,-1.5071
854,-1.5806
855,-1.6483
856,-1.6483
857,-1.6483
858,-1.6483
859,-1.6483
860,-1.6483
861,-1.6483
862,-1.6483
863,-1.6483
864,-1.6483
865,-1.6483
866,-1.6483
867,-1.6483
868,-1.6483
869,-1.6483
870,-1.6483
871,-1.5798
872,-1.4397
873,-1.2923
874,-1.1247
875,-0.96236
876,-0.94629
877,-0.93021
878,-0.9271299999999999
879,-0.9271299999999999
880,-0.9271299999999999
881,-0.9271299999999999
882,-0.9271299999999999
883,-0.9271299999999999
884,-0.9271299999999999
885,-0.9271299999999999
886,-0.9271299999999999
887,-0.9271299999999999
888,-0.9271299999999999
889,-0.9271299999999999
890,-0.9271299999999999
891,-0.91379
892,-0.8839299999999999
893,-0.8237700000000001
894,-0.6561
895,-0.48843000000000003
896,-0.36180999999999996
897,-0.23548000000000002
898,-0.20592
899,-0.20592
900,-0.20592
901,-0.20592
902,-0.20592
903,-0.20592
904,-0.20592
905,-0.20592
906,-0.20592
907,-0.20592
908,-0.20592
909,-0.15808
910,-0.41547
911,0.14920999999999998
912,0.19833
913,0.38147
914,0.63642
915,0.8913700000000001
916,1.2227
917,1.5581
918,1.8219999999999998
919,2.0585
920,2.2609
921,2.4286
922,2.5368
923,2.484
924,2.4263
925,2.2586
926,2.0909
927,2.0225
928,1.9766
929,1.9577
930,1.9577
931,1.9095
932,1.7763
933,1.6385
934,1.4708
935,1.3031
936,1.1354
937,0.96777
938,0.8001
939,0.63243
940,0.53565
941,0.52417
942,0.5152899999999999
943,0.5152899999999999
944,0.5152899999999999
