time,value
0,-1.5234
1,-1.5234
2,-1.5234
3,-1.5234
4,-1.5234
5,-1.5234
6,-1.5234
7,-1.5234
8,-1.5234
9,-1.5234
10,-1.5234
11,-1.5234
12,-1.5234
13,-1.5234
14,-1.5234
15,-1.5234
16,-1.5234
17,-1.5234
18,-1.5234
19,-1.5234
20,-1.5234
21,-1.5234
22,-1.5234
23,-1.5234
24,-1.5234
25,-1.5234
26,-1.5234
27,-1.5234
28,-1.5234
29,-1.5234
30,-1.5234
31,-1.5234
32,-1.5234
33,-1.5234
34,-1.5234
35,-1.5234
36,-1.5234
37,-1.5234
38,-1.5234
39,-1.5234
40,-1.5234
41,-1.5234
42,-1.5234
43,-1.5234
44,-1.5234
45,-1.5234
46,-1.5234
47,-1.5234
48,-1.5234
49,-1.5234
50,-1.5234
51,-1.5234
52,-1.5234
53,-1.5234
54,-1.5234
55,-1.5234
56,-1.5234
57,-1.5239
58,-1.5278
59,-1.5318
60,-1.5462
61,-1.5626
62,-1.5754
63,-1.5852
64,-1.5922
65,-1.5922
66,-1.5919999999999999
67,-1.5735
68,-1.5551
69,-1.526
70,-1.4932
71,-1.4658
72,-1.4447
73,-1.4246
74,-1.4081
75,-1.3917
76,-1.3488
77,-1.3035
78,-1.2547
79,-1.2041
80,-1.1420000000000001
81,-1.0598
82,-0.9779399999999999
83,-0.89904
84,-0.8201299999999999
85,-0.7519
86,-0.68615
87,-0.61722
88,-0.54555
89,-0.47113999999999995
90,-0.38895
91,-0.30675
92,-0.23299
93,-0.15934
94,-0.091304
95,-0.025551
96,0.040202
97,0.10595999999999998
98,0.17171
99,0.23746
100,0.30321
101,0.35675999999999997
102,0.40871
103,0.45905
104,0.50836
105,0.5522
106,0.58508
107,0.6178
108,0.64805
109,0.67829
110,0.6977300000000001
111,0.71417
112,0.73328
113,0.75498
114,0.77927
115,0.81214
116,0.8450200000000001
117,0.87035
118,0.89533
119,0.9145
120,0.93094
121,0.94737
122,0.9638100000000001
123,0.98025
124,0.99669
125,1.0131
126,1.0183
127,1.0216
128,1.023
129,1.023
130,1.0134
131,0.98182
132,0.9502200000000001
133,0.91735
134,0.8844700000000001
135,0.85159
136,0.81872
137,0.78584
138,0.7529600000000001
139,0.72009
140,0.68721
141,0.6543399999999999
142,0.62146
143,0.58858
144,0.55571
145,0.52283
146,0.49738999999999994
147,0.48423999999999995
148,0.47242
149,0.47242
150,0.47242
151,0.4621
152,0.44961
153,0.43493999999999994
154,0.4185
155,0.40623000000000004
156,0.40491
157,0.4036
158,0.40228
159,0.40097
160,0.38869000000000004
161,0.37225
162,0.35581999999999997
163,0.33938
164,0.32294
165,0.3065
166,0.29006
167,0.27363000000000004
168,0.25719000000000003
169,0.24075
170,0.22430999999999998
171,0.20786999999999997
172,0.19143
173,0.175
174,0.15855999999999998
175,0.14212
176,0.13512000000000002
177,0.13051
178,0.12830999999999998
179,0.12830999999999998
180,0.13188
181,0.14634
182,0.16080999999999998
183,0.17719000000000001
184,0.19363
185,0.21006
186,0.2265
187,0.24156
188,0.25471
189,0.26595
190,0.26595
191,0.26595
192,0.26595
193,0.26595
194,0.26595
195,0.26595
196,0.26595
197,0.26595
198,0.26595
199,0.26595
200,0.26595
201,0.28313
202,0.30548000000000003
203,0.33302
204,0.3659
205,0.40178
206,0.44846
207,0.49515
208,0.5443100000000001
209,0.59362
210,0.6539
211,0.71965
212,0.7864300000000001
213,0.85482
214,0.9248
215,1.0070000000000001
216,1.0892
217,1.1758
218,1.2632
219,1.357
220,1.4556
221,1.5451
222,1.6122
223,1.6788
224,1.7116
225,1.7445
226,1.7541
227,1.7554
228,1.7485
229,1.732
230,1.7156
231,1.6992
232,1.6827
233,1.6663
234,1.6498
235,1.6233
236,1.5911
237,1.5579
238,1.5231
239,1.4869999999999999
240,1.4377
241,1.3884
242,1.339
243,1.2897
244,1.2404
245,1.1911
246,1.1418
247,1.0925
248,1.0432
249,0.99384
250,0.94453
251,0.8952100000000001
252,0.8459
253,0.7965800000000001
254,0.74727
255,0.69795
256,0.64864
257,0.59932
258,0.55001
259,0.50069
260,0.46058000000000004
261,0.42639
262,0.39308000000000004
263,0.36152
264,0.33083
265,0.31439
266,0.29795
267,0.28152
268,0.26508000000000004
269,0.24864
270,0.2322
271,0.21575999999999998
272,0.19932
273,0.18289
274,0.16645
275,0.15001
276,0.13984000000000002
277,0.13260999999999998
278,0.12830999999999998
279,0.12830999999999998
280,0.12830999999999998
281,0.12830999999999998
282,0.12830999999999998
283,0.12830999999999998
284,0.12830999999999998
285,0.1367
286,0.15116
287,0.16623
288,0.18267
289,0.19910999999999998
290,0.21554
291,0.23198000000000002
292,0.24594000000000002
293,0.25909
294,0.26595
295,0.26595
296,0.26595
297,0.26595
298,0.26595
299,0.26595
300,0.26595
301,0.26038
302,0.25183
303,0.24031
304,0.22386999999999999
305,0.20856999999999998
306,0.20331
307,0.19805
308,0.19713
309,0.19713
310,0.19713
311,0.19713
312,0.19713
313,0.19713
314,0.19713
