time,value
0,-1.1064
1,-0.9023
2,-0.67666
3,-0.41558999999999996
4,-0.10905999999999999
5,0.29139
6,0.79005
7,1.3162
8,1.7978
9,2.1623
10,2.3243
11,2.1926
12,1.7873
13,1.1802
14,0.43723
15,-0.29197
16,-0.9061299999999999
17,-1.3171
18,-1.466
19,-1.4046
20,-1.2134
21,-0.9733299999999999
22,-0.74571
23,-0.5655600000000001
24,-0.45043999999999995
25,-0.37956999999999996
26,-0.3106
27,-0.20834
28,-0.062989
29,0.11422
30,0.29919
31,0.45656
32,0.55084
33,0.56099
34,0.48258999999999996
35,0.36422
36,0.24627
37,0.16412000000000002
38,0.11269000000000001
39,0.09164800000000001
40,0.09739500000000001
41,0.14096
42,0.13828
43,0.088391
44,0.027127
45,-0.052235000000000004
46,-0.14533
47,-0.20624
48,-0.24109
49,-0.25799
50,-0.26884
51,-0.27797
52,-0.28584
53,-0.31546
54,-0.33682
55,-0.33925
56,-0.3023
57,-0.24031999999999998
58,-0.12574000000000002
59,0.030794
60,0.20035999999999998
61,0.34065
62,0.42931
63,0.4477
64,0.37977
65,0.3029
66,0.22591
67,0.14099
68,0.13878
69,0.21281
70,0.32694
71,0.42171000000000003
72,0.43171000000000004
73,0.27991
74,-0.023400999999999998
75,-0.41417
76,-0.82134
77,-1.1269
78,-1.2329999999999999
79,-1.0958
80,-0.7371
81,-0.25991
82,0.24503000000000003
83,0.6206699999999999
84,0.81103
85,0.78394
86,0.61226
87,0.41834
88,0.28676999999999997
89,0.23903000000000002
90,0.24574000000000001
91,0.30243000000000003
92,0.30877
93,0.22769
94,0.046364999999999996
95,-0.17076
96,-0.37331
97,-0.51547
98,-0.551
99,-0.52295
100,-0.48031
101,-0.49528999999999995
102,-0.59149
103,-0.71496
104,-0.79919
105,-0.74769
106,-0.48131
107,0.025137
108,0.68121
109,1.3589
110,1.8901
111,2.1277
112,1.9933
113,1.5168
114,0.76681
115,-0.085247
116,-0.9155
117,-1.5824
118,-2.0005
119,-2.2071
120,-2.2043
121,-2.0122
122,-1.6543
123,-1.1762
124,-0.599
125,0.072758
126,0.77523
127,1.4392
128,1.9867
129,2.3782
130,2.5231
131,2.4308
132,2.1236
133,1.646
134,1.0372
135,0.35705
136,-0.35008
137,-1.0576
138,-1.6886
139,-2.1661
140,-2.4314
141,-2.4634
142,-2.2434
143,-1.8019
144,-1.2236
145,-0.59358
146,-0.0016631
147,0.48536999999999997
148,0.86426
149,1.1616
150,1.3831
151,1.5129
152,1.5415
153,1.4138
154,1.0981
155,0.6066600000000001
156,0.00035602
157,-0.58736
158,-0.98746
159,-1.1283
160,-0.9425
161,-0.52588
162,-0.013226
163,0.44053000000000003
164,0.66923
165,0.62797
166,0.32838
167,-0.078921
168,-0.43218999999999996
169,-0.62589
170,-0.62844
171,-0.45014
172,-0.18918
173,0.022185
174,0.11115
175,0.013375
176,-0.17708
177,-0.35734
178,-0.45552
179,-0.38711999999999996
180,-0.16177
181,0.12352
182,0.39166
183,0.5555
184,0.5888899999999999
185,0.51047
186,0.36804000000000003
187,0.28662
188,0.25289
189,0.28031
190,0.33518000000000003
191,0.34508
192,0.24427
193,0.015642
194,-0.29224
195,-0.5999899999999999
196,-0.8359700000000001
197,-0.9174100000000001
198,-0.80108
199,-0.5203899999999999
200,-0.15680999999999998
201,0.18178
202,0.40565999999999997
203,0.49553
204,0.42763
205,0.25008
206,0.048629
207,-0.10883
208,-0.21358000000000002
209,-0.24163
210,-0.19888
211,-0.13658
212,-0.079667
213,-0.031858
214,0.0021493000000000003
215,0.017766
216,-0.0093737
217,-0.09325800000000001
218,-0.21864
219,-0.41448999999999997
220,-0.63103
221,-0.79887
222,-0.88908
223,-0.85246
224,-0.66095
225,-0.35323000000000004
226,-0.018994
227,0.26875
228,0.48049
229,0.55
230,0.5228
231,0.50935
232,0.58132
233,0.81772
234,1.1508
235,1.5323
236,1.8146
237,1.8543
238,1.6163
239,1.0873
240,0.36574
241,-0.37066
242,-0.99461
243,-1.4048
244,-1.5326
245,-1.4615
246,-1.2878
247,-1.123
248,-1.0292
249,-1.0228
250,-1.0658
251,-1.0545
252,-0.91501
253,-0.64785
254,-0.27276999999999996
255,0.19815
256,0.59132
257,0.9038799999999999
258,1.095
259,1.1529
260,1.1814
261,1.1726
262,1.1523
263,1.0967
264,0.94345
265,0.66571
266,0.25661
267,-0.2555
268,-0.7835
269,-1.2048
270,-1.4567
271,-1.4293
272,-1.1762
273,-0.7868
274,-0.29156
275,0.16479000000000002
276,0.54392
277,0.7774
278,0.88225
279,0.8895799999999999
280,0.7911
281,0.66804
282,0.5123
283,0.31848000000000004
284,0.08037899999999999
285,-0.19158
286,-0.48915
287,-0.7573
288,-0.9872
289,-1.0971
290,-1.0326
291,-0.8223299999999999
292,-0.47112
293,-0.021405
294,0.44016000000000005
295,0.85341
296,1.1153
297,1.1986
298,1.1261
299,0.88879
300,0.55101
301,0.19227
302,-0.15042
303,-0.40811
304,-0.59753
305,-0.70445
306,-0.7490399999999999
307,-0.72651
308,-0.63803
309,-0.51493
310,-0.33673000000000003
311,-0.15145999999999998
312,0.01087
313,0.10795999999999999
314,0.13064
315,0.047068
316,-0.076431
317,-0.19054000000000001
318,-0.22858
319,-0.16726
320,-0.006178800000000001
321,0.20473
322,0.38448000000000004
323,0.4739
324,0.41528000000000004
325,0.24428000000000002
326,0.010405
327,-0.12567
328,-0.0798
329,0.12819
330,0.58304
331,1.1625
332,1.6767
333,1.9479
334,1.8658
335,1.3907
336,0.5654100000000001
337,-0.46776999999999996
338,-1.4721
339,-2.298
340,-2.8268
341,-2.9453
342,-2.7112
343,-2.1663
344,-1.4548
345,-0.71628
346,-0.02376
347,0.51853
348,0.92455
349,1.1977
350,1.3795
351,1.5169
352,1.6494
353,1.7485
354,1.7852
355,1.7292
356,1.4654
357,1.0812
358,0.56042
359,-0.013826
360,-0.51039
361,-0.9119799999999999
362,-1.1601
363,-1.2129
364,-1.119
365,-0.9282299999999999
366,-0.735
367,-0.6178
368,-0.55882
369,-0.60587
370,-0.67314
371,-0.69038
372,-0.61862
373,-0.39918000000000003
374,-0.035656
375,0.37208
376,0.74845
377,1.0444
378,1.1456
379,1.0335
380,0.76386
381,0.45401
382,0.15835
383,-0.048797
384,-0.07157100000000001
385,0.0013664000000000003
386,0.080567
387,0.10751
388,0.033103
389,-0.16072999999999998
390,-0.44906
391,-0.72935
392,-0.8848799999999999
393,-0.888
394,-0.7248
395,-0.40229000000000004
396,-0.057304999999999995
397,0.25415
398,0.49959
399,0.63472
400,0.70025
401,0.7297600000000001
402,0.73061
403,0.7066
404,0.61256
405,0.44122
406,0.17374
407,-0.13493
408,-0.4251
409,-0.60917
410,-0.5827899999999999
411,-0.35749000000000003
412,-0.02496
413,0.35365
414,0.66568
415,0.72463
416,0.5767399999999999
417,0.27318000000000003
418,-0.11753
419,-0.5101100000000001
420,-0.8121
421,-0.96301
422,-1.016
423,-1.0191
424,-0.9833700000000001
425,-0.87472
426,-0.70635
427,-0.44956999999999997
428,-0.083402
429,0.32927
430,0.77045
431,1.0688
432,1.1694
433,1.0685
434,0.82205
435,0.50095
436,0.23584000000000002
437,0.12678
438,0.22236
439,0.4615
440,0.7184
441,0.9536100000000001
442,1.0393
443,0.88313
444,0.49743999999999994
445,-0.014891
446,-0.6121
447,-1.2554
448,-1.7932
449,-2.2174
450,-2.4628
451,-2.4935
452,-2.2592
453,-1.7546
454,-1.0329
455,-0.14499
456,0.77346
457,1.5989
458,2.2195
459,2.5533
460,2.6053
461,2.4282
462,2.0997
463,1.7047
464,1.2503
465,0.73735
466,0.16325
467,-0.44832
468,-1.0856
469,-1.6593
470,-2.0631
471,-2.2916
472,-2.2515
473,-2.0049
474,-1.5996
475,-1.1203
476,-0.6652899999999999
477,-0.21231
478,0.1866
479,0.59738
480,1.0281
481,1.4665
482,1.8466
483,2.0245
484,1.9939
485,1.6482
486,1.04
487,0.28183
488,-0.49112
489,-1.1554
490,-1.5682
491,-1.6641
492,-1.4818
493,-1.1045
494,-0.58402
495,-0.089701
496,0.2812
497,0.50647
498,0.55387
499,0.3988
