time,value
0,1.807
1,1.807
2,1.807
3,1.807
4,1.807
5,1.807
6,1.807
7,1.807
8,1.807
9,1.807
10,1.807
11,1.807
12,1.807
13,1.807
14,1.807
15,1.807
16,1.807
17,1.807
18,1.807
19,1.807
20,1.807
21,1.807
22,1.807
23,1.807
24,1.807
25,1.7989
26,1.7514
27,1.67
28,1.575
29,1.48
30,1.4601
31,1.4601
32,1.4601
33,1.4601
34,1.4601
35,1.4601
36,1.4601
37,1.4601
38,1.4601
39,1.4601
40,1.4601
41,1.4601
42,1.4601
43,1.4601
44,1.4778
45,1.5728
46,1.6678
47,1.7377
48,1.7377
49,1.6612
50,1.5662
51,1.4712
52,1.2922
53,1.1022
54,0.91219
55,0.81365
56,0.76637
57,0.76637
58,0.76637
59,0.76637
60,0.76637
61,0.76637
62,0.76637
63,0.76637
64,0.76637
65,0.76637
66,0.73985
67,0.64485
68,0.54984
69,0.47184
70,0.42433999999999994
71,0.41948
72,0.41948
73,0.41948
74,0.41948
75,0.41948
76,0.41948
77,0.41948
78,0.41948
79,0.41948
80,0.41948
81,0.41948
82,0.41948
83,0.41948
84,0.41948
85,0.41948
86,0.41948
87,0.41948
88,0.41948
89,0.41948
90,0.41948
91,0.41948
92,0.41948
93,0.41948
94,0.41948
95,0.41948
96,0.41948
97,0.41948
98,0.41948
99,0.41948
100,0.41948
101,0.41948
102,0.41948
103,0.34656
104,0.25156
105,0.15655
106,0.10175
107,0.072587
108,0.072587
109,0.072587
110,0.072587
111,0.072587
112,0.072587
113,0.098438
114,0.14992
115,0.24493
116,0.33994
117,0.41948
118,0.41948
119,0.41948
120,0.41948
121,0.41948
122,0.41948
123,0.41948
124,0.41948
125,0.41948
126,0.41948
127,0.41948
128,0.41948
129,0.41948
130,0.41948
131,0.41948
132,0.41948
133,0.41948
134,0.41948
135,0.41948
136,0.41948
137,0.41948
138,0.41948
139,0.41948
140,0.41948
141,0.41948
142,0.40357
143,0.35606
144,0.26702
145,0.17201
146,0.07700599999999999
147,-0.018002
148,-0.11300999999999999
149,-0.20647
150,-0.25398000000000004
151,-0.2743
152,-0.2743
153,-0.2743
154,-0.33616999999999997
155,-0.43118
156,-0.52618
157,-0.6211899999999999
158,-0.7162
159,-0.81121
160,-0.90622
161,-0.9680799999999999
162,-0.9680799999999999
163,-0.9680799999999999
164,-0.9680799999999999
165,-0.9680799999999999
166,-0.9680799999999999
167,-0.9680799999999999
168,-0.9680799999999999
169,-0.9680799999999999
170,-0.9680799999999999
171,-0.9680799999999999
172,-0.9680799999999999
173,-0.9680799999999999
174,-0.9680799999999999
175,-0.9680799999999999
176,-1.0388
177,-1.1338
178,-1.2288
179,-1.3238
180,-1.4188
181,-1.5138
182,-1.6088
183,-1.6619
184,-1.6619
185,-1.6619
186,-1.6619
187,-1.6619
188,-1.6619
189,-1.6619
190,-1.6619
191,-1.6619
192,-1.6619
193,-1.6515
194,-1.604
195,-1.5205
196,-1.4254
197,-1.3304
198,-1.315
199,-1.315
200,-1.315
201,-1.315
202,-1.315
203,-1.315
204,-1.315
205,-1.315
206,-1.315
207,-1.315
208,-1.2858
209,-1.2309999999999999
210,-1.136
211,-1.041
212,-0.9680799999999999
213,-0.9680799999999999
214,-0.9680799999999999
215,-0.9680799999999999
216,-0.9680799999999999
217,-0.9680799999999999
218,-0.9680799999999999
219,-0.9680799999999999
220,-0.9680799999999999
221,-0.9680799999999999
222,-0.9680799999999999
223,-0.9680799999999999
224,-0.9680799999999999
225,-0.9680799999999999
226,-0.9680799999999999
227,-0.9680799999999999
228,-0.9680799999999999
229,-0.9680799999999999
230,-0.9680799999999999
231,-0.9680799999999999
232,-0.9680799999999999
233,-0.9680799999999999
234,-0.9680799999999999
235,-0.9680799999999999
236,-0.9680799999999999
237,-0.9680799999999999
238,-0.9680799999999999
239,-0.9680799999999999
240,-0.9680799999999999
241,-0.9680799999999999
242,-0.9680799999999999
243,-0.9680799999999999
244,-0.9632200000000001
245,-0.9157200000000001
246,-0.83772
247,-0.7427199999999999
248,-0.64771
249,-0.6211899999999999
250,-0.6211899999999999
251,-0.6211899999999999
252,-0.6211899999999999
253,-0.6211899999999999
254,-0.6211899999999999
255,-0.6211899999999999
256,-0.6211899999999999
257,-0.6211899999999999
258,-0.6211899999999999
259,-0.59755
260,-0.54828
261,-0.45327
262,-0.35825999999999997
263,-0.28535
264,-0.38036
265,-0.47536999999999996
266,-0.56109
267,-0.6086
268,-0.6211899999999999
269,-0.6211899999999999
270,-0.6211899999999999
271,-0.69853
272,-0.7935300000000001
273,-0.88854
274,-0.9411299999999999
275,-0.9680799999999999
276,-0.9680799999999999
277,-0.9680799999999999
278,-0.9194700000000001
279,-0.82447
280,-0.72946
281,-0.63445
282,-0.5394399999999999
283,-0.44443
284,-0.34943
285,-0.2743
286,-0.2743
287,-0.2743
288,-0.2743
289,-0.2743
290,-0.2743
291,-0.2743
292,-0.2743
293,-0.2743
294,-0.2743
295,-0.2743
296,-0.2743
297,-0.2743
298,-0.2743
299,-0.2743
300,-0.21686
301,-0.12185
302,-0.02684
303,0.06816799999999999
304,0.16318
305,0.25818
306,0.35319
307,0.4482
308,0.5432100000000001
309,0.63822
310,0.69699
311,0.69699
312,0.60949
313,0.51449
314,0.41948
