time,value
0,0.2816
1,-0.27025
2,0.037585
3,0.11828
4,0.31471
5,-0.38706
6,0.041232
7,-0.26427
8,-0.12849000000000002
9,-0.080235
10,0.39387
11,0.082359
12,-0.06441000000000001
13,-0.30682
14,0.15868
15,0.33186
16,-0.12145
17,-0.10787000000000001
18,0.4542
19,0.07176
20,-0.011271999999999999
21,-0.38351
22,0.21750999999999998
23,-0.063422
24,-0.33878
25,0.1303
26,0.14247
27,-0.07245399999999999
28,-0.14104
29,0.48832
30,0.038574000000000004
31,1.4104
32,1.4104
33,1.4104
34,1.4104
35,1.4104
36,1.4104
37,1.4104
38,1.4104
39,1.4104
40,1.4104
41,1.4104
42,1.4104
43,1.4104
44,1.4104
45,1.4104
46,-1.4694
47,-1.4694
48,-1.4694
49,-1.4694
50,-1.4694
51,-1.4694
52,-1.4694
53,-1.4694
54,-1.4694
55,-1.4694
56,-1.4694
57,-1.4694
58,-1.4694
59,-1.4694
60,-1.4694
61,0.077775
62,-0.24274
63,-0.57762
64,-0.26637
65,0.11886
66,0.045385
67,0.18147
68,0.44842
69,-0.26345
70,-0.038071
71,0.15780999999999998
72,0.0028923
73,0.24791
74,0.4902
75,-0.24564
76,0.09688
77,0.024722
78,-0.12302
79,-0.34231
80,-0.39195
81,0.36125999999999997
82,-0.47446000000000005
83,-0.41622
84,0.055709
85,0.47696000000000005
86,0.19369
87,-0.065301
88,-0.16515
89,-0.16822
90,0.37211
91,0.10983
92,-0.4155
93,0.36464
94,0.16568
95,0.29072
96,-0.11957999999999999
97,1.4104
98,1.4104
99,1.4104
100,1.4104
101,1.4104
102,1.4104
103,1.4104
104,1.4104
105,1.4104
106,1.4104
107,1.4104
108,1.4104
109,1.4104
110,1.4104
111,1.4104
112,-1.4694
113,-1.4694
114,-1.4694
115,-1.4694
116,-1.4694
117,-1.4694
118,-1.4694
119,-1.4694
120,-1.4694
121,-1.4694
122,-1.4694
123,-1.4694
124,-1.4694
125,-1.4694
126,-0.035823
127,-0.19186
