time,value
0,1.6515
1,1.6515
2,1.6515
3,1.6515
4,1.6515
5,1.6515
6,1.6515
7,1.6515
8,1.6523
9,1.6637
10,1.7077
11,1.7232
12,1.7282
13,1.7282
14,1.7282
15,1.7369
16,1.7589
17,1.838
18,1.8816
19,1.8816
20,1.8816
21,1.9141
22,1.9754
23,2.0634
24,2.1591
25,2.2616
26,2.3752
27,2.3453
28,2.2574
29,2.1694
30,2.0332
31,1.8825
32,1.7286
33,1.6055
34,1.4975
35,1.4047
36,1.2747
37,1.1428
38,1.0118
39,0.9116
40,0.80519
41,0.6933699999999999
42,0.5761
43,0.47383000000000003
44,0.37273
45,0.2408
46,0.16914
47,0.11282
48,0.035865
49,-0.069601
50,-0.18871
51,-0.32064000000000004
52,-0.4461
53,-0.55519
54,-0.6431399999999999
55,-0.68993
56,-0.7517
57,-0.8292200000000001
58,-0.8915200000000001
59,-0.95311
60,-1.0164
61,-1.0958
62,-1.1518
63,-1.1958
64,-1.2398
65,-1.2837
66,-1.3352
67,-1.4061
68,-1.4759
69,-1.5364
70,-1.5803
71,-1.6232
72,-1.6473
73,-1.6473
74,-1.6473
75,-1.6473
76,-1.6484
77,-1.6679
78,-1.6889
79,-1.702
80,-1.6580000000000001
81,-1.6141
82,-1.5782
83,-1.5721
84,-1.5264
85,-1.4592
86,-1.3712
87,-1.2833
88,-1.1953
89,-1.1073
90,-1.0194
91,-0.9490700000000001
92,-0.9002100000000001
93,-0.9167
94,-0.91307
95,-0.8864799999999999
96,-0.7985300000000001
97,-0.71057
98,-0.62262
99,-0.53467
100,-0.44671000000000005
101,-0.366
102,-0.3098
103,-0.26299
104,-0.22351
105,-0.19419
106,-0.19485999999999998
107,-0.21559
108,-0.25956999999999997
109,-0.2651
110,-0.28175
111,-0.31467
112,-0.33421
113,-0.35176
114,-0.37
115,-0.41397
116,-0.45795
117,-0.49496999999999997
118,-0.49618999999999996
119,-0.49655
120,-0.50276
121,-0.52841
122,-0.55502
123,-0.57052
124,-0.56197
125,-0.52294
126,-0.49655
127,-0.49655
128,-0.46326999999999996
129,-0.43662
130,-0.41984
131,-0.41984
132,-0.41438
133,-0.40151
134,-0.35996999999999996
135,-0.37293000000000004
136,-0.41043
137,-0.41776
138,-0.43996
139,-0.47212
140,-0.5161
141,-0.55133
142,-0.57409
143,-0.57653
144,-0.61529
145,-0.65927
146,-0.70324
147,-0.71927
148,-0.7471800000000001
149,-0.78982
150,-0.86556
151,-0.9231299999999999
152,-0.96711
153,-1.0111
154,-1.0551
155,-1.099
156,-1.143
157,-1.1709
158,-1.1906
159,-1.2041
160,-1.2422
161,-1.2862
162,-1.3302
163,-1.3025
164,-1.2899
165,-1.3095
166,-1.3302
167,-1.3330000000000002
168,-1.3173
169,-1.2794
170,-1.2637
171,-1.2481
172,-1.1235
173,-1.0598
174,-1.0236
175,-0.9747
176,-0.89674
177,-0.81087
178,-0.73024
179,-0.67979
180,-0.6203
181,-0.53357
182,-0.44573
183,-0.34645
184,-0.23284000000000002
185,-0.10125
186,0.026227999999999998
187,0.14747000000000002
188,0.23542
189,0.34976
190,0.48168999999999995
191,0.6136199999999999
192,0.7273
193,0.82462
194,0.89425
195,0.9444299999999999
196,0.9880399999999999
197,1.0308
198,1.0378
199,1.0378
200,1.0378
201,1.0635
202,1.081
203,1.0859
204,1.064
205,1.0759999999999998
206,1.1145
207,1.1145
208,1.0912
209,1.0569
210,1.0423
211,1.0234
212,0.9972
213,0.9532200000000001
214,0.9120799999999999
215,0.88433
216,0.88433
217,0.9508700000000001
218,1.0090000000000001
219,1.0359
220,1.0173
221,0.98498
222,0.94105
223,0.90196
224,0.88433
225,0.88076
226,0.84045
227,0.8177800000000001
228,0.80761
229,0.80761
230,0.79725
231,0.77536
232,0.73138
233,0.6874100000000001
234,0.6434300000000001
235,0.59945
236,0.58401
237,0.5774600000000001
238,0.5774600000000001
239,0.56247
240,0.54009
241,0.51248
242,0.55645
243,0.5763699999999999
244,0.5774600000000001
245,0.5774600000000001
246,0.5774600000000001
247,0.58057
248,0.59767
249,0.63415
250,0.67812
251,0.7221
252,0.7308899999999999
253,0.71887
254,0.6834399999999999
255,0.56962
256,0.43888999999999995
257,0.29962
258,0.21889
259,0.15834
260,0.11717000000000001
261,0.11717000000000001
262,0.096035
263,0.058535000000000004
264,0.014558000000000001
265,-0.029419
266,-0.071248
267,-0.10422999999999999
268,-0.11298
269,-0.11298
270,-0.11298
271,-0.17462
272,-0.24431999999999998
273,-0.30295
274,-0.36704000000000003
275,-0.43654
276,-0.5122800000000001
277,-0.56071
278,-0.62897
279,-0.7129300000000001
280,-0.7227
281,-0.7267
282,-0.7267
283,-0.7267
284,-0.7177
285,-0.69889
286,-0.6598
287,-0.64998
288,-0.64998
289,-0.64998
290,-0.62369
291,-0.58744
292,-0.54346
293,-0.48618999999999996
294,-0.41718999999999995
295,-0.33534
296,-0.29084
297,-0.29052
298,-0.32563000000000003
299,-0.30364
300,-0.28313
301,-0.26411999999999997
302,-0.24824000000000002
303,-0.21315
304,-0.16917000000000001
305,-0.12519
306,-0.015987
307,0.1039
308,0.20163
309,0.29112
310,0.37256
311,0.44341
312,0.49738000000000004
313,0.56623
314,0.65418
