time,value
0,-0.52817
1,-0.24266999999999997
2,0.023576
3,0.25113
4,0.42462
5,0.53585
6,0.58822
7,0.58704
8,0.54264
9,0.47175
10,0.38655
11,0.29585
12,0.20589000000000002
13,0.12165999999999999
14,0.042588
15,-0.029156
16,-0.094343
17,-0.14723
18,-0.18845
19,-0.21714
20,-0.23181999999999997
21,-0.23756999999999998
22,-0.23526999999999998
23,-0.2261
24,-0.20839000000000002
25,-0.18561
26,-0.15673
27,-0.12253
28,-0.08091
29,-0.031466
30,0.029131999999999998
31,0.098397
32,0.17235
33,0.24633000000000002
34,0.30915
35,0.35200000000000004
36,0.36589
37,0.34426
38,0.2812
39,0.17857
40,0.043075
41,-0.11563
42,-0.28118000000000004
43,-0.43753000000000003
44,-0.56522
45,-0.64803
46,-0.67335
47,-0.6292399999999999
48,-0.51623
49,-0.33875
50,-0.11
51,0.15009
52,0.41286999999999996
53,0.6468
54,0.82276
55,0.9178
56,0.91438
57,0.81013
58,0.61422
59,0.34598
60,0.037792
61,-0.27515
62,-0.5605899999999999
63,-0.78447
64,-0.9259
65,-0.9687
66,-0.91225
67,-0.76574
68,-0.55006
69,-0.29016
70,-0.014038
71,0.24875999999999998
72,0.47711000000000003
73,0.65294
74,0.76347
75,0.8062
76,0.77573
77,0.67247
78,0.50441
79,0.28137
80,0.018276
81,-0.25789
82,-0.5191100000000001
83,-0.73387
84,-0.87515
85,-0.9217299999999999
86,-0.86526
87,-0.71362
88,-0.48071
89,-0.195
90,0.11478
91,0.4164
92,0.67955
93,0.87995
94,0.9954799999999999
95,1.0149
96,0.9346
97,0.7626
98,0.5142100000000001
99,0.21366999999999997
100,-0.11012000000000001
101,-0.42191999999999996
102,-0.69002
103,-0.89169
104,-1.0147
105,-1.0519
106,-1.0056
107,-0.88554
108,-0.7017100000000001
109,-0.46488999999999997
110,-0.19121
111,0.098972
112,0.38195
113,0.62756
114,0.81296
115,0.9183600000000001
116,0.9365
117,0.87329
118,0.74459
119,0.57534
120,0.39182
121,0.21443
122,0.056039
123,-0.081842
124,-0.20375
125,-0.3171
126,-0.42306000000000005
127,-0.5201100000000001
128,-0.59928
129,-0.65159
130,-0.6711600000000001
131,-0.65868
132,-0.61417
133,-0.54535
134,-0.45921999999999996
135,-0.35694000000000004
136,-0.23851
137,-0.10031
138,0.059289999999999995
139,0.24026
140,0.43381000000000003
141,0.6250100000000001
142,0.7950699999999999
143,0.9263899999999999
144,1.0071
145,1.0271
146,0.98488
147,0.8796799999999999
148,0.71375
149,0.49223
150,0.21803000000000003
151,-0.099124
152,-0.44501
153,-0.7971
154,-1.1244
155,-1.3929
156,-1.5725
157,-1.6374
158,-1.5732
159,-1.3801
160,-1.0713
161,-0.67227
162,-0.21358000000000002
163,0.27214
164,0.7459100000000001
165,1.1742
166,1.5209
167,1.7597
168,1.8692
169,1.8403
170,1.6698
171,1.3709
172,0.9728899999999999
173,0.5088600000000001
174,0.021184
175,-0.45073
176,-0.87402
177,-1.2239
178,-1.4875
179,-1.6562
180,-1.7296
181,-1.7046
182,-1.5819
183,-1.3603
184,-1.0431
185,-0.64073
186,-0.17418
187,0.32456999999999997
188,0.81619
189,1.2558
190,1.6011
191,1.8165
192,1.8838
193,1.7983
194,1.5676
195,1.2175
196,0.77845
197,0.28865
198,-0.21649000000000002
199,-0.69588
200,-1.1102
201,-1.4279
202,-1.6265
203,-1.6925
204,-1.6239
205,-1.431
206,-1.1369
207,-0.77268
208,-0.37245
209,0.030066000000000002
210,0.40329
211,0.7228399999999999
212,0.9757
213,1.1525
214,1.2507
215,1.2684
216,1.2085
217,1.0748
218,0.87721
219,0.62747
220,0.34398
221,0.047055
222,-0.24503000000000003
223,-0.5130600000000001
224,-0.7417699999999999
225,-0.91858
226,-1.0333
227,-1.0792
228,-1.0546
229,-0.9617100000000001
230,-0.80871
231,-0.6099899999999999
232,-0.37917
233,-0.13798
234,0.10055
235,0.31861999999999996
236,0.50505
237,0.65276
238,0.75858
239,0.81913
240,0.8311
241,0.79662
242,0.7144199999999999
243,0.59033
244,0.4355
245,0.2595
246,0.07613400000000001
247,-0.10041
248,-0.25961
249,-0.39332
250,-0.50567
251,-0.5932
252,-0.65572
253,-0.68967
254,-0.68989
255,-0.65349
256,-0.5735
257,-0.45006999999999997
258,-0.28943
259,-0.10615999999999999
260,0.08293500000000001
261,0.26091
262,0.41171
263,0.52142
264,0.5846
265,0.59872
266,0.56619
267,0.49478999999999995
268,0.39125
269,0.26655999999999996
270,0.13069
271,-0.0017603999999999999
272,-0.11717999999999999
273,-0.20915
274,-0.26850999999999997
275,-0.29578000000000004
276,-0.28943
277,-0.25435
278,-0.19475
279,-0.11624000000000001
280,-0.028102
281,0.061013
282,0.13922
283,0.19380999999999998
284,0.21124
285,0.18548
286,0.11709000000000001
287,0.011822
288,-0.12012
289,-0.26015
290,-0.39608000000000004
291,-0.51256
292,-0.59658
293,-0.64286
294,-0.64513
295,-0.59468
296,-0.4807
297,-0.2965
298,-0.043035000000000004
299,0.27116
300,0.61932
301,0.95965
302,1.2462
303,1.4340000000000002
304,1.4858
305,1.3859
306,1.1441
307,0.78887
308,0.3593
309,-0.097979
310,-0.53989
311,-0.93748
312,-1.2694
313,-1.5266
314,-1.6995
315,-1.7803
316,-1.76
317,-1.6264
318,-1.3736
319,-1.0071
320,-0.54346
321,-0.014417
322,0.53608
323,1.0634
324,1.5230000000000001
325,1.8789
326,2.1067
327,2.1935
328,2.137
329,1.9454
330,1.6305
331,1.2059
332,0.6937399999999999
333,0.11932000000000001
334,-0.48325
335,-1.0755
336,-1.6127
337,-2.0491
338,-2.3431
339,-2.469
340,-2.4174
341,-2.1963
342,-1.8321
343,-1.3578
344,-0.81281
345,-0.23615999999999998
346,0.34205
347,0.89385
348,1.3936
349,1.8147
350,2.1281
351,2.3118
352,2.3451
353,2.2194
354,1.9392
355,1.525
356,1.0167
357,0.45453999999999994
358,-0.11405
359,-0.6523
360,-1.126
361,-1.5125
362,-1.8016
363,-1.9833
364,-2.0492
365,-1.9949
366,-1.8179
367,-1.5237
368,-1.1321
369,-0.6726800000000001
370,-0.18557
371,0.28326
372,0.6943600000000001
373,1.0173
374,1.2379
375,1.3561
376,1.3880000000000001
377,1.3549
378,1.2771
379,1.1705
380,1.0459
381,0.90233
382,0.73595
383,0.5422899999999999
384,0.31843
385,0.068871
386,-0.19802
387,-0.47186000000000006
388,-0.7363
389,-0.9767899999999999
390,-1.1808
391,-1.3371
392,-1.4380000000000002
393,-1.4797
394,-1.455
395,-1.3608
396,-1.1916
397,-0.9473299999999999
398,-0.62878
399,-0.24368
400,0.19186
401,0.65451
402,1.1123
403,1.5285
404,1.8674
405,2.099
406,2.1981
407,2.1475
408,1.9411
409,1.5899
410,1.1103
411,0.52766
412,-0.11971
413,-0.78632
414,-1.4229
415,-1.9759
416,-2.3917
417,-2.628
418,-2.6599
419,-2.4814
420,-2.105
421,-1.5677
422,-0.9186700000000001
423,-0.21418
424,0.48905
425,1.1368
426,1.6879
427,2.1074
428,2.3706
429,2.4624
430,2.3738
431,2.1055
432,1.6745
433,1.112
434,0.46513999999999994
435,-0.20831
436,-0.8458600000000001
437,-1.3845
438,-1.7751
439,-1.9941
440,-2.0338
441,-1.905
442,-1.6362
443,-1.2670000000000001
444,-0.8344799999999999
445,-0.3751
446,0.078582
447,0.4943
448,0.8462700000000001
449,1.1123
450,1.275
451,1.3227
452,1.2576
453,1.0884
454,0.83783
455,0.53533
456,0.21600999999999998
457,-0.088754
458,-0.35286
459,-0.56312
460,-0.70599
461,-0.78157
462,-0.79182
463,-0.73731
464,-0.62248
465,-0.45715
466,-0.25664000000000003
467,-0.041795
468,0.16149000000000002
469,0.33123
470,0.44565
471,0.49543999999999994
472,0.48285
473,0.41945
474,0.32
475,0.20078
476,0.079778
477,-0.034199
478,-0.13608
479,-0.22084
480,-0.28874
481,-0.33491
482,-0.35369
483,-0.34009
484,-0.29202
485,-0.20895
486,-0.099226
487,0.026414999999999998
488,0.15479
489,0.26987
490,0.36234
491,0.42228000000000004
492,0.4438
493,0.42223
494,0.35862
495,0.2562
496,0.12637
497,-0.019627000000000002
498,-0.16705
499,-0.30236999999999997
