time,value
0,-0.26311
1,-0.26311
2,-0.26311
3,-0.26311
4,-0.26311
5,-0.26311
6,-0.26311
7,-0.26311
8,-0.26311
9,-0.26311
10,-0.26311
11,-0.26311
12,-0.26311
13,-0.26311
14,-0.26311
15,-0.26311
16,-0.26311
17,-0.26311
18,-0.26311
19,-0.26311
20,-0.26311
21,-0.26311
22,-0.26311
23,-0.26311
24,-0.26311
25,-0.26311
26,-0.26311
27,-0.26311
28,-0.26311
29,-0.26311
30,-0.26311
31,-0.26311
32,-0.26311
33,-0.26311
34,-0.26311
35,-0.26311
36,-0.26311
37,-0.26311
38,-0.26311
39,-0.26311
40,-0.26311
41,-0.26311
42,-0.26311
43,-0.26311
44,-0.26311
45,-0.26311
46,-0.26311
47,-0.26311
48,-0.26311
49,-0.26311
50,-0.26311
51,-0.26311
52,-0.26311
53,-0.26311
54,-0.26311
55,-0.26311
56,-0.26311
57,-0.26311
58,-0.26311
59,-0.26311
60,-0.26311
61,-0.26311
62,-0.26311
63,-0.26311
64,-0.26311
65,-0.26311
66,-0.26311
67,-0.26311
68,-0.26311
69,-0.26311
70,-0.26311
71,-0.26311
72,-0.26311
73,-0.26311
74,-0.26311
75,-0.26311
76,-0.26311
77,-0.26311
78,-0.26311
79,-0.26311
80,-0.26311
81,-0.26311
82,-0.26311
83,-0.26311
84,-0.26311
85,-0.26311
86,-0.26311
87,-0.26311
88,-0.26311
89,-0.26311
90,-0.26311
91,-0.26311
92,-0.26311
93,-0.26311
94,-0.26311
95,-0.26311
96,-0.26311
97,-0.26311
98,-0.26311
99,-0.26311
100,-0.26311
101,-0.26311
102,-0.26311
103,-0.26311
104,-0.26311
105,-0.26311
106,-0.26311
107,-0.26311
108,-0.26311
109,-0.26311
110,-0.26311
111,-0.26311
112,-0.26311
113,-0.26311
114,-0.26311
115,-0.26311
116,-0.26311
117,-0.26311
118,-0.26311
119,-0.26311
120,-0.26311
121,-0.26311
122,-0.26311
123,-0.26311
124,-0.26311
125,-0.26311
126,-0.26311
127,-0.26311
128,-0.26311
129,-0.26311
130,-0.26311
131,-0.26311
132,-0.26311
133,-0.26311
134,-0.26311
135,-0.26311
136,-0.26311
137,-0.26311
138,-0.26311
139,-0.26311
140,-0.26311
141,-0.26311
142,-0.26311
143,-0.26311
144,-0.26311
145,-0.26311
146,-0.26311
147,-0.26311
148,-0.26311
149,-0.26311
150,-0.26311
151,-0.26311
152,-0.26311
153,-0.26311
154,-0.26311
155,-0.26311
156,-0.26311
157,-0.26311
158,-0.26311
159,-0.26311
160,-0.26311
161,-0.26311
162,-0.26311
163,-0.26311
164,-0.26311
165,-0.26311
166,-0.26311
167,-0.26311
168,-0.26311
169,-0.26311
170,-0.26311
171,-0.26311
172,-0.26311
173,-0.26311
174,-0.26311
175,-0.26311
176,-0.26311
177,-0.26311
178,-0.26311
179,-0.26311
180,-0.26311
181,-0.26311
182,-0.26311
183,-0.26311
184,-0.26311
185,-0.26311
186,-0.26311
187,-0.26311
188,-0.26311
189,-0.26311
190,-0.26311
191,-0.26311
192,-0.26311
193,-0.26311
194,-0.26311
195,-0.26311
196,-0.26311
197,-0.26311
198,-0.26311
199,-0.26311
200,-0.26311
201,-0.26311
202,-0.26311
203,-0.26311
204,-0.26311
205,-0.26311
206,-0.26311
207,-0.26311
208,-0.26311
209,-0.26311
210,-0.26311
211,-0.26311
212,-0.26311
213,-0.26311
214,-0.26311
215,-0.26311
216,-0.26311
217,-0.26311
218,-0.26311
219,-0.26311
220,-0.26311
221,-0.26311
222,-0.26311
223,-0.26311
224,-0.26311
225,-0.26311
226,-0.26311
227,-0.26311
228,-0.26311
229,-0.26311
230,-0.26311
231,-0.26311
232,-0.26311
233,-0.26311
234,-0.26311
235,-0.26311
236,-0.26311
237,-0.26311
238,-0.26311
239,-0.26311
240,-0.26311
241,-0.26311
242,-0.26311
243,-0.26311
244,-0.26311
245,-0.26311
246,-0.26311
247,-0.26311
248,-0.26311
249,-0.26311
250,-0.26311
251,-0.26311
252,-0.26311
253,-0.26311
254,-0.26311
255,-0.26311
256,-0.26311
257,-0.26311
258,-0.26311
259,-0.26311
260,-0.26311
261,-0.26311
262,-0.26311
263,-0.26311
264,-0.26311
265,-0.26311
266,-0.26311
267,-0.26311
268,-0.26311
269,-0.26311
270,-0.26311
271,-0.26311
272,-0.26311
273,-0.26311
274,-0.26311
275,-0.26311
276,-0.26311
277,-0.26311
278,-0.26311
279,-0.26311
280,-0.26311
281,-0.26311
282,-0.26311
283,-0.26311
284,-0.26311
285,-0.26311
286,-0.26311
287,-0.26311
288,-0.26311
289,-0.26311
290,-0.26311
291,-0.26311
292,-0.26311
293,-0.26311
294,-0.26311
295,-0.26311
296,-0.26311
297,-0.26311
298,-0.26311
299,-0.26311
300,-0.26311
301,-0.26311
302,-0.26311
303,-0.26311
304,-0.26311
305,-0.26311
306,-0.26311
307,-0.26311
308,-0.26311
309,-0.26311
310,-0.26311
311,-0.26311
312,-0.26311
313,-0.26311
314,-0.26311
315,-0.26311
316,-0.26311
317,-0.26311
318,-0.26311
319,-0.26311
320,-0.26311
321,-0.26311
322,-0.26311
323,-0.26311
324,-0.26311
325,-0.26311
326,-0.26311
327,-0.26311
328,-0.26311
329,-0.26311
330,-0.26311
331,-0.26311
332,-0.26311
333,-0.26311
334,-0.26311
335,-0.26311
336,-0.26311
337,-0.26311
338,-0.26311
339,-0.26311
340,-0.26311
341,-0.26311
342,-0.26311
343,-0.26311
344,-0.26311
345,-0.26311
346,-0.26311
347,-0.26311
348,-0.26311
349,3.603
350,4.5696
351,3.603
352,3.603
353,4.5696
354,3.603
355,3.603
356,4.5696
357,3.603
358,3.603
359,4.5696
360,3.603
361,3.603
362,3.603
363,3.603
364,4.5696
365,3.603
366,3.603
367,3.603
368,4.5696
369,3.603
370,3.603
371,3.603
372,3.603
373,3.603
374,4.5696
375,3.603
376,3.603
377,3.603
378,3.603
379,4.5696
380,3.603
381,3.603
382,3.603
383,3.603
384,3.603
385,4.5696
386,3.603
387,3.603
388,3.603
389,4.5696
390,3.603
391,3.603
392,4.5696
393,1.1867
394,-0.26311
395,-0.26311
396,-0.26311
397,-0.26311
398,-0.26311
399,-0.26311
400,-0.26311
401,-0.26311
402,-0.26311
403,-0.26311
404,-0.26311
405,-0.26311
406,-0.26311
407,-0.26311
408,-0.26311
409,-0.26311
410,-0.26311
411,-0.26311
412,-0.26311
413,-0.26311
414,-0.26311
415,-0.26311
416,-0.26311
417,-0.26311
418,-0.26311
419,-0.26311
420,-0.26311
421,-0.26311
422,-0.26311
423,-0.26311
424,-0.26311
425,-0.26311
426,-0.26311
427,-0.26311
428,-0.26311
429,-0.26311
430,-0.26311
431,-0.26311
432,-0.26311
433,-0.26311
434,-0.26311
435,-0.26311
436,-0.26311
437,-0.26311
438,0.22016
439,-0.26311
440,-0.26311
441,-0.26311
442,-0.26311
443,-0.26311
444,-0.26311
445,-0.26311
446,-0.26311
447,-0.26311
448,-0.26311
449,-0.26311
450,-0.26311
451,-0.26311
452,-0.26311
453,-0.26311
454,-0.26311
455,-0.26311
456,-0.26311
457,-0.26311
458,-0.26311
459,-0.26311
460,-0.26311
461,-0.26311
462,-0.26311
463,-0.26311
464,-0.26311
465,-0.26311
466,-0.26311
467,-0.26311
468,-0.26311
469,-0.26311
470,-0.26311
471,-0.26311
472,-0.26311
473,-0.26311
474,-0.26311
475,-0.26311
476,-0.26311
477,-0.26311
478,-0.26311
479,-0.26311
480,-0.26311
481,-0.26311
482,-0.26311
483,-0.26311
484,-0.26311
485,-0.26311
486,-0.26311
487,-0.26311
488,-0.26311
489,-0.26311
490,-0.26311
491,-0.26311
492,-0.26311
493,-0.26311
494,-0.26311
495,-0.26311
496,-0.26311
497,0.22016
498,-0.26311
499,-0.26311
500,-0.26311
501,-0.26311
502,-0.26311
503,-0.26311
504,-0.26311
505,-0.26311
506,-0.26311
507,-0.26311
508,-0.26311
509,-0.26311
510,-0.26311
511,-0.26311
512,-0.26311
513,-0.26311
514,-0.26311
515,-0.26311
516,-0.26311
517,-0.26311
518,-0.26311
519,-0.26311
520,-0.26311
521,-0.26311
522,-0.26311
523,-0.26311
524,-0.26311
525,-0.26311
526,-0.26311
527,-0.26311
528,-0.26311
529,-0.26311
530,-0.26311
531,-0.26311
532,-0.26311
533,-0.26311
534,0.22016
535,-0.26311
536,-0.26311
537,-0.26311
538,-0.26311
539,-0.26311
540,-0.26311
541,-0.26311
542,-0.26311
543,-0.26311
544,-0.26311
545,-0.26311
546,-0.26311
547,-0.26311
548,-0.26311
549,-0.26311
550,-0.26311
551,-0.26311
552,-0.26311
553,-0.26311
554,-0.26311
555,-0.26311
556,-0.26311
557,-0.26311
558,-0.26311
559,-0.26311
560,-0.26311
561,-0.26311
562,-0.26311
563,-0.26311
564,-0.26311
565,-0.26311
566,-0.26311
567,-0.26311
568,-0.26311
569,-0.26311
570,-0.26311
571,0.22016
572,-0.26311
573,-0.26311
574,-0.26311
575,-0.26311
576,-0.26311
577,-0.26311
578,-0.26311
579,-0.26311
580,-0.26311
581,-0.26311
582,-0.26311
583,-0.26311
584,-0.26311
585,-0.26311
586,-0.26311
587,-0.26311
588,-0.26311
589,-0.26311
590,-0.26311
591,-0.26311
592,-0.26311
593,-0.26311
594,-0.26311
595,-0.26311
596,-0.26311
597,-0.26311
598,-0.26311
599,-0.26311
600,-0.26311
601,-0.26311
602,-0.26311
603,-0.26311
604,-0.26311
605,-0.26311
606,-0.26311
607,-0.26311
608,-0.26311
609,-0.26311
610,-0.26311
611,-0.26311
612,-0.26311
613,-0.26311
614,-0.26311
615,-0.26311
616,-0.26311
617,-0.26311
618,-0.26311
619,-0.26311
620,-0.26311
621,-0.26311
622,-0.26311
623,-0.26311
624,-0.26311
625,0.22016
626,-0.26311
627,-0.26311
628,-0.26311
629,-0.26311
630,-0.26311
631,-0.26311
632,-0.26311
633,-0.26311
634,-0.26311
635,-0.26311
636,-0.26311
637,-0.26311
638,-0.26311
639,-0.26311
640,-0.26311
641,-0.26311
642,-0.26311
643,-0.26311
644,-0.26311
645,-0.26311
646,-0.26311
647,-0.26311
648,-0.26311
649,-0.26311
650,-0.26311
651,-0.26311
652,-0.26311
653,-0.26311
654,-0.26311
655,-0.26311
656,-0.26311
657,-0.26311
658,-0.26311
659,-0.26311
660,-0.26311
661,-0.26311
662,-0.26311
663,-0.26311
664,-0.26311
665,-0.26311
666,-0.26311
667,-0.26311
668,-0.26311
669,-0.26311
670,0.22016
671,3.603
672,-0.26311
673,-0.26311
674,-0.26311
675,-0.26311
676,-0.26311
677,-0.26311
678,-0.26311
679,-0.26311
680,-0.26311
681,-0.26311
682,-0.26311
683,-0.26311
684,-0.26311
685,-0.26311
686,-0.26311
687,-0.26311
688,-0.26311
689,-0.26311
690,-0.26311
691,-0.26311
692,-0.26311
693,-0.26311
694,-0.26311
695,-0.26311
696,-0.26311
697,-0.26311
698,-0.26311
699,-0.26311
700,-0.26311
701,-0.26311
702,-0.26311
703,-0.26311
704,0.22016
705,-0.26311
706,-0.26311
707,-0.26311
708,-0.26311
709,-0.26311
710,-0.26311
711,-0.26311
712,-0.26311
713,-0.26311
714,-0.26311
715,-0.26311
716,-0.26311
717,-0.26311
718,-0.26311
719,-0.26311
