time,value
0,-0.60243
1,-0.60243
2,-0.60243
3,-0.60243
4,-0.60243
5,-0.60243
6,-0.60243
7,-0.60243
8,-0.60243
9,-0.60002
10,-0.5844600000000001
11,-0.55271
12,-0.51941
13,-0.50934
14,-0.50665
15,-0.50665
16,-0.50665
17,-0.50665
18,-0.50665
19,-0.50665
20,-0.50665
21,-0.50665
22,-0.50665
23,-0.50665
24,-0.50665
25,-0.50665
26,-0.50665
27,-0.50665
28,-0.50665
29,-0.50665
30,-0.50665
31,-0.50665
32,-0.50665
33,-0.50665
34,-0.50665
35,-0.50665
36,-0.50098
37,-0.48743000000000003
38,-0.44808000000000003
39,-0.40873000000000004
40,-0.36938000000000004
41,-0.33003000000000005
42,-0.29068
43,-0.25406
44,-0.22569
45,-0.2193
46,-0.22673000000000001
47,-0.25143000000000004
48,-0.28824
49,-0.32759
50,-0.36694
51,-0.39504
52,-0.41086999999999996
53,-0.41086999999999996
54,-0.4602
55,-0.52412
56,-0.6009899999999999
57,-0.60243
58,-0.60243
59,-0.60243
60,-0.60243
61,-0.5707300000000001
62,-0.51237
63,-0.43642
64,-0.3828
65,-0.34345
66,-0.3041
67,-0.26475
68,-0.23106999999999997
69,-0.22191999999999998
70,-0.21604
71,-0.20313
72,-0.16378
73,-0.12444000000000001
74,-0.42700000000000005
75,-0.23025
76,-0.22558000000000003
77,0.16325
78,0.36
79,0.11166
80,0.15100999999999998
81,0.19036
82,0.22971
83,0.28417
84,0.35738000000000003
85,0.43592
86,0.51462
87,0.5938399999999999
88,0.6945
89,0.80471
90,0.92276
91,1.0408
92,1.1589
93,1.2769
94,1.395
95,1.4975
96,1.589
97,1.6677
98,1.7464
99,1.8251
100,1.9038
101,1.9825
102,2.0612
103,2.1399
104,2.2186
105,2.271
106,2.271
107,2.271
108,2.271
109,2.271
110,2.246
111,2.2134
112,2.174
113,2.1347
114,2.0953
115,2.056
116,2.0166
117,1.9773
118,1.9377
119,1.8947
120,1.8306
121,1.7519
122,1.6732
123,1.5945
124,1.521
125,1.4734
126,1.4277
127,1.3754
128,1.2967
129,1.2324
130,1.1784
131,1.139
132,1.0997
133,1.058
134,1.0113
135,0.9374
136,0.86661
137,0.80896
138,0.7678
139,0.72845
140,0.6891
141,0.64975
142,0.6104
143,0.57105
144,0.5317
145,0.49235
146,0.45299999999999996
147,0.41365
148,0.3807
149,0.35539
150,0.35539
151,0.35539
152,0.35539
153,0.35539
154,0.35539
155,0.35539
156,0.35539
157,0.35539
158,0.36236999999999997
159,0.38891
160,0.4241
161,0.43743999999999994
162,0.39809
163,0.35874
164,0.31939
165,0.28005
166,0.2407
167,0.20135
168,0.162
169,0.12265
170,0.45357
171,0.33918000000000004
172,0.33864
173,0.33864
174,0.33864
175,0.33864
176,0.33864
177,0.34767
178,0.43918
179,0.1196
180,0.15413
181,0.16146
182,0.1595
183,0.14644000000000001
184,0.10709
185,0.33712
186,0.14037
187,-0.056379
188,-0.38506999999999997
189,-0.15158
190,-0.23028
191,-0.30898000000000003
192,-0.40336
193,-0.52598
194,-0.6793
195,-0.8367
196,-0.9941
197,-1.1421
198,-1.276
199,-1.3940000000000001
200,-1.4417
201,-1.4645
202,-1.4616
203,-1.3866
204,-1.3028
205,-1.2098
206,-1.0917
207,-0.9736600000000001
208,-0.85561
209,-0.73756
210,-0.61951
211,-0.50939
212,-0.43251999999999996
213,-0.41086999999999996
214,-0.41757
215,-0.44501999999999997
216,-0.48727
217,-0.57833
218,-0.77508
219,-0.98461
220,-1.2052
221,-1.4413
222,-1.6262
223,-1.7928
224,-1.9429
225,-2.0269999999999997
226,-2.0821
227,-2.1087
228,-2.0709
229,-2.0003
230,-1.8982
231,-1.7802
232,-1.6621
233,-1.5456
234,-1.4468
235,-1.3601
236,-1.2814
237,-1.2027
238,-1.1337
239,-1.0813
240,-1.0813
241,-1.0813
242,-1.0813
243,-1.0813
244,-1.0813
245,-1.0866
246,-1.1049
247,-1.1722
248,-1.2432
249,-1.2990000000000002
250,-1.3406
251,-1.3514
252,-1.3176
253,-1.2686
254,-1.2058
255,-1.1271
256,-1.0723
257,-1.0255
258,-0.9861700000000001
259,-0.9468200000000001
260,-0.90049
261,-0.84646
262,-0.76776
263,-0.7207100000000001
264,-0.6981
265,-0.69718
266,-0.67137
267,-0.63202
268,-0.59267
269,-0.55332
270,-0.52036
271,-0.50938
272,-0.50459
273,-0.4917
274,-0.45235
275,-0.42623
276,-0.41086999999999996
277,-0.41086999999999996
278,-0.38506
279,-0.34964
280,-0.30572
281,-0.23028
282,-0.14368
283,-0.23496
284,0.35085
285,0.17305
286,0.259
287,0.3377
288,0.4164
289,0.49633
290,0.59516
291,0.70527
292,0.82332
293,0.94137
294,1.0489
295,1.1403
296,1.1796
297,1.219
298,1.2583
299,1.2977
300,1.2841
301,1.2501
302,1.2107
303,1.1714
304,1.1244
305,1.0613
306,0.9849899999999999
307,0.9341200000000001
308,0.9304600000000001
309,0.94075
310,0.96425
311,1.0036
312,1.0672
313,1.1387
314,1.2174
315,-0.40585
316,-0.40585
317,-0.40585
318,-0.40585
319,-0.40585
320,-0.40585
321,-0.40585
322,-0.40585
323,-0.40585
324,-0.40297
325,-0.38438
326,-0.34643
327,-0.30663
328,-0.2946
329,-0.29138000000000003
330,-0.29138000000000003
331,-0.29138000000000003
332,-0.29138000000000003
333,-0.29138000000000003
334,-0.29138000000000003
335,-0.29138000000000003
336,-0.29138000000000003
337,-0.29138000000000003
338,-0.29138000000000003
339,-0.29138000000000003
340,-0.29138000000000003
341,-0.29138000000000003
342,-0.29138000000000003
343,-0.29138000000000003
344,-0.29138000000000003
345,-0.29138000000000003
346,-0.29138000000000003
347,-0.29138000000000003
348,-0.29138000000000003
349,-0.29138000000000003
350,-0.29138000000000003
351,-0.2846
352,-0.26841
353,-0.22139
354,-0.17436
355,-0.12733
356,-0.40308
357,-0.16794
358,0.067202
359,0.30234
360,0.10780999999999999
361,0.14597000000000002
362,0.16347
363,0.16651
364,0.16651
365,0.16651
366,0.16651
367,0.16651
368,0.16651
369,0.19599
370,0.23418000000000003
371,0.28010999999999997
372,0.28098
373,0.28098
374,0.28098
375,0.28098
376,0.29991999999999996
377,0.33493
378,0.38195999999999997
379,0.42899
380,0.47334
381,0.50068
382,0.5099199999999999
383,0.5167
384,0.55279
385,0.59278
386,0.62439
387,0.62439
388,0.62439
389,0.62439
390,0.62439
391,0.65566
392,0.69694
393,0.74397
394,0.79099
395,0.8285299999999999
396,0.8515
397,0.8533299999999999
398,0.8894299999999999
399,0.97036
400,1.0545
401,1.1202
402,1.1678
403,1.2411
404,1.3258
405,1.4199
406,1.5139
407,1.6007
408,1.6783
409,1.7254
410,1.7724
411,1.8194
412,1.8664
413,1.945
414,2.0342
415,2.114
416,2.169
417,2.2074
418,2.2238
419,2.227
420,2.227
421,2.227
422,2.2129
423,2.1847
424,2.1377
425,2.0608
426,1.9757
427,1.8838
428,1.8351
429,1.7881
430,1.7409999999999999
431,1.694
432,1.6469999999999998
433,1.5997
434,1.5483
435,1.4716
436,1.38
437,1.3067
438,1.2503
439,1.2033
440,1.1563
441,1.1047
442,1.0422
443,0.9481200000000001
444,0.87121
445,0.80667
446,0.75964
447,0.68119
448,0.59515
449,0.50984
450,0.45706
451,0.41003
452,0.363
453,0.31597
454,0.25119
455,0.1626
456,0.39455999999999997
457,0.06537899999999999
458,-0.16976
459,-0.4049
460,-0.12769
461,-0.17719000000000001
462,-0.26796
463,-0.34536999999999995
464,-0.40585
465,-0.40585
466,-0.42457
467,-0.45688999999999996
468,-0.50392
469,-0.51946
470,-0.52356
471,-0.53887
472,-0.5775600000000001
473,-0.61625
474,-0.63156
475,-0.63479
476,-0.63479
477,-0.63479
478,-0.6642100000000001
479,-0.72083
480,-0.81489
481,-0.8787
482,-0.93337
483,-0.9804
484,-1.0274
485,-1.0652
486,-1.0926
487,-1.0927
488,-1.1115
489,-1.1478
490,-1.1894
491,-1.2072
492,-1.2072
493,-1.2072
494,-1.2072
495,-1.2072
496,-1.2072
497,-1.2072
498,-1.2072
499,-1.2072
500,-1.2247
501,-1.2545
502,-1.3016
503,-1.3486
504,-1.3956
505,-1.4427
506,-1.4897
507,-1.5461
508,-1.6194
509,-1.7109999999999999
510,-1.805
511,-1.8991
512,-1.9819
513,-2.0478
514,-2.0949
515,-2.1138
516,-2.1229
517,-2.1196
518,-2.0299
519,-1.9377
520,-1.8437
521,-1.7496
522,-1.6367
523,-1.5097
524,-1.3687
525,-1.2589
526,-1.1649
527,-1.0708
528,-0.97675
529,-0.89871
530,-0.8702799999999999
531,-0.8654200000000001
532,-0.88087
533,-0.9279
534,-1.0055
535,-1.1095
536,-1.2505
537,-1.3611
538,-1.4606
539,-1.5503
540,-1.6005
541,-1.6194
542,-1.6041
543,-1.5119
544,-1.4179
545,-1.3238
546,-1.2298
547,-1.1357
548,-1.0416
549,-0.9475899999999999
550,-0.8535299999999999
551,-0.75947
552,-0.66542
553,-0.57711
554,-0.49881000000000003
555,-0.45178999999999997
556,-0.40476
557,-0.35773
558,-0.3107
559,-0.26366999999999996
560,-0.21978000000000003
561,-0.18369000000000002
562,-0.17690999999999998
563,-0.16767
564,-0.14032
565,-0.48146000000000005
566,-0.33155
567,-0.31515
568,-0.31376
569,-0.31376
570,-0.31376
571,-0.31376
572,-0.31376
573,-0.30945
574,-0.079777
575,0.15287
576,0.38800999999999997
577,0.12495
578,0.15306
579,0.16651
580,0.16651
581,0.16651
582,0.16955
583,0.18704
584,0.2252
585,0.25695
586,0.23617
587,0.19814
588,0.16651
589,0.16651
590,0.16651
591,0.16651
592,0.16651
593,0.16651
594,0.16651
595,0.16651
596,0.16651
597,0.1854
598,0.22915
599,0.32108000000000003
600,0.39662
601,0.45238999999999996
602,0.50708
603,0.5828300000000001
604,0.67542
605,0.74542
606,0.80193
607,0.8444
608,0.85096
609,0.85962
610,0.8755700000000001
611,0.9226
612,0.9515100000000001
613,0.9678100000000001
614,0.9678100000000001
615,0.9361700000000001
616,0.8923399999999999
617,0.84531
618,0.7982899999999999
619,0.75126
620,0.70423
621,0.6572
622,0.6268100000000001
623,0.62462
624,0.61164
625,0.5835600000000001
626,0.5365300000000001
627,0.5475899999999999
628,0.57736
629,0.62439
630,-0.18983
631,-0.18983
632,-0.18983
633,-0.18983
634,-0.18983
635,-0.18983
636,-0.18983
637,-0.18983
638,-0.18983
639,-0.18775
640,-0.17429
641,-0.14681
642,-0.11799000000000001
643,-0.10928
644,-0.10695
645,-0.10695
646,-0.10695
647,-0.10695
648,-0.10695
649,-0.10695
650,-0.10695
651,-0.10695
652,-0.10695
653,-0.10695
654,-0.10695
655,-0.10695
656,-0.10695
657,-0.10695
658,-0.10695
659,-0.10695
660,-0.10695
661,-0.10695
662,-0.10695
663,-0.10695
664,-0.10695
665,-0.10695
666,-0.10203999999999999
667,-0.45316000000000006
668,-0.2829
669,-0.31011
670,0.23711999999999997
671,0.11585
672,0.18395
673,0.24969
674,0.30829
675,0.34788
676,0.3755
677,0.38816999999999996
678,0.39038
679,0.40209
680,0.43535
681,0.45957
682,0.47326
683,0.47326
684,0.47326
685,0.47326
686,0.47326
687,0.47326
688,0.47326
689,0.47326
690,0.47326
691,0.47326
692,0.47346000000000005
693,0.47584
694,0.49755
695,0.5316
696,0.56565
697,0.5997
698,0.63376
699,0.66781
700,0.69621
701,0.7079300000000001
702,0.67388
703,0.67619
704,0.7055600000000001
705,0.77366
706,0.79648
707,0.80481
708,0.80481
709,0.80481
710,0.80481
711,0.80481
712,0.80481
713,0.81788
714,0.8471799999999999
715,0.8741700000000001
716,0.8877
717,0.8881399999999999
718,0.90715
719,0.93442
720,0.96615
721,0.9693200000000001
722,0.97059
723,0.97059
724,0.97059
725,0.95715
726,0.93416
727,0.9001100000000001
728,0.84319
729,0.77867
730,0.7208600000000001
731,0.68101
732,0.6469600000000001
733,0.6129
734,0.57885
735,0.55615
736,0.55615
737,0.54594
738,0.52553
739,0.49148000000000003
740,0.47906000000000004
741,0.47257
742,0.47098999999999996
743,0.43815
744,0.4041
745,0.37005
746,0.336
747,0.30194
748,0.2681
749,0.23722
750,0.2246
751,0.22284
752,0.20779
753,0.18052
754,0.14647000000000002
755,0.11241
756,0.39023
757,0.21996
758,0.32911999999999997
759,-0.12055999999999999
760,-0.29081999999999997
761,-0.46108000000000005
762,-0.12595
763,-0.16410999999999998
764,-0.21083000000000002
765,-0.30466
766,-0.39998
767,-0.48391999999999996
768,-0.5535899999999999
769,-0.6088399999999999
770,-0.64685
771,-0.68863
772,-0.74312
773,-0.81104
774,-0.83955
775,-0.85293
776,-0.85293
777,-0.85293
778,-0.85293
779,-0.85293
780,-0.85293
781,-0.8664799999999999
782,-0.88989
783,-0.92394
784,-0.9807899999999999
785,-1.0459
786,-1.1029
787,-1.143
788,-1.1831
789,-1.2401
790,-1.3059
791,-1.374
792,-1.4421
793,-1.5102
794,-1.5783
795,-1.6464
796,-1.7145
797,-1.7816
798,-1.8474
799,-1.8832
800,-1.9173
801,-1.9513
802,-1.9854
803,-2.0058
804,-2.0134
805,-2.0134
806,-2.0134
807,-2.0134
808,-2.0134
809,-2.0134
810,-2.0134
811,-2.0134
812,-2.0134
813,-2.0134
814,-2.0134
815,-2.0007
816,-1.979
817,-1.945
818,-1.9109
819,-1.8769
820,-1.8428
821,-1.8088
822,-1.7815
823,-1.7665
824,-1.7647
825,-1.7521
826,-1.7212
827,-1.6955
828,-1.6818
829,-1.6818
830,-1.6615
831,-1.6340000000000001
832,-1.6
833,-1.5659
834,-1.5435
835,-1.5342
836,-1.5683
837,-1.6296
838,-1.7114
839,-1.8135
840,-1.8249
841,-1.784
842,-1.7143
843,-1.5968
844,-1.4548
845,-1.2948
846,-1.1269
847,-0.95667
848,-0.78641
849,-0.61615
850,-0.44588999999999995
851,-0.27563000000000004
852,-0.14962
853,-0.18655
854,0.32423
855,0.16732
856,0.25590999999999997
857,0.32798
858,0.36291999999999996
859,0.39697
860,0.43088999999999994
861,0.46019
862,0.47326
863,0.47326
864,0.47326
865,0.47326
866,0.48076
867,0.53778
868,0.60624
869,0.68576
870,0.78792
871,0.87716
872,0.95739
873,1.0255
874,1.0478
875,1.0535
876,1.0535
877,1.0535
878,1.0602
879,1.08
880,1.1121
881,1.1214
882,1.0921
883,1.0672
884,1.0535
885,1.0535
886,1.0535
887,1.0535
888,1.0541
889,1.0874
890,1.115
891,1.1364
892,1.1364
893,1.1364
894,1.1364
895,1.1364
896,1.1364
897,1.1364
898,1.1364
899,1.1364
900,1.1364
901,1.1364
902,1.1364
903,1.1364
904,1.1364
905,1.1249
906,1.1042
907,1.0701
908,1.0361
909,1.0035
910,0.97341
911,0.97059
912,0.9637399999999999
913,0.94791
914,0.9146200000000001
915,0.89397
916,0.8877
917,0.8877
918,0.8877
919,0.8898299999999999
920,0.9246700000000001
921,0.97903
922,1.0438
923,1.0826
924,1.1184
925,1.1525
926,1.1865
927,1.1943
928,1.1839
929,1.1498
930,1.1158
931,1.0794
932,1.0366
933,0.97375
934,0.90565
935,0.83754
936,0.76944
937,0.71338
938,0.67774
939,0.6342899999999999
940,0.57991
941,0.5118
942,0.4437
943,0.37559000000000003
944,0.30749
