time,value
0,-0.8607100000000001
1,3.5733
2,2.7393
3,-1.4298
4,-0.9918100000000001
5,-0.17754
6,-1.1205
7,-0.57538
8,-0.33213000000000004
9,-1.0031
10,0.18814
11,2.2266
12,2.5909
13,2.0465
14,1.1248
15,-0.13909000000000002
16,-0.38384
17,-0.2276
18,-0.54487
19,-0.48795
20,-0.38932
21,-0.62274
22,-0.6603
23,-0.60553
24,-0.6846399999999999
25,-0.72054
26,-0.6855600000000001
27,-0.73029
28,-0.7695
29,-0.6905399999999999
30,-0.6177699999999999
31,-0.64118
32,-0.71706
33,-0.7781899999999999
34,-0.7194
35,-0.61001
36,-0.68434
37,-0.7460600000000001
38,-0.63752
39,-0.68228
40,-0.69989
41,-0.49818999999999997
42,-0.45525
43,-0.31505
44,0.15574000000000002
45,0.27929
46,0.055715999999999995
47,0.14633
48,0.24040999999999998
49,0.12443
50,0.57275
51,1.3269
52,1.4767
53,1.4038
54,1.5376
55,1.611
56,1.5914
57,1.5005
58,1.3485
59,1.3958
60,1.5409
61,1.41
62,1.2536
63,1.2302
64,1.0769
65,1.0616
66,1.0216
67,0.61919
68,0.4679
69,0.42303999999999997
70,0.13045
71,0.07278
72,0.016149
73,-0.16535999999999998
74,-0.1562
75,-0.25816
76,-0.33912
77,-0.25948000000000004
78,-0.36571
79,-0.4309
80,-0.39826999999999996
81,-0.47663
82,-0.48441999999999996
83,-0.48613999999999996
84,-0.55965
85,-0.5585899999999999
86,-0.5949800000000001
87,-0.68709
88,-0.69697
89,-0.73782
90,-0.8579100000000001
91,-0.8780899999999999
92,-0.85046
93,-0.9144700000000001
94,-0.91646
95,-0.86364
96,-0.93871
97,-1.0292
98,-1.0407
