time,value
0,0.31666
1,0.31666
2,0.31666
3,0.31666
4,0.31666
5,0.31666
6,0.31666
7,0.31666
8,0.31666
9,0.31666
10,0.31666
11,0.31666
12,0.31666
13,0.31666
14,0.31666
15,0.31666
16,0.31666
17,0.31666
18,0.31666
19,0.31666
20,0.31666
21,0.31666
22,0.31666
23,0.31666
24,0.31666
25,0.31666
26,0.31666
27,0.31666
28,0.31666
29,0.31666
30,0.31666
31,0.31666
32,0.31666
33,0.31666
34,0.31666
35,0.31666
36,0.31666
37,0.31666
38,0.31666
39,0.31666
40,0.31666
41,0.31666
42,0.31666
43,0.31666
44,0.31666
45,0.31666
46,0.31666
47,0.31666
48,0.31666
49,0.31666
50,0.32593
51,0.36813
52,0.4144
53,0.46993
54,0.089742
55,0.10720999999999999
56,0.12694
57,0.14915
58,0.17378
59,0.20027999999999999
60,0.23119
61,0.26450999999999997
62,0.2962
63,0.3273
64,0.35114
65,0.37335
66,0.39529000000000003
67,0.41721
68,0.41748
69,0.41748
70,0.41748
71,0.41602
72,0.40684000000000003
73,0.39719
74,0.38608000000000003
75,0.36796
76,0.33553
77,0.29812
78,0.2537
79,0.20424
80,0.14975
81,0.088145
82,0.19672
83,-0.15633
84,-0.51912
85,-0.20654
86,-0.29538000000000003
87,-0.38573
88,-0.47635
89,-0.58592
90,-0.69698
91,-0.80804
92,-0.9191
93,-1.0302
94,-1.1412
95,-1.2523
96,-1.3591
97,-1.4545
98,-1.5476
99,-1.6364
100,-1.7253
101,-1.8141
102,-1.9029
103,-1.9918
104,-2.0716
105,-2.1457
106,-2.1991
107,-2.2435
108,-2.2867
109,-2.3295
110,-2.3641
111,-2.3974
112,-2.4307
113,-2.4632
114,-2.4752
115,-2.4871
116,-2.4982
117,-2.5058
118,-2.4997
119,-2.4922
120,-2.4811
121,-2.465
122,-2.4409
123,-2.4125
124,-2.3792
125,-2.3385
126,-2.2919
127,-2.2326
128,-2.1659
129,-2.0959
130,-2.0245
131,-1.9391
132,-1.8502
133,-1.7614
134,-1.6725
135,-1.5837
136,-1.4948
137,-1.406
138,-1.3171
139,-1.2283
140,-1.1394
141,-1.0506
142,-0.96405
143,-0.88246
144,-0.8024100000000001
145,-0.72467
146,-0.64946
147,-0.5769
148,-0.50773
149,-0.4411
150,-0.37446
151,-0.30782
152,-0.24119000000000002
153,-0.17455
154,-0.4461
155,-0.10772999999999999
156,0.27668000000000004
157,0.11524000000000001
158,0.19299000000000002
159,0.27073
160,0.34847
161,0.42621000000000003
162,0.5039600000000001
163,0.58375
164,0.66948
165,0.75629
166,0.8451299999999999
167,0.9289299999999999
168,1.0059
169,1.0776
170,1.1443
171,1.2063
172,1.2652
173,1.3143
174,1.3587
175,1.399
176,1.4381
177,1.4533
178,1.4644
179,1.4755
180,1.4869
181,1.5088
182,1.5307
183,1.5530000000000002
184,1.5735
185,1.5869
186,1.5998
187,1.6109
188,1.6219999999999999
189,1.6331
190,1.6442
191,1.6553
192,1.659
193,1.6563
194,1.6415
195,1.6193
196,1.5935
197,1.5663
198,1.5254
199,1.4809999999999999
200,1.4366
201,1.3921
202,1.3477
203,1.3033
204,1.2589
205,1.2132
206,1.1593
207,1.105
208,1.0495
209,0.99621
210,0.94809
211,0.9014
212,0.85698
213,0.81509
214,0.7759999999999999
215,0.7401399999999999
216,0.7068300000000001
217,0.67351
218,0.6401899999999999
219,0.60687
220,0.57355
221,0.5412
222,0.50907
223,0.48589
224,0.46368000000000004
225,0.44147
226,0.41851000000000005
227,0.38608000000000003
228,0.35351
229,0.32019000000000003
230,0.28686999999999996
231,0.25355
232,0.22023
233,0.18692
234,0.15863
235,0.13746
236,0.12130999999999999
237,0.11020999999999999
238,0.096763
239,0.08165900000000001
240,0.39810999999999996
241,0.28705
242,0.19782
243,0.11564
244,0.14933
245,0.20486
246,0.26039
247,0.31592
248,0.37145
249,0.42698
250,0.078668
251,0.086523
252,0.07986
253,0.4492
254,0.39366999999999996
255,0.36223
256,0.37481
257,0.40625
258,0.46178
259,0.085627
260,0.096734
261,0.10784
262,0.11895
263,0.1282
264,0.13664
265,0.13849
266,0.13849
267,0.13849
268,0.13849
269,0.13849
270,0.13849
271,0.13849
272,0.13849
273,0.13849
274,0.13849
275,0.13849
276,0.1407
277,0.14826
278,0.15715
279,0.16826
280,0.17936
281,0.19047
282,0.20157
283,0.21268
284,0.22379000000000002
285,0.23489000000000002
286,0.24600000000000002
287,0.25711
288,0.26714
289,0.27691
290,0.27799
291,0.27799
292,0.27799
293,0.27799
294,0.27799
295,0.27799
296,0.27799
297,0.27414
298,0.25756
299,0.23919
300,0.21698
301,0.19727
302,0.18127000000000001
303,0.16767
304,0.15656
305,0.14783
306,0.14087
307,0.13849
308,0.13849
309,0.13849
310,0.13849
311,0.13849
312,0.13849
313,0.13849
314,0.13849
315,-0.5020899999999999
316,-0.5020899999999999
317,-0.5020899999999999
318,-0.5020899999999999
319,-0.5020899999999999
320,-0.5020899999999999
321,-0.5020899999999999
322,-0.5020899999999999
323,-0.5020899999999999
324,-0.5020899999999999
325,-0.5020899999999999
326,-0.5020899999999999
327,-0.5020899999999999
328,-0.5020899999999999
329,-0.5020899999999999
330,-0.5020899999999999
331,-0.5020899999999999
332,-0.5020899999999999
333,-0.5020899999999999
334,-0.5020899999999999
335,-0.5020899999999999
336,-0.5020899999999999
337,-0.5020899999999999
338,-0.5020899999999999
339,-0.5020899999999999
340,-0.5020899999999999
341,-0.5020899999999999
342,-0.5020899999999999
343,-0.5020899999999999
344,-0.5020899999999999
345,-0.5020899999999999
346,-0.5020899999999999
347,-0.5020899999999999
348,-0.5020899999999999
349,-0.5020899999999999
350,-0.5020899999999999
351,-0.5020899999999999
352,-0.5020899999999999
353,-0.5020899999999999
354,-0.5020899999999999
355,-0.5020899999999999
356,-0.5020899999999999
357,-0.5020899999999999
358,-0.5020899999999999
359,-0.5020899999999999
360,-0.5020899999999999
361,-0.5020899999999999
362,-0.5020899999999999
363,-0.5020899999999999
364,-0.5020899999999999
365,-0.49883999999999995
366,-0.48403999999999997
367,-0.46783
368,-0.44836000000000004
369,-0.42454
370,-0.39391
371,-0.35934
372,-0.3204
373,-0.28569
374,-0.25429
375,-0.2306
376,-0.21113
377,-0.18882000000000002
378,-0.16546
379,-0.12938
380,-0.36305
381,-0.17073
382,0.26855
383,0.28415999999999997
384,0.28415999999999997
385,0.28415999999999997
386,0.28415999999999997
387,0.28415999999999997
388,0.28415999999999997
389,0.28415999999999997
390,0.28415999999999997
391,0.28415999999999997
392,0.28415999999999997
393,0.28415999999999997
394,0.13709000000000002
395,-0.15707000000000002
396,-0.11778
397,-0.21511
398,-0.34726
399,-0.4965
400,-0.16857
401,-0.22696999999999998
402,-0.28799
403,-0.3495
404,-0.44421000000000005
405,-0.5415399999999999
406,-0.6388699999999999
407,-0.7345
408,-0.8144399999999999
409,-0.894
410,-0.9718700000000001
411,-1.0571
412,-1.1625
413,-1.2719
414,-1.3887
415,-1.4966
416,-1.5932
417,-1.6799
418,-1.7578
419,-1.8277
420,-1.8926
421,-1.9395
422,-1.9784
423,-2.0129
424,-2.0461
425,-2.0505
426,-2.0505
427,-2.0505
428,-2.0492
429,-2.0118
430,-1.9742
431,-1.9353
432,-1.8901
433,-1.8211
434,-1.7495
435,-1.6716
436,-1.5808
437,-1.4687
438,-1.3454
439,-1.2091
440,-1.0686
441,-0.92451
442,-0.77305
443,-0.61733
444,-0.46458999999999995
445,-0.31301
446,-0.17376
447,-0.098312
448,0.09784
449,0.23306
450,0.33132
451,0.42865
452,0.52598
453,0.61852
454,0.68315
455,0.74633
456,0.8047300000000001
457,0.86716
458,0.9382799999999999
459,1.0121
460,1.09
461,1.1545
462,1.2052
463,1.2379
464,1.2574
465,1.2804
466,1.3054
467,1.3407
468,1.3796
469,1.4186
470,1.4575
471,1.4964
472,1.5354
473,1.5743
474,1.6147
475,1.6713
476,1.7282
477,1.7866
478,1.8414
479,1.8858
480,1.9283
481,1.9672
482,1.9973
483,2.0155
484,2.0243
485,2.0243
486,2.0243
487,2.0243
488,2.0243
489,2.0243
490,2.0243
491,2.0243
492,2.0243
493,2.0243
494,2.0243
495,2.0239
496,2.0049
497,1.9859
498,1.9665
499,1.9469999999999998
500,1.9275
501,1.9081
502,1.8886
503,1.8691
504,1.8497
505,1.8302
506,1.8107
507,1.7826
508,1.7471
509,1.6973
510,1.6389
511,1.5805
512,1.5221
513,1.4637
514,1.4053
515,1.3462
516,1.2871
517,1.2099
518,1.1320000000000001
519,1.0542
520,0.9785200000000001
521,0.91727
522,0.85664
523,0.79824
524,0.7358899999999999
525,0.66451
526,0.5906100000000001
527,0.51274
528,0.43932
529,0.3708
530,0.30796
531,0.24956
532,0.19485
533,0.14217
534,0.09954299999999999
535,0.39223
536,0.19757
537,0.14574
538,-0.19175
539,-0.38641
540,-0.13405
541,-0.17298
542,-0.21191
543,-0.25085
544,-0.28978000000000004
545,-0.32871
546,-0.36764
547,-0.40657
548,-0.44551
549,-0.47561000000000003
550,-0.49326000000000003
551,-0.5020899999999999
552,-0.5020899999999999
553,-0.5061899999999999
554,-0.5132
555,-0.52856
556,-0.54803
557,-0.56494
558,-0.58103
559,-0.58358
560,-0.58358
561,-0.58358
562,-0.58335
563,-0.56414
564,-0.54491
565,-0.52545
566,-0.50883
567,-0.5049399999999999
568,-0.5020899999999999
569,-0.5020899999999999
570,-0.5020899999999999
571,-0.5020899999999999
572,-0.5020899999999999
573,-0.5020899999999999
574,-0.49773
575,-0.48943000000000003
576,-0.47431999999999996
577,-0.45485
578,-0.43863
579,-0.42383999999999994
580,-0.42058999999999996
581,-0.42058999999999996
582,-0.41968999999999995
583,-0.41865
584,-0.40008
585,-0.38061999999999996
586,-0.36115
587,-0.34374
588,-0.34115
589,-0.33909
590,-0.33909
591,-0.33521999999999996
592,-0.32198000000000004
593,-0.30639
594,-0.28692
595,-0.27191
596,-0.26204
597,-0.25759
598,-0.25759
599,-0.25381
600,-0.24784
601,-0.23215999999999998
602,-0.21269000000000002
603,-0.19510999999999998
604,-0.17798
605,-0.1761
606,-0.1761
607,-0.1761
608,-0.1772
609,-0.19537000000000002
610,-0.21373000000000003
611,-0.2332
612,-0.24929
613,-0.25423
614,-0.25759
615,-0.25759
616,-0.25759
617,-0.25759
618,-0.25759
619,-0.25759
620,-0.25759
621,-0.25759
622,-0.25759
623,-0.25759
624,-0.25759
625,-0.25759
626,-0.25759
627,-0.25759
628,-0.25759
629,-0.25759
630,-0.49486
631,-0.49486
632,-0.49486
633,-0.49486
634,-0.49486
635,-0.49486
636,-0.49486
637,-0.49486
638,-0.49486
639,-0.49486
640,-0.49486
641,-0.49486
642,-0.49486
643,-0.49486
644,-0.49486
645,-0.49486
646,-0.49486
647,-0.49486
648,-0.49486
649,-0.49486
650,-0.49486
651,-0.49486
652,-0.49486
653,-0.49486
654,-0.49486
655,-0.49486
656,-0.49486
657,-0.49486
658,-0.49486
659,-0.49486
660,-0.49486
661,-0.49486
662,-0.49486
663,-0.49486
664,-0.49486
665,-0.49486
666,-0.49486
667,-0.49486
668,-0.49486
669,-0.49486
670,-0.49486
671,-0.49486
672,-0.49486
673,-0.49486
674,-0.49486
675,-0.49486
676,-0.49486
677,-0.49486
678,-0.49486
679,-0.49486
680,-0.49486
681,-0.49486
682,-0.49486
683,-0.49486
684,-0.48778999999999995
685,-0.46967
686,-0.44514
687,-0.41353999999999996
688,-0.38537
689,-0.35988000000000003
690,-0.34065
691,-0.32485
692,-0.31137
693,-0.29873
694,-0.29641
695,-0.29641
696,-0.29622
697,-0.29601
698,-0.2804
699,-0.2646
700,-0.2488
701,-0.233
702,-0.2172
703,-0.2014
704,-0.1856
705,-0.16314
706,-0.12712
707,-0.34271999999999997
708,-0.10572999999999999
709,0.2208
710,0.10954000000000001
711,0.21803000000000003
712,0.34443
713,0.47365
714,0.60427
715,0.74364
716,0.88584
717,1.0270000000000001
718,1.1679
719,1.2954
720,1.4218
721,1.5482
722,1.6718
723,1.77
724,1.8675
725,1.9623
726,2.0511
727,2.1236
728,2.1928
729,2.256
730,2.3156
731,2.3706
732,2.4216
733,2.469
734,2.51
735,2.5468
736,2.5691
737,2.5849
738,2.5988
739,2.6123
740,2.6141
741,2.6141
742,2.6141
743,2.6141
744,2.6141
745,2.6141
746,2.6141
747,2.6116
748,2.5994
749,2.5861
750,2.5703
751,2.5405
752,2.4876
753,2.4226
754,2.3436
755,2.2542
756,2.1563
757,2.0403
758,1.9139
759,1.7899
760,1.6669
761,1.5539
762,1.4433
763,1.3323
764,1.2213
765,1.0952
766,0.9688399999999999
767,0.84244
768,0.71604
769,0.5896399999999999
770,0.46324
771,0.33685
772,0.21699000000000002
773,0.11124
774,0.13864
775,-0.33535
776,-0.17251
777,-0.25256
778,-0.32295999999999997
779,-0.38616
780,-0.44353000000000004
781,-0.49788000000000004
782,-0.5353100000000001
783,-0.56691
784,-0.59973
785,-0.6328
786,-0.67898
787,-0.72638
788,-0.77378
789,-0.81996
790,-0.85303
791,-0.88585
792,-0.91745
793,-0.94905
794,-0.98065
795,-1.0123
796,-1.0439
797,-1.0755
798,-1.1071
799,-1.1387
800,-1.1703
801,-1.1953
802,-1.2159
803,-1.2225
804,-1.2225
805,-1.2167
806,-1.2091
807,-1.1675
808,-1.1201
809,-1.0727
810,-1.0253
811,-0.9779100000000001
812,-0.9305100000000001
813,-0.8831100000000001
814,-0.83814
815,-0.8031699999999999
816,-0.76915
817,-0.73754
818,-0.71635
819,-0.71319
820,-0.71859
821,-0.73439
822,-0.7431800000000001
823,-0.74592
824,-0.73712
825,-0.72132
826,-0.70552
827,-0.68972
828,-0.67392
829,-0.6581199999999999
830,-0.64232
831,-0.62653
832,-0.6107199999999999
833,-0.59492
834,-0.57912
835,-0.56333
836,-0.5475300000000001
837,-0.53173
838,-0.51593
839,-0.50655
840,-0.5118199999999999
841,-0.5211899999999999
842,-0.53699
843,-0.54918
844,-0.5574
845,-0.56101
846,-0.56101
847,-0.55801
848,-0.55338
849,-0.54057
850,-0.52477
851,-0.50897
852,-0.49317
853,-0.47736999999999996
854,-0.46157
855,-0.44577
856,-0.42996999999999996
857,-0.41417
858,-0.39837
859,-0.38256999999999997
860,-0.3696
861,-0.36539
862,-0.36256
863,-0.36256
864,-0.36614
865,-0.37478
866,-0.387
867,-0.4028
868,-0.41194
869,-0.41636000000000006
870,-0.40721999999999997
871,-0.39142
872,-0.37562
873,-0.35982
874,-0.34402
875,-0.32821999999999996
876,-0.31242
877,-0.29681
878,-0.2966
879,-0.29641
880,-0.29641
881,-0.2941
882,-0.28146
883,-0.26797
884,-0.25217
885,-0.2398
886,-0.23369
887,-0.23026
888,-0.23026
889,-0.23026
890,-0.23026
891,-0.23026
892,-0.23026
893,-0.2329
894,-0.23669
895,-0.24986
896,-0.26566
897,-0.28073000000000004
898,-0.29568
899,-0.29641
900,-0.29641
901,-0.29641
902,-0.29641
903,-0.29641
904,-0.29641
905,-0.29641
906,-0.29956
907,-0.3103
908,-0.32295999999999997
909,-0.33876
910,-0.35094000000000003
911,-0.35895
912,-0.36256
913,-0.36256
914,-0.36256
915,-0.36256
916,-0.36256
917,-0.36256
918,-0.36104
919,-0.35914
920,-0.34486999999999995
921,-0.32907
922,-0.31327
923,-0.29746999999999996
924,-0.28167
925,-0.26587
926,-0.25006999999999996
927,-0.23426999999999998
928,-0.21846999999999997
929,-0.20267000000000002
930,-0.18687
931,-0.17463
932,-0.16768
933,-0.16412000000000002
934,-0.16412000000000002
935,-0.1675
936,-0.17339000000000002
937,-0.18581
938,-0.20160999999999998
939,-0.21522
940,-0.22807
941,-0.23026
942,-0.23026
943,-0.23026
944,-0.23026
