time,value
0,-0.40269
1,-0.38509
2,-0.33499
3,-0.28589000000000003
4,-0.25959
5,-0.25019
6,-0.23863
7,-0.2013
8,-0.13157
9,-0.035097
10,0.064951
11,0.13716
12,0.17209000000000002
13,0.15907000000000002
14,0.11995
15,0.082401
16,0.065966
17,0.07153
18,0.10079
19,0.13043
20,0.11977
21,0.060986
22,-0.041868
23,-0.17119
24,-0.28915
25,-0.34445
26,-0.32069000000000003
27,-0.23190999999999998
28,-0.11830999999999998
29,-0.023294
30,0.022419
31,0.020897
32,-0.020057
33,-0.057313
34,-0.044392
35,0.047035
36,0.20953000000000002
37,0.41084
38,0.59537
39,0.69935
40,0.6851
41,0.53209
42,0.26529
43,-0.066389
44,-0.39721
45,-0.67469
46,-0.86341
47,-0.9424799999999999
48,-0.9133399999999999
49,-0.7870699999999999
50,-0.56385
51,-0.27024000000000004
52,0.072113
53,0.43672
54,0.7772
55,1.0373
56,1.1801
57,1.1822
58,1.0409
59,0.77812
60,0.42273999999999995
61,0.025013999999999998
62,-0.35911
63,-0.69329
64,-0.9649399999999999
65,-1.1616
66,-1.2708
67,-1.2874
68,-1.2004
69,-1.0039
70,-0.6971
71,-0.31208
72,0.10848
73,0.52388
74,0.8785200000000001
75,1.1355
76,1.2771
77,1.3081
78,1.2266
79,1.0403
80,0.7762
81,0.44997
82,0.075013
83,-0.31115
84,-0.6633100000000001
85,-0.9241
86,-1.0465
87,-1.0007
88,-0.78173
89,-0.43973999999999996
90,-0.034338
91,0.34689000000000003
92,0.63588
93,0.78272
94,0.76552
95,0.61161
96,0.35318
97,0.045243
98,-0.26264
99,-0.53175
100,-0.75915
101,-0.9352799999999999
102,-1.0438
103,-1.0686
104,-0.99024
105,-0.79747
106,-0.48178999999999994
107,-0.068864
108,0.38568
109,0.8227200000000001
110,1.1771
111,1.3856
112,1.4295
113,1.3071
114,1.0566
115,0.72975
116,0.37679
117,0.053780999999999995
118,-0.2018
119,-0.38477
120,-0.50744
121,-0.58734
122,-0.64299
123,-0.6764899999999999
124,-0.6834100000000001
125,-0.65268
126,-0.58014
127,-0.45929
128,-0.27846
129,-0.059502
130,0.15732000000000002
131,0.3305
132,0.42431
133,0.42483000000000004
134,0.34135
135,0.21018
136,0.081794
137,-0.0042916000000000004
138,-0.013843000000000001
139,0.045607
140,0.14839000000000002
141,0.23671999999999999
142,0.27484000000000003
143,0.23940999999999998
144,0.13046
145,-0.025894999999999998
146,-0.17752
147,-0.27908
148,-0.30399
149,-0.25925
150,-0.16418
151,-0.064703
152,0.0098284
153,0.043405
154,0.030364999999999996
155,0.00041956
156,-0.011829000000000001
157,0.00082224
158,0.041750999999999996
159,0.096808
160,0.14564000000000002
161,0.16230999999999998
162,0.12852
163,0.037301
164,-0.095578
165,-0.25344
166,-0.40258
167,-0.52088
168,-0.59154
169,-0.59432
170,-0.51577
171,-0.35155
172,-0.09451799999999999
173,0.24366
174,0.63752
175,1.0518
176,1.4241
177,1.6917
178,1.7911
179,1.694
180,1.3924
181,0.9050600000000001
182,0.2822
183,-0.40854
184,-1.0961
185,-1.7135
186,-2.2109
187,-2.5412
188,-2.6657
189,-2.5776
190,-2.2585
191,-1.7137
192,-0.98411
193,-0.14006
194,0.7275
195,1.5366
196,2.1769
197,2.5917
198,2.7428
199,2.64
200,2.3189
201,1.8405
202,1.2690000000000001
203,0.65965
204,0.062383
205,-0.49645
206,-0.99005
207,-1.3966
208,-1.6796
209,-1.8124
210,-1.7788
211,-1.5779
212,-1.2284
213,-0.78845
214,-0.31538
215,0.12682000000000002
216,0.47895
217,0.70438
218,0.78556
219,0.73324
220,0.58377
221,0.37696
222,0.15832000000000002
223,-0.035597000000000004
224,-0.17954
225,-0.24343
226,-0.21631
227,-0.10269
228,0.084104
229,0.31534
230,0.5626399999999999
231,0.79001
232,0.96406
233,1.0411
234,1.0002
235,0.84306
236,0.56704
237,0.19860999999999998
238,-0.21903000000000003
239,-0.63852
240,-1.0008
241,-1.2704
242,-1.4064
243,-1.4067
244,-1.2961
245,-1.0961
246,-0.85419
247,-0.60738
248,-0.36663
249,-0.14448
250,0.07622899999999999
251,0.31094
252,0.56834
253,0.83755
254,1.0951
255,1.3107
256,1.4379
257,1.4503
258,1.3475
259,1.1378
260,0.8456799999999999
261,0.49721000000000004
262,0.1347
263,-0.20485
264,-0.51402
265,-0.78804
266,-0.9999899999999999
267,-1.1523
268,-1.2241
269,-1.1958
270,-1.0702
271,-0.8595299999999999
272,-0.60364
273,-0.3365
274,-0.098229
275,0.084856
276,0.20658
277,0.29882
278,0.38158000000000003
279,0.48283999999999994
280,0.61195
281,0.76013
282,0.88964
283,0.95386
284,0.9159
285,0.7519899999999999
286,0.47336000000000006
287,0.11696
288,-0.25845
289,-0.59308
290,-0.84531
291,-0.9938799999999999
292,-1.0323
293,-0.98341
294,-0.85172
295,-0.63297
296,-0.33309
297,0.051439
298,0.50698
299,0.99682
300,1.4482
301,1.7716
302,1.8743
303,1.6937
304,1.2081
305,0.46069
306,-0.45583
307,-1.3949
308,-2.19
309,-2.7173
310,-2.8769
311,-2.6362
312,-2.0421
313,-1.1869
314,-0.1934
315,0.79913
316,1.6655
317,2.3149
318,2.6938
319,2.7877
320,2.6144
321,2.2025
322,1.6066
323,0.8840899999999999
324,0.1026
325,-0.66508
326,-1.3543
327,-1.9047
328,-2.2632
329,-2.3962
330,-2.2987
331,-1.9852
332,-1.5002
333,-0.89602
334,-0.23217
335,0.43087
336,1.01
337,1.4544
338,1.7239
339,1.8019999999999998
340,1.6888
341,1.4044
342,1.0207
343,0.5836899999999999
344,0.15517
345,-0.20554
346,-0.48106000000000004
347,-0.6700699999999999
348,-0.77623
349,-0.82157
350,-0.81916
351,-0.77896
352,-0.69103
353,-0.55101
354,-0.35857
355,-0.12734
356,0.12125999999999999
357,0.3442
358,0.50115
359,0.56275
360,0.5176
361,0.37842
362,0.1861
363,-0.009681799999999999
364,-0.16725
365,-0.25834
366,-0.27023
367,-0.2212
368,-0.12442
369,-0.007827299999999999
370,0.10236
371,0.19532
372,0.26006
373,0.30430999999999997
374,0.3298
375,0.32866
376,0.29667
377,0.23914000000000002
378,0.15673
379,0.067871
380,-0.01155
381,-0.079025
382,-0.12939
383,-0.16091
384,-0.18036
385,-0.19964
386,-0.23004000000000002
387,-0.27452
388,-0.33299
389,-0.39518000000000003
390,-0.45116000000000006
391,-0.47368999999999994
392,-0.44518
393,-0.35756
394,-0.18971
395,0.049422
396,0.33798
397,0.63725
398,0.90359
399,1.0785
400,1.1214
401,1.0091
402,0.7361800000000001
403,0.34136
404,-0.115
405,-0.55928
406,-0.93176
407,-1.1672
408,-1.2311
409,-1.137
410,-0.89289
411,-0.53213
412,-0.10059
413,0.36476
414,0.81879
415,1.2209999999999999
416,1.5030000000000001
417,1.6147
418,1.5119999999999998
419,1.1837
420,0.64488
421,-0.045493
422,-0.7893600000000001
423,-1.4919
424,-2.0454
425,-2.3644
426,-2.4002
427,-2.1585
428,-1.6682
429,-0.9759700000000001
430,-0.15197
431,0.7177100000000001
432,1.5435
433,2.2542
434,2.7555
435,2.971
436,2.8589
437,2.423
438,1.7165
439,0.82783
440,-0.1317
441,-1.0227
442,-1.7278
443,-2.1839
444,-2.3716
445,-2.3066
446,-2.0496
447,-1.6639
448,-1.1955
449,-0.6957
450,-0.20292000000000002
451,0.26789
452,0.69922
453,1.0572
454,1.3129
455,1.4345
456,1.4111
457,1.245
458,0.97311
459,0.64385
460,0.307
461,0.019029
462,-0.19771
463,-0.33029000000000003
464,-0.3999
465,-0.43701
466,-0.46431999999999995
467,-0.49187
468,-0.51278
469,-0.51786
470,-0.4881
471,-0.42002
472,-0.31937
473,-0.18877
474,-0.054505
475,0.068439
476,0.17176
477,0.25592
478,0.3304
479,0.39903
480,0.47483000000000003
481,0.54293
482,0.5971
483,0.61224
484,0.5666399999999999
485,0.46166
486,0.28943
487,0.073537
488,-0.14874
489,-0.33509
490,-0.4678
491,-0.54013
492,-0.5563600000000001
493,-0.53282
494,-0.48103999999999997
495,-0.41356000000000004
496,-0.32184
497,-0.20444
498,-0.052258000000000006
499,0.13817000000000002
