time,value
0,-0.076486
1,-0.076486
2,-0.076486
3,-0.076486
4,-0.076486
5,-0.076486
6,-0.076486
7,-0.076486
8,-0.076486
9,-0.076486
10,-0.076486
11,-0.076486
12,-0.076486
13,-0.076486
14,-0.076486
15,-0.076486
16,-0.076486
17,-0.076486
18,-0.076486
19,-0.076486
20,-0.076486
21,-0.076486
22,-0.076486
23,-0.076486
24,-0.076486
25,-0.076486
26,-0.076486
27,-0.076486
28,-0.076486
29,-0.076486
30,-0.076486
31,-0.076486
32,-0.076486
33,-0.076486
34,-0.076486
35,-0.076486
36,-0.076486
37,-0.076486
38,-0.076486
39,-0.076486
40,-0.076486
41,-0.076486
42,-0.076486
43,-0.076486
44,-0.076486
45,-0.076486
46,-0.076486
47,-0.076486
48,-0.076486
49,-0.076486
50,-0.076486
51,-0.076486
52,-0.076486
53,-0.076486
54,-0.076486
55,-0.076486
56,-0.076486
57,-0.076486
58,-0.076486
59,-0.076486
60,-0.076486
61,-0.076486
62,-0.076486
63,-0.076486
64,-0.076486
65,-0.076486
66,-0.076486
67,-0.076486
68,-0.076486
69,-0.076486
70,-0.076486
71,-0.076486
72,-0.076486
73,-0.076486
74,-0.076486
75,-0.076486
76,-0.076486
77,-0.076486
78,-0.076486
79,-0.076486
80,-0.076486
81,-0.076486
82,-0.076486
83,-0.076486
84,-0.076486
85,-0.076486
86,-0.076486
87,-0.076486
88,-0.076486
89,-0.076486
90,-0.076486
91,-0.076486
92,-0.076486
93,-0.076486
94,-0.076486
95,-0.076486
96,-0.076486
97,-0.076486
98,-0.076486
99,-0.076486
100,-0.076486
101,-0.076486
102,-0.076486
103,-0.076486
104,-0.076486
105,-0.076486
106,-0.076486
107,-0.076486
108,-0.076486
109,-0.076486
110,-0.076486
111,-0.076486
112,-0.076486
113,-0.076486
114,-0.076486
115,-0.076486
116,-0.076486
117,-0.076486
118,-0.076486
119,-0.076486
120,-0.076486
121,-0.076486
122,-0.076486
123,-0.076486
124,-0.076486
125,-0.076486
126,-0.076486
127,-0.076486
128,-0.076486
129,-0.076486
130,-0.076486
131,-0.076486
132,-0.076486
133,-0.076486
134,-0.076486
135,-0.076486
136,-0.076486
137,-0.076486
138,-0.076486
139,-0.076486
140,-0.076486
141,-0.076486
142,-0.076486
143,-0.076486
144,-0.076486
145,-0.076486
146,-0.076486
147,-0.076486
148,-0.076486
149,-0.076486
150,-0.076486
151,-0.076486
152,-0.076486
153,-0.076486
154,-0.076486
155,-0.076486
156,-0.076486
157,-0.076486
158,-0.076486
159,-0.076486
160,-0.076486
161,-0.076486
162,-0.076486
163,-0.076486
164,-0.076486
165,-0.076486
166,-0.076486
167,-0.076486
168,-0.076486
169,-0.076486
170,-0.076486
171,-0.076486
172,-0.076486
173,-0.076486
174,-0.076486
175,-0.076486
176,-0.076486
177,-0.076486
178,-0.076486
179,-0.076486
180,-0.076486
181,-0.076486
182,-0.076486
183,-0.076486
184,-0.076486
185,-0.076486
186,-0.076486
187,-0.076486
188,-0.076486
189,-0.076486
190,-0.076486
191,-0.076486
192,-0.076486
193,-0.076486
194,-0.076486
195,-0.076486
196,15.632
197,4.9758
198,0.061304
199,-0.076486
200,-0.076486
201,-0.076486
202,-0.076486
203,-0.076486
204,-0.076486
205,-0.076486
206,-0.076486
207,-0.076486
208,-0.076486
209,-0.076486
210,-0.076486
211,-0.076486
212,-0.076486
213,-0.076486
214,-0.076486
215,-0.076486
216,-0.076486
217,-0.076486
218,-0.076486
219,-0.076486
220,-0.076486
221,-0.076486
222,-0.076486
223,-0.076486
224,-0.076486
225,-0.076486
226,-0.076486
227,-0.076486
228,-0.076486
229,-0.076486
230,-0.076486
231,-0.076486
232,-0.076486
233,-0.076486
234,1.4392
235,14.390999999999998
236,0.47467
237,-0.076486
238,-0.076486
239,-0.076486
240,-0.076486
241,-0.076486
242,-0.076486
243,-0.076486
244,-0.076486
245,-0.076486
246,-0.076486
247,-0.076486
248,-0.076486
249,-0.076486
250,-0.076486
251,-0.076486
252,-0.076486
253,-0.076486
254,-0.076486
255,-0.076486
256,-0.076486
257,-0.076486
258,-0.076486
259,-0.076486
260,-0.076486
261,-0.076486
262,-0.076486
263,-0.076486
264,-0.076486
265,-0.076486
266,-0.076486
267,-0.076486
268,-0.076486
269,-0.076486
270,-0.076486
271,-0.076486
272,-0.076486
273,-0.076486
274,-0.076486
275,-0.076486
276,-0.076486
277,-0.076486
278,-0.076486
279,-0.076486
280,-0.076486
281,-0.076486
282,-0.076486
283,-0.076486
284,-0.076486
285,-0.076486
286,-0.076486
287,-0.076486
288,-0.076486
289,-0.076486
290,-0.076486
291,-0.076486
292,-0.076486
293,-0.076486
294,-0.076486
295,-0.076486
296,-0.076486
297,-0.076486
298,-0.076486
299,-0.076486
300,-0.076486
301,-0.076486
302,-0.076486
303,-0.076486
304,-0.076486
305,-0.076486
306,-0.076486
307,-0.076486
308,-0.076486
309,-0.076486
310,-0.076486
311,-0.076486
312,-0.076486
313,-0.076486
314,-0.076486
315,-0.076486
316,-0.076486
317,-0.076486
318,-0.076486
319,-0.076486
320,-0.076486
321,-0.076486
322,-0.076486
323,-0.076486
324,-0.076486
325,-0.076486
326,-0.076486
327,-0.076486
328,-0.076486
329,-0.076486
330,-0.076486
331,-0.076486
332,-0.076486
333,-0.076486
334,-0.076486
335,-0.076486
336,-0.076486
337,-0.076486
338,-0.076486
339,-0.076486
340,-0.076486
341,-0.076486
342,-0.076486
343,-0.076486
344,-0.076486
345,2.1741
346,15.218
347,0.015374
348,-0.076486
349,-0.076486
350,-0.076486
351,-0.076486
352,-0.076486
353,-0.076486
354,-0.076486
355,-0.076486
356,-0.076486
357,-0.076486
358,-0.076486
359,-0.076486
360,-0.076486
361,-0.076486
362,-0.076486
363,-0.076486
364,-0.076486
365,-0.076486
366,-0.076486
367,-0.076486
368,-0.076486
369,-0.076486
370,-0.076486
371,-0.076486
372,-0.076486
373,-0.076486
374,-0.076486
375,-0.076486
376,-0.076486
377,-0.076486
378,-0.076486
379,-0.076486
380,-0.076486
381,-0.076486
382,-0.076486
383,-0.076486
384,-0.076486
385,-0.076486
386,-0.076486
387,-0.076486
388,-0.076486
389,-0.076486
390,-0.076486
391,-0.076486
392,-0.076486
393,-0.076486
394,-0.076486
395,-0.076486
396,-0.076486
397,-0.076486
398,-0.076486
399,-0.076486
400,-0.076486
401,-0.076486
402,-0.076486
403,-0.076486
404,-0.076486
405,-0.076486
406,-0.076486
407,-0.076486
408,-0.076486
409,-0.076486
410,-0.076486
411,-0.076486
412,-0.076486
413,-0.076486
414,-0.076486
415,-0.076486
416,-0.076486
417,-0.076486
418,-0.076486
419,-0.076486
420,-0.076486
421,-0.076486
422,-0.076486
423,-0.076486
424,-0.076486
425,-0.076486
426,-0.076486
427,-0.076486
428,-0.076486
429,-0.076486
430,-0.076486
431,-0.076486
432,-0.076486
433,-0.076486
434,-0.076486
435,-0.076486
436,-0.076486
437,-0.076486
438,-0.076486
439,-0.076486
440,-0.076486
441,-0.076486
442,-0.076486
443,-0.076486
444,-0.076486
445,-0.076486
446,-0.076486
447,-0.076486
448,-0.076486
449,-0.076486
450,-0.076486
451,-0.076486
452,-0.076486
453,-0.076486
454,-0.076486
455,-0.076486
456,-0.076486
457,-0.076486
458,-0.076486
459,-0.076486
460,-0.076486
461,-0.076486
462,-0.076486
463,-0.076486
464,-0.076486
465,-0.076486
466,-0.076486
467,-0.076486
468,-0.076486
469,-0.076486
470,-0.076486
471,-0.076486
472,-0.076486
473,-0.076486
474,-0.076486
475,-0.076486
476,-0.076486
477,-0.076486
478,-0.076486
479,-0.076486
480,-0.076486
481,-0.076486
482,-0.076486
483,-0.076486
484,-0.076486
485,-0.076486
486,-0.076486
487,-0.076486
488,-0.076486
489,-0.076486
490,-0.076486
491,-0.076486
492,-0.076486
493,-0.076486
494,-0.076486
495,-0.076486
496,-0.076486
497,-0.076486
498,-0.076486
499,-0.076486
500,-0.076486
501,-0.076486
502,-0.076486
503,-0.076486
504,-0.076486
505,-0.076486
506,-0.076486
507,-0.076486
508,-0.076486
509,-0.076486
510,-0.076486
511,-0.076486
512,-0.076486
513,-0.076486
514,-0.076486
515,-0.076486
516,-0.076486
517,-0.076486
518,-0.076486
519,-0.076486
520,-0.076486
521,-0.076486
522,-0.076486
523,-0.076486
524,-0.076486
525,-0.076486
526,-0.076486
527,-0.076486
528,-0.076486
529,-0.076486
530,-0.076486
531,-0.076486
532,-0.076486
533,-0.076486
534,-0.076486
535,-0.076486
536,-0.076486
537,-0.076486
538,-0.076486
539,-0.076486
540,-0.076486
541,-0.076486
542,-0.076486
543,-0.076486
544,-0.076486
545,-0.076486
546,-0.076486
547,-0.076486
548,-0.076486
549,-0.076486
550,-0.076486
551,-0.076486
552,-0.076486
553,-0.076486
554,-0.076486
555,-0.076486
556,-0.076486
557,-0.076486
558,-0.076486
559,-0.076486
560,-0.076486
561,-0.076486
562,-0.076486
563,-0.076486
564,-0.076486
565,-0.076486
566,-0.076486
567,-0.076486
568,-0.076486
569,-0.076486
570,-0.076486
571,-0.076486
572,-0.076486
573,-0.076486
574,-0.076486
575,-0.076486
576,-0.076486
577,-0.076486
578,-0.076486
579,-0.076486
580,-0.076486
581,-0.076486
582,-0.076486
583,-0.076486
584,-0.076486
585,-0.076486
586,-0.076486
587,-0.076486
588,-0.076486
589,-0.076486
590,-0.076486
591,-0.076486
592,-0.076486
593,-0.076486
594,-0.076486
595,-0.076486
596,-0.076486
597,-0.076486
598,-0.076486
599,-0.076486
600,-0.076486
601,-0.076486
602,-0.076486
603,-0.076486
604,-0.076486
605,-0.076486
606,-0.076486
607,-0.076486
608,-0.076486
609,-0.076486
610,-0.076486
611,-0.076486
612,-0.076486
613,-0.076486
614,-0.076486
615,-0.076486
616,-0.076486
617,-0.076486
618,-0.076486
619,-0.076486
620,-0.076486
621,-0.076486
622,-0.076486
623,-0.076486
624,-0.076486
625,-0.076486
626,-0.076486
627,-0.076486
628,-0.076486
629,-0.076486
630,-0.076486
631,-0.076486
632,-0.076486
633,-0.076486
634,-0.076486
635,-0.076486
636,-0.076486
637,-0.076486
638,-0.076486
639,-0.076486
640,-0.076486
641,-0.076486
642,-0.076486
643,-0.076486
644,-0.076486
645,-0.076486
646,-0.076486
647,-0.076486
648,-0.076486
649,-0.076486
650,-0.076486
651,-0.076486
652,-0.076486
653,-0.076486
654,-0.076486
655,-0.076486
656,-0.076486
657,-0.076486
658,-0.076486
659,-0.076486
660,-0.076486
661,-0.076486
662,-0.076486
663,-0.076486
664,-0.076486
665,-0.076486
666,-0.076486
667,-0.076486
668,-0.076486
669,-0.076486
670,-0.076486
671,-0.076486
672,-0.076486
673,-0.076486
674,-0.076486
675,-0.076486
676,-0.076486
677,-0.076486
678,-0.076486
679,-0.076486
680,-0.076486
681,-0.076486
682,-0.076486
683,-0.076486
684,-0.076486
685,-0.076486
686,-0.076486
687,-0.076486
688,-0.076486
689,-0.076486
690,-0.076486
691,-0.076486
692,-0.076486
693,-0.076486
694,-0.076486
695,-0.076486
696,-0.076486
697,-0.076486
698,-0.076486
699,-0.076486
700,-0.076486
701,-0.076486
702,-0.076486
703,-0.076486
704,-0.076486
705,-0.076486
706,-0.076486
707,-0.076486
708,-0.076486
709,-0.076486
710,-0.076486
711,-0.076486
712,-0.076486
713,-0.076486
714,-0.076486
715,-0.076486
716,-0.076486
717,-0.076486
718,-0.076486
719,-0.076486
