time,value
0,-0.49423
1,-0.38569000000000003
2,-0.28458
3,-0.20665999999999998
4,-0.16305999999999998
5,-0.1449
6,-0.13852
7,-0.12932000000000002
8,-0.1002
9,-0.032036
10,0.079375
11,0.22301999999999997
12,0.38529
13,0.5467
14,0.6833199999999999
15,0.77427
16,0.80989
17,0.7812
18,0.69113
19,0.55415
20,0.37851
21,0.17126
22,-0.051368
23,-0.27856
24,-0.5008699999999999
25,-0.7168899999999999
26,-0.9195
27,-1.0927
28,-1.2269
29,-1.2990000000000002
30,-1.2897
31,-1.1822
32,-0.9633
33,-0.63636
34,-0.22823000000000002
35,0.22805999999999998
36,0.69428
37,1.1177
38,1.4597
39,1.6882
40,1.7841
41,1.7472
42,1.5826
43,1.3054
44,0.9303799999999999
45,0.47263999999999995
46,-0.041757
47,-0.57422
48,-1.0786
49,-1.5093
50,-1.8214
51,-1.9743
52,-1.9485
53,-1.7547
54,-1.4168
55,-0.9734299999999999
56,-0.47891999999999996
57,0.024919999999999998
58,0.50051
59,0.9152100000000001
60,1.2445
61,1.473
62,1.5939
63,1.5973
64,1.4834
65,1.2616
66,0.94796
67,0.5704899999999999
68,0.16547
69,-0.22496
70,-0.56593
71,-0.83278
72,-1.0116
73,-1.1079
74,-1.1362
75,-1.1114
76,-1.0531
77,-0.97031
78,-0.86331
79,-0.72593
80,-0.55083
81,-0.32728
82,-0.055182
83,0.25654
84,0.59309
85,0.9256200000000001
86,1.2151
87,1.4266
88,1.528
89,1.4962
90,1.3267
91,1.0308
92,0.63457
93,0.18417999999999998
94,-0.26924000000000003
95,-0.67373
96,-0.9932200000000001
97,-1.1971
98,-1.2782
99,-1.2424
100,-1.112
101,-0.92005
102,-0.6945100000000001
103,-0.46561
104,-0.25773
105,-0.08791
106,0.034305
107,0.11515999999999998
108,0.16367
109,0.19547
110,0.22379000000000002
111,0.26475
112,0.32947
113,0.42577
114,0.55182
115,0.69521
116,0.83315
117,0.9305
118,0.95624
119,0.8837799999999999
120,0.69691
121,0.40324
122,0.033856
123,-0.3665
124,-0.7490899999999999
125,-1.0578
126,-1.2497
127,-1.3045
128,-1.228
129,-1.0347
130,-0.76088
131,-0.44848999999999994
132,-0.13425
133,0.14523
134,0.36846999999999996
135,0.5263
136,0.62093
137,0.66001
138,0.66152
139,0.64215
140,0.61342
141,0.5767
142,0.52581
143,0.44501999999999997
144,0.31821
145,0.14306
146,-0.06695599999999999
147,-0.28731
148,-0.48633000000000004
149,-0.63657
150,-0.7157399999999999
151,-0.71302
152,-0.6443300000000001
153,-0.53257
154,-0.40299
155,-0.28019
156,-0.1742
157,-0.080312
158,0.0054591
159,0.092904
160,0.18818
161,0.28514
162,0.36565
163,0.41386000000000006
164,0.42378000000000005
165,0.39474000000000004
166,0.34221999999999997
167,0.29046
168,0.26073
169,0.26399
170,0.29883000000000004
171,0.34467
172,0.36432
173,0.33274000000000004
174,0.23273000000000002
175,0.066379
176,-0.15320999999999999
177,-0.39771999999999996
178,-0.6361600000000001
179,-0.83721
180,-0.9741700000000001
181,-1.0292
182,-0.99661
183,-0.8753299999999999
184,-0.67387
185,-0.41279
186,-0.11379
187,0.19311
188,0.47323999999999994
189,0.70199
190,0.85926
191,0.93701
192,0.9396399999999999
193,0.88613
194,0.79175
195,0.6744399999999999
196,0.54394
197,0.40307
198,0.24959
199,0.07720700000000001
200,-0.11865
201,-0.33155
202,-0.5492199999999999
203,-0.75717
204,-0.9399700000000001
205,-1.0791
206,-1.1528
207,-1.1504
208,-1.068
209,-0.8950100000000001
210,-0.63154
211,-0.28412
212,0.12162
213,0.55724
214,0.97844
215,1.3292
216,1.5662
217,1.6532
218,1.5844
219,1.3685
220,1.0302
221,0.60421
222,0.13743
223,-0.32727
224,-0.7630600000000001
225,-1.1406
226,-1.4437
227,-1.6545
228,-1.757
229,-1.7365
230,-1.5791
231,-1.2822
232,-0.8555799999999999
233,-0.327
234,0.2646
235,0.8658600000000001
236,1.4195
237,1.8649
238,2.155
239,2.2583
240,2.1596
241,1.8562
242,1.3693
243,0.73661
244,0.0085524
245,-0.74973
246,-1.4658
247,-2.0653
248,-2.4818
249,-2.6634
250,-2.5804
251,-2.2365
252,-1.6692
253,-0.9386200000000001
254,-0.12733
255,0.6723100000000001
256,1.3767
257,1.9162
258,2.2385
259,2.3223
260,2.1727
261,1.8218
262,1.3267
263,0.75964
264,0.1952
265,-0.30689
266,-0.69622
267,-0.95195
268,-1.0759999999999998
269,-1.0996
270,-1.0583
271,-0.98939
272,-0.9147200000000001
273,-0.8345799999999999
274,-0.73532
275,-0.60213
276,-0.42096999999999996
277,-0.18638
278,0.091848
279,0.38271
280,0.64808
281,0.8463200000000001
282,0.9411200000000001
283,0.9179
284,0.77763
285,0.54104
286,0.24796999999999997
287,-0.060351
288,-0.33565
289,-0.5352
290,-0.63317
291,-0.60683
292,-0.45168
293,-0.18216
294,0.15846
295,0.51273
296,0.81586
297,0.99367
298,0.9972700000000001
299,0.79564
300,0.4004
301,-0.13446
302,-0.72163
303,-1.2618
304,-1.6578
305,-1.827
306,-1.7361
307,-1.3962
308,-0.85756
309,-0.19809000000000002
310,0.48365
311,1.0931
312,1.5625
313,1.8471
314,1.922
315,1.7966
316,1.5017
317,1.0771
318,0.5743699999999999
319,0.039349
320,-0.48281
321,-0.94273
322,-1.2993
323,-1.5259
324,-1.6156
325,-1.5682
326,-1.4004
327,-1.1374
328,-0.80562
329,-0.43141
330,-0.030055000000000002
331,0.37986
332,0.7810699999999999
333,1.1475
334,1.4495
335,1.6505
336,1.71
337,1.6013
338,1.3249
339,0.9009799999999999
340,0.36651
341,-0.21628000000000003
342,-0.7760100000000001
343,-1.2471
344,-1.5829
345,-1.7480000000000002
346,-1.7298
347,-1.5319
348,-1.1733
349,-0.6872699999999999
350,-0.12345
351,0.44636000000000003
352,0.9405700000000001
353,1.2811
354,1.4053
355,1.2862
356,0.9421700000000001
357,0.43541
358,-0.13342
359,-0.64388
360,-0.98703
361,-1.0941
362,-0.9512
363,-0.59745
364,-0.11091
365,0.40818000000000004
366,0.86819
367,1.197
368,1.3542
369,1.3289
370,1.1404
371,0.82111
372,0.40761
373,-0.059066999999999995
374,-0.53332
375,-0.96641
376,-1.3054
377,-1.5038
378,-1.5276
379,-1.3716
380,-1.058
381,-0.6388699999999999
382,-0.18803
383,0.21771999999999997
384,0.51257
385,0.66079
386,0.6632399999999999
387,0.54824
388,0.37255
389,0.20229
390,0.09400499999999999
391,0.089414
392,0.19393
393,0.38669000000000003
394,0.6169
395,0.83095
396,0.97593
397,0.99774
398,0.86803
399,0.58024
400,0.16205
401,-0.33735
402,-0.8542700000000001
403,-1.3159999999999998
404,-1.6467
405,-1.7916
406,-1.7273
407,-1.4541
408,-1.0116
409,-0.46029
410,0.12125
411,0.65959
412,1.0882
413,1.3639
414,1.475
415,1.444
416,1.3042
417,1.0992
418,0.86587
419,0.62592
420,0.38595
421,0.14285
422,-0.12199000000000002
423,-0.41745
424,-0.73783
425,-1.0644
426,-1.3664
427,-1.5946
428,-1.7009999999999998
429,-1.6548
430,-1.4348
431,-1.0456
432,-0.51869
433,0.094644
434,0.73545
435,1.3332
436,1.8192
437,2.1332
438,2.231
439,2.0886
440,1.7069999999999999
441,1.1302
442,0.42100000000000004
443,-0.33221999999999996
444,-1.0311
445,-1.5803
446,-1.9086
447,-1.9836
448,-1.8086
449,-1.4279
450,-0.91494
451,-0.3639
452,0.14587
453,0.54632
454,0.79365
455,0.8840100000000001
456,0.8326399999999999
457,0.68285
458,0.49175
459,0.31335999999999997
460,0.19216
461,0.15187
462,0.19908
463,0.31367
464,0.45632
465,0.57519
466,0.61457
467,0.5322600000000001
468,0.31114
469,-0.033128
470,-0.45869
471,-0.89885
472,-1.2722
473,-1.5016
474,-1.5381
475,-1.3623
476,-1.0041
477,-0.51886
478,0.013833000000000002
479,0.51125
480,0.90174
481,1.1383
482,1.2039
483,1.114
484,0.90381
485,0.6168600000000001
486,0.30766
487,0.026264
488,-0.17994000000000002
489,-0.28176
490,-0.26409
491,-0.13819
492,0.06462899999999999
493,0.29579
494,0.48749
495,0.5804199999999999
496,0.53141
497,0.32766999999999996
498,-0.0073631
499,-0.41975
