time,value
0,-0.29713
1,-0.033394
2,0.73216
3,-0.09640599999999999
4,0.28808
5,-0.26544
6,0.10719000000000001
7,-0.20478
8,-0.23456
9,0.24883000000000002
10,0.2473
11,0.062276
12,0.5839300000000001
13,-0.45868000000000003
14,0.4405
15,-0.37144
16,-0.03805
17,-0.28697
18,-0.3936
19,0.096778
20,-0.70292
21,-0.09274199999999999
22,-0.33623000000000003
23,-0.30988000000000004
24,0.010685
25,-0.41915
26,-0.21085
27,0.20618000000000003
28,0.21761
29,-0.28544
30,-0.26382
31,-0.20047
32,0.021194
33,0.36207
34,-0.36246
35,0.037114
36,0.40859
37,0.20706
38,-0.14908
39,0.58135
40,-0.38766999999999996
41,-0.10765
42,0.17424
43,0.27169
44,-0.091623
45,-0.065805
46,-0.25214000000000003
47,-0.24183000000000002
48,-0.38216
49,-0.41325
50,0.6266
51,0.32193
52,0.22678
53,-0.022116
54,1.6914
55,1.6914
56,1.6914
57,1.6914
58,1.6914
59,1.6914
60,1.6914
61,1.6914
62,-1.635
63,-1.635
64,-1.635
65,-1.635
66,-1.635
67,-1.635
68,-1.635
69,-1.635
70,0.04672
71,-0.22760999999999998
72,0.1373
73,0.048083999999999995
74,-1.635
75,-1.635
76,-1.635
77,-1.635
78,-1.635
79,-1.635
80,-1.635
81,-1.635
82,-1.635
83,-1.635
84,-1.635
85,-1.635
86,-1.635
87,-1.635
88,1.6914
89,1.6914
90,1.6914
91,1.6914
92,1.6914
93,1.6914
94,1.6914
95,1.6914
96,1.6914
97,1.6914
98,1.6914
99,1.6914
100,1.6914
101,0.26718000000000003
102,0.16757
103,0.08947999999999999
104,-0.0038382
105,0.10777
106,0.35255
107,-0.56001
108,0.21269000000000002
109,0.17773
110,-0.12858
111,0.21536999999999998
112,0.47606000000000004
113,-0.15821
114,-0.29119
115,0.31398000000000004
116,-0.090086
117,-0.70248
118,0.39889
119,0.42818
120,-0.049183
121,-0.24336999999999998
122,0.37162
123,0.18929
124,0.08090900000000001
125,0.48668
126,0.1408
127,-0.30615
