time,value
0,-0.59416
1,-0.54583
2,-0.37262
3,-0.18495999999999999
4,0.1127
5,0.41278000000000004
6,0.62333
7,0.8723700000000001
8,1.1354
9,1.3123
10,1.3501
11,1.3748
12,1.3703
13,1.4119
14,1.3782
15,1.232
16,0.9344100000000001
17,0.5888399999999999
18,0.32328
19,0.027016000000000002
20,-0.26184
21,-0.5303899999999999
22,-0.69114
23,-0.7370399999999999
24,-0.6077600000000001
25,-0.4116
26,-0.20081
27,0.038456
28,0.33068000000000003
29,0.60626
30,0.8594700000000001
31,1.1491
32,1.3683
33,1.3999
34,1.4718
35,1.4669999999999999
36,1.3805
37,1.337
38,1.3457
39,1.4278
40,1.4014
41,1.5321
42,1.2781
43,1.1259
44,0.82115
45,0.47676
46,0.19003
47,-0.10595
48,-0.32961
49,-0.53484
50,-0.34808
51,-0.48577
52,-0.57406
53,-0.74497
54,-0.9484600000000001
55,-1.159
56,-1.2942
57,-1.4841
58,-1.5486
59,-1.4661
60,-1.287
61,-1.0581
62,-0.82216
63,-0.61085
64,-0.48956000000000005
65,-0.46216
66,-0.56203
67,-0.76566
68,-1.0061
69,-1.1572
70,-1.2839
71,-1.4126
72,-1.4046
73,-1.4259
74,-1.3376
75,-1.1854
76,-1.0489
77,-0.85388
78,-0.6481600000000001
79,-0.48344
