time,value
0,-0.45248
1,-0.45248
2,-0.45248
3,-0.45248
4,-0.45248
5,-0.45248
6,-0.45248
7,-0.45248
8,-0.45248
9,-0.45248
10,-0.45248
11,-0.45248
12,-0.45248
13,-0.45248
14,-0.45248
15,-0.45248
16,-0.45248
17,-0.45248
18,-0.45248
19,-0.45248
20,-0.096755
21,-0.12034
22,-0.15759
23,-0.19526
24,-0.19526
25,-0.19526
26,-0.19526
27,-0.19526
28,-0.19526
29,-0.19526
30,-0.19526
31,-0.19526
32,-0.19526
33,-0.19526
34,-0.19526
35,-0.19526
36,-0.19480999999999998
37,-0.17327
38,-0.13987
39,-0.45077
40,-0.18924000000000002
41,0.099317
42,0.12193
43,0.20765999999999998
44,0.27843
45,0.35091999999999995
46,0.43037
47,0.53498
48,0.63959
49,0.7442
50,0.80555
51,0.86215
52,0.91445
53,0.9537700000000001
54,0.98556
55,0.98556
56,0.98556
57,0.98556
58,0.98556
59,0.98556
60,0.98556
61,0.98556
62,0.98556
63,0.9899399999999999
64,1.0054
65,1.0577
66,1.11
67,1.1623
68,1.2146
69,1.2669
70,1.3192
71,1.3715
72,1.4238
73,1.4761
74,1.511
75,1.5202
76,1.5223
77,1.5223
78,1.5223
79,1.5238
80,1.5269
81,1.5726
82,1.6152
83,1.6255
84,1.6296
85,1.6296
86,1.6296
87,1.6296
88,1.6296
89,1.6296
90,1.6296
91,1.6296
92,1.6296
93,1.6296
94,1.6296
95,1.6293
96,1.6273
97,1.5729
98,1.4683
99,1.3987
100,1.3306
101,1.2516
102,1.1652
103,1.074
104,1.0204
105,0.9506899999999999
106,0.8460799999999999
107,0.76867
108,0.70386
109,0.65156
110,0.6045
111,0.5645100000000001
112,0.5561699999999999
113,0.54015
114,0.43759
115,0.35372
116,0.28706
117,0.21131
118,0.13029000000000002
119,0.17185999999999998
120,-0.16873
121,-0.43026000000000003
122,-0.13577
123,-0.18808
124,-0.24038
125,-0.29269
126,-0.345
127,-0.3973
128,-0.44961
129,-0.5019100000000001
130,-0.6331899999999999
131,-0.779
132,-0.90002
133,-1.0243
134,-1.1515
135,-1.297
136,-1.4335
137,-1.5381
138,-1.6126
139,-1.669
140,-1.6523
141,-1.6149
142,-1.5411
143,-1.4509999999999998
144,-1.3583
145,-1.306
146,-1.2537
147,-1.2014
148,-1.1491
149,-1.1077
150,-1.1169
151,-1.1972
152,-1.3377
153,-1.6827
154,-1.9989
155,-2.1804
156,-2.3046
157,-2.3959
158,-2.3897
159,-2.3454
160,-2.2347
161,-2.0902
162,-1.9376
163,-1.8258
164,-1.7173
165,-1.6126
166,-1.5384
167,-1.4834
168,-1.4834
169,-1.4834
170,-1.4834
171,-1.5643
172,-1.6484
173,-1.7223
174,-1.7935
175,-1.8635
176,-1.9599
177,-2.0202
178,-2.0202
179,-1.9564
180,-1.8684
181,-1.7638
182,-1.6591
183,-1.5545
184,-1.4499
185,-1.3453
186,-1.2407
187,-1.1597
188,-1.0972
189,-1.1506
190,-1.2407
191,-1.3976
192,-1.5491
193,-1.6937
194,-1.6414
195,-1.5416
196,-1.3662
197,-1.207
198,-1.0572
199,-0.9382
200,-0.80056
201,-0.64261
202,-0.4414
203,-0.24884
204,-0.11962
205,-0.25434
206,0.48766000000000004
207,0.17973
208,0.23413
209,0.23413
210,0.23413
211,0.23779
212,0.35470999999999997
213,0.43671000000000004
214,0.46543
215,0.44891000000000003
216,0.44814
217,0.65737
218,0.79127
219,0.8466600000000001
220,0.89941
221,0.94095
222,0.9440200000000001
223,0.9082100000000001
224,0.8446299999999999
225,0.74215
226,0.6532399999999999
227,0.5988899999999999
228,0.57092
229,0.5561699999999999
230,0.5561699999999999
231,0.5561699999999999
232,0.5561699999999999
233,0.5561699999999999
234,0.56284
235,0.61207
236,0.66284
237,0.71514
238,0.72843
239,0.7241
240,0.68102
241,0.66352
242,0.66352
243,0.70972
244,0.74798
245,0.76542
246,0.7708699999999999
247,0.7708699999999999
248,0.7708699999999999
249,0.7708699999999999
250,0.7708699999999999
251,0.73401
252,0.68608
253,0.63378
254,0.5919399999999999
255,0.56015
256,0.5561699999999999
257,0.5561699999999999
258,0.5561699999999999
259,0.5282899999999999
260,0.48213999999999996
261,0.46182
262,0.44233
263,0.42283999999999994
264,0.38045
265,0.32815
266,0.27584000000000003
267,0.22353
268,0.17123
269,0.11892
270,0.30572
271,-0.048115
272,-0.47673000000000004
273,-0.19224000000000002
274,-0.24996
275,-0.28021
276,-0.24431
277,-0.21724000000000002
278,-0.19571
279,-0.17818
280,-0.14876
281,-0.096456
282,-0.23369
283,0.1673
284,0.28936999999999996
285,0.48583999999999994
286,0.12232
287,0.11362
288,0.44578
289,0.19963
290,0.084253
291,0.084253
292,0.084253
293,0.084253
294,0.084253
295,0.084253
296,0.084253
297,0.084253
298,0.084253
299,0.084253
300,0.23168000000000002
301,0.41843
302,0.40305
303,0.30956999999999996
304,0.11982999999999999
305,0.084253
306,0.084253
307,0.084253
308,0.084253
309,0.084253
310,0.084253
311,0.066198
312,-0.1818
313,-0.19095
314,-0.45248
315,0.98087
316,0.98087
317,0.98087
318,0.98087
319,0.98087
320,0.98087
321,0.98087
322,0.98087
323,0.98087
324,0.98087
325,0.98087
326,0.98087
327,0.98087
328,0.98087
329,0.98087
330,0.98087
331,0.98087
332,0.98087
333,0.98087
334,0.98087
335,0.98087
336,0.98087
337,0.98087
338,0.98087
339,0.98087
340,0.98087
341,0.98087
342,0.98087
343,0.98087
344,0.98087
345,0.97154
346,0.95496
347,0.86664
348,0.79793
349,0.79056
350,0.74692
351,0.68443
352,0.62915
353,0.59518
354,0.59518
355,0.59518
356,0.6048899999999999
357,0.6896399999999999
358,0.77881
359,0.8727799999999999
360,0.93565
361,0.98356
362,0.99645
363,1.0558
364,1.1498
365,1.166
366,1.1915
367,1.2505
368,1.3094
369,1.3666
370,1.3666
371,1.3666
372,1.3666
373,1.3666
374,1.3666
375,1.3666
376,1.3666
377,1.3666
378,1.3666
379,1.3666
380,1.3666
381,1.3666
382,1.3666
383,1.3666
384,1.3666
385,1.3666
386,1.3666
387,1.3666
388,1.3666
389,1.3666
390,1.3666
391,1.3254
392,1.2744
393,1.2394
394,1.2634
395,1.3463
396,1.2763
397,1.1996
398,1.1812
399,1.1737
400,1.1737
401,1.1472
402,1.0982
403,1.0042
404,0.9102399999999999
405,0.81628
406,0.72231
407,0.62834
408,0.53438
409,0.44041
410,0.34618000000000004
411,0.25037
412,0.10754000000000001
413,-0.41489
414,-0.20545
415,-0.3277
416,-0.46957
417,-0.6248
418,-0.78878
419,-0.8849299999999999
420,-0.9789
421,-1.0729
422,-1.2157
423,-1.3783
424,-1.5202
425,-1.6321
426,-1.704
427,-1.719
428,-1.7334
429,-1.8255
430,-1.8831
431,-1.9088
432,-1.9118
433,-1.9169
434,-1.9371
435,-2.0027
436,-2.0967
437,-2.1022
438,-2.1046
439,-2.1046
440,-2.1046
441,-2.1033
442,-2.0849
443,-2.0334
444,-1.9394
445,-1.9164
446,-1.9118
447,-1.9118
448,-1.9333
449,-1.9739
450,-2.0623
451,-2.1562
452,-2.2502
453,-2.3983
454,-2.5789
455,-2.5807
456,-2.5337
457,-2.4011
458,-2.2287
459,-2.0408
460,-1.8528
461,-1.6649
462,-1.4769999999999999
463,-1.2396
464,-0.9915700000000001
465,-0.74652
466,-0.56734
467,-0.44388999999999995
468,-0.68779
469,-0.9472299999999999
470,-1.1462
471,-1.3007
472,-1.4297
473,-1.4536
474,-1.4306
475,-1.3256
476,-1.1601
477,-0.96454
478,-0.6955399999999999
479,-0.44681000000000004
480,-0.22203
481,-0.28726
482,0.42094
483,0.17153
484,0.20949
485,0.20949
486,0.13687
487,0.33226999999999995
488,0.13881
489,-0.22399000000000002
490,-0.18995
491,-0.11463
492,-0.12891
493,-0.18765
494,-0.044863
495,0.098122
496,0.36528
497,0.16189
498,0.28534
499,0.45331000000000005
500,0.59518
501,0.59518
502,0.59518
503,0.59518
504,0.40387
505,0.1642
506,-0.15639
507,-0.38266999999999995
508,-0.5539
509,-0.45993999999999996
510,-0.36596999999999996
511,-0.27201
512,-0.21535
513,-0.17029
514,-0.1187
515,-0.19328
516,0.18342999999999998
517,0.29179
518,0.37078
519,0.39289
520,0.40234000000000003
521,0.40234000000000003
522,0.37988
523,0.33478
524,0.24081
525,0.14685
526,0.29523
527,0.24771999999999997
528,0.38056999999999996
529,0.43216000000000004
530,0.36885999999999997
531,0.3053
532,0.49323
533,0.6360600000000001
534,0.73187
535,0.7096399999999999
536,0.65598
537,0.56202
538,0.46805
539,0.37408
540,0.28012
541,0.18615
542,0.44799999999999995
543,0.20272
544,0.070293
545,0.070293
546,0.070293
547,0.070293
548,0.070293
549,0.13017
550,0.11706
551,0.14378
552,0.10877
553,0.45145
554,0.49041
555,0.17805
556,0.20949
557,0.20949
558,0.20949
559,0.22971999999999998
560,0.29236
561,0.32334
562,0.33416
563,0.2402
564,0.14623
565,0.2484
566,0.10964000000000002
567,0.070293
568,0.070293
569,0.070293
570,0.070293
571,0.070293
572,0.070293
573,0.070293
574,0.32075
575,0.14965
576,0.18615
577,0.20949
578,0.20949
579,0.20178
580,0.18554
581,0.44493
582,-0.18433
583,-0.096358
584,-0.14511
585,-0.1762
586,-0.1762
587,-0.18100000000000002
588,-0.19021
589,-0.27446
590,-0.34862
591,-0.36336
592,-0.36904000000000003
593,-0.36904000000000003
594,-0.33837
595,-0.28805
596,-0.20146
597,-0.1762
598,-0.1762
599,-0.1762
600,-0.15282
601,-0.099391
602,-0.31661999999999996
603,-0.24445999999999998
604,-0.13474
605,-0.1762
606,-0.1762
607,-0.24386999999999998
608,-0.31078
609,-0.35315
610,-0.36904000000000003
611,-0.36904000000000003
612,-0.36904000000000003
613,-0.36904000000000003
614,-0.36904000000000003
615,-0.36904000000000003
616,-0.36904000000000003
617,-0.36904000000000003
618,-0.36904000000000003
619,-0.36904000000000003
620,-0.36904000000000003
621,-0.36904000000000003
622,-0.36904000000000003
623,-0.36904000000000003
624,-0.36904000000000003
625,-0.36904000000000003
626,-0.36904000000000003
627,-0.36904000000000003
628,-0.36904000000000003
629,-0.36904000000000003
630,0.8283
631,0.8283
632,0.8283
633,0.8283
634,0.8283
635,0.8283
636,0.8283
637,0.8283
638,0.8283
639,0.8283
640,0.8283
641,0.8283
642,0.8283
643,0.8283
644,0.8283
645,0.8283
646,0.8283
647,0.8283
648,0.8283
649,0.8283
650,0.84125
651,0.87577
652,0.93027
653,0.98539
654,0.98539
655,0.98539
656,0.98539
657,0.98539
658,0.98539
659,0.98539
660,0.98919
661,0.9959399999999999
662,1.0319
663,1.0599
664,1.0629
665,1.0472
666,1.0224
667,1.0314
668,1.0687
669,1.1513
670,1.258
671,1.3689
672,1.4492
673,1.5277
674,1.6042
675,1.6681
676,1.7237
677,1.7567
678,1.7708
679,1.7708
680,1.7392
681,1.6968
682,1.6345
683,1.5722
684,1.5105
685,1.4678
686,1.4116
687,1.3351
688,1.2836
689,1.2408
690,1.2025
691,1.1708
692,1.1461
693,1.1329
694,1.0989
695,0.98414
696,0.88815
697,0.8056
698,0.72875
699,0.6522100000000001
700,0.57567
701,0.49709
702,0.41608
703,0.30127
704,0.21206999999999998
705,0.16029000000000002
706,0.1357
707,0.11817000000000001
708,0.45786000000000004
709,0.20647
710,-0.17623
711,-0.1092
712,-0.19279000000000002
713,-0.3001
714,-0.39939
715,-0.49318999999999996
716,-0.55966
717,-0.61719
718,-0.65846
719,-0.75029
720,-0.86511
721,-0.9799200000000001
722,-1.0947
723,-1.2095
724,-1.3161
725,-1.4164
726,-1.4929
727,-1.5695
728,-1.646
729,-1.7226
730,-1.7944
731,-1.8515
732,-1.9031
733,-1.9511
734,-2.0267
735,-2.0905
736,-2.1288
737,-2.1472
738,-2.1563
739,-2.1563
740,-2.1601
741,-2.1692
742,-2.2013
743,-2.2279
744,-2.1911
745,-2.168
746,-2.1575
747,-2.1404
748,-2.1173
749,-2.079
750,-2.0407
751,-2.0025
752,-2.0002
753,-1.9899
754,-1.9629
755,-1.9402
756,-1.9196
757,-1.9046
758,-1.8626
759,-1.7861
760,-1.7096
761,-1.6286
762,-1.5258
763,-1.4167
764,-1.3018
765,-1.1931
766,-1.0932
767,-1.0167
768,-0.9842299999999999
769,-0.9782299999999999
770,-1.0034
771,-1.0334
772,-1.0717
773,-1.1057
774,-1.1353
775,-1.1353
776,-1.1043
777,-1.0353
778,-0.96016
779,-0.8836200000000001
780,-0.80708
781,-0.71062
782,-0.59731
783,-0.27454
784,0.062176999999999996
785,0.15685
786,0.23573000000000002
787,0.27851
788,0.26425
789,0.24124
790,0.20297
791,0.1647
792,0.12952
793,0.12427
794,0.14275
795,0.18927
796,0.24938000000000002
797,0.30848000000000003
798,0.3505
799,0.41158
800,0.48812
801,0.53508
802,0.584
803,0.64478
804,0.69927
805,0.74976
806,0.74976
807,0.74976
808,0.74976
809,0.77307
810,0.80529
811,0.8435600000000001
812,0.8762
813,0.9024700000000001
814,0.90685
815,0.90685
816,0.90685
817,0.92415
818,0.9549200000000001
819,0.99264
820,1.0408
821,1.1128
822,1.2351
823,1.3814
824,1.4196
825,1.4348
826,1.413
827,1.3789
828,1.3382
829,1.2789
830,1.1926
831,1.0771
832,0.92986
833,0.78897
834,0.69442
835,0.61019
836,0.53365
837,0.4754
838,0.43559
839,0.43559
840,0.38456999999999997
841,0.30892
842,0.26089
843,0.21673
844,0.17845
845,0.11964000000000001
846,0.20397
847,-0.1097
848,-0.20767
849,-0.2482
850,-0.23936
851,-0.21750999999999998
852,-0.17924
853,-0.14578
854,-0.11577
855,-0.1142
856,-0.12569
857,-0.16246
858,-0.21854
859,-0.28358
860,-0.34286
861,-0.39055
862,-0.42132
863,-0.42837
864,-0.42349
865,-0.38748
866,-0.35033000000000003
867,-0.31206
868,-0.27379000000000003
869,-0.23551999999999998
870,-0.19725
871,-0.15897999999999998
872,-0.12070999999999998
873,-0.18383
874,-0.26252
875,-0.36457
876,-0.4429
877,-0.5069100000000001
878,-0.5069100000000001
879,-0.5069100000000001
880,-0.5069100000000001
881,-0.45298
882,-0.38285
883,-0.30630999999999997
884,-0.22976999999999997
885,-0.15322
886,-0.41933000000000004
887,-0.10244
888,0.088911
889,0.17826
890,0.20077
891,0.085159
892,-0.25103000000000003
893,-0.15497
894,-0.17553
895,-0.14246
896,0.3076
897,0.16974
898,0.196
899,0.29355
900,0.41103999999999996
901,0.10955999999999999
902,0.12337999999999999
903,0.12713
904,0.16145
905,0.18358
906,0.15732000000000002
907,0.12368
908,0.41408999999999996
909,0.28519
910,0.19630999999999998
911,0.1813
912,0.25758000000000003
913,-0.14997
914,-0.34131999999999996
915,-0.48507
916,-0.11094000000000001
917,-0.12383
918,-0.13984000000000002
919,-0.17586
920,-0.19275
921,-0.19275
922,-0.22030999999999998
923,-0.24756
924,-0.26482
925,-0.27129000000000003
926,-0.27129000000000003
927,-0.27129000000000003
928,-0.27129000000000003
929,-0.27129000000000003
930,-0.27129000000000003
931,-0.27129000000000003
932,-0.27129000000000003
933,-0.26658000000000004
934,-0.25608000000000003
935,-0.22300999999999999
936,-0.18474000000000002
937,-0.14647000000000002
938,-0.47467
939,-0.13699
940,-0.17651
941,-0.084275
942,-0.20125
943,-0.3926
944,-0.1142
