time,value
0,1.8217
1,1.7775
2,1.6137
3,1.4366
4,1.2775
5,1.1118
6,0.9478
7,0.81394
8,0.61664
9,0.48367
10,0.3581
11,0.29493
12,0.1585
13,0.084867
14,-0.068701
15,-0.021353999999999998
16,-0.09523200000000001
17,-0.23439000000000002
18,-0.32945
19,-0.33169
20,-0.45361
21,-0.47647
22,-0.48413
23,-0.5794199999999999
24,-0.66662
25,-0.69058
26,-0.81361
27,-0.81494
28,-0.9190299999999999
29,-1.0132
30,-0.9776299999999999
31,-1.0478
32,-1.1645
33,-1.2076
34,-1.2939
35,-1.4186
36,-1.4392
37,-1.5078
38,-1.5457
39,-1.5105
40,-1.4531
41,-1.3754
42,-1.2794
43,-1.1676
44,-1.0225
45,-0.88887
46,-0.7449399999999999
47,-0.58186
48,-0.42456000000000005
49,-0.2546
50,-0.017778
51,0.15996
52,0.33778
53,0.52142
54,0.69913
55,0.883
56,1.0606
57,1.2447
58,1.4222
59,1.6064
60,1.7909
61,1.9757
62,2.1456
63,2.1277
64,1.8812
65,1.6992
66,1.5208
67,1.3392
68,1.1608
69,0.97964
70,0.80115
71,0.62052
72,0.44196
73,0.26341
74,0.083379
75,-0.09575499999999999
76,-0.27384000000000003
77,-0.44778
78,-0.60143
79,-0.6867800000000001
80,-0.81494
81,-0.92455
82,-1.0132
83,-1.1103
84,-1.1914
85,-1.2547
86,-1.2547
87,-1.2746
88,-1.2738
89,-1.2523
90,-1.1546
91,-1.0347
92,-0.96355
93,-0.92317
94,-0.86985
95,-0.8043600000000001
96,-0.78659
97,-0.69882
98,-0.60143
99,-0.49536
100,-0.43731000000000003
101,-0.42456000000000005
102,-0.34745
103,-0.26229
104,-0.16969
105,-0.16702
106,-0.11199
107,0.007151899999999999
108,0.047978
109,0.055986
110,0.11892
111,0.14438
112,0.22782
113,0.32153000000000004
114,0.34518000000000004
115,0.38061
116,0.44782
117,0.5596899999999999
118,0.69871
119,0.7147600000000001
120,0.92537
121,1.0156
122,1.1791
123,1.2237
124,1.2753
125,1.4524
126,1.5747
127,1.7586
