time,value
0,1.3049
1,1.3049
2,1.3049
3,1.3049
4,1.3049
5,1.3049
6,1.3049
7,1.3049
8,1.3049
9,1.3049
10,1.3049
11,1.3049
12,1.3049
13,1.3049
14,1.3049
15,1.3049
16,1.3049
17,1.3049
18,1.3049
19,1.3049
20,1.3049
21,1.3049
22,1.3049
23,1.3049
24,1.3047
25,1.3036
26,1.2967
27,1.2599
28,1.2343
29,1.26
30,1.2926
31,1.354
32,1.4252
33,1.5349
34,1.6477
35,1.7716
36,1.8841
37,1.9575
38,2.031
39,2.1045
40,2.1602
41,2.1635
42,2.1432
43,2.0576
44,1.9652
45,1.855
46,1.7358
47,1.5949
48,1.4436
49,1.2686
50,1.1039
51,0.9613200000000001
52,0.84146
53,0.7679699999999999
54,0.70554
55,0.6644100000000001
56,0.6431
57,0.65791
58,0.68077
59,0.7175199999999999
60,0.74468
61,0.7562
62,0.75115
63,0.72043
64,0.70216
65,0.70216
66,0.68704
67,0.65084
68,0.6016600000000001
69,0.5353
70,0.46578
71,0.39229
72,0.3113
73,0.22136
74,0.13116
75,0.040665
76,-0.022392
77,-0.055847
78,-0.072786
79,-0.072786
80,-0.072786
81,-0.072786
82,-0.072786
83,-0.072786
84,-0.061998000000000004
85,-0.041705
86,-0.012458
87,0.024288
88,0.057062
89,0.08667799999999999
90,0.099112
91,0.098563
92,0.076938
93,0.040193
94,-0.014825
95,-0.08228300000000001
96,-0.15341
97,-0.2269
98,-0.31127
99,-0.40231999999999996
100,-0.49856000000000006
101,-0.59783
102,-0.67196
103,-0.73229
104,-0.72872
105,-0.69198
106,-0.65523
107,-0.61848
108,-0.6008600000000001
109,-0.59208
110,-0.60431
111,-0.6257
112,-0.66847
113,-0.72002
114,-0.7874
115,-0.8609
116,-0.9343899999999999
117,-1.0079
118,-1.0814
119,-1.1549
120,-1.2284
121,-1.3018
122,-1.3559
123,-1.4041
124,-1.4433
125,-1.4801
126,-1.4976
127,-1.5102
128,-1.4784
129,-1.4362
130,-1.3682
131,-1.2947
132,-1.251
133,-1.2132
134,-1.2009
135,-1.1932
136,-1.2115
137,-1.234
138,-1.2828
139,-1.3355
140,-1.4149
141,-1.4977
142,-1.6027
143,-1.7102
144,-1.7867
145,-1.8602
146,-1.8728
147,-1.8805
148,-1.9057
149,-1.932
150,-1.9495
151,-1.9665
152,-1.9291
153,-1.8896
154,-1.7619
155,-1.632
156,-1.4126
157,-1.1922
158,-1.0819
159,-0.97321
160,-0.9836299999999999
161,-0.99651
162,-1.104
163,-1.2117
164,-1.3247
165,-1.4357
166,-1.5092
167,-1.5819
168,-1.6439
169,-1.6984
170,-1.6616
171,-1.6188
172,-1.5141
173,-1.406
174,-1.2684
175,-1.1296
176,-0.98265
177,-0.8428899999999999
178,-0.7529399999999999
179,-0.6765899999999999
180,-0.6842699999999999
181,-0.69653
182,-0.73437
183,-0.77808
184,-0.85157
185,-0.9306
186,-1.0354
187,-1.1318
188,-1.1927
189,-1.245
190,-1.2636
191,-1.2733
192,-1.2503
193,-1.2135
194,-1.1301
195,-1.0315
196,-0.8844799999999999
197,-0.7286100000000001
198,-0.5465300000000001
199,-0.37917
200,-0.25248000000000004
201,-0.13648
202,-0.048183
203,0.022393
204,0.049815
205,0.055077
206,0.0095564
207,-0.044121
208,-0.11542000000000001
209,-0.17534
210,-0.21209
211,-0.23778000000000002
212,-0.24216
213,-0.245
214,-0.245
215,-0.23795
216,-0.21875
217,-0.1881
218,-0.13874
219,-0.079916
220,-0.0064247
221,0.067066
222,0.14056
223,0.21405
224,0.28754
225,0.33554
226,0.3498
227,0.35774
228,0.35774
229,0.35774
230,0.35774
231,0.36236
232,0.37224
233,0.39503
234,0.43178
235,0.46852
236,0.50527
237,0.55896
238,0.62916
239,0.68712
240,0.73373
241,0.7751
242,0.81185
243,0.8187399999999999
244,0.80064
245,0.73123
246,0.6209899999999999
247,0.5113800000000001
248,0.40224
249,0.33525
250,0.29851
251,0.29830999999999996
252,0.32299
253,0.36966
254,0.43054
255,0.5210100000000001
256,0.6296
257,0.75555
258,0.89156
259,1.0053
260,1.1067
261,1.1656
262,1.2023
263,1.2159
264,1.2181
265,1.1423
266,1.0304
267,0.8941100000000001
268,0.7471300000000001
269,0.61065
270,0.47847
271,0.374
272,0.28021999999999997
273,0.23071999999999998
274,0.19727
275,0.21624000000000002
276,0.25299
277,0.31389
278,0.38245
279,0.45481000000000005
280,0.5283
281,0.6018
282,0.67529
283,0.69105
284,0.69214
285,0.57772
286,0.43622
287,0.32045
288,0.21020999999999998
289,0.07019
290,-0.075695
291,-0.17321
292,-0.26205
293,-0.33768000000000004
294,-0.41117
295,-0.45688
296,-0.49856000000000006
297,-0.49505
298,-0.48573
299,-0.45176000000000005
300,-0.41501000000000005
301,-0.37827
302,-0.34152
303,-0.27437
304,-0.20472
305,-0.13147
306,-0.057977999999999995
307,-0.0032313000000000003
308,0.050516000000000005
309,0.075244
310,0.098827
311,0.09301
312,0.08642799999999999
313,0.050065
314,0.013319
