time,value
0,-0.18994
1,-0.7279899999999999
2,-1.0695
3,-0.8034600000000001
4,0.25024
5,1.8917
6,3.591
7,4.7254
8,4.8802
9,4.0491
10,2.6244
11,1.1854
12,0.21131
13,-0.12333
14,0.02823
15,0.33366999999999997
16,0.49566000000000004
17,0.40295
18,0.14372000000000001
19,-0.099358
20,-0.18679
21,-0.1034
22,0.055989
23,0.16862
24,0.16882
25,0.078416
26,-0.026133999999999998
27,-0.076816
28,-0.059163
29,-0.013203
30,0.0037654000000000003
31,-0.039236
32,-0.12805
33,-0.21828000000000003
34,-0.26849
35,-0.266
36,-0.23051
37,-0.19621
38,-0.18782000000000001
39,-0.2074
40,-0.2388
41,-0.26219000000000003
42,-0.26703000000000005
43,-0.25714000000000004
44,-0.24503000000000003
45,-0.2452
46,-0.25354
47,-0.2673
48,-0.28017
49,-0.28475
50,-0.27701
51,-0.26089
52,-0.24491
53,-0.23631
54,-0.23885
55,-0.25101999999999997
56,-0.26696
57,-0.27819
58,-0.27963000000000005
59,-0.27154
60,-0.25899
61,-0.24959
62,-0.25055
63,-0.26497
64,-0.28925
65,-0.31587
66,-0.33726
67,-0.34972
68,-0.35355
69,-0.35407
70,-0.35738000000000003
71,-0.36641
72,-0.37901999999999997
73,-0.39002
74,-0.39441
75,-0.39
76,-0.37935
77,-0.3684
78,-0.36341
79,-0.36719
80,-0.37901
81,-0.39516999999999997
82,-0.41081999999999996
83,-0.42183999999999994
84,-0.42631
85,-0.4243
86,-0.41715
87,-0.40784000000000004
88,-0.40074
89,-0.40092
90,-0.41151000000000004
91,-0.43258
92,-0.45936000000000005
93,-0.48281999999999997
94,-0.49271000000000004
95,-0.48257
96,-0.45301
97,-0.4118
98,-0.37131
