time,value
0,1.7869
1,1.7869
2,1.7869
3,1.7869
4,1.7869
5,1.7869
6,1.7869
7,1.7869
8,1.7869
9,1.7869
10,1.7869
11,1.7869
12,1.7869
13,1.7869
14,1.7869
15,1.7869
16,1.7869
17,1.7869
18,1.7869
19,1.7869
20,1.7869
21,1.7694
22,1.7359
23,1.7005
24,1.6647
25,1.6288
26,1.6062
27,1.6033
28,1.6024
29,1.6024
30,1.6024
31,1.6024
32,1.6024
33,1.6024
34,1.6024
35,1.6024
36,1.6024
37,1.6024
38,1.6024
39,1.6024
40,1.6024
41,1.6024
42,1.6024
43,1.6024
44,1.6024
45,1.6024
46,1.6024
47,1.5647
48,1.5225
49,1.4747
50,1.4269
51,1.3791
52,1.3635
53,1.3564
54,1.3564
55,1.3564
56,1.3564
57,1.3564
58,1.3564
59,1.3564
60,1.3564
61,1.3564
62,1.3564
63,1.3564
64,1.3564
65,1.3564
66,1.3564
67,1.3564
68,1.3564
69,1.3564
70,1.3564
71,1.3564
72,1.3474
73,1.3198
74,1.2871
75,1.2512
76,1.2154
77,1.1777
78,1.1328
79,1.0865
80,1.0387
81,0.9909399999999999
82,0.94315
83,0.89536
84,0.8475799999999999
85,0.79979
86,0.752
87,0.70421
88,0.66476
89,0.62646
90,0.59062
91,0.55478
92,0.51894
93,0.4831
94,0.44726000000000005
95,0.41142
96,0.37558
97,0.33974
98,0.30989
99,0.28236
100,0.25845999999999997
101,0.23456999999999997
102,0.21066999999999997
103,0.18189
104,0.14997
105,0.11450999999999999
106,0.078672
107,0.042832
108,0.0069914
109,-0.028849
110,-0.064689
111,-0.10053
112,-0.13637
113,-0.17221
114,-0.20805
115,-0.24389
116,-0.27973000000000003
117,-0.31556999999999996
118,-0.35141
119,-0.38725
120,-0.42308999999999997
121,-0.45893
122,-0.49477
123,-0.52967
124,-0.5582600000000001
125,-0.58486
126,-0.6087600000000001
127,-0.63265
128,-0.65662
129,-0.68757
130,-0.72
131,-0.75584
132,-0.79168
133,-0.82752
134,-0.85725
135,-0.8853
136,-0.9091899999999999
137,-0.9330799999999999
138,-0.9569799999999999
139,-0.9757299999999999
140,-0.9926200000000001
141,-1.0046
142,-1.0165
143,-1.0285
144,-1.0404
145,-1.0524
146,-1.0643
147,-1.0763
148,-1.0882
149,-1.1001
150,-1.1121
151,-1.124
152,-1.136
153,-1.1479
154,-1.1574
155,-1.1632
156,-1.165
157,-1.165
158,-1.165
159,-1.1632
160,-1.1574
161,-1.1479
162,-1.136
163,-1.124
164,-1.1131
165,-1.1068
166,-1.1035
167,-1.1035
168,-1.1035
169,-1.1032
170,-1.0977
171,-1.09
172,-1.078
173,-1.0661
174,-1.0541
175,-1.0422
176,-1.0302
177,-1.0183
178,-1.0063
179,-0.99439
180,-0.98659
181,-0.9804799999999999
182,-0.9804799999999999
183,-0.9804799999999999
184,-0.9804799999999999
185,-0.9770700000000001
186,-0.9721799999999999
187,-0.96031
188,-0.9483600000000001
189,-0.9364100000000001
190,-0.9244700000000001
191,-0.9125200000000001
192,-0.9005700000000001
193,-0.8886299999999999
194,-0.8766799999999999
195,-0.8647299999999999
196,-0.8527899999999999
197,-0.8408399999999999
198,-0.82889
199,-0.81695
200,-0.80645
201,-0.79881
202,-0.79599
203,-0.79599
204,-0.79599
205,-0.7942
206,-0.78598
207,-0.76975
208,-0.74585
209,-0.72196
210,-0.6988300000000001
211,-0.68277
212,-0.6729999999999999
213,-0.6729999999999999
214,-0.6729999999999999
215,-0.6729999999999999
216,-0.6766399999999999
217,-0.6825899999999999
218,-0.6945399999999999
219,-0.70649
220,-0.71843
221,-0.72735
222,-0.73449
223,-0.73449
224,-0.73449
225,-0.73449
226,-0.7320300000000001
227,-0.72842
228,-0.71648
229,-0.70453
230,-0.69258
231,-0.6806399999999999
232,-0.66869
233,-0.65674
234,-0.64479
235,-0.63285
236,-0.6209
237,-0.60895
238,-0.59701
239,-0.58506
240,-0.57311
241,-0.56221
242,-0.55301
243,-0.55
244,-0.55
245,-0.55
246,-0.5493399999999999
247,-0.54679
248,-0.53904
249,-0.52709
250,-0.5151399999999999
251,-0.50353
252,-0.49393000000000004
253,-0.48851000000000006
254,-0.48851000000000006
255,-0.48851000000000006
256,-0.48846000000000006
257,-0.48631
258,-0.48106000000000004
259,-0.46912
260,-0.45716999999999997
261,-0.44522
262,-0.43504
263,-0.42701000000000006
264,-0.42701000000000006
265,-0.42701000000000006
266,-0.42701000000000006
267,-0.42563
268,-0.42308999999999997
269,-0.41115
270,-0.3992
271,-0.38725
272,-0.37531
273,-0.36336
274,-0.35141
275,-0.33947
276,-0.32752
277,-0.31632
278,-0.30574
279,-0.30401999999999996
280,-0.30401999999999996
281,-0.30401999999999996
282,-0.30401999999999996
283,-0.30401999999999996
284,-0.30401999999999996
285,-0.30401999999999996
286,-0.30401999999999996
287,-0.30401999999999996
288,-0.30401999999999996
289,-0.30401999999999996
290,-0.30401999999999996
291,-0.30401999999999996
292,-0.30416
293,-0.30495
294,-0.31106999999999996
295,-0.32300999999999996
296,-0.33496
297,-0.34691
298,-0.35885
299,-0.3708
300,-0.38275
301,-0.3947
302,-0.40664
303,-0.41822
304,-0.42701000000000006
305,-0.42701000000000006
306,-0.42701000000000006
307,-0.42701000000000006
308,-0.42717
309,-0.42877
310,-0.44072
311,-0.45266999999999996
312,-0.46461
313,-0.47656000000000004
314,-0.48851000000000006
