time,value
0,-0.5362899999999999
1,0.34539000000000003
2,0.63049
3,0.16695
4,-0.0085387
5,-0.058152999999999996
6,0.22616999999999998
7,0.0025049
8,0.42117
9,0.047088
10,0.06741
11,0.32914
12,0.021766
13,-0.67767
14,0.4107
15,-0.48028000000000004
16,-0.47918999999999995
17,-0.26585
18,-0.2159
19,0.08434900000000001
20,-0.070373
21,0.31648000000000004
22,0.30841999999999997
23,0.041464
24,-0.75062
25,-0.40016999999999997
26,-0.22896
27,-0.12917
28,0.34047
29,-0.19963
30,-0.30235
31,0.25782
32,0.45971000000000006
33,-0.040516
34,-0.14105
35,-0.011436
36,-0.24806999999999998
37,0.039766
38,-0.14107999999999998
39,0.33144
40,-0.041416
41,-0.5455
42,0.17561
43,-0.50757
44,-0.0091571
45,-0.24386
46,-0.28074
47,0.20101
48,-0.48413
49,0.27616
50,0.30234
51,0.031711
52,0.42807
53,-0.23342
54,-0.67367
55,0.07638400000000001
56,0.14475
57,-0.20475
58,0.1314
59,0.1551
60,-1.6038
61,-1.6038
62,-1.6038
63,-1.6038
64,-1.6038
65,-1.6038
66,-1.6038
67,-1.6038
68,1.5707
69,1.5707
70,1.5707
71,1.5707
72,1.5707
73,1.5707
74,1.5707
75,1.5707
76,-0.69045
77,-0.35818
78,-0.40802
79,-0.45111
80,0.55051
81,0.01671
82,1.5707
83,1.5707
84,1.5707
85,1.5707
86,1.5707
87,1.5707
88,1.5707
89,1.5707
90,1.5707
91,1.5707
92,1.5707
93,1.5707
94,1.5707
95,1.5707
96,1.5707
97,1.5707
98,-1.6038
99,-1.6038
100,-1.6038
101,-1.6038
102,-1.6038
103,-1.6038
104,-1.6038
105,-1.6038
106,-1.6038
107,-1.6038
108,-1.6038
109,-1.6038
110,-1.6038
111,-1.6038
112,-1.6038
113,0.10901
114,0.18547
115,0.13567
116,-0.077252
117,0.06706799999999999
118,0.5292600000000001
119,0.51902
120,0.6616
121,-0.29591
122,0.1831
123,-0.049765
124,0.18359
125,0.18845
126,0.007603
127,0.022255
