time,value
0,0.39681
1,1.49
2,2.6273
3,3.5647
4,4.0819
5,4.0493
6,3.4704
7,2.4853
8,1.3284
9,0.25995
10,-0.50965
11,-0.8744200000000001
12,-0.8515799999999999
13,-0.56126
14,-0.17502
15,0.14468
16,0.29603
17,0.25925
18,0.08748600000000001
19,-0.12649000000000002
20,-0.29285
21,-0.35553
22,-0.3095
23,-0.1932
24,-0.06653400000000001
25,0.016836
26,0.0313
27,-0.016125999999999998
28,-0.093441
29,-0.16116
30,-0.18932000000000002
31,-0.16891
32,-0.11313
33,-0.049094
34,-0.0052031
35,0.0005881
36,-0.033365
37,-0.09351799999999999
38,-0.1579
39,-0.20503000000000002
40,-0.22127
41,-0.20439000000000002
42,-0.16254000000000002
43,-0.11005
44,-0.062054
45,-0.029898
46,-0.018609
47,-0.026639
48,-0.048045
49,-0.072522
50,-0.091191
51,-0.098039
52,-0.09169
53,-0.07605
54,-0.05335499999999999
55,-0.033234
56,-0.024926
57,-0.03374
58,-0.05774
59,-0.087603
60,-0.10949
61,-0.10832
62,-0.072673
63,0.002763
64,0.11356
65,0.2459
66,0.37942
67,0.49086
68,0.56057
69,0.57393
70,0.52477
71,0.41586999999999996
72,0.25821
73,0.068897
74,-0.13338
75,-0.33075
76,-0.5088600000000001
77,-0.6573399999999999
78,-0.7710899999999999
79,-0.85025
80,-0.89869
81,-0.92299
82,-0.9293799999999999
83,-0.92475
84,-0.91538
85,-0.9064200000000001
86,-0.9016299999999999
87,-0.9022899999999999
88,-0.9089
89,-0.9205200000000001
90,-0.93499
91,-0.9486700000000001
92,-0.95742
93,-0.9583
94,-0.94996
95,-0.9335100000000001
96,-0.91106
97,-0.8867299999999999
98,-0.8653700000000001
