time,value
0,0.34797
1,0.52522
2,-0.14342
3,-0.19416
4,0.34397
5,-0.10890999999999999
6,-0.5173300000000001
7,-0.46911
8,0.15909
9,-0.31403000000000003
10,0.047721
11,0.41807
12,0.35441
13,-0.25666
14,-0.10608
15,0.36916
16,0.53685
17,0.54888
18,-0.089135
19,-0.30022
20,0.043794
21,0.18681
22,0.1581
23,-0.16697
24,0.30501999999999996
25,0.13928
26,-0.1661
27,-0.79243
28,-0.24384
29,-0.11462
30,0.38848
31,0.04671
32,-0.058960000000000005
33,-0.16610999999999998
34,0.018038
35,-0.23109000000000002
36,0.077194
37,-0.2263
38,0.21733000000000002
39,-0.088422
40,0.082362
41,0.10375
42,0.12918
43,0.033405000000000004
44,-0.13524
45,0.031194
46,-0.21397
47,-0.1822
48,-0.039385
49,-0.165
50,0.062984
51,-0.17335
52,0.31786
53,0.30605
54,-0.37849
55,0.09438400000000001
56,-0.084633
57,0.0050982
58,-0.091495
59,-0.27343
60,0.057752
61,1.5206
62,1.5206
63,1.5206
64,1.5206
65,1.5206
66,1.5206
67,1.5206
68,1.5206
69,1.5206
70,1.5206
71,1.5206
72,1.5206
73,-1.5364
74,-1.5364
75,-1.5364
76,-1.5364
77,-1.5364
78,-1.5364
79,-1.5364
80,-1.5364
81,-1.5364
82,-1.5364
83,-1.5364
84,-1.5364
85,-0.20387
86,-0.36211
87,0.37997
88,-0.09858099999999999
89,-0.26194
90,-0.30063
91,-0.20085
92,0.41793
93,1.5206
94,1.5206
95,1.5206
96,1.5206
97,1.5206
98,1.5206
99,1.5206
100,1.5206
101,1.5206
102,1.5206
103,1.5206
104,1.5206
105,1.5206
106,1.5206
107,-1.5364
108,-1.5364
109,-1.5364
110,-1.5364
111,-1.5364
112,-1.5364
113,-1.5364
114,-1.5364
115,-1.5364
116,-1.5364
117,-1.5364
118,-1.5364
119,-1.5364
120,-1.5364
121,0.10486
122,-0.19584000000000001
123,0.06661900000000001
124,0.09946
125,0.57181
126,0.29191
127,0.13642
