time,value
0,0.56805
1,-0.3426
2,0.53986
3,0.08592799999999999
4,-0.11737
5,-0.14013
6,-0.16036
7,0.5018600000000001
8,0.08511
9,-0.312
10,-0.33281
11,0.040005
12,0.099256
13,-0.24331999999999998
14,-0.27808
15,-0.36219
16,0.24336
17,0.17855
18,-0.7510600000000001
19,0.41528000000000004
20,-0.19129000000000002
21,0.13024000000000002
22,-0.20310999999999998
23,-0.31661999999999996
24,-0.45601
25,-0.047464
26,0.48572
27,-0.48922
28,-0.2785
29,0.091671
30,0.0047293
31,-0.29944
32,0.39934000000000003
33,0.13017
34,-0.31123
35,0.33424
36,0.2431
37,-1.6855
38,-1.6855
39,-1.6855
40,-1.6855
41,-1.6855
42,-1.6855
43,-1.6855
44,-1.6855
45,-1.6855
46,1.7772
47,1.7772
48,1.7772
49,1.7772
50,1.7772
51,1.7772
52,1.7772
53,1.7772
54,1.7772
55,-0.079466
56,0.026475
57,-0.15104
58,0.47817
59,-0.18094000000000002
60,0.13856
61,0.02102
62,0.028516000000000003
63,-0.037293
64,0.57276
65,-0.2622
66,-0.23078
67,-0.33484
68,-1.6855
69,-1.6855
70,-1.6855
71,-1.6855
72,-1.6855
73,-1.6855
74,-1.6855
75,-1.6855
76,-1.6855
77,-1.6855
78,-1.6855
79,1.7772
80,1.7772
81,1.7772
82,1.7772
83,1.7772
84,1.7772
85,1.7772
86,1.7772
87,1.7772
88,1.7772
89,-0.17378
90,-0.18359
91,-0.32199
92,0.40145
93,0.60136
94,-0.39997
95,0.06729500000000001
96,-0.40574
97,0.0035811
98,0.21639
99,0.0094974
100,0.38022
101,0.14001
102,0.35026
103,0.037264
104,0.4004
105,-0.30604000000000003
106,-0.1632
107,-0.29401
108,-0.15665
109,0.34826999999999997
110,-0.28738
111,0.44876000000000005
112,0.38218
113,0.043443999999999997
114,-0.09751900000000001
115,0.6876800000000001
116,-0.7167600000000001
117,-0.86698
118,0.25364000000000003
119,0.2766
120,0.059685
121,-0.6836
122,-0.16099000000000002
123,0.22646999999999998
124,-0.24081999999999998
125,0.74461
126,0.18461
127,0.20422
