time,value
0,-1.9862
1,-1.9862
2,-1.9862
3,-1.9862
4,-1.9862
5,-1.9862
6,-1.9862
7,-1.9862
8,-1.9862
9,-1.9862
10,-1.9862
11,-1.9862
12,-1.9862
13,-1.9862
14,-1.9862
15,-1.9862
16,-1.9862
17,-1.9862
18,-1.9239
19,-1.8244
20,-1.6924
21,-1.6269999999999998
22,-1.5953
23,-1.5953
24,-1.5953
25,-1.5953
26,-1.5953
27,-1.5953
28,-1.5953
29,-1.5953
30,-1.5953
31,-1.5953
32,-1.5953
33,-1.5953
34,-1.5953
35,-1.5771
36,-1.5347
37,-1.4036
38,-1.2717
39,-1.1397
40,-1.0077
41,-0.89413
42,-0.8135399999999999
43,-0.8135399999999999
44,-0.8135399999999999
45,-0.8135399999999999
46,-0.8135399999999999
47,-0.80224
48,-0.73387
49,-0.60205
50,-0.47507
51,-0.42265
52,-0.42265
53,-0.42265
54,-0.42265
55,-0.42265
56,-0.42265
57,-0.32192
58,-0.19608
59,-0.064126
60,-0.040393
61,-0.031758999999999996
62,-0.031758999999999996
63,-0.031758999999999996
64,-0.031758999999999996
65,-0.031758999999999996
66,-0.031758999999999996
67,-0.031758999999999996
68,-0.031758999999999996
69,-0.031758999999999996
70,-0.031758999999999996
71,-0.031758999999999996
72,-0.031758999999999996
73,-0.031758999999999996
74,-0.031758999999999996
75,-0.031758999999999996
76,-0.031758999999999996
77,-0.031758999999999996
78,-0.031758999999999996
79,-0.031758999999999996
80,-0.031758999999999996
81,-0.031758999999999996
82,-0.031758999999999996
83,-0.031758999999999996
84,-0.031758999999999996
85,-0.031758999999999996
86,-0.031758999999999996
87,-0.031758999999999996
88,-0.026277
89,0.013559
90,0.11763
91,0.24126999999999998
92,0.34086
93,0.35913
94,0.35913
95,0.35913
96,0.35913
97,0.35913
98,0.35913
99,0.35913
100,0.36525
101,0.39648
102,0.5284399999999999
103,0.65857
104,0.75002
105,0.75002
106,0.75002
107,0.80245
108,0.92942
109,1.0612
110,1.0659999999999998
111,0.95667
112,0.8247200000000001
113,0.69276
114,0.5608
115,0.42885
116,0.37746999999999997
117,0.35913
118,0.35913
119,0.27271999999999996
120,0.15995
121,0.027995
122,-0.10396
123,-0.23592
124,-0.35731999999999997
125,-0.40712
126,-0.42265
127,-0.42265
128,-0.42265
129,-0.42265
130,-0.42265
131,-0.42265
132,-0.42265
133,-0.3936
134,-0.33053
135,-0.19857
136,-0.034957
137,0.16244
138,0.42636
139,0.62531
140,0.75002
141,0.75002
142,0.75002
143,0.75002
144,0.75002
145,0.75002
146,0.75002
147,0.74632
148,0.7015100000000001
149,0.51599
150,0.25206999999999996
151,-0.011840999999999999
152,-0.27575
153,-0.53487
154,-0.78385
155,-0.8135399999999999
156,-0.8135399999999999
157,-0.8135399999999999
158,-0.8135399999999999
159,-0.8135399999999999
160,-0.8135399999999999
161,-0.8135399999999999
162,-0.8135399999999999
163,-0.75772
164,-0.52368
165,-0.2658
166,-0.041077999999999996
167,0.11329000000000002
168,0.24709
169,0.37905
170,0.5110100000000001
171,0.6429600000000001
172,0.66208
173,0.59317
174,0.46121
175,0.32926
176,0.1973
177,0.065341
178,-0.066616
179,-0.19857
180,-0.33053
181,-0.3247
182,-0.25085999999999997
183,-0.1189
184,0.013056
185,0.14501
186,0.27697
187,0.40893
188,0.54088
189,0.6883699999999999
190,0.87013
191,1.1235
192,1.3509
193,1.5302
194,1.5318
195,1.551
196,1.5965
197,1.7285
198,1.8238
199,1.8530000000000002
200,1.7209999999999999
201,1.6205
202,1.6065
203,1.7385
204,1.8478
205,1.8430000000000002
206,1.7113
207,1.5893
208,1.6165
209,1.7484
210,1.8804
211,1.8294
212,1.7011
213,1.5692
214,1.5379
215,1.5318
216,1.5318
217,1.5318
218,1.5318
219,1.5387
220,1.6457
221,1.7683
222,1.882
223,1.9144
224,1.9227
225,1.9227
226,1.9227
227,1.9227
228,1.9227
229,1.9227
230,1.9227
231,1.8809
232,1.7982
233,1.6663
234,1.5343
235,1.4023
236,1.2704
237,1.1384
238,1.0065
239,0.87451
240,0.74255
241,0.6106
242,0.47951000000000005
243,0.39486
244,0.35913
245,0.35913
246,0.35913
247,0.35913
248,0.35913
249,0.35913
250,0.35913
251,0.35913
252,0.35913
253,0.35913
254,0.35913
255,0.35913
256,0.35913
257,0.35301
258,0.32179
259,0.18983
260,0.057872
261,-0.074085
262,-0.20604
263,-0.33799999999999997
264,-0.41753
265,-0.42251000000000005
266,-0.42265
267,-0.42265
268,-0.42265
269,-0.42265
270,-0.42265
271,-0.42265
272,-0.42265
273,-0.5032399999999999
274,-0.61685
275,-0.7488100000000001
276,-0.70794
277,-0.61436
278,-0.48405
279,-0.53135
280,-0.6268100000000001
281,-0.73766
282,-0.70529
283,-0.6044
284,-0.49095
285,-0.43368
286,-0.42265
287,-0.42265
288,-0.42265
289,-0.42265
290,-0.42265
291,-0.42265
292,-0.42265
293,-0.42265
294,-0.42265
295,-0.42265
296,-0.45513000000000003
297,-0.52473
298,-0.65669
299,-0.7256
300,-0.70648
301,-0.57453
302,-0.44256999999999996
303,-0.31061
304,-0.1805
305,-0.07095599999999999
306,-0.031758999999999996
307,-0.031758999999999996
308,-0.031758999999999996
309,-0.031758999999999996
310,-0.031758999999999996
311,-0.031758999999999996
312,-0.031758999999999996
313,-0.031758999999999996
314,-0.031758999999999996
