time,value
0,-1.6169
1,0.6176
2,0.6176
3,-1.6169
4,0.6176
5,0.6176
6,-1.6169
7,0.6176
8,0.6176
9,0.6176
10,-1.6169
11,0.6176
12,0.6176
13,-1.6169
14,0.6176
15,0.6176
16,0.6176
17,-1.6169
18,0.6176
19,0.6176
20,-1.6169
21,0.6176
22,0.6176
23,-1.6169
24,0.6176
25,0.6176
26,0.6176
27,-1.6169
28,0.6176
29,0.6176
30,0.6176
31,-1.6169
32,0.6176
33,0.6176
34,-1.6169
35,0.6176
36,0.6176
37,-1.6169
38,0.6176
39,0.6176
40,0.6176
41,-1.6169
42,0.6176
43,0.6176
44,-1.6169
45,0.6176
46,0.6176
47,0.6176
48,-1.6169
49,0.6176
50,0.6176
51,-1.6169
52,0.6176
53,0.6176
54,0.6176
55,-1.6169
56,0.6176
57,0.6176
58,-1.6169
59,0.6176
60,0.6176
61,0.6176
62,-1.6169
63,0.6176
64,0.6176
65,-1.6169
66,0.6176
67,0.6176
68,0.6176
69,-1.6169
70,0.6176
71,0.6176
72,0.6176
73,-1.6169
74,0.6176
75,0.6176
76,-1.6169
77,0.6176
78,0.6176
79,0.6176
80,-1.6169
81,0.6176
82,0.6176
83,0.6176
84,-1.6169
85,0.6176
86,0.6176
87,0.6176
88,-1.6169
89,0.6176
90,0.6176
91,-1.6169
92,0.6176
93,0.6176
94,0.6176
95,-1.6169
96,0.6176
97,0.6176
98,0.6176
99,-1.6169
100,0.6176
101,0.6176
102,-1.6169
103,0.6176
104,0.6176
105,0.6176
106,-1.6169
107,0.6176
108,0.6176
109,0.6176
110,-1.6169
111,0.6176
112,0.6176
113,-1.6169
114,0.6176
115,0.6176
116,0.6176
117,-1.6169
118,0.6176
119,0.6176
120,0.6176
121,-1.6169
122,0.6176
123,0.6176
124,-1.6169
125,0.6176
126,0.6176
127,0.6176
128,-1.6169
129,0.6176
130,0.6176
131,0.6176
132,-1.6169
133,0.6176
134,0.6176
135,-1.6169
136,0.6176
137,0.6176
138,0.6176
139,-1.6169
140,0.6176
141,0.6176
142,0.6176
143,-1.6169
144,0.6176
145,0.6176
146,0.6176
147,-1.6169
148,0.6176
149,0.6176
150,0.6176
151,-1.6169
152,0.6176
153,0.6176
154,0.6176
155,-1.6169
156,0.6176
157,0.6176
158,0.6176
159,-1.6169
160,0.6176
161,0.6176
162,0.6176
163,-1.6169
164,0.6176
165,0.6176
166,-1.6169
167,0.6176
168,0.6176
169,0.6176
170,-1.6169
171,0.6176
172,0.6176
173,0.6176
174,-1.6169
175,0.6176
176,0.6176
177,-1.6169
178,0.6176
179,0.6176
180,0.6176
181,-1.6169
182,0.6176
183,0.6176
184,-1.6169
185,0.6176
186,0.6176
187,0.6176
188,-1.6169
189,0.6176
190,0.6176
191,0.6176
192,-1.6169
193,0.6176
194,0.6176
195,-1.6169
196,0.6176
197,0.6176
198,0.6176
199,-1.6169
200,0.6176
201,0.6176
202,-1.6169
203,0.6176
204,0.6176
205,-1.6169
206,0.6176
207,0.6176
208,0.6176
209,-1.6169
210,0.6176
211,0.6176
212,-1.6169
213,0.6176
214,0.6176
215,0.6176
216,-1.6169
217,0.6176
218,0.6176
219,-1.6169
220,0.6176
221,0.6176
222,-1.6169
223,0.6176
224,0.6176
225,0.6176
226,-1.6169
227,0.6176
228,0.6176
229,-1.6169
230,0.6176
231,0.6176
232,0.6176
233,-1.6169
234,0.6176
235,0.6176
236,0.6176
237,-1.6169
238,0.6176
239,0.6176
240,-1.6169
241,0.6176
242,0.6176
243,0.6176
244,-1.6169
245,0.6176
246,0.6176
247,-1.6169
248,0.6176
249,0.6176
250,0.6176
251,-1.6169
252,0.6176
253,0.6176
254,0.6176
255,-1.6169
256,0.6176
257,0.6176
258,-1.6169
259,0.6176
260,0.6176
261,0.6176
262,-1.6169
263,0.6176
264,0.6176
265,-1.6169
266,0.6176
267,0.6176
268,0.6176
269,-1.6169
270,0.6176
271,0.6176
272,-1.6169
273,0.6176
274,0.6176
275,0.6176
276,-1.6169
277,0.6176
278,0.6176
279,-1.6169
280,0.6176
281,0.6176
282,0.6176
283,-1.6169
284,0.6176
285,0.6176
286,0.6176
287,-1.6169
288,0.6176
289,0.6176
290,0.6176
291,-1.6169
292,0.6176
293,0.6176
294,-1.6169
295,0.6176
296,0.6176
297,0.6176
298,-1.6169
299,0.6176
300,0.6176
301,0.6176
302,-1.6169
303,0.6176
304,0.6176
305,-1.6169
306,0.6176
307,0.6176
308,0.6176
309,-1.6169
310,0.6176
311,0.6176
312,0.6176
313,-1.6169
314,0.6176
315,0.6176
316,-1.6169
317,0.6176
318,0.6176
319,-1.6169
320,0.6176
321,0.6176
322,0.6176
323,-1.6169
324,0.6176
325,0.6176
326,-1.6169
327,0.6176
328,0.6176
329,0.6176
330,-1.6169
331,0.6176
332,0.6176
333,0.6176
334,-1.6169
335,0.6176
336,0.6176
337,-1.6169
338,0.6176
339,0.6176
340,0.6176
341,-1.6169
342,0.6176
343,0.6176
344,-1.6169
345,0.6176
346,0.6176
347,0.6176
348,-1.6169
349,0.6176
350,0.6176
351,-1.6169
352,0.6176
353,0.6176
354,0.6176
355,-1.6169
356,0.6176
357,0.6176
358,-1.6169
359,0.6176
360,0.6176
361,0.6176
362,-1.6169
363,0.6176
364,0.6176
365,0.6176
366,-1.6169
367,0.6176
368,0.6176
369,0.6176
370,-1.6169
371,0.6176
372,0.6176
373,-1.6169
374,0.6176
375,0.6176
376,0.6176
377,-1.6169
378,0.6176
379,0.6176
380,0.6176
381,-1.6169
382,0.6176
383,0.6176
384,-1.6169
385,0.6176
386,0.6176
387,0.6176
388,-1.6169
389,0.6176
390,0.6176
391,0.6176
392,-1.6169
393,0.6176
394,0.6176
395,0.6176
396,-1.6169
397,0.6176
398,0.6176
399,0.6176
400,-1.6169
401,0.6176
402,0.6176
403,0.6176
404,-1.6169
405,0.6176
406,0.6176
407,0.6176
408,-1.6169
409,0.6176
410,0.6176
411,0.6176
412,-1.6169
413,0.6176
414,0.6176
415,0.6176
416,-1.6169
417,0.6176
418,0.6176
419,0.6176
420,-1.6169
421,0.6176
422,0.6176
423,0.6176
424,-1.6169
425,0.6176
426,0.6176
427,-1.6169
428,0.6176
429,0.6176
430,0.6176
431,-1.6169
432,0.6176
433,0.6176
434,0.6176
435,-1.6169
436,0.6176
437,0.6176
438,-1.6169
439,0.6176
440,0.6176
441,0.6176
442,-1.6169
443,0.6176
444,0.6176
445,0.6176
446,-1.6169
447,0.6176
448,0.6176
449,-1.6169
450,0.6176
451,0.6176
452,0.6176
453,-1.6169
454,0.6176
455,0.6176
456,0.6176
457,-1.6169
458,0.6176
459,0.6176
460,-1.6169
461,0.6176
462,0.6176
463,0.6176
464,-1.6169
465,0.6176
466,0.6176
467,0.6176
468,-1.6169
469,0.6176
470,0.6176
471,-1.6169
472,0.6176
473,0.6176
474,0.6176
475,-1.6169
476,0.6176
477,0.6176
478,-1.6169
479,0.6176
480,0.6176
481,0.6176
482,-1.6169
483,0.6176
484,0.6176
485,-1.6169
486,0.6176
487,0.6176
488,0.6176
489,-1.6169
490,0.6176
491,0.6176
492,-1.6169
493,0.6176
494,0.6176
495,0.6176
496,-1.6169
497,0.6176
498,0.6176
499,-1.6169
500,0.6176
501,0.6176
502,-1.6169
503,0.6176
504,0.6176
505,-1.6169
506,0.6176
507,0.6176
508,0.6176
509,-1.6169
510,0.6176
511,0.6176
512,-1.6169
513,0.6176
514,0.6176
515,-1.6169
516,0.6176
517,0.6176
518,-1.6169
519,0.6176
520,0.6176
521,0.6176
522,-1.6169
523,0.6176
524,0.6176
525,-1.6169
526,0.6176
527,0.6176
528,0.6176
529,-1.6169
530,0.6176
531,0.6176
532,-1.6169
533,0.6176
534,0.6176
535,0.6176
536,-1.6169
537,0.6176
538,0.6176
539,-1.6169
540,0.6176
541,0.6176
542,0.6176
543,-1.6169
544,0.6176
545,0.6176
546,-1.6169
547,0.6176
548,0.6176
549,0.6176
550,-1.6169
551,0.6176
552,0.6176
553,-1.6169
554,0.6176
555,0.6176
556,0.6176
557,-1.6169
558,0.6176
559,0.6176
560,-1.6169
561,0.6176
562,0.6176
563,0.6176
564,-1.6169
565,0.6176
566,0.6176
567,0.6176
568,-1.6169
569,0.6176
570,0.6176
571,-1.6169
572,0.6176
573,0.6176
574,0.6176
575,-1.6169
576,0.6176
577,0.6176
578,-1.6169
579,0.6176
580,0.6176
581,0.6176
582,-1.6169
583,0.6176
584,0.6176
585,0.6176
586,-1.6169
587,0.6176
588,0.6176
589,0.6176
590,-1.6169
591,0.6176
592,0.6176
593,-1.6169
594,0.6176
595,0.6176
596,0.6176
597,-1.6169
598,0.6176
599,0.6176
600,0.6176
601,-1.6169
602,0.6176
603,0.6176
604,-1.6169
605,0.6176
606,0.6176
607,0.6176
608,-1.6169
609,0.6176
610,0.6176
611,0.6176
612,-1.6169
613,0.6176
614,0.6176
615,0.6176
616,-1.6169
617,0.6176
618,0.6176
619,0.6176
620,-1.6169
621,0.6176
622,0.6176
623,0.6176
624,-1.6169
625,0.6176
626,0.6176
627,-1.6169
628,0.6176
629,0.6176
630,0.6176
631,-1.6169
632,0.6176
633,0.6176
634,0.6176
635,-1.6169
636,0.6176
637,0.6176
638,0.6176
639,-1.6169
640,0.6176
641,0.6176
642,-1.6169
643,0.6176
644,0.6176
645,0.6176
646,-1.6169
647,0.6176
648,0.6176
649,-1.6169
650,0.6176
651,0.6176
652,0.6176
653,-1.6169
654,0.6176
655,0.6176
656,0.6176
657,-1.6169
658,0.6176
659,0.6176
660,-1.6169
661,0.6176
662,0.6176
663,0.6176
664,-1.6169
665,0.6176
666,0.6176
667,0.6176
668,-1.6169
669,0.6176
670,0.6176
671,0.6176
672,-1.6169
673,0.6176
674,0.6176
675,0.6176
676,-1.6169
677,0.6176
678,0.6176
679,-1.6169
680,0.6176
681,0.6176
682,0.6176
683,-1.6169
684,0.6176
685,0.6176
686,0.6176
687,-1.6169
688,0.6176
689,0.6176
690,0.6176
691,-1.6169
692,0.6176
693,0.6176
694,0.6176
695,-1.6169
696,0.6176
697,0.6176
698,0.6176
699,-1.6169
700,0.6176
701,0.6176
702,0.6176
703,-1.6169
704,0.6176
705,0.6176
706,0.6176
707,-1.6169
708,0.6176
709,0.6176
710,0.6176
711,-1.6169
712,0.6176
713,0.6176
714,0.6176
715,-1.6169
716,0.6176
717,0.6176
718,-1.6169
719,0.6176
