time,value
0,0.75776
1,0.75776
2,0.75776
3,0.75776
4,0.75776
5,0.75776
6,0.75776
7,0.75776
8,0.75776
9,0.75776
10,0.75776
11,0.75776
12,0.75776
13,0.75776
14,0.75776
15,0.75776
16,0.75776
17,0.75776
18,0.75776
19,0.75776
20,0.75776
21,0.75776
22,0.75776
23,0.75776
24,0.75776
25,0.75776
26,0.75776
27,0.75776
28,0.75776
29,0.75776
30,0.75776
31,0.75776
32,0.75776
33,0.75776
34,0.75776
35,0.75776
36,0.75776
37,0.75776
38,0.75776
39,0.75776
40,0.74783
41,0.71441
42,0.66263
43,0.6108600000000001
44,0.55908
45,0.5073
46,0.45552
47,0.40375
48,0.35197
49,0.30019
50,0.24841
51,0.20861999999999997
52,0.19061
53,0.19061
54,0.19005
55,0.17199
56,0.1268
57,0.075018
58,0.02324
59,-0.028538
60,-0.080315
61,-0.13209
62,-0.17012
63,-0.18748
64,-0.18748
65,-0.18748
66,-0.18748
67,-0.18748
68,-0.18748
69,-0.18748
70,-0.18748
71,-0.18748
72,-0.18748
73,-0.18748
74,-0.18748
75,-0.18748
76,-0.18748
77,-0.16338
78,-0.11885
79,-0.06707
80,-0.015291999999999998
81,0.036485000000000004
82,0.088263
83,0.14004
84,0.15893
85,0.13763
86,0.085855
87,0.034076999999999996
88,0.008715100000000002
89,0.0015655999999999999
90,0.0015655999999999999
91,-0.005489899999999999
92,-0.035762
93,-0.08753999999999999
94,-0.13932
95,-0.1911
96,-0.24286999999999997
97,-0.29465
98,-0.34643
99,-0.39821
100,-0.44998
101,-0.50176
102,-0.56012
103,-0.64562
104,-0.74861
105,-0.85216
106,-0.9557200000000001
107,-1.0593
108,-1.1628
109,-1.2664
110,-1.4001
111,-1.5494
112,-1.7047
113,-1.8484
114,-1.929
115,-1.9828
116,-2.0346
117,-2.0864
118,-2.1382
119,-2.19
120,-2.2417
121,-2.2618
122,-2.267
123,-2.267
124,-2.267
125,-2.267
126,-2.267
127,-2.267
128,-2.2486
129,-2.2044
130,-2.1526
131,-2.1008
132,-2.0491
133,-1.9973
134,-1.9455
135,-1.8972
136,-1.89
137,-1.8889
138,-1.8889
139,-1.8889
140,-1.8889
141,-1.8889
142,-1.8889
143,-1.8552
144,-1.8058
145,-1.7541
146,-1.7042
147,-1.7006
148,-1.6999
149,-1.6999
150,-1.6999
151,-1.6999
152,-1.6999
153,-1.6999
154,-1.6311
155,-1.5289
156,-1.4253
157,-1.3218
158,-1.2182
159,-1.1147
160,-1.0105
161,-0.88949
162,-0.73416
163,-0.5788300000000001
164,-0.4214
165,-0.23204
166,-0.024925
167,0.18083
168,0.38072
169,0.48804
170,0.59159
171,0.6975899999999999
172,0.81917
173,0.9745
174,1.1298
175,1.2702
176,1.3249
177,1.3249
178,1.3206
179,1.2917
180,1.0985
181,0.8914200000000001
182,0.68826
183,0.50008
184,0.34474
185,0.18941
186,0.049279
187,-0.039375
188,-0.091153
189,-0.14056
190,-0.17065999999999998
191,-0.12847999999999998
192,-0.076703
193,-0.035273
194,-0.023721000000000003
195,-0.075499
196,-0.12728
197,-0.16912
198,-0.18748
199,-0.18748
200,-0.1885
201,-0.20295
202,-0.24889
203,-0.30067
204,-0.34021999999999997
205,-0.34884
206,-0.29706
207,-0.24528000000000003
208,-0.20549
209,-0.18748
210,-0.18748
211,-0.18635
212,-0.15023
213,-0.059845
214,0.04371
215,0.14727
216,0.25082
217,0.35438000000000003
218,0.45793
219,0.57524
220,0.71321
221,0.86854
222,1.0239
223,1.1577
224,1.2683
225,1.3719
226,1.4826
227,1.6115
228,1.7668
229,1.9222
230,2.0469999999999997
231,2.1317
232,2.1835
233,2.2352
234,2.2147
235,2.1329
236,2.0293
237,1.9185
238,1.7873
239,1.632
240,1.4766
241,1.3377
242,1.2189
243,1.1154
244,1.0118
245,0.90828
246,0.80472
247,0.70117
248,0.5976100000000001
249,0.49406000000000005
250,0.3905
251,0.28695
252,0.21811999999999998
253,0.19061
254,0.19061
255,0.19061
256,0.19061
257,0.19061
258,0.19061
259,0.19061
260,0.19061
261,0.19061
262,0.19061
263,0.20861999999999997
264,0.24841
265,0.30019
266,0.35197
267,0.37355
268,0.37966
269,0.37966
270,0.37966
271,0.37966
272,0.37966
273,0.37966
274,0.37966
275,0.37966
276,0.37966
277,0.37966
278,0.37966
279,0.37966
280,0.37966
281,0.37966
282,0.37966
283,0.37966
284,0.37966
285,0.37966
286,0.37966
287,0.37966
288,0.37966
289,0.37966
290,0.37966
291,0.37966
292,0.37966
293,0.37966
294,0.37966
295,0.37966
296,0.39789
297,0.44469
298,0.49646
299,0.54824
300,0.49876000000000004
301,0.40254
302,0.29899000000000003
303,0.19919
304,0.19197
305,0.19061
306,0.19061
307,0.15513
308,0.055751999999999996
309,-0.047804
310,-0.15136
311,-0.22054
312,-0.27298
313,-0.32475
314,-0.37653000000000003
