time,value
0,0.14501
1,0.16899999999999998
2,0.12733
3,0.033438
4,-0.0871
5,-0.19103
6,-0.26411
7,-0.28570999999999996
8,-0.25625
9,-0.2088
10,-0.17243
11,-0.1636
12,-0.15382
13,-0.14053
14,-0.081592
15,0.056598
16,0.23246
17,0.434
18,0.59375
19,0.63505
20,0.55588
21,0.34634000000000004
22,0.052598
23,-0.25021
24,-0.48200000000000004
25,-0.60785
26,-0.6007600000000001
27,-0.49632
28,-0.32692
29,-0.14999
30,0.017282
31,0.12747999999999998
32,0.21100000000000002
33,0.2719
34,0.33779000000000003
35,0.42372
36,0.49688999999999994
37,0.55123
38,0.565
39,0.51161
40,0.40081999999999995
41,0.24455
42,0.08692799999999999
43,-0.036614
44,-0.088306
45,-0.1029
46,-0.11359000000000001
47,-0.12611
48,-0.20239000000000001
49,-0.34747
50,-0.52359
51,-0.7118
52,-0.82731
53,-0.84667
54,-0.72934
55,-0.48411000000000004
56,-0.17431
57,0.13999
58,0.40269
59,0.5525800000000001
60,0.6057
61,0.5858800000000001
62,0.52871
63,0.50062
64,0.52189
65,0.6074
66,0.73747
67,0.8709
68,0.94768
69,0.9087299999999999
70,0.73151
71,0.42827
72,0.034467000000000005
73,-0.39515
74,-0.8311799999999999
75,-1.2049
76,-1.4668
77,-1.5787
78,-1.5627
79,-1.4219
80,-1.1895
81,-0.8933
82,-0.57512
83,-0.26375
84,0.021261000000000002
85,0.29120999999999997
86,0.54581
87,0.7621100000000001
88,0.94096
89,1.0486
90,1.1012
91,1.0968
92,1.037
93,0.9549799999999999
94,0.85655
95,0.78188
96,0.74615
97,0.72172
98,0.66328
99,0.52218
100,0.26295999999999997
101,-0.13613
102,-0.62392
103,-1.1072
104,-1.4895
105,-1.6539
106,-1.5630000000000002
107,-1.2467
108,-0.77399
109,-0.27226999999999996
110,0.13076
111,0.34186
112,0.34455
113,0.17181
114,-0.041262
115,-0.21525
116,-0.27779
117,-0.18258
118,0.0058805
119,0.24985
120,0.47085
121,0.6147600000000001
122,0.6976100000000001
123,0.72149
124,0.68582
125,0.60115
126,0.48458
127,0.28905
128,0.039398
129,-0.25682
130,-0.54292
131,-0.72548
132,-0.74336
133,-0.56945
134,-0.22794
135,0.18899000000000002
136,0.57285
137,0.8295
138,0.91174
139,0.81771
140,0.65687
141,0.5071399999999999
142,0.42131
143,0.41528000000000004
144,0.44966000000000006
145,0.4315
146,0.32227
147,0.13195
148,-0.14151
149,-0.41535
150,-0.59613
151,-0.6454
152,-0.59477
153,-0.5262899999999999
154,-0.50349
155,-0.6007100000000001
156,-0.81612
157,-1.0665
158,-1.2367
159,-1.227
160,-1.0036
161,-0.5794699999999999
162,-0.062585
163,0.42163
164,0.76455
165,0.92429
166,0.9335200000000001
167,0.85946
168,0.812
169,0.86756
170,1.0304
171,1.2349
172,1.3746
173,1.3571
174,1.1472
175,0.79415
176,0.37564000000000003
177,-0.017814
178,-0.32366999999999996
179,-0.53898
180,-0.70045
181,-0.85226
182,-1.0533
183,-1.2906
184,-1.4915
185,-1.5783
186,-1.5117
187,-1.2392
188,-0.78161
189,-0.27255999999999997
190,0.22596999999999998
191,0.61454
192,0.8281299999999999
193,0.9043100000000001
194,0.90979
195,0.9041299999999999
196,0.91095
197,0.8974799999999999
198,0.83331
199,0.6806
200,0.42273999999999995
201,0.11134000000000001
202,-0.17811
203,-0.37196999999999997
204,-0.39966
205,-0.27904
206,-0.063538
207,0.16277
208,0.32531
209,0.37506999999999996
210,0.32411
211,0.19834000000000002
212,0.05336900000000001
213,-0.052291
214,-0.10522000000000001
215,-0.15026
216,-0.22296999999999997
217,-0.33391
218,-0.50152
219,-0.69533
220,-0.8740600000000001
221,-0.97067
222,-0.9841200000000001
223,-0.92586
224,-0.8236700000000001
225,-0.68301
226,-0.51132
227,-0.29107
228,0.026211
229,0.44568
230,0.96172
231,1.5309
232,2.0373
233,2.3831
234,2.4824
235,2.293
236,1.8723
237,1.2791
238,0.61824
239,-0.012014
240,-0.52894
241,-0.94063
242,-1.255
243,-1.5018
244,-1.6983
245,-1.8461
246,-1.9037
247,-1.8158
248,-1.5725
249,-1.157
250,-0.6139
251,-0.030864999999999997
252,0.50861
253,0.92774
254,1.1912
255,1.2713
256,1.1842
257,0.9849
258,0.72339
259,0.45823
260,0.20717
261,0.011558
262,-0.12655
263,-0.23668000000000003
264,-0.32855
265,-0.42336999999999997
266,-0.5232600000000001
267,-0.61254
268,-0.63781
269,-0.57696
270,-0.39918000000000003
271,-0.11599999999999999
272,0.24538000000000001
273,0.63794
274,0.9937600000000001
275,1.2448
276,1.3633
277,1.3441
278,1.2214
279,1.015
280,0.78593
281,0.55677
282,0.292
283,-0.019087
284,-0.40896
285,-0.86635
286,-1.354
287,-1.7864
288,-2.0884
289,-2.2047
290,-2.0580000000000003
291,-1.7247
292,-1.2678
293,-0.78413
294,-0.35891
295,-0.023932
296,0.23481
297,0.47123000000000004
298,0.77104
299,1.1548
300,1.5999
301,2.0361
302,2.3572
303,2.4857
304,2.3318
305,1.9089
306,1.2826
307,0.55391
308,-0.18222
309,-0.82084
310,-1.3102
311,-1.6498
312,-1.8194
313,-1.8454
314,-1.7645
315,-1.5909
316,-1.3446
317,-1.0415
318,-0.72645
319,-0.40741
320,-0.1157
321,0.12329000000000001
322,0.31418
323,0.47658
324,0.6088600000000001
325,0.72622
326,0.8508
327,0.97003
328,1.0574
329,1.0905
330,1.0484
331,0.93519
332,0.75392
333,0.52749
334,0.29136
335,0.063318
336,-0.12319000000000001
337,-0.29675
338,-0.44963000000000003
339,-0.55745
340,-0.6246
341,-0.66238
342,-0.66899
343,-0.6752
344,-0.67237
345,-0.70482
346,-0.7701100000000001
347,-0.8363799999999999
348,-0.8710899999999999
349,-0.7972199999999999
350,-0.5988399999999999
351,-0.2224
352,0.29066
353,0.8565
354,1.3714
355,1.6988
356,1.7709
357,1.5658
358,1.1286
359,0.56525
360,-0.0010085
361,-0.43746999999999997
362,-0.69528
363,-0.7864300000000001
364,-0.7368
365,-0.62048
366,-0.52068
367,-0.48295
368,-0.50646
369,-0.58263
370,-0.6504
371,-0.6577
372,-0.56539
373,-0.37756999999999996
374,-0.11225999999999998
375,0.18322
376,0.45675
377,0.65662
378,0.75437
379,0.76523
380,0.72143
381,0.64208
382,0.55738
383,0.49865
384,0.4685
385,0.46328
386,0.43383999999999995
387,0.35719
388,0.2298
389,0.03297
390,-0.22085
391,-0.5304
392,-0.8372299999999999
393,-1.1074
394,-1.2789
395,-1.3163
396,-1.2244
397,-1.0019
398,-0.68337
399,-0.30825
400,0.06301
401,0.40571999999999997
402,0.7198100000000001
403,0.9825799999999999
404,1.1612
405,1.2722
406,1.2796
407,1.1867
408,0.98185
409,0.6781
410,0.3073
411,-0.08136
412,-0.45566
413,-0.78671
414,-1.0384
415,-1.1902
416,-1.2639
417,-1.2768
418,-1.247
419,-1.1772
420,-1.0737
421,-0.8986
422,-0.62937
423,-0.27378
424,0.17648
425,0.69714
426,1.2348
427,1.7095
428,2.0686
429,2.2704
430,2.2928
431,2.1337
432,1.817
433,1.3845
434,0.88307
435,0.33825
436,-0.19922
437,-0.71355
438,-1.1728
439,-1.5613
440,-1.8908
441,-2.1411
442,-2.3094
443,-2.3744
444,-2.2775
445,-2.0238
446,-1.5968
447,-1.0238
448,-0.35202
449,0.33886
450,0.9635299999999999
451,1.4802
452,1.8302
453,2.0184
454,2.0616
455,1.9921
456,1.8481
457,1.6244
458,1.3074
459,0.8946700000000001
460,0.3678
461,-0.26633
462,-0.9737899999999999
463,-1.6385
464,-2.1509
465,-2.4248
466,-2.3837
467,-2.0182
468,-1.4062
469,-0.65179
470,0.10618
471,0.73301
472,1.1425
473,1.3127
474,1.3083
475,1.2134
476,1.1195
477,1.1061
478,1.1973
479,1.3685
480,1.53
481,1.5717
482,1.4255
483,1.0473
484,0.44665
485,-0.30482
486,-1.0936
487,-1.7858
488,-2.282
489,-2.5163
490,-2.4915
491,-2.2477
492,-1.8345
493,-1.3486
494,-0.86125
495,-0.42022
496,-0.041306999999999996
497,0.26389
498,0.5223899999999999
499,0.76558
