time,value
0,0.038666000000000006
1,0.27079000000000003
2,0.021755
3,-0.63737
4,-0.054639
5,-0.13022
6,-0.40371
7,0.17376
8,-0.3172
9,0.32025
10,-0.13074000000000002
11,-0.23574
12,-0.48828999999999995
13,0.13927
14,0.23173000000000002
15,-0.94178
16,0.62649
17,-0.23574
18,0.26982
19,-0.55712
20,0.26479
21,-0.24153000000000002
22,-0.077431
23,0.15841
24,-0.12859
25,0.06561
26,0.58254
27,-0.15552
28,0.094502
29,0.18211
30,-0.16863
31,0.3709
32,0.23872
33,0.52818
34,0.32133
35,-0.18936
36,0.49638000000000004
37,-0.17163
38,0.40318000000000004
39,-0.36225999999999997
40,0.32825
41,0.30006
42,-0.593
43,0.20806999999999998
44,-0.24756
45,-0.20788
46,-0.13423
47,0.015061000000000001
48,0.022793
49,0.31529
50,0.35607
51,0.29220999999999997
52,0.12401
53,0.19329000000000002
54,-0.26698
55,-0.043667000000000004
56,-0.35491
57,-0.25129
58,-0.24875999999999998
59,0.21925999999999998
60,-0.22726999999999997
61,-0.057120000000000004
62,0.16639
63,-0.34674
64,0.7551800000000001
65,0.31571
66,-0.087948
67,-1.6469999999999998
68,-1.6469999999999998
69,-1.6469999999999998
70,-1.6469999999999998
71,-1.6469999999999998
72,-1.6469999999999998
73,-1.6469999999999998
74,-1.6469999999999998
75,-1.6469999999999998
76,-1.6469999999999998
77,-1.6469999999999998
78,-1.6469999999999998
79,1.6161
80,1.6161
81,1.6161
82,1.6161
83,1.6161
84,1.6161
85,1.6161
86,1.6161
87,1.6161
88,1.6161
89,1.6161
90,1.6161
91,0.023528
92,0.29111
93,0.22799
94,-0.59159
95,0.28479
96,0.37585
97,0.25375
98,-0.8633799999999999
99,-0.34005
100,0.15263
101,-0.54898
102,-0.35568
103,1.6161
104,1.6161
105,1.6161
106,1.6161
107,1.6161
108,1.6161
109,1.6161
110,1.6161
111,1.6161
112,1.6161
113,-1.6469999999999998
114,-1.6469999999999998
115,-1.6469999999999998
116,-1.6469999999999998
117,-1.6469999999999998
118,-1.6469999999999998
119,-1.6469999999999998
120,-1.6469999999999998
121,-1.6469999999999998
122,-1.6469999999999998
123,0.65187
124,0.39075
125,-0.083025
126,0.21225
127,-0.11888
