time,value
0,-0.8532299999999999
1,-0.8532299999999999
2,-0.8532299999999999
3,-0.8532299999999999
4,-0.8532299999999999
5,-0.8532299999999999
6,-0.8532299999999999
7,-0.8532299999999999
8,-0.8532299999999999
9,-0.8532299999999999
10,-0.8532299999999999
11,-0.8532299999999999
12,-0.8532299999999999
13,-0.8532299999999999
14,-0.8532299999999999
15,-0.8532299999999999
16,-0.8532299999999999
17,-0.8532299999999999
18,-0.8532299999999999
19,-0.8532299999999999
20,-0.8532299999999999
21,-0.8532299999999999
22,-0.8532299999999999
23,-0.8532299999999999
24,-0.8532299999999999
25,-0.8532299999999999
26,-0.8532299999999999
27,-0.8532299999999999
28,-0.8532299999999999
29,-0.8532299999999999
30,-0.8532299999999999
31,-0.8532299999999999
32,-0.8532299999999999
33,-0.8532299999999999
34,-0.8532299999999999
35,-0.8532299999999999
36,-0.8532299999999999
37,-0.8532299999999999
38,-0.8532299999999999
39,-0.8532299999999999
40,-0.8532299999999999
41,-0.8532299999999999
42,-0.8532299999999999
43,-0.8532299999999999
44,-0.8532299999999999
45,-0.8532299999999999
46,-0.8532299999999999
47,-0.85209
48,-0.83054
49,-0.8104100000000001
50,-0.8253
51,-0.79984
52,-0.81565
53,-0.81915
54,-0.7790100000000001
55,-0.7833399999999999
56,-0.73037
57,-0.72155
58,-0.73134
59,-0.70418
60,-0.6934100000000001
61,-0.72702
62,-0.7401
63,-0.72147
64,-0.72747
65,-0.72778
66,-0.7014699999999999
67,-0.6855399999999999
68,-0.7068800000000001
69,-0.6975899999999999
70,-0.69692
71,-0.70596
72,-0.6715800000000001
73,-0.66804
74,-0.61151
75,-0.64271
76,-0.66361
77,-0.69739
78,-0.6718
79,-0.65994
80,-0.7178100000000001
81,-0.71518
82,-0.65298
83,-0.65594
84,-0.72895
85,-0.6550699999999999
86,-0.6852600000000001
87,-0.6945399999999999
88,-0.6692100000000001
89,-0.68118
90,-0.63025
91,-0.64305
92,-0.69029
93,-0.6572600000000001
94,-0.67537
95,-0.71711
96,-0.62385
97,-0.61416
98,-0.60745
99,-0.57434
100,-0.63185
101,-0.64242
102,-0.66855
103,-0.69086
104,-0.74119
105,-0.6725
106,-0.70992
107,-0.72135
108,-0.71454
109,-0.68058
110,-0.72358
111,-0.72637
112,-0.71218
113,-0.65203
114,-0.66154
115,-0.6731699999999999
116,-0.6915100000000001
117,1.099
118,0.36498
119,0.66897
120,2.9659
121,3.653
122,3.0965
123,0.55512
124,0.5079
125,1.4985
126,1.5209
127,1.527
128,1.9086
129,1.9877
130,1.3932
131,2.8461
132,4.1292
133,2.551
134,4.2008
135,2.6114
136,2.6085
137,2.9137
138,2.2407
139,1.9676
140,1.4069999999999998
141,1.514
142,1.9724
143,2.1373
144,2.4452
145,3.5999
146,2.399
147,1.8657
148,1.7891
149,2.0004
150,1.6708
151,2.2362
152,1.4472
153,1.7735
154,1.3861
155,0.91794
156,1.1625
157,2.4898
158,0.9063
159,1.2273
160,1.1109
161,0.80102
162,1.1605
163,0.75635
164,1.1036
165,1.1395
166,0.93214
167,1.107
168,0.70613
169,0.76161
170,0.9227299999999999
171,0.62457
172,1.1293
173,1.9523
174,0.9520799999999999
175,0.75267
176,1.0302
177,0.9346200000000001
178,0.9578200000000001
179,0.43046999999999996
180,0.72323
181,0.79002
182,0.29076
183,0.32588
184,0.48744
185,0.79673
186,0.20115999999999998
187,0.93695
188,0.30251999999999996
189,0.50848
190,0.50447
191,0.33582
192,0.16537000000000002
193,0.34726
194,0.72454
195,0.32211
196,0.36430999999999997
197,0.29618
198,0.10187
199,0.075362
200,-0.10840999999999999
201,0.35162
202,-0.039508999999999996
203,0.26663000000000003
204,0.46331000000000006
205,0.25237
206,0.32886
207,0.36753
208,0.16338
209,0.14234000000000002
210,0.21828000000000003
211,-0.16585999999999998
212,0.14629
213,0.1295
214,0.19397999999999999
215,-0.050964999999999996
216,0.015094
217,-0.054976
218,0.16333
219,0.10378
220,0.054329999999999996
221,-0.22391999999999998
222,-0.067039
223,-0.14093
224,-0.18404
225,-0.25336
226,-0.29883000000000004
227,-0.28160999999999997
228,0.039477
229,-0.09454299999999999
230,0.14060999999999998
231,0.56375
232,0.40771999999999997
233,0.019497
234,0.84319
235,0.42691999999999997
236,-0.10198
237,0.1098
238,0.12270999999999999
239,0.16086
240,0.020281999999999998
241,0.44719
242,0.60748
243,0.51979
244,0.56908
245,0.085255
246,0.19892
247,-0.097987
248,-0.074963
249,-0.29721
250,-0.28569
251,-0.19944
252,-0.088785
253,-0.11375
254,-0.30903
255,-0.098319
256,-0.20299
257,-0.29406
258,-0.31851999999999997
259,-0.25486
260,-0.33231
261,-0.33134
262,-0.38025
263,-0.3536
264,-0.36791
265,-0.27969
266,-0.46121
267,-0.25895999999999997
268,-0.36723
269,-0.25449
270,-0.32931
271,-0.44141
272,-0.34624
273,-0.41795
274,-0.46063000000000004
275,-0.29925999999999997
276,-0.4508
277,-0.5069100000000001
278,-0.34674
279,-0.44935
280,-0.38399
281,-0.41753999999999997
282,-0.39427
283,-0.30362
284,-0.33842
285,-0.38643
286,-0.43525
287,-0.34692
288,-0.57518
289,-0.43171000000000004
290,-0.23979
291,-0.50655
292,-0.45863999999999994
293,-0.45661999999999997
294,-0.47398
295,-0.3882
296,-0.45982
297,-0.38432
298,-0.38500999999999996
299,-0.36461
300,-0.31058
301,-0.4858
302,-0.40287
303,-0.39455999999999997
304,-0.524
305,-0.52337
306,-0.48518
307,-0.5796600000000001
308,-0.57302
309,-0.70782
310,-0.70315
311,-0.73714
312,-0.76635
313,-0.81894
314,-0.8532299999999999
315,-0.8532299999999999
316,-0.8532299999999999
317,-0.8532299999999999
318,-0.8532299999999999
