time,value
0,0.24578000000000003
1,0.5674
2,0.87265
3,1.1341
4,1.2997
5,1.3375
6,1.2402
7,1.0038
8,0.64987
9,0.2143
10,-0.25275
11,-0.6983699999999999
12,-1.07
13,-1.3289
14,-1.4562
15,-1.4433
16,-1.31
17,-1.0832
18,-0.7872899999999999
19,-0.44974
20,-0.095158
21,0.25209000000000004
22,0.57131
23,0.8406
24,1.0415
25,1.1461
26,1.1424
27,1.0216
28,0.8076399999999999
29,0.53988
30,0.25575
31,0.0082165
32,-0.17014
33,-0.25640999999999997
34,-0.27331
35,-0.26095999999999997
36,-0.25535
37,-0.29035
38,-0.37988
39,-0.5179199999999999
40,-0.67171
41,-0.78961
42,-0.8333799999999999
43,-0.76876
44,-0.58862
45,-0.3208
46,-0.0048752
47,0.31636
48,0.60011
49,0.81713
50,0.95596
51,1.0158
52,1.0017
53,0.9102299999999999
54,0.74849
55,0.51041
56,0.22286999999999998
57,-0.099867
58,-0.41148
59,-0.67309
60,-0.83931
61,-0.89097
62,-0.83596
63,-0.70523
64,-0.53092
65,-0.36522
66,-0.23628000000000002
67,-0.14683
68,-0.084678
69,-0.040747000000000005
70,0.011266
71,0.091129
72,0.19555999999999998
73,0.31113
74,0.41161000000000003
75,0.48088000000000003
76,0.5128199999999999
77,0.51571
78,0.50385
79,0.48435
80,0.45752
81,0.40425
82,0.3041
83,0.14514000000000002
84,-0.071758
85,-0.32569000000000004
86,-0.5744100000000001
87,-0.75729
88,-0.82576
89,-0.75784
90,-0.56375
91,-0.27776
92,0.042893
93,0.32268
94,0.5276
95,0.62588
96,0.61147
97,0.5088600000000001
98,0.34719
99,0.1531
100,-0.062898
101,-0.27976
102,-0.46546000000000004
103,-0.59395
104,-0.65345
105,-0.62434
106,-0.48456000000000005
107,-0.2576
108,0.028916000000000004
109,0.32426
110,0.56194
111,0.69265
112,0.68899
113,0.5472199999999999
114,0.29446
115,-0.011448999999999999
116,-0.29704
117,-0.50351
118,-0.5836399999999999
119,-0.52085
120,-0.33425
121,-0.066577
122,0.22896
123,0.4989
124,0.69248
125,0.77213
126,0.73543
127,0.5937
128,0.37856999999999996
129,0.12259
130,-0.13606
131,-0.36622
132,-0.53876
133,-0.6454
134,-0.69715
135,-0.69733
136,-0.6418699999999999
137,-0.5559
138,-0.45597
139,-0.34819
140,-0.23449
141,-0.12405999999999999
142,-0.019444
143,0.08138200000000001
144,0.17053
145,0.2408
146,0.29786999999999997
147,0.34776999999999997
148,0.3913
149,0.4279
150,0.46713999999999994
151,0.5072
152,0.5338
153,0.5385
154,0.52325
155,0.46778000000000003
156,0.37931
157,0.25648000000000004
158,0.10707
159,-0.060573
160,-0.23117
161,-0.39464
162,-0.53489
163,-0.6408
164,-0.70749
165,-0.72583
166,-0.69819
167,-0.63854
168,-0.55858
169,-0.46893999999999997
170,-0.35983000000000004
171,-0.24181
172,-0.11455
173,0.018516
174,0.14552
175,0.26078
176,0.35399
177,0.41572
178,0.45061999999999997
179,0.47671
180,0.51399
181,0.57314
182,0.66327
183,0.75393
184,0.80371
185,0.7670100000000001
186,0.60677
187,0.30662
188,-0.11824000000000001
189,-0.60322
190,-1.071
191,-1.4239
192,-1.5876
193,-1.538
194,-1.2747
195,-0.86288
196,-0.3831
197,0.08455700000000001
198,0.47231999999999996
199,0.7349899999999999
200,0.86944
201,0.91209
202,0.91894
203,0.9152299999999999
204,0.92299
205,0.9477200000000001
206,0.9784700000000001
207,0.97316
208,0.90389
209,0.73939
210,0.47058999999999995
211,0.1045
212,-0.34729
213,-0.85182
214,-1.3651
215,-1.8367
216,-2.2118
217,-2.4374
218,-2.4596
219,-2.2433
220,-1.7872
221,-1.1165
222,-0.29459
223,0.59065
224,1.4422
225,2.1601
226,2.6718
227,2.9225
228,2.8934
229,2.5975
230,2.0863
231,1.4221
232,0.68972
233,-0.039113
234,-0.68614
235,-1.1871
236,-1.5085
237,-1.6564
238,-1.6447
239,-1.5112
240,-1.3127
241,-1.1104
242,-0.92845
243,-0.78166
244,-0.65872
245,-0.53409
246,-0.37616
247,-0.16592
248,0.091427
249,0.37278
250,0.64336
251,0.8634700000000001
252,0.99446
253,1.0356
254,0.99331
255,0.8732700000000001
256,0.71428
257,0.54475
258,0.37865
259,0.23479
260,0.11400999999999999
261,0.021563
262,-0.042565
263,-0.085862
264,-0.11075
265,-0.12925
266,-0.1671
267,-0.2384
268,-0.34717
269,-0.49833
270,-0.6902
271,-0.9008700000000001
272,-1.1016
273,-1.2564
274,-1.3259
275,-1.2703
276,-1.0626
277,-0.70112
278,-0.19264
279,0.42086999999999997
280,1.072
281,1.6838
282,2.1726
283,2.4559
284,2.4911
285,2.2755
286,1.8329
287,1.2231
288,0.52686
289,-0.17914000000000002
290,-0.83224
291,-1.3843
292,-1.8118
293,-2.1071
294,-2.254
295,-2.2441
296,-2.0735
297,-1.7379
298,-1.2676
299,-0.71373
300,-0.1278
301,0.41566000000000003
302,0.8564200000000001
303,1.1528
304,1.2933
305,1.3121
306,1.2589
307,1.182
308,1.112
309,1.0651
310,1.0305
311,0.97582
312,0.87444
313,0.69533
314,0.41965
315,0.060926
316,-0.35186
317,-0.7841
318,-1.1901
319,-1.5276
320,-1.7635
321,-1.8599
322,-1.8003
323,-1.5764
324,-1.1987
325,-0.7002
326,-0.13142
327,0.43309
328,0.9348299999999999
329,1.3111
330,1.5282
331,1.5749
332,1.4597
333,1.2117
334,0.88886
335,0.54711
336,0.22816999999999998
337,-0.038437
338,-0.22964
339,-0.34644
340,-0.401
341,-0.41267
342,-0.4044
343,-0.40249
344,-0.41293
345,-0.43961000000000006
346,-0.47794
347,-0.51067
348,-0.51866
349,-0.49165
350,-0.4185
351,-0.29558
352,-0.14237
353,0.026726
354,0.18567
355,0.3049
356,0.3702
357,0.37754
358,0.32029
359,0.21463000000000002
360,0.086724
361,-0.030855
362,-0.12093
363,-0.16264
364,-0.14781
365,-0.085641
366,0.019474
367,0.1541
368,0.29386
369,0.43106000000000005
370,0.5576300000000001
371,0.66673
372,0.73521
373,0.74797
374,0.67867
375,0.5111100000000001
376,0.24416999999999997
377,-0.10819000000000001
378,-0.51321
379,-0.9168200000000001
380,-1.2615
381,-1.492
382,-1.5691
383,-1.4718
384,-1.2069
385,-0.80594
386,-0.3203
387,0.19255
388,0.67396
389,1.069
390,1.3419
391,1.4694
392,1.4435
393,1.2705
394,0.9823200000000001
395,0.62767
396,0.25737
397,-0.071325
398,-0.31832
399,-0.46745
400,-0.52768
401,-0.5274300000000001
402,-0.49851999999999996
403,-0.48248
404,-0.5028600000000001
405,-0.55003
406,-0.6163
407,-0.66375
408,-0.65759
409,-0.57387
410,-0.41681999999999997
411,-0.19468
412,0.061554
413,0.3195
414,0.56328
415,0.78188
416,0.95688
417,1.0768
418,1.1345
419,1.1069
420,0.9769200000000001
421,0.74416
422,0.40862
423,-0.0040067
424,-0.44441
425,-0.85705
426,-1.1952
427,-1.4218
428,-1.5114
429,-1.4701
430,-1.3124
431,-1.0779
432,-0.79671
433,-0.48536
434,-0.16025
435,0.16801
436,0.49978999999999996
437,0.8311799999999999
438,1.1409
439,1.4199
440,1.6369999999999998
441,1.7592
442,1.7645
443,1.6422
444,1.3841
445,0.99625
446,0.49911000000000005
447,-0.070485
448,-0.67781
449,-1.2687
450,-1.7856
451,-2.1859
452,-2.4345
453,-2.4924
454,-2.3466
455,-2.0154
456,-1.518
457,-0.88723
458,-0.17884
459,0.5587
460,1.2678
461,1.8924
462,2.3738
463,2.6651
464,2.7339
465,2.5628
466,2.1581
467,1.5517
468,0.80705
469,0.0032536
470,-0.7864800000000001
471,-1.4792
472,-2.0081
473,-2.3332
474,-2.4302
475,-2.2933
476,-1.9531
477,-1.4568
478,-0.86231
479,-0.22288000000000002
480,0.39041
481,0.9247299999999999
482,1.3327
483,1.5744
484,1.6448
485,1.5512
486,1.3317
487,1.0304
488,0.69852
489,0.38076
490,0.10156
491,-0.1158
492,-0.28556
493,-0.42646000000000006
494,-0.55083
495,-0.67608
496,-0.8097300000000001
497,-0.94337
498,-1.0515
499,-1.1017
