time,value
0,-0.054534000000000006
1,-0.054534000000000006
2,-0.054534000000000006
3,-0.054534000000000006
4,-0.054534000000000006
5,-0.054534000000000006
6,-0.054534000000000006
7,-0.054534000000000006
8,-0.054534000000000006
9,-0.054534000000000006
10,-0.054534000000000006
11,-0.054534000000000006
12,-0.054534000000000006
13,-0.054534000000000006
14,-0.054534000000000006
15,-0.054534000000000006
16,-0.054534000000000006
17,-0.054534000000000006
18,-0.054534000000000006
19,-0.054534000000000006
20,-0.054534000000000006
21,-0.054534000000000006
22,-0.054534000000000006
23,-0.054534000000000006
24,-0.054534000000000006
25,-0.054534000000000006
26,-0.054534000000000006
27,-0.054534000000000006
28,-0.054534000000000006
29,-0.054534000000000006
30,-0.054534000000000006
31,-0.054534000000000006
32,-0.054534000000000006
33,-0.054534000000000006
34,-0.054534000000000006
35,-0.054534000000000006
36,-0.054534000000000006
37,-0.054534000000000006
38,-0.054534000000000006
39,-0.054534000000000006
40,-0.054534000000000006
41,-0.054534000000000006
42,-0.054534000000000006
43,-0.054534000000000006
44,-0.054534000000000006
45,-0.054534000000000006
46,-0.054534000000000006
47,-0.054534000000000006
48,-0.054534000000000006
49,-0.054534000000000006
50,-0.054534000000000006
51,-0.054534000000000006
52,-0.054534000000000006
53,-0.054534000000000006
54,-0.054534000000000006
55,-0.054534000000000006
56,-0.054534000000000006
57,-0.054534000000000006
58,-0.054534000000000006
59,-0.054534000000000006
60,-0.054534000000000006
61,-0.054534000000000006
62,-0.054534000000000006
63,-0.054534000000000006
64,-0.054534000000000006
65,-0.054534000000000006
66,-0.054534000000000006
67,-0.054534000000000006
68,-0.054534000000000006
69,-0.054534000000000006
70,-0.054534000000000006
71,-0.054534000000000006
72,-0.054534000000000006
73,-0.054534000000000006
74,-0.054534000000000006
75,-0.054534000000000006
76,-0.054534000000000006
77,-0.054534000000000006
78,-0.054534000000000006
79,-0.054534000000000006
80,-0.054534000000000006
81,-0.054534000000000006
82,-0.054534000000000006
83,-0.054534000000000006
84,-0.054534000000000006
85,-0.054534000000000006
86,-0.054534000000000006
87,-0.054534000000000006
88,-0.054534000000000006
89,-0.054534000000000006
90,-0.054534000000000006
91,-0.054534000000000006
92,-0.054534000000000006
93,-0.054534000000000006
94,-0.054534000000000006
95,-0.054534000000000006
96,-0.054534000000000006
97,-0.054534000000000006
98,-0.054534000000000006
99,-0.054534000000000006
100,-0.054534000000000006
101,-0.054534000000000006
102,-0.054534000000000006
103,-0.054534000000000006
104,-0.054534000000000006
105,-0.054534000000000006
106,-0.054534000000000006
107,-0.054534000000000006
108,-0.054534000000000006
109,-0.054534000000000006
110,-0.054534000000000006
111,-0.054534000000000006
112,-0.054534000000000006
113,-0.054534000000000006
114,-0.054534000000000006
115,-0.054534000000000006
116,-0.054534000000000006
117,-0.054534000000000006
118,-0.054534000000000006
119,-0.054534000000000006
120,-0.054534000000000006
121,-0.054534000000000006
122,-0.054534000000000006
123,-0.054534000000000006
124,-0.054534000000000006
125,-0.054534000000000006
126,-0.054534000000000006
127,-0.054534000000000006
128,-0.054534000000000006
129,-0.054534000000000006
130,-0.054534000000000006
131,-0.054534000000000006
132,-0.054534000000000006
133,-0.054534000000000006
134,-0.054534000000000006
135,-0.054534000000000006
136,-0.054534000000000006
137,-0.054534000000000006
138,-0.054534000000000006
139,-0.054534000000000006
140,-0.054534000000000006
141,-0.054534000000000006
142,-0.054534000000000006
143,-0.054534000000000006
144,-0.054534000000000006
145,-0.054534000000000006
146,-0.054534000000000006
147,-0.054534000000000006
148,-0.054534000000000006
149,-0.054534000000000006
150,-0.054534000000000006
151,-0.054534000000000006
152,-0.054534000000000006
153,-0.054534000000000006
154,-0.054534000000000006
155,-0.054534000000000006
156,-0.054534000000000006
157,-0.054534000000000006
158,-0.054534000000000006
159,-0.054534000000000006
160,-0.054534000000000006
161,-0.054534000000000006
162,-0.054534000000000006
163,-0.054534000000000006
164,-0.054534000000000006
165,-0.054534000000000006
166,-0.054534000000000006
167,-0.054534000000000006
168,-0.054534000000000006
169,-0.054534000000000006
170,-0.054534000000000006
171,-0.054534000000000006
172,-0.054534000000000006
173,-0.054534000000000006
174,-0.054534000000000006
175,-0.054534000000000006
176,-0.054534000000000006
177,-0.054534000000000006
178,-0.054534000000000006
179,-0.054534000000000006
180,-0.054534000000000006
181,-0.054534000000000006
182,-0.054534000000000006
183,-0.054534000000000006
184,-0.054534000000000006
185,-0.054534000000000006
186,-0.054534000000000006
187,-0.054534000000000006
188,-0.054534000000000006
189,-0.054534000000000006
190,-0.054534000000000006
191,-0.054534000000000006
192,-0.054534000000000006
193,-0.054534000000000006
194,-0.054534000000000006
195,-0.054534000000000006
196,-0.054534000000000006
197,-0.054534000000000006
198,-0.054534000000000006
199,-0.054534000000000006
200,-0.054534000000000006
201,-0.054534000000000006
202,-0.054534000000000006
203,-0.054534000000000006
204,-0.054534000000000006
205,-0.054534000000000006
206,-0.054534000000000006
207,-0.054534000000000006
208,-0.054534000000000006
209,-0.054534000000000006
210,-0.054534000000000006
211,-0.054534000000000006
212,-0.054534000000000006
213,-0.054534000000000006
214,-0.054534000000000006
215,-0.054534000000000006
216,-0.054534000000000006
217,-0.054534000000000006
218,-0.054534000000000006
219,-0.054534000000000006
220,-0.054534000000000006
221,-0.054534000000000006
222,-0.054534000000000006
223,-0.054534000000000006
224,-0.054534000000000006
225,-0.054534000000000006
226,-0.054534000000000006
227,-0.054534000000000006
228,-0.054534000000000006
229,-0.054534000000000006
230,-0.054534000000000006
231,-0.054534000000000006
232,-0.054534000000000006
233,-0.054534000000000006
234,-0.054534000000000006
235,-0.054534000000000006
236,-0.054534000000000006
237,-0.054534000000000006
238,-0.054534000000000006
239,-0.054534000000000006
240,-0.054534000000000006
241,-0.054534000000000006
242,-0.054534000000000006
243,-0.054534000000000006
244,-0.054534000000000006
245,-0.054534000000000006
246,-0.054534000000000006
247,-0.054534000000000006
248,-0.054534000000000006
249,-0.054534000000000006
250,-0.054534000000000006
251,-0.054534000000000006
252,-0.054534000000000006
253,-0.054534000000000006
254,-0.054534000000000006
255,-0.054534000000000006
256,-0.054534000000000006
257,-0.054534000000000006
258,-0.054534000000000006
259,-0.054534000000000006
260,-0.054534000000000006
261,-0.054534000000000006
262,-0.054534000000000006
263,-0.054534000000000006
264,-0.054534000000000006
265,-0.054534000000000006
266,-0.054534000000000006
267,-0.054534000000000006
268,-0.054534000000000006
269,-0.054534000000000006
270,-0.054534000000000006
271,-0.054534000000000006
272,-0.054534000000000006
273,-0.054534000000000006
274,-0.054534000000000006
275,-0.054534000000000006
276,-0.054534000000000006
277,-0.054534000000000006
278,-0.054534000000000006
279,-0.054534000000000006
280,-0.054534000000000006
281,-0.054534000000000006
282,-0.054534000000000006
283,-0.054534000000000006
284,-0.054534000000000006
285,-0.054534000000000006
286,-0.054534000000000006
287,-0.054534000000000006
288,-0.054534000000000006
289,-0.054534000000000006
290,-0.054534000000000006
291,-0.054534000000000006
292,-0.054534000000000006
293,-0.054534000000000006
294,-0.054534000000000006
295,-0.054534000000000006
296,-0.054534000000000006
297,-0.054534000000000006
298,-0.054534000000000006
299,-0.054534000000000006
300,-0.054534000000000006
301,-0.054534000000000006
302,-0.054534000000000006
303,-0.054534000000000006
304,-0.054534000000000006
305,-0.054534000000000006
306,-0.054534000000000006
307,-0.054534000000000006
308,-0.054534000000000006
309,-0.054534000000000006
310,-0.054534000000000006
311,-0.054534000000000006
312,-0.054534000000000006
313,-0.054534000000000006
314,-0.054534000000000006
315,-0.054534000000000006
316,-0.054534000000000006
317,-0.054534000000000006
318,-0.054534000000000006
319,-0.054534000000000006
320,-0.054534000000000006
321,-0.054534000000000006
322,-0.054534000000000006
323,-0.054534000000000006
324,-0.054534000000000006
325,-0.054534000000000006
326,-0.054534000000000006
327,-0.054534000000000006
328,-0.054534000000000006
329,-0.054534000000000006
330,-0.054534000000000006
331,-0.054534000000000006
332,-0.054534000000000006
333,-0.054534000000000006
334,-0.054534000000000006
335,-0.054534000000000006
336,-0.054534000000000006
337,-0.054534000000000006
338,-0.054534000000000006
339,-0.054534000000000006
340,-0.054534000000000006
341,-0.054534000000000006
342,-0.054534000000000006
343,-0.054534000000000006
344,-0.054534000000000006
345,-0.054534000000000006
346,-0.054534000000000006
347,-0.054534000000000006
348,-0.054534000000000006
349,-0.054534000000000006
350,-0.054534000000000006
351,-0.054534000000000006
352,-0.054534000000000006
353,-0.054534000000000006
354,-0.054534000000000006
355,-0.054534000000000006
356,-0.054534000000000006
357,-0.054534000000000006
358,-0.054534000000000006
359,-0.054534000000000006
360,-0.054534000000000006
361,-0.054534000000000006
362,-0.054534000000000006
363,-0.054534000000000006
364,-0.054534000000000006
365,-0.054534000000000006
366,-0.054534000000000006
367,-0.054534000000000006
368,-0.054534000000000006
369,-0.054534000000000006
370,-0.054534000000000006
371,-0.054534000000000006
372,-0.054534000000000006
373,-0.054534000000000006
374,-0.054534000000000006
375,-0.054534000000000006
376,-0.054534000000000006
377,-0.054534000000000006
378,-0.054534000000000006
379,-0.054534000000000006
380,-0.054534000000000006
381,-0.054534000000000006
382,-0.054534000000000006
383,-0.054534000000000006
384,-0.054534000000000006
385,-0.054534000000000006
386,-0.054534000000000006
387,-0.054534000000000006
388,-0.054534000000000006
389,-0.054534000000000006
390,-0.054534000000000006
391,-0.054534000000000006
392,-0.054534000000000006
393,-0.054534000000000006
394,-0.054534000000000006
395,-0.054534000000000006
396,-0.054534000000000006
397,-0.054534000000000006
398,-0.054534000000000006
399,-0.054534000000000006
400,-0.054534000000000006
401,-0.054534000000000006
402,-0.054534000000000006
403,-0.054534000000000006
404,-0.054534000000000006
405,-0.054534000000000006
406,-0.054534000000000006
407,-0.054534000000000006
408,-0.054534000000000006
409,-0.054534000000000006
410,-0.054534000000000006
411,-0.054534000000000006
412,-0.054534000000000006
413,-0.054534000000000006
414,-0.054534000000000006
415,-0.054534000000000006
416,-0.054534000000000006
417,-0.054534000000000006
418,-0.054534000000000006
419,-0.054534000000000006
420,-0.054534000000000006
421,-0.054534000000000006
422,-0.054534000000000006
423,-0.054534000000000006
424,-0.054534000000000006
425,-0.054534000000000006
426,-0.054534000000000006
427,-0.054534000000000006
428,-0.054534000000000006
429,-0.054534000000000006
430,-0.054534000000000006
431,-0.054534000000000006
432,-0.054534000000000006
433,-0.054534000000000006
434,-0.054534000000000006
435,-0.054534000000000006
436,-0.054534000000000006
437,-0.054534000000000006
438,-0.054534000000000006
439,-0.054534000000000006
440,-0.054534000000000006
441,-0.054534000000000006
442,-0.054534000000000006
443,-0.054534000000000006
444,-0.054534000000000006
445,-0.054534000000000006
446,-0.054534000000000006
447,-0.054534000000000006
448,-0.054534000000000006
449,-0.054534000000000006
450,-0.054534000000000006
451,-0.054534000000000006
452,-0.054534000000000006
453,-0.054534000000000006
454,-0.054534000000000006
455,-0.054534000000000006
456,-0.054534000000000006
457,-0.054534000000000006
458,-0.054534000000000006
459,-0.054534000000000006
460,-0.054534000000000006
461,-0.054534000000000006
462,-0.054534000000000006
463,-0.054534000000000006
464,-0.054534000000000006
465,-0.054534000000000006
466,-0.054534000000000006
467,-0.054534000000000006
468,-0.054534000000000006
469,-0.054534000000000006
470,-0.054534000000000006
471,-0.054534000000000006
472,-0.054534000000000006
473,-0.054534000000000006
474,-0.054534000000000006
475,-0.054534000000000006
476,-0.054534000000000006
477,-0.054534000000000006
478,-0.054534000000000006
479,-0.054534000000000006
480,-0.054534000000000006
481,-0.054534000000000006
482,-0.054534000000000006
483,-0.054534000000000006
484,-0.054534000000000006
485,-0.054534000000000006
486,-0.054534000000000006
487,-0.054534000000000006
488,-0.054534000000000006
489,-0.054534000000000006
490,-0.054534000000000006
491,-0.054534000000000006
492,-0.054534000000000006
493,-0.054534000000000006
494,-0.054534000000000006
495,-0.054534000000000006
496,-0.054534000000000006
497,-0.054534000000000006
498,-0.054534000000000006
499,-0.054534000000000006
500,-0.054534000000000006
501,-0.054534000000000006
502,-0.054534000000000006
503,-0.054534000000000006
504,-0.054534000000000006
505,-0.054534000000000006
506,-0.054534000000000006
507,-0.054534000000000006
508,-0.054534000000000006
509,-0.054534000000000006
510,-0.054534000000000006
511,-0.054534000000000006
512,-0.054534000000000006
513,-0.054534000000000006
514,-0.054534000000000006
515,-0.054534000000000006
516,-0.054534000000000006
517,-0.054534000000000006
518,-0.054534000000000006
519,-0.054534000000000006
520,-0.054534000000000006
521,-0.054534000000000006
522,-0.054534000000000006
523,-0.054534000000000006
524,-0.054534000000000006
525,-0.054534000000000006
526,1.926
527,22.97
528,13.610999999999999
529,0.53964
530,-0.054534000000000006
531,-0.054534000000000006
532,-0.054534000000000006
533,-0.054534000000000006
534,-0.054534000000000006
535,-0.054534000000000006
536,-0.054534000000000006
537,-0.054534000000000006
538,-0.054534000000000006
539,-0.054534000000000006
540,-0.054534000000000006
541,-0.054534000000000006
542,-0.054534000000000006
543,-0.054534000000000006
544,-0.054534000000000006
545,-0.054534000000000006
546,-0.054534000000000006
547,-0.054534000000000006
548,-0.054534000000000006
549,-0.054534000000000006
550,-0.054534000000000006
551,-0.054534000000000006
552,-0.054534000000000006
553,-0.054534000000000006
554,-0.054534000000000006
555,-0.054534000000000006
556,-0.054534000000000006
557,-0.054534000000000006
558,-0.054534000000000006
559,-0.054534000000000006
560,-0.054534000000000006
561,-0.054534000000000006
562,-0.054534000000000006
563,-0.054534000000000006
564,-0.054534000000000006
565,-0.054534000000000006
566,-0.054534000000000006
567,-0.054534000000000006
568,-0.054534000000000006
569,-0.054534000000000006
570,-0.054534000000000006
571,-0.054534000000000006
572,-0.054534000000000006
573,-0.054534000000000006
574,-0.054534000000000006
575,-0.054534000000000006
576,-0.054534000000000006
577,-0.054534000000000006
578,-0.054534000000000006
579,-0.054534000000000006
580,-0.054534000000000006
581,-0.054534000000000006
582,-0.054534000000000006
583,-0.054534000000000006
584,-0.054534000000000006
585,-0.054534000000000006
586,-0.054534000000000006
587,-0.054534000000000006
588,-0.054534000000000006
589,-0.054534000000000006
590,-0.054534000000000006
591,-0.054534000000000006
592,-0.054534000000000006
593,-0.054534000000000006
594,-0.054534000000000006
595,-0.054534000000000006
596,-0.054534000000000006
597,-0.054534000000000006
598,-0.054534000000000006
599,-0.054534000000000006
600,-0.054534000000000006
601,-0.054534000000000006
602,-0.054534000000000006
603,-0.054534000000000006
604,-0.054534000000000006
605,-0.054534000000000006
606,-0.054534000000000006
607,-0.054534000000000006
608,-0.054534000000000006
609,-0.054534000000000006
610,-0.054534000000000006
611,-0.054534000000000006
612,-0.054534000000000006
613,-0.054534000000000006
614,-0.054534000000000006
615,-0.054534000000000006
616,-0.054534000000000006
617,-0.054534000000000006
618,-0.054534000000000006
619,-0.054534000000000006
620,-0.054534000000000006
621,-0.054534000000000006
622,-0.054534000000000006
623,-0.054534000000000006
624,-0.054534000000000006
625,-0.054534000000000006
626,-0.054534000000000006
627,-0.054534000000000006
628,-0.054534000000000006
629,-0.054534000000000006
630,-0.054534000000000006
631,-0.054534000000000006
632,-0.054534000000000006
633,-0.054534000000000006
634,-0.054534000000000006
635,-0.054534000000000006
636,-0.054534000000000006
637,-0.054534000000000006
638,-0.054534000000000006
639,-0.054534000000000006
640,-0.054534000000000006
641,-0.054534000000000006
642,-0.054534000000000006
643,-0.054534000000000006
644,-0.054534000000000006
645,-0.054534000000000006
646,-0.054534000000000006
647,-0.054534000000000006
648,-0.054534000000000006
649,-0.054534000000000006
650,-0.054534000000000006
651,-0.054534000000000006
652,-0.054534000000000006
653,-0.054534000000000006
654,-0.054534000000000006
655,-0.054534000000000006
656,-0.054534000000000006
657,-0.054534000000000006
658,-0.054534000000000006
659,-0.054534000000000006
660,-0.054534000000000006
661,-0.054534000000000006
662,-0.054534000000000006
663,-0.054534000000000006
664,-0.054534000000000006
665,-0.054534000000000006
666,-0.054534000000000006
667,-0.054534000000000006
668,-0.054534000000000006
669,-0.054534000000000006
670,-0.054534000000000006
671,-0.054534000000000006
672,-0.054534000000000006
673,-0.054534000000000006
674,-0.054534000000000006
675,-0.054534000000000006
676,-0.054534000000000006
677,-0.054534000000000006
678,-0.054534000000000006
679,-0.054534000000000006
680,-0.054534000000000006
681,-0.054534000000000006
682,-0.054534000000000006
683,-0.054534000000000006
684,-0.054534000000000006
685,-0.054534000000000006
686,-0.054534000000000006
687,-0.054534000000000006
688,-0.054534000000000006
689,-0.054534000000000006
690,-0.054534000000000006
691,-0.054534000000000006
692,-0.054534000000000006
693,-0.054534000000000006
694,-0.054534000000000006
695,-0.054534000000000006
696,-0.054534000000000006
697,-0.054534000000000006
698,-0.054534000000000006
699,-0.054534000000000006
700,-0.054534000000000006
701,-0.054534000000000006
702,-0.054534000000000006
703,-0.054534000000000006
704,-0.054534000000000006
705,-0.054534000000000006
706,-0.054534000000000006
707,-0.054534000000000006
708,-0.054534000000000006
709,-0.054534000000000006
710,-0.054534000000000006
711,-0.054534000000000006
712,-0.054534000000000006
713,-0.054534000000000006
714,-0.054534000000000006
715,-0.054534000000000006
716,-0.054534000000000006
717,-0.054534000000000006
718,-0.054534000000000006
719,-0.054534000000000006
