time,value
0,-0.3718
1,-0.3718
2,-0.3718
3,-0.3718
4,-0.3718
5,-0.3718
6,-0.3718
7,-0.3718
8,-0.3718
9,-0.3718
10,-0.3718
11,-0.3718
12,-0.3718
13,-0.3718
14,-0.3718
15,-0.3718
16,-0.3718
17,-0.3718
18,-0.3718
19,-0.3718
20,-0.3718
21,-0.3718
22,-0.3718
23,-0.3718
24,-0.3718
25,-0.3718
26,-0.3718
27,-0.3718
28,-0.3718
29,-0.3718
30,-0.33263000000000004
31,-0.25336
32,-0.15502
33,-0.23269
34,0.25899
35,0.20264000000000001
36,0.38904
37,0.52975
38,0.52975
39,0.50732
40,0.42783000000000004
41,0.32949
42,0.23115
43,0.13280999999999998
44,0.22311
45,-0.26858000000000004
46,-0.1622
47,-0.26054
48,-0.34663
49,-0.37032
50,-0.3718
51,-0.3718
52,-0.37284
53,-0.39979000000000003
54,-0.49766000000000005
55,-0.58092
56,-0.59718
57,-0.581
58,-0.52828
59,-0.42994
60,-0.3316
61,-0.23326
62,-0.13492
63,-0.1322
64,0.28647
65,0.44438999999999995
66,0.44561999999999996
67,0.13998
68,0.22971
69,0.29912
70,0.30375
71,0.29657
72,0.21105
73,0.099996
74,-0.20039
75,-0.23503000000000002
76,-0.36567
77,-0.3718
78,-0.3718
79,-0.3718
80,-0.3557
81,-0.29499000000000003
82,-0.19665
83,-0.44085
84,0.050835000000000005
85,0.38702
86,0.44561999999999996
87,0.44561999999999996
88,0.16821
89,0.25793
90,0.30437
91,0.30437
92,0.30437
93,0.30437
94,0.27464
95,0.20315999999999998
96,0.10482000000000001
97,0.083136
98,-0.40855
99,-0.1343
100,-0.14640999999999998
101,-0.11400999999999999
102,-0.11425999999999999
103,0.37743000000000004
104,0.33752
105,0.6217
106,0.81113
107,0.89951
108,0.95325
109,0.8549100000000001
110,0.68097
111,0.36753
112,-0.24324
113,-0.55555
114,-1.1456
115,-1.5794
116,-1.9122
117,-2.0102
118,-1.8476
119,-1.5449
120,-0.9225700000000001
121,-0.24761999999999998
122,0.44075
123,1.1227
124,1.7715
125,2.2632
126,2.6955
127,2.9688
128,3.1039
129,3.1066
130,2.91
131,2.6659
132,2.3831
133,2.0881
134,1.7931
135,1.5096
136,1.3625
137,1.2569
138,1.2128
139,1.2059
140,1.2059
141,1.2059
142,1.2331
143,1.3825
144,1.5657
145,1.7163
146,1.8083
147,1.7459
148,1.4945
149,1.1372
150,0.7034600000000001
151,0.19422999999999999
152,-0.42953
153,-1.1118
154,-1.5855
155,-1.9229
156,-2.1347
157,-2.0622
158,-1.9509
159,-1.6976
160,-1.4025
161,-1.1075
162,-0.81555
163,-0.55284
164,-0.34739000000000003
165,-0.17969000000000002
166,-0.20039
167,0.23679
168,0.43777
169,0.44561999999999996
170,-0.076237
171,-0.19522
172,-0.39189
173,-0.5885699999999999
174,-0.7852399999999999
175,-1.0622
176,-1.329
177,-1.4478
178,-1.3567
179,-1.3071
180,-1.3939
181,-1.4923
182,-1.5906
183,-1.7011
184,-1.8504
185,-2.0471
186,-2.194
187,-2.3077
188,-2.3549
189,-2.2962
190,-2.1979
191,-1.8638
192,-1.4777
193,-1.0401
194,-0.55173
195,-0.33200999999999997
196,0.31872
197,0.66793
198,0.9302799999999999
199,1.1018
200,1.2059
201,1.2059
202,1.2059
203,1.2059
204,1.2592
205,1.4055
206,1.6021
207,1.7228
208,1.8261
209,1.8789
210,1.8799
211,1.8684
212,1.7701
213,1.6718
214,1.5734
215,1.4509
216,1.2676
217,0.9726299999999999
218,0.67762
219,0.38261
220,0.08759199999999999
221,-0.20742
222,-0.50243
223,-0.57952
224,-0.59718
225,-0.69005
226,-0.8695
227,-1.048
228,-1.048
229,-1.0362
230,-0.9690000000000001
231,-0.88145
232,-0.82257
233,-0.82257
234,-0.82257
235,-0.82257
236,-0.79637
237,-0.73141
238,-0.63307
239,-0.53473
240,-0.4364
241,-0.38451
242,-0.3718
243,-0.38461999999999996
244,-0.47576999999999997
245,-0.5735
246,-0.67183
247,-0.77017
248,-0.86851
249,-0.9666
250,-1.0334
251,-1.048
252,-0.99859
253,-0.87425
254,-0.6775800000000001
255,-0.4809
256,-0.28423000000000004
257,-0.13316
258,-0.21131999999999998
259,0.3679
260,0.44327
261,0.44561999999999996
262,0.44561999999999996
263,0.44561999999999996
264,0.44561999999999996
265,0.44561999999999996
266,0.44561999999999996
267,0.44561999999999996
268,0.44561999999999996
269,0.44561999999999996
270,0.44561999999999996
271,0.44561999999999996
272,0.44561999999999996
273,0.44561999999999996
274,0.44561999999999996
275,0.44561999999999996
276,0.44561999999999996
277,0.44561999999999996
278,0.44561999999999996
279,0.44561999999999996
280,0.44561999999999996
281,0.43637
282,0.35741
283,-0.089135
284,-0.48549
285,-0.14640999999999998
286,-0.15519000000000002
287,-0.19682
288,-0.29427
289,-0.39261
290,-0.49095
291,-0.5687300000000001
292,-0.59718
293,-0.59718
294,-0.52872
295,-0.43711000000000005
296,-0.33878
297,-0.23908000000000001
298,-0.13285
299,0.34513
300,0.25556
301,0.45223
302,0.63994
303,0.8003600000000001
304,0.8987
305,0.9970399999999999
306,1.0954
307,1.1937
308,1.2919999999999998
309,1.3904
310,1.423
311,1.4313
312,1.3539
313,1.1772
314,0.9805299999999999
315,0.37277
316,0.37277
317,0.37277
318,0.37277
319,0.37277
320,0.37277
321,0.37277
322,0.37277
323,0.37277
324,0.37277
325,0.37277
326,0.37277
327,0.37277
328,0.37277
329,0.37277
330,0.37277
331,0.37277
332,0.37277
333,0.37277
334,0.37277
335,0.37277
336,0.37277
337,0.37277
338,0.37277
339,0.37277
340,0.37277
341,0.37277
342,0.37277
343,0.37277
344,0.37277
345,0.37277
346,0.37277
347,0.37492
348,0.39459
349,0.41758999999999996
350,0.42608999999999997
351,0.42751000000000006
352,0.43418
353,0.45761999999999997
354,0.47036000000000006
355,0.4559
356,0.43246999999999997
357,0.40904
358,0.38642
359,0.37462
360,0.37277
361,0.37277
362,0.37277
363,0.37277
364,0.37277
365,0.37277
366,0.35793
367,0.33607
368,0.31906
369,0.31906
370,0.31906
371,0.31906
372,0.32292
373,0.33548
374,0.3577
375,0.37138000000000004
376,0.37277
377,0.37277
378,0.37277
379,0.37625
380,0.39216
381,0.41553999999999996
382,0.42443000000000003
383,0.42648
384,0.42648
385,0.42633999999999994
386,0.42463
387,0.40425
388,0.38081
389,0.35738000000000003
390,0.33536
391,0.31979
392,0.31906
393,0.31906
394,0.31906
395,0.3229
396,0.33736
397,0.3608
398,0.3702
399,0.37277
400,0.37277
401,0.37277
402,0.37277
403,0.39404
404,0.41541999999999996
405,0.42648
406,0.42648
407,0.42648
408,0.42648
409,0.42648
410,0.42648
411,0.4225
412,0.40921
413,0.38577
414,0.37566
415,0.37277
416,0.38049
417,0.3998
418,0.42323
419,0.44666999999999996
420,0.46934
421,0.48018999999999995
422,0.47901000000000005
423,0.47368999999999994
424,0.45026000000000005
425,0.42683000000000004
426,0.40339
427,0.3721
428,0.32402
429,0.25372
430,0.20822
431,0.17879
432,0.18666
433,0.23593000000000003
434,0.30669
435,0.39649
436,0.48943000000000003
437,0.58317
438,0.67767
439,0.77612
440,0.8932899999999999
441,1.001
442,1.0835
443,1.1538
444,1.2241
445,1.2944
446,1.3422
447,1.3714
448,1.4026
449,1.4432
450,1.4915
451,1.556
452,1.6254
453,1.6957
454,1.7657
455,1.8274
456,1.8509
457,1.8808
458,1.9398
459,2.0037
460,2.052
461,2.0755
462,2.0989
463,2.1223
464,2.1309
465,2.1213
466,2.0937
467,2.0388
468,1.9699
469,1.9124
470,1.8630000000000002
471,1.8161
472,1.7693
473,1.7224
474,1.6755
475,1.6337
476,1.6081
477,1.6067
478,1.5913
479,1.5486
480,1.4948
481,1.4319
482,1.3616
483,1.2913
484,1.2209999999999999
485,1.1383
486,1.0478
487,0.94839
488,0.83445
489,0.71728
490,0.58098
491,0.44051
492,0.2999
493,0.15929000000000001
494,0.14415999999999998
495,-0.12192
496,-0.26871
497,-0.42503
498,-0.57748
499,-0.69291
500,-0.76321
501,-0.7859999999999999
502,-0.7772399999999999
503,-0.74771
504,-0.7055600000000001
505,-0.65869
506,-0.5931
507,-0.52356
508,-0.45326000000000005
509,-0.38375
510,-0.31738
511,-0.27005999999999997
512,-0.22319
513,-0.17632
514,-0.13544
515,-0.50243
516,-0.50243
517,-0.50243
518,-0.50243
519,-0.50243
520,-0.50243
521,-0.50243
522,-0.50243
523,-0.50243
524,-0.13234
525,-0.17715999999999998
526,-0.22130999999999998
527,-0.24474
528,-0.28056
529,-0.35114
530,-0.44198999999999994
531,-0.52561
532,-0.59592
533,-0.66622
534,-0.73653
535,-0.80683
536,-0.87713
537,-0.94744
538,-0.9831200000000001
539,-1.0094
540,-1.0549
541,-1.1211
542,-1.1871
543,-1.2105
544,-1.234
545,-1.2574
546,-1.2808
547,-1.3043
548,-1.3277
549,-1.3511
550,-1.3746
551,-1.3918
552,-1.3997
553,-1.399
554,-1.3834
555,-1.3614
556,-1.3601
557,-1.3775
558,-1.3979
559,-1.3996
560,-1.401
561,-1.4175
562,-1.4409
563,-1.4644
564,-1.4877
565,-1.5037
566,-1.5071
567,-1.5012
568,-1.4864
569,-1.463
570,-1.4396
571,-1.4161
572,-1.4036
573,-1.3997
574,-1.3958
575,-1.376
576,-1.3527
577,-1.3462
578,-1.3447
579,-1.3361
580,-1.3130000000000002
581,-1.2952
582,-1.2923
583,-1.2976
584,-1.3119999999999998
585,-1.3335
586,-1.3452
587,-1.3459999999999999
588,-1.3565
589,-1.3754
590,-1.3944
591,-1.3997
592,-1.3997
593,-1.4165
594,-1.4385
595,-1.4534
596,-1.453
597,-1.4492
598,-1.4279
599,-1.409
600,-1.3997
601,-1.3997
602,-1.3997
603,-1.3997
604,-1.3899
605,-1.3713
606,-1.3479
607,-1.3244
608,-1.301
609,-1.2776
610,-1.2541
611,-1.2218
612,-1.176
613,-1.1291
614,-1.0822
615,-1.0354
616,-0.98849
617,-0.9416200000000001
618,-0.89475
619,-0.84788
620,-0.81005
621,-0.78151
622,-0.75298
623,-0.71412
624,-0.66725
625,-0.62038
626,-0.5735100000000001
627,-0.54509
628,-0.54032
629,-0.54032
630,0.23284000000000002
631,0.23284000000000002
632,0.23284000000000002
633,0.23284000000000002
634,0.23284000000000002
635,0.23284000000000002
636,0.23284000000000002
637,0.23284000000000002
638,0.23284000000000002
639,0.23284000000000002
640,0.23284000000000002
641,0.23284000000000002
642,0.22036999999999998
643,0.20240999999999998
644,0.19055999999999998
645,0.18756
646,0.18756
647,0.18756
648,0.18756
649,0.18756
650,0.18756
651,0.18756
652,0.18756
653,0.18756
654,0.18756
655,0.18756
656,0.18756
657,0.18756
658,0.18756
659,0.18756
660,0.18756
661,0.18756
662,0.18574000000000002
663,0.16915999999999998
664,0.14977000000000001
665,0.1426
666,0.14227
667,0.14227
668,0.14227
669,0.14227
670,0.14227
671,0.14227
672,0.14227
673,0.14227
674,0.14227
675,0.14227
676,0.14227
677,0.14227
678,0.14227
679,0.14227
680,0.14227
681,0.14227
682,0.14227
683,0.14227
684,0.14218
685,0.13915
686,0.12265999999999999
687,0.10615
688,0.096988
689,0.096988
690,0.096988
691,0.096988
692,0.096988
693,0.096988
694,0.096988
695,0.096988
696,0.096988
697,0.47439
698,0.38424
699,0.31451999999999997
700,0.30925
701,0.30925
702,0.30925
703,0.30925
704,0.30925
705,0.30925
706,0.30925
707,0.30925
708,0.30925
709,0.30925
710,0.30925
711,0.30925
712,0.30925
713,0.30925
714,0.30925
715,0.34049
716,0.42751000000000006
717,0.095113
718,0.096943
719,0.096988
720,0.096988
721,0.09817100000000001
722,0.10332999999999999
723,0.12309
724,0.13688
725,0.14227
726,0.13890999999999998
727,0.12771
728,0.10795
729,0.09942100000000001
730,0.096988
731,0.1035
732,0.11977
733,0.13953
734,0.15929000000000001
735,0.18033
736,0.2213
737,0.28257
738,0.35081
739,0.44959
740,0.5534399999999999
741,0.66664
742,0.7884899999999999
743,0.91743
744,1.0557
745,1.2045
746,1.36
747,1.5115
748,1.6542
749,1.7925
750,1.9308
751,2.0691
752,2.1966
753,2.3149
754,2.4295
755,2.5283
756,2.6151
757,2.6701
758,2.6972
759,2.6978
760,2.6582
761,2.6092
762,2.5524
763,2.4996
764,2.4549
765,2.4165
766,2.3919
767,2.3714
768,2.3516
769,2.3321
770,2.3196
771,2.3394
772,2.3537
773,2.3434
774,2.3156
775,2.2680000000000002
776,2.189
777,2.1099
778,2.0309
779,1.9331
780,1.8123
781,1.6740000000000002
782,1.5357
783,1.3974
784,1.2806
785,1.1776
786,1.0788
787,0.9800200000000001
788,0.88123
789,0.7824399999999999
790,0.68365
791,0.58487
792,0.48546999999999996
793,0.38019000000000003
794,0.26341
795,0.15650999999999998
796,0.37559000000000003
797,-0.13153
798,-0.48406000000000005
799,-0.20543000000000003
800,-0.29373
801,-0.37546
802,-0.44974
803,-0.51174
804,-0.57102
805,-0.64641
806,-0.7267100000000001
807,-0.8145899999999999
808,-0.91265
809,-1.0065
810,-1.0867
811,-1.1762
812,-1.2817
813,-1.3929
814,-1.4807
815,-1.54
816,-1.5893
817,-1.6319
818,-1.656
819,-1.6482
820,-1.6284
821,-1.5455
822,-1.4498
823,-1.3599
824,-1.2815
825,-1.2058
826,-1.1461
827,-1.0869
828,-1.0276
829,-0.9733799999999999
830,-0.93271
831,-0.91295
832,-0.8931899999999999
833,-0.8734299999999999
834,-0.8643799999999999
835,-0.8740100000000001
836,-0.8937700000000001
837,-0.88297
838,-0.86521
839,-0.83631
840,-0.79743
841,-0.7579199999999999
842,-0.7184
843,-0.68237
844,-0.6561
845,-0.63878
846,-0.62755
847,-0.62755
848,-0.6361
849,-0.6525
850,-0.66686
851,-0.67283
852,-0.67283
853,-0.73121
854,-0.8055100000000001
855,-0.8658799999999999
856,-0.90859
857,-0.94078
858,-0.9012700000000001
859,-0.86646
860,-0.8539700000000001
861,-0.85613
862,-0.86406
863,-0.88382
864,-0.88845
865,-0.87516
866,-0.86067
867,-0.8539700000000001
868,-0.8539700000000001
869,-0.8539700000000001
870,-0.8539700000000001
871,-0.8539700000000001
872,-0.8539700000000001
873,-0.8539700000000001
874,-0.8539700000000001
875,-0.8560700000000001
876,-0.8839600000000001
877,-0.9200200000000001
878,-0.94453
879,-0.94453
880,-0.94453
881,-0.94453
882,-0.9395700000000001
883,-0.9270799999999999
884,-0.9073200000000001
885,-0.8875700000000001
886,-0.8678100000000001
887,-0.8388899999999999
888,-0.80262
889,-0.7663800000000001
890,-0.74359
891,-0.7237399999999999
892,-0.71832
893,-0.7170000000000001
894,-0.70975
895,-0.68999
896,-0.67023
897,-0.6504800000000001
898,-0.6352
899,-0.62755
900,-0.62755
901,-0.62755
902,-0.62755
903,-0.61873
904,-0.6027399999999999
905,-0.58677
906,-0.58226
907,-0.58226
908,-0.58226
909,-0.5825899999999999
910,-0.5897600000000001
911,-0.60915
912,-0.62573
913,-0.62755
914,-0.62755
915,-0.62755
916,-0.62578
917,-0.61742
918,-0.5978399999999999
919,-0.58639
920,-0.58226
921,-0.58226
922,-0.58226
923,-0.58226
924,-0.58226
925,-0.58226
926,-0.58226
927,-0.58226
928,-0.58226
929,-0.58226
930,-0.58527
931,-0.59712
932,-0.61688
933,-0.63663
934,-0.6563899999999999
935,-0.66092
936,-0.64976
937,-0.6257
938,-0.5929399999999999
939,-0.55342
940,-0.5403100000000001
941,-0.53698
942,-0.54476
943,-0.5625100000000001
944,-0.58226
