time,value
0,2.2888
1,2.2888
2,2.2888
3,2.2888
4,2.2888
5,2.2888
6,2.2888
7,2.2888
8,2.2888
9,2.2888
10,2.2888
11,2.2888
12,2.2888
13,2.2888
14,2.2544
15,2.2005
16,2.1371
17,2.0601
18,1.9972
19,1.9972
20,1.9972
21,1.9972
22,1.9972
23,1.9972
24,1.9972
25,1.9972
26,1.9972
27,1.9944
28,1.9842
29,1.9665
30,1.8075
31,1.6484
32,1.4894
33,1.3303
34,1.1754
35,1.0232
36,0.87579
37,0.7365
38,0.60056
39,0.48488000000000003
40,0.3692
41,0.2653
42,0.16249
43,0.072635
44,-0.011339
45,-0.08993
46,-0.16222999999999999
47,-0.23456
48,-0.30699
49,-0.37951999999999997
50,-0.46628000000000003
51,-0.55304
52,-0.63173
53,-0.70814
54,-0.7789
55,-0.8451
56,-0.90796
57,-0.96394
58,-1.0187
59,-1.0621
60,-1.1054
61,-1.1593
62,-1.2148
63,-1.2617
64,-1.3039
65,-1.3375
66,-1.3593
67,-1.3769
68,-1.3769
69,-1.3769
70,-1.3769
71,-1.3769
72,-1.3769
73,-1.3769
74,-1.3741
75,-1.3688
76,-1.3612
77,-1.3478
78,-1.3352
79,-1.3352
80,-1.3352
81,-1.3258
82,-1.3146
83,-1.2971
84,-1.2756
85,-1.2503
86,-1.2186
87,-1.1852
88,-1.1418
89,-1.0984
90,-1.067
91,-1.0366
92,-1.0194
93,-1.008
94,-0.99774
95,-0.98872
96,-0.9749
97,-0.9459799999999999
98,-0.91706
99,-0.8881399999999999
100,-0.8592200000000001
101,-0.8303
102,-0.80138
103,-0.77595
104,-0.75327
105,-0.73333
106,-0.71887
107,-0.7044100000000001
108,-0.68995
109,-0.6754899999999999
110,-0.67176
111,-0.6695
112,-0.67391
113,-0.68187
114,-0.69102
115,-0.70176
116,-0.71038
117,-0.71038
118,-0.71038
119,-0.71038
120,-0.71038
121,-0.70316
122,-0.69348
123,-0.68414
124,-0.6751199999999999
125,-0.66976
126,-0.6733399999999999
127,-0.67947
128,-0.72285
129,-0.76623
130,-0.8096
131,-0.85298
132,-0.8876299999999999
133,-0.9166799999999999
134,-0.9390200000000001
135,-0.9505600000000001
136,-0.96031
137,-0.96031
138,-0.96031
139,-0.9481
140,-0.9349700000000001
141,-0.92715
142,-0.9215700000000001
143,-0.9164399999999999
144,-0.9118
145,-0.9049200000000001
146,-0.89126
147,-0.8781899999999999
148,-0.89265
149,-0.9071100000000001
150,-0.9215700000000001
151,-0.9360299999999999
152,-0.9577100000000001
153,-0.9849100000000001
154,-1.0154
155,-1.0525
156,-1.0853
157,-1.0853
158,-1.0853
159,-1.0634
160,-1.0387
161,-1.0006
162,-0.95547
163,-0.8932
164,-0.80843
165,-0.70839
166,-0.54933
167,-0.39027
168,-0.34131
169,-0.29475
170,-0.23581999999999997
171,-0.17281
172,-0.11077000000000001
173,-0.049613
174,0.006247699999999999
175,0.049627
176,0.093007
177,0.13639
178,0.17977
179,0.2134
180,0.24524
181,0.27978000000000003
182,0.316
183,0.35501
184,0.39839
185,0.44177
186,0.48515
187,0.52853
188,0.58432
189,0.6409699999999999
190,0.69206
191,0.74088
192,0.78708
193,0.8304600000000001
194,0.8735700000000001
195,0.9158799999999999
196,0.95741
197,0.9718700000000001
198,0.9863299999999999
199,0.99218
200,0.9958899999999999
201,0.99374
202,0.98724
203,0.9779700000000001
204,0.9635100000000001
205,0.94905
206,0.9346
207,0.92014
208,0.8945299999999999
209,0.8676
210,0.85031
211,0.8378399999999999
212,0.83436
213,0.8423200000000001
214,0.8547299999999999
215,0.88365
216,0.9125700000000001
217,0.91351
218,0.91404
219,0.9066200000000001
220,0.8966700000000001
221,0.88128
222,0.8611200000000001
223,0.8382799999999999
224,0.80937
225,0.78045
226,0.75153
227,0.7226100000000001
228,0.6936899999999999
229,0.66477
230,0.64048
231,0.6189899999999999
232,0.60029
233,0.5858300000000001
234,0.5713699999999999
235,0.55692
236,0.54246
237,0.528
238,0.51354
239,0.5121899999999999
240,0.5160399999999999
241,0.52508
242,0.5395399999999999
243,0.55382
244,0.56762
245,0.5809300000000001
246,0.5809300000000001
247,0.5809300000000001
248,0.54575
249,0.5022300000000001
250,0.45038999999999996
251,0.39255
252,0.33471
253,0.27687
254,0.21903000000000003
255,0.16119
256,0.10335
257,0.045515
258,-0.012325
259,-0.047639999999999995
260,-0.072049
261,-0.089227
262,-0.097452
263,-0.11023
264,-0.13915
265,-0.16807
266,-0.19699
267,-0.22591
268,-0.25483
269,-0.28374
270,-0.30637
271,-0.32361999999999996
272,-0.33648
273,-0.33966
274,-0.34503
275,-0.37395
276,-0.40287
277,-0.42166000000000003
278,-0.43877
279,-0.44466999999999995
280,-0.444
281,-0.43642
282,-0.41863999999999996
283,-0.39889
284,-0.36996999999999997
285,-0.34105
286,-0.33785
287,-0.336
288,-0.32876
289,-0.31948000000000004
290,-0.30512
291,-0.28562
292,-0.26400999999999997
293,-0.23668000000000003
294,-0.21051999999999998
295,-0.21051999999999998
296,-0.21051999999999998
297,-0.2195
298,-0.23051
299,-0.23558
300,-0.23651
301,-0.23279
302,-0.22085
303,-0.21051999999999998
304,-0.21051999999999998
305,-0.21051999999999998
306,-0.19896
307,-0.18622
308,-0.17231
309,-0.15785
310,-0.14532
311,-0.1351
312,-0.12721
313,-0.12721
314,-0.12721
