time,value
0,2.1962
1,2.0808
2,1.8468
3,1.5592
4,1.2903
5,1.0268
6,0.81565
7,0.55511
8,0.29386999999999996
9,0.19105
10,0.10496
11,-0.12159
12,-0.062286
13,-0.19877
14,-0.11719
15,-0.32666
16,-0.28884
17,-0.44067
18,-0.60998
19,-0.9575899999999999
20,-1.0361
21,-0.9919600000000001
22,-1.0354
23,-1.0170000000000001
24,-1.0827
25,-1.1605
26,-1.2313
27,-1.321
28,-1.2058
29,-1.3084
30,-1.2498
31,-1.2617
32,-1.2596
33,-1.2273
34,-1.2162
35,-1.1992
36,-1.1837
37,-1.0855
38,-1.0619
39,-1.0391
40,-0.9239
41,-0.82504
42,-0.7067
43,-0.56228
44,-0.39543
45,-0.29041999999999996
46,-0.15022
47,-0.0086458
48,0.15603
49,0.29655
50,0.31726
51,0.6715
52,0.9805200000000001
53,1.0088
54,0.76262
55,0.82819
56,1.1393
57,1.4511
58,1.7178
59,1.8071
60,1.8612
61,1.7881
62,1.7298
63,1.6784
64,1.6022
65,1.5187
66,1.5619
67,1.4862
68,1.455
69,1.3516
70,1.2642
71,1.0856
72,0.9007799999999999
73,0.8484200000000001
74,0.6937300000000001
75,0.5021899999999999
76,0.44498000000000004
77,0.24051
78,0.14944000000000002
79,0.0073143999999999995
80,-0.041074
81,-0.12025
82,-0.20811
83,-0.34038
84,-0.61333
85,-0.61375
86,-0.62045
87,-0.71373
88,-0.7319100000000001
89,-0.87434
90,-0.96006
91,-0.97621
92,-0.97464
93,-0.9558
94,-0.9602799999999999
95,-0.8504
96,-0.82526
97,-0.8572
98,-0.9450700000000001
99,-0.8468899999999999
100,-0.875
101,-0.9201299999999999
102,-0.8460200000000001
103,-0.97846
104,-0.8935299999999999
105,-0.78745
106,-0.73683
107,-0.72164
108,-0.68458
109,-0.52446
110,-0.63557
111,-0.45529
112,-0.44106999999999996
113,-0.20888
114,-0.23092
115,-0.052239
116,-0.091007
117,0.072215
118,0.060517999999999995
119,0.20649
120,0.17685
121,0.38885
122,0.52982
123,0.86056
124,1.1772
125,1.5530000000000002
126,1.8393
127,2.1398
