time,value
0,0.21553000000000003
1,0.21553000000000003
2,0.21553000000000003
3,0.21553000000000003
4,0.21553000000000003
5,0.21553000000000003
6,0.21553000000000003
7,0.21553000000000003
8,0.21553000000000003
9,0.21553000000000003
10,0.21553000000000003
11,0.21553000000000003
12,0.21553000000000003
13,0.21553000000000003
14,0.21553000000000003
15,0.21553000000000003
16,0.21553000000000003
17,0.21553000000000003
18,0.21553000000000003
19,0.21553000000000003
20,0.21553000000000003
21,0.21553000000000003
22,0.21553000000000003
23,0.21553000000000003
24,0.21553000000000003
25,0.21553000000000003
26,0.21553000000000003
27,0.21553000000000003
28,0.21553000000000003
29,0.21553000000000003
30,0.21553000000000003
31,0.21553000000000003
32,0.21553000000000003
33,0.21553000000000003
34,0.21553000000000003
35,0.21553000000000003
36,0.21553000000000003
37,0.21553000000000003
38,0.21553000000000003
39,0.21553000000000003
40,0.21553000000000003
41,0.21553000000000003
42,0.21553000000000003
43,0.21553000000000003
44,0.21553000000000003
45,0.21553000000000003
46,0.21036999999999997
47,0.19318
48,0.16693
49,0.14243
50,0.12465
51,0.12247000000000001
52,0.12104000000000001
53,0.11748
54,0.44865
55,0.30788000000000004
56,0.1671
57,0.14845999999999998
58,0.14043
59,0.14043
60,0.14043
61,0.14043
62,0.14519
63,0.2015
64,0.30935999999999997
65,0.4471
66,0.11445999999999999
67,0.12247000000000001
68,0.12247000000000001
69,0.12247000000000001
70,0.12247000000000001
71,0.12247000000000001
72,0.12247000000000001
73,0.13699
74,0.15863
75,0.18679
76,0.20501
77,0.21553000000000003
78,0.21553000000000003
79,0.21553000000000003
80,0.21553000000000003
81,0.21553000000000003
82,0.21553000000000003
83,0.21553000000000003
84,0.21553000000000003
85,0.21553000000000003
86,0.21553000000000003
87,0.21553000000000003
88,0.21553000000000003
89,0.20836999999999997
90,0.19419
91,0.16604000000000002
92,0.13789
93,0.10973
94,0.40123000000000003
95,0.26045999999999997
96,0.14427
97,0.14131
98,0.14043
99,0.11657000000000001
100,0.076177
101,-0.11889000000000001
102,-0.25966
103,-0.40044
104,-0.10690999999999999
105,-0.13269
106,-0.15374000000000002
107,-0.1567
108,-0.15682000000000001
109,-0.15711
110,-0.18278
111,-0.21094000000000002
112,-0.23909
113,-0.26724000000000003
114,-0.2954
115,-0.32355
116,-0.35170999999999997
117,-0.37986
118,-0.40802
119,-0.43617
120,-0.46433
121,-0.49248000000000003
122,-0.52064
123,-0.54879
124,-0.57695
125,-0.6051
126,-0.63325
127,-0.66141
128,-0.6895600000000001
129,-0.72944
130,-0.7767
131,-0.833
132,-0.8822200000000001
133,-0.9234
134,-0.95155
135,-0.9814700000000001
136,-1.0215
137,-1.0778
138,-1.1341
139,-1.1904
140,-1.2467
141,-1.3030000000000002
142,-1.3514
143,-1.3911
144,-1.4192
145,-1.4422
146,-1.4595
147,-1.4595
148,-1.4612
149,-1.4669
150,-1.4951
151,-1.5232
152,-1.5514
153,-1.5795
154,-1.6077
155,-1.6322
156,-1.6428
157,-1.6456
158,-1.6456
159,-1.6456
160,-1.6456
161,-1.6468
162,-1.6507
163,-1.675
164,-1.7031
165,-1.7313
166,-1.7145
167,-1.6898
168,-1.6616
169,-1.6682
170,-1.6859
171,-1.7141
172,-1.7192
173,-1.7069999999999999
174,-1.6791
175,-1.6556
176,-1.6456
177,-1.6456
178,-1.6456
179,-1.6456
180,-1.6456
181,-1.6456
182,-1.6456
183,-1.6456
184,-1.6456
185,-1.6366
186,-1.6201
187,-1.5919999999999999
188,-1.5638
189,-1.5357
190,-1.5075
191,-1.4794
192,-1.4416
193,-1.3865
194,-1.3303
195,-1.274
196,-1.2177
197,-1.1614
198,-1.1051
199,-1.0488
200,-0.99245
201,-0.9328
202,-0.86916
203,-0.7847
204,-0.70023
205,-0.6157699999999999
206,-0.5313100000000001
207,-0.44683999999999996
208,-0.36238000000000004
209,-0.27791
210,-0.19345
211,-0.11172
212,-0.21408000000000002
213,0.08708400000000001
214,0.37767
215,0.14057999999999998
216,0.22028000000000003
217,0.30474
218,0.3892
219,0.47367
220,0.55813
221,0.64259
222,0.74621
223,0.85509
224,0.9677100000000001
225,1.0943
226,1.2279
227,1.3687
228,1.5095
229,1.6502
230,1.7909
231,1.9272
232,2.0192
233,2.0755
234,2.1318
235,2.1743
236,2.2071
237,2.2353
238,2.2424
239,2.2341
240,2.2059
241,2.1778
242,2.1496
243,2.1215
244,2.0897
245,2.042
246,1.9576
247,1.8731
248,1.7967
249,1.7359
250,1.679
251,1.6227
252,1.5664
253,1.5101
254,1.4582
255,1.412
256,1.3832
257,1.3551
258,1.3269
259,1.2987
260,1.2706
261,1.2424
262,1.2143
263,1.1861
264,1.158
265,1.1298
266,1.1017
267,1.0716
268,1.0325
269,0.98134
270,0.9259700000000001
271,0.8738
272,0.83968
273,0.81152
274,0.78337
275,0.75521
276,0.72706
277,0.6989
278,0.6867
279,0.68083
280,0.68083
281,0.67008
282,0.6511899999999999
283,0.62303
284,0.59488
285,0.56672
286,0.53857
287,0.51042
288,0.49638000000000004
289,0.49471000000000004
290,0.49471000000000004
291,0.47175
292,0.43068999999999996
293,0.37438
294,0.33435
295,0.30859000000000003
296,0.30859000000000003
297,0.30859000000000003
298,0.30859000000000003
299,0.30859000000000003
300,0.30859000000000003
301,0.31589
302,0.34315
303,0.37112
304,0.39275
305,0.40046
306,0.40165
307,0.40671
308,0.42033999999999994
309,0.44698999999999994
310,0.47226999999999997
311,0.49361000000000005
312,0.49471000000000004
313,0.49471000000000004
314,0.49471000000000004
315,-0.09805
316,-0.09805
317,-0.09805
318,-0.09805
319,-0.09805
320,-0.09805
321,-0.09805
322,-0.09805
323,-0.09805
324,-0.09805
325,-0.09805
326,-0.09805
327,-0.09805
328,-0.09805
329,-0.09805
330,-0.09805
331,-0.09805
332,-0.09805
333,-0.09805
334,-0.09805
335,-0.09805
336,-0.09805
337,-0.09805
338,-0.09805
339,-0.09805
340,-0.09805
341,-0.09805
342,-0.09805
343,-0.09805
344,-0.09805
345,-0.09805
346,-0.09805
347,-0.09805
348,-0.09805
349,-0.09805
350,-0.09805
351,-0.09805
352,-0.09805
353,-0.09805
354,-0.09805
355,-0.09805
356,-0.09805
357,-0.09805
358,-0.09805
359,-0.09805
360,-0.09805
361,-0.09805
362,-0.09805
363,-0.09805
364,-0.13969
365,-0.25795999999999997
366,-0.10951
367,-0.17044
368,-0.22653
369,-0.23048000000000002
370,-0.23048000000000002
371,-0.23048000000000002
372,-0.28618000000000005
373,-0.34671
374,-0.40956
375,-0.43254
376,-0.44268
377,-0.44268
378,-0.44268
379,-0.44268
380,-0.44268
381,-0.44268
382,-0.44268
383,-0.44268
384,-0.44268
385,-0.40071999999999997
386,-0.34063000000000004
387,-0.27643
388,-0.24533000000000002
389,-0.23048000000000002
390,-0.23048000000000002
391,-0.23048000000000002
392,-0.23048000000000002
393,-0.23048000000000002
394,-0.23048000000000002
395,-0.23048000000000002
396,-0.23048000000000002
397,-0.23048000000000002
398,-0.23048000000000002
399,-0.23048000000000002
400,-0.23048000000000002
401,-0.25301
402,-0.29873
403,-0.36293000000000003
404,-0.4108
405,-0.44268
406,-0.44268
407,-0.44268
408,-0.44268
409,-0.44268
410,-0.44268
411,-0.44268
412,-0.44268
413,-0.44268
414,-0.44268
415,-0.44268
416,-0.44268
417,-0.44268
418,-0.44268
419,-0.44268
420,-0.44268
421,-0.44268
422,-0.44268
423,-0.44268
424,-0.44268
425,-0.44268
426,-0.44268
427,-0.44268
428,-0.44268
429,-0.44268
430,-0.44268
431,-0.44268
432,-0.44268
433,-0.44388
434,-0.46212
435,-0.50755
436,-0.57112
437,-0.6299100000000001
438,-0.6096
439,-0.5454
440,-0.4812
441,-0.45268
442,-0.44268
443,-0.44268
444,-0.46941000000000005
445,-0.5129600000000001
446,-0.57716
447,-0.6251800000000001
448,-0.65488
449,-0.65488
450,-0.65488
451,-0.65488
452,-0.65488
453,-0.65488
454,-0.6776800000000001
455,-0.73107
456,-0.79476
457,-0.8408399999999999
458,-0.8670700000000001
459,-0.8670700000000001
460,-0.8670700000000001
461,-0.8670700000000001
462,-0.8670700000000001
463,-0.8710100000000001
464,-0.88397
465,-0.9481700000000001
466,-1.0124
467,-1.0677
468,-1.0765
469,-1.0793
470,-1.0793
471,-1.0793
472,-1.0793
473,-1.0793
474,-1.0793
475,-1.0793
476,-1.0765
477,-1.0677
478,-1.0124
479,-0.9481700000000001
480,-0.88397
481,-0.92225
482,-0.9785799999999999
483,-1.0428
484,-1.0674
485,-1.0793
486,-1.0793
487,-1.053
488,-1.0070000000000001
489,-0.94327
490,-0.8898799999999999
491,-0.8670700000000001
492,-0.8670700000000001
493,-0.8670700000000001
494,-0.8670700000000001
495,-0.8670700000000001
496,-0.8670700000000001
497,-0.8373799999999999
498,-0.7893600000000001
499,-0.72516
500,-0.68161
501,-0.65488
502,-0.65488
503,-0.6448699999999999
504,-0.61636
505,-0.55216
506,-0.48795
507,-0.42375
508,-0.35955
509,-0.29535
510,-0.23115
511,-0.16695
512,-0.10275
513,-0.19942000000000001
514,0.12158
515,0.44258000000000003
516,0.15405
517,0.21825
518,0.28245
519,0.34665
520,0.41085
521,0.47505
522,0.53925
523,0.61021
524,0.72239
525,0.8453799999999999
526,0.97378
527,1.1022
528,1.2306
529,1.3549
530,1.4664
531,1.5414
532,1.6059999999999999
533,1.6716
534,1.7888
535,1.9172
536,2.0456
537,2.2177
538,2.4017
539,2.5943
540,2.7551
541,2.8998
542,3.0282
543,3.1196
544,3.1647
545,3.1647
546,3.1647
547,3.1647
548,3.1647
549,3.1647
550,3.1332
551,3.0795
552,3.0154
553,2.9272
554,2.8214
555,2.693
556,2.5646
557,2.4362
558,2.3078
559,2.1794
560,2.051
561,1.9226
562,1.7942
563,1.6658
564,1.5374
565,1.409
566,1.2806
567,1.1522
568,1.0238
569,0.90553
570,0.80011
571,0.73455
572,0.67035
573,0.60615
574,0.54195
575,0.47775
576,0.41355
577,0.34935
578,0.28515
579,0.22095
580,0.15675
581,0.4561
582,0.1351
583,-0.1859
584,-0.10005
585,-0.16425
586,-0.22845
587,-0.29265
588,-0.35685
589,-0.42105
590,-0.43859
591,-0.44268
592,-0.44268
593,-0.44268
594,-0.44268
595,-0.44268
596,-0.46717
597,-0.51026
598,-0.5744600000000001
599,-0.62765
600,-0.65488
601,-0.65488
602,-0.65488
603,-0.65488
604,-0.65488
605,-0.65488
606,-0.65488
607,-0.65488
608,-0.65488
609,-0.65488
610,-0.65488
611,-0.65488
612,-0.64555
613,-0.6210899999999999
614,-0.55689
615,-0.49268999999999996
616,-0.44511999999999996
617,-0.4431
618,-0.44268
619,-0.42778999999999995
620,-0.38116
621,-0.31968
622,-0.25548000000000004
623,-0.19128
624,-0.12708
625,-0.3539
626,-0.11060999999999999
627,-0.09805
628,-0.09805
629,-0.09805
630,-0.9208299999999999
631,-0.9208299999999999
632,-0.9208299999999999
633,-0.9208299999999999
634,-0.9208299999999999
635,-0.9208299999999999
636,-0.9208299999999999
637,-0.9208299999999999
638,-0.9208299999999999
639,-0.9208299999999999
640,-0.9208299999999999
641,-0.9208299999999999
642,-0.9208299999999999
643,-0.9208299999999999
644,-0.9208299999999999
645,-0.9208299999999999
646,-0.9208299999999999
647,-0.9208299999999999
648,-0.9208299999999999
649,-0.9208299999999999
650,-0.9208299999999999
651,-0.9208299999999999
652,-0.9208299999999999
653,-0.9208299999999999
654,-0.9208299999999999
655,-0.9208299999999999
656,-0.9208299999999999
657,-0.9208299999999999
658,-0.9208299999999999
659,-0.9208299999999999
660,-0.9684200000000001
661,-1.0614
662,-1.1737
663,-1.249
664,-1.2918
665,-1.2918
666,-1.2918
667,-1.2918
668,-1.2918
669,-1.2918
670,-1.2918
671,-1.2918
672,-1.2918
673,-1.2918
674,-1.2918
675,-1.2918
676,-1.2712
677,-1.2027
678,-1.0979999999999999
679,-1.0004
680,-0.92948
681,-0.9208299999999999
682,-0.9208299999999999
683,-0.9208299999999999
684,-0.9208299999999999
685,-0.9208299999999999
686,-0.9208299999999999
687,-0.9208299999999999
688,-0.9208299999999999
689,-0.9208299999999999
690,-0.9208299999999999
691,-0.9208299999999999
692,-0.9208299999999999
693,-0.9208299999999999
694,-0.9208299999999999
695,-0.9208299999999999
696,-0.9208299999999999
697,-0.9208299999999999
698,-0.9208299999999999
699,-0.9208299999999999
700,-0.8474799999999999
701,-0.74243
702,-0.6301899999999999
703,-0.57582
704,-0.54986
705,-0.54986
706,-0.54986
707,-0.54986
708,-0.54986
709,-0.53138
710,-0.47423999999999994
711,-0.36201
712,-0.24977
713,-0.23238000000000003
714,-0.3328
715,-0.44471000000000005
716,-0.51755
717,-0.54986
718,-0.54986
719,-0.54986
720,-0.54986
721,-0.54986
722,-0.54986
723,-0.54986
724,-0.54986
725,-0.54986
726,-0.53025
727,-0.42038000000000003
728,-0.30884
729,-0.21563000000000002
730,-0.1861
731,-0.17889000000000002
732,-0.17889000000000002
733,-0.17889000000000002
734,-0.17889000000000002
735,-0.17889000000000002
736,-0.17889000000000002
737,-0.17889000000000002
738,-0.17843
739,-0.17725
740,-0.38125
741,0.17993
742,0.14955
743,0.17878
744,0.19208
745,0.19208
746,0.19208
747,0.19208
748,0.19418
749,0.22608000000000003
750,0.3055
751,0.41718
752,0.52469
753,0.56305
754,0.56305
755,0.56305
756,0.62544
757,0.72018
758,0.83242
759,0.94466
760,1.0569
761,1.1691
762,1.2531
763,1.305
764,1.305
765,1.305
766,1.305
767,1.305
768,1.305
769,1.3449
770,1.4382
771,1.5496
772,1.6301
773,1.676
774,1.676
775,1.6553
776,1.6122
777,1.4999
778,1.3946
779,1.305
780,1.305
781,1.305
782,1.2895
783,1.1927
784,1.0852
785,0.97301
786,0.86077
787,0.74854
788,0.64748
789,0.5777800000000001
790,0.56305
791,0.56789
792,0.58324
793,0.68002
794,0.79225
795,0.90449
796,0.83757
797,0.7390899999999999
798,0.62685
799,0.5837399999999999
800,0.56305
801,0.56305
802,0.56305
803,0.56305
804,0.56305
805,0.56305
806,0.56305
807,0.56305
808,0.56305
809,0.62797
810,0.73318
811,0.8454200000000001
812,0.95765
813,1.0699
814,1.1821
815,1.2583
816,1.305
817,1.305
818,1.305
819,1.305
820,1.305
821,1.305
822,1.305
823,1.305
824,1.305
825,1.3378
826,1.4181
827,1.5283
828,1.5916
829,1.5975
830,1.4869
831,1.3880000000000001
832,1.305
833,1.305
834,1.305
835,1.2951
836,1.1840000000000002
837,1.0723
838,0.96001
839,0.84778
840,0.73554
841,0.6451399999999999
842,0.64632
843,0.72727
844,0.8323
845,0.915
846,0.9340200000000001
847,0.9347200000000001
848,0.93709
849,1.0297
850,1.1420000000000001
851,1.2542
852,1.2137
853,1.1313
854,1.0191
855,0.9625799999999999
856,0.9340200000000001
857,0.9340200000000001
858,0.9663299999999999
859,1.0392
860,1.1512
861,1.2576
862,1.305
863,1.305
864,1.305
865,1.3601
866,1.4539
867,1.5661
868,1.5945
869,1.5614
870,1.4491
871,1.3629
872,1.305
873,1.305
874,1.2978
875,1.2589
876,1.1467
877,1.0344
878,0.95416
879,0.9364399999999999
880,0.9340200000000001
881,0.9077799999999999
882,0.84044
883,0.732
884,0.6020399999999999
885,0.44963000000000003
886,0.22753
887,0.072688
888,-0.17889000000000002
889,-0.17889000000000002
890,-0.17889000000000002
891,-0.18579
892,-0.28385
893,-0.39036
894,-0.49395
895,-0.5352899999999999
896,-0.54986
897,-0.55745
898,-0.60116
899,-0.69281
900,-0.80132
901,-0.8970100000000001
902,-0.9208299999999999
903,-0.9208299999999999
904,-0.9208299999999999
905,-1.0024
906,-1.1075
907,-1.2197
908,-1.3319999999999999
909,-1.4442
910,-1.5564
911,-1.5830000000000002
912,-1.5446
913,-1.4324
914,-1.3394
915,-1.2918
916,-1.2918
917,-1.2918
918,-1.2918
919,-1.2918
920,-1.2918
921,-1.2918
922,-1.2918
923,-1.2918
924,-1.2918
925,-1.2918
926,-1.2918
927,-1.2918
928,-1.2918
929,-1.2918
930,-1.2918
931,-1.2627
932,-1.1540000000000001
933,-1.0425
934,-0.9563
935,-0.92558
936,-0.9208299999999999
937,-0.9208299999999999
938,-0.9208299999999999
939,-0.9208299999999999
940,-0.9208299999999999
941,-0.9208299999999999
942,-0.9208299999999999
943,-0.9208299999999999
944,-0.9208299999999999
