time,value
0,1.9231
1,1.9231
2,1.9231
3,1.9231
4,1.9231
5,1.9231
6,1.9231
7,1.9231
8,1.9231
9,1.9231
10,1.9231
11,1.9231
12,1.9231
13,1.9231
14,1.9096
15,1.8814
16,1.8255
17,1.8134
18,1.8134
19,1.8134
20,1.8134
21,1.8134
22,1.8134
23,1.7607
24,1.7196
25,1.7046
26,1.6131
27,1.4975
28,1.3598
29,1.2221
30,1.1006
31,0.99595
32,0.9271
33,0.8352200000000001
34,0.71946
35,0.54227
36,0.43222
37,0.36286
38,0.29052
39,0.1743
40,0.049758
41,-0.021188
42,-0.17906
43,-0.36023
44,-0.51121
45,-0.6131800000000001
46,-0.69524
47,-0.7640899999999999
48,-0.8649899999999999
49,-0.9949100000000001
50,-1.1658
51,-1.3438
52,-1.5061
53,-1.6438
54,-1.7509
55,-1.8129
56,-1.8238
57,-1.8864
58,-1.9178
59,-1.9178
60,-1.9178
61,-1.9178
62,-1.9129
63,-1.8556
64,-1.7597
65,-1.6493
66,-1.6039
67,-1.4812
68,-1.3109
69,-1.1054
70,-0.9692200000000001
71,-0.86464
72,-0.77203
73,-0.631
74,-0.4677
75,-0.28631999999999996
76,-0.19685999999999998
77,-0.12897
78,-0.062918
79,-0.11402999999999999
80,-0.13189
81,-0.071426
82,-0.057596
83,-0.052174
84,-0.052174
85,-0.005643100000000001
86,0.010583
87,-0.0055298000000000005
88,-0.037683
89,-0.052174
90,-0.050258
91,-0.024745
92,0.014838999999999998
93,0.057565
94,0.057565
95,0.051864
96,0.032963
97,-0.032741
98,-0.052174
99,-0.052174
100,-0.052174
101,-0.09813999999999999
102,-0.14565999999999998
103,-0.15929000000000001
104,-0.16191
105,-0.17659
106,-0.22063000000000002
107,-0.28598
108,-0.34219
109,-0.37818
110,-0.38139
111,-0.40032
112,-0.44365
113,-0.57781
114,-0.70527
115,-0.82035
116,-0.82035
117,-0.82035
118,-0.82035
119,-0.82035
120,-0.85736
121,-0.9139700000000001
122,-0.92585
123,-0.93009
124,-0.9378299999999999
125,-0.98361
126,-1.0175
127,-1.0322
128,-0.9976
129,-0.9374299999999999
130,-0.8685799999999999
131,-0.79973
132,-0.73088
133,-0.6659999999999999
134,-0.60938
135,-0.60087
136,-0.60127
137,-0.60232
138,-0.6644800000000001
139,-0.73333
140,-0.80218
141,-0.87103
142,-0.9144399999999999
143,-0.93009
144,-0.93009
145,-0.95234
146,-0.99375
147,-1.0263
148,-1.1473
149,-1.3402
150,-1.6023
151,-1.6611
152,-1.581
153,-1.3884
154,-1.2507
155,-1.1759
156,-1.2419
157,-1.2593
158,-1.2246
159,-1.0925
160,-1.0036
161,-0.92905
162,-0.8602
163,-0.79135
164,-0.73849
165,-0.71333
166,-0.74459
167,-0.7955399999999999
168,-0.86439
169,-0.90784
170,-0.9200799999999999
171,-0.8987700000000001
172,-0.83014
173,-0.7560100000000001
174,-0.67405
175,-0.53181
176,-0.35274
177,-0.1395
178,0.13485
179,0.40985
180,0.65973
181,0.7652800000000001
182,0.8460200000000001
183,0.90569
184,0.92911
185,0.90649
186,0.88535
187,0.91925
188,0.9893700000000001
189,1.0663
190,1.1355
191,1.3044
192,1.4793
193,1.6289
194,1.8177
195,1.9603
196,2.0284
197,2.0329
198,1.974
199,1.8461
200,1.651
201,1.5306
202,1.4842
203,1.4842
204,1.5076
205,1.5516
206,1.6205
207,1.6519
208,1.6456
209,1.5519999999999998
210,1.4418
211,1.3329
212,1.264
213,1.1952
214,1.1263
215,1.0575
216,0.98861
217,0.93919
218,0.93605
219,0.8861
220,0.82295
221,0.7541
222,0.68525
223,0.6164
224,0.54755
225,0.4787
226,0.42433999999999994
227,0.38765
228,0.36085
229,0.31304
230,0.24419000000000002
231,0.17534
232,0.11192
233,0.0579
234,0.062094
235,0.10545
236,0.16543
237,0.16683
238,0.16731
239,0.157
240,0.10073
241,0.07147300000000001
242,0.046981999999999996
243,0.0018980999999999998
244,-0.031225
245,-0.07159199999999999
246,-0.13939000000000001
247,-0.24097
248,-0.32898
249,-0.37511
250,-0.38139
251,-0.3769
252,-0.36537
253,-0.3068
254,-0.27165
255,-0.27165
256,-0.27165
257,-0.30301
258,-0.36672
259,-0.43556999999999996
260,-0.50441
261,-0.57326
262,-0.6421100000000001
263,-0.66179
264,-0.64577
265,-0.61256
266,-0.60087
267,-0.5966199999999999
268,-0.57216
269,-0.51665
270,-0.4478
271,-0.37895
272,-0.3101
273,-0.24241
274,-0.17775
275,-0.22028000000000003
276,-0.28913
277,-0.35798
278,-0.37576
279,-0.40199
280,-0.45616999999999996
281,-0.47962
282,-0.47257
283,-0.42958
284,-0.43345
285,-0.42368
286,-0.39632
287,-0.28483
288,-0.2072
289,-0.16191
290,-0.16191
291,-0.15638
292,-0.14068
293,-0.075674
294,-0.052174
295,-0.052174
296,-0.052174
297,-0.052174
298,-0.064251
299,-0.12017
300,-0.11102000000000001
301,-0.069299
302,-0.00044993
303,0.0684
304,0.13725
305,0.2061
306,0.25132
307,0.27705
308,0.27705
309,0.27705
310,0.27232
311,0.26114
312,0.19526
313,0.12641
314,0.057565
