time,value
0,-0.39111999999999997
1,-0.18102000000000001
2,0.029089
3,-0.39111999999999997
4,-0.39111999999999997
5,0.23920999999999998
6,0.44931000000000004
7,0.23920999999999998
8,0.44931000000000004
9,0.029089
10,-0.60127
11,-0.18102000000000001
12,1.2897
13,1.9201
14,0.8695299999999999
15,-1.8619
16,-1.8619
17,-0.81129
18,0.23920999999999998
19,1.9201
20,2.5504
21,1.4998
22,0.44931000000000004
23,-0.60127
24,-0.60127
25,-1.0214
26,-0.39111999999999997
27,-0.18102000000000001
28,-0.39111999999999997
29,-1.0214
30,-1.2316
31,-0.60127
32,-0.60127
33,-0.39111999999999997
34,-0.18102000000000001
35,-0.18102000000000001
36,0.44931000000000004
37,0.44931000000000004
38,0.44931000000000004
39,0.44931000000000004
40,0.029089
41,-0.39111999999999997
42,-0.39111999999999997
43,-0.18102000000000001
44,-0.18102000000000001
45,-0.60127
46,-0.60127
47,-0.18102000000000001
48,0.23920999999999998
49,0.23920999999999998
50,-0.18102000000000001
51,0.23920999999999998
52,2.1302
53,1.71
54,-1.0214
55,-2.4922
56,0.23920999999999998
57,1.9201
58,1.9201
59,0.8695299999999999
60,0.44931000000000004
61,-1.2316
62,-1.6517
63,-1.0214
64,0.23920999999999998
