time,value
0,-0.42171000000000003
1,-0.42171000000000003
2,-0.42171000000000003
3,-0.42171000000000003
4,-0.42171000000000003
5,-0.42171000000000003
6,-0.42171000000000003
7,-0.42171000000000003
8,-0.42171000000000003
9,-0.42171000000000003
10,-0.42171000000000003
11,-0.42171000000000003
12,-0.42171000000000003
13,-0.42171000000000003
14,-0.42171000000000003
15,-0.42171000000000003
16,-0.42171000000000003
17,-0.42171000000000003
18,-0.43091
19,-0.45391000000000004
20,-0.50103
21,-0.54814
22,-0.59526
23,-0.64237
24,-0.66213
25,-0.6682899999999999
26,-0.6682899999999999
27,-0.6682899999999999
28,-0.6682899999999999
29,-0.6682899999999999
30,-0.6682899999999999
31,-0.6682899999999999
32,-0.70262
33,-0.7436699999999999
34,-0.79079
35,-0.8379
36,-0.88249
37,-0.9194
38,-0.94705
39,-0.96816
40,-0.97405
41,-0.9765
42,-0.9765
43,-0.9765
44,-0.97221
45,-0.9631799999999999
46,-0.9407700000000001
47,-0.9172100000000001
48,-0.89366
49,-0.8701
50,-0.84654
51,-0.8229799999999999
52,-0.79391
53,-0.7601600000000001
54,-0.71305
55,-0.66593
56,-0.61882
57,-0.5717
58,-0.51354
59,-0.44365
60,-0.37303000000000003
61,-0.30236
62,-0.23168000000000002
63,-0.16101
64,-0.42494
65,-0.07157000000000001
66,0.2818
67,0.12343
68,0.2051
69,0.30858
70,0.42701000000000006
71,0.55776
72,0.69375
73,0.8351
74,0.93804
75,1.0345
76,1.1244
77,1.1983
78,1.2657
79,1.3246
80,1.375
81,1.4221
82,1.4692
83,1.5163
84,1.5634
85,1.6105
86,1.6523
87,1.6888
88,1.713
89,1.7366
90,1.7601
91,1.7819999999999998
92,1.7974
93,1.7974
94,1.8043
95,1.8163
96,1.8398
97,1.8529
98,1.8591
99,1.8591
100,1.8591
101,1.8591
102,1.867
103,1.8815
104,1.905
105,1.9018
106,1.8893
107,1.8658
108,1.8594
109,1.8578
110,1.8507
111,1.8332
112,1.8096
113,1.7861
114,1.7625
115,1.7389
116,1.694
117,1.6454
118,1.5924
119,1.5242
120,1.4535
121,1.3828
122,1.3121
123,1.2456
124,1.1957
125,1.1476
126,1.1005
127,1.0534
128,1.0193
129,0.9965299999999999
130,0.99608
131,0.97936
132,0.9401
133,0.89707
134,0.8598299999999999
135,0.8362799999999999
136,0.8043399999999999
137,0.76717
138,0.72006
139,0.66088
140,0.59527
141,0.5293100000000001
142,0.48644
143,0.46288
144,0.41989
145,0.36473
146,0.29405
147,0.2386
148,0.18764
149,0.1417
150,0.11305
151,0.47418999999999994
152,0.3564
153,0.23861
154,0.13835
155,0.18154
156,0.26609
157,0.38388
158,0.26609
159,0.13169
160,-0.11815999999999999
161,-0.25022
162,-0.4858
163,-0.14962
164,-0.19674
165,-0.23876
166,-0.26349
167,-0.29166
168,-0.32356
169,-0.37067
170,-0.41003
171,-0.44331000000000004
172,-0.46687
173,-0.48077
174,-0.48312
175,-0.48336
176,-0.48336
177,-0.48336
178,-0.47341000000000005
179,-0.45823
180,-0.43467
181,-0.42478999999999995
182,-0.42171000000000003
183,-0.42171000000000003
184,-0.42171000000000003
185,-0.42171000000000003
186,-0.42171000000000003
187,-0.42171000000000003
188,-0.42171000000000003
189,-0.45605
190,-0.4971
191,-0.54422
192,-0.59133
193,-0.63845
194,-0.6855600000000001
195,-0.73268
196,-0.77735
197,-0.80679
198,-0.8328
199,-0.85636
200,-0.8799100000000001
201,-0.9034700000000001
202,-0.9270299999999999
203,-0.9505899999999999
204,-0.96811
205,-0.9751700000000001
206,-0.97682
207,-0.9831799999999999
208,-1.0067
209,-1.0413
210,-1.0853
211,-1.1559
212,-1.2448
213,-1.3468
214,-1.4645
215,-1.5492
216,-1.5987
217,-1.6397
218,-1.6738
219,-1.6974
220,-1.7093
221,-1.7162
222,-1.7162
223,-1.7162
224,-1.7153
225,-1.7099
226,-1.6934
227,-1.6705
228,-1.6599
229,-1.6546
230,-1.6546
231,-1.6354
232,-1.6137
233,-1.5902
234,-1.5666
235,-1.5463
236,-1.5346
237,-1.5313
238,-1.5281
239,-1.5088
240,-1.4869
241,-1.4634
242,-1.4398
243,-1.4055
244,-1.3608
245,-1.2914
246,-1.2207
247,-1.15
248,-1.0761
249,-0.9890700000000001
250,-0.8712799999999999
251,-0.76039
252,-0.65455
253,-0.5603100000000001
254,-0.46608
255,-0.37196
256,-0.2793
257,-0.21009
258,-0.16297
259,-0.11585999999999999
260,-0.31695999999999996
261,-0.081385
262,0.08732899999999999
263,0.23271999999999998
264,0.35051
265,0.38229
266,0.39053000000000004
267,0.42586999999999997
268,0.097343
269,0.1209
270,0.14445999999999998
271,0.16802
272,0.19158
273,0.21513000000000002
274,0.23869
275,0.26225
276,0.28581
277,0.31346
278,0.35036999999999996
279,0.39496
280,0.43795
281,0.46426000000000006
282,0.4888
283,0.51235
284,0.53591
285,0.55947
286,0.58303
287,0.60659
288,0.62179
289,0.62571
290,0.62622
291,0.62622
292,0.62622
293,0.62622
294,0.62622
295,0.62622
296,0.62622
297,0.62668
298,0.6314
299,0.6592
300,0.70631
301,0.7339899999999999
302,0.7495
303,0.7495
304,0.7495
305,0.74912
306,0.7479399999999999
307,0.72948
308,0.7078
309,0.69288
310,0.68786
311,0.68786
312,0.68786
313,0.68786
314,0.68786
315,-0.5725100000000001
316,-0.5725100000000001
317,-0.5725100000000001
318,-0.5725100000000001
319,-0.5725100000000001
320,-0.5725100000000001
321,-0.5725100000000001
322,-0.5725100000000001
323,-0.5725100000000001
324,-0.5725100000000001
325,-0.5725100000000001
326,-0.5725100000000001
327,-0.5725100000000001
328,-0.5725100000000001
329,-0.5725100000000001
330,-0.5725100000000001
331,-0.5725100000000001
332,-0.5725100000000001
333,-0.57905
334,-0.59539
335,-0.6288699999999999
336,-0.6482100000000001
337,-0.6601199999999999
338,-0.6601199999999999
339,-0.6601199999999999
340,-0.6601199999999999
341,-0.6601199999999999
342,-0.6601199999999999
343,-0.6601199999999999
344,-0.6601199999999999
345,-0.6601199999999999
346,-0.6601199999999999
347,-0.68452
348,-0.7123
349,-0.74188
350,-0.74773
351,-0.7441399999999999
352,-0.72963
353,-0.70198
354,-0.6684899999999999
355,-0.6350100000000001
356,-0.60153
357,-0.56805
358,-0.53457
359,-0.5010899999999999
360,-0.46761
361,-0.43412
362,-0.39205999999999996
363,-0.33514
364,-0.27005999999999997
365,-0.2031
366,-0.13614
367,-0.31915
368,0.14232
369,0.35048
370,0.13171
371,0.19868
372,0.26564
373,0.3483
374,0.44763000000000003
375,0.5391699999999999
376,0.6211
377,0.68806
378,0.77154
379,0.8621700000000001
380,0.9626100000000001
381,1.1068
382,1.2683
383,1.4279
384,1.5719999999999998
385,1.705
386,1.8205
387,1.9286
388,2.029
389,2.1021
390,2.1719
391,2.2388
392,2.3058
393,2.3681
394,2.4183
395,2.4564
396,2.4899
397,2.5234
398,2.5541
399,2.5814
400,2.5814
401,2.5738
402,2.5588
403,2.5262
404,2.4927
405,2.4592
406,2.4211
407,2.3644
408,2.2639
409,2.1831
410,2.1166
411,2.0831
412,2.0347
413,1.9765
414,1.9096
415,1.8426
416,1.7757
417,1.7199
418,1.6735
419,1.6401
420,1.5686
421,1.4838
422,1.3834
423,1.2829
424,1.1844
425,1.094
426,1.0184
427,0.95309
428,0.9067700000000001
429,0.86719
430,0.8337100000000001
431,0.76991
432,0.70425
433,0.6372800000000001
434,0.5703199999999999
435,0.50336
436,0.43638999999999994
437,0.36943000000000004
438,0.30832
439,0.27094
440,0.24036999999999997
441,0.21597
442,0.21597
443,0.20673000000000002
444,0.18943
445,0.15627
446,0.12278
447,0.47325
448,0.32771999999999996
449,0.23051
450,0.23051
451,0.11139
452,-0.081987
453,-0.4168
454,-0.13853
455,-0.17855
456,-0.21203000000000002
457,-0.24550999999999998
458,-0.27899
459,-0.32629
460,-0.38223
461,-0.44919
462,-0.49451999999999996
463,-0.53401
464,-0.5674899999999999
465,-0.60097
466,-0.63178
467,-0.65299
468,-0.6601199999999999
469,-0.6601199999999999
470,-0.6601199999999999
471,-0.6601199999999999
472,-0.6601199999999999
473,-0.6936100000000001
474,-0.72709
475,-0.76057
476,-0.79405
477,-0.8275299999999999
478,-0.86101
479,-0.8945
480,-0.9279799999999999
481,-0.96146
482,-0.9949399999999999
483,-1.0284
484,-1.0619
485,-1.0954
486,-1.1289
487,-1.1623
488,-1.1958
489,-1.2293
490,-1.2563
491,-1.2734
492,-1.2734
493,-1.2592
494,-1.2377
495,-1.2042
496,-1.1902
497,-1.1858
498,-1.1858
499,-1.1858
500,-1.1858
501,-1.1858
502,-1.1858
503,-1.1858
504,-1.1614
505,-1.135
506,-1.1093
507,-1.1311
508,-1.1646
509,-1.1981
510,-1.2315
511,-1.2615
512,-1.2699
513,-1.2734
514,-1.2734
515,-1.2734
516,-1.2734
517,-1.2734
518,-1.2734
519,-1.2648
520,-1.2414
521,-1.2098
522,-1.1763
523,-1.1428
524,-1.1172
525,-1.0982
526,-1.0982
527,-1.0982
528,-1.0982
529,-1.0982
530,-1.0982
531,-1.0982
532,-1.0805
533,-1.0435
534,-0.97652
535,-0.90956
536,-0.8426
537,-0.77564
538,-0.73055
539,-0.69348
540,-0.6521899999999999
541,-0.59539
542,-0.5293399999999999
543,-0.48078999999999994
544,-0.4397
545,-0.40621999999999997
546,-0.37274
547,-0.33926
548,-0.30578
549,-0.2723
550,-0.23881999999999998
551,-0.20533
552,-0.17185
553,-0.14297
554,-0.13683
555,-0.13172
556,-0.12554
557,-0.43354
558,-0.26614
559,-0.098728
560,0.06867899999999999
561,0.23609000000000002
562,0.40349
563,0.10883
564,0.14232
565,0.1758
566,0.20928000000000002
567,0.24276
568,0.27624
569,0.29475999999999997
570,0.30366
571,0.30478
572,0.32256
573,0.35604
574,0.36701
575,0.35939
576,0.32591
577,0.29241999999999996
578,0.25894
579,0.22546
580,0.21643
581,0.21597
582,0.21597
583,0.21597
584,0.21597
585,0.21597
586,0.21597
587,0.21597
588,0.2463
589,0.27499
590,0.3001
591,0.30358
592,0.30941
593,0.32838
594,0.35827
595,0.38004
596,0.35436999999999996
597,0.32798
598,0.30358
599,0.30358
600,0.29434
601,0.27704
602,0.24388
603,0.22227
604,0.21669000000000002
605,0.20722
606,0.17915
607,0.11218
608,0.31239
609,0.07426
610,-0.09314800000000001
611,-0.26056
612,-0.42631
613,-0.12074000000000001
614,-0.13447
615,-0.13447
616,-0.13447
617,-0.13447
618,-0.13447
619,-0.13447
620,-0.13447
621,-0.13447
622,-0.13447
623,-0.13447
624,-0.13447
625,-0.13447
626,-0.13447
627,-0.13447
628,-0.13447
629,-0.13447
630,0.12380999999999999
631,0.12380999999999999
632,0.12380999999999999
633,0.12380999999999999
634,0.12380999999999999
635,0.12380999999999999
636,0.12380999999999999
637,0.12380999999999999
638,0.12380999999999999
639,0.12380999999999999
640,0.12380999999999999
641,0.12380999999999999
642,0.12380999999999999
643,0.12380999999999999
644,0.12380999999999999
645,0.12380999999999999
646,0.12380999999999999
647,0.12380999999999999
648,0.14240999999999998
649,0.18893
650,0.28424
651,0.37955
652,0.47485
653,0.10869000000000001
654,0.11667999999999999
655,0.11917
656,0.11917
657,0.11917
658,0.11917
659,0.11917
660,0.11917
661,0.11917
662,0.13305999999999998
663,0.14967
664,0.16873
665,0.18779
666,0.20889000000000002
667,0.23621
668,0.27102
669,0.30716
670,0.33099
671,0.35352
672,0.37618
673,0.43336
674,0.48707
675,0.53695
676,0.5760000000000001
677,0.61412
678,0.6522399999999999
679,0.69063
680,0.7338899999999999
681,0.7910699999999999
682,0.84826
683,0.9054399999999999
684,0.96262
685,1.0272
686,1.097
687,1.1732
688,1.2495
689,1.3257
690,1.402
691,1.4782
692,1.5545
693,1.6119
694,1.6612
695,1.6993
696,1.7375
697,1.7749
698,1.8085
699,1.8334
700,1.8525
701,1.8715
702,1.8906
703,1.9096
704,1.8821
705,1.8473
706,1.8057
707,1.7511
708,1.6939
709,1.6368
710,1.5796
711,1.5171
712,1.4288
713,1.3362
714,1.2409
715,1.1456
716,1.0503
717,0.955
718,0.85969
719,0.7586
720,0.64868
721,0.53368
722,0.41271
723,0.27928000000000003
724,0.15144000000000002
725,0.16510999999999998
726,-0.40673000000000004
727,-0.20106
728,-0.31529
729,-0.42775
730,-0.51175
731,-0.56894
732,-0.61331
733,-0.6470899999999999
734,-0.66615
735,-0.6743899999999999
736,-0.67886
737,-0.67886
738,-0.66494
739,-0.6482899999999999
740,-0.64066
741,-0.64995
742,-0.67087
743,-0.71344
744,-0.76368
745,-0.82086
746,-0.8607799999999999
747,-0.9016299999999999
748,-0.94452
749,-0.99972
750,-1.0536
751,-1.1
752,-1.1401
753,-1.1783
754,-1.2164
755,-1.252
756,-1.285
757,-1.3041
758,-1.3179
759,-1.3271
760,-1.3273
761,-1.334
762,-1.3499
763,-1.3686
764,-1.3876
765,-1.4067
766,-1.419
767,-1.4269999999999998
768,-1.4269999999999998
769,-1.4172
770,-1.4023
771,-1.3869999999999998
772,-1.3905
773,-1.4095
774,-1.4207
775,-1.4269999999999998
776,-1.4269999999999998
777,-1.4269999999999998
778,-1.4273
779,-1.4283
780,-1.4432
781,-1.4592
782,-1.4643
783,-1.4534
784,-1.4357
785,-1.4297
786,-1.4269999999999998
787,-1.4269999999999998
788,-1.4269999999999998
789,-1.4243
790,-1.4183
791,-1.4006
792,-1.3816
793,-1.3625
794,-1.3435
795,-1.3285
796,-1.3276
797,-1.3273
798,-1.3273
799,-1.3273
800,-1.3273
801,-1.3273
802,-1.3273
803,-1.3273
804,-1.3273
805,-1.3273
806,-1.3273
807,-1.3273
808,-1.3273
809,-1.3273
810,-1.3273
811,-1.3273
812,-1.3268
813,-1.3237
814,-1.3114
815,-1.2923
816,-1.2732
817,-1.2542
818,-1.2351
819,-1.2022
820,-1.1673
821,-1.1314
822,-1.109
823,-1.0899
824,-1.0709
825,-1.0518
826,-1.0347
827,-1.03
828,-1.028
829,-1.028
830,-1.028
831,-1.0245
832,-1.0172
833,-0.99908
834,-0.9800200000000001
835,-0.96096
836,-0.9416399999999999
837,-0.9174399999999999
838,-0.8793200000000001
839,-0.83673
840,-0.7903600000000001
841,-0.73318
842,-0.66864
843,-0.5988
844,-0.52256
845,-0.45525
846,-0.39743
847,-0.33518000000000003
848,-0.26745
849,-0.19121
850,-0.12435999999999998
851,-0.28124
852,0.069051
853,0.41515
854,0.16960999999999998
855,0.26047
856,0.3425
857,0.41875
858,0.49499
859,0.57124
860,0.64748
861,0.70819
862,0.76558
863,0.81927
864,0.86001
865,0.89285
866,0.91191
867,0.91719
868,0.91981
869,0.9353799999999999
870,0.9515299999999999
871,0.9670700000000001
872,0.9670700000000001
873,0.9670700000000001
874,0.9670700000000001
875,0.9670700000000001
876,0.9612799999999999
877,0.9466700000000001
878,0.92965
879,0.91719
880,0.91719
881,0.91719
882,0.91719
883,0.91719
884,0.90015
885,0.87226
886,0.83668
887,0.83904
888,0.8771700000000001
889,0.89607
890,0.89909
891,0.88003
892,0.8826
893,0.8927299999999999
894,0.91179
895,0.93085
896,0.95099
897,0.97577
898,1.0090000000000001
899,1.0462
900,1.0726
901,1.0951
902,1.1142
903,1.1332
904,1.1523
905,1.1713
906,1.1904
907,1.2028
908,1.2003
909,1.1853
910,1.1629
911,1.127
912,1.0897
913,1.0516
914,1.0135
915,0.9753299999999999
916,0.93721
917,0.89909
918,0.8609600000000001
919,0.82284
920,0.78223
921,0.73611
922,0.67893
923,0.62175
924,0.5645600000000001
925,0.50738
926,0.45995
927,0.41811000000000004
928,0.37999
929,0.34187
930,0.30374
931,0.25776
932,0.20685
933,0.14967
934,0.1048
935,0.34457
936,0.15872
937,0.3232
938,-0.060118
939,-0.19037
940,-0.36066
941,-0.11417999999999999
942,-0.13928
943,-0.16103
944,-0.18009
