time,value
0,-0.21253000000000002
1,0.027677999999999998
2,-0.05921900000000001
3,-0.20667
4,0.064579
5,-0.47558
6,0.27468000000000004
7,-0.09199600000000001
8,-0.37401999999999996
9,0.17367
10,-0.032474
11,-0.021156
12,0.023502000000000002
13,-0.29136
14,0.29593
15,-0.17765999999999998
16,0.12483
17,0.50876
18,0.30735
19,-0.17024
20,0.10839000000000001
21,-0.18807000000000001
22,0.48657
23,0.040526
24,-0.095542
25,0.29391999999999996
26,-0.06976399999999999
27,0.35419
28,0.12182
29,-0.63494
30,-0.12934
31,0.53871
32,-0.25082
33,0.11639000000000001
34,0.21705
35,-0.71062
36,-0.67072
37,-0.22899999999999998
38,0.51956
39,0.097248
40,0.25351999999999997
41,-0.054822
42,-0.28899
43,0.095926
44,0.61831
45,0.40437
46,0.13024000000000002
47,-0.37877
48,0.031052999999999997
49,0.27382
50,0.12788
51,0.26898
52,0.055539
53,-0.18175999999999998
54,0.12394000000000001
55,-0.054148
56,-0.28361
57,-0.068281
58,0.27521
59,-0.24173000000000003
60,-0.20306
61,-0.5290600000000001
62,-0.11819
63,-0.18774000000000002
64,-1.4534
65,-1.4534
66,-1.4534
67,-1.4534
68,-1.4534
69,-1.4534
70,-1.4534
71,-1.4534
72,-1.4534
73,-1.4534
74,-1.4534
75,-1.4534
76,-1.4534
77,-1.4534
78,-1.4534
79,1.4108
80,1.4108
81,1.4108
82,1.4108
83,1.4108
84,1.4108
85,1.4108
86,1.4108
87,1.4108
88,1.4108
89,1.4108
90,1.4108
91,1.4108
92,1.4108
93,1.4108
94,-0.38379
95,0.020980000000000002
96,0.093279
97,-0.16804000000000002
98,1.4108
99,1.4108
100,1.4108
101,1.4108
102,1.4108
103,1.4108
104,1.4108
105,1.4108
106,1.4108
107,1.4108
108,1.4108
109,1.4108
110,1.4108
111,1.4108
112,1.4108
113,-1.4534
114,-1.4534
115,-1.4534
116,-1.4534
117,-1.4534
118,-1.4534
119,-1.4534
120,-1.4534
121,-1.4534
122,-1.4534
123,-1.4534
124,-1.4534
125,-1.4534
126,-1.4534
127,0.58958
