time,value
0,-0.61729
1,-0.61729
2,-0.61729
3,-0.61729
4,-0.61729
5,-0.61729
6,-0.61729
7,-0.61729
8,-0.61729
9,-0.61234
10,-0.60349
11,-0.56123
12,-0.51403
13,-0.46683
14,-0.42618999999999996
15,-0.39227
16,-0.3857
17,-0.3857
18,-0.3857
19,-0.3857
20,-0.3857
21,-0.3857
22,-0.3857
23,-0.3857
24,-0.37761
25,-0.35549000000000003
26,-0.31637
27,-0.26916999999999996
28,-0.22196999999999997
29,-0.18275999999999998
30,-0.16211
31,-0.15412
32,-0.15412
33,-0.15412
34,-0.15412
35,-0.15412
36,-0.15412
37,-0.15412
38,-0.15412
39,-0.15412
40,-0.15412
41,-0.15412
42,-0.15412
43,-0.15412
44,-0.15412
45,-0.15412
46,-0.15412
47,-0.15412
48,-0.15412
49,-0.15412
50,-0.15412
51,-0.15412
52,-0.15412
53,-0.15313
54,-0.15166
55,-0.10544
56,-0.058237
57,-0.011035
58,0.032615
59,0.073917
60,0.07746900000000001
61,0.07746900000000001
62,0.07746900000000001
63,0.07746900000000001
64,0.07746900000000001
65,0.07746900000000001
66,0.07746900000000001
67,0.07746900000000001
68,0.091427
69,0.12093
70,0.20138
71,0.29578000000000004
72,0.39018
73,0.46892
74,0.5249699999999999
75,0.54064
76,0.54064
77,0.54064
78,0.54876
79,0.5723600000000001
80,0.61144
81,0.65865
82,0.70585
83,0.74521
84,0.76439
85,0.77223
86,0.77223
87,0.77223
88,0.7792
89,0.81166
90,0.85188
91,0.8990799999999999
92,0.9462799999999999
93,0.98793
94,0.99826
95,1.0038
96,1.0038
97,1.0038
98,1.0038
99,1.0038
100,1.0038
101,1.0038
102,1.0038
103,1.0048
104,1.0505
105,1.0967
106,1.1439
107,1.1892
108,1.2335
109,1.2354
110,1.2354
111,1.2354
112,1.2397
113,1.2471
114,1.29
115,1.3372
116,1.3844
117,1.4316
118,1.4788
119,1.526
120,1.5732
121,1.6204
122,1.6603
123,1.6912
124,1.6986
125,1.6986
126,1.6986
127,1.6906
128,1.6699
129,1.6307
130,1.5835
131,1.5363
132,1.4972
133,1.4751
134,1.4669999999999999
135,1.4669999999999999
136,1.4669999999999999
137,1.4669999999999999
138,1.4669999999999999
139,1.4669999999999999
140,1.4669999999999999
141,1.4669999999999999
142,1.4669999999999999
143,1.4669999999999999
144,1.4669999999999999
145,1.4669999999999999
146,1.4669999999999999
147,1.462
148,1.4237
149,1.3814
150,1.3342
151,1.287
152,1.2398
153,1.1926
154,1.1454
155,1.0982
156,1.051
157,1.0038
158,0.9566100000000001
159,0.90941
160,0.86221
161,0.815
162,0.7678
163,0.7206
164,0.6734
165,0.6261899999999999
166,0.57899
167,0.53179
168,0.48458999999999997
169,0.43738999999999995
170,0.39018
171,0.34955
172,0.31561999999999996
173,0.30905
174,0.30905
175,0.30905
176,0.30905
177,0.30905
178,0.30905
179,0.30905
180,0.30905
181,0.30096999999999996
182,0.27884000000000003
183,0.23973000000000003
184,0.19252
185,0.14532
186,0.09812
187,0.050918
188,0.0037161
189,-0.043486000000000004
190,-0.090688
191,-0.13789
192,-0.18509
193,-0.23229
194,-0.2795
195,-0.3267
196,-0.3739
197,-0.4211
198,-0.46831000000000006
199,-0.51551
200,-0.56271
201,-0.60563
202,-0.613
203,-0.61729
204,-0.61729
205,-0.61729
206,-0.61729
207,-0.61729
208,-0.61729
209,-0.61729
210,-0.61729
211,-0.61729
212,-0.61729
213,-0.61729
214,-0.61729
215,-0.6101800000000001
216,-0.59838
217,-0.51108
218,-0.41668
219,-0.32227
220,-0.23342
221,-0.14934
222,-0.096588
223,-0.049386
224,-0.0021844
225,0.045018
226,0.09222000000000001
227,0.13942000000000002
228,0.18662
229,0.23383
230,0.27319
231,0.30122
232,0.30905
233,0.30905
234,0.30905
235,0.30905
236,0.30905
237,0.30905
238,0.30905
239,0.30905
240,0.30905
241,0.30905
242,0.30905
243,0.30905
244,0.30905
245,0.30208
246,0.26961999999999997
247,0.2294
248,0.1822
249,0.135
250,0.087795
251,0.040593000000000004
252,-0.0066094
253,-0.053811000000000005
254,-0.10101
255,-0.14822000000000002
256,-0.19542
257,-0.24261999999999997
258,-0.28981999999999997
259,-0.33702
260,-0.38521
261,-0.47813999999999995
262,-0.5715600000000001
263,-0.66596
264,-0.75656
265,-0.8450700000000001
266,-0.8488700000000001
267,-0.8488700000000001
268,-0.8488700000000001
269,-0.8488700000000001
270,-0.8488700000000001
271,-0.8488700000000001
272,-0.8488700000000001
273,-0.8488700000000001
274,-0.8671399999999999
275,-0.90255
276,-1.0259
277,-1.1675
278,-1.3091
279,-1.436
280,-1.5452
281,-1.6071
282,-1.6543
283,-1.7015
284,-1.7487
285,-1.7959
286,-1.8431
287,-1.8903
288,-1.9375
289,-1.9766
290,-1.9987
291,-2.0068
292,-2.0068
293,-2.0068
294,-2.0068
295,-2.0068
296,-2.0068
297,-2.0068
298,-2.0068
299,-2.0068
300,-2.0068
301,-2.0068
302,-2.0068
303,-2.0068
304,-2.0117
305,-2.0501
306,-2.0924
307,-2.1396
308,-2.1868
309,-2.234
310,-2.2812
311,-2.3284
312,-2.3756
313,-2.4228
314,-2.47
