time,value
0,-0.10559
1,-0.10559
2,-0.10559
3,-0.10559
4,-0.10559
5,-0.10559
6,-0.10559
7,-0.10559
8,-0.10559
9,-0.10559
10,-0.10559
11,-0.10559
12,-0.10559
13,-0.10559
14,-0.10559
15,-0.10559
16,-0.10559
17,-0.10559
18,-0.10559
19,-0.10559
20,-0.10559
21,-0.10559
22,-0.10559
23,-0.10559
24,-0.10559
25,-0.10559
26,-0.10559
27,-0.10559
28,-0.10559
29,-0.10559
30,-0.10559
31,-0.10559
32,-0.10559
33,-0.10559
34,-0.10559
35,-0.10559
36,-0.10559
37,-0.10559
38,-0.10559
39,-0.10559
40,-0.10559
41,-0.10559
42,-0.10559
43,-0.10559
44,-0.10559
45,-0.10559
46,-0.10559
47,-0.10559
48,-0.10559
49,-0.10559
50,-0.10559
51,-0.10559
52,-0.10559
53,-0.10559
54,-0.10559
55,-0.10559
56,-0.10559
57,-0.10559
58,-0.10559
59,-0.10559
60,-0.10559
61,-0.10559
62,-0.10559
63,-0.10559
64,-0.10559
65,-0.10559
66,-0.10559
67,-0.10559
68,-0.10559
69,-0.10559
70,-0.10559
71,-0.10559
72,-0.10559
73,-0.10559
74,-0.10559
75,-0.10559
76,-0.10559
77,-0.10559
78,-0.10559
79,-0.10559
80,-0.10559
81,-0.10559
82,-0.10559
83,-0.10559
84,-0.10559
85,-0.10559
86,-0.10559
87,-0.10559
88,-0.10559
89,-0.10559
90,-0.10559
91,-0.10559
92,-0.10559
93,-0.10559
94,-0.10559
95,-0.10559
96,-0.10559
97,-0.10559
98,-0.10559
99,-0.10559
100,-0.10559
101,-0.10559
102,-0.10559
103,-0.10559
104,-0.10559
105,-0.10559
106,-0.10559
107,-0.10559
108,-0.10559
109,-0.10559
110,-0.10559
111,-0.10559
112,-0.10559
113,-0.10559
114,-0.10559
115,-0.10559
116,-0.10559
117,-0.10559
118,-0.10559
119,-0.10559
120,-0.10559
121,-0.10559
122,-0.10559
123,-0.10559
124,-0.10559
125,-0.10559
126,-0.10559
127,-0.10559
128,-0.10559
129,-0.10559
130,-0.10559
131,-0.10559
132,-0.10559
133,-0.10559
134,-0.10559
135,-0.10559
136,-0.10559
137,-0.10559
138,-0.10559
139,-0.10559
140,-0.10559
141,-0.10559
142,-0.10559
143,-0.10559
144,-0.10559
145,-0.10559
146,-0.10559
147,-0.10559
148,-0.10559
149,-0.10559
150,-0.10559
151,-0.10559
152,-0.10559
153,-0.10559
154,-0.10559
155,-0.10559
156,-0.10559
157,-0.10559
158,-0.10559
159,-0.10559
160,-0.10559
161,-0.10559
162,-0.10559
163,-0.10559
164,-0.10559
165,-0.10559
166,-0.10559
167,-0.10559
168,-0.10559
169,-0.10559
170,-0.10559
171,-0.10559
172,-0.10559
173,-0.10559
174,-0.10559
175,-0.10559
176,-0.10559
177,-0.10559
178,-0.10559
179,-0.10559
180,-0.10559
181,-0.10559
182,-0.10559
183,-0.10559
184,-0.10559
185,-0.10559
186,-0.10559
187,-0.10559
188,-0.10559
189,-0.10559
190,-0.10559
191,-0.10559
192,-0.10559
193,-0.10559
194,-0.10559
195,-0.10559
196,-0.10559
197,-0.10559
198,-0.10559
199,-0.10559
200,-0.10559
201,-0.10559
202,-0.10559
203,-0.10559
204,-0.10559
205,-0.10559
206,-0.10559
207,-0.10559
208,-0.10559
209,-0.10559
210,-0.10559
211,-0.10559
212,-0.10559
213,-0.10559
214,-0.10559
215,-0.10559
216,-0.10559
217,-0.10559
218,-0.10559
219,-0.10559
220,-0.10559
221,-0.10559
222,-0.10559
223,-0.10559
224,-0.10559
225,-0.10559
226,-0.10559
227,-0.10559
228,-0.10559
229,-0.10559
230,-0.10559
231,-0.10559
232,-0.10559
233,-0.10559
234,-0.10559
235,-0.10559
236,-0.10559
237,-0.10559
238,-0.10559
239,-0.10559
240,-0.10559
241,-0.10559
242,-0.10559
243,-0.10559
244,-0.10559
245,-0.10559
246,-0.10559
247,-0.10559
248,-0.10559
249,-0.10559
250,-0.10559
251,-0.10559
252,-0.10559
253,-0.10559
254,-0.10559
255,-0.10559
256,-0.10559
257,-0.10559
258,-0.10559
259,-0.10559
260,-0.10559
261,-0.10559
262,-0.10559
263,-0.10559
264,-0.10559
265,-0.10559
266,-0.10559
267,-0.10559
268,-0.10559
269,-0.10559
270,-0.10559
271,-0.10559
272,-0.10559
273,-0.10559
274,-0.10559
275,-0.10559
276,-0.10559
277,-0.10559
278,-0.10559
279,-0.10559
280,-0.10559
281,-0.10559
282,-0.10559
283,-0.10559
284,-0.10559
285,-0.10559
286,-0.10559
287,-0.10559
288,-0.10559
289,-0.10559
290,-0.10559
291,-0.10559
292,-0.10559
293,-0.10559
294,-0.10559
295,-0.10559
296,-0.10559
297,-0.10559
298,-0.10559
299,-0.10559
300,-0.10559
301,-0.10559
302,-0.10559
303,-0.10559
304,-0.10559
305,-0.10559
306,-0.10559
307,-0.10559
308,-0.10559
309,-0.10559
310,-0.10559
311,-0.10559
312,-0.10559
313,-0.10559
314,-0.10559
315,-0.10559
316,-0.10559
317,-0.10559
318,-0.10559
319,-0.10559
320,-0.10559
321,-0.10559
322,-0.10559
323,-0.10559
324,-0.10559
325,-0.10559
326,-0.10559
327,-0.10559
328,-0.10559
329,-0.10559
330,-0.10559
331,-0.10559
332,-0.10559
333,-0.10559
334,-0.10559
335,-0.10559
336,-0.10559
337,-0.10559
338,-0.10559
339,-0.10559
340,-0.10559
341,-0.10559
342,-0.10559
343,-0.10559
344,-0.10559
345,-0.10559
346,-0.10559
347,-0.10559
348,-0.10559
349,-0.10559
350,-0.10559
351,-0.10559
352,-0.10559
353,-0.10559
354,-0.10559
355,-0.10559
356,-0.10559
357,-0.10559
358,-0.10559
359,-0.10559
360,-0.10559
361,-0.10559
362,-0.10559
363,-0.10559
364,-0.10559
365,-0.10559
366,-0.10559
367,-0.10559
368,-0.10559
369,-0.10559
370,-0.10559
371,-0.10559
372,-0.10559
373,-0.10559
374,-0.10559
375,-0.10559
376,-0.10559
377,-0.10559
378,-0.10559
379,-0.10559
380,-0.10559
381,-0.10559
382,-0.10559
383,-0.10559
384,-0.10559
385,-0.10559
386,-0.10559
387,-0.10559
388,-0.10559
389,-0.10559
390,-0.10559
391,-0.10559
392,-0.10559
393,-0.10559
394,-0.10559
395,-0.10559
396,-0.10559
397,-0.10559
398,-0.10559
399,-0.10559
400,-0.10559
401,-0.10559
402,-0.10559
403,-0.10559
404,-0.10559
405,-0.10559
406,-0.10559
407,-0.10559
408,-0.10559
409,-0.10559
410,-0.10559
411,-0.10559
412,-0.10559
413,-0.10559
414,-0.10559
415,-0.10559
416,-0.10559
417,-0.10559
418,-0.10559
419,-0.10559
420,-0.10559
421,-0.10559
422,-0.10559
423,-0.10559
424,-0.10559
425,-0.10559
426,-0.10559
427,-0.10559
428,-0.10559
429,-0.10559
430,-0.10559
431,-0.10559
432,-0.10559
433,-0.10559
434,-0.10559
435,-0.10559
436,-0.10559
437,-0.10559
438,-0.10559
439,-0.10559
440,-0.10559
441,-0.10559
442,-0.10559
443,-0.10559
444,-0.10559
445,-0.10559
446,-0.10559
447,-0.10559
448,-0.10559
449,-0.10559
450,-0.10559
451,-0.10559
452,-0.10559
453,-0.10559
454,-0.10559
455,-0.10559
456,-0.10559
457,-0.10559
458,-0.10559
459,-0.10559
460,-0.10559
461,-0.10559
462,-0.10559
463,-0.10559
464,-0.10559
465,-0.10559
466,-0.10559
467,-0.10559
468,-0.10559
469,-0.10559
470,-0.10559
471,-0.10559
472,-0.10559
473,-0.10559
474,-0.10559
475,-0.10559
476,-0.10559
477,-0.10559
478,-0.10559
479,-0.10559
480,-0.10559
481,-0.10559
482,-0.10559
483,-0.10559
484,-0.10559
485,-0.10559
486,-0.10559
487,-0.10559
488,-0.10559
489,-0.10559
490,-0.10559
491,-0.10559
492,-0.10559
493,-0.10559
494,-0.10559
495,-0.10559
496,-0.10559
497,-0.10559
498,-0.10559
499,-0.10559
500,-0.10559
501,-0.10559
502,-0.10559
503,-0.10559
504,-0.10559
505,-0.10559
506,-0.10559
507,-0.10559
508,-0.10559
509,-0.10559
510,-0.10559
511,-0.10559
512,-0.10559
513,-0.10559
514,-0.10559
515,-0.10559
516,-0.10559
517,-0.10559
518,-0.10559
519,-0.10559
520,-0.10559
521,-0.10559
522,-0.10559
523,-0.10559
524,-0.10559
525,-0.10559
526,-0.10559
527,-0.10559
528,-0.10559
529,-0.10559
530,-0.10559
531,-0.10559
532,-0.10559
533,-0.10559
534,-0.10559
535,-0.10559
536,-0.10559
537,-0.10559
538,-0.10559
539,-0.10559
540,-0.10559
541,-0.10559
542,-0.10559
543,-0.10559
544,-0.10559
545,-0.10559
546,-0.10559
547,-0.10559
548,-0.10559
549,-0.10559
550,-0.10559
551,-0.10559
552,-0.10559
553,-0.10559
554,-0.10559
555,-0.10559
556,-0.10559
557,-0.10559
558,-0.10559
559,-0.10559
560,-0.10559
561,-0.10559
562,-0.10559
563,-0.10559
564,-0.10559
565,-0.10559
566,-0.10559
567,-0.10559
568,-0.10559
569,-0.10559
570,-0.10559
571,-0.10559
572,-0.10559
573,-0.10559
574,-0.10559
575,-0.10559
576,-0.10559
577,-0.10559
578,-0.10559
579,-0.10559
580,-0.10559
581,-0.10559
582,-0.10559
583,-0.10559
584,-0.10559
585,-0.10559
586,-0.10559
587,-0.10559
588,-0.10559
589,-0.10559
590,-0.10559
591,-0.10559
592,-0.10559
593,-0.10559
594,-0.10559
595,-0.10559
596,-0.10559
597,-0.10559
598,-0.10559
599,-0.10559
600,-0.10559
601,-0.10559
602,-0.10559
603,-0.10559
604,-0.10559
605,-0.10559
606,-0.10559
607,-0.10559
608,-0.10559
609,-0.10559
610,-0.10559
611,-0.10559
612,-0.10559
613,-0.10559
614,-0.10559
615,-0.10559
616,-0.10559
617,-0.10559
618,-0.10559
619,-0.10559
620,-0.10559
621,-0.10559
622,-0.10559
623,-0.10559
624,-0.10559
625,-0.10559
626,-0.10559
627,-0.10559
628,-0.10559
629,-0.10559
630,-0.10559
631,-0.10559
632,-0.10559
633,0.57318
634,8.0396
635,10.076
636,10.076
637,10.076
638,12.112
639,8.0396
640,10.076
641,5.3246
642,0.57318
643,-0.10559
644,-0.10559
645,-0.10559
646,-0.10559
647,-0.10559
648,-0.10559
649,-0.10559
650,-0.10559
651,-0.10559
652,-0.10559
653,-0.10559
654,-0.10559
655,-0.10559
656,-0.10559
657,-0.10559
658,-0.10559
659,-0.10559
660,-0.10559
661,-0.10559
662,-0.10559
663,-0.10559
664,-0.10559
665,-0.10559
666,-0.10559
667,-0.10559
668,-0.10559
669,-0.10559
670,-0.10559
671,-0.10559
672,-0.10559
673,-0.10559
674,-0.10559
675,-0.10559
676,-0.10559
677,-0.10559
678,-0.10559
679,-0.10559
680,-0.10559
681,-0.10559
682,-0.10559
683,-0.10559
684,-0.10559
685,-0.10559
686,-0.10559
687,-0.10559
688,-0.10559
689,-0.10559
690,-0.10559
691,-0.10559
692,-0.10559
693,-0.10559
694,-0.10559
695,-0.10559
696,-0.10559
697,-0.10559
698,-0.10559
699,-0.10559
700,-0.10559
701,-0.10559
702,-0.10559
703,-0.10559
704,-0.10559
705,-0.10559
706,-0.10559
707,-0.10559
708,-0.10559
709,-0.10559
710,-0.10559
711,-0.10559
712,-0.10559
713,-0.10559
714,-0.10559
715,-0.10559
716,-0.10559
717,-0.10559
718,-0.10559
719,-0.10559
