time,value
0,-1.2524
1,-1.2524
2,-1.2524
3,-1.2524
4,-1.2524
5,-1.2524
6,-1.2524
7,-1.2524
8,-1.2524
9,-1.2524
10,-1.2748
11,-1.2986
12,-1.319
13,-1.3334
14,-1.3334
15,-1.3334
16,-1.3334
17,-1.3334
18,-1.3334
19,-1.3334
20,-1.3334
21,-1.3334
22,-1.3334
23,-1.3334
24,-1.3334
25,-1.3334
26,-1.3334
27,-1.3334
28,-1.3294
29,-1.3242
30,-1.2916
31,-1.2457
32,-1.1276
33,-1.004
34,-0.8689600000000001
35,-0.7339100000000001
36,-0.59887
37,-0.46383
38,-0.32878
39,-0.19374
40,-0.30893000000000004
41,0.08795399999999999
42,0.40715999999999997
43,0.098959
44,0.47579
45,0.30699
46,0.28853
47,-0.27969
48,-0.37346
49,-0.41341000000000006
50,-0.20097
51,0.23945999999999998
52,0.37271
53,0.14129
54,0.20881
55,0.27633
56,0.34386
57,0.40381
58,0.46102
59,0.49668
60,0.5339
61,0.60091
62,0.66806
63,0.73558
64,0.80311
65,0.8706299999999999
66,0.93815
67,1.0057
68,1.0732
69,1.14
70,1.1838
71,1.2283
72,1.2749
73,1.3282
74,1.3916
75,1.4180000000000001
76,1.4180000000000001
77,1.3988
78,1.3738
79,1.2728
80,1.1532
81,0.9406200000000001
82,0.69847
83,0.39463000000000004
84,0.13089
85,-0.4666
86,-0.27135
87,-0.42751999999999996
88,-0.52732
89,-0.61562
90,-0.6493800000000001
91,-0.66943
92,-0.64804
93,-0.61403
94,-0.56352
95,-0.50615
96,-0.44455
97,-0.40531999999999996
98,-0.37156
99,-0.36633000000000004
100,-0.36541
101,-0.38345
102,-0.40454
103,-0.43109
104,-0.44321000000000005
105,-0.44321000000000005
106,-0.42125
107,-0.39109
108,-0.33999
109,-0.28549
110,-0.21796
111,-0.15044000000000002
112,-0.41075
113,-0.14675
114,0.22983
115,0.34115
116,0.14245
117,0.23948000000000003
118,0.34076
119,0.44205
120,0.54333
121,0.64461
122,0.7458899999999999
123,0.8471799999999999
124,0.9484600000000001
125,1.0497
126,1.1512
127,1.2528
128,1.3861
129,1.518
130,1.6299
131,1.7344
132,1.8233
133,1.9023
134,1.9713
135,2.0626
136,2.1638
137,2.2438
138,2.3184
139,2.3586
140,2.3884
141,2.3856
142,2.3695
143,2.3357
144,2.302
145,2.2682
146,2.2225
147,2.1738
148,2.1026
149,2.026
150,1.9247
151,1.8139
152,1.6855
153,1.5623
154,1.4435
155,1.3374
156,1.2361
157,1.1348
158,1.0387
159,0.99416
160,0.95744
161,0.94121
162,0.9293799999999999
163,0.92268
164,0.89846
165,0.8647
166,0.85561
167,0.8512299999999999
168,0.83242
169,0.80896
170,0.7672100000000001
171,0.71548
172,0.6479600000000001
173,0.58044
174,0.5129199999999999
175,0.43017
176,0.34255
177,0.22458000000000003
178,0.49641
179,-0.34761
180,-0.22904000000000002
181,-0.36563
182,-0.49082
183,-0.60447
184,-0.6952699999999999
185,-0.77542
186,-0.81535
187,-0.8473700000000001
188,-0.8476299999999999
189,-0.84782
190,-0.84782
191,-0.84782
192,-0.84782
193,-0.8472
194,-0.8461700000000001
195,-0.8192200000000001
196,-0.78545
197,-0.75169
198,-0.7179300000000001
199,-0.68417
200,-0.64961
201,-0.61353
202,-0.5607300000000001
203,-0.4932
204,-0.42568
205,-0.35816
206,-0.29064
207,-0.22280999999999998
208,-0.15168
209,-0.35791999999999996
210,0.14849
211,0.14232999999999998
212,0.27016
213,0.39253000000000005
214,0.51185
215,0.61221
216,0.70827
217,0.77579
218,0.83237
219,0.8442200000000001
220,0.85805
221,0.87505
222,0.89455
223,0.91594
224,0.8958799999999999
225,0.8621200000000001
226,0.8556299999999999
227,0.85156
228,0.85156
229,0.8492700000000001
230,0.8417899999999999
231,0.8214
232,0.78764
233,0.75388
234,0.72012
235,0.6863600000000001
236,0.6526
237,0.61884
238,0.58508
239,0.55132
240,0.49117
241,0.39400999999999997
242,0.30691999999999997
243,0.22651999999999997
244,0.16414
245,0.10667
246,0.36498
247,0.17043
248,-0.16330999999999998
249,-0.49837
250,-0.16797
251,-0.24741999999999997
252,-0.33762
253,-0.45897
254,-0.5929800000000001
255,-0.66742
256,-0.73115
257,-0.75176
258,-0.76354
259,-0.7509100000000001
260,-0.7295699999999999
261,-0.6976100000000001
262,-0.68598
263,-0.68598
264,-0.70628
265,-0.73124
266,-0.79283
267,-0.862
268,-0.9632799999999999
269,-1.0646
270,-1.1658
271,-1.2525
272,-1.3278
273,-1.3746
274,-1.4117
275,-1.4102
276,-1.4024
277,-1.3687
278,-1.3349
279,-1.3011
280,-1.2674
281,-1.2336
282,-1.2037
283,-1.1756
284,-1.1715
285,-1.1727
286,-1.2013
287,-1.2229999999999999
288,-1.2212
289,-1.2092
290,-1.1824
291,-1.1715
292,-1.1715
293,-1.1015
294,-1.0118
295,-0.94778
296,-0.88782
297,-0.8458100000000001
298,-0.79525
299,-0.72773
300,-0.67643
301,-0.6400899999999999
302,-0.59121
303,-0.53709
304,-0.47953
305,-0.42336
306,-0.3896
307,-0.35584
308,-0.32208000000000003
309,-0.29796
310,-0.28584
311,-0.28136
312,-0.28136
313,-0.28136
314,-0.28136
315,1.2488
316,1.2488
317,1.2488
318,1.2488
319,1.2488
320,1.2488
321,1.2488
322,1.2488
323,1.2488
324,1.2488
325,1.2739
326,1.3006
327,1.3234
328,1.3395
329,1.3395
330,1.3395
331,1.3395
332,1.3395
333,1.3395
334,1.3395
335,1.3395
336,1.3395
337,1.3395
338,1.3395
339,1.3395
340,1.3395
341,1.3606
342,1.3964
343,1.463
344,1.5386
345,1.6142
346,1.6853
347,1.7295
348,1.7652
349,1.7837
350,1.7926
351,1.7926
352,1.7926
353,1.7926
354,1.7635
355,1.7274
356,1.6480000000000001
357,1.5556
358,1.4248
359,1.2685
360,1.0794
361,0.93322
362,0.81285
363,0.68011
364,0.54445
365,0.40333
366,0.26715
367,0.15372
368,0.27044
369,-0.11779
370,-0.43546999999999997
371,-0.13982
372,-0.1814
373,-0.21921
374,-0.25701999999999997
375,-0.29871
376,-0.37375
377,-0.43445
378,-0.45985
379,-0.47936999999999996
380,-0.49236
381,-0.5217
382,-0.55952
383,-0.59733
384,-0.63437
385,-0.64563
386,-0.65757
387,-0.672
388,-0.69668
389,-0.7368
390,-0.79764
391,-0.8732700000000001
392,-0.94889
393,-1.0245
394,-1.1153
395,-1.2109
396,-1.3318
397,-1.4748
398,-1.6639
399,-1.8679
400,-2.0864
401,-2.2627
402,-2.4203
403,-2.4921
404,-2.5459
405,-2.5081
406,-2.4473
407,-2.3168
408,-2.1936
409,-2.0799
410,-1.9897
411,-1.9141
412,-1.8385
413,-1.7629
414,-1.6872
415,-1.6186
416,-1.5834
417,-1.5579
418,-1.5498
419,-1.5256
420,-1.4878
421,-1.45
422,-1.4122
423,-1.3546
424,-1.2945
425,-1.2284
426,-1.1703
427,-1.1325
428,-1.0782
429,-1.0051
430,-0.93042
431,-0.8548
432,-0.78837
433,-0.72433
434,-0.68652
435,-0.64108
436,-0.5666100000000001
437,-0.50133
438,-0.45024
439,-0.40681999999999996
440,-0.36901
441,-0.3312
442,-0.29339
443,-0.25558000000000003
444,-0.22121999999999997
445,-0.20938
446,-0.20131
447,-0.20131
448,-0.20131
449,-0.20131
450,-0.20131
451,-0.20131
452,-0.20131
453,-0.2022
454,-0.21749000000000002
455,-0.23903000000000002
456,-0.28002
457,-0.33582
458,-0.41144
459,-0.48707
460,-0.5626899999999999
461,-0.6249600000000001
462,-0.68384
463,-0.72656
464,-0.77455
465,-0.8501799999999999
466,-0.9258
467,-1.0014
468,-1.0771
469,-1.1527
470,-1.2239
471,-1.2935
472,-1.3342
473,-1.3662
474,-1.3405
475,-1.306
476,-1.2485
477,-1.1827
478,-1.1071
479,-1.0314
480,-0.9558200000000001
481,-0.8802
482,-0.80494
483,-0.75038
484,-0.6956
485,-0.63989
486,-0.56182
487,-0.44838999999999996
488,-0.35477
489,-0.27597
490,-0.18253
491,-0.41811000000000004
492,0.31711999999999996
493,0.47515
494,0.13207
495,0.18114
496,0.25504
497,0.35361
498,0.47715
499,0.61151
500,0.75093
501,0.86782
502,0.98125
503,1.0947
504,1.1961
505,1.2587
506,1.3053
507,1.3298
508,1.3388
509,1.3376
510,1.3074
511,1.2696
512,1.2056
513,1.1391
514,1.0635
515,0.9878899999999999
516,0.91227
517,0.8366399999999999
518,0.76102
519,0.6854
520,0.60977
521,0.53415
522,0.45921999999999996
523,0.39168000000000003
524,0.34249
525,0.34249
526,0.34249
527,0.34249
528,0.33119
529,0.31359000000000004
530,0.28834
531,0.26225
532,0.30006
533,0.33175
534,0.33838
535,0.34249
536,0.34249
537,0.34249
538,0.34249
539,0.34249
540,0.34249
541,0.40358
542,0.46758
543,0.52271
544,0.5751
545,0.62128
546,0.68193
547,0.75756
548,0.8331799999999999
549,0.9088
550,0.96554
551,1.018
552,1.046
553,1.0676
554,1.0676
555,1.0676
556,1.0676
557,1.0535
558,1.0301
559,1.0131
560,0.9978
561,1.0341
562,1.0661
563,1.067
564,1.0506
565,1.001
566,0.93099
567,0.8426600000000001
568,0.7369
569,0.6240399999999999
570,0.5445399999999999
571,0.46891000000000005
572,0.39329000000000003
573,0.32519000000000003
574,0.27785
575,0.25186
576,0.25186
577,0.25186
578,0.25186
579,0.22910999999999998
580,0.20125
581,0.14785
582,0.45164
583,0.0562
584,-0.40376999999999996
585,-0.19496
586,-0.27571
587,-0.33084
588,-0.37305
589,-0.41086999999999996
590,-0.43954
591,-0.45993
592,-0.42212
593,-0.38431
594,-0.3465
595,-0.32661999999999997
596,-0.32576
597,-0.35083000000000003
598,-0.38864
599,-0.42645
600,-0.46297
601,-0.46874
602,-0.47321
603,-0.47321
604,-0.47321
605,-0.47321
606,-0.47321
607,-0.47321
608,-0.44708000000000003
609,-0.4136
610,-0.37594
611,-0.33952
612,-0.31094
613,-0.29195
614,-0.29195
615,-0.29195
616,-0.29195
617,-0.29195
618,-0.29195
619,-0.29195
620,-0.29195
621,-0.29195
622,-0.30141
623,-0.33776999999999996
624,-0.36399000000000004
625,-0.37756
626,-0.38258000000000003
627,-0.38258000000000003
628,-0.38258000000000003
629,-0.38258000000000003
630,1.5311
631,1.5311
632,1.5311
633,1.5311
634,1.5311
635,1.5311
636,1.5311
637,1.5311
638,1.5311
639,1.5311
640,1.6159999999999999
641,1.7062
642,1.7834
643,1.8378
644,1.8378
645,1.8378
646,1.8378
647,1.8378
648,1.8378
649,1.8378
650,1.8378
651,1.8378
652,1.8378
653,1.8378
654,1.8378
655,1.8378
656,1.8736
657,1.9341
658,2.0378
659,2.1541
660,2.2079
661,2.2468
662,2.2128
663,2.1645
664,2.0871
665,1.9944
666,1.8871
667,1.7654
668,1.6374
669,1.4897
670,1.3402
671,1.2007
672,1.0641
673,0.93616
674,0.80818
675,0.68021
676,0.5232100000000001
677,0.34873000000000004
678,0.13394
679,-0.44793999999999995
680,-0.33933
681,-0.58508
682,-0.81543
683,-1.0017
684,-1.1109
685,-1.19
686,-1.2443
687,-1.2718
688,-1.2896
689,-1.291
690,-1.291
691,-1.291
692,-1.2959
693,-1.3129
694,-1.334
695,-1.3596
696,-1.3855
697,-1.4117
698,-1.459
699,-1.5107
700,-1.5799
701,-1.6465
702,-1.7038
703,-1.749
704,-1.7762
705,-1.8173
706,-1.8685
707,-1.8906
708,-1.9039
709,-1.8737
710,-1.835
711,-1.7556
712,-1.6689
713,-1.5665
714,-1.4844
715,-1.4218
716,-1.3672
717,-1.3159999999999998
718,-1.2648
719,-1.2136
720,-1.1624
721,-1.1112
722,-1.06
723,-1.0089
724,-0.95767
725,-0.90648
726,-0.85529
727,-0.8041
728,-0.7529100000000001
729,-0.72335
730,-0.69231
731,-0.65304
732,-0.61342
733,-0.57317
734,-0.55479
735,-0.55479
736,-0.53814
737,-0.5152800000000001
738,-0.48993000000000003
739,-0.46433
740,-0.43873999999999996
741,-0.41313999999999995
742,-0.38755
743,-0.35079
744,-0.30136
745,-0.2712
746,-0.25127
747,-0.24181999999999998
748,-0.23398000000000002
749,-0.20838
750,-0.17762
751,-0.12722
752,-0.37864000000000003
753,-0.1227
754,0.13325
755,0.3892
756,0.12811
757,0.1791
758,0.20601999999999998
759,0.22694
760,0.21736999999999998
761,0.19674
762,0.15238
763,0.46542
764,0.08735599999999999
765,-0.20670999999999998
766,-0.46266
767,-0.12829000000000002
768,-0.16111
769,-0.19705999999999999
770,-0.23671
771,-0.2879
772,-0.33909
773,-0.39028
774,-0.45343999999999995
775,-0.52417
776,-0.5906899999999999
777,-0.65614
778,-0.70144
779,-0.7388399999999999
780,-0.7388399999999999
781,-0.73161
782,-0.71109
783,-0.68123
784,-0.6433300000000001
785,-0.60175
786,-0.55877
787,-0.55479
788,-0.55877
789,-0.60175
790,-0.6433300000000001
791,-0.68123
792,-0.71109
793,-0.73161
794,-0.7388399999999999
795,-0.7388399999999999
796,-0.7388399999999999
797,-0.7381
798,-0.69531
799,-0.64687
800,-0.57614
801,-0.51298
802,-0.46179
803,-0.42402
804,-0.39628
805,-0.33554
806,-0.26421999999999995
807,-0.15039
808,-0.14223
809,0.12435
810,0.27792
811,0.43149
812,0.5770000000000001
813,0.71435
814,0.8343799999999999
815,0.9463299999999999
816,1.0278
817,1.1059
818,1.2081
819,1.3022
820,1.3702
821,1.4273
822,1.4695
823,1.5006
824,1.5247
825,1.5094
826,1.4838
827,1.4227
828,1.36
829,1.2932
830,1.2312
831,1.1782
832,1.1126
833,1.0358
834,0.9590200000000001
835,0.88223
836,0.78572
837,0.68498
838,0.56248
839,0.4524
840,0.37561
841,0.29883000000000004
842,0.22204000000000002
843,0.16055
844,0.1076
845,0.42086999999999997
846,0.33254
847,0.46052
848,0.12522
849,0.19302
850,0.24949000000000002
851,0.28758
852,0.31206999999999996
853,0.32614
854,0.38733
855,0.46412
856,0.5409
857,0.616
858,0.67892
859,0.72609
860,0.7376199999999999
861,0.6806
862,0.5526300000000001
863,0.44023999999999996
864,0.33532
865,0.29654
866,0.27119
867,0.30343000000000003
868,0.34005
869,0.39124000000000003
870,0.43243000000000004
871,0.45958999999999994
872,0.47629
873,0.48606000000000005
874,0.48216000000000003
875,0.47453999999999996
876,0.44947
877,0.41996999999999995
878,0.36935999999999997
879,0.31856
880,0.26737
881,0.22521999999999998
882,0.19122999999999998
883,0.18085
884,0.18006
885,0.13412000000000002
886,0.41131999999999996
887,0.066469
888,-0.3015
889,-0.14743
890,-0.23978000000000002
891,-0.33942
892,-0.40826
893,-0.45945
894,-0.49523999999999996
895,-0.52764
896,-0.55323
897,-0.57838
898,-0.60163
899,-0.6161399999999999
900,-0.6161399999999999
901,-0.62721
902,-0.64694
903,-0.66245
904,-0.67652
905,-0.68367
906,-0.69547
907,-0.74666
908,-0.7854
909,-0.7951699999999999
910,-0.80019
911,-0.80019
912,-0.79443
913,-0.78583
914,-0.7408
915,-0.69048
916,-0.66098
917,-0.63236
918,-0.6067600000000001
919,-0.58334
920,-0.56302
921,-0.55479
922,-0.55479
923,-0.55479
924,-0.55479
925,-0.54084
926,-0.52564
927,-0.5063
928,-0.49344
929,-0.49344
930,-0.49344
931,-0.49344
932,-0.5043300000000001
933,-0.51976
934,-0.53781
935,-0.55479
936,-0.55479
937,-0.5483899999999999
938,-0.52377
939,-0.49872
940,-0.47312
941,-0.44753000000000004
942,-0.42193
943,-0.39634
944,-0.37074
