time,value
0,0.66176
1,0.66176
2,0.66176
3,0.66176
4,0.66176
5,0.6652899999999999
6,0.70298
7,0.7320300000000001
8,0.75088
9,0.75422
10,0.75422
11,0.75422
12,0.75422
13,0.75422
14,0.75422
15,0.75422
16,0.75422
17,0.75422
18,0.75422
19,0.75422
20,0.75422
21,0.75422
22,0.75422
23,0.75422
24,0.75422
25,0.73655
26,0.69886
27,0.6219
28,0.52777
29,0.39585
30,0.26393
31,0.13201
32,0.15155
33,-0.3461
34,-0.16275
35,-0.22753
36,-0.27935
37,-0.33118000000000003
38,-0.38301
39,-0.43483
40,-0.44778999999999997
41,-0.44778999999999997
42,-0.44778999999999997
43,-0.42746999999999996
44,-0.38506999999999997
45,-0.36651999999999996
46,-0.35533000000000003
47,-0.35533000000000003
48,-0.35533000000000003
49,-0.35533000000000003
50,-0.35533000000000003
51,-0.35533000000000003
52,-0.35533000000000003
53,-0.35533000000000003
54,-0.35533000000000003
55,-0.35533000000000003
56,-0.35719
57,-0.3619
58,-0.40244
59,-0.45427
60,-0.5060899999999999
61,-0.55792
62,-0.60974
63,-0.62535
64,-0.63271
65,-0.63271
66,-0.61348
67,-0.58049
68,-0.52965
69,-0.47781999999999997
70,-0.426
71,-0.38693
72,-0.35533000000000003
73,-0.35533000000000003
74,-0.35916
75,-0.36858
76,-0.41431999999999997
77,-0.47723999999999994
78,-0.58089
79,-0.6845399999999999
80,-0.78819
81,-0.93258
82,-1.0844
83,-1.2399
84,-1.3954
85,-1.5509
86,-1.6747
87,-1.7911
88,-1.8948
89,-1.9822
90,-2.0599
91,-2.0929
92,-2.1121
93,-2.1121
94,-2.1047
95,-2.0891
96,-2.0373
97,-1.9855
98,-1.9337
99,-1.9272
100,-1.9046
101,-1.8104
102,-1.7105
103,-1.6068
104,-1.4666
105,-1.3316
106,-1.2091
107,-1.0997
108,-0.99608
109,-0.89243
110,-0.79683
111,-0.71202
112,-0.6197600000000001
113,-0.5078600000000001
114,-0.30056
115,-0.43395
116,0.12122000000000001
117,0.37495
118,0.65999
119,1.0228
120,1.1829
121,1.2158
122,1.2996
123,1.3779
124,1.4439
125,1.4764
126,1.4939
127,1.4939
128,1.4733
129,1.4262
130,1.3337
131,1.2301
132,1.1264
133,1.0278
134,0.93355
135,0.8815299999999999
136,0.8466799999999999
137,0.8466799999999999
138,0.87907
139,0.9309
140,0.9361
141,0.95416
142,0.99656
143,1.0186
144,1.0316
145,1.0316
146,1.0063
147,0.9497399999999999
148,0.8166399999999999
149,0.6592
150,0.47075
151,0.30781
152,0.16647
153,0.35914
154,-0.29293
155,-0.28376999999999997
156,-0.36966
157,-0.36966
158,-0.11052999999999999
159,0.1486
160,0.40773000000000004
161,0.12936
162,0.17765999999999998
163,0.19179000000000002
164,0.18433
165,0.15135
166,0.12612
167,0.10257000000000001
168,0.41508999999999996
169,0.16725
170,-0.18611
171,-0.11622
172,-0.17305
173,-0.18248
174,-0.21624000000000002
175,-0.26287
176,-0.26287
177,-0.24343
178,-0.1916
179,-0.10493
180,-0.1686
181,0.27669
182,0.10815999999999999
183,0.15999000000000002
184,0.21181
185,0.26364
186,0.31546
187,0.36729
188,0.41912
189,0.436
190,0.42265
191,0.34256
192,0.21918
193,0.39104
194,-0.0801
195,-0.36966
196,-0.36966
197,0.15531
198,0.10345
199,0.2071
200,0.29044000000000003
201,0.35168
202,0.34138
203,0.3188
204,0.29996
205,0.29191
206,0.29191
207,0.29191
208,0.30329
209,0.34099
210,0.4038
211,0.47741999999999996
212,0.49627
213,0.54682
214,0.64576
215,0.70887
216,0.74774
217,0.69591
218,0.6671600000000001
219,0.6624399999999999
220,0.66176
221,0.65351
222,0.61582
223,0.58912
224,0.57028
225,0.5425
226,0.51423
227,0.48596000000000006
228,0.48958999999999997
229,0.5104
230,0.57636
231,0.65763
232,0.7612899999999999
233,0.8649399999999999
234,0.96859
235,1.0722
236,1.2018
237,1.3573
238,1.5128
239,1.6682
240,1.8237
241,1.9344
242,2.0145
243,2.0991
244,2.1809
245,2.2563
246,2.2993
247,2.3251
248,2.3062
249,2.2678
250,2.2018
251,2.099
252,1.9798
253,1.8243
254,1.6688
255,1.5133
256,1.3579
257,1.1572
258,0.8133100000000001
259,0.4836
260,0.16323
261,-0.14802
262,-0.426
263,-0.6380100000000001
264,-0.79084
265,-0.9151100000000001
266,-0.9952
267,-1.0632
268,-1.115
269,-1.1669
270,-1.2172
271,-1.2596
272,-1.2799
273,-1.2799
274,-1.2799
275,-1.2670000000000001
276,-1.2152
277,-1.1923
278,-1.1876
279,-1.1875
280,-1.2393
281,-1.3901
282,-1.5342
283,-1.6707
284,-1.7461
285,-1.7906
286,-1.7953
287,-1.7546
288,-1.7004
289,-1.6345
290,-1.5485
291,-1.4448
292,-1.3412
293,-1.2375
294,-1.1339
295,-1.0626
296,-1.0108
297,-0.9589799999999999
298,-0.90715
299,-0.8553299999999999
300,-0.8035
301,-0.75442
302,-0.73558
303,-0.69985
304,-0.64331
305,-0.58678
306,-0.53358
307,-0.49588000000000004
308,-0.42246000000000006
309,-0.31881
310,-0.20661999999999997
311,-0.39665
312,0.35718
313,0.18825999999999998
314,0.29191
315,1.1057
316,1.1057
317,1.1057
318,1.1057
319,1.1057
320,1.103
321,1.0741
322,1.0519
323,1.0374
324,1.0349
325,1.0349
326,1.0349
327,1.0349
328,1.0349
329,1.0349
330,1.0349
331,1.0349
332,1.0349
333,1.0349
334,1.0349
335,1.0349
336,1.0349
337,1.0349
338,1.0349
339,1.0349
340,1.0214
341,0.9924799999999999
342,0.9335399999999999
343,0.86572
344,0.78632
345,0.6866300000000001
346,0.57114
347,0.44227
348,0.32392
349,0.2337
350,0.134
351,0.17352
352,-0.13812
353,-0.22346999999999997
354,-0.42196000000000006
355,-0.1281
356,-0.16366
357,-0.16727
358,-0.16915
359,-0.16915
360,-0.16915
361,-0.17442
362,-0.19968
363,-0.23321
364,-0.27291
365,-0.31261
366,-0.35231
367,-0.39200999999999997
368,-0.43171000000000004
369,-0.4714
370,-0.5111
371,-0.5508
372,-0.5905
373,-0.6302
374,-0.6699
375,-0.7096
376,-0.7493
377,-0.78899
378,-0.8286899999999999
379,-0.86208
380,-0.8729
381,-0.87741
382,-0.87741
383,-0.89794
384,-0.91959
385,-0.94125
386,-0.95801
387,-0.97305
388,-1.0019
389,-1.0191
390,-1.0191
391,-1.0218
392,-1.0303
393,-1.07
394,-1.1296
395,-1.209
396,-1.2884
397,-1.3678
398,-1.4472
399,-1.5266
400,-1.6059999999999999
401,-1.6854
402,-1.7578
403,-1.8155
404,-1.8485
405,-1.869
406,-1.869
407,-1.8645
408,-1.8536
409,-1.8203
410,-1.7806
411,-1.7409
412,-1.7012
413,-1.6615
414,-1.6218
415,-1.5821
416,-1.5424
417,-1.5027
418,-1.463
419,-1.4233
420,-1.3836
421,-1.3439
422,-1.3042
423,-1.2656
424,-1.244
425,-1.2254
426,-1.2109
427,-1.1765
428,-1.1357
429,-1.0888
430,-1.0268
431,-0.9510200000000001
432,-0.9071899999999999
433,-0.86749
434,-0.8277899999999999
435,-0.8102699999999999
436,-0.80666
437,-0.8065899999999999
438,-0.8165100000000001
439,-0.8453799999999999
440,-0.84614
441,-0.83478
442,-0.8167399999999999
443,-0.81448
444,-0.8325299999999999
445,-0.85636
446,-0.87741
447,-0.87741
448,-0.87741
449,-0.87741
450,-0.87741
451,-0.87741
452,-0.87741
453,-0.87741
454,-0.87741
455,-0.87741
456,-0.87741
457,-0.87741
458,-0.87741
459,-0.87741
460,-0.87741
461,-0.89681
462,-0.9401200000000001
463,-0.9980899999999999
464,-1.0582
465,-1.1123
466,-1.1743
467,-1.2428
468,-1.2787
469,-1.3014
470,-1.2978
471,-1.2712
472,-1.2315
473,-1.1918
474,-1.1521
475,-1.1124
476,-1.0727
477,-1.0331
478,-0.99335
479,-0.95365
480,-0.91395
481,-0.8920799999999999
482,-0.87741
483,-0.87741
484,-0.87741
485,-0.87741
486,-0.86749
487,-0.84854
488,-0.80884
489,-0.76681
490,-0.72313
491,-0.64373
492,-0.56434
493,-0.48494
494,-0.37885
495,-0.26637
496,-0.17975
497,-0.46257
498,-0.065579
499,0.33141
500,0.14167000000000002
501,0.22107
502,0.30046999999999996
503,0.37986
504,0.44588
505,0.50347
506,0.5431699999999999
507,0.58287
508,0.62264
509,0.66595
510,0.72317
511,0.80256
512,0.8819600000000001
513,0.9572200000000001
514,1.0005
515,1.0577
516,1.1299
517,1.1594
518,1.1713
519,1.146
520,1.1249
521,1.1068
522,1.1057
523,1.1057
524,1.1057
525,1.0985
526,1.087
527,1.0545
528,1.0335
529,1.0299
530,0.9988
531,0.9591
532,0.9194
533,0.8443700000000001
534,0.73249
535,0.69768
536,0.68076
537,0.68076
538,0.66602
539,0.64076
540,0.62234
541,0.6043
542,0.58625
543,0.57309
544,0.5643699999999999
545,0.60407
546,0.64377
547,0.68347
548,0.72317
549,0.76286
550,0.80256
551,0.8819600000000001
552,1.0011
553,1.0577
554,1.1179
555,1.2226
556,1.3186
557,1.4089
558,1.4645
559,1.514
560,1.5537
561,1.6058
562,1.6632
563,1.7137
564,1.7522
565,1.7738
566,1.8293
567,1.8853
568,1.8889
569,1.911
570,1.9507
571,1.9209
572,1.8725
573,1.7968
574,1.6795
575,1.5352
576,1.3768
577,1.2349
578,1.1266
579,1.0385
580,0.96249
581,0.93722
582,0.9335399999999999
583,0.9588
584,0.9469200000000001
585,0.9185
586,0.85354
587,0.8224100000000001
588,0.8224100000000001
589,0.8224100000000001
590,0.8224100000000001
591,0.8224100000000001
592,0.84459
593,0.8806799999999999
594,0.8567
595,0.80662
596,0.70918
597,0.5785100000000001
598,0.43625
599,0.32077
600,0.22107
601,0.14167000000000002
602,0.3893
603,0.10359000000000002
604,0.11752
605,0.076525
606,0.27502
607,0.47351000000000004
608,0.13039
609,0.17009000000000002
610,0.18498
611,0.18498
612,0.18498
613,0.18498
614,0.18498
615,0.16423
616,0.13445
617,0.49381
618,0.34381
619,0.25359
620,0.16337000000000002
621,0.079532
622,0.19771
623,0.1081
624,0.3066
625,0.097009
626,0.13671
627,0.17640999999999998
628,0.21611
629,0.2558
630,1.9944
631,1.9944
632,1.9944
633,1.9944
634,1.9944
635,1.9892
636,1.9335
637,1.8906
638,1.8627
639,1.8578
640,1.8578
641,1.8578
642,1.8578
643,1.8578
644,1.8578
645,1.8578
646,1.8578
647,1.8578
648,1.8578
649,1.8578
650,1.8578
651,1.8578
652,1.8578
653,1.8578
654,1.8578
655,1.8186
656,1.7351
657,1.5848
658,1.4198
659,1.2492
660,1.0884
661,0.9352
662,0.80783
663,0.69976
664,0.63361
665,0.58118
666,0.5353399999999999
667,0.46223000000000003
668,0.40253
669,0.36424
670,0.32594
671,0.27967
672,0.17174
673,0.32245
674,-0.25199
675,-0.2163
676,-0.39124000000000003
677,-0.58272
678,-0.7383
679,-0.86711
680,-0.9469700000000001
681,-1.0236
682,-1.1001
683,-1.1628
684,-1.217
685,-1.224
686,-1.2433
687,-1.2816
688,-1.3199
689,-1.3534
690,-1.3534
691,-1.3534
692,-1.3534
693,-1.3534
694,-1.3534
695,-1.3534
696,-1.3534
697,-1.3534
698,-1.3534
699,-1.3534
700,-1.3534
701,-1.344
702,-1.3291
703,-1.2908
704,-1.2525
705,-1.2142
706,-1.1732
707,-1.1267
708,-1.0501
709,-0.99266
710,-0.95436
711,-0.91607
712,-0.89213
713,-0.9165
714,-0.9326
715,-0.94305
716,-0.9668399999999999
717,-0.9889600000000001
718,-1.0064
719,-0.99984
720,-0.98062
721,-0.9284
722,-0.86167
723,-0.77463
724,-0.67672
725,-0.5848899999999999
726,-0.5466
727,-0.5083
728,-0.47001000000000004
729,-0.46521999999999997
730,-0.46521999999999997
731,-0.46521999999999997
732,-0.46521999999999997
733,-0.46521999999999997
734,-0.4922
735,-0.51541
736,-0.5293399999999999
737,-0.53354
738,-0.53137
739,-0.49655
740,-0.44983999999999996
741,-0.38718
742,-0.35207
743,-0.32748
744,-0.32051999999999997
745,-0.30086999999999997
746,-0.26953
747,-0.29985
748,-0.34772
749,-0.42431
750,-0.45811
751,-0.46507
752,-0.46521999999999997
753,-0.47479
754,-0.50265
755,-0.50337
756,-0.49088999999999994
757,-0.4526
758,-0.40669
759,-0.35098
760,-0.2897
761,-0.23109000000000002
762,-0.1928
763,-0.1582
764,-0.12687
765,-0.12672
766,-0.13927
767,-0.17756
768,-0.23979
769,-0.31639
770,-0.32408000000000003
771,-0.33966999999999997
772,-0.371
773,-0.40734000000000004
774,-0.44766999999999996
775,-0.5103300000000001
776,-0.56988
777,-0.62558
778,-0.653
779,-0.66772
780,-0.6538
781,-0.63799
782,-0.62058
783,-0.65365
784,-0.69195
785,-0.73025
786,-0.76854
787,-0.80684
788,-0.8834299999999999
789,-0.9473299999999999
790,-0.98911
791,-1.0283
792,-1.0666
793,-1.1049
794,-1.1544
795,-1.2171
796,-1.274
797,-1.3264
798,-1.3647
799,-1.403
800,-1.4413
801,-1.4701
802,-1.4901
803,-1.4901
804,-1.4878
805,-1.484
806,-1.4457
807,-1.4074
808,-1.3691
809,-1.3308
810,-1.286
811,-1.185
812,-1.0906
813,-1.0035
814,-0.9252100000000001
815,-0.8444799999999999
816,-0.747
817,-0.64952
818,-0.55204
819,-0.46101000000000003
820,-0.35425
821,-0.20803000000000002
822,-0.22271999999999997
823,0.21069000000000002
824,0.40565
825,0.61403
826,0.8438100000000001
827,1.0161
828,1.1613
829,1.2449
830,1.3551
831,1.4944
832,1.6454
833,1.7884
834,1.8929
835,1.9694
836,2.0251
837,2.0808
838,2.126
839,2.1469
840,2.1028
841,2.026
842,1.9424
843,1.8465
844,1.7316
845,1.6167
846,1.5018
847,1.3869
848,1.272
849,1.1571
850,1.1225
851,1.094
852,1.0383
853,0.97045
854,0.89385
855,0.7974600000000001
856,0.6891
857,0.55681
858,0.42922
859,0.30635999999999997
860,0.24020999999999998
861,0.18538
862,0.14708
863,0.11147
864,0.42688999999999994
865,0.42688999999999994
866,0.42688999999999994
867,0.42688999999999994
868,0.42688999999999994
869,0.42688999999999994
870,0.42688999999999994
871,0.3442
872,0.20495
873,0.24919000000000002
874,0.38011
875,0.1312
876,0.20235
877,0.27821999999999997
878,0.34088
879,0.39339
880,0.43168999999999996
881,0.46998999999999996
882,0.5077699999999999
883,0.54259
884,0.5596300000000001
885,0.5596300000000001
886,0.52612
887,0.49617
888,0.49268999999999996
889,0.5102399999999999
890,0.54157
891,0.52569
892,0.50132
893,0.46302
894,0.41015
895,0.3477
896,0.23629
897,0.1011
898,-0.31001999999999996
899,-0.22760999999999998
900,-0.37253000000000003
901,-0.43518999999999997
902,-0.46521999999999997
903,-0.46521999999999997
904,-0.46521999999999997
905,-0.44606999999999997
906,-0.36948000000000003
907,-0.33568000000000003
908,-0.32871999999999996
909,-0.32857
910,-0.30942
911,-0.25372
912,-0.18322
913,-0.1112
914,-0.46631999999999996
915,-0.10619
916,-0.14449
917,-0.19396
918,-0.2485
919,-0.31465
920,-0.3586
921,-0.38297
922,-0.34808
923,-0.29724
924,-0.22065
925,-0.12012
926,-0.060272000000000006
927,0.39605999999999997
928,0.15404
929,0.23064
930,0.28720999999999997
931,0.33305
932,0.34697
933,0.34531
934,0.32442
935,0.2611
936,0.18799000000000002
937,0.11488
938,0.48346000000000006
939,0.11357
940,0.17862999999999998
941,0.23789000000000002
942,0.26921999999999996
943,0.25631
944,0.21802
