time,value
0,-1.7436
1,-1.7014
2,-1.6794
3,-1.7054
4,-1.6929
5,-1.6945
6,-1.7271
7,-1.6869
8,-1.7
9,-1.6605
10,-1.6938
11,-1.7269999999999999
12,-1.7134
13,-1.6840000000000002
14,-1.7194
15,-1.7115
16,-1.6379
17,-1.7080000000000002
18,-1.6985
19,-1.6891
20,-1.71
21,-1.6799
22,-1.6764
23,-1.6769999999999998
24,-1.6776
25,-1.6956
26,-1.6767
27,-1.6806
28,-1.73
29,-1.6773
30,-1.6641
31,-1.6849
32,-1.7057
33,-1.6803
34,-1.7098
35,-1.6633
36,-1.6528
37,-1.735
38,-1.7285
39,-1.6791
40,-1.6723
41,-1.7314
42,-1.7271
43,-1.6642
44,-1.6467
45,-1.6833
46,-1.6782
47,-1.6599
48,-1.6416
49,-1.6378
50,-1.6626
51,-1.7191
52,-1.6395
53,-1.6562
54,-1.6414
55,-1.6762
56,-1.6380000000000001
57,-1.6668
58,-1.6688
59,-1.5727
60,-1.5469
61,-1.5278
62,-1.5213
63,-1.5195
64,-1.4959
65,-1.4014
66,-1.3687
67,-1.3134
68,-1.2018
69,-1.1769
70,-1.0174
71,-0.9363299999999999
72,-0.88276
73,-0.77386
74,-0.64559
75,-0.5406
76,-0.4387
77,-0.26802
78,-0.23426999999999998
79,-0.20052999999999999
80,-0.1046
81,-0.037016
82,0.11292
83,0.1621
84,0.27202
85,0.32592
86,0.40694
87,0.41784
88,0.45791000000000004
89,0.48577
90,0.5152399999999999
91,0.49428
92,0.50435
93,0.5553600000000001
94,0.57329
95,0.58053
96,0.60288
97,0.6252300000000001
98,0.63193
99,0.63864
100,0.6423300000000001
101,0.64603
102,0.61368
103,0.58134
104,0.6874399999999999
105,0.63755
106,0.6534399999999999
107,0.6450199999999999
108,0.65987
109,0.62583
110,0.63958
111,0.63158
112,0.6682
113,0.72748
114,0.6814
115,0.58472
116,0.69995
117,0.61444
118,0.6485
119,0.59739
120,0.64896
121,0.59097
122,0.69589
123,0.65585
124,0.65189
125,0.65683
126,0.62917
127,0.6015199999999999
128,0.6755399999999999
129,0.65725
130,0.63895
131,0.64199
132,0.65558
133,0.62576
134,0.65151
135,0.6571100000000001
136,0.66271
137,0.6153
138,0.65109
139,0.6803
140,0.69193
141,0.6824600000000001
142,0.67975
143,0.6178100000000001
144,0.67476
145,0.64318
146,0.67989
147,0.68191
148,0.6937300000000001
149,0.65432
150,0.64182
151,0.65837
152,0.59841
153,0.6026199999999999
154,0.64056
155,0.63551
156,0.65037
157,0.61971
158,0.62834
159,0.60777
160,0.64139
161,0.66589
162,0.6548
163,0.62028
164,0.6138399999999999
165,0.63684
166,0.60756
167,0.6816399999999999
168,0.67096
169,0.63671
170,0.63768
171,0.69325
172,0.65633
173,0.6269100000000001
174,0.66779
175,0.64863
176,0.63305
177,0.6806
178,0.6819
179,0.7577
180,0.80225
181,0.8468
182,0.99321
183,1.0823
184,1.1517
185,1.1006
186,1.0197
187,0.84596
188,0.75548
189,0.72729
190,0.69911
191,0.49905
192,0.41423000000000004
193,0.2423
194,0.15264
195,0.1459
196,0.17489000000000002
197,0.28646
198,0.37046
199,0.46593999999999997
200,0.59113
201,0.62336
202,0.66651
203,0.62659
204,0.68071
205,0.60838
206,0.64782
207,0.6097
208,0.7148899999999999
209,0.6189600000000001
210,0.65047
211,0.62083
212,0.60828
213,0.64944
214,0.6906100000000001
215,0.6534800000000001
216,0.66928
217,0.69334
218,0.67395
219,0.56598
220,0.68514
221,0.67855
222,0.66642
223,0.61743
224,0.67103
225,0.65378
226,0.61034
227,0.63771
228,0.6531600000000001
229,0.64102
230,0.6307699999999999
231,0.62052
232,0.6383800000000001
233,0.63221
234,0.6569699999999999
235,0.6817300000000001
236,0.64336
237,0.62152
238,0.62831
239,0.60727
240,0.65222
241,0.66089
242,0.66957
243,0.64139
244,0.61911
245,0.61824
246,0.61737
247,0.61085
248,0.6772100000000001
249,0.66496
250,0.68587
251,0.62208
252,0.60311
253,0.62339
254,0.60948
255,0.63377
256,0.6580699999999999
257,0.6530199999999999
258,0.62117
259,0.65584
260,0.57657
261,0.61864
262,0.66071
263,0.6230399999999999
264,0.6277
265,0.64022
266,0.6852699999999999
267,0.6976600000000001
268,0.68119
269,0.6420100000000001
270,0.63167
271,0.62972
272,0.62843
273,0.6217
274,0.62851
