time,value
0,0.8885
1,0.99159
2,0.98419
3,0.8467899999999999
4,0.5876100000000001
5,0.25636
6,-0.10353
7,-0.45966999999999997
8,-0.79232
9,-1.0918
10,-1.3407
11,-1.514
12,-1.5912
13,-1.5229
14,-1.2914
15,-0.88136
16,-0.33248
17,0.27015
18,0.86015
19,1.354
20,1.6784
21,1.8264
22,1.8048
23,1.6589
24,1.4307
25,1.1514
26,0.8430799999999999
27,0.51659
28,0.17919000000000002
29,-0.16864
30,-0.51495
31,-0.8325
32,-1.0868
33,-1.2621
34,-1.3612
35,-1.3856
36,-1.3583
37,-1.2774
38,-1.14
39,-0.96786
40,-0.74471
41,-0.47596000000000005
42,-0.17581
43,0.15544000000000002
44,0.49303
45,0.8103899999999999
46,1.0756
47,1.2637
48,1.3835
49,1.4242
50,1.3791
51,1.2556
52,1.0758
53,0.84898
54,0.59515
55,0.33505
56,0.094375
57,-0.1199
58,-0.3227
59,-0.5374899999999999
60,-0.7759199999999999
61,-1.0364
62,-1.3137
63,-1.5643
64,-1.7454
65,-1.8004
66,-1.6945
67,-1.3998
68,-0.93658
69,-0.34793
70,0.30766
71,0.96131
72,1.5476
73,1.9956
74,2.2581
75,2.3144
76,2.1615
77,1.8121
78,1.2897
79,0.64961
80,-0.037573
81,-0.68384
82,-1.2249
83,-1.6064
84,-1.7985
85,-1.8168
86,-1.7036
87,-1.508
88,-1.2725
89,-1.0224
90,-0.75679
91,-0.45401
92,-0.093914
93,0.3299
94,0.7894399999999999
95,1.2252
96,1.578
97,1.7785
98,1.7806
99,1.5984
100,1.2695
101,0.86479
102,0.45813999999999994
103,0.088103
104,-0.21628000000000003
105,-0.45879
106,-0.66173
107,-0.8449
108,-1.0165
109,-1.1713
110,-1.2678
111,-1.2729
112,-1.1569
113,-0.91415
114,-0.58503
115,-0.20187
116,0.1685
117,0.47525
118,0.71101
119,0.85669
120,0.9257700000000001
121,0.93801
122,0.9205200000000001
123,0.86288
124,0.76423
125,0.61598
126,0.41725
127,0.17057
128,-0.10061
129,-0.37201
130,-0.5989800000000001
131,-0.7501399999999999
132,-0.8197700000000001
133,-0.81126
134,-0.75283
135,-0.66106
136,-0.542
137,-0.40310999999999997
138,-0.24686999999999998
139,-0.070386
140,0.14254
141,0.37463
142,0.61743
143,0.82701
144,0.9636899999999999
145,0.99334
146,0.91389
147,0.73649
148,0.48388000000000003
149,0.18900999999999998
150,-0.1004
151,-0.3466
152,-0.53271
153,-0.6661
154,-0.73961
155,-0.77055
156,-0.75847
157,-0.71253
158,-0.63854
159,-0.51867
160,-0.35072
161,-0.16422
162,0.034372
163,0.23981999999999998
164,0.41211000000000003
165,0.54772
166,0.6367
167,0.6805399999999999
168,0.68766
169,0.66772
170,0.64585
171,0.62163
172,0.58167
173,0.5229
174,0.4395
175,0.31034
176,0.12764
177,-0.1182
178,-0.41848
179,-0.73703
180,-1.0389
181,-1.2638
182,-1.3805
183,-1.3577
184,-1.1766
185,-0.8564
186,-0.42573999999999995
187,0.068756
188,0.57391
189,1.0165
190,1.3365
191,1.4859
192,1.4446
193,1.2164
194,0.8334
195,0.35266
196,-0.15803
197,-0.6318600000000001
198,-1.0004
199,-1.2279
200,-1.2967
201,-1.2096
202,-0.9974799999999999
203,-0.69167
204,-0.33686
205,0.0332
206,0.40606
207,0.7386199999999999
208,1.0101
209,1.1998
210,1.2919999999999998
211,1.2651
212,1.1169
213,0.8458
214,0.47403
215,0.053125
216,-0.37990999999999997
217,-0.76748
218,-1.0548
219,-1.2281
220,-1.2726
221,-1.2098
222,-1.0566
223,-0.8572
224,-0.62329
225,-0.3884
226,-0.1556
227,0.07697799999999999
228,0.32781
229,0.60033
230,0.8857700000000001
231,1.1507
232,1.3418
233,1.4280000000000002
234,1.3716
235,1.1563
236,0.8113100000000001
237,0.3706
238,-0.09936
239,-0.52213
240,-0.83601
241,-1.0203
242,-1.0699
243,-1.0325
244,-0.9472
245,-0.86188
246,-0.7965
247,-0.74725
248,-0.68366
249,-0.5566399999999999
250,-0.32941
251,0.0023677
252,0.39559
253,0.79793
254,1.1375
255,1.3423
256,1.3738
257,1.2378
258,0.9673799999999999
259,0.63189
260,0.29691
261,0.019212
262,-0.18087999999999999
263,-0.31926
264,-0.41901000000000005
265,-0.5086
266,-0.59992
267,-0.68082
268,-0.72247
269,-0.7072
270,-0.613
271,-0.45471999999999996
272,-0.24573000000000003
273,-0.016693
274,0.18916
275,0.34495
276,0.44941000000000003
277,0.51568
278,0.57215
279,0.6291399999999999
280,0.67594
281,0.70607
282,0.6719
283,0.5461699999999999
284,0.31545
285,-0.021098
286,-0.42675
287,-0.8465
288,-1.2166
289,-1.4961
290,-1.6405
291,-1.6164
292,-1.4217
293,-1.0651
294,-0.57271
295,0.016236
296,0.6596
297,1.2988
298,1.8629
299,2.2703
300,2.4601
301,2.3891
302,2.0365
303,1.4369
304,0.6642399999999999
305,-0.17906
306,-0.9797899999999999
307,-1.6382
308,-2.0611
309,-2.2253
310,-2.1425
311,-1.8668
312,-1.4716
313,-1.0411
314,-0.62673
315,-0.25222
316,0.095083
317,0.43938
318,0.78562
319,1.1189
320,1.4105
321,1.5963
322,1.6298
323,1.4615
324,1.0996
325,0.5989399999999999
326,0.054785
327,-0.42741
328,-0.76167
329,-0.91269
330,-0.8926200000000001
331,-0.76222
332,-0.59333
333,-0.44333
334,-0.35591999999999996
335,-0.32152
336,-0.30301999999999996
337,-0.25554
338,-0.14157999999999998
339,0.039693
340,0.25126
341,0.43695
342,0.56029
343,0.5795399999999999
344,0.50298
345,0.36091999999999996
346,0.20096
347,0.077303
348,0.0041701
349,-0.013103
350,0.00063133
351,0.0031555
352,-0.02337
353,-0.072591
354,-0.14199
355,-0.20776
356,-0.25561999999999996
357,-0.27292
358,-0.2726
359,-0.26011999999999996
360,-0.24464
361,-0.23067
362,-0.2188
363,-0.18079
364,-0.088004
365,0.052396000000000005
366,0.22271999999999997
367,0.38027
368,0.49032
369,0.51256
370,0.45318
371,0.33616999999999997
372,0.20307
373,0.08784199999999999
374,0.025205
375,0.0068452
376,0.016981
377,0.014266
378,-0.045136
379,-0.17260999999999999
380,-0.34484000000000004
381,-0.51681
382,-0.64748
383,-0.68715
384,-0.61612
385,-0.44914
386,-0.20729
387,0.062708
388,0.31106
389,0.51561
390,0.6600199999999999
391,0.76305
392,0.83816
393,0.8831600000000001
394,0.8938299999999999
395,0.8484200000000001
396,0.72615
397,0.49051999999999996
398,0.13659000000000002
399,-0.31537
400,-0.8253
401,-1.3197
402,-1.7222
403,-1.9413
404,-1.929
405,-1.6545
406,-1.1347
407,-0.4316
408,0.35061
409,1.0859
410,1.6748
411,2.0281
412,2.114
413,1.9319
414,1.5398
415,1.02
416,0.46013000000000004
417,-0.068976
418,-0.51727
419,-0.8508600000000001
420,-1.0799
421,-1.2199
422,-1.2788
423,-1.2824
424,-1.2128
425,-1.0713
426,-0.86349
427,-0.5883
428,-0.25665
429,0.11173
430,0.49355
431,0.8541700000000001
432,1.1678
433,1.405
434,1.5246
435,1.5113
436,1.3516
437,1.0536
438,0.63265
439,0.12299000000000002
440,-0.4155
441,-0.91286
442,-1.3045
443,-1.5561
444,-1.6282
445,-1.5304
446,-1.2790000000000001
447,-0.90049
448,-0.45188999999999996
449,0.021674000000000002
450,0.47888000000000003
451,0.8846200000000001
452,1.2158
453,1.4364
454,1.5233
455,1.4705
456,1.2685
457,0.94586
458,0.5526
459,0.13468
460,-0.27341
461,-0.64039
462,-0.9466700000000001
463,-1.1864
464,-1.3613
465,-1.4686
466,-1.4934
467,-1.4182
468,-1.2195
469,-0.89864
470,-0.46921999999999997
471,0.034763
472,0.54979
473,1.026
474,1.4135
475,1.6703
476,1.7935
477,1.7816
478,1.6569999999999998
479,1.4569
480,1.1874
481,0.8515799999999999
482,0.45231000000000005
483,-0.007855500000000001
484,-0.49862
485,-0.9903200000000001
486,-1.4436
487,-1.8119999999999998
488,-2.0484
489,-2.1178
490,-2.0048
491,-1.7045
492,-1.2518
493,-0.70863
494,-0.12793
495,0.41598999999999997
496,0.86441
497,1.176
498,1.3563
499,1.4223
