time,value
0,-0.63235
1,-0.54702
2,-0.39503
3,-0.13307
4,0.1798
5,0.45052
6,0.69423
7,0.9101100000000001
8,1.1371
9,1.2996
10,1.3399
11,1.3836
12,1.3626
13,1.3324
14,1.1621
15,0.9215700000000001
16,0.70719
17,0.4056
18,0.12145
19,-0.14609
20,-0.30469
21,-0.49272
22,-0.60302
23,-0.5577
24,-0.36307
25,-0.12674000000000002
26,0.12511
27,0.39709
28,0.6188100000000001
29,0.89785
30,1.1805
31,1.4372
32,1.4892
33,1.5656
34,1.4069
35,1.3512
36,1.4344
37,1.3836
38,1.426
39,1.475
40,1.6219999999999999
41,1.511
42,1.2242
43,0.9278299999999999
44,0.6482100000000001
45,0.3813
46,0.11135
47,-0.17
48,-0.38682
49,-0.58373
50,-0.6722100000000001
51,-0.76775
52,-0.86126
53,-0.98315
54,-1.1078
55,-1.1851
56,-1.2409
57,-1.2562
58,-1.2598
59,-1.2797
60,-1.2194
61,-1.0985
62,-0.97365
63,-0.8835299999999999
64,-0.7901100000000001
65,-0.72388
66,-0.7154699999999999
67,-0.8156899999999999
68,-0.9422299999999999
69,-1.0279
70,-1.1478
71,-1.1892
72,-1.254
73,-1.2875
74,-1.2187
75,-1.1566
76,-1.0371
77,-0.9202100000000001
78,-0.82936
79,-0.73569
