time,value
0,-0.20357999999999998
1,-0.36344
2,0.21014000000000002
3,-0.13477999999999998
4,-0.033435
5,0.014825
6,-0.24763000000000002
7,0.060562
8,0.061584
9,0.23988
10,-0.030501999999999998
11,0.50736
12,-0.2018
13,0.35515
14,-0.40583
15,0.11532
16,0.48213
17,0.40234000000000003
18,0.40308
19,0.069437
20,-0.25418
21,-0.12993
22,0.11742999999999999
23,0.19682
24,-0.76646
25,0.28565
26,0.09437000000000001
27,-0.24566999999999997
28,0.0052415
29,0.43237
30,0.24675
31,-0.30006
32,-0.22230999999999998
33,0.42458
34,0.2489
35,-0.042557
36,0.11473
37,0.086788
38,0.23281
39,-0.10588
40,-0.14594000000000001
41,-0.50703
42,-0.24672
43,0.022192
44,-0.30823
45,0.35107
46,0.00022508
47,0.24916
48,-0.35411
49,0.35663
50,0.19907
51,-0.048092
52,-0.29489
53,0.64355
54,0.50683
55,-0.26531
56,-0.072543
57,0.09325499999999999
58,0.048628
59,0.05995
60,-0.29625
61,-0.3389
62,-0.20451
63,-0.53878
64,-1.4984
65,-1.4984
66,-1.4984
67,-1.4984
68,-1.4984
69,-1.4984
70,-1.4984
71,-1.4984
72,-1.4984
73,-1.4984
74,-1.4984
75,-1.4984
76,-1.4984
77,1.4915
78,1.4915
79,1.4915
80,1.4915
81,1.4915
82,1.4915
83,1.4915
84,1.4915
85,1.4915
86,1.4915
87,1.4915
88,1.4915
89,1.4915
90,-0.07634099999999999
91,0.14538
92,0.60985
93,-0.027041000000000003
94,-0.3396
95,-0.37373
96,0.1942
97,1.4915
98,1.4915
99,1.4915
100,1.4915
101,1.4915
102,1.4915
103,1.4915
104,1.4915
105,1.4915
106,1.4915
107,1.4915
108,1.4915
109,1.4915
110,1.4915
111,-1.4984
112,-1.4984
113,-1.4984
114,-1.4984
115,-1.4984
116,-1.4984
117,-1.4984
118,-1.4984
119,-1.4984
120,-1.4984
121,-1.4984
122,-1.4984
123,-1.4984
124,-1.4984
125,-0.11832999999999999
126,-0.022477
127,-0.43627
