time,value
0,0.20269
1,0.20269
2,0.20269
3,0.20269
4,0.20269
5,0.20269
6,0.20269
7,0.20269
8,0.20269
9,0.20269
10,0.20269
11,0.20269
12,0.20269
13,0.20269
14,0.20269
15,0.20269
16,0.20269
17,0.20269
18,0.20269
19,0.20269
20,0.20269
21,0.20269
22,0.20269
23,0.20269
24,0.20269
25,0.20269
26,0.20269
27,0.20269
28,0.20269
29,0.22551
30,0.32233
31,0.42853
32,0.53473
33,0.5798800000000001
34,0.586
35,0.586
36,0.586
37,0.586
38,0.586
39,0.586
40,0.586
41,0.586
42,0.586
43,0.586
44,0.6531
45,0.73982
46,0.83085
47,0.91853
48,0.9965200000000001
49,1.0724
50,1.1482
51,1.2072
52,1.2553
53,1.3008
54,1.3455
55,1.3784
56,1.4091
57,1.4395
58,1.464
59,1.4812
60,1.4963
61,1.5115
62,1.5374
63,1.5668
64,1.5971
65,1.6241
66,1.6421
67,1.6573
68,1.6725
69,1.6876
70,1.7028
71,1.7180000000000002
72,1.7321
73,1.7356
74,1.7359
75,1.7359
76,1.7359
77,1.7359
78,1.7359
79,1.7359
80,1.7155
81,1.6875
82,1.6571
83,1.6302
84,1.6114
85,1.5963
86,1.5811
87,1.5581
88,1.5298
89,1.4995
90,1.4691
91,1.4388
92,1.4084
93,1.3781
94,1.3477
95,1.3174
96,1.2871
97,1.2567
98,1.2264
99,1.196
100,1.1657
101,1.1387
102,1.1193
103,1.1041
104,1.0889
105,1.0738
106,1.0586
107,1.0434
108,1.0296
109,1.0244
110,1.0241
111,1.0241
112,1.0188
113,1.0072
114,0.9919899999999999
115,0.97682
116,0.9616399999999999
117,0.94647
118,0.9313
119,0.9161299999999999
120,0.90096
121,0.8857799999999999
122,0.87061
123,0.85544
124,0.8402700000000001
125,0.8251
126,0.80847
127,0.78423
128,0.75412
129,0.72377
130,0.70348
131,0.69552
132,0.69552
133,0.69552
134,0.68707
135,0.67337
136,0.6582
137,0.64303
138,0.6278600000000001
139,0.61269
140,0.59751
141,0.57582
142,0.5483399999999999
143,0.51799
144,0.48765
145,0.4573
146,0.42696000000000006
147,0.39662
148,0.36627
149,0.33593
150,0.30558
151,0.27524
152,0.2449
153,0.21455
154,0.18420999999999998
155,0.15386
156,0.12352
157,0.093175
158,0.062831
159,0.038497
160,0.020279
161,0.005107100000000001
162,-0.0085553
163,-0.016343
164,-0.016343
165,-0.016343
166,-0.016343
167,-0.016343
168,-0.016343
169,-0.01645
170,-0.023425
171,-0.037096
172,-0.052267999999999995
173,-0.064584
174,-0.071102
175,-0.071102
176,-0.071102
177,-0.08202899999999999
178,-0.10597999999999999
179,-0.13632
180,-0.16667
181,-0.19701
182,-0.22735999999999998
183,-0.2577
184,-0.28804
185,-0.31839
186,-0.34873000000000004
187,-0.37884
188,-0.40308
189,-0.41971
190,-0.43488000000000004
191,-0.45268
192,-0.47603999999999996
193,-0.50638
194,-0.53673
195,-0.56219
196,-0.58067
197,-0.59585
198,-0.61102
199,-0.6261899999999999
200,-0.64136
201,-0.6565300000000001
202,-0.67171
203,-0.68688
204,-0.70205
205,-0.71754
206,-0.73795
207,-0.7669199999999999
208,-0.79727
209,-0.82526
210,-0.8478399999999999
211,-0.86301
212,-0.8781899999999999
213,-0.8891100000000001
214,-0.89249
215,-0.89249
216,-0.89249
217,-0.89249
218,-0.89249
219,-0.89249
220,-0.8955700000000001
221,-0.90522
222,-0.9203899999999999
223,-0.9355600000000001
224,-0.95073
225,-0.9659
226,-0.98108
227,-0.99625
228,-1.0114
229,-1.0266
230,-1.0418
231,-1.0569
232,-1.0721
233,-1.0873
234,-1.1036
235,-1.1237
236,-1.1541
237,-1.1844
238,-1.2122
239,-1.2331
240,-1.2482
241,-1.263
242,-1.2747
243,-1.2758
244,-1.2758
245,-1.2758
246,-1.2758
247,-1.2758
248,-1.2758
249,-1.2758
250,-1.2758
251,-1.2758
252,-1.2758
253,-1.2758
254,-1.2758
255,-1.2758
256,-1.2778
257,-1.2871
258,-1.3023
259,-1.3175
260,-1.3326
261,-1.3478
262,-1.3630000000000002
263,-1.3782
264,-1.3933
265,-1.4085
266,-1.4237
267,-1.4346
268,-1.4261
269,-1.411
270,-1.3965
271,-1.3853
272,-1.3853
273,-1.3853
274,-1.3839
275,-1.3747
276,-1.3595
277,-1.3443
278,-1.3292
279,-1.314
280,-1.2988
281,-1.2828
282,-1.2611
283,-1.2308
284,-1.2005
285,-1.1715
286,-1.153
287,-1.1379
288,-1.1227
289,-1.1075
290,-1.0923
291,-1.0772
292,-1.062
293,-1.0468
294,-1.0316
295,-1.0166
296,-1.0023
297,-1.002
298,-1.002
299,-1.0024
300,-1.0086
301,-1.0238
302,-1.0390000000000001
303,-1.0536
304,-1.0568
305,-1.0568
306,-1.0568
307,-1.0568
308,-1.0568
309,-1.0568
310,-1.0566
311,-1.0475
312,-1.0323
313,-1.0172
314,-1.002
