time,value
0,-1.1327
1,-1.1359
2,-1.1324
3,-1.119
4,-1.0956
5,-1.0648
6,-1.0315
7,-1.0006
8,-0.9746600000000001
9,-0.9534100000000001
10,-0.93545
11,-0.91875
12,-0.90155
13,-0.88361
14,-0.8663700000000001
15,-0.85029
16,-0.83568
17,-0.82314
18,-0.8123
19,-0.80205
20,-0.7919
21,-0.7825
22,-0.77293
23,-0.76283
24,-0.7536
25,-0.7456
26,-0.73874
27,-0.7339899999999999
28,-0.73345
29,-0.73657
30,-0.74298
31,-0.7541
32,-0.76844
33,-0.78356
34,-0.79792
35,-0.81102
36,-0.81976
37,-0.8222299999999999
38,-0.81994
39,-0.81183
40,-0.7974600000000001
41,-0.77823
42,-0.75627
43,-0.73134
44,-0.7037399999999999
45,-0.67625
46,-0.6471100000000001
47,-0.6150899999999999
48,-0.58049
49,-0.54333
50,-0.50175
51,-0.45524
52,-0.40651
53,-0.3538
54,-0.29678000000000004
55,-0.23761
56,-0.17735
57,-0.11520999999999999
58,-0.051770000000000004
59,0.0097855
60,0.071238
61,0.1329
62,0.19209
63,0.24804
64,0.30122
65,0.35068
66,0.39365
67,0.43143000000000004
68,0.46371999999999997
69,0.48738000000000004
70,0.5012800000000001
71,0.5051399999999999
72,0.49877
73,0.48291000000000006
74,0.46235
75,0.44195
76,0.42495
77,0.41522
78,0.41472
79,0.42338000000000003
80,0.44041
81,0.46548
82,0.49746999999999997
83,0.53441
84,0.5756100000000001
85,0.6191800000000001
86,0.6627
87,0.7047899999999999
88,0.7446699999999999
89,0.78122
90,0.81298
91,0.84062
92,0.8629100000000001
93,0.8777299999999999
94,0.8841899999999999
95,0.8807799999999999
96,0.8647600000000001
97,0.83339
98,0.78722
99,0.72582
100,0.64963
101,0.56297
102,0.46988
103,0.37266
104,0.27257
105,0.17195
106,0.06939400000000001
107,-0.037613
108,-0.14761
109,-0.25914
110,-0.37065
111,-0.47891999999999996
112,-0.57852
113,-0.667
114,-0.74395
115,-0.80705
116,-0.8569899999999999
117,-0.89664
118,-0.92815
119,-0.95214
120,-0.971
121,-0.9876299999999999
122,-1.0003
123,-1.0096
124,-1.0173
125,-1.0237
126,-1.0279
127,-1.0313
128,-1.0362
129,-1.0394
130,-1.0408
131,-1.0416
132,-1.0405
133,-1.0362
134,-1.0296
135,-1.0238
136,-1.0158
137,-1.0066
138,-0.99836
139,-0.9907600000000001
140,-0.9829100000000001
141,-0.9757
142,-0.97173
143,-0.96857
144,-0.96585
145,-0.9646600000000001
146,-0.9639
147,-0.96141
148,-0.95678
149,-0.9522
150,-0.94584
151,-0.9373299999999999
152,-0.92879
153,-0.9202899999999999
154,-0.91033
155,-0.89889
156,-0.88838
157,-0.87708
158,-0.8640899999999999
159,-0.8506600000000001
160,-0.8353700000000001
161,-0.81583
162,-0.7914100000000001
163,-0.76385
164,-0.73245
165,-0.69755
166,-0.6613399999999999
167,-0.62278
168,-0.5798300000000001
169,-0.53145
170,-0.47785
171,-0.4177
172,-0.35084
173,-0.27938
174,-0.2029
175,-0.12161
176,-0.037568
177,0.04651
178,0.13033
179,0.21416
180,0.29686
181,0.38204
182,0.47118000000000004
183,0.56086
184,0.64453
185,0.71633
186,0.7701
187,0.7993899999999999
188,0.80783
189,0.80102
190,0.78203
191,0.75373
192,0.71967
193,0.6802699999999999
194,0.63198
195,0.57991
196,0.52846
197,0.47700000000000004
198,0.4262
199,0.37743000000000004
200,0.32847
201,0.27374
202,0.21838000000000002
203,0.16784000000000002
204,0.12305999999999999
205,0.090137
206,0.07509199999999999
207,0.07846900000000001
208,0.095944
209,0.12967
210,0.17862
211,0.23588
212,0.30204000000000003
213,0.37774
214,0.46146000000000004
215,0.55185
216,0.65204
217,0.76183
218,0.87635
219,0.99608
220,1.1182
221,1.2383
222,1.3555
223,1.4711
224,1.5851
225,1.6955
226,1.8063
227,1.9172
228,2.0269
229,2.137
230,2.2486
231,2.3599
232,2.4672
233,2.5682
234,2.6568
235,2.7261
236,2.7733
237,2.7973
238,2.7981
239,2.7776
240,2.7396
241,2.6844
242,2.6093
243,2.5108
244,2.3824
245,2.2167
246,2.0096
247,1.7636
248,1.4855
249,1.1879
250,0.89007
251,0.6098600000000001
252,0.36024
253,0.14939000000000002
254,-0.020493
255,-0.15574000000000002
256,-0.26697
257,-0.36013
258,-0.44248000000000004
259,-0.51972
260,-0.59222
261,-0.65855
262,-0.72085
263,-0.78351
264,-0.8443200000000001
265,-0.9051600000000001
266,-0.96729
267,-1.0249
268,-1.0712
269,-1.1038
