time,value
0,1.1476
1,1.1476
2,1.1476
3,1.1476
4,1.1476
5,1.1476
6,1.1476
7,1.1476
8,1.1476
9,1.1476
10,1.1476
11,1.1476
12,1.1476
13,1.1476
14,1.1476
15,1.1476
16,1.1476
17,1.1476
18,1.1476
19,1.1476
20,1.1476
21,1.1476
22,1.1476
23,1.1476
24,1.1476
25,1.1476
26,1.1476
27,1.1476
28,1.1476
29,1.1476
30,1.1476
31,1.1476
32,1.1476
33,1.1476
34,1.1476
35,1.1476
36,1.1476
37,1.1476
38,1.1476
39,1.1476
40,1.1476
41,1.1476
42,1.1476
43,1.1476
44,1.1476
45,1.1476
46,1.1476
47,1.1476
48,1.1476
49,1.1476
50,1.1476
51,1.1476
52,1.1476
53,1.1476
54,1.1476
55,1.1476
56,1.1476
57,1.1476
58,1.1476
59,1.1476
60,1.1476
61,1.1476
62,1.1476
63,1.1476
64,1.1476
65,1.1476
66,1.1476
67,1.1476
68,1.1476
69,1.1476
70,1.1476
71,1.1476
72,1.1476
73,1.1493
74,1.1564
75,1.171
76,1.2009999999999998
77,1.2309999999999999
78,1.261
79,1.2938
80,1.3295
81,1.375
82,1.4275
83,1.4799
84,1.5324
85,1.5802
86,1.6266
87,1.6591
88,1.6891
89,1.7191
90,1.7489
91,1.7658
92,1.7796
93,1.7646
94,1.7496
95,1.7346
96,1.7165
97,1.6899
98,1.6542
99,1.6018
100,1.5493
101,1.4968
102,1.4379
103,1.3732
104,1.2931
105,1.2032
106,1.1132
107,1.0233
108,0.92932
109,0.83421
110,0.7306
111,0.62568
112,0.52075
113,0.41563
114,0.30525
115,0.19371
116,0.36945
117,-0.23012
118,-0.16602999999999998
119,-0.28511
120,-0.40216999999999997
121,-0.51747
122,-0.62989
123,-0.74231
124,-0.8547299999999999
125,-0.96221
126,-1.0656
127,-1.1605
128,-1.2504
129,-1.3404
130,-1.4303
131,-1.5051
132,-1.5763
133,-1.6241
134,-1.6691
135,-1.714
136,-1.7572
137,-1.7727
138,-1.7827
139,-1.7602
140,-1.7377
141,-1.7153
142,-1.683
143,-1.6299
144,-1.5619999999999998
145,-1.472
146,-1.3821
147,-1.2921
148,-1.2225
149,-1.168
150,-1.1395
151,-1.1245
152,-1.1095
153,-1.0946
154,-1.0857
155,-1.078
156,-1.0774
157,-1.0774
158,-1.0774
159,-1.0774
160,-1.0774
161,-1.0774
162,-1.0774
163,-1.0774
164,-1.0774
165,-1.0774
166,-1.0774
167,-1.0774
168,-1.0774
169,-1.0774
170,-1.0774
171,-1.0774
172,-1.0774
173,-1.0774
174,-1.0774
175,-1.0774
176,-1.0774
177,-1.0774
178,-1.0774
179,-1.0774
180,-1.0774
181,-1.0774
182,-1.0774
183,-1.0774
184,-1.0774
185,-1.0774
186,-1.0774
187,-1.0774
188,-1.0725
189,-1.0590000000000002
190,-1.0414
191,-1.0189
192,-0.99644
193,-0.97396
194,-0.9514799999999999
195,-0.92899
196,-0.90651
197,-0.88402
198,-0.86154
199,-0.83906
200,-0.81657
201,-0.79409
202,-0.7716
203,-0.74912
204,-0.72664
205,-0.7054699999999999
206,-0.6928
207,-0.6812600000000001
208,-0.67377
209,-0.66627
210,-0.65878
211,-0.65128
212,-0.64379
213,-0.6362899999999999
214,-0.6288
215,-0.6213
216,-0.6138100000000001
217,-0.61635
218,-0.62439
219,-0.63752
220,-0.65251
221,-0.6675
222,-0.6824899999999999
223,-0.68309
224,-0.68213
225,-0.67472
226,-0.66722
227,-0.65973
228,-0.65051
229,-0.6321100000000001
230,-0.6127199999999999
231,-0.59023
232,-0.56775
233,-0.54527
234,-0.52741
235,-0.5161
236,-0.5067
237,-0.49921000000000004
238,-0.49171000000000004
239,-0.48422
240,-0.47288
241,-0.45966999999999997
242,-0.44511000000000006
243,-0.43012
244,-0.41513
245,-0.40014
246,-0.38515
247,-0.37016
248,-0.35517
249,-0.34018000000000004
250,-0.32519000000000003
251,-0.3113
252,-0.30230999999999997
253,-0.29372
254,-0.28622
255,-0.27873000000000003
256,-0.27123
257,-0.26374000000000003
258,-0.25624
259,-0.24875
260,-0.24125
261,-0.23376
262,-0.22626
263,-0.22313000000000002
264,-0.2219
265,-0.22163000000000002
266,-0.22163000000000002
267,-0.22163000000000002
268,-0.22163000000000002
269,-0.22163000000000002
270,-0.22163000000000002
271,-0.22163000000000002
272,-0.22163000000000002
273,-0.22163000000000002
274,-0.22163000000000002
275,-0.22163000000000002
276,-0.22163000000000002
277,-0.22163000000000002
278,-0.22163000000000002
279,-0.22163000000000002
280,-0.22163000000000002
281,-0.22163000000000002
282,-0.22163000000000002
283,-0.22163000000000002
284,-0.22163000000000002
285,-0.22163000000000002
286,-0.22653
287,-0.23335
288,-0.24070999999999998
289,-0.2482
290,-0.2557
291,-0.26319000000000004
292,-0.26391
293,-0.26442
294,-0.26442
295,-0.26442
296,-0.26442
297,-0.26605999999999996
298,-0.27315
299,-0.28036
300,-0.28786
301,-0.29535
302,-0.30285
303,-0.30682
304,-0.30709000000000003
305,-0.30721
306,-0.30721
307,-0.30721
308,-0.30721
309,-0.30721
310,-0.30721
311,-0.30721
312,-0.30721
313,-0.30721
314,-0.30721
315,0.46698999999999996
316,0.46698999999999996
317,0.46698999999999996
318,0.46698999999999996
319,0.46698999999999996
320,0.46698999999999996
321,0.46698999999999996
322,0.46698999999999996
323,0.46698999999999996
324,0.46698999999999996
325,0.46698999999999996
326,0.46698999999999996
327,0.46698999999999996
328,0.46698999999999996
329,0.46698999999999996
330,0.46698999999999996
331,0.46698999999999996
332,0.46698999999999996
333,0.46698999999999996
334,0.46698999999999996
335,0.46698999999999996
336,0.46698999999999996
337,0.46698999999999996
338,0.46698999999999996
339,0.46698999999999996
340,0.46698999999999996
341,0.46698999999999996
342,0.46771999999999997
343,0.47143999999999997
344,0.48562
345,0.52661
346,0.5676
347,0.60859
348,0.64757
349,0.68409
350,0.70101
351,0.70101
352,0.70101
353,0.70101
354,0.70101
355,0.70101
356,0.70101
357,0.70101
358,0.70101
359,0.70101
360,0.70101
361,0.70101
362,0.70101
363,0.70101
364,0.70101
365,0.70101
366,0.70101
367,0.70101
368,0.70101
369,0.70101
370,0.70101
371,0.70189
372,0.70376
373,0.71033
374,0.7205699999999999
375,0.73082
376,0.74107
377,0.7498199999999999
378,0.75802
379,0.75951
380,0.75951
381,0.75951
382,0.75951
383,0.75951
384,0.75951
385,0.75951
386,0.75951
387,0.75951
388,0.76188
389,0.77157
390,0.79156
391,0.83255
392,0.87354
393,0.9145399999999999
394,0.95683
395,1.0004
396,1.0485
397,1.0997
398,1.151
399,1.2022
400,1.2556
401,1.3096
402,1.3699
403,1.4314
404,1.4929
405,1.5544
406,1.6159
407,1.6773
408,1.7388
409,1.8003
410,1.8618
411,1.9224
412,1.9808
413,2.0366
414,2.0878
415,2.1390000000000002
416,2.1903
417,2.238
418,2.2825
419,2.3187
420,2.3494
421,2.3802
422,2.4109
423,2.4306
424,2.4472
425,2.4405
426,2.4303
427,2.42
428,2.4088
429,2.3725
430,2.3306
431,2.2486
432,2.1666
433,2.0846
434,1.9946
435,1.8853
436,1.7591
437,1.6054
438,1.4517
439,1.298
440,1.1353
441,0.96516
442,0.77945
443,0.5847399999999999
444,0.39004
445,0.19533
446,0.12430999999999999
447,-0.13994
448,-0.2675
449,-0.39047
450,-0.51344
451,-0.63532
452,-0.74041
453,-0.8421200000000001
454,-0.9241
455,-1.0061
456,-1.0881
457,-1.1523
458,-1.1784
459,-1.1775
460,-1.1365
461,-1.0955
462,-1.0545
463,-1.0163
464,-0.98016
465,-0.94757
466,-0.9168299999999999
467,-0.8860899999999999
468,-0.85535
469,-0.8246
470,-0.79386
471,-0.76312
472,-0.73237
473,-0.70163
474,-0.6722199999999999
475,-0.65713
476,-0.64461
477,-0.64461
478,-0.64461
479,-0.64461
480,-0.64646
481,-0.65186
482,-0.65933
483,-0.6695800000000001
484,-0.67983
485,-0.69008
486,-0.7036600000000001
487,-0.7195
488,-0.73852
489,-0.75902
490,-0.77951
491,-0.80001
492,-0.8205
493,-0.841
494,-0.86149
495,-0.8819899999999999
496,-0.90249
497,-0.9216700000000001
498,-0.93024
499,-0.93714
500,-0.93714
501,-0.93714
502,-0.93714
503,-0.93489
504,-0.92874
505,-0.92074
506,-0.9105
507,-0.90025
508,-0.89
509,-0.8758100000000001
510,-0.8592299999999999
511,-0.83988
512,-0.8193799999999999
513,-0.79889
514,-0.7783899999999999
515,-0.7579
516,-0.7374
517,-0.71691
518,-0.6964100000000001
519,-0.67592
520,-0.65632
521,-0.64253
522,-0.62952
523,-0.61927
524,-0.6090300000000001
525,-0.59878
526,-0.59122
527,-0.58787
528,-0.58611
529,-0.58611
530,-0.58611
531,-0.58611
532,-0.5906899999999999
533,-0.59777
534,-0.60716
535,-0.61741
536,-0.62766
537,-0.6379100000000001
538,-0.66127
539,-0.68605
540,-0.71672
541,-0.74746
542,-0.7782100000000001
543,-0.8054100000000001
544,-0.81379
545,-0.8201299999999999
546,-0.8201299999999999
547,-0.8201299999999999
548,-0.8201299999999999
549,-0.81696
550,-0.8093199999999999
551,-0.80038
552,-0.79013
553,-0.77988
554,-0.76964
555,-0.75939
556,-0.7491399999999999
557,-0.7388899999999999
558,-0.72865
559,-0.7184
560,-0.70815
561,-0.70533
562,-0.70312
563,-0.70312
564,-0.70312
565,-0.70312
566,-0.70162
567,-0.69342
568,-0.68467
569,-0.67443
570,-0.66418
571,-0.65393
572,-0.65104
573,-0.65757
574,-0.66604
575,-0.67629
576,-0.6865399999999999
577,-0.6967800000000001
578,-0.70107
579,-0.70275
580,-0.70312
581,-0.70312
582,-0.70312
583,-0.70312
584,-0.70312
585,-0.70312
586,-0.70312
587,-0.70312
588,-0.70312
589,-0.70312
590,-0.70312
591,-0.70312
592,-0.70312
593,-0.70312
594,-0.70312
595,-0.70735
596,-0.71648
597,-0.72622
598,-0.73647
599,-0.7467199999999999
600,-0.75697
601,-0.76051
602,-0.76144
603,-0.76162
604,-0.76162
605,-0.76162
606,-0.76162
607,-0.7709
608,-0.7804399999999999
609,-0.79069
610,-0.80094
611,-0.81119
612,-0.81919
613,-0.81975
614,-0.8201299999999999
615,-0.8201299999999999
616,-0.8201299999999999
617,-0.8201299999999999
618,-0.8201299999999999
619,-0.8201299999999999
620,-0.8201299999999999
621,-0.8201299999999999
622,-0.8201299999999999
623,-0.8201299999999999
624,-0.8276100000000001
625,-0.83768
626,-0.8478899999999999
627,-0.85814
628,-0.86839
629,-0.87864
630,-1.2339
631,-1.2339
632,-1.2339
633,-1.2339
634,-1.2339
635,-1.2339
636,-1.2339
637,-1.2339
638,-1.2339
639,-1.2339
640,-1.2339
641,-1.2339
642,-1.2339
643,-1.2339
644,-1.2339
645,-1.2339
646,-1.2339
647,-1.2339
648,-1.2339
649,-1.2339
650,-1.2339
651,-1.2339
652,-1.2339
653,-1.2339
654,-1.2339
655,-1.2339
656,-1.2339
657,-1.2345
658,-1.2374
659,-1.2487
660,-1.2811
661,-1.3135
662,-1.3459
663,-1.3767
664,-1.4056
665,-1.419
666,-1.419
667,-1.419
668,-1.419
669,-1.419
670,-1.419
671,-1.419
672,-1.419
673,-1.419
674,-1.419
675,-1.419
676,-1.419
677,-1.419
678,-1.419
679,-1.419
680,-1.419
681,-1.419
682,-1.419
683,-1.419
684,-1.419
685,-1.419
686,-1.419
687,-1.419
688,-1.419
689,-1.419
690,-1.419
691,-1.419
692,-1.419
693,-1.419
694,-1.419
695,-1.419
696,-1.419
697,-1.419
698,-1.419
699,-1.419
700,-1.419
701,-1.419
702,-1.419
703,-1.42
704,-1.4238
705,-1.4317
706,-1.4479
707,-1.4641
708,-1.4803
709,-1.4965
710,-1.5128
711,-1.5290000000000001
712,-1.5452
713,-1.5614
714,-1.5776
715,-1.5838
716,-1.5867
717,-1.5599
718,-1.5275
719,-1.4951
720,-1.4626
721,-1.4254
722,-1.3872
723,-1.3386
724,-1.2899
725,-1.2413
726,-1.1926
727,-1.1440000000000001
728,-1.0954
729,-1.0467
730,-0.99811
731,-0.9494799999999999
732,-0.90084
733,-0.85221
734,-0.80357
735,-0.7549399999999999
736,-0.7063
737,-0.65767
738,-0.59155
739,-0.52051
740,-0.41272
741,-0.29924
742,-0.18575999999999998
743,-0.35985
744,0.23703000000000002
745,0.16795
746,0.29764
747,0.42733000000000004
748,0.55702
749,0.68128
750,0.7924
751,0.8921600000000001
752,0.9732200000000001
753,1.0543
754,1.1353
755,1.2022
756,1.2573
757,1.2877
758,1.3039
759,1.3201
760,1.3364
761,1.2925
762,1.2342
763,1.0835
764,0.9213399999999999
765,0.7592300000000001
766,0.60574
767,0.5851
768,0.59122
769,0.75333
770,0.91545
771,1.0776
772,1.2233
773,1.3339
774,1.4195
775,1.4681
776,1.5167
777,1.5654
778,1.5701
779,1.5421
780,1.4578
781,1.3443
782,1.2308
783,1.1174
784,1.0303
785,0.94863
786,0.89717
787,0.84854
788,0.7999
789,0.75479
790,0.74742
791,0.74685
792,0.77927
793,0.8116899999999999
794,0.8441200000000001
795,0.8736200000000001
796,0.8975
797,0.9181
798,0.9343100000000001
799,0.95052
800,0.96673
801,0.9723799999999999
802,0.9709
803,0.9593700000000001
804,0.94315
805,0.92694
806,0.9107299999999999
807,0.8867200000000001
808,0.8613700000000001
809,0.8293799999999999
810,0.79695
811,0.76453
812,0.73314
813,0.71015
814,0.68848
815,0.67227
816,0.6560600000000001
817,0.63985
818,0.6272
819,0.62071
820,0.61715
821,0.61715
822,0.61715
823,0.61715
824,0.61715
825,0.61715
826,0.61715
827,0.61715
828,0.61715
829,0.61715
830,0.61715
831,0.61715
832,0.61715
833,0.61715
834,0.61715
835,0.61715
836,0.61715
837,0.61715
838,0.61715
839,0.61715
840,0.61715
841,0.62567
842,0.64748
843,0.6743399999999999
844,0.70676
845,0.7391800000000001
846,0.77161
847,0.79679
848,0.81801
849,0.83557
850,0.85178
851,0.8679899999999999
852,0.8842
853,0.90041
854,0.91663
855,0.93284
856,0.94905
857,0.96526
858,0.9777299999999999
859,0.9703700000000001
860,0.9608399999999999
861,0.94463
862,0.92842
863,0.9122100000000001
864,0.89599
865,0.8797799999999999
866,0.8635700000000001
867,0.84736
868,0.83115
869,0.81494
870,0.79872
871,0.78251
872,0.7663
873,0.7500899999999999
874,0.73388
875,0.71767
876,0.70145
877,0.68524
878,0.66903
879,0.65282
880,0.63661
881,0.6227699999999999
882,0.61953
883,0.61715
884,0.61715
885,0.61715
886,0.61715
887,0.60551
888,0.57898
889,0.5493600000000001
890,0.51694
891,0.48451000000000005
892,0.45208999999999994
893,0.42908999999999997
894,0.41023000000000004
895,0.39343
896,0.37722
897,0.36101
898,0.3448
899,0.32859
900,0.31238
901,0.29616
902,0.27995
903,0.26374000000000003
904,0.2534
905,0.26548
906,0.27876999999999996
907,0.29499000000000003
908,0.3112
909,0.32741
910,0.34362
911,0.35983000000000004
912,0.37604
913,0.39226
914,0.40847
915,0.42468
916,0.44088999999999995
917,0.4571
918,0.47331000000000006
919,0.48951999999999996
920,0.50574
921,0.52195
922,0.50883
923,0.49483
924,0.47862
925,0.46241000000000004
926,0.44619
927,0.43353
928,0.43265
929,0.43205
930,0.43205
931,0.43205
932,0.43205
933,0.43205
934,0.43205
935,0.43205
936,0.43205
937,0.43205
938,0.43205
939,0.43205
940,0.43205
941,0.43205
942,0.43205
943,0.43205
944,0.43205
