time,value
0,0.20142000000000002
1,0.20142000000000002
2,0.20142000000000002
3,0.20142000000000002
4,0.20142000000000002
5,0.20142000000000002
6,0.20142000000000002
7,0.20142000000000002
8,0.20142000000000002
9,0.20142000000000002
10,0.20142000000000002
11,0.20142000000000002
12,0.20142000000000002
13,0.20142000000000002
14,0.20142000000000002
15,0.20142000000000002
16,0.20142000000000002
17,0.20142000000000002
18,0.20142000000000002
19,0.20142000000000002
20,0.20142000000000002
21,0.20142000000000002
22,0.20368
23,0.21026
24,0.24034
25,0.27003
26,0.28081
27,0.28955
28,0.30188000000000004
29,0.33791
30,0.39016
31,0.45277
32,0.51562
33,0.5646
34,0.60063
35,0.63666
36,0.6726800000000001
37,0.7087100000000001
38,0.74474
39,0.7711399999999999
40,0.7779699999999999
41,0.78872
42,0.80628
43,0.84231
44,0.87834
45,0.9162399999999999
46,0.9654200000000001
47,1.0282
48,1.1003
49,1.1724
50,1.2371
51,1.2947
52,1.3317
53,1.3542
54,1.3571
55,1.3575
56,1.3575
57,1.3575
58,1.3575
59,1.3575
60,1.3575
61,1.3575
62,1.3483
63,1.2768
64,1.2157
65,1.1627
66,1.1277
67,1.1098
68,1.1098
69,1.1098
70,1.1088
71,1.1065
72,1.0756
73,1.0459
74,1.0309
75,1.0244
76,1.014
77,0.97801
78,0.9419799999999999
79,0.90538
80,0.86436
81,0.80575
82,0.73416
83,0.68577
84,0.64323
85,0.6072
86,0.57117
87,0.53514
88,0.49912
89,0.46308999999999995
90,0.42706000000000005
91,0.39103000000000004
92,0.355
93,0.31897
94,0.28294
95,0.24691
96,0.21088
97,0.17486
98,0.13883
99,0.1028
100,0.06677000000000001
101,0.030741
102,-0.0052875
103,-0.051862
104,-0.10837999999999999
105,-0.18043
106,-0.22776
107,-0.2715
108,-0.32041
109,-0.38609
110,-0.45255
111,-0.49305
112,-0.53073
113,-0.56676
114,-0.6027899999999999
115,-0.62116
116,-0.62432
117,-0.63971
118,-0.66432
119,-0.70035
120,-0.76703
121,-0.8378899999999999
122,-0.90995
123,-0.98201
124,-1.0359
125,-1.0369
126,-1.063
127,-1.105
128,-1.1762
129,-1.2258
130,-1.2618
131,-1.2979
132,-1.3328
133,-1.3667
134,-1.3675
135,-1.3675
136,-1.3675
137,-1.3736
138,-1.4023
139,-1.4743
140,-1.5115
141,-1.5338
142,-1.5386
143,-1.565
144,-1.5976
145,-1.6102
146,-1.6153
147,-1.6153
148,-1.6153
149,-1.6153
150,-1.6153
151,-1.6153
152,-1.6153
153,-1.6153
154,-1.6153
155,-1.6125
156,-1.6038
157,-1.574
158,-1.5504
159,-1.569
160,-1.5927
161,-1.6153
162,-1.6153
163,-1.6321
164,-1.6606
165,-1.6853
166,-1.6979
167,-1.6979
168,-1.6979
169,-1.6928
170,-1.6802
171,-1.6476
172,-1.6211
173,-1.6164
174,-1.6047
175,-1.5861
176,-1.5501
177,-1.5357
178,-1.5327
179,-1.5327
180,-1.5327
181,-1.5335
182,-1.5675
183,-1.5786
184,-1.565
185,-1.4969
186,-1.4384
187,-1.4016
188,-1.3804
189,-1.3674
190,-1.3669
191,-1.3399
192,-1.3039
193,-1.2679
194,-1.2306
195,-1.1892
196,-1.1172
197,-1.0565
198,-1.0052
199,-0.9691200000000001
200,-0.93309
201,-0.8970600000000001
202,-0.8610399999999999
203,-0.82501
204,-0.78898
205,-0.75295
206,-0.71692
207,-0.68089
208,-0.64486
209,-0.60883
210,-0.57281
211,-0.53678
212,-0.50075
213,-0.46471999999999997
214,-0.42868999999999996
215,-0.39266
216,-0.33099
217,-0.26459
218,-0.19253
219,-0.12047000000000001
220,-0.058024
221,-0.013054
222,0.032554
223,0.08517899999999999
224,0.15724000000000002
225,0.18872
226,0.20327
227,0.21431
228,0.24086999999999997
229,0.27689
230,0.31292
231,0.34895
232,0.38498000000000004
233,0.42101000000000005
234,0.47048999999999996
235,0.53755
236,0.59692
237,0.6477
238,0.6837300000000001
239,0.7197600000000001
240,0.7520899999999999
241,0.77313
242,0.77946
243,0.77432
244,0.74065
245,0.71544
246,0.69688
247,0.69688
248,0.69688
249,0.69688
250,0.69688
251,0.69699
252,0.69725
253,0.7287
254,0.77088
255,0.82585
256,0.8965700000000001
257,0.98774
258,1.1319
259,1.2482
260,1.3475
261,1.4196
262,1.4916
263,1.5618
264,1.5907
265,1.6052
266,1.6052
267,1.6052
268,1.5959999999999999
269,1.5731
270,1.5342
271,1.4832
272,1.4111
273,1.376
274,1.3545
275,1.3409
276,1.2881
277,1.2191
278,1.1726
279,1.1321
280,1.0961
281,1.0601
282,1.037
283,1.0278
284,1.0183
285,0.9985200000000001
286,0.96249
287,0.9264600000000001
288,0.8904299999999999
289,0.85441
290,0.81838
291,0.7764
292,0.71092
293,0.64113
294,0.56907
295,0.49701000000000006
296,0.42495
297,0.3529
298,0.28084000000000003
299,0.20878000000000002
300,0.13672
301,0.094221
302,0.061238
303,0.039937
304,0.036264
305,0.036264
306,0.036264
307,0.036264
308,0.036264
309,0.036264
310,0.036264
311,0.034638999999999996
312,0.017282
313,-0.010284
314,-0.046313
