time,value
0,-0.008043300000000001
1,1.2046
2,2.5181
3,3.5424
4,3.9746
5,3.7348
6,3.0019
7,2.1275
8,1.4713
9,1.2385
10,1.4017
11,1.7385
12,1.9614
13,1.8682
14,1.4364
15,0.81689
16,0.24111999999999997
17,-0.10275
18,-0.15703
19,-0.006021800000000001
20,0.18637
21,0.27058000000000004
22,0.18497
23,-0.028294999999999997
24,-0.26316999999999996
25,-0.41656000000000004
26,-0.44133
27,-0.36179
28,-0.2482
29,-0.17202
30,-0.1688
31,-0.2281
32,-0.30965
33,-0.37174
34,-0.39349
35,-0.3808
36,-0.35593
37,-0.34064
38,-0.34376999999999996
39,-0.35975
40,-0.37598000000000004
41,-0.38173
42,-0.37404
43,-0.35814
44,-0.34368000000000004
45,-0.3343
46,-0.32891
47,-0.32704
48,-0.32764
49,-0.32793
50,-0.32658000000000004
51,-0.32561999999999997
52,-0.32863000000000003
53,-0.33574
54,-0.34595
55,-0.3582
56,-0.36987
57,-0.37587
58,-0.37196999999999997
59,-0.35735
60,-0.33566
61,-0.31346
62,-0.2995
63,-0.30173
64,-0.32377
65,-0.36256
66,-0.40996000000000005
67,-0.45574
68,-0.49123999999999995
69,-0.51151
70,-0.5171600000000001
71,-0.5132899999999999
72,-0.50684
73,-0.50308
74,-0.50461
75,-0.5109899999999999
76,-0.51983
77,-0.52788
78,-0.5333
79,-0.53633
80,-0.53888
81,-0.54294
82,-0.5501199999999999
83,-0.56062
84,-0.57362
85,-0.58621
86,-0.596
87,-0.60219
88,-0.60658
89,-0.61127
90,-0.61865
91,-0.62946
92,-0.64222
93,-0.65235
94,-0.65572
95,-0.65069
96,-0.63998
97,-0.62852
98,-0.62238
