time,value
0,-0.7780600000000001
1,2.9044
2,5.9591
3,5.4707
4,2.3113
5,-0.19087
6,-0.41226999999999997
7,0.3304
8,0.37731
9,-0.1791
10,-0.39936
11,-0.14346
12,0.012369
13,-0.16018
14,-0.35168
15,-0.32259
16,-0.19615
17,-0.16169
18,-0.22080999999999998
19,-0.24915
20,-0.18173
21,-0.087402
22,-0.073795
23,-0.13851
24,-0.16787
25,-0.10680999999999999
26,-0.046586
27,-0.075485
28,-0.11457
29,-0.071758
30,0.019704
31,0.05714400000000001
32,0.050669
33,0.11587
34,0.30425
35,0.48756000000000005
36,0.48444
37,0.29504
38,0.13521
39,0.17164000000000001
40,0.28765999999999997
41,0.26699
42,0.15905
43,0.24986999999999998
44,0.59911
45,0.88841
46,0.86374
47,0.71006
48,0.71643
49,0.7842399999999999
50,0.5946600000000001
51,0.17817
52,-0.0742
53,0.010863
54,0.1508
55,0.062807
56,-0.13307
57,-0.17031
58,-0.06067
59,-0.04773
60,-0.21086999999999997
61,-0.37206999999999996
62,-0.36186999999999997
63,-0.24026
64,-0.18358
65,-0.26254
66,-0.38285
67,-0.42966000000000004
68,-0.40526
69,-0.40181999999999995
70,-0.46266
71,-0.51807
72,-0.49888999999999994
73,-0.43443000000000004
74,-0.41546000000000005
75,-0.45761
76,-0.49628
77,-0.48881
78,-0.4749
79,-0.50285
80,-0.55918
81,-0.59332
82,-0.5859800000000001
83,-0.56604
84,-0.56685
85,-0.59427
86,-0.6241899999999999
87,-0.63637
88,-0.63641
89,-0.65665
90,-0.71222
91,-0.77273
92,-0.78692
93,-0.7479
94,-0.70991
95,-0.72472
96,-0.7701600000000001
97,-0.76858
98,-0.68081
