time,value
0,1.6565
1,1.091
2,0.436
3,-0.24081999999999998
4,-0.8703700000000001
5,-1.3692
6,-1.6974
7,-1.8299
8,-1.7716
9,-1.5724
10,-1.2902
11,-0.97554
12,-0.6705
13,-0.40048
14,-0.17572000000000002
15,0.014591
16,0.18014000000000002
17,0.31818
18,0.40144
19,0.4263
20,0.39157
21,0.30906999999999996
22,0.20676
23,0.11098
24,0.074685
25,0.1288
26,0.28804
27,0.5182399999999999
28,0.77263
29,0.99085
30,1.1037
31,1.0851
32,0.92624
33,0.63922
34,0.28039000000000003
35,-0.099924
36,-0.46538999999999997
37,-0.76739
38,-0.97021
39,-1.0599
40,-1.0361
41,-0.92137
42,-0.7367100000000001
43,-0.51931
44,-0.31517
45,-0.14933
46,-0.037592
47,0.027622000000000004
48,0.067756
49,0.1234
50,0.2161
51,0.34918000000000005
52,0.5082399999999999
53,0.6549699999999999
54,0.73457
55,0.69899
56,0.53579
57,0.25532
58,-0.09240599999999999
59,-0.43205
60,-0.69277
61,-0.81535
62,-0.76136
63,-0.52646
64,-0.15709
65,0.28084000000000003
66,0.71542
67,1.0774
68,1.3097
69,1.3717
70,1.2382
71,0.9207700000000001
72,0.45761999999999997
73,-0.09423200000000001
74,-0.65449
75,-1.1438
76,-1.5034
77,-1.6841
78,-1.6712
79,-1.4965
80,-1.2042
81,-0.85683
82,-0.48789
83,-0.11314
84,0.27212
85,0.6611100000000001
86,1.0599
87,1.4361
88,1.7411
89,1.9208
90,1.9253
91,1.7295
92,1.3556
93,0.8447600000000001
94,0.27153
95,-0.28218000000000004
96,-0.76839
97,-1.1474
98,-1.4125
99,-1.5719999999999998
100,-1.6376
101,-1.5998
102,-1.4509
103,-1.1821
104,-0.79752
105,-0.32211999999999996
106,0.18747
107,0.67993
108,1.0907
109,1.3579
110,1.4753
111,1.4497
112,1.3069
113,1.0708
114,0.75802
115,0.39810999999999996
116,0.0030654
117,-0.38752
118,-0.74732
119,-1.0244
120,-1.1721
121,-1.1761
122,-1.0504
123,-0.82035
124,-0.5354899999999999
125,-0.24575999999999998
126,0.012318
127,0.21541
128,0.39461999999999997
129,0.56166
130,0.7259800000000001
131,0.8864299999999999
132,1.0061
133,1.0512
134,0.9958100000000001
135,0.83191
136,0.58787
137,0.31551999999999997
138,0.06428099999999999
139,-0.14379
140,-0.30783
141,-0.45748999999999995
142,-0.63276
143,-0.84793
144,-1.1025
145,-1.3462
146,-1.4871
147,-1.4546
148,-1.2082
149,-0.75165
150,-0.17002
151,0.43677
152,0.9618899999999999
153,1.3159
154,1.464
155,1.4321
156,1.2917
157,1.1094
158,0.9415600000000001
159,0.79802
160,0.66889
161,0.53847
162,0.3823
163,0.19747
164,-0.0048951
165,-0.1901
166,-0.32126
167,-0.4045
168,-0.45975
169,-0.52049
170,-0.61339
171,-0.7603300000000001
172,-0.96091
173,-1.1723
174,-1.349
175,-1.4301
176,-1.3716
177,-1.1519
178,-0.7658
179,-0.24693
180,0.3648
181,0.9991700000000001
182,1.5839
183,2.0403
184,2.3007
185,2.312
186,2.0728
187,1.6043
188,0.9726
189,0.27986
190,-0.36436
191,-0.87531
192,-1.1959
193,-1.3285
194,-1.3026
195,-1.1828
196,-1.0289
197,-0.86971
198,-0.72018
199,-0.55811
200,-0.33408000000000004
201,-0.030481
202,0.33551
203,0.72949
204,1.0781
205,1.2993
206,1.3534
207,1.2109
208,0.8920799999999999
209,0.45978
210,7.6325e-05
211,-0.40785
212,-0.71087
213,-0.88692
214,-0.9245200000000001
215,-0.85496
216,-0.71795
217,-0.54642
218,-0.3729
219,-0.20107
220,-0.037801999999999995
221,0.11269000000000001
222,0.2445
223,0.36033000000000004
224,0.45138999999999996
225,0.52446
226,0.5774100000000001
227,0.61112
228,0.63503
229,0.64707
230,0.64371
231,0.61164
232,0.53461
233,0.39969
234,0.19401
235,-0.068591
236,-0.36436
237,-0.66561
238,-0.92419
239,-1.1135
240,-1.1988
241,-1.1788
242,-1.0612
243,-0.8536799999999999
244,-0.61061
245,-0.34525
246,-0.068839
247,0.20109000000000002
248,0.46176999999999996
249,0.70443
250,0.9252100000000001
251,1.1301
252,1.2943
253,1.3945
254,1.4228
255,1.3673
256,1.2177
257,0.97365
258,0.6452
259,0.24365
260,-0.19229000000000002
261,-0.6434300000000001
262,-1.0607
263,-1.4044
264,-1.6337
265,-1.7169
266,-1.6544
267,-1.4635
268,-1.1779
269,-0.8361200000000001
270,-0.47991999999999996
271,-0.14715999999999999
272,0.14829
273,0.40131
274,0.6279
275,0.84759
276,1.0554
277,1.2374
278,1.3884
279,1.4697
280,1.4739
281,1.3766
282,1.1824
283,0.9069
284,0.56647
285,0.16996
286,-0.25288
287,-0.68585
288,-1.0938
289,-1.4352
290,-1.6791
291,-1.7978
292,-1.7489
293,-1.52
294,-1.1179999999999999
295,-0.57665
296,0.05457000000000001
297,0.7077
298,1.2921
299,1.7245
300,1.9304
301,1.8618
302,1.5267
303,0.97291
304,0.28148
305,-0.42817
306,-1.0196
307,-1.4123
308,-1.5393
309,-1.3912
310,-1.0184
311,-0.5017
312,0.042423
313,0.51008
314,0.83536
315,0.98011
316,0.96764
317,0.84809
318,0.67933
319,0.50925
320,0.36546999999999996
321,0.25193000000000004
322,0.15123
323,0.044504
324,-0.088296
325,-0.25590999999999997
326,-0.44819
327,-0.6451399999999999
328,-0.80042
329,-0.8828
330,-0.8722
331,-0.75653
332,-0.54474
333,-0.25051
334,0.087435
335,0.42868999999999996
336,0.72543
337,0.9475600000000001
338,1.0842
339,1.1157
340,1.0468
341,0.8870299999999999
342,0.6541899999999999
343,0.37027
344,0.053424
345,-0.26097
346,-0.55938
347,-0.8196899999999999
348,-1.0082
349,-1.1076
350,-1.0984
351,-0.98041
352,-0.7760100000000001
353,-0.50775
354,-0.21291999999999997
355,0.066135
356,0.29903
357,0.46698
358,0.55845
359,0.57748
360,0.55255
361,0.49882
362,0.45485
363,0.42121000000000003
364,0.40126999999999996
365,0.3932
366,0.374
367,0.33526999999999996
368,0.26624000000000003
369,0.16180999999999998
370,0.029501999999999997
371,-0.11235999999999999
372,-0.24405
373,-0.3314
374,-0.3483
375,-0.30223
376,-0.20835
377,-0.087163
378,0.028861
379,0.11587
380,0.14178
381,0.10176
382,0.026376
383,-0.064695
384,-0.14795
385,-0.21227
386,-0.2448
387,-0.26366999999999996
388,-0.26542
389,-0.2581
390,-0.23510999999999999
391,-0.18807000000000001
392,-0.091765
393,0.051557000000000006
394,0.22453
395,0.39714
396,0.53477
397,0.6063
398,0.58457
399,0.48508
400,0.32550999999999997
401,0.16317
402,0.028756
403,-0.052287
404,-0.07283300000000001
405,-0.045721
406,-0.0028353000000000002
407,0.014111000000000002
408,-0.0004212
409,-0.06738999999999999
410,-0.17815999999999999
411,-0.32509
412,-0.5001399999999999
413,-0.6754399999999999
414,-0.82581
415,-0.92169
416,-0.9188799999999999
417,-0.7812899999999999
418,-0.50142
419,-0.075475
420,0.47092
421,1.0657
422,1.6167
423,2.0322
424,2.2336
425,2.1757
426,1.8681
427,1.3628
428,0.74366
429,0.089183
430,-0.51872
431,-1.0318
432,-1.4369
433,-1.7265
434,-1.9165
435,-2.0048
436,-1.983
437,-1.8286
438,-1.5359
439,-1.1138
440,-0.5789300000000001
441,0.007352199999999999
442,0.58343
443,1.0828
444,1.4514
445,1.6549
446,1.6857
447,1.5701
448,1.3557
449,1.067
450,0.74915
451,0.43986000000000003
452,0.1711
453,-0.034476
454,-0.14965
455,-0.17429
456,-0.11005999999999999
457,0.012565999999999999
458,0.14973
459,0.25269
460,0.27715
461,0.18728
462,-0.015998
463,-0.32968000000000003
464,-0.7197
465,-1.1279
466,-1.4919
467,-1.7616
468,-1.89
469,-1.8524
470,-1.6323
471,-1.2333
472,-0.68035
473,-0.0086836
474,0.72192
475,1.4339
476,2.0647
477,2.5402
478,2.7957
479,2.8027
480,2.5664
481,2.1506
482,1.5939
483,0.95654
484,0.29375999999999997
485,-0.34171999999999997
486,-0.92942
487,-1.4467
488,-1.8756
489,-2.2001
490,-2.4044
491,-2.4714
492,-2.374
493,-2.109
494,-1.6909
495,-1.1487
496,-0.5193300000000001
497,0.1519
498,0.8199
499,1.4346
