time,value
0,1.8294
1,3.2849
2,3.2849
3,3.2849
4,3.2849
5,3.2849
6,3.2849
7,3.2849
8,3.2849
9,3.2849
10,2.9730000000000003
11,3.2849
12,3.2849
13,3.2849
14,2.9730000000000003
15,-0.66565
16,-0.71763
17,-0.76961
18,-0.71763
19,-0.76961
20,0.89379
21,1.1017
22,1.3096
23,-0.76961
24,-0.71763
25,-0.76961
26,-0.71763
27,-0.76961
28,-0.71763
29,-0.76961
30,-0.71763
31,-0.76961
32,-0.71763
33,-0.76961
34,-0.76961
35,-0.71763
36,-0.76961
37,-0.71763
38,-0.76961
39,-0.71763
40,-0.76961
41,-0.71763
42,-0.76961
43,-0.71763
44,-0.76961
45,-0.71763
46,-0.76961
47,-0.71763
48,-0.76961
49,-0.71763
50,-0.76961
51,-0.71763
52,-0.76961
53,-0.71763
54,-0.76961
55,-0.71763
56,0.47794
57,1.1017
58,1.3096
59,1.3096
60,1.1017
61,1.1017
62,1.3096
63,1.1017
64,1.1017
65,1.1017
66,1.1017
67,1.1017
68,-0.2498
69,-0.76961
70,-0.71763
71,-0.76961
72,-0.71763
73,-0.76961
74,-0.71763
75,-0.76961
76,-0.71763
77,-0.76961
78,-0.71763
79,-0.76961
80,-0.71763
81,-0.76961
82,-0.71763
83,-0.76961
84,-0.71763
85,-0.76961
86,-0.71763
87,-0.76961
88,-0.71763
89,-0.76961
90,-0.71763
91,-0.76961
92,-0.71763
93,-0.14584
94,0.89379
95,1.1017
96,1.1017
97,0.89379
98,1.1017
99,1.1017
100,0.16605
101,-0.76961
102,-0.71763
103,-0.76961
104,-0.71763
105,-0.76961
106,0.89379
107,1.1017
108,1.1017
109,1.1017
110,1.1017
111,1.1017
112,1.3096
113,1.1017
114,1.1017
115,1.1017
116,1.3096
117,1.1017
118,1.1017
119,1.1017
120,1.1017
121,1.1017
122,1.1017
123,1.1017
124,1.1017
125,1.1017
126,1.1017
127,1.1017
128,1.1017
129,1.1017
130,1.1017
131,1.1017
132,1.1017
133,1.1017
134,0.010107
135,-0.71763
136,-0.71763
137,-0.76961
138,-0.71763
139,-0.76961
140,-0.71763
141,-0.76961
142,-0.71763
143,-0.76961
144,-0.71763
145,-0.76961
146,-0.71763
147,-0.76961
148,-0.76961
149,-0.71763
150,-0.76961
151,-0.71763
152,-0.76961
153,-0.71763
154,-0.76961
155,-0.71763
156,-0.76961
157,-0.71763
158,-0.76961
159,-0.71763
160,-0.76961
161,-0.71763
162,-0.76961
163,-0.71763
164,-0.76961
165,-0.71763
166,-0.76961
167,-0.71763
168,-0.76961
169,-0.71763
170,-0.76961
171,-0.71763
172,-0.76961
173,-0.76961
174,-0.71763
175,-0.76961
176,-0.71763
177,-0.76961
178,-0.71763
179,-0.76961
180,-0.71763
181,-0.76961
182,-0.71763
183,-0.76961
184,-0.71763
185,-0.76961
186,-0.71763
187,-0.76961
188,-0.71763
189,-0.76961
190,-0.71763
191,-0.76961
192,-0.71763
193,-0.76961
194,-0.71763
195,-0.76961
196,-0.71763
197,-0.76961
198,-0.76961
199,-0.71763
200,-0.76961
201,-0.71763
202,-0.76961
203,-0.71763
204,-0.76961
205,-0.71763
206,-0.76961
207,-0.71763
208,-0.76961
209,-0.71763
210,-0.76961
211,-0.71763
212,-0.76961
213,-0.71763
214,-0.76961
215,-0.71763
216,-0.76961
217,-0.71763
218,1.1017
219,1.1017
220,1.1017
221,1.3096
222,1.3096
223,1.1017
224,1.3096
225,1.1017
226,1.3096
227,1.1017
228,1.3096
229,1.1017
230,1.3096
231,1.1017
232,1.3096
233,1.1017
234,1.1017
235,1.3096
236,1.1017
237,1.1017
238,1.1017
239,1.3096
240,1.1017
241,1.1017
242,1.1017
243,1.3096
244,-0.14584
245,-0.71763
246,-0.71763
247,-0.76961
248,-0.71763
249,-0.76961
250,-0.71763
251,-0.76961
252,-0.71763
253,-0.76961
254,-0.71763
255,-0.76961
256,-0.76961
257,-0.71763
258,-0.76961
259,-0.71763
260,-0.76961
261,-0.71763
262,-0.71763
263,-0.76961
264,-0.71763
265,-0.76961
266,-0.71763
267,-0.76961
268,-0.76961
269,-0.71763
270,-0.76961
271,-0.71763
272,-0.76961
273,-0.71763
274,-0.76961
275,-0.71763
276,-0.76961
277,-0.71763
278,-0.76961
279,-0.71763
280,-0.71763
281,-0.76961
282,-0.71763
283,-0.76961
284,-0.71763
285,0.68586
286,0.89379
287,1.1017
288,1.3096
289,1.1017
290,1.1017
291,1.1017
292,0.89379
293,0.010107
294,-0.76961
295,-0.71763
296,-0.76961
297,-0.71763
298,-0.76961
299,-0.71763
300,-0.76961
301,-0.71763
302,-0.76961
303,-0.71763
304,-0.76961
305,-0.71763
306,-0.76961
307,-0.71763
308,-0.76961
309,-0.71763
310,-0.76961
311,-0.71763
312,-0.76961
313,-0.71763
314,-0.76961
315,0.68586
316,1.1017
317,1.3096
318,1.1017
319,1.3096
320,1.1017
321,1.1017
322,1.3096
323,1.1017
324,1.1017
325,1.3096
326,1.1017
327,1.1017
328,1.1017
329,1.3096
330,1.1017
331,1.1017
332,1.1017
333,1.1017
334,1.1017
335,1.3096
336,1.1017
337,1.1017
338,1.1017
339,1.1017
340,0.89379
341,-0.6136699999999999
342,-0.76961
343,-0.71763
344,-0.76961
345,-0.71763
346,-0.76961
347,-0.71763
348,-0.76961
349,-0.71763
350,-0.76961
351,-0.71763
352,-0.76961
353,-0.71763
354,-0.76961
355,-0.71763
356,-0.76961
357,-0.71763
358,-0.76961
359,-0.71763
360,-0.76961
361,-0.71763
362,-0.76961
363,-0.71763
364,-0.76961
365,-0.71763
366,-0.76961
367,-0.71763
368,-0.76961
369,-0.71763
370,-0.76961
371,-0.71763
372,-0.76961
373,-0.71763
374,-0.76961
375,-0.71763
376,-0.76961
377,-0.66565
378,-0.66565
379,-0.2498
380,1.3096
381,1.1017
382,1.5695
383,1.3096
384,1.1017
385,1.3096
386,1.1017
387,1.3096
388,1.1017
389,1.3096
390,1.1017
391,1.3096
392,1.1017
393,1.1017
394,1.3096
395,1.1017
396,1.1017
397,1.1017
398,1.1017
399,1.1017
400,1.1017
401,1.1017
402,1.1017
403,1.1017
404,0.010107
405,-0.66565
406,-0.76961
407,-0.71763
408,-0.76961
409,-0.71763
410,-0.76961
411,-0.71763
412,-0.76961
413,-0.76961
414,-0.71763
415,-0.76961
416,-0.71763
417,-0.76961
418,-0.71763
419,-0.76961
420,-0.71763
421,-0.76961
422,-0.71763
423,-0.76961
424,-0.71763
425,-0.76961
426,-0.71763
427,-0.76961
428,-0.71763
429,-0.76961
430,-0.71763
431,-0.76961
432,-0.71763
433,-0.76961
434,-0.71763
435,-0.76961
436,-0.71763
437,-0.76961
438,-0.71763
439,-0.76961
440,-0.71763
441,-0.76961
442,-0.71763
443,-0.76961
444,-0.71763
445,-0.76961
446,-0.71763
447,-0.76961
448,-0.71763
449,-0.76961
450,-0.71763
451,-0.76961
452,-0.71763
453,-0.76961
454,-0.71763
455,-0.76961
456,-0.71763
457,-0.76961
458,0.010107
459,1.1017
460,1.3096
461,1.1017
462,1.3096
463,1.1017
464,1.3096
465,1.1017
466,1.3096
467,1.3096
468,1.1017
469,1.3096
470,1.3096
471,1.1017
472,1.3096
473,1.1017
474,1.1017
475,1.3096
476,1.1017
477,1.1017
478,1.1017
479,1.1017
480,1.1017
481,1.1017
482,1.1017
483,1.3096
484,1.1017
485,1.1017
486,1.3096
487,1.1017
488,1.1017
489,1.1017
490,1.3096
491,1.1017
492,1.1017
493,1.1017
494,1.1017
495,1.1017
496,1.1017
497,1.1017
498,1.1017
499,1.1017
500,1.1017
501,1.1017
502,1.1017
503,1.1017
504,1.1017
505,0.89379
506,0.16605
507,-0.71763
508,-0.71763
509,-0.76961
510,-0.71763
511,-0.71763
512,-0.71763
513,-0.71763
514,-0.71763
515,-0.76961
516,-0.71763
517,-0.76961
518,-0.71763
519,-0.76961
520,-0.71763
521,-0.76961
522,-0.71763
523,-0.76961
524,-0.71763
525,-0.76961
526,-0.71763
527,-0.76961
528,-0.71763
529,-0.76961
530,0.16605
531,1.1017
532,1.1017
533,1.1017
534,1.1017
535,1.3096
536,1.1017
537,1.1017
538,1.1017
539,1.1017
540,1.1017
541,1.3096
542,1.1017
543,0.89379
544,-0.45771999999999996
545,-0.6136699999999999
546,-0.76961
547,-0.71763
548,-0.76961
549,-0.71763
550,-0.76961
551,-0.71763
552,-0.76961
553,-0.71763
554,-0.76961
555,-0.71763
556,-0.76961
557,-0.71763
558,-0.76961
559,-0.71763
560,-0.76961
561,-0.71763
562,-0.76961
563,-0.71763
564,-0.76961
565,-0.76961
566,-0.71763
567,-0.76961
568,-0.71763
569,-0.76961
570,-0.71763
571,-0.76961
572,-0.71763
573,-0.76961
574,-0.71763
575,-0.71763
576,-0.71763
577,-0.76961
578,-0.71763
579,-0.14584
580,1.1017
581,1.3096
582,1.1017
583,1.3096
584,1.1017
585,1.1017
586,1.1017
587,1.3096
588,1.1017
589,1.1017
590,1.3096
591,1.1017
592,1.1017
593,1.1017
594,1.1017
595,1.1017
596,1.3096
597,-0.5616899999999999
598,-0.71763
599,-0.76961
600,-0.71763
601,-0.76961
602,-0.71763
603,-0.76961
604,-0.71763
605,-0.76961
606,-0.71763
607,-0.76961
608,-0.71763
609,-0.76961
610,-0.71763
611,-0.76961
612,-0.71763
613,-0.76961
614,-0.71763
615,-0.76961
616,-0.71763
617,-0.5616899999999999
618,1.3096
619,1.3096
620,1.1017
621,1.1017
622,1.3096
623,1.1017
624,1.3096
625,1.1017
626,1.1017
627,1.3096
628,1.1017
629,1.1017
630,1.1017
631,1.1017
632,1.1017
633,1.1017
634,1.1017
635,1.1017
636,0.68586
637,-0.6136699999999999
638,-0.76961
639,-0.71763
640,-0.76961
641,-0.71763
642,-0.76961
643,-0.71763
644,-0.76961
645,-0.71763
646,-0.76961
647,-0.71763
648,-0.76961
649,-0.71763
650,-0.76961
651,-0.71763
652,-0.76961
653,-0.71763
654,-0.76961
655,-0.71763
656,-0.76961
657,-0.71763
658,-0.76961
659,-0.71763
660,-0.76961
661,-0.71763
662,-0.76961
663,-0.71763
664,-0.71763
665,-0.66565
666,-0.76961
667,-0.71763
668,-0.76961
669,-0.71763
670,1.3096
671,1.1017
672,1.1017
673,1.3096
674,1.1017
675,1.1017
676,1.3096
677,1.1017
678,1.1017
679,1.1017
680,1.3096
681,1.1017
682,1.1017
683,1.1017
684,1.1017
685,1.1017
686,1.1017
687,1.1017
688,1.1017
689,-0.14584
690,-0.71763
691,-0.76961
692,-0.71763
693,-0.76961
694,-0.71763
695,-0.76961
696,-0.71763
697,-0.76961
698,-0.71763
699,-0.76961
700,-0.71763
701,-0.76961
702,-0.71763
703,-0.76961
704,-0.71763
705,-0.76961
706,-0.71763
707,-0.76961
708,-0.71763
709,-0.76961
710,-0.71763
711,-0.76961
712,-0.71763
713,-0.76961
714,-0.71763
715,-0.76961
716,-0.71763
717,-0.76961
718,-0.71763
719,-0.76961
