time,value
0,1.0936
1,1.0936
2,1.0936
3,1.0936
4,1.0936
5,1.0936
6,1.0936
7,1.0936
8,1.0936
9,1.0936
10,1.0936
11,1.0936
12,1.0936
13,1.0936
14,1.0936
15,1.0936
16,1.0936
17,1.0936
18,1.0936
19,1.0936
20,1.0936
21,1.0936
22,1.0936
23,1.0936
24,1.0936
25,1.0936
26,1.0936
27,1.0936
28,1.1107
29,1.1302
30,1.1505
31,1.1707
32,1.1905
33,1.1939
34,1.1939
35,1.1939
36,1.1939
37,1.1904
38,1.1754
39,1.1551
40,1.1348
41,1.1145
42,1.0886
43,1.0543
44,1.0137
45,0.9731299999999999
46,0.93255
47,0.8852
48,0.8306100000000001
49,0.76858
50,0.69604
51,0.6165
52,0.52837
53,0.43227
54,0.33081
55,0.22935
56,0.12789
57,0.14127
58,-0.36603
59,-0.17649
60,-0.27795
61,-0.37942
62,-0.47636999999999996
63,-0.5581699999999999
64,-0.6402800000000001
65,-0.7350899999999999
66,-0.8356100000000001
67,-0.93306
68,-1.0142
69,-1.0921
70,-1.1609
71,-1.2192
72,-1.2686
73,-1.2908
74,-1.3111
75,-1.3314
76,-1.351
77,-1.3624
78,-1.3648
79,-1.3701
80,-1.3827
81,-1.403
82,-1.4233
83,-1.4436
84,-1.459
85,-1.4651
86,-1.4651
87,-1.4771
88,-1.4948
89,-1.5117
90,-1.515
91,-1.5153
92,-1.5036
93,-1.4845
94,-1.463
95,-1.4226
96,-1.3843
97,-1.3648
98,-1.3648
99,-1.3648
100,-1.3648
101,-1.3677
102,-1.3776
103,-1.3979
104,-1.4182
105,-1.4384
106,-1.455
107,-1.4651
108,-1.4651
109,-1.4651
110,-1.4651
111,-1.4615
112,-1.4501
113,-1.4298
114,-1.4
115,-1.3635
116,-1.3229
117,-1.2823
118,-1.2418
119,-1.1916
120,-1.1337
121,-1.0729
122,-1.012
123,-0.95111
124,-0.89896
125,-0.8573700000000001
126,-0.81711
127,-0.7945300000000001
128,-0.7753800000000001
129,-0.76273
130,-0.7628199999999999
131,-0.7663300000000001
132,-0.78222
133,-0.8002100000000001
134,-0.8129
135,-0.8129
136,-0.80702
137,-0.7922899999999999
138,-0.76948
139,-0.74068
140,-0.70009
141,-0.66674
142,-0.64066
143,-0.62036
144,-0.60007
145,-0.5797800000000001
146,-0.5594899999999999
147,-0.5392
148,-0.51878
149,-0.48378999999999994
150,-0.44477
151,-0.41834
152,-0.41153
153,-0.41153
154,-0.41153
155,-0.41153
156,-0.42272
157,-0.4617
158,-0.50149
159,-0.52737
160,-0.5446
161,-0.5502199999999999
162,-0.50964
163,-0.47246000000000005
164,-0.44509
165,-0.42168
166,-0.3902
167,-0.32955999999999996
168,-0.26869
169,-0.20781
170,-0.14693
171,-0.42115
172,-0.11677
173,0.15867
174,0.39771999999999996
175,0.1183
176,0.1471
177,0.16990999999999998
178,0.19577
179,0.23046999999999998
180,0.27105
181,0.28626
182,0.29086999999999996
183,0.29086999999999996
184,0.29086999999999996
185,0.29086999999999996
186,0.30351999999999996
187,0.32266
188,0.34754
189,0.40778000000000003
190,0.46853999999999996
191,0.52942
192,0.59103
193,0.65478
194,0.73538
195,0.8135
196,0.88397
197,0.9442
198,0.9990100000000001
199,1.0422
200,1.0909
201,1.153
202,1.2342
203,1.3065
204,1.371
205,1.4277
206,1.4768
207,1.5173
208,1.5276
209,1.5185
210,1.4982
211,1.4779
212,1.4576
213,1.4477
214,1.4448
215,1.4479
216,1.4824
217,1.5218
218,1.5624
219,1.6030000000000002
220,1.6436
221,1.6842
222,1.7236
223,1.7556
224,1.7753
225,1.7889
226,1.7756
227,1.7553
228,1.735
229,1.7147
230,1.6821
231,1.6309
232,1.5671
233,1.4972
234,1.416
235,1.3425
236,1.2764
237,1.2179
238,1.1684
239,1.1272
240,1.0866
241,1.046
242,1.0054
243,0.9648200000000001
244,0.92424
245,0.8677799999999999
246,0.79322
247,0.71205
248,0.63088
249,0.54971
250,0.4752
251,0.41341999999999995
252,0.35254
253,0.29167
254,0.23079000000000002
255,0.16990999999999998
256,0.10903
257,0.28481
258,0.1213
259,0.19105999999999998
260,-0.16151
261,-0.46588999999999997
262,-0.1666
263,-0.25415
264,-0.35235
265,-0.43656000000000006
266,-0.49973
267,-0.54175
268,-0.56204
269,-0.56108
270,-0.53743
271,-0.5010100000000001
272,-0.47297
273,-0.4617
274,-0.4617
275,-0.4617
276,-0.4617
277,-0.46701000000000004
278,-0.48375
279,-0.5040399999999999
280,-0.53792
281,-0.57738
282,-0.61115
283,-0.61211
284,-0.61123
285,-0.59863
286,-0.57834
287,-0.55805
288,-0.53776
289,-0.51747
290,-0.49717
291,-0.48076
292,-0.48411000000000004
293,-0.53792
294,-0.59436
295,-0.64385
296,-0.6844399999999999
297,-0.72502
298,-0.76561
299,-0.79197
300,-0.79596
301,-0.77567
302,-0.76607
303,-0.76273
304,-0.76273
305,-0.76273
306,-0.76273
307,-0.76273
308,-0.76273
309,-0.76273
310,-0.76273
311,-0.76273
312,-0.77346
313,-0.79261
314,-0.8129
315,-0.21214
316,-0.21214
317,-0.21214
318,-0.21214
319,-0.21214
320,-0.21214
321,-0.21214
322,-0.21214
323,-0.21214
324,-0.21214
325,-0.21214
326,-0.21214
327,-0.21214
328,-0.21214
329,-0.21214
330,-0.21214
331,-0.21214
332,-0.21214
333,-0.21214
334,-0.21214
335,-0.21214
336,-0.21214
337,-0.21214
338,-0.21214
339,-0.21214
340,-0.21214
341,-0.21214
342,-0.21214
343,-0.21214
344,-0.21214
345,-0.18168
346,-0.10544
347,-0.12149000000000001
348,0.11288
349,0.30243000000000003
350,0.43677
351,0.43677
352,0.43677
353,0.43677
354,0.43677
355,0.43677
356,0.43677
357,0.49246
358,0.1244
359,0.16452999999999998
360,0.20465999999999998
361,0.24479
362,0.2983
363,0.36613
364,0.44185
365,0.47598
366,0.48241000000000006
367,0.46865
368,0.43911999999999995
369,0.39899
370,0.3868
371,0.38319000000000003
372,0.37091999999999997
373,0.33769
374,0.29756
375,0.28611
376,0.28397
377,0.30180999999999997
378,0.37954
379,0.45787
380,0.51117
381,0.55503
382,0.61102
383,0.73141
384,0.8387399999999999
385,0.9102600000000001
386,0.9504
387,0.9905299999999999
388,1.0307
389,1.0614
390,1.0777
391,1.0764
392,1.0587
393,1.0234
394,0.99369
395,0.9785200000000001
396,0.9785200000000001
397,0.9562799999999999
398,0.92196
399,0.87225
400,0.80409
401,0.72383
402,0.66719
403,0.62208
404,0.57509
405,0.50146
406,0.42173999999999995
407,0.34148
408,0.26122
409,0.18324000000000001
410,0.1428
411,0.09821
412,0.090765
413,-0.10407000000000001
414,-0.22446
415,-0.34485
416,-0.46524
417,-0.5856399999999999
418,-0.7054199999999999
419,-0.8134899999999999
420,-0.90036
421,-0.98062
422,-1.0609
423,-1.1411
424,-1.2046
425,-1.253
426,-1.2931
427,-1.3333
428,-1.3734
429,-1.3947
430,-1.4028
431,-1.3977
432,-1.3696
433,-1.3307
434,-1.2906
435,-1.2505
436,-1.2103
437,-1.1702
438,-1.1301
439,-1.1245
440,-1.1604
441,-1.2006
442,-1.2407
443,-1.2808
444,-1.3209
445,-1.3611
446,-1.4012
447,-1.4413
448,-1.4815
449,-1.5216
450,-1.5617
451,-1.6019
452,-1.642
453,-1.6771
454,-1.7005
455,-1.7005
456,-1.7147
457,-1.7434
458,-1.7765
459,-1.7711
460,-1.7355
461,-1.7105
462,-1.7005
463,-1.7005
464,-1.7005
465,-1.7005
466,-1.7005
467,-1.7005
468,-1.7005
469,-1.7309
470,-1.7690000000000001
471,-1.8092
472,-1.8493
473,-1.8878
474,-1.8989
475,-1.8969
476,-1.8872
477,-1.8471
478,-1.8069
479,-1.7668
480,-1.7205
481,-1.6583
482,-1.5383
483,-1.4280000000000002
484,-1.3326
485,-1.2569
486,-1.2114
487,-1.2043
488,-1.1929
489,-1.1671
490,-1.1269
491,-1.0635
492,-0.98821
493,-0.91895
494,-0.86718
495,-0.82705
496,-0.78692
497,-0.74679
498,-0.7066600000000001
499,-0.6665300000000001
500,-0.6264
501,-0.56125
502,-0.48325
503,-0.40299
504,-0.32273
505,-0.24247
506,-0.16221
507,-0.4006
508,0.14722000000000002
509,0.40202
510,0.15282
511,0.21193
512,0.25334
513,0.30546999999999996
514,0.38066
515,0.45283999999999996
516,0.5118
517,0.55193
518,0.59206
519,0.6321899999999999
520,0.67232
521,0.71245
522,0.75259
523,0.81272
524,0.8856200000000001
525,0.9592700000000001
526,1.0117
527,1.0525
528,1.0926
529,1.1327
530,1.1759
531,1.2502
532,1.3293
533,1.4095
534,1.4897
535,1.5697
536,1.6121
537,1.6499
538,1.6731
539,1.6731
540,1.6731
541,1.6731
542,1.6681
543,1.6516
544,1.6114
545,1.5713
546,1.5312
547,1.4911
548,1.4509
549,1.4108
550,1.3707
551,1.3305
552,1.2904
553,1.2503
554,1.2101
555,1.2027
556,1.224
557,1.2604
558,1.2429999999999999
559,1.2079
560,1.1678
561,1.1277
562,1.0875
563,1.0152
564,0.93681
565,0.85655
566,0.77636
567,0.6973600000000001
568,0.64831
569,0.61032
570,0.58163
571,0.58163
572,0.58853
573,0.61639
574,0.65291
575,0.68086
576,0.68086
577,0.68086
578,0.68086
579,0.68086
580,0.68086
581,0.68086
582,0.70572
583,0.75922
584,0.8394799999999999
585,0.91974
586,1.0
587,1.0679
588,1.1191
589,1.1593
590,1.2259
591,1.3021
592,1.3613
593,1.3754
594,1.3754
595,1.3217
596,1.2458
597,1.1656
598,1.0853
599,1.0070000000000001
600,0.9516600000000001
601,0.90986
602,0.8635
603,0.7832399999999999
604,0.70927
605,0.65178
606,0.60782
607,0.5443100000000001
608,0.43091
609,0.31051
610,0.19012
611,0.35925
612,-0.15265
613,-0.1186
614,-0.18949000000000002
615,-0.24563000000000001
616,-0.28576
617,-0.30475
618,-0.31135999999999997
619,-0.31947
620,-0.34706
621,-0.38719000000000003
622,-0.42732
623,-0.46745
624,-0.50759
625,-0.54772
626,-0.58785
627,-0.62798
628,-0.66811
629,-0.70824
630,0.41494
631,0.41494
632,0.41494
633,0.41494
634,0.41494
635,0.41494
636,0.41494
637,0.41494
638,0.41494
639,0.41494
640,0.41494
641,0.41494
642,0.41494
643,0.41494
644,0.41494
645,0.41494
646,0.41494
647,0.41494
648,0.41494
649,0.41494
650,0.41494
651,0.41494
652,0.41494
653,0.41494
654,0.41494
655,0.41494
656,0.41494
657,0.41494
658,0.43903000000000003
659,0.46636000000000005
660,0.50569
661,0.5614100000000001
662,0.61912
663,0.6998800000000001
664,0.78464
665,0.8654799999999999
666,0.9367700000000001
667,1.0056
668,1.0663
669,1.1219
670,1.1741
671,1.2169
672,1.2636
673,1.3162
674,1.3733
675,1.4303
676,1.4874
677,1.5491
678,1.6159999999999999
679,1.6841
680,1.7226
681,1.7414
682,1.7312
683,1.693
684,1.636
685,1.5889
686,1.5448
687,1.5064
688,1.4755
689,1.4469
690,1.449
691,1.4609999999999999
692,1.4752
693,1.4895
694,1.5025
695,1.4976
696,1.482
697,1.4621
698,1.4193
699,1.3742
700,1.3228
701,1.2639
702,1.1988
703,1.1146
704,1.0291
705,0.9435100000000001
706,0.85749
707,0.76566
708,0.66755
709,0.57515
710,0.49308
711,0.42178000000000004
712,0.34259
713,0.2591
714,0.17695
715,0.10136
716,0.15947999999999998
717,-0.15502
718,-0.44903000000000004
719,-0.14867
720,-0.2057
721,-0.26273
722,-0.31155
723,-0.35513
724,-0.3971
725,-0.42573
726,-0.45505
727,-0.49098
728,-0.5333399999999999
729,-0.57398
730,-0.60359
731,-0.6341399999999999
732,-0.66961
733,-0.71195
734,-0.74597
735,-0.7649199999999999
736,-0.77918
737,-0.7934399999999999
738,-0.8077
739,-0.81001
740,-0.8016399999999999
741,-0.78992
742,-0.78367
743,-0.78367
744,-0.77698
745,-0.7656
746,-0.7549399999999999
747,-0.76067
748,-0.7740199999999999
749,-0.78828
750,-0.80253
751,-0.81679
752,-0.83105
753,-0.84531
754,-0.8657
755,-0.8934799999999999
756,-0.92199
757,-0.9505100000000001
758,-0.97983
759,-1.0137
760,-1.0564
761,-1.0942
762,-1.1146
763,-1.1273
764,-1.1362
765,-1.1362
766,-1.1362
767,-1.1362
768,-1.138
769,-1.1440000000000001
770,-1.1582
771,-1.1725
772,-1.1867
773,-1.2022
774,-1.2246
775,-1.2523
776,-1.2755
777,-1.2933
778,-1.3074
779,-1.3114
780,-1.3125
781,-1.3125
782,-1.3125
783,-1.3125
784,-1.3233
785,-1.3368
786,-1.3472
787,-1.3477
788,-1.3483
789,-1.3586
790,-1.3729
791,-1.3871
792,-1.4014
793,-1.4156
794,-1.4299
795,-1.4442
796,-1.4584
797,-1.4727
798,-1.4905
799,-1.5137
800,-1.5414
801,-1.5637
802,-1.5792
803,-1.5854
804,-1.5812
805,-1.567
806,-1.561
807,-1.5592
808,-1.5553
809,-1.5452
810,-1.531
811,-1.5256
812,-1.524
813,-1.5209
814,-1.5091
815,-1.4949
816,-1.4807
817,-1.4664
818,-1.4505
819,-1.4222
820,-1.3945
821,-1.3741
822,-1.3598
823,-1.3456
824,-1.3313
825,-1.3128
826,-1.2835
827,-1.2412
828,-1.2027
829,-1.1724
830,-1.1438
831,-1.1153
832,-1.0868
833,-1.0708
834,-1.0657
835,-1.0598
836,-1.0432
837,-1.0147
838,-0.9791
839,-0.93894
840,-0.8938200000000001
841,-0.8411700000000001
842,-0.78435
843,-0.72001
844,-0.65074
845,-0.57945
846,-0.5081600000000001
847,-0.43687
848,-0.36558
849,-0.29431
850,-0.22313000000000002
851,-0.16527999999999998
852,-0.10987000000000001
853,-0.31543000000000004
854,-0.17188
855,-0.10377
856,0.18417999999999998
857,0.39805
858,0.12055999999999999
859,0.16334
860,0.21040999999999999
861,0.26404
862,0.32108000000000003
863,0.37811
864,0.43513999999999997
865,0.48678999999999994
866,0.53327
867,0.57604
868,0.61882
869,0.6616
870,0.6927399999999999
871,0.7136899999999999
872,0.7286199999999999
873,0.7530899999999999
874,0.78072
875,0.81481
876,0.85526
877,0.89804
878,0.92937
879,0.95855
880,0.97772
881,0.97896
882,0.97851
883,0.9674200000000001
884,0.9524
885,0.9340799999999999
886,0.90556
887,0.8721399999999999
888,0.82383
889,0.77193
890,0.73221
891,0.73221
892,0.74728
893,0.78476
894,0.84065
895,0.8916200000000001
896,0.9352
897,0.97798
898,1.0208
899,1.0628
900,1.089
901,1.1062
902,1.1116
903,1.1053
904,1.091
905,1.0862
906,1.0847
907,1.0847
908,1.0847
909,1.0847
910,1.0847
911,1.0847
912,1.0871
913,1.1011
914,1.1146
915,1.12
916,1.1182
917,1.1116
918,1.0688
919,1.0238
920,0.9729200000000001
921,0.9165700000000001
922,0.86369
923,0.8196700000000001
924,0.7769
925,0.73412
926,0.69145
927,0.65508
928,0.62443
929,0.58926
930,0.5436
931,0.48657
932,0.42202
933,0.35307
934,0.28178000000000003
935,0.21049
936,0.1392
937,0.42721000000000003
938,0.19428
939,-0.058615
940,-0.16454000000000002
941,-0.30869
942,-0.37590999999999997
943,-0.38392
944,-0.38392
