time,value
0,-0.22709000000000001
1,-0.06386
2,0.06861
3,0.15846
4,0.21264
5,0.2321
6,0.21929
7,0.19279000000000002
8,0.14147
9,0.069553
10,-0.0061222
11,-0.08845499999999999
12,-0.1663
13,-0.21971
14,-0.22739
15,-0.18200999999999998
16,-0.053903999999999994
17,0.16154000000000002
18,0.43998000000000004
19,0.72435
20,0.9585899999999999
21,1.0828
22,1.0398
23,0.84046
24,0.48578000000000005
25,0.062699
26,-0.33564
27,-0.63502
28,-0.77408
29,-0.75721
30,-0.6208600000000001
31,-0.4206
32,-0.25277
33,-0.16303
34,-0.17102
35,-0.26366999999999996
36,-0.40051
37,-0.50283
38,-0.50756
39,-0.40931
40,-0.21398000000000003
41,0.041323
42,0.29485
43,0.46405
44,0.5381199999999999
45,0.47798999999999997
46,0.30078
47,0.047365
48,-0.22459
49,-0.44251
50,-0.56648
51,-0.54177
52,-0.35557
53,-0.040293
54,0.34379
55,0.72943
56,1.0373
57,1.2153
58,1.2497
59,1.1471
60,0.9517700000000001
61,0.70604
62,0.46308
63,0.22771999999999998
64,-0.013397999999999998
65,-0.30029
66,-0.63344
67,-1.0277
68,-1.4356
69,-1.7844
70,-2.01
71,-2.0323
72,-1.8343
73,-1.4373
74,-0.9056700000000001
75,-0.35454
76,0.1295
77,0.4847
78,0.7048399999999999
79,0.84646
80,0.94625
81,1.0601
82,1.2112
83,1.3936
84,1.5629
85,1.6347
86,1.5692
87,1.3581
88,0.9918100000000001
89,0.52369
90,0.024791
91,-0.45008000000000004
92,-0.8398200000000001
93,-1.1347
94,-1.3236
95,-1.442
96,-1.5013
97,-1.5105
98,-1.4497
99,-1.3055
100,-1.0497
101,-0.67905
102,-0.24564
103,0.19754000000000002
104,0.59117
105,0.8769100000000001
106,1.0052
107,0.99269
108,0.8387899999999999
109,0.63351
110,0.43513
111,0.29175
112,0.24528000000000003
113,0.26646
114,0.3101
115,0.32143
116,0.27115
117,0.14257999999999998
118,-0.060349
119,-0.30387
120,-0.52125
121,-0.66268
122,-0.7047
123,-0.62336
124,-0.44698000000000004
125,-0.20095
126,0.071088
127,0.33071999999999996
128,0.53135
129,0.65755
130,0.67765
131,0.60748
132,0.4576
133,0.2619
134,0.028422000000000003
135,-0.20636
136,-0.41623999999999994
137,-0.5975
138,-0.71807
139,-0.7923600000000001
140,-0.8094899999999999
141,-0.7484
142,-0.60333
143,-0.38996
144,-0.11972000000000001
145,0.14987999999999999
146,0.39085
147,0.5616899999999999
148,0.6581899999999999
149,0.6890000000000001
150,0.65967
151,0.63748
152,0.64869
153,0.6890000000000001
154,0.73198
155,0.7298600000000001
156,0.63045
157,0.43201999999999996
158,0.13488
159,-0.2238
160,-0.58926
161,-0.86767
162,-1.0102
163,-1.003
164,-0.86965
165,-0.65341
166,-0.42046999999999995
167,-0.22036
168,-0.061922000000000005
169,0.082978
170,0.20237
171,0.30968
172,0.40695
173,0.43651999999999996
174,0.38575
175,0.209
176,-0.062539
177,-0.4033
178,-0.74095
179,-0.9865
180,-1.1069
181,-1.0611
182,-0.84735
183,-0.50736
184,-0.099583
185,0.34852
186,0.79805
187,1.2195
188,1.5647
189,1.8132
190,1.9335
191,1.9041
192,1.714
193,1.3703
194,0.9051299999999999
195,0.34708
196,-0.22919
197,-0.7892399999999999
198,-1.2924
199,-1.6959
200,-2.0026
201,-2.1937
202,-2.2286
203,-2.1231
204,-1.8698
205,-1.4469
206,-0.9158700000000001
207,-0.34081
208,0.21416
209,0.7186600000000001
210,1.1320000000000001
211,1.4643
212,1.7273
213,1.9206
214,2.0434
215,2.0657
216,1.9327
217,1.6035
218,1.0563
219,0.34404
220,-0.41825
221,-1.1112
222,-1.6263
223,-1.8829
224,-1.8698
225,-1.6546
226,-1.3244
227,-0.9647100000000001
228,-0.62549
229,-0.33116999999999996
230,-0.06753200000000001
231,0.20479
232,0.5018600000000001
233,0.79778
234,1.0674
235,1.2843
236,1.3853
237,1.3609
238,1.2283
239,1.0097
240,0.7356
241,0.44991000000000003
242,0.13285999999999998
243,-0.23543000000000003
244,-0.64445
245,-1.0953
246,-1.5255
247,-1.8587
248,-2.022
249,-1.9777
250,-1.6887
251,-1.1684
252,-0.49831000000000003
253,0.23811999999999997
254,0.94173
255,1.5417
256,2.0099
257,2.3155
258,2.4369
259,2.3297
260,1.9902
261,1.4526
262,0.74897
263,-0.019500999999999998
264,-0.76348
265,-1.3646
266,-1.755
267,-1.9013
268,-1.837
269,-1.6585
270,-1.4621
271,-1.2737
272,-1.1131
273,-0.95119
274,-0.66985
275,-0.25484
276,0.31492
277,0.98782
278,1.6276
279,2.1098
280,2.3249
281,2.2218
282,1.8302
283,1.2344
284,0.5656800000000001
285,-0.057934000000000006
286,-0.58023
287,-0.96619
288,-1.2529
289,-1.4425
290,-1.5607
291,-1.5787
292,-1.48
293,-1.2209999999999999
294,-0.79833
295,-0.22589
296,0.43145
297,1.0639
298,1.5809
299,1.9231
300,2.0449
301,1.9569
302,1.6828
303,1.2634
304,0.78618
305,0.27939
306,-0.26753000000000005
307,-0.8163199999999999
308,-1.3323
309,-1.7989
310,-2.1451
311,-2.3315
312,-2.3226
313,-2.0889
314,-1.6485
315,-1.0598
316,-0.40521
317,0.26266
318,0.86687
319,1.3601
320,1.7145
321,1.9140000000000001
322,1.9711
323,1.9082
324,1.7409999999999999
325,1.4794
326,1.1391
327,0.74574
328,0.32513000000000003
329,-0.12215999999999999
330,-0.5372399999999999
331,-0.87485
332,-1.0883
333,-1.1399
334,-1.016
335,-0.75258
336,-0.40605
337,-0.044719
338,0.25447
339,0.44637
340,0.51746
341,0.48373999999999995
342,0.361
343,0.19702999999999998
344,0.039912
345,-0.11632
346,-0.23364000000000001
347,-0.33709
348,-0.43821000000000004
349,-0.53232
350,-0.61583
351,-0.68299
352,-0.73031
353,-0.7539399999999999
354,-0.755
355,-0.7359
356,-0.6843899999999999
357,-0.5998600000000001
358,-0.44855
359,-0.23039
360,0.085438
361,0.49906999999999996
362,0.9753299999999999
363,1.4555
364,1.8436
365,2.0669
366,2.0946
367,1.9183
368,1.5721
369,1.1124
370,0.6258
371,0.14193
372,-0.31443000000000004
373,-0.71213
374,-1.0716
375,-1.3998
376,-1.6621
377,-1.8243
378,-1.8746
379,-1.7646
380,-1.4942
381,-1.112
382,-0.6524
383,-0.15516
384,0.31156
385,0.69726
386,0.9889399999999999
387,1.1708
388,1.2427
389,1.2154
390,1.0858
391,0.88079
392,0.6027100000000001
393,0.30426
394,0.016284
395,-0.23535999999999999
396,-0.42717
397,-0.56071
398,-0.64751
399,-0.72423
400,-0.7875
401,-0.84188
402,-0.8386
403,-0.72292
404,-0.46503999999999995
405,-0.07810299999999999
406,0.40081999999999995
407,0.8825200000000001
408,1.249
409,1.4008
410,1.3231
411,1.0059
412,0.52852
413,0.028961
414,-0.39237
415,-0.626
416,-0.63685
417,-0.46102
418,-0.18542
419,0.072696
420,0.24025
421,0.26819
422,0.16742
423,-0.014911
424,-0.21045
425,-0.3337
426,-0.35574
427,-0.26934
428,-0.10732
429,0.056176
430,0.20189000000000001
431,0.28761
432,0.30533000000000005
433,0.26259
434,0.17869000000000002
435,0.092022
436,0.009726700000000001
437,-0.071269
438,-0.15750999999999998
439,-0.26009
440,-0.35619
441,-0.44586000000000003
442,-0.50788
443,-0.51212
444,-0.44815
445,-0.30664
446,-0.07499700000000001
447,0.21031999999999998
448,0.51547
449,0.80991
450,1.0329
451,1.1662
452,1.16
453,0.9864299999999999
454,0.66852
455,0.23056999999999997
456,-0.24573000000000003
457,-0.69235
458,-1.0357
459,-1.2408
460,-1.2646
461,-1.1182
462,-0.8592700000000001
463,-0.56866
464,-0.29943000000000003
465,-0.10436
466,0.010274
467,0.059689
468,0.079664
469,0.10195
470,0.15703
471,0.26438
472,0.4284
473,0.61393
474,0.7843100000000001
475,0.92375
476,0.99434
477,1.0036
478,0.95045
479,0.8454299999999999
480,0.70034
481,0.52823
482,0.31451999999999997
483,0.058745000000000006
484,-0.24203000000000002
485,-0.56691
486,-0.8689
487,-1.123
488,-1.2747
489,-1.3167
490,-1.2431
491,-1.0809
492,-0.88236
493,-0.68843
494,-0.5263399999999999
495,-0.39999
496,-0.29785
497,-0.18792
498,-0.041998
499,0.14653
