time,value
0,0.89791
1,2.1667
2,3.2136
3,3.5703
4,3.0557
5,1.905
6,0.6474300000000001
7,-0.19572
8,-0.39519
9,-0.098707
10,0.32133
11,0.53473
12,0.4465
13,0.19821
14,0.010148
15,0.0028371
16,0.1287
17,0.24581999999999998
18,0.25632
19,0.19407
20,0.19838
21,0.40325
22,0.8298200000000001
23,1.3577
24,1.7919999999999998
25,1.9785
26,1.8924
27,1.6483
28,1.43
29,1.3809
30,1.5165
31,1.7115
32,1.7695
33,1.5381
34,1.0028
35,0.30864
36,-0.32161
37,-0.70745
38,-0.79432
39,-0.67624
40,-0.5182399999999999
41,-0.44676000000000005
42,-0.48655
43,-0.57575
44,-0.63242
45,-0.61717
46,-0.5552699999999999
47,-0.50322
48,-0.49801000000000006
49,-0.53557
50,-0.58282
51,-0.60759
52,-0.60306
53,-0.58673
54,-0.5787899999999999
55,-0.5834699999999999
56,-0.59067
57,-0.5886
58,-0.57139
59,-0.54988
60,-0.53986
61,-0.54501
62,-0.55999
63,-0.57693
64,-0.58909
65,-0.59509
66,-0.6007899999999999
67,-0.6115
68,-0.62138
69,-0.62539
70,-0.61946
71,-0.60302
72,-0.5809300000000001
73,-0.56137
74,-0.55138
75,-0.55324
76,-0.56411
77,-0.57787
78,-0.58814
79,-0.5918399999999999
80,-0.5901
81,-0.5867600000000001
82,-0.58695
83,-0.5946100000000001
84,-0.6102
85,-0.6304
86,-0.64957
87,-0.6622100000000001
88,-0.66603
89,-0.6642600000000001
90,-0.6644
91,-0.6734100000000001
92,-0.69335
93,-0.71865
94,-0.73745
95,-0.73801
96,-0.71591
97,-0.6772699999999999
98,-0.63627
