time,value
0,2.1007
1,1.4951
2,1.7979
3,-0.39755999999999997
4,-0.62467
5,-0.62467
6,-0.62467
7,-0.62467
8,-0.62467
9,-0.62467
10,-0.62467
11,-0.62467
12,-0.62467
13,-0.62467
14,2.1007
15,1.7979
16,1.7979
17,0.73802
18,-0.54897
19,-0.62467
20,-0.62467
21,-0.62467
22,-0.62467
23,-0.62467
24,-0.62467
25,-0.62467
26,-0.62467
27,-0.62467
28,0.96514
29,1.7979
30,1.7979
31,1.7979
32,-0.17044
33,-0.62467
34,-0.62467
35,-0.62467
36,-0.62467
37,-0.62467
38,-0.62467
39,-0.62467
40,-0.62467
41,-0.62467
42,-0.62467
43,1.1923
44,1.7979
45,1.7979
46,1.4951
47,-0.54897
48,-0.62467
49,-0.62467
50,-0.62467
51,-0.62467
52,-0.62467
53,-0.62467
54,-0.62467
55,-0.62467
56,-0.62467
57,-0.62467
58,1.4951
59,2.1007
60,1.7979
61,1.1923
62,-0.47326
63,-0.62467
64,-0.62467
65,-0.62467
66,-0.62467
67,-0.62467
68,-0.62467
69,-0.62467
70,-0.62467
71,-0.62467
72,-0.62467
73,0.96514
74,1.7979
75,1.7979
76,1.7979
77,-0.32185
78,-0.54897
79,-0.62467
80,-0.62467
81,-0.62467
82,-0.62467
83,-0.62467
84,-0.62467
85,-0.62467
86,-0.62467
87,-0.62467
88,0.13238
89,1.7979
90,1.7979
91,1.7979
92,0.13238
93,-0.54897
94,-0.62467
95,-0.62467
96,-0.62467
97,-0.62467
98,-0.62467
99,-0.62467
100,-0.62467
101,-0.62467
102,-0.62467
103,0.13238
104,1.7979
105,2.1007
106,1.4951
107,0.28379
108,-0.47326
109,-0.62467
110,-0.62467
111,-0.62467
112,-0.62467
113,-0.62467
114,-0.62467
115,-0.62467
116,-0.62467
117,-0.62467
118,0.73802
119,2.1007
120,1.7979
121,1.4951
122,-0.17044
123,-0.62467
124,-0.62467
125,-0.62467
126,-0.62467
127,-0.62467
128,-0.62467
129,-0.62467
130,-0.62467
131,-0.62467
132,-0.62467
133,0.5109100000000001
134,1.7979
135,1.7979
136,1.7979
137,-0.019031
138,-0.54897
139,-0.62467
140,-0.62467
141,-0.62467
142,-0.62467
143,-0.62467
144,-0.62467
145,-0.62467
146,-0.62467
147,-0.62467
148,0.13238
149,1.7979
150,2.1007
151,1.7979
152,0.28379
153,-0.47326
154,-0.62467
155,-0.62467
156,-0.62467
157,-0.62467
158,-0.62467
159,-0.62467
160,-0.62467
161,-0.62467
162,-0.62467
163,-0.019031
164,2.1007
165,1.7979
166,1.7979
167,0.13238
168,-0.62467
169,-0.62467
170,-0.62467
171,-0.62467
172,-0.62467
173,-0.62467
174,-0.62467
175,-0.62467
176,-0.62467
177,-0.62467
178,-0.32185
179,2.1007
180,1.7979
181,1.7979
182,0.5109100000000001
183,-0.54897
184,-0.62467
185,-0.62467
186,-0.62467
187,-0.62467
188,-0.62467
189,-0.62467
190,-0.62467
191,-0.62467
192,-0.62467
193,-0.62467
194,1.4951
195,1.7979
196,1.7979
197,1.4951
198,-0.62467
199,-0.62467
200,-0.62467
201,-0.62467
202,-0.62467
203,-0.62467
204,-0.62467
205,-0.62467
206,-0.62467
207,-0.62467
208,-0.62467
209,1.1923
210,1.7979
211,1.7979
212,1.1923
213,-0.54897
214,-0.62467
215,-0.62467
216,-0.62467
217,-0.62467
218,-0.62467
219,-0.62467
220,-0.62467
221,-0.62467
222,-0.62467
223,-0.62467
224,1.4951
225,1.7979
226,1.7979
227,1.1923
228,-0.47326
229,-0.62467
230,-0.62467
231,-0.62467
232,-0.62467
233,-0.62467
234,-0.62467
235,-0.62467
236,-0.62467
237,-0.62467
238,-0.62467
239,0.96514
240,1.7979
241,1.7979
242,1.4951
243,-0.62467
244,-0.62467
245,-0.62467
246,-0.62467
247,-0.62467
248,-0.62467
249,-0.62467
250,-0.62467
251,-0.62467
252,-0.62467
253,-0.62467
254,1.1923
255,1.7979
256,1.7979
257,1.4951
258,-0.54897
259,-0.62467
260,-0.62467
261,-0.62467
262,-0.62467
263,-0.62467
264,-0.62467
265,-0.62467
266,-0.62467
267,-0.62467
268,-0.62467
269,1.7979
270,1.7979
271,1.7979
272,0.73802
273,-0.62467
274,-0.62467
275,-0.62467
276,-0.62467
277,-0.62467
278,-0.62467
279,-0.62467
280,-0.62467
281,-0.62467
282,-0.62467
283,-0.62467
284,1.4951
285,1.7979
286,1.7979
287,1.4951
288,-0.62467
289,-0.62467
290,-0.62467
291,-0.62467
292,-0.62467
293,-0.62467
294,-0.62467
295,-0.62467
296,-0.62467
297,-0.62467
298,-0.62467
299,1.1923
300,1.7979
301,1.4951
302,1.7979
303,-0.62467
304,-0.62467
305,-0.62467
306,-0.62467
307,-0.62467
308,-0.62467
309,-0.62467
310,-0.62467
311,-0.62467
312,-0.62467
313,-0.62467
314,1.7979
315,2.1007
316,1.4951
317,0.96514
318,-0.54897
319,-0.62467
320,-0.62467
321,-0.62467
322,-0.62467
323,-0.62467
324,-0.62467
325,-0.62467
326,-0.62467
327,-0.62467
328,-0.39755999999999997
329,2.1007
330,1.7979
331,1.4951
332,0.96514
333,-0.62467
334,-0.62467
335,-0.62467
336,-0.62467
337,-0.62467
338,-0.62467
339,-0.62467
340,-0.62467
341,-0.62467
342,-0.62467
343,-0.019031
344,1.7979
345,1.7979
346,1.7979
347,0.5109100000000001
348,-0.54897
349,-0.62467
350,-0.62467
351,-0.62467
352,-0.62467
353,-0.62467
354,-0.62467
355,-0.62467
356,-0.62467
357,-0.62467
358,1.1923
359,2.1007
360,1.7979
361,1.4951
362,-0.39755999999999997
363,-0.62467
364,-0.62467
365,-0.62467
366,-0.62467
367,-0.62467
368,-0.62467
369,-0.62467
370,-0.62467
371,-0.62467
372,-0.62467
373,2.1007
374,1.7979
375,1.7979
376,0.96514
377,-0.47326
378,-0.62467
379,-0.62467
380,-0.62467
381,-0.62467
382,-0.62467
383,-0.62467
384,-0.62467
385,-0.62467
386,-0.62467
387,-0.17044
388,1.7979
389,2.1007
390,1.4951
391,0.96514
392,-0.54897
393,-0.62467
394,-0.62467
395,-0.62467
396,-0.62467
397,-0.62467
398,-0.62467
399,-0.62467
400,-0.62467
401,-0.62467
402,-0.17044
403,1.7979
404,1.7979
405,1.7979
406,0.73802
407,-0.54897
408,-0.62467
409,-0.62467
410,-0.62467
411,-0.62467
412,-0.62467
413,-0.62467
414,-0.62467
415,-0.62467
416,-0.62467
417,0.28379
418,1.7979
419,1.7979
420,1.4951
421,0.28379
422,-0.62467
423,-0.62467
424,-0.62467
425,-0.62467
426,-0.62467
427,-0.62467
428,-0.62467
429,-0.62467
430,-0.62467
431,-0.62467
432,0.28379
433,2.1007
434,1.7979
435,1.4951
436,0.28379
437,-0.47326
438,-0.62467
439,-0.62467
440,-0.62467
441,-0.62467
442,-0.62467
443,-0.62467
444,-0.62467
445,-0.62467
446,-0.62467
447,0.96514
448,2.1007
449,1.7979
450,1.7979
451,-0.17044
452,-0.62467
453,-0.62467
454,-0.62467
455,-0.62467
456,-0.62467
457,-0.62467
458,-0.62467
459,-0.62467
460,-0.62467
461,-0.47326
462,2.1007
463,1.7979
464,1.7979
465,0.96514
466,-0.54897
467,-0.62467
468,-0.62467
469,-0.62467
470,-0.62467
471,-0.62467
472,-0.62467
473,-0.62467
474,-0.62467
475,-0.62467
476,1.4951
477,1.7979
478,1.7979
479,1.7979
480,-0.32185
481,-0.54897
482,-0.62467
483,-0.62467
484,-0.62467
485,-0.62467
486,-0.62467
487,-0.62467
488,-0.62467
489,-0.62467
490,0.5109100000000001
491,1.7979
492,1.7979
493,1.7979
494,0.28379
495,-0.54897
496,-0.62467
497,-0.62467
498,-0.62467
499,-0.62467
500,-0.62467
501,-0.62467
502,-0.62467
503,-0.62467
504,-0.62467
505,1.4951
506,2.1007
507,1.4951
508,1.7979
509,-0.39755999999999997
510,-0.62467
511,-0.62467
512,-0.62467
513,-0.62467
514,-0.62467
515,-0.62467
516,-0.62467
517,-0.62467
518,-0.62467
519,0.28379
520,2.1007
521,1.7979
522,1.4951
523,0.73802
524,-0.54897
525,-0.62467
526,-0.62467
527,-0.62467
528,-0.62467
529,-0.62467
530,-0.62467
531,-0.62467
532,-0.62467
533,-0.17044
534,1.7979
535,2.1007
536,1.4951
537,1.1923
538,-0.47326
539,-0.62467
540,-0.62467
541,-0.62467
542,-0.62467
543,-0.62467
544,-0.62467
545,-0.62467
546,-0.62467
547,-0.17044
548,1.7979
549,2.1007
550,1.4951
551,1.1923
552,-0.62467
553,-0.62467
554,-0.62467
555,-0.62467
556,-0.62467
557,-0.62467
558,-0.62467
559,-0.62467
560,-0.62467
561,-0.62467
562,0.96514
563,1.7979
564,1.7979
565,1.7979
566,0.28379
567,-0.47326
568,-0.62467
569,-0.62467
570,-0.62467
571,-0.62467
572,-0.62467
573,-0.62467
574,-0.62467
575,-0.62467
576,0.13238
577,2.1007
578,1.7979
579,1.7979
580,0.96514
581,-0.47326
582,-0.62467
583,-0.62467
584,-0.62467
585,-0.62467
586,-0.62467
587,-0.62467
588,-0.62467
589,-0.62467
590,-0.62467
591,1.7979
592,1.7979
593,1.7979
594,1.7979
595,-0.54897
596,-0.62467
597,-0.62467
598,-0.62467
599,-0.62467
600,-0.62467
601,-0.62467
602,-0.62467
603,-0.62467
604,-0.62467
605,0.28379
606,1.7979
607,1.7979
608,1.7979
609,0.73802
610,-0.62467
611,-0.62467
612,-0.62467
613,-0.62467
614,-0.62467
615,-0.62467
616,-0.62467
617,-0.62467
618,-0.62467
619,-0.62467
620,1.4951
621,1.7979
622,1.7979
623,1.7979
624,-0.54897
625,-0.62467
626,-0.62467
627,-0.62467
628,-0.62467
629,-0.62467
630,-0.62467
631,-0.62467
632,-0.62467
633,-0.62467
634,0.5109100000000001
635,1.7979
636,1.7979
637,1.7979
638,0.13238
639,-0.54897
640,-0.62467
641,-0.62467
642,-0.62467
643,-0.62467
644,-0.62467
645,-0.62467
646,-0.62467
647,-0.62467
648,-0.62467
649,1.7979
650,1.7979
651,1.7979
652,1.1923
653,-0.62467
654,-0.62467
655,-0.62467
656,-0.62467
657,-0.62467
658,-0.62467
659,-0.62467
660,-0.62467
661,-0.62467
662,-0.62467
663,0.73802
664,1.7979
665,1.7979
666,1.7979
667,-0.39755999999999997
668,-0.62467
669,-0.62467
670,-0.62467
671,-0.62467
672,-0.62467
673,-0.62467
674,-0.62467
675,-0.62467
676,-0.62467
677,-0.62467
678,1.1923
679,2.1007
680,1.4951
681,1.7979
682,-0.62467
683,-0.62467
684,-0.62467
685,-0.62467
686,-0.62467
687,-0.62467
688,-0.62467
689,-0.62467
690,-0.62467
691,-0.62467
692,-0.62467
693,1.4951
694,2.1007
695,1.7979
696,1.4951
697,-0.54897
698,-0.62467
699,-0.62467
700,-0.62467
701,-0.62467
702,-0.62467
703,-0.62467
704,-0.62467
705,-0.62467
706,-0.62467
707,-0.62467
708,1.1923
709,2.1007
710,1.7979
711,1.4951
712,-0.47326
713,-0.62467
714,-0.62467
715,-0.62467
716,-0.62467
717,-0.62467
718,-0.62467
719,-0.62467
