time,value
0,1.8551
1,1.6896
2,1.3371
3,0.89155
4,0.41108
5,-0.022461000000000002
6,-0.34633
7,-0.54197
8,-0.63699
9,-0.67143
10,-0.65689
11,-0.6201300000000001
12,-0.5905199999999999
13,-0.57475
14,-0.5976899999999999
15,-0.61229
16,-0.61632
17,-0.55125
18,-0.43111000000000005
19,-0.25823
20,-0.024034
21,0.2633
22,0.56438
23,0.8488399999999999
24,1.0878
25,1.2526
26,1.3081
27,1.2439
28,1.0109
29,0.616
30,0.09362100000000001
31,-0.52555
32,-1.1665
33,-1.725
34,-2.1365
35,-2.3381
36,-2.2611
37,-1.9188
38,-1.3528
39,-0.6211899999999999
40,0.18335
41,0.9666399999999999
42,1.6102
43,2.0606
44,2.2509
45,2.1915
46,1.9071
47,1.5057
48,1.0301
49,0.5339
50,0.099062
51,-0.24218
52,-0.49531000000000003
53,-0.67024
54,-0.7961600000000001
55,-0.9163899999999999
56,-1.0423
57,-1.1644
58,-1.2705
59,-1.3237
60,-1.2649
61,-1.0849
62,-0.7789
63,-0.33146
64,0.18037
65,0.68462
66,1.08
67,1.2764
68,1.2787
69,1.1134
70,0.80176
71,0.45782
72,0.13505
73,-0.15317
74,-0.37568
75,-0.5102399999999999
76,-0.5995699999999999
77,-0.68057
78,-0.76774
79,-0.7960699999999999
80,-0.73348
81,-0.5249
82,-0.099459
83,0.51008
84,1.2055
85,1.8776
86,2.3754
87,2.5526
88,2.3365
89,1.7406
90,0.8664
91,-0.1485
92,-1.1254
93,-1.9065
94,-2.4077
95,-2.6215
96,-2.5808
97,-2.4018
98,-2.1633
99,-1.9236
100,-1.6819
101,-1.4091
102,-1.0526
103,-0.55308
104,0.09710099999999999
105,0.8787200000000001
106,1.6857
107,2.4003
108,2.9195
109,3.1798
110,3.1589
111,2.8988
112,2.481
113,1.9473
114,1.406
115,0.9158
116,0.44806999999999997
117,-0.015045
118,-0.5087
119,-1.0474
120,-1.5869
121,-2.0817
122,-2.4846
123,-2.715
124,-2.7243
125,-2.5083
126,-2.0972
127,-1.5509
128,-0.9556899999999999
129,-0.35608
130,0.21741999999999997
131,0.71332
132,1.1451
133,1.4962
134,1.7391
135,1.8506
136,1.8215
137,1.6134
138,1.2379
139,0.74522
140,0.18556
141,-0.35223000000000004
142,-0.80802
143,-1.1289
144,-1.3156
145,-1.3629
146,-1.3036
147,-1.13
148,-0.88341
149,-0.52585
150,-0.056587
151,0.51531
152,1.1319
153,1.7074
154,2.1564
155,2.3480000000000003
156,2.2298
157,1.7890000000000001
158,1.0778
159,0.2075
160,-0.6711600000000001
161,-1.4282
162,-1.9451
163,-2.1693
164,-2.1374
165,-1.8769
166,-1.4946
167,-1.0884
168,-0.69858
169,-0.3882
170,-0.14648
171,0.061706
172,0.23425
173,0.43018999999999996
174,0.65064
175,0.88594
176,1.0866
177,1.1984
178,1.2069
179,1.1359
180,1.005
181,0.83857
182,0.66071
183,0.4653
184,0.27574
185,0.07345399999999999
186,-0.14115999999999998
187,-0.3704
188,-0.6025
189,-0.81666
190,-0.95929
191,-1.0299
192,-1.018
193,-0.90671
194,-0.71436
195,-0.49418999999999996
196,-0.25583
197,-0.041518
198,0.13504000000000002
199,0.26592
200,0.34085
201,0.37864000000000003
202,0.38169000000000003
203,0.38900999999999997
204,0.3832
205,0.35731
206,0.28888
207,0.22578
208,0.15100999999999998
209,0.063329
210,-0.007282899999999999
211,-0.047008999999999995
212,-0.071529
213,-0.073267
214,0.016918
215,0.14151
216,0.29155
217,0.45066999999999996
218,0.59082
219,0.6591
220,0.61573
221,0.43609
222,0.14355
223,-0.20203
224,-0.54381
225,-0.77035
226,-0.8421200000000001
227,-0.76653
228,-0.5886100000000001
229,-0.38504
230,-0.25673
231,-0.28959
232,-0.45118
233,-0.70036
234,-0.9464899999999999
235,-1.0684
236,-0.9653799999999999
237,-0.60549
238,-0.023134000000000002
239,0.69162
240,1.4062
241,1.9391
242,2.1828
243,2.0945
244,1.7157
245,1.1323
246,0.45435
247,-0.1499
248,-0.57552
249,-0.77409
250,-0.7439399999999999
251,-0.5524600000000001
252,-0.32865
253,-0.153
254,-0.13414
255,-0.29393
256,-0.5602199999999999
257,-0.85555
258,-1.0632
259,-1.087
260,-0.9033200000000001
261,-0.56666
262,-0.1617
263,0.19153
264,0.39025
265,0.43256999999999995
266,0.33526
267,0.19142
268,0.12425
269,0.18961
270,0.40421
271,0.69194
272,0.9518700000000001
273,1.0993
274,1.0217
275,0.7535
276,0.34657
277,-0.10257999999999999
278,-0.43873
279,-0.6146699999999999
280,-0.6049800000000001
281,-0.46743999999999997
282,-0.27244
283,-0.11044000000000001
284,-0.022499
285,-0.031271
286,-0.11642999999999999
287,-0.23114
288,-0.34762
289,-0.4109
290,-0.43964
291,-0.46928000000000003
292,-0.47545
293,-0.46021999999999996
294,-0.42502
295,-0.32766999999999996
296,-0.15579
297,0.094269
298,0.40003
299,0.70922
300,0.94115
301,1.0745
302,1.0809
303,0.9427
304,0.69058
305,0.38016
306,0.031569
307,-0.28648
308,-0.5715100000000001
309,-0.79268
310,-0.9342299999999999
311,-0.9708
312,-0.88705
313,-0.66896
314,-0.34057
315,0.011052
316,0.35645
317,0.6037399999999999
318,0.74133
319,0.72692
320,0.5561699999999999
321,0.29091
322,-0.037786
323,-0.4011
324,-0.75583
325,-1.0285
326,-1.2254
327,-1.3034
328,-1.193
329,-0.9045
330,-0.46787
331,0.063974
332,0.6071300000000001
333,1.0492
334,1.2934
335,1.3449
336,1.2063
337,0.9488200000000001
338,0.6849
339,0.49233000000000005
340,0.39971999999999996
341,0.38742
342,0.45457
343,0.50672
344,0.46483
345,0.30779
346,0.045906999999999996
347,-0.28314
348,-0.62175
349,-0.93009
350,-1.1375
351,-1.2455
352,-1.2309999999999999
353,-1.1014
354,-0.89392
355,-0.61053
356,-0.29932
357,-0.0081274
358,0.22851999999999997
359,0.37456999999999996
360,0.42191000000000006
361,0.38803000000000004
362,0.31213
363,0.2411
364,0.22061999999999998
365,0.28126999999999996
366,0.40506
367,0.5483399999999999
368,0.64859
369,0.66314
370,0.53545
371,0.31399
372,0.066634
373,-0.15686
374,-0.28184000000000003
375,-0.26434
376,-0.14640999999999998
377,0.0058091
378,0.11800999999999999
379,0.10547000000000001
380,-0.030317
381,-0.25482
382,-0.49537
383,-0.6642100000000001
384,-0.66484
385,-0.50944
386,-0.25281
387,0.036235
388,0.22565
389,0.24915
390,0.07412300000000001
391,-0.22607
392,-0.54972
393,-0.79979
394,-0.8536600000000001
395,-0.67565
396,-0.32239
397,0.14800000000000002
398,0.5906100000000001
399,0.91458
400,1.0643
401,1.0596
402,0.92476
403,0.70432
404,0.5039600000000001
405,0.33287
406,0.19501
407,0.11033
408,0.023302
409,-0.08845599999999999
410,-0.21688000000000002
411,-0.34157
412,-0.45292
413,-0.5283899999999999
414,-0.5657300000000001
415,-0.57065
416,-0.57109
417,-0.59817
418,-0.6514300000000001
419,-0.7522800000000001
420,-0.87375
421,-0.9528399999999999
422,-0.95591
423,-0.85693
424,-0.62063
425,-0.27907
426,0.11896
427,0.5593199999999999
428,0.98503
429,1.3287
430,1.5714
431,1.676
432,1.6089
433,1.3708
434,0.9506100000000001
435,0.42408999999999997
436,-0.13592
437,-0.64567
438,-1.0076
439,-1.1897
440,-1.1873
441,-1.0489
442,-0.8236899999999999
443,-0.57308
444,-0.36248
445,-0.18627
446,-0.059387
447,0.035791
448,0.15241
449,0.28375
450,0.41918
451,0.51357
452,0.55601
453,0.51991
454,0.45948999999999995
455,0.42468999999999996
456,0.44361000000000006
457,0.5083300000000001
458,0.56197
459,0.55387
460,0.4286
461,0.14279
462,-0.28101
463,-0.75868
464,-1.1862
465,-1.4209
466,-1.4044
467,-1.1696
468,-0.78542
469,-0.37366
470,-0.074382
471,0.078456
472,0.074275
473,-0.048872000000000006
474,-0.18172
475,-0.22973000000000002
476,-0.14612
477,0.055269000000000006
478,0.31490999999999997
479,0.5542100000000001
480,0.69897
481,0.73156
482,0.6803600000000001
483,0.59877
484,0.53588
485,0.49423999999999996
486,0.44916000000000006
487,0.3478
488,0.14055
489,-0.16364
490,-0.51607
491,-0.83339
492,-0.99449
493,-0.9196
494,-0.62325
495,-0.17171
496,0.35331999999999997
497,0.81033
498,1.084
499,1.1691
