time,value
0,-1.1501
1,-1.1501
2,-1.1501
3,-1.1501
4,-1.1501
5,-1.1501
6,-1.1501
7,-1.1501
8,-1.1501
9,-1.1501
10,-1.1501
11,-1.1501
12,-1.1501
13,-1.1501
14,-1.1501
15,-1.1501
16,-1.1501
17,-1.1501
18,-1.1501
19,-1.1501
20,-1.1501
21,-1.1501
22,-1.1501
23,-1.1501
24,-1.1501
25,-1.1501
26,-1.1501
27,-1.1501
28,-1.1501
29,-1.1501
30,-1.1501
31,-1.1501
32,-1.1501
33,-1.1501
34,-1.1501
35,-1.1501
36,-1.1501
37,-1.1501
38,-1.1501
39,-1.1501
40,-1.1501
41,-1.1501
42,-1.1501
43,-1.1501
44,-1.1501
45,-1.1501
46,-1.1501
47,-1.1501
48,-1.1501
49,-1.1501
50,-1.1501
51,-1.1501
52,-1.1501
53,-1.1501
54,-1.1501
55,-1.1501
56,-1.1501
57,-1.1501
58,-1.1501
59,-1.1501
60,-1.1501
61,-1.1501
62,-1.1501
63,-1.1501
64,-1.1501
65,-1.1501
66,-1.1501
67,-1.1501
68,-1.1501
69,-1.1501
70,-1.1501
71,-1.1501
72,-1.1501
73,-1.1501
74,-1.1501
75,-1.1501
76,-1.1501
77,-1.1501
78,-1.1501
79,-1.1501
80,-1.1501
81,-1.1501
82,-1.1501
83,-1.1501
84,-1.1501
85,-1.1501
86,-1.1501
87,-1.1501
88,-1.1501
89,-1.1501
90,-1.1501
91,-1.1501
92,-1.1501
93,-1.1501
94,-1.1501
95,-1.1501
96,-1.1501
97,-1.1501
98,-1.1501
99,-1.1501
100,-1.1501
101,-1.1501
102,-1.1501
103,-1.1501
104,-1.1501
105,-1.1501
106,-1.1501
107,-1.1501
108,-1.1495
109,-1.1486
110,-1.1333
111,-1.1118
112,-1.0904
113,-1.0689
114,-1.0474
115,-1.0259
116,-0.9948600000000001
117,-0.96031
118,-0.91948
119,-0.8765200000000001
120,-0.83357
121,-0.79061
122,-0.75343
123,-0.7179399999999999
124,-0.7103
125,-0.7103
126,-0.7103
127,-0.7103
128,-0.7103
129,-0.7103
130,-0.69724
131,-0.68137
132,-0.66081
133,-0.6393300000000001
134,-0.6178600000000001
135,-0.59638
136,-0.56365
137,-0.5291
138,-0.46845
139,-0.40401
140,-0.33958
141,-0.27515
142,-0.21070999999999998
143,-0.14628
144,-0.064824
145,0.018286
146,0.10397999999999999
147,0.1899
148,0.27581
149,0.36172
150,0.43876000000000004
151,0.5153399999999999
152,0.58023
153,0.64467
154,0.7091
155,0.77353
156,0.8379700000000001
157,0.9024
158,0.9024
159,0.9024
160,0.9024
161,0.9024
162,0.9024
163,0.90194
164,0.8898
165,0.8771899999999999
166,0.8557100000000001
167,0.8342299999999999
168,0.81275
169,0.79127
170,0.7698
171,0.74832
172,0.7268399999999999
173,0.70536
174,0.68389
175,0.66241
176,0.64093
177,0.62134
178,0.6148100000000001
179,0.60918
180,0.60918
181,0.60918
182,0.60918
183,0.60918
184,0.60918
185,0.60918
186,0.60918
187,0.60918
188,0.60918
189,0.60918
190,0.60918
191,0.613
192,0.63074
193,0.64933
194,0.67081
195,0.69229
196,0.71377
197,0.73525
198,0.75672
199,0.7782
200,0.7996800000000001
201,0.82116
202,0.8426299999999999
203,0.86411
204,0.88559
205,0.9133100000000001
206,0.9553299999999999
207,0.99765
208,1.0406
209,1.0836
210,1.1265
211,1.1656
212,1.1974
213,1.2255
214,1.247
215,1.2685
216,1.2899
217,1.3114
218,1.3329
219,1.3544
220,1.3758
221,1.3973
222,1.4188
223,1.4403
224,1.4618
225,1.4772
226,1.4847
227,1.4888
228,1.4888
229,1.4888
230,1.4888
231,1.4866
232,1.482
233,1.4692
234,1.4477
235,1.4263
236,1.4048
237,1.3833
238,1.3618
239,1.3404
240,1.3189
241,1.2974
242,1.2759
243,1.2544
244,1.2329999999999999
245,1.2032
246,1.1668
247,1.1144
248,1.0499
249,0.98551
250,0.9210799999999999
251,0.85664
252,0.7922100000000001
253,0.7516
254,0.72639
255,0.7035
256,0.68202
257,0.66054
258,0.6390600000000001
259,0.62422
260,0.61301
261,0.60918
262,0.60918
263,0.60918
264,0.60918
265,0.60982
266,0.61075
267,0.6259899999999999
268,0.64747
269,0.66894
270,0.69042
271,0.7119
272,0.73338
273,0.7548600000000001
274,0.77633
275,0.79781
276,0.81929
277,0.84077
278,0.86224
279,0.88084
280,0.8985799999999999
281,0.9024
282,0.9024
283,0.9024
284,0.9024
285,0.9024
286,0.9024
287,0.9024
288,0.9024
289,0.9024
290,0.9024
291,0.9024
292,0.9024
293,0.8967700000000001
294,0.8902399999999999
295,0.87065
296,0.8491700000000001
297,0.8276899999999999
298,0.8062199999999999
299,0.78474
300,0.76326
301,0.77583
302,0.7917
303,0.81275
304,0.8342299999999999
305,0.8557100000000001
306,0.8771899999999999
307,0.8898
308,0.90194
309,0.9024
310,0.9024
311,0.9024
312,0.9024
313,0.9024
314,0.9024
