time,value
0,-0.42753
1,-0.42753
2,-0.42753
3,-0.42753
4,-0.42753
5,-0.42753
6,-0.42753
7,-0.42753
8,0.56839
9,2.8922
10,2.5602
11,2.5602
12,0.07042999999999999
13,-0.34454
14,-0.42753
15,-0.42753
16,-0.42753
17,-0.42753
18,-0.42753
19,-0.42753
20,-0.42753
21,-0.42753
22,-0.42753
23,-0.42753
24,-0.42753
25,-0.42753
26,-0.42753
27,2.8922
28,2.5602
29,2.5602
30,2.5602
31,1.8963
32,-0.34454
33,-0.42753
34,-0.42753
35,-0.42753
36,-0.42753
37,-0.42753
38,-0.42753
39,-0.42753
40,-0.42753
41,-0.42753
42,-0.42753
43,-0.42753
44,-0.42753
45,-0.42753
46,-0.42753
47,-0.42753
48,-0.42753
49,-0.42753
50,-0.42753
51,-0.42753
52,-0.42753
53,-0.42753
54,-0.42753
55,-0.42753
56,-0.42753
57,-0.42753
58,-0.42753
59,-0.42753
60,-0.42753
61,2.2283
62,2.8922
63,2.5602
64,1.0664
65,-0.26155
66,-0.42753
67,-0.42753
68,-0.42753
69,-0.42753
70,-0.42753
71,-0.42753
72,-0.42753
73,-0.42753
74,-0.42753
75,-0.42753
76,-0.42753
77,-0.42753
78,-0.42753
79,-0.42753
80,-0.42753
81,-0.42753
82,-0.42753
83,-0.42753
84,-0.42753
85,-0.42753
86,-0.42753
87,-0.42753
88,-0.42753
89,-0.42753
90,-0.42753
91,-0.42753
92,-0.42753
93,-0.42753
94,-0.42753
95,-0.42753
96,2.5602
97,2.8922
98,2.5602
99,0.07042999999999999
100,-0.34454
101,-0.42753
102,-0.42753
103,-0.42753
104,-0.42753
105,-0.42753
106,-0.42753
107,-0.42753
108,-0.42753
109,-0.42753
110,-0.42753
111,-0.42753
112,-0.42753
113,-0.42753
114,-0.42753
115,-0.42753
116,-0.42753
117,-0.42753
118,-0.42753
119,-0.42753
120,-0.42753
121,-0.42753
122,-0.42753
123,-0.42753
124,-0.42753
125,-0.42753
126,-0.42753
127,-0.42753
128,-0.42753
129,-0.42753
130,-0.095558
131,2.8922
132,2.8922
133,2.2283
134,-0.42753
135,-0.42753
136,-0.42753
137,-0.42753
138,-0.42753
139,-0.42753
140,-0.42753
141,-0.42753
142,-0.42753
143,-0.42753
144,-0.42753
145,-0.42753
146,-0.42753
147,-0.42753
148,-0.42753
149,-0.42753
150,-0.42753
151,-0.42753
152,-0.42753
153,-0.42753
154,-0.42753
155,-0.42753
156,-0.42753
157,-0.42753
158,-0.42753
159,-0.42753
160,-0.42753
161,-0.42753
162,-0.42753
163,-0.42753
164,-0.42753
165,-0.42753
166,-0.42753
167,0.81738
168,2.8922
169,2.5602
170,1.3153
171,-0.26155
172,-0.42753
173,-0.42753
174,-0.42753
175,-0.42753
176,-0.42753
177,-0.42753
178,-0.42753
179,-0.42753
180,-0.42753
181,-0.42753
182,-0.42753
183,-0.42753
184,-0.42753
185,-0.42753
186,-0.42753
187,-0.42753
188,-0.42753
189,-0.42753
190,-0.42753
191,-0.42753
192,-0.42753
193,-0.42753
194,-0.42753
195,-0.42753
196,-0.42753
197,-0.42753
198,-0.42753
199,-0.42753
200,-0.42753
201,-0.42753
202,-0.42753
203,-0.42753
204,-0.42753
205,-0.42753
206,0.81738
207,2.8922
208,2.5602
209,1.3153
210,-0.34454
211,-0.42753
212,-0.42753
213,-0.42753
214,-0.42753
215,-0.42753
216,-0.42753
217,-0.42753
218,-0.42753
219,-0.42753
220,-0.42753
221,-0.42753
222,-0.42753
223,-0.42753
224,-0.42753
225,-0.42753
226,-0.42753
227,-0.42753
228,-0.42753
229,-0.42753
230,-0.42753
231,-0.42753
232,-0.42753
233,-0.42753
234,-0.42753
235,-0.42753
236,-0.42753
237,-0.42753
238,-0.42753
239,-0.42753
240,-0.42753
241,-0.42753
242,-0.42753
243,-0.42753
244,-0.42753
245,-0.42753
246,-0.42753
247,0.56839
248,2.8922
249,2.5602
250,1.3153
251,-0.26155
252,-0.42753
253,-0.42753
254,-0.42753
255,-0.42753
256,-0.42753
257,-0.42753
258,-0.42753
259,-0.42753
260,-0.42753
261,-0.42753
262,-0.42753
263,-0.42753
264,-0.42753
265,-0.42753
266,-0.42753
267,-0.42753
268,-0.42753
269,-0.42753
270,-0.42753
271,-0.42753
272,-0.42753
273,-0.42753
274,-0.42753
275,-0.42753
276,-0.42753
277,-0.42753
278,-0.42753
279,-0.42753
280,-0.42753
281,-0.42753
282,-0.42753
283,0.81738
284,2.8922
285,2.8922
286,1.0664
287,-0.26155
288,-0.42753
289,-0.42753
290,-0.42753
291,-0.42753
292,-0.42753
293,-0.42753
294,-0.42753
295,-0.42753
296,-0.42753
297,-0.42753
298,-0.42753
299,-0.42753
300,-0.42753
301,-0.42753
302,-0.42753
303,-0.42753
304,-0.42753
305,-0.42753
306,-0.42753
307,-0.42753
308,-0.42753
309,-0.42753
310,-0.42753
311,-0.42753
312,-0.42753
313,-0.42753
314,-0.42753
315,-0.42753
316,-0.42753
317,-0.42753
318,2.5602
319,2.8922
320,2.5602
321,-0.17855
322,-0.42753
323,-0.42753
324,-0.42753
325,-0.42753
326,-0.42753
327,-0.42753
328,-0.42753
329,-0.42753
330,-0.42753
331,-0.42753
332,-0.42753
333,-0.42753
334,-0.42753
335,-0.42753
336,-0.42753
337,-0.42753
338,-0.42753
339,-0.42753
340,-0.42753
341,-0.42753
342,1.0664
343,2.8922
344,2.5602
345,2.5602
346,0.81738
347,-0.42753
348,-0.42753
349,-0.42753
350,-0.42753
351,-0.42753
352,-0.42753
353,-0.42753
354,-0.42753
355,-0.42753
356,-0.42753
357,-0.42753
358,-0.42753
359,-0.42753
360,3.3072
361,2.5602
362,2.5602
363,2.2283
364,2.2283
365,1.3153
366,-0.34454
367,-0.42753
368,-0.42753
369,-0.42753
370,-0.42753
371,-0.42753
372,-0.42753
373,-0.42753
374,-0.42753
375,-0.42753
376,-0.42753
377,0.56839
378,2.8922
379,2.5602
380,2.2283
381,2.2283
382,2.2283
383,-0.17855
384,-0.42753
385,-0.42753
386,-0.42753
387,-0.42753
388,-0.42753
389,-0.42753
390,-0.42753
391,-0.42753
392,-0.42753
393,-0.42753
394,-0.42753
395,-0.42753
396,-0.42753
397,1.5643
398,2.8922
399,2.2283
400,2.5602
401,1.5643
402,-0.42753
403,-0.42753
404,-0.42753
405,-0.42753
406,-0.42753
407,-0.42753
408,-0.42753
409,-0.42753
410,-0.42753
411,-0.42753
412,-0.42753
413,-0.42753
414,-0.42753
415,-0.42753
416,-0.42753
417,3.3072
418,2.5602
419,2.2283
420,2.2283
421,0.56839
422,-0.42753
423,-0.42753
424,-0.42753
425,-0.42753
426,-0.42753
427,-0.42753
428,-0.42753
429,-0.42753
430,-0.42753
431,-0.42753
432,-0.42753
433,-0.42753
434,0.56839
435,2.8922
436,2.5602
437,2.2283
438,1.8963
439,-0.34454
440,-0.42753
441,-0.42753
442,-0.42753
443,-0.42753
444,-0.42753
445,-0.42753
446,-0.42753
447,-0.42753
448,-0.42753
449,-0.42753
450,-0.42753
451,-0.42753
452,-0.42753
453,-0.42753
454,1.8963
455,2.5602
456,2.5602
457,2.2283
458,0.56839
459,-0.42753
460,-0.42753
461,-0.42753
462,-0.42753
463,-0.42753
464,-0.42753
465,-0.42753
466,-0.42753
467,-0.42753
468,-0.42753
469,-0.42753
470,-0.42753
471,-0.42753
472,-0.42753
473,-0.42753
474,-0.42753
475,1.8963
476,2.8922
477,2.2283
478,2.2283
479,1.0664
480,-0.34454
481,-0.42753
482,-0.42753
483,-0.42753
484,-0.42753
485,-0.42753
486,-0.42753
487,-0.42753
488,-0.42753
489,-0.42753
490,-0.42753
491,-0.42753
492,-0.42753
493,-0.42753
494,-0.42753
495,-0.42753
496,-0.42753
497,2.8922
498,2.5602
499,2.5602
500,1.8963
501,-0.34454
502,-0.42753
503,-0.42753
504,-0.42753
505,-0.42753
506,-0.42753
507,-0.42753
508,-0.42753
509,-0.42753
510,-0.42753
511,-0.42753
512,-0.42753
513,-0.42753
514,-0.42753
515,-0.42753
516,-0.42753
517,-0.42753
518,-0.42753
519,-0.42753
520,-0.42753
521,1.5643
522,2.8922
523,2.5602
524,2.2283
525,0.07042999999999999
526,-0.34454
527,-0.42753
528,-0.42753
529,-0.42753
530,-0.42753
531,-0.42753
532,-0.42753
533,-0.42753
534,-0.42753
535,-0.42753
536,-0.42753
537,-0.42753
538,-0.42753
539,-0.42753
540,-0.42753
541,-0.42753
542,-0.42753
543,-0.42753
544,-0.42753
545,-0.42753
546,-0.42753
547,0.40241
548,2.8922
549,2.5602
550,2.2283
551,0.56839
552,-0.34454
553,-0.42753
554,-0.42753
555,-0.42753
556,-0.42753
557,-0.42753
558,-0.42753
559,-0.42753
560,-0.42753
561,-0.42753
562,-0.42753
563,-0.42753
564,-0.42753
565,-0.42753
566,-0.42753
567,-0.42753
568,-0.42753
569,-0.42753
570,-0.42753
571,0.40241
572,2.8922
573,2.5602
574,2.2283
575,0.56839
576,-0.26155
577,-0.42753
578,-0.42753
579,-0.42753
580,-0.42753
581,-0.42753
582,-0.42753
583,-0.42753
584,-0.42753
585,-0.42753
586,-0.42753
587,-0.42753
588,-0.42753
589,-0.42753
590,-0.42753
591,-0.42753
592,-0.42753
593,1.5643
594,2.5602
595,2.5602
596,2.2283
597,-0.26155
598,-0.42753
599,-0.42753
600,-0.42753
601,-0.42753
602,-0.42753
603,-0.42753
604,-0.42753
605,-0.42753
606,-0.42753
607,-0.42753
608,-0.42753
609,-0.42753
610,-0.42753
611,-0.42753
612,-0.42753
613,-0.42753
614,-0.42753
615,-0.42753
616,-0.42753
617,0.23642
618,2.8922
619,2.5602
620,2.2283
621,0.40241
622,-0.34454
623,-0.42753
624,-0.42753
625,-0.42753
626,-0.42753
627,-0.42753
628,-0.42753
629,-0.42753
630,-0.42753
631,-0.42753
632,-0.42753
633,-0.42753
634,-0.42753
635,-0.42753
636,-0.42753
637,-0.42753
638,-0.42753
639,-0.42753
640,-0.42753
641,-0.42753
642,-0.42753
643,-0.42753
644,-0.42753
645,-0.42753
646,2.8922
647,2.8922
648,2.2283
649,0.56839
650,-0.42753
651,-0.42753
652,-0.42753
653,-0.42753
654,-0.42753
655,-0.42753
656,-0.42753
657,-0.42753
658,-0.42753
659,-0.42753
660,-0.42753
661,-0.42753
662,-0.42753
663,-0.42753
664,-0.42753
665,-0.42753
666,-0.42753
667,-0.42753
668,-0.42753
669,-0.42753
670,-0.42753
671,-0.42753
672,-0.42753
673,1.0664
674,2.8922
675,2.5602
676,2.2283
677,-0.42753
678,-0.42753
679,-0.42753
680,-0.42753
681,-0.42753
682,-0.42753
683,-0.42753
684,-0.42753
685,-0.42753
686,-0.42753
687,-0.42753
688,-0.42753
689,-0.42753
690,-0.42753
691,-0.42753
692,-0.42753
693,-0.42753
694,-0.42753
695,-0.42753
696,0.40241
697,2.8922
698,2.5602
699,2.2283
700,0.40241
701,-0.42753
702,-0.42753
703,-0.42753
704,-0.42753
705,-0.42753
706,-0.42753
707,-0.42753
708,-0.42753
709,-0.42753
710,-0.42753
711,-0.42753
712,-0.42753
713,-0.42753
714,-0.42753
715,-0.42753
716,-0.42753
717,-0.42753
718,-0.42753
719,-0.42753
