time,value
0,-0.9229
1,-0.9229
2,-0.9229
3,-0.9229
4,-0.9229
5,-0.9229
6,-0.9229
7,-0.9229
8,-0.9229
9,-0.9229
10,-0.9229
11,-0.9229
12,-0.9229
13,-0.9229
14,-0.9229
15,-0.9229
16,-0.9229
17,-0.9229
18,-0.9229
19,-0.9229
20,-0.9229
21,-0.9229
22,-0.9229
23,-0.9229
24,-0.9229
25,-0.9229
26,-0.9229
27,-0.9229
28,-0.9229
29,-0.9229
30,-0.97051
31,-1.0635
32,-1.1758
33,-1.2512
34,-1.294
35,-1.294
36,-1.294
37,-1.294
38,-1.294
39,-1.294
40,-1.294
41,-1.294
42,-1.294
43,-1.294
44,-1.294
45,-1.294
46,-1.2734
47,-1.2049
48,-1.1002
49,-1.0025
50,-0.93155
51,-0.9229
52,-0.9229
53,-0.9229
54,-0.9229
55,-0.9229
56,-0.9229
57,-0.9229
58,-0.9229
59,-0.9229
60,-0.9229
61,-0.9229
62,-0.9229
63,-0.9229
64,-0.9229
65,-0.9229
66,-0.9229
67,-0.9229
68,-0.9229
69,-0.9229
70,-0.84951
71,-0.74442
72,-0.63213
73,-0.5777399999999999
74,-0.55176
75,-0.55176
76,-0.55176
77,-0.55176
78,-0.55176
79,-0.53328
80,-0.47612
81,-0.36383000000000004
82,-0.25155
83,-0.23415
84,-0.33462
85,-0.44656999999999997
86,-0.51944
87,-0.55176
88,-0.55176
89,-0.55176
90,-0.55176
91,-0.55176
92,-0.55176
93,-0.55176
94,-0.55176
95,-0.55176
96,-0.53215
97,-0.42223
98,-0.31064
99,-0.21739
100,-0.18784
101,-0.18062999999999999
102,-0.18062999999999999
103,-0.18062999999999999
104,-0.18062999999999999
105,-0.18062999999999999
106,-0.18062999999999999
107,-0.18062999999999999
108,-0.18017
109,-0.17899
110,-0.076616
111,0.03567
112,0.14795999999999998
113,0.1772
114,0.19050999999999998
115,0.19050999999999998
116,0.19050999999999998
117,0.19050999999999998
118,0.1926
119,0.22451999999999997
120,0.30396999999999996
121,0.4157
122,0.5232600000000001
123,0.5616399999999999
124,0.5616399999999999
125,0.5616399999999999
126,0.6240600000000001
127,0.7188399999999999
128,0.8311299999999999
129,0.9434100000000001
130,1.0557
131,1.168
132,1.252
133,1.3039
134,1.3039
135,1.3039
136,1.3039
137,1.3039
138,1.3039
139,1.3438
140,1.4372
141,1.5486
142,1.6292
143,1.675
144,1.675
145,1.6543
146,1.6112
147,1.4989
148,1.3935
149,1.3039
150,1.3039
151,1.3039
152,1.2884
153,1.1915
154,1.0841
155,0.97178
156,0.85949
157,0.74721
158,0.6461100000000001
159,0.5763699999999999
160,0.5616399999999999
161,0.56647
162,0.5818399999999999
163,0.67865
164,0.79094
165,0.90322
166,0.8362700000000001
167,0.73775
168,0.62547
169,0.58233
170,0.5616399999999999
171,0.5616399999999999
172,0.5616399999999999
173,0.5616399999999999
174,0.5616399999999999
175,0.5616399999999999
176,0.5616399999999999
177,0.5616399999999999
178,0.5616399999999999
179,0.62659
180,0.7318399999999999
181,0.8441299999999999
182,0.95641
183,1.0687
184,1.181
185,1.2571
186,1.3039
187,1.3039
188,1.3039
189,1.3039
190,1.3039
191,1.3039
192,1.3039
193,1.3039
194,1.3039
195,1.3367
196,1.4171
197,1.5273
198,1.5906
199,1.5965
200,1.4859
201,1.3869
202,1.3039
203,1.3039
204,1.3039
205,1.294
206,1.1829
207,1.0711
208,0.95878
209,0.84649
210,0.7342
211,0.64376
212,0.64494
213,0.72593
214,0.831
215,0.91374
216,0.9327700000000001
217,0.93347
218,0.93584
219,1.0285
220,1.1408
221,1.2531
222,1.2126
223,1.1302
224,1.0179
225,0.96134
226,0.9327700000000001
227,0.9327700000000001
228,0.96509
229,1.038
230,1.1501
231,1.2565
232,1.3039
233,1.3039
234,1.3039
235,1.359
236,1.4528
237,1.5651
238,1.5935
239,1.5604
240,1.4481
241,1.3618
242,1.3039
243,1.3039
244,1.2967
245,1.2578
246,1.1455
247,1.0332
248,0.9529200000000001
249,0.93519
250,0.9327700000000001
251,0.9065200000000001
252,0.83915
253,0.7306600000000001
254,0.60064
255,0.44816999999999996
256,0.22596
257,0.014211000000000001
258,-0.18062999999999999
259,-0.18062999999999999
260,-0.18062999999999999
261,-0.18754
262,-0.28564
263,-0.3922
264,-0.49583
265,-0.5372
266,-0.55176
267,-0.5593600000000001
268,-0.60309
269,-0.6947800000000001
270,-0.80333
271,-0.89907
272,-0.9229
273,-0.9229
274,-0.9229
275,-1.0045
276,-1.1096
277,-1.2219
278,-1.3342
279,-1.4465
280,-1.5588
281,-1.5854
282,-1.547
283,-1.4347
284,-1.3416
285,-1.294
286,-1.294
287,-1.294
288,-1.294
289,-1.294
290,-1.294
291,-1.294
292,-1.294
293,-1.294
294,-1.294
295,-1.294
296,-1.294
297,-1.294
298,-1.294
299,-1.294
300,-1.294
301,-1.2649
302,-1.1562
303,-1.0446
304,-0.95839
305,-0.92766
306,-0.9229
307,-0.9229
308,-0.9229
309,-0.9229
310,-0.9229
311,-0.9229
312,-0.9229
313,-0.9229
314,-0.9229
