time,value
0,-0.52385
1,-0.52385
2,-0.52385
3,-0.52385
4,-0.52385
5,-0.52385
6,-0.52385
7,-0.52385
8,-0.52385
9,-0.52385
10,-0.52385
11,-0.52385
12,-0.52385
13,-0.52385
14,-0.52385
15,-0.52385
16,-0.52385
17,-0.52385
18,-0.52385
19,-0.52385
20,-0.52385
21,-0.52385
22,-0.52385
23,-0.52385
24,-0.52385
25,-0.52598
26,-0.5334899999999999
27,-0.54445
28,-0.5554100000000001
29,-0.5656899999999999
30,-0.5697300000000001
31,-0.5697300000000001
32,-0.5697300000000001
33,-0.5697300000000001
34,-0.5697300000000001
35,-0.5697300000000001
36,-0.5697300000000001
37,-0.5697300000000001
38,-0.5697300000000001
39,-0.5697300000000001
40,-0.5697300000000001
41,-0.5697300000000001
42,-0.5734
43,-0.58215
44,-0.5931
45,-0.60406
46,-0.61378
47,-0.61553
48,-0.6156
49,-0.6156
50,-0.61747
51,-0.62393
52,-0.63489
53,-0.64585
54,-0.65681
55,-0.66776
56,-0.67872
57,-0.6896800000000001
58,-0.70129
59,-0.71583
60,-0.73775
61,-0.75966
62,-0.78158
63,-0.8079
64,-0.8385600000000001
65,-0.87144
66,-0.9043100000000001
67,-0.9371799999999999
68,-0.97006
69,-1.0029
70,-1.0358
71,-1.0687
72,-1.1016
73,-1.1344
74,-1.1673
75,-1.2002
76,-1.2256
77,-1.248
78,-1.2699
79,-1.291
80,-1.3087
81,-1.3197
82,-1.3306
83,-1.3416
84,-1.3438
85,-1.3358
86,-1.3248
87,-1.3138
88,-1.3029
89,-1.2919
90,-1.281
91,-1.27
92,-1.2591
93,-1.2481
94,-1.2371
95,-1.2262
96,-1.2142
97,-1.1965
98,-1.1746
99,-1.1527
100,-1.1308
101,-1.1089
102,-1.0869
103,-1.065
104,-1.0431
105,-1.0248
106,-1.0139
107,-1.0029
108,-0.99197
109,-0.9849
110,-0.98262
111,-0.98262
112,-0.98262
113,-0.9836
114,-0.99324
115,-1.0041
116,-1.0151
117,-1.026
118,-1.037
119,-1.0479
120,-1.0589
121,-1.0698
122,-1.0663
123,-1.057
124,-1.046
125,-1.0343
126,-1.0197
127,-0.99782
128,-0.9759
129,-0.95399
130,-0.9276
131,-0.89686
132,-0.86398
133,-0.83121
134,-0.7992100000000001
135,-0.77661
136,-0.7547
137,-0.73278
138,-0.71317
139,-0.69815
140,-0.6872
141,-0.67624
142,-0.66528
143,-0.65432
144,-0.64336
145,-0.63241
146,-0.6222
147,-0.61563
148,-0.6156
149,-0.6156
150,-0.6156
151,-0.6156
152,-0.6156
153,-0.6156
154,-0.6156
155,-0.6156
156,-0.6156
157,-0.6156
158,-0.6156
159,-0.61188
160,-0.59573
161,-0.57382
162,-0.5519
163,-0.5275
164,-0.49228999999999995
165,-0.44846
166,-0.40463000000000005
167,-0.36084
168,-0.33016
169,-0.30673
170,-0.28481999999999996
171,-0.26269000000000003
172,-0.23719
173,-0.20431
174,-0.17144
175,-0.13857
176,-0.11381
177,-0.098241
178,-0.087283
179,-0.076325
180,-0.066726
181,-0.075931
182,-0.086698
183,-0.09765599999999999
184,-0.10860999999999998
185,-0.11957000000000001
186,-0.13053
187,-0.14149
188,-0.15245
189,-0.1634
190,-0.17436
191,-0.18532
192,-0.19305
193,-0.18912
194,-0.15624000000000002
195,-0.12337000000000001
196,-0.09049700000000001
197,-0.048637
198,0.0021344000000000003
199,0.056924
200,0.11191
201,0.16933
202,0.24409
203,0.32079
204,0.3975
205,0.47193
206,0.54156
207,0.60731
208,0.67306
209,0.7388
210,0.76802
211,0.77898
212,0.78994
213,0.79956
214,0.80088
215,0.79038
216,0.77942
217,0.76846
218,0.76169
219,0.76072
220,0.76072
221,0.76072
222,0.7639
223,0.77285
224,0.7838
225,0.79476
226,0.81077
227,0.8469200000000001
228,0.89075
229,0.9345899999999999
230,0.9798899999999999
231,1.0303
232,1.0851
233,1.1399
234,1.1947
235,1.2494
236,1.3042
237,1.359
238,1.413
239,1.4607
240,1.4936
241,1.5265
242,1.5593
243,1.5838
244,1.5994
245,1.6103
246,1.6213
247,1.6315
248,1.6215
249,1.6106
250,1.5997
251,1.5887
252,1.5777
253,1.5668
254,1.5558
255,1.5449
256,1.5413
257,1.5406
258,1.5406
259,1.5432
260,1.5547
261,1.5875
262,1.6204
263,1.6533
264,1.6817
265,1.7054
266,1.7274
267,1.7492
268,1.7694
269,1.7816
270,1.7925
271,1.8035
272,1.81
273,1.8064
274,1.7954
275,1.7845
276,1.7732
277,1.7551
278,1.7332
279,1.7113
280,1.6888
281,1.6616
282,1.6292
283,1.5963
284,1.5634
285,1.5306
286,1.4977
287,1.4648
288,1.4319
289,1.4025
290,1.3785
291,1.3565
292,1.3346
293,1.3127
294,1.2908
295,1.2689
296,1.247
297,1.2234
298,1.1949
299,1.1621
300,1.1292
301,1.0963
302,1.0565
303,1.0135
304,0.96965
305,0.9263600000000001
306,0.88608
307,0.8532
308,0.8203299999999999
309,0.78746
310,0.7589
311,0.7347100000000001
312,0.7128
313,0.69088
314,0.66896
