time,value
0,1.17
1,3.0004
2,4.6285
3,5.2574
4,4.5566
5,2.8974
6,1.114
7,-0.03488
8,-0.30527
9,-0.0092686
10,0.32124
11,0.34938
12,0.10953
13,-0.13675
14,-0.18208
15,-0.03876
16,0.11961
17,0.14271
18,0.028997000000000002
19,-0.10477
20,-0.14995999999999998
21,-0.09813999999999999
22,-0.026087
23,-0.008822799999999999
24,-0.053336
25,-0.10910999999999998
26,-0.12802
27,-0.1079
28,-0.084204
29,-0.088024
30,-0.11672
31,-0.14387
32,-0.15084
33,-0.14128
34,-0.138
35,-0.15811
36,-0.18437
37,-0.20169
38,-0.20357999999999998
39,-0.19524
40,-0.19319
41,-0.20848000000000003
42,-0.23413
43,-0.25255
44,-0.25106
45,-0.23217
46,-0.21284
47,-0.21023000000000003
48,-0.22643000000000002
49,-0.24900999999999998
50,-0.26334
51,-0.26452
52,-0.26118
53,-0.267
54,-0.28672
55,-0.31179
56,-0.32811999999999997
57,-0.32733
58,-0.31377
59,-0.30218
60,-0.30591999999999997
61,-0.3269
62,-0.35546
63,-0.37658
64,-0.37938
65,-0.36485
66,-0.34419
67,-0.33057
68,-0.3321
69,-0.3468
70,-0.36386999999999997
71,-0.37264
72,-0.3697
73,-0.36008
74,-0.35375999999999996
75,-0.35744000000000004
76,-0.36896999999999996
77,-0.38047
78,-0.38536
79,-0.38331
80,-0.38072
81,-0.38455
82,-0.39541
83,-0.40729
84,-0.41306000000000004
85,-0.41013999999999995
86,-0.40287
87,-0.39893
88,-0.4028
89,-0.41289
90,-0.42425
91,-0.43291999999999997
92,-0.43888999999999995
93,-0.44516000000000006
94,-0.45353000000000004
95,-0.46182
96,-0.46546000000000004
97,-0.46125
98,-0.45031000000000004
