time,value
0,0.9032399999999999
1,1.1761
2,-0.051828
3,-0.87046
4,-0.87046
5,-0.87046
6,-0.87046
7,-0.87046
8,-0.87046
9,-0.87046
10,-0.87046
11,-0.87046
12,-0.87046
13,-0.87046
14,-0.87046
15,-0.87046
16,-0.87046
17,-0.87046
18,0.63036
19,1.449
20,1.449
21,1.449
22,1.1761
23,1.1761
24,1.1761
25,1.1761
26,0.9032399999999999
27,0.9032399999999999
28,1.1761
29,0.9032399999999999
30,-0.73402
31,-0.87046
32,-0.87046
33,-0.87046
34,-0.87046
35,-0.87046
36,-0.87046
37,-0.87046
38,-0.87046
39,-0.87046
40,-0.87046
41,-0.87046
42,-0.87046
43,-0.87046
44,-0.87046
45,-0.87046
46,1.449
47,1.449
48,1.449
49,1.449
50,1.1761
51,0.9032399999999999
52,1.1761
53,1.1761
54,0.9032399999999999
55,1.1761
56,0.63036
57,-0.73402
58,-0.87046
59,-0.87046
60,-0.87046
61,-0.87046
62,-0.87046
63,-0.87046
64,-0.87046
65,-0.87046
66,-0.87046
67,-0.87046
68,-0.87046
69,-0.73402
70,-0.87046
71,-0.87046
72,0.15283
73,1.449
74,1.449
75,1.449
76,1.1761
77,1.1761
78,1.1761
79,1.1761
80,0.9032399999999999
81,1.1761
82,0.9032399999999999
83,-0.051828
84,-0.87046
85,-0.87046
86,-0.87046
87,-0.87046
88,-0.87046
89,-0.87046
90,-0.87046
91,-0.87046
92,-0.87046
93,-0.87046
94,-0.87046
95,-0.87046
96,-0.87046
97,-0.87046
98,-0.73402
99,1.1761
100,1.449
101,1.449
102,1.1761
103,1.1761
104,1.1761
105,1.1761
106,1.1761
107,0.9032399999999999
108,1.1761
109,0.9032399999999999
110,0.35749000000000003
111,-0.73402
112,-0.87046
113,-0.87046
114,-0.87046
115,-0.87046
116,-0.87046
117,-0.87046
118,-0.87046
119,-0.87046
120,-0.87046
121,-0.73402
122,-0.87046
123,-0.87046
124,-0.87046
125,-0.87046
126,-0.59758
127,1.449
128,1.449
129,1.449
130,1.449
131,1.1761
132,0.9032399999999999
133,1.1761
134,1.1761
135,0.9032399999999999
136,1.1761
137,0.9032399999999999
138,-0.46113999999999994
139,-0.87046
140,-0.87046
141,-0.87046
142,-0.87046
143,-0.87046
144,-0.87046
145,-0.87046
146,-0.73402
147,-0.87046
148,-1.0069
149,-0.87046
150,-0.87046
151,-0.87046
152,-0.87046
153,-0.87046
154,0.35749000000000003
155,1.449
156,1.449
157,1.449
158,1.1761
159,1.1761
160,1.1761
161,0.9032399999999999
162,1.1761
163,0.9032399999999999
164,0.9032399999999999
165,0.63036
166,-0.73402
167,-0.87046
168,-0.87046
169,-0.87046
170,-0.87046
171,-0.87046
172,-0.87046
173,-0.87046
174,-0.87046
175,-0.87046
176,-0.87046
177,-0.87046
178,-0.87046
179,-0.87046
180,-0.87046
181,-0.87046
182,1.1761
183,1.449
184,1.449
185,1.449
186,1.1761
187,1.1761
188,0.9032399999999999
189,1.1761
190,0.9032399999999999
191,0.9032399999999999
192,1.1761
193,-0.051828
194,-0.87046
195,-0.87046
196,-1.0069
197,-0.87046
198,-0.87046
199,-0.87046
200,-0.87046
201,-0.87046
202,-0.87046
203,-0.87046
204,-0.87046
205,-0.87046
206,-0.87046
207,-0.87046
208,-0.87046
209,-0.87046
210,1.1761
211,1.449
212,1.449
213,1.449
214,1.1761
215,1.1761
216,0.9032399999999999
217,1.1761
218,0.9032399999999999
219,1.1761
220,0.9032399999999999
221,-0.46113999999999994
222,-0.87046
223,-0.87046
224,-1.0069
225,-0.87046
226,-0.87046
227,-0.87046
228,-0.87046
229,-0.87046
230,-0.87046
231,-0.87046
232,-0.87046
233,-0.87046
234,-0.87046
235,-0.87046
236,-0.87046
237,-0.051828
238,1.449
239,1.449
240,1.449
241,1.1761
242,1.1761
243,1.1761
244,0.9032399999999999
245,1.1761
246,0.9032399999999999
247,0.9032399999999999
248,-0.051828
249,-0.73402
250,-0.87046
251,-0.87046
252,-1.0069
253,-0.87046
254,-0.87046
255,-0.87046
256,-0.87046
257,-0.87046
258,-0.87046
259,-0.87046
260,-0.87046
261,-0.87046
262,-0.87046
263,-0.87046
264,-0.46113999999999994
265,1.449
266,1.449
267,1.449
268,1.1761
269,1.1761
270,1.1761
271,1.1761
272,0.9032399999999999
273,1.1761
274,0.9032399999999999
275,0.35749000000000003
276,-0.87046
277,-0.87046
278,-0.87046
279,-0.87046
280,-0.87046
281,-0.87046
282,-0.87046
283,-0.87046
284,-0.87046
285,-0.87046
286,-0.87046
287,-0.87046
288,-0.25649
289,1.449
290,1.449
291,1.449
292,1.1761
293,1.1761
294,1.1761
295,0.9032399999999999
296,1.1761
297,0.9032399999999999
298,0.9032399999999999
299,1.1761
300,-0.25649
301,-0.87046
302,-0.87046
303,-0.87046
304,-1.0069
305,-0.87046
306,-0.87046
307,-0.87046
308,-0.87046
309,-0.87046
310,-0.87046
311,-0.87046
312,-1.0069
313,-0.87046
314,-0.87046
315,-0.87046
316,0.9032399999999999
317,1.449
318,1.449
319,1.1761
320,1.449
321,1.1761
322,0.9032399999999999
323,1.1761
324,1.1761
325,0.9032399999999999
326,0.9032399999999999
327,1.1761
328,0.9032399999999999
329,-0.46113999999999994
330,-0.73402
331,-0.87046
332,-0.87046
333,-0.87046
334,-0.87046
335,-1.0069
336,-0.87046
337,-0.87046
338,-0.87046
339,-0.87046
340,-0.87046
341,-0.87046
342,-0.87046
343,-0.87046
344,-0.25649
345,1.449
346,1.449
347,1.449
348,1.449
349,1.1761
350,1.1761
351,0.9032399999999999
352,1.1761
353,0.9032399999999999
354,1.1761
355,0.9032399999999999
356,0.9032399999999999
357,-0.59758
358,-0.87046
359,-0.87046
360,-0.87046
361,-0.87046
362,-0.87046
363,-0.87046
364,-1.0069
365,-0.87046
366,-0.87046
367,-0.87046
368,-0.87046
369,-0.87046
370,-0.87046
371,-0.87046
372,-0.46113999999999994
373,1.449
374,1.449
375,1.449
376,1.449
377,1.1761
378,1.1761
379,1.1761
380,0.9032399999999999
381,1.1761
382,0.9032399999999999
383,1.1761
384,0.15283
385,-0.73402
386,-0.87046
387,-0.87046
388,-0.87046
389,-0.87046
390,-0.87046
391,-0.87046
392,-0.87046
393,-0.87046
394,-1.0069
395,-0.87046
396,-0.87046
397,-0.87046
398,-0.87046
399,-0.87046
400,0.35749000000000003
401,1.449
402,1.449
403,1.449
404,1.1761
405,1.1761
406,1.1761
407,1.1761
408,1.1761
409,0.9032399999999999
410,0.9032399999999999
411,1.1761
412,-0.25649
413,-0.73402
414,-0.87046
415,-0.87046
416,-0.87046
417,-0.87046
418,-0.87046
419,-0.87046
420,-0.87046
421,-0.87046
422,-0.87046
423,-0.87046
424,-0.87046
425,-0.87046
426,-0.87046
427,-0.87046
428,1.449
429,1.449
430,1.449
431,1.1761
432,1.449
433,1.1761
434,0.9032399999999999
435,1.1761
436,1.1761
437,0.9032399999999999
438,0.9032399999999999
439,0.63036
440,-0.87046
441,-0.87046
442,-0.87046
443,-0.87046
444,-0.87046
445,-0.87046
446,-0.87046
447,-0.87046
448,-1.0069
449,-0.87046
450,-0.87046
451,-0.87046
452,-0.87046
453,-0.87046
454,-0.87046
455,0.15283
456,1.449
457,1.449
458,1.1761
459,1.449
460,1.1761
461,0.9032399999999999
462,1.1761
463,0.9032399999999999
464,1.1761
465,0.9032399999999999
466,0.63036
467,-0.87046
468,-0.87046
469,-0.87046
470,-0.87046
471,-0.87046
472,-0.87046
473,-0.87046
474,-0.87046
475,-0.87046
476,-0.87046
477,-0.87046
478,-0.87046
479,-0.87046
480,-0.87046
481,-0.87046
482,-0.46113999999999994
483,1.449
484,1.449
485,1.449
486,1.1761
487,1.1761
488,1.1761
489,1.1761
490,0.9032399999999999
491,1.1761
492,0.9032399999999999
493,0.9032399999999999
494,-0.73402
495,-0.87046
496,-0.87046
497,-0.87046
498,-0.87046
499,-0.87046
500,-0.87046
501,-0.87046
502,-1.0069
503,-0.87046
504,-0.87046
505,-0.87046
506,-0.87046
507,-0.87046
508,-0.87046
509,-0.87046
510,1.449
511,1.449
512,1.449
513,1.1761
514,1.1761
515,1.1761
516,1.1761
517,0.9032399999999999
518,1.1761
519,0.9032399999999999
520,0.9032399999999999
521,-0.25649
522,-0.87046
523,-0.87046
524,-0.87046
525,-0.87046
526,-0.87046
527,-0.87046
528,-0.87046
529,-0.87046
530,-1.0069
531,-0.87046
532,-0.87046
533,-0.87046
534,-0.87046
535,-0.87046
536,-0.87046
537,0.63036
538,1.449
539,1.449
540,1.449
541,1.1761
542,1.1761
543,1.1761
544,0.9032399999999999
545,1.1761
546,0.9032399999999999
547,0.9032399999999999
548,-0.25649
549,-0.73402
550,-0.87046
551,-1.0069
552,-0.87046
553,-0.87046
554,-0.87046
555,-0.87046
556,-0.87046
557,-0.87046
558,-0.87046
559,-0.87046
560,-0.87046
561,-1.0069
562,-0.87046
563,-0.87046
564,0.35749000000000003
565,1.7901
566,1.1761
567,1.449
568,1.1761
569,1.1761
570,1.1761
571,0.9032399999999999
572,1.1761
573,0.9032399999999999
574,1.1761
575,-0.46113999999999994
576,-0.87046
577,-0.87046
578,-0.87046
579,-0.87046
580,-0.87046
581,-0.87046
582,-0.87046
583,-0.87046
584,-0.87046
585,-0.87046
586,-0.87046
587,-1.0069
588,-0.87046
589,-0.87046
590,-0.87046
591,1.1761
592,1.449
593,1.449
594,1.449
595,1.1761
596,1.1761
597,0.9032399999999999
598,1.1761
599,1.1761
600,0.9032399999999999
601,0.63036
602,-0.87046
603,-0.87046
604,-0.87046
605,-0.87046
606,-0.87046
607,-0.87046
608,-0.87046
609,-0.87046
610,-0.87046
611,-0.87046
612,-0.87046
613,-0.87046
614,-0.87046
615,-0.87046
616,-0.87046
617,1.7901
618,1.449
619,1.449
620,1.449
621,1.1761
622,1.1761
623,1.1761
624,0.9032399999999999
625,1.1761
626,0.9032399999999999
627,1.1761
628,0.9032399999999999
629,0.9032399999999999
630,0.9032399999999999
631,0.9032399999999999
632,-0.87046
633,-0.87046
634,-0.87046
635,-0.87046
636,-0.87046
637,-0.87046
638,-1.0069
639,-0.87046
640,-0.87046
641,-0.87046
642,-0.87046
643,-0.87046
644,-0.87046
645,-0.87046
646,-0.87046
647,-0.87046
648,0.63036
649,1.449
650,1.449
651,1.449
652,1.1761
653,1.1761
654,0.9032399999999999
655,1.1761
656,1.1761
657,0.9032399999999999
658,0.9032399999999999
659,0.9032399999999999
660,1.1761
661,-0.59758
662,-0.87046
663,-0.87046
664,-0.87046
665,-0.87046
666,-0.87046
667,-0.87046
668,-0.87046
669,-0.87046
670,-0.87046
671,-0.87046
672,-0.87046
673,-0.87046
674,-0.87046
675,-0.87046
676,-0.87046
677,1.1761
678,1.449
679,1.449
680,1.449
681,1.1761
682,1.1761
683,0.9032399999999999
684,1.1761
685,0.9032399999999999
686,1.1761
687,0.9032399999999999
688,0.9032399999999999
689,-0.051828
690,-0.87046
691,-0.87046
692,-0.87046
693,-0.87046
694,-0.87046
695,-0.87046
696,-0.87046
697,-0.87046
698,-0.87046
699,-0.87046
700,-0.87046
701,-0.87046
702,-0.87046
703,-0.87046
704,-0.87046
705,0.35749000000000003
706,1.449
707,1.449
708,1.1761
709,1.1761
710,1.1761
711,1.1761
712,1.1761
713,0.9032399999999999
714,1.1761
715,0.9032399999999999
716,0.9032399999999999
717,0.63036
718,-0.73402
719,-0.87046
