time,value
0,0.39981
1,0.39981
2,0.39981
3,0.39981
4,0.39981
5,0.39981
6,0.39981
7,0.39981
8,0.39981
9,0.39981
10,0.39981
11,0.39981
12,0.39981
13,0.39981
14,0.39981
15,0.39981
16,0.39981
17,0.39981
18,0.39981
19,0.39981
20,0.39981
21,0.39981
22,0.39981
23,0.39981
24,0.39981
25,0.39981
26,0.39981
27,0.39981
28,0.39981
29,0.39981
30,0.39981
31,0.39981
32,0.39981
33,0.39981
34,0.39981
35,0.39981
36,0.39981
37,0.39981
38,0.39981
39,0.39981
40,0.39981
41,0.39981
42,0.39981
43,0.39981
44,0.39981
45,0.39981
46,0.39981
47,0.39981
48,0.39981
49,0.39981
50,0.39981
51,0.39981
52,0.39981
53,0.39981
54,0.4083
55,0.4208
56,0.4333
57,0.4458
58,0.4583
59,0.4708
60,0.48802
61,0.5067699999999999
62,0.52552
63,0.54427
64,0.56303
65,0.58178
66,0.60572
67,0.63072
68,0.65572
69,0.68072
70,0.70572
71,0.73073
72,0.76139
73,0.79264
74,0.82389
75,0.85515
76,0.8864
77,0.91765
78,0.9489
79,0.98016
80,1.0114
81,1.0427
82,1.0739
83,1.1052
84,1.1364
85,1.1677
86,1.1989
87,1.2302
88,1.2614
89,1.291
90,1.3098
91,1.3285
92,1.3473
93,1.3659999999999999
94,1.3848
95,1.4009
96,1.4072
97,1.4134
98,1.4197
99,1.4259
100,1.4322
101,1.4349
102,1.4287
103,1.4224
104,1.4162
105,1.4099
106,1.4037
107,1.3996
108,1.3996
109,1.3996
110,1.3996
111,1.3996
112,1.3996
113,1.3969
114,1.3907
115,1.3844
116,1.3782
117,1.3719
118,1.3657
119,1.3626
120,1.3626
121,1.3626
122,1.3626
123,1.3626
124,1.3626
125,1.359
126,1.3527
127,1.3465
128,1.3402
129,1.334
130,1.3277
131,1.3132
132,1.2944
133,1.2757
134,1.2569
135,1.2382
136,1.2194
137,1.1777
138,1.1277
139,1.0777
140,1.0277
141,0.9776799999999999
142,0.92768
143,0.8675299999999999
144,0.80502
145,0.74252
146,0.68002
147,0.61751
148,0.55501
149,0.49804
150,0.44178999999999996
151,0.38554
152,0.32928
153,0.27303
154,0.21677
155,0.13045
156,0.21508000000000002
157,-0.22246
158,-0.13207
159,-0.21958000000000003
160,-0.30638000000000004
161,-0.37513
162,-0.44388999999999995
163,-0.51264
164,-0.5814
165,-0.65015
166,-0.71537
167,-0.7528699999999999
168,-0.79038
169,-0.82788
170,-0.8653799999999999
171,-0.90289
172,-0.94157
173,-0.9853200000000001
174,-1.0291
175,-1.0728
176,-1.1166
177,-1.1603
178,-1.2057
179,-1.2557
180,-1.3057
181,-1.3557
182,-1.4058
183,-1.4558
184,-1.4951
185,-1.5139
186,-1.5326
187,-1.5514
188,-1.5702
189,-1.5889
190,-1.6025
191,-1.6087
192,-1.615
193,-1.6212
194,-1.6275
195,-1.6337
196,-1.64
197,-1.6462
198,-1.6525
199,-1.6587
200,-1.665
201,-1.6712
202,-1.6739
203,-1.6739
204,-1.6739
205,-1.6739
206,-1.6739
207,-1.6739
208,-1.6699
209,-1.6637
210,-1.6574
211,-1.6512
212,-1.6449
213,-1.6387
214,-1.6235
215,-1.6047
216,-1.5859999999999999
217,-1.5672
218,-1.5485
219,-1.5297
220,-1.5109
221,-1.4922
222,-1.4734
223,-1.4547
224,-1.4359
225,-1.4172
226,-1.4093
227,-1.403
228,-1.3968
229,-1.3905
230,-1.3843
231,-1.3780000000000001
232,-1.3718
233,-1.3655
234,-1.3593
235,-1.3530000000000002
236,-1.3468
237,-1.3402
238,-1.3152
239,-1.2902
240,-1.2652
241,-1.2402
242,-1.2152
243,-1.1896
244,-1.1583
245,-1.1271
246,-1.0958
247,-1.0646
248,-1.0333
249,-1.0031
250,-0.9781299999999999
251,-0.9531200000000001
252,-0.9281200000000001
253,-0.90312
254,-0.8781200000000001
255,-0.85005
256,-0.81255
257,-0.77505
258,-0.73754
259,-0.70004
260,-0.66254
261,-0.62303
262,-0.57928
263,-0.53552
264,-0.49177
265,-0.44802
266,-0.40426
267,-0.36299000000000003
268,-0.32548
269,-0.28798
270,-0.25048000000000004
271,-0.21298000000000003
272,-0.17547000000000001
273,-0.14387
274,-0.11886
275,-0.46893999999999997
276,-0.34393
277,-0.21891999999999998
278,-0.093909
279,0.093864
280,0.10776
281,0.20151
282,0.29527
283,0.38903000000000004
284,0.48278000000000004
285,0.11134000000000001
286,0.12384
287,0.13634000000000002
288,0.14884
289,0.16134
290,0.17385
291,0.18198
292,0.18823
293,0.19448
294,0.20073
295,0.20698000000000003
296,0.21324
297,0.21949000000000002
298,0.22574
299,0.23199
300,0.23824
301,0.24449
302,0.25074
303,0.25699
304,0.26324000000000003
305,0.26949
306,0.27574
307,0.28199
308,0.28824
309,0.29449000000000003
310,0.30074
311,0.30699
312,0.31324
313,0.31949
314,0.32574000000000003
315,-1.02
316,-1.02
317,-1.02
318,-1.02
319,-1.02
320,-1.02
321,-1.02
322,-1.02
323,-1.02
324,-1.02
325,-1.02
326,-1.02
327,-1.02
328,-1.02
329,-1.02
330,-1.02
331,-1.02
332,-1.02
333,-1.02
334,-1.02
335,-1.02
336,-1.02
337,-1.02
338,-1.02
339,-1.02
340,-1.02
341,-1.02
342,-1.02
343,-1.02
344,-1.02
345,-1.02
346,-1.02
347,-1.02
348,-1.02
349,-1.02
350,-1.02
351,-1.02
352,-1.02
353,-1.02
354,-1.02
355,-1.02
356,-1.02
357,-1.02
358,-1.02
359,-1.02
360,-1.02
361,-1.02
362,-1.02
363,-1.02
364,-1.02
365,-1.02
366,-1.02
367,-1.02
368,-1.02
369,-1.02
370,-1.02
371,-1.02
372,-1.02
373,-1.02
374,-1.02
375,-1.0112
376,-0.99955
377,-0.9878899999999999
378,-0.9762299999999999
379,-0.96457
380,-0.9529
381,-0.93156
382,-0.90823
383,-0.8849100000000001
384,-0.8615799999999999
385,-0.83826
386,-0.81493
387,-0.78105
388,-0.7460600000000001
389,-0.71107
390,-0.67608
391,-0.6411
392,-0.60611
393,-0.54824
394,-0.48991999999999997
395,-0.43161000000000005
396,-0.3733
397,-0.31499
398,-0.25667
399,-0.19835999999999998
400,-0.14005
401,-0.4083
402,-0.11674000000000001
403,0.17482999999999999
404,0.45869
405,0.13831
406,0.18495999999999999
407,0.23160999999999998
408,0.27826
409,0.32491
410,0.36914
411,0.40413000000000004
412,0.43911999999999995
413,0.47411000000000003
414,0.5090899999999999
415,0.54408
416,0.57907
417,0.61405
418,0.64904
419,0.68403
420,0.71902
421,0.7540100000000001
422,0.7931699999999999
423,0.8398200000000001
424,0.8864700000000001
425,0.9331200000000001
426,0.97977
427,1.0264
428,1.063
429,1.0863
430,1.1096
431,1.1329
432,1.1563
433,1.1796
434,1.2088
435,1.2438
436,1.2788
437,1.3138
438,1.3488
439,1.3838
440,1.4188
441,1.4538
442,1.4887
443,1.5237
444,1.5587
445,1.5937
446,1.6287
447,1.6637
448,1.6987
449,1.7337
450,1.7686
451,1.8036
452,1.8215
453,1.8331
454,1.8448
455,1.8564
456,1.8681
457,1.8798
458,1.882
459,1.882
460,1.882
461,1.882
462,1.882
463,1.882
464,1.882
465,1.882
466,1.882
467,1.882
468,1.882
469,1.882
470,1.8707
471,1.8591
472,1.8474
473,1.8358
474,1.8241
475,1.8119999999999998
476,1.7887
477,1.7653
478,1.742
479,1.7187
480,1.6954
481,1.6734
482,1.6617
483,1.65
484,1.6384
485,1.6267
486,1.6151
487,1.599
488,1.564
489,1.5290000000000001
490,1.494
491,1.459
492,1.4241
493,1.3767
494,1.2951
495,1.2135
496,1.1318
497,1.0502
498,0.96855
499,0.89484
500,0.83652
501,0.7782100000000001
502,0.7199
503,0.66159
504,0.60327
505,0.5498
506,0.50315
507,0.4565
508,0.40985
509,0.3632
510,0.31655
511,0.26418
512,0.20586999999999997
513,0.14755
514,0.44658000000000003
515,0.15502
516,-0.13654000000000002
517,-0.3951
518,-0.12574000000000002
519,-0.1724
520,-0.21905
521,-0.26569
522,-0.31234
523,-0.35151
524,-0.3865
525,-0.42149
526,-0.45648
527,-0.49146000000000006
528,-0.52645
529,-0.55308
530,-0.5764
531,-0.59973
532,-0.62305
533,-0.6463800000000001
534,-0.6697
535,-0.68379
536,-0.69545
537,-0.70711
538,-0.71877
539,-0.73044
540,-0.7421
541,-0.76388
542,-0.7872100000000001
543,-0.81053
544,-0.83386
545,-0.8571799999999999
546,-0.88051
547,-0.8928299999999999
548,-0.90449
549,-0.9161600000000001
550,-0.9278200000000001
551,-0.93948
552,-0.9509200000000001
553,-0.9509200000000001
554,-0.9509200000000001
555,-0.9509200000000001
556,-0.9509200000000001
557,-0.9509200000000001
558,-0.9498200000000001
559,-0.93816
560,-0.9265
561,-0.91484
562,-0.90317
563,-0.89151
564,-0.87787
565,-0.85454
566,-0.8312200000000001
567,-0.80789
568,-0.78457
569,-0.7612399999999999
570,-0.73792
571,-0.71459
572,-0.6912699999999999
573,-0.66794
574,-0.64462
575,-0.62129
576,-0.59423
577,-0.55924
578,-0.52425
579,-0.48926000000000003
580,-0.45428
581,-0.41928999999999994
582,-0.38892
583,-0.3656
584,-0.34226999999999996
585,-0.31895
586,-0.29562
587,-0.2723
588,-0.24896999999999997
589,-0.22565
590,-0.20232
591,-0.179
592,-0.15567
593,-0.13235
594,-0.12178
595,-0.12178
596,-0.12178
597,-0.12178
598,-0.12178
599,-0.12178
600,-0.12178
601,-0.12178
602,-0.12178
603,-0.12178
604,-0.12178
605,-0.12178
606,-0.12993
607,-0.14159000000000002
608,-0.15325
609,-0.16491
610,-0.17658
611,-0.18824000000000002
612,-0.1999
613,-0.21156
614,-0.22323
615,-0.23489000000000002
616,-0.24655
617,-0.25821
618,-0.26988
619,-0.28154
620,-0.2932
621,-0.30485999999999996
622,-0.31653000000000003
623,-0.32819
624,-0.32907
625,-0.32907
626,-0.32907
627,-0.32907
628,-0.32907
629,-0.32907
630,-0.25121
631,-0.25121
632,-0.25121
633,-0.25121
634,-0.25121
635,-0.25121
636,-0.25121
637,-0.25121
638,-0.25121
639,-0.25121
640,-0.25121
641,-0.25121
642,-0.25121
643,-0.25121
644,-0.25121
645,-0.25121
646,-0.25121
647,-0.25121
648,-0.25121
649,-0.25121
650,-0.25121
651,-0.25121
652,-0.25121
653,-0.25121
654,-0.25121
655,-0.25121
656,-0.25121
657,-0.25121
658,-0.25121
659,-0.25121
660,-0.25121
661,-0.25121
662,-0.25121
663,-0.25121
664,-0.25121
665,-0.25121
666,-0.25121
667,-0.25121
668,-0.25121
669,-0.25121
670,-0.25121
671,-0.25121
672,-0.25121
673,-0.25121
674,-0.25121
675,-0.25121
676,-0.25121
677,-0.25121
678,-0.25121
679,-0.25121
680,-0.25121
681,-0.25121
682,-0.25121
683,-0.25121
684,-0.25121
685,-0.25121
686,-0.25121
687,-0.25121
688,-0.25121
689,-0.25121
690,-0.2366
691,-0.21724000000000002
692,-0.19788
693,-0.17852
694,-0.15916
695,-0.1398
696,-0.12044
697,-0.10107999999999999
698,-0.40821
699,-0.31140999999999996
700,-0.21461
701,-0.11780999999999998
702,0.066653
703,0.26025
704,0.45385
705,0.12941
706,0.16813
707,0.20685
708,0.20758000000000001
709,0.20758000000000001
710,0.20758000000000001
711,0.20758000000000001
712,0.20758000000000001
713,0.20868
714,0.22804000000000002
715,0.2474
716,0.26676
717,0.28612
718,0.30548000000000003
719,0.32228
720,0.32228
721,0.32228
722,0.32228
723,0.32228
724,0.32228
725,0.31826
726,0.2989
727,0.27954
728,0.26018
729,0.24081999999999998
730,0.22146999999999997
731,0.19115
732,0.13307
733,0.37532
734,0.084918
735,-0.20548000000000002
736,-0.49588000000000004
737,-0.17121
738,-0.26800999999999997
739,-0.36480999999999997
740,-0.46161
741,-0.5584100000000001
742,-0.6552100000000001
743,-0.76041
744,-0.8765700000000001
745,-0.99272
746,-1.1089
747,-1.225
748,-1.3412
749,-1.4278
750,-1.4859
751,-1.5439
752,-1.6019999999999999
753,-1.6601
754,-1.7182
755,-1.7649
756,-1.8036
757,-1.8424
758,-1.8811
759,-1.9198
760,-1.9585
761,-2.01
762,-2.0681
763,-2.1262
764,-2.1843
765,-2.2423
766,-2.3004
767,-2.3443
768,-2.383
769,-2.4217
770,-2.4604
771,-2.4991
772,-2.5379
773,-2.5138
774,-2.475
775,-2.4363
776,-2.3976
777,-2.3589
778,-2.3202
779,-2.1956
780,-2.0601
781,-1.9246
782,-1.7890000000000001
783,-1.6535
784,-1.518
785,-1.3266
786,-1.133
787,-0.93939
788,-0.7458
789,-0.5522
790,-0.36079
791,-0.22526999999999997
792,-0.44838999999999996
793,0.2292
794,0.18128
795,0.3168
796,0.45232
797,0.5878399999999999
798,0.72336
799,0.85888
800,0.9944
801,1.1299
802,1.2691
803,1.4240000000000002
804,1.5788
805,1.7337
806,1.8886
807,2.0435
808,2.1830000000000003
809,2.2798
810,2.3766
811,2.4734
812,2.5702
813,2.667
814,2.6981
815,2.6013
816,2.5045
817,2.4077
818,2.3109
819,2.2141
820,2.0932
821,1.9383
822,1.7834
823,1.6285
824,1.4736
825,1.3188
826,1.2019
827,1.1244
828,1.047
829,0.9695600000000001
830,0.89212
831,0.8146800000000001
832,0.7810699999999999
833,0.7810699999999999
834,0.7810699999999999
835,0.7810699999999999
836,0.7810699999999999
837,0.7810699999999999
838,0.7934899999999999
839,0.81285
840,0.83221
841,0.85157
842,0.87093
843,0.8902899999999999
844,0.88189
845,0.8625299999999999
846,0.8431700000000001
847,0.82381
848,0.80445
849,0.78509
850,0.75039
851,0.71167
852,0.67295
853,0.6342300000000001
854,0.59551
855,0.55679
856,0.5516800000000001
857,0.5516800000000001
858,0.5516800000000001
859,0.5516800000000001
860,0.5516800000000001
861,0.5516800000000001
862,0.53341
863,0.51405
864,0.49468999999999996
865,0.47533000000000003
866,0.45597
867,0.43662
868,0.41726
869,0.39789
870,0.37854
871,0.35918
872,0.33981999999999996
873,0.32045999999999997
874,0.3011
875,0.28174
876,0.26238
877,0.24301999999999999
878,0.22366
879,0.21086999999999997
880,0.23023000000000002
881,0.24959
882,0.26895
883,0.28831
884,0.30767
885,0.31753000000000003
886,0.29817
887,0.27881
888,0.25945
889,0.24009
890,0.22073
891,0.20758000000000001
892,0.20758000000000001
893,0.20758000000000001
894,0.20758000000000001
895,0.20758000000000001
896,0.20758000000000001
897,0.20758000000000001
898,0.20758000000000001
899,0.20758000000000001
900,0.20758000000000001
901,0.20758000000000001
902,0.20758000000000001
903,0.20758000000000001
904,0.20758000000000001
905,0.20758000000000001
906,0.20758000000000001
907,0.20758000000000001
908,0.20758000000000001
909,0.20758000000000001
910,0.20758000000000001
911,0.20758000000000001
912,0.20758000000000001
913,0.20758000000000001
914,0.20758000000000001
915,0.20758000000000001
916,0.20758000000000001
917,0.20758000000000001
918,0.20758000000000001
919,0.20758000000000001
920,0.20758000000000001
921,0.19407
922,0.17471
923,0.15535
924,0.13599
925,0.11663
926,0.48673
927,0.38993
928,0.29313
929,0.19633
930,0.09952799999999999
931,0.14107999999999998
932,-0.094069
933,-0.19087
934,-0.28767
935,-0.38447
936,-0.48127
937,-0.11569000000000002
938,-0.13505
939,-0.17231
940,-0.21103000000000002
941,-0.24975
942,-0.28847
943,-0.32718
944,-0.36591
