time,value
0,0.057767
1,-0.27414
2,0.076953
3,-0.013284
4,-0.16444
5,0.089137
6,-0.51785
7,0.27749
8,0.31065
9,-0.035826
10,0.20105
11,-0.5707899999999999
12,0.12927
13,-0.47868999999999995
14,0.45365
15,-0.074443
16,-0.41091000000000005
17,-0.64522
18,0.73839
19,-0.46661
20,0.14147
21,-0.25932
22,0.18535
23,0.07964700000000001
24,0.027339999999999996
25,-0.50327
26,0.055667999999999995
27,-0.40968000000000004
28,0.13815
29,-0.21411
30,0.28867
31,-0.20355
32,0.07885199999999999
33,-0.14565
34,0.020275
35,-0.066049
36,0.23713
37,-0.13589
38,-0.053639
39,0.23446999999999998
40,0.3947
41,0.15517
42,0.41576
43,0.32099
44,1.5774
45,1.5774
46,1.5774
47,1.5774
48,1.5774
49,1.5774
50,1.5774
51,1.5774
52,1.5774
53,1.5774
54,1.5774
55,1.5774
56,1.5774
57,1.5774
58,1.5774
59,-1.6807
60,-1.6807
61,-1.6807
62,-1.6807
63,-1.6807
64,-1.6807
65,-1.6807
66,-1.6807
67,-1.6807
68,-1.6807
69,-1.6807
70,-1.6807
71,-1.6807
72,-1.6807
73,-0.21420999999999998
74,-1.6807
75,-1.6807
76,-1.6807
77,-1.6807
78,-1.6807
79,-1.6807
80,-1.6807
81,-1.6807
82,1.5774
83,1.5774
84,1.5774
85,1.5774
86,1.5774
87,1.5774
88,1.5774
89,1.5774
90,0.40557
91,0.36829
92,-0.09374
93,0.72642
94,0.0065228000000000005
95,0.10407000000000001
96,-0.494
97,0.12934
98,-0.5061899999999999
99,0.15238
100,-0.26783
101,0.33808
102,-0.25709
103,0.10303
104,0.028295999999999998
105,-0.5522600000000001
106,-0.059754999999999996
107,0.29072
108,-0.13982999999999998
109,0.14570999999999998
110,-0.037423000000000005
111,-0.43442
112,-0.14918
113,0.16371
114,-0.071493
115,-0.11257
116,-0.12343
117,0.036683999999999994
118,-0.080327
119,0.61266
120,0.16535999999999998
121,0.35301
122,-0.047331
123,-0.27605
124,0.67192
125,0.12982
126,0.0053365
127,0.21065
