time,value
0,0.53732
1,0.53732
2,0.53732
3,0.53732
4,0.53732
5,0.53732
6,0.53732
7,0.53732
8,0.53732
9,0.53732
10,0.53732
11,0.53732
12,0.53732
13,0.53732
14,0.53732
15,0.53732
16,0.53732
17,0.53732
18,0.53732
19,0.53732
20,0.53732
21,0.53732
22,0.53732
23,0.53732
24,0.53732
25,0.53732
26,0.53732
27,0.53732
28,0.53732
29,0.53732
30,0.53732
31,0.53732
32,0.53732
33,0.53732
34,0.53732
35,0.53732
36,0.53732
37,0.53732
38,0.55406
39,0.6075
40,0.69407
41,0.78063
42,0.86719
43,0.94789
44,1.0252
45,1.1022
46,1.1783
47,1.2493
48,1.3075
49,1.3653
50,1.423
51,1.4748
52,1.5176
53,1.5561
54,1.5945
55,1.6314
56,1.6554
57,1.6746
58,1.6938
59,1.7093
60,1.7094
61,1.6902
62,1.6709
63,1.6517
64,1.6283
65,1.6002
66,1.5714
67,1.5425
68,1.5137
69,1.4848
70,1.456
71,1.4271
72,1.3999
73,1.3777
74,1.3585
75,1.3393
76,1.32
77,1.3008
78,1.2815
79,1.2623
80,1.2433
81,1.2327
82,1.2311
83,1.2311
84,1.2311
85,1.2337
86,1.242
87,1.2517
88,1.2613
89,1.2709
90,1.2805
91,1.2901
92,1.2997
93,1.3094
94,1.319
95,1.3286
96,1.3382
97,1.3475
98,1.3419
99,1.3130000000000002
100,1.2841
101,1.2553
102,1.2298
103,1.2088
104,1.1895
105,1.1703
106,1.1511
107,1.1318
108,1.1126
109,1.0933
110,1.073
111,1.0484
112,1.0195
113,0.99067
114,0.96181
115,0.9433
116,0.93166
117,0.92204
118,0.9124200000000001
119,0.90074
120,0.88175
121,0.86251
122,0.8432799999999999
123,0.8216100000000001
124,0.7957
125,0.76685
126,0.738
127,0.70914
128,0.68029
129,0.6514300000000001
130,0.62258
131,0.59438
132,0.56929
133,0.55005
134,0.53082
135,0.51158
136,0.49628
137,0.48481
138,0.47518999999999995
139,0.46557
140,0.45548
141,0.4369
142,0.41773999999999994
143,0.3985
144,0.37763
145,0.35301
146,0.32416
147,0.2953
148,0.26645
149,0.2376
150,0.20874
151,0.17989000000000002
152,0.15103
153,0.12218
154,0.093325
155,0.064471
156,0.035617
157,0.0095905
158,-0.012473
159,-0.03171
160,-0.050946
161,-0.07018200000000001
162,-0.089418
163,-0.10865
164,-0.12789
165,-0.14712999999999998
166,-0.16635999999999998
167,-0.1856
168,-0.20483
169,-0.22407
170,-0.24331
171,-0.26254
172,-0.28178000000000003
173,-0.30094
174,-0.31951999999999997
175,-0.32961
176,-0.33923000000000003
177,-0.34885
178,-0.36217
179,-0.38316
180,-0.41201000000000004
181,-0.44087
182,-0.46971999999999997
183,-0.49272
184,-0.51261
185,-0.53185
186,-0.55109
187,-0.5703199999999999
188,-0.5895600000000001
189,-0.6087899999999999
190,-0.62803
191,-0.64431
192,-0.65636
193,-0.66598
194,-0.6756
195,-0.68472
196,-0.67924
197,-0.66962
198,-0.66
199,-0.6514
200,-0.64623
201,-0.64623
202,-0.64623
203,-0.64623
204,-0.64623
205,-0.64623
206,-0.64623
207,-0.64623
208,-0.64623
209,-0.64623
210,-0.64623
211,-0.64623
212,-0.65162
213,-0.6704
214,-0.69926
215,-0.72811
216,-0.7569600000000001
217,-0.78582
218,-0.81467
219,-0.8435299999999999
220,-0.8717799999999999
221,-0.89336
222,-0.90409
223,-0.91371
224,-0.9233299999999999
225,-0.93015
226,-0.93191
227,-0.93191
228,-0.93191
229,-0.9292600000000001
230,-0.91527
231,-0.89604
232,-0.8768
233,-0.85834
234,-0.84444
235,-0.8346899999999999
236,-0.8250700000000001
237,-0.81545
238,-0.81388
239,-0.82273
240,-0.83235
241,-0.8419700000000001
242,-0.85455
243,-0.8721200000000001
244,-0.89136
245,-0.91059
246,-0.9313
247,-0.9576399999999999
248,-0.9865
249,-1.0154
250,-1.0434
251,-1.0668
252,-1.0861
253,-1.1053
254,-1.1245
255,-1.1389
256,-1.1495
257,-1.1591
258,-1.1687
259,-1.1783
260,-1.188
261,-1.1976
262,-1.2072
263,-1.2168
264,-1.2264
265,-1.236
266,-1.2457
267,-1.2553
268,-1.2649
269,-1.2745
270,-1.2841
271,-1.2942
272,-1.3075
273,-1.3268
274,-1.3459999999999999
275,-1.3652
276,-1.3771
277,-1.3808
278,-1.3808
279,-1.3808
280,-1.3808
281,-1.3808
282,-1.3808
283,-1.3808
284,-1.3823
285,-1.3876
286,-1.3972
287,-1.4068
288,-1.4165
289,-1.4206
290,-1.4217
291,-1.4217
292,-1.4217
293,-1.4217
294,-1.4217
295,-1.4217
296,-1.4217
297,-1.419
298,-1.4123
299,-1.4027
300,-1.3931
301,-1.3834
302,-1.3738
303,-1.3642
304,-1.3546
305,-1.3458
306,-1.34
307,-1.34
308,-1.34
309,-1.34
310,-1.34
311,-1.34
312,-1.34
313,-1.34
314,-1.34
