time,value
0,0.22003000000000003
1,-0.33823000000000003
2,-0.2504
3,0.19701
4,-0.055691
5,-0.41947
6,0.08125299999999999
7,1.6893
8,1.6893
9,1.6893
10,1.6893
11,1.6893
12,1.6893
13,1.6893
14,1.6893
15,1.6893
16,-1.7233
17,-1.7233
18,-1.7233
19,-1.7233
20,-1.7233
21,-1.7233
22,-1.7233
23,-1.7233
24,-1.7233
25,-0.10617
26,0.3119
27,-0.77145
28,-0.39932
29,-0.33552
30,0.003012
31,0.43696
32,0.58275
33,-1.0368
34,-0.39771999999999996
35,-0.067605
36,0.23344
37,0.12340999999999999
38,-0.07915900000000001
39,-0.35195
40,-0.21335
41,0.9147299999999999
42,0.031291
43,-1.7233
44,-1.7233
45,-1.7233
46,-1.7233
47,-1.7233
48,-1.7233
49,-1.7233
50,-1.7233
51,-1.7233
52,-1.7233
53,-1.7233
54,1.6893
55,1.6893
56,1.6893
57,1.6893
58,1.6893
59,1.6893
60,1.6893
61,1.6893
62,1.6893
63,1.6893
64,1.6893
65,0.09504
66,-0.3948
67,-0.21700999999999998
68,-0.10325999999999999
69,-0.1171
70,0.098634
71,0.048361
72,0.020012000000000002
73,-0.14548
74,0.37405
75,0.46752
76,-0.013307
77,0.01375
78,0.47167
79,0.11375999999999999
80,-0.0032887
81,-0.25373
82,-0.14395
83,-0.11444000000000001
84,-0.59037
85,-0.061402
86,0.13064
87,0.83089
88,0.086632
89,-0.53785
90,0.71745
91,0.23501
92,0.14664000000000002
93,-0.15217
94,-0.073834
95,0.18288
96,0.027293
97,0.31734
98,0.8452
99,0.2645
100,-0.08228300000000001
101,0.055428
102,-0.088426
103,0.13119
104,-0.020569999999999998
105,0.033706
106,0.13815
107,-0.76959
108,0.31493000000000004
109,-0.090942
110,-0.72472
111,-0.1522
112,0.19419
113,0.01372
114,0.13024000000000002
115,-0.6382
116,-0.16222
117,-0.14941
118,0.18217
119,0.33844
120,0.09904500000000001
121,0.48073999999999995
122,-0.086688
123,0.30184
124,0.13498
125,-0.081357
126,0.2623
127,0.036015
