time,value
0,-0.90976
1,-0.91204
2,-0.91245
3,-0.9096
4,-0.9031299999999999
5,-0.8931600000000001
6,-0.8798799999999999
7,-0.86411
8,-0.8470799999999999
9,-0.8306399999999999
10,-0.81465
11,-0.79886
12,-0.78275
13,-0.76676
14,-0.75068
15,-0.73416
16,-0.71732
17,-0.70085
18,-0.68597
19,-0.67214
20,-0.65889
21,-0.64565
22,-0.63308
23,-0.6204
24,-0.60702
25,-0.5926899999999999
26,-0.57796
27,-0.5635899999999999
28,-0.54908
29,-0.53417
30,-0.51857
31,-0.50317
32,-0.48706000000000005
33,-0.46979
34,-0.45101
35,-0.43112
36,-0.41033000000000003
37,-0.38828
38,-0.36479
39,-0.33984000000000003
40,-0.31395
41,-0.28659
42,-0.25753000000000004
43,-0.22663000000000003
44,-0.19434
45,-0.16086
46,-0.12639
47,-0.091278
48,-0.056053
49,-0.021424000000000002
50,0.012386
51,0.045058
52,0.076271
53,0.10537
54,0.13215
55,0.15639
56,0.17794000000000001
57,0.19660999999999998
58,0.21252
59,0.22616999999999998
60,0.23800000000000002
61,0.24835
62,0.25706
63,0.26444
64,0.27016
65,0.27365
66,0.27388
67,0.27026999999999995
68,0.26247
69,0.25023
70,0.23351
71,0.21235
72,0.18772
73,0.16016
74,0.13007
75,0.097208
76,0.06195
77,0.024419
78,-0.015396
79,-0.057554999999999995
80,-0.10177
81,-0.14682
82,-0.19188
83,-0.23619
84,-0.2799
85,-0.32188
86,-0.36191
87,-0.40003
88,-0.43672
89,-0.47178000000000003
90,-0.5042800000000001
91,-0.53379
92,-0.56003
93,-0.58381
94,-0.6037399999999999
95,-0.6199
96,-0.63266
97,-0.64346
98,-0.6521600000000001
99,-0.6582899999999999
100,-0.66204
101,-0.6641100000000001
102,-0.66602
103,-0.6663899999999999
104,-0.66543
105,-0.6634399999999999
106,-0.66261
107,-0.66177
108,-0.6600199999999999
109,-0.65705
110,-0.65368
111,-0.6509999999999999
112,-0.6471
113,-0.64182
114,-0.6353
115,-0.6308600000000001
116,-0.62627
117,-0.62078
118,-0.61392
119,-0.60721
120,-0.60117
121,-0.59359
122,-0.5838300000000001
123,-0.57187
124,-0.56147
125,-0.54965
126,-0.5357
127,-0.519
128,-0.5018600000000001
129,-0.48403
130,-0.46341000000000004
131,-0.43896999999999997
132,-0.41088
133,-0.38195999999999997
134,-0.34942
135,-0.31232
136,-0.26989
137,-0.22487
138,-0.1762
139,-0.12247000000000001
140,-0.062938
141,0.0013769
142,0.06826
143,0.13918
144,0.21422
145,0.29317
146,0.37232
147,0.45288
148,0.5353100000000001
149,0.62003
150,0.70577
151,0.79169
152,0.87933
153,0.96929
154,1.0617
155,1.1543
156,1.2483
157,1.3439
158,1.4409999999999998
159,1.538
160,1.6343
161,1.7298
162,1.8239
163,1.9158
164,2.0041
165,2.0887
166,2.1691
167,2.2444
168,2.3133
169,2.3755
170,2.4301
171,2.4765
172,2.5136
173,2.5409
174,2.5583
175,2.5655
176,2.5622
177,2.5478
178,2.5232
179,2.4891
180,2.4464
181,2.3965
182,2.3417
183,2.2849
184,2.2284
185,2.174
186,2.1224
187,2.0749
188,2.0307
189,1.9878
190,1.9432
191,1.8948
192,1.84
193,1.7756
194,1.6984
195,1.6061
196,1.4988
197,1.3754
198,1.2361
199,1.0812
200,0.91495
201,0.7411800000000001
202,0.56379
203,0.3865
204,0.21461
205,0.054136000000000004
206,-0.09156399999999999
207,-0.22021
208,-0.3321
209,-0.42372
210,-0.49613
211,-0.55178
212,-0.59483
213,-0.62661
214,-0.6487
215,-0.66442
216,-0.67694
217,-0.68929
218,-0.69917
219,-0.70772
220,-0.71595
221,-0.72593
222,-0.73501
223,-0.7423
224,-0.74845
225,-0.7547
226,-0.7611899999999999
227,-0.76535
228,-0.76782
229,-0.76941
230,-0.77217
231,-0.7733399999999999
232,-0.7729199999999999
233,-0.77172
234,-0.7712600000000001
235,-0.7709
236,-0.76905
237,-0.76626
238,-0.76313
239,-0.76137
240,-0.7581
241,-0.75376
242,-0.74922
243,-0.74608
244,-0.7437
245,-0.74165
246,-0.74058
247,-0.7411
248,-0.74356
249,-0.74634
250,-0.74926
251,-0.75232
252,-0.7559100000000001
253,-0.75964
254,-0.76357
255,-0.76798
256,-0.7731600000000001
257,-0.77909
258,-0.7854
259,-0.7920699999999999
260,-0.79928
261,-0.80752
262,-0.81705
263,-0.8282700000000001
264,-0.8413299999999999
265,-0.8559
266,-0.8709600000000001
267,-0.88505
268,-0.89679
269,-0.9051899999999999
