time,value
0,2.852
1,2.6181
2,2.1922
3,1.8241
4,1.4575
5,1.2575
6,0.8982600000000001
7,0.5515800000000001
8,0.26598
9,-0.050891000000000006
10,-0.032664
11,-0.24661
12,-0.38473
13,-0.40166
14,-0.48755
15,-0.5293800000000001
16,-0.5193300000000001
17,-0.37006
18,-0.23586999999999997
19,-0.12179000000000001
20,-0.20257
21,-0.15063
22,-0.12039000000000001
23,-0.07126
24,-0.047888
25,0.023737
26,-0.097287
27,0.0054535
28,-0.070333
29,0.037868
30,0.16091
31,0.09767200000000001
32,0.10870999999999999
33,0.044467
34,0.051739
35,0.18295999999999998
36,0.15019000000000002
37,0.15912
38,0.11320999999999999
39,0.025106
40,-0.09426
41,-0.19404000000000002
42,-0.3401
43,-0.56975
44,-0.63088
45,-0.77027
46,-1.0226
47,-1.2594
48,-1.4782
49,-1.7443
50,-1.9661
51,-2.2645
52,-2.4919
53,-2.1222
54,-1.7524
55,-1.324
56,-0.9468799999999999
57,-0.56924
58,-0.13092
59,0.24774000000000002
60,0.62665
61,1.0773
62,1.4397
63,1.7967
64,1.6142
65,1.2279
66,0.8503
67,0.41423000000000004
68,0.037868
69,-0.33791
70,-0.7650100000000001
71,-1.1393
72,-1.5124
73,-1.9364
74,-2.3065
75,-2.2001
76,-1.7641
77,-1.4201
78,-1.0559
79,-0.6527
80,-0.34593
81,-0.21966999999999998
82,-0.073348
83,0.025106
84,0.080065
85,0.08729400000000001
86,0.038324000000000004
87,0.021911
88,0.038324000000000004
89,-0.027829000000000003
90,0.051739
91,0.045604
92,0.068977
93,0.21952
94,0.20249
95,0.29922
96,0.23012
97,0.28612
98,0.36261
99,0.3611
100,0.22019
101,0.16247
102,0.12376
103,0.044467
104,0.0015611
105,0.13005
106,0.13587
107,0.025106
108,0.051739
109,0.12937
110,0.11208
111,0.023737
112,-0.0094431
113,-0.062919
114,0.14102
115,0.16804000000000002
116,0.09632
117,0.2078
118,0.22703
119,0.3652
120,0.44927
121,0.67807
122,1.0212
123,1.3681
124,1.6662
125,2.0189
126,2.4404
127,2.8048
