time,value
0,-0.16205
1,0.33233
2,0.25958000000000003
3,-0.1301
4,-0.03681
5,0.50757
6,-0.35539
7,0.13957
8,-0.67853
9,-0.14196
10,0.012429
11,-0.24297
12,-0.0017256
13,-0.16375
14,-0.15947
15,-0.14123
16,-0.59543
17,-0.12739
18,0.13469
19,-0.064801
20,-1.0395
21,0.023163999999999997
22,-0.28391
23,0.15074
24,0.22757
25,0.48696999999999996
26,-0.72812
27,0.47576999999999997
28,-0.30086999999999997
29,0.37874
30,-0.31306
31,0.19573
32,0.090395
33,0.10173
34,0.06763999999999999
35,0.34356
36,-0.24859
37,0.39152
38,-0.12643
39,0.011967
40,-0.60731
41,0.24422
42,-0.17402
43,-0.13842000000000002
44,-0.14085
45,0.081631
46,-0.17675
47,0.50921
48,-0.016262000000000002
49,0.017075
50,0.55693
51,0.15306
52,0.45353999999999994
53,0.11907999999999999
54,0.10832
55,0.10114
56,0.035299000000000004
57,0.18322
58,-0.2142
59,-0.33371
60,-0.9503
61,0.16756
62,0.046826
63,-0.15819
64,0.020824000000000002
65,-0.2111
66,-0.5789300000000001
67,-0.055421000000000005
68,1.8194
69,1.8194
70,1.8194
71,1.8194
72,1.8194
73,1.8194
74,1.8194
75,1.8194
76,1.8194
77,-1.7199
78,-1.7199
79,-1.7199
80,-1.7199
81,-1.7199
82,-1.7199
83,-1.7199
84,-1.7199
85,0.006801899999999999
86,-0.39779000000000003
87,0.11748
88,0.46412
89,-0.39357
90,-0.73275
91,0.14363
92,0.21011999999999997
93,-0.4123
94,-0.36103
95,0.53071
96,0.23367
97,-0.59964
98,0.12282
99,0.32343
100,-0.22925
101,-0.27008000000000004
102,1.8194
103,1.8194
104,1.8194
105,1.8194
106,1.8194
107,1.8194
108,1.8194
109,1.8194
110,1.8194
111,1.8194
112,-1.7199
113,-1.7199
114,-1.7199
115,-1.7199
116,-1.7199
117,-1.7199
118,-1.7199
119,-1.7199
120,-1.7199
121,-1.7199
122,-0.35893
123,0.6591
124,-0.38449
125,0.19175999999999999
126,0.41016
127,-0.21645999999999999
