time,value
0,-0.65574
1,0.5818
2,0.020773
3,0.16524
4,-0.21239
5,0.21791999999999997
6,0.26263000000000003
7,0.30149000000000004
8,-0.46413999999999994
9,-0.28908
10,-0.23337
11,-0.19327
12,0.06966900000000001
13,1.0369
14,0.060663999999999996
15,-0.08678
16,-0.18567999999999998
17,-0.1912
18,-0.15919
19,0.77147
20,0.011590000000000001
21,0.49563999999999997
22,-0.38637
23,-0.24914
24,-0.4562
25,-0.017352
26,-0.0065382
27,-0.042778
28,-0.53175
29,0.73535
30,-0.70418
31,-0.43051000000000006
32,0.44966000000000006
33,0.21015999999999999
34,-0.07954299999999999
35,0.26753000000000005
36,0.31916
37,-0.17743
38,-0.50321
39,-0.22738000000000003
40,-0.5217
41,-0.12603
42,-0.5572600000000001
43,0.25177
44,0.11137000000000001
45,0.8855799999999999
46,-0.013055
47,-0.43388000000000004
48,-0.58225
49,-0.23381999999999997
50,-0.22795
51,0.36524
52,-0.43665
53,-0.0023407
54,0.10243
55,0.53104
56,-0.12404000000000001
57,0.31376
58,-0.50285
59,-0.40936999999999996
60,-0.2427
61,0.37371
62,-0.050025
63,-0.28191
64,-0.39454
65,0.40685
66,0.43058
67,-0.45283
68,-0.082315
69,-0.035025
70,-0.15075
71,0.49257
72,0.40023000000000003
73,-0.29146
74,-0.23758
75,0.34201
76,-0.018336
77,0.26108000000000003
78,0.39679000000000003
79,0.055837
80,-0.17704
81,0.46626999999999996
82,-0.29104
83,0.00034092
84,0.5774100000000001
85,0.007459899999999999
86,-0.059354
87,-0.28133
88,-0.060916
89,-0.14459
90,0.42373999999999995
91,0.01945
92,1.8232
93,1.8232
94,1.8232
95,1.8232
96,1.8232
97,1.8232
98,1.8232
99,1.8232
100,-1.8421
101,-1.8421
102,-1.8421
103,-1.8421
104,-1.8421
105,-1.8421
106,-1.8421
107,-1.8421
108,0.5340199999999999
109,1.8232
110,1.8232
111,1.8232
112,1.8232
113,1.8232
114,1.8232
115,1.8232
116,1.8232
117,1.8232
118,-1.8421
119,-1.8421
120,-1.8421
121,-1.8421
122,-1.8421
123,-1.8421
124,-1.8421
125,-1.8421
126,-1.8421
127,0.50147
