time,value
0,0.57518
1,0.57518
2,0.57518
3,0.57518
4,0.57518
5,0.57518
6,0.57518
7,0.57518
8,0.57518
9,0.57518
10,0.57518
11,0.57518
12,0.57518
13,0.57518
14,0.57518
15,0.57518
16,0.57518
17,0.57518
18,0.57518
19,0.57518
20,0.57518
21,0.57518
22,0.57518
23,0.57518
24,0.57518
25,0.57518
26,0.57518
27,0.57518
28,0.57518
29,0.57518
30,0.57518
31,0.57518
32,0.57518
33,0.57518
34,0.57518
35,0.57518
36,0.57518
37,0.57518
38,0.57518
39,0.57518
40,0.57518
41,0.57518
42,0.57518
43,0.57518
44,0.57518
45,0.57518
46,0.57518
47,0.57518
48,0.57518
49,0.57518
50,0.57518
51,0.57518
52,0.57518
53,0.57518
54,0.57518
55,0.57518
56,0.57518
57,0.57518
58,0.57518
59,0.57518
60,0.57518
61,0.57518
62,0.57518
63,0.57518
64,0.57518
65,0.57518
66,0.57518
67,0.57518
68,0.57518
69,0.57518
70,0.57518
71,0.57518
72,0.57518
73,0.57518
74,0.57518
75,0.57518
76,0.57518
77,0.57518
78,0.57518
79,0.57518
80,0.57518
81,0.57518
82,0.57518
83,0.57518
84,0.57518
85,0.57518
86,0.57518
87,0.57518
88,0.57518
89,0.57518
90,0.57518
91,0.57518
92,0.57518
93,0.57518
94,0.57518
95,0.57518
96,0.57518
97,0.57518
98,0.57518
99,0.57518
100,0.57518
101,0.57518
102,0.57518
103,0.57518
104,0.57518
105,0.57518
106,0.57518
107,0.57518
108,0.57518
109,0.57518
110,0.57518
111,0.57518
112,0.57518
113,0.57518
114,0.57518
115,0.57518
116,0.57518
117,0.57518
118,0.57518
119,0.57518
120,0.57518
121,0.57518
122,0.57518
123,0.57518
124,0.57518
125,0.57518
126,0.57518
127,0.57518
128,0.57518
129,0.57518
130,0.57518
131,0.57518
132,0.57518
133,0.57518
134,0.57518
135,0.57518
136,0.57518
137,0.57518
138,0.5553899999999999
139,0.53345
140,0.49751000000000006
141,0.45531000000000005
142,0.4131
143,0.37089
144,0.32868
145,0.28647
146,0.24425999999999998
147,0.20205
148,0.15984
149,0.11763
150,0.075422
151,0.048194
152,0.029622000000000002
153,0.012953000000000001
154,-0.0011169
155,-0.015187
156,-0.029256
157,-0.043325999999999996
158,-0.057396
159,-0.071466
160,-0.085536
161,-0.099605
162,-0.11367000000000001
163,-0.12774000000000002
164,-0.14181
165,-0.15588
166,-0.16995
167,-0.18402000000000002
168,-0.19809000000000002
169,-0.21216
170,-0.22623000000000001
171,-0.2403
172,-0.25437
173,-0.26844
174,-0.28251
175,-0.29449000000000003
176,-0.30180999999999997
177,-0.3084
178,-0.3084
179,-0.3084
180,-0.3084
181,-0.3084
182,-0.3084
183,-0.3084
184,-0.3084
185,-0.3084
186,-0.3084
187,-0.3084
188,-0.30364
189,-0.19109
190,-0.078528
191,0.057413
192,0.19810999999999998
193,0.33881
194,0.47951000000000005
195,0.6202
196,0.7609
197,0.9016
198,1.0423
199,1.183
200,1.3087
201,1.4342
202,1.4734
203,1.4875
204,1.5015
205,1.5156
206,1.5297
207,1.5437
208,1.5578
209,1.5719
210,1.5859
211,1.6
212,1.6141
213,1.5926
214,1.5571
215,1.4897
216,1.3912
217,1.2927
218,1.1942
219,1.0958
220,0.9972700000000001
221,0.8987799999999999
222,0.8003
223,0.70181
224,0.60332
225,0.50483
226,0.40152
227,0.29234
228,0.18235
229,0.06979500000000001
230,-0.042763
231,-0.15532
232,-0.26788
233,-0.38044
234,-0.493
235,-0.60555
236,-0.71811
237,-0.82934
238,-0.93852
239,-1.0406
240,-1.1109
241,-1.1813
242,-1.2516
243,-1.3219999999999998
244,-1.3923
245,-1.4627
246,-1.5330000000000001
247,-1.6034
248,-1.6737
249,-1.7441
250,-1.8130000000000002
251,-1.8721
252,-1.9312
253,-1.9748
254,-2.017
255,-2.0592
256,-2.1014
257,-2.1437
258,-2.1859
259,-2.2281
260,-2.2703
261,-2.3125
262,-2.3547
263,-2.3969
264,-2.4043
265,-2.406
266,-2.3975
267,-2.3834
268,-2.3693
269,-2.3553
270,-2.3412
271,-2.3271
272,-2.3131
273,-2.299
274,-2.2849
275,-2.269
276,-2.2527
277,-2.2044
278,-2.1341
279,-2.0637
280,-1.9934
281,-1.923
282,-1.8527
283,-1.7823
284,-1.712
285,-1.6416
286,-1.5713
287,-1.501
288,-1.4306
289,-1.3603
290,-1.2899
291,-1.2196
292,-1.1492
293,-1.0789
294,-1.0085
295,-0.93816
296,-0.8678100000000001
297,-0.7974600000000001
298,-0.72712
299,-0.65677
300,-0.5864199999999999
301,-0.5211899999999999
302,-0.46998
303,-0.41927
304,-0.37706
305,-0.33485
306,-0.29264
307,-0.25043000000000004
308,-0.20822
309,-0.16601
310,-0.12380999999999999
311,-0.081596
312,-0.039387
313,0.0028224
314,0.045032
