time,value
0,-0.60742
1,-0.60742
2,-0.60742
3,-0.60742
4,-0.60742
5,-0.60742
6,-0.60742
7,-0.60742
8,-0.60742
9,-0.60742
10,-0.60742
11,-0.60742
12,-0.60742
13,-0.60742
14,-0.60742
15,-0.60742
16,-0.60742
17,-0.60742
18,-0.60742
19,-0.60742
20,-0.60742
21,-0.60742
22,-0.61032
23,-0.62349
24,-0.64695
25,-0.6855399999999999
26,-0.71886
27,-0.74851
28,-0.7551899999999999
29,-0.7551899999999999
30,-0.7551899999999999
31,-0.7551899999999999
32,-0.7551899999999999
33,-0.7551899999999999
34,-0.7551899999999999
35,-0.7551899999999999
36,-0.7551899999999999
37,-0.7551899999999999
38,-0.7551899999999999
39,-0.7551899999999999
40,-0.7551899999999999
41,-0.7551899999999999
42,-0.7551899999999999
43,-0.7551899999999999
44,-0.7551899999999999
45,-0.7551899999999999
46,-0.77987
47,-0.8194
48,-0.8737799999999999
49,-0.9316700000000001
50,-0.97856
51,-1.0239
52,-1.0625
53,-1.1011
54,-1.1397
55,-1.1783
56,-1.2169
57,-1.2504
58,-1.2822
59,-1.3025
60,-1.3213
61,-1.3359
62,-1.3463
63,-1.3463
64,-1.3475
65,-1.3501
66,-1.3637
67,-1.383
68,-1.4023
69,-1.4216
70,-1.4409
71,-1.4602
72,-1.4795
73,-1.4917
74,-1.4934
75,-1.494
76,-1.494
77,-1.506
78,-1.5215
79,-1.5406
80,-1.5599
81,-1.5792
82,-1.5985
83,-1.6178
84,-1.6314
85,-1.6394
86,-1.6418
87,-1.6418
88,-1.6418
89,-1.6418
90,-1.6418
91,-1.6418
92,-1.6418
93,-1.6418
94,-1.6418
95,-1.6357
96,-1.6258
97,-1.5929
98,-1.5543
99,-1.5157
100,-1.4771
101,-1.4385
102,-1.4002
103,-1.3623
104,-1.3345
105,-1.3152
106,-1.2959
107,-1.2766
108,-1.2247
109,-1.1693
110,-1.1114
111,-1.0536
112,-0.99567
113,-0.93779
114,-0.8799
115,-0.8220200000000001
116,-0.76413
117,-0.70625
118,-0.64863
119,-0.60228
120,-0.5575399999999999
121,-0.51895
122,-0.48406000000000005
123,-0.45488
124,-0.43141999999999997
125,-0.41212
126,-0.39283
127,-0.37353000000000003
128,-0.35424
129,-0.33425
130,-0.30978
131,-0.28081999999999996
132,-0.24223000000000003
133,-0.20057
134,-0.15586
135,-0.08881499999999999
136,-0.011636
137,0.06554299999999999
138,0.14272
139,0.2199
140,0.29708
141,0.37426
142,0.44369
143,0.50275
144,0.56109
145,0.61897
146,0.65133
147,0.6772100000000001
148,0.69662
149,0.71825
150,0.75142
151,0.78651
152,0.8251
153,0.86369
154,0.90228
155,0.9408700000000001
156,0.97946
157,1.018
158,1.0566
159,1.0952
160,1.1338
161,1.1724
162,1.2109999999999999
163,1.2496
164,1.2882
165,1.3268
166,1.3654
167,1.4039
168,1.4392
169,1.4712
170,1.4905
171,1.5098
172,1.5291
173,1.5484
174,1.5677
175,1.587
176,1.6063
177,1.6083
178,1.6091
179,1.6091
180,1.6142
181,1.6304
182,1.6482
183,1.6675
184,1.6868
185,1.7061
186,1.7254
187,1.744
188,1.7513
189,1.7569
190,1.7569
191,1.7486
192,1.7288
193,1.6976
194,1.659
195,1.6204
196,1.5818
197,1.5432
198,1.5056
199,1.4726
200,1.4444
201,1.4251
202,1.4039
203,1.3811
204,1.347
205,1.3084
206,1.2711
207,1.2355
208,1.2162
209,1.1969
210,1.1776
211,1.1583
212,1.139
213,1.1197
214,1.1004
215,1.0675
216,1.0317
217,0.99311
218,0.95452
219,0.9159299999999999
220,0.87734
221,0.83875
222,0.80016
223,0.76157
224,0.7229800000000001
225,0.6843899999999999
226,0.65527
227,0.62792
228,0.6086199999999999
229,0.58933
230,0.57003
231,0.55074
232,0.5314399999999999
233,0.51215
234,0.49285
235,0.47356000000000004
236,0.45408999999999994
237,0.43103
238,0.40438
239,0.36579
240,0.32788
241,0.29094000000000003
242,0.26461
243,0.24531
244,0.22601999999999997
245,0.20672
246,0.18742999999999999
247,0.16814
248,0.14884
249,0.12955
250,0.11025
251,0.090956
252,0.071661
253,0.062739
254,0.058033
255,0.057543
256,0.057543
257,0.057543
258,0.057543
259,0.057543
260,0.052875
261,0.042522000000000004
262,0.026483
263,0.0071882000000000005
264,0.0014130999999999998
265,-0.0012825999999999998
266,0.018012
267,0.03614
268,0.049317
269,0.057543
270,0.057543
271,0.059786
272,0.063786
273,0.079191
274,0.098486
275,0.11953
276,0.14272
277,0.18131
278,0.2199
279,0.25849
280,0.27857
281,0.27904
282,0.2792
283,0.2792
284,0.29369
285,0.31073
286,0.33002
287,0.34263000000000005
288,0.33228
289,0.31826
290,0.29896
291,0.2948
292,0.30091999999999997
293,0.31732
294,0.33660999999999996
295,0.35591
296,0.3752
297,0.3945
298,0.41379
299,0.43309
300,0.45238
301,0.47168000000000004
302,0.49545
303,0.5211
304,0.5582699999999999
305,0.5968600000000001
306,0.63545
307,0.67404
308,0.71262
309,0.75121
310,0.7898
311,0.82839
312,0.86698
313,0.9055700000000001
314,0.94416
