time,value
0,-0.10505999999999999
1,-0.043877
2,0.017301
3,0.13965999999999998
4,0.28241
5,0.42516000000000004
6,0.56791
7,0.79223
8,1.0166
9,1.2613
10,1.5876
11,1.8119
12,1.9342
13,2.1178
14,2.2605
15,2.3625
16,2.546
17,2.4237
18,2.4237
19,2.5052
20,2.3829
21,2.2401
22,2.1178
23,1.975
24,1.7099
25,1.4652
26,1.2613
27,1.0369
28,0.79223
29,0.54752
30,0.34359
31,0.16005
32,0.098873
33,0.017301
34,-0.023485
35,-0.06427000000000001
36,-0.18663
37,-0.28859
38,-0.43133999999999995
39,-0.5333100000000001
40,-0.47213
41,-0.41095
42,-0.47213
43,-0.45174
44,-0.43133999999999995
45,-0.43133999999999995
46,-0.28859
47,-0.5537
48,-0.61488
49,-0.67606
50,-0.73724
51,-0.7168399999999999
52,-0.73724
53,-0.75763
54,-0.69645
55,-0.67606
56,-0.7168399999999999
57,-0.73724
58,-0.7780199999999999
59,-0.75763
60,-0.8799899999999999
61,-0.98195
62,-0.8799899999999999
63,-0.63527
64,-0.59449
65,-0.75763
66,-0.9207700000000001
67,-0.75763
68,-0.79842
69,-0.7168399999999999
70,-0.67606
71,-0.61488
72,-0.61488
73,-0.75763
74,-0.8799899999999999
75,-0.9207700000000001
76,-0.9207700000000001
77,-0.9207700000000001
78,-0.90038
79,-0.9207700000000001
80,-1.0635
81,-0.9615600000000001
82,-0.9411700000000001
83,-0.9615600000000001
84,-1.0023
85,-1.0227
86,-1.0431
87,-1.0023
88,-0.9411700000000001
89,-0.8799899999999999
90,-0.85959
91,-0.8799899999999999
92,-0.90038
93,-0.90038
94,-0.90038
95,-0.85959
96,-0.7168399999999999
97,-0.65567
98,-0.7168399999999999
99,-0.69645
100,-0.61488
101,-0.5333100000000001
102,-0.49251999999999996
103,-0.45174
104,-0.43133999999999995
105,-0.47213
106,-0.47213
107,-0.45174
108,-0.47213
109,-0.47213
110,-0.59449
111,-0.73724
112,-0.8799899999999999
113,-1.0227
114,-0.9207700000000001
115,-0.9615600000000001
116,-0.8392
117,-0.9615600000000001
118,-0.75763
119,-0.61488
120,-0.49251999999999996
121,-0.24781
122,-0.023485
123,0.13965999999999998
124,0.28241
125,0.38437
126,0.52712
127,0.50673
128,0.6087
129,0.6902699999999999
130,0.73105
131,0.73105
132,0.6087
133,0.38437
134,0.3028
135,0.3028
136,0.26202
137,0.26202
138,0.3028
139,0.20084000000000002
140,0.16005
141,0.13965999999999998
142,0.16005
143,0.13965999999999998
144,0.20084000000000002
145,0.28241
146,0.3028
147,0.24161999999999997
148,0.28241
149,0.42516000000000004
150,0.56791
151,0.7106600000000001
152,0.9349799999999999
153,1.0573
154,1.2001
155,1.4244
156,1.6487
157,1.8527
158,2.0974
159,2.4033
160,2.7703
161,2.9743
162,3.0355
163,2.75
164,2.6888
165,2.648
166,2.4441
167,2.2809
168,2.0974
169,1.9546
170,1.8731
171,1.7099
172,1.3836
173,1.1593
174,0.81263
175,0.46595
176,0.36398
177,0.38437
178,0.34359
179,0.22123
180,0.07848
181,-0.043877
182,-0.12545
183,-0.20701999999999998
184,-0.28859
185,-0.2682
186,-0.30899
187,-0.39056
188,-0.41095
189,-0.41095
190,-0.47213
191,-0.59449
192,-0.63527
193,-0.63527
194,-0.73724
195,-0.79842
196,-0.81881
197,-0.7780199999999999
198,-0.67606
199,-0.59449
200,-0.65567
201,-0.75763
202,-0.69645
203,-0.65567
204,-0.63527
205,-0.63527
206,-0.63527
207,-0.65567
208,-0.73724
209,-0.81881
210,-0.81881
211,-0.85959
212,-0.90038
213,-0.8392
214,-0.8392
215,-0.85959
216,-0.8799899999999999
217,-0.9615600000000001
218,-0.8392
219,-0.79842
220,-0.90038
221,-0.9411700000000001
222,-0.90038
223,-0.81881
224,-0.79842
225,-0.8392
226,-0.85959
227,-0.8799899999999999
228,-0.85959
229,-0.7780199999999999
230,-0.7168399999999999
231,-0.73724
232,-0.73724
233,-0.69645
234,-0.63527
235,-0.59449
236,-0.63527
237,-0.61488
238,-0.45174
239,-0.49251999999999996
240,-0.90038
241,-0.65567
242,-0.63527
243,-0.49251999999999996
244,-0.45174
245,-0.41095
246,-0.43133999999999995
247,-0.5129100000000001
248,-0.5129100000000001
249,-0.49251999999999996
250,-0.5333100000000001
251,-0.5537
252,-0.67606
253,-0.79842
254,-0.9207700000000001
255,-1.0023
256,-1.0227
257,-0.9615600000000001
258,-0.79842
259,-0.57409
260,-0.41095
261,-0.22741
262,0.037694
263,0.18044000000000002
264,0.3232
265,0.50673
266,0.6290899999999999
267,0.6290899999999999
268,0.6087
269,0.6087
270,0.5883
271,0.50673
272,0.48633999999999994
273,0.44555
274,0.34359
275,0.3028
276,0.3028
277,0.3232
278,0.3028
279,0.13965999999999998
280,0.18044000000000002
281,0.098873
282,0.16005
283,0.11927
284,0.058087
285,-0.043877
286,-0.06427000000000001
287,-0.023485
288,-0.043877
289,-0.084663
290,-0.043877
291,0.017301
292,0.098873
293,0.16005
294,0.26202
295,0.40476999999999996
296,0.6087
297,0.85341
298,1.0981
299,1.3632
300,1.5672
301,1.7303
302,1.9342
303,2.0974
304,2.2197
305,2.1993
306,2.0974
307,1.9546
308,1.7507
309,1.5672
310,1.3632
311,1.0777
312,0.79223
313,0.50673
314,0.36398
315,0.28241
316,0.11927
317,-0.023485
318,-0.14584
319,-0.22741
320,-0.32938
321,-0.45174
322,-0.5333100000000001
323,-0.65567
324,-0.73724
325,-0.8392
326,-0.8799899999999999
327,-0.9207700000000001
328,-0.98195
329,-1.0431
330,-1.0839
331,-1.0839
332,-1.0431
333,-1.0431
334,-1.0431
335,-1.0635
336,-1.0431
337,-1.0431
338,-1.0431
339,-1.0023
340,-1.0023
341,-1.0635
342,-1.0635
