time,value
0,-1.7755
1,-1.7755
2,-1.7755
3,-1.7755
4,-1.7755
5,-1.7755
6,-1.7755
7,-1.7755
8,-1.7755
9,-1.7755
10,1.8235
11,1.8235
12,1.8235
13,1.8235
14,1.8235
15,1.8235
16,1.8235
17,1.8235
18,1.8235
19,1.8235
20,-0.23638
21,-0.10131
22,0.37585999999999997
23,0.28653
24,0.2372
25,0.10282000000000001
26,-0.31979
27,-0.30054000000000003
28,0.13013
29,-0.30776
30,0.24666
31,-0.044248
32,0.25447
33,0.22971
34,0.017891999999999998
35,-0.5777
36,0.32844
37,0.63307
38,0.016372
39,0.32689
40,0.028673
41,0.58821
42,0.1216
43,-0.18456
44,-0.7965899999999999
45,-0.17685
46,0.016867
47,0.34031
48,-0.50361
49,0.13689
50,0.60615
51,0.58217
52,-0.50227
53,0.19272999999999998
54,-0.045083
55,-0.15434
56,-0.19643
57,0.37455
58,-0.27155
59,0.0581
60,0.72311
61,-0.10101
62,-0.1124
63,-0.2806
64,-0.18359
65,1.8235
66,1.8235
67,1.8235
68,1.8235
69,1.8235
70,1.8235
71,1.8235
72,1.8235
73,-1.7755
74,-1.7755
75,-1.7755
76,-1.7755
77,-1.7755
78,-1.7755
79,-1.7755
80,-1.7755
81,-0.4107
82,0.082997
83,-0.13316
84,0.52327
85,-0.17521
86,-0.048035
87,0.18807000000000001
88,0.28317
89,0.24336
90,-0.099126
91,-0.40078
92,0.044944
93,-0.55894
94,-0.41798
95,0.0018505
96,-0.096814
97,0.09073400000000001
98,0.23265
99,-0.17587
100,0.1937
101,0.051288
102,0.11350999999999999
103,0.39029
104,-0.52615
105,0.32983
106,-0.15053
107,0.007351399999999999
108,-0.35647
109,-0.192
110,0.33760999999999997
111,0.27108000000000004
112,-0.65208
113,0.045962
114,-0.43814
115,0.3534
116,-0.14326
117,-0.38123
118,-0.35695
119,0.2333
120,0.5957600000000001
121,-0.41525
122,-0.39859
123,0.008170199999999999
124,0.60955
125,-0.0010856
126,-0.4124
127,-0.71345
