time,value
0,0.41823999999999995
1,-0.083901
2,-0.1694
3,-0.091177
4,-0.32849
5,0.086835
6,0.37643000000000004
7,-0.33948
8,-0.47397
9,-0.25501999999999997
10,0.13225
11,0.32011
12,0.29709
13,0.099874
14,-0.10717
15,-0.051789999999999996
16,0.14014000000000001
17,-0.27686
18,0.31693000000000005
19,-0.12235
20,0.16233
21,0.154
22,0.34079
23,-0.56709
24,-0.19825
25,-0.050048
26,0.43396999999999997
27,-0.29186999999999996
28,0.18815
29,-0.36396999999999996
30,0.06428099999999999
31,-0.67899
32,-0.014697
33,-0.1881
34,-0.11062999999999999
35,-0.5868
36,0.12111
37,0.67304
38,0.20335
39,0.033821
40,0.10138
41,-0.13617
42,0.39329000000000003
43,0.55518
44,-0.29341999999999996
45,-0.4154
46,0.027757
47,-0.014903
48,0.038861
49,0.34858
50,0.016961
51,0.12974000000000002
52,-0.21436
53,-1.5107
54,-1.5107
55,-1.5107
56,-1.5107
57,-1.5107
58,-1.5107
59,-1.5107
60,-1.5107
61,-1.5107
62,-1.5107
63,1.536
64,1.536
65,1.536
66,1.536
67,1.536
68,1.536
69,1.536
70,1.536
71,1.536
72,1.536
73,0.2292
74,-1.5107
75,-1.5107
76,-1.5107
77,-1.5107
78,-1.5107
79,-1.5107
80,-1.5107
81,-1.5107
82,-1.5107
83,-1.5107
84,-1.5107
85,-1.5107
86,-1.5107
87,-1.5107
88,-1.5107
89,-1.5107
90,1.536
91,1.536
92,1.536
93,1.536
94,1.536
95,1.536
96,1.536
97,1.536
98,1.536
99,1.536
100,1.536
101,1.536
102,1.536
103,1.536
104,1.536
105,1.536
106,0.11778
107,0.03307
108,0.16984000000000002
109,0.50813
110,0.16563
111,0.08925
112,-0.17531
113,-0.52956
114,-0.21388000000000001
115,0.6237699999999999
116,-0.32418
117,0.085721
118,-0.25683
119,-0.084489
120,-0.059673000000000004
121,-0.17931
122,-0.021361
123,-0.18009
124,0.026695
125,-0.09619
126,-0.52966
127,0.19244
