time,value
0,0.90075
1,0.90075
2,0.90075
3,0.90075
4,0.90075
5,0.90075
6,0.90075
7,0.90075
8,0.90075
9,0.90075
10,0.90075
11,0.90075
12,0.90075
13,0.90075
14,0.90075
15,0.90075
16,0.90075
17,0.90075
18,0.90075
19,0.90075
20,0.90075
21,0.90075
22,0.90075
23,0.90075
24,0.90075
25,0.90075
26,0.90075
27,0.90075
28,0.90075
29,0.90075
30,0.90075
31,0.90075
32,0.90075
33,0.90075
34,0.90075
35,0.90075
36,0.90075
37,0.90075
38,0.90075
39,0.90075
40,0.90075
41,0.90075
42,0.90075
43,0.90075
44,0.90075
45,0.90075
46,0.90075
47,0.90075
48,0.90075
49,0.90075
50,0.90075
51,0.90075
52,0.90075
53,0.90075
54,0.90075
55,0.91984
56,0.9404
57,0.9616899999999999
58,0.98298
59,1.0057
60,1.0303
61,1.0623
62,1.0942
63,1.1261
64,1.1581
65,1.1778
66,1.1889
67,1.1889
68,1.1889
69,1.1889
70,1.1889
71,1.2044
72,1.2234
73,1.2447
74,1.266
75,1.2867
76,1.3064
77,1.317
78,1.3277
79,1.3383
80,1.3489
81,1.3567
82,1.3618
83,1.3618
84,1.3618
85,1.3618
86,1.3618
87,1.3618
88,1.3618
89,1.3618
90,1.3618
91,1.3618
92,1.3618
93,1.3411
94,1.3199
95,1.2987
96,1.2774
97,1.2561
98,1.2348
99,1.2135
100,1.1922
101,1.1709
102,1.1496
103,1.1283
104,1.107
105,1.0858
106,1.0645
107,1.0432
108,1.0219
109,1.0091
110,0.99766
111,0.9870200000000001
112,0.9763700000000001
113,0.96483
114,0.95178
115,0.9304899999999999
116,0.9092
117,0.8879100000000001
118,0.8666200000000001
119,0.8486799999999999
120,0.8335799999999999
121,0.82294
122,0.81229
123,0.80165
124,0.7909999999999999
125,0.77356
126,0.75393
127,0.73264
128,0.71135
129,0.68988
130,0.66803
131,0.6361
132,0.60416
133,0.57223
134,0.5402899999999999
135,0.5128
136,0.49037
137,0.47973000000000005
138,0.46908
139,0.45843999999999996
140,0.44778999999999997
141,0.4424
142,0.43972
143,0.43972
144,0.43972
145,0.43972
146,0.43972
147,0.43044
148,0.42026
149,0.40962
150,0.39897
151,0.38581
152,0.36887
153,0.33694
154,0.305
155,0.27307
156,0.24113
157,0.21308000000000002
158,0.18791
159,0.16662000000000002
160,0.14533
161,0.12404000000000001
162,0.10275
163,0.066456
164,0.026396
165,-0.016184
166,-0.058764
167,-0.10041
168,-0.14025
169,-0.16154000000000002
170,-0.18283
171,-0.20412
172,-0.22541
173,-0.25476
174,-0.29222
175,-0.34545
176,-0.39866999999999997
177,-0.4519
178,-0.50512
179,-0.54656
180,-0.58294
181,-0.61487
182,-0.64681
183,-0.67874
184,-0.71068
185,-0.73253
186,-0.7539899999999999
187,-0.77528
188,-0.79657
189,-0.8195100000000001
190,-0.8446600000000001
191,-0.87659
192,-0.90853
193,-0.9404600000000001
194,-0.9724
195,-1.0088
196,-1.048
197,-1.0906
198,-1.1332
199,-1.1758
200,-1.2183
201,-1.2527
202,-1.2855
203,-1.3174
204,-1.3494
205,-1.3797
206,-1.4074
207,-1.4180000000000001
208,-1.4287
209,-1.4393
210,-1.45
211,-1.4574
212,-1.4621
213,-1.4621
214,-1.4621
215,-1.4621
216,-1.4621
217,-1.4686
218,-1.4775
219,-1.4881
220,-1.4988
221,-1.5093
222,-1.5197
223,-1.5197
224,-1.5197
225,-1.5197
226,-1.5197
227,-1.5176
228,-1.5131
229,-1.5024
230,-1.4918
231,-1.4812
232,-1.4705
233,-1.4649
234,-1.4621
235,-1.4621
236,-1.4621
237,-1.4621
238,-1.4621
239,-1.444
240,-1.4239
241,-1.4026
242,-1.3813
243,-1.3612
244,-1.3428
245,-1.3321
246,-1.3215
247,-1.3108
248,-1.3002
249,-1.2858
250,-1.2686
251,-1.2473
252,-1.226
253,-1.2048
254,-1.1835
255,-1.1622
256,-1.1409
257,-1.1196
258,-1.0983
259,-1.0774
260,-1.0572
261,-1.0465
262,-1.0359
263,-1.0253
264,-1.0146
265,-1.004
266,-0.9933200000000001
267,-0.9826799999999999
268,-0.97203
269,-0.96139
270,-0.9507399999999999
271,-0.9401
272,-0.92945
273,-0.91881
274,-0.9081600000000001
275,-0.8975200000000001
276,-0.88687
277,-0.8860399999999999
278,-0.8857700000000001
279,-0.8857700000000001
280,-0.8857700000000001
281,-0.8857700000000001
282,-0.8857700000000001
283,-0.8857700000000001
284,-0.8857700000000001
285,-0.8857700000000001
286,-0.8857700000000001
287,-0.87725
288,-0.86301
289,-0.84172
290,-0.8204299999999999
291,-0.79914
292,-0.77785
293,-0.75656
294,-0.73527
295,-0.7139800000000001
296,-0.6926899999999999
297,-0.6714
298,-0.6501100000000001
299,-0.6288199999999999
300,-0.60753
301,-0.58624
302,-0.56495
303,-0.54366
304,-0.52237
305,-0.50108
306,-0.47978999999999994
307,-0.4585
308,-0.43721000000000004
309,-0.41591999999999996
310,-0.39463000000000004
311,-0.37334
312,-0.35205
313,-0.33076
314,-0.30946999999999997
