time,value
0,-0.15922
1,-0.15922
2,-0.15922
3,-0.15922
4,-0.15922
5,-0.15922
6,-0.15922
7,-0.15922
8,-0.15922
9,-0.14956
10,-0.13718
11,-0.12208
12,-0.11532
13,-0.11532
14,-0.11532
15,-0.11532
16,-0.11532
17,-0.11532
18,-0.11532
19,-0.11532
20,-0.11532
21,-0.11532
22,-0.11532
23,-0.11532
24,-0.11532
25,-0.11532
26,-0.11532
27,-0.11532
28,-0.11532
29,-0.11532
30,-0.11532
31,-0.11532
32,-0.09250599999999999
33,-0.066594
34,-0.037513
35,-0.027516000000000002
36,-0.027020999999999996
37,-0.0032530000000000002
38,0.040992
39,0.11789000000000001
40,0.18178
41,0.23981
42,0.28595
43,0.33208000000000004
44,0.37822
45,0.42341999999999996
46,0.46547
47,0.49622
48,0.52698
49,0.55774
50,0.5885
51,0.61656
52,0.63837
53,0.65589
54,0.67127
55,0.68665
56,0.70203
57,0.71741
58,0.7327899999999999
59,0.74817
60,0.76355
61,0.77893
62,0.7943100000000001
63,0.81757
64,0.84352
65,0.87428
66,0.8973700000000001
67,0.91499
68,0.9320799999999999
69,0.9534100000000001
70,0.9841700000000001
71,1.0111
72,1.0359
73,1.0513
74,1.0705
75,1.0954
76,1.1248
77,1.161
78,1.2321
79,1.3031
80,1.3741
81,1.4103
82,1.4424
83,1.4791
84,1.5213
85,1.5675
86,1.5949
87,1.6178
88,1.6332
89,1.6297
90,1.6174
91,1.5998
92,1.5767
93,1.5459
94,1.5056
95,1.4598
96,1.3983
97,1.3419
98,1.2905
99,1.2437
100,1.1975
101,1.1514
102,1.1022
103,1.051
104,0.97495
105,0.9023399999999999
106,0.8383
107,0.78676
108,0.73933
109,0.6724899999999999
110,0.60136
111,0.52447
112,0.45886000000000005
113,0.39683
114,0.33810999999999997
115,0.28595
116,0.23981
117,0.18773
118,0.13271
119,0.07119199999999999
120,0.0031434
121,-0.069
122,-0.1458
123,-0.2127
124,-0.26052
125,-0.30932
126,-0.35943
127,-0.42095
128,-0.47635
129,-0.52389
130,-0.55797
131,-0.58873
132,-0.61949
133,-0.65025
134,-0.6809999999999999
135,-0.7117600000000001
136,-0.74252
137,-0.77328
138,-0.80404
139,-0.8348
140,-0.86556
141,-0.8963200000000001
142,-0.9270799999999999
143,-0.9498
144,-0.9690200000000001
145,-0.9844
146,-1.0065
147,-1.037
148,-1.0648
149,-1.0898
150,-1.1052
151,-1.1247
152,-1.1476
153,-1.1776
154,-1.2053
155,-1.2246
156,-1.2414
157,-1.2568
158,-1.2721
159,-1.2875
160,-1.3029
161,-1.3183
162,-1.3337
163,-1.349
164,-1.3644
165,-1.3798
166,-1.3952
167,-1.4105
168,-1.4256
169,-1.4324
170,-1.4324
171,-1.4362
172,-1.4435
173,-1.4589
174,-1.4691
175,-1.4763
176,-1.4763
177,-1.4808
178,-1.4928
179,-1.5069
180,-1.5202
181,-1.5202
182,-1.5181
183,-1.5136
184,-1.5
185,-1.4847
186,-1.4693
187,-1.4539
188,-1.4385
189,-1.4345
190,-1.4321
191,-1.4313
192,-1.4209
193,-1.4056
194,-1.395
195,-1.3885
196,-1.3885
197,-1.3885
198,-1.3885
199,-1.3885
200,-1.3885
201,-1.3885
202,-1.3875
203,-1.3834
204,-1.368
205,-1.3556
206,-1.3452
207,-1.3446
208,-1.3419
209,-1.3329
210,-1.3197
211,-1.3043
212,-1.2889
213,-1.273
214,-1.2562
215,-1.2288
216,-1.198
217,-1.1673
218,-1.1365
219,-1.1058
220,-1.075
221,-1.0442
222,-1.0135
223,-0.99039
224,-0.97277
225,-0.9572799999999999
226,-0.9419
227,-0.9265200000000001
228,-0.91114
229,-0.89576
230,-0.8803799999999999
231,-0.86114
232,-0.83625
233,-0.80684
234,-0.7742600000000001
235,-0.7300800000000001
236,-0.6859
237,-0.64172
238,-0.60914
239,-0.57704
240,-0.5404
241,-0.49813
242,-0.45198999999999995
243,-0.37771
244,-0.2968
245,-0.20452
246,-0.12165999999999999
247,-0.042943
248,0.038429000000000005
249,0.13075
250,0.23840999999999998
251,0.34126
252,0.44142
253,0.53369
254,0.62083
255,0.70304
256,0.7806
257,0.8508
258,0.89974
259,0.94394
260,0.98505
261,1.0012
262,1.0188
263,1.0406
264,1.0686
265,1.0987
266,1.1191
267,1.1374
268,1.1528
269,1.1682
270,1.1835
271,1.1989
272,1.2143
273,1.2297
274,1.2391
275,1.2456
276,1.2456
277,1.2326
278,1.2113
279,1.1808
280,1.16
281,1.1583
282,1.1556
283,1.1517
284,1.1363
285,1.127
286,1.1256
287,1.1377
288,1.1513
289,1.1557
290,1.1578
291,1.1578
292,1.1578
293,1.1587
294,1.1621
295,1.1729
296,1.1883
297,1.1893
298,1.1844
299,1.169
300,1.1456
301,1.1187
302,1.0879
303,1.0572
304,1.0264
305,0.9897299999999999
306,0.9475399999999999
307,0.88602
308,0.8286
309,0.77463
310,0.7277600000000001
311,0.68783
312,0.66462
313,0.6463800000000001
314,0.631
