time,value
0,-0.92805
1,-0.9204700000000001
2,-0.91051
3,-0.89849
4,-0.8849799999999999
5,-0.8708100000000001
6,-0.85564
7,-0.8391200000000001
8,-0.82083
9,-0.80084
10,-0.7792100000000001
11,-0.75548
12,-0.7296199999999999
13,-0.70182
14,-0.6733100000000001
15,-0.6443399999999999
16,-0.6149600000000001
17,-0.58532
18,-0.5556800000000001
19,-0.52751
20,-0.5004
21,-0.4744
22,-0.44948
23,-0.42605
24,-0.40499
25,-0.3856
26,-0.36764
27,-0.35104
28,-0.33678
29,-0.32555
30,-0.31719
31,-0.31175
32,-0.30913
33,-0.31017
34,-0.31389
35,-0.31905
36,-0.32435
37,-0.32871
38,-0.33231
39,-0.3339
40,-0.33302
41,-0.32945
42,-0.32355
43,-0.31601999999999997
44,-0.30651999999999996
45,-0.29491999999999996
46,-0.28099
47,-0.26487
48,-0.24647
49,-0.22546999999999998
50,-0.20182999999999998
51,-0.17569
52,-0.14774
53,-0.11825999999999999
54,-0.087681
55,-0.056472
56,-0.025106
57,0.0058124
58,0.036253
59,0.066051
60,0.095105
61,0.12322000000000001
62,0.15037999999999999
63,0.17695999999999998
64,0.20315999999999998
65,0.22924
66,0.25511999999999996
67,0.28124
68,0.30775
69,0.33433
70,0.36027
71,0.38401
72,0.40488
73,0.42148
74,0.43241999999999997
75,0.43643999999999994
76,0.43263999999999997
77,0.42158999999999996
78,0.40373000000000003
79,0.37985
80,0.35065999999999997
81,0.31733
82,0.28119
83,0.24276
84,0.20215999999999998
85,0.15869
86,0.11248
87,0.06336900000000001
88,0.011072
89,-0.044476
90,-0.10371
91,-0.16502999999999998
92,-0.22735
93,-0.28944000000000003
94,-0.35022
95,-0.40875
96,-0.46305
97,-0.5120899999999999
98,-0.5552
99,-0.5926600000000001
100,-0.62426
101,-0.6495
102,-0.66875
103,-0.68261
104,-0.69302
105,-0.69985
106,-0.70344
107,-0.70443
108,-0.7036
109,-0.70322
110,-0.7017399999999999
111,-0.6992
112,-0.6956600000000001
113,-0.69204
114,-0.6895899999999999
115,-0.6866399999999999
116,-0.6831
117,-0.67896
118,-0.67609
119,-0.67428
120,-0.67195
121,-0.66862
122,-0.66405
123,-0.66123
124,-0.65809
125,-0.6537
126,-0.64771
127,-0.64043
128,-0.63522
129,-0.6288100000000001
130,-0.62045
131,-0.60952
132,-0.59717
133,-0.58503
134,-0.57055
135,-0.55316
136,-0.53249
137,-0.51095
138,-0.48843000000000003
139,-0.46325
140,-0.43483
141,-0.4029
142,-0.3708
143,-0.33678
144,-0.29998
145,-0.25974
146,-0.21599000000000002
147,-0.17094
148,-0.12188
149,-0.067639
150,-0.0071952
151,0.058809
152,0.12918
153,0.20521
154,0.28701
155,0.37445
156,0.46543999999999996
157,0.55962
158,0.65752
159,0.7590600000000001
160,0.8638899999999999
161,0.96921
162,1.0753
163,1.1815
164,1.2872
165,1.3919
166,1.4943
167,1.5951
168,1.6948
169,1.7934
170,1.8907
171,1.986
172,2.0784
173,2.1663
174,2.2478
175,2.3204
176,2.3825
177,2.4328
178,2.4705
179,2.4956
180,2.5084
181,2.5108
182,2.5041
183,2.49
184,2.4698
185,2.4447
186,2.4159
187,2.3837
188,2.3483
189,2.3096
190,2.2677
191,2.2225
192,2.1737
193,2.121
194,2.0637
195,2.0022
196,1.9369
197,1.8685
198,1.7977
199,1.7256
200,1.6542
201,1.5839
202,1.5143
203,1.4428
204,1.3665
205,1.2819
206,1.1843
207,1.0695
208,0.9341799999999999
209,0.7790100000000001
210,0.6068399999999999
211,0.42208
212,0.231
213,0.039984
214,-0.14127
215,-0.30593000000000004
216,-0.44942
217,-0.56948
218,-0.6664899999999999
219,-0.73924
220,-0.79087
221,-0.8256600000000001
222,-0.8488100000000001
223,-0.86364
224,-0.87146
225,-0.8752
226,-0.8771399999999999
227,-0.88
228,-0.88229
229,-0.88325
230,-0.88351
231,-0.8837
232,-0.88584
233,-0.8868
234,-0.8866200000000001
235,-0.8859799999999999
236,-0.88587
237,-0.88723
238,-0.88738
239,-0.88681
240,-0.8862399999999999
241,-0.8870899999999999
242,-0.8887700000000001
243,-0.88971
244,-0.89035
245,-0.8912
246,-0.8936700000000001
247,-0.89595
248,-0.8974
249,-0.89854
250,-0.89991
251,-0.90307
252,-0.9057
253,-0.9079299999999999
254,-0.91014
255,-0.9128799999999999
256,-0.91635
257,-0.9188799999999999
258,-0.9205700000000001
259,-0.92176
260,-0.9231
261,-0.9244
262,-0.92527
263,-0.9259799999999999
264,-0.92684
265,-0.92815
266,-0.9296200000000001
267,-0.9310200000000001
268,-0.93224
269,-0.9331299999999999
