time,value
0,-0.36046999999999996
1,0.15316
2,0.75267
3,1.3923
4,2.0187
5,2.5769
6,3.0165
7,3.2978
8,3.3967
9,3.3071
10,3.0421
11,2.6317
12,2.1194
13,1.5571
14,0.9983200000000001
15,0.4925
16,0.079481
17,-0.21444000000000002
18,-0.37856
19,-0.41775
20,-0.35053
21,-0.20551999999999998
22,-0.016966
23,0.18009
24,0.35429
25,0.48149
26,0.54701
27,0.54637
28,0.48453
29,0.37398000000000003
30,0.23201
31,0.077623
32,-0.071384
33,-0.20075
34,-0.30128
35,-0.36941
36,-0.40683
37,-0.41935
38,-0.41535
39,-0.40396
40,-0.39346
41,-0.39002
42,-0.39703
43,-0.41489
44,-0.44148000000000004
45,-0.47289
46,-0.50442
47,-0.5315300000000001
48,-0.55071
49,-0.55999
50,-0.55912
51,-0.54943
52,-0.5334300000000001
53,-0.51425
54,-0.49505
55,-0.47841000000000006
56,-0.46606000000000003
57,-0.45869
58,-0.456
59,-0.45697
60,-0.46016999999999997
61,-0.4641
62,-0.46758
63,-0.46983
64,-0.47068000000000004
65,-0.47043
66,-0.4698
67,-0.46963
68,-0.47071999999999997
69,-0.47361000000000003
70,-0.4785
71,-0.48512
72,-0.49293000000000003
73,-0.5011399999999999
74,-0.50895
75,-0.51565
76,-0.52078
77,-0.52428
78,-0.52622
79,-0.5270100000000001
80,-0.5272100000000001
81,-0.52742
82,-0.5281399999999999
83,-0.52964
84,-0.53241
85,-0.53676
86,-0.54059
87,-0.5434899999999999
88,-0.54523
89,-0.54569
90,-0.54492
91,-0.5431199999999999
92,-0.54084
93,-0.5382399999999999
94,-0.53554
95,-0.53318
96,-0.53156
97,-0.53095
98,-0.5314800000000001
