time,value
0,0.64417
1,0.64417
2,0.64417
3,0.64417
4,0.64417
5,0.64417
6,0.64417
7,0.64417
8,0.64417
9,0.64417
10,0.64417
11,0.64417
12,0.64417
13,0.64417
14,0.64417
15,0.64417
16,0.64751
17,0.6805100000000001
18,0.71102
19,0.7222
20,0.73197
21,0.73197
22,0.72995
23,0.71541
24,0.6973
25,0.65927
26,0.62087
27,0.5806100000000001
28,0.534
29,0.45793999999999996
30,0.39484
31,0.38700999999999997
32,0.38643
33,0.41439
34,0.44451999999999997
35,0.48255
36,0.52058
37,0.55861
38,0.59664
39,0.63466
40,0.67184
41,0.70652
42,0.73197
43,0.73197
44,0.73197
45,0.73197
46,0.72351
47,0.69443
48,0.66263
49,0.6246
50,0.57595
51,0.50437
52,0.42228999999999994
53,0.31883
54,0.22321
55,0.14268
56,0.050253
57,-0.063833
58,-0.20461
59,-0.39139
60,-0.54505
61,-0.6446
62,-0.73493
63,-0.81098
64,-0.87979
65,-0.93795
66,-0.9828
67,-1.0091
68,-1.0265
69,-1.0321
70,-1.052
71,-1.09
72,-1.1281
73,-1.1661
74,-1.2188
75,-1.2881
76,-1.3365
77,-1.3622
78,-1.3753
79,-1.3753
80,-1.3753
81,-1.3753
82,-1.3753
83,-1.3753
84,-1.375
85,-1.3744
86,-1.3535
87,-1.3154
88,-1.2955
89,-1.2899
90,-1.2875
91,-1.2875
92,-1.2875
93,-1.2875
94,-1.2875
95,-1.2875
96,-1.2875
97,-1.2875
98,-1.2885
99,-1.2902
100,-1.3149
101,-1.3529
102,-1.4126
103,-1.4842
104,-1.5226
105,-1.5439
106,-1.5651
107,-1.5864
108,-1.6088
109,-1.6317
110,-1.6387
111,-1.6387
112,-1.6406
113,-1.6434
114,-1.6717
115,-1.7097
116,-1.6968
117,-1.6655
118,-1.6505
119,-1.641
120,-1.6217
121,-1.5993
122,-1.5648
123,-1.5268
124,-1.4888
125,-1.4508
126,-1.4159
127,-1.3817
128,-1.3753
129,-1.3753
130,-1.3458
131,-1.31
132,-1.2971
133,-1.2887
134,-1.2875
135,-1.2875
136,-1.2725
137,-1.2552
138,-1.2296
139,-1.2027
140,-1.1952
141,-1.1902
142,-1.1555
143,-1.1175
144,-1.0794
145,-1.0414
146,-1.0318
147,-1.0245
148,-1.0241
149,-1.0241
150,-1.0241
151,-1.0241
152,-1.0241
153,-1.0241
154,-1.0241
155,-1.0241
156,-1.0241
157,-1.0241
158,-1.0241
159,-1.0237
160,-0.9917799999999999
161,-0.9597399999999999
162,-0.92171
163,-0.88294
164,-0.82534
165,-0.76612
166,-0.67665
167,-0.58607
168,-0.47925
169,-0.3746
170,-0.29631
171,-0.21147
172,-0.059359
173,0.086073
174,0.1722
175,0.25716999999999995
176,0.33323
177,0.40667
178,0.46203
179,0.51499
180,0.55301
181,0.58977
182,0.61941
183,0.6438
184,0.64157
185,0.6329899999999999
186,0.59496
187,0.5634100000000001
188,0.5594899999999999
189,0.5677
190,0.62362
191,0.68388
192,0.75994
193,0.83599
194,0.91205
195,0.99039
196,1.0759999999999998
197,1.1679
198,1.2786
199,1.3801
200,1.4562
201,1.5224
202,1.5633
203,1.5948
204,1.6038
205,1.6030000000000002
206,1.5801
207,1.5471
208,1.4923
209,1.4340000000000002
210,1.3685
211,1.3094
212,1.2624
213,1.1917
214,1.0776
215,1.0436
216,1.1476
217,1.2209999999999999
218,1.2445
219,1.2588
220,1.2588
221,1.2588
222,1.2588
223,1.2588
224,1.2588
225,1.2612
226,1.2668
227,1.2867
228,1.3248
229,1.3457
230,1.3463
231,1.3172
232,1.2546
233,1.1976
234,1.1467
235,1.1022
236,1.0642
237,1.0196
238,0.96873
239,0.91175
240,0.84911
241,0.8200700000000001
242,0.82063
243,0.8415799999999999
244,0.87961
245,0.91764
246,0.95567
247,1.0087
248,1.073
249,1.1324
250,1.1883
251,1.2336
252,1.2716
253,1.3002
254,1.3225
255,1.3074
256,1.2694
257,1.2314
258,1.1933
259,1.1337
260,1.0621
261,1.0056
262,0.95693
263,0.88689
264,0.8063600000000001
265,0.72353
266,0.63965
267,0.5814600000000001
268,0.5344800000000001
269,0.46688999999999997
270,0.39083
271,0.31478
272,0.23872
273,0.18812
274,0.14673
275,0.10786
276,0.069827
277,0.014808000000000002
278,-0.04559
279,-0.10555999999999999
280,-0.1654
281,-0.20022
282,-0.22818000000000002
283,-0.23697
284,-0.24088
285,-0.27243
286,-0.31046
287,-0.31904
288,-0.32128
289,-0.32164
290,-0.32164
291,-0.30172
292,-0.27824
293,-0.24223000000000003
294,-0.2042
295,-0.15641
296,-0.10719000000000001
297,-0.034193
298,0.041864
299,0.11792000000000001
300,0.19397999999999999
301,0.2364
302,0.27554
303,0.31366
304,0.35169
305,0.36667
306,0.38009
307,0.41581
308,0.45271999999999996
309,0.51545
310,0.57921
311,0.6118899999999999
312,0.64377
313,0.64417
314,0.64417
