time,value
0,-0.46374
1,-0.46374
2,-0.46374
3,-0.46374
4,-0.46374
5,-0.46374
6,-0.46374
7,-0.46374
8,-0.46374
9,-0.46374
10,-0.46374
11,-0.46374
12,-0.46374
13,-0.46374
14,-0.46374
15,-0.46374
16,-0.46374
17,-0.46374
18,-0.46374
19,-0.46374
20,-0.46374
21,-0.46374
22,-0.46374
23,-0.46374
24,-0.46374
25,-0.46374
26,-0.46374
27,-0.46374
28,-0.46374
29,-0.46374
30,-0.46374
31,-0.46374
32,-0.46374
33,-0.46374
34,-0.46374
35,-0.46374
36,-0.46374
37,-0.46374
38,-0.46374
39,-0.46374
40,-0.46374
41,-0.46374
42,-0.46374
43,-0.44678
44,-0.41401000000000004
45,-0.24664
46,-0.23709000000000002
47,0.22032
48,0.4538
49,0.15134
50,0.18557
51,0.18557
52,0.18557
53,0.18557
54,0.18557
55,0.18557
56,0.18557
57,0.18557
58,0.18557
59,0.18557
60,0.20169
61,0.22326
62,0.31665
63,0.41003999999999996
64,0.50343
65,0.5898800000000001
66,0.66362
67,0.70005
68,0.70005
69,0.70005
70,0.70005
71,0.70005
72,0.70005
73,0.70005
74,0.70005
75,0.70005
76,0.70005
77,0.70005
78,0.70005
79,0.70005
80,0.70005
81,0.70005
82,0.70901
83,0.7213
84,0.76395
85,0.8106399999999999
86,0.85734
87,0.9015700000000001
88,0.93516
89,0.9572799999999999
90,0.9572799999999999
91,0.9572799999999999
92,0.9572799999999999
93,0.9572799999999999
94,0.9572799999999999
95,0.9572799999999999
96,0.9572799999999999
97,0.9572799999999999
98,0.9572799999999999
99,0.9572799999999999
100,0.9572799999999999
101,0.9572799999999999
102,0.9572799999999999
103,0.9572799999999999
104,0.93091
105,0.8842200000000001
106,0.7705
107,0.63041
108,0.49032
109,0.35024
110,0.21015
111,0.24489
112,-0.45555
113,-0.21011999999999997
114,-0.3502
115,-0.48199
116,-0.60488
117,-0.70902
118,-0.80242
119,-0.89581
120,-0.9892
121,-1.0656
122,-1.1383
123,-1.185
124,-1.2317
125,-1.2784
126,-1.31
127,-1.319
128,-1.2972
129,-1.2505
130,-1.2038
131,-1.1571
132,-1.0936
133,-1.0269
134,-0.9334899999999999
135,-0.8401
136,-0.74671
137,-0.64681
138,-0.53294
139,-0.40673000000000004
140,-0.26664
141,-0.12655
142,-0.037741000000000004
143,0.15362
144,0.29370999999999997
145,0.4338
146,0.57389
147,0.71397
148,0.8488600000000001
149,0.96683
150,1.0753
151,1.1686
152,1.262
153,1.3554
154,1.4011
155,1.4256
156,1.3898
157,1.3431
158,1.2964
159,1.2352
160,1.0935
161,0.9237
162,0.69022
163,0.45674
164,0.22326
165,-0.15653
166,-0.2437
167,-0.47718
168,-0.7106600000000001
169,-0.94414
170,-1.1758
171,-1.3839
172,-1.5872
173,-1.774
174,-1.9608
175,-2.1476
176,-2.2927
177,-2.4009
178,-2.4671
179,-2.5138
180,-2.5605
181,-2.6072
182,-2.6004
183,-2.5875
184,-2.5408
185,-2.4941
186,-2.4474
187,-2.3883
188,-2.3137
189,-2.2279
190,-2.1345
191,-2.0411
192,-1.9477
193,-1.8543
194,-1.7609
195,-1.6675
196,-1.5741
197,-1.4807
198,-1.3766
199,-1.2537
200,-1.1219
201,-0.98183
202,-0.8417399999999999
203,-0.70165
204,-0.5615600000000001
205,-0.42148
206,-0.28139000000000003
207,-0.1413
208,-0.11147
209,0.13009
210,0.23904
211,0.34123000000000003
212,0.43462
213,0.5280100000000001
214,0.6214
215,0.66743
216,0.69692
217,0.70005
218,0.70005
219,0.70005
220,0.6803899999999999
221,0.58208
222,0.46903
223,0.32894
224,0.18885
225,0.13839
226,-0.4514
227,-0.1757
228,-0.27155999999999997
229,-0.36495
230,-0.45833999999999997
231,-0.5476800000000001
232,-0.6066699999999999
233,-0.66233
234,-0.70902
235,-0.75572
236,-0.80242
237,-0.82881
238,-0.8402700000000001
239,-0.8433799999999999
240,-0.8433799999999999
241,-0.8433799999999999
242,-0.84083
243,-0.76874
244,-0.6926399999999999
245,-0.59925
246,-0.5058600000000001
247,-0.41246000000000005
248,-0.33729000000000003
249,-0.28076
250,-0.2306
251,-0.1839
252,-0.1372
253,-0.090508
254,0.081605
255,0.15198
256,0.29207
257,0.43216000000000004
258,0.57225
259,0.69648
260,0.79806
261,0.89502
262,0.9884200000000001
263,1.0818
264,1.1752
265,1.2686
266,1.3619999999999999
267,1.4554
268,1.5488
269,1.6422
270,1.7223
271,1.7756
272,1.8257
273,1.8724
274,1.9191
275,1.9658
276,1.9479
277,1.9126
278,1.8666
279,1.8199
280,1.7732
281,1.7162
282,1.6277
283,1.5373
284,1.4439
285,1.3505
286,1.2571
287,1.1938
288,1.143
289,1.0957
290,1.0490000000000002
291,1.0023
292,0.9484899999999999
293,0.8583799999999999
294,0.76722
295,0.67383
296,0.58044
297,0.48705
298,0.39366
299,0.30025999999999997
300,0.20686999999999997
301,0.46198999999999996
302,-0.18247
303,-0.43483
304,-0.45121000000000006
305,-0.46374
306,-0.46374
307,-0.46374
308,-0.46374
309,-0.12132000000000001
310,-0.21306999999999998
311,-0.30596
312,-0.39936
313,-0.49275
314,-0.58614
315,-1.2063
316,-1.2063
317,-1.2063
318,-1.2063
319,-1.2063
320,-1.2063
321,-1.2063
322,-1.2063
323,-1.2063
324,-1.2063
325,-1.2063
326,-1.2063
327,-1.2063
328,-1.2063
329,-1.2063
330,-1.2063
331,-1.2063
332,-1.2063
333,-1.2063
334,-1.2063
335,-1.2063
336,-1.2063
337,-1.2063
338,-1.2063
339,-1.2063
340,-1.2063
341,-1.2063
342,-1.2063
343,-1.2063
344,-1.2063
345,-1.2063
346,-1.2063
347,-1.2063
348,-1.2063
349,-1.2063
350,-1.2063
351,-1.2063
352,-1.2063
353,-1.2063
354,-1.2063
355,-1.2063
356,-1.2063
357,-1.2063
358,-1.2052
359,-1.2031
360,-1.1923
361,-1.1773
362,-1.1623
363,-1.1472
364,-1.1345
365,-1.1235
366,-1.1235
367,-1.1235
368,-1.1235
369,-1.1235
370,-1.1235
371,-1.1235
372,-1.1235
373,-1.1235
374,-1.1235
375,-1.1209
376,-1.1175
377,-1.1024
378,-1.0874
379,-1.0724
380,-1.0585
381,-1.0466
382,-1.0408
383,-1.0408
384,-1.0408
385,-1.0408
386,-1.0408
387,-1.0408
388,-1.0408
389,-1.0408
390,-1.0408
391,-1.0388
392,-1.0314
393,-1.0144
394,-0.98434
395,-0.95429
396,-0.92424
397,-0.89707
398,-0.87097
399,-0.85465
400,-0.83962
401,-0.8245899999999999
402,-0.80957
403,-0.7945399999999999
404,-0.77952
405,-0.76449
406,-0.74947
407,-0.73444
408,-0.72232
409,-0.71177
410,-0.7096600000000001
411,-0.7096600000000001
412,-0.7096600000000001
413,-0.7096600000000001
414,-0.7096600000000001
415,-0.7096600000000001
416,-0.7096600000000001
417,-0.7096600000000001
418,-0.7096600000000001
419,-0.7096600000000001
420,-0.7096600000000001
421,-0.7096600000000001
422,-0.7096600000000001
423,-0.7096600000000001
424,-0.7096600000000001
425,-0.7096600000000001
426,-0.7096600000000001
427,-0.7096600000000001
428,-0.7096600000000001
429,-0.7096600000000001
430,-0.7096600000000001
431,-0.7096600000000001
432,-0.7096600000000001
433,-0.7096600000000001
434,-0.7096600000000001
435,-0.7096600000000001
436,-0.7042
437,-0.6975399999999999
438,-0.6825100000000001
439,-0.6674800000000001
440,-0.65246
441,-0.63743
442,-0.62241
443,-0.60738
444,-0.59236
445,-0.57733
446,-0.5623100000000001
447,-0.54185
448,-0.5203899999999999
449,-0.49033999999999994
450,-0.46029
451,-0.43023999999999996
452,-0.40228
453,-0.37882
454,-0.35933000000000004
455,-0.3443
456,-0.32928
457,-0.31425
458,-0.2939
459,-0.27203
460,-0.24255
461,-0.2125
462,-0.18245
463,-0.15407
464,-0.13114
465,-0.11127000000000001
466,-0.096249
467,-0.081223
468,-0.4364
469,-0.38689
470,-0.34865999999999997
471,-0.34281999999999996
472,-0.34281999999999996
473,-0.34281999999999996
474,-0.33697
475,-0.29875
476,-0.24924000000000002
477,-0.17411
478,-0.098983
479,-0.023856
480,-0.13004000000000002
481,-0.15641
482,-0.059441999999999995
483,-0.13457
484,-0.2097
485,-0.27906
486,-0.27247
487,-0.25056
488,-0.17543
489,-0.1003
490,-0.025172999999999997
491,0.1837
492,0.12508
493,0.20021
494,0.27534000000000003
495,0.35047
496,0.42558999999999997
497,0.12982
498,0.15444000000000002
499,0.18449000000000002
500,0.21454
501,0.24459
502,0.27465
503,0.3047
504,0.33475
505,0.3648
506,0.39485
507,0.4249
508,0.46331000000000006
509,0.50293
510,0.54801
511,0.59308
512,0.6381600000000001
513,0.68324
514,0.72831
515,0.7733899999999999
516,0.81847
517,0.86354
518,0.9086200000000001
519,0.9456600000000001
520,0.9809899999999999
521,1.0112
522,1.0412
523,1.0713
524,1.1013
525,1.1314
526,1.1614
527,1.1915
528,1.2215
529,1.2516
530,1.274
531,1.2938
532,1.3093
533,1.3243
534,1.3394
535,1.3502
536,1.3441
537,1.3349
538,1.3198
539,1.3048
540,1.2898
541,1.2676
542,1.2418
543,1.2126
544,1.1825
545,1.1525
546,1.125
547,1.1171
548,1.1113
549,1.1113
550,1.1113
551,1.1113
552,1.1113
553,1.1113
554,1.1113
555,1.1113
556,1.1113
557,1.1122
558,1.1353
559,1.1598
560,1.1899
561,1.2199
562,1.25
563,1.2742
564,1.2924
565,1.3085
566,1.3235
567,1.3386
568,1.3536
569,1.3686
570,1.3836
571,1.3987
572,1.4137
573,1.4287
574,1.4386
575,1.4413
576,1.4424
577,1.4424
578,1.4424
579,1.4424
580,1.4424
581,1.4424
582,1.4424
583,1.4424
584,1.4424
585,1.4424
586,1.4424
587,1.4424
588,1.4424
589,1.4424
590,1.4424
591,1.432
592,1.4189
593,1.4039
594,1.3889
595,1.3739
596,1.3589
597,1.3438
598,1.3288
599,1.3138
600,1.2988
601,1.2837
602,1.2687
603,1.2537
604,1.2387
605,1.2236
606,1.2086
607,1.1936
608,1.1786
609,1.1635
610,1.1485
611,1.1335
612,1.1185
613,1.0857
614,1.0422
615,0.99746
616,0.9523799999999999
617,0.9073
618,0.8658100000000001
619,0.8642200000000001
620,0.8630200000000001
621,0.8630200000000001
622,0.8630200000000001
623,0.8630200000000001
624,0.84704
625,0.8175100000000001
626,0.78762
627,0.75757
628,0.72752
629,0.69747
630,-1.0107
631,-1.0107
632,-1.0107
633,-1.0107
634,-1.0107
635,-1.0107
636,-1.0107
637,-1.0107
638,-1.0107
639,-1.0107
640,-1.0107
641,-1.0107
642,-1.0107
643,-1.0107
644,-1.0107
645,-1.0107
646,-1.0107
647,-1.0107
648,-1.0107
649,-1.0107
650,-1.0107
651,-1.0107
652,-1.0107
653,-1.0107
654,-1.0107
655,-1.0107
656,-1.0107
657,-1.0107
658,-1.0107
659,-1.0107
660,-1.0107
661,-1.0107
662,-1.0107
663,-1.0107
664,-1.0107
665,-1.0107
666,-1.0107
667,-1.0107
668,-1.0107
669,-1.0107
670,-1.0107
671,-1.0107
672,-1.0107
673,-1.0107
674,-1.0107
675,-1.0107
676,-1.0107
677,-1.0107
678,-1.0107
679,-1.0107
680,-1.0107
681,-1.0107
682,-1.0107
683,-1.0107
684,-1.0107
685,-1.0107
686,-1.0107
687,-1.0107
688,-1.0107
689,-1.0107
690,-1.0107
691,-1.0107
692,-1.0107
693,-1.0107
694,-1.0107
695,-1.0107
696,-1.0107
697,-1.0107
698,-1.0107
699,-1.0107
700,-1.0107
701,-1.0107
702,-1.0107
703,-1.0107
704,-1.0107
705,-1.0107
706,-1.0107
707,-1.0107
708,-1.0107
709,-1.0107
710,-1.0107
711,-1.0107
712,-1.0093
713,-1.0073
714,-1.0006
715,-0.99326
716,-0.9859
717,-0.97854
718,-0.9711799999999999
719,-0.9638100000000001
720,-0.95645
721,-0.94909
722,-0.94173
723,-0.93437
724,-0.92701
725,-0.91964
726,-0.91228
727,-0.9049200000000001
728,-0.89756
729,-0.8902
730,-0.88284
731,-0.8754700000000001
732,-0.86811
733,-0.86075
734,-0.85062
735,-0.83835
736,-0.81904
737,-0.79695
738,-0.77487
739,-0.75278
740,-0.7307
741,-0.7086100000000001
742,-0.68653
743,-0.6644399999999999
744,-0.64236
745,-0.6228899999999999
746,-0.60623
747,-0.59548
748,-0.58812
749,-0.58075
750,-0.57339
751,-0.5687
752,-0.5646100000000001
753,-0.5646100000000001
754,-0.5646100000000001
755,-0.5646100000000001
756,-0.5658
757,-0.56877
758,-0.57417
759,-0.58153
760,-0.5888899999999999
761,-0.59625
762,-0.6036100000000001
763,-0.61098
764,-0.61834
765,-0.6257
766,-0.6330600000000001
767,-0.63734
768,-0.63502
769,-0.6268600000000001
770,-0.61214
771,-0.59741
772,-0.5826899999999999
773,-0.56797
774,-0.55325
775,-0.53852
776,-0.5238
777,-0.50908
778,-0.49435
779,-0.47963
780,-0.46491000000000005
781,-0.45018
782,-0.43546
783,-0.42073999999999995
784,-0.40601
785,-0.39129
786,-0.37656999999999996
787,-0.36184
788,-0.34712
789,-0.3324
790,-0.31767
791,-0.30295
792,-0.28823000000000004
793,-0.2735
794,-0.25878
795,-0.24169000000000002
796,-0.22309
797,-0.20182999999999998
798,-0.17974
799,-0.15766
800,-0.13585
801,-0.11777
802,-0.10044
803,-0.08572
804,-0.4604
805,-0.38678
806,-0.32411
807,-0.27115
808,-0.22921999999999998
809,-0.19241
810,-0.1556
811,-0.1188
812,-0.039869
813,0.14357
814,0.15436
815,0.26478
816,0.37521
817,0.49543999999999994
818,0.14665
819,0.17490999999999998
820,0.20435
821,0.2338
822,0.26324000000000003
823,0.29678000000000004
824,0.33092
825,0.36773
826,0.40453
827,0.44133999999999995
828,0.47645
829,0.50861
830,0.53937
831,0.56881
832,0.59826
833,0.62771
834,0.65715
835,0.6866
836,0.71605
837,0.74549
838,0.77494
839,0.8029999999999999
840,0.8275399999999999
841,0.85101
842,0.8730899999999999
843,0.89518
844,0.9172600000000001
845,0.9430799999999999
846,0.9702
847,0.9994
848,1.0288
849,1.0583
850,1.0867
851,1.111
852,1.1345
853,1.1566
854,1.1787
855,1.2007
856,1.2124
857,1.2186
858,1.2197
859,1.2197
860,1.2197
861,1.2204
862,1.2258
863,1.2317
864,1.2391
865,1.2465
866,1.2538
867,1.2644
868,1.2773
869,1.2915
870,1.3063
871,1.321
872,1.3357
873,1.3504
874,1.3652
875,1.3799
876,1.3946
877,1.4093
878,1.4240000000000002
879,1.4388
880,1.4535
881,1.4682
882,1.4829
883,1.4977
884,1.5011
885,1.5036
886,1.5036
887,1.5036
888,1.5036
889,1.5036
890,1.5036
891,1.5036
892,1.5036
893,1.5036
894,1.5036
895,1.4982
896,1.492
897,1.4846
898,1.4773
899,1.4699
900,1.4604
901,1.4468
902,1.4326
903,1.4178
904,1.4031
905,1.3884
906,1.3788
907,1.3705
908,1.3631
909,1.3557
910,1.3484
911,1.341
912,1.3336
913,1.3263
914,1.3189
915,1.3116
916,1.3042
917,1.2968
918,1.2895
919,1.2821
920,1.2748
921,1.2674
922,1.2612
923,1.2606
924,1.2603
925,1.2603
926,1.2603
927,1.2603
928,1.2646
929,1.2716
930,1.2789
931,1.2862
932,1.2936
933,1.3004
934,1.3006
935,1.3008
936,1.3008
937,1.3008
938,1.3008
939,1.3048
940,1.3119999999999998
941,1.3193
942,1.3267
943,1.334
944,1.3414
