time,value
0,-0.34026999999999996
1,-0.34026999999999996
2,-0.34026999999999996
3,-0.34026999999999996
4,-0.34026999999999996
5,-0.34026999999999996
6,-0.34026999999999996
7,-0.34026999999999996
8,-0.34026999999999996
9,-0.34026999999999996
10,-0.34026999999999996
11,-0.34026999999999996
12,-0.34026999999999996
13,-0.34026999999999996
14,-0.34026999999999996
15,-0.34026999999999996
16,-0.34026999999999996
17,-0.34026999999999996
18,-0.33943
19,-0.33463000000000004
20,-0.30189
21,-0.2623
22,-0.22271999999999997
23,-0.18314
24,-0.16135
25,-0.15195999999999998
26,-0.15195999999999998
27,-0.15195999999999998
28,-0.14781
29,-0.13397
30,-0.094385
31,-0.054804
32,-0.015222999999999999
33,0.021773
34,0.033168
35,0.036351999999999995
36,0.036351999999999995
37,0.036351999999999995
38,0.036351999999999995
39,0.036351999999999995
40,0.036351999999999995
41,0.036351999999999995
42,0.036351999999999995
43,0.036351999999999995
44,0.036351999999999995
45,0.036351999999999995
46,0.036351999999999995
47,0.036351999999999995
48,0.036351999999999995
49,0.036351999999999995
50,0.036351999999999995
51,0.036351999999999995
52,0.036351999999999995
53,0.036351999999999995
54,0.036351999999999995
55,0.036351999999999995
56,0.036351999999999995
57,0.043852999999999996
58,0.060341
59,0.086728
60,0.11312
61,0.1395
62,0.15889
63,0.16168
64,0.16189
65,0.16189
66,0.16292
67,0.16852
68,0.18028
69,0.19347999999999999
70,0.20667
71,0.21986
72,0.22426
73,0.22466
74,0.22466
75,0.22466
76,0.22091999999999998
77,0.21306999999999998
78,0.19987
79,0.18667999999999998
80,0.17339000000000002
81,0.15869
82,0.13230999999999998
83,0.10592
84,0.079532
85,0.053144000000000004
86,0.026757
87,0.00036965
88,-0.026018
89,-0.05240499999999999
90,-0.080538
91,-0.12117
92,-0.17395
93,-0.22671999999999998
94,-0.2795
95,-0.32916
96,-0.37385
97,-0.41343
98,-0.45301
99,-0.4921
100,-0.52988
101,-0.5573600000000001
102,-0.58375
103,-0.61014
104,-0.63652
105,-0.66291
106,-0.6893
107,-0.7156899999999999
108,-0.74207
109,-0.7667
110,-0.78725
111,-0.80045
112,-0.8136399999999999
113,-0.82683
114,-0.8381799999999999
115,-0.84178
116,-0.8424299999999999
117,-0.8424299999999999
118,-0.8426899999999999
119,-0.84609
120,-0.8564200000000001
121,-0.86961
122,-0.88281
123,-0.8959999999999999
124,-0.90302
125,-0.9052
126,-0.9052
127,-0.9052
128,-0.9052
129,-0.9052
130,-0.9052
131,-0.9052
132,-0.9052
133,-0.9052
134,-0.9052
135,-0.9052
136,-0.9052
137,-0.9052
138,-0.9096
139,-0.91879
140,-0.9319799999999999
141,-0.9451799999999999
142,-0.95837
143,-0.9715600000000001
144,-0.9847600000000001
145,-0.99795
146,-1.0111
147,-1.0243
148,-1.0375
149,-1.0507
150,-1.0639
151,-1.0771
152,-1.0903
153,-1.0933
154,-1.0935
155,-1.0935
156,-1.0935
157,-1.0979999999999999
158,-1.1067
159,-1.1199
160,-1.1331
161,-1.1458
162,-1.1531
163,-1.1399
164,-1.1267
165,-1.1135
166,-1.1016
167,-1.1032
168,-1.1131
169,-1.1263
170,-1.1395
171,-1.1503
172,-1.1467
173,-1.1335
174,-1.1203
175,-1.1071
176,-1.0939
177,-1.0807
178,-1.0675
179,-1.0543
180,-1.0411
181,-1.0279
182,-1.0147
183,-1.0015
184,-0.98836
185,-0.97516
186,-0.9619700000000001
187,-0.94878
188,-0.93558
189,-0.9223899999999999
190,-0.90702
191,-0.8868
192,-0.8604200000000001
193,-0.8340299999999999
194,-0.8076399999999999
195,-0.7812600000000001
196,-0.7548699999999999
197,-0.72848
198,-0.70209
199,-0.67571
200,-0.64932
201,-0.62293
202,-0.59654
203,-0.57016
204,-0.54377
205,-0.5173800000000001
206,-0.49099
207,-0.46461
208,-0.43822
209,-0.41694
210,-0.40304
211,-0.40304
212,-0.40304
213,-0.40304
214,-0.40194
215,-0.39055
216,-0.37785
217,-0.36466
218,-0.35146
219,-0.33826999999999996
220,-0.32506999999999997
221,-0.31188
222,-0.29869
223,-0.28549
224,-0.26623
225,-0.24070999999999998
226,-0.21433000000000002
227,-0.18794
228,-0.16385999999999998
229,-0.14356
230,-0.13037
231,-0.11717000000000001
232,-0.10397999999999999
233,-0.090787
234,-0.06590399999999999
235,-0.039611
236,-0.013224000000000001
237,0.013163999999999999
238,0.039550999999999996
239,0.065938
240,0.092326
241,0.11871
242,0.14590999999999998
243,0.18108
244,0.23385999999999998
245,0.28663
246,0.33941
247,0.39218000000000003
248,0.44496
249,0.49773
250,0.55051
251,0.60318
252,0.65455
253,0.6976399999999999
254,0.73722
255,0.7768
256,0.81638
257,0.8609100000000001
258,0.9099299999999999
259,0.9627100000000001
260,1.0155
261,1.0651
262,1.1078
263,1.121
264,1.1342
265,1.1474
266,1.1606
267,1.1829
268,1.2078
269,1.2342
270,1.2606
271,1.2843
272,1.3025
273,1.3157
274,1.3289
275,1.3421
276,1.3592
277,1.3825
278,1.4089
279,1.4353
280,1.4627
281,1.4929
282,1.5316
283,1.5712
284,1.6108
285,1.6504
286,1.7071
287,1.7703
288,1.8363
289,1.9023
290,1.962
291,2.0134
292,2.053
293,2.0926
294,2.1321
295,2.1695
296,2.1974
297,2.2241
298,2.2505
299,2.2764
300,2.2974
301,2.3129
302,2.3261
303,2.3392
304,2.3524
305,2.3953
306,2.4588
307,2.5248
308,2.5907
309,2.6657
310,2.7527
311,2.8582
312,2.9637
313,3.0693
314,3.1748
