time,value
0,-0.35155
1,-0.75144
2,-1.0998
3,-1.2459
4,-1.0651
5,-0.5000600000000001
6,0.41316
7,1.5441
8,2.6932
9,3.6385
10,4.1905
11,4.2404
12,3.7878
13,2.9401
14,1.8826
15,0.8310700000000001
16,-0.0233
17,-0.5576300000000001
18,-0.74046
19,-0.62847
20,-0.33988
21,-0.014204
22,0.22885
23,0.3196
24,0.24973
25,0.064162
26,-0.16187
27,-0.35159
28,-0.45143999999999995
29,-0.44496
30,-0.35257
31,-0.21953000000000003
32,-0.097437
33,-0.026310000000000004
34,-0.023101
35,-0.079515
36,-0.16855
37,-0.25635
38,-0.3146
39,-0.32921999999999996
40,-0.30296
41,-0.25181
42,-0.19759000000000002
43,-0.15955999999999998
44,-0.14832
45,-0.16364
46,-0.19635999999999998
47,-0.23306
48,-0.2614
49,-0.27416
50,-0.27081
51,-0.25639
52,-0.23873000000000003
53,-0.22515
54,-0.22002
55,-0.22383000000000003
56,-0.23387
57,-0.24591999999999997
58,-0.25616
59,-0.26241
60,-0.26458000000000004
61,-0.26416999999999996
62,-0.26326
63,-0.26489
64,-0.26844
65,-0.27168000000000003
66,-0.27431
67,-0.27605999999999997
68,-0.27681999999999995
69,-0.27655
70,-0.27501
71,-0.27266999999999997
72,-0.27024000000000004
73,-0.26853
74,-0.26838
75,-0.27003
76,-0.27366
77,-0.27913000000000004
78,-0.28601
79,-0.29369
80,-0.30130999999999997
81,-0.30818
82,-0.31389
83,-0.31837
84,-0.32187
85,-0.32473
86,-0.32743
87,-0.3304
88,-0.33389
89,-0.33787
90,-0.34197
91,-0.34562
92,-0.34833000000000003
93,-0.3498
94,-0.35007
95,-0.34954
96,-0.34869
97,-0.34820999999999996
98,-0.34861
