time,value
0,0.63117
1,0.52166
2,0.3739
3,0.22271
4,0.081867
5,-0.02076
6,-0.09064900000000001
7,-0.15914
8,-0.23778000000000002
9,-0.35267
10,-0.49048
11,-0.6441100000000001
12,-0.7894899999999999
13,-0.8857799999999999
14,-0.9113100000000001
15,-0.83319
16,-0.6571100000000001
17,-0.39816
18,-0.0794
19,0.24716
20,0.5569
21,0.81412
22,0.98951
23,1.0673
24,1.0645
25,0.99065
26,0.86421
27,0.71075
28,0.55188
29,0.38361
30,0.19405
31,-0.013113
32,-0.25106999999999996
33,-0.49996
34,-0.74455
35,-0.94225
36,-1.0627
37,-1.0884
38,-1.0155
39,-0.8660200000000001
40,-0.67889
41,-0.48195
42,-0.30529
43,-0.15665
44,-0.01768
45,0.14351
46,0.33731
47,0.57026
48,0.82683
49,1.0543
50,1.2025
51,1.2349
52,1.1348
53,0.904
54,0.591
55,0.25211999999999996
56,-0.068649
57,-0.34176999999999996
58,-0.55611
59,-0.71715
60,-0.8390200000000001
61,-0.92185
62,-0.9580700000000001
63,-0.9341700000000001
64,-0.8361299999999999
65,-0.65778
66,-0.40655
67,-0.1106
68,0.18911
69,0.44675
70,0.6359
71,0.7543300000000001
72,0.79872
73,0.8033399999999999
74,0.78425
75,0.7447
76,0.67483
77,0.55186
78,0.35375
79,0.075722
80,-0.25105
81,-0.58233
82,-0.8581700000000001
83,-1.0290000000000001
84,-1.0545
85,-0.93604
86,-0.72082
87,-0.45883
88,-0.20254
89,0.014484
90,0.18713
91,0.33186
92,0.46626000000000006
93,0.593
94,0.70825
95,0.78887
96,0.80682
97,0.7317
98,0.56015
99,0.31658000000000003
100,0.046236
101,-0.19297
102,-0.36319
103,-0.4419
104,-0.44066000000000005
105,-0.38216
106,-0.3046
107,-0.23318000000000003
108,-0.16684000000000002
109,-0.10052
110,-0.010409999999999999
111,0.093851
112,0.2085
113,0.30455
114,0.3536
115,0.32942
116,0.21941999999999998
117,0.045388
118,-0.15925
119,-0.35313
120,-0.4914
121,-0.5607300000000001
122,-0.5732
123,-0.54187
124,-0.47555
125,-0.37446999999999997
126,-0.2233
127,-0.011182
128,0.26072
129,0.55793
130,0.8371700000000001
131,1.0357
132,1.0825
133,0.95157
134,0.6499
135,0.25305
136,-0.16186
137,-0.49601000000000006
138,-0.68258
139,-0.69833
140,-0.57381
141,-0.36629
142,-0.14739000000000002
143,0.042877
144,0.17602
145,0.26156999999999997
146,0.31509000000000004
147,0.34568000000000004
148,0.36108
149,0.33518000000000003
150,0.25042
151,0.0808
152,-0.15807000000000002
153,-0.43448000000000003
154,-0.68207
155,-0.8325899999999999
156,-0.84734
157,-0.71901
158,-0.48200000000000004
159,-0.18825999999999998
160,0.094318
161,0.3091
162,0.44108
163,0.5041100000000001
164,0.54367
165,0.58887
166,0.66008
167,0.73583
168,0.77667
169,0.7299
170,0.57348
171,0.2964
172,-0.069438
173,-0.45623
174,-0.7901699999999999
175,-1.0048
176,-1.0712
177,-0.98374
178,-0.77168
179,-0.47431999999999996
180,-0.15005
181,0.15509
182,0.41401000000000004
183,0.6102
184,0.73728
185,0.78813
186,0.7639699999999999
187,0.6695800000000001
188,0.50921
189,0.3044
190,0.064472
191,-0.17658
192,-0.39299999999999996
193,-0.55462
194,-0.64126
195,-0.6604899999999999
196,-0.61929
197,-0.53995
198,-0.43376000000000003
199,-0.31309000000000003
200,-0.17392
201,-0.019389
202,0.14076
203,0.30471
204,0.44267
205,0.55143
206,0.5964
207,0.56921
208,0.478
209,0.34208
210,0.19787000000000002
211,0.062451
212,-0.036105
213,-0.091081
214,-0.10144
215,-0.082146
216,-0.04439
217,-0.011481
218,0.009091799999999999
219,0.018359
220,0.017159
221,0.0039292
222,-0.019444
223,-0.052266999999999994
224,-0.096581
225,-0.14586
226,-0.1964
227,-0.24454
228,-0.27628
229,-0.28458
230,-0.26604
231,-0.22658000000000003
232,-0.18347
233,-0.14029
234,-0.10519
235,-0.088038
236,-0.08835499999999999
237,-0.09284400000000001
238,-0.084466
239,-0.056157000000000006
240,0.0038148
241,0.095796
242,0.21665
243,0.37268
244,0.54091
245,0.71257
246,0.8668899999999999
247,0.9716299999999999
248,0.99625
249,0.91646
250,0.71877
251,0.40786999999999995
252,0.026733
253,-0.38147
254,-0.7539
255,-1.0396
256,-1.2098
257,-1.2568
258,-1.1945
259,-1.0525
260,-0.85634
261,-0.63661
262,-0.4033
263,-0.15433
264,0.10415
265,0.36567
266,0.62336
267,0.8566600000000001
268,1.0421
269,1.1464
270,1.1507
271,1.0442
272,0.8435
273,0.5798399999999999
274,0.28909
275,0.012505
276,-0.22365
277,-0.39273
278,-0.49076000000000003
279,-0.52877
280,-0.5292399999999999
281,-0.50747
282,-0.49378
283,-0.49978
284,-0.53068
285,-0.57722
286,-0.61968
287,-0.6445
288,-0.6289
289,-0.55776
290,-0.42063999999999996
291,-0.21629
292,0.042411000000000004
293,0.33992
294,0.65173
295,0.9534299999999999
296,1.2227
297,1.433
298,1.5539
299,1.5665
300,1.4702
301,1.2442
302,0.8924200000000001
303,0.44775
304,-0.07083099999999999
305,-0.6184
306,-1.1663
307,-1.6432
308,-2.0183
309,-2.2524
310,-2.3191
311,-2.2052
312,-1.915
313,-1.4609999999999999
314,-0.8802399999999999
315,-0.22191999999999998
316,0.45992
317,1.1094
318,1.6787
319,2.1205
320,2.4118
321,2.5305
322,2.4725
323,2.233
324,1.8333
325,1.3022
326,0.67427
327,-0.0093567
328,-0.69702
329,-1.341
330,-1.8856
331,-2.2873
332,-2.5119
333,-2.526
334,-2.3366
335,-1.9577
336,-1.4162
337,-0.7670899999999999
338,-0.062185000000000004
339,0.62798
340,1.2514
341,1.7577
342,2.1177
343,2.3144
344,2.3294
345,2.1745
346,1.8646
347,1.4173
348,0.86134
349,0.23237
350,-0.42955
351,-1.0806
352,-1.665
353,-2.1377
354,-2.4463
355,-2.5538
356,-2.4428
357,-2.1215
358,-1.6061
359,-0.9520299999999999
360,-0.20876999999999998
361,0.55024
362,1.2691
363,1.8932
364,2.3633
365,2.6515
366,2.7343
367,2.5985
368,2.2593
369,1.7457
370,1.1112
371,0.4166
372,-0.27504
373,-0.9153
374,-1.4598
375,-1.8808
376,-2.1723
377,-2.3273
378,-2.3408
379,-2.2178
380,-1.9622
381,-1.5829
382,-1.1045
383,-0.54986
384,0.029595999999999997
385,0.59685
386,1.1088
387,1.528
388,1.8334
389,2.0172
390,2.0899
391,2.0445
392,1.8911
393,1.6345
394,1.2808
395,0.8439200000000001
396,0.34839000000000003
397,-0.18118
398,-0.70221
399,-1.1704
400,-1.5553
401,-1.8327
402,-1.9743
403,-1.9722
404,-1.8332
405,-1.5621
406,-1.1736
407,-0.6907800000000001
408,-0.1567
409,0.39058000000000004
410,0.89759
411,1.3109
412,1.589
413,1.7193
414,1.6929
415,1.5375
416,1.2738
417,0.94296
418,0.56952
419,0.17349
420,-0.22336
421,-0.61264
422,-0.96446
423,-1.2537
424,-1.4457
425,-1.5114
426,-1.4328
427,-1.2211
428,-0.9126200000000001
429,-0.54305
430,-0.16463
431,0.17447000000000001
432,0.45786000000000004
433,0.68774
434,0.8691200000000001
435,1.0301
436,1.1808
437,1.3066
438,1.386
439,1.3754
440,1.2488
441,0.97565
442,0.57812
443,0.10362
444,-0.38669000000000003
445,-0.82488
446,-1.1656
447,-1.3826
448,-1.4880000000000002
449,-1.4998
450,-1.4318
451,-1.3013
452,-1.1021
453,-0.8294600000000001
454,-0.46645
455,-0.032146
456,0.43745
457,0.88974
458,1.2493
459,1.4656
460,1.5099
461,1.3886
462,1.1459
463,0.83168
464,0.50546
465,0.20670999999999998
466,-0.051358
467,-0.27857
468,-0.49001000000000006
469,-0.69517
470,-0.88497
471,-1.0303
472,-1.0808
473,-1.0168
474,-0.81339
475,-0.5002800000000001
476,-0.11609000000000001
477,0.27476
478,0.61875
479,0.86949
480,1.0082
481,1.0527
482,1.0259
483,0.9303600000000001
484,0.77325
485,0.56491
486,0.29191999999999996
487,-0.041287
488,-0.39632
489,-0.73045
490,-0.9969
491,-1.1595
492,-1.1942
493,-1.1206
494,-0.9655
495,-0.76354
496,-0.5401699999999999
497,-0.30722
498,-0.050638
499,0.23684000000000002
