time,value
0,0.27560999999999997
1,0.0014308
2,-0.086563
3,0.46376999999999996
4,0.026465
5,0.31322
6,-0.015156000000000001
7,-0.27005999999999997
8,0.057210000000000004
9,-0.009599799999999999
10,-0.1394
11,-0.09378500000000001
12,-0.36869
13,0.096277
14,0.19937
15,-0.40489
16,0.020668000000000002
17,0.12865
18,0.5100100000000001
19,0.21864
20,0.062797
21,0.8153
22,0.15617999999999999
23,0.11984000000000002
24,-0.14056
25,-0.075331
26,0.28681999999999996
27,-0.38822
28,-0.9097200000000001
29,0.63137
30,-0.16004000000000002
31,0.020502
32,-0.11167
33,0.05956
34,0.044626
35,-0.33178
36,-0.032006
37,-0.22591
38,0.08630399999999999
39,-0.30225
40,0.78251
41,-0.15425999999999998
42,0.20849
43,0.017153
44,-0.36612
45,-1.5262
46,-1.5262
47,-1.5262
48,-1.5262
49,-1.5262
50,-1.5262
51,-1.5262
52,-1.5262
53,-1.5262
54,-1.5262
55,-1.5262
56,-1.5262
57,-1.5262
58,-1.5262
59,-1.5262
60,-1.5262
61,1.6553
62,1.6553
63,1.6553
64,1.6553
65,1.6553
66,1.6553
67,1.6553
68,1.6553
69,1.6553
70,1.6553
71,1.6553
72,1.6553
73,1.6553
74,1.6553
75,1.6553
76,0.2468
77,-0.24586999999999998
78,0.3704
79,0.092543
80,-0.032208
81,0.16645
82,0.12988
83,-0.016
84,0.012799
85,-0.6399199999999999
86,-0.010348
87,0.25549
88,-0.044248
89,-0.36123
90,-0.16369
91,0.27425
92,0.23558
93,0.012745999999999999
94,0.18382
95,-0.016715999999999998
96,-0.35311
97,-0.56393
98,-0.041005
99,0.32243
100,0.16725
101,-0.41068999999999994
102,-0.83315
103,-0.21498
104,0.1057
105,-0.8136399999999999
106,0.32186
107,0.1435
108,-1.5262
109,-1.5262
110,-1.5262
111,-1.5262
112,-1.5262
113,-1.5262
114,-1.5262
115,-1.5262
116,1.6553
117,1.6553
118,1.6553
119,1.6553
120,1.6553
121,1.6553
122,1.6553
123,1.6553
124,-0.12845
125,-0.09302200000000001
126,-0.38108000000000003
127,-0.13787
