time,value
0,0.38806
1,0.06927799999999999
2,-0.26404
3,-0.58978
4,-0.8868299999999999
5,-1.1336
6,-1.3103
7,-1.4018
8,-1.3999
9,-1.3039
10,-1.1208
11,-0.86697
12,-0.56694
13,-0.24397
14,0.07631399999999999
15,0.37005
16,0.62173
17,0.8201700000000001
18,0.96346
19,1.0496
20,1.0843
21,1.0739
22,1.0227
23,0.93863
24,0.8234600000000001
25,0.68417
26,0.5262399999999999
27,0.34976
28,0.15919
29,-0.045369
30,-0.25847
31,-0.47621
32,-0.69167
33,-0.89166
34,-1.0658
35,-1.1991
36,-1.2784
37,-1.2937
38,-1.2357
39,-1.1036
40,-0.90115
41,-0.64115
42,-0.33488
43,-0.0045116999999999996
44,0.33171999999999996
45,0.65601
46,0.9517
47,1.206
48,1.4054
49,1.5409
50,1.6039
51,1.5867
52,1.4832
53,1.2882
54,1.0053
55,0.6449199999999999
56,0.2259
57,-0.2244
58,-0.67394
59,-1.0891
60,-1.4372
61,-1.6931
62,-1.8422
63,-1.8782
64,-1.8032
65,-1.6271
66,-1.3656
67,-1.0359
68,-0.65873
69,-0.25761999999999996
70,0.14942
71,0.54404
72,0.90902
73,1.2341
74,1.5106
75,1.7323
76,1.8905
77,1.974
78,1.9685
79,1.8559999999999999
80,1.6267
81,1.2759
82,0.81201
83,0.26439
84,-0.33032
85,-0.9234
86,-1.4629
87,-1.9057
88,-2.224
89,-2.4019
90,-2.4371
91,-2.3368
92,-2.1171
93,-1.7887
94,-1.3668
95,-0.86145
96,-0.28946
97,0.32654
98,0.9553299999999999
99,1.5599
100,2.0971
101,2.5214
102,2.7954
103,2.8885
104,2.781
105,2.4701
106,1.9724
107,1.3208
108,0.56301
109,-0.23771
110,-1.0170000000000001
111,-1.7103
112,-2.2623
113,-2.6332
114,-2.8045
115,-2.7766
116,-2.5636
117,-2.1946
118,-1.7
119,-1.1156
120,-0.47608
121,0.18267
122,0.8227899999999999
123,1.4077
124,1.8955
125,2.2522
126,2.452
127,2.4752
128,2.3235
129,2.0091
130,1.5595
131,1.0095
132,0.39835
133,-0.22835
134,-0.82689
135,-1.3501
136,-1.7606
137,-2.0278
138,-2.1369
139,-2.086
140,-1.8933
141,-1.5866
142,-1.1971
143,-0.7630100000000001
144,-0.31353000000000003
145,0.1262
146,0.54225
147,0.92074
148,1.248
149,1.5114
150,1.6918
151,1.7690000000000001
152,1.7269
153,1.5634
154,1.29
155,0.92542
156,0.50471
157,0.063933
158,-0.36033000000000004
159,-0.73934
160,-1.0496
161,-1.2767
162,-1.415
163,-1.4602
164,-1.4107
165,-1.2716
166,-1.0529
167,-0.7703
168,-0.44922
169,-0.11739000000000001
170,0.19827
171,0.4728
172,0.68862
173,0.84251
174,0.93466
175,0.97029
176,0.95495
177,0.89165
178,0.78114
179,0.62637
180,0.43173999999999996
181,0.21044000000000002
182,-0.018663
183,-0.23392
184,-0.41421
185,-0.54569
186,-0.61919
187,-0.64281
188,-0.625
189,-0.57518
190,-0.5029600000000001
191,-0.41289
192,-0.30741999999999997
193,-0.18531
194,-0.051196
195,0.087031
196,0.21454
197,0.31266
198,0.36756
199,0.37033
200,0.32766
201,0.25954
202,0.1912
203,0.1442
204,0.13367
205,0.16255
206,0.21903000000000003
207,0.28126999999999996
208,0.32197
209,0.3227
210,0.2705
211,0.16627999999999998
212,0.021168
213,-0.14832
214,-0.31990999999999997
215,-0.47723000000000004
216,-0.60449
217,-0.69294
218,-0.7356600000000001
219,-0.72727
220,-0.66527
221,-0.55053
222,-0.38963000000000003
223,-0.19475
224,0.016613
225,0.22780999999999998
226,0.4228
227,0.58512
228,0.70938
229,0.79298
230,0.8374
231,0.84596
232,0.81616
233,0.75067
234,0.6462100000000001
235,0.49953000000000003
236,0.31190999999999997
237,0.089937
238,-0.1529
239,-0.39939
240,-0.63167
241,-0.8297700000000001
242,-0.98001
243,-1.073
244,-1.1007
245,-1.0596
246,-0.9514799999999999
247,-0.77992
248,-0.55507
249,-0.29086
250,-0.0049421000000000005
251,0.27991
252,0.54446
253,0.76908
254,0.93634
255,1.0383
256,1.0738
257,1.0466
258,0.9627600000000001
259,0.8311299999999999
260,0.6614800000000001
261,0.45875
262,0.23412
263,-0.0024715999999999996
264,-0.23776
265,-0.4621
266,-0.6609999999999999
267,-0.82009
268,-0.9314600000000001
269,-0.9888600000000001
270,-0.98975
271,-0.9326399999999999
272,-0.8189
273,-0.6504
274,-0.43475
275,-0.18302000000000002
276,0.087918
277,0.35628000000000004
278,0.59867
279,0.7901100000000001
280,0.91005
281,0.9490799999999999
282,0.90696
283,0.79628
284,0.63397
285,0.44692
286,0.25874
287,0.080961
288,-0.074291
289,-0.2052
290,-0.31485
291,-0.41025
292,-0.49246
293,-0.5597300000000001
294,-0.6070399999999999
295,-0.62879
296,-0.61964
297,-0.57301
298,-0.49138000000000004
299,-0.37696
300,-0.23569
301,-0.075057
302,0.093544
303,0.26173
304,0.42148
305,0.56325
306,0.67792
307,0.75445
308,0.7829999999999999
309,0.75543
310,0.66643
311,0.5183399999999999
312,0.32554
313,0.10490999999999999
314,-0.12145
315,-0.32891
316,-0.49648000000000003
317,-0.61332
318,-0.67902
319,-0.69697
320,-0.6802
321,-0.6409699999999999
322,-0.58829
323,-0.5229699999999999
324,-0.43808
325,-0.32366999999999996
326,-0.16998
327,0.021755
328,0.24766999999999997
329,0.48961000000000005
330,0.7235199999999999
331,0.9202899999999999
332,1.0501
333,1.0967
334,1.0486
335,0.90666
336,0.68148
337,0.38989
338,0.0572
339,-0.2895
340,-0.6181300000000001
341,-0.89931
342,-1.1062
343,-1.2171
344,-1.2212
345,-1.1188
346,-0.9199
347,-0.6467
348,-0.32978
349,-0.0022805
350,0.30229
351,0.55572
352,0.74237
353,0.85083
354,0.88385
355,0.84952
356,0.76142
357,0.63613
358,0.48733000000000004
359,0.33266
360,0.17881
361,0.032719
362,-0.10057
363,-0.22232
364,-0.3293
365,-0.41853999999999997
366,-0.48344
367,-0.52253
368,-0.5301
369,-0.50185
370,-0.43801999999999996
371,-0.34281999999999996
372,-0.22461
373,-0.09445
374,0.029893
375,0.13234
376,0.20275
377,0.23501
378,0.22955
379,0.19159
380,0.13472
381,0.076119
382,0.031662
383,0.013583000000000001
384,0.030381000000000002
385,0.08417999999999999
386,0.16179000000000002
387,0.24831999999999999
388,0.32963000000000003
389,0.3872
390,0.40749
391,0.38528
392,0.32149
393,0.22075
394,0.092525
395,-0.054456
396,-0.21051999999999998
397,-0.36459
398,-0.50393
399,-0.61519
400,-0.68661
401,-0.70385
402,-0.66371
403,-0.57071
404,-0.43673
405,-0.28158
406,-0.12705
407,0.009864
408,0.12245999999999999
409,0.21234
410,0.29213
411,0.37688
412,0.48003999999999997
413,0.59858
414,0.72211
415,0.8301799999999999
416,0.89181
417,0.88451
418,0.79584
419,0.62941
420,0.39626
421,0.12088
422,-0.16984000000000002
423,-0.45073
424,-0.70338
425,-0.9144899999999999
426,-1.0741
427,-1.1736
428,-1.2037
429,-1.1583
430,-1.0319
431,-0.8310299999999999
432,-0.56979
433,-0.2721
434,0.035148
435,0.32541
436,0.5795399999999999
437,0.78909
438,0.95509
439,1.082
440,1.1743
441,1.2297
442,1.2407
443,1.1908
444,1.0644
445,0.8514
446,0.55296
447,0.18367999999999998
448,-0.22805
449,-0.64499
450,-1.0261
451,-1.3315
452,-1.535
453,-1.6243
454,-1.5974
455,-1.4654
456,-1.2442
457,-0.95344
458,-0.61546
459,-0.2503
460,0.11815
461,0.47121
462,0.7895
463,1.0573
464,1.2615
465,1.3929
466,1.4471
467,1.4249
468,1.335
469,1.1807
470,0.96836
471,0.70512
472,0.40034000000000003
473,0.061536
474,-0.29714
475,-0.65466
476,-0.99065
477,-1.2814
478,-1.5034
479,-1.6331
480,-1.6549
481,-1.5590000000000002
482,-1.3485
483,-1.0347
484,-0.64075
485,-0.20074
486,0.24786
487,0.66694
488,1.022
489,1.287
490,1.4471
491,1.4988
492,1.4483
493,1.311
494,1.1065
495,0.85514
496,0.57473
497,0.27906
498,-0.018961000000000002
499,-0.31081
