time,value
0,-0.13601
1,0.24664
2,0.62285
3,0.96081
4,1.2259
5,1.4040000000000001
6,1.484
7,1.4611
8,1.3285
9,1.0962
10,0.7723
11,0.36554000000000003
12,-0.090384
13,-0.54299
14,-0.9433299999999999
15,-1.2371
16,-1.3987
17,-1.4255
18,-1.3308
19,-1.1602
20,-0.9544600000000001
21,-0.75997
22,-0.58135
23,-0.40158
24,-0.19627999999999998
25,0.052345
26,0.35144000000000003
27,0.6773600000000001
28,0.99844
29,1.2689
30,1.4448
31,1.4932
32,1.4087
33,1.2015
34,0.90081
35,0.53408
36,0.12865
37,-0.29112
38,-0.69494
39,-1.0548
40,-1.338
41,-1.5103
42,-1.5538
43,-1.4568
44,-1.2294
45,-0.9049299999999999
46,-0.52509
47,-0.14861
48,0.19816
49,0.49249
50,0.7330800000000001
51,0.9271799999999999
52,1.0854
53,1.2068
54,1.2724
55,1.2717
56,1.1909999999999998
57,1.0052
58,0.71939
59,0.35261
60,-0.055985
61,-0.46384
62,-0.83362
63,-1.1305
64,-1.3396
65,-1.4469
66,-1.4442
67,-1.3324
68,-1.115
69,-0.80174
70,-0.41767
71,0.0031331999999999996
72,0.40905
73,0.7478600000000001
74,0.9752700000000001
75,1.0679
76,1.0316
77,0.89628
78,0.6985899999999999
79,0.48941999999999997
80,0.30959000000000003
81,0.18104
82,0.098688
83,0.049654000000000004
84,0.0098754
85,-0.048452999999999996
86,-0.13967000000000002
87,-0.27078
88,-0.42588000000000004
89,-0.58531
90,-0.71995
91,-0.7946300000000001
92,-0.78618
93,-0.68077
94,-0.47326999999999997
95,-0.17683
96,0.16648
97,0.5161899999999999
98,0.81803
99,1.0192
100,1.0896
101,1.0143
102,0.81093
103,0.51298
104,0.17012
105,-0.16401
106,-0.44914
107,-0.65556
108,-0.77273
109,-0.81025
110,-0.78203
111,-0.70705
112,-0.6004
113,-0.47781
114,-0.35270999999999997
115,-0.235
116,-0.14253
117,-0.07270800000000001
118,-0.025233000000000002
119,-0.0029874000000000003
120,0.0034671999999999997
121,0.012067
122,0.051976
123,0.13565
124,0.27684000000000003
125,0.47602
126,0.7167399999999999
127,0.9746100000000001
128,1.2085
129,1.3825
130,1.4467
131,1.3673
132,1.1174
133,0.6852699999999999
134,0.080291
135,-0.64736
136,-1.4114
137,-2.1094
138,-2.6178
139,-2.8287
140,-2.6699
141,-2.1297
142,-1.2726
143,-0.21836
144,0.8602700000000001
145,1.7916
146,2.4189
147,2.6527
148,2.4862
149,1.9713
150,1.2239
151,0.3927
152,-0.36687
153,-0.94725
154,-1.2767
155,-1.3352
156,-1.1604
157,-0.8287
158,-0.44731000000000004
159,-0.11277999999999999
160,0.086985
161,0.11635999999999999
162,-0.017107
163,-0.26509
164,-0.54367
165,-0.75083
166,-0.80782
167,-0.6673
168,-0.32633
169,0.15997999999999998
170,0.69698
171,1.1738
172,1.4909999999999999
173,1.5811
174,1.4363
175,1.0908
176,0.62437
177,0.12120999999999998
178,-0.3293
179,-0.65068
180,-0.80056
181,-0.7725
182,-0.59228
183,-0.30893000000000004
184,0.014991999999999998
185,0.304
186,0.49623
187,0.53342
188,0.38766
189,0.065295
190,-0.39366999999999996
191,-0.92117
192,-1.4236
193,-1.7987
194,-1.953
195,-1.8508
196,-1.4963
197,-0.94527
198,-0.29838000000000003
199,0.33675
200,0.86455
201,1.2248
202,1.4096
203,1.4512
204,1.4097
205,1.3502
206,1.3186
207,1.3219999999999998
208,1.3412
209,1.3252
210,1.2325
211,1.0191
212,0.67395
213,0.21569000000000002
214,-0.31482
215,-0.86616
216,-1.3906
217,-1.8315
218,-2.1594
219,-2.3345
220,-2.3382
221,-2.1603
222,-1.8096
223,-1.3141
224,-0.72241
225,-0.096873
226,0.49738999999999994
227,1.0023
228,1.3729
229,1.5948
230,1.676
231,1.6509
232,1.5507
233,1.4097
234,1.2396
235,1.0449
236,0.81187
237,0.52633
238,0.18218
239,-0.21659
240,-0.65064
241,-1.0799
242,-1.4615
243,-1.7482
244,-1.8974
245,-1.8777
246,-1.6836
247,-1.3251
248,-0.8332
249,-0.26579
250,0.31687
251,0.85516
252,1.2892
253,1.5728
254,1.6916
255,1.6588
256,1.4959
257,1.2393
258,0.93068
259,0.61074
260,0.29139
261,-0.0083117
262,-0.29131999999999997
263,-0.56023
264,-0.81466
265,-1.0491
266,-1.251
267,-1.4035
268,-1.4869
269,-1.4899
270,-1.3976
271,-1.1916
272,-0.8622700000000001
273,-0.40993999999999997
274,0.14569000000000001
275,0.75748
276,1.3513
277,1.8356
278,2.1347
279,2.1982
280,2.0031
281,1.5796
282,1.0045
283,0.37314
284,-0.22250999999999999
285,-0.7167399999999999
286,-1.0767
287,-1.3115
288,-1.4424
289,-1.4918
290,-1.4785
291,-1.3965
292,-1.2368
293,-0.9908100000000001
294,-0.67465
295,-0.31943
296,0.032106
297,0.33994
298,0.57734
299,0.75348
300,0.89571
301,1.034
302,1.1825
303,1.3227
304,1.4057
305,1.3644
306,1.1447
307,0.71999
308,0.1366
309,-0.519
310,-1.125
311,-1.5657
312,-1.7548
313,-1.6779
314,-1.3894
315,-0.9775
316,-0.5455800000000001
317,-0.17514000000000002
318,0.09642200000000001
319,0.27987
320,0.40126999999999996
321,0.50146
322,0.59839
323,0.6896399999999999
324,0.74436
325,0.7367100000000001
326,0.6532
327,0.49706000000000006
328,0.30228
329,0.11640999999999999
330,-0.022674
331,-0.1046
332,-0.14933
333,-0.19066
334,-0.27116
335,-0.40347
336,-0.57531
337,-0.73712
338,-0.8272700000000001
339,-0.79391
340,-0.60811
341,-0.29023000000000004
342,0.098341
343,0.48034
344,0.78352
345,0.9602299999999999
346,0.99003
347,0.89505
348,0.71094
349,0.47681
350,0.22726999999999997
351,-0.02514
352,-0.27259
353,-0.51171
354,-0.73154
355,-0.91045
356,-1.0297
357,-1.0659999999999998
358,-1.0190000000000001
359,-0.8976299999999999
360,-0.7187
361,-0.49783999999999995
362,-0.25759
363,0.0019121
364,0.28981999999999997
365,0.6146699999999999
366,0.9604600000000001
367,1.2959
368,1.5735
369,1.7385
370,1.7472
371,1.5808
372,1.2492
373,0.79364
374,0.27352
375,-0.25128
376,-0.73378
377,-1.1437
378,-1.4717
379,-1.7012
380,-1.8368
381,-1.8572
382,-1.7481
383,-1.5021
384,-1.1243
385,-0.64376
386,-0.12297000000000001
387,0.36682
388,0.76499
389,1.0247
390,1.1373
391,1.1299
392,1.0573
393,0.9805799999999999
394,0.93594
395,0.9341
396,0.9332
397,0.8792700000000001
398,0.7183
399,0.42123
400,-0.002634
401,-0.50089
402,-0.9849899999999999
403,-1.3586
404,-1.5504
405,-1.5338
406,-1.3265
407,-0.98667
408,-0.58617
409,-0.19844
410,0.12886
411,0.37526
412,0.54369
413,0.6596
414,0.73787
415,0.7905399999999999
416,0.8163100000000001
417,0.8055399999999999
418,0.75235
419,0.6462
420,0.49625
421,0.31932
422,0.1316
423,-0.057402999999999996
424,-0.25299
425,-0.45745
426,-0.6764399999999999
427,-0.89941
428,-1.0997
429,-1.2339
430,-1.2547
431,-1.1286
432,-0.8464
433,-0.4336
434,0.052752999999999994
435,0.53594
436,0.9378200000000001
437,1.2025
438,1.3061
439,1.2514
440,1.0805
441,0.8375799999999999
442,0.56884
443,0.30623
444,0.060458000000000005
445,-0.16000999999999999
446,-0.36303
447,-0.5407
448,-0.68893
449,-0.79401
450,-0.8420000000000001
451,-0.82919
452,-0.74571
453,-0.6126699999999999
454,-0.4415
455,-0.24938000000000002
456,-0.054084
457,0.13325
458,0.30687
459,0.47331999999999996
460,0.62051
461,0.73782
462,0.80512
463,0.8142199999999999
464,0.75663
465,0.6319
466,0.44656
467,0.21289
468,-0.047882999999999995
469,-0.31396999999999997
470,-0.55878
471,-0.7639100000000001
472,-0.90765
473,-0.9747299999999999
474,-0.9538700000000001
475,-0.8472
476,-0.67027
477,-0.45076000000000005
478,-0.22344
479,-0.006829600000000001
480,0.16818
481,0.29068
482,0.36296999999999996
483,0.40345
484,0.4312
485,0.44851
486,0.46337
487,0.47394
488,0.47456000000000004
489,0.45253000000000004
490,0.40556
491,0.33621999999999996
492,0.25032
493,0.1543
494,0.051542
495,-0.056532000000000006
496,-0.1714
497,-0.28968
498,-0.40796
499,-0.51342
