time,value
0,-1.1905
1,-0.8189
2,-0.19975
3,0.58703
4,1.4069
5,2.0955
6,2.5054
7,2.5619
8,2.2885
9,1.7483
10,1.0549
11,0.34121999999999997
12,-0.29057
13,-0.75989
14,-1.0433
15,-1.1416
16,-1.0904
17,-0.9285
18,-0.71122
19,-0.47093999999999997
20,-0.244
21,-0.05879500000000001
22,0.041056999999999996
23,0.034928
24,-0.040529
25,-0.1522
26,-0.25815
27,-0.30973
28,-0.28244
29,-0.18433
30,-0.052941999999999996
31,0.05739299999999999
32,0.10245
33,0.060158
34,-0.04607
35,-0.17222
36,-0.26675
37,-0.28531
38,-0.20733000000000001
39,-0.048375
40,0.1212
41,0.25099
42,0.30651
43,0.29023000000000004
44,0.258
45,0.28442
46,0.43643999999999994
47,0.72008
48,1.068
49,1.3705
50,1.5039
51,1.3448
52,0.8728799999999999
53,0.14551
54,-0.71536
55,-1.528
56,-2.1242
57,-2.3929
58,-2.3369999999999997
59,-2.0031
60,-1.4815
61,-0.8962600000000001
62,-0.33866999999999997
63,0.1685
64,0.60232
65,0.9695799999999999
66,1.2607
67,1.4535
68,1.4964
69,1.3814
70,1.0996
71,0.69023
72,0.25498000000000004
73,-0.10718
74,-0.32182
75,-0.34621999999999997
76,-0.19821
77,0.049749
78,0.29462
79,0.43892
80,0.43863
81,0.28043
82,-0.014811000000000001
83,-0.39169
84,-0.7701899999999999
85,-1.1065
86,-1.3599
87,-1.4972
88,-1.4968
89,-1.3447
90,-1.0491
91,-0.60542
92,-0.06869299999999999
93,0.50327
94,1.0171
95,1.3978
96,1.5915
97,1.5818
98,1.4021
99,1.094
100,0.7246199999999999
101,0.33784000000000003
102,-0.029016000000000004
103,-0.34385
104,-0.59117
105,-0.76861
106,-0.8642700000000001
107,-0.85651
108,-0.73944
109,-0.55669
110,-0.35586
111,-0.18904
112,-0.10437
113,-0.111
114,-0.19142
115,-0.28891
116,-0.33413000000000004
117,-0.26786
118,-0.074005
119,0.23359000000000002
120,0.58582
121,0.8906200000000001
122,1.0642
123,1.0666
124,0.8931600000000001
125,0.57773
126,0.19201
127,-0.20117000000000002
128,-0.5439
129,-0.80166
130,-0.94742
131,-1.012
132,-0.9969899999999999
133,-0.91906
134,-0.76782
135,-0.55829
136,-0.30996
137,-0.030677999999999997
138,0.25328
139,0.50322
140,0.6924100000000001
141,0.8185899999999999
142,0.8805799999999999
143,0.9010600000000001
144,0.89999
145,0.89876
146,0.8879299999999999
147,0.85511
148,0.76127
149,0.5993
150,0.35336999999999996
151,0.016837
152,-0.37451999999999996
153,-0.8114600000000001
154,-1.248
155,-1.6106
156,-1.8386
157,-1.8943
158,-1.7635
159,-1.4248
160,-0.9170299999999999
161,-0.31636
162,0.31432
163,0.8971100000000001
164,1.3317
165,1.5732
166,1.5975
167,1.4224
168,1.0751
169,0.62944
170,0.16394
171,-0.24691
172,-0.54375
173,-0.70438
174,-0.70701
175,-0.56194
176,-0.31313
177,-0.024897
178,0.2512
179,0.44888999999999996
180,0.53045
181,0.47351000000000004
182,0.29364
183,0.026136000000000003
184,-0.25476
185,-0.49073999999999995
186,-0.6418699999999999
187,-0.6855100000000001
188,-0.62308
189,-0.46998999999999996
190,-0.26494
191,-0.044572
192,0.15065
193,0.31997
194,0.4513
195,0.55198
196,0.61775
197,0.62507
198,0.5845100000000001
199,0.48253999999999997
200,0.33293
201,0.15036
202,-0.060615999999999996
203,-0.27686
204,-0.4691
205,-0.6373
206,-0.76839
207,-0.8430200000000001
208,-0.8662799999999999
209,-0.8479700000000001
210,-0.79945
211,-0.72042
212,-0.5997
213,-0.43948999999999994
214,-0.2323
215,0.030577999999999998
216,0.35445
217,0.7297100000000001
218,1.1193
219,1.4773
220,1.7386
221,1.8385
222,1.7304
223,1.4178
224,0.93414
225,0.36071
226,-0.2088
227,-0.68152
228,-0.98225
229,-1.1082
230,-1.0831
231,-0.98582
232,-0.87603
233,-0.82744
234,-0.86259
235,-0.9974
236,-1.1805
237,-1.3488
238,-1.4226
239,-1.341
240,-1.0626
241,-0.58597
242,0.039862
243,0.74436
244,1.4229
245,1.9828
246,2.3361
247,2.4531
248,2.3247
249,2.0095
250,1.58
251,1.1121
252,0.6624399999999999
253,0.24834
254,-0.11904
255,-0.47386999999999996
256,-0.8443
257,-1.2697
258,-1.7138
259,-2.1076
260,-2.395
261,-2.4926
262,-2.3639
263,-2.002
264,-1.4596
265,-0.79979
266,-0.10003
267,0.56824
268,1.1533
269,1.6459
270,2.0265
271,2.2762
272,2.3876
273,2.3298
274,2.0981
275,1.6958
276,1.1466
277,0.51117
278,-0.13346
279,-0.71585
280,-1.1686
281,-1.4659
282,-1.6024
283,-1.5996
284,-1.4801
285,-1.2938
286,-1.0709
287,-0.81918
288,-0.56361
289,-0.30665
290,-0.1046
291,0.023121
292,0.09260700000000001
293,0.11810999999999999
294,0.16013
295,0.26455
296,0.46443
297,0.77166
298,1.1574
299,1.5190000000000001
300,1.7380000000000002
301,1.7059
302,1.3534
303,0.71025
304,-0.12422000000000001
305,-1.0155
306,-1.7767
307,-2.261
308,-2.3961
309,-2.1731
310,-1.6524
311,-0.94195
312,-0.1598
313,0.58187
314,1.1998
315,1.6436
316,1.8937
317,1.9431
318,1.7915
319,1.4543
320,0.96819
321,0.38622
322,-0.22905
323,-0.7783899999999999
324,-1.1962
325,-1.4472
326,-1.5419
327,-1.483
328,-1.3232
329,-1.1196
330,-0.89848
331,-0.6907300000000001
332,-0.47463
333,-0.26214
334,-0.025391999999999998
335,0.22566
336,0.47602
337,0.69663
338,0.8710700000000001
339,1.0005
340,1.0998
341,1.182
342,1.2466
343,1.2878
344,1.2673
345,1.1393
346,0.87731
347,0.47165
348,-0.041847
349,-0.57194
350,-1.0207
351,-1.3119999999999998
352,-1.4146
353,-1.3384
354,-1.1595
355,-0.96185
356,-0.81618
357,-0.76179
358,-0.74879
359,-0.7074699999999999
360,-0.5678
361,-0.28443
362,0.11531
363,0.56234
364,0.9424
365,1.1383
366,1.0908
367,0.79368
368,0.32781
369,-0.19082000000000002
370,-0.61724
371,-0.85136
372,-0.8353700000000001
373,-0.59896
374,-0.19802
375,0.27576
376,0.73112
377,1.1011
378,1.3502
379,1.4689
380,1.4554
381,1.3049
382,1.0221
383,0.61517
384,0.12397999999999999
385,-0.40696
386,-0.92881
387,-1.3637
388,-1.6411
389,-1.7287
390,-1.6458
391,-1.4049
392,-1.0668
393,-0.69234
394,-0.34409
395,-0.057952
396,0.15427000000000002
397,0.31417
398,0.41268
399,0.44978
400,0.45705
401,0.43466000000000005
402,0.39221999999999996
403,0.35246
404,0.33259
405,0.34126999999999996
406,0.37759000000000004
407,0.41362
408,0.42706000000000005
409,0.39274000000000003
410,0.26702
411,0.048437
412,-0.23406
413,-0.52977
414,-0.76795
415,-0.8634
416,-0.78314
417,-0.51363
418,-0.086672
419,0.40569
420,0.86145
421,1.1601
422,1.2415
423,1.0764
424,0.66732
425,0.096861
426,-0.5030899999999999
427,-1.0173
428,-1.3634
429,-1.4841
430,-1.3767
431,-1.0882
432,-0.67098
433,-0.21721
434,0.20382999999999998
435,0.53878
436,0.78061
437,0.9149299999999999
438,0.9300299999999999
439,0.846
440,0.67792
441,0.42163999999999996
442,0.12057999999999999
443,-0.16305999999999998
444,-0.38034
445,-0.47503999999999996
446,-0.42244
447,-0.25636
448,-0.035125
449,0.16679000000000002
450,0.2664
451,0.2119
452,0.013516
453,-0.26815
454,-0.54801
455,-0.73492
456,-0.78489
457,-0.70303
458,-0.51244
459,-0.27957
460,-0.069768
461,0.093269
462,0.22624
463,0.3775
464,0.58155
465,0.8338200000000001
466,1.1045
467,1.3082
468,1.3613
469,1.1775
470,0.76021
471,0.14947
472,-0.5363100000000001
473,-1.1642
474,-1.618
475,-1.8201
476,-1.7569
477,-1.4817
478,-1.0743
479,-0.61715
480,-0.18525
481,0.18566
482,0.48295
483,0.72929
484,0.91561
485,1.0255
486,1.0538
487,1.0107
488,0.8850399999999999
489,0.67437
490,0.44511000000000006
491,0.22086
492,0.032418999999999996
493,-0.099518
494,-0.19841
495,-0.27382
496,-0.34981999999999996
497,-0.43071000000000004
498,-0.5341600000000001
499,-0.61636
