time,value
0,0.26716
1,0.26716
2,0.26716
3,0.26716
4,0.26716
5,0.26716
6,0.26716
7,0.26716
8,0.26716
9,0.26716
10,0.26716
11,0.26716
12,0.26716
13,0.26716
14,0.26716
15,0.26716
16,0.26716
17,0.26716
18,0.26716
19,0.26716
20,0.26716
21,0.26716
22,0.26716
23,0.26716
24,0.26716
25,0.25766
26,0.23542
27,0.19935
28,0.16469
29,0.15391
30,0.15391
31,0.15391
32,0.15391
33,0.15391
34,0.15391
35,0.15391
36,0.15391
37,0.15391
38,0.15391
39,0.15391
40,0.15391
41,0.15391
42,0.15391
43,0.15391
44,0.15391
45,0.15391
46,0.15391
47,0.15875999999999998
48,0.17014
49,0.18817
50,0.20621
51,0.21019000000000002
52,0.21054
53,0.20831
54,0.19893
55,0.18132
56,0.16329000000000002
57,0.14525
58,0.12722
59,0.49831000000000003
60,0.4545
61,0.4388
62,0.4388
63,0.4388
64,0.4388
65,0.4388
66,0.4388
67,0.4388
68,0.4388
69,0.4388
70,0.4388
71,0.4388
72,0.4388
73,0.11210999999999999
74,0.12938
75,0.15028
76,0.17699
77,0.21306
78,0.24913000000000002
79,0.27618000000000004
80,0.29422
81,0.31225
82,0.33028
83,0.34831999999999996
84,0.36635
85,0.38439
86,0.40242
87,0.42046000000000006
88,0.43849
89,0.45652
90,0.47456000000000004
91,0.48862
92,0.49367
93,0.49367
94,0.4945
95,0.50893
96,0.5261399999999999
97,0.55045
98,0.58601
99,0.6401100000000001
100,0.69422
101,0.75865
102,0.82983
103,0.90155
104,0.9650299999999999
105,1.0214
106,1.0744
107,1.1166
108,1.1166
109,1.1166
110,1.1033
111,1.0769
112,1.0408
113,1.0048
114,0.9687
115,0.93263
116,0.8989
117,0.87582
118,0.85725
119,0.83921
120,0.8211799999999999
121,0.80314
122,0.7851100000000001
123,0.78967
124,0.8045899999999999
125,0.82262
126,0.84065
127,0.85869
128,0.87672
129,0.9109299999999999
130,0.98096
131,1.0531
132,1.1322
133,1.2176
134,1.3077
135,1.3979
136,1.4881
137,1.5783
138,1.6579
139,1.7132
140,1.7492
141,1.78
142,1.7961
143,1.7961
144,1.7961
145,1.808
146,1.8242
147,1.844
148,1.8679
149,1.9040000000000001
150,1.94
151,1.9623
152,1.966
153,1.966
154,1.9797
155,2.0071
156,2.0432
157,2.0792
158,2.0432
159,2.0071
160,1.9581
161,1.8884
162,1.7983
163,1.7026
164,1.579
165,1.4347
166,1.2904
167,1.1583
168,1.0304
169,0.9041399999999999
170,0.7779
171,0.65165
172,0.52541
173,0.40721999999999997
174,0.29638000000000003
175,0.18817
176,0.44803000000000004
177,0.125
178,-0.14551
179,-0.43642
180,-0.16505
181,-0.25475
182,-0.34492
183,-0.43509
184,-0.5252600000000001
185,-0.61543
186,-0.7056100000000001
187,-0.79578
188,-0.8871899999999999
189,-0.98818
190,-1.0951
191,-1.2018
192,-1.3033
193,-1.3934
194,-1.4836
195,-1.5473
196,-1.5925
197,-1.6281
198,-1.6591
199,-1.6795
200,-1.6975
201,-1.7155
202,-1.7336
203,-1.7516
204,-1.7793
205,-1.8201
206,-1.8742
207,-1.9283
208,-1.9403
209,-1.9413
210,-1.9369
211,-1.9181
212,-1.8829
213,-1.8468
214,-1.8107
215,-1.7747
216,-1.7386
217,-1.7118
218,-1.6906
219,-1.6718
220,-1.6501
221,-1.6149
222,-1.5788
223,-1.5478
224,-1.5258
225,-1.5078
226,-1.4897
227,-1.4717
228,-1.4537
229,-1.4356
230,-1.4324
231,-1.4317
232,-1.4288
233,-1.4201
234,-1.4021
235,-1.3841
236,-1.357
237,-1.3209
238,-1.2849
239,-1.2488
240,-1.2127
241,-1.1774
242,-1.1446
243,-1.1265
244,-1.1085
245,-1.0905
246,-1.0724
247,-1.0544
248,-1.0364
249,-1.0183
250,-1.0003
251,-0.9814200000000001
252,-0.94896
253,-0.9137200000000001
254,-0.88079
255,-0.85349
256,-0.83545
257,-0.81742
258,-0.78905
259,-0.7539399999999999
260,-0.71787
261,-0.6818
262,-0.64573
263,-0.61001
264,-0.57792
265,-0.55989
266,-0.54185
267,-0.51717
268,-0.48595
269,-0.45
270,-0.41681999999999997
271,-0.39505999999999997
272,-0.37701999999999997
273,-0.36133000000000004
274,-0.35628000000000004
275,-0.35574
276,-0.35574
277,-0.35574
278,-0.35574
279,-0.35574
280,-0.35574
281,-0.35574
282,-0.3545
283,-0.34729
284,-0.33049
285,-0.31246
286,-0.29441999999999996
287,-0.27639
288,-0.25836
289,-0.2334
290,-0.20209000000000002
291,-0.16626
292,-0.13163
293,-0.11155999999999999
294,-0.09352200000000001
295,-0.40754
296,-0.25913
297,-0.078782
298,0.088404
299,0.21878000000000003
300,0.30895
301,0.39913000000000004
302,0.4893
303,0.12541
304,0.14175
305,0.15391
306,0.15391
307,0.15391
308,0.14012
309,0.4911
310,0.31076
311,0.16455999999999998
312,0.28502
313,-0.31613
314,-0.12747999999999998
315,-0.64479
316,-0.64479
317,-0.64479
318,-0.64479
319,-0.64479
320,-0.64479
321,-0.64479
322,-0.64479
323,-0.64479
324,-0.64479
325,-0.64479
326,-0.64479
327,-0.64479
328,-0.64479
329,-0.64479
330,-0.64479
331,-0.64479
332,-0.64479
333,-0.64479
334,-0.64479
335,-0.64479
336,-0.64479
337,-0.64479
338,-0.64479
339,-0.64479
340,-0.6551100000000001
341,-0.67923
342,-0.71837
343,-0.75598
344,-0.76769
345,-0.76769
346,-0.76769
347,-0.76769
348,-0.76769
349,-0.76769
350,-0.76769
351,-0.76769
352,-0.76769
353,-0.76769
354,-0.76769
355,-0.76886
356,-0.77982
357,-0.81387
358,-0.85301
359,-0.8679
360,-0.8084100000000001
361,-0.7309
362,-0.68418
363,-0.68001
364,-0.71915
365,-0.7582899999999999
366,-0.73645
367,-0.6988
368,-0.6693399999999999
369,-0.6709
370,-0.70819
371,-0.74526
372,-0.76769
373,-0.76769
374,-0.76769
375,-0.76769
376,-0.76769
377,-0.76769
378,-0.76769
379,-0.76769
380,-0.76769
381,-0.77866
382,-0.80918
383,-0.8483200000000001
384,-0.8775
385,-0.89059
386,-0.89059
387,-0.89059
388,-0.89059
389,-0.89059
390,-0.89059
391,-0.89059
392,-0.89059
393,-0.89059
394,-0.8710200000000001
395,-0.83188
396,-0.79274
397,-0.7536
398,-0.71446
399,-0.67697
400,-0.64479
401,-0.64479
402,-0.64479
403,-0.6317
404,-0.60252
405,-0.5633699999999999
406,-0.53286
407,-0.52189
408,-0.52189
409,-0.5200899999999999
410,-0.48878
411,-0.45143
412,-0.40548
413,-0.34731999999999996
414,-0.26904
415,-0.19075999999999999
416,-0.11248
417,-0.21858000000000002
418,0.16821
419,0.46567
420,0.14662999999999998
421,0.18503
422,0.21552
423,0.21552
424,0.21552
425,0.18665
426,0.12941
427,0.20805
428,-0.18335
429,-0.10543
430,-0.18370999999999998
431,-0.26199
432,-0.34026999999999996
433,-0.41856000000000004
434,-0.49018999999999996
435,-0.5485
436,-0.5876399999999999
437,-0.62678
438,-0.6414
439,-0.64479
440,-0.6420899999999999
441,-0.62644
442,-0.58999
443,-0.55085
444,-0.51171
445,-0.47257
446,-0.43343000000000004
447,-0.36426
448,-0.26747
449,-0.15005
450,-0.21075
451,0.37636
452,0.20221
453,0.30444
454,0.3713
455,0.41043999999999997
456,0.45529
457,0.51612
458,0.5944
459,0.6726800000000001
460,0.77681
461,0.8903
462,1.0077
463,1.1251
464,1.2426
465,1.36
466,1.4924
467,1.6449
468,1.8015
469,1.9581
470,2.1146
471,2.2712
472,2.4277
473,2.5452
474,2.6626
475,2.7707
476,2.8638
477,2.9419999999999997
478,3.0083
479,3.0141
480,2.9749
481,2.9358
482,2.8966
483,2.8575
484,2.8184
485,2.7792
486,2.7401
487,2.7009
488,2.6443
489,2.5718
490,2.4935
491,2.4291
492,2.3823
493,2.3432
494,2.2952
495,2.184
496,2.0676
497,1.9399
498,1.7984
499,1.6418
500,1.4868
501,1.3576
502,1.2402
503,1.1228
504,1.0054
505,0.88795
506,0.7739199999999999
507,0.6711199999999999
508,0.5928399999999999
509,0.51455
510,0.45545
511,0.40966
512,0.37169
513,0.3435
514,0.33842
515,0.33842
516,0.33034
517,0.29746
518,0.25858000000000003
519,0.21944
520,0.18029
521,0.14115
522,0.46247
523,0.41922
524,0.4155
525,0.43968999999999997
526,0.11780999999999998
527,0.15603
528,0.19309
529,0.21552
530,0.21552
531,0.21552
532,0.23564000000000002
533,0.26797
534,0.30711
535,0.34625
536,0.38539
537,0.42453
538,0.4527
539,0.46132
540,0.46132
541,0.46132
542,0.46132
543,0.46132
544,0.46132
545,0.46132
546,0.46132
547,0.45511
548,0.43627
549,0.39713000000000004
550,0.35799000000000003
551,0.31885
552,0.27971
553,0.24056999999999998
554,0.20143
555,0.16229000000000002
556,0.12149000000000001
557,0.32939
558,-0.062016999999999996
559,-0.45342
560,-0.15945
561,-0.23773000000000002
562,-0.31601
563,-0.38566
564,-0.43578
565,-0.47492
566,-0.5140600000000001
567,-0.5532
568,-0.59234
569,-0.62467
570,-0.64479
571,-0.64479
572,-0.64479
573,-0.64479
574,-0.64479
575,-0.64386
576,-0.62508
577,-0.59077
578,-0.55312
579,-0.53128
580,-0.5704199999999999
581,-0.60956
582,-0.63426
583,-0.64479
584,-0.64479
585,-0.64479
586,-0.64479
587,-0.64479
588,-0.64479
589,-0.64479
590,-0.64479
591,-0.64479
592,-0.64479
593,-0.64479
594,-0.64479
595,-0.64479
596,-0.64479
597,-0.64479
598,-0.64479
599,-0.64479
600,-0.64479
601,-0.64479
602,-0.64479
603,-0.64479
604,-0.6297699999999999
605,-0.60095
606,-0.5623199999999999
607,-0.5263100000000001
608,-0.52189
609,-0.52189
610,-0.50669
611,-0.45613000000000004
612,-0.37785
613,-0.30528
614,-0.24869000000000002
615,-0.20955
616,-0.1704
617,-0.15711
618,-0.15317999999999998
619,-0.15317999999999998
620,-0.15317999999999998
621,-0.15317999999999998
622,-0.15317999999999998
623,-0.16815
624,-0.20328
625,-0.24241999999999997
626,-0.26674000000000003
627,-0.27608
628,-0.27608
629,-0.27608
630,-0.44678
631,-0.44678
632,-0.44678
633,-0.44678
634,-0.44678
635,-0.44678
636,-0.44678
637,-0.44678
638,-0.44678
639,-0.44678
640,-0.44678
641,-0.44678
642,-0.44678
643,-0.44678
644,-0.44678
645,-0.44678
646,-0.44678
647,-0.44678
648,-0.44678
649,-0.44678
650,-0.44678
651,-0.44678
652,-0.44678
653,-0.44678
654,-0.44678
655,-0.44678
656,-0.44678
657,-0.44678
658,-0.44678
659,-0.44678
660,-0.44678
661,-0.44678
662,-0.44678
663,-0.44678
664,-0.44678
665,-0.44678
666,-0.44678
667,-0.44678
668,-0.44678
669,-0.44678
670,-0.45646000000000003
671,-0.099945
672,-0.15642
673,-0.22133000000000003
674,-0.27283
675,-0.28321
676,-0.28364
677,-0.26619
678,-0.22521999999999998
679,-0.16032000000000002
680,-0.095412
681,-0.20014
682,0.12437999999999999
683,0.4088
684,0.12243
685,0.12397000000000001
686,0.12397000000000001
687,0.12397000000000001
688,0.12397000000000001
689,0.12397000000000001
690,0.12397000000000001
691,0.12397000000000001
692,0.12397000000000001
693,0.12397000000000001
694,0.12397000000000001
695,0.12397000000000001
696,0.12397000000000001
697,0.12397000000000001
698,0.12397000000000001
699,0.48966000000000004
700,0.27366999999999997
701,-0.050857
702,-0.37538
703,-0.13046
704,-0.19537000000000002
705,-0.24996999999999997
706,-0.28364
707,-0.28364
708,-0.28364
709,-0.28364
710,-0.28364
711,-0.28364
712,-0.28364
713,-0.28364
714,-0.28638
715,-0.29791999999999996
716,-0.36282
717,-0.42773
718,-0.47093
719,-0.48744
720,-0.48744
721,-0.5160399999999999
722,-0.60946
723,-0.73927
724,-0.8661
725,-0.94399
726,-1.0119
727,-1.0768
728,-1.1417
729,-1.2066
730,-1.2715
731,-1.3736
732,-1.5
733,-1.6282
734,-1.7269
735,-1.7998
736,-1.8659999999999999
737,-1.9452
738,-2.075
739,-2.2048
740,-2.2868
741,-2.3217
742,-2.3212
743,-2.3108
744,-2.2593
745,-2.1944
746,-2.1211
747,-2.0095
748,-1.8816
749,-1.7518
750,-1.6219999999999999
751,-1.4922
752,-1.3624
753,-1.2732
754,-1.2027
755,-1.1423
756,-1.1033
757,-1.0988
758,-1.0988
759,-1.0988
760,-1.0988
761,-1.0988
762,-1.0988
763,-1.0988
764,-1.0988
765,-1.0988
766,-1.0988
767,-1.0988
768,-1.0988
769,-1.0988
770,-1.0988
771,-1.1083
772,-1.1443
773,-1.2092
774,-1.2741
775,-1.339
776,-1.4039
777,-1.4627
778,-1.5064
779,-1.5064
780,-1.5064
781,-1.432
782,-1.2572
783,-1.0625
784,-0.91694
785,-0.82105
786,-0.75615
787,-0.69124
788,-0.69124
789,-0.69124
790,-0.6602600000000001
791,-0.5796
792,-0.44978999999999997
793,-0.31998000000000004
794,-0.19017
795,-0.34942
796,0.29963
797,0.19926
798,0.32907
799,0.45237
800,0.56013
801,0.62503
802,0.68994
803,0.75484
804,0.81975
805,0.88465
806,0.92658
807,0.9391700000000001
808,0.9391700000000001
809,0.91715
810,0.73801
811,0.54585
812,0.35113
813,0.15642
814,-0.23908000000000001
815,-0.23048000000000002
816,-0.3797
817,-0.50951
818,-0.63485
819,-0.72572
820,-0.79509
821,-0.8487600000000001
822,-0.86519
823,-0.80028
824,-0.73538
825,-0.6068899999999999
826,-0.43422
827,-0.24144000000000002
828,-0.37209000000000003
829,0.3191
830,0.20315
831,0.33296
832,0.46276999999999996
833,0.59258
834,0.70494
835,0.79379
836,0.85869
837,0.9236
838,0.93794
839,0.9391700000000001
840,0.9391700000000001
841,0.9391700000000001
842,0.9391700000000001
843,0.9391700000000001
844,0.9391700000000001
845,0.9391700000000001
846,0.9391700000000001
847,1.0393
848,1.2001
849,1.3888
850,1.5576
851,1.6285
852,1.6934
853,1.7219
854,1.6856
855,1.6207
856,1.5723
857,1.5506
858,1.5506
859,1.5506
860,1.5506
861,1.5506
862,1.5609
863,1.5921
864,1.6569999999999998
865,1.7219
866,1.7544
867,1.7544
868,1.7544
869,1.7544
870,1.7544
871,1.7544
872,1.7544
873,1.7544
874,1.7544
875,1.7544
876,1.7544
877,1.7544
878,1.7544
879,1.7544
880,1.7544
881,1.7514
882,1.6995
883,1.6376
884,1.5726
885,1.5077
886,1.4428
887,1.3779
888,1.3502
889,1.3468
890,1.3468
891,1.3468
892,1.3468
893,1.3468
894,1.3468
895,1.3468
896,1.3468
897,1.2989
898,1.204
899,1.075
900,0.96599
901,0.9391700000000001
902,0.9391700000000001
903,0.93075
904,0.8840100000000001
905,0.82105
906,0.7561399999999999
907,0.69124
908,0.62633
909,0.56143
910,0.53719
911,0.53157
912,0.5271
913,0.5011399999999999
914,0.4407
915,0.3758
916,0.31089
917,0.24599000000000001
918,0.18108
919,0.14107999999999998
920,0.12397000000000001
921,0.12312000000000001
922,0.11792000000000001
923,0.2542
924,-0.07032999999999999
925,-0.33187
926,-0.44678
927,-0.44678
928,-0.44678
929,-0.44678
930,-0.44678
931,-0.44678
932,-0.44678
933,-0.44678
934,-0.47741999999999996
935,-0.1071
936,-0.172
937,-0.23690999999999998
938,-0.27699999999999997
939,-0.28364
940,-0.28364
941,-0.25906
942,-0.20965
943,-0.14474
944,-0.44678
