time,value
0,2.0187
1,3.8577
2,5.0852
3,4.9541
4,3.437
5,1.3119
6,-0.3559
7,-0.9351
8,-0.57999
9,0.029445999999999996
10,0.28795
11,0.08346100000000001
12,-0.26902
13,-0.4176
14,-0.28401
15,-0.062129
16,0.027358999999999998
17,-0.055678
18,-0.18072
19,-0.2099
20,-0.12894
21,-0.034408
22,-0.019916999999999997
23,-0.087686
24,-0.16044
25,-0.16235
26,-0.089906
27,-0.014371
28,-0.015811000000000002
29,-0.10555
30,-0.2053
31,-0.20192000000000002
32,-0.06711
33,0.088983
34,0.10601
35,-0.090989
36,-0.36149000000000003
37,-0.41481999999999997
38,-0.051396000000000004
39,0.6258
40,1.2341
41,1.3789
42,0.95941
43,0.24765
44,-0.32799999999999996
45,-0.5041800000000001
46,-0.34185
47,-0.11342
48,-0.045589
49,-0.15621
50,-0.30153
51,-0.34571999999999997
52,-0.28087
53,-0.20168
54,-0.19082000000000002
55,-0.24544000000000002
56,-0.3023
57,-0.31251999999999996
58,-0.28573000000000004
59,-0.26546
60,-0.27605
61,-0.30375
62,-0.32031
63,-0.31477
64,-0.30272
65,-0.305
66,-0.32469000000000003
67,-0.34934
68,-0.36612
69,-0.37281
70,-0.37714000000000003
71,-0.38483
72,-0.39168000000000003
73,-0.39569
74,-0.39825
75,-0.40373000000000003
76,-0.41553999999999996
77,-0.43004
78,-0.43823
79,-0.43456000000000006
80,-0.42244
81,-0.41284
82,-0.41553
83,-0.4295
84,-0.44416000000000005
85,-0.44925
86,-0.44319
87,-0.43413
88,-0.43188000000000004
89,-0.43855
90,-0.44881000000000004
91,-0.45705
92,-0.46293
93,-0.47136999999999996
94,-0.48544
95,-0.50052
96,-0.50785
97,-0.50235
98,-0.48686999999999997
