time,value
0,-0.23861
1,-0.23861
2,-0.23861
3,-0.23861
4,-0.23861
5,-0.23861
6,-0.23861
7,-0.23861
8,-0.23861
9,-0.23861
10,-0.23861
11,-0.23861
12,-0.23861
13,-0.23861
14,-0.23861
15,-0.23861
16,-0.23861
17,-0.23861
18,-0.23861
19,-0.23861
20,-0.23861
21,-0.23861
22,-0.23861
23,-0.23861
24,-0.23861
25,-0.23861
26,-0.23861
27,-0.23861
28,-0.23861
29,-0.23861
30,-0.23861
31,-0.23861
32,-0.23861
33,-0.23861
34,-0.23861
35,-0.23861
36,-0.26561999999999997
37,-0.3092
38,-0.35607
39,-0.40771
40,-0.44916000000000006
41,-0.44916000000000006
42,-0.44916000000000006
43,-0.44916000000000006
44,-0.44916000000000006
45,-0.44916000000000006
46,-0.44916000000000006
47,-0.44916000000000006
48,-0.44916000000000006
49,-0.44916000000000006
50,-0.44916000000000006
51,-0.45231000000000005
52,-0.47466
53,-0.49701000000000006
54,-0.53141
55,-0.5667300000000001
56,-0.58085
57,-0.5866600000000001
58,-0.58953
59,-0.58953
60,-0.58953
61,-0.58953
62,-0.58917
63,-0.58492
64,-0.58067
65,-0.56472
66,-0.54706
67,-0.5294
68,-0.51174
69,-0.49408
70,-0.47643
71,-0.4615
72,-0.45524
73,-0.44916000000000006
74,-0.44916000000000006
75,-0.44916000000000006
76,-0.43692
77,-0.42195
78,-0.40535
79,-0.38769000000000003
80,-0.37003
81,-0.35236999999999996
82,-0.33471999999999996
83,-0.31706
84,-0.2994
85,-0.28174
86,-0.26409
87,-0.24643
88,-0.22876999999999997
89,-0.21111
90,-0.19346
91,-0.16008
92,-0.47991000000000006
93,-0.14386
94,0.29758
95,0.14786
96,0.20831
97,0.26621
98,0.32142
99,0.37551
100,0.43776000000000004
101,0.50839
102,0.5763699999999999
103,0.63762
104,0.69703
105,0.73235
106,0.76767
107,0.81009
108,0.85367
109,0.9033399999999999
110,0.95631
111,1.0093
112,1.0623
113,1.1152
114,1.1682
115,1.2212
116,1.2742
117,1.3271
118,1.3801
119,1.4331
120,1.486
121,1.5390000000000001
122,1.5957
123,1.6585
124,1.7257
125,1.8139
126,1.9022
127,1.9905
128,2.0788
129,2.1671
130,2.2554
131,2.3243
132,2.3764
133,2.423
134,2.4583
135,2.4866
136,2.4593
137,2.4321
138,2.4004
139,2.3682
140,2.3582
141,2.3582
142,2.3533
143,2.343
144,2.326
145,2.2907
146,2.2539
147,2.1925
148,2.131
149,2.0469
150,1.9586
151,1.8781
152,1.8021
153,1.7283
154,1.6577
155,1.5871
156,1.5164
157,1.4458
158,1.3734
159,1.301
160,1.216
161,1.1278
162,1.0426
163,0.9596399999999999
164,0.88121
165,0.81058
166,0.74134
167,0.67965
168,0.61795
169,0.5644899999999999
170,0.51152
171,0.46771
172,0.42725
173,0.38948
174,0.35416
175,0.32383
176,0.30461
177,0.28514
178,0.26345999999999997
179,0.24178000000000002
180,0.19234
181,0.13935999999999998
182,0.43168999999999996
183,0.16683
184,-0.098041
185,-0.36291
186,-0.12783
187,-0.18997
188,-0.25246
189,-0.32309
190,-0.39373
191,-0.47494
192,-0.5583199999999999
193,-0.64473
194,-0.73302
195,-0.81465
196,-0.8866200000000001
197,-0.95745
198,-1.0236
199,-1.0898
200,-1.1255
201,-1.1608
202,-1.1871
203,-1.2108
204,-1.2212
205,-1.2212
206,-1.2212
207,-1.2212
208,-1.2212
209,-1.2212
210,-1.2212
211,-1.2212
212,-1.2212
213,-1.2212
214,-1.2212
215,-1.2128
216,-1.1963
217,-1.1808
218,-1.1681
219,-1.1579
220,-1.1756
221,-1.1932
222,-1.2109
223,-1.2286
224,-1.2462
225,-1.2639
226,-1.2859
227,-1.3131
228,-1.3423
229,-1.3776
230,-1.4126
231,-1.4347
232,-1.4568
233,-1.4753
234,-1.493
235,-1.5005
236,-1.5014
237,-1.4998
238,-1.4944
239,-1.4836
240,-1.4483
241,-1.413
242,-1.3898
243,-1.367
244,-1.3616
245,-1.3616
246,-1.3507
247,-1.3311
248,-1.3061
249,-1.2708
250,-1.2304
251,-1.1548
252,-1.0793
253,-0.99208
254,-0.90379
255,-0.8035399999999999
256,-0.69826
257,-0.5926600000000001
258,-0.48671000000000003
259,-0.38076
260,-0.27481
261,-0.16978
262,-0.38424
263,0.080678
264,0.44956999999999997
265,0.16059
266,0.21168
267,0.25213
268,0.28264
269,0.30029
270,0.31181
271,0.30219
272,0.29247
273,0.27481
274,0.25715
275,0.22568000000000002
276,0.19080999999999998
277,0.15567999999999999
278,0.12036
279,0.42499
280,0.24841
281,0.07183200000000001
282,-0.10475
283,-0.28131999999999996
284,-0.4579
285,-0.12685
286,-0.15449000000000002
287,-0.17952
288,-0.20060999999999998
289,-0.21825999999999998
290,-0.23592
291,-0.25358
292,-0.27124000000000004
293,-0.2889
294,-0.30655
295,-0.29278000000000004
296,-0.27557
297,-0.25574
298,-0.23473000000000002
299,-0.20686999999999997
300,-0.17155
301,-0.13623
302,-0.10092000000000001
303,-0.32826
304,-0.15168
305,0.16560999999999998
306,0.29025
307,0.11442999999999999
308,0.17982
309,0.25045
310,0.30323
311,0.33161999999999997
312,0.35774
313,0.37539
314,0.39305
315,-0.55669
316,-0.55669
317,-0.55669
318,-0.55669
319,-0.55669
320,-0.55669
321,-0.55669
322,-0.55669
323,-0.55669
324,-0.55669
325,-0.55669
326,-0.55669
327,-0.55669
328,-0.55669
329,-0.55669
330,-0.55669
331,-0.55669
332,-0.55669
333,-0.55669
334,-0.55669
335,-0.55669
336,-0.55669
337,-0.55669
338,-0.55669
339,-0.55669
340,-0.55669
341,-0.55669
342,-0.55669
343,-0.55669
344,-0.55669
345,-0.55669
346,-0.55669
347,-0.55669
348,-0.55669
349,-0.55669
350,-0.55669
351,-0.57347
352,-0.60055
353,-0.62968
354,-0.66176
355,-0.6875100000000001
356,-0.6875100000000001
357,-0.6875100000000001
358,-0.6875100000000001
359,-0.6875100000000001
360,-0.6875100000000001
361,-0.6875100000000001
362,-0.6875100000000001
363,-0.6875100000000001
364,-0.6875100000000001
365,-0.6875100000000001
366,-0.69045
367,-0.71128
368,-0.73211
369,-0.76417
370,-0.79709
371,-0.81025
372,-0.81567
373,-0.8177
374,-0.81645
375,-0.80584
376,-0.7729199999999999
377,-0.7400100000000001
378,-0.70709
379,-0.67418
380,-0.64126
381,-0.60835
382,-0.57544
383,-0.54252
384,-0.50961
385,-0.47668999999999995
386,-0.44378
387,-0.41086000000000006
388,-0.37795
389,-0.34504
390,-0.31212
391,-0.30201
392,-0.29701
393,-0.29302
394,-0.28969
395,-0.26171
396,-0.19588
397,-0.13005
398,-0.32137
399,0.051499
400,0.33692
401,0.13326
402,0.18767999999999999
403,0.23851
404,0.2795
405,0.31242
406,0.35998
407,0.43622
408,0.51532
409,0.61406
410,0.7128
411,0.81155
412,0.9102899999999999
413,1.0105
414,1.1113
415,1.2273
416,1.359
417,1.4857
418,1.5999
419,1.7106
420,1.7765
421,1.8423
422,1.8949
423,1.9453
424,1.9844
425,2.0173
426,2.0309
427,2.0197
428,2.0035
429,1.9706
430,1.9373
431,1.8756
432,1.814
433,1.7530000000000001
434,1.6922
435,1.6673
436,1.6673
437,1.6638
438,1.6547
439,1.6415
440,1.6086
441,1.5757
442,1.5579
443,1.5408
444,1.5365
445,1.5365
446,1.5245
447,1.5019999999999998
448,1.4761
449,1.4432
450,1.4168
451,1.4422
452,1.4677
453,1.4893
454,1.5106
455,1.449
456,1.3503
457,1.2561
458,1.1669
459,1.084
460,1.0182
461,0.9542
462,0.9208700000000001
463,0.88754
464,0.8823700000000001
465,0.8823700000000001
466,0.86785
467,0.8449399999999999
468,0.81779
469,0.78488
470,0.73947
471,0.6473899999999999
472,0.5553100000000001
473,0.46324
474,0.37116
475,0.32575
476,0.29283000000000003
477,0.2426
478,0.17968
479,0.45774
480,-0.20054
481,-0.16655
482,-0.26488
483,-0.3632
484,-0.43086
485,-0.49668999999999996
486,-0.54543
487,-0.5879300000000001
488,-0.62543
489,-0.65835
490,-0.68197
491,-0.68488
492,-0.6875100000000001
493,-0.6875100000000001
494,-0.6875100000000001
495,-0.6875100000000001
496,-0.6875100000000001
497,-0.6875100000000001
498,-0.6875100000000001
499,-0.6875100000000001
500,-0.6875100000000001
501,-0.69617
502,-0.73034
503,-0.76584
504,-0.83167
505,-0.8975
506,-0.9633200000000001
507,-1.0292
508,-1.095
509,-1.1608
510,-1.2515
511,-1.3781
512,-1.5041
513,-1.6275
514,-1.7508
515,-1.8174
516,-1.8833
517,-1.9323
518,-1.9765
519,-1.9957
520,-1.9957
521,-1.9896
522,-1.9721
523,-1.9524
524,-1.9195
525,-1.8866
526,-1.8087
527,-1.7275
528,-1.6337
529,-1.5349
530,-1.4675
531,-1.4304
532,-1.3945
533,-1.3616
534,-1.3287
535,-1.2958
536,-1.2629
537,-1.23
538,-1.1971
539,-1.1641
540,-1.1312
541,-1.0983
542,-1.0654
543,-1.0325
544,-0.9995700000000001
545,-0.9659700000000001
546,-0.9084700000000001
547,-0.8509700000000001
548,-0.78667
549,-0.7208399999999999
550,-0.65501
551,-0.58918
552,-0.52336
553,-0.45753
554,-0.3917
555,-0.32587
556,-0.26004
557,-0.19421
558,-0.12839
559,-0.31303000000000003
560,0.10704000000000001
561,0.3956
562,0.16333
563,0.25242
564,0.35115999999999997
565,0.44991000000000003
566,0.54865
567,0.6473899999999999
568,0.7461300000000001
569,0.84488
570,0.92132
571,0.9884
572,1.0549
573,1.1207
574,1.1865
575,1.2523
576,1.3173
577,1.3711
578,1.4248
579,1.4607
580,1.4936
581,1.4901
582,1.4667
583,1.4248
584,1.359
585,1.2932
586,1.2273
587,1.1615
588,1.0957
589,1.0299
590,0.9382799999999999
591,0.8403700000000001
592,0.74542
593,0.65251
594,0.5699
595,0.50407
596,0.43613
597,0.3578
598,0.27947
599,0.18159
600,0.414
601,-0.054911
602,-0.40607
603,-0.15338
604,-0.21921
605,-0.26831
606,-0.28247
607,-0.29504
608,-0.29504
609,-0.29504
610,-0.23645
611,-0.17146
612,-0.1102
613,-0.25335
614,-0.12905
615,0.14527
616,0.30984
617,0.47441000000000005
618,0.12785
619,0.16076
620,0.19367
621,0.22659
622,0.2595
623,0.29241999999999996
624,0.32533
625,0.34715
626,0.35381999999999997
627,0.35908
628,0.35908
629,0.35908
630,-0.08648099999999999
631,-0.08648099999999999
632,-0.08648099999999999
633,-0.08648099999999999
634,-0.08648099999999999
635,-0.08648099999999999
636,-0.08648099999999999
637,-0.08648099999999999
638,-0.08648099999999999
639,-0.08648099999999999
640,-0.08648099999999999
641,-0.08648099999999999
642,-0.08648099999999999
643,-0.08648099999999999
644,-0.08648099999999999
645,-0.08648099999999999
646,-0.08648099999999999
647,-0.08648099999999999
648,-0.08648099999999999
649,-0.08648099999999999
650,-0.08648099999999999
651,-0.08648099999999999
652,-0.08648099999999999
653,-0.08648099999999999
654,-0.08648099999999999
655,-0.08648099999999999
656,-0.08648099999999999
657,-0.08648099999999999
658,-0.08648099999999999
659,-0.08648099999999999
660,-0.08648099999999999
661,-0.08648099999999999
662,-0.08648099999999999
663,-0.08648099999999999
664,-0.08648099999999999
665,-0.08648099999999999
666,-0.067661
667,0.11316
668,0.24570999999999998
669,0.39173
670,0.10184
671,0.10184
672,0.10184
673,0.10184
674,0.10184
675,0.10184
676,0.10184
677,0.10184
678,0.10184
679,0.10184
680,0.10184
681,0.10450999999999999
682,0.12347000000000001
683,0.14244
684,0.17162
685,0.20158
686,0.24053000000000002
687,0.28301
688,0.32645
689,0.37082
690,0.41093
691,0.44088999999999995
692,0.47025
693,0.493
694,0.51576
695,0.51864
696,0.51864
697,0.52303
698,0.52967
699,0.5400699999999999
700,0.55505
701,0.57235
702,0.597
703,0.6218
704,0.65176
705,0.68172
706,0.71168
707,0.74164
708,0.77023
709,0.79791
710,0.80877
711,0.79379
712,0.7802
713,0.7728
714,0.76541
715,0.77976
716,0.79474
717,0.83049
718,0.87277
719,0.9329799999999999
720,1.0079
721,1.0828
722,1.1577
723,1.2326
724,1.3075
725,1.3824
726,1.4101
727,1.4334
728,1.4502
729,1.4642
730,1.4713
731,1.4713
732,1.4702
733,1.4662
734,1.4615
735,1.4465
736,1.4315
737,1.4165
738,1.4015
739,1.3866
740,1.3716
741,1.3566
742,1.3416
743,1.3266
744,1.3117
745,1.2972
746,1.3215
747,1.3458
748,1.371
749,1.3964
750,1.389
751,1.3591
752,1.3259
753,1.2876
754,1.2457
755,1.1858
756,1.1258
757,1.0521
758,0.97777
759,0.8918299999999999
760,0.80194
761,0.71206
762,0.6221800000000001
763,0.5322899999999999
764,0.44241
765,0.35253
766,0.26264
767,0.17276
768,0.42012
769,-0.15143
770,-0.41833000000000004
771,-0.15852
772,-0.23133
773,-0.30188000000000004
774,-0.36958
775,-0.4295
776,-0.48941999999999997
777,-0.5493399999999999
778,-0.60926
779,-0.66919
780,-0.72911
781,-0.77581
782,-0.81487
783,-0.85009
784,-0.88005
785,-0.91001
786,-0.9399799999999999
787,-0.9699399999999999
788,-1.0029
789,-1.0359
790,-1.0902
791,-1.1501
792,-1.21
793,-1.2699
794,-1.3298
795,-1.3898
796,-1.4473
797,-1.4921
798,-1.5368
799,-1.5676
800,-1.5976
801,-1.6119999999999999
802,-1.6207
803,-1.6249
804,-1.6249
805,-1.6249
806,-1.6249
807,-1.6246
808,-1.6212
809,-1.6177
810,-1.5908
811,-1.5608
812,-1.5373
813,-1.5168
814,-1.5058
815,-1.5058
816,-1.5039
817,-1.4961
818,-1.4880000000000002
819,-1.473
820,-1.4580000000000002
821,-1.4609999999999999
822,-1.4677
823,-1.4795
824,-1.4944
825,-1.5151
826,-1.5439
827,-1.5733
828,-1.6052
829,-1.6369999999999998
830,-1.6818
831,-1.7267
832,-1.7602
833,-1.7904
834,-1.8035
835,-1.8035
836,-1.8035
837,-1.8035
838,-1.8035
839,-1.8035
840,-1.8035
841,-1.7831
842,-1.7611
843,-1.7334
844,-1.7034
845,-1.6592
846,-1.6012
847,-1.5432
848,-1.4854
849,-1.4286
850,-1.3837
851,-1.3388
852,-1.2983
853,-1.2585
854,-1.2252
855,-1.1952
856,-1.1616
857,-1.1235
858,-1.0837
859,-1.0388
860,-0.99351
861,-0.9373799999999999
862,-0.88125
863,-0.8220299999999999
864,-0.7621
865,-0.70218
866,-0.64226
867,-0.58234
868,-0.52242
869,-0.46248999999999996
870,-0.40257
871,-0.34265
872,-0.27241
873,-0.20185999999999998
874,-0.11660999999999999
875,-0.13389
876,0.31553000000000003
877,0.15304
878,0.24291999999999997
879,0.33281
880,0.42557
881,0.5382100000000001
882,0.65085
883,0.7700899999999999
884,0.8899299999999999
885,0.9590299999999999
886,1.0068
887,1.052
888,1.0945
889,1.1334
890,1.1634
891,1.1926
892,1.2115
893,1.2305
894,1.2332
895,1.2332
896,1.2276
897,1.2191
898,1.2077
899,1.1928
900,1.1752
901,1.1486
902,1.122
903,1.0921
904,1.0621
905,1.0322
906,1.0022
907,0.9753700000000001
908,0.9507200000000001
909,0.9354399999999999
910,0.9354399999999999
911,0.93448
912,0.92879
913,0.9231
914,0.9085200000000001
915,0.8935299999999999
916,0.8720399999999999
917,0.84834
918,0.82129
919,0.79133
920,0.76136
921,0.7314
922,0.70144
923,0.67148
924,0.64152
925,0.59823
926,0.55347
927,0.50663
928,0.45883999999999997
929,0.40524
930,0.34531999999999996
931,0.29012
932,0.24783000000000002
933,0.20708000000000001
934,0.1921
935,0.17712
936,0.15461
937,0.13072
938,0.10298
939,0.36483000000000004
940,0.2655
941,0.23515999999999998
942,0.21123000000000003
943,0.21123000000000003
944,0.21123000000000003
