time,value
0,-0.42377
1,-0.42377
2,-0.42377
3,-0.42377
4,-0.42377
5,-0.42377
6,-0.42377
7,-0.42377
8,-0.42377
9,-0.42377
10,-0.42377
11,-0.42377
12,-0.42377
13,-0.42377
14,-0.42377
15,-0.42377
16,-0.42377
17,-0.42377
18,-0.42377
19,-0.42377
20,-0.42377
21,-0.42377
22,-0.42377
23,-0.42377
24,-0.42377
25,-0.42377
26,-0.42377
27,-0.42377
28,-0.42377
29,-0.42377
30,-0.42377
31,-0.42377
32,-0.42377
33,-0.42377
34,-0.42377
35,-0.42377
36,-0.42377
37,-0.42377
38,-0.42377
39,-0.42377
40,-0.42377
41,-0.42377
42,-0.42377
43,-0.42377
44,-0.42377
45,-0.42377
46,-0.42377
47,-0.42377
48,-0.42377
49,-0.42377
50,-0.42377
51,-0.42377
52,-0.42357
53,-0.38129
54,-0.39798
55,-0.35831999999999997
56,-0.29675999999999997
57,-0.23911999999999997
58,-0.26168
59,-0.13051
60,-0.069225
61,0.048981
62,-0.047363999999999996
63,0.10002
64,-0.075565
65,0.014934000000000001
66,0.12394000000000001
67,-0.06359
68,0.05388300000000001
69,-0.024577
70,-0.037892
71,0.02028
72,0.05248
73,-0.099452
74,-0.037861
75,0.011886
76,-0.054849
77,0.016881
78,-0.0072043
79,0.0611
80,-0.0041728
81,0.024501
82,0.075934
83,-0.02308
84,0.0089796
85,-0.022721
86,0.021458
87,-0.047138
88,0.056728999999999995
89,0.044545999999999995
90,0.0090401
91,0.049504
92,0.023191999999999997
93,0.0033236
94,0.1171
95,0.10592
96,-0.035025
97,0.04428
98,-0.036482
99,0.051788
100,-0.056305999999999995
101,0.007967199999999999
102,-0.02695
103,-0.029999
104,-0.034821
105,0.10336
106,-0.023621
107,0.044456
108,-0.08466
109,-0.054679
110,-0.0031245
111,-0.0027667
112,0.016685
113,-0.074101
114,0.015737
115,-0.10839000000000001
116,-0.080761
117,0.002349
118,-0.0021697
119,-0.041625999999999996
120,-0.012611
121,0.044788
122,-0.044145
123,0.062190999999999996
124,0.10835999999999998
125,0.10751
126,0.068233
127,0.050942
128,-0.019759
129,-0.004997
130,0.093476
131,-0.029716000000000003
132,0.12103
133,0.027482999999999997
134,-0.029814
135,0.062298
136,0.055847
137,0.07735800000000001
138,0.12839
139,0.049779000000000004
140,0.088811
141,0.0055592
142,-0.070809
143,0.12997
144,0.081081
145,0.057186
146,-0.06619900000000001
147,-0.091974
148,-0.088308
149,0.031914
150,0.015835
151,0.03706
152,0.043813
153,0.032534
154,0.055298
155,0.11696
156,0.03847
157,-0.017356
158,-0.011124
159,0.14177
160,0.19705
161,0.09409
162,0.071056
163,0.07035
164,0.085847
165,0.052412
166,-0.054360000000000006
167,0.078854
168,0.027905000000000003
169,-0.013411000000000001
170,0.020909999999999998
171,-0.014161000000000002
172,-0.047797000000000006
173,0.008323200000000001
174,0.069756
175,0.29256
176,0.29083000000000003
177,0.011665
178,0.05845
179,-0.0075333
180,-0.1116
181,0.093589
182,0.050055
183,0.14462
184,0.073523
185,0.16371
186,0.057687999999999996
187,-0.044206999999999996
188,0.041818
189,0.029979000000000002
190,0.18523
191,0.1139
192,0.098339
193,-0.066241
194,0.15475999999999998
195,0.060541
196,0.15642
197,0.2856
198,0.41785
199,0.24458000000000002
200,0.24595
201,0.24914
202,0.055028
203,0.035064
204,0.21266999999999997
205,0.17125
206,0.20822
207,0.031382
208,0.061312
209,0.06017
210,0.074544
211,0.017227000000000003
212,0.20678000000000002
213,0.37625
214,0.10214
215,0.17397
216,4.2002
217,16.945
218,0.14155
219,0.15962
220,0.052933
221,0.06816599999999999
222,-0.047064999999999996
223,0.023981
224,0.083188
225,-0.045183999999999995
226,0.012361
227,-0.087511
228,-0.013412
229,-0.037135
230,0.14759
231,0.09425399999999999
232,0.045271
233,0.1087
234,-0.049727
235,0.034994
236,0.020874
237,-0.015661
238,-0.045659
239,0.086177
240,-0.0074209
241,0.074789
242,-0.054971000000000006
243,-0.0074393
244,-0.057363
245,-0.01763
246,0.07751
247,-0.073805
248,0.08616499999999999
249,-0.014831
250,0.07624700000000001
251,-0.14392
252,-0.031835
253,0.045239999999999995
254,-0.00087903
255,0.014417
256,-0.024622
257,0.014874
258,-0.064343
259,-0.10228
260,-0.0011107
261,0.040825
262,-0.083991
263,-0.14149
264,-0.070548
265,-0.073837
266,-0.029951
267,-0.149
268,-0.064071
269,-0.059826
270,-0.10752
271,0.021165
272,-0.040843
273,0.14644000000000001
274,-0.045189
275,-0.09159400000000001
276,-0.08454600000000001
277,0.0113
278,-0.007579600000000001
279,0.0088463
280,-0.045666000000000005
281,-0.14407999999999999
282,-0.049045
283,-0.095486
284,-0.057295000000000006
285,-0.013647999999999999
286,-0.055122000000000004
287,-0.049924
288,-0.058477999999999995
289,-0.044094
290,-0.045433
291,0.027822000000000003
292,0.012765
293,0.08551
294,-0.073795
295,0.026708999999999997
296,-0.040342
297,-0.050937
298,-0.028968999999999998
299,-0.079209
300,-0.091668
301,0.0018027000000000002
302,-0.042809
303,0.023842
304,0.06590800000000001
305,0.06405
306,-0.004531
307,0.016071000000000002
308,0.00071373
309,-0.040899
310,-0.11001
311,-0.08276599999999999
312,-0.24502
313,-0.27216999999999997
314,-0.3246
315,-0.42376
316,-0.42377
317,-0.42377
318,-0.42377
