time,value
0,1.7712
1,1.4222
2,1.4222
3,1.4222
4,1.0731
5,-0.55571
6,-0.67205
7,-0.67205
8,-0.67205
9,-0.67205
10,-0.67205
11,-0.67205
12,-0.67205
13,-0.67205
14,-0.67205
15,-0.67205
16,-0.67205
17,0.4914
18,1.7712
19,1.4222
20,1.7712
21,1.4222
22,1.4222
23,1.4222
24,-0.20667
25,-0.55571
26,-0.67205
27,-0.67205
28,-0.67205
29,-0.67205
30,-0.67205
31,-0.67205
32,-0.67205
33,-0.67205
34,-0.67205
35,-0.67205
36,-0.67205
37,1.0731
38,1.7712
39,1.4222
40,1.4222
41,1.7712
42,1.4222
43,1.0731
44,-0.43936000000000003
45,-0.67205
46,-0.67205
47,-0.67205
48,-0.67205
49,-0.67205
50,-0.67205
51,-0.67205
52,-0.67205
53,-0.67205
54,-0.67205
55,-0.67205
56,-0.67205
57,2.1202
58,1.4222
59,1.7712
60,1.4222
61,1.4222
62,1.4222
63,0.026016
64,-0.67205
65,-0.67205
66,-0.67205
67,-0.67205
68,-0.67205
69,-0.67205
70,-0.67205
71,-0.67205
72,-0.67205
73,-0.67205
74,-0.67205
75,-0.67205
76,0.72409
77,1.7712
78,1.4222
79,1.7712
80,1.4222
81,1.4222
82,1.0731
83,-0.67205
84,-0.67205
85,-0.67205
86,-0.67205
87,-0.67205
88,-0.67205
89,-0.67205
90,-0.67205
91,-0.67205
92,-0.67205
93,-0.67205
94,-0.67205
95,-0.67205
96,1.0731
97,1.7712
98,1.7712
99,1.4222
100,1.4222
101,1.4222
102,0.4914
103,-0.55571
104,-0.67205
105,-0.67205
106,-0.67205
107,-0.67205
108,-0.67205
109,-0.67205
110,-0.67205
111,-0.67205
112,-0.67205
113,-0.67205
114,-0.67205
115,-0.67205
116,-0.67205
117,-0.67205
118,-0.67205
119,-0.67205
120,-0.67205
121,-0.67205
122,-0.67205
123,-0.67205
124,-0.67205
125,-0.67205
126,-0.67205
127,-0.67205
128,-0.67205
129,-0.67205
130,-0.67205
131,-0.67205
132,-0.67205
133,1.4222
134,1.7712
135,1.7712
136,1.7712
137,1.4222
138,1.4222
139,1.7712
140,1.4222
141,1.4222
142,0.72409
143,-0.67205
144,-0.67205
145,-0.67205
146,-0.67205
147,-0.67205
148,-0.67205
149,-0.67205
150,-0.67205
151,-0.67205
152,-0.67205
153,-0.67205
154,1.4222
155,1.7712
156,1.4222
157,1.4222
158,1.7712
159,1.4222
160,0.25871
161,-0.67205
162,-0.67205
163,-0.67205
164,-0.67205
165,-0.67205
166,-0.67205
167,-0.67205
168,-0.67205
169,-0.67205
170,-0.67205
171,-0.67205
172,-0.67205
173,1.0731
174,1.7712
175,1.4222
176,1.4222
177,1.7712
178,1.4222
179,0.4914
180,-0.67205
181,-0.67205
182,-0.67205
183,-0.67205
184,-0.67205
185,-0.67205
186,-0.67205
187,-0.67205
188,-0.67205
189,-0.67205
190,-0.67205
191,-0.67205
192,-0.67205
193,1.7712
194,1.7712
195,1.7712
196,1.4222
197,1.4222
198,1.4222
199,-0.55571
200,-0.67205
201,-0.67205
202,-0.67205
203,-0.67205
204,-0.67205
205,-0.67205
206,-0.67205
207,-0.67205
208,-0.67205
209,-0.67205
210,-0.67205
211,-0.67205
212,0.4914
213,1.7712
214,1.4222
215,1.7712
216,1.4222
217,1.4222
218,0.72409
219,-0.55571
220,-0.67205
221,-0.67205
222,-0.67205
223,-0.67205
224,-0.67205
225,-0.67205
226,-0.67205
227,-0.67205
228,-0.67205
229,-0.67205
230,-0.67205
231,-0.67205
232,-0.67205
233,-0.67205
234,-0.67205
235,-0.67205
236,-0.67205
237,-0.67205
238,-0.67205
239,-0.67205
240,-0.67205
241,-0.67205
242,-0.67205
243,-0.67205
244,-0.67205
245,-0.67205
246,-0.67205
247,-0.67205
248,-0.67205
249,-0.67205
250,1.7712
251,1.7712
252,1.7712
253,1.4222
254,1.7712
255,1.4222
256,1.4222
257,1.4222
258,1.7712
259,0.026016
260,-0.67205
261,-0.67205
262,-0.67205
263,-0.67205
264,-0.67205
265,-0.67205
266,-0.67205
267,-0.67205
268,-0.67205
269,-0.67205
270,-0.67205
271,1.0731
272,1.4222
273,1.7712
274,1.4222
275,1.4222
276,1.4222
277,0.4914
278,-0.67205
279,-0.67205
280,-0.67205
281,-0.67205
282,-0.67205
283,-0.67205
284,-0.67205
285,-0.67205
286,-0.67205
287,-0.67205
288,-0.67205
289,-0.67205
290,1.0731
291,1.7712
292,1.4222
293,1.4222
294,1.7712
295,1.4222
296,0.25871
297,-0.55571
298,-0.67205
299,-0.67205
300,-0.67205
301,-0.67205
302,-0.67205
303,-0.67205
304,-0.67205
305,-0.67205
306,-0.67205
307,-0.67205
308,-0.67205
309,0.026016
310,1.4222
311,1.7712
312,1.4222
313,1.7712
314,1.4222
315,1.4222
316,-0.67205
317,-0.67205
318,-0.67205
319,-0.67205
320,-0.67205
321,-0.67205
322,-0.67205
323,-0.67205
324,-0.67205
325,-0.67205
326,-0.67205
327,-0.67205
328,-0.67205
329,0.25871
330,1.7712
331,1.4222
332,1.7712
333,1.4222
334,1.4222
335,1.0731
336,-0.43936000000000003
337,-0.67205
338,-0.67205
339,-0.67205
340,-0.67205
341,-0.67205
342,-0.67205
343,-0.67205
344,-0.67205
345,-0.67205
346,-0.67205
347,-0.67205
348,-0.67205
349,-0.67205
350,-0.67205
351,-0.67205
352,-0.67205
353,-0.67205
354,-0.67205
355,-0.67205
356,-0.67205
357,-0.67205
358,-0.67205
359,-0.67205
360,-0.67205
361,-0.67205
362,-0.67205
363,-0.67205
364,-0.67205
365,-0.67205
366,0.72409
367,1.7712
368,1.7712
369,1.4222
370,1.7712
371,1.4222
372,1.7712
373,1.4222
374,1.4222
375,1.0731
376,-0.43936000000000003
377,-0.67205
378,-0.67205
379,-0.67205
380,-0.67205
381,-0.67205
382,-0.67205
383,-0.67205
384,-0.67205
385,-0.67205
386,-0.67205
387,0.026016
388,1.7712
389,1.4222
390,1.7712
391,1.4222
392,1.4222
393,1.4222
394,-0.32302
395,-0.67205
396,-0.67205
397,-0.67205
398,-0.67205
399,-0.67205
400,-0.67205
401,-0.67205
402,-0.67205
403,-0.67205
404,-0.67205
405,-0.67205
406,-0.67205
407,2.1202
408,1.4222
409,1.7712
410,1.4222
411,1.4222
412,1.4222
413,-0.20667
414,-0.55571
415,-0.67205
416,-0.67205
417,-0.67205
418,-0.67205
419,-0.67205
420,-0.67205
421,-0.67205
422,-0.67205
423,-0.67205
424,-0.67205
425,-0.67205
426,0.72409
427,1.4222
428,1.7712
429,1.4222
430,1.7712
431,1.4222
432,1.0731
433,-0.67205
434,-0.67205
435,-0.67205
436,-0.67205
437,-0.67205
438,-0.67205
439,-0.67205
440,-0.67205
441,-0.67205
442,-0.67205
443,-0.67205
444,-0.67205
445,-0.67205
446,-0.67205
447,-0.67205
448,-0.67205
449,-0.67205
450,-0.67205
451,-0.67205
452,-0.67205
453,-0.67205
454,-0.67205
455,-0.67205
456,-0.67205
457,-0.67205
458,-0.67205
459,-0.67205
460,-0.67205
461,-0.67205
462,0.72409
463,1.7712
464,1.4222
465,1.7712
466,1.4222
467,1.7712
468,1.4222
469,1.4222
470,1.7712
471,1.4222
472,-0.20667
473,-0.67205
474,-0.67205
475,-0.67205
476,-0.67205
477,-0.67205
478,-0.67205
479,-0.67205
480,-0.67205
481,-0.67205
482,-0.67205
483,-0.67205
484,1.7712
485,1.7712
486,1.4222
487,1.7712
488,1.4222
489,1.4222
490,0.25871
491,-0.67205
492,-0.67205
493,-0.67205
494,-0.67205
495,-0.67205
496,-0.67205
497,-0.67205
498,-0.67205
499,-0.67205
500,-0.67205
501,-0.67205
502,-0.67205
503,1.0731
504,1.7712
505,1.7712
506,1.4222
507,1.4222
508,1.4222
509,0.72409
510,-0.43936000000000003
511,-0.67205
512,-0.67205
513,-0.67205
514,-0.67205
515,-0.67205
516,-0.67205
517,-0.67205
518,-0.67205
519,-0.67205
520,-0.67205
521,-0.67205
522,0.026016
523,1.7712
524,1.4222
525,1.7712
526,1.4222
527,1.4222
528,1.4222
529,0.72409
530,-0.43936000000000003
531,-0.67205
532,-0.67205
533,-0.67205
534,-0.67205
535,-0.67205
536,-0.67205
537,-0.67205
538,-0.67205
539,-0.67205
540,-0.67205
541,-0.67205
542,-0.67205
543,-0.67205
544,-0.67205
545,-0.67205
546,-0.67205
547,-0.67205
548,-0.67205
549,-0.67205
550,-0.67205
551,-0.67205
552,-0.67205
553,-0.67205
554,-0.67205
555,-0.67205
556,-0.67205
557,-0.67205
558,1.7712
559,1.7712
560,1.4222
561,1.7712
562,1.7712
563,1.4222
564,1.4222
565,1.7712
566,1.4222
567,1.4222
568,-0.32302
569,-0.67205
570,-0.67205
571,-0.67205
572,-0.67205
573,-0.67205
574,-0.67205
575,-0.67205
576,-0.67205
577,-0.67205
578,-0.67205
579,1.7712
580,1.4222
581,1.7712
582,1.4222
583,1.4222
584,1.4222
585,0.25871
586,-0.55571
587,-0.67205
588,-0.67205
589,-0.67205
590,-0.67205
591,-0.67205
592,-0.67205
593,-0.67205
594,-0.67205
595,-0.67205
596,-0.67205
597,-0.67205
598,-0.67205
599,-0.67205
600,-0.67205
601,-0.67205
602,-0.67205
603,-0.67205
604,-0.67205
605,-0.67205
606,-0.67205
607,-0.67205
608,-0.67205
609,-0.67205
610,0.026016
611,1.7712
612,1.7712
613,1.7712
614,1.4222
615,1.7712
616,1.4222
617,1.4222
618,1.7712
619,1.4222
620,1.4222
621,-0.55571
622,-0.67205
623,-0.67205
624,-0.67205
625,-0.67205
626,-0.67205
627,-0.67205
628,-0.67205
629,-0.67205
630,-0.67205
631,-0.67205
632,-0.67205
633,-0.67205
634,-0.67205
635,-0.67205
636,-0.67205
637,-0.67205
638,-0.67205
639,-0.67205
640,-0.67205
641,-0.67205
642,-0.67205
643,-0.67205
644,-0.67205
645,-0.67205
646,-0.67205
647,2.1202
648,1.7712
649,1.4222
650,1.7712
651,1.4222
652,1.7712
653,1.4222
654,1.4222
655,1.4222
656,1.4222
657,-0.55571
658,-0.67205
659,-0.67205
660,-0.67205
661,-0.67205
662,-0.67205
663,-0.67205
664,-0.67205
665,-0.67205
666,-0.67205
667,-0.67205
668,-0.67205
669,-0.67205
670,-0.67205
671,-0.67205
672,-0.67205
673,-0.67205
674,-0.67205
675,-0.67205
676,-0.67205
677,-0.67205
678,-0.67205
679,-0.67205
680,-0.67205
681,-0.67205
682,2.1202
683,1.7712
684,1.4222
685,1.7712
686,1.4222
687,1.7712
688,1.4222
689,1.4222
690,1.4222
691,0.72409
692,-0.43936000000000003
693,-0.67205
694,-0.67205
695,-0.67205
696,-0.67205
697,-0.67205
698,-0.67205
699,-0.67205
700,-0.67205
701,-0.67205
702,-0.67205
703,-0.67205
704,-0.67205
705,-0.67205
706,-0.67205
707,-0.67205
708,-0.67205
709,-0.67205
710,-0.67205
711,-0.67205
712,-0.67205
713,-0.67205
714,-0.67205
715,-0.67205
716,1.0731
717,1.7712
718,1.7712
719,1.7712
