time,value
0,1.3469
1,1.3469
2,1.3469
3,1.3469
4,1.3469
5,1.3469
6,1.3469
7,1.3469
8,1.3469
9,1.3469
10,1.3469
11,1.3469
12,1.3469
13,1.3469
14,1.3469
15,1.3469
16,1.3469
17,1.3469
18,1.3469
19,1.3469
20,1.3469
21,1.3469
22,1.3469
23,1.3469
24,1.3469
25,1.3469
26,1.3469
27,1.3469
28,1.3469
29,1.3469
30,1.3469
31,1.3469
32,1.3469
33,1.3469
34,1.3469
35,1.3469
36,1.3469
37,1.3469
38,1.3469
39,1.3469
40,1.3469
41,1.3469
42,1.3469
43,1.3469
44,1.3469
45,1.3469
46,1.3469
47,1.3469
48,1.3469
49,1.3469
50,1.3469
51,1.3469
52,1.3469
53,1.3469
54,1.3469
55,1.3469
56,1.3469
57,1.3469
58,1.3469
59,1.3469
60,1.3469
61,1.3469
62,1.3469
63,1.3469
64,1.3469
65,1.3469
66,1.3469
67,1.3469
68,1.3469
69,1.3469
70,1.3469
71,1.3469
72,1.3469
73,1.3469
74,1.3469
75,1.3469
76,1.3469
77,1.3469
78,1.3469
79,1.3469
80,1.3469
81,1.3469
82,1.3469
83,1.3469
84,1.3469
85,1.3469
86,1.3469
87,1.3469
88,1.3469
89,1.3469
90,1.3469
91,1.3469
92,1.3448
93,1.3239
94,1.3031
95,1.2672
96,1.2189
97,1.1706
98,1.1223
99,1.074
100,1.0234
101,0.9698399999999999
102,0.9163100000000001
103,0.8245899999999999
104,0.72797
105,0.63135
106,0.53472
107,0.4381
108,0.34148
109,0.24486
110,0.15039
111,0.30146
112,-0.13432
113,-0.10932
114,-0.19386
115,-0.27841
116,-0.36295
117,-0.44748999999999994
118,-0.51625
119,-0.57305
120,-0.62931
121,-0.65347
122,-0.6776300000000001
123,-0.7017800000000001
124,-0.7259399999999999
125,-0.7500899999999999
126,-0.7683
127,-0.78593
128,-0.78861
129,-0.76446
130,-0.7403
131,-0.71614
132,-0.69199
133,-0.66783
134,-0.64368
135,-0.61952
136,-0.59537
137,-0.57121
138,-0.54705
139,-0.5229
140,-0.49873999999999996
141,-0.47458999999999996
142,-0.45043
143,-0.42675
144,-0.41435
145,-0.40195
146,-0.39559
147,-0.39559
148,-0.39559
149,-0.39559
150,-0.39559
151,-0.39484
152,-0.39289
153,-0.39093
154,-0.38058000000000003
155,-0.3685
156,-0.35641999999999996
157,-0.34434000000000003
158,-0.33226999999999995
159,-0.32019000000000003
160,-0.30811
161,-0.29775999999999997
162,-0.2958
163,-0.29384
164,-0.29309
165,-0.29309
166,-0.29309
167,-0.29309
168,-0.29309
169,-0.29309
170,-0.29309
171,-0.29309
172,-0.29309
173,-0.29309
174,-0.29309
175,-0.29309
176,-0.29309
177,-0.29505
178,-0.29733000000000004
179,-0.30256
180,-0.31464000000000003
181,-0.32671999999999995
182,-0.33879000000000004
183,-0.35086999999999996
184,-0.36295
185,-0.37503000000000003
186,-0.38711
187,-0.39918000000000003
188,-0.41126
189,-0.42333999999999994
190,-0.43542
191,-0.44748999999999994
192,-0.45957
193,-0.47165
194,-0.48373
195,-0.48296000000000006
196,-0.48198
197,-0.47622
198,-0.46413999999999994
199,-0.45206
200,-0.43998999999999994
201,-0.42791
202,-0.41583000000000003
203,-0.40375
204,-0.39168000000000003
205,-0.3796
206,-0.36751999999999996
207,-0.35544000000000003
208,-0.34336
209,-0.33129000000000003
210,-0.31921
211,-0.30713
212,-0.29505
213,-0.28298
214,-0.2709
215,-0.25882
216,-0.24674000000000001
217,-0.23465999999999998
218,-0.22259
219,-0.21051
220,-0.20779
221,-0.21628000000000003
222,-0.22476999999999997
223,-0.2474
224,-0.27155
225,-0.29571
226,-0.31986
227,-0.34402
228,-0.36817
229,-0.39233
230,-0.41648
231,-0.44064
232,-0.4648
233,-0.48895
234,-0.5131100000000001
235,-0.5372600000000001
236,-0.56142
237,-0.58557
238,-0.60323
239,-0.61629
240,-0.62931
241,-0.64139
242,-0.65347
243,-0.66555
244,-0.6776300000000001
245,-0.6897
246,-0.70844
247,-0.7277
248,-0.74879
249,-0.77294
250,-0.7971
251,-0.82125
252,-0.84541
253,-0.86956
254,-0.8937200000000001
255,-0.9178799999999999
256,-0.9420299999999999
257,-0.96619
258,-0.99034
259,-1.0145
260,-1.0387
261,-1.0628
262,-1.087
263,-1.1111
264,-1.1353
265,-1.1594
266,-1.1836
267,-1.2077
268,-1.2319
269,-1.2561
270,-1.2802
271,-1.3014
272,-1.318
273,-1.3347
274,-1.3475
275,-1.3595
276,-1.3716
277,-1.3837
278,-1.3958
279,-1.4052
280,-1.4137
281,-1.4206
282,-1.4206
283,-1.4206
284,-1.4206
285,-1.4206
286,-1.4206
287,-1.4206
288,-1.4206
289,-1.4144
290,-1.4026
291,-1.3909
292,-1.3788
293,-1.3667
294,-1.3546
295,-1.3426
296,-1.3305
297,-1.3184
298,-1.3063
299,-1.2942
300,-1.2822
301,-1.2701
302,-1.258
303,-1.2459
304,-1.2339
305,-1.2218
306,-1.2097
307,-1.1976
308,-1.1855
309,-1.1735
310,-1.1614
311,-1.1493
312,-1.1372
313,-1.1252
314,-1.1131
315,1.1947
316,1.1947
317,1.1947
318,1.1947
319,1.1947
320,1.1947
321,1.1947
322,1.1947
323,1.1947
324,1.1947
325,1.1947
326,1.1947
327,1.1947
328,1.1947
329,1.1947
330,1.1947
331,1.1947
332,1.1947
333,1.1947
334,1.1947
335,1.1947
336,1.1947
337,1.1947
338,1.1947
339,1.1947
340,1.1947
341,1.1947
342,1.1947
343,1.1947
344,1.1947
345,1.1947
346,1.1947
347,1.1947
348,1.1947
349,1.1947
350,1.1947
351,1.1947
352,1.1947
353,1.1947
354,1.1947
355,1.1947
356,1.1947
357,1.1947
358,1.1947
359,1.1947
360,1.1947
361,1.1947
362,1.1947
363,1.1947
364,1.1947
365,1.1947
366,1.1947
367,1.1947
368,1.1947
369,1.1947
370,1.1947
371,1.1947
372,1.1947
373,1.1947
374,1.1947
375,1.1947
376,1.1947
377,1.1947
378,1.1947
379,1.1947
380,1.1947
381,1.1947
382,1.1947
383,1.1947
384,1.1947
385,1.1947
386,1.1947
387,1.1947
388,1.1947
389,1.1947
390,1.1947
391,1.1947
392,1.1947
393,1.1947
394,1.1947
395,1.1947
396,1.1947
397,1.1947
398,1.1947
399,1.1947
400,1.2244
401,1.2637
402,1.3055
403,1.3573
404,1.4092
405,1.4611
406,1.5130000000000001
407,1.5615
408,1.5798
409,1.598
410,1.5922
411,1.5662
412,1.5403
413,1.5144
414,1.4884
415,1.46
416,1.4285
417,1.3969
418,1.3244
419,1.2466
420,1.1688
421,1.091
422,1.0132
423,0.93537
424,0.85757
425,0.77745
426,0.68948
427,0.60151
428,0.51165
429,0.42086999999999997
430,0.3301
431,0.23933000000000001
432,0.14855
433,0.34201
434,0.18502000000000002
435,-0.32511999999999996
436,-0.10099
437,-0.13989000000000001
438,-0.17879
439,-0.21769000000000002
440,-0.2566
441,-0.28912
442,-0.32101
443,-0.33686
444,-0.32389
445,-0.31092
446,-0.29795
447,-0.28499
448,-0.27202
449,-0.25905
450,-0.24608000000000002
451,-0.24047
452,-0.23801
453,-0.23592
454,-0.23592
455,-0.23592
456,-0.23592
457,-0.23592
458,-0.23565999999999998
459,-0.22935
460,-0.22305
461,-0.21349
462,-0.20052
463,-0.18755
464,-0.17459000000000002
465,-0.16162
466,-0.14945
467,-0.13859000000000002
468,-0.12772
469,-0.12587
470,-0.12587
471,-0.12587
472,-0.12587
473,-0.12587
474,-0.12587
475,-0.12587
476,-0.12402
477,-0.11315
478,-0.10228999999999999
479,-0.46531000000000006
480,-0.40048
481,-0.33564
482,-0.2708
483,-0.20596
484,-0.17523
485,-0.17698
486,-0.17873
487,-0.24101
488,-0.30585
489,-0.37068
490,-0.43551999999999996
491,-0.097131
492,-0.11429
493,-0.13216
494,-0.15636
495,-0.19526
496,-0.23417
497,-0.27307
498,-0.31196999999999997
499,-0.35088
500,-0.38978
501,-0.42868
502,-0.45318
503,-0.46965
504,-0.48581
505,-0.49878
506,-0.51174
507,-0.52471
508,-0.53768
509,-0.55065
510,-0.55672
511,-0.5626800000000001
512,-0.56607
513,-0.56607
514,-0.56607
515,-0.56607
516,-0.56607
517,-0.56516
518,-0.56235
519,-0.55955
520,-0.5489
521,-0.53593
522,-0.5229600000000001
523,-0.5099899999999999
524,-0.49701999999999996
525,-0.48406000000000005
526,-0.47108999999999995
527,-0.46075
528,-0.47092
529,-0.48108
530,-0.49282
531,-0.50579
532,-0.51875
533,-0.53172
534,-0.54469
535,-0.55766
536,-0.57062
537,-0.5835899999999999
538,-0.5965600000000001
539,-0.60953
540,-0.6225
541,-0.63546
542,-0.6484300000000001
543,-0.66391
544,-0.68003
545,-0.69855
546,-0.72448
547,-0.75042
548,-0.77636
549,-0.80229
550,-0.8282299999999999
551,-0.85416
552,-0.8801
553,-0.8990600000000001
554,-0.91307
555,-0.92706
556,-0.9400299999999999
557,-0.95299
558,-0.96596
559,-0.97893
560,-0.9919
561,-1.0049
562,-1.0178
563,-1.0308
564,-1.0438
565,-1.0567
566,-1.0697
567,-1.0827
568,-1.0956
569,-1.1086
570,-1.1216
571,-1.1345
572,-1.1475
573,-1.1605
574,-1.1734
575,-1.1864
576,-1.1994
577,-1.2123
578,-1.2253
579,-1.2383
580,-1.2513
581,-1.2642
582,-1.2772
583,-1.2902
584,-1.3031
585,-1.3161
586,-1.3291
587,-1.3419999999999999
588,-1.355
589,-1.368
590,-1.3809
591,-1.3939
592,-1.4069
593,-1.4198
594,-1.4299
595,-1.4391
596,-1.4465
597,-1.4465
598,-1.4465
599,-1.4465
600,-1.4465
601,-1.4465
602,-1.4465
603,-1.4465
604,-1.4398
605,-1.4272
606,-1.4146
607,-1.4016
608,-1.3886
609,-1.3757
610,-1.3627
611,-1.3497
612,-1.3441
613,-1.3395
614,-1.3364
615,-1.3364
616,-1.3364
617,-1.3364
618,-1.3364
619,-1.3346
620,-1.3262
621,-1.3178
622,-1.2979
623,-1.2719
624,-1.246
625,-1.2201
626,-1.1941
627,-1.1682
628,-1.1423
629,-1.1163
630,-1.3345
631,-1.3345
632,-1.3345
633,-1.3345
634,-1.3345
635,-1.3345
636,-1.3345
637,-1.3345
638,-1.3345
639,-1.3345
640,-1.3345
641,-1.3345
642,-1.3345
643,-1.3345
644,-1.3345
645,-1.3345
646,-1.3345
647,-1.3345
648,-1.3345
649,-1.3345
650,-1.3345
651,-1.3345
652,-1.3345
653,-1.3345
654,-1.3345
655,-1.3345
656,-1.3345
657,-1.3345
658,-1.3345
659,-1.3345
660,-1.3345
661,-1.3345
662,-1.3345
663,-1.3345
664,-1.3345
665,-1.3345
666,-1.3345
667,-1.3345
668,-1.3345
669,-1.3345
670,-1.3345
671,-1.3345
672,-1.3345
673,-1.3345
674,-1.3345
675,-1.3345
676,-1.3345
677,-1.3345
678,-1.3345
679,-1.3345
680,-1.3345
681,-1.3345
682,-1.3345
683,-1.3345
684,-1.3345
685,-1.3345
686,-1.3345
687,-1.3345
688,-1.3345
689,-1.3345
690,-1.3345
691,-1.3345
692,-1.3345
693,-1.3345
694,-1.3345
695,-1.3345
696,-1.3345
697,-1.3345
698,-1.3345
699,-1.3345
700,-1.3345
701,-1.3345
702,-1.3345
703,-1.3345
704,-1.3345
705,-1.3345
706,-1.3345
707,-1.3345
708,-1.3345
709,-1.3345
710,-1.3345
711,-1.3345
712,-1.3345
713,-1.3345
714,-1.3345
715,-1.2924
716,-1.2365
717,-1.1771
718,-1.1034
719,-1.0296
720,-0.95589
721,-0.88215
722,-0.80769
723,-0.72659
724,-0.6455
725,-0.55914
726,-0.46838
727,-0.37763
728,-0.28688
729,-0.19612000000000002
730,-0.10670999999999999
731,-0.10982
732,0.32863000000000003
733,0.13394
734,0.19633
735,0.25873
736,0.32111999999999996
737,0.38351999999999997
738,0.44591000000000003
739,0.5083
740,0.56361
741,0.5948899999999999
742,0.62616
743,0.65164
744,0.67433
745,0.69702
746,0.7197100000000001
747,0.7424
748,0.7487699999999999
749,0.74279
750,0.73626
751,0.6965600000000001
752,0.65685
753,0.61715
754,0.57744
755,0.53774
756,0.49733
757,0.45686000000000004
758,0.41463999999999995
759,0.36926
760,0.32388
761,0.2785
762,0.23313000000000003
763,0.18775
764,0.14237
765,0.47026
766,0.30769
767,0.17278
768,0.25261
769,-0.07242799999999999
770,-0.18587
771,-0.29930999999999996
772,-0.41276
773,-0.10163
774,-0.10776
775,-0.11389
776,-0.1115
777,-0.10015
778,-0.45875
779,-0.40203
780,-0.34531
781,-0.27804
782,-0.19372
783,-0.10941
784,0.093139
785,0.32003000000000004
786,0.11232
787,0.1577
788,0.20307999999999998
789,0.24846
790,0.29383000000000004
791,0.33921
792,0.38459
793,0.42996999999999996
794,0.47534
795,0.52072
796,0.5661
797,0.61148
798,0.65685
799,0.70372
800,0.7520100000000001
801,0.8003
802,0.85124
803,0.9022899999999999
804,0.95334
805,1.0044
806,1.0554
807,1.1047
808,1.1536
809,1.1997
810,1.2394
811,1.2791
812,1.3188
813,1.3585
814,1.3982
815,1.4379
816,1.4776
817,1.5079
818,1.5329
819,1.5577
820,1.5803
821,1.6030000000000002
822,1.6257
823,1.6484
824,1.6711
825,1.6787
826,1.6861
827,1.6878
828,1.6821
829,1.6765
830,1.6708
831,1.6651
832,1.6579
833,1.6473
834,1.6367
835,1.6124
836,1.584
837,1.5557
838,1.5273
839,1.4989
840,1.4706
841,1.4422
842,1.4139
843,1.3855
844,1.3571
845,1.3288
846,1.3004
847,1.2721
848,1.2437
849,1.2153
850,1.1928
851,1.1774
852,1.1619
853,1.1552
854,1.1496
855,1.1439
856,1.1382
857,1.1325
858,1.1258
859,1.1187
860,1.1106
861,1.0993
862,1.0879
863,1.0766
864,1.0653
865,1.0539
866,1.0426
867,1.0312
868,1.0168
869,1.0003
870,0.98369
871,0.9666799999999999
872,0.9496600000000001
873,0.9326399999999999
874,0.9156299999999999
875,0.89861
876,0.8722200000000001
877,0.8450799999999999
878,0.8153699999999999
879,0.78133
880,0.7473
881,0.71327
882,0.67924
883,0.6452
884,0.61117
885,0.57714
886,0.5431
887,0.50907
888,0.47503999999999996
889,0.441
890,0.40697
891,0.37294
892,0.3389
893,0.30548000000000003
894,0.28218000000000004
895,0.25888
896,0.23589000000000002
897,0.2132
898,0.19050999999999998
899,0.16782
900,0.14513
901,0.12525
902,0.10960999999999999
903,0.45518000000000003
904,0.39514
905,0.33842
906,0.2817
907,0.22498
908,0.16826
909,0.11777
910,0.069483
911,0.1453
912,-0.043779000000000005
913,-0.23285
914,-0.060163999999999995
915,-0.088525
916,-0.11689000000000001
917,-0.14525
918,-0.17361
919,-0.23113000000000003
920,-0.31468
921,-0.39823000000000003
922,-0.48328000000000004
923,-0.11073
924,-0.12775
925,-0.14476
926,-0.16178
927,-0.1724
928,-0.18205
929,-0.19045
930,-0.19612000000000002
931,-0.20179
932,-0.20745999999999998
933,-0.21314
934,-0.21841999999999998
935,-0.22225
936,-0.22609
937,-0.22739
938,-0.22739
939,-0.22739
940,-0.22739
941,-0.22739
942,-0.22739
943,-0.22739
944,-0.22739
