time,value
0,1.9848
1,1.9848
2,2.2309
3,1.9848
4,2.2309
5,1.9848
6,2.2309
7,1.9848
8,1.9848
9,2.2309
10,1.9848
11,2.2309
12,1.9848
13,2.2309
14,1.9848
15,1.9848
16,2.2309
17,1.9848
18,2.2309
19,1.9848
20,1.9848
21,2.2309
22,1.9848
23,2.2309
24,1.9848
25,1.9848
26,2.2309
27,1.9848
28,1.9848
29,1.9848
30,2.2309
31,1.9848
32,0.40975
33,-0.42698
34,-0.4762
35,-0.4762
36,-0.4762
37,-0.4762
38,-0.4762
39,-0.4762
40,-0.4762
41,-0.4762
42,-0.4762
43,-0.4762
44,-0.4762
45,-0.4762
46,-0.4762
47,-0.4762
48,-0.4762
49,-0.4762
50,-0.4762
51,-0.4762
52,-0.4762
53,-0.4762
54,-0.4762
55,-0.4762
56,-0.4762
57,-0.4762
58,-0.4762
59,-0.4762
60,-0.4762
61,-0.4762
62,-0.4762
63,-0.4762
64,-0.4762
65,-0.4762
66,-0.4762
67,-0.4762
68,-0.4762
69,-0.4762
70,-0.4762
71,-0.4762
72,-0.4762
73,-0.4762
74,-0.4762
75,-0.4762
76,-0.4762
77,-0.4762
78,-0.4762
79,-0.4762
80,-0.4762
81,-0.4762
82,-0.4762
83,-0.4762
84,-0.4762
85,-0.4762
86,-0.4762
87,-0.4762
88,-0.4762
89,-0.4762
90,-0.4762
91,-0.4762
92,-0.4762
93,-0.4762
94,-0.4762
95,-0.4762
96,-0.4762
97,-0.4762
98,-0.4762
99,-0.4762
100,-0.4762
101,-0.4762
102,-0.4762
103,-0.4762
104,-0.4762
105,-0.4762
106,-0.4762
107,-0.4762
108,-0.4762
109,-0.4762
110,-0.4762
111,-0.4762
112,-0.4762
113,-0.4762
114,-0.4762
115,-0.4762
116,-0.4762
117,-0.4762
118,-0.4762
119,-0.4762
120,-0.4762
121,-0.4762
122,-0.4762
123,-0.4762
124,-0.4762
125,-0.4762
126,-0.4762
127,-0.4762
128,-0.4762
129,-0.4762
130,-0.4762
131,-0.4762
132,-0.4762
133,-0.4762
134,-0.4762
135,-0.4762
136,-0.4762
137,-0.4762
138,-0.4762
139,-0.4762
140,-0.4762
141,-0.4762
142,-0.4762
143,-0.4762
144,-0.4762
145,-0.4762
146,-0.4762
147,-0.4762
148,-0.4762
149,-0.4762
150,-0.4762
151,-0.4762
152,-0.4762
153,-0.4762
154,-0.4762
155,-0.4762
156,-0.4762
157,-0.4762
158,-0.4762
159,-0.4762
160,-0.4762
161,-0.4762
162,-0.4762
163,-0.4762
164,-0.4762
165,-0.4762
166,-0.4762
167,-0.4762
168,-0.4762
169,-0.4762
170,-0.4762
171,-0.4762
172,-0.4762
173,-0.4762
174,-0.4762
175,-0.4762
176,-0.4762
177,-0.4762
178,-0.4762
179,-0.4762
180,-0.4762
181,-0.4762
182,-0.4762
183,-0.4762
184,-0.4762
185,-0.4762
186,-0.4762
187,-0.4762
188,-0.4762
189,-0.4762
190,-0.4762
191,-0.4762
192,-0.4762
193,-0.4762
194,-0.4762
195,-0.4762
196,-0.4762
197,-0.4762
198,-0.4762
199,-0.4762
200,-0.4762
201,-0.4762
202,-0.4762
203,-0.4762
204,-0.4762
205,-0.4762
206,-0.4762
207,-0.4762
208,-0.4762
209,-0.4762
210,-0.4762
211,-0.4762
212,-0.4762
213,-0.4762
214,-0.4762
215,-0.4762
216,-0.4762
217,-0.4762
218,-0.4762
219,-0.4762
220,-0.4762
221,-0.4762
222,-0.4762
223,-0.4762
224,-0.4762
225,-0.4762
226,-0.4762
227,-0.4762
228,-0.4762
229,-0.4762
230,-0.4762
231,-0.4762
232,-0.4762
233,-0.4762
234,-0.4762
235,-0.4762
236,-0.4762
237,-0.4762
238,-0.4762
239,-0.4762
240,-0.4762
241,-0.4762
242,-0.4762
243,-0.4762
244,-0.4762
245,-0.4762
246,-0.4762
247,-0.4762
248,-0.4762
249,-0.4762
250,-0.4762
251,-0.4762
252,-0.4762
253,-0.4762
254,-0.4762
255,-0.4762
256,-0.4762
257,-0.4762
258,-0.4762
259,-0.4762
260,-0.4762
261,-0.4762
262,-0.4762
263,-0.4762
264,-0.4762
265,-0.4762
266,-0.4762
267,-0.4762
268,-0.4762
269,-0.4762
270,-0.4762
271,-0.4762
272,-0.4762
273,-0.4762
274,-0.4762
275,-0.4762
276,-0.4762
277,-0.4762
278,-0.4762
279,-0.4762
280,-0.4762
281,-0.4762
282,-0.4762
283,-0.4762
284,-0.4762
285,-0.4762
286,-0.4762
287,-0.4762
288,-0.4762
289,-0.4762
290,-0.4762
291,-0.4762
292,-0.4762
293,-0.4762
294,-0.4762
295,-0.4762
296,-0.4762
297,-0.4762
298,-0.4762
299,-0.4762
300,-0.4762
301,-0.4762
302,-0.4762
303,-0.4762
304,-0.4762
305,-0.4762
306,-0.4762
307,-0.4762
308,-0.4762
309,1.9848
310,1.9848
311,2.2309
312,2.2309
313,2.2309
314,2.2309
315,1.9848
316,2.2309
317,2.2309
318,1.9848
319,2.2309
320,2.2309
321,1.9848
322,2.2309
323,1.9848
324,2.2309
325,2.2309
326,1.9848
327,2.2309
328,1.9848
329,2.2309
330,1.9848
331,1.9848
332,2.2309
333,1.9848
334,2.2309
335,1.9848
336,2.2309
337,1.9848
338,2.2309
339,1.9848
340,1.9848
341,2.2309
342,1.9848
343,2.2309
344,1.9848
345,1.9848
346,2.2309
347,1.9848
348,2.2309
349,1.9848
350,2.2309
351,1.9848
352,1.9848
353,2.2309
354,1.9848
355,2.2309
356,1.9848
357,1.9848
358,2.2309
359,1.9848
360,2.2309
361,1.9848
362,2.2309
363,1.9848
364,2.2309
365,1.9848
366,1.9848
367,2.2309
368,1.9848
369,2.2309
370,1.9848
371,1.9848
372,2.2309
373,0.90195
374,-0.42698
375,-0.4762
376,-0.4762
377,-0.4762
378,-0.4762
379,-0.4762
380,-0.4762
381,-0.4762
382,-0.4762
383,-0.4762
384,-0.4762
385,-0.4762
386,-0.4762
387,-0.4762
388,-0.4762
389,-0.4762
390,-0.4762
391,-0.4762
392,-0.4762
393,-0.4762
394,-0.4762
395,-0.4762
396,-0.4762
397,-0.4762
398,-0.4762
399,-0.4762
400,-0.4762
401,-0.4762
402,-0.4762
403,-0.4762
404,-0.4762
405,-0.4762
406,-0.4762
407,-0.4762
408,-0.4762
409,-0.4762
410,-0.4762
411,-0.4762
412,-0.4762
413,-0.4762
414,-0.4762
415,-0.4762
416,-0.4762
417,-0.4762
418,-0.4762
419,-0.4762
420,-0.4762
421,-0.4762
422,-0.4762
423,-0.4762
424,-0.4762
425,-0.4762
426,-0.4762
427,-0.4762
428,-0.4762
429,-0.4762
430,-0.4762
431,-0.4762
432,-0.4762
433,-0.4762
434,-0.4762
435,-0.4762
436,-0.4762
437,-0.4762
438,-0.4762
439,-0.4762
440,-0.4762
441,-0.4762
442,-0.4762
443,-0.4762
444,-0.4762
445,-0.4762
446,-0.4762
447,-0.4762
448,-0.4762
449,-0.4762
450,-0.4762
451,-0.4762
452,-0.4762
453,-0.4762
454,-0.4762
455,-0.4762
456,-0.4762
457,-0.4762
458,-0.4762
459,-0.4762
460,-0.4762
461,-0.4762
462,-0.4762
463,-0.4762
464,-0.4762
465,-0.4762
466,-0.4762
467,-0.4762
468,-0.42698
469,1.9848
470,1.9848
471,2.2309
472,2.2309
473,2.2309
474,2.2309
475,1.9848
476,2.2309
477,2.2309
478,1.9848
479,2.2309
480,2.2309
481,1.9848
482,2.2309
483,2.2309
484,1.9848
485,2.2309
486,1.9848
487,2.2309
488,1.9848
489,2.2309
490,1.9848
491,2.2309
492,1.9848
493,2.2309
494,1.9848
495,2.2309
496,1.9848
497,1.9848
498,2.2309
499,1.9848
500,2.2309
501,1.9848
502,2.2309
503,1.9848
504,2.2309
505,-0.37776
506,-0.4762
507,-0.4762
508,-0.4762
509,-0.4762
510,-0.4762
511,-0.4762
512,-0.4762
513,-0.4762
514,-0.4762
515,-0.4762
516,-0.4762
517,-0.4762
518,-0.4762
519,-0.4762
520,-0.4762
521,-0.4762
522,-0.4762
523,-0.4762
524,-0.4762
525,-0.4762
526,-0.4762
527,-0.4762
528,-0.4762
529,-0.4762
530,-0.4762
531,-0.4762
532,-0.4762
533,-0.4762
534,-0.4762
535,-0.4762
536,-0.4762
537,-0.4762
538,-0.4762
539,-0.4762
540,-0.4762
541,-0.4762
542,-0.4762
543,-0.4762
544,-0.4762
545,-0.4762
546,-0.4762
547,-0.4762
548,-0.4762
549,-0.4762
550,-0.4762
551,-0.4762
552,-0.4762
553,-0.4762
554,-0.4762
555,-0.4762
556,-0.4762
557,-0.4762
558,-0.4762
559,-0.4762
560,-0.4762
561,-0.4762
562,-0.4762
563,-0.4762
564,-0.4762
565,-0.4762
566,-0.4762
567,-0.4762
568,-0.4762
569,-0.4762
570,-0.4762
571,-0.4762
572,-0.4762
573,-0.4762
574,-0.4762
575,-0.4762
576,-0.4762
577,-0.4762
578,-0.4762
579,-0.4762
580,-0.4762
581,-0.4762
582,-0.4762
583,-0.4762
584,-0.4762
585,-0.4762
586,-0.4762
587,-0.4762
588,-0.4762
589,-0.4762
590,-0.4762
591,-0.4762
592,-0.4762
593,-0.4762
594,-0.4762
595,-0.4762
596,-0.4762
597,-0.4762
598,-0.4762
599,-0.4762
600,-0.4762
601,-0.4762
602,-0.4762
603,-0.4762
604,-0.4762
605,-0.4762
606,-0.4762
607,-0.4762
608,-0.4762
609,-0.4762
610,-0.4762
611,-0.4762
612,-0.4762
613,-0.4762
614,-0.4762
615,-0.4762
616,-0.4762
617,-0.4762
618,-0.4762
619,-0.4762
620,-0.4762
621,-0.4762
622,-0.4762
623,-0.4762
624,-0.4762
625,-0.4762
626,-0.4762
627,-0.4762
628,-0.4762
629,-0.4762
630,-0.4762
631,-0.4762
632,-0.4762
633,-0.4762
634,-0.4762
635,-0.4762
636,-0.4762
637,-0.4762
638,-0.4762
639,-0.4762
640,-0.4762
641,-0.4762
642,-0.4762
643,-0.4762
644,-0.4762
645,-0.4762
646,-0.4762
647,-0.4762
648,-0.4762
649,-0.4762
650,-0.4762
651,-0.4762
652,-0.4762
653,-0.4762
654,-0.4762
655,-0.4762
656,-0.4762
657,-0.4762
658,-0.4762
659,-0.4762
660,-0.4762
661,-0.4762
662,-0.4762
663,-0.4762
664,-0.4762
665,-0.4762
666,-0.4762
667,-0.4762
668,-0.4762
669,-0.4762
670,-0.4762
671,-0.4762
672,-0.4762
673,-0.4762
674,-0.4762
675,-0.4762
676,-0.4762
677,-0.4762
678,-0.4762
679,-0.4762
680,-0.4762
681,-0.4762
682,-0.4762
683,-0.4762
684,-0.4762
685,-0.4762
686,-0.4762
687,-0.4762
688,-0.4762
689,-0.4762
690,-0.4762
691,-0.4762
692,-0.4762
693,-0.4762
694,-0.4762
695,-0.4762
696,-0.4762
697,-0.4762
698,-0.4762
699,-0.4762
700,-0.4762
701,-0.4762
702,-0.4762
703,-0.4762
704,-0.4762
705,-0.4762
706,-0.4762
707,-0.4762
708,-0.4762
709,-0.4762
710,-0.4762
711,-0.4762
712,-0.4762
713,-0.4762
714,-0.4762
715,-0.4762
716,-0.4762
717,-0.4762
718,-0.4762
719,-0.4762
