time,value
0,0.092586
1,-0.1115
2,-0.21718
3,-0.13438
4,-0.075831
5,0.13022
6,0.39571999999999996
7,-0.47105
8,-0.18515
9,-0.007908700000000001
10,0.17723
11,-0.08999
12,-0.52836
13,-0.34999
14,0.24636
15,-0.061826
16,-0.23975
17,0.5885199999999999
18,-0.87744
19,-0.24783000000000002
20,-0.20509000000000002
21,0.26979000000000003
22,-0.23721
23,0.8615799999999999
24,0.060259
25,-0.073074
26,0.16847
27,-0.074643
28,0.5693
29,-0.37918
30,0.30179
31,0.05864400000000001
32,-0.087473
33,0.49372
34,0.019357
35,0.37688
36,0.33786
37,-0.18402000000000002
38,-0.27157
39,0.064777
40,0.23564000000000002
41,0.065273
42,-0.08872000000000001
43,0.037062
44,0.095898
45,-0.015907
46,-0.00054623
47,-0.47394
48,0.16125
49,0.21728000000000003
50,-1.0109
51,-0.24195
52,-0.29795
53,0.042194
54,-0.17257
55,0.010140999999999999
56,-0.20703000000000002
57,-0.3039
58,0.7025600000000001
59,0.021796
60,0.076872
61,-0.40693
62,0.19676
63,0.041594
64,-0.051624
65,-0.007289699999999999
66,-0.16445
67,0.1887
68,-0.40917
69,0.29486999999999997
70,0.13588
71,-0.27957
72,-0.6765899999999999
73,0.14794000000000002
74,-0.30704000000000004
75,0.34683
76,-0.38661
77,0.081887
78,-1.6158
79,-1.6158
80,-1.6158
81,-1.6158
82,-1.6158
83,-1.6158
84,-1.6158
85,-1.6158
86,-1.6158
87,-1.6158
88,-1.6158
89,1.6233
90,1.6233
91,1.6233
92,1.6233
93,1.6233
94,1.6233
95,1.6233
96,1.6233
97,1.6233
98,1.6233
99,1.6233
100,0.3712
101,1.6233
102,1.6233
103,1.6233
104,1.6233
105,1.6233
106,1.6233
107,1.6233
108,1.6233
109,1.6233
110,1.6233
111,1.6233
112,1.6233
113,-1.6158
114,-1.6158
115,-1.6158
116,-1.6158
117,-1.6158
118,-1.6158
119,-1.6158
120,-1.6158
121,-1.6158
122,-1.6158
123,-1.6158
124,-0.092019
125,-0.11381
126,-0.39953
127,0.7450100000000001
