time,value
0,-0.10755
1,-0.10755
2,-0.10755
3,-0.10755
4,-0.10755
5,-0.10755
6,-0.10755
7,-0.10755
8,-0.10755
9,-0.10755
10,-0.10755
11,-0.10755
12,-0.10755
13,-0.10755
14,-0.10755
15,-0.10755
16,-0.10755
17,-0.10755
18,-0.10755
19,-0.10755
20,-0.10755
21,-0.10755
22,-0.10755
23,-0.10755
24,-0.10755
25,-0.10755
26,-0.10755
27,-0.10755
28,-0.10755
29,-0.10755
30,-0.10755
31,-0.10755
32,-0.10755
33,-0.10755
34,-0.10755
35,-0.10755
36,-0.10755
37,-0.10755
38,-0.10755
39,-0.10755
40,-0.10755
41,-0.10755
42,-0.10755
43,-0.10755
44,-0.10755
45,-0.10755
46,-0.10755
47,-0.10755
48,-0.10755
49,-0.10755
50,-0.10755
51,-0.14365
52,-0.19052
53,-0.26726
54,-0.34401
55,-0.42076
56,-0.4975
57,-0.57425
58,-0.65099
59,-0.7277399999999999
60,-0.8044899999999999
61,-0.88123
62,-0.9579799999999999
63,-1.02
64,-1.0575
65,-0.9808
66,-0.90405
67,-0.8273
68,-0.7861100000000001
69,-0.75915
70,-0.75885
71,-0.75885
72,-0.75885
73,-0.75885
74,-0.75885
75,-0.75885
76,-0.75885
77,-0.75885
78,-0.75885
79,-0.75885
80,-0.74563
81,-0.7248899999999999
82,-0.6530699999999999
83,-0.5763199999999999
84,-0.49958
85,-0.45155
86,-0.43703000000000003
87,-0.4332
88,-0.4332
89,-0.4332
90,-0.4332
91,-0.4332
92,-0.4332
93,-0.4332
94,-0.4332
95,-0.4332
96,-0.4332
97,-0.4332
98,-0.4332
99,-0.4332
100,-0.4332
101,-0.4332
102,-0.4332
103,-0.4332
104,-0.4332
105,-0.4332
106,-0.4332
107,-0.4332
108,-0.4332
109,-0.4332
110,-0.4332
111,-0.4332
112,-0.4332
113,-0.4332
114,-0.4332
115,-0.4332
116,-0.4332
117,-0.4332
118,-0.44027
119,-0.45064
120,-0.52447
121,-0.60121
122,-0.67796
123,-0.75471
124,-0.83145
125,-0.9082
126,-0.9849399999999999
127,-1.0617
128,-1.1384
129,-1.2152
130,-1.2919
131,-1.3687
132,-1.3944
133,-1.4102
134,-1.4102
135,-1.4102
136,-1.4102
137,-1.4102
138,-1.4102
139,-1.4102
140,-1.3777
141,-1.2491
142,-1.1073
143,-0.95383
144,-0.82363
145,-0.70285
146,-0.6261
147,-0.5493600000000001
148,-0.47261000000000003
149,-0.44004
150,-0.43382
151,-0.4332
152,-0.4456
153,-0.51612
154,-0.62403
155,-0.77752
156,-0.93101
157,-1.0845
158,-1.0845
159,-1.0845
160,-1.0845
161,-1.0845
162,-1.0845
163,-1.0845
164,-1.0845
165,-1.0845
166,-1.0845
167,-1.0845
168,-1.0845
169,-1.0845
170,-1.0405
171,-0.9870200000000001
172,-0.91027
173,-0.8335299999999999
174,-0.75678
175,-0.68003
176,-0.60329
177,-0.52654
178,-0.44978999999999997
179,-0.37305
180,-0.2963
181,-0.21955999999999998
182,-0.15861
183,-0.10755
184,-0.10755
185,-0.10755
186,-0.10755
187,-0.32736
188,-0.16493
189,0.35257
190,0.15098
191,0.25261999999999996
192,0.37989
193,0.5333899999999999
194,0.68688
195,0.8403700000000001
196,0.9938600000000001
197,1.1474
198,1.3008
199,1.4543
200,1.6078
201,1.7613
202,1.9148
203,2.0683
204,2.1915
205,2.2724
206,2.3504
207,2.4272
208,2.4678
209,2.4977
210,2.4977
211,2.4977
212,2.4977
213,2.4977
214,2.4977
215,2.4977
216,2.4977
217,2.4977
218,2.4977
219,2.4977
220,2.4903
221,2.4707
222,2.394
223,2.3172
224,2.2405
225,2.1637
226,2.0869999999999997
227,2.0102
228,1.9335
229,1.8567
230,1.78
231,1.7032
232,1.6265
233,1.5547
234,1.5339
235,1.5207
236,1.5207
237,1.5207
238,1.5207
239,1.5207
240,1.5207
241,1.5207
242,1.5207
243,1.5207
244,1.5207
245,1.5204
246,1.4935
247,1.4523
248,1.3755
249,1.2988
250,1.222
251,1.1453
252,1.0685
253,0.99179
254,0.91504
255,0.8383
256,0.76155
257,0.68481
258,0.60806
259,0.5313100000000001
260,0.45457
261,0.37782
262,0.30107
263,0.25421
264,0.21811
265,0.21811
266,0.21683000000000002
267,0.21268
268,0.16625
269,0.45628
270,0.072551
271,-0.28109
272,-0.43666000000000005
273,-0.10755
274,-0.10755
275,-0.11460999999999999
276,-0.12498
277,-0.19881
278,-0.27555999999999997
279,-0.35231
280,-0.40284000000000003
281,-0.42773
282,-0.4332
283,-0.4332
284,-0.4332
285,-0.4332
286,-0.4332
287,-0.4332
288,-0.4332
289,-0.48426
290,-0.5452100000000001
291,-0.6219600000000001
292,-0.67914
293,-0.71026
294,-0.66551
295,-0.58877
296,-0.51202
297,-0.45153000000000004
298,-0.43908
299,-0.4332
300,-0.4332
301,-0.4332
302,-0.4332
303,-0.4332
304,-0.4332
305,-0.4332
306,-0.4332
307,-0.4332
308,-0.4332
309,-0.42700000000000005
310,-0.39174000000000003
311,-0.33779000000000003
312,-0.26104
313,-0.18429
314,-0.10755
315,-1.2364
316,-1.2364
317,-1.2364
318,-1.2364
319,-1.2364
320,-1.2364
321,-1.2364
322,-1.2364
323,-1.2364
324,-1.2364
325,-1.2364
326,-1.2364
327,-1.2364
328,-1.2364
329,-1.2364
330,-1.2364
331,-1.2364
332,-1.2364
333,-1.2364
334,-1.2364
335,-1.2364
336,-1.2364
337,-1.2364
338,-1.2364
339,-1.2364
340,-1.2364
341,-1.2364
342,-1.2364
343,-1.2364
344,-1.2364
345,-1.2364
346,-1.2364
347,-1.2364
348,-1.2364
349,-1.2364
350,-1.2364
351,-1.2364
352,-1.2364
353,-1.2364
354,-1.2364
355,-1.2364
356,-1.2364
357,-1.2364
358,-1.2364
359,-1.2364
360,-1.2364
361,-1.2364
362,-1.2364
363,-1.2364
364,-1.2364
365,-1.2364
366,-1.2433
367,-1.2523
368,-1.2669
369,-1.2814
370,-1.2957
371,-1.2986
372,-1.2986
373,-1.2986
374,-1.3015
375,-1.3098
376,-1.3219999999999998
377,-1.3367
378,-1.35
379,-1.3609
380,-1.3609
381,-1.3609
382,-1.3609
383,-1.3473
384,-1.3283
385,-1.2990000000000002
386,-1.2704
387,-1.2439
388,-1.2237
389,-1.209
390,-1.1944
391,-1.1797
392,-1.165
393,-1.1504
394,-1.1357
395,-1.121
396,-1.1064
397,-1.0917
398,-1.077
399,-1.0623
400,-1.0532
401,-1.0504
402,-1.0497
403,-1.0497
404,-1.0497
405,-1.0497
406,-1.0497
407,-1.0497
408,-1.0497
409,-1.0387
410,-1.0255
411,-1.0108
412,-0.9985700000000001
413,-0.99024
414,-0.9874
415,-0.9874
416,-0.9874
417,-0.9844200000000001
418,-0.97015
419,-0.9556899999999999
420,-0.9410200000000001
421,-0.9263399999999999
422,-0.9116700000000001
423,-0.897
424,-0.88233
425,-0.86767
426,-0.853
427,-0.8383299999999999
428,-0.82365
429,-0.80783
430,-0.7844399999999999
431,-0.75863
432,-0.72929
433,-0.7013
434,-0.67394
435,-0.65872
436,-0.64405
437,-0.62938
438,-0.6147100000000001
439,-0.60004
440,-0.58537
441,-0.57052
442,-0.5526800000000001
443,-0.53105
444,-0.50171
445,-0.47236999999999996
446,-0.44303000000000003
447,-0.42345
448,-0.40576
449,-0.39109
450,-0.37455
451,-0.35552
452,-0.32923
453,-0.29989
454,-0.27055
455,-0.22568000000000002
456,-0.13489
457,-0.18032
458,0.33314
459,0.1453
460,0.21673
461,0.24606999999999998
462,0.27541
463,0.30475
464,0.32565
465,0.34151
466,0.35629
467,0.36978
468,0.37771
469,0.38206
470,0.38206
471,0.38206
472,0.38206
473,0.38206
474,0.38206
475,0.38206
476,0.38642
477,0.39435
478,0.40784000000000004
479,0.42251000000000005
480,0.43718
481,0.45185
482,0.46652
483,0.48118999999999995
484,0.49586
485,0.51053
486,0.5252
487,0.53987
488,0.55566
489,0.57271
490,0.5989399999999999
491,0.6282800000000001
492,0.65762
493,0.68696
494,0.7163
495,0.74564
496,0.77498
497,0.79828
498,0.8178
499,0.8178
500,0.8178
501,0.8178
502,0.8332200000000001
503,0.8562200000000001
504,0.88521
505,0.91559
506,0.9496899999999999
507,0.98869
508,1.0327
509,1.0767
510,1.1196
511,1.1382
512,1.1556
513,1.1703
514,1.185
515,1.1996
516,1.2143
517,1.229
518,1.2436
519,1.2583
520,1.273
521,1.2876
522,1.3023
523,1.3101
524,1.3158
525,1.3158
526,1.3158
527,1.3158
528,1.3158
529,1.3158
530,1.3158
531,1.3158
532,1.3158
533,1.3158
534,1.3158
535,1.3158
536,1.3158
537,1.3158
538,1.3158
539,1.3158
540,1.3158
541,1.3158
542,1.3158
543,1.3151
544,1.3123
545,1.3031
546,1.2884
547,1.2738
548,1.26
549,1.2561
550,1.2535
551,1.2535
552,1.251
553,1.2471
554,1.2333
555,1.2187
556,1.204
557,1.1948
558,1.192
559,1.1913
560,1.1912
561,1.1861
562,1.1782
563,1.1635
564,1.1489
565,1.1342
566,1.1195
567,1.1049
568,1.0902
569,1.0755
570,1.0609
571,1.0462
572,1.0315
573,1.0168
574,1.0022
575,0.9875
576,0.97283
577,0.95816
578,0.9434899999999999
579,0.9288200000000001
580,0.91415
581,0.8997299999999999
582,0.88585
583,0.88005
584,0.88005
585,0.88005
586,0.8789
587,0.87018
588,0.8590399999999999
589,0.8443700000000001
590,0.8297
591,0.81503
592,0.8003600000000001
593,0.78569
594,0.7710199999999999
595,0.75635
596,0.74168
597,0.72701
598,0.71234
599,0.69767
600,0.6829999999999999
601,0.66833
602,0.65366
603,0.63899
604,0.62432
605,0.60965
606,0.5949800000000001
607,0.58405
608,0.5781
609,0.58665
610,0.60132
611,0.6159899999999999
612,0.62445
613,0.61454
614,0.60212
615,0.58745
616,0.57723
617,0.56881
618,0.56881
619,0.56881
620,0.56881
621,0.56881
622,0.56881
623,0.56881
624,0.56881
625,0.56881
626,0.56881
627,0.56881
628,0.56881
629,0.56881
630,-0.78825
631,-0.78825
632,-0.78825
633,-0.78825
634,-0.78825
635,-0.78825
636,-0.78825
637,-0.78825
638,-0.78825
639,-0.78825
640,-0.78825
641,-0.78825
642,-0.78825
643,-0.78825
644,-0.78825
645,-0.78825
646,-0.78825
647,-0.78825
648,-0.78825
649,-0.78825
650,-0.78825
651,-0.78825
652,-0.78825
653,-0.78825
654,-0.78825
655,-0.78825
656,-0.78825
657,-0.78825
658,-0.78825
659,-0.78825
660,-0.78825
661,-0.78825
662,-0.78825
663,-0.78825
664,-0.78825
665,-0.78825
666,-0.78825
667,-0.78825
668,-0.78825
669,-0.78825
670,-0.78825
671,-0.78825
672,-0.78825
673,-0.78825
674,-0.78825
675,-0.78825
676,-0.78825
677,-0.78825
678,-0.78825
679,-0.78825
680,-0.78825
681,-0.79684
682,-0.80799
683,-0.82625
684,-0.84477
685,-0.8635200000000001
686,-0.89633
687,-0.93284
688,-0.96936
689,-1.0023
690,-1.0285
691,-1.0498
692,-1.0681
693,-1.0881
694,-1.111
695,-1.1475
696,-1.1840000000000002
697,-1.2205
698,-1.2486
699,-1.2733
700,-1.2916
701,-1.308
702,-1.3194
703,-1.3148
704,-1.2965
705,-1.2783
706,-1.26
707,-1.2418
708,-1.2235
709,-1.2052
710,-1.1901
711,-1.1768
712,-1.1756
713,-1.1756
714,-1.1756
715,-1.1756
716,-1.1756
717,-1.1756
718,-1.1756
719,-1.1756
720,-1.1756
721,-1.1756
722,-1.1756
723,-1.1756
724,-1.1756
725,-1.1756
726,-1.1756
727,-1.1756
728,-1.1756
729,-1.1756
730,-1.1756
731,-1.1756
732,-1.1756
733,-1.1756
734,-1.1756
735,-1.1756
736,-1.1756
737,-1.1756
738,-1.1756
739,-1.1759
740,-1.1769
741,-1.188
742,-1.2062
743,-1.2245
744,-1.2413
745,-1.2487
746,-1.2531
747,-1.2531
748,-1.2514
749,-1.249
750,-1.2314
751,-1.2131
752,-1.1949
753,-1.1766
754,-1.1584
755,-1.1401
756,-1.1216
757,-1.0994
758,-1.0725
759,-1.036
760,-0.99946
761,-0.96295
762,-0.93858
763,-0.91656
764,-0.8983
765,-0.8800399999999999
766,-0.8617799999999999
767,-0.84352
768,-0.82526
769,-0.80701
770,-0.76941
771,-0.67467
772,-0.57211
773,-0.46256
774,-0.36963
775,-0.28342
776,-0.22864
777,-0.17387
778,-0.11909000000000002
779,-0.36536
780,-0.17537
781,0.065428
782,0.19792
783,0.42245
784,0.13209
785,0.18687
786,0.24164000000000002
787,0.29641999999999996
788,0.33294
789,0.36946
790,0.40597
791,0.43706999999999996
792,0.46371999999999997
793,0.48345
794,0.50156
795,0.5183399999999999
796,0.52885
797,0.52885
798,0.52885
799,0.52885
800,0.52885
801,0.52885
802,0.52885
803,0.53025
804,0.5332100000000001
805,0.5476
806,0.56586
807,0.58412
808,0.5985699999999999
809,0.604
810,0.60633
811,0.60633
812,0.6138399999999999
813,0.62607
814,0.6625800000000001
815,0.6991
816,0.7356199999999999
817,0.76254
818,0.78475
819,0.80323
820,0.8227899999999999
821,0.8469700000000001
822,0.87725
823,0.9137700000000001
824,0.9502799999999999
825,0.98611
826,1.0068
827,1.0268
828,1.045
829,1.0589
830,1.0698
831,1.0712
832,1.0712
833,1.0712
834,1.0784
835,1.0957
836,1.1136
837,1.1319
838,1.1501
839,1.1684
840,1.1867
841,1.2049
842,1.2232
843,1.2414
844,1.2597
845,1.278
846,1.2962
847,1.3145
848,1.3327
849,1.351
850,1.3692
851,1.3875
852,1.4058
853,1.4240000000000002
854,1.4423
855,1.4521
856,1.4585
857,1.4586
858,1.4604
859,1.4673
860,1.4902
861,1.5267
862,1.5632
863,1.5974
864,1.6072
865,1.6135
866,1.6135
867,1.6135
868,1.6135
869,1.6135
870,1.6135
871,1.6135
872,1.6067
873,1.5919
874,1.5745
875,1.5564
876,1.5445
877,1.536
878,1.536
879,1.536
880,1.536
881,1.5224
882,1.5059
883,1.4877
884,1.4694
885,1.4512
886,1.4329
887,1.4147
888,1.3964
889,1.3744
890,1.3384
891,1.3021
892,1.2656
893,1.2291
894,1.1926
895,1.1561
896,1.1199
897,1.0843
898,1.0588
899,1.0406
900,1.0223
901,1.0026
902,0.9735299999999999
903,0.9414
904,0.9048799999999999
905,0.8683700000000001
906,0.83185
907,0.79533
908,0.75881
909,0.7223
910,0.69201
911,0.66783
912,0.64827
913,0.6298
914,0.60759
915,0.58067
916,0.54415
917,0.50763
918,0.47111000000000003
919,0.4346
920,0.39808000000000004
921,0.36156
922,0.32737
923,0.29628000000000004
924,0.27421
925,0.25595
926,0.2377
927,0.2233
928,0.22034
929,0.21894
930,0.21894
931,0.20786
932,0.1923
933,0.15578
934,0.11925999999999999
935,0.42248
936,0.34498
937,0.33018000000000003
938,0.32871
939,0.32134
940,0.27939
941,0.21520999999999998
942,0.12392
943,0.22991999999999999
944,-0.058668
