time,value
0,-0.13901
1,-0.13901
2,-0.13901
3,-0.13901
4,-0.13901
5,-0.13901
6,-0.13901
7,-0.13901
8,-0.13901
9,-0.13901
10,-0.13901
11,-0.13901
12,-0.13901
13,-0.13901
14,-0.13901
15,-0.13901
16,-0.13901
17,-0.13901
18,-0.13901
19,-0.13901
20,-0.13901
21,-0.13901
22,-0.13901
23,-0.13901
24,-0.13901
25,-0.13901
26,-0.13901
27,-0.13901
28,-0.13901
29,-0.13901
30,-0.13901
31,-0.13901
32,-0.13901
33,-0.13901
34,-0.13901
35,-0.13901
36,-0.13901
37,-0.13901
38,-0.13901
39,-0.13901
40,-0.13901
41,-0.13901
42,-0.13901
43,-0.13901
44,-0.13901
45,-0.13901
46,-0.13901
47,-0.13901
48,-0.13901
49,-0.13901
50,-0.13901
51,-0.13901
52,-0.13901
53,-0.13901
54,-0.13901
55,-0.13901
56,-0.13901
57,-0.13901
58,-0.13901
59,-0.13901
60,-0.13901
61,-0.13901
62,-0.13901
63,-0.13901
64,-0.13901
65,-0.13901
66,-0.13901
67,-0.13901
68,-0.13901
69,-0.13901
70,-0.13901
71,-0.13901
72,-0.13901
73,-0.13901
74,-0.13901
75,-0.13901
76,-0.13901
77,-0.13901
78,-0.13901
79,-0.13901
80,-0.13901
81,-0.13901
82,-0.13901
83,-0.13901
84,-0.13901
85,-0.13901
86,-0.13901
87,-0.13901
88,-0.13901
89,-0.13901
90,-0.13901
91,-0.13901
92,-0.13901
93,-0.13901
94,-0.13901
95,-0.13901
96,-0.13901
97,-0.13901
98,-0.13901
99,-0.13901
100,-0.13901
101,-0.13901
102,-0.13901
103,-0.13901
104,-0.13901
105,-0.13901
106,-0.13901
107,-0.13901
108,-0.13901
109,-0.13901
110,-0.13901
111,-0.13901
112,-0.13901
113,-0.13901
114,-0.13901
115,-0.13901
116,-0.13901
117,-0.13901
118,-0.13901
119,-0.13901
120,-0.13901
121,-0.13901
122,-0.13901
123,-0.13901
124,-0.13901
125,-0.13901
126,-0.13901
127,-0.13901
128,-0.13901
129,-0.13901
130,-0.13901
131,-0.13901
132,-0.13901
133,-0.13901
134,-0.13901
135,-0.13901
136,-0.13901
137,3.2793
138,10.525
139,1.7559
140,-0.015155000000000002
141,-0.13901
142,-0.13901
143,-0.13901
144,-0.13901
145,-0.13901
146,-0.13901
147,-0.13901
148,-0.13901
149,-0.13901
150,-0.13901
151,-0.13901
152,-0.13901
153,-0.13901
154,-0.13901
155,-0.13901
156,-0.13901
157,-0.13901
158,-0.13901
159,-0.13901
160,-0.13901
161,-0.13901
162,-0.13901
163,-0.13901
164,-0.13901
165,-0.13901
166,-0.13901
167,-0.13901
168,-0.13901
169,-0.13901
170,-0.13901
171,-0.13901
172,-0.13901
173,-0.13901
174,-0.13901
175,-0.13901
176,-0.13901
177,-0.13901
178,-0.13901
179,-0.13901
180,-0.13901
181,-0.13901
182,-0.13901
183,-0.13901
184,-0.13901
185,-0.13901
186,-0.13901
187,-0.13901
188,-0.13901
189,-0.13901
190,-0.13901
191,-0.13901
192,-0.13901
193,-0.13901
194,-0.13901
195,-0.13901
196,-0.13901
197,-0.13901
198,-0.13901
199,-0.13901
200,-0.13901
201,-0.13901
202,-0.13901
203,-0.13901
204,-0.13901
205,-0.13901
206,-0.13901
207,-0.13901
208,-0.13901
209,-0.13901
210,-0.13901
211,-0.13901
212,-0.13901
213,-0.13901
214,-0.13901
215,-0.13901
216,-0.13901
217,6.5986
218,2.8582
219,-0.12662
220,-0.13901
221,-0.13901
222,-0.13901
223,-0.13901
224,-0.13901
225,-0.13901
226,-0.13901
227,-0.13901
228,-0.13901
229,-0.13901
230,-0.13901
231,-0.13901
232,-0.13901
233,-0.13901
234,-0.13901
235,-0.13901
236,-0.13901
237,-0.13901
238,-0.13901
239,-0.13901
240,-0.13901
241,-0.13901
242,-0.13901
243,-0.13901
244,-0.13901
245,-0.13901
246,-0.13901
247,-0.13901
248,-0.13901
249,-0.13901
250,-0.13901
251,-0.13901
252,-0.13901
253,-0.13901
254,-0.13901
255,-0.13901
256,-0.13901
257,-0.13901
258,-0.13901
259,-0.13901
260,-0.13901
261,-0.13901
262,-0.13901
263,-0.13901
264,-0.13901
265,-0.13901
266,-0.13901
267,-0.13901
268,-0.13901
269,-0.13901
270,-0.13901
271,-0.13901
272,-0.13901
273,-0.13901
274,-0.13901
275,-0.13901
276,-0.13901
277,-0.13901
278,-0.13901
279,-0.13901
280,-0.13901
281,-0.13901
282,-0.13901
283,-0.13901
284,-0.13901
285,-0.13901
286,-0.13901
287,-0.13901
288,-0.13901
289,-0.13901
290,-0.13901
291,-0.13901
292,-0.13901
293,-0.13901
294,-0.13901
295,-0.13901
296,-0.13901
297,-0.13901
298,-0.13901
299,-0.13901
300,-0.13901
301,-0.13901
302,-0.13901
303,-0.13901
304,-0.13901
305,-0.13901
306,-0.13901
307,-0.13901
308,-0.13901
309,-0.13901
310,-0.13901
311,-0.13901
312,-0.13901
313,-0.13901
314,-0.13901
315,-0.13901
316,-0.13901
317,-0.13901
318,-0.13901
319,-0.13901
320,-0.13901
321,-0.13901
322,-0.13901
323,-0.13901
324,-0.13901
325,-0.13901
326,-0.13901
327,-0.13901
328,-0.13901
329,-0.13901
330,-0.13901
331,-0.13901
332,-0.13901
333,-0.13901
334,-0.13901
335,-0.13901
336,-0.13901
337,-0.13901
338,-0.13901
339,-0.13901
340,-0.13901
341,3.8862
342,10.265
343,1.8674
344,1.6445
345,-0.08946599999999999
346,-0.13901
347,-0.13901
348,-0.13901
349,-0.13901
350,-0.13901
351,-0.13901
352,-0.13901
353,-0.13901
354,-0.13901
355,-0.13901
356,-0.13901
357,-0.13901
358,-0.13901
359,-0.13901
360,-0.13901
361,-0.13901
362,-0.13901
363,-0.13901
364,-0.13901
365,-0.13901
366,-0.13901
367,-0.13901
368,-0.13901
369,-0.13901
370,-0.13901
371,-0.13901
372,-0.13901
373,-0.13901
374,-0.13901
375,-0.13901
376,-0.13901
377,-0.13901
378,-0.13901
379,-0.13901
380,-0.13901
381,-0.13901
382,-0.13901
383,-0.13901
384,-0.13901
385,-0.13901
386,-0.13901
387,-0.13901
388,-0.13901
389,-0.13901
390,-0.13901
391,-0.13901
392,-0.13901
393,-0.13901
394,-0.13901
395,-0.13901
396,-0.13901
397,-0.13901
398,-0.13901
399,-0.13901
400,-0.13901
401,-0.13901
402,-0.13901
403,0.20778000000000002
404,8.3325
405,0.30685999999999997
406,-0.13901
407,-0.13901
408,-0.13901
409,-0.13901
410,-0.13901
411,-0.13901
412,-0.13901
413,-0.13901
414,-0.13901
415,-0.13901
416,-0.13901
417,-0.13901
418,-0.13901
419,-0.13901
420,-0.13901
421,-0.13901
422,-0.13901
423,-0.13901
424,-0.13901
425,-0.13901
426,-0.13901
427,-0.13901
428,-0.13901
429,-0.13901
430,-0.13901
431,-0.13901
432,-0.13901
433,-0.13901
434,-0.13901
435,-0.13901
436,-0.13901
437,-0.13901
438,-0.13901
439,-0.13901
440,-0.13901
441,-0.13901
442,-0.13901
443,-0.13901
444,-0.13901
445,-0.13901
446,3.5766
447,2.5857
448,-0.12662
449,-0.13901
450,-0.13901
451,-0.13901
452,-0.13901
453,-0.13901
454,-0.13901
455,-0.13901
456,-0.13901
457,-0.13901
458,-0.13901
459,-0.13901
460,-0.13901
461,-0.13901
462,-0.13901
463,-0.13901
464,-0.13901
465,-0.13901
466,-0.13901
467,-0.13901
468,-0.13901
469,-0.13901
470,-0.13901
471,-0.13901
472,-0.13901
473,-0.13901
474,-0.13901
475,-0.13901
476,-0.13901
477,-0.13901
478,-0.13901
479,-0.13901
480,-0.13901
481,-0.13901
482,-0.13901
483,-0.13901
484,-0.13901
485,-0.13901
486,4.3692
487,9.7692
488,0.12108
489,-0.11424000000000001
490,-0.13901
491,-0.13901
492,-0.13901
493,-0.13901
494,-0.13901
495,-0.13901
496,-0.13901
497,-0.13901
498,-0.13901
499,-0.13901
500,-0.13901
501,-0.13901
502,-0.13901
503,-0.13901
504,-0.13901
505,-0.13901
506,-0.13901
507,-0.13901
508,-0.13901
509,-0.13901
510,-0.13901
511,-0.13901
512,-0.13901
513,-0.13901
514,-0.13901
515,-0.13901
516,-0.13901
517,-0.13901
518,-0.13901
519,-0.13901
520,-0.13901
521,-0.13901
522,-0.13901
523,-0.13901
524,-0.13901
525,-0.13901
526,-0.13901
527,-0.13901
528,-0.13901
529,-0.13901
530,-0.13901
531,-0.13901
532,-0.13901
533,-0.13901
534,-0.13901
535,-0.13901
536,-0.13901
537,-0.13901
538,-0.13901
539,-0.13901
540,-0.13901
541,-0.13901
542,-0.13901
543,-0.13901
544,-0.13901
545,-0.13901
546,-0.13901
547,-0.13901
548,-0.13901
549,-0.13901
550,-0.13901
551,-0.13901
552,0.41833000000000004
553,9.5215
554,2.4619
555,-0.08946599999999999
556,-0.13901
557,-0.13901
558,-0.13901
559,-0.13901
560,-0.13901
561,-0.13901
562,-0.13901
563,-0.13901
564,-0.13901
565,-0.13901
566,-0.13901
567,-0.13901
568,-0.13901
569,-0.13901
570,-0.13901
571,-0.13901
572,-0.13901
573,-0.13901
574,-0.13901
575,-0.13901
576,-0.13901
577,-0.13901
578,-0.13901
579,-0.13901
580,-0.13901
581,-0.13901
582,-0.13901
583,-0.13901
584,-0.13901
585,-0.13901
586,-0.13901
587,-0.13901
588,-0.13901
589,-0.13901
590,-0.13901
591,-0.13901
592,9.7692
593,2.5857
594,-0.08946599999999999
595,-0.13901
596,-0.13901
597,-0.13901
598,-0.13901
599,-0.13901
600,-0.13901
601,-0.13901
602,-0.13901
603,-0.13901
604,-0.13901
605,-0.13901
606,-0.13901
607,-0.13901
608,-0.13901
609,-0.13901
610,-0.13901
611,-0.13901
612,-0.13901
613,-0.13901
614,-0.13901
615,-0.13901
616,-0.13901
617,-0.13901
618,-0.13901
619,-0.13901
620,-0.13901
621,-0.13901
622,-0.13901
623,-0.13901
624,-0.13901
625,-0.13901
626,-0.13901
627,-0.13901
628,-0.13901
629,-0.13901
630,-0.13901
631,-0.13901
632,-0.13901
633,-0.13901
634,-0.13901
635,-0.13901
636,-0.13901
637,-0.13901
638,-0.13901
639,-0.13901
640,-0.13901
641,-0.13901
642,-0.13901
643,-0.13901
644,-0.13901
645,-0.13901
646,-0.13901
647,-0.13901
648,-0.13901
649,-0.13901
650,-0.13901
651,-0.13901
652,-0.13901
653,-0.13901
654,-0.13901
655,-0.13901
656,-0.13901
657,-0.13901
658,-0.13901
659,-0.13901
660,-0.13901
661,-0.13901
662,-0.13901
663,-0.13901
664,-0.13901
665,-0.13901
666,-0.13901
667,-0.13901
668,-0.13901
669,-0.13901
670,-0.13901
671,-0.13901
672,-0.13901
673,-0.13901
674,-0.13901
675,-0.13901
676,-0.13901
677,-0.13901
678,-0.13901
679,-0.13901
680,-0.13901
681,-0.13901
682,-0.13901
683,-0.13901
684,-0.13901
685,-0.13901
686,-0.13901
687,-0.13901
688,-0.13901
689,-0.13901
690,-0.13901
691,-0.13901
692,-0.13901
693,-0.13901
694,-0.13901
695,-0.13901
696,-0.13901
697,-0.13901
698,-0.13901
699,-0.13901
700,-0.13901
701,-0.13901
702,-0.13901
703,-0.13901
704,-0.13901
705,-0.13901
706,-0.13901
707,-0.13901
708,-0.13901
709,-0.13901
710,-0.13901
711,-0.13901
712,-0.13901
713,-0.13901
714,-0.13901
715,-0.13901
716,-0.13901
717,-0.13901
718,-0.13901
719,-0.13901
