time,value
0,1.2011
1,4.1257
2,5.8744
3,4.7635
4,1.7402
5,-0.5838399999999999
6,-0.76977
7,0.23673000000000002
8,0.72212
9,0.27049
10,-0.2404
11,-0.14783
12,0.22976
13,0.2869
14,-0.025082
15,-0.2995
16,-0.26105
17,0.028964999999999998
18,0.39976
19,0.72993
20,0.9253899999999999
21,0.9438
22,0.87071
23,0.8529
24,0.9074
25,0.89361
26,0.68562
27,0.36228
28,0.10094
29,0.004296899999999999
30,0.025178
31,0.04605
32,0.014597999999999998
33,-0.032501
34,-0.040611
35,-0.015309
36,-0.0054608
37,-0.039046
38,-0.093315
39,-0.12584
40,-0.12971
41,-0.13433
42,-0.16657
43,-0.21103000000000002
44,-0.23299
45,-0.22271999999999997
46,-0.20711999999999997
47,-0.21666
48,-0.24053000000000002
49,-0.25875
50,-0.26961
51,-0.29088
52,-0.31742
53,-0.32059
54,-0.29795
55,-0.28698
56,-0.32156999999999997
57,-0.37901
58,-0.41048999999999997
59,-0.40345
60,-0.39295
61,-0.4065
62,-0.42535
63,-0.42235
64,-0.40441
65,-0.40373000000000003
66,-0.42657
67,-0.44685
68,-0.44709
69,-0.44136000000000003
70,-0.45043
71,-0.46775
72,-0.47553
73,-0.47373000000000004
74,-0.47944
75,-0.49486
76,-0.50074
77,-0.4875
78,-0.47226
79,-0.47862
80,-0.50161
81,-0.51462
82,-0.50393
83,-0.48717
84,-0.49188000000000004
85,-0.52085
86,-0.5484600000000001
87,-0.54784
88,-0.52182
89,-0.49933
90,-0.50439
91,-0.5311600000000001
92,-0.55508
93,-0.56619
94,-0.57744
95,-0.59968
96,-0.61645
97,-0.60151
98,-0.557
