time,value
0,0.90022
1,0.90022
2,0.90022
3,0.90022
4,0.90022
5,0.90022
6,0.90022
7,0.90022
8,0.90022
9,0.90022
10,0.90022
11,0.90022
12,0.90022
13,0.90022
14,0.90022
15,0.90022
16,0.90022
17,0.90022
18,0.90022
19,0.90022
20,0.90022
21,0.90022
22,0.90022
23,0.90022
24,0.90022
25,0.90022
26,0.90022
27,0.90022
28,0.88886
29,0.8741899999999999
30,0.85754
31,0.8517299999999999
32,0.84946
33,0.84946
34,0.84946
35,0.84946
36,0.84946
37,0.8592799999999999
38,0.8730600000000001
39,0.88971
40,0.90636
41,0.92301
42,0.93966
43,0.95631
44,0.97296
45,0.98961
46,1.0063
47,1.0229
48,1.0396
49,1.0483
50,1.0525
51,1.0525
52,1.03
53,0.99382
54,0.9438700000000001
55,0.8868299999999999
56,0.82521
57,0.75861
58,0.67867
59,0.5895199999999999
60,0.48962
61,0.39598
62,0.30695
63,0.2237
64,0.14044
65,0.23714000000000002
66,-0.17912
67,-0.098307
68,-0.16153
69,-0.21148000000000003
70,-0.25629
71,-0.29667
72,-0.32997
73,-0.36806
74,-0.41047
75,-0.46043
76,-0.5103800000000001
77,-0.56033
78,-0.61028
79,-0.66023
80,-0.71018
81,-0.76013
82,-0.81389
83,-0.8717600000000001
84,-0.93811
85,-1.0012
86,-1.0602
87,-1.1106
88,-1.1606
89,-1.2105
90,-1.2605
91,-1.3104
92,-1.3604
93,-1.4103
94,-1.4576
95,-1.5009
96,-1.5353
97,-1.5661
98,-1.5931
99,-1.6111
100,-1.6299
101,-1.6525
102,-1.6843
103,-1.7137
104,-1.7357
105,-1.7393
106,-1.7409999999999999
107,-1.7464
108,-1.7609
109,-1.776
110,-1.7877
111,-1.79
112,-1.7873
113,-1.778
114,-1.7499
115,-1.7178
116,-1.6889
117,-1.6693
118,-1.6516
119,-1.6309
120,-1.6009
121,-1.5685
122,-1.5389
123,-1.5186
124,-1.5027
125,-1.4894
126,-1.4855
127,-1.4849
128,-1.4818
129,-1.4695
130,-1.4528
131,-1.4362
132,-1.4195
133,-1.4029
134,-1.3862
135,-1.3696
136,-1.3526
137,-1.3339
138,-1.306
139,-1.2729
140,-1.2414
141,-1.2189
142,-1.2021
143,-1.1840000000000002
144,-1.157
145,-1.1238
146,-1.0916
147,-1.0682
148,-1.0516
149,-1.0349
150,-1.0183
151,-1.0016
152,-0.98449
153,-0.95881
154,-0.9255
155,-0.8920399999999999
156,-0.8501700000000001
157,-0.8002199999999999
158,-0.75027
159,-0.7003199999999999
160,-0.65037
161,-0.60042
162,-0.55047
163,-0.50052
164,-0.45056
165,-0.40776999999999997
166,-0.37366
167,-0.34031999999999996
168,-0.3003
169,-0.25148000000000004
170,-0.20162
171,-0.15795
172,-0.12319000000000001
173,-0.089752
174,-0.30176
175,-0.060894000000000004
176,0.18784
177,0.41031000000000006
178,0.12722999999999998
179,0.16080999999999998
180,0.19411
181,0.22741
182,0.26072
183,0.29402
184,0.32732
185,0.36062
186,0.39392
187,0.42722
188,0.46052
189,0.49382
190,0.52712
191,0.56042
192,0.59012
193,0.61049
194,0.6279899999999999
195,0.64464
196,0.6612899999999999
197,0.67795
198,0.6916399999999999
199,0.69601
200,0.69718
201,0.6998300000000001
202,0.7117899999999999
203,0.72709
204,0.74139
205,0.7464
206,0.7479399999999999
207,0.74587
208,0.73456
209,0.71965
210,0.7048
211,0.69914
212,0.69718
213,0.69872
214,0.70939
215,0.72385
216,0.74051
217,0.75716
218,0.77381
219,0.7925800000000001
220,0.8292700000000001
221,0.87387
222,0.92214
223,0.9527
224,0.9752299999999999
225,0.9918799999999999
226,1.0085
227,1.0252
228,1.0418
229,1.0585
230,1.0751
231,1.0918
232,1.1084
233,1.1251
234,1.1417
235,1.1499
236,1.1540000000000001
237,1.1540000000000001
238,1.1540000000000001
239,1.1540000000000001
240,1.1540000000000001
241,1.1540000000000001
242,1.1540000000000001
243,1.1540000000000001
244,1.1469
245,1.1354
246,1.1188
247,1.1088
248,1.1033
249,1.1033
250,1.1033
251,1.1033
252,1.1033
253,1.1033
254,1.1033
255,1.1033
256,1.0979
257,1.0879
258,1.0713
259,1.0596
260,1.0525
261,1.0525
262,1.0571
263,1.0662
264,1.0829
265,1.0953
266,1.1033
267,1.1033
268,1.0994
269,1.0911
270,1.0745
271,1.0508
272,1.0186
273,0.9686
274,0.9122600000000001
275,0.8476799999999999
276,0.76443
277,0.68118
278,0.5979300000000001
279,0.51467
280,0.43141999999999997
281,0.34817
282,0.26492
283,0.18167
284,0.44325
285,0.11077000000000001
286,-0.37934
287,-0.14407
288,-0.21066999999999997
289,-0.27726999999999996
290,-0.34387
291,-0.41047
292,-0.47416
293,-0.53236
294,-0.56566
295,-0.60018
296,-0.6371100000000001
297,-0.68706
298,-0.7360399999999999
299,-0.78293
300,-0.81623
301,-0.85029
302,-0.8860600000000001
303,-0.93601
304,-0.98541
305,-1.0335
306,-1.0668
307,-1.1001
308,-1.1334
309,-1.1667
310,-1.1998
311,-1.2325
312,-1.2491
313,-1.2658
314,-1.2824
315,-0.29702
316,-0.29702
317,-0.29702
318,-0.29702
319,-0.29702
320,-0.29702
321,-0.29702
322,-0.29702
323,-0.29702
324,-0.29702
325,-0.29702
326,-0.29702
327,-0.29702
328,-0.29702
329,-0.29702
330,-0.29702
331,-0.29702
332,-0.29702
333,-0.29702
334,-0.24115999999999999
335,-0.17489000000000002
336,-0.10342
337,-0.47576
338,-0.44447
339,-0.44447
340,-0.44447
341,-0.44447
342,-0.44447
343,-0.44447
344,-0.44447
345,-0.44447
346,-0.44447
347,-0.44447
348,-0.44447
349,-0.44447
350,-0.44447
351,-0.44447
352,-0.23362
353,0.06209099999999999
354,0.41946000000000006
355,0.16513
356,0.2366
357,0.30808
358,0.37955
359,0.45102
360,0.5225
361,0.59397
362,0.6654399999999999
363,0.73692
364,0.8083899999999999
365,0.8798600000000001
366,0.9513299999999999
367,0.95835
368,0.92635
369,0.85488
370,0.7226100000000001
371,0.55095
372,0.33653
373,0.12211
374,-0.092314
375,-0.30673
376,-0.49425
377,-0.6620199999999999
378,-0.80496
379,-0.92268
380,-1.0208
381,-1.0922
382,-1.1873
383,-1.3018
384,-1.4448
385,-1.5436
386,-1.6044
387,-1.6044
388,-1.6249
389,-1.6640000000000001
390,-1.7355
391,-1.7688
392,-1.766
393,-1.6946
394,-1.6408
395,-1.6047
396,-1.6044
397,-1.6044
398,-1.6044
399,-1.6044
400,-1.6044
401,-1.6044
402,-1.6044
403,-1.6044
404,-1.6044
405,-1.6044
406,-1.5917
407,-1.5619
408,-1.494
409,-1.4225
410,-1.3511
411,-1.2796
412,-1.2185
413,-1.1741
414,-1.1686
415,-1.1592
416,-1.1335
417,-1.0687
418,-1.0056
419,-0.9584
420,-0.9506899999999999
421,-0.9506899999999999
422,-0.9506899999999999
423,-0.9506899999999999
424,-0.9440700000000001
425,-0.92256
426,-0.8611700000000001
427,-0.7897
428,-0.71822
429,-0.64675
430,-0.57023
431,-0.48003
432,-0.34976
433,-0.21548
434,-0.10722999999999999
435,-0.44447
436,-0.42605
437,-0.34625
438,-0.06628300000000001
439,0.27566999999999997
440,0.1218
441,0.13876
442,0.13876
443,0.13876
444,0.13876
445,0.13672
446,0.12492
447,0.31884
448,-0.27263000000000004
449,-0.33584
450,-0.44447
451,-0.44447
452,-0.44447
453,-0.44447
454,-0.44887
455,-0.087643
456,-0.13395
457,-0.20481999999999997
458,-0.27005
459,-0.29702
460,-0.29702
461,-0.29702
462,-0.29702
463,-0.29722
464,-0.30069
465,-0.34143
466,-0.41273999999999994
467,-0.48005
468,-0.47397
469,-0.40251
470,-0.33173
471,-0.29702
472,-0.29702
473,-0.29702
474,-0.26231
475,-0.19153
476,-0.12007000000000001
477,-0.2918
478,0.06556000000000001
479,0.42293000000000003
480,0.13509000000000002
481,0.13856
482,0.13876
483,0.16758
484,0.2342
485,0.3053
486,0.32283
487,0.26385
488,0.19358
489,0.14727
490,0.13964000000000001
491,0.13876
492,0.11534000000000001
493,0.21561999999999998
494,-0.13568
495,-0.38442
496,-0.43646
497,-0.44447
498,-0.44447
499,-0.44447
500,-0.44447
501,-0.097625
502,-0.15591
503,-0.22485
504,-0.27936
505,-0.29394000000000003
506,-0.29702
507,-0.29702
508,-0.29702
509,-0.29702
510,-0.28297
511,-0.22884000000000002
512,-0.16171
513,-0.12825999999999999
514,-0.215
515,-0.34281999999999996
516,-0.46305
517,-0.5033
518,-0.5149100000000001
519,-0.525
520,-0.57496
521,-0.63981
522,-0.71129
523,-0.78276
524,-0.8542299999999999
525,-0.91799
526,-0.9422799999999999
527,-0.9506899999999999
528,-0.9440799999999999
529,-0.89828
530,-0.83619
531,-0.76472
532,-0.69324
533,-0.6217699999999999
534,-0.54575
535,-0.43125
536,-0.29979
537,-0.16045
538,-0.34452
539,0.07596900000000001
540,0.44688
541,0.21086
542,0.34
543,0.48107
544,0.58516
545,0.67169
546,0.74316
547,0.81463
548,0.8861100000000001
549,0.95793
550,1.0655
551,1.1907
552,1.3337
553,1.4079
554,1.4461
555,1.4461
556,1.4461
557,1.4461
558,1.4461
559,1.4461
560,1.4461
561,1.4461
562,1.4746
563,1.5224
564,1.5939
565,1.6388
566,1.6640000000000001
567,1.6640000000000001
568,1.6888
569,1.7334
570,1.8049
571,1.8763
572,1.9478
573,2.0193
574,2.0907
575,2.1622
576,2.2337
577,2.3052
578,2.3766
579,2.4481
580,2.5196
581,2.5911
582,2.6625
583,2.7174
584,2.7534
585,2.7534
586,2.7232
587,2.6563
588,2.5133
589,2.3704
590,2.2274
591,2.0845
592,1.9292
593,1.757
594,1.5426
595,1.3391
596,1.1519
597,1.0089
598,0.87572
599,0.75773
600,0.68626
601,0.60626
602,0.5120899999999999
603,0.36914
604,0.23356
605,0.5062
606,0.14883
607,-0.20854
608,-0.10342
609,-0.17489000000000002
610,-0.24115999999999999
611,-0.29702
612,-0.29702
613,-0.29702
614,-0.29702
615,-0.29702
616,-0.29702
617,-0.29702
618,-0.29702
619,-0.29938000000000003
620,-0.30743000000000004
621,-0.3789
622,-0.44733
623,-0.50797
624,-0.4365
625,-0.36501999999999996
626,-0.29355
627,-0.22208000000000003
628,-0.1506
629,-0.44447
630,-0.20898000000000003
631,-0.20898000000000003
632,-0.20898000000000003
633,-0.20898000000000003
634,-0.20898000000000003
635,-0.20898000000000003
636,-0.20898000000000003
637,-0.20898000000000003
638,-0.20898000000000003
639,-0.20898000000000003
640,-0.20898000000000003
641,-0.20898000000000003
642,-0.20898000000000003
643,-0.20898000000000003
644,-0.20898000000000003
645,-0.20898000000000003
646,-0.20898000000000003
647,-0.20898000000000003
648,-0.20898000000000003
649,-0.19898
650,-0.18711
651,-0.1743
652,-0.17107
653,-0.16995
654,-0.16995
655,-0.16995
656,-0.16995
657,-0.16995
658,-0.15247
659,-0.12992
660,-0.10430999999999999
661,-0.095368
662,-0.091878
663,-0.091878
664,-0.091878
665,-0.091878
666,-0.091878
667,-0.47043999999999997
668,-0.41746000000000005
669,-0.35343
670,-0.28941
671,-0.22539
672,-0.16136
673,-0.13141
674,-0.11785
675,-0.11785
676,-0.20911
677,0.12643
678,0.3185
679,0.11799000000000001
680,0.16596
681,0.21718
682,0.2684
683,0.31961
684,0.37083
685,0.4275
686,0.48768999999999996
687,0.55171
688,0.61574
689,0.67976
690,0.74379
691,0.80299
692,0.8586600000000001
693,0.9098700000000001
694,0.95657
695,0.99976
696,1.0382
697,1.0681
698,1.0911
699,1.1039
700,1.1128
701,1.1182
702,1.1182
703,1.1182
704,1.1182
705,1.1182
706,1.1182
707,1.1182
708,1.1182
709,1.1182
710,1.1182
711,1.1182
712,1.1153
713,1.1092
714,1.0966
715,1.0838
716,1.071
717,1.0582
718,1.0454
719,1.0326
720,1.0198
721,1.0047
722,0.98655
723,0.96159
724,0.93186
725,0.8960600000000001
726,0.8464700000000001
727,0.7971199999999999
728,0.75075
729,0.71134
730,0.67292
731,0.63451
732,0.5961
733,0.55919
734,0.52513
735,0.49813
736,0.47386999999999996
737,0.45236000000000004
738,0.43796
739,0.42278999999999994
740,0.40228
741,0.36748000000000003
742,0.32698
743,0.28136
744,0.2214
745,0.15919
746,0.46056
747,0.24578000000000003
748,0.28888
749,-0.13835999999999998
750,-0.33043
751,-0.094077
752,-0.12963
753,-0.15800999999999998
754,-0.18417999999999998
755,-0.2124
756,-0.24777
757,-0.28619
758,-0.3246
759,-0.36301
760,-0.40105999999999997
761,-0.43736
762,-0.46657
763,-0.49246999999999996
764,-0.51994
765,-0.5544600000000001
766,-0.5926600000000001
767,-0.62946
768,-0.6592600000000001
769,-0.68503
770,-0.71201
771,-0.7459100000000001
772,-0.78422
773,-0.82152
774,-0.85196
775,-0.8775700000000001
776,-0.9031799999999999
777,-0.9287799999999999
778,-0.95439
779,-0.98
780,-1.0056
781,-1.0312
782,-1.0564
783,-1.0751
784,-1.0879
785,-1.1008
786,-1.1202
787,-1.1458
788,-1.1715
789,-1.1908
790,-1.2038
791,-1.2166
792,-1.2294
793,-1.2422
794,-1.255
795,-1.2678
796,-1.2806
797,-1.2934
798,-1.3062
799,-1.319
800,-1.3318
801,-1.3446
802,-1.3574
803,-1.3702
804,-1.383
805,-1.3958
806,-1.4087
807,-1.4215
808,-1.4343
809,-1.4471
810,-1.4599
811,-1.4727
812,-1.4855
813,-1.4983
814,-1.5111
815,-1.5239
816,-1.5334
817,-1.5357
818,-1.5362
819,-1.5362
820,-1.5362
821,-1.5362
822,-1.5362
823,-1.5362
824,-1.5362
825,-1.5337
826,-1.524
827,-1.5119999999999998
828,-1.4992
829,-1.4863
830,-1.4735
831,-1.4628
832,-1.4592
833,-1.4581
834,-1.4563
835,-1.4474
836,-1.4358
837,-1.4229
838,-1.4101
839,-1.3973
840,-1.3818
841,-1.3521
842,-1.3167
843,-1.2794
844,-1.2492
845,-1.2219
846,-1.1953
847,-1.1618
848,-1.1252
849,-1.0876
850,-1.0569
851,-1.0292
852,-1.003
853,-0.96991
854,-0.93376
855,-0.89486
856,-0.8492299999999999
857,-0.8004899999999999
858,-0.74927
859,-0.69805
860,-0.64683
861,-0.5956100000000001
862,-0.5443899999999999
863,-0.49317
864,-0.44196
865,-0.39074000000000003
866,-0.33952
867,-0.2883
868,-0.24324
869,-0.2014
870,-0.16299
871,-0.12457
872,-0.47962
873,-0.28755
874,-0.068256
875,0.16808
876,0.42417
877,0.14582
878,0.19704000000000002
879,0.24825999999999998
880,0.29946999999999996
881,0.35069
882,0.40191
883,0.45313000000000003
884,0.50435
885,0.55557
886,0.61092
887,0.66982
888,0.7338399999999999
889,0.79403
890,0.8507
891,0.90192
892,0.95314
893,1.0044
894,1.0556
895,1.1035
896,1.1481
897,1.1865
898,1.2219
899,1.254
900,1.2796
901,1.3052
902,1.3308
903,1.3564
904,1.3771
905,1.3915
906,1.3915
907,1.3937
908,1.3989
909,1.4117
910,1.4245
911,1.4374
912,1.4502
913,1.4612
914,1.4696
915,1.4696
916,1.4711
917,1.4751
918,1.4880000000000002
919,1.5008
920,1.5136
921,1.5264
922,1.538
923,1.5476
924,1.5476
925,1.5476
926,1.5476
927,1.5476
928,1.5484
929,1.5507
930,1.5635
931,1.5758
932,1.5867
933,1.5867
934,1.5862
935,1.5848
936,1.5719999999999998
937,1.5586
938,1.5439
939,1.5055
940,1.4668
941,1.4274
942,1.3634
943,1.2994
944,1.2353
