time,value
0,0.7407100000000001
1,0.73961
2,0.68447
3,0.59959
4,0.49456000000000006
5,0.37089
6,0.2248
7,0.047397
8,-0.15734
9,-0.37392
10,-0.57545
11,-0.73225
12,-0.82109
13,-0.8279200000000001
14,-0.75332
15,-0.61522
16,-0.44173999999999997
17,-0.25301
18,-0.05827
19,0.13507
20,0.33174000000000003
21,0.54274
22,0.76785
23,0.9787
24,1.1472
25,1.2339
26,1.2018
27,1.0268
28,0.71013
29,0.27997
30,-0.21447
31,-0.71746
32,-1.1656
33,-1.5096
34,-1.7104
35,-1.7435
36,-1.6037
37,-1.3029
38,-0.8637
39,-0.32115
40,0.26711999999999997
41,0.83746
42,1.3206
43,1.6564
44,1.8038
45,1.7463
46,1.5009
47,1.1009
48,0.6106699999999999
49,0.09415499999999999
50,-0.3787
51,-0.7589
52,-1.018
53,-1.1441
54,-1.1462
55,-1.0465
56,-0.86905
57,-0.6421399999999999
58,-0.40355
59,-0.17804
60,0.018684
61,0.17540999999999998
62,0.29516
63,0.3825
64,0.45321000000000006
65,0.5210600000000001
66,0.59328
67,0.66705
68,0.72946
69,0.75566
70,0.7196
71,0.59948
72,0.39296
73,0.1088
74,-0.226
75,-0.5685100000000001
76,-0.8750700000000001
77,-1.0958
78,-1.2002
79,-1.1724
80,-1.0138
81,-0.7468199999999999
82,-0.40576999999999996
83,-0.034651999999999995
84,0.32381
85,0.63593
86,0.8739100000000001
87,1.0163
88,1.0571
89,0.99876
90,0.8496100000000001
91,0.63322
92,0.37577
93,0.10222
94,-0.15370999999999999
95,-0.36983
96,-0.5341899999999999
97,-0.64054
98,-0.68553
99,-0.6858
100,-0.6543399999999999
101,-0.59833
102,-0.5171899999999999
103,-0.40223000000000003
104,-0.2529
105,-0.065843
106,0.15319000000000002
107,0.38165
108,0.5915
109,0.74983
110,0.82921
111,0.8210700000000001
112,0.72896
113,0.5725
114,0.3764
115,0.16774
116,-0.038432
117,-0.22738000000000003
118,-0.39566
119,-0.54737
120,-0.67788
121,-0.7673800000000001
122,-0.79811
123,-0.7529399999999999
124,-0.6119899999999999
125,-0.384
126,-0.094828
127,0.20828000000000002
128,0.47768
129,0.66719
130,0.7467600000000001
131,0.70682
132,0.57144
133,0.38126
134,0.17912
135,0.0028611
136,-0.1277
137,-0.19918
138,-0.21489
139,-0.1935
140,-0.15049
141,-0.10117000000000001
142,-0.05463099999999999
143,-0.012564
144,0.017184
145,0.027107
146,0.015880000000000002
147,-0.016198
148,-0.057544000000000005
149,-0.10059
150,-0.12830999999999998
151,-0.1352
152,-0.11444000000000001
153,-0.065795
154,-0.0048008
155,0.056237999999999996
156,0.10545999999999998
157,0.12938
158,0.12414000000000001
159,0.10507999999999999
160,0.078323
161,0.0542
162,0.041372000000000006
163,0.037132
164,0.042206
165,0.050585000000000005
166,0.05832999999999999
167,0.070323
168,0.08342999999999999
169,0.10284000000000001
170,0.13435
171,0.16951
172,0.19995
173,0.2048
174,0.16841
175,0.076365
176,-0.0676
177,-0.23931999999999998
178,-0.41585
179,-0.5586300000000001
180,-0.63485
181,-0.62993
182,-0.53774
183,-0.38032
184,-0.18974000000000002
185,0.00099423
186,0.15733
187,0.27141
188,0.34263000000000005
189,0.38987
190,0.42987
191,0.47998999999999997
192,0.5443
193,0.61582
194,0.6785100000000001
195,0.70176
196,0.6690699999999999
197,0.56924
198,0.39523
199,0.15319000000000002
200,-0.13549
201,-0.44377
202,-0.7396699999999999
203,-1.0001
204,-1.1875
205,-1.2778
206,-1.2533
207,-1.1081
208,-0.84846
209,-0.49672
210,-0.090767
211,0.32095999999999997
212,0.6863100000000001
213,0.9626100000000001
214,1.1177
215,1.1452
216,1.0586
217,0.88216
218,0.6479600000000001
219,0.3925
220,0.14265999999999998
221,-0.076981
222,-0.25761
223,-0.38833
224,-0.46156
225,-0.48358999999999996
226,-0.44953999999999994
227,-0.3643
228,-0.24229
229,-0.10500999999999999
230,0.025661
231,0.12470999999999999
232,0.17653
233,0.17427
234,0.12243
235,0.038426999999999996
236,-0.053038999999999996
237,-0.12379000000000001
238,-0.16457
239,-0.16987
240,-0.14262
241,-0.091833
242,-0.033139999999999996
243,0.022672
244,0.056471
245,0.066539
246,0.055719000000000005
247,0.026633999999999998
248,-0.005830699999999999
249,-0.029718
250,-0.034381
251,-0.0055937
252,0.066221
253,0.17386
254,0.29825999999999997
255,0.41391000000000006
256,0.4911
257,0.50013
258,0.42726000000000003
259,0.27213000000000004
260,0.047976
261,-0.20674
262,-0.44815
263,-0.63868
264,-0.75478
265,-0.7855300000000001
266,-0.7311300000000001
267,-0.61237
268,-0.45006999999999997
269,-0.25948000000000004
270,-0.058838
271,0.13601
272,0.32137
273,0.48541000000000006
274,0.61233
275,0.69142
276,0.71935
277,0.6955
278,0.62757
279,0.53427
280,0.42736999999999997
281,0.32134
282,0.22416
283,0.12904000000000002
284,0.033368
285,-0.070741
286,-0.19116
287,-0.32298000000000004
288,-0.46026999999999996
289,-0.5906399999999999
290,-0.6989
291,-0.7711
292,-0.80512
293,-0.80402
294,-0.77242
295,-0.71405
296,-0.62344
297,-0.49618999999999996
298,-0.32898
299,-0.11194000000000001
300,0.15098
301,0.44633999999999996
302,0.74957
303,1.0239
304,1.2471
305,1.3857
306,1.4237
307,1.3617
308,1.2167
309,1.0021
310,0.73648
311,0.4375
312,0.11665
313,-0.22326
314,-0.57716
315,-0.92822
316,-1.2593
317,-1.5456
318,-1.7516
319,-1.841
320,-1.7899
321,-1.589
322,-1.2515
323,-0.79942
324,-0.28109
325,0.2493
326,0.7430399999999999
327,1.1523
328,1.4492
329,1.6219999999999999
330,1.6724
331,1.6119999999999999
332,1.4599
333,1.2398
334,0.9746600000000001
335,0.6837
336,0.3844
337,0.089469
338,-0.19473
339,-0.45995
340,-0.69514
341,-0.89666
342,-1.061
343,-1.1744
344,-1.2258
345,-1.2067
346,-1.1162
347,-0.9569200000000001
348,-0.73654
349,-0.47705
350,-0.20549
351,0.056792999999999996
352,0.28653
353,0.46716
354,0.5908899999999999
355,0.66292
356,0.68865
357,0.67114
358,0.62434
359,0.55704
360,0.4832
361,0.41612
362,0.36813
363,0.35091999999999995
364,0.37058
365,0.42596999999999996
366,0.50862
367,0.59112
368,0.64122
369,0.61706
370,0.48566000000000004
371,0.23249
372,-0.13632
373,-0.59139
374,-1.0879
375,-1.5525
376,-1.9219
377,-2.1432
378,-2.1769
379,-2.0121
380,-1.661
381,-1.1574
382,-0.5483399999999999
383,0.11307
384,0.7757
385,1.3822
386,1.8953
387,2.2865
388,2.5266
389,2.5988
390,2.5003
391,2.2315
392,1.8092
393,1.2618
394,0.62898
395,-0.047249
396,-0.72306
397,-1.3516
398,-1.8956
399,-2.323
400,-2.6052
401,-2.7272
402,-2.685
403,-2.4745
404,-2.0935
405,-1.5612
406,-0.90671
407,-0.15822999999999998
408,0.6358199999999999
409,1.4088
410,2.0931
411,2.6301
412,2.9611
413,3.0476
414,2.8816
415,2.4792
416,1.8813
417,1.147
418,0.35338
419,-0.42886
420,-1.1335
421,-1.7115
422,-2.1213
423,-2.3413
424,-2.3746
425,-2.231
426,-1.9409999999999998
427,-1.5391
428,-1.0738
429,-0.5887399999999999
430,-0.12232
431,0.29478000000000004
432,0.6459
433,0.9350200000000001
434,1.1634
435,1.3425
436,1.4757
437,1.5562
438,1.5718
439,1.5042
440,1.3367
441,1.0587
442,0.6884899999999999
443,0.2544
444,-0.20536
445,-0.65281
446,-1.0519
447,-1.3773
448,-1.6172
449,-1.767
450,-1.8234
451,-1.7794
452,-1.6158
453,-1.3168
454,-0.87798
455,-0.30993000000000004
456,0.34823000000000004
457,1.0323
458,1.6540000000000001
459,2.124
460,2.379
461,2.3856
462,2.154
463,1.7322
464,1.1895
465,0.60168
466,0.033301
467,-0.47493
468,-0.90651
469,-1.2587
470,-1.5392
471,-1.7428
472,-1.8644
473,-1.8862
474,-1.7964
475,-1.5796
476,-1.2444
477,-0.80901
478,-0.30725
479,0.21138
480,0.70035
481,1.1179
482,1.4418
483,1.6542
484,1.7533
485,1.7442
486,1.6377
487,1.4414
488,1.159
489,0.80066
490,0.38313
491,-0.072535
492,-0.53382
493,-0.95934
494,-1.3023
495,-1.526
496,-1.6057
497,-1.5376
498,-1.3453
499,-1.0738
