time,value
0,-0.6323
1,-0.6323
2,-0.6323
3,-0.6323
4,-0.6323
5,-0.6323
6,-0.6323
7,0.084074
8,1.875
9,1.5168
10,1.875
11,1.5168
12,1.5168
13,1.5168
14,-0.15472
15,-0.5129
16,-0.6323
17,-0.6323
18,-0.6323
19,-0.6323
20,-0.6323
21,-0.6323
22,-0.6323
23,-0.6323
24,-0.6323
25,-0.6323
26,-0.6323
27,-0.6323
28,0.32286
29,1.875
30,1.5168
31,1.875
32,1.5168
33,1.5168
34,1.1586
35,-0.5129
36,-0.6323
37,-0.6323
38,-0.6323
39,-0.6323
40,-0.6323
41,-0.6323
42,-0.6323
43,-0.6323
44,-0.6323
45,-0.6323
46,-0.6323
47,-0.6323
48,-0.6323
49,1.5168
50,1.875
51,1.5168
52,1.875
53,1.5168
54,1.5168
55,-0.5129
56,-0.6323
57,-0.6323
58,-0.6323
59,-0.6323
60,-0.6323
61,-0.6323
62,-0.6323
63,-0.6323
64,-0.6323
65,-0.6323
66,-0.6323
67,-0.6323
68,-0.6323
69,-0.6323
70,-0.6323
71,-0.6323
72,-0.6323
73,-0.6323
74,-0.6323
75,-0.6323
76,-0.6323
77,-0.6323
78,-0.6323
79,-0.6323
80,-0.6323
81,-0.6323
82,-0.6323
83,1.5168
84,1.875
85,1.5168
86,1.875
87,1.5168
88,1.5168
89,1.875
90,1.5168
91,0.8004399999999999
92,-0.6323
93,-0.6323
94,-0.6323
95,-0.6323
96,-0.6323
97,-0.6323
98,-0.6323
99,-0.6323
100,-0.6323
101,-0.6323
102,-0.6323
103,-0.6323
104,-0.6323
105,-0.6323
106,-0.6323
107,-0.6323
108,-0.6323
109,-0.6323
110,-0.6323
111,-0.6323
112,-0.6323
113,-0.6323
114,-0.6323
115,-0.6323
116,-0.6323
117,-0.6323
118,1.1586
119,1.875
120,1.5168
121,1.875
122,1.5168
123,1.875
124,1.5168
125,1.5168
126,1.1586
127,-0.6323
128,-0.6323
129,-0.6323
130,-0.6323
131,-0.6323
132,-0.6323
133,-0.6323
134,-0.6323
135,-0.6323
136,-0.6323
137,-0.6323
138,-0.6323
139,-0.6323
140,-0.6323
141,-0.6323
142,-0.6323
143,-0.6323
144,-0.6323
145,-0.6323
146,-0.6323
147,-0.6323
148,-0.6323
149,-0.6323
150,-0.6323
151,-0.6323
152,-0.6323
153,-0.6323
154,0.8004399999999999
155,1.875
156,1.5168
157,1.875
158,1.5168
159,1.875
160,1.5168
161,1.5168
162,1.5168
163,-0.15472
164,-0.5129
165,-0.6323
166,-0.6323
167,-0.6323
168,-0.6323
169,-0.6323
170,-0.6323
171,-0.6323
172,-0.6323
173,-0.6323
174,-0.15472
175,1.875
176,1.5168
177,1.875
178,1.5168
179,1.5168
180,0.8004399999999999
181,-0.6323
182,-0.6323
183,-0.6323
184,-0.6323
185,-0.6323
186,-0.6323
187,-0.6323
188,-0.6323
189,-0.6323
190,-0.6323
191,-0.6323
192,-0.6323
193,-0.6323
194,-0.6323
195,-0.6323
196,-0.6323
197,-0.6323
198,-0.6323
199,-0.6323
200,-0.6323
201,-0.6323
202,-0.6323
203,-0.6323
204,-0.6323
205,-0.6323
206,-0.6323
207,0.56165
208,1.875
209,1.5168
210,1.875
211,1.5168
212,1.5168
213,1.875
214,1.5168
215,1.5168
216,-0.5129
217,-0.6323
218,-0.6323
219,-0.6323
220,-0.6323
221,-0.6323
222,-0.6323
223,-0.6323
224,-0.6323
225,-0.6323
226,-0.6323
227,-0.6323
228,-0.6323
229,2.2332
230,1.5168
231,1.875
232,1.5168
233,1.5168
234,1.5168
235,-0.6323
236,-0.6323
237,-0.6323
238,-0.6323
239,-0.6323
240,-0.6323
241,-0.6323
242,-0.6323
243,-0.6323
244,-0.6323
245,-0.6323
246,-0.6323
247,-0.6323
248,-0.6323
249,-0.6323
250,-0.6323
251,-0.6323
252,-0.6323
253,-0.6323
254,-0.6323
255,-0.6323
256,-0.6323
257,-0.6323
258,-0.6323
259,-0.6323
260,-0.6323
261,-0.6323
262,0.8004399999999999
263,1.5168
264,1.875
265,1.875
266,1.5168
267,1.5168
268,1.875
269,1.5168
270,1.1586
271,-0.39350999999999997
272,-0.6323
273,-0.6323
274,-0.6323
275,-0.6323
276,-0.6323
277,-0.6323
278,-0.6323
279,-0.6323
280,-0.6323
281,-0.6323
282,-0.6323
283,-0.6323
284,-0.6323
285,-0.6323
286,-0.6323
287,-0.6323
288,-0.6323
289,-0.6323
290,-0.6323
291,-0.6323
292,-0.6323
293,-0.6323
294,-0.6323
295,-0.6323
296,0.56165
297,1.875
298,1.5168
299,1.875
300,1.5168
301,1.875
302,1.5168
303,1.5168
304,1.5168
305,-0.6323
306,-0.6323
307,-0.6323
308,-0.6323
309,-0.6323
310,-0.6323
311,-0.6323
312,-0.6323
313,-0.6323
314,-0.6323
315,-0.6323
316,-0.6323
317,-0.6323
318,-0.6323
319,-0.6323
320,-0.6323
321,-0.6323
322,-0.6323
323,-0.6323
324,-0.6323
325,-0.6323
326,-0.6323
327,-0.6323
328,-0.6323
329,0.56165
330,1.875
331,1.5168
332,1.875
333,1.5168
334,1.875
335,1.5168
336,1.5168
337,1.5168
338,-0.27410999999999996
339,-0.6323
340,-0.6323
341,-0.6323
342,-0.6323
343,-0.6323
344,-0.6323
345,-0.6323
346,-0.6323
347,-0.6323
348,-0.6323
349,-0.6323
350,1.5168
351,1.5168
352,1.875
353,1.5168
354,1.5168
355,1.5168
356,-0.5129
357,-0.6323
358,-0.6323
359,-0.6323
360,-0.6323
361,-0.6323
362,-0.6323
363,-0.6323
364,-0.6323
365,-0.6323
366,-0.6323
367,-0.6323
368,-0.6323
369,1.1586
370,1.875
371,1.5168
372,1.875
373,1.5168
374,1.5168
375,0.084074
376,-0.6323
377,-0.6323
378,-0.6323
379,-0.6323
380,-0.6323
381,-0.6323
382,-0.6323
383,-0.6323
384,-0.6323
385,-0.6323
386,-0.6323
387,-0.6323
388,0.32286
389,1.875
390,1.5168
391,1.875
392,1.5168
393,1.5168
394,0.8004399999999999
395,-0.5129
396,-0.6323
397,-0.6323
398,-0.6323
399,-0.6323
400,-0.6323
401,-0.6323
402,-0.6323
403,-0.6323
404,-0.6323
405,-0.6323
406,-0.6323
407,-0.6323
408,-0.6323
409,-0.6323
410,-0.6323
411,-0.6323
412,-0.6323
413,-0.6323
414,-0.6323
415,-0.6323
416,-0.6323
417,-0.6323
418,-0.6323
419,-0.6323
420,-0.6323
421,-0.6323
422,-0.6323
423,1.875
424,1.875
425,1.5168
426,1.875
427,1.5168
428,1.5168
429,1.875
430,1.5168
431,0.8004399999999999
432,-0.5129
433,-0.6323
434,-0.6323
435,-0.6323
436,-0.6323
437,-0.6323
438,-0.6323
439,-0.6323
440,-0.6323
441,-0.6323
442,-0.6323
443,-0.6323
444,-0.6323
445,-0.6323
446,-0.6323
447,-0.6323
448,-0.6323
449,-0.6323
450,-0.6323
451,-0.6323
452,-0.6323
453,-0.6323
454,-0.6323
455,-0.6323
456,-0.6323
457,0.084074
458,1.875
459,1.875
460,1.5168
461,1.875
462,1.5168
463,1.5168
464,1.875
465,1.5168
466,0.8004399999999999
467,-0.6323
468,-0.6323
469,-0.6323
470,-0.6323
471,-0.6323
472,-0.6323
473,-0.6323
474,-0.6323
475,-0.6323
476,-0.6323
477,0.32286
478,1.5168
479,1.875
480,1.5168
481,1.875
482,1.5168
483,0.32286
484,-0.6323
485,-0.6323
486,-0.6323
487,-0.6323
488,-0.6323
489,-0.6323
490,-0.6323
491,-0.6323
492,-0.6323
493,-0.6323
494,-0.6323
495,-0.6323
496,-0.6323
497,-0.6323
498,-0.6323
499,-0.6323
500,-0.6323
501,-0.6323
502,-0.6323
503,-0.6323
504,-0.6323
505,-0.6323
506,-0.6323
507,-0.6323
508,-0.6323
509,-0.6323
510,1.1586
511,1.875
512,1.875
513,1.875
514,1.5168
515,1.5168
516,1.875
517,1.5168
518,1.5168
519,-0.15472
520,-0.6323
521,-0.6323
522,-0.6323
523,-0.6323
524,-0.6323
525,-0.6323
526,-0.6323
527,-0.6323
528,-0.6323
529,-0.6323
530,-0.15472
531,1.875
532,1.5168
533,1.875
534,1.5168
535,1.5168
536,1.1586
537,-0.6323
538,-0.6323
539,-0.6323
540,-0.6323
541,-0.6323
542,-0.6323
543,-0.6323
544,-0.6323
545,-0.6323
546,-0.6323
547,-0.6323
548,-0.6323
549,-0.6323
550,-0.6323
551,-0.6323
552,-0.6323
553,-0.6323
554,-0.6323
555,-0.6323
556,-0.6323
557,-0.6323
558,-0.6323
559,-0.6323
560,-0.6323
561,-0.6323
562,-0.6323
563,-0.6323
564,0.8004399999999999
565,1.5168
566,1.875
567,1.875
568,1.5168
569,1.875
570,1.5168
571,1.5168
572,1.5168
573,1.1586
574,-0.6323
575,-0.6323
576,-0.6323
577,-0.6323
578,-0.6323
579,-0.6323
580,-0.6323
581,-0.6323
582,-0.6323
583,-0.6323
584,-0.6323
585,1.5168
586,1.875
587,1.5168
588,1.875
589,1.5168
590,1.5168
591,-0.39350999999999997
592,-0.6323
593,-0.6323
594,-0.6323
595,-0.6323
596,-0.6323
597,-0.6323
598,-0.6323
599,-0.6323
600,-0.6323
601,-0.6323
602,-0.6323
603,-0.6323
604,-0.6323
605,-0.6323
606,-0.6323
607,-0.6323
608,-0.6323
609,-0.6323
610,-0.6323
611,-0.6323
612,-0.6323
613,-0.6323
614,-0.6323
615,-0.6323
616,-0.6323
617,-0.6323
618,2.2332
619,1.875
620,1.875
621,1.5168
622,1.875
623,1.5168
624,1.5168
625,1.5168
626,0.8004399999999999
627,-0.5129
628,-0.6323
629,-0.6323
630,-0.6323
631,-0.6323
632,-0.6323
633,-0.6323
634,-0.6323
635,-0.6323
636,-0.6323
637,-0.6323
638,2.2332
639,1.875
640,1.5168
641,1.5168
642,1.875
643,0.56165
644,-0.5129
645,-0.6323
646,-0.6323
647,-0.6323
648,-0.6323
649,-0.6323
650,-0.6323
651,-0.6323
652,-0.6323
653,-0.6323
654,-0.6323
655,-0.6323
656,0.8004399999999999
657,1.5168
658,1.875
659,1.5168
660,1.875
661,1.5168
662,0.084074
663,-0.5129
664,-0.6323
665,-0.6323
666,-0.6323
667,-0.6323
668,-0.6323
669,-0.6323
670,-0.6323
671,-0.6323
672,-0.6323
673,-0.6323
674,-0.6323
675,-0.6323
676,-0.6323
677,-0.6323
678,-0.6323
679,-0.6323
680,-0.6323
681,-0.6323
682,-0.6323
683,-0.6323
684,-0.6323
685,-0.6323
686,-0.6323
687,-0.6323
688,-0.6323
689,-0.6323
690,0.32286
691,1.875
692,1.875
693,1.5168
694,1.875
695,1.5168
696,1.5168
697,1.875
698,1.5168
699,-0.15472
700,-0.5129
701,-0.6323
702,-0.6323
703,-0.6323
704,-0.6323
705,-0.6323
706,-0.6323
707,-0.6323
708,-0.6323
709,-0.6323
710,1.1586
711,1.875
712,1.5168
713,1.875
714,1.5168
715,1.5168
716,-0.6323
717,-0.6323
718,-0.6323
719,-0.6323
