time,value
0,0.53217
1,0.5828300000000001
2,0.63694
3,0.61342
4,0.52799
5,0.53988
6,0.54233
7,0.57481
8,0.5859800000000001
9,0.5503600000000001
10,0.55753
11,0.61902
12,0.6227
13,0.5494100000000001
14,0.6348600000000001
15,0.5757899999999999
16,0.6098100000000001
17,0.5481
18,0.58138
19,0.5547300000000001
20,0.48086
21,0.58809
22,0.59729
23,0.5895100000000001
24,0.5725100000000001
25,0.61041
26,0.58158
27,0.61959
28,0.5535100000000001
29,0.617
30,0.64937
31,0.58572
32,0.59021
33,0.5604
34,0.64237
35,0.60532
36,0.60702
37,0.66473
38,0.5471
39,0.61831
40,0.58896
41,0.61448
42,0.57376
43,0.6031
44,0.59901
45,0.55352
46,0.6744
47,1.0148
48,2.2487
49,3.549
50,3.8977
51,3.8117
52,3.1736
53,0.9476100000000001
54,-1.3323
55,-1.8903
56,-1.9492
57,-1.9426
58,-1.9709999999999999
59,-2.0126
60,-1.9509999999999998
61,-1.9137
62,-1.9657
63,-1.9554
64,-1.9577
65,-1.9625
66,-1.902
67,-1.8932
68,-1.8769
69,-1.8957
70,-1.9429
71,-1.8726
72,-1.8385
73,-1.8407
74,-1.8511
75,-1.8229
76,-1.8384
77,-1.8265
78,-1.7925
79,-1.7494
80,-1.7826
81,-1.7988
82,-1.7675
83,-1.7276
84,-1.7424
85,-1.6805
86,-1.6648
87,-1.6374
88,-1.5589
89,-1.6052
90,-1.5742
91,-1.526
92,-1.5081
93,-1.5703
94,-1.5226
95,-1.4508
96,-1.4584
97,-1.3919
98,-1.4133
99,-1.2819999999999998
100,-1.255
101,-1.2453
102,-1.225
103,-1.2672
104,-1.2027
105,-1.1739
106,-1.1425
107,-1.126
108,-1.0475
109,-1.0313
110,-0.95636
111,-0.9936200000000001
112,-0.9397700000000001
113,-0.8627799999999999
114,-0.90695
115,-0.82385
116,-0.8260799999999999
117,-0.77095
118,-0.72468
119,-0.68362
120,-0.62776
121,-0.57792
122,-0.59172
123,-0.5430699999999999
124,-0.53435
125,-0.48283000000000004
126,-0.51882
127,-0.40847
128,-0.41565
129,-0.35875
130,-0.28497
131,-0.35944
132,-0.29983000000000004
133,-0.26558000000000004
134,-0.19902999999999998
135,-0.21704
136,-0.17582
137,-0.14866
138,-0.082759
139,-0.080609
140,-0.030798000000000002
141,2.2573000000000002e-05
142,-0.09929400000000001
143,-0.079465
144,-0.0033878999999999997
145,-0.0067735
146,0.039598
147,0.031345
148,0.1403
149,0.10949
150,0.24201999999999999
151,0.15897999999999998
152,0.15288
153,0.19088
154,0.17338
155,0.26349
156,0.23414000000000001
157,0.24705
158,0.2626
159,0.2392
160,0.26803
161,0.27203
162,0.31526
163,0.3792
164,0.32078
165,0.32566
166,0.37714000000000003
167,0.34889000000000003
168,0.38006
169,0.39234
170,0.41983000000000004
171,0.40305
172,0.37081
173,0.39481
174,0.4557
175,0.44286000000000003
176,0.44935
177,0.41057
178,0.42828
179,0.48463
180,0.48983000000000004
181,0.52691
182,0.42223
183,0.49191999999999997
184,0.49668999999999996
185,0.5271100000000001
186,0.52877
187,0.59977
188,0.4599
189,0.46652
190,0.45971999999999996
191,0.48686999999999997
192,0.5048699999999999
193,0.49698000000000003
194,0.58528
195,0.55057
196,0.51842
197,0.51056
198,0.49001999999999996
199,0.5232399999999999
200,0.48768999999999996
201,0.58757
202,0.56187
203,0.50572
204,0.49851999999999996
205,0.49877
206,0.54114
207,0.47126999999999997
208,0.60016
209,0.6087100000000001
210,0.5060600000000001
211,0.51408
212,0.57812
213,0.53501
214,0.57898
215,0.51485
216,0.52428
217,0.5467
218,0.58805
219,0.60201
220,0.53863
221,0.5031899999999999
222,0.54504
223,0.54535
224,0.5266
225,0.5189699999999999
226,0.56634
227,0.47541000000000005
228,0.58727
229,0.57226
230,0.60532
231,0.57484
232,0.5058699999999999
233,0.51798
234,0.57839
235,0.56283
236,0.56274
237,0.6349199999999999
238,0.59768
239,0.5017
240,0.55781
241,0.52484
242,0.57916
243,0.5726899999999999
244,0.55796
245,0.5503100000000001
246,0.55472
247,0.5030100000000001
248,0.6016100000000001
249,0.66341
250,0.57938
251,0.5495899999999999
252,0.59775
253,0.53083
254,0.5711
255,0.59851
256,0.55966
257,0.5596300000000001
258,0.51755
259,0.642
260,0.57981
261,0.4882
262,0.54843
263,0.54185
264,0.5280100000000001
265,0.53395
266,0.55987
267,0.58577
268,0.5224300000000001
269,0.6382800000000001
270,0.5031800000000001
271,0.5156
272,0.58455
273,0.58596
274,0.51815
