time,value
0,-1.7742
1,-1.7742
2,-1.7742
3,-1.7742
4,-1.7742
5,-1.7742
6,-1.7742
7,-1.7742
8,-1.7742
9,-1.7742
10,-1.7742
11,-1.7742
12,-1.7742
13,-1.7742
14,-1.7742
15,-1.7742
16,-1.7742
17,-1.7742
18,-1.7742
19,-1.7742
20,-1.7742
21,-1.7742
22,-1.7742
23,-1.7742
24,-1.7742
25,-1.7742
26,-1.7742
27,-1.7742
28,-1.7742
29,-1.7742
30,-1.7742
31,-1.7742
32,-1.7742
33,-1.7742
34,-1.7742
35,-1.7742
36,-1.7742
37,-1.7742
38,-1.7742
39,-1.7742
40,-1.7742
41,-1.7742
42,-1.7742
43,-1.7742
44,-1.7742
45,-1.7742
46,-1.7742
47,-1.7742
48,-1.7742
49,-1.7742
50,-1.7742
51,-1.7742
52,-1.7731
53,-1.7715
54,-1.7557
55,-1.7321
56,-1.7085
57,-1.6848
58,-1.6492
59,-1.6031
60,-1.545
61,-1.4741
62,-1.4032
63,-1.3323
64,-1.2535
65,-1.1617
66,-1.069
67,-0.9745
68,-0.88182
69,-0.79408
70,-0.71008
71,-0.63917
72,-0.56826
73,-0.49733999999999995
74,-0.42643000000000003
75,-0.35552
76,-0.28461
77,-0.2137
78,-0.14285
79,-0.07674199999999999
80,-0.010637
81,0.014665000000000001
82,0.038303
83,0.061939999999999995
84,0.085578
85,0.098924
86,0.11054000000000001
87,0.11282
88,0.11282
89,0.11282
90,0.11282
91,0.11282
92,0.11282
93,0.11282
94,0.11282
95,0.11282
96,0.11282
97,0.11282
98,0.11282
99,0.11282
100,0.11282
101,0.12791
102,0.16236
103,0.20176
104,0.24904
105,0.29845
106,0.35213
107,0.4173
108,0.51185
109,0.6064
110,0.70095
111,0.79098
112,0.85988
113,0.92611
114,0.9733799999999999
115,1.0207
116,1.0679
117,1.1143
118,1.1167
119,1.1191
120,1.1192
121,1.1192
122,1.1038
123,1.087
124,1.0439
125,0.9966200000000001
126,0.94934
127,0.90207
128,0.86846
129,0.8392200000000001
130,0.81393
131,0.7902899999999999
132,0.76665
133,0.74302
134,0.71938
135,0.6957399999999999
136,0.6721
137,0.64847
138,0.63836
139,0.6419699999999999
140,0.6544800000000001
141,0.67811
142,0.70175
143,0.72539
144,0.75692
145,0.8038
146,0.8507899999999999
147,0.8980600000000001
148,0.94534
149,0.99261
150,1.0399
151,1.0872
152,1.1344
153,1.1817
154,1.2275
155,1.256
156,1.2843
157,1.3079
158,1.3315
159,1.3505
160,1.3693
161,1.3708
162,1.3708
163,1.3708
164,1.3708
165,1.3708
166,1.3708
167,1.3708
168,1.3708
169,1.3702
170,1.3694
171,1.338
172,1.2907
173,1.2434
174,1.1961
175,1.1433
176,1.0859999999999999
177,1.0219
178,0.95095
179,0.88003
180,0.80912
181,0.7460399999999999
182,0.69476
183,0.64486
184,0.59759
185,0.55361
186,0.51755
187,0.49022
188,0.49022
189,0.49022
190,0.49022
191,0.49231
192,0.50753
193,0.52347
194,0.54711
195,0.5707399999999999
196,0.59438
197,0.61802
198,0.64166
199,0.6652899999999999
200,0.68893
201,0.71257
202,0.73621
203,0.75984
204,0.7834800000000001
205,0.80712
206,0.83076
207,0.85439
208,0.86334
209,0.86655
210,0.86761
211,0.86761
212,0.8636799999999999
213,0.8572700000000001
214,0.8411700000000001
215,0.8175399999999999
216,0.7939
217,0.7702600000000001
218,0.74662
219,0.7229899999999999
220,0.69935
221,0.67571
222,0.65278
223,0.63115
224,0.61602
225,0.61602
226,0.61602
227,0.61602
228,0.61374
229,0.60212
230,0.58877
231,0.56514
232,0.5415
233,0.51786
234,0.49506000000000006
235,0.49265
236,0.49025
237,0.49022
238,0.49022
239,0.48348
240,0.47626999999999997
241,0.45456
242,0.43091999999999997
243,0.40729
244,0.38365
245,0.3731
246,0.36629
247,0.36441999999999997
248,0.36441999999999997
249,0.36253
250,0.35973
251,0.34399
252,0.32035
253,0.29671
254,0.27307
255,0.25585
256,0.24463000000000001
257,0.23861999999999997
258,0.23861999999999997
259,0.23861999999999997
260,0.23861999999999997
261,0.23861999999999997
262,0.23861999999999997
263,0.23861999999999997
264,0.23861999999999997
265,0.23658
266,0.22855999999999999
267,0.21739
268,0.19375
269,0.17010999999999998
270,0.14647000000000002
271,0.12284
272,0.099199
273,0.075562
274,0.051924
275,0.028287
276,0.0082318
277,-0.0118
278,-0.012978
279,-0.012978
280,-0.012978
281,-0.012978
282,-0.024038999999999998
283,-0.03726
284,-0.058651
285,-0.082288
286,-0.10593
287,-0.12955999999999998
288,-0.13768
289,-0.13848
290,-0.13878
291,-0.13878
292,-0.13878
293,-0.13878
294,-0.13878
295,-0.13878
296,-0.13878
297,-0.13878
298,-0.13878
299,-0.13878
300,-0.13878
301,-0.13878
302,-0.13878
303,-0.13878
304,-0.13878
305,-0.13878
306,-0.13878
307,-0.13878
308,-0.13878
309,-0.13878
310,-0.13878
311,-0.13878
312,-0.13878
313,-0.13878
314,-0.13878
