time,value
0,0.63651
1,0.5020899999999999
2,0.31848000000000004
3,0.10661
4,-0.11884000000000002
5,-0.34734
6,-0.55505
7,-0.72124
8,-0.85244
9,-0.92719
10,-0.9315399999999999
11,-0.87316
12,-0.74897
13,-0.56076
14,-0.32498
15,-0.07699099999999999
16,0.16132
17,0.37271
18,0.53622
19,0.65381
20,0.73854
21,0.7904399999999999
22,0.8197399999999999
23,0.82081
24,0.78864
25,0.70113
26,0.54602
27,0.3179
28,0.03277
29,-0.27819
30,-0.57423
31,-0.80643
32,-0.9436700000000001
33,-0.96631
34,-0.8774
35,-0.69699
36,-0.46442
37,-0.21395999999999998
38,0.027763
39,0.23686999999999997
40,0.39878
41,0.5078699999999999
42,0.55506
43,0.53455
44,0.44382
45,0.28776999999999997
46,0.08090499999999999
47,-0.15235
48,-0.36004
49,-0.50412
50,-0.55565
51,-0.49706000000000006
52,-0.34598
53,-0.13105999999999998
54,0.09840700000000001
55,0.29475999999999997
56,0.43278999999999995
57,0.49993000000000004
58,0.5159199999999999
59,0.49954
60,0.47112
61,0.43838999999999995
62,0.38771
63,0.29803
64,0.14653
65,-0.06894199999999999
66,-0.3249
67,-0.57705
68,-0.76936
69,-0.8583
70,-0.81655
71,-0.64684
72,-0.38814
73,-0.10638
74,0.13864
75,0.31046
76,0.38825
77,0.38459
78,0.34048
79,0.28985
80,0.26673
81,0.26816999999999996
82,0.27824
83,0.26729
84,0.20805
85,0.095515
86,-0.058928999999999995
87,-0.22384
88,-0.35699000000000003
89,-0.42411000000000004
90,-0.40926999999999997
91,-0.32164
92,-0.17770999999999998
93,-0.017702000000000002
94,0.13223
95,0.24368
96,0.31778
97,0.35675
98,0.37067
99,0.36048
100,0.31606999999999996
101,0.22946999999999998
102,0.09564600000000001
103,-0.076102
104,-0.26979000000000003
105,-0.45838
106,-0.59345
107,-0.64662
108,-0.60638
109,-0.47586000000000006
110,-0.27742
111,-0.0481
112,0.17234000000000002
113,0.36574
114,0.50895
115,0.59415
116,0.63551
117,0.63183
118,0.5737300000000001
119,0.45887
120,0.28511
121,0.057842
122,-0.19726
123,-0.45182
124,-0.6570600000000001
125,-0.78942
126,-0.82278
127,-0.7539
128,-0.5981
129,-0.38756
130,-0.15300999999999998
131,0.08544500000000001
132,0.30691
133,0.5109199999999999
134,0.68687
135,0.8223299999999999
136,0.90704
137,0.91491
138,0.8391200000000001
139,0.66269
140,0.40312
141,0.082687
142,-0.26195
143,-0.59502
144,-0.8810600000000001
145,-1.0954
146,-1.2238
147,-1.2609
148,-1.1929
149,-1.0267
150,-0.75739
151,-0.38358000000000003
152,0.08033
153,0.60091
154,1.1212
155,1.5812
156,1.9152
157,2.0641
158,2.0043
159,1.7217
160,1.2462
161,0.62851
162,-0.07170599999999999
163,-0.78184
164,-1.4416
165,-1.9889
166,-2.3781
167,-2.5852
168,-2.5813
169,-2.3636
170,-1.9312
171,-1.3152
172,-0.55506
173,0.28386
174,1.1179999999999999
175,1.8746
176,2.4662
177,2.841
178,2.9653
179,2.8269
180,2.4612
181,1.9
182,1.2083
183,0.44564
184,-0.32855999999999996
185,-1.048
186,-1.673
187,-2.1604
188,-2.4861
189,-2.6244
190,-2.5639999999999996
191,-2.3107
192,-1.8723
193,-1.2852
194,-0.5971
195,0.12069
196,0.81005
197,1.4069
198,1.8430000000000002
199,2.0858
200,2.1302
201,1.9919
202,1.6982
203,1.2997
204,0.8352799999999999
205,0.34923000000000004
206,-0.11994
207,-0.54677
208,-0.9081299999999999
209,-1.1858
210,-1.3582
211,-1.4152
212,-1.358
213,-1.1913
214,-0.93606
215,-0.6334
216,-0.31185999999999997
217,-0.017502
218,0.23924
219,0.44647
220,0.60914
221,0.7389600000000001
222,0.8343
223,0.9009799999999999
224,0.9286
225,0.90674
226,0.82963
227,0.69504
228,0.51955
229,0.31793000000000005
230,0.10627
231,-0.10067000000000001
232,-0.30061
233,-0.49245
234,-0.67807
235,-0.8467
236,-0.97972
237,-1.0591
238,-1.0555
239,-0.95841
240,-0.75958
241,-0.48563
242,-0.1652
243,0.15661
244,0.4408
245,0.6631100000000001
246,0.81035
247,0.88208
248,0.8984
249,0.8763
250,0.8325600000000001
251,0.76684
252,0.6795
253,0.56112
254,0.40047
255,0.20018
256,-0.037972000000000006
257,-0.30344
258,-0.58305
259,-0.85362
260,-1.0866
261,-1.2552
262,-1.3274
263,-1.2851
264,-1.1232
265,-0.84698
266,-0.48095
267,-0.068523
268,0.35503
269,0.74744
270,1.0823
271,1.3317
272,1.489
273,1.5423
274,1.4874
275,1.3165
276,1.03
277,0.64326
278,0.17606
279,-0.32086
280,-0.79079
281,-1.1823
282,-1.4452
283,-1.5536
284,-1.5158
285,-1.3645
286,-1.1406
287,-0.88026
288,-0.61807
289,-0.34467
290,-0.055064
291,0.26792
292,0.61211
293,0.9581
294,1.2603
295,1.4685
296,1.5531
297,1.4807
298,1.2608
299,0.93066
300,0.53823
301,0.12697999999999998
302,-0.26506
303,-0.61592
304,-0.9118
305,-1.1396
306,-1.2996
307,-1.3745
308,-1.3487
309,-1.2128
310,-0.9651700000000001
311,-0.62553
312,-0.22415
313,0.19328
314,0.58596
315,0.9131799999999999
316,1.1572
317,1.3019
318,1.3507
319,1.2941
320,1.1382
321,0.88787
322,0.54827
323,0.14271
324,-0.29420999999999997
325,-0.71311
326,-1.0605
327,-1.2930000000000001
328,-1.3823
329,-1.3231
330,-1.133
331,-0.83285
332,-0.46918999999999994
333,-0.084189
334,0.28933000000000003
335,0.61954
336,0.87524
337,1.0437
338,1.1143
339,1.0834
340,0.95573
341,0.73956
342,0.46271999999999996
343,0.14751
344,-0.1756
345,-0.46678000000000003
346,-0.69993
347,-0.8522700000000001
348,-0.9036700000000001
349,-0.85645
350,-0.7195
351,-0.50748
352,-0.24024
353,0.043585000000000006
354,0.31855
355,0.55767
356,0.73398
357,0.82216
358,0.81565
359,0.72249
360,0.5494
361,0.31083
362,0.030391
363,-0.26671999999999996
364,-0.5507
365,-0.78418
366,-0.94671
367,-1.0195
368,-0.9816600000000001
369,-0.8409200000000001
370,-0.6107600000000001
371,-0.31484
372,0.022649000000000002
373,0.37035999999999997
374,0.69462
375,0.96147
376,1.1494
377,1.232
378,1.1982
379,1.0465
380,0.77887
381,0.42777
382,0.025065
383,-0.38916
384,-0.7781600000000001
385,-1.0956
386,-1.3045
387,-1.3907
388,-1.3284
389,-1.1217
390,-0.78838
391,-0.36327
392,0.11567000000000001
393,0.60233
394,1.028
395,1.3484
396,1.5231
397,1.5119
398,1.3259
399,0.98534
400,0.53874
401,0.044152
402,-0.43107
403,-0.83415
404,-1.1291
405,-1.3006
406,-1.3464
407,-1.2708
408,-1.0895
409,-0.82291
410,-0.48186
411,-0.09261
412,0.31929
413,0.71732
414,1.0590000000000002
415,1.3003
416,1.4063
417,1.3575
418,1.1499
419,0.8074899999999999
420,0.37156
421,-0.10437
422,-0.5611
423,-0.94153
424,-1.1982
425,-1.3076
426,-1.2623
427,-1.0801
428,-0.7853399999999999
429,-0.4168
430,-0.016543000000000002
431,0.3765
432,0.7145100000000001
433,0.9787299999999999
434,1.1522
435,1.2237
436,1.1849
437,1.0483
438,0.81318
439,0.48538000000000003
440,0.089865
441,-0.34872
442,-0.78783
443,-1.1811
444,-1.4722
445,-1.6156
446,-1.5963
447,-1.4069999999999998
448,-1.067
449,-0.6197699999999999
450,-0.11599000000000001
451,0.39574000000000004
452,0.8726700000000001
453,1.2806
454,1.5967
455,1.7966
456,1.8595
457,1.7711
458,1.5255
459,1.1251
460,0.58992
461,-0.037188
462,-0.68661
463,-1.2849
464,-1.758
465,-2.0477
466,-2.1264
467,-1.9917
468,-1.6749
469,-1.2347
470,-0.71937
471,-0.1819
472,0.33901
473,0.80853
474,1.2062
475,1.5194
476,1.7333
477,1.8306
478,1.7996
479,1.6274
480,1.3145
481,0.8782399999999999
482,0.34729
483,-0.22964
484,-0.7860699999999999
485,-1.2581
486,-1.5959999999999999
487,-1.771
488,-1.7586
489,-1.5866
490,-1.2786
491,-0.8795700000000001
492,-0.43061000000000005
493,0.010020999999999999
494,0.40828000000000003
495,0.74373
496,0.99
497,1.1307
498,1.1777
499,1.1304
