time,value
0,-0.15975999999999999
1,0.095302
2,0.15275999999999998
3,-0.010579999999999999
4,-0.063387
5,0.1305
6,-0.2509
7,-0.38691
8,0.043866
9,0.048799
10,0.30966
11,0.24276999999999999
12,0.090111
13,-0.35216
14,-0.046512
15,0.031695
16,0.32169000000000003
17,0.0075143
18,-0.10784
19,0.27765
20,0.33209
21,-0.067634
22,0.11182
23,0.15871
24,-0.16021
25,-0.32256
26,0.78376
27,0.29141
28,-0.10575999999999999
29,0.25513
30,-0.28300000000000003
31,0.29120999999999997
32,-0.46142
33,-0.014851
34,-0.50752
35,-0.6653600000000001
36,-0.3231
37,0.13665
38,1.5505
39,1.5505
40,1.5505
41,1.5505
42,1.5505
43,1.5505
44,1.5505
45,1.5505
46,1.5505
47,1.5505
48,-1.5374
49,-1.5374
50,-1.5374
51,-1.5374
52,-1.5374
53,-1.5374
54,-1.5374
55,-1.5374
56,-1.5374
57,-1.5374
58,-0.35078000000000004
59,-0.23426
60,0.26059
61,-0.5788800000000001
62,0.22052
63,0.0543
64,0.29096
65,0.66369
66,-0.43838
67,-0.6111
68,-0.0025706999999999995
69,-0.062947
70,-0.40526999999999996
71,0.6187600000000001
72,0.435
73,-0.09081
74,-0.054291
75,-0.54838
76,-0.28934
77,0.42443000000000003
78,-0.070421
79,0.18154
80,0.34331999999999996
81,-0.36535
82,-0.0057973
83,0.48616000000000004
84,-0.24638000000000002
85,-0.22455
86,0.41606000000000004
87,-0.2779
88,0.1267
89,1.5505
90,1.5505
91,1.5505
92,1.5505
93,1.5505
94,1.5505
95,1.5505
96,1.5505
97,1.5505
98,1.5505
99,1.5505
100,1.5505
101,1.5505
102,1.5505
103,1.5505
104,-1.5374
105,-1.5374
106,-1.5374
107,-1.5374
108,-1.5374
109,-1.5374
110,-1.5374
111,-1.5374
112,-1.5374
113,-1.5374
114,-1.5374
115,-1.5374
116,-1.5374
117,-1.5374
118,-1.5374
119,0.2379
120,0.28968
121,-0.7748
122,0.20365
123,-0.10289000000000001
124,0.027835000000000002
125,0.08904
126,0.14568
127,0.069261
