time,value
0,-0.23381999999999997
1,-0.23381999999999997
2,-0.23381999999999997
3,-0.23381999999999997
4,-0.23381999999999997
5,-0.23381999999999997
6,-0.23381999999999997
7,-0.23381999999999997
8,-0.23381999999999997
9,-0.23381999999999997
10,-0.23381999999999997
11,-0.23381999999999997
12,-0.23381999999999997
13,-0.23381999999999997
14,-0.23381999999999997
15,-0.23381999999999997
16,-0.23381999999999997
17,-0.23381999999999997
18,-0.23381999999999997
19,-0.23381999999999997
20,-0.23381999999999997
21,-0.23381999999999997
22,-0.23381999999999997
23,-0.23381999999999997
24,-0.23381999999999997
25,-0.23381999999999997
26,-0.23381999999999997
27,-0.23381999999999997
28,-0.23381999999999997
29,-0.23381999999999997
30,-0.23381999999999997
31,-0.23381999999999997
32,-0.23381999999999997
33,-0.23381999999999997
34,-0.23381999999999997
35,-0.23381999999999997
36,-0.23381999999999997
37,-0.23381999999999997
38,-0.23381999999999997
39,-0.23381999999999997
40,-0.23381999999999997
41,-0.23381999999999997
42,-0.23381999999999997
43,-0.23381999999999997
44,-0.23381999999999997
45,-0.23381999999999997
46,-0.23381999999999997
47,-0.23381999999999997
48,-0.2372
49,-0.24414
50,-0.25290999999999997
51,-0.26418
52,-0.27768000000000004
53,-0.29521
54,-0.31745
55,-0.35129
56,-0.38511999999999996
57,-0.41895
58,-0.45278999999999997
59,-0.48662
60,-0.52046
61,-0.55429
62,-0.58759
63,-0.60112
64,-0.61466
65,-0.61519
66,-0.61519
67,-0.60727
68,-0.59842
69,-0.56886
70,-0.53503
71,-0.5012
72,-0.46736000000000005
73,-0.42627
74,-0.38201999999999997
75,-0.33723000000000003
76,-0.29212
77,-0.23955
78,-0.18125
79,-0.11825999999999999
80,-0.24795
81,0.096415
82,0.44864
83,0.1623
84,0.24124
85,0.32019000000000003
86,0.39913000000000004
87,0.47566
88,0.54437
89,0.6129
90,0.68056
91,0.7482300000000001
92,0.8159
93,0.8835700000000001
94,0.95124
95,1.0189
96,1.084
97,1.1491
98,1.2063
99,1.2627
100,1.3191
101,1.3755
102,1.4240000000000002
103,1.4704
104,1.5158
105,1.5609
106,1.594
107,1.6203
108,1.6380000000000001
109,1.6493
110,1.6605
111,1.6718
112,1.6831
113,1.6944
114,1.7056
115,1.7169
116,1.722
117,1.7135
118,1.7043
119,1.693
120,1.6817
121,1.6704
122,1.6591
123,1.6479
124,1.6368
125,1.6301
126,1.6233
127,1.6343
128,1.6456
129,1.6569
130,1.6682
131,1.6711
132,1.6727
133,1.673
134,1.673
135,1.6688
136,1.6629
137,1.6534
138,1.6421
139,1.6309
140,1.6196
141,1.6083
142,1.597
143,1.5858
144,1.5745
145,1.5594
146,1.5386
147,1.5172
148,1.4947
149,1.4691
150,1.4351
151,1.3989
152,1.3538
153,1.3087
154,1.2635
155,1.2184
156,1.1733
157,1.1282
158,1.0831
159,1.038
160,1.0279
161,1.0203
162,1.0192
163,1.0192
164,1.0103
165,0.99923
166,0.97969
167,0.9571299999999999
168,0.93225
169,0.90622
170,0.86865
171,0.8235299999999999
172,0.77842
173,0.73331
174,0.68384
175,0.62953
176,0.57438
177,0.51799
178,0.46343999999999996
179,0.41243
180,0.36304000000000003
181,0.31793000000000005
182,0.27183
183,0.22204000000000002
184,0.16802
185,0.45042
186,0.055686
187,-0.33904
188,-0.14812
189,-0.25413
190,-0.36014
191,-0.47257
192,-0.58535
193,-0.68895
194,-0.79132
195,-0.8837799999999999
196,-0.9740000000000001
197,-1.0621
198,-1.1496
199,-1.2235
200,-1.2912
201,-1.3588
202,-1.4265
203,-1.4746
204,-1.5069
205,-1.5344
206,-1.557
207,-1.569
208,-1.5663
209,-1.5527
210,-1.5188
211,-1.4843
212,-1.4480000000000002
213,-1.4073
214,-1.3509
215,-1.2945
216,-1.2381
217,-1.1817
218,-1.1253
219,-1.0689
220,-1.0125
221,-0.9561299999999999
222,-0.90441
223,-0.85288
224,-0.80709
225,-0.76198
226,-0.71945
227,-0.67747
228,-0.65891
229,-0.64764
230,-0.63636
231,-0.62508
232,-0.62454
233,-0.63027
234,-0.63913
235,-0.65041
236,-0.66638
237,-0.68702
238,-0.7134
239,-0.7472300000000001
240,-0.78266
241,-0.82083
242,-0.87476
243,-0.96498
244,-1.0552
245,-1.1454
246,-1.2328
247,-1.3064
248,-1.3793
249,-1.4469999999999998
250,-1.5147
251,-1.5823
252,-1.65
253,-1.7177
254,-1.7853
255,-1.8505
256,-1.9154
257,-1.9446
258,-1.9672
259,-1.9897
260,-2.0123
261,-1.9595
262,-1.876
263,-1.7664
264,-1.6424
265,-1.5208
266,-1.4011
267,-1.2849
268,-1.1721
269,-1.0594
270,-0.9465899999999999
271,-0.83381
272,-0.7210300000000001
273,-0.60825
274,-0.49546999999999997
275,-0.39066999999999996
276,-0.30982
277,-0.23139
278,-0.16372
279,-0.48263999999999996
280,-0.20676999999999998
281,0.06349400000000001
282,0.23265999999999998
283,0.40183
284,0.11182
285,0.14427
286,0.13644
287,0.12517
288,0.11389
289,0.10260999999999999
290,0.43087
291,0.33544
292,0.22746
293,0.11467999999999999
294,0.10730999999999999
295,-0.077801
296,-0.14905
297,-0.20544
298,-0.26092
299,-0.31556999999999996
300,-0.31909
301,-0.2627
302,-0.20631
303,-0.14992
304,-0.09353
305,-0.24047
306,0.13546
307,0.07564
308,0.1358
309,0.21126999999999999
310,0.29166
311,0.40444
312,0.10244
313,0.12499
314,0.14755
315,-1.0281
316,-1.0281
317,-1.0281
318,-1.0281
319,-1.0281
320,-1.0281
321,-1.0281
322,-1.0281
323,-1.0281
324,-1.0281
325,-1.0281
326,-1.0281
327,-1.0281
328,-1.0281
329,-1.0281
330,-1.0281
331,-1.0281
332,-1.0281
333,-1.0281
334,-1.0281
335,-1.0281
336,-1.0281
337,-1.0281
338,-1.0281
339,-1.0281
340,-1.0281
341,-1.0281
342,-1.0281
343,-1.0281
344,-1.0281
345,-1.0281
346,-1.0281
347,-1.0281
348,-1.0281
349,-1.0281
350,-1.0281
351,-1.0281
352,-1.0281
353,-1.0281
354,-1.0281
355,-1.0281
356,-1.0281
357,-1.0281
358,-1.0281
359,-1.0281
360,-1.0281
361,-1.0281
362,-1.0281
363,-1.0281
364,-1.0281
365,-1.0281
366,-1.0281
367,-1.0281
368,-1.0281
369,-1.0281
370,-1.0281
371,-1.0281
372,-1.0281
373,-1.0249
374,-1.0051
375,-0.9852299999999999
376,-0.96415
377,-0.9424
378,-0.8960100000000001
379,-0.84962
380,-0.78703
381,-0.72377
382,-0.64571
383,-0.56591
384,-0.44738999999999995
385,-0.32087
386,-0.19435999999999998
387,-0.33418000000000003
388,0.43412
389,0.25126
390,0.41875
391,0.58744
392,0.74217
393,0.8862
394,1.0215
395,1.148
396,1.27
397,1.3861
398,1.4906
399,1.5749
400,1.6592
401,1.7436
402,1.8234
403,1.8886
404,1.9535
405,2.0167
406,2.0775
407,2.1167
408,2.1552
409,2.1763
410,2.1974
411,2.2138
412,2.23
413,2.2315
414,2.2315
415,2.2315
416,2.2315
417,2.2023
418,2.1646
419,2.1238
420,2.0816
421,2.0319
422,1.9781
423,1.9188
424,1.8555
425,1.7899
426,1.7221
427,1.6469
428,1.5626
429,1.4782
430,1.3939
431,1.3095
432,1.2252
433,1.1409
434,1.0565
435,0.97635
436,0.9147200000000001
437,0.85539
438,0.81321
439,0.77149
440,0.73775
441,0.70401
442,0.70357
443,0.70357
444,0.70357
445,0.70357
446,0.68803
447,0.66987
448,0.6494
449,0.62831
450,0.59924
451,0.56713
452,0.5284
453,0.48622
454,0.44866000000000006
455,0.41428000000000004
456,0.39799
457,0.39799
458,0.39799
459,0.39799
460,0.39095
461,0.3731
462,0.3542
463,0.33311
464,0.31484
465,0.30446
466,0.29613
467,0.29613
468,0.29707
469,0.3042
470,0.31365
471,0.35581999999999997
472,0.39799
473,0.44016000000000005
474,0.48233000000000004
475,0.47541000000000005
476,0.46503
477,0.44535
478,0.42427
479,0.41151000000000004
480,0.40081
481,0.39799
482,0.39799
483,0.40016999999999997
484,0.40341
485,0.41745
486,0.43854
487,0.45962
488,0.48071
489,0.5018
490,0.52288
491,0.54397
492,0.56505
493,0.5827
494,0.59373
495,0.6017100000000001
496,0.6017100000000001
497,0.6017100000000001
498,0.6017100000000001
499,0.6017100000000001
500,0.6017100000000001
501,0.6017100000000001
502,0.6017100000000001
503,0.60082
504,0.53335
505,0.46587
506,0.38242
507,0.29807
508,0.17084000000000002
509,0.1942
510,-0.14148
511,-0.33125
512,-0.51908
513,-0.70625
514,-0.8807799999999999
515,-1.0495
516,-1.2181
517,-1.3868
518,-1.5007
519,-1.5701
520,-1.6262
521,-1.6684
522,-1.6908
523,-1.6859
524,-1.6603
525,-1.597
526,-1.5325
527,-1.4647
528,-1.3885
529,-1.2830000000000001
530,-1.1776
531,-1.0722
532,-0.96525
533,-0.8436
534,-0.72182
535,-0.59531
536,-0.4688
537,-0.36846
538,-0.26919
539,-0.20214000000000001
540,-0.13889
541,-0.38924000000000003
542,-0.092422
543,0.058337
544,0.16377
545,0.26919
546,0.37462
547,0.37966
548,0.32613000000000003
549,0.24324
550,0.13781
551,0.22303
552,-0.073043
553,-0.17847000000000002
554,-0.2839
555,-0.39829000000000003
556,-0.10662
557,-0.15024
558,-0.23458
559,-0.31893
560,-0.40326999999999996
561,-0.49294
562,-0.60842
563,-0.72507
564,-0.8515799999999999
565,-0.9774299999999999
566,-1.0871
567,-1.1967
568,-1.2817
569,-1.3661
570,-1.4469
571,-1.5273
572,-1.5578
573,-1.5789
574,-1.6
575,-1.621
576,-1.5121
577,-1.3503
578,-1.1432
579,-0.91127
580,-0.6934100000000001
581,-0.4858
582,-0.29816
583,-0.12947999999999998
584,0.19236
585,0.20226
586,0.33635
587,0.4207
588,0.5050399999999999
589,0.58938
590,0.6662600000000001
591,0.7207600000000001
592,0.77299
593,0.81516
594,0.85365
595,0.86467
596,0.8729
597,0.83073
598,0.78856
599,0.74575
600,0.70293
601,0.6412899999999999
602,0.57803
603,0.51477
604,0.45151
605,0.37673
606,0.29888000000000003
607,0.21633000000000002
608,0.13198
609,0.29233000000000003
610,-0.054775
611,-0.32121
612,-0.10742
613,-0.14925
614,-0.19077
615,-0.21316999999999997
616,-0.21316999999999997
617,-0.21316999999999997
618,-0.21316999999999997
619,-0.20378
620,-0.17524
621,-0.1431
622,-0.49962
623,-0.28876999999999997
624,-0.07791000000000001
625,0.13295
626,0.3438
627,0.10993
628,0.1521
629,0.19427
630,0.3471
631,0.3471
632,0.3471
633,0.3471
634,0.3471
635,0.3471
636,0.3471
637,0.3471
638,0.3471
639,0.3471
640,0.3471
641,0.3471
642,0.3471
643,0.3471
644,0.3471
645,0.3471
646,0.3471
647,0.3471
648,0.3471
649,0.3471
650,0.3471
651,0.3471
652,0.3471
653,0.3471
654,0.3471
655,0.3471
656,0.3471
657,0.3471
658,0.3471
659,0.3471
660,0.3471
661,0.3471
662,0.3471
663,0.3471
664,0.3471
665,0.3471
666,0.3471
667,0.3471
668,0.3471
669,0.3471
670,0.3471
671,0.3471
672,0.3471
673,0.3471
674,0.3471
675,0.3471
676,0.3471
677,0.3471
678,0.35291
679,0.36484
680,0.37990999999999997
681,0.3993
682,0.41963999999999996
683,0.44171000000000005
684,0.46581000000000006
685,0.49488999999999994
686,0.52398
687,0.55306
688,0.58214
689,0.61122
690,0.6403
691,0.66938
692,0.69816
693,0.7156100000000001
694,0.73306
695,0.74306
696,0.75275
697,0.76925
698,0.78655
699,0.82165
700,0.8604299999999999
701,0.8992
702,0.9379799999999999
703,0.97051
704,1.0003
705,1.0297
706,1.0588
707,1.0911
708,1.1258
709,1.1626
710,1.2014
711,1.2412
712,1.2823
713,1.3262
714,1.3747
715,1.4231
716,1.4716
717,1.518
718,1.5576
719,1.5972
720,1.6359
721,1.6718
722,1.683
723,1.6934
724,1.6837
725,1.6740000000000002
726,1.6556
727,1.6369
728,1.5912
729,1.5427
730,1.4943
731,1.4458
732,1.3973
733,1.3489
734,1.3004
735,1.2519
736,1.2
737,1.1461
738,1.0898
739,1.0316
740,0.97562
741,0.92163
742,0.87445
743,0.83567
744,0.7969
745,0.75812
746,0.71934
747,0.68057
748,0.64179
749,0.60302
750,0.56616
751,0.53783
752,0.51055
753,0.49117
754,0.47157
755,0.44831000000000004
756,0.42504
757,0.38647
758,0.3477
759,0.30892
760,0.27014
761,0.22423
762,0.1771
763,0.12891
764,0.40724
765,0.1649
766,-0.077452
767,-0.3198
768,-0.11344000000000001
769,-0.16297
770,-0.21322
771,-0.26764
772,-0.32581
773,-0.38397
774,-0.44213
775,-0.5003
776,-0.5584600000000001
777,-0.61662
778,-0.67479
779,-0.73295
780,-0.7911100000000001
781,-0.8492799999999999
782,-0.9074399999999999
783,-0.9651700000000001
784,-1.0201
785,-1.0739
786,-1.1127
787,-1.1514
788,-1.1902
789,-1.229
790,-1.2753
791,-1.3221
792,-1.3704
793,-1.4188
794,-1.4596
795,-1.4986
796,-1.5302
797,-1.5593
798,-1.5884
799,-1.6175
800,-1.6466
801,-1.6756
802,-1.7047
803,-1.7338
804,-1.7591
805,-1.7803
806,-1.8008
807,-1.8202
808,-1.8348
809,-1.8403
810,-1.8416
811,-1.8319
812,-1.8214
813,-1.8077
814,-1.7903
815,-1.7516
816,-1.7128
817,-1.6740000000000002
818,-1.635
819,-1.5807
820,-1.5265
821,-1.4685
822,-1.4103
823,-1.3837
824,-1.3614
825,-1.3730000000000002
826,-1.3924
827,-1.4145
828,-1.4375
829,-1.4779
830,-1.5264
831,-1.5748
832,-1.6233
833,-1.655
834,-1.673
835,-1.6869999999999998
836,-1.6967
837,-1.7009
838,-1.6976
839,-1.6886
840,-1.6692
841,-1.6492
842,-1.6278
843,-1.6024
844,-1.5636
845,-1.5249
846,-1.4861
847,-1.4459
848,-1.3923
849,-1.3384
850,-1.2803
851,-1.2221
852,-1.172
853,-1.1222
854,-1.0822
855,-1.0435
856,-1.0062
857,-0.9691799999999999
858,-0.9456200000000001
859,-0.9262299999999999
860,-0.90685
861,-0.88746
862,-0.86345
863,-0.8367600000000001
864,-0.80871
865,-0.77963
866,-0.74854
867,-0.71543
868,-0.67986
869,-0.64108
870,-0.60231
871,-0.56353
872,-0.52476
873,-0.48598
874,-0.4472
875,-0.40843
876,-0.36476
877,-0.29735
878,-0.22887
879,-0.15132
880,-0.36073
881,0.10457000000000001
882,0.11297
883,0.22868000000000002
884,0.34501
885,0.4608
886,0.57653
887,0.6846
888,0.79123
889,0.89786
890,1.0045
891,1.0812
892,1.1458
893,1.2
894,1.2485
895,1.2689
896,1.2689
897,1.2291
898,1.1515
899,1.0738
900,0.99579
901,0.91427
902,0.8270200000000001
903,0.73978
904,0.65253
905,0.57215
906,0.51234
907,0.45463000000000003
908,0.40615999999999997
909,0.35854
910,0.31722
911,0.27656
912,0.24748
913,0.21839
914,0.1902
915,0.16201
916,0.15978
917,0.15978
918,0.15978
919,0.15978
920,0.17038
921,0.1838
922,0.20154
923,0.22093000000000002
924,0.24256999999999998
925,0.26539
926,0.29191999999999996
927,0.321
928,0.35031999999999996
929,0.37985
930,0.42256000000000005
931,0.48073
932,0.53889
933,0.59705
934,0.64874
935,0.6872199999999999
936,0.72322
937,0.7523
938,0.7794399999999999
939,0.7986800000000001
940,0.81539
941,0.81539
942,0.81539
943,0.81539
944,0.81539
