time,value
0,-0.8711899999999999
1,-0.8715
2,-0.8715299999999999
3,-0.8710399999999999
4,-0.8700200000000001
5,-0.86835
6,-0.86597
7,-0.86293
8,-0.85956
9,-0.8561200000000001
10,-0.8526
11,-0.8489700000000001
12,-0.8452700000000001
13,-0.8416799999999999
14,-0.8378200000000001
15,-0.8335100000000001
16,-0.8287700000000001
17,-0.8243299999999999
18,-0.81996
19,-0.81565
20,-0.8114399999999999
21,-0.80842
22,-0.80612
23,-0.80405
24,-0.80183
25,-0.80056
26,-0.80024
27,-0.79992
28,-0.79906
29,-0.79867
30,-0.79984
31,-0.80081
32,-0.8004600000000001
33,-0.79883
34,-0.79828
35,-0.79637
36,-0.7919
37,-0.7842899999999999
38,-0.77779
39,-0.7699699999999999
40,-0.7599199999999999
41,-0.74685
42,-0.73438
43,-0.72167
44,-0.70722
45,-0.69023
46,-0.67328
47,-0.65774
48,-0.64175
49,-0.6240899999999999
50,-0.6050300000000001
51,-0.58577
52,-0.56285
53,-0.53398
54,-0.49796
55,-0.4569
56,-0.40874
57,-0.35277
58,-0.28829
59,-0.21693
60,-0.13618
61,-0.043576
62,0.063427
63,0.18544000000000002
64,0.32364
65,0.47881999999999997
66,0.65023
67,0.83515
68,1.0299
69,1.2309
70,1.4337
71,1.6335
72,1.8249
73,2.0043
74,2.1692
75,2.3182
76,2.4514
77,2.5706
78,2.6781
79,2.7756
80,2.8636
81,2.9419
82,3.0085
83,3.0608
84,3.0959
85,3.1114
86,3.1056
87,3.0775
88,3.0267
89,2.9531
90,2.8575
91,2.741
92,2.6054
93,2.4537
94,2.2903
95,2.12
96,1.9477
97,1.7775
98,1.6134
99,1.4578
100,1.3114
101,1.1738
102,1.0444
103,0.92164
104,0.80329
105,0.68637
106,0.56899
107,0.44973
108,0.32737
109,0.20160999999999998
110,0.074309
111,-0.05019
112,-0.16832
113,-0.27663000000000004
114,-0.37281
115,-0.45198
116,-0.5139699999999999
117,-0.5603899999999999
118,-0.5957100000000001
119,-0.61945
120,-0.63484
121,-0.64563
122,-0.65647
123,-0.66622
124,-0.67464
125,-0.68283
126,-0.6928
127,-0.70308
128,-0.71099
129,-0.71719
130,-0.72325
131,-0.73015
132,-0.73425
133,-0.73633
134,-0.73741
135,-0.74079
136,-0.74202
137,-0.7417199999999999
138,-0.7409
139,-0.74236
140,-0.74357
141,-0.7439899999999999
142,-0.74405
143,-0.74546
144,-0.74715
145,-0.74758
146,-0.7468
147,-0.7457699999999999
148,-0.74495
149,-0.74243
150,-0.73814
151,-0.7324
152,-0.7268
153,-0.71935
154,-0.70994
155,-0.6986899999999999
156,-0.6876
157,-0.67578
158,-0.66314
159,-0.64979
160,-0.6369600000000001
161,-0.62455
162,-0.6118100000000001
163,-0.5983
164,-0.58427
165,-0.5698300000000001
166,-0.55399
167,-0.53625
168,-0.51652
169,-0.49537
170,-0.47189
171,-0.44578999999999996
172,-0.41703999999999997
173,-0.38684
174,-0.35481
175,-0.32116999999999996
176,-0.28620999999999996
177,-0.25099
178,-0.2154
179,-0.17925
180,-0.14243
181,-0.10547000000000001
182,-0.068609
183,-0.031637
184,0.005317100000000001
185,0.041694
186,0.076799
187,0.11102999999999999
188,0.14452
189,0.17719000000000001
190,0.20815
191,0.2379
192,0.26632
193,0.29301
194,0.31618
195,0.33555999999999997
196,0.35044000000000003
197,0.36
198,0.36246999999999996
199,0.35739
200,0.34501
201,0.32584
202,0.30017
203,0.26898
204,0.23459000000000002
205,0.19891
206,0.16313
207,0.12744
208,0.09335399999999999
209,0.061321
210,0.031405
211,0.0023285999999999997
212,-0.024822
213,-0.049711
214,-0.072002
215,-0.092521
216,-0.11042
217,-0.12538
218,-0.13737
219,-0.14714000000000002
220,-0.15445
221,-0.15895
222,-0.16071
223,-0.16018
224,-0.15737
225,-0.15178
226,-0.14357
227,-0.13296
228,-0.12
229,-0.10374000000000001
230,-0.084437
231,-0.062661
232,-0.039771
233,-0.015503999999999999
234,0.0089046
235,0.032181
236,0.052917
237,0.071911
238,0.089536
239,0.10605999999999999
240,0.12149000000000001
241,0.13695
242,0.15295999999999998
243,0.16859000000000002
244,0.18204
245,0.19174000000000002
246,0.19692
247,0.19607
248,0.18832000000000002
249,0.17352
250,0.15381
251,0.13028
252,0.10377
253,0.07417
254,0.042223000000000004
255,0.0071506
256,-0.032257999999999995
257,-0.077348
258,-0.12802
259,-0.18416
260,-0.24581
261,-0.31305
262,-0.38519000000000003
263,-0.46088
264,-0.53857
265,-0.61575
266,-0.6887300000000001
267,-0.75271
268,-0.80412
269,-0.84095
