time,value
0,-0.4012
1,-0.4012
2,-0.4012
3,-0.4012
4,-0.4012
5,-0.4012
6,-0.4012
7,-0.4012
8,-0.4012
9,-0.4012
10,-0.4012
11,-0.4012
12,-0.4012
13,-0.4012
14,-0.4012
15,-0.4012
16,-0.4012
17,-0.4012
18,-0.4012
19,-0.4012
20,-0.4012
21,-0.4012
22,-0.4012
23,-0.4012
24,-0.4012
25,-0.4012
26,-0.4012
27,-0.4012
28,-0.4012
29,-0.4012
30,-0.4012
31,-0.4012
32,-0.4012
33,-0.4012
34,-0.4012
35,-0.4012
36,-0.4012
37,-0.4012
38,-0.4012
39,-0.4012
40,-0.4012
41,-0.4012
42,-0.4012
43,-0.4012
44,-0.4012
45,-0.4012
46,-0.4012
47,-0.4012
48,-0.4012
49,-0.4012
50,-0.4012
51,-0.4012
52,-0.4012
53,-0.4012
54,-0.4012
55,-0.4012
56,-0.4012
57,-0.4012
58,-0.4012
59,-0.4012
60,-0.4012
61,-0.4012
62,-0.4012
63,-0.4012
64,-0.4012
65,-0.4012
66,-0.4012
67,-0.4012
68,-0.4012
69,-0.4012
70,-0.4012
71,-0.4012
72,-0.4012
73,-0.4012
74,-0.4012
75,-0.4012
76,-0.4012
77,-0.4012
78,-0.4012
79,-0.4012
80,-0.4012
81,-0.4012
82,-0.4012
83,-0.4012
84,-0.4012
85,-0.4012
86,-0.4012
87,-0.4012
88,-0.4012
89,-0.4012
90,-0.4012
91,-0.4012
92,-0.4012
93,-0.4012
94,-0.4012
95,-0.4012
96,-0.4012
97,-0.4012
98,-0.4012
99,-0.4012
100,-0.4012
101,-0.4012
102,-0.4012
103,-0.4012
104,-0.4012
105,-0.4012
106,-0.4012
107,-0.4012
108,-0.4012
109,-0.4012
110,-0.4012
111,-0.4012
112,-0.4012
113,-0.4012
114,-0.4012
115,-0.4012
116,-0.4012
117,-0.4012
118,-0.4012
119,-0.4012
120,-0.4012
121,-0.4012
122,-0.4012
123,-0.4012
124,-0.4012
125,-0.4012
126,-0.4012
127,-0.4012
128,-0.4012
129,-0.4012
130,-0.4012
131,-0.4012
132,-0.4012
133,-0.4012
134,-0.4012
135,-0.4012
136,-0.4012
137,-0.4012
138,-0.4012
139,-0.4012
140,-0.4012
141,-0.4012
142,-0.4012
143,-0.4012
144,-0.4012
145,-0.4012
146,-0.4012
147,-0.4012
148,-0.4012
149,-0.4012
150,-0.4012
151,-0.4012
152,-0.4012
153,-0.4012
154,-0.4012
155,-0.4012
156,-0.4012
157,-0.4012
158,-0.4012
159,-0.4012
160,-0.4012
161,-0.4012
162,-0.4012
163,-0.4012
164,-0.4012
165,-0.4012
166,-0.4012
167,-0.4012
168,-0.4012
169,-0.4012
170,-0.4012
171,-0.4012
172,-0.4012
173,-0.4012
174,-0.4012
175,-0.4012
176,-0.4012
177,-0.4012
178,-0.4012
179,-0.4012
180,-0.4012
181,-0.4012
182,-0.4012
183,-0.4012
184,-0.4012
185,-0.4012
186,-0.4012
187,-0.4012
188,-0.4012
189,-0.4012
190,-0.4012
191,-0.4012
192,-0.4012
193,-0.4012
194,-0.4012
195,-0.4012
196,-0.4012
197,-0.4012
198,-0.4012
199,-0.4012
200,-0.4012
201,-0.4012
202,-0.4012
203,-0.4012
204,-0.4012
205,-0.4012
206,-0.4012
207,-0.4012
208,-0.4012
209,-0.4012
210,-0.4012
211,-0.4012
212,-0.4012
213,-0.4012
214,-0.4012
215,-0.4012
216,-0.4012
217,-0.4012
218,-0.4012
219,-0.4012
220,-0.4012
221,-0.4012
222,-0.4012
223,-0.4012
224,-0.4012
225,-0.4012
226,-0.4012
227,-0.4012
228,-0.4012
229,-0.4012
230,-0.4012
231,-0.4012
232,-0.4012
233,-0.4012
234,-0.4012
235,-0.4012
236,-0.4012
237,-0.4012
238,-0.4012
239,-0.4012
240,-0.4012
241,-0.4012
242,-0.4012
243,-0.4012
244,-0.4012
245,-0.4012
246,-0.4012
247,-0.4012
248,-0.4012
249,-0.4012
250,-0.4012
251,-0.4012
252,-0.4012
253,-0.4012
254,-0.4012
255,-0.4012
256,-0.4012
257,-0.4012
258,-0.4012
259,-0.4012
260,-0.4012
261,-0.4012
262,-0.4012
263,-0.4012
264,-0.4012
265,-0.4012
266,-0.4012
267,-0.4012
268,-0.4012
269,-0.4012
270,-0.4012
271,-0.4012
272,-0.4012
273,-0.4012
274,-0.4012
275,-0.4012
276,-0.4012
277,-0.4012
278,-0.4012
279,-0.4012
280,-0.4012
281,-0.4012
282,-0.4012
283,-0.4012
284,-0.4012
285,-0.4012
286,-0.4012
287,-0.4012
288,-0.4012
289,-0.4012
290,-0.4012
291,-0.4012
292,-0.4012
293,-0.4012
294,-0.4012
295,-0.4012
296,-0.4012
297,-0.4012
298,-0.4012
299,-0.4012
300,-0.4012
301,-0.4012
302,-0.4012
303,-0.4012
304,-0.4012
305,-0.4012
306,-0.4012
307,-0.4012
308,-0.4012
309,-0.4012
310,-0.4012
311,-0.4012
312,-0.4012
313,-0.4012
314,-0.4012
315,-0.4012
316,-0.4012
317,-0.4012
318,-0.4012
319,-0.4012
320,-0.4012
321,-0.4012
322,-0.4012
323,-0.4012
324,-0.4012
325,-0.4012
326,-0.4012
327,-0.4012
328,-0.4012
329,-0.4012
330,-0.4012
331,-0.4012
332,-0.4012
333,-0.4012
334,-0.4012
335,-0.4012
336,-0.4012
337,-0.4012
338,-0.4012
339,-0.4012
340,-0.4012
341,-0.4012
342,-0.4012
343,-0.4012
344,-0.4012
345,-0.4012
346,-0.4012
347,-0.4012
348,-0.4012
349,-0.4012
350,-0.4012
351,-0.4012
352,-0.4012
353,-0.4012
354,-0.4012
355,-0.4012
356,-0.4012
357,-0.4012
358,-0.4012
359,-0.4012
360,-0.4012
361,-0.4012
362,-0.4012
363,-0.4012
364,-0.4012
365,-0.4012
366,-0.4012
367,-0.4012
368,-0.4012
369,-0.4012
370,-0.4012
371,-0.4012
372,-0.4012
373,-0.4012
374,-0.4012
375,-0.4012
376,-0.4012
377,-0.4012
378,-0.4012
379,-0.4012
380,-0.4012
381,-0.4012
382,-0.4012
383,-0.4012
384,-0.4012
385,-0.4012
386,-0.4012
387,-0.4012
388,-0.4012
389,-0.4012
390,-0.4012
391,-0.4012
392,-0.4012
393,-0.4012
394,-0.4012
395,-0.4012
396,-0.4012
397,-0.4012
398,-0.4012
399,-0.4012
400,-0.4012
401,-0.4012
402,-0.4012
403,-0.4012
404,-0.4012
405,-0.4012
406,-0.4012
407,-0.4012
408,-0.4012
409,-0.4012
410,-0.4012
411,-0.4012
412,-0.4012
413,-0.4012
414,-0.4012
415,-0.4012
416,-0.4012
417,-0.4012
418,-0.4012
419,-0.4012
420,-0.4012
421,-0.4012
422,-0.4012
423,-0.4012
424,-0.4012
425,-0.4012
426,-0.4012
427,-0.4012
428,-0.4012
429,-0.4012
430,-0.4012
431,-0.4012
432,-0.4012
433,-0.4012
434,-0.4012
435,-0.4012
436,-0.4012
437,-0.4012
438,-0.4012
439,-0.4012
440,-0.4012
441,-0.4012
442,-0.4012
443,-0.4012
444,-0.4012
445,-0.4012
446,-0.4012
447,-0.4012
448,-0.4012
449,-0.4012
450,-0.4012
451,-0.4012
452,-0.4012
453,-0.4012
454,-0.4012
455,-0.4012
456,-0.4012
457,-0.4012
458,-0.4012
459,-0.4012
460,-0.4012
461,-0.4012
462,-0.4012
463,-0.4012
464,-0.4012
465,-0.4012
466,-0.4012
467,-0.4012
468,-0.4012
469,-0.4012
470,-0.4012
471,-0.4012
472,-0.4012
473,-0.4012
474,-0.4012
475,-0.4012
476,-0.4012
477,-0.4012
478,-0.4012
479,-0.4012
480,-0.4012
481,-0.4012
482,-0.4012
483,-0.4012
484,-0.4012
485,-0.4012
486,-0.4012
487,-0.4012
488,-0.4012
489,-0.4012
490,-0.4012
491,-0.4012
492,-0.4012
493,-0.4012
494,-0.4012
495,-0.4012
496,-0.4012
497,-0.4012
498,-0.4012
499,-0.4012
500,-0.4012
501,-0.4012
502,-0.4012
503,-0.4012
504,-0.4012
505,-0.4012
506,-0.4012
507,-0.4012
508,-0.4012
509,-0.4012
510,-0.4012
511,-0.4012
512,-0.4012
513,-0.4012
514,-0.4012
515,-0.4012
516,-0.4012
517,-0.4012
518,-0.4012
519,-0.4012
520,-0.4012
521,0.57882
522,2.1714
523,2.5389
524,2.5389
525,2.5389
526,2.1714
527,2.1714
528,2.1714
529,2.1714
530,2.1714
531,2.5389
532,2.5389
533,2.5389
534,2.5389
535,2.5389
536,2.1714
537,2.5389
538,2.5389
539,2.5389
540,2.5389
541,2.5389
542,3.0289
543,2.5389
544,2.5389
545,2.1714
546,2.5389
547,2.5389
548,2.5389
549,2.5389
550,1.4363
551,-0.27869
552,-0.4012
553,-0.4012
554,-0.4012
555,-0.4012
556,-0.4012
557,-0.033688
558,2.5389
559,2.5389
560,2.5389
561,2.5389
562,3.0289
563,2.5389
564,2.5389
565,3.0289
566,2.1714
567,2.5389
568,2.5389
569,3.0289
570,2.5389
571,2.1714
572,2.5389
573,2.5389
574,3.0289
575,2.5389
576,3.0289
577,2.5389
578,3.0289
579,2.5389
580,2.5389
581,2.5389
582,3.0289
583,2.5389
584,2.5389
585,1.8038
586,2.1714
587,2.1714
588,2.1714
589,2.1714
590,2.5389
591,2.1714
592,2.5389
593,2.5389
594,2.5389
595,2.5389
596,2.5389
597,1.8038
598,1.8038
599,2.5389
600,2.5389
601,2.1714
602,2.5389
603,2.5389
604,2.5389
605,2.5389
606,3.0289
607,2.5389
608,2.5389
609,2.5389
610,2.5389
611,2.5389
612,2.5389
613,3.0289
614,2.1714
615,2.1714
616,2.1714
617,2.5389
618,2.1714
619,2.5389
620,2.5389
621,3.0289
622,2.5389
623,2.5389
624,2.5389
625,2.5389
626,2.1714
627,2.1714
628,1.8038
629,-0.27869
630,-0.4012
631,-0.4012
632,-0.4012
633,-0.4012
634,-0.4012
635,-0.4012
636,-0.4012
637,-0.4012
638,-0.4012
639,-0.4012
640,-0.4012
641,-0.4012
642,-0.4012
643,-0.4012
644,-0.4012
645,-0.4012
646,-0.4012
647,-0.4012
648,-0.4012
649,-0.4012
650,-0.4012
651,-0.4012
652,-0.4012
653,-0.4012
654,-0.4012
655,-0.4012
656,-0.4012
657,-0.4012
658,-0.4012
659,-0.4012
660,-0.4012
661,-0.4012
662,-0.4012
663,-0.4012
664,-0.4012
665,-0.4012
666,-0.4012
667,-0.4012
668,-0.4012
669,-0.4012
670,-0.4012
671,-0.4012
672,-0.4012
673,-0.4012
674,-0.4012
675,-0.4012
676,-0.4012
677,-0.4012
678,-0.4012
679,-0.4012
680,-0.4012
681,-0.4012
682,-0.4012
683,-0.4012
684,-0.4012
685,-0.4012
686,-0.4012
687,-0.4012
688,-0.4012
689,-0.4012
690,-0.4012
691,-0.4012
692,-0.4012
693,-0.4012
694,-0.4012
695,-0.4012
696,-0.4012
697,-0.4012
698,-0.4012
699,-0.4012
700,-0.4012
701,-0.4012
702,-0.4012
703,-0.4012
704,-0.4012
705,-0.4012
706,-0.4012
707,-0.4012
708,-0.4012
709,-0.4012
710,-0.4012
711,-0.4012
712,-0.4012
713,-0.4012
714,-0.4012
715,-0.4012
716,-0.4012
717,-0.4012
718,-0.4012
719,-0.4012
