d3mIndex,timeseries_file,label
0,0000_train_ts.csv,2
1,0001_train_ts.csv,2
2,0002_train_ts.csv,1
3,0003_train_ts.csv,2
4,0004_train_ts.csv,3
5,0005_train_ts.csv,1
6,0006_train_ts.csv,2
7,0007_train_ts.csv,2
8,0008_train_ts.csv,1
9,0009_train_ts.csv,2
10,0010_train_ts.csv,1
11,0011_train_ts.csv,2
12,0012_train_ts.csv,1
13,0013_train_ts.csv,1
14,0014_train_ts.csv,1
15,0015_train_ts.csv,2
16,0016_train_ts.csv,2
17,0017_train_ts.csv,2
18,0018_train_ts.csv,2
19,0019_train_ts.csv,2
20,0020_train_ts.csv,3
21,0021_train_ts.csv,2
22,0022_train_ts.csv,2
23,0023_train_ts.csv,3
24,0024_train_ts.csv,3
25,0025_train_ts.csv,2
26,0026_train_ts.csv,2
27,0027_train_ts.csv,2
28,0028_train_ts.csv,3
29,0029_train_ts.csv,3
30,0030_train_ts.csv,2
31,0031_train_ts.csv,2
32,0032_train_ts.csv,3
33,0033_train_ts.csv,2
34,0034_train_ts.csv,3
35,0035_train_ts.csv,3
36,0036_train_ts.csv,2
37,0037_train_ts.csv,2
38,0038_train_ts.csv,3
39,0039_train_ts.csv,1
40,0040_train_ts.csv,1
41,0041_train_ts.csv,1
42,0042_train_ts.csv,1
43,0043_train_ts.csv,3
44,0044_train_ts.csv,1
45,0045_train_ts.csv,1
46,0046_train_ts.csv,1
47,0047_train_ts.csv,1
48,0048_train_ts.csv,1
49,0049_train_ts.csv,2
50,0050_train_ts.csv,1
51,0051_train_ts.csv,1
52,0052_train_ts.csv,1
53,0053_train_ts.csv,1
54,0054_train_ts.csv,2
55,0055_train_ts.csv,2
56,0056_train_ts.csv,1
57,0057_train_ts.csv,2
58,0058_train_ts.csv,2
59,0059_train_ts.csv,2
60,0060_train_ts.csv,2
61,0061_train_ts.csv,3
62,0062_train_ts.csv,1
63,0063_train_ts.csv,2
64,0064_train_ts.csv,1
65,0065_train_ts.csv,2
66,0066_train_ts.csv,3
67,0067_train_ts.csv,1
68,0068_train_ts.csv,2
69,0069_train_ts.csv,2
70,0070_train_ts.csv,1
71,0071_train_ts.csv,1
72,0072_train_ts.csv,2
73,0073_train_ts.csv,2
74,0074_train_ts.csv,2
75,0075_train_ts.csv,2
76,0076_train_ts.csv,2
77,0077_train_ts.csv,2
78,0078_train_ts.csv,3
79,0079_train_ts.csv,2
80,0080_train_ts.csv,2
81,0081_train_ts.csv,3
82,0082_train_ts.csv,2
83,0083_train_ts.csv,2
84,0084_train_ts.csv,2
85,0085_train_ts.csv,2
86,0086_train_ts.csv,1
87,0087_train_ts.csv,2
88,0088_train_ts.csv,3
89,0089_train_ts.csv,2
90,0090_train_ts.csv,2
91,0091_train_ts.csv,2
92,0092_train_ts.csv,3
93,0093_train_ts.csv,1
94,0094_train_ts.csv,2
95,0095_train_ts.csv,1
96,0096_train_ts.csv,2
97,0097_train_ts.csv,2
98,0098_train_ts.csv,2
99,0099_train_ts.csv,2
100,0100_train_ts.csv,2
101,0101_train_ts.csv,2
102,0102_train_ts.csv,2
103,0103_train_ts.csv,2
104,0104_train_ts.csv,2
105,0105_train_ts.csv,3
106,0106_train_ts.csv,2
107,0107_train_ts.csv,3
108,0108_train_ts.csv,2
109,0109_train_ts.csv,2
110,0110_train_ts.csv,2
111,0111_train_ts.csv,2
112,0112_train_ts.csv,2
113,0113_train_ts.csv,3
114,0114_train_ts.csv,1
115,0115_train_ts.csv,2
116,0116_train_ts.csv,1
117,0117_train_ts.csv,2
118,0118_train_ts.csv,1
119,0119_train_ts.csv,3
120,0120_train_ts.csv,1
121,0121_train_ts.csv,1
122,0122_train_ts.csv,3
123,0123_train_ts.csv,2
124,0124_train_ts.csv,2
125,0125_train_ts.csv,2
126,0126_train_ts.csv,2
127,0127_train_ts.csv,1
128,0128_train_ts.csv,2
129,0129_train_ts.csv,2
130,0130_train_ts.csv,2
131,0131_train_ts.csv,2
132,0132_train_ts.csv,2
133,0133_train_ts.csv,2
134,0134_train_ts.csv,2
135,0135_train_ts.csv,2
136,0136_train_ts.csv,2
137,0137_train_ts.csv,2
138,0138_train_ts.csv,1
139,0139_train_ts.csv,2
140,0140_train_ts.csv,2
141,0141_train_ts.csv,2
142,0142_train_ts.csv,1
143,0143_train_ts.csv,2
144,0144_train_ts.csv,2
145,0145_train_ts.csv,2
146,0146_train_ts.csv,2
147,0147_train_ts.csv,3
148,0148_train_ts.csv,3
149,0149_train_ts.csv,3
150,0150_train_ts.csv,3
151,0151_train_ts.csv,3
152,0152_train_ts.csv,3
153,0153_train_ts.csv,3
154,0154_test_ts.csv,2
155,0155_test_ts.csv,2
156,0156_test_ts.csv,2
157,0157_test_ts.csv,2
158,0158_test_ts.csv,3
159,0159_test_ts.csv,3
160,0160_test_ts.csv,3
161,0161_test_ts.csv,3
162,0162_test_ts.csv,3
163,0163_test_ts.csv,1
164,0164_test_ts.csv,2
165,0165_test_ts.csv,2
166,0166_test_ts.csv,3
167,0167_test_ts.csv,3
168,0168_test_ts.csv,2
169,0169_test_ts.csv,2
170,0170_test_ts.csv,3
171,0171_test_ts.csv,3
172,0172_test_ts.csv,3
173,0173_test_ts.csv,2
174,0174_test_ts.csv,1
175,0175_test_ts.csv,1
176,0176_test_ts.csv,1
177,0177_test_ts.csv,1
178,0178_test_ts.csv,1
179,0179_test_ts.csv,1
180,0180_test_ts.csv,1
181,0181_test_ts.csv,2
182,0182_test_ts.csv,2
183,0183_test_ts.csv,2
184,0184_test_ts.csv,2
185,0185_test_ts.csv,2
186,0186_test_ts.csv,2
187,0187_test_ts.csv,2
188,0188_test_ts.csv,2
189,0189_test_ts.csv,2
190,0190_test_ts.csv,3
191,0191_test_ts.csv,3
192,0192_test_ts.csv,1
193,0193_test_ts.csv,1
194,0194_test_ts.csv,1
195,0195_test_ts.csv,1
196,0196_test_ts.csv,1
197,0197_test_ts.csv,2
198,0198_test_ts.csv,2
199,0199_test_ts.csv,2
200,0200_test_ts.csv,2
201,0201_test_ts.csv,2
202,0202_test_ts.csv,2
203,0203_test_ts.csv,2
204,0204_test_ts.csv,2
205,0205_test_ts.csv,2
206,0206_test_ts.csv,1
207,0207_test_ts.csv,1
208,0208_test_ts.csv,1
209,0209_test_ts.csv,1
210,0210_test_ts.csv,1
211,0211_test_ts.csv,1
212,0212_test_ts.csv,1
213,0213_test_ts.csv,2
214,0214_test_ts.csv,2
215,0215_test_ts.csv,2
216,0216_test_ts.csv,2
217,0217_test_ts.csv,2
218,0218_test_ts.csv,2
219,0219_test_ts.csv,3
220,0220_test_ts.csv,1
221,0221_test_ts.csv,1
222,0222_test_ts.csv,1
223,0223_test_ts.csv,2
224,0224_test_ts.csv,2
225,0225_test_ts.csv,2
226,0226_test_ts.csv,2
227,0227_test_ts.csv,2
228,0228_test_ts.csv,2
229,0229_test_ts.csv,2
230,0230_test_ts.csv,2
231,0231_test_ts.csv,2
232,0232_test_ts.csv,3
233,0233_test_ts.csv,2
234,0234_test_ts.csv,3
235,0235_test_ts.csv,1
236,0236_test_ts.csv,2
237,0237_test_ts.csv,1
238,0238_test_ts.csv,2
239,0239_test_ts.csv,3
240,0240_test_ts.csv,3
241,0241_test_ts.csv,3
242,0242_test_ts.csv,1
243,0243_test_ts.csv,1
244,0244_test_ts.csv,2
245,0245_test_ts.csv,2
246,0246_test_ts.csv,2
247,0247_test_ts.csv,2
248,0248_test_ts.csv,3
249,0249_test_ts.csv,2
250,0250_test_ts.csv,2
251,0251_test_ts.csv,3
252,0252_test_ts.csv,1
253,0253_test_ts.csv,1
254,0254_test_ts.csv,2
255,0255_test_ts.csv,3
256,0256_test_ts.csv,3
257,0257_test_ts.csv,2
258,0258_test_ts.csv,1
259,0259_test_ts.csv,2
260,0260_test_ts.csv,2
261,0261_test_ts.csv,2
262,0262_test_ts.csv,1
263,0263_test_ts.csv,2
264,0264_test_ts.csv,2
265,0265_test_ts.csv,1
266,0266_test_ts.csv,2
267,0267_test_ts.csv,2
268,0268_test_ts.csv,2
269,0269_test_ts.csv,1
270,0270_test_ts.csv,1
271,0271_test_ts.csv,1
272,0272_test_ts.csv,2
273,0273_test_ts.csv,2
274,0274_test_ts.csv,2
275,0275_test_ts.csv,2
276,0276_test_ts.csv,2
277,0277_test_ts.csv,1
278,0278_test_ts.csv,2
279,0279_test_ts.csv,2
280,0280_test_ts.csv,1
281,0281_test_ts.csv,2
282,0282_test_ts.csv,2
283,0283_test_ts.csv,2
284,0284_test_ts.csv,2
285,0285_test_ts.csv,2
286,0286_test_ts.csv,2
287,0287_test_ts.csv,1
288,0288_test_ts.csv,1
289,0289_test_ts.csv,2
290,0290_test_ts.csv,2
291,0291_test_ts.csv,3
292,0292_test_ts.csv,1
293,0293_test_ts.csv,2
294,0294_test_ts.csv,1
295,0295_test_ts.csv,1
296,0296_test_ts.csv,2
297,0297_test_ts.csv,2
298,0298_test_ts.csv,1
299,0299_test_ts.csv,1
300,0300_test_ts.csv,2
301,0301_test_ts.csv,2
302,0302_test_ts.csv,2
303,0303_test_ts.csv,2
304,0304_test_ts.csv,1
305,0305_test_ts.csv,2
306,0306_test_ts.csv,1
307,0307_test_ts.csv,2
308,0308_test_ts.csv,2
309,0309_test_ts.csv,3
310,0310_test_ts.csv,2
311,0311_test_ts.csv,2
312,0312_test_ts.csv,2
313,0313_test_ts.csv,2
314,0314_test_ts.csv,2
315,0315_test_ts.csv,2
316,0316_test_ts.csv,1
317,0317_test_ts.csv,1
318,0318_test_ts.csv,2
319,0319_test_ts.csv,3
320,0320_test_ts.csv,1
321,0321_test_ts.csv,1
322,0322_test_ts.csv,2
323,0323_test_ts.csv,3
324,0324_test_ts.csv,3
325,0325_test_ts.csv,1
326,0326_test_ts.csv,3
327,0327_test_ts.csv,3
328,0328_test_ts.csv,2
329,0329_test_ts.csv,2
330,0330_test_ts.csv,2
331,0331_test_ts.csv,3
332,0332_test_ts.csv,3
333,0333_test_ts.csv,3
334,0334_test_ts.csv,3
335,0335_test_ts.csv,3
336,0336_test_ts.csv,3
337,0337_test_ts.csv,3
338,0338_test_ts.csv,3
339,0339_test_ts.csv,3
340,0340_test_ts.csv,3
341,0341_test_ts.csv,3
342,0342_test_ts.csv,3
343,0343_test_ts.csv,3
344,0344_test_ts.csv,3
345,0345_test_ts.csv,3
346,0346_test_ts.csv,3
347,0347_test_ts.csv,3
348,0348_test_ts.csv,3
349,0349_test_ts.csv,3
350,0350_test_ts.csv,3
351,0351_test_ts.csv,3
352,0352_test_ts.csv,3
353,0353_test_ts.csv,3
354,0354_test_ts.csv,3
355,0355_test_ts.csv,3
356,0356_test_ts.csv,3
357,0357_test_ts.csv,3
358,0358_test_ts.csv,3
359,0359_test_ts.csv,3
360,0360_test_ts.csv,3
361,0361_test_ts.csv,3
362,0362_test_ts.csv,3
363,0363_test_ts.csv,3
364,0364_test_ts.csv,3
365,0365_test_ts.csv,3
366,0366_test_ts.csv,3
367,0367_test_ts.csv,3
368,0368_test_ts.csv,3
369,0369_test_ts.csv,3
370,0370_test_ts.csv,3
371,0371_test_ts.csv,3
372,0372_test_ts.csv,3
373,0373_test_ts.csv,3
374,0374_test_ts.csv,3
375,0375_test_ts.csv,3
376,0376_test_ts.csv,3
377,0377_test_ts.csv,3
378,0378_test_ts.csv,3
379,0379_test_ts.csv,3
380,0380_test_ts.csv,3
381,0381_test_ts.csv,3
382,0382_test_ts.csv,3
383,0383_test_ts.csv,3
384,0384_test_ts.csv,3
385,0385_test_ts.csv,3
386,0386_test_ts.csv,3
387,0387_test_ts.csv,3
388,0388_test_ts.csv,3
389,0389_test_ts.csv,3
390,0390_test_ts.csv,3
391,0391_test_ts.csv,3
392,0392_test_ts.csv,3
393,0393_test_ts.csv,3
394,0394_test_ts.csv,3
395,0395_test_ts.csv,3
396,0396_test_ts.csv,3
397,0397_test_ts.csv,3
398,0398_test_ts.csv,3
399,0399_test_ts.csv,3
400,0400_test_ts.csv,3
401,0401_test_ts.csv,3
402,0402_test_ts.csv,3
403,0403_test_ts.csv,3
404,0404_test_ts.csv,3
405,0405_test_ts.csv,3
406,0406_test_ts.csv,3
407,0407_test_ts.csv,3
408,0408_test_ts.csv,3
409,0409_test_ts.csv,3
410,0410_test_ts.csv,3
411,0411_test_ts.csv,3
412,0412_test_ts.csv,3
413,0413_test_ts.csv,3
414,0414_test_ts.csv,3
415,0415_test_ts.csv,3
416,0416_test_ts.csv,3
417,0417_test_ts.csv,3
418,0418_test_ts.csv,3
419,0419_test_ts.csv,3
420,0420_test_ts.csv,3
421,0421_test_ts.csv,3
422,0422_test_ts.csv,3
423,0423_test_ts.csv,3
424,0424_test_ts.csv,3
425,0425_test_ts.csv,3
426,0426_test_ts.csv,3
427,0427_test_ts.csv,3
428,0428_test_ts.csv,2
429,0429_test_ts.csv,3
430,0430_test_ts.csv,3
431,0431_test_ts.csv,3
432,0432_test_ts.csv,3
433,0433_test_ts.csv,3
434,0434_test_ts.csv,3
435,0435_test_ts.csv,3
436,0436_test_ts.csv,3
437,0437_test_ts.csv,3
438,0438_test_ts.csv,3
439,0439_test_ts.csv,3
440,0440_test_ts.csv,3
441,0441_test_ts.csv,3
442,0442_test_ts.csv,3
443,0443_test_ts.csv,3
444,0444_test_ts.csv,3
445,0445_test_ts.csv,3
446,0446_test_ts.csv,3
447,0447_test_ts.csv,3
448,0448_test_ts.csv,3
449,0449_test_ts.csv,3
450,0450_test_ts.csv,3
451,0451_test_ts.csv,3
452,0452_test_ts.csv,3
453,0453_test_ts.csv,3
454,0454_test_ts.csv,3
455,0455_test_ts.csv,3
456,0456_test_ts.csv,3
457,0457_test_ts.csv,3
458,0458_test_ts.csv,3
459,0459_test_ts.csv,2
460,0460_test_ts.csv,3
461,0461_test_ts.csv,3
462,0462_test_ts.csv,3
463,0463_test_ts.csv,3
464,0464_test_ts.csv,3
465,0465_test_ts.csv,3
466,0466_test_ts.csv,3
467,0467_test_ts.csv,3
468,0468_test_ts.csv,3
469,0469_test_ts.csv,3
470,0470_test_ts.csv,3
471,0471_test_ts.csv,3
472,0472_test_ts.csv,3
473,0473_test_ts.csv,3
474,0474_test_ts.csv,3
475,0475_test_ts.csv,3
476,0476_test_ts.csv,3
477,0477_test_ts.csv,3
478,0478_test_ts.csv,3
479,0479_test_ts.csv,3
480,0480_test_ts.csv,3
481,0481_test_ts.csv,2
482,0482_test_ts.csv,3
483,0483_test_ts.csv,3
484,0484_test_ts.csv,3
485,0485_test_ts.csv,3
486,0486_test_ts.csv,3
487,0487_test_ts.csv,3
488,0488_test_ts.csv,3
489,0489_test_ts.csv,3
490,0490_test_ts.csv,3
491,0491_test_ts.csv,3
492,0492_test_ts.csv,3
493,0493_test_ts.csv,3
494,0494_test_ts.csv,3
495,0495_test_ts.csv,3
496,0496_test_ts.csv,3
497,0497_test_ts.csv,3
498,0498_test_ts.csv,3
499,0499_test_ts.csv,3
500,0500_test_ts.csv,3
501,0501_test_ts.csv,3
502,0502_test_ts.csv,3
503,0503_test_ts.csv,3
504,0504_test_ts.csv,3
505,0505_test_ts.csv,3
506,0506_test_ts.csv,3
507,0507_test_ts.csv,3
508,0508_test_ts.csv,3
509,0509_test_ts.csv,3
510,0510_test_ts.csv,3
511,0511_test_ts.csv,3
512,0512_test_ts.csv,2
513,0513_test_ts.csv,3
514,0514_test_ts.csv,3
515,0515_test_ts.csv,2
516,0516_test_ts.csv,3
517,0517_test_ts.csv,3
518,0518_test_ts.csv,3
519,0519_test_ts.csv,3
520,0520_test_ts.csv,3
521,0521_test_ts.csv,3
522,0522_test_ts.csv,3
523,0523_test_ts.csv,3
524,0524_test_ts.csv,3
525,0525_test_ts.csv,3
526,0526_test_ts.csv,3
527,0527_test_ts.csv,3
528,0528_test_ts.csv,3
529,0529_test_ts.csv,3
530,0530_test_ts.csv,3
531,0531_test_ts.csv,3
532,0532_test_ts.csv,3
533,0533_test_ts.csv,3
534,0534_test_ts.csv,3
535,0535_test_ts.csv,3
536,0536_test_ts.csv,3
537,0537_test_ts.csv,3
538,0538_test_ts.csv,3
539,0539_test_ts.csv,3
540,0540_test_ts.csv,3
541,0541_test_ts.csv,3
542,0542_test_ts.csv,1
543,0543_test_ts.csv,2
544,0544_test_ts.csv,2
545,0545_test_ts.csv,2
546,0546_test_ts.csv,3
547,0547_test_ts.csv,2
548,0548_test_ts.csv,1
549,0549_test_ts.csv,3
550,0550_test_ts.csv,1
551,0551_test_ts.csv,1
552,0552_test_ts.csv,2
553,0553_test_ts.csv,2
