time,value
0,-0.008055199999999998
1,-0.037944
2,-0.38683
3,-0.35561
4,0.12569
5,-0.019842
6,-0.054273
7,-0.18175999999999998
8,0.53371
9,0.26475
10,-0.19798
11,0.23611999999999997
12,0.40697
13,0.17502
14,0.50647
15,0.10955999999999999
16,0.32149
17,-0.07964299999999999
18,-0.12685
19,-0.15937
20,-0.4624
21,-0.087714
22,0.048854
23,0.41851000000000005
24,-0.4618
25,-0.12362000000000001
26,-0.16308
27,0.053529999999999994
28,0.32448
29,0.17999
30,-0.068445
31,0.0060155
32,-0.070403
33,0.089524
34,-0.07458300000000001
35,0.12653
36,1.4194
37,1.4194
38,1.4194
39,1.4194
40,1.4194
41,1.4194
42,1.4194
43,1.4194
44,1.4194
45,1.4194
46,1.4194
47,1.4194
48,1.4194
49,1.4194
50,1.4194
51,1.4194
52,-1.4107
53,-1.4107
54,-1.4107
55,-1.4107
56,-1.4107
57,-1.4107
58,-1.4107
59,-1.4107
60,-1.4107
61,-1.4107
62,-1.4107
63,-1.4107
64,-1.4107
65,-1.4107
66,-1.4107
67,-1.4107
68,-0.035464999999999997
69,-0.71346
70,-0.50293
71,-0.10364000000000001
72,0.16607
73,0.30477
74,-0.27671999999999997
75,0.066958
76,-0.034192
77,-0.07675900000000001
78,0.47442
79,0.20742
80,-0.19058
81,-0.034694
82,-0.13144
83,0.18409
84,0.23675
85,-0.16409
86,0.51983
87,0.49362
88,0.3468
89,-0.30387
90,0.13229000000000002
91,-0.54718
92,0.1858
93,0.011393
94,-0.040958
95,0.0045383
96,-1.4107
97,-1.4107
98,-1.4107
99,-1.4107
100,-1.4107
101,-1.4107
102,-1.4107
103,-1.4107
104,-1.4107
105,-1.4107
106,-1.4107
107,-1.4107
108,-1.4107
109,-1.4107
110,-1.4107
111,1.4194
112,1.4194
113,1.4194
114,1.4194
115,1.4194
116,1.4194
117,1.4194
118,1.4194
119,1.4194
120,1.4194
121,1.4194
122,1.4194
123,1.4194
124,1.4194
125,-0.17684
126,0.32889
127,0.011359999999999999
