time,value
0,-0.7204699999999999
1,-0.62856
2,-0.44013
3,-0.19902
4,0.077638
5,0.40328
6,0.67884
7,1.0045
8,1.2422
9,1.3804
10,1.4135
11,1.3889
12,1.4382
13,1.4081
14,1.2693
15,1.0108
16,0.6432
17,0.43921000000000004
18,0.12625999999999998
19,-0.16576
20,-0.42486
21,-0.61666
22,-0.72509
23,-0.7968
24,-0.59037
25,-0.38094
26,-0.12284
27,0.15974000000000002
28,0.42700000000000005
29,0.7319399999999999
30,1.0142
31,1.3333
32,1.492
33,1.4807
34,1.4376
35,1.4095
36,1.3671
37,1.4518
38,1.4325
39,1.5608
40,1.6206
41,1.5489
42,1.2523
43,0.9848299999999999
44,0.65827
45,0.40107
46,0.096082
47,-0.18177000000000001
48,-0.42049
49,-0.61698
50,-0.43395
51,-0.46342
52,-0.60173
53,-0.71455
54,-0.8834700000000001
55,-1.0462
56,-1.21
57,-1.3628
58,-1.4435
59,-1.3264
60,-1.1773
61,-1.0509
62,-0.89894
63,-0.78887
64,-0.655
65,-0.6056699999999999
66,-0.7227100000000001
67,-0.8337200000000001
68,-0.9386899999999999
69,-1.111
70,-1.2397
71,-1.3067
72,-1.3253
73,-1.2946
74,-1.1804
75,-1.0601
76,-0.97631
77,-0.84595
78,-0.7109800000000001
79,-0.5451
