time,value
0,-0.7548699999999999
1,-0.68288
2,-0.48482
3,-0.23504
4,0.06141799999999999
5,0.35394000000000003
6,0.67382
7,1.0248
8,1.3241
9,1.4568
10,1.3918
11,1.3835
12,1.4008
13,1.4222
14,1.3659999999999999
15,1.1753
16,0.8583700000000001
17,0.50507
18,0.28654
19,-0.005153100000000001
20,-0.34761
21,-0.56524
22,-0.74493
23,-0.71641
24,-0.55809
25,-0.32036
26,-0.093373
27,0.16618
28,0.45448999999999995
29,0.72426
30,1.0089
31,1.3269
32,1.4074
33,1.4026
34,1.3090000000000002
35,1.295
36,1.3123
37,1.4043
38,1.3151
39,1.4364
40,1.4723
41,1.5004
42,1.307
43,0.98267
44,0.6724
45,0.37732
46,0.090491
47,-0.15794
48,-0.40613
49,-0.62705
50,-0.4756
51,-0.51441
52,-0.64773
53,-0.78843
54,-0.99471
55,-1.1935
56,-1.2972
57,-1.3789
58,-1.4985
59,-1.4285
60,-1.2653
61,-1.1062
62,-0.9312799999999999
63,-0.7226199999999999
64,-0.52142
65,-0.36341999999999997
66,-0.43966000000000005
67,-0.57998
68,-0.7541800000000001
69,-0.92655
70,-1.0955
71,-1.2469
72,-1.3779
73,-1.3924
74,-1.3766
75,-1.2348
76,-1.084
77,-0.95562
78,-0.7797
79,-0.5787399999999999
