time,value
0,3.6285
1,3.6872
2,3.3206
3,2.7903
4,2.3766
5,2.2473
6,2.3865
7,2.6137
8,2.6838
9,2.4137
10,1.7749
11,0.90781
12,0.054609000000000005
13,-0.55214
14,-0.78915
15,-0.6846300000000001
16,-0.3883
17,-0.090503
18,0.06593500000000001
19,0.038861
20,-0.11534000000000001
21,-0.28959
22,-0.38948
23,-0.37836
24,-0.28541
25,-0.17857
26,-0.12224000000000002
27,-0.14403
28,-0.22645
29,-0.32337
30,-0.38869000000000004
31,-0.39994
32,-0.3656
33,-0.31511999999999996
34,-0.27996
35,-0.27702
36,-0.30301
37,-0.34021
38,-0.36857
39,-0.37633
40,-0.36415
41,-0.34204
42,-0.32424000000000003
43,-0.31513
44,-0.31588
45,-0.32375
46,-0.33476
47,-0.34226999999999996
48,-0.3437
49,-0.3409
50,-0.33810999999999997
51,-0.33626
52,-0.33526999999999996
53,-0.33621
54,-0.33937
55,-0.34403
56,-0.34893
57,-0.35307
58,-0.35598
59,-0.35786
60,-0.35936
61,-0.36158
62,-0.36537
63,-0.37094
64,-0.37736
65,-0.3835
66,-0.38823
67,-0.39107
68,-0.39192
69,-0.39169
70,-0.3916
71,-0.39258000000000004
72,-0.39463000000000004
73,-0.39719
74,-0.39939
75,-0.40060999999999997
76,-0.40059
77,-0.3998
78,-0.39915
79,-0.39957
80,-0.40139
81,-0.40437
82,-0.40794
83,-0.41144
84,-0.41436999999999996
85,-0.41661000000000004
86,-0.41848
87,-0.42043
88,-0.42268999999999995
89,-0.42518
90,-0.42773999999999995
91,-0.4302
92,-0.43246999999999997
93,-0.43451999999999996
94,-0.43653000000000003
95,-0.43866000000000005
96,-0.44086000000000003
97,-0.44272
98,-0.4438
