time,value
0,-0.56967
1,-0.47776
2,-0.26546
3,0.034892
4,0.3806
5,0.70418
6,0.94609
7,1.0673
8,1.0619
9,0.95491
10,0.77856
11,0.58001
12,0.40065
13,0.27418000000000003
14,0.20292000000000002
15,0.16932
16,0.13697
17,0.089645
18,0.034944
19,-0.025858
20,-0.088476
21,-0.16234
22,-0.24058000000000002
23,-0.34174
24,-0.47343999999999997
25,-0.64488
26,-0.8644799999999999
27,-1.0973
28,-1.2959
29,-1.4192
30,-1.3903
31,-1.1815
32,-0.78046
33,-0.25783
34,0.303
35,0.80876
36,1.1523
37,1.3037
38,1.2616
39,1.081
40,0.86749
41,0.70391
42,0.66998
43,0.76947
44,0.9507399999999999
45,1.1164
46,1.1486
47,1.0022
48,0.63136
49,0.075132
50,-0.57211
51,-1.218
52,-1.7445
53,-2.1083
54,-2.2708
55,-2.2693
56,-2.1142
57,-1.8034
58,-1.3544
59,-0.77591
60,-0.086747
61,0.6752600000000001
62,1.415
63,2.0504
64,2.4866
65,2.6633
66,2.5591
67,2.2131
68,1.7125
69,1.1511
70,0.63076
71,0.19732
72,-0.1337
73,-0.39323
74,-0.6206
75,-0.8701700000000001
76,-1.1596
77,-1.4729
78,-1.7938
79,-2.056
80,-2.2065
81,-2.2030000000000003
82,-2.0228
83,-1.661
84,-1.1309
85,-0.46776
86,0.27716
87,1.0412
88,1.7553
89,2.3402
90,2.7110000000000003
91,2.8128
92,2.6288
93,2.1762
94,1.5188
95,0.75831
96,0.0027245999999999998
97,-0.66442
98,-1.1740000000000002
99,-1.5061
100,-1.6642
101,-1.6898
102,-1.6358
103,-1.5548
104,-1.4652
105,-1.3687
106,-1.2579
107,-1.0859999999999999
108,-0.79833
109,-0.37126
110,0.17604
111,0.80616
112,1.4445
113,2.0023
114,2.4008
115,2.573
116,2.4881
117,2.1671
118,1.6538
119,0.9903200000000001
120,0.25459
121,-0.49367
122,-1.2004
123,-1.8068
124,-2.2484
125,-2.4996
126,-2.5375
127,-2.3424
128,-1.9308
129,-1.3587
130,-0.67506
131,0.015433
132,0.62217
133,1.0796
134,1.3776
135,1.5179
136,1.5296
137,1.4547
138,1.325
139,1.1535
140,0.93614
141,0.6662
142,0.34565
143,-0.022563999999999997
144,-0.41418999999999995
145,-0.76193
146,-1.0294
147,-1.1712
148,-1.1792
149,-1.0673
150,-0.8633700000000001
151,-0.61715
152,-0.35368
153,-0.11619000000000002
154,0.097713
155,0.285
156,0.49304
157,0.72009
158,0.9586
159,1.1892
160,1.3514
161,1.3944
162,1.272
163,0.96615
164,0.49842
165,-0.077928
166,-0.65657
167,-1.1496
168,-1.4553
169,-1.5473
170,-1.4344
171,-1.1947
172,-0.9134399999999999
173,-0.65299
174,-0.4773
175,-0.38988
176,-0.33399999999999996
177,-0.24541
178,-0.065206
179,0.23408
180,0.65662
181,1.114
182,1.4939
183,1.7145
184,1.6961
185,1.4392
186,0.9887
187,0.44
188,-0.10195
189,-0.57088
190,-0.9008299999999999
191,-1.1012
192,-1.1811
193,-1.1877
194,-1.1496
195,-1.0623
196,-0.9392299999999999
197,-0.75139
198,-0.48386
199,-0.13594
200,0.25724
201,0.6484300000000001
202,0.9863
203,1.2152
204,1.3264
205,1.3178
206,1.1873
207,0.98906
208,0.7555
209,0.50392
210,0.24494000000000002
211,-0.031118
212,-0.32178
213,-0.60647
214,-0.8884299999999999
215,-1.1495
216,-1.3586
217,-1.4704
218,-1.4689
219,-1.3465
220,-1.1038
221,-0.77522
222,-0.40875
223,-0.051521000000000004
224,0.2552
225,0.493
226,0.67397
227,0.8317
228,0.98364
229,1.1454
230,1.321
231,1.4592
232,1.5242
233,1.4522
234,1.2303
235,0.83042
236,0.30069
237,-0.29313
238,-0.8725700000000001
239,-1.3642
240,-1.7188
241,-1.8955
242,-1.8965
243,-1.7391
244,-1.4399
245,-1.0354
246,-0.56598
247,-0.044905
248,0.48573999999999995
249,0.96839
250,1.3649
251,1.639
252,1.7435
253,1.6882
254,1.505
255,1.2125
256,0.86301
257,0.48785
258,0.10914000000000001
259,-0.26499
260,-0.63765
261,-0.9828100000000001
262,-1.2824
263,-1.5205
264,-1.6519
265,-1.6539
266,-1.5105
267,-1.2512
268,-0.87764
269,-0.43708
270,0.051878999999999995
271,0.54269
272,1.0081
273,1.4255
274,1.7282
275,1.8737
276,1.8174
277,1.5393
278,1.0765
279,0.48489
280,-0.11285
281,-0.6543
282,-1.0559
283,-1.268
284,-1.3065
285,-1.212
286,-1.0741
287,-0.9346200000000001
288,-0.8155100000000001
289,-0.6967800000000001
290,-0.5390199999999999
291,-0.30496
292,0.042397000000000004
293,0.45571999999999996
294,0.8770600000000001
295,1.2174
296,1.3942
297,1.3867
298,1.1915
299,0.8701
300,0.5119199999999999
301,0.19712000000000002
302,-0.017206
303,-0.1201
304,-0.13885
305,-0.13890999999999998
306,-0.1738
307,-0.24224
308,-0.37688
309,-0.53574
310,-0.67709
311,-0.784
312,-0.83465
313,-0.8196700000000001
314,-0.7590399999999999
315,-0.64628
316,-0.49226000000000003
317,-0.27769
318,-0.029419
319,0.25243000000000004
320,0.52977
321,0.7649699999999999
322,0.88765
323,0.8742700000000001
324,0.72406
325,0.47176999999999997
326,0.17979
327,-0.089753
328,-0.27249
329,-0.33808
330,-0.30332
331,-0.21333000000000002
332,-0.11915999999999999
333,-0.057999
334,-0.033171
335,-0.047991000000000006
336,-0.046966
337,-0.020169
338,0.05637999999999999
339,0.1801
340,0.30851999999999996
341,0.42518999999999996
342,0.48341999999999996
343,0.48238000000000003
344,0.42246999999999996
345,0.32955999999999996
346,0.22339
347,0.12370999999999999
348,0.021471
349,-0.10377
350,-0.24206
351,-0.40292
352,-0.58257
353,-0.74121
354,-0.8582200000000001
355,-0.9031299999999999
356,-0.85264
357,-0.70463
358,-0.48813
359,-0.20575
360,0.098187
361,0.40595
362,0.68965
363,0.90475
364,1.0483
365,1.0903
366,1.0104
367,0.81617
368,0.5366
369,0.21908000000000002
370,-0.09070399999999999
371,-0.34558
372,-0.50361
373,-0.5757
374,-0.59692
375,-0.59768
376,-0.61232
377,-0.64298
378,-0.66685
379,-0.65059
380,-0.55372
381,-0.3589
382,-0.06853300000000001
383,0.27458
384,0.6080300000000001
385,0.8544700000000001
386,0.9728
387,0.9534600000000001
388,0.82
389,0.6198199999999999
390,0.40984
391,0.24505
392,0.13821
393,0.076299
394,0.019652
395,-0.077717
396,-0.22926
397,-0.43964
398,-0.68202
399,-0.9012600000000001
400,-1.0215
401,-0.99584
402,-0.8046399999999999
403,-0.45846000000000003
404,-0.029958999999999996
405,0.39289
406,0.71426
407,0.87955
408,0.85177
409,0.6874600000000001
410,0.43951
411,0.17759
412,-0.011009999999999999
413,-0.081164
414,-0.05704
415,0.023688
416,0.098688
417,0.12122000000000001
418,0.056385000000000005
419,-0.067967
420,-0.21298000000000003
421,-0.31538
422,-0.34226
423,-0.27421
424,-0.12972
425,0.036647000000000006
426,0.18075
427,0.24149
428,0.21924000000000002
429,0.1282
430,0.005162399999999999
431,-0.092195
432,-0.13396
433,-0.11585999999999999
434,-0.062215999999999994
435,-0.008471700000000002
436,0.0089155
437,-0.027214999999999996
438,-0.095851
439,-0.17432
440,-0.23198000000000002
441,-0.22346
442,-0.15837
443,-0.033760000000000005
444,0.10386
445,0.22660999999999998
446,0.30196
447,0.33316999999999997
448,0.32159
449,0.28105
450,0.24850999999999998
451,0.23123000000000002
452,0.24600999999999998
453,0.28922
454,0.35758
455,0.42552
456,0.46041000000000004
457,0.43588999999999994
458,0.33712
459,0.16923
460,-0.05404199999999999
461,-0.30864
462,-0.56381
463,-0.7741600000000001
464,-0.8922899999999999
465,-0.92776
466,-0.89202
467,-0.79566
468,-0.665
469,-0.51208
470,-0.35441
471,-0.18193
472,-0.007354600000000001
473,0.15285
474,0.29971
475,0.42123999999999995
476,0.50635
477,0.55625
478,0.5919800000000001
479,0.61928
480,0.64735
481,0.6891
482,0.73524
483,0.7643
484,0.74532
485,0.64878
486,0.46266999999999997
487,0.19723
488,-0.10295
489,-0.40119
490,-0.6573399999999999
491,-0.8389200000000001
492,-0.94819
493,-0.99754
494,-1.0103
495,-0.97954
496,-0.8902100000000001
497,-0.73787
498,-0.51777
499,-0.21764
