time,value
0,-0.037388
1,0.45009
2,0.7733
3,0.9137200000000001
4,0.88954
5,0.76852
6,0.63435
7,0.52858
8,0.45985
9,0.4139
10,0.34381
11,0.20118
12,-0.019612
13,-0.30135
14,-0.59695
15,-0.84651
16,-1.003
17,-1.0353
18,-0.9443299999999999
19,-0.7645
20,-0.51941
21,-0.24155
22,0.04305
23,0.34444
24,0.65678
25,0.9607899999999999
26,1.2392
27,1.4569999999999999
28,1.5734
29,1.564
30,1.4206
31,1.1631
32,0.83499
33,0.46513999999999994
34,0.088389
35,-0.28658
36,-0.6644899999999999
37,-1.0337
38,-1.401
39,-1.7403
40,-2.0071
41,-2.1562
42,-2.1381
43,-1.9378
44,-1.5456
45,-1.0128
46,-0.3928
47,0.24718
48,0.85229
49,1.3768
50,1.7873
51,2.0793
52,2.2247
53,2.2253
54,2.0853
55,1.7988
56,1.3648
57,0.8311700000000001
58,0.22914
59,-0.37395
60,-0.9281200000000001
61,-1.3734
62,-1.6647
63,-1.7945
64,-1.7596
65,-1.5787
66,-1.2824
67,-0.91712
68,-0.5098199999999999
69,-0.10021000000000001
70,0.29103
71,0.63342
72,0.90666
73,1.0942
74,1.1904
75,1.1892
76,1.0853
77,0.89202
78,0.62846
79,0.31148000000000003
80,-0.031671
81,-0.38103000000000004
82,-0.6986600000000001
83,-0.94805
84,-1.1193
85,-1.1899
86,-1.1497
87,-0.9973
88,-0.75639
89,-0.44697
90,-0.092199
91,0.27873000000000003
92,0.6323300000000001
93,0.9306399999999999
94,1.1555
95,1.2767
96,1.2947
97,1.2039
98,1.0222
99,0.76845
100,0.47506000000000004
101,0.18132
102,-0.093533
103,-0.32211
104,-0.50284
105,-0.64841
106,-0.77927
107,-0.90545
108,-1.0286
109,-1.1355
110,-1.2046
111,-1.1872
112,-1.0526
113,-0.79402
114,-0.41894
115,0.024326
116,0.46813
117,0.84619
118,1.0956
119,1.1771
120,1.0998
121,0.89765
122,0.6403800000000001
123,0.40354
124,0.23308
125,0.14704
126,0.13038
127,0.14367
128,0.14062
129,0.09009
130,-0.017831
131,-0.15278
132,-0.28609
133,-0.37889
134,-0.39483
135,-0.33793
136,-0.22855
137,-0.096469
138,0.011743
139,0.075504
140,0.086983
141,0.045163
142,-0.026212
143,-0.11255
144,-0.19617
145,-0.26955999999999997
146,-0.31932
147,-0.3431
148,-0.33288
149,-0.2841
150,-0.18792
151,-0.050102
152,0.10695999999999999
153,0.25686
154,0.36568
155,0.40536
156,0.37963
157,0.31708000000000003
158,0.23398000000000002
159,0.17524
160,0.15077000000000002
161,0.16587000000000002
162,0.2022
163,0.22726
164,0.20615999999999998
165,0.12633
166,-0.004326
167,-0.16335
168,-0.30804000000000004
169,-0.40114
170,-0.41155
171,-0.349
172,-0.22812
173,-0.079082
174,0.0533
175,0.12467
176,0.1439
177,0.10709
178,0.032573000000000005
179,-0.048539
180,-0.10967
181,-0.13737
182,-0.12290999999999999
183,-0.059681
184,0.033868
185,0.14667
186,0.25881
187,0.35912
188,0.42903
189,0.46448999999999996
190,0.46061
191,0.41721
192,0.3219
193,0.17735
194,-0.0037028
195,-0.22904000000000002
196,-0.46278
197,-0.6781699999999999
198,-0.83725
199,-0.9104399999999999
200,-0.89151
201,-0.78023
202,-0.60626
203,-0.3983
204,-0.19632
205,-0.019146
206,0.14153
207,0.29748
208,0.46629
209,0.64652
210,0.8324299999999999
211,0.9954700000000001
212,1.0943
213,1.0956
214,0.97311
215,0.73623
216,0.4217
217,0.092431
218,-0.2067
219,-0.43591
220,-0.57573
221,-0.6307699999999999
222,-0.62629
223,-0.60763
224,-0.58948
225,-0.57719
226,-0.55695
227,-0.5060399999999999
228,-0.40939000000000003
229,-0.25861
230,-0.078919
231,0.10644
232,0.26643
233,0.3677
234,0.3995
235,0.36762
236,0.28514
237,0.17515
238,0.059546
239,-0.044042000000000005
240,-0.1352
241,-0.20801
242,-0.24865
243,-0.2687
244,-0.25572
245,-0.19977
246,-0.097273
247,0.05058
248,0.23433
249,0.43492
250,0.62834
251,0.7813100000000001
252,0.8741200000000001
253,0.89039
254,0.82737
255,0.70324
256,0.5233899999999999
257,0.30293000000000003
258,0.049425
259,-0.22171
260,-0.51378
261,-0.8223799999999999
262,-1.1227
263,-1.3845
264,-1.5706
265,-1.6244
266,-1.5148
267,-1.2299
268,-0.7903600000000001
269,-0.25356
270,0.31431
271,0.81434
272,1.1955
273,1.4261
274,1.5136
275,1.4945
276,1.4286
277,1.3311
278,1.2082
279,1.0452
280,0.80008
281,0.45503999999999994
282,0.0035663000000000005
283,-0.51047
284,-1.0312
285,-1.4794
286,-1.7837
287,-1.901
288,-1.8286
289,-1.5895
290,-1.2202
291,-0.78576
292,-0.33902
293,0.097844
294,0.49675
295,0.8487399999999999
296,1.1527
297,1.3813
298,1.5174
299,1.5329
300,1.4366
301,1.2426
302,0.97149
303,0.6600699999999999
304,0.32838
305,-0.0046692
306,-0.32573
307,-0.62905
308,-0.9091899999999999
309,-1.1504
310,-1.3269
311,-1.4101
312,-1.3878
313,-1.2626
314,-1.0414
315,-0.7564
316,-0.43418
317,-0.10322
318,0.22003000000000003
319,0.52289
320,0.79335
321,1.0169
322,1.1714
323,1.2333
324,1.2023
325,1.0661
326,0.83773
327,0.55025
328,0.24569000000000002
329,-0.028674
330,-0.25713
331,-0.41785
332,-0.52131
333,-0.5965
334,-0.64276
335,-0.6653899999999999
336,-0.66079
337,-0.612
338,-0.49473
339,-0.30188000000000004
340,-0.061209000000000006
341,0.19664
342,0.43263999999999997
343,0.58975
344,0.65613
345,0.61597
346,0.48328999999999994
347,0.28423000000000004
348,0.044324
349,-0.20594
350,-0.44685
351,-0.65675
352,-0.80707
353,-0.8791700000000001
354,-0.8529700000000001
355,-0.7057
356,-0.45
357,-0.10799
358,0.26604
359,0.61435
360,0.87472
361,1.0017
362,1.0018
363,0.89865
364,0.7341300000000001
365,0.5605899999999999
366,0.41473000000000004
367,0.31166
368,0.23071
369,0.14374
370,0.030579000000000002
371,-0.14078
372,-0.36257
373,-0.60939
374,-0.83255
375,-1.0008
376,-1.0756
377,-1.0506
378,-0.93937
379,-0.76543
380,-0.5585100000000001
381,-0.34909
382,-0.16554000000000002
383,0.0012775
384,0.15547
385,0.3235
386,0.5211100000000001
387,0.74736
388,0.99174
389,1.2271
390,1.4105
391,1.496
392,1.4539
393,1.2726
394,0.95395
395,0.5341100000000001
396,0.052754999999999996
397,-0.45221999999999996
398,-0.93132
399,-1.3558
400,-1.6805
401,-1.8914
402,-1.9834
403,-1.9318
404,-1.7333
405,-1.3837
406,-0.8974
407,-0.3113
408,0.31589
409,0.92584
410,1.449
411,1.8431
412,2.0719
413,2.1268
414,2.0235
415,1.7662
416,1.3877
417,0.90279
418,0.3352
419,-0.29494000000000004
420,-0.9393799999999999
421,-1.5264
422,-1.9819
423,-2.2411
424,-2.254
425,-2.0132
426,-1.5507
427,-0.9462799999999999
428,-0.2928
429,0.32177
430,0.82483
431,1.1823
432,1.3907
433,1.4744
434,1.4592
435,1.3588
436,1.1747
437,0.9055200000000001
438,0.5511
439,0.11992
440,-0.34504
441,-0.7814399999999999
442,-1.1192
443,-1.3157
444,-1.3419999999999999
445,-1.2232
446,-0.99921
447,-0.7226199999999999
448,-0.44673
449,-0.18752
450,0.052584000000000006
451,0.30035
452,0.57416
453,0.87156
454,1.1619
455,1.4058
456,1.5501
457,1.5422
458,1.3649
459,1.0281
460,0.57312
461,0.051526
462,-0.47688
463,-0.9778100000000001
464,-1.4234
465,-1.7921
466,-2.057
467,-2.2064
468,-2.2108
469,-2.0289
470,-1.6596
471,-1.1188
472,-0.44093999999999994
473,0.30862
474,1.0513
475,1.7052
476,2.208
477,2.5249
478,2.6323
479,2.5534
480,2.3121
481,1.9302
482,1.4371
483,0.86777
484,0.23968000000000003
485,-0.41089
486,-1.0468
487,-1.6343
488,-2.1223
489,-2.4657
490,-2.6404
491,-2.6207
492,-2.406
493,-2.009
494,-1.4615
495,-0.80271
496,-0.08419199999999999
497,0.6273
498,1.2779
499,1.8092
