d3mIndex,G1.nodeID,G2.nodeID,match
0,Kwethluk,KEHU,1
1,Bethel,BTE,1
2,Napaskiak,NPSIK,1
3,Quinhagak,QIHGK,1
4,Juneau Intl,JNA NL,1
5,Sitka,STA,1
6,Ketchikan Intl,KTHKNIT,1
7,Unalaska,UAAK,1
8,Glacier Park Intl,GAIRPR NL,1
9,Hector Intll,HCO NL,1
10,Walla Walla Regional,WLAWLARGOA,1
11,Eastern Oregon Regional At Pen,ESENOEO EINLA E,1
12,Burlington Intl,BRIGO NL,1
13,Mahlon Sweet Field,MHO WE IL,1
14,Rapid City Regional,RPDCT EINL,1
15,Jackson Hole,JCSNHL,1
16,Greater Rochester Intl,GETRRCETRIT,1
17,General Mitchell Intll,GNRLMTHL NL,1
18,Albany County,ABN ONY,1
19,Tompkins County,TMKN ONY,1
20,Twin Falls-Sun Valley Regional,TI AL-U ALYRGOA,1
21,Rogue Valley Intl- M,RGEVLE NL ,1
22,Detroit Metropolitan Wayne Cou,DTOTMTOOIA AN O,1
23,Cedar Rapids Muni,CDRRPD UI,1
24,Stewart Int'l,SEATITL,1
25,Cleveland-Hopkins Intl,CEEADHPISIT,1
26,Wilkes-Barre/Scranton Intl,WLE-AR/CATNIT,1
27,Lincoln Muni,LNONMN,1
28,Elko Muni-J.C. Harris Field,EK UIJC ARSFED,1
29,Yampa Valley,YMAVLE,1
30,Philadelphia Intl,PIAEPI NL,1
31,Capital,CPTL,1
32,Hulman Regional,HLA EINL,1
33,Sacramento Metropolitan,SCAET ERPLTN,1
34,Louisville Intl,LUSIL NL,1
35,Mammoth Lakes,MMOHLKS,1
36,San Jose Intll,SNJS NL,1
37,Monterey Peninsula,MNEE EISL,1
38,Tri-Cities Regional Tn/Va,TICTE EINLT/A,1
39,Tulsa Intl,TLAIT,1
40,Fort Smith Regional,FR MT EINL,1
41,Kinston Regional Jetport At St,KNTNRGOA EPR TS,1
42,Memphis Intl,MMHSIT,1
43,Huntsville Intl-Carl T Jones F,HNSIL NLCR  OE ,1
44,Los Angeles Intl,LSAGLSIT,1
45,Palm Springs Regional,PL PIG EINL,1
46,Long Beach /Daugherty Field/,LN EC DUHRYFED,1
47,Bush Field,BS IL,1
48,Shreveport Regional,SRVPR EINL,1
49,Gregg County,GEGCUT,1
50,Tucson Intl,TCO NL,1
51,Waco Regional,WC EINL,1
52,Mathis Field,MTI IL,1
53,"Baton Rouge Metropolitan, Ryan","BTNRUEMTOOIA,RA",1
54,Pensacola Regional,PNAOARGOA,1
55,Tallahassee Regional,TLAASERGOA,1
56,Robert Mueller Muni,RBR ULE UI,1
57,Lake Charles Regional,LK HRE EINL,1
58,Gainesville Regional,GIEVLERGOA,1
59,William P Hobby,WLIMPHBY,1
60,Daytona Beach Intl,DYOABAHIT,1
61,Melbourne Intll,MLOREITL,1
62,Miami Intl,MAIIT,1
63,Kahului,KHLI,1
64,Alexander Hamilton,AEADRHMLO,1
65,Rota Intl,RT NL,1
66,Wiley Post-Will Rogers Mem,WLYPS-ILRGR E,1
67,Deadhorse,DAHRE,1
68,Ralph Wien Memorial,RLHWE EOIL,1
69,Fairbanks Intl,FIBNSIT,1
70,Nome,NM,1
71,St Mary's,S AYS,1
72,Aniak,AIK,1
73,Anchorage Intl,ACOAEIT,1
74,Tuluksak,TLKA,1
75,Akiachak,AICA,1
76,Akiak,AIK,1
77,Napakiak,NPKA,1
78,Merle K (Mudhole) Smith,MREK(UHL)SIH,1
79,Tuntutuliak,TNUUIK,1
80,Eek,EK,1
81,Kongiganak,KNIAA,1
82,Kwigillingok,KIILNO,1
83,Yakutat,YKTT,1
84,Dillingham,DLIGA,1
85,King Salmon,KN AMN,1
86,Gustavus,GSAU,1
87,Kodiak,KDA,1
88,St Paul Island,S ALILN,1
89,Port Heiden,PR EDN,1
90,James A Johnson Petersburg,JMSAJHSNPTRBR,1
91,Wrangell,WAGL,1
92,Sand Point,SN ON,1
93,Cold Bay,CL A,1
94,Eareckson As,ERCSNA,1
95,Adak Naf,AA A,1
96,Bellingham Intl,BLIGA NL,1
97,Minot Intl,MNTIT,1
98,William R Fairchild Intl,WLIMRFICIDIT,1
99,Grand Forks Afb,GADFRSAB,1
100,Grand Forks Intl,GADFRSIT,1
101,Spokane Intl,SOAEIT,1
102,Great Falls Intl,GETFLSIT,1
103,Seattle-Tacoma Intl,SATETCM NL,1
104,Pangborn Memorial,PNBR EOIL,1
105,Grant County,GATCUT,1
106,Missoula Intll,MSOL NL,1
107,Duluth Intl,DLT NL,1
108,Bismarck Muni,BSAC UI,1
109,Pullman/Moscow Regional,PLMNMSO EINL,1
110,Helena Regional,HLN EINL,1
111,Yakima Air Terminal,YKM I EMNL,1
112,Marquette County,MRUTECUT,1
113,Lewiston-Nez Perce County,LWSO-E EC ONY,1
114,Tri-Cities,TICTE,1
115,Bert Mooney,BR ONY,1
116,Billings Logan Intl,BLIG OA NL,1
117,Gallatin Field,GLAI IL,1
118,Portland Intl,PRLN NL,1
119,Mcnary Fld,MNR L,1
120,Minneapolis-St Paul Intl/Wold-,MNEPLSS ALIT/OD,1
121,Bangor Intl,BNO NL,1
122,Central Wisconsin,CNRLWSOSN,1
123,Cherry Capital,CER AIA,1
124,Austin Straubel Intll,ASI TABLITL,1
125,Outagamie County,OTGMECUT,1
126,Roberts Field,RBRSFED,1
127,Wittman Regional,WTMNRGOA,1
128,Rochester Intll,RCETRITL,1
129,La Crosse Muni,L RSEMN,1
130,Portland Intl Jetport,PRLN NLJTOT,1
131,Joe Foss Field,JEFS IL,1
132,Boise Air Terminal /Gowen Fld/,BIEARTRIA GWNFD,1
133,Mbs Intll,MSITL,1
134,Fanning Field,FNIGFED,1
135,Friedman Memorial,FIDA EOIL,1
136,North Bend Muni,NRHBN UI,1
137,Muskegon County,MSEO ONY,1
138,Oneida County,OED ONY,1
139,Dane County Regional-Truax Fie,DN ONYRGOA-RA I,1
140,Syracuse Hancock Intl,SRCS ACC NL,1
141,Bishop Intll,BSO NL,1
142,Greater Buffalo Intl,GETRBFAOIT,1
143,Manchester,MNHSE,1
144,Pocatello Regional,PCTLORGOA,1
145,Natrona County Intl,NTOACUT NL,1
146,Kent County Intl,KN ONYIT,1
147,Capital City,CPTLCT,1
148,Waterloo Muni,WTRO UI,1
149,Detroit City,DTOTCT,1
150,Sioux Gateway,SOXGTWY,1
151,Dubuque Regional,DBQERGOA,1
152,General Edward Lawrence Logan,GNRLEWR ARNELGN,1
153,Worcester Muni,WRETRMN,1
154,Kalamazoo/Battle Creek Interna,KLMZOBTL RE NEN,1
155,Binghamton Regional/Edwin A Li,BNHMO EINLEWNAL,1
156,Greater Rockford,GETRRCFR,1
157,Elmira/Corning Regional,EMR/ONN EINL,1
158,Klamath Falls Intll,KAAHFLSITL,1
159,Erie Intl,EI NL,1
160,Chicago O'hare Intl,CIAOOHR NL,1
161,Bradley Intl,BALYIT,1
162,William B. Heilig Field,WLIMB ELGFED,1
163,Merrill C Meigs,MRILCMIS,1
164,Chicago Midway,CIAOMDA,1
165,Jack Mc Namara Field,JC CNMR IL,1
166,Theodore Francis Green State,TEDR RNI RE TT,1
167,Michiana Rgnl Transportation C,MCIN GLTASOTTO ,1
168,Toledo Express,TLD XRS,1
169,Des Moines Intl,DSMIE NL,1
170,Quad-City,QA-IY,1
171,Eppley Airfield,EPE IFED,1
172,Tweed-New Haven,TEDNWHVN,1
173,Youngstown-Warren Regional,YUGTW-ARNRGOA,1
174,Westchester County,WSCETRCUT,1
175,Fort Wayne Intll,FR AN NL,1
176,Arcata,ACT,1
177,Akron-Canton Regional,ARNCNO EINL,1
178,University Park,UIEST AK,1
179,Long Island Mac Arthur,LN SADMCATU,1
180,Salt Lake City Intl,SL AECT NL,1
181,Burlington Regional,BRIGO EINL,1
182,La Guardia,L URI,1
183,Newark Intl,NWR NL,1
184,Greater Peoria Regional,GETRPOI EINL,1
185,Lehigh Valley Intll,LHG ALYITL,1
186,John F Kennedy Intl,JH  END NL,1
187,Redding Muni,RDIGMN,1
188,Pittsburgh Intll,PTSUG NL,1
189,Bloomington/Normal,BOMNTNNRA,1
190,Purdue University,PRU NVRIY,1
191,Mercer County,MRE ONY,1
192,Harrisburg Intll,HRIBR NL,1
193,University Of Illinois-Willard,UIEST FILNI-ILR,1
194,Port Columbus Intl,PR OUBSIT,1
195,Quincy Muni Baldwin Field,QIC UIBLWNFED,1
196,James M Cox Dayton Intl,JMSMCXDYO NL,1
197,Decatur,DCTR,1
198,Chico Muni,CIOMN,1
199,Stapleton Intl,SALTNIT,1
200,Indianapolis Intl,IDAAOI NL,1
201,Eagle County Regional,EGECUT EINL,1
202,Reno/Tahoe Intll,RN/AO NL,1
203,Atlantic City Intll,ALNI IYITL,1
204,Kansas City Intl,KNA IYIT,1
205,Aspen-Pitkin Co/Sardy Field,APNPTI OSRYFED,1
206,Baltimore-Washington Intl,BLIOEWSIGO NL,1
207,Walker Field,WLE IL,1
208,Cincinnati/Northern Kentucky I,CNINT/OTENKNUK ,1
209,Washington Dulles Intl,WSIGO ULSIT,1
210,Lake Tahoe,LK AO,1
211,Washington National,WSIGO AINL,1
212,Columbia Regional,CLMI EINL,1
213,City Of Colorado Springs Muni,CT FCLRD PIG UI,1
214,Lambert-St Louis Intl,LMETS OI NL,1
215,Gunnison County,GNIO ONY,1
216,Sonoma County,SNM ONY,1
217,Yeager,YAE,1
218,Tri-State/Milton J.Ferguson Fi,TISAEMLO .EGSNF,1
219,Pueblo Memorial,PEL EOIL,1
220,Charlottesville-Albemarle,CALTEVLEABMRE,1
221,Evansville Regional,EASIL EINL,1
222,Blue Grass,BU RS,1
223,Stockton Metropolitan,SOKO ERPLTN,1
224,Greenbrier Valley,GENRE ALY,1
225,Williamson County Regional,WLIMO ONYRGOA,1
226,Forney Aaf,FRE A,1
227,Metropolitan Oakland Intl,MTOOIA ALN NL,1
228,Wichita Mid-Continent,WCIAMDCNIET,1
229,Modesto City-County--Harry Sha,MDSOCT-ONY-AR H,1
230,San Francisco Intl,SNFACSOIT,1
231,Richmond Intll,RCMN NL,1
232,Roanoke Regional/Woodrum Field,RAOERGOA/ODU IL,1
233,Merced Municipal/Macready Fiel,MRE UIIA/ARAYFE,1
234,Springfield Regional,SRNFEDRGOA,1
235,Cape Girardeau Regional,CP IADA EINL,1
236,Durango-La Plata County,DRNOL LT ONY,1
237,Joplin Regional,JPI EINL,1
238,Newport News/Williamsburg Inte,NWOTNW/ILASUGIT,1
239,Barkley Regional,BRLYRGOA,1
240,Norfolk Intl,NROKIT,1
241,Fresno Air Terminal,FEN I EMNL,1
242,Nashville Intll,NSVLEITL,1
243,Piedmont Triad Intll,PEMN RA NL,1
244,Mc Carran Intl,M ARNIT,1
245,Drake Field,DAEFED,1
246,Raleigh-Durham Intll,RLIHDRA NL,1
247,Mc Ghee Tyson,M HETSN,1
248,Asheville Regional,AHVLERGOA,1
249,Meadows Field,MAOSFED,1
250,Will Rogers World,WL OESWRD,1
251,San Luis Obispo County-Mc Ches,SNLI BSOCUT-CCE,1
252,Amarillo Intl,AAIL NL,1
253,Charlotte/Douglas Intl,CALTEDULSIT,1
254,Flagstaff Pulliam,FASAFPLIM,1
255,Albuquerque Intl,ABQEQEIT,1
256,Lovell Field,LVL IL,1
257,Fayetteville Regional/Grannis,FYTEIL EINLGANS,1
258,Santa Maria Pub/Capt G Allan H,SNAMRAPBCP  LA ,1
259,Greenville-Spartanburg,GENIL-PRABR,1
260,Albert J Ellis,ABR  LI,1
261,Adams Field,AASFED,1
262,Lawton Muni,LWO UI,1
263,Santa Barbara Muni,SNABRAAMN,1
264,New Hanover Intll,NWHNVRITL,1
265,Oxnard,ONR,1
266,Burbank-Glendale-Pasadena,BRAKGEDL-AAEA,1
267,Ontario Intl,OTROIT,1
268,Sheppard Afb/Wichita Falls Mun,SEPR F/IHT AL U,1
269,Columbia Metropolitan,CLMI ERPLTN,1
270,Myrtle Beach Intl,MRL EC NL,1
271,John Wayne Airport-Orange Coun,JH AN IPR-RNECU,1
272,Lubbock Intl,LBOKIT,1
273,The William B Hartsfield Atlan,TEWLIMBHRSIL TA,1
274,Birmingham Intl,BRIGA NL,1
275,Texarkana Regional-Webb Field,TXRAARGOA-EBFED,1
276,Phoenix Sky Harbor Intl,PONXSYHRO NL,1
277,Charleston Afb/Intl,CALSO F/NL,1
278,Dallas/Fort Worth Intl,DLA/OTWRHIT,1
279,Dallas Love Field,DLA OEFED,1
280,San Diego Intl-Lindbergh Fld,SNDEOIT-IDEG L,1
281,Yuma Mcas/Yuma Intl,YM CSYM NL,1
282,Columbus Metropolitan,CLMU ERPLTN,1
283,Monroe Regional,MNO EINL,1
284,Abilene Regional,AIEERGOA,1
285,Tyler Pounds Field,TLRPUD IL,1
286,Jackson Intll,JCSNITL,1
287,Dannelly Field,DNEL IL,1
288,Savannah Intll,SVNA NL,1
289,Midland Intll,MDADITL,1
290,El Paso Intl,E AOIT,1
291,Alexandria Esler Regional,AEADI SE EINL,1
292,Killeen Muni,KLENMN,1
293,Mobile Regional,MBL EINL,1
294,Easterwood Field,ESEWO IL,1
295,Jacksonville Intl,JCSNIL NL,1
296,Eglin Afb,ELNAB,1
297,Panama City-Bay Co Intl,PNM IYBYC NL,1
298,Lafayette Regional,LFYTERGOA,1
299,New Orleans Intl/Moisant Fld/,NWOLASIT/OSN L/,1
300,Houston Intercontinental,HUTNITROTNNA,1
301,Jefferson County,JFESNCUT,1
302,San Antonio Intl,SNATNOIT,1
303,Orlando Intl,OLNOIT,1
304,Tampa Intl,TMAIT,1
305,St Petersburg/Clearwater Intl,S EESUGCERAE NL,1
306,Corpus Christi Intl,CRU HIT NL,1
307,Laredo Intl,LRD NL,1
308,Sarasota/Bradenton Intl,SRST/RDNO NL,1
309,Palm Beach Intl,PL EC NL,1
310,Southwest Florida Intl,SUHETFOIAIT,1
311,Rio Grande Valley Intl,ROGAD ALYIT,1
312,Mc Allen Miller Intl,M LE ILRIT,1
313,Fort Lauderdale/Hollywood Intl,FR ADRAEHLYODIT,1
314,Lihue,LHE,1
315,Honolulu Intl,HNLL NL,1
316,Molokai,MLKI,1
317,Kapalua,KPLA,1
318,Lanai,LNI,1
319,Keahole-Kona Intll,KAOEKN NL,1
320,Hilo Intll,HL NL,1
321,Rafael Hernandez,RFE ENNE,1
322,Luis Munoz Marin Intl,LI UO AI NL,1
323,Cyril E King,CRLEKN,1
324,Eugenio Maria De Hostos,EGNOMRAD OTS,1
325,Mercedita,MREIA,1
326,Johnston Atoll,JHSO TL,1
327,Saipan Intl,SIA NL,1
328,Guam Intll,GA NL,1
329,Babelthuap/Koror,BBLHA/OO,1
330,Pago Pago Intl,PG AOIT,1
331,West Tinian,WS IIN,1
332,Philadelphia Intl,NWOTNW/ILASUGIT,0
333,Rapid City Regional,LHE,0
334,Quinhagak,LRD NL,0
335,Baltimore-Washington Intl,RT NL,0
336,Dubuque Regional,DTOTCT,0
337,Mercedita,KDA,0
338,Capital,BNO NL,0
339,Bloomington/Normal,WTRO UI,0
340,Corpus Christi Intl,SEATITL,0
341,Will Rogers World,PNBR EOIL,0
342,Bradley Intl,CT FCLRD PIG UI,0
343,Akiak,RPDCT EINL,0
344,Sheppard Afb/Wichita Falls Mun,CPTLCT,0
345,John F Kennedy Intl,HRIBR NL,0
346,General Mitchell Intll,LNI,0
347,Merced Municipal/Macready Fiel,SN ON,0
348,Kongiganak,TEDR RNI RE TT,0
349,Bellingham Intl,AIEERGOA,0
350,Tuluksak,M LE ILRIT,0
351,Burlington Regional,YAE,0
352,Minneapolis-St Paul Intl/Wold-,MNR L,0
353,Jack Mc Namara Field,TICTE,0
354,Roanoke Regional/Woodrum Field,QIC UIBLWNFED,0
355,University Park,EGECUT EINL,0
356,Helena Regional,EK UIJC ARSFED,0
357,San Antonio Intl,CALTEDULSIT,0
358,Kongiganak,GATCUT,0
359,Minneapolis-St Paul Intl/Wold-,WLIMPHBY,0
360,Portland Intl Jetport,BRIGO EINL,0
361,Billings Logan Intl,CLMU ERPLTN,0
362,Natrona County Intl,RPDCT EINL,0
363,Great Falls Intl,GENIL-PRABR,0
364,Theodore Francis Green State,PR OUBSIT,0
365,North Bend Muni,GIEVLERGOA,0
366,Sonoma County,BRIGO EINL,0
367,Charlotte/Douglas Intl,SRCS ACC NL,0
368,Abilene Regional,SNFACSOIT,0
369,Panama City-Bay Co Intl,WLIMO ONYRGOA,0
370,Bloomington/Normal,TLAIT,0
371,Tuluksak,TEDR RNI RE TT,0
372,Columbus Metropolitan,KN ONYIT,0
373,Albuquerque Intl,JEFS IL,0
374,Theodore Francis Green State,KNIAA,0
375,St Mary's,DSMIE NL,0
376,Portland Intl,WL OESWRD,0
377,Panama City-Bay Co Intl,SNFACSOIT,0
378,La Crosse Muni,AICA,0
379,James A Johnson Petersburg,JMSMCXDYO NL,0
380,Pangborn Memorial,LN SADMCATU,0
381,Eastern Oregon Regional At Pen,SNJS NL,0
382,Dillingham,DBQERGOA,0
383,Atlantic City Intll,LVL IL,0
384,Theodore Francis Green State,PNM IYBYC NL,0
385,Metropolitan Oakland Intl,GENIL-PRABR,0
386,Orlando Intl,PEMN RA NL,0
387,Dallas/Fort Worth Intl,BNO NL,0
388,Redding Muni,FR ADRAEHLYODIT,0
389,Dallas Love Field,AASFED,0
390,Hector Intll,SRST/RDNO NL,0
391,Orlando Intl,SNATNOIT,0
392,Quinhagak,BTE,0
393,Lovell Field,SEATITL,0
394,Dubuque Regional,MRL EC NL,0
395,Mathis Field,HLN EINL,0
396,William R Fairchild Intl,MSEO ONY,0
397,Pocatello Regional,WLE-AR/CATNIT,0
398,Nome,SRCS ACC NL,0
399,Birmingham Intl,KTHKNIT,0
400,Youngstown-Warren Regional,PCTLORGOA,0
401,Birmingham Intl,IDAAOI NL,0
402,Pangborn Memorial,CRLEKN,0
403,Rafael Hernandez,RAOERGOA/ODU IL,0
404,Norfolk Intl,PNAOARGOA,0
405,Port Columbus Intl,SRST/RDNO NL,0
406,Akron-Canton Regional,GNRLEWR ARNELGN,0
407,San Diego Intl-Lindbergh Fld,SNM ONY,0
408,Harrisburg Intll,TMAIT,0
409,Tallahassee Regional,LMETS OI NL,0
410,Fayetteville Regional/Grannis,HRIBR NL,0
411,Elko Muni-J.C. Harris Field,OLNOIT,0
412,Youngstown-Warren Regional,WLAWLARGOA,0
413,Charlottesville-Albemarle,TI AL-U ALYRGOA,0
414,Elmira/Corning Regional,TCO NL,0
415,Mathis Field,AA A,0
416,Fairbanks Intl,EMR/ONN EINL,0
417,Cape Girardeau Regional,E AOIT,0
418,Tulsa Intl,LUSIL NL,0
419,Grand Forks Afb,NPKA,0
420,Alexandria Esler Regional,GETFLSIT,0
421,Houston Intercontinental,LHE,0
422,Easterwood Field,MNTIT,0
423,Texarkana Regional-Webb Field,MDADITL,0
424,William B. Heilig Field,GNRLEWR ARNELGN,0
425,Tweed-New Haven,BOMNTNNRA,0
426,Greater Buffalo Intl,JMSMCXDYO NL,0
427,Wichita Mid-Continent,TLKA,0
428,Santa Maria Pub/Capt G Allan H,MSOL NL,0
429,Bush Field,KAAHFLSITL,0
430,Dane County Regional-Truax Fie,LHE,0
431,Los Angeles Intl,SNAMRAPBCP  LA ,0
432,Cold Bay,KAAHFLSITL,0
433,Austin Straubel Intll,TCO NL,0
434,Stapleton Intl,SRST/RDNO NL,0
435,Meadows Field,CALSO F/NL,0
436,Nome,YAE,0
437,Mc Allen Miller Intl,CP IADA EINL,0
438,Lincoln Muni,ROGAD ALYIT,0
439,"Baton Rouge Metropolitan, Ryan",GETRRCFR,0
440,Wichita Mid-Continent,EMR/ONN EINL,0
441,Merced Municipal/Macready Fiel,ACOAEIT,0
442,Bradley Intl,SUHETFOIAIT,0
443,Port Heiden,HLA EINL,0
444,Monroe Regional,TLKA,0
445,Yakutat,LHE,0
446,Los Angeles Intl,TI AL-U ALYRGOA,0
447,William B. Heilig Field,CPTLCT,0
448,Keahole-Kona Intll,HLN EINL,0
449,Gregg County,LWO UI,0
450,Nashville Intll,WCIAMDCNIET,0
451,Hilo Intll,MLOREITL,0
452,Waco Regional,SEPR F/IHT AL U,0
453,Bangor Intl,JCSNHL,0
454,Newark Intl,SNATNOIT,0
455,Gunnison County,ESEWO IL,0
456,Waco Regional,CIOMN,0
457,Meadows Field,RT NL,0
458,Wiley Post-Will Rogers Mem,TLKA,0
459,Merle K (Mudhole) Smith,SCAET ERPLTN,0
460,Savannah Intll,MREK(UHL)SIH,0
461,John F Kennedy Intl,"BTNRUEMTOOIA,RA",0
462,Bush Field,RPDCT EINL,0
463,Mammoth Lakes,PIAEPI NL,0
464,Charlottesville-Albemarle,YKTT,0
465,Tri-Cities Regional Tn/Va,KTHKNIT,0
466,Robert Mueller Muni,PEMN RA NL,0
467,James M Cox Dayton Intl,NWHNVRITL,0
468,Stapleton Intl,KN ONYIT,0
469,Mc Ghee Tyson,BBLHA/OO,0
470,Palm Beach Intl,QIHGK,0
471,Baltimore-Washington Intl,CL A,0
472,James A Johnson Petersburg,SOKO ERPLTN,0
473,Mc Carran Intl,NPSIK,0
474,Robert Mueller Muni,S AYS,0
475,Akiak,OED ONY,0
476,Mc Carran Intl,TCO NL,0
477,Gallatin Field,OED ONY,0
478,Columbia Regional,SIA NL,0
479,Easterwood Field,YKTT,0
480,Springfield Regional,MSITL,0
481,San Luis Obispo County-Mc Ches,NWOTNW/ILASUGIT,0
482,Purdue University,BSAC UI,0
483,Los Angeles Intl,EI NL,0
484,Binghamton Regional/Edwin A Li,CRU HIT NL,0
485,Yampa Valley,JPI EINL,0
486,Syracuse Hancock Intl,MRE ONY,0
487,Glacier Park Intl,EMR/ONN EINL,0
488,Redding Muni,SN ON,0
489,Gunnison County,RN/AO NL,0
490,La Crosse Muni,SATETCM NL,0
491,Blue Grass,SL AECT NL,0
492,Richmond Intll,PIAEPI NL,0
493,Williamson County Regional,GNIO ONY,0
494,Greater Peoria Regional,ARNCNO EINL,0
495,Roberts Field,MNHSE,0
496,Natrona County Intl,NPKA,0
497,Pueblo Memorial,YKTT,0
498,Burlington Regional,KAOEKN NL,0
499,Elko Muni-J.C. Harris Field,RLIHDRA NL,0
500,Juneau Intl,PRLN NLJTOT,0
501,Palm Springs Regional,HNLL NL,0
502,Midland Intll,AEADI SE EINL,0
503,Mc Allen Miller Intl,NM,0
504,Greenbrier Valley,RDIGMN,0
505,Jackson Hole,KHLI,0
506,Panama City-Bay Co Intl,PEL EOIL,0
507,Lafayette Regional,MNR L,0
508,Tuluksak,AICA,0
509,Modesto City-County--Harry Sha,RBRSFED,0
510,Adams Field,M HETSN,0
511,Marquette County,KIILNO,0
512,Mammoth Lakes,SL AECT NL,0
513,Dillingham,LHE,0
514,Myrtle Beach Intl,MAOSFED,0
515,Roanoke Regional/Woodrum Field,L URI,0
516,Walker Field,AICA,0
517,La Guardia,PNBR EOIL,0
518,Blue Grass,TMKN ONY,0
519,Waco Regional,WLE-AR/CATNIT,0
520,Spokane Intl,BRIGO NL,0
521,Tri-State/Milton J.Ferguson Fi,S AYS,0
522,Klamath Falls Intll,SNAMRAPBCP  LA ,0
523,Eagle County Regional,M ARNIT,0
524,Greater Rochester Intl,BRLYRGOA,0
525,Sioux Gateway,NM,0
526,Great Falls Intl,KEHU,0
527,Fresno Air Terminal,CALTEVLEABMRE,0
528,Kodiak,GENIL-PRABR,0
529,Gustavus,MNR L,0
530,Los Angeles Intl,KIILNO,0
531,Sacramento Metropolitan,SIA NL,0
532,Outagamie County,FR AN NL,0
533,Jack Mc Namara Field,TEWLIMBHRSIL TA,0
534,Detroit Metropolitan Wayne Cou,NPSIK,0
535,Blue Grass,SIA NL,0
536,Marquette County,DTOTCT,0
537,Ontario Intl,LWSO-E EC ONY,0
538,Fort Lauderdale/Hollywood Intl,PG AOIT,0
539,La Crosse Muni,WS IIN,0
540,Billings Logan Intl,WLIMO ONYRGOA,0
541,Yuma Mcas/Yuma Intl,TLAASERGOA,0
542,Mbs Intll,KTHKNIT,0
543,Eek,UAAK,0
544,Yuma Mcas/Yuma Intl,MMOHLKS,0
545,Waterloo Muni,CNINT/OTENKNUK ,0
546,Los Angeles Intl,GENIL-PRABR,0
547,Jackson Hole,WSIGO AINL,0
548,Kansas City Intl,SRNFEDRGOA,0
549,Adak Naf,KLMZOBTL RE NEN,0
550,Bert Mooney,TEDR RNI RE TT,0
551,Kongiganak,FR MT EINL,0
552,Kwigillingok,IDAAOI NL,0
553,Aspen-Pitkin Co/Sardy Field,ACT,0
554,Tallahassee Regional,BRLYRGOA,0
555,Elmira/Corning Regional,CP IADA EINL,0
556,Akiachak,TMAIT,0
557,Bush Field,L RSEMN,0
558,Yakima Air Terminal,S EESUGCERAE NL,0
559,Southwest Florida Intl,"BTNRUEMTOOIA,RA",0
560,Ontario Intl,SNJS NL,0
561,Tompkins County,SRST/RDNO NL,0
562,Lambert-St Louis Intl,SNJS NL,0
563,Greater Peoria Regional,KEHU,0
564,Newark Intl,ALNI IYITL,0
565,Sitka,MMOHLKS,0
566,Atlantic City Intll,PL PIG EINL,0
567,Akiachak,DBQERGOA,0
568,Columbus Metropolitan,SRST/RDNO NL,0
569,Waterloo Muni,BBLHA/OO,0
570,Decatur,WL OESWRD,0
571,Natrona County Intl,KAOEKN NL,0
572,Lake Charles Regional,SL AECT NL,0
573,Portland Intl Jetport,BLIGA NL,0
574,Michiana Rgnl Transportation C,PCTLORGOA,0
575,Gallatin Field,M LE ILRIT,0
576,Piedmont Triad Intll,MREIA,0
577,Fanning Field,LBOKIT,0
578,New Orleans Intl/Moisant Fld/,RPDCT EINL,0
579,Unalaska,HLN EINL,0
580,Arcata,TICTE EINLT/A,0
581,Bishop Intll,BLIOEWSIGO NL,0
582,Lanai,WLIMPHBY,0
583,Natrona County Intl,YM CSYM NL,0
584,Palm Beach Intl,BR ONY,0
585,Mbs Intll,LMETS OI NL,0
586,Rogue Valley Intl- M,SNFACSOIT,0
587,Kongiganak,QIC UIBLWNFED,0
588,Will Rogers World,M LE ILRIT,0
589,Helena Regional,AEADRHMLO,0
590,Eastern Oregon Regional At Pen,GETFLSIT,0
591,Bethel,CEEADHPISIT,0
592,Charlottesville-Albemarle,DSMIE NL,0
593,Greater Rockford,MDADITL,0
594,Sitka,HNSIL NLCR  OE ,0
595,Bismarck Muni,PRU NVRIY,0
596,Louisville Intl,ESENOEO EINLA E,0
597,Jacksonville Intl,AA A,0
598,Will Rogers World,DLA OEFED,0
599,Kahului,PRLN NL,0
600,Will Rogers World,LN SADMCATU,0
601,Akron-Canton Regional,RFE ENNE,0
602,Lawton Muni,BALYIT,0
603,Molokai,EK,0
604,Muskegon County,CIAOMDA,0
605,Long Beach /Daugherty Field/,RGEVLE NL ,0
606,Dannelly Field,WS IIN,0
607,Norfolk Intl,NPSIK,0
608,Sonoma County,EGNOMRAD OTS,0
609,Billings Logan Intl,BS IL,0
610,Eppley Airfield,CLMI EINL,0
611,The William B Hartsfield Atlan,BLIGA NL,0
612,Unalaska,BNO NL,0
613,Gregg County,TEWLIMBHRSIL TA,0
614,Kalamazoo/Battle Creek Interna,SNJS NL,0
615,San Francisco Intl,AA A,0
616,Bradley Intl,DTOTCT,0
617,Akiachak,WLE-AR/CATNIT,0
618,Palm Beach Intl,GA NL,0
619,Yeager,FYTEIL EINLGANS,0
620,Savannah Intll,KN AMN,0
621,Billings Logan Intl,TLKA,0
622,Bismarck Muni,HL NL,0
623,Great Falls Intl,UIEST FILNI-ILR,0
624,North Bend Muni,SNM ONY,0
625,Kwethluk,CDRRPD UI,0
626,Greater Buffalo Intl,JEFS IL,0
627,Monterey Peninsula,BBLHA/OO,0
628,Keahole-Kona Intll,JHSO TL,0
629,Stapleton Intl,OTGMECUT,0
630,Cyril E King,DAHRE,0
631,University Of Illinois-Willard,EK,0
632,Fanning Field,MNEPLSS ALIT/OD,0
633,Lihue,DTOTMTOOIA AN O,0
634,Greater Rochester Intl,TEDNWHVN,0
635,Joplin Regional,YMAVLE,0
636,Mahlon Sweet Field,EK,0
637,Lehigh Valley Intll,MRUTECUT,0
638,Myrtle Beach Intl,MDSOCT-ONY-AR H,0
639,Jefferson County,WSIGO ULSIT,0
640,Gustavus,NWOLASIT/OSN L/,0
641,Yakima Air Terminal,JC CNMR IL,0
642,Lake Tahoe,ESEWO IL,0
643,Panama City-Bay Co Intl,JC CNMR IL,0
644,Waco Regional,UAAK,0
645,Chicago O'hare Intl,TEDR RNI RE TT,0
646,Long Beach /Daugherty Field/,LNONMN,0
647,Tompkins County,ESEWO IL,0
648,Roanoke Regional/Woodrum Field,MHO WE IL,0
649,Great Falls Intl,PRLN NL,0
650,Lewiston-Nez Perce County,KNIAA,0
651,Newark Intl,TLAASERGOA,0
652,Quinhagak,KAOEKN NL,0
653,Adams Field,LHE,0
654,Central Wisconsin,RDIGMN,0
655,Lawton Muni,DLIGA,0
656,Melbourne Intll,SNDEOIT-IDEG L,0
657,Yakima Air Terminal,GATCUT,0
658,Unalaska,GENRE ALY,0
659,Roberts Field,OLNOIT,0
660,Duluth Intl,WSCETRCUT,0
661,Toledo Express,GSAU,0
662,Ralph Wien Memorial,DLIGA,0
663,Indianapolis Intl,KLMZOBTL RE NEN,0
