time,value
0,-0.74331
1,-0.62816
2,-0.47228000000000003
3,-0.21469000000000002
4,0.053997
5,0.35009
6,0.65868
7,0.9921399999999999
8,1.2195
9,1.4737
10,1.4759
11,1.44
12,1.4477
13,1.5195
14,1.5176
15,1.4055
16,1.0728
17,0.78881
18,0.44881000000000004
19,0.15242
20,-0.16208
21,-0.40931999999999996
22,-0.65405
23,-0.76803
24,-0.6973199999999999
25,-0.48113
26,-0.28934
27,-0.017928
28,0.23905
29,0.5260100000000001
30,0.8044899999999999
31,1.0956
32,1.3738
33,1.4508
34,1.4174
35,1.318
36,1.4077
37,1.3981
38,1.4577
39,1.4395
40,1.4797
41,1.4527
42,1.2049
43,0.90725
44,0.58858
45,0.29939
46,0.034291
47,-0.23301
48,-0.47791000000000006
49,-0.6882699999999999
50,-0.60558
51,-0.68703
52,-0.79103
53,-0.8880899999999999
54,-1.0285
55,-1.1848
56,-1.3261
57,-1.3937
58,-1.3031
59,-1.1846
60,-1.0382
61,-0.95047
62,-0.78854
63,-0.6691699999999999
64,-0.57067
65,-0.58016
66,-0.69095
67,-0.76917
68,-0.9018700000000001
69,-0.99571
70,-1.1126
71,-1.1708
72,-1.2649
73,-1.2822
74,-1.2626
75,-1.1438
76,-1.0358
77,-0.9144
78,-0.7862
79,-0.6541600000000001
