time,value
0,-0.69172
1,-0.6309899999999999
2,-0.43485
3,-0.15538
4,0.13295
5,0.40548
6,0.67908
7,0.97778
8,1.2013
9,1.3883
10,1.4462
11,1.4545
12,1.4715
13,1.4614
14,1.3834
15,1.1665
16,0.9331200000000001
17,0.65271
18,0.3035
19,0.094513
20,-0.23335
21,-0.47348
22,-0.64856
23,-0.6915899999999999
24,-0.8228
25,-0.63635
26,-0.4477
27,-0.18258
28,0.074379
29,0.37321
30,0.65676
31,0.97114
32,1.2281
33,1.4748
34,1.5135
35,1.5238
36,1.4953
37,1.4262
38,1.4442
39,1.5328
40,1.5729
41,1.5648
42,1.3436
43,1.0389
44,0.69828
45,0.39091
46,0.11047
47,-0.17327
48,-0.41356000000000004
49,-0.59955
50,-0.36912
51,-0.50132
52,-0.62785
53,-0.78092
54,-0.9708600000000001
55,-1.1492
56,-1.2813
57,-1.4340000000000002
58,-1.4042
59,-1.2635
60,-1.0961
61,-0.92327
62,-0.86316
63,-0.68109
64,-0.59615
65,-0.66169
66,-0.8202
67,-1.0079
68,-1.1182
69,-1.2356
70,-1.3287
71,-1.3186
72,-1.2737
73,-1.2202
74,-1.1195
75,-0.96396
76,-0.8227
77,-0.6428699999999999
78,-0.51658
79,-0.35814
