time,value
0,2.2365
1,2.0244
2,1.7631
3,1.5303
4,1.2999
5,1.1008
6,0.9061899999999999
7,0.81198
8,0.62324
9,0.5322399999999999
10,0.45776999999999995
11,0.39349
12,0.36095
13,0.29683000000000004
14,0.1776
15,0.14368
16,0.11875
17,0.14757
18,0.13852
19,0.09085
20,0.024541
21,-0.045288
22,-0.049277999999999995
23,-0.060917
24,-0.050963999999999995
25,-0.097122
26,-0.12090999999999999
27,-0.15605
28,-0.15175999999999998
29,-0.20794
30,-0.32395999999999997
31,-0.42365
32,-0.37104000000000004
33,-0.27513000000000004
34,-0.3583
35,-0.35589
36,-0.36630999999999997
37,-0.40836999999999996
38,-0.45708999999999994
39,-0.48385
40,-0.60782
41,-0.71317
42,-0.8643299999999999
43,-0.99974
44,-1.1063
45,-1.4024
46,-1.6117
47,-1.7752
48,-1.8841
49,-1.8112
50,-1.5485
51,-1.2859
52,-1.0495
53,-0.78675
54,-0.52403
55,-0.26122
56,-0.024781
57,0.23793000000000003
58,0.50064
59,0.76358
60,1.0
61,1.2627
62,1.5257
63,1.7889
64,2.0264
65,2.1034
66,1.8419
67,1.5787
68,1.3423
69,1.0796
70,0.81699
71,0.5543399999999999
72,0.31795999999999996
73,0.055327999999999995
74,-0.20646
75,-0.469
76,-0.70527
77,-0.96647
78,-1.2271
79,-1.4892
80,-1.7225
81,-1.8268
82,-1.8375
83,-1.93
84,-1.8172
85,-1.6904
86,-1.5218
87,-1.3733
88,-1.1740000000000002
89,-1.0014
90,-0.8755700000000001
91,-0.75527
92,-0.6311
93,-0.5074
94,-0.42778
95,-0.35329
96,-0.34176
97,-0.28296
98,-0.2342
99,-0.27399999999999997
100,-0.24213
101,-0.14657
102,-0.081615
103,-0.024869
104,0.0381
105,0.055327999999999995
106,0.062234000000000005
107,0.07549299999999999
108,0.12292
109,0.19291
110,0.22186999999999998
111,0.22999
112,0.27994
113,0.25788
114,0.32315
115,0.34906
116,0.36929
117,0.42405
118,0.53988
119,0.6101300000000001
120,0.71341
121,0.80537
122,0.96755
123,1.2212
124,1.479
125,1.6843
126,1.9476
127,2.211
