time,value
0,2.0533
1,1.9122
2,1.7428
3,1.5408
4,1.3728
5,1.1725
6,1.0087
7,0.85413
8,0.77168
9,0.6307
10,0.49843999999999994
11,0.43178999999999995
12,0.317
13,0.20181
14,0.051753999999999994
15,-0.046012
16,-0.16254000000000002
17,-0.28367
18,-0.38576
19,-0.48656000000000005
20,-0.57157
21,-0.69522
22,-0.7625
23,-0.8666299999999999
24,-0.9401200000000001
25,-1.022
26,-1.09
27,-1.1609
28,-1.2017
29,-1.2498
30,-1.26
31,-1.2495
32,-1.2276
33,-1.2241
34,-1.2045
35,-1.2009999999999998
36,-1.1903
37,-1.1247
38,-1.0592
39,-0.9979
40,-0.91264
41,-0.8544299999999999
42,-0.77764
43,-0.69445
44,-0.5987100000000001
45,-0.5172800000000001
46,-0.42076
47,-0.33986
48,-0.20407
49,-0.10586
50,0.016845
51,0.16297
52,0.27415
53,0.42571000000000003
54,0.55319
55,0.7078399999999999
56,0.81335
57,0.96295
58,1.1358
59,1.3423
60,1.5491
61,1.7232
62,1.9214
63,2.0414
64,1.9587
65,1.7899
66,1.5878
67,1.4191
68,1.2151
69,1.01
70,0.8401200000000001
71,0.87344
72,0.847
73,0.7309
74,0.58721
75,0.45888999999999996
76,0.32665
77,0.16990999999999998
78,0.022379
79,-0.096951
80,-0.23949
81,-0.34345
82,-0.44978
83,-0.5712
84,-0.67384
85,-0.7625
86,-0.83665
87,-0.9226
88,-0.97446
89,-1.0328
90,-1.0885
91,-1.117
92,-1.1168
93,-1.1767
94,-1.1557
95,-1.1797
96,-1.2269
97,-1.1924
98,-1.1758
99,-1.1168
100,-1.0715
101,-1.0224
102,-0.9508200000000001
103,-0.8961100000000001
104,-0.81597
105,-0.73769
106,-0.69426
107,-0.61862
108,-0.50593
109,-0.45738
110,-0.37643000000000004
111,-0.26109
112,-0.15525999999999998
113,-0.067213
114,0.074237
115,0.16327
116,0.24950999999999998
117,0.34798
118,0.49899
119,0.65822
120,0.7921199999999999
121,0.95978
122,1.1151
123,1.3052
124,1.4638
125,1.6629
126,1.8288
127,2.0225
