time,value
0,1.7043
1,1.0848
2,0.4361
3,-0.06841
4,-0.36155
5,-0.43858
6,-0.33960999999999997
7,-0.20335999999999999
8,-0.12325
9,-0.11997000000000001
10,-0.16745
11,-0.24486
12,-0.30558
13,-0.3463
14,-0.33621
15,-0.28581999999999996
16,-0.24084
17,-0.17682
18,-0.10425999999999999
19,-0.029037999999999998
20,0.10445
21,0.26875
22,0.40935
23,0.50448
24,0.46835
25,0.30064
26,0.016501
27,-0.29101
28,-0.54818
29,-0.6882199999999999
30,-0.64635
31,-0.45358000000000004
32,-0.16067
33,0.11599999999999999
34,0.30855
35,0.36775
36,0.27709
37,0.096216
38,-0.089189
39,-0.23176999999999998
40,-0.29391999999999996
41,-0.24975
42,-0.1117
43,0.036951
44,0.15842
45,0.20425
46,0.15329
47,0.009129700000000001
48,-0.20052
49,-0.45321999999999996
50,-0.66352
51,-0.77699
52,-0.7457
53,-0.5492100000000001
54,-0.17613
55,0.31421
56,0.8271
57,1.3173
58,1.6713
59,1.8506
60,1.8364
61,1.6444
62,1.328
63,0.9329799999999999
64,0.5112800000000001
65,0.0923
66,-0.30674
67,-0.70021
68,-1.0704
69,-1.4091
70,-1.7044
71,-1.8939
72,-1.923
73,-1.7971
74,-1.554
75,-1.2164
76,-0.85029
77,-0.54645
78,-0.32656999999999997
79,-0.20289000000000001
80,-0.14520999999999998
81,-0.07596900000000001
82,0.041397
83,0.27471
84,0.64062
85,1.1329
86,1.6471
87,2.0866
88,2.3646
89,2.4357
90,2.2482
91,1.8472
92,1.2428
93,0.54447
94,-0.14165
95,-0.7205600000000001
96,-1.1332
97,-1.3519999999999999
98,-1.3979
99,-1.3130000000000002
100,-1.1353
101,-0.90751
102,-0.67362
103,-0.44683999999999996
104,-0.24289000000000002
105,-0.036681
106,0.16025
107,0.33541
108,0.47316
109,0.54604
110,0.4907
111,0.29366
112,0.013118000000000001
113,-0.33245
114,-0.6531600000000001
115,-0.89186
116,-1.0315
117,-1.0411
118,-0.92971
119,-0.73014
120,-0.48844
121,-0.2605
122,-0.11167
123,-0.068327
124,-0.13822
125,-0.22471999999999998
126,-0.25841
127,-0.11678
128,0.23165999999999998
129,0.7951600000000001
130,1.5347
131,2.2774
132,2.9006
133,3.2205
134,3.1222
135,2.5867
136,1.6909
137,0.61442
138,-0.44317
139,-1.3471
140,-1.9484
141,-2.1837
142,-2.1706
143,-1.9999
144,-1.7859
145,-1.6282
146,-1.5768
147,-1.5888
148,-1.6218
149,-1.5884
150,-1.4243
151,-1.0791
152,-0.61771
153,-0.06547599999999999
154,0.4898
155,0.99989
156,1.3961
157,1.6907
158,1.8321
159,1.867
160,1.7738
161,1.5751
162,1.3034
163,0.9687
164,0.61516
165,0.26695
166,-0.057551
167,-0.33147
168,-0.55087
169,-0.7389399999999999
170,-0.86892
171,-0.92899
172,-0.90499
173,-0.81255
174,-0.63093
175,-0.36930999999999997
176,-0.086729
177,0.1569
178,0.29486
179,0.30104000000000003
180,0.13042
181,-0.14196
182,-0.48921000000000003
183,-0.76727
184,-0.90143
185,-0.82555
186,-0.58643
187,-0.21584
188,0.19685999999999998
189,0.5341600000000001
190,0.65159
191,0.5505
192,0.24445
193,-0.17335
194,-0.57798
195,-0.8346899999999999
196,-0.86198
197,-0.64975
198,-0.25311999999999996
199,0.21995
200,0.68917
201,1.0384
202,1.2502
203,1.3364
204,1.3305
205,1.2609
206,1.1518
207,1.0317
208,0.88156
209,0.68677
210,0.41586999999999996
211,0.11342999999999999
212,-0.20963
213,-0.5422399999999999
214,-0.8738299999999999
215,-1.1799
216,-1.4763
217,-1.7356
218,-1.9289
219,-2.0596
220,-2.0648
221,-1.9259
222,-1.6186
223,-1.1489
224,-0.57609
225,0.039037999999999996
226,0.56415
227,0.98639
228,1.2834
229,1.4762
230,1.6184
231,1.7543
232,1.8939
233,1.9680000000000002
234,1.9296
235,1.6897
236,1.2521
237,0.6160399999999999
238,-0.12355999999999999
239,-0.84099
240,-1.3885
241,-1.6997
242,-1.776
243,-1.5961
244,-1.2865
245,-0.9408200000000001
246,-0.65532
247,-0.44001
248,-0.29764
249,-0.19415
250,-0.061834
251,0.13815
252,0.39429000000000003
253,0.70843
254,0.99759
255,1.2022
256,1.2181
257,0.99916
258,0.55915
259,-0.0018882000000000003
260,-0.63271
261,-1.1587
262,-1.4980000000000002
263,-1.5985
264,-1.4421
265,-1.0965
266,-0.64489
267,-0.17092000000000002
268,0.25429
269,0.60773
270,0.8974200000000001
271,1.0832
272,1.2161
273,1.2519
274,1.1825
275,0.97125
276,0.63089
277,0.21247
278,-0.23078
279,-0.59133
280,-0.8434299999999999
281,-0.90655
282,-0.8675799999999999
283,-0.7485
284,-0.65366
285,-0.57423
286,-0.5273
287,-0.47972
288,-0.35504
289,-0.14328
290,0.14232999999999998
291,0.50048
292,0.8236
293,1.0217
294,1.0393
295,0.89012
296,0.6320600000000001
297,0.32472
298,0.07471799999999999
299,-0.043207999999999996
300,-0.024029
301,0.021689
302,0.047654
303,-0.056109000000000006
304,-0.28258
305,-0.58924
306,-0.8753799999999999
307,-1.0367
308,-1.0381
309,-0.83393
310,-0.48049
311,-0.039048
312,0.38311999999999996
313,0.6997899999999999
314,0.88415
315,0.9637399999999999
316,0.93581
317,0.79814
318,0.56952
319,0.22439
320,-0.18262
321,-0.6096699999999999
322,-0.99536
323,-1.2693
324,-1.3732
325,-1.2873
326,-1.0784
327,-0.75303
328,-0.43196999999999997
329,-0.16343
330,0.039944
331,0.19221
332,0.34209
333,0.51467
334,0.76681
335,1.0555
336,1.3281
337,1.4861
338,1.4927
339,1.3209
340,1.0089
341,0.61355
342,0.23251999999999998
343,-0.11292
344,-0.39474000000000004
345,-0.63383
346,-0.8799600000000001
347,-1.1329
348,-1.4113
349,-1.6764
350,-1.8441
351,-1.8383
352,-1.5926
353,-1.1225
354,-0.49161000000000005
355,0.22121999999999997
356,0.89238
357,1.4013
358,1.6966
359,1.7275
360,1.4868
361,1.0689
362,0.5339
363,0.044917
364,-0.36498
365,-0.61615
366,-0.6904899999999999
367,-0.6288199999999999
368,-0.44623999999999997
369,-0.20274
370,0.049717000000000004
371,0.2324
372,0.38345
373,0.46142
374,0.48823999999999995
375,0.45125
376,0.35841999999999996
377,0.21711999999999998
378,0.05608099999999999
379,-0.098927
380,-0.20426
381,-0.21033000000000002
382,-0.12596
383,0.057382
384,0.29076
385,0.54091
386,0.67943
387,0.67469
388,0.5615600000000001
389,0.3846
390,0.18427000000000002
391,0.0015549000000000001
392,-0.15685
393,-0.29858
394,-0.46585
395,-0.61638
396,-0.777
397,-0.9069
398,-0.94325
399,-0.84311
400,-0.61942
401,-0.3496
402,-0.081688
403,0.13248
404,0.25645999999999997
405,0.26321
406,0.1963
407,0.14427
408,0.15404
409,0.25751999999999997
410,0.41563
411,0.55509
412,0.59234
413,0.46358999999999995
414,0.14951
415,-0.25346
416,-0.6278600000000001
417,-0.84205
418,-0.8134100000000001
419,-0.50529
420,-0.0014517999999999998
421,0.5506800000000001
422,0.99446
423,1.2314
424,1.2163
425,0.95773
426,0.58608
427,0.23494
428,-0.026666000000000002
429,-0.12434
430,-0.11260999999999999
431,-0.041128
432,0.013594
433,-0.030008999999999997
434,-0.17528
435,-0.45181000000000004
436,-0.81097
437,-1.1466
438,-1.4105
439,-1.5346
440,-1.4782
441,-1.2255
442,-0.78167
443,-0.24241999999999997
444,0.34046
445,0.87554
446,1.3021
447,1.5729
448,1.6892
449,1.6442
450,1.4792
451,1.2304
452,0.8528399999999999
453,0.37994
454,-0.15529
455,-0.71621
456,-1.2531
457,-1.6880000000000002
458,-1.9173
459,-1.8985
460,-1.6586
461,-1.1879
462,-0.59955
463,0.046145
464,0.6251899999999999
465,1.0981
466,1.4180000000000001
467,1.61
468,1.69
469,1.6227
470,1.4293
471,1.0967
472,0.68435
473,0.22315
474,-0.24991
475,-0.69245
476,-1.0608
477,-1.3330000000000002
478,-1.4909999999999999
479,-1.5489
480,-1.5026
481,-1.375
482,-1.151
483,-0.81739
484,-0.38783
485,0.10662999999999999
486,0.63037
487,1.1355
488,1.544
489,1.7969
490,1.8158
491,1.6421
492,1.3346
493,0.94814
494,0.5435800000000001
495,0.17757
496,-0.18048
497,-0.52785
498,-0.8714299999999999
499,-1.1754
