time,value
0,0.29736999999999997
1,0.29736999999999997
2,0.29736999999999997
3,0.29736999999999997
4,0.29736999999999997
5,0.29736999999999997
6,0.29736999999999997
7,0.29736999999999997
8,0.29736999999999997
9,0.29736999999999997
10,0.29736999999999997
11,0.29736999999999997
12,0.29736999999999997
13,0.29736999999999997
14,0.29736999999999997
15,0.29736999999999997
16,0.29736999999999997
17,0.31089
18,0.34515999999999997
19,0.4042
20,0.45147
21,0.47375
22,0.47675
23,0.47675
24,0.47675
25,0.47675
26,0.47675
27,0.47675
28,0.47675
29,0.47675
30,0.47675
31,0.47712
32,0.49228999999999995
33,0.5421
34,0.59192
35,0.64173
36,0.69155
37,0.74136
38,0.7911699999999999
39,0.84099
40,0.8908
41,0.9406200000000001
42,0.9904299999999999
43,1.0402
44,1.0901
45,1.1399
46,1.1855
47,1.2282
48,1.2656
49,1.2981
50,1.3275
51,1.3524
52,1.3718
53,1.3879
54,1.4004
55,1.4007
56,1.3937
57,1.3813
58,1.3754
59,1.3736
60,1.3736
61,1.3665
62,1.3549
63,1.3427
64,1.3378
65,1.3375
66,1.3348
67,1.3192
68,1.2945
69,1.2721
70,1.2553
71,1.2426
72,1.2265
73,1.2057
74,1.1806
75,1.1509
76,1.1173
77,1.0798
78,1.0365
79,0.9899700000000001
80,0.94016
81,0.8903399999999999
82,0.8405299999999999
83,0.79072
84,0.7409
85,0.69109
86,0.64127
87,0.58254
88,0.52199
89,0.45973
90,0.39746
91,0.33519
92,0.27292
93,0.2213
94,0.17115
95,0.12168
96,0.083036
97,0.045676
98,0.0083152
99,-0.029044999999999998
100,-0.06640599999999999
101,-0.10377
102,-0.14113
103,-0.17718
104,-0.21076999999999999
105,-0.2371
106,-0.26200999999999997
107,-0.28691
108,-0.31182
109,-0.33673000000000003
110,-0.36163
111,-0.38654
112,-0.41145
113,-0.43636
114,-0.46126000000000006
115,-0.48617
116,-0.51108
117,-0.53598
118,-0.56089
119,-0.5858
120,-0.6107100000000001
121,-0.6380600000000001
122,-0.6736
123,-0.71045
124,-0.7478100000000001
125,-0.78517
126,-0.82221
127,-0.8568100000000001
128,-0.88171
129,-0.90771
130,-0.9361
131,-0.97346
132,-1.0090000000000001
133,-1.0421
134,-1.067
135,-1.0919
136,-1.1168
137,-1.1418
138,-1.1667
139,-1.1916
140,-1.2165
141,-1.2339
142,-1.2453
143,-1.2453
144,-1.2496
145,-1.2573
146,-1.2697
147,-1.2774
148,-1.2811
149,-1.2811
150,-1.2811
151,-1.2811
152,-1.2811
153,-1.2811
154,-1.2811
155,-1.2811
156,-1.2872
157,-1.2991
158,-1.3115
159,-1.324
160,-1.3364
161,-1.3472
162,-1.3529
163,-1.3529
164,-1.3529
165,-1.3529
166,-1.3529
167,-1.3529
168,-1.3529
169,-1.3529
170,-1.3576
171,-1.3658
172,-1.3783
173,-1.385
174,-1.3888
175,-1.3888
176,-1.3888
177,-1.3888
178,-1.3888
179,-1.3739
180,-1.354
181,-1.3291
182,-1.3124
183,-1.2982
184,-1.2857
185,-1.2733
186,-1.2608
187,-1.2483
188,-1.2456
189,-1.2453
190,-1.2453
191,-1.2453
192,-1.2453
193,-1.2453
194,-1.2453
195,-1.2453
196,-1.2453
197,-1.2453
198,-1.2463
199,-1.2504
200,-1.2606
201,-1.2719
202,-1.2791
203,-1.2811
204,-1.2786
205,-1.2658
206,-1.2446
207,-1.2197
208,-1.1948
209,-1.1699
210,-1.1449
211,-1.12
212,-1.0951
213,-1.0716
214,-1.0566
215,-1.0432
216,-1.0293
217,-1.0059
218,-0.98157
219,-0.95794
220,-0.94515
221,-0.9316
222,-0.91553
223,-0.8781700000000001
224,-0.8408100000000001
225,-0.80345
226,-0.7660899999999999
227,-0.72873
228,-0.6913699999999999
229,-0.6540100000000001
230,-0.61892
231,-0.58603
232,-0.56112
233,-0.5362100000000001
234,-0.51131
235,-0.4864
236,-0.46148999999999996
237,-0.43658
238,-0.41168000000000005
239,-0.38677
240,-0.36186
241,-0.33696
242,-0.29581
243,-0.23571
244,-0.16169
245,-0.11335
246,-0.09826900000000001
247,-0.097254
248,-0.064433
249,0.013144999999999999
250,0.099489
251,0.18666
252,0.27384000000000003
253,0.36265
254,0.46053
255,0.5726100000000001
256,0.68289
257,0.7891199999999999
258,0.88875
259,0.98564
260,1.0789
261,1.166
262,1.2423
263,1.3085
264,1.3583
265,1.3947
266,1.4216
267,1.4341
268,1.4412
269,1.4454
270,1.4454
271,1.4454
272,1.4454
273,1.4454
274,1.4454
275,1.4454
276,1.4454
277,1.4379
278,1.4273
279,1.4149
280,1.4105
281,1.4095
282,1.4095
283,1.4008
284,1.3887
285,1.3773
286,1.3736
287,1.3733
288,1.3711
289,1.3621
290,1.3486
291,1.3295
292,1.2987
293,1.2595
294,1.2088
295,1.1431
296,1.0696
297,1.0061
298,0.9509
299,0.90044
300,0.84388
301,0.78398
302,0.72231
303,0.66793
304,0.6161399999999999
305,0.5663199999999999
306,0.51651
307,0.4667
308,0.41727
309,0.37763
310,0.33919
311,0.30183000000000004
312,0.26447
313,0.22710999999999998
314,0.18975
