time,value
0,-0.30086
1,-0.30086
2,-0.30086
3,-0.30086
4,-0.30086
5,-0.30086
6,-0.30086
7,-0.30086
8,-0.30086
9,-0.32485
10,-0.35557
11,-0.39305
12,-0.40984
13,-0.40984
14,-0.40984
15,-0.40984
16,-0.40984
17,-0.40984
18,-0.40984
19,-0.40984
20,-0.40984
21,-0.40984
22,-0.40984
23,-0.40984
24,-0.40984
25,-0.41505
26,-0.42616000000000004
27,-0.45982
28,-0.49388000000000004
29,-0.5112300000000001
30,-0.51883
31,-0.51883
32,-0.51883
33,-0.51883
34,-0.51883
35,-0.51883
36,-0.5187
37,-0.5128
38,-0.5018199999999999
39,-0.48273
40,-0.47171
41,-0.46434
42,-0.46434
43,-0.46434
44,-0.46434
45,-0.46551000000000003
46,-0.47058
47,-0.48967
48,-0.5016
49,-0.5082
50,-0.49071000000000004
51,-0.47162
52,-0.45253000000000004
53,-0.43343999999999994
54,-0.41436000000000006
55,-0.39526999999999995
56,-0.37549
57,-0.35466
58,-0.32064000000000004
59,-0.28329
60,-0.2517
61,-0.22624
62,-0.20715
63,-0.17828
64,-0.14606
65,-0.10787999999999999
66,-0.30249000000000004
67,-0.20240999999999998
68,0.25559
69,0.1087
70,0.16596
71,0.22323
72,0.2805
73,0.33776999999999996
74,0.39024000000000003
75,0.43571000000000004
76,0.47556000000000004
77,0.51374
78,0.55192
79,0.5901
80,0.6282800000000001
81,0.66646
82,0.70463
83,0.7428100000000001
84,0.78099
85,0.81917
86,0.8457100000000001
87,0.8695
88,0.88859
89,0.93106
90,0.98424
91,1.0387
92,1.0864
93,1.1246
94,1.1568
95,1.1857
96,1.2048
97,1.2175
98,1.2241
99,1.2249
100,1.2249
101,1.2249
102,1.2249
103,1.2249
104,1.2249
105,1.2249
106,1.2249
107,1.2249
108,1.2257
109,1.2386
110,1.2541
111,1.2732
112,1.2922
113,1.3113
114,1.3304
115,1.3495
116,1.3686
117,1.3877
118,1.4068
119,1.4259
120,1.445
121,1.464
122,1.4831
123,1.5022
124,1.5213
125,1.5404
126,1.5595
127,1.5786
128,1.5939
129,1.6043
130,1.6064
131,1.6064
132,1.6064
133,1.6064
134,1.6064
135,1.5899
136,1.5713
137,1.5522
138,1.5331
139,1.514
140,1.4949
141,1.4758
142,1.4568
143,1.4277
144,1.3943
145,1.3561
146,1.3263
147,1.3069
148,1.2877
149,1.2686
150,1.2496
151,1.2305
152,1.2114
153,1.1923
154,1.1693
155,1.136
156,1.0996
157,1.0614
158,1.0042
159,0.9486700000000001
160,0.8962600000000001
161,0.8542299999999999
162,0.81605
163,0.77787
164,0.73969
165,0.7015100000000001
166,0.66333
167,0.62522
168,0.58739
169,0.5599
170,0.54081
171,0.51695
172,0.48875
173,0.45056999999999997
174,0.41239
175,0.37421
176,0.33603
177,0.30345
178,0.2802
179,0.259
180,0.23469
181,0.17742
182,0.12275
183,0.35364
184,0.15145999999999998
185,-0.049737
186,-0.29269
187,-0.1117
188,-0.16897
189,-0.21208000000000002
190,-0.25296
191,-0.29114
192,-0.32932
193,-0.3675
194,-0.40568000000000004
195,-0.44386000000000003
196,-0.48203999999999997
197,-0.50408
198,-0.51883
199,-0.51883
200,-0.5263100000000001
201,-0.54193
202,-0.56048
203,-0.57957
204,-0.5986600000000001
205,-0.61417
206,-0.6270100000000001
207,-0.6278100000000001
208,-0.63117
209,-0.64227
210,-0.6587
211,-0.67829
212,-0.71334
213,-0.74964
214,-0.78781
215,-0.82599
216,-0.865
217,-0.9097700000000001
218,-0.9606600000000001
219,-1.0179
220,-1.0654
221,-1.1096
222,-1.1477
223,-1.1764
224,-1.1983
225,-1.2155
226,-1.2272
227,-1.2272
228,-1.2272
229,-1.2272
230,-1.2272
231,-1.232
232,-1.2438
233,-1.2612
234,-1.2803
235,-1.2994
236,-1.3185
237,-1.3376
238,-1.3567
239,-1.3741
240,-1.3859
241,-1.3907
242,-1.3907
243,-1.3907
244,-1.3907
245,-1.3907
246,-1.4141
247,-1.4485
248,-1.4894
249,-1.5372
250,-1.5944
251,-1.6517
252,-1.709
253,-1.7662
254,-1.8171
255,-1.8619
256,-1.9009
257,-1.9266
258,-1.9127
259,-1.8938
260,-1.8716
261,-1.8339
262,-1.7931
263,-1.7469
264,-1.693
265,-1.6349
266,-1.5648
267,-1.492
268,-1.4157
269,-1.3533
270,-1.2933
271,-1.2256
272,-1.1335
273,-1.0190000000000001
274,-0.9486899999999999
275,-0.9002700000000001
276,-0.9002700000000001
277,-0.87595
278,-0.8363799999999999
279,-0.7794800000000001
280,-0.72842
281,-0.6892
282,-0.65072
283,-0.61254
284,-0.57436
285,-0.53998
286,-0.51048
287,-0.48933000000000004
288,-0.46571999999999997
289,-0.41956000000000004
290,-0.3675
291,-0.31023
292,-0.25296
293,-0.19460999999999998
294,-0.13318
295,-0.31363
296,0.068163
297,0.10815999999999999
298,0.2097
299,0.32423
300,0.44875
301,0.5776
302,0.71123
303,0.83646
304,0.95134
305,1.0623
306,1.1697
307,1.2652
308,1.3555
309,1.4416
310,1.5189
311,1.5875
312,1.6354
313,1.6772
314,1.7153
315,-1.5691
316,-1.5691
317,-1.5691
318,-1.5691
319,-1.5691
320,-1.5691
321,-1.5691
322,-1.5691
323,-1.5691
324,-1.5691
325,-1.5691
326,-1.5691
327,-1.5691
328,-1.5691
329,-1.5691
330,-1.5691
331,-1.5691
332,-1.5691
333,-1.5691
334,-1.5691
335,-1.5691
336,-1.5691
337,-1.5691
338,-1.5691
339,-1.5691
340,-1.5691
341,-1.5691
342,-1.5691
343,-1.5691
344,-1.5691
345,-1.5691
346,-1.5691
347,-1.4902
348,-1.3998
349,-1.2964
350,-1.226
351,-1.1728
352,-1.1196
353,-1.0665
354,-1.0133
355,-0.9601700000000001
356,-0.90701
357,-0.8538600000000001
358,-0.8423799999999999
359,-0.87621
360,-0.9230799999999999
361,-0.9621
362,-0.9621
363,-0.9621
364,-0.9621
365,-0.9621
366,-0.95276
367,-0.9218299999999999
368,-0.8760899999999999
369,-0.8229299999999999
370,-0.76977
371,-0.71662
372,-0.66346
373,-0.6103
374,-0.55485
375,-0.48333000000000004
376,-0.39478
377,-0.28846
378,-0.18215
379,-0.38074
380,0.15082
381,0.11029000000000001
382,0.17118
383,0.22474
384,0.2779
385,0.33105
386,0.38421
387,0.43736
388,0.49051999999999996
389,0.54368
390,0.59683
391,0.64999
392,0.70315
393,0.7563
394,0.80608
395,0.8524700000000001
396,0.85875
397,0.85875
398,0.85875
399,0.85875
400,0.85875
401,0.85875
402,0.85875
403,0.85875
404,0.85875
405,0.85915
406,0.8668899999999999
407,0.89354
408,0.9467
409,0.98325
410,1.0105
411,1.0105
412,1.0105
413,1.0105
414,1.0105
415,1.0105
416,1.0105
417,1.0105
418,1.0105
419,1.0105
420,1.0179
421,1.0401
422,1.0839
423,1.1349
424,1.1523
425,1.1622
426,1.1622
427,1.1622
428,1.1622
429,1.1622
430,1.1622
431,1.1622
432,1.1622
433,1.1622
434,1.1622
435,1.1848
436,1.2215
437,1.2743
438,1.2929
439,1.2456
440,1.2092
441,1.1835
442,1.2366
443,1.2687
444,1.2735
445,1.2318
446,1.1849
447,1.1695
448,1.1622
449,1.1622
450,1.1163
451,1.0676
452,1.0261
453,1.0105
454,1.0105
455,0.98562
456,0.95057
457,0.89741
458,0.8720399999999999
459,0.85875
460,0.85875
461,0.85875
462,0.85875
463,0.84854
464,0.8287899999999999
465,0.77563
466,0.72248
467,0.66932
468,0.61616
469,0.56301
470,0.50985
471,0.45669
472,0.40354
473,0.40354
474,0.3986
475,0.38506999999999997
476,0.34265
477,0.29203
478,0.26593
479,0.2518
480,0.2518
481,0.2184
482,0.17563
483,0.12344000000000001
484,0.49876000000000004
485,0.49876000000000004
486,0.43231
487,0.30546
488,0.26232
489,-0.1356
490,-0.25993
491,-0.25993
492,-0.33785
493,-0.10882
494,-0.16039
495,-0.22080999999999998
496,-0.32711999999999997
497,-0.41894
498,-0.49433
499,-0.50689
500,-0.51263
501,-0.54162
502,-0.58421
503,-0.63736
504,-0.69052
505,-0.74283
506,-0.79309
507,-0.81037
508,-0.81071
509,-0.82714
510,-0.85772
511,-0.9108799999999999
512,-0.94157
513,-0.9621
514,-0.9621
515,-0.94126
516,-0.8977700000000001
517,-0.84939
518,-0.81037
519,-0.81037
520,-0.8004
521,-0.7829999999999999
522,-0.7320800000000001
523,-0.6882699999999999
524,-0.66604
525,-0.65863
526,-0.65863
527,-0.65863
528,-0.66054
529,-0.66537
530,-0.70695
531,-0.7601100000000001
532,-0.81326
533,-0.8664200000000001
534,-0.91958
535,-0.9454899999999999
536,-0.9621
537,-0.9621
538,-0.9886
539,-1.034
540,-1.0813
541,-1.1138
542,-1.1138
543,-1.1008
544,-1.08
545,-1.0269
546,-0.9737
547,-0.9205399999999999
548,-0.86739
549,-0.8205100000000001
550,-0.81375
551,-0.80698
552,-0.8002199999999999
553,-0.75334
554,-0.70019
555,-0.64703
556,-0.59387
557,-0.54072
558,-0.42272
559,-0.28943
560,-0.12996
561,-0.10072
562,-0.13189
563,-0.18505
564,-0.23820999999999998
565,-0.29136
566,-0.34452
567,-0.39768000000000003
568,-0.45083
569,-0.48623
570,-0.50459
571,-0.50689
572,-0.50689
573,-0.50689
574,-0.50163
575,-0.49294
576,-0.44117
577,-0.3806
578,-0.30522
579,-0.20825
580,-0.10192999999999999
581,0.13346
582,0.11069000000000001
583,0.21700999999999998
584,0.32332
585,0.42812
586,0.52477
587,0.59877
588,0.6519199999999999
589,0.6845399999999999
590,0.70701
591,0.70701
592,0.70701
593,0.70701
594,0.70701
595,0.6897399999999999
596,0.63948
597,0.5796399999999999
598,0.51275
599,0.40644
600,0.33184
601,0.29801
602,0.33395
603,0.38083
604,0.39629000000000003
605,0.40354
606,0.40354
607,0.40354
608,0.4126
609,0.44738999999999995
610,0.56011
611,0.71958
612,0.87905
613,1.0385
614,1.198
615,1.3297
616,1.4493
617,1.5556
618,1.6619
619,1.7682
620,1.8847
621,2.0108
622,2.1703
623,2.3015
624,2.4087
625,2.467
626,2.5094
627,2.5229
628,2.5279
629,2.5279
630,-0.15879000000000001
631,-0.15879000000000001
632,-0.15879000000000001
633,-0.15879000000000001
634,-0.15879000000000001
635,-0.15879000000000001
636,-0.15879000000000001
637,-0.15879000000000001
638,-0.15879000000000001
639,-0.14912999999999998
640,-0.13676
641,-0.12165999999999999
642,-0.1149
643,-0.1149
644,-0.1149
645,-0.1149
646,-0.1149
647,-0.1149
648,-0.1149
649,-0.1149
650,-0.1149
651,-0.1149
652,-0.1149
653,-0.1149
654,-0.1149
655,-0.1149
656,-0.1149
657,-0.1149
658,-0.1149
659,-0.1149
660,-0.1149
661,-0.1149
662,-0.46201000000000003
663,-0.33249
664,-0.18713
665,-0.13716
666,-0.13468
667,-0.10802
668,0.20529
669,0.11824000000000001
670,0.18212
671,0.24013
672,0.28625
673,0.33238
674,0.3785
675,0.42368999999999996
676,0.46571999999999997
677,0.49646999999999997
678,0.52722
679,0.55797
680,0.58872
681,0.6167699999999999
682,0.63858
683,0.6561
684,0.67147
685,0.68685
686,0.70222
687,0.7176
688,0.73297
689,0.74835
690,0.76372
691,0.7791
692,0.79447
693,0.8177300000000001
694,0.84367
695,0.8744200000000001
696,0.89751
697,0.91512
698,0.9322
699,0.9535399999999999
700,0.98429
701,1.0113
702,1.036
703,1.0514
704,1.0706
705,1.0955
706,1.1249
707,1.1611
708,1.2321
709,1.3031
710,1.3741
711,1.4103
712,1.4424
713,1.479
714,1.5213
715,1.5674
716,1.5948
717,1.6177
718,1.6331
719,1.6297
720,1.6173
721,1.5997
722,1.5766
723,1.5459
724,1.5055
725,1.4598
726,1.3983
727,1.3419
728,1.2905
729,1.2437
730,1.1976
731,1.1515
732,1.1023
733,1.0511
734,0.97506
735,0.9024700000000001
736,0.83845
737,0.78692
738,0.73951
739,0.67269
740,0.60158
741,0.52471
742,0.45912
743,0.39711
744,0.33841
745,0.28625
746,0.24013
747,0.18805999999999998
748,0.13305999999999998
749,0.35625
750,0.10514000000000001
751,-0.34452
752,-0.14537
753,-0.21225
754,-0.26006
755,-0.30885
756,-0.35895
757,-0.42045
758,-0.47583000000000003
759,-0.52335
760,-0.55743
761,-0.58818
762,-0.61892
763,-0.64968
764,-0.68043
765,-0.71118
766,-0.74193
767,-0.77268
768,-0.80343
769,-0.8341799999999999
770,-0.86493
771,-0.8956799999999999
772,-0.92643
773,-0.94914
774,-0.96836
775,-0.98374
776,-1.0059
777,-1.0363
778,-1.0641
779,-1.0891
780,-1.1045
781,-1.124
782,-1.1469
783,-1.1769
784,-1.2046
785,-1.2238
786,-1.2406
787,-1.256
788,-1.2714
789,-1.2868
790,-1.3021
791,-1.3175
792,-1.3329
793,-1.3483
794,-1.3636
795,-1.379
796,-1.3944
797,-1.4097
798,-1.4248
799,-1.4316
800,-1.4316
801,-1.4354
802,-1.4428
803,-1.4581
804,-1.4683
805,-1.4755
806,-1.4755
807,-1.48
808,-1.492
809,-1.5061
810,-1.5194
811,-1.5194
812,-1.5173
813,-1.5128
814,-1.4992
815,-1.4838
816,-1.4685
817,-1.4531
818,-1.4377
819,-1.4338
820,-1.4313
821,-1.4305
822,-1.4201
823,-1.4048
824,-1.3942
825,-1.3877
826,-1.3877
827,-1.3877
828,-1.3877
829,-1.3877
830,-1.3877
831,-1.3877
832,-1.3867
833,-1.3827
834,-1.3673
835,-1.3548
836,-1.3444
837,-1.3438
838,-1.3411
839,-1.3321
840,-1.3189
841,-1.3035
842,-1.2882
843,-1.2722
844,-1.2555
845,-1.2281
846,-1.1973
847,-1.1666
848,-1.1358
849,-1.1051
850,-1.0743
851,-1.0436
852,-1.0128
853,-0.98972
854,-0.97211
855,-0.95662
856,-0.94124
857,-0.9258700000000001
858,-0.9104899999999999
859,-0.89512
860,-0.87974
861,-0.86051
862,-0.8356299999999999
863,-0.8062199999999999
864,-0.77366
865,-0.72949
866,-0.6853199999999999
867,-0.64115
868,-0.60858
869,-0.57649
870,-0.53987
871,-0.4976
872,-0.45148
873,-0.37722
874,-0.29633000000000004
875,-0.20407
876,-0.12124000000000001
877,-0.21427
878,0.19247999999999998
879,0.1311
880,0.23873000000000003
881,0.34155
882,0.44168
883,0.53393
884,0.62105
885,0.70324
886,0.78077
887,0.85095
888,0.8998700000000001
889,0.9440700000000001
890,0.98516
891,1.0013
892,1.0189
893,1.0407
894,1.0687
895,1.0988
896,1.1192
897,1.1375
898,1.1529
899,1.1682
900,1.1836
901,1.199
902,1.2144
903,1.2297
904,1.2392
905,1.2457
906,1.2457
907,1.2326
908,1.2114
909,1.1808
910,1.1601
911,1.1584
912,1.1557
913,1.1517
914,1.1364
915,1.1271
916,1.1257
917,1.1378
918,1.1513
919,1.1558
920,1.1579
921,1.1579
922,1.1579
923,1.1588
924,1.1621
925,1.173
926,1.1884
927,1.1893
928,1.1844
929,1.1691
930,1.1457
931,1.1187
932,1.088
933,1.0572
934,1.0265
935,0.9898399999999999
936,0.9476600000000001
937,0.8861600000000001
938,0.82875
939,0.7748
940,0.7279399999999999
941,0.68802
942,0.66482
943,0.64659
944,0.63122
