time,value
0,-1.0642
1,-1.0642
2,-1.0642
3,-1.0642
4,-1.0642
5,-1.0642
6,-1.0642
7,-1.0642
8,-1.0642
9,-1.0642
10,-1.0642
11,-1.0642
12,-1.0642
13,-1.0642
14,-1.0642
15,-1.0642
16,-1.0642
17,-1.0642
18,-1.0642
19,-1.0642
20,-1.0642
21,-1.0642
22,-1.0642
23,-1.0642
24,-1.0642
25,-1.0642
26,-1.0642
27,-1.0642
28,-1.0642
29,-1.0642
30,-1.0642
31,-1.0642
32,-1.0642
33,-1.0642
34,-1.0642
35,-1.0642
36,-1.0642
37,-1.0642
38,-1.0642
39,-1.0642
40,-1.0642
41,-1.0642
42,-1.0642
43,-1.0642
44,-1.0642
45,-1.0642
46,-1.0642
47,-1.0642
48,-1.0642
49,-1.0642
50,-1.0642
51,-1.0642
52,-1.07
53,-1.0916
54,-1.1328
55,-1.1740000000000002
56,-1.2141
57,-1.2501
58,-1.2707
59,-1.2913
60,-1.3117
61,-1.3318
62,-1.3337
63,-1.3337
64,-1.3337
65,-1.3337
66,-1.3273
67,-1.3174
68,-1.3071
69,-1.2968
70,-1.2899
71,-1.2888
72,-1.2888
73,-1.2888
74,-1.2888
75,-1.2888
76,-1.2888
77,-1.2888
78,-1.2888
79,-1.2888
80,-1.2888
81,-1.2888
82,-1.2888
83,-1.2888
84,-1.2888
85,-1.2888
86,-1.2888
87,-1.2867
88,-1.2804
89,-1.2704
90,-1.2601
91,-1.2491
92,-1.2276
93,-1.2001
94,-1.1692
95,-1.1383
96,-1.1074
97,-1.0765
98,-1.0456
99,-1.0147
100,-0.9927799999999999
101,-0.9814799999999999
102,-0.9917799999999999
103,-1.0021
104,-1.0114
105,-1.0183
106,-1.0192
107,-1.0192
108,-1.0192
109,-1.0137
110,-0.9992200000000001
111,-0.97862
112,-0.9580200000000001
113,-0.93894
114,-0.92312
115,-0.9128200000000001
116,-0.9025200000000001
117,-0.8922200000000001
118,-0.88192
119,-0.8716200000000001
120,-0.8613200000000001
121,-0.8507600000000001
122,-0.83931
123,-0.81211
124,-0.7812100000000001
125,-0.75031
126,-0.71941
127,-0.6773899999999999
128,-0.6261399999999999
129,-0.57465
130,-0.52315
131,-0.46626999999999996
132,-0.39589
133,-0.32402
134,-0.25192
135,-0.17962999999999998
136,-0.49803000000000003
137,-0.089173
138,0.32281
139,0.14776
140,0.23016
141,0.31256
142,0.39495
143,0.47735
144,0.5524899999999999
145,0.61983
146,0.6816300000000001
147,0.74343
148,0.79903
149,0.8345100000000001
150,0.85787
151,0.8784700000000001
152,0.89907
153,0.86831
154,0.81409
155,0.742
156,0.6699
157,0.60512
158,0.5463
159,0.4948
160,0.44331000000000004
161,0.40373000000000003
162,0.37979
163,0.39009
164,0.40039
165,0.41483000000000003
166,0.44745
167,0.51025
168,0.58235
169,0.65445
170,0.72932
171,0.80809
172,0.8904799999999999
173,0.97288
174,1.0538
175,1.1320000000000001
176,1.2041
177,1.2761
178,1.3476
179,1.4181
180,1.4801
181,1.5419
182,1.6033
183,1.6616
184,1.693
185,1.7136
186,1.7342
187,1.7543
188,1.7559
189,1.7353
190,1.7147
191,1.6941
192,1.6717
193,1.6414
194,1.6106
195,1.5797
196,1.5488
197,1.5179
198,1.4869999999999999
199,1.4561
200,1.4252
201,1.4109
202,1.4063
203,1.4063
204,1.4063
205,1.4063
206,1.4063
207,1.4063
208,1.4063
209,1.4063
210,1.4063
211,1.4063
212,1.4063
213,1.4063
214,1.3955
215,1.3794
216,1.3588
217,1.3382
218,1.3176
219,1.297
220,1.2764
221,1.2558
222,1.2352
223,1.2146
224,1.194
225,1.1734
226,1.1525
227,1.1279
228,1.0991
229,1.0682
230,1.0373
231,1.0009
232,0.9577200000000001
233,0.90622
234,0.85472
235,0.8032199999999999
236,0.7517199999999999
237,0.70023
238,0.64873
239,0.59892
240,0.5529999999999999
241,0.52942
242,0.5088199999999999
243,0.48827
244,0.46881999999999996
245,0.45503999999999994
246,0.44473999999999997
247,0.43443999999999994
248,0.4248
249,0.42241999999999996
250,0.43272
251,0.44301999999999997
252,0.45332
253,0.46362
254,0.47392
255,0.48422
256,0.49451999999999996
257,0.5048199999999999
258,0.50738
259,0.5079600000000001
260,0.5079600000000001
261,0.5079600000000001
262,0.5079600000000001
263,0.5079600000000001
264,0.5079600000000001
265,0.5079600000000001
266,0.50554
267,0.49768
268,0.48765
269,0.47735
270,0.46673000000000003
271,0.44928
272,0.42986
273,0.40926
274,0.38866
275,0.3731
276,0.36034
277,0.35004
278,0.33974
279,0.32944
280,0.31914000000000003
281,0.30884
282,0.29854
283,0.29081999999999997
284,0.29053
285,0.29911
286,0.30941
287,0.31971
288,0.33000999999999997
289,0.34031
290,0.35061
291,0.36091
292,0.37383
293,0.3898
294,0.4104
295,0.431
296,0.45026000000000005
297,0.46762
298,0.47791999999999996
299,0.48822
300,0.49896999999999997
301,0.51142
302,0.53028
303,0.55088
304,0.57148
305,0.59343
306,0.62012
307,0.6510199999999999
308,0.68191
309,0.71233
310,0.7399899999999999
311,0.76059
312,0.7811899999999999
313,0.80179
314,0.82239
315,-0.14684
316,-0.14684
317,-0.14684
318,-0.14684
319,-0.14684
320,-0.14684
321,-0.14684
322,-0.14684
323,-0.14684
324,-0.14684
325,-0.14684
326,-0.14684
327,-0.14684
328,-0.14684
329,-0.14684
330,-0.14684
331,-0.14684
332,-0.14684
333,-0.14684
334,-0.14684
335,-0.14684
336,-0.14684
337,-0.14684
338,-0.14684
339,-0.14684
340,-0.14684
341,-0.14684
342,-0.14684
343,-0.14684
344,-0.14684
345,-0.14684
346,-0.14684
347,-0.14684
348,-0.14684
349,-0.14684
350,-0.14684
351,-0.14684
352,-0.14684
353,-0.14684
354,-0.14684
355,-0.14684
356,-0.14684
357,-0.14684
358,-0.14684
359,-0.14684
360,-0.14684
361,-0.14684
362,-0.14684
363,-0.14684
364,-0.14684
365,-0.14684
366,-0.14684
367,-0.14684
368,-0.14684
369,-0.14684
370,-0.14684
371,-0.14457
372,-0.13468
373,-0.47846000000000005
374,-0.27951
375,-0.082348
376,0.11108
377,0.12946
378,0.12946
379,0.12946
380,0.12946
381,0.12946
382,0.12946
383,0.12946
384,0.12946
385,0.12946
386,0.12946
387,0.12946
388,0.12946
389,0.11027999999999999
390,-0.052752
391,-0.24081999999999998
392,-0.43978
393,-0.12695
394,-0.14122
395,-0.14684
396,-0.14684
397,-0.14684
398,-0.16289
399,-0.19216
400,-0.23195
401,-0.27174
402,-0.3035
403,-0.31898000000000004
404,-0.32038
405,-0.32038
406,-0.32038
407,-0.32038
408,-0.32038
409,-0.32038
410,-0.32038
411,-0.32038
412,-0.32038
413,-0.32038
414,-0.32038
415,-0.33778
416,-0.37564000000000003
417,-0.45523
418,-0.53481
419,-0.6106699999999999
420,-0.67699
421,-0.72051
422,-0.7603
423,-0.7999
424,-0.82919
425,-0.84099
426,-0.84099
427,-0.84099
428,-0.84099
429,-0.84099
430,-0.84099
431,-0.84099
432,-0.84099
433,-0.84099
434,-0.84099
435,-0.84099
436,-0.8404799999999999
437,-0.8382700000000001
438,-0.80562
439,-0.76582
440,-0.7260300000000001
441,-0.68624
442,-0.62497
443,-0.54586
444,-0.46628000000000003
445,-0.3867
446,-0.30711
447,-0.22753
448,-0.14795
449,-0.34583
450,0.055904999999999996
451,0.12528
452,0.24223000000000003
453,0.36161
454,0.48098
455,0.60036
456,0.71973
457,0.83911
458,0.95849
459,1.0498
460,1.111
461,1.1508
462,1.1906
463,1.2184
464,1.2074
465,1.1729
466,1.1331
467,1.0933
468,0.9212799999999999
469,0.68879
470,0.41023999999999994
471,0.1317
472,-0.45553
473,-0.26621999999999996
474,-0.38559
475,-0.50497
476,-0.57829
477,-0.59118
478,-0.47181000000000006
479,-0.35243
480,-0.22505999999999998
481,-0.31689
482,0.15822999999999998
483,0.39698
484,0.63573
485,0.86377
486,1.0768
487,1.2757
488,1.4747
489,1.6736
490,1.8726
491,2.0715
492,2.2705
493,2.4646
494,2.6514
495,2.7723
496,2.8917
497,3.0097
498,3.1192
499,3.1503
500,3.1503
501,3.1503
502,3.1479
503,3.0564
504,2.8574
505,2.6585
506,2.4595
507,2.2748
508,2.151
509,2.0307
510,1.9113
511,1.7919
512,1.6725
513,1.5532
514,1.4338
515,1.3144
516,1.2590000000000001
517,1.2414
518,1.2414
519,1.2414
520,1.2297
521,1.2004
522,1.1608
523,1.121
524,1.0849
525,1.0716
526,1.0679
527,1.0679
528,1.0679
529,1.0679
530,1.0679
531,1.0679
532,1.0679
533,1.0421
534,0.99275
535,0.91317
536,0.8335799999999999
537,0.76044
538,0.69909
539,0.65784
540,0.6180399999999999
541,0.57545
542,0.50471
543,0.4014
544,0.28203
545,0.16265
546,0.15974000000000002
547,-0.11037000000000001
548,-0.26953
549,-0.4287
550,-0.5766100000000001
551,-0.70724
552,-0.78682
553,-0.86641
554,-0.94599
555,-1.0256
556,-1.1052
557,-1.1847
558,-1.2638
559,-1.3301
560,-1.3306
561,-1.2909
562,-1.2511
563,-1.2113
564,-1.1715
565,-1.1317
566,-1.0919
567,-1.0521
568,-1.0123
569,-0.97252
570,-0.93273
571,-0.89294
572,-0.85315
573,-0.81335
574,-0.77356
575,-0.73377
576,-0.69398
577,-0.6920000000000001
578,-0.72051
579,-0.7603
580,-0.80009
581,-0.83988
582,-0.8796700000000001
583,-0.91946
584,-0.95926
585,-0.99905
586,-1.0388
587,-1.0786
588,-1.1184
589,-1.1582
590,-1.1785
591,-1.1881
592,-1.1881
593,-1.1881
594,-1.1996
595,-1.2234
596,-1.2632
597,-1.3030000000000002
598,-1.3328
599,-1.3339
600,-1.3008
601,-1.261
602,-1.2212
603,-1.1814
604,-1.1416
605,-1.1018
606,-1.0621
607,-1.0324
608,-1.0145
609,-1.0145
610,-1.0145
611,-1.0093
612,-0.99684
613,-0.95705
614,-0.91725
615,-0.87746
616,-0.83767
617,-0.79788
618,-0.7580899999999999
619,-0.71829
620,-0.67328
621,-0.60997
622,-0.5303899999999999
623,-0.45081000000000004
624,-0.36556
625,-0.24853000000000003
626,-0.25187
627,0.14939000000000002
628,0.34834
629,0.5473
630,1.1233
631,1.1233
632,1.1233
633,1.1233
634,1.1233
635,1.1233
636,1.1233
637,1.1233
638,1.1233
639,1.1233
640,1.1233
641,1.1233
642,1.1233
643,1.1233
644,1.1233
645,1.1233
646,1.1233
647,1.1233
648,1.1233
649,1.1233
650,1.1233
651,1.1233
652,1.1233
653,1.1233
654,1.1233
655,1.1233
656,1.1233
657,1.1233
658,1.1233
659,1.1233
660,1.1233
661,1.1233
662,1.1233
663,1.1233
664,1.1233
665,1.1233
666,1.1233
667,1.1233
668,1.1233
669,1.1233
670,1.1233
671,1.1233
672,1.1233
673,1.1233
674,1.1233
675,1.1233
676,1.1233
677,1.1233
678,1.1233
679,1.1233
680,1.1233
681,1.1233
682,1.1305
683,1.1572
684,1.208
685,1.2587
686,1.3066
687,1.3448
688,1.3448
689,1.3448
690,1.3448
691,1.3448
692,1.3448
693,1.3448
694,1.3448
695,1.3448
696,1.3135
697,1.2644
698,1.2136
699,1.1628
700,1.1292
701,1.1235
702,1.1233
703,1.1233
704,1.1233
705,1.1233
706,1.1233
707,1.1233
708,1.1233
709,1.0907
710,1.0471
711,0.99635
712,0.94557
713,0.91527
714,0.9018299999999999
715,0.9018299999999999
716,0.9018299999999999
717,0.9018299999999999
718,0.9018299999999999
719,0.9018299999999999
720,0.9018299999999999
721,0.9018299999999999
722,0.9018299999999999
723,0.9018299999999999
724,0.9018299999999999
725,0.9018299999999999
726,0.8825200000000001
727,0.8482200000000001
728,0.7974399999999999
729,0.74665
730,0.70697
731,0.68035
732,0.68035
733,0.68035
734,0.6756
735,0.65867
736,0.61263
737,0.56184
738,0.51081
739,0.44663
740,0.36011
741,0.25853000000000004
742,0.15696
743,0.31024
744,-0.07975800000000001
745,-0.33369
746,-0.11672
747,-0.16438
748,-0.2056
749,-0.2056
750,-0.2056
751,-0.20625
752,-0.20906999999999998
753,-0.25074
754,-0.30153
755,-0.35231999999999997
756,-0.4031
757,-0.42646999999999996
758,-0.42708999999999997
759,-0.42708999999999997
760,-0.42708999999999997
761,-0.42708999999999997
762,-0.42708999999999997
763,-0.42708999999999997
764,-0.42708999999999997
765,-0.42708999999999997
766,-0.42708999999999997
767,-0.42708999999999997
768,-0.42708999999999997
769,-0.42708999999999997
770,-0.42708999999999997
771,-0.42708999999999997
772,-0.42708999999999997
773,-0.42708999999999997
774,-0.44498999999999994
775,-0.48211000000000004
776,-0.53289
777,-0.58368
778,-0.63447
779,-0.68525
780,-0.7360399999999999
781,-0.78683
782,-0.8376100000000001
783,-0.8321299999999999
784,-0.80093
785,-0.75015
786,-0.69936
787,-0.7026899999999999
788,-0.75015
789,-0.85172
790,-0.95329
791,-1.0549
792,-1.1564
793,-1.258
794,-1.3596
795,-1.4544
796,-1.5192
797,-1.5345
798,-1.5345
799,-1.5345
800,-1.4935
801,-1.3949
802,-1.2425
803,-1.0901
804,-0.9526899999999999
805,-0.8418399999999999
806,-0.79106
807,-0.74027
808,-0.69257
809,-0.64955
810,-0.64857
811,-0.64857
812,-0.64972
813,-0.6581899999999999
814,-0.73322
815,-0.8347899999999999
816,-0.9363600000000001
817,-1.0379
818,-1.1395
819,-1.2411
820,-1.3427
821,-1.4442
822,-1.5458
823,-1.6474
824,-1.749
825,-1.8505
826,-1.9521
827,-2.0125
828,-2.0664
829,-2.1172
830,-2.1679
831,-2.1099
832,-1.9874
833,-1.835
834,-1.6826
835,-1.4851
836,-1.2206
837,-0.91661
838,-0.6118899999999999
839,-0.31192
840,-0.20931
841,0.21761999999999998
842,0.47156000000000003
843,0.72549
844,0.87292
845,0.96814
846,1.0189
847,1.0697
848,1.071
849,1.0274
850,0.92581
851,0.82424
852,0.71445
853,0.5896
854,0.43911000000000006
855,0.28675
856,0.13618
857,0.086476
858,-0.10826
859,-0.20983000000000002
860,-0.31140999999999996
861,-0.41298
862,-0.51455
863,-0.6161300000000001
864,-0.7177
865,-0.81927
866,-0.92085
867,-1.0224
868,-1.124
869,-1.2228
870,-1.3152
871,-1.3709
872,-1.4217
873,-1.472
874,-1.5115
875,-1.495
876,-1.4442
877,-1.3934
878,-1.3427
879,-1.2919
880,-1.2411
881,-1.1903
882,-1.1395
883,-1.0887
884,-1.0379
885,-0.98715
886,-0.9363600000000001
887,-0.8855799999999999
888,-0.8729600000000001
889,-0.8700600000000001
890,-0.8700600000000001
891,-0.8700600000000001
892,-0.8700600000000001
893,-0.8700600000000001
894,-0.8700600000000001
895,-0.8700600000000001
896,-0.8700600000000001
897,-0.8700600000000001
898,-0.8700600000000001
899,-0.8700600000000001
900,-0.8700600000000001
901,-0.8700600000000001
902,-0.8700600000000001
903,-0.8700600000000001
904,-0.8700600000000001
905,-0.8700600000000001
906,-0.8700600000000001
907,-0.8700600000000001
908,-0.8700600000000001
909,-0.8700600000000001
910,-0.8700600000000001
911,-0.8700600000000001
912,-0.8700600000000001
913,-0.86369
914,-0.8390000000000001
915,-0.79247
916,-0.74168
917,-0.6909
918,-0.6190399999999999
919,-0.5300699999999999
920,-0.4285
921,-0.32692
922,-0.22535
923,-0.12378
924,-0.11503
925,0.39284
926,0.18094000000000002
927,0.28252
928,0.38409
929,0.48566000000000004
930,0.58503
931,0.67603
932,0.73536
933,0.78615
934,0.83694
935,0.88105
936,0.9018299999999999
937,0.9018299999999999
938,0.9018299999999999
939,0.9042399999999999
940,0.92017
941,0.97096
942,1.0217
943,1.0725
944,1.1233
