time,value
0,-1.3705
1,-1.3748
2,-1.3773
3,-1.3762
4,-1.3699
5,-1.3569
6,-1.3367
7,-1.3095
8,-1.2745
9,-1.2322
10,-1.1832
11,-1.1282
12,-1.0682
13,-1.005
14,-0.93879
15,-0.8696200000000001
16,-0.7974600000000001
17,-0.72209
18,-0.6432399999999999
19,-0.56101
20,-0.47618
21,-0.38833
22,-0.29778000000000004
23,-0.20501999999999998
24,-0.11067
25,-0.015392
26,0.079433
27,0.17336
28,0.26655999999999996
29,0.3592
30,0.45171000000000006
31,0.54465
32,0.63854
33,0.73292
34,0.82895
35,0.92701
36,1.0273
37,1.1298
38,1.2342
39,1.3394
40,1.4445
41,1.5489
42,1.6517
43,1.7516
44,1.8476
45,1.9382
46,2.0211
47,2.0952
48,2.1588
49,2.2102
50,2.248
51,2.2707
52,2.2769
53,2.2653
54,2.2356
55,2.1877
56,2.122
57,2.0394
58,1.9413
59,1.8295
60,1.7062
61,1.5743
62,1.4369999999999998
63,1.2975
64,1.159
65,1.0247
66,0.897
67,0.77877
68,0.672
69,0.57818
70,0.49816000000000005
71,0.43215
72,0.37955
73,0.33936
74,0.31040999999999996
75,0.29109
76,0.27965999999999996
77,0.27434000000000003
78,0.2734
79,0.27482
80,0.27778
81,0.28131999999999996
82,0.28481
83,0.28784
84,0.29026
85,0.29178000000000004
86,0.29236
87,0.29262
88,0.29261
89,0.2923
90,0.29148
91,0.28986999999999996
92,0.28625
93,0.281
94,0.27386
95,0.26431
96,0.25187
97,0.23613
98,0.21653000000000003
99,0.19247
100,0.16527
101,0.13505999999999999
102,0.10197
103,0.06617200000000001
104,0.027839999999999997
105,-0.013797
106,-0.057562
107,-0.1025
108,-0.14845
109,-0.19534
110,-0.24305
111,-0.29147
112,-0.34171
113,-0.39088
114,-0.43843000000000004
115,-0.48391000000000006
116,-0.52691
117,-0.56703
118,-0.6048100000000001
119,-0.63936
120,-0.669
121,-0.6937
122,-0.71377
123,-0.72968
124,-0.7420399999999999
125,-0.7530100000000001
126,-0.7611
127,-0.76667
128,-0.77046
129,-0.7732
130,-0.77559
131,-0.77862
132,-0.78293
133,-0.7873100000000001
134,-0.79181
135,-0.79645
136,-0.80119
137,-0.80599
138,-0.81165
139,-0.81718
140,-0.8219200000000001
141,-0.82573
142,-0.8285600000000001
143,-0.83044
144,-0.83168
145,-0.83344
146,-0.8343799999999999
147,-0.8345600000000001
148,-0.83411
149,-0.8332
150,-0.83201
151,-0.83168
152,-0.83215
153,-0.8325100000000001
154,-0.8327399999999999
155,-0.8328899999999999
156,-0.83304
157,-0.8333799999999999
158,-0.8362799999999999
159,-0.8398700000000001
160,-0.84404
161,-0.84875
162,-0.85396
163,-0.85962
164,-0.86661
165,-0.8756799999999999
166,-0.8849299999999999
167,-0.8939600000000001
168,-0.9023700000000001
169,-0.90984
170,-0.91622
171,-0.9235
172,-0.9305100000000001
173,-0.9366200000000001
174,-0.9417700000000001
175,-0.9459799999999999
176,-0.94932
177,-0.9524
178,-0.95699
179,-0.96135
180,-0.96526
181,-0.96845
182,-0.9706100000000001
183,-0.97152
184,-0.97219
185,-0.9723299999999999
186,-0.97104
187,-0.9680799999999999
188,-0.96324
189,-0.95634
190,-0.9472700000000001
191,-0.9371
192,-0.92466
193,-0.9098
194,-0.8923700000000001
195,-0.87226
196,-0.8494200000000001
197,-0.8241
198,-0.79637
199,-0.76598
200,-0.733
201,-0.6975399999999999
202,-0.65967
203,-0.61935
204,-0.5766899999999999
205,-0.53115
206,-0.4824
207,-0.43013
208,-0.37403000000000003
209,-0.31381
210,-0.24929
211,-0.18033
212,-0.10655999999999999
213,-0.028041000000000003
214,0.055072
215,0.14247
216,0.23374
217,0.32819
218,0.4254
219,0.52472
220,0.62526
221,0.72597
222,0.82571
223,0.92325
224,1.0172
225,1.1067
226,1.1906
227,1.2678
228,1.3376
229,1.3992
230,1.4524
231,1.4971
232,1.5338
233,1.5628
234,1.5848
235,1.6003
236,1.6099
237,1.6138
238,1.6124
239,1.6055
240,1.5928
241,1.5731
242,1.5455
243,1.5085
244,1.4606
245,1.4007
246,1.3278
247,1.2409999999999999
248,1.1402
249,1.0258
250,0.89864
251,0.7603800000000001
252,0.6130899999999999
253,0.45902
254,0.30058
255,0.14014000000000001
256,-0.020048
257,-0.17798
258,-0.33155999999999997
259,-0.47916000000000003
260,-0.61935
261,-0.7508
262,-0.8723
263,-0.9827899999999999
264,-1.081
265,-1.1659
266,-1.2369
267,-1.2935
268,-1.3362
269,-1.3658
