time,value
0,0.10839000000000001
1,0.10839000000000001
2,0.10839000000000001
3,0.10839000000000001
4,0.10839000000000001
5,0.10839000000000001
6,0.10839000000000001
7,0.10839000000000001
8,0.10839000000000001
9,0.10839000000000001
10,0.10839000000000001
11,0.10839000000000001
12,0.10839000000000001
13,0.10839000000000001
14,0.10839000000000001
15,0.10839000000000001
16,0.10839000000000001
17,0.10839000000000001
18,0.10839000000000001
19,0.10839000000000001
20,0.10839000000000001
21,0.10839000000000001
22,0.10839000000000001
23,0.10839000000000001
24,0.10839000000000001
25,0.10839000000000001
26,0.10839000000000001
27,0.10839000000000001
28,0.10839000000000001
29,0.10839000000000001
30,0.10839000000000001
31,0.10839000000000001
32,0.10839000000000001
33,0.10839000000000001
34,0.10839000000000001
35,0.10839000000000001
36,0.10839000000000001
37,0.098855
38,-0.063286
39,-0.22543000000000002
40,-0.38756999999999997
41,-0.49058
42,-0.49058
43,-0.49058
44,-0.49058
45,-0.63555
46,-0.8517399999999999
47,-1.0679
48,-1.2841
49,-1.4475
50,-1.6097
51,-1.7718
52,-1.9187
53,-2.0268
54,-2.1349
55,-2.2430000000000003
56,-2.2557
57,-2.2016
58,-2.1476
59,-2.0936
60,-2.0395
61,-1.9855
62,-1.9314
63,-1.8774
64,-1.8233
65,-1.7693
66,-1.7152
67,-1.6612
68,-1.6071
69,-1.5531
70,-1.499
71,-1.4889
72,-1.4889
73,-1.4889
74,-1.4825
75,-1.4285
76,-1.3744
77,-1.3204
78,-1.3121
79,-1.3661
80,-1.4202
81,-1.4742
82,-1.4889
83,-1.4889
84,-1.4889
85,-1.485
86,-1.3769
87,-1.2689
88,-1.1608
89,-1.0342
90,-0.8720899999999999
91,-0.70994
92,-0.5478
93,-0.35069
94,-0.1345
95,0.081687
96,0.29788000000000003
97,0.46256
98,0.6247
99,0.78684
100,0.935
101,1.0431
102,1.1512
103,1.2593
104,1.3063
105,1.3063
106,1.3063
107,1.3063
108,1.2593
109,1.2052
110,1.1512
111,1.0971
112,1.0431
113,0.9890399999999999
114,0.935
115,0.90702
116,0.90702
117,0.90702
118,0.90702
119,0.8218200000000001
120,0.71372
121,0.60563
122,0.49753000000000003
123,0.38944
124,0.28134000000000003
125,0.17325
126,0.021918
127,-0.19427
128,-0.41046000000000005
129,-0.62665
130,-0.8428399999999999
131,-1.0590000000000002
132,-1.2752
133,-1.4901
134,-1.5982
135,-1.7063
136,-1.8144
137,-1.9053
138,-1.9594
139,-2.0134
140,-2.0675
141,-2.1215
142,-2.1756
143,-2.2296
144,-2.2837
145,-2.187
146,-2.0789
147,-1.9708
148,-1.8755
149,-1.8214
150,-1.7674
151,-1.7133
152,-1.5715
153,-1.3553
154,-1.1391
155,-0.92295
156,-0.75255
157,-0.5904
158,-0.42826000000000003
159,-0.28265
160,-0.22860999999999998
161,-0.17456
162,-0.12050999999999999
163,-0.041667
164,0.066427
165,0.17452
166,0.28262
167,0.34938
168,0.40343
169,0.45747
170,0.51152
171,0.56557
172,0.61962
173,0.67366
174,0.7277100000000001
175,0.78176
176,0.8358
177,0.88985
178,0.9439
179,0.99795
180,1.052
181,1.1059999999999999
182,1.0533
183,0.9992200000000001
184,0.9451700000000001
185,0.90702
186,0.90702
187,0.90702
188,0.90702
189,0.84216
190,0.73407
191,0.62597
192,0.51788
193,0.45875
194,0.4047
195,0.35065
196,0.28515999999999997
197,0.17706
198,0.06897
199,-0.039124
200,-0.063286
201,-0.009239
202,0.044808
203,0.098855
204,0.19741
205,0.30551
206,0.4136
207,0.5147
208,0.56875
209,0.62279
210,0.67684
211,0.70736
212,0.70736
213,0.70736
214,0.70736
215,0.70736
216,0.70736
217,0.70736
218,0.70991
219,0.76395
220,0.818
221,0.87205
222,0.92609
223,0.98014
224,1.0342
225,1.0882
226,1.0711
227,1.0170000000000001
228,0.9629700000000001
229,0.9089299999999999
230,0.90702
231,0.90702
232,0.90702
233,0.89239
234,0.83835
235,0.7843
236,0.73025
237,0.6762100000000001
238,0.62216
239,0.56811
240,0.5140600000000001
241,0.5553899999999999
242,0.60944
243,0.6634899999999999
244,0.70736
245,0.70736
246,0.70736
247,0.70736
248,0.73407
249,0.7881199999999999
250,0.84216
251,0.8962100000000001
252,0.90702
253,0.90702
254,0.90702
255,0.91274
256,0.9667899999999999
257,1.0208
258,1.0749
259,1.1289
260,1.183
261,1.237
262,1.2911
263,1.3063
264,1.3063
265,1.3063
266,1.3051
267,1.251
268,1.197
269,1.1429
270,1.0889
271,1.0348
272,0.9807799999999999
273,0.9267299999999999
274,0.8726799999999999
275,0.8186399999999999
276,0.76459
277,0.71054
278,0.65649
279,0.60245
280,0.5484
281,0.50771
282,0.50771
283,0.50771
284,0.50771
285,0.47781999999999997
286,0.42377
287,0.36973
288,0.31568
289,0.30805
290,0.30805
291,0.30805
292,0.30805
293,0.30805
294,0.30805
295,0.30805
296,0.30805
297,0.30805
298,0.30805
299,0.30805
300,0.26608000000000004
301,0.21204
302,0.15799000000000002
303,0.10839000000000001
304,0.10839000000000001
305,0.10839000000000001
306,0.10839000000000001
307,0.08741
308,0.033363
309,-0.020684
310,-0.07473099999999999
311,-0.12878
312,-0.18283
313,-0.23686999999999997
314,-0.29091999999999996
