time,value
0,0.81965
1,0.81965
2,0.81965
3,0.81965
4,0.81965
5,0.81965
6,0.81965
7,0.81965
8,0.81965
9,0.81965
10,0.81965
11,0.81965
12,0.81965
13,0.81965
14,0.81965
15,0.81965
16,0.81965
17,0.81965
18,0.81965
19,0.81965
20,0.81965
21,0.81965
22,0.81965
23,0.81965
24,0.81965
25,0.81965
26,0.81965
27,0.81965
28,0.81965
29,0.81965
30,0.81965
31,0.81965
32,0.81965
33,0.81965
34,0.81965
35,0.81965
36,0.81965
37,0.81965
38,0.81965
39,0.81965
40,0.81965
41,0.81965
42,0.81965
43,0.81965
44,0.81965
45,0.81965
46,0.81965
47,0.81965
48,0.81965
49,0.81965
50,0.94214
51,1.1403
52,1.3659999999999999
53,1.5795
54,1.7521
55,1.7521
56,1.7521
57,1.7521
58,1.7521
59,1.7521
60,1.7521
61,1.7521
62,1.7521
63,1.7521
64,1.7521
65,1.7521
66,1.7285
67,1.5501
68,1.3245
69,1.0988
70,0.88739
71,0.828
72,0.81965
73,0.81965
74,0.78587
75,0.67711
76,0.45143
77,0.22575
78,7.2469e-05
79,-0.11277000000000001
80,-0.11277000000000001
81,-0.11277000000000001
82,-0.11277000000000001
83,0.0041555
84,0.19605999999999998
85,0.42173999999999995
86,0.63071
87,0.7376199999999999
88,0.54052
89,0.31484
90,0.089157
91,-0.089197
92,-0.11277000000000001
93,-0.11277000000000001
94,-0.11277000000000001
95,-0.11277000000000001
96,-0.11277000000000001
97,-0.11277000000000001
98,-0.11277000000000001
99,-0.11277000000000001
100,-0.11277000000000001
101,-0.11277000000000001
102,-0.11277000000000001
103,-0.11277000000000001
104,-0.11277000000000001
105,-0.11277000000000001
106,-0.11277000000000001
107,-0.11277000000000001
108,-0.11277000000000001
109,-0.11277000000000001
110,-0.11277000000000001
111,-0.11277000000000001
112,-0.11277000000000001
113,-0.11277000000000001
114,-0.11277000000000001
115,-0.11277000000000001
116,-0.11277000000000001
117,-0.11277000000000001
118,-0.11277000000000001
119,-0.11277000000000001
120,-0.11277000000000001
121,-0.11277000000000001
122,-0.11277000000000001
123,-0.11277000000000001
124,-0.11277000000000001
125,-0.11277000000000001
126,-0.11277000000000001
127,-0.11277000000000001
128,-0.16993
129,-0.32063
130,-0.5463100000000001
131,-0.77199
132,-0.96167
133,-1.0452
134,-1.0452
135,-1.0452
136,-1.0452
137,-1.0452
138,-1.0452
139,-1.0452
140,-1.0452
141,-1.0452
142,-1.0452
143,-1.0452
144,-1.0335
145,-0.9561
146,-0.73042
147,-0.50474
148,-0.27906
149,-0.15081
150,-0.11277000000000001
151,-0.11277000000000001
152,-0.11277000000000001
153,-0.11277000000000001
154,-0.11277000000000001
155,-0.11277000000000001
156,-0.11277000000000001
157,-0.11277000000000001
158,-0.11277000000000001
159,-0.11277000000000001
160,-0.11277000000000001
161,-0.11277000000000001
162,-0.11277000000000001
163,-0.11277000000000001
164,-0.11277000000000001
165,-0.11277000000000001
166,-0.11277000000000001
167,-0.11277000000000001
168,-0.11277000000000001
169,-0.11277000000000001
170,-0.11277000000000001
171,-0.11277000000000001
172,-0.11277000000000001
173,-0.10627
174,0.012506999999999999
175,0.21980999999999998
176,0.44548999999999994
177,0.65781
178,0.81965
179,0.81965
180,0.81965
181,0.81965
182,0.7361300000000001
183,0.5464600000000001
184,0.32078
185,0.095096
186,-0.055604999999999995
187,-0.11277000000000001
188,-0.11277000000000001
189,-0.11407
190,-0.12594
191,-0.32656999999999997
192,-0.55225
193,-0.77793
194,-0.97224
195,-1.0435
196,-1.0452
197,-1.0452
198,-1.0452
199,-1.0452
200,-1.0452
201,-1.0452
202,-1.0452
203,-0.9132299999999999
204,-0.6947800000000001
205,-0.4691
206,-0.24341999999999997
207,-0.26273
208,-0.43346999999999997
209,-0.65915
210,-0.8725799999999999
211,-1.0452
212,-1.0452
213,-1.0452
214,-1.0452
215,-1.112
216,-1.3065
217,-1.5322
218,-1.7579
219,-1.9117
220,-1.9776
221,-1.9776
222,-1.9776
223,-1.9776
224,-1.9776
225,-1.9776
226,-1.9776
227,-1.9776
228,-1.9776
229,-1.9776
230,-1.9776
231,-1.9776
232,-1.9776
233,-1.9776
234,-1.9776
235,-1.9776
236,-1.9776
237,-1.9776
238,-1.9776
239,-1.9776
240,-1.8607
241,-1.6688
242,-1.4431
243,-1.2258
244,-1.0595
245,-1.0452
246,-1.0452
247,-1.0452
248,-1.0452
249,-1.0452
250,-1.0452
251,-1.0452
252,-1.1111
253,-1.2649
254,-1.4906
255,-1.7163
256,-1.8796
257,-1.7875
258,-1.5619
259,-1.3362
260,-1.1105
261,-0.8848299999999999
262,-0.65915
263,-0.43346999999999997
264,-0.20779
265,0.017889
266,0.24356999999999998
267,0.46925
268,0.69493
269,0.92061
270,1.1463
271,1.3719999999999999
272,1.5976
273,1.6062
274,1.4551
275,1.2294
276,1.0038
277,0.7780699999999999
278,0.5523899999999999
279,0.32671
280,0.10103
281,-0.09959
282,-0.11147
283,-0.11277000000000001
284,-0.11277000000000001
285,-0.11277000000000001
286,-0.11277000000000001
287,-0.11277000000000001
288,-0.11277000000000001
289,-0.11277000000000001
290,-0.11277000000000001
291,-0.11277000000000001
292,-0.11277000000000001
293,-0.11277000000000001
294,-0.11277000000000001
295,-0.11277000000000001
296,-0.11277000000000001
297,-0.07602
298,0.13777999999999999
299,0.57615
300,1.0275
301,1.4555
302,1.7521
303,1.7521
304,1.7521
305,1.7521
306,1.7521
307,1.7521
308,1.7521
309,1.7521
310,1.6767
311,1.4967
312,1.271
313,1.0453
314,0.81965
