time,value
0,0.17469
1,-0.77994
2,-1.6432
3,-2.3653
4,-2.8689
5,-3.13
6,-3.1668
7,-2.9863
8,-2.6084
9,-2.0323
10,-1.2912
11,-0.41112
12,0.53838
13,1.4693
14,2.2452
15,2.7283
16,2.85
17,2.617
18,2.0554
19,1.2993
20,0.46868999999999994
21,-0.31515
22,-0.93452
23,-1.3344
24,-1.4962
25,-1.4636
26,-1.3032
27,-1.0672
28,-0.7983600000000001
29,-0.56002
30,-0.34181999999999996
31,-0.1263
32,0.084176
33,0.3039
34,0.55412
35,0.8323
36,1.1233
37,1.3695
38,1.5406
39,1.5717
40,1.3993
41,0.99623
42,0.3829
43,-0.3417
44,-1.0699
45,-1.6675
46,-2.0407
47,-2.1327
48,-1.9531
49,-1.5816
50,-1.0988
51,-0.60543
52,-0.14486
53,0.23538
54,0.5571699999999999
55,0.83681
56,1.0781
57,1.28
58,1.429
59,1.4978
60,1.4836
61,1.3933
62,1.2381
63,1.0649
64,0.8335100000000001
65,0.5454
66,0.19684000000000001
67,-0.23713
68,-0.7448600000000001
69,-1.2776
70,-1.7367
71,-2.0269
72,-2.0677
73,-1.8377
74,-1.3667
75,-0.7539600000000001
76,-0.16342
77,0.29812
78,0.56363
79,0.64537
80,0.62166
81,0.58596
82,0.62358
83,0.76517
84,0.9615799999999999
85,1.1439
86,1.2374
87,1.1778
88,0.9526
89,0.62561
90,0.275
91,-0.015872
92,-0.18723
93,-0.27166
94,-0.30227
95,-0.34715999999999997
96,-0.46898
97,-0.6734899999999999
98,-0.91779
99,-1.1193
100,-1.1847
101,-1.0733
102,-0.78035
103,-0.36991
104,0.07620700000000001
105,0.44106000000000006
106,0.64615
107,0.66993
108,0.53127
109,0.29993000000000003
110,0.066053
111,-0.10987999999999999
112,-0.20457
113,-0.22459
114,-0.17394
115,-0.08834299999999999
116,0.019712999999999998
117,0.13417
118,0.23073000000000002
119,0.33847
120,0.44378
121,0.55576
122,0.6471600000000001
123,0.7018800000000001
124,0.72411
125,0.6785100000000001
126,0.55742
127,0.37666
128,0.15156
129,-0.096352
130,-0.31354
131,-0.46421999999999997
132,-0.5414
133,-0.54456
134,-0.51846
135,-0.50581
136,-0.55378
137,-0.6562
138,-0.8063600000000001
139,-0.94326
140,-0.9826299999999999
141,-0.91312
142,-0.6939
143,-0.34999
144,0.036892
145,0.37869
146,0.61406
147,0.6955899999999999
148,0.63949
149,0.48828
150,0.3378
151,0.25451
152,0.27214
153,0.38624
154,0.55737
155,0.71015
156,0.8004899999999999
157,0.80594
158,0.74524
159,0.64742
160,0.54399
161,0.45899999999999996
162,0.41596000000000005
163,0.38373
164,0.32137
165,0.20605
166,0.02023
167,-0.2447
168,-0.5746600000000001
169,-0.9104899999999999
170,-1.1965
171,-1.3799
172,-1.4337
173,-1.3423
174,-1.1141
175,-0.79835
176,-0.44778
177,-0.1166
178,0.15331
179,0.33964
180,0.44438999999999995
181,0.45548999999999995
182,0.4246
183,0.40041
184,0.42621000000000003
185,0.5217
186,0.68092
187,0.8484200000000001
188,0.9676
189,1.0032
190,0.9295100000000001
191,0.73255
192,0.47503999999999996
193,0.20979
194,-0.024559
195,-0.19866
196,-0.32038
197,-0.40849
198,-0.48106000000000004
199,-0.53764
200,-0.58953
201,-0.6247199999999999
202,-0.6151399999999999
203,-0.55097
204,-0.41883000000000004
205,-0.23763
206,-0.043973000000000005
207,0.11850999999999999
208,0.2406
209,0.32588
210,0.36917
211,0.3689
212,0.37075
213,0.38778
214,0.40775
215,0.37539
216,0.28749
217,0.12928
218,-0.087935
219,-0.33263000000000004
220,-0.56455
221,-0.73017
222,-0.8107800000000001
223,-0.79393
224,-0.67874
225,-0.52785
226,-0.34598
227,-0.14178
228,0.058207
229,0.2492
230,0.42562
231,0.5665899999999999
232,0.6534
233,0.68084
234,0.6338199999999999
235,0.5331600000000001
236,0.38395
237,0.228
238,0.10435
239,0.029575999999999998
240,-0.013428
241,-0.047018
242,-0.043548
243,-0.018928
244,0.025036000000000003
245,0.10222
246,0.18822
247,0.27560999999999997
248,0.35688000000000003
249,0.40705
250,0.39726999999999996
251,0.31928
252,0.16990999999999998
253,-0.029187
254,-0.23331
255,-0.40612
256,-0.49181
257,-0.49936
258,-0.44181000000000004
259,-0.3739
260,-0.3476
261,-0.39753
262,-0.50795
263,-0.6695
264,-0.8166
265,-0.8884799999999999
266,-0.81971
267,-0.5911
268,-0.23315999999999998
269,0.19908
270,0.60975
271,0.9254100000000001
272,1.0873
273,1.0793
274,0.92437
275,0.68583
276,0.44481000000000004
277,0.25868
278,0.18715
279,0.22488000000000002
280,0.31499
281,0.406
282,0.44218
283,0.35525
284,0.14629
285,-0.13655
286,-0.42566000000000004
287,-0.65404
288,-0.7601600000000001
289,-0.71516
290,-0.53068
291,-0.28843
292,-0.037391
293,0.14122
294,0.21218
295,0.17731
296,0.076964
297,0.0044954999999999995
298,-0.0037722000000000003
299,0.080554
300,0.24295999999999998
301,0.43226000000000003
302,0.59362
303,0.6574800000000001
304,0.59118
305,0.373
306,0.023819999999999997
307,-0.36551999999999996
308,-0.71123
309,-0.9789899999999999
310,-1.1278
311,-1.1274
312,-0.98577
313,-0.75837
314,-0.49833999999999995
315,-0.2476
316,-0.036074
317,0.11135999999999999
318,0.20925
319,0.2629
320,0.31488
321,0.39282
322,0.50554
323,0.65367
324,0.81781
325,0.9555
326,1.0623
327,1.1091
328,1.0564
329,0.91681
330,0.72335
331,0.49231
332,0.26403000000000004
333,0.030357
334,-0.19183
335,-0.39894
336,-0.58867
337,-0.7361300000000001
338,-0.84319
339,-0.9259700000000001
340,-0.9690000000000001
341,-0.95436
342,-0.88415
343,-0.78596
344,-0.6703399999999999
345,-0.5302
346,-0.37192
347,-0.15429
348,0.10094
349,0.37988
350,0.64015
351,0.83454
352,0.93447
353,0.9189200000000001
354,0.80496
355,0.59234
356,0.34598
357,0.12252
358,-0.0094351
359,-0.033045
360,0.033179
361,0.14452
362,0.2728
363,0.35575
364,0.36107
365,0.27379000000000003
366,0.10683
367,-0.10862999999999999
368,-0.35104
369,-0.585
370,-0.78738
371,-0.9283299999999999
372,-0.99623
373,-0.98492
374,-0.87525
375,-0.66228
376,-0.36919
377,-0.055746000000000004
378,0.23656
379,0.45664
380,0.55075
381,0.54377
382,0.47043999999999997
383,0.38193
384,0.35808
385,0.44527
386,0.6343300000000001
387,0.88129
388,1.1003
389,1.2083
390,1.1527
391,0.9005200000000001
392,0.51322
393,0.07732
394,-0.34712
395,-0.6926899999999999
396,-0.9277299999999999
397,-1.0832
398,-1.2164
399,-1.3589
400,-1.5221
401,-1.6776
402,-1.7411
403,-1.6385
404,-1.3164
405,-0.782
406,-0.083616
407,0.67275
408,1.3355
409,1.8118
410,2.0807
411,2.144
412,2.0622
413,1.9299
414,1.7886
415,1.6417
416,1.4525
417,1.1673
418,0.73647
419,0.14081
420,-0.57045
421,-1.3077
422,-1.9652
423,-2.4361
424,-2.6643
425,-2.6367
426,-2.377
427,-1.9655
428,-1.4733
429,-0.9558
430,-0.43893000000000004
431,0.050327
432,0.5100899999999999
433,0.93815
434,1.3497
435,1.7103
436,2.0
437,2.1892
438,2.2565
439,2.1851
440,1.9809
441,1.6825
442,1.3113
443,0.88855
444,0.4525
445,0.016236
446,-0.41383000000000003
447,-0.82005
448,-1.2236
449,-1.5929
450,-1.9387
451,-2.2238
452,-2.4062
453,-2.4575
454,-2.3521
455,-2.0714
456,-1.5845
457,-0.92414
458,-0.16507
459,0.59539
460,1.2375
461,1.6902
462,1.9242
463,1.9137
464,1.7116
465,1.4009
466,1.0545
467,0.73238
468,0.46434
469,0.27452
470,0.12725
471,0.021054
472,-0.038747000000000004
473,-0.068104
474,-0.06679600000000001
475,-0.033127
476,0.027826999999999998
477,0.08304500000000001
478,0.10565
479,0.043501
480,-0.1328
481,-0.41366
482,-0.77863
483,-1.176
484,-1.5074
485,-1.6715
486,-1.6067
487,-1.2772
488,-0.73338
489,-0.056514999999999996
490,0.6592100000000001
491,1.3098
492,1.8
493,2.055
494,2.0407
495,1.8084
496,1.3974
497,0.8756799999999999
498,0.32642
499,-0.20326
