time,value
0,2.3139
1,2.1247
2,1.7633
3,1.4672
4,1.3125
5,1.0575
6,0.88456
7,0.77789
8,0.82165
9,0.7715
10,0.8002
11,0.60542
12,0.48423999999999995
13,0.52331
14,0.40595
15,0.50339
16,0.31445
17,0.14327
18,0.2083
19,0.40595
20,0.33894
21,0.14151
22,0.11949000000000001
23,0.20017000000000001
24,0.16405
25,0.036551
26,-0.013451
27,0.162
28,0.091472
29,0.10181
30,-0.047519
31,-0.055082000000000006
32,-0.10463
33,-0.071754
34,-0.01736
35,-0.014953999999999999
36,-0.095782
37,-0.036644
38,-0.23171999999999998
39,-0.39327
40,-0.26298
41,-0.34506
42,-0.52037
43,-0.67094
44,-0.7981199999999999
45,-0.9465
46,-1.0349
47,-1.2894
48,-1.446
49,-1.5594
50,-1.5885
51,-1.6435
52,-1.7751
53,-2.0165
54,-1.8002
55,-1.4413
56,-1.1434
57,-0.78159
58,-0.41544
59,-0.044194
60,0.26605
61,0.6381
62,0.9999600000000001
63,1.3531
64,1.6517
65,1.91
66,1.633
67,1.2883
68,0.98861
69,0.61197
70,0.23609000000000002
71,-0.13890999999999998
72,-0.45257
73,-0.82962
74,-1.202
75,-1.5682
76,-1.8713
77,-1.9209
78,-1.8193
79,-1.807
80,-1.7823
81,-1.713
82,-1.6145
83,-1.3851
84,-1.2229999999999999
85,-1.1548
86,-0.92065
87,-0.84352
88,-0.65882
89,-0.53909
90,-0.38334
91,-0.31114
92,-0.25703000000000004
93,-0.37566
94,-0.38461999999999996
95,-0.30924
96,-0.26643
97,-0.31209000000000003
98,-0.22548
99,-0.29725
100,-0.16505999999999998
101,-0.078739
102,-0.20681999999999998
103,-0.073879
104,-0.095782
105,0.056498
106,0.01983
107,0.22655
108,0.28872
109,0.39159
110,0.49228999999999995
111,0.39581
112,0.44745
113,0.61197
114,0.62287
115,0.66087
116,0.72553
117,0.7643
118,0.8780100000000001
119,0.93548
120,1.0759
121,0.97439
122,1.1759
123,1.206
124,1.4556
125,1.5881
126,1.9209
127,2.2563
