time,value
0,0.20903000000000002
1,-0.00023873
2,0.011401999999999999
3,0.52563
4,-0.15483
5,-0.38863000000000003
6,-0.29728000000000004
7,-0.14752
8,-0.22305
9,0.30132
10,0.19368
11,0.071244
12,-0.073152
13,0.42272
14,-0.49668999999999996
15,0.07555
16,-0.27810999999999997
17,0.039358
18,0.20758000000000001
19,0.22916
20,-0.18162999999999999
21,0.062311
22,0.36002
23,-0.35838000000000003
24,0.26866999999999996
25,-0.59788
26,0.021726
27,-0.063989
28,-0.077684
29,0.61569
30,0.14454
31,-0.31596
32,-0.47768
33,0.149
34,0.43085
35,-0.057586
36,-0.19292
37,0.03494
38,1.6362
39,1.6362
40,1.6362
41,1.6362
42,1.6362
43,1.6362
44,1.6362
45,1.6362
46,-1.6104
47,-1.6104
48,-1.6104
49,-1.6104
50,-1.6104
51,-1.6104
52,-1.6104
53,-1.6104
54,-0.36668
55,-0.26198
56,0.017597
57,0.23776
58,-0.045308
59,0.6944100000000001
60,-0.26114
61,0.45261
62,0.012731999999999999
63,-0.43883
64,0.36403
65,-0.29143
66,-0.26671
67,-0.60895
68,-0.12724000000000002
69,0.1221
70,0.25708000000000003
71,-0.15545
72,-0.10958
73,-0.08957000000000001
74,-0.46088
75,-0.077222
76,0.64912
77,-0.4313
78,-0.055457000000000006
79,-0.35107
80,-0.21261999999999998
81,0.5664399999999999
82,-0.010813
83,-0.6559
84,-0.084774
85,0.12451
86,0.08709
87,0.30111
88,-0.27774
89,-0.40626
90,-0.70463
91,1.6362
92,1.6362
93,1.6362
94,1.6362
95,1.6362
96,1.6362
97,1.6362
98,1.6362
99,1.6362
100,1.6362
101,1.6362
102,1.6362
103,1.6362
104,1.6362
105,1.6362
106,-1.6104
107,-1.6104
108,-1.6104
109,-1.6104
110,-1.6104
111,-1.6104
112,-1.6104
113,-1.6104
114,-1.6104
115,-1.6104
116,-1.6104
117,-1.6104
118,-1.6104
119,-1.6104
120,0.17614000000000002
121,0.030227999999999998
122,0.1575
123,0.20067000000000002
124,0.24493
125,-0.51808
126,-0.078054
127,0.45706
