time,value
0,-1.0728
1,-1.0728
2,-1.0728
3,-1.0728
4,-1.0728
5,-1.0728
6,-1.0728
7,-1.0728
8,-1.0728
9,-1.0728
10,-1.0728
11,-1.0728
12,-1.0728
13,-1.0728
14,-1.0728
15,-1.0728
16,-1.0728
17,-1.0728
18,-1.0728
19,-1.0728
20,-1.0728
21,-1.0728
22,-1.0728
23,-1.0728
24,-1.0728
25,-1.0728
26,-1.0728
27,-1.0728
28,-1.0728
29,-1.0728
30,-1.0728
31,-1.0728
32,-1.0728
33,-1.0728
34,-1.0728
35,-1.0728
36,-1.0728
37,-1.0728
38,-1.0728
39,-1.0728
40,-1.0728
41,-1.0728
42,-1.0728
43,-1.0728
44,-1.0728
45,-1.0728
46,-1.0728
47,-1.0728
48,-1.0728
49,-1.0728
50,-1.0728
51,-1.0728
52,-1.0728
53,-1.0728
54,-1.0728
55,-1.0728
56,-1.0728
57,-1.0728
58,-1.0728
59,-1.0728
60,-1.0728
61,-1.0728
62,-1.0728
63,-1.0728
64,-1.0728
65,-1.0728
66,-1.0728
67,-1.0728
68,-1.0728
69,-1.0728
70,-1.0728
71,-1.0728
72,-1.0728
73,-1.0728
74,-1.0728
75,-1.0728
76,-1.0728
77,-1.0728
78,-1.0728
79,-1.0728
80,-1.0728
81,-1.0728
82,-1.0728
83,-1.0728
84,-1.0728
85,-1.0728
86,-1.0728
87,-1.0728
88,-1.0728
89,-1.0728
90,-1.0728
91,-1.0728
92,-1.0728
93,-1.0728
94,-1.0728
95,-1.0728
96,-1.0728
97,-1.0728
98,-1.0728
99,-1.0728
100,-1.0728
101,-1.0728
102,-1.0728
103,-1.0728
104,-1.0728
105,-1.0728
106,-1.0728
107,-1.0728
108,-1.0728
109,-1.0728
110,-1.0728
111,-1.0728
112,-1.0606
113,-1.0452
114,-1.0288
115,-1.0117
116,-0.9946799999999999
117,-0.9776299999999999
118,-0.9605899999999999
119,-0.9435399999999999
120,-0.92638
121,-0.9075700000000001
122,-0.8887700000000001
123,-0.8654700000000001
124,-0.8416100000000001
125,-0.8177399999999999
126,-0.79388
127,-0.7700199999999999
128,-0.74616
129,-0.72229
130,-0.69843
131,-0.67492
132,-0.6531399999999999
133,-0.63137
134,-0.6109
135,-0.59044
136,-0.56999
137,-0.5495399999999999
138,-0.52908
139,-0.50863
140,-0.48818
141,-0.46771999999999997
142,-0.44466000000000006
143,-0.41431
144,-0.38393
145,-0.35325
146,-0.32256999999999997
147,-0.29189
148,-0.26121
149,-0.23053
150,-0.19985
151,-0.17035999999999998
152,-0.14188
153,-0.11506
154,-0.46448
155,-0.34517
156,-0.22585999999999998
157,-0.10655
158,0.073098
159,0.13208
160,0.25139
161,0.37071
162,0.49738999999999994
163,0.12735
164,0.15402000000000002
165,0.18129
166,0.20856999999999998
167,0.23584000000000002
168,0.26311
169,0.29038
170,0.31765
171,0.34563
172,0.37367
173,0.41871
174,0.46984
175,0.52098
176,0.57211
177,0.62325
178,0.67438
179,0.72551
180,0.77665
181,0.8278399999999999
182,0.8829299999999999
183,0.9380200000000001
184,0.99834
185,1.0597
186,1.1211
187,1.1824
188,1.2438
189,1.3051
190,1.3665
191,1.4279
192,1.4861
193,1.5197
194,1.5532
195,1.5777
196,1.6016
197,1.6255
198,1.6493
199,1.6732
200,1.6971
201,1.7193
202,1.7388
203,1.7501
204,1.7296
205,1.7092
206,1.6887
207,1.6682
208,1.6478
209,1.6273
210,1.6069
211,1.5864
212,1.5637
213,1.5387
214,1.5119
215,1.4812
216,1.4505
217,1.4198
218,1.3892
219,1.3585
220,1.3278
221,1.2971
222,1.2664
223,1.2422
224,1.2225
225,1.2039
226,1.1868
227,1.1698
228,1.1527
229,1.1357
230,1.1186
231,1.1016
232,1.0859999999999999
233,1.0706
234,1.061
235,1.0542
236,1.0474
237,1.0406
238,1.0337
239,1.0269
240,1.0201
241,1.0133
242,1.0065
243,0.99797
244,0.9894
245,0.9795299999999999
246,0.96931
247,0.9590799999999999
248,0.94885
249,0.93863
250,0.9284
251,0.91817
252,0.90795
253,0.8977200000000001
254,0.88749
255,0.8772700000000001
256,0.8670399999999999
257,0.8568100000000001
258,0.84659
259,0.83636
260,0.8261299999999999
261,0.81591
262,0.80619
263,0.79751
264,0.78962
265,0.7862100000000001
266,0.78281
267,0.7794
268,0.77599
269,0.77258
270,0.76917
271,0.76576
272,0.76235
273,0.75894
274,0.75553
275,0.75213
276,0.7487199999999999
277,0.74531
278,0.7419
279,0.73849
280,0.7350800000000001
281,0.7316699999999999
282,0.72826
283,0.72485
284,0.7248100000000001
285,0.72778
286,0.7309
287,0.73431
288,0.7377199999999999
289,0.7411300000000001
290,0.74454
291,0.74795
292,0.75136
293,0.75397
294,0.75639
295,0.75729
296,0.75729
297,0.75729
298,0.75729
299,0.75729
300,0.75729
301,0.75729
302,0.75729
303,0.75729
304,0.75729
305,0.75729
306,0.75729
307,0.75729
308,0.75729
309,0.75729
310,0.75729
311,0.75729
312,0.75729
313,0.75729
314,0.75729
315,-1.1609
316,-1.1609
317,-1.1609
318,-1.1609
319,-1.1609
320,-1.1609
321,-1.1609
322,-1.1609
323,-1.1609
324,-1.1609
325,-1.1609
326,-1.1609
327,-1.1609
328,-1.1609
329,-1.1609
330,-1.1609
331,-1.1609
332,-1.1609
333,-1.1609
334,-1.1609
335,-1.1609
336,-1.1609
337,-1.1609
338,-1.1609
339,-1.1609
340,-1.1609
341,-1.1609
342,-1.1609
343,-1.1609
344,-1.1609
345,-1.1609
346,-1.1609
347,-1.1609
348,-1.1609
349,-1.1609
350,-1.1609
351,-1.1609
352,-1.1609
353,-1.1609
354,-1.1609
355,-1.1609
356,-1.1609
357,-1.1609
358,-1.1609
359,-1.1609
360,-1.1609
361,-1.1609
362,-1.1609
363,-1.1609
364,-1.1609
365,-1.1609
366,-1.1609
367,-1.1609
368,-1.1609
369,-1.1609
370,-1.1609
371,-1.1609
372,-1.1609
373,-1.1609
374,-1.1609
375,-1.1609
376,-1.1609
377,-1.1609
378,-1.1609
379,-1.1609
380,-1.1609
381,-1.1609
382,-1.1609
383,-1.1609
384,-1.1609
385,-1.1609
386,-1.1609
387,-1.1609
388,-1.1609
389,-1.1609
390,-1.1609
391,-1.1609
392,-1.1609
393,-1.1609
394,-1.1609
395,-1.1609
396,-1.1609
397,-1.1609
398,-1.1609
399,-1.1609
400,-1.1609
401,-1.1609
402,-1.1609
403,-1.1609
404,-1.1609
405,-1.1609
406,-1.1609
407,-1.1609
408,-1.1609
409,-1.1609
410,-1.1609
411,-1.1609
412,-1.1609
413,-1.1609
414,-1.1609
415,-1.1609
416,-1.1609
417,-1.1609
418,-1.1609
419,-1.1609
420,-1.1609
421,-1.1609
422,-1.1609
423,-1.1609
424,-1.1609
425,-1.1609
426,-1.1609
427,-1.0972
428,-1.0168
429,-0.93109
430,-0.8420200000000001
431,-0.7529600000000001
432,-0.66389
433,-0.5748300000000001
434,-0.48576
435,-0.39728
436,-0.31656999999999996
437,-0.23586
438,-0.17651
439,-0.11984000000000002
440,-0.32427
441,-0.28455
442,0.24251
443,0.10687999999999999
444,0.16355
445,0.22023
446,0.27691
447,0.33359
448,0.39027
449,0.44695
450,0.50362
451,0.5603
452,0.61698
453,0.67366
454,0.73034
455,0.78701
456,0.8436899999999999
457,0.8921
458,0.91743
459,0.94268
460,0.9669700000000001
461,0.99126
462,1.0156
463,1.0398
464,1.0641
465,1.0884
466,1.1071
467,1.1209
468,1.1268
469,1.1187
470,1.1106
471,1.1025
472,1.0944
473,1.0863
474,1.0782
475,1.0701
476,1.062
477,1.0645
478,1.0728
479,1.0848
480,1.101
481,1.1172
482,1.1334
483,1.1495
484,1.1657
485,1.1819
486,1.1984
487,1.2148
488,1.237
489,1.2613
490,1.2856
491,1.3099
492,1.3342
493,1.3585
494,1.3828
495,1.4071
496,1.4313
497,1.4493
498,1.4673
499,1.4771
500,1.4852
501,1.4933
502,1.5014
503,1.5095
504,1.5176
505,1.5257
506,1.5338
507,1.5398
508,1.5299
509,1.52
510,1.5042
511,1.4880000000000002
512,1.4719
513,1.4557
514,1.4395
515,1.4233
516,1.4068
517,1.3898
518,1.3713
519,1.347
520,1.3227
521,1.2984
522,1.2741
523,1.2498
524,1.2256
525,1.2013
526,1.177
527,1.1545
528,1.1338
529,1.1145
530,1.0984
531,1.0822
532,1.0659999999999998
533,1.0498
534,1.0336
535,1.0174
536,1.0012
537,0.985
538,0.9726100000000001
539,0.96295
540,0.95391
541,0.9458200000000001
542,0.9377200000000001
543,0.9296200000000001
544,0.92153
545,0.91343
546,0.90533
547,0.8972399999999999
548,0.8891399999999999
549,0.8810399999999999
550,0.87295
551,0.86485
552,0.85675
553,0.84865
554,0.8405600000000001
555,0.8324600000000001
556,0.82436
557,0.8162699999999999
558,0.80416
559,0.79189
560,0.77657
561,0.76037
562,0.7441800000000001
563,0.7279800000000001
564,0.7117899999999999
565,0.6956
566,0.6794
567,0.6632100000000001
568,0.6470199999999999
569,0.6308199999999999
570,0.61463
571,0.59843
572,0.58224
573,0.56605
574,0.54985
575,0.53366
576,0.51747
577,0.50066
578,0.48263999999999996
579,0.46366
580,0.43937
581,0.41508
582,0.39079
583,0.3665
584,0.34221
585,0.31792
586,0.29363
587,0.26934
588,0.24505
589,0.22075
590,0.19646
591,0.17217000000000002
592,0.14787999999999998
593,0.12359
594,0.48803
595,0.36657
596,0.24511999999999998
597,0.12367
598,0.040123
599,-0.079261
600,-0.12497
601,-0.16885999999999998
602,-0.20935
603,-0.24983000000000002
604,-0.29031999999999997
605,-0.3308
606,-0.37128
607,-0.41176999999999997
608,-0.45225
609,-0.49273999999999996
610,-0.10495
611,-0.11304000000000002
612,-0.12114000000000001
613,-0.12924000000000002
614,-0.13734000000000002
615,-0.14543
616,-0.15353
617,-0.16163
618,-0.16972
619,-0.17782
620,-0.18592
621,-0.19401
622,-0.20210999999999998
623,-0.21020999999999998
624,-0.2183
625,-0.2264
626,-0.2345
627,-0.24259
628,-0.25069
629,-0.25879
630,0.63088
631,0.63088
632,0.63088
633,0.63088
634,0.63088
635,0.63088
636,0.63088
637,0.63088
638,0.63088
639,0.63088
640,0.63088
641,0.63088
642,0.63088
643,0.63088
644,0.63088
645,0.63088
646,0.63088
647,0.63088
648,0.63088
649,0.63088
650,0.63088
651,0.63088
652,0.63088
653,0.63088
654,0.63088
655,0.63088
656,0.63088
657,0.63088
658,0.63088
659,0.63088
660,0.63088
661,0.63088
662,0.63088
663,0.63088
664,0.63088
665,0.63088
666,0.63088
667,0.63088
668,0.63088
669,0.63088
670,0.63088
671,0.63088
672,0.63088
673,0.63088
674,0.63088
675,0.63088
676,0.63088
677,0.63088
678,0.63088
679,0.63088
680,0.63088
681,0.63088
682,0.63088
683,0.63088
684,0.63088
685,0.63088
686,0.63088
687,0.63088
688,0.63088
689,0.63088
690,0.63088
691,0.63088
692,0.63088
693,0.63088
694,0.63088
695,0.63088
696,0.63088
697,0.63088
698,0.63088
699,0.63088
700,0.63088
701,0.63088
702,0.63088
703,0.63088
704,0.63088
705,0.63088
706,0.63088
707,0.63088
708,0.63088
709,0.63088
710,0.63088
711,0.63088
712,0.63088
713,0.63088
714,0.63088
715,0.63088
716,0.63088
717,0.63088
718,0.63088
719,0.63088
720,0.63088
721,0.63088
722,0.63088
723,0.63088
724,0.63088
725,0.63088
726,0.63088
727,0.63088
728,0.63088
729,0.63088
730,0.63088
731,0.63088
732,0.63088
733,0.63088
734,0.63088
735,0.63088
736,0.63088
737,0.63088
738,0.63088
739,0.63088
740,0.63088
741,0.63088
742,0.63851
743,0.6481600000000001
744,0.6584300000000001
745,0.66911
746,0.67978
747,0.6904600000000001
748,0.70113
749,0.71181
750,0.72287
751,0.73905
752,0.7552399999999999
753,0.7855
754,0.81753
755,0.84956
756,0.88159
757,0.91361
758,0.9456399999999999
759,0.97767
760,1.0097
761,1.0341
762,1.0203
763,1.0065
764,0.96424
765,0.92153
766,0.8788299999999999
767,0.8361299999999999
768,0.79342
769,0.7507199999999999
770,0.70802
771,0.66532
772,0.60898
773,0.51462
774,0.42012
775,0.32404
776,0.22796
777,0.13188
778,0.1705
779,-0.30990999999999996
780,-0.15637
781,-0.24499
782,-0.32729
783,-0.39915
784,-0.45253000000000004
785,-0.5059100000000001
786,-0.55929
787,-0.6126699999999999
788,-0.66604
789,-0.71942
790,-0.7728
791,-0.8261799999999999
792,-0.8657
793,-0.89738
794,-0.9243299999999999
795,-0.94568
796,-0.96703
797,-0.9883799999999999
798,-1.0097
799,-1.0311
800,-1.0524
801,-1.0744
802,-1.0965
803,-1.1337
804,-1.1764
805,-1.2191
806,-1.2618
807,-1.3045
808,-1.3472
809,-1.3899
810,-1.4326
811,-1.4756
812,-1.5390000000000001
813,-1.6023
814,-1.693
815,-1.7891
816,-1.8851
817,-1.9812
818,-2.0773
819,-2.1734
820,-2.2695
821,-2.3655
822,-2.4546
823,-2.4873
824,-2.52
825,-2.5322
826,-2.5429
827,-2.5536
828,-2.5643
829,-2.5749
830,-2.5856
831,-2.5935
832,-2.5969
833,-2.5863
834,-2.5222
835,-2.4582
836,-2.3941
837,-2.3301
838,-2.266
839,-2.202
840,-2.1379
841,-2.0739
842,-2.0051
843,-1.9314
844,-1.8541
845,-1.7687
846,-1.6833
847,-1.5979
848,-1.5125
849,-1.4271
850,-1.3417
851,-1.2563
852,-1.1709
853,-1.0805
854,-0.98646
855,-0.89161
856,-0.7955300000000001
857,-0.69945
858,-0.60337
859,-0.50729
860,-0.41121
861,-0.31511999999999996
862,-0.21904
863,-0.12295999999999999
864,-0.14289000000000002
865,0.33752
866,0.16527999999999998
867,0.26136
868,0.35744000000000004
869,0.45352
870,0.54961
871,0.64569
872,0.7417699999999999
873,0.80089
874,0.8584
875,0.8877799999999999
876,0.90914
877,0.9304899999999999
878,0.9518399999999999
879,0.97319
880,0.99454
881,1.0159
882,1.0372
883,1.056
884,1.0309
885,1.0057
886,0.97457
887,0.9425399999999999
888,0.91051
889,0.87849
890,0.84646
891,0.81443
892,0.7824
893,0.75038
894,0.71835
895,0.6863199999999999
896,0.6543
897,0.62227
898,0.59024
899,0.5582199999999999
900,0.5261899999999999
901,0.49416000000000004
902,0.46213000000000004
903,0.43011000000000005
904,0.39808000000000004
905,0.36605
906,0.33403
907,0.302
908,0.26997
909,0.23794
910,0.20592
911,0.17389000000000002
912,0.14185999999999999
913,0.10984000000000001
914,0.35420999999999997
915,0.14414000000000002
916,-0.067124
917,-0.28064
918,-0.49415
919,-0.13984000000000002
920,-0.18254
921,-0.22524
922,-0.26794
923,-0.29816
924,-0.32537
925,-0.3289
926,-0.31822
927,-0.30755
928,-0.29686999999999997
929,-0.2862
930,-0.27552
931,-0.26485
932,-0.25417
933,-0.24349
934,-0.23281999999999997
935,-0.22214
936,-0.21147
937,-0.20079
938,-0.19012
939,-0.17944000000000002
940,-0.16876
941,-0.15809
942,-0.14740999999999999
943,-0.13674
944,-0.12605999999999998
