time,value
0,-0.53452
1,-0.53452
2,-0.53452
3,-0.53452
4,-0.53452
5,-0.53452
6,-0.53452
7,-0.53452
8,-0.53452
9,-0.53452
10,-0.53452
11,-0.53452
12,-0.53452
13,-0.53452
14,-0.53452
15,-0.53452
16,-0.53452
17,-0.53452
18,-0.53452
19,-0.53452
20,-0.53452
21,-0.53452
22,-0.53452
23,-0.53452
24,-0.53452
25,-0.53452
26,-0.53452
27,-0.53452
28,-0.53452
29,-0.53452
30,-0.53452
31,-0.53452
32,-0.53452
33,-0.53452
34,-0.53452
35,-0.53452
36,-0.53452
37,-0.53452
38,-0.53452
39,-0.53452
40,-0.53452
41,-0.53452
42,-0.53452
43,-0.53452
44,-0.53452
45,-0.53452
46,-0.53452
47,-0.53452
48,-0.53452
49,-0.53452
50,-0.53452
51,-0.53452
52,-0.53452
53,-0.53452
54,-0.53452
55,-0.53452
56,-0.53452
57,-0.53452
58,-0.53452
59,-0.53452
60,-0.53452
61,-0.53452
62,-0.53452
63,-0.53452
64,-0.53452
65,-0.53452
66,-0.53452
67,-0.53452
68,-0.53452
69,-0.53452
70,-0.53452
71,-0.53452
72,-0.53452
73,-0.53452
74,-0.53452
75,-0.53452
76,-0.53452
77,-0.53452
78,-0.53452
79,-0.53452
80,-0.53452
81,-0.53452
82,-0.53452
83,-0.53452
84,-0.53452
85,-0.53452
86,-0.53452
87,-0.53452
88,-0.53452
89,-0.53452
90,-0.53452
91,-0.53452
92,-0.53452
93,-0.53452
94,-0.53452
95,-0.53452
96,-0.53452
97,-0.53452
98,-0.53452
99,-0.53452
100,-0.53452
101,-0.53452
102,-0.53452
103,-0.53452
104,-0.53452
105,-0.53452
106,-0.53452
107,-0.53452
108,-0.53452
109,-0.53452
110,-0.53452
111,-0.53452
112,-0.53452
113,-0.53452
114,-0.53452
115,-0.53452
116,-0.53452
117,-0.53452
118,-0.53452
119,-0.53452
120,-0.53452
121,-0.53452
122,-0.53452
123,-0.53452
124,-0.53452
125,-0.53452
126,-0.53452
127,-0.53452
128,-0.53452
129,-0.53452
130,-0.53452
131,-0.53452
132,-0.53452
133,-0.53452
134,-0.53452
135,-0.53452
136,-0.53452
137,-0.53452
138,-0.53452
139,-0.53452
140,-0.53452
141,-0.53452
142,-0.53452
143,-0.53452
144,-0.53452
145,-0.53452
146,-0.53452
147,-0.53452
148,-0.53452
149,-0.53452
150,-0.53452
151,-0.53452
152,-0.53452
153,-0.53452
154,-0.53452
155,-0.53452
156,-0.53452
157,-0.53452
158,-0.53452
159,-0.53452
160,-0.53452
161,-0.53452
162,-0.53452
163,-0.53452
164,-0.53452
165,-0.53452
166,-0.53452
167,-0.53452
168,-0.53452
169,-0.53452
170,-0.53452
171,-0.53452
172,-0.53452
173,-0.53452
174,-0.53452
175,-0.53452
176,-0.53452
177,-0.53452
178,-0.53452
179,-0.53452
180,-0.53452
181,-0.53452
182,-0.53452
183,-0.53452
184,-0.53452
185,-0.53452
186,-0.53452
187,-0.53452
188,-0.53452
189,-0.53452
190,-0.53452
191,-0.53452
192,-0.53452
193,-0.53452
194,-0.53452
195,-0.53452
196,-0.53452
197,-0.53452
198,-0.53452
199,-0.53452
200,-0.53452
201,-0.53452
202,-0.53452
203,-0.53452
204,-0.53452
205,-0.53452
206,-0.53452
207,-0.53452
208,-0.53452
209,-0.53452
210,-0.53452
211,-0.53452
212,-0.53452
213,-0.53452
214,-0.53452
215,-0.53452
216,-0.53452
217,-0.53452
218,-0.53452
219,-0.53452
220,-0.53452
221,-0.53452
222,-0.53452
223,-0.53452
224,-0.53452
225,-0.53452
226,-0.53452
227,-0.53452
228,-0.53452
229,-0.53452
230,-0.53452
231,-0.53452
232,-0.53452
233,-0.53452
234,-0.53452
235,-0.53452
236,-0.53452
237,-0.53452
238,-0.53452
239,-0.53452
240,-0.53452
241,-0.53452
242,-0.53452
243,-0.53452
244,-0.53452
245,-0.53452
246,-0.53452
247,-0.53452
248,-0.53452
249,-0.53452
250,-0.53452
251,-0.53452
252,-0.53452
253,-0.53452
254,-0.53452
255,-0.53452
256,-0.53452
257,-0.53452
258,-0.53452
259,-0.53452
260,-0.53452
261,-0.53452
262,-0.53452
263,-0.53452
264,-0.53452
265,-0.53452
266,-0.53452
267,-0.53452
268,-0.53452
269,-0.53452
270,-0.53452
271,-0.53452
272,-0.53452
273,-0.53452
274,-0.53452
275,-0.53452
276,-0.53452
277,-0.53452
278,-0.53452
279,-0.53452
280,-0.53452
281,-0.53452
282,-0.53452
283,-0.53452
284,-0.53452
285,-0.53452
286,-0.53452
287,-0.53452
288,-0.53452
289,-0.53452
290,-0.53452
291,-0.53452
292,-0.53452
293,-0.53452
294,-0.53452
295,-0.53452
296,-0.53452
297,-0.53452
298,-0.53452
299,-0.53452
300,-0.53452
301,-0.53452
302,-0.53452
303,-0.53452
304,-0.53452
305,-0.53452
306,-0.53452
307,-0.53452
308,-0.53452
309,-0.53452
310,-0.53452
311,-0.53452
312,-0.53452
313,-0.53452
314,-0.53452
315,-0.53452
316,-0.53452
317,-0.53452
318,-0.53452
319,-0.53452
320,-0.53452
321,-0.53452
322,-0.53452
323,-0.53452
324,-0.53452
325,-0.53452
326,-0.53452
327,-0.53452
328,-0.53452
329,-0.53452
330,-0.53452
331,-0.53452
332,-0.53452
333,-0.53452
334,-0.53452
335,-0.53452
336,-0.53452
337,-0.53452
338,-0.53452
339,-0.53452
340,-0.53452
341,-0.53452
342,-0.53452
343,-0.53452
344,-0.53452
345,-0.53452
346,-0.53452
347,-0.53452
348,-0.53452
349,-0.53452
350,-0.53452
351,-0.53452
352,-0.53452
353,-0.53452
354,-0.53452
355,-0.53452
356,-0.53452
357,-0.53452
358,-0.53452
359,-0.53452
360,-0.53452
361,-0.53452
362,-0.53452
363,-0.53452
364,-0.53452
365,-0.53452
366,-0.53452
367,-0.53452
368,-0.53452
369,-0.53452
370,-0.53452
371,-0.53452
372,-0.53452
373,-0.53452
374,-0.53452
375,-0.53452
376,-0.53452
377,-0.53452
378,-0.53452
379,-0.53452
380,-0.53452
381,-0.53452
382,-0.53452
383,-0.53452
384,-0.53452
385,-0.53452
386,-0.53452
387,-0.53452
388,-0.53452
389,-0.53452
390,-0.53452
391,-0.53452
392,-0.53452
393,-0.53452
394,-0.53452
395,-0.53452
396,-0.53452
397,-0.53452
398,-0.53452
399,-0.53452
400,-0.53452
401,-0.53452
402,-0.53452
403,-0.53452
404,-0.53452
405,-0.53452
406,-0.53452
407,-0.53452
408,-0.53452
409,-0.53452
410,-0.53452
411,-0.53452
412,-0.53452
413,-0.53452
414,-0.53452
415,-0.53452
416,-0.53452
417,-0.53452
418,-0.53452
419,-0.53452
420,-0.53452
421,-0.53452
422,-0.53452
423,-0.53452
424,-0.53452
425,-0.53452
426,-0.53452
427,-0.53452
428,-0.53452
429,-0.53452
430,-0.53452
431,-0.53452
432,-0.53452
433,-0.53452
434,-0.53452
435,-0.53452
436,-0.53452
437,-0.53452
438,-0.53452
439,-0.53452
440,-0.53452
441,-0.53452
442,-0.53452
443,-0.53452
444,-0.53452
445,-0.53452
446,-0.53452
447,-0.53452
448,-0.53452
449,-0.53452
450,-0.53452
451,-0.53452
452,-0.53452
453,-0.53452
454,-0.53452
455,-0.53452
456,-0.53452
457,-0.53452
458,-0.53452
459,-0.53452
460,-0.53452
461,-0.53452
462,-0.53452
463,-0.53452
464,-0.53452
465,-0.53452
466,-0.53452
467,-0.53452
468,-0.53452
469,-0.53452
470,-0.53452
471,-0.53452
472,-0.53452
473,-0.53452
474,-0.53452
475,-0.53452
476,-0.53452
477,-0.53452
478,-0.53452
479,-0.53452
480,-0.53452
481,-0.53452
482,-0.53452
483,0.04161
484,1.8659999999999999
485,2.1061
486,1.8659999999999999
487,1.8659999999999999
488,1.8659999999999999
489,2.1061
490,1.8659999999999999
491,2.1061
492,1.8659999999999999
493,1.8659999999999999
494,1.8659999999999999
495,1.8659999999999999
496,1.8659999999999999
497,2.1061
498,1.8659999999999999
499,1.626
500,1.626
501,1.626
502,1.3859
503,1.626
504,1.3859
505,0.47371
506,-0.53452
507,-0.53452
508,-0.53452
509,-0.53452
510,-0.53452
511,-0.53452
512,-0.53452
513,-0.53452
514,-0.53452
515,-0.53452
516,-0.53452
517,-0.53452
518,-0.53452
519,-0.53452
520,-0.53452
521,-0.53452
522,-0.53452
523,-0.53452
524,-0.53452
525,-0.53452
526,-0.53452
527,-0.53452
528,-0.53452
529,-0.53452
530,-0.53452
531,1.1939
532,1.626
533,1.8659999999999999
534,1.626
535,1.3859
536,1.8659999999999999
537,1.626
538,1.8659999999999999
539,1.8659999999999999
540,1.626
541,1.8659999999999999
542,1.8659999999999999
543,1.626
544,1.626
545,1.8659999999999999
546,1.626
547,1.8659999999999999
548,1.3859
549,1.8659999999999999
550,2.1061
551,2.1061
552,1.8659999999999999
553,1.626
554,1.8659999999999999
555,2.1061
556,1.8659999999999999
557,1.3859
558,1.8659999999999999
559,1.626
560,2.1061
561,1.8659999999999999
562,1.8659999999999999
563,1.8659999999999999
564,1.1939
565,2.1061
566,1.8659999999999999
567,2.1061
568,1.8659999999999999
569,1.8659999999999999
570,1.8659999999999999
571,2.1061
572,1.8659999999999999
573,2.1061
574,2.1061
575,2.1061
576,1.8659999999999999
577,1.626
578,1.8659999999999999
579,2.1061
580,2.1061
581,2.1061
582,1.8659999999999999
583,2.1061
584,1.626
585,2.1061
586,1.8659999999999999
587,2.1061
588,1.8659999999999999
589,2.1061
590,1.8659999999999999
591,2.1061
592,1.8659999999999999
593,1.8659999999999999
594,2.1061
595,1.8659999999999999
596,2.1061
597,1.8659999999999999
598,2.1061
599,1.8659999999999999
600,2.1061
601,1.8659999999999999
602,2.1061
603,1.8659999999999999
604,1.8659999999999999
605,1.3859
606,1.8659999999999999
607,1.8659999999999999
608,2.1061
609,1.8659999999999999
610,1.8659999999999999
611,1.8659999999999999
612,2.1061
613,1.8659999999999999
614,1.8659999999999999
615,1.8659999999999999
616,2.1061
617,1.8659999999999999
618,2.1061
619,2.1061
620,1.8659999999999999
621,1.3859
622,1.8659999999999999
623,1.8659999999999999
624,1.8659999999999999
625,1.8659999999999999
626,2.1061
627,1.626
628,1.626
629,1.8659999999999999
630,1.8659999999999999
631,1.8659999999999999
632,1.8659999999999999
633,1.626
634,1.626
635,1.8659999999999999
636,1.8659999999999999
637,1.8659999999999999
638,1.626
639,1.626
640,1.626
641,1.0018
642,1.626
643,1.626
644,1.8659999999999999
645,1.8659999999999999
646,2.1061
647,1.8659999999999999
648,2.1061
649,1.8659999999999999
650,1.8659999999999999
651,2.1061
652,1.8659999999999999
653,2.1061
654,1.8659999999999999
655,1.8659999999999999
656,2.1061
657,1.8659999999999999
658,2.1061
659,1.8659999999999999
660,1.8659999999999999
661,2.1061
662,1.8659999999999999
663,1.8659999999999999
664,2.1061
665,1.8659999999999999
666,2.1061
667,1.8659999999999999
668,2.1061
669,1.626
670,-0.15043
671,-0.48651000000000005
672,-0.53452
673,-0.53452
674,-0.53452
675,-0.53452
676,-0.53452
677,-0.53452
678,-0.53452
679,-0.53452
680,-0.53452
681,-0.53452
682,-0.53452
683,-0.53452
684,-0.53452
685,-0.53452
686,-0.53452
687,-0.53452
688,-0.53452
689,-0.53452
690,-0.53452
691,-0.53452
692,-0.53452
693,-0.53452
694,-0.53452
695,-0.53452
696,-0.53452
697,-0.53452
698,-0.53452
699,-0.53452
700,-0.53452
701,-0.53452
702,-0.53452
703,-0.53452
704,-0.53452
705,-0.53452
706,-0.53452
707,-0.53452
708,-0.53452
709,-0.53452
710,-0.53452
711,-0.53452
712,-0.53452
713,-0.53452
714,-0.53452
715,-0.53452
716,-0.53452
717,-0.53452
718,-0.53452
719,-0.53452
