time,value
0,-0.21197
1,-0.2225
2,-0.23303000000000001
3,-0.24356
4,-0.25032
5,-0.25442
6,-0.25490999999999997
7,-0.25490999999999997
8,-0.25490999999999997
9,-0.25490999999999997
10,-0.25490999999999997
11,-0.25490999999999997
12,-0.25490999999999997
13,-0.25490999999999997
14,-0.25490999999999997
15,-0.25490999999999997
16,-0.25490999999999997
17,-0.25490999999999997
18,-0.25490999999999997
19,-0.25516
20,-0.25626
21,-0.26777
22,-0.28883000000000003
23,-0.30989
24,-0.32944
25,-0.33655
26,-0.3408
27,-0.3408
28,-0.3408
29,-0.3408
30,-0.3408
31,-0.3408
32,-0.3408
33,-0.3408
34,-0.3408
35,-0.3408
36,-0.3408
37,-0.3408
38,-0.3408
39,-0.3408
40,-0.3408
41,-0.3408
42,-0.3408
43,-0.3408
44,-0.3408
45,-0.3408
46,-0.3408
47,-0.3408
48,-0.34229
49,-0.34913
50,-0.36323
51,-0.38429
52,-0.40536
53,-0.42641999999999997
54,-0.44748000000000004
55,-0.46853999999999996
56,-0.4896
57,-0.51067
58,-0.53173
59,-0.55279
60,-0.5734100000000001
61,-0.59283
62,-0.60722
63,-0.61775
64,-0.6282800000000001
65,-0.6388199999999999
66,-0.64935
67,-0.65988
68,-0.6704100000000001
69,-0.68094
70,-0.69147
71,-0.7020000000000001
72,-0.71253
73,-0.72306
74,-0.73359
75,-0.74412
76,-0.75466
77,-0.7651899999999999
78,-0.77572
79,-0.78625
80,-0.79678
81,-0.8073100000000001
82,-0.81784
83,-0.82837
84,-0.8389
85,-0.8494299999999999
86,-0.8599600000000001
87,-0.8705
88,-0.88103
89,-0.89038
90,-0.8964
91,-0.8990799999999999
92,-0.8990799999999999
93,-0.8990799999999999
94,-0.8990799999999999
95,-0.8990799999999999
96,-0.8990799999999999
97,-0.8990799999999999
98,-0.8941
99,-0.88718
100,-0.87665
101,-0.86698
102,-0.85919
103,-0.85613
104,-0.85613
105,-0.85613
106,-0.85613
107,-0.85613
108,-0.85613
109,-0.85613
110,-0.8521700000000001
111,-0.8467
112,-0.8361700000000001
113,-0.8252799999999999
114,-0.81379
115,-0.79596
116,-0.7749
117,-0.75383
118,-0.73647
119,-0.73017
120,-0.7273
121,-0.7273
122,-0.7218100000000001
123,-0.71335
124,-0.69229
125,-0.67123
126,-0.65017
127,-0.63607
128,-0.62473
129,-0.6142
130,-0.59855
131,-0.57119
132,-0.53501
133,-0.49288999999999994
134,-0.45076000000000005
135,-0.40864
136,-0.36651
137,-0.32439
138,-0.28226999999999997
139,-0.24627
140,-0.21224
141,-0.18065
142,-0.14906
143,-0.11746
144,-0.42623
145,-0.26826
146,-0.1103
147,0.24045999999999998
148,0.14207999999999998
149,0.24803000000000003
150,0.35334
151,0.48407
152,0.12393
153,0.15552
154,0.18796
155,0.2216
156,0.26124
157,0.30336
158,0.34549
159,0.38761
160,0.42973
161,0.47186000000000006
162,0.51398
163,0.56766
164,0.62613
165,0.69985
166,0.77331
167,0.8464799999999999
168,0.90404
169,0.9566899999999999
170,1.0093
171,1.0643
172,1.1237
173,1.1855
174,1.2487
175,1.307
176,1.3614
177,1.4035
178,1.4456
179,1.4878
180,1.5152
181,1.5389
182,1.56
183,1.581
184,1.6021
185,1.6231
186,1.6442
187,1.6645
188,1.682
189,1.6925
190,1.703
191,1.7136
192,1.7241
193,1.7346
194,1.7451
195,1.7557
196,1.7662
197,1.7767
198,1.7873
199,1.7978
200,1.8116
201,1.8317
202,1.8524
203,1.8734
204,1.8995
205,1.9272
206,1.9588
207,1.9897
208,2.0199
209,2.0427
210,2.0638
211,2.0849
212,2.0998
213,2.1053
214,2.1069999999999998
215,2.1069999999999998
216,2.0926
217,2.0704
218,2.0282
219,1.9861
220,1.944
221,1.9106
222,1.8786
223,1.847
224,1.8101
225,1.7665
226,1.7162
227,1.6635
228,1.6108
229,1.5582
230,1.5055
231,1.4529
232,1.4002
233,1.3323
234,1.2621
235,1.1884
236,1.1125
237,1.0346
238,0.95163
239,0.8673700000000001
240,0.78299
241,0.69465
242,0.59987
243,0.5050899999999999
244,0.41031000000000006
245,0.31553000000000003
246,0.22075999999999998
247,0.12598
248,0.14548
249,-0.35303
250,-0.18462
251,-0.30046
252,-0.4163
253,-0.52441
254,-0.62247
255,-0.71814
256,-0.81271
257,-0.89791
258,-0.9795
259,-1.0532
260,-1.1257
261,-1.1973
262,-1.2424
263,-1.2845
264,-1.3266
265,-1.3583
266,-1.3791
267,-1.3918
268,-1.4021
269,-1.4097
270,-1.4144
271,-1.4144
272,-1.4144
273,-1.4144
274,-1.3964
275,-1.3769
276,-1.3559
277,-1.3319
278,-1.3055
279,-1.2748
280,-1.2429
281,-1.2088
282,-1.1669
283,-1.1142
284,-1.0616
285,-1.0088
286,-0.9485100000000001
287,-0.8873200000000001
288,-0.8241299999999999
289,-0.76307
290,-0.70344
291,-0.65003
292,-0.59737
293,-0.54472
294,-0.49683999999999995
295,-0.45416999999999996
296,-0.41192
297,-0.37018
298,-0.33394
299,-0.29936
300,-0.26777
301,-0.23618000000000003
302,-0.20457999999999998
303,-0.17299
304,-0.1414
305,-0.10980999999999999
306,-0.43163999999999997
307,-0.35573
308,-0.29903
309,-0.24393
310,-0.17076
311,-0.084312
312,0.14443
313,0.12630999999999998
314,0.23162
315,-0.29148
316,-0.26671
317,-0.24193
318,-0.21715
319,-0.20125
320,-0.1916
321,-0.19044
322,-0.19044
323,-0.19044
324,-0.19044
325,-0.19044
326,-0.19044
327,-0.19044
328,-0.19044
329,-0.19044
330,-0.19044
331,-0.19044
332,-0.19044
333,-0.19044
334,-0.19044
335,-0.19044
336,-0.19044
337,-0.19044
338,-0.19044
339,-0.19044
340,-0.19044
341,-0.19044
342,-0.19044
343,-0.19044
344,-0.19044
345,-0.19044
346,-0.19044
347,-0.19044
348,-0.19044
349,-0.19044
350,-0.19044
351,-0.19044
352,-0.19044
353,-0.19044
354,-0.19044
355,-0.19044
356,-0.19044
357,-0.19044
358,-0.19044
359,-0.19044
360,-0.19044
361,-0.19044
362,-0.19044
363,-0.19219
364,-0.20023
365,-0.21683000000000002
366,-0.24161
367,-0.26638
368,-0.29116
369,-0.31594
370,-0.34071999999999997
371,-0.3655
372,-0.39027
373,-0.41505
374,-0.43983
375,-0.46461
376,-0.48938999999999994
377,-0.51417
378,-0.53894
379,-0.56372
380,-0.5885
381,-0.61328
382,-0.6380600000000001
383,-0.66283
384,-0.68072
385,-0.6956600000000001
386,-0.6956600000000001
387,-0.6956600000000001
388,-0.6956600000000001
389,-0.71081
390,-0.73527
391,-0.76002
392,-0.78174
393,-0.79171
394,-0.7967
395,-0.7967
396,-0.80079
397,-0.8076399999999999
398,-0.83242
399,-0.8572
400,-0.8819799999999999
401,-0.8930899999999999
402,-0.8976
403,-0.89774
404,-0.89774
405,-0.89774
406,-0.89774
407,-0.89774
408,-0.89856
409,-0.90289
410,-0.9276700000000001
411,-0.95245
412,-0.9772299999999999
413,-0.99029
414,-0.99879
415,-0.99879
416,-0.99879
417,-0.99879
418,-0.99879
419,-0.99879
420,-0.99879
421,-0.99879
422,-0.99879
423,-0.99879
424,-0.99879
425,-0.9894700000000001
426,-0.9765799999999999
427,-0.95181
428,-0.9270299999999999
429,-0.90225
430,-0.8774700000000001
431,-0.85269
432,-0.82791
433,-0.80748
434,-0.80008
435,-0.7967
436,-0.7967
437,-0.7902399999999999
438,-0.7802899999999999
439,-0.75551
440,-0.73073
441,-0.70596
442,-0.68118
443,-0.6564
444,-0.63162
445,-0.60283
446,-0.56486
447,-0.5199600000000001
448,-0.4704
449,-0.42085
450,-0.37129
451,-0.32173
452,-0.27218000000000003
453,-0.22261999999999998
454,-0.20187
455,-0.19044
456,-0.19044
457,-0.18721
458,-0.1782
459,-0.15891
460,-0.13413
461,-0.10935
462,-0.41972
463,-0.29583000000000004
464,-0.17194
465,-0.31587
466,0.07584400000000001
467,0.19973
468,0.32363000000000003
469,0.46745
470,0.1273
471,0.18992
472,0.26425
473,0.33859
474,0.40121
475,0.43563999999999997
476,0.46441000000000004
477,0.48918999999999996
478,0.52303
479,0.5606300000000001
480,0.6101800000000001
481,0.65974
482,0.7093
483,0.75885
484,0.8084100000000001
485,0.8579600000000001
486,0.89655
487,0.9145700000000001
488,0.92104
489,0.92104
490,0.92675
491,0.9371299999999999
492,0.9619
493,0.9866799999999999
494,1.0115
495,1.0016
496,0.98314
497,0.95836
498,0.9429
499,0.94129
500,0.95804
501,0.98282
502,1.0057
503,1.0221
504,1.0221
505,1.0221
506,1.0221
507,1.0369
508,1.0552
509,1.08
510,1.1048
511,1.1296
512,1.1543
513,1.1791
514,1.2039
515,1.2363
516,1.2836
517,1.3323
518,1.3818
519,1.4314
520,1.4809999999999999
521,1.5305
522,1.5801
523,1.6296
524,1.6792
525,1.7287
526,1.7783
527,1.8207
528,1.8519
529,1.8787
530,1.9035
531,1.9283
532,1.953
533,1.9778
534,2.0026
535,2.0274
536,2.0317
537,2.0325
538,2.0325
539,2.0325
540,2.0325
541,2.0325
542,2.0325
543,2.0325
544,2.0325
545,2.0325
546,2.0325
547,2.0325
548,1.9967
549,1.9553
550,1.9057
551,1.8612
552,1.8216
553,1.7937
554,1.7689
555,1.7431
556,1.6895
557,1.5904
558,1.4913
559,1.3921
560,1.2930000000000001
561,1.1939
562,1.0948
563,0.9924799999999999
564,0.8875799999999999
565,0.76657
566,0.64268
567,0.51879
568,0.37671
569,0.21099
570,0.20134000000000002
571,-0.13355999999999998
572,-0.29574
573,-0.45366999999999996
574,-0.60234
575,-0.74905
576,-0.8945
577,-0.9981399999999999
578,-1.0973
579,-1.1964
580,-1.2873
581,-1.3697
582,-1.4458
583,-1.5190000000000001
584,-1.5792
585,-1.6263
586,-1.6511
587,-1.6758
588,-1.7006
589,-1.7042
590,-1.7061
591,-1.7061
592,-1.6993
593,-1.6867
594,-1.6639
595,-1.6388
596,-1.6111
597,-1.5742
598,-1.5246
599,-1.475
600,-1.4253
601,-1.3577
602,-1.2881
603,-1.2137
604,-1.1344
605,-1.0517
606,-0.9543799999999999
607,-0.8552700000000001
608,-0.75615
609,-0.66828
610,-0.5926600000000001
611,-0.51803
612,-0.44459
613,-0.3841
614,-0.32752
615,-0.27797
616,-0.22841
617,-0.17886
618,-0.1293
619,-0.39558000000000004
620,-0.1478
621,0.32818
622,0.1998
623,0.32845
624,0.45233999999999996
625,0.11462
626,0.1394
627,0.16418
628,0.18895
629,0.21373000000000003
630,-0.58623
631,-0.58623
632,-0.58623
633,-0.58623
634,-0.58623
635,-0.58623
636,-0.58623
637,-0.58623
638,-0.58623
639,-0.58623
640,-0.58623
641,-0.58623
642,-0.58623
643,-0.58623
644,-0.58623
645,-0.58623
646,-0.58057
647,-0.57175
648,-0.5525
649,-0.53299
650,-0.51508
651,-0.51695
652,-0.53693
653,-0.55691
654,-0.57545
655,-0.5822
656,-0.58623
657,-0.58623
658,-0.58623
659,-0.58623
660,-0.58623
661,-0.58623
662,-0.58623
663,-0.58623
664,-0.58623
665,-0.58623
666,-0.58623
667,-0.58623
668,-0.58623
669,-0.58623
670,-0.58623
671,-0.58623
672,-0.58623
673,-0.58623
674,-0.58623
675,-0.58623
676,-0.58623
677,-0.58623
678,-0.58623
679,-0.58623
680,-0.58623
681,-0.58623
682,-0.58623
683,-0.58623
684,-0.58623
685,-0.58623
686,-0.58623
687,-0.58623
688,-0.58623
689,-0.58623
690,-0.58708
691,-0.59019
692,-0.6028399999999999
693,-0.6228199999999999
694,-0.6428
695,-0.66045
696,-0.6651199999999999
697,-0.66771
698,-0.66771
699,-0.67327
700,-0.6812
701,-0.70118
702,-0.72116
703,-0.7411399999999999
704,-0.7489
705,-0.74916
706,-0.7491899999999999
707,-0.7467199999999999
708,-0.73478
709,-0.71883
710,-0.69885
711,-0.68545
712,-0.67653
713,-0.6965100000000001
714,-0.71649
715,-0.73647
716,-0.74544
717,-0.74907
718,-0.7491899999999999
719,-0.75142
720,-0.75998
721,-0.77488
722,-0.79486
723,-0.81418
724,-0.83067
725,-0.83067
726,-0.83067
727,-0.83067
728,-0.84011
729,-0.85324
730,-0.8732200000000001
731,-0.8915700000000001
732,-0.90636
733,-0.91214
734,-0.91214
735,-0.91214
736,-0.90874
737,-0.89136
738,-0.8727
739,-0.85272
740,-0.8327399999999999
741,-0.81276
742,-0.79278
743,-0.7728
744,-0.7528199999999999
745,-0.7328399999999999
746,-0.71286
747,-0.69288
748,-0.6729
749,-0.65292
750,-0.63294
751,-0.6129600000000001
752,-0.5929800000000001
753,-0.57299
754,-0.55301
755,-0.53303
756,-0.51305
757,-0.49307
758,-0.47308999999999996
759,-0.45311
760,-0.42988999999999994
761,-0.39926999999999996
762,-0.36307
763,-0.32311
764,-0.28315
765,-0.24319000000000002
766,-0.20323
767,-0.16327
768,-0.1233
769,-0.35551
770,-0.078847
771,0.22086
772,0.4945
773,0.14368
774,0.17251
775,0.19249000000000002
776,0.21247
777,0.2278
778,0.22832
779,0.22855999999999999
780,0.22855999999999999
781,0.24785
782,0.27319
783,0.31315
784,0.3515
785,0.38756999999999997
786,0.41228000000000004
787,0.43226000000000003
788,0.45224
789,0.47222
790,0.4922
791,0.51218
792,0.5321600000000001
793,0.55214
794,0.57212
795,0.5921
796,0.6118399999999999
797,0.6313
798,0.63595
799,0.63595
800,0.63595
801,0.63153
802,0.61882
803,0.60144
804,0.5814600000000001
805,0.56148
806,0.5415
807,0.52152
808,0.50154
809,0.48156000000000004
810,0.46158000000000005
811,0.4416
812,0.42162
813,0.40164
814,0.38166
815,0.36168
816,0.3417
817,0.32016999999999995
818,0.29343
819,0.25347
820,0.21350999999999998
821,0.17355
822,0.14555
823,0.12035
824,0.10037
825,0.39147
826,0.26173
827,0.079439
828,-0.12037
829,-0.32016999999999995
830,-0.11074
831,-0.16887
832,-0.22814
833,-0.28808
834,-0.34802
835,-0.40796
836,-0.4679
837,-0.52917
838,-0.5917100000000001
839,-0.66823
840,-0.74815
841,-0.8280700000000001
842,-0.9022
843,-0.96734
844,-1.0289
845,-1.0889
846,-1.1351
847,-1.1740000000000002
848,-1.1939
849,-1.2139
850,-1.2339
851,-1.2209
852,-1.2023
853,-1.1823
854,-1.1623
855,-1.1423
856,-1.1223
857,-1.1023
858,-1.0824
859,-1.0624
860,-1.0424
861,-1.0224
862,-1.0024
863,-0.9824700000000001
864,-0.9624799999999999
865,-0.9425
866,-0.9064399999999999
867,-0.8542799999999999
868,-0.7642399999999999
869,-0.6643100000000001
870,-0.56415
871,-0.45648999999999995
872,-0.3366
873,-0.21671999999999997
874,-0.48105
875,0.17861
876,0.1694
877,0.30926
878,0.4543
879,0.60351
880,0.77867
881,0.9585
882,1.1383
883,1.3108
884,1.4738
885,1.6345
886,1.7937
887,1.9263
888,2.0486
889,2.1485
890,2.2468
891,2.3441
892,2.4077
893,2.4677
894,2.5276
895,2.5744
896,2.6073
897,2.6301
898,2.6501
899,2.6701
900,2.69
901,2.71
902,2.73
903,2.75
904,2.7015
905,2.6478
906,2.5878
907,2.5224
908,2.4523
909,2.374
910,2.2938
911,2.2115
912,2.1218
913,2.0219
914,1.922
915,1.8224
916,1.7515
917,1.6840000000000002
918,1.6241
919,1.5601
920,1.4934
921,1.4149
922,1.335
923,1.2551
924,1.1661
925,1.0672
926,0.9675799999999999
927,0.86913
928,0.7915399999999999
929,0.72029
930,0.6603399999999999
931,0.6026
932,0.54603
933,0.50517
934,0.46521
935,0.42525
936,0.38529
937,0.34533
938,0.30537
939,0.26541
940,0.22545
941,0.18548
942,0.14552
943,0.10555999999999999
944,0.33114
