time,value
0,-1.187
1,-1.1905
2,-1.1824
3,-1.1584
4,-1.1193
5,-1.0642
6,-0.99535
7,-0.91885
8,-0.83541
9,-0.74256
10,-0.63817
11,-0.52365
12,-0.39883
13,-0.26626
14,-0.1304
15,0.0059706
16,0.14364000000000002
17,0.28465
18,0.4292
19,0.57892
20,0.73278
21,0.88692
22,1.0359
23,1.1766
24,1.3068
25,1.4243
26,1.5297
27,1.6251
28,1.7118
29,1.7898
30,1.8609
31,1.9265
32,1.9869
33,2.0428
34,2.0949
35,2.1419
36,2.1790000000000003
37,2.1992
38,2.1925
39,2.1474
40,2.0543
41,1.9089
42,1.7143
43,1.4812
44,1.2272
45,0.97304
46,0.73749
47,0.5342600000000001
48,0.37103
49,0.24766999999999997
50,0.15855
51,0.097252
52,0.057164
53,0.032466
54,0.018175999999999998
55,0.014037
56,0.017456
57,0.024849
58,0.03422
59,0.044001
60,0.05033
61,0.048126999999999996
62,0.037367000000000004
63,0.015057
64,-0.022878
65,-0.078694
66,-0.14951
67,-0.2347
68,-0.33299
69,-0.43637
70,-0.53737
71,-0.63083
72,-0.71448
73,-0.78025
74,-0.8285100000000001
75,-0.8633200000000001
76,-0.88687
77,-0.90055
78,-0.90914
79,-0.9180799999999999
80,-0.92561
81,-0.9324
82,-0.9401700000000001
83,-0.9499200000000001
84,-0.95926
85,-0.96855
86,-0.9790000000000001
87,-0.9893
88,-0.9984
89,-1.0065
90,-1.0152
91,-1.0229
92,-1.03
93,-1.0374
94,-1.0448
95,-1.0503
96,-1.0534
97,-1.0556
98,-1.0554
99,-1.053
100,-1.0493
101,-1.0457
102,-1.0394
103,-1.0298
104,-1.0177
105,-1.003
106,-0.98525
107,-0.9657600000000001
108,-0.9489
109,-0.9336399999999999
110,-0.9197700000000001
111,-0.9079
112,-0.89881
113,-0.88965
114,-0.8788600000000001
115,-0.8686799999999999
116,-0.85814
117,-0.8458200000000001
118,-0.8320200000000001
119,-0.8202200000000001
120,-0.8082600000000001
121,-0.7953
122,-0.78333
123,-0.77298
124,-0.76169
125,-0.74773
126,-0.7338899999999999
127,-0.7165600000000001
128,-0.6937
129,-0.66547
130,-0.6337
131,-0.59634
132,-0.5524399999999999
133,-0.50413
134,-0.44993999999999995
135,-0.38735
136,-0.31511999999999996
137,-0.23493000000000003
138,-0.14529
139,-0.046331
140,0.060192999999999997
141,0.17268
142,0.29036999999999996
143,0.41205
144,0.53582
145,0.6606
146,0.7844399999999999
147,0.90485
148,1.0195
149,1.1263
150,1.2239
151,1.311
152,1.3877
153,1.4538
154,1.508
155,1.5486
156,1.5742
157,1.584
158,1.5787
159,1.5615
160,1.5362
161,1.5062
162,1.4728
163,1.4374
164,1.3998
165,1.3597
166,1.3175
167,1.2725
168,1.2201
169,1.1508
170,1.0535
171,0.9164700000000001
172,0.73248
173,0.50329
174,0.24235
175,-0.030674
176,-0.29464
177,-0.52955
178,-0.72254
179,-0.8698799999999999
180,-0.97619
181,-1.0453
182,-1.0857
183,-1.1069
184,-1.1157
185,-1.1159
186,-1.1124
187,-1.1106
188,-1.1082
189,-1.1047
190,-1.1008
191,-1.0981
192,-1.0931
193,-1.0867
194,-1.0823
195,-1.0781
196,-1.0712
197,-1.0616
198,-1.0541
199,-1.0434
200,-1.03
201,-1.0164
202,-1.0028
203,-0.98431
204,-0.9596399999999999
205,-0.9326399999999999
206,-0.9005
207,-0.8634200000000001
208,-0.8247399999999999
209,-0.78983
210,-0.75546
211,-0.72101
212,-0.68804
213,-0.65518
214,-0.619
215,-0.57829
216,-0.53672
217,-0.49233999999999994
218,-0.44459
219,-0.39400999999999997
220,-0.34183
221,-0.28581
222,-0.22471
223,-0.1601
224,-0.091712
225,-0.018831999999999998
226,0.05864
227,0.13963
228,0.22578
229,0.31811999999999996
230,0.41648999999999997
231,0.51978
232,0.62584
233,0.73123
234,0.83206
235,0.9254
236,1.0096
237,1.0847
238,1.1526
239,1.2156
240,1.2753
241,1.331
242,1.3804
243,1.4191
244,1.4424
245,1.4467
246,1.4313
247,1.3971
248,1.3468
249,1.2848
250,1.215
251,1.141
252,1.0652
253,0.99031
254,0.91638
255,0.84124
256,0.76168
257,0.67378
258,0.5732
259,0.45655
260,0.32371
261,0.17406
262,0.006534100000000001
263,-0.1789
264,-0.37831
265,-0.5846100000000001
266,-0.78532
267,-0.96154
268,-1.0961
269,-1.1799
