time,value
0,-1.6378
1,-1.5228
2,-1.4078
3,-1.2799
4,-1.1521
5,-1.1393
6,-1.1393
7,-1.1265
8,-1.1265
9,-1.1393
10,-1.3055
11,-1.216
12,-1.1777
13,-1.0243
14,-1.0371
15,-1.0371
16,-0.90922
17,-0.79418
18,-0.66635
19,-0.53852
20,-0.41068999999999994
21,-0.28286
22,-0.15503
23,-0.027199
24,-0.014416
25,-0.0016334
26,0.01115
27,-0.027199
28,-0.065548
29,-0.1039
30,-0.14225
31,-0.18059
32,-0.21894
33,-0.29564
34,-0.37234
35,-0.51295
36,-0.65356
37,-0.7813899999999999
38,-1.0498
39,-0.56408
40,-0.66635
41,-0.69191
42,-0.71748
43,-0.76861
44,-1.1649
45,-0.80696
46,-1.0115
47,-1.2288
48,-1.4333
49,-1.395
50,-1.395
51,-1.4461
52,-1.5228
53,-0.96035
54,-0.80696
55,-0.90922
56,-1.1137
57,-1.0498
58,-0.90922
59,-0.90922
60,-0.922
61,-0.93479
62,-1.0115
63,-0.94757
64,-1.0754
65,-1.1521
66,-0.93479
67,-0.8580899999999999
68,-0.7813899999999999
69,-0.79418
70,-0.79418
71,-0.98592
72,-0.83252
73,-0.66635
74,-0.51295
75,-0.69191
76,-0.88366
77,-0.94757
78,-0.8580899999999999
79,-0.96035
80,-1.0754
81,-1.1904
82,-1.0115
83,-0.922
84,-0.8197399999999999
85,-0.93479
86,-0.94757
87,-0.58965
88,-0.58965
89,-0.51295
90,-0.12946
91,-0.14225
92,-0.12946
93,-0.1039
94,0.21568
95,-0.1039
96,-0.0016334
97,-0.078331
98,-0.052765
99,-0.014416
100,0.023932
101,0.036715
102,-0.28286
103,-0.052765
104,0.16454000000000002
105,-0.30841999999999997
106,-0.52573
107,-0.38511999999999996
108,-0.38511999999999996
109,-0.60243
110,-0.65356
111,-0.50017
112,-0.51295
113,-0.80696
114,-0.75583
115,-0.79418
116,-0.94757
117,-1.0115
118,-0.9987
119,-0.922
120,-1.1649
121,-1.1649
122,-1.0626
123,-0.8580899999999999
124,-0.79418
125,-0.628
126,-0.84531
127,-0.57687
128,-0.52573
129,-0.50017
130,-0.42346999999999996
131,-0.34676999999999997
132,-0.19338
133,0.11341
134,-0.091114
135,-0.12946
136,0.27959
137,0.38185
138,0.48412
139,0.25403000000000003
140,0.22846
141,0.16454000000000002
142,0.023932
143,0.062280999999999996
144,-0.11667999999999999
145,-0.15503
146,-0.43625
147,-0.46182
148,-0.76861
149,-1.0882
150,-0.75583
151,-0.922
152,-1.101
153,-1.2416
154,-1.4972
155,-1.5228
156,-1.5995
157,-1.7401
158,-1.804
159,-1.7401
160,-1.8935
161,-1.7657
162,-1.689
163,-1.7273
164,-1.6762
165,-1.7529
166,-1.689
167,-1.3566
168,-1.3694
169,-1.51
170,-1.2416
171,-1.1137
172,-1.1265
173,-1.1265
174,-0.922
175,-0.84531
176,-0.9987
177,-0.90922
178,-0.97314
179,-0.83252
180,-0.8197399999999999
181,-0.89644
182,-0.8197399999999999
183,-0.8197399999999999
184,-0.93479
185,-1.1393
186,-1.0882
187,-1.0882
188,-1.0754
189,-1.0882
190,-1.2671
191,-1.395
192,-1.51
193,-1.6251
194,-1.7529
195,-1.6378
196,-1.804
197,-1.9319
198,-1.7785
199,-1.804
200,-1.9063
201,-1.8807
202,-1.7401
203,-1.7273
204,-1.9702
205,-1.7401
206,-1.9191
207,-1.8168
208,-1.804
209,-1.7785
210,-1.5867
211,-1.3822
212,-1.3566
213,-1.0371
214,-1.1137
215,-0.58965
216,-0.922
217,-0.83252
218,-0.7430399999999999
219,-0.89644
220,-0.9987
221,-0.9987
222,-0.8580899999999999
223,-0.73026
224,-0.7813899999999999
225,-0.922
226,-0.96035
227,-0.88366
228,-0.79418
229,-0.93479
230,-1.0754
231,-0.9987
232,-1.3311
233,-1.2927
234,-1.4461
235,-1.3055
236,-1.3566
237,-1.4717
238,-1.4205
239,-1.5228
240,-1.5484
241,-1.3694
242,-1.5356
243,-1.6123
244,-1.51
245,-1.3055
246,-1.2927
247,-1.2799
248,-1.5484
249,-1.395
250,-1.0626
251,-1.2032
252,-1.0626
253,-0.90922
254,-0.922
255,-0.922
256,-0.79418
257,-0.75583
258,-0.64078
259,-0.7813899999999999
260,-0.43625
261,-0.48738000000000004
262,-0.41068999999999994
263,-0.58965
264,-0.60243
265,-0.7430399999999999
266,-0.65356
267,-0.69191
268,-0.79418
269,-0.75583
270,-0.7813899999999999
271,-0.90922
272,-0.83252
273,-1.0115
274,-0.8580899999999999
275,-1.0243
276,-0.8580899999999999
277,-0.89644
278,-0.90922
279,-0.93479
280,-1.0626
281,-1.0243
282,-0.98592
283,-1.0115
284,-0.94757
285,-0.79418
286,-0.64078
287,-0.48738000000000004
288,-0.34676999999999997
289,-0.19338
290,-0.37234
291,-0.56408
292,-0.58965
293,-0.60243
294,-0.56408
295,-0.50017
296,-0.69191
297,-0.57687
298,-0.69191
299,-0.76861
300,-0.29564
301,-0.58965
302,-0.38511999999999996
303,-0.51295
304,-0.14225
305,0.22846
306,0.11341
307,0.19011
308,0.26681
309,0.4969
310,0.44577
311,0.59916
312,0.82926
313,1.0466
314,0.98265
315,0.80369
316,0.98265
317,1.2767
318,0.90596
319,0.75256
320,0.61195
321,0.62473
322,0.62473
323,0.08784700000000001
324,-0.065548
325,-0.091114
326,-0.23173000000000002
327,-0.25729
328,-0.3979
329,-0.628
330,-0.84531
331,-0.87087
332,-0.79418
333,-0.7046899999999999
334,-0.65356
335,-0.34676999999999997
336,-0.60243
337,-0.64078
338,-0.67913
339,-0.628
340,-0.46182
341,-0.46182
342,-0.7430399999999999
343,-0.52573
344,-0.51295
345,-0.43625
346,-0.30841999999999997
347,-0.628
348,-0.48738000000000004
349,-0.48738000000000004
350,-0.4746
351,-0.57687
352,-0.7046899999999999
353,-0.8580899999999999
354,-0.98592
355,-1.0371
356,-1.1904
357,-0.29564
358,-0.88366
359,-0.9987
360,-0.94757
361,-1.0882
362,-1.2671
363,-1.3055
364,-1.3311
365,-1.2799
366,-1.4078
367,-1.0243
368,-0.8197399999999999
369,-0.73026
370,-0.60243
371,-0.73026
372,-0.15503
373,0.19011
374,0.24124
375,0.19011
376,0.29236999999999996
377,0.4969
378,0.35629
379,0.73978
380,0.54803
381,0.61195
382,0.61195
383,0.63751
384,0.4969
385,0.40742
386,0.22846
387,-0.039982
388,0.1262
389,0.062280999999999996
390,0.08784700000000001
391,-0.014416
392,-0.078331
393,-0.24450999999999998
394,-0.19338
395,-0.33399
396,-0.28286
397,-0.29564
398,-0.43625
399,-0.73026
400,-0.87087
401,-1.0115
402,-0.98592
403,-1.1904
404,-1.2927
405,-1.2799
406,-1.4589
407,-1.3183
408,-1.4461
409,-1.2032
410,-1.0115
411,-0.8580899999999999
412,-0.71748
413,-0.7430399999999999
414,-0.8197399999999999
415,-0.65356
416,-0.65356
417,-0.69191
418,-0.58965
419,-0.628
420,-0.69191
421,-0.56408
422,-0.51295
423,-0.42346999999999996
424,-0.34676999999999997
425,-0.25729
426,-0.18059
427,-0.091114
428,-0.014416
429,0.062280999999999996
430,0.15175999999999998
431,0.22846
432,0.31794
433,0.39464
434,0.48412
435,0.56082
436,0.6503
437,0.7269899999999999
438,0.81647
439,0.89317
440,0.98265
441,1.0594
442,1.136
443,1.2255
444,1.3022
445,1.3917
446,1.4684
447,1.5579
448,1.6346
449,1.7241
450,1.7241
451,1.7241
452,1.7368
453,1.7368
454,1.7368
455,1.7496
456,1.7496
457,1.7496
458,1.7624
459,1.7624
460,1.7752
461,1.7752
462,1.7752
463,1.788
464,1.788
465,1.788
466,1.8008
467,1.8008
468,1.8008
469,1.8135
470,1.8135
471,1.8135
472,1.8263
473,1.8263
474,1.8263
475,1.8391
476,1.8391
477,1.8519
478,1.8519
479,1.8519
480,1.8647
481,0.24124
482,0.22846
483,0.21568
484,0.19011
485,0.17733
486,0.27959
487,0.25403000000000003
488,0.10063
489,0.24124
490,0.10063
491,0.10063
492,0.036715
493,0.049498
494,-0.039982
495,-0.19338
496,-0.0016334
497,-0.16781
498,-0.091114
499,0.19011
500,0.16454000000000002
501,0.29236999999999996
502,0.21568
503,0.22846
504,0.33071999999999996
505,0.34351
506,0.4969
507,0.43299
508,0.36907
509,0.4969
510,0.45855
511,0.34351
512,0.66308
513,0.70143
514,0.71421
515,0.63751
516,0.5736
517,0.63751
518,0.62473
519,0.6503
520,0.63751
521,0.53525
522,0.4969
523,0.45855
524,0.27959
525,0.30516
526,0.33071999999999996
527,0.30516
528,0.22846
529,0.27959
530,0.33071999999999996
531,0.38185
532,0.38185
533,0.24124
534,0.47134
535,0.34351
536,0.35629
537,0.45855
538,0.34351
539,0.45855
540,0.36907
541,0.31794
542,0.34351
543,0.36907
544,0.07506399999999999
545,0.25403000000000003
546,0.30516
547,0.21568
548,0.25403000000000003
549,0.21568
550,0.16454000000000002
551,0.21568
552,0.10063
553,0.35629
554,0.47134
555,0.58638
556,0.70143
557,0.63751
558,0.77813
559,0.73978
560,1.0338
561,-0.014416
562,1.0082
563,1.0849
564,1.1744
565,1.1744
566,1.1616
567,0.99544
568,0.86761
569,0.71421
570,0.73978
571,0.59916
572,0.38185
573,0.48412
574,0.33071999999999996
575,0.049498
576,0.10063
577,-0.014416
578,-0.039982
579,-0.25729
580,-0.23173000000000002
581,-0.3979
582,-0.23173000000000002
583,-0.42346999999999996
584,-0.33399
585,-0.29564
586,-0.32121
587,-0.4746
588,-0.29564
589,-0.24450999999999998
590,-0.039982
591,-0.039982
592,0.036715
593,0.11341
594,0.17733
595,0.25403000000000003
596,0.31794
597,0.39464
598,0.39464
599,0.39464
600,0.40742
601,0.15175999999999998
602,0.24124
603,-0.0016334
604,0.08784700000000001
605,0.08784700000000001
606,-0.078331
607,-0.21894
608,-0.35956
609,-0.44903999999999994
610,-0.58965
611,-0.628
612,-0.60243
613,-0.76861
614,-0.80696
615,-0.97314
616,-0.922
617,-0.922
618,-0.87087
619,-0.75583
620,-0.90922
621,-0.87087
622,-0.7813899999999999
623,-0.89644
624,-0.80696
625,-0.75583
626,-0.71748
627,-0.7046899999999999
628,-0.57687
629,-0.41068999999999994
630,-0.34676999999999997
631,-0.16781
632,0.01115
633,0.20289000000000001
634,0.38185
635,0.38185
636,0.4969
637,0.52247
638,0.70143
639,0.6503
640,0.75256
641,0.68865
642,0.82926
643,0.82926
644,0.81647
645,0.71421
646,0.59916
647,0.6503
648,0.5736
649,0.59916
650,0.43299
651,0.26681
652,-0.027199
653,-0.12946
654,-0.23173000000000002
655,-0.21894
656,-0.52573
657,-0.46182
658,-0.66635
659,-0.7046899999999999
660,-0.7813899999999999
661,-0.71748
662,-0.71748
663,-0.8580899999999999
664,-0.75583
665,-0.65356
666,-0.64078
667,-0.38511999999999996
668,-0.37234
669,-0.30841999999999997
670,-0.19338
671,-0.21894
672,0.062280999999999996
673,-0.052765
674,-0.039982
675,-0.027199
676,0.049498
677,0.16454000000000002
678,0.26681
679,0.43299
680,0.61195
681,0.4969
682,0.6503
683,0.68865
684,1.0594
685,0.86761
686,0.80369
687,1.021
688,1.021
689,1.1488
690,1.2
691,1.1872
692,0.91874
693,0.9698700000000001
694,0.71421
695,0.52247
696,0.40742
697,0.29236999999999996
698,-0.039982
699,-0.027199
700,0.13898
701,-0.16781
702,-0.027199
703,0.19011
704,-0.28286
705,-0.27008000000000004
706,-0.27008000000000004
707,-0.37234
708,-0.43625
709,-0.53852
710,-0.79418
711,-0.60243
712,-0.7046899999999999
713,-0.65356
714,-1.0115
715,-0.83252
716,-0.7046899999999999
717,-0.84531
718,-0.57687
719,-0.61521
720,-0.58965
721,-0.53852
722,-0.33399
723,-0.4746
724,-0.25729
725,-0.24450999999999998
726,-0.0016334
727,0.036715
728,0.08784700000000001
729,0.27959
730,0.4969
731,0.66308
732,0.75256
733,0.89317
734,0.90596
735,1.0594
736,1.3022
737,1.3406
738,1.4556
739,1.7113
740,1.8902
741,2.0053
742,2.082
743,2.1331
744,2.2354
745,2.3376
746,2.376
747,2.3632
748,2.4143
749,2.2482
750,2.1459
751,1.9286
752,2.0053
753,2.0564
754,1.9797
755,1.7241
756,1.7241
757,1.5962
758,1.6346
759,1.5323
760,1.4812
761,1.3661
762,1.2127
763,1.3534
764,1.3534
765,1.2127
766,1.3278
767,1.4045
768,1.2894
769,1.5068
770,1.4173
771,1.5707
772,1.6601
773,1.7752
774,1.9286
775,1.9925
776,2.197
777,2.2482
778,2.2482
779,2.3888
780,2.5038
781,2.376
782,2.555
783,2.6061
784,2.2482
785,2.0309
786,1.9925
787,1.903
788,1.8008
789,1.7113
790,1.609
791,1.5195
792,1.5707
793,1.4684
794,1.2894
795,1.3534
796,1.2383
797,1.2639
798,1.2255
799,1.2
800,1.2511
801,1.0721
802,1.0977
803,0.89317
804,0.90596
805,0.88039
806,0.66308
807,0.6503
808,0.58638
809,0.56082
810,0.70143
811,0.48412
812,0.40742
813,0.39464
814,0.29236999999999996
815,0.27959
816,0.21568
817,0.062280999999999996
818,0.10063
819,-0.039982
820,-0.078331
821,-0.091114
822,0.1262
823,-0.078331
824,-0.091114
825,-0.014416
826,0.11341
827,0.25403000000000003
828,0.34351
829,0.4202
830,0.45855
831,0.45855
832,0.4969
833,0.4969
834,0.61195
835,0.75256
836,0.85482
837,0.95709
838,1.0082
839,1.0977
840,1.0082
841,1.2767
842,1.1233
843,1.1488
844,1.2767
845,1.2511
846,1.4301
847,1.2127
848,1.0977
849,0.73978
850,0.58638
851,0.85482
852,0.68865
853,1.1105
854,0.9698700000000001
855,1.0082
856,1.2767
857,0.95709
858,1.0594
859,1.2
860,1.2
861,1.1744
862,1.3534
863,1.4301
864,2.0948
865,1.9669
866,2.1331
867,2.1203
868,1.3917
869,1.3789
870,1.3534
871,1.1616
872,1.8647
873,1.8008
874,1.7113
875,1.5451
876,1.6729
877,1.5579
878,1.6729
879,1.4684
880,1.3278
881,1.1744
882,1.1105
883,0.86761
884,0.36907
885,0.50968
886,0.53525
887,0.5736
888,0.5736
889,0.50968
890,0.53525
891,0.58638
892,0.5736
893,0.70143
894,0.88039
895,0.88039
896,1.0594
897,1.0849
898,1.1872
899,1.1233
