time,value
0,-0.9095700000000001
1,-0.9095700000000001
2,-0.9095700000000001
3,-0.9095700000000001
4,-0.9095700000000001
5,-0.9095700000000001
6,-0.9095700000000001
7,-0.9095700000000001
8,-0.9095700000000001
9,-0.9095700000000001
10,-0.9095700000000001
11,-0.9095700000000001
12,-0.9095700000000001
13,-0.9095700000000001
14,-0.9095700000000001
15,-0.9095700000000001
16,-0.9095700000000001
17,-0.9095700000000001
18,-0.9095700000000001
19,-0.9095700000000001
20,-0.9095700000000001
21,-0.9095700000000001
22,-0.9095700000000001
23,-0.9095700000000001
24,-0.9095700000000001
25,-0.9095700000000001
26,-0.9095700000000001
27,-0.9095700000000001
28,-0.9095700000000001
29,-0.9095700000000001
30,-0.9095700000000001
31,-0.9095700000000001
32,-0.9095700000000001
33,-0.9095700000000001
34,-0.9095700000000001
35,-0.9095700000000001
36,-0.9095700000000001
37,-0.9095700000000001
38,-0.9095700000000001
39,-0.9095700000000001
40,-0.9095700000000001
41,-0.9095700000000001
42,-0.9095700000000001
43,-0.9095700000000001
44,-0.9095700000000001
45,-0.9095700000000001
46,-0.9095700000000001
47,-0.9095700000000001
48,-0.9095700000000001
49,-0.9095700000000001
50,-0.9095700000000001
51,-0.9095700000000001
52,-0.9095700000000001
53,-0.9095700000000001
54,-0.9095700000000001
55,-0.9095700000000001
56,-0.9095700000000001
57,-0.9095700000000001
58,-0.9095700000000001
59,-0.9095700000000001
60,-0.9095700000000001
61,-0.9095700000000001
62,-0.9095700000000001
63,-0.9095700000000001
64,-0.9095700000000001
65,-0.9095700000000001
66,-0.9095700000000001
67,-0.9095700000000001
68,-0.9095700000000001
69,-0.9095700000000001
70,-0.9095700000000001
71,-0.9095700000000001
72,-0.9095700000000001
73,-0.9095700000000001
74,-0.9095700000000001
75,-0.9095700000000001
76,-0.9095700000000001
77,-0.9095700000000001
78,-0.9095700000000001
79,-0.9095700000000001
80,-0.9095700000000001
81,-0.9095700000000001
82,-0.9095700000000001
83,-0.9095700000000001
84,-0.9095700000000001
85,-0.9095700000000001
86,-0.9095700000000001
87,-0.9095700000000001
88,-0.9095700000000001
89,-0.9095700000000001
90,-0.9095700000000001
91,-0.9095700000000001
92,-0.9095700000000001
93,-0.9095700000000001
94,-0.9095700000000001
95,-0.9095700000000001
96,-0.9095700000000001
97,-0.9095700000000001
98,-0.9095700000000001
99,-0.9095700000000001
100,-0.9095700000000001
101,-0.9095700000000001
102,-0.9095700000000001
103,-0.9095700000000001
104,-0.9095700000000001
105,-0.9095700000000001
106,-0.9095700000000001
107,-0.9095700000000001
108,-0.9095700000000001
109,-0.9095700000000001
110,-0.9095700000000001
111,-0.9095700000000001
112,-0.9095700000000001
113,-0.9095700000000001
114,-0.9095700000000001
115,-0.9095700000000001
116,-0.9095700000000001
117,-0.9095700000000001
118,-0.9095700000000001
119,-0.9095700000000001
120,-0.9095700000000001
121,-0.9095700000000001
122,-0.9095700000000001
123,-0.9095700000000001
124,-0.9095700000000001
125,-0.9095700000000001
126,-0.9095700000000001
127,-0.9095700000000001
128,-0.9095700000000001
129,-0.9095700000000001
130,-0.9095700000000001
131,-0.9095700000000001
132,-0.9095700000000001
133,-0.9095700000000001
134,-0.9095700000000001
135,-0.9095700000000001
136,-0.9095700000000001
137,-0.9095700000000001
138,-0.9095700000000001
139,-0.9095700000000001
140,-0.9095700000000001
141,-0.9095700000000001
142,-0.9095700000000001
143,-0.9095700000000001
144,-0.9095700000000001
145,-0.9095700000000001
146,-0.9095700000000001
147,-0.9095700000000001
148,-0.9095700000000001
149,-0.9095700000000001
150,-0.9095700000000001
151,-0.9095700000000001
152,-0.9095700000000001
153,-0.9095700000000001
154,-0.9095700000000001
155,-0.9095700000000001
156,-0.9095700000000001
157,-0.9095700000000001
158,-0.9095700000000001
159,-0.9095700000000001
160,-0.9095700000000001
161,-0.9095700000000001
162,-0.9095700000000001
163,-0.9095700000000001
164,-0.9095700000000001
165,-0.9095700000000001
166,-0.9095700000000001
167,-0.9095700000000001
168,-0.9095700000000001
169,-0.9095700000000001
170,-0.9095700000000001
171,-0.9095700000000001
172,-0.9095700000000001
173,-0.9095700000000001
174,-0.9095700000000001
175,-0.9095700000000001
176,-0.9095700000000001
177,-0.9095700000000001
178,-0.9095700000000001
179,-0.9095700000000001
180,-0.9095700000000001
181,-0.9095700000000001
182,-0.9095700000000001
183,-0.9095700000000001
184,-0.9095700000000001
185,-0.9095700000000001
186,-0.9095700000000001
187,-0.9095700000000001
188,-0.9095700000000001
189,-0.9095700000000001
190,-0.9095700000000001
191,-0.9095700000000001
192,-0.9095700000000001
193,-0.9095700000000001
194,-0.9095700000000001
195,-0.9095700000000001
196,-0.9095700000000001
197,-0.9095700000000001
198,-0.9095700000000001
199,-0.9095700000000001
200,-0.9095700000000001
201,-0.9095700000000001
202,-0.9095700000000001
203,-0.9095700000000001
204,-0.9095700000000001
205,-0.9095700000000001
206,-0.9095700000000001
207,-0.9095700000000001
208,-0.9095700000000001
209,-0.9095700000000001
210,-0.9095700000000001
211,-0.9095700000000001
212,-0.9095700000000001
213,-0.9095700000000001
214,-0.9095700000000001
215,-0.9095700000000001
216,-0.9095700000000001
217,-0.9095700000000001
218,-0.9095700000000001
219,-0.9095700000000001
220,-0.9095700000000001
221,-0.9095700000000001
222,-0.9095700000000001
223,-0.9095700000000001
224,-0.9095700000000001
225,-0.9095700000000001
226,-0.9095700000000001
227,-0.9095700000000001
228,-0.9095700000000001
229,-0.9095700000000001
230,-0.9095700000000001
231,-0.9095700000000001
232,-0.9095700000000001
233,-0.9095700000000001
234,-0.9095700000000001
235,-0.9095700000000001
236,-0.9095700000000001
237,-0.9095700000000001
238,-0.9095700000000001
239,-0.9095700000000001
240,-0.9095700000000001
241,-0.9095700000000001
242,-0.9095700000000001
243,-0.9095700000000001
244,-0.9095700000000001
245,-0.9095700000000001
246,-0.9095700000000001
247,-0.9095700000000001
248,-0.9095700000000001
249,-0.9095700000000001
250,-0.9095700000000001
251,-0.9095700000000001
252,-0.74331
253,1.0855
254,1.5843
255,1.0855
256,1.0855
257,1.5843
258,-0.24454
259,1.0855
260,1.0855
261,1.0855
262,1.5843
263,1.0855
264,1.0855
265,1.5843
266,1.0855
267,-0.74331
268,-0.9095700000000001
269,-0.9095700000000001
270,-0.9095700000000001
271,0.087978
272,1.0855
273,1.0855
274,1.0855
275,1.5843
276,1.0855
277,1.0855
278,1.0855
279,1.5843
280,1.0855
281,1.0855
282,1.0855
283,1.0855
284,1.0855
285,1.5843
286,1.0855
287,1.0855
288,1.0855
289,1.0855
290,1.0855
291,1.0855
292,1.0855
293,1.5843
294,1.0855
295,1.0855
296,1.0855
297,1.0855
298,1.0855
299,1.0855
300,1.0855
301,1.0855
302,1.5843
303,1.0855
304,0.087978
305,0.42049
306,1.0855
307,1.0855
308,1.0855
309,1.0855
310,1.0855
311,1.0855
312,1.0855
313,1.0855
314,1.5843
315,1.0855
316,1.0855
317,1.0855
318,1.0855
319,1.0855
320,1.0855
321,1.0855
322,1.5843
323,1.0855
324,1.0855
325,1.0855
326,1.0855
327,1.0855
328,1.0855
329,1.0855
330,0.7530100000000001
331,1.0855
332,1.0855
333,0.7530100000000001
334,1.0855
335,1.0855
336,1.0855
337,1.0855
338,1.0855
339,1.0855
340,1.0855
341,1.0855
342,1.0855
343,1.0855
344,1.0855
345,1.0855
346,1.0855
347,1.0855
348,1.0855
349,0.7530100000000001
350,1.0855
351,1.0855
352,1.0855
353,1.0855
354,1.0855
355,1.0855
356,1.0855
357,1.0855
358,0.7530100000000001
359,1.0855
360,1.0855
361,1.0855
362,1.0855
363,0.7530100000000001
364,1.0855
365,1.0855
366,1.0855
367,1.0855
368,0.7530100000000001
369,1.0855
370,1.0855
371,1.0855
372,1.0855
373,1.0855
374,1.0855
375,1.0855
376,1.0855
377,1.0855
378,1.0855
379,1.0855
380,1.0855
381,1.0855
382,1.0855
383,1.0855
384,1.0855
385,1.0855
386,1.0855
387,1.0855
388,1.0855
389,1.0855
390,1.0855
391,1.0855
392,1.5843
393,1.0855
394,1.0855
395,1.0855
396,1.0855
397,1.0855
398,1.0855
399,1.0855
400,1.0855
401,1.0855
402,1.0855
403,1.0855
404,1.0855
405,1.0855
406,1.0855
407,1.0855
408,1.0855
409,1.0855
410,1.0855
411,1.0855
412,1.0855
413,1.5843
414,-0.24454
415,-0.9095700000000001
416,-0.9095700000000001
417,-0.9095700000000001
418,-0.9095700000000001
419,-0.9095700000000001
420,-0.9095700000000001
421,-0.9095700000000001
422,-0.9095700000000001
423,-0.9095700000000001
424,-0.9095700000000001
425,-0.9095700000000001
426,-0.9095700000000001
427,-0.9095700000000001
428,-0.9095700000000001
429,0.7530100000000001
430,1.0855
431,1.0855
432,1.0855
433,1.5843
434,1.0855
435,1.0855
436,1.0855
437,1.0855
438,1.5843
439,1.0855
440,1.0855
441,1.0855
442,1.0855
443,1.5843
444,0.7530100000000001
445,-0.9095700000000001
446,-0.9095700000000001
447,-0.9095700000000001
448,-0.9095700000000001
449,-0.9095700000000001
450,-0.9095700000000001
451,-0.9095700000000001
452,-0.9095700000000001
453,-0.9095700000000001
454,-0.9095700000000001
455,-0.9095700000000001
456,-0.9095700000000001
457,-0.9095700000000001
458,-0.9095700000000001
459,-0.9095700000000001
460,-0.9095700000000001
461,-0.9095700000000001
462,-0.9095700000000001
463,-0.9095700000000001
464,-0.9095700000000001
465,-0.9095700000000001
466,-0.9095700000000001
467,-0.9095700000000001
468,-0.9095700000000001
469,-0.9095700000000001
470,-0.9095700000000001
471,-0.9095700000000001
472,-0.9095700000000001
473,-0.9095700000000001
474,-0.9095700000000001
475,-0.9095700000000001
476,-0.9095700000000001
477,0.087978
478,1.0855
479,1.0855
480,1.0855
481,1.0855
482,1.0855
483,1.0855
484,1.0855
485,1.0855
486,1.0855
487,1.0855
488,0.7530100000000001
489,1.0855
490,1.0855
491,1.0855
492,1.0855
493,1.0855
494,0.7530100000000001
495,1.0855
496,1.0855
497,1.0855
498,1.0855
499,1.0855
500,1.0855
501,1.0855
502,1.0855
503,1.0855
504,1.0855
505,1.0855
506,0.7530100000000001
507,1.0855
508,1.0855
509,1.0855
510,1.0855
511,1.0855
512,0.7530100000000001
513,1.0855
514,1.0855
515,0.7530100000000001
516,1.0855
517,1.0855
518,1.0855
519,0.7530100000000001
520,1.0855
521,1.0855
522,1.0855
523,1.0855
524,1.0855
525,0.7530100000000001
526,1.0855
527,1.0855
528,1.0855
529,1.0855
530,1.0855
531,1.0855
532,1.0855
533,0.7530100000000001
534,1.0855
535,1.0855
536,0.7530100000000001
537,1.0855
538,1.0855
539,0.7530100000000001
540,1.0855
541,1.0855
542,0.7530100000000001
543,1.0855
544,1.0855
545,1.0855
546,1.0855
547,1.0855
548,1.0855
549,1.0855
550,1.0855
551,1.0855
552,1.0855
553,-0.24454
554,0.7530100000000001
555,1.0855
556,1.0855
557,1.0855
558,1.0855
559,1.0855
560,1.0855
561,1.0855
562,1.5843
563,1.0855
564,1.0855
565,1.0855
566,1.0855
567,-0.24454
568,0.42049
569,1.0855
570,1.0855
571,1.0855
572,1.0855
573,1.5843
574,1.0855
575,1.0855
576,1.0855
577,1.0855
578,1.0855
579,1.0855
580,0.7530100000000001
581,1.0855
582,1.0855
583,1.0855
584,1.0855
585,1.5843
586,1.0855
587,1.0855
588,0.42049
589,-0.9095700000000001
590,-0.9095700000000001
591,-0.9095700000000001
592,-0.9095700000000001
593,-0.9095700000000001
594,-0.9095700000000001
595,-0.9095700000000001
596,-0.9095700000000001
597,-0.9095700000000001
598,-0.9095700000000001
599,-0.9095700000000001
600,-0.9095700000000001
601,-0.9095700000000001
602,-0.9095700000000001
603,-0.9095700000000001
604,-0.9095700000000001
605,-0.9095700000000001
606,-0.9095700000000001
607,-0.9095700000000001
608,-0.9095700000000001
609,-0.9095700000000001
610,-0.9095700000000001
611,-0.9095700000000001
612,-0.9095700000000001
613,-0.9095700000000001
614,-0.9095700000000001
615,-0.9095700000000001
616,-0.9095700000000001
617,-0.9095700000000001
618,-0.9095700000000001
619,-0.9095700000000001
620,-0.9095700000000001
621,-0.9095700000000001
622,-0.9095700000000001
623,-0.9095700000000001
624,-0.9095700000000001
625,-0.9095700000000001
626,-0.9095700000000001
627,-0.9095700000000001
628,-0.9095700000000001
629,-0.9095700000000001
630,-0.9095700000000001
631,-0.9095700000000001
632,-0.9095700000000001
633,-0.57705
634,1.0855
635,1.0855
636,1.0855
637,1.0855
638,1.5843
639,1.0855
640,1.0855
641,1.5843
642,1.0855
643,1.0855
644,1.0855
645,1.0855
646,1.5843
647,1.0855
648,1.0855
649,1.0855
650,1.5843
651,1.0855
652,1.0855
653,1.0855
654,1.0855
655,1.0855
656,1.0855
657,1.0855
658,1.5843
659,1.0855
660,1.0855
661,1.0855
662,1.0855
663,1.0855
664,1.0855
665,1.0855
666,1.0855
667,0.7530100000000001
668,-0.74331
669,-0.9095700000000001
670,-0.9095700000000001
671,-0.9095700000000001
672,-0.9095700000000001
673,-0.9095700000000001
674,-0.9095700000000001
675,-0.9095700000000001
676,-0.9095700000000001
677,-0.9095700000000001
678,-0.24454
679,1.0855
680,1.0855
681,1.0855
682,1.5843
683,1.0855
684,1.0855
685,1.0855
686,1.5843
687,1.0855
688,0.7530100000000001
689,-0.9095700000000001
690,-0.9095700000000001
691,-0.9095700000000001
692,-0.9095700000000001
693,-0.9095700000000001
694,-0.9095700000000001
695,-0.9095700000000001
696,-0.9095700000000001
697,-0.9095700000000001
698,-0.9095700000000001
699,-0.9095700000000001
700,-0.9095700000000001
701,-0.9095700000000001
702,-0.9095700000000001
703,-0.9095700000000001
704,-0.9095700000000001
705,-0.9095700000000001
706,-0.9095700000000001
707,-0.9095700000000001
708,-0.9095700000000001
709,-0.9095700000000001
710,-0.9095700000000001
711,-0.9095700000000001
712,-0.9095700000000001
713,-0.9095700000000001
714,-0.9095700000000001
715,-0.9095700000000001
716,-0.9095700000000001
717,-0.9095700000000001
718,-0.9095700000000001
719,-0.9095700000000001
