time,value
0,-0.48288000000000003
1,-0.073015
2,0.38074
3,0.8481299999999999
4,1.2956
5,1.6898
6,2.0011
7,2.2067
8,2.2934
9,2.2593
10,2.1137
11,1.8764
12,1.5755
13,1.2447
14,0.9187299999999999
15,0.63053
16,0.40707
17,0.26676
18,0.21769000000000002
19,0.25705
20,0.37185
21,0.54084
22,0.73732
23,0.93245
24,1.0988
25,1.2136
26,1.2612
27,1.2346
28,1.1361
29,0.97685
30,0.77474
31,0.5523899999999999
32,0.33418000000000003
33,0.14339000000000002
34,-0.00050878
35,-0.083911
36,-0.10036
37,-0.050956
38,0.05612999999999999
39,0.20693000000000003
40,0.3835
41,0.56611
42,0.73537
43,0.8743
44,0.9699
45,1.014
46,1.0038
47,0.94147
48,0.8332700000000001
49,0.68872
50,0.5190100000000001
51,0.33576
52,0.14989
53,-0.029432
54,-0.19528
55,-0.34321999999999997
56,-0.47123999999999994
57,-0.57931
58,-0.66896
59,-0.74263
60,-0.80302
61,-0.85277
62,-0.89405
63,-0.92847
64,-0.9570299999999999
65,-0.98024
66,-0.9983299999999999
67,-1.0114
68,-1.0198
69,-1.0238
70,-1.0241
71,-1.0217
72,-1.0176
73,-1.0129
74,-1.0087
75,-1.0057
76,-1.0045
77,-1.0053
78,-1.0078
79,-1.0119
80,-1.0169
81,-1.0225
82,-1.028
83,-1.0332
84,-1.0379
85,-1.0416
86,-1.0444
87,-1.0464
88,-1.0475
89,-1.0479
90,-1.0474
91,-1.0464
92,-1.045
93,-1.0418
94,-1.0369
95,-1.0304
96,-1.0229
97,-1.0147
98,-1.0068
