time,value
0,0.1675
1,0.1675
2,0.1675
3,0.1675
4,0.1675
5,0.1675
6,0.1675
7,0.1675
8,0.1675
9,0.1675
10,0.1675
11,0.1675
12,0.1675
13,0.16572
14,0.15220999999999998
15,0.1344
16,0.11744
17,0.10601
18,0.10601
19,0.10601
20,0.10601
21,0.10601
22,0.10601
23,0.10601
24,0.10601
25,0.10601
26,0.10601
27,0.10601
28,0.10601
29,0.10601
30,0.10601
31,0.10601
32,0.10601
33,0.10601
34,0.10601
35,0.10601
36,0.10601
37,0.10601
38,0.10601
39,0.10601
40,0.10601
41,0.10601
42,0.10601
43,0.47694
44,0.34555
45,0.15952
46,-0.1662
47,-0.21253000000000002
48,-0.39855
49,-0.11925999999999999
50,-0.16527999999999998
51,-0.21924000000000002
52,-0.27505
53,-0.33486
54,-0.40751
55,-0.48183000000000004
56,-0.55624
57,-0.63065
58,-0.70506
59,-0.77947
60,-0.8424
61,-0.9002899999999999
62,-0.95439
63,-1.0028
64,-1.0231
65,-1.0417
66,-1.0559
67,-1.0622
68,-1.0622
69,-1.0622
70,-1.0622
71,-1.0622
72,-1.0622
73,-1.0794
74,-1.11
75,-1.1472
76,-1.1857
77,-1.2401
78,-1.2956
79,-1.3548
80,-1.4198
81,-1.4942
82,-1.5686
83,-1.643
84,-1.7174
85,-1.7913
86,-1.8575
87,-1.9011
88,-1.9383
89,-1.9706
90,-1.9835
91,-1.9845
92,-1.9845
93,-1.9845
94,-1.9845
95,-1.9845
96,-1.9845
97,-1.9845
98,-1.9845
99,-1.9845
100,-2.0006
101,-2.0188
102,-2.035
103,-2.046
104,-2.046
105,-2.046
106,-2.0389
107,-2.0231
108,-2.0045
109,-1.9859
110,-1.9673
111,-1.9487
112,-1.9301
113,-1.9115
114,-1.8929
115,-1.8743
116,-1.8557
117,-1.8371
118,-1.8185
119,-1.7756
120,-1.7061
121,-1.6131
122,-1.5201
123,-1.3867
124,-1.2389
125,-1.0913
126,-0.94994
127,-0.81844
128,-0.6882199999999999
129,-0.55801
130,-0.42778999999999995
131,-0.29757
132,-0.17457
133,-0.32511999999999996
134,0.13994
135,0.11952
136,0.1672
137,0.19510999999999998
138,0.21229
139,0.22565
140,0.20705
141,0.18845
142,0.17903
143,0.18375
144,0.20235
145,0.22096
146,0.27169
147,0.34569
148,0.42028999999999994
149,0.5182
150,0.63942
151,0.76963
152,0.89985
153,1.0301
154,1.1603
155,1.2814
156,1.3843
157,1.4587
158,1.5331
159,1.579
160,1.6068
161,1.6242
162,1.6346
163,1.6044
164,1.5672
165,1.53
166,1.4928
167,1.4556
168,1.4182
169,1.3731
170,1.3173
171,1.2615
172,1.2474
173,1.2756
174,1.3314
175,1.3872
176,1.4431
177,1.4989
178,1.55
179,1.5913
180,1.6099
181,1.6285
182,1.6245
183,1.5981
184,1.5609
185,1.5237
186,1.4865
187,1.4493
188,1.4121
189,1.3749
190,1.3377
191,1.3011
192,1.2743
193,1.2743
194,1.2743
195,1.2625
196,1.2374
197,1.2002
198,1.163
199,1.1395
200,1.12
201,1.1013
202,1.0827
203,1.0641
204,1.0455
205,1.0269
206,1.0083
207,0.9897299999999999
208,0.9682700000000001
209,0.9382299999999999
210,0.9010299999999999
211,0.86382
212,0.8376
213,0.81663
214,0.7972899999999999
215,0.77355
216,0.7177399999999999
217,0.66194
218,0.61078
219,0.56618
220,0.52898
221,0.49177
222,0.46574
223,0.44615
224,0.4286
225,0.42291999999999996
226,0.43655
227,0.45515
228,0.47696000000000005
229,0.5100600000000001
230,0.54699
231,0.5765899999999999
232,0.58615
233,0.56755
234,0.54895
235,0.48335
236,0.38838
237,0.27793
238,0.1718
239,0.12951
240,0.46892
241,0.31601999999999997
242,0.23001999999999997
243,0.23001999999999997
244,0.23001999999999997
245,0.23001999999999997
246,0.23001999999999997
247,0.23001999999999997
248,0.29294000000000003
249,0.43563
250,0.12285
251,0.16091
252,0.213
253,0.26795
254,0.31751
255,0.35196
256,0.35196
257,0.35196
258,0.34426999999999996
259,0.32983
260,0.31105
261,0.28893
262,0.24111999999999997
263,0.18532
264,0.12951
265,0.3759
266,0.096863
267,-0.18218
268,-0.43200000000000005
269,-0.12584
270,-0.16304000000000002
271,-0.19478
272,-0.21944
273,-0.23804
274,-0.25664000000000003
275,-0.2616
276,-0.26291
277,-0.26141
278,-0.25625
279,-0.23765
280,-0.21905
281,-0.20044
282,-0.18184
283,-0.16324
284,-0.14464000000000002
285,-0.12603
286,-0.10743
287,-0.43673999999999996
288,-0.34373000000000004
289,-0.25071
290,-0.1577
291,-0.32124
292,0.13430999999999998
293,0.32009
294,0.099745
295,0.13695
296,0.17415999999999998
297,0.21136
298,0.24856999999999999
299,0.28576999999999997
300,0.32218
301,0.3543
302,0.37467
303,0.39327
304,0.41575
305,0.44752
306,0.48472
307,0.5200899999999999
308,0.54777
309,0.56638
310,0.58498
311,0.62178
312,0.67075
313,0.72656
314,0.78236
315,-0.23126
316,-0.23126
317,-0.23126
318,-0.23126
319,-0.23126
320,-0.23126
321,-0.23126
322,-0.23126
323,-0.23126
324,-0.23126
325,-0.23126
326,-0.23126
327,-0.23126
328,-0.23126
329,-0.23126
330,-0.23126
331,-0.23126
332,-0.23126
333,-0.23126
334,-0.23126
335,-0.23126
336,-0.23126
337,-0.23126
338,-0.23126
339,-0.23126
340,-0.23126
341,-0.23126
342,-0.23126
343,-0.23126
344,-0.23126
345,-0.23126
346,-0.23126
347,-0.23126
348,-0.23126
349,-0.23126
350,-0.23126
351,-0.23126
352,-0.23126
353,-0.23126
354,-0.23126
355,-0.23126
356,-0.23126
357,-0.23126
358,-0.24
359,-0.25898000000000004
360,-0.28585
361,-0.31055
362,-0.30056
363,-0.27369
364,-0.24806999999999998
365,-0.23393000000000003
366,-0.23126
367,-0.23126
368,-0.23126
369,-0.23126
370,-0.23126
371,-0.23126
372,-0.23126
373,-0.23126
374,-0.23126
375,-0.23126
376,-0.23126
377,-0.23126
378,-0.23126
379,-0.23126
380,-0.23126
381,-0.225
382,-0.20722
383,-0.18035
384,-0.15483
385,-0.14245
386,-0.14245
387,-0.14245
388,-0.14245
389,-0.14245
390,-0.14245
391,-0.14428
392,-0.16917000000000001
393,-0.19562000000000002
394,-0.22249000000000002
395,-0.24936
396,-0.27623000000000003
397,-0.3031
398,-0.34353
399,-0.39361
400,-0.44696
401,-0.49476000000000003
402,-0.5262600000000001
403,-0.55313
404,-0.58
405,-0.60687
406,-0.63374
407,-0.6591899999999999
408,-0.67532
409,-0.67532
410,-0.67532
411,-0.6859999999999999
412,-0.70615
413,-0.73302
414,-0.75989
415,-0.7636
416,-0.76413
417,-0.76071
418,-0.74971
419,-0.7228399999999999
420,-0.69597
421,-0.6691
422,-0.64223
423,-0.61536
424,-0.57676
425,-0.51184
426,-0.43123
427,-0.35136
428,-0.28885
429,-0.23296
430,-0.1779
431,-0.11699000000000001
432,-0.17451
433,0.22854000000000002
434,0.13359000000000001
435,0.2326
436,0.34008
437,0.44756
438,0.55504
439,0.66252
440,0.7663
441,0.85229
442,0.9097299999999999
443,0.96347
444,1.0172
445,1.0709
446,1.1247
447,1.168
448,1.1897
449,1.1897
450,1.1897
451,1.1897
452,1.1897
453,1.1918
454,1.1994
455,1.2531
456,1.3068
457,1.3672
458,1.4378
459,1.5184
460,1.599
461,1.6951
462,1.8024
463,1.9099
464,2.0173
465,2.1248
466,2.2323
467,2.3432
468,2.4735
469,2.6073
470,2.7242
471,2.8059
472,2.8328
473,2.8596
474,2.8591
475,2.841
476,2.813
477,2.7782
478,2.7044
479,2.6237
480,2.5345
481,2.4227
482,2.2886
483,2.1548
484,2.0547
485,2.0009
486,1.9472
487,1.8935
488,1.8397
489,1.786
490,1.7322
491,1.7016
492,1.6737
493,1.6401
494,1.5922
495,1.5116
496,1.431
497,1.3504
498,1.2698
499,1.1892
500,1.1041
501,1.0036
502,0.89615
503,0.79052
504,0.69916
505,0.6167
506,0.53701
507,0.47131999999999996
508,0.44445
509,0.41758
510,0.38224
511,0.33725
512,0.28351
513,0.22976999999999997
514,0.21545
515,0.2128
516,0.21065
517,0.20188
518,0.17575
519,0.14887999999999998
520,0.12201
521,0.4831
522,0.34875
523,0.19374
524,-0.1441
525,-0.29189
526,-0.1136
527,-0.1832
528,-0.26039
529,-0.341
530,-0.42161000000000004
531,-0.50222
532,-0.5828300000000001
533,-0.6634399999999999
534,-0.74405
535,-0.8246600000000001
536,-0.90527
537,-0.93747
538,-0.94176
539,-0.9402299999999999
540,-0.92156
541,-0.8750100000000001
542,-0.8212700000000001
543,-0.76753
544,-0.7137899999999999
545,-0.66005
546,-0.61363
547,-0.5865100000000001
548,-0.5865100000000001
549,-0.5865100000000001
550,-0.6272399999999999
551,-0.69342
552,-0.77361
553,-0.85224
554,-0.9078200000000001
555,-0.9615600000000001
556,-1.0057
557,-1.0306
558,-1.0306
559,-1.0306
560,-1.0306
561,-1.0306
562,-1.0306
563,-1.0215
564,-1.0009
565,-0.9740000000000001
566,-0.9459
567,-0.8975299999999999
568,-0.84503
569,-0.7973100000000001
570,-0.76413
571,-0.76413
572,-0.76413
573,-0.76413
574,-0.76413
575,-0.76426
576,-0.7668
577,-0.78789
578,-0.81476
579,-0.8443
580,-0.88531
581,-0.9378
582,-0.99154
583,-1.0368
584,-1.0648
585,-1.0917
586,-1.1185
587,-1.1454
588,-1.1723
589,-1.1991
590,-1.2063
591,-1.2082
592,-1.2082
593,-1.2082
594,-1.2082
595,-1.2082
596,-1.1913
597,-1.1516
598,-1.0979
599,-1.0469
600,-1.0105
601,-0.98362
602,-0.95675
603,-0.9298799999999999
604,-0.9030100000000001
605,-0.8761399999999999
606,-0.8492700000000001
607,-0.8224
608,-0.7955300000000001
609,-0.76866
610,-0.74179
611,-0.71492
612,-0.68805
613,-0.66118
614,-0.63431
615,-0.60744
616,-0.58057
617,-0.5537
618,-0.52683
619,-0.49996
620,-0.47308999999999996
621,-0.44622
622,-0.41935
623,-0.39248
624,-0.36561
625,-0.33874
626,-0.28558
627,-0.21485
628,-0.13424
629,-0.26077
630,-0.25786
631,-0.25786
632,-0.25786
633,-0.25786
634,-0.25786
635,-0.25786
636,-0.25786
637,-0.25786
638,-0.25786
639,-0.25786
640,-0.25786
641,-0.25786
642,-0.25786
643,-0.25786
644,-0.25786
645,-0.25786
646,-0.25786
647,-0.25786
648,-0.25786
649,-0.25786
650,-0.25786
651,-0.25786
652,-0.25786
653,-0.25786
654,-0.25786
655,-0.25786
656,-0.25786
657,-0.25786
658,-0.25786
659,-0.25786
660,-0.25786
661,-0.25786
662,-0.25786
663,-0.25786
664,-0.25786
665,-0.25786
666,-0.25786
667,-0.28426999999999997
668,-0.31786
669,-0.34668000000000004
670,-0.35402
671,-0.28094
672,-0.20786
673,-0.14667
674,-0.48957
675,-0.30687
676,-0.12418
677,0.058517999999999994
678,0.24120999999999998
679,0.43241999999999997
680,0.13885
681,0.20831
682,0.28138
683,0.35446
684,0.42754
685,0.50062
686,0.5737
687,0.64678
688,0.71986
689,0.79293
690,0.84346
691,0.8840899999999999
692,0.9172799999999999
693,0.9392
694,0.90601
695,0.8694700000000001
696,0.84996
697,0.8617799999999999
698,0.8983200000000001
699,0.93486
700,0.9714
701,1.0079
702,1.0445
703,1.0979
704,1.1645
705,1.2376
706,1.3081
707,1.3474
708,1.3845
709,1.4276
710,1.4822
711,1.5553
712,1.6283
713,1.7014
714,1.7745
715,1.847
716,1.912
717,1.9549
718,1.9914
719,2.0182
720,2.0069999999999997
721,1.9726
722,1.9380000000000002
723,1.916
724,1.916
725,1.916
726,1.9015
727,1.8741
728,1.8376
729,1.801
730,1.7015
731,1.5933
732,1.4884
733,1.3937
734,1.3206
735,1.2476
736,1.1604
737,1.0564
738,0.94678
739,0.8611
740,0.82909
741,0.82909
742,0.83111
743,0.88034
744,0.94755
745,1.0206
746,1.0937
747,1.1668
748,1.2399
749,1.301
750,1.3491
751,1.3856
752,1.4222
753,1.4323
754,1.4329
755,1.4279
756,1.3987
757,1.3306
758,1.2576
759,1.175
760,1.0714
761,0.96178
762,0.83798
763,0.68486
764,0.50216
765,0.31945999999999997
766,0.20356
767,0.11675999999999999
768,0.25382
769,-0.048132
770,0.3566
771,0.14292
772,0.24306999999999998
773,0.38485
774,0.5675399999999999
775,0.75024
776,0.93294
777,1.1156
778,1.2978
779,1.419
780,1.4791
781,1.5156
782,1.5384
783,1.4815
784,1.4106
785,1.3316
786,1.2406
787,1.131
788,1.0214
789,0.8744799999999999
790,0.7037
791,0.521
792,0.33831
793,0.15561
794,-0.12803
795,-0.20978000000000002
796,-0.39248
797,-0.57517
798,-0.75679
799,-0.87749
800,-0.9140299999999999
801,-0.95057
802,-0.93255
803,-0.85903
804,-0.74941
805,-0.63979
806,-0.68718
807,-0.75326
808,-0.84005
809,-0.95595
810,-1.1386
811,-1.3213
812,-1.4893
813,-1.6425
814,-1.7887
815,-1.9168
816,-1.9817
817,-2.0183
818,-2.0548
819,-2.0914
820,-2.1279
821,-2.1613
822,-2.1471
823,-2.001
824,-1.8548
825,-1.6971
826,-1.5264
827,-1.3437
828,-1.161
829,-1.0319
830,-0.91864
831,-0.81196
832,-0.71426
833,-0.64018
834,-0.5671
835,-0.5260199999999999
836,-0.53864
837,-0.57517
838,-0.6117100000000001
839,-0.64825
840,-0.68479
841,-0.72133
842,-0.73629
843,-0.74095
844,-0.7424
845,-0.75249
846,-0.82557
847,-0.89864
848,-0.99
849,-1.1071
850,-1.2533
851,-1.3994
852,-1.5017
853,-1.5787
854,-1.6497
855,-1.6974
856,-1.7071
857,-1.7071
858,-1.7008
859,-1.6724
860,-1.6364
861,-1.5948
862,-1.5402
863,-1.4671
864,-1.3940000000000001
865,-1.2656
866,-1.1025
867,-0.9215200000000001
868,-0.7469
869,-0.66633
870,-0.59325
871,-0.52668
872,-0.47325
873,-0.43671000000000004
874,-0.40016999999999997
875,-0.43096999999999996
876,-0.53325
877,-0.6428699999999999
878,-0.72777
879,-0.78133
880,-0.81787
881,-0.85106
882,-0.8291299999999999
883,-0.79595
884,-0.75532
885,-0.7047899999999999
886,-0.63171
887,-0.5586399999999999
888,-0.50065
889,-0.45593999999999996
890,-0.4194
891,-0.38286
892,-0.34631999999999996
893,-0.30978
894,-0.2805
895,-0.28242
896,-0.31555
897,-0.35209
898,-0.40010999999999997
899,-0.47171
900,-0.54479
901,-0.59641
902,-0.6201800000000001
903,-0.6201800000000001
904,-0.6201800000000001
905,-0.6201800000000001
906,-0.6201800000000001
907,-0.6172300000000001
908,-0.6071
909,-0.5705600000000001
910,-0.5340199999999999
911,-0.49748000000000003
912,-0.46093999999999996
913,-0.4244
914,-0.39161
915,-0.37863
916,-0.37863
917,-0.37814000000000003
918,-0.35814
919,-0.32594
920,-0.2894
921,-0.25872
922,-0.25795
923,-0.25786
924,-0.25786
925,-0.25786
926,-0.25786
927,-0.25786
928,-0.25786
929,-0.25786
930,-0.25474
931,-0.23474
932,-0.16863
933,-0.47034
934,-0.066926
935,0.42776000000000003
936,0.19369
937,0.29609
938,0.36830999999999997
939,0.40485
940,0.44138999999999995
941,0.46005
942,0.46676999999999996
943,0.46676999999999996
944,0.46676999999999996
