time,value
0,-0.1474
1,0.18261
2,-0.1911
3,0.3832
4,0.069551
5,0.17038
6,0.50264
7,-0.072871
8,0.079907
9,1.3833
10,1.3833
11,1.3833
12,1.3833
13,1.3833
14,1.3833
15,1.3833
16,1.3833
17,1.3833
18,1.3833
19,1.3833
20,1.3833
21,1.3833
22,1.3833
23,1.3833
24,1.3833
25,-1.4139
26,-1.4139
27,-1.4139
28,-1.4139
29,-1.4139
30,-1.4139
31,-1.4139
32,-1.4139
33,-1.4139
34,-1.4139
35,-1.4139
36,-1.4139
37,-1.4139
38,-1.4139
39,-1.4139
40,-1.4139
41,-0.24606
42,-0.22174000000000002
43,-0.18012
44,0.036556
45,0.18314
46,0.05829500000000001
47,-0.6954100000000001
48,-0.37598000000000004
49,-0.011401999999999999
50,0.18827
51,-0.20496
52,-0.44283
53,0.44877
54,0.54748
55,0.58025
56,-0.31827
57,-0.088046
58,0.018158
59,-0.2591
60,-0.12625999999999998
61,0.37746
62,-0.036137999999999997
63,-0.42585
64,-0.29841999999999996
65,0.38750999999999997
66,-0.37827
67,-0.50126
68,0.063087
69,-0.14328
70,-0.07849099999999999
71,0.086507
72,0.39087
73,-0.29353
74,-0.09613300000000001
75,0.23438
76,0.037643
77,-0.28800000000000003
78,0.094514
79,0.36885999999999997
80,0.80933
81,0.037233999999999996
82,0.20354
83,-0.13164
84,-0.073081
85,0.36449000000000004
86,0.24745
87,0.066025
88,-0.00011240000000000001
89,-0.10953
90,-0.24461999999999998
91,1.3833
92,1.3833
93,1.3833
94,1.3833
95,1.3833
96,1.3833
97,1.3833
98,1.3833
99,1.3833
100,1.3833
101,1.3833
102,1.3833
103,1.3833
104,1.3833
105,1.3833
106,-1.4139
107,-1.4139
108,-1.4139
109,-1.4139
110,-1.4139
111,-1.4139
112,-1.4139
113,-1.4139
114,-1.4139
115,-1.4139
116,-1.4139
117,-1.4139
118,-1.4139
119,-1.4139
120,-1.4139
121,0.23385999999999998
122,0.099527
123,0.12512
124,0.36248
125,-0.50565
126,-0.141
127,0.23631
