time,value
0,0.15492999999999998
1,-0.31133
2,0.04559
3,0.0079428
4,0.2525
5,-0.72611
6,0.14306
7,-0.34953
8,-0.2418
9,0.18821
10,-0.43693000000000004
11,0.068518
12,0.25640999999999997
13,0.31096
14,0.13854
15,0.5858399999999999
16,-0.5199600000000001
17,0.18413
18,-0.46556000000000003
19,-0.14164000000000002
20,-0.33293
21,0.15138
22,0.18561
23,-0.13552999999999998
24,0.17862999999999998
25,-0.18392999999999998
26,0.29912
27,0.56386
28,0.027942
29,-0.41001000000000004
30,0.27123
31,-0.010372
32,-0.27225
33,0.29751
34,0.088018
35,-0.5433899999999999
36,-0.10715999999999999
37,0.11849000000000001
38,0.40724
39,0.27413000000000004
40,0.20467
41,-0.19017
42,-0.17179
43,0.1812
44,-0.082966
45,0.3431
46,-0.48536999999999997
47,0.28785
48,-0.18025
49,-0.23545
50,0.18575999999999998
51,-0.058796
52,-0.22516
53,-0.21229
54,0.73934
55,-0.14729
56,0.49626000000000003
57,0.81398
58,-0.20134000000000002
59,-0.13674
60,-0.5364800000000001
61,-0.51443
62,-0.44017
63,0.24453000000000003
64,-0.1043
65,0.5543
66,0.36700000000000005
67,-0.46229
68,-0.38049
69,1.7345
70,1.7345
71,1.7345
72,1.7345
73,1.7345
74,1.7345
75,1.7345
76,1.7345
77,1.7345
78,1.7345
79,-1.7707
80,-1.7707
81,-1.7707
82,-1.7707
83,-1.7707
84,-1.7707
85,-1.7707
86,-1.7707
87,-1.7707
88,-1.7707
89,0.059494000000000005
90,-1.7707
91,-1.7707
92,-1.7707
93,-1.7707
94,-1.7707
95,-1.7707
96,-1.7707
97,-1.7707
98,-1.7707
99,1.7345
100,1.7345
101,1.7345
102,1.7345
103,1.7345
104,1.7345
105,1.7345
106,1.7345
107,1.7345
108,0.4535
109,-0.22483000000000003
110,0.57308
111,0.09288300000000001
112,-0.28644000000000003
113,-0.60675
114,0.32602
115,-0.0024476999999999997
116,0.60825
117,-0.37625
118,-0.07319400000000001
119,0.23708
120,-0.30908
121,-0.08289500000000001
122,0.66309
123,0.35919
124,-0.20106
125,-0.035601999999999995
126,-0.13546
127,-0.015151
