time,value
0,1.5206
1,1.4734
2,1.2204
3,0.81295
4,0.31825
5,-0.17736
6,-0.59148
7,-0.85062
8,-0.9306700000000001
9,-0.8343
10,-0.61229
11,-0.32232
12,-0.026931
13,0.2251
14,0.39842
15,0.49087
16,0.501
17,0.45227
18,0.37571
19,0.2914
20,0.2244
21,0.20023
22,0.22128
23,0.27376999999999996
24,0.3352
25,0.36004
26,0.31126
27,0.15883
28,-0.09664400000000001
29,-0.42938000000000004
30,-0.77012
31,-1.0365
32,-1.1745
33,-1.1535
34,-0.9840399999999999
35,-0.73368
36,-0.48954
37,-0.27876
38,-0.13210999999999998
39,-0.037081
40,0.061269000000000004
41,0.23243000000000003
42,0.49558
43,0.82114
44,1.1391
45,1.3683
46,1.4401
47,1.2929
48,0.9647100000000001
49,0.5414800000000001
50,0.1199
51,-0.21252
52,-0.4006
53,-0.45815
54,-0.44325
55,-0.43693999999999994
56,-0.48223999999999995
57,-0.59658
58,-0.73697
59,-0.8362
60,-0.82881
61,-0.68989
62,-0.4422
63,-0.1297
64,0.1805
65,0.40883
66,0.50843
67,0.48038000000000003
68,0.35648
69,0.17908
70,-0.0017764
71,-0.15862
72,-0.27767
73,-0.35495
74,-0.40789000000000003
75,-0.42023
76,-0.36626
77,-0.23939000000000002
78,-0.0082736
79,0.32024
80,0.67774
81,1.0006
82,1.2364
83,1.3236
84,1.2259
85,0.9777399999999999
86,0.6230100000000001
87,0.22719
88,-0.1468
89,-0.47663
90,-0.7419600000000001
91,-0.9430200000000001
92,-1.0887
93,-1.1664
94,-1.1687
95,-1.0994
96,-0.9585899999999999
97,-0.75588
98,-0.51021
99,-0.25045
100,-0.024342
101,0.15299000000000001
102,0.27281
103,0.35605
104,0.42078000000000004
105,0.5002800000000001
106,0.60005
107,0.6826
108,0.74359
109,0.78313
110,0.76199
111,0.6896800000000001
112,0.5891
113,0.49241999999999997
114,0.39704
115,0.32715
116,0.27474
117,0.20888
118,0.094195
119,-0.08268099999999999
120,-0.32116
121,-0.6087600000000001
122,-0.9182600000000001
123,-1.1794
124,-1.3347
125,-1.3685
126,-1.2576
127,-1.0019
128,-0.65142
129,-0.26526
130,0.12738
131,0.48495
132,0.74427
133,0.90249
134,0.9655600000000001
135,0.94175
136,0.8348700000000001
137,0.68914
138,0.52352
139,0.35231999999999997
140,0.17007
141,-0.0057943000000000005
142,-0.17553
143,-0.34992
144,-0.50834
145,-0.62859
146,-0.68798
147,-0.68582
148,-0.59316
149,-0.40331999999999996
150,-0.15281
151,0.11579
152,0.36024
153,0.52485
154,0.5915600000000001
155,0.54675
156,0.43288000000000004
157,0.29105
158,0.15927
159,0.067761
160,0.05101
161,0.081122
162,0.12105999999999999
163,0.13948
164,0.10572000000000001
165,-0.019349
166,-0.21122
167,-0.42513
168,-0.62448
169,-0.7912399999999999
170,-0.88334
171,-0.89255
172,-0.8464299999999999
173,-0.74215
174,-0.57932
175,-0.34803
176,-0.06981699999999999
177,0.24649000000000001
178,0.5917399999999999
179,0.9019799999999999
180,1.1533
181,1.3297
182,1.4129
183,1.4151
184,1.3428
185,1.2242
186,1.0734
187,0.87921
188,0.6479199999999999
189,0.34565
190,-0.041356
191,-0.47888000000000003
192,-0.95934
193,-1.4284
194,-1.8347
195,-2.1438
196,-2.2902
197,-2.2701
198,-2.0805
199,-1.7433
200,-1.3177
201,-0.8005899999999999
202,-0.244
203,0.33326
204,0.89513
205,1.4165
206,1.8638
207,2.1712
208,2.3667
209,2.4195
210,2.3328
211,2.1217
212,1.8008
213,1.4128
214,0.9475100000000001
215,0.43467
216,-0.1142
217,-0.69471
218,-1.2866
219,-1.8368
220,-2.3143
221,-2.6618
222,-2.8169999999999997
223,-2.7253
224,-2.3987
225,-1.8654
226,-1.1894
227,-0.44388999999999995
228,0.2779
229,0.8990100000000001
230,1.3935
231,1.7380000000000002
232,1.9412
233,2.0535
234,2.0853
235,2.0383
236,1.8867
237,1.6149
238,1.2183
239,0.69204
240,0.092514
241,-0.49213
242,-0.9940700000000001
243,-1.3554
244,-1.5312
245,-1.5232
246,-1.3798
247,-1.1736
248,-0.9560299999999999
249,-0.75835
250,-0.60254
251,-0.4693
252,-0.32414
253,-0.14419
254,0.076784
255,0.32584
256,0.58011
257,0.7846
258,0.89571
259,0.91517
260,0.8587899999999999
261,0.7286699999999999
262,0.56555
263,0.40234000000000003
264,0.25009000000000003
265,0.10273
266,-0.015083000000000001
267,-0.12639
268,-0.23121999999999998
269,-0.31456999999999996
270,-0.36541
271,-0.38288
272,-0.37774
273,-0.32306999999999997
274,-0.26111999999999996
275,-0.20823000000000003
276,-0.16011
277,-0.12468
278,-0.08655800000000001
279,-0.047439999999999996
280,0.017996
281,0.087389
282,0.1509
283,0.22084
284,0.25471
285,0.27314
286,0.28870999999999997
287,0.30529
288,0.33359
289,0.3588
290,0.38205
291,0.38304
292,0.31892
293,0.19359
294,0.017181000000000002
295,-0.19277
296,-0.38072
297,-0.52864
298,-0.61452
299,-0.62375
300,-0.56792
301,-0.45798
302,-0.34835
303,-0.23383
304,-0.13658
305,-0.043031
306,0.050423
307,0.13974
308,0.26537
309,0.40347
310,0.54971
311,0.66161
312,0.71948
313,0.7156899999999999
314,0.62429
315,0.46592
316,0.25851
317,0.021843
318,-0.22223
319,-0.44753000000000004
320,-0.6592
321,-0.8233299999999999
322,-0.9284
323,-0.94706
324,-0.8695700000000001
325,-0.67027
326,-0.35348
327,0.066116
328,0.51665
329,0.92411
330,1.2247
331,1.3512
332,1.2790000000000001
333,1.0444
334,0.70165
335,0.32356
336,-0.024064
337,-0.28076
338,-0.43888999999999995
339,-0.5262899999999999
340,-0.58314
341,-0.66556
342,-0.78092
343,-0.9159999999999999
344,-1.0216
345,-1.05
346,-0.9761700000000001
347,-0.7884399999999999
348,-0.49556999999999995
349,-0.14866
350,0.21824000000000002
351,0.56126
352,0.85462
353,1.1013
354,1.3103
355,1.4818
356,1.6047
357,1.645
358,1.5813
359,1.3882
360,1.0544
361,0.59146
362,0.05556900000000001
363,-0.50195
364,-1.0204
365,-1.4509
366,-1.7604
367,-1.9269
368,-1.9436
369,-1.8329
370,-1.6111
371,-1.2853
372,-0.8842200000000001
373,-0.42258
374,0.061087999999999996
375,0.5456
376,0.9915799999999999
377,1.3575
378,1.6346
379,1.7683
380,1.7705
381,1.6521
382,1.3962
383,1.0455
384,0.62952
385,0.17735
386,-0.26016
387,-0.65105
388,-0.9631200000000001
389,-1.1749
390,-1.2952
391,-1.3258
392,-1.2745
393,-1.1571
394,-0.9499799999999999
395,-0.6400100000000001
396,-0.24
397,0.22428
398,0.72143
399,1.2068
400,1.5738
401,1.7478
402,1.6945
403,1.4063
404,0.9128200000000001
405,0.31149
406,-0.30288000000000004
407,-0.8297899999999999
408,-1.182
409,-1.3365
410,-1.3086
411,-1.1298
412,-0.85041
413,-0.50678
414,-0.16112
415,0.14599
416,0.38251999999999997
417,0.52485
418,0.59308
419,0.58025
420,0.52167
421,0.45003999999999994
422,0.39368000000000003
423,0.36741
424,0.3422
425,0.32208000000000003
426,0.2509
427,0.11285
428,-0.10945999999999999
429,-0.36916
430,-0.62608
431,-0.81784
432,-0.8869100000000001
433,-0.79783
434,-0.5941
435,-0.31151
436,0.0019843
437,0.28785
438,0.5232600000000001
439,0.69567
440,0.81203
441,0.88799
442,0.9287200000000001
443,0.90045
444,0.77895
445,0.5280199999999999
446,0.14955
447,-0.31989
448,-0.80485
449,-1.2037
450,-1.421
451,-1.4152
452,-1.1686
453,-0.72059
454,-0.16118
455,0.41273000000000004
456,0.91779
457,1.2895
458,1.5177
459,1.5999
460,1.5681
461,1.4238
462,1.1794
463,0.82396
464,0.35081
465,-0.20908000000000002
466,-0.81829
467,-1.4117
468,-1.9176
469,-2.2753
470,-2.4035
471,-2.2753
472,-1.9140000000000001
473,-1.3555
474,-0.69319
475,0.0018235
476,0.65645
477,1.229
478,1.6942
479,2.0435
480,2.2723
481,2.3594
482,2.3077
483,2.1105
484,1.7505
485,1.2387
486,0.60675
487,-0.091901
488,-0.7902100000000001
489,-1.4285
490,-1.9371
491,-2.2765
492,-2.4311
493,-2.4103
494,-2.2141
495,-1.8649
496,-1.4054
497,-0.84291
498,-0.18619000000000002
499,0.50463
