time,value
0,-0.47136999999999996
1,-0.8395299999999999
2,-0.9938799999999999
3,-0.83809
4,-0.45583
5,0.023795
6,0.4225
7,0.53601
8,0.27747
9,-0.24865
10,-0.83129
11,-1.2118
12,-1.2447
13,-0.88592
14,-0.19452
15,0.6067
16,1.2319
17,1.4817
18,1.3404
19,0.8549399999999999
20,0.18784
21,-0.38500999999999996
22,-0.64646
23,-0.5984
24,-0.20976999999999998
25,0.33141
26,0.8157
27,1.1479
28,1.2061
29,0.9908100000000001
30,0.57816
31,0.09450900000000001
32,-0.30701999999999996
33,-0.56758
34,-0.67801
35,-0.6579
36,-0.5521699999999999
37,-0.43067
38,-0.2976
39,-0.23831
40,-0.19812000000000002
41,-0.1436
42,-0.061985000000000005
43,0.07084800000000001
44,0.23349
45,0.38049
46,0.42928
47,0.35827
48,0.27656
49,0.16589
50,0.08766399999999999
51,0.095874
52,0.19128
53,0.34359
54,0.49156000000000005
55,0.5433899999999999
56,0.46853999999999996
57,0.25144
58,-0.085313
59,-0.42585
60,-0.63964
61,-0.62043
62,-0.37901
63,-0.035658999999999996
64,0.31782
65,0.52222
66,0.53946
67,0.34226999999999996
68,0.038825
69,-0.23661999999999997
70,-0.30738000000000004
71,-0.082856
72,0.42593000000000003
73,1.1069
74,1.6937
75,1.9973
76,1.8827
77,1.3188
78,0.46626000000000006
79,-0.48763
80,-1.2856
81,-1.702
82,-1.6676
83,-1.3156
84,-0.80917
85,-0.30209
86,-0.014953
87,-0.028745
88,-0.24819000000000002
89,-0.4971
90,-0.6710699999999999
91,-0.61595
92,-0.3359
93,0.013478
94,0.34419
95,0.5313
96,0.54328
97,0.44016000000000005
98,0.37927
99,0.48303
100,0.7941600000000001
101,1.2153
102,1.6343
103,1.9255
104,1.9016
105,1.5353
106,0.8655200000000001
107,0.041638999999999995
108,-0.73583
109,-1.3211
110,-1.5377
111,-1.4833
112,-1.2781
113,-0.9919
114,-0.6927
115,-0.37096
116,-0.051011
117,0.35131
118,0.83185
119,1.2235
120,1.452
121,1.4195
122,1.0307
123,0.31824
124,-0.49865
125,-1.281
126,-1.7896
127,-1.9444
128,-1.7303
129,-1.262
130,-0.7037
131,-0.18408
132,0.20742
133,0.43336
134,0.59853
135,0.72534
136,0.85708
137,0.9306
138,0.87275
139,0.62797
140,0.25499
141,-0.23005
142,-0.60911
143,-0.77194
144,-0.62087
145,-0.16337000000000002
146,0.47383000000000003
147,1.0898
148,1.4344
149,1.3371
150,0.83636
151,0.1267
152,-0.555
153,-0.93926
154,-0.88361
155,-0.44106999999999996
156,0.23299
157,0.8494
158,1.1828
159,1.1025
160,0.66041
161,0.059205999999999995
162,-0.4708
163,-0.77446
164,-0.74475
165,-0.4796
166,-0.22555999999999998
167,-0.17967
168,-0.38508000000000003
169,-0.8447600000000001
170,-1.3155
171,-1.629
172,-1.5826
173,-1.1147
174,-0.35331
175,0.54533
176,1.2918
177,1.6391
178,1.5706
179,1.107
180,0.47231999999999996
181,-0.14265
182,-0.5825
183,-0.7568600000000001
184,-0.6433300000000001
185,-0.33495
186,0.018704
187,0.39016
188,0.76117
189,1.0732
190,1.2784
191,1.4286
192,1.4279
193,1.2299
194,0.78828
195,0.1352
196,-0.6492100000000001
197,-1.4283
198,-2.023
199,-2.2434
200,-2.0563
201,-1.4917
202,-0.66896
203,0.12299000000000002
204,0.63766
205,0.77455
206,0.53886
207,0.10461
208,-0.36175999999999997
209,-0.65012
210,-0.61662
211,-0.34053
212,0.16109
213,0.68129
214,1.0566
215,1.2757
216,1.2841
217,1.176
218,1.0362
219,0.8799100000000001
220,0.7703399999999999
221,0.62362
222,0.43293000000000004
223,0.23353000000000002
224,-0.037926
225,-0.30769
226,-0.51778
227,-0.64741
228,-0.6126199999999999
229,-0.50044
230,-0.33082
231,-0.15644
232,-0.069027
233,-0.10347999999999999
234,-0.2124
235,-0.41196000000000005
236,-0.63797
237,-0.87528
238,-1.0629
239,-1.1799
240,-1.1837
241,-1.0569
242,-0.8166100000000001
243,-0.49245
244,-0.048264999999999995
245,0.41395
246,0.8183199999999999
247,1.0912
248,1.2053
249,1.1636
250,1.0738
251,1.0113
252,1.0411
253,1.1571
254,1.3211
255,1.4411
256,1.3959
257,1.1366
258,0.64123
259,0.0069764
260,-0.58367
261,-1.0625
262,-1.2995
263,-1.3367
264,-1.1279
265,-0.78164
266,-0.50608
267,-0.29535
268,-0.16804000000000002
269,-0.17305
270,-0.2308
271,-0.28445
272,-0.32571
273,-0.32918000000000003
274,-0.32487
275,-0.30896999999999997
276,-0.35735
277,-0.49371000000000004
278,-0.6232300000000001
279,-0.67818
280,-0.6308699999999999
281,-0.43762
282,-0.03524
283,0.51134
284,1.1155
285,1.6347
286,1.943
287,1.9442
288,1.5949
289,0.9565
290,0.18649000000000002
291,-0.5727399999999999
292,-1.1714
293,-1.4267
294,-1.2986
295,-0.80976
296,-0.13634000000000002
297,0.52215
298,1.0523
299,1.317
300,1.2223
301,0.8659899999999999
302,0.3551
303,-0.16557
304,-0.58353
305,-0.8236899999999999
306,-0.8295899999999999
307,-0.63774
308,-0.36193000000000003
309,-0.016931
310,0.32805
311,0.6045699999999999
312,0.72509
313,0.66463
314,0.4422
315,0.0095451
316,-0.56328
317,-1.1157
318,-1.545
319,-1.6956
320,-1.5194
321,-1.0324
322,-0.32350999999999996
323,0.30901
324,0.7091
325,0.81294
326,0.55953
327,0.033947000000000005
328,-0.4894
329,-0.75212
330,-0.67111
331,-0.20071
332,0.4859
333,1.2503
334,1.8683
335,2.1546
336,2.1611
337,1.8468
338,1.3648
339,0.82825
340,0.3873
341,-0.014759
342,-0.40884000000000004
343,-0.7318
344,-1.0148
345,-1.284
346,-1.4567
347,-1.4113
348,-1.1256
349,-0.68183
350,-0.09221599999999999
351,0.43683
352,0.8094100000000001
353,0.91714
354,0.7898
355,0.5390699999999999
356,0.2112
357,-0.045472000000000005
358,-0.24215
359,-0.34884
360,-0.40828000000000003
361,-0.48383000000000004
362,-0.60001
363,-0.74245
364,-0.77344
365,-0.72442
366,-0.5307
367,-0.1357
368,0.31687
369,0.70994
370,0.9825299999999999
371,1.0371
372,0.8557299999999999
373,0.56217
374,0.18025
375,-0.087262
376,-0.19856
377,-0.11625999999999999
378,0.096571
379,0.35949000000000003
380,0.52317
381,0.49481
382,0.30409
383,-0.083937
384,-0.5062800000000001
385,-0.82826
386,-0.91338
387,-0.72317
388,-0.27434000000000003
389,0.31832
390,0.8376100000000001
391,1.1987
392,1.2877
393,1.1129
394,0.66073
395,0.052632000000000005
396,-0.54495
397,-1.0439
398,-1.3176
399,-1.3185
400,-1.1389
401,-0.84378
402,-0.47201000000000004
403,-0.072431
404,0.28095
405,0.65466
406,1.0376
407,1.3452
408,1.5133
409,1.5305
410,1.3147
411,0.835
412,0.21022
413,-0.39899
414,-0.9507899999999999
415,-1.3771
416,-1.4902
417,-1.3848
418,-1.1781
419,-0.93652
420,-0.75207
421,-0.6903100000000001
422,-0.6701
423,-0.64663
424,-0.53676
425,-0.2855
426,0.020285
427,0.36830999999999997
428,0.66783
429,0.86219
430,0.91645
431,0.9129700000000001
432,0.81847
433,0.82126
434,0.9211600000000001
435,1.0632
436,1.1619
437,1.0681
438,0.73197
439,0.12176
440,-0.70431
441,-1.5905
442,-2.2579
443,-2.5916
444,-2.4578
445,-1.8589
446,-0.9517700000000001
447,0.05575
448,0.8806700000000001
449,1.3283
450,1.3856
451,1.0877
452,0.65198
453,0.28576999999999997
454,0.15846
455,0.35114
456,0.76773
457,1.2114
458,1.5123
459,1.5798
460,1.2552
461,0.66601
462,-0.091921
463,-0.735
464,-1.1516
465,-1.3182
466,-1.2535
467,-1.0689
468,-0.986
469,-1.0718
470,-1.2259
471,-1.4721
472,-1.6481
473,-1.6198
474,-1.2905
475,-0.7603
476,-0.2169
477,0.35178000000000004
478,0.83714
479,1.1535
480,1.3089
481,1.4989
482,1.7159
483,1.8951
484,2.1707
485,2.3629
486,2.3118
487,1.9635
488,1.3468
489,0.46683
490,-0.54461
491,-1.505
492,-2.325
493,-2.9502
494,-3.3754
495,-3.4753
496,-3.2439
497,-2.6954
498,-1.7617
499,-0.52378
