time,value
0,-0.038891
1,-4.0391
2,-0.038891
3,-0.038891
4,-0.038891
5,-0.038891
6,-0.038891
7,-0.038891
8,-0.038891
9,-0.038891
10,-0.038891
11,-0.038891
12,-0.038891
13,-0.038891
14,-0.038891
15,-0.038891
16,-0.038891
17,-0.038891
18,-0.038891
19,-0.038891
20,-4.0391
21,-0.038891
22,-0.038891
23,-0.038891
24,-0.038891
25,-0.038891
26,-0.038891
27,-0.038891
28,-0.038891
29,-0.038891
30,-0.038891
31,-0.038891
32,-0.038891
33,-0.038891
34,-0.038891
35,3.9614
36,-0.038891
37,-0.038891
38,-0.038891
39,-0.038891
40,-0.038891
41,-0.038891
42,-0.038891
43,-0.038891
44,-0.038891
45,-0.038891
46,-0.038891
47,-0.038891
48,-0.038891
49,3.9614
50,-0.038891
51,-0.038891
52,-0.038891
53,-0.038891
54,-0.038891
55,-0.038891
56,-0.038891
57,-0.038891
58,-0.038891
59,3.9614
60,-0.038891
61,-0.038891
62,-0.038891
63,-0.038891
64,-0.038891
65,-0.038891
66,-0.038891
67,-0.038891
68,-0.038891
69,-0.038891
70,-0.038891
71,-0.038891
72,3.9614
73,-0.038891
74,-0.038891
75,-0.038891
76,-0.038891
77,-0.038891
78,-0.038891
79,-0.038891
80,-0.038891
81,-0.038891
82,-0.038891
83,3.9614
84,-0.038891
85,-0.038891
86,-0.038891
87,-0.038891
88,-0.038891
89,-0.038891
90,3.9614
91,-0.038891
92,-0.038891
93,-0.038891
94,-0.038891
95,-0.038891
96,-0.038891
97,-0.038891
98,-0.038891
99,3.9614
100,-0.038891
101,-0.038891
102,-0.038891
103,-0.038891
104,-0.038891
105,-0.038891
106,-0.038891
107,-0.038891
108,-0.038891
109,-0.038891
110,-0.038891
111,-0.038891
112,-0.038891
113,-0.038891
114,-0.038891
115,-0.038891
116,-0.038891
117,-0.038891
118,-0.038891
119,-0.038891
120,3.9614
121,-0.038891
122,-0.038891
123,-0.038891
124,-0.038891
125,-0.038891
126,-0.038891
127,-0.038891
128,-0.038891
129,-0.038891
130,-0.038891
131,3.9614
132,-0.038891
133,-0.038891
134,-0.038891
135,-0.038891
136,-0.038891
137,-0.038891
138,-0.038891
139,-0.038891
140,-0.038891
141,-0.038891
142,-0.038891
143,-0.038891
144,-0.038891
145,-0.038891
146,-0.038891
147,-0.038891
148,-0.038891
149,3.9614
150,-0.038891
151,-0.038891
152,-0.038891
153,-0.038891
154,-0.038891
155,-0.038891
156,-0.038891
157,-0.038891
158,-0.038891
159,-0.038891
160,-0.038891
161,-0.038891
162,-0.038891
163,-0.038891
164,-0.038891
165,-0.038891
166,-0.038891
167,-0.038891
168,-0.038891
169,-0.038891
170,-0.038891
171,-0.038891
172,-0.038891
173,-0.038891
174,-0.038891
175,-0.038891
176,-0.038891
177,-0.038891
178,-0.038891
179,-0.038891
180,-0.038891
181,-0.038891
182,-0.038891
183,3.9614
184,-0.038891
185,-0.038891
186,-0.038891
187,-0.038891
188,-0.038891
189,-0.038891
190,-0.038891
191,-0.038891
192,-0.038891
193,-0.038891
194,-0.038891
195,-0.038891
196,-0.038891
197,-0.038891
198,3.9614
199,-0.038891
200,-0.038891
201,-0.038891
202,-0.038891
203,-0.038891
204,-0.038891
205,-0.038891
206,-0.038891
207,-0.038891
208,-0.038891
209,3.9614
210,-0.038891
211,-0.038891
212,-0.038891
213,-0.038891
214,-0.038891
215,-0.038891
216,-0.038891
217,3.9614
218,-0.038891
219,-0.038891
220,-0.038891
221,-0.038891
222,-0.038891
223,-0.038891
224,-0.038891
225,3.9614
226,-0.038891
227,-0.038891
228,-0.038891
229,-0.038891
230,-0.038891
231,-0.038891
232,-0.038891
233,-0.038891
234,-0.038891
235,-0.038891
236,-0.038891
237,3.9614
238,-0.038891
239,-0.038891
240,-0.038891
241,-0.038891
242,-0.038891
243,-0.038891
244,-0.038891
245,-0.038891
246,-0.038891
247,-0.038891
248,3.9614
249,-0.038891
250,-0.038891
251,-0.038891
252,-0.038891
253,-0.038891
254,-0.038891
255,-0.038891
256,-0.038891
257,3.9614
258,-0.038891
259,-0.038891
260,-0.038891
261,-0.038891
262,-0.038891
263,-0.038891
264,-0.038891
265,-0.038891
266,-0.038891
267,-0.038891
268,-0.038891
269,-0.038891
270,-0.038891
271,-0.038891
272,-0.038891
273,-0.038891
274,-0.038891
275,-0.038891
276,-0.038891
277,-0.038891
278,-0.038891
279,-0.038891
280,-0.038891
281,-0.038891
282,-0.038891
283,-0.038891
284,-0.038891
285,-0.038891
286,-0.038891
287,-0.038891
288,-0.038891
289,-0.038891
290,-0.038891
291,-0.038891
292,-0.038891
293,-0.038891
294,-0.038891
295,-0.038891
296,-0.038891
297,-0.038891
298,-0.038891
299,-0.038891
300,-0.038891
301,-4.0391
302,-0.038891
303,-0.038891
304,-0.038891
305,-0.038891
306,-0.038891
307,-0.038891
308,-0.038891
309,-0.038891
310,-0.038891
311,-0.038891
312,-0.038891
313,-0.038891
314,-0.038891
315,-0.038891
316,-0.038891
317,-0.038891
318,-0.038891
319,-0.038891
320,-0.038891
321,-0.038891
322,-0.038891
323,-0.038891
324,-0.038891
325,-0.038891
326,-0.038891
327,-0.038891
328,-0.038891
329,-0.038891
330,-0.038891
331,-0.038891
332,-0.038891
333,-0.038891
334,-0.038891
335,-0.038891
336,-0.038891
337,-0.038891
338,-0.038891
339,-0.038891
340,-0.038891
341,-0.038891
342,-0.038891
343,-0.038891
344,-0.038891
345,-0.038891
346,-0.038891
347,-0.038891
348,-0.038891
349,-0.038891
350,-0.038891
351,-0.038891
352,-0.038891
353,-0.038891
354,-0.038891
355,-0.038891
356,-0.038891
357,-0.038891
358,-0.038891
359,-0.038891
360,-0.038891
361,-0.038891
362,-0.038891
363,-0.038891
364,-0.038891
365,-0.038891
366,-0.038891
367,-0.038891
368,-0.038891
369,-0.038891
370,-0.038891
371,-0.038891
372,-0.038891
373,-0.038891
374,-0.038891
375,-0.038891
376,-0.038891
377,-0.038891
378,-0.038891
379,-0.038891
380,-0.038891
381,-0.038891
382,-0.038891
383,-0.038891
384,-0.038891
385,-0.038891
386,-0.038891
387,-0.038891
388,-0.038891
389,-0.038891
390,-0.038891
391,-0.038891
392,-4.0391
393,-0.038891
394,-0.038891
395,-0.038891
396,-0.038891
397,-0.038891
398,-0.038891
399,-0.038891
400,-0.038891
401,-0.038891
402,-0.038891
403,-0.038891
404,-0.038891
405,3.9614
406,-0.038891
407,-0.038891
408,-0.038891
409,-0.038891
410,-0.038891
411,-0.038891
412,-0.038891
413,-0.038891
414,-0.038891
415,-0.038891
416,-0.038891
417,-0.038891
418,-0.038891
419,-0.038891
420,-0.038891
421,-0.038891
422,-0.038891
423,-0.038891
424,-0.038891
425,-0.038891
426,-0.038891
427,-0.038891
428,-0.038891
429,-0.038891
430,-0.038891
431,-0.038891
432,-0.038891
433,-0.038891
434,-0.038891
435,-0.038891
436,-0.038891
437,3.9614
438,-0.038891
439,-4.0391
440,-0.038891
441,-0.038891
442,-0.038891
443,-0.038891
444,-0.038891
445,-0.038891
446,-0.038891
447,-0.038891
448,-0.038891
449,-0.038891
450,-0.038891
451,-0.038891
452,-0.038891
453,-0.038891
454,-0.038891
455,-0.038891
456,-0.038891
457,-0.038891
458,-0.038891
459,-0.038891
460,-0.038891
461,-0.038891
462,-0.038891
463,-0.038891
464,-0.038891
465,-0.038891
466,-0.038891
467,-0.038891
468,-0.038891
469,-0.038891
470,-0.038891
471,-0.038891
472,-0.038891
473,-0.038891
474,-0.038891
475,-0.038891
476,-0.038891
477,-0.038891
478,-0.038891
479,-0.038891
480,-0.038891
481,-0.038891
482,-4.0391
483,-0.038891
484,-0.038891
485,-0.038891
486,-0.038891
487,-0.038891
488,-0.038891
489,-0.038891
490,-0.038891
491,-0.038891
492,-0.038891
493,-0.038891
494,-0.038891
495,-0.038891
496,-0.038891
497,-0.038891
498,-0.038891
499,-0.038891
500,-0.038891
501,-0.038891
502,-4.0391
503,-0.038891
504,-0.038891
505,-0.038891
506,-0.038891
507,-0.038891
508,-0.038891
509,-0.038891
510,-0.038891
511,-0.038891
512,-4.0391
513,-0.038891
514,-0.038891
515,-0.038891
516,-0.038891
517,-0.038891
518,-0.038891
519,-0.038891
520,-0.038891
521,-0.038891
522,-0.038891
523,-0.038891
524,-4.0391
525,-0.038891
526,-0.038891
527,-0.038891
528,-0.038891
529,-0.038891
530,-4.0391
531,-0.038891
532,-0.038891
533,-0.038891
534,-0.038891
535,-4.0391
536,-0.038891
537,-0.038891
538,-0.038891
539,-0.038891
540,-4.0391
541,-0.038891
542,-0.038891
543,-0.038891
544,-0.038891
545,-0.038891
546,-4.0391
547,-0.038891
548,-0.038891
549,-0.038891
550,-0.038891
551,-0.038891
552,-4.0391
553,-0.038891
554,-0.038891
555,-0.038891
556,-0.038891
557,-4.0391
558,-0.038891
559,-0.038891
560,-0.038891
561,-0.038891
562,-4.0391
563,-0.038891
564,-0.038891
565,-0.038891
566,-0.038891
567,-0.038891
568,-0.038891
569,-0.038891
570,-0.038891
571,-0.038891
572,-0.038891
573,-0.038891
574,-0.038891
575,-0.038891
576,-0.038891
577,-0.038891
578,-0.038891
579,-0.038891
580,-0.038891
581,-0.038891
582,-0.038891
583,-0.038891
584,-0.038891
585,-0.038891
586,-0.038891
587,-0.038891
588,-4.0391
589,-0.038891
590,-0.038891
591,-0.038891
592,-0.038891
593,-0.038891
594,-0.038891
595,-0.038891
596,-0.038891
597,-0.038891
598,-0.038891
599,-0.038891
600,-0.038891
601,-0.038891
602,-0.038891
603,-0.038891
604,-0.038891
605,-0.038891
606,-0.038891
607,-0.038891
608,-0.038891
609,-0.038891
610,3.9614
611,-4.0391
612,3.9614
613,-0.038891
614,-4.0391
615,-0.038891
616,-0.038891
617,3.9614
618,-0.038891
619,-0.038891
620,-0.038891
621,-0.038891
622,-0.038891
623,-0.038891
624,-0.038891
625,-0.038891
626,-0.038891
627,-0.038891
628,-0.038891
629,-0.038891
630,-0.038891
631,-0.038891
632,-0.038891
633,-0.038891
634,-0.038891
635,-0.038891
636,-0.038891
637,-0.038891
638,-0.038891
639,-0.038891
640,-0.038891
641,-0.038891
642,-0.038891
643,-0.038891
644,-0.038891
645,-0.038891
646,-0.038891
647,-0.038891
648,-0.038891
649,-0.038891
650,-0.038891
651,-0.038891
652,-0.038891
653,-0.038891
654,-0.038891
655,-0.038891
656,-0.038891
657,-0.038891
658,-0.038891
659,-0.038891
660,-0.038891
661,-0.038891
662,-0.038891
663,-0.038891
664,-0.038891
665,-0.038891
666,-0.038891
667,3.9614
668,-0.038891
669,-0.038891
670,-0.038891
671,-0.038891
672,-0.038891
673,-0.038891
674,-0.038891
675,-0.038891
676,-0.038891
677,-0.038891
678,-0.038891
679,3.9614
680,-0.038891
681,-0.038891
682,-0.038891
683,-0.038891
684,-0.038891
685,-0.038891
686,-0.038891
687,-0.038891
688,-0.038891
689,-0.038891
690,-0.038891
691,-0.038891
692,-0.038891
693,-0.038891
694,-0.038891
695,-0.038891
696,-0.038891
697,-0.038891
698,-0.038891
699,-0.038891
700,-0.038891
701,-0.038891
702,-0.038891
703,-0.038891
704,3.9614
705,-0.038891
706,-0.038891
707,-0.038891
708,-0.038891
709,-0.038891
710,-0.038891
711,-0.038891
712,-0.038891
713,-0.038891
714,-0.038891
715,-0.038891
716,-0.038891
717,-0.038891
718,-0.038891
719,-0.038891
