time,value
0,0.23806
1,-0.010351
2,-0.057808000000000005
3,-0.026581999999999998
4,0.065914
5,0.03723
6,-0.10427
7,-0.067879
8,0.11383
9,-0.4035
10,-0.51046
11,0.77437
12,0.036425
13,0.35763
14,0.2751
15,-0.17698
16,-0.15029
17,-0.1487
18,-0.65822
19,-0.12172999999999999
20,-0.14372000000000001
21,-0.12113
22,-0.52248
23,0.19022999999999998
24,-0.49421000000000004
25,0.042143
26,-0.038576
27,-0.7932
28,0.47638
29,0.041904000000000004
30,0.24879
31,-0.0023866
32,-0.19772
33,0.46465
34,-0.54096
35,-0.053501
36,0.13923
37,0.13907
38,0.5564100000000001
39,0.30879
40,-0.061235000000000005
41,-0.10475
42,0.0080403
43,0.42878
44,0.33744
45,-0.15574000000000002
46,-0.15862
47,0.1656
48,-0.24061999999999997
49,0.053712
50,-0.364
51,-0.41638000000000003
52,-0.0091336
53,0.34944000000000003
54,-0.27818000000000004
55,0.09764500000000001
56,-0.21781999999999999
57,0.075913
58,0.26241
59,0.3966
60,-0.40016999999999997
61,-0.48396999999999996
62,1.6096
63,1.6096
64,1.6096
65,1.6096
66,1.6096
67,1.6096
68,1.6096
69,1.6096
70,1.6096
71,1.6096
72,1.6096
73,1.6096
74,1.6096
75,1.6096
76,-1.5918
77,-1.5918
78,-1.5918
79,-1.5918
80,-1.5918
81,-1.5918
82,-1.5918
83,-1.5918
84,-1.5918
85,-1.5918
86,-1.5918
87,-1.5918
88,-1.5918
89,-1.5918
90,1.1445
91,1.6096
92,1.6096
93,1.6096
94,1.6096
95,1.6096
96,1.6096
97,1.6096
98,1.6096
99,1.6096
100,-1.5918
101,-1.5918
102,-1.5918
103,-1.5918
104,-1.5918
105,-1.5918
106,-1.5918
107,-1.5918
108,-1.5918
109,-0.31261
110,0.25837
111,0.013872999999999998
112,0.61879
113,0.11821
114,0.51598
115,0.10664000000000001
116,0.050736
117,-0.37395
118,-0.3524
119,-0.4726
120,-0.16492
121,-0.40423000000000003
122,0.013911000000000001
123,-0.23726999999999998
124,-0.058292
125,0.17414000000000002
126,0.038686
127,0.4671
