time,value
0,-0.19647
1,0.33701
2,0.30564
3,-0.010447
4,-0.45947
5,0.10527
6,-0.14438
7,0.11622
8,-0.12696
9,0.1732
10,0.55457
11,-0.21936999999999998
12,0.20831
13,-0.067096
14,-0.18509
15,-0.39281
16,-0.4229
17,-0.22916
18,0.27907
19,-0.39449
20,0.014358000000000001
21,-0.22016
22,-0.13582
23,0.15313
24,0.07482799999999999
25,0.1639
26,-0.71992
27,0.083287
28,0.29557
29,-0.017981
30,-0.46942
31,0.45252
32,-0.13499
33,-0.17570999999999998
34,-0.03723
35,0.41898
36,-0.054962000000000004
37,0.64376
38,0.14501
39,-0.095368
40,-0.44841000000000003
41,0.00069895
42,0.15605
43,-0.24148000000000003
44,-0.21276
45,-0.10837999999999999
46,-0.23440999999999998
47,0.14204
48,0.13377
49,-0.31629
50,-0.48178000000000004
51,-0.054394000000000005
52,-0.050336
53,0.132
54,0.15941
55,0.073384
56,0.063193
57,-0.30449
58,-0.082669
59,0.065559
60,-0.2137
61,-0.33671
62,-0.35258
63,0.9208700000000001
64,0.23068000000000002
65,-0.027599000000000002
66,-0.36075999999999997
67,-0.78868
68,0.62673
69,0.25313
70,0.10651
71,0.017294999999999998
72,0.029301999999999998
73,0.099427
74,1.5408
75,1.5408
76,1.5408
77,1.5408
78,1.5408
79,1.5408
80,1.5408
81,1.5408
82,1.5408
83,1.5408
84,1.5408
85,1.5408
86,1.5408
87,1.5408
88,-1.5291
89,-1.5291
90,-1.5291
91,-1.5291
92,-1.5291
93,-1.5291
94,-1.5291
95,-1.5291
96,-1.5291
97,-1.5291
98,-1.5291
99,-1.5291
100,-1.5291
101,-1.5291
102,1.5408
103,1.5408
104,1.5408
105,1.5408
106,1.5408
107,1.5408
108,1.5408
109,1.5408
110,1.5408
111,1.5408
112,1.5408
113,1.5408
114,-1.5291
115,-1.5291
116,-1.5291
117,-1.5291
118,-1.5291
119,-1.5291
120,-1.5291
121,-1.5291
122,-1.5291
123,-1.5291
124,-1.5291
125,-0.075937
126,0.14006
127,-0.10438
