time,value
0,-0.64657
1,-0.66315
2,-0.48962
3,-0.24370999999999998
4,0.07811799999999999
5,0.37134
6,0.60016
7,0.83672
8,1.156
9,1.3744
10,1.4384
11,1.4702
12,1.5033
13,1.5459
14,1.4675
15,1.2491
16,0.98849
17,0.7438600000000001
18,0.46401000000000003
19,0.18374000000000001
20,-0.092789
21,-0.36371
22,-0.58592
23,-0.65185
24,-0.61669
25,-0.45453000000000005
26,-0.21191
27,0.047531
28,0.27928000000000003
29,0.55596
30,0.81503
31,1.0985
32,1.3209
33,1.3797
34,1.5089
35,1.4905
36,1.4358
37,1.4201
38,1.5034
39,1.4869999999999999
40,1.5114
41,1.4834
42,1.1993
43,0.90633
44,0.61856
45,0.34356
46,0.073792
47,-0.20801
48,-0.39914
49,-0.5825100000000001
50,-0.779
51,-0.7761399999999999
52,-0.82744
53,-0.9461299999999999
54,-1.0628
55,-1.1875
56,-1.2491
57,-1.3062
58,-1.2628
59,-1.1645
60,-1.0904
61,-0.97188
62,-0.8519700000000001
63,-0.76505
64,-0.64362
65,-0.5845199999999999
66,-0.6764600000000001
67,-0.76715
68,-0.88886
69,-0.94199
70,-1.0233
71,-1.1372
72,-1.1978
73,-1.2677
74,-1.2605
75,-1.2006
76,-1.1302
77,-1.0125
78,-0.92761
79,-0.83914
