time,value
0,-0.86861
1,0.4165
2,1.9119
3,3.1395
4,3.7
5,3.4546
6,2.5852
7,1.4976
8,0.62558
9,0.23675
10,0.33897
11,0.72026
12,1.0902
13,1.2376
14,1.1209
15,0.8535200000000001
16,0.61102
17,0.52174
18,0.6028399999999999
19,0.76886
20,0.89591
21,0.89869
22,0.7733300000000001
23,0.5907600000000001
24,0.45168
25,0.43426000000000003
26,0.55938
27,0.7881100000000001
28,1.0449
29,1.2512
30,1.3517
31,1.3272
32,1.1924
33,0.9853700000000001
34,0.7508199999999999
35,0.5262399999999999
36,0.33326
37,0.1761
38,0.047077999999999995
39,-0.063993
40,-0.16059
41,-0.23801999999999998
42,-0.28881
43,-0.31168
44,-0.3101
45,-0.30458
46,-0.31732
47,-0.35888000000000003
48,-0.42213
49,-0.48956000000000005
50,-0.54209
51,-0.56701
52,-0.56543
53,-0.55097
54,-0.5407
55,-0.54304
56,-0.55811
57,-0.5795399999999999
58,-0.60004
59,-0.6127100000000001
60,-0.6187199999999999
61,-0.62347
62,-0.63295
63,-0.6451399999999999
64,-0.65713
65,-0.66609
66,-0.67143
67,-0.6735
68,-0.67684
69,-0.68598
70,-0.69948
71,-0.71163
72,-0.71883
73,-0.7219300000000001
74,-0.72315
75,-0.72755
76,-0.73952
77,-0.75942
78,-0.77937
79,-0.7914399999999999
80,-0.7929
81,-0.7901199999999999
82,-0.7925
83,-0.8094100000000001
84,-0.8417600000000001
85,-0.8794200000000001
86,-0.9045
87,-0.90509
88,-0.8845299999999999
89,-0.86214
90,-0.86326
91,-0.90369
92,-0.97557
93,-1.0439
94,-1.0606
95,-0.9887600000000001
96,-0.82389
97,-0.599
98,-0.37342
