time,value
0,-0.54461
1,-0.4926
2,-0.35493
3,-0.13905
4,0.11602
5,0.376
6,0.53456
7,0.8145100000000001
8,1.1414
9,1.3035
10,1.3471
11,1.412
12,1.3964
13,1.416
14,1.3548
15,1.1296
16,0.82119
17,0.58404
18,0.40094
19,0.096386
20,-0.1738
21,-0.42193
22,-0.54962
23,-0.54835
24,-0.45556
25,-0.30371
26,-0.0908
27,0.15350999999999998
28,0.43278999999999995
29,0.69465
30,0.96421
31,1.2257
32,1.521
33,1.5336
34,1.3389
35,1.2616
36,1.3516
37,1.3359999999999999
38,1.4011
39,1.43
40,1.4211
41,1.53
42,1.3249
43,1.1001
44,0.80211
45,0.49344
46,0.15707000000000002
47,-0.066191
48,-0.3066
49,-0.46498999999999996
50,-0.62356
51,-0.73758
52,-0.8457399999999999
53,-0.9371700000000001
54,-1.1151
55,-1.286
56,-1.3824
57,-1.4234
58,-1.3739
59,-1.3015
60,-1.2003
61,-0.99485
62,-0.81705
63,-0.6803100000000001
64,-0.58054
65,-0.6974199999999999
66,-0.8055100000000001
67,-0.9485600000000001
68,-1.0408
69,-1.166
70,-1.2473
71,-1.3073
72,-1.3096
73,-1.3235
74,-1.2496
75,-1.1515
76,-1.0319
77,-0.8551700000000001
78,-0.7557
79,-0.61569
