time,value
0,-0.44705
1,-0.44705
2,-0.44705
3,-0.44705
4,-0.44705
5,-0.44705
6,-0.44705
7,-0.44705
8,-0.44705
9,-0.44705
10,-0.44705
11,-0.44705
12,-0.45097
13,-0.45726000000000006
14,-0.47011000000000003
15,-0.49526000000000003
16,-0.52042
17,-0.54557
18,-0.5707300000000001
19,-0.58836
20,-0.6040800000000001
21,-0.6116
22,-0.6116
23,-0.6116
24,-0.6116
25,-0.6116
26,-0.6116
27,-0.6116
28,-0.6116
29,-0.6116
30,-0.6116
31,-0.6116
32,-0.6116
33,-0.6116
34,-0.6116
35,-0.6116
36,-0.6116
37,-0.6116
38,-0.6116
39,-0.6116
40,-0.6116
41,-0.6116
42,-0.6116
43,-0.6116
44,-0.6116
45,-0.6116
46,-0.6116
47,-0.6116
48,-0.6116
49,-0.6116
50,-0.6116
51,-0.6116
52,-0.6116
53,-0.6116
54,-0.6116
55,-0.6116
56,-0.6116
57,-0.61197
58,-0.61511
59,-0.61826
60,-0.6399
61,-0.66505
62,-0.69021
63,-0.71536
64,-0.7459899999999999
65,-0.79001
66,-0.83485
67,-0.93547
68,-1.0361
69,-1.1367
70,-1.2373
71,-1.3336
72,-1.4247
73,-1.5130000000000001
74,-1.5884
75,-1.6639
76,-1.7394
77,-1.8148
78,-1.8742
79,-1.9246
80,-1.9658
81,-1.9909
82,-2.0161
83,-2.0412
84,-2.0664
85,-2.066
86,-2.0597
87,-2.0433
88,-2.0182
89,-1.993
90,-1.9678
91,-1.9427
92,-1.8804
93,-1.8175
94,-1.7456
95,-1.6702
96,-1.5947
97,-1.5193
98,-1.4508
99,-1.4194
100,-1.3879
101,-1.3619999999999999
102,-1.3369
103,-1.3117
104,-1.2866
105,-1.2866
106,-1.3369
107,-1.3872
108,-1.4375
109,-1.4878
110,-1.5283
111,-1.5659999999999998
112,-1.5591
113,-1.5088
114,-1.4585
115,-1.4082
116,-1.3579
117,-1.2895
118,-1.2203
119,-1.1126
120,-0.98682
121,-0.86105
122,-0.73528
123,-0.60951
124,-0.48373
125,-0.35796
126,-0.23219
127,-0.49856999999999996
128,0.13029000000000002
129,0.14513
130,0.2709
131,0.39666999999999997
132,0.52244
133,0.64822
134,0.77399
135,0.89976
136,1.0255
137,1.1438
138,1.2538
139,1.3619999999999999
140,1.4626
141,1.5632
142,1.6638
143,1.7644
144,1.8158
145,1.841
146,1.8567
147,1.8567
148,1.8567
149,1.8567
150,1.8567
151,1.8567
152,1.8567
153,1.8567
154,1.8567
155,1.8567
156,1.8567
157,1.8567
158,1.8567
159,1.8567
160,1.8567
161,1.8567
162,1.8539
163,1.8476
164,1.8336
165,1.7833
166,1.733
167,1.6827
168,1.6324
169,1.5859999999999999
170,1.5419999999999998
171,1.5045
172,1.4794
173,1.4542
174,1.4291
175,1.4039
176,1.3712
177,1.3366
178,1.2938
179,1.2435
180,1.1932
181,1.1429
182,1.0926
183,1.0423
184,0.9919899999999999
185,0.9416899999999999
186,0.89138
187,0.8410700000000001
188,0.79076
189,0.74045
190,0.69014
191,0.63983
192,0.5895199999999999
193,0.5392100000000001
194,0.4889
195,0.4386
196,0.3943
197,0.36286
198,0.33169
199,0.30653
200,0.28138
201,0.25623
202,0.23106999999999997
203,0.22760999999999998
204,0.24647
205,0.26671
206,0.29186
207,0.31701999999999997
208,0.34217
209,0.36732
210,0.39248
211,0.41763
212,0.44278999999999996
213,0.46793999999999997
214,0.49237
215,0.5112300000000001
216,0.5301
217,0.5119600000000001
218,0.48681
219,0.46165
220,0.4365
221,0.41317
222,0.3943
223,0.37571
224,0.37571
225,0.37571
226,0.37571
227,0.37571
228,0.37134
229,0.3619
230,0.34951
231,0.32435
232,0.2992
233,0.27404
234,0.24889
235,0.23175
236,0.21918
237,0.21116
238,0.21116
239,0.21116
240,0.21116
241,0.21116
242,0.21116
243,0.21116
244,0.21116
245,0.21116
246,0.21116
247,0.21116
248,0.21116
249,0.22975
250,0.24861999999999998
251,0.27195
252,0.2971
253,0.32226
254,0.34741
255,0.36906
256,0.3722
257,0.37535
258,0.37571
259,0.37571
260,0.37571
261,0.37571
262,0.38409
263,0.40925
264,0.4344
265,0.45956
266,0.48471000000000003
267,0.50248
268,0.5182100000000001
269,0.50043
270,0.45011999999999996
271,0.39982
272,0.34951
273,0.2992
274,0.26092
275,0.22319
276,0.21116
277,0.21116
278,0.21116
279,0.21116
280,0.21116
281,0.21116
282,0.21116
283,0.21116
284,0.21116
285,0.21116
286,0.21116
287,0.21116
288,0.21116
289,0.21116
290,0.21116
291,0.21116
292,0.21116
293,0.21116
294,0.21116
295,0.21116
296,0.21116
297,0.21116
298,0.21116
299,0.21116
300,0.21116
301,0.21116
302,0.21116
303,0.21116
304,0.21116
305,0.21116
306,0.21116
307,0.21116
308,0.21116
309,0.21116
310,0.21116
311,0.21116
312,0.21116
313,0.21116
314,0.21116
315,2.0278
316,2.0278
317,2.0278
318,2.0278
319,2.0278
320,2.0278
321,2.0278
322,2.0278
323,2.0278
324,2.0278
325,2.0278
326,2.0278
327,2.0194
328,2.0059
329,1.9785
330,1.9247
331,1.8709
332,1.8172
333,1.7634
334,1.7257
335,1.6921
336,1.6761
337,1.6761
338,1.6761
339,1.6761
340,1.6761
341,1.6761
342,1.6761
343,1.6761
344,1.6761
345,1.6761
346,1.6761
347,1.6761
348,1.6761
349,1.6761
350,1.6761
351,1.6761
352,1.6761
353,1.6761
354,1.6761
355,1.6761
356,1.6761
357,1.6761
358,1.6761
359,1.6761
360,1.6761
361,1.6761
362,1.6761
363,1.6761
364,1.6761
365,1.6761
366,1.6761
367,1.6761
368,1.6761
369,1.6761
370,1.6761
371,1.6761
372,1.6748
373,1.6636
374,1.6524
375,1.5753
376,1.4857
377,1.3961
378,1.3064
379,1.2181
380,1.133
381,1.0481
382,0.97641
383,0.9047299999999999
384,0.83305
385,0.76136
386,0.6928
387,0.62783
388,0.56498
389,0.51122
390,0.45746000000000003
391,0.4037
392,0.34994000000000003
393,0.30189
394,0.25709
395,0.21553000000000003
396,0.17969000000000002
397,0.14385
398,0.10801
399,0.39434
400,0.30603
401,0.23883000000000001
402,0.20767
403,0.20767
404,0.20767
405,0.20767
406,0.20767
407,0.20767
408,0.20767
409,0.20767
410,0.20767
411,0.20767
412,0.20767
413,0.18267
414,0.21988000000000002
415,-0.13094
416,-0.30755
417,-0.48676
418,-0.13989000000000001
419,-0.17574
420,-0.2056
421,-0.22353
422,-0.24145
423,-0.25937
424,-0.27729000000000004
425,-0.2917
426,-0.30514
427,-0.30267
428,-0.28475
429,-0.26683
430,-0.24891
431,-0.23099
432,-0.21736
433,-0.20392000000000002
434,-0.19963
435,-0.19963
436,-0.19963
437,-0.19963
438,-0.19788
439,-0.18444000000000002
440,-0.171
441,-0.1384
442,-0.47928999999999994
443,-0.30009
444,-0.12088
445,0.044691
446,0.1791
447,0.3122
448,0.4018
449,0.09158
450,0.1095
451,0.12742
452,0.13463
453,0.13015
454,0.12294000000000001
455,0.10502
456,0.46901000000000004
457,0.3794
458,0.2898
459,0.24403000000000002
460,0.22163000000000002
461,0.20767
462,0.20767
463,0.20767
464,0.20767
465,0.20767
466,0.20767
467,0.20767
468,0.20767
469,0.20767
470,0.20767
471,0.20767
472,0.20767
473,0.2372
474,-0.15075
475,-0.32995
476,-0.10853
477,-0.14337
478,-0.17697000000000002
479,-0.20784
480,-0.22576
481,-0.24368
482,-0.26161
483,-0.27953
484,-0.30024
485,-0.32264
486,-0.34972
487,-0.38556
488,-0.4214
489,-0.45724
490,-0.49308
491,-0.52357
492,-0.55269
493,-0.57596
494,-0.59388
495,-0.6118100000000001
496,-0.62973
497,-0.64765
498,-0.66557
499,-0.6834899999999999
500,-0.7014100000000001
501,-0.71933
502,-0.73725
503,-0.75517
504,-0.77147
505,-0.7781899999999999
506,-0.78491
507,-0.78578
508,-0.78578
509,-0.78578
510,-0.78578
511,-0.78578
512,-0.78578
513,-0.78578
514,-0.78578
515,-0.78578
516,-0.78578
517,-0.78578
518,-0.78578
519,-0.78578
520,-0.78578
521,-0.78578
522,-0.78578
523,-0.78578
524,-0.78578
525,-0.79773
526,-0.81565
527,-0.83357
528,-0.85149
529,-0.86915
530,-0.8848299999999999
531,-0.9005200000000001
532,-0.9030100000000001
533,-0.9030100000000001
534,-0.9030100000000001
535,-0.9030100000000001
536,-0.9030100000000001
537,-0.9030100000000001
538,-0.9030100000000001
539,-0.9030100000000001
540,-0.9030100000000001
541,-0.9030100000000001
542,-0.9030100000000001
543,-0.9030100000000001
544,-0.9030100000000001
545,-0.9030100000000001
546,-0.9030100000000001
547,-0.9030100000000001
548,-0.9030100000000001
549,-0.9030100000000001
550,-0.9030100000000001
551,-0.9030100000000001
552,-0.9030100000000001
553,-0.9030100000000001
554,-0.9030100000000001
555,-0.9030100000000001
556,-0.9030100000000001
557,-0.9030100000000001
558,-0.9030100000000001
559,-0.9030100000000001
560,-0.9030100000000001
561,-0.9030100000000001
562,-0.9030100000000001
563,-0.9030100000000001
564,-0.8897700000000001
565,-0.8763299999999999
566,-0.8597100000000001
567,-0.8417899999999999
568,-0.8238700000000001
569,-0.80594
570,-0.79302
571,-0.8064600000000001
572,-0.81991
573,-0.83731
574,-0.8552299999999999
575,-0.87315
576,-0.89107
577,-0.9030100000000001
578,-0.9030100000000001
579,-0.9030100000000001
580,-0.9030100000000001
581,-0.9030100000000001
582,-0.9030100000000001
583,-0.9030100000000001
584,-0.9030100000000001
585,-0.9030100000000001
586,-0.9030100000000001
587,-0.9030100000000001
588,-0.9030100000000001
589,-0.9030100000000001
590,-0.9030100000000001
591,-0.9030100000000001
592,-0.9030100000000001
593,-0.9030100000000001
594,-0.9030100000000001
595,-0.9030100000000001
596,-0.9030100000000001
597,-0.9030100000000001
598,-0.9030100000000001
599,-0.9030100000000001
600,-0.9030100000000001
601,-0.9030100000000001
602,-0.9030100000000001
603,-0.9030100000000001
604,-0.9030100000000001
605,-0.9030100000000001
606,-0.9030100000000001
607,-0.9030100000000001
608,-0.9030100000000001
609,-0.9030100000000001
610,-0.9030100000000001
611,-0.9030100000000001
612,-0.9030100000000001
613,-0.9030100000000001
614,-0.9030100000000001
615,-0.9030100000000001
616,-0.9030100000000001
617,-0.9030100000000001
618,-0.9030100000000001
619,-0.9030100000000001
620,-0.9030100000000001
621,-0.9030100000000001
622,-0.9030100000000001
623,-0.9030100000000001
624,-0.9030100000000001
625,-0.9030100000000001
626,-0.9030100000000001
627,-0.9030100000000001
628,-0.9030100000000001
629,-0.9030100000000001
630,-1.57
631,-1.57
632,-1.57
633,-1.57
634,-1.57
635,-1.57
636,-1.57
637,-1.57
638,-1.57
639,-1.57
640,-1.57
641,-1.57
642,-1.5502
643,-1.5185
644,-1.4537
645,-1.3269
646,-1.2
647,-1.0732
648,-0.94631
649,-0.8573799999999999
650,-0.7781
651,-0.7401800000000001
652,-0.7401800000000001
653,-0.7401800000000001
654,-0.7401800000000001
655,-0.7401800000000001
656,-0.7401800000000001
657,-0.7401800000000001
658,-0.7401800000000001
659,-0.7401800000000001
660,-0.7401800000000001
661,-0.7401800000000001
662,-0.7401800000000001
663,-0.7401800000000001
664,-0.7401800000000001
665,-0.7401800000000001
666,-0.7401800000000001
667,-0.7401800000000001
668,-0.7401800000000001
669,-0.7401800000000001
670,-0.7401800000000001
671,-0.7401800000000001
672,-0.7401800000000001
673,-0.7401800000000001
674,-0.7401800000000001
675,-0.7401800000000001
676,-0.7401800000000001
677,-0.7401800000000001
678,-0.7401800000000001
679,-0.7401800000000001
680,-0.7401800000000001
681,-0.7401800000000001
682,-0.7401800000000001
683,-0.7401800000000001
684,-0.7401800000000001
685,-0.7401800000000001
686,-0.7401800000000001
687,-0.73902
688,-0.72892
689,-0.71883
690,-0.64937
691,-0.56865
692,-0.48793000000000003
693,-0.40721
694,-0.32983
695,-0.26064
696,-0.19195
697,-0.15736
698,-0.12276
699,-0.40731999999999996
700,-0.23435
701,-0.0714
702,0.079953
703,0.22451999999999997
704,0.33983
705,0.45515
706,0.10739000000000001
707,0.13045
708,0.16455
709,0.20490999999999998
710,0.25154
711,0.3092
712,0.36685
713,0.42451000000000005
714,0.48217
715,0.54568
716,0.61054
717,0.67773
718,0.74692
719,0.81611
720,0.8853
721,0.95449
722,1.0152
723,1.0757
724,1.1342
725,1.1918
726,1.2495
727,1.3072
728,1.3632
729,1.4108
730,1.4583
731,1.5046
732,1.5508
733,1.5969
734,1.643
735,1.6815
736,1.7045
737,1.7276
738,1.7507
739,1.7737
740,1.7956
741,1.8173
742,1.8338
743,1.8453
744,1.8568
745,1.8684
746,1.8799
747,1.8832
748,1.886
749,1.8713
750,1.8482
751,1.8251
752,1.8021
753,1.7790000000000001
754,1.7559
755,1.7329
756,1.7098
757,1.6867
758,1.6637
759,1.6406
760,1.6193
761,1.6019999999999999
762,1.5849
763,1.5734
764,1.5618
765,1.5503
766,1.5388
767,1.5238
768,1.505
769,1.4854
770,1.4624
771,1.4393
772,1.4162
773,1.3932
774,1.3757
775,1.3613
776,1.348
777,1.3365
778,1.3249
779,1.3134
780,1.3019
781,1.2819999999999998
782,1.2604
783,1.238
784,1.2149
785,1.1918
786,1.1688
787,1.1457
788,1.1111
789,1.0765
790,1.0419
791,1.0073
792,0.97275
793,0.93815
794,0.90356
795,0.8689600000000001
796,0.8343700000000001
797,0.79977
798,0.76518
799,0.72878
800,0.6913100000000001
801,0.65082
802,0.60469
803,0.55857
804,0.51244
805,0.46631000000000006
806,0.42363
807,0.38183
808,0.34379
809,0.3092
810,0.2746
811,0.24001
812,0.20540999999999998
813,0.18200999999999998
814,0.15895
815,0.14390999999999998
816,0.13238
817,0.12084
818,0.10930999999999999
819,0.098826
820,0.094502
821,0.4844
822,0.48158
823,0.48158
824,0.48158
825,0.48158
826,0.09237100000000001
827,0.10102
828,0.10979000000000001
829,0.12133
830,0.13285999999999998
831,0.14439000000000002
832,0.15592
833,0.16247999999999999
834,0.16392
835,0.16505
836,0.16505
837,0.16505
838,0.16505
839,0.16505
840,0.16505
841,0.16505
842,0.16505
843,0.16505
844,0.16488
845,0.16344
846,0.162
847,0.15208
848,0.14054
849,0.12900999999999999
850,0.11748
851,0.10511
852,0.48701000000000005
853,0.41431
854,0.29899000000000003
855,0.18367999999999998
856,0.068359
857,-0.26558000000000004
858,-0.1723
859,-0.30924
860,-0.45297
861,-0.13189
862,-0.16649
863,-0.20108
864,-0.23568000000000003
865,-0.26659
866,-0.29541999999999996
867,-0.32216
868,-0.34523000000000004
869,-0.36829
870,-0.39135
871,-0.41441999999999996
872,-0.43748000000000004
873,-0.46053999999999995
874,-0.48361000000000004
875,-0.50667
876,-0.52973
877,-0.5528
878,-0.57586
879,-0.59892
880,-0.6219899999999999
881,-0.64505
882,-0.66811
883,-0.69118
884,-0.71424
885,-0.7373
886,-0.76036
887,-0.7834300000000001
888,-0.8064899999999999
889,-0.8295600000000001
890,-0.85262
891,-0.8756799999999999
892,-0.89874
893,-0.92181
894,-0.9448700000000001
895,-0.9679399999999999
896,-0.991
897,-1.0129
898,-1.0346
899,-1.0511
900,-1.0626
901,-1.0741
902,-1.0857
903,-1.0972
904,-1.1087
905,-1.1202
906,-1.1318
907,-1.1433
908,-1.1548
909,-1.1664
910,-1.1768
911,-1.1797
912,-1.1825
913,-1.1731
914,-1.1616
915,-1.15
916,-1.1385
917,-1.1287
918,-1.123
919,-1.1174
920,-1.1174
921,-1.1174
922,-1.1174
923,-1.1174
924,-1.1139
925,-1.1067
926,-1.0986
927,-1.0871
928,-1.0756
929,-1.064
930,-1.0525
931,-1.041
932,-1.0294
933,-1.0179
934,-1.0064
935,-0.99484
936,-0.98331
937,-0.97178
938,-0.95191
939,-0.93029
940,-0.9078700000000001
941,-0.88481
942,-0.86175
943,-0.83868
944,-0.81562
