time,value
0,-1.3955
1,-1.3999
2,-1.3962
3,-1.3806
4,-1.3519999999999999
5,-1.3116
6,-1.2632
7,-1.2114
8,-1.1584
9,-1.1042
10,-1.0484
11,-0.9910399999999999
12,-0.9324100000000001
13,-0.87426
14,-0.81975
15,-0.77055
16,-0.72669
17,-0.6875
18,-0.65274
19,-0.6211399999999999
20,-0.59273
21,-0.5694
22,-0.55266
23,-0.54277
24,-0.53927
25,-0.54193
26,-0.54785
27,-0.55465
28,-0.56177
29,-0.5694899999999999
30,-0.5776
31,-0.58636
32,-0.59722
33,-0.60843
34,-0.61821
35,-0.626
36,-0.63248
37,-0.63776
38,-0.64299
39,-0.6510699999999999
40,-0.66178
41,-0.67379
42,-0.68575
43,-0.69672
44,-0.70418
45,-0.70689
46,-0.70599
47,-0.70104
48,-0.6919
49,-0.67937
50,-0.66503
51,-0.64825
52,-0.62952
53,-0.6106
54,-0.59103
55,-0.57014
56,-0.5479999999999999
57,-0.52562
58,-0.50162
59,-0.47668
60,-0.45305
61,-0.43137
62,-0.41153999999999996
63,-0.39358000000000004
64,-0.37806
65,-0.36163
66,-0.34287
67,-0.32252
68,-0.30157
69,-0.28084000000000003
70,-0.26244
71,-0.24986
72,-0.24156
73,-0.23643000000000003
74,-0.2343
75,-0.2353
76,-0.23815999999999998
77,-0.24374
78,-0.25571
79,-0.27347
80,-0.29606
81,-0.32311999999999996
82,-0.35488000000000003
83,-0.38734
84,-0.41834
85,-0.44943
86,-0.47922
87,-0.50608
88,-0.53059
89,-0.55648
90,-0.5808
91,-0.60202
92,-0.62133
93,-0.63662
94,-0.64341
95,-0.6401
96,-0.63156
97,-0.61537
98,-0.59263
99,-0.56767
100,-0.54261
101,-0.51442
102,-0.48138000000000003
103,-0.4478
104,-0.40899
105,-0.36351999999999995
106,-0.31316
107,-0.26004
108,-0.20132
109,-0.13627999999999998
110,-0.068209
111,0.0054957
112,0.085778
113,0.17151
114,0.26081
115,0.35548
116,0.45523
117,0.5573
118,0.6622399999999999
119,0.76973
120,0.8776700000000001
121,0.9826299999999999
122,1.0851
123,1.1844
124,1.2789
125,1.3696
126,1.4574
127,1.5415
128,1.6184
129,1.6875
130,1.7468
131,1.795
132,1.8334
133,1.8652
134,1.8923
135,1.9126
136,1.9242
137,1.9205
138,1.8927
139,1.8337
140,1.7398
141,1.6105
142,1.4483
143,1.2625
144,1.0635
145,0.86201
146,0.66914
147,0.49559
148,0.34726999999999997
149,0.22508000000000003
150,0.12967
151,0.057052
152,0.00047699
153,-0.046451
154,-0.086371
155,-0.12329000000000001
156,-0.16146
157,-0.19969
158,-0.23759
159,-0.27608
160,-0.31633
161,-0.35395
162,-0.38915
163,-0.42468
164,-0.45921999999999996
165,-0.49246
166,-0.52675
167,-0.5663699999999999
168,-0.60656
169,-0.64803
170,-0.69325
171,-0.74043
172,-0.7862399999999999
173,-0.83026
174,-0.8744200000000001
175,-0.9113600000000001
176,-0.9395
177,-0.96068
178,-0.9758100000000001
179,-0.9837
180,-0.98721
181,-0.9912
182,-0.9926799999999999
183,-0.9899100000000001
184,-0.98277
185,-0.97191
186,-0.9544799999999999
187,-0.93156
188,-0.9076
189,-0.8828
190,-0.85664
191,-0.8297899999999999
192,-0.80496
193,-0.77856
194,-0.75015
195,-0.72306
196,-0.69813
197,-0.67384
198,-0.64994
199,-0.63027
200,-0.60969
201,-0.5859
202,-0.56065
203,-0.53576
204,-0.50905
205,-0.48047
206,-0.45595
207,-0.43163
208,-0.4049
209,-0.37631
210,-0.34853
211,-0.31843
212,-0.28522
213,-0.25342
214,-0.22034
215,-0.18200999999999998
216,-0.13676
217,-0.08644099999999999
218,-0.026968000000000002
219,0.04286
220,0.11930999999999999
221,0.20224
222,0.29325999999999997
223,0.39221
224,0.49516000000000004
225,0.60312
226,0.71441
227,0.8247200000000001
228,0.9315
229,1.0346
230,1.1348
231,1.2339
232,1.3372
233,1.4483
234,1.5689
235,1.6986
236,1.8333
237,1.9659
238,2.0875
239,2.1919999999999997
240,2.274
241,2.3314
242,2.3661
243,2.3828
244,2.3862
245,2.3801
246,2.3688
247,2.3526
248,2.3288
249,2.294
250,2.2455
251,2.1804
252,2.0976
253,1.9999
254,1.8892
255,1.7651
256,1.6252
257,1.4662
258,1.2816
259,1.0654
260,0.81779
261,0.54256
262,0.2468
263,-0.058484
264,-0.35638000000000003
265,-0.63284
266,-0.8759999999999999
267,-1.0734
268,-1.2186
269,-1.3136
