time,value
0,0.82065
1,0.82065
2,0.82065
3,0.82065
4,0.82065
5,0.82065
6,0.82065
7,0.82065
8,0.82065
9,0.82065
10,0.82065
11,0.82065
12,0.82065
13,0.82065
14,0.82065
15,0.82065
16,0.82065
17,0.82065
18,0.82065
19,0.82065
20,0.82065
21,0.82065
22,0.82065
23,0.82065
24,0.82065
25,0.82065
26,0.82065
27,0.82065
28,0.82065
29,0.82065
30,0.82065
31,0.82065
32,0.82065
33,0.82065
34,0.82065
35,0.82065
36,0.82065
37,0.82065
38,0.82065
39,0.82065
40,0.82065
41,0.82065
42,0.82065
43,0.82065
44,0.82065
45,0.82065
46,0.82065
47,0.82065
48,0.82065
49,0.82065
50,0.82065
51,0.82065
52,0.82065
53,0.82065
54,0.82065
55,0.82065
56,0.82065
57,0.82065
58,0.82065
59,0.82065
60,0.82065
61,0.82065
62,0.82065
63,0.82065
64,0.82065
65,0.82065
66,0.82065
67,0.82065
68,0.82065
69,0.82065
70,0.82065
71,0.82065
72,0.82065
73,0.82065
74,0.82065
75,0.82065
76,0.82065
77,0.82065
78,0.82065
79,0.82065
80,0.82065
81,0.82065
82,0.82065
83,0.82065
84,0.82065
85,0.82065
86,0.82065
87,0.82065
88,0.82065
89,0.82065
90,0.82065
91,0.82065
92,0.82065
93,0.82065
94,0.82065
95,0.82065
96,0.82065
97,0.82065
98,0.82065
99,0.82065
100,0.82065
101,0.82065
102,0.82065
103,0.82065
104,0.82065
105,0.82065
106,0.82065
107,0.82065
108,0.82065
109,0.82065
110,0.82065
111,0.82065
112,0.82065
113,0.82065
114,0.82065
115,0.82065
116,0.82065
117,0.82065
118,0.82065
119,0.82065
120,0.82065
121,0.82065
122,0.82065
123,0.82065
124,0.82065
125,0.82065
126,0.82065
127,0.82065
128,0.82065
129,0.82065
130,0.82065
131,0.82065
132,0.82065
133,0.82065
134,0.82065
135,0.82065
136,0.82065
137,0.82065
138,0.81705
139,0.81306
140,0.80652
141,0.79883
142,0.79115
143,0.78347
144,0.77578
145,0.7681
146,0.76042
147,0.75273
148,0.74505
149,0.73737
150,0.72969
151,0.71928
152,0.70729
153,0.69496
154,0.68215
155,0.66935
156,0.65654
157,0.64374
158,0.63093
159,0.6181300000000001
160,0.60532
161,0.5925199999999999
162,0.57924
163,0.56562
164,0.55042
165,0.53249
166,0.51456
167,0.49663
168,0.47871
169,0.46078
170,0.44285
171,0.42493000000000003
172,0.40700000000000003
173,0.38906999999999997
174,0.37114
175,0.35284
176,0.33368000000000003
177,0.31439
178,0.2939
179,0.27342
180,0.25293000000000004
181,0.23244
182,0.21195
183,0.19146
184,0.17098
185,0.15049
186,0.13
187,0.10951
188,0.43241
189,0.29924
190,0.16607
191,0.16058
192,-0.11435
193,-0.2552
194,-0.39605999999999997
195,-0.1051
196,-0.13327
197,-0.16144
198,-0.18962
199,-0.21779
200,-0.24444000000000002
201,-0.27108000000000004
202,-0.28898
203,-0.30435
204,-0.31971
205,-0.33508000000000004
206,-0.35045
207,-0.36580999999999997
208,-0.38118
209,-0.39655
210,-0.41191000000000005
211,-0.42728
212,-0.44264
213,-0.45558000000000004
214,-0.46757
215,-0.47736999999999996
216,-0.48505
217,-0.49273999999999996
218,-0.50042
219,-0.5081
220,-0.51579
221,-0.52347
222,-0.53115
223,-0.53883
224,-0.54652
225,-0.5542
226,-0.5636399999999999
227,-0.57521
228,-0.58709
229,-0.5998899999999999
230,-0.61269
231,-0.6255
232,-0.6383
233,-0.6511100000000001
234,-0.66392
235,-0.67672
236,-0.68953
237,-0.70298
238,-0.71742
239,-0.73532
240,-0.76861
241,-0.8019
242,-0.8352
243,-0.86849
244,-0.9017799999999999
245,-0.9350799999999999
246,-0.9683700000000001
247,-1.0017
248,-1.035
249,-1.0682
250,-1.1015
251,-1.1348
252,-1.1681
253,-1.2014
254,-1.2347
255,-1.268
256,-1.3013
257,-1.3346
258,-1.3679
259,-1.4012
260,-1.4345
261,-1.4678
262,-1.5011
263,-1.5344
264,-1.5581
265,-1.5804
266,-1.5998
267,-1.6177
268,-1.6357
269,-1.6536
270,-1.6715
271,-1.6894
272,-1.7074
273,-1.7253
274,-1.7432
275,-1.7607
276,-1.7782
277,-1.7883
278,-1.7934
279,-1.7985
280,-1.8037
281,-1.8088
282,-1.8139
283,-1.819
284,-1.8242
285,-1.8293
286,-1.8344
287,-1.8395
288,-1.8432
289,-1.8455
290,-1.8463
291,-1.8437
292,-1.8412
293,-1.8386
294,-1.8359999999999999
295,-1.8335
296,-1.8309
297,-1.8284
298,-1.8258
299,-1.8232
300,-1.8207
301,-1.8172
302,-1.8111
303,-1.805
304,-1.7973
305,-1.7896
306,-1.7819999999999998
307,-1.7743
308,-1.7666
309,-1.7589
310,-1.7512
311,-1.7435
312,-1.7359
313,-1.7282
314,-1.7205
315,-0.086674
316,-0.086674
317,-0.086674
318,-0.086674
319,-0.086674
320,-0.086674
321,-0.086674
322,-0.086674
323,-0.086674
324,-0.086674
325,-0.086674
326,-0.086674
327,-0.086674
328,-0.086674
329,-0.086674
330,-0.086674
331,-0.086674
332,-0.086674
333,-0.086674
334,-0.086674
335,-0.086674
336,-0.086674
337,-0.086674
338,-0.086674
339,-0.086674
340,-0.086674
341,-0.086674
342,-0.086674
343,-0.086674
344,-0.086674
345,-0.086674
346,-0.086674
347,-0.086674
348,-0.086674
349,-0.086674
350,-0.086674
351,-0.086674
352,-0.086674
353,-0.048813999999999996
354,0.27637
355,0.13733
356,0.23389000000000001
357,0.33044
358,0.42700000000000005
359,0.10699000000000002
360,0.1263
361,0.14561
362,0.16492
363,0.18424000000000001
364,0.20164
365,0.21555
366,0.22749
367,0.22749
368,0.22749
369,0.22749
370,0.22749
371,0.22749
372,0.22749
373,0.22749
374,0.22749
375,0.22749
376,0.22749
377,0.22749
378,0.22749
379,0.22749
380,0.22749
381,0.22749
382,0.22749
383,0.22749
384,0.22749
385,0.22749
386,0.22749
387,0.22749
388,0.22749
389,0.22749
390,0.22749
391,0.22749
392,0.22749
393,0.22749
394,0.22749
395,0.22749
396,0.22749
397,0.22749
398,0.22749
399,0.22749
400,0.22749
401,0.22749
402,0.22749
403,0.22749
404,0.22749
405,0.22749
406,0.22749
407,0.22749
408,0.22749
409,0.22749
410,0.22749
411,0.22749
412,0.22749
413,0.22749
414,0.22749
415,0.22749
416,0.22749
417,0.22749
418,0.22749
419,0.22749
420,0.22749
421,0.22749
422,0.22749
423,0.22749
424,0.22749
425,0.22749
426,0.22749
427,0.22749
428,0.22749
429,0.22749
430,0.22749
431,0.22749
432,0.22749
433,0.22749
434,0.22749
435,0.22749
436,0.22749
437,0.22749
438,0.22749
439,0.22749
440,0.22749
441,0.22749
442,0.22749
443,0.22749
444,0.22749
445,0.22749
446,0.22749
447,0.22749
448,0.22749
449,0.22749
450,0.22749
451,0.22749
452,0.22749
453,0.23428000000000002
454,0.24181
455,0.25414000000000003
456,0.26861999999999997
457,0.28311
458,0.29759
459,0.31206999999999996
460,0.32656
461,0.34104
462,0.35552
463,0.37001
464,0.38449
465,0.39897
466,0.41346000000000005
467,0.42794
468,0.44242
469,0.45691000000000004
470,0.47139
471,0.48586999999999997
472,0.50036
473,0.51484
474,0.52932
475,0.54381
476,0.55829
477,0.57322
478,0.5884699999999999
479,0.60521
480,0.62453
481,0.64384
482,0.66315
483,0.6824600000000001
484,0.70177
485,0.72108
486,0.74039
487,0.7597
488,0.7790100000000001
489,0.79832
490,0.81692
491,0.83391
492,0.8506600000000001
493,0.8651399999999999
494,0.8796200000000001
495,0.8941100000000001
496,0.90859
497,0.9230700000000001
498,0.9375600000000001
499,0.95204
500,0.96652
501,0.981
502,0.99549
503,1.0101
504,1.0285
505,1.0468
506,1.0659999999999998
507,1.0853
508,1.1046
509,1.1239
510,1.1432
511,1.1625
512,1.1818
513,1.2011
514,1.2205
515,1.2363
516,1.2522
517,1.2483
518,1.2386
519,1.229
520,1.2193
521,1.2096
522,1.2
523,1.1903
524,1.1807
525,1.171
526,1.1614
527,1.1517
528,1.1436
529,1.1361
530,1.1299
531,1.1251
532,1.1202
533,1.1154
534,1.1106
535,1.1058
536,1.1009
537,1.0961
538,1.0913
539,1.0864
540,1.0816
541,1.0702
542,1.0507
543,1.0301
544,1.0059
545,0.9817799999999999
546,0.9576399999999999
547,0.9335
548,0.9093600000000001
549,0.8852200000000001
550,0.86108
551,0.83695
552,0.8115899999999999
553,0.7843600000000001
554,0.75063
555,0.68786
556,0.6251
557,0.56234
558,0.49958
559,0.43682
560,0.37406
561,0.3113
562,0.24854
563,0.18578
564,0.12302
565,0.28499
566,-0.06743099999999999
567,-0.41986
568,-0.16278
569,-0.24485
570,-0.32693
571,-0.409
572,-0.49107
573,-0.57314
574,-0.6552100000000001
575,-0.73728
576,-0.8193600000000001
577,-0.90143
578,-0.9835
579,-1.0536
580,-1.1218
581,-1.1865
582,-1.2492
583,-1.3119999999999998
584,-1.3747
585,-1.4375
586,-1.5003
587,-1.5630000000000002
588,-1.6258
589,-1.6885
590,-1.7502
591,-1.8116
592,-1.8538
593,-1.8828
594,-1.9118
595,-1.9407
596,-1.9697
597,-1.9987
598,-2.0276
599,-2.0566
600,-2.0856
601,-2.1145
602,-2.1435
603,-2.1697
604,-2.1934
605,-2.2142
606,-2.2287
607,-2.2432
608,-2.2576
609,-2.2721
610,-2.2866
611,-2.3011
612,-2.3156
613,-2.3301
614,-2.3445
615,-2.359
616,-2.3717
617,-2.3797
618,-2.3874
619,-2.3922
620,-2.3971
621,-2.4019
622,-2.4067
623,-2.4115
624,-2.4164
625,-2.4212
626,-2.426
627,-2.4309
628,-2.4357
629,-2.4405
630,0.5777100000000001
631,0.5777100000000001
632,0.5777100000000001
633,0.5777100000000001
634,0.5777100000000001
635,0.5777100000000001
636,0.5777100000000001
637,0.5777100000000001
638,0.5777100000000001
639,0.5777100000000001
640,0.5777100000000001
641,0.5777100000000001
642,0.5777100000000001
643,0.5777100000000001
644,0.5777100000000001
645,0.5777100000000001
646,0.5777100000000001
647,0.5777100000000001
648,0.5777100000000001
649,0.5777100000000001
650,0.5777100000000001
651,0.5777100000000001
652,0.5777100000000001
653,0.5777100000000001
654,0.5777100000000001
655,0.5777100000000001
656,0.5777100000000001
657,0.5777100000000001
658,0.5777100000000001
659,0.5777100000000001
660,0.5777100000000001
661,0.5777100000000001
662,0.5777100000000001
663,0.5777100000000001
664,0.5777100000000001
665,0.5777100000000001
666,0.5777100000000001
667,0.5777100000000001
668,0.5777100000000001
669,0.5777100000000001
670,0.5777100000000001
671,0.5777100000000001
672,0.5777100000000001
673,0.5777100000000001
674,0.5777100000000001
675,0.5777100000000001
676,0.5777100000000001
677,0.5777100000000001
678,0.5777100000000001
679,0.5777100000000001
680,0.5777100000000001
681,0.5777100000000001
682,0.5777100000000001
683,0.5777100000000001
684,0.5777100000000001
685,0.5777100000000001
686,0.5777100000000001
687,0.5777100000000001
688,0.5777100000000001
689,0.5777100000000001
690,0.5777100000000001
691,0.5777100000000001
692,0.5777100000000001
693,0.5777100000000001
694,0.5777100000000001
695,0.5777100000000001
696,0.5777100000000001
697,0.5777100000000001
698,0.5777100000000001
699,0.5777100000000001
700,0.5777100000000001
701,0.5777100000000001
702,0.5777100000000001
703,0.5777100000000001
704,0.5777100000000001
705,0.5777100000000001
706,0.5777100000000001
707,0.5777100000000001
708,0.5777100000000001
709,0.5777100000000001
710,0.5777100000000001
711,0.5777100000000001
712,0.5777100000000001
713,0.5777100000000001
714,0.5777100000000001
715,0.5777100000000001
716,0.5777100000000001
717,0.5777100000000001
718,0.5777100000000001
719,0.5777100000000001
720,0.5777100000000001
721,0.5777100000000001
722,0.5777100000000001
723,0.5777100000000001
724,0.5777100000000001
725,0.5777100000000001
726,0.5777100000000001
727,0.5777100000000001
728,0.5777100000000001
729,0.5777100000000001
730,0.5777100000000001
731,0.5777100000000001
732,0.5777100000000001
733,0.5777100000000001
734,0.5777100000000001
735,0.5777100000000001
736,0.5777100000000001
737,0.5777100000000001
738,0.5777100000000001
739,0.5777100000000001
740,0.5777100000000001
741,0.5777100000000001
742,0.5777100000000001
743,0.5777100000000001
744,0.5777100000000001
745,0.5777100000000001
746,0.5777100000000001
747,0.5777100000000001
748,0.5777100000000001
749,0.5777100000000001
750,0.5777100000000001
751,0.5777100000000001
752,0.5777100000000001
753,0.5777100000000001
754,0.5777100000000001
755,0.5777100000000001
756,0.5777100000000001
757,0.5777100000000001
758,0.5777100000000001
759,0.5777100000000001
760,0.5777100000000001
761,0.5777100000000001
762,0.5777100000000001
763,0.5777100000000001
764,0.5777100000000001
765,0.5777100000000001
766,0.5777100000000001
767,0.5777100000000001
768,0.55794
769,0.536
770,0.5000899999999999
771,0.4579
772,0.41572
773,0.37353000000000003
774,0.33135
775,0.28916
776,0.24697
777,0.20479
778,0.1626
779,0.12042
780,0.37975
781,0.24369000000000002
782,0.15088
783,0.067579
784,-0.034358
785,-0.07304
786,-0.14335
787,-0.21366
788,-0.28397
789,-0.35428000000000004
790,-0.42458999999999997
791,-0.4949
792,-0.11076
793,-0.12482
794,-0.13888
795,-0.15295
796,-0.16701
797,-0.18107
798,-0.19513
799,-0.20919000000000001
800,-0.22326
801,-0.23731999999999998
802,-0.25138
803,-0.26544
804,-0.2795
805,-0.29147
806,-0.29879
807,-0.30538000000000004
808,-0.30538000000000004
809,-0.30538000000000004
810,-0.30538000000000004
811,-0.30538000000000004
812,-0.30538000000000004
813,-0.30538000000000004
814,-0.30538000000000004
815,-0.30538000000000004
816,-0.30538000000000004
817,-0.30538000000000004
818,-0.30062
819,-0.18813
820,-0.38956999999999997
821,0.28976
822,0.20085
823,0.34147
824,0.48208999999999996
825,0.62271
826,0.7633300000000001
827,0.90395
828,1.0446
829,1.1852
830,1.3108
831,1.4363
832,1.4754
833,1.4895
834,1.5035
835,1.5176
836,1.5317
837,1.5457
838,1.5598
839,1.5739
840,1.5879
841,1.6019999999999999
842,1.6159999999999999
843,1.5945
844,1.5591
845,1.4917
846,1.3933
847,1.2949
848,1.1964
849,1.0979999999999999
850,0.9995700000000001
851,0.9011299999999999
852,0.8027
853,0.70427
854,0.60583
855,0.5074
856,0.40415
857,0.29503
858,0.1851
859,0.35163
860,-0.21085
861,-0.15238
862,-0.26488
863,-0.37737
864,-0.48986999999999997
865,-0.60237
866,-0.71486
867,-0.8260299999999999
868,-0.93515
869,-1.0372
870,-1.1075
871,-1.1778
872,-1.2481
873,-1.3184
874,-1.3887
875,-1.459
876,-1.5293
877,-1.5996
878,-1.6699
879,-1.7403
880,-1.8091
881,-1.8682
882,-1.9273
883,-1.9709
884,-2.0131
885,-2.0552
886,-2.0974
887,-2.1396
888,-2.1818
889,-2.224
890,-2.2662
891,-2.3084
892,-2.3505
893,-2.3927
894,-2.4001
895,-2.4018
896,-2.3933
897,-2.3792
898,-2.3652
899,-2.3511
900,-2.3369999999999997
901,-2.323
902,-2.3089
903,-2.2949
904,-2.2808
905,-2.2649
906,-2.2486
907,-2.2004
908,-2.1301
909,-2.0597
910,-1.9894
911,-1.9191
912,-1.8488
913,-1.7785
914,-1.7082
915,-1.6379
916,-1.5676
917,-1.4973
918,-1.4269999999999998
919,-1.3566
920,-1.2863
921,-1.216
922,-1.1457
923,-1.0754
924,-1.0051
925,-0.93479
926,-0.8644799999999999
927,-0.7941699999999999
928,-0.7238600000000001
929,-0.65355
930,-0.58324
931,-0.51805
932,-0.46686000000000005
933,-0.41618999999999995
934,-0.374
935,-0.33181
936,-0.28963
937,-0.24744000000000002
938,-0.20526
939,-0.16307
940,-0.12089000000000001
941,-0.4049
942,-0.19397
943,0.09688
944,0.22788000000000003
