time,value
0,-0.93635
1,-0.93635
2,-0.93635
3,-0.93635
4,-0.93635
5,-0.93635
6,-0.93635
7,-0.93635
8,-0.93635
9,-0.93635
10,-0.93635
11,-0.9466700000000001
12,-0.9657
13,-0.99074
14,-1.0158
15,-1.0242
16,-1.0267
17,-1.0267
18,-1.0267
19,-1.0267
20,-1.0267
21,-1.0267
22,-1.0267
23,-1.0267
24,-1.0267
25,-1.0267
26,-1.0267
27,-1.0267
28,-1.0267
29,-1.0267
30,-1.0267
31,-1.0267
32,-1.0267
33,-1.0582
34,-1.1027
35,-1.1528
36,-1.198
37,-1.2061
38,-1.2074
39,-1.2074
40,-1.2074
41,-1.2074
42,-1.2074
43,-1.2074
44,-1.2074
45,-1.2074
46,-1.2074
47,-1.2074
48,-1.2074
49,-1.2074
50,-1.207
51,-1.1782
52,-1.1338
53,-1.0837
54,-1.0434
55,-1.0503
56,-1.0733
57,-1.0984
58,-1.1234
59,-1.1484
60,-1.1735
61,-1.1961
62,-1.2074
63,-1.2074
64,-1.2074
65,-1.2146
66,-1.2333
67,-1.2584
68,-1.2825
69,-1.2952
70,-1.2978
71,-1.2978
72,-1.3017
73,-1.3186
74,-1.3433
75,-1.3683
76,-1.4016
77,-1.4486
78,-1.4987
79,-1.5478
80,-1.5838
81,-1.6089
82,-1.6339
83,-1.6533
84,-1.6592
85,-1.6592
86,-1.6579
87,-1.6475
88,-1.6247
89,-1.5997
90,-1.5746
91,-1.5496
92,-1.5246
93,-1.4995
94,-1.4745
95,-1.4494
96,-1.4244
97,-1.3994
98,-1.3743
99,-1.3493
100,-1.3243
101,-1.2992
102,-1.2742
103,-1.2492
104,-1.2257
105,-1.209
106,-1.2074
107,-1.2074
108,-1.203
109,-1.1893
110,-1.1643
111,-1.1392
112,-1.1055
113,-1.0612
114,-1.0112
115,-0.9611
116,-0.9110299999999999
117,-0.86095
118,-0.81088
119,-0.76081
120,-0.7107399999999999
121,-0.66066
122,-0.6090399999999999
123,-0.5526399999999999
124,-0.47822
125,-0.40310999999999997
126,-0.33675
127,-0.28685
128,-0.26181
129,-0.23678000000000002
130,-0.20312
131,-0.15994
132,-0.10987000000000001
133,-0.3009
134,-0.12207
135,0.11120999999999999
136,0.14227
137,0.26745
138,0.39263000000000003
139,0.10394
140,0.12897999999999998
141,0.15400999999999998
142,0.17905
143,0.20409000000000002
144,0.22912
145,0.25416
146,0.2792
147,0.30423
148,0.33755
149,0.37990999999999997
150,0.42999
151,0.48006000000000004
152,0.51622
153,0.54481
154,0.56984
155,0.59488
156,0.61992
157,0.64495
158,0.66999
159,0.69502
160,0.72006
161,0.7451
162,0.77013
163,0.7951699999999999
164,0.8202
165,0.84524
166,0.8702799999999999
167,0.89531
168,0.92035
169,0.9453799999999999
170,0.9704200000000001
171,0.99546
172,1.0205
173,1.0455
174,1.0706
175,1.0956
176,1.1205
177,1.1419
178,1.1419
179,1.1419
180,1.1419
181,1.1419
182,1.1419
183,1.1419
184,1.1419
185,1.1419
186,1.1419
187,1.1419
188,1.1419
189,1.1419
190,1.1419
191,1.1412
192,1.1225
193,1.0991
194,1.074
195,1.0579
196,1.0795
197,1.1042
198,1.1275
199,1.1419
200,1.1419
201,1.1419
202,1.1419
203,1.1419
204,1.1419
205,1.1419
206,1.1533
207,1.1739
208,1.1989
209,1.2208
210,1.2125
211,1.1906
212,1.1655
213,1.1405
214,1.1155
215,1.0904
216,1.0654
217,1.0403
218,1.0153
219,0.9902799999999999
220,0.9698399999999999
221,0.96121
222,0.96121
223,0.96121
224,0.96121
225,0.96121
226,0.96121
227,0.95899
228,0.94432
229,0.92064
230,0.8956
231,0.8823700000000001
232,0.89618
233,0.9212100000000001
234,0.94625
235,0.9602700000000001
236,0.96121
237,0.96121
238,0.96121
239,0.96121
240,0.96121
241,0.96078
242,0.95273
243,0.9315700000000001
244,0.90654
245,0.88413
246,0.8717600000000001
247,0.87085
248,0.87085
249,0.87085
250,0.87085
251,0.87085
252,0.87085
253,0.85951
254,0.8368899999999999
255,0.81186
256,0.7882
257,0.78049
258,0.78049
259,0.77983
260,0.77378
261,0.752
262,0.72697
263,0.70476
264,0.6903699999999999
265,0.69013
266,0.69013
267,0.69013
268,0.69013
269,0.69013
270,0.69013
271,0.69013
272,0.69013
273,0.69013
274,0.69013
275,0.69013
276,0.69013
277,0.69013
278,0.69013
279,0.69013
280,0.69013
281,0.69013
282,0.69013
283,0.69013
284,0.69013
285,0.69013
286,0.69013
287,0.69013
288,0.69013
289,0.7014199999999999
290,0.7217899999999999
291,0.7468199999999999
292,0.77186
293,0.79689
294,0.8219299999999999
295,0.84606
296,0.8670700000000001
297,0.8446600000000001
298,0.81963
299,0.7971
300,0.78049
301,0.78049
302,0.78049
303,0.77449
304,0.75977
305,0.73474
306,0.7097
307,0.69558
308,0.69013
309,0.69013
310,0.69013
311,0.67287
312,0.64984
313,0.6248100000000001
314,0.59977
315,-1.0999
316,-1.0999
317,-1.0999
318,-1.0999
319,-1.0999
320,-1.0999
321,-1.0999
322,-1.0999
323,-1.0999
324,-1.0999
325,-1.0999
326,-1.0999
327,-1.0999
328,-1.0999
329,-1.0999
330,-1.0999
331,-1.0999
332,-1.0999
333,-1.0999
334,-1.0999
335,-1.0999
336,-1.0999
337,-1.0999
338,-1.0999
339,-1.0999
340,-1.0999
341,-1.0999
342,-1.0999
343,-1.0999
344,-1.0999
345,-1.0999
346,-1.0999
347,-1.0999
348,-1.0999
349,-1.0999
350,-1.0999
351,-1.0999
352,-1.0999
353,-1.0999
354,-1.0999
355,-1.0999
356,-1.0999
357,-1.0999
358,-1.0999
359,-1.0999
360,-1.0999
361,-1.0999
362,-1.0755
363,-1.0215
364,-0.94894
365,-0.87705
366,-0.8461799999999999
367,-0.838
368,-0.838
369,-0.8285600000000001
370,-0.7735
371,-0.70285
372,-0.6302800000000001
373,-0.58004
374,-0.57606
375,-0.57606
376,-0.57606
377,-0.57606
378,-0.57606
379,-0.57606
380,-0.55537
381,-0.50098
382,-0.4284
383,-0.35846
384,-0.32176
385,-0.31411999999999995
386,-0.31411999999999995
387,-0.31411999999999995
388,-0.31411999999999995
389,-0.31411999999999995
390,-0.31411999999999995
391,-0.31411999999999995
392,-0.31411999999999995
393,-0.31411999999999995
394,-0.31411999999999995
395,-0.31411999999999995
396,-0.31411999999999995
397,-0.31411999999999995
398,-0.29784
399,-0.24236999999999997
400,-0.1698
401,-0.10115
402,-0.29491
403,-0.26278
404,-0.26278
405,-0.20082
406,0.10845999999999999
407,0.37955
408,0.14887
409,0.22144
410,0.29402
411,0.36659
412,0.43917
413,0.46998999999999996
414,0.4717
415,0.4717
416,0.4717
417,0.4717
418,0.4717
419,0.4717
420,0.4717
421,0.4717
422,0.4717
423,0.4717
424,0.4717
425,0.4717
426,0.4717
427,0.49704
428,0.55262
429,0.6252
430,0.69777
431,0.77035
432,0.8429200000000001
433,0.9155
434,0.98808
435,1.0607
436,1.1332
437,1.2058
438,1.2784
439,1.351
440,1.4235
441,1.4961
442,1.5687
443,1.6413
444,1.7138
445,1.7614
446,1.7814
447,1.7814
448,1.7814
449,1.7814
450,1.7814
451,1.7814
452,1.7814
453,1.7814
454,1.7814
455,1.7814
456,1.7814
457,1.7814
458,1.7814
459,1.7814
460,1.7814
461,1.7814
462,1.7814
463,1.7814
464,1.7814
465,1.7814
466,1.7814
467,1.8217
468,1.8840000000000001
469,1.9566
470,2.0292
471,2.0409
472,2.0433
473,2.0409
474,2.0292
475,1.9566
476,1.8840000000000001
477,1.8217
478,1.7814
479,1.7814
480,1.7814
481,1.7591
482,1.7105
483,1.6379
484,1.5653
485,1.5313
486,1.5195
487,1.5195
488,1.5195
489,1.4606
490,1.3918
491,1.3196
492,1.2575
493,1.2575
494,1.2575
495,1.2494
496,1.2183
497,1.1457
498,1.0732
499,1.0006
500,0.92801
501,0.85544
502,0.78286
503,0.71029
504,0.63771
505,0.56513
506,0.49256000000000005
507,0.41998
508,0.34741
509,0.27483
510,0.21522
511,0.21020999999999998
512,0.20976
513,0.21500999999999998
514,0.24563000000000001
515,0.31821
516,0.39079
517,0.44636000000000003
518,0.4717
519,0.4717
520,0.4717
521,0.4717
522,0.4717
523,0.4717
524,0.4717
525,0.4717
526,0.4717
527,0.4717
528,0.45633
529,0.3946
530,0.32238
531,0.24981
532,0.17723
533,0.10465
534,0.15849000000000002
535,-0.13776
536,-0.26278
537,-0.26278
538,-0.26278
539,-0.40817
540,-0.14144
541,-0.21400999999999998
542,-0.28015999999999996
543,-0.31019
544,-0.31411999999999995
545,-0.31411999999999995
546,-0.33123
547,-0.38753000000000004
548,-0.4601
549,-0.53268
550,-0.5733199999999999
551,-0.57606
552,-0.57606
553,-0.57606
554,-0.57606
555,-0.57606
556,-0.57606
557,-0.57606
558,-0.57606
559,-0.57606
560,-0.57606
561,-0.57606
562,-0.57606
563,-0.57606
564,-0.59424
565,-0.64613
566,-0.7187
567,-0.79128
568,-0.83099
569,-0.838
570,-0.838
571,-0.84198
572,-0.8922200000000001
573,-0.9648
574,-1.0354
575,-1.0905
576,-1.0999
577,-1.0999
578,-1.0999
579,-1.0999
580,-1.0999
581,-1.0999
582,-1.0999
583,-1.0999
584,-1.0999
585,-1.0999
586,-1.0668
587,-1.0048
588,-0.9322600000000001
589,-0.85969
590,-0.8907200000000001
591,-0.96146
592,-1.0321
593,-1.093
594,-1.0999
595,-1.0999
596,-1.0919
597,-1.0649
598,-0.9923200000000001
599,-0.91975
600,-0.8471700000000001
601,-0.7746
602,-0.70202
603,-0.62944
604,-0.58959
605,-0.57606
606,-0.57606
607,-0.57606
608,-0.5248
609,-0.45593
610,-0.38466999999999996
611,-0.31793000000000005
612,-0.31411999999999995
613,-0.31411999999999995
614,-0.31411999999999995
615,-0.31411999999999995
616,-0.31411999999999995
617,-0.31411999999999995
618,-0.33150999999999997
619,-0.37418
620,-0.44675
621,-0.5193300000000001
622,-0.5602600000000001
623,-0.57606
624,-0.57606
625,-0.57606
626,-0.6261
627,-0.69284
628,-0.76542
629,-0.838
630,-0.74459
631,-0.74459
632,-0.74459
633,-0.74459
634,-0.74459
635,-0.74459
636,-0.74459
637,-0.74459
638,-0.74459
639,-0.74459
640,-0.74459
641,-0.80369
642,-0.91274
643,-1.0562
644,-1.1996
645,-1.2478
646,-1.2622
647,-1.2622
648,-1.2622
649,-1.2622
650,-1.2622
651,-1.2622
652,-1.2622
653,-1.2622
654,-1.2622
655,-1.2622
656,-1.2622
657,-1.2622
658,-1.2622
659,-1.2622
660,-1.2622
661,-1.2622
662,-1.2622
663,-1.1721
664,-1.0446
665,-0.9012
666,-0.77153
667,-0.74845
668,-0.74459
669,-0.74459
670,-0.74459
671,-0.74459
672,-0.74459
673,-0.76554
674,-0.8435
675,-0.98693
676,-1.1304
677,-1.2255
678,-1.2622
679,-1.2622
680,-1.2636
681,-1.3459999999999999
682,-1.4733
683,-1.6167
684,-1.7415
685,-1.7761
686,-1.7799
687,-1.7799
688,-1.7799
689,-1.7799
690,-1.7799
691,-1.766
692,-1.6876
693,-1.5441
694,-1.4007
695,-1.2573
696,-1.1139
697,-0.97044
698,-0.8322200000000001
699,-0.75969
700,-0.74459
701,-0.74459
702,-0.70012
703,-0.50559
704,-0.22364
705,0.31415
706,0.25519000000000003
707,0.29070999999999997
708,0.29070999999999997
709,0.29070999999999997
710,0.29070999999999997
711,0.29070999999999997
712,0.29070999999999997
713,0.29070999999999997
714,0.29070999999999997
715,0.29070999999999997
716,0.28296
717,0.22361
718,0.46252
719,-0.2546
720,-0.19397
721,-0.33739
722,-0.48081999999999997
723,-0.62424
724,-0.71825
725,-0.74459
726,-0.74459
727,-0.74459
728,-0.74459
729,-0.74459
730,-0.7438899999999999
731,-0.72246
732,-0.60941
733,-0.46598
734,-0.32255
735,-0.17912999999999998
736,-0.18042
737,0.10772000000000001
738,0.25115
739,0.39457
740,0.5379999999999999
741,0.68142
742,0.77477
743,0.8083600000000001
744,0.8083600000000001
745,0.8083600000000001
746,0.89126
747,1.0243
748,1.1678
749,1.3112
750,1.4546
751,1.598
752,1.7326
753,1.8397
754,1.8437
755,1.8437
756,1.8437
757,1.8437
758,1.8437
759,1.8437
760,1.7942
761,1.6903
762,1.5469
763,1.4035
764,1.3419999999999999
765,1.3259999999999998
766,1.3259999999999998
767,1.3259999999999998
768,1.4487
769,1.5914
770,1.7274
771,1.8437
772,1.8437
773,1.8437
774,1.8203
775,1.7530000000000001
776,1.6096
777,1.4661
778,1.3702
779,1.3259999999999998
780,1.3259999999999998
781,1.3259999999999998
782,1.3259999999999998
783,1.3259999999999998
784,1.3259999999999998
785,1.3259999999999998
786,1.4462
787,1.5848
788,1.7235
789,1.8437
790,1.8437
791,1.8437
792,1.8437
793,1.8437
794,1.8437
795,1.8437
796,1.8437
797,1.8437
798,1.8437
799,1.8437
800,1.8437
801,1.8437
802,1.8437
803,1.8437
804,1.7274
805,1.5914
806,1.4480000000000002
807,1.3046
808,1.1612
809,1.0177
810,0.87431
811,0.73088
812,0.58746
813,0.44403000000000004
814,0.34013000000000004
815,0.29070999999999997
816,0.29070999999999997
817,0.29070999999999997
818,0.21949000000000002
819,0.10113
820,-0.21339
821,-0.17785
822,-0.10695999999999999
823,0.09159400000000001
824,0.16213
825,0.25432
826,0.13067
827,-0.056777
828,-0.14404
829,-0.22694
830,-0.22694
831,-0.22694
832,-0.19335
833,-0.099997
834,0.21524000000000001
835,0.18685
836,0.26528
837,0.29070999999999997
838,0.29070999999999997
839,0.29070999999999997
840,0.29070999999999997
841,0.29070999999999997
842,0.29070999999999997
843,0.29070999999999997
844,0.29070999999999997
845,0.29070999999999997
846,0.29070999999999997
847,0.29070999999999997
848,0.29070999999999997
849,0.29070999999999997
850,0.29070999999999997
851,0.29070999999999997
852,0.29070999999999997
853,0.29070999999999997
854,0.29070999999999997
855,0.29070999999999997
856,0.29070999999999997
857,0.29070999999999997
858,0.29070999999999997
859,0.29070999999999997
860,0.29070999999999997
861,0.2569
862,0.14564000000000002
863,0.058410000000000004
864,-0.14121
865,-0.22153
866,-0.22694
867,-0.22694
868,-0.2447
869,-0.34069
870,-0.48411000000000004
871,-0.6250899999999999
872,-0.72236
873,-0.74459
874,-0.74459
875,-0.74459
876,-0.74459
877,-0.74459
878,-0.74459
879,-0.70865
880,-0.60611
881,-0.46268000000000004
882,-0.31926
883,-0.24078000000000002
884,-0.22694
885,-0.22694
886,-0.22694
887,-0.22694
888,-0.22694
889,-0.22694
890,-0.22694
891,-0.22694
892,-0.22694
893,-0.24311999999999998
894,-0.30412
895,-0.4462
896,-0.58962
897,-0.69631
898,-0.74459
899,-0.74459
900,-0.74459
901,-0.67912
902,-0.55665
903,-0.41322
904,-0.2698
905,-0.33113000000000004
906,-0.47092
907,-0.61049
908,-0.73083
909,-0.74459
910,-0.74459
911,-0.76053
912,-0.81383
913,-0.95725
914,-1.1007
915,-1.1717
916,-1.1369
917,-0.9935200000000001
918,-0.8501
919,-0.70667
920,-0.56324
921,-0.41981999999999997
922,-0.27639
923,-0.23426
924,-0.22694
925,-0.22953
926,-0.24106999999999998
927,-0.37696
928,-0.5203800000000001
929,-0.63502
930,-0.68194
931,-0.53852
932,-0.39509
933,-0.25167
934,-0.10824
935,0.17402
936,0.17861
937,0.32204
938,0.46546000000000004
939,0.6088899999999999
940,0.75231
941,0.89574
942,1.0392
943,1.1826
944,1.3259999999999998
