time,value
0,1.0991
1,1.3392
2,1.6594
3,1.9796
4,1.9796
5,1.3392
6,-0.34175
7,-0.58189
8,-0.58189
9,-0.58189
10,-0.58189
11,-0.58189
12,-0.58189
13,-0.58189
14,-0.58189
15,-0.58189
16,-0.58189
17,-0.58189
18,-0.58189
19,-0.58189
20,-0.58189
21,-0.58189
22,-0.58189
23,-0.58189
24,-0.58189
25,-0.58189
26,-0.58189
27,-0.58189
28,-0.58189
29,-0.58189
30,-0.58189
31,-0.58189
32,-0.58189
33,-0.58189
34,-0.58189
35,-0.58189
36,-0.58189
37,-0.58189
38,-0.58189
39,-0.58189
40,-0.58189
41,-0.58189
42,-0.58189
43,-0.58189
44,-0.58189
45,-0.58189
46,-0.58189
47,-0.58189
48,-0.58189
49,-0.58189
50,-0.58189
51,-0.58189
52,-0.58189
53,-0.58189
54,-0.58189
55,-0.58189
56,-0.58189
57,-0.58189
58,-0.58189
59,-0.58189
60,-0.58189
61,-0.58189
62,-0.58189
63,-0.58189
64,-0.58189
65,-0.58189
66,-0.58189
67,-0.58189
68,-0.58189
69,-0.58189
70,-0.58189
71,-0.58189
72,-0.58189
73,-0.58189
74,-0.58189
75,-0.58189
76,-0.58189
77,-0.58189
78,-0.58189
79,-0.58189
80,-0.58189
81,-0.58189
82,-0.58189
83,-0.58189
84,-0.58189
85,-0.58189
86,-0.58189
87,-0.58189
88,-0.58189
89,-0.58189
90,-0.58189
91,-0.58189
92,-0.58189
93,-0.58189
94,-0.58189
95,-0.58189
96,-0.58189
97,-0.58189
98,-0.58189
99,-0.58189
100,-0.58189
101,-0.58189
102,-0.58189
103,-0.58189
104,-0.58189
105,-0.58189
106,-0.58189
107,-0.58189
108,-0.58189
109,-0.58189
110,-0.58189
111,-0.58189
112,-0.58189
113,-0.58189
114,-0.58189
115,-0.58189
116,-0.58189
117,-0.58189
118,-0.58189
119,-0.58189
120,-0.58189
121,-0.58189
122,-0.58189
123,-0.58189
124,-0.58189
125,-0.58189
126,-0.58189
127,-0.58189
128,-0.58189
129,-0.58189
130,-0.58189
131,-0.58189
132,-0.58189
133,-0.58189
134,-0.58189
135,-0.58189
136,-0.58189
137,-0.58189
138,-0.58189
139,-0.58189
140,-0.58189
141,-0.58189
142,-0.58189
143,-0.58189
144,-0.58189
145,-0.58189
146,-0.58189
147,-0.58189
148,-0.58189
149,-0.58189
150,-0.58189
151,-0.58189
152,-0.58189
153,-0.58189
154,-0.58189
155,-0.58189
156,-0.58189
157,-0.58189
158,-0.58189
159,-0.58189
160,-0.58189
161,-0.58189
162,-0.58189
163,-0.58189
164,-0.58189
165,-0.58189
166,-0.58189
167,-0.58189
168,-0.58189
169,-0.58189
170,-0.58189
171,-0.58189
172,-0.58189
173,-0.58189
174,-0.58189
175,-0.58189
176,-0.58189
177,-0.58189
178,-0.58189
179,-0.58189
180,-0.58189
181,-0.58189
182,-0.58189
183,-0.58189
184,-0.58189
185,-0.58189
186,-0.58189
187,-0.58189
188,-0.58189
189,-0.58189
190,-0.58189
191,-0.58189
192,-0.58189
193,-0.58189
194,-0.58189
195,-0.58189
196,-0.58189
197,-0.58189
198,-0.58189
199,-0.58189
200,-0.58189
201,-0.58189
202,-0.58189
203,-0.58189
204,-0.58189
205,-0.58189
206,-0.58189
207,-0.58189
208,-0.58189
209,-0.58189
210,-0.58189
211,-0.58189
212,-0.58189
213,-0.58189
214,-0.58189
215,-0.58189
216,-0.58189
217,-0.58189
218,-0.58189
219,-0.58189
220,-0.58189
221,-0.58189
222,-0.58189
223,-0.58189
224,-0.58189
225,-0.58189
226,-0.58189
227,-0.58189
228,-0.58189
229,-0.58189
230,-0.58189
231,-0.58189
232,-0.58189
233,-0.58189
234,-0.58189
235,-0.58189
236,-0.58189
237,-0.58189
238,-0.58189
239,-0.58189
240,-0.58189
241,-0.58189
242,-0.58189
243,-0.58189
244,-0.58189
245,-0.58189
246,-0.58189
247,-0.58189
248,-0.58189
249,-0.58189
250,-0.58189
251,-0.58189
252,-0.58189
253,-0.58189
254,-0.58189
255,-0.58189
256,-0.58189
257,-0.58189
258,-0.58189
259,-0.58189
260,-0.58189
261,-0.58189
262,-0.58189
263,-0.58189
264,-0.58189
265,-0.58189
266,-0.58189
267,-0.58189
268,-0.58189
269,-0.58189
270,-0.58189
271,-0.58189
272,-0.58189
273,-0.58189
274,-0.58189
275,-0.58189
276,-0.58189
277,-0.58189
278,-0.58189
279,-0.58189
280,-0.58189
281,-0.58189
282,-0.58189
283,-0.58189
284,-0.58189
285,-0.58189
286,-0.58189
287,-0.58189
288,-0.58189
289,-0.58189
290,-0.58189
291,-0.58189
292,-0.58189
293,-0.58189
294,-0.58189
295,-0.58189
296,-0.58189
297,-0.58189
298,-0.58189
299,-0.58189
300,-0.58189
301,-0.58189
302,-0.58189
303,-0.58189
304,-0.58189
305,-0.58189
306,-0.58189
307,-0.58189
308,-0.58189
309,-0.58189
310,-0.58189
311,-0.58189
312,-0.58189
313,-0.58189
314,-0.58189
315,-0.58189
316,-0.58189
317,-0.58189
318,-0.58189
319,-0.58189
320,-0.58189
321,-0.58189
322,-0.58189
323,-0.58189
324,-0.58189
325,-0.58189
326,-0.58189
327,-0.58189
328,-0.58189
329,-0.58189
330,-0.58189
331,-0.58189
332,-0.58189
333,-0.58189
334,-0.58189
335,-0.58189
336,-0.58189
337,-0.58189
338,-0.58189
339,-0.58189
340,-0.58189
341,-0.58189
342,-0.58189
343,-0.58189
344,-0.58189
345,-0.58189
346,-0.58189
347,-0.58189
348,-0.58189
349,-0.58189
350,-0.58189
351,-0.58189
352,-0.58189
353,-0.58189
354,-0.58189
355,-0.58189
356,-0.58189
357,-0.58189
358,-0.58189
359,-0.58189
360,-0.58189
361,-0.58189
362,-0.58189
363,-0.58189
364,-0.58189
365,-0.58189
366,-0.58189
367,-0.58189
368,-0.58189
369,-0.58189
370,-0.58189
371,-0.58189
372,-0.58189
373,-0.58189
374,-0.58189
375,-0.58189
376,-0.58189
377,-0.58189
378,-0.58189
379,-0.58189
380,-0.58189
381,-0.58189
382,-0.58189
383,-0.58189
384,-0.58189
385,-0.58189
386,-0.58189
387,-0.58189
388,-0.58189
389,-0.58189
390,-0.58189
391,-0.58189
392,-0.58189
393,-0.58189
394,-0.58189
395,-0.58189
396,-0.58189
397,-0.58189
398,-0.58189
399,-0.58189
400,-0.58189
401,-0.58189
402,-0.58189
403,-0.58189
404,-0.58189
405,-0.58189
406,-0.58189
407,-0.58189
408,-0.58189
409,-0.58189
410,-0.58189
411,-0.58189
412,-0.58189
413,-0.58189
414,-0.58189
415,-0.58189
416,-0.58189
417,-0.58189
418,-0.58189
419,-0.58189
420,-0.58189
421,-0.58189
422,-0.58189
423,-0.58189
424,-0.58189
425,-0.58189
426,-0.58189
427,-0.58189
428,-0.58189
429,-0.58189
430,-0.58189
431,-0.58189
432,-0.58189
433,-0.58189
434,-0.58189
435,-0.58189
436,-0.58189
437,-0.58189
438,-0.58189
439,-0.58189
440,-0.58189
441,-0.58189
442,-0.58189
443,-0.58189
444,-0.58189
445,-0.58189
446,-0.58189
447,-0.58189
448,-0.58189
449,-0.58189
450,-0.58189
451,-0.58189
452,-0.58189
453,-0.58189
454,-0.58189
455,-0.58189
456,-0.58189
457,-0.58189
458,-0.58189
459,-0.58189
460,-0.58189
461,-0.58189
462,-0.58189
463,-0.58189
464,-0.58189
465,-0.58189
466,-0.58189
467,-0.58189
468,-0.58189
469,-0.58189
470,-0.58189
471,-0.58189
472,-0.58189
473,-0.58189
474,-0.58189
475,-0.58189
476,-0.58189
477,-0.58189
478,-0.58189
479,-0.58189
480,-0.58189
481,-0.58189
482,-0.58189
483,-0.58189
484,-0.58189
485,-0.58189
486,-0.58189
487,-0.58189
488,-0.58189
489,-0.58189
490,-0.58189
491,0.37866
492,1.6594
493,1.3392
494,1.3392
495,1.3392
496,1.3392
497,1.3392
498,1.6594
499,1.6594
500,1.6594
501,1.3392
502,1.3392
503,1.3392
504,1.3392
505,1.3392
506,1.3392
507,1.9796
508,1.6594
509,1.6594
510,1.3392
511,1.6594
512,1.3392
513,1.3392
514,1.6594
515,1.9796
516,1.6594
517,1.0991
518,1.3392
519,1.3392
520,1.0991
521,1.3392
522,1.3392
523,1.9796
524,1.6594
525,0.37866
526,-0.4218
527,-0.58189
528,-0.50184
529,-0.58189
530,-0.58189
531,1.6594
532,1.6594
533,1.6594
534,1.9796
535,1.6594
536,1.6594
537,1.6594
538,1.6594
539,1.9796
540,1.6594
541,1.6594
542,1.9796
543,2.2998
544,1.9796
545,1.6594
546,1.9796
547,1.6594
548,1.6594
549,1.9796
550,1.9796
551,1.9796
552,1.6594
553,1.6594
554,1.6594
555,1.9796
556,1.6594
557,1.6594
558,1.9796
559,1.6594
560,1.9796
561,1.6594
562,1.9796
563,1.9796
564,1.6594
565,1.9796
566,1.9796
567,1.6594
568,1.9796
569,1.9796
570,1.3392
571,1.9796
572,1.9796
573,1.9796
574,1.6594
575,1.6594
576,1.9796
577,1.6594
578,1.9796
579,1.6594
580,1.6594
581,1.9796
582,1.6594
583,1.9796
584,1.6594
585,1.6594
586,1.9796
587,1.9796
588,1.9796
589,1.6594
590,1.6594
591,1.9796
592,1.9796
593,1.6594
594,1.6594
595,1.9796
596,1.9796
597,1.6594
598,1.6594
599,1.9796
600,1.9796
601,1.6594
602,1.9796
603,1.6594
604,1.9796
605,1.6594
606,2.2998
607,1.6594
608,2.2998
609,1.6594
610,1.6594
611,1.6594
612,1.6594
613,1.6594
614,1.9796
615,1.6594
616,1.9796
617,1.6594
618,1.9796
619,1.6594
620,1.6594
621,1.6594
622,1.9796
623,1.3392
624,1.3392
625,1.3392
626,1.6594
627,1.3392
628,1.3392
629,1.6594
630,1.6594
631,1.6594
632,1.3392
633,1.3392
634,1.6594
635,1.3392
636,1.6594
637,1.9796
638,1.9796
639,1.6594
640,1.3392
641,1.6594
642,1.6594
643,1.6594
644,1.6594
645,1.6594
646,1.6594
647,1.6594
648,1.9796
649,1.9796
650,1.6594
651,1.6594
652,1.6594
653,1.6594
654,1.6594
655,1.6594
656,1.9796
657,1.6594
658,1.6594
659,1.9796
660,1.6594
661,1.3392
662,1.6594
663,1.6594
664,1.6594
665,1.6594
666,1.9796
667,1.9796
668,1.6594
669,1.9796
670,1.9796
671,1.6594
672,1.6594
673,1.9796
674,-0.34175
675,-0.58189
676,-0.58189
677,-0.58189
678,-0.58189
679,-0.58189
680,-0.50184
681,-0.58189
682,-0.58189
683,-0.58189
684,-0.58189
685,-0.58189
686,-0.50184
687,-0.58189
688,-0.58189
689,-0.58189
690,-0.58189
691,-0.58189
692,-0.58189
693,-0.50184
694,-0.58189
695,-0.58189
696,-0.58189
697,-0.58189
698,-0.58189
699,-0.58189
700,-0.50184
701,-0.58189
702,-0.58189
703,-0.58189
704,-0.58189
705,-0.58189
706,-0.58189
707,-0.58189
708,-0.50184
709,-0.58189
710,-0.58189
711,-0.58189
712,-0.58189
713,-0.58189
714,-0.58189
715,-0.50184
716,-0.58189
717,-0.58189
718,-0.58189
719,-0.58189
