time,value
0,0.033139
1,0.033139
2,0.033139
3,-0.13258
4,0.033139
5,0.033139
6,0.19887
7,0.033139
8,0.033139
9,-0.2983
10,-0.79545
11,-0.79545
12,0.36459
13,1.5246
14,0.86174
15,-1.2926
16,-1.2926
17,-0.2983
18,0.5303
19,1.6903
20,2.0218
21,1.3589
22,0.36459
23,-0.46403999999999995
24,-0.6297
25,-0.2983
26,-0.13258
27,-0.2983
28,-0.2983
29,-0.6297
30,-0.6297
31,-0.96119
32,-0.79545
33,-0.46403999999999995
34,-0.13258
35,0.19887
36,0.19887
37,0.19887
38,0.19887
39,0.36459
40,-0.2983
41,-0.46403999999999995
42,-0.13258
43,0.5303
44,0.19887
45,-0.13258
46,-0.13258
47,0.19887
48,0.36459
49,0.19887
50,0.19887
51,0.86174
52,1.3589
53,0.36459
54,-2.287
55,-2.4526
56,-0.2983
57,1.5246
58,2.3532
59,2.3532
60,1.8561
61,-0.79545
62,-2.7841
63,-1.4583
64,-0.79545
