time,value
0,-0.29814
1,0.085823
2,-0.11349000000000001
3,0.29782
4,-0.25694
5,-0.084506
6,-0.15772
7,-0.58322
8,0.40886999999999996
9,-0.29301
10,-0.066652
11,0.29363
12,0.35409
13,0.13732
14,0.12899000000000002
15,-0.37008
16,0.029188
17,0.1717
18,-0.1002
19,-0.24789
20,-0.14612
21,0.040264999999999995
22,-0.07308400000000001
23,0.60249
24,-0.72119
25,-0.48336
26,-0.54072
27,-0.024548
28,-0.41863999999999996
29,0.37228
30,0.47636999999999996
31,0.20158
32,-0.07396799999999999
33,-0.4884
34,-0.010921
35,0.27549
36,0.024106
37,0.12245
38,-0.19714
39,0.1676
40,-0.93689
41,0.27129000000000003
42,-0.1206
43,0.50331
44,0.029372000000000002
45,0.72895
46,0.30133000000000004
47,0.5618
48,0.058841
49,0.09371499999999999
50,-0.06476799999999999
51,1.5115
52,1.5115
53,1.5115
54,1.5115
55,1.5115
56,1.5115
57,1.5115
58,1.5115
59,1.5115
60,1.5115
61,1.5115
62,-1.5491
63,-1.5491
64,-1.5491
65,-1.5491
66,-1.5491
67,-1.5491
68,-1.5491
69,-1.5491
70,-1.5491
71,-1.5491
72,0.078666
73,-0.29833000000000004
74,-0.29341999999999996
75,-0.1404
76,-0.38997
77,-0.26291
78,-0.24906999999999999
79,-0.11924000000000001
80,0.25873
81,0.046954
82,0.64499
83,0.045113
84,-0.08507
85,0.08797
86,0.10772000000000001
87,0.24906
88,-0.056087
89,0.28247
90,0.029901
91,-0.23003
92,-0.24523000000000003
93,0.0050156
94,0.53178
95,-0.21208000000000002
96,-0.1729
97,1.5115
98,1.5115
99,1.5115
100,1.5115
101,1.5115
102,1.5115
103,1.5115
104,1.5115
105,1.5115
106,1.5115
107,1.5115
108,1.5115
109,1.5115
110,1.5115
111,1.5115
112,-1.5491
113,-1.5491
114,-1.5491
115,-1.5491
116,-1.5491
117,-1.5491
118,-1.5491
119,-1.5491
120,-1.5491
121,-1.5491
122,-1.5491
123,-1.5491
124,-1.5491
125,-1.5491
126,-1.5491
127,-0.050922
