time,value
0,0.35911
1,0.35911
2,0.35911
3,0.35911
4,0.35911
5,0.35911
6,0.35911
7,0.35911
8,0.35911
9,0.35911
10,0.35911
11,0.35911
12,0.35911
13,0.35911
14,0.35911
15,0.35911
16,0.35911
17,0.35911
18,0.35911
19,0.35911
20,0.35911
21,0.35911
22,0.35911
23,0.35911
24,0.35911
25,0.35911
26,0.35911
27,0.35911
28,0.35911
29,0.35911
30,0.35911
31,0.35911
32,0.35911
33,0.35911
34,0.35911
35,0.35911
36,0.35911
37,0.35911
38,0.35911
39,0.35911
40,0.35911
41,0.35911
42,0.35911
43,0.35911
44,0.35911
45,0.35911
46,0.35911
47,0.35958
48,0.36193000000000003
49,0.37126
50,0.38371
51,0.39615
52,0.40239
53,0.40508
54,0.40508
55,0.40508
56,0.40508
57,0.40508
58,0.40508
59,0.4064
60,0.41694
61,0.42865
62,0.4411
63,0.45353999999999994
64,0.46598999999999996
65,0.47843
66,0.49088000000000004
67,0.50332
68,0.51577
69,0.5282100000000001
70,0.53715
71,0.5429999999999999
72,0.5429999999999999
73,0.5433899999999999
74,0.54446
75,0.55691
76,0.56935
77,0.5818
78,0.59424
79,0.60669
80,0.6191300000000001
81,0.63158
82,0.64402
83,0.65646
84,0.66891
85,0.68135
86,0.6938
87,0.70624
88,0.7186899999999999
89,0.7311300000000001
90,0.74358
91,0.75602
92,0.76847
93,0.78091
94,0.7933600000000001
95,0.8058
96,0.835
97,0.87813
98,0.94035
99,1.0026
100,1.0563
101,1.0954
102,1.133
103,1.1724
104,1.2158
105,1.2645
106,1.3143
107,1.3641
108,1.4138
109,1.4636
110,1.5134
111,1.5573
112,1.5983
113,1.6356
114,1.6716
115,1.7043
116,1.7292
117,1.7541
118,1.7725
119,1.7715
120,1.7619999999999998
121,1.7495
122,1.7371
123,1.7247
124,1.7122
125,1.6998
126,1.6873
127,1.6749
128,1.6624
129,1.65
130,1.6375
131,1.6251
132,1.6127
133,1.5985
134,1.5748
135,1.5503
136,1.5269
137,1.5135
138,1.5084
139,1.5083
140,1.5074
141,1.4619
142,1.3872
143,1.3125
144,1.2626
145,1.2326
146,1.2326
147,1.2309
148,1.2267
149,1.2018
150,1.1769
151,1.1521
152,1.1272
153,1.1023
154,1.0773
155,1.0497
156,1.0171
157,0.9797299999999999
158,0.9424
159,0.9050600000000001
160,0.8677299999999999
161,0.8304
162,0.79306
163,0.75573
164,0.71839
165,0.68106
166,0.64373
167,0.59605
168,0.5471
169,0.49732
170,0.44254
171,0.38444
172,0.32222
173,0.25999
174,0.19777
175,0.13555
176,0.073323
177,0.0111
178,-0.051123
179,-0.11335
180,-0.17515
181,-0.23621
182,-0.28772
183,-0.3375
184,-0.38728
185,-0.45703
186,-0.53515
187,-0.62226
188,-0.70736
189,-0.7890199999999999
190,-0.86369
191,-0.93835
192,-1.0078
193,-1.0637
194,-1.1149
195,-1.1617
196,-1.2001
197,-1.219
198,-1.2315
199,-1.2439
200,-1.2642
201,-1.2877
202,-1.3126
203,-1.3375
204,-1.3623
205,-1.3872
206,-1.4121
207,-1.4326
208,-1.4335
209,-1.4338
210,-1.4338
211,-1.4338
212,-1.4338
213,-1.4337
214,-1.4328
215,-1.4246
216,-1.4121
217,-1.3997
218,-1.3872
219,-1.3748
220,-1.3623
221,-1.3499
222,-1.3375
223,-1.325
224,-1.3126
225,-1.3007
226,-1.2974
227,-1.2959
228,-1.2957
229,-1.2922
230,-1.2839
231,-1.2714
232,-1.2590000000000001
233,-1.2465
234,-1.2341
235,-1.2217
236,-1.2116
237,-1.204
238,-1.2039
239,-1.2039
240,-1.2039
241,-1.2039
242,-1.2039
243,-1.2039
244,-1.1981
245,-1.1891
246,-1.1767
247,-1.1643
248,-1.1518
249,-1.1394
250,-1.1269
251,-1.1145
252,-1.102
253,-1.0896
254,-1.0779
255,-1.0673
256,-1.0659999999999998
257,-1.0659999999999998
258,-1.0659999999999998
259,-1.0585
260,-1.0485
261,-1.036
262,-1.0263
263,-1.02
264,-1.02
265,-1.02
266,-1.02
267,-1.02
268,-1.02
269,-1.02
270,-1.02
271,-1.02
272,-1.02
273,-1.02
274,-1.02
275,-1.02
276,-1.02
277,-1.0114
278,-0.9966200000000001
279,-0.97173
280,-0.9472700000000001
281,-0.9281
282,-0.9281
283,-0.9281
284,-0.9267299999999999
285,-0.91955
286,-0.9087799999999999
287,-0.89661
288,-0.8857799999999999
289,-0.88213
290,-0.88213
291,-0.88213
292,-0.88213
293,-0.88213
294,-0.88213
295,-0.8803
296,-0.87628
297,-0.8638299999999999
298,-0.85139
299,-0.83894
300,-0.8265
301,-0.81405
302,-0.80194
303,-0.79374
304,-0.79019
305,-0.79019
306,-0.79019
307,-0.78409
308,-0.77291
309,-0.76047
310,-0.75097
311,-0.74422
312,-0.74422
313,-0.74422
314,-0.74422
