time,value
0,-0.16382
1,1.037
2,2.3785
3,3.5356
4,4.2093
5,4.2291
6,3.6134
7,2.5636
8,1.3929
9,0.41886999999999996
10,-0.14123
11,-0.23165
12,0.042086
13,0.47193999999999997
14,0.8364299999999999
15,0.9838899999999999
16,0.87808
17,0.59249
18,0.2627
19,0.020781
20,-0.058086
21,0.022141
22,0.19322999999999999
23,0.36234
24,0.4561
25,0.44909
26,0.36614
27,0.26176
28,0.18903
29,0.17423
30,0.20756999999999998
31,0.25278
32,0.26829000000000003
33,0.22884000000000002
34,0.13699
35,0.020012000000000002
36,-0.084494
37,-0.14665999999999998
38,-0.15675999999999998
39,-0.12762
40,-0.08645900000000001
41,-0.061411
42,-0.069284
43,-0.11004000000000001
44,-0.16957
45,-0.22821999999999998
46,-0.27083
47,-0.29168
48,-0.29662
49,-0.29778000000000004
50,-0.3083
51,-0.33132
52,-0.36236999999999997
53,-0.3947
54,-0.42048
55,-0.43532
56,-0.43818999999999997
57,-0.43471000000000004
58,-0.43327
59,-0.44161999999999996
60,-0.46213000000000004
61,-0.49185
62,-0.52454
63,-0.5527
64,-0.57115
65,-0.57696
66,-0.57287
67,-0.5647
68,-0.55908
69,-0.55981
70,-0.56728
71,-0.57926
72,-0.59159
73,-0.60065
74,-0.6028600000000001
75,-0.59853
76,-0.59046
77,-0.58311
78,-0.57992
79,-0.58285
80,-0.59248
81,-0.60746
82,-0.62543
83,-0.64257
84,-0.65647
85,-0.66609
86,-0.67204
87,-0.6755
88,-0.67811
89,-0.6816
90,-0.68679
91,-0.6935
92,-0.69973
93,-0.7036600000000001
94,-0.70399
95,-0.70071
96,-0.6947300000000001
97,-0.68767
98,-0.68188
