time,value
0,-0.5009399999999999
1,-0.5009399999999999
2,-0.5009399999999999
3,-0.5009399999999999
4,-0.5009399999999999
5,-0.5009399999999999
6,-0.5009399999999999
7,-0.5009399999999999
8,-0.5009399999999999
9,-0.5009399999999999
10,-0.5009399999999999
11,-0.5009399999999999
12,-0.5009399999999999
13,-0.5009399999999999
14,-0.5009399999999999
15,-0.5009399999999999
16,-0.5009399999999999
17,-0.5009399999999999
18,-0.5009399999999999
19,-0.5009399999999999
20,-0.5009399999999999
21,-0.5009399999999999
22,-0.51259
23,-0.56161
24,-0.6099899999999999
25,-0.65187
26,-0.65187
27,-0.70468
28,-0.7975899999999999
29,-0.9373100000000001
30,-1.0502
31,-1.1322
32,-1.2052
33,-1.2735
34,-1.3351
35,-1.3668
36,-1.3852
37,-1.3855
38,-1.3572
39,-1.3162
40,-1.2751
41,-1.2321
42,-1.187
43,-1.1255
44,-1.064
45,-1.0024
46,-0.9406200000000001
47,-0.8713700000000001
48,-0.7893399999999999
49,-0.70002
50,-0.6060399999999999
51,-0.5035
52,-0.38856999999999997
53,-0.26883
54,-0.15154
55,-0.21176
56,0.30096
57,0.16207
58,0.26461999999999997
59,0.36716
60,0.46971
61,0.57225
62,0.67479
63,0.7773399999999999
64,0.86926
65,0.9320700000000001
66,0.9939600000000001
67,1.0555
68,1.117
69,1.1685
70,1.2134
71,1.2592
72,1.3128
73,1.3743
74,1.4359
75,1.4961
76,1.5545
77,1.5813
78,1.6019
79,1.6224
80,1.6429
81,1.6666
82,1.706
83,1.742
84,1.7752
85,1.7957
86,1.8242
87,1.8604
88,1.8902
89,1.8999
90,1.8794
91,1.8694
92,1.8635
93,1.8628
94,1.8476
95,1.8255
96,1.7957
97,1.7589
98,1.7166
99,1.6576
100,1.5974
101,1.5358
102,1.4743
103,1.4128
104,1.3513
105,1.2922
106,1.2388
107,1.1978
108,1.1653
109,1.1375
110,1.117
111,1.0965
112,1.0759999999999998
113,1.0555
114,1.035
115,1.0145
116,0.9939600000000001
117,0.97345
118,0.95294
119,0.93243
120,0.9119299999999999
121,0.8914200000000001
122,0.8680100000000001
123,0.8363
124,0.77477
125,0.71325
126,0.65172
127,0.59019
128,0.53895
129,0.49665
130,0.44838
131,0.3944
132,0.33287
133,0.28531
134,0.24123000000000003
135,0.20021
136,0.15919
137,0.12084
138,0.4665
139,0.35063
140,0.24809
141,0.14554
142,0.11684000000000001
143,-0.13379000000000002
144,-0.33834000000000003
145,-0.1173
146,-0.17659
147,-0.23785
148,-0.29936999999999997
149,-0.3609
150,-0.42243
151,-0.48325
152,-0.5415800000000001
153,-0.5884199999999999
154,-0.62685
155,-0.6441600000000001
156,-0.65187
157,-0.65187
158,-0.63136
159,-0.61085
160,-0.59034
161,-0.5698300000000001
162,-0.55515
163,-0.55194
164,-0.55125
165,-0.55125
166,-0.55125
167,-0.56074
168,-0.57613
169,-0.60113
170,-0.64674
171,-0.70827
172,-0.76979
173,-0.8313200000000001
174,-0.89284
175,-1.0072
176,-1.123
177,-1.2307
178,-1.3181
179,-1.3923
180,-1.4417
181,-1.4823
182,-1.5168
183,-1.5373
184,-1.5502
185,-1.5575
186,-1.5575
187,-1.5575
188,-1.5575
189,-1.5303
190,-1.4892
191,-1.4277
192,-1.3811
193,-1.3419
194,-1.3144
195,-1.3059
196,-1.3102
197,-1.3409
198,-1.3818
199,-1.4309
200,-1.5129
201,-1.5949
202,-1.6769999999999998
203,-1.7581
204,-1.817
205,-1.8375
206,-1.8435
207,-1.8401
208,-1.8196
209,-1.7743
210,-1.7177
211,-1.6562
212,-1.5946
213,-1.5354
214,-1.5315
215,-1.5358
216,-1.5486
217,-1.5113
218,-1.4576
219,-1.383
220,-1.2854
221,-1.1775
222,-1.0551
223,-0.9379700000000001
224,-0.82491
225,-0.72237
226,-0.6198199999999999
227,-0.51823
228,-0.43491
229,-0.38269000000000003
230,-0.36218
231,-0.35433000000000003
232,-0.34815
233,-0.34334000000000003
234,-0.29136
235,-0.22415
236,-0.14211
237,-0.22296999999999997
238,0.28974
239,0.15983
240,0.25372
241,0.34056
242,0.40209
243,0.44776000000000005
244,0.47788
245,0.49887
246,0.51937
247,0.53988
248,0.54987
249,0.5555899999999999
250,0.5555899999999999
251,0.5555899999999999
252,0.5555899999999999
253,0.5555899999999999
254,0.5555899999999999
255,0.5555899999999999
256,0.5555899999999999
257,0.55872
258,0.56481
259,0.58475
260,0.59927
261,0.6050399999999999
262,0.6059
263,0.6059
264,0.6059
265,0.61446
266,0.62769
267,0.6482
268,0.65591
269,0.6562100000000001
270,0.6562100000000001
271,0.6562100000000001
272,0.6562100000000001
273,0.6562100000000001
274,0.6562100000000001
275,0.6562100000000001
276,0.6562100000000001
277,0.6604399999999999
278,0.6742199999999999
279,0.6916100000000001
280,0.70652
281,0.70652
282,0.70652
283,0.70652
284,0.70652
285,0.70652
286,0.70652
287,0.70652
288,0.70652
289,0.70652
290,0.6925600000000001
291,0.67511
292,0.6546
293,0.6341
294,0.61359
295,0.59308
296,0.57257
297,0.55206
298,0.53155
299,0.50581
300,0.47568999999999995
301,0.43478
302,0.40967
303,0.40519
304,0.4103
305,0.42132
306,0.44183
307,0.43906999999999996
308,0.42778
309,0.41048
310,0.40465
311,0.40595
312,0.4178
313,0.43446
314,0.45496000000000003
315,-0.91638
316,-0.91638
317,-0.91638
318,-0.91638
319,-0.91638
320,-0.91638
321,-0.91638
322,-0.91638
323,-0.91638
324,-0.91638
325,-0.91638
326,-0.91638
327,-0.91638
328,-0.91638
329,-0.91638
330,-0.91638
331,-0.91638
332,-0.91638
333,-0.91638
334,-0.91638
335,-0.91638
336,-0.91638
337,-0.9223
338,-0.9472
339,-0.97177
340,-0.99305
341,-0.99305
342,-1.016
343,-1.0565
344,-1.117
345,-1.1640000000000001
346,-1.1952
347,-1.2127
348,-1.2229999999999999
349,-1.2229999999999999
350,-1.1549
351,-1.0678
352,-0.9740000000000001
353,-0.88025
354,-0.78974
355,-0.71942
356,-0.65053
357,-0.58189
358,-0.48813
359,-0.39438
360,-0.30062
361,-0.20551999999999998
362,-0.37913
363,0.11102000000000001
364,0.28743
365,0.45674
366,0.613
367,0.76926
368,0.92422
369,1.0717
370,1.2058
371,1.3299
372,1.433
373,1.5277
374,1.6137
375,1.6487
376,1.6864
377,1.7347
378,1.7947
379,1.841
380,1.8430000000000002
381,1.8435
382,1.8435
383,1.8435
384,1.8435
385,1.8435
386,1.8435
387,1.8435
388,1.8435
389,1.8435
390,1.8426
391,1.8402
392,1.8138
393,1.7825
394,1.7513
395,1.72
396,1.6936
397,1.6912
398,1.6902
399,1.6902
400,1.6902
401,1.6902
402,1.6902
403,1.6902
404,1.6902
405,1.6902
406,1.6582
407,1.6133
408,1.5518
409,1.5125
410,1.4787
411,1.4333
412,1.3772
413,1.3147
414,1.2522
415,1.1897
416,1.1272
417,1.0647
418,0.98395
419,0.8765200000000001
420,0.76161
421,0.66135
422,0.5988399999999999
423,0.5363399999999999
424,0.47384
425,0.41133000000000003
426,0.36832
427,0.33562
428,0.29167
429,0.23798000000000002
430,0.17548
431,0.13809000000000002
432,0.1037
433,0.36554000000000003
434,0.20928000000000002
435,0.085244
436,0.23116
437,0.07306499999999999
438,-0.21154
439,-0.18869
440,-0.34495
441,-0.1009
442,-0.13216
443,-0.16341
444,-0.19466
445,-0.22591
446,-0.25716
447,-0.28841999999999995
448,-0.31966999999999995
449,-0.34891
450,-0.37381
451,-0.37973
452,-0.38785
453,-0.42691999999999997
454,-0.47938000000000003
455,-0.5330600000000001
456,-0.5330600000000001
457,-0.5330600000000001
458,-0.5330600000000001
459,-0.5330600000000001
460,-0.5573100000000001
461,-0.61298
462,-0.66606
463,-0.71178
464,-0.74303
465,-0.8097300000000001
466,-0.8883700000000001
467,-0.97236
468,-1.0214
469,-1.0526
470,-1.0839
471,-1.1151
472,-1.1464
473,-1.1151
474,-1.0839
475,-1.0526
476,-1.0214
477,-0.9989899999999999
478,-0.99411
479,-0.98655
480,-0.9730200000000001
481,-0.9417700000000001
482,-0.9105200000000001
483,-0.8796799999999999
484,-0.8518399999999999
485,-0.83972
486,-0.84005
487,-0.87325
488,-0.9198
489,-0.9823
490,-1.0716
491,-1.1604
492,-1.2424
493,-1.3090000000000002
494,-1.3715
495,-1.4340000000000002
496,-1.4825
497,-1.515
498,-1.4838
499,-1.4066
500,-1.2945
501,-1.148
502,-1.0697
503,-1.0697
504,-1.0283
505,-0.9657
506,-0.8719399999999999
507,-0.7781899999999999
508,-0.68697
509,-0.60347
510,-0.53452
511,-0.48177
512,-0.48958
513,-0.50795
514,-0.5330600000000001
515,-0.5330600000000001
516,-0.5330600000000001
517,-0.5330600000000001
518,-0.53261
519,-0.52085
520,-0.4896
521,-0.43615
522,-0.3685
523,-0.27474
524,-0.16211
525,-0.19437000000000001
526,0.47461000000000003
527,0.2414
528,0.39679000000000003
529,0.5310699999999999
530,0.66275
531,0.79167
532,0.9460299999999999
533,1.0894
534,1.2115
535,1.3103
536,1.4122
537,1.5362
538,1.6348
539,1.7141
540,1.7454
541,1.746
542,1.7255
543,1.6869
544,1.6365
545,1.574
546,1.5115
547,1.4499
548,1.3899
549,1.3538
550,1.3182
551,1.2713
552,1.2131
553,1.1555
554,1.1218
555,1.083
556,1.0398
557,0.9772799999999999
558,0.9027
559,0.8162699999999999
560,0.72844
561,0.6506
562,0.5881
563,0.50957
564,0.4248
565,0.33202
566,0.26142
567,0.20144
568,0.1531
569,0.11542000000000001
570,0.42413
571,0.26788
572,0.1355
573,0.17556
574,0.14655
575,-0.15739
576,-0.13662
577,-0.28636
578,-0.44261000000000006
579,-0.12044
580,-0.13863
581,-0.14973
582,-0.14973
583,-0.14973
584,-0.15074
585,-0.16344
586,-0.18587
587,-0.21711999999999998
588,-0.22326
589,-0.22965
590,-0.23746
591,-0.26546
592,-0.29672
593,-0.32797
594,-0.35702
595,-0.37973
596,-0.37973
597,-0.3901
598,-0.40756
599,-0.43881000000000003
600,-0.4544
601,-0.45635
602,-0.4674
603,-0.48716000000000004
604,-0.51841
605,-0.5283899999999999
606,-0.5350699999999999
607,-0.54142
608,-0.56675
609,-0.598
610,-0.62926
611,-0.66051
612,-0.69176
613,-0.72301
614,-0.75426
615,-0.78551
616,-0.81677
617,-0.8480200000000001
618,-0.8792700000000001
619,-0.90192
620,-0.91638
621,-0.91638
622,-0.91638
623,-0.91638
624,-0.91638
625,-0.91638
626,-0.91638
627,-0.91638
628,-0.91638
629,-0.91638
630,-0.19925
631,-0.19925
632,-0.19925
633,-0.19925
634,-0.19925
635,-0.19925
636,-0.19925
637,-0.19925
638,-0.19925
639,-0.19925
640,-0.19925
641,-0.19925
642,-0.19925
643,-0.19925
644,-0.19925
645,-0.19925
646,-0.19925
647,-0.19925
648,-0.19925
649,-0.19925
650,-0.19925
651,-0.19925
652,-0.19269
653,-0.16510999999999998
654,-0.13789
655,-0.11433
656,-0.11433
657,-0.4728
658,-0.30463
659,-0.29527
660,0.21464
661,0.47426999999999997
662,0.13848
663,0.17884
664,0.21345999999999998
665,0.26066
666,0.31277
667,0.37038000000000004
668,0.43604
669,0.51068
670,0.6188600000000001
671,0.7328899999999999
672,0.85065
673,0.9545
674,1.0535
675,1.147
676,1.2341
677,1.3207
678,1.4072
679,1.4815
680,1.5479
681,1.5998
682,1.6517
683,1.7037
684,1.7556
685,1.8075
686,1.8594
687,1.9114
688,1.9633
689,2.0152
690,2.0671
691,2.1013
692,2.1059
693,2.0782
694,2.0391
695,1.9877
696,1.9263
697,1.8575
698,1.771
699,1.6675
700,1.5525
701,1.4313
702,1.3101
703,1.189
704,1.0678
705,0.9477
706,0.82924
707,0.73733
708,0.65318
709,0.57529
710,0.50366
711,0.43442
712,0.36519
713,0.30326
714,0.24727
715,0.21265
716,0.18472
717,0.16335999999999998
718,0.14276
719,0.11664000000000001
720,0.41341999999999995
721,0.24033000000000002
722,0.066467
723,-0.10933
724,-0.34655
725,-0.1219
726,-0.17382
727,-0.22575
728,-0.27978000000000003
729,-0.36199000000000003
730,-0.44378999999999996
731,-0.5252
732,-0.59492
733,-0.66415
734,-0.73339
735,-0.80055
736,-0.8629399999999999
737,-0.91486
738,-0.9667899999999999
739,-1.0187
740,-1.0706
741,-1.1226
742,-1.1728
743,-1.2037
744,-1.2183
745,-1.2183
746,-1.2183
747,-1.2201
748,-1.2244
749,-1.2399
750,-1.2537
751,-1.2594
752,-1.262
753,-1.2667
754,-1.284
755,-1.3071
756,-1.3341
757,-1.3687
758,-1.3946
759,-1.413
760,-1.4242
761,-1.4306
762,-1.4306
763,-1.4306
764,-1.4317
765,-1.4352
766,-1.4493
767,-1.4643
768,-1.4708
769,-1.4725
770,-1.4701
771,-1.4528
772,-1.4355
773,-1.4182
774,-1.4009
775,-1.3836
776,-1.3662
777,-1.3442
778,-1.3176
779,-1.2829
780,-1.2581
781,-1.2378
782,-1.2232
783,-1.2183
784,-1.2194
785,-1.2294
786,-1.2435
787,-1.2608
788,-1.2608
789,-1.2608
790,-1.2608
791,-1.2608
792,-1.2509
793,-1.2217
794,-1.1919
795,-1.1648
796,-1.1475
797,-1.1301
798,-1.1126
799,-1.0934
800,-1.0655
801,-1.0309
802,-0.9962700000000001
803,-0.96165
804,-0.9270299999999999
805,-0.90728
806,-0.89169
807,-0.88087
808,-0.8786200000000001
809,-0.87534
810,-0.86155
811,-0.84536
812,-0.82805
813,-0.81074
814,-0.79343
815,-0.7761399999999999
816,-0.7599199999999999
817,-0.75124
818,-0.75124
819,-0.7436
820,-0.7320399999999999
821,-0.71473
822,-0.6974199999999999
823,-0.6787
824,-0.65572
825,-0.62467
826,-0.59005
827,-0.55543
828,-0.5173399999999999
829,-0.47591999999999995
830,-0.40668000000000004
831,-0.33255999999999997
832,-0.25305
833,-0.16657
834,-0.33166999999999996
835,0.27414
836,0.16303
837,0.26404
838,0.35058
839,0.41621
840,0.47156000000000003
841,0.51862
842,0.55829
843,0.59435
844,0.6654800000000001
845,0.7461899999999999
846,0.83706
847,0.9561200000000001
848,1.0773
849,1.1984
850,1.3196
851,1.4363
852,1.5407
853,1.6399
854,1.7353
855,1.8218
856,1.8744
857,1.9039
858,1.9171
859,1.9238
860,1.9238
861,1.9024
862,1.8751
863,1.8405
864,1.8059
865,1.7689
866,1.7256
867,1.6761
868,1.6215
869,1.5536
870,1.4812
871,1.4053
872,1.3188
873,1.2389
874,1.1657
875,1.0962
876,1.0270000000000001
877,0.95775
878,0.88851
879,0.8192799999999999
880,0.7500399999999999
881,0.6808
882,0.61297
883,0.55157
884,0.49608
885,0.44626000000000005
886,0.42462
887,0.4105
888,0.40347
889,0.41981999999999997
890,0.43208
891,0.43693999999999994
892,0.43351999999999996
893,0.41981999999999997
894,0.3852
895,0.34335
896,0.29757
897,0.24565
898,0.20452
899,0.16965
900,0.13502999999999998
901,0.10041
902,0.33229000000000003
903,0.1592
904,-0.087922
905,-0.18698
906,-0.36007
907,-0.10729000000000001
908,-0.14190999999999998
909,-0.17653
910,-0.21115
911,-0.24577
912,-0.27464
913,-0.29958
914,-0.31689
915,-0.32553000000000004
916,-0.32661
917,-0.32663000000000003
918,-0.32663000000000003
919,-0.32663000000000003
920,-0.32663000000000003
921,-0.32663000000000003
922,-0.32663000000000003
923,-0.32663000000000003
924,-0.32888
925,-0.3397
926,-0.35423000000000004
927,-0.36909000000000003
928,-0.36909000000000003
929,-0.36909000000000003
930,-0.36909000000000003
931,-0.36909000000000003
932,-0.36909000000000003
933,-0.36909000000000003
934,-0.36432
935,-0.35503
936,-0.33771999999999996
937,-0.32041
938,-0.3031
939,-0.28579
940,-0.26848
941,-0.25226
942,-0.24495999999999998
943,-0.24170999999999998
944,-0.24170999999999998
