time,value
0,-0.69265
1,-0.60614
2,-0.52261
3,-0.2635
4,0.041514999999999996
5,0.31476
6,0.5365300000000001
7,0.83565
8,1.1737
9,1.327
10,1.3924
11,1.435
12,1.5455
13,1.5075
14,1.3519999999999999
15,1.1178
16,0.8357700000000001
17,0.53382
18,0.26406
19,-0.024005000000000002
20,-0.28889000000000004
21,-0.49045
22,-0.56021
23,-0.61793
24,-0.49113
25,-0.25988
26,-0.013772
27,0.2557
28,0.52253
29,0.8289700000000001
30,1.0749
31,1.3573
32,1.5143
33,1.4638
34,1.3654
35,1.3344
36,1.3719
37,1.3805
38,1.4356
39,1.5423
40,1.6594
41,1.4217
42,1.1385
43,0.84735
44,0.55472
45,0.29399000000000003
46,0.020673
47,-0.22144
48,-0.45691000000000004
49,-0.5867
50,-0.74432
51,-0.82547
52,-0.91617
53,-1.0747
54,-1.2205
55,-1.3008
56,-1.3838
57,-1.338
58,-1.2343
59,-1.1156
60,-0.96001
61,-0.80497
62,-0.70906
63,-0.58202
64,-0.42667
65,-0.48134
66,-0.5237
67,-0.6523399999999999
68,-0.7577699999999999
69,-0.9096200000000001
70,-1.0878
71,-1.1840000000000002
72,-1.2504
73,-1.2882
74,-1.3395
75,-1.2768
76,-1.212
77,-1.0924
78,-0.96765
79,-0.8407899999999999
