time,value
0,2.1896
1,1.9366
2,1.6539
3,1.3361
4,1.0155
5,0.80555
6,0.60958
7,0.35686999999999997
8,0.1376
9,0.19583
10,0.039242
11,-0.017419
12,-0.12265
13,-0.28275
14,-0.30428
15,-0.34131999999999996
16,-0.46876999999999996
17,-0.61752
18,-0.66937
19,-0.81342
20,-0.69394
21,-0.8309200000000001
22,-0.9547899999999999
23,-0.9077700000000001
24,-1.0298
25,-0.99461
26,-1.1362
27,-1.214
28,-1.13
29,-1.0704
30,-1.1289
31,-1.2095
32,-1.0912
33,-1.1307
34,-1.0447
35,-1.077
36,-0.95676
37,-0.9144
38,-0.81814
39,-0.78204
40,-0.82363
41,-0.72113
42,-0.6343300000000001
43,-0.50412
44,-0.44406999999999996
45,-0.23515999999999998
46,-0.071668
47,0.055699
48,0.22257
49,0.42468999999999996
50,0.60839
51,0.73374
52,0.8544
53,0.97054
54,1.0536
55,1.1709
56,1.0732
57,1.2657
58,1.4559
59,1.604
60,1.7167
61,1.7099
62,1.8924
63,1.975
64,2.0011
65,1.8626
66,1.7002
67,1.6507
68,1.7242
69,1.4680000000000002
70,1.173
71,0.8286399999999999
72,0.58973
73,0.43686
74,0.37235999999999997
75,0.31637
76,0.17795999999999998
77,0.075449
78,-0.083512
79,-0.25740999999999997
80,-0.3894
81,-0.5102300000000001
82,-0.6121300000000001
83,-0.76876
84,-0.93645
85,-1.032
86,-1.1323
87,-1.253
88,-1.2799
89,-1.3315
90,-1.2529
91,-0.99169
92,-1.0943
93,-1.0475
94,-1.1148
95,-1.0597
96,-1.0209
97,-1.0657
98,-1.0657
99,-1.002
100,-0.81712
101,-0.7611899999999999
102,-0.76308
103,-0.63421
104,-0.65997
105,-0.69108
106,-0.53633
107,-0.40548
108,-0.38413
109,-0.24541999999999997
110,-0.31814000000000003
111,-0.12868
112,-0.14590999999999998
113,0.02915
114,-0.11250999999999999
115,0.07814199999999999
116,0.1525
117,0.16525
118,0.30612
119,0.24113
120,0.42296000000000006
121,0.5747800000000001
122,0.77968
123,1.0475
124,1.2657
125,1.5807
126,1.8511
127,2.1566
