time,value
0,1.9334
1,1.791
2,1.6664
3,1.435
4,1.3104
5,1.1146
6,0.86541
7,0.68742
8,0.52723
9,0.38483
10,0.11785
11,-0.042344
12,-0.13134
13,-0.060142999999999995
14,-0.060142999999999995
15,-0.27373000000000003
16,-0.48732
17,-0.48732
18,-0.45171999999999995
19,-0.5229199999999999
20,-0.62971
21,-0.70091
22,-0.7721100000000001
23,-0.7721100000000001
24,-0.80771
25,-0.80771
26,-0.78991
27,-0.73651
28,-0.7187100000000001
29,-0.7187100000000001
30,-0.70091
31,-0.6653100000000001
32,-0.6653100000000001
33,-0.70091
34,-0.7187100000000001
35,-0.73651
36,-0.73651
37,-0.70091
38,-0.7187100000000001
39,-0.7187100000000001
40,-0.70091
41,-0.70091
42,-0.70091
43,-0.7187100000000001
44,-0.73651
45,-0.75431
46,-0.7721100000000001
47,-0.7721100000000001
48,-0.7721100000000001
49,-0.80771
50,-0.8255100000000001
51,-0.8255100000000001
52,-0.8433
53,-0.8433
54,-0.8967
55,-0.9323
56,-0.9323
57,-0.9501
58,-0.9145
59,-0.9501
60,-0.9679
61,-0.9857
62,-0.9857
63,-0.9501
64,-0.8967
65,-0.8789
66,-0.8611
67,-0.8255100000000001
68,-0.78991
69,-0.75431
70,-0.73651
71,-0.7187100000000001
72,-0.6653100000000001
73,-0.61192
74,-0.61192
75,-0.61192
76,-0.61192
77,-0.61192
78,-0.55852
79,-0.48732
80,-0.48732
81,-0.48732
82,-0.5229199999999999
83,-0.59412
84,-0.5763199999999999
85,-0.50512
86,-0.61192
87,-0.78991
88,-1.0925
89,-0.9857
90,-1.1459
91,-1.3595
92,-1.4129
93,-1.2883
94,-1.0035
95,-0.30933
96,-0.7721100000000001
97,-0.46952
98,1.9156
99,2.2715
100,1.0968
101,0.61622
102,0.31364000000000003
103,0.49163
104,1.4706
105,2.5385
106,2.8411
107,3.0725
108,2.8411
109,3.0191
110,2.2359
111,0.34924
112,0.24244000000000002
113,0.36704000000000003
114,0.42043
115,0.42043
116,0.34924
117,0.34924
118,0.36704000000000003
119,0.36704000000000003
120,0.31364000000000003
121,0.24244000000000002
122,0.11785
123,0.17125
124,0.31364000000000003
125,0.38483
126,0.45603
127,0.38483
128,0.40263000000000004
129,0.45603
130,0.47383000000000003
131,0.43823
132,0.72302
133,0.82981
134,0.86541
135,0.99
136,1.2214
137,1.4706
138,1.6842
139,1.88
140,2.0402
141,2.1469
142,2.2715
143,2.3605
144,2.3961
145,2.3783
146,2.2181
147,1.9868
148,1.8978
149,1.7198
150,1.524
151,1.3282
152,1.1502
153,0.86541
154,0.70522
155,0.70522
156,0.49163
157,0.27804
158,0.20684
159,0.18904
160,0.15345
161,0.11785
162,0.06445
163,0.011053
164,-0.077942
165,-0.16694
166,-0.29153
167,-0.36273
168,-0.36273
169,-0.39833
170,-0.43392
171,-0.54072
172,-0.55852
173,-0.50512
174,-0.48732
175,-0.50512
176,-0.5763199999999999
177,-0.59412
178,-0.5763199999999999
179,-0.55852
180,-0.5229199999999999
181,-0.5229199999999999
182,-0.48732
183,-0.43392
184,-0.45171999999999995
185,-0.46952
186,-0.50512
187,-0.61192
188,-0.55852
189,-0.5763199999999999
190,-0.61192
191,-0.59412
192,-0.59412
193,-0.62971
194,-0.64751
195,-0.64751
196,-0.64751
197,-0.68311
198,-0.70091
199,-0.70091
200,-0.68311
201,-0.7187100000000001
202,-0.6653100000000001
203,-0.59412
204,-0.62971
205,-0.68311
206,-0.62971
207,-0.5763199999999999
208,-0.68311
209,-0.78991
210,-0.8433
211,-0.8255100000000001
212,-0.80771
213,-0.7187100000000001
214,-0.64751
215,-0.62971
216,-0.62971
217,-0.50512
218,-0.45171999999999995
219,-0.50512
220,-0.59412
221,-0.50512
222,-0.41613
223,-0.36273
224,-0.30933
225,-0.14914000000000002
226,-0.024544999999999997
227,-0.20254
228,-0.32713000000000003
229,-0.38053000000000003
230,-0.5229199999999999
231,-0.7187100000000001
232,-0.61192
233,-0.5229199999999999
234,-0.68311
235,-0.80771
236,-0.68311
237,-0.64751
238,-0.8967
239,-1.2883
240,-1.3061
241,-1.3417
242,-1.0569
243,-0.78991
244,-0.54072
245,-0.27373000000000003
246,-0.024544999999999997
247,0.08225
248,-0.060142999999999995
249,-0.060142999999999995
250,-0.077942
251,-0.25593
252,-0.43392
253,-0.30933
254,-0.22034
255,-0.024544999999999997
256,0.06445
257,0.11785
258,0.028852
259,0.046651
260,-0.006745999999999999
261,-0.006745999999999999
262,0.10005
263,0.15345
264,0.08225
265,0.011053
266,-0.024544999999999997
267,0.08225
268,0.26024
269,0.13565
270,-0.18474000000000002
271,-0.23813
272,-0.042344
273,0.22464
274,0.27804
275,0.58062
276,0.7942100000000001
277,0.9544100000000001
278,1.1502
279,1.3994
280,1.6486
281,1.8622
282,2.0935
283,2.2715
284,2.4851
285,2.6275
286,2.6275
287,2.5385
288,2.4673
289,2.4139
290,2.3427
291,2.2181
292,2.1647
293,2.0758
294,2.0046
295,1.8978
296,1.7732
297,1.6664
298,1.5062
299,1.3282
300,1.1146
301,0.82981
302,0.58062
303,0.38483
304,0.24244000000000002
305,0.17125
306,0.011053
307,-0.095742
308,-0.18474000000000002
309,-0.22034
310,-0.30933
311,-0.45171999999999995
312,-0.55852
313,-0.5763199999999999
314,-0.55852
315,-0.55852
316,-0.55852
317,-0.55852
318,-0.59412
319,-0.62971
320,-0.62971
321,-0.61192
322,-0.59412
323,-0.61192
324,-0.64751
325,-0.62971
326,-0.64751
327,-0.62971
328,-0.62971
329,-0.62971
330,-0.61192
331,-0.59412
332,-0.61192
333,-0.6653100000000001
334,-0.7187100000000001
335,-0.78991
336,-0.8255100000000001
337,-0.80771
338,-0.8255100000000001
339,-0.8433
340,-0.8611
341,-0.8967
342,-0.8789
