time,value
0,0.37459000000000003
1,0.29335
2,0.3018
3,0.051146
4,0.16365
5,0.061696
6,-0.12838
7,0.49963
8,0.18716
9,-0.42131
10,-0.43331000000000003
11,-0.5047699999999999
12,-0.33209
13,0.32189
14,-0.24336
15,0.32306999999999997
16,1.5055
17,1.5055
18,1.5055
19,1.5055
20,1.5055
21,1.5055
22,1.5055
23,1.5055
24,1.5055
25,1.5055
26,1.5055
27,1.5055
28,1.5055
29,-1.4877
30,-1.4877
31,-1.4877
32,-1.4877
33,-1.4877
34,-1.4877
35,-1.4877
36,-1.4877
37,-1.4877
38,-1.4877
39,-1.4877
40,-1.4877
41,-0.010579
42,0.39794
43,-0.34175
44,0.078587
45,0.017130000000000003
46,0.18309
47,-0.30418
48,-0.012027
49,0.08401499999999999
50,0.35028000000000004
51,0.064371
52,0.24611999999999998
53,0.54883
54,-0.07317799999999999
55,-0.77937
56,0.43513
57,0.70019
58,-0.18946
59,-0.10021000000000001
60,-0.047777999999999994
61,0.018503
62,-0.23165999999999998
63,-0.21175
64,-0.049625
65,-0.26221
66,0.047727
67,-0.28623000000000004
68,-0.25683
69,0.33425
70,-0.19996
71,0.035505
72,-0.35954
73,0.29303
74,0.11194000000000001
75,0.042968
76,-0.10378
77,-0.35906
78,0.26038
79,-0.16604000000000002
80,-0.36891
81,-0.16697
82,0.20105
83,-0.28814
84,-0.23774
85,-0.28253
86,0.24447
87,0.14769000000000002
88,0.046766
89,0.14447000000000002
90,-0.14590999999999998
91,-0.021603999999999998
92,0.00079682
93,-0.5523899999999999
94,-0.40701
95,0.24568
96,0.041312
97,-1.4877
98,-1.4877
99,-1.4877
100,-1.4877
101,-1.4877
102,-1.4877
103,-1.4877
104,-1.4877
105,-1.4877
106,-1.4877
107,-1.4877
108,-1.4877
109,-1.4877
110,-1.4877
111,-1.4877
112,1.5055
113,1.5055
114,1.5055
115,1.5055
116,1.5055
117,1.5055
118,1.5055
119,1.5055
120,1.5055
121,1.5055
122,1.5055
123,1.5055
124,1.5055
125,1.5055
126,0.20115999999999998
127,0.29648
