time,value
0,0.26183
1,0.26183
2,0.26183
3,0.26183
4,0.26183
5,0.26183
6,0.26183
7,0.26183
8,0.26183
9,0.26183
10,0.26183
11,0.26183
12,0.26183
13,0.26183
14,0.26183
15,0.26183
16,0.26183
17,0.26183
18,0.26183
19,0.26183
20,0.26183
21,0.26183
22,0.26183
23,0.26183
24,0.26183
25,0.26183
26,0.26183
27,0.26183
28,0.26183
29,0.26183
30,0.26183
31,0.26183
32,0.26183
33,0.26183
34,0.26183
35,0.26183
36,0.26183
37,0.26183
38,0.26183
39,0.26183
40,0.26183
41,0.26183
42,0.26183
43,0.26183
44,0.26183
45,0.26183
46,0.26183
47,0.26183
48,0.26183
49,0.26183
50,0.26183
51,0.26183
52,0.26183
53,0.26531
54,0.2835
55,0.36191
56,0.45895
57,0.556
58,0.65305
59,0.7500899999999999
60,0.84714
61,0.9441799999999999
62,1.0412
63,1.1322
64,1.1989
65,1.2141
66,1.2141
67,1.2141
68,1.2141
69,1.2141
70,1.2141
71,1.2141
72,1.2141
73,1.2097
74,1.1884
75,1.1459
76,1.0973
77,1.0488
78,1.0003
79,0.97603
80,0.97603
81,0.97603
82,0.97603
83,0.9700700000000001
84,0.94278
85,0.89869
86,0.8501700000000001
87,0.80165
88,0.74745
89,0.67124
90,0.5742
91,0.47715
92,0.3801
93,0.28306
94,0.18600999999999998
95,0.46485
96,-0.10751
97,-0.10512
98,-0.21364
99,-0.34167
100,-0.48723999999999995
101,-0.63281
102,-0.7783800000000001
103,-0.93327
104,-1.1183
105,-1.3106
106,-1.5047
107,-1.6988
108,-1.8929
109,-2.0869999999999997
110,-2.2811
111,-2.4752
112,-2.6693
113,-2.8075
114,-2.7742
115,-2.7284
116,-2.6799
117,-2.6313
118,-2.5361
119,-2.4130000000000003
120,-2.2674
121,-2.1219
122,-1.9742
123,-1.814
124,-1.6199
125,-1.4259
126,-1.2318
127,-1.0377
128,-0.8435799999999999
129,-0.64949
130,-0.4554
131,-0.26131
132,-0.41036000000000006
133,0.26771999999999996
134,0.098066
135,0.14659
136,0.19510999999999998
137,0.24363
138,0.2207
139,0.18298
140,0.13446
141,0.44969
142,0.31322
143,0.31322
144,0.10715999999999999
145,0.15569000000000002
146,0.20421
147,0.25273
148,0.21711
149,0.17388
150,0.12536
151,0.4042
152,0.086315
153,-0.3009
154,-0.16122999999999998
155,-0.25827
156,-0.35531999999999997
157,-0.45237
158,-0.5979300000000001
159,-0.7435
160,-0.88907
161,-1.0346
162,-1.1214
163,-1.1666
164,-1.1666
165,-1.1666
166,-1.1613
167,-1.1484
168,-1.0513
169,-0.9542700000000001
170,-0.8572299999999999
171,-0.76018
172,-0.63888
173,-0.50392
174,-0.35835
175,-0.21278000000000002
176,-0.31606999999999996
177,0.41178000000000003
178,0.22391999999999998
179,0.36949
180,0.5150600000000001
181,0.66063
182,0.8352299999999999
183,1.023
184,1.2171
185,1.4112
186,1.5805
187,1.7175
188,1.766
189,1.8146
190,1.8631
191,1.9116
192,1.9262
193,1.9283
194,1.9283
195,1.9283
196,1.9283
197,1.9283
198,1.9283
199,1.9283
200,1.9255
201,1.9104
202,1.7236
203,1.4809999999999999
204,1.2384
205,0.99574
206,0.75312
207,0.51051
208,0.2679
209,0.14642
210,-0.2156
211,-0.44911
212,-0.65252
213,-0.8466100000000001
214,-1.0407
215,-1.2348
216,-1.3763
217,-1.4592
218,-1.5077
219,-1.5563
220,-1.5896
221,-1.5623
222,-1.4061
223,-1.2121
224,-1.018
225,-0.8238700000000001
226,-0.62978
227,-0.43568999999999997
228,-0.24159
229,-0.2175
230,0.14215
231,0.31501
232,0.46653999999999995
233,0.61211
234,0.75767
235,0.9032399999999999
236,1.0003
237,1.0488
238,1.0973
239,1.1459
240,1.1825
241,1.1764
242,1.1368
243,1.0882
244,1.0397
245,0.97983
246,0.87595
247,0.73038
248,0.58481
249,0.43923999999999996
250,0.28609
251,0.10715999999999999
252,-0.39946
253,-0.27799
254,-0.47208
255,-0.64323
256,-0.77535
257,-0.87239
258,-0.96944
259,-1.0665
260,-1.1542
261,-1.2118
262,-1.2621
263,-1.3106
264,-1.3591
265,-1.3903
266,-1.4046
267,-1.4046
268,-1.4046
269,-1.4046
270,-1.3935
271,-1.348
272,-1.3
273,-1.2515
274,-1.203
275,-1.1077
276,-0.9846
277,-0.8390299999999999
278,-0.6934600000000001
279,-0.5479
280,-0.40233
281,-0.25676
282,-0.11119000000000001
283,0.19191
284,0.17995
285,0.23701999999999998
286,0.26183
287,0.26183
288,0.26183
289,0.26183
290,0.26183
291,0.26183
292,0.26183
293,0.26183
294,0.26183
295,0.26183
296,0.26183
297,0.26183
298,0.26183
299,0.25122
300,0.22695
301,0.17843
302,0.12991
303,0.42694
304,0.18433
305,0.15207
306,0.13884000000000002
307,0.13884000000000002
308,0.13884000000000002
309,0.2141
310,0.35871
311,0.11625999999999999
312,0.16479000000000002
313,0.21331
314,0.26183
315,-1.4939
316,-1.4939
317,-1.4939
318,-1.4939
319,-1.4939
320,-1.4939
321,-1.4939
322,-1.4939
323,-1.4939
324,-1.4939
325,-1.4939
326,-1.4939
327,-1.4939
328,-1.4939
329,-1.4939
330,-1.4939
331,-1.4939
332,-1.4939
333,-1.4939
334,-1.4939
335,-1.4939
336,-1.4939
337,-1.4939
338,-1.4939
339,-1.4939
340,-1.4939
341,-1.4939
342,-1.4939
343,-1.4939
344,-1.4939
345,-1.4939
346,-1.4939
347,-1.4939
348,-1.4939
349,-1.4939
350,-1.4939
351,-1.4939
352,-1.4939
353,-1.4939
354,-1.4939
355,-1.4939
356,-1.4939
357,-1.4939
358,-1.4939
359,-1.4939
360,-1.4939
361,-1.4939
362,-1.4939
363,-1.4939
364,-1.4939
365,-1.4939
366,-1.4939
367,-1.4939
368,-1.4919
369,-1.4814
370,-1.4359
371,-1.3796
372,-1.3233
373,-1.2670000000000001
374,-1.2209
375,-1.1861
376,-1.1579
377,-1.1298
378,-1.1034
379,-1.084
380,-1.0796
381,-1.0796
382,-1.0796
383,-1.0796
384,-1.0675
385,-1.0427
386,-1.0145
387,-0.9864
388,-0.95825
389,-0.93011
390,-0.90196
391,-0.8738100000000001
392,-0.84567
393,-0.81752
394,-0.78937
395,-0.76122
396,-0.7330800000000001
397,-0.7049300000000001
398,-0.67678
399,-0.64864
400,-0.62049
401,-0.59234
402,-0.5642
403,-0.53605
404,-0.5079
405,-0.47975
406,-0.45161
407,-0.42346000000000006
408,-0.39971
409,-0.39092
410,-0.38916
411,-0.38916
412,-0.38916
413,-0.38916
414,-0.38916
415,-0.38916
416,-0.38916
417,-0.38916
418,-0.39455999999999997
419,-0.41743
420,-0.44456999999999997
421,-0.47272
422,-0.5008600000000001
423,-0.53909
424,-0.58706
425,-0.64336
426,-0.69965
427,-0.75595
428,-0.79281
429,-0.76994
430,-0.74275
431,-0.7146100000000001
432,-0.6864600000000001
433,-0.67187
434,-0.66535
435,-0.66535
436,-0.66535
437,-0.66295
438,-0.6459999999999999
439,-0.5897
440,-0.53341
441,-0.47711000000000003
442,-0.42081999999999997
443,-0.36453
444,-0.30823
445,-0.25194
446,-0.19565
447,-0.14300000000000002
448,-0.47003999999999996
449,-0.3293
450,-0.18857000000000002
451,-0.29054
452,0.092902
453,0.13
454,0.14568
455,0.14568
456,0.14568
457,0.14568
458,0.14568
459,0.14568
460,0.14568
461,0.14568
462,0.14568
463,0.2677
464,0.40076
465,0.1043
466,0.13244
467,0.16059
468,0.18874000000000002
469,0.21689
470,0.24503000000000003
471,0.27318000000000003
472,0.30133000000000004
473,0.32947
474,0.35762
475,0.38577
476,0.41391000000000006
477,0.45343
478,0.5009899999999999
479,0.55729
480,0.61358
481,0.6683399999999999
482,0.7208899999999999
483,0.7490399999999999
484,0.7771899999999999
485,0.80533
486,0.8334799999999999
487,0.8897799999999999
488,0.9619
489,1.0463
490,1.1308
491,1.2121
492,1.2891
493,1.3454
494,1.4017
495,1.4580000000000002
496,1.5143
497,1.5369
498,1.5442
499,1.5442
500,1.5442
501,1.5490000000000002
502,1.56
503,1.5882
504,1.6163
505,1.6445
506,1.6726
507,1.6811
508,1.6823
509,1.6823
510,1.6823
511,1.6758
512,1.6612
513,1.633
514,1.6049
515,1.5764
516,1.5465
517,1.4967
518,1.4404
519,1.3841
520,1.3278
521,1.2715
522,1.2152
523,1.1589
524,1.1026
525,1.0474
526,0.9963299999999999
527,0.96278
528,0.93463
529,0.90649
530,0.87834
531,0.86036
532,0.8537100000000001
533,0.8537100000000001
534,0.8537100000000001
535,0.8554700000000001
536,0.8642700000000001
537,0.88802
538,0.9161600000000001
539,0.94431
540,0.97246
541,1.0006
542,1.0288
543,1.0569
544,1.085
545,1.1106
546,1.1264
547,1.1299
548,1.1299
549,1.1299
550,1.1299
551,1.1299
552,1.1299
553,1.1299
554,1.1299
555,1.1264
556,1.1106
557,1.085
558,1.0569
559,1.0288
560,0.99731
561,0.95311
562,0.89681
563,0.84052
564,0.78422
565,0.72793
566,0.67164
567,0.61534
568,0.55905
569,0.50275
570,0.45311
571,0.41478999999999994
572,0.38665
573,0.3585
574,0.33035
575,0.30221
576,0.27405999999999997
577,0.24591
578,0.21777
579,0.18962
580,0.16147
581,0.13332
582,0.10518
583,0.40515999999999996
584,0.26442
585,0.18846
586,0.3116
587,0.44914
588,0.11397
589,0.14212
590,0.18383
591,0.2336
592,0.28989000000000004
593,0.34619
594,0.40008
595,0.43942
596,0.43942
597,0.43942
598,0.43942
599,0.43942
600,0.45653
601,0.47988000000000003
602,0.50803
603,0.53618
604,0.5606800000000001
605,0.57752
606,0.57752
607,0.57752
608,0.57752
609,0.57752
610,0.59824
611,0.62326
612,0.6514
613,0.67955
614,0.7015399999999999
615,0.71562
616,0.71562
617,0.71562
618,0.71562
619,0.71562
620,0.71562
621,0.71562
622,0.71562
623,0.71562
624,0.72435
625,0.74112
626,0.76927
627,0.79742
628,0.8255600000000001
629,0.8537100000000001
630,-1.5415
631,-1.5415
632,-1.5415
633,-1.5415
634,-1.5415
635,-1.5415
636,-1.5415
637,-1.5415
638,-1.5415
639,-1.5415
640,-1.5415
641,-1.5415
642,-1.5415
643,-1.5415
644,-1.5415
645,-1.5415
646,-1.5415
647,-1.5415
648,-1.5415
649,-1.5415
650,-1.5415
651,-1.5415
652,-1.5415
653,-1.5415
654,-1.5415
655,-1.5415
656,-1.5415
657,-1.5415
658,-1.5415
659,-1.5415
660,-1.5415
661,-1.5415
662,-1.5415
663,-1.5415
664,-1.5415
665,-1.5415
666,-1.5415
667,-1.5415
668,-1.5415
669,-1.5415
670,-1.5415
671,-1.5415
672,-1.5415
673,-1.5415
674,-1.5415
675,-1.5415
676,-1.5415
677,-1.5415
678,-1.5415
679,-1.5415
680,-1.5415
681,-1.5415
682,-1.5415
683,-1.5415
684,-1.5415
685,-1.5415
686,-1.5415
687,-1.5415
688,-1.5415
689,-1.5381
690,-1.531
691,-1.5217
692,-1.5124
693,-1.5025
694,-1.4902
695,-1.4731
696,-1.4544
697,-1.4358
698,-1.4172
699,-1.3946
700,-1.3677
701,-1.3398
702,-1.3118
703,-1.2856
704,-1.2658
705,-1.2542
706,-1.2449
707,-1.2356
708,-1.2262
709,-1.2169
710,-1.2076
711,-1.1983
712,-1.189
713,-1.1762
714,-1.1512
715,-1.1165
716,-1.0793
717,-1.042
718,-1.0058
719,-0.9739
720,-0.94596
721,-0.9180200000000001
722,-0.89008
723,-0.8592299999999999
724,-0.81848
725,-0.77308
726,-0.72651
727,-0.67994
728,-0.63117
729,-0.57865
730,-0.52277
731,-0.46688999999999997
732,-0.41100000000000003
733,-0.35333000000000003
734,-0.28988
735,-0.22501999999999997
736,-0.15982000000000002
737,-0.45313000000000003
738,-0.14382
739,0.14935
740,0.42876000000000003
741,0.13763
742,0.19352
743,0.23010999999999998
744,0.20740999999999998
745,0.18042
746,0.15248
747,0.12454000000000001
748,0.096595
749,0.36328
750,0.22357
751,0.083866
752,-0.30423
753,-0.14752
754,-0.14752
755,-0.14752
756,-0.14752
757,-0.14752
758,-0.053095
759,0.18719
760,0.42003
761,0.12657000000000002
762,0.17435
763,0.22466
764,0.28054
765,0.33642
766,0.39231
767,0.44819
768,0.49035
769,0.52968
770,0.56694
771,0.60419
772,0.6333
773,0.65193
774,0.65193
775,0.65193
776,0.65193
777,0.65193
778,0.64385
779,0.63505
780,0.62573
781,0.61642
782,0.6157699999999999
783,0.62311
784,0.64174
785,0.66037
786,0.67899
787,0.69762
788,0.72556
789,0.7535
790,0.78145
791,0.8093899999999999
792,0.8335600000000001
793,0.85508
794,0.87371
795,0.8923399999999999
796,0.91046
797,0.92784
798,0.93716
799,0.94647
800,0.9557899999999999
801,0.9651
802,0.9697600000000001
803,0.9717899999999999
804,0.9717899999999999
805,0.9717899999999999
806,0.9717899999999999
807,0.9717899999999999
808,0.9717899999999999
809,0.9717899999999999
810,0.9717899999999999
811,0.9717899999999999
812,0.9829399999999999
813,0.99915
814,1.0178
815,1.0364
816,1.0534
817,1.0684
818,1.0777
819,1.0871
820,1.0964
821,1.1057
822,1.1085
823,1.1089
824,1.1089
825,1.1089
826,1.1046
827,1.0949
828,1.0763
829,1.0577
830,1.0392
831,1.0218
832,1.0175
833,1.0175
834,1.0175
835,1.0175
836,1.0147
837,1.0088
838,0.99945
839,0.99013
840,0.98115
841,0.9735799999999999
842,0.9717899999999999
843,0.9717899999999999
844,0.9717899999999999
845,0.9717899999999999
846,0.96506
847,0.95084
848,0.93221
849,0.91358
850,0.8949600000000001
851,0.8763299999999999
852,0.8577
853,0.8390700000000001
854,0.82045
855,0.80182
856,0.78719
857,0.77679
858,0.76747
859,0.7581600000000001
860,0.7497
861,0.74446
862,0.74332
863,0.74332
864,0.74332
865,0.74332
866,0.73866
867,0.72935
868,0.7200300000000001
869,0.71072
870,0.7048300000000001
871,0.71124
872,0.72731
873,0.7459399999999999
874,0.76456
875,0.7831899999999999
876,0.80182
877,0.82045
878,0.8390700000000001
879,0.8577
880,0.8734200000000001
881,0.8792399999999999
882,0.8804
883,0.8804
884,0.8804
885,0.8759999999999999
886,0.8641
887,0.8454799999999999
888,0.82685
889,0.8082199999999999
890,0.78781
891,0.76161
892,0.7340000000000001
893,0.70606
894,0.67812
895,0.66018
896,0.65193
897,0.65193
898,0.65193
899,0.65193
900,0.64764
901,0.6301800000000001
902,0.6117600000000001
903,0.59313
904,0.5745100000000001
905,0.55588
906,0.53725
907,0.51862
908,0.5
909,0.48177
910,0.46593999999999997
911,0.45663000000000004
912,0.44731000000000004
913,0.43799999999999994
914,0.42868999999999996
915,0.42504
916,0.42345
917,0.42345
918,0.42345
919,0.42465
920,0.4284
921,0.43771000000000004
922,0.44702
923,0.45633999999999997
924,0.46565
925,0.47497
926,0.48428000000000004
927,0.49359
928,0.5029100000000001
929,0.51222
930,0.52153
931,0.53085
932,0.5401600000000001
933,0.54947
934,0.55879
935,0.57618
936,0.5943
937,0.61292
938,0.63155
939,0.6530699999999999
940,0.67725
941,0.70519
942,0.7331300000000001
943,0.76107
944,0.78901
