time,value
0,-0.32743
1,-0.32743
2,-0.32743
3,-0.32743
4,-0.35746
5,-0.32743
6,-0.32743
7,-0.32743
8,-0.32743
9,-0.32743
10,-0.32743
11,-0.32743
12,-0.35746
13,-0.35746
14,-0.35746
15,-0.35746
16,-0.35746
17,-0.35746
18,-0.35746
19,-0.32743
20,-0.32743
21,-0.32743
22,-0.35746
23,-0.35746
24,-0.38749
25,-0.35746
26,-0.35746
27,-0.35746
28,-0.32743
29,-0.32743
30,-0.35746
31,-0.38749
32,-0.35746
33,-0.32743
34,-0.32743
35,-0.38749
36,-0.38749
37,-0.35746
38,-0.35746
39,-0.35746
40,-0.35746
41,-0.35746
42,-0.32743
43,-0.35746
44,-0.35746
45,-0.35746
46,-0.35746
47,-0.38749
48,-0.35746
49,-0.35746
50,-0.38749
51,-0.35746
52,-0.35746
53,-0.32743
54,-0.32743
55,-0.32743
56,-0.35746
57,-0.35746
58,-0.35746
59,-0.35746
60,-0.32743
61,-0.32743
62,-0.32743
63,-0.32743
64,-0.32743
65,-0.32743
66,-0.32743
67,-0.32743
68,-0.32743
69,-0.2974
70,-0.2974
71,-0.2974
72,-0.32743
73,-0.32743
74,-0.35746
75,-0.35746
76,-0.35746
77,-0.35746
78,-0.35746
79,-0.32743
80,-0.32743
81,-0.32743
82,-0.35746
83,-0.32743
84,-0.26737
85,-0.23735
86,-0.20731999999999998
87,-0.26737
88,-0.2974
89,-0.32743
90,-0.32743
91,-0.32743
92,-0.32743
93,-0.35746
94,-0.38749
95,-0.35746
96,-0.32743
97,-0.32743
98,-0.32743
99,-0.2974
100,-0.2974
101,-0.2974
102,-0.32743
103,-0.32743
104,-0.32743
105,-0.32743
106,-0.32743
107,-0.32743
108,-0.2974
109,-0.2974
110,-0.2974
111,-0.32743
112,-0.35746
113,-0.2974
114,-0.26737
115,-0.32743
116,-0.26737
117,-0.23735
118,-0.26737
119,-0.26737
120,-0.26737
121,-0.26737
122,-0.26737
123,-0.2974
124,-0.32743
125,-0.32743
126,-0.32743
127,-0.32743
128,-0.26737
129,-0.26737
130,-0.14726
131,-0.14726
132,-0.17729
133,-0.17729
134,-0.14726
135,-0.057170000000000006
136,0.032918
137,0.062948
138,0.032918
139,0.092977
140,0.18307
141,0.18307
142,0.24311999999999998
143,0.33321
144,0.45333
145,0.51339
146,0.57345
147,0.57345
148,0.6635300000000001
149,0.78365
150,0.72359
151,0.6935600000000001
152,0.72359
153,0.8136800000000001
154,0.8437100000000001
155,0.8136800000000001
156,0.75362
157,0.9938600000000001
158,1.0239
159,0.9037700000000001
160,0.8136800000000001
161,0.9338
162,1.0839
163,1.114
164,1.114
165,1.1740000000000002
166,1.2341
167,1.2641
168,1.3242
169,1.4143
170,1.5944
171,1.7446
172,1.7446
173,1.8046
174,1.8647
175,1.8947
176,1.9248
177,1.9848
178,2.195
179,2.3452
180,2.5254
181,2.5254
182,2.4953
183,2.5254
184,2.5854
185,2.5854
186,2.5854
187,2.4953
188,2.3752
189,2.3151
190,2.135
191,1.9848
192,1.9248
193,1.8046
194,1.6545
195,1.4443
196,1.1440000000000001
197,0.9338
198,0.72359
199,0.54342
200,0.39327
201,0.36324
202,0.33321
203,0.24311999999999998
204,0.092977
205,0.0028891
206,-0.027139999999999997
207,-0.057170000000000006
208,-0.11723
209,-0.20731999999999998
210,-0.41752
211,-0.62773
212,-0.68779
213,-0.65776
214,-0.62773
215,-0.62773
216,-0.5977
217,-0.5977
218,-0.71782
219,-0.83793
220,-0.9280200000000001
221,-0.98808
222,-0.98808
223,-0.95805
224,-0.9280200000000001
225,-0.9280200000000001
226,-0.9280200000000001
227,-0.89799
228,-0.89799
229,-0.83793
230,-0.89799
231,-1.0181
232,-1.0181
233,-1.0181
234,-1.0782
235,-1.1082
236,-1.1382
237,-1.1382
238,-1.1082
239,-1.0782
240,-1.0782
241,-1.1382
242,-1.1382
243,-1.1082
244,-1.1082
245,-1.0782
246,-1.0782
247,-1.0782
248,-1.0782
249,-1.0181
250,-1.0181
251,-0.95805
252,-0.9280200000000001
253,-0.95805
254,-0.98808
255,-1.0481
256,-1.0782
257,-1.0181
258,-0.95805
259,-0.9280200000000001
260,-0.89799
261,-0.8679600000000001
262,-0.8679600000000001
263,-0.83793
264,-0.83793
265,-0.83793
266,-0.77787
267,-0.77787
268,-0.77787
269,-0.74784
270,-0.62773
271,-0.50761
272,-0.50761
273,-0.53764
274,-0.47758
275,-0.41752
276,-0.44755
277,-0.56767
278,-0.62773
279,-0.62773
280,-0.68779
281,-0.77787
282,-0.8079
283,-0.74784
284,-0.71782
285,-0.89799
286,-0.8079
287,-0.68779
288,-0.68779
289,-0.71782
290,-0.89799
291,-0.95805
292,-0.95805
293,-0.9280200000000001
294,-0.89799
295,-0.9280200000000001
296,-0.98808
297,-0.9280200000000001
298,-0.98808
299,-1.1382
300,-1.2283
301,-1.2583
302,-1.3184
303,-1.3184
304,-1.1983
305,-1.1382
306,-1.1382
307,-1.0181
308,-0.89799
309,-0.77787
310,-0.56767
311,-0.53764
312,-0.35746
313,-0.2974
314,0.0028891
315,0.48336
316,0.9938600000000001
317,1.3542
318,1.5644
319,1.6845
320,1.4443
321,1.5044
322,1.6545
323,1.8046
324,1.8347
325,1.7746
326,1.8046
327,1.8947
328,1.9848
329,1.9548
330,1.8046
331,2.0449
332,2.0449
333,2.195
334,2.3752
335,2.4052
336,2.4353
337,2.4052
338,2.2551
339,2.0149
340,1.9548
341,1.7146
342,1.2942
