time,value
0,0.89956
1,0.89956
2,0.89956
3,0.89956
4,0.89956
5,0.89956
6,0.89956
7,0.89956
8,0.89956
9,0.89956
10,0.89956
11,0.89956
12,0.89956
13,0.89956
14,0.89956
15,0.89956
16,0.89956
17,0.89956
18,0.89956
19,0.89956
20,0.89956
21,0.89956
22,0.89956
23,0.89956
24,0.89956
25,0.89956
26,0.89956
27,0.89956
28,0.89956
29,0.89956
30,0.89956
31,0.89956
32,0.89956
33,0.89956
34,0.89956
35,0.89956
36,0.89956
37,0.89956
38,0.89956
39,0.89956
40,0.89956
41,0.89956
42,0.89956
43,0.89956
44,0.89956
45,0.89956
46,0.89956
47,0.89956
48,0.89956
49,0.89956
50,0.89956
51,0.89956
52,0.89956
53,0.89956
54,0.89956
55,0.89956
56,0.89956
57,0.89956
58,0.89956
59,0.89956
60,0.89956
61,0.89956
62,0.89956
63,0.89956
64,0.89956
65,0.89956
66,0.89956
67,0.89956
68,0.89956
69,0.89956
70,0.89956
71,0.89956
72,0.89956
73,0.89956
74,0.89956
75,0.89956
76,0.89956
77,0.89956
78,0.89956
79,0.89956
80,0.89956
81,0.89956
82,0.89956
83,0.89956
84,0.89956
85,0.89956
86,0.89956
87,0.89956
88,0.89956
89,0.89956
90,0.89956
91,0.89956
92,0.89956
93,0.89956
94,0.89956
95,0.89956
96,0.89956
97,0.89956
98,0.89956
99,0.89956
100,0.89956
101,0.89956
102,0.89956
103,0.89956
104,0.89956
105,0.89956
106,0.89956
107,0.89956
108,0.89956
109,0.89956
110,0.89907
111,0.89692
112,0.89476
113,0.87374
114,0.84362
115,0.8135
116,0.78338
117,0.75326
118,0.72315
119,0.69303
120,0.66291
121,0.63279
122,0.6026699999999999
123,0.57886
124,0.56237
125,0.54588
126,0.5352600000000001
127,0.52522
128,0.51518
129,0.5051399999999999
130,0.4951
131,0.48506000000000005
132,0.47502
133,0.46571
134,0.45853
135,0.45136000000000004
136,0.44921000000000005
137,0.44921000000000005
138,0.44921000000000005
139,0.44921000000000005
140,0.44921000000000005
141,0.44921000000000005
142,0.44921000000000005
143,0.44921000000000005
144,0.44921000000000005
145,0.44921000000000005
146,0.45358000000000004
147,0.46253999999999995
148,0.47151000000000004
149,0.48148
150,0.49151999999999996
151,0.50155
152,0.51159
153,0.52163
154,0.53167
155,0.54171
156,0.54898
157,0.54898
158,0.54898
159,0.54171
160,0.53167
161,0.52163
162,0.51159
163,0.50155
164,0.49151999999999996
165,0.48148
166,0.4713
167,0.4591
168,0.44691000000000003
169,0.42554
170,0.39542
171,0.3653
172,0.33518000000000003
173,0.30506
174,0.27495
175,0.24483000000000002
176,0.21470999999999998
177,0.18459
178,0.15447
179,0.12219000000000001
180,0.42191000000000006
181,0.23546
182,0.25151999999999997
183,-0.16251
184,-0.3633
185,-0.1123
186,-0.15245999999999998
187,-0.19262
188,-0.23276999999999998
189,-0.27321999999999996
190,-0.31661
191,-0.35999000000000003
192,-0.40703
193,-0.45723
194,-0.50743
195,-0.5576300000000001
196,-0.60783
197,-0.65803
198,-0.70822
199,-0.75842
200,-0.80862
201,-0.85882
202,-0.90295
203,-0.9345100000000001
204,-0.96606
205,-0.99651
206,-1.0266
207,-1.0567
208,-1.0869
209,-1.117
210,-1.1471
211,-1.1772
212,-1.2073
213,-1.2375
214,-1.2676
215,-1.2977
216,-1.3278
217,-1.3579
218,-1.3881
219,-1.4182
220,-1.4483
221,-1.4784
222,-1.5085
223,-1.5386
224,-1.5688
225,-1.5989
226,-1.629
227,-1.6591
228,-1.6892
229,-1.7194
230,-1.7495
231,-1.7796
232,-1.8097
233,-1.8398
234,-1.87
235,-1.8969999999999998
236,-1.9045
237,-1.912
238,-1.9151
239,-1.9151
240,-1.9151
241,-1.9151
242,-1.9151
243,-1.9151
244,-1.9151
245,-1.9151
246,-1.9118
247,-1.9082
248,-1.9022
249,-1.8922
250,-1.8821
251,-1.8721
252,-1.8621
253,-1.8519999999999999
254,-1.8419999999999999
255,-1.8319
256,-1.8219
257,-1.8119
258,-1.7987
259,-1.7693
260,-1.7399
261,-1.71
262,-1.6799
263,-1.6498
264,-1.6197
265,-1.5896
266,-1.5594
267,-1.5293
268,-1.4992
269,-1.4582
270,-1.4166
271,-1.3716
272,-1.3214
273,-1.2712
274,-1.2209999999999999
275,-1.1708
276,-1.1206
277,-1.0704
278,-1.0202
279,-0.96865
280,-0.91665
281,-0.8631200000000001
282,-0.80288
283,-0.74265
284,-0.6824100000000001
285,-0.62217
286,-0.56193
287,-0.50169
288,-0.44146
289,-0.38122
290,-0.32098000000000004
291,-0.26074
292,-0.22359
293,-0.18702
294,-0.15317
295,-0.12305
296,-0.46729
297,-0.31669
298,-0.1661
299,-0.10703
300,0.13509000000000002
301,0.28569
302,0.40614
303,0.10397999999999999
304,0.12362999999999999
305,0.13367
306,0.14371
307,0.15375
308,0.16379000000000002
309,0.17382999999999998
310,0.18387
311,0.19391
312,0.20395
313,0.21399
314,0.22403
315,0.81362
316,0.81362
317,0.81362
318,0.81362
319,0.81362
320,0.81362
321,0.81362
322,0.81362
323,0.81362
324,0.81362
325,0.81362
326,0.81362
327,0.81362
328,0.81362
329,0.81362
330,0.81362
331,0.81362
332,0.81362
333,0.81362
334,0.81362
335,0.81362
336,0.81362
337,0.81362
338,0.81362
339,0.81362
340,0.81362
341,0.81362
342,0.81362
343,0.81362
344,0.81362
345,0.81362
346,0.81362
347,0.81362
348,0.81362
349,0.81362
350,0.81362
351,0.81362
352,0.81362
353,0.81362
354,0.81362
355,0.81362
356,0.81362
357,0.81362
358,0.81362
359,0.81362
360,0.81362
361,0.81362
362,0.81362
363,0.81362
364,0.81362
365,0.81362
366,0.81362
367,0.81362
368,0.81362
369,0.81362
370,0.81362
371,0.81362
372,0.81362
373,0.81362
374,0.81362
375,0.81362
376,0.81362
377,0.81362
378,0.81362
379,0.81362
380,0.81362
381,0.81362
382,0.81362
383,0.81362
384,0.81362
385,0.81362
386,0.81362
387,0.81362
388,0.81362
389,0.81362
390,0.81362
391,0.81362
392,0.81362
393,0.81362
394,0.81362
395,0.81362
396,0.81362
397,0.81362
398,0.81362
399,0.81362
400,0.81362
401,0.81362
402,0.81362
403,0.81362
404,0.81362
405,0.81362
406,0.81362
407,0.81362
408,0.81362
409,0.81362
410,0.81362
411,0.81362
412,0.81362
413,0.81362
414,0.81362
415,0.81362
416,0.81362
417,0.81362
418,0.81362
419,0.81362
420,0.81362
421,0.81362
422,0.81362
423,0.81362
424,0.81362
425,0.81347
426,0.81282
427,0.81216
428,0.80577
429,0.79662
430,0.78746
431,0.7783100000000001
432,0.76915
433,0.76
434,0.75084
435,0.74169
436,0.73253
437,0.72338
438,0.7199800000000001
439,0.72325
440,0.7265199999999999
441,0.73515
442,0.7443
443,0.75346
444,0.76261
445,0.77177
446,0.78092
447,0.79008
448,0.79857
449,0.80511
450,0.81165
451,0.81362
452,0.81362
453,0.81362
454,0.81362
455,0.81362
456,0.81362
457,0.81362
458,0.81362
459,0.81362
460,0.81362
461,0.8096300000000001
462,0.8014600000000001
463,0.79328
464,0.7841899999999999
465,0.77504
466,0.76588
467,0.75673
468,0.74757
469,0.73842
470,0.72926
471,0.72011
472,0.71095
473,0.7018
474,0.6926399999999999
475,0.6834899999999999
476,0.67433
477,0.66518
478,0.6560199999999999
479,0.64687
480,0.63771
481,0.6285
482,0.61836
483,0.60822
484,0.5939
485,0.5755899999999999
486,0.55728
487,0.53897
488,0.52066
489,0.50235
490,0.48403999999999997
491,0.46573000000000003
492,0.44743
493,0.42912
494,0.41276999999999997
495,0.401
496,0.38923
497,0.37942
498,0.37026
499,0.36111
500,0.35195
501,0.3428
502,0.33364
503,0.32449
504,0.31454
505,0.29656
506,0.27858
507,0.2506
508,0.21398000000000003
509,0.17736
510,0.14074
511,0.10412
512,0.33489
513,0.1518
514,-0.21236
515,-0.2144
516,-0.39749
517,-0.1156
518,-0.15222
519,-0.18884
520,-0.22545
521,-0.26206999999999997
522,-0.29869
523,-0.33531
524,-0.37193000000000004
525,-0.40855
526,-0.44516999999999995
527,-0.48235
528,-0.52387
529,-0.5654
530,-0.6093
531,-0.65508
532,-0.70085
533,-0.74663
534,-0.7924
535,-0.8381700000000001
536,-0.88395
537,-0.9297200000000001
538,-0.9743200000000001
539,-1.0188
540,-1.0605
541,-1.0971
542,-1.1337
543,-1.1704
544,-1.207
545,-1.2436
546,-1.2802
547,-1.3168
548,-1.3535
549,-1.3901
550,-1.4248
551,-1.4477
552,-1.4706
553,-1.4908
554,-1.5091
555,-1.5274
556,-1.5457
557,-1.564
558,-1.5823
559,-1.6006
560,-1.6189
561,-1.6282
562,-1.6367
563,-1.6386
564,-1.6294
565,-1.6203
566,-1.6111
567,-1.6019
568,-1.5928
569,-1.5836
570,-1.5745
571,-1.5653
572,-1.5562
573,-1.5485
574,-1.5481
575,-1.5478
576,-1.5477
577,-1.5477
578,-1.5477
579,-1.5477
580,-1.5477
581,-1.5477
582,-1.5477
583,-1.5477
584,-1.5477
585,-1.5477
586,-1.5477
587,-1.5477
588,-1.5477
589,-1.5477
590,-1.5477
591,-1.5477
592,-1.5477
593,-1.5477
594,-1.5465
595,-1.5448
596,-1.5418
597,-1.5326
598,-1.5235
599,-1.5143
600,-1.5052
601,-1.496
602,-1.4869
603,-1.4777
604,-1.4685
605,-1.4594
606,-1.4502
607,-1.4411
608,-1.4319
609,-1.4228
610,-1.4136
611,-1.4045
612,-1.3953
613,-1.3862
614,-1.3769999999999998
615,-1.3678
616,-1.3587
617,-1.3523
618,-1.3467
619,-1.3423
620,-1.3423
621,-1.3423
622,-1.3423
623,-1.3423
624,-1.3423
625,-1.3423
626,-1.3423
627,-1.3423
628,-1.3423
629,-1.3423
630,1.0558
631,1.0558
632,1.0558
633,1.0558
634,1.0558
635,1.0558
636,1.0558
637,1.0558
638,1.0558
639,1.0558
640,1.0558
641,1.0558
642,1.0558
643,1.0558
644,1.0558
645,1.0558
646,1.0558
647,1.0558
648,1.0558
649,1.0558
650,1.0558
651,1.0558
652,1.0558
653,1.0558
654,1.0558
655,1.0558
656,1.0558
657,1.0558
658,1.0558
659,1.0558
660,1.0558
661,1.0558
662,1.0558
663,1.0558
664,1.0558
665,1.0558
666,1.0558
667,1.0558
668,1.0558
669,1.0558
670,1.0558
671,1.0558
672,1.0558
673,1.0558
674,1.0558
675,1.0558
676,1.0558
677,1.0558
678,1.0558
679,1.0558
680,1.0558
681,1.0558
682,1.0558
683,1.0558
684,1.0558
685,1.0558
686,1.0558
687,1.0558
688,1.0558
689,1.0558
690,1.0558
691,1.0558
692,1.0558
693,1.0558
694,1.0558
695,1.0558
696,1.0558
697,1.0558
698,1.0558
699,1.0558
700,1.0558
701,1.0558
702,1.0558
703,1.0558
704,1.0558
705,1.0558
706,1.0558
707,1.0558
708,1.0558
709,1.0558
710,1.0558
711,1.0558
712,1.0558
713,1.0558
714,1.0558
715,1.0558
716,1.0558
717,1.0558
718,1.0558
719,1.0558
720,1.0558
721,1.0558
722,1.0558
723,1.0558
724,1.0558
725,1.0558
726,1.0558
727,1.0558
728,1.0558
729,1.0558
730,1.0558
731,1.0558
732,1.0558
733,1.0558
734,1.0558
735,1.0558
736,1.0558
737,1.0558
738,1.0558
739,1.0558
740,1.0557
741,1.0551
742,1.0545
743,1.0488
744,1.0407
745,1.0325
746,1.0243
747,1.0162
748,1.008
749,0.9998799999999999
750,0.99172
751,0.98357
752,0.97541
753,0.96298
754,0.9456100000000001
755,0.9282299999999999
756,0.9068700000000001
757,0.88512
758,0.8633799999999999
759,0.8416299999999999
760,0.8198799999999999
761,0.79814
762,0.7763899999999999
763,0.75425
764,0.73095
765,0.70765
766,0.6816399999999999
767,0.65445
768,0.62727
769,0.60009
770,0.5729
771,0.54572
772,0.51853
773,0.49135
774,0.46416999999999997
775,0.43698000000000004
776,0.40862
777,0.37901
778,0.34939000000000003
779,0.31951
780,0.28961
781,0.25971
782,0.22981
783,0.1999
784,0.17
785,0.1401
786,0.11133
787,0.4249
788,0.29578000000000004
789,0.18141
790,0.072673
791,-0.2441
792,-0.1448
793,-0.25353000000000003
794,-0.36225999999999997
795,-0.47100000000000003
796,-0.11540999999999998
797,-0.13685999999999998
798,-0.15832000000000002
799,-0.17853
800,-0.19755999999999999
801,-0.21659
802,-0.23561999999999997
803,-0.25464000000000003
804,-0.27366999999999997
805,-0.2927
806,-0.31173
807,-0.33076
808,-0.34979
809,-0.36880999999999997
810,-0.38784
811,-0.40687
812,-0.4259
813,-0.44493
814,-0.46396000000000004
815,-0.48299
816,-0.5020100000000001
817,-0.52104
818,-0.5400699999999999
819,-0.55933
820,-0.58098
821,-0.60263
822,-0.62725
823,-0.6544399999999999
824,-0.68162
825,-0.7088
826,-0.7359899999999999
827,-0.76317
828,-0.79035
829,-0.8175399999999999
830,-0.84472
831,-0.8719
832,-0.8982700000000001
833,-0.9229299999999999
834,-0.9475899999999999
835,-0.9721
836,-0.99656
837,-1.021
838,-1.0455
839,-1.07
840,-1.0944
841,-1.1189
842,-1.1425
843,-1.1597
844,-1.1769
845,-1.1905
846,-1.2014
847,-1.2123
848,-1.2232
849,-1.234
850,-1.2449
851,-1.2558
852,-1.2666
853,-1.2761
854,-1.2854
855,-1.2915
856,-1.2915
857,-1.2915
858,-1.2915
859,-1.2915
860,-1.2915
861,-1.2915
862,-1.2915
863,-1.2915
864,-1.2915
865,-1.2909
866,-1.2869
867,-1.2828
868,-1.2779
869,-1.2725
870,-1.2670000000000001
871,-1.2616
872,-1.2562
873,-1.2507
874,-1.2453
875,-1.2399
876,-1.2344
877,-1.229
878,-1.2235
879,-1.2181
880,-1.2127
881,-1.2072
882,-1.2018
883,-1.1964
884,-1.1909
885,-1.1855
886,-1.1801
887,-1.1746
888,-1.1713
889,-1.179
890,-1.1866
891,-1.1946
892,-1.2028
893,-1.2109
894,-1.2191
895,-1.2272
896,-1.2354
897,-1.2435
898,-1.2517
899,-1.251
900,-1.2498
901,-1.2459
902,-1.2377
903,-1.2296
904,-1.2214
905,-1.2133
906,-1.2051
907,-1.1969
908,-1.1888
909,-1.1817
910,-1.175
911,-1.1696
912,-1.1696
913,-1.1696
914,-1.1696
915,-1.1696
916,-1.1696
917,-1.1696
918,-1.1696
919,-1.1696
920,-1.1696
921,-1.1696
922,-1.1612
923,-1.1527
924,-1.1432
925,-1.1323
926,-1.1214
927,-1.1105
928,-1.0997
929,-1.0888
930,-1.0779
931,-1.067
932,-1.0545
933,-1.0415
934,-1.0278
935,-1.0115
936,-0.9952
937,-0.9788899999999999
938,-0.9625799999999999
939,-0.9462700000000001
940,-0.92996
941,-0.91365
942,-0.8973399999999999
943,-0.88103
944,-0.86472
