time,value
0,0.6916
1,0.6916
2,0.6916
3,0.6916
4,0.6916
5,0.6916
6,0.6916
7,0.6916
8,0.6916
9,0.6916
10,0.6916
11,0.6916
12,0.6916
13,0.6916
14,0.6916
15,0.6916
16,0.6916
17,0.6916
18,0.6916
19,0.6916
20,0.6916
21,0.6916
22,0.6916
23,0.6916
24,0.6916
25,0.6916
26,0.6916
27,0.6916
28,0.6916
29,0.6916
30,0.6916
31,0.6916
32,0.6916
33,0.6916
34,0.6916
35,0.6916
36,0.6916
37,0.6916
38,0.6916
39,0.70118
40,0.72228
41,0.7471300000000001
42,0.77199
43,0.79684
44,0.8217
45,0.84655
46,0.8714
47,0.8962600000000001
48,0.92111
49,0.9459700000000001
50,0.9708200000000001
51,0.9795299999999999
52,0.98064
53,0.98064
54,0.9812200000000001
55,0.9999399999999999
56,1.0236
57,1.0485
58,1.0733
59,1.0982
60,1.123
61,1.1479
62,1.1727
63,1.1976
64,1.2224
65,1.2473
66,1.2721
67,1.297
68,1.3218
69,1.3458
70,1.3659999999999999
71,1.3659999999999999
72,1.3659999999999999
73,1.3659999999999999
74,1.3659999999999999
75,1.3659999999999999
76,1.3659999999999999
77,1.3659999999999999
78,1.3803
79,1.4025
80,1.4274
81,1.4515
82,1.4607
83,1.4624
84,1.4624
85,1.4581
86,1.4446
87,1.4197
88,1.3949
89,1.3806
90,1.3869
91,1.4117
92,1.4366
93,1.4577
94,1.4624
95,1.4624
96,1.4624
97,1.4599
98,1.4353
99,1.4105
100,1.3857
101,1.3695
102,1.3659999999999999
103,1.3659999999999999
104,1.3659999999999999
105,1.3414
106,1.2998
107,1.25
108,1.2019
109,1.1774
110,1.1733
111,1.1733
112,1.1733
113,1.1733
114,1.1733
115,1.1733
116,1.1701
117,1.1558
118,1.131
119,1.1061
120,1.0807
121,1.0359
122,0.98616
123,0.93645
124,0.88926
125,0.86103
126,0.83581
127,0.81096
128,0.79375
129,0.78794
130,0.78794
131,0.78794
132,0.77771
133,0.75818
134,0.73333
135,0.7084699999999999
136,0.68362
137,0.65876
138,0.6339100000000001
139,0.60685
140,0.57316
141,0.52345
142,0.47373999999999994
143,0.42623999999999995
144,0.40255
145,0.40255
146,0.40255
147,0.40255
148,0.38435
149,0.36052
150,0.33566
151,0.30835999999999997
152,0.2651
153,0.21599000000000002
154,0.16629000000000002
155,0.12311
156,0.44716000000000006
157,0.32289
158,0.19862
159,0.22134
160,-0.18186
161,-0.4304
162,-0.13443
163,-0.17769000000000001
164,-0.20499
165,-0.22985
166,-0.2547
167,-0.27955
168,-0.30441
169,-0.32926
170,-0.35412
171,-0.39081
172,-0.43942
173,-0.48912
174,-0.53883
175,-0.57253
176,-0.59959
177,-0.62444
178,-0.6470199999999999
179,-0.6565300000000001
180,-0.65727
181,-0.65727
182,-0.66259
183,-0.6772199999999999
184,-0.70207
185,-0.72693
186,-0.75178
187,-0.77663
188,-0.8014899999999999
189,-0.8259700000000001
190,-0.84745
191,-0.8499700000000001
192,-0.8499700000000001
193,-0.8499700000000001
194,-0.8548899999999999
195,-0.87913
196,-0.90397
197,-0.9288299999999999
198,-0.9430799999999999
199,-0.94632
200,-0.94632
201,-0.94632
202,-0.94632
203,-0.94632
204,-0.94632
205,-0.94632
206,-0.94632
207,-0.94632
208,-0.94632
209,-0.94632
210,-0.94632
211,-0.94632
212,-0.94632
213,-0.9497700000000001
214,-0.96596
215,-0.9908100000000001
216,-1.0156
217,-1.0402
218,-1.0427
219,-1.0427
220,-1.0427
221,-1.0473
222,-1.0685
223,-1.0933
224,-1.1181
225,-1.1245
226,-1.1102
227,-1.0853
228,-1.0605
229,-1.0469
230,-1.0427
231,-1.0427
232,-1.041
233,-1.0318
234,-1.0077
235,-0.98283
236,-0.9605799999999999
237,-0.94632
238,-0.94632
239,-0.94632
240,-0.94732
241,-0.9625799999999999
242,-0.9874299999999999
243,-1.0123
244,-1.0371
245,-1.062
246,-1.0869
247,-1.1117
248,-1.145
249,-1.2062
250,-1.2808
251,-1.3553
252,-1.4142
253,-1.4535
254,-1.4784
255,-1.5032
256,-1.5104
257,-1.4959
258,-1.4709999999999999
259,-1.4474
260,-1.4286
261,-1.4281
262,-1.4281
263,-1.4258
264,-1.4084
265,-1.3587
266,-1.3090000000000002
267,-1.2593
268,-1.2376
269,-1.2354
270,-1.2354
271,-1.2354
272,-1.2177
273,-1.1946
274,-1.1697
275,-1.1486
276,-1.139
277,-1.139
278,-1.139
279,-1.1453
280,-1.1611
281,-1.186
282,-1.2108
283,-1.2231
284,-1.2102
285,-1.1853
286,-1.1611
287,-1.1394
288,-1.139
289,-1.139
290,-1.139
291,-1.1317
292,-1.1077
293,-1.0829
294,-1.058
295,-1.0456
296,-1.0427
297,-1.0427
298,-1.0427
299,-1.0276
300,-1.0052
301,-0.9803799999999999
302,-0.95234
303,-0.9150200000000001
304,-0.86531
305,-0.8156
306,-0.77057
307,-0.7349
308,-0.71005
309,-0.6852
310,-0.65673
311,-0.6137
312,-0.56399
313,-0.5142899999999999
314,-0.46458
315,-0.77533
316,-0.77533
317,-0.77533
318,-0.77533
319,-0.77533
320,-0.77533
321,-0.77533
322,-0.77533
323,-0.77533
324,-0.77533
325,-0.77533
326,-0.77533
327,-0.77533
328,-0.77533
329,-0.77533
330,-0.77533
331,-0.77533
332,-0.77533
333,-0.77533
334,-0.77533
335,-0.77533
336,-0.77533
337,-0.77533
338,-0.77533
339,-0.77533
340,-0.77533
341,-0.77533
342,-0.77533
343,-0.77533
344,-0.77533
345,-0.77533
346,-0.77533
347,-0.77533
348,-0.77533
349,-0.77533
350,-0.77533
351,-0.77533
352,-0.77533
353,-0.77533
354,-0.75713
355,-0.71708
356,-0.6699
357,-0.626
358,-0.59242
359,-0.59242
360,-0.59242
361,-0.59242
362,-0.59242
363,-0.59242
364,-0.59242
365,-0.59242
366,-0.5617800000000001
367,-0.5167
368,-0.46952
369,-0.42344
370,-0.41179
371,-0.40952
372,-0.40952
373,-0.39969
374,-0.36932
375,-0.32214
376,-0.27496
377,-0.22776999999999997
378,-0.18059
379,-0.13341
380,-0.4349
381,-0.26256
382,-0.22228
383,-0.22228
384,-0.21409
385,-0.16985999999999998
386,0.066061
387,0.30198
388,0.10834
389,0.15552
390,0.2027
391,0.24989
392,0.29707
393,0.31717
394,0.32211999999999996
395,0.32211999999999996
396,0.32350999999999996
397,0.35322
398,0.39726
399,0.44443999999999995
400,0.4835
401,0.50503
402,0.50503
403,0.50503
404,0.5150399999999999
405,0.54464
406,0.59182
407,0.63895
408,0.67914
409,0.68793
410,0.68793
411,0.68793
412,0.69267
413,0.73927
414,0.78638
415,0.8335600000000001
416,0.8642799999999999
417,0.87084
418,0.87084
419,0.87084
420,0.8941899999999999
421,0.93375
422,0.9809399999999999
423,1.0266
424,1.0499
425,1.0538
426,1.0538
427,1.0538
428,1.0538
429,1.0538
430,1.0538
431,1.0538
432,1.0538
433,1.0538
434,1.0538
435,1.0538
436,1.0538
437,1.0538
438,1.0538
439,1.0585
440,1.0993
441,1.1458
442,1.193
443,1.2256
444,1.2367
445,1.2367
446,1.2367
447,1.2561
448,1.2932
449,1.3403
450,1.3861
451,1.4152
452,1.4196
453,1.4196
454,1.4237
455,1.4405
456,1.4877
457,1.5349
458,1.58
459,1.6025
460,1.6025
461,1.6025
462,1.6025
463,1.6025
464,1.6025
465,1.6025
466,1.6025
467,1.6025
468,1.6025
469,1.6025
470,1.6025
471,1.6025
472,1.6025
473,1.6025
474,1.6025
475,1.6025
476,1.6025
477,1.6013
478,1.5891
479,1.5466
480,1.4994
481,1.4541
482,1.4196
483,1.4196
484,1.4196
485,1.4196
486,1.3971
487,1.3519999999999999
488,1.3048
489,1.2576
490,1.2104
491,1.1633
492,1.1161
493,1.0689
494,1.0217
495,0.9745299999999999
496,0.92735
497,0.88016
498,0.8329799999999999
499,0.7858
500,0.73861
501,0.69143
502,0.64425
503,0.59706
504,0.54988
505,0.5027
506,0.45551
507,0.40833
508,0.36115
509,0.32331
510,0.32214
511,0.32211999999999996
512,0.32211999999999996
513,0.32211999999999996
514,0.32211999999999996
515,0.32211999999999996
516,0.32211999999999996
517,0.32211999999999996
518,0.32211999999999996
519,0.32211999999999996
520,0.32594
521,0.34924
522,0.39493
523,0.44211000000000006
524,0.47406000000000004
525,0.47357
526,0.42639
527,0.3792
528,0.33202
529,0.28484
530,0.23765
531,0.19047
532,0.14329
533,0.47673000000000004
534,0.24081
535,0.1985
536,-0.18706
537,-0.22200999999999999
538,-0.22228
539,-0.22228
540,-0.3102
541,-0.49606000000000006
542,-0.14564000000000002
543,-0.19282
544,-0.19695
545,-0.16602999999999998
546,-0.11884000000000002
547,-0.37779
548,-0.22924
549,-0.22228
550,-0.22228
551,-0.22228
552,-0.22228
553,-0.22228
554,-0.22228
555,-0.22228
556,-0.22228
557,-0.22228
558,-0.22228
559,-0.22228
560,-0.12037
561,-0.21145999999999998
562,-0.30583
563,-0.4002
564,-0.49456000000000006
565,-0.5889300000000001
566,-0.6833
567,-0.7479399999999999
568,-0.77533
569,-0.77533
570,-0.77533
571,-0.79215
572,-0.8295100000000001
573,-0.87669
574,-0.9216
575,-0.9571299999999999
576,-0.95824
577,-0.95824
578,-0.95824
579,-0.95824
580,-0.95824
581,-0.95824
582,-0.95824
583,-0.9848600000000001
584,-1.0299
585,-1.0771
586,-1.1243
587,-1.1379
588,-1.1411
589,-1.1411
590,-1.1411
591,-1.1411
592,-1.1411
593,-1.1411
594,-1.1531
595,-1.1831
596,-1.2303
597,-1.2775
598,-1.3127
599,-1.3241
600,-1.3241
601,-1.3265
602,-1.3382
603,-1.4312
604,-1.5256
605,-1.62
606,-1.7005
607,-1.7493
608,-1.7965
609,-1.8437
610,-1.8672
611,-1.8728
612,-1.8728
613,-1.8728
614,-1.8728
615,-1.8728
616,-1.8728
617,-1.8728
618,-1.8728
619,-1.8728
620,-1.8728
621,-1.8639
622,-1.8373
623,-1.7901
624,-1.7429
625,-1.7026
626,-1.6899
627,-1.6899
628,-1.6899
629,-1.6899
630,-1.4468
631,-1.4468
632,-1.4468
633,-1.4468
634,-1.4468
635,-1.4468
636,-1.4468
637,-1.4468
638,-1.4468
639,-1.4468
640,-1.4468
641,-1.4468
642,-1.4468
643,-1.4468
644,-1.4468
645,-1.4468
646,-1.4468
647,-1.4468
648,-1.4468
649,-1.4468
650,-1.4468
651,-1.4468
652,-1.4468
653,-1.4468
654,-1.4468
655,-1.4468
656,-1.4468
657,-1.4468
658,-1.4468
659,-1.4468
660,-1.4468
661,-1.4468
662,-1.4468
663,-1.4468
664,-1.4468
665,-1.4468
666,-1.4468
667,-1.4468
668,-1.4468
669,-1.3984
670,-1.2918
671,-1.1662
672,-1.0493
673,-0.9599700000000001
674,-0.9599700000000001
675,-0.9599700000000001
676,-0.9599700000000001
677,-0.9599700000000001
678,-0.9599700000000001
679,-0.9599700000000001
680,-0.9599700000000001
681,-0.9599700000000001
682,-0.9599700000000001
683,-0.9599700000000001
684,-0.9599700000000001
685,-0.9599700000000001
686,-0.9599700000000001
687,-0.9599700000000001
688,-0.9599700000000001
689,-0.9599700000000001
690,-0.9599700000000001
691,-0.9599700000000001
692,-0.9599700000000001
693,-0.9599700000000001
694,-0.9599700000000001
695,-0.9599700000000001
696,-0.9599700000000001
697,-0.9599700000000001
698,-0.9599700000000001
699,-0.9599700000000001
700,-0.9599700000000001
701,-0.9599700000000001
702,-0.9599700000000001
703,-0.9599700000000001
704,-0.91146
705,-0.79096
706,-0.6653600000000001
707,-0.53976
708,-0.48627
709,-0.47308999999999996
710,-0.47308999999999996
711,-0.47308999999999996
712,-0.47308999999999996
713,-0.47308999999999996
714,-0.47308999999999996
715,-0.47308999999999996
716,-0.47308999999999996
717,-0.47308999999999996
718,-0.47308999999999996
719,-0.44643999999999995
720,-0.36765
721,-0.24206
722,-0.11660999999999999
723,-0.051878999999999995
724,0.065139
725,0.065139
726,0.065139
727,0.065139
728,0.065139
729,0.065139
730,0.065139
731,0.065139
732,0.065139
733,0.065139
734,0.065139
735,0.065139
736,0.065139
737,0.065139
738,0.065139
739,0.065139
740,0.065139
741,0.065139
742,0.14824
743,0.42951999999999996
744,0.21226
745,0.33785
746,0.44709
747,0.50066
748,0.50066
749,0.50059
750,0.49749
751,0.39676999999999996
752,0.27118000000000003
753,0.14558
754,0.15975
755,0.07446699999999999
756,0.065139
757,0.065139
758,0.25847
759,0.14868
760,0.27428
761,0.39987
762,0.47376999999999997
763,0.50066
764,0.50066
765,0.50442
766,0.55248
767,0.66657
768,0.7921600000000001
769,0.90664
770,0.98754
771,0.98754
772,0.98754
773,0.98754
774,0.98754
775,0.98754
776,0.98754
777,0.98754
778,0.98754
779,0.98754
780,0.98754
781,0.98754
782,0.98754
783,0.98754
784,0.98754
785,0.98754
786,0.98754
787,0.98754
788,0.98754
789,0.98754
790,0.98754
791,0.98754
792,0.99059
793,1.0232
794,1.1364
795,1.262
796,1.3824
797,1.4744
798,1.4744
799,1.4744
800,1.4744
801,1.4146
802,1.2945
803,1.169
804,1.0434
805,0.99866
806,0.98754
807,0.98754
808,0.97603
809,0.8985
810,0.77666
811,0.6510600000000001
812,0.57925
813,0.60145
814,0.7270399999999999
815,0.85264
816,0.9488700000000001
817,0.98754
818,0.98754
819,0.9894
820,1.0065
821,1.1193
822,1.2449
823,1.3705
824,1.4712
825,1.4743
826,1.4744
827,1.4744
828,1.4744
829,1.4744
830,1.4744
831,1.4744
832,1.4744
833,1.4744
834,1.4744
835,1.4744
836,1.4744
837,1.4744
838,1.4744
839,1.4947
840,1.5581
841,1.6837
842,1.8093
843,1.9175
844,1.9613
845,1.9613
846,1.9613
847,1.9613
848,1.9613
849,1.9613
850,1.9613
851,1.9379
852,1.8309
853,1.7054
854,1.5798
855,1.5011
856,1.4744
857,1.4744
858,1.4744
859,1.3598
860,1.1519
861,0.9007
862,0.66623
863,0.50807
864,0.50066
865,0.50066
866,0.48748
867,0.43399
868,0.30839
869,0.1828
870,0.30766
871,0.065139
872,0.065139
873,0.065139
874,0.065139
875,0.065139
876,0.065139
877,0.065139
878,0.17235
879,0.12697999999999998
880,0.25256999999999996
881,0.37817
882,0.4642
883,0.50066
884,0.50066
885,0.50066
886,0.41111000000000003
887,0.21226
888,-0.19846
889,-0.27801
890,-0.46718000000000004
891,-0.47308999999999996
892,-0.47308999999999996
893,-0.47308999999999996
894,-0.47308999999999996
895,-0.47308999999999996
896,-0.47308999999999996
897,-0.47308999999999996
898,-0.54396
899,-0.66381
900,-0.7894
901,-0.915
902,-0.8618399999999999
903,-0.75374
904,-0.62815
905,-0.52155
906,-0.47308999999999996
907,-0.47308999999999996
908,-0.47308999999999996
909,-0.44126000000000004
910,-0.36145
911,-0.23585
912,-0.11026
913,-0.08592000000000001
914,0.065139
915,0.065139
916,0.21085
917,-0.12262
918,-0.27152
919,-0.52271
920,-0.7739
921,-0.95139
922,-0.9599700000000001
923,-0.9599700000000001
924,-0.9599700000000001
925,-0.9599700000000001
926,-0.9599700000000001
927,-0.9599700000000001
928,-0.9599700000000001
929,-0.88375
930,-0.7708
931,-0.6452
932,-0.53567
933,-0.47308999999999996
934,-0.47308999999999996
935,-0.47308999999999996
936,-0.49671000000000004
937,-0.56767
938,-0.6932699999999999
939,-0.81887
940,-0.92619
941,-0.9599700000000001
942,-0.9599700000000001
943,-0.9599700000000001
944,-0.9599700000000001
