time,value
0,-0.14472000000000002
1,0.52076
2,-0.79708
3,0.042554
4,0.2674
5,-0.48886999999999997
6,-0.59491
7,0.058991999999999996
8,0.14167000000000002
9,-0.12383
10,0.27291
11,0.26796
12,0.64803
13,0.28456
14,0.23262
15,0.19067
16,-0.17612
17,0.010628
18,0.28869
19,-0.13482
20,-0.58955
21,0.48323999999999995
22,0.22664
23,-0.0044045
24,0.5437
25,0.045015
26,0.11817000000000001
27,-0.47988000000000003
28,-0.10558
29,0.039376999999999995
30,0.46571
31,-0.32281
32,0.016036
33,-0.33805
34,0.49963
35,0.39957
36,-0.5488
37,-0.074081
38,0.13945
39,-0.1721
40,-0.50812
41,0.15312
42,0.40154
43,-0.097011
44,-0.5187
45,1.6379
46,1.6379
47,1.6379
48,1.6379
49,1.6379
50,1.6379
51,1.6379
52,1.6379
53,1.6379
54,1.6379
55,1.6379
56,1.6379
57,1.6379
58,-1.6566
59,-1.6566
60,-1.6566
61,-1.6566
62,-1.6566
63,-1.6566
64,-1.6566
65,-1.6566
66,-1.6566
67,-1.6566
68,-1.6566
69,-1.6566
70,-0.04589
71,-0.52817
72,-0.36813
73,0.20794
74,0.048483
75,0.15815
76,-0.010001999999999999
77,0.36069
78,-0.36207
79,0.08341
80,0.40305
81,0.32759
82,0.60358
83,-0.00021735
84,0.0019974
85,-0.48328000000000004
86,0.49663999999999997
87,-0.0045613
88,0.53765
89,-0.08316
90,-0.80261
91,-0.5632
92,-0.12954000000000002
93,1.6379
94,1.6379
95,1.6379
96,1.6379
97,1.6379
98,1.6379
99,1.6379
100,1.6379
101,1.6379
102,-1.6566
103,-1.6566
104,-1.6566
105,-1.6566
106,-1.6566
107,-1.6566
108,-1.6566
109,-1.6566
110,-1.6566
111,0.31301999999999996
112,-0.8615700000000001
113,0.0031896999999999997
114,-0.085911
115,-0.24347
116,0.25331
117,-0.17279
118,0.08428
119,0.057114
120,-0.29701
121,-0.49163
122,-0.21444000000000002
123,0.35115999999999997
124,0.091613
125,-0.24303000000000002
126,-0.051519
127,-0.1247
