time,value
0,1.6772
1,1.5856
2,1.4451
3,1.2612
4,1.1228
5,0.9904200000000001
6,0.8073600000000001
7,0.7348100000000001
8,0.5655899999999999
9,0.45878
10,0.34649
11,0.34457
12,0.26061
13,0.16441
14,0.06360299999999999
15,0.13719
16,0.004363199999999999
17,-0.062902
18,-0.17282999999999998
19,-0.24918
20,-0.34951
21,-0.27053
22,-0.38822
23,-0.39188
24,-0.5324300000000001
25,-0.6230399999999999
26,-0.7705
27,-0.8876799999999999
28,-0.97954
29,-1.0759999999999998
30,-1.2049
31,-1.3154
32,-1.3679
33,-1.4943
34,-1.5609
35,-1.6392
36,-1.6652
37,-1.6444
38,-1.6289
39,-1.5863
40,-1.4869
41,-1.3886
42,-1.2769
43,-1.13
44,-1.0185
45,-0.86113
46,-0.68588
47,-0.54875
48,-0.35472
49,-0.20770999999999998
50,-0.013124
51,0.17590999999999998
52,0.32328
53,0.5180899999999999
54,0.71304
55,0.85454
56,1.0495
57,1.1975
58,1.386
59,1.5746
60,1.7162
61,1.9051
62,2.0887
63,2.1225
64,1.9704
65,1.8308
66,1.6444
67,1.4547
68,1.3124
69,1.1189
70,0.92553
71,0.78313
72,0.59001
73,0.44755
74,0.25468
75,0.062204999999999996
76,-0.082232
77,-0.27247
78,-0.46437
79,-0.60537
80,-0.7856
81,-0.86113
82,-1.0065
83,-1.1267
84,-1.1975
85,-1.2894
86,-1.3486
87,-1.3585
88,-1.3288
89,-1.2817
90,-1.2769
91,-1.2026
92,-1.0954
93,-0.93214
94,-0.79699
95,-0.79319
96,-0.67998
97,-0.61021
98,-0.47608999999999996
99,-0.33235
100,-0.33075
101,-0.21495999999999998
102,-0.19743
103,-0.10758
104,-0.008832600000000001
105,0.031651
106,-0.062902
107,0.024232
108,0.053454999999999996
109,0.09559
110,0.1749
111,0.23084000000000002
112,0.16271
113,0.23483
114,0.29209
115,0.40355
116,0.51686
117,0.49504
118,0.49688999999999994
119,0.6549699999999999
120,0.80821
121,0.7348100000000001
122,0.9017299999999999
123,1.0799
124,1.1629
125,1.3479
126,1.4393
127,1.6293
