time,value
0,0.1609
1,0.1609
2,0.1609
3,0.1609
4,0.1609
5,0.1609
6,0.1609
7,0.1609
8,0.1609
9,0.1609
10,0.1609
11,0.1609
12,0.1609
13,0.1609
14,0.1609
15,0.1609
16,0.1609
17,0.1609
18,0.1609
19,0.1609
20,0.1609
21,0.13796
22,0.44071000000000005
23,0.19767
24,-0.19971
25,-0.055095000000000005
26,0.082743
27,0.2668
28,0.11012000000000001
29,0.11558
30,0.11325999999999999
31,0.29119
32,0.25704
33,-0.11141
34,-0.24193
35,-0.34175
36,-0.4331
37,-0.10538
38,-0.12294000000000001
39,-0.14117000000000002
40,-0.17242000000000002
41,-0.20801
42,-0.25813
43,-0.31025
44,-0.3658
45,-0.41851000000000005
46,-0.45408999999999994
47,-0.48968
48,-0.52527
49,-0.5714
50,-0.63303
51,-0.71233
52,-0.80695
53,-0.88594
54,-0.95711
55,-1.0283
56,-1.0995
57,-1.1706
58,-1.2403
59,-1.2854
60,-1.3122
61,-1.261
62,-1.1897
63,-1.0759999999999998
64,-0.9548
65,-0.8246
66,-0.7257899999999999
67,-0.6494
68,-0.5544100000000001
69,-0.45198999999999995
70,-0.3701
71,-0.29198
72,-0.15624000000000002
73,-0.12505
74,0.17876
75,0.24076
76,-0.47102
77,-0.23881999999999998
78,-0.38118
79,-0.48795
80,-0.55913
81,-0.45503999999999994
82,-0.24846
83,-0.17156
84,0.17695999999999998
85,0.36104
86,0.5392399999999999
87,0.62083
88,0.69598
89,0.7359100000000001
90,0.7659100000000001
91,0.77112
92,0.76186
93,0.73235
94,0.73088
95,0.75258
96,0.84025
97,0.9591700000000001
98,1.1406
99,1.3368
100,1.5248
101,1.7080000000000002
102,1.8356
103,1.9492
104,2.0073
105,2.0502
106,2.0623
107,2.0479
108,2.0027
109,1.9163
110,1.8017
111,1.6821
112,1.5605
113,1.5030000000000001
114,1.4561
115,1.5122
116,1.5775
117,1.7025
118,1.8275
119,1.9525
120,2.0517
121,2.109
122,2.113
123,2.0661
124,1.9807
125,1.8739
126,1.7672
127,1.6604
128,1.5536
129,1.4473
130,1.3527
131,1.262
132,1.1908
133,1.1227
134,1.062
135,1.0161
136,0.99005
137,0.97372
138,0.96504
139,0.93778
140,0.9021899999999999
141,0.8609
142,0.8183699999999999
143,0.7427699999999999
144,0.66305
145,0.55629
146,0.45045
147,0.34802
148,0.25758000000000003
149,0.18988
150,0.1387
151,0.10572000000000001
152,0.47512
153,0.47512
154,0.47192
155,0.46758
156,0.31237
157,0.13442
158,-0.39941
159,-0.17527
160,-0.17787999999999998
161,-0.19752999999999998
162,-0.26524000000000003
163,-0.32135
164,-0.35954
165,-0.41318999999999995
166,-0.4809
167,-0.53042
168,-0.57035
169,-0.63074
170,-0.69671
171,-0.7404
172,-0.78041
173,-0.78735
174,-0.79306
175,-0.79306
176,-0.8013899999999999
177,-0.8283
178,-0.85903
179,-0.8946200000000001
180,-0.9445899999999999
181,-1.0054
182,-1.0564
183,-1.1032
184,-1.1602
185,-1.2193
186,-1.2465
187,-1.268
188,-1.2463
189,-1.2261
190,-1.2114
191,-1.2019
192,-1.2019
193,-1.2205
194,-1.2587
195,-1.3286
196,-1.4180000000000001
197,-1.5074
198,-1.5968
199,-1.6266
200,-1.6476
201,-1.6119999999999999
202,-1.5786
203,-1.5577
204,-1.5426
205,-1.5426
206,-1.5426
207,-1.5426
208,-1.5491
209,-1.5613
210,-1.589
211,-1.6246
212,-1.6519
213,-1.6771
214,-1.6877
215,-1.6978
216,-1.716
217,-1.7225
218,-1.6791
219,-1.6268
220,-1.5556
221,-1.4844
222,-1.4133
223,-1.3482
224,-1.2874
225,-1.27
226,-1.27
227,-1.2759
228,-1.2829
229,-1.3474
230,-1.4061
231,-1.4044
232,-1.3940000000000001
233,-1.3558
234,-1.2792
235,-1.1368
236,-1.0122
237,-0.9054700000000001
238,-0.8206100000000001
239,-0.74856
240,-0.67718
241,-0.606
242,-0.59372
243,-0.5894
244,-0.62152
245,-0.6493399999999999
246,-0.65368
247,-0.65678
248,-0.65678
249,-0.6198899999999999
250,-0.53135
251,-0.43283
252,-0.32606
253,-0.1816
254,-0.085063
255,0.15569000000000002
256,0.33364
257,0.4626
258,0.5835100000000001
259,0.63993
260,0.67738
261,0.64005
262,0.59144
263,0.5202600000000001
264,0.47003999999999996
265,0.444
266,0.44638
267,0.46808
268,0.54525
269,0.6433399999999999
270,0.79648
271,0.9588
272,1.1366
273,1.308
274,1.4313
275,1.5285
276,1.5476
277,1.5333
278,1.4647
279,1.3686
280,1.2462
281,1.1204
282,0.99284
283,0.87061
284,0.7499600000000001
285,0.6450100000000001
286,0.54457
287,0.52113
288,0.50536
289,0.52793
290,0.56187
291,0.62263
292,0.6726
293,0.70819
294,0.73407
295,0.75229
296,0.73336
297,0.69777
298,0.6564800000000001
299,0.61395
300,0.54413
301,0.47339
302,0.40742
303,0.34796
304,0.31237
305,0.27798
306,0.24586
307,0.23028
308,0.23288000000000003
309,0.25551999999999997
310,0.29111
311,0.32669000000000004
312,0.36228
313,0.39787
314,0.43346
315,-0.97569
316,-0.97569
317,-0.97569
318,-0.97569
319,-0.97569
320,-0.97569
321,-0.97569
322,-0.97569
323,-0.97569
324,-0.97569
325,-0.97569
326,-0.97569
327,-0.97569
328,-0.97569
329,-0.97569
330,-0.97569
331,-0.97569
332,-0.97569
333,-0.97569
334,-0.97569
335,-0.97569
336,-0.97569
337,-0.97569
338,-0.97569
339,-0.97569
340,-0.9543200000000001
341,-0.9239
342,-0.9061600000000001
343,-0.89094
344,-0.8904
345,-0.88781
346,-0.86065
347,-0.8354600000000001
348,-0.81699
349,-0.80511
350,-0.80511
351,-0.80511
352,-0.80511
353,-0.79099
354,-0.76817
355,-0.74536
356,-0.72254
357,-0.7016399999999999
358,-0.68071
359,-0.6361600000000001
360,-0.59162
361,-0.54707
362,-0.50253
363,-0.45798
364,-0.42003
365,-0.39178
366,-0.36236999999999997
367,-0.33195
368,-0.27183
369,-0.19685999999999998
370,-0.13576
371,-0.37956
372,0.05464600000000001
373,0.097758
374,0.18685
375,0.27594
376,0.36503
377,0.45413000000000003
378,0.54322
379,0.62543
380,0.69931
381,0.7339
382,0.74041
383,0.77409
384,0.8186399999999999
385,0.8668600000000001
386,0.91575
387,1.0039
388,1.0925
389,1.1773
390,1.2418
391,1.2418
392,1.2418
393,1.2418
394,1.2418
395,1.2418
396,1.2418
397,1.2418
398,1.2741
399,1.3165
400,1.4714
401,1.6391
402,1.7771
403,1.9083
404,2.0028
405,2.0849
406,2.136
407,2.1844
408,2.2289
409,2.2734
410,2.318
411,2.3625
412,2.4071
413,2.4516
414,2.4962
415,2.5101
416,2.5189
417,2.4874
418,2.4471
419,2.3721
420,2.2925
421,2.2034
422,2.1274
423,2.0665
424,2.0316
425,2.0142
426,1.9905
427,1.9644
428,1.9439
429,1.9244
430,1.8769
431,1.8296
432,1.7862
433,1.7427
434,1.6992
435,1.6384
436,1.5493
437,1.4602
438,1.3711
439,1.3058
440,1.2536
441,1.2553
442,1.2727
443,1.2999
444,1.3271
445,1.3271
446,1.3177
447,1.2612
448,1.1763
449,1.0241
450,0.89904
451,0.80995
452,0.73302
453,0.66565
454,0.6448
455,0.6448
456,0.63766
457,0.62897
458,0.58613
459,0.54104
460,0.48998
461,0.43076000000000003
462,0.34167
463,0.25258
464,0.16349
465,0.39107
466,-0.23793000000000003
467,-0.34852
468,-0.11869
469,-0.19668
470,-0.28576999999999997
471,-0.37485999999999997
472,-0.46396000000000004
473,-0.55305
474,-0.63076
475,-0.63293
476,-0.63453
477,-0.63453
478,-0.65075
479,-0.69204
480,-0.7139800000000001
481,-0.71832
482,-0.71982
483,-0.71982
484,-0.71982
485,-0.71982
486,-0.75369
487,-0.79099
488,-0.8355299999999999
489,-0.8862899999999999
490,-0.9656
491,-1.0271
492,-1.0488
493,-1.061
494,-1.061
495,-1.043
496,-1.0115
497,-0.9708
498,-0.9262600000000001
499,-0.9061600000000001
500,-0.89094
501,-0.8904
502,-0.89299
503,-0.92015
504,-0.94535
505,-0.9638200000000001
506,-0.98462
507,-1.0096
508,-1.0208
509,-1.0175
510,-0.9746
511,-0.9072399999999999
512,-0.83988
513,-0.77252
514,-0.72526
515,-0.68118
516,-0.67574
517,-0.67745
518,-0.722
519,-0.76178
520,-0.78894
521,-0.81171
522,-0.82801
523,-0.85129
524,-0.8806200000000001
525,-0.8809899999999999
526,-0.8668600000000001
527,-0.8388700000000001
528,-0.8073600000000001
529,-0.78292
530,-0.75643
531,-0.68907
532,-0.63453
533,-0.63453
534,-0.63453
535,-0.63453
536,-0.63797
537,-0.64558
538,-0.67473
539,-0.71928
540,-0.75994
541,-0.79906
542,-0.8014399999999999
543,-0.79709
544,-0.7535
545,-0.70873
546,-0.66201
547,-0.60546
548,-0.51745
549,-0.44548999999999994
550,-0.40094
551,-0.40094
552,-0.44548999999999994
553,-0.49003
554,-0.53458
555,-0.54684
556,-0.54901
557,-0.5123800000000001
558,-0.47006000000000003
559,-0.38531
560,-0.2999
561,-0.2108
562,-0.13258
563,-0.39625
564,-0.077544
565,0.32989
566,0.1101
567,0.12747999999999998
568,0.44073999999999997
569,0.093061
570,-0.33376999999999996
571,-0.15811
572,-0.21655
573,-0.26994
574,-0.28298
575,-0.27491
576,-0.18364
577,-0.37995
578,0.28824
579,0.16279000000000002
580,0.23993
581,0.2815
582,0.29889
583,0.26577
584,0.21361999999999998
585,0.15123
586,0.44693999999999995
587,0.10496
588,-0.22241
589,-0.43971000000000005
590,-0.13366
591,-0.17712
592,-0.22224000000000002
593,-0.27004
594,-0.28336999999999996
595,-0.26381
596,-0.24006
597,-0.21399
598,-0.20809
599,-0.20809
600,-0.22283000000000003
601,-0.24014000000000002
602,-0.28469
603,-0.32923
604,-0.37378
605,-0.41831999999999997
606,-0.46287
607,-0.50229
608,-0.53489
609,-0.54924
610,-0.54924
611,-0.54924
612,-0.54924
613,-0.5421
614,-0.53341
615,-0.48333000000000004
616,-0.42865
617,-0.34607
618,-0.27281
619,-0.2337
620,-0.20959
621,-0.21393
622,-0.23742
623,-0.28197
624,-0.32652
625,-0.37106
626,-0.41561000000000003
627,-0.46015
628,-0.5047
629,-0.54924
630,0.11455
631,0.11455
632,0.11455
633,0.11455
634,0.11455
635,0.11455
636,0.11455
637,0.11455
638,0.11455
639,0.11455
640,0.11455
641,0.11455
642,0.11455
643,0.11455
644,0.11455
645,0.11455
646,0.11455
647,0.11455
648,0.11455
649,0.11455
650,0.11455
651,0.10385
652,0.40921
653,0.19535999999999998
654,-0.087844
655,-0.32558000000000004
656,-0.11107
657,-0.16421
658,-0.21923
659,-0.2446
660,-0.26849
661,-0.28872
662,-0.31188
663,-0.34506
664,-0.37823
665,-0.41141000000000005
666,-0.45327
667,-0.50425
668,-0.5542199999999999
669,-0.60358
670,-0.65294
671,-0.7023
672,-0.75308
673,-0.8036800000000001
674,-0.82229
675,-0.83824
676,-0.83824
677,-0.83115
678,-0.80525
679,-0.75807
680,-0.6795899999999999
681,-0.58983
682,-0.4903
683,-0.38376
684,-0.27371999999999996
685,-0.13785
686,0.24341
687,0.1357
688,0.25971
689,0.2848
690,0.30233000000000004
691,0.28776
692,0.25863
693,0.19876
694,0.15352000000000002
695,0.12600999999999998
696,0.11170999999999999
697,0.10686
698,0.46353999999999995
699,0.35835
700,0.13318
701,0.21247
702,0.40157
703,0.58345
704,0.68298
705,0.7821199999999999
706,0.88003
707,0.95405
708,0.9872200000000001
709,1.0038
710,1.0038
711,1.1059
712,1.2678
713,1.4808
714,1.7097
715,1.9416
716,2.1717
717,2.3141
718,2.437
719,2.4532
720,2.4162
721,2.2463
722,2.0757
723,1.9041
724,1.7796
725,1.6938
726,1.6739
727,1.6852
728,1.7549
729,1.8382
730,1.8911
731,1.9391
732,1.9489
733,1.9474
734,1.9021
735,1.8425
736,1.7543
737,1.6413
738,1.4997
739,1.3316
740,1.1455
741,0.97821
742,0.81799
743,0.71327
744,0.61778
745,0.58627
746,0.5612
747,0.57819
748,0.59519
749,0.6121800000000001
750,0.61098
751,0.58024
752,0.5312600000000001
753,0.46491000000000005
754,0.37203
755,0.26441
756,0.11170999999999999
757,-0.2595
758,-0.20906
759,-0.36083000000000004
760,-0.45955
761,-0.54384
762,-0.55598
763,-0.5546300000000001
764,-0.52145
765,-0.49591
766,-0.48053
767,-0.50138
768,-0.55074
769,-0.64982
770,-0.7711899999999999
771,-0.95106
772,-1.1436
773,-1.3
774,-1.4487
775,-1.5337
776,-1.6013
777,-1.6054
778,-1.6172
779,-1.6439
780,-1.6456
781,-1.6197
782,-1.6488
783,-1.7136
784,-1.755
785,-1.7882
786,-1.8214
787,-1.8545
788,-1.9209
789,-1.9788
790,-1.9804
791,-1.9733
792,-1.9418
793,-1.9096
794,-1.8764
795,-1.8432
796,-1.81
797,-1.7769
798,-1.7437
799,-1.7328
800,-1.7279
801,-1.7275
802,-1.7275
803,-1.7275
804,-1.7275
805,-1.7275
806,-1.7197
807,-1.6947
808,-1.6553
809,-1.5979
810,-1.5353
811,-1.469
812,-1.4026
813,-1.3363
814,-1.2881
815,-1.2436
816,-1.21
817,-1.1769
818,-1.1437
819,-1.1149
820,-1.1012
821,-1.0857
822,-1.0671
823,-1.024
824,-0.9551799999999999
825,-0.88841
826,-0.82286
827,-0.7816
828,-0.74842
829,-0.7287899999999999
830,-0.71137
831,-0.7259399999999999
832,-0.73923
833,-0.7449
834,-0.73638
835,-0.69026
836,-0.63595
837,-0.5696
838,-0.50325
839,-0.4369
840,-0.38456999999999997
841,-0.33926
842,-0.32234
843,-0.31263
844,-0.29766
845,-0.2847
846,-0.30978
847,-0.32731
848,-0.31275
849,-0.28362
850,-0.22374000000000002
851,-0.17082
852,-0.12630999999999998
853,-0.25140999999999997
854,0.22195
855,0.11079000000000001
856,0.16905
857,0.17259000000000002
858,0.16612000000000002
859,0.10355999999999999
860,0.22685999999999998
861,0.069075
862,-0.30566
863,-0.22474
864,0.15519000000000002
865,0.1283
866,0.261
867,0.42688000000000004
868,0.57234
869,0.70585
870,0.76661
871,0.8046399999999999
872,0.75598
873,0.69602
874,0.59973
875,0.49843000000000004
876,0.36978
877,0.25615
878,0.18009
879,0.15392
880,0.19762000000000002
881,0.29759
882,0.44405
883,0.62125
884,0.81302
885,0.9903799999999999
886,1.1644
887,1.3079
888,1.4438
889,1.5061
890,1.5488
891,1.514
892,1.4468
893,1.3149
894,1.177
895,1.0322
896,0.9066200000000001
897,0.79414
898,0.74748
899,0.72563
900,0.75095
901,0.7841199999999999
902,0.8173
903,0.8504799999999999
904,0.88365
905,0.90469
906,0.8893200000000001
907,0.8545200000000001
908,0.78817
909,0.71436
910,0.63345
911,0.52288
912,0.39584
913,0.27881999999999996
914,0.16473
915,0.12385
916,0.46874
917,0.41615
918,0.41748999999999997
919,0.13545
920,0.20315
921,0.30267
922,0.39839
923,0.48901000000000006
924,0.55247
925,0.59455
926,0.5796399999999999
927,0.53918
928,0.47213999999999995
929,0.39931
930,0.30106
931,0.20153
932,0.102
933,0.23185999999999998
934,-0.4248
935,-0.15631
936,-0.18300999999999998
937,-0.18005
938,-0.14444
939,-0.44445
940,-0.12079000000000001
941,0.086414
942,0.25229
943,0.41817
944,0.11455
