time,value
0,-0.13544
1,-0.13544
2,-0.13544
3,-0.13544
4,-0.13544
5,-0.13544
6,-0.13544
7,-0.13544
8,-0.13544
9,-0.13544
10,-0.13544
11,-0.13544
12,-0.13544
13,-0.13544
14,-0.13544
15,-0.13544
16,-0.13544
17,-0.13544
18,-0.13544
19,-0.13544
20,-0.13544
21,-0.13544
22,-0.13544
23,-0.13544
24,-0.13544
25,-0.13544
26,-0.13544
27,-0.13544
28,-0.13544
29,-0.13544
30,-0.13124
31,-0.10914000000000001
32,-0.069134
33,0.25711
34,0.13087000000000001
35,0.14377
36,0.15372
37,0.15372
38,0.16036
39,0.18799000000000002
40,0.2366
41,0.34711
42,0.11060999999999999
43,0.1946
44,0.27602
45,0.35079
46,0.42503
47,0.49796999999999997
48,0.5756
49,0.66401
50,0.74554
51,0.81221
52,0.8739100000000001
53,0.92548
54,0.9771700000000001
55,1.0291
56,1.0856
57,1.1505
58,1.1996
59,1.2217
60,1.2498
61,1.2878
62,1.3282
63,1.3724
64,1.4173
65,1.4633
66,1.5179
67,1.5842
68,1.6432
69,1.6925
70,1.7308
71,1.7551
72,1.7683
73,1.7683
74,1.7683
75,1.7683
76,1.7683
77,1.7683
78,1.7738
79,1.7848
80,1.8015
81,1.8236
82,1.8457
83,1.8678
84,1.8899
85,1.912
86,1.9407
87,1.975
88,2.0033
89,2.0269
90,2.0118
91,1.9676
92,1.8998
93,1.8151
94,1.7203
95,1.6186
96,1.5154
97,1.4112
98,1.3167
99,1.2283
100,1.1399
101,1.0515
102,0.96311
103,0.87471
104,0.79115
105,0.71011
106,0.63871
107,0.57204
108,0.49051000000000006
109,0.40210999999999997
110,0.33524
111,0.27778
112,0.22371
113,0.17104
114,0.10853
115,0.19792
116,-0.1336
117,-0.46512
118,-0.15669
119,-0.22299000000000002
120,-0.28929
121,-0.3556
122,-0.41991000000000006
123,-0.48363999999999996
124,-0.53204
125,-0.57624
126,-0.62045
127,-0.66465
128,-0.70885
129,-0.75305
130,-0.79119
131,-0.8280299999999999
132,-0.83409
133,-0.83409
134,-0.8500200000000001
135,-0.8688100000000001
136,-0.89045
137,-0.91255
138,-0.93465
139,-0.95675
140,-0.9788600000000001
141,-1.001
142,-1.0231
143,-1.0452
144,-1.079
145,-1.114
146,-1.1466
147,-1.179
148,-1.1811
149,-1.1811
150,-1.2009999999999998
151,-1.222
152,-1.2306
153,-1.2387
154,-1.2389
155,-1.2389
156,-1.2389
157,-1.2389
158,-1.2831
159,-1.3269
160,-1.3409
161,-1.3546
162,-1.3546
163,-1.3546
164,-1.3546
165,-1.3546
166,-1.3546
167,-1.3566
168,-1.389
169,-1.4224
170,-1.4666
171,-1.511
172,-1.5574
173,-1.6058
174,-1.6721
175,-1.7364
176,-1.7854
177,-1.8325
178,-1.8664
179,-1.8982
180,-1.9169999999999998
181,-1.9329
182,-1.9329
183,-1.9329
184,-1.9329
185,-1.9288
186,-1.906
187,-1.8791
188,-1.8349
189,-1.7907
190,-1.7465
191,-1.7065
192,-1.6818
193,-1.6577
194,-1.6356
195,-1.6122
196,-1.5846
197,-1.5528
198,-1.5085
199,-1.4643
200,-1.4201
201,-1.3684
202,-1.2969
203,-1.2205
204,-1.1321
205,-1.0437
206,-0.9552799999999999
207,-0.86
208,-0.7498600000000001
209,-0.6396
210,-0.52909
211,-0.42123
212,-0.31845999999999997
213,-0.22104000000000001
214,-0.13337000000000002
215,-0.28094
216,0.31851
217,0.32195
218,0.49508
219,0.1279
220,0.14115999999999998
221,0.14681
222,0.14128
223,0.11037000000000001
224,0.20713
225,-0.087925
226,-0.33471999999999996
227,-0.10697000000000001
228,-0.14123
229,-0.16726
230,-0.18347
231,-0.18174
232,-0.15963
233,-0.13752999999999999
234,-0.11542999999999999
235,-0.45257
236,-0.28681
237,-0.093078
238,0.12794
239,0.34895
240,0.11663
241,0.17102
242,0.23438
243,0.29272
244,0.34686999999999996
245,0.3926
246,0.43165
247,0.46103999999999995
248,0.48315
249,0.49345
250,0.49528999999999995
251,0.50393
252,0.5171899999999999
253,0.53582
254,0.55792
255,0.58002
256,0.60212
257,0.63775
258,0.68121
259,0.69733
260,0.69844
261,0.68912
262,0.67438
263,0.6695300000000001
264,0.6695300000000001
265,0.6695300000000001
266,0.6695300000000001
267,0.6695300000000001
268,0.6695300000000001
269,0.6815399999999999
270,0.6984899999999999
271,0.73297
272,0.77423
273,0.7852
274,0.7852
275,0.77282
276,0.7562399999999999
277,0.72092
278,0.67966
279,0.61907
280,0.55276
281,0.48646000000000006
282,0.42016000000000003
283,0.38205
284,0.35111
285,0.32733
286,0.30523
287,0.28313
288,0.26103000000000004
289,0.23893000000000003
290,0.21681999999999998
291,0.19472
292,0.17262
293,0.16067
294,0.15035
295,0.14487
296,0.14007999999999998
297,0.11995
298,0.47603
299,0.36551999999999996
300,0.25501999999999997
301,0.20326
302,0.15722
303,0.15372
304,0.15372
305,0.15372
306,0.15372
307,0.054055
308,-0.050927
309,-0.16122
310,-0.27173
311,-0.34813
312,-0.42363999999999996
313,-0.4246
314,-0.4246
315,-0.25535
316,-0.25535
317,-0.25535
318,-0.25535
319,-0.25535
320,-0.25535
321,-0.25535
322,-0.25535
323,-0.25535
324,-0.25535
325,-0.25535
326,-0.25535
327,-0.25535
328,-0.25535
329,-0.25535
330,-0.25535
331,-0.25535
332,-0.25535
333,-0.25535
334,-0.25535
335,-0.25535
336,-0.25535
337,-0.25535
338,-0.25535
339,-0.25535
340,-0.25535
341,-0.25535
342,-0.25535
343,-0.25535
344,-0.25535
345,-0.25775
346,-0.27036
347,-0.2932
348,-0.35628000000000004
349,-0.40738
350,-0.41473999999999994
351,-0.42856000000000005
352,-0.46431000000000006
353,-0.50284
354,-0.55015
355,-0.58549
356,-0.58549
357,-0.55418
358,-0.43643000000000004
359,-0.32716
360,-0.2399
361,-0.15416
362,-0.37398000000000003
363,0.10314000000000001
364,0.14943
365,0.25597
366,0.32011
367,0.39774
368,0.5028699999999999
369,0.60765
370,0.7117399999999999
371,0.8013
372,0.8643799999999999
373,0.9274600000000001
374,0.99055
375,1.0708
376,1.1791
377,1.3043
378,1.4557
379,1.6182
380,1.7969
381,1.9273
382,1.9904
383,2.0535
384,2.1166
385,2.1671
386,2.2018
387,2.2207
388,2.2207
389,2.2207
390,2.2207
391,2.2455
392,2.2969999999999997
393,2.3542
394,2.4173
395,2.4804
396,2.5434
397,2.6065
398,2.6696
399,2.7036
400,2.7119999999999997
401,2.7348
402,2.7695
403,2.8036
404,2.8372
405,2.8158
406,2.7527
407,2.6559
408,2.535
409,2.3885
410,2.2244
411,2.0451
412,1.8558
413,1.6666
414,1.4773
415,1.3267
416,1.1984
417,1.0715
418,0.94534
419,0.80533
420,0.65813
421,0.48413999999999996
422,0.29699000000000003
423,0.19464
424,0.13155999999999998
425,0.17547000000000001
426,-0.36073
427,-0.17302
428,-0.27501
429,-0.34892
430,-0.41201000000000004
431,-0.47508999999999996
432,-0.53817
433,-0.60126
434,-0.6643399999999999
435,-0.72742
436,-0.79051
437,-0.85359
438,-0.9166700000000001
439,-0.9797600000000001
440,-1.0428
441,-1.0657
442,-1.0783
443,-1.1054
444,-1.1359
445,-1.1845
446,-1.2371
447,-1.2458
448,-1.2458
449,-1.2458
450,-1.2458
451,-1.2458
452,-1.2458
453,-1.2458
454,-1.2458
455,-1.2458
456,-1.2458
457,-1.1947
458,-1.138
459,-1.109
460,-1.0827
461,-1.0651
462,-1.0483
463,-0.9881700000000001
464,-0.9250799999999999
465,-0.862
466,-0.79892
467,-0.73583
468,-0.67275
469,-0.5902
470,-0.5071399999999999
471,-0.38151999999999997
472,-0.25535
473,-0.19227
474,-0.12864
475,-0.12544
476,0.40219
477,0.16297999999999999
478,0.23997
479,0.24313
480,0.24931999999999999
481,0.3124
482,0.37256
483,0.38938
484,0.40492
485,0.40492
486,0.40436
487,0.39805
488,0.386
489,0.32291
490,0.26546
491,0.25179
492,0.23613
493,0.20669
494,0.1752
495,0.13104000000000002
496,0.10317
497,0.16626
498,0.22069
499,0.2312
500,0.23985
501,0.23985
502,0.23985
503,0.23985
504,0.23985
505,0.23985
506,0.21586999999999998
507,0.10442
508,-0.18108
509,-0.47645
510,-0.1765
511,-0.23958000000000002
512,-0.30266
513,-0.36575
514,-0.42883000000000004
515,-0.49191
516,-0.53333
517,-0.51861
518,-0.48981
519,-0.42673
520,-0.36364
521,-0.30056
522,-0.19822
523,-0.06854299999999999
524,0.16293
525,0.31012
526,0.43504
527,0.51705
528,0.5707399999999999
529,0.57284
530,0.59733
531,0.66041
532,0.68916
533,0.66182
534,0.61056
535,0.5222399999999999
536,0.41646000000000005
537,0.28504
538,0.12946
539,-0.31216
540,-0.20740999999999998
541,-0.29993000000000003
542,-0.37940999999999997
543,-0.4425
544,-0.49791
545,-0.54418
546,-0.53922
547,-0.47613999999999995
548,-0.43783999999999995
549,-0.42627
550,-0.40485
551,-0.37331
552,-0.33165
553,-0.28013000000000005
554,-0.25535
555,-0.25535
556,-0.22628
557,-0.17160999999999998
558,-0.13125
559,-0.10286
560,-0.09848
561,-0.1132
562,-0.15547
563,-0.21855
564,-0.24795999999999999
565,-0.25322
566,-0.30039
567,-0.37609000000000004
568,-0.47158999999999995
569,-0.5798800000000001
570,-0.66014
571,-0.72322
572,-0.7863
573,-0.8493799999999999
574,-0.93894
575,-1.043
576,-1.1340000000000001
577,-1.2181
578,-1.2458
579,-1.2458
580,-1.2458
581,-1.2458
582,-1.2458
583,-1.2458
584,-1.2115
585,-1.1631
586,-1.0616
587,-0.93968
588,-0.86095
589,-0.79787
590,-0.77012
591,-0.75435
592,-0.75055
593,-0.75055
594,-0.7562399999999999
595,-0.7636
596,-0.8146899999999999
597,-0.87777
598,-0.86036
599,-0.8225100000000001
600,-0.78892
601,-0.7563300000000001
602,-0.7419
603,-0.73139
604,-0.67696
605,-0.61387
606,-0.59627
607,-0.5868
608,-0.55653
609,-0.52288
610,-0.47546000000000005
611,-0.42605
612,-0.42041999999999996
613,-0.42041999999999996
614,-0.42041999999999996
615,-0.42041999999999996
616,-0.42041999999999996
617,-0.42041999999999996
618,-0.42041999999999996
619,-0.42041999999999996
620,-0.42041999999999996
621,-0.42041999999999996
622,-0.47731
623,-0.5372399999999999
624,-0.56177
625,-0.5849
626,-0.60496
627,-0.62493
628,-0.68747
629,-0.75055
630,0.4187
631,0.4187
632,0.4187
633,0.4187
634,0.4187
635,0.4187
636,0.4187
637,0.4187
638,0.4187
639,0.4187
640,0.4187
641,0.4187
642,0.4187
643,0.4187
644,0.41936999999999997
645,0.42695
646,0.44143000000000004
647,0.5172
648,0.5862
649,0.6026199999999999
650,0.61695
651,0.61695
652,0.61695
653,0.61695
654,0.61695
655,0.61695
656,0.61695
657,0.61695
658,0.61695
659,0.61695
660,0.61983
661,0.63498
662,0.66241
663,0.7381800000000001
664,0.80674
665,0.84905
666,0.8879
667,0.91505
668,0.9413600000000001
669,0.96504
670,0.99231
671,1.0302
672,1.0728
673,1.1283
674,1.1875
675,1.256
676,1.3233
677,1.3877
678,1.4441
679,1.4819
680,1.5139
681,1.5332
682,1.5482
683,1.5545
684,1.5587
685,1.5587
686,1.5582
687,1.5569
688,1.5422
689,1.5044
690,1.4613
691,1.4099
692,1.3533
693,1.2889
694,1.2199
695,1.1442
696,1.0684
697,0.9926200000000001
698,0.91686
699,0.84109
700,0.7691
701,0.70186
702,0.63822
703,0.57887
704,0.51183
705,0.43606000000000006
706,0.36774
707,0.30744
708,0.24886
709,0.19203
710,0.13169
711,0.32642
712,-0.07270900000000001
713,-0.10661
714,-0.19259
715,-0.27088
716,-0.35347
717,-0.43965
718,-0.5232
719,-0.60464
720,-0.66128
721,-0.69916
722,-0.7370399999999999
723,-0.77493
724,-0.81281
725,-0.85069
726,-0.8885700000000001
727,-0.9264600000000001
728,-0.96434
729,-1.0022
730,-1.0169
731,-1.0182
732,-1.0266
733,-1.0389
734,-1.0639
735,-1.0955
736,-1.1440000000000001
737,-1.2008
738,-1.2576
739,-1.3144
740,-1.3619999999999999
741,-1.4056
742,-1.44
743,-1.4706
744,-1.4928
745,-1.5117
746,-1.5307
747,-1.5496
748,-1.5686
749,-1.5875
750,-1.6002
751,-1.611
752,-1.6134
753,-1.6134
754,-1.6134
755,-1.6134
756,-1.6134
757,-1.6134
758,-1.6208
759,-1.63
760,-1.6446
761,-1.6604
762,-1.663
763,-1.663
764,-1.663
765,-1.663
766,-1.663
767,-1.663
768,-1.663
769,-1.663
770,-1.663
771,-1.663
772,-1.6476
773,-1.6306
774,-1.6219
775,-1.614
776,-1.6087
777,-1.6037
778,-1.5856
779,-1.5667
780,-1.5477
781,-1.5288
782,-1.5214
783,-1.5144
784,-1.5143
785,-1.5143
786,-1.5143
787,-1.5143
788,-1.5143
789,-1.5143
790,-1.5143
791,-1.5141
792,-1.5072
793,-1.4997
794,-1.4798
795,-1.459
796,-1.4211
797,-1.3815
798,-1.3158
799,-1.2482
800,-1.1567
801,-1.0632
802,-0.9495
803,-0.83585
804,-0.7222
805,-0.60856
806,-0.49491
807,-0.38126
808,-0.26761
809,-0.15475
810,-0.24714
811,0.26824000000000003
812,0.13205
813,0.21041999999999997
814,0.30196999999999996
815,0.39234
816,0.47726
817,0.56045
818,0.63621
819,0.7119800000000001
820,0.78774
821,0.8599100000000001
822,0.91894
823,0.9774700000000001
824,1.0343
825,1.0911
826,1.1479
827,1.2048
828,1.2616
829,1.3184
830,1.3752
831,1.4256
832,1.459
833,1.4849
834,1.4925
835,1.492
836,1.4731
837,1.4424
838,1.3862
839,1.3298
840,1.273
841,1.2161
842,1.1593
843,1.1029
844,1.0474
845,1.0053
846,0.98631
847,0.97252
848,0.96716
849,0.9668700000000001
850,0.97445
851,0.9872700000000001
852,1.0078
853,1.0356
854,1.0734
855,1.1113
856,1.1492
857,1.172
858,1.1758
859,1.1571
860,1.1117
861,1.0431
862,0.9484299999999999
863,0.8760399999999999
864,0.8277399999999999
865,0.78458
866,0.7467
867,0.7035399999999999
868,0.6552399999999999
869,0.58286
870,0.48815
871,0.40216999999999997
872,0.32388
873,0.26398
874,0.21946
875,0.18673
876,0.16337000000000002
877,0.13174
878,0.45607
879,0.31721
880,0.21461
881,0.082899
882,-0.068632
883,-0.24318
884,-0.4326
885,-0.12176
886,-0.15964
887,-0.19752999999999998
888,-0.23540999999999998
889,-0.27329000000000003
890,-0.31118
891,-0.35320999999999997
892,-0.39741
893,-0.44966000000000006
894,-0.50585
895,-0.5365800000000001
896,-0.55552
897,-0.556
898,-0.54842
899,-0.52764
900,-0.50144
901,-0.4659
902,-0.42675
903,-0.37463
904,-0.31781
905,-0.2822
906,-0.25379
907,-0.24504
908,-0.24251
909,-0.25486
910,-0.27159
911,-0.27519
912,-0.27519
913,-0.22685
914,-0.16624
915,-0.47995
916,-0.10112
917,0.23875
918,0.11667999999999999
919,0.14342
920,0.16236
921,0.16765
922,0.17049
923,0.17958
924,0.18968
925,0.20392000000000002
926,0.21875999999999998
927,0.22045
928,0.22045
929,0.23576999999999998
930,0.25281
931,0.26152
932,0.26941
933,0.26534
934,0.26029
935,0.24223000000000003
936,0.22329000000000002
937,0.22143000000000002
938,0.22048
939,0.20890999999999998
940,0.19691
941,0.18399000000000001
942,0.17105
943,0.17088
944,0.17088
