time,value
0,-0.3255
1,-0.3255
2,-0.3255
3,-0.3255
4,-0.3255
5,-0.3255
6,-0.3255
7,-0.3255
8,-0.3255
9,-0.3255
10,-0.33785
11,-0.35219
12,-0.36814
13,-0.37287
14,-0.37509000000000003
15,-0.37509000000000003
16,-0.37509000000000003
17,-0.37509000000000003
18,-0.37509000000000003
19,-0.37509000000000003
20,-0.37509000000000003
21,-0.37509000000000003
22,-0.37509000000000003
23,-0.37509000000000003
24,-0.37509000000000003
25,-0.37509000000000003
26,-0.37509000000000003
27,-0.37509000000000003
28,-0.37509000000000003
29,-0.37509000000000003
30,-0.37509000000000003
31,-0.37509000000000003
32,-0.37509000000000003
33,-0.37509000000000003
34,-0.37509000000000003
35,-0.37509000000000003
36,-0.37509000000000003
37,-0.37509000000000003
38,-0.37509000000000003
39,-0.37509000000000003
40,-0.37235999999999997
41,-0.36577
42,-0.34981999999999996
43,-0.33583
44,-0.3255
45,-0.3255
46,-0.3255
47,-0.3255
48,-0.3255
49,-0.32441
50,-0.31729
51,-0.28539000000000003
52,-0.2535
53,-0.2216
54,-0.1897
55,-0.1578
56,-0.1259
57,-0.46711
58,-0.30763
59,-0.15682000000000001
60,-0.06681000000000001
61,0.11667999999999999
62,0.089781
63,0.10478
64,0.11084000000000001
65,0.11084000000000001
66,0.11084000000000001
67,0.11084000000000001
68,0.11456
69,0.16983
70,0.23875
71,0.32092
72,0.4512
73,0.11886
74,0.15102000000000002
75,0.19208
76,0.23665999999999998
77,0.28451
78,0.33235
79,0.3802
80,0.42805
81,0.48308999999999996
82,0.54238
83,0.60617
84,0.6761
85,0.75066
86,0.83041
87,0.91015
88,0.9899
89,1.0696
90,1.1411
91,1.2023
92,1.2501
93,1.298
94,1.3458
95,1.3937
96,1.4347
97,1.4595
98,1.4595
99,1.4581
100,1.4513
101,1.4354
102,1.4194
103,1.4035
104,1.3875
105,1.3716
106,1.3607
107,1.3604
108,1.3604
109,1.3649
110,1.3796
111,1.3953
112,1.4152
113,1.4449
114,1.4763
115,1.5082
116,1.5401
117,1.5719999999999998
118,1.6039
119,1.6358
120,1.6677
121,1.6969999999999998
122,1.7180000000000002
123,1.7354
124,1.7471
125,1.7432
126,1.7308
127,1.7131
128,1.6882
129,1.6585
130,1.6252
131,1.5853
132,1.5401
133,1.4922
134,1.4444
135,1.3965
136,1.3495
137,1.3078
138,1.2722
139,1.2415
140,1.2201
141,1.2116
142,1.2112
143,1.2069
144,1.1958
145,1.1801
146,1.1675
147,1.162
148,1.1619
149,1.1595
150,1.1497
151,1.1338
152,1.1178
153,1.1019
154,1.0859
155,1.0695
156,1.0452
157,1.0133
158,0.9813700000000001
159,0.94947
160,0.9175700000000001
161,0.8856799999999999
162,0.86062
163,0.84325
164,0.82725
165,0.8113
166,0.79535
167,0.7794
168,0.7579899999999999
169,0.7294
170,0.69776
171,0.6707
172,0.6504800000000001
173,0.63412
174,0.61817
175,0.60223
176,0.58628
177,0.57033
178,0.55438
179,0.53843
180,0.52248
181,0.50653
182,0.49058
183,0.47728999999999994
184,0.46924
185,0.46784
186,0.46343
187,0.44953999999999994
188,0.4211
189,0.39278
190,0.37288000000000004
191,0.36867
192,0.36727
193,0.36221
194,0.34878000000000003
195,0.33176
196,0.31171
197,0.28276999999999997
198,0.25087
199,0.21896999999999997
200,0.18708
201,0.15517999999999998
202,0.12328
203,0.45982
204,0.30033000000000004
205,0.14084000000000002
206,-0.12018
207,-0.17814000000000002
208,-0.33763000000000004
209,-0.49712
210,-0.13191
211,-0.1638
212,-0.18569000000000002
213,-0.20218
214,-0.21811999999999998
215,-0.22495
216,-0.22634
217,-0.22634
218,-0.2346
219,-0.24829
220,-0.26423
221,-0.28018000000000004
222,-0.29613
223,-0.31208
224,-0.33468000000000003
225,-0.36245
226,-0.39435
227,-0.42625
228,-0.45815
229,-0.49005
230,-0.52195
231,-0.55384
232,-0.5857399999999999
233,-0.61764
234,-0.64954
235,-0.6814399999999999
236,-0.7094699999999999
237,-0.73363
238,-0.74965
239,-0.7688699999999999
240,-0.79161
241,-0.82324
242,-0.8578399999999999
243,-0.8955799999999999
244,-0.94294
245,-0.9907799999999999
246,-1.0386
247,-1.0865
248,-1.1343
249,-1.1822
250,-1.23
251,-1.2791
252,-1.3299
253,-1.3924
254,-1.4554
255,-1.5171
256,-1.5667
257,-1.6145
258,-1.6624
259,-1.7102
260,-1.758
261,-1.8057
262,-1.8402
263,-1.8721
264,-1.9040000000000001
265,-1.9111
266,-1.9122
267,-1.9122
268,-1.9122
269,-1.9122
270,-1.9122
271,-1.9225
272,-1.9365
273,-1.9525
274,-1.9591
275,-1.9618
276,-1.9618
277,-1.9365
278,-1.8992
279,-1.8514
280,-1.796
281,-1.7366
282,-1.6728
283,-1.609
284,-1.5452
285,-1.4814
286,-1.4234
287,-1.3695
288,-1.3216
289,-1.2788
290,-1.2398
291,-1.2079
292,-1.176
293,-1.1441
294,-1.1122
295,-1.0839
296,-1.0588
297,-1.0429
298,-1.0212
299,-0.9936299999999999
300,-0.94578
301,-0.8979299999999999
302,-0.85009
303,-0.80224
304,-0.75278
305,-0.70133
306,-0.63754
307,-0.5695899999999999
308,-0.49605
309,-0.36846
310,-0.24486999999999998
311,-0.12717
312,-0.12717
313,-0.12717
314,-0.12717
315,-1.3434
316,-1.3434
317,-1.3434
318,-1.3434
319,-1.3434
320,-1.3434
321,-1.3434
322,-1.3434
323,-1.3434
324,-1.3434
325,-1.3434
326,-1.3434
327,-1.3434
328,-1.3434
329,-1.3434
330,-1.3434
331,-1.3434
332,-1.3434
333,-1.3434
334,-1.3434
335,-1.3434
336,-1.3434
337,-1.3434
338,-1.3434
339,-1.3434
340,-1.3434
341,-1.3434
342,-1.3434
343,-1.3302
344,-1.3086
345,-1.2745
346,-1.2515
347,-1.2373
348,-1.2373
349,-1.2373
350,-1.2373
351,-1.2373
352,-1.2373
353,-1.2373
354,-1.2373
355,-1.2257
356,-1.1975
357,-1.1292
358,-1.0694
359,-1.0252
360,-1.0252
361,-1.0199
362,-1.0002
363,-0.93201
364,-0.86613
365,-0.81313
366,-0.81313
367,-0.81313
368,-0.80209
369,-0.73455
370,-0.66656
371,-0.60292
372,-0.56645
373,-0.53147
374,-0.49736
375,-0.46325
376,-0.42913999999999997
377,-0.39796
378,-0.39154
379,-0.38895
380,-0.38895
381,-0.38895
382,-0.38895
383,-0.38736
384,-0.36372
385,-0.33424
386,-0.30013
387,-0.26602
388,-0.23190999999999998
389,-0.19724
390,-0.14354
391,-0.40859
392,-0.066646
393,0.36225999999999997
394,0.16593
395,0.26826
396,0.37058
397,0.47292
398,0.57524
399,0.66445
400,0.7437699999999999
401,0.81199
402,0.8692799999999999
403,0.91601
404,0.9501200000000001
405,0.97541
406,0.9896299999999999
407,0.9896299999999999
408,0.9896299999999999
409,0.9896299999999999
410,0.9896299999999999
411,0.99446
412,1.0109
413,1.045
414,1.0762
415,1.0957
416,1.0957
417,1.0968
418,1.1095
419,1.1436
420,1.1777
421,1.2228
422,1.2903
423,1.3584
424,1.4169999999999998
425,1.4538
426,1.4884
427,1.5395
428,1.6324
429,1.7326
430,1.8276
431,1.9026
432,1.9724
433,2.0406
434,2.1088
435,2.1771
436,2.2399
437,2.2848
438,2.3219
439,2.3471
440,2.3386
441,2.3122
442,2.278
443,2.2439
444,2.2098
445,2.1757
446,2.1416
447,2.1075
448,2.0734
449,2.0393
450,2.0052
451,1.9711
452,1.9369
453,1.9028
454,1.8674
455,1.8222
456,1.7630000000000001
457,1.6948
458,1.6266
459,1.5584
460,1.4901
461,1.4219
462,1.3537
463,1.2855
464,1.2173
465,1.149
466,1.0808
467,1.0126
468,0.9443799999999999
469,0.87616
470,0.80794
471,0.7397199999999999
472,0.6715
473,0.60328
474,0.55129
475,0.5161600000000001
476,0.48203
477,0.44792
478,0.41381
479,0.3797
480,0.33247
481,0.26931
482,0.20139
483,0.14486
484,0.10365
485,0.34791
486,0.17736
487,0.04952
488,-0.16374
489,-0.33429000000000003
490,-0.10155
491,-0.13566
492,-0.16192
493,-0.17509
494,-0.17686
495,-0.18359
496,-0.2025
497,-0.23428000000000002
498,-0.2627
499,-0.27993
500,-0.28291
501,-0.28291
502,-0.28291
503,-0.28291
504,-0.28291
505,-0.28291
506,-0.28291
507,-0.28592
508,-0.29673
509,-0.32545999999999997
510,-0.35957
511,-0.39368000000000003
512,-0.42778999999999995
513,-0.46028
514,-0.48763
515,-0.495
516,-0.49604
517,-0.5007699999999999
518,-0.52641
519,-0.56052
520,-0.59463
521,-0.62874
522,-0.66285
523,-0.69696
524,-0.73107
525,-0.76518
526,-0.79929
527,-0.81198
528,-0.81313
529,-0.81313
530,-0.81313
531,-0.81313
532,-0.81313
533,-0.79547
534,-0.7661899999999999
535,-0.7320800000000001
536,-0.71387
537,-0.70709
538,-0.70709
539,-0.72131
540,-0.7466
541,-0.78071
542,-0.8022
543,-0.81313
544,-0.81313
545,-0.81313
546,-0.81313
547,-0.81313
548,-0.81313
549,-0.81313
550,-0.81313
551,-0.81313
552,-0.81313
553,-0.81313
554,-0.80615
555,-0.7916300000000001
556,-0.75808
557,-0.72397
558,-0.68986
559,-0.65575
560,-0.6170100000000001
561,-0.57243
562,-0.5058
563,-0.44473
564,-0.3934
565,-0.38895
566,-0.39154
567,-0.39796
568,-0.42913999999999997
569,-0.46156
570,-0.49128
571,-0.495
572,-0.495
573,-0.495
574,-0.495
575,-0.495
576,-0.495
577,-0.495
578,-0.495
579,-0.495
580,-0.442
581,-0.37611999999999995
582,-0.3079
583,-0.28819
584,-0.28291
585,-0.28291
586,-0.28291
587,-0.28291
588,-0.28291
589,-0.2629
590,-0.23460999999999999
591,-0.2005
592,-0.16639
593,-0.13228
594,-0.48795
595,-0.3174
596,-0.14686
597,0.1621
598,0.19424
599,0.36479
600,0.10649000000000002
601,0.15305
602,0.20814000000000002
603,0.27636
604,0.31232
605,0.32364
606,0.28953
607,0.25542
608,0.22130999999999998
609,0.1872
610,0.16829000000000002
611,0.16355999999999998
612,0.19767
613,0.23178
614,0.26589
615,0.3
616,0.33411
617,0.36822
618,0.40233
619,0.43643999999999994
620,0.47055
621,0.50466
622,0.5432100000000001
623,0.5877399999999999
624,0.69007
625,0.78919
626,0.88359
627,0.88359
628,0.88359
629,0.88359
630,0.13995
631,0.13995
632,0.13995
633,0.13995
634,0.13995
635,0.13995
636,0.13995
637,0.13995
638,0.13995
639,0.13995
640,0.16856
641,0.20178
642,0.23873000000000003
643,0.24968
644,0.25483
645,0.25483
646,0.25483
647,0.25483
648,0.25483
649,0.25483
650,0.25483
651,0.25483
652,0.25483
653,0.25483
654,0.25483
655,0.25483
656,0.25483
657,0.25483
658,0.26431
659,0.27995
660,0.30459
661,0.32114000000000004
662,0.33142
663,0.33142
664,0.33142
665,0.33142
666,0.33142
667,0.33686
668,0.34849
669,0.37312
670,0.39776
671,0.42239
672,0.44703000000000004
673,0.47166
674,0.4963
675,0.52093
676,0.54461
677,0.5656899999999999
678,0.57801
679,0.59075
680,0.6058100000000001
681,0.63045
682,0.65508
683,0.67972
684,0.70435
685,0.7289899999999999
686,0.75362
687,0.77825
688,0.80289
689,0.82752
690,0.85216
691,0.87679
692,0.90249
693,0.9371200000000001
694,0.97314
695,1.0101
696,1.047
697,1.084
698,1.1209
699,1.1579
700,1.1948
701,1.2318
702,1.2688
703,1.3057
704,1.3425
705,1.3723
706,1.3995
707,1.4240000000000002
708,1.436
709,1.4419
710,1.4419
711,1.4419
712,1.4419
713,1.4419
714,1.4419
715,1.4419
716,1.4419
717,1.4340000000000002
718,1.4185
719,1.3939
720,1.3661
721,1.3342
722,1.2973
723,1.2652
724,1.2414
725,1.2291
726,1.2168
727,1.2045
728,1.1922
729,1.1809
730,1.1739
731,1.1739
732,1.1735
733,1.1689
734,1.1566
735,1.1442
736,1.124
737,1.0876
738,1.0507
739,1.0137
740,0.9768
741,0.93984
742,0.8998299999999999
743,0.8522700000000001
744,0.80338
745,0.7541100000000001
746,0.7048399999999999
747,0.65557
748,0.60401
749,0.5456
750,0.48483000000000004
751,0.42518999999999996
752,0.37201999999999996
753,0.32166
754,0.27239
755,0.22311999999999999
756,0.17385
757,0.12592
758,0.42091000000000006
759,0.22764
760,0.28999
761,-0.14188
762,-0.32664
763,-0.10202
764,-0.13348
765,-0.16055
766,-0.18582
767,-0.21520999999999998
768,-0.24933000000000002
769,-0.28628000000000003
770,-0.32323
771,-0.36019
772,-0.39745
773,-0.4377
774,-0.48323999999999995
775,-0.5323100000000001
776,-0.57902
777,-0.62019
778,-0.65714
779,-0.6941
780,-0.73105
781,-0.7679600000000001
782,-0.80381
783,-0.83373
784,-0.8583700000000001
785,-0.883
786,-0.90764
787,-0.93227
788,-0.95691
789,-0.98154
790,-1.0062
791,-1.0308
792,-1.0502
793,-1.0636
794,-1.0759
795,-1.0835
796,-1.0853
797,-1.0854
798,-1.0854
799,-1.0854
800,-1.0854
801,-1.0929
802,-1.111
803,-1.135
804,-1.1563
805,-1.1727
806,-1.1855
807,-1.2006
808,-1.2205
809,-1.2445
810,-1.2667
811,-1.2845
812,-1.2976
813,-1.31
814,-1.3223
815,-1.3346
816,-1.3469
817,-1.3592
818,-1.3716
819,-1.3825
820,-1.3902
821,-1.3918
822,-1.3929
823,-1.3968
824,-1.4072
825,-1.4203
826,-1.4358
827,-1.4581
828,-1.4822
829,-1.5044
830,-1.5194
831,-1.5313
832,-1.5419
833,-1.545
834,-1.5448
835,-1.5438
836,-1.535
837,-1.5227
838,-1.5103
839,-1.4980000000000002
840,-1.4857
841,-1.4734
842,-1.4611
843,-1.4487
844,-1.4364
845,-1.4312
846,-1.4301
847,-1.4301
848,-1.4301
849,-1.4301
850,-1.4301
851,-1.4301
852,-1.4301
853,-1.4301
854,-1.4301
855,-1.4301
856,-1.4301
857,-1.4255
858,-1.4172
859,-1.4048
860,-1.3925
861,-1.3802
862,-1.3679
863,-1.3521
864,-1.3330000000000002
865,-1.3084
866,-1.2837
867,-1.2591
868,-1.2345
869,-1.2073
870,-1.1774
871,-1.1407
872,-1.1017
873,-1.0602
874,-1.0113
875,-0.9637
876,-0.9182100000000001
877,-0.88069
878,-0.84373
879,-0.80678
880,-0.76983
881,-0.73288
882,-0.69593
883,-0.65897
884,-0.62141
885,-0.58287
886,-0.53495
887,-0.48568
888,-0.43641
889,-0.38714
890,-0.33787
891,-0.2886
892,-0.23933000000000001
893,-0.19005999999999998
894,-0.14079
895,-0.40685
896,-0.10103
897,0.20690999999999998
898,0.10239
899,0.16397
900,0.22555999999999998
901,0.29512
902,0.36751
903,0.44142
904,0.5081
905,0.5717899999999999
906,0.63337
907,0.6754600000000001
908,0.70825
909,0.7328899999999999
910,0.75752
911,0.7821600000000001
912,0.80679
913,0.8314299999999999
914,0.85606
915,0.8807
916,0.9008299999999999
917,0.91789
918,0.93021
919,0.9464100000000001
920,0.9655799999999999
921,0.99021
922,1.0181
923,1.0489
924,1.0858
925,1.12
926,1.1517
927,1.1763
928,1.2009
929,1.2256
930,1.2502
931,1.2731
932,1.2941
933,1.3064
934,1.3188
935,1.3311
936,1.3434
937,1.3557
938,1.368
939,1.3803
940,1.3923
941,1.4036
942,1.4036
943,1.4036
944,1.4036
