time,value
0,-1.54
1,-1.5982
2,-1.5793
3,-1.4521
4,-1.1963
5,-0.8019
6,-0.29521
7,0.27723000000000003
8,0.83104
9,1.3047
10,1.6403
11,1.8023
12,1.7969
13,1.6372
14,1.3634
15,0.9958
16,0.56999
17,0.11052999999999999
18,-0.35384
19,-0.79589
20,-1.1764
21,-1.4611
22,-1.6257
23,-1.6432
24,-1.5145
25,-1.2584
26,-0.9005200000000001
27,-0.48318999999999995
28,-0.040594
29,0.39139
30,0.77753
31,1.0995
32,1.3289
33,1.4537
34,1.4562
35,1.3401
36,1.1135
37,0.80512
38,0.44135
39,0.055522
40,-0.30601999999999996
41,-0.62107
42,-0.8562
43,-0.98431
44,-1.0098
45,-0.9272100000000001
46,-0.74741
47,-0.50066
48,-0.23158
49,0.01813
50,0.20209000000000002
51,0.27353
52,0.22891
53,0.076002
54,-0.13335
55,-0.3507
56,-0.5211600000000001
57,-0.60039
58,-0.57468
59,-0.43306999999999995
60,-0.20492
61,0.073469
62,0.38085
63,0.6682899999999999
64,0.93234
65,1.1416
66,1.2686
67,1.3039
68,1.2246
69,1.0319
70,0.7299899999999999
71,0.34811
72,-0.06327999999999999
73,-0.46361
74,-0.8001699999999999
75,-1.0451
76,-1.2036
77,-1.2705
78,-1.2827
79,-1.2584
80,-1.196
81,-1.1037
82,-0.94155
83,-0.72228
84,-0.42378999999999994
85,-0.058845
86,0.33826
87,0.7471899999999999
88,1.1049
89,1.3857
90,1.5602
91,1.6045
92,1.5361
93,1.3424
94,1.0423
95,0.66166
96,0.21824000000000002
97,-0.21535
98,-0.6066699999999999
99,-0.8938799999999999
100,-1.0427
101,-1.0606
102,-0.95183
103,-0.76894
104,-0.5696100000000001
105,-0.39604
106,-0.2858
107,-0.24289000000000002
108,-0.26361999999999997
109,-0.30217
110,-0.32646
111,-0.31933
112,-0.26323
113,-0.16374
114,-0.02678
115,0.13114
116,0.31018
117,0.50693
118,0.71951
119,0.93839
120,1.1512
121,1.3079
122,1.3708
123,1.3088
124,1.0865
125,0.7054600000000001
126,0.19627999999999998
127,-0.38437
128,-0.96449
129,-1.4775
130,-1.8583
131,-2.0634
132,-2.0817
133,-1.9136
134,-1.5905
135,-1.1459
136,-0.62133
137,-0.059252
138,0.49256000000000005
139,1.0012
140,1.4338
141,1.7512
142,1.9474
143,2.0112
144,1.9411
145,1.7567
146,1.4759
147,1.1172
148,0.70333
149,0.24428000000000002
150,-0.23865
151,-0.72924
152,-1.1977
153,-1.6155
154,-1.9487
155,-2.1686
156,-2.2430000000000003
157,-2.1677
158,-1.9337
159,-1.5564
160,-1.0738
161,-0.5139600000000001
162,0.075254
163,0.65415
164,1.1849
165,1.6277
166,1.9561
167,2.1411
168,2.1741
169,2.0457
170,1.7717
171,1.3811
172,0.9147799999999999
173,0.42516000000000004
174,-0.041144
175,-0.43378
176,-0.73034
177,-0.92099
178,-1.0158
179,-1.0401
180,-1.0234
181,-0.9921700000000001
182,-0.96865
183,-0.96819
184,-0.98225
185,-0.99118
186,-0.9789100000000001
187,-0.91964
188,-0.8074899999999999
189,-0.61465
190,-0.34584000000000004
191,-0.00098047
192,0.40081999999999995
193,0.8289
194,1.2426
195,1.5979
196,1.8546
197,1.976
198,1.9380000000000002
199,1.7405
200,1.3895
201,0.92225
202,0.37786
203,-0.1934
204,-0.74867
205,-1.2469
206,-1.6489
207,-1.9319
208,-2.0715
209,-2.0527
210,-1.8841
211,-1.5746
212,-1.1436
213,-0.6257199999999999
214,-0.066874
215,0.49454
216,0.99876
217,1.4169
218,1.7153
219,1.8741
220,1.8922
221,1.7743
222,1.5490000000000002
223,1.2346
224,0.86321
225,0.45399999999999996
226,0.035323
227,-0.38255
228,-0.7856
229,-1.1548
230,-1.4625
231,-1.6872
232,-1.8061
233,-1.8001
234,-1.6704
235,-1.4155
236,-1.0565
237,-0.62368
238,-0.15088
239,0.32897
240,0.7781399999999999
241,1.1679
242,1.4835
243,1.7019
244,1.8043
245,1.7889
246,1.6528
247,1.4014
248,1.0511
249,0.63513
250,0.1951
251,-0.24131
252,-0.6328
253,-0.9575600000000001
254,-1.2044
255,-1.3753
256,-1.4648
257,-1.4809
258,-1.4258
259,-1.2958
260,-1.0952
261,-0.8282700000000001
262,-0.51689
263,-0.18052
264,0.14658
265,0.42591999999999997
266,0.64093
267,0.78473
268,0.8644200000000001
269,0.89339
270,0.89866
271,0.90004
272,0.90581
273,0.9112600000000001
274,0.90579
275,0.86835
276,0.77777
277,0.6381
278,0.44492
279,0.20823000000000003
280,-0.059377
281,-0.33953
282,-0.62183
283,-0.89189
284,-1.127
285,-1.3166
286,-1.4396
287,-1.4757
288,-1.4111
289,-1.2397
290,-0.9726600000000001
291,-0.61893
292,-0.21328000000000003
293,0.21428000000000003
294,0.62597
295,0.98935
296,1.2725
297,1.4456
298,1.496
299,1.4156
300,1.2238
301,0.94357
302,0.61127
303,0.26731
304,-0.055799
305,-0.32845
306,-0.54196
307,-0.69639
308,-0.79748
309,-0.8544799999999999
310,-0.87297
311,-0.8426100000000001
312,-0.76281
313,-0.63826
314,-0.47058999999999995
315,-0.26896
316,-0.064276
317,0.1288
318,0.2844
319,0.39418000000000003
320,0.45521999999999996
321,0.48373
322,0.47931
323,0.45521000000000006
324,0.4153
325,0.35633000000000004
326,0.27894
327,0.18204
328,0.066896
329,-0.053827
330,-0.16760999999999998
331,-0.26316
332,-0.32549
333,-0.34726
334,-0.3288
335,-0.26361
336,-0.16713
337,-0.043253
338,0.09891799999999999
339,0.24925
340,0.38502
341,0.49282
342,0.55197
343,0.5425300000000001
344,0.45337
345,0.29573
346,0.079555
347,-0.17577
348,-0.43648000000000003
349,-0.6785899999999999
350,-0.8754200000000001
351,-1.0170000000000001
352,-1.0914
353,-1.0923
354,-1.0124
355,-0.84116
356,-0.57449
357,-0.22038000000000002
358,0.19093
359,0.62649
360,1.0265
361,1.3361
362,1.5188
363,1.5533
364,1.4451
365,1.2145
366,0.91675
367,0.5814699999999999
368,0.23878000000000002
369,-0.089147
370,-0.39366
371,-0.6620199999999999
372,-0.8856799999999999
373,-1.0476
374,-1.1293
375,-1.1202
376,-1.0153
377,-0.8336100000000001
378,-0.61156
379,-0.38026
380,-0.1706
381,-0.0070631
382,0.11445
383,0.20724
384,0.29567
385,0.39515
386,0.5104
387,0.6289600000000001
388,0.7199399999999999
389,0.75461
390,0.71554
391,0.59739
392,0.41416000000000003
393,0.19996
394,-0.013993
395,-0.20256
396,-0.35318
397,-0.46693999999999997
398,-0.54514
399,-0.5954699999999999
400,-0.61836
401,-0.6097
402,-0.5554899999999999
403,-0.45124
404,-0.30383000000000004
405,-0.12407
406,0.053637
407,0.21044000000000002
408,0.32106999999999997
409,0.38081
410,0.39479000000000003
411,0.38679
412,0.37051
413,0.36504000000000003
414,0.37335
415,0.38452
416,0.38211
417,0.34892
418,0.28054
419,0.17898
420,0.054405999999999996
421,-0.06879099999999999
422,-0.18545
423,-0.27188
424,-0.33244
425,-0.36215
426,-0.36984
427,-0.35725
428,-0.32556
429,-0.27373000000000003
430,-0.22123
431,-0.175
432,-0.15761
433,-0.18884
434,-0.27021999999999996
435,-0.38977
436,-0.515
437,-0.60692
438,-0.61697
439,-0.51537
440,-0.30001
441,0.025664
442,0.41725
443,0.83031
444,1.2068
445,1.5061
446,1.6879
447,1.7252
448,1.6168
449,1.3626
450,0.98155
451,0.48888000000000004
452,-0.07173099999999999
453,-0.64636
454,-1.1802
455,-1.621
456,-1.923
457,-2.0519
458,-2.0045
459,-1.7885
460,-1.4372
461,-0.9910399999999999
462,-0.49266000000000004
463,0.011269
464,0.47708
465,0.87172
466,1.1717
467,1.3496
468,1.4054
469,1.3508
470,1.2098
471,1.0171
472,0.80065
473,0.58975
474,0.39497
475,0.21456999999999998
476,0.035345999999999995
477,-0.15639
478,-0.37524
479,-0.61285
480,-0.84859
481,-1.0526
482,-1.1724
483,-1.1795
484,-1.0506
485,-0.79591
486,-0.4453
487,-0.049615
488,0.33565
489,0.66103
490,0.8886299999999999
491,1.0008
492,0.99811
493,0.9089
494,0.75256
495,0.5551
496,0.33214
497,0.11073
498,-0.10054
499,-0.29366
