time,value
0,-0.53127
1,-0.53127
2,-0.53127
3,-0.53127
4,-0.53127
5,-0.53127
6,-0.53127
7,-0.53127
8,-0.53127
9,-0.53127
10,-0.53127
11,-0.53127
12,-0.53127
13,-0.53127
14,-0.53127
15,-0.53127
16,-0.53127
17,-0.53127
18,-0.53127
19,-0.53127
20,-0.30987
21,2.4208
22,2.1256
23,2.1256
24,1.8304
25,1.8304
26,1.8304
27,1.8304
28,-0.23606
29,-0.45747
30,-0.53127
31,-0.53127
32,-0.53127
33,-0.53127
34,-0.53127
35,-0.53127
36,-0.53127
37,-0.53127
38,-0.53127
39,-0.53127
40,-0.53127
41,-0.53127
42,-0.53127
43,-0.53127
44,-0.53127
45,-0.53127
46,-0.53127
47,-0.53127
48,-0.53127
49,-0.53127
50,-0.53127
51,-0.53127
52,-0.53127
53,-0.53127
54,2.1256
55,2.4208
56,1.8304
57,1.8304
58,1.8304
59,1.8304
60,1.8304
61,0.35435
62,-0.53127
63,-0.53127
64,-0.53127
65,-0.53127
66,-0.53127
67,-0.53127
68,-0.53127
69,-0.53127
70,-0.53127
71,-0.53127
72,-0.53127
73,-0.53127
74,-0.53127
75,-0.53127
76,-0.53127
77,-0.53127
78,-0.53127
79,-0.53127
80,-0.53127
81,-0.53127
82,-0.53127
83,-0.53127
84,-0.53127
85,-0.53127
86,-0.53127
87,1.0186
88,2.4208
89,2.1256
90,1.8304
91,1.8304
92,1.8304
93,1.8304
94,0.059144
95,-0.53127
96,-0.53127
97,-0.53127
98,-0.53127
99,-0.53127
100,-0.53127
101,-0.53127
102,-0.53127
103,-0.53127
104,-0.53127
105,-0.53127
106,-0.53127
107,-0.53127
108,-0.53127
109,-0.53127
110,-0.53127
111,-0.53127
112,-0.53127
113,-0.53127
114,-0.53127
115,-0.53127
116,-0.53127
117,-0.53127
118,-0.53127
119,0.35435
120,2.4208
121,2.1256
122,2.1256
123,1.8304
124,1.8304
125,1.8304
126,-0.08846
127,-0.45747
128,-0.53127
129,-0.53127
130,-0.53127
131,-0.53127
132,-0.53127
133,-0.53127
134,-0.53127
135,-0.53127
136,-0.53127
137,-0.53127
138,-0.53127
139,-0.53127
140,-0.53127
141,-0.53127
142,-0.53127
143,-0.53127
144,-0.53127
145,-0.53127
146,-0.53127
147,-0.53127
148,-0.53127
149,-0.53127
150,-0.53127
151,0.35435
152,2.4208
153,2.1256
154,2.1256
155,1.8304
156,1.8304
157,1.8304
158,-0.30987
159,-0.53127
160,-0.53127
161,-0.53127
162,-0.53127
163,-0.53127
164,-0.53127
165,-0.53127
166,-0.53127
167,-0.53127
168,-0.53127
169,-0.53127
170,-0.53127
171,-0.53127
172,-0.53127
173,-0.53127
174,-0.53127
175,-0.53127
176,-0.53127
177,-0.53127
178,-0.53127
179,-0.53127
180,-0.53127
181,-0.53127
182,-0.53127
183,0.57576
184,2.4208
185,2.1256
186,1.8304
187,1.8304
188,1.8304
189,0.7971699999999999
190,-0.53127
191,-0.53127
192,-0.53127
193,-0.53127
194,-0.53127
195,-0.53127
196,-0.53127
197,-0.53127
198,-0.53127
199,-0.53127
200,-0.53127
201,-0.53127
202,-0.53127
203,-0.53127
204,-0.53127
205,-0.53127
206,-0.53127
207,-0.53127
208,-0.53127
209,-0.53127
210,-0.53127
211,-0.53127
212,-0.53127
213,-0.53127
214,1.0186
215,2.4208
216,2.1256
217,1.8304
218,1.8304
219,1.8304
220,0.35435
221,-0.38366999999999996
222,-0.53127
223,-0.53127
224,-0.53127
225,-0.53127
226,-0.53127
227,-0.53127
228,-0.53127
229,-0.53127
230,-0.53127
231,-0.53127
232,-0.53127
233,-0.53127
234,-0.53127
235,-0.53127
236,-0.53127
237,-0.53127
238,-0.53127
239,-0.53127
240,-0.53127
241,-0.53127
242,-0.53127
243,-0.53127
244,-0.53127
245,1.0186
246,2.4208
247,2.1256
248,1.8304
249,1.8304
250,1.8304
251,0.7971699999999999
252,-0.38366999999999996
253,-0.53127
254,-0.45747
255,-0.53127
256,-0.53127
257,-0.53127
258,-0.53127
259,-0.53127
260,-0.53127
261,-0.53127
262,-0.53127
263,-0.53127
264,-0.53127
265,-0.53127
266,-0.53127
267,-0.53127
268,-0.53127
269,-0.53127
270,-0.53127
271,-0.53127
272,1.8304
273,2.4208
274,1.8304
275,1.8304
276,1.8304
277,1.8304
278,1.5352
279,-0.30987
280,-0.53127
281,-0.53127
282,-0.53127
283,-0.53127
284,-0.53127
285,-0.53127
286,-0.53127
287,-0.53127
288,-0.53127
289,-0.53127
290,-0.53127
291,-0.53127
292,-0.53127
293,-0.53127
294,-0.53127
295,-0.53127
296,-0.53127
297,-0.53127
298,-0.53127
299,-0.53127
300,-0.53127
301,-0.53127
302,-0.53127
303,-0.53127
304,1.0186
305,2.4208
306,1.8304
307,2.1256
308,1.8304
309,1.8304
310,1.0186
311,-0.45747
312,-0.53127
313,-0.53127
314,-0.53127
315,-0.53127
316,-0.53127
317,-0.53127
318,-0.53127
319,-0.53127
320,-0.53127
321,-0.53127
322,-0.53127
323,-0.53127
324,-0.53127
325,-0.53127
326,-0.53127
327,-0.53127
328,-0.53127
329,-0.53127
330,-0.53127
331,-0.53127
332,-0.53127
333,-0.53127
334,-0.53127
335,-0.53127
336,2.1256
337,2.1256
338,2.1256
339,1.8304
340,1.8304
341,1.8304
342,-0.38366999999999996
343,-0.53127
344,-0.53127
345,-0.53127
346,-0.53127
347,-0.53127
348,-0.53127
349,-0.53127
350,-0.53127
351,-0.53127
352,-0.53127
353,-0.53127
354,-0.53127
355,-0.53127
356,-0.53127
357,-0.53127
358,-0.53127
359,-0.53127
360,-0.53127
361,-0.53127
362,-0.53127
363,-0.53127
364,-0.53127
365,-0.53127
366,-0.53127
367,2.4208
368,2.1256
369,2.1256
370,1.8304
371,1.8304
372,1.8304
373,-0.08846
374,-0.45747
375,-0.53127
376,-0.53127
377,-0.53127
378,-0.53127
379,-0.53127
380,-0.53127
381,-0.53127
382,-0.53127
383,-0.53127
384,-0.53127
385,-0.53127
386,-0.53127
387,-0.53127
388,-0.53127
389,-0.53127
390,-0.53127
391,-0.53127
392,-0.53127
393,-0.53127
394,-0.53127
395,-0.53127
396,-0.53127
397,-0.53127
398,1.8304
399,2.4208
400,1.8304
401,2.1256
402,1.8304
403,1.8304
404,-0.23606
405,-0.45747
406,-0.53127
407,-0.53127
408,-0.53127
409,-0.53127
410,-0.53127
411,-0.53127
412,-0.53127
413,-0.53127
414,-0.53127
415,-0.53127
416,-0.53127
417,-0.53127
418,-0.53127
419,-0.53127
420,-0.53127
421,-0.53127
422,-0.53127
423,-0.53127
424,-0.53127
425,-0.53127
426,-0.53127
427,-0.53127
428,0.57576
429,2.4208
430,2.1256
431,1.8304
432,2.1256
433,1.8304
434,1.8304
435,0.35435
436,-0.53127
437,-0.53127
438,-0.53127
439,-0.53127
440,-0.53127
441,-0.53127
442,-0.53127
443,-0.53127
444,-0.53127
445,-0.53127
446,-0.53127
447,-0.53127
448,-0.53127
449,-0.53127
450,-0.53127
451,-0.53127
452,-0.53127
453,-0.53127
454,-0.53127
455,-0.53127
456,-0.53127
457,-0.53127
458,-0.53127
459,0.059144
460,2.4208
461,2.1256
462,2.1256
463,1.8304
464,1.8304
465,1.8304
466,1.8304
467,1.0186
468,-0.45747
469,-0.53127
470,-0.53127
471,-0.53127
472,-0.53127
473,-0.53127
474,-0.53127
475,-0.53127
476,-0.53127
477,-0.53127
478,-0.53127
479,-0.53127
480,-0.53127
481,-0.53127
482,-0.53127
483,-0.53127
484,-0.53127
485,-0.53127
486,-0.53127
487,-0.53127
488,-0.53127
489,-0.53127
490,-0.53127
491,-0.53127
492,0.7971699999999999
493,2.4208
494,1.8304
495,2.1256
496,1.8304
497,1.8304
498,1.8304
499,1.5352
500,1.8304
501,1.8304
502,0.059144
503,-0.45747
504,-0.53127
505,-0.53127
506,-0.53127
507,-0.53127
508,-0.53127
509,-0.53127
510,-0.53127
511,-0.53127
512,-0.53127
513,-0.53127
514,-0.53127
515,-0.53127
516,-0.53127
517,-0.53127
518,-0.53127
519,-0.53127
520,-0.53127
521,-0.53127
522,-0.53127
523,-0.53127
524,-0.53127
525,-0.53127
526,-0.53127
527,-0.53127
528,-0.53127
529,2.4208
530,2.1256
531,1.8304
532,1.8304
533,1.8304
534,1.8304
535,1.8304
536,-0.30987
537,-0.53127
538,-0.53127
539,-0.53127
540,-0.53127
541,-0.53127
542,-0.53127
543,-0.53127
544,-0.53127
545,-0.53127
546,-0.53127
547,-0.53127
548,-0.53127
549,-0.53127
550,-0.53127
551,-0.53127
552,-0.53127
553,-0.53127
554,-0.53127
555,-0.53127
556,-0.53127
557,-0.53127
558,-0.53127
559,-0.53127
560,-0.53127
561,0.20675
562,2.4208
563,2.1256
564,2.1256
565,1.8304
566,1.8304
567,1.24
568,-0.45747
569,-0.53127
570,-0.53127
571,-0.53127
572,-0.53127
573,-0.53127
574,-0.53127
575,-0.53127
576,-0.53127
577,-0.53127
578,-0.53127
579,-0.53127
580,-0.53127
581,-0.53127
582,-0.53127
583,-0.53127
584,-0.53127
585,-0.53127
586,-0.53127
587,-0.53127
588,-0.53127
589,-0.53127
590,-0.53127
591,-0.53127
592,0.57576
593,2.4208
594,2.1256
595,1.8304
596,2.1256
597,1.5352
598,0.7971699999999999
599,-0.38366999999999996
600,-0.53127
601,-0.53127
602,-0.53127
603,-0.53127
604,-0.53127
605,-0.53127
606,-0.53127
607,-0.53127
608,-0.53127
609,-0.53127
610,-0.53127
611,-0.53127
612,-0.53127
613,-0.53127
614,-0.53127
615,-0.53127
616,-0.53127
617,-0.53127
618,-0.53127
619,-0.53127
620,1.8304
621,2.1256
622,2.1256
623,1.8304
624,1.8304
625,1.8304
626,0.35435
627,-0.53127
628,-0.53127
629,-0.53127
630,-0.53127
631,-0.53127
632,-0.53127
633,-0.53127
634,-0.53127
635,-0.53127
636,-0.53127
637,-0.53127
638,-0.53127
639,-0.53127
640,-0.53127
641,-0.53127
642,-0.53127
643,-0.53127
644,-0.53127
645,-0.53127
646,-0.53127
647,-0.53127
648,-0.53127
649,-0.53127
650,-0.53127
651,1.0186
652,2.4208
653,2.1256
654,1.8304
655,1.8304
656,1.8304
657,1.5352
658,-0.38366999999999996
659,-0.53127
660,-0.53127
661,-0.53127
662,-0.53127
663,-0.53127
664,-0.53127
665,-0.53127
666,-0.53127
667,-0.53127
668,-0.53127
669,-0.53127
670,-0.53127
671,-0.53127
672,-0.53127
673,-0.53127
674,-0.53127
675,-0.53127
676,-0.53127
677,-0.53127
678,-0.53127
679,-0.53127
680,-0.53127
681,-0.53127
682,-0.53127
683,1.24
684,2.4208
685,2.1256
686,1.8304
687,1.8304
688,1.8304
689,-0.53127
690,-0.53127
691,-0.53127
692,-0.53127
693,-0.53127
694,-0.53127
695,-0.53127
696,-0.53127
697,-0.53127
698,-0.53127
699,-0.53127
700,-0.53127
701,-0.53127
702,-0.53127
703,-0.53127
704,-0.53127
705,-0.53127
706,-0.53127
707,-0.53127
708,-0.53127
709,-0.53127
710,-0.53127
711,-0.53127
712,-0.53127
713,-0.23606
714,2.4208
715,2.4208
716,1.8304
717,1.8304
718,1.8304
719,-0.08846
