time,value
0,0.34876999999999997
1,1.5732
2,1.5732
3,1.5732
4,1.5732
5,1.5732
6,1.5732
7,1.5732
8,1.5732
9,1.5732
10,-1.5777
11,-1.5777
12,-1.5777
13,-1.5777
14,-1.5777
15,-1.5777
16,-1.5777
17,-1.5777
18,-0.0039537
19,-0.087123
20,-0.16608
21,-0.0045341
22,-0.28506
23,0.15800999999999998
24,0.33421
25,0.3231
26,0.18345999999999998
27,1.5732
28,1.5732
29,1.5732
30,1.5732
31,1.5732
32,1.5732
33,1.5732
34,1.5732
35,1.5732
36,1.5732
37,1.5732
38,1.5732
39,1.5732
40,1.5732
41,1.5732
42,1.5732
43,-1.5777
44,-1.5777
45,-1.5777
46,-1.5777
47,-1.5777
48,-1.5777
49,-1.5777
50,-1.5777
51,-1.5777
52,-1.5777
53,-1.5777
54,-1.5777
55,-1.5777
56,-1.5777
57,-1.5777
58,-0.5034
59,-0.14732
60,0.03046
61,-0.11429
62,-0.0085266
63,-0.24124
64,-0.06719800000000001
65,0.56862
66,0.24428000000000002
67,0.39433
68,-0.14978
69,-0.65522
70,-0.07295700000000001
71,0.054893
72,-0.25072
73,-0.096848
74,0.43503000000000003
75,-0.19773
76,-0.16573
77,0.36712
78,-0.025832
79,-0.24391999999999997
80,-0.30963
81,-0.054012
82,-0.6243
83,0.27043
84,-0.14706
85,-0.24891999999999997
86,0.23681999999999997
87,-0.4651
88,0.3064
89,0.21254
90,0.25905
91,-0.43443000000000004
92,-0.46195
93,-0.18008
94,0.37104000000000004
95,-0.62142
96,-0.28064
97,0.08869400000000001
98,-0.018928999999999998
99,-0.064816
100,-0.82895
101,-0.065419
102,0.19267
103,0.5958100000000001
104,-0.39400999999999997
105,0.6198600000000001
106,-0.1678
107,-0.28406
108,0.12401
109,-0.32045999999999997
110,0.38299
111,-0.045381
112,-0.13043
113,0.050989
114,0.058385
115,-0.14869000000000002
116,0.35234
117,-0.18505
118,0.10513
119,0.0064056
120,0.19885
121,-0.79762
122,-0.17051
123,0.22599
124,-0.42207
125,-0.24595999999999998
126,0.23283
127,0.22999
