time,value
0,-0.11662
1,-0.11662
2,-0.11662
3,-0.11662
4,-0.11662
5,-0.11662
6,-0.11662
7,-0.11662
8,-0.11662
9,-0.11662
10,-0.11662
11,-0.11662
12,-0.11662
13,-0.11662
14,-0.11662
15,-0.11662
16,-0.11662
17,-0.11662
18,-0.11547
19,-0.18147
20,0.12115999999999999
21,0.36673
22,0.14065999999999998
23,0.18517999999999998
24,0.19017
25,0.21156
26,0.25151
27,0.2991
28,0.34195
29,0.35943
30,0.36708
31,0.36708
32,0.38869000000000004
33,0.40836
34,0.41918
35,0.4005
36,0.36730999999999997
37,0.37813
38,0.40114
39,0.4436
40,0.45608000000000004
41,0.46392
42,0.51303
43,0.5394100000000001
44,0.54108
45,0.57786
46,0.61421
47,0.6242
48,0.64849
49,0.6834600000000001
50,0.70281
51,0.71559
52,0.71559
53,0.7006100000000001
54,0.67787
55,0.64707
56,0.6228600000000001
57,0.6087100000000001
58,0.57557
59,0.5413399999999999
60,0.5413399999999999
61,0.54215
62,0.54382
63,0.58601
64,0.62493
65,0.62742
66,0.62846
67,0.62846
68,0.59217
69,0.5504899999999999
70,0.50138
71,0.43198000000000003
72,0.3521
73,0.25387
74,0.16444
75,0.34826
76,0.34584000000000004
77,-0.16533
78,-0.3443
79,-0.45668000000000003
80,-0.08229
81,-0.12599000000000002
82,-0.17511
83,-0.22421999999999997
84,-0.27333
85,-0.32245
86,-0.37156
87,-0.42067
88,-0.46979
89,-0.49313999999999997
90,-0.5041899999999999
91,-0.5041899999999999
92,-0.5163300000000001
93,-0.54547
94,-0.5707
95,-0.59132
96,-0.59132
97,-0.58282
98,-0.56617
99,-0.53204
100,-0.5041899999999999
101,-0.5041899999999999
102,-0.50671
103,-0.5108699999999999
104,-0.55858
105,-0.59132
106,-0.59132
107,-0.6540600000000001
108,-0.74449
109,-0.8427100000000001
110,-0.98787
111,-1.196
112,-1.3566
113,-1.4926
114,-1.5625
115,-1.609
116,-1.6340000000000001
117,-1.6368
118,-1.6368
119,-1.6368
120,-1.6368
121,-1.6368
122,-1.6368
123,-1.6368
124,-1.6368
125,-1.6368
126,-1.6368
127,-1.6368
128,-1.6562
129,-1.7003
130,-1.7163
131,-1.7180000000000002
132,-1.6822
133,-1.6562
134,-1.6387
135,-1.6122
136,-1.5791
137,-1.53
138,-1.4689
139,-1.4007
140,-1.2879
141,-1.1588
142,-1.0006
143,-0.81018
144,-0.6037399999999999
145,-0.36067
146,-0.13848
147,0.19885999999999998
148,0.29298
149,0.52184
150,0.68084
151,0.81233
152,0.9205399999999999
153,1.0197
154,1.1096
155,1.177
156,1.2497
157,1.3255
158,1.4237
159,1.5219
160,1.6202
161,1.6874
162,1.7343
163,1.6952
164,1.6687
165,1.6569999999999998
166,1.5741
167,1.4759
168,1.3776
169,1.2794
170,1.1812
171,1.083
172,0.98474
173,0.8865200000000001
174,0.7882899999999999
175,0.69038
176,0.62212
177,0.5513600000000001
178,0.47644
179,0.40029000000000003
180,0.32656999999999997
181,0.27746
182,0.22834000000000002
183,0.17923
184,0.13012
185,0.31895
186,0.098357
187,-0.11662
188,-0.11662
189,-0.11662
190,-0.06492
191,-0.29384
192,-0.39711
193,-0.43378999999999995
194,-0.43378999999999995
195,-0.36962
196,-0.20314000000000002
197,-0.08659800000000001
198,-0.021240000000000002
199,0.14102
200,0.22399999999999998
201,0.26145999999999997
202,0.13035
203,-0.20332999999999998
204,-0.07359199999999999
205,-0.2171
206,-0.42103999999999997
207,-0.43378999999999995
208,-0.43378999999999995
209,-0.43378999999999995
210,-0.43378999999999995
211,-0.44081000000000004
212,-0.11490999999999998
213,-0.16151
214,-0.21061999999999997
215,-0.25974
216,-0.30885
217,-0.35796
218,-0.36551
219,-0.32971
220,-0.24059
221,-0.14236
222,-0.3117
223,0.1333
224,0.12727
225,0.16707
226,0.19517
227,0.20265999999999998
228,0.23833000000000001
229,0.28745
230,0.33655999999999997
231,0.38566999999999996
232,0.43478999999999995
233,0.4839
234,0.5276
235,0.53676
236,0.50554
237,0.43395
238,0.39403
239,0.37967
240,0.43461000000000005
241,0.48758
242,0.53919
243,0.5413399999999999
244,0.54618
245,0.56116
246,0.5996100000000001
247,0.64907
248,0.7048399999999999
249,0.7783
250,0.8765299999999999
251,0.97475
252,1.0661
253,1.1168
254,1.1889
255,1.2813
256,1.3788
257,1.4686
258,1.5319
259,1.6052
260,1.6851
261,1.757
262,1.8211
263,1.8702
264,1.9193
265,1.9675
266,2.0025
267,2.0225
268,2.0225
269,2.0133
270,1.9881
271,1.8899
272,1.7916
273,1.6934
274,1.5539
275,1.4191
276,1.3142
277,1.2134
278,1.1152
279,0.98351
280,0.84601
281,0.69867
282,0.53305
283,0.35662
284,0.13853
285,-0.083937
286,-0.31201999999999996
287,-0.52542
288,-0.73963
289,-0.97604
290,-1.1912
291,-1.3877
292,-1.5826
293,-1.7523
294,-1.8505
295,-1.9201
296,-1.9726
297,-1.9805
298,-1.9588
299,-1.8839
300,-1.8401
301,-1.8087
302,-1.7795
303,-1.7526
304,-1.7285
305,-1.724
306,-1.7269
307,-1.7436
308,-1.7643
309,-1.7884
310,-1.7537
311,-1.724
312,-1.724
313,-1.724
314,-1.724
315,0.44806
316,0.44806
317,0.44806
318,0.44806
319,0.44806
320,0.44806
321,0.44806
322,0.44806
323,0.44806
324,0.44806
325,0.44806
326,0.44806
327,0.44806
328,0.44806
329,0.44806
330,0.44806
331,0.44806
332,0.44806
333,0.44811999999999996
334,0.45437
335,0.49282
336,0.58494
337,0.6100800000000001
338,0.61148
339,0.61148
340,0.57635
341,0.50141
342,0.52405
343,0.5526
344,0.5260600000000001
345,0.46263000000000004
346,0.37051
347,0.27839
348,0.18627
349,0.37974
350,-0.053230999999999994
351,-0.30205
352,-0.30205
353,-0.32613000000000003
354,-0.38858000000000004
355,-0.12821
356,-0.20563
357,-0.20563
358,-0.24827
359,-0.33726999999999996
360,-0.3604
361,-0.35375999999999996
362,-0.28038
363,-0.2714
364,-0.31044
365,-0.34508
366,-0.38415
367,-0.43411000000000005
368,-0.48407
369,-0.5314
370,-0.49705
371,-0.45033999999999996
372,-0.38476
373,-0.34056
374,-0.28611
375,-0.11279000000000002
376,-0.091738
377,0.49668
378,0.2888
379,0.45391000000000004
380,0.55072
381,0.64479
382,0.7369100000000001
383,0.8290299999999999
384,0.8811399999999999
385,0.8452299999999999
386,0.8093199999999999
387,0.7749
388,0.7749
389,0.7749
390,0.7749
391,0.80018
392,0.83762
393,0.90476
394,0.9383299999999999
395,0.9383299999999999
396,0.9221299999999999
397,0.86582
398,0.68314
399,0.55423
400,0.46211
401,0.36999
402,0.27787
403,0.18575
404,0.37714000000000003
405,-0.0672
406,-0.21553000000000003
407,-0.087748
408,-0.19704000000000002
409,-0.2917
410,-0.36905
411,-0.36905
412,-0.36905
413,-0.36905
414,-0.38955
415,-0.42943000000000003
416,-0.52155
417,-0.60895
418,-0.69326
419,-0.6959
420,-0.7266
421,-0.81872
422,-0.9696899999999999
423,-1.1418
424,-1.2496
425,-1.4093
426,-1.6388
427,-1.7608
428,-1.8481
429,-1.9012
430,-1.9511
431,-1.9979
432,-1.9701
433,-1.9264
434,-1.8639
435,-1.8264
436,-1.8046
437,-1.7277
438,-1.6743
439,-1.6680000000000001
440,-1.601
441,-1.5221
442,-1.611
443,-1.6652
444,-1.6746
445,-1.6764
446,-1.6876
447,-1.7548
448,-1.8037
449,-1.8364
450,-1.8399
451,-1.8399
452,-1.8399
453,-1.8399
454,-1.8399
455,-1.8119999999999998
456,-1.7541
457,-1.6417
458,-1.4776
459,-1.2934
460,-1.1091
461,-0.9249
462,-0.74066
463,-0.62873
464,-0.53404
465,-0.44192
466,-0.38955
467,-0.37081
468,-0.36905
469,-0.36905
470,-0.36905
471,-0.36905
472,-0.36905
473,-0.36905
474,-0.35653
475,-0.32218
476,-0.28441
477,-0.25592
478,-0.3293
479,-0.37906999999999996
480,-0.40093
481,-0.55128
482,-0.6959
483,-0.6959
484,-0.7924399999999999
485,-0.96731
486,-1.0048
487,-1.0429
488,-1.1148
489,-1.117
490,-1.0811
491,-1.0452
492,-1.0227
493,-1.0227
494,-0.99272
495,-0.94676
496,-0.85464
497,-0.77423
498,-0.70709
499,-0.68158
500,-0.64958
501,-0.5574600000000001
502,-0.46534
503,-0.37322
504,-0.2811
505,-0.21402
506,-0.20778000000000002
507,-0.1544
508,-0.4712
509,-0.19960999999999998
510,0.13227
511,0.28685
512,0.42268999999999995
513,0.54799
514,0.6401100000000001
515,0.7135199999999999
516,0.76661
517,0.7749
518,0.7700199999999999
519,0.7466
520,0.68382
521,0.5917
522,0.49227
523,0.36687
524,0.18263
525,-0.099078
526,-0.18585
527,-0.37009000000000003
528,-0.55433
529,-0.73857
530,-0.8705700000000001
531,-0.9755799999999999
532,-1.0068
533,-0.99675
534,-0.9436700000000001
535,-0.85724
536,-0.75692
537,-0.62733
538,-0.50047
539,-0.37556
540,-0.32761
541,-0.24875999999999998
542,-0.092627
543,-0.30205
544,-0.30205
545,-0.30205
546,-0.30205
547,-0.30205
548,-0.30205
549,-0.3528
550,-0.1273
551,-0.1437
552,-0.10153999999999999
553,-0.42843000000000003
554,-0.36109
555,-0.10554000000000001
556,-0.15521
557,-0.20360999999999999
558,-0.20563
559,-0.20563
560,-0.20563
561,-0.20563
562,-0.20498000000000002
563,-0.19249000000000002
564,-0.14877
565,-0.39769
566,-0.30205
567,-0.17227
568,0.16174000000000002
569,0.30149000000000004
570,0.40454
571,0.43381000000000003
572,0.46376999999999996
573,0.52935
574,0.57606
575,0.61041
576,0.65988
577,0.7239
578,0.81602
579,0.93211
580,1.0605
581,1.2182
582,1.3479
583,1.44
584,1.5235
585,1.5925
586,1.5956
587,1.6451
588,1.7372
589,1.7519
590,1.7554
591,1.7554
592,1.7996
593,1.8714
594,1.9004
595,1.9382
596,1.9944
597,2.0418
598,2.0823
599,2.0823
600,2.0823
601,2.0823
602,2.0622
603,2.0232
604,1.9139
605,1.7648
606,1.5806
607,1.3977
608,1.2386
609,1.1465
610,1.0544
611,0.9622700000000001
612,1.0247
613,1.0986
614,1.1907
615,1.2829
616,1.375
617,1.4671
618,1.5382
619,1.5835
620,1.6237
621,1.6666
622,1.7275
623,1.7428
624,1.7193
625,1.6337
626,1.5415
627,1.4494
628,1.3573
629,1.2652
630,-0.12977
631,-0.12977
632,-0.12977
633,-0.12977
634,-0.12977
635,-0.12699000000000002
636,-0.097354
637,-0.46666
638,-0.39932
639,-0.38739
640,-0.38739
641,-0.38739
642,-0.38739
643,-0.38739
644,-0.38739
645,-0.38739
646,-0.38739
647,-0.38739
648,-0.38725
649,-0.37378
650,-0.29086
651,-0.092189
652,0.10647999999999999
653,0.30516
654,0.50383
655,0.1587
656,0.19844
657,0.23817
658,0.27791
659,0.31764000000000003
660,0.35738000000000003
661,0.39711
662,0.45433
663,0.5190100000000001
664,0.59848
665,0.67795
666,0.75741
667,0.83688
668,0.91843
669,1.0033
670,1.1124
671,1.2252
672,1.3047
673,1.3842
674,1.4637
675,1.5431
676,1.6159999999999999
677,1.6638
678,1.7069999999999999
679,1.7467
680,1.7631
681,1.78
682,1.8015
683,1.8231
684,1.8439
685,1.8439
686,1.8439
687,1.8439
688,1.8378
689,1.8252
690,1.7807
691,1.7191
692,1.6397
693,1.5602
694,1.4725
695,1.3553
696,1.2169
697,1.0633
698,0.93405
699,0.79157
700,0.6171399999999999
701,0.45912
702,0.30935999999999997
703,0.16927999999999999
704,0.21943000000000001
705,-0.11277000000000001
706,-0.25887
707,-0.41038
708,-0.5875
709,-0.74307
710,-0.8770899999999999
711,-1.0635
712,-1.25
713,-1.4089
714,-1.5678
715,-1.7268
716,-1.8147
717,-1.8978
718,-1.9773
719,-2.0151
720,-2.0316
721,-2.0046
722,-1.9724
723,-1.9326
724,-1.8929
725,-1.8507
726,-1.7941
727,-1.7328
728,-1.6668
729,-1.6149
730,-1.5596
731,-1.4868
732,-1.432
733,-1.3889
734,-1.3106
735,-1.2311
736,-1.1516
737,-1.0468
738,-0.9328
739,-0.8466
740,-0.7379600000000001
741,-0.59923
742,-0.48608
743,-0.38745999999999997
744,-0.33089
745,-0.28309
746,-0.24336
747,-0.18930999999999998
748,-0.13392
749,-0.08004
750,-0.38739
751,-0.38739
752,-0.38739
753,-0.38739
754,-0.38739
755,-0.38739
756,-0.40163000000000004
757,-0.10117999999999999
758,-0.12492
759,-0.12897
760,-0.12977
761,-0.12977
762,-0.12977
763,-0.11617000000000001
764,-0.09057799999999999
765,-0.09213500000000001
766,-0.10106
767,-0.12194
768,-0.12007999999999999
769,-0.10459
770,-0.07710800000000001
771,-0.4029
772,-0.44666999999999996
773,-0.094408
774,-0.11780999999999998
775,-0.080097
776,-0.38739
777,-0.38739
778,-0.38739
779,-0.38739
780,-0.38739
781,-0.38739
782,-0.38739
783,-0.25922
784,-0.10228999999999999
785,0.09638200000000001
786,0.15812
787,0.14128
788,0.09456200000000001
789,-0.061952999999999994
790,-0.13602999999999998
791,-0.30096
792,-0.081724
793,-0.12145999999999998
794,-0.16119
795,-0.20093
796,-0.23955
797,-0.27074000000000004
798,-0.27074000000000004
799,-0.29157
800,-0.32928
801,-0.33736
802,-0.35866
803,-0.42062
804,-0.47605
805,-0.52778
806,-0.56752
807,-0.59942
808,-0.61828
809,-0.6361399999999999
810,-0.6559699999999999
811,-0.6957
812,-0.74049
813,-0.7909999999999999
814,-0.8594700000000001
815,-0.9251299999999999
816,-0.96486
817,-1.0046
818,-1.0443
819,-1.0841
820,-1.1238
821,-1.1635
822,-1.2033
823,-1.2424
824,-1.2518
825,-1.268
826,-1.2949
827,-1.3138
828,-1.3304
829,-1.3506
830,-1.3802
831,-1.4199
832,-1.4483
833,-1.4691
834,-1.4691
835,-1.4652
836,-1.4585
837,-1.4176
838,-1.3636
839,-1.2841
840,-1.2046
841,-1.1229
842,-0.97067
843,-0.80274
844,-0.6108
845,-0.43628
846,-0.26193
847,-0.34334000000000003
848,0.17419
849,0.4126
850,0.6510100000000001
851,0.8858799999999999
852,1.1081
853,1.3092
854,1.495
855,1.6375
856,1.7605
857,1.8461
858,1.9526
859,2.0675
860,2.147
861,2.2106
862,2.251
863,2.2634
864,2.2537
865,2.1568
866,2.0776
867,2.0163
868,1.9294
869,1.8319999999999999
870,1.7128
871,1.5936
872,1.4744
873,1.3552
874,1.236
875,1.1168
876,1.0036
877,0.8948
878,0.81533
879,0.7358600000000001
880,0.6563899999999999
881,0.57693
882,0.49186
883,0.374
884,0.25545999999999996
885,0.13625
886,0.13272
887,-0.29535
888,-0.12034
889,-0.19981
890,-0.27926999999999996
891,-0.33787
892,-0.38971999999999996
893,-0.42946000000000006
894,-0.46918999999999994
895,-0.50893
896,-0.54866
897,-0.58494
898,-0.6166
899,-0.6231899999999999
900,-0.62298
901,-0.62163
902,-0.60029
903,-0.5605600000000001
904,-0.52082
905,-0.48108999999999996
906,-0.44136000000000003
907,-0.40162
908,-0.36189
909,-0.32215
910,-0.28242
911,-0.24268
912,-0.18816
913,-0.12617
914,-0.32454
915,0.072811
916,0.47016
917,0.1917
918,0.27241
919,0.35928000000000004
920,0.46119
921,0.57635
922,0.65954
923,0.7390100000000001
924,0.81848
925,0.85164
926,0.85703
927,0.85709
928,0.83562
929,0.7750100000000001
930,0.68148
931,0.57597
932,0.48034
933,0.41005
934,0.37099
935,0.36366
936,0.36605
937,0.37951999999999997
938,0.40174
939,0.43137
940,0.44025
941,0.4541
942,0.4871
943,0.47389
944,0.43415
