time,value
0,-1.2309999999999999
1,6.946000000000001
2,-0.7158100000000001
3,-0.9768
4,-0.7839
5,-0.92007
6,-0.77255
7,-0.60233
8,-0.58645
9,1.2496
10,1.4584
11,1.6717
12,1.6899
13,1.531
14,1.7693
15,1.9826
16,0.5483
17,0.61639
18,0.3622
19,0.37809
20,0.0013525
21,0.069438
22,-0.066733
23,0.1988
24,0.1693
25,-0.005456
26,-0.16885999999999998
27,-0.23695
28,-0.40035
29,-0.32092
30,-0.51836
31,-0.38219000000000003
32,-0.40489
33,-0.55921
34,-0.5138199999999999
35,-0.6431899999999999
36,-0.5978
37,-0.47297
38,-0.58645
39,-0.42758
40,-0.44573999999999997
41,-0.5751
42,-0.50248
43,-0.31638
44,-0.19155999999999998
45,0.16476
46,0.23284000000000002
47,0.69582
48,0.67313
49,0.44616999999999996
50,0.46887
51,0.26008000000000003
52,0.70036
53,0.54376
54,0.50972
55,0.67313
56,0.66178
57,0.5029100000000001
58,0.70717
59,0.93185
60,0.77525
61,0.77979
62,0.6549699999999999
63,0.74121
64,0.57781
65,0.51426
66,0.27823000000000003
67,0.12618
68,-0.19155999999999998
69,-0.23695
70,-0.36630999999999997
71,-0.49113
72,-0.24148000000000003
73,-0.51836
74,-0.47978000000000004
75,-0.60233
76,-0.33226
77,-0.66588
78,-0.45708999999999994
79,-0.52517
80,-0.68177
81,-0.53652
82,-0.5138199999999999
83,-0.6590699999999999
84,-0.45028
85,-0.6431899999999999
86,-0.48432
87,-0.74531
88,-0.7158100000000001
89,-0.53652
90,-0.68858
91,-0.68177
92,-0.55921
93,-0.69312
94,-0.63184
95,-0.74985
96,-0.96546
97,-1.0835
98,-1.2083
