time,value
0,0.30417
1,0.30417
2,0.30417
3,0.30417
4,0.30417
5,0.30417
6,0.30417
7,0.30417
8,0.30417
9,0.30417
10,0.30417
11,0.30417
12,0.30417
13,0.30417
14,0.30417
15,0.30417
16,0.30417
17,0.30417
18,0.30417
19,0.29275
20,0.27842
21,0.24525999999999998
22,0.19485
23,0.15477
24,0.14628
25,0.13779
26,0.13754
27,0.13754
28,0.13754
29,0.13754
30,0.13754
31,0.13754
32,0.13754
33,0.13754
34,0.13754
35,0.13662
36,0.13555999999999999
37,0.10517
38,0.27301
39,0.24006999999999998
40,-0.16813
41,-0.37128
42,-0.10965
43,-0.14520999999999998
44,-0.19218
45,-0.24259
46,-0.28751
47,-0.32678
48,-0.36559
49,-0.40273000000000003
50,-0.43988
51,-0.48951999999999996
52,-0.53993
53,-0.58185
54,-0.61953
55,-0.65963
56,-0.7035
57,-0.75007
58,-0.81729
59,-0.88451
60,-0.9276399999999999
61,-0.9662
62,-1.002
63,-1.0356
64,-1.0692
65,-1.1028
66,-1.1364
67,-1.17
68,-1.2036
69,-1.2311
70,-1.2564
71,-1.2767
72,-1.2914
73,-1.297
74,-1.2634
75,-1.2298
76,-1.1962
77,-1.1626
78,-1.1304
79,-1.0991
80,-1.0731
81,-1.0563
82,-1.0405
83,-1.0352
84,-1.0298
85,-1.0288
86,-1.0288
87,-1.0288
88,-1.0288
89,-1.0288
90,-1.0288
91,-1.0288
92,-1.0234
93,-1.018
94,-1.0044
95,-0.9876299999999999
96,-0.97083
97,-0.9540200000000001
98,-0.93609
99,-0.9122100000000001
100,-0.88833
101,-0.85585
102,-0.82224
103,-0.78863
104,-0.75503
105,-0.7156399999999999
106,-0.6647
107,-0.61275
108,-0.54447
109,-0.47618999999999995
110,-0.39559
111,-0.31156999999999996
112,-0.23795999999999998
113,-0.17446
114,-0.11460999999999999
115,-0.33502
116,-0.096221
117,0.074898
118,0.24294000000000002
119,0.41098
120,0.11596
121,0.14612
122,0.17124
123,0.19308
124,0.19308
125,0.19308
126,0.19308
127,0.19308
128,0.19647
129,0.2023
130,0.21148000000000003
131,0.22828
132,0.24552
133,0.27736
134,0.3092
135,0.34797
136,0.38900999999999997
137,0.43453
138,0.48494
139,0.53873
140,0.60577
141,0.67281
142,0.73165
143,0.78984
144,0.84204
145,0.8910299999999999
146,0.9342299999999999
147,0.9678399999999999
148,0.9993
149,1.0117
150,1.0241
151,1.0262
152,1.0262
153,1.0262
154,1.0262
155,1.0229
156,1.0106
157,0.99844
158,0.98164
159,0.96483
160,0.9480299999999999
161,0.9312299999999999
162,0.9206200000000001
163,0.91761
164,0.9172799999999999
165,0.92966
166,0.94205
167,0.9735
168,1.0071
169,1.0407
170,1.0743
171,1.1106
172,1.1520000000000001
173,1.1941
174,1.2447
175,1.2953
176,1.3591
177,1.4263
178,1.4838
179,1.5322
180,1.5762
181,1.6062
182,1.6363
183,1.6372
184,1.6372
185,1.6372
186,1.6372
187,1.6344
188,1.6276
189,1.617
190,1.5834
191,1.5498
192,1.5271
193,1.5061
194,1.4905
195,1.4786
196,1.4706
197,1.4706
198,1.4706
199,1.4706
200,1.4706
201,1.4756
202,1.4821
203,1.4937
204,1.5105
205,1.5273
206,1.5441
207,1.5609
208,1.5701
209,1.5787
210,1.5813
211,1.5808
212,1.5739
213,1.557
214,1.538
215,1.5017
216,1.4655
217,1.4173
218,1.3669
219,1.3165
220,1.2661
221,1.2124
222,1.1506
223,1.0886
224,1.0065
225,0.9244700000000001
226,0.80369
227,0.6692600000000001
228,0.55878
229,0.47600000000000003
230,0.39715
231,0.33524
232,0.27333
233,0.22191
234,0.1715
235,0.11184000000000001
236,0.23384000000000002
237,-0.10740999999999999
238,-0.47798999999999997
239,-0.17042000000000002
240,-0.25444
241,-0.33846
242,-0.43554
243,-0.53566
244,-0.6361600000000001
245,-0.73698
246,-0.8375799999999999
247,-0.93752
248,-1.0375
249,-1.1217
250,-1.2057
251,-1.2826
252,-1.3565
253,-1.4265
254,-1.4912
255,-1.5537
256,-1.6041
257,-1.6545
258,-1.7049
259,-1.7553
260,-1.8033
261,-1.8496
262,-1.8917
263,-1.9253
264,-1.9566
265,-1.9504
266,-1.9442
267,-1.9342
268,-1.923
269,-1.9175
270,-1.9175
271,-1.9037
272,-1.8443
273,-1.7849
274,-1.7249
275,-1.665
276,-1.6115
277,-1.5611
278,-1.4907
279,-1.3909
280,-1.2921
281,-1.2002
282,-1.1082
283,-1.023
284,-0.93899
285,-0.8549700000000001
286,-0.77095
287,-0.6901
288,-0.61652
289,-0.54328
290,-0.48172
291,-0.42017
292,-0.37967
293,-0.34607
294,-0.30095
295,-0.24329
296,-0.18548
297,-0.12711
298,-0.34445
299,-0.16744
300,0.16476
301,0.16865
302,0.33669
303,0.4934
304,0.12643
305,0.15292999999999998
306,0.16973
307,0.18654
308,0.21591
309,0.24791999999999997
310,0.27663000000000004
311,0.30263
312,0.3261
313,0.3429
314,0.35971
315,-0.45202
316,-0.45202
317,-0.45202
318,-0.45202
319,-0.45202
320,-0.45202
321,-0.45202
322,-0.45202
323,-0.45202
324,-0.45202
325,-0.45202
326,-0.45202
327,-0.45202
328,-0.45202
329,-0.45202
330,-0.45202
331,-0.45202
332,-0.45202
333,-0.45202
334,-0.46738
335,-0.48665
336,-0.53123
337,-0.5990300000000001
338,-0.65293
339,-0.66435
340,-0.67577
341,-0.6761
342,-0.6761
343,-0.6761
344,-0.6761
345,-0.6761
346,-0.6761
347,-0.6761
348,-0.6761
349,-0.6761
350,-0.6761
351,-0.6761
352,-0.6761
353,-0.6761
354,-0.6761
355,-0.6761
356,-0.67576
357,-0.66791
358,-0.6600600000000001
359,-0.60616
360,-0.53837
361,-0.49273
362,-0.46989
363,-0.45511999999999997
364,-0.46939
365,-0.48367
366,-0.5483600000000001
367,-0.61616
368,-0.68395
369,-0.75175
370,-0.8195399999999999
371,-0.88734
372,-0.9551299999999999
373,-1.0229
374,-1.0907
375,-1.1585
376,-1.2263
377,-1.2788
378,-1.3195
379,-1.3483
380,-1.3483
381,-1.3483
382,-1.3483
383,-1.3483
384,-1.3236
385,-1.29
386,-1.2379
387,-1.1644
388,-1.0665
389,-0.8630700000000001
390,-0.65969
391,-0.52928
392,-0.40581999999999996
393,-0.31786
394,-0.25006
395,-0.18227000000000002
396,-0.11447
397,-0.25432
398,-0.14727
399,-0.2693
400,-0.083772
401,-0.16227
402,-0.38045
403,-0.14373
404,-0.19775
405,-0.21273000000000003
406,-0.22771999999999998
407,-0.22794
408,-0.22794
409,-0.22794
410,-0.22794
411,-0.25369
412,-0.31292
413,-0.36441999999999997
414,-0.37512
415,-0.38583
416,-0.32713000000000003
417,-0.25934
418,-0.19154000000000002
419,-0.12375
420,-0.28054
421,0.058438
422,0.39741
423,0.14743
424,0.21523
425,0.28302
426,0.35081999999999997
427,0.41861000000000004
428,0.48641
429,0.54924
430,0.59563
431,0.6420100000000001
432,0.57918
433,0.51139
434,0.47616
435,0.45618000000000003
436,0.43736
437,0.42023
438,0.39649
439,0.3287
440,0.2609
441,0.19311
442,0.12531
443,0.42332
444,0.31985
445,0.35103
446,0.13815999999999998
447,0.20595
448,0.27375
449,0.34154
450,0.40934
451,0.47713
452,0.54493
453,0.6127199999999999
454,0.68052
455,0.74831
456,0.81611
457,0.8839
458,0.9517
459,1.0158
460,1.0779
461,1.1165
462,1.1165
463,1.1165
464,1.1165
465,1.1165
466,1.1165
467,1.1165
468,1.1165
469,1.1165
470,1.1165
471,1.1165
472,1.1165
473,1.1165
474,1.1165
475,1.1165
476,1.1165
477,1.1165
478,1.1165
479,1.1165
480,1.1165
481,1.1165
482,1.1165
483,1.1165
484,1.1552
485,1.2173
486,1.2814
487,1.3492
488,1.4169999999999998
489,1.4856
490,1.5541
491,1.676
492,1.8116
493,1.9078
494,1.9677
495,2.0146
496,2.0218
497,2.0289
498,2.0949
499,2.1627
500,2.169
501,2.1483
502,2.1078
503,2.04
504,1.9722
505,1.9044
506,1.8366
507,1.7248
508,1.6063
509,1.4776
510,1.3421
511,1.2065
512,1.0709
513,0.94025
514,0.91884
515,0.89743
516,0.8924700000000001
517,0.8924700000000001
518,0.8924700000000001
519,0.8924700000000001
520,0.8924700000000001
521,0.8924700000000001
522,0.8924700000000001
523,0.9233899999999999
524,0.9562200000000001
525,1.0109
526,1.0766
527,1.1165
528,1.1165
529,1.112
530,1.0727
531,1.0335
532,0.97025
533,0.90246
534,0.8346600000000001
535,0.7668699999999999
536,0.69907
537,0.6312800000000001
538,0.56348
539,0.49568999999999996
540,0.42788999999999994
541,0.3601
542,0.2923
543,0.24866999999999997
544,0.23296999999999998
545,0.22021999999999997
546,0.22021999999999997
547,0.22021999999999997
548,0.22021999999999997
549,0.22021999999999997
550,0.25754
551,0.31606
552,0.35777
553,0.3699
554,0.37508
555,0.30729
556,0.23949
557,0.1717
558,0.1039
559,-0.20589000000000002
560,-0.13693
561,-0.28981
562,-0.48963
563,-0.6894399999999999
564,-0.82596
565,-0.96155
566,-1.0971
567,-1.2327
568,-1.364
569,-1.4896
570,-1.6059999999999999
571,-1.6738
572,-1.7416
573,-1.8094
574,-1.8771
575,-1.935
576,-1.9863
577,-2.0206
578,-2.0206
579,-2.0237
580,-2.0772
581,-2.1307
582,-2.1597
583,-2.1818
584,-2.1583
585,-2.0905
586,-2.0227
587,-1.9549
588,-1.8871
589,-1.8473
590,-1.8088
591,-1.7965
592,-1.7965
593,-1.7426
594,-1.6099
595,-1.4721
596,-1.3009
597,-1.1296
598,-0.9394100000000001
599,-0.74602
600,-0.62543
601,-0.5576399999999999
602,-0.50266
603,-0.47697
604,-0.45169
605,-0.44027
606,-0.42885
607,-0.37495
608,-0.30715
609,-0.23936
610,-0.17156
611,-0.10377
612,-0.18062999999999999
613,0.15835
614,0.49732
615,0.16742
616,0.23521
617,0.30301
618,0.36166
619,0.40519
620,0.44431000000000004
621,0.44431000000000004
622,0.44431000000000004
623,0.44431000000000004
624,0.44431000000000004
625,0.44431000000000004
626,0.44431000000000004
627,0.44431000000000004
628,0.44431000000000004
629,0.44431000000000004
630,1.4964
631,1.4964
632,1.4964
633,1.4964
634,1.4964
635,1.4964
636,1.4964
637,1.4964
638,1.4964
639,1.4964
640,1.4964
641,1.4964
642,1.4964
643,1.4964
644,1.4964
645,1.4964
646,1.4964
647,1.4964
648,1.4964
649,1.4863
650,1.4736
651,1.4443
652,1.3998
653,1.3644
654,1.3569
655,1.3494
656,1.3491
657,1.3491
658,1.3491
659,1.3491
660,1.3491
661,1.3491
662,1.3491
663,1.3491
664,1.3491
665,1.3489
666,1.3486
667,1.3396
668,1.3248
669,1.3099
670,1.2951
671,1.28
672,1.26
673,1.24
674,1.1897
675,1.1303
676,1.0709
677,1.0116
678,0.95216
679,0.8927700000000001
680,0.8333799999999999
681,0.77399
682,0.7146
683,0.6552100000000001
684,0.5958100000000001
685,0.53465
686,0.47073000000000004
687,0.40560999999999997
688,0.33137
689,0.25713
690,0.19353
691,0.13195
692,0.39084
693,0.15327000000000002
694,-0.05846900000000001
695,-0.20695
696,-0.35441
697,-0.43255
698,-0.10198
699,-0.11704
700,-0.13188
701,-0.14731
702,-0.16341
703,-0.18487
704,-0.22941
705,-0.27395
706,-0.32649
707,-0.37978
708,-0.43567
709,-0.49303
710,-0.54575
711,-0.59029
712,-0.63483
713,-0.67938
714,-0.72392
715,-0.76846
716,-0.81301
717,-0.85755
718,-0.90209
719,-0.9436200000000001
720,-0.9766
721,-1.0096
722,-1.0441
723,-1.0786
724,-1.1203
725,-1.1648
726,-1.2037
727,-1.2353
728,-1.2656
729,-1.2890000000000001
730,-1.3125
731,-1.3283
732,-1.3432
733,-1.358
734,-1.3728
735,-1.3851
736,-1.3923
737,-1.3992
738,-1.4001
739,-1.401
740,-1.4129
741,-1.4277
742,-1.4426
743,-1.4574
744,-1.4717
745,-1.4842
746,-1.4967
747,-1.4973
748,-1.4973
749,-1.4973
750,-1.4973
751,-1.4973
752,-1.4973
753,-1.4973
754,-1.4973
755,-1.4973
756,-1.5074
757,-1.5193
758,-1.5299
759,-1.5396
760,-1.5463
761,-1.5463
762,-1.5463
763,-1.5463
764,-1.5463
765,-1.5463
766,-1.5463
767,-1.5463
768,-1.5463
769,-1.5434
770,-1.5287
771,-1.514
772,-1.5065
773,-1.4996
774,-1.4956
775,-1.4931
776,-1.4804
777,-1.4507
778,-1.421
779,-1.3913
780,-1.3616
781,-1.3319
782,-1.3022
783,-1.2725
784,-1.2428
785,-1.2101
786,-1.1697
787,-1.1292
788,-1.0846
789,-1.0401
790,-0.99556
791,-0.95101
792,-0.91195
793,-0.87959
794,-0.84675
795,-0.8115899999999999
796,-0.77642
797,-0.73283
798,-0.68829
799,-0.65222
800,-0.62127
801,-0.59315
802,-0.57033
803,-0.54808
804,-0.53308
805,-0.51807
806,-0.49136
807,-0.46166
808,-0.42332
809,-0.37706
810,-0.32718
811,-0.26621999999999996
812,-0.20526999999999998
813,-0.13142
814,-0.28665999999999997
815,0.11824000000000001
816,0.10772999999999999
817,0.19258
818,0.2787
819,0.36309
820,0.43733
821,0.51157
822,0.57616
823,0.6393
824,0.69502
825,0.74566
826,0.78962
827,0.81931
828,0.84901
829,0.8787
830,0.9084
831,0.93809
832,0.9677899999999999
833,0.99749
834,1.0272
835,1.0539
836,1.0696
837,1.0854
838,1.1139
839,1.1431
840,1.1816
841,1.2247
842,1.251
843,1.251
844,1.25
845,1.2414
846,1.2328
847,1.2174
848,1.2007
849,1.1766
850,1.1469
851,1.1143
852,1.0746
853,1.0349
854,0.9969600000000001
855,0.9589799999999999
856,0.93809
857,0.92325
858,0.9031100000000001
859,0.87685
860,0.84906
861,0.8146800000000001
862,0.7802899999999999
863,0.73663
864,0.69209
865,0.66389
866,0.64498
867,0.6319600000000001
868,0.6293
869,0.62817
870,0.6430100000000001
871,0.65786
872,0.68425
873,0.71332
874,0.73468
875,0.74938
876,0.75983
877,0.75826
878,0.7567
879,0.72741
880,0.69772
881,0.66802
882,0.6383300000000001
883,0.60863
884,0.5789300000000001
885,0.54924
886,0.51954
887,0.48985
888,0.43278999999999995
889,0.37215
890,0.31418
891,0.25791
892,0.2204
893,0.2204
894,0.2204
895,0.2204
896,0.2204
897,0.21649000000000002
898,0.21148000000000003
899,0.20149
900,0.18664
901,0.1657
902,0.1246
903,0.41668999999999995
904,0.19472
905,-0.18772
906,-0.25071
907,-0.47343
908,-0.14497000000000002
909,-0.20405
910,-0.26215
911,-0.31373
912,-0.3653
913,-0.41086999999999996
914,-0.45541000000000004
915,-0.49995
916,-0.5445
917,-0.58062
918,-0.5975
919,-0.61382
920,-0.61132
921,-0.60882
922,-0.59701
923,-0.58216
924,-0.56223
925,-0.53676
926,-0.51042
927,-0.48073
928,-0.45103000000000004
929,-0.42133999999999994
930,-0.39164
931,-0.37764000000000003
932,-0.37201999999999996
933,-0.36651
934,-0.36119
935,-0.35491
936,-0.34007
937,-0.32522
938,-0.31037
939,-0.29552
940,-0.28067
941,-0.26583
942,-0.25098000000000004
943,-0.23613
944,-0.22128
