time,value
0,0.26666
1,0.021418
2,-0.20412
3,-0.40331
4,-0.58475
5,-0.75815
6,-0.92716
7,-1.0741
8,-1.1838
9,-1.2342
10,-1.1986
11,-1.0604
12,-0.8285299999999999
13,-0.52468
14,-0.17539000000000002
15,0.18028
16,0.50113
17,0.7608699999999999
18,0.95258
19,1.074
20,1.1332
21,1.1501
22,1.1356
23,1.0838
24,0.9943299999999999
25,0.86905
26,0.6954600000000001
27,0.47035
28,0.20872
29,-0.072643
30,-0.35803
31,-0.62678
32,-0.8615200000000001
33,-1.0615
34,-1.2228
35,-1.3366
36,-1.3869999999999998
37,-1.3632
38,-1.2514
39,-1.0373
40,-0.7306600000000001
41,-0.35931
42,0.042952
43,0.43532
44,0.7762100000000001
45,1.0363
46,1.2058
47,1.2894
48,1.2975
49,1.2496
50,1.1628
51,1.0429
52,0.8895200000000001
53,0.70287
54,0.4805
55,0.22519
56,-0.042709
57,-0.30675
58,-0.55032
59,-0.76288
60,-0.9348299999999999
61,-1.0675
62,-1.1656
63,-1.2231
64,-1.235
65,-1.1902
66,-1.0783
67,-0.88671
68,-0.62324
69,-0.30236999999999997
70,0.050873
71,0.40564
72,0.73498
73,1.0166
74,1.2373
75,1.3896
76,1.4728
77,1.4855
78,1.4256
79,1.2934
80,1.0867
81,0.81362
82,0.49025
83,0.13452
84,-0.22906999999999997
85,-0.5789300000000001
86,-0.8962600000000001
87,-1.171
88,-1.3928
89,-1.5526
90,-1.6434
91,-1.6535
92,-1.5722
93,-1.3887
94,-1.1043
95,-0.7344
96,-0.30651
97,0.14722000000000002
98,0.59182
99,0.98814
100,1.3148
101,1.5574
102,1.7084
103,1.7674
104,1.7336
105,1.6127
106,1.4059
107,1.1213
108,0.76851
109,0.3725
110,-0.040727
111,-0.44325
112,-0.80671
113,-1.107
114,-1.3353
115,-1.4886
116,-1.5697
117,-1.5846
118,-1.5330000000000001
119,-1.4151
120,-1.2262
121,-0.9607600000000001
122,-0.62348
123,-0.22855
124,0.20158
125,0.6330100000000001
126,1.0206
127,1.3361
128,1.5505
129,1.6507
130,1.6397
131,1.5312
132,1.3405
133,1.0883
134,0.79473
135,0.47781999999999997
136,0.15145999999999998
137,-0.16634000000000002
138,-0.46218000000000004
139,-0.7207399999999999
140,-0.93394
141,-1.0918
142,-1.1905
143,-1.2359
144,-1.2319
145,-1.1875
146,-1.1062
147,-0.98461
148,-0.81985
149,-0.60815
150,-0.34528000000000003
151,-0.03663
152,0.30036
153,0.64267
154,0.96324
155,1.2371
156,1.4398
157,1.5502
158,1.5663
159,1.4866
160,1.3161
161,1.0733
162,0.78188
163,0.46225
164,0.1336
165,-0.18569000000000002
166,-0.48175
167,-0.75038
168,-0.99269
169,-1.2025
170,-1.3804
171,-1.5199
172,-1.6059
173,-1.6172
174,-1.5416
175,-1.3673
176,-1.0866
177,-0.7064
178,-0.25201999999999997
179,0.24575
180,0.7536
181,1.2248
182,1.6218
183,1.9163
184,2.082
185,2.1086
186,1.9979
187,1.761
188,1.4175
189,1.0014
190,0.54094
191,0.068237
192,-0.38977
193,-0.80925
194,-1.1737
195,-1.4680000000000002
196,-1.6834
197,-1.8103
198,-1.8443
199,-1.785
200,-1.6295
201,-1.3829
202,-1.0596
203,-0.68024
204,-0.26485
205,0.16630999999999999
206,0.58641
207,0.9784799999999999
208,1.3235
209,1.5974
210,1.7789
211,1.857
212,1.8211
213,1.6632
214,1.3982
215,1.0490000000000002
216,0.64217
217,0.20899
218,-0.21236999999999998
219,-0.5940300000000001
220,-0.9195200000000001
221,-1.1715
222,-1.3459999999999999
223,-1.4425
224,-1.4604
225,-1.4036
226,-1.2801
227,-1.0943
228,-0.8628100000000001
229,-0.5996
230,-0.31688
231,-0.032295
232,0.24486
233,0.5068199999999999
234,0.74788
235,0.9655799999999999
236,1.1483
237,1.2868
238,1.3628
239,1.365
240,1.2879
241,1.1342
242,0.9137
243,0.6442100000000001
244,0.34153
245,0.024549
246,-0.28214
247,-0.56283
248,-0.81047
249,-1.0135
250,-1.1628
251,-1.2579
252,-1.3007
253,-1.2855
254,-1.2159
255,-1.1019
256,-0.93995
257,-0.72629
258,-0.4624
259,-0.15411
260,0.19395
261,0.5696
262,0.9417200000000001
263,1.278
264,1.5504
265,1.726
266,1.7851
267,1.7268
268,1.5616
269,1.3007
270,0.96741
271,0.5862
272,0.17079
273,-0.26361
274,-0.69624
275,-1.1004
276,-1.4469999999999998
277,-1.7043
278,-1.8483
279,-1.8649
280,-1.7541
281,-1.5328
282,-1.2211
283,-0.8514
284,-0.4512
285,-0.031131
286,0.38711999999999996
287,0.78935
288,1.1638
289,1.49
290,1.7344
291,1.8725
292,1.8861
293,1.7632
294,1.5154
295,1.1687
296,0.75033
297,0.29999000000000003
298,-0.15125999999999998
299,-0.5747899999999999
300,-0.9530200000000001
301,-1.2659
302,-1.4981
303,-1.6369999999999998
304,-1.669
305,-1.5838
306,-1.3914
307,-1.1097
308,-0.76652
309,-0.39561
310,-0.026872000000000004
311,0.31764000000000003
312,0.61945
313,0.8765299999999999
314,1.087
315,1.2483
316,1.3536
317,1.3905
318,1.3513
319,1.229
320,1.033
321,0.77523
322,0.47794
323,0.17089000000000001
324,-0.12634
325,-0.39854
326,-0.63359
327,-0.82968
328,-0.99006
329,-1.1056
330,-1.1695
331,-1.1778
332,-1.1235
333,-1.0039
334,-0.8255600000000001
335,-0.6069
336,-0.36324
337,-0.1101
338,0.13402999999999998
339,0.3625
340,0.57786
341,0.77552
342,0.9465
343,1.083
344,1.1734
345,1.2067
346,1.1746
347,1.0679
348,0.8921600000000001
349,0.66156
350,0.39303
351,0.1048
352,-0.18754
353,-0.46491000000000005
354,-0.7174
355,-0.9324600000000001
356,-1.0892
357,-1.1784
358,-1.1977
359,-1.1427
360,-1.0144
361,-0.8236100000000001
362,-0.5919399999999999
363,-0.33632
364,-0.071397
365,0.19025
366,0.44331000000000004
367,0.6853600000000001
368,0.9047200000000001
369,1.0855
370,1.2175
371,1.2772
372,1.2446
373,1.1187
374,0.90801
375,0.62125
376,0.28967
377,-0.0581
378,-0.39579000000000003
379,-0.6989
380,-0.94924
381,-1.1363
382,-1.252
383,-1.2841
384,-1.2272
385,-1.0804
386,-0.85357
387,-0.55728
388,-0.22188000000000002
389,0.11637
390,0.42816000000000004
391,0.6808
392,0.85888
393,0.9621700000000001
394,1.0037
395,1.0012
396,0.96624
397,0.9075
398,0.82053
399,0.69973
400,0.53576
401,0.33175
402,0.09278
403,-0.16512000000000002
404,-0.4122
405,-0.62035
406,-0.77366
407,-0.8629
408,-0.88797
409,-0.86275
410,-0.80394
411,-0.72102
412,-0.61711
413,-0.49341
414,-0.34907
415,-0.17535
416,0.017372
417,0.21855
418,0.41623999999999994
419,0.59425
420,0.73983
421,0.84305
422,0.9026200000000001
423,0.9149200000000001
424,0.88184
425,0.8099
426,0.6967300000000001
427,0.54667
428,0.36454000000000003
429,0.15684
430,-0.068464
431,-0.29588000000000003
432,-0.5121399999999999
433,-0.70575
434,-0.86692
435,-0.9852
436,-1.0462
437,-1.044
438,-0.9735799999999999
439,-0.82849
440,-0.61627
441,-0.36162
442,-0.085463
443,0.18772
444,0.43278999999999995
445,0.6322800000000001
446,0.77799
447,0.8740000000000001
448,0.93858
449,0.97929
450,0.99665
451,0.98341
452,0.9265100000000001
453,0.80762
454,0.61646
455,0.35789
456,0.048007999999999995
457,-0.28343
458,-0.59764
459,-0.85565
460,-1.031
461,-1.1147
462,-1.1156
463,-1.0463
464,-0.92337
465,-0.76263
466,-0.57793
467,-0.37851999999999997
468,-0.1702
469,0.042992
470,0.25378
471,0.44632
472,0.6066
473,0.72949
474,0.80784
475,0.8434200000000001
476,0.84672
477,0.8192799999999999
478,0.76772
479,0.6847
480,0.56562
481,0.40998999999999997
482,0.21857
483,0.005556
484,-0.21338000000000001
485,-0.41483000000000003
486,-0.579
487,-0.68817
488,-0.74225
489,-0.74757
490,-0.7118800000000001
491,-0.65322
492,-0.5746899999999999
493,-0.47713999999999995
494,-0.36648000000000003
495,-0.24353000000000002
496,-0.1137
497,0.018462
498,0.14936
499,0.27152
