time,value
0,-0.086562
1,-0.041627
2,-0.041627
3,-0.086562
4,-0.041627
5,-0.086562
6,-0.041627
7,-0.041627
8,-0.086562
9,-0.041627
10,-0.086562
11,-0.041627
12,-0.041627
13,-0.086562
14,-0.041627
15,-0.086562
16,-0.041627
17,-0.041627
18,-0.086562
19,-0.041627
20,-0.086562
21,-0.041627
22,-0.041627
23,-0.086562
24,-0.041627
25,-0.086562
26,-0.041627
27,-0.041627
28,-0.086562
29,-0.041627
30,-0.086562
31,-0.041627
32,-0.041627
33,-0.086562
34,-0.041627
35,-0.086562
36,-0.041627
37,-0.041627
38,-0.086562
39,-0.041627
40,-0.086562
41,-0.041627
42,-0.041627
43,-0.086562
44,-0.041627
45,-0.086562
46,-0.041627
47,-0.041627
48,-0.086562
49,-0.041627
50,-0.086562
51,-0.041627
52,-0.041627
53,-0.086562
54,-0.041627
55,-0.041627
56,-0.086562
57,-0.041627
58,-0.086562
59,-0.041627
60,-0.041627
61,-0.086562
62,-0.041627
63,-0.086562
64,-0.041627
65,-0.041627
66,-0.086562
67,-0.041627
68,-0.086562
69,-0.041627
70,-0.086562
71,-0.041627
72,-0.041627
73,-0.086562
74,-0.041627
75,-0.086562
76,-0.041627
77,-0.086562
78,-0.041627
79,-0.086562
80,-0.041627
81,-0.041627
82,-0.086562
83,-0.041627
84,-0.086562
85,-0.041627
86,-0.086562
87,-0.041627
88,-0.086562
89,-0.041627
90,-0.041627
91,-0.086562
92,-0.041627
93,-0.086562
94,-0.041627
95,-0.086562
96,-0.041627
97,-0.041627
98,-0.086562
99,-0.041627
100,-0.086562
101,-0.041627
102,-0.086562
103,-0.041627
104,-0.041627
105,-0.086562
106,-0.041627
107,-0.086562
108,-0.041627
109,-0.086562
110,-0.041627
111,-0.041627
112,-0.086562
113,-0.041627
114,-0.086562
115,-0.041627
116,-0.086562
117,-0.041627
118,-0.041627
119,-0.086562
120,-0.041627
121,-0.086562
122,-0.041627
123,-0.041627
124,-0.086562
125,-0.041627
126,-0.086562
127,-0.041627
128,-0.086562
129,-0.041627
130,-0.041627
131,-0.086562
132,-0.041627
133,-0.086562
134,-0.041627
135,-0.086562
136,-0.041627
137,-0.041627
138,-0.086562
139,-0.041627
140,-0.086562
141,-0.041627
142,-0.086562
143,-0.041627
144,-0.041627
145,-0.086562
146,-0.041627
147,-0.086562
148,-0.041627
149,-0.086562
150,-0.041627
151,-0.041627
152,-0.086562
153,-0.041627
154,-0.086562
155,-0.041627
156,-0.041627
157,-0.086562
158,-0.041627
159,-0.086562
160,-0.041627
161,-0.086562
162,-0.041627
163,-0.086562
164,-0.041627
165,-0.041627
166,-0.086562
167,-0.041627
168,-0.086562
169,-0.041627
170,-0.041627
171,-0.086562
172,-0.041627
173,-0.086562
174,-0.041627
175,-0.041627
176,-0.086562
177,-0.041627
178,-0.086562
179,-0.041627
180,-0.041627
181,-0.086562
182,-0.041627
183,-0.086562
184,-0.041627
185,-0.041627
186,-0.086562
187,-0.041627
188,-0.086562
189,-0.041627
190,-0.086562
191,-0.041627
192,-0.041627
193,-0.086562
194,-0.041627
195,-0.086562
196,-0.041627
197,-0.041627
198,-0.086562
199,-0.041627
200,-0.086562
201,-0.041627
202,-0.086562
203,-0.041627
204,-0.041627
205,-0.086562
206,-0.041627
207,-0.086562
208,-0.041627
209,-0.086562
210,-0.041627
211,-0.041627
212,-0.086562
213,-0.041627
214,-0.086562
215,-0.041627
216,-0.086562
217,-0.041627
218,-0.041627
219,-0.086562
220,-0.041627
221,-0.086562
222,-0.041627
223,-0.086562
224,-0.041627
225,-0.041627
226,-0.086562
227,-0.041627
228,-0.086562
229,-0.041627
230,-0.086562
231,-0.041627
232,-0.086562
233,-0.041627
234,-0.041627
235,-0.086562
236,-0.041627
237,-0.086562
238,-0.041627
239,-0.086562
240,-0.041627
241,-0.086562
242,-0.041627
243,-0.086562
244,-0.041627
245,-0.086562
246,-0.041627
247,-0.041627
248,-0.086562
249,-0.041627
250,-0.086562
251,-0.041627
252,-0.086562
253,-0.041627
254,-0.086562
255,-0.041627
256,-0.086562
257,-0.041627
258,-0.086562
259,-0.041627
260,-0.086562
261,-0.041627
262,-0.041627
263,-0.086562
264,-0.041627
265,-0.086562
266,-0.041627
267,-0.086562
268,-0.041627
269,-0.086562
270,-0.041627
271,-0.086562
272,-0.041627
273,-0.086562
274,-0.041627
275,-0.086562
276,-0.041627
277,-0.041627
278,-0.086562
279,-0.041627
280,-0.086562
281,-0.041627
282,-0.086562
283,-0.041627
284,-0.086562
285,-0.041627
286,-0.086562
287,-0.041627
288,-0.041627
289,-0.086562
290,-0.041627
291,-0.086562
292,-0.041627
293,-0.086562
294,-0.041627
295,-0.086562
296,-0.041627
297,-0.086562
298,-0.041627
299,-0.041627
300,-0.086562
301,-0.041627
302,-0.086562
303,-0.041627
304,-0.086562
305,-0.041627
306,-0.041627
307,-0.086562
308,-0.041627
309,-0.086562
310,-0.041627
311,-0.086562
312,-0.041627
313,-0.086562
314,-0.041627
315,-0.041627
316,-0.086562
317,-0.041627
318,-0.086562
319,-0.041627
320,-0.086562
321,-0.041627
322,-0.086562
323,-0.041627
324,-0.041627
325,-0.086562
326,-0.041627
327,-0.086562
328,-0.041627
329,-0.086562
330,-0.041627
331,-0.086562
332,-0.041627
333,-0.041627
334,-0.086562
335,-0.041627
336,-0.086562
337,-0.041627
338,-0.086562
339,-0.041627
340,-0.041627
341,-0.086562
342,-0.041627
343,-0.086562
344,-0.041627
345,-0.086562
346,-0.041627
347,-0.041627
348,-0.086562
349,-0.041627
350,-0.086562
351,-0.041627
352,-0.086562
353,-0.041627
354,-0.086562
355,-0.041627
356,-0.041627
357,-0.086562
358,-0.041627
359,-0.086562
360,-0.041627
361,-0.086562
362,-0.041627
363,-0.041627
364,-0.086562
365,-0.041627
366,-0.086562
367,-0.041627
368,-0.086562
369,-0.041627
370,-0.086562
371,-0.041627
372,-0.086562
373,-0.041627
374,-0.086562
375,-0.041627
376,-0.041627
377,-0.086562
378,-0.041627
379,-0.086562
380,-0.041627
381,-0.086562
382,-0.041627
383,-0.086562
384,-0.041627
385,-0.041627
386,-0.086562
387,-0.041627
388,-0.086562
389,-0.041627
390,-0.086562
391,-0.041627
392,-0.041627
393,-0.086562
394,-0.041627
395,-0.086562
396,-0.041627
397,-0.086562
398,-0.041627
399,-0.086562
400,-0.041627
401,-0.041627
402,-0.086562
403,-0.041627
404,-0.086562
405,-0.041627
406,-0.086562
407,-0.041627
408,-0.041627
409,-0.086562
410,-0.041627
411,-0.086562
412,-0.041627
413,-0.086562
414,-0.041627
415,-0.041627
416,-0.086562
417,-0.041627
418,-0.086562
419,-0.041627
420,-0.041627
421,-0.086562
422,-0.041627
423,-0.086562
424,-0.041627
425,-0.086562
426,-0.041627
427,-0.086562
428,-0.041627
429,-0.086562
430,-0.041627
431,-0.086562
432,-0.041627
433,-0.086562
434,-0.041627
435,-0.086562
436,-0.041627
437,-0.086562
438,-0.041627
439,-0.041627
440,-0.086562
441,-0.041627
442,-0.086562
443,-0.041627
444,-0.086562
445,-0.041627
446,-0.086562
447,-0.041627
448,-0.086562
449,-0.041627
450,-0.086562
451,-0.041627
452,-0.041627
453,-0.086562
454,-0.041627
455,-0.086562
456,-0.041627
457,-0.086562
458,-0.041627
459,-0.086562
460,-0.041627
461,-0.086562
462,-0.041627
463,-0.041627
464,-0.086562
465,-0.041627
466,-0.086562
467,-0.041627
468,-0.086562
469,-0.041627
470,-0.086562
471,-0.041627
472,-0.041627
473,-0.086562
474,-0.041627
475,-0.086562
476,-0.041627
477,-0.086562
478,-0.041627
479,-0.086562
480,-0.041627
481,-0.041627
482,-0.086562
483,-0.041627
484,-0.086562
485,-0.041627
486,-0.086562
487,-0.041627
488,-0.041627
489,-0.086562
490,-0.041627
491,-0.086562
492,-0.041627
493,-0.086562
494,-0.041627
495,-0.086562
496,-0.041627
497,-0.041627
498,-0.086562
499,-0.041627
500,-0.086562
501,-0.041627
502,-0.086562
503,-0.041627
504,-0.086562
505,-0.041627
506,-0.041627
507,-0.086562
508,-0.041627
509,-0.086562
510,-0.041627
511,-0.086562
512,-0.041627
513,-0.041627
514,-0.086562
515,-0.041627
516,-0.086562
517,-0.041627
518,-0.086562
519,-0.041627
520,-0.086562
521,-0.041627
522,-0.041627
523,-0.086562
524,-0.041627
525,-0.086562
526,-0.041627
527,-0.086562
528,-0.041627
529,-0.086562
530,-0.041627
531,-0.041627
532,-0.086562
533,-0.041627
534,-0.086562
535,-0.041627
536,-0.041627
537,-0.086562
538,-0.041627
539,-0.086562
540,-0.041627
541,-0.086562
542,-0.041627
543,-0.086562
544,-0.041627
545,-0.041627
546,-0.086562
547,-0.041627
548,-0.086562
549,-0.041627
550,-0.086562
551,-0.041627
552,-0.041627
553,-0.086562
554,-0.041627
555,-0.086562
556,-0.041627
557,-0.086562
558,-0.041627
559,-0.041627
560,-0.086562
561,-0.041627
562,-0.086562
563,-0.041627
564,-0.086562
565,-0.041627
566,-0.041627
567,-0.086562
568,-0.041627
569,-0.086562
570,-0.041627
571,-0.041627
572,-0.086562
573,-0.041627
574,-0.086562
575,-0.041627
576,-0.086562
577,-0.041627
578,-0.086562
579,-0.041627
580,-0.086562
581,-0.041627
582,-0.041627
583,-0.086562
584,-0.041627
585,-0.086562
586,-0.041627
587,-0.086562
588,-0.041627
589,-0.041627
590,-0.086562
591,-0.041627
592,-0.086562
593,-0.041627
594,-0.086562
595,-0.041627
596,-0.041627
597,-0.086562
598,-0.041627
599,-0.086562
600,-0.041627
601,-0.041627
602,-0.086562
603,-0.041627
604,-0.086562
605,-0.041627
606,-0.086562
607,-0.041627
608,-0.086562
609,-0.041627
610,-0.041627
611,-0.086562
612,16.899
613,19.46
614,7.1929
615,0.0033077
616,-0.041627
617,-0.041627
618,-0.086562
619,-0.041627
620,-0.086562
621,-0.041627
622,-0.086562
623,-0.041627
624,-0.041627
625,-0.086562
626,-0.041627
627,-0.086562
628,-0.041627
629,-0.041627
630,-0.086562
631,-0.041627
632,-0.086562
633,-0.041627
634,-0.041627
635,-0.086562
636,-0.041627
637,-0.086562
638,-0.041627
639,-0.041627
640,-0.086562
641,-0.041627
642,-0.086562
643,-0.041627
644,-0.041627
645,-0.086562
646,-0.041627
647,-0.086562
648,-0.041627
649,-0.041627
650,-0.086562
651,-0.041627
652,-0.086562
653,-0.041627
654,-0.041627
655,-0.086562
656,-0.041627
657,-0.086562
658,-0.041627
659,-0.041627
660,-0.086562
661,-0.041627
662,-0.086562
663,-0.041627
664,-0.041627
665,-0.086562
666,-0.041627
667,-0.086562
668,-0.041627
669,-0.086562
670,-0.041627
671,-0.086562
672,-0.041627
673,-0.041627
674,-0.086562
675,-0.041627
676,-0.086562
677,-0.041627
678,-0.041627
679,-0.086562
680,-0.041627
681,-0.086562
682,-0.041627
683,-0.086562
684,-0.041627
685,-0.041627
686,-0.086562
687,-0.041627
688,-0.041627
689,-0.086562
690,-0.041627
691,-0.086562
692,-0.041627
693,-0.041627
694,-0.086562
695,-0.041627
696,-0.041627
697,-0.086562
698,-0.041627
699,-0.041627
700,-0.086562
701,-0.041627
702,-0.086562
703,-0.041627
704,-0.041627
705,-0.086562
706,-0.041627
707,-0.041627
708,-0.086562
709,-0.041627
710,-0.041627
711,-0.086562
712,-0.041627
713,-0.041627
714,-0.086562
715,-0.041627
716,-0.041627
717,-0.086562
718,-0.041627
719,-0.041627
