time,value
0,-2.3801
1,-0.8499
2,0.81321
3,1.5959
4,1.3177
5,0.69326
6,0.44006000000000006
7,0.5985199999999999
8,0.73619
9,0.62784
10,0.45724
11,0.42699
12,0.47326999999999997
13,0.42153
14,0.30316
15,0.28423000000000004
16,0.37969
17,0.42173999999999995
18,0.3066
19,0.17920999999999998
20,0.22276999999999997
21,0.4
22,0.50008
23,0.41466000000000003
24,0.28525
25,0.29209
26,0.43791
27,0.5695899999999999
28,0.59655
29,0.58808
30,0.6298199999999999
31,0.7214
32,0.77018
33,0.75265
34,0.7435
35,0.80698
36,0.92875
37,1.0239
38,1.0538
39,1.0223
40,0.93435
41,0.79451
42,0.63293
43,0.54276
44,0.56934
45,0.65785
46,0.7013199999999999
47,0.65452
48,0.59488
49,0.59328
50,0.6403300000000001
51,0.66523
52,0.64437
53,0.63237
54,0.63794
55,0.59921
56,0.4471
57,0.23705
58,0.10924
59,0.10647999999999999
60,0.13546
61,0.070643
62,-0.064763
63,-0.1453
64,-0.10975
65,-0.033224000000000004
66,-0.029105000000000002
67,-0.087711
68,-0.12
69,-0.078789
70,-0.016017
71,0.0015992
72,0.004676
73,0.062047000000000005
74,0.1859
75,0.28291
76,0.25545
77,0.12614
78,0.017372
79,0.036812
80,0.12891
81,0.1026
82,-0.20456
83,-0.76959
84,-1.3669
85,-1.7716
86,-1.9301
87,-1.9659
88,-2.0183
89,-2.0943
90,-2.1266
91,-2.09
92,-2.0558
93,-2.0996
94,-2.21
95,-2.3214
96,-2.3781
97,-2.3805
98,-2.3443
