time,value
0,-0.27333
1,0.014032
2,-0.38711
3,-0.20579
4,0.051591
5,-0.22716
6,0.0066191
7,0.22624
8,0.38190999999999997
9,-0.20554
10,-0.38871999999999995
11,-0.063435
12,-0.095188
13,-0.10008
14,0.18731
15,-0.4106
16,-0.58757
17,-0.27283
18,-0.023303
19,0.11084000000000001
20,0.30524
21,0.38006999999999996
22,0.24821
23,0.016796000000000002
24,-0.19983
25,-0.12397999999999999
26,0.35811
27,0.21523
28,-0.023323
29,0.051266
30,0.69103
31,-0.080421
32,0.46066
33,-0.42041999999999996
34,0.15363
35,0.11852
36,-0.056732000000000005
37,0.38151
38,-0.06424400000000001
39,-0.37009000000000003
40,-0.40354
41,-0.11533
42,-0.37144
43,1.4172
44,1.4172
45,1.4172
46,1.4172
47,1.4172
48,1.4172
49,1.4172
50,1.4172
51,1.4172
52,1.4172
53,1.4172
54,1.4172
55,1.4172
56,1.4172
57,1.4172
58,-1.4284
59,-1.4284
60,-1.4284
61,-1.4284
62,-1.4284
63,-1.4284
64,-1.4284
65,-1.4284
66,-1.4284
67,-1.4284
68,-1.4284
69,-1.4284
70,-1.4284
71,-1.4284
72,-1.4284
73,-0.06894299999999999
74,-0.22654000000000002
75,0.2405
76,0.082506
77,0.13672
78,-0.021495
79,-0.035494
80,-0.32761999999999997
81,0.29231999999999997
82,-0.082621
83,0.021999
84,-0.13972
85,0.48438000000000003
86,-0.33188
87,1.4172
88,1.4172
89,1.4172
90,1.4172
91,1.4172
92,1.4172
93,1.4172
94,1.4172
95,1.4172
96,1.4172
97,1.4172
98,1.4172
99,1.4172
100,1.4172
101,1.4172
102,-1.4284
103,-1.4284
104,-1.4284
105,-1.4284
106,-1.4284
107,-1.4284
108,-1.4284
109,-1.4284
110,-1.4284
111,-1.4284
112,-1.4284
113,-1.4284
114,-1.4284
115,-1.4284
116,-1.4284
117,0.13274
118,-0.10764000000000001
119,-0.33326
120,0.5330699999999999
121,-0.042957
122,0.017724
123,0.26604
124,-0.24023000000000003
125,0.37406
126,-0.020225
127,0.84559
