time,value
0,-0.39649
1,-0.39649
2,-0.39649
3,-0.39649
4,-0.39649
5,-0.39649
6,-0.39649
7,-0.39649
8,-0.39649
9,-0.39649
10,-0.39649
11,-0.39649
12,-0.39649
13,-0.39649
14,-0.39649
15,-0.39649
16,-0.39649
17,-0.39649
18,-0.39649
19,-0.39649
20,-0.39649
21,-0.39649
22,-0.39649
23,-0.39649
24,-0.39649
25,-0.39649
26,-0.39649
27,-0.39649
28,-0.39649
29,-0.39649
30,-0.39649
31,-0.39649
32,-0.39649
33,-0.39649
34,-0.39649
35,-0.39649
36,-0.39649
37,-0.39649
38,-0.39649
39,-0.39649
40,-0.39649
41,-0.39649
42,-0.39649
43,-0.39649
44,-0.39649
45,-0.39649
46,-0.39649
47,-0.39649
48,-0.39649
49,-0.39649
50,-0.39649
51,-0.39649
52,-0.39649
53,-0.39649
54,-0.39649
55,-0.39649
56,-0.39649
57,-0.39649
58,-0.39649
59,-0.39735
60,-0.40424
61,-0.41275
62,-0.42294
63,-0.43243000000000004
64,-0.43975
65,-0.43975
66,-0.43975
67,-0.43975
68,-0.44445
69,-0.45105
70,-0.46124
71,-0.47143999999999997
72,-0.48126
73,-0.48236
74,-0.48301000000000005
75,-0.48301000000000005
76,-0.48301000000000005
77,-0.48301000000000005
78,-0.48301000000000005
79,-0.48301000000000005
80,-0.48301000000000005
81,-0.48301000000000005
82,-0.48301000000000005
83,-0.48301000000000005
84,-0.48367
85,-0.48477
86,-0.49459
87,-0.50478
88,-0.51498
89,-0.52517
90,-0.53537
91,-0.54556
92,-0.55576
93,-0.56595
94,-0.5688300000000001
95,-0.5695399999999999
96,-0.5695399999999999
97,-0.57122
98,-0.57453
99,-0.58387
100,-0.59406
101,-0.60426
102,-0.61445
103,-0.62465
104,-0.63484
105,-0.64412
106,-0.65156
107,-0.64669
108,-0.6365
109,-0.6263
110,-0.61846
111,-0.6137699999999999
112,-0.6128
113,-0.6128
114,-0.6128
115,-0.60778
116,-0.59813
117,-0.588
118,-0.5787
119,-0.57209
120,-0.5695399999999999
121,-0.5695399999999999
122,-0.5695399999999999
123,-0.5695399999999999
124,-0.5695399999999999
125,-0.5695399999999999
126,-0.5695399999999999
127,-0.5695399999999999
128,-0.5695399999999999
129,-0.5695399999999999
130,-0.5695399999999999
131,-0.5695399999999999
132,-0.5695399999999999
133,-0.5695399999999999
134,-0.5695399999999999
135,-0.5695399999999999
136,-0.57212
137,-0.58204
138,-0.59213
139,-0.60233
140,-0.61252
141,-0.6227199999999999
142,-0.6329100000000001
143,-0.6431100000000001
144,-0.6533
145,-0.6635
146,-0.6737
147,-0.68389
148,-0.69252
149,-0.6993199999999999
150,-0.6993199999999999
151,-0.6993199999999999
152,-0.6993199999999999
153,-0.6993199999999999
154,-0.6993199999999999
155,-0.6993199999999999
156,-0.6993199999999999
157,-0.6993199999999999
158,-0.6993199999999999
159,-0.6993199999999999
160,-0.6993199999999999
161,-0.69631
162,-0.6916100000000001
163,-0.6814100000000001
164,-0.6712199999999999
165,-0.6610199999999999
166,-0.65763
167,-0.6560600000000001
168,-0.6560600000000001
169,-0.6560600000000001
170,-0.6560600000000001
171,-0.6560600000000001
172,-0.6560600000000001
173,-0.6560600000000001
174,-0.6560600000000001
175,-0.6560600000000001
176,-0.6560600000000001
177,-0.6560600000000001
178,-0.6560600000000001
179,-0.6560600000000001
180,-0.6560600000000001
181,-0.6560600000000001
182,-0.6560600000000001
183,-0.6560600000000001
184,-0.6560600000000001
185,-0.6560600000000001
186,-0.6560600000000001
187,-0.6560600000000001
188,-0.6560600000000001
189,-0.6560600000000001
190,-0.65678
191,-0.6592600000000001
192,-0.66681
193,-0.677
194,-0.6872
195,-0.69484
196,-0.69843
197,-0.6993199999999999
198,-0.6993199999999999
199,-0.6993199999999999
200,-0.6993199999999999
201,-0.6993199999999999
202,-0.6993199999999999
203,-0.6993199999999999
204,-0.6993199999999999
205,-0.6993199999999999
206,-0.6993199999999999
207,-0.6993199999999999
208,-0.6993199999999999
209,-0.6993199999999999
210,-0.6993199999999999
211,-0.69924
212,-0.69648
213,-0.6907800000000001
214,-0.68058
215,-0.6703899999999999
216,-0.65847
217,-0.6345
218,-0.60729
219,-0.5767
220,-0.5454100000000001
221,-0.51195
222,-0.47116
223,-0.43038000000000004
224,-0.3896
225,-0.35352
226,-0.31934
227,-0.28875
228,-0.25816
229,-0.2272
230,-0.18752
231,-0.14739000000000002
232,-0.10661
233,-0.0705
234,-0.03772
235,-0.017329
236,0.0030615
237,0.023452
238,0.050037
239,0.078287
240,0.10887000000000001
241,0.14010999999999998
242,0.1718
243,0.21220999999999998
244,0.25299
245,0.29377
246,0.35255
247,0.4208
248,0.51256
249,0.60432
250,0.69608
251,0.78052
252,0.86279
253,0.94435
254,1.0242
255,1.1025
256,1.1747
257,1.2461
258,1.3174
259,1.3933
260,1.4721
261,1.5536
262,1.6347
263,1.7149
264,1.7889
265,1.8603
266,1.9317
267,2.0007
268,2.0665
269,2.1287
270,2.1898
271,2.251
272,2.2971
273,2.3294
274,2.3601
275,2.388
276,2.4079
277,2.4155
278,2.4155
279,2.4155
280,2.4049
281,2.3741
282,2.3362
283,2.2955
284,2.2564
285,2.221
286,2.1904
287,2.1598
288,2.1292
289,2.0986
290,2.0681
291,2.0375
292,2.0069
293,1.9789
294,1.9582
295,1.9377
296,1.9173
297,1.9008
298,1.8865
299,1.8763
300,1.8661
301,1.8565
302,1.8543
303,1.8531
304,1.8531
305,1.8531
306,1.8531
307,1.8531
308,1.8531
309,1.8531
310,1.8641
311,1.8785
312,1.8989
313,1.9193
314,1.9396
