time,value
0,1.5008
1,1.5008
2,1.5008
3,1.5008
4,1.5008
5,1.5008
6,1.5008
7,1.5008
8,1.5008
9,1.5008
10,1.5008
11,1.5008
12,1.5008
13,-1.4305
14,-1.4305
15,-1.4305
16,-1.4305
17,-1.4305
18,-1.4305
19,-1.4305
20,-1.4305
21,-1.4305
22,-1.4305
23,-1.4305
24,-1.4305
25,-1.4305
26,-0.7177
27,-0.30325
28,0.52667
29,0.62532
30,-0.14465
31,-0.33673000000000003
32,0.65561
33,-0.17699
34,0.090437
35,0.18022
36,0.13938
37,-0.23535
38,0.0035915999999999995
39,-0.13369
40,-0.15437
41,-0.065963
42,-0.24720999999999999
43,-0.058128
44,0.046301999999999996
45,0.20096
46,0.033578
47,0.42318
48,0.20212
49,0.22823000000000002
50,-0.12900999999999999
51,-0.23435999999999998
52,0.037675
53,-0.28201
54,-0.11819
55,-0.0070619
56,-0.33247
57,0.08626900000000001
58,0.30701
59,-0.59943
60,0.3952
61,0.42972
62,-0.31983
63,0.10365
64,-0.21879
65,0.070882
66,0.20505
67,0.31035999999999997
68,0.35693
69,-0.096385
70,0.13187000000000001
71,0.23515999999999998
72,-0.014794
73,-0.36441
74,-1.4305
75,-1.4305
76,-1.4305
77,-1.4305
78,-1.4305
79,-1.4305
80,-1.4305
81,-1.4305
82,-1.4305
83,-1.4305
84,-1.4305
85,-1.4305
86,-1.4305
87,-1.4305
88,-1.4305
89,1.5008
90,1.5008
91,1.5008
92,1.5008
93,1.5008
94,1.5008
95,1.5008
96,1.5008
97,1.5008
98,1.5008
99,1.5008
100,1.5008
101,1.5008
102,1.5008
103,1.5008
104,0.28463
105,-0.43854
106,-0.041176
107,-0.18239
108,-0.34423000000000004
109,-0.6292800000000001
110,-0.14901
111,0.18864
112,-0.20596
113,-0.77561
114,-0.22269
115,-0.32826
116,-0.058285000000000003
117,0.068386
118,0.058138999999999996
119,-0.058008000000000004
120,0.1306
121,0.13521
122,-0.31501
123,0.52162
124,-0.01157
125,0.2229
126,0.02758
127,-0.58022
