time,value
0,-0.34465
1,-0.34465
2,-0.34465
3,-0.34465
4,-0.33100999999999997
5,-0.31556999999999996
6,-0.29841999999999996
7,-0.29151
8,-0.28794000000000003
9,-0.28794000000000003
10,-0.28794000000000003
11,-0.28794000000000003
12,-0.28794000000000003
13,-0.28794000000000003
14,-0.28794000000000003
15,-0.28794000000000003
16,-0.28794000000000003
17,-0.28794000000000003
18,-0.28794000000000003
19,-0.28794000000000003
20,-0.28794000000000003
21,-0.28794000000000003
22,-0.28794000000000003
23,-0.28794000000000003
24,-0.28794000000000003
25,-0.28794000000000003
26,-0.28794000000000003
27,-0.28794000000000003
28,-0.28794000000000003
29,-0.28634
30,-0.28128000000000003
31,-0.26645
32,-0.24984
33,-0.23449
34,-0.23124
35,-0.23124
36,-0.23124
37,-0.23124
38,-0.23124
39,-0.23124
40,-0.22189
41,-0.2083
42,-0.19115
43,-0.17399
44,-0.15684
45,-0.13968
46,-0.12253
47,-0.10537
48,-0.088216
49,-0.07106
50,-0.053904999999999995
51,-0.036749000000000004
52,-0.019594
53,-0.0024383000000000004
54,0.014717
55,0.031873
56,0.049027999999999995
57,0.066184
58,0.083339
59,0.10049
60,0.11765
61,0.13480999999999999
62,0.15195999999999998
63,0.16912
64,0.18627
65,0.20374
66,0.22451
67,0.25309
68,0.28735
69,0.32094
70,0.3358
71,0.3358
72,0.3358
73,0.34348
74,0.35783000000000004
75,0.37498000000000004
76,0.38642
77,0.3925
78,0.3925
79,0.3925
80,0.3925
81,0.3925
82,0.3925
83,0.3925
84,0.3925
85,0.3925
86,0.3925
87,0.3925
88,0.3925
89,0.3925
90,0.3925
91,0.3925
92,0.3925
93,0.40339
94,0.41741999999999996
95,0.43458
96,0.43623
97,0.42951999999999996
98,0.41236000000000006
99,0.40469
100,0.40695
101,0.4241
102,0.43755
103,0.43998999999999994
104,0.42283999999999994
105,0.40568000000000004
106,0.39904
107,0.41402
108,0.43078
109,0.44398999999999994
110,0.44833
111,0.4492
112,0.4492
113,0.4492
114,0.4492
115,0.4492
116,0.4492
117,0.4492
118,0.4492
119,0.4492
120,0.4492
121,0.4492
122,0.4492
123,0.4492
124,0.4492
125,0.4492
126,0.45883999999999997
127,0.47322
128,0.49038000000000004
129,0.50038
130,0.5059100000000001
131,0.5059100000000001
132,0.51549
133,0.5329999999999999
134,0.56731
135,0.59906
136,0.62762
137,0.64478
138,0.66193
139,0.67909
140,0.69624
141,0.7134
142,0.73196
143,0.76374
144,0.79701
145,0.8322
146,0.8778799999999999
147,0.92685
148,0.9783200000000001
149,1.0298
150,1.0813
151,1.1325
152,1.1791
153,1.2192
154,1.2536
155,1.2895
156,1.3333
157,1.3848
158,1.4363
159,1.4801
160,1.5161
161,1.5504
162,1.5905
163,1.6371
164,1.6884
165,1.7358
166,1.7782
167,1.8130000000000002
168,1.8448
169,1.8733
170,1.8914
171,1.9075
172,1.9221
173,1.9235
174,1.9235
175,1.9235
176,1.9235
177,1.9235
178,1.9235
179,1.9007
180,1.8715
181,1.8372
182,1.8029
183,1.7686
184,1.7342
185,1.6944
186,1.6501
187,1.5986
188,1.5472
189,1.4957
190,1.4442
191,1.3929
192,1.3463
193,1.3119999999999998
194,1.2777
195,1.2361
196,1.1736
197,1.1065
198,1.0405
199,0.9827299999999999
200,0.92956
201,0.8780899999999999
202,0.82663
203,0.7751600000000001
204,0.7236899999999999
205,0.67223
206,0.6207600000000001
207,0.56929
208,0.51783
209,0.46636000000000005
210,0.41489
211,0.36343000000000003
212,0.31196
213,0.26049
214,0.20903000000000002
215,0.16501
216,0.12596
217,0.091646
218,0.052112
219,0.0083968
220,-0.04307
221,-0.094536
222,-0.146
223,-0.19747
224,-0.24894000000000002
225,-0.3004
226,-0.35186999999999996
227,-0.40334000000000003
228,-0.4548
229,-0.50627
230,-0.55774
231,-0.6092
232,-0.66067
233,-0.71214
234,-0.7636
235,-0.81507
236,-0.86654
237,-0.9179999999999999
238,-0.96339
239,-1.0034
240,-1.0377
241,-1.0748
242,-1.1186
243,-1.1701
244,-1.2216
245,-1.2656
246,-1.3003
247,-1.3346
248,-1.3689
249,-1.4032
250,-1.4375
251,-1.4719
252,-1.5062
253,-1.5405
254,-1.5694
255,-1.5896
256,-1.5921
257,-1.5921
258,-1.5921
259,-1.5921
260,-1.5921
261,-1.5921
262,-1.5921
263,-1.5921
264,-1.5921
265,-1.5803
266,-1.565
267,-1.5479
268,-1.5397
269,-1.5354
270,-1.5354
271,-1.5292
272,-1.5188
273,-1.5017
274,-1.4881
275,-1.4787
276,-1.4787
277,-1.4776
278,-1.4726
279,-1.4554
280,-1.4383
281,-1.4211
282,-1.4040000000000001
283,-1.3868
284,-1.3719999999999999
285,-1.3669
286,-1.3653
287,-1.3653
288,-1.3653
289,-1.3653
290,-1.3644
291,-1.3589
292,-1.3458
293,-1.329
294,-1.3142
295,-1.3086
296,-1.3086
297,-1.3086
298,-1.2988
299,-1.2824
300,-1.2653
301,-1.2634
302,-1.2729
303,-1.29
304,-1.3016
305,-1.3086
306,-1.3086
307,-1.3122
308,-1.3191
309,-1.3362
310,-1.3517
311,-1.3653
312,-1.3653
313,-1.3653
314,-1.3653
