time,value
0,0.17053
1,0.19234
2,0.21415
3,0.23596
4,0.24736999999999998
5,0.25016
6,0.25016
7,0.25016
8,0.25016
9,0.25016
10,0.25016
11,0.25016
12,0.25016
13,0.25016
14,0.25016
15,0.25016
16,0.25016
17,0.25016
18,0.25016
19,0.25016
20,0.25016
21,0.25016
22,0.25016
23,0.25016
24,0.25016
25,0.25016
26,0.25016
27,0.25016
28,0.25016
29,0.25016
30,0.25016
31,0.25016
32,0.25016
33,0.25016
34,0.25016
35,0.25016
36,0.25016
37,0.25016
38,0.25016
39,0.25016
40,0.25819000000000003
41,0.28667
42,0.33029000000000003
43,0.37390999999999996
44,0.41752
45,0.46113999999999994
46,0.50475
47,0.54837
48,0.5919800000000001
49,0.6356
50,0.6792199999999999
51,0.72283
52,0.76645
53,0.81006
54,0.8535
55,0.88444
56,0.88715
57,0.88715
58,0.88715
59,0.88715
60,0.88715
61,0.88715
62,0.88715
63,0.88715
64,0.88715
65,0.88715
66,0.8947299999999999
67,0.91505
68,0.93685
69,0.9586600000000001
70,0.9804700000000001
71,1.0023
72,1.0241
73,1.0504
74,1.089
75,1.1326
76,1.1762
77,1.2025
78,1.2056
79,1.2056
80,1.2043
81,1.1909
82,1.1691
83,1.1473
84,1.1255
85,1.1037
86,1.0819
87,1.0601
88,1.0383
89,1.0165
90,0.99467
91,0.9750200000000001
92,0.96678
93,0.96678
94,0.96678
95,0.96678
96,0.96678
97,0.96678
98,0.96678
99,0.95601
100,0.93584
101,0.9140299999999999
102,0.8951399999999999
103,0.88715
104,0.88715
105,0.88715
106,0.8916700000000001
107,0.9115
108,0.9333
109,0.95511
110,0.98866
111,1.0307
112,1.0743
113,1.1143
114,1.1438
115,1.1656
116,1.1874
117,1.2003
118,1.1803
119,1.1585
120,1.1367
121,1.1149
122,1.0931
123,1.0713
124,1.0494
125,1.0276
126,1.0058
127,0.9841700000000001
128,0.97134
129,0.99315
130,1.015
131,1.0368
132,1.0857
133,1.1483
134,1.2138
135,1.2792
136,1.3446
137,1.41
138,1.4742
139,1.5241
140,1.5241
141,1.5241
142,1.5241
143,1.4809
144,1.4192
145,1.3537
146,1.2883
147,1.2229
148,1.1575
149,1.0928
150,1.0332
151,0.9896
152,0.9459799999999999
153,0.9023700000000001
154,0.85875
155,0.81514
156,0.77152
157,0.7339100000000001
158,0.7061
159,0.68429
160,0.66447
161,0.65589
162,0.67769
163,0.6995
164,0.72131
165,0.75907
166,0.80195
167,0.8455600000000001
168,0.8762
169,0.88715
170,0.88715
171,0.88594
172,0.8785299999999999
173,0.85672
174,0.83491
175,0.81311
176,0.74133
177,0.6553800000000001
178,0.56815
179,0.46705
180,0.34601
181,0.21516
182,0.33621
183,-0.27679000000000004
184,-0.14593
185,-0.25497
186,-0.36401
187,-0.4211
188,-0.46493999999999996
189,-0.50855
190,-0.54484
191,-0.57093
192,-0.5927399999999999
193,-0.61152
194,-0.61506
195,-0.59325
196,-0.57144
197,-0.5496300000000001
198,-0.52783
199,-0.50602
200,-0.48421000000000003
201,-0.47008
202,-0.46646000000000004
203,-0.46646000000000004
204,-0.46646000000000004
205,-0.46646000000000004
206,-0.46646000000000004
207,-0.46646000000000004
208,-0.46447
209,-0.44719
210,-0.42538000000000004
211,-0.40357
212,-0.38975
213,-0.38684
214,-0.38684
215,-0.39011999999999997
216,-0.41218999999999995
217,-0.45581000000000005
218,-0.49942
219,-0.54304
220,-0.5866600000000001
221,-0.63027
222,-0.67389
223,-0.70925
224,-0.73323
225,-0.75503
226,-0.7752
227,-0.78496
228,-0.78496
229,-0.78496
230,-0.78093
231,-0.76366
232,-0.74185
233,-0.72004
234,-0.72363
235,-0.76315
236,-0.80676
237,-0.8503799999999999
238,-0.894
239,-0.93761
240,-0.9812299999999999
241,-1.0199
242,-1.0461
243,-1.068
244,-1.0898
245,-1.0943
246,-1.0735
247,-1.0517
248,-1.0359
249,-1.071
250,-1.1364
251,-1.2018
252,-1.2673
253,-1.3327
254,-1.3981
255,-1.4635
256,-1.5290000000000001
257,-1.5944
258,-1.6598
259,-1.7212
260,-1.7402
261,-1.7404
262,-1.7404
263,-1.7404
264,-1.7404
265,-1.7404
266,-1.7396
267,-1.7303
268,-1.7085
269,-1.6867
270,-1.6625
271,-1.6072
272,-1.5421
273,-1.4767
274,-1.4264
275,-1.3966
276,-1.3748
277,-1.3544
278,-1.3423
279,-1.3423
280,-1.3423
281,-1.3423
282,-1.3423
283,-1.3423
284,-1.3423
285,-1.334
286,-1.3159999999999998
287,-1.2941
288,-1.2742
289,-1.2627
290,-1.2627
291,-1.2627
292,-1.2634
293,-1.2826
294,-1.3043
295,-1.3261
296,-1.3479
297,-1.3697
298,-1.3915
299,-1.4133
300,-1.4351
301,-1.4569
302,-1.4788
303,-1.5002
304,-1.5015
305,-1.5016
306,-1.5016
307,-1.5016
308,-1.5016
309,-1.5016
310,-1.4988
311,-1.4874
312,-1.4656
313,-1.4438
314,-1.4219
315,-1.2863
316,-1.1554
317,-1.0246
318,-0.8937799999999999
319,-0.82531
320,-0.8085899999999999
321,-0.8085899999999999
322,-0.8085899999999999
323,-0.8085899999999999
324,-0.8085899999999999
325,-0.8085899999999999
326,-0.8085899999999999
327,-0.8085899999999999
328,-0.8085899999999999
329,-0.8085899999999999
330,-0.8085899999999999
331,-0.8085899999999999
332,-0.8085899999999999
333,-0.8085899999999999
334,-0.8085899999999999
335,-0.8085899999999999
336,-0.8085899999999999
337,-0.8085899999999999
338,-0.8085899999999999
339,-0.8085899999999999
340,-0.8085899999999999
341,-0.8085899999999999
342,-0.8085899999999999
343,-0.8085899999999999
344,-0.8085899999999999
345,-0.8085899999999999
346,-0.8085899999999999
347,-0.8085899999999999
348,-0.8085899999999999
349,-0.8085899999999999
350,-0.8085899999999999
351,-0.8085899999999999
352,-0.8085899999999999
353,-0.8085899999999999
354,-0.8085899999999999
355,-0.79655
356,-0.75383
357,-0.6884100000000001
358,-0.623
359,-0.55758
360,-0.49217
361,-0.42675
362,-0.36134
363,-0.29593
364,-0.23051
365,-0.1651
366,-0.09968300000000001
367,-0.26365
368,0.29202
369,0.38916
370,0.14269
371,0.14676
372,0.14676
373,0.14676
374,0.14676
375,0.14676
376,0.14676
377,0.13368
378,0.33725
379,-0.062946
380,-0.3169
381,-0.08759299999999999
382,-0.092076
383,-0.092076
384,-0.090498
385,-0.34731999999999996
386,-0.26578
387,0.30682
388,0.14524
389,0.21066
390,0.27607
391,0.34148
392,0.38084
393,0.3856
394,0.3856
395,0.3856
396,0.3856
397,0.3856
398,0.3856
399,0.3856
400,0.3856
401,0.3856
402,0.3856
403,0.35635
404,0.29585
405,0.23043000000000002
406,0.17151
407,0.14676
408,0.14676
409,0.14676
410,0.14676
411,0.14676
412,0.14676
413,0.14676
414,0.14676
415,0.14676
416,0.14676
417,0.14676
418,0.14676
419,0.14676
420,0.14676
421,0.16033
422,0.21978000000000003
423,0.2852
424,0.35061
425,0.41603
426,0.48144
427,0.54686
428,0.61227
429,0.6776800000000001
430,0.7431
431,0.8085100000000001
432,0.8605799999999999
433,0.8632799999999999
434,0.8632799999999999
435,0.8632799999999999
436,0.82526
437,0.7644
438,0.69898
439,0.63357
440,0.56815
441,0.50274
442,0.43778
443,0.39929000000000003
444,0.46471
445,0.53012
446,0.59554
447,0.70162
448,0.82829
449,0.9591200000000001
450,1.1047
451,1.2801
452,1.4763
453,1.67
454,1.8354
455,1.9008
456,1.9662
457,2.0316
458,2.0538
459,2.0575
460,2.0575
461,2.041
462,1.9951
463,1.9297
464,1.8643
465,1.7989
466,1.7334
467,1.6680000000000001
468,1.6026
469,1.5372
470,1.4718
471,1.4064
472,1.3049
473,1.1447
474,0.94847
475,0.7611899999999999
476,0.62444
477,0.62444
478,0.62444
479,0.62444
480,0.5766
481,0.51339
482,0.44797
483,0.40203
484,0.3856
485,0.3856
486,0.3856
487,0.3856
488,0.3856
489,0.3856
490,0.3856
491,0.3856
492,0.3856
493,0.3856
494,0.36480999999999997
495,0.3141
496,0.24869000000000002
497,0.17911
498,0.35246
499,-0.30168
500,-0.1727
501,-0.30353
502,-0.43436
503,-0.56519
504,-0.69602
505,-0.82685
506,-0.95768
507,-1.0885
508,-1.2102
509,-1.2863
510,-1.2863
511,-1.2863
512,-1.2863
513,-1.2863
514,-1.2863
515,-1.2863
516,-1.2632
517,-1.2087
518,-1.1433
519,-1.0827
520,-1.0474
521,-1.0474
522,-1.0474
523,-1.0474
524,-1.0474
525,-1.0474
526,-1.0474
527,-1.0714
528,-1.1281
529,-1.1935
530,-1.2589
531,-1.3243
532,-1.3897
533,-1.4551
534,-1.5205
535,-1.5859999999999999
536,-1.6514
537,-1.7168
538,-1.7575
539,-1.7639
540,-1.7639
541,-1.7590000000000001
542,-1.7229
543,-1.6575
544,-1.5919999999999999
545,-1.5146
546,-1.3973
547,-1.2665
548,-1.1357
549,-1.0302
550,-0.96072
551,-0.8953
552,-0.82989
553,-0.76447
554,-0.69906
555,-0.63365
556,-0.5533100000000001
557,-0.43588000000000005
558,-0.30505
559,-0.17422
560,-0.095231
561,-0.092076
562,-0.092076
563,-0.08759299999999999
564,-0.3169
565,-0.062946
566,0.33725
567,0.13368
568,0.14676
569,0.14676
570,0.14676
571,0.14676
572,0.14676
573,0.14676
574,0.1549
575,0.2477
576,0.37799
577,0.5088199999999999
578,0.63965
579,0.77048
580,0.9013100000000001
581,1.0321
582,1.163
583,1.2938
584,1.4246
585,1.5590000000000002
586,1.74
587,1.9358
588,2.1319999999999997
589,2.2602
590,2.2963
591,2.2963
592,2.2921
593,2.2628
594,2.1974
595,2.1319999999999997
596,2.0638
597,1.9443
598,1.8141
599,1.6832
600,1.5524
601,1.4216
602,1.2908
603,1.1656
604,1.0656
605,1.0002
606,0.9347799999999999
607,0.86531
608,0.68428
609,0.48905
610,0.2928
611,0.39049
612,-0.099682
613,-0.29591999999999996
614,-0.47796000000000005
615,-0.60931
616,-0.67472
617,-0.7401399999999999
618,-0.80555
619,-0.8709600000000001
620,-0.9363799999999999
621,-1.0018
622,-1.0672
623,-1.1326
624,-1.198
625,-1.2551
626,-1.2863
627,-1.2863
628,-1.2863
629,-1.2863
630,-0.52282
631,-0.39666999999999997
632,-0.27052
633,-0.14437
634,-0.078347
635,-0.40345
636,-0.40345
637,-0.40345
638,-0.40345
639,-0.40345
640,-0.40345
641,-0.40345
642,-0.40345
643,-0.40345
644,-0.40345
645,-0.40345
646,-0.40345
647,-0.40345
648,-0.40345
649,-0.40345
650,-0.40345
651,-0.40345
652,-0.40345
653,-0.40345
654,-0.40345
655,-0.40345
656,-0.40345
657,-0.40345
658,-0.40345
659,-0.40345
660,-0.40345
661,-0.40345
662,-0.40345
663,-0.40345
664,-0.40345
665,-0.40345
666,-0.40345
667,-0.40345
668,-0.40345
669,-0.40345
670,-0.40345
671,-0.40345
672,-0.40345
673,-0.40345
674,-0.40345
675,-0.40345
676,-0.40345
677,-0.40345
678,-0.40345
679,-0.40345
680,-0.40345
681,-0.40345
682,-0.40345
683,-0.40345
684,-0.40345
685,-0.40345
686,-0.40345
687,-0.40345
688,-0.40345
689,-0.40345
690,-0.40345
691,-0.40345
692,-0.46652
693,-0.1209
694,-0.18398
695,-0.24705
696,-0.2882
697,-0.29252
698,-0.29252
699,-0.29252
700,-0.29252
701,-0.29252
702,-0.29252
703,-0.29252
704,-0.29252
705,-0.29252
706,-0.29252
707,-0.24226
708,-0.1253
709,-0.088076
710,0.12304000000000001
711,0.21061
712,0.27368000000000003
713,0.33676
714,0.38673
715,0.39836
716,0.39836
717,0.39836
718,0.37016
719,0.31182
720,0.24875
721,0.18567
722,0.1226
723,0.20529
724,-0.11008
725,-0.35967
726,-0.40345
727,-0.40345
728,-0.40345
729,-0.40345
730,-0.40345
731,-0.40345
732,-0.3613
733,-0.16142
734,0.15395
735,0.46933
736,0.14925
737,0.39599
738,0.080612
739,-0.23476
740,-0.21044000000000002
741,0.25995
742,0.37398000000000003
743,0.14586
744,0.16807
745,0.16807
746,0.16807
747,0.18094000000000002
748,0.24140999999999999
749,0.30449
750,0.36756
751,0.43063999999999997
752,0.49371000000000004
753,0.55678
754,0.60746
755,0.62866
756,0.62866
757,0.62822
758,0.60226
759,0.47611000000000003
760,0.34996
761,0.22380999999999998
762,0.39599
763,-0.23476
764,-0.15464
765,-0.25242
766,-0.29252
767,-0.29252
768,-0.29252
769,-0.29252
770,-0.29252
771,-0.29252
772,-0.29252
773,-0.084268
774,0.21354
775,0.52891
776,0.84429
777,1.1597
778,1.475
779,1.7862
780,2.0676
781,2.2569
782,2.4461
783,2.6353
784,2.6487
785,2.5972
786,2.5341
787,2.4015
788,2.1557
789,1.8403
790,1.5307
791,1.2535
792,1.0643
793,0.8750899999999999
794,0.68587
795,0.54277
796,0.4145
797,0.28835
798,0.19975
799,0.16807
800,0.16807
801,0.16455999999999998
802,0.14313
803,0.30796999999999997
804,-0.1801
805,-0.32277
806,-0.10917
807,-0.17224
808,-0.23531999999999997
809,-0.27834000000000003
810,-0.29252
811,-0.29252
812,-0.29252
813,-0.29252
814,-0.29252
815,-0.29252
816,-0.29252
817,-0.29252
818,-0.29252
819,-0.29252
820,-0.31372
821,-0.3644
822,-0.42746999999999996
823,-0.48616000000000004
824,-0.52282
825,-0.52282
826,-0.52282
827,-0.52542
828,-0.57563
829,-0.6387
830,-0.70177
831,-0.76485
832,-0.8279200000000001
833,-0.8909999999999999
834,-0.9540700000000001
835,-1.0171
836,-1.0802
837,-1.1433
838,-1.2006
839,-1.2137
840,-1.2137
841,-1.2137
842,-1.2368
843,-1.2914
844,-1.3545
845,-1.4223
846,-1.5173
847,-1.6435
848,-1.7696
849,-1.9045
850,-2.0806
851,-2.2698
852,-2.4591
853,-2.5529
854,-2.5148
855,-2.4517
856,-2.3792
857,-2.2464
858,-2.0571
859,-1.8679
860,-1.7136
861,-1.6743
862,-1.6743
863,-1.6743
864,-1.6743
865,-1.6743
866,-1.6743
867,-1.6697
868,-1.6318
869,-1.5687
870,-1.5056
871,-1.4425
872,-1.3795
873,-1.3164
874,-1.2533
875,-1.2152
876,-1.2137
877,-1.2137
878,-1.2094
879,-1.1682
880,-1.1052
881,-1.0421
882,-0.96199
883,-0.84846
884,-0.72231
885,-0.59616
886,-0.47001000000000004
887,-0.34386
888,-0.21771
889,-0.09156399999999999
890,0.080612
891,0.16072999999999998
892,0.28688
893,0.39352
894,0.46876999999999996
895,0.53185
896,0.59737
897,0.68733
898,0.81348
899,0.93963
900,1.0522
901,0.98472
902,0.8604200000000001
903,0.73427
904,0.60812
905,0.48197
906,0.35583000000000004
907,0.2499
908,0.26488
909,0.45411
910,0.6433300000000001
911,0.8380299999999999
912,1.1314
913,1.4457
914,1.7611
915,1.98
916,2.0867
917,2.1498
918,2.2018
919,2.2055
920,2.1425
921,2.0794
922,2.0163
923,1.9532
924,1.8902
925,1.8271
926,1.7902
927,1.7801
928,1.7801
929,1.7733
930,1.742
931,1.6789
932,1.6159
933,1.5517
934,1.4293
935,1.3034
936,1.1773
937,1.0511
938,0.92496
939,0.79881
940,0.68072
941,0.58759
942,0.52451
943,0.46143999999999996
944,0.39836
