time,value
0,-0.44109
1,-0.44109
2,-0.44109
3,-0.44109
4,-1.0433
5,-0.8425799999999999
6,-0.8425799999999999
7,-0.8425799999999999
8,-0.8425799999999999
9,-1.1939
10,-0.94296
11,-0.94296
12,-0.94296
13,-0.94296
14,-1.0935
15,-0.8927700000000001
16,-0.8927700000000001
17,-0.8927700000000001
18,-0.8927700000000001
19,-1.1437
20,0.91396
21,0.91396
22,0.91396
23,0.91396
24,-1.1939
25,1.1147
26,1.1147
27,1.1147
28,1.1147
29,-1.1437
30,1.1147
31,1.1147
32,1.1147
33,1.1147
34,-1.1437
35,1.1147
36,1.1147
37,1.1147
38,1.1147
39,-1.1437
40,1.0143
41,1.0143
42,1.0143
43,1.0143
44,-1.1939
45,0.010595
46,0.010595
47,0.010595
48,0.010595
49,-1.1939
50,-0.8425799999999999
51,-0.8425799999999999
52,-0.8425799999999999
53,-0.8425799999999999
54,-1.1939
55,-0.94296
56,-0.94296
57,-0.94296
58,-0.94296
59,-1.0935
60,-0.94296
61,-0.94296
62,-0.94296
63,-0.94296
64,-1.0935
65,-0.3909
66,-0.3909
67,-0.3909
68,-0.3909
69,-1.0433
70,1.2151
71,1.2151
72,1.2151
73,1.2151
74,-1.1437
75,1.1147
76,1.1147
77,1.1147
78,1.1147
79,-1.1437
80,1.0143
81,1.0143
82,1.0143
83,1.0143
84,-1.1939
85,1.0143
86,1.0143
87,1.0143
88,1.0143
89,-1.1939
90,0.8135899999999999
91,0.8135899999999999
92,0.8135899999999999
93,0.8135899999999999
94,-1.1939
95,-0.8927700000000001
96,-0.8927700000000001
97,-0.8927700000000001
98,-0.8927700000000001
99,-1.1437
100,-0.8927700000000001
101,-0.8927700000000001
102,-0.8927700000000001
103,-0.8927700000000001
104,-1.1437
105,-0.94296
106,-0.94296
107,-0.94296
108,-0.94296
109,-1.0935
110,-0.8927700000000001
111,-0.8927700000000001
112,-0.8927700000000001
113,-0.8927700000000001
114,-1.1437
115,0.6128399999999999
116,0.6128399999999999
117,0.6128399999999999
118,0.6128399999999999
119,-1.1939
120,1.2151
121,1.2151
122,1.2151
123,1.2151
124,-1.1437
125,1.1147
126,1.1147
127,1.1147
128,1.1147
129,-1.1437
130,1.0143
131,1.0143
132,1.0143
133,1.0143
134,-1.1939
135,1.0143
136,1.0143
137,1.0143
138,1.0143
139,-1.1939
140,-0.24034
141,-0.24034
142,-0.24034
143,-0.24034
144,-1.0433
145,-0.8927700000000001
146,-0.8927700000000001
147,-0.8927700000000001
148,-0.8927700000000001
149,-1.1437
150,-0.94296
151,-0.94296
152,-0.94296
153,-0.94296
154,-1.0935
155,-0.8927700000000001
156,-0.8927700000000001
157,-0.8927700000000001
158,-0.8927700000000001
159,-1.1437
160,-0.59165
161,-0.59165
162,-0.59165
163,-0.59165
164,-1.1939
165,1.2151
166,1.2151
167,1.2151
168,1.2151
169,-1.1437
170,1.2151
171,1.2151
172,1.2151
173,1.2151
174,-1.1437
175,1.0143
176,1.0143
177,1.0143
178,1.0143
179,-1.1939
180,1.0143
181,1.0143
182,1.0143
183,1.0143
184,-1.1939
185,0.71321
186,0.71321
187,0.71321
188,0.71321
189,-1.1939
190,-0.94296
191,-0.94296
192,-0.94296
193,-0.94296
194,-1.0935
195,-0.8927700000000001
196,-0.8927700000000001
197,-0.8927700000000001
198,-0.8927700000000001
199,-1.1437
200,-0.94296
201,-0.94296
202,-0.94296
203,-0.94296
204,-1.0935
205,-0.8927700000000001
206,-0.8927700000000001
207,-0.8927700000000001
208,-0.8927700000000001
209,-1.1437
210,0.060782
211,0.060782
212,0.060782
213,0.060782
214,-1.0433
215,1.2151
216,1.2151
217,1.2151
218,1.2151
219,-1.1437
220,1.1147
221,1.1147
222,1.1147
223,1.1147
224,-1.1437
225,1.0143
226,1.0143
227,1.0143
228,1.0143
229,-1.1939
230,1.1147
231,1.1147
232,1.1147
233,1.1147
234,-1.1437
235,0.71321
236,0.71321
237,0.71321
238,0.71321
239,-1.1939
240,-0.8425799999999999
241,-0.8425799999999999
242,-0.8425799999999999
243,-0.8425799999999999
244,-1.1939
245,-0.8927700000000001
246,-0.8927700000000001
247,-0.8927700000000001
248,-0.8927700000000001
249,-1.1437
250,-0.94296
251,-0.94296
252,-0.94296
253,-0.94296
254,-1.0935
255,-0.8927700000000001
256,-0.8927700000000001
257,-0.8927700000000001
258,-0.8927700000000001
259,-1.1437
260,-0.3909
261,-0.3909
262,-0.3909
263,-0.3909
264,-1.0433
265,1.3155
266,1.3155
267,1.3155
268,1.3155
269,-1.0935
270,1.1147
271,1.1147
272,1.1147
273,1.1147
274,-1.1437
275,1.1147
276,1.1147
277,1.1147
278,1.1147
279,-1.1437
280,1.0143
281,1.0143
282,1.0143
283,1.0143
284,-1.1939
285,1.0143
286,1.0143
287,1.0143
288,1.0143
289,-1.1939
290,-0.13997
291,-0.13997
292,-0.13997
293,-0.13997
294,-1.1939
295,-0.8927700000000001
296,-0.8927700000000001
297,-0.8927700000000001
298,-0.8927700000000001
299,-1.1437
300,-0.94296
301,-0.94296
302,-0.94296
303,-0.94296
304,-1.0935
305,-0.8927700000000001
306,-0.8927700000000001
307,-0.8927700000000001
308,-0.8927700000000001
309,-1.1437
310,-0.49127
311,-0.49127
312,-0.49127
313,-0.49127
314,-1.1437
315,1.2151
316,1.2151
317,1.2151
318,1.2151
319,-1.1437
320,1.2151
321,1.2151
322,1.2151
323,1.2151
324,-1.1437
325,1.1147
326,1.1147
327,1.1147
328,1.1147
329,-1.1437
330,1.0143
331,1.0143
332,1.0143
333,1.0143
334,-1.1939
335,1.1147
336,1.1147
337,1.1147
338,1.1147
339,-1.1437
340,1.0143
341,1.0143
342,1.0143
343,1.0143
344,-1.1939
345,1.0143
346,1.0143
347,1.0143
348,1.0143
349,-1.1939
350,-0.49127
351,-0.49127
352,-0.49127
353,-0.49127
354,-1.1437
355,-0.8927700000000001
356,-0.8927700000000001
357,-0.8927700000000001
358,-0.8927700000000001
359,-1.1437
360,-0.8927700000000001
361,-0.8927700000000001
362,-0.8927700000000001
363,-0.8927700000000001
364,-1.1437
365,-0.13997
366,-0.13997
367,-0.13997
368,-0.13997
369,-1.1939
370,1.2151
371,1.2151
372,1.2151
373,1.2151
374,-1.1437
375,1.2151
376,1.2151
377,1.2151
378,1.2151
379,-1.1437
380,1.1147
381,1.1147
382,1.1147
383,1.1147
384,-1.1437
385,1.1147
386,1.1147
387,1.1147
388,1.1147
389,-1.1437
390,1.0143
391,1.0143
392,1.0143
393,1.0143
394,-1.1939
395,0.060782
396,0.060782
397,0.060782
398,0.060782
399,-1.0433
400,-0.8927700000000001
401,-0.8927700000000001
402,-0.8927700000000001
403,-0.8927700000000001
404,-1.1437
405,-0.8927700000000001
406,-0.8927700000000001
407,-0.8927700000000001
408,-0.8927700000000001
409,-1.1437
410,-0.8927700000000001
411,-0.8927700000000001
412,-0.8927700000000001
413,-0.8927700000000001
414,-1.1437
415,0.31172
416,0.31172
417,0.31172
418,0.31172
419,-1.0433
420,1.3155
421,1.3155
422,1.3155
423,1.3155
424,-1.0935
425,1.1147
426,1.1147
427,1.1147
428,1.1147
429,-1.1437
430,1.1147
431,1.1147
432,1.1147
433,1.1147
434,-1.1437
435,1.1147
436,1.1147
437,1.1147
438,1.1147
439,-1.1437
440,1.1147
441,1.1147
442,1.1147
443,1.1147
444,-1.1437
445,-0.3909
446,-0.3909
447,-0.3909
448,-0.3909
449,-1.0433
450,-0.8927700000000001
451,-0.8927700000000001
452,-0.8927700000000001
453,-0.8927700000000001
454,-1.1437
455,-0.8927700000000001
456,-0.8927700000000001
457,-0.8927700000000001
458,-0.8927700000000001
459,-1.1437
460,-0.8927700000000001
461,-0.8927700000000001
462,-0.8927700000000001
463,-0.8927700000000001
464,-1.1437
465,0.91396
466,0.91396
467,0.91396
468,0.91396
469,-1.1939
470,1.2151
471,1.2151
472,1.2151
473,1.2151
474,-1.1437
475,1.2151
476,1.2151
477,1.2151
478,1.2151
479,-1.1437
480,1.1147
481,1.1147
482,1.1147
483,1.1147
484,-1.1437
485,1.0143
486,1.0143
487,1.0143
488,1.0143
489,-1.1939
490,1.0143
491,1.0143
492,1.0143
493,1.0143
494,-1.1939
495,1.1147
496,1.1147
497,1.1147
498,1.1147
499,-1.1437
500,0.060782
501,0.060782
502,0.060782
503,0.060782
504,-1.0433
505,-0.8927700000000001
506,-0.8927700000000001
507,-0.8927700000000001
508,-0.8927700000000001
509,-1.1437
510,-0.7924
511,-0.7924
512,-0.7924
513,-0.7924
514,-1.1939
515,1.2151
516,1.2151
517,1.2151
518,1.2151
519,-1.1437
520,1.1147
521,1.1147
522,1.1147
523,1.1147
524,-1.1437
525,1.1147
526,1.1147
527,1.1147
528,1.1147
529,-1.1437
530,1.0143
531,1.0143
532,1.0143
533,1.0143
534,-1.1939
535,1.0143
536,1.0143
537,1.0143
538,1.0143
539,-1.1939
540,1.0143
541,1.0143
542,1.0143
543,1.0143
544,-1.1939
545,1.0143
546,1.0143
547,1.0143
548,1.0143
549,-1.1939
550,0.010595
551,0.010595
552,0.010595
553,0.010595
554,-1.1939
555,-0.8927700000000001
556,-0.8927700000000001
557,-0.8927700000000001
558,-0.8927700000000001
559,-1.1437
560,-0.8927700000000001
561,-0.8927700000000001
562,-0.8927700000000001
563,-0.8927700000000001
564,-1.1437
565,-0.59165
566,-0.59165
567,-0.59165
568,-0.59165
569,-1.1939
570,1.2151
571,1.2151
572,1.2151
573,1.2151
574,-1.1437
575,1.2151
576,1.2151
577,1.2151
578,1.2151
579,-1.1437
580,1.1147
581,1.1147
582,1.1147
583,1.1147
584,-1.1437
585,1.0143
586,1.0143
587,1.0143
588,1.0143
589,-1.1939
590,1.0143
591,1.0143
592,1.0143
593,1.0143
594,-1.1939
595,-0.54146
596,-0.54146
597,-0.54146
598,-0.54146
599,-1.1437
600,-0.8927700000000001
601,-0.8927700000000001
602,-0.8927700000000001
603,-0.8927700000000001
604,-1.1437
605,-0.8927700000000001
606,-0.8927700000000001
607,-0.8927700000000001
608,-0.8927700000000001
609,-1.1437
610,-0.24034
611,-0.24034
612,-0.24034
613,-0.24034
614,-1.0433
615,1.3155
616,1.3155
617,1.3155
618,1.3155
619,-1.0935
620,1.1147
621,1.1147
622,1.1147
623,1.1147
624,-1.1437
625,1.1147
626,1.1147
627,1.1147
628,1.1147
629,-1.1437
630,1.1147
631,1.1147
632,1.1147
633,1.1147
634,-1.1437
635,1.1147
636,1.1147
637,1.1147
638,1.1147
639,-1.1437
640,0.41208999999999996
641,0.41208999999999996
642,0.41208999999999996
643,0.41208999999999996
644,-1.0935
645,-0.8927700000000001
646,-0.8927700000000001
647,-0.8927700000000001
648,-0.8927700000000001
649,-1.1437
650,-0.8927700000000001
651,-0.8927700000000001
652,-0.8927700000000001
653,-0.8927700000000001
654,-1.1437
655,-0.8927700000000001
656,-0.8927700000000001
657,-0.8927700000000001
658,-0.8927700000000001
659,-1.1437
660,0.21134
661,0.21134
662,0.21134
663,0.21134
664,-1.0433
665,1.2151
666,1.2151
667,1.2151
668,1.2151
669,-1.1437
670,1.2151
671,1.2151
672,1.2151
673,1.2151
674,-1.1437
675,1.0143
676,1.0143
677,1.0143
678,1.0143
679,-1.1939
680,1.1147
681,1.1147
682,1.1147
683,1.1147
684,-1.1437
685,1.1147
686,1.1147
687,1.1147
688,1.1147
689,-1.1437
690,-0.54146
691,-0.54146
692,-0.54146
693,-0.54146
694,-1.1437
695,-0.8927700000000001
696,-0.8927700000000001
697,-0.8927700000000001
698,-0.8927700000000001
699,-1.1437
700,-0.8927700000000001
701,-0.8927700000000001
702,-0.8927700000000001
703,-0.8927700000000001
704,-1.1437
705,-0.8425799999999999
706,-0.8425799999999999
707,-0.8425799999999999
708,-0.8425799999999999
709,-1.1939
710,1.3155
711,1.3155
712,1.3155
713,1.3155
714,-1.0935
715,1.2151
716,1.2151
717,1.2151
718,1.2151
719,-1.1437
