time,value
0,0.8626299999999999
1,0.8626299999999999
2,0.8626299999999999
3,0.8626299999999999
4,0.8626299999999999
5,0.8626299999999999
6,0.8626299999999999
7,0.8626299999999999
8,0.8626299999999999
9,0.8626299999999999
10,0.8626299999999999
11,0.8626299999999999
12,0.8626299999999999
13,0.8626299999999999
14,0.8626299999999999
15,0.8626299999999999
16,0.8626299999999999
17,0.8626299999999999
18,0.8626299999999999
19,0.8626299999999999
20,0.8626299999999999
21,0.8626299999999999
22,0.8626299999999999
23,0.8626299999999999
24,0.8626299999999999
25,0.8626299999999999
26,0.8626299999999999
27,0.8626299999999999
28,0.8626299999999999
29,0.8626299999999999
30,0.8626299999999999
31,0.8626299999999999
32,0.8626299999999999
33,0.8626299999999999
34,0.8626299999999999
35,0.8626299999999999
36,0.8626299999999999
37,0.8626299999999999
38,0.8626299999999999
39,0.8626299999999999
40,0.8626299999999999
41,0.8626299999999999
42,0.8626299999999999
43,0.8626299999999999
44,0.8626299999999999
45,0.8626299999999999
46,0.8626299999999999
47,0.8626299999999999
48,0.8626299999999999
49,0.8626299999999999
50,0.8626299999999999
51,0.8626299999999999
52,0.8626299999999999
53,0.8626299999999999
54,0.8626299999999999
55,0.8626299999999999
56,0.8626299999999999
57,0.8626299999999999
58,0.8626299999999999
59,0.8626299999999999
60,0.8626299999999999
61,0.8626299999999999
62,0.8626299999999999
63,0.8626299999999999
64,0.8626299999999999
65,0.8626299999999999
66,0.8626299999999999
67,0.8626299999999999
68,0.8626299999999999
69,0.8626299999999999
70,0.8626299999999999
71,0.8626299999999999
72,0.8626299999999999
73,0.8626299999999999
74,0.8626299999999999
75,0.8626299999999999
76,0.8626299999999999
77,0.8626299999999999
78,0.8626299999999999
79,0.8626299999999999
80,0.8626299999999999
81,0.8626299999999999
82,0.8626299999999999
83,0.8626299999999999
84,0.8626299999999999
85,0.8626299999999999
86,0.8626299999999999
87,0.8626299999999999
88,0.8626299999999999
89,0.8626299999999999
90,0.8626299999999999
91,0.8626299999999999
92,0.8626299999999999
93,0.8626299999999999
94,0.8626299999999999
95,0.8626299999999999
96,0.8626299999999999
97,0.8626299999999999
98,0.8626299999999999
99,0.8626299999999999
100,0.8626299999999999
101,0.8626299999999999
102,0.8626299999999999
103,0.8626299999999999
104,0.8626299999999999
105,0.8626299999999999
106,0.8626299999999999
107,0.8626299999999999
108,0.8626299999999999
109,0.8626299999999999
110,0.8626299999999999
111,0.8626299999999999
112,0.84372
113,0.8126399999999999
114,0.7697
115,0.7267600000000001
116,0.68382
117,0.67991
118,0.67794
119,0.67794
120,0.67267
121,0.65383
122,0.6108899999999999
123,0.56795
124,0.52893
125,0.5012800000000001
126,0.49325
127,0.49325
128,0.49325
129,0.49325
130,0.49325
131,0.49325
132,0.49325
133,0.49325
134,0.49325
135,0.49325
136,0.49325
137,0.49273
138,0.47796000000000005
139,0.43501999999999996
140,0.39208000000000004
141,0.35397
142,0.33103
143,0.35385
144,0.39679000000000003
145,0.43973
146,0.47100000000000003
147,0.49325
148,0.49325
149,0.49325
150,0.49325
151,0.52094
152,0.5556
153,0.59854
154,0.64147
155,0.6721699999999999
156,0.67688
157,0.67794
158,0.67688
159,0.6721699999999999
160,0.64147
161,0.59854
162,0.5556
163,0.52094
164,0.49325
165,0.49325
166,0.49325
167,0.49325
168,0.44873999999999997
169,0.3862
170,0.30032
171,0.21445
172,0.13863
173,0.4241
174,0.19735
175,-0.12180999999999999
176,-0.23203000000000001
177,-0.44672
178,-0.13141
179,-0.17434000000000002
180,-0.21224
181,-0.24552
182,-0.24552
183,-0.24552
184,-0.24552
185,-0.22854000000000002
186,-0.20081
187,-0.15787
188,-0.11494000000000001
189,-0.3242
190,0.18522
191,0.4385
192,0.17445
193,0.26033
194,0.32211
195,0.37032
196,0.41326
197,0.45423
198,0.49325
199,0.49325
200,0.49325
201,0.49325
202,0.49325
203,0.49325
204,0.49325
205,0.49325
206,0.48708
207,0.46473000000000003
208,0.42736999999999997
209,0.38443
210,0.3415
211,0.29856
212,0.25561999999999996
213,0.21268
214,0.16975
215,0.12680999999999998
216,0.21011999999999997
217,-0.21439
218,-0.12788
219,-0.21375
220,-0.29963
221,-0.3855
222,-0.47138
223,-0.56171
224,-0.66464
225,-0.78606
226,-0.9148700000000001
227,-1.0437
228,-1.1561
229,-1.2572
230,-1.3431
231,-1.429
232,-1.5148
233,-1.4952
234,-1.4642
235,-1.4213
236,-1.3784
237,-1.3354
238,-1.2925
239,-1.2496
240,-1.2066
241,-1.1637
242,-1.1207
243,-1.0778
244,-1.0349
245,-0.99193
246,-0.94899
247,-0.90605
248,-0.86311
249,-0.8201700000000001
250,-0.8363
251,-0.86488
252,-0.9078200000000001
253,-0.95075
254,-0.99369
255,-1.0366
256,-1.0796
257,-1.1225
258,-1.1654
259,-1.2084
260,-1.2513
261,-1.2943
262,-1.3372
263,-1.3801
264,-1.4231
265,-1.466
266,-1.5089
267,-1.5759
268,-1.6513
269,-1.7372
270,-1.8230000000000002
271,-1.8874
272,-1.9038
273,-1.9077
274,-1.9077
275,-1.9077
276,-1.9077
277,-1.9077
278,-1.9077
279,-1.9077
280,-1.9077
281,-1.9077
282,-1.9077
283,-1.9077
284,-1.9077
285,-1.9077
286,-1.9077
287,-1.9077
288,-1.899
289,-1.8696
290,-1.8301
291,-1.7872
292,-1.7442
293,-1.7013
294,-1.6583
295,-1.6154
296,-1.5754
297,-1.5384
298,-1.5384
299,-1.5384
300,-1.5384
301,-1.5384
302,-1.5384
303,-1.5384
304,-1.5384
305,-1.5451
306,-1.5692
307,-1.6072
308,-1.6501
309,-1.693
310,-1.7145
311,-1.723
312,-1.723
313,-1.723
314,-1.723
315,-0.9150299999999999
316,-0.9150299999999999
317,-0.9150299999999999
318,-0.9150299999999999
319,-0.9150299999999999
320,-0.9150299999999999
321,-0.9150299999999999
322,-0.9150299999999999
323,-0.9150299999999999
324,-0.9150299999999999
325,-0.9150299999999999
326,-0.9150299999999999
327,-0.9150299999999999
328,-0.9150299999999999
329,-0.9150299999999999
330,-0.9150299999999999
331,-0.9150299999999999
332,-0.9150299999999999
333,-0.9150299999999999
334,-0.9150299999999999
335,-0.9150299999999999
336,-0.9150299999999999
337,-0.9150299999999999
338,-0.9150299999999999
339,-0.9150299999999999
340,-0.9150299999999999
341,-0.9150299999999999
342,-0.9150299999999999
343,-0.9150299999999999
344,-0.9150299999999999
345,-0.9150299999999999
346,-0.9150299999999999
347,-0.9150299999999999
348,-0.9150299999999999
349,-0.9150299999999999
350,-0.9150299999999999
351,-0.9150299999999999
352,-0.9150299999999999
353,-0.9150299999999999
354,-0.9150299999999999
355,-0.9150299999999999
356,-0.9150299999999999
357,-0.9150299999999999
358,-0.9150299999999999
359,-0.9150299999999999
360,-0.9150299999999999
361,-0.9150299999999999
362,-0.9150299999999999
363,-0.9150299999999999
364,-0.9150299999999999
365,-0.9150299999999999
366,-0.9150299999999999
367,-0.9150299999999999
368,-0.9150299999999999
369,-0.9150299999999999
370,-0.9150299999999999
371,-0.9102899999999999
372,-0.8952700000000001
373,-0.8782
374,-0.86105
375,-0.84578
376,-0.85275
377,-0.87044
378,-0.88813
379,-0.90286
380,-0.9150299999999999
381,-0.9150299999999999
382,-0.9150299999999999
383,-0.9150299999999999
384,-0.9150299999999999
385,-0.9150299999999999
386,-0.9150299999999999
387,-0.9150299999999999
388,-0.91889
389,-0.93173
390,-0.9482200000000001
391,-0.96591
392,-0.9836
393,-0.99025
394,-0.99111
395,-0.99111
396,-0.99111
397,-0.99111
398,-0.99111
399,-0.99111
400,-0.99111
401,-0.99111
402,-0.99111
403,-0.99111
404,-0.99111
405,-0.99111
406,-0.99111
407,-0.99111
408,-0.99111
409,-0.99111
410,-0.99111
411,-0.99111
412,-0.99111
413,-0.99111
414,-0.99111
415,-0.99111
416,-0.99111
417,-0.99111
418,-0.99111
419,-0.99111
420,-0.99111
421,-0.99111
422,-0.99111
423,-0.99111
424,-0.99111
425,-0.99111
426,-0.99111
427,-0.99111
428,-0.99111
429,-0.99111
430,-0.99111
431,-0.99111
432,-0.99111
433,-0.99111
434,-0.99111
435,-0.99111
436,-0.99111
437,-0.99111
438,-0.99111
439,-0.9895
440,-0.9832
441,-0.9688200000000001
442,-0.9511299999999999
443,-0.9334399999999999
444,-0.91575
445,-0.8980600000000001
446,-0.8803799999999999
447,-0.86269
448,-0.845
449,-0.8410200000000001
450,-0.83894
451,-0.83894
452,-0.83852
453,-0.82634
454,-0.79097
455,-0.75559
456,-0.72121
457,-0.68995
458,-0.6681199999999999
459,-0.6504300000000001
460,-0.63274
461,-0.61506
462,-0.59737
463,-0.57968
464,-0.56199
465,-0.5443
466,-0.52662
467,-0.50893
468,-0.49123999999999995
469,-0.47355
470,-0.45586000000000004
471,-0.43817
472,-0.42049
473,-0.40324
474,-0.38749
475,-0.38245
476,-0.38245
477,-0.38245
478,-0.37904
479,-0.37275
480,-0.35507
481,-0.33738
482,-0.31969000000000003
483,-0.29283000000000003
484,-0.26226
485,-0.22689
486,-0.19150999999999999
487,-0.16028
488,-0.13847
489,-0.11979000000000001
490,-0.1021
491,-0.42644
492,-0.22198
493,0.26848
494,0.30651999999999996
495,0.11317
496,0.16225
497,0.19763
498,0.233
499,0.26838
500,0.30376
501,0.33913000000000004
502,0.37451
503,0.40988
504,0.44195
505,0.46593999999999997
506,0.48523999999999995
507,0.50293
508,0.52062
509,0.5383100000000001
510,0.55599
511,0.57368
512,0.59137
513,0.60906
514,0.62675
515,0.6444300000000001
516,0.6621199999999999
517,0.67981
518,0.6975
519,0.71519
520,0.73287
521,0.75056
522,0.76825
523,0.78594
524,0.8036300000000001
525,0.82131
526,0.8306899999999999
527,0.83488
528,0.83488
529,0.83488
530,0.83488
531,0.83488
532,0.83488
533,0.83488
534,0.83772
535,0.84603
536,0.86372
537,0.88141
538,0.90276
539,0.9345
540,0.9814799999999999
541,1.0345
542,1.0876
543,1.1407
544,1.1937
545,1.2468
546,1.2999
547,1.3529
548,1.3769999999999998
549,1.3980000000000001
550,1.4157
551,1.4342
552,1.4586
553,1.4939
554,1.5293
555,1.5635
556,1.594
557,1.6156
558,1.6333
559,1.651
560,1.6686
561,1.6863
562,1.704
563,1.7217
564,1.7394
565,1.7571
566,1.7748
567,1.7925
568,1.8102
569,1.8171
570,1.8019
571,1.7847
572,1.7664
573,1.7461
574,1.7154
575,1.68
576,1.6447
577,1.6093
578,1.5739
579,1.5385
580,1.5032
581,1.4678
582,1.4324
583,1.3969999999999998
584,1.3616
585,1.3263
586,1.2953
587,1.2743
588,1.2558
589,1.2381
590,1.2204
591,1.2027
592,1.185
593,1.1673
594,1.1521
595,1.1392
596,1.1392
597,1.1392
598,1.1392
599,1.1392
600,1.1392
601,1.1392
602,1.1392
603,1.1392
604,1.1392
605,1.1392
606,1.1392
607,1.1392
608,1.1392
609,1.1392
610,1.1392
611,1.138
612,1.1356
613,1.1179
614,1.1002
615,1.0825
616,1.0648
617,1.0471
618,1.0295
619,1.0118
620,0.99408
621,0.97639
622,0.9587
623,0.94101
624,0.92332
625,0.91448
626,0.9109700000000001
627,0.9109700000000001
628,0.9109700000000001
629,0.9109700000000001
630,-0.18745
631,-0.18745
632,-0.18745
633,-0.18745
634,-0.18745
635,-0.18745
636,-0.18745
637,-0.18745
638,-0.18745
639,-0.18745
640,-0.18745
641,-0.18745
642,-0.18745
643,-0.18745
644,-0.18745
645,-0.18745
646,-0.18745
647,-0.18745
648,-0.18745
649,-0.18745
650,-0.18745
651,-0.18745
652,-0.18745
653,-0.18745
654,-0.18745
655,-0.18745
656,-0.18745
657,-0.18745
658,-0.18745
659,-0.18745
660,-0.18745
661,-0.18745
662,-0.18745
663,-0.18745
664,-0.18745
665,-0.18745
666,-0.18745
667,-0.18745
668,-0.18745
669,-0.19272999999999998
670,-0.20873000000000003
671,-0.22507
672,-0.24076999999999998
673,-0.25406999999999996
674,-0.25819000000000003
675,-0.25819000000000003
676,-0.25819000000000003
677,-0.25819000000000003
678,-0.25819000000000003
679,-0.25819000000000003
680,-0.25819000000000003
681,-0.25819000000000003
682,-0.26809
683,-0.28094
684,-0.29739
685,-0.31383
686,-0.32588
687,-0.32835
688,-0.32893
689,-0.32918000000000003
690,-0.3303
691,-0.34176999999999996
692,-0.35822
693,-0.37466
694,-0.39111
695,-0.40755
696,-0.424
697,-0.44043999999999994
698,-0.45688999999999996
699,-0.46548999999999996
700,-0.47041000000000005
701,-0.47041000000000005
702,-0.47041000000000005
703,-0.47041000000000005
704,-0.47041000000000005
705,-0.47041000000000005
706,-0.47041000000000005
707,-0.47041000000000005
708,-0.48067
709,-0.49631000000000003
710,-0.51276
711,-0.52767
712,-0.54114
713,-0.54114
714,-0.54114
715,-0.54114
716,-0.55283
717,-0.57313
718,-0.6060300000000001
719,-0.6389199999999999
720,-0.66614
721,-0.6792100000000001
722,-0.68262
723,-0.68262
724,-0.68262
725,-0.69134
726,-0.70515
727,-0.72159
728,-0.7380399999999999
729,-0.75449
730,-0.77093
731,-0.78738
732,-0.80382
733,-0.82027
734,-0.8367100000000001
735,-0.85316
736,-0.8696
737,-0.88605
738,-0.9025
739,-0.91894
740,-0.9353899999999999
741,-0.95183
742,-0.9682799999999999
743,-0.98472
744,-1.0012
745,-1.0176
746,-1.0341
747,-1.0505
748,-1.067
749,-1.0834
750,-1.0998
751,-1.1163
752,-1.1327
753,-1.1492
754,-1.1641
755,-1.1747
756,-1.1778
757,-1.1778
758,-1.1778
759,-1.1778
760,-1.1778
761,-1.1778
762,-1.1778
763,-1.1778
764,-1.1778
765,-1.1778
766,-1.1778
767,-1.1778
768,-1.1778
769,-1.1778
770,-1.1778
771,-1.1769
772,-1.173
773,-1.1604
774,-1.1440000000000001
775,-1.1276
776,-1.1066
777,-1.0823
778,-1.0494
779,-1.0165
780,-0.9836
781,-0.96131
782,-0.9416899999999999
783,-0.92525
784,-0.9088
785,-0.89236
786,-0.8759100000000001
787,-0.8594700000000001
788,-0.8434299999999999
789,-0.8287899999999999
790,-0.8241
791,-0.8241
792,-0.8241
793,-0.8209299999999999
794,-0.81509
795,-0.79864
796,-0.7822
797,-0.76575
798,-0.75783
799,-0.75336
800,-0.75336
801,-0.75336
802,-0.75336
803,-0.75336
804,-0.75336
805,-0.75336
806,-0.75336
807,-0.74257
808,-0.72633
809,-0.7098800000000001
810,-0.69343
811,-0.67699
812,-0.66054
813,-0.6441
814,-0.62765
815,-0.61121
816,-0.5947600000000001
817,-0.57832
818,-0.56187
819,-0.54542
820,-0.52898
821,-0.51253
822,-0.49609
823,-0.47963999999999996
824,-0.45397
825,-0.4231
826,-0.39021
827,-0.35807
828,-0.32668
829,-0.31023
830,-0.29379
831,-0.27734000000000003
832,-0.25635
833,-0.23071
834,-0.19782
835,-0.16492
836,-0.13203
837,-0.09914099999999999
838,-0.33563000000000004
839,-0.17117000000000002
840,-0.050996
841,0.08043
842,0.11944
843,0.11944
844,0.11944
845,0.11944
846,0.26699
847,-0.26877
848,-0.12161
849,-0.19064
850,-0.23425
851,-0.23425
852,-0.23425
853,-0.22573000000000001
854,-0.19305999999999998
855,-0.12499
856,-0.2913
857,0.25689
858,0.24754
859,0.10924
860,0.19147
861,0.2737
862,0.35593
863,0.45163000000000003
864,0.54877
865,0.64744
866,0.74611
867,0.8447899999999999
868,0.9434600000000001
869,1.0421
870,1.1419
871,1.2451
872,1.3566
873,1.4717
874,1.5869
875,1.6872
876,1.7766
877,1.8423
878,1.9081
879,1.9739
880,2.0284
881,2.0805
882,2.1298
883,2.1791
884,2.2235
885,2.2575
886,2.2906
887,2.323
888,2.3534
889,2.3742
890,2.3907
891,2.4071
892,2.4128
893,2.4096
894,2.3767
895,2.3438
896,2.3109
897,2.278
898,2.2451
899,2.2122
900,2.1794
901,2.1423
902,2.0962
903,2.0476
904,1.9981
905,1.9483
906,1.8878
907,1.8221
908,1.7563
909,1.6905
910,1.6247
911,1.5589
912,1.4931
913,1.4274
914,1.3688
915,1.314
916,1.2647
917,1.2154
918,1.176
919,1.1605
920,1.1566
921,1.1566
922,1.1566
923,1.1566
924,1.1566
925,1.1566
926,1.1554
927,1.1532
928,1.1368
929,1.1203
930,1.1039
931,1.0719
932,1.0264
933,0.9605799999999999
934,0.8948
935,0.8368
936,0.79873
937,0.77653
938,0.76008
939,0.74364
940,0.7107399999999999
941,0.66794
942,0.6186
943,0.5692699999999999
944,0.51993
