time,value
0,-0.59175
1,-0.4136
2,-0.18327000000000002
3,0.08694600000000001
4,0.37622
5,0.65996
6,0.9095
7,1.0971
8,1.2004
9,1.2058
10,1.1152
11,0.93795
12,0.68918
13,0.39204
14,0.070717
15,-0.25333
16,-0.55833
17,-0.8239700000000001
18,-1.0344
19,-1.1793
20,-1.2497
21,-1.2407
22,-1.1522
23,-0.9872
24,-0.7553
25,-0.47073000000000004
26,-0.15379
27,0.16879
28,0.47083
29,0.72777
30,0.9194100000000001
31,1.0336
32,1.0681
33,1.028
34,0.92795
35,0.78255
36,0.60822
37,0.41922
38,0.22421999999999997
39,0.031777
40,-0.15292
41,-0.32244
42,-0.46913999999999995
43,-0.58692
44,-0.66781
45,-0.7078800000000001
46,-0.7075100000000001
47,-0.67106
48,-0.60477
49,-0.5191399999999999
50,-0.42128999999999994
51,-0.31897
52,-0.21556
53,-0.11255
54,-0.0096023
55,0.093873
56,0.20139
57,0.31235
58,0.42435
59,0.5315300000000001
60,0.6262
61,0.69915
62,0.7398600000000001
63,0.73932
64,0.69255
65,0.59864
66,0.45903999999999995
67,0.28396
68,0.08426499999999999
69,-0.12863
70,-0.34263000000000005
71,-0.5464100000000001
72,-0.72817
73,-0.8796
74,-0.98985
75,-1.0513
76,-1.0552
77,-0.9944200000000001
78,-0.8643
79,-0.66808
80,-0.41266
81,-0.11562
82,0.20108
83,0.51154
84,0.79118
85,1.0185
86,1.1774
87,1.2553
88,1.2451
89,1.1494
90,0.97535
91,0.7348
92,0.44792
93,0.1379
94,-0.17044
95,-0.45203000000000004
96,-0.6882
97,-0.86565
98,-0.97757
99,-1.0258
100,-1.0138
101,-0.95195
102,-0.8515
103,-0.7236899999999999
104,-0.5749
105,-0.40865
106,-0.23179
107,-0.047932
108,0.14088
109,0.32825
110,0.50639
111,0.6649
112,0.79343
113,0.8840100000000001
114,0.9304
115,0.92622
116,0.87202
117,0.77084
118,0.62705
119,0.44681000000000004
120,0.239
121,0.010775
122,-0.22762
123,-0.46452
124,-0.68798
125,-0.88239
126,-1.036
127,-1.1361
128,-1.1663
129,-1.1204
130,-0.99664
131,-0.79904
132,-0.5384
133,-0.23456
134,0.086914
135,0.39892
136,0.67891
137,0.9048
138,1.0618
139,1.1449
140,1.153
141,1.0927
142,0.9711299999999999
143,0.79786
144,0.5855
145,0.34388
146,0.08495599999999999
147,-0.17609
148,-0.42575
149,-0.6485
150,-0.8283200000000001
151,-0.95249
152,-1.0126
153,-1.0048
154,-0.93463
155,-0.81129
156,-0.64871
157,-0.46471
158,-0.27596
159,-0.095076
160,0.069977
161,0.21195
162,0.32803000000000004
163,0.41956000000000004
164,0.4897
165,0.54186
166,0.58124
167,0.61443
168,0.6432899999999999
169,0.66309
170,0.6692100000000001
171,0.6552899999999999
172,0.61355
173,0.53871
174,0.43161000000000005
175,0.293
176,0.13
177,-0.047909
178,-0.23669
179,-0.43375
180,-0.63589
181,-0.8423200000000001
182,-1.0463
183,-1.2357
184,-1.3875
185,-1.4756
186,-1.4716
187,-1.3501
188,-1.0997
189,-0.72307
190,-0.24244000000000002
191,0.30588000000000004
192,0.8710200000000001
193,1.3986
194,1.8372
195,2.1441
196,2.2877
197,2.2562
198,2.0509
199,1.6869
200,1.192
201,0.6042
202,-0.032079
203,-0.66703
204,-1.2506
205,-1.736
206,-2.0854
207,-2.2713
208,-2.2792
209,-2.1135
210,-1.7926
211,-1.3488
212,-0.82271
213,-0.26003000000000004
214,0.29220999999999997
215,0.79076
216,1.2016
217,1.4997
218,1.6721
219,1.7148
220,1.6325
221,1.4375
222,1.1509
223,0.79669
224,0.4027
225,-0.00049923
226,-0.38429
227,-0.71991
228,-0.98525
229,-1.165
230,-1.2491
231,-1.2368
232,-1.1323
233,-0.94526
234,-0.69118
235,-0.38697
236,-0.055304
237,0.27657
238,0.58318
239,0.8379200000000001
240,1.0169
241,1.1044
242,1.0902
243,0.97616
244,0.77232
245,0.49598000000000003
246,0.17355
247,-0.16465
248,-0.49076000000000003
249,-0.77461
250,-0.9867
251,-1.1067
252,-1.1213
253,-1.0259
254,-0.8325299999999999
255,-0.56407
256,-0.25174
257,0.065535
258,0.35285
259,0.58295
260,0.73843
261,0.81471
262,0.82025
263,0.76937
264,0.6763600000000001
265,0.55051
266,0.39797
267,0.22113000000000002
268,0.020887
269,-0.19618
270,-0.413
271,-0.60747
272,-0.75285
273,-0.82186
274,-0.79788
275,-0.6756300000000001
276,-0.46393999999999996
277,-0.18741
278,0.11527000000000001
279,0.40462
280,0.6441100000000001
281,0.8056399999999999
282,0.8741200000000001
283,0.8464700000000001
284,0.7319899999999999
285,0.54557
286,0.305
287,0.028546
288,-0.26702
289,-0.5615899999999999
290,-0.8360299999999999
291,-1.0659
292,-1.2277
293,-1.2965
294,-1.2522
295,-1.0837
296,-0.79475
297,-0.40531
298,0.048742
299,0.52388
300,0.9719399999999999
301,1.3484
302,1.6188
303,1.7606
304,1.7657
305,1.6372
306,1.3866
307,1.0305
308,0.59468
309,0.10542
310,-0.40767
311,-0.90915
312,-1.3601
313,-1.7253
314,-1.975
315,-2.086
316,-2.0486
317,-1.8694
318,-1.5638
319,-1.1578
320,-0.67899
321,-0.15611
322,0.38213
323,0.90765
324,1.3893
325,1.7969
326,2.097
327,2.2611
328,2.2689
329,2.1148
330,1.8112
331,1.3840000000000001
332,0.87097
333,0.31533
334,-0.24349
335,-0.77357
336,-1.2522
337,-1.6624
338,-1.9892
339,-2.2151
340,-2.3205
341,-2.2891
342,-2.1094
343,-1.7815
344,-1.3264
345,-0.77972
346,-0.18783
347,0.40008
348,0.9424
349,1.4134
350,1.8025
351,2.1033
352,2.312
353,2.4161
354,2.3927
355,2.215
356,1.8603
357,1.3248
358,0.63659
359,-0.1455
360,-0.9381
361,-1.6454
362,-2.1813
363,-2.4898
364,-2.551
365,-2.3879
366,-2.0518
367,-1.6103
368,-1.1258
369,-0.64588
370,-0.19718
371,0.21134
372,0.57943
373,0.9055
374,1.181
375,1.3891
376,1.5126
377,1.5375
378,1.4603
379,1.2914
380,1.056
381,0.78391
382,0.50117
383,0.22712
384,-0.030313999999999997
385,-0.26998
386,-0.49599
387,-0.70516
388,-0.88841
389,-1.0326
390,-1.1239
391,-1.1464
392,-1.0933
393,-0.9691200000000001
394,-0.78432
395,-0.55689
396,-0.30844
397,-0.05829500000000001
398,0.17914000000000002
399,0.39485
400,0.58113
401,0.7304
402,0.8377399999999999
403,0.8931100000000001
404,0.89033
405,0.82473
406,0.69865
407,0.52063
408,0.30673
409,0.073745
410,-0.16
411,-0.37163
412,-0.54203
413,-0.65852
414,-0.71259
415,-0.6984899999999999
416,-0.61735
417,-0.47923000000000004
418,-0.29267
419,-0.076541
420,0.14619000000000001
421,0.34785
422,0.50656
423,0.60185
424,0.61906
425,0.55648
426,0.41716000000000003
427,0.21370999999999998
428,-0.036407
429,-0.30738000000000004
430,-0.5708300000000001
431,-0.7994399999999999
432,-0.96091
433,-1.026
434,-0.9752700000000001
435,-0.8023
436,-0.515
437,-0.13829
438,0.28556
439,0.70509
440,1.0659999999999998
441,1.3226
442,1.4447
443,1.4207
444,1.2613
445,0.99329
446,0.65063
447,0.27081
448,-0.11216
449,-0.47336999999999996
450,-0.79073
451,-1.0509
452,-1.2449
453,-1.3655
454,-1.4044
455,-1.3566
456,-1.2197
457,-0.9929899999999999
458,-0.68145
459,-0.30046
460,0.12545
461,0.5655899999999999
462,0.9814
463,1.3268
464,1.5595
465,1.6456
466,1.5671
467,1.3281
468,0.95788
469,0.50436
470,0.028842000000000003
471,-0.40815
472,-0.7605
473,-0.9987299999999999
474,-1.1177
475,-1.1346
476,-1.0789
477,-0.9816600000000001
478,-0.86526
479,-0.73945
480,-0.59764
481,-0.42663999999999996
482,-0.21533000000000002
483,0.038109
484,0.32018
485,0.60812
486,0.8683799999999999
487,1.0683
488,1.1821
489,1.1955
490,1.1126
491,0.94932
492,0.72524
493,0.45899999999999996
494,0.17033
495,-0.1272
496,-0.42255
497,-0.6999
498,-0.9367
499,-1.1095
