time,value
0,-0.46493
1,-0.09602999999999999
2,0.14538
3,-0.43403
4,0.08816399999999999
5,-0.19637000000000002
6,-0.047505
7,0.5809
8,-0.6144
9,-0.074277
10,-0.58908
11,-0.33174000000000003
12,0.12312000000000001
13,-0.2472
14,-0.53776
15,0.40136
16,0.059028
17,-0.4396
18,0.20139
19,0.14733
20,-0.51266
21,-0.0050688
22,0.42076
23,0.71067
24,0.24418
25,-0.13443
26,0.26089
27,0.147
28,-0.41913999999999996
29,0.35536999999999996
30,-0.25961
31,-0.31175
32,0.31983
33,-0.30291999999999997
34,0.5377
35,-0.6240100000000001
36,-0.068781
37,0.10764000000000001
38,1.8089
39,1.8089
40,1.8089
41,1.8089
42,1.8089
43,1.8089
44,1.8089
45,1.8089
46,1.8089
47,-1.8195
48,-1.8195
49,-1.8195
50,-1.8195
51,-1.8195
52,-1.8195
53,-1.8195
54,-1.8195
55,-0.056379
56,0.42063999999999996
57,-0.08897100000000001
58,-0.077099
59,-0.15689
60,-0.11624000000000001
61,-0.25148000000000004
62,-0.50368
63,1.8952e-05
64,-0.4427
65,-0.16412000000000002
66,0.19535999999999998
67,0.33655999999999997
68,-0.64375
69,0.55391
70,-0.13228
71,-0.75242
72,0.061789
73,-0.015639
74,0.072202
75,-0.50441
76,-0.33355
77,0.18937
78,0.064104
79,-0.29466
80,0.36236999999999997
81,0.30854000000000004
82,0.51475
83,-0.62239
84,0.03038
85,-0.237
86,1.8089
87,1.8089
88,1.8089
89,1.8089
90,1.8089
91,1.8089
92,1.8089
93,1.8089
94,1.8089
95,-1.8195
96,-1.8195
97,-1.8195
98,-1.8195
99,-1.8195
100,-1.8195
101,-1.8195
102,-1.8195
103,-1.8195
104,0.37969
105,-0.35475
106,0.09563200000000001
107,0.15595
108,-0.75584
109,0.069124
110,-0.0050855
111,0.0081735
112,0.13605
113,-0.18282
114,0.8527600000000001
115,0.55783
116,0.18684
117,-0.07646599999999999
118,0.21921999999999997
119,-0.11277000000000001
120,0.5043300000000001
121,0.47325
122,0.052753999999999995
123,0.17949
124,0.4719
125,0.28615
126,-0.5957100000000001
127,-0.029921
