time,value
0,-0.12390999999999999
1,-0.12390999999999999
2,-0.12390999999999999
3,-0.12390999999999999
4,-0.12390999999999999
5,-0.12390999999999999
6,-0.12390999999999999
7,-0.12390999999999999
8,-0.12390999999999999
9,-0.12390999999999999
10,-0.12390999999999999
11,-0.12390999999999999
12,-0.12390999999999999
13,-0.12390999999999999
14,-0.12390999999999999
15,-0.12390999999999999
16,-0.12390999999999999
17,-0.12390999999999999
18,-0.12390999999999999
19,-0.12390999999999999
20,-0.12390999999999999
21,-0.12390999999999999
22,-0.12390999999999999
23,-0.12390999999999999
24,-0.12390999999999999
25,-0.12390999999999999
26,-0.12390999999999999
27,-0.12390999999999999
28,-0.12390999999999999
29,-0.12390999999999999
30,-0.12390999999999999
31,-0.12390999999999999
32,-0.12390999999999999
33,-0.12390999999999999
34,-0.12390999999999999
35,-0.12390999999999999
36,-0.12390999999999999
37,-0.12390999999999999
38,-0.12390999999999999
39,-0.12390999999999999
40,-0.12390999999999999
41,-0.12390999999999999
42,-0.12390999999999999
43,-0.12390999999999999
44,-0.12390999999999999
45,-0.12390999999999999
46,-0.12390999999999999
47,-0.12390999999999999
48,-0.12390999999999999
49,-0.12390999999999999
50,-0.12390999999999999
51,-0.12390999999999999
52,-0.12390999999999999
53,-0.12390999999999999
54,-0.12390999999999999
55,-0.12390999999999999
56,-0.12390999999999999
57,-0.12390999999999999
58,-0.12390999999999999
59,-0.12390999999999999
60,-0.12390999999999999
61,-0.12390999999999999
62,-0.12390999999999999
63,-0.12390999999999999
64,-0.12390999999999999
65,-0.12390999999999999
66,-0.12390999999999999
67,-0.12390999999999999
68,-0.12390999999999999
69,-0.12390999999999999
70,-0.12390999999999999
71,-0.12390999999999999
72,-0.12390999999999999
73,-0.12390999999999999
74,-0.12390999999999999
75,-0.12390999999999999
76,-0.12390999999999999
77,-0.12390999999999999
78,-0.12390999999999999
79,-0.12390999999999999
80,-0.12390999999999999
81,-0.12390999999999999
82,-0.12390999999999999
83,-0.12390999999999999
84,-0.12390999999999999
85,-0.12390999999999999
86,-0.12390999999999999
87,-0.12390999999999999
88,-0.12390999999999999
89,-0.12390999999999999
90,-0.12390999999999999
91,-0.12390999999999999
92,-0.12390999999999999
93,-0.12390999999999999
94,-0.12390999999999999
95,-0.12390999999999999
96,-0.12390999999999999
97,-0.12390999999999999
98,-0.12390999999999999
99,-0.12390999999999999
100,-0.12390999999999999
101,-0.12390999999999999
102,-0.12390999999999999
103,-0.12390999999999999
104,-0.12390999999999999
105,-0.12390999999999999
106,-0.12390999999999999
107,-0.12390999999999999
108,-0.12390999999999999
109,-0.12390999999999999
110,-0.12390999999999999
111,-0.12390999999999999
112,-0.12390999999999999
113,-0.12390999999999999
114,-0.12390999999999999
115,-0.12390999999999999
116,-0.12390999999999999
117,-0.12390999999999999
118,-0.12390999999999999
119,-0.12390999999999999
120,-0.12390999999999999
121,-0.12390999999999999
122,-0.12390999999999999
123,-0.12390999999999999
124,-0.12390999999999999
125,-0.12390999999999999
126,-0.12390999999999999
127,-0.12390999999999999
128,-0.12390999999999999
129,-0.12390999999999999
130,-0.12390999999999999
131,-0.12390999999999999
132,-0.12390999999999999
133,-0.12390999999999999
134,-0.12390999999999999
135,-0.12390999999999999
136,-0.12390999999999999
137,-0.12390999999999999
138,-0.12390999999999999
139,-0.12390999999999999
140,-0.12390999999999999
141,-0.12390999999999999
142,-0.12390999999999999
143,-0.12390999999999999
144,-0.12390999999999999
145,-0.12390999999999999
146,-0.12390999999999999
147,-0.12390999999999999
148,-0.12390999999999999
149,-0.12390999999999999
150,-0.12390999999999999
151,-0.12390999999999999
152,-0.12390999999999999
153,-0.12390999999999999
154,-0.12390999999999999
155,-0.12390999999999999
156,-0.12390999999999999
157,-0.12390999999999999
158,-0.12390999999999999
159,-0.12390999999999999
160,-0.12390999999999999
161,-0.12390999999999999
162,-0.12390999999999999
163,-0.12390999999999999
164,-0.12390999999999999
165,-0.12390999999999999
166,-0.12390999999999999
167,-0.12390999999999999
168,-0.12390999999999999
169,-0.12390999999999999
170,-0.12390999999999999
171,-0.12390999999999999
172,-0.12390999999999999
173,-0.12390999999999999
174,-0.12390999999999999
175,-0.12390999999999999
176,-0.12390999999999999
177,-0.12390999999999999
178,-0.12390999999999999
179,-0.12390999999999999
180,-0.12390999999999999
181,-0.12390999999999999
182,-0.12390999999999999
183,-0.12390999999999999
184,-0.12390999999999999
185,-0.12390999999999999
186,-0.12390999999999999
187,-0.12390999999999999
188,-0.12390999999999999
189,-0.12390999999999999
190,-0.12390999999999999
191,-0.12390999999999999
192,-0.12390999999999999
193,-0.12390999999999999
194,-0.12390999999999999
195,-0.12390999999999999
196,-0.12390999999999999
197,-0.12390999999999999
198,-0.12390999999999999
199,-0.12390999999999999
200,-0.12390999999999999
201,-0.12390999999999999
202,2.1943
203,12.626
204,3.2761
205,-0.046632
206,-0.12390999999999999
207,-0.12390999999999999
208,-0.12390999999999999
209,-0.12390999999999999
210,-0.12390999999999999
211,-0.12390999999999999
212,-0.12390999999999999
213,-0.12390999999999999
214,-0.12390999999999999
215,-0.12390999999999999
216,-0.12390999999999999
217,-0.12390999999999999
218,-0.12390999999999999
219,-0.12390999999999999
220,-0.12390999999999999
221,-0.12390999999999999
222,-0.12390999999999999
223,-0.12390999999999999
224,-0.12390999999999999
225,-0.12390999999999999
226,-0.12390999999999999
227,-0.12390999999999999
228,-0.12390999999999999
229,-0.12390999999999999
230,6.058
231,0.18519000000000002
232,-0.12390999999999999
233,-0.12390999999999999
234,-0.12390999999999999
235,-0.12390999999999999
236,-0.12390999999999999
237,-0.12390999999999999
238,-0.12390999999999999
239,-0.12390999999999999
240,-0.12390999999999999
241,-0.12390999999999999
242,-0.12390999999999999
243,-0.12390999999999999
244,-0.12390999999999999
245,-0.12390999999999999
246,-0.12390999999999999
247,-0.12390999999999999
248,-0.12390999999999999
249,-0.12390999999999999
250,-0.12390999999999999
251,-0.12390999999999999
252,-0.12390999999999999
253,-0.12390999999999999
254,1.7307
255,3.8943
256,0.030641
257,-0.12390999999999999
258,-0.12390999999999999
259,-0.12390999999999999
260,-0.12390999999999999
261,-0.12390999999999999
262,-0.12390999999999999
263,-0.12390999999999999
264,-0.12390999999999999
265,-0.12390999999999999
266,-0.12390999999999999
267,-0.12390999999999999
268,-0.12390999999999999
269,-0.12390999999999999
270,-0.12390999999999999
271,-0.12390999999999999
272,-0.12390999999999999
273,-0.12390999999999999
274,-0.12390999999999999
275,-0.12390999999999999
276,-0.12390999999999999
277,-0.12390999999999999
278,-0.12390999999999999
279,-0.12390999999999999
280,-0.12390999999999999
281,-0.12390999999999999
282,-0.12390999999999999
283,-0.12390999999999999
284,-0.12390999999999999
285,-0.12390999999999999
286,-0.12390999999999999
287,-0.12390999999999999
288,-0.12390999999999999
289,-0.12390999999999999
290,-0.12390999999999999
291,-0.12390999999999999
292,-0.12390999999999999
293,-0.12390999999999999
294,-0.12390999999999999
295,-0.12390999999999999
296,-0.12390999999999999
297,-0.12390999999999999
298,-0.12390999999999999
299,-0.12390999999999999
300,-0.12390999999999999
301,-0.12390999999999999
302,-0.12390999999999999
303,-0.12390999999999999
304,-0.12390999999999999
305,-0.12390999999999999
306,-0.12390999999999999
307,-0.12390999999999999
308,-0.12390999999999999
309,-0.12390999999999999
310,-0.12390999999999999
311,-0.12390999999999999
312,-0.12390999999999999
313,-0.12390999999999999
314,-0.12390999999999999
315,-0.12390999999999999
316,-0.12390999999999999
317,-0.12390999999999999
318,-0.12390999999999999
319,-0.12390999999999999
320,-0.12390999999999999
321,-0.12390999999999999
322,-0.12390999999999999
323,-0.12390999999999999
324,-0.12390999999999999
325,-0.12390999999999999
326,-0.12390999999999999
327,-0.12390999999999999
328,-0.12390999999999999
329,-0.12390999999999999
330,-0.12390999999999999
331,-0.12390999999999999
332,-0.12390999999999999
333,-0.12390999999999999
334,-0.12390999999999999
335,-0.12390999999999999
336,-0.12390999999999999
337,-0.12390999999999999
338,-0.12390999999999999
339,-0.12390999999999999
340,-0.12390999999999999
341,-0.12390999999999999
342,-0.12390999999999999
343,-0.12390999999999999
344,-0.12390999999999999
345,-0.12390999999999999
346,-0.12390999999999999
347,-0.12390999999999999
348,-0.12390999999999999
349,-0.12390999999999999
350,-0.12390999999999999
351,-0.12390999999999999
352,-0.12390999999999999
353,-0.12390999999999999
354,-0.12390999999999999
355,-0.12390999999999999
356,-0.12390999999999999
357,-0.12390999999999999
358,-0.12390999999999999
359,-0.12390999999999999
360,-0.12390999999999999
361,-0.12390999999999999
362,-0.12390999999999999
363,-0.12390999999999999
364,-0.12390999999999999
365,-0.12390999999999999
366,-0.12390999999999999
367,-0.12390999999999999
368,-0.12390999999999999
369,-0.12390999999999999
370,-0.12390999999999999
371,-0.12390999999999999
372,-0.12390999999999999
373,-0.12390999999999999
374,-0.12390999999999999
375,-0.12390999999999999
376,-0.12390999999999999
377,-0.12390999999999999
378,-0.12390999999999999
379,-0.12390999999999999
380,-0.12390999999999999
381,-0.12390999999999999
382,-0.12390999999999999
383,-0.12390999999999999
384,-0.12390999999999999
385,-0.12390999999999999
386,-0.12390999999999999
387,-0.12390999999999999
388,-0.12390999999999999
389,-0.12390999999999999
390,-0.12390999999999999
391,-0.12390999999999999
392,-0.12390999999999999
393,-0.12390999999999999
394,-0.12390999999999999
395,-0.12390999999999999
396,-0.12390999999999999
397,-0.12390999999999999
398,-0.12390999999999999
399,-0.12390999999999999
400,-0.12390999999999999
401,-0.12390999999999999
402,-0.12390999999999999
403,-0.12390999999999999
404,-0.12390999999999999
405,-0.12390999999999999
406,-0.12390999999999999
407,-0.12390999999999999
408,-0.12390999999999999
409,-0.12390999999999999
410,-0.12390999999999999
411,-0.12390999999999999
412,-0.12390999999999999
413,-0.12390999999999999
414,-0.12390999999999999
415,-0.12390999999999999
416,-0.12390999999999999
417,-0.12390999999999999
418,-0.12390999999999999
419,-0.12390999999999999
420,-0.12390999999999999
421,-0.12390999999999999
422,-0.12390999999999999
423,-0.12390999999999999
424,-0.12390999999999999
425,-0.12390999999999999
426,-0.12390999999999999
427,-0.12390999999999999
428,-0.12390999999999999
429,-0.12390999999999999
430,-0.12390999999999999
431,-0.12390999999999999
432,-0.12390999999999999
433,-0.12390999999999999
434,-0.12390999999999999
435,-0.12390999999999999
436,-0.12390999999999999
437,-0.12390999999999999
438,-0.12390999999999999
439,-0.12390999999999999
440,-0.12390999999999999
441,-0.12390999999999999
442,-0.12390999999999999
443,-0.12390999999999999
444,-0.12390999999999999
445,-0.12390999999999999
446,-0.12390999999999999
447,-0.12390999999999999
448,-0.12390999999999999
449,-0.12390999999999999
450,-0.12390999999999999
451,-0.12390999999999999
452,-0.12390999999999999
453,-0.12390999999999999
454,-0.12390999999999999
455,-0.12390999999999999
456,-0.12390999999999999
457,-0.12390999999999999
458,-0.12390999999999999
459,-0.12390999999999999
460,-0.12390999999999999
461,-0.12390999999999999
462,-0.12390999999999999
463,-0.12390999999999999
464,-0.12390999999999999
465,-0.12390999999999999
466,-0.12390999999999999
467,-0.12390999999999999
468,-0.12390999999999999
469,-0.12390999999999999
470,-0.12390999999999999
471,-0.12390999999999999
472,-0.12390999999999999
473,-0.12390999999999999
474,-0.12390999999999999
475,11.505999999999998
476,0.45565
477,-0.07239
478,-0.12390999999999999
479,-0.12390999999999999
480,-0.12390999999999999
481,-0.12390999999999999
482,-0.12390999999999999
483,-0.12390999999999999
484,-0.12390999999999999
485,-0.12390999999999999
486,-0.12390999999999999
487,-0.12390999999999999
488,-0.12390999999999999
489,-0.12390999999999999
490,-0.12390999999999999
491,-0.12390999999999999
492,-0.12390999999999999
493,-0.12390999999999999
494,-0.12390999999999999
495,-0.12390999999999999
496,-0.12390999999999999
497,-0.12390999999999999
498,-0.12390999999999999
499,-0.12390999999999999
500,-0.12390999999999999
501,-0.12390999999999999
502,-0.12390999999999999
503,-0.12390999999999999
504,-0.12390999999999999
505,-0.12390999999999999
506,-0.12390999999999999
507,-0.12390999999999999
508,-0.12390999999999999
509,-0.12390999999999999
510,-0.12390999999999999
511,-0.12390999999999999
512,-0.12390999999999999
513,-0.12390999999999999
514,-0.12390999999999999
515,-0.12390999999999999
516,-0.12390999999999999
517,-0.12390999999999999
518,-0.12390999999999999
519,-0.12390999999999999
520,-0.12390999999999999
521,-0.12390999999999999
522,-0.12390999999999999
523,-0.12390999999999999
524,-0.12390999999999999
525,-0.12390999999999999
526,-0.12390999999999999
527,-0.12390999999999999
528,-0.12390999999999999
529,5.2852
530,6.058
531,0.18519000000000002
532,-0.12390999999999999
533,-0.12390999999999999
534,-0.12390999999999999
535,-0.12390999999999999
536,-0.12390999999999999
537,-0.12390999999999999
538,-0.12390999999999999
539,-0.12390999999999999
540,-0.12390999999999999
541,-0.12390999999999999
542,-0.12390999999999999
543,-0.12390999999999999
544,-0.12390999999999999
545,-0.12390999999999999
546,-0.12390999999999999
547,4.0617
548,0.10790999999999999
549,-0.12390999999999999
550,-0.12390999999999999
551,-0.12390999999999999
552,-0.12390999999999999
553,-0.12390999999999999
554,-0.12390999999999999
555,-0.12390999999999999
556,-0.12390999999999999
557,-0.12390999999999999
558,-0.12390999999999999
559,-0.12390999999999999
560,-0.12390999999999999
561,-0.12390999999999999
562,-0.12390999999999999
563,-0.12390999999999999
564,-0.12390999999999999
565,-0.12390999999999999
566,-0.12390999999999999
567,-0.12390999999999999
568,-0.12390999999999999
569,-0.12390999999999999
570,-0.12390999999999999
571,-0.12390999999999999
572,-0.12390999999999999
573,-0.12390999999999999
574,-0.12390999999999999
575,-0.12390999999999999
576,-0.12390999999999999
577,-0.12390999999999999
578,-0.12390999999999999
579,-0.12390999999999999
580,-0.12390999999999999
581,-0.12390999999999999
582,-0.12390999999999999
583,-0.12390999999999999
584,-0.12390999999999999
585,-0.12390999999999999
586,-0.12390999999999999
587,-0.12390999999999999
588,-0.12390999999999999
589,-0.12390999999999999
590,-0.12390999999999999
591,-0.12390999999999999
592,-0.12390999999999999
593,-0.12390999999999999
594,-0.12390999999999999
595,-0.12390999999999999
596,-0.12390999999999999
597,-0.12390999999999999
598,-0.12390999999999999
599,-0.12390999999999999
600,-0.12390999999999999
601,-0.12390999999999999
602,-0.12390999999999999
603,-0.12390999999999999
604,-0.12390999999999999
605,-0.12390999999999999
606,-0.12390999999999999
607,-0.12390999999999999
608,-0.12390999999999999
609,-0.12390999999999999
610,-0.12390999999999999
611,-0.12390999999999999
612,-0.12390999999999999
613,-0.12390999999999999
614,-0.12390999999999999
615,-0.12390999999999999
616,-0.12390999999999999
617,-0.12390999999999999
618,-0.12390999999999999
619,-0.12390999999999999
620,-0.12390999999999999
621,-0.12390999999999999
622,-0.12390999999999999
623,-0.12390999999999999
624,-0.12390999999999999
625,-0.12390999999999999
626,-0.12390999999999999
627,-0.12390999999999999
628,-0.12390999999999999
629,-0.12390999999999999
630,-0.12390999999999999
631,-0.12390999999999999
632,-0.12390999999999999
633,-0.12390999999999999
634,-0.12390999999999999
635,-0.12390999999999999
636,-0.12390999999999999
637,-0.12390999999999999
638,-0.12390999999999999
639,2.9928
640,12.626
641,4.564
642,0.06927799999999999
643,-0.12390999999999999
644,-0.12390999999999999
645,-0.12390999999999999
646,-0.12390999999999999
647,-0.12390999999999999
648,-0.12390999999999999
649,-0.12390999999999999
650,-0.12390999999999999
651,8.6853
652,-0.11102999999999999
653,-0.12390999999999999
654,-0.12390999999999999
655,-0.12390999999999999
656,-0.12390999999999999
657,-0.12390999999999999
658,-0.12390999999999999
659,-0.12390999999999999
660,-0.12390999999999999
661,-0.12390999999999999
662,-0.12390999999999999
663,-0.12390999999999999
664,-0.12390999999999999
665,-0.12390999999999999
666,-0.12390999999999999
667,-0.12390999999999999
668,-0.12390999999999999
669,-0.12390999999999999
670,-0.12390999999999999
671,-0.12390999999999999
672,-0.12390999999999999
673,-0.12390999999999999
674,-0.12390999999999999
675,-0.12390999999999999
676,-0.12390999999999999
677,-0.12390999999999999
678,-0.12390999999999999
679,-0.12390999999999999
680,-0.12390999999999999
681,-0.12390999999999999
682,-0.12390999999999999
683,-0.12390999999999999
684,-0.12390999999999999
685,-0.12390999999999999
686,-0.12390999999999999
687,-0.12390999999999999
688,-0.12390999999999999
689,-0.12390999999999999
690,-0.12390999999999999
691,-0.12390999999999999
692,-0.12390999999999999
693,-0.12390999999999999
694,-0.12390999999999999
695,-0.12390999999999999
696,-0.12390999999999999
697,-0.12390999999999999
698,-0.12390999999999999
699,-0.12390999999999999
700,-0.12390999999999999
701,-0.12390999999999999
702,-0.12390999999999999
703,-0.12390999999999999
704,-0.12390999999999999
705,-0.12390999999999999
706,-0.12390999999999999
707,-0.12390999999999999
708,-0.12390999999999999
709,-0.12390999999999999
710,-0.12390999999999999
711,-0.12390999999999999
712,-0.12390999999999999
713,-0.12390999999999999
714,-0.12390999999999999
715,-0.12390999999999999
716,-0.12390999999999999
717,-0.12390999999999999
718,-0.12390999999999999
719,-0.12390999999999999
