time,value
0,-0.14393
1,-0.14393
2,-0.14393
3,-0.14393
4,-0.14393
5,-0.14393
6,-0.14393
7,-0.14393
8,-0.14393
9,-0.14393
10,-0.14393
11,-0.14393
12,-0.14393
13,-0.14393
14,-0.14393
15,-0.14393
16,-0.14393
17,-0.14393
18,-0.14393
19,-0.14393
20,-0.14393
21,-0.14393
22,-0.14393
23,-0.14393
24,-0.14393
25,-0.14393
26,-0.14393
27,-0.14393
28,-0.14393
29,-0.14393
30,-0.14393
31,-0.14393
32,-0.14393
33,-0.14393
34,-0.14393
35,-0.14393
36,-0.14393
37,-0.14393
38,-0.14393
39,-0.14393
40,-0.14393
41,-0.14393
42,-0.14393
43,-0.14393
44,-0.14393
45,-0.14393
46,-0.14393
47,-0.14393
48,-0.14393
49,-0.14393
50,-0.14393
51,-0.14393
52,-0.14393
53,-0.14393
54,-0.14393
55,-0.14393
56,-0.14393
57,-0.14393
58,-0.14393
59,-0.14393
60,-0.14393
61,-0.14393
62,-0.14393
63,-0.14393
64,-0.14393
65,-0.14393
66,-0.14393
67,-0.14393
68,-0.14393
69,-0.14393
70,-0.14393
71,-0.14393
72,-0.14393
73,-0.14393
74,-0.14393
75,-0.14393
76,-0.14393
77,-0.14393
78,-0.14393
79,-0.14393
80,-0.14393
81,-0.14393
82,-0.14393
83,-0.14393
84,-0.14393
85,-0.14393
86,-0.14393
87,-0.14393
88,-0.14393
89,-0.14393
90,-0.14393
91,-0.14393
92,-0.14393
93,-0.14393
94,-0.14393
95,-0.14393
96,-0.14393
97,-0.14393
98,-0.14393
99,-0.14393
100,-0.14393
101,-0.14393
102,-0.14393
103,-0.14393
104,-0.14393
105,-0.14393
106,-0.14393
107,-0.14393
108,-0.14393
109,-0.14393
110,-0.14393
111,-0.14393
112,-0.14393
113,-0.14393
114,-0.14393
115,-0.14393
116,-0.14393
117,-0.14393
118,-0.14393
119,-0.14393
120,-0.14393
121,-0.14393
122,-0.14393
123,-0.14393
124,-0.14393
125,-0.14393
126,-0.14393
127,-0.14393
128,-0.14393
129,-0.14393
130,-0.14393
131,-0.14393
132,-0.14393
133,-0.14393
134,-0.14393
135,-0.14393
136,-0.14393
137,-0.14393
138,-0.14393
139,-0.14393
140,-0.14393
141,-0.14393
142,-0.14393
143,-0.14393
144,-0.14393
145,-0.14393
146,-0.14393
147,-0.14393
148,-0.14393
149,-0.14393
150,-0.14393
151,-0.14393
152,-0.14393
153,-0.14393
154,-0.14393
155,-0.14393
156,-0.14393
157,-0.14393
158,-0.14393
159,-0.14393
160,-0.14393
161,-0.14393
162,-0.14393
163,-0.14393
164,-0.14393
165,-0.14393
166,-0.14393
167,-0.14393
168,-0.14393
169,-0.14393
170,-0.14393
171,-0.14393
172,-0.14393
173,-0.14393
174,-0.14393
175,-0.14393
176,-0.14393
177,-0.14393
178,-0.14393
179,6.129
180,6.8171
181,-0.11193
182,-0.14393
183,-0.14393
184,-0.14393
185,-0.14393
186,-0.14393
187,-0.14393
188,-0.14393
189,-0.14393
190,-0.14393
191,-0.14393
192,-0.14393
193,-0.14393
194,-0.14393
195,-0.14393
196,-0.14393
197,-0.14393
198,-0.14393
199,-0.14393
200,-0.14393
201,-0.14393
202,-0.14393
203,-0.14393
204,-0.14393
205,-0.14393
206,-0.14393
207,-0.14393
208,-0.14393
209,-0.14393
210,-0.14393
211,-0.14393
212,-0.14393
213,-0.14393
214,-0.14393
215,-0.14393
216,-0.14393
217,-0.14393
218,-0.14393
219,-0.14393
220,-0.14393
221,-0.14393
222,-0.14393
223,-0.14393
224,-0.14393
225,-0.14393
226,-0.14393
227,-0.14393
228,-0.14393
229,-0.14393
230,-0.14393
231,-0.14393
232,-0.14393
233,-0.14393
234,-0.14393
235,-0.14393
236,-0.14393
237,-0.14393
238,-0.14393
239,-0.14393
240,-0.14393
241,-0.14393
242,-0.14393
243,-0.14393
244,-0.14393
245,-0.14393
246,-0.14393
247,-0.14393
248,7.2972
249,5.4729
250,-0.015913999999999998
251,-0.14393
252,-0.14393
253,-0.14393
254,-0.14393
255,-0.14393
256,-0.14393
257,-0.14393
258,-0.14393
259,-0.14393
260,-0.14393
261,-0.14393
262,-0.14393
263,-0.14393
264,-0.14393
265,-0.14393
266,-0.14393
267,-0.14393
268,-0.14393
269,-0.14393
270,-0.14393
271,-0.14393
272,-0.14393
273,-0.14393
274,-0.14393
275,-0.14393
276,-0.14393
277,-0.14393
278,-0.14393
279,-0.14393
280,-0.14393
281,-0.14393
282,-0.14393
283,-0.14393
284,-0.14393
285,-0.14393
286,-0.14393
287,-0.14393
288,-0.14393
289,-0.14393
290,-0.14393
291,-0.14393
292,5.0569
293,6.129
294,0.14411
295,-0.14393
296,-0.14393
297,-0.14393
298,-0.14393
299,-0.14393
300,-0.14393
301,-0.14393
302,-0.14393
303,-0.14393
304,-0.14393
305,-0.14393
306,-0.14393
307,-0.14393
308,-0.14393
309,-0.14393
310,-0.14393
311,-0.14393
312,-0.14393
313,-0.14393
314,-0.14393
315,-0.14393
316,-0.14393
317,-0.14393
318,-0.14393
319,-0.14393
320,-0.14393
321,-0.14393
322,-0.14393
323,-0.14393
324,-0.14393
325,-0.14393
326,-0.14393
327,-0.14393
328,-0.14393
329,-0.14393
330,-0.14393
331,-0.14393
332,-0.14393
333,-0.14393
334,-0.14393
335,-0.14393
336,-0.14393
337,-0.14393
338,-0.14393
339,-0.14393
340,-0.14393
341,-0.14393
342,-0.14393
343,-0.14393
344,-0.14393
345,9.6496
346,4.8488
347,-0.047918
348,-0.14393
349,-0.14393
350,-0.14393
351,-0.14393
352,-0.14393
353,-0.14393
354,-0.14393
355,-0.14393
356,-0.14393
357,-0.14393
358,-0.14393
359,-0.14393
360,-0.14393
361,-0.14393
362,-0.14393
363,-0.14393
364,-0.14393
365,-0.14393
366,-0.14393
367,-0.14393
368,-0.14393
369,-0.14393
370,-0.14393
371,-0.14393
372,-0.14393
373,-0.14393
374,-0.14393
375,-0.14393
376,-0.14393
377,-0.14393
378,-0.14393
379,-0.14393
380,-0.14393
381,-0.14393
382,-0.14393
383,-0.14393
384,-0.14393
385,-0.14393
386,-0.14393
387,-0.14393
388,-0.14393
389,-0.14393
390,-0.14393
391,-0.14393
392,-0.14393
393,-0.14393
394,-0.14393
395,-0.14393
396,-0.14393
397,-0.14393
398,-0.14393
399,-0.14393
400,-0.14393
401,-0.14393
402,-0.14393
403,-0.14393
404,-0.14393
405,-0.14393
406,-0.14393
407,-0.14393
408,-0.14393
409,-0.14393
410,-0.14393
411,-0.14393
412,-0.14393
413,-0.14393
414,-0.14393
415,-0.14393
416,-0.14393
417,-0.14393
418,-0.14393
419,-0.14393
420,-0.14393
421,-0.14393
422,-0.14393
423,-0.14393
424,-0.14393
425,-0.14393
426,-0.14393
427,-0.14393
428,-0.14393
429,-0.14393
430,-0.14393
431,-0.14393
432,-0.14393
433,-0.14393
434,-0.14393
435,-0.14393
436,-0.14393
437,-0.14393
438,-0.14393
439,-0.14393
440,-0.14393
441,-0.14393
442,-0.14393
443,-0.14393
444,-0.14393
445,-0.14393
446,-0.14393
447,-0.14393
448,-0.14393
449,-0.14393
450,-0.14393
451,-0.14393
452,9.1055
453,6.5771
454,1.2003
455,-0.07992300000000001
456,-0.14393
457,-0.14393
458,-0.14393
459,-0.14393
460,-0.14393
461,-0.14393
462,-0.14393
463,-0.14393
464,-0.14393
465,-0.14393
466,-0.14393
467,8.5614
468,1.5363
469,-0.14393
470,-0.14393
471,-0.14393
472,-0.14393
473,-0.14393
474,-0.14393
475,-0.14393
476,-0.14393
477,-0.14393
478,-0.14393
479,-0.14393
480,-0.14393
481,-0.14393
482,-0.14393
483,-0.14393
484,-0.14393
485,-0.14393
486,-0.14393
487,-0.14393
488,-0.14393
489,-0.14393
490,-0.14393
491,-0.14393
492,-0.14393
493,-0.14393
494,-0.14393
495,-0.14393
496,-0.14393
497,-0.14393
498,-0.14393
499,-0.14393
500,-0.14393
501,-0.14393
502,-0.14393
503,-0.14393
504,-0.14393
505,-0.14393
506,-0.14393
507,-0.14393
508,-0.14393
509,-0.14393
510,-0.14393
511,-0.14393
512,-0.14393
513,-0.14393
514,-0.14393
515,-0.14393
516,-0.14393
517,-0.14393
518,7.7933
519,0.096103
520,-0.14393
521,-0.14393
522,-0.14393
523,-0.14393
524,-0.14393
525,-0.14393
526,-0.14393
527,-0.14393
528,-0.14393
529,-0.14393
530,-0.14393
531,-0.14393
532,-0.14393
533,-0.14393
534,-0.14393
535,-0.14393
536,-0.14393
537,-0.14393
538,-0.14393
539,-0.14393
540,-0.14393
541,-0.14393
542,-0.14393
543,-0.14393
544,-0.14393
545,-0.14393
546,-0.14393
547,-0.14393
548,-0.14393
549,-0.14393
550,-0.14393
551,-0.14393
552,-0.14393
553,-0.14393
554,-0.14393
555,-0.14393
556,-0.14393
557,-0.14393
558,-0.14393
559,-0.14393
560,-0.14393
561,-0.14393
562,-0.14393
563,-0.14393
564,-0.14393
565,-0.14393
566,-0.14393
567,-0.14393
568,-0.14393
569,-0.14393
570,-0.14393
571,-0.14393
572,-0.14393
573,-0.14393
574,-0.14393
575,-0.14393
576,-0.14393
577,-0.14393
578,-0.14393
579,-0.14393
580,-0.14393
581,-0.14393
582,-0.14393
583,-0.14393
584,-0.14393
585,-0.14393
586,-0.14393
587,-0.14393
588,-0.14393
589,-0.14393
590,-0.14393
591,-0.14393
592,-0.14393
593,-0.14393
594,-0.14393
595,-0.14393
596,4.8488
597,8.3053
598,1.0082
599,-0.14393
600,-0.14393
601,-0.14393
602,-0.14393
603,-0.14393
604,-0.14393
605,-0.14393
606,-0.14393
607,-0.14393
608,-0.14393
609,-0.14393
610,-0.14393
611,-0.14393
612,-0.14393
613,-0.14393
614,-0.14393
615,-0.14393
616,-0.14393
617,-0.14393
618,-0.14393
619,-0.14393
620,-0.14393
621,-0.14393
622,-0.14393
623,-0.14393
624,-0.14393
625,-0.14393
626,-0.14393
627,-0.14393
628,-0.14393
629,-0.14393
630,-0.14393
631,-0.14393
632,-0.14393
633,-0.14393
634,-0.14393
635,-0.14393
636,-0.14393
637,-0.14393
638,-0.14393
639,-0.14393
640,-0.14393
641,-0.14393
642,-0.14393
643,-0.14393
644,-0.14393
645,-0.14393
646,-0.14393
647,-0.14393
648,-0.14393
649,-0.14393
650,-0.14393
651,-0.14393
652,-0.14393
653,-0.14393
654,-0.14393
655,-0.14393
656,-0.14393
657,-0.14393
658,-0.14393
659,-0.14393
660,-0.14393
661,-0.14393
662,-0.14393
663,-0.14393
664,-0.14393
665,-0.14393
666,-0.14393
667,-0.14393
668,-0.14393
669,-0.14393
670,-0.14393
671,-0.14393
672,-0.14393
673,-0.14393
674,-0.14393
675,-0.14393
676,-0.14393
677,-0.14393
678,-0.14393
679,-0.14393
680,-0.14393
681,-0.14393
682,-0.14393
683,-0.14393
684,-0.14393
685,-0.14393
686,-0.14393
687,-0.14393
688,-0.14393
689,-0.14393
690,-0.14393
691,-0.14393
692,-0.14393
693,-0.14393
694,-0.14393
695,-0.14393
696,-0.14393
697,-0.14393
698,-0.14393
699,-0.14393
700,-0.14393
701,-0.14393
702,-0.14393
703,-0.14393
704,-0.14393
705,-0.14393
706,-0.14393
707,-0.14393
708,-0.14393
709,-0.14393
710,-0.14393
711,-0.14393
712,-0.14393
713,-0.14393
714,-0.14393
715,-0.14393
716,-0.14393
717,-0.14393
718,-0.14393
719,-0.14393
