time,value
0,-1.4594
1,-1.4548
2,-1.3567
3,-1.1616
4,-0.88192
5,-0.5313899999999999
6,-0.13771
7,0.26381
8,0.63317
9,0.93591
10,1.1482
11,1.2543
12,1.2541
13,1.1624
14,0.99097
15,0.7629
16,0.50035
17,0.22645
18,-0.043483
19,-0.29105
20,-0.4976
21,-0.65769
22,-0.76318
23,-0.81309
24,-0.8119
25,-0.76658
26,-0.6829999999999999
27,-0.5636
28,-0.4143
29,-0.24153000000000002
30,-0.049176
31,0.14991
32,0.33924
33,0.4982
34,0.6110399999999999
35,0.6672100000000001
36,0.66474
37,0.60854
38,0.5166
39,0.40346
40,0.29016
41,0.18022
42,0.078751
43,-0.014736
44,-0.10680999999999999
45,-0.19514
46,-0.27771
47,-0.353
48,-0.4173
49,-0.46395
50,-0.49513999999999997
51,-0.51991
52,-0.54555
53,-0.57177
54,-0.5926899999999999
55,-0.59195
56,-0.54364
57,-0.41708
58,-0.19769
59,0.11884000000000002
60,0.5141600000000001
61,0.94824
62,1.3655
63,1.7059
64,1.9064
65,1.922
66,1.7337
67,1.3474
68,0.79485
69,0.13097999999999999
70,-0.57444
71,-1.2505
72,-1.8315
73,-2.2638
74,-2.5147
75,-2.5684
76,-2.4276
77,-2.102
78,-1.6144
79,-0.99871
80,-0.29681
81,0.44805
82,1.1772
83,1.8336
84,2.3692
85,2.7339
86,2.897
87,2.8442
88,2.5833
89,2.1283
90,1.5159
91,0.7922100000000001
92,0.00047387
93,-0.80474
94,-1.5712
95,-2.237
96,-2.7510000000000003
97,-3.0639
98,-3.1341
99,-2.9447
100,-2.5041
101,-1.8466
102,-1.0305
103,-0.14142000000000002
104,0.7368600000000001
105,1.5258
106,2.1621
107,2.6027
108,2.8263
109,2.8319
110,2.6367
111,2.2638
112,1.7472
113,1.1244
114,0.43712
115,-0.26269000000000003
116,-0.93006
117,-1.5148
118,-1.9797
119,-2.292
120,-2.4321
121,-2.4025
122,-2.2078
123,-1.8647
124,-1.3995
125,-0.8408
126,-0.2224
127,0.41581999999999997
128,1.026
129,1.5646
130,1.9891
131,2.2592
132,2.3467
133,2.2437
134,1.9619
135,1.5254
136,0.9740700000000001
137,0.36056
138,-0.26108000000000003
139,-0.84595
140,-1.3459999999999999
141,-1.7279
142,-1.9678
143,-2.0481
144,-1.9669999999999999
145,-1.7321
146,-1.3684
147,-0.9089700000000001
148,-0.3938
149,0.13566
150,0.63454
151,1.0622
152,1.3946
153,1.6106
154,1.6984
155,1.6596
156,1.5015
157,1.2407
158,0.8946799999999999
159,0.49277
160,0.064278
161,-0.36053
162,-0.74802
163,-1.0698
164,-1.2999
165,-1.4228
166,-1.4299
167,-1.3230000000000002
168,-1.1159999999999999
169,-0.82878
170,-0.48927
171,-0.12583
172,0.22845
173,0.54807
174,0.8104899999999999
175,0.99823
176,1.0982
177,1.1105
178,1.0390000000000001
179,0.8914799999999999
180,0.68414
181,0.44278999999999996
182,0.18697
183,-0.060548000000000005
184,-0.27705
185,-0.44993999999999995
186,-0.56819
187,-0.6319899999999999
188,-0.64489
189,-0.61507
190,-0.55009
191,-0.46093999999999996
192,-0.3631
193,-0.26707
194,-0.18109
195,-0.109
196,-0.048068
197,0.0038539
198,0.055229999999999994
199,0.11435999999999999
200,0.18778
201,0.27671
202,0.37456999999999996
203,0.47662
204,0.56845
205,0.63357
206,0.65866
207,0.62732
208,0.53169
209,0.37091999999999997
210,0.1555
211,-0.099745
212,-0.36738000000000004
213,-0.61388
214,-0.8094600000000001
215,-0.9240700000000001
216,-0.9440700000000001
217,-0.8676200000000001
218,-0.70629
219,-0.48251000000000005
220,-0.22648000000000001
221,0.031045999999999997
222,0.27191
223,0.48056000000000004
224,0.6462
225,0.77127
226,0.8523700000000001
227,0.8821399999999999
228,0.8556600000000001
229,0.7682399999999999
230,0.61763
231,0.40495
232,0.14787
233,-0.13172
234,-0.40773000000000004
235,-0.65335
236,-0.84609
237,-0.9717899999999999
238,-1.0267
239,-1.01
240,-0.9209200000000001
241,-0.7650600000000001
242,-0.54742
243,-0.26875
244,0.05452100000000001
245,0.39999
246,0.73895
247,1.0378
248,1.2517
249,1.3529
250,1.3261
251,1.1659
252,0.88871
253,0.52546
254,0.12075999999999999
255,-0.29085
256,-0.66968
257,-0.9787299999999999
258,-1.2
259,-1.3197
260,-1.3308
261,-1.2305
262,-1.0306
263,-0.74512
264,-0.39605
265,-0.017049
266,0.35808
267,0.6963199999999999
268,0.9628899999999999
269,1.1375
270,1.2096
271,1.1854
272,1.071
273,0.8855200000000001
274,0.6512899999999999
275,0.38689
276,0.1107
277,-0.16065
278,-0.41233000000000003
279,-0.6312
280,-0.81094
281,-0.9378700000000001
282,-1.0056
283,-1.011
284,-0.94885
285,-0.81793
286,-0.62571
287,-0.38368
288,-0.10951
289,0.1746
290,0.44043000000000004
291,0.6632399999999999
292,0.8183600000000001
293,0.8965799999999999
294,0.8973899999999999
295,0.8251
296,0.69606
297,0.52736
298,0.34208
299,0.15657000000000001
300,-0.017535
301,-0.16997
302,-0.29667
303,-0.38844
304,-0.44597
305,-0.46776
306,-0.45823
307,-0.42531
308,-0.37225
309,-0.31361999999999995
310,-0.25288
311,-0.19825
312,-0.14415999999999998
313,-0.090914
314,-0.035204
315,0.031167
316,0.10478
317,0.18499000000000002
318,0.26966999999999997
319,0.34784
320,0.40731
321,0.44423999999999997
322,0.45507
323,0.43471000000000004
324,0.38369000000000003
325,0.30414
326,0.1949
327,0.060864
328,-0.086177
329,-0.23489000000000002
330,-0.37268
331,-0.48273
332,-0.54476
333,-0.55561
334,-0.51481
335,-0.42985
336,-0.31559
337,-0.18786
338,-0.05776
339,0.06927699999999999
340,0.19272999999999998
341,0.30649
342,0.41463
343,0.50902
344,0.57325
345,0.59244
346,0.55597
347,0.45824
348,0.2988
349,0.10527
350,-0.10107999999999999
351,-0.29698
352,-0.46226999999999996
353,-0.5807
354,-0.64881
355,-0.6751199999999999
356,-0.65457
357,-0.58626
358,-0.47138
359,-0.30559000000000003
360,-0.08555700000000001
361,0.17977
362,0.4603
363,0.72959
364,0.94657
365,1.0723
366,1.0847
367,0.97821
368,0.76648
369,0.47465
370,0.13887
371,-0.2019
372,-0.52387
373,-0.79988
374,-1.0154
375,-1.1599
376,-1.227
377,-1.2087
378,-1.095
379,-0.88505
380,-0.5906899999999999
381,-0.22574
382,0.17948
383,0.58737
384,0.9536899999999999
385,1.2446
386,1.4284
387,1.4851
388,1.4102
389,1.2195
390,0.9306
391,0.5726
392,0.17317000000000002
393,-0.22983
394,-0.607
395,-0.9313799999999999
396,-1.1746
397,-1.3174
398,-1.3492
399,-1.2772
400,-1.1091
401,-0.8626299999999999
402,-0.56502
403,-0.23596
404,0.09741699999999999
405,0.41333000000000003
406,0.69488
407,0.9280700000000001
408,1.0962
409,1.1819
410,1.1809
411,1.0829
412,0.89326
413,0.623
414,0.30022
415,-0.043723000000000005
416,-0.37363
417,-0.6591600000000001
418,-0.8733799999999999
419,-1.0051
420,-1.0484
421,-1.0039
422,-0.88061
423,-0.68735
424,-0.44338
425,-0.1659
426,0.12531
427,0.40671999999999997
428,0.6522100000000001
429,0.83205
430,0.9296399999999999
431,0.9360299999999999
432,0.85
433,0.6843600000000001
434,0.46492
435,0.21786
436,-0.033336000000000005
437,-0.2598
438,-0.45463000000000003
439,-0.60595
440,-0.70705
441,-0.75752
442,-0.75043
443,-0.69077
444,-0.57355
445,-0.40702
446,-0.20926999999999998
447,0.0061016
448,0.21939
449,0.41039
450,0.55871
451,0.65898
452,0.70985
453,0.71003
454,0.66292
455,0.5755100000000001
456,0.44908000000000003
457,0.28898
458,0.10319
459,-0.095087
460,-0.29331999999999997
461,-0.47156000000000003
462,-0.61228
463,-0.7005600000000001
464,-0.7318
465,-0.70665
466,-0.63257
467,-0.52288
468,-0.38961999999999997
469,-0.24243
470,-0.081495
471,0.090141
472,0.27213000000000004
473,0.46157
474,0.64237
475,0.79533
476,0.89499
477,0.91815
478,0.85005
479,0.69085
480,0.45387
481,0.17163
482,-0.11813
483,-0.37964000000000003
484,-0.58428
485,-0.71759
486,-0.7803399999999999
487,-0.78804
488,-0.7531899999999999
489,-0.6843899999999999
490,-0.5934
491,-0.47594
492,-0.33021
493,-0.15625999999999998
494,0.03848
495,0.23847
496,0.42223999999999995
497,0.5646
498,0.65327
499,0.6836399999999999
