time,value
0,-1.3682
1,-1.3682
2,-1.3682
3,-1.3682
4,-1.3682
5,-1.3682
6,-1.3682
7,-1.3682
8,-1.3682
9,-1.3682
10,-1.3682
11,-1.3682
12,-1.3682
13,-1.3682
14,-1.3682
15,-1.3682
16,-1.3682
17,-1.3682
18,-1.3682
19,-1.3682
20,-1.3682
21,-1.3682
22,-1.3682
23,-1.3682
24,-1.3682
25,-1.3682
26,-1.3682
27,-1.3682
28,-1.3682
29,-1.3682
30,-1.3682
31,-1.3682
32,-1.3682
33,-1.3682
34,-1.3682
35,-1.3682
36,-1.3682
37,-1.3682
38,-1.3682
39,-1.3682
40,-1.3682
41,-1.3682
42,-1.3682
43,-1.3682
44,-1.3682
45,-1.3682
46,-1.3682
47,-1.3682
48,-1.3682
49,-1.3682
50,-1.3682
51,-1.3682
52,-1.3682
53,-1.3682
54,-1.3682
55,-1.3682
56,-1.3682
57,-1.3682
58,-1.3512
59,-1.1895
60,-0.88526
61,-0.10705
62,-0.53108
63,-0.18139
64,-0.204
65,-0.25085
66,-0.12180999999999999
67,0.18853
68,-0.054825
69,-0.19489
70,-0.17374
71,-0.41617
72,-0.30282
73,-0.07763400000000001
74,-0.21104
75,-0.4318
76,-0.16798
77,-0.26025
78,-0.26921999999999996
79,-0.42465
80,-0.35427
81,-0.541
82,-0.2897
83,-0.3475
84,0.058852
85,-0.099979
86,-0.24704
87,-0.18899000000000002
88,-0.16485
89,0.17375
90,-0.15805
91,-0.042449
92,-0.13335999999999998
93,-0.066459
94,-0.49722
95,-0.14552
96,-0.46301000000000003
97,-0.27696
98,-0.18432
99,-0.22164
100,0.31173
101,-0.29895
102,0.19483
103,0.28081
104,-0.082804
105,-0.17535
106,-0.12192
107,-0.00062994
108,-0.06299099999999999
109,-0.15924000000000002
110,-0.015368000000000001
111,-0.35158
112,-0.52389
113,-0.027017000000000003
114,0.18682
115,-0.083592
116,-0.038758999999999995
117,0.51369
118,-0.047473
119,-0.31973
120,0.13468
121,-0.087966
122,-0.10017999999999999
123,-0.006408800000000001
124,-0.15842
125,-0.28523000000000004
126,-0.35270999999999997
127,0.13798
128,0.027973
129,0.097202
130,-0.23849
131,-0.16994
132,-0.069323
133,0.3167
134,-0.029568
135,-0.32786
136,-0.14106
137,0.28835
138,0.17454
139,-0.20506
140,0.2157
141,-0.38855
142,0.34119
143,-0.20515999999999998
144,-0.068243
145,-0.14672000000000002
146,0.35949000000000003
147,0.074866
148,0.34976
149,0.30761
150,0.51904
151,0.14845999999999998
152,-0.27435
153,-0.34064
154,0.31374
155,0.009323999999999999
156,-0.0037403
157,-0.19934000000000002
158,0.036157999999999996
159,-0.13324
160,-0.08943999999999999
161,-0.13245
162,-0.45106999999999997
163,1.4909
164,-0.20109000000000002
165,1.018
166,0.64883
167,0.63574
168,0.01599
169,-0.2422
170,-0.33828
171,0.19043
172,-0.22973000000000002
173,-0.079456
174,0.4073
175,0.299
176,0.5948
177,0.5355
178,0.7197600000000001
179,0.63515
180,0.18887
181,0.0027267
182,0.71109
183,0.61338
184,0.3019
185,0.61927
186,-0.27236
187,-0.47826
188,0.086633
189,0.37983
190,0.6066
191,0.92268
192,0.22974
193,0.13691
194,0.1742
195,0.32461
196,0.15050999999999998
197,0.6638
198,0.7943100000000001
199,0.20492
200,0.061279999999999994
201,-0.14594000000000001
202,0.59797
203,1.4491
204,0.12247000000000001
205,1.0277
206,0.50029
207,0.62192
208,0.07596
209,-0.046447
210,0.38778
211,0.7299
212,0.7719199999999999
213,0.91159
214,0.63917
215,0.91604
216,-0.072491
217,0.17442
218,-0.029089
219,0.14203
220,1.0653
221,0.35141
222,0.5231899999999999
223,0.5293899999999999
224,1.4239
225,0.16876
226,-0.0581
227,0.32005
228,0.66659
229,0.97164
230,0.5859300000000001
231,0.22483000000000003
232,0.8891600000000001
233,0.84552
234,1.3
235,0.65979
236,0.10557000000000001
237,0.027489
238,1.1092
239,0.37155
240,0.7070000000000001
241,0.6360600000000001
242,0.38235
243,0.63331
244,0.71439
245,0.46313000000000004
246,0.7783399999999999
247,0.8222
248,0.33464
249,0.7363
250,1.393
251,1.157
252,0.73844
253,1.2756
254,-0.27076999999999996
255,0.58032
256,0.64403
257,2.5066
258,1.2157
259,0.94504
260,1.3434
261,1.2830000000000001
262,0.95814
263,0.61428
264,0.8828299999999999
265,1.4964
266,1.2509
267,0.9743200000000001
268,2.2321
269,5.4074
270,4.1297
271,3.8919
272,4.0984
273,2.2585
274,1.9764
275,1.6517
276,2.4892
277,1.521
278,2.9501
279,1.3777
280,1.3051
281,1.1461
282,1.1558
283,0.66499
284,0.73259
285,0.1741
286,0.8360700000000001
287,0.039356999999999996
288,0.047023
289,1.4696
290,0.95981
291,0.53927
292,0.75549
293,-0.07117799999999999
294,0.28195
295,0.4765
296,0.85326
297,-0.24272
298,1.2622
299,0.42351000000000005
300,0.27276
301,0.22795
302,-0.11020999999999999
303,-0.042892
304,0.27895
305,-0.5111
306,-0.74436
307,-0.70586
308,-0.85846
309,-0.72616
310,-0.8333799999999999
311,-0.90407
312,-0.8460200000000001
313,-1.0206
314,-0.9034200000000001
315,-1.1539
316,-1.3098
317,-1.3682
318,-1.3682
