time,value
0,-1.7686
1,-1.6840000000000002
2,-1.5847
3,-1.4711
4,-1.3305
5,-1.1435
6,-0.92056
7,-0.67876
8,-0.44461999999999996
9,-0.22288000000000002
10,-0.021283
11,0.16864
12,0.34059
13,0.49001999999999996
14,0.57836
15,0.57548
16,0.46411
17,0.28304
18,0.082311
19,-0.075351
20,-0.15367999999999998
21,-0.12959
22,-0.024444999999999998
23,0.12887
24,0.29885
25,0.4801
26,0.66784
27,0.8602799999999999
28,1.0596
29,1.2692
30,1.4729
31,1.6373
32,1.7442
33,1.7994
34,1.8218
35,1.8185
36,1.7909
37,1.7257
38,1.6048
39,1.4104
40,1.1524
41,0.85585
42,0.54982
43,0.25267
44,-0.013987000000000001
45,-0.24494000000000002
46,-0.44623999999999997
47,-0.6368
48,-0.8114399999999999
49,-0.96495
50,-1.0891
51,-1.1958
52,-1.2763
53,-1.3308
54,-1.3522
55,-1.3594
56,-1.3535
57,-1.3446
58,-1.3226
59,-1.2943
60,-1.2474
61,-1.1874
62,-1.1095
63,-1.0331
64,-0.9604299999999999
65,-0.9027799999999999
66,-0.84511
67,-0.78676
68,-0.71682
69,-0.65274
70,-0.5979300000000001
71,-0.56386
72,-0.53792
73,-0.52489
74,-0.5179699999999999
75,-0.51649
76,-0.49786
77,-0.45326000000000005
78,-0.37717
79,-0.27255
80,-0.13127
81,0.045744
82,0.24706
83,0.45087
84,0.64356
85,0.81594
86,0.96962
87,1.1104
88,1.2403
89,1.3403
90,1.3886
91,1.3786
92,1.3117
93,1.1638
94,0.8989799999999999
95,0.51808
96,0.08498700000000001
97,-0.31388
98,-0.62126
99,-0.8271
100,-0.94968
101,-1.0157
102,-1.0496
103,-1.0653
104,-1.0669
105,-1.0503
106,-1.0195
107,-0.9818899999999999
108,-0.94871
109,-0.91599
110,-0.88387
111,-0.8511
112,-0.82584
113,-0.79415
114,-0.74166
115,-0.6519199999999999
116,-0.53573
117,-0.40251
118,-0.26671999999999996
119,-0.12905999999999998
120,0.0050418
121,0.14094
122,0.27818000000000004
123,0.42633999999999994
124,0.58341
125,0.75346
126,0.9293600000000001
127,1.1136
128,1.306
129,1.5146
130,1.7309999999999999
131,1.9478
132,2.1543
133,2.3564
134,2.545
135,2.7094
136,2.8323
137,2.9168
138,2.9607
139,2.971
140,2.9534
141,2.9164
142,2.8169999999999997
143,2.5792
144,2.1408
145,1.5442
146,0.91371
147,0.39019000000000004
148,0.032106
149,-0.17815999999999999
150,-0.29959
151,-0.37226
152,-0.42412
153,-0.47103999999999996
154,-0.5284800000000001
155,-0.59546
156,-0.6644800000000001
157,-0.72059
158,-0.74964
159,-0.74065
160,-0.69776
161,-0.64003
162,-0.5872
163,-0.5526399999999999
164,-0.5413100000000001
165,-0.55597
166,-0.5898800000000001
167,-0.6269
168,-0.64959
169,-0.64957
170,-0.63208
171,-0.60743
172,-0.58225
173,-0.5583600000000001
174,-0.53715
175,-0.52441
176,-0.52496
177,-0.53875
178,-0.5557
179,-0.56255
180,-0.54589
181,-0.5033
182,-0.43985
183,-0.37128
184,-0.30501
185,-0.24165999999999999
186,-0.16884000000000002
187,-0.088462
188,-0.011123000000000001
189,0.041234
190,0.06827000000000001
191,0.075807
192,0.079044
193,0.07090700000000001
194,0.047116000000000005
195,-0.0063216
196,-0.07999099999999999
197,-0.16876
198,-0.2516
199,-0.32543
200,-0.37765
201,-0.4123
202,-0.41953999999999997
203,-0.40154
204,-0.34295
205,-0.24086
206,-0.081011
207,0.12722999999999998
208,0.36601999999999996
209,0.58878
210,0.77227
211,0.9204100000000001
212,1.0665
213,1.204
214,1.2938
215,1.2915
216,1.2082
217,1.0797
218,0.9383299999999999
219,0.7858
220,0.62946
221,0.48868
222,0.38777
223,0.31979
224,0.25292
225,0.15500999999999998
226,0.027807
227,-0.099962
228,-0.19780999999999999
229,-0.25644
230,-0.28665999999999997
231,-0.30344
232,-0.31728
233,-0.33199
234,-0.35516
235,-0.39547
236,-0.46033
237,-0.54214
238,-0.62607
239,-0.69618
240,-0.74955
241,-0.78841
242,-0.81897
243,-0.8408899999999999
244,-0.8566600000000001
245,-0.86534
246,-0.86639
247,-0.84836
248,-0.8021699999999999
249,-0.72232
250,-0.61784
251,-0.49503
252,-0.36056
253,-0.21338000000000001
254,-0.067272
255,0.05733099999999999
256,0.13685999999999998
257,0.17107
258,0.16848
259,0.14476
260,0.11007
261,0.072973
262,0.015208000000000001
263,-0.097385
264,-0.2914
265,-0.5624
266,-0.9005
267,-1.2769
268,-1.6166
269,-1.8164
