time,value
0,-0.34031
1,-0.34031
2,-0.34031
3,-0.34031
4,-0.34031
5,-0.34031
6,-0.34031
7,-0.34031
8,-0.34031
9,-0.34031
10,-0.34031
11,-0.34031
12,-0.34031
13,-0.34031
14,-0.34031
15,-0.34031
16,-0.34031
17,-0.34031
18,-0.34031
19,-0.34031
20,-0.34031
21,-0.349
22,-0.36173
23,-0.3763
24,-0.39124000000000003
25,-0.40521
26,-0.4172
27,-0.4172
28,-0.4172
29,-0.4172
30,-0.41906000000000004
31,-0.42322
32,-0.43385
33,-0.44878999999999997
34,-0.46371999999999997
35,-0.47866000000000003
36,-0.48694
37,-0.49409
38,-0.49409
39,-0.49409
40,-0.49409
41,-0.49409
42,-0.49409
43,-0.49409
44,-0.49409
45,-0.49409
46,-0.49409
47,-0.49409
48,-0.49409
49,-0.49409
50,-0.49409
51,-0.49409
52,-0.49409
53,-0.49409
54,-0.49409
55,-0.49409
56,-0.49409
57,-0.49409
58,-0.49409
59,-0.49409
60,-0.49409
61,-0.49448000000000003
62,-0.5028100000000001
63,-0.51245
64,-0.5273899999999999
65,-0.54233
66,-0.5572699999999999
67,-0.5722
68,-0.58714
69,-0.6020800000000001
70,-0.6170100000000001
71,-0.63195
72,-0.64689
73,-0.66183
74,-0.67676
75,-0.6917
76,-0.7066399999999999
77,-0.7215699999999999
78,-0.73651
79,-0.75145
80,-0.76639
81,-0.78132
82,-0.7918
83,-0.80061
84,-0.80165
85,-0.80165
86,-0.80165
87,-0.8034
88,-0.81271
89,-0.8239299999999999
90,-0.8388700000000001
91,-0.8538100000000001
92,-0.86874
93,-0.8756
94,-0.87805
95,-0.87854
96,-0.87854
97,-0.8799399999999999
98,-0.8844200000000001
99,-0.9142899999999999
100,-0.94416
101,-0.97404
102,-1.0007
103,-1.0227
104,-1.0323
105,-1.0323
106,-1.0323
107,-1.0323
108,-1.0385
109,-1.0458
110,-1.0607
111,-1.0757
112,-1.0906
113,-1.1021
114,-1.1068
115,-1.1092
116,-1.1092
117,-1.1092
118,-1.1092
119,-1.1092
120,-1.1092
121,-1.1092
122,-1.1089
123,-1.1055
124,-1.0955
125,-1.0656
126,-1.0357
127,-1.0059
128,-0.9787100000000001
129,-0.95373
130,-0.93584
131,-0.9209
132,-0.90596
133,-0.89112
134,-0.8842700000000001
135,-0.87854
136,-0.87854
137,-0.87854
138,-0.87854
139,-0.87854
140,-0.87854
141,-0.87854
142,-0.87854
143,-0.87854
144,-0.87854
145,-0.86511
146,-0.85062
147,-0.8356899999999999
148,-0.8213799999999999
149,-0.80914
150,-0.80165
151,-0.80165
152,-0.80165
153,-0.80165
154,-0.80165
155,-0.80165
156,-0.80165
157,-0.80165
158,-0.80165
159,-0.8002600000000001
160,-0.7912
161,-0.7803399999999999
162,-0.76541
163,-0.75047
164,-0.73553
165,-0.71311
166,-0.68592
167,-0.65668
168,-0.6268100000000001
169,-0.59738
170,-0.56902
171,-0.55408
172,-0.53914
173,-0.5242100000000001
174,-0.50789
175,-0.48928
176,-0.4647
177,-0.43483
178,-0.40496
179,-0.37508
180,-0.35666
181,-0.3405
182,-0.34031
183,-0.34031
184,-0.34031
185,-0.33736
186,-0.32732
187,-0.31509000000000004
188,-0.30015
189,-0.28520999999999996
190,-0.27026999999999995
191,-0.25534
192,-0.2404
193,-0.22546
194,-0.21061
195,-0.19714
196,-0.18653
197,-0.18653
198,-0.18653
199,-0.18653
200,-0.18653
201,-0.18653
202,-0.18653
203,-0.18653
204,-0.18653
205,-0.18653
206,-0.18653
207,-0.18653
208,-0.18653
209,-0.18653
210,-0.18653
211,-0.17694000000000001
212,-0.1549
213,-0.12825
214,-0.48131999999999997
215,-0.33195
216,-0.18257
217,-0.2064
218,0.11617000000000001
219,0.26554
220,0.41736
221,0.11367999999999999
222,0.15042
223,0.19523
224,0.24004
225,0.28485
226,0.32595
227,0.36513
228,0.39676
229,0.42663
230,0.45651
231,0.48638000000000003
232,0.51626
233,0.54613
234,0.5760000000000001
235,0.60588
236,0.63575
237,0.66563
238,0.6955
239,0.72538
240,0.75525
241,0.78513
242,0.815
243,0.84488
244,0.87475
245,0.9046200000000001
246,0.9356700000000001
247,0.9689700000000001
248,1.008
249,1.0528
250,1.0976
251,1.1424
252,1.1766
253,1.2082
254,1.2239
255,1.2389
256,1.2538
257,1.2713
258,1.296
259,1.3229
260,1.3527
261,1.3826
262,1.4125
263,1.4424
264,1.4722
265,1.5021
266,1.5319999999999998
267,1.5606
268,1.5868
269,1.6018
270,1.6167
271,1.6317
272,1.6466
273,1.6615
274,1.6765
275,1.6914
276,1.7063
277,1.7213
278,1.7362
279,1.7511
280,1.7661
281,1.781
282,1.796
283,1.8109
284,1.8258
285,1.8408
286,1.8557
287,1.8706
288,1.8856
289,1.9005
290,1.9155
291,1.9304
292,1.945
293,1.9577
294,1.9664
295,1.9664
296,1.9664
297,1.9664
298,1.9698
299,1.9751
300,1.9879
301,2.0029
302,2.0178
303,2.0328
304,2.0477
305,2.0626
306,2.0776
307,2.0925
308,2.1074
309,2.1224
310,2.1373
311,2.1522
312,2.1672
313,2.1821
314,2.1971
315,-0.7641600000000001
316,-0.7641600000000001
317,-0.7641600000000001
318,-0.7641600000000001
319,-0.7641600000000001
320,-0.7641600000000001
321,-0.7641600000000001
322,-0.7641600000000001
323,-0.7641600000000001
324,-0.7641600000000001
325,-0.7641600000000001
326,-0.7641600000000001
327,-0.7641600000000001
328,-0.7641600000000001
329,-0.7641600000000001
330,-0.7641600000000001
331,-0.7641600000000001
332,-0.7641600000000001
333,-0.7641600000000001
334,-0.7641600000000001
335,-0.7641600000000001
336,-0.78358
337,-0.81204
338,-0.8446100000000001
339,-0.8779899999999999
340,-0.9092100000000001
341,-0.9359999999999999
342,-0.9359999999999999
343,-0.9359999999999999
344,-0.9359999999999999
345,-0.94016
346,-0.9494600000000001
347,-0.97321
348,-1.0066
349,-1.04
350,-1.0734
351,-1.0919
352,-1.1078
353,-1.1078
354,-1.1078
355,-1.1078
356,-1.1078
357,-1.1078
358,-1.1078
359,-1.1078
360,-1.1078
361,-1.1078
362,-1.1078
363,-1.1078
364,-1.1078
365,-1.1078
366,-1.1078
367,-1.1078
368,-1.1078
369,-1.1078
370,-1.1078
371,-1.1078
372,-1.1078
373,-1.1078
374,-1.1078
375,-1.1078
376,-1.1078
377,-1.1078
378,-1.1078
379,-1.1078
380,-1.1078
381,-1.1078
382,-1.1078
383,-1.1078
384,-1.1078
385,-1.1078
386,-1.1078
387,-1.1078
388,-1.1395
389,-1.1724
390,-1.2058
391,-1.2374
392,-1.2642
393,-1.2797
394,-1.2797
395,-1.2797
396,-1.2797
397,-1.2697
398,-1.256
399,-1.225
400,-1.1916
401,-1.1582
402,-1.1248
403,-1.0914
404,-1.058
405,-1.0247
406,-0.9912700000000001
407,-0.9578899999999999
408,-0.94257
409,-0.9371
410,-0.9359999999999999
411,-0.9359999999999999
412,-0.9359999999999999
413,-0.9359999999999999
414,-0.9359999999999999
415,-0.9359999999999999
416,-0.9359999999999999
417,-0.9359999999999999
418,-0.9359999999999999
419,-0.9359999999999999
420,-0.9359999999999999
421,-0.9359999999999999
422,-0.9359999999999999
423,-0.9359999999999999
424,-0.9359999999999999
425,-0.9359999999999999
426,-0.9359999999999999
427,-0.9359999999999999
428,-0.92843
429,-0.9054399999999999
430,-0.87744
431,-0.84406
432,-0.8106800000000001
433,-0.7772899999999999
434,-0.76764
435,-0.76435
436,-0.7641600000000001
437,-0.7641600000000001
438,-0.7641600000000001
439,-0.7641600000000001
440,-0.7641600000000001
441,-0.7641600000000001
442,-0.7641600000000001
443,-0.7581100000000001
444,-0.74716
445,-0.72038
446,-0.687
447,-0.65361
448,-0.6202300000000001
449,-0.58685
450,-0.55347
451,-0.52008
452,-0.4867
453,-0.45332
454,-0.43178
455,-0.42357
456,-0.42048
457,-0.42048
458,-0.42048
459,-0.42048
460,-0.42048
461,-0.42048
462,-0.42048
463,-0.42048
464,-0.42048
465,-0.42048
466,-0.42048
467,-0.42048
468,-0.42048
469,-0.40225
470,-0.37598000000000004
471,-0.31540999999999997
472,-0.24864
473,-0.18187
474,-0.1213
475,-0.46461
476,-0.37345
477,-0.37345
478,-0.37345
479,-0.37345
480,-0.37345
481,-0.37345
482,-0.37345
483,-0.37345
484,-0.36841999999999997
485,-0.35156
486,-0.18464
487,-0.10323
488,0.14919000000000002
489,0.30065
490,0.42651999999999995
491,0.48575
492,0.48575
493,0.48575
494,0.48575
495,0.10784
496,0.12315999999999999
497,0.15633
498,0.18972
499,0.2231
500,0.24988000000000002
501,0.26083
502,0.26688
503,0.26688
504,0.26688
505,0.26688
506,0.26688
507,0.26688
508,0.26688
509,0.26688
510,0.26688
511,0.26688
512,0.26688
513,0.26688
514,0.26688
515,0.26688
516,0.26688
517,0.26688
518,0.26688
519,0.26688
520,0.26688
521,0.28398
522,0.30355
523,0.33693
524,0.37031
525,0.4037
526,0.43708
527,0.47046000000000004
528,0.50384
529,0.53723
530,0.5706100000000001
531,0.6039899999999999
532,0.6373800000000001
533,0.67076
534,0.70414
535,0.73753
536,0.77091
537,0.80429
538,0.83767
539,0.8710600000000001
540,0.9044399999999999
541,0.9378200000000001
542,0.97121
543,1.0046
544,1.038
545,1.0714
546,1.1024
547,1.1161
548,1.1261
549,1.1261
550,1.1261
551,1.1261
552,1.1261
553,1.1261
554,1.1261
555,1.1261
556,1.1261
557,1.1261
558,1.1261
559,1.1261
560,1.1261
561,1.1261
562,1.1261
563,1.1261
564,1.1261
565,1.1261
566,1.1261
567,1.1261
568,1.1261
569,1.1261
570,1.1261
571,1.1261
572,1.1374
573,1.1812
574,1.2344
575,1.3012
576,1.368
577,1.4347
578,1.4807
579,1.5184
580,1.5524
581,1.5858
582,1.6192
583,1.6525
584,1.6859
585,1.7193
586,1.7527
587,1.7766
588,1.7903
589,1.774
590,1.7407
591,1.7073
592,1.6739
593,1.6565
594,1.6416
595,1.6416
596,1.6416
597,1.6416
598,1.6416
599,1.6416
600,1.6416
601,1.6416
602,1.6416
603,1.6416
604,1.6148
605,1.5836
606,1.5502
607,1.5176
608,1.4892
609,1.4698
610,1.4698
611,1.4698
612,1.4698
613,1.4623
614,1.4502
615,1.4216
616,1.3882
617,1.3548
618,1.3230000000000002
619,1.3088
620,1.2979
621,1.2979
622,1.2979
623,1.2979
624,1.2979
625,1.2979
626,1.2979
627,1.2979
628,1.2979
629,1.2979
630,0.19625
631,0.19625
632,0.19625
633,0.19625
634,0.19625
635,0.19625
636,0.19625
637,0.19625
638,0.19625
639,0.19625
640,0.19625
641,0.19625
642,0.19625
643,0.19625
644,0.19625
645,0.19625
646,0.19625
647,0.19625
648,0.19625
649,0.19625
650,0.19625
651,0.19625
652,0.19625
653,0.19625
654,0.19625
655,0.19625
656,0.19625
657,0.19625
658,0.19625
659,0.19625
660,0.19191
661,0.18219000000000002
662,0.1574
663,0.12255
664,0.44906
665,0.27481
666,0.17819000000000002
667,0.09484400000000001
668,0.09484400000000001
669,0.09484400000000001
670,0.09484400000000001
671,0.09484400000000001
672,0.09484400000000001
673,0.09484400000000001
674,0.09484400000000001
675,0.09484400000000001
676,0.09484400000000001
677,0.09484400000000001
678,0.09484400000000001
679,0.09484400000000001
680,0.09484400000000001
681,0.09484400000000001
682,0.09484400000000001
683,0.09484400000000001
684,0.09484400000000001
685,0.09484400000000001
686,0.09484400000000001
687,0.09484400000000001
688,0.09484400000000001
689,0.09484400000000001
690,0.09484400000000001
691,0.09484400000000001
692,0.09484400000000001
693,0.09484400000000001
694,0.09484400000000001
695,0.09484400000000001
696,0.09484400000000001
697,0.09484400000000001
698,0.09484400000000001
699,0.09484400000000001
700,0.09484400000000001
701,0.09484400000000001
702,0.09484400000000001
703,0.26019000000000003
704,0.43191999999999997
705,0.11912
706,0.15212
707,0.18011
708,0.19625
709,0.19625
710,0.19625
711,0.19625
712,0.20667
713,0.22095
714,0.25338
715,0.28823000000000004
716,0.32308000000000003
717,0.34976
718,0.34119
719,0.32365
720,0.2888
721,0.25395
722,0.2191
723,0.2031
724,0.19739
725,0.19625
726,0.19625
727,0.19788
728,0.20310999999999998
729,0.23795
730,0.2728
731,0.30765
732,0.33874
733,0.36445
734,0.37564000000000003
735,0.37564000000000003
736,0.37564000000000003
737,0.37564000000000003
738,0.37564000000000003
739,0.37564000000000003
740,0.37564000000000003
741,0.37564000000000003
742,0.37564000000000003
743,0.36774
744,0.34374
745,0.31451
746,0.27965999999999996
747,0.24481
748,0.20995999999999998
749,0.17511
750,0.14026
751,0.10540999999999999
752,0.36148
753,0.16723
754,-0.065122
755,-0.41362
756,-0.15453
757,-0.22423
758,-0.2813
759,-0.32815
760,-0.34192
761,-0.34192
762,-0.34192
763,-0.3417
764,-0.32285
765,-0.30136
766,-0.26650999999999997
767,-0.23165999999999998
768,-0.19680999999999998
769,-0.17432999999999998
770,-0.16576
771,-0.16253
772,-0.16253
773,-0.16253
774,-0.16253
775,-0.19386
776,-0.22766
777,-0.26250999999999997
778,-0.29588000000000003
779,-0.32445
780,-0.34192
781,-0.34192
782,-0.34192
783,-0.34192
784,-0.35144000000000003
785,-0.36515
786,-0.39676999999999996
787,-0.43162
788,-0.46647
789,-0.50132
790,-0.53617
791,-0.57102
792,-0.60587
793,-0.64072
794,-0.67557
795,-0.7278899999999999
796,-0.7913100000000001
797,-0.8595299999999999
798,-0.9292299999999999
799,-0.9978799999999999
800,-1.0641
801,-1.0989
802,-1.1338
803,-1.1686
804,-1.2067
805,-1.2501
806,-1.3074
807,-1.3771
808,-1.4468
809,-1.5165
810,-1.5595
811,-1.5972
812,-1.5977
813,-1.5977
814,-1.5977
815,-1.6045
816,-1.6280000000000001
817,-1.6565
818,-1.6914
819,-1.7262
820,-1.7611
821,-1.7959
822,-1.8308
823,-1.8656
824,-1.9003
825,-1.9317
826,-1.9564
827,-1.9564
828,-1.9564
829,-1.9564
830,-1.9564
831,-1.9564
832,-1.9564
833,-1.9564
834,-1.9564
835,-1.9564
836,-1.9207
837,-1.8799
838,-1.8102
839,-1.7405
840,-1.6708
841,-1.6123
842,-1.5683
843,-1.5297
844,-1.4948
845,-1.46
846,-1.4251
847,-1.3606
848,-1.2926
849,-1.2229
850,-1.1543
851,-1.0903
852,-1.0366
853,-1.0018
854,-0.96693
855,-0.93209
856,-0.89723
857,-0.86239
858,-0.8275399999999999
859,-0.79269
860,-0.75784
861,-0.7205699999999999
862,-0.66515
863,-0.60587
864,-0.53617
865,-0.46647
866,-0.39676999999999996
867,-0.34321
868,-0.3015
869,-0.2648
870,-0.22995
871,-0.1951
872,-0.16025
873,-0.1254
874,-0.44218999999999997
875,-0.26794
876,-0.093687
877,0.08056100000000001
878,0.25481
879,0.42906000000000005
880,0.11855
881,0.1534
882,0.20059000000000002
883,0.25087
884,0.31965
885,0.38935
886,0.45905
887,0.53467
888,0.62722
889,0.7247100000000001
890,0.82926
891,0.93381
892,1.0384
893,1.1212
894,1.1954
895,1.2657
896,1.3354
897,1.4051
898,1.4748
899,1.5445
900,1.6142
901,1.6839
902,1.7487
903,1.8081
904,1.8519
905,1.8867
906,1.9216
907,1.9564
908,1.9580000000000002
909,1.9542
910,1.9193
911,1.8845
912,1.8496
913,1.8248
914,1.8151
915,1.8108
916,1.8108
917,1.8108
918,1.8108
919,1.8108
920,1.8108
921,1.8108
922,1.8099
923,1.8048
924,1.7902
925,1.7553
926,1.7205
927,1.6856
928,1.6586
929,1.6364
930,1.6314
931,1.6314
932,1.6314
933,1.6297
934,1.6097
935,1.5862
936,1.5514
937,1.5165
938,1.4817
939,1.4617
940,1.4543
941,1.452
942,1.452
943,1.452
944,1.452
