{
  "about": {
    "datasetID": "LL1_facebook_network_dataset",
    "datasetName": "facebook_network",
    "description": "Facebook, network",
    "citation": " Viswanath, Bimal and Mislove, Alan and Cha, Meeyoung and Gummadi, Krishna P. (2009), On the Evolution of User Interaction in Facebook, Proc. Workshop on Online Social Networks",
    "license": "Creative Commons Attribution-ShareAlike 2.0",
    "source": "Koblenz Network Collection",
    "sourceURI": "http://konect.uni-koblenz.de/networks/facebook-wosn-links",
    "approximateSize": "",
    "datasetSchemaVersion": "4.0.0",
    "redacted": false,
    "datasetVersion": "4.0.0",
    "digest": "d8a003a223fccca33cefa32eb91763919e5f1e079a2c5b39aad239f4a1c44bd7"
  },
  "dataResources": [
    {
      "resID": "learningData",
      "resPath": "tables/learningData.csv",
      "resType": "table",
      "resFormat": {
        "text/csv": [
          "csv"
        ]
      },
      "isCollection": false,
      "columns": [
        {
          "colIndex": 0,
          "colName": "d3mIndex",
          "colType": "integer",
          "role": [
            "index"
          ]
        },
        {
          "colIndex": 1,
          "colName": "fromNode",
          "colType": "integer",
          "role": [
            "attribute"
          ]
        },
        {
          "colIndex": 2,
          "colName": "toNode",
          "colType": "integer",
          "role": [
            "attribute"
          ]
        }
      ],
      "columnsCount": 3
    }
  ]
}