{
  "about": {
    "problemID": "LL1_domestic_product_demand_total_industry_problem",
    "problemName": "Predict_LL1_domestic_product_demand_total_industry",
    "problemDescription": "Predict Domestic product demand, total INDUSTRY ",
    "problemSchemaVersion": "4.0.0",
    "problemVersion": "4.0.0",
    "taskKeywords": [
      "timeSeries",
      "forecasting"
    ]
  },
  "inputs": {
    "data": [
      {
        "datasetID": "LL1_domestic_product_demand_total_industry_dataset",
        "targets": [
          {
            "targetIndex": 0,
            "resID": "learningData",
            "colIndex": 2,
            "colName": "value"
          }
        ]
      }
    ],
    "dataSplits": {
      "method": "holdOut",
      "testSize": 0.125,
      "numRepeats": 0,
      "splitsFile": "dataSplits.csv"
    },
    "performanceMetrics": [
      {
        "metric": "rootMeanSquaredError"
      }
    ]
  },
  "expectedOutputs": {
    "predictionsFile": "predictions.csv"
  }
}