time,value
0,-0.47853999999999997
1,-0.47853999999999997
2,-0.47853999999999997
3,-0.47853999999999997
4,-0.47853999999999997
5,-0.47853999999999997
6,-0.47853999999999997
7,-0.47853999999999997
8,-0.47853999999999997
9,-0.47853999999999997
10,-0.47853999999999997
11,-0.47853999999999997
12,-0.47853999999999997
13,-0.47853999999999997
14,-0.47853999999999997
15,-0.47853999999999997
16,-0.47853999999999997
17,-0.47853999999999997
18,-0.49863
19,-0.54143
20,-0.59078
21,-0.6026199999999999
22,-0.60639
23,-0.61903
24,-0.69306
25,-0.75557
26,-0.79097
27,-0.79097
28,-0.79097
29,-0.79097
30,-0.79097
31,-0.79097
32,-0.79097
33,-0.8188
34,-0.87097
35,-0.945
36,-1.0355
37,-1.1313
38,-1.2246
39,-1.3032
40,-1.3776
41,-1.4385
42,-1.4884
43,-1.535
44,-1.5408
45,-1.5408
46,-1.5408
47,-1.5408
48,-1.5469
49,-1.5627
50,-1.5888
51,-1.6238
52,-1.6702
53,-1.7195
54,-1.7689
55,-1.8182
56,-1.8432
57,-1.8532
58,-1.8532
59,-1.8532
60,-1.8532
61,-1.8453
62,-1.8230000000000002
63,-1.7983
64,-1.7736
65,-1.749
66,-1.7243
67,-1.6996
68,-1.6749
69,-1.6503
70,-1.6256
71,-1.6097
72,-1.6033
73,-1.5976
74,-1.5725
75,-1.5261
76,-1.4685
77,-1.4019
78,-1.3279
79,-1.2229
80,-1.1058
81,-0.98545
82,-0.88356
83,-0.7842
84,-0.6855
85,-0.58735
86,-0.49422
87,-0.43396999999999997
88,-0.38694
89,-0.34442
90,-0.31974
91,-0.29506
92,-0.27039
93,-0.24541
94,-0.19725
95,-0.13188
96,-0.048501999999999997
97,0.054977
98,0.17776
99,0.31216
100,0.45516
101,0.60322
102,0.7512800000000001
103,0.89933
104,1.0364
105,1.1371
106,1.236
107,1.3347
108,1.4344
109,1.5381
110,1.6583
111,1.7856
112,1.9194
113,2.0675
114,2.2068
115,2.3377
116,2.4568
117,2.5384
118,2.5956
119,2.6243
120,2.6215
121,2.5968
122,2.5296
123,2.44
124,2.3413
125,2.2426
126,2.1447
127,2.0547
128,1.9807
129,1.9107
130,1.8537
131,1.8064
132,1.7642
133,1.7383
134,1.7136
135,1.689
136,1.6643
137,1.6396
138,1.6149
139,1.5903
140,1.5656
141,1.5409
142,1.5067
143,1.4621
144,1.4128
145,1.3457
146,1.2731
147,1.199
148,1.125
149,1.0484
150,0.9622200000000001
151,0.86351
152,0.76481
153,0.6661
154,0.5674
155,0.4687
156,0.36999
157,0.28792
158,0.22194
159,0.17259000000000002
160,0.12322999999999999
161,0.073882
162,0.034901999999999996
163,0.022165999999999998
164,0.021346
165,0.0088258
166,-0.013280000000000002
167,-0.037956000000000004
168,-0.08430499999999999
169,-0.13207
170,-0.17447000000000001
171,-0.19915
172,-0.22855999999999999
173,-0.2684
174,-0.31643000000000004
175,-0.35722
176,-0.38500999999999996
177,-0.40968999999999994
178,-0.43436
179,-0.45903999999999995
180,-0.47262
181,-0.47853999999999997
182,-0.47734
183,-0.45983
184,-0.43715
185,-0.41247
186,-0.3878
187,-0.36312
188,-0.35436999999999996
189,-0.35416
190,-0.35595
191,-0.38024
192,-0.40188
193,-0.41606000000000004
194,-0.41606000000000004
195,-0.41606000000000004
196,-0.41606000000000004
197,-0.41343
198,-0.40268000000000004
199,-0.37944
200,-0.36230999999999997
201,-0.35357
202,-0.35357
203,-0.33929000000000004
204,-0.31855
205,-0.29386999999999996
206,-0.26919
207,-0.24452
208,-0.21984
209,-0.19528
210,-0.1716
211,-0.16610999999999998
212,-0.16444
213,-0.15895
214,-0.13427
215,-0.1096
216,-0.08492000000000001
217,-0.059945000000000005
218,-0.025319
219,0.019356
220,0.068708
221,0.11805999999999998
222,0.16741
223,0.21675999999999998
224,0.26611999999999997
225,0.31547
226,0.34697
227,0.37396999999999997
228,0.3932
229,0.39599
230,0.39626
231,0.39626
232,0.39692
233,0.4001
234,0.42173
235,0.44326000000000004
236,0.45875
237,0.45875
238,0.46621
239,0.48263
240,0.5073
241,0.53198
242,0.55665
243,0.5749
244,0.58372
245,0.58372
246,0.58372
247,0.58372
248,0.58299
249,0.5619
250,0.53835
251,0.50551
252,0.45675
253,0.4074
254,0.35805
255,0.31029
256,0.26631
257,0.24064000000000002
258,0.22099000000000002
259,0.2088
260,0.2088
261,0.21908000000000002
262,0.23786
263,0.26253000000000004
264,0.28720999999999997
265,0.31189
266,0.32764
267,0.33378
268,0.33378
269,0.35041
270,0.37278
271,0.39166
272,0.36977
273,0.34571999999999997
274,0.32104
275,0.29636
276,0.27169
277,0.24700999999999998
278,0.22234
279,0.19766
280,0.17298
281,0.1556
282,0.14632
283,0.14632
284,0.14632
285,0.14632
286,0.14135999999999999
287,0.12484
288,0.10055
289,0.087673
290,0.083832
291,0.083832
292,0.083832
293,0.083384
294,0.077464
295,0.052788
296,0.031389999999999994
297,0.021346
298,0.021346
299,0.021346
300,0.021346
301,0.021346
302,0.021346
303,0.021346
304,0.011397
305,-0.0065141999999999995
306,-0.029841000000000003
307,-0.038796
308,-0.041139999999999996
309,-0.048445999999999996
310,-0.06740800000000001
311,-0.092084
312,-0.11675999999999999
313,-0.14144
314,-0.16610999999999998
