time,value
0,1.7272
1,1.7272
2,1.7272
3,1.7123
4,1.6095
5,1.5235
6,1.4671
7,1.4671
8,1.4671
9,1.4671
10,1.4671
11,1.4671
12,1.4671
13,1.4671
14,1.4671
15,1.4671
16,1.4671
17,1.4671
18,1.4555
19,1.4019
20,1.2963
21,1.0931
22,0.9113899999999999
23,0.74642
24,0.5906899999999999
25,0.45203999999999994
26,0.33281
27,0.24335
28,0.18213
29,0.10361
30,-0.00020629
31,-0.10403
32,-0.18399000000000001
33,-0.25129
34,-0.33413000000000004
35,-0.43261000000000005
36,-0.5364300000000001
37,-0.64025
38,-0.7401399999999999
39,-0.81752
40,-0.87116
41,-0.9705600000000001
42,-1.0727
43,-1.1765
44,-1.2803
45,-1.3524
46,-1.3901
47,-1.3779
48,-1.3359999999999999
49,-1.3366
50,-1.3864
51,-1.3919
52,-1.3941
53,-1.3941
54,-1.3941
55,-1.3789
56,-1.3519
57,-1.3111
58,-1.3053
59,-1.2792
60,-1.2273
61,-1.1754
62,-1.0777
63,-0.9467399999999999
64,-0.79101
65,-0.64979
66,-0.52428
67,-0.42046000000000006
68,-0.31765
69,-0.23988
70,-0.18234
71,-0.042076
72,0.040559
73,0.085411
74,0.11192
75,0.1721
76,0.24756
77,0.33371
78,0.33997
79,0.31401999999999997
80,0.26211
81,0.2102
82,0.18039000000000002
83,0.16103
84,0.13562000000000002
85,0.08925599999999999
86,0.042969
87,0.006520999999999999
88,0.052809
89,0.027125
90,-0.07022
91,-0.13207
92,-0.18742
93,-0.23933000000000001
94,-0.29124
95,-0.33078
96,-0.35364
97,-0.35364
98,-0.35364
99,-0.32788
100,-0.2817
101,-0.27065
102,-0.26694
103,-0.26145999999999997
104,-0.23826
105,-0.21506999999999998
106,-0.21844
107,-0.26483
108,-0.26694
109,-0.26694
110,-0.27091
111,-0.31068
112,-0.37940999999999997
113,-0.45656
114,-0.5162
115,-0.52704
116,-0.52704
117,-0.52704
118,-0.52704
119,-0.52704
120,-0.52704
121,-0.52704
122,-0.56771
123,-0.63325
124,-0.71609
125,-0.7833899999999999
126,-0.86203
127,-0.96254
128,-1.0158
129,-1.093
130,-1.1875
131,-1.2538
132,-1.2903
133,-1.3074
134,-1.3074
135,-1.3074
136,-1.3092
137,-1.3136
138,-1.4156
139,-1.5194
140,-1.6186
141,-1.686
142,-1.7425
143,-1.7893
144,-1.8224
145,-1.8276
146,-1.8266
147,-1.8244
148,-1.7215
149,-1.6675
150,-1.6493
151,-1.614
152,-1.5857
153,-1.5675
154,-1.5675
155,-1.5448
156,-1.4631
157,-1.3074
158,-1.2035
159,-1.0504
160,-0.87277
161,-0.76785
162,-0.68275
163,-0.59291
164,-0.47252
165,-0.32161
166,-0.16588
167,-0.009684700000000001
168,0.19685
169,0.42845
170,0.71032
171,1.1687
172,1.5853
173,1.9189
174,2.0957
175,2.2088
176,2.3126
177,2.4155
178,2.4696
179,2.5224
180,2.5691
181,2.589
182,2.5942
183,2.5898
184,2.5754
185,2.5231
186,2.4446
187,2.3407
188,2.2369
189,2.1331
190,2.0239
191,1.8892
192,1.7388
193,1.5915
194,1.4623
195,1.3980000000000001
196,1.3196
197,1.2158
198,1.112
199,1.0082
200,0.90436
201,0.8005399999999999
202,0.71255
203,0.63984
204,0.5879300000000001
205,0.5360199999999999
206,0.48411000000000004
207,0.43431000000000003
208,0.42878
209,0.42667
210,0.42667
211,0.42667
212,0.41148999999999997
213,0.38455
214,0.34369
215,0.33997
216,0.33997
217,0.33997
218,0.33997
219,0.31711
220,0.28309
221,0.25879
222,0.25327
223,0.25327
224,0.25327
225,0.25226
226,0.22621
227,0.1743
228,0.12239000000000001
229,0.07048
230,0.024112
231,-0.0012907
232,-0.020649
233,-0.050460000000000005
234,-0.10237
235,-0.15428
236,-0.20619
237,-0.2581
238,-0.31001
239,-0.36191999999999996
240,-0.41383000000000003
241,-0.46574
242,-0.50455
243,-0.52985
244,-0.53759
245,-0.58668
246,-0.61273
247,-0.61374
248,-0.61374
249,-0.59206
250,-0.55465
251,-0.50274
252,-0.43846
253,-0.35998
254,-0.26278
255,-0.2084
256,-0.18224
257,-0.18024
258,-0.18024
259,-0.20149
260,-0.23274
261,-0.26145999999999997
262,-0.26694
263,-0.26694
264,-0.26694
265,-0.26694
266,-0.21569000000000002
267,-0.12180999999999999
268,-0.05775
269,-0.022667
270,-0.0014112
271,0.020678
272,0.045479
273,0.042386
274,-0.0051062
275,-0.006833199999999999
276,-0.032306
277,-0.07184700000000001
278,-0.046444
279,-0.0233
280,-0.006833199999999999
281,-0.006833199999999999
282,0.0032176
283,0.029945999999999997
284,0.078543
285,0.079868
286,0.079868
287,0.07543
288,0.037877999999999995
289,-0.0095944
290,-0.045781
291,-0.03805
292,0.04081
293,0.11596
294,0.16567
295,0.16657
296,0.19168
297,0.23317
298,0.24863000000000002
299,0.25327
300,0.25327
301,0.25327
302,0.25327
303,0.25327
304,0.25327
305,0.25327
306,0.25327
307,0.25327
308,0.25327
309,0.27207
310,0.29577
311,0.31234
312,0.27794
313,0.25327
314,0.25327
