time,value
0,-0.05853
1,-0.05853
2,-0.05853
3,-0.05853
4,-0.05853
5,-0.05853
6,-0.05853
7,-0.05853
8,-0.05853
9,-0.05853
10,-0.05853
11,-0.05853
12,-0.05853
13,-0.05853
14,-0.05853
15,-0.05853
16,-0.05853
17,-0.05853
18,-0.05853
19,-0.05853
20,-0.05853
21,-0.05853
22,-0.05853
23,-0.05853
24,-0.05853
25,-0.05853
26,-0.05853
27,-0.05853
28,-0.05853
29,-0.05853
30,-0.05853
31,-0.05853
32,-0.05853
33,-0.05853
34,-0.05853
35,-0.05853
36,-0.05853
37,-0.05853
38,-0.05853
39,-0.05853
40,-0.05853
41,-0.05853
42,-0.05853
43,-0.05853
44,-0.05853
45,-0.05853
46,-0.05853
47,-0.05853
48,-0.05853
49,-0.05853
50,-0.05853
51,-0.05853
52,-0.05853
53,-0.05853
54,-0.05853
55,-0.05853
56,-0.05853
57,-0.05853
58,-0.05853
59,-0.05853
60,-0.05853
61,-0.05853
62,-0.05853
63,-0.05853
64,-0.05853
65,-0.05853
66,-0.05853
67,-0.05853
68,-0.05853
69,-0.05853
70,-0.05853
71,-0.05853
72,-0.05853
73,-0.05853
74,-0.05853
75,-0.05853
76,-0.05853
77,-0.05853
78,-0.05853
79,-0.05853
80,-0.05853
81,-0.05853
82,-0.05853
83,-0.05853
84,-0.05853
85,-0.05853
86,-0.05853
87,-0.05853
88,-0.05853
89,-0.05853
90,-0.05853
91,-0.05853
92,-0.05853
93,-0.05853
94,-0.05853
95,-0.05853
96,-0.05853
97,-0.05853
98,-0.05853
99,-0.05853
100,-0.05853
101,-0.05853
102,-0.05853
103,-0.05853
104,-0.05853
105,-0.05853
106,-0.05853
107,-0.05853
108,-0.05853
109,-0.05853
110,-0.05853
111,-0.05853
112,-0.05853
113,-0.05853
114,-0.05853
115,-0.05853
116,-0.05853
117,-0.05853
118,-0.05853
119,-0.05853
120,-0.05853
121,-0.05853
122,-0.05853
123,-0.05853
124,-0.05853
125,-0.05853
126,-0.05853
127,-0.05853
128,-0.05853
129,-0.05853
130,-0.05853
131,-0.05853
132,-0.05853
133,-0.05853
134,-0.05853
135,-0.05853
136,-0.05853
137,-0.05853
138,-0.05853
139,-0.05853
140,-0.05853
141,-0.05853
142,-0.05853
143,-0.05853
144,-0.05853
145,-0.05853
146,-0.05853
147,-0.05853
148,-0.05853
149,-0.05853
150,-0.05853
151,-0.05853
152,-0.05853
153,-0.05853
154,-0.05853
155,-0.05853
156,-0.05853
157,-0.05853
158,-0.05853
159,-0.05853
160,-0.05853
161,-0.05853
162,-0.05853
163,-0.05853
164,-0.05853
165,-0.05853
166,-0.05853
167,-0.05853
168,-0.05853
169,-0.05853
170,-0.05853
171,-0.05853
172,-0.05853
173,-0.05853
174,-0.05853
175,-0.05853
176,-0.05853
177,-0.05853
178,-0.05853
179,-0.05853
180,-0.05853
181,-0.05853
182,-0.05853
183,-0.05853
184,-0.05853
185,-0.05853
186,-0.05853
187,-0.05853
188,-0.05853
189,-0.05853
190,-0.05853
191,-0.05853
192,-0.05853
193,-0.05853
194,-0.05853
195,-0.05853
196,-0.05853
197,-0.05853
198,-0.05853
199,-0.05853
200,-0.05853
201,-0.05853
202,-0.05853
203,-0.05853
204,-0.05853
205,-0.05853
206,-0.05853
207,-0.05853
208,-0.05853
209,-0.05853
210,-0.05853
211,-0.05853
212,-0.05853
213,-0.05853
214,-0.05853
215,-0.05853
216,-0.05853
217,-0.05853
218,-0.05853
219,-0.05853
220,-0.05853
221,-0.05853
222,-0.05853
223,-0.05853
224,-0.05853
225,-0.05853
226,-0.05853
227,-0.05853
228,-0.05853
229,-0.05853
230,-0.05853
231,-0.05853
232,-0.05853
233,-0.05853
234,-0.05853
235,-0.05853
236,-0.05853
237,-0.05853
238,-0.05853
239,-0.05853
240,-0.05853
241,-0.05853
242,-0.05853
243,-0.05853
244,-0.05853
245,-0.05853
246,-0.05853
247,-0.05853
248,17.903
249,-0.033652999999999995
250,-0.05853
251,-0.05853
252,-0.05853
253,-0.05853
254,-0.05853
255,-0.05853
256,-0.05853
257,-0.05853
258,-0.05853
259,-0.05853
260,-0.05853
261,-0.05853
262,-0.05853
263,-0.05853
264,-0.05853
265,-0.05853
266,-0.05853
267,-0.05853
268,-0.05853
269,-0.05853
270,-0.05853
271,-0.05853
272,-0.05853
273,-0.05853
274,-0.05853
275,-0.05853
276,-0.05853
277,-0.05853
278,-0.05853
279,-0.05853
280,-0.05853
281,-0.05853
282,-0.05853
283,-0.05853
284,-0.05853
285,-0.05853
286,-0.05853
287,-0.05853
288,-0.05853
289,-0.05853
290,-0.05853
291,-0.05853
292,-0.05853
293,-0.05853
294,-0.05853
295,-0.05853
296,-0.05853
297,-0.05853
298,-0.05853
299,-0.05853
300,-0.05853
301,-0.05853
302,-0.05853
303,-0.05853
304,-0.05853
305,-0.05853
306,-0.05853
307,-0.05853
308,-0.05853
309,-0.05853
310,-0.05853
311,-0.05853
312,-0.05853
313,-0.05853
314,-0.05853
315,-0.05853
316,-0.05853
317,-0.05853
318,-0.05853
319,-0.05853
320,-0.05853
321,-0.05853
322,-0.05853
323,-0.05853
324,-0.05853
325,-0.05853
326,-0.05853
327,-0.05853
328,-0.05853
329,-0.05853
330,-0.05853
331,-0.05853
332,-0.05853
333,-0.05853
334,-0.05853
335,-0.05853
336,-0.05853
337,-0.05853
338,-0.05853
339,-0.05853
340,-0.05853
341,-0.05853
342,-0.05853
343,-0.05853
344,-0.05853
345,-0.05853
346,-0.05853
347,-0.05853
348,-0.05853
349,-0.05853
350,-0.05853
351,-0.05853
352,-0.05853
353,-0.05853
354,-0.05853
355,-0.05853
356,-0.05853
357,-0.05853
358,-0.05853
359,-0.05853
360,-0.05853
361,-0.05853
362,-0.05853
363,-0.05853
364,-0.05853
365,-0.05853
366,-0.05853
367,-0.05853
368,-0.05853
369,-0.05853
370,-0.05853
371,-0.05853
372,-0.05853
373,-0.05853
374,-0.05853
375,-0.05853
376,-0.05853
377,-0.05853
378,-0.05853
379,-0.05853
380,-0.05853
381,-0.05853
382,-0.05853
383,-0.05853
384,-0.05853
385,-0.05853
386,-0.05853
387,-0.05853
388,-0.05853
389,-0.05853
390,-0.05853
391,-0.05853
392,-0.05853
393,-0.05853
394,-0.05853
395,-0.05853
396,-0.05853
397,-0.05853
398,-0.05853
399,-0.05853
400,-0.05853
401,-0.05853
402,-0.05853
403,-0.05853
404,-0.05853
405,-0.05853
406,-0.05853
407,-0.05853
408,-0.05853
409,-0.05853
410,-0.05853
411,-0.05853
412,-0.05853
413,-0.05853
414,-0.05853
415,-0.05853
416,-0.05853
417,-0.05853
418,-0.05853
419,-0.05853
420,-0.05853
421,-0.05853
422,-0.05853
423,-0.05853
424,-0.05853
425,-0.05853
426,-0.05853
427,-0.05853
428,-0.05853
429,-0.05853
430,-0.05853
431,-0.05853
432,-0.05853
433,-0.05853
434,-0.05853
435,-0.05853
436,-0.05853
437,-0.05853
438,-0.05853
439,-0.05853
440,-0.05853
441,-0.05853
442,-0.05853
443,-0.05853
444,-0.05853
445,-0.05853
446,-0.05853
447,-0.05853
448,-0.05853
449,-0.05853
450,-0.05853
451,-0.05853
452,-0.05853
453,-0.05853
454,-0.05853
455,-0.05853
456,-0.05853
457,-0.05853
458,-0.05853
459,-0.05853
460,-0.05853
461,-0.05853
462,-0.05853
463,-0.05853
464,-0.05853
465,-0.05853
466,-0.05853
467,-0.05853
468,-0.05853
469,-0.05853
470,-0.05853
471,-0.05853
472,-0.05853
473,-0.05853
474,-0.05853
475,-0.05853
476,-0.05853
477,-0.05853
478,-0.05853
479,-0.05853
480,-0.05853
481,-0.05853
482,-0.05853
483,-0.05853
484,-0.05853
485,-0.05853
486,-0.05853
487,-0.05853
488,-0.05853
489,-0.05853
490,-0.05853
491,-0.05853
492,-0.05853
493,-0.05853
494,-0.05853
495,-0.05853
496,-0.05853
497,-0.05853
498,-0.05853
499,-0.05853
500,-0.05853
501,-0.05853
502,-0.05853
503,-0.05853
504,-0.05853
505,-0.05853
506,-0.05853
507,-0.05853
508,-0.05853
509,-0.05853
510,-0.05853
511,-0.05853
512,-0.05853
513,-0.05853
514,-0.05853
515,-0.05853
516,-0.05853
517,-0.05853
518,-0.05853
519,-0.05853
520,-0.05853
521,-0.05853
522,-0.05853
523,-0.05853
524,-0.05853
525,-0.05853
526,-0.05853
527,-0.05853
528,-0.05853
529,-0.05853
530,-0.05853
531,-0.05853
532,-0.05853
533,-0.05853
534,-0.05853
535,-0.05853
536,-0.05853
537,-0.05853
538,-0.05853
539,-0.05853
540,-0.05853
541,-0.05853
542,-0.05853
543,-0.05853
544,-0.05853
545,-0.05853
546,-0.05853
547,-0.05853
548,-0.05853
549,-0.05853
550,-0.05853
551,-0.05853
552,-0.05853
553,-0.05853
554,-0.05853
555,-0.05853
556,-0.05853
557,-0.05853
558,-0.05853
559,-0.05853
560,-0.05853
561,-0.05853
562,-0.05853
563,-0.05853
564,-0.05853
565,-0.05853
566,-0.05853
567,-0.05853
568,-0.05853
569,-0.05853
570,-0.05853
571,4.6681
572,19.346
573,-0.033652999999999995
574,-0.05853
575,-0.05853
576,-0.05853
577,-0.05853
578,-0.05853
579,-0.05853
580,-0.05853
581,-0.05853
582,-0.05853
583,-0.05853
584,-0.05853
585,-0.05853
586,-0.05853
587,-0.05853
588,-0.05853
589,-0.05853
590,-0.05853
591,-0.05853
592,-0.05853
593,-0.05853
594,-0.05853
595,-0.05853
596,-0.05853
597,-0.05853
598,-0.05853
599,-0.05853
600,-0.05853
601,-0.05853
602,-0.05853
603,-0.05853
604,-0.05853
605,-0.05853
606,-0.05853
607,-0.05853
608,-0.05853
609,-0.05853
610,-0.05853
611,-0.05853
612,-0.05853
613,-0.05853
614,-0.05853
615,-0.05853
616,-0.05853
617,-0.05853
618,-0.05853
619,-0.05853
620,-0.05853
621,-0.05853
622,-0.05853
623,-0.05853
624,-0.05853
625,-0.05853
626,-0.05853
627,-0.05853
628,-0.05853
629,-0.05853
630,-0.05853
631,-0.05853
632,-0.05853
633,-0.05853
634,-0.05853
635,-0.05853
636,-0.05853
637,-0.05853
638,-0.05853
639,-0.05853
640,-0.05853
641,-0.05853
642,-0.05853
643,-0.05853
644,-0.05853
645,-0.05853
646,-0.05853
647,-0.05853
648,-0.05853
649,-0.05853
650,-0.05853
651,-0.05853
652,-0.05853
653,-0.05853
654,-0.05853
655,-0.05853
656,-0.05853
657,-0.05853
658,-0.05853
659,-0.05853
660,-0.05853
661,-0.05853
662,-0.05853
663,-0.05853
664,-0.05853
665,-0.05853
666,-0.05853
667,-0.05853
668,-0.05853
669,-0.05853
670,-0.05853
671,-0.05853
672,-0.05853
673,-0.05853
674,-0.05853
675,-0.05853
676,-0.05853
677,-0.05853
678,-0.05853
679,-0.05853
680,-0.05853
681,-0.05853
682,-0.05853
683,-0.05853
684,-0.05853
685,-0.05853
686,-0.05853
687,-0.05853
688,-0.05853
689,-0.05853
690,-0.05853
691,-0.05853
692,-0.05853
693,-0.05853
694,-0.05853
695,-0.05853
696,-0.05853
697,-0.05853
698,-0.05853
699,-0.05853
700,-0.05853
701,-0.05853
702,-0.05853
703,-0.05853
704,-0.05853
705,-0.05853
706,-0.05853
707,-0.05853
708,-0.05853
709,-0.05853
710,-0.05853
711,-0.05853
712,-0.05853
713,-0.05853
714,-0.05853
715,-0.05853
716,-0.05853
717,-0.05853
718,-0.05853
719,-0.05853
