time,value
0,-0.7699600000000001
1,-0.7044100000000001
2,-0.66317
3,-0.6116
4,-0.5574399999999999
5,-0.52664
6,-0.51136
7,-0.50964
8,-0.52368
9,-0.54005
10,-0.55308
11,-0.56835
12,-0.5866399999999999
13,-0.60205
14,-0.60961
15,-0.6116
16,-0.61192
17,-0.60952
18,-0.60237
19,-0.59306
20,-0.58707
21,-0.5834600000000001
22,-0.57524
23,-0.56065
24,-0.54213
25,-0.5233
26,-0.50861
27,-0.49083000000000004
28,-0.46052
29,-0.42646999999999996
30,-0.39582
31,-0.36254000000000003
32,-0.32979
33,-0.30523
34,-0.28585
35,-0.27257
36,-0.27449
37,-0.29351
38,-0.32408000000000003
39,-0.36162
40,-0.40083
41,-0.43491
42,-0.46235
43,-0.48343
44,-0.49038000000000004
45,-0.47617
46,-0.44625
47,-0.40928000000000003
48,-0.36351
49,-0.30578
50,-0.24486
51,-0.19000999999999998
52,-0.13794
53,-0.080315
54,-0.013934
55,0.054633
56,0.1068
57,0.11900000000000001
58,0.080364
59,0.001358
60,-0.098222
61,-0.20206
62,-0.29889
63,-0.38441
64,-0.46163999999999994
65,-0.53017
66,-0.58048
67,-0.60339
68,-0.59924
69,-0.5773199999999999
70,-0.54888
71,-0.52169
72,-0.49828999999999996
73,-0.47476999999999997
74,-0.44869
75,-0.42496999999999996
76,-0.39953
77,-0.3588
78,-0.30522
79,-0.24784
80,-0.18178
81,-0.10512
82,-0.01684
83,0.089503
84,0.20597
85,0.31619
86,0.41693
87,0.5123
88,0.60238
89,0.6875600000000001
90,0.76882
91,0.82889
92,0.8202799999999999
93,0.69688
94,0.46661
95,0.20016
96,-0.021797
97,-0.16748
98,-0.25661
99,-0.32001999999999997
100,-0.37442
101,-0.42413999999999996
102,-0.47018000000000004
103,-0.51499
104,-0.55407
105,-0.57568
106,-0.58075
107,-0.58219
108,-0.58305
109,-0.58033
110,-0.57492
111,-0.56189
112,-0.5421199999999999
113,-0.52781
114,-0.5170100000000001
115,-0.4954
116,-0.46425
117,-0.42591
118,-0.36451
119,-0.27253
120,-0.15849000000000002
121,-0.024707
122,0.12122000000000001
123,0.25925
124,0.38216
125,0.50065
126,0.6247699999999999
127,0.7507
128,0.85867
129,0.92742
130,0.95163
131,0.9484899999999999
132,0.9475299999999999
133,0.9713799999999999
134,1.0271
135,1.1014
136,1.1581
137,1.1613
138,1.1124
139,1.0421
140,0.9563799999999999
141,0.82636
142,0.6400399999999999
143,0.42373
144,0.21223000000000003
145,0.027079000000000002
146,-0.12324
147,-0.23661
148,-0.31237
149,-0.35641999999999996
150,-0.38167
151,-0.39834
152,-0.41118999999999994
153,-0.42353
154,-0.43551000000000006
155,-0.44911999999999996
156,-0.46938
157,-0.49025
158,-0.49943999999999994
159,-0.49818
160,-0.49521000000000004
161,-0.49249
162,-0.48494
163,-0.46768999999999994
164,-0.44263
165,-0.41202
166,-0.36796
167,-0.30593000000000004
168,-0.23826
169,-0.17648
170,-0.11815999999999999
171,-0.058373
172,0.004317100000000001
173,0.074166
174,0.15979000000000002
175,0.27053
176,0.40664
177,0.55201
178,0.6764
179,0.75817
180,0.8116899999999999
181,0.86474
182,0.9084
183,0.90843
184,0.86482
185,0.81196
186,0.7563300000000001
187,0.66361
188,0.5102399999999999
189,0.30764
190,0.089366
191,-0.10530999999999999
192,-0.25342
193,-0.35504
194,-0.41806000000000004
195,-0.45486000000000004
196,-0.47631999999999997
197,-0.47473999999999994
198,-0.44463
199,-0.39669
200,-0.33224000000000004
201,-0.24943
202,-0.15945
203,-0.057232000000000005
204,0.07587
205,0.24618
206,0.46445
207,0.74197
208,1.0876
209,1.5187
210,2.0331
211,2.5669
212,3.0336
213,3.4364
214,3.8628
215,4.3252
216,4.7101
217,4.918
218,4.9191
219,4.6509
220,4.0159
221,3.0354
222,1.9247
223,0.97004
224,0.33659
225,-0.00033233
226,-0.16549
227,-0.25882
228,-0.31196999999999997
229,-0.33981999999999996
230,-0.36491
231,-0.38489
232,-0.39182
233,-0.40345
234,-0.42639
235,-0.45091000000000003
236,-0.48045
237,-0.51627
238,-0.55228
239,-0.5848
240,-0.6170100000000001
241,-0.65541
242,-0.69539
243,-0.72872
244,-0.75602
245,-0.77961
246,-0.7964
247,-0.80587
248,-0.81123
249,-0.8128
250,-0.81052
251,-0.80706
252,-0.80557
253,-0.80761
254,-0.81037
255,-0.8107800000000001
256,-0.81221
257,-0.81615
258,-0.81944
259,-0.82324
260,-0.82962
261,-0.8335899999999999
262,-0.83162
263,-0.82895
264,-0.8282700000000001
265,-0.82444
266,-0.81502
267,-0.79971
268,-0.78513
269,-0.79288
