time,value
0,-0.028156
1,0.20703000000000002
2,-0.021272
3,-0.1756
4,0.069747
5,0.43628
6,0.044475
7,-0.0313
8,-0.30577
9,-0.089715
10,1.6472
11,1.6472
12,1.6472
13,1.6472
14,1.6472
15,1.6472
16,1.6472
17,1.6472
18,1.6472
19,1.6472
20,1.6472
21,1.6472
22,1.6472
23,1.6472
24,-1.615
25,-1.615
26,-1.615
27,-1.615
28,-1.615
29,-1.615
30,-1.615
31,-1.615
32,-1.615
33,-1.615
34,-1.615
35,-1.615
36,-1.615
37,-1.615
38,-0.20489000000000002
39,0.11699999999999999
40,0.13735
41,0.0033040999999999995
42,-1.615
43,-1.615
44,-1.615
45,-1.615
46,-1.615
47,-1.615
48,-1.615
49,-1.615
50,-1.615
51,1.6472
52,1.6472
53,1.6472
54,1.6472
55,1.6472
56,1.6472
57,1.6472
58,1.6472
59,-0.31251999999999996
60,0.28397
61,0.40545
62,0.12912
63,-0.11884000000000002
64,0.39389
65,0.51515
66,0.22505
67,-0.11155
68,0.22523
69,-0.09496399999999999
70,0.034027999999999996
71,0.059957
72,0.23242
73,0.14165
74,-1.101
75,-0.18911
76,0.29683000000000004
77,0.017632
78,0.091791
79,-0.30532
80,-0.24558000000000002
81,-0.11687
82,-0.16155
83,0.2348
84,0.067755
85,-0.42301000000000005
86,0.17044
87,-0.14762999999999998
88,-0.19885999999999998
89,0.17574
90,0.5977100000000001
91,0.5333399999999999
92,-0.062405999999999996
93,0.3648
94,-0.16008
95,-0.32332
96,0.088986
97,-0.50854
98,0.13367
99,0.044045
100,-0.3328
101,-0.040645999999999995
102,0.15066
103,-0.32332
104,-0.70325
105,0.62975
106,-0.17515999999999998
107,0.32798
108,-0.24525
109,-0.21363000000000001
110,-0.12700999999999998
111,-0.2137
112,0.18105
113,0.36516
114,0.4864
115,0.068534
116,0.21891999999999998
117,-0.52062
118,0.0098286
119,0.053403
120,-0.15165
121,0.36293000000000003
122,-0.31093000000000004
123,0.1576
124,0.27412
125,0.053444000000000005
126,0.2955
127,-0.41235
