time,value
0,1.1675
1,1.7002
2,2.1761
3,2.5346
4,2.7244
5,2.7138
6,2.4969
7,2.0969
8,1.5625
9,0.96062
10,0.36501999999999996
11,-0.15682000000000001
12,-0.55505
13,-0.8055100000000001
14,-0.91227
15,-0.9043899999999999
16,-0.8275299999999999
17,-0.73235
18,-0.6622100000000001
19,-0.64312
20,-0.67804
21,-0.7468899999999999
22,-0.8122699999999999
23,-0.8294100000000001
24,-0.7581399999999999
25,-0.57407
26,-0.27629000000000004
27,0.11005999999999999
28,0.53719
29,0.9430799999999999
30,1.2634
31,1.4443
32,1.4527
33,1.2836
34,0.9606100000000001
35,0.53218
36,0.062159000000000006
37,-0.38145
38,-0.7384
39,-0.96577
40,-1.044
41,-0.9780700000000001
42,-0.7945
43,-0.5342600000000001
44,-0.24423000000000003
45,0.031799
46,0.26039
47,0.42294
48,0.5169100000000001
49,0.55389
50,0.55521
51,0.54618
52,0.55029
53,0.58424
54,0.65473
55,0.75745
56,0.8781700000000001
57,0.9956299999999999
58,1.0856
59,1.1252
60,1.0972
61,0.9928100000000001
62,0.81335
63,0.57
64,0.28439000000000003
65,-0.017688
66,-0.30875
67,-0.5636
68,-0.7629100000000001
69,-0.89718
70,-0.9627399999999999
71,-0.9674200000000001
72,-0.92658
73,-0.85985
74,-0.7874
75,-0.72651
76,-0.6886899999999999
77,-0.67861
78,-0.69417
79,-0.728
80,-0.76981
81,-0.80914
82,-0.8376299999999999
83,-0.85072
84,-0.84831
85,-0.8341200000000001
86,-0.81426
87,-0.7954399999999999
88,-0.78304
89,-0.77982
90,-0.78551
91,-0.79704
92,-0.80957
93,-0.81815
94,-0.8190000000000001
95,-0.80877
96,-0.7881600000000001
97,-0.76036
98,-0.73017
