time,value
0,-0.048749
1,0.33789
2,-0.30221
3,0.67042
4,0.5371
5,0.037611
6,0.066995
7,0.1041
8,-0.31413
9,-0.11254000000000002
10,-0.032458999999999995
11,-0.009540799999999999
12,0.33183
13,-0.23258
14,0.53574
15,-0.2114
16,-0.22304000000000002
17,-0.091056
18,-0.27319
19,0.16837
20,-1.4455
21,-1.4455
22,-1.4455
23,-1.4455
24,-1.4455
25,-1.4455
26,-1.4455
27,-1.4455
28,-1.4455
29,-1.4455
30,-1.4455
31,-1.4455
32,-1.4455
33,-1.4455
34,-1.4455
35,1.4249
36,1.4249
37,1.4249
38,1.4249
39,1.4249
40,1.4249
41,1.4249
42,1.4249
43,1.4249
44,1.4249
45,1.4249
46,1.4249
47,1.4249
48,1.4249
49,1.4249
50,-0.073487
51,-0.004645000000000001
52,-0.17655
53,-0.049529000000000004
54,-0.51168
55,0.1496
56,0.27245
57,-0.30831
58,-0.028156999999999998
59,-0.15416
60,0.15907000000000002
61,-0.10504000000000001
62,-0.055473
63,0.014971
64,0.24583000000000002
65,-0.53233
66,1.4249
67,1.4249
68,1.4249
69,1.4249
70,1.4249
71,1.4249
72,1.4249
73,1.4249
74,1.4249
75,1.4249
76,1.4249
77,1.4249
78,1.4249
79,1.4249
80,1.4249
81,-1.4455
82,-1.4455
83,-1.4455
84,-1.4455
85,-1.4455
86,-1.4455
87,-1.4455
88,-1.4455
89,-1.4455
90,-1.4455
91,-1.4455
92,-1.4455
93,-1.4455
94,-1.4455
95,-0.055437
96,-0.014194
97,-0.43186
98,-0.096073
99,0.024814
100,-0.35539
101,-0.09162200000000001
102,-0.10701
103,0.1882
104,0.048764
105,-0.23269
106,0.48194
107,0.22443000000000002
108,-0.31885
109,0.47684
110,-0.061860000000000005
111,0.026104000000000002
112,-0.30337
113,0.55415
114,-0.21
115,-0.19927
116,-0.13682
117,0.28526999999999997
118,0.4082
119,-0.34553
120,-0.5767
121,0.15175
122,0.13244
123,0.13366
124,-0.46538
125,-0.12887
126,-0.15254
127,0.53878
