time,value
0,1.4868
1,1.4742
2,1.306
3,1.135
4,0.9507
5,0.8248
6,0.7386
7,0.6532899999999999
8,0.54155
9,0.44743999999999995
10,0.45748
11,0.31239
12,0.29318
13,0.21950999999999998
14,0.18018
15,0.21035
16,0.25006
17,0.14929
18,0.18792
19,0.12564
20,0.11975999999999999
21,0.010248
22,0.049958999999999996
23,0.022090000000000002
24,-0.033852
25,-0.05356
26,-0.1135
27,-0.18862
28,-0.33184
29,-0.30286
30,-0.50234
31,-0.67855
32,-0.7546
33,-0.9143899999999999
34,-1.0832
35,-1.2196
36,-1.3645
37,-1.5486
38,-1.6724
39,-1.7783
40,-1.8983
41,-1.9285
42,-1.9027
43,-1.8273
44,-1.6658
45,-1.4847
46,-1.2764
47,-1.0936
48,-0.9103899999999999
49,-0.70005
50,-0.51502
51,-0.30286
52,-0.11625999999999999
53,0.099242
54,0.28717
55,0.47547
56,0.6872699999999999
57,0.87018
58,1.0793
59,1.2601
60,1.4655
61,1.6457
62,1.828
63,2.0367
64,2.0589
65,1.8748
66,1.6908
67,1.5081
68,1.3006
69,1.1181
70,0.9114
71,0.72616
72,0.51474
73,0.32961
74,0.14235
75,-0.06913899999999999
76,-0.25340999999999997
77,-0.4625
78,-0.6439600000000001
79,-0.84991
80,-1.0304
81,-1.2099
82,-1.4138
83,-1.5948
84,-1.7312
85,-1.7509
86,-1.7178
87,-1.6637
88,-1.5651
89,-1.4232
90,-1.268
91,-1.1741
92,-1.028
93,-0.8346100000000001
94,-0.65593
95,-0.51125
96,-0.43732
97,-0.25038
98,-0.07577300000000001
99,-0.022649000000000002
100,0.12376
101,0.1472
102,0.1387
103,0.26389
104,0.2221
105,0.34176999999999996
106,0.31709
107,0.38074
108,0.38771
109,0.40831
110,0.47038
111,0.37715
112,0.40526
113,0.42454
114,0.41725
115,0.47906000000000004
116,0.49298000000000003
117,0.52822
118,0.52685
119,0.6532899999999999
120,0.6735300000000001
121,0.79315
122,0.8327600000000001
123,0.9378799999999999
124,1.0222
125,1.1693
126,1.3493
127,1.4593
