time,value
0,-0.7411
1,-0.7411
2,-0.7411
3,-0.7411
4,-0.7411
5,-0.7411
6,-0.7411
7,-0.7411
8,-0.7411
9,-0.7411
10,-0.7411
11,-0.7411
12,-0.7411
13,-0.7411
14,-0.7411
15,-0.7411
16,-0.7411
17,-0.7411
18,-0.7411
19,-0.7411
20,-0.7411
21,-0.7411
22,-0.7411
23,-0.7411
24,-0.7411
25,-0.7411
26,-0.7411
27,-0.7411
28,-0.7411
29,-0.7411
30,-0.7411
31,-0.7411
32,-0.7411
33,-0.7411
34,-0.7411
35,-0.7411
36,-0.7411
37,-0.7411
38,-0.7411
39,-0.7411
40,-0.7411
41,-0.7411
42,-0.7411
43,-0.7411
44,-0.7411
45,-0.7411
46,-0.7411
47,-0.7411
48,-0.7411
49,-0.7411
50,-0.73525
51,-0.71167
52,-0.69953
53,-0.6726800000000001
54,-0.60114
55,-0.56547
56,-0.5392
57,-0.39491
58,-0.31901
59,-0.19595
60,-0.33061
61,-0.1021
62,-0.23112
63,-0.25025
64,-0.32001
65,-0.32863000000000003
66,-0.22144
67,-0.15916
68,-0.12934
69,-0.32132
70,-0.1077
71,-0.2652
72,-0.32402
73,-0.29268
74,-0.3308
75,-0.40699
76,-0.17544
77,-0.17703
78,-0.23404
79,-0.25301
80,-0.2721
81,-0.16264
82,-0.20157
83,-0.27999
84,-0.38859
85,-0.21427
86,-0.28207
87,-0.37412
88,-0.2865
89,-0.13443
90,-0.23778000000000002
91,-0.048147
92,-0.24513000000000001
93,-0.30257
94,-0.19197
95,-0.3281
96,-0.32203000000000004
97,-0.26256999999999997
98,-0.37106
99,-0.27359
100,-0.22921
101,-0.10999
102,-0.31228
103,-0.23444
104,-0.14213
105,-0.20393
106,-0.091515
107,-0.2197
108,-0.22937
109,0.074113
110,-0.19977999999999999
111,-0.091038
112,-0.16858
113,-0.084371
114,-0.14197
115,-0.14244
116,-0.34862
117,-0.30265
118,-0.24479
119,-0.20454
120,-0.28365
121,-0.37267
122,-0.29103
123,-0.26322
124,-0.14737999999999998
125,-0.31624
126,-0.23904
127,-0.23176999999999998
128,-0.11872
129,-0.01949
130,-0.14296
131,-0.27616999999999997
132,-0.068851
133,-0.19804000000000002
134,-0.30564
135,-0.099858
136,-0.27171
137,-0.018853
138,-0.065084
139,-0.22651999999999997
140,-0.35344000000000003
141,-0.29084
142,-0.038033
143,-0.27074000000000004
144,-0.20873000000000003
145,-0.26194
146,-0.018347
147,-0.16823
148,-0.18978
149,-0.20608
150,-0.23986
151,-0.26955999999999997
152,-0.17262
153,-0.32066
154,-0.16947
155,-0.24889
156,-0.090728
157,0.26029
158,-0.30296
159,-0.31975
160,-0.27946
161,-0.24377
162,-0.18184
163,-0.036202
164,-0.27707
165,-0.35454
166,-0.18373
167,-0.06643500000000001
168,0.12426
169,-0.092764
170,-0.25511999999999996
171,-0.2501
172,-0.099959
173,-0.10484
174,-0.065737
175,-0.14172
176,-0.068255
177,-0.30422
178,-0.14042000000000002
179,0.16701
180,0.20425
181,0.027906
182,-0.16862
183,-0.15843
184,-0.032322000000000004
185,-0.19746
186,-0.17865999999999999
187,0.005346899999999999
188,-0.053850999999999996
189,-0.024075
190,-0.23938
191,-0.26092
192,0.004871100000000001
193,0.05927999999999999
194,-0.034789999999999995
195,-0.10829000000000001
196,-0.076653
197,-0.11469000000000001
198,-0.11112999999999999
199,-0.1382
200,0.05343
201,-0.053438
202,0.10925
203,-0.04143
204,-0.045236
205,0.71314
206,1.0849
207,0.36628
208,0.69787
209,1.0583
210,0.45532
211,1.4498
212,1.4528
213,0.95378
214,0.8324299999999999
215,1.3237
216,0.60914
217,0.37462
218,0.31542
219,0.93024
220,1.1243
221,1.0446
222,0.70539
223,0.5028199999999999
224,0.42081
225,0.4996
226,0.85695
227,0.26529
228,-0.096859
229,0.54611
230,0.73317
231,0.8264
232,0.9062
233,0.90064
234,0.85244
235,0.58203
236,0.45014
237,0.35522
238,0.18782000000000001
239,0.71416
240,1.2391
241,0.97659
242,0.8738
243,2.1206
244,1.2635
245,1.0944
246,1.0171
247,1.6228
248,1.7
249,2.5395
250,3.1729
251,2.9813
252,4.0849
253,9.1944
254,2.7412
255,4.9585
256,2.8960000000000004
257,1.6304
258,0.62017
259,0.83934
260,1.5475
261,1.308
262,1.1817
263,1.8769
264,1.9569
265,3.7047
266,3.2125
267,4.3848
268,0.8115600000000001
269,0.45387
270,0.056473
271,-0.29102
272,-0.22599
273,-0.38633
274,-0.29958
275,-0.42918
276,-0.36851
277,-0.41697
278,-0.46703
279,-0.33246
280,-0.33793
281,-0.42215
282,-0.39931
283,-0.41557
284,-0.48357
285,-0.53796
286,-0.47662
287,-0.50355
288,-0.46498
289,-0.50748
290,-0.47953
291,-0.42328000000000005
292,-0.5106
293,-0.51117
294,-0.48081999999999997
295,-0.53555
296,-0.47263
297,-0.47407
298,-0.50481
299,-0.51789
300,-0.54478
301,-0.4785
302,-0.5009
303,-0.5506
304,-0.50659
305,-0.54896
306,-0.57952
307,-0.5736
308,-0.59145
309,-0.59635
310,-0.6463
311,-0.6744399999999999
312,-0.66669
313,-0.6954199999999999
314,-0.73836
315,-0.7411
316,-0.7411
317,-0.7411
318,-0.7411
