time,value
0,-0.35834
1,-0.41455
2,-0.5151100000000001
3,-0.6200399999999999
4,-0.68494
5,-0.66333
6,-0.54924
7,-0.34006
8,-0.056847
9,0.27153
10,0.60313
11,0.89754
12,1.1282
13,1.2623
14,1.2766
15,1.163
16,0.9280200000000001
17,0.58329
18,0.16877999999999999
19,-0.26219000000000003
20,-0.64062
21,-0.9264100000000001
22,-1.0686
23,-1.0475
24,-0.89123
25,-0.63979
26,-0.3495
27,-0.090409
28,0.093376
29,0.17259000000000002
30,0.16833
31,0.1098
32,0.055471000000000006
33,0.026156
34,0.06846100000000001
35,0.18012
36,0.34184000000000003
37,0.51226
38,0.64742
39,0.69702
40,0.6402100000000001
41,0.45357
42,0.15962
43,-0.22085
44,-0.6258699999999999
45,-1.0206
46,-1.3224
47,-1.5071
48,-1.5092
49,-1.3188
50,-0.93995
51,-0.39933
52,0.25236
53,0.93673
54,1.5717
55,2.0635
56,2.3567
57,2.4005
58,2.1925
59,1.7491
60,1.1195
61,0.36759000000000003
62,-0.41966000000000003
63,-1.1625
64,-1.7969
65,-2.2639
66,-2.5251
67,-2.5739
68,-2.3996
69,-2.0216
70,-1.4889
71,-0.8492
72,-0.16475
73,0.48336999999999997
74,1.05
75,1.4948
76,1.7825
77,1.9236
78,1.9299
79,1.8307
80,1.6471
81,1.4079
82,1.1199
83,0.79104
84,0.42638000000000004
85,0.042412
86,-0.35097
87,-0.72323
88,-1.0599
89,-1.3256
90,-1.5191
91,-1.6159999999999999
92,-1.617
93,-1.5221
94,-1.3387
95,-1.0667
96,-0.7219800000000001
97,-0.30862
98,0.14237
99,0.60229
100,1.0113
101,1.3358
102,1.5236
103,1.5696
104,1.4667
105,1.2447
106,0.9406100000000001
107,0.6187699999999999
108,0.31261
109,0.048065
110,-0.17447000000000001
111,-0.37651999999999997
112,-0.58601
113,-0.8137300000000001
114,-1.0659
115,-1.3087
116,-1.5
117,-1.5622
118,-1.4683
119,-1.1798
120,-0.71448
121,-0.13127
122,0.48477
123,1.0455
124,1.4709999999999999
125,1.7181
126,1.7590000000000001
127,1.6124
128,1.3329
129,0.96288
130,0.55483
131,0.15229
132,-0.21583000000000002
133,-0.5361100000000001
134,-0.7864
135,-0.95995
136,-1.047
137,-1.0534
138,-0.99323
139,-0.87123
140,-0.6954600000000001
141,-0.5052300000000001
142,-0.30223
143,-0.10279
144,0.091425
145,0.26187
146,0.42173999999999995
147,0.54478
148,0.6419
149,0.69577
150,0.6956
151,0.64513
152,0.5397
153,0.39164
154,0.22451
155,0.029369
156,-0.16527999999999998
157,-0.3663
158,-0.557
159,-0.74408
160,-0.89292
161,-0.9918600000000001
162,-1.0099
163,-0.94529
164,-0.77667
165,-0.52353
166,-0.2004
167,0.16810999999999998
168,0.5744199999999999
169,0.96391
170,1.3356
171,1.6519
172,1.8882
173,1.9941
174,1.9499
175,1.6996
176,1.2283
177,0.5611
178,-0.24989
179,-1.1257
180,-1.9555
181,-2.6180000000000003
182,-3.0177
183,-3.1057
184,-2.8607
185,-2.3271
186,-1.5773
187,-0.7177
188,0.15718
189,0.9474799999999999
190,1.579
191,2.0176
192,2.241
193,2.2745
194,2.1424
195,1.8908
196,1.5625
197,1.2093
198,0.8541799999999999
199,0.5082800000000001
200,0.1743
201,-0.15395999999999999
202,-0.49788000000000004
203,-0.84903
204,-1.2105
205,-1.5418
206,-1.8049
207,-1.9509999999999998
208,-1.9451
209,-1.7601
210,-1.41
211,-0.92895
212,-0.38184
213,0.17282999999999998
214,0.6511899999999999
215,1.023
216,1.2556
217,1.3676
218,1.358
219,1.2796
220,1.1378
221,0.96811
222,0.7767
223,0.5851
224,0.39548
225,0.20799
226,0.015896
227,-0.17615999999999998
228,-0.37534
229,-0.58508
230,-0.82178
231,-1.0503
232,-1.2506
233,-1.3808
234,-1.3969
235,-1.2583
236,-0.96252
237,-0.5321199999999999
238,-0.029258
239,0.48386
240,0.91699
241,1.1985
242,1.3041
243,1.2309999999999999
244,1.0159
245,0.72206
246,0.41367
247,0.13038
248,-0.10424000000000001
249,-0.28919
250,-0.43641
251,-0.5495899999999999
252,-0.63454
253,-0.6715800000000001
254,-0.6439
255,-0.56215
256,-0.40962
257,-0.21883000000000002
258,-0.02876
259,0.11815
260,0.20824
261,0.21265
262,0.15483
263,0.065812
264,-0.013825
265,-0.066545
266,-0.063166
267,-0.0081507
268,0.081152
269,0.163
270,0.23705
271,0.25561999999999996
272,0.22926999999999997
273,0.14985
274,0.044032
275,-0.08778999999999999
276,-0.19958
277,-0.27410999999999996
278,-0.28575
279,-0.21832
280,-0.062901
281,0.16748
282,0.44283
283,0.69309
284,0.86361
285,0.88455
286,0.7357600000000001
287,0.3931
288,-0.082249
289,-0.63383
290,-1.1526
291,-1.548
292,-1.7454
293,-1.7137
294,-1.4753
295,-1.0789
296,-0.5956100000000001
297,-0.10435
298,0.3344
299,0.6814600000000001
300,0.93021
301,1.0739
302,1.1396
303,1.1441
304,1.097
305,1.0098
306,0.8886
307,0.74151
308,0.57284
309,0.38781
310,0.1973
311,-0.00068653
312,-0.21434
313,-0.43108
314,-0.65828
315,-0.8734299999999999
316,-1.0647
317,-1.1964
318,-1.2408
319,-1.1836
320,-1.0172
321,-0.74949
322,-0.42571000000000003
323,-0.067094
324,0.27859
325,0.58718
326,0.8269799999999999
327,1.0004
328,1.0867
329,1.0764
330,0.95955
331,0.75879
332,0.47198
333,0.14054
334,-0.19752999999999998
335,-0.47676999999999997
336,-0.6681699999999999
337,-0.74684
338,-0.72796
339,-0.63185
340,-0.51965
341,-0.43241
342,-0.39395
343,-0.38572
344,-0.38552
345,-0.34313
346,-0.23035999999999998
347,-0.035309
348,0.21613000000000002
349,0.49388999999999994
350,0.73451
351,0.9022899999999999
352,0.95921
353,0.9208
354,0.79571
355,0.60672
356,0.39639
357,0.18085
358,-0.039499
359,-0.25763
360,-0.46889
361,-0.66825
362,-0.83801
363,-0.9310299999999999
364,-0.94201
365,-0.8667799999999999
366,-0.71949
367,-0.532
368,-0.34308
369,-0.18295999999999998
370,-0.056947000000000005
371,0.039304
372,0.12835
373,0.22918000000000002
374,0.36448
375,0.52047
376,0.67683
377,0.80002
378,0.85416
379,0.8141
380,0.66579
381,0.42831
382,0.13967000000000002
383,-0.17465
384,-0.44883
385,-0.64625
386,-0.73153
387,-0.69395
388,-0.51986
389,-0.24115999999999999
390,0.088889
391,0.40475
392,0.6399699999999999
393,0.7135699999999999
394,0.61253
395,0.32223
396,-0.10074
397,-0.59206
398,-1.0605
399,-1.4222
400,-1.6028
401,-1.5821
402,-1.3461
403,-0.94834
404,-0.43803000000000003
405,0.11848
406,0.6611899999999999
407,1.1355
408,1.4991
409,1.7231
410,1.7911
411,1.6942
412,1.4636
413,1.1293
414,0.7456
415,0.36148
416,0.025294
417,-0.24915
418,-0.4613
419,-0.64431
420,-0.8127
421,-1.0074
422,-1.2247
423,-1.4391
424,-1.6097
425,-1.6793
426,-1.5995
427,-1.351
428,-0.94229
429,-0.41452
430,0.18434
431,0.77467
432,1.2898
433,1.6678
434,1.8751
435,1.9036
436,1.7413
437,1.4232
438,0.9929600000000001
439,0.5031
440,0.01001
441,-0.43163
442,-0.7728
443,-0.99797
444,-1.1136
445,-1.1251
446,-1.0721
447,-0.97864
448,-0.86905
449,-0.7359600000000001
450,-0.5924699999999999
451,-0.42062
452,-0.21899000000000002
453,0.031105
454,0.29801
455,0.5614100000000001
456,0.79979
457,0.9845200000000001
458,1.0959
459,1.1329
460,1.0941
461,0.97887
462,0.78623
463,0.53203
464,0.20558
465,-0.15943
466,-0.52407
467,-0.83204
468,-1.0505
469,-1.1307
470,-1.0731
471,-0.90461
472,-0.67247
473,-0.43011000000000005
474,-0.22278
475,-0.0849
476,-0.017174000000000002
477,0.015612000000000001
478,0.028274
479,0.05094
480,0.09652000000000001
481,0.16149000000000002
482,0.21233000000000002
483,0.22211
484,0.18161
485,0.093205
486,-0.013366
487,-0.082773
488,-0.07581900000000001
489,0.031368
490,0.23879
491,0.53342
492,0.85726
493,1.138
494,1.3252
495,1.3411
496,1.1594
497,0.7784399999999999
498,0.22828
499,-0.42708
