time,value
0,0.22635
1,0.24251999999999999
2,0.2586
3,0.27158000000000004
4,0.28765
5,0.29168
6,0.26368
7,0.19902999999999998
8,0.08326599999999999
9,-0.07837000000000001
10,-0.28146
11,-0.50389
12,-0.71465
13,-0.8782200000000001
14,-0.9601799999999999
15,-0.93981
16,-0.80809
17,-0.5612699999999999
18,-0.21783000000000002
19,0.1918
20,0.62642
21,1.0289
22,1.34
23,1.5022
24,1.4946
25,1.3027
26,0.9495299999999999
27,0.46265
28,-0.10525999999999999
29,-0.6771
30,-1.1939
31,-1.5907
32,-1.8125
33,-1.8298
34,-1.6308
35,-1.2405
36,-0.69891
37,-0.065555
38,0.58523
39,1.1683
40,1.6041
41,1.8419999999999999
42,1.8551
43,1.6514
44,1.2699
45,0.77736
46,0.245
47,-0.25919000000000003
48,-0.67595
49,-0.97541
50,-1.1326
51,-1.1566
52,-1.0673
53,-0.8876200000000001
54,-0.6543
55,-0.40660999999999997
56,-0.19319
57,-0.040951999999999995
58,0.030289
59,0.023209999999999998
60,-0.032175999999999996
61,-0.09857300000000001
62,-0.12308
63,-0.063898
64,0.089645
65,0.32945
66,0.60532
67,0.8455299999999999
68,0.98031
69,0.96367
70,0.79186
71,0.49351000000000006
72,0.12972999999999998
73,-0.23085999999999998
74,-0.53847
75,-0.75663
76,-0.8745799999999999
77,-0.90481
78,-0.8506600000000001
79,-0.7248600000000001
80,-0.5151600000000001
81,-0.20924
82,0.18609
83,0.6449600000000001
84,1.097
85,1.4643
86,1.6591
87,1.6092
88,1.2758
89,0.68291
90,-0.08680800000000001
91,-0.92061
92,-1.689
93,-2.2749
94,-2.6011
95,-2.6328
96,-2.3699
97,-1.8562
98,-1.1561
99,-0.34426999999999996
100,0.5049399999999999
101,1.3005
102,1.9691
103,2.4478
104,2.6986
105,2.7
106,2.4642
107,2.0392
108,1.4784
109,0.84955
110,0.21456999999999998
111,-0.3725
112,-0.8764
113,-1.2733
114,-1.5589
115,-1.7314
116,-1.7933
117,-1.7518
118,-1.6284
119,-1.44
120,-1.2122
121,-0.9650299999999999
122,-0.71648
123,-0.46745
124,-0.20838
125,0.066629
126,0.36271
127,0.6722199999999999
128,0.9788100000000001
129,1.2583
130,1.476
131,1.6101
132,1.6434
133,1.5719
134,1.4048
135,1.1572
136,0.8434200000000001
137,0.4752
138,0.065028
139,-0.36524
140,-0.7925300000000001
141,-1.1786
142,-1.4866
143,-1.6804
144,-1.7262
145,-1.6211
146,-1.3738
147,-1.0062
148,-0.56204
149,-0.081963
150,0.39444
151,0.81704
152,1.1415
153,1.3321
154,1.3551
155,1.1978
156,0.87713
157,0.43817
158,-0.045885
159,-0.49854
160,-0.8362299999999999
161,-1.0053
162,-0.98257
163,-0.78487
164,-0.46948
165,-0.097403
166,0.25683
167,0.53481
168,0.7077399999999999
169,0.77703
170,0.75615
171,0.65841
172,0.49848000000000003
173,0.29225
174,0.058372
175,-0.18433
176,-0.41346000000000005
177,-0.61635
178,-0.7621399999999999
179,-0.82955
180,-0.80111
181,-0.68072
182,-0.49138000000000004
183,-0.25004
184,0.001117
185,0.24391999999999997
186,0.43986000000000003
187,0.5635600000000001
188,0.60212
189,0.55513
190,0.44273999999999997
191,0.28037
192,0.10390999999999999
193,-0.05382000000000001
194,-0.16935
195,-0.22489
196,-0.22143000000000002
197,-0.1841
198,-0.135
199,-0.099674
200,-0.09349400000000001
201,-0.11589
202,-0.15291
203,-0.18797
204,-0.20325
205,-0.19276
206,-0.16205999999999998
207,-0.12287999999999999
208,-0.09288300000000001
209,-0.077532
210,-0.067006
211,-0.043164999999999995
212,0.013033000000000001
213,0.12997
214,0.30724
215,0.5350600000000001
216,0.7593300000000001
217,0.93205
218,0.99698
219,0.91809
220,0.6874399999999999
221,0.32088
222,-0.14021
223,-0.6303300000000001
224,-1.087
225,-1.4459
226,-1.6719
227,-1.7344
228,-1.6338
229,-1.3759
230,-0.9864
231,-0.50308
232,0.037054000000000004
233,0.5886100000000001
234,1.1105
235,1.5454
236,1.8518
237,1.9941
238,1.9537
239,1.7266
240,1.3334
241,0.83229
242,0.28110999999999997
243,-0.25001
244,-0.71246
245,-1.0719
246,-1.3079
247,-1.4367
248,-1.4731
249,-1.4338
250,-1.3321
251,-1.171
252,-0.95424
253,-0.6794
254,-0.35736999999999997
255,-0.009367799999999999
256,0.33826999999999996
257,0.65893
258,0.92463
259,1.11
260,1.2022
261,1.1958
262,1.0965
263,0.91869
264,0.6795399999999999
265,0.41448999999999997
266,0.13706
267,-0.11905999999999999
268,-0.32661
269,-0.47107
270,-0.55276
271,-0.59311
272,-0.60578
273,-0.61127
274,-0.6118
275,-0.6048399999999999
276,-0.57536
277,-0.50755
278,-0.37375
279,-0.17008
280,0.079718
281,0.33621
282,0.5523600000000001
283,0.68352
284,0.6995600000000001
285,0.6049100000000001
286,0.41141000000000005
287,0.16284
288,-0.092712
289,-0.32266
290,-0.50243
291,-0.6227
292,-0.67665
293,-0.66811
294,-0.60759
295,-0.48538000000000003
296,-0.31025
297,-0.093794
298,0.14701
299,0.38256
300,0.5845899999999999
301,0.7179800000000001
302,0.76912
303,0.73666
304,0.6448
305,0.52178
306,0.39019000000000004
307,0.28328000000000003
308,0.20307999999999998
309,0.14281
310,0.086406
311,0.008454799999999998
312,-0.10482000000000001
313,-0.2487
314,-0.41896000000000005
315,-0.60432
316,-0.78672
317,-0.93414
318,-1.0359
319,-1.0737
320,-1.0429
321,-0.9370700000000001
322,-0.7570100000000001
323,-0.50865
324,-0.20829
325,0.12644
326,0.46446000000000004
327,0.77304
328,1.0261
329,1.2084
330,1.3079
331,1.3268
332,1.2713
333,1.1441
334,0.9456600000000001
335,0.67988
336,0.36080999999999996
337,-0.012270999999999999
338,-0.41026
339,-0.79955
340,-1.1274
341,-1.3495
342,-1.4276
343,-1.3435
344,-1.1115
345,-0.75889
346,-0.34635
347,0.059608
348,0.39511999999999997
349,0.61195
350,0.68023
351,0.59691
352,0.38361999999999996
353,0.083747
354,-0.24689
355,-0.55062
356,-0.76323
357,-0.83711
358,-0.75034
359,-0.49918999999999997
360,-0.10231
361,0.38583
362,0.88664
363,1.3246
364,1.633
365,1.7631
366,1.6871
367,1.4341
368,1.0435
369,0.58033
370,0.10167999999999999
371,-0.35634
372,-0.76007
373,-1.1118
374,-1.3961
375,-1.6173
376,-1.7669
377,-1.8274
378,-1.7681
379,-1.5902
380,-1.3038
381,-0.92345
382,-0.48958
383,-0.041089999999999995
384,0.39399999999999996
385,0.7852100000000001
386,1.1187
387,1.3964
388,1.6091
389,1.7480000000000002
390,1.8114
391,1.7785
392,1.641
393,1.3881
394,1.0267
395,0.58032
396,0.074102
397,-0.4486
398,-0.95519
399,-1.3969
400,-1.7348
401,-1.9459
402,-2.0
403,-1.8916
404,-1.6272
405,-1.232
406,-0.7376
407,-0.18109
408,0.37045
409,0.87726
410,1.2878
411,1.5655
412,1.6878
413,1.6433
414,1.4309
415,1.063
416,0.58358
417,0.049218
418,-0.48328000000000004
419,-0.9463799999999999
420,-1.2727
421,-1.4207
422,-1.3811
423,-1.1677
424,-0.8127
425,-0.37686
426,0.073348
427,0.48608999999999997
428,0.8248700000000001
429,1.0638
430,1.1812
431,1.1714
432,1.0319
433,0.77595
434,0.43194
435,0.040899
436,-0.36241999999999996
437,-0.72454
438,-0.99167
439,-1.1321
440,-1.1262
441,-0.98325
442,-0.72802
443,-0.40146
444,-0.055962
445,0.25985
446,0.50636
447,0.6483
448,0.66803
449,0.58012
450,0.40408
451,0.18835
452,-0.010053
453,-0.14282
454,-0.17598
455,-0.1049
456,0.037101
457,0.20252
458,0.32506999999999997
459,0.35503
460,0.26118
461,0.04952
462,-0.22801
463,-0.50295
464,-0.7049
465,-0.7851899999999999
466,-0.71842
467,-0.51926
468,-0.22935999999999998
469,0.10588
470,0.42478999999999995
471,0.6855
472,0.87382
473,0.9739
474,0.9824700000000001
475,0.88331
476,0.67971
477,0.36035
478,-0.068698
479,-0.5786100000000001
480,-1.1045
481,-1.5619
482,-1.8663
483,-1.9411
484,-1.7552
485,-1.3158
486,-0.66638
487,0.10079
488,0.87218
489,1.554
490,2.0602
491,2.3269
492,2.3431
493,2.1237
494,1.6987
495,1.1099
496,0.42308
497,-0.28963
498,-0.9598899999999999
499,-1.5133
