d3mIndex,fromNode,toNode
0,501,617
1,501,29264
2,501,3740
3,501,823
4,501,1076
5,501,52043
6,501,1376
7,501,605
8,501,5411
9,501,905
10,501,616
11,501,5441
12,501,1190
13,501,52158
14,501,634
15,501,52013
16,501,1080
17,501,851
18,501,52007
19,501,1072
20,501,726
21,501,1330
22,501,835
23,501,52015
24,501,1370
25,501,2369
26,501,2327
27,501,1612
28,501,3163
29,501,52092
30,501,52021
31,501,3034
32,501,1814
33,501,52012
34,501,5624
35,501,52227
36,501,5169
37,383,455
38,383,94
39,383,8307
40,383,11822
41,383,78361
42,383,68266
43,383,34590
44,383,78265
45,383,11667
46,3647,45580
47,3647,7472
48,3647,37321
49,3647,33067
50,3647,46639
51,3647,46576
52,3647,19600
53,3647,46574
54,3647,46582
55,3647,46565
56,3647,47079
57,3647,46577
58,3647,46563
59,3647,46613
60,3647,871
61,3647,29707
62,3647,46633
63,3647,605
64,3647,4334
65,3213,80315
66,3213,1230
67,3213,498
68,3213,37926
69,3213,80337
70,3213,80583
71,3213,18162
72,3213,3218
73,3213,14873
74,3213,35100
75,3213,80361
76,3213,10220
77,3213,80408
78,3213,759
79,3213,3203
80,3213,80423
81,3213,5459
82,3213,37341
83,3213,45101
84,3213,80518
85,3213,3117
86,3213,5999
87,3213,80628
88,3213,4304
89,3213,3400
90,3213,80642
91,80315,78909
92,1399,1061
93,1399,1063
94,1399,456
95,1399,2162
96,1399,547
97,1399,6587
98,1399,723
99,1399,15810
100,1399,19499
101,1061,3351
102,1061,5548
103,1061,3670
104,1061,5442
105,1061,2887
106,11667,15457
107,11667,527
108,11667,11638
109,11667,11732
110,11667,1211
111,11667,146
112,11667,14329
113,11667,420
114,11667,11685
115,11667,127
116,11667,33179
117,15457,249
118,15457,18976
119,786,447
120,786,1300
121,786,1310
122,786,519
123,786,39653
124,786,864
125,786,641
126,786,558
127,786,3600
128,786,142
129,786,1375
130,786,854
131,786,7745
132,786,642
133,786,1541
134,786,1593
135,786,851
136,786,825
137,786,28968
138,786,1323
139,786,1331
140,786,17215
141,786,5888
142,786,39632
143,786,3307
144,786,610
145,786,611
146,1300,756
147,1300,851
148,1300,807
149,1310,558
150,1310,519
151,1310,1079
152,1310,1360
153,1310,1538
154,1310,538
155,1310,762
156,1310,673
157,1310,928
158,1310,730
159,1310,508
160,1310,1078
161,1310,498
162,1310,1067
163,1310,1313
164,1310,509
165,519,641
166,519,4334
167,519,32797
168,519,930
169,489,603
170,489,144
171,489,491
172,489,851
173,489,612
174,489,655
175,489,1897
176,489,562
177,489,502
178,489,540
179,489,547
180,489,498
181,489,553
182,489,723
183,489,532
184,489,530
185,489,506
186,489,544
187,489,566
188,489,555
189,703,1071
190,703,864
191,1071,5410
192,1071,756
193,1071,508
194,1071,52066
195,1071,856
196,864,508
197,756,624
198,756,5986
199,756,1588
200,756,558
201,144,700
202,144,45083
203,144,29371
204,144,1180
205,144,514
206,144,11669
207,144,17781
208,144,33086
209,144,437
210,144,622
211,144,30526
212,144,85714
213,144,718
214,807,3228
215,807,53429
216,807,712
217,807,29144
218,807,53379
219,807,53440
220,807,4
221,807,5558
222,807,184
223,807,53479
224,807,730
225,807,53488
226,807,3355
227,807,53462
228,807,456
229,807,4214
230,807,17146
231,807,53436
232,807,15795
233,807,53394
234,807,1339
235,807,2827
236,3228,4
237,3228,8467
238,3228,5172
239,3228,544
240,3228,8441
241,3228,8335
242,3228,181
243,3228,8526
244,3228,8391
245,3228,8351
246,3228,8534
247,3228,8328
248,3228,3714
249,3228,8337
250,3228,8332
251,3228,4717
252,3228,3229
253,3228,1528
254,3228,2850
255,3228,9045
256,3228,188
257,3228,8349
258,3228,2024
259,3228,505
260,641,2482
261,641,86260
262,641,6017
263,641,558
264,641,927
265,641,1586
266,641,3382
267,641,985
268,641,17265
269,641,628
270,641,663
271,641,714
272,641,1070
273,641,3923
274,641,600
275,641,4112
276,641,719
277,641,919
278,641,86233
279,641,5380
280,641,4857
281,641,86275
282,641,851
283,641,498
284,641,34400
285,641,4540
286,641,3701
287,641,5293
288,641,1329
289,641,3303
290,641,3283
291,641,1593
292,641,625
293,641,2397
294,641,3026
295,641,518
296,641,9
297,641,5541
298,641,1067
299,641,1315
300,641,825
301,641,3927
302,641,3722
303,641,87195
304,641,3731
305,641,1540
306,641,19985
307,641,1335
308,641,28562
309,641,5191
310,641,982
311,641,7826
312,641,19662
313,641,12512
314,641,877
315,641,1306
316,641,1279
317,641,746
318,641,1331
319,641,610
320,641,86353
321,641,3286
322,641,4623
323,641,3863
324,641,6781
325,641,1364
326,641,5888
327,641,4290
328,641,4819
329,641,86956
330,641,4961
331,641,19986
332,641,2176
333,641,3092
334,641,1077
335,641,5270
336,2482,854
337,2482,3286
338,558,825
339,558,1552
340,558,12514
341,558,628
342,558,3425
343,558,7644
344,558,1586
345,558,17327
346,558,854
347,558,849
348,558,1335
349,558,1331
350,558,28232
351,558,3704
352,558,607
353,558,28812
354,558,28351
355,558,1062
356,558,28562
357,558,28250
358,558,1336
359,558,1063
360,558,28233
361,558,20430
362,558,3624
363,558,1307
364,558,3450
365,558,919
366,558,15461
367,558,1079
368,558,877
369,825,28229
370,825,982
371,825,1331
372,825,1336
373,1552,10259
374,1552,817
375,12514,1593
376,12514,151
377,842,1584
378,842,628
379,842,452
380,628,919
381,628,10269
382,628,610
383,2179,39703
384,2179,1589
385,3351,4178
386,3351,47971
387,3351,18145
388,3351,3894
389,3351,7708
390,3351,5291
391,3351,47968
392,3351,8355
393,3351,2986
394,3351,3460
395,3351,10248
396,3351,47939
397,3351,3431
398,3351,17239
399,3351,3868
400,3351,29343
401,3351,3670
402,3351,17243
403,3351,17245
404,3351,32087
405,3351,3918
406,3351,10247
407,3351,5442
408,3351,3443
409,3351,938
410,3351,49145
411,3351,17124
412,712,713
413,29144,4564
414,5205,41920
415,5205,73587
416,5205,3455
417,5205,48437
418,5205,73496
419,5205,3147
420,5205,73494
421,5205,41403
422,6017,1323
423,527,11702
424,527,550
425,527,4250
426,527,14902
427,527,3029
428,527,281
429,527,11701
430,527,723
431,527,1411
432,527,15291
433,527,126
434,527,540
435,527,125
436,527,2051
437,527,30
438,527,143
439,527,10173
440,927,508
441,498,1550
442,498,508
443,498,758
444,498,764
445,498,143
446,498,76458
447,498,40591
448,498,1329
449,498,953
450,498,3029
451,498,1540
452,498,714
453,498,2092
454,498,611
455,498,496
456,498,1516
457,498,796
458,1550,4594
459,1550,19497
460,1586,17175
461,1586,3927
462,1586,3307
463,1586,17317
464,1586,4979
465,1586,3714
466,1586,10259
467,1586,4088
468,1586,3281
469,1586,4280
470,1586,4623
471,1586,746
472,2100,1070
473,2100,714
474,2100,11678
475,2100,2117
476,2100,5203
477,2100,854
478,2100,48788
479,2100,3180
480,2100,12513
481,2100,1246
482,2100,29466
483,2100,14507
484,2100,18427
485,2100,146
486,2100,4312
487,2100,300
488,2100,4181
489,2100,17687
490,2100,18321
491,2100,33136
492,2100,7828
493,1070,508
494,1070,87150
495,1070,4334
496,1079,3354
497,1079,4857
498,1079,24132
499,1079,71211
500,1079,71247
501,1079,3120
502,1079,71245
503,1079,71220
504,1079,5601
505,1079,71240
506,1079,3061
507,1360,700
508,1360,625
509,29337,928
510,928,885
511,928,851
512,928,908
513,928,1063
514,928,5601
515,928,784
516,928,1376
517,928,5888
518,928,5502
519,491,733
520,491,620
521,491,499
522,491,748
523,491,611
524,491,661
525,505,604
526,505,30
527,505,1199
528,505,174
529,505,4252
530,505,917
531,505,5630
532,505,5479
533,505,5358
534,505,1813
535,505,4508
536,505,5372
537,505,2022
538,505,3035
539,505,5370
540,505,5361
541,505,453
542,505,4557
543,505,5214
544,505,5368
545,505,540
546,505,1412
547,505,4334
548,505,748
549,604,2051
550,604,452
551,604,20668
552,604,550
553,604,540
554,604,580
555,604,30
556,604,542
557,604,125
558,604,500
559,604,890
560,604,544
561,604,23339
562,604,723
563,723,1223
564,723,804
565,723,1573
566,723,2104
567,723,544
568,723,1959
569,723,547
570,723,540
571,723,500
572,723,174
573,723,5497
574,723,1201
575,723,550
576,723,1220
577,723,1231
578,723,1203
579,723,1010
580,723,1210
581,723,1886
582,723,1187
583,723,1414
584,723,1213
585,723,1236
586,723,1224
587,723,1191
588,723,453
589,723,1895
590,723,1195
591,723,419
592,723,1193
593,723,920
594,723,1246
595,723,495
596,723,532
597,723,452
598,723,545
599,723,1192
600,723,1230
601,723,1214
602,723,1887
603,723,1197
604,723,1242
605,723,1239
606,723,1182
607,723,1527
608,723,9931
609,723,1240
610,723,420
611,723,1234
612,723,1200
613,723,580
614,723,510
615,723,719
616,723,1218
617,1223,1411
618,1223,544
619,1223,20745
620,1223,1208
621,1223,547
622,1246,26395
623,1246,540
624,1246,544
625,1246,1894
626,1246,125
627,1068,985
628,1068,851
629,1068,5317
630,985,4296
631,985,4334
632,851,733
633,851,905
634,851,1583
635,851,936
636,851,708
637,851,28215
638,851,508
639,851,5211
640,851,1331
641,851,1329
642,851,1548
643,851,1067
644,2262,4507
645,2262,5277
646,2262,544
647,2262,4503
648,2262,20575
649,2262,15016
650,2262,625
651,4507,4503
652,5277,890
653,5277,901
654,3382,3298
655,3382,3286
656,3382,1331
657,3382,19987
658,905,4260
659,905,4269
660,905,765
661,905,663
662,905,679
663,905,600
664,905,1587
665,905,673
666,2092,4506
667,2092,136
668,2092,1574
669,2092,550
670,2092,890
671,4506,544
672,4506,890
673,17300,28200
674,28200,1279
675,540,10351
676,540,550
677,540,544
678,540,9931
679,540,1178
680,540,954
681,540,1414
682,540,30
683,540,4250
684,540,546
685,540,547
686,540,1245
687,540,149
688,540,2050
689,540,1010
690,540,1574
691,540,5372
692,10351,11695
693,10351,9931
694,3600,1077
695,3600,3199
696,52560,971
697,971,544
698,971,151
699,4558,3298
700,4558,17265
701,4558,3307
702,4558,730
703,3298,17264
704,3298,28230
705,3298,3722
706,3298,5519
707,3298,11369
708,3298,3731
709,142,2102
710,142,2965
711,142,3695
712,142,450
713,142,4063
714,142,1412
715,142,59916
716,142,2129
717,508,708
718,508,624
719,508,1067
720,508,673
721,508,817
722,508,1328
723,508,448
724,508,508
725,508,1547
726,508,642
727,508,1551
728,508,610
729,508,1066
730,508,889
731,508,611
732,508,735
733,508,538
734,508,549
735,714,642
736,714,1376
737,151,14480
738,151,8612
739,151,20884
740,151,5024
741,151,33723
742,151,33704
743,151,10040
744,151,3894
745,151,5600
746,151,17156
747,151,3717
748,151,5905
749,151,3404
750,151,3880
751,151,17264
752,151,14640
753,151,124
754,151,4163
755,151,15724
756,151,3850
757,151,10260
758,151,3704
759,151,1593
760,151,5585
761,151,8634
762,151,35260
763,151,33683
764,151,152
765,151,9313
766,151,3545
767,15612,17234
768,15612,3468
769,17234,5295
770,17234,33768
771,17234,3950
772,17234,14474
773,17234,18197
774,17234,10250
775,17234,15452
776,17234,15741
777,17234,18145
778,17234,5298
779,17234,3918
780,2259,765
781,2259,425
782,765,5461
783,765,143
784,15452,5299
785,15452,15826
786,15452,643
787,15452,3587
788,15452,15749
789,15452,15494
790,15452,4766
791,15452,48936
792,15452,15650
793,15452,29167
794,15452,67360
795,15452,4505
796,15452,29376
797,15452,45046
798,15452,15941
799,15452,15774
800,5299,1593
801,17265,3731
802,1375,19579
803,11695,78430
804,11695,890
805,4,216
806,4,59545
807,4,8595
808,4,111
809,4,20698
810,4,206
811,4,8326
812,4,24534
813,4,171
814,4,40252
815,4,10380
816,4,59551
817,3894,28661
818,5291,4110
819,5291,7712
820,5291,5578
821,5291,3918
822,5295,3303
823,5295,34394
824,15689,5632
825,15689,29174
826,5632,19600
827,5599,33768
828,5599,5496
829,5599,28661
830,33768,15805
831,33768,19878
832,33768,33778
833,11297,5604
834,11297,2878
835,11297,5328
836,11297,5292
837,5604,5552
838,5604,759
839,4110,17855
840,4110,3204
841,4110,5550
842,4110,8365
843,4110,17251
844,4748,17235
845,4748,17248
846,17235,14474
847,17235,3286
848,36549,3
849,36549,29869
850,36549,29082
851,3,118
852,3,11706
853,3,174
854,3,254
855,15805,15787
856,15805,3286
857,15805,15766
858,15805,15754
859,47936,2986
860,47936,7707
861,2986,47935
862,3854,29018
863,3854,143
864,787,5411
865,787,318
866,787,138
867,787,148
868,787,1798
869,787,3015
870,663,125
871,663,764
872,663,1911
873,663,4308
874,663,1593
875,663,762
876,663,4334
877,663,1516
878,663,1077
879,663,4513
880,663,2613
881,3950,4116
882,3468,33766
883,3468,29163
884,1230,33884
885,1230,29732
886,1230,8612
887,5314,40987
888,5314,1593
889,5314,4334
890,14474,2876
891,14474,5328
892,14474,1393
893,901,1868
894,901,78324
895,901,20934
896,901,2022
897,125,544
898,125,1048
899,125,15277
900,125,158
901,125,15291
902,125,661
903,125,804
904,10808,11032
905,10808,11033
906,10808,11022
907,10808,3117
908,10808,68218
909,10808,29643
910,10808,1002
911,10808,70188
912,3218,3099
913,3218,17973
914,3218,3203
915,538,1593
916,538,1275
917,18197,17248
918,18197,5330
919,17247,10256
920,17247,15741
921,10256,700
922,544,1414
923,544,20671
924,544,5688
925,544,20742
926,544,30
927,544,2106
928,544,21036
929,544,1411
930,544,4503
931,544,20747
932,544,9931
933,544,452
934,544,1199
935,544,20869
936,544,20764
937,544,547
938,544,20771
939,544,15272
940,544,216
941,544,20677
942,544,20827
943,544,5345
944,544,1214
945,544,1233
946,544,1193
947,544,916
948,544,963
949,544,2288
950,544,1181
951,544,1192
952,544,149
953,544,1222
954,544,1206
955,544,1231
956,544,1225
957,544,1191
958,544,1186
959,544,1207
960,544,1888
961,544,1202
962,544,20811
963,544,554
964,544,8431
965,544,1493
966,544,1185
967,544,1229
968,544,1184
969,544,1245
970,544,746
971,544,1240
972,544,1201
973,544,1197
974,544,1237
975,544,1209
976,544,1218
977,544,1203
978,544,1208
979,544,20903
980,544,1216
981,544,1188
982,544,1213
983,544,1010
984,544,890
985,544,1187
986,544,419
987,544,1178
988,544,495
989,544,1179
990,544,1183
991,544,1195
992,544,804
993,544,1241
994,544,1220
995,544,1235
996,544,1228
997,544,20853
998,544,1196
999,544,1182
1000,544,417
1001,544,661
1002,544,118
1003,544,1219
1004,544,1242
1005,544,1247
1006,544,550
1007,544,453
1008,544,1212
1009,544,510
1010,544,1239
1011,544,500
1012,544,22876
1013,544,20761
1014,544,580
1015,544,1189
1016,544,20743
1017,544,20780
1018,544,954
1019,764,425
1020,764,3048
1021,9315,4696
1022,9315,5381
1023,9315,7838
1024,9315,5647
1025,9315,3704
1026,3923,3303
1027,3923,6018
1028,625,823
1029,625,600
1030,625,1546
1031,625,1548
1032,625,733
1033,625,726
1034,625,720
1035,625,28215
1036,625,517
1037,625,127
1038,625,580
1039,625,1813
1040,625,890
1041,823,733
1042,3204,3026
1043,3204,143
1044,3204,5438
1045,3204,3046
1046,3204,5999
1047,17973,15953
1048,17973,19578
1049,17973,33884
1050,17973,17747
1051,17973,29392
1052,17973,17351
1053,17973,6095
1054,17973,3233
1055,17973,3203
1056,17973,37325
1057,17973,20022
1058,17973,3096
1059,17973,3400
1060,17973,7421
1061,15953,10042
1062,15953,1346
1063,15953,34188
1064,30,1243
1065,5496,34394
1066,5496,14467
1067,12376,5197
1068,12376,3385
1069,5197,15766
1070,5197,3286
1071,5197,1331
1072,5197,3307
1073,5198,719
1074,719,1593
1075,719,661
1076,719,4334
1077,719,4819
1078,719,5888
1079,719,3307
1080,5381,1336
1081,1959,6058
1082,1959,4288
1083,1959,5690
1084,6058,6112
1085,6058,20668
1086,6058,2238
1087,15650,1593
1088,118,212
1089,118,196
1090,118,179
1091,118,174
1092,118,191
1093,118,84
1094,118,9931
1095,2878,5512
1096,3307,3714
1097,3307,4857
1098,3307,4280
1099,3307,20587
1100,3307,3026
1101,3307,3722
1102,3307,17707
1103,3307,17276
1104,3307,7701
1105,3307,3281
1106,5552,5548
1107,5552,28279
1108,5552,2879
1109,5552,3309
1110,5552,5553
1111,5548,10245
1112,890,26383
1113,890,26403
1114,890,804
1115,890,19637
1116,890,11702
1117,890,5640
1118,890,21513
1119,890,20916
1120,890,4509
1121,890,492
1122,890,21520
1123,890,925
1124,890,1178
1125,890,20677
1126,890,5690
1127,890,1411
1128,890,4504
1129,890,22217
1130,890,5179
1131,890,414
1132,890,1493
1133,890,1414
1134,890,452
1135,890,890
1136,890,11701
1137,890,23749
1138,890,5373
1139,890,20682
1140,890,5688
1141,890,1813
1142,890,4333
1143,890,11681
1144,890,1294
1145,890,21521
1146,890,5374
1147,890,21515
1148,890,15016
1149,890,20683
1150,196,103
1151,179,10349
1152,179,9045
1153,10349,10356
1154,10349,388
1155,10349,42237
1156,10349,190
1157,10349,8334
1158,10349,28725
1159,174,77
1160,174,10753
1161,174,744
1162,174,10763
1163,174,89
1164,174,186
1165,174,10758
1166,174,10760
1167,174,171
1168,174,10391
1169,174,4314
1170,174,9045
1171,174,204
1172,174,276
1173,174,9931
1174,174,110
1175,174,231
1176,174,3447
1177,174,510
1178,174,1527
1179,14739,45109
1180,14739,11901
1181,14739,12377
1182,14739,3117
1183,14739,31801
1184,14739,11721
1185,14739,12356
1186,14739,6106
1187,11678,916
1188,3117,428
1189,19794,33804
1190,19794,19798
1191,19794,20430
1192,19794,33748
1193,19794,3297
1194,19794,45701
1195,19794,45824
1196,600,713
1197,9322,35049
1198,9322,34799
1199,9322,164
1200,9322,51
1201,9322,7897
1202,9322,29664
1203,9322,11706
1204,9322,249
1205,9322,429
1206,9322,1206
1207,47307,47313
1208,47307,261
1209,261,425
1210,261,124
1211,5550,4334
1212,8365,3077
1213,3233,5459
1214,3233,457
1215,5459,27349
1216,5459,4304
1217,3303,3918
1218,3303,5289
1219,3303,8691
1220,3303,5309
1221,3303,5380
1222,3303,10250
1223,3303,3286
1224,3303,1335
1225,3918,3422
1226,216,291
1227,216,9045
1228,216,8326
1229,216,276
1230,216,8336
1231,216,277
1232,216,8608
1233,80337,33251
1234,3460,3446
1235,2876,6039
1236,2876,6096
1237,2876,17293
1238,2876,6040
1239,2876,4088
1240,2876,59063
1241,2876,47233
1242,2876,3527
1243,2876,59067
1244,2876,59066
1245,2876,6819
1246,231,36551
1247,10759,17778
1248,10759,5178
1249,10759,4508
1250,10759,78848
1251,10759,11691
1252,10759,17777
1253,10759,14298
1254,10759,954
1255,10759,253
1256,10759,605
1257,17778,17777
1258,10250,1063
1259,19578,5999
1260,33884,5175
1261,33884,34940
1262,143,446
1263,143,425
1264,143,3860
1265,143,2842
1266,143,2129
1267,143,3412
1268,143,342
1269,143,64019
1270,35960,37852
1271,35960,32084
1272,35960,17156
1273,35960,621
1274,37852,60191
1275,37852,19581
1276,5647,33776
1277,5647,19187
1278,5647,4334
1279,46879,6808
1280,6808,4717
1281,542,8558
1282,542,8470
1283,542,8441
1284,542,8566
1285,542,8644
1286,542,8391
1287,542,547
1288,542,8431
1289,542,1243
1290,542,1199
1291,17239,3403
1292,3309,15774
1293,3309,3297
1294,3309,3300
1295,3309,6110
1296,733,679
1297,733,856
1298,733,1328
1299,733,1066
1300,733,61635
1301,733,15291
1302,1063,5191
1303,1063,5298
1304,1063,5280
1305,1063,5321
1306,1063,4755
1307,1063,25376
1308,1063,148
1309,1063,3451
1310,1063,1539
1311,1063,610
1312,1063,3015
1313,1063,1331
1314,1063,3286
1315,5191,1593
1316,5191,1336
1317,5191,4334
1318,8391,8443
1319,8391,8550
1320,8391,8419
1321,8391,8501
1322,8391,8409
1323,8391,8497
1324,8391,8435
1325,8391,8474
1326,8391,8414
1327,8391,8718
1328,8391,8781
1329,8391,8672
1330,8391,8677
1331,8391,8566
1332,8391,8782
1333,8391,8431
1334,8391,8749
1335,8419,8783
1336,8419,8540
1337,3927,6018
1338,8388,8661
1339,8388,8662
1340,8388,8878
1341,8388,8522
1342,8388,8573
1343,8388,8464
1344,8661,8957
1345,2117,28215
1346,5203,24237
1347,5203,1525
1348,5203,1521
1349,5203,4334
1350,5203,7763
1351,5203,8196
1352,5203,4819
1353,5203,414
1354,3385,34603
1355,3385,38325
1356,3385,5296
1357,3385,3612
1358,3385,38328
1359,3385,3008
1360,17317,9321
1361,4979,1331
1362,4979,3286
1363,7838,4863
1364,7838,3545
1365,7838,2050
1366,7838,7666
1367,7838,3734
1368,7838,2990
1369,7838,5294
1370,7838,5315
1371,7838,17250
1372,7838,32087
1373,7838,27476
1374,854,726
1375,854,45531
1376,854,45535
1377,854,19988
1378,854,28323
1379,854,1329
1380,854,10623
1381,854,1312
1382,854,3081
1383,854,1335
1384,726,28215
1385,46574,47057
1386,46574,46936
1387,46574,46969
1388,46574,46952
1389,46574,46830
1390,46574,46575
1391,46574,46828
1392,1364,40342
1393,1364,4290
1394,89,29640
1395,1336,3057
1396,1336,4088
1397,1336,4857
1398,1336,3735
1399,1336,19986
1400,1336,3701
1401,1336,3026
1402,1336,4961
1403,1336,3286
1404,1336,1335
1405,1336,4984
1406,1336,17193
1407,3057,6040
1408,3057,1593
1409,708,3286
1410,708,1340
1411,29457,10701
1412,29457,3264
1413,29457,45117
1414,5298,15741
1415,5298,15754
1416,5298,3286
1417,3354,1593
1418,3354,15810
1419,15941,15810
1420,15941,3884
1421,33777,5607
1422,33777,17266
1423,8435,5683
1424,8435,8772
1425,8965,8646
1426,8965,8644
1427,8965,8699
1428,8965,8652
1429,8965,8675
1430,919,1335
1431,919,3395
1432,919,5335
1433,919,5338
1434,919,4873
1435,919,1331
1436,7707,47962
1437,7707,47929
1438,4088,1593
1439,5688,4252
1440,5688,9012
1441,5688,4503
1442,4252,5435
1443,4252,52227
1444,1393,1383
1445,1393,15768
1446,425,1412
1447,425,123
1448,425,949
1449,425,7858
1450,425,5493
1451,425,439
1452,425,452
1453,425,546
1454,425,5422
1455,425,456
1456,425,424
1457,425,1276
1458,425,1211
1459,425,19496
1460,425,30537
1461,1412,2234
1462,1412,10973
1463,1412,796
1464,5280,1593
1465,679,808
1466,679,1279
1467,856,1492
1468,856,1589
1469,856,1335
1470,856,1331
1471,14334,14331
1472,14334,11689
1473,14331,11732
1474,8376,8644
1475,8376,8979
1476,8376,8651
1477,8376,8783
1478,8376,8667
1479,8376,8669
1480,8376,8682
1481,8566,8431
1482,8566,8778
1483,8566,9028
1484,8566,8713
1485,8414,8722
1486,8414,8495
1487,456,5290
1488,456,5529
1489,1384,1272
1490,1384,11732
1491,1272,6092
1492,1272,1609
1493,181,84
1494,181,9045
1495,10269,572
1496,572,497
1497,572,4290
1498,86233,86866
1499,8672,8496
1500,8526,9018
1501,8526,8378
1502,8431,20817
1503,8431,20740
1504,8431,23460
1505,8431,13257
1506,8431,20764
1507,8431,20763
1508,8431,1243
1509,8540,8966
1510,8444,8830
1511,8444,8796
1512,8444,8860
1513,8444,8957
1514,5380,5319
1515,5380,12451
1516,5380,3286
1517,5380,4819
1518,3714,11378
1519,3714,1593
1520,5178,3624
1521,5178,452
1522,4508,5176
1523,9059,8522
1524,148,6092
1525,8495,8496
1526,8495,8955
1527,28215,1323
1528,8652,23211
1529,8652,8496
1530,3713,10249
1531,3713,1593
1532,123,2919
1533,4642,7666
1534,4642,28209
1535,4642,3695
1536,7666,450
1537,138,249
1538,138,30537
1539,138,10173
1540,15458,5510
1541,5510,8634
1542,3231,17124
1543,3231,270
1544,17124,3286
1545,8764,8488
1546,8764,8676
1547,8488,20819
1548,8488,8735
1549,642,1589
1550,642,64032
1551,642,3006
1552,8876,5359
1553,8876,8669
1554,8876,8674
1555,5359,8713
1556,5359,10411
1557,8496,8405
1558,8496,8404
1559,8496,8546
1560,8496,8756
1561,8496,8749
1562,8496,8475
1563,8496,8715
1564,8496,8668
1565,8496,8468
1566,8496,8399
1567,8496,8658
1568,8405,8928
1569,8405,8939
1570,8405,8925
1571,8405,8531
1572,8405,8880
1573,6096,59060
1574,6096,59323
1575,6096,59273
1576,8378,8548
1577,8378,8427
1578,8548,8674
1579,8427,8713
1580,1593,1608
1581,1593,5318
1582,1593,28688
1583,1593,5297
1584,1593,5327
1585,1593,5311
1586,1593,5190
1587,1593,3695
1588,1593,949
1589,1593,28690
1590,1593,3432
1591,1593,736
1592,1593,3463
1593,1593,3067
1594,1593,5376
1595,1593,3703
1596,1593,5301
1597,1593,5339
1598,1593,3704
1599,1593,874
1600,1593,5341
1601,1593,843
1602,1593,5286
1603,1593,563
1604,1593,3480
1605,1593,5336
1606,1593,5337
1607,1593,1066
1608,1593,5313
1609,1593,3165
1610,1593,5304
1611,1593,2978
1612,1593,5319
1613,1593,1798
1614,1593,3722
1615,1593,5312
1616,1593,3015
1617,1593,18401
1618,1593,2842
1619,1593,3707
1620,1593,735
1621,1593,930
1622,1593,2960
1623,1593,3697
1624,1593,3742
1625,1593,3721
1626,1593,5283
1627,1593,1334
1628,1593,5293
1629,1593,2911
1630,1593,3230
1631,1593,5195
1632,3281,4984
1633,8667,8957
1634,8528,8680
1635,8528,8480
1636,8528,8747
1637,8528,8455
1638,8528,8713
1639,8528,8878
1640,5319,3286
1641,17156,3286
1642,11378,28209
1643,8749,8713
1644,6040,5327
1645,6040,17266
1646,6040,59448
1647,6040,2944
1648,6040,2975
1649,6040,6610
1650,6040,59456
1651,6040,2966
1652,6040,3079
1653,5175,1813
1654,5553,129
1655,129,5290
1656,129,1222
1657,129,14325
1658,129,15285
1659,5290,127
1660,5290,15810
1661,5290,11890
1662,5290,3029
1663,5290,5978
1664,5290,622
1665,5290,1377
1666,3029,435
1667,3029,546
1668,3029,7695
1669,3029,622
1670,3029,33288
1671,3029,126
1672,3029,128
1673,3029,656
1674,3029,2886
1675,3029,1236
1676,3029,217
1677,3029,444
1678,3029,140
1679,3029,14300
1680,3029,34403
1681,3029,12512
1682,3029,14301
1683,3029,916
1684,18162,5296
1685,29168,36184
1686,29168,33761
1687,29168,18406
1688,29168,19133
1689,33761,700
1690,3264,86888
1691,3264,11791
1692,3264,33223
1693,3264,333
1694,3264,1371
1695,3264,3423
1696,3264,29438
1697,3264,3472
1698,3264,29465
1699,3264,13683
1700,3423,5578
1701,4280,4334
1702,4280,3141
1703,4623,3286
1704,3472,2934
1705,5905,15813
1706,5905,5287
1707,15813,3286
1708,15813,15799
1709,5287,35001
1710,5287,34552
1711,80553,78909
1712,78909,82577
1713,78909,80430
1714,1823,917
1715,1823,14472
1716,1813,1178
1717,1897,742
1718,1897,616
1719,5410,54491
1720,5410,5435
1721,616,914
1722,616,720
1723,33686,3948
1724,33686,3014
1725,9045,53543
1726,9045,10358
1727,9045,10376
1728,9045,91
1729,9045,10354
1730,9045,68
1731,9045,49976
1732,9045,58252
1733,9045,10371
1734,9045,10373
1735,9045,8352
1736,9045,9046
1737,9045,32895
1738,9045,10343
1739,9045,10374
1740,9045,121
1741,9045,277
1742,9045,10347
1743,9045,10353
1744,9045,2024
1745,9045,8351
1746,9045,251
1747,9045,307
1748,9045,252
1749,9045,275
1750,9045,10365
1751,9045,10387
1752,9045,10346
1753,9045,10375
1754,9045,10369
1755,9045,10372
1756,9045,201
1757,9045,32887
1758,9045,293
1759,9045,10352
1760,9045,8349
1761,9045,3743
1762,9045,2659
1763,9045,10378
1764,9045,10385
1765,9045,10363
1766,9045,306
1767,9045,3447
1768,9045,315
1769,9045,10380
1770,9045,3085
1771,9045,10388
1772,9045,76
1773,9045,10350
1774,9045,6755
1775,9045,32882
1776,9045,10361
1777,9045,276
1778,9045,10384
1779,9045,112
1780,9045,10366
1781,9045,10379
1782,9045,10377
1783,9045,32881
1784,9045,10382
1785,9045,9823
1786,9045,96
1787,804,547
1788,804,731
1789,804,1493
1790,804,1243
1791,1573,4334
1792,1573,4873
1793,1573,5890
1794,19988,3286
1795,759,546
1796,759,19800
1797,8302,2023
1798,8302,5301
1799,700,3019
1800,700,10185
1801,700,46256
1802,700,42879
1803,700,5443
1804,700,46255
1805,700,15460
1806,700,930
1807,700,5315
1808,700,32092
1809,700,27392
1810,700,5343
1811,700,3374
1812,700,1352
1813,700,45051
1814,700,3214
1815,700,3040
1816,700,53981
1817,700,15799
1818,700,5505
1819,700,15806
1820,3019,18146
1821,10376,32974
1822,611,5236
1823,611,4760
1824,611,17295
1825,15766,5987
1826,15766,5310
1827,15766,3286
1828,15766,1334
1829,14873,10212
1830,1067,4334
1831,4540,4717
1832,91,85
1833,91,10388
1834,10354,29794
1835,746,3706
1836,746,3141
1837,4503,452
1838,4503,20684
1839,6092,5355
1840,546,5163
1841,546,1332
1842,546,10047
1843,546,31807
1844,546,4962
1845,1798,1243
1846,1798,20727
1847,8351,2024
1848,8351,288
1849,4863,9321
1850,4863,4334
1851,2050,48779
1852,2050,3229
1853,2050,83657
1854,15787,67241
1855,949,37196
1856,9035,8504
1857,9035,8531
1858,9035,8988
1859,9035,8437
1860,9035,8721
1861,8531,8878
1862,8531,10729
1863,3734,3286
1864,2990,10245
1865,28209,17266
1866,17266,5492
1867,17266,32407
1868,17266,6315
1869,17266,32410
1870,17266,6663
1871,17266,10245
1872,17266,6110
1873,17266,32409
1874,17266,4856
1875,5294,2960
1876,3230,5333
1877,3230,64400
1878,3230,31692
1879,5311,15754
1880,3077,3171
1881,3077,55290
1882,3077,10261
1883,3077,6765
1884,3701,3286
1885,3701,3730
1886,3176,3847
1887,3176,73592
1888,3176,3087
1889,33723,34838
1890,2934,6026
1891,2934,6034
1892,2934,6029
1893,2934,3592
1894,2934,6027
1895,2934,2962
1896,2934,3465
1897,2934,4625
1898,2934,6053
1899,2934,6050
1900,2934,6031
1901,68,270
1902,8878,1150
1903,8878,8535
1904,8878,8449
1905,8878,8423
1906,8878,8767
1907,1150,8875
1908,1150,1177
1909,8713,8483
1910,8713,8719
1911,8713,8909
1912,8713,8521
1913,8713,8515
1914,8713,8770
1915,8713,8425
1916,8713,8539
1917,8713,8658
1918,8713,8408
1919,8713,8925
1920,8713,8393
1921,8713,8549
1922,8713,8486
1923,8713,23446
1924,8713,8945
1925,8713,8931
1926,8713,8933
1927,8713,8955
1928,8713,10461
1929,8713,8894
1930,885,3756
1931,730,10204
1932,673,54221
1933,19800,3933
1934,19800,19785
1935,19800,19792
1936,19800,19784
1937,3026,3286
1938,3026,5888
1939,3026,1335
1940,10371,189
1941,17251,5422
1942,2842,29490
1943,2842,424
1944,2842,2848
1945,2842,4163
1946,2842,3061
1947,2842,56195
1948,2842,3214
1949,2842,56187
1950,713,11520
1951,713,857
1952,8755,8446
1953,8755,8479
1954,8755,8525
1955,8755,8453
1956,8755,8503
1957,40591,39792
1958,35100,4709
1959,3180,518
1960,8352,10388
1961,9046,32974
1962,15799,17249
1963,2024,7659
1964,2024,277
1965,2024,8336
1966,84,390
1967,17243,3009
1968,1492,1331
1969,1492,1589
1970,1331,1323
1971,1331,6781
1972,1331,1279
1973,1331,2480
1974,1331,1313
1975,164,51
1976,164,15903
1977,164,10388
1978,164,29921
1979,164,29668
1980,51,29649
1981,51,247
1982,51,29962
1983,249,3071
1984,249,11732
1985,249,10213
1986,249,7427
1987,1414,15954
1988,1414,547
1989,8957,8653
1990,8957,8962
1991,8957,8686
1992,8957,8468
1993,5443,5435
1994,1076,1332
1995,3286,3888
1996,3286,3205
1997,3286,3885
1998,3286,17212
1999,3286,3845
2000,3286,5312
2001,3286,17228
2002,3286,5547
2003,3286,3870
2004,3286,2935
2005,3286,17263
2006,3286,45923
2007,3286,1066
2008,3286,29434
2009,3286,4585
2010,3286,929
2011,3286,3882
2012,3286,2944
2013,3286,2850
2014,3286,17279
2015,3286,4095
2016,3286,4143
2017,3286,3289
2018,3286,5472
2019,3286,10173
2020,3286,2958
2021,3286,17214
2022,3286,1334
2023,3286,8375
2024,3286,5193
2025,3286,3697
2026,3286,1850
2027,3286,4278
2028,3286,3992
2029,3286,5603
2030,3286,15768
2031,3286,33835
2032,3286,5519
2033,3286,5293
2034,3286,7075
2035,3286,17163
2036,3286,33834
2037,3286,3283
2038,3286,3931
2039,3286,19985
2040,3286,17296
2041,3286,5532
2042,3286,3735
2043,3286,1815
2044,3286,4961
2045,3286,6886
2046,3286,4146
2047,3286,2978
2048,3286,7714
2049,3286,5324
2050,3286,40350
2051,3286,4141
2052,3286,3737
2053,3286,31760
2054,3286,3707
2055,3286,5611
2056,3286,4861
2057,3286,5653
2058,3286,17267
2059,3286,35601
2060,3888,930
2061,3205,11778
2062,3205,31678
2063,3205,3203
2064,1411,23080
2065,1411,547
2066,1411,15936
2067,1411,23878
2068,1411,19653
2069,8453,8393
2070,8453,8966
2071,1546,877
2072,11890,52495
2073,11890,9313
2074,11890,11732
2075,11890,418
2076,1376,1323
2077,1376,835
2078,1376,1498
2079,1376,1312
2080,1376,517
2081,1376,1077
2082,1376,1313
2083,1376,1321
2084,1323,674
2085,1323,28267
2086,7659,121
2087,1329,1335
2088,1329,610
2089,1329,1313
2090,17293,3449
2091,954,78146
2092,954,954
2093,954,5631
2094,954,1895
2095,954,133
2096,954,5214
2097,954,1881
2098,954,599
2099,954,1894
2100,954,15274
2101,3880,4873
2102,17264,8629
2103,5631,5630
2104,5631,11523
2105,1895,20016
2106,10374,10387
2107,121,194
2108,121,29414
2109,121,29865
2110,277,277
2111,277,11381
2112,605,5215
2113,12055,43046
2114,12055,3447
2115,12055,100
2116,100,193
2117,9321,15785
2118,9321,20440
2119,9321,10260
2120,9321,29480
2121,10260,33881
2122,10260,8594
2123,10260,5529
2124,10260,27547
2125,10260,5598
2126,1315,4468
2127,15810,3221
2128,15810,17348
2129,15810,15810
2130,15810,13392
2131,15810,3059
2132,20819,8739
2133,20819,21735
2134,20819,22929
2135,20819,21757
2136,20819,2021
2137,20819,22456
2138,20819,20803
2139,20819,8505
2140,20819,21762
2141,5163,871
2142,5296,18155
2143,17777,2096
2144,17777,2828
2145,550,452
2146,550,4250
2147,550,547
2148,550,1243
2149,4334,1523
2150,4334,3149
2151,4334,1185
2152,4334,4213
2153,4334,3612
2154,4334,3089
2155,4334,3634
2156,4334,5221
2157,4334,3662
2158,4334,766
2159,4334,5222
2160,4334,1062
2161,4334,5216
2162,4334,5171
2163,4334,4819
2164,4334,5206
2165,4334,5217
2166,4334,3530
2167,4334,5209
2168,4334,547
2169,4334,5213
2170,4334,4225
2171,4334,5196
2172,4334,598
2173,4334,3932
2174,4334,5199
2175,4334,3975
2176,4334,4859
2177,4334,3015
2178,4334,4867
2179,4334,5162
2180,4334,3583
2181,4334,5649
2182,4334,3031
2183,4334,775
2184,4334,1077
2185,4334,3624
2186,4334,5644
2187,4334,4865
2188,4334,3577
2189,4334,4839
2190,4334,4840
2191,4334,2862
2192,4334,3979
2193,4334,2518
2194,4334,4849
2195,4334,7552
2196,4334,1525
2197,4334,3160
2198,4334,5220
2199,4334,3158
2200,4334,5204
2201,4334,3167
2202,4334,3935
2203,4334,2480
2204,1523,11539
2205,597,10212
2206,597,46616
2207,4709,2475
2208,29466,5305
2209,5305,14469
2210,3283,4992
2211,10378,112
2212,10378,32974
2213,112,288
2214,112,8370
2215,591,1562
2216,591,2256
2217,591,547
2218,591,1178
2219,591,770
2220,591,2021
2221,591,794
2222,591,20830
2223,591,1563
2224,591,512
2225,591,1942
2226,591,1909
2227,591,22583
2228,591,23303
2229,5306,4407
2230,4407,4873
2231,4407,270
2232,4858,3140
2233,4858,3602
2234,4858,5193
2235,4858,5218
2236,4858,3659
2237,4858,5222
2238,4858,4511
2239,4858,3150
2240,4858,465
2241,4858,3149
2242,4858,5216
2243,4858,4865
2244,4858,3558
2245,4858,3609
2246,4858,6844
2247,4858,5890
2248,3140,5212
2249,3014,5316
2250,3014,58815
2251,3014,58864
2252,3014,2960
2253,5316,3008
2254,448,4290
2255,2105,416
2256,416,59916
2257,17295,10
2258,452,1493
2259,252,272
2260,20963,22737
2261,20963,22735
2262,20963,22722
2263,20963,8521
2264,20963,22967
2265,20963,8937
2266,20963,22987
2267,20963,22969
2268,20963,21681
2269,20963,22964
2270,20963,22704
2271,20963,22992
2272,20963,22734
2273,20963,21746
2274,20963,22740
2275,20963,22741
2276,20963,23013
2277,20963,22963
2278,22737,20906
2279,22737,20727
2280,1335,1589
2281,1335,5502
2282,1335,4961
2283,1335,28259
2284,1335,11369
2285,1335,19883
2286,1335,4978
2287,1335,1313
2288,1335,1306
2289,720,5435
2290,10365,276
2291,10365,9820
2292,547,1415
2293,547,636
2294,547,500
2295,547,23742
2296,547,545
2297,547,2027
2298,547,136
2299,547,2053
2300,547,453
2301,547,1236
2302,547,510
2303,547,1178
2304,547,580
2305,547,23611
2306,547,23623
2307,547,23682
2308,2397,188
2309,3602,7505
2310,3602,3048
2311,5193,5890
2312,1180,1243
2313,194,401
2314,194,389
2315,194,10459
2316,194,200
2317,401,29668
2318,20742,20768
2319,22722,20906
2320,4717,6617
2321,4717,130
2322,4717,10705
2323,4717,10704
2324,4717,6819
2325,1330,5441
2326,3840,11531
2327,3840,2138
2328,3840,731
2329,3840,3144
2330,3840,2234
2331,3840,11546
2332,8735,22956
2333,11679,126
2334,126,755
2335,6095,241
2336,300,270
2337,874,29953
2338,288,288
2339,674,871
2340,2021,20906
2341,2021,2019
2342,2021,1623
2343,5218,5221
2344,3659,3624
2345,3659,7436
2346,17228,8594
2347,518,131
2348,1243,2124
2349,1243,2333
2350,1243,1245
2351,1243,187
2352,1243,25312
2353,1243,20830
2354,1243,20763
2355,1243,1249
2356,607,592
2357,908,49633
2358,908,49628
2359,2106,9931
2360,4509,28725
2361,4509,20677
2362,9,610
2363,9,5029
2364,8875,8481
2365,46660,871
2366,20740,20743
2367,20740,23479
2368,20740,20827
2369,6112,10279
2370,6112,768
2371,6112,6703
2372,6112,6629
2373,6112,6856
2374,6112,6675
2375,3592,4819
2376,5547,5611
2377,3149,5212
2378,3149,7505
2379,1185,4216
2380,32890,276
2381,32890,10356
2382,276,9820
2383,276,276
2384,2935,2844
2385,17263,35597
2386,17263,3075
2387,17263,929
2388,22969,20906
2389,5220,3150
2390,5220,5221
2391,3150,5890
2392,2051,661
2393,15768,8634
2394,1415,270
2395,5204,37980
2396,5204,38047
2397,5204,37962
2398,5204,37981
2399,5204,11539
2400,37980,38071
2401,37980,38101
2402,37980,38098
2403,37980,38073
2404,8375,58867
2405,6625,4873
2406,4873,3119
2407,4873,731
2408,4873,3935
2409,4873,4225
2410,4873,4841
2411,4873,3928
2412,4873,3932
2413,4873,1236
2414,4873,5196
2415,4873,11539
2416,4873,5645
2417,4873,1849
2418,4873,6720
2419,4873,4839
2420,1066,1313
2421,44605,3015
2422,3015,672
2423,3015,17644
2424,3015,29953
2425,4213,11539
2426,9931,20859
2427,9931,15272
2428,9931,1894
2429,9931,19495
2430,9931,731
2431,9931,2238
2432,9931,12388
2433,9931,20670
2434,9931,50601
2435,9931,19609
2436,9931,281
2437,9931,1244
2438,1589,2173
2439,3203,17661
2440,3203,3211
2441,3203,3217
2442,3203,3079
2443,1547,52010
2444,1190,4072
2445,925,956
2446,656,1278
2447,1236,5645
2448,3119,24232
2449,20743,20813
2450,20743,23062
2451,12512,40578
2452,5438,5601
2453,188,531
2454,531,566
2455,531,4290
2456,500,961
2457,500,731
2458,500,1944
2459,500,548
2460,500,553
2461,419,3985
2462,419,4282
2463,419,1525
2464,419,1526
2465,419,4845
2466,4511,3147
2467,4511,5212
2468,961,574
2469,15936,15904
2470,916,11904
2471,916,64032
2472,11732,382
2473,11732,14332
2474,11732,14322
2475,11732,14329
2476,11732,4217
2477,11732,14321
2478,11732,2
2479,11732,68259
2480,382,15405
2481,20668,17850
2482,281,76904
2483,272,8349
2484,272,29
2485,517,40597
2486,1062,3897
2487,1525,4820
2488,191,32889
2489,492,1574
2490,5221,4510
2491,5221,4840
2492,5221,3147
2493,553,543
2494,2960,2962
2495,2960,40398
2496,217,5589
2497,731,24248
2498,731,11526
2499,731,4216
2500,731,11536
2501,731,27996
2502,731,2907
2503,24248,24240
2504,3355,4233
2505,3355,1294
2506,610,1069
2507,610,1307
2508,610,2480
2509,610,87022
2510,1069,877
2511,1528,28782
2512,29921,29702
2513,205,256
2514,205,566
2515,20906,22717
2516,20906,22963
2517,20906,22734
2518,20906,22711
2519,20906,23025
2520,20906,8482
2521,20906,23013
2522,20906,22994
2523,20906,21684
2524,20906,2446
2525,20906,20780
2526,20906,24956
2527,20906,20891
2528,20906,22714
2529,20906,23015
2530,7505,465
2531,7505,5207
2532,7505,5890
2533,7505,5209
2534,7505,3036
2535,7505,3448
2536,7505,5164
2537,59066,59299
2538,59066,59075
2539,634,1225
2540,634,71088
2541,1521,4820
2542,267,939
2543,267,2701
2544,939,31525
2545,3147,7618
2546,3147,2518
2547,3147,7625
2548,3147,5890
2549,3147,6844
2550,24240,11538
2551,24240,5645
2552,24240,2161
2553,24240,3723
2554,24240,4216
2555,11538,11541
2556,5645,4859
2557,5645,270
2558,39792,76660
2559,39792,40824
2560,39792,76655
2561,39792,40527
2562,39792,76413
2563,39792,40857
2564,39792,76653
2565,39792,40297
2566,39792,40829
2567,39792,4311
2568,39792,40820
2569,22704,8772
2570,20682,2378
2571,73592,74356
2572,73592,3646
2573,73592,3142
2574,73592,4869
2575,73592,4336
2576,3646,4819
2577,85,10379
2578,85,58642
2579,10379,32974
2580,766,4265
2581,10226,171
2582,11748,225
2583,225,59916
2584,5207,5890
2585,5601,19733
2586,5601,5601
2587,5601,19805
2588,5890,4840
2589,5890,57949
2590,5890,3629
2591,5890,4429
2592,5890,3943
2593,5890,3036
2594,5890,4819
2595,5890,2516
2596,5890,5890
2597,5890,3133
2598,5890,2701
2599,929,34394
2600,1178,26330
2601,1178,1232
2602,1178,28725
2603,1178,1494
2604,1178,1228
2605,3297,35167
2606,3297,3304
2607,3297,3312
2608,45117,15291
2609,45117,45798
2610,45117,34429
2611,45117,28883
2612,15291,6692
2613,15291,14315
2614,15291,15274
2615,15291,8366
2616,15291,15281
2617,15291,2556
2618,15291,5999
2619,15291,15264
2620,15291,15270
2621,566,1284
2622,4819,4966
2623,4819,3191
2624,4819,5196
2625,4819,5379
2626,4819,4969
2627,4819,1849
2628,10459,270
2629,20677,15921
2630,11904,14504
2631,1239,23086
2632,5442,1888
2633,29867,253
2634,4841,3656
2635,4214,7475
2636,5888,5519
2637,5888,7701
2638,5888,17161
2639,5888,17707
2640,103,117
2641,3882,29480
2642,28999,3127
2643,28999,5530
2644,5530,2978
2645,10245,2844
2646,10245,10257
2647,914,18976
2648,5212,5210
2649,29480,40248
2650,29480,17323
2651,29480,8598
2652,5215,35975
2653,10388,10404
2654,10388,58269
2655,77589,457
2656,34394,5304
2657,47438,10381
2658,10381,58269
2659,10381,29
2660,631,3903
2661,631,1819
2662,21762,22876
2663,20827,23476
2664,20827,20771
2665,20827,23058
2666,2161,11541
2667,10042,6841
2668,4143,270
2669,8772,22736
2670,8772,20727
2671,532,12521
2672,20879,22721
2673,22721,20727
2674,847,1346
2675,8693,4248
2676,8693,10192
2677,8693,6799
2678,8693,6614
2679,8693,3641
2680,8693,10164
2681,8693,3884
2682,8693,10189
2683,429,245
2684,245,37580
2685,10173,12519
2686,10173,153
2687,10173,3006
2688,40248,7664
2689,2844,5549
2690,2844,35563
2691,2844,3925
2692,32974,58765
2693,32974,8327
2694,32974,33061
2695,32974,58596
2696,32974,10383
2697,3838,3061
2698,3838,5201
2699,3838,24243
2700,3061,43942
2701,1572,61874
2702,1572,5435
2703,1866,348
2704,348,4290
2705,3943,15762
2706,17298,37277
2707,17298,37271
2708,17298,31531
2709,17298,5366
2710,17298,3756
2711,18976,34446
2712,2840,3083
2713,2840,3641
2714,3641,3053
2715,7664,5141
2716,7664,11753
2717,3884,8348
2718,3884,1888
2719,3884,3457
2720,661,20016
2721,5529,19143
2722,5164,7239
2723,8966,8684
2724,580,17776
2725,4072,4805
2726,2907,2234
2727,10204,4187
2728,13257,22809
2729,20964,22579
2730,20964,22961
2731,20964,22993
2732,20964,22738
2733,20964,22724
2734,20964,22716
2735,20964,22719
2736,20964,23017
2737,20964,23013
2738,2234,11539
2739,8634,4304
2740,8327,938
2741,3191,15949
2742,3191,3006
2743,15754,490
2744,8394,22719
2745,2238,15262
2746,2238,208
2747,22740,20727
2748,1226,453
2749,1226,1010
2750,453,510
2751,11541,24252
2752,11541,4845
2753,963,1113
2754,6595,12521
2755,12521,4290
2756,3931,3006
2757,80430,80709
2758,29933,29192
2759,29933,5435
2760,22724,20727
2761,149,11712
2762,4820,7763
2763,598,11539
2764,2475,3199
2765,14325,59916
2766,270,3962
2767,270,32617
2768,270,9814
2769,270,53592
2770,270,35242
2771,270,65017
2772,270,55989
2773,270,5167
2774,270,69245
2775,270,18210
2776,270,1524
2777,270,2851
2778,270,32427
2779,270,10211
2780,270,3306
2781,270,70212
2782,270,5706
2783,270,5672
2784,270,18236
2785,2980,2848
2786,20811,20761
2787,20761,21253
2788,20761,20748
2789,599,11712
2790,5549,32304
2791,18146,29743
2792,1888,5435
2793,1888,29953
2794,668,1909
2795,668,1945
2796,668,1943
2797,64032,17776
2798,3120,5435
2799,28725,1884
2800,28725,11681
2801,1340,802
2802,8348,6659
2803,8348,6725
2804,8348,6853
2805,8348,10313
2806,11539,27997
2807,11539,24231
2808,11539,7088
2809,11539,10973
2810,11539,1814
2811,1237,1183
2812,5358,5373
2813,14469,1955
2814,20763,2165
2815,20763,25307
2816,2165,26938
2817,131,970
2818,131,239
2819,19653,19653
2820,1955,4715
2821,1312,1313
2822,4859,36378
2823,4805,81440
2824,4290,302
2825,4290,902
2826,4290,7670
2827,3199,4083
2828,3199,3914
2829,29953,3585
2830,29953,64160
2831,1313,496
2832,4063,2966
2833,2446,22876
2834,5435,1819
2835,5435,4533
2836,5435,5282
2837,5435,31802
2838,5435,3438
2839,5435,887
2840,5282,3965
2841,3400,34477
2842,3400,81439
2843,28661,2871
2844,28661,27534
2845,28661,32088
2846,28661,19190
2847,32981,8333
2848,32981,58612
2849,32981,58642
2850,5426,2701
2851,2701,10219
2852,20727,25959
2853,20727,22726
2854,20727,22876
2855,20727,22428
2856,20727,22742
2857,20727,22713
2858,30765,15883
2859,30765,7499
2860,30765,14006
2861,30765,1064
2862,30765,322
2863,30765,1533
2864,30765,1321
2865,3034,52016
2866,3034,5370
2867,22876,25767
2868,22876,22894
2869,22876,20733
2870,22876,22918
2871,22876,22892
2872,22876,22915
2873,22876,23502
2874,22876,22920
2875,4304,4304
2876,10219,15932
2877,11712,445
2878,2887,6746
2879,2887,6743
2880,2887,6658
2881,2887,6865
2882,322,12378
2883,4715,34208
2884,3637,3008
2885,52034,29110
2886,29110,5029
2887,10211,2930
2888,11753,37851
2889,3438,2905
2890,26938,962
2891,3217,3066
2892,5029,529
2893,5029,722
2894,5029,10679
2895,5029,24535
2896,58642,15543
2897,58642,10345
2898,58642,258
2899,58642,42370
2900,58642,32711
2901,59916,4075
2902,59916,6852
2903,59916,5436
2904,81440,79232
2905,4334,3609
2906,4334,3298
2907,4334,5162
2908,4334,5601
2909,4334,5213
2910,4334,5207
2911,4334,1525
2912,4334,1523
2913,4334,4841
2914,4334,4867
2915,4334,3176
2916,505,5164
2917,505,4506
2918,505,625
2919,505,1527
2920,505,452
2921,505,786
2922,5164,919
2923,501,726
2924,501,508
2925,501,1080
2926,501,4252
2927,39792,40820
2928,39792,40527
2929,2092,1493
2930,1493,544
2931,1493,2827
2932,1493,1352
2933,1493,4503
2934,1493,890
2935,1336,3281
2936,1336,5601
2937,1336,11369
2938,1336,3935
2939,1336,3283
2940,1336,610
2941,1336,1340
2942,1336,1331
2943,1336,628
2944,1336,1321
2945,3281,1335
2946,3281,4146
2947,3281,4961
2948,3281,3722
2949,3281,7701
2950,3281,20587
2951,5601,1335
2952,807,1063
2953,807,450
2954,807,1593
2955,807,1340
2956,807,3214
2957,807,1335
2958,807,5410
2959,663,545
2960,663,1335
2961,663,1077
2962,3412,142
2963,3914,3931
2964,3914,3446
2965,4072,3704
2966,22876,2446
2967,22876,22713
2968,1200,544
2969,591,545
2970,591,414
2971,9931,550
2972,9931,1243
2973,9931,2238
2974,9931,12388
2975,9931,1895
2976,9931,723
2977,9931,125
2978,9931,2828
2979,9931,1894
2980,9931,15936
2981,9931,599
2982,9931,731
2983,9931,1574
2984,9931,1881
2985,9931,30
2986,9931,1245
2987,550,489
2988,550,723
2989,890,4508
2990,890,4505
2991,890,5179
2992,890,2022
2993,890,1246
2994,890,19609
2995,890,21513
2996,890,925
2997,890,4503
2998,890,532
2999,890,4506
3000,890,4509
3001,890,1178
3002,890,2828
3003,890,21520
3004,890,20916
3005,890,19637
3006,890,890
3007,890,5372
3008,890,5178
3009,890,549
3010,890,723
3011,890,954
3012,890,5277
3013,890,1199
3014,890,452
3015,890,11695
3016,890,1813
3017,890,125
3018,890,4333
3019,890,804
3020,890,604
3021,4508,604
3022,5179,4509
3023,2022,5178
3024,723,1182
3025,723,527
3026,723,1189
3027,723,540
3028,723,796
3029,723,452
3030,723,489
3031,723,125
3032,723,1887
3033,723,1574
3034,723,1815
3035,723,1180
3036,723,1187
3037,723,1229
3038,723,580
3039,723,414
3040,723,544
3041,723,1236
3042,723,723
3043,723,1178
3044,723,804
3045,723,148
3046,723,510
3047,1182,544
3048,1182,1178
3049,641,628
3050,641,3286
3051,641,851
3052,641,4978
3053,641,1335
3054,641,714
3055,641,4280
3056,641,1340
3057,641,2842
3058,628,558
3059,628,1279
3060,628,1331
3061,628,518
3062,628,1070
3063,628,1340
3064,628,953
3065,628,1323
3066,628,4819
3067,452,5277
3068,452,1246
3069,452,1959
3070,452,544
3071,452,527
3072,452,20668
3073,452,19637
3074,452,17777
3075,452,125
3076,452,4507
3077,452,1199
3078,452,11701
3079,452,804
3080,452,580
3081,452,2828
3082,452,604
3083,452,925
3084,452,11695
3085,452,1574
3086,414,1526
3087,414,1010
3088,414,1527
3089,414,5203
3090,414,544
3091,414,625
3092,414,1234
3093,414,419
3094,414,1523
3095,414,2828
3096,2887,2842
3097,2887,3577
3098,2887,418
3099,2842,3931
3100,2842,2850
3101,2842,56187
3102,2842,2844
3103,2842,2960
3104,2842,3066
3105,2842,3354
3106,1526,4216
3107,1526,419
3108,538,131
3109,538,661
3110,538,540
3111,538,1323
3112,131,508
3113,131,125
3114,131,970
3115,131,11667
3116,1335,1593
3117,1335,3307
3118,1335,558
3119,1335,3026
3120,1335,1313
3121,1335,4280
3122,1335,610
3123,1335,1323
3124,1335,17193
3125,1335,3880
3126,1335,3697
3127,1335,1340
3128,1335,4978
3129,1335,518
3130,1335,3722
3131,1335,1067
3132,1335,448
3133,1335,1077
3134,1335,1068
3135,1335,10260
3136,1335,7714
3137,1335,1070
3138,1335,3119
3139,1335,3286
3140,20727,8772
3141,20727,22716
3142,20727,22741
3143,20727,20906
3144,20727,20780
3145,20727,22721
3146,20727,544
3147,20727,8394
3148,20727,21746
3149,20727,22722
3150,20727,8531
3151,20727,22742
3152,1593,713
3153,1593,5305
3154,1593,4269
3155,1593,919
3156,1593,5333
3157,1593,2978
3158,1593,1334
3159,1593,3735
3160,1593,3583
3161,1593,3351
3162,919,746
3163,4715,437
3164,4715,18321
3165,4715,143
3166,144,622
3167,144,5999
3168,544,604
3169,544,1178
3170,544,1230
3171,544,746
3172,544,419
3173,544,1225
3174,544,1242
3175,544,1237
3176,544,719
3177,544,1180
3178,544,1193
3179,544,2828
3180,544,1189
3181,544,1211
3182,544,1183
3183,544,1249
3184,544,1179
3185,544,1232
3186,544,125
3187,544,500
3188,544,8431
3189,544,916
3190,544,1236
3191,544,804
3192,544,580
3193,544,1574
3194,544,963
3195,544,1412
3196,544,2129
3197,544,142
3198,544,457
3199,544,1352
3200,544,925
3201,544,20813
3202,544,971
3203,544,661
3204,544,1798
3205,544,1199
3206,604,1178
3207,604,604
3208,604,4509
3209,1178,796
3210,1178,5204
3211,1178,1213
3212,1178,2161
3213,1178,4873
3214,1178,3167
3215,1178,11695
3216,1178,4820
3217,1178,23025
3218,1178,1814
3219,1178,24240
3220,1178,1521
3221,1178,419
3222,1178,2828
3223,1178,10973
3224,28661,3918
3225,28661,3868
3226,270,3149
3227,270,517
3228,270,1067
3229,270,726
3230,1230,5598
3231,1061,3918
3232,1061,3965
3233,20934,540
3234,20934,5688
3235,20934,1895
3236,20934,5178
3237,20934,17776
3238,540,1527
3239,540,318
3240,540,457
3241,540,5277
3242,540,661
3243,3918,17245
3244,3918,3894
3245,3918,938
3246,3046,15810
3247,3046,3053
3248,20763,8431
3249,20763,125
3250,8431,1243
3251,143,2848
3252,143,3204
3253,143,151
3254,143,611
3255,143,3585
3256,2848,3395
3257,1307,558
3258,1307,508
3259,558,1062
3260,558,4225
3261,558,1331
3262,558,3704
3263,558,4819
3264,558,1323
3265,3048,3036
3266,3048,3577
3267,746,3985
3268,746,5178
3269,1077,3600
3270,527,14315
3271,527,4217
3272,527,125
3273,527,1959
3274,527,954
3275,419,3838
3276,419,1525
3277,419,2965
3278,3307,1062
3279,3307,20587
3280,3307,4146
3281,3307,3882
3282,416,129
3283,416,126
3284,416,11890
3285,416,151
3286,416,148
3287,416,127
3288,129,10260
3289,129,123
3290,126,2556
3291,126,6703
3292,126,10040
3293,126,4468
3294,126,448
3295,126,14298
3296,457,127
3297,457,1527
3298,457,3006
3299,457,153
3300,103,12055
3301,103,51
3302,3286,17279
3303,3286,6017
3304,3286,1067
3305,3286,1063
3306,3286,3735
3307,3286,5550
3308,3286,12513
3309,3286,5163
3310,3286,2935
3311,3286,3870
3312,3286,3300
3313,3286,9315
3314,3286,4979
3315,3286,17163
3316,3286,2978
3317,3286,1079
3318,3286,3600
3319,6017,3722
3320,133,125
3321,3838,125
3322,3838,1814
3323,1527,4511
3324,1243,1249
3325,1243,1244
3326,1243,2333
3327,1243,13257
3328,1243,2021
3329,3,146
3330,3,11681
3331,3,2
3332,3,128
3333,3,118
3334,322,288
3335,322,251
3336,954,901
3337,954,11701
3338,545,854
3339,545,4873
3340,425,128
3341,425,11712
3342,10042,3077
3343,267,2934
3344,2934,2050
3345,2934,6039
3346,2844,2930
3347,5999,3354
3348,489,519
3349,519,4290
3350,59916,2516
3351,3006,4533
3352,3006,5191
3353,3006,152
3354,382,140
3355,318,766
3356,318,11904
3357,318,249
3358,318,420
3359,2475,3199
3360,2475,142
3361,3395,877
3362,3395,1815
3363,3395,3160
3364,10173,2965
3365,10173,2100
3366,2965,142
3367,2965,123
3368,2965,3142
3369,2965,2162
3370,2965,3081
3371,2965,3029
3372,1523,3144
3373,1523,2100
3374,151,3656
3375,151,3697
3376,151,152
3377,748,3034
3378,3034,3641
3379,1881,29643
3380,796,498
3381,2827,1063
3382,2827,874
3383,2827,142
3384,2827,3229
3385,2827,4214
3386,2827,2050
3387,3950,152
3388,3026,3300
3389,9322,9313
3390,9322,15903
3391,3035,3602
3392,532,508
3393,532,125
3394,448,508
3395,10759,1959
3396,20771,20813
3397,20813,20743
3398,8336,277
3399,8336,251
3400,8336,288
3401,277,251
3402,277,112
3403,3722,3731
3404,3722,1331
3405,3722,4979
3406,29,216
3407,29,30
3408,29,112
3409,1574,174
3410,1574,1959
3411,3948,7714
3412,3948,1814
3413,10808,125
3414,6595,631
3415,6595,6853
3416,6595,11890
3417,6595,6595
3418,631,1524
3419,2828,1244
3420,2828,10973
3421,498,775
3422,1895,20668
3423,127,125
3424,4819,3928
3425,4819,762
3426,1313,610
3427,1313,877
3428,1313,1323
3429,1313,856
3430,1313,1313
3431,1313,1331
3432,1313,1315
3433,20743,20764
3434,20743,20740
3435,20764,20740
3436,10257,3385
3437,212,204
3438,30,174
3439,3229,2050
3440,3229,2850
3441,3199,6765
3442,4217,14325
3443,437,11904
3444,437,3704
3445,142,786
3446,142,146
3447,142,3600
3448,142,424
3449,142,4564
3450,142,3756
3451,142,446
3452,142,1002
3453,142,2100
3454,142,123
3455,1066,1492
3456,508,1068
3457,508,603
3458,508,512
3459,508,847
3460,5624,2369
3461,851,499
3462,4216,24240
3463,3176,2162
3464,1079,1340
3465,1079,3701
3466,1079,1067
3467,1079,1079
3468,3300,4978
3469,1340,1340
3470,1340,1329
3471,9045,2024
3472,9045,10361
3473,9045,275
3474,9045,315
3475,9045,3447
3476,9045,276
3477,9045,293
3478,9045,10371
3479,9045,32895
3480,9045,76
3481,9045,10380
3482,9045,6675
3483,9045,32882
3484,9045,10459
3485,9045,8349
3486,2024,3085
3487,2024,32981
3488,20677,20668
3489,20677,1959
3490,20677,19653
3491,20668,4509
3492,186,121
3493,125,136
3494,125,138
3495,125,153
3496,146,11712
3497,2907,1814
3498,1814,4873
3499,1814,1814
3500,1814,3160
3501,1814,5204
3502,1814,4845
3503,1814,11538
3504,1814,4820
3505,610,985
3506,610,1064
3507,4503,15016
3508,4503,5178
3509,1352,4214
3510,2161,1415
3511,1246,5178
3512,9814,29640
3513,204,174
3514,204,118
3515,5178,3141
3516,11748,11667
3517,1815,24240
3518,766,4510
3519,3985,1524
3520,3985,3158
3521,1524,24240
3522,30765,300
3523,1294,1959
3524,58642,9
3525,9,181
3526,174,111
3527,174,89
3528,174,200
3529,174,118
3530,174,10
3531,174,4557
3532,174,201
3533,11538,4873
3534,11538,3158
3535,11538,4278
3536,8470,8749
3537,8470,8676
3538,8376,8735
3539,2100,1494
3540,1959,17323
3541,1959,1199
3542,22714,22737
3543,22714,22722
3544,3228,4858
3545,3228,3624
3546,15953,34188
3547,661,1199
3548,3167,24240
3549,2850,3081
3550,24240,27997
3551,3147,4857
3552,3992,4143
3553,4143,2930
3554,5550,10260
3555,804,17777
3556,85,118
3557,85,8327
3558,118,10371
3559,11546,6625
3560,611,4760
3561,611,5236
3562,3141,148
3563,3141,3624
3564,51,89
3565,51,164
3566,51,68
3567,51,6781
3568,51,261
3569,51,29921
3570,51,29649
3571,1310,1329
3572,1310,808
3573,825,4225
3574,825,1331
3575,825,1323
3576,315,181
3577,251,112
3578,251,288
3579,251,10369
3580,251,32981
3581,251,17781
3582,251,9046
3583,251,181
3584,251,401
3585,3646,17777
3586,1213,123
3587,2050,4075
3588,2050,1414
3589,642,1300
3590,1494,11541
3591,2930,2966
3592,2930,3351
3593,2930,2930
3594,32889,10382
3595,32889,8608
3596,3737,3306
3597,3737,3351
3598,1279,1331
3599,5640,20916
3600,288,17781
3601,420,453
3602,2,10374
3603,2,117
3604,2,247
3605,5205,231
3606,4820,3158
3607,4820,1850
3608,3463,3217
3609,10369,401
3610,4717,9315
3611,4717,9313
3612,3014,3592
3613,3014,3014
3614,8349,401
3615,970,158
3616,8608,11381
3617,8608,29794
3618,8608,28883
3619,401,193
3620,10388,164
3621,10388,10354
3622,1323,1331
3623,1323,802
3624,1323,1538
3625,3233,3233
3626,10371,10391
3627,1331,20430
3628,181,4
3629,89,29649
3630,111,254
3631,4504,4333
3632,4333,4336
3633,2876,6039
3634,3351,3355
3635,616,847
3636,8634,8693
3637,2935,123
3638,3400,3431
3639,607,3863
3640,272,29414
3641,272,32890
3642,272,10381
3643,123,2482
3644,2962,3096
3645,10260,3704
3646,10260,7838
3647,3385,8598
3648,138,11667
3649,201,193
3650,307,10377
3651,8693,12356
3652,193,29702
3653,193,390
3654,2162,3854
3655,446,3850
