time,value
0,1.1133
1,0.90302
2,0.85339
3,0.66455
4,0.6744600000000001
5,0.87556
6,0.89231
7,0.68282
8,0.50212
9,0.29765
10,0.10067000000000001
11,-0.097022
12,-0.27463000000000004
13,-0.46942
14,-0.24554
15,0.0033089
16,0.27154
17,0.5572600000000001
18,0.64165
19,0.8528
20,1.0807
21,1.0442
22,0.9084
23,0.83214
24,0.6896
25,0.5713600000000001
26,0.5969899999999999
27,0.45388999999999996
28,0.18257
29,-0.10933
30,-0.33379000000000003
31,-0.39327
32,-0.21022
33,-0.07647899999999999
34,0.1135
35,0.17720999999999998
36,-0.04112
37,-0.23872
38,-0.40019
39,-0.4397
40,-0.62639
41,-0.84052
42,-1.0417
43,-1.0036
44,-1.1057
45,-1.3101
46,-1.5312
47,-1.7932
48,-1.9581
49,-1.8575
50,-1.7181
51,-1.5517
52,-1.358
53,-1.165
54,-0.9474799999999999
55,-0.7234
56,-0.51212
57,-0.28143
58,-0.048836000000000004
59,0.16527
60,0.39642
61,0.628
62,0.8396399999999999
63,1.0717
64,1.304
65,1.5365
66,1.7530000000000001
67,1.9858
68,2.2142
69,2.4175
70,2.5029
71,2.2842
72,2.0669
73,1.8289
74,1.5957
75,1.3834
76,1.146
77,0.9176
78,0.7054699999999999
79,0.47289
80,0.24056
81,0.024888999999999998
82,-0.21022
83,-0.44406999999999996
84,-0.6785899999999999
85,-0.89069
86,-1.1154
87,-1.3336
88,-1.5325
89,-1.3342
90,-1.4853
91,-1.5285
92,-1.3534
93,-1.1862
94,-1.0634
95,-1.1431
96,-1.0646
97,-0.8684299999999999
98,-0.8330299999999999
99,-1.053
100,-1.2342
101,-1.1667
102,-0.9424100000000001
103,-0.71185
104,-0.49041
105,-0.3828
106,-0.36723
107,-0.18287
108,-0.056985
109,-0.0029566999999999996
110,-0.094593
111,-0.20668000000000003
112,-0.34991
113,-0.48303
114,-0.65489
115,-0.53233
116,-0.33293
117,-0.093172
118,0.13076
119,0.34024
120,0.5434100000000001
121,0.66504
122,0.51775
123,0.45028
124,0.64508
125,0.80697
126,0.8902200000000001
127,1.0994
