time,value
0,-0.13627
1,-0.13627
2,-0.13627
3,-0.13627
4,-0.13627
5,-0.13627
6,-0.13627
7,-0.13627
8,-0.13627
9,-0.13627
10,-0.13627
11,-0.13627
12,-0.13627
13,-0.13627
14,-0.13627
15,-0.13627
16,-0.13627
17,-0.13627
18,-0.13627
19,-0.13627
20,-0.13627
21,-0.13627
22,-0.13627
23,-0.13627
24,-0.13627
25,-0.13627
26,-0.13627
27,-0.13627
28,-0.13627
29,-0.13627
30,-0.13627
31,-0.13627
32,-0.13627
33,-0.13627
34,-0.13627
35,-0.13627
36,-0.13627
37,-0.13627
38,-0.13627
39,-0.13627
40,-0.13627
41,-0.13627
42,-0.13627
43,-0.13627
44,-0.13627
45,-0.13627
46,-0.13627
47,-0.13627
48,-0.13627
49,-0.13627
50,-0.13627
51,-0.13627
52,-0.13627
53,-0.13627
54,-0.13627
55,-0.13627
56,-0.13627
57,-0.13627
58,-0.13627
59,-0.13627
60,-0.13627
61,-0.13627
62,-0.13627
63,-0.13627
64,-0.13627
65,-0.13627
66,-0.13627
67,-0.13627
68,-0.13627
69,-0.13627
70,-0.13627
71,-0.13627
72,-0.13627
73,-0.13627
74,-0.13627
75,-0.13627
76,-0.13627
77,-0.13627
78,-0.13627
79,-0.13627
80,-0.13627
81,-0.13627
82,-0.13627
83,-0.13627
84,-0.13627
85,-0.13627
86,-0.13627
87,-0.13627
88,-0.13627
89,-0.13627
90,-0.13627
91,-0.13627
92,-0.13627
93,-0.13627
94,-0.13627
95,-0.13627
96,-0.13627
97,-0.13627
98,-0.13627
99,-0.13627
100,-0.13627
101,-0.13627
102,-0.13627
103,-0.13627
104,-0.13627
105,-0.13627
106,-0.13627
107,-0.13627
108,-0.13627
109,-0.13627
110,-0.13627
111,-0.13627
112,-0.13627
113,-0.13627
114,-0.13627
115,-0.13627
116,-0.13627
117,-0.13627
118,-0.13627
119,-0.13627
120,-0.13627
121,-0.13627
122,-0.13627
123,-0.13627
124,-0.13627
125,-0.13627
126,-0.13627
127,-0.13627
128,-0.13627
129,-0.13627
130,-0.13627
131,-0.13627
132,-0.13627
133,-0.13627
134,-0.13627
135,-0.13627
136,-0.13627
137,-0.13627
138,-0.13627
139,-0.13627
140,-0.13627
141,-0.13627
142,-0.13627
143,-0.13627
144,-0.13627
145,-0.13627
146,-0.13627
147,-0.13627
148,-0.13627
149,-0.13627
150,-0.13627
151,-0.13627
152,-0.13627
153,-0.13627
154,-0.13627
155,-0.13627
156,-0.13627
157,-0.13627
158,-0.13627
159,-0.13627
160,-0.13627
161,-0.13627
162,-0.13627
163,-0.13627
164,-0.13627
165,-0.13627
166,-0.13627
167,-0.13627
168,-0.13627
169,-0.13627
170,-0.13627
171,-0.13627
172,-0.13627
173,-0.13627
174,-0.13627
175,-0.13627
176,-0.13627
177,-0.13627
178,-0.13627
179,-0.13627
180,-0.13627
181,-0.13627
182,-0.13627
183,-0.13627
184,-0.13627
185,-0.13627
186,-0.13627
187,-0.13627
188,-0.13627
189,-0.13627
190,-0.13627
191,-0.13627
192,-0.13627
193,-0.13627
194,-0.13627
195,-0.13627
196,-0.13627
197,-0.13627
198,-0.13627
199,-0.13627
200,-0.13627
201,-0.13627
202,-0.13627
203,-0.13627
204,-0.13627
205,-0.13627
206,-0.13627
207,-0.13627
208,-0.13627
209,-0.13627
210,-0.13627
211,-0.13627
212,-0.13627
213,-0.13627
214,-0.13627
215,-0.13627
216,-0.13627
217,-0.13627
218,-0.13627
219,-0.13627
220,-0.13627
221,-0.13627
222,-0.13627
223,-0.13627
224,-0.13627
225,-0.13627
226,-0.13627
227,-0.13627
228,-0.13627
229,-0.13627
230,-0.13627
231,-0.13627
232,-0.13627
233,-0.13627
234,4.4158
235,8.0787
236,0.21935
237,-0.13627
238,-0.13627
239,-0.13627
240,-0.13627
241,-0.13627
242,-0.13627
243,-0.13627
244,-0.13627
245,-0.13627
246,-0.13627
247,-0.13627
248,-0.13627
249,-0.13627
250,-0.13627
251,-0.13627
252,-0.13627
253,-0.13627
254,-0.13627
255,-0.13627
256,-0.13627
257,-0.13627
258,-0.13627
259,-0.13627
260,-0.13627
261,-0.13627
262,-0.13627
263,-0.13627
264,-0.13627
265,-0.13627
266,-0.13627
267,-0.13627
268,-0.13627
269,-0.13627
270,-0.13627
271,-0.13627
272,-0.13627
273,-0.13627
274,-0.13627
275,-0.13627
276,-0.13627
277,-0.13627
278,-0.13627
279,-0.13627
280,-0.13627
281,-0.13627
282,-0.13627
283,-0.13627
284,-0.13627
285,-0.13627
286,-0.13627
287,-0.13627
288,-0.13627
289,-0.13627
290,-0.13627
291,-0.13627
292,-0.13627
293,-0.13627
294,-0.13627
295,-0.13627
296,-0.13627
297,-0.13627
298,-0.13627
299,-0.13627
300,-0.13627
301,-0.13627
302,-0.13627
303,-0.13627
304,-0.13627
305,-0.13627
306,-0.13627
307,-0.13627
308,-0.13627
309,-0.13627
310,-0.13627
311,-0.13627
312,-0.13627
313,-0.13627
314,-0.13627
315,-0.13627
316,-0.13627
317,-0.13627
318,-0.13627
319,-0.13627
320,-0.13627
321,-0.13627
322,-0.13627
323,-0.13627
324,-0.13627
325,-0.13627
326,-0.13627
327,-0.13627
328,-0.13627
329,-0.13627
330,-0.13627
331,-0.13627
332,-0.13627
333,-0.13627
334,-0.13627
335,-0.13627
336,-0.13627
337,-0.13627
338,-0.13627
339,-0.13627
340,-0.13627
341,-0.13627
342,-0.13627
343,-0.13627
344,-0.13627
345,-0.13627
346,-0.13627
347,-0.13627
348,-0.13627
349,-0.13627
350,-0.13627
351,-0.13627
352,-0.13627
353,-0.13627
354,-0.13627
355,-0.13627
356,-0.13627
357,-0.13627
358,-0.13627
359,-0.13627
360,-0.13627
361,-0.13627
362,-0.13627
363,-0.13627
364,-0.13627
365,-0.13627
366,-0.13627
367,-0.13627
368,-0.13627
369,-0.13627
370,-0.13627
371,-0.13627
372,-0.13627
373,-0.13627
374,-0.13627
375,-0.13627
376,-0.13627
377,-0.13627
378,-0.13627
379,-0.13627
380,-0.13627
381,-0.13627
382,-0.13627
383,-0.13627
384,-0.13627
385,-0.13627
386,-0.13627
387,-0.13627
388,-0.13627
389,-0.13627
390,-0.13627
391,-0.13627
392,-0.13627
393,-0.13627
394,-0.13627
395,-0.13627
396,-0.13627
397,-0.13627
398,-0.13627
399,-0.13627
400,-0.13627
401,-0.13627
402,-0.13627
403,-0.13627
404,-0.13627
405,-0.13627
406,-0.13627
407,-0.13627
408,-0.13627
409,-0.13627
410,-0.13627
411,-0.13627
412,-0.13627
413,-0.13627
414,-0.13627
415,-0.13627
416,-0.13627
417,-0.13627
418,-0.13627
419,-0.13627
420,-0.13627
421,-0.13627
422,-0.13627
423,-0.13627
424,-0.13627
425,-0.13627
426,-0.13627
427,-0.13627
428,-0.13627
429,-0.13627
430,-0.13627
431,-0.13627
432,-0.13627
433,-0.13627
434,-0.13627
435,-0.13627
436,-0.13627
437,-0.13627
438,-0.13627
439,-0.13627
440,-0.13627
441,-0.13627
442,-0.13627
443,-0.13627
444,-0.13627
445,-0.13627
446,-0.13627
447,-0.13627
448,-0.13627
449,-0.13627
450,-0.13627
451,-0.13627
452,-0.13627
453,-0.13627
454,-0.13627
455,-0.13627
456,-0.13627
457,-0.13627
458,-0.13627
459,-0.13627
460,-0.13627
461,-0.13627
462,-0.13627
463,-0.13627
464,-0.13627
465,-0.13627
466,-0.13627
467,-0.13627
468,-0.13627
469,-0.13627
470,-0.13627
471,-0.13627
472,-0.13627
473,-0.13627
474,-0.13627
475,-0.13627
476,-0.13627
477,-0.13627
478,-0.13627
479,-0.13627
480,-0.13627
481,-0.13627
482,-0.13627
483,-0.13627
484,-0.13627
485,-0.13627
486,-0.13627
487,-0.13627
488,-0.13627
489,-0.13627
490,-0.13627
491,-0.13627
492,-0.13627
493,-0.13627
494,-0.13627
495,-0.13627
496,-0.13627
497,-0.13627
498,-0.13627
499,-0.13627
500,-0.13627
501,-0.13627
502,-0.13627
503,-0.13627
504,-0.13627
505,-0.13627
506,-0.13627
507,-0.13627
508,-0.13627
509,3.8468
510,9.2523
511,0.21935
512,5.6249
513,7.6875
514,0.077102
515,3.8468
516,10.106
517,4.7003
518,4.4158
519,8.8611
520,0.50385
521,-0.13627
522,-0.13627
523,-0.13627
524,-0.13627
525,-0.13627
526,-0.13627
527,-0.13627
528,-0.13627
529,-0.13627
530,-0.13627
531,-0.13627
532,-0.13627
533,-0.13627
534,-0.13627
535,-0.13627
536,-0.13627
537,-0.13627
538,-0.13627
539,-0.13627
540,-0.13627
541,-0.13627
542,-0.13627
543,-0.13627
544,-0.13627
545,-0.13627
546,-0.13627
547,-0.13627
548,-0.13627
549,-0.13627
550,-0.13627
551,-0.13627
552,-0.13627
553,-0.13627
554,-0.13627
555,-0.13627
556,-0.13627
557,-0.13627
558,-0.13627
559,-0.13627
560,-0.13627
561,-0.13627
562,-0.13627
563,-0.13627
564,-0.13627
565,-0.13627
566,-0.13627
567,-0.13627
568,-0.13627
569,-0.13627
570,-0.13627
571,-0.13627
572,-0.13627
573,-0.13627
574,-0.13627
575,-0.13627
576,-0.13627
577,-0.13627
578,-0.13627
579,-0.13627
580,-0.13627
581,-0.13627
582,-0.13627
583,-0.13627
584,-0.13627
585,-0.13627
586,-0.13627
587,-0.13627
588,-0.13627
589,-0.13627
590,-0.13627
591,-0.13627
592,-0.13627
593,-0.13627
594,-0.13627
595,-0.13627
596,-0.13627
597,-0.13627
598,-0.13627
599,-0.13627
600,-0.13627
601,-0.13627
602,-0.13627
603,-0.13627
604,-0.13627
605,-0.13627
606,-0.13627
607,-0.13627
608,-0.13627
609,-0.13627
610,-0.13627
611,-0.13627
612,-0.13627
613,-0.13627
614,-0.13627
615,-0.13627
616,-0.13627
617,-0.13627
618,-0.13627
619,-0.13627
620,-0.13627
621,-0.13627
622,-0.13627
623,-0.13627
624,-0.13627
625,-0.13627
626,-0.13627
627,-0.13627
628,-0.13627
629,-0.13627
630,-0.13627
631,-0.13627
632,-0.13627
633,-0.13627
634,-0.13627
635,-0.13627
636,-0.13627
637,-0.13627
638,-0.13627
639,-0.13627
640,-0.13627
641,-0.13627
642,-0.13627
643,-0.13627
644,-0.13627
645,-0.13627
646,-0.13627
647,5.945
648,8.4699
649,9.2523
650,0.0059765
651,-0.13627
652,-0.13627
653,-0.13627
654,-0.13627
655,-0.13627
656,-0.13627
657,-0.13627
658,-0.13627
659,-0.13627
660,-0.13627
661,-0.13627
662,-0.13627
663,-0.13627
664,-0.13627
665,-0.13627
666,-0.13627
667,-0.13627
668,-0.13627
669,-0.13627
670,-0.13627
671,-0.13627
672,-0.13627
673,-0.13627
674,-0.13627
675,-0.13627
676,-0.13627
677,-0.13627
678,-0.13627
679,-0.13627
680,-0.13627
681,-0.13627
682,-0.13627
683,-0.13627
684,-0.13627
685,-0.13627
686,-0.13627
687,-0.13627
688,-0.13627
689,-0.13627
690,-0.13627
691,-0.13627
692,-0.13627
693,-0.13627
694,-0.13627
695,-0.13627
696,-0.13627
697,-0.13627
698,-0.13627
699,-0.13627
700,-0.13627
701,-0.13627
702,-0.13627
703,-0.13627
704,-0.13627
705,-0.13627
706,-0.13627
707,-0.13627
708,-0.13627
709,-0.13627
710,-0.13627
711,-0.13627
712,-0.13627
713,-0.13627
714,-0.13627
715,-0.13627
716,-0.13627
717,-0.13627
718,-0.13627
719,-0.13627
