time,value
0,-0.40003
1,-0.38729
2,-0.27826
3,-0.095459
4,0.14943
5,0.38545
6,0.6474300000000001
7,0.9108200000000001
8,1.0988
9,1.2967
10,1.4824
11,1.4326
12,1.399
13,1.4457
14,1.506
15,1.3817
16,1.1566
17,0.8789899999999999
18,0.63648
19,0.38725
20,0.12954000000000002
21,-0.11594000000000002
22,-0.27486
23,-0.39139
24,-0.39418000000000003
25,-0.29606
26,-0.14300000000000002
27,0.068972
28,0.28152
29,0.50348
30,0.76267
31,1.0196
32,1.2790000000000001
33,1.3874
34,1.3399
35,1.3093
36,1.36
37,1.3311
38,1.2724
39,1.2813
40,1.3752
41,1.3778
42,1.2055
43,0.95647
44,0.72839
45,0.48531
46,0.25259000000000004
47,0.035477
48,-0.15969
49,-0.31931
50,-1.0894
51,-1.0894
52,-1.0894
53,-1.0894
54,-1.0894
55,-1.0894
56,-1.0894
57,-1.0894
58,-1.0894
59,-1.0894
60,-1.0894
61,-1.0894
62,-1.0894
63,-1.0894
64,-1.0894
65,-1.0894
66,-1.0894
67,-1.0894
68,-1.0894
69,-1.0894
70,-1.0894
71,-1.0894
72,-1.0894
73,-1.0894
74,-1.0894
75,-1.0894
76,-1.0894
77,-1.0894
78,-1.0894
79,-1.0894
