time,value
0,1.1297
1,1.1297
2,0.8585799999999999
3,1.1297
4,0.8585799999999999
5,1.1297
6,0.8585799999999999
7,1.1297
8,0.8585799999999999
9,1.1297
10,0.58749
11,-0.9487
12,-1.0391
13,-1.0391
14,-1.0391
15,-1.0391
16,-1.0391
17,-1.0391
18,-1.0391
19,-1.0391
20,-1.0391
21,-1.0391
22,-1.0391
23,-1.0391
24,-0.31615
25,1.1297
26,1.1297
27,1.1297
28,0.8585799999999999
29,1.1297
30,1.1297
31,0.8585799999999999
32,1.1297
33,0.8585799999999999
34,1.1297
35,0.8585799999999999
36,0.8585799999999999
37,1.1297
38,-0.8583299999999999
39,-1.0391
40,-1.0391
41,-1.0391
42,-1.0391
43,-1.0391
44,-1.0391
45,-1.0391
46,-1.0391
47,-1.0391
48,-1.0391
49,-1.0391
50,-1.0391
51,-1.0391
52,0.8585799999999999
53,1.1297
54,1.1297
55,0.8585799999999999
56,1.1297
57,1.1297
58,0.8585799999999999
59,1.1297
60,0.8585799999999999
61,1.1297
62,0.8585799999999999
63,1.1297
64,0.8585799999999999
65,-0.49688000000000004
66,-0.9487
67,-1.0391
68,-1.0391
69,-1.0391
70,-1.0391
71,-1.0391
72,-1.0391
73,-1.0391
74,-1.0391
75,-1.0391
76,-1.0391
77,-1.0391
78,-1.0391
79,0.3164
80,0.8585799999999999
81,1.1297
82,1.1297
83,1.1297
84,0.8585799999999999
85,1.1297
86,0.8585799999999999
87,1.1297
88,0.8585799999999999
89,1.1297
90,0.8585799999999999
91,1.1297
92,-0.13542
93,-1.0391
94,-1.0391
95,-1.0391
96,-1.0391
97,-1.0391
98,-1.0391
99,-1.0391
100,-1.0391
101,-1.0391
102,-1.0391
103,-1.0391
104,-1.0391
105,-1.0391
106,0.045307
107,1.1297
108,1.1297
109,1.1297
110,0.8585799999999999
111,1.1297
112,1.1297
113,0.8585799999999999
114,1.1297
115,0.8585799999999999
116,1.1297
117,0.8585799999999999
118,1.1297
119,0.3164
120,-1.0391
121,-1.0391
122,-1.0391
123,-1.0391
124,-1.0391
125,-1.0391
126,-1.0391
127,-1.0391
128,-1.0391
129,-1.0391
130,-1.0391
131,-1.0391
132,-1.0391
133,-0.7679699999999999
134,1.1297
135,1.1297
136,1.1297
137,0.8585799999999999
138,1.1297
139,1.1297
140,0.8585799999999999
141,1.1297
142,0.8585799999999999
143,1.1297
144,0.8585799999999999
145,1.1297
146,0.3164
147,-0.8583299999999999
148,-1.0391
149,-1.0391
150,-1.0391
151,-1.0391
152,-1.0391
153,-1.0391
154,-1.0391
155,-1.0391
156,-1.0391
157,-1.0391
158,-1.0391
159,-1.0391
160,-1.0391
161,0.8585799999999999
162,1.1297
163,0.8585799999999999
164,1.1297
165,0.8585799999999999
166,1.1297
167,1.1297
168,0.8585799999999999
169,1.1297
170,0.8585799999999999
171,0.8585799999999999
172,1.1297
173,0.8585799999999999
174,-0.6776
175,-0.9487
176,-1.0391
177,-1.0391
178,-1.0391
179,-1.0391
180,-1.0391
181,-1.0391
182,-1.0391
183,-1.0391
184,-1.0391
185,-1.0391
186,-1.0391
187,-1.0391
188,0.045307
189,1.1297
190,0.8585799999999999
191,1.1297
192,1.1297
193,0.8585799999999999
194,1.1297
195,0.8585799999999999
196,1.1297
197,0.8585799999999999
198,1.1297
199,0.8585799999999999
200,0.8585799999999999
201,0.3164
202,-0.8583299999999999
203,-1.0391
204,-1.0391
205,-1.0391
206,-1.0391
207,-1.0391
208,-1.0391
209,-1.0391
210,-1.0391
211,-1.0391
212,-1.0391
213,-1.0391
214,-1.0391
215,-0.49688000000000004
216,1.1297
217,0.8585799999999999
218,1.1297
219,1.1297
220,0.8585799999999999
221,1.1297
222,0.8585799999999999
223,1.1297
224,0.8585799999999999
225,1.1297
226,0.8585799999999999
227,0.8585799999999999
228,1.1297
229,-0.6776
230,-1.0391
231,-1.0391
232,-1.0391
233,-1.0391
234,-1.0391
235,-1.0391
236,-1.0391
237,-1.0391
238,-1.0391
239,-1.0391
240,-1.0391
241,-1.0391
242,-1.0391
243,0.8585799999999999
244,1.1297
245,1.1297
246,0.8585799999999999
247,1.1297
248,0.8585799999999999
249,1.1297
250,0.8585799999999999
251,1.1297
252,0.8585799999999999
253,0.8585799999999999
254,1.1297
255,0.8585799999999999
256,0.3164
257,-0.9487
258,-1.0391
259,-1.0391
260,-1.0391
261,-1.0391
262,-1.0391
263,-1.0391
264,-1.0391
265,-1.0391
266,-1.0391
267,-1.0391
268,-1.0391
269,-1.0391
270,-0.13542
271,1.1297
272,1.1297
273,0.8585799999999999
274,1.1297
275,0.8585799999999999
276,1.1297
277,1.1297
278,0.8585799999999999
279,1.1297
280,0.8585799999999999
281,1.1297
282,0.8585799999999999
283,0.8585799999999999
284,-0.6776
285,-0.9487
286,-1.0391
287,-1.0391
288,-1.0391
289,-1.0391
290,-1.0391
291,-1.0391
292,-1.0391
293,-1.0391
294,-1.0391
295,-1.0391
296,-1.0391
297,-0.13542
298,1.1297
299,0.8585799999999999
300,1.1297
301,1.1297
302,0.8585799999999999
303,1.1297
304,0.8585799999999999
305,1.1297
306,0.8585799999999999
307,1.1297
308,0.8585799999999999
309,1.1297
310,0.8585799999999999
311,0.58749
312,-0.8583299999999999
313,-1.0391
314,-1.0391
315,-1.0391
316,-1.0391
317,-1.0391
318,-1.0391
319,-1.0391
320,-1.0391
321,-1.0391
322,-1.0391
323,-1.0391
324,-1.0391
325,0.58749
326,1.1297
327,1.1297
328,1.1297
329,0.8585799999999999
330,1.1297
331,0.8585799999999999
332,1.1297
333,0.8585799999999999
334,1.1297
335,0.8585799999999999
336,1.1297
337,0.8585799999999999
338,0.8585799999999999
339,0.3164
340,-1.0391
341,-1.0391
342,-1.0391
343,-1.0391
344,-1.0391
345,-1.0391
346,-1.0391
347,-1.0391
348,-1.0391
349,-1.0391
350,-1.0391
351,-1.0391
352,-0.49688000000000004
353,1.1297
354,1.1297
355,0.8585799999999999
356,1.1297
357,1.1297
358,0.8585799999999999
359,1.1297
360,0.8585799999999999
361,1.1297
362,0.8585799999999999
363,1.1297
364,0.8585799999999999
365,0.8585799999999999
366,1.1297
367,-0.7679699999999999
368,-1.0391
369,-1.0391
370,-1.0391
371,-1.0391
372,-1.0391
373,-1.0391
374,-1.0391
375,-1.0391
376,-1.0391
377,-1.0391
378,-1.0391
379,-1.0391
380,0.045307
381,1.1297
382,1.1297
383,0.8585799999999999
384,1.1297
385,1.1297
386,0.8585799999999999
387,1.1297
388,0.8585799999999999
389,1.1297
390,0.8585799999999999
391,0.8585799999999999
392,1.1297
393,0.8585799999999999
394,0.58749
395,-0.9487
396,-1.0391
397,-1.0391
398,-1.0391
399,-1.0391
400,-1.0391
401,-1.0391
402,-1.0391
403,-1.0391
404,-1.0391
405,-1.0391
406,-1.0391
407,-1.0391
408,0.8585799999999999
409,1.1297
410,1.1297
411,0.8585799999999999
412,1.1297
413,1.1297
414,0.8585799999999999
415,1.1297
416,0.8585799999999999
417,1.1297
418,0.8585799999999999
419,0.8585799999999999
420,1.1297
421,0.8585799999999999
422,-0.31615
423,-1.0391
424,-1.0391
425,-1.0391
426,-1.0391
427,-1.0391
428,-1.0391
429,-1.0391
430,-1.0391
431,-1.0391
432,-1.0391
433,-1.0391
434,-1.0391
435,-0.13542
436,1.1297
437,1.1297
438,0.8585799999999999
439,1.1297
440,0.8585799999999999
441,1.1297
442,1.1297
443,0.8585799999999999
444,0.8585799999999999
445,1.1297
446,0.8585799999999999
447,1.1297
448,0.8585799999999999
449,0.8585799999999999
450,-0.7679699999999999
451,-1.0391
452,-1.0391
453,-1.0391
454,-1.0391
455,-1.0391
456,-1.0391
457,-1.0391
458,-1.0391
459,-1.0391
460,-1.0391
461,-1.0391
462,-1.0391
463,0.3164
464,1.1297
465,1.1297
466,0.8585799999999999
467,1.1297
468,0.8585799999999999
469,1.1297
470,1.1297
471,0.8585799999999999
472,1.1297
473,0.8585799999999999
474,0.8585799999999999
475,1.1297
476,0.8585799999999999
477,0.58749
478,-1.0391
479,-1.0391
480,-1.0391
481,-1.0391
482,-1.0391
483,-1.0391
484,-1.0391
485,-1.0391
486,-1.0391
487,-1.0391
488,-1.0391
489,-1.0391
490,-1.0391
491,1.1297
492,1.1297
493,1.1297
494,0.8585799999999999
495,1.1297
496,1.1297
497,0.8585799999999999
498,1.1297
499,0.8585799999999999
500,1.1297
501,0.8585799999999999
502,1.1297
503,0.8585799999999999
504,0.8585799999999999
505,-0.49688000000000004
506,-0.9487
507,-1.0391
508,-1.0391
509,-1.0391
510,-1.0391
511,-1.0391
512,-1.0391
513,-1.0391
514,-1.0391
515,-1.0391
516,-1.0391
517,-1.0391
518,0.3164
519,1.1297
520,0.8585799999999999
521,1.1297
522,1.1297
523,0.8585799999999999
524,1.1297
525,0.8585799999999999
526,1.1297
527,0.8585799999999999
528,0.8585799999999999
529,1.1297
530,0.8585799999999999
531,1.1297
532,0.8585799999999999
533,-0.49688000000000004
534,-1.0391
535,-1.0391
536,-1.0391
537,-1.0391
538,-1.0391
539,-1.0391
540,-1.0391
541,-1.0391
542,-1.0391
543,-1.0391
544,-1.0391
545,-1.0391
546,0.3164
547,0.8585799999999999
548,1.1297
549,1.1297
550,1.1297
551,0.8585799999999999
552,1.1297
553,0.8585799999999999
554,1.1297
555,0.8585799999999999
556,0.8585799999999999
557,1.1297
558,0.8585799999999999
559,0.8585799999999999
560,0.8585799999999999
561,-0.8583299999999999
562,-1.0391
563,-1.0391
564,-1.0391
565,-1.0391
566,-1.0391
567,-1.0391
568,-1.0391
569,-1.0391
570,-1.0391
571,-1.0391
572,-1.0391
573,-1.0391
574,0.3164
575,1.1297
576,1.1297
577,1.1297
578,0.8585799999999999
579,1.1297
580,0.8585799999999999
581,1.1297
582,0.8585799999999999
583,0.8585799999999999
584,1.1297
585,0.8585799999999999
586,0.8585799999999999
587,1.1297
588,0.045307
589,-1.0391
590,-1.0391
591,-1.0391
592,-1.0391
593,-1.0391
594,-1.0391
595,-1.0391
596,-1.0391
597,-1.0391
598,-1.0391
599,-1.0391
600,-1.0391
601,-1.0391
602,0.8585799999999999
603,1.1297
604,1.1297
605,0.8585799999999999
606,1.1297
607,0.8585799999999999
608,1.1297
609,0.8585799999999999
610,1.1297
611,0.8585799999999999
612,1.1297
613,0.8585799999999999
614,0.8585799999999999
615,0.8585799999999999
616,-0.9487
617,-1.0391
618,-1.0391
619,-1.0391
620,-1.0391
621,-1.0391
622,-1.0391
623,-1.0391
624,-1.0391
625,-1.0391
626,-1.0391
627,-1.0391
628,-1.0391
629,-0.13542
630,1.1297
631,1.1297
632,0.8585799999999999
633,1.1297
634,0.8585799999999999
635,1.1297
636,0.8585799999999999
637,1.1297
638,0.8585799999999999
639,1.1297
640,0.8585799999999999
641,1.1297
642,0.8585799999999999
643,-0.49688000000000004
644,-0.9487
645,-1.0391
646,-1.0391
647,-1.0391
648,-1.0391
649,-1.0391
650,-1.0391
651,-1.0391
652,-1.0391
653,-1.0391
654,-1.0391
655,-1.0391
656,-1.0391
657,0.8585799999999999
658,0.8585799999999999
659,1.1297
660,1.1297
661,0.8585799999999999
662,1.1297
663,1.1297
664,0.8585799999999999
665,1.1297
666,0.8585799999999999
667,0.8585799999999999
668,1.1297
669,0.8585799999999999
670,0.045307
671,-0.8583299999999999
672,-1.0391
673,-1.0391
674,-1.0391
675,-1.0391
676,-1.0391
677,-1.0391
678,-1.0391
679,-1.0391
680,-1.0391
681,-1.0391
682,-1.0391
683,-1.0391
684,0.045307
685,1.1297
686,1.1297
687,1.1297
688,0.8585799999999999
689,1.1297
690,0.8585799999999999
691,1.1297
692,0.8585799999999999
693,1.1297
694,0.8585799999999999
695,1.1297
696,0.8585799999999999
697,0.8585799999999999
698,-0.9487
699,-1.0391
700,-1.0391
701,-1.0391
702,-1.0391
703,-1.0391
704,-1.0391
705,-1.0391
706,-1.0391
707,-1.0391
708,-1.0391
709,-1.0391
710,-1.0391
711,-0.9487
712,1.1297
713,1.1297
714,0.8585799999999999
715,1.1297
716,1.1297
717,0.8585799999999999
718,1.1297
719,0.8585799999999999
