time,value
0,-1.4446
1,-1.4446
2,-1.4446
3,-1.4446
4,-1.4446
5,-1.4446
6,-1.4446
7,-1.4446
8,-1.4446
9,-1.4446
10,-1.4446
11,-1.4446
12,-1.4446
13,-1.4446
14,-1.4446
15,-1.4446
16,-1.4446
17,-1.4446
18,-1.4442
19,-1.4406
20,-1.4369999999999998
21,-1.4289
22,-1.4174
23,-1.4061
24,-1.3991
25,-1.3922
26,-1.3885
27,-1.3885
28,-1.3885
29,-1.3885
30,-1.3885
31,-1.3885
32,-1.3885
33,-1.3885
34,-1.3885
35,-1.3885
36,-1.3885
37,-1.3885
38,-1.3885
39,-1.3682
40,-1.3396
41,-1.3084
42,-1.2626
43,-1.2168
44,-1.1904
45,-1.1768
46,-1.1638
47,-1.1638
48,-1.1638
49,-1.1638
50,-1.1638
51,-1.1638
52,-1.1638
53,-1.1638
54,-1.1638
55,-1.1638
56,-1.1638
57,-1.1638
58,-1.1638
59,-1.1638
60,-1.1638
61,-1.1638
62,-1.1632
63,-1.1623
64,-1.1513
65,-1.0941
66,-1.0369
67,-0.9783
68,-0.9189299999999999
69,-0.85803
70,-0.77791
71,-0.6977899999999999
72,-0.6176699999999999
73,-0.53755
74,-0.45743
75,-0.37731
76,-0.29719
77,-0.22538000000000002
78,-0.16529000000000002
79,-0.1052
80,-0.09689500000000001
81,-0.09689500000000001
82,-0.09805499999999999
83,-0.10181
84,-0.10557000000000001
85,-0.11514
86,-0.12658
87,-0.13708
88,-0.14388
89,-0.15067
90,-0.15305
91,-0.15305
92,-0.15250999999999998
93,-0.14697000000000002
94,-0.14142000000000002
95,-0.13266
96,-0.12122000000000001
97,-0.10977
98,-0.07916799999999999
99,-0.048408
100,-0.011052
101,0.034730000000000004
102,0.080513
103,0.13929
104,0.19974
105,0.26293
106,0.3316
107,0.40028
108,0.48178999999999994
109,0.56692
110,0.65351
111,0.74508
112,0.8366399999999999
113,0.92206
114,1.0045
115,1.0867
116,1.1668
117,1.2469
118,1.3099
119,1.36
120,1.41
121,1.4558
122,1.5016
123,1.5322
124,1.5452
125,1.5583
126,1.5702
127,1.5819999999999999
128,1.5978
129,1.6207
130,1.6436
131,1.6665
132,1.6893
133,1.7122
134,1.7351
135,1.758
136,1.7794
137,1.8002
138,1.8195
139,1.831
140,1.8424
141,1.8503
142,1.8556
143,1.8603
144,1.8489
145,1.8374
146,1.8221
147,1.8028
148,1.7835
149,1.7502
150,1.7158
151,1.6778
152,1.6338
153,1.5898
154,1.5348
155,1.4776
156,1.422
157,1.3705
158,1.3189
159,1.2716
160,1.2258
161,1.1811
162,1.1420000000000001
163,1.1028
164,1.0666
165,1.0323
166,0.9989299999999999
167,0.97962
168,0.96031
169,0.9450200000000001
170,0.93358
171,0.9221299999999999
172,0.92681
173,0.9321799999999999
174,0.94001
175,0.9514600000000001
176,0.96291
177,0.97435
178,0.9858
179,0.99724
180,1.0087
181,1.0201
182,1.0087
183,0.9895700000000001
184,0.9697
185,0.94681
186,0.9239200000000001
187,0.9010299999999999
188,0.8781399999999999
189,0.8551
190,0.8306
191,0.8061
192,0.7640399999999999
193,0.70681
194,0.64958
195,0.5909399999999999
196,0.53228
197,0.46931000000000006
198,0.40064
199,0.33196
200,0.26329
201,0.19460999999999998
202,0.12594
203,0.057263999999999995
204,-0.01141
205,-0.077598
206,-0.14305
207,-0.2067
208,-0.26393
209,-0.32116
210,-0.3729
211,-0.42191000000000006
212,-0.46924
213,-0.50358
214,-0.53791
215,-0.57787
216,-0.62222
217,-0.66668
218,-0.7239
219,-0.78113
220,-0.83836
221,-0.89559
222,-0.9528200000000001
223,-1.01
224,-1.0673
225,-1.1126
226,-1.1359
227,-1.1591
228,-1.1638
229,-1.1638
230,-1.1545
231,-1.1159999999999999
232,-1.0776
233,-1.0261
234,-0.96891
235,-0.9105
236,-0.8446899999999999
237,-0.77887
238,-0.71139
239,-0.64271
240,-0.57435
241,-0.51515
242,-0.45595
243,-0.3977
244,-0.34047
245,-0.28325
246,-0.26447
247,-0.24873
248,-0.2346
249,-0.22316
250,-0.21170999999999998
251,-0.20951999999999998
252,-0.20934
253,-0.20959
254,-0.21101999999999999
255,-0.21245
256,-0.22924
257,-0.25213
258,-0.27423000000000003
259,-0.2923
260,-0.31035999999999997
261,-0.31043000000000004
262,-0.29898
263,-0.2874
264,-0.27345
265,-0.2595
266,-0.24104
267,-0.21815
268,-0.19526
269,-0.1659
270,-0.13621
271,-0.10011
272,-0.054331
273,-0.008548700000000001
274,0.033605
275,0.07509600000000001
276,0.11449000000000001
277,0.14883
278,0.18317
279,0.2175
280,0.25184
281,0.28618000000000005
282,0.32051999999999997
283,0.35485
284,0.38148000000000004
285,0.40365
286,0.42496000000000006
287,0.4364
288,0.44785
289,0.45929
290,0.47073999999999994
291,0.48218999999999995
292,0.49363
293,0.50508
294,0.51652
295,0.5279699999999999
296,0.5394100000000001
297,0.55086
298,0.5623100000000001
299,0.57097
300,0.5736600000000001
301,0.57634
302,0.57697
303,0.57697
304,0.57493
305,0.5652699999999999
306,0.55561
307,0.54478
308,0.53333
309,0.52189
310,0.51044
311,0.499
312,0.48755
313,0.47611000000000003
314,0.46466
