time,value
0,-0.23867
1,-0.40334000000000003
2,-0.64347
3,-0.91959
4,-1.1435
5,-1.25
6,-1.1843
7,-0.94358
8,-0.57117
9,-0.10894000000000001
10,0.34843
11,0.73664
12,1.0148
13,1.1423
14,1.1472
15,1.0473
16,0.8849299999999999
17,0.7198399999999999
18,0.58646
19,0.50198
20,0.48665
21,0.51999
22,0.55725
23,0.52993
24,0.41101000000000004
25,0.15054
26,-0.24103000000000002
27,-0.72326
28,-1.2095
29,-1.6136
30,-1.8494
31,-1.891
32,-1.7346
33,-1.4108
34,-0.9886
35,-0.52282
36,-0.046445
37,0.40941
38,0.8330700000000001
39,1.2032
40,1.5004
41,1.6972
42,1.755
43,1.6417
44,1.3995
45,1.0696
46,0.71495
47,0.40966
48,0.18118
49,0.037422000000000004
50,-0.065669
51,-0.20911999999999997
52,-0.43096999999999996
53,-0.75826
54,-1.1527
55,-1.5373
56,-1.817
57,-1.9128
58,-1.7836
59,-1.4645
60,-1.0203
61,-0.50593
62,-0.0040819
63,0.45398
64,0.86574
65,1.2258
66,1.5445
67,1.8007
68,1.9406
69,1.9362
70,1.7678
71,1.443
72,1.0073
73,0.53865
74,0.11373
75,-0.21281999999999998
76,-0.42499
77,-0.57367
78,-0.7058800000000001
79,-0.8971399999999999
80,-1.1717
81,-1.5072
82,-1.8348
83,-2.0744
84,-2.1404
85,-1.9661
86,-1.5658
87,-0.9718700000000001
88,-0.2875
89,0.38402
90,0.9544799999999999
91,1.3729
92,1.6089
93,1.6733
94,1.641
95,1.5767
96,1.5044
97,1.4349
98,1.3637
99,1.2434
100,1.0262
101,0.67861
102,0.20057
103,-0.36349000000000004
104,-0.95132
105,-1.4954
106,-1.906
107,-2.1206
108,-2.116
109,-1.8991
110,-1.5255
111,-1.0397
112,-0.51369
113,-0.02175
114,0.41413
115,0.76048
116,1.0199
117,1.2024
118,1.2859
119,1.2928
120,1.2185
121,1.0551
122,0.82668
123,0.5314800000000001
124,0.22041
125,-0.085274
126,-0.36127
127,-0.5585
128,-0.66328
129,-0.65832
130,-0.5722
131,-0.44425
132,-0.32268
133,-0.24579
134,-0.23205
135,-0.26164
136,-0.3087
137,-0.34218000000000004
138,-0.30057
139,-0.1419
140,0.12625
141,0.43923999999999996
142,0.7345
143,0.9444299999999999
144,1.0213
145,0.93271
146,0.71848
147,0.41018000000000004
148,0.066616
149,-0.25895
150,-0.54967
151,-0.78255
152,-0.96652
153,-1.1033
154,-1.1877
155,-1.2024
156,-1.1077
157,-0.8876799999999999
158,-0.55053
159,-0.11082
160,0.36956999999999995
161,0.82165
162,1.1623
163,1.3497
164,1.3633
165,1.2237
166,0.98966
167,0.72614
168,0.49583
169,0.33305
170,0.21859
171,0.12732000000000002
172,0.025581
173,-0.12134
174,-0.33246
175,-0.57496
176,-0.8444
177,-1.1169
178,-1.3209
179,-1.4425
180,-1.4593
181,-1.3709
182,-1.1646
183,-0.8422299999999999
184,-0.41795
185,0.08462599999999999
186,0.6267199999999999
187,1.1542
188,1.5959
189,1.8711
190,1.9089
191,1.6943
192,1.2515
193,0.65725
194,0.014263
195,-0.57965
196,-1.0248
197,-1.2704
198,-1.3131
199,-1.1891
200,-0.9406399999999999
201,-0.62789
202,-0.30691
203,-0.015587
204,0.21356999999999998
205,0.39304
206,0.5125
207,0.57216
208,0.57038
209,0.51863
210,0.46563999999999994
211,0.4347
212,0.43456999999999996
213,0.46426999999999996
214,0.50326
215,0.49686
216,0.41572
217,0.21094000000000002
218,-0.13249
219,-0.54378
220,-0.9568200000000001
221,-1.272
222,-1.4118
223,-1.3665
224,-1.1474
225,-0.81733
226,-0.45208999999999994
227,-0.10770999999999999
228,0.17958
229,0.42183999999999994
230,0.63851
231,0.85295
232,1.0489
233,1.1832
234,1.1962
235,1.0412
236,0.7109800000000001
237,0.27246
238,-0.1502
239,-0.46696000000000004
240,-0.60874
241,-0.5664600000000001
242,-0.39077
243,-0.1947
244,-0.093644
245,-0.1678
246,-0.40589000000000003
247,-0.71959
248,-0.99834
249,-1.1139
250,-0.98651
251,-0.61798
252,-0.11431
253,0.41163
254,0.82237
255,1.0484
256,1.0816
257,0.98569
258,0.8647600000000001
259,0.7998
260,0.8044899999999999
261,0.86618
262,0.8772200000000001
263,0.74257
264,0.42616000000000004
265,-0.072099
266,-0.67178
267,-1.2462
268,-1.6666
269,-1.8518
270,-1.7757
271,-1.4743
272,-1.0491
273,-0.61837
274,-0.25331
275,0.009009399999999999
276,0.15775999999999998
277,0.25153000000000003
278,0.34915
279,0.48493
280,0.66675
281,0.87528
282,1.0709
283,1.1983
284,1.2218
285,1.1223
286,0.9121600000000001
287,0.6060800000000001
288,0.24270999999999998
289,-0.15428
290,-0.5407
291,-0.8745700000000001
292,-1.129
293,-1.295
294,-1.3589
295,-1.2998
296,-1.1254
297,-0.86687
298,-0.54332
299,-0.17039
300,0.21463000000000002
301,0.58245
302,0.93927
303,1.2825
304,1.5844
305,1.8073
306,1.9026
307,1.8468
308,1.6199
309,1.2137
310,0.66823
311,0.018009999999999998
312,-0.65957
313,-1.2718
314,-1.7621
315,-2.0648
316,-2.1558
317,-2.0509
318,-1.7866
319,-1.4121
320,-0.986
321,-0.55955
322,-0.17218
323,0.14935
324,0.42083999999999994
325,0.65422
326,0.8710200000000001
327,1.0847
328,1.2832
329,1.449
330,1.5459
331,1.537
332,1.3818
333,1.0841
334,0.67902
335,0.21781999999999999
336,-0.22945
337,-0.60743
338,-0.86098
339,-0.9876299999999999
340,-1.0053
341,-0.9558700000000001
342,-0.8819899999999999
343,-0.81491
344,-0.77232
345,-0.73145
346,-0.65235
347,-0.51298
348,-0.29420999999999997
349,0.020322999999999997
350,0.4078
351,0.79042
352,1.0998
353,1.2957
354,1.3296
355,1.2158
356,0.99064
357,0.70102
358,0.38024
359,0.05744
360,-0.25856999999999997
361,-0.55829
362,-0.84751
363,-1.0917
364,-1.2825
365,-1.3997
366,-1.4099
367,-1.3009
368,-1.0804
369,-0.7752399999999999
370,-0.40700000000000003
371,-0.0022648000000000004
372,0.39276
373,0.75844
374,1.084
375,1.3345
376,1.4945
377,1.5681
378,1.5344
379,1.3969
380,1.1509
381,0.81453
382,0.4011
383,-0.06060499999999999
384,-0.52813
385,-0.9556600000000001
386,-1.3003
387,-1.5241
388,-1.5971
389,-1.5064
390,-1.266
391,-0.9257700000000001
392,-0.5291899999999999
393,-0.16080999999999998
394,0.1468
395,0.368
396,0.4913
397,0.53414
398,0.53087
399,0.52593
400,0.54965
401,0.62475
402,0.73868
403,0.84155
404,0.88405
405,0.84906
406,0.73864
407,0.5646899999999999
408,0.34836999999999996
409,0.11590999999999999
410,-0.12000999999999999
411,-0.35288
412,-0.56882
413,-0.7672899999999999
414,-0.93861
415,-1.0458
416,-1.0862
417,-1.0427
418,-0.91606
419,-0.70665
420,-0.41252
421,-0.07996
422,0.26277
423,0.58982
424,0.8802399999999999
425,1.1014
426,1.2307
427,1.2612
428,1.1817
429,0.9909100000000001
430,0.69952
431,0.33616999999999997
432,-0.069517
433,-0.46236000000000005
434,-0.7955300000000001
435,-1.0225
436,-1.1273
437,-1.1304
438,-1.0414
439,-0.8958
440,-0.72885
441,-0.53537
442,-0.31456999999999996
443,-0.050477
444,0.26532
445,0.61379
446,0.94726
447,1.2241
448,1.3916
449,1.4086
450,1.2709
451,0.98011
452,0.5928899999999999
453,0.18019000000000002
454,-0.22687
455,-0.58331
456,-0.87975
457,-1.1268
458,-1.3207
459,-1.4258
460,-1.4336
461,-1.3071
462,-1.0289
463,-0.6388699999999999
464,-0.19247999999999998
465,0.25425
466,0.62079
467,0.85444
468,0.94176
469,0.91795
470,0.86603
471,0.84221
472,0.88439
473,1.0006
474,1.1369
475,1.205
476,1.1327
477,0.8726299999999999
478,0.39854
479,-0.21438000000000001
480,-0.8828600000000001
481,-1.49
482,-1.9234
483,-2.1099
484,-2.0219
485,-1.6785
486,-1.1483
487,-0.52483
488,0.08706599999999999
489,0.60256
490,0.9526700000000001
491,1.1139
492,1.097
493,0.9449
494,0.7288100000000001
495,0.50907
496,0.33015
497,0.21971
498,0.17138
499,0.15641
