time,value
0,0.66943
1,0.59832
2,0.48956000000000005
3,0.40009
4,0.35115999999999997
5,0.35585
6,0.39328
7,0.41953999999999997
8,0.38834
9,0.27189
10,0.054866
11,-0.21636
12,-0.49435
13,-0.70562
14,-0.80273
15,-0.76435
16,-0.5949
17,-0.35402
18,-0.086873
19,0.13855
20,0.30036
21,0.36749
22,0.36013
23,0.28391
24,0.16465
25,-0.0011787
26,-0.21018
27,-0.4708
28,-0.7731
29,-1.0788
30,-1.3328
31,-1.4708
32,-1.4228
33,-1.1261
34,-0.59241
35,0.13758
36,0.9538200000000001
37,1.7325
38,2.3381
39,2.6742
40,2.6804
41,2.3736
42,1.8064
43,1.0763
44,0.29355
45,-0.43901
46,-1.0467
47,-1.4749
48,-1.6994
49,-1.7419
50,-1.6253
51,-1.3877
52,-1.0782
53,-0.75389
54,-0.46196000000000004
55,-0.23634000000000002
56,-0.09934
57,-0.042664999999999995
58,-0.047191000000000004
59,-0.065857
60,-0.055366
61,0.0093822
62,0.14302
63,0.33542
64,0.55998
65,0.76664
66,0.92966
67,1.0256
68,1.0557
69,1.0155
70,0.9321799999999999
71,0.82395
72,0.69911
73,0.55783
74,0.37351999999999996
75,0.13111
76,-0.17459000000000002
77,-0.55461
78,-0.9793200000000001
79,-1.4071
80,-1.7732
81,-2.0211
82,-2.1077
83,-2.0018
84,-1.7037
85,-1.2386
86,-0.64569
87,0.0073617000000000005
88,0.67913
89,1.3026
90,1.8363
91,2.2437
92,2.4933
93,2.5591
94,2.4228
95,2.0943
96,1.5892
97,0.9428
98,0.21319000000000002
99,-0.5273399999999999
100,-1.2044
101,-1.7594
102,-2.1297
103,-2.286
104,-2.2327
105,-1.9866
106,-1.5895
107,-1.1075
108,-0.6017399999999999
109,-0.12728
110,0.27368000000000003
111,0.57622
112,0.77841
113,0.88956
114,0.9366899999999999
115,0.9323
116,0.9088799999999999
117,0.8732700000000001
118,0.8333299999999999
119,0.7862100000000001
120,0.72716
121,0.64093
122,0.5191899999999999
123,0.34729
124,0.13397
125,-0.12502
126,-0.3973
127,-0.66343
128,-0.89123
129,-1.0553
130,-1.146
131,-1.1528
132,-1.0742
133,-0.9204700000000001
134,-0.7019
135,-0.42935
136,-0.11410999999999999
137,0.22910999999999998
138,0.5875
139,0.93368
140,1.2265
141,1.4106
142,1.4456
143,1.3101
144,1.0078
145,0.58057
146,0.1103
147,-0.31471
148,-0.61452
149,-0.73852
150,-0.67961
151,-0.48149
152,-0.22074000000000002
153,0.0078815
154,0.14342
155,0.15195999999999998
156,0.035013999999999997
157,-0.17835
158,-0.43806999999999996
159,-0.70325
160,-0.9407399999999999
161,-1.1331
162,-1.2519
163,-1.272
164,-1.1696
165,-0.90715
166,-0.46931000000000006
167,0.12598
168,0.82235
169,1.5318
170,2.1497
171,2.5580000000000003
172,2.6704
173,2.4647
174,1.9681
175,1.2571
176,0.44331000000000004
177,-0.35602
178,-1.0392
179,-1.5577
180,-1.8904
181,-2.0521
182,-2.0728
183,-1.9788
184,-1.797
185,-1.5252
186,-1.1755
187,-0.75165
188,-0.26968000000000003
189,0.22124000000000002
190,0.69024
191,1.0809
192,1.3553
193,1.4881
194,1.4988
195,1.4172
196,1.2728
197,1.1014
198,0.9275
199,0.75245
200,0.56238
201,0.34291
202,0.08867
203,-0.20315
204,-0.5161600000000001
205,-0.81605
206,-1.0746
207,-1.266
208,-1.3601
209,-1.3621
210,-1.2835
211,-1.1371
212,-0.92871
213,-0.6719
214,-0.35854
215,0.0038342
216,0.41515
217,0.83635
218,1.2159
219,1.4937
220,1.6056
221,1.5077
222,1.1906
223,0.69222
224,0.085963
225,-0.54924
226,-1.107
227,-1.5147
228,-1.7099
229,-1.6662
230,-1.3978
231,-0.94429
232,-0.35882
233,0.29459
234,0.93985
235,1.4967
236,1.8933
237,2.0876
238,2.0538
239,1.7824
240,1.3089
241,0.68737
242,-0.0055552
243,-0.67672
244,-1.2431
245,-1.6293
246,-1.7987
247,-1.7461
248,-1.4971
249,-1.1129
250,-0.66295
251,-0.231
252,0.11350999999999999
253,0.3151
254,0.37722
255,0.32818
256,0.21666999999999997
257,0.10454000000000001
258,0.04767
259,0.066861
260,0.16321
261,0.31189
262,0.46247
263,0.5716899999999999
264,0.61119
265,0.5726600000000001
266,0.46138999999999997
267,0.29279
268,0.088185
269,-0.13909000000000002
270,-0.38011999999999996
271,-0.6296
272,-0.87424
273,-1.0772
274,-1.1951
275,-1.1832
276,-1.0079
277,-0.6624800000000001
278,-0.18284
279,0.37554
280,0.95729
281,1.4955
282,1.9236
283,2.2011
284,2.2947
285,2.1799
286,1.8389
287,1.2802
288,0.52817
289,-0.35663
290,-1.2722
291,-2.114
292,-2.7597
293,-3.1197
294,-3.1394
295,-2.8357
296,-2.2686
297,-1.515
298,-0.68261
299,0.13151
300,0.86277
301,1.4637
302,1.8881
303,2.1237
304,2.1641
305,2.0042
306,1.6636
307,1.195
308,0.66922
309,0.15386
310,-0.27952
311,-0.57411
312,-0.70936
313,-0.70815
314,-0.60812
315,-0.45858000000000004
316,-0.33018000000000003
317,-0.26114
318,-0.25555
319,-0.30124
320,-0.38109
321,-0.45913000000000004
322,-0.50247
323,-0.5052300000000001
324,-0.45961
325,-0.3672
326,-0.23901
327,-0.081039
328,0.088989
329,0.25724
330,0.39905999999999997
331,0.50454
332,0.56904
333,0.5920000000000001
334,0.57313
335,0.52796
336,0.47298
337,0.42731
338,0.38706999999999997
339,0.35036
340,0.30693000000000004
341,0.22415
342,0.093277
343,-0.088517
344,-0.31624
345,-0.56788
346,-0.80415
347,-0.9775299999999999
348,-1.0507
349,-1.0021
350,-0.81791
351,-0.53617
352,-0.20795
353,0.11777
354,0.38915
355,0.5633
356,0.6207600000000001
357,0.57806
358,0.46473000000000003
359,0.32203000000000004
360,0.1976
361,0.11944
362,0.08392000000000001
363,0.086105
364,0.10745
365,0.12372000000000001
366,0.13312000000000002
367,0.1241
368,0.12147000000000001
369,0.12867
370,0.14174
371,0.13552
372,0.092699
373,-0.004889899999999999
374,-0.17895
375,-0.42166000000000003
376,-0.6935600000000001
377,-0.9343299999999999
378,-1.0796
379,-1.0638
380,-0.86149
381,-0.50052
382,-0.034904000000000004
383,0.45911
384,0.8874200000000001
385,1.171
386,1.2776
387,1.198
388,0.97782
389,0.67889
390,0.37049
391,0.11223
392,-0.061995
393,-0.15964
394,-0.213
395,-0.25797
396,-0.33026
397,-0.4483
398,-0.60815
399,-0.7699199999999999
400,-0.8858
401,-0.9133100000000001
402,-0.83693
403,-0.6528
404,-0.39719
405,-0.12506
406,0.13055
407,0.33233
408,0.47125
409,0.5536399999999999
410,0.5940300000000001
411,0.6100800000000001
412,0.59873
413,0.5593199999999999
414,0.48225
415,0.36277
416,0.20765
417,0.046591
418,-0.08682999999999999
419,-0.16709000000000002
420,-0.18991
421,-0.15481
422,-0.08734199999999999
423,-0.022973
424,0.009706999999999999
425,-0.018535
426,-0.10227
427,-0.20697
428,-0.31278
429,-0.38509
430,-0.4073
431,-0.37867
432,-0.31096
433,-0.20795
434,-0.093183
435,0.020075
436,0.12654
437,0.22401
438,0.30539
439,0.36249000000000003
440,0.3857
441,0.36044
442,0.29679
443,0.19560999999999998
444,0.07624
445,-0.046672000000000005
446,-0.14957
447,-0.21895
448,-0.25179
449,-0.25398000000000004
450,-0.23708
451,-0.21026999999999998
452,-0.17823
453,-0.14125
454,-0.10649000000000002
455,-0.06375700000000001
456,-0.011353
457,0.049987000000000004
458,0.11359000000000001
459,0.1884
460,0.26482
461,0.33138
462,0.37063
463,0.37819
464,0.34865999999999997
465,0.26466999999999996
466,0.13194
467,-0.050994
468,-0.25595999999999997
469,-0.45997
470,-0.6323300000000001
471,-0.72692
472,-0.7190300000000001
473,-0.60493
474,-0.40271999999999997
475,-0.1359
476,0.1548
477,0.41752
478,0.6056
479,0.6774399999999999
480,0.61469
481,0.42177
482,0.14149
483,-0.17048
484,-0.45788
485,-0.65873
486,-0.71807
487,-0.6161399999999999
488,-0.36461
489,-0.0051372
490,0.39978
491,0.77436
492,1.0379
493,1.1386
494,1.0484
495,0.77933
496,0.35931
497,-0.13990999999999998
498,-0.64522
499,-1.0803
