time,value
0,-0.17802
1,-0.76132
2,-1.3219999999999998
3,-1.8183
4,-2.2087
5,-2.4503
6,-2.5258
7,-2.4218
8,-2.1277
9,-1.6673
10,-1.0729
11,-0.36203
12,0.41781
13,1.1801
14,1.8575
15,2.3819
16,2.697
17,2.7828
18,2.6499
19,2.3065
20,1.8008
21,1.1948
22,0.5151899999999999
23,-0.19627999999999998
24,-0.90128
25,-1.5753
26,-2.1843
27,-2.655
28,-2.9245
29,-2.9589
30,-2.7124
31,-2.1976
32,-1.4712
33,-0.60224
34,0.30479
35,1.1482
36,1.8449
37,2.3385
38,2.6324
39,2.7363
40,2.6615
41,2.4371
42,2.0825
43,1.5946
44,0.9685299999999999
45,0.24603000000000003
46,-0.54294
47,-1.3327
48,-2.0428
49,-2.5782
50,-2.8851
51,-2.9165
52,-2.6794
53,-2.2165
54,-1.5788
55,-0.8602700000000001
56,-0.11844
57,0.59788
58,1.2256
59,1.7427
60,2.1064
61,2.3008
62,2.3004
63,2.1114
64,1.7413
65,1.2337
66,0.65378
67,0.06578200000000001
68,-0.45098999999999995
69,-0.8434
70,-1.0957
71,-1.1976
72,-1.1578
73,-1.0284
74,-0.85501
75,-0.6511
76,-0.45685
77,-0.28076
78,-0.12064000000000001
79,0.016250999999999998
80,0.13523
81,0.24628000000000003
82,0.34744
83,0.41907
84,0.46411
85,0.47076999999999997
86,0.42915
87,0.34612
88,0.21693
89,0.07103999999999999
90,-0.086617
91,-0.21743
92,-0.30058
93,-0.32295999999999997
94,-0.28941999999999996
95,-0.20462
96,-0.086521
97,0.028322000000000003
98,0.12928
99,0.20157
100,0.23384000000000002
101,0.23351
102,0.21909
103,0.19715
104,0.16221
105,0.12861
106,0.083138
107,0.028083999999999998
108,-0.073008
109,-0.19266
110,-0.30013
111,-0.37127
112,-0.37212
113,-0.29541999999999996
114,-0.13345
115,0.072689
116,0.27291
117,0.4303
118,0.4961
119,0.46043999999999996
120,0.35067
121,0.21585
122,0.099631
123,0.03349
124,0.029363999999999998
125,0.063014
126,0.079803
127,0.04584
128,-0.071743
129,-0.26485
130,-0.4832
131,-0.66584
132,-0.73736
133,-0.65205
134,-0.41991000000000006
135,-0.09732
136,0.24766999999999997
137,0.5293100000000001
138,0.68002
139,0.69222
140,0.57877
141,0.39634
142,0.19467
143,0.034461
144,-0.07164
145,-0.13287000000000002
146,-0.18219000000000002
147,-0.24695
148,-0.32319000000000003
149,-0.39545
150,-0.44213
151,-0.41285
152,-0.31377
153,-0.15187
154,0.040482
155,0.22405999999999998
156,0.37192
157,0.46496000000000004
158,0.51005
159,0.5302600000000001
160,0.53269
161,0.51613
162,0.47171
163,0.37739
164,0.2268
165,0.024672
166,-0.18622
167,-0.36893000000000004
168,-0.47196000000000005
169,-0.48291999999999996
170,-0.40715999999999997
171,-0.27063000000000004
172,-0.13424
173,-0.048119
174,-0.031148000000000002
175,-0.072186
176,-0.13560999999999998
177,-0.15283
178,-0.090666
179,0.061375
180,0.2821
181,0.50569
182,0.66687
183,0.70707
184,0.59783
185,0.36013
186,0.034293000000000004
187,-0.30557
188,-0.61441
189,-0.82462
190,-0.9176700000000001
191,-0.88976
192,-0.76331
193,-0.56091
194,-0.29911
195,-0.00053095
196,0.30611
197,0.60965
198,0.8819100000000001
199,1.0955
200,1.2269
201,1.2647
202,1.1958
203,1.0054
204,0.71833
205,0.33976999999999996
206,-0.09057799999999999
207,-0.53162
208,-0.93705
209,-1.2323
210,-1.3871
211,-1.3727
212,-1.1971
213,-0.92122
214,-0.58427
215,-0.23673000000000002
216,0.050238
217,0.25268
218,0.37283
219,0.44488999999999995
220,0.47928999999999994
221,0.5168699999999999
222,0.5858300000000001
223,0.66109
224,0.73802
225,0.78176
226,0.76565
227,0.6673899999999999
228,0.47623999999999994
229,0.22951999999999997
230,-0.033704000000000005
231,-0.28602
232,-0.49878999999999996
233,-0.62898
234,-0.67582
235,-0.67456
236,-0.6208199999999999
237,-0.5321899999999999
238,-0.43935
239,-0.35631999999999997
240,-0.28379
241,-0.20569
242,-0.11374000000000001
243,0.008587899999999999
244,0.14736
245,0.31185
246,0.46271999999999996
247,0.58228
248,0.6567
249,0.66732
250,0.59216
251,0.45698
252,0.29478000000000004
253,0.1581
254,0.076534
255,0.066979
256,0.11825
257,0.19342
258,0.23831999999999998
259,0.21305
260,0.10435
261,-0.094434
262,-0.35583000000000004
263,-0.64286
264,-0.88781
265,-1.0569
266,-1.1157
267,-1.056
268,-0.86693
269,-0.59048
270,-0.24433000000000002
271,0.13752999999999999
272,0.52347
273,0.87611
274,1.1647
275,1.3751
276,1.5001
277,1.5208
278,1.4161
279,1.2166
280,0.93179
281,0.55091
282,0.11373
283,-0.32964
284,-0.76317
285,-1.1533
286,-1.4607
287,-1.6579
288,-1.7579
289,-1.7413
290,-1.6127
291,-1.3721
292,-0.9969899999999999
293,-0.51603
294,0.068633
295,0.69993
296,1.2990000000000002
297,1.8096
298,2.16
299,2.2871
300,2.1755
301,1.8481
302,1.3552
303,0.78595
304,0.2139
305,-0.32343
306,-0.76675
307,-1.1383
308,-1.4416
309,-1.671
310,-1.8183
311,-1.8462
312,-1.7417
313,-1.4734
314,-1.0342
315,-0.48468
316,0.09819299999999999
317,0.65546
318,1.1244
319,1.4365
320,1.5784
321,1.614
322,1.5694
323,1.4511
324,1.2997
325,1.0962
326,0.82083
327,0.43918999999999997
328,-0.028983999999999996
329,-0.5260199999999999
330,-0.99982
331,-1.3989
332,-1.6339
333,-1.6584
334,-1.5118
335,-1.239
336,-0.87974
337,-0.50202
338,-0.17575
339,0.084967
340,0.32236
341,0.5361600000000001
342,0.72522
343,0.8928200000000001
344,1.0238
345,1.1076
346,1.0974
347,0.9953700000000001
348,0.8051
349,0.5593600000000001
350,0.27376999999999996
351,0.025881
352,-0.16345
353,-0.31064
354,-0.41453
355,-0.49132
356,-0.5694100000000001
357,-0.65118
358,-0.72533
359,-0.7700899999999999
360,-0.74587
361,-0.6699
362,-0.5221899999999999
363,-0.29944
364,-0.029807
365,0.25227
366,0.52952
367,0.77468
368,0.9678899999999999
369,1.0825
370,1.1004
371,1.0253
372,0.86679
373,0.62437
374,0.34453
375,0.052422
376,-0.22152
377,-0.45115
378,-0.60855
379,-0.69145
380,-0.72623
381,-0.7420100000000001
382,-0.74337
383,-0.7336
384,-0.73668
385,-0.74051
386,-0.6856399999999999
387,-0.5748300000000001
388,-0.38906999999999997
389,-0.11622
390,0.21069000000000002
391,0.55202
392,0.85346
393,1.0516
394,1.1422
395,1.1284
396,1.0302
397,0.8972600000000001
398,0.76334
399,0.6170399999999999
400,0.46112
401,0.2685
402,0.022486000000000003
403,-0.27486
404,-0.61038
405,-0.93129
406,-1.1761
407,-1.2928
408,-1.2627
409,-1.0909
410,-0.8195
411,-0.51488
412,-0.23156999999999997
413,-0.0055344999999999995
414,0.16247999999999999
415,0.29641
416,0.44148000000000004
417,0.60858
418,0.82468
419,1.0486
420,1.2483
421,1.3685
422,1.3356
423,1.1199
424,0.75344
425,0.27021
426,-0.25116
427,-0.73014
428,-1.0969
429,-1.3041
430,-1.3443
431,-1.2439
432,-1.0295
433,-0.74253
434,-0.44375
435,-0.1599
436,0.08893999999999999
437,0.29807
438,0.46321999999999997
439,0.60573
440,0.72049
441,0.79988
442,0.83993
443,0.81829
444,0.72505
445,0.5658
446,0.32592
447,0.029242
448,-0.27519
449,-0.54965
450,-0.76254
451,-0.86364
452,-0.84995
453,-0.73753
454,-0.54074
455,-0.29169
456,-0.033523000000000004
457,0.21570999999999999
458,0.41413
459,0.56811
460,0.68805
461,0.76885
462,0.8209799999999999
463,0.8312
464,0.7952600000000001
465,0.69594
466,0.54448
467,0.32763000000000003
468,0.070879
469,-0.20781999999999998
470,-0.5019
471,-0.7448100000000001
472,-0.92237
473,-1.0424
474,-1.0624
475,-1.0116
476,-0.90241
477,-0.74787
478,-0.5727899999999999
479,-0.36466
480,-0.11952
481,0.13892000000000002
482,0.41215
483,0.70215
484,0.94804
485,1.1179999999999999
486,1.2023
487,1.1619
488,1.0132
489,0.7612399999999999
490,0.45647
491,0.14736
492,-0.12907000000000002
493,-0.3491
494,-0.49023999999999995
495,-0.56494
496,-0.60383
497,-0.61046
498,-0.59954
499,-0.57194
