time,value
0,-1.2188
1,-1.2188
2,-1.2188
3,-1.2188
4,-1.2188
5,-1.2188
6,-1.2188
7,-1.2188
8,-1.2188
9,-1.2188
10,-1.2188
11,-1.2188
12,-1.2188
13,-1.2188
14,-1.2188
15,-1.2188
16,-1.2188
17,-1.2168
18,-1.1921
19,-1.1178
20,-1.0435
21,-0.98645
22,-0.9597399999999999
23,-0.95673
24,-0.95673
25,-0.95673
26,-0.95673
27,-0.95673
28,-0.95673
29,-0.8939
30,-0.82488
31,-0.75205
32,-0.71199
33,-0.6946899999999999
34,-0.6946899999999999
35,-0.6946899999999999
36,-0.6946899999999999
37,-0.6946899999999999
38,-0.6946899999999999
39,-0.6946899999999999
40,-0.6946899999999999
41,-0.6946899999999999
42,-0.6946899999999999
43,-0.6946899999999999
44,-0.6946899999999999
45,-0.6946899999999999
46,-0.6946899999999999
47,-0.6946899999999999
48,-0.6946899999999999
49,-0.68176
50,-0.64504
51,-0.57535
52,-0.5041100000000001
53,-0.43735
54,-0.43265
55,-0.43265
56,-0.43265
57,-0.43265
58,-0.43265
59,-0.43265
60,-0.43265
61,-0.43265
62,-0.43265
63,-0.43265
64,-0.43265
65,-0.43265
66,-0.43265
67,-0.43265
68,-0.43265
69,-0.43265
70,-0.4398
71,-0.4652
72,-0.53947
73,-0.61374
74,-0.67198
75,-0.69118
76,-0.6946899999999999
77,-0.68582
78,-0.65995
79,-0.59204
80,-0.51777
81,-0.4435
82,-0.49977
83,-0.57035
84,-0.64462
85,-0.6783399999999999
86,-0.6946899999999999
87,-0.6946899999999999
88,-0.6946899999999999
89,-0.6946899999999999
90,-0.6946899999999999
91,-0.6946899999999999
92,-0.6946899999999999
93,-0.6946899999999999
94,-0.6946899999999999
95,-0.6946899999999999
96,-0.6946899999999999
97,-0.6946899999999999
98,-0.6946899999999999
99,-0.6946899999999999
100,-0.6946899999999999
101,-0.6946899999999999
102,-0.68223
103,-0.638
104,-0.5695100000000001
105,-0.50025
106,-0.44098999999999994
107,-0.43265
108,-0.43265
109,-0.43265
110,-0.43265
111,-0.43265
112,-0.43265
113,-0.43265
114,-0.43265
115,-0.43267
116,-0.43433999999999995
117,-0.47521
118,-0.54948
119,-0.62376
120,-0.67038
121,-0.6946899999999999
122,-0.6946899999999999
123,-0.71723
124,-0.77147
125,-0.92001
126,-1.0686
127,-1.2033
128,-1.2892
129,-1.3665
130,-1.4408
131,-1.515
132,-1.5893
133,-1.6622
134,-1.7323
135,-1.7429
136,-1.7429
137,-1.7429
138,-1.6541
139,-1.5342
140,-1.3857
141,-1.2371
142,-1.0886
143,-0.94004
144,-0.7915
145,-0.67748
146,-0.59455
147,-0.52027
148,-0.42511000000000004
149,-0.31081
150,-0.16226
151,-0.017948
152,0.11313
153,0.1874
154,0.26168
155,0.33595
156,0.41022
157,0.4845
158,0.54692
159,0.57613
160,0.52372
161,0.44945
162,0.37517
163,0.35771
164,0.35348
165,0.35348
166,0.35348
167,0.35348
168,0.35348
169,0.35348
170,0.35348
171,0.35348
172,0.35348
173,0.38174
174,0.43693000000000004
175,0.5112
176,0.5854699999999999
177,0.65975
178,0.73402
179,0.80829
180,0.8931
181,1.0375
182,1.1847
183,1.3415
184,1.5309
185,1.7446
186,1.9615
187,2.161
188,2.2629
189,2.3371
190,2.4114
191,2.4385
192,2.4498
193,2.4498
194,2.4255
195,2.3789
196,2.3046
197,2.2303
198,2.1561
199,2.0818
200,2.0075
201,1.9554
202,1.9257
203,1.9257
204,1.9257
205,1.9257
206,1.9257
207,1.9257
208,1.9257
209,1.9257
210,1.9257
211,1.9199
212,1.8899
213,1.8281
214,1.754
215,1.6806
216,1.6637
217,1.6637
218,1.6637
219,1.626
220,1.5702
221,1.4959
222,1.4362
223,1.4016
224,1.4016
225,1.4016
226,1.4016
227,1.4016
228,1.4016
229,1.3853
230,1.3516
231,1.2773
232,1.203
233,1.1288
234,1.0545
235,0.9802
236,0.8995700000000001
237,0.77689
238,0.63721
239,0.49218
240,0.36283000000000004
241,0.27253
242,0.19825
243,0.12397999999999999
244,0.09858
245,0.091434
246,0.091434
247,0.091434
248,0.091434
249,0.091434
250,0.091434
251,0.091434
252,0.091434
253,0.091434
254,0.1139
255,0.16480999999999998
256,0.23831
257,0.30189
258,0.35348
259,0.35348
260,0.35348
261,0.35818
262,0.42494
263,0.49618
264,0.56587
265,0.60259
266,0.61552
267,0.61552
268,0.61552
269,0.61552
270,0.61552
271,0.61552
272,0.61552
273,0.61552
274,0.61552
275,0.59609
276,0.55543
277,0.48116000000000003
278,0.40689000000000003
279,0.33261
280,0.25834
281,0.18407
282,0.1271
283,0.09287999999999999
284,0.091434
285,0.091434
286,0.091434
287,0.091434
288,0.091434
289,0.088021
290,0.032108
291,-0.034579
292,-0.10584
293,-0.15341
294,-0.17060999999999998
295,-0.17060999999999998
296,-0.17060999999999998
297,-0.17060999999999998
298,-0.17060999999999998
299,-0.17060999999999998
300,-0.20218
301,-0.25323
302,-0.3275
303,-0.39118
304,-0.43265
305,-0.43265
306,-0.43265
307,-0.43265
308,-0.43265
309,-0.43265
310,-0.44498999999999994
311,-0.4742
312,-0.54614
313,-0.62042
314,-0.6946899999999999
