time,value
0,-0.22680999999999998
1,-0.22680999999999998
2,-0.22680999999999998
3,-0.22680999999999998
4,-0.22680999999999998
5,-0.22680999999999998
6,-0.22680999999999998
7,-0.22680999999999998
8,0.13448
9,-0.22680999999999998
10,-0.22680999999999998
11,-0.22680999999999998
12,-0.22680999999999998
13,-0.22680999999999998
14,-0.22680999999999998
15,-0.22680999999999998
16,-0.22680999999999998
17,-0.22680999999999998
18,-0.22680999999999998
19,-0.22680999999999998
20,-0.22680999999999998
21,-0.22680999999999998
22,-0.22680999999999998
23,-0.22680999999999998
24,0.13448
25,-0.22680999999999998
26,-0.22680999999999998
27,-0.22680999999999998
28,-0.22680999999999998
29,-0.22680999999999998
30,-0.22680999999999998
31,-0.22680999999999998
32,-0.22680999999999998
33,-0.22680999999999998
34,-0.22680999999999998
35,-0.22680999999999998
36,-0.22680999999999998
37,-0.22680999999999998
38,-0.22680999999999998
39,0.13448
40,-0.22680999999999998
41,-0.22680999999999998
42,-0.22680999999999998
43,-0.22680999999999998
44,-0.22680999999999998
45,-0.22680999999999998
46,-0.22680999999999998
47,-0.22680999999999998
48,-0.22680999999999998
49,-0.22680999999999998
50,-0.22680999999999998
51,-0.22680999999999998
52,-0.22680999999999998
53,-0.22680999999999998
54,-0.22680999999999998
55,-0.22680999999999998
56,0.13448
57,-0.22680999999999998
58,-0.22680999999999998
59,-0.22680999999999998
60,-0.22680999999999998
61,-0.22680999999999998
62,-0.22680999999999998
63,-0.22680999999999998
64,-0.22680999999999998
65,-0.22680999999999998
66,-0.22680999999999998
67,-0.22680999999999998
68,-0.22680999999999998
69,-0.22680999999999998
70,-0.22680999999999998
71,0.13448
72,-0.22680999999999998
73,-0.22680999999999998
74,-0.22680999999999998
75,-0.22680999999999998
76,-0.22680999999999998
77,-0.22680999999999998
78,-0.22680999999999998
79,-0.22680999999999998
80,-0.22680999999999998
81,-0.22680999999999998
82,-0.22680999999999998
83,-0.22680999999999998
84,-0.22680999999999998
85,-0.22680999999999998
86,0.13448
87,-0.22680999999999998
88,-0.22680999999999998
89,-0.22680999999999998
90,-0.22680999999999998
91,-0.22680999999999998
92,-0.22680999999999998
93,-0.22680999999999998
94,-0.22680999999999998
95,-0.22680999999999998
96,-0.22680999999999998
97,-0.22680999999999998
98,-0.22680999999999998
99,-0.22680999999999998
100,-0.22680999999999998
101,-0.22680999999999998
102,0.13448
103,-0.22680999999999998
104,-0.22680999999999998
105,-0.22680999999999998
106,-0.22680999999999998
107,-0.22680999999999998
108,-0.22680999999999998
109,-0.22680999999999998
110,-0.22680999999999998
111,-0.22680999999999998
112,-0.22680999999999998
113,-0.22680999999999998
114,-0.22680999999999998
115,-0.22680999999999998
116,-0.22680999999999998
117,0.13448
118,-0.22680999999999998
119,-0.22680999999999998
120,-0.22680999999999998
121,-0.22680999999999998
122,-0.22680999999999998
123,-0.22680999999999998
124,-0.22680999999999998
125,-0.22680999999999998
126,-0.22680999999999998
127,-0.22680999999999998
128,-0.22680999999999998
129,-0.22680999999999998
130,-0.22680999999999998
131,0.13448
132,-0.22680999999999998
133,-0.22680999999999998
134,-0.22680999999999998
135,-0.22680999999999998
136,-0.22680999999999998
137,-0.22680999999999998
138,-0.22680999999999998
139,-0.22680999999999998
140,-0.22680999999999998
141,-0.22680999999999998
142,-0.22680999999999998
143,-0.22680999999999998
144,-0.22680999999999998
145,-0.22680999999999998
146,0.13448
147,-0.22680999999999998
148,-0.22680999999999998
149,-0.22680999999999998
150,-0.22680999999999998
151,-0.22680999999999998
152,-0.22680999999999998
153,-0.22680999999999998
154,-0.22680999999999998
155,-0.22680999999999998
156,-0.22680999999999998
157,-0.22680999999999998
158,-0.22680999999999998
159,-0.22680999999999998
160,-0.22680999999999998
161,-0.22680999999999998
162,0.13448
163,-0.22680999999999998
164,-0.22680999999999998
165,-0.22680999999999998
166,-0.22680999999999998
167,-0.22680999999999998
168,-0.22680999999999998
169,-0.22680999999999998
170,-0.22680999999999998
171,-0.22680999999999998
172,-0.22680999999999998
173,-0.22680999999999998
174,-0.22680999999999998
175,-0.22680999999999998
176,-0.22680999999999998
177,-0.22680999999999998
178,0.13448
179,-0.22680999999999998
180,-0.22680999999999998
181,-0.22680999999999998
182,-0.22680999999999998
183,-0.22680999999999998
184,-0.22680999999999998
185,-0.22680999999999998
186,-0.22680999999999998
187,-0.22680999999999998
188,-0.22680999999999998
189,-0.22680999999999998
190,-0.22680999999999998
191,-0.22680999999999998
192,-0.22680999999999998
193,-0.22680999999999998
194,0.13448
195,-0.22680999999999998
196,-0.22680999999999998
197,-0.22680999999999998
198,-0.22680999999999998
199,-0.22680999999999998
200,-0.22680999999999998
201,-0.22680999999999998
202,-0.22680999999999998
203,-0.22680999999999998
204,-0.22680999999999998
205,-0.22680999999999998
206,-0.22680999999999998
207,-0.22680999999999998
208,-0.22680999999999998
209,-0.22680999999999998
210,-0.22680999999999998
211,0.13448
212,-0.22680999999999998
213,-0.22680999999999998
214,-0.22680999999999998
215,-0.22680999999999998
216,-0.22680999999999998
217,-0.22680999999999998
218,-0.22680999999999998
219,-0.22680999999999998
220,-0.22680999999999998
221,-0.22680999999999998
222,-0.22680999999999998
223,-0.22680999999999998
224,-0.22680999999999998
225,-0.22680999999999998
226,-0.22680999999999998
227,-0.22680999999999998
228,0.13448
229,-0.22680999999999998
230,-0.22680999999999998
231,-0.22680999999999998
232,-0.22680999999999998
233,-0.22680999999999998
234,-0.22680999999999998
235,-0.22680999999999998
236,-0.22680999999999998
237,-0.22680999999999998
238,-0.22680999999999998
239,-0.22680999999999998
240,-0.22680999999999998
241,-0.22680999999999998
242,-0.22680999999999998
243,-0.22680999999999998
244,0.13448
245,-0.22680999999999998
246,-0.22680999999999998
247,-0.22680999999999998
248,-0.22680999999999998
249,-0.22680999999999998
250,-0.22680999999999998
251,-0.22680999999999998
252,-0.22680999999999998
253,-0.22680999999999998
254,-0.22680999999999998
255,-0.22680999999999998
256,-0.22680999999999998
257,-0.22680999999999998
258,-0.22680999999999998
259,-0.22680999999999998
260,0.13448
261,-0.22680999999999998
262,-0.22680999999999998
263,-0.22680999999999998
264,-0.22680999999999998
265,-0.22680999999999998
266,-0.22680999999999998
267,-0.22680999999999998
268,-0.22680999999999998
269,-0.22680999999999998
270,-0.22680999999999998
271,-0.22680999999999998
272,-0.22680999999999998
273,-0.22680999999999998
274,-0.22680999999999998
275,-0.22680999999999998
276,-0.22680999999999998
277,-0.22680999999999998
278,-0.22680999999999998
279,0.13448
280,-0.22680999999999998
281,-0.22680999999999998
282,-0.22680999999999998
283,-0.22680999999999998
284,-0.22680999999999998
285,-0.22680999999999998
286,-0.22680999999999998
287,-0.22680999999999998
288,-0.22680999999999998
289,-0.22680999999999998
290,-0.22680999999999998
291,-0.22680999999999998
292,-0.22680999999999998
293,-0.22680999999999998
294,-0.22680999999999998
295,-0.22680999999999998
296,0.13448
297,-0.22680999999999998
298,-0.22680999999999998
299,-0.22680999999999998
300,-0.22680999999999998
301,-0.22680999999999998
302,-0.22680999999999998
303,-0.22680999999999998
304,-0.22680999999999998
305,-0.22680999999999998
306,-0.22680999999999998
307,-0.22680999999999998
308,-0.22680999999999998
309,-0.22680999999999998
310,-0.22680999999999998
311,-0.22680999999999998
312,-0.22680999999999998
313,-0.22680999999999998
314,0.13448
315,-0.22680999999999998
316,-0.22680999999999998
317,-0.22680999999999998
318,-0.22680999999999998
319,-0.22680999999999998
320,-0.22680999999999998
321,-0.22680999999999998
322,-0.22680999999999998
323,-0.22680999999999998
324,-0.22680999999999998
325,-0.22680999999999998
326,-0.22680999999999998
327,-0.22680999999999998
328,-0.22680999999999998
329,-0.22680999999999998
330,-0.22680999999999998
331,-0.22680999999999998
332,-0.22680999999999998
333,0.13448
334,-0.22680999999999998
335,-0.22680999999999998
336,-0.22680999999999998
337,-0.22680999999999998
338,-0.22680999999999998
339,-0.22680999999999998
340,-0.22680999999999998
341,-0.22680999999999998
342,-0.22680999999999998
343,-0.22680999999999998
344,-0.22680999999999998
345,-0.22680999999999998
346,-0.22680999999999998
347,-0.22680999999999998
348,-0.22680999999999998
349,-0.22680999999999998
350,-0.22680999999999998
351,0.13448
352,-0.22680999999999998
353,-0.22680999999999998
354,-0.22680999999999998
355,-0.22680999999999998
356,-0.22680999999999998
357,-0.22680999999999998
358,-0.22680999999999998
359,-0.22680999999999998
360,-0.22680999999999998
361,-0.22680999999999998
362,-0.22680999999999998
363,-0.22680999999999998
364,-0.22680999999999998
365,-0.22680999999999998
366,-0.22680999999999998
367,-0.22680999999999998
368,-0.22680999999999998
369,0.13448
370,-0.22680999999999998
371,-0.22680999999999998
372,-0.22680999999999998
373,-0.22680999999999998
374,-0.22680999999999998
375,-0.22680999999999998
376,-0.22680999999999998
377,-0.22680999999999998
378,-0.22680999999999998
379,-0.22680999999999998
380,-0.22680999999999998
381,-0.22680999999999998
382,-0.22680999999999998
383,-0.22680999999999998
384,-0.22680999999999998
385,-0.22680999999999998
386,-0.22680999999999998
387,0.13448
388,-0.22680999999999998
389,-0.22680999999999998
390,-0.22680999999999998
391,-0.22680999999999998
392,-0.22680999999999998
393,-0.22680999999999998
394,-0.22680999999999998
395,-0.22680999999999998
396,-0.22680999999999998
397,-0.22680999999999998
398,-0.22680999999999998
399,-0.22680999999999998
400,-0.22680999999999998
401,-0.22680999999999998
402,-0.22680999999999998
403,-0.22680999999999998
404,-0.22680999999999998
405,0.13448
406,-0.22680999999999998
407,-0.22680999999999998
408,-0.22680999999999998
409,-0.22680999999999998
410,-0.22680999999999998
411,-0.22680999999999998
412,-0.22680999999999998
413,-0.22680999999999998
414,-0.22680999999999998
415,-0.22680999999999998
416,-0.22680999999999998
417,-0.22680999999999998
418,-0.22680999999999998
419,-0.22680999999999998
420,-0.22680999999999998
421,-0.22680999999999998
422,-0.22680999999999998
423,-0.22680999999999998
424,0.13448
425,-0.22680999999999998
426,-0.22680999999999998
427,-0.22680999999999998
428,-0.22680999999999998
429,-0.22680999999999998
430,-0.22680999999999998
431,-0.22680999999999998
432,-0.22680999999999998
433,-0.22680999999999998
434,-0.22680999999999998
435,-0.22680999999999998
436,-0.22680999999999998
437,-0.22680999999999998
438,-0.22680999999999998
439,-0.22680999999999998
440,-0.22680999999999998
441,-0.22680999999999998
442,0.13448
443,-0.22680999999999998
444,-0.22680999999999998
445,1.9409
446,5.1926
447,5.1926
448,4.1087
449,5.1926
450,5.1926
451,4.1087
452,5.1926
453,5.1926
454,4.1087
455,5.1926
456,5.1926
457,4.1087
458,5.1926
459,5.1926
460,4.1087
461,5.1926
462,5.1926
463,4.1087
464,5.1926
465,5.1926
466,4.1087
467,5.1926
468,5.1926
469,4.1087
470,5.1926
471,5.1926
472,4.1087
473,5.1926
474,4.1087
475,-0.22680999999999998
476,-0.22680999999999998
477,-0.22680999999999998
478,-0.22680999999999998
479,-0.22680999999999998
480,-0.22680999999999998
481,-0.22680999999999998
482,-0.22680999999999998
483,0.13448
484,-0.22680999999999998
485,-0.22680999999999998
486,-0.22680999999999998
487,-0.22680999999999998
488,-0.22680999999999998
489,-0.22680999999999998
490,-0.22680999999999998
491,-0.22680999999999998
492,-0.22680999999999998
493,-0.22680999999999998
494,-0.22680999999999998
495,-0.22680999999999998
496,-0.22680999999999998
497,-0.22680999999999998
498,-0.22680999999999998
499,-0.22680999999999998
500,-0.22680999999999998
501,-0.22680999999999998
502,-0.22680999999999998
503,-0.22680999999999998
504,0.13448
505,-0.22680999999999998
506,-0.22680999999999998
507,-0.22680999999999998
508,-0.22680999999999998
509,-0.22680999999999998
510,-0.22680999999999998
511,-0.22680999999999998
512,-0.22680999999999998
513,-0.22680999999999998
514,-0.22680999999999998
515,-0.22680999999999998
516,-0.22680999999999998
517,-0.22680999999999998
518,0.13448
519,-0.22680999999999998
520,-0.22680999999999998
521,-0.22680999999999998
522,-0.22680999999999998
523,-0.22680999999999998
524,-0.22680999999999998
525,-0.22680999999999998
526,-0.22680999999999998
527,-0.22680999999999998
528,-0.22680999999999998
529,-0.22680999999999998
530,-0.22680999999999998
531,-0.22680999999999998
532,-0.22680999999999998
533,-0.22680999999999998
534,0.13448
535,-0.22680999999999998
536,-0.22680999999999998
537,-0.22680999999999998
538,-0.22680999999999998
539,-0.22680999999999998
540,-0.22680999999999998
541,-0.22680999999999998
542,-0.22680999999999998
543,-0.22680999999999998
544,-0.22680999999999998
545,-0.22680999999999998
546,-0.22680999999999998
547,-0.22680999999999998
548,-0.22680999999999998
549,-0.22680999999999998
550,-0.22680999999999998
551,-0.22680999999999998
552,-0.22680999999999998
553,-0.22680999999999998
554,-0.22680999999999998
555,-0.22680999999999998
556,0.13448
557,-0.22680999999999998
558,-0.22680999999999998
559,-0.22680999999999998
560,-0.22680999999999998
561,-0.22680999999999998
562,-0.22680999999999998
563,-0.22680999999999998
564,-0.22680999999999998
565,-0.22680999999999998
566,-0.22680999999999998
567,-0.22680999999999998
568,-0.22680999999999998
569,-0.22680999999999998
570,-0.22680999999999998
571,-0.22680999999999998
572,-0.22680999999999998
573,-0.22680999999999998
574,-0.22680999999999998
575,0.13448
576,-0.22680999999999998
577,-0.22680999999999998
578,-0.22680999999999998
579,-0.22680999999999998
580,-0.22680999999999998
581,-0.22680999999999998
582,-0.22680999999999998
583,-0.22680999999999998
584,-0.22680999999999998
585,-0.22680999999999998
586,-0.22680999999999998
587,-0.22680999999999998
588,-0.22680999999999998
589,-0.22680999999999998
590,-0.22680999999999998
591,-0.22680999999999998
592,-0.22680999999999998
593,-0.22680999999999998
594,0.13448
595,-0.22680999999999998
596,-0.22680999999999998
597,-0.22680999999999998
598,-0.22680999999999998
599,-0.22680999999999998
600,-0.22680999999999998
601,-0.22680999999999998
602,-0.22680999999999998
603,-0.22680999999999998
604,-0.22680999999999998
605,-0.22680999999999998
606,-0.22680999999999998
607,-0.22680999999999998
608,-0.22680999999999998
609,-0.22680999999999998
610,-0.22680999999999998
611,-0.22680999999999998
612,-0.22680999999999998
613,-0.22680999999999998
614,0.13448
615,-0.22680999999999998
616,-0.22680999999999998
617,-0.22680999999999998
618,-0.22680999999999998
619,-0.22680999999999998
620,-0.22680999999999998
621,-0.22680999999999998
622,-0.22680999999999998
623,-0.22680999999999998
624,-0.22680999999999998
625,-0.22680999999999998
626,-0.22680999999999998
627,-0.22680999999999998
628,-0.22680999999999998
629,-0.22680999999999998
630,-0.22680999999999998
631,-0.22680999999999998
632,-0.22680999999999998
633,0.13448
634,-0.22680999999999998
635,-0.22680999999999998
636,-0.22680999999999998
637,-0.22680999999999998
638,-0.22680999999999998
639,-0.22680999999999998
640,-0.22680999999999998
641,-0.22680999999999998
642,-0.22680999999999998
643,-0.22680999999999998
644,-0.22680999999999998
645,-0.22680999999999998
646,-0.22680999999999998
647,-0.22680999999999998
648,-0.22680999999999998
649,-0.22680999999999998
650,0.13448
651,-0.22680999999999998
652,-0.22680999999999998
653,-0.22680999999999998
654,-0.22680999999999998
655,-0.22680999999999998
656,-0.22680999999999998
657,-0.22680999999999998
658,-0.22680999999999998
659,-0.22680999999999998
660,-0.22680999999999998
661,-0.22680999999999998
662,-0.22680999999999998
663,-0.22680999999999998
664,-0.22680999999999998
665,-0.22680999999999998
666,-0.22680999999999998
667,0.13448
668,-0.22680999999999998
669,-0.22680999999999998
670,-0.22680999999999998
671,-0.22680999999999998
672,-0.22680999999999998
673,-0.22680999999999998
674,-0.22680999999999998
675,-0.22680999999999998
676,-0.22680999999999998
677,-0.22680999999999998
678,-0.22680999999999998
679,-0.22680999999999998
680,-0.22680999999999998
681,-0.22680999999999998
682,0.13448
683,-0.22680999999999998
684,-0.22680999999999998
685,-0.22680999999999998
686,-0.22680999999999998
687,-0.22680999999999998
688,-0.22680999999999998
689,-0.22680999999999998
690,-0.22680999999999998
691,-0.22680999999999998
692,-0.22680999999999998
693,-0.22680999999999998
694,-0.22680999999999998
695,-0.22680999999999998
696,-0.22680999999999998
697,-0.22680999999999998
698,0.13448
699,-0.22680999999999998
700,-0.22680999999999998
701,-0.22680999999999998
702,-0.22680999999999998
703,-0.22680999999999998
704,-0.22680999999999998
705,-0.22680999999999998
706,-0.22680999999999998
707,-0.22680999999999998
708,-0.22680999999999998
709,-0.22680999999999998
710,-0.22680999999999998
711,-0.22680999999999998
712,-0.22680999999999998
713,-0.22680999999999998
714,0.13448
715,-0.22680999999999998
716,-0.22680999999999998
717,-0.22680999999999998
718,-0.22680999999999998
719,-0.22680999999999998
