time,value
0,1.598
1,1.598
2,1.598
3,1.598
4,1.598
5,1.598
6,1.598
7,1.598
8,1.598
9,1.598
10,1.598
11,1.598
12,1.598
13,1.598
14,1.598
15,1.598
16,1.598
17,1.6136
18,1.6467
19,1.6662
20,1.6662
21,1.7001
22,1.7992
23,1.8801
24,1.9131
25,1.9392
26,1.9392
27,1.9296
28,1.8636
29,1.7897
30,1.6245
31,1.4593
32,1.2942
33,1.129
34,0.99511
35,0.8629700000000001
36,0.73083
37,0.5986899999999999
38,0.33181
39,0.034499
40,-0.31235999999999997
41,-0.67574
42,-1.0165
43,-1.3469
44,-1.6568
45,-1.9541
46,-2.1966
47,-2.3948
48,-2.5126
49,-2.5457
50,-2.4674
51,-2.2362
52,-2.0049
53,-1.7737
54,-1.5807
55,-1.4816
56,-1.3973
57,-1.3643
58,-1.3312
59,-1.2982
60,-1.2712
61,-1.3043
62,-1.3373
63,-1.3703
64,-1.4034
65,-1.4364
66,-1.4694
67,-1.5616
68,-1.6607
69,-1.705
70,-1.7381
71,-1.7207
72,-1.6876
73,-1.6085
74,-1.5094
75,-1.3686
76,-1.2034
77,-1.0756
78,-0.9765299999999999
79,-0.91046
80,-0.8774299999999999
81,-0.85874
82,-0.85874
83,-0.85874
84,-0.85874
85,-0.8787299999999999
86,-0.9448
87,-1.0109
88,-1.0769
89,-1.143
90,-1.2091
91,-1.2821
92,-1.4142
93,-1.5386
94,-1.4725
95,-1.4064
96,-1.2439
97,-1.0787
98,-0.8535200000000001
99,-0.62228
100,-0.47448999999999997
101,-0.34236
102,-0.3128
103,-0.3128
104,-0.21891
105,-0.086773
106,0.10926
107,0.3405
108,0.5717399999999999
109,0.80299
110,0.9664200000000001
111,1.0655
112,0.9725
113,0.6421600000000001
114,0.38745
115,0.25531
116,0.14403
117,0.07796499999999999
118,0.028413
119,0.028413
120,0.022328
121,-0.010707
122,-0.039829
123,-0.039829
124,-0.03809
125,-0.0050558999999999995
126,0.027979
127,-0.036786
128,-0.10286
129,-0.1385
130,-0.17153
131,-0.20457
132,-0.2376
133,-0.3228
134,-0.4219
135,-0.56882
136,-0.7339899999999999
137,-0.8774299999999999
138,-1.0096
139,-1.083
140,-1.1161
141,-1.1665
142,-1.2325
143,-1.2986
144,-1.3647
145,-1.4438
146,-1.5429
147,-1.6529
148,-1.785
149,-1.865
150,-1.7989
151,-1.7068
152,-1.5086
153,-1.3017
154,-1.0374
155,-0.76659
156,-0.40321
157,-0.039829
158,0.32355
159,0.68693
160,0.8651399999999999
161,1.0303
162,0.99467
163,0.9286
164,0.91556
165,0.91556
166,0.93991
167,0.9729399999999999
168,1.0281
169,1.0942
170,1.2403
171,1.4385
172,1.6189
173,1.784
174,1.7771
175,1.5789
176,1.3941
177,1.229
178,1.0751
179,0.94295
180,0.83819
181,0.80516
182,0.77212
183,0.7390899999999999
184,0.70127
185,0.63521
186,0.5717399999999999
187,0.53871
188,0.5052399999999999
189,0.43917
190,0.3731
191,0.36963
192,0.36963
193,0.36963
194,0.36963
195,0.34268000000000004
196,0.30964
197,0.25183
198,0.18575999999999998
199,0.11969
200,0.053624
201,0.007984
202,-0.02505
203,-0.021573
204,0.011461
205,0.060578
206,0.12665
207,0.17881
208,0.21184
209,0.23314000000000001
210,0.23314000000000001
211,0.2427
212,0.27574
213,0.30138000000000004
214,0.30138000000000004
215,0.3066
216,0.33963000000000004
217,0.37267
218,0.4057
219,0.43873999999999996
220,0.47176999999999997
221,0.50481
222,0.44265
223,0.37658
224,0.2514
225,0.11925999999999999
226,0.12404000000000001
227,0.15707000000000002
228,0.21531999999999998
229,0.28139000000000003
230,0.32442
231,0.35745
232,0.41135
233,0.47741999999999996
234,0.5248
235,0.55783
236,0.57435
237,0.57435
238,0.5887
239,0.62173
240,0.59391
241,0.46176999999999996
242,0.31964000000000004
243,0.15447
244,-0.0028826
245,-0.13502
246,-0.27846
247,-0.47667
248,-0.66096
249,-0.7270300000000001
250,-0.7865800000000001
251,-0.68748
252,-0.58838
253,-0.42494
254,-0.25977
255,-0.12459
256,0.0075494
257,0.056232000000000004
258,0.089266
259,0.09665599999999999
260,0.09665599999999999
261,0.09665599999999999
262,0.09665599999999999
263,0.054058
264,-0.012010999999999999
265,-0.039829
266,-0.039829
267,-0.05678099999999999
268,-0.089816
269,-0.12285
270,-0.15588
271,-0.16371
272,-0.13067
273,-0.08720800000000001
274,-0.021138999999999998
275,0.036672
276,0.06970599999999999
277,0.09665599999999999
278,0.09665599999999999
279,0.09665599999999999
280,0.09665599999999999
281,0.09665599999999999
282,0.09665599999999999
283,0.09665599999999999
284,0.06405599999999999
285,0.031020999999999996
286,0.028413
287,0.028413
288,0.028413
289,0.028413
290,0.05449299999999999
291,0.087528
292,0.12055999999999999
293,0.1536
294,0.1649
295,0.1649
296,0.18445999999999999
297,0.21749000000000002
298,0.23314000000000001
299,0.23314000000000001
300,0.23314000000000001
301,0.23314000000000001
302,0.24618
303,0.27921
304,0.29052
305,0.25748000000000004
306,0.22445
307,0.19141
308,0.1649
309,0.1649
310,0.1649
311,0.1649
312,0.1649
313,0.1649
314,0.1649
