time,value
0,-0.68495
1,-0.68495
2,-0.68495
3,-0.68495
4,-0.68495
5,-0.68495
6,-0.68495
7,-0.68495
8,-0.68495
9,-0.68495
10,-0.68495
11,-0.68495
12,-0.68495
13,-0.68495
14,-0.68495
15,-0.68495
16,-0.68495
17,-0.68495
18,-0.68495
19,-0.6809
20,-0.6449699999999999
21,-0.60905
22,-0.56825
23,-0.52584
24,-0.5000100000000001
25,-0.5000100000000001
26,-0.5000100000000001
27,-0.5000100000000001
28,-0.5000100000000001
29,-0.4943
30,-0.48576
31,-0.47422
32,-0.45596000000000003
33,-0.4377
34,-0.48836
35,-0.54284
36,-0.5006
37,-0.39016999999999996
38,-0.27973000000000003
39,-0.16929
40,-0.29374
41,0.25844
42,0.16201
43,0.28936
44,0.43337
45,0.56892
46,0.65373
47,0.73855
48,0.8371799999999999
49,0.93966
50,1.012
51,1.0429
52,1.0691
53,1.0208
54,0.9725
55,0.89126
56,0.79584
57,0.70192
58,0.61092
59,0.5199199999999999
60,0.4793
61,0.43983
62,0.39747
63,0.35329
64,0.29534
65,0.19727
66,0.49659
67,0.1604
68,-0.15765
69,-0.38374
70,-0.10601
71,-0.12921
72,-0.12390999999999999
73,-0.11861
74,-0.46195
75,-0.30734
76,-0.30551999999999996
77,-0.48958
78,-0.13484000000000002
79,-0.17165
80,-0.20845999999999998
81,-0.27083
82,-0.34269
83,-0.4152
84,-0.48882
85,-0.5624399999999999
86,-0.63607
87,-0.7096899999999999
88,-0.78332
89,-0.8569399999999999
90,-0.93056
91,-1.0042
92,-1.0778
93,-1.1514
94,-1.2251
95,-1.2869
96,-1.3396
97,-1.3929
98,-1.4482
99,-1.5036
100,-1.547
101,-1.5883
102,-1.6097
103,-1.6097
104,-1.6083
105,-1.5968
106,-1.5853
107,-1.5477
108,-1.5017
109,-1.4475
110,-1.3806
111,-1.3137
112,-1.246
113,-1.1782
114,-0.96125
115,-0.67294
116,-0.41755
117,-0.2335
118,-0.24661999999999998
119,0.13462000000000002
120,0.31868
121,0.52303
122,0.74125
123,0.96751
124,1.2202
125,1.4729
126,1.7042
127,1.9324
128,2.0738
129,2.1321
130,2.1779
131,2.1532
132,2.1285
133,2.1119
134,2.0974
135,2.0892
136,2.0892
137,2.088
138,2.0703
139,2.0526
140,1.9998
141,1.9324
142,1.8501
143,1.7396
144,1.6292
145,1.5292
146,1.4294
147,1.351
148,1.2856
149,1.2247
150,1.1761
151,1.1275
152,1.0263
153,0.9194
154,0.8305100000000001
155,0.75689
156,0.6832699999999999
157,0.60964
158,0.5360199999999999
159,0.5208
160,0.51845
161,0.5324399999999999
162,0.56571
163,0.59631
164,0.6022
165,0.6080899999999999
166,0.63069
167,0.6592600000000001
168,0.7007800000000001
169,0.7638
170,0.82734
171,0.9248200000000001
172,1.0223
173,1.1001
174,1.1676
175,1.2036
176,1.1638
177,1.1241
178,1.0184
179,0.90797
180,0.76455
181,0.59639
182,0.4043
183,0.12247000000000001
184,-0.15936
185,-0.4502
186,-0.74263
187,-0.9785
188,-1.1552
189,-1.3243
190,-1.4415
191,-1.5587
192,-1.5316
193,-1.4606
194,-1.4035
195,-1.3667
196,-1.3299
197,-1.2931
198,-1.2563
199,-1.1719
200,-1.0656
201,-0.9684200000000001
202,-0.89038
203,-0.81234
204,-0.79637
205,-0.78282
206,-0.79408
207,-0.82176
208,-0.85164
209,-0.88845
210,-0.9252600000000001
211,-0.9418700000000001
212,-0.9557100000000001
213,-0.9516700000000001
214,-0.93106
215,-0.90212
216,-0.8287899999999999
217,-0.75546
218,-0.65256
219,-0.5421199999999999
220,-0.4435
221,-0.36016
222,-0.28031999999999996
223,-0.24351
224,-0.2067
225,-0.16357
226,-0.11793
227,-0.32285
228,0.086592
229,0.34859
230,0.11074
231,0.15167
232,0.21325
233,0.28688
234,0.3605
235,0.43413
236,0.50775
237,0.61433
238,0.72417
239,0.81575
240,0.8923200000000001
241,0.96834
242,1.042
243,1.1156
244,1.2133
245,1.3161
246,1.41
247,1.4936
248,1.5736
249,1.6228
250,1.672
251,1.6955
252,1.7102
253,1.7117
254,1.692
255,1.6711
256,1.5995
257,1.528
258,1.4208
259,1.2953
260,1.1557
261,0.9831
262,0.81053
263,0.5828800000000001
264,0.3517
265,0.10517
266,-0.15250999999999998
267,-0.40653
268,-0.6474300000000001
269,-0.8883200000000001
270,-1.0406
271,-1.1781
272,-1.2648
273,-1.2999
274,-1.3252
275,-1.2884
276,-1.2516
277,-1.1874
278,-1.1152
279,-1.0561
280,-1.0155
281,-0.97503
282,-0.93822
283,-0.90141
284,-0.88415
285,-0.87561
286,-0.8613200000000001
287,-0.83541
288,-0.8094899999999999
289,-0.81871
290,-0.8290200000000001
291,-0.84255
292,-0.85816
293,-0.8652200000000001
294,-0.8463700000000001
295,-0.8275299999999999
296,-0.76348
297,-0.69368
298,-0.6099399999999999
299,-0.51364
300,-0.41718999999999995
301,-0.32001
302,-0.22282
303,-0.46416999999999997
304,0.22495
305,0.17055
306,0.28099
307,0.39025
308,0.48655
309,0.58285
310,0.60964
311,0.60964
312,0.60964
313,0.60964
314,0.60964
315,0.34076
316,0.34076
317,0.34076
318,0.34076
319,0.34076
320,0.34076
321,0.34076
322,0.34076
323,0.34076
324,0.34076
325,0.34076
326,0.34076
327,0.34076
328,0.34076
329,0.34076
330,0.34076
331,0.34076
332,0.34076
333,0.34076
334,0.34483
335,0.3809
336,0.41696000000000005
337,0.45792
338,0.5005
339,0.53163
340,0.54493
341,0.55862
342,0.58463
343,0.61065
344,0.61926
345,0.61926
346,0.61734
347,0.6111300000000001
348,0.60493
349,0.5805100000000001
350,0.55509
351,0.58965
352,0.66652
353,0.75939
354,0.90722
355,1.055
356,1.1717
357,1.2834
358,1.3438
359,1.3536
360,1.3485
361,1.2545
362,1.1605
363,1.0533
364,0.9424
365,0.80912
366,0.64504
367,0.47825
368,0.26923
369,0.30161
370,-0.12711
371,-0.30508
372,-0.45966
373,-0.56845
374,-0.67725
375,-0.73519
376,-0.79195
377,-0.84562
378,-0.89736
379,-0.9515899999999999
380,-1.0131
381,-1.0746
382,-1.1141
383,-1.1511
384,-1.1839
385,-1.2132
386,-1.2374
387,-1.2374
388,-1.2374
389,-1.2398
390,-1.2428
391,-1.2608
392,-1.2972
393,-1.3302
394,-1.3302
395,-1.3302
396,-1.3816
397,-1.4519
398,-1.5236
399,-1.5975
400,-1.6712
401,-1.7146
402,-1.7581
403,-1.8155
404,-1.8806
405,-1.9408
406,-1.989
407,-2.0372
408,-2.075
409,-2.1119
410,-2.1489
411,-2.1858
412,-2.2228
413,-2.2597
414,-2.2967
415,-2.32
416,-2.3407
417,-2.3514
418,-2.3514
419,-2.3486
420,-2.3256
421,-2.3025
422,-2.2408
423,-2.1669
424,-2.093
425,-2.0191
426,-1.9443
427,-1.8483
428,-1.7522
429,-1.5517
430,-1.3012
431,-1.0949
432,-0.98403
433,-0.8731700000000001
434,-0.72729
435,-0.57977
436,-0.43206000000000006
437,-0.28424
438,-0.13642
439,0.057599000000000004
440,0.15922999999999998
441,0.28126999999999996
442,0.39953
443,0.44447
444,0.41934
445,0.38688
446,0.31296999999999997
447,0.23906
448,0.16514
449,0.45671999999999996
450,0.13024000000000002
451,-0.1388
452,-0.40813
453,-0.13643
454,-0.19113
455,-0.2594
456,-0.33332
457,-0.41173000000000004
458,-0.49865
459,-0.58557
460,-0.67511
461,-0.76469
462,-0.8214299999999999
463,-0.8583799999999999
464,-0.8953399999999999
465,-0.9323
466,-0.96925
467,-1.0062
468,-1.0432
469,-1.0801
470,-1.1171
471,-1.1540000000000001
472,-1.1909999999999998
473,-1.2279
474,-1.1769
475,-1.1066
476,-1.0346
477,-0.96068
478,-0.8867700000000001
479,-0.81286
480,-0.7389399999999999
481,-0.6439
482,-0.5413100000000001
483,-0.42572
484,-0.28854
485,-0.15084
486,0.10522000000000001
487,0.1927
488,0.37298000000000003
489,0.55776
490,0.73127
491,0.8776200000000001
492,1.024
493,1.1215
494,1.2155
495,1.2732
496,1.3037
497,1.3072
498,1.2096
499,1.1121
500,0.90899
501,0.68726
502,0.47636000000000006
503,0.2768
504,0.44663
505,-0.082578
506,-0.12247000000000001
507,-0.19566
508,-0.25893
509,-0.2665
510,-0.19259
511,-0.11868
512,-0.22326999999999997
513,0.14629
514,0.10305999999999998
515,0.17697000000000002
516,0.24036999999999997
517,0.28176
518,0.32315
519,0.36027
520,0.39723
521,0.40075
522,0.38211999999999996
523,0.35297
524,0.29059
525,0.22821
526,0.17597000000000002
527,0.12512
528,0.46162
529,0.38032
530,0.3408
531,0.10471
532,0.14137
533,0.20772
534,0.28163
535,0.34961
536,0.40992
537,0.46848
538,0.50543
539,0.5423899999999999
540,0.57301
541,0.6011
542,0.6169600000000001
543,0.61045
544,0.60395
545,0.57133
546,0.53851
547,0.52754
548,0.52932
549,0.54062
550,0.57757
551,0.61453
552,0.68457
553,0.75789
554,0.8315299999999999
555,0.9054399999999999
556,0.97341
557,1.0157
558,1.058
559,1.1443
560,1.2397
561,1.3173
562,1.3744
563,1.4293
564,1.4663
565,1.5032
566,1.5402
567,1.5772
568,1.6065
569,1.6237
570,1.6408
571,1.6583
572,1.6757
573,1.6761
574,1.6678
575,1.6322
576,1.5328
577,1.4335
578,1.2789
579,1.1207
580,0.9471299999999999
581,0.76235
582,0.5788
583,0.39963000000000004
584,0.22046999999999997
585,0.38323
586,-0.3071
587,-0.14854
588,-0.18373
589,-0.20914000000000002
590,-0.17219
591,-0.13523
592,-0.0787
593,0.12754000000000001
594,0.24536999999999998
595,0.32697
596,0.40817
597,0.48208
598,0.55599
599,0.61027
600,0.6558
601,0.68988
602,0.70082
603,0.7117600000000001
604,0.68915
605,0.6655
606,0.63374
607,0.5967899999999999
608,0.56453
609,0.5464899999999999
610,0.52846
611,0.52642
612,0.52642
613,0.53389
614,0.54808
615,0.568
616,0.61678
617,0.66556
618,0.72695
619,0.7914
620,0.83736
621,0.8601200000000001
622,0.87795
623,0.84099
624,0.80404
625,0.76367
626,0.7219800000000001
627,0.65533
628,0.54446
629,0.43359
630,1.6821
631,1.6821
632,1.6821
633,1.6821
634,1.6821
635,1.6821
636,1.6821
637,1.6821
638,1.6821
639,1.6821
640,1.6821
641,1.6821
642,1.6821
643,1.6821
644,1.6821
645,1.6821
646,1.6821
647,1.6821
648,1.6821
649,1.6821
650,1.6821
651,1.6821
652,1.6821
653,1.6821
654,1.6729
655,1.6492
656,1.625
657,1.5788
658,1.5326
659,1.5072
660,1.492
661,1.4680000000000002
662,1.4245
663,1.381
664,1.4257
665,1.4754
666,1.4436
667,1.3544
668,1.2558
669,1.1247
670,0.99355
671,0.7701899999999999
672,0.53241
673,0.31338
674,0.11284000000000001
675,-0.42200000000000004
676,-0.26268
677,-0.44083999999999995
678,-0.6432100000000001
679,-0.8523200000000001
680,-1.0455
681,-1.2169
682,-1.3828
683,-1.4641
684,-1.5454
685,-1.5914
686,-1.6222
687,-1.646
688,-1.6563
689,-1.6666
690,-1.6669
691,-1.6669
692,-1.6615
693,-1.6527
694,-1.6444
695,-1.6372
696,-1.6301
697,-1.6435
698,-1.6595
699,-1.6693
700,-1.6738
701,-1.6808
702,-1.6995
703,-1.7183
704,-1.7204
705,-1.7186
706,-1.7078
707,-1.6859
708,-1.6641
709,-1.6422
710,-1.6204
711,-1.5833
712,-1.5407
713,-1.4976
714,-1.4539
715,-1.4105
716,-1.4028
717,-1.3951
718,-1.3924
719,-1.3924
720,-1.3880000000000001
721,-1.3728
722,-1.3576
723,-1.3362
724,-1.3144
725,-1.2925
726,-1.2707
727,-1.2443
728,-1.2005
729,-1.1566
730,-1.1349
731,-1.1174
732,-1.1334
733,-1.1853
734,-1.2356
735,-1.2739
736,-1.3122
737,-1.2924
738,-1.2543
739,-1.1981
740,-1.1147
741,-1.0323
742,-0.9746100000000001
743,-0.91691
744,-0.89909
745,-0.90031
746,-0.90805
747,-0.9299
748,-0.95176
749,-0.93221
750,-0.9107
751,-0.8769399999999999
752,-0.83481
753,-0.7791
754,-0.67874
755,-0.57838
756,-0.36349000000000004
757,-0.13183
758,0.14837999999999998
759,0.47498999999999997
760,0.79182
761,1.0534
762,1.3149
763,1.4377
764,1.5233
765,1.5468
766,1.4874
767,1.4245
768,1.3153
769,1.206
770,1.1096
771,1.0185
772,0.9308799999999999
773,0.84993
774,0.7689699999999999
775,0.65392
776,0.53835
777,0.41612
778,0.28989000000000004
779,0.17179
780,0.38308000000000003
781,-0.09337100000000001
782,-0.22906999999999997
783,-0.32786
784,-0.37695
785,-0.38395
786,-0.42912
787,-0.12965
788,-0.17336
789,-0.21706999999999999
790,-0.26078
791,-0.33166999999999996
792,-0.43466000000000005
793,-0.53646
794,-0.62738
795,-0.7183
796,-0.78165
797,-0.83515
798,-0.8791200000000001
799,-0.90727
800,-0.93511
801,-0.9428
802,-0.9505
803,-0.92811
804,-0.88982
805,-0.8468600000000001
806,-0.79266
807,-0.73846
808,-0.65687
809,-0.5733
810,-0.44786000000000004
811,-0.29103
812,-0.12429000000000001
813,0.39845
814,0.28344
815,0.45077
816,0.6116199999999999
817,0.69387
818,0.69387
819,0.6934899999999999
820,0.6905100000000001
821,0.6875399999999999
822,0.67009
823,0.64823
824,0.62638
825,0.60452
826,0.58267
827,0.56081
828,0.53895
829,0.5171
830,0.49523999999999996
831,0.48582
832,0.50244
833,0.51905
834,0.55787
835,0.5975600000000001
836,0.62978
837,0.65705
838,0.6866399999999999
839,0.72354
840,0.76043
841,0.7553300000000001
842,0.74449
843,0.7039
844,0.63571
845,0.56619
846,0.48961000000000005
847,0.41303
848,0.35275
849,0.29663
850,0.24941999999999998
851,0.21375999999999998
852,0.18012999999999998
853,0.17156
854,0.16299
855,0.18365
856,0.21599000000000002
857,0.25736
858,0.31523
859,0.37311
860,0.40009
861,0.42683999999999994
862,0.47678000000000004
863,0.54025
864,0.59246
865,0.61431
866,0.63617
867,0.63846
868,0.63881
869,0.6389699999999999
870,0.6389699999999999
871,0.63545
872,0.61674
873,0.5980300000000001
874,0.59104
875,0.58649
876,0.57665
877,0.56074
878,0.5442
879,0.52235
880,0.50049
881,0.47863
882,0.45678
883,0.43942
884,0.42927
885,0.4189
886,0.39826999999999996
887,0.37763
888,0.34763
889,0.31284
890,0.28646
891,0.27964
892,0.27282
893,0.26994
894,0.26732
895,0.22279000000000002
896,0.14778
897,0.32708000000000004
898,-0.2193
899,-0.15325
900,-0.26088
901,-0.36823
902,-0.46491000000000005
903,-0.55076
904,-0.62795
905,-0.6498
906,-0.67166
907,-0.6610199999999999
908,-0.6409100000000001
909,-0.61198
910,-0.57055
911,-0.52803
912,-0.46613999999999994
913,-0.40424
914,-0.33981
915,-0.27424
916,-0.21377
917,-0.16359
918,-0.11341
919,-0.27910999999999997
920,0.063363
921,0.24516999999999997
922,0.44711000000000006
923,0.1251
924,0.14695999999999998
925,0.16881
926,0.17329
927,0.17557
928,0.16072
929,0.13047999999999998
930,0.49633999999999995
931,0.31276
932,0.12917
933,0.18663
934,-0.053426999999999995
935,-0.098662
936,-0.098662
937,-0.095191
938,-0.053229
939,-0.074321
940,0.23199
941,0.11045
942,0.16724
943,0.21095
944,0.25466
