time,value
0,-0.038834
1,-0.0080745
2,0.012565
3,0.28881
4,-0.32453000000000004
5,0.39214
6,0.36199000000000003
7,-0.2194
8,-0.28893
9,0.41108
10,-0.015302000000000001
11,-0.09198300000000001
12,-0.20795999999999998
13,-0.18337
14,0.19091
15,0.019053999999999998
16,-0.51044
17,-0.39449
18,-0.37728
19,0.7722100000000001
20,-0.053648
21,0.48915
22,-0.085869
23,-0.8164899999999999
24,-0.48191000000000006
25,-0.27412
26,0.17829
27,0.55634
28,-0.095887
29,-0.39419
30,0.40251
31,-0.054865
32,-0.11613
33,-0.30479
34,-0.4224
35,0.32106999999999997
36,0.092784
37,-0.13412000000000002
38,-0.08355
39,-0.15654
40,-0.14885
41,-0.21456999999999998
42,0.21428000000000003
43,0.31489
44,0.039484
45,0.51598
46,-0.15705999999999998
47,-0.085201
48,-0.10776
49,0.094321
50,-0.27443
51,-0.28424
52,0.14445999999999998
53,-0.14707
54,-0.17737999999999998
55,-0.21400999999999998
56,0.0094191
57,0.32461
58,-0.39313000000000003
59,-0.37775
60,-0.40694
61,-0.46079
62,-0.35447
63,-1.6059999999999999
64,-1.6059999999999999
65,-1.6059999999999999
66,-1.6059999999999999
67,-1.6059999999999999
68,-1.6059999999999999
69,-1.6059999999999999
70,-1.6059999999999999
71,-1.6059999999999999
72,-1.6059999999999999
73,-1.6059999999999999
74,-1.6059999999999999
75,-1.6059999999999999
76,-1.6059999999999999
77,1.6366
78,1.6366
79,1.6366
80,1.6366
81,1.6366
82,1.6366
83,1.6366
84,1.6366
85,1.6366
86,1.6366
87,1.6366
88,1.6366
89,1.6366
90,1.6366
91,0.080915
92,0.034316
93,0.35042
94,0.27366999999999997
95,1.6366
96,1.6366
97,1.6366
98,1.6366
99,1.6366
100,1.6366
101,1.6366
102,1.6366
103,1.6366
104,-1.6059999999999999
105,-1.6059999999999999
106,-1.6059999999999999
107,-1.6059999999999999
108,-1.6059999999999999
109,-1.6059999999999999
110,-1.6059999999999999
111,-1.6059999999999999
112,0.40774
113,0.75772
114,0.57297
115,-0.63381
116,-0.10066
117,-0.21669000000000002
118,0.19165
119,0.035595
120,0.37512
121,-0.20025
122,0.25664000000000003
123,0.25844
124,-0.53123
125,-0.11767000000000001
126,0.084274
127,-0.39655
