time,value
0,-0.7801
1,-0.80769
2,-0.60495
3,-0.43488999999999994
4,-0.16174000000000002
5,0.17051
6,0.50212
7,0.80194
8,1.0647
9,1.3815
10,1.415
11,1.3602
12,1.4125
13,1.5049
14,1.4915
15,1.3708
16,1.0893
17,0.82314
18,0.49977
19,0.17752
20,-0.14290999999999998
21,-0.4712
22,-0.6479600000000001
23,-0.77658
24,-0.8966700000000001
25,-0.71365
26,-0.49501999999999996
27,-0.24488000000000001
28,0.035332999999999996
29,0.33826
30,0.66461
31,0.9896
32,1.3292
33,1.4745
34,1.5323
35,1.5133
36,1.4116
37,1.2736
38,1.3362
39,1.439
40,1.5599
41,1.6105
42,1.3507
43,1.0142
44,0.65165
45,0.37233
46,0.04455
47,-0.25592
48,-0.5125
49,-0.6893
50,-0.15453
51,-0.29116
52,-0.53904
53,-0.81208
54,-1.0794
55,-1.2921
56,-1.4761
57,-1.5516
58,-1.5326
59,-1.2990000000000002
60,-1.0835
61,-0.84651
62,-0.63458
63,-0.44693
64,-0.2124
65,-0.20768000000000003
66,-0.3161
67,-0.53608
68,-0.81328
69,-1.015
70,-1.2285
71,-1.3341
72,-1.3336
73,-1.3611
74,-1.3359
75,-1.1685
76,-1.0176
77,-0.7518600000000001
78,-0.44866000000000006
79,-0.25117
