time,value
0,-1.1821
1,-1.1045
2,-0.7776
3,-0.24604
4,0.38275
5,0.95729
6,1.3542
7,1.4816
8,1.3272
9,0.9271299999999999
10,0.40417
11,-0.11935
12,-0.5457
13,-0.80918
14,-0.8915700000000001
15,-0.80291
16,-0.6048399999999999
17,-0.32792
18,-0.014872
19,0.30496
20,0.6146199999999999
21,0.87734
22,1.0775
23,1.1546
24,1.0914
25,0.8606
26,0.47547
27,0.00015006
28,-0.49283999999999994
29,-0.9238700000000001
30,-1.2293
31,-1.3665
32,-1.3509
33,-1.2158
34,-1.0145
35,-0.79571
36,-0.58437
37,-0.40786999999999995
38,-0.24902
39,-0.089258
40,0.09686499999999999
41,0.31742
42,0.57463
43,0.86535
44,1.1503
45,1.4011
46,1.5703
47,1.6343
48,1.5619999999999998
49,1.3465
50,1.01
51,0.58935
52,0.13016
53,-0.3288
54,-0.7294
55,-1.0461
56,-1.2598
57,-1.3698
58,-1.39
59,-1.3204
60,-1.1676
61,-0.9440799999999999
62,-0.66506
63,-0.36119
64,-0.06450700000000001
65,0.18298
66,0.34153
67,0.3919
68,0.34293
69,0.23792
70,0.1361
71,0.098738
72,0.16449
73,0.33562
74,0.56855
75,0.79871
76,0.94725
77,0.96839
78,0.8384299999999999
79,0.59628
80,0.2962
81,-0.0018524999999999998
82,-0.23501999999999998
83,-0.39018
84,-0.45548999999999995
85,-0.45707
86,-0.42845
87,-0.39453
88,-0.36424
89,-0.32919
90,-0.28924
91,-0.22960999999999998
92,-0.15125
93,-0.065572
94,-0.0083759
95,-0.00099264
96,-0.05057
97,-0.15205
98,-0.28373000000000004
99,-0.41256000000000004
100,-0.49882
101,-0.5140899999999999
102,-0.44331000000000004
103,-0.25918
104,0.026697000000000002
105,0.39779000000000003
106,0.81597
107,1.2141
108,1.5291
109,1.6708
110,1.5976
111,1.2754
112,0.71101
113,-0.015323
114,-0.7955399999999999
115,-1.48
116,-1.9672
117,-2.1541
118,-2.0214
119,-1.619
120,-1.032
121,-0.3866
122,0.22168000000000002
123,0.7042
124,1.035
125,1.2136
126,1.2751
127,1.2743
128,1.2191
129,1.1313
130,0.99649
131,0.79462
132,0.51508
133,0.16543
134,-0.218
135,-0.59585
136,-0.9126799999999999
137,-1.1384
138,-1.2508
139,-1.2541
140,-1.1794
141,-1.0467
142,-0.87835
143,-0.6848
144,-0.46399999999999997
145,-0.20601
146,0.10909
147,0.47472
148,0.87131
149,1.2457
150,1.5426
151,1.6985
152,1.665
153,1.4369
154,1.0345
155,0.51974
156,-0.021965000000000002
157,-0.50325
158,-0.8416799999999999
159,-1.0092
160,-1.0112
161,-0.89704
162,-0.71496
163,-0.5262
164,-0.37954
165,-0.30175
166,-0.31268
167,-0.39265
168,-0.50654
169,-0.61316
170,-0.6796399999999999
171,-0.68172
172,-0.59782
173,-0.43785
174,-0.20047
175,0.096215
176,0.4297
177,0.7744
178,1.1035
179,1.3947
180,1.6002
181,1.6851
182,1.6288
183,1.4184
184,1.0643
185,0.59828
186,0.078445
187,-0.44358000000000003
188,-0.8885299999999999
189,-1.197
190,-1.3357
191,-1.3148
192,-1.1733
193,-0.96665
194,-0.77778
195,-0.65073
196,-0.62641
197,-0.68882
198,-0.80267
199,-0.88881
200,-0.8759100000000001
201,-0.69103
202,-0.30583
203,0.25535
204,0.9180299999999999
205,1.5819
206,2.1306
207,2.4648
208,2.5198
209,2.2738
210,1.7585
211,1.0427
212,0.22441
213,-0.5837899999999999
214,-1.2797
215,-1.7779
216,-2.0473
217,-2.0577
218,-1.8349
219,-1.4407
220,-0.9438700000000001
221,-0.4223
222,0.048693
223,0.40171999999999997
224,0.6162
225,0.70662
226,0.70828
227,0.66097
228,0.59751
229,0.55425
230,0.52344
231,0.49311000000000005
232,0.44118
233,0.34526999999999997
234,0.19189
235,-0.011975
236,-0.23969000000000001
237,-0.46593999999999997
238,-0.64457
239,-0.7468
240,-0.75751
241,-0.6744100000000001
242,-0.49798000000000003
243,-0.25726
244,0.022078
245,0.30899
246,0.57144
247,0.7701399999999999
248,0.8807299999999999
249,0.8835299999999999
250,0.76648
251,0.53745
252,0.22966999999999999
253,-0.11878
254,-0.44211000000000006
255,-0.6824
256,-0.8043
257,-0.79972
258,-0.6819
259,-0.5007
260,-0.30503
261,-0.13205
262,-0.006833199999999999
263,0.060204999999999995
264,0.082398
265,0.07786599999999999
266,0.071154
267,0.085029
268,0.12272999999999999
269,0.17539000000000002
270,0.23940999999999998
271,0.3059
272,0.36561
273,0.41503999999999996
274,0.46816
275,0.51373
276,0.53762
277,0.52353
278,0.46295
279,0.33793
280,0.14082999999999998
281,-0.10992
282,-0.38716
283,-0.6581899999999999
284,-0.8878799999999999
285,-1.0372
286,-1.0933
287,-1.0449
288,-0.89015
289,-0.64303
290,-0.34381
291,-0.033566000000000006
292,0.2497
293,0.46975
294,0.5909800000000001
295,0.61795
296,0.5674600000000001
297,0.47821
298,0.39365
299,0.3603
300,0.39575
301,0.50898
302,0.66704
303,0.8279
304,0.94479
305,0.97469
306,0.8857700000000001
307,0.66882
308,0.32811
309,-0.11258
310,-0.6158399999999999
311,-1.1306
312,-1.5969
313,-1.9597
314,-2.1646
315,-2.1593
316,-1.9367
317,-1.5057
318,-0.9265899999999999
319,-0.25914
320,0.40638
321,1.0058
322,1.4753
323,1.7934
324,1.965
325,2.0066
326,1.9435
327,1.7814
328,1.5427
329,1.2371
330,0.86646
331,0.45003000000000004
332,-0.006605800000000001
333,-0.47283000000000003
334,-0.9278299999999999
335,-1.3467
336,-1.7005
337,-1.9706
338,-2.123
339,-2.1556
340,-2.0509
341,-1.7993
342,-1.4069999999999998
343,-0.9017700000000001
344,-0.31611999999999996
345,0.29515
346,0.86055
347,1.3354
348,1.6635
349,1.8345
350,1.8459999999999999
351,1.7272
352,1.5199
353,1.2545
354,0.9765799999999999
355,0.70105
356,0.43961000000000006
357,0.18567999999999998
358,-0.054917999999999995
359,-0.28226999999999997
360,-0.49428
361,-0.68321
362,-0.85414
363,-0.9996200000000001
364,-1.1208
365,-1.2233
366,-1.2867
367,-1.3022
368,-1.2585
369,-1.1405
370,-0.92796
371,-0.6262800000000001
372,-0.25338
373,0.17686
374,0.6270899999999999
375,1.0456
376,1.3912
377,1.63
378,1.7380000000000002
379,1.6892
380,1.49
381,1.1659
382,0.75149
383,0.301
384,-0.13187000000000001
385,-0.50426
386,-0.79477
387,-0.9842200000000001
388,-1.078
389,-1.08
390,-1.0167
391,-0.90851
392,-0.77432
393,-0.62615
394,-0.48135
395,-0.33524
396,-0.19759000000000002
397,-0.075343
398,0.046196
399,0.16766
400,0.28848
401,0.41535
402,0.55092
403,0.69697
404,0.85469
405,1.0142
406,1.1498
407,1.2284
408,1.2097
409,1.0562
410,0.74221
411,0.26924000000000003
412,-0.32426
413,-0.9656399999999999
414,-1.5637
415,-2.0227
416,-2.2796
417,-2.2858
418,-2.0444
419,-1.5817
420,-0.98374
421,-0.32182
422,0.325
423,0.90922
424,1.3928
425,1.7614
426,2.0118
427,2.1264
428,2.1053
429,1.9321
430,1.6126
431,1.153
432,0.58377
433,-0.03107
434,-0.6353
435,-1.1645
436,-1.5784
437,-1.851
438,-1.9781
439,-1.9869999999999999
440,-1.8788
441,-1.6716
442,-1.375
443,-0.9897100000000001
444,-0.5312
445,-0.025687
446,0.48868999999999996
447,0.97716
448,1.3780000000000001
449,1.6632
450,1.7956
451,1.7729
452,1.6062
453,1.3184
454,0.93853
455,0.49637
456,0.022782
457,-0.4377
458,-0.83067
459,-1.1126
460,-1.2487
461,-1.2204
462,-1.0378
463,-0.74263
464,-0.40510999999999997
465,-0.089439
466,0.14274
467,0.24903000000000003
468,0.22113000000000002
469,0.10507999999999999
470,-0.037238
471,-0.15208
472,-0.18588
473,-0.10941
474,0.056767
475,0.26889
476,0.47997
477,0.6421899999999999
478,0.7207100000000001
479,0.69786
480,0.5894699999999999
481,0.42223
482,0.21224
483,-0.01984
484,-0.26206999999999997
485,-0.50867
486,-0.73807
487,-0.9102899999999999
488,-0.9973200000000001
489,-0.9657
490,-0.8044899999999999
491,-0.52582
492,-0.17429
493,0.18394000000000002
494,0.47827
495,0.63272
496,0.61197
497,0.42504
498,0.14019
499,-0.16305999999999998
