time,value
0,2.0207
1,1.8689
2,1.5953
3,1.3628
4,1.0923
5,0.8586799999999999
6,0.68105
7,0.60232
8,0.41931
9,0.32813000000000003
10,0.30222
11,0.27816
12,0.10695999999999999
13,0.14695999999999998
14,-0.033311
15,-0.16824
16,-0.06081
17,-0.1782
18,-0.35706
19,-0.33278
20,-0.43701999999999996
21,-0.61649
22,-0.64145
23,-0.73015
24,-0.8514200000000001
25,-0.71215
26,-0.80984
27,-0.9089
28,-0.86498
29,-0.96024
30,-1.0881
31,-1.0756
32,-1.0885
33,-1.1234
34,-1.0988
35,-1.0619
36,-1.1165
37,-1.1232
38,-1.1344
39,-0.99779
40,-0.9010600000000001
41,-0.89792
42,-0.86498
43,-0.80428
44,-0.69926
45,-0.6057
46,-0.47336000000000006
47,-0.48827
48,-0.33311999999999997
49,-0.17422
50,-0.017849
51,0.13714
52,0.31595
53,0.46563999999999994
54,0.59317
55,0.68808
56,0.72622
57,0.9685299999999999
58,1.2690000000000001
59,1.4986
60,1.7525
61,1.8856
62,1.9067
63,1.8599
64,1.8624
65,1.9133
66,1.8971
67,1.7685
68,1.6963
69,1.5506
70,1.4063
71,1.3213
72,1.1974
73,1.0106
74,0.9630299999999999
75,0.7674300000000001
76,0.67682
77,0.5053300000000001
78,0.30811
79,0.20481999999999997
80,0.072657
81,-0.051087
82,-0.16111
83,-0.28579
84,-0.46663999999999994
85,-0.54371
86,-0.62821
87,-0.8165399999999999
88,-0.8903
89,-0.91381
90,-1.0098
91,-1.0395
92,-1.1011
93,-1.2515
94,-1.2404
95,-1.2481
96,-1.3596
97,-1.2964
98,-1.2496
99,-1.2318
100,-1.1985
101,-1.1867
102,-1.176
103,-1.0444
104,-0.9863700000000001
105,-1.0568
106,-0.9081100000000001
107,-0.81118
108,-0.7823399999999999
109,-0.6530600000000001
110,-0.5150100000000001
111,-0.43368
112,-0.2931
113,-0.31992
114,-0.12268
115,-0.21825999999999998
116,-0.064705
117,0.054148
118,0.14165999999999998
119,0.18185
120,0.37913
121,0.55915
122,0.78876
123,1.0261
124,1.2221
125,1.4611
126,1.7401
127,1.98
