time,value
0,0.80312
1,0.80312
2,0.80312
3,0.80312
4,0.80312
5,0.80312
6,0.80312
7,0.80312
8,0.80442
9,0.83014
10,0.8547799999999999
11,0.8635
12,0.87156
13,0.87156
14,0.87156
15,0.87156
16,0.87156
17,0.87156
18,0.87156
19,0.87156
20,0.87156
21,0.87156
22,0.87156
23,0.87156
24,0.86798
25,0.84444
26,0.81401
27,0.74863
28,0.6847
29,0.6276
30,0.5738800000000001
31,0.53465
32,0.48915
33,0.41897
34,0.34343
35,0.2484
36,0.16012
37,0.46019
38,0.13324
39,-0.1937
40,-0.47981
41,-0.1264
42,-0.1513
43,-0.15348
44,-0.15505
45,-0.15505
46,-0.15505
47,-0.15505
48,-0.15505
49,-0.15505
50,-0.15505
51,-0.15505
52,-0.16222999999999999
53,-0.18402000000000002
54,-0.20269
55,-0.21533000000000002
56,-0.22349000000000002
57,-0.22349000000000002
58,-0.21741
59,-0.20085
60,-0.18379
61,-0.16591
62,-0.15505
63,-0.15505
64,-0.15505
65,-0.15505
66,-0.15105
67,-0.14146
68,-0.1253
69,-0.10045
70,-0.43301999999999996
71,-0.40251
72,-0.32134
73,-0.17966
74,-0.10434
75,-0.10434
76,-0.10434
77,-0.10434
78,-0.10434
79,-0.10434
80,-0.10434
81,-0.10434
82,-0.18239
83,-0.33279000000000003
84,-0.49013
85,-0.12803
86,-0.16072
87,-0.19342
88,-0.22610999999999998
89,-0.2588
90,-0.31782
91,-0.39671999999999996
92,-0.48678999999999994
93,-0.5848800000000001
94,-0.68296
95,-0.78105
96,-0.87913
97,-0.97721
98,-1.0653
99,-1.1472
100,-1.2278
101,-1.3076
102,-1.391
103,-1.4765
104,-1.5559
105,-1.6322
106,-1.7169
107,-1.8059
108,-1.8736
109,-1.9316
110,-1.9681
111,-1.9951
112,-2.0002
113,-1.9962
114,-1.97
115,-1.9351
116,-1.8778
117,-1.8125
118,-1.7471
119,-1.6817
120,-1.5686
121,-1.4404
122,-1.3103
123,-1.1795
124,-1.0706
125,-0.96772
126,-0.82695
127,-0.67656
128,-0.5353399999999999
129,-0.39628
130,-0.24538000000000001
131,-0.47316
132,0.33595
133,0.23335999999999998
134,0.39683
135,0.5603100000000001
136,0.72378
137,0.88725
138,1.037
139,1.1848
140,1.3052
141,1.422
142,1.5329
143,1.6432
144,1.7436
145,1.8430000000000002
146,1.8727
147,1.8966
148,1.8851
149,1.8712
150,1.8084
151,1.743
152,1.6742
153,1.6054
154,1.5063
155,1.4065
156,1.2761
157,1.1453
158,1.0472
159,0.9495399999999999
160,0.88241
161,0.8153199999999999
162,0.74993
163,0.6855899999999999
164,0.64766
165,0.61
166,0.57731
167,0.54461
168,0.5119199999999999
169,0.47753
170,0.42261000000000004
171,0.36857
172,0.32366999999999996
173,0.2781
174,0.22666999999999998
175,0.17557
176,0.12719
177,0.39044
178,0.22696999999999998
179,0.082312
180,0.053977
181,0.2269
182,0.08267100000000001
183,0.10226
184,-0.092968
185,-0.11168
186,-0.15309
187,-0.22389
188,-0.42005
189,-0.12585
190,-0.19122999999999998
191,-0.25661999999999996
192,-0.32201
193,-0.3874
194,-0.45278999999999997
195,-0.51818
196,-0.58357
197,-0.64079
198,-0.67392
199,-0.6744899999999999
200,-0.58513
201,-0.48532
202,-0.35846999999999996
203,-0.23046999999999998
204,-0.09969
205,0.14196
206,0.16187
207,0.27775
208,0.36144
209,0.42477
210,0.44656999999999997
211,0.44721000000000005
212,0.4071
213,0.36451999999999996
214,0.31744
215,0.27564
216,0.24295
217,0.22150999999999998
218,0.21846
219,0.22944
220,0.26213000000000003
221,0.29481999999999997
222,0.32752
223,0.36021
224,0.39291
225,0.4256
226,0.4583
227,0.48828999999999995
228,0.51488
229,0.5313399999999999
230,0.5357
231,0.55333
232,0.58602
233,0.6187199999999999
234,0.65141
235,0.68411
236,0.7168
237,0.76561
238,0.8301299999999999
239,0.87949
240,0.9148
241,0.96378
242,1.0248
243,1.1027
244,1.1947
245,1.2762
246,1.3494
247,1.4182
248,1.4836
249,1.5366
250,1.5806
251,1.6062
252,1.6193
253,1.6244
254,1.6244
255,1.6144
256,1.5983
257,1.5626
258,1.5155
259,1.4403
260,1.3496
261,1.2397
262,1.1198
263,1.0145
264,0.91646
265,0.8183699999999999
266,0.72029
267,0.62221
268,0.52412
269,0.42604
270,0.32796
271,0.2283
272,0.12804000000000001
273,0.048664
274,-0.12692
275,-0.30676
276,-0.50292
277,-0.7467699999999999
278,-1.0057
279,-1.198
280,-1.3706
281,-1.4923
282,-1.6
283,-1.7
284,-1.7981
285,-1.8566
286,-1.9059
287,-1.9228
288,-1.9329
289,-1.9169999999999998
290,-1.8961
291,-1.8489
292,-1.7971
293,-1.7185
294,-1.6357
295,-1.5807
296,-1.5297
297,-1.5115
298,-1.4976
299,-1.4777
300,-1.4572
301,-1.4554
302,-1.4554
303,-1.4554
304,-1.4554
305,-1.4554
306,-1.4554
307,-1.4505
308,-1.4452
309,-1.4102
310,-1.374
311,-1.3094
312,-1.244
313,-1.1786
314,-1.1132
315,0.5184300000000001
316,0.5184300000000001
317,0.5184300000000001
318,0.5184300000000001
319,0.5184300000000001
320,0.5184300000000001
321,0.5184300000000001
322,0.5184300000000001
323,0.5184300000000001
324,0.5184300000000001
325,0.5184300000000001
326,0.5184300000000001
327,0.5184300000000001
328,0.5184300000000001
329,0.5184300000000001
330,0.5184300000000001
331,0.5184300000000001
332,0.5184300000000001
333,0.5184300000000001
334,0.5184300000000001
335,0.5164
336,0.50035
337,0.48173999999999995
338,0.44736000000000004
339,0.41108999999999996
340,0.36432
341,0.31566
342,0.25743
343,0.20342000000000002
344,0.16902999999999999
345,0.13464
346,0.48778999999999995
347,0.31073
348,0.11357
349,-0.11172
350,-0.43956000000000006
351,-0.14368
352,-0.17807
353,-0.21245999999999998
354,-0.24685
355,-0.28124
356,-0.31563
357,-0.34148
358,-0.34378000000000003
359,-0.34543
360,-0.34543
361,-0.35370999999999997
362,-0.38214000000000004
363,-0.4043
364,-0.41208999999999996
365,-0.41741999999999996
366,-0.41741999999999996
367,-0.42496000000000006
368,-0.44788999999999995
369,-0.46753
370,-0.48081999999999997
371,-0.49623
372,-0.51549
373,-0.53391
374,-0.55087
375,-0.5673199999999999
376,-0.58291
377,-0.60587
378,-0.64026
379,-0.66982
380,-0.69229
381,-0.7053699999999999
382,-0.7053699999999999
383,-0.70892
384,-0.71718
385,-0.73417
386,-0.7621399999999999
387,-0.77736
388,-0.77736
389,-0.77736
390,-0.77736
391,-0.7778
392,-0.77872
393,-0.7961600000000001
394,-0.83055
395,-0.8479899999999999
396,-0.84891
397,-0.86577
398,-0.89741
399,-0.9305100000000001
400,-0.9649
401,-0.99929
402,-1.0337
403,-1.0535
404,-1.0618
405,-1.093
406,-1.1416
407,-1.1889
408,-1.2352
409,-1.2867
410,-1.3417
411,-1.4051
412,-1.4739
413,-1.5321
414,-1.5839
415,-1.6343
416,-1.6838
417,-1.7458
418,-1.8145
419,-1.8758
420,-1.9331
421,-1.975
422,-2.0094
423,-2.0385
424,-2.0651
425,-2.069
426,-2.063
427,-2.0399
428,-2.0096
429,-1.9979
430,-1.9933
431,-1.9419
432,-1.8736
433,-1.8306
434,-1.7962
435,-1.7618
436,-1.7274
437,-1.669
438,-1.6034
439,-1.5353
440,-1.4665
441,-1.4197
442,-1.3784
443,-1.3219
444,-1.2619
445,-1.175
446,-1.0824
447,-0.98095
448,-0.8777799999999999
449,-0.79172
450,-0.70873
451,-0.63797
452,-0.56919
453,-0.51483
454,-0.46256
455,-0.42613
456,-0.39174000000000003
457,-0.36889
458,-0.34734
459,-0.34543
460,-0.34543
461,-0.34543
462,-0.34543
463,-0.34543
464,-0.34543
465,-0.35065999999999997
466,-0.35616
467,-0.38945
468,-0.42383999999999994
469,-0.46002
470,-0.49623999999999996
471,-0.5646100000000001
472,-0.63338
473,-0.63338
474,-0.6338
475,-0.66635
476,-0.69818
477,-0.7018399999999999
478,-0.70428
479,-0.6753899999999999
480,-0.64759
481,-0.64026
482,-0.63179
483,-0.6065699999999999
484,-0.58243
485,-0.57143
486,-0.5594899999999999
487,-0.53794
488,-0.5150899999999999
489,-0.4807
490,-0.44631000000000004
491,-0.41192
492,-0.3755
493,-0.32506
494,-0.27207
495,-0.20329
496,-0.13263
497,-0.27084
498,0.14439000000000002
499,0.1242
500,0.21259
501,0.28137
502,0.35015
503,0.41893
504,0.48668
505,0.55042
506,0.60715
507,0.6383300000000001
508,0.6624
509,0.6624
510,0.6624
511,0.6624
512,0.67099
513,0.70492
514,0.74751
515,0.81399
516,0.88955
517,0.98859
518,1.0806
519,1.1553
520,1.2201
521,1.2623
522,1.2942
523,1.3038
524,1.3028
525,1.2798
526,1.253
527,1.2186
528,1.1842
529,1.1498
530,1.1154
531,1.081
532,1.0466
533,1.0123
534,0.9832700000000001
535,0.9626299999999999
536,0.95036
537,0.95036
538,0.95036
539,0.95036
540,0.95391
541,0.96216
542,0.97915
543,1.0071
544,1.0223
545,1.0223
546,1.0223
547,1.0223
548,1.0228
549,1.0237
550,1.0411
551,1.0755
552,1.1099
553,1.1443
554,1.1623
555,1.165
556,1.1822
557,1.212
558,1.2443
559,1.2787
560,1.3276
561,1.3881
562,1.4395
563,1.484
564,1.5226
565,1.557
566,1.5791
567,1.5929
568,1.6097
569,1.6285
570,1.6569
571,1.6913
572,1.7066
573,1.7107
574,1.69
575,1.6556
576,1.6287
577,1.6058
578,1.5983
579,1.5983
580,1.5983
581,1.5983
582,1.6024
583,1.6084
584,1.6345
585,1.6689
586,1.7016
587,1.7337
588,1.7416
589,1.7406
590,1.689
591,1.6203
592,1.4763
593,1.3084
594,1.1374
595,0.96549
596,0.7935399999999999
597,0.6216
598,0.47158999999999995
599,0.32715
600,0.22989
601,0.14369
602,0.34565
603,-0.077448
604,-0.066329
605,-0.080085
606,-0.16508
607,0.30873
608,0.059069
609,0.059069
610,0.059069
611,0.059069
612,0.059069
613,0.059069
614,-0.096291
615,-0.062817
616,-0.22521999999999998
617,-0.39716
618,-0.11112999999999999
619,-0.14552
620,-0.1799
621,-0.21429
622,-0.23824
623,-0.26161999999999996
624,-0.23295
625,-0.20223
626,-0.19967000000000001
627,-0.19783
628,-0.16385999999999998
629,-0.12947
630,1.1066
631,1.1066
632,1.1066
633,1.1066
634,1.1066
635,1.1066
636,1.1066
637,1.1066
638,1.1066
639,1.1066
640,1.1066
641,1.1066
642,1.1066
643,1.1066
644,1.1066
645,1.1066
646,1.1066
647,1.1066
648,1.1066
649,1.1066
650,1.1066
651,1.1066
652,1.1049
653,1.0929
654,1.0783
655,1.0492
656,1.0231
657,1.0118
658,1.0077
659,1.0368
660,1.0648
661,1.088
662,1.1066
663,1.1066
664,1.1066
665,1.1066
666,1.1066
667,1.1066
668,1.1066
669,1.1066
670,1.0921
671,1.0347
672,0.97708
673,0.91891
674,0.8536100000000001
675,0.76984
676,0.68506
677,0.5978100000000001
678,0.51739
679,0.45261999999999997
680,0.38332
681,0.30421
682,0.2288
683,0.16093
684,0.43793999999999994
685,0.057892
686,-0.34208
687,-0.15298
688,-0.24564
689,-0.34763
690,-0.45507
691,-0.5714100000000001
692,-0.67862
693,-0.7717
694,-0.8506299999999999
695,-0.9088
696,-0.9669700000000001
697,-1.0251
698,-1.0803
699,-1.1315
700,-1.1729
701,-1.202
702,-1.2311
703,-1.2602
704,-1.2892
705,-1.3183
706,-1.3474
707,-1.3765
708,-1.4056
709,-1.4347
710,-1.4494
711,-1.4502
712,-1.4506
713,-1.4506
714,-1.4506
715,-1.4506
716,-1.4506
717,-1.4506
718,-1.4506
719,-1.4506
720,-1.4506
721,-1.4506
722,-1.4395
723,-1.4205
724,-1.4059
725,-1.3942
726,-1.3704
727,-1.3386
728,-1.2993
729,-1.2555
730,-1.2209999999999999
731,-1.1919
732,-1.1556
733,-1.1152
734,-1.0631
735,-1.005
736,-0.94681
737,-0.88864
738,-0.8349700000000001
739,-0.7833899999999999
740,-0.7509899999999999
741,-0.7269399999999999
742,-0.7174699999999999
743,-0.7139800000000001
744,-0.69202
745,-0.66294
746,-0.63357
747,-0.60409
748,-0.55319
749,-0.49501999999999996
750,-0.47926
751,-0.47693
752,-0.4764
753,-0.4764
754,-0.4764
755,-0.4764
756,-0.4764
757,-0.4764
758,-0.45881000000000005
759,-0.43709
760,-0.40931
761,-0.38023
762,-0.33559
763,-0.28789000000000003
764,-0.23131
765,-0.17314000000000002
766,-0.12832000000000002
767,-0.44181000000000004
768,-0.34876
769,-0.27314
770,-0.3195
771,-0.38155
772,-0.11077000000000001
773,-0.15070999999999998
774,-0.20726999999999998
775,-0.26544
776,-0.31644
777,-0.36685999999999996
778,-0.39729000000000003
779,-0.42638000000000004
780,-0.45546000000000003
781,-0.48455
782,-0.51363
783,-0.54272
784,-0.5718
785,-0.6008899999999999
786,-0.62997
787,-0.6590600000000001
788,-0.71723
789,-0.77505
790,-0.80569
791,-0.8362799999999999
792,-0.8653700000000001
793,-0.89538
794,-0.9489
795,-1.0015
796,-1.0368
797,-1.073
798,-1.1234
799,-1.1729
800,-1.2113
801,-1.2505
802,-1.2978
803,-1.3429
804,-1.3677
805,-1.3914
806,-1.4065
807,-1.4217
808,-1.4372
809,-1.4472
810,-1.4232
811,-1.3908
812,-1.3116
813,-1.2279
814,-1.1205
815,-1.014
816,-0.91201
817,-0.80066
818,-0.64942
819,-0.4926
820,-0.31383
821,-0.13146
822,0.30648000000000003
823,0.24141999999999997
824,0.35775999999999997
825,0.4741
826,0.59044
827,0.6995100000000001
828,0.7871600000000001
829,0.8674799999999999
830,0.9275899999999999
831,0.99429
832,1.0781
833,1.1558
834,1.219
835,1.2739
836,1.3096
837,1.3498
838,1.3998
839,1.4525
840,1.5107
841,1.5689
842,1.6269999999999998
843,1.6794
844,1.7213
845,1.7531
846,1.7674
847,1.7813
848,1.7945
849,1.8048
850,1.8106
851,1.8023
852,1.7732
853,1.7477
854,1.7272
855,1.7155
856,1.7155
857,1.7155
858,1.7155
859,1.7155
860,1.7155
861,1.7144
862,1.712
863,1.6968
864,1.6678
865,1.6387
866,1.6096
867,1.5662
868,1.5088
869,1.4509999999999998
870,1.3928
871,1.348
872,1.3151
873,1.2713
874,1.2186
875,1.1628
876,1.1047
877,1.0348
878,0.95606
879,0.8723700000000001
880,0.7851199999999999
881,0.69786
882,0.61061
883,0.51369
884,0.41053
885,0.317
886,0.22935999999999998
887,0.16037
888,0.49751000000000006
889,0.17035
890,-0.17673
891,-0.10743
892,-0.18499000000000002
893,-0.24954
894,-0.30771
895,-0.35686999999999997
896,-0.40185
897,-0.41903
898,-0.42407
899,-0.44615
900,-0.47523999999999994
901,-0.50432
902,-0.53341
903,-0.56193
904,-0.59023
905,-0.57568
906,-0.5466
907,-0.53872
908,-0.53755
909,-0.55765
910,-0.58402
911,-0.61252
912,-0.64161
913,-0.67069
914,-0.6997800000000001
915,-0.71127
916,-0.71864
917,-0.68676
918,-0.6464300000000001
919,-0.59119
920,-0.5330199999999999
921,-0.50379
922,-0.47975
923,-0.4497
924,-0.41867
925,-0.38833
926,-0.35808
927,-0.34364
928,-0.33123
929,-0.31359000000000004
930,-0.29536
931,-0.2683
932,-0.24038
933,-0.1648
934,-0.43996999999999997
935,-0.14237
936,0.14849
937,0.46143
938,0.1578
939,0.23815999999999998
940,0.31921
941,0.35113
942,0.38176
943,0.43958
944,0.49776000000000004
