time,value
0,-1.9344
1,-1.9072
2,-1.9289
3,-1.8638
4,-1.7932
5,-1.7280000000000002
6,-1.5759
7,-1.4618
8,-1.1631
9,-0.79379
10,-0.65801
11,-0.1692
12,0.08064299999999999
13,0.22186
14,0.35764
15,0.49341999999999997
16,0.60205
17,0.6129100000000001
18,0.68895
19,0.6237699999999999
20,0.71067
21,0.84645
22,1.1235
23,1.1669
24,1.3244
25,1.4493
26,1.5688
27,1.6937
28,1.7480000000000002
29,1.7915
30,1.7643
31,1.8349
32,1.9707
33,2.15
34,2.188
35,2.0685
36,2.0142
37,1.9762
38,1.8132
39,1.5634
40,1.5091
41,1.4276
42,1.2701
43,1.2375
44,1.1995
45,1.1669
46,1.1343
47,1.0963
48,1.0637
49,1.0257
50,1.0094
51,1.0909
52,1.1452
53,1.5688
54,1.6883
55,1.9544
56,1.9599
57,2.0576
58,2.1337
59,2.0957
60,2.0739
61,1.9653
62,1.8675
63,1.7969
64,1.7263
65,1.6611
66,1.5471
67,1.3135
68,1.0148
69,0.46626000000000006
70,0.10237
71,-0.17463
72,-0.21808000000000002
73,-0.26153000000000004
74,-0.30498000000000003
75,-0.35386
76,-0.36472
77,-0.55482
78,-0.9404399999999999
79,-1.0871
80,-1.2555
81,-1.288
82,-1.3261
83,-1.3586
84,-1.3586
85,-1.3043
86,-1.2392
87,-1.0599
88,-0.70689
89,-0.52766
90,-0.31584
91,-0.20178
92,-0.093159
93,0.015466999999999998
94,0.14039000000000001
95,0.27074000000000004
96,0.41195
97,0.5423
98,0.67265
99,0.8084399999999999
100,0.93879
101,1.0691
102,1.1995
103,1.3353
104,1.3516
105,1.1452
106,1.1452
107,0.81387
108,0.8790399999999999
109,0.73783
110,0.83016
111,0.43368
112,0.35764
113,0.26531
114,0.11865999999999999
115,-0.34299999999999997
116,-0.59827
117,-0.73405
118,-0.87526
119,-1.011
120,-1.1523
121,-1.288
122,-1.4293
123,-1.565
124,-1.4781
125,-1.4184
126,-1.3315
127,-1.3043
128,-1.2772
129,-1.25
130,-1.2011
131,-1.136
132,-1.0817
133,-1.0165
134,-1.0273
135,-0.7177600000000001
136,-0.5656800000000001
137,-0.16377
138,0.031761000000000005
139,0.053486
140,0.031761000000000005
141,0.21641999999999997
142,0.40109
143,0.58575
144,0.77042
145,0.9550799999999999
146,1.1397
147,1.3244
148,1.5036
149,1.6014
150,1.71
151,1.5959999999999999
152,1.3298
153,1.1017
154,0.9605100000000001
155,0.5966199999999999
156,0.35220999999999997
157,0.23815
158,0.12409
159,0.010036
160,-0.087727
161,-0.43533
162,-0.6037
163,-0.66888
164,-0.88613
165,-1.1957
166,-1.3043
167,-1.3369
168,-1.3043
169,-1.3043
170,-1.3098
171,-1.2609
172,-1.212
173,-0.83725
174,-0.67974
175,-0.26153000000000004
176,-0.14747000000000002
177,-0.093159
178,-0.038846
179,0.015466999999999998
180,0.2816
181,0.32505
182,0.5260100000000001
183,0.5966199999999999
184,0.66179
185,0.7324
186,0.58575
187,0.4554
188,0.31961999999999996
189,0.21099
190,0.21641999999999997
191,0.11323
192,0.010036
193,-0.09859
194,-0.20178
195,-0.53852
196,-0.6199899999999999
197,-0.64715
198,-0.67974
199,-0.70689
200,-0.79379
201,-0.81552
202,-0.92415
203,-1.212
204,-1.3261
205,-1.4184
206,-1.4184
207,-1.4238
208,-1.4293
209,-1.3369
210,-1.2555
211,-1.2663
212,-1.25
213,-1.2283
214,-1.212
215,-1.1523
216,-0.9676
217,-0.78293
218,-0.59827
219,-0.41903999999999997
220,-0.23437
221,0.031761000000000005
222,0.10237
223,0.24900999999999998
224,0.59118
225,0.79214
226,0.9605100000000001
227,1.1235
228,1.2864
229,1.357
230,1.4656
231,1.4819
232,1.4222
233,1.2104
234,1.0257
235,0.9605100000000001
236,0.8790399999999999
237,0.8410200000000001
238,0.77042
239,0.6292
240,0.49341999999999997
241,0.36307
242,0.22729000000000002
243,0.09693600000000001
244,-0.038846
245,-0.09859
246,-0.11488
247,-0.18549000000000002
248,-0.2561
249,-0.3267
250,-0.4299
251,-0.7449100000000001
252,-0.79923
253,-0.79923
254,-0.91328
255,-0.89156
256,-1.0871
257,-1.1468
258,-1.1794
259,-1.1305
260,-1.0762
261,-1.0219
262,-0.9513
263,-0.79923
264,-0.79923
265,-0.36472
266,-0.23437
267,-0.19635
268,-0.17463
269,-0.049707999999999995
270,0.058917
271,0.25988
272,0.40652
273,0.66722
274,0.7161
275,0.76498
276,0.81387
277,0.86275
278,0.9116299999999999
279,0.9550799999999999
280,0.9985299999999999
281,1.1072
282,1.1886
283,1.1995
284,1.2158
285,1.2266
286,1.1886
287,1.1506
288,1.1126
289,1.0583
290,1.0691
291,1.1179999999999999
292,1.2049
293,1.2375
294,1.1343
295,1.0691
296,0.98767
297,0.93879
298,0.8899
299,0.84645
300,0.86275
301,0.75412
302,0.68352
303,0.54773
304,0.21099
305,0.042624
306,-0.09859
307,-0.20178
308,-0.15833
309,-0.2561
310,-0.39188
311,-0.6362899999999999
312,-0.7449100000000001
313,-0.7883600000000001
314,-0.83725
315,-0.88613
316,-0.92958
317,-0.97846
318,-1.0219
319,-1.0708
320,-1.1142
321,-1.1631
322,-1.1740000000000002
323,-1.0925
324,-1.1034
325,-1.212
326,-1.3043
327,-1.3424
328,-1.3098
329,-1.3261
330,-1.3478
331,-1.3641
332,-1.3424
333,-1.3532
334,-1.25
335,-1.2011
336,-0.9893200000000001
337,-1.0056
338,-0.9676
339,-1.0056
340,-0.97303
341,-0.92958
342,-0.89156
343,-0.84811
344,-0.8263799999999999
345,-0.84811
346,-0.81552
347,-0.76121
348,-0.64715
349,-0.6743100000000001
350,-0.72319
351,-0.76121
352,-0.80466
353,-0.84811
354,-0.67974
355,-0.75578
356,-0.75034
357,-0.76664
358,-0.81009
359,-0.59827
360,-0.43533
361,-0.4299
362,-0.41903999999999997
363,-0.40817
364,-0.40274
365,-0.39188
366,-0.38101999999999997
367,-0.37559000000000003
368,-0.41903999999999997
369,-0.39731
370,-0.40274
371,-0.4136
372,-0.36472
373,-0.36472
374,-0.28869
375,-0.2398
376,-0.1529
377,-0.19635
378,-0.15833
379,-0.19092
380,-0.21265
381,-0.19092
382,-0.16377
383,-0.14204
384,0.053486
385,0.064349
386,-0.038846
387,-0.10945
388,-0.2398
389,-0.29412
390,-0.29412
391,-0.29412
392,-0.28869
393,-0.48963999999999996
394,-0.52766
395,-0.5765399999999999
396,-0.70689
397,-0.89156
398,-0.93501
399,-0.97846
400,-1.0165
401,-1.0599
402,-1.1197
403,-1.3152
404,-1.3532
405,-1.3152
406,-1.3478
407,-1.4075
408,-1.4673
409,-1.5596
410,-1.5868
411,-1.6628
412,-1.8312
413,-1.8149
414,-1.8149
415,-1.7877
416,-1.6682
417,-1.4075
418,-1.1142
419,-0.97303
420,-0.8263799999999999
421,-0.68517
422,-0.52223
423,-0.40817
424,-0.39188
425,-0.4299
426,-0.47878000000000004
427,-0.61456
428,-0.96216
429,-1.0654
430,-1.1740000000000002
431,-1.2826
432,-1.4944
433,-1.7986
434,-1.8963
435,-1.9126
436,-1.9235
437,-1.9344
438,-1.9289
439,-1.9018
440,-1.8257
441,-1.6465
442,-1.6356
443,-1.5922
444,-1.5433
445,-1.4944
446,-1.6031
447,-1.2826
448,-1.0599
449,-0.93501
450,-0.85354
451,-0.56025
452,-0.40817
453,-0.38101999999999997
454,-0.26153000000000004
455,-0.18549000000000002
456,0.14582
457,0.17840999999999999
458,0.1078
459,0.026330000000000003
460,0.064349
461,0.13496
462,0.2816
463,0.28703
464,0.16754000000000002
465,0.10237
466,0.058917
467,0.042624
468,0.026330000000000003
469,0.0046045
470,0.09150499999999999
471,0.06978
472,0.010036
473,-0.022552000000000003
474,-0.12575
475,-0.1529
476,-0.2561
477,-0.46792
478,-0.58741
479,-0.66888
480,-0.76121
481,-0.8589700000000001
482,-0.9513
483,-1.0871
484,-1.3749
485,-1.4509999999999998
486,-1.4509999999999998
487,-1.4509999999999998
488,-1.4509999999999998
489,-1.4293
490,-1.4564
491,-1.4075
492,-1.3532
493,-1.2772
494,-1.3586
495,-1.5487
496,-1.5759
497,-1.565
498,-1.5922
499,-1.6194
500,-1.6411
501,-1.8638
502,-1.9398
503,-2.0158
504,-2.1245
505,-2.0539
506,-1.7388
507,-1.4836
508,-1.288
509,-0.8644
510,-0.6634399999999999
511,-0.58741
512,-0.51137
513,-0.43533
514,-0.37015
515,-0.41903999999999997
516,-0.11488
517,-0.038846
518,0.17840999999999999
519,0.23271999999999998
520,0.32505
521,0.44454
522,0.42281
523,0.5966199999999999
524,0.8518899999999999
525,0.9442200000000001
526,1.042
527,1.1343
528,1.2321
529,1.3244
530,1.4222
531,1.5851
532,1.6014
533,1.6123
534,1.6286
535,1.5905
536,1.6177
537,1.5797
538,1.6774
539,1.6177
540,1.5851
541,1.6231
542,1.3787
543,1.3896
544,1.4982
545,1.5254
546,1.5471
547,1.5688
548,1.4928
549,1.1941
550,1.1289
551,1.1179999999999999
552,1.0583
553,0.9985299999999999
554,0.91706
555,0.8518899999999999
556,0.81387
557,0.81387
558,0.79214
559,0.69981
560,0.65093
561,0.68895
562,0.68895
563,0.69438
564,0.69438
565,0.69981
566,0.68895
567,0.68895
568,0.63463
569,0.59118
570,0.58575
571,0.60748
572,0.5586
573,0.5260100000000001
574,0.5260100000000001
575,0.5260100000000001
576,0.5260100000000001
577,0.53687
578,0.53687
579,0.56403
580,0.59118
581,0.6237699999999999
582,0.61834
583,0.64007
584,0.64007
585,0.67808
586,0.65636
587,0.67265
588,0.68352
589,0.66722
590,0.66179
591,0.7161
592,0.8193
593,0.82473
594,0.83016
595,0.8518899999999999
596,0.8953399999999999
597,0.94965
598,1.042
599,1.1615
600,1.1832
601,1.3081
602,1.3624
603,1.4439
604,1.5905
605,1.672
606,1.7535
607,1.7861
608,1.8132
609,1.8458
610,1.8838
611,1.9436
612,1.9979
613,2.0685
614,2.0794
615,2.1608
616,2.1988
617,1.7480000000000002
618,1.7209
619,1.7263
620,1.6883
621,1.6557
622,1.6231
623,1.7643
624,1.6231
625,1.6829
626,1.8024
627,1.7861
628,1.7752
629,1.7426
630,1.7426
631,1.6992
632,1.6557
633,1.5145
634,1.6883
635,1.6774
636,1.6449
637,1.6123
638,1.5797
639,1.6340000000000001
640,1.5742
641,1.5036
642,1.357
643,1.156
644,0.72153
645,0.4554
646,0.20013
647,0.0046045
648,-0.011689
649,-0.00082676
650,0.015466999999999998
651,0.031761000000000005
652,-0.0062581
653,0.09693600000000001
654,-0.09859
655,-0.25067
656,-0.44076000000000004
657,-0.5928399999999999
658,-0.6634399999999999
659,-0.7883600000000001
660,-0.91328
661,-1.0382
662,-1.1631
663,-1.288
664,-1.4184
665,-1.4618
666,-1.4781
667,-1.5325
668,-1.7877
669,-1.7008
670,-2.1082
671,-2.2331
672,-2.3417
673,-2.4558
674,-2.5644
675,-2.5535
676,-2.4178
677,-2.2114
678,-2.0539
679,-1.6248
680,-1.4999
681,-1.3641
682,-1.0925
683,-0.9513
684,-0.81009
685,-0.6906
686,-0.57111
687,-0.44619
688,-0.066002
689,0.40652
690,0.68352
691,0.69438
692,0.69981
693,0.71067
694,0.67808
695,0.73783
696,0.72697
697,0.71067
698,0.66722
699,0.64007
700,0.5966199999999999
701,0.21099
702,0.21641999999999997
703,0.18384
704,0.14582
705,0.11323
706,-0.049707999999999995
707,-0.23437
708,-0.27781999999999996
709,-0.32127
710,-0.36472
711,-0.35929
712,-0.45706
713,-0.65258
714,-0.7286199999999999
715,-0.76121
716,-0.76664
717,-0.88613
718,-0.8426799999999999
719,-0.79923
720,-0.79923
721,-0.80466
722,-0.81009
723,-0.81009
724,-0.81552
725,-0.8263799999999999
726,-0.79923
727,-0.7775
728,-0.75578
729,-0.73948
730,-0.6634399999999999
731,-0.62543
732,-0.65801
733,-0.6199899999999999
734,-0.61456
735,-0.58741
736,-0.5656800000000001
737,-0.48421000000000003
738,-0.36472
739,-0.34843
740,-0.08229600000000001
741,-0.076865
742,-0.033414
743,-0.0062581
744,0.031761000000000005
745,0.27616999999999997
746,0.3685
747,0.33048
748,0.35764
749,0.33591
750,0.34678000000000003
751,0.35764
752,0.37393000000000004
753,0.39023
754,0.40109
755,0.41738000000000003
756,0.35764
757,0.40652
758,0.3685
759,0.43368
760,0.43911000000000006
761,0.44454
762,0.38479
763,0.38479
764,0.40652
765,0.39566
766,0.39023
767,0.37936
768,0.33048
769,0.30876
770,0.35764
771,0.42281
772,0.3685
773,0.33591
774,0.26531
775,0.36307
776,0.32505
777,0.35764
778,0.33591
779,0.2816
780,0.27074000000000004
781,0.22186
782,0.22186
783,0.22186
784,0.20556
785,0.22186
786,0.24358000000000002
787,0.21099
788,0.24358000000000002
789,0.23271999999999998
790,0.23815
791,0.22729000000000002
792,0.23271999999999998
793,0.21641999999999997
794,0.23271999999999998
795,0.20556
796,0.21099
797,0.21099
798,0.21099
799,0.21641999999999997
800,0.21641999999999997
801,0.23271999999999998
802,0.24358000000000002
803,0.22186
804,0.23815
805,0.1947
806,0.20556
807,0.22186
808,0.21641999999999997
809,0.18384
810,0.17840999999999999
811,0.18927
812,0.18927
813,0.18384
814,0.18384
815,0.18384
816,0.20556
817,0.17840999999999999
818,0.18927
819,0.18384
820,0.17840999999999999
821,0.21641999999999997
822,0.23815
823,0.26531
824,0.30876
825,0.31419
826,0.28703
827,0.24358000000000002
828,0.21641999999999997
829,0.17297
830,0.15125
831,0.1947
832,0.21099
833,0.18384
834,0.15667999999999999
835,0.15667999999999999
836,0.24900999999999998
837,0.24900999999999998
838,0.20556
839,0.21099
840,0.12409
841,0.15667999999999999
842,0.12952
843,0.15125
844,0.17297
845,0.20013
846,0.17297
847,0.17840999999999999
848,0.15667999999999999
849,0.16211
850,0.16754000000000002
851,0.15125
852,0.16211
853,0.14039000000000001
854,0.13496
855,0.18384
856,0.14582
857,0.16211
858,0.17297
859,0.14582
860,0.13496
861,0.11865999999999999
862,0.10237
863,0.12952
864,0.18927
865,0.14039000000000001
866,0.15667999999999999
867,0.12952
868,0.16754000000000002
869,0.16754000000000002
870,0.14582
871,0.15125
872,0.14582
873,0.14039000000000001
874,0.12952
875,0.18927
876,0.11865999999999999
877,0.15125
878,0.17297
879,0.13496
880,0.16754000000000002
881,0.12952
882,0.12952
883,0.11865999999999999
884,0.09150499999999999
885,0.09150499999999999
886,0.09150499999999999
887,0.09150499999999999
888,0.064349
889,0.075211
890,0.048055
891,0.09693600000000001
892,-0.00082676
893,0.042624
894,-0.00082676
895,-0.017121
896,-0.017121
897,0.0046045
898,-0.00082676
899,-0.0062581
