time,value
0,-0.31954
1,0.85662
2,2.2441
3,3.5058
4,4.3161
5,4.4745
6,3.9745
7,3.0009
8,1.8561
9,0.85
10,0.19587000000000002
11,-0.046252
12,0.036686
13,0.2712
14,0.47978000000000004
15,0.5502600000000001
16,0.46393999999999996
17,0.27976999999999996
18,0.088453
19,-0.036498
20,-0.069388
21,-0.033718
22,0.020464
23,0.047593
24,0.029064999999999997
25,-0.022972
26,-0.07862999999999999
27,-0.11072
28,-0.11001
29,-0.088895
30,-0.07222
31,-0.08231799999999999
32,-0.12653
33,-0.19411
34,-0.26269000000000003
35,-0.31024
36,-0.32548
37,-0.31195
38,-0.28472
39,-0.26188
40,-0.25595
41,-0.26898
42,-0.29349000000000003
43,-0.31747
44,-0.33084
45,-0.32913000000000003
46,-0.31529
47,-0.2971
48,-0.28549
49,-0.28299
50,-0.29029
51,-0.30593000000000004
52,-0.32532
53,-0.34115999999999996
54,-0.34624
55,-0.33841
56,-0.32028
57,-0.29878000000000005
58,-0.2812
59,-0.27491
60,-0.28378000000000003
61,-0.30715
62,-0.33874
63,-0.3704
64,-0.39493
65,-0.40851
66,-0.41146000000000005
67,-0.40804
68,-0.40495
69,-0.40815
70,-0.42031999999999997
71,-0.43928999999999996
72,-0.46011
73,-0.47683000000000003
74,-0.48544
75,-0.48439
76,-0.47635
77,-0.46663000000000004
78,-0.4609
79,-0.46252
80,-0.47148999999999996
81,-0.48505
82,-0.49896
83,-0.50939
84,-0.51399
85,-0.51336
86,-0.51021
87,-0.50827
88,-0.5100399999999999
89,-0.51664
90,-0.52722
91,-0.53952
92,-0.55033
93,-0.55688
94,-0.55782
95,-0.55337
96,-0.54491
97,-0.53422
98,-0.52322
