time,value
0,-0.76202
1,-0.76202
2,-0.76202
3,-0.76202
4,-0.76202
5,-0.76202
6,-0.76202
7,-0.76202
8,-0.76202
9,-0.76202
10,-0.76202
11,-0.76202
12,-0.76202
13,-0.76202
14,-0.76202
15,-0.76202
16,-0.76202
17,-0.76202
18,-0.76202
19,-0.76202
20,-0.76202
21,-0.76202
22,-0.76202
23,-0.76202
24,-0.76202
25,-0.76202
26,-0.76202
27,-0.76202
28,-0.76202
29,-0.76202
30,-0.76202
31,-0.76202
32,-0.76202
33,-0.76202
34,-0.76202
35,-0.76202
36,-0.76202
37,-0.76202
38,-0.76202
39,-0.76202
40,-0.76202
41,-0.76202
42,-0.76202
43,-0.76202
44,-0.76202
45,-0.76202
46,-0.76202
47,-0.76202
48,-0.76202
49,-0.76202
50,-0.76202
51,-0.76202
52,-0.76202
53,-0.76202
54,-0.76202
55,-0.76202
56,-0.76202
57,-0.76202
58,-0.76202
59,-0.76202
60,-0.76202
61,-0.76202
62,-0.76202
63,-0.76202
64,-0.76202
65,-0.76202
66,-0.76202
67,-0.76202
68,-0.76202
69,-0.76202
70,-0.76202
71,-0.76202
72,-0.76202
73,-0.76202
74,-0.76202
75,-0.76202
76,-0.76202
77,-0.76202
78,-0.76202
79,-0.76202
80,-0.76202
81,-0.76202
82,-0.76202
83,-0.76202
84,-0.76202
85,-0.76202
86,-0.76202
87,-0.76202
88,-0.76202
89,-0.76202
90,-0.76202
91,-0.76202
92,-0.76202
93,-0.76202
94,-0.76202
95,-0.76202
96,-0.76202
97,-0.76202
98,-0.76202
99,-0.76202
100,-0.76202
101,-0.76202
102,-0.76202
103,-0.76202
104,-0.76202
105,-0.76202
106,-0.76202
107,-0.76202
108,-0.76202
109,-0.76202
110,-0.76202
111,-0.76202
112,-0.76202
113,-0.76202
114,-0.76202
115,-0.76202
116,-0.76202
117,-0.76202
118,-0.76202
119,-0.76202
120,-0.76202
121,-0.76202
122,-0.76202
123,-0.76202
124,-0.76202
125,-0.76202
126,-0.76202
127,-0.76202
128,-0.76202
129,-0.76202
130,-0.76202
131,-0.76202
132,-0.76202
133,-0.76202
134,-0.76202
135,-0.76202
136,-0.76202
137,-0.76202
138,-0.76202
139,-0.76202
140,-0.76202
141,-0.76202
142,-0.76202
143,-0.76202
144,-0.76202
145,-0.76202
146,-0.76202
147,-0.76202
148,-0.76202
149,-0.76202
150,-0.76202
151,-0.76202
152,-0.76202
153,-0.76202
154,-0.76202
155,-0.76202
156,-0.76202
157,-0.76202
158,-0.76202
159,-0.76202
160,-0.76202
161,-0.76202
162,-0.76202
163,-0.76202
164,-0.76202
165,-0.76202
166,-0.76202
167,-0.76202
168,-0.76202
169,-0.76202
170,-0.76202
171,-0.76202
172,-0.76202
173,-0.76202
174,-0.76202
175,-0.76202
176,-0.76202
177,-0.76202
178,-0.76202
179,-0.76202
180,-0.76202
181,-0.76202
182,-0.76202
183,-0.76202
184,-0.76202
185,-0.76202
186,-0.76202
187,-0.76202
188,-0.76202
189,-0.76202
190,-0.76202
191,-0.76202
192,-0.76202
193,-0.76202
194,-0.76202
195,-0.76202
196,-0.76202
197,-0.76202
198,-0.76202
199,-0.76202
200,-0.76202
201,-0.76202
202,-0.76202
203,-0.76202
204,-0.76202
205,-0.76202
206,-0.76202
207,-0.76202
208,-0.76202
209,-0.76202
210,-0.76202
211,-0.76202
212,-0.76202
213,-0.76202
214,-0.76202
215,-0.76202
216,-0.76202
217,-0.76202
218,-0.76202
219,-0.76202
220,-0.76202
221,-0.76202
222,-0.76202
223,-0.76202
224,-0.76202
225,-0.76202
226,-0.76202
227,-0.76202
228,-0.76202
229,-0.76202
230,-0.76202
231,-0.76202
232,-0.76202
233,-0.76202
234,-0.76202
235,-0.76202
236,-0.76202
237,-0.76202
238,-0.76202
239,-0.76202
240,-0.76202
241,-0.76202
242,-0.76202
243,-0.76202
244,-0.76202
245,-0.76202
246,-0.76202
247,-0.76202
248,-0.76202
249,-0.76202
250,-0.76202
251,-0.76202
252,-0.76202
253,-0.76202
254,-0.76202
255,-0.76202
256,-0.76202
257,-0.76202
258,-0.76202
259,-0.76202
260,-0.76202
261,-0.76202
262,-0.76202
263,-0.76202
264,-0.76202
265,-0.76202
266,-0.76202
267,-0.76202
268,-0.76202
269,-0.76202
270,-0.76202
271,-0.76202
272,-0.76202
273,-0.76202
274,-0.76202
275,-0.76202
276,-0.76202
277,-0.76202
278,-0.76202
279,-0.76202
280,-0.76202
281,-0.76202
282,-0.76202
283,-0.76202
284,-0.76202
285,-0.76202
286,-0.76202
287,-0.76202
288,-0.76202
289,-0.76202
290,-0.76202
291,-0.76202
292,-0.76202
293,-0.76202
294,-0.76202
295,-0.76202
296,-0.76202
297,-0.76202
298,-0.76202
299,-0.76202
300,-0.76202
301,-0.76202
302,-0.76202
303,-0.76202
304,-0.76202
305,-0.76202
306,-0.76202
307,-0.76202
308,-0.76202
309,-0.76202
310,-0.76202
311,-0.76202
312,-0.76202
313,-0.76202
314,-0.76202
315,-0.76202
316,-0.76202
317,-0.76202
318,-0.76202
319,-0.76202
320,-0.76202
321,-0.76202
322,-0.76202
323,-0.76202
324,-0.76202
325,-0.76202
326,-0.76202
327,-0.76202
328,-0.76202
329,-0.76202
330,-0.76202
331,-0.76202
332,-0.76202
333,-0.76202
334,-0.76202
335,-0.76202
336,-0.76202
337,-0.76202
338,-0.76202
339,-0.76202
340,-0.76202
341,-0.76202
342,-0.76202
343,-0.76202
344,-0.76202
345,-0.76202
346,-0.76202
347,-0.68025
348,-0.76202
349,-0.76202
350,-0.76202
351,-0.76202
352,-0.76202
353,-0.76202
354,-0.76202
355,-0.76202
356,-0.76202
357,-0.76202
358,-0.27142
359,1.5274
360,1.5274
361,1.2004
362,1.2004
363,1.5274
364,1.2004
365,1.2004
366,1.2004
367,1.8545
368,1.5274
369,1.8545
370,1.2004
371,1.8545
372,1.5274
373,1.5274
374,1.2004
375,1.2004
376,1.2004
377,1.2004
378,1.2004
379,1.2004
380,1.5274
381,1.2004
382,0.9550799999999999
383,1.2004
384,1.2004
385,1.2004
386,1.2004
387,1.2004
388,1.2004
389,2.1816
390,1.5274
391,1.2004
392,1.2004
393,1.2004
394,1.2004
395,1.2004
396,1.2004
397,1.2004
398,1.2004
399,1.2004
400,1.2004
401,1.2004
402,1.2004
403,1.2004
404,1.2004
405,1.2004
406,1.2004
407,1.2004
408,1.2004
409,1.2004
410,1.2004
411,1.2004
412,1.2004
413,1.2004
414,1.2004
415,0.9550799999999999
416,1.2004
417,1.2004
418,1.2004
419,1.2004
420,1.2004
421,1.2004
422,1.2004
423,1.2004
424,1.2004
425,1.2004
426,1.2004
427,1.2004
428,1.2004
429,1.2004
430,1.2004
431,0.9550799999999999
432,1.2004
433,1.2004
434,1.2004
435,1.2004
436,1.2004
437,1.2004
438,1.2004
439,1.2004
440,1.2004
441,1.2004
442,1.2004
443,1.2004
444,1.2004
445,1.2004
446,1.2004
447,1.2004
448,1.2004
449,1.2004
450,1.2004
451,1.2004
452,1.2004
453,0.9550799999999999
454,1.2004
455,1.2004
456,1.2004
457,1.2004
458,1.2004
459,1.2004
460,1.2004
461,1.2004
462,1.2004
463,1.2004
464,1.2004
465,1.2004
466,1.2004
467,1.2004
468,1.2004
469,1.2004
470,1.2004
471,1.2004
472,1.2004
473,1.2004
474,1.2004
475,1.2004
476,1.2004
477,1.2004
478,1.2004
479,1.2004
480,1.2004
481,1.2004
482,1.2004
483,1.2004
484,1.2004
485,1.2004
486,1.2004
487,1.2004
488,1.2004
489,1.2004
490,1.2004
491,1.2004
492,1.2004
493,0.9550799999999999
494,1.2004
495,1.2004
496,1.2004
497,1.2004
498,1.2004
499,1.2004
500,1.2004
501,1.2004
502,1.2004
503,1.2004
504,1.2004
505,1.2004
506,1.2004
507,1.2004
508,1.2004
509,1.2004
510,1.2004
511,1.2004
512,1.2004
513,1.2004
514,1.2004
515,1.2004
516,1.2004
517,1.2004
518,1.2004
519,1.2004
520,1.2004
521,1.2004
522,1.2004
523,1.2004
524,1.5274
525,1.2004
526,1.2004
527,1.2004
528,1.2004
529,1.2004
530,1.2004
531,1.2004
532,1.2004
533,1.5274
534,1.2004
535,1.2004
536,1.2004
537,1.2004
538,1.2004
539,1.2004
540,1.2004
541,1.2004
542,1.2004
543,1.2004
544,1.2004
545,1.2004
546,1.5274
547,1.5274
548,1.5274
549,1.5274
550,1.5274
551,1.2004
552,1.5274
553,1.5274
554,1.5274
555,1.2004
556,1.5274
557,1.2004
558,1.5274
559,1.2004
560,1.5274
561,1.2004
562,1.2004
563,1.5274
564,1.2004
565,1.5274
566,1.2004
567,1.5274
568,1.2004
569,1.5274
570,1.2004
571,1.2004
572,1.5274
573,1.2004
574,1.2004
575,1.2004
576,1.2004
577,1.5274
578,1.2004
579,1.5274
580,1.5274
581,1.2004
582,1.2004
583,1.2004
584,1.2004
585,1.2004
586,1.2004
587,1.2004
588,1.2004
589,1.2004
590,1.2004
591,1.2004
592,1.5274
593,1.8545
594,1.5274
595,1.5274
596,1.2004
597,1.5274
598,1.5274
599,1.8545
600,1.5274
601,1.5274
602,1.5274
603,1.5274
604,1.2004
605,1.5274
606,1.8545
607,1.5274
608,1.2004
609,1.5274
610,1.5274
611,2.1816
612,2.1816
613,2.1816
614,1.5274
615,1.8545
616,2.1816
617,1.5274
618,1.8545
619,1.2004
620,1.2004
621,1.2004
622,1.2004
623,1.5274
624,2.1816
625,0.46448
626,-0.51672
627,-0.76202
628,-0.76202
629,-0.76202
630,-0.76202
631,-0.76202
632,-0.76202
633,-0.76202
634,-0.76202
635,-0.76202
636,-0.76202
637,-0.76202
638,-0.76202
639,-0.76202
640,-0.76202
641,-0.76202
642,-0.76202
643,-0.76202
644,-0.76202
645,-0.76202
646,-0.76202
647,-0.76202
648,-0.76202
649,-0.76202
650,-0.76202
651,-0.76202
652,-0.76202
653,-0.76202
654,-0.76202
655,-0.76202
656,-0.76202
657,-0.76202
658,-0.76202
659,-0.76202
660,-0.76202
661,-0.76202
662,-0.76202
663,-0.76202
664,-0.76202
665,-0.76202
666,-0.76202
667,-0.76202
668,-0.76202
669,-0.76202
670,-0.76202
671,-0.76202
672,-0.76202
673,-0.76202
674,-0.76202
675,-0.76202
676,-0.76202
677,-0.76202
678,-0.76202
679,-0.76202
680,-0.76202
681,-0.76202
682,-0.76202
683,-0.76202
684,-0.76202
685,-0.76202
686,-0.76202
687,-0.76202
688,-0.76202
689,-0.76202
690,-0.76202
691,-0.76202
692,-0.76202
693,-0.76202
694,-0.76202
695,-0.76202
696,-0.76202
697,-0.76202
698,-0.76202
699,-0.76202
700,-0.76202
701,-0.76202
702,-0.76202
703,-0.76202
704,-0.76202
705,-0.76202
706,-0.76202
707,-0.76202
708,-0.76202
709,-0.76202
710,-0.76202
711,-0.76202
712,-0.76202
713,-0.76202
714,-0.76202
715,-0.76202
716,-0.76202
717,-0.76202
718,-0.76202
719,-0.76202
