time,value
0,0.68313
1,2.6545
2,4.4252
3,5.0395
4,4.1126
5,2.1243
6,0.11242
7,-1.0103
8,-1.0031
9,-0.33309
10,0.27142
11,0.36575
12,0.017431
13,-0.38931
14,-0.53238
15,-0.38575
16,-0.16219
17,-0.076557
18,-0.16818
19,-0.31818
20,-0.39435
21,-0.36751
22,-0.30677
23,-0.28799
24,-0.32181
25,-0.36463
26,-0.38015
27,-0.37705
28,-0.38841
29,-0.42173999999999995
30,-0.43653000000000003
31,-0.37487
32,-0.21366
33,0.014200999999999998
34,0.23686
35,0.38986
36,0.4629
37,0.46981000000000006
38,0.43705
39,0.38786
40,0.33671999999999996
41,0.29703
42,0.28641
43,0.31518
44,0.37064
45,0.41368
46,0.39418000000000003
47,0.28203
48,0.091225
49,-0.12478
50,-0.30251
51,-0.40216999999999997
52,-0.42533000000000004
53,-0.4059
54,-0.38325
55,-0.37985
56,-0.39598
57,-0.41861000000000004
58,-0.43361000000000005
59,-0.43831000000000003
60,-0.44155
61,-0.44806999999999997
62,-0.45903999999999995
63,-0.4717
64,-0.48261000000000004
65,-0.49038999999999994
66,-0.49433
67,-0.49168999999999996
68,-0.48468999999999995
69,-0.48338000000000003
70,-0.49505
71,-0.52194
72,-0.55447
73,-0.57122
74,-0.56211
75,-0.54389
76,-0.54395
77,-0.57657
78,-0.623
79,-0.6393300000000001
80,-0.59968
81,-0.52957
82,-0.49017
83,-0.51836
84,-0.5695399999999999
85,-0.5171399999999999
86,-0.23215
87,0.30136
88,0.9267799999999999
89,1.3686
90,1.379
91,0.8939600000000001
92,0.095334
93,-0.6714399999999999
94,-1.0784
95,-0.9914799999999999
96,-0.53667
97,-0.013325
98,0.29481999999999997
