time,value
0,-0.5072800000000001
1,-0.4066
2,-0.34835
3,-0.11713
4,0.1644
5,0.40976
6,0.58268
7,0.88764
8,1.0851
9,1.1826
10,1.3077
11,1.247
12,1.1923
13,1.1244
14,0.9807100000000001
15,0.7428100000000001
16,0.5696
17,0.24559
18,-0.027232999999999997
19,-0.30612
20,-0.45908000000000004
21,-0.5917899999999999
22,-0.5066
23,-0.35225
24,-0.14820999999999998
25,0.089459
26,0.29181999999999997
27,0.5645
28,0.85546
29,1.1589
30,1.4725
31,1.5411
32,1.5043
33,1.3477
34,1.2209
35,1.1854
36,1.1723
37,1.198
38,1.3149
39,1.5408
40,1.6451
41,1.6092
42,1.4301
43,1.1315
44,0.84219
45,0.50885
46,0.27412
47,0.035970999999999996
48,-0.16687000000000002
49,-0.38169000000000003
50,-0.69448
51,-0.7601399999999999
52,-0.80718
53,-0.99511
54,-1.0713
55,-1.2355
56,-1.3326
57,-1.4166
58,-1.4044
59,-1.3232
60,-1.1895
61,-1.0428
62,-0.83629
63,-0.78564
64,-0.72955
65,-0.59872
66,-0.69857
67,-0.83768
68,-0.9169
69,-1.0878
70,-1.1771
71,-1.386
72,-1.4476
73,-1.4476
74,-1.3612
75,-1.229
76,-1.1029
77,-0.9532200000000001
78,-0.7963600000000001
79,-0.67327
