time,value
0,2.815
1,2.4999
2,2.1381
3,1.8275
4,1.4656
5,1.1043
6,0.80307
7,0.55971
8,0.3379
9,0.34762
10,0.26535
11,0.25078
12,0.20493000000000003
13,0.15219000000000002
14,0.036683999999999994
15,-0.011264
16,-0.095149
17,-0.20611
18,-0.23396
19,-0.3117
20,-0.33225
21,-0.35359
22,-0.40010999999999997
23,-0.6309899999999999
24,-0.63774
25,-0.76536
26,-0.7964600000000001
27,-0.78719
28,-0.74693
29,-0.8023899999999999
30,-0.68524
31,-0.7047100000000001
32,-0.64776
33,-0.62375
34,-0.47146000000000005
35,-0.34861
36,-0.35359
37,-0.28512
38,-0.21538000000000002
39,-0.19779000000000002
40,-0.15358
41,0.043788
42,0.020002000000000002
43,0.21205
44,0.30864
45,0.53166
46,0.59396
47,0.722
48,0.7460899999999999
49,0.73475
50,0.79518
51,0.70843
52,0.76157
53,0.69182
54,0.5915199999999999
55,0.46979
56,0.30205
57,0.10142000000000001
58,-0.2321
59,-0.60233
60,-0.90828
61,-0.77793
62,-0.57333
63,-0.34861
64,-0.12040999999999999
65,0.18436
66,0.4534
67,0.78215
68,1.0513
69,1.3965
70,1.7488
71,2.1519
72,1.8683
73,1.5128
74,1.1965
75,0.8882399999999999
76,0.58907
77,0.32053000000000004
78,-0.0067876
79,-0.32232
80,-0.624
81,-0.85872
82,-1.0886
83,-1.2379
84,-1.3491
85,-1.5349
86,-1.5909
87,-1.6163
88,-1.5897
89,-1.5121
90,-1.4303
91,-1.4242
92,-1.4283
93,-1.3984
94,-1.3859
95,-1.2849
96,-1.3189
97,-1.2732
98,-1.1485
99,-1.0578
100,-0.8872399999999999
101,-0.84386
102,-0.7751
103,-0.6562899999999999
104,-0.79956
105,-0.71231
106,-0.77356
107,-0.5604899999999999
108,-0.48336
109,-0.45886000000000005
110,-0.34173000000000003
111,-0.311
112,-0.26966
113,-0.19755999999999999
114,-0.21909
115,-0.15106
116,-0.16092
117,-0.011264
118,0.1216
119,0.36555
120,0.56053
121,0.7186100000000001
122,1.0490000000000002
123,1.3927
124,1.7412
125,2.0476
126,2.4061
127,2.7653
