time,value
0,1.5878
1,2.5504
2,3.3586
3,3.7987
4,3.7313
5,3.1463
6,2.1754
7,1.0534
8,0.042052
9,-0.65569
10,-0.9563200000000001
11,-0.9096299999999999
12,-0.66242
13,-0.38961999999999997
14,-0.22314
15,-0.20729
16,-0.29707
17,-0.39466
18,-0.40439
19,-0.27945
20,-0.04094
21,0.23643000000000003
22,0.46206
23,0.57096
24,0.54984
25,0.43751999999999996
26,0.30224
27,0.20843000000000003
28,0.18923
29,0.23574
30,0.3067
31,0.35202
32,0.33910999999999997
33,0.26973
34,0.18133
35,0.13266
36,0.18008
37,0.35361
38,0.6413300000000001
39,0.98811
40,1.3089
41,1.5130000000000001
42,1.5315
43,1.3395
44,0.9638
45,0.48133000000000004
46,-0.0091379
47,-0.41336999999999996
48,-0.6702199999999999
49,-0.76097
50,-0.71638
51,-0.6006600000000001
52,-0.48403999999999997
53,-0.41765
54,-0.41922
55,-0.47381
56,-0.54677
57,-0.60253
58,-0.6199100000000001
59,-0.59939
60,-0.55886
61,-0.52252
62,-0.5082
63,-0.52041
64,-0.55015
65,-0.58143
66,-0.599
67,-0.5956600000000001
68,-0.57517
69,-0.54835
70,-0.52725
71,-0.5184
72,-0.52284
73,-0.5360699999999999
74,-0.55172
75,-0.56329
76,-0.56867
77,-0.5694899999999999
78,-0.56944
79,-0.57104
80,-0.57513
81,-0.58123
82,-0.58818
83,-0.59472
84,-0.5990800000000001
85,-0.60202
86,-0.60478
87,-0.60927
88,-0.61344
89,-0.61712
90,-0.62058
91,-0.62427
92,-0.62843
93,-0.6330399999999999
94,-0.6378
95,-0.6420600000000001
96,-0.64499
97,-0.64581
98,-0.64442
