time,value
0,-1.0526
1,-1.0526
2,-1.0526
3,-1.0526
4,-1.0526
5,-1.0526
6,-1.0526
7,-1.0526
8,-1.0526
9,-1.0526
10,-1.0526
11,-1.0526
12,-1.0526
13,-1.0526
14,-1.0526
15,-1.0526
16,-1.0526
17,-1.0526
18,-1.0526
19,-1.0526
20,-1.0526
21,-1.0526
22,-1.0526
23,-1.0526
24,-1.0526
25,-1.0526
26,-1.0526
27,-1.0485
28,-1.0181
29,-0.96851
30,-0.91891
31,-0.86931
32,-0.83734
33,-0.8264
34,-0.82101
35,-0.78377
36,-0.74195
37,-0.7146399999999999
38,-0.71404
39,-0.69026
40,-0.64863
41,-0.5990300000000001
42,-0.54943
43,-0.51135
44,-0.48832
45,-0.48832
46,-0.48832
47,-0.48832
48,-0.48832
49,-0.48832
50,-0.48832
51,-0.48832
52,-0.48832
53,-0.45132
54,-0.41018000000000004
55,-0.37546999999999997
56,-0.37546999999999997
57,-0.35552
58,-0.32011999999999996
59,-0.27052
60,-0.22091999999999998
61,-0.1778
62,-0.14975
63,-0.14975
64,-0.14975
65,-0.14975
66,-0.14975
67,-0.14975
68,-0.14975
69,-0.14975
70,-0.15362
71,-0.20897
72,-0.29496
73,-0.36496
74,-0.37503000000000003
75,-0.38681
76,-0.42075
77,-0.47035
78,-0.51995
79,-0.56955
80,-0.59763
81,-0.59988
82,-0.58694
83,-0.54727
84,-0.50835
85,-0.48858
86,-0.48832
87,-0.5170899999999999
88,-0.56452
89,-0.61412
90,-0.66372
91,-0.71332
92,-0.7629199999999999
93,-0.81252
94,-0.8621200000000001
95,-0.90585
96,-0.93975
97,-0.93975
98,-0.9190799999999999
99,-0.88225
100,-0.83265
101,-0.8272299999999999
102,-0.8269
103,-0.8269
104,-0.8269
105,-0.77463
106,-0.69493
107,-0.60118
108,-0.60118
109,-0.5895
110,-0.5623600000000001
111,-0.51276
112,-0.49506999999999995
113,-0.48832
114,-0.48832
115,-0.48832
116,-0.48832
117,-0.48832
118,-0.48556000000000005
119,-0.45033
120,-0.40494
121,-0.35534
122,-0.30574
123,-0.25614000000000003
124,-0.20654
125,-0.15694
126,-0.10734
127,-0.2511
128,0.12536
129,0.11757999999999999
130,0.19629000000000002
131,0.25351999999999997
132,0.31683
133,0.40381
134,0.4983
135,0.56477
136,0.61437
137,0.66397
138,0.7135699999999999
139,0.76317
140,0.81277
141,0.8623700000000001
142,0.9119700000000001
143,0.96157
144,1.0112
145,1.0608
146,1.0845
147,1.0956
148,1.1092
149,1.2009
150,1.3001
151,1.3993
152,1.4985
153,1.5977
154,1.6969
155,1.7961
156,1.8953
157,1.9775
158,2.0441
159,2.0937
160,2.1433
161,2.1878
162,2.2203
163,2.2203
164,2.1988
165,2.162
166,2.1162
167,2.1093
168,2.1002
169,2.0765
170,2.0269
171,1.9773
172,1.9277
173,1.8781
174,1.8285
175,1.7789
176,1.7293
177,1.683
178,1.6614
179,1.656
180,1.6391
181,1.5942
182,1.5568
183,1.5431
184,1.5431
185,1.5431
186,1.5431
187,1.5431
188,1.5431
189,1.5431
190,1.5431
191,1.5308
192,1.5
193,1.4504
194,1.432
195,1.426
196,1.4117
197,1.3648
198,1.3152
199,1.2656
200,1.216
201,1.1664
202,1.1236
203,1.0917
204,1.0917
205,1.0692
206,1.0313
207,0.9817
208,0.9789700000000001
209,0.9692200000000001
210,0.94576
211,0.8961600000000001
212,0.8465600000000001
213,0.79696
214,0.74736
215,0.69776
216,0.63539
217,0.55686
218,0.45766999999999997
219,0.35846999999999996
220,0.25927
221,0.16007000000000002
222,0.32663000000000003
223,-0.088157
224,-0.41376999999999997
225,-0.14132
226,-0.2265
227,-0.32227
228,-0.42146999999999996
229,-0.52067
230,-0.61987
231,-0.71907
232,-0.8282
233,-0.96406
234,-1.1116
235,-1.2604
236,-1.4092
237,-1.558
238,-1.7068
239,-1.8242
240,-1.8965
241,-1.9461
242,-1.9957
243,-2.0057
244,-1.9237
245,-1.6873
246,-1.5261
247,-1.4426
248,-1.3992
249,-1.3912
250,-1.3912
251,-1.3912
252,-1.3912
253,-1.3631
254,-1.3129
255,-1.2417
256,-1.0483
257,-0.87829
258,-0.7392
259,-0.64
260,-0.5408
261,-0.44553999999999994
262,-0.35893
263,-0.30933
264,-0.25973
265,-0.21013
266,-0.16053
267,-0.11093
268,-0.2554
269,0.089417
270,0.11262
271,0.18879
272,0.24991999999999998
273,0.29368
274,0.30015
275,0.30168
276,0.30168
277,0.30108
278,0.27376999999999996
279,0.23195
280,0.18235
281,0.13275
282,0.49028999999999995
283,0.40210999999999997
284,0.40210999999999997
285,0.40210999999999997
286,0.40210999999999997
287,0.40210999999999997
288,0.40210999999999997
289,0.40210999999999997
290,0.40210999999999997
291,0.40210999999999997
292,0.40210999999999997
293,0.40210999999999997
294,0.40210999999999997
295,0.40210999999999997
296,0.40210999999999997
297,0.40210999999999997
298,0.40210999999999997
299,0.40210999999999997
300,0.40210999999999997
301,0.40210999999999997
302,0.40210999999999997
303,0.40210999999999997
304,0.40210999999999997
305,0.40210999999999997
306,0.40210999999999997
307,0.40210999999999997
308,0.40210999999999997
309,0.36379
310,0.26553000000000004
311,0.14848
312,-0.10905999999999999
313,-0.16217
314,-0.16217
315,-1.5947
316,-1.5947
317,-1.5947
318,-1.5947
319,-1.5947
320,-1.5947
321,-1.5947
322,-1.5947
323,-1.5947
324,-1.5947
325,-1.5947
326,-1.5947
327,-1.5947
328,-1.5947
329,-1.5947
330,-1.5947
331,-1.5947
332,-1.5947
333,-1.5947
334,-1.5947
335,-1.5947
336,-1.5947
337,-1.5947
338,-1.5947
339,-1.5947
340,-1.5947
341,-1.5947
342,-1.5892
343,-1.5484
344,-1.4817
345,-1.415
346,-1.3484
347,-1.2817
348,-1.2157
349,-1.1563
350,-1.1397
351,-1.1292
352,-1.0993
353,-1.0334
354,-1.0307
355,-1.0759
356,-1.1426
357,-1.2093
358,-1.2604
359,-1.2914
360,-1.2914
361,-1.3319999999999999
362,-1.3869999999999998
363,-1.4431
364,-1.4431
365,-1.4221
366,-1.3803
367,-1.3136
368,-1.2469
369,-1.1803
370,-1.1136
371,-1.0469
372,-0.9802799999999999
373,-0.9136200000000001
374,-0.8492
375,-0.8395299999999999
376,-0.8363299999999999
377,-0.8363299999999999
378,-0.8363299999999999
379,-0.8363299999999999
380,-0.8363299999999999
381,-0.8363299999999999
382,-0.8363299999999999
383,-0.8363299999999999
384,-0.8363299999999999
385,-0.83373
386,-0.7965300000000001
387,-0.73875
388,-0.67209
389,-0.60542
390,-0.53876
391,-0.4721
392,-0.40543
393,-0.33876999999999996
394,-0.27211
395,-0.23438
396,-0.2296
397,-0.2296
398,-0.2296
399,-0.25831
400,-0.3385
401,-0.47113
402,-0.56579
403,-0.63537
404,-0.70204
405,-0.7687
406,-0.83536
407,-0.9020299999999999
408,-0.9686899999999999
409,-0.9865299999999999
410,-0.98013
411,-0.9590299999999999
412,-0.89236
413,-0.8257
414,-0.7590399999999999
415,-0.69238
416,-0.62571
417,-0.54747
418,-0.45181000000000004
419,-0.31848000000000004
420,-0.25540999999999997
421,-0.2296
422,-0.2296
423,-0.2296
424,-0.24529
425,-0.28176999999999996
426,-0.34843
427,-0.4151
428,-0.48176
429,-0.54842
430,-0.6150800000000001
431,-0.68175
432,-0.74841
433,-0.81135
434,-0.83068
435,-0.83394
436,-0.80928
437,-0.74261
438,-0.70113
439,-0.68465
440,-0.68465
441,-0.68465
442,-0.68465
443,-0.68465
444,-0.68465
445,-0.68465
446,-0.68465
447,-0.68465
448,-0.68465
449,-0.6783899999999999
450,-0.63441
451,-0.57508
452,-0.53741
453,-0.53296
454,-0.53296
455,-0.53296
456,-0.53296
457,-0.53296
458,-0.5208699999999999
459,-0.48949
460,-0.42282
461,-0.35616
462,-0.2895
463,-0.22283000000000003
464,-0.15617
465,-0.42525
466,-0.091932
467,0.24138
468,0.11048
469,0.18169000000000002
470,0.26216
471,0.39549
472,0.48311000000000004
473,0.52882
474,0.52882
475,0.52882
476,0.52882
477,0.52882
478,0.52882
479,0.49996
480,0.45056
481,0.38389
482,0.31723
483,0.26026
484,0.22545
485,0.22545
486,0.22545
487,0.22545
488,0.22545
489,0.22545
490,0.23833000000000001
491,0.27859
492,0.34081
493,0.36979
494,0.37713
495,0.39981
496,0.46021999999999996
497,0.52688
498,0.59355
499,0.6602100000000001
500,0.72687
501,0.7935300000000001
502,0.8602
503,0.92686
504,0.9935200000000001
505,1.0602
506,1.1104
507,1.1355
508,1.1355
509,1.1775
510,1.2362
511,1.2835
512,1.2872
513,1.3104
514,1.3568
515,1.4235
516,1.4378
517,1.4389
518,1.4389
519,1.4389
520,1.4389
521,1.4389
522,1.4389
523,1.5019
524,1.5684
525,1.635
526,1.7017
527,1.7307
528,1.7423
529,1.7423
530,1.7423
531,1.7423
532,1.7423
533,1.7423
534,1.7423
535,1.7408
536,1.723
537,1.6563
538,1.5896
539,1.5230000000000001
540,1.4563
541,1.3896
542,1.3230000000000002
543,1.2563
544,1.1893
545,1.0961
546,0.9771
547,0.85711
548,0.7730600000000001
549,0.69987
550,0.59548
551,0.46215
552,0.32883
553,0.1955
554,0.33316
555,-0.33050999999999997
556,-0.19036
557,-0.2296
558,-0.22071999999999997
559,-0.19125
560,-0.12719
561,-0.28033
562,0.045276
563,0.33753
564,0.39113000000000003
565,0.39113000000000003
566,0.39113000000000003
567,0.39113000000000003
568,0.11145999999999999
569,0.17583
570,0.26181
571,0.45732
572,0.61915
573,0.73943
574,0.80609
575,0.8727600000000001
576,0.9341299999999999
577,0.9838600000000001
578,0.9838600000000001
579,1.0087
580,1.0544
581,1.1211
582,1.1317
583,1.1355
584,1.1355
585,1.1355
586,1.1355
587,1.1355
588,1.1355
589,1.1355
590,1.1248
591,1.0901
592,1.0235
593,0.95681
594,0.89015
595,0.84009
596,0.8328399999999999
597,0.81814
598,0.77518
599,0.72118
600,0.7308399999999999
601,0.78581
602,0.8266899999999999
603,0.8321799999999999
604,0.8321799999999999
605,0.8321799999999999
606,0.8321799999999999
607,0.8321799999999999
608,0.8321799999999999
609,0.8321799999999999
610,0.8321799999999999
611,0.8321799999999999
612,0.8321799999999999
613,0.88812
614,1.0177
615,1.2177
616,1.1453
617,0.9838
618,0.86303
619,0.92396
620,0.96519
621,0.9838600000000001
622,0.9838600000000001
623,0.9838600000000001
624,0.9838600000000001
625,0.9838600000000001
626,0.9838600000000001
627,0.9512299999999999
628,0.89884
629,0.8321799999999999
630,-0.13863
631,-0.13863
632,-0.13863
633,-0.13863
634,-0.13863
635,-0.13863
636,-0.13863
637,-0.13863
638,-0.13863
639,-0.13863
640,-0.13863
641,-0.13863
642,-0.13863
643,-0.13863
644,-0.13863
645,-0.13863
646,-0.13863
647,-0.13863
648,-0.13863
649,-0.13863
650,-0.13863
651,-0.13863
652,-0.13863
653,-0.13863
654,-0.13863
655,-0.13863
656,-0.13863
657,-0.13863
658,-0.13863
659,-0.13863
660,-0.13863
661,-0.13863
662,-0.13863
663,-0.12187
664,0.06096699999999999
665,0.19387000000000001
666,0.40658
667,0.10465
668,0.10525
669,0.10525
670,0.10525
671,0.10525
672,0.10525
673,0.43128
674,0.16096
675,-0.34367
676,-0.1126
677,-0.12147000000000001
678,-0.11342
679,-0.29247
680,-0.11943
681,-0.13863
682,-0.13863
683,-0.13863
684,0.14618
685,0.073197
686,0.32550999999999997
687,0.47635
688,0.10525
689,0.10525
690,0.10525
691,0.10525
692,0.10525
693,0.10525
694,0.10525
695,0.10525
696,0.097139
697,0.28676
698,0.084838
699,-0.13863
700,-0.13863
701,-0.13863
702,-0.13863
703,-0.13863
704,-0.13863
705,-0.083235
706,-0.25590999999999997
707,-0.47691999999999996
708,-0.12105
709,-0.12439000000000001
710,-0.16819
711,-0.26056
712,-0.34831999999999996
713,-0.40888
714,-0.45933999999999997
715,-0.5098
716,-0.5602699999999999
717,-0.61073
718,-0.6611899999999999
719,-0.71165
720,-0.76212
721,-0.81258
722,-0.8630399999999999
723,-0.9135
724,-0.92701
725,-0.9221600000000001
726,-0.9061899999999999
727,-0.8557299999999999
728,-0.8473299999999999
729,-0.87182
730,-0.9222799999999999
731,-0.9727399999999999
732,-1.0232
733,-1.0737
734,-1.1241
735,-1.148
736,-1.1581
737,-1.1636
738,-1.2645
739,-1.3417
740,-1.3874
741,-1.3874
742,-1.4199
743,-1.4618
744,-1.4905
745,-1.4401
746,-1.4049
747,-1.3874
748,-1.3874
749,-1.3874
750,-1.3856
751,-1.3669
752,-1.3165
753,-1.266
754,-1.2155
755,-1.1651
756,-1.1146
757,-1.061
758,-0.98444
759,-0.8812399999999999
760,-0.75948
761,-0.61585
762,-0.49236
763,-0.41703
764,-0.35699000000000003
765,-0.23994000000000001
766,-0.42046000000000006
767,0.33648
768,0.21422
769,0.34562
770,0.45711999999999997
771,0.56389
772,0.70495
773,0.84719
774,0.97482
775,1.0757
776,1.1767
777,1.2756
778,1.3696
779,1.4239
780,1.4743
781,1.5248
782,1.5753
783,1.6257
784,1.6727
785,1.7127
786,1.7127
787,1.7127
788,1.7127
789,1.7127
790,1.6727
791,1.6309
792,1.5979
793,1.5979
794,1.5979
795,1.5979
796,1.5979
797,1.5979
798,1.5906
799,1.5665
800,1.516
801,1.4655
802,1.4151
803,1.3233
804,1.0944
805,0.8746299999999999
806,0.71373
807,0.6128100000000001
808,0.51188
809,0.41096000000000005
810,0.29286
811,0.14626
812,0.058842
813,-0.10757
814,-0.20849
815,-0.30942
816,-0.41034
817,-0.51127
818,-0.6101800000000001
819,-0.69758
820,-0.75627
821,-0.8192
822,-0.90107
823,-1.002
824,-1.0711
825,-1.1277
826,-1.1928
827,-1.2909
828,-1.3393
829,-1.3348
830,-1.2843
831,-1.3922
832,-1.5265
833,-1.6419
834,-1.6924
835,-1.7428
836,-1.7933
837,-1.8438
838,-1.8465
839,-1.8565
840,-1.8803
841,-1.9308
842,-1.9242
843,-1.8913
844,-1.8408
845,-1.7904
846,-1.7269
847,-1.6469999999999998
848,-1.5461
849,-1.4107
850,-1.2642
851,-1.0993
852,-0.89741
853,-0.7451399999999999
854,-0.6473
855,-0.5876600000000001
856,-0.4648
857,-0.31818
858,-0.1456
859,0.30489
860,0.27848
861,0.51993
862,0.7621399999999999
863,0.97715
864,1.1767
865,1.35
866,1.5047
867,1.6773
868,1.8729
869,2.0588
870,2.2211
871,2.3571
872,2.4017
873,2.3882
874,2.3436
875,2.2466
876,2.1678
877,2.1084
878,2.0579
879,2.0075
880,1.9569999999999999
881,1.9065
882,1.8561
883,1.8056
884,1.7503
885,1.6852
886,1.5372
887,1.3858
888,1.2344
889,1.0831
890,0.96698
891,0.86146
892,0.76054
893,0.65961
894,0.5586899999999999
895,0.45776000000000006
896,0.35684
897,0.29832
898,0.23905
899,0.16888
900,0.36208
901,-0.13773
902,-0.33635
903,-0.11625
904,-0.12283
905,-0.12439000000000001
906,-0.12439000000000001
907,-0.12439000000000001
908,-0.12439000000000001
909,-0.12439000000000001
910,-0.12439000000000001
911,-0.12439000000000001
912,-0.13501
913,-0.16754000000000002
914,-0.2132
915,-0.23478000000000002
916,-0.23920999999999998
917,-0.23920999999999998
918,-0.23920999999999998
919,-0.23920999999999998
920,-0.23920999999999998
921,-0.23920999999999998
922,-0.23920999999999998
923,-0.23920999999999998
924,-0.21243
925,-0.16734000000000002
926,-0.13077
927,-0.12439000000000001
928,-0.12439000000000001
929,-0.12439000000000001
930,-0.12439000000000001
931,-0.12439000000000001
932,-0.11928
933,-0.49914
934,-0.25225
935,0.032011000000000005
936,0.25238
937,0.096479
938,0.10469
939,0.10525
940,0.10525
941,0.10525
942,0.10525
943,0.10525
944,0.10525
