time,value
0,-0.34196
1,-0.34196
2,-0.34196
3,-0.34196
4,-0.34196
5,-0.34196
6,-0.34196
7,-0.34196
8,-0.34196
9,-0.34196
10,-0.34196
11,-0.34196
12,-0.34196
13,-0.34196
14,-0.34196
15,-0.34196
16,-0.34196
17,-0.34196
18,-0.34196
19,-0.34196
20,-0.34196
21,-0.34196
22,-0.34196
23,-0.34196
24,-0.34196
25,-0.34196
26,-0.34196
27,-0.34196
28,-0.34196
29,-0.34196
30,-0.34196
31,-0.34196
32,-0.34196
33,-0.34196
34,-0.34196
35,-0.34196
36,-0.34196
37,-0.34196
38,-0.34196
39,-0.34196
40,-0.34196
41,-0.34196
42,-0.34196
43,-0.34196
44,-0.34196
45,-0.34196
46,-0.34196
47,-0.34196
48,-0.34196
49,-0.34196
50,-0.34196
51,-0.34196
52,-0.34196
53,-0.34196
54,-0.34196
55,-0.34196
56,-0.34196
57,-0.34196
58,-0.34196
59,-0.34196
60,-0.34196
61,-0.34196
62,-0.34196
63,-0.34196
64,-0.34196
65,-0.34196
66,-0.34196
67,-0.34196
68,-0.34196
69,-0.34196
70,-0.34196
71,-0.34196
72,-0.34196
73,-0.34196
74,-0.34196
75,-0.34196
76,-0.34196
77,-0.34196
78,-0.34196
79,-0.34196
80,-0.34196
81,-0.34196
82,-0.34196
83,-0.34196
84,-0.34196
85,-0.34196
86,-0.34196
87,-0.34196
88,-0.34196
89,-0.34196
90,-0.34196
91,-0.34196
92,-0.34196
93,-0.34196
94,-0.34196
95,-0.34196
96,-0.34196
97,-0.34196
98,-0.34196
99,-0.34196
100,-0.34196
101,-0.34196
102,-0.34196
103,-0.34196
104,-0.34196
105,-0.34196
106,-0.34196
107,-0.34196
108,-0.34196
109,-0.34196
110,-0.34196
111,-0.34196
112,-0.34196
113,-0.34196
114,-0.34196
115,-0.34196
116,-0.34196
117,-0.34196
118,-0.34196
119,-0.34196
120,-0.34196
121,-0.34196
122,-0.34196
123,-0.34196
124,-0.34196
125,-0.34196
126,-0.34196
127,-0.34196
128,-0.34196
129,-0.34196
130,-0.34196
131,-0.34196
132,-0.34196
133,-0.34196
134,-0.34196
135,-0.34196
136,-0.34196
137,-0.34196
138,-0.34196
139,-0.34196
140,-0.34196
141,-0.34196
142,-0.34196
143,-0.34196
144,-0.34196
145,-0.34196
146,-0.34196
147,-0.34196
148,-0.34196
149,-0.34196
150,-0.34196
151,-0.34196
152,-0.34196
153,-0.34196
154,-0.34196
155,-0.34196
156,-0.34196
157,-0.34196
158,-0.34196
159,-0.34196
160,-0.34196
161,-0.34196
162,-0.34196
163,-0.34196
164,-0.34196
165,-0.34196
166,-0.34196
167,-0.34196
168,-0.34196
169,-0.34196
170,-0.34196
171,-0.34196
172,-0.34196
173,-0.34196
174,-0.34196
175,-0.34196
176,-0.34196
177,-0.34196
178,-0.34196
179,-0.34196
180,-0.34196
181,-0.34196
182,-0.34196
183,-0.34196
184,-0.34196
185,-0.34196
186,-0.34196
187,-0.34196
188,-0.34196
189,-0.34196
190,-0.34196
191,-0.34196
192,-0.34196
193,-0.34196
194,-0.34196
195,-0.34196
196,-0.34196
197,-0.34196
198,-0.34196
199,-0.34196
200,-0.34196
201,-0.34196
202,-0.34196
203,-0.34196
204,-0.34196
205,-0.34196
206,-0.34196
207,-0.34196
208,-0.34196
209,-0.34196
210,-0.34196
211,-0.34196
212,-0.34196
213,-0.34196
214,-0.34196
215,-0.34196
216,-0.34196
217,-0.34196
218,-0.34196
219,-0.34196
220,-0.34196
221,-0.34196
222,-0.34196
223,-0.34196
224,-0.34196
225,-0.34196
226,-0.34196
227,-0.34196
228,-0.34196
229,-0.34196
230,-0.34196
231,-0.34196
232,-0.34196
233,-0.34196
234,-0.34196
235,-0.34196
236,-0.34196
237,-0.34196
238,-0.34196
239,-0.34196
240,-0.34196
241,-0.34196
242,-0.34196
243,-0.34196
244,-0.34196
245,-0.34196
246,-0.34196
247,-0.34196
248,-0.34196
249,-0.34196
250,-0.34196
251,-0.34196
252,-0.34196
253,-0.34196
254,-0.34196
255,-0.34196
256,-0.34196
257,-0.34196
258,-0.34196
259,-0.34196
260,-0.34196
261,-0.34196
262,-0.34196
263,-0.34196
264,-0.34196
265,-0.34196
266,-0.34196
267,-0.34196
268,-0.34196
269,-0.34196
270,-0.34196
271,-0.34196
272,-0.34196
273,-0.34196
274,-0.34196
275,-0.070802
276,2.9119
277,2.9119
278,2.9119
279,2.9119
280,3.7254
281,2.9119
282,2.9119
283,2.9119
284,2.9119
285,2.9119
286,3.7254
287,2.9119
288,2.9119
289,2.9119
290,2.9119
291,2.9119
292,2.9119
293,2.9119
294,2.9119
295,2.9119
296,2.9119
297,2.9119
298,2.9119
299,2.9119
300,2.9119
301,3.7254
302,2.9119
303,2.9119
304,2.9119
305,2.9119
306,2.9119
307,2.9119
308,2.9119
309,2.9119
310,2.9119
311,2.9119
312,2.9119
313,2.9119
314,2.9119
315,2.9119
316,2.9119
317,2.9119
318,2.9119
319,2.9119
320,2.9119
321,2.9119
322,2.9119
323,2.9119
324,2.9119
325,2.9119
326,1.285
327,-0.34196
328,-0.34196
329,-0.34196
330,-0.34196
331,-0.34196
332,-0.34196
333,-0.34196
334,-0.34196
335,-0.34196
336,-0.34196
337,-0.34196
338,-0.34196
339,-0.34196
340,-0.34196
341,-0.34196
342,-0.34196
343,-0.34196
344,-0.34196
345,-0.34196
346,-0.34196
347,-0.34196
348,-0.34196
349,-0.34196
350,-0.34196
351,-0.34196
352,-0.34196
353,-0.34196
354,-0.34196
355,-0.34196
356,-0.34196
357,-0.34196
358,-0.34196
359,-0.34196
360,-0.34196
361,-0.34196
362,-0.34196
363,-0.34196
364,-0.34196
365,-0.34196
366,-0.34196
367,-0.34196
368,-0.34196
369,-0.34196
370,-0.34196
371,-0.34196
372,-0.34196
373,-0.34196
374,-0.34196
375,-0.34196
376,-0.34196
377,-0.34196
378,-0.34196
379,-0.34196
380,-0.34196
381,-0.34196
382,-0.34196
383,-0.34196
384,-0.34196
385,-0.34196
386,-0.34196
387,-0.34196
388,-0.34196
389,-0.34196
390,-0.34196
391,-0.34196
392,-0.34196
393,-0.34196
394,-0.34196
395,-0.34196
396,-0.34196
397,-0.34196
398,-0.34196
399,-0.34196
400,-0.34196
401,-0.34196
402,-0.34196
403,-0.34196
404,-0.34196
405,-0.34196
406,-0.34196
407,-0.34196
408,-0.34196
409,-0.34196
410,-0.34196
411,-0.34196
412,-0.34196
413,-0.34196
414,-0.34196
415,-0.34196
416,-0.34196
417,-0.34196
418,-0.34196
419,-0.34196
420,-0.34196
421,-0.34196
422,-0.34196
423,-0.34196
424,-0.34196
425,-0.34196
426,-0.34196
427,-0.34196
428,-0.34196
429,-0.34196
430,-0.34196
431,-0.34196
432,-0.34196
433,-0.34196
434,-0.34196
435,-0.34196
436,-0.34196
437,-0.34196
438,-0.34196
439,-0.34196
440,-0.34196
441,-0.34196
442,-0.34196
443,-0.34196
444,-0.34196
445,-0.34196
446,-0.34196
447,-0.34196
448,-0.34196
449,-0.34196
450,-0.34196
451,-0.34196
452,-0.34196
453,-0.34196
454,-0.34196
455,-0.34196
456,-0.34196
457,-0.34196
458,-0.34196
459,-0.34196
460,-0.34196
461,-0.34196
462,-0.34196
463,-0.34196
464,-0.34196
465,-0.34196
466,-0.34196
467,-0.34196
468,-0.34196
469,-0.34196
470,-0.34196
471,-0.34196
472,-0.34196
473,-0.34196
474,-0.34196
475,-0.34196
476,-0.34196
477,-0.34196
478,-0.34196
479,-0.34196
480,-0.34196
481,-0.34196
482,-0.34196
483,-0.34196
484,-0.34196
485,-0.34196
486,-0.34196
487,-0.34196
488,-0.34196
489,-0.34196
490,-0.34196
491,-0.34196
492,-0.34196
493,-0.34196
494,-0.34196
495,-0.34196
496,-0.34196
497,-0.34196
498,-0.34196
499,-0.34196
500,-0.34196
501,-0.34196
502,-0.34196
503,-0.34196
504,-0.34196
505,-0.34196
506,-0.34196
507,-0.34196
508,-0.34196
509,-0.34196
510,-0.34196
511,-0.34196
512,-0.34196
513,-0.34196
514,-0.34196
515,-0.34196
516,-0.34196
517,-0.34196
518,-0.34196
519,-0.34196
520,-0.34196
521,-0.34196
522,-0.34196
523,-0.34196
524,-0.34196
525,-0.34196
526,-0.34196
527,-0.34196
528,-0.34196
529,-0.34196
530,-0.34196
531,-0.34196
532,-0.34196
533,-0.34196
534,-0.34196
535,-0.34196
536,-0.34196
537,-0.34196
538,-0.34196
539,-0.34196
540,-0.34196
541,-0.34196
542,-0.34196
543,-0.34196
544,-0.34196
545,-0.34196
546,-0.34196
547,-0.34196
548,-0.34196
549,-0.34196
550,-0.34196
551,-0.34196
552,-0.34196
553,-0.34196
554,-0.34196
555,-0.34196
556,-0.34196
557,-0.34196
558,-0.34196
559,-0.34196
560,-0.34196
561,-0.34196
562,-0.34196
563,-0.34196
564,-0.34196
565,-0.34196
566,-0.34196
567,-0.34196
568,-0.34196
569,-0.34196
570,-0.34196
571,-0.34196
572,-0.34196
573,-0.34196
574,-0.34196
575,-0.34196
576,-0.34196
577,-0.34196
578,-0.34196
579,-0.34196
580,-0.34196
581,-0.34196
582,-0.34196
583,-0.34196
584,-0.34196
585,-0.34196
586,-0.34196
587,-0.34196
588,-0.34196
589,-0.34196
590,-0.34196
591,-0.34196
592,-0.34196
593,-0.34196
594,-0.34196
595,-0.34196
596,-0.34196
597,-0.34196
598,-0.34196
599,-0.34196
600,-0.34196
601,-0.34196
602,-0.34196
603,-0.34196
604,-0.34196
605,-0.34196
606,-0.34196
607,-0.34196
608,-0.34196
609,-0.34196
610,-0.34196
611,-0.34196
612,-0.34196
613,-0.34196
614,-0.34196
615,-0.34196
616,-0.34196
617,-0.34196
618,-0.34196
619,-0.34196
620,-0.34196
621,-0.34196
622,-0.34196
623,-0.34196
624,-0.34196
625,-0.34196
626,-0.34196
627,-0.34196
628,-0.34196
629,-0.34196
630,-0.34196
631,-0.34196
632,-0.34196
633,-0.34196
634,-0.34196
635,-0.34196
636,-0.34196
637,-0.34196
638,-0.34196
639,-0.34196
640,-0.34196
641,-0.34196
642,-0.34196
643,-0.34196
644,-0.34196
645,-0.34196
646,-0.34196
647,-0.34196
648,-0.34196
649,-0.34196
650,-0.34196
651,-0.34196
652,-0.34196
653,-0.34196
654,-0.34196
655,-0.34196
656,2.9119
657,2.9119
658,2.9119
659,2.9119
660,3.7254
661,2.9119
662,2.9119
663,2.9119
664,2.9119
665,2.9119
666,2.9119
667,3.7254
668,2.9119
669,2.9119
670,2.9119
671,2.9119
672,3.7254
673,2.9119
674,2.9119
675,2.9119
676,2.9119
677,2.9119
678,0.7426699999999999
679,0.20035
680,-0.34196
681,-0.34196
682,-0.070802
683,-0.34196
684,-0.34196
685,-0.070802
686,-0.34196
687,-0.34196
688,-0.070802
689,-0.34196
690,-0.34196
691,-0.070802
692,-0.34196
693,-0.34196
694,-0.070802
695,-0.34196
696,-0.34196
697,-0.070802
698,-0.34196
699,-0.34196
700,-0.070802
701,-0.34196
702,-0.34196
703,-0.070802
704,-0.34196
705,-0.34196
706,-0.070802
707,-0.34196
708,-0.34196
709,-0.070802
710,-0.34196
711,-0.34196
712,-0.070802
713,-0.34196
714,-0.34196
715,-0.070802
716,-0.34196
717,-0.34196
718,-0.070802
719,-0.34196
