time,value
0,-1.9468
1,-1.9468
2,-1.9468
3,-1.9468
4,-1.9468
5,-1.9468
6,-1.9468
7,-1.9468
8,-1.9468
9,-1.9468
10,-1.9468
11,-1.9468
12,-1.9468
13,-1.9468
14,-1.9468
15,-1.9468
16,-1.9468
17,-1.9468
18,-1.9104
19,-1.8630000000000002
20,-1.8561
21,-1.8561
22,-1.8561
23,-1.8561
24,-1.8561
25,-1.8509
26,-1.8035
27,-1.7561
28,-1.7087
29,-1.6547
30,-1.5836
31,-1.4952
32,-1.3767
33,-1.2476
34,-1.1054
35,-0.9759899999999999
36,-0.8575299999999999
37,-0.73907
38,-0.62061
39,-0.50215
40,-0.38369000000000003
41,-0.26523
42,-0.14677
43,-0.25358
44,0.22025999999999998
45,0.46585
46,0.14215999999999998
47,0.18954000000000001
48,0.24328000000000002
49,0.33805
50,0.44842
51,0.61427
52,0.75844
53,0.85321
54,0.9479799999999999
55,1.0427
56,1.115
57,1.1624
58,1.2229999999999999
59,1.2941
60,1.3499
61,1.3973
62,1.4446
63,1.492
64,1.5007
65,1.5007
66,1.5007
67,1.5007
68,1.5007
69,1.499
70,1.4753
71,1.4516
72,1.4279
73,1.4042
74,1.3805
75,1.3724
76,1.3961
77,1.41
78,1.41
79,1.4218
80,1.4455
81,1.4831
82,1.5305
83,1.5619
84,1.5856
85,1.5914
86,1.5914
87,1.5515
88,1.5042
89,1.4129
90,1.3181
91,1.2233
92,1.1309
93,1.0598
94,0.9973799999999999
95,0.9736899999999999
96,0.9627100000000001
97,0.9864
98,1.0185
99,1.0659
100,1.0924
101,1.0924
102,1.0676
103,1.0202
104,0.9583799999999999
105,0.8873
106,0.81623
107,0.74515
108,0.65558
109,0.56081
110,0.50707
111,0.45969
112,0.45738
113,0.45651
114,0.43282
115,0.41202
116,0.41202
117,0.40219
118,0.35481
119,0.31436
120,0.29067
121,0.25801999999999997
122,0.21063
123,0.16325
124,0.11587
125,0.33439
126,0.097466
127,0.060555
128,0.060555
129,-0.15968
130,-0.3966
131,-0.14417
132,-0.21524000000000001
133,-0.28631999999999996
134,-0.3574
135,-0.45158999999999994
136,-0.54635
137,-0.64112
138,-0.7358899999999999
139,-0.8306600000000001
140,-0.91994
141,-0.9910100000000001
142,-1.0471
143,-1.0708
144,-1.0849
145,-1.0849
146,-1.0734
147,-1.0497
148,-1.026
149,-1.0023
150,-0.97859
151,-0.9549
152,-0.91358
153,-0.8662
154,-0.83846
155,-0.81477
156,-0.7910699999999999
157,-0.7673800000000001
158,-0.7673800000000001
159,-0.76941
160,-0.7931
161,-0.81274
162,-0.81274
163,-0.80061
164,-0.7532300000000001
165,-0.7139300000000001
166,-0.69024
167,-0.68677
168,-0.7104600000000001
169,-0.75843
170,-0.8295
171,-0.92889
172,-1.0474
173,-1.1982
174,-1.364
175,-1.4571
176,-1.5281
177,-1.5183
178,-1.4946
179,-1.4264
180,-1.3565
181,-1.3328
182,-1.3143
183,-1.338
184,-1.3478
185,-1.3005
186,-1.2464
187,-1.1753
188,-1.0956
189,-1.0008
190,-0.90607
191,-0.8113
192,-0.72924
193,-0.65817
194,-0.60183
195,-0.5544399999999999
196,-0.47353999999999996
197,-0.37878
198,-0.20889000000000002
199,-0.10478
200,0.12858
201,0.27073
202,0.41288
203,0.5492600000000001
204,0.57295
205,0.59028
206,0.5665899999999999
207,0.5585
208,0.6058899999999999
209,0.6604899999999999
210,0.7315699999999999
211,0.7934
212,0.84078
213,0.8656299999999999
214,0.8656299999999999
215,0.82576
216,0.75468
217,0.7448600000000001
218,0.76855
219,0.84425
220,0.9390200000000001
221,0.9950700000000001
222,1.0425
223,0.9615600000000001
224,0.86679
225,0.8188300000000001
226,0.77318
227,0.74948
228,0.72204
229,0.67465
230,0.62727
231,0.5798800000000001
232,0.5403
233,0.51661
234,0.5223899999999999
235,0.56977
236,0.60531
237,0.629
238,0.68043
239,0.75151
240,0.82258
241,0.89366
242,0.92891
243,0.9526
244,0.93642
245,0.9127299999999999
246,0.86708
247,0.8194
248,0.74833
249,0.68187
250,0.65818
251,0.6388199999999999
252,0.6388199999999999
253,0.62611
254,0.57873
255,0.53972
256,0.51603
257,0.47153999999999996
258,0.40046
259,0.35423000000000004
260,0.33054
261,0.30685
262,0.28315999999999997
263,0.24299
264,0.19560999999999998
265,0.16672
266,0.14303
267,0.16036
268,0.18405
269,0.20775
270,0.23144
271,0.25513
272,0.27015
273,0.22276999999999997
274,0.1803
275,0.15661
276,0.13985
277,0.13985
278,0.13985
279,0.13985
280,0.12887
281,0.10518
282,0.4644
283,0.4644
284,0.4644
285,0.4644
286,0.11152999999999999
287,0.13523
288,0.17799
289,0.22537
290,0.27275
291,0.32014000000000004
292,0.29818
293,0.2716
294,0.20052
295,0.13291
296,0.41962
297,0.2376
298,0.2376
299,0.2376
300,0.2376
301,0.28526999999999997
302,0.40373000000000003
303,0.4644
304,0.4644
305,0.4644
306,0.4644
307,0.11009000000000001
308,0.13377999999999998
309,0.15747
310,0.18116
311,0.20486
312,0.22855
313,0.2089
314,0.18520999999999999
315,-0.61544
316,-0.61544
317,-0.61544
318,-0.61544
319,-0.61544
320,-0.61544
321,-0.60542
322,-0.5662699999999999
323,-0.5404899999999999
324,-0.5404899999999999
325,-0.5404899999999999
326,-0.5404899999999999
327,-0.5404899999999999
328,-0.5404899999999999
329,-0.5404899999999999
330,-0.5404899999999999
331,-0.5404899999999999
332,-0.5404899999999999
333,-0.51042
334,-0.47126999999999997
335,-0.46553999999999995
336,-0.46553999999999995
337,-0.46553999999999995
338,-0.46553999999999995
339,-0.46553999999999995
340,-0.45695
341,-0.37866
342,-0.29273000000000005
343,-0.17529
344,-0.29729
345,0.2899
346,0.19135
347,0.34793
348,0.52218
349,0.71791
350,0.91364
351,1.1094
352,1.3051
353,1.5008
354,1.6689
355,1.8255
356,1.9509999999999998
357,2.0684
358,2.1859
359,2.3033
360,2.3453
361,2.3826
362,2.3826
363,2.3931
364,2.4714
365,2.5411
366,2.5802
367,2.6313
368,2.7096
369,2.7726
370,2.8117
371,2.8137
372,2.7745
373,2.7354
374,2.6962
375,2.6571
376,2.6179
377,2.5788
378,2.5396
379,2.5005
380,2.4613
381,2.3869
382,2.3086
383,2.1529
384,2.0021
385,1.9238
386,1.8455
387,1.7672
388,1.7080000000000002
389,1.7080000000000002
390,1.6822
391,1.6039
392,1.5419
393,1.5027
394,1.444
395,1.3657
396,1.3103
397,1.2712
398,1.2058
399,1.1275
400,1.0788
401,1.0397
402,0.9017
403,0.74512
404,0.6248199999999999
405,0.50738
406,0.38994
407,0.27631999999999995
408,0.19802999999999998
409,0.1269
410,0.43073
411,0.28752
412,0.28752
413,0.21829
414,0.13906
415,-0.17317000000000002
416,-0.3689
417,-0.35935
418,-0.16362000000000002
419,-0.20658
420,-0.40231
421,-0.11800000000000001
422,-0.15715
423,-0.22685
424,-0.30514
425,-0.38343
426,-0.46171999999999996
427,-0.50278
428,-0.54193
429,-0.58107
430,-0.62022
431,-0.6593600000000001
432,-0.69039
433,-0.69039
434,-0.69039
435,-0.69039
436,-0.70519
437,-0.74434
438,-0.7653399999999999
439,-0.7653399999999999
440,-0.7438600000000001
441,-0.70472
442,-0.66557
443,-0.62642
444,-0.61544
445,-0.61544
446,-0.58394
447,-0.54479
448,-0.57534
449,-0.61449
450,-0.73002
451,-0.84746
452,-0.9648899999999999
453,-1.0766
454,-1.1549
455,-1.2241
456,-1.2633
457,-1.3024
458,-1.3416
459,-1.3649
460,-1.3649
461,-1.3459
462,-1.3067
463,-1.2451
464,-1.1668
465,-1.037
466,-0.8804
467,-0.7238100000000001
468,-0.56723
469,-0.41063999999999995
470,-0.25406
471,-0.13327999999999998
472,-0.08723600000000001
473,0.30422
474,0.1374
475,0.17655
476,0.20901
477,0.20901
478,0.22905999999999999
479,0.30735
480,0.35891
481,0.35891
482,0.35891
483,0.35891
484,0.35891
485,0.35891
486,0.31213
487,0.23383
488,0.12880999999999998
489,0.3141
490,-0.13614
491,-0.29273000000000005
492,-0.38248000000000004
493,-0.46076999999999996
494,-0.46553999999999995
495,-0.46553999999999995
496,-0.46553999999999995
497,-0.46984
498,-0.5089899999999999
499,-0.53286
500,-0.49371000000000004
501,-0.46553999999999995
502,-0.46553999999999995
503,-0.46553999999999995
504,-0.46553999999999995
505,-0.46553999999999995
506,-0.46553999999999995
507,-0.46553999999999995
508,-0.46553999999999995
509,-0.41685
510,-0.33855999999999997
511,-0.28795
512,-0.24881
513,-0.17862999999999998
514,-0.10034
515,0.053595000000000004
516,0.12976
517,0.28513
518,-0.09678400000000001
519,-0.29251
520,-0.48823999999999995
521,-0.13519
522,-0.16574
523,-0.16574
524,-0.15381
525,-0.11465999999999998
526,-0.10607
527,-0.14520999999999998
528,-0.2216
529,-0.33903
530,-0.41255
531,-0.4517
532,-0.46553999999999995
533,-0.46553999999999995
534,-0.35097
535,-0.19439
536,-0.10177
537,-0.12542999999999999
538,-0.08723600000000001
539,-0.08723600000000001
540,-0.08723600000000001
541,-0.10156
542,-0.29729
543,-0.1032
544,-0.1815
545,-0.25979
546,-0.33808
547,-0.40348
548,-0.44263
549,-0.46553999999999995
550,-0.46553999999999995
551,-0.4264
552,-0.34811
553,-0.26981
554,-0.19152
555,-0.13949
556,-0.10034
557,-0.314
558,-0.11827
559,-0.25193000000000004
560,-0.44766000000000006
561,-0.12707000000000002
562,-0.1667
563,-0.24499
564,-0.31945999999999997
565,-0.35861
566,-0.39775
567,-0.4369
568,-0.46553999999999995
569,-0.46553999999999995
570,-0.47939
571,-0.51853
572,-0.59205
573,-0.70949
574,-0.7653399999999999
575,-0.7653399999999999
576,-0.7892100000000001
577,-0.82836
578,-0.86751
579,-0.90665
580,-0.88469
581,-0.84555
582,-0.8064
583,-0.76725
584,-0.69087
585,-0.61258
586,-0.5342899999999999
587,-0.47031999999999996
588,-0.50946
589,-0.54861
590,-0.5877600000000001
591,-0.61544
592,-0.61544
593,-0.61544
594,-0.61544
595,-0.63359
596,-0.67273
597,-0.69039
598,-0.69039
599,-0.69039
600,-0.69039
601,-0.66223
602,-0.62308
603,-0.55243
604,-0.47413999999999995
605,-0.43068999999999996
606,-0.39155
607,-0.42878
608,-0.46793
609,-0.50708
610,-0.5576800000000001
611,-0.6751199999999999
612,-0.7653399999999999
613,-0.7653399999999999
614,-0.7653399999999999
615,-0.7653399999999999
616,-0.7653399999999999
617,-0.7653399999999999
618,-0.7653399999999999
619,-0.7653399999999999
620,-0.7653399999999999
621,-0.7653399999999999
622,-0.73957
623,-0.7004199999999999
624,-0.66127
625,-0.6221300000000001
626,-0.61544
627,-0.61544
628,-0.61544
629,-0.61544
630,1.1238
631,1.1238
632,1.1238
633,1.1238
634,1.1238
635,1.1238
636,1.1338
637,1.1728
638,1.1986
639,1.1986
640,1.1986
641,1.1986
642,1.1986
643,1.1986
644,1.1986
645,1.1986
646,1.1986
647,1.1986
648,1.2286
649,1.2676
650,1.2733
651,1.2733
652,1.2733
653,1.2733
654,1.2733
655,1.2733
656,1.2733
657,1.2695
658,1.25
659,1.2414
660,1.261
661,1.2662
662,1.2467
663,1.2359
664,1.2359
665,1.2674
666,1.3259999999999998
667,1.3724
668,1.4115
669,1.4367
670,1.4562
671,1.4448
672,1.4253
673,1.4229
674,1.4229
675,1.4229
676,1.4229
677,1.4229
678,1.4203
679,1.4007
680,1.3769
681,1.3379
682,1.3048
683,1.2852
684,1.2581
685,1.219
686,1.1893
687,1.1697
688,1.1283
689,1.0697
690,1.0364
691,1.0169
692,0.96875
693,0.9101600000000001
694,0.8356299999999999
695,0.75751
696,0.6441600000000001
697,0.52699
698,0.39053000000000004
699,0.25527
700,0.1381
701,0.08114600000000001
702,-0.11886
703,-0.25079
704,-0.36796
705,-0.4787
706,-0.57634
707,-0.66588
708,-0.7439899999999999
709,-0.81234
710,-0.87092
711,-0.8952200000000001
712,-0.8952200000000001
713,-0.9083100000000001
714,-0.92784
715,-0.9621299999999999
716,-1.0012
717,-1.0402
718,-1.0793
719,-1.1184
720,-1.1572
721,-1.1767
722,-1.1943
723,-1.1943
724,-1.1943
725,-1.1943
726,-1.1891
727,-1.1696
728,-1.1569
729,-1.1569
730,-1.1741
731,-1.2131
732,-1.242
733,-1.2615
734,-1.3048
735,-1.3634
736,-1.3948
737,-1.4144
738,-1.4339
739,-1.4534
740,-1.4899
741,-1.5289
742,-1.6051
743,-1.6825
744,-1.7411
745,-1.7949
746,-1.8145
747,-1.8299
748,-1.8299
749,-1.8242
750,-1.8047
751,-1.7778
752,-1.7387
753,-1.6997
754,-1.6606
755,-1.6216
756,-1.5825
757,-1.5434
758,-1.5044
759,-1.4653
760,-1.4263
761,-1.4187
762,-1.4187
763,-1.436
764,-1.4556
765,-1.4751
766,-1.4946
767,-1.5142
768,-1.5308
769,-1.5308
770,-1.5218
771,-1.4827
772,-1.4437
773,-1.4046
774,-1.3734
775,-1.3539
776,-1.3439
777,-1.3439
778,-1.3551
779,-1.3746
780,-1.3684
781,-1.3489
782,-1.2858
783,-1.2077
784,-1.1295
785,-1.0514
786,-0.93761
787,-0.82044
788,-0.80091
789,-0.78471
790,-0.80424
791,-0.81377
792,-0.77471
793,-0.71565
794,-0.59849
795,-0.47465
796,-0.33796
797,-0.20126
798,-0.33085
799,0.30262
800,0.1793
801,0.26145999999999997
802,0.32004
803,0.36529
804,0.40434000000000003
805,0.41339
806,0.41339
807,0.43006000000000005
808,0.44959
809,0.50579
810,0.56485
811,0.6429699999999999
812,0.72322
813,0.82086
814,0.9185
815,1.0161
816,1.1083
817,1.1864
818,1.2645
819,1.3426
820,1.3855
821,1.3855
822,1.3855
823,1.3855
824,1.3976
825,1.4172
826,1.4367
827,1.4562
828,1.4758
829,1.4953
830,1.4977
831,1.4977
832,1.4036
833,1.3041
834,1.1674
835,1.0359
836,0.93827
837,0.86206
838,0.86206
839,0.86206
840,0.86206
841,0.8468200000000001
842,0.80776
843,0.73156
844,0.61439
845,0.49722
846,0.38005
847,0.30075
848,0.24216999999999997
849,0.26932
850,0.3279
851,0.38648000000000005
852,0.44506999999999997
853,0.46841000000000005
854,0.48793000000000003
855,0.41101000000000004
856,0.3329
857,0.25479
858,0.17357999999999998
859,0.37168
860,-0.14032999999999998
861,-0.14363
862,-0.22865
863,-0.24816999999999997
864,-0.24341
865,-0.20435999999999999
866,-0.1653
867,-0.12624000000000002
868,-0.44396
869,-0.24868
870,-0.24988000000000002
871,-0.34752
872,-0.37133
873,-0.37133
874,-0.37133
875,-0.37133
876,-0.37133
877,-0.37014
878,-0.2725
879,-0.19391
880,-0.29155
881,-0.38919000000000004
882,-0.48683000000000004
883,-0.11529
884,-0.13482
885,-0.16125
886,-0.20031
887,-0.22221999999999997
888,-0.22221999999999997
889,-0.23246
890,-0.25198000000000004
891,-0.27151
892,-0.29104
893,-0.28342
894,-0.26389
895,-0.25961
896,-0.25961
897,-0.25961
898,-0.25961
899,-0.24103000000000002
900,-0.22079000000000001
901,-0.18173
902,-0.14744000000000002
903,-0.14744000000000002
904,-0.14744000000000002
905,-0.14744000000000002
906,-0.15887
907,-0.19793
908,-0.2296
909,-0.24913000000000002
910,-0.25056
911,-0.23103
912,-0.22221999999999997
913,-0.22221999999999997
914,-0.22221999999999997
915,-0.22221999999999997
916,-0.22221999999999997
917,-0.22221999999999997
918,-0.2065
919,-0.18697
920,-0.16744
921,-0.14790999999999999
922,-0.12839
923,-0.11124
924,-0.13077
925,-0.14744000000000002
926,-0.14744000000000002
927,-0.15195999999999998
928,-0.17149
929,-0.18483
930,-0.18483
931,-0.18483
932,-0.18483
933,-0.1753
934,-0.15577
935,-0.12505
936,-0.43801
937,-0.24273000000000003
938,-0.32771999999999996
939,-0.070076
940,-0.16772
941,-0.14862999999999998
942,-0.28531999999999996
943,-0.33271999999999996
944,-0.37177
