time,value
0,0.048229
1,-0.090098
2,-0.0942
3,0.091291
4,0.21932
5,0.19855
6,-0.30458
7,0.17984
8,-0.062983
9,-0.10549000000000001
10,-0.082588
11,-0.35656
12,0.35925999999999997
13,0.61035
14,0.25911
15,0.16563
16,-0.09485299999999999
17,-0.17864000000000002
18,0.16353
19,0.25535
20,-0.097771
21,0.6048100000000001
22,-0.4208
23,-0.059694000000000004
24,-0.10228
25,-0.3843
26,-0.18516
27,-0.27468000000000004
28,0.3949
29,-0.20327
30,0.22691
31,0.37672
32,-0.26054
33,0.19068
34,0.6506
35,0.23059000000000002
36,0.5671
37,-1.6384
38,-1.6384
39,-1.6384
40,-1.6384
41,-1.6384
42,-1.6384
43,-1.6384
44,-1.6384
45,-1.6384
46,1.6621
47,1.6621
48,1.6621
49,1.6621
50,1.6621
51,1.6621
52,1.6621
53,1.6621
54,1.6621
55,0.52636
56,-0.15317
57,0.2091
58,0.31426
59,0.35974
60,0.21377
61,-0.15008
62,0.3622
63,0.091562
64,0.23142
65,0.29089
66,-0.36175
67,-0.21256999999999998
68,-0.18907000000000002
69,0.25913
70,0.093453
71,-0.037545999999999996
72,-0.5123300000000001
73,-0.5338
74,-0.41776
75,-0.035239
76,0.064211
77,-0.52773
78,-0.010595
79,0.27855
80,0.11879
81,-0.15125
82,-0.061723
83,-0.18329
84,-0.040389
85,-0.39233
86,-0.36975
87,0.72614
88,-0.5243800000000001
89,-0.063051
90,-1.1123
91,0.5975
92,0.24759
93,-0.58511
94,0.11385999999999999
95,-0.53754
96,0.52559
97,0.11675
98,-1.6384
99,-1.6384
100,-1.6384
101,-1.6384
102,-1.6384
103,-1.6384
104,-1.6384
105,-1.6384
106,-1.6384
107,-1.6384
108,-1.6384
109,-1.6384
110,-1.6384
111,1.6621
112,1.6621
113,1.6621
114,1.6621
115,1.6621
116,1.6621
117,1.6621
118,1.6621
119,1.6621
120,1.6621
121,1.6621
122,1.6621
123,0.1196
124,0.55682
125,-0.52466
126,-0.14876
127,0.12499
