time,value
0,-0.42546999999999996
1,0.18287
2,0.9030100000000001
3,1.6678
4,2.3995
5,3.0201
6,3.4619
7,3.6772
8,3.6447
9,3.3722
10,2.8956
11,2.2732
12,1.5773
13,0.88408
14,0.26311
15,-0.23153
16,-0.56734
17,-0.73602
18,-0.75233
19,-0.64959
20,-0.47271
21,-0.27019
22,-0.086273
23,0.045419
24,0.10584
25,0.091697
26,0.013863999999999998
27,-0.1064
28,-0.24256
29,-0.36828
30,-0.46218000000000004
31,-0.5111899999999999
32,-0.512
33,-0.47062
34,-0.40018000000000004
35,-0.31776
36,-0.24075
37,-0.18359
38,-0.15538
39,-0.15879000000000001
40,-0.19021
41,-0.24118
42,-0.30048
43,-0.35656
44,-0.39976999999999996
45,-0.42394
46,-0.42718
47,-0.41173999999999994
48,-0.3831
49,-0.34854
50,-0.31559
51,-0.29054
52,-0.27739
53,-0.27741
54,-0.28924
55,-0.30949
56,-0.33365
57,-0.35713
58,-0.37611999999999995
59,-0.38825
60,-0.3928
61,-0.39061
62,-0.38369000000000003
63,-0.37465
64,-0.36606
65,-0.35999000000000003
66,-0.35765
67,-0.35929
68,-0.36435
69,-0.37164
70,-0.37976
71,-0.38735
72,-0.39343
73,-0.39744
74,-0.39936
75,-0.39955999999999997
76,-0.39864
77,-0.39729000000000003
78,-0.39658000000000004
79,-0.39755999999999997
80,-0.39844
81,-0.39939
82,-0.40057
83,-0.40210999999999997
84,-0.40407
85,-0.40645
86,-0.40928000000000003
87,-0.41198999999999997
88,-0.41434
89,-0.41612
90,-0.41718999999999995
91,-0.41748
92,-0.41705
93,-0.41611000000000004
94,-0.41476999999999997
95,-0.4133
96,-0.41201000000000004
97,-0.41117
98,-0.41100000000000003
