time,value
0,-1.2648
1,-1.3116
2,-1.3584
3,-1.4052
4,-1.4343
5,-1.4435
6,-1.4462
7,-1.4462
8,-1.4462
9,-1.4462
10,-1.4462
11,-1.4462
12,-1.4462
13,-1.4462
14,-1.4462
15,-1.4462
16,-1.4462
17,-1.4462
18,-1.4462
19,-1.4462
20,-1.4462
21,-1.4462
22,-1.4462
23,-1.4462
24,-1.4462
25,-1.4462
26,-1.4462
27,-1.4462
28,-1.4462
29,-1.4462
30,-1.4462
31,-1.4462
32,-1.4462
33,-1.4462
34,-1.4488
35,-1.454
36,-1.4722
37,-1.4956
38,-1.5185
39,-1.5369
40,-1.5369
41,-1.5369
42,-1.5369
43,-1.5369
44,-1.5369
45,-1.5369
46,-1.5379
47,-1.5453
48,-1.5543
49,-1.5659999999999998
50,-1.5715
51,-1.5731
52,-1.5635
53,-1.5518
54,-1.5401
55,-1.5284
56,-1.5167
57,-1.505
58,-1.4933
59,-1.4816
60,-1.4699
61,-1.4582
62,-1.4491
63,-1.4472
64,-1.4462
65,-1.4462
66,-1.4408
67,-1.4332
68,-1.4217
69,-1.4089
70,-1.392
71,-1.3723
72,-1.3489
73,-1.3255
74,-1.3021
75,-1.2787
76,-1.2554
77,-1.2326
78,-1.214
79,-1.2023
80,-1.1906
81,-1.1789
82,-1.1587
83,-1.1369
84,-1.1135
85,-1.0901
86,-1.0667
87,-1.0433
88,-1.0199
89,-0.9922200000000001
90,-0.96326
91,-0.92816
92,-0.89307
93,-0.8579700000000001
94,-0.8228700000000001
95,-0.78777
96,-0.75375
97,-0.7201
98,-0.7079
99,-0.6962
100,-0.6845
101,-0.6682600000000001
102,-0.64645
103,-0.62355
104,-0.60016
105,-0.56239
106,-0.5221600000000001
107,-0.47536999999999996
108,-0.42857
109,-0.38177
110,-0.33498
111,-0.28818
112,-0.24139000000000002
113,-0.19459
114,-0.14779
115,-0.10099999999999999
116,-0.29039
117,-0.056409
118,0.17757
119,0.41155
120,0.13344
121,0.19049000000000002
122,0.24795
123,0.30645
124,0.36494
125,0.42344
126,0.48193
127,0.54043
128,0.58778
129,0.63229
130,0.66738
131,0.6994199999999999
132,0.72787
133,0.74466
134,0.75635
135,0.7671100000000001
136,0.7759999999999999
137,0.7759999999999999
138,0.7759999999999999
139,0.7759999999999999
140,0.7693399999999999
141,0.75894
142,0.7474
143,0.73752
144,0.742
145,0.7489899999999999
146,0.76069
147,0.78251
148,0.8115399999999999
149,0.85515
150,0.9021399999999999
151,0.9524
152,1.0051
153,1.0636
154,1.1208
155,1.177
156,1.2171
157,1.2522
158,1.2873
159,1.3174
160,1.3314
161,1.3443
162,1.3559999999999999
163,1.3561
164,1.3513
165,1.34
166,1.3294
167,1.3236
168,1.3202
169,1.3202
170,1.3155
171,1.3083
172,1.2867
173,1.2633
174,1.2399
175,1.2165
176,1.1931
177,1.1697
178,1.1463
179,1.1318
180,1.1192
181,1.1075
182,1.0958
183,1.0841
184,1.0724
185,1.0607
186,1.0537
187,1.0481
188,1.0481
189,1.0490000000000002
190,1.0528
191,1.0604
192,1.0721
193,1.0817
194,1.0905
195,1.0797
196,1.068
197,1.0563
198,1.0446
199,1.0329
200,1.0212
201,1.0095
202,0.99019
203,0.96954
204,0.94614
205,0.92504
206,0.90786
207,0.894
208,0.8823
209,0.8706
210,0.8589
211,0.8472
212,0.835
213,0.82171
214,0.80286
215,0.77946
216,0.75607
217,0.73242
218,0.69805
219,0.6634800000000001
220,0.62839
221,0.5975699999999999
222,0.57114
223,0.54693
224,0.52353
225,0.51241
226,0.50389
227,0.50389
228,0.50743
229,0.51552
230,0.53393
231,0.55733
232,0.57915
233,0.59936
234,0.61106
235,0.62275
236,0.63445
237,0.64615
238,0.65785
239,0.66955
240,0.6804600000000001
241,0.68335
242,0.68529
243,0.68529
244,0.67799
245,0.66499
246,0.6437
247,0.6203
248,0.5969
249,0.5735
250,0.5501
251,0.52671
252,0.50331
253,0.47991000000000006
254,0.45651
255,0.43311000000000005
256,0.41212
257,0.39999
258,0.38805
259,0.37635
260,0.37079
261,0.36805
262,0.36783000000000005
263,0.36991999999999997
264,0.38321
265,0.40047
266,0.42386999999999997
267,0.44454
268,0.46361
269,0.4763
270,0.488
271,0.4997
272,0.5114
273,0.5231
274,0.53479
275,0.5464899999999999
276,0.54896
277,0.54924
278,0.54924
279,0.54924
280,0.54924
281,0.54924
282,0.54924
283,0.54413
284,0.5373399999999999
285,0.5257
286,0.515
287,0.50778
288,0.50389
289,0.50389
290,0.50389
291,0.50389
292,0.50389
293,0.50389
294,0.50389
295,0.50389
296,0.50389
297,0.50389
298,0.50389
299,0.49578999999999995
300,0.48627
301,0.47457
302,0.46528
303,0.46052
304,0.45853
305,0.45853
306,0.45095
307,0.44091
308,0.41752
309,0.39547
310,0.37669
311,0.36783000000000005
312,0.36783000000000005
313,0.36783000000000005
314,0.36783000000000005
315,-0.28739000000000003
316,-0.24981
317,-0.21224
318,-0.17465999999999998
319,-0.15131
320,-0.14389000000000002
321,-0.14172
322,-0.14172
323,-0.14172
324,-0.14172
325,-0.14172
326,-0.14172
327,-0.14172
328,-0.14172
329,-0.14172
330,-0.14172
331,-0.14172
332,-0.14172
333,-0.14172
334,-0.14172
335,-0.14172
336,-0.14172
337,-0.14172
338,-0.14172
339,-0.14172
340,-0.14172
341,-0.14172
342,-0.14172
343,-0.14172
344,-0.14172
345,-0.14172
346,-0.14172
347,-0.14172
348,-0.14172
349,-0.13768
350,-0.12933
351,-0.099963
352,-0.33131
353,-0.14784
354,-0.21711999999999998
355,-0.21711999999999998
356,-0.21711999999999998
357,-0.21711999999999998
358,-0.21711999999999998
359,-0.21711999999999998
360,-0.21711999999999998
361,0.081591
362,0.13466
363,0.27876999999999996
364,0.46666
365,0.13479000000000002
366,0.17237
367,0.20995
368,0.24683000000000002
369,0.27559
370,0.29531
371,0.29531
372,0.29569
373,0.29639
374,0.31132
375,0.3301
376,0.34889000000000003
377,0.36768
378,0.38647
379,0.40526
380,0.42405
381,0.45165
382,0.4825
383,0.51985
384,0.55743
385,0.59501
386,0.63259
387,0.6701699999999999
388,0.70462
389,0.73756
390,0.75762
391,0.77641
392,0.7952
393,0.81399
394,0.83278
395,0.85157
396,0.87036
397,0.88915
398,0.90794
399,0.9267299999999999
400,0.94952
401,0.98061
402,1.0153
403,1.0529
404,1.0836
405,1.1123
406,1.1311
407,1.1499
408,1.1687
409,1.1875
410,1.2062
411,1.225
412,1.2438
413,1.2626
414,1.2814
415,1.3002
416,1.319
417,1.3378
418,1.3566
419,1.3754
420,1.4057
421,1.4380000000000002
422,1.4756
423,1.5131
424,1.5507
425,1.5883
426,1.6259
427,1.6679
428,1.7119
429,1.7683
430,1.8237
431,1.8773
432,1.911
433,1.9298
434,1.9485
435,1.9666
436,1.9689
437,1.9706
438,1.9706
439,1.964
440,1.9512
441,1.9339
442,1.9151
443,1.8785
444,1.8372
445,1.7808
446,1.7269
447,1.6759
448,1.6342
449,1.5967
450,1.5591
451,1.5215
452,1.4839
453,1.4463
454,1.4088
455,1.3819
456,1.361
457,1.3419
458,1.3261
459,1.3333
460,1.3445
461,1.3633
462,1.3767
463,1.3862
464,1.3879
465,1.3876
466,1.382
467,1.3726
468,1.3538
469,1.3321
470,1.3077
471,1.2445
472,1.1694
473,1.0942
474,1.0151
475,0.92296
476,0.83
477,0.73605
478,0.65146
479,0.5707399999999999
480,0.49527
481,0.42011000000000004
482,0.34495
483,0.26979000000000003
484,0.19464
485,0.12704000000000001
486,0.298
487,0.095513
488,-0.09109099999999999
489,-0.26855
490,-0.41598
491,-0.098108
492,-0.1169
493,-0.13569
494,-0.1402
495,-0.14172
496,-0.14172
497,-0.14987999999999999
498,-0.17679
499,-0.20945
500,-0.24703000000000003
501,-0.28461
502,-0.32219000000000003
503,-0.35977
504,-0.39884000000000003
505,-0.44245
506,-0.49222
507,-0.5485899999999999
508,-0.6016199999999999
509,-0.65335
510,-0.67362
511,-0.6924100000000001
512,-0.7112
513,-0.7299899999999999
514,-0.74878
515,-0.76757
516,-0.7863600000000001
517,-0.80515
518,-0.82394
519,-0.84273
520,-0.85782
521,-0.8666299999999999
522,-0.8701
523,-0.8701
524,-0.8753799999999999
525,-0.8826200000000001
526,-0.90141
527,-0.9194
528,-0.9356399999999999
529,-0.94294
530,-0.94294
531,-0.94294
532,-0.9433299999999999
533,-0.96096
534,-0.9788899999999999
535,-0.9976799999999999
536,-1.0165
537,-1.0353
538,-1.054
539,-1.0728
540,-1.0818
541,-1.0886
542,-1.0886
543,-1.0886
544,-1.0886
545,-1.0886
546,-1.0886
547,-1.0886
548,-1.0886
549,-1.0886
550,-1.0886
551,-1.0886
552,-1.0886
553,-1.0886
554,-1.0886
555,-1.0899
556,-1.104
557,-1.1197
558,-1.1385
559,-1.1514
560,-1.1598
561,-1.1614
562,-1.1614
563,-1.1614
564,-1.1614
565,-1.1614
566,-1.1614
567,-1.1614
568,-1.1614
569,-1.1614
570,-1.1614
571,-1.1653
572,-1.1834
573,-1.2018
574,-1.2206
575,-1.2197
576,-1.2097
577,-1.1916
578,-1.1745
579,-1.1664
580,-1.1614
581,-1.1614
582,-1.1571
583,-1.1501
584,-1.1329
585,-1.1145
586,-1.0989
587,-1.0886
588,-1.0886
589,-1.0886
590,-1.0886
591,-1.0738
592,-1.0554
593,-1.0367
594,-1.022
595,-1.0178
596,-1.0158
597,-1.0158
598,-1.0158
599,-1.0158
600,-1.0158
601,-1.0142
602,-1.0070000000000001
603,-0.9944299999999999
604,-0.97564
605,-0.9592799999999999
606,-0.9439700000000001
607,-0.94294
608,-0.94294
609,-0.94294
610,-0.94294
611,-0.94294
612,-0.94294
613,-0.94294
614,-0.94294
615,-0.94294
616,-0.94294
617,-0.94294
618,-0.94294
619,-0.94294
620,-0.94294
621,-0.94294
622,-0.94294
623,-0.94294
624,-0.94185
625,-0.93814
626,-0.9264700000000001
627,-0.9076799999999999
628,-0.88889
629,-0.8701
630,1.9356
631,1.9012
632,1.8668
633,1.8323
634,1.8109
635,1.8041
636,1.8021
637,1.8021
638,1.8021
639,1.8021
640,1.8021
641,1.8021
642,1.8021
643,1.8021
644,1.8021
645,1.8021
646,1.8021
647,1.8021
648,1.8021
649,1.8021
650,1.8021
651,1.8021
652,1.8021
653,1.8021
654,1.8021
655,1.8021
656,1.8021
657,1.8021
658,1.8021
659,1.8021
660,1.8021
661,1.8021
662,1.8021
663,1.8021
664,1.7947
665,1.7794
666,1.7256
667,1.6567
668,1.5894
669,1.5351
670,1.5351
671,1.5351
672,1.5351
673,1.5351
674,1.5351
675,1.5351
676,1.5263
677,1.4613
678,1.382
679,1.2787
680,1.1934
681,1.1199
682,1.0793
683,1.0455
684,1.0191
685,1.001
686,1.001
687,1.001
688,1.001
689,1.001
690,1.001
691,1.001
692,0.99356
693,0.96465
694,0.9329999999999999
695,0.89856
696,0.8641200000000001
697,0.82967
698,0.79523
699,0.76079
700,0.72635
701,0.69191
702,0.65747
703,0.62303
704,0.58858
705,0.55414
706,0.51945
707,0.48331
708,0.43466000000000005
709,0.36578
710,0.29689
711,0.22801
712,0.18417999999999998
713,0.14509
714,0.11065
715,0.36167
716,0.18946
717,0.08757999999999999
718,-0.15495
719,-0.20165
720,-0.21023000000000003
721,-0.28093
722,0.15827
723,0.41977
724,0.16593
725,0.26925
726,0.371
727,0.4722
728,0.54181
729,0.61069
730,0.6795800000000001
731,0.7217100000000001
732,0.73106
733,0.7340000000000001
734,0.7340000000000001
735,0.6705399999999999
736,0.59624
737,0.49291
738,0.37688
739,0.24124
740,0.39355999999999997
741,-0.46748
742,-0.24564
743,-0.39407
744,-0.49738999999999994
745,-0.59814
746,-0.69381
747,-0.7346600000000001
748,-0.7346600000000001
749,-0.7346600000000001
750,-0.73058
751,-0.64002
752,-0.54586
753,-0.44254
754,-0.3513
755,-0.27136
756,-0.19975
757,-0.13086
758,-0.49325
759,-0.3548
760,-0.3548
761,-0.42238000000000003
762,-0.10994000000000001
763,-0.19082000000000002
764,-0.29414
765,-0.40024
766,-0.51185
767,-0.64961
768,-0.78738
769,-0.92515
770,-1.0629
771,-1.2007
772,-1.3384
773,-1.4682
774,-1.5345
775,-1.5897
776,-1.6242
777,-1.6388
778,-1.6392
779,-1.611
780,-1.5748
781,-1.5098
782,-1.4235
783,-1.2857
784,-1.148
785,-1.0102
786,-0.8724200000000001
787,-0.7346600000000001
788,-0.5968899999999999
789,-0.47376999999999997
790,-0.39808000000000004
791,-0.32561
792,-0.25672
793,-0.25647
794,-0.28453
795,-0.35112
796,-0.42313999999999996
797,-0.50945
798,-0.6028399999999999
799,-0.70617
800,-0.82335
801,-0.9479299999999999
802,-1.1148
803,-1.2865
804,-1.4549
805,-1.6123
806,-1.75
807,-1.8878
808,-2.0256
809,-2.0849
810,-2.1276
811,-2.1621
812,-2.1741
813,-2.1345
814,-2.0792
815,-2.0103
816,-1.9137
817,-1.8087
818,-1.671
819,-1.5359
820,-1.4092
821,-1.2938
822,-1.1905
823,-1.0902
824,-0.9911399999999999
825,-0.9209
826,-0.85201
827,-0.78313
828,-0.74148
829,-0.73638
830,-0.7346600000000001
831,-0.7346600000000001
832,-0.75721
833,-0.78355
834,-0.818
835,-0.85244
836,-0.8868799999999999
837,-0.92132
838,-0.95576
839,-0.9611799999999999
840,-0.95576
841,-0.8868799999999999
842,-0.81652
843,-0.7429600000000001
844,-0.6530199999999999
845,-0.54969
846,-0.44637
847,-0.34376999999999996
848,-0.27276
849,-0.2023
850,-0.13342
851,-0.40510999999999997
852,-0.18825
853,-0.054157000000000004
854,0.1682
855,0.15963
856,0.11292999999999999
857,-0.05927999999999999
858,-0.23149
859,-0.4037
860,-0.1113
861,-0.14575
862,-0.18019000000000002
863,-0.21463000000000002
864,-0.24906999999999999
865,-0.28351
866,-0.31795
867,-0.3524
868,-0.38684
869,-0.42128000000000004
870,-0.45338999999999996
871,-0.46188999999999997
872,-0.46763000000000005
873,-0.46763000000000005
874,-0.45688
875,-0.43773999999999996
876,-0.4064
877,-0.37196
878,-0.33751
879,-0.30307
880,-0.26863000000000004
881,-0.23419
882,-0.19975
883,-0.16530999999999998
884,-0.13086
885,-0.09642300000000001
886,-0.36469
887,-0.35831
888,-0.3548
889,-0.3548
890,-0.44514
891,-0.11150999999999998
892,-0.14532
893,-0.17669
894,-0.19157000000000002
895,-0.2006
896,-0.2006
897,-0.21665
898,-0.24216
899,-0.3052
900,-0.37228
901,-0.4233
902,-0.44551999999999997
903,-0.41107
904,-0.37663
905,-0.34219
906,-0.30775
907,-0.27331
908,-0.23886999999999997
909,-0.20442000000000002
910,-0.16998
911,-0.13554000000000002
912,-0.1011
913,-0.35267
914,-0.18045999999999998
915,-0.082504
916,0.14914000000000002
917,0.25544
918,0.31277
919,0.31277
920,0.26834
921,0.20456
922,-0.12094
923,-0.46535
924,-0.15808
925,-0.19944
926,-0.20029
927,-0.2006
928,-0.2006
929,-0.22445
930,-0.25246999999999997
931,-0.28691
932,-0.31425
933,-0.32828
934,-0.33411
935,-0.33411
936,-0.32295
937,-0.30817
938,-0.27373000000000003
939,-0.24128000000000002
940,-0.21364
941,-0.2006
942,-0.2006
943,-0.2006
944,-0.2006
