time,value
0,0.71716
1,0.47331000000000006
2,0.47331000000000006
3,-0.7459399999999999
4,-1.3556
5,-1.4165
6,-1.4165
7,-1.4165
8,-1.4165
9,-1.4775
10,-1.4165
11,-1.4165
12,-1.4165
13,-1.4165
14,-1.4165
15,-1.4165
16,-1.4165
17,-1.4165
18,-1.4775
19,-1.4165
20,-1.4165
21,-1.4165
22,-1.4165
23,-1.4165
24,-1.4165
25,-1.4165
26,-1.4165
27,-1.4775
28,-1.4165
29,-1.4165
30,-1.4165
31,-1.4165
32,-1.4165
33,-1.4165
34,-1.4165
35,-1.4165
36,-1.4775
37,-1.4165
38,-1.4165
39,-1.4165
40,-1.4165
41,-1.4165
42,-1.4165
43,-1.4165
44,-1.4165
45,-1.4775
46,-1.4165
47,-1.4165
48,-1.4165
49,-1.4165
50,-1.4165
51,-1.4165
52,-1.4165
53,-1.4165
54,-1.4165
55,-1.4775
56,-1.4165
57,-1.4165
58,-1.4165
59,-1.4165
60,-1.4165
61,-1.4165
62,-1.4165
63,-1.4165
64,-1.4775
65,-1.4165
66,-1.4165
67,-1.4165
68,-1.4165
69,-1.4165
70,-1.4165
71,-1.4165
72,-1.4165
73,-1.4775
74,-1.4165
75,-1.4165
76,-1.4165
77,-1.4165
78,-1.4165
79,-1.4165
80,-1.4165
81,-1.4775
82,-1.4165
83,-1.4165
84,-1.4165
85,-1.4165
86,-1.4165
87,-1.4165
88,-1.4165
89,-1.4165
90,-1.4775
91,-1.4165
92,-1.4165
93,-1.4165
94,-1.4165
95,-1.4165
96,-1.4165
97,-1.4165
98,-1.4165
99,-1.4775
100,-1.4165
101,-1.4165
102,-1.4165
103,-1.4165
104,-1.4165
105,-1.4165
106,-1.4165
107,-1.4165
108,-1.4775
109,-1.4165
110,-1.4165
111,-1.4165
112,-1.4165
113,-1.4165
114,-1.4165
115,-1.4165
116,-1.4165
117,-1.4775
118,-1.4165
119,-1.4165
120,-1.4165
121,-1.4165
122,-1.4165
123,-1.4165
124,-1.4165
125,-1.4165
126,-1.4775
127,-1.4165
128,-1.4165
129,-1.4165
130,-1.4165
131,-1.4165
132,-1.4165
133,-1.4165
134,-1.4165
135,-1.4775
136,-1.4165
137,-1.4165
138,-1.4165
139,-1.4165
140,-1.4165
141,-1.4165
142,-1.4165
143,-1.4165
144,-1.4775
145,-1.4165
146,-1.4165
147,-1.4165
148,-1.4165
149,-1.4165
150,-1.4165
151,-1.4165
152,-1.4165
153,-1.4775
154,-1.4165
155,-1.4165
156,-1.4165
157,-1.4165
158,-1.4165
159,-1.4165
160,-1.4165
161,-1.4775
162,-1.4165
163,-1.4165
164,-1.4165
165,-1.4165
166,-1.4165
167,-1.4165
168,-1.4165
169,-1.4775
170,-1.4165
171,-1.4165
172,-1.4165
173,-1.4165
174,-1.4165
175,-1.4165
176,-1.4165
177,-1.4165
178,-1.4775
179,-1.4165
180,-1.4165
181,-0.98979
182,0.961
183,0.961
184,0.71716
185,0.961
186,0.961
187,0.961
188,0.71716
189,0.961
190,0.71716
191,0.961
192,0.961
193,0.71716
194,0.71716
195,0.961
196,0.71716
197,0.961
198,0.71716
199,0.961
200,0.71716
201,0.961
202,0.71716
203,0.961
204,0.961
205,0.71716
206,0.71716
207,0.71716
208,0.71716
209,0.71716
210,0.71716
211,0.71716
212,0.961
213,0.71716
214,0.71716
215,0.71716
216,0.71716
217,0.71716
218,0.961
219,0.71716
220,0.71716
221,0.961
222,0.71716
223,0.47331000000000006
224,0.71716
225,0.71716
226,0.71716
227,0.71716
228,0.47331000000000006
229,0.71716
230,0.71716
231,0.47331000000000006
232,0.71716
233,0.71716
234,0.71716
235,0.71716
236,0.71716
237,0.71716
238,0.961
239,0.71716
240,0.961
241,0.71716
242,0.961
243,0.71716
244,0.47331000000000006
245,0.71716
246,0.71716
247,0.47331000000000006
248,0.71716
249,0.71716
250,0.47331000000000006
251,0.71716
252,0.47331000000000006
253,0.71716
254,0.71716
255,0.71716
256,0.71716
257,0.47331000000000006
258,0.71716
259,0.47331000000000006
260,0.71716
261,0.47331000000000006
262,0.71716
263,0.71716
264,0.47331000000000006
265,0.47331000000000006
266,0.71716
267,0.47331000000000006
268,-0.014394
269,-1.2946
270,-1.4775
271,-1.4165
272,-1.4165
273,-1.4165
274,-1.4165
275,-1.4165
276,-1.4165
277,-1.4165
278,-1.4165
279,-1.4775
280,-1.4165
281,-1.4165
282,-1.4165
283,-1.4165
284,-1.4165
285,-1.4165
286,-1.4165
287,-1.4165
288,-1.4165
289,-1.4775
290,-1.4165
291,-1.4165
292,-1.4165
293,-1.4165
294,-1.4165
295,-1.4165
296,-1.4165
297,-1.4165
298,-1.4165
299,-1.4165
300,-1.4775
301,-1.4165
302,-1.4165
303,-1.4165
304,-1.4165
305,-1.4165
306,-1.4165
307,-1.4165
308,-1.4165
309,-0.56306
310,0.961
311,0.71716
312,0.961
313,0.961
314,0.71716
315,0.961
316,0.961
317,0.71716
318,0.71716
319,0.961
320,0.71716
321,0.961
322,0.71716
323,0.71716
324,0.961
325,0.71716
326,0.961
327,0.71716
328,-0.19727999999999998
329,-1.2946
330,-1.4165
331,-1.4165
332,-1.4165
333,-1.4165
334,-1.4165
335,-1.4775
336,-1.4165
337,-1.4165
338,-1.4165
339,-1.4165
340,-1.4165
341,-1.4165
342,-1.4165
343,-1.4165
344,0.47331000000000006
345,0.71716
346,0.71716
347,0.961
348,0.961
349,0.71716
350,0.71716
351,0.71716
352,0.961
353,0.71716
354,0.71716
355,0.71716
356,0.71716
357,0.71716
358,0.71716
359,0.71716
360,0.71716
361,0.71716
362,0.71716
363,0.71716
364,0.71716
365,0.71716
366,0.71716
367,0.71716
368,0.71716
369,0.71716
370,0.71716
371,0.71716
372,0.47331000000000006
373,0.71716
374,0.71716
375,0.71716
376,0.71716
377,0.71716
378,0.71716
379,0.71716
380,0.47331000000000006
381,0.71716
382,0.71716
383,0.47331000000000006
384,0.71716
385,0.71716
386,0.71716
387,0.47331000000000006
388,0.47331000000000006
389,0.22946
390,0.47331000000000006
391,0.71716
392,0.47331000000000006
393,0.71716
394,0.71716
395,0.71716
396,0.47331000000000006
397,0.71716
398,0.71716
399,0.71716
400,0.71716
401,0.47331000000000006
402,0.71716
403,0.71716
404,0.71716
405,0.47331000000000006
406,0.47331000000000006
407,0.71716
408,0.71716
409,0.47331000000000006
410,0.71716
411,0.71716
412,0.71716
413,0.71716
414,0.71716
415,0.71716
416,0.47331000000000006
417,0.71716
418,0.47331000000000006
419,0.71716
420,0.71716
421,0.47331000000000006
422,0.71716
423,0.71716
424,0.71716
425,0.47331000000000006
426,0.71716
427,0.71716
428,0.71716
429,0.71716
430,0.47331000000000006
431,0.71716
432,0.47331000000000006
433,0.47331000000000006
434,0.71716
435,0.47331000000000006
436,0.71716
437,0.71716
438,0.47331000000000006
439,0.47331000000000006
440,0.71716
441,0.71716
442,0.71716
443,0.71716
444,0.71716
445,0.47331000000000006
446,0.71716
447,0.71716
448,0.71716
449,0.961
450,0.961
451,0.961
452,1.2658
453,0.961
454,0.961
455,0.961
456,0.961
457,1.2658
458,0.961
459,0.961
460,0.961
461,0.961
462,0.961
463,1.2658
464,0.961
465,0.961
466,0.961
467,0.961
468,0.961
469,0.961
470,0.961
471,0.961
472,0.961
473,0.961
474,1.2658
475,0.961
476,0.961
477,0.961
478,0.961
479,0.961
480,0.961
481,0.961
482,0.961
483,0.961
484,0.961
485,0.961
486,1.2658
487,0.961
488,0.961
489,0.961
490,0.961
491,0.961
492,0.961
493,0.961
494,0.961
495,0.961
496,0.961
497,0.961
498,0.961
499,0.961
500,0.961
501,0.961
502,1.2658
503,0.961
504,0.961
505,0.961
506,0.961
507,0.961
508,0.961
509,0.961
510,0.961
511,0.961
512,0.961
513,0.961
514,0.961
515,0.961
516,0.961
517,0.961
518,0.961
519,0.71716
520,0.71716
521,0.71716
522,0.71716
523,0.47331000000000006
524,0.47331000000000006
525,0.71716
526,0.71716
527,0.71716
528,0.47331000000000006
529,0.71716
530,0.71716
531,0.71716
532,0.71716
533,0.47331000000000006
534,0.47331000000000006
535,0.71716
536,0.47331000000000006
537,0.47331000000000006
538,0.71716
539,0.71716
540,0.71716
541,0.47331000000000006
542,0.47331000000000006
543,0.22946
544,0.47331000000000006
545,0.71716
546,0.71716
547,0.47331000000000006
548,0.47331000000000006
549,0.47331000000000006
550,0.71716
551,0.71716
552,0.71716
553,0.47331000000000006
554,0.71716
555,0.71716
556,0.71716
557,0.71716
558,0.47331000000000006
559,0.71716
560,0.71716
561,0.71716
562,0.47331000000000006
563,0.71716
564,0.71716
565,0.47331000000000006
566,0.47331000000000006
567,0.47331000000000006
568,0.961
569,0.47331000000000006
570,0.71716
571,0.71716
572,0.71716
573,0.47331000000000006
574,0.71716
575,0.71716
576,0.71716
577,0.71716
578,0.47331000000000006
579,0.71716
580,0.71716
581,0.47331000000000006
582,0.71716
583,0.71716
584,0.47331000000000006
585,0.47331000000000006
586,0.47331000000000006
587,0.47331000000000006
588,0.71716
589,0.71716
590,0.71716
591,0.47331000000000006
592,0.47331000000000006
593,0.71716
594,0.71716
595,0.71716
596,0.71716
597,0.71716
598,0.71716
599,0.71716
600,0.47331000000000006
601,0.71716
602,0.71716
603,0.47331000000000006
604,0.71716
605,0.71716
606,0.47331000000000006
607,0.71716
608,0.71716
609,0.71716
610,0.71716
611,0.71716
612,0.22946
613,0.47331000000000006
614,0.71716
615,0.71716
616,0.47331000000000006
617,0.47331000000000006
618,0.71716
619,0.47331000000000006
620,0.47331000000000006
621,0.71716
622,0.47331000000000006
623,0.47331000000000006
624,0.47331000000000006
625,0.47331000000000006
626,0.47331000000000006
627,0.71716
628,0.47331000000000006
629,0.47331000000000006
630,0.22946
631,0.47331000000000006
632,0.47331000000000006
633,0.47331000000000006
634,0.47331000000000006
635,0.22946
636,0.47331000000000006
637,0.22946
638,0.22946
639,0.47331000000000006
640,0.71716
641,0.22946
642,0.47331000000000006
643,0.22946
644,0.47331000000000006
645,0.22946
646,0.47331000000000006
647,0.22946
648,0.47331000000000006
649,0.22946
650,0.47331000000000006
651,0.22946
652,0.47331000000000006
653,0.47331000000000006
654,0.47331000000000006
655,0.47331000000000006
656,0.22946
657,0.47331000000000006
658,0.22946
659,0.47331000000000006
660,0.71716
661,0.71716
662,0.47331000000000006
663,0.71716
664,0.47331000000000006
665,0.47331000000000006
666,0.71716
667,0.47331000000000006
668,0.71716
669,0.71716
670,0.47331000000000006
671,0.71716
672,0.71716
673,0.47331000000000006
674,0.47331000000000006
675,0.71716
676,0.47331000000000006
677,0.71716
678,0.47331000000000006
679,0.47331000000000006
680,0.71716
681,0.47331000000000006
682,0.71716
683,0.71716
684,0.47331000000000006
685,0.71716
686,0.71716
687,0.47331000000000006
688,0.71716
689,0.71716
690,0.47331000000000006
691,0.71716
692,0.71716
693,0.47331000000000006
694,0.71716
695,0.47331000000000006
696,0.47331000000000006
697,0.71716
698,0.47331000000000006
699,0.71716
700,0.71716
701,0.47331000000000006
702,0.71716
703,0.47331000000000006
704,0.71716
705,0.47331000000000006
706,0.47331000000000006
707,0.47331000000000006
708,0.22946
709,0.47331000000000006
710,0.47331000000000006
711,0.47331000000000006
712,0.47331000000000006
713,0.47331000000000006
714,0.47331000000000006
715,0.47331000000000006
716,0.22946
717,0.22946
718,0.47331000000000006
719,0.47331000000000006
