time,value
0,0.46796000000000004
1,0.4483
2,0.4483
3,0.42208
4,0.36309
5,0.28444
6,0.2189
7,0.14025
8,0.022269999999999998
9,0.055041
10,-0.056380999999999994
11,-0.056380999999999994
12,-0.043273
13,-0.10226
14,-0.049826999999999996
15,0.061596000000000005
16,0.11402999999999999
17,0.17302
18,0.25822
19,0.36965
20,0.43518999999999997
21,0.58594
22,0.65803
23,0.7104699999999999
24,0.82844
25,0.91365
26,0.9923
27,1.0841
28,1.1955
29,1.0972
30,1.1889
31,1.1496
32,1.1496
33,1.2151
34,1.0906
35,1.0644
36,1.0316
37,0.89399
38,0.82844
39,0.7104699999999999
40,0.7104699999999999
41,0.6514800000000001
42,0.6056
43,0.59905
44,0.48762
45,0.43518999999999997
46,0.40897
47,0.29755
48,0.25167
49,0.21234
50,0.14025
51,0.11402999999999999
52,0.087813
53,0.041933
54,0.022269999999999998
55,0.035378
56,-0.030164
57,0.0026070999999999998
58,0.10092000000000001
59,0.16646
60,0.25167
61,0.31066
62,0.3762
63,0.42863
64,0.46796000000000004
65,0.5728300000000001
66,0.5662699999999999
67,0.7104699999999999
68,0.835
69,0.8808799999999999
70,0.9202
71,1.0775
72,1.1103
73,1.0513
74,1.202
75,1.2086
76,1.3266
77,1.3266
78,1.379
79,1.4118
80,1.4773
81,1.6477
82,1.615
83,1.746
84,1.7985
85,1.9427
86,1.9689
87,1.8968
88,1.7723
89,1.7133
90,1.6543
91,1.615
92,1.5363
93,1.4445
94,1.379
95,1.3266
96,1.2872
97,1.2676
98,1.1955
99,1.1234
100,1.0447
101,0.97919
102,0.90054
103,0.7301300000000001
104,0.65803
105,0.6973600000000001
106,0.71702
107,0.73668
108,0.80878
109,0.80878
110,0.86777
111,0.8874299999999999
112,0.97919
113,1.0775
114,1.0251
115,0.98575
116,0.97919
117,0.9595299999999999
118,0.8743200000000001
119,0.84811
120,0.82844
121,0.80878
122,0.78256
123,0.74979
124,0.7104699999999999
125,0.68425
126,0.67114
127,0.67114
128,0.82844
129,0.7760100000000001
130,0.8808799999999999
131,0.8546600000000001
132,0.84155
133,0.9595299999999999
134,1.071
135,1.071
136,1.143
137,1.2807
138,1.3462
139,1.3135
140,1.4118
141,1.4314
142,1.5232
143,1.6018
144,1.5756
145,1.6084
146,1.5822
147,1.4904
148,1.3987
149,1.3397
150,1.2479
151,1.2414
152,1.2086
153,1.2348
154,1.2479
155,1.2151
156,1.3331
157,1.3921
158,1.4511
159,1.5166
160,1.6215
161,1.8116
162,1.8181
163,1.9033
164,1.9623
165,2.1196
166,2.1196
167,2.1590000000000003
168,2.3359
169,2.2442
170,2.2966
171,2.349
172,2.3359
173,2.2442
174,2.2179
175,2.1524
176,1.9754
177,1.8181
178,1.8247
179,1.7591
180,1.7657
181,1.7067
182,1.746
183,1.6805
184,1.5953
185,1.5625
186,1.5363
187,1.5363
188,1.4642
189,1.4314
190,1.2872
191,1.2414
192,1.2151
193,1.1824
194,1.2414
195,1.2741
196,1.2938
197,1.3266
198,1.3004
199,1.3397
200,1.3135
201,1.3724
202,1.3921
203,1.3266
204,1.3135
205,1.2217
206,1.0906
207,1.071
208,0.97919
209,0.9398700000000001
210,0.9660799999999999
211,0.835
212,0.80223
213,0.7629
214,0.63837
215,0.68425
216,0.82189
217,0.92676
218,0.89399
219,0.9923
220,0.9988600000000001
221,1.071
222,1.0775
223,1.1758
224,1.2283
225,1.2283
226,1.071
227,1.0185
228,0.9398700000000001
229,0.9529799999999999
230,0.90054
231,0.9529799999999999
232,0.9660799999999999
233,0.97264
234,0.9398700000000001
235,0.89399
236,0.82844
237,0.8808799999999999
238,0.81534
239,0.7891199999999999
240,0.80223
241,0.81534
242,0.75635
243,0.7104699999999999
244,0.79567
245,0.82189
246,0.835
247,0.8874299999999999
248,0.9071
249,0.98575
250,0.7629
251,0.7104699999999999
252,0.6973600000000001
253,0.70391
254,0.63837
255,0.59249
256,0.6056
257,0.5203899999999999
258,0.49418
259,0.42863
260,0.38931
261,0.40897
262,0.31721
263,0.23201
264,0.18613
265,0.10092000000000001
266,0.015716
267,-0.049826999999999996
268,-0.082598
269,-0.10882
270,-0.12192
271,-0.089153
272,-0.11537
273,-0.13502999999999998
274,-0.1678
275,-0.20713
276,-0.24645
277,-0.30544
278,-0.22679000000000002
279,-0.2399
280,-0.31855
281,-0.29889
282,-0.52173
283,-0.42996999999999996
284,-0.42341999999999996
285,-0.40376
286,-0.46275
287,-0.37754
288,-0.47585
289,-0.44964
290,-0.28578000000000003
291,-0.35788000000000003
292,-0.41686999999999996
293,-0.41686999999999996
294,-0.47585
295,-0.25301
296,-0.42341999999999996
297,-0.39065
298,-0.44308000000000003
299,-0.41031000000000006
300,-0.36443000000000003
301,-0.32511
302,-0.36443000000000003
303,-0.29889
304,-0.43653000000000003
305,-0.32511
306,-0.16125
307,-0.20058
308,-0.076044
309,-0.12192
310,-0.049826999999999996
311,-0.13502999999999998
312,-0.062935
313,-0.11537
314,-0.017056
315,-0.27923000000000003
316,-0.31855
317,-0.42996999999999996
318,-0.49551999999999996
319,-0.5414
320,-0.37754
321,-0.44308000000000003
322,-0.4693
323,-0.44964
324,-0.56106
325,-0.6069399999999999
326,-0.57417
327,-0.63971
328,-0.69214
329,-0.74458
330,-0.7642399999999999
331,-0.8232299999999999
332,-0.856
333,-0.94776
334,-0.97398
335,-1.092
336,-1.0788
337,-1.1247
338,-1.1641
339,-1.0723
340,-1.1903
341,-1.0067
342,-0.91499
343,-0.91499
344,-0.89533
345,-0.79046
346,-0.75769
347,-0.80357
348,-0.57417
349,-0.56106
350,-0.58728
351,-0.46275
352,-0.5282899999999999
353,-0.5282899999999999
354,-0.36443000000000003
355,-0.50207
356,-0.50207
357,-0.46275
358,-0.57417
359,-0.51518
360,-0.37754
361,-0.37754
362,-0.10226
363,0.07470399999999999
364,0.15336
365,0.31066
366,0.43518999999999997
367,0.50073
368,0.54661
369,0.43518999999999997
370,0.31721
371,0.22545
372,0.15991
373,0.10747999999999999
374,0.048487
375,0.10747999999999999
376,0.0026070999999999998
377,-0.017056
378,0.041933
379,0.009161399999999998
380,-0.062935
381,-0.11537
382,-0.089153
383,-0.16125
384,-0.18091
385,-0.27923000000000003
386,-0.27266999999999997
387,-0.29233000000000003
388,-0.34476999999999997
389,-0.24645
390,-0.20713
391,-0.21368
392,-0.10226
393,-0.030164
394,0.022269999999999998
395,0.041933
396,0.08125800000000001
397,0.10092000000000001
398,0.15991
399,0.20579
400,0.17957
401,0.3041
402,0.26478
403,0.24511
404,0.34998
405,0.34343
406,0.47451000000000004
407,0.40897
408,0.46796000000000004
409,0.36965
410,0.36309
411,0.36965
412,0.34998
413,0.31721
414,0.35654
415,0.35654
416,0.29099
417,0.34343
418,0.17957
419,0.10092000000000001
420,0.015716
421,-0.13502999999999998
422,-0.18747
423,-0.35131999999999997
424,-0.50207
425,-0.58072
426,-0.61349
427,-0.66593
428,-0.6987
429,-0.83634
430,-0.9281
431,-1.0133
432,-1.0199
433,-1.1772
434,-1.2361
435,-1.2427
436,-1.2951
437,-1.4
438,-1.4262
439,-1.4655
440,-1.2624
441,-1.1968
442,-1.0788
443,-1.0592
444,-0.9281
445,-0.856
446,-0.80357
447,-0.70525
448,-0.7839
449,-0.66593
450,-0.58072
451,-0.62005
452,-0.61349
453,-0.56106
454,-0.59383
455,-0.53484
456,-0.53484
457,-0.50863
458,-0.5414
459,-0.6266
460,-0.6987
461,-0.69214
462,-0.71181
463,-0.8428899999999999
464,-0.8887700000000001
465,-0.9870899999999999
466,-1.0788
467,-1.1247
468,-1.2034
469,-1.1247
470,-1.1444
471,-0.9870899999999999
472,-0.86911
473,-0.8232299999999999
474,-0.7708
475,-0.75113
476,-0.67904
477,-0.59383
478,-0.57417
479,-0.49551999999999996
480,-0.41031000000000006
481,-0.32511
482,-0.25956
483,-0.18747
484,-0.095707
485,-0.10882
486,-0.06949
487,-0.036718
488,0.015716
489,0.06815
490,0.087813
491,0.12057999999999999
492,0.17302
493,0.17957
494,0.08125800000000001
495,0.08125800000000001
496,0.08125800000000001
497,0.07470399999999999
498,0.022269999999999998
499,-0.02361
500,-0.02361
501,-0.06949
502,-0.10882
503,-0.1547
504,-0.1678
505,-0.16125
506,-0.22679000000000002
507,-0.25301
508,-0.26611999999999997
509,-0.20058
510,-0.22679000000000002
511,-0.27266999999999997
512,-0.17436
513,-0.13502999999999998
514,-0.010501
515,0.055041
516,0.16646
517,0.17302
518,0.19924
519,0.24511
520,0.29755
521,0.29099
522,0.31066
523,0.31721
524,0.25167
525,0.22545
526,0.26478
527,0.36309
528,0.33032
529,0.42208
530,0.35654
531,0.40897
532,0.47451000000000004
533,0.5335
534,0.52695
535,0.57938
536,0.59905
537,0.55972
538,0.6449199999999999
539,0.47451000000000004
540,0.57938
541,0.47451000000000004
542,0.36965
543,0.34343
544,0.31066
545,0.20579
546,0.19924
547,0.12057999999999999
548,0.07470399999999999
549,0.028824000000000002
550,0.07470399999999999
551,0.048487
552,0.14025
553,0.19924
554,0.3041
555,0.3762
556,0.46141000000000004
557,0.49418
558,0.61871
559,0.7104699999999999
560,0.9071
561,0.94642
562,0.8808799999999999
563,0.8808799999999999
564,0.9529799999999999
565,0.8546600000000001
566,0.6908
567,0.68425
568,0.6449199999999999
569,0.59905
570,0.46796000000000004
571,0.51384
572,0.5531699999999999
573,0.5203899999999999
574,0.5203899999999999
575,0.62526
576,0.80878
577,0.8743200000000001
578,0.9923
579,1.143
580,1.3135
581,1.4249
582,1.4052
583,1.4052
584,1.4511
585,1.4380000000000002
586,1.3331
587,1.3987
588,1.2479
589,1.1234
590,0.9595299999999999
591,0.9202
592,0.9202
593,0.82189
594,0.8808799999999999
595,0.78256
596,0.66459
597,0.6318199999999999
598,0.63837
599,0.5531699999999999
600,0.6056
601,0.54661
602,0.50073
603,0.48762
604,0.43518999999999997
605,0.29755
606,0.29099
607,0.18613
608,0.22545
609,0.11402999999999999
610,0.10092000000000001
611,0.009161399999999998
612,-0.14814000000000002
613,-0.14159000000000002
614,-0.28578000000000003
615,-0.27266999999999997
616,-0.29233000000000003
617,-0.312
618,-0.25956
619,-0.19402
620,-0.16125
621,-0.082598
622,0.009161399999999998
623,-0.010501
624,0.07470399999999999
625,0.13369
626,0.15991
627,0.16646
628,0.19924
629,0.13369
630,0.11402999999999999
631,0.09436699999999999
632,0.1468
633,0.10092000000000001
634,0.061596000000000005
635,0.07470399999999999
636,0.009161399999999998
637,-0.076044
638,-0.049826999999999996
639,-0.10882
640,-0.12847999999999998
641,-0.28578000000000003
642,-0.35131999999999997
643,-0.36443000000000003
644,-0.45619
645,-0.6266
646,-0.74458
647,-0.7708
648,-0.8232299999999999
649,-0.82978
650,-0.9543200000000001
651,-0.87566
652,-0.94776
653,-1.0461
654,-0.91499
655,-1.0199
656,-0.94776
657,-0.8887700000000001
658,-0.83634
659,-0.6987
660,-0.6266
661,-0.5282899999999999
662,-0.47585
663,-0.44308000000000003
664,-0.4693
665,-0.52173
666,-0.57417
667,-0.71181
668,-0.81012
669,-0.75769
670,-0.9674200000000001
671,-0.9870899999999999
672,-1.0067
673,-1.1575
674,-1.0985
675,-1.1575
676,-1.1968
677,-1.2427
678,-1.2361
679,-1.2689
680,-1.3607
681,-1.3476
682,-1.3738
683,-1.5049
684,-1.5376
685,-1.6163
686,-1.6163
687,-1.6818
688,-1.7605
689,-1.6753
690,-1.8457
691,-1.7081
692,-1.8195
693,-1.7343
694,-1.8588
695,-1.8195
696,-1.6818
697,-1.6032
698,-1.4459
699,-1.4066
700,-1.3279
701,-1.2755
702,-1.1444
703,-1.1313
704,-1.0526
705,-0.97398
706,-0.9543200000000001
707,-0.8887700000000001
708,-0.81012
709,-0.74458
710,-0.6462600000000001
711,-0.62005
712,-0.53484
713,-0.53484
714,-0.5282899999999999
715,-0.5545100000000001
716,-0.52173
717,-0.56106
718,-0.6331600000000001
719,-0.72492
720,-0.8166800000000001
721,-0.9018799999999999
722,-0.9870899999999999
723,-1.0723
724,-1.2558
725,-1.3803
726,-1.636
727,-1.8195
728,-1.8588
729,-1.8326
730,-1.8391
731,-1.7867
732,-1.7212
733,-1.6622
734,-1.5901
735,-1.3738
736,-1.3148
737,-1.1968
738,-1.0788
739,-0.99364
740,-0.94121
741,-0.9215399999999999
742,-0.87566
743,-0.86911
744,-0.99364
745,-1.0788
746,-1.1247
747,-1.2296
748,-1.2099
749,-1.2558
750,-1.2951
751,-1.2689
752,-1.2296
753,-1.2624
754,-1.2296
755,-1.2165
756,-1.2099
757,-1.1903
758,-1.1903
759,-1.1772
760,-1.2755
761,-1.2624
762,-1.3214
763,-1.3672
764,-1.4524
765,-1.5311
766,-1.6163
767,-1.6491
768,-1.7408
769,-1.8981
770,-2.0489
771,-1.9899
772,-2.121
773,-2.1669
774,-2.311
775,-2.2258
776,-2.2258
777,-2.1669
778,-2.1341
779,-2.121
780,-2.0358
781,-2.0292
782,-2.0096
783,-1.8654
784,-1.9243
785,-1.767
786,-1.6949
787,-1.7081
788,-1.6818
789,-1.6163
790,-1.6032
791,-1.4655
792,-1.4262
793,-1.3803
794,-1.3082
795,-1.3214
796,-1.4
797,-1.4524
798,-1.5639
799,-1.7146
800,-1.7867
801,-1.7802
802,-1.8259999999999998
803,-1.8785
804,-1.8259999999999998
805,-1.7867
806,-1.8129
807,-1.7802
808,-1.7343
809,-1.6818
810,-1.6425
811,-1.636
812,-1.5573
813,-1.5573
814,-1.4721
815,-1.4524
816,-1.3082
817,-1.3082
818,-1.1903
819,-1.1509
820,-1.0788
821,-1.0723
822,-1.1247
823,-1.0264
824,-1.0199
825,-1.0395
826,-1.033
827,-1.0199
828,-1.0264
829,-1.0002
830,-1.0264
831,-1.0133
832,-1.1247
833,-1.1772
834,-1.2558
835,-1.3148
836,-1.3869
837,-1.4328
838,-1.4262
839,-1.4721
840,-1.3935
841,-1.2819999999999998
842,-1.2229999999999999
843,-1.0657
844,-0.9543200000000001
845,-0.81012
846,-0.67904
847,-0.5414
848,-0.41031000000000006
849,-0.27923000000000003
850,-0.062935
851,-0.13502999999999998
852,0.10092000000000001
853,0.11402999999999999
854,-0.010501
855,0.14025
856,0.3041
857,0.27789
858,0.2189
859,0.19268
860,0.10747999999999999
861,0.055041
862,-0.056380999999999994
863,0.009161399999999998
864,-0.062935
865,-0.02361
866,-0.10882
867,-0.11537
868,-0.17436
869,-0.12192
870,-0.22024000000000002
871,-0.23335
872,-0.22679000000000002
873,-0.095707
874,-0.12192
875,0.061596000000000005
876,0.23856
877,0.34343
878,0.5335
879,0.7104699999999999
880,0.82844
881,1.0316
882,1.2151
883,1.3069
884,1.4118
885,1.4708
886,1.5691
887,1.6871
888,1.746
889,1.8771
890,1.8575
891,1.8902
892,1.8509
893,1.7985
894,1.6936
895,1.6477
896,1.6084
897,1.5822
898,1.556
899,1.4904
