time,value
0,-0.052134
1,-0.10032
2,-0.052134
3,-0.10032
4,-0.10032
5,-0.052134
6,-0.10032
7,-0.10032
8,-0.052134
9,-0.10032
10,-0.10032
11,-0.052134
12,-0.10032
13,-0.052134
14,-0.10032
15,-0.10032
16,-0.052134
17,-0.10032
18,-0.10032
19,-0.052134
20,-0.10032
21,-0.052134
22,-0.10032
23,-0.10032
24,-0.052134
25,-0.10032
26,-0.052134
27,-0.10032
28,-0.10032
29,-0.052134
30,-0.10032
31,-0.052134
32,-0.10032
33,-0.10032
34,-0.052134
35,-0.10032
36,-0.10032
37,-0.052134
38,-0.10032
39,-0.10032
40,-0.052134
41,-0.10032
42,-0.10032
43,-0.052134
44,-0.10032
45,-0.052134
46,-0.10032
47,-0.10032
48,-0.052134
49,-0.10032
50,-0.10032
51,-0.052134
52,-0.10032
53,-0.10032
54,-0.052134
55,-0.10032
56,-0.10032
57,-0.052134
58,-0.10032
59,-0.10032
60,-0.052134
61,-0.10032
62,-0.10032
63,-0.052134
64,-0.10032
65,-0.10032
66,-0.052134
67,-0.10032
68,-0.10032
69,-0.052134
70,-0.10032
71,-0.10032
72,-0.052134
73,-0.10032
74,-0.10032
75,-0.052134
76,-0.10032
77,-0.10032
78,-0.052134
79,-0.10032
80,-0.10032
81,-0.10032
82,-0.052134
83,-0.10032
84,-0.10032
85,-0.052134
86,-0.10032
87,-0.10032
88,-0.052134
89,-0.10032
90,-0.10032
91,-0.052134
92,-0.10032
93,-0.10032
94,-0.052134
95,-0.10032
96,-0.10032
97,-0.052134
98,-0.10032
99,-0.10032
100,-0.052134
101,-0.10032
102,-0.10032
103,-0.052134
104,-0.10032
105,-0.10032
106,-0.052134
107,-0.10032
108,-0.10032
109,-0.052134
110,-0.10032
111,-0.10032
112,-0.052134
113,-0.10032
114,-0.10032
115,-0.052134
116,-0.10032
117,-0.10032
118,-0.052134
119,-0.10032
120,-0.10032
121,-0.052134
122,-0.10032
123,-0.10032
124,-0.052134
125,-0.10032
126,-0.10032
127,-0.052134
128,-0.10032
129,-0.10032
130,-0.052134
131,-0.10032
132,-0.10032
133,-0.052134
134,-0.10032
135,-0.10032
136,-0.052134
137,-0.10032
138,-0.10032
139,-0.052134
140,-0.10032
141,-0.10032
142,-0.052134
143,-0.10032
144,-0.10032
145,-0.052134
146,-0.10032
147,-0.10032
148,-0.052134
149,-0.10032
150,-0.10032
151,-0.10032
152,-0.052134
153,-0.10032
154,-0.10032
155,-0.052134
156,-0.10032
157,-0.10032
158,-0.052134
159,-0.10032
160,-0.10032
161,-0.052134
162,-0.10032
163,-0.10032
164,-0.052134
165,-0.10032
166,-0.10032
167,-0.052134
168,-0.10032
169,-0.10032
170,-0.10032
171,-0.052134
172,-0.10032
173,-0.10032
174,-0.052134
175,-0.10032
176,-0.10032
177,-0.052134
178,-0.10032
179,-0.10032
180,-0.052134
181,-0.10032
182,-0.10032
183,-0.052134
184,-0.10032
185,-0.052134
186,-0.10032
187,-0.10032
188,-0.052134
189,-0.10032
190,-0.10032
191,-0.052134
192,-0.10032
193,-0.10032
194,-0.052134
195,-0.10032
196,-0.10032
197,-0.052134
198,-0.10032
199,-0.10032
200,-0.052134
201,-0.10032
202,-0.10032
203,-0.052134
204,-0.10032
205,-0.10032
206,-0.052134
207,-0.10032
208,-0.10032
209,-0.052134
210,-0.10032
211,-0.10032
212,-0.052134
213,-0.10032
214,-0.10032
215,-0.052134
216,-0.10032
217,-0.10032
218,-0.052134
219,-0.10032
220,-0.10032
221,-0.052134
222,-0.10032
223,-0.10032
224,-0.052134
225,-0.10032
226,-0.10032
227,-0.052134
228,-0.10032
229,-0.10032
230,-0.052134
231,-0.10032
232,-0.10032
233,-0.052134
234,-0.10032
235,-0.10032
236,-0.052134
237,-0.10032
238,-0.10032
239,-0.052134
240,-0.10032
241,-0.10032
242,-0.052134
243,-0.10032
244,-0.10032
245,-0.052134
246,-0.10032
247,-0.10032
248,-0.10032
249,-0.052134
250,-0.10032
251,-0.10032
252,-0.052134
253,-0.10032
254,-0.10032
255,-0.052134
256,-0.10032
257,-0.10032
258,-0.052134
259,-0.10032
260,-0.10032
261,-0.052134
262,-0.10032
263,-0.10032
264,-0.052134
265,-0.10032
266,-0.10032
267,-0.052134
268,-0.10032
269,-0.10032
270,-0.052134
271,-0.10032
272,-0.052134
273,-0.10032
274,-0.10032
275,-0.052134
276,-0.10032
277,-0.10032
278,-0.052134
279,3.3689999999999998
280,18.788
281,0.28515999999999997
282,-0.052134
283,-0.10032
284,-0.0039485
285,0.28515999999999997
286,0.28515999999999997
287,0.28515999999999997
288,0.28515999999999997
289,0.28515999999999997
290,0.28515999999999997
291,0.28515999999999997
292,0.28515999999999997
293,0.28515999999999997
294,0.18879
295,0.28515999999999997
296,0.28515999999999997
297,0.28515999999999997
298,0.28515999999999997
299,0.28515999999999997
300,0.28515999999999997
301,0.28515999999999997
302,0.28515999999999997
303,-0.052134
304,-0.10032
305,-0.10032
306,-0.052134
307,-0.10032
308,-0.10032
309,-0.052134
310,-0.10032
311,-0.10032
312,-0.052134
313,-0.10032
314,-0.10032
315,-0.052134
316,-0.10032
317,-0.10032
318,-0.052134
319,-0.10032
320,-0.10032
321,-0.052134
322,-0.10032
323,-0.10032
324,-0.052134
325,-0.10032
326,-0.10032
327,-0.052134
328,-0.10032
329,-0.10032
330,-0.052134
331,-0.10032
332,-0.10032
333,-0.052134
334,-0.10032
335,-0.052134
336,-0.10032
337,-0.10032
338,-0.052134
339,-0.10032
340,-0.10032
341,-0.052134
342,-0.10032
343,-0.10032
344,-0.052134
345,-0.10032
346,-0.052134
347,-0.10032
348,-0.10032
349,-0.052134
350,-0.10032
351,-0.10032
352,-0.052134
353,-0.10032
354,-0.052134
355,-0.10032
356,-0.10032
357,-0.052134
358,-0.10032
359,-0.10032
360,-0.052134
361,-0.10032
362,-0.10032
363,-0.052134
364,-0.10032
365,-0.052134
366,-0.10032
367,-0.10032
368,-0.10032
369,-0.052134
370,-0.10032
371,-0.10032
372,-0.052134
373,-0.10032
374,-0.10032
375,-0.052134
376,-0.10032
377,-0.10032
378,-0.052134
379,-0.10032
380,-0.10032
381,-0.052134
382,-0.10032
383,-0.10032
384,-0.052134
385,-0.10032
386,-0.10032
387,-0.052134
388,-0.10032
389,-0.10032
390,-0.052134
391,-0.10032
392,-0.10032
393,-0.052134
394,-0.10032
395,-0.10032
396,-0.052134
397,-0.10032
398,-0.10032
399,-0.052134
400,-0.10032
401,-0.10032
402,-0.052134
403,-0.10032
404,-0.10032
405,-0.052134
406,-0.10032
407,-0.10032
408,-0.052134
409,-0.10032
410,-0.052134
411,-0.10032
412,-0.10032
413,-0.052134
414,-0.10032
415,-0.10032
416,-0.052134
417,-0.10032
418,-0.10032
419,-0.052134
420,-0.10032
421,-0.10032
422,-0.052134
423,-0.10032
424,-0.052134
425,-0.10032
426,-0.10032
427,-0.052134
428,-0.10032
429,-0.10032
430,-0.052134
431,-0.10032
432,-0.10032
433,-0.052134
434,-0.10032
435,-0.10032
436,-0.052134
437,-0.10032
438,-0.052134
439,-0.10032
440,-0.10032
441,-0.052134
442,-0.10032
443,-0.10032
444,-0.052134
445,-0.10032
446,-0.10032
447,-0.052134
448,-0.10032
449,-0.10032
450,-0.052134
451,-0.10032
452,-0.10032
453,-0.052134
454,-0.10032
455,-0.10032
456,-0.052134
457,-0.10032
458,-0.10032
459,-0.052134
460,-0.10032
461,-0.10032
462,-0.052134
463,-0.10032
464,-0.10032
465,-0.052134
466,-0.10032
467,-0.10032
468,-0.052134
469,-0.10032
470,-0.10032
471,-0.052134
472,-0.10032
473,-0.10032
474,-0.052134
475,-0.10032
476,-0.10032
477,-0.052134
478,-0.10032
479,-0.052134
480,-0.10032
481,-0.10032
482,-0.052134
483,-0.10032
484,-0.10032
485,-0.052134
486,-0.10032
487,-0.10032
488,-0.052134
489,-0.10032
490,-0.052134
491,-0.10032
492,-0.10032
493,-0.052134
494,-0.10032
495,-0.10032
496,-0.052134
497,-0.10032
498,-0.10032
499,-0.052134
500,-0.10032
501,-0.052134
502,-0.10032
503,-0.10032
504,-0.052134
505,-0.10032
506,-0.10032
507,-0.052134
508,-0.10032
509,-0.052134
510,-0.10032
511,-0.10032
512,-0.052134
513,-0.10032
514,-0.10032
515,-0.052134
516,-0.10032
517,-0.10032
518,-0.052134
519,-0.10032
520,-0.10032
521,-0.052134
522,-0.10032
523,-0.10032
524,-0.052134
525,-0.10032
526,-0.10032
527,-0.052134
528,-0.10032
529,-0.10032
530,-0.052134
531,-0.10032
532,-0.10032
533,-0.052134
534,-0.10032
535,-0.10032
536,-0.052134
537,-0.10032
538,-0.10032
539,-0.052134
540,-0.10032
541,-0.10032
542,-0.052134
543,-0.10032
544,-0.10032
545,-0.052134
546,-0.10032
547,-0.10032
548,-0.10032
549,-0.052134
550,-0.10032
551,-0.10032
552,-0.052134
553,-0.10032
554,-0.10032
555,-0.052134
556,-0.10032
557,-0.10032
558,-0.052134
559,-0.10032
560,-0.10032
561,-0.052134
562,-0.10032
563,-0.10032
564,-0.052134
565,-0.10032
566,-0.10032
567,-0.052134
568,-0.10032
569,-0.10032
570,-0.052134
571,-0.10032
572,-0.10032
573,-0.052134
574,-0.10032
575,-0.10032
576,-0.052134
577,-0.10032
578,-0.10032
579,-0.052134
580,-0.10032
581,-0.10032
582,-0.052134
583,-0.10032
584,-0.10032
585,-0.052134
586,-0.10032
587,-0.052134
588,-0.10032
589,-0.10032
590,-0.052134
591,-0.10032
592,-0.10032
593,-0.052134
594,-0.10032
595,-0.10032
596,-0.052134
597,-0.10032
598,-0.10032
599,-0.052134
600,-0.10032
601,-0.10032
602,-0.052134
603,-0.10032
604,-0.10032
605,-0.052134
606,-0.052134
607,0.092422
608,-0.052134
609,-0.052134
610,-0.10032
611,-0.10032
612,15.56
613,5.6819
614,8.573
615,-0.10032
616,-0.052134
617,0.18879
618,0.18879
619,-0.10032
620,-0.052134
621,-0.10032
622,-0.10032
623,-0.052134
624,-0.10032
625,-0.10032
626,-0.052134
627,-0.10032
628,-0.10032
629,-0.052134
630,-0.10032
631,-0.052134
632,-0.10032
633,-0.10032
634,-0.052134
635,-0.10032
636,-0.10032
637,-0.052134
638,-0.10032
639,-0.052134
640,-0.10032
641,-0.10032
642,-0.052134
643,-0.10032
644,-0.10032
645,-0.052134
646,-0.10032
647,-0.052134
648,-0.10032
649,-0.10032
650,-0.052134
651,-0.10032
652,-0.052134
653,-0.10032
654,-0.10032
655,-0.052134
656,-0.10032
657,-0.052134
658,-0.10032
659,-0.10032
660,-0.052134
661,-0.10032
662,-0.10032
663,-0.052134
664,-0.10032
665,-0.052134
666,-0.10032
667,-0.10032
668,-0.052134
669,-0.10032
670,-0.10032
671,-0.052134
672,-0.10032
673,-0.10032
674,-0.052134
675,-0.10032
676,-0.10032
677,-0.052134
678,-0.10032
679,-0.10032
680,-0.052134
681,-0.10032
682,-0.10032
683,-0.052134
684,-0.10032
685,-0.052134
686,-0.10032
687,-0.10032
688,-0.052134
689,-0.10032
690,-0.10032
691,-0.052134
692,-0.10032
693,-0.10032
694,-0.052134
695,-0.10032
696,-0.052134
697,-0.10032
698,-0.10032
699,-0.052134
700,-0.10032
701,-0.10032
702,-0.052134
703,-0.10032
704,-0.10032
705,-0.052134
706,-0.10032
707,-0.052134
708,-0.10032
709,-0.10032
710,-0.052134
711,-0.10032
712,-0.052134
713,-0.10032
714,-0.10032
715,-0.052134
716,-0.10032
717,-0.10032
718,-0.052134
719,-0.10032
