{
  "about": {
    "problemID": "LL1_ScreenType_problem",
    "problemName": "LL1_ScreenType_problem",
    "problemDescription": "A time series classification problem.",
    "problemSchemaVersion": "4.0.0",
    "problemVersion": "4.0.0",
    "taskKeywords": [
      "classification",
      "multiClass"
    ]
  },
  "inputs": {
    "data": [
      {
        "datasetID": "LL1_ScreenType_dataset",
        "targets": [
          {
            "targetIndex": 0,
            "resID": "learningData",
            "colIndex": 2,
            "colName": "label"
          }
        ]
      }
    ],
    "dataSplits": {
      "method": "holdOut",
      "testSize": 0.5,
      "stratified": true,
      "numRepeats": 0,
      "splitsFile": "dataSplits.csv"
    },
    "performanceMetrics": [
      {
        "metric": "f1Macro"
      }
    ]
  },
  "expectedOutputs": {
    "predictionsFile": "predictions.csv"
  }
}