time,value
0,-0.72526
1,-0.6732
2,-0.47726
3,-0.2328
4,0.031789
5,0.33881999999999995
6,0.67152
7,0.90964
8,1.1522
9,1.3971
10,1.4395
11,1.3877
12,1.3915
13,1.4097
14,1.5188
15,1.3986
16,1.1855
17,0.8321
18,0.54113
19,0.2143
20,-0.092842
21,-0.39738
22,-0.64869
23,-0.7279
24,-0.69502
25,-0.54348
26,-0.3622
27,-0.12065999999999999
28,0.14048
29,0.41697
30,0.69507
31,0.9817100000000001
32,1.2895
33,1.3939
34,1.3883
35,1.41
36,1.3895
37,1.3418
38,1.3971
39,1.4372
40,1.5349
41,1.5036
42,1.3044
43,1.041
44,0.7148100000000001
45,0.41678999999999994
46,0.11281
47,-0.16591
48,-0.43423999999999996
49,-0.63974
50,-0.39952
51,-0.45983
52,-0.60587
53,-0.74627
54,-0.9147700000000001
55,-1.114
56,-1.3066
57,-1.4699
58,-1.4617
59,-1.3242
60,-1.1393
61,-0.9819
62,-0.80655
63,-0.64544
64,-0.5462
65,-0.49401999999999996
66,-0.6431
67,-0.7892
68,-0.96262
69,-1.0986
70,-1.258
71,-1.3506
72,-1.3755
73,-1.3171
74,-1.262
75,-1.1464
76,-1.0395
77,-0.8793200000000001
78,-0.71272
79,-0.54257
