time,value
0,-0.38878
1,-0.38878
2,-0.38878
3,-0.38878
4,-0.38878
5,-0.38878
6,-0.38878
7,-0.38878
8,-0.38878
9,-0.38878
10,-0.38878
11,-0.38878
12,-0.38878
13,-0.38878
14,-0.38878
15,-0.38878
16,-0.38878
17,-0.38878
18,-0.38878
19,-0.38878
20,-0.38878
21,-0.38878
22,-0.38878
23,-0.38878
24,-0.38878
25,-0.38878
26,-0.38878
27,-0.38878
28,-0.38878
29,-0.38878
30,-0.38878
31,-0.38878
32,-0.38878
33,-0.38878
34,-0.38878
35,-0.38878
36,-0.38878
37,-0.38878
38,-0.38878
39,-0.38878
40,-0.38878
41,-0.38878
42,-0.38878
43,-0.38878
44,-0.38878
45,-0.38878
46,-0.38878
47,-0.38878
48,-0.38878
49,-0.38878
50,-0.38878
51,-0.38878
52,-0.38878
53,-0.38878
54,-0.38878
55,-0.38878
56,-0.38878
57,-0.38878
58,-0.38878
59,-0.38878
60,-0.38878
61,-0.38878
62,-0.38878
63,-0.38878
64,-0.38878
65,-0.38878
66,-0.38878
67,-0.38878
68,-0.38878
69,-0.38878
70,-0.38878
71,-0.38878
72,-0.38878
73,-0.38878
74,-0.38878
75,-0.38878
76,-0.38878
77,-0.38878
78,-0.38878
79,-0.38878
80,-0.38878
81,-0.38878
82,-0.38878
83,-0.38878
84,-0.38878
85,-0.38878
86,-0.38878
87,-0.38878
88,-0.38878
89,-0.38878
90,-0.38878
91,-0.38878
92,-0.38878
93,-0.38878
94,-0.38878
95,-0.38878
96,-0.38878
97,-0.38878
98,-0.38878
99,-0.38878
100,-0.38878
101,-0.38878
102,-0.38878
103,-0.38878
104,-0.38878
105,-0.38878
106,-0.38878
107,-0.38878
108,-0.38878
109,-0.38878
110,-0.38878
111,-0.38878
112,-0.38878
113,-0.38878
114,-0.38878
115,-0.38878
116,-0.38878
117,-0.38878
118,-0.38878
119,-0.38878
120,-0.38878
121,-0.38878
122,-0.38878
123,-0.38878
124,-0.38878
125,-0.38878
126,-0.38878
127,-0.38878
128,-0.38878
129,-0.38878
130,-0.38878
131,-0.38878
132,-0.38878
133,-0.38878
134,-0.38878
135,-0.38878
136,-0.38878
137,-0.38878
138,-0.38878
139,-0.38878
140,-0.38878
141,-0.38878
142,-0.38878
143,-0.38878
144,-0.38878
145,-0.38878
146,-0.38878
147,-0.38878
148,-0.38878
149,-0.38878
150,-0.38878
151,-0.38878
152,-0.38878
153,-0.38878
154,-0.38878
155,-0.38878
156,-0.38878
157,-0.38878
158,-0.38878
159,-0.38878
160,-0.38878
161,-0.38878
162,-0.38878
163,-0.38878
164,-0.38878
165,-0.38878
166,-0.38878
167,-0.38878
168,-0.38878
169,-0.38878
170,-0.38878
171,-0.38878
172,-0.38878
173,-0.38878
174,-0.38878
175,-0.38878
176,-0.38878
177,-0.38878
178,-0.38878
179,-0.38878
180,-0.38878
181,-0.38878
182,-0.38878
183,-0.38878
184,-0.38878
185,-0.38878
186,-0.38878
187,-0.38878
188,-0.38878
189,-0.38878
190,-0.38878
191,-0.38878
192,-0.38878
193,-0.38878
194,-0.38878
195,-0.38878
196,-0.38878
197,-0.38878
198,-0.38878
199,-0.38878
200,-0.38878
201,-0.38878
202,-0.38878
203,-0.38878
204,-0.38878
205,-0.38878
206,-0.38878
207,-0.38878
208,-0.38878
209,-0.38878
210,-0.38878
211,-0.38878
212,-0.38878
213,-0.38878
214,-0.38878
215,-0.38878
216,-0.38878
217,-0.38878
218,-0.38878
219,-0.38878
220,-0.38878
221,-0.38878
222,-0.38878
223,-0.38878
224,-0.38878
225,-0.38878
226,-0.38878
227,-0.38878
228,-0.38878
229,-0.38878
230,-0.38878
231,-0.38878
232,-0.38878
233,-0.38878
234,-0.38878
235,-0.38878
236,-0.38878
237,-0.38878
238,-0.38878
239,-0.38878
240,-0.38878
241,-0.38878
242,-0.38878
243,-0.38878
244,-0.38878
245,-0.38878
246,-0.38878
247,-0.38878
248,-0.38878
249,-0.38878
250,-0.38878
251,-0.38878
252,-0.38878
253,-0.38878
254,-0.38878
255,-0.38878
256,-0.38878
257,-0.38878
258,-0.38878
259,-0.38878
260,-0.38878
261,-0.38878
262,-0.38878
263,-0.38878
264,-0.38878
265,-0.38878
266,-0.38878
267,-0.38878
268,-0.38878
269,-0.38878
270,-0.38878
271,-0.38878
272,-0.38878
273,-0.38878
274,-0.38878
275,-0.38878
276,-0.38878
277,-0.38878
278,-0.38878
279,-0.38878
280,-0.38878
281,-0.38878
282,-0.38878
283,-0.38878
284,-0.38878
285,-0.38878
286,-0.38878
287,-0.38878
288,-0.38878
289,-0.38878
290,-0.38878
291,-0.38878
292,-0.38878
293,-0.38878
294,-0.38878
295,-0.38878
296,-0.38878
297,-0.38878
298,-0.38878
299,-0.38878
300,-0.38878
301,-0.38878
302,-0.38878
303,-0.38878
304,-0.38878
305,-0.38878
306,-0.38878
307,-0.38878
308,-0.38878
309,-0.38878
310,-0.38878
311,-0.38878
312,-0.38878
313,-0.38878
314,-0.38878
315,-0.38878
316,-0.38878
317,-0.38878
318,-0.38878
319,-0.38878
320,-0.38878
321,-0.38878
322,-0.38878
323,-0.38878
324,-0.38878
325,-0.38878
326,-0.38878
327,-0.38878
328,-0.38878
329,-0.38878
330,-0.38878
331,-0.38878
332,-0.38878
333,-0.38878
334,0.50174
335,2.5796
336,2.5796
337,2.5796
338,2.5796
339,2.5796
340,2.5796
341,3.1733
342,2.5796
343,2.5796
344,2.5796
345,3.1733
346,2.5796
347,2.5796
348,2.5796
349,2.5796
350,2.5796
351,2.5796
352,3.1733
353,2.5796
354,2.5796
355,2.5796
356,2.5796
357,2.5796
358,2.5796
359,2.5796
360,2.5796
361,2.5796
362,2.5796
363,2.5796
364,3.1733
365,2.5796
366,2.5796
367,2.5796
368,2.5796
369,2.5796
370,2.5796
371,2.5796
372,2.5796
373,2.5796
374,2.5796
375,2.5796
376,2.5796
377,2.5796
378,2.5796
379,2.5796
380,2.5796
381,2.5796
382,2.5796
383,2.5796
384,2.5796
385,2.5796
386,2.5796
387,2.5796
388,2.5796
389,2.5796
390,2.5796
391,2.5796
392,2.5796
393,2.5796
394,2.5796
395,1.9859
396,2.5796
397,2.5796
398,2.5796
399,2.5796
400,2.5796
401,2.5796
402,2.5796
403,2.5796
404,2.5796
405,1.3923
406,-0.091938
407,-0.38878
408,-0.38878
409,-0.38878
410,-0.38878
411,-0.38878
412,-0.38878
413,-0.38878
414,-0.38878
415,-0.38878
416,-0.38878
417,-0.38878
418,-0.38878
419,-0.38878
420,-0.38878
421,-0.38878
422,-0.38878
423,-0.38878
424,-0.38878
425,-0.38878
426,-0.38878
427,-0.38878
428,-0.38878
429,-0.38878
430,-0.38878
431,-0.38878
432,-0.38878
433,-0.38878
434,-0.38878
435,-0.38878
436,-0.38878
437,-0.38878
438,-0.38878
439,-0.38878
440,-0.38878
441,-0.38878
442,-0.38878
443,-0.38878
444,-0.38878
445,-0.38878
446,-0.38878
447,-0.38878
448,-0.38878
449,-0.38878
450,-0.38878
451,-0.38878
452,-0.38878
453,-0.38878
454,-0.38878
455,-0.38878
456,-0.38878
457,-0.38878
458,-0.38878
459,-0.38878
460,-0.38878
461,-0.38878
462,-0.38878
463,-0.38878
464,-0.38878
465,-0.38878
466,-0.38878
467,-0.38878
468,-0.38878
469,1.3923
470,2.5796
471,2.5796
472,2.5796
473,2.5796
474,2.5796
475,2.5796
476,2.5796
477,2.5796
478,2.5796
479,2.5796
480,2.5796
481,2.5796
482,2.5796
483,2.5796
484,2.5796
485,2.5796
486,2.5796
487,2.5796
488,2.5796
489,2.5796
490,2.5796
491,1.9859
492,0.50174
493,-0.38878
494,-0.38878
495,-0.38878
496,-0.38878
497,-0.38878
498,-0.38878
499,-0.38878
500,-0.38878
501,-0.38878
502,-0.38878
503,-0.38878
504,-0.38878
505,-0.38878
506,-0.38878
507,-0.38878
508,-0.38878
509,-0.38878
510,-0.38878
511,-0.38878
512,-0.38878
513,-0.38878
514,-0.38878
515,-0.38878
516,-0.38878
517,-0.38878
518,-0.38878
519,-0.38878
520,-0.38878
521,-0.38878
522,-0.38878
523,-0.38878
524,-0.38878
525,-0.38878
526,-0.38878
527,-0.38878
528,-0.38878
529,-0.38878
530,-0.38878
531,-0.38878
532,-0.38878
533,-0.38878
534,-0.38878
535,-0.38878
536,-0.38878
537,-0.38878
538,-0.38878
539,-0.38878
540,-0.38878
541,-0.38878
542,-0.38878
543,-0.38878
544,-0.38878
545,-0.38878
546,-0.38878
547,-0.38878
548,-0.38878
549,-0.38878
550,-0.38878
551,-0.38878
552,-0.38878
553,-0.38878
554,-0.38878
555,-0.38878
556,-0.38878
557,-0.38878
558,-0.38878
559,-0.38878
560,-0.38878
561,-0.38878
562,-0.38878
563,-0.38878
564,-0.38878
565,-0.38878
566,-0.38878
567,-0.38878
568,-0.38878
569,-0.38878
570,-0.38878
571,-0.38878
572,-0.38878
573,-0.38878
574,-0.38878
575,-0.38878
576,-0.38878
577,-0.38878
578,-0.38878
579,-0.38878
580,-0.38878
581,-0.38878
582,-0.38878
583,-0.38878
584,-0.38878
585,-0.38878
586,-0.38878
587,-0.38878
588,-0.38878
589,-0.38878
590,-0.38878
591,-0.38878
592,-0.38878
593,-0.38878
594,-0.38878
595,-0.38878
596,-0.38878
597,-0.38878
598,-0.38878
599,-0.38878
600,-0.38878
601,-0.38878
602,-0.38878
603,-0.38878
604,-0.38878
605,-0.38878
606,-0.38878
607,-0.38878
608,-0.38878
609,-0.38878
610,-0.38878
611,-0.38878
612,-0.38878
613,-0.38878
614,-0.38878
615,-0.38878
616,-0.38878
617,-0.38878
618,-0.38878
619,-0.38878
620,-0.38878
621,-0.38878
622,-0.38878
623,-0.38878
624,-0.38878
625,-0.38878
626,-0.38878
627,-0.38878
628,-0.38878
629,-0.38878
630,-0.38878
631,-0.38878
632,-0.38878
633,-0.38878
634,-0.38878
635,-0.38878
636,-0.38878
637,-0.38878
638,-0.38878
639,-0.38878
640,-0.38878
641,-0.38878
642,-0.38878
643,-0.38878
644,-0.38878
645,-0.38878
646,-0.38878
647,-0.38878
648,-0.38878
649,-0.38878
650,-0.38878
651,-0.38878
652,-0.38878
653,-0.38878
654,-0.38878
655,-0.38878
656,-0.38878
657,-0.38878
658,-0.38878
659,-0.38878
660,-0.38878
661,-0.38878
662,-0.38878
663,-0.38878
664,-0.38878
665,-0.38878
666,-0.38878
667,-0.38878
668,-0.38878
669,-0.38878
670,-0.38878
671,-0.38878
672,-0.38878
673,-0.38878
674,-0.38878
675,-0.38878
676,-0.38878
677,-0.38878
678,-0.38878
679,-0.38878
680,-0.38878
681,-0.38878
682,-0.38878
683,-0.38878
684,-0.38878
685,-0.38878
686,-0.38878
687,-0.38878
688,-0.38878
689,-0.38878
690,-0.38878
691,-0.38878
692,-0.38878
693,-0.38878
694,-0.38878
695,-0.38878
696,-0.38878
697,-0.38878
698,-0.38878
699,-0.38878
700,-0.38878
701,-0.38878
702,-0.38878
703,-0.38878
704,-0.38878
705,-0.38878
706,-0.38878
707,-0.38878
708,-0.38878
709,-0.38878
710,-0.38878
711,-0.38878
712,-0.38878
713,-0.38878
714,-0.38878
715,-0.38878
716,-0.38878
717,-0.38878
718,-0.38878
719,-0.38878
