time,value
0,0.1607
1,-0.014249000000000001
2,0.17477
3,-0.6645300000000001
4,0.041158
5,-0.08606699999999999
6,-0.48041999999999996
7,0.29099
8,0.39386
9,-0.61435
10,-0.21784
11,0.52183
12,0.39598
13,-0.037778
14,0.45114
15,-0.16919
16,0.3548
17,0.58678
18,0.32566999999999996
19,0.22976999999999997
20,-0.31409000000000004
21,0.79138
22,-0.066499
23,-0.28673000000000004
24,0.37931
25,-0.50027
26,-0.40569
27,-0.31469
28,-0.019071
29,-0.27345
30,0.32286
31,-0.2333
32,0.42071000000000003
33,0.38244
34,-0.013078999999999999
35,0.52136
36,0.13859000000000002
37,-0.15361
38,-0.04721
39,-0.24622
40,-0.009400799999999999
41,0.26607
42,-0.026275
43,-0.065112
44,0.1811
45,0.17918
46,-0.24941999999999998
47,-0.33103
48,-0.13053
49,-0.25761
50,0.33155999999999997
51,-0.1834
52,-0.46989
53,-0.5232600000000001
54,-0.15691
55,-0.37827
56,0.37722
57,0.23593000000000003
58,0.2592
59,-0.51121
60,0.1961
61,0.11868
62,-1.6355
63,-1.6355
64,-1.6355
65,-1.6355
66,-1.6355
67,-1.6355
68,-1.6355
69,-1.6355
70,-1.6355
71,-1.6355
72,-1.6355
73,-1.6355
74,1.5693
75,1.5693
76,1.5693
77,1.5693
78,1.5693
79,1.5693
80,1.5693
81,1.5693
82,1.5693
83,1.5693
84,1.5693
85,1.5693
86,-0.036699
87,-0.16573
88,-0.015580000000000002
89,0.5943
90,-0.017707
91,-0.14992
92,0.14415
93,0.48853
94,0.13423
95,-1.6355
96,-1.6355
97,-1.6355
98,-1.6355
99,-1.6355
100,-1.6355
101,-1.6355
102,-1.6355
103,-1.6355
104,-1.6355
105,-1.6355
106,1.5693
107,1.5693
108,1.5693
109,1.5693
110,1.5693
111,1.5693
112,1.5693
113,1.5693
114,1.5693
115,1.5693
116,1.5693
117,-0.08925
118,0.5272399999999999
119,-0.50693
120,-0.51375
121,0.3936
122,0.06579299999999999
123,0.074349
124,0.14035
125,0.076663
126,0.25842
127,-0.45736000000000004
