time,value
0,0.30483000000000005
1,0.60724
2,0.87484
3,1.0801
4,1.1974
5,1.2198
6,1.1296
7,0.9498200000000001
8,0.70529
9,0.42567
10,0.1435
11,-0.11880999999999999
12,-0.35379
13,-0.5606
14,-0.7446
15,-0.90569
16,-1.0309
17,-1.1123
18,-1.1251
19,-1.0583
20,-0.91145
21,-0.69695
22,-0.42988000000000004
23,-0.15629
24,0.097002
25,0.30737
26,0.46256
27,0.5684600000000001
28,0.64808
29,0.69907
30,0.7265
31,0.73205
32,0.70158
33,0.6188600000000001
34,0.48662
35,0.32195999999999997
36,0.14306
37,-0.020047
38,-0.14003
39,-0.20790999999999998
40,-0.22018000000000001
41,-0.20504
42,-0.18139
43,-0.17867
44,-0.20655
45,-0.27434000000000003
46,-0.35612
47,-0.43393000000000004
48,-0.4906
49,-0.5020899999999999
50,-0.47186000000000006
51,-0.40659
52,-0.32169000000000003
53,-0.23331
54,-0.15354
55,-0.088399
56,-0.019492
57,0.072012
58,0.19371
59,0.34678000000000003
60,0.51876
61,0.67775
62,0.7985899999999999
63,0.8469899999999999
64,0.79752
65,0.65566
66,0.42907
67,0.14983
68,-0.14538
69,-0.41256000000000004
70,-0.6219899999999999
71,-0.7560100000000001
72,-0.8073899999999999
73,-0.78797
74,-0.71912
75,-0.61562
76,-0.5001800000000001
77,-0.37859
78,-0.25369
79,-0.12872
80,0.00096101
81,0.13255
82,0.26676
83,0.40367
84,0.52551
85,0.62053
86,0.67772
87,0.6925100000000001
88,0.65041
89,0.5577300000000001
90,0.42605
91,0.26635
92,0.10288
93,-0.046361
94,-0.16726
95,-0.26294
96,-0.34246
97,-0.42256000000000005
98,-0.51977
99,-0.63777
100,-0.77079
101,-0.8996200000000001
102,-0.99466
103,-1.0267
104,-0.9618
105,-0.78559
106,-0.5166
107,-0.16119
108,0.24554
109,0.65901
110,1.0423
111,1.37
112,1.6259
113,1.7902
114,1.8497
115,1.7914
116,1.6004
117,1.2646
118,0.7921600000000001
119,0.20484000000000002
120,-0.45675
121,-1.1192
122,-1.7109999999999999
123,-2.1751
124,-2.4529
125,-2.5269
126,-2.3955
127,-2.0852
128,-1.6443
129,-1.1114
130,-0.53341
131,0.056785
132,0.6241800000000001
133,1.1411
134,1.5865
135,1.9297
136,2.1459
137,2.2152
138,2.1302
139,1.8966
140,1.537
141,1.0726
142,0.54774
143,-0.007749600000000001
144,-0.55998
145,-1.074
146,-1.5151
147,-1.8552
148,-2.0591
149,-2.1051
150,-1.9852
151,-1.703
152,-1.2804
153,-0.75133
154,-0.17338
155,0.40041
156,0.91965
157,1.3408
158,1.6378
159,1.8051
160,1.8438
161,1.7639
162,1.5798
163,1.2919
164,0.90684
165,0.44538
166,-0.074698
167,-0.6141
168,-1.1247
169,-1.5514
170,-1.8373
171,-1.9573
172,-1.8984
173,-1.673
174,-1.3208
175,-0.8899600000000001
176,-0.42937
177,0.02188
178,0.43082
179,0.78235
180,1.0641
181,1.2733
182,1.4092
183,1.4662
184,1.4275
185,1.3008
186,1.0798
187,0.77425
188,0.40612
189,0.0071998
190,-0.38233
191,-0.73653
192,-1.0212
193,-1.2217
194,-1.3283
195,-1.3388
196,-1.2538
197,-1.0833
198,-0.8365299999999999
199,-0.52956
200,-0.18728
201,0.17562
202,0.5252399999999999
203,0.8388100000000001
204,1.0938
205,1.2612
206,1.3296
207,1.2982
208,1.1632
209,0.9304
210,0.62052
211,0.25966999999999996
212,-0.11385
213,-0.47376
214,-0.78545
215,-1.0194
216,-1.1577
217,-1.188
218,-1.1183
219,-0.9657100000000001
220,-0.75718
221,-0.51678
222,-0.2744
223,-0.050037
224,0.15147
225,0.32276
226,0.4725
227,0.59919
228,0.6966899999999999
229,0.755
230,0.75352
231,0.67919
232,0.53943
233,0.34761
234,0.13659000000000002
235,-0.070397
236,-0.24273000000000003
237,-0.37265
238,-0.45463000000000003
239,-0.49382
240,-0.5018
241,-0.47308
242,-0.39947
243,-0.28271
244,-0.1186
245,0.083239
246,0.29268
247,0.48608999999999997
248,0.6388199999999999
249,0.7126399999999999
250,0.6967800000000001
251,0.58509
252,0.39024000000000003
253,0.13209
254,-0.15684
255,-0.43723999999999996
256,-0.67085
257,-0.8356899999999999
258,-0.92012
259,-0.9198299999999999
260,-0.84601
261,-0.7087399999999999
262,-0.5272600000000001
263,-0.32329
264,-0.1099
265,0.10294
266,0.29982
267,0.48713999999999996
268,0.6674
269,0.83168
270,0.97319
271,1.0727
272,1.1129
273,1.0671
274,0.9203899999999999
275,0.67199
276,0.33099
277,-0.072587
278,-0.49783999999999995
279,-0.89681
280,-1.2225
281,-1.4191
282,-1.4645
283,-1.3529
284,-1.1053
285,-0.75451
286,-0.35274
287,0.050453
288,0.4061
289,0.6725399999999999
290,0.8255100000000001
291,0.8559100000000001
292,0.7810600000000001
293,0.64378
294,0.52064
295,0.45428
296,0.47331999999999996
297,0.56376
298,0.67743
299,0.7398399999999999
300,0.67823
301,0.45785
302,0.084957
303,-0.38835
304,-0.8962399999999999
305,-1.3534
306,-1.681
307,-1.8388
308,-1.8081
309,-1.6035
310,-1.2519
311,-0.78659
312,-0.2493
313,0.32287
314,0.89089
315,1.4142
316,1.8514
317,2.1573
318,2.2892
319,2.2285
320,1.9881
321,1.5858
322,1.0694
323,0.48063
324,-0.13591
325,-0.75
326,-1.3396
327,-1.8757
328,-2.3206
329,-2.6215
330,-2.7188
331,-2.569
332,-2.1449
333,-1.4724
334,-0.63443
335,0.24871
336,1.0565
337,1.6837
338,2.0617
339,2.1893
340,2.1103
341,1.9017
342,1.6354
343,1.3531
344,1.0707
345,0.76599
346,0.41117
347,-0.0077266
348,-0.49562
349,-1.0216
350,-1.5041
351,-1.8683
352,-2.0457
353,-2.0065
354,-1.7636
355,-1.3688
356,-0.9010600000000001
357,-0.42518
358,0.015774
359,0.40157
360,0.73488
361,1.0294
362,1.2887
363,1.4992
364,1.6314
365,1.6622
366,1.5674
367,1.3503
368,1.0157
369,0.58486
370,0.10412
371,-0.39489
372,-0.8713200000000001
373,-1.2925
374,-1.6274
375,-1.8413
376,-1.9107
377,-1.8171
378,-1.5691
379,-1.1936
380,-0.72706
381,-0.22211
382,0.2622
383,0.69466
384,1.0598
385,1.3632
386,1.6032
387,1.7686
388,1.845
389,1.7922
390,1.5722
391,1.1728
392,0.62278
393,-0.0045652
394,-0.62137
395,-1.1479
396,-1.5087
397,-1.6654
398,-1.6225
399,-1.4257
400,-1.1305
401,-0.79937
402,-0.47868
403,-0.20039
404,0.030062000000000002
405,0.23404
406,0.41708
407,0.5754600000000001
408,0.70782
409,0.79085
410,0.81628
411,0.7751399999999999
412,0.6782699999999999
413,0.53746
414,0.34957
415,0.12534
416,-0.12779000000000001
417,-0.39419
418,-0.64372
419,-0.8301799999999999
420,-0.9034
421,-0.83954
422,-0.632
423,-0.31848000000000004
424,0.026177
425,0.31765
426,0.49718999999999997
427,0.55024
428,0.49428
429,0.38629
430,0.30351
431,0.2901
432,0.35774
433,0.47498
434,0.57102
435,0.58216
436,0.47008
437,0.23899
438,-0.063776
439,-0.36901999999999996
440,-0.6197600000000001
441,-0.77174
442,-0.82614
443,-0.809
444,-0.75644
445,-0.69403
446,-0.6288
447,-0.55623
448,-0.45421000000000006
449,-0.3035
450,-0.1003
451,0.13282
452,0.36501
453,0.56155
454,0.7028399999999999
455,0.79
456,0.82315
457,0.82549
458,0.80055
459,0.73569
460,0.6208199999999999
461,0.43583999999999995
462,0.17712999999999998
463,-0.14068
464,-0.48318999999999995
465,-0.77756
466,-0.97764
467,-1.0484
468,-0.98649
469,-0.81498
470,-0.57455
471,-0.31744
472,-0.07660399999999999
473,0.12253
474,0.27652
475,0.39818000000000003
476,0.48646999999999996
477,0.54827
478,0.5784199999999999
479,0.5797399999999999
480,0.55014
481,0.47573000000000004
482,0.36298
483,0.21731999999999999
484,0.047857
485,-0.13007
486,-0.30555
487,-0.45255
488,-0.54323
489,-0.5687399999999999
490,-0.524
491,-0.40881
492,-0.24723
493,-0.07388
494,0.06792000000000001
495,0.15455
496,0.16777999999999998
497,0.11638
498,0.032844
499,-0.043672
