time,value
0,-0.14455
1,-0.4678
2,-0.53018
3,-0.46601000000000004
4,-0.5131399999999999
5,0.23868000000000003
6,0.17088
7,-0.22694
8,0.24122
9,0.12611
10,-0.085296
11,0.10703
12,-0.015137000000000001
13,0.34345
14,-0.061028
15,-0.34508
16,-0.3574
17,0.80818
18,-0.17381
19,0.12149000000000001
20,0.15449000000000002
21,0.41535
22,-0.22016
23,0.2746
24,-0.15539
25,0.47101000000000004
26,0.27767
27,0.11765999999999999
28,0.39109
29,-0.22096
30,0.22016999999999998
31,0.072142
32,0.13494
33,-0.27193
34,-0.0059824
35,-0.54013
36,-0.27181
37,-0.53367
38,-0.32636
39,-0.48608
40,-0.29759
41,-0.090265
42,0.010995
43,0.48882
44,0.15254
45,-0.0056909
46,-0.14232
47,-0.006413800000000001
48,0.1871
49,0.064335
50,-0.3988
51,-0.31077
52,-0.18819
53,0.055622000000000005
54,-0.14753
55,0.12941
56,-0.097277
57,-0.24759
58,0.3389
59,0.35001
60,-0.14135999999999999
61,-0.039931
62,0.20543000000000003
63,1.5269
64,1.5269
65,1.5269
66,1.5269
67,1.5269
68,1.5269
69,1.5269
70,1.5269
71,1.5269
72,1.5269
73,1.5269
74,1.5269
75,1.5269
76,1.5269
77,1.5269
78,-1.5478
79,-1.5478
80,-1.5478
81,-1.5478
82,-1.5478
83,-1.5478
84,-1.5478
85,-1.5478
86,-1.5478
87,-1.5478
88,-1.5478
89,-1.5478
90,-1.5478
91,-1.5478
92,-1.5478
93,-0.20403
94,-0.3516
95,0.3921
96,0.38331
97,0.49936
98,0.051570000000000005
99,1.5269
100,1.5269
101,1.5269
102,1.5269
103,1.5269
104,1.5269
105,1.5269
106,1.5269
107,1.5269
108,1.5269
109,1.5269
110,-1.5478
111,-1.5478
112,-1.5478
113,-1.5478
114,-1.5478
115,-1.5478
116,-1.5478
117,-1.5478
118,-1.5478
119,-1.5478
120,-0.15047
121,0.2687
122,0.26588
123,-0.23646999999999999
124,0.2079
125,0.10918
126,-0.14215
127,-0.23469
