time,value
0,-0.47845
1,-0.4165
2,-0.11191
3,0.29339
4,0.67761
5,0.99175
6,1.1384
7,1.1531
8,1.1243
9,1.073
10,0.9705799999999999
11,0.82334
12,0.65808
13,0.39403
14,0.06692200000000001
15,-0.25955
16,-0.55938
17,-0.78794
18,-0.8295600000000001
19,-0.75834
20,-0.62688
21,-0.55735
22,-0.5856399999999999
23,-0.69526
24,-0.8360200000000001
25,-0.8955200000000001
26,-0.78447
27,-0.47316
28,0.010959
29,0.54519
30,0.98592
31,1.2356
32,1.2101
33,0.9125
34,0.44933
35,-0.068583
36,-0.47043
37,-0.64083
38,-0.55696
39,-0.26897
40,0.099473
41,0.48998
42,0.8035
43,0.9652
44,0.93166
45,0.7105100000000001
46,0.37229
47,0.0056497
48,-0.29924
49,-0.5663199999999999
50,-0.7004199999999999
51,-0.69476
52,-0.5115
53,-0.25216
54,-0.004468199999999999
55,0.12722
56,0.13566
57,0.04325
58,-0.14470999999999998
59,-0.30049000000000003
60,-0.41043
61,-0.40410999999999997
62,-0.26249
63,-0.1022
64,0.036366
65,0.078054
66,0.059427999999999995
67,0.031641
68,0.068728
69,0.18161
70,0.43226000000000003
71,0.7590600000000001
72,0.99954
73,1.0989
74,1.0122
75,0.73201
76,0.29886999999999997
77,-0.2032
78,-0.6198899999999999
79,-0.88654
80,-0.9032600000000001
81,-0.74757
82,-0.50544
83,-0.34473000000000004
84,-0.27695
85,-0.26707
86,-0.34084000000000003
87,-0.41697
88,-0.4743
89,-0.47962
90,-0.36238000000000004
91,-0.17414000000000002
92,0.063871
93,0.34818000000000005
94,0.6049800000000001
95,0.8543700000000001
96,1.0669
97,1.1887
98,1.1640000000000001
99,0.8784299999999999
100,0.43578999999999996
101,-0.065578
102,-0.56002
103,-0.9517
104,-1.1091
105,-1.0223
106,-0.79435
107,-0.49048
108,-0.18742
109,0.041919
110,0.19758
111,0.36323
112,0.53138
113,0.69665
114,0.90146
115,1.0285
116,0.9318700000000001
117,0.63663
118,0.14782
119,-0.45377
120,-0.96147
121,-1.2346
122,-1.1803
123,-0.7953100000000001
124,-0.17467
125,0.46348999999999996
126,0.98966
127,1.2736
128,1.2696
129,0.99582
130,0.56865
131,0.075067
132,-0.39081
133,-0.79156
134,-1.1368
135,-1.3327
136,-1.3032
137,-1.0584
138,-0.62387
139,-0.0017105999999999998
140,0.70316
141,1.2707
142,1.5007
143,1.3613
144,0.85388
145,0.093849
146,-0.64373
147,-1.1788
148,-1.3
149,-1.0323
150,-0.43668
151,0.2356
152,0.79402
153,1.002
154,0.79982
155,0.30043000000000003
156,-0.28797
157,-0.78879
158,-1.0032
159,-0.9030600000000001
160,-0.58303
161,-0.18019000000000002
162,0.13981
163,0.24099
164,0.21416
165,0.15728
166,0.19919
167,0.4239
168,0.7903899999999999
169,1.2017
170,1.4849
171,1.4414
172,1.0038
173,0.27729000000000004
174,-0.66887
175,-1.5881
176,-2.194
177,-2.3172
178,-1.8921
179,-1.0189
180,0.087588
181,1.0613
182,1.693
183,1.8436
184,1.5967
185,1.0339
186,0.32632
187,-0.29985
188,-0.68753
189,-0.77691
190,-0.63162
191,-0.38950999999999997
192,-0.20064
193,-0.20151
194,-0.43715
195,-0.78103
196,-1.1439
197,-1.4188
198,-1.4478
199,-1.22
200,-0.68278
201,-0.0071782
202,0.63236
203,1.1923
204,1.629
205,1.8725
206,1.9534
207,1.9676
208,1.9299
209,1.8211
210,1.6062
211,1.2574
212,0.75989
213,0.25585
214,-0.13851
215,-0.42439
216,-0.60887
217,-0.70473
218,-0.8608100000000001
219,-1.1284
220,-1.4898
221,-1.8731
222,-2.1288
223,-2.0681
224,-1.5937
225,-0.8062199999999999
226,0.16004000000000002
227,0.99415
228,1.4321
229,1.3664
230,0.85091
231,0.084864
232,-0.61041
233,-0.9684
234,-0.82439
235,-0.20708000000000001
236,0.6028100000000001
237,1.228
238,1.4324
239,1.1468
240,0.50642
241,-0.22211
242,-0.71073
243,-0.7748
244,-0.36251
245,0.32556
246,1.0335
247,1.4564
248,1.4456
249,0.9877799999999999
250,0.21349
251,-0.6368
252,-1.2706
253,-1.567
254,-1.4639
255,-1.0443
256,-0.5239699999999999
257,-0.12709
258,0.05575700000000001
259,-0.013198
260,-0.2113
261,-0.41253999999999996
262,-0.4815
263,-0.38269000000000003
264,-0.09873
265,0.19428
266,0.4382
267,0.57901
268,0.5683
269,0.4803
270,0.37895999999999996
271,0.30663
272,0.3555
273,0.4161
274,0.44495
275,0.45038999999999996
276,0.36306
277,0.24165
278,0.14959
279,0.12799000000000002
280,0.1721
281,0.23373000000000002
282,0.23096
283,0.08125700000000001
284,-0.23354
285,-0.64232
286,-1.0258
287,-1.2329
288,-1.1159999999999999
289,-0.6455
290,0.10445
291,0.8652299999999999
292,1.465
293,1.7945
294,1.7454
295,1.3401
296,0.6442100000000001
297,-0.10453
298,-0.74787
299,-1.1755
300,-1.2875
301,-1.194
302,-0.9573
303,-0.66268
304,-0.32950999999999997
305,-0.057830999999999994
306,0.20555
307,0.46066
308,0.614
309,0.63855
310,0.5024
311,0.24996999999999997
312,-0.020069
313,-0.22068000000000002
314,-0.25277
315,-0.053519000000000004
316,0.39166999999999996
317,0.97498
318,1.547
319,1.9002
320,1.9329
321,1.5852
322,0.85725
323,-0.05959400000000001
324,-0.9815299999999999
325,-1.686
326,-2.031
327,-1.9941
328,-1.6524
329,-1.1237
330,-0.5321600000000001
331,-0.060318
332,0.2906
333,0.50092
334,0.60464
335,0.61645
336,0.54387
337,0.38449
338,0.14540999999999998
339,-0.15120999999999998
340,-0.50462
341,-0.84949
342,-1.0766
343,-1.1457
344,-0.96895
345,-0.57424
346,0.023224
347,0.67515
348,1.2229
349,1.5117
350,1.4685
351,1.1977
352,0.78358
353,0.37722
354,0.19104000000000002
355,0.27676999999999996
356,0.55745
357,0.93305
358,1.3108
359,1.4874
360,1.3248
361,0.8177300000000001
362,0.013862000000000001
363,-0.9146700000000001
364,-1.7444
365,-2.3636
366,-2.5965
367,-2.4272
368,-1.9845
369,-1.2946
370,-0.47046000000000004
371,0.3717
372,1.2007
373,1.7898
374,2.1075
375,2.0631
376,1.6107
377,0.78671
378,-0.27752
379,-1.324
380,-2.0784
381,-2.2919
382,-1.8803
383,-0.9128299999999999
384,0.27274
385,1.3214
386,1.9357
387,1.9456
388,1.3558
389,0.46841000000000005
390,-0.33132
391,-0.68737
392,-0.40612
393,0.34218000000000004
394,1.2008
395,1.7341
396,1.6529
397,0.9499
398,-0.26342
399,-1.5684
400,-2.4855
401,-2.6559
402,-2.0026
403,-0.7409
404,0.72429
405,1.8565
406,2.3368
407,2.0466
408,1.1118
409,-0.11384000000000001
410,-1.1884
411,-1.8143
412,-1.8044
413,-1.2930000000000001
414,-0.49618999999999996
415,0.27568000000000004
416,0.78456
417,0.9422200000000001
418,0.8315100000000001
419,0.53433
420,0.21209
421,-0.073724
422,-0.33003000000000005
423,-0.58794
424,-0.8460700000000001
425,-1.074
426,-1.2926
427,-1.4159
428,-1.3306
429,-1.0294
430,-0.49278999999999995
431,0.14398
432,0.78797
433,1.2496
434,1.4256
435,1.325
436,0.9793700000000001
437,0.54173
438,0.16905
439,-0.063158
440,-0.08348799999999999
441,0.10951
442,0.44887
443,0.74054
444,0.94485
445,1.0061
446,0.93605
447,0.7358100000000001
448,0.43338999999999994
449,0.021314
450,-0.39137
451,-0.75917
452,-1.0944
453,-1.3336
454,-1.4576
455,-1.4862
456,-1.493
457,-1.4144
458,-1.3193
459,-1.2242
460,-1.1353
461,-0.99971
462,-0.77768
463,-0.44675
464,-0.046705
465,0.39731
466,0.83391
467,1.1111
468,1.1745
469,1.1025
470,0.91914
471,0.71517
472,0.5665399999999999
473,0.52542
474,0.68519
475,0.9213
476,1.0969
477,1.1938
478,1.1811
479,1.0499
480,0.80857
481,0.57706
482,0.38166
483,0.23099
484,0.013475999999999998
485,-0.18417
486,-0.48781
487,-0.90985
488,-1.4038
489,-1.8072
490,-2.0738
491,-2.1452
492,-2.0704
493,-1.8469
494,-1.5132
495,-1.1839
496,-0.9001100000000001
497,-0.6777
498,-0.49082
499,-0.30085
