time,value
0,0.4466
1,1.4887
2,2.1139
3,2.3223
4,1.4887
5,0.65501
6,0.029773
7,-1.0123
8,-1.4291
9,-1.4291
10,-1.0123
11,-1.2207
12,-1.6375
13,-1.6375
14,-1.2207
15,-0.59546
16,-0.17864000000000002
17,0.23818000000000003
18,0.23818000000000003
19,0.029773
20,-0.17864000000000002
21,0.23818000000000003
22,0.23818000000000003
23,0.029773
24,0.029773
25,0.23818000000000003
26,0.23818000000000003
27,0.65501
28,0.8634200000000001
29,1.0718
30,0.8634200000000001
31,0.4466
32,0.23818000000000003
33,0.23818000000000003
34,0.23818000000000003
35,0.23818000000000003
36,0.23818000000000003
37,0.4466
38,0.8634200000000001
39,0.4466
40,1.0718
41,1.9055
42,1.6971
43,1.9055
44,1.0718
45,0.029773
46,-1.0123
47,-1.6375
48,-1.8459
49,-1.2207
50,-1.0123
51,-1.0123
52,-1.6375
53,-1.8459
54,-1.6375
55,-1.0123
56,-0.59546
57,-0.38705
58,-0.17864000000000002
59,-0.17864000000000002
60,0.029773
61,0.23818000000000003
62,0.4466
63,0.4466
64,0.23818000000000003
65,0.23818000000000003
66,0.23818000000000003
67,0.23818000000000003
68,0.029773
69,0.029773
