time,value
0,0.96745
1,0.96745
2,0.96745
3,0.96745
4,0.96745
5,0.96745
6,0.96745
7,0.96745
8,0.96745
9,0.96745
10,0.96745
11,0.96745
12,0.96745
13,0.96745
14,0.96745
15,0.96745
16,0.96745
17,0.96745
18,0.96745
19,0.96745
20,0.96745
21,0.96745
22,0.96745
23,0.96745
24,0.96745
25,0.96745
26,0.96745
27,0.96745
28,0.96745
29,0.96745
30,0.96745
31,0.96745
32,0.96745
33,0.96745
34,0.96745
35,0.96745
36,0.96745
37,0.96745
38,0.96745
39,0.96745
40,0.96745
41,0.96745
42,0.96745
43,0.96745
44,0.96745
45,0.96745
46,0.96745
47,0.96745
48,0.96745
49,0.96745
50,0.96745
51,0.96745
52,0.96745
53,0.96745
54,0.96745
55,0.96745
56,0.96745
57,0.96745
58,0.96745
59,0.96745
60,0.96745
61,0.96745
62,0.96745
63,0.96745
64,0.96799
65,0.9712200000000001
66,0.97931
67,0.9936
68,1.0079
69,1.0222
70,1.0364
71,1.0477
72,1.0507
73,1.0521
74,1.0521
75,1.0521
76,1.0525
77,1.0576
78,1.0661
79,1.0804
80,1.0947
81,1.1089
82,1.1232
83,1.1375
84,1.1518
85,1.1661
86,1.1804
87,1.1946
88,1.2089
89,1.2232
90,1.2375
91,1.2518
92,1.2661
93,1.2803
94,1.2933
95,1.3030000000000002
96,1.2887
97,1.2744
98,1.2601
99,1.2458
100,1.2316
101,1.2173
102,1.203
103,1.1887
104,1.1744
105,1.1601
106,1.1479
107,1.1367
108,1.1367
109,1.1367
110,1.1367
111,1.1367
112,1.1367
113,1.1367
114,1.1367
115,1.1367
116,1.1367
117,1.1367
118,1.1305
119,1.1213
120,1.0936
121,1.065
122,1.0364
123,1.0079
124,0.97931
125,0.95075
126,0.9221799999999999
127,0.89361
128,0.8650399999999999
129,0.8364799999999999
130,0.81182
131,0.78972
132,0.77449
133,0.76021
134,0.74592
135,0.73153
136,0.71697
137,0.6925600000000001
138,0.664
139,0.63543
140,0.6068600000000001
141,0.57829
142,0.55413
143,0.53392
144,0.51847
145,0.5041800000000001
146,0.4899
147,0.47486000000000006
148,0.45842
149,0.43438000000000004
150,0.40581
151,0.37725
152,0.34868000000000005
153,0.32011
154,0.28693
155,0.24811999999999998
156,0.20638
157,0.16353
158,0.12068
159,0.07783
160,0.034979
161,-0.007871300000000001
162,-0.050722
163,-0.093573
164,-0.13642
165,-0.17927
166,-0.22213000000000002
167,-0.26498
168,-0.30783
169,-0.35068
170,-0.39353
171,-0.43521000000000004
172,-0.47213
173,-0.5051
174,-0.53367
175,-0.56224
176,-0.5908
177,-0.61937
178,-0.63962
179,-0.6401600000000001
180,-0.64039
181,-0.64039
182,-0.64039
183,-0.6422800000000001
184,-0.65791
185,-0.67866
186,-0.70723
187,-0.7357899999999999
188,-0.76436
189,-0.7914
190,-0.81557
191,-0.82985
192,-0.8441299999999999
193,-0.8584200000000001
194,-0.8727
195,-0.88741
196,-0.9114
197,-0.93684
198,-0.96541
199,-0.99398
200,-1.0225
201,-1.0481
202,-1.0716
203,-1.0859
204,-1.1002
205,-1.1144
206,-1.1287
207,-1.143
208,-1.1573
209,-1.1716
210,-1.1859
211,-1.2001
212,-1.2144
213,-1.2244
214,-1.2328
215,-1.2328
216,-1.2328
217,-1.2328
218,-1.2328
219,-1.2328
220,-1.2448
221,-1.2584
222,-1.2726
223,-1.2869
224,-1.3012
225,-1.3103
226,-1.3173
227,-1.3174
228,-1.3174
229,-1.3174
230,-1.3174
231,-1.3174
232,-1.3174
233,-1.3174
234,-1.3174
235,-1.3174
236,-1.3174
237,-1.3174
238,-1.3174
239,-1.3174
240,-1.3174
241,-1.3174
242,-1.3174
243,-1.3174
244,-1.3174
245,-1.3174
246,-1.3174
247,-1.3174
248,-1.3174
249,-1.3112
250,-1.3001
251,-1.2864
252,-1.2721
253,-1.2578
254,-1.2454
255,-1.236
256,-1.2328
257,-1.2328
258,-1.2328
259,-1.2328
260,-1.2328
261,-1.2328
262,-1.2328
263,-1.2328
264,-1.2328
265,-1.2328
266,-1.2307
267,-1.2239
268,-1.2128
269,-1.1985
270,-1.1842
271,-1.17
272,-1.1557
273,-1.1414
274,-1.1271
275,-1.1128
276,-1.0985
277,-1.0843
278,-1.07
279,-1.0557
280,-1.0414
281,-1.0271
282,-1.0128
283,-0.9984299999999999
284,-0.98172
285,-0.9611
286,-0.93253
287,-0.90396
288,-0.8754
289,-0.84683
290,-0.8198799999999999
291,-0.80182
292,-0.78538
293,-0.7711
294,-0.7568199999999999
295,-0.74253
296,-0.73247
297,-0.72501
298,-0.72501
299,-0.72501
300,-0.72501
301,-0.72501
302,-0.72597
303,-0.73837
304,-0.75143
305,-0.76571
306,-0.77999
307,-0.79428
308,-0.8085600000000001
309,-0.82284
310,-0.8371299999999999
311,-0.85141
312,-0.86569
313,-0.8799799999999999
314,-0.89426
