time,value
0,-1.1229
1,-1.1229
2,-1.1229
3,-1.1229
4,-1.1229
5,-1.1229
6,-1.1229
7,-1.1229
8,-1.1229
9,-1.1229
10,-1.1229
11,-1.1229
12,-1.1229
13,-1.1229
14,-1.1229
15,-1.1229
16,-1.1229
17,-1.1229
18,-1.1229
19,-1.1229
20,-1.1229
21,-1.1229
22,-1.1229
23,-1.1229
24,-1.1229
25,-1.1229
26,-1.1229
27,-1.1229
28,-1.1229
29,-1.1229
30,-1.1229
31,-1.1229
32,-1.1229
33,-1.1229
34,-1.1229
35,-1.1229
36,-1.1229
37,-1.1229
38,-1.1229
39,-1.1229
40,-1.1229
41,-1.1229
42,-1.1229
43,-1.1229
44,-1.1229
45,-1.1229
46,-1.1229
47,-1.1229
48,-1.1229
49,-1.1229
50,-1.1229
51,-1.1229
52,-1.1229
53,-1.1229
54,-1.1229
55,-1.1229
56,-1.1229
57,-1.1229
58,-1.1229
59,-1.1229
60,-1.1229
61,-1.1229
62,-1.1229
63,-1.1229
64,-1.1229
65,-1.173
66,-1.255
67,-1.3527
68,-1.4504
69,-1.548
70,-1.5718
71,-1.5739
72,-1.5739
73,-1.5739
74,-1.5412
75,-1.4647
76,-1.3671
77,-1.2694
78,-1.1717
79,-1.0741
80,-0.9764299999999999
81,-0.87877
82,-0.7811100000000001
83,-0.69745
84,-0.67195
85,-0.67195
86,-0.67195
87,-0.67195
88,-0.67195
89,-0.67195
90,-0.67195
91,-0.67195
92,-0.67195
93,-0.73836
94,-0.83281
95,-0.93047
96,-1.0281
97,-1.0968
98,-1.1229
99,-1.1229
100,-1.1229
101,-1.1229
102,-1.069
103,-0.9850399999999999
104,-0.88738
105,-0.78972
106,-0.69206
107,-0.5944
108,-0.49673999999999996
109,-0.39908000000000005
110,-0.30141999999999997
111,-0.24406999999999998
112,-0.22099000000000002
113,-0.22099000000000002
114,-0.22099000000000002
115,-0.22099000000000002
116,-0.28008
117,-0.37323
118,-0.47089
119,-0.56855
120,-0.6662100000000001
121,-0.7638699999999999
122,-0.8615299999999999
123,-0.95919
124,-1.0569
125,-1.1065
126,-1.1229
127,-1.1229
128,-1.1229
129,-1.1133
130,-1.054
131,-0.9563200000000001
132,-0.8586600000000001
133,-0.7609999999999999
134,-0.69904
135,-0.67195
136,-0.67195
137,-0.67195
138,-0.67195
139,-0.61998
140,-0.5283399999999999
141,-0.43068
142,-0.33302
143,-0.25764000000000004
144,-0.22099000000000002
145,-0.22099000000000002
146,-0.22099000000000002
147,-0.22099000000000002
148,-0.17879
149,-0.49966000000000005
150,-0.072716
151,0.47695
152,0.18491
153,0.22996999999999998
154,0.22996999999999998
155,0.22996999999999998
156,0.22996999999999998
157,0.22996999999999998
158,0.22996999999999998
159,0.22996999999999998
160,0.22996999999999998
161,0.22996999999999998
162,0.22996999999999998
163,0.22996999999999998
164,0.22996999999999998
165,0.22996999999999998
166,0.21074
167,0.15529
168,0.29024
169,-0.19805999999999999
170,-0.13769
171,-0.19871
172,-0.22099000000000002
173,-0.22099000000000002
174,-0.22099000000000002
175,-0.21498
176,-0.16929
177,-0.35604
178,0.13226
179,0.12369000000000001
180,0.19427
181,0.22996999999999998
182,0.22996999999999998
183,0.22996999999999998
184,0.22996999999999998
185,0.26831
186,0.35635
187,0.45401
188,0.5516800000000001
189,0.6493399999999999
190,0.747
191,0.8446600000000001
192,0.94232
193,1.04
194,1.0751
195,1.0285
196,0.9308299999999999
197,0.8331700000000001
198,0.74002
199,0.68093
200,0.68093
201,0.68093
202,0.68093
203,0.68093
204,0.68093
205,0.68093
206,0.68093
207,0.68093
208,0.68093
209,0.68093
210,0.68093
211,0.68093
212,0.68093
213,0.68093
214,0.68093
215,0.68093
216,0.68093
217,0.68093
218,0.68093
219,0.68093
220,0.68093
221,0.68414
222,0.7154
223,0.81306
224,0.9107200000000001
225,1.0084
226,1.0868
227,1.1319
228,1.1319
229,1.1319
230,1.1319
231,1.1319
232,1.1319
233,1.1319
234,1.1319
235,1.1319
236,1.1319
237,1.1319
238,1.1319
239,1.1319
240,1.1319
241,1.1319
242,1.1319
243,1.1319
244,1.1319
245,1.1319
246,1.1319
247,1.1319
248,1.1319
249,1.1319
250,1.1319
251,1.1319
252,1.1319
253,1.1319
254,1.1319
255,1.1319
256,1.1319
257,1.1319
258,1.1319
259,1.1319
260,1.1319
261,1.1319
262,1.1319
263,1.1319
264,1.1319
265,1.1319
266,1.1319
267,1.1331
268,1.1491
269,1.2468
270,1.3444
271,1.4421
272,1.5153
273,1.5283
274,1.4306
275,1.3330000000000002
276,1.2353
277,1.1646
278,1.2277
279,1.3215
280,1.4191
281,1.5098
282,1.5829
283,1.5829
284,1.5829
285,1.5829
286,1.5829
287,1.5829
288,1.5829
289,1.5829
290,1.5829
291,1.5829
292,1.5829
293,1.5829
294,1.5829
295,1.5829
296,1.5829
297,1.5829
298,1.5829
299,1.5829
300,1.5751
301,1.4961
302,1.4019
303,1.3042
304,1.2066
305,1.1089
306,1.0113
307,0.91359
308,0.81593
309,0.71827
310,0.62061
311,0.52295
312,0.42528999999999995
313,0.32763000000000003
314,0.22996999999999998
315,1.1022
316,1.1022
317,1.1022
318,1.1022
319,1.1022
320,1.1022
321,1.1022
322,1.1022
323,1.1022
324,1.1022
325,1.1022
326,1.1022
327,1.1022
328,1.1022
329,1.1022
330,1.1022
331,1.1022
332,1.1022
333,1.1022
334,1.1022
335,1.1022
336,1.1022
337,1.1022
338,1.1022
339,1.1022
340,1.1022
341,1.1022
342,1.1022
343,1.1022
344,1.1022
345,1.1022
346,1.1022
347,1.1022
348,1.1022
349,1.1022
350,1.1022
351,1.1022
352,1.1022
353,1.1022
354,1.1022
355,1.1022
356,1.1022
357,1.1022
358,1.1022
359,1.1022
360,1.1022
361,1.1022
362,1.1022
363,1.1022
364,1.1022
365,1.1022
366,1.1022
367,1.1022
368,1.1022
369,1.1022
370,1.1022
371,1.1022
372,1.1022
373,1.1022
374,1.1022
375,1.1022
376,1.1022
377,1.1022
378,1.1022
379,1.1022
380,1.0914
381,1.0736
382,1.0525
383,1.0314
384,1.0102
385,1.0051
386,1.0046
387,1.0046
388,1.0046
389,1.0117
390,1.0283
391,1.0494
392,1.0705
393,1.0917
394,1.0998
395,1.1022
396,1.1022
397,1.1022
398,1.1053
399,1.1209
400,1.1420000000000001
401,1.1631
402,1.1843
403,1.1859
404,1.1731
405,1.1520000000000001
406,1.1308
407,1.1097
408,1.0886
409,1.0674
410,1.0463
411,1.0252
412,1.0103
413,1.0046
414,1.0046
415,1.0046
416,1.0046
417,1.0046
418,1.0046
419,1.0046
420,1.0046
421,1.0046
422,1.0046
423,1.0046
424,1.0046
425,1.0046
426,0.99592
427,0.97977
428,0.9586399999999999
429,0.9375100000000001
430,0.91637
431,0.8952399999999999
432,0.8741
433,0.8529700000000001
434,0.83183
435,0.8107
436,0.78956
437,0.7684300000000001
438,0.74729
439,0.72616
440,0.70502
441,0.68389
442,0.66276
443,0.64162
444,0.62257
445,0.61427
446,0.61427
447,0.61427
448,0.61427
449,0.60654
450,0.59127
451,0.57014
452,0.5489999999999999
453,0.52787
454,0.50673
455,0.4856
456,0.46446000000000004
457,0.44333
458,0.42218999999999995
459,0.40105999999999997
460,0.37992
461,0.35879
462,0.33765
463,0.31651999999999997
464,0.29539
465,0.27425
466,0.25311999999999996
467,0.23198000000000002
468,0.21085
469,0.18971
470,0.16858
471,0.14744000000000002
472,0.12630999999999998
473,0.10517
474,0.42231
475,0.31663
476,0.21095999999999998
477,0.056534
478,-0.14645999999999998
479,-0.35781
480,-0.11425
481,-0.15236
482,-0.18263
483,-0.20376
484,-0.2249
485,-0.24603000000000003
486,-0.26716999999999996
487,-0.2883
488,-0.30944
489,-0.33057
490,-0.35041
491,-0.36165
492,-0.36165
493,-0.36165
494,-0.36165
495,-0.36751
496,-0.38092
497,-0.40206
498,-0.42318999999999996
499,-0.44433
500,-0.45716
501,-0.45924
502,-0.45924
503,-0.45924
504,-0.46279
505,-0.47353999999999996
506,-0.49468
507,-0.51581
508,-0.53694
509,-0.55808
510,-0.57921
511,-0.60035
512,-0.62148
513,-0.64262
514,-0.66375
515,-0.68489
516,-0.70602
517,-0.72716
518,-0.74829
519,-0.7694300000000001
520,-0.79056
521,-0.8116899999999999
522,-0.83283
523,-0.85396
524,-0.8751
525,-0.89623
526,-0.91737
527,-0.93553
528,-0.9472
529,-0.9472
530,-0.9472
531,-0.9472
532,-0.9472
533,-0.9472
534,-0.9472
535,-0.9472
536,-0.9472
537,-0.9472
538,-0.9472
539,-0.9472
540,-0.9472
541,-0.9472
542,-0.9472
543,-0.9472
544,-0.9472
545,-0.9472
546,-0.9527200000000001
547,-0.97083
548,-0.9919600000000001
549,-1.0131
550,-1.0342
551,-1.0554
552,-1.0765
553,-1.0976
554,-1.1188
555,-1.1353
556,-1.1424
557,-1.1424
558,-1.1424
559,-1.1424
560,-1.1424
561,-1.1424
562,-1.1424
563,-1.1424
564,-1.1424
565,-1.1424
566,-1.1424
567,-1.1424
568,-1.1424
569,-1.1466
570,-1.1643
571,-1.1853
572,-1.2064
573,-1.2256
574,-1.24
575,-1.24
576,-1.24
577,-1.24
578,-1.24
579,-1.24
580,-1.24
581,-1.24
582,-1.2402
583,-1.2437
584,-1.2648
585,-1.286
586,-1.3071
587,-1.3256
588,-1.3376
589,-1.3376
590,-1.3376
591,-1.3376
592,-1.3376
593,-1.3376
594,-1.3376
595,-1.3376
596,-1.3376
597,-1.3376
598,-1.3376
599,-1.3376
600,-1.3376
601,-1.3376
602,-1.3376
603,-1.3376
604,-1.3376
605,-1.3376
606,-1.3376
607,-1.3376
608,-1.3376
609,-1.3376
610,-1.3376
611,-1.3376
612,-1.3376
613,-1.3376
614,-1.3376
615,-1.3376
616,-1.3376
617,-1.3376
618,-1.3376
619,-1.3387
620,-1.3430000000000002
621,-1.3637
622,-1.3848
623,-1.406
624,-1.4255
625,-1.4339
626,-1.4352
627,-1.4352
628,-1.4352
629,-1.4352
630,1.2831
631,1.2831
632,1.2831
633,1.2831
634,1.2831
635,1.2831
636,1.2831
637,1.2831
638,1.2831
639,1.2831
640,1.2831
641,1.2831
642,1.2831
643,1.2831
644,1.2831
645,1.2831
646,1.2831
647,1.2831
648,1.2831
649,1.2831
650,1.2831
651,1.2831
652,1.2831
653,1.2831
654,1.2831
655,1.2831
656,1.2831
657,1.2831
658,1.2831
659,1.2831
660,1.2831
661,1.2831
662,1.2831
663,1.2831
664,1.2831
665,1.2831
666,1.2831
667,1.2831
668,1.2831
669,1.2831
670,1.2831
671,1.2831
672,1.2831
673,1.2831
674,1.2831
675,1.2831
676,1.2831
677,1.2716
678,1.2579
679,1.2442
680,1.2305
681,1.2218
682,1.2195
683,1.2195
684,1.2195
685,1.2195
686,1.2101
687,1.1976
688,1.1838
689,1.1701
690,1.1586
691,1.1559
692,1.1559
693,1.1559
694,1.1559
695,1.1559
696,1.1559
697,1.1559
698,1.1559
699,1.1559
700,1.1559
701,1.1559
702,1.1559
703,1.1559
704,1.1559
705,1.1559
706,1.1559
707,1.1559
708,1.1559
709,1.1389
710,1.1145
711,1.087
712,1.0594
713,1.0378
714,1.0408
715,1.0546
716,1.0684
717,1.0821
718,1.0895
719,1.0923
720,1.0923
721,1.0923
722,1.0923
723,1.0923
724,1.0923
725,1.0923
726,1.0923
727,1.0882
728,1.0781
729,1.0643
730,1.0505
731,1.0368
732,1.0154
733,0.9897600000000001
734,0.9622200000000001
735,0.9346700000000001
736,0.90712
737,0.8795700000000001
738,0.8520200000000001
739,0.8244799999999999
740,0.79693
741,0.77507
742,0.7580399999999999
743,0.74426
744,0.73049
745,0.71672
746,0.70294
747,0.68917
748,0.6753899999999999
749,0.66162
750,0.64785
751,0.63407
752,0.6203
753,0.60652
754,0.59275
755,0.57221
756,0.54697
757,0.51942
758,0.49188000000000004
759,0.46433
760,0.43678
761,0.40923000000000004
762,0.38169000000000003
763,0.35414
764,0.33163000000000004
765,0.31403000000000003
766,0.30025999999999997
767,0.28648
768,0.27271
769,0.25161
770,0.22491
771,0.19735999999999998
772,0.16981
773,0.14226
774,0.11472
775,0.43793999999999994
776,0.30021
777,0.16247
778,0.16784000000000002
779,-0.11300999999999999
780,-0.25075
781,-0.38849
782,-0.10567
783,-0.13321
784,-0.16076
785,-0.18830999999999998
786,-0.21586
787,-0.24341
788,-0.27095
789,-0.2985
790,-0.32605
791,-0.3536
792,-0.36844
793,-0.37061
794,-0.37061
795,-0.37061
796,-0.37061
797,-0.37061
798,-0.37061
799,-0.37061
800,-0.37061
801,-0.37578
802,-0.38641
803,-0.40019
804,-0.41396000000000005
805,-0.42773
806,-0.44151
807,-0.45528
808,-0.46905
809,-0.48283000000000004
810,-0.4966
811,-0.5103800000000001
812,-0.52415
813,-0.53792
814,-0.5517
815,-0.57088
816,-0.59707
817,-0.62462
818,-0.65217
819,-0.67971
820,-0.70726
821,-0.7348100000000001
822,-0.76236
823,-0.78991
824,-0.81304
825,-0.83042
826,-0.84419
827,-0.8579600000000001
828,-0.87174
829,-0.88551
830,-0.8992899999999999
831,-0.91306
832,-0.9268299999999999
833,-0.93735
834,-0.94304
835,-0.94304
836,-0.94304
837,-0.94304
838,-0.9475299999999999
839,-0.95965
840,-0.9734200000000001
841,-0.9872
842,-1.001
843,-1.0147
844,-1.0285
845,-1.0423
846,-1.0561
847,-1.0662
848,-1.0702
849,-1.0702
850,-1.0702
851,-1.0702
852,-1.0702
853,-1.0702
854,-1.0702
855,-1.0702
856,-1.0702
857,-1.0702
858,-1.0702
859,-1.0702
860,-1.0702
861,-1.0738
862,-1.0856
863,-1.0994
864,-1.1132
865,-1.1254
866,-1.1338
867,-1.1338
868,-1.1338
869,-1.1338
870,-1.1338
871,-1.1338
872,-1.1338
873,-1.1338
874,-1.1338
875,-1.1338
876,-1.1338
877,-1.1338
878,-1.1338
879,-1.1338
880,-1.1338
881,-1.1338
882,-1.1338
883,-1.1338
884,-1.1311
885,-1.1196
886,-1.1059
887,-1.0921
888,-1.0796
889,-1.0702
890,-1.0702
891,-1.0702
892,-1.0702
893,-1.0679
894,-1.0592
895,-1.0455
896,-1.0318
897,-1.0182
898,-1.0066
899,-1.0066
900,-1.0066
901,-1.0066
902,-1.0066
903,-1.0066
904,-1.0066
905,-1.0066
906,-1.0066
907,-1.0085
908,-1.0199
909,-1.0334
910,-1.0472
911,-1.0599
912,-1.0702
913,-1.0702
914,-1.0702
915,-1.0702
916,-1.0702
917,-1.0702
918,-1.0702
919,-1.0702
920,-1.0703
921,-1.0715
922,-1.0852
923,-1.099
924,-1.1128
925,-1.1266
926,-1.1403
927,-1.1541
928,-1.1679
929,-1.1817
930,-1.1943
931,-1.197
932,-1.1975
933,-1.1975
934,-1.1975
935,-1.1975
936,-1.1975
937,-1.1975
938,-1.1975
939,-1.1975
940,-1.1975
941,-1.1975
942,-1.1975
943,-1.1975
944,-1.1975
