time,value
0,-0.32995
1,-0.0037360999999999996
2,-0.22787
3,0.052099
4,-0.11767999999999999
5,-0.11753
6,-0.038441
7,-0.17595999999999998
8,0.23167
9,-0.36172
10,-0.092174
11,-0.7713800000000001
12,-0.19977999999999999
13,0.72526
14,0.12785
15,-0.26886
16,0.27991
17,-0.19515
18,0.1018
19,-0.036494
20,-0.21659
21,-0.29215
22,0.26934
23,-0.30196999999999996
24,0.52518
25,0.18183
26,0.36052
27,-0.07091900000000001
28,-0.38919000000000004
29,1.507
30,1.507
31,1.507
32,1.507
33,1.507
34,1.507
35,1.507
36,1.507
37,1.507
38,1.507
39,1.507
40,1.507
41,-1.5097
42,-1.5097
43,-1.5097
44,-1.5097
45,-1.5097
46,-1.5097
47,-1.5097
48,-1.5097
49,-1.5097
50,-1.5097
51,-1.5097
52,-0.20143
53,0.48531
54,-0.28383
55,0.27007
56,0.077973
57,0.047883999999999996
58,-0.12598
59,0.19097999999999998
60,-0.16802999999999998
61,-0.31059000000000003
62,-0.3595
63,-0.37222
64,-0.008921
65,-0.49206000000000005
66,-0.24115999999999999
67,0.21274
68,-0.12842
69,-0.038932
70,0.20202
71,0.44309
72,-0.086034
73,-0.17207
74,0.12845
75,-0.46543
76,0.12702
77,0.31324
78,-0.4021
79,0.27974
80,1.507
81,1.507
82,1.507
83,1.507
84,1.507
85,1.507
86,1.507
87,1.507
88,1.507
89,1.507
90,1.507
91,1.507
92,1.507
93,1.507
94,1.507
95,-1.5097
96,-1.5097
97,-1.5097
98,-1.5097
99,-1.5097
100,-1.5097
101,-1.5097
102,-1.5097
103,-1.5097
104,-1.5097
105,-1.5097
106,-1.5097
107,-1.5097
108,-1.5097
109,-1.5097
110,-0.28909
111,0.5847899999999999
112,0.25401
113,0.010568000000000001
114,0.17669
115,-0.22268000000000002
116,-0.1354
117,-0.076306
118,-0.14762999999999998
119,0.24824000000000002
120,0.056416999999999995
121,0.22981
122,0.55432
123,-0.052335
124,0.4016
125,-0.43075
126,0.25190999999999997
127,-0.42096999999999996
