time,value
0,0.93371
1,1.8931
2,1.8931
3,-0.30789
4,-0.64651
5,-0.64651
6,-0.64651
7,-0.64651
8,-0.64651
9,-0.64651
10,-0.64651
11,1.6109
12,1.8931
13,1.1595
14,-0.64651
15,-0.64651
16,-0.64651
17,-0.64651
18,-0.64651
19,-0.64651
20,-0.64651
21,0.36934
22,1.8931
23,1.8931
24,0.030726
25,-0.64651
26,-0.64651
27,-0.64651
28,-0.64651
29,-0.64651
30,-0.64651
31,-0.64651
32,0.93371
33,1.8931
34,1.6109
35,-0.42076
36,-0.64651
37,-0.64651
38,-0.64651
39,-0.64651
40,-0.64651
41,-0.64651
42,-0.082146
43,1.8931
44,1.8931
45,0.53865
46,-0.59007
47,-0.64651
48,-0.64651
49,-0.64651
50,-0.64651
51,-0.64651
52,-0.64651
53,1.3852
54,1.8931
55,1.3852
56,-0.53364
57,-0.64651
58,-0.64651
59,-0.64651
60,-0.64651
61,-0.64651
62,-0.64651
63,-0.64651
64,1.8931
65,1.8931
66,0.93371
67,-0.53364
68,-0.64651
69,-0.64651
70,-0.64651
71,-0.64651
72,-0.64651
73,-0.64651
74,0.20002999999999999
75,1.8931
76,1.8931
77,0.030726
78,-0.64651
79,-0.64651
80,-0.64651
81,-0.64651
82,-0.64651
83,-0.64651
84,-0.64651
85,1.3852
86,1.8931
87,1.6109
88,-0.64651
89,-0.64651
90,-0.64651
91,-0.64651
92,-0.64651
93,-0.64651
94,-0.64651
95,-0.42076
96,1.8931
97,1.8931
98,0.53865
99,-0.53364
100,-0.64651
101,-0.64651
102,-0.64651
103,-0.64651
104,-0.64651
105,-0.64651
106,0.36934
107,1.8931
108,1.8931
109,-0.19502
110,-0.64651
111,-0.64651
112,-0.64651
113,-0.64651
114,-0.64651
115,-0.64651
116,-0.64651
117,1.3852
118,1.8931
119,1.6109
120,-0.59007
121,-0.64651
122,-0.64651
123,-0.64651
124,-0.64651
125,-0.64651
126,-0.64651
127,-0.64651
128,1.8931
129,1.8931
130,1.1595
131,-0.53364
132,-0.64651
133,-0.64651
134,-0.64651
135,-0.64651
136,-0.64651
137,-0.64651
138,-0.19502
139,1.8931
140,1.8931
141,0.53865
142,-0.53364
143,-0.64651
144,-0.64651
145,-0.64651
146,-0.64651
147,-0.64651
148,-0.64651
149,0.70796
150,1.8931
151,1.8931
152,-0.082146
153,-0.64651
154,-0.64651
155,-0.64651
156,-0.64651
157,-0.64651
158,-0.64651
159,-0.64651
160,0.70796
161,1.8931
162,1.8931
163,-0.42076
164,-0.64651
165,-0.64651
166,-0.64651
167,-0.64651
168,-0.64651
169,-0.64651
170,-0.64651
171,1.1595
172,1.8931
173,1.6109
174,-0.64651
175,-0.64651
176,-0.64651
177,-0.64651
178,-0.64651
179,-0.64651
180,-0.64651
181,-0.30789
182,1.8931
183,1.8931
184,0.70796
185,-0.64651
186,-0.64651
187,-0.64651
188,-0.64651
189,-0.64651
190,-0.64651
191,-0.64651
192,-0.19502
193,1.8931
194,1.8931
195,0.53865
196,-0.64651
197,-0.64651
198,-0.64651
199,-0.64651
200,-0.64651
201,-0.64651
202,-0.64651
203,0.36934
204,1.8931
205,1.6109
206,0.030726
207,-0.53364
208,-0.64651
209,-0.64651
210,-0.64651
211,-0.64651
212,-0.64651
213,-0.64651
214,0.70796
215,1.8931
216,1.6109
217,-0.42076
218,-0.59007
219,-0.64651
220,-0.64651
221,-0.64651
222,-0.64651
223,-0.64651
224,-0.64651
225,2.1753
226,1.6109
227,0.93371
228,-0.59007
229,-0.64651
230,-0.64651
231,-0.64651
232,-0.64651
233,-0.64651
234,-0.64651
235,0.36934
236,1.8931
237,1.8931
238,-0.30789
239,-0.64651
240,-0.64651
241,-0.64651
242,-0.64651
243,-0.64651
244,-0.64651
245,-0.64651
246,0.93371
247,1.8931
248,1.6109
249,-0.42076
250,-0.59007
251,-0.64651
252,-0.64651
253,-0.64651
254,-0.64651
255,-0.64651
256,-0.64651
257,0.93371
258,1.8931
259,1.8931
260,-0.53364
261,-0.64651
262,-0.64651
263,-0.64651
264,-0.64651
265,-0.64651
266,-0.64651
267,-0.64651
268,1.1595
269,1.8931
270,1.6109
271,-0.4772
272,-0.64651
273,-0.64651
274,-0.64651
275,-0.64651
276,-0.64651
277,-0.64651
278,-0.64651
279,1.6109
280,1.8931
281,1.6109
282,-0.64651
283,-0.64651
284,-0.64651
285,-0.64651
286,-0.64651
287,-0.64651
288,-0.64651
289,1.8931
290,1.6109
291,1.3852
292,-0.53364
293,-0.64651
294,-0.64651
295,-0.64651
296,-0.64651
297,-0.64651
298,-0.64651
299,0.93371
300,1.8931
301,1.8931
302,-0.64651
303,-0.64651
304,-0.64651
305,-0.64651
306,-0.64651
307,-0.64651
308,-0.64651
309,0.20002999999999999
310,1.8931
311,1.8931
312,0.36934
313,-0.64651
314,-0.64651
315,-0.64651
316,-0.64651
317,-0.64651
318,-0.64651
319,-0.64651
320,1.1595
321,1.8931
322,1.6109
323,-0.4772
324,-0.64651
325,-0.64651
326,-0.64651
327,-0.64651
328,-0.64651
329,-0.64651
330,-0.42076
331,1.8931
332,1.8931
333,0.70796
334,-0.64651
335,-0.64651
336,-0.64651
337,-0.64651
338,-0.64651
339,-0.64651
340,-0.64651
341,0.030726
342,1.8931
343,1.8931
344,0.36934
345,-0.64651
346,-0.64651
347,-0.64651
348,-0.64651
349,-0.64651
350,-0.64651
351,-0.64651
352,0.93371
353,1.8931
354,1.8931
355,-0.4772
356,-0.64651
357,-0.64651
358,-0.64651
359,-0.64651
360,-0.64651
361,-0.64651
362,0.030726
363,1.8931
364,1.8931
365,0.20002999999999999
366,-0.53364
367,-0.64651
368,-0.64651
369,-0.64651
370,-0.64651
371,-0.64651
372,-0.64651
373,1.1595
374,1.8931
375,1.3852
376,-0.4772
377,-0.64651
378,-0.64651
379,-0.64651
380,-0.64651
381,-0.64651
382,-0.64651
383,0.20002999999999999
384,1.8931
385,1.8931
386,0.20002999999999999
387,-0.53364
388,-0.64651
389,-0.64651
390,-0.64651
391,-0.64651
392,-0.64651
393,-0.64651
394,1.8931
395,1.8931
396,1.1595
397,-0.64651
398,-0.64651
399,-0.64651
400,-0.64651
401,-0.64651
402,-0.64651
403,-0.64651
404,1.1595
405,1.8931
406,1.6109
407,-0.4772
408,-0.64651
409,-0.64651
410,-0.64651
411,-0.64651
412,-0.64651
413,-0.64651
414,0.030726
415,1.8931
416,1.6109
417,0.53865
418,-0.59007
419,-0.64651
420,-0.64651
421,-0.64651
422,-0.64651
423,-0.64651
424,-0.64651
425,1.6109
426,1.8931
427,1.1595
428,-0.64651
429,-0.64651
430,-0.64651
431,-0.64651
432,-0.64651
433,-0.64651
434,-0.64651
435,0.20002999999999999
436,1.8931
437,1.8931
438,0.030726
439,-0.64651
440,-0.64651
441,-0.64651
442,-0.64651
443,-0.64651
444,-0.64651
445,-0.64651
446,1.6109
447,1.8931
448,1.1595
449,-0.64651
450,-0.64651
451,-0.64651
452,-0.64651
453,-0.64651
454,-0.64651
455,-0.64651
456,0.53865
457,1.8931
458,1.6109
459,-0.082146
460,-0.64651
461,-0.64651
462,-0.64651
463,-0.64651
464,-0.64651
465,-0.64651
466,-0.64651
467,1.3852
468,1.8931
469,1.3852
470,-0.53364
471,-0.64651
472,-0.64651
473,-0.64651
474,-0.64651
475,-0.64651
476,-0.64651
477,0.53865
478,1.8931
479,1.8931
480,-0.19502
481,-0.59007
482,-0.64651
483,-0.64651
484,-0.64651
485,-0.64651
486,-0.64651
487,-0.64651
488,1.8931
489,1.8931
490,0.93371
491,-0.59007
492,-0.64651
493,-0.64651
494,-0.64651
495,-0.64651
496,-0.64651
497,-0.64651
498,0.70796
499,1.8931
500,1.6109
501,-0.30789
502,-0.59007
503,-0.64651
504,-0.64651
505,-0.64651
506,-0.64651
507,-0.64651
508,-0.30789
509,1.8931
510,1.8931
511,0.53865
512,-0.59007
513,-0.64651
514,-0.64651
515,-0.64651
516,-0.64651
517,-0.64651
518,-0.64651
519,0.53865
520,1.8931
521,1.8931
522,-0.19502
523,-0.59007
524,-0.64651
525,-0.64651
526,-0.64651
527,-0.64651
528,-0.64651
529,-0.64651
530,1.1595
531,1.8931
532,1.6109
533,-0.64651
534,-0.64651
535,-0.64651
536,-0.64651
537,-0.64651
538,-0.64651
539,-0.64651
540,-0.64651
541,2.1753
542,1.8931
543,0.93371
544,-0.64651
545,-0.64651
546,-0.64651
547,-0.64651
548,-0.64651
549,-0.64651
550,-0.64651
551,0.70796
552,1.8931
553,1.8931
554,-0.19502
555,-0.64651
556,-0.64651
557,-0.64651
558,-0.64651
559,-0.64651
560,-0.64651
561,-0.64651
562,1.8931
563,1.8931
564,0.93371
565,-0.4772
566,-0.64651
567,-0.64651
568,-0.64651
569,-0.64651
570,-0.64651
571,-0.64651
572,0.93371
573,1.8931
574,1.6109
575,-0.19502
576,-0.59007
577,-0.64651
578,-0.64651
579,-0.64651
580,-0.64651
581,-0.64651
582,-0.19502
583,1.8931
584,1.8931
585,0.36934
586,-0.64651
587,-0.64651
588,-0.64651
589,-0.64651
590,-0.64651
591,-0.64651
592,-0.64651
593,2.1753
594,1.6109
595,0.93371
596,-0.4772
597,-0.64651
598,-0.64651
599,-0.64651
600,-0.64651
601,-0.64651
602,-0.64651
603,1.6109
604,1.8931
605,1.3852
606,-0.4772
607,-0.64651
608,-0.64651
609,-0.64651
610,-0.64651
611,-0.64651
612,-0.64651
613,0.93371
614,1.8931
615,1.8931
616,-0.42076
617,-0.59007
618,-0.64651
619,-0.64651
620,-0.64651
621,-0.64651
622,-0.64651
623,-0.19502
624,1.8931
625,1.8931
626,0.70796
627,-0.59007
628,-0.64651
629,-0.64651
630,-0.64651
631,-0.64651
632,-0.64651
633,-0.64651
634,0.93371
635,1.8931
636,1.8931
637,-0.59007
638,-0.64651
639,-0.64651
640,-0.64651
641,-0.64651
642,-0.64651
643,-0.64651
644,0.36934
645,1.8931
646,1.8931
647,0.030726
648,-0.64651
649,-0.64651
650,-0.64651
651,-0.64651
652,-0.64651
653,-0.64651
654,-0.64651
655,1.8931
656,1.6109
657,0.93371
658,-0.4772
659,-0.64651
660,-0.64651
661,-0.64651
662,-0.64651
663,-0.64651
664,-0.64651
665,0.70796
666,1.8931
667,1.8931
668,-0.30789
669,-0.64651
670,-0.64651
671,-0.64651
672,-0.64651
673,-0.64651
674,-0.64651
675,-0.19502
676,1.8931
677,1.8931
678,0.70796
679,-0.64651
680,-0.64651
681,-0.64651
682,-0.64651
683,-0.64651
684,-0.64651
685,-0.64651
686,1.6109
687,1.8931
688,1.1595
689,-0.4772
690,-0.64651
691,-0.64651
692,-0.64651
693,-0.64651
694,-0.64651
695,-0.64651
696,1.1595
697,1.8931
698,1.6109
699,-0.59007
700,-0.64651
701,-0.64651
702,-0.64651
703,-0.64651
704,-0.64651
705,-0.64651
706,0.70796
707,1.8931
708,1.8931
709,-0.30789
710,-0.64651
711,-0.64651
712,-0.64651
713,-0.64651
714,-0.64651
715,-0.64651
716,-0.19502
717,1.8931
718,1.8931
719,0.53865
