time,value
0,0.71094
1,0.80215
2,0.89336
3,0.92099
4,0.94511
5,0.94763
6,0.94763
7,0.94763
8,0.94763
9,0.94763
10,0.94763
11,0.94763
12,0.94763
13,0.94763
14,0.94763
15,0.94763
16,0.94763
17,0.9456600000000001
18,0.94227
19,0.9286
20,0.9058
21,0.89261
22,0.8899799999999999
23,0.88846
24,0.88846
25,0.8763799999999999
26,0.8439700000000001
27,0.79273
28,0.7015100000000001
29,0.61031
30,0.5190899999999999
31,0.43195
32,0.35958
33,0.28996
34,0.23437
35,0.18139
36,0.14935
37,0.11915999999999999
38,0.1184
39,0.11750999999999999
40,0.094703
41,0.38906999999999997
42,0.27505999999999997
43,0.16104000000000002
44,0.12155999999999999
45,-0.1763
46,-0.37261
47,-0.12057999999999999
48,-0.14689000000000002
49,-0.16969
50,-0.20906999999999998
51,-0.25411
52,-0.28831
53,-0.31771
54,-0.33636
55,-0.34899
56,-0.35419
57,-0.35419
58,-0.35419
59,-0.35419
60,-0.34407
61,-0.32315
62,-0.30141999999999997
63,-0.27862
64,-0.25916999999999996
65,-0.24523000000000003
66,-0.23676
67,-0.23959
68,-0.2479
69,-0.2707
70,-0.29351
71,-0.31631
72,-0.34142
73,-0.37779
74,-0.41525
75,-0.46085
76,-0.50655
77,-0.55367
78,-0.60106
79,-0.66947
80,-0.73787
81,-0.80628
82,-0.87469
83,-0.9319700000000001
84,-0.98813
85,-1.0299
86,-1.0693
87,-1.0954
88,-1.1182
89,-1.141
90,-1.1638
91,-1.1747
92,-1.1806
93,-1.1897
94,-1.2006
95,-1.2186
96,-1.2414
97,-1.2642
98,-1.287
99,-1.3204
100,-1.3649
101,-1.3962
102,-1.4105
103,-1.4156
104,-1.406
105,-1.3896
106,-1.3596
107,-1.3189
108,-1.2505
109,-1.1821
110,-1.1136
111,-1.0503
112,-1.0105
113,-0.9718399999999999
114,-0.94075
115,-0.9087700000000001
116,-0.8654299999999999
117,-0.8224899999999999
118,-0.79969
119,-0.77688
120,-0.7356699999999999
121,-0.6938300000000001
122,-0.64855
123,-0.6029399999999999
124,-0.55132
125,-0.49873999999999996
126,-0.43105
127,-0.35980999999999996
128,-0.23886
129,-0.48063
130,0.20344
131,0.17159000000000002
132,0.30841
133,0.44522
134,0.57524
135,0.70075
136,0.80742
137,0.89864
138,0.96757
139,1.0139
140,1.0527
141,1.0819
142,1.1004
143,1.1025
144,1.0961
145,1.0733
146,1.0505
147,1.0277
148,0.9999600000000001
149,0.95605
150,0.91459
151,0.8840600000000001
152,0.8569
153,0.85219
154,0.84964
155,0.87244
156,0.8952399999999999
157,0.91805
158,0.94085
159,0.9443799999999999
160,0.9474
161,0.94763
162,0.94763
163,0.95435
164,0.9620799999999999
165,0.97935
166,0.99876
167,0.9858899999999999
168,0.96309
169,0.95344
170,0.94911
171,0.93942
172,0.9269799999999999
173,0.90825
174,0.88544
175,0.86285
176,0.8404200000000001
177,0.8292799999999999
178,0.8292799999999999
179,0.82155
180,0.8044
181,0.78943
182,0.77775
183,0.76835
184,0.76326
185,0.7529600000000001
186,0.73016
187,0.6967800000000001
188,0.63026
189,0.56038
190,0.47613999999999995
191,0.38826
192,0.27745
193,0.16347
194,0.1063
195,-0.13464
196,-0.33986
197,-0.54509
198,-0.50865
199,-0.46738
200,-0.42786
201,-0.38847
202,-0.35618
203,-0.3249
204,-0.27981
205,-0.23175
206,-0.168
207,-0.46838
208,0.1209
209,0.10330999999999999
210,0.20614000000000002
211,0.30696
212,0.40628000000000003
213,0.50465
214,0.6099100000000001
215,0.72053
216,0.7979999999999999
217,0.8436100000000001
218,0.8892100000000001
219,0.9348200000000001
220,0.9804200000000001
221,1.026
222,1.0716
223,1.1172
224,1.1628
225,1.2084
226,1.2597
227,1.3279
228,1.3896
229,1.4249
230,1.4583
231,1.4811
232,1.5039
233,1.5267
234,1.5495
235,1.5723
236,1.5952
237,1.5969
238,1.5984
239,1.5985
240,1.5985
241,1.5822
242,1.5638
243,1.5228
244,1.4772
245,1.4316
246,1.386
247,1.3259
248,1.2603
249,1.1834
250,1.1011
251,0.9984700000000001
252,0.88351
253,0.74102
254,0.57763
255,0.39264
256,0.18742
257,-0.059445000000000005
258,-0.22303
259,-0.43865
260,-0.6691199999999999
261,-0.90454
262,-1.1488
263,-1.3875
264,-1.6138
265,-1.8232
266,-1.9828
267,-2.1248
268,-2.1978
269,-2.2598
270,-2.2602
271,-2.2555
272,-2.2046
273,-2.153
274,-2.0845
275,-2.0161
276,-1.9477
277,-1.8793
278,-1.8109
279,-1.7425
280,-1.683
281,-1.6246
282,-1.5769
283,-1.5313
284,-1.4856
285,-1.44
286,-1.4096
287,-1.3847
288,-1.3513
289,-1.3138
290,-1.2712
291,-1.2256
292,-1.18
293,-1.1344
294,-1.0888
295,-1.0432
296,-1.0067
297,-0.9805
298,-0.9501299999999999
299,-0.91394
300,-0.87431
301,-0.8287100000000001
302,-0.78352
303,-0.73923
304,-0.7005600000000001
305,-0.67776
306,-0.65496
307,-0.63215
308,-0.60935
309,-0.58655
310,-0.56311
311,-0.53428
312,-0.50457
313,-0.45897
314,-0.41336000000000006
315,-0.16752
316,0.080505
317,0.32853000000000004
318,0.40365999999999996
319,0.46926
320,0.47612
321,0.47612
322,0.47612
323,0.47612
324,0.47612
325,0.47612
326,0.47612
327,0.47612
328,0.47612
329,0.47612
330,0.47612
331,0.47612
332,0.093602
333,0.10098
334,0.13072
335,0.18032
336,0.209
337,0.21474000000000001
338,0.21804
339,0.21804
340,0.21804
341,0.21804
342,0.21804
343,0.21804
344,0.21804
345,0.21804
346,0.2092
347,0.1682
348,0.13491
349,0.14106
350,0.15039
351,0.18524000000000002
352,0.21813000000000002
353,0.21977
354,0.22173
355,0.27133
356,0.32094
357,0.33416
358,0.34564
359,0.36932
360,0.39433
361,0.43013
362,0.46785
363,0.47548999999999997
364,0.47548999999999997
365,0.47548999999999997
366,0.47548999999999997
367,0.49992
368,0.53518
369,0.5654399999999999
370,0.59291
371,0.60422
372,0.60422
373,0.60422
374,0.60422
375,0.60422
376,0.60422
377,0.61819
378,0.65058
379,0.67488
380,0.68595
381,0.67719
382,0.62759
383,0.57798
384,0.5283800000000001
385,0.48825
386,0.48128000000000004
387,0.47048
388,0.44096
389,0.40908
390,0.35946999999999996
391,0.30965
392,0.25677
393,0.20328
394,0.10407000000000001
395,0.053858
396,-0.44218999999999997
397,-0.19355999999999998
398,-0.26855999999999997
399,-0.34113000000000004
400,-0.39403
401,-0.44364
402,-0.49323999999999996
403,-0.54285
404,-0.59245
405,-0.6420600000000001
406,-0.66586
407,-0.67857
408,-0.69844
409,-0.72222
410,-0.7677
411,-0.82796
412,-0.90935
413,-1.0086
414,-1.0847
415,-1.1367
416,-1.1877
417,-1.2373
418,-1.2708
419,-1.2786
420,-1.2672
421,-1.2176
422,-1.168
423,-1.1184
424,-1.079
425,-1.0736
426,-1.0747
427,-1.1059
428,-1.1371
429,-1.1687
430,-1.198
431,-1.198
432,-1.198
433,-1.198
434,-1.198
435,-1.198
436,-1.198
437,-1.2238
438,-1.2521
439,-1.2726
440,-1.2919
441,-1.2554
442,-1.2058
443,-1.1561
444,-1.1065
445,-1.0297
446,-0.9416
447,-0.8296100000000001
448,-0.70498
449,-0.5806
450,-0.45638
451,-0.37313
452,-0.32352
453,-0.29815
454,-0.29733000000000004
455,-0.29686999999999997
456,-0.29686999999999997
457,-0.30572
458,-0.32826
459,-0.36001
460,-0.40961000000000003
461,-0.45921999999999996
462,-0.5088199999999999
463,-0.55843
464,-0.6080300000000001
465,-0.65164
466,-0.6684399999999999
467,-0.68048
468,-0.6608
469,-0.63878
470,-0.58917
471,-0.53957
472,-0.48996000000000006
473,-0.44036000000000003
474,-0.34883000000000003
475,-0.25618
476,-0.18507
477,-0.11578
478,-0.36152
479,-0.19752999999999998
480,-0.15245
481,-0.134
482,0.060007000000000005
483,0.30803
484,0.41295
485,0.46008999999999994
486,0.47612
487,0.47612
488,0.09778200000000001
489,0.11172
490,0.14502
491,0.1938
492,0.21804
493,0.21804
494,0.23485999999999999
495,0.27216999999999997
496,0.32402
497,0.39781
498,0.47273999999999994
499,0.54982
500,0.60422
501,0.60422
502,0.60422
503,0.60422
504,0.59117
505,0.5222899999999999
506,0.4434
507,0.30156
508,0.14933
509,-0.11467999999999999
510,-0.38952
511,-0.9847899999999999
512,-1.58
513,-1.6496
514,-1.7086
515,-1.7422
516,-1.7737
517,-1.7888
518,-1.8015
519,-1.7585
520,-1.7036
521,-1.6145
522,-1.5153
523,-1.4461
524,-1.3887
525,-1.2983
526,-1.1913
527,-1.0777
528,-0.96006
529,-0.8792700000000001
530,-0.82721
531,-0.75111
532,-0.6519
533,-0.55269
534,-0.45348
535,-0.35427
536,-0.25506
537,-0.15136
538,-0.16764
539,0.44742
540,0.23239
541,0.40564
542,0.65284
543,0.8789899999999999
544,1.0188
545,1.156
546,1.2782
547,1.4019
548,1.5409
549,1.6783
550,1.7775
551,1.8767
552,1.9759
553,2.0752
554,2.1744
555,2.2736
556,2.3728
557,2.472
558,2.5654
559,2.6577
560,2.7167
561,2.7664
562,2.7844
563,2.7906
564,2.813
565,2.8433
566,2.8643
567,2.8794
568,2.8531
569,2.7953
570,2.6905
571,2.5417
572,2.374
573,2.1846
574,1.9802
575,1.7543
576,1.5102
577,1.2334
578,0.93581
579,0.59104
580,0.27092
581,0.14405
582,-0.20985
583,-0.38244
584,-0.54406
585,-0.64368
586,-0.7384
587,-0.78801
588,-0.8376100000000001
589,-0.8872200000000001
590,-0.9368200000000001
591,-0.89112
592,-0.8448
593,-0.8281799999999999
594,-0.81342
595,-0.79247
596,-0.77074
597,-0.72569
598,-0.67609
599,-0.62648
600,-0.5768800000000001
601,-0.56028
602,-0.55577
603,-0.53259
604,-0.50062
605,-0.46941000000000005
606,-0.43866000000000005
607,-0.4223
608,-0.41656000000000004
609,-0.38788
610,-0.33828
611,-0.28867
612,-0.23906999999999998
613,-0.18946
614,-0.13985999999999998
615,-0.4217
616,-0.17367
617,0.069854
618,0.30353
619,0.47612
620,0.47612
621,0.47612
622,0.47612
623,0.47612
624,0.47612
625,0.47612
626,0.47612
627,0.47612
628,0.47612
629,0.47612
630,2.2
631,2.2705
632,2.3409999999999997
633,2.3624
634,2.381
635,2.383
636,2.383
637,2.383
638,2.383
639,2.383
640,2.383
641,2.383
642,2.383
643,2.383
644,2.383
645,2.383
646,2.383
647,2.3799
648,2.3747
649,2.3536
650,2.3183
651,2.2979
652,2.2939
653,2.2915
654,2.2915
655,2.2775
656,2.2399
657,2.1795
658,2.0705
659,1.953
660,1.8119999999999998
661,1.6678
662,1.5123
663,1.3594
664,1.2206
665,1.0835
666,0.96015
667,0.8368700000000001
668,0.71524
669,0.59395
670,0.52345
671,0.45295
672,0.38245
673,0.31194
674,0.24144000000000002
675,0.17094
676,0.10044
677,0.17926
678,-0.17324
679,-0.11105999999999999
680,-0.18156
681,-0.25206999999999996
682,-0.32256999999999997
683,-0.39307
684,-0.45853
685,-0.52117
686,-0.57618
687,-0.62585
688,-0.66779
689,-0.70304
690,-0.73829
691,-0.77354
692,-0.80879
693,-0.84404
694,-0.8741
695,-0.89566
696,-0.91089
697,-0.91307
698,-0.9195
699,-0.9371200000000001
700,-0.95475
701,-0.9723700000000001
702,-0.9882200000000001
703,-0.99535
704,-1.0023
705,-1.0082
706,-1.0147
707,-1.0311
708,-1.0474
709,-1.0474
710,-1.0474
711,-1.0474
712,-1.0474
713,-1.0388
714,-1.0293
715,-1.0088
716,-0.9863200000000001
717,-0.9537
718,-0.91859
719,-0.8966299999999999
720,-0.879
721,-0.85221
722,-0.82147
723,-0.79328
724,-0.76648
725,-0.7451399999999999
726,-0.72751
727,-0.7098899999999999
728,-0.69226
729,-0.66642
730,-0.63205
731,-0.60258
732,-0.5794199999999999
733,-0.56413
734,-0.5613600000000001
735,-0.56723
736,-0.59039
737,-0.6219100000000001
738,-0.67478
739,-0.72406
740,-0.7612
741,-0.79411
742,-0.8072199999999999
743,-0.8179
744,-0.8114899999999999
745,-0.80428
746,-0.78665
747,-0.76903
748,-0.7514
749,-0.73378
750,-0.73038
751,-0.72747
752,-0.72722
753,-0.72722
754,-0.73187
755,-0.73726
756,-0.75198
757,-0.7688699999999999
758,-0.7729600000000001
759,-0.7729600000000001
760,-0.7632899999999999
761,-0.7496
762,-0.73334
763,-0.7157100000000001
764,-0.6954600000000001
765,-0.6734600000000001
766,-0.6441899999999999
767,-0.6089399999999999
768,-0.5736899999999999
769,-0.5384399999999999
770,-0.51445
771,-0.50455
772,-0.50167
773,-0.50968
774,-0.51982
775,-0.5341
776,-0.54427
777,-0.54427
778,-0.55194
779,-0.58457
780,-0.61555
781,-0.63915
782,-0.66196
783,-0.6795899999999999
784,-0.69703
785,-0.71232
786,-0.72722
787,-0.72722
788,-0.72722
789,-0.72722
790,-0.72722
791,-0.72722
792,-0.72722
793,-0.72722
794,-0.72722
795,-0.72829
796,-0.7296
797,-0.74339
798,-0.7610100000000001
799,-0.78881
800,-0.82071
801,-0.8611700000000001
802,-0.9060299999999999
803,-0.9557700000000001
804,-1.0086
805,-1.0614
806,-1.1139
807,-1.1578
808,-1.1931
809,-1.2283
810,-1.2636
811,-1.2954
812,-1.3219999999999998
813,-1.3401
814,-1.3419999999999999
815,-1.3278
816,-1.2749
817,-1.2057
818,-1.0852
819,-0.9595799999999999
820,-0.8117300000000001
821,-0.6613600000000001
822,-0.49516000000000004
823,-0.32142
824,-0.30296999999999996
825,0.20139
826,0.8535200000000001
827,1.5057
828,1.5819
829,1.6465
830,1.6199
831,1.5863
832,1.5358
833,1.4829
834,1.4301
835,1.3772
836,1.3243
837,1.2714
838,1.2079
839,1.1401
840,1.0706
841,1.0001
842,0.93296
843,0.8679899999999999
844,0.80982
845,0.75695
846,0.70407
847,0.6511899999999999
848,0.59832
849,0.5454399999999999
850,0.49628999999999995
851,0.45258999999999994
852,0.41186999999999996
853,0.37661999999999995
854,0.34137
855,0.30612
856,0.26218
857,0.19197
858,0.12925
859,0.097201
860,0.36571
861,0.27759
862,0.18946
863,0.10132999999999999
864,0.12994
865,-0.074919
866,-0.16305
867,-0.088724
868,-0.25031
869,0.17506
870,0.049109
871,0.052536
872,0.052536
873,0.32361999999999996
874,0.24106999999999998
875,-0.23421999999999998
876,-0.12954000000000002
877,-0.27368000000000003
878,-0.43901
879,-0.11374000000000001
880,-0.12743
881,-0.12882000000000002
882,-0.1227
883,-0.10922
884,-0.4211
885,-0.28395
886,-0.10769000000000001
887,0.052820000000000006
888,0.26646
889,0.092722
890,0.19032000000000002
891,0.30701999999999996
892,0.45779
893,0.11168
894,0.12843
895,0.13642
896,0.11879
897,0.10117000000000001
898,0.44728999999999997
899,0.35916
900,0.27103
901,0.1849
902,0.11717000000000001
903,0.052536
904,0.052536
905,0.052536
906,0.052536
907,0.052536
908,0.075763
909,-0.067635
910,-0.15285
911,-0.24098000000000003
912,-0.31631
913,-0.38914
914,-0.40485
915,-0.40485
916,-0.46348999999999996
917,-0.11464
918,-0.12402
919,-0.13029000000000002
920,-0.13262000000000002
921,-0.13262000000000002
922,-0.13145
923,-0.12941
924,-0.11922
925,-0.47841000000000006
926,-0.39028
927,-0.30215
928,-0.23565999999999998
929,-0.19924
930,-0.18655
931,-0.21495999999999998
932,-0.2589
933,-0.33683
934,-0.37134
935,-0.28321999999999997
936,-0.20972
937,-0.19150999999999999
938,-0.17615999999999998
939,-0.17615999999999998
940,-0.17859
941,-0.2019
942,-0.22859000000000002
943,-0.31672
944,-0.40485
