time,value
0,-1.0249
1,-0.99495
2,-0.9563799999999999
3,-0.9102399999999999
4,-0.8587
5,-0.8034600000000001
6,-0.7479600000000001
7,-0.69382
8,-0.6441399999999999
9,-0.60283
10,-0.5684100000000001
11,-0.5373899999999999
12,-0.5029600000000001
13,-0.46343999999999996
14,-0.41968999999999995
15,-0.37983
16,-0.34967
17,-0.32957
18,-0.31579
19,-0.30658
20,-0.3023
21,-0.29983000000000004
22,-0.29918
23,-0.30013
24,-0.3025
25,-0.3033
26,-0.30561
27,-0.31513
28,-0.3308
29,-0.34779
30,-0.36259
31,-0.37968
32,-0.39765
33,-0.41535
34,-0.42923
35,-0.43965
36,-0.44672
37,-0.45176000000000005
38,-0.45728
39,-0.4623
40,-0.46926999999999996
41,-0.47603999999999996
42,-0.4862
43,-0.49368
44,-0.49978999999999996
45,-0.50222
46,-0.5040600000000001
47,-0.50426
48,-0.5019100000000001
49,-0.49531000000000003
50,-0.47778999999999994
51,-0.44746
52,-0.39621
53,-0.32611999999999997
54,-0.23614000000000002
55,-0.14097
56,-0.050327
57,0.031937
58,0.11517999999999999
59,0.20592
60,0.29912
61,0.38547
62,0.45419
63,0.50349
64,0.53265
65,0.5503100000000001
66,0.56953
67,0.6025699999999999
68,0.6492100000000001
69,0.69647
70,0.73022
71,0.7377600000000001
72,0.71386
73,0.65394
74,0.5616
75,0.43692
76,0.27978000000000003
77,0.093218
78,-0.10719000000000001
79,-0.29172
80,-0.43508
81,-0.5223399999999999
82,-0.5643600000000001
83,-0.5763699999999999
84,-0.58009
85,-0.58194
86,-0.5835100000000001
87,-0.58126
88,-0.57608
89,-0.57485
90,-0.57839
91,-0.58721
92,-0.59173
93,-0.5946600000000001
94,-0.59241
95,-0.58985
96,-0.5816899999999999
97,-0.56901
98,-0.55181
99,-0.5344
100,-0.51737
101,-0.49745
102,-0.47338
103,-0.44071000000000005
104,-0.40413000000000004
105,-0.35956
106,-0.31416
107,-0.26479
108,-0.21266
109,-0.15302000000000002
110,-0.089853
111,-0.027079000000000002
112,0.038549
113,0.10983
114,0.19384
115,0.28357
116,0.38051
117,0.47357
118,0.56542
119,0.66277
120,0.78403
121,0.93056
122,1.0778
123,1.1937
124,1.248
125,1.2533
126,1.2295
127,1.2184
128,1.2294
129,1.2648
130,1.31
131,1.3635
132,1.4301
133,1.5117
134,1.6127
135,1.7221
136,1.8438
137,1.9776
138,2.1305
139,2.2984
140,2.4729
141,2.6512
142,2.8253
143,2.9859
144,3.1091
145,3.1867
146,3.2097
147,3.1776
148,3.0765
149,2.8877
150,2.5912
151,2.1746
152,1.6593
153,1.101
154,0.5913
155,0.19274000000000002
156,-0.072462
157,-0.2392
158,-0.34512
159,-0.41849
160,-0.47193999999999997
161,-0.5081600000000001
162,-0.53578
163,-0.55135
164,-0.56479
165,-0.56843
166,-0.57202
167,-0.56692
168,-0.5616300000000001
169,-0.55658
170,-0.5546399999999999
171,-0.55383
172,-0.5507
173,-0.5483399999999999
174,-0.5455800000000001
175,-0.54572
176,-0.54343
177,-0.5414399999999999
178,-0.53296
179,-0.52257
180,-0.50831
181,-0.49517
182,-0.47915
183,-0.45718000000000003
184,-0.42601999999999995
185,-0.38308000000000003
186,-0.33502
187,-0.27863000000000004
188,-0.21999000000000002
189,-0.15026
190,-0.06976900000000001
191,0.033722
192,0.16940999999999998
193,0.34762
194,0.56453
195,0.80302
196,1.0443
197,1.2741
198,1.4903
199,1.6881
200,1.8566
201,1.9753
202,2.0321
203,2.0337
204,1.9939
205,1.9153
206,1.7818
207,1.5837
208,1.3248
209,1.0309
210,0.72624
211,0.42677
212,0.13513
213,-0.1407
214,-0.37193000000000004
215,-0.53461
216,-0.62362
217,-0.66499
218,-0.67451
219,-0.66818
220,-0.6506
221,-0.62712
222,-0.59811
223,-0.563
224,-0.53128
225,-0.50384
226,-0.48700000000000004
227,-0.47638
228,-0.47812
229,-0.48863
230,-0.51163
231,-0.5465899999999999
232,-0.59173
233,-0.64172
234,-0.69415
235,-0.7529899999999999
236,-0.8203799999999999
237,-0.89166
238,-0.9538399999999999
239,-0.99731
240,-1.0202
241,-1.0293
242,-1.0325
243,-1.0342
244,-1.036
245,-1.0372
246,-1.0390000000000001
247,-1.0403
248,-1.0412
249,-1.0397
250,-1.0376
251,-1.0357
252,-1.0346
253,-1.0331
254,-1.0307
255,-1.0290000000000001
256,-1.0279
257,-1.0263
258,-1.0233
259,-1.0197
260,-1.016
261,-1.0126
262,-1.0094
263,-1.0065
264,-1.0048
265,-1.0057
266,-1.0077
267,-1.0073
268,-1.0068
269,-1.0142
