time,value
0,-0.36966
1,-0.36966
2,-0.36966
3,-0.36966
4,-0.36966
5,-0.36966
6,-0.36966
7,-0.36966
8,-0.36966
9,-0.36966
10,-0.36966
11,-0.36966
12,-0.36966
13,-0.36966
14,-0.36966
15,-0.36966
16,-0.36966
17,-0.36966
18,-0.36966
19,-0.40294
20,-0.46579
21,-0.52462
22,-0.57904
23,-0.61034
24,-0.61034
25,-0.61034
26,-0.61034
27,-0.61034
28,-0.61034
29,-0.61034
30,-0.61034
31,-0.61034
32,-0.61034
33,-0.61034
34,-0.61034
35,-0.61034
36,-0.61034
37,-0.61323
38,-0.66228
39,-0.71148
40,-0.78251
41,-0.85354
42,-0.8811700000000001
43,-0.9067200000000001
44,-0.90554
45,-0.90145
46,-0.88021
47,-0.8559399999999999
48,-0.8510200000000001
49,-0.8510200000000001
50,-0.86092
51,-0.87421
52,-0.89599
53,-0.9215399999999999
54,-0.97949
55,-1.0556
56,-1.1252
57,-1.1901
58,-1.2476
59,-1.2987
60,-1.3268
61,-1.3303
62,-1.3368
63,-1.347
64,-1.3630000000000002
65,-1.3886
66,-1.3996
67,-1.3807
68,-1.3624
69,-1.3455
70,-1.3324
71,-1.3324
72,-1.3289
73,-1.3082
74,-1.2877
75,-1.2693
76,-1.2522
77,-1.2522
78,-1.2529
79,-1.3104
80,-1.3679
81,-1.433
82,-1.4984
83,-1.5276
84,-1.5531
85,-1.5334
86,-1.5061
87,-1.4596
88,-1.4085
89,-1.3574
90,-1.3063
91,-1.2665
92,-1.2315
93,-1.2026
94,-1.177
95,-1.1515
96,-1.1259
97,-1.1004
98,-1.0748
99,-1.0493
100,-1.0237
101,-0.9981899999999999
102,-0.97264
103,-0.93704
104,-0.8854299999999999
105,-0.82547
106,-0.7488199999999999
107,-0.6721699999999999
108,-0.5955199999999999
109,-0.5188699999999999
110,-0.44222
111,-0.36557
112,-0.28891999999999995
113,-0.21519000000000002
114,-0.16205
115,-0.10977
116,-0.34031
117,-0.13616
118,-0.051993
119,0.11934000000000002
120,0.24709
121,0.37484
122,0.099945
123,0.12549000000000002
124,0.15104
125,0.17659
126,0.20215
127,0.22769
128,0.25324
129,0.27879
130,0.30434
131,0.32989
132,0.35544000000000003
133,0.38099
134,0.40331999999999996
135,0.4235
136,0.4326
137,0.4326
138,0.44987
139,0.48461000000000004
140,0.5249199999999999
141,0.57219
142,0.6109399999999999
143,0.63649
144,0.66743
145,0.70882
146,0.753
147,0.8041
148,0.8552
149,0.9063
150,0.9574
151,1.0085
152,1.0595
153,1.1098
154,1.1582
155,1.1838
156,1.2097
157,1.248
158,1.2863
159,1.3371
160,1.3882
161,1.4164
162,1.4427
163,1.4684
164,1.4939
165,1.5195
166,1.545
167,1.5528
168,1.5551
169,1.5558
170,1.5558
171,1.5558
172,1.5558
173,1.5558
174,1.5558
175,1.5558
176,1.5558
177,1.5558
178,1.5558
179,1.5558
180,1.5558
181,1.5584
182,1.5651
183,1.5783
184,1.6038
185,1.6239
186,1.6308
187,1.6372
188,1.6424
189,1.6513
190,1.6769
191,1.7024
192,1.7280000000000002
193,1.7532
194,1.7752
195,1.7965
196,1.7965
197,1.7965
198,1.7965
199,1.7965
200,1.7965
201,1.7965
202,1.7965
203,1.7965
204,1.7733
205,1.7452
206,1.6994
207,1.6483
208,1.5972
209,1.5461
210,1.4866
211,1.423
212,1.3514
213,1.2747
214,1.2119
215,1.1597
216,1.1193
217,1.0902
218,1.0744
219,1.0744
220,1.0837
221,1.1067
222,1.1306
223,1.1562
224,1.1817
225,1.2073
226,1.2168
227,1.178
228,1.1352
229,1.0762
230,1.0146
231,0.9379799999999999
232,0.85221
233,0.67592
234,0.49901999999999996
235,0.3074
236,0.11578
237,-0.18725999999999998
238,-0.19132000000000002
239,-0.32743
240,-0.46233
241,-0.58236
242,-0.7004
243,-0.78408
244,-0.8607299999999999
245,-0.88492
246,-0.89412
247,-0.8757
248,-0.8468200000000001
249,-0.80299
250,-0.75189
251,-0.71031
252,-0.6745399999999999
253,-0.64458
254,-0.61903
255,-0.59348
256,-0.56793
257,-0.55518
258,-0.55723
259,-0.56885
260,-0.59414
261,-0.61034
262,-0.61034
263,-0.61411
264,-0.62637
265,-0.64202
266,-0.66757
267,-0.68329
268,-0.6602899999999999
269,-0.63853
270,-0.62371
271,-0.61034
272,-0.61034
273,-0.6093
274,-0.5865600000000001
275,-0.56382
276,-0.54743
277,-0.53108
278,-0.53012
279,-0.53012
280,-0.53012
281,-0.53012
282,-0.5237
283,-0.5160399999999999
284,-0.49435
285,-0.4688
286,-0.44325
287,-0.4177
288,-0.39215
289,-0.3666
290,-0.34105
291,-0.3155
292,-0.28995
293,-0.2644
294,-0.24125
295,-0.2203
296,-0.20920999999999998
297,-0.20920999999999998
298,-0.20226
299,-0.18565
300,-0.16465
301,-0.13604000000000002
302,-0.49896
303,-0.24347
304,-0.047094
305,0.17245
306,0.34163000000000004
307,0.46938
308,0.11885
309,0.1444
310,0.16995
311,0.1955
312,0.22105
313,0.2466
314,0.27215
315,-1.188
316,-1.188
317,-1.188
318,-1.188
319,-1.188
320,-1.188
321,-1.188
322,-1.188
323,-1.188
324,-1.188
325,-1.188
326,-1.188
327,-1.188
328,-1.188
329,-1.188
330,-1.188
331,-1.188
332,-1.188
333,-1.188
334,-1.188
335,-1.188
336,-1.188
337,-1.188
338,-1.188
339,-1.188
340,-1.188
341,-1.188
342,-1.188
343,-1.188
344,-1.188
345,-1.188
346,-1.188
347,-1.188
348,-1.188
349,-1.188
350,-1.188
351,-1.188
352,-1.1913
353,-1.2466
354,-1.3019999999999998
355,-1.3789
356,-1.4557
357,-1.4593
358,-1.4593
359,-1.3689
360,-1.2687
361,-1.1105
362,-0.94205
363,-0.83904
364,-0.75266
365,-0.73322
366,-0.7366699999999999
367,-0.7975800000000001
368,-0.8839600000000001
369,-0.97034
370,-1.0567
371,-1.0964
372,-1.1033
373,-1.0602
374,-0.9737899999999999
375,-0.9651200000000001
376,-1.0394
377,-1.0891
378,-1.1064
379,-1.0844
380,-0.99798
381,-0.9116
382,-0.8252200000000001
383,-0.7388399999999999
384,-0.65246
385,-0.56608
386,-0.4797
387,-0.39332
388,-0.30694
389,-0.22625
390,-0.18824000000000002
391,-0.15836
392,-0.24474
393,-0.33197
394,-0.48313999999999996
395,-0.6343
396,-0.7697
397,-0.90445
398,-0.9167799999999999
399,-0.9167799999999999
400,-0.86575
401,-0.80615
402,-0.72502
403,-0.63864
404,-0.5522600000000001
405,-0.46588
406,-0.3795
407,-0.29312
408,-0.21231999999999998
409,-0.13458
410,-0.10307999999999999
411,-0.10307999999999999
412,-0.10307999999999999
413,-0.10307999999999999
414,-0.10139
415,-0.48678
416,-0.28794000000000003
417,0.14396
418,0.1146
419,0.20098
420,0.28736
421,0.37374
422,0.43633
423,0.43806000000000006
424,0.43938999999999995
425,0.43938999999999995
426,0.43938999999999995
427,0.43938999999999995
428,0.43938999999999995
429,0.43938999999999995
430,0.43938999999999995
431,0.43938999999999995
432,0.43938999999999995
433,0.43938999999999995
434,0.43938999999999995
435,0.43938999999999995
436,0.43938999999999995
437,0.41331
438,0.3848
439,0.30637
440,0.21998
441,0.18961
442,0.17232999999999998
443,0.16816
444,0.16816
445,0.16816
446,0.16816
447,0.16816
448,0.16816
449,0.15725
450,0.13910999999999998
451,0.42038000000000003
452,-0.07274800000000001
453,-0.29754
454,-0.43575
455,-0.10307999999999999
456,-0.10307999999999999
457,-0.10307999999999999
458,-0.10307999999999999
459,-0.42152
460,-0.15374000000000002
461,0.16124000000000002
462,0.11805999999999998
463,0.20444
464,0.29081999999999997
465,0.36834
466,0.40635
467,0.43973
468,0.44232
469,0.45148
470,0.53787
471,0.62425
472,0.71063
473,0.79701
474,0.88339
475,0.96977
476,1.0561
477,1.1425
478,1.2289
479,1.3153
480,1.4017
481,1.4881
482,1.5143
483,1.5221
484,1.5477
485,1.5805
486,1.6487
487,1.7351
488,1.8215
489,1.9079
490,1.9789
491,2.0376
492,2.0668
493,2.0668
494,2.0668
495,2.0668
496,2.0578
497,2.0354
498,1.9908
499,1.9044
500,1.818
501,1.7316
502,1.6453
503,1.5589
504,1.4725
505,1.3861
506,1.2997
507,1.2134
508,1.128
509,1.0537
510,0.9818600000000001
511,0.9818600000000001
512,0.9818600000000001
513,0.9302
514,0.87751
515,0.79997
516,0.7205
517,0.71063
518,0.71063
519,0.6715
520,0.6239899999999999
521,0.5451699999999999
522,0.45706
523,0.30809000000000003
524,0.13533
525,-0.18428
526,-0.21019000000000002
527,-0.38295
528,-0.55571
529,-0.63525
530,-0.6421600000000001
531,-0.64555
532,-0.64555
533,-0.64555
534,-0.64555
535,-0.58254
536,-0.42706000000000005
537,-0.28804
538,-0.1792
539,-0.10307999999999999
540,-0.10307999999999999
541,-0.10307999999999999
542,-0.10307999999999999
543,-0.10307999999999999
544,-0.10307999999999999
545,-0.10307999999999999
546,-0.10307999999999999
547,-0.12157000000000001
548,-0.3237
549,-0.5263800000000001
550,-0.74233
551,-0.9582799999999999
552,-1.0464
553,-1.1327
554,-1.2772
555,-1.4258
556,-1.5668
557,-1.7067
558,-1.7305
559,-1.7305
560,-1.6861
561,-1.6291
562,-1.5427
563,-1.4451
564,-1.2969
565,-1.1241
566,-0.9835200000000001
567,-0.8625799999999999
568,-0.76474
569,-0.6844
570,-0.64555
571,-0.64555
572,-0.6239
573,-0.57726
574,-0.51425
575,-0.42787
576,-0.34149
577,-0.25511
578,-0.18145999999999998
579,-0.13655
580,-0.10307999999999999
581,-0.10307999999999999
582,-0.10307999999999999
583,-0.10307999999999999
584,-0.48526
585,-0.30385999999999996
586,-0.097902
587,0.33399999999999996
588,0.15261
589,0.23899
590,0.32537
591,0.38086
592,0.43613999999999997
593,0.43938999999999995
594,0.43938999999999995
595,0.50312
596,0.57482
597,0.63712
598,0.69758
599,0.71063
600,0.71063
601,0.75932
602,0.82583
603,0.90585
604,0.99223
605,1.0786
606,1.165
607,1.2161
608,1.2411
609,1.2612
610,1.2768
611,1.3257
612,1.412
613,1.4749
614,1.5052
615,1.5243
616,1.5243
617,1.5243
618,1.5243
619,1.5243
620,1.5243
621,1.5254
622,1.5306
623,1.5485
624,1.6349
625,1.7165
626,1.7571
627,1.7956
628,1.7956
629,1.7956
630,1.0368
631,1.0368
632,1.0368
633,1.0368
634,1.0368
635,1.0368
636,1.0368
637,1.0368
638,1.0368
639,1.0368
640,1.0368
641,1.0368
642,1.0368
643,1.0368
644,1.0368
645,1.0368
646,1.0368
647,1.0368
648,1.0368
649,1.0214
650,0.9922
651,0.96488
652,0.9396200000000001
653,0.92509
654,0.92509
655,0.92509
656,0.92509
657,0.92509
658,0.92509
659,0.92509
660,0.92509
661,0.92509
662,0.92509
663,0.92509
664,0.92509
665,0.92509
666,0.92509
667,0.92509
668,0.92509
669,0.92506
670,0.92115
671,0.9172299999999999
672,0.8831
673,0.84751
674,0.7933100000000001
675,0.7370899999999999
676,0.6681699999999999
677,0.597
678,0.52583
679,0.45466000000000006
680,0.39728
681,0.34462
682,0.30378
683,0.2682
684,0.23260999999999998
685,0.19702999999999998
686,0.16626
687,0.13885999999999998
688,0.11660999999999999
689,0.49695
690,0.40799
691,0.31903000000000004
692,0.23006999999999997
693,0.14110999999999999
694,0.05215
695,-0.24135
696,-0.15106
697,-0.31742
698,-0.49526000000000003
699,-0.14126
700,-0.1855
701,-0.23888
702,-0.2996
703,-0.39621
704,-0.49401999999999996
705,-0.60077
706,-0.7075199999999999
707,-0.81428
708,-0.9201600000000001
709,-0.96019
710,-1.0002
711,-1.0076
712,-1.0137
713,-0.98188
714,-0.9463
715,-0.94224
716,-0.9434899999999999
717,-0.9603299999999999
718,-0.9809700000000001
719,-1.0128
720,-1.0484
721,-1.0762
722,-1.1005
723,-1.1207
724,-1.1385
725,-1.1562
726,-1.1740000000000002
727,-1.1863
728,-1.194
729,-1.1982
730,-1.1989
731,-1.2071
732,-1.2249
733,-1.2427
734,-1.2605
735,-1.2783
736,-1.2961
737,-1.3188
738,-1.354
739,-1.3875
740,-1.4151
741,-1.4409
742,-1.4587
743,-1.4745
744,-1.4759
745,-1.4772
746,-1.4772
747,-1.4772
748,-1.4772
749,-1.4772
750,-1.4772
751,-1.4772
752,-1.4772
753,-1.4772
754,-1.4772
755,-1.4772
756,-1.4772
757,-1.4772
758,-1.4772
759,-1.4772
760,-1.4772
761,-1.4772
762,-1.4772
763,-1.4772
764,-1.4772
765,-1.4772
766,-1.4772
767,-1.4772
768,-1.4832
769,-1.4953
770,-1.5088
771,-1.5239
772,-1.5331
773,-1.5331
774,-1.5331
775,-1.5331
776,-1.5326
777,-1.531
778,-1.5256
779,-1.5078
780,-1.4918
781,-1.484
782,-1.4771
783,-1.4766
784,-1.4747
785,-1.4569
786,-1.4389
787,-1.4122
788,-1.3855
789,-1.3502
790,-1.3146
791,-1.2949
792,-1.2766
793,-1.2587
794,-1.2409
795,-1.2231
796,-1.2053
797,-1.1752
798,-1.1412
799,-1.1061
800,-1.0705
801,-1.0349
802,-0.9993200000000001
803,-0.93615
804,-0.8552
805,-0.7698
806,-0.68084
807,-0.59187
808,-0.5029100000000001
809,-0.42028999999999994
810,-0.34539000000000003
811,-0.27382
812,-0.20726999999999998
813,-0.14529
814,-0.45671000000000006
815,-0.22801999999999997
816,-0.091025
817,0.20442000000000002
818,0.10122
819,0.1589
820,0.1589
821,0.16708
822,0.22669
823,0.28879
824,0.37775
825,0.46671
826,0.11055999999999999
827,0.12835
828,0.15679
829,0.18542999999999998
830,0.22184
831,0.25885
832,0.31019
833,0.36357
834,0.43306000000000006
835,0.5060100000000001
836,0.5907600000000001
837,0.67901
838,0.7421800000000001
839,0.79556
840,0.83731
841,0.87325
842,0.89804
843,0.91584
844,0.91443
845,0.8980600000000001
846,0.88876
847,0.8862700000000001
848,0.8930600000000001
849,0.91085
850,0.94811
851,1.0139
852,1.0817
853,1.1528
854,1.224
855,1.2952
856,1.3626
857,1.4188
858,1.4734
859,1.5213
860,1.5674
861,1.6030000000000002
862,1.6347
863,1.6287
864,1.6222
865,1.6044
866,1.5866
867,1.5688
868,1.551
869,1.5093
870,1.4659
871,1.4196
872,1.3730000000000002
873,1.3503
874,1.3325
875,1.3056
876,1.2761
877,1.2438
878,1.2106
879,1.1877
880,1.1699
881,1.1521
882,1.1343
883,1.1172
884,1.1007
885,1.0927
886,1.0927
887,1.0927
888,1.0927
889,1.0925
890,1.0922
891,1.0792
892,1.0436
893,1.0054
894,0.96125
895,0.9147700000000001
896,0.86139
897,0.80801
898,0.75464
899,0.70126
900,0.64788
901,0.59451
902,0.54113
903,0.48848
904,0.45093999999999995
905,0.4134
906,0.38416
907,0.35498
908,0.33652
909,0.31873
910,0.30094
911,0.28314
912,0.26535
913,0.24756
914,0.22976999999999997
915,0.21198000000000003
916,0.20421
917,0.20012
918,0.19881
919,0.19881
920,0.19881
921,0.19881
922,0.19881
923,0.19881
924,0.19714
925,0.19393
926,0.18386
927,0.16607
928,0.14828
929,0.13049000000000002
930,0.1127
931,0.47738
932,0.38842
933,0.29946
934,0.22421999999999997
935,0.18775
936,0.15779
937,0.15245
938,0.13399
939,0.30428
940,-0.28879
941,-0.13289
942,-0.22185
943,-0.31081
944,-0.39976999999999996
