time,value
0,-1.0945
1,-1.3535
2,-1.515
3,-1.5645
4,-1.4969999999999999
5,-1.3225
6,-1.0596
7,-0.73521
8,-0.37855
9,-0.016184999999999998
10,0.32459
11,0.62011
12,0.8538100000000001
13,1.0142
14,1.0951
15,1.0959999999999999
16,1.0252
17,0.8945799999999999
18,0.72197
19,0.52809
20,0.33111999999999997
21,0.14854
22,-0.0065268
23,-0.12673
24,-0.21148000000000003
25,-0.26469000000000004
26,-0.29420999999999997
27,-0.31019
28,-0.32108000000000003
29,-0.3338
30,-0.35136999999999996
31,-0.37408
32,-0.40060999999999997
33,-0.42693000000000003
34,-0.45078999999999997
35,-0.47145
36,-0.48681
37,-0.49203
38,-0.4793
39,-0.4404
40,-0.36272
41,-0.23794
42,-0.062648
43,0.15912
44,0.41189
45,0.6733600000000001
46,0.91415
47,1.1058
48,1.2237
49,1.2549
50,1.1951
51,1.0496
52,0.8315
53,0.55676
54,0.24214000000000002
55,-0.096666
56,-0.44438
57,-0.78465
58,-1.0983
59,-1.3631
60,-1.5541
61,-1.6492
62,-1.6321
63,-1.4917
64,-1.2316
65,-0.86905
66,-0.43318999999999996
67,0.040563
68,0.51168
69,0.94052
70,1.2935
71,1.5458
72,1.6843
73,1.7061
74,1.6167
75,1.4282
76,1.1607
77,0.83336
78,0.46788
79,0.086313
80,-0.29026
81,-0.64112
82,-0.9466
83,-1.1887
84,-1.354
85,-1.4334
86,-1.4238
87,-1.3307
88,-1.1627
89,-0.9368
90,-0.6725399999999999
91,-0.38879
92,-0.10237
93,0.17569
94,0.43646
95,0.6733600000000001
96,0.88028
97,1.0506
98,1.1752
99,1.2446
100,1.2516
101,1.1921
102,1.0692
103,0.8924200000000001
104,0.6731
105,0.42176
106,0.14855
107,-0.14013
108,-0.43899
109,-0.7391
110,-1.0293
111,-1.2901
112,-1.4937
113,-1.6130000000000002
114,-1.6242
115,-1.514
116,-1.2798
117,-0.93704
118,-0.51274
119,-0.042131
120,0.43518
121,0.8825299999999999
122,1.2676
123,1.5639
124,1.7522
125,1.8182
126,1.7573
127,1.5754
128,1.288
129,0.9189299999999999
130,0.5001899999999999
131,0.068307
132,-0.34352
133,-0.70922
134,-1.0136
135,-1.2513
136,-1.4222
137,-1.5279
138,-1.5676
139,-1.5362
140,-1.4265
141,-1.2302
142,-0.94515
143,-0.58121
144,-0.16045
145,0.28629
146,0.72109
147,1.1088
148,1.4198
149,1.6356
150,1.7464
151,1.7509
152,1.6532
153,1.4592
154,1.1791
155,0.82501
156,0.41413999999999995
157,-0.030386
158,-0.47908
159,-0.90143
160,-1.2654
161,-1.5443
162,-1.7192
163,-1.7787
164,-1.7252
165,-1.5674
166,-1.3171
167,-0.9900200000000001
168,-0.60551
169,-0.18721
170,0.24183000000000002
171,0.65613
172,1.0299
173,1.3389
174,1.5626
175,1.6862
176,1.7028
177,1.6108
178,1.4151
179,1.1247
180,0.75461
181,0.32655
182,-0.13263
183,-0.59019
184,-1.0093
185,-1.3496
186,-1.5764
187,-1.6649
188,-1.604
189,-1.4031
190,-1.0877
191,-0.69652
192,-0.2743
193,0.13407
194,0.49201000000000006
195,0.7752100000000001
196,0.9725
197,1.0843
198,1.1181
199,1.0838
200,0.99067
201,0.8443
202,0.64932
203,0.4096
204,0.13193
205,-0.16945
206,-0.47218999999999994
207,-0.7460399999999999
208,-0.95845
209,-1.0776
210,-1.0831
211,-0.9686799999999999
212,-0.74374
213,-0.43742
214,-0.09062
215,0.25214000000000003
216,0.54832
217,0.7629600000000001
218,0.8758299999999999
219,0.8851399999999999
220,0.80283
221,0.6502899999999999
222,0.45353999999999994
223,0.23876999999999998
224,0.028270999999999998
225,-0.16233
226,-0.32321
227,-0.44803999999999994
228,-0.5342899999999999
229,-0.58041
230,-0.58707
231,-0.55401
232,-0.48733999999999994
233,-0.39127
234,-0.26985
235,-0.12937
236,0.025619
237,0.18971
238,0.3542
239,0.5069
240,0.63226
241,0.71073
242,0.72226
243,0.6541600000000001
244,0.50198
245,0.27536
246,-0.0020685
247,-0.29302
248,-0.55705
249,-0.75422
250,-0.8564
251,-0.84949
252,-0.73445
253,-0.5262
254,-0.25085999999999997
255,0.057694
256,0.36351
257,0.63438
258,0.8407399999999999
259,0.96095
260,0.98262
261,0.9018299999999999
262,0.72583
263,0.47218999999999994
264,0.16719
265,-0.15888
266,-0.47321
267,-0.74883
268,-0.96446
269,-1.1061
270,-1.1682
271,-1.1516
272,-1.0613
273,-0.9022399999999999
274,-0.68116
275,-0.40464
276,-0.08114400000000001
277,0.27668000000000004
278,0.64725
279,1.0042
280,1.3177
281,1.556
282,1.6902
283,1.6992
284,1.5736
285,1.3193
286,0.95275
287,0.5018600000000001
288,0.0033349000000000005
289,-0.50403
290,-0.97954
291,-1.3843
292,-1.6859
293,-1.8623
294,-1.901
295,-1.8036
296,-1.5822
297,-1.2613
298,-0.8708799999999999
299,-0.44253000000000003
300,-0.0065998
301,0.4121
302,0.79468
303,1.1268
304,1.3984
305,1.6006
306,1.7243
307,1.7581
308,1.6911
309,1.5194
310,1.2416
311,0.8678299999999999
312,0.42167
313,-0.067939
314,-0.5646100000000001
315,-1.0295
316,-1.4282
317,-1.7307
318,-1.9132
319,-1.9603
320,-1.8674
321,-1.6389
322,-1.2882
323,-0.83962
324,-0.3286
325,0.2043
326,0.71439
327,1.1595
328,1.5039
329,1.7232
330,1.8069
331,1.7582
332,1.5889
333,1.3208
334,0.9768399999999999
335,0.5794100000000001
336,0.15392
337,-0.2755
338,-0.68495
339,-1.0469
340,-1.335
341,-1.5254
342,-1.5989
343,-1.5466
344,-1.3723
345,-1.0903
346,-0.72517
347,-0.30737
348,0.1265
349,0.5411199999999999
350,0.9041399999999999
351,1.1896
352,1.3752
353,1.4456
354,1.3935
355,1.2227
356,0.94816
357,0.59659
358,0.20232
359,-0.19322999999999999
360,-0.55032
361,-0.83615
362,-1.0284
363,-1.1181
364,-1.1104
365,-1.0211
366,-0.8700100000000001
367,-0.67966
368,-0.46558999999999995
369,-0.24028000000000002
370,-0.013016999999999999
371,0.21061999999999997
372,0.42511000000000004
373,0.62149
374,0.7872600000000001
375,0.9101100000000001
376,0.9758700000000001
377,0.9747399999999999
378,0.9003200000000001
379,0.75618
380,0.55102
381,0.29811
382,0.016842
383,-0.27343
384,-0.54899
385,-0.78545
386,-0.9620700000000001
387,-1.0594
388,-1.0642
389,-0.97464
390,-0.79857
391,-0.5542699999999999
392,-0.26981
393,0.022678999999999998
394,0.29381999999999997
395,0.51926
396,0.68523
397,0.7853100000000001
398,0.82394
399,0.8092600000000001
400,0.74978
401,0.65245
402,0.52262
403,0.36596999999999996
404,0.18785
405,-0.004921899999999999
406,-0.20226
407,-0.3927
408,-0.56248
409,-0.6998300000000001
410,-0.79381
411,-0.8340700000000001
412,-0.81355
413,-0.7299899999999999
414,-0.58304
415,-0.37749
416,-0.12503
417,0.15677
418,0.44343
419,0.70476
420,0.90996
421,1.0334
422,1.0576
423,0.9747899999999999
424,0.79066
425,0.52405
426,0.20239000000000001
427,-0.1416
428,-0.47151000000000004
429,-0.75457
430,-0.96404
431,-1.0816
432,-1.0979999999999999
433,-1.0149
434,-0.84275
435,-0.60045
436,-0.31151999999999996
437,-0.0019548
438,0.30280999999999997
439,0.5819300000000001
440,0.8174399999999999
441,0.9971399999999999
442,1.1122
443,1.1561
444,1.1239
445,1.0111
446,0.81603
447,0.54064
448,0.19619
449,-0.19763
450,-0.60943
451,-1.0001
452,-1.3276
453,-1.5524
454,-1.6453
455,-1.591
456,-1.3915
457,-1.0664
458,-0.6489199999999999
459,-0.17800000000000002
460,0.30513
461,0.76126
462,1.1569
463,1.4659
464,1.6671
465,1.7471
466,1.7004
467,1.5297
468,1.2501
469,0.88292
470,0.45893999999999996
471,0.013099000000000001
472,-0.4203
473,-0.8116899999999999
474,-1.139
475,-1.3878
476,-1.5518
477,-1.6276
478,-1.6153
479,-1.5142
480,-1.3247
481,-1.0523
482,-0.70526
483,-0.30157
484,0.13585
485,0.5763699999999999
486,0.98595
487,1.3335
488,1.5916
489,1.74
490,1.7685
491,1.6754
492,1.4667
493,1.1584
494,0.77193
495,0.33542
496,-0.11634000000000001
497,-0.5493
498,-0.92981
499,-1.2297
