time,value
0,-0.43272
1,0.050148000000000005
2,0.61564
3,1.2255
4,1.8349
5,2.3964
6,2.8649
7,3.2024
8,3.3816
9,3.3889
10,3.2258
11,2.9085
12,2.4662
13,1.9379
14,1.3683
15,0.8031699999999999
16,0.28469
17,-0.15239
18,-0.48391000000000006
19,-0.69794
20,-0.79513
21,-0.7876
22,-0.6966
23,-0.5494100000000001
24,-0.37573
25,-0.2041
26,-0.058792
27,0.042577
28,0.09036799999999999
29,0.083192
30,0.027126
31,-0.065901
32,-0.18031
33,-0.29930999999999996
34,-0.40726
35,-0.49158999999999997
36,-0.54424
37,-0.5622
38,-0.54747
39,-0.50625
40,-0.44766999999999996
41,-0.38228
42,-0.3204
43,-0.27081
44,-0.23959
45,-0.22964
46,-0.24056
47,-0.26899999999999996
48,-0.30951999999999996
49,-0.35546
50,-0.40005999999999997
51,-0.43743000000000004
52,-0.46323000000000003
53,-0.47518999999999995
54,-0.4732
55,-0.4591
56,-0.43622
57,-0.40878000000000003
58,-0.38121
59,-0.35749000000000003
60,-0.34065
61,-0.33245
62,-0.33329000000000003
63,-0.34229
64,-0.35756
65,-0.37659000000000004
66,-0.39666999999999997
67,-0.41526
68,-0.43036
69,-0.44066000000000005
70,-0.44568
71,-0.44568
72,-0.44153000000000003
73,-0.43451999999999996
74,-0.4261
75,-0.41768
76,-0.41043
77,-0.40517
78,-0.40231
79,-0.40191
80,-0.40368000000000004
81,-0.40715999999999997
82,-0.41172
83,-0.41678000000000004
84,-0.42177
85,-0.42627
86,-0.42994
87,-0.43261000000000005
88,-0.43416000000000005
89,-0.43456000000000006
90,-0.43383
91,-0.43241999999999997
92,-0.43085
93,-0.42773
94,-0.42333000000000004
95,-0.41802
96,-0.41233000000000003
97,-0.40681
98,-0.402
