{
  "about": {
    "datasetID": "LL1_bituminous_coal_consumption_total_industry_dataset",
    "datasetName": "Bituminous_coal_consumption_total_Industry",
    "description": "Bituminous coal, consumption, total INDUSTRY ",
    "citation": " Makridakis, Spyros; Hibon, Michele (October-December 2000), The M3-Competition: Results, Conclusions and Implications, http://www.forecastingprinciples.com/files/pdf/Makridakia-The%20M3%20Competition.pdf",
    "license": "general public domain - the data for M3 are available to any researcher who wants to use them, but the results and conclusion paper should be cited",
    "source": "International Institute of Forecasters",
    "sourceURI": "http://forecasters.org/resources/time-series-data/m3-competition/",
    "approximateSize": "",
    "datasetSchemaVersion": "4.0.0",
    "redacted": false,
    "datasetVersion": "4.0.0",
    "digest": "64655b6d60dc8a220c1508702f1baf6ecfd320412d79f6def279f5bdf99354fa"
  },
  "dataResources": [
    {
      "resID": "learningData",
      "resPath": "tables/learningData.csv",
      "resType": "table",
      "resFormat": {
        "text/csv": [
          "csv"
        ]
      },
      "isCollection": false,
      "columns": [
        {
          "colIndex": 0,
          "colName": "d3mIndex",
          "colType": "integer",
          "role": [
            "index"
          ]
        },
        {
          "colIndex": 1,
          "colName": "time",
          "colType": "real",
          "role": [
            "attribute",
            "timeIndicator"
          ]
        },
        {
          "colIndex": 2,
          "colName": "value",
          "colType": "real",
          "role": [
            "suggestedTarget"
          ]
        }
      ],
      "columnsCount": 3
    }
  ]
}