time,value
0,-0.54619
1,-0.54619
2,-0.54619
3,-0.54619
4,-0.54619
5,-0.54619
6,-0.54619
7,-0.54619
8,-0.54619
9,-0.54619
10,-0.54619
11,-0.54619
12,-0.54619
13,-0.54619
14,-0.54619
15,-0.54619
16,-0.54619
17,-0.54619
18,-0.54619
19,-0.54619
20,-0.54619
21,-0.54619
22,-0.54619
23,-0.54619
24,-0.54619
25,-0.54619
26,-0.54619
27,-0.54619
28,-0.54619
29,-0.54619
30,-0.54619
31,-0.54619
32,-0.54619
33,-0.54619
34,-0.54619
35,-0.54619
36,-0.54619
37,-0.54619
38,-0.54619
39,-0.54619
40,-0.54619
41,-0.54619
42,-0.54619
43,-0.54619
44,-0.54619
45,-0.54619
46,-0.54619
47,-0.54619
48,-0.54619
49,-0.54619
50,-0.54619
51,-0.54619
52,-0.54619
53,-0.54619
54,-0.54619
55,-0.54619
56,-0.54619
57,-0.54619
58,-0.54619
59,-0.54619
60,-0.54619
61,1.4851
62,1.8914
63,1.8914
64,2.2976
65,1.8914
66,1.8914
67,1.8914
68,1.8914
69,2.2976
70,1.8914
71,1.8914
72,1.8914
73,1.8914
74,1.8914
75,1.8914
76,1.4851
77,1.8914
78,1.8914
79,1.8914
80,1.8914
81,1.4851
82,1.8914
83,1.8914
84,1.8914
85,1.4851
86,1.8914
87,1.8914
88,1.4851
89,1.8914
90,1.4851
91,1.8914
92,1.4851
93,1.8914
94,1.4851
95,1.8914
96,1.4851
97,1.4851
98,1.8914
99,0.5371600000000001
100,-0.41076999999999997
101,-0.54619
102,-0.54619
103,-0.54619
104,-0.54619
105,-0.54619
106,-0.54619
107,-0.54619
108,-0.54619
109,-0.54619
110,-0.54619
111,-0.54619
112,-0.54619
113,-0.54619
114,-0.54619
115,-0.54619
116,-0.54619
117,-0.54619
118,-0.54619
119,-0.54619
120,-0.54619
121,-0.54619
122,-0.54619
123,-0.54619
124,-0.54619
125,-0.54619
126,-0.54619
127,-0.54619
128,-0.54619
129,-0.54619
130,-0.54619
131,-0.54619
132,-0.54619
133,-0.54619
134,-0.54619
135,-0.54619
136,-0.54619
137,-0.54619
138,-0.54619
139,-0.54619
140,-0.54619
141,-0.54619
142,-0.54619
143,-0.54619
144,-0.54619
145,-0.54619
146,-0.54619
147,-0.54619
148,-0.54619
149,-0.54619
150,-0.54619
151,-0.54619
152,-0.54619
153,-0.54619
154,-0.54619
155,-0.54619
156,-0.54619
157,-0.54619
158,-0.54619
159,-0.54619
160,-0.54619
161,-0.54619
162,-0.54619
163,-0.54619
164,-0.54619
165,-0.54619
166,-0.54619
167,-0.54619
168,-0.54619
169,-0.54619
170,-0.54619
171,-0.54619
172,-0.54619
173,-0.54619
174,-0.54619
175,-0.54619
176,-0.54619
177,-0.54619
178,-0.54619
179,-0.54619
180,-0.54619
181,-0.54619
182,-0.54619
183,-0.54619
184,-0.54619
185,-0.54619
186,-0.54619
187,-0.54619
188,-0.54619
189,-0.54619
190,-0.54619
191,-0.54619
192,-0.54619
193,-0.54619
194,-0.54619
195,-0.54619
196,-0.54619
197,-0.54619
198,-0.54619
199,-0.54619
200,-0.54619
201,-0.54619
202,-0.54619
203,-0.54619
204,-0.54619
205,-0.54619
206,-0.54619
207,-0.54619
208,-0.54619
209,-0.54619
210,-0.54619
211,-0.54619
212,-0.54619
213,-0.54619
214,-0.54619
215,-0.54619
216,-0.54619
217,-0.54619
218,-0.54619
219,-0.54619
220,-0.54619
221,-0.54619
222,-0.54619
223,-0.54619
224,-0.54619
225,-0.54619
226,-0.54619
227,-0.54619
228,-0.54619
229,-0.54619
230,-0.54619
231,-0.54619
232,-0.54619
233,-0.54619
234,-0.54619
235,-0.54619
236,-0.54619
237,-0.54619
238,-0.54619
239,-0.54619
240,-0.54619
241,-0.54619
242,-0.54619
243,-0.54619
244,-0.54619
245,-0.54619
246,-0.54619
247,-0.54619
248,-0.54619
249,-0.54619
250,1.8914
251,1.8914
252,2.2976
253,1.8914
254,1.8914
255,1.8914
256,1.8914
257,1.8914
258,1.8914
259,1.8914
260,1.8914
261,1.8914
262,1.8914
263,1.8914
264,1.8914
265,1.8914
266,1.8914
267,1.4851
268,1.8914
269,1.8914
270,1.4851
271,1.8914
272,1.8914
273,1.4851
274,1.8914
275,1.4851
276,1.8914
277,1.4851
278,1.8914
279,1.4851
280,1.8914
281,1.4851
282,1.8914
283,1.4851
284,1.4851
285,1.8914
286,1.4851
287,1.4851
288,1.4851
289,0.26633
290,-0.41076999999999997
291,-0.54619
292,-0.54619
293,-0.54619
294,-0.54619
295,-0.54619
296,-0.54619
297,-0.54619
298,-0.54619
299,-0.54619
300,-0.54619
301,-0.54619
302,-0.54619
303,-0.54619
304,-0.54619
305,-0.54619
306,-0.54619
307,-0.54619
308,-0.54619
309,-0.54619
310,-0.54619
311,-0.54619
312,-0.54619
313,-0.54619
314,-0.54619
315,-0.54619
316,-0.54619
317,-0.54619
318,-0.54619
319,-0.54619
320,-0.54619
321,-0.54619
322,-0.54619
323,-0.54619
324,-0.54619
325,-0.54619
326,-0.54619
327,-0.54619
328,-0.54619
329,-0.54619
330,-0.54619
331,-0.54619
332,-0.54619
333,-0.54619
334,-0.54619
335,-0.54619
336,-0.54619
337,-0.54619
338,-0.54619
339,-0.54619
340,-0.54619
341,-0.54619
342,-0.54619
343,-0.54619
344,-0.54619
345,-0.54619
346,-0.54619
347,-0.54619
348,-0.54619
349,-0.54619
350,-0.54619
351,-0.54619
352,-0.54619
353,-0.54619
354,-0.54619
355,-0.54619
356,-0.54619
357,-0.54619
358,-0.54619
359,-0.54619
360,-0.54619
361,-0.54619
362,-0.54619
363,-0.54619
364,-0.54619
365,-0.54619
366,-0.54619
367,-0.54619
368,-0.54619
369,-0.54619
370,-0.54619
371,-0.54619
372,-0.54619
373,-0.54619
374,-0.54619
375,-0.54619
376,-0.54619
377,-0.54619
378,-0.54619
379,-0.54619
380,-0.54619
381,-0.54619
382,-0.54619
383,-0.54619
384,-0.54619
385,-0.54619
386,-0.54619
387,-0.54619
388,-0.54619
389,-0.54619
390,-0.54619
391,-0.54619
392,-0.54619
393,-0.54619
394,-0.54619
395,-0.54619
396,-0.54619
397,-0.54619
398,-0.54619
399,-0.54619
400,-0.54619
401,-0.54619
402,-0.54619
403,-0.54619
404,-0.54619
405,-0.54619
406,-0.54619
407,-0.54619
408,-0.54619
409,-0.54619
410,-0.54619
411,-0.54619
412,-0.54619
413,-0.54619
414,-0.54619
415,-0.54619
416,-0.54619
417,-0.54619
418,-0.54619
419,-0.54619
420,-0.54619
421,-0.54619
422,-0.54619
423,1.0788
424,1.8914
425,1.8914
426,2.2976
427,1.8914
428,1.8914
429,1.8914
430,1.8914
431,1.8914
432,1.8914
433,1.8914
434,1.8914
435,1.8914
436,1.8914
437,1.8914
438,1.8914
439,1.8914
440,1.8914
441,1.4851
442,1.8914
443,1.8914
444,1.8914
445,1.4851
446,1.8914
447,1.8914
448,1.4851
449,1.8914
450,1.8914
451,1.4851
452,1.8914
453,1.4851
454,1.8914
455,1.4851
456,1.8914
457,1.4851
458,1.4851
459,1.8914
460,-0.13993
461,-0.54619
462,-0.54619
463,-0.54619
464,-0.54619
465,-0.54619
466,-0.54619
467,-0.54619
468,-0.54619
469,-0.54619
470,-0.54619
471,-0.54619
472,-0.54619
473,-0.54619
474,-0.54619
475,-0.54619
476,-0.54619
477,-0.54619
478,-0.54619
479,-0.54619
480,-0.54619
481,-0.54619
482,-0.54619
483,-0.54619
484,-0.54619
485,-0.54619
486,-0.54619
487,-0.54619
488,-0.54619
489,-0.54619
490,-0.54619
491,-0.54619
492,-0.54619
493,-0.54619
494,-0.54619
495,-0.54619
496,-0.54619
497,-0.54619
498,-0.54619
499,-0.54619
500,-0.54619
501,-0.54619
502,-0.54619
503,-0.54619
504,-0.54619
505,-0.54619
506,-0.54619
507,-0.54619
508,-0.54619
509,-0.54619
510,-0.54619
511,-0.54619
512,-0.54619
513,-0.54619
514,-0.54619
515,-0.54619
516,-0.54619
517,-0.54619
518,-0.54619
519,-0.54619
520,-0.54619
521,-0.54619
522,-0.54619
523,-0.54619
524,-0.54619
525,-0.54619
526,-0.54619
527,-0.54619
528,-0.54619
529,-0.54619
530,-0.54619
531,-0.54619
532,-0.54619
533,-0.54619
534,-0.54619
535,-0.54619
536,-0.54619
537,-0.54619
538,-0.54619
539,-0.54619
540,-0.54619
541,-0.54619
542,-0.54619
543,-0.54619
544,-0.54619
545,-0.54619
546,-0.54619
547,-0.54619
548,-0.54619
549,-0.54619
550,-0.54619
551,-0.54619
552,-0.54619
553,-0.54619
554,-0.54619
555,-0.54619
556,2.2976
557,1.8914
558,1.8914
559,2.2976
560,1.8914
561,1.8914
562,1.8914
563,1.8914
564,1.8914
565,1.8914
566,1.8914
567,1.8914
568,1.8914
569,1.8914
570,1.8914
571,1.8914
572,1.8914
573,1.4851
574,1.8914
575,1.8914
576,1.8914
577,1.4851
578,1.8914
579,1.4851
580,1.8914
581,1.4851
582,1.8914
583,1.4851
584,1.8914
585,1.4851
586,1.4851
587,-0.27535
588,-0.54619
589,-0.54619
590,-0.54619
591,-0.54619
592,-0.54619
593,-0.54619
594,-0.54619
595,-0.54619
596,-0.54619
597,-0.54619
598,-0.54619
599,-0.54619
600,-0.54619
601,-0.54619
602,-0.54619
603,-0.54619
604,-0.54619
605,-0.54619
606,-0.54619
607,-0.54619
608,-0.54619
609,-0.54619
610,-0.54619
611,-0.54619
612,-0.54619
613,-0.54619
614,-0.54619
615,-0.54619
616,-0.54619
617,-0.54619
618,-0.54619
619,-0.54619
620,-0.54619
621,-0.54619
622,-0.54619
623,-0.54619
624,-0.54619
625,-0.54619
626,-0.54619
627,-0.54619
628,-0.54619
629,-0.54619
630,-0.54619
631,-0.54619
632,-0.54619
633,-0.54619
634,-0.54619
635,-0.54619
636,-0.54619
637,-0.54619
638,-0.54619
639,-0.54619
640,-0.54619
641,-0.54619
642,-0.54619
643,-0.54619
644,-0.54619
645,-0.54619
646,-0.54619
647,-0.54619
648,-0.54619
649,-0.54619
650,-0.54619
651,-0.54619
652,-0.54619
653,-0.54619
654,-0.54619
655,-0.54619
656,-0.54619
657,-0.54619
658,-0.54619
659,-0.54619
660,-0.54619
661,-0.54619
662,-0.54619
663,-0.54619
664,-0.54619
665,-0.54619
666,-0.54619
667,-0.54619
668,-0.54619
669,-0.54619
670,-0.54619
671,-0.54619
672,-0.54619
673,-0.54619
674,-0.54619
675,-0.54619
676,-0.54619
677,-0.54619
678,-0.54619
679,-0.54619
680,-0.54619
681,-0.54619
682,-0.54619
683,-0.54619
684,-0.54619
685,-0.54619
686,-0.54619
687,-0.54619
688,-0.54619
689,-0.54619
690,-0.54619
691,-0.54619
692,-0.54619
693,-0.54619
694,-0.54619
695,-0.54619
696,-0.54619
697,-0.54619
698,-0.54619
699,-0.54619
700,2.7039
701,1.8914
702,1.8914
703,2.2976
704,1.8914
705,1.8914
706,2.2976
707,1.8914
708,1.8914
709,1.8914
710,1.8914
711,1.8914
712,1.8914
713,1.8914
714,1.8914
715,1.8914
716,1.8914
717,1.8914
718,1.8914
719,1.8914
