time,value
0,-0.40302
1,-0.40302
2,-0.40302
3,-0.40302
4,-0.40302
5,-0.40302
6,-0.40302
7,-0.40302
8,-0.40302
9,-0.40302
10,-0.40302
11,-0.40302
12,-0.40302
13,-0.40302
14,-0.40302
15,-0.40302
16,-0.40302
17,-0.40302
18,-0.40302
19,-0.40302
20,-0.40302
21,-0.40302
22,-0.40302
23,-0.40302
24,-0.40302
25,-0.40302
26,-0.40302
27,-0.40302
28,-0.40302
29,-0.40302
30,-0.40302
31,-0.40302
32,-0.40302
33,-0.40302
34,-0.40302
35,-0.40302
36,-0.40302
37,-0.40302
38,-0.40302
39,-0.40302
40,-0.40302
41,-0.55891
42,-0.77198
43,-0.99854
44,-1.2251
45,-1.4517
46,-1.6782
47,-1.9048
48,-2.1313
49,-2.3579
50,-2.5335
51,-2.6858
52,-2.8369
53,-2.9879
54,-3.0456
55,-3.0246
56,-2.9491
57,-2.8736
58,-2.7902
59,-2.6189999999999998
60,-2.3924
61,-2.1658
62,-1.9393
63,-1.7127
64,-1.4862
65,-1.2596
66,-1.0331
67,-0.81542
68,-0.63389
69,-0.48285
70,-0.33182
71,-0.18078
72,-0.31914000000000003
73,0.13692000000000001
74,0.10403
75,0.17955
76,0.21655
77,0.16229000000000002
78,0.32939
79,-0.13978
80,-0.29081999999999997
81,-0.47412
82,-0.68783
83,-0.9143899999999999
84,-1.1409
85,-1.3361
86,-1.4775
87,-1.5531
88,-1.6286
89,-1.7041
90,-1.7796
91,-1.8551
92,-1.9307
93,-2.0062
94,-2.0642
95,-2.0968
96,-2.0968
97,-2.0968
98,-2.0968
99,-2.0691
100,-1.9975
101,-1.922
102,-1.8465
103,-1.7528
104,-1.6329
105,-1.4819
106,-1.3308
107,-1.1811
108,-1.0546
109,-0.9791200000000001
110,-0.9036
111,-0.8280799999999999
112,-0.75256
113,-0.67705
114,-0.60153
115,-0.5260100000000001
116,-0.446
117,-0.34692
118,-0.19588
119,-0.22989
120,0.10619
121,0.24081999999999998
122,0.34138
123,0.4169
124,0.49241
125,0.56793
126,0.64345
127,0.71897
128,0.7944899999999999
129,0.8700100000000001
130,0.9316200000000001
131,0.95104
132,0.9520000000000001
133,0.9520000000000001
134,0.9520000000000001
135,0.9520000000000001
136,0.9520000000000001
137,0.9520000000000001
138,0.9520000000000001
139,0.9520000000000001
140,0.9520000000000001
141,0.9520000000000001
142,0.9520000000000001
143,0.94435
144,0.9163
145,0.84196
146,0.76644
147,0.69092
148,0.6268199999999999
149,0.68939
150,0.76212
151,0.8376399999999999
152,0.9066
153,0.9476
154,0.9520000000000001
155,0.9520000000000001
156,0.9520000000000001
157,0.9520000000000001
158,0.9520000000000001
159,0.9520000000000001
160,0.9520000000000001
161,0.9520000000000001
162,0.9520000000000001
163,0.9520000000000001
164,0.9520000000000001
165,0.9520000000000001
166,0.9520000000000001
167,0.9520000000000001
168,0.9520000000000001
169,0.9520000000000001
170,0.9520000000000001
171,0.9520000000000001
172,0.9520000000000001
173,0.9520000000000001
174,0.9520000000000001
175,0.9520000000000001
176,0.9520000000000001
177,0.9520000000000001
178,0.9520000000000001
179,0.9520000000000001
180,0.9520000000000001
181,0.9520000000000001
182,0.9520000000000001
183,0.9520000000000001
184,0.9520000000000001
185,0.9520000000000001
186,0.9520000000000001
187,0.9520000000000001
188,0.9520000000000001
189,0.9520000000000001
190,0.9520000000000001
191,0.9520000000000001
192,0.9520000000000001
193,0.9520000000000001
194,0.9520000000000001
195,0.9520000000000001
196,0.9520000000000001
197,0.9520000000000001
198,1.004
199,1.075
200,1.1505
201,1.226
202,1.2443
203,1.2044
204,1.1289
205,1.0534
206,0.9778899999999999
207,0.9533
208,0.9520000000000001
209,0.9520000000000001
210,0.9520000000000001
211,0.9208700000000001
212,0.86354
213,0.7880199999999999
214,0.7125
215,0.63698
216,0.5614600000000001
217,0.48594
218,0.41042
219,0.3349
220,0.29197
221,0.27449
222,0.27449
223,0.27449
224,0.26557
225,0.22055
226,0.14503
227,0.3419
228,-0.24599000000000001
229,-0.083754
230,0.13692000000000001
231,0.10403
232,0.17955
233,0.24223000000000003
234,0.27449
235,0.27449
236,0.27449
237,0.27449
238,0.27449
239,0.27449
240,0.27449
241,0.27449
242,0.27449
243,0.27449
244,0.27449
245,0.27449
246,0.27449
247,0.27449
248,0.27449
249,0.27449
250,0.27449
251,0.29197
252,0.3349
253,0.41042
254,0.48594
255,0.5614600000000001
256,0.60932
257,0.61325
258,0.61325
259,0.61325
260,0.61325
261,0.61325
262,0.61325
263,0.61325
264,0.6119399999999999
265,0.58735
266,0.51183
267,0.43632
268,0.3608
269,0.30311
270,0.27449
271,0.27449
272,0.27449
273,0.27449
274,0.27449
275,0.27449
276,0.27449
277,0.27449
278,0.27449
279,0.27449
280,0.27449
281,0.27449
282,0.27449
283,0.27449
284,0.27449
285,0.27449
286,0.27449
287,0.27449
288,0.27449
289,0.27449
290,0.27449
291,0.28215999999999997
292,0.30685999999999997
293,0.38237
294,0.45788999999999996
295,0.53341
296,0.59859
297,0.61153
298,0.61325
299,0.61325
300,0.61325
301,0.61325
302,0.61325
303,0.61325
304,0.61325
305,0.61325
306,0.61325
307,0.61325
308,0.61325
309,0.61325
310,0.61325
311,0.61325
312,0.61325
313,0.61325
314,0.61325
315,0.59268
316,0.59268
317,0.59268
318,0.59268
319,0.59268
320,0.59268
321,0.59268
322,0.59268
323,0.59268
324,0.59268
325,0.59268
326,0.59268
327,0.59268
328,0.59268
329,0.59268
330,0.59268
331,0.59268
332,0.59268
333,0.59268
334,0.59268
335,0.59268
336,0.59268
337,0.59268
338,0.59268
339,0.59268
340,0.59268
341,0.59268
342,0.59268
343,0.59268
344,0.59268
345,0.59268
346,0.59268
347,0.59268
348,0.59268
349,0.59268
350,0.59268
351,0.59268
352,0.59268
353,0.59268
354,0.59268
355,0.59268
356,0.55172
357,0.49573999999999996
358,0.43621000000000004
359,0.37669
360,0.32468
361,0.28031999999999996
362,0.24063
363,0.20095
364,0.16127
365,0.14835
366,0.14765999999999999
367,0.14765999999999999
368,0.14765999999999999
369,0.1722
370,0.21739
371,0.27691
372,0.33644
373,0.39493
374,0.44188
375,0.48157
376,0.52125
377,0.56093
378,0.6006100000000001
379,0.6403
380,0.67998
381,0.7196600000000001
382,0.757
383,0.78486
384,0.8047
385,0.8245399999999999
386,0.8443799999999999
387,0.8642200000000001
388,0.8840600000000001
389,0.90391
390,0.92375
391,0.94021
392,0.9486899999999999
393,0.9486899999999999
394,0.9486899999999999
395,0.9486899999999999
396,0.9486899999999999
397,0.9486899999999999
398,0.9486899999999999
399,0.9486899999999999
400,0.9486899999999999
401,0.9486899999999999
402,0.9486899999999999
403,0.9486899999999999
404,0.9486899999999999
405,0.94068
406,0.9231799999999999
407,0.9033399999999999
408,0.8835
409,0.87284
410,0.87556
411,0.8954
412,0.9152399999999999
413,0.9350799999999999
414,0.9476600000000001
415,0.9486899999999999
416,0.9486899999999999
417,0.9486899999999999
418,0.95347
419,0.9651299999999999
420,0.9849700000000001
421,1.0048
422,1.0247
423,1.0445
424,1.0643
425,1.0842
426,1.104
427,1.1239
428,1.1437
429,1.1635
430,1.1834
431,1.2032
432,1.2231
433,1.2429
434,1.2628
435,1.2826
436,1.2938
437,1.2871
438,1.2673
439,1.2474
440,1.2293
441,1.2157
442,1.2157
443,1.2157
444,1.2157
445,1.212
446,1.1973
447,1.1777
448,1.1579
449,1.14
450,1.1267
451,1.1267
452,1.1267
453,1.1267
454,1.124
455,1.1075
456,1.0881
457,1.0683
458,1.0465
459,1.0192
460,0.97987
461,0.94019
462,0.9005
463,0.8623200000000001
464,0.84078
465,0.82057
466,0.80073
467,0.78089
468,0.76105
469,0.7412
470,0.72136
471,0.70152
472,0.6816800000000001
473,0.6816800000000001
474,0.6816800000000001
475,0.6816800000000001
476,0.68052
477,0.66975
478,0.65163
479,0.63179
480,0.61232
481,0.59418
482,0.59268
483,0.59268
484,0.59268
485,0.59206
486,0.56712
487,0.53145
488,0.49177
489,0.45253999999999994
490,0.41626
491,0.3937
492,0.37385
493,0.35401
494,0.33416999999999997
495,0.31433
496,0.29449000000000003
497,0.27465
498,0.25481
499,0.23496
500,0.21511999999999998
501,0.19528
502,0.17544
503,0.1556
504,0.12211
505,0.41518999999999995
506,0.21678000000000003
507,0.1144
508,-0.14715999999999999
509,-0.26792
510,-0.36713
511,-0.46634
512,-0.11198
513,-0.14547000000000002
514,-0.18397
515,-0.22366
516,-0.26334
517,-0.2955
518,-0.32003000000000004
519,-0.33987
520,-0.35971
521,-0.37955
522,-0.3994
523,-0.41923999999999995
524,-0.43908
525,-0.45892
526,-0.47876
527,-0.4986
528,-0.51844
529,-0.5382899999999999
530,-0.55813
531,-0.57797
532,-0.5978100000000001
533,-0.61765
534,-0.63749
535,-0.66589
536,-0.70099
537,-0.7406699999999999
538,-0.78035
539,-0.81535
540,-0.83137
541,-0.83137
542,-0.83137
543,-0.83137
544,-0.8400299999999999
545,-0.85575
546,-0.87559
547,-0.89543
548,-0.91527
549,-0.9351200000000001
550,-0.95496
551,-0.9748
552,-0.99464
553,-1.0145
554,-1.0343
555,-1.0542
556,-1.074
557,-1.0897
558,-1.0984
559,-1.0984
560,-1.0984
561,-1.0984
562,-1.1064
563,-1.1239
564,-1.1437
565,-1.1636
566,-1.1834
567,-1.2033
568,-1.2231
569,-1.2429
570,-1.2628
571,-1.2754
572,-1.2764
573,-1.2764
574,-1.2764
575,-1.2764
576,-1.2764
577,-1.2764
578,-1.2764
579,-1.2767
580,-1.2832
581,-1.3030000000000002
582,-1.3229
583,-1.3427
584,-1.3672
585,-1.3994
586,-1.4391
587,-1.4788
588,-1.5173
589,-1.5508
590,-1.5706
591,-1.5905
592,-1.6103
593,-1.6301
594,-1.65
595,-1.6698
596,-1.6897
597,-1.7078
598,-1.7214
599,-1.7214
600,-1.7214
601,-1.7214
602,-1.7214
603,-1.7214
604,-1.7214
605,-1.7214
606,-1.7214
607,-1.7214
608,-1.7214
609,-1.7214
610,-1.7214
611,-1.7214
612,-1.7214
613,-1.7214
614,-1.7214
615,-1.7214
616,-1.7214
617,-1.7214
618,-1.7214
619,-1.7214
620,-1.7229
621,-1.7409999999999999
622,-1.7605
623,-1.7804
624,-1.7985
625,-1.8093
626,-1.8104
627,-1.8104
628,-1.8104
629,-1.8104
630,1.1802
631,1.1802
632,1.1802
633,1.1802
634,1.1802
635,1.1802
636,1.1802
637,1.1802
638,1.1802
639,1.1802
640,1.1802
641,1.1802
642,1.1802
643,1.1802
644,1.1802
645,1.1802
646,1.1802
647,1.1802
648,1.1802
649,1.1802
650,1.1802
651,1.1802
652,1.1802
653,1.1802
654,1.1802
655,1.1802
656,1.1802
657,1.1802
658,1.1802
659,1.1802
660,1.1802
661,1.1802
662,1.1802
663,1.1802
664,1.1802
665,1.1802
666,1.1802
667,1.1802
668,1.1802
669,1.1802
670,1.1802
671,1.235
672,1.3098
673,1.3894
674,1.469
675,1.5297
676,1.5713
677,1.6012
678,1.631
679,1.6608
680,1.6706
681,1.6711
682,1.6711
683,1.6711
684,1.6629
685,1.6478
686,1.6279
687,1.608
688,1.5881
689,1.5682
690,1.5483
691,1.5284
692,1.5085
693,1.4886
694,1.4687
695,1.4488
696,1.4289
697,1.409
698,1.3891
699,1.3692
700,1.3493
701,1.3294
702,1.3139
703,1.3019
704,1.2919
705,1.2819999999999998
706,1.272
707,1.2621
708,1.2521
709,1.2422
710,1.2322
711,1.218
712,1.1998
713,1.18
714,1.1601
715,1.1422
716,1.1279
717,1.1179999999999999
718,1.1079999999999999
719,1.0981
720,1.0881
721,1.0782
722,1.0683
723,1.0583
724,1.0461
725,1.0305
726,1.0106
727,0.99066
728,0.97077
729,0.9508700000000001
730,0.9309799999999999
731,0.9110799999999999
732,0.8911899999999999
733,0.87129
734,0.8514
735,0.8315
736,0.81161
737,0.7915399999999999
738,0.76841
739,0.73856
740,0.70872
741,0.67888
742,0.64904
743,0.61919
744,0.58935
745,0.5595100000000001
746,0.52966
747,0.49982
748,0.46998
749,0.44014
750,0.41029
751,0.38045
752,0.35061
753,0.32077
754,0.29091999999999996
755,0.26108000000000003
756,0.23124
757,0.2014
758,0.17155
759,0.14171
760,0.1137
761,0.45058000000000004
762,0.35047
763,0.25099
764,0.15657000000000001
765,0.073358
766,0.14945999999999998
767,-0.18212
768,-0.07585499999999999
769,-0.12559
770,-0.17532999999999999
771,-0.22507
772,-0.27481
773,-0.32454
774,-0.37428
775,-0.42402
776,-0.47376
777,-0.10357000000000001
778,-0.11427000000000001
779,-0.13330999999999998
780,-0.15302000000000002
781,-0.17292000000000002
782,-0.19195
783,-0.2073
784,-0.21781999999999999
785,-0.22776999999999997
786,-0.23772
787,-0.24766999999999997
788,-0.26755999999999996
789,-0.28746
790,-0.30735
791,-0.32666999999999996
792,-0.34115999999999996
793,-0.35197
794,-0.36191999999999996
795,-0.37205
796,-0.38285
797,-0.40199
798,-0.42189
799,-0.44178
800,-0.46168000000000003
801,-0.48158
802,-0.50147
803,-0.52137
804,-0.5414899999999999
805,-0.56309
806,-0.5915699999999999
807,-0.62141
808,-0.65125
809,-0.68109
810,-0.69755
811,-0.7095199999999999
812,-0.71946
813,-0.72954
814,-0.7420399999999999
815,-0.7601100000000001
816,-0.78
817,-0.7999
818,-0.81979
819,-0.83285
820,-0.84367
821,-0.8536100000000001
822,-0.86356
823,-0.87021
824,-0.8723700000000001
825,-0.8723700000000001
826,-0.8723700000000001
827,-0.8723700000000001
828,-0.8792200000000001
829,-0.8885700000000001
830,-0.8985200000000001
831,-0.9084700000000001
832,-0.9108700000000001
833,-0.9056200000000001
834,-0.8956799999999999
835,-0.8857299999999999
836,-0.8757799999999999
837,-0.87254
838,-0.8723700000000001
839,-0.8723700000000001
840,-0.8723700000000001
841,-0.8682700000000001
842,-0.86072
843,-0.85077
844,-0.8408200000000001
845,-0.83139
846,-0.82775
847,-0.82775
848,-0.82775
849,-0.82775
850,-0.83204
851,-0.8396899999999999
852,-0.8496299999999999
853,-0.8595799999999999
854,-0.86835
855,-0.8723700000000001
856,-0.8723700000000001
857,-0.8723700000000001
858,-0.8723700000000001
859,-0.8723700000000001
860,-0.8723700000000001
861,-0.8723700000000001
862,-0.8723700000000001
863,-0.8740600000000001
864,-0.87976
865,-0.88971
866,-0.89966
867,-0.9096
868,-0.9153
869,-0.91699
870,-0.91699
871,-0.91699
872,-0.91906
873,-0.9246700000000001
874,-0.93461
875,-0.9445600000000001
876,-0.9545100000000001
877,-0.96044
878,-0.96162
879,-0.96162
880,-0.96162
881,-0.9662200000000001
882,-0.9775299999999999
883,-0.9974299999999999
884,-1.0173
885,-1.0372
886,-1.0535
887,-1.0639
888,-1.0739
889,-1.0838
890,-1.0914
891,-1.0955
892,-1.0955
893,-1.0955
894,-1.0957
895,-1.0989
896,-1.1088
897,-1.1188
898,-1.1287
899,-1.1363
900,-1.1401
901,-1.1401
902,-1.1401
903,-1.1401
904,-1.1401
905,-1.1401
906,-1.1401
907,-1.1401
908,-1.1401
909,-1.1401
910,-1.1401
911,-1.1401
912,-1.1401
913,-1.1401
914,-1.1401
915,-1.1401
916,-1.1401
917,-1.1401
918,-1.1401
919,-1.1401
920,-1.1401
921,-1.1391
922,-1.1358
923,-1.1259
924,-1.1159
925,-1.1059999999999999
926,-1.0974
927,-1.0957
928,-1.0955
929,-1.0955
930,-1.0945
931,-1.0908
932,-1.081
933,-1.071
934,-1.0611
935,-1.0526
936,-1.0609
937,-1.0705
938,-1.0804
939,-1.0895
940,-1.0949
941,-1.0955
942,-1.0955
943,-1.0955
944,-1.0955
