time,value
0,-0.073818
1,-0.095152
2,0.68977
3,-0.18762
4,-0.067356
5,-0.099832
6,0.054803
7,0.16224
8,-0.19927999999999998
9,-0.41235
10,-0.23953000000000002
11,0.039924
12,-0.31399
13,-0.12015
14,0.52432
15,0.16733
16,0.21663000000000002
17,-0.28486999999999996
18,0.303
19,0.82581
20,0.24697
21,-0.5689
22,0.47195
23,-0.013713
24,-0.30314
25,-0.18008
26,0.034566
27,-0.20314000000000002
28,-0.669
29,-0.14823
30,0.046001
31,-0.26655999999999996
32,-0.9031799999999999
33,0.031401
34,0.4725
35,-0.30985
36,0.21656999999999998
37,-0.08293400000000001
38,-0.45473
39,-0.023106
40,0.17407
41,-0.72772
42,0.42826000000000003
43,-0.15679
44,0.41511000000000003
45,-0.083583
46,0.054064999999999995
47,-0.24194000000000002
48,-0.37431
49,0.011852
50,-0.038316
51,0.17690999999999998
52,-0.16312000000000001
53,-0.13068
54,0.36835999999999997
55,0.051937
56,0.74956
57,-0.18375
58,0.06692000000000001
59,-0.079819
60,0.010999
61,-0.10869000000000001
62,0.31637
63,-0.30101999999999995
64,0.20819000000000001
65,0.12713
66,0.24889
67,-0.29641999999999996
68,-0.20546999999999999
69,0.15286
70,-0.10525
71,1.7586
72,1.7586
73,1.7586
74,1.7586
75,1.7586
76,1.7586
77,1.7586
78,1.7586
79,1.7586
80,1.7586
81,1.7586
82,-1.7681
83,-1.7681
84,-1.7681
85,-1.7681
86,-1.7681
87,-1.7681
88,-1.7681
89,-1.7681
90,-1.7681
91,-1.7681
92,0.33291
93,0.24943
94,-0.13953
95,0.23333
96,-0.11792000000000001
97,-0.31012
98,0.10026
99,0.5272600000000001
100,0.099
101,0.12427
102,-0.028356
103,0.39696
104,0.29081
105,-0.22938000000000003
106,-1.7681
107,-1.7681
108,-1.7681
109,-1.7681
110,-1.7681
111,-1.7681
112,-1.7681
113,-1.7681
114,-1.7681
115,1.7586
116,1.7586
117,1.7586
118,1.7586
119,1.7586
120,1.7586
121,1.7586
122,1.7586
123,-0.42949
124,-0.33050999999999997
125,0.14926
126,0.45973
127,0.1544
