time,value
0,-0.36334
1,-0.38158000000000003
2,-0.24816
3,-0.03901
4,0.18653
5,0.41608
6,0.66366
7,0.91286
8,1.0646
9,1.3053
10,1.4283
11,1.4047
12,1.4096
13,1.4839
14,1.4757
15,1.3474
16,1.1541
17,0.9146299999999999
18,0.75848
19,0.50589
20,0.24941999999999998
21,-0.019644
22,-0.23223000000000002
23,-0.41655
24,-0.35658
25,-0.2954
26,-0.18505
27,-0.0097445
28,0.1921
29,0.40984
30,0.64507
31,0.8880299999999999
32,1.1229
33,1.3285
34,1.3559999999999999
35,1.3252
36,1.3209
37,1.3887
38,1.3505
39,1.3457
40,1.3215
41,1.365
42,1.2868
43,1.0153
44,0.7577
45,0.49713999999999997
46,0.25219
47,0.032912000000000004
48,-0.17282999999999998
49,-0.32066
50,-1.0947
51,-1.0947
52,-1.0947
53,-1.0947
54,-1.0947
55,-1.0947
56,-1.0947
57,-1.0947
58,-1.0947
59,-1.0947
60,-1.0947
61,-1.0947
62,-1.0947
63,-1.0947
64,-1.0947
65,-1.0947
66,-1.0947
67,-1.0947
68,-1.0947
69,-1.0947
70,-1.0947
71,-1.0947
72,-1.0947
73,-1.0947
74,-1.0947
75,-1.0947
76,-1.0947
77,-1.0947
78,-1.0947
79,-1.0947
