time,value
0,2.0877
1,2.0877
2,2.0877
3,1.7148
4,2.0877
5,2.0877
6,1.7148
7,1.7148
8,2.0877
9,0.5958399999999999
10,-0.5230600000000001
11,-0.5230600000000001
12,-0.5230600000000001
13,-0.5230600000000001
14,-0.5230600000000001
15,-0.5230600000000001
16,-0.5230600000000001
17,-0.5230600000000001
18,-0.5230600000000001
19,-0.5230600000000001
20,-0.5230600000000001
21,-0.5230600000000001
22,-0.5230600000000001
23,-0.5230600000000001
24,-0.5230600000000001
25,-0.5230600000000001
26,-0.5230600000000001
27,-0.5230600000000001
28,-0.5230600000000001
29,-0.5230600000000001
30,-0.5230600000000001
31,-0.5230600000000001
32,-0.5230600000000001
33,-0.5230600000000001
34,-0.5230600000000001
35,-0.5230600000000001
36,-0.5230600000000001
37,-0.5230600000000001
38,-0.5230600000000001
39,-0.5230600000000001
40,-0.5230600000000001
41,-0.5230600000000001
42,-0.5230600000000001
43,-0.5230600000000001
44,-0.5230600000000001
45,-0.5230600000000001
46,-0.5230600000000001
47,-0.5230600000000001
48,-0.5230600000000001
49,-0.5230600000000001
50,-0.5230600000000001
51,-0.5230600000000001
52,-0.5230600000000001
53,-0.5230600000000001
54,-0.5230600000000001
55,-0.5230600000000001
56,-0.5230600000000001
57,1.435
58,2.0877
59,2.0877
60,2.0877
61,2.0877
62,2.0877
63,1.7148
64,2.0877
65,1.7148
66,2.0877
67,1.7148
68,0.5958399999999999
69,-0.5230600000000001
70,-0.5230600000000001
71,-0.5230600000000001
72,-0.5230600000000001
73,-0.5230600000000001
74,-0.5230600000000001
75,-0.5230600000000001
76,-0.5230600000000001
77,-0.5230600000000001
78,-0.5230600000000001
79,-0.5230600000000001
80,-0.5230600000000001
81,-0.5230600000000001
82,-0.5230600000000001
83,-0.5230600000000001
84,-0.5230600000000001
85,-0.5230600000000001
86,-0.5230600000000001
87,-0.5230600000000001
88,-0.5230600000000001
89,-0.5230600000000001
90,-0.5230600000000001
91,-0.5230600000000001
92,-0.5230600000000001
93,-0.5230600000000001
94,-0.5230600000000001
95,-0.5230600000000001
96,-0.5230600000000001
97,-0.5230600000000001
98,-0.5230600000000001
99,-0.5230600000000001
100,-0.5230600000000001
101,-0.5230600000000001
102,-0.5230600000000001
103,-0.5230600000000001
104,-0.5230600000000001
105,-0.5230600000000001
106,-0.5230600000000001
107,-0.5230600000000001
108,-0.5230600000000001
109,-0.5230600000000001
110,-0.5230600000000001
111,-0.5230600000000001
112,-0.5230600000000001
113,-0.5230600000000001
114,-0.5230600000000001
115,-0.5230600000000001
116,-0.5230600000000001
117,1.435
118,2.0877
119,2.0877
120,2.0877
121,2.0877
122,1.7148
123,2.0877
124,2.0877
125,1.7148
126,1.7148
127,2.0877
128,0.5958399999999999
129,-0.42982
130,-0.5230600000000001
131,-0.5230600000000001
132,-0.5230600000000001
133,-0.5230600000000001
134,-0.5230600000000001
135,-0.5230600000000001
136,-0.5230600000000001
137,-0.5230600000000001
138,-0.5230600000000001
139,-0.5230600000000001
140,-0.5230600000000001
141,-0.5230600000000001
142,-0.5230600000000001
143,-0.5230600000000001
144,-0.5230600000000001
145,-0.5230600000000001
146,-0.5230600000000001
147,-0.5230600000000001
148,-0.5230600000000001
149,-0.5230600000000001
150,-0.5230600000000001
151,-0.5230600000000001
152,-0.5230600000000001
153,-0.5230600000000001
154,-0.5230600000000001
155,-0.5230600000000001
156,-0.5230600000000001
157,-0.5230600000000001
158,-0.5230600000000001
159,-0.5230600000000001
160,-0.5230600000000001
161,-0.5230600000000001
162,-0.5230600000000001
163,-0.5230600000000001
164,-0.5230600000000001
165,-0.5230600000000001
166,-0.5230600000000001
167,-0.5230600000000001
168,-0.5230600000000001
169,-0.5230600000000001
170,-0.5230600000000001
171,-0.5230600000000001
172,-0.5230600000000001
173,-0.5230600000000001
174,-0.5230600000000001
175,-0.5230600000000001
176,-0.5230600000000001
177,0.5958399999999999
178,2.0877
179,2.0877
180,2.0877
181,2.0877
182,2.0877
183,1.7148
184,2.0877
185,1.7148
186,2.0877
187,1.7148
188,1.1553
189,-0.42982
190,-0.5230600000000001
191,-0.5230600000000001
192,-0.5230600000000001
193,-0.5230600000000001
194,-0.5230600000000001
195,-0.5230600000000001
196,-0.5230600000000001
197,-0.5230600000000001
198,-0.5230600000000001
199,-0.5230600000000001
200,-0.5230600000000001
201,-0.5230600000000001
202,-0.5230600000000001
203,-0.5230600000000001
204,-0.5230600000000001
205,-0.5230600000000001
206,-0.5230600000000001
207,-0.5230600000000001
208,-0.5230600000000001
209,-0.5230600000000001
210,-0.5230600000000001
211,-0.5230600000000001
212,-0.5230600000000001
213,-0.5230600000000001
214,-0.5230600000000001
215,-0.5230600000000001
216,-0.5230600000000001
217,-0.5230600000000001
218,-0.5230600000000001
219,-0.5230600000000001
220,-0.5230600000000001
221,-0.5230600000000001
222,-0.5230600000000001
223,-0.5230600000000001
224,-0.5230600000000001
225,-0.5230600000000001
226,-0.5230600000000001
227,-0.5230600000000001
228,-0.5230600000000001
229,-0.5230600000000001
230,-0.5230600000000001
231,-0.5230600000000001
232,-0.5230600000000001
233,-0.5230600000000001
234,-0.5230600000000001
235,-0.5230600000000001
236,1.7148
237,2.0877
238,2.0877
239,2.0877
240,2.0877
241,2.0877
242,1.7148
243,2.0877
244,2.0877
245,1.7148
246,1.7148
247,2.0877
248,-0.33658000000000005
249,-0.5230600000000001
250,-0.5230600000000001
251,-0.5230600000000001
252,-0.5230600000000001
253,-0.5230600000000001
254,-0.5230600000000001
255,-0.5230600000000001
256,-0.5230600000000001
257,-0.5230600000000001
258,-0.5230600000000001
259,-0.5230600000000001
260,-0.5230600000000001
261,-0.5230600000000001
262,-0.5230600000000001
263,-0.5230600000000001
264,-0.5230600000000001
265,-0.5230600000000001
266,-0.5230600000000001
267,-0.5230600000000001
268,-0.5230600000000001
269,-0.5230600000000001
270,-0.5230600000000001
271,-0.5230600000000001
272,-0.5230600000000001
273,-0.5230600000000001
274,-0.5230600000000001
275,-0.5230600000000001
276,-0.5230600000000001
277,-0.5230600000000001
278,-0.5230600000000001
279,-0.5230600000000001
280,-0.5230600000000001
281,-0.5230600000000001
282,-0.5230600000000001
283,-0.5230600000000001
284,-0.5230600000000001
285,-0.5230600000000001
286,-0.5230600000000001
287,-0.5230600000000001
288,-0.5230600000000001
289,-0.5230600000000001
290,-0.5230600000000001
291,-0.5230600000000001
292,-0.5230600000000001
293,-0.5230600000000001
294,-0.15009
295,2.0877
296,2.0877
297,2.0877
298,2.0877
299,2.0877
300,1.7148
301,2.0877
302,1.7148
303,2.0877
304,1.7148
305,2.0877
306,0.5958399999999999
307,-0.5230600000000001
308,-0.5230600000000001
309,-0.5230600000000001
310,-0.5230600000000001
311,-0.5230600000000001
312,-0.5230600000000001
313,-0.5230600000000001
314,-0.5230600000000001
315,-0.5230600000000001
316,-0.5230600000000001
317,-0.5230600000000001
318,-0.5230600000000001
319,-0.5230600000000001
320,-0.5230600000000001
321,-0.5230600000000001
322,-0.5230600000000001
323,-0.5230600000000001
324,-0.5230600000000001
325,-0.5230600000000001
326,-0.5230600000000001
327,-0.5230600000000001
328,-0.5230600000000001
329,-0.5230600000000001
330,-0.5230600000000001
331,-0.5230600000000001
332,-0.5230600000000001
333,-0.5230600000000001
334,-0.5230600000000001
335,-0.5230600000000001
336,-0.5230600000000001
337,-0.5230600000000001
338,-0.5230600000000001
339,-0.5230600000000001
340,-0.5230600000000001
341,-0.5230600000000001
342,-0.5230600000000001
343,-0.5230600000000001
344,-0.5230600000000001
345,-0.5230600000000001
346,-0.5230600000000001
347,-0.5230600000000001
348,-0.5230600000000001
349,-0.5230600000000001
350,-0.5230600000000001
351,-0.5230600000000001
352,-0.5230600000000001
353,-0.5230600000000001
354,1.7148
355,2.4607
356,2.0877
357,1.7148
358,2.0877
359,2.0877
360,2.0877
361,1.7148
362,2.0877
363,1.7148
364,1.7148
365,2.0877
366,-0.42982
367,-0.5230600000000001
368,-0.5230600000000001
369,-0.5230600000000001
370,-0.5230600000000001
371,-0.5230600000000001
372,-0.5230600000000001
373,-0.5230600000000001
374,-0.5230600000000001
375,-0.5230600000000001
376,-0.5230600000000001
377,-0.5230600000000001
378,-0.5230600000000001
379,-0.5230600000000001
380,-0.5230600000000001
381,-0.5230600000000001
382,-0.5230600000000001
383,-0.5230600000000001
384,-0.5230600000000001
385,-0.5230600000000001
386,-0.5230600000000001
387,-0.5230600000000001
388,-0.5230600000000001
389,-0.5230600000000001
390,-0.5230600000000001
391,-0.5230600000000001
392,-0.5230600000000001
393,-0.5230600000000001
394,-0.5230600000000001
395,-0.5230600000000001
396,-0.5230600000000001
397,-0.5230600000000001
398,-0.5230600000000001
399,-0.5230600000000001
400,-0.5230600000000001
401,-0.5230600000000001
402,-0.5230600000000001
403,-0.5230600000000001
404,-0.5230600000000001
405,-0.5230600000000001
406,-0.5230600000000001
407,-0.5230600000000001
408,-0.5230600000000001
409,-0.5230600000000001
410,-0.5230600000000001
411,-0.5230600000000001
412,0.40936
413,2.0877
414,2.0877
415,2.0877
416,2.0877
417,2.0877
418,2.0877
419,1.7148
420,2.0877
421,1.7148
422,2.0877
423,1.7148
424,0.5958399999999999
425,-0.5230600000000001
426,-0.5230600000000001
427,-0.5230600000000001
428,-0.5230600000000001
429,-0.5230600000000001
430,-0.5230600000000001
431,-0.5230600000000001
432,-0.5230600000000001
433,-0.5230600000000001
434,-0.5230600000000001
435,-0.5230600000000001
436,-0.5230600000000001
437,-0.5230600000000001
438,-0.5230600000000001
439,-0.5230600000000001
440,-0.5230600000000001
441,-0.5230600000000001
442,-0.5230600000000001
443,-0.5230600000000001
444,-0.5230600000000001
445,-0.5230600000000001
446,-0.5230600000000001
447,-0.5230600000000001
448,-0.5230600000000001
449,-0.5230600000000001
450,-0.5230600000000001
451,-0.5230600000000001
452,-0.5230600000000001
453,-0.5230600000000001
454,-0.5230600000000001
455,-0.5230600000000001
456,-0.5230600000000001
457,-0.5230600000000001
458,-0.5230600000000001
459,-0.5230600000000001
460,-0.5230600000000001
461,-0.5230600000000001
462,-0.5230600000000001
463,-0.5230600000000001
464,-0.5230600000000001
465,-0.5230600000000001
466,-0.5230600000000001
467,-0.5230600000000001
468,-0.5230600000000001
469,-0.5230600000000001
470,-0.5230600000000001
471,2.0877
472,2.0877
473,2.0877
474,2.0877
475,1.7148
476,2.0877
477,2.0877
478,1.7148
479,2.0877
480,1.7148
481,2.0877
482,1.1553
483,-0.33658000000000005
484,-0.5230600000000001
485,-0.5230600000000001
486,-0.5230600000000001
487,-0.5230600000000001
488,-0.5230600000000001
489,-0.5230600000000001
490,-0.5230600000000001
491,-0.5230600000000001
492,-0.5230600000000001
493,-0.5230600000000001
494,-0.5230600000000001
495,-0.5230600000000001
496,-0.5230600000000001
497,-0.5230600000000001
498,-0.5230600000000001
499,-0.5230600000000001
500,-0.5230600000000001
501,-0.5230600000000001
502,-0.5230600000000001
503,-0.5230600000000001
504,-0.5230600000000001
505,-0.5230600000000001
506,-0.5230600000000001
507,-0.5230600000000001
508,-0.5230600000000001
509,-0.5230600000000001
510,-0.5230600000000001
511,-0.5230600000000001
512,-0.5230600000000001
513,-0.5230600000000001
514,-0.5230600000000001
515,-0.5230600000000001
516,-0.5230600000000001
517,-0.5230600000000001
518,-0.5230600000000001
519,-0.5230600000000001
520,-0.5230600000000001
521,-0.5230600000000001
522,-0.5230600000000001
523,-0.5230600000000001
524,-0.5230600000000001
525,-0.5230600000000001
526,-0.5230600000000001
527,-0.5230600000000001
528,-0.5230600000000001
529,0.8755700000000001
530,2.0877
531,2.0877
532,2.0877
533,2.0877
534,1.7148
535,2.0877
536,2.0877
537,1.7148
538,2.0877
539,1.7148
540,1.7148
541,0.8755700000000001
542,-0.42982
543,-0.5230600000000001
544,-0.5230600000000001
545,-0.5230600000000001
546,-0.5230600000000001
547,-0.5230600000000001
548,-0.5230600000000001
549,-0.5230600000000001
550,-0.5230600000000001
551,-0.5230600000000001
552,-0.5230600000000001
553,-0.5230600000000001
554,-0.5230600000000001
555,-0.5230600000000001
556,-0.5230600000000001
557,-0.5230600000000001
558,-0.5230600000000001
559,-0.5230600000000001
560,-0.5230600000000001
561,-0.5230600000000001
562,-0.5230600000000001
563,-0.5230600000000001
564,-0.5230600000000001
565,-0.5230600000000001
566,-0.5230600000000001
567,-0.5230600000000001
568,-0.5230600000000001
569,-0.5230600000000001
570,-0.5230600000000001
571,-0.5230600000000001
572,-0.5230600000000001
573,-0.5230600000000001
574,-0.5230600000000001
575,-0.5230600000000001
576,-0.5230600000000001
577,-0.5230600000000001
578,-0.5230600000000001
579,-0.5230600000000001
580,-0.5230600000000001
581,-0.5230600000000001
582,-0.5230600000000001
583,-0.5230600000000001
584,-0.5230600000000001
585,-0.5230600000000001
586,0.40936
587,2.0877
588,2.0877
589,2.0877
590,2.0877
591,2.0877
592,1.7148
593,2.0877
594,1.7148
595,2.0877
596,1.7148
597,1.7148
598,1.435
599,-0.42982
600,-0.5230600000000001
601,-0.5230600000000001
602,-0.5230600000000001
603,-0.5230600000000001
604,-0.5230600000000001
605,-0.5230600000000001
606,-0.5230600000000001
607,-0.5230600000000001
608,-0.5230600000000001
609,-0.5230600000000001
610,-0.5230600000000001
611,-0.5230600000000001
612,-0.5230600000000001
613,-0.5230600000000001
614,-0.5230600000000001
615,-0.5230600000000001
616,-0.5230600000000001
617,-0.5230600000000001
618,-0.5230600000000001
619,-0.5230600000000001
620,-0.5230600000000001
621,-0.5230600000000001
622,-0.5230600000000001
623,-0.5230600000000001
624,-0.5230600000000001
625,-0.5230600000000001
626,-0.5230600000000001
627,-0.5230600000000001
628,-0.5230600000000001
629,-0.5230600000000001
630,-0.5230600000000001
631,-0.5230600000000001
632,-0.5230600000000001
633,-0.5230600000000001
634,-0.5230600000000001
635,-0.5230600000000001
636,-0.5230600000000001
637,-0.5230600000000001
638,-0.5230600000000001
639,-0.5230600000000001
640,-0.5230600000000001
641,-0.5230600000000001
642,-0.5230600000000001
643,1.435
644,2.0877
645,2.0877
646,2.0877
647,2.0877
648,2.0877
649,1.7148
650,2.0877
651,1.7148
652,2.0877
653,1.7148
654,1.7148
655,0.8755700000000001
656,-0.42982
657,-0.5230600000000001
658,-0.5230600000000001
659,-0.5230600000000001
660,-0.5230600000000001
661,-0.5230600000000001
662,-0.5230600000000001
663,-0.5230600000000001
664,-0.5230600000000001
665,-0.5230600000000001
666,-0.5230600000000001
667,-0.5230600000000001
668,-0.5230600000000001
669,-0.5230600000000001
670,-0.5230600000000001
671,-0.5230600000000001
672,-0.5230600000000001
673,-0.5230600000000001
674,-0.5230600000000001
675,-0.5230600000000001
676,-0.5230600000000001
677,-0.5230600000000001
678,-0.5230600000000001
679,-0.5230600000000001
680,-0.5230600000000001
681,-0.5230600000000001
682,-0.5230600000000001
683,-0.5230600000000001
684,-0.5230600000000001
685,-0.5230600000000001
686,-0.5230600000000001
687,-0.5230600000000001
688,-0.5230600000000001
689,-0.5230600000000001
690,-0.5230600000000001
691,-0.5230600000000001
692,-0.5230600000000001
693,-0.5230600000000001
694,-0.5230600000000001
695,-0.5230600000000001
696,-0.5230600000000001
697,-0.5230600000000001
698,-0.5230600000000001
699,-0.5230600000000001
700,-0.5230600000000001
701,2.0877
702,2.0877
703,2.0877
704,2.0877
705,2.0877
706,2.0877
707,2.0877
708,1.7148
709,2.0877
710,1.7148
711,2.0877
712,1.1553
713,-0.33658000000000005
714,-0.5230600000000001
715,-0.5230600000000001
716,-0.5230600000000001
717,-0.5230600000000001
718,-0.5230600000000001
719,-0.5230600000000001
