time,value
0,-0.095959
1,-0.42186
2,-0.095959
3,-0.095959
4,-0.42186
5,-0.095959
6,-0.095959
7,-0.42186
8,-0.095959
9,-0.095959
10,-0.42186
11,-0.095959
12,-0.095959
13,-0.42186
14,-0.095959
15,-0.095959
16,-0.42186
17,-0.095959
18,-0.42186
19,-0.095959
20,-0.095959
21,-0.42186
22,-0.095959
23,-0.095959
24,-0.42186
25,-0.095959
26,-0.095959
27,-0.42186
28,-0.095959
29,-0.095959
30,-0.42186
31,-0.095959
32,-0.095959
33,-0.42186
34,-0.095959
35,-0.095959
36,-0.42186
37,-0.095959
38,-0.095959
39,-0.42186
40,-0.095959
41,-0.095959
42,-0.42186
43,-0.095959
44,-0.42186
45,-0.095959
46,-0.095959
47,-0.42186
48,-0.095959
49,-0.095959
50,-0.42186
51,-0.095959
52,-0.095959
53,-0.42186
54,-0.095959
55,-0.095959
56,-0.42186
57,-0.095959
58,-0.095959
59,-0.42186
60,-0.095959
61,-0.095959
62,-0.42186
63,-0.095959
64,-0.42186
65,-0.095959
66,-0.095959
67,-0.095959
68,-0.42186
69,-0.095959
70,-0.42186
71,-0.095959
72,-0.095959
73,-0.42186
74,-0.095959
75,-0.095959
76,-0.42186
77,-0.095959
78,-0.095959
79,-0.42186
80,-0.095959
81,-0.095959
82,-0.42186
83,-0.095959
84,-0.095959
85,-0.42186
86,-0.095959
87,-0.095959
88,-0.42186
89,-0.095959
90,-0.095959
91,0.22994
92,-0.42186
93,-0.095959
94,-0.095959
95,-0.42186
96,-0.095959
97,-0.095959
98,-0.42186
99,-0.095959
100,-0.095959
101,-0.42186
102,-0.095959
103,-0.095959
104,-0.42186
105,-0.095959
106,-0.42186
107,-0.095959
108,-0.095959
109,-0.42186
110,-0.095959
111,-0.095959
112,-0.42186
113,-0.095959
114,-0.095959
115,-0.42186
116,-0.095959
117,-0.095959
118,-0.42186
119,-0.095959
120,-0.095959
121,-0.42186
122,-0.095959
123,-0.095959
124,-0.42186
125,-0.095959
126,-0.095959
127,-0.42186
128,-0.095959
129,-0.095959
130,-0.42186
131,-0.095959
132,-0.095959
133,-0.42186
134,-0.095959
135,-0.095959
136,-0.42186
137,-0.095959
138,-0.095959
139,-0.42186
140,-0.095959
141,-0.095959
142,-0.42186
143,-0.095959
144,-0.42186
145,-0.095959
146,-0.095959
147,-0.42186
148,-0.095959
149,-0.095959
150,-0.42186
151,-0.095959
152,-0.095959
153,-0.42186
154,-0.095959
155,-0.095959
156,-0.42186
157,-0.095959
158,-0.095959
159,-0.42186
160,-0.095959
161,-0.095959
162,-0.42186
163,-0.095959
164,-0.42186
165,-0.095959
166,-0.095959
167,-0.42186
168,-0.095959
169,-0.095959
170,-0.42186
171,-0.095959
172,-0.095959
173,-0.42186
174,-0.095959
175,-0.095959
176,-0.42186
177,-0.095959
178,-0.095959
179,-0.42186
180,-0.095959
181,-0.095959
182,-0.42186
183,-0.095959
184,-0.095959
185,-0.42186
186,-0.095959
187,-0.095959
188,-0.42186
189,-0.095959
190,-0.095959
191,-0.42186
192,-0.095959
193,-0.095959
194,-0.42186
195,-0.095959
196,-0.095959
197,-0.42186
198,-0.095959
199,-0.42186
200,-0.095959
201,-0.095959
202,-0.42186
203,-0.095959
204,-0.095959
205,-0.42186
206,-0.095959
207,-0.095959
208,-0.42186
209,-0.095959
210,8.7033
211,7.3997
212,8.7033
213,7.3997
214,8.7033
215,8.7033
216,10.007
217,7.3997
218,-0.095959
219,-0.42186
220,-0.095959
221,-0.095959
222,-0.42186
223,-0.095959
224,-0.095959
225,-0.42186
226,-0.095959
227,-0.095959
228,-0.42186
229,-0.095959
230,-0.095959
231,-0.42186
232,-0.095959
233,-0.42186
234,-0.095959
235,-0.095959
236,-0.42186
237,-0.095959
238,-0.095959
239,-0.42186
240,-0.095959
241,-0.095959
242,-0.42186
243,-0.095959
244,-0.095959
245,-0.42186
246,-0.095959
247,-0.095959
248,-0.42186
249,-0.095959
250,-0.095959
251,-0.42186
252,-0.095959
253,-0.42186
254,-0.095959
255,-0.095959
256,-0.095959
257,-0.42186
258,-0.095959
259,-0.095959
260,-0.42186
261,-0.095959
262,-0.095959
263,-0.42186
264,-0.095959
265,-0.42186
266,-0.095959
267,-0.095959
268,-0.42186
269,-0.095959
270,-0.095959
271,-0.42186
272,-0.095959
273,-0.095959
274,-0.42186
275,-0.095959
276,-0.095959
277,-0.42186
278,-0.095959
279,-0.095959
280,-0.42186
281,-0.095959
282,-0.095959
283,-0.42186
284,-0.095959
285,-0.095959
286,-0.42186
287,-0.095959
288,-0.095959
289,-0.42186
290,-0.095959
291,-0.095959
292,-0.42186
293,-0.095959
294,-0.42186
295,-0.095959
296,-0.095959
297,-0.42186
298,-0.095959
299,-0.095959
300,-0.42186
301,-0.095959
302,-0.095959
303,-0.42186
304,-0.095959
305,-0.095959
306,-0.42186
307,-0.095959
308,-0.095959
309,-0.42186
310,-0.095959
311,-0.42186
312,-0.095959
313,-0.095959
314,-0.42186
315,-0.095959
316,-0.095959
317,-0.42186
318,-0.095959
319,-0.095959
320,-0.42186
321,-0.095959
322,-0.095959
323,-0.42186
324,-0.095959
325,-0.095959
326,-0.42186
327,-0.095959
328,-0.42186
329,-0.095959
330,-0.095959
331,-0.42186
332,-0.095959
333,-0.095959
334,-0.42186
335,-0.095959
336,-0.095959
337,-0.42186
338,-0.095959
339,-0.095959
340,-0.42186
341,-0.095959
342,-0.095959
343,-0.42186
344,-0.095959
345,-0.095959
346,-0.42186
347,-0.095959
348,-0.42186
349,-0.095959
350,-0.095959
351,-0.42186
352,-0.095959
353,-0.095959
354,-0.42186
355,-0.095959
356,-0.095959
357,-0.42186
358,-0.095959
359,-0.095959
360,-0.42186
361,-0.095959
362,-0.095959
363,-0.42186
364,-0.095959
365,-0.095959
366,-0.42186
367,-0.095959
368,-0.42186
369,-0.095959
370,-0.095959
371,-0.42186
372,-0.095959
373,-0.095959
374,-0.42186
375,-0.095959
376,-0.095959
377,-0.42186
378,-0.095959
379,-0.095959
380,-0.42186
381,-0.095959
382,-0.42186
383,-0.095959
384,-0.095959
385,-0.42186
386,-0.095959
387,-0.095959
388,-0.42186
389,-0.095959
390,-0.095959
391,-0.42186
392,-0.095959
393,-0.095959
394,-0.42186
395,-0.095959
396,-0.42186
397,-0.095959
398,-0.095959
399,-0.095959
400,-0.42186
401,-0.095959
402,-0.42186
403,-0.095959
404,-0.095959
405,-0.42186
406,-0.095959
407,-0.095959
408,-0.42186
409,-0.095959
410,-0.095959
411,-0.42186
412,-0.095959
413,-0.42186
414,-0.095959
415,-0.095959
416,-0.42186
417,-0.095959
418,-0.095959
419,-0.42186
420,-0.095959
421,-0.095959
422,-0.42186
423,-0.095959
424,-0.095959
425,-0.42186
426,-0.095959
427,-0.095959
428,-0.42186
429,-0.095959
430,-0.095959
431,-0.42186
432,-0.095959
433,-0.095959
434,-0.42186
435,-0.095959
436,-0.095959
437,-0.42186
438,-0.095959
439,-0.42186
440,-0.095959
441,-0.095959
442,-0.42186
443,-0.095959
444,-0.095959
445,-0.42186
446,-0.095959
447,-0.095959
448,-0.42186
449,-0.095959
450,-0.095959
451,-0.42186
452,-0.095959
453,-0.095959
454,-0.42186
455,-0.095959
456,-0.095959
457,-0.42186
458,-0.095959
459,-0.095959
460,-0.42186
461,-0.095959
462,-0.095959
463,-0.42186
464,-0.095959
465,-0.42186
466,-0.095959
467,-0.095959
468,-0.42186
469,-0.095959
470,-0.095959
471,-0.42186
472,-0.095959
473,-0.095959
474,-0.42186
475,-0.095959
476,-0.095959
477,-0.42186
478,-0.095959
479,-0.095959
480,-0.42186
481,-0.095959
482,-0.095959
483,-0.42186
484,-0.095959
485,-0.42186
486,-0.095959
487,-0.095959
488,-0.42186
489,-0.095959
490,-0.095959
491,-0.42186
492,-0.095959
493,-0.095959
494,-0.42186
495,-0.095959
496,-0.095959
497,-0.42186
498,-0.095959
499,-0.095959
500,-0.42186
501,-0.095959
502,-0.095959
503,-0.42186
504,-0.095959
505,-0.42186
506,-0.095959
507,-0.095959
508,-0.42186
509,-0.095959
510,-0.095959
511,-0.42186
512,-0.095959
513,-0.095959
514,-0.42186
515,-0.095959
516,-0.095959
517,-0.42186
518,-0.095959
519,-0.42186
520,-0.095959
521,-0.095959
522,-0.42186
523,-0.095959
524,-0.095959
525,-0.42186
526,-0.095959
527,-0.095959
528,-0.42186
529,-0.095959
530,-0.095959
531,-0.42186
532,-0.095959
533,-0.095959
534,-0.42186
535,-0.095959
536,-0.42186
537,-0.095959
538,-0.095959
539,-0.42186
540,-0.095959
541,-0.095959
542,-0.42186
543,-0.095959
544,-0.095959
545,-0.42186
546,-0.095959
547,-0.095959
548,-0.42186
549,-0.095959
550,-0.095959
551,-0.42186
552,-0.095959
553,-0.095959
554,-0.42186
555,-0.095959
556,-0.095959
557,-0.42186
558,-0.095959
559,-0.42186
560,-0.095959
561,-0.095959
562,-0.42186
563,-0.095959
564,-0.095959
565,-0.42186
566,-0.095959
567,-0.095959
568,-0.42186
569,-0.095959
570,-0.095959
571,-0.42186
572,-0.095959
573,-0.095959
574,-0.42186
575,-0.095959
576,-0.42186
577,-0.095959
578,-0.095959
579,-0.42186
580,-0.095959
581,-0.095959
582,-0.42186
583,-0.095959
584,-0.095959
585,-0.42186
586,-0.095959
587,-0.095959
588,-0.42186
589,-0.095959
590,-0.095959
591,-0.42186
592,-0.095959
593,-0.095959
594,-0.42186
595,-0.095959
596,-0.42186
597,-0.095959
598,-0.095959
599,-0.42186
600,-0.095959
601,-0.095959
602,-0.42186
603,-0.095959
604,-0.095959
605,-0.42186
606,-0.095959
607,-0.095959
608,-0.42186
609,-0.095959
610,-0.42186
611,-0.095959
612,-0.095959
613,-0.42186
614,-0.095959
615,-0.095959
616,-0.42186
617,-0.095959
618,-0.095959
619,-0.42186
620,-0.095959
621,-0.095959
622,-0.42186
623,-0.095959
624,-0.42186
625,-0.095959
626,-0.095959
627,-0.42186
628,-0.095959
629,-0.095959
630,-0.42186
631,-0.095959
632,-0.095959
633,-0.42186
634,-0.095959
635,-0.095959
636,-0.42186
637,-0.095959
638,-0.42186
639,-0.095959
640,-0.095959
641,-0.42186
642,-0.095959
643,-0.095959
644,-0.42186
645,-0.095959
646,-0.095959
647,-0.42186
648,-0.095959
649,-0.42186
650,-0.095959
651,-0.095959
652,-0.42186
653,-0.095959
654,-0.095959
655,-0.42186
656,-0.095959
657,-0.095959
658,-0.42186
659,-0.095959
660,-0.095959
661,-0.42186
662,-0.095959
663,0.88174
664,2.1853
665,1.5335
666,1.5335
667,1.5335
668,1.5335
669,1.5335
670,1.5335
671,1.5335
672,2.1853
673,1.5335
674,1.5335
675,1.5335
676,1.5335
677,1.5335
678,1.5335
679,1.5335
680,1.5335
681,1.5335
682,1.5335
683,1.5335
684,0.88174
685,1.5335
686,1.5335
687,1.5335
688,1.5335
689,1.5335
690,1.5335
691,1.5335
692,1.5335
693,1.5335
694,1.5335
695,1.5335
696,1.5335
697,1.5335
698,1.5335
699,1.5335
700,0.88174
701,1.5335
702,1.5335
703,1.5335
704,1.5335
705,1.5335
706,1.5335
707,1.5335
708,0.88174
709,0.22994
710,-0.095959
711,0.22994
712,-0.095959
713,0.22994
714,-0.095959
715,0.22994
716,-0.095959
717,0.22994
718,-0.095959
719,-0.095959
