time,value
0,1.1035
1,0.6382899999999999
2,0.14176
3,-0.34303
4,-0.77288
5,-1.1287
6,-1.3762
7,-1.4980000000000002
8,-1.4685
9,-1.2854
10,-0.9638100000000001
11,-0.5319699999999999
12,-0.055393
13,0.41894
14,0.8419399999999999
15,1.1585
16,1.3139
17,1.3068
18,1.1407
19,0.8434799999999999
20,0.46913999999999995
21,0.078958
22,-0.2908
23,-0.59945
24,-0.8269299999999999
25,-0.94737
26,-0.9591700000000001
27,-0.8711700000000001
28,-0.6732600000000001
29,-0.38539
30,-0.032672
31,0.34725
32,0.71377
33,1.0154
34,1.1995
35,1.2502
36,1.1562
37,0.9398700000000001
38,0.63294
39,0.27710999999999997
40,-0.099131
41,-0.46166999999999997
42,-0.7884
43,-1.0608
44,-1.2772
45,-1.4142
46,-1.4555
47,-1.3856
48,-1.2078
49,-0.9247700000000001
50,-0.5774600000000001
51,-0.21205
52,0.14436
53,0.46488
54,0.73653
55,0.9622799999999999
56,1.1483
57,1.2967
58,1.3939
59,1.4148
60,1.3445
61,1.1681
62,0.88781
63,0.53804
64,0.17384000000000002
65,-0.14964
66,-0.38889
67,-0.5271100000000001
68,-0.58629
69,-0.60287
70,-0.60597
71,-0.63417
72,-0.69802
73,-0.78656
74,-0.87384
75,-0.9319700000000001
76,-0.93991
77,-0.8783
78,-0.74952
79,-0.55672
80,-0.31415
81,-0.038149
82,0.27082
83,0.59022
84,0.8994200000000001
85,1.1667
86,1.3696
87,1.4834
88,1.5033
89,1.44
90,1.3026
91,1.1014
92,0.86126
93,0.5846399999999999
94,0.26466
95,-0.10908
96,-0.54485
97,-1.0333
98,-1.5416
99,-2.0137
100,-2.3908
101,-2.5915
102,-2.5754
103,-2.3117
104,-1.8022
105,-1.0904
106,-0.22721999999999998
107,0.68745
108,1.5539
109,2.2808
110,2.7943
111,3.0715
112,3.0967
113,2.9218
114,2.5785
115,2.108
116,1.5530000000000002
117,0.94839
118,0.27824
119,-0.45093999999999995
120,-1.2232
121,-2.0069
122,-2.7301
123,-3.2848
124,-3.5872
125,-3.5692
126,-3.2234
127,-2.5879
128,-1.7604
129,-0.8552799999999999
130,0.010865000000000001
131,0.75745
132,1.3517
133,1.7969
134,2.1094
135,2.3273
136,2.464
137,2.51
138,2.4399
139,2.2287
140,1.8692
141,1.3618
142,0.75346
143,0.10428
144,-0.52062
145,-1.057
146,-1.4744
147,-1.7403
148,-1.8564
149,-1.8206
150,-1.6596
151,-1.3868
152,-1.0242
153,-0.62856
154,-0.23926
155,0.081216
156,0.3067
157,0.43105
158,0.4658
159,0.45846000000000003
160,0.45905
161,0.50772
162,0.60664
163,0.7335
164,0.84106
165,0.8639700000000001
166,0.7566
167,0.51274
168,0.16979
169,-0.2073
170,-0.53392
171,-0.75249
172,-0.8356600000000001
173,-0.7842100000000001
174,-0.63942
175,-0.45505
176,-0.27915999999999996
177,-0.13938
178,-0.036455
179,0.044174
180,0.12643
181,0.23204
182,0.36459
183,0.49572
184,0.59643
185,0.6469699999999999
186,0.61983
187,0.52515
188,0.38095999999999997
189,0.21883000000000002
190,0.075905
191,-0.025021
192,-0.063862
193,-0.056933000000000004
194,-0.025424000000000002
195,0.005483699999999999
196,0.017134
197,-0.0046286999999999995
198,-0.075701
199,-0.20128
200,-0.37564000000000003
201,-0.5773
202,-0.7739199999999999
203,-0.92569
204,-0.97311
205,-0.8888799999999999
206,-0.65337
207,-0.28998
208,0.15370999999999999
209,0.60159
210,0.9492
211,1.1354
212,1.1158
213,0.92469
214,0.61533
215,0.28315999999999997
216,0.028012000000000002
217,-0.10562
218,-0.11120999999999999
219,-0.023088
220,0.07334600000000001
221,0.10464000000000001
222,0.024926
223,-0.16945
224,-0.44643999999999995
225,-0.72893
226,-0.92185
227,-0.97325
228,-0.86779
229,-0.6169100000000001
230,-0.28418000000000004
231,0.07073099999999999
232,0.3769
233,0.5918800000000001
234,0.6933
235,0.7039
236,0.65123
237,0.55874
238,0.45511999999999997
239,0.36471
240,0.30530999999999997
241,0.26645
242,0.2543
243,0.25049
244,0.22304000000000002
245,0.14607
246,0.0016698000000000001
247,-0.20526999999999998
248,-0.46116999999999997
249,-0.72111
250,-0.92256
251,-1.0152
252,-0.9763799999999999
253,-0.79109
254,-0.48305
255,-0.11632
256,0.24648
257,0.53699
258,0.70997
259,0.75822
260,0.6874899999999999
261,0.53695
262,0.336
263,0.12937
264,-0.040871
265,-0.14683
266,-0.17720999999999998
267,-0.13997
268,-0.05105
269,0.051695000000000005
270,0.13658
271,0.16901
272,0.13668
273,0.049072000000000005
274,-0.06945499999999999
275,-0.17324
276,-0.21965
277,-0.17507999999999999
278,-0.045951
279,0.13201
280,0.29891999999999996
281,0.3995
282,0.38519000000000003
283,0.24145999999999998
284,0.00099839
285,-0.27505
286,-0.52178
287,-0.67264
288,-0.69691
289,-0.5915600000000001
290,-0.39313000000000003
291,-0.15214
292,0.064067
293,0.21555
294,0.27634000000000003
295,0.24686999999999998
296,0.15666
297,0.042445
298,-0.062559
299,-0.12554
300,-0.12822
301,-0.06804500000000001
302,0.057589
303,0.21636
304,0.3884
305,0.53786
306,0.6441600000000001
307,0.68269
308,0.65558
309,0.56072
310,0.42428
311,0.27601
312,0.11522
313,-0.035631
314,-0.17837
315,-0.3036
316,-0.39883
317,-0.45231000000000005
318,-0.45575
319,-0.4387
320,-0.41
321,-0.39086
322,-0.4089
323,-0.47616
324,-0.5897600000000001
325,-0.71533
326,-0.8
327,-0.79243
328,-0.63635
329,-0.3285
330,0.093096
331,0.5543600000000001
332,0.9557399999999999
333,1.2044
334,1.248
335,1.1
336,0.80929
337,0.47048999999999996
338,0.16652
339,-0.021623
340,-0.057611
341,0.017304
342,0.15627
343,0.27613000000000004
344,0.3102
345,0.21644000000000002
346,-0.01066
347,-0.33426999999999996
348,-0.69281
349,-1.0038
350,-1.1881
351,-1.2053
352,-1.0321
353,-0.6701199999999999
354,-0.18348
355,0.34435
356,0.81491
357,1.1423
358,1.2753
359,1.1909
360,0.90723
361,0.48899
362,0.022425999999999998
363,-0.38418
364,-0.64617
365,-0.7255
366,-0.633
367,-0.39982
368,-0.08329099999999999
369,0.23367
370,0.47
371,0.56779
372,0.5071100000000001
373,0.28676999999999997
374,-0.045397
375,-0.40778000000000003
376,-0.7135100000000001
377,-0.88087
378,-0.8577
379,-0.64162
380,-0.26809
381,0.18453
382,0.5912
383,0.8589600000000001
384,0.9217
385,0.75144
386,0.38523
387,-0.086712
388,-0.5431699999999999
389,-0.8747799999999999
390,-0.99669
391,-0.8796200000000001
392,-0.5526
393,-0.07535599999999999
394,0.43463
395,0.88549
396,1.1806
397,1.2534
398,1.0872
399,0.70787
400,0.18914
401,-0.3772
402,-0.88597
403,-1.2408
404,-1.3545
405,-1.1908
406,-0.77873
407,-0.18266
408,0.47123999999999994
409,1.0326
410,1.3711
411,1.4032
412,1.1093
413,0.5667399999999999
414,-0.09610700000000001
415,-0.71829
416,-1.1465
417,-1.2830000000000001
418,-1.1093
419,-0.67897
420,-0.096011
421,0.48891999999999997
422,0.9296200000000001
423,1.1168
424,1.0102
425,0.63612
426,0.085813
427,-0.5215
428,-1.0553
429,-1.4089
430,-1.5069
431,-1.3213
432,-0.8864200000000001
433,-0.27373000000000003
434,0.40751
435,1.0362
436,1.506
437,1.7262
438,1.6493
439,1.3004
440,0.73212
441,0.062537
442,-0.55475
443,-0.9965
444,-1.1759
445,-1.061
446,-0.68957
447,-0.15732000000000002
448,0.41002
449,0.8672799999999999
450,1.1062
451,1.0559
452,0.73182
453,0.20276
454,-0.41773999999999994
455,-0.9918100000000001
456,-1.4035
457,-1.5673
458,-1.4415
459,-1.0584
460,-0.49642
461,0.13767000000000001
462,0.72544
463,1.1451
464,1.3099
465,1.199
466,0.8360200000000001
467,0.30861
468,-0.25708000000000003
469,-0.7201
470,-0.9613299999999999
471,-0.91825
472,-0.5915199999999999
473,-0.049982
474,0.5816
475,1.1548
476,1.5235
477,1.6053
478,1.3565
479,0.81326
480,0.078529
481,-0.72491
482,-1.4459
483,-1.9539
484,-2.1628
485,-2.0383
486,-1.5855
487,-0.87031
488,-0.016380000000000002
489,0.8251200000000001
490,1.4972
491,1.8828
492,1.911
493,1.5859999999999999
494,0.99265
495,0.27396
496,-0.41747
497,-0.9358700000000001
498,-1.171
499,-1.1006
