time,value
0,-1.1384
1,-1.1384
2,-1.1384
3,-1.1384
4,-1.1384
5,-1.1384
6,-1.1384
7,-1.1384
8,-1.1384
9,-1.1384
10,-1.1384
11,-1.1384
12,-1.1384
13,-1.1384
14,-1.1384
15,-1.1384
16,-1.1384
17,-1.1384
18,-1.1384
19,-1.1384
20,-1.1384
21,-1.1384
22,-1.1064
23,-0.9816799999999999
24,-0.82315
25,-0.72138
26,-0.72168
27,-0.7240000000000001
28,-0.76455
29,-0.80704
30,-0.87421
31,-0.95844
32,-1.0342
33,-1.0813
34,-1.1238
35,-1.1966
36,-1.2792
37,-1.3642
38,-1.4491
39,-1.5341
40,-1.6191
41,-1.7041
42,-1.7699
43,-1.819
44,-1.8521
45,-1.8681
46,-1.8659999999999999
47,-1.8504
48,-1.8090000000000002
49,-1.7572
50,-1.6842
51,-1.5956
52,-1.4936
53,-1.3669
54,-1.2487
55,-1.1988
56,-1.1556
57,-1.0892
58,-1.0043
59,-0.9350799999999999
60,-0.92989
61,-0.92989
62,-0.92989
63,-0.92989
64,-0.92989
65,-0.92989
66,-0.934
67,-0.96288
68,-1.0049
69,-1.0275
70,-1.0341
71,-1.0341
72,-1.0341
73,-1.0326
74,-1.0147
75,-0.9743700000000001
76,-0.9318799999999999
77,-0.88938
78,-0.8509399999999999
79,-0.82563
80,-0.82563
81,-0.82563
82,-0.82563
83,-0.82563
84,-0.82563
85,-0.82563
86,-0.81932
87,-0.77715
88,-0.7346600000000001
89,-0.6614399999999999
90,-0.57796
91,-0.49296
92,-0.40797
93,-0.32297
94,-0.23798000000000002
95,-0.15298
96,-0.10885999999999998
97,-0.48728
98,-0.48728
99,-0.48728
100,-0.48349
101,-0.38223
102,-0.18515
103,-0.20820999999999998
104,0.21531
105,0.055553
106,0.14354
107,0.35602
108,0.11528
109,0.15778
110,0.19672
111,0.21686999999999998
112,0.21686999999999998
113,0.21686999999999998
114,0.21686999999999998
115,0.21686999999999998
116,0.24745999999999999
117,0.28925
118,0.31699
119,0.32111999999999996
120,0.32263000000000003
121,0.35616
122,0.39749
123,0.41928000000000004
124,0.42536999999999997
125,0.43431000000000003
126,0.46321999999999997
127,0.50572
128,0.52589
129,0.52962
130,0.54167
131,0.5714600000000001
132,0.61395
133,0.65645
134,0.69895
135,0.74145
136,0.78394
137,0.82644
138,0.8689399999999999
139,0.9124200000000001
140,0.96124
141,1.0462
142,1.1306
143,1.1857
144,1.2282
145,1.2569
146,1.2594
147,1.2594
148,1.2951
149,1.3364
150,1.3582
151,1.3636
152,1.3719999999999999
153,1.4021
154,1.4446
155,1.4871
156,1.5296
157,1.5721
158,1.6146
159,1.6571
160,1.6996
161,1.7421
162,1.7846
163,1.8271
164,1.8641
165,1.8849
166,1.8849
167,1.8849
168,1.8849
169,1.8799
170,1.8225
171,1.7375
172,1.665
173,1.6219
174,1.5794
175,1.5731
176,1.5721
177,1.5516
178,1.5137
179,1.4787
180,1.4679
181,1.4679
182,1.4679
183,1.4679
184,1.4679
185,1.4679
186,1.4679
187,1.4679
188,1.4679
189,1.4543
190,1.4207
191,1.3843
192,1.3636
193,1.3636
194,1.3636
195,1.3636
196,1.3636
197,1.3636
198,1.3629
199,1.351
200,1.3085
201,1.266
202,1.2235
203,1.181
204,1.1587
205,1.1551
206,1.1487
207,1.1153
208,1.0728
209,1.0303
210,0.9878
211,0.9453
212,0.9028
213,0.86339
214,0.8431299999999999
215,0.8423799999999999
216,0.82775
217,0.79457
218,0.75207
219,0.70957
220,0.66708
221,0.62458
222,0.58208
223,0.5395800000000001
224,0.49709
225,0.45308000000000004
226,0.39881
227,0.31383
228,0.22916999999999998
229,0.18035
230,0.13785
231,0.13439
232,0.17238
233,0.20969000000000002
234,0.21666
235,0.21686999999999998
236,0.21686999999999998
237,0.21686999999999998
238,0.2044
239,0.17238
240,0.12768
241,0.29518
242,-0.12207
243,-0.46988
244,-0.14435
245,-0.19351
246,-0.25856
247,-0.34356
248,-0.42855
249,-0.51355
250,-0.58496
251,-0.6171300000000001
252,-0.61921
253,-0.63108
254,-0.67357
255,-0.71607
256,-0.75857
257,-0.80107
258,-0.82491
259,-0.82563
260,-0.82195
261,-0.7841
262,-0.74197
263,-0.75045
264,-0.78579
265,-0.81628
266,-0.82563
267,-0.82563
268,-0.82563
269,-0.82563
270,-0.82563
271,-0.82563
272,-0.81243
273,-0.7658699999999999
274,-0.68088
275,-0.6272800000000001
276,-0.6171300000000001
277,-0.60936
278,-0.58327
279,-0.5432
280,-0.51288
281,-0.51288
282,-0.51288
283,-0.51288
284,-0.51288
285,-0.51288
286,-0.51288
287,-0.51093
288,-0.47075
289,-0.42855
290,-0.36061
291,-0.27848
292,-0.20481999999999997
293,-0.15431
294,-0.11182
295,-0.35448
296,-0.14199
297,0.070493
298,0.28298
299,0.49546
300,0.14317
301,0.18566
302,0.21106
303,0.21686999999999998
304,0.21686999999999998
305,0.21686999999999998
306,0.21941999999999998
307,0.23215
308,0.27464
309,0.31071
310,0.32111999999999996
311,0.32305
312,0.34038
313,0.38288
314,0.42536999999999997
315,-1.8251
316,-1.8251
317,-1.8251
318,-1.8251
319,-1.8251
320,-1.8251
321,-1.8251
322,-1.8251
323,-1.8251
324,-1.8251
325,-1.8251
326,-1.8251
327,-1.8251
328,-1.8251
329,-1.8251
330,-1.8251
331,-1.8251
332,-1.8251
333,-1.8251
334,-1.8251
335,-1.8251
336,-1.8251
337,-1.791
338,-1.6580000000000001
339,-1.4889
340,-1.3803
341,-1.3803
342,-1.3803
343,-1.3803
344,-1.3803
345,-1.3803
346,-1.3803
347,-1.3902
348,-1.4306
349,-1.4759
350,-1.4889
351,-1.4915
352,-1.4915
353,-1.4915
354,-1.4969
355,-1.5255
356,-1.5708
357,-1.5957
358,-1.6027
359,-1.5927
360,-1.5645
361,-1.5191
362,-1.4738
363,-1.4285
364,-1.3831
365,-1.3378
366,-1.2886
367,-1.2252
368,-1.1349
369,-1.0492
370,-0.9999100000000001
371,-0.9538
372,-0.88303
373,-0.7923600000000001
374,-0.71012
375,-0.6620199999999999
376,-0.61668
377,-0.6040300000000001
378,-0.6018100000000001
379,-0.58465
380,-0.54656
381,-0.50561
382,-0.49108999999999997
383,-0.4906
384,-0.4906
385,-0.4906
386,-0.48051000000000005
387,-0.45164
388,-0.4063
389,-0.36096999999999996
390,-0.31563
391,-0.28148
392,-0.26816999999999996
393,-0.26384
394,-0.2455
395,-0.20017000000000001
396,-0.15483
397,-0.1095
398,-0.3407
399,-0.23661
400,-0.23661
401,-0.23661
402,-0.23661
403,-0.23661
404,-0.23661
405,-0.23661
406,-0.23661
407,-0.23661
408,-0.2522
409,-0.41866000000000003
410,-0.1265
411,-0.15003
412,-0.15696
413,-0.16689
414,-0.19663
415,-0.24115
416,-0.26488
417,-0.26816999999999996
418,-0.29245
419,-0.35601
420,-0.43746999999999997
421,-0.4906
422,-0.4906
423,-0.4906
424,-0.4906
425,-0.4906
426,-0.4906
427,-0.4906
428,-0.4906
429,-0.4906
430,-0.4906
431,-0.52323
432,-0.56781
433,-0.59739
434,-0.6018100000000001
435,-0.6018100000000001
436,-0.6018100000000001
437,-0.6018100000000001
438,-0.6018100000000001
439,-0.6018100000000001
440,-0.59227
441,-0.56143
442,-0.5161
443,-0.49456999999999995
444,-0.4906
445,-0.4906
446,-0.4906
447,-0.4906
448,-0.4906
449,-0.4906
450,-0.4906
451,-0.4906
452,-0.4906
453,-0.4906
454,-0.48954
455,-0.4828
456,-0.43746999999999997
457,-0.39213000000000003
458,-0.3468
459,-0.30146
460,-0.25613
461,-0.21079
462,-0.16546
463,-0.19634000000000001
464,-0.23913
465,-0.26233
466,-0.26816999999999996
467,-0.27707
468,-0.30926
469,-0.35459
470,-0.37495
471,-0.37938
472,-0.36605
473,-0.33405
474,-0.28870999999999997
475,-0.24338
476,-0.19804000000000002
477,-0.16585999999999998
478,-0.15696
479,-0.15112
480,-0.12792
481,-0.42715
482,-0.23661
483,-0.23661
484,-0.24981
485,-0.40308
486,-0.12437000000000001
487,-0.15634
488,-0.15696
489,-0.15696
490,-0.11835999999999999
491,-0.37829
492,-0.26129
493,-0.23661
494,-0.23661
495,-0.23661
496,-0.23661
497,-0.10717
498,0.096315
499,0.25518
500,0.31945
501,0.33935
502,0.44695
503,0.1363
504,0.18164
505,0.22696999999999998
506,0.27231
507,0.31764000000000003
508,0.36298
509,0.40831
510,0.45365
511,0.49456999999999995
512,0.51032
513,0.51107
514,0.52377
515,0.56911
516,0.61444
517,0.65978
518,0.70511
519,0.75045
520,0.79578
521,0.8411200000000001
522,0.88645
523,0.93179
524,0.9771200000000001
525,1.0225
526,1.0542
527,1.0664
528,1.0697
529,1.0934
530,1.1379
531,1.1677
532,1.1776
533,1.1845
534,1.208
535,1.2534
536,1.2987
537,1.3441
538,1.3834
539,1.4
540,1.4
541,1.4
542,1.4
543,1.4
544,1.4
545,1.4
546,1.3792
547,1.3363
548,1.3019999999999998
549,1.3325
550,1.3773
551,1.3957
552,1.4
553,1.4133
554,1.4475
555,1.4905
556,1.5096
557,1.5112
558,1.5112
559,1.5112
560,1.5041
561,1.4801
562,1.4352
563,1.4044
564,1.4
565,1.3928
566,1.3646
567,1.3193
568,1.2739
569,1.2286
570,1.186
571,1.1776
572,1.1776
573,1.1776
574,1.1776
575,1.1776
576,1.1776
577,1.1776
578,1.1776
579,1.1776
580,1.1776
581,1.1776
582,1.1764
583,1.1477
584,1.1046
585,1.0593
586,1.014
587,0.97567
588,0.9551700000000001
589,0.9551700000000001
590,0.9551700000000001
591,0.9551700000000001
592,0.9551700000000001
593,0.9551700000000001
594,0.9551700000000001
595,0.9551700000000001
596,0.9551700000000001
597,0.9551700000000001
598,0.9551700000000001
599,0.95435
600,0.9353299999999999
601,0.89
602,0.84675
603,0.8442700000000001
604,0.84395
605,0.84395
606,0.84395
607,0.84395
608,0.84395
609,0.84395
610,0.87489
611,0.9176200000000001
612,0.9454899999999999
613,0.9551700000000001
614,0.9551700000000001
615,0.9551700000000001
616,0.9551700000000001
617,0.9551700000000001
618,0.9551700000000001
619,0.9551700000000001
620,0.9551700000000001
621,0.9551700000000001
622,0.9551700000000001
623,0.9551700000000001
624,0.9551700000000001
625,0.9551700000000001
626,0.9551700000000001
627,0.9551700000000001
628,0.9551700000000001
629,0.9551700000000001
630,-1.6013
631,-1.6013
632,-1.6013
633,-1.6013
634,-1.6013
635,-1.6013
636,-1.6013
637,-1.6013
638,-1.6013
639,-1.6013
640,-1.6013
641,-1.6013
642,-1.6013
643,-1.6013
644,-1.6013
645,-1.6013
646,-1.6013
647,-1.6013
648,-1.6013
649,-1.6013
650,-1.6013
651,-1.6013
652,-1.6269999999999998
653,-1.7269
654,-1.8539
655,-1.9355
656,-1.9358
657,-1.9388
658,-1.9908
659,-2.0453
660,-2.0523
661,-2.0266
662,-1.9993
663,-1.9721
664,-1.9448
665,-1.8787
666,-1.8001
667,-1.7184
668,-1.6366
669,-1.5582
670,-1.4936
671,-1.4391
672,-1.3969999999999998
673,-1.3655
674,-1.3322
675,-1.288
676,-1.2349
677,-1.1904
678,-1.1624
679,-1.1532
680,-1.1846
681,-1.2368
682,-1.2803
683,-1.3071
684,-1.3284
685,-1.3059
686,-1.2791
687,-1.2671
688,-1.2671
689,-1.2570000000000001
690,-1.2058
691,-1.1514
692,-1.0969
693,-1.0424
694,-0.97759
695,-0.9002100000000001
696,-0.82111
697,-0.7579
698,-0.70312
699,-0.64863
700,-0.59414
701,-0.53966
702,-0.48517
703,-0.43068
704,-0.3762
705,-0.32171
706,-0.26721999999999996
707,-0.21274
708,-0.15825
709,-0.10375999999999999
710,-0.25292
711,0.06421
712,0.11674000000000001
713,0.22426999999999997
714,0.31851
715,0.40024
716,0.47386999999999996
717,0.50154
718,0.5288
719,0.55604
720,0.58328
721,0.61053
722,0.63777
723,0.66689
724,0.71414
725,0.76803
726,0.8225100000000001
727,0.877
728,0.9374600000000001
729,1.0098
730,1.0911
731,1.1598
732,1.2163
733,1.2562
734,1.2725
735,1.2725
736,1.2725
737,1.2725
738,1.2783
739,1.3014
740,1.3309
741,1.3725
742,1.4266
743,1.4772
744,1.5045
745,1.5317
746,1.5785
747,1.6326
748,1.6871
749,1.7416
750,1.7941
751,1.8056
752,1.8071
753,1.7806
754,1.7339
755,1.6851
756,1.6492
757,1.6219
758,1.5804
759,1.5283
760,1.4815
761,1.4461
762,1.4189
763,1.3916
764,1.3644
765,1.3302
766,1.2805
767,1.2261
768,1.1716
769,1.1177
770,1.0673
771,1.04
772,1.0124
773,0.9659700000000001
774,0.91148
775,0.8481700000000001
776,0.76803
777,0.6863
778,0.62747
779,0.57222
780,0.53103
781,0.5002800000000001
782,0.47303
783,0.44578999999999996
784,0.41855
785,0.3913
786,0.36406
787,0.32881
788,0.28233
789,0.22784000000000001
790,0.17335
791,0.11887
792,0.31401999999999997
793,0.26607
794,-0.23085
795,-0.09908
796,-0.15357
797,-0.20805
798,-0.26254
799,-0.31703000000000003
800,-0.37151
801,-0.426
802,-0.46442
803,-0.46516
804,-0.46516
805,-0.44197
806,-0.41536000000000006
807,-0.41448
808,-0.43578999999999996
809,-0.45821999999999996
810,-0.46516
811,-0.46516
812,-0.46516
813,-0.46516
814,-0.46516
815,-0.46516
816,-0.46516
817,-0.46516
818,-0.46516
819,-0.46516
820,-0.46516
821,-0.46516
822,-0.46516
823,-0.46516
824,-0.46516
825,-0.46516
826,-0.46781999999999996
827,-0.4856
828,-0.51239
829,-0.532
830,-0.532
831,-0.532
832,-0.50866
833,-0.48177
834,-0.45452
835,-0.42728
836,-0.40003
837,-0.37279
838,-0.34555
839,-0.33426999999999996
840,-0.3315
841,-0.32336
842,-0.30341
843,-0.28010999999999997
844,-0.28139000000000003
845,-0.30766
846,-0.31616
847,-0.30085
848,-0.26945
849,-0.22805999999999998
850,-0.17357
851,-0.11909000000000002
852,-0.33088
853,-0.058449
854,0.21399
855,0.48158999999999996
856,0.14483
857,0.17207
858,0.19888
859,0.17974
860,0.1525
861,0.12525
862,0.48216000000000003
863,0.36258
864,0.34023000000000003
865,0.33956
866,0.42068
867,0.11035
868,0.14559
869,0.19336
870,0.24925999999999998
871,0.3195
872,0.40024
873,0.46218000000000004
874,0.50155
875,0.5288
876,0.55604
877,0.58358
878,0.61955
879,0.6714
880,0.71718
881,0.7378100000000001
882,0.7391399999999999
883,0.74674
884,0.77399
885,0.80123
886,0.82847
887,0.85572
888,0.8829600000000001
889,0.9102
890,0.93745
891,0.9646899999999999
892,0.9919399999999999
893,1.0192
894,1.0464
895,1.0659999999999998
896,1.072
897,1.072
898,1.072
899,1.072
900,1.0514
901,1.0090000000000001
902,0.9544799999999999
903,0.89999
904,0.8455
905,0.81114
906,0.8046399999999999
907,0.8046399999999999
908,0.8046399999999999
909,0.8046399999999999
910,0.8046399999999999
911,0.8046399999999999
912,0.8076
913,0.8289
914,0.85516
915,0.85955
916,0.83231
917,0.80506
918,0.77782
919,0.75057
920,0.70702
921,0.65437
922,0.59988
923,0.5454
924,0.49091
925,0.45501
926,0.42621000000000003
927,0.39896
928,0.37172
929,0.34043
930,0.29765
931,0.24316999999999997
932,0.19964
933,0.16867000000000001
934,0.1469
935,0.13632
936,0.13469
937,0.12653
938,0.48855
939,0.39354
940,0.46301000000000003
941,0.11895
942,0.12397999999999999
943,0.47578000000000004
944,0.33956
