time,value
0,-0.21418
1,-0.028914
2,-0.021215
3,0.15056
4,-0.10178
5,0.17959
6,-0.27105999999999997
7,0.14253
8,1.4778
9,1.4778
10,1.4778
11,1.4778
12,1.4778
13,1.4778
14,1.4778
15,1.4778
16,1.4778
17,1.4778
18,1.4778
19,-1.5258
20,-1.5258
21,-1.5258
22,-1.5258
23,-1.5258
24,-1.5258
25,-1.5258
26,-1.5258
27,-1.5258
28,-1.5258
29,0.037688
30,0.45009
31,-0.23615
32,-0.036636
33,0.37689
34,0.099682
35,-0.41663999999999995
36,0.0093799
37,-0.067248
38,-0.077705
39,-0.19359
40,0.65031
41,-0.48243
42,0.33399999999999996
43,-0.47522
44,0.076896
45,-0.47891999999999996
46,0.21696
47,0.23013000000000003
48,0.22311
49,0.11592000000000001
50,-0.088545
51,0.28311
52,0.39607
53,-0.11432
54,-0.11988
55,0.53972
56,0.15971
57,0.11145999999999999
58,0.51152
59,-0.23758
60,0.068202
61,-0.067594
62,0.0050596
63,0.36068
64,-0.35595
65,-0.28683000000000003
66,0.10912999999999999
67,0.066231
68,-0.06336900000000001
69,-0.15997
70,-0.3919
71,-0.35698
72,0.32468
73,0.4435
74,-0.027262
75,-0.099972
76,-0.54874
77,0.5111100000000001
78,0.65213
79,-0.004749300000000001
80,-0.69671
81,0.64493
82,-0.11589
83,-0.03281
84,-0.11549000000000001
85,0.51341
86,-0.23010999999999998
87,0.17898
88,-0.07768
89,-0.17632
90,-0.7297399999999999
91,-0.41956000000000004
92,0.028735000000000004
93,-0.089197
94,-0.5655399999999999
95,-1.5258
96,-1.5258
97,-1.5258
98,-1.5258
99,-1.5258
100,-1.5258
101,-1.5258
102,-1.5258
103,-1.5258
104,-1.5258
105,-1.5258
106,-1.5258
107,-1.5258
108,-1.5258
109,-1.5258
110,-1.5258
111,1.4778
112,1.4778
113,1.4778
114,1.4778
115,1.4778
116,1.4778
117,1.4778
118,1.4778
119,1.4778
120,1.4778
121,1.4778
122,1.4778
123,1.4778
124,1.4778
125,1.4778
126,1.4778
127,-0.15683
