time,value
0,1.2243
1,1.0798
2,0.92024
3,0.9699700000000001
4,0.80218
5,0.9017299999999999
6,0.99131
7,0.8695
8,0.87013
9,0.85845
10,0.99946
11,0.93634
12,0.77507
13,0.73351
14,0.64351
15,0.7529399999999999
16,0.82847
17,0.69193
18,0.52364
19,0.48958
20,0.52335
21,0.6541600000000001
22,0.55409
23,0.37681
24,0.36438000000000004
25,0.23246999999999998
26,0.15792
27,0.27779
28,0.15465
29,-0.01521
30,-0.25156999999999996
31,-0.33660999999999996
32,-0.55688
33,-0.36672
34,-0.43946999999999997
35,-0.6177
36,-0.81693
37,-0.9515399999999999
38,-0.82891
39,-0.85272
40,-0.9909399999999999
41,-1.1529
42,-1.235
43,-1.3819
44,-1.5376
45,-1.6915
46,-1.8107
47,-1.8097
48,-1.5831
49,-1.3408
50,-1.1283
51,-0.9083
52,-0.6620199999999999
53,-0.44375
54,-0.22214
55,0.0021878
56,0.25795
57,0.49028
58,0.7267399999999999
59,0.9699700000000001
60,1.25
61,1.5073
62,1.7693
63,2.0352
64,2.2106
65,1.9929
66,1.7845
67,1.5834
68,1.4097
69,1.1677
70,0.9094200000000001
71,0.6603899999999999
72,0.38777
73,0.15052000000000001
74,-0.080448
75,-0.30975
76,-0.56538
77,-0.79109
78,-1.0153
79,-1.2682
80,-1.4918
81,-1.7175
82,-1.9207
83,-1.838
84,-1.7246
85,-1.6688
86,-1.6141
87,-1.5683
88,-1.528
89,-1.4177
90,-1.3065
91,-1.1985
92,-1.2979
93,-1.1524
94,-0.9507700000000001
95,-0.73454
96,-0.73454
97,-0.74329
98,-0.5286
99,-0.33860999999999997
100,-0.33059
101,-0.10995999999999999
102,0.016339
103,-0.10329
104,-0.11699000000000001
105,0.017016999999999997
106,0.19877
107,0.25255
108,0.08526900000000001
109,0.23246999999999998
110,0.13809000000000002
111,0.23726
112,0.32756
113,0.50839
114,0.49875
115,0.37681
116,0.5415
117,0.6809999999999999
118,0.6603899999999999
119,0.69307
120,0.78483
121,0.69621
122,0.79801
123,0.8177
124,0.85626
125,0.96105
126,1.099
127,1.1971
