time,value
0,-0.7420899999999999
1,-0.72682
2,-0.70498
3,-0.67793
4,-0.64684
5,-0.6107899999999999
6,-0.56902
7,-0.52284
8,-0.47123000000000004
9,-0.41433000000000003
10,-0.35428000000000004
11,-0.29324
12,-0.23218000000000003
13,-0.17259000000000002
14,-0.11721
15,-0.066211
16,-0.019599000000000002
17,0.02223
18,0.059627
19,0.093362
20,0.12326
21,0.14783
22,0.1659
23,0.17624
24,0.17818
25,0.17271
26,0.16249
27,0.15108
28,0.1422
29,0.13946
30,0.14537
31,0.16093
32,0.18609
33,0.21974000000000002
34,0.25984
35,0.30366
36,0.34831999999999996
37,0.39071999999999996
38,0.42763999999999996
39,0.45663000000000004
40,0.47575
41,0.48358
42,0.47948999999999997
43,0.46352
44,0.4356
45,0.39526
46,0.34337
47,0.28042
48,0.20722
49,0.12625
50,0.040714
51,-0.046462
52,-0.13285999999999998
53,-0.2146
54,-0.2898
55,-0.35775
56,-0.41663999999999995
57,-0.46531000000000006
58,-0.50412
59,-0.5343899999999999
60,-0.55602
61,-0.5711
62,-0.58304
63,-0.5928
64,-0.60105
65,-0.60878
66,-0.61657
67,-0.6220899999999999
68,-0.62465
69,-0.62588
70,-0.62459
71,-0.62057
72,-0.61557
73,-0.6117600000000001
74,-0.6070399999999999
75,-0.6012
76,-0.5978600000000001
77,-0.5943
78,-0.58895
79,-0.58343
80,-0.57987
81,-0.5746600000000001
82,-0.56655
83,-0.56033
84,-0.55169
85,-0.53832
86,-0.52235
87,-0.50659
88,-0.48765
89,-0.46418000000000004
90,-0.44233
91,-0.4168
92,-0.3848
93,-0.34845
94,-0.31039
95,-0.26805
96,-0.22050999999999998
97,-0.17188
98,-0.11642000000000001
99,-0.049551
100,0.029573000000000002
101,0.12155
102,0.22864
103,0.35111
104,0.48681
105,0.63776
106,0.8047300000000001
107,0.98582
108,1.1779
109,1.3766
110,1.5759999999999998
111,1.7698
112,1.9549
113,2.1298
114,2.2942
115,2.4498
116,2.5989999999999998
117,2.7439
118,2.8852
119,3.0235
120,3.1563
121,3.2779
122,3.3819
123,3.4607
124,3.5077
125,3.5187
126,3.4932
127,3.432
128,3.3359
129,3.2065
130,3.0436
131,2.8456
132,2.6126
133,2.3478
134,2.0573
135,1.7505
136,1.4418
137,1.1447
138,0.8706799999999999
139,0.62938
140,0.42615
141,0.26098000000000005
142,0.12984
143,0.030162
144,-0.044716000000000006
145,-0.10295
146,-0.14828
147,-0.18470999999999999
148,-0.21698
149,-0.24793
150,-0.2742
151,-0.29656
152,-0.31759
153,-0.33379000000000003
154,-0.34536999999999995
155,-0.35578000000000004
156,-0.36648000000000003
157,-0.37379
158,-0.3794
159,-0.38700999999999997
160,-0.3916
161,-0.39352
162,-0.39635
163,-0.40035
164,-0.40204
165,-0.40329
166,-0.40784000000000004
167,-0.41096000000000005
168,-0.41325
169,-0.41748999999999997
170,-0.42321000000000003
171,-0.42804
172,-0.43268
173,-0.43886000000000003
174,-0.44354
175,-0.44663
176,-0.44914
177,-0.45081000000000004
178,-0.45101
179,-0.45025
180,-0.44998
181,-0.44942
182,-0.44921000000000005
183,-0.45048999999999995
184,-0.45338999999999996
185,-0.45758999999999994
186,-0.46306
187,-0.46992
188,-0.47667
189,-0.48266000000000003
190,-0.48788000000000004
191,-0.49178
192,-0.49396
193,-0.49458
194,-0.49405
195,-0.49173
196,-0.48778999999999995
197,-0.48306000000000004
198,-0.4779
199,-0.47297
200,-0.46931999999999996
201,-0.46774
202,-0.46768999999999994
203,-0.46876
204,-0.47065
205,-0.47216
206,-0.47266
207,-0.47226999999999997
208,-0.47135
209,-0.46991000000000005
210,-0.46848
211,-0.46778000000000003
212,-0.46748
213,-0.46742
214,-0.46768999999999994
215,-0.46818999999999994
216,-0.46856000000000003
217,-0.46905
218,-0.47042
219,-0.47247
220,-0.47536000000000006
221,-0.47936999999999996
222,-0.48432
223,-0.48966000000000004
224,-0.49532
225,-0.50167
226,-0.5082399999999999
227,-0.5150600000000001
228,-0.52218
229,-0.52905
230,-0.53505
231,-0.53993
232,-0.54384
233,-0.54672
234,-0.5492199999999999
235,-0.55214
236,-0.5556
237,-0.5595899999999999
238,-0.56409
239,-0.56884
240,-0.57318
241,-0.57701
242,-0.58049
243,-0.58329
244,-0.5853
245,-0.58654
246,-0.58682
247,-0.5857600000000001
248,-0.5836
249,-0.58107
250,-0.57855
251,-0.57681
252,-0.5766399999999999
253,-0.57823
254,-0.58139
255,-0.58621
256,-0.5930300000000001
257,-0.6017100000000001
258,-0.61238
259,-0.62495
260,-0.63863
261,-0.6523399999999999
262,-0.66559
263,-0.6786
264,-0.6915399999999999
265,-0.705
266,-0.71902
267,-0.73248
268,-0.74361
269,-0.7509999999999999
