time,value
0,0.13085
1,-0.30291999999999997
2,-0.26494
3,0.061571
4,-0.08105599999999999
5,0.30741
6,-0.27118000000000003
7,0.31538
8,0.38616999999999996
9,0.13145
10,0.9728100000000001
11,-0.28164
12,0.51685
13,0.051167000000000004
14,-0.15874000000000002
15,-0.52461
16,0.43809
17,0.047332
18,0.22635999999999998
19,-0.26498
20,-0.6440100000000001
21,-0.45747
22,-0.15317999999999998
23,-0.2687
24,0.23615
25,0.012156
26,0.46108999999999994
27,-0.3883
28,0.17244
29,-0.49683
30,0.41391000000000006
31,0.12239000000000001
32,0.34731
33,-0.30488000000000004
34,-0.38209
35,-0.14432999999999999
36,-0.6008
37,0.21338000000000001
38,0.6486
39,-0.27662
40,-0.52048
41,-0.32284
42,0.5098199999999999
43,0.5191
44,0.023591
45,-0.50432
46,0.34458
47,0.10478
48,-0.20398
49,-0.24299
50,-0.45411999999999997
51,-0.49666000000000005
52,-0.0050372
53,0.16496
54,0.39613000000000004
55,-0.09431
56,0.2377
57,0.47789
58,0.1319
59,-0.054465999999999994
60,0.67956
61,-0.085162
62,-0.19799
63,-0.57057
64,0.090559
65,0.27889
66,-0.21598
67,-0.13351
68,-0.41666000000000003
69,0.35036
70,0.31482
71,0.8220799999999999
72,-0.40556
73,-0.31377
74,-0.30501999999999996
75,0.75275
76,0.028035
77,0.86111
78,-0.76084
79,0.11348
80,0.5188699999999999
81,-0.41101000000000004
82,0.084928
83,0.037154
84,-0.19621
85,-0.0062081
86,-1.8003
87,-1.8003
88,-1.8003
89,-1.8003
90,-1.8003
91,-1.8003
92,-1.8003
93,-1.8003
94,-1.8003
95,-1.8003
96,1.7464
97,1.7464
98,1.7464
99,1.7464
100,1.7464
101,1.7464
102,1.7464
103,1.7464
104,1.7464
105,1.7464
106,-0.8093899999999999
107,1.7464
108,1.7464
109,1.7464
110,1.7464
111,1.7464
112,1.7464
113,1.7464
114,1.7464
115,-1.8003
116,-1.8003
117,-1.8003
118,-1.8003
119,-1.8003
120,-1.8003
121,-1.8003
122,-1.8003
123,0.5261899999999999
124,-0.22077
125,0.39835
126,-0.045582
127,0.25101999999999997
