time,value
0,-0.030402
1,0.011182
2,-0.030032999999999997
3,-0.39776
4,0.81381
5,0.3422
6,0.093726
7,0.08200299999999999
8,0.6614399999999999
9,-0.1508
10,0.44146
11,-0.017344
12,0.45507
13,0.2341
14,-0.8188300000000001
15,-1.7282
16,-1.7282
17,-1.7282
18,-1.7282
19,-1.7282
20,-1.7282
21,-1.7282
22,-1.7282
23,-1.7282
24,1.8079
25,1.8079
26,1.8079
27,1.8079
28,1.8079
29,1.8079
30,1.8079
31,1.8079
32,0.45366000000000006
33,0.2004
34,0.2801
35,0.3875
36,-1.7282
37,-1.7282
38,-1.7282
39,-1.7282
40,-1.7282
41,-1.7282
42,-1.7282
43,-1.7282
44,-1.7282
45,-1.7282
46,1.8079
47,1.8079
48,1.8079
49,1.8079
50,1.8079
51,1.8079
52,1.8079
53,1.8079
54,1.8079
55,1.8079
56,-0.2163
57,-0.184
58,0.072483
59,0.2541
60,0.2041
61,-0.18899999999999997
62,-0.0086087
63,-0.23859
64,-0.10390999999999999
65,-0.010103000000000001
66,-0.11955999999999999
67,-0.54359
68,0.20794
69,-0.19762000000000002
70,0.11734000000000001
71,-0.20938
72,0.32048000000000004
73,0.22751999999999997
74,0.078609
75,-0.33574
76,0.69853
77,0.28118000000000004
78,-0.27893
79,-0.60795
80,0.037094
81,0.39928
82,-0.21875
83,0.37515
84,-0.48754
85,0.5011
86,-0.11020999999999999
87,-0.50717
88,0.12855
89,-0.0084156
90,0.032094
91,0.27075
92,0.33203
93,0.0058087
94,-0.11227000000000001
95,0.1801
96,-0.82045
97,-0.18556
98,0.45686000000000004
99,0.10303
100,-0.065419
101,0.12722999999999998
102,-0.41513999999999995
103,0.5554600000000001
104,0.43723999999999996
105,-0.25593
106,-0.42598
107,-0.16864
108,-0.41631999999999997
109,-0.09324400000000001
110,0.3495
111,-0.38456
112,-0.46183
113,-0.39694
114,0.51683
115,-0.099312
116,0.43488999999999994
117,-0.32656999999999997
118,0.023631
119,0.44165
120,0.5108
121,-0.44743999999999995
122,-0.057986
123,-0.2406
124,0.15809
125,-0.75913
126,-0.58399
127,-0.26452
