time,value
0,1.8014
1,1.68
2,1.5633
3,1.4247
4,1.2887
5,1.1786
6,1.0483
7,0.91907
8,0.81296
9,0.6862199999999999
10,0.56307
11,0.43896999999999997
12,0.33726
13,0.21875
14,0.099327
15,-0.0015635
16,-0.11765
17,-0.22533000000000003
18,-0.32122
19,-0.42823999999999995
20,-0.53084
21,-0.6090800000000001
22,-0.7114199999999999
23,-0.7966300000000001
24,-0.8696
25,-0.9523799999999999
26,-1.0416
27,-1.092
28,-1.1616
29,-1.1977
30,-1.2362
31,-1.2542
32,-1.2575
33,-1.2409
34,-1.2125
35,-1.1629
36,-1.1166
37,-1.053
38,-0.9677899999999999
39,-0.8889299999999999
40,-0.80597
41,-0.71394
42,-0.61612
43,-0.52271
44,-0.42671000000000003
45,-0.32553000000000004
46,-0.20579
47,-0.11205
48,0.0036086
49,0.11534000000000001
50,0.21366
51,0.3293
52,0.44686000000000003
53,0.54501
54,0.66288
55,0.78523
56,0.88741
57,1.0104
58,1.1343
59,1.2392
60,1.3676
61,1.4957
62,1.6022
63,1.7303
64,1.7751
65,1.6479
66,1.5412
67,1.4132
68,1.2844
69,1.1797
70,1.0559
71,0.93185
72,0.8277
73,0.7027
74,0.57818
75,0.47531
76,0.35189000000000004
77,0.22918000000000002
78,0.12824000000000002
79,0.0072324
80,-0.11263
81,-0.21609
82,-0.3397
83,-0.45624
84,-0.57775
85,-0.67811
86,-0.7971699999999999
87,-0.9142899999999999
88,-1.0197
89,-1.1216
90,-1.2286
91,-1.3127
92,-1.405
93,-1.5015
94,-1.554
95,-1.5925
96,-1.5983
97,-1.5566
98,-1.5059
99,-1.433
100,-1.33
101,-1.2629
102,-1.1579
103,-1.0476
104,-0.9527899999999999
105,-0.8447899999999999
106,-0.7328899999999999
107,-0.63188
108,-0.50966
109,-0.39211999999999997
110,-0.29368
111,-0.16875
112,-0.043416
113,0.061278
114,0.18342999999999998
115,0.30974
116,0.41194
117,0.54178
118,0.66855
119,0.79543
120,0.90125
121,1.031
122,1.1608
123,1.2695
124,1.4022
125,1.5352
126,1.6505
127,1.7839
