time,value
0,-0.03829
1,-0.03829
2,-0.03829
3,-0.03829
4,-0.03829
5,-0.03829
6,-0.03829
7,-0.03829
8,-0.03829
9,-0.03829
10,-0.03829
11,-0.03829
12,-0.03829
13,-0.03829
14,-0.03829
15,-0.03829
16,-0.03829
17,-0.03829
18,-0.03829
19,-0.03829
20,-0.03829
21,-0.03829
22,-0.03829
23,-0.03829
24,-0.03829
25,-0.03829
26,-0.03829
27,-0.03829
28,-0.03829
29,-0.03829
30,-0.03829
31,-0.03829
32,-0.03829
33,-0.03829
34,-0.03829
35,-0.03829
36,-0.03829
37,-0.03829
38,-0.03829
39,-0.03829
40,-0.03829
41,-0.03829
42,-0.03829
43,-0.03829
44,-0.03829
45,-0.03829
46,-0.03829
47,-0.03829
48,-0.03829
49,-0.03829
50,-0.03829
51,-0.03829
52,-0.03829
53,-0.03829
54,-0.03829
55,-0.03829
56,-0.03829
57,-0.03829
58,-0.03829
59,-0.03829
60,-0.03829
61,-0.03829
62,-0.03829
63,-0.03829
64,-0.03829
65,-0.03829
66,-0.03829
67,-0.03829
68,-0.03829
69,-0.03829
70,-0.03829
71,-0.03829
72,-0.03829
73,-0.03829
74,-0.03829
75,-0.03829
76,-0.03829
77,-0.03829
78,-0.03829
79,-0.03829
80,-0.03829
81,-0.03829
82,-0.03829
83,-0.03829
84,-0.03829
85,-0.03829
86,-0.03829
87,-0.03829
88,-0.03829
89,-0.03829
90,-0.03829
91,-0.03829
92,-0.03829
93,-0.03829
94,-0.03829
95,-0.03829
96,-0.03829
97,-0.03829
98,-0.03829
99,-0.03829
100,-0.03829
101,-0.03829
102,-0.03829
103,-0.03829
104,-0.03829
105,-0.03829
106,-0.03829
107,-0.03829
108,-0.03829
109,-0.03829
110,-0.03829
111,-0.03829
112,-0.03829
113,-0.03829
114,-0.03829
115,-0.03829
116,-0.03829
117,-0.03829
118,-0.03829
119,-0.03829
120,-0.03829
121,-0.03829
122,-0.03829
123,-0.03829
124,-0.03829
125,-0.03829
126,-0.03829
127,-0.03829
128,-0.03829
129,-0.03829
130,-0.03829
131,-0.03829
132,-0.03829
133,-0.03829
134,-0.03829
135,-0.03829
136,-0.03829
137,-0.03829
138,-0.03829
139,-0.03829
140,-0.03829
141,-0.03829
142,-0.03829
143,-0.03829
144,-0.03829
145,-0.03829
146,-0.03829
147,-0.03829
148,-0.03829
149,-0.03829
150,-0.03829
151,-0.03829
152,-0.03829
153,-0.03829
154,-0.03829
155,-0.03829
156,-0.03829
157,-0.03829
158,-0.03829
159,-0.03829
160,-0.03829
161,-0.03829
162,-0.03829
163,-0.03829
164,-0.03829
165,-0.03829
166,-0.03829
167,-0.03829
168,-0.03829
169,-0.03829
170,-0.03829
171,-0.03829
172,-0.03829
173,-0.03829
174,-0.03829
175,-0.03829
176,-0.03829
177,-0.03829
178,-0.03829
179,-0.03829
180,-0.03829
181,-0.03829
182,-0.03829
183,-0.03829
184,-0.03829
185,-0.03829
186,-0.03829
187,-0.03829
188,-0.03829
189,-0.03829
190,-0.03829
191,-0.03829
192,-0.03829
193,-0.03829
194,-0.03829
195,-0.03829
196,-0.03829
197,-0.03829
198,-0.03829
199,-0.03829
200,-0.03829
201,-0.03829
202,-0.03829
203,-0.03829
204,-0.03829
205,-0.03829
206,-0.03829
207,-0.03829
208,-0.03829
209,-0.03829
210,-0.03829
211,-0.03829
212,-0.03829
213,-0.03829
214,-0.03829
215,-0.03829
216,-0.03829
217,-0.03829
218,-0.03829
219,-0.03829
220,-0.03829
221,-0.03829
222,-0.03829
223,-0.03829
224,-0.03829
225,-0.03829
226,-0.03829
227,-0.03829
228,-0.03829
229,-0.03829
230,-0.03829
231,-0.03829
232,-0.03829
233,-0.03829
234,-0.03829
235,-0.03829
236,-0.03829
237,-0.03829
238,-0.03829
239,-0.03829
240,-0.03829
241,-0.03829
242,-0.03829
243,-0.03829
244,-0.03829
245,-0.03829
246,-0.03829
247,-0.03829
248,-0.03829
249,-0.03829
250,-0.03829
251,-0.03829
252,-0.03829
253,-0.03829
254,-0.03829
255,-0.03829
256,-0.03829
257,-0.03829
258,-0.03829
259,-0.03829
260,-0.03829
261,-0.03829
262,-0.03829
263,-0.03829
264,-0.03829
265,-0.03829
266,-0.03829
267,-0.03829
268,-0.03829
269,-0.03829
270,-0.03829
271,-0.03829
272,-0.03829
273,-0.03829
274,-0.03829
275,-0.03829
276,-0.03829
277,-0.03829
278,-0.03829
279,-0.03829
280,-0.03829
281,-0.03829
282,-0.03829
283,-0.03829
284,-0.03829
285,-0.03829
286,-0.03829
287,-0.03829
288,-0.03829
289,-0.03829
290,-0.03829
291,-0.03829
292,-0.03829
293,-0.03829
294,-0.03829
295,-0.03829
296,-0.03829
297,-0.03829
298,-0.03829
299,-0.03829
300,-0.03829
301,-0.03829
302,-0.03829
303,-0.03829
304,-0.03829
305,-0.03829
306,-0.03829
307,-0.03829
308,-0.03829
309,-0.03829
310,-0.03829
311,-0.03829
312,-0.03829
313,-0.03829
314,-0.03829
315,-0.03829
316,-0.03829
317,-0.03829
318,-0.03829
319,-0.03829
320,-0.03829
321,-0.03829
322,-0.03829
323,-0.03829
324,-0.03829
325,-0.03829
326,-0.03829
327,-0.03829
328,-0.03829
329,-0.03829
330,-0.03829
331,-0.03829
332,-0.03829
333,-0.03829
334,-0.03829
335,-0.03829
336,-0.03829
337,-0.03829
338,-0.03829
339,-0.03829
340,-0.03829
341,-0.03829
342,-0.03829
343,-0.03829
344,-0.03829
345,-0.03829
346,-0.03829
347,-0.03829
348,-0.03829
349,-0.03829
350,-0.03829
351,-0.03829
352,-0.03829
353,-0.03829
354,-0.03829
355,-0.03829
356,-0.03829
357,-0.03829
358,-0.03829
359,-0.03829
360,-0.03829
361,-0.03829
362,-0.03829
363,-0.03829
364,-0.03829
365,-0.03829
366,-0.03829
367,-0.03829
368,-0.03829
369,-0.03829
370,-0.03829
371,-0.03829
372,-0.03829
373,-0.03829
374,-0.03829
375,-0.03829
376,-0.03829
377,-0.03829
378,-0.03829
379,-0.03829
380,-0.03829
381,-0.03829
382,-0.03829
383,-0.03829
384,-0.03829
385,-0.03829
386,-0.03829
387,-0.03829
388,-0.03829
389,-0.03829
390,-0.03829
391,-0.03829
392,-0.03829
393,-0.03829
394,-0.03829
395,-0.03829
396,-0.03829
397,-0.03829
398,-0.03829
399,-0.03829
400,-0.03829
401,-0.03829
402,-0.03829
403,-0.03829
404,-0.03829
405,-0.03829
406,-0.03829
407,-0.03829
408,-0.03829
409,-0.03829
410,-0.03829
411,-0.03829
412,-0.03829
413,-0.03829
414,-0.03829
415,-0.03829
416,-0.03829
417,-0.03829
418,-0.03829
419,-0.03829
420,-0.03829
421,-0.03829
422,-0.03829
423,-0.03829
424,-0.03829
425,-0.03829
426,-0.03829
427,-0.03829
428,-0.03829
429,-0.03829
430,-0.03829
431,-0.03829
432,-0.03829
433,-0.03829
434,-0.03829
435,-0.03829
436,-0.03829
437,-0.03829
438,-0.03829
439,-0.03829
440,-0.03829
441,-0.03829
442,-0.03829
443,-0.03829
444,-0.03829
445,-0.03829
446,-0.03829
447,-0.03829
448,-0.03829
449,-0.03829
450,-0.03829
451,-0.03829
452,-0.03829
453,-0.03829
454,-0.03829
455,-0.03829
456,-0.03829
457,-0.03829
458,-0.03829
459,-0.03829
460,-0.03829
461,-0.03829
462,-0.03829
463,-0.03829
464,-0.03829
465,-0.03829
466,-0.03829
467,-0.03829
468,-0.03829
469,-0.03829
470,-0.03829
471,-0.03829
472,-0.03829
473,-0.03829
474,-0.03829
475,-0.03829
476,-0.03829
477,-0.03829
478,-0.03829
479,-0.03829
480,-0.03829
481,-0.03829
482,-0.03829
483,-0.03829
484,-0.03829
485,-0.03829
486,-0.03829
487,-0.03829
488,-0.03829
489,-0.03829
490,-0.03829
491,-0.03829
492,-0.03829
493,-0.03829
494,-0.03829
495,-0.03829
496,-0.03829
497,-0.03829
498,-0.03829
499,-0.03829
500,-0.03829
501,-0.03829
502,-0.03829
503,-0.03829
504,-0.03829
505,-0.03829
506,-0.03829
507,-0.03829
508,-0.03829
509,-0.03829
510,-0.03829
511,-0.03829
512,-0.03829
513,-0.03829
514,-0.03829
515,-0.03829
516,-0.03829
517,-0.03829
518,-0.03829
519,-0.03829
520,-0.03829
521,-0.03829
522,-0.03829
523,-0.03829
524,-0.03829
525,-0.03829
526,-0.03829
527,-0.03829
528,-0.03829
529,-0.03829
530,-0.03829
531,-0.03829
532,-0.03829
533,-0.03829
534,-0.03829
535,-0.03829
536,-0.03829
537,-0.03829
538,-0.03829
539,-0.03829
540,26.785
541,0.70681
542,-0.03829
543,-0.03829
544,-0.03829
545,-0.03829
546,-0.03829
547,-0.03829
548,-0.03829
549,-0.03829
550,-0.03829
551,-0.03829
552,-0.03829
553,-0.03829
554,-0.03829
555,-0.03829
556,-0.03829
557,-0.03829
558,-0.03829
559,-0.03829
560,-0.03829
561,-0.03829
562,-0.03829
563,-0.03829
564,-0.03829
565,-0.03829
566,-0.03829
567,-0.03829
568,-0.03829
569,-0.03829
570,-0.03829
571,-0.03829
572,-0.03829
573,-0.03829
574,-0.03829
575,-0.03829
576,-0.03829
577,-0.03829
578,-0.03829
579,-0.03829
580,-0.03829
581,-0.03829
582,-0.03829
583,-0.03829
584,-0.03829
585,-0.03829
586,-0.03829
587,-0.03829
588,-0.03829
589,-0.03829
590,-0.03829
591,-0.03829
592,-0.03829
593,-0.03829
594,-0.03829
595,-0.03829
596,-0.03829
597,-0.03829
598,-0.03829
599,-0.03829
600,-0.03829
601,-0.03829
602,-0.03829
603,-0.03829
604,-0.03829
605,-0.03829
606,-0.03829
607,-0.03829
608,-0.03829
609,-0.03829
610,-0.03829
611,-0.03829
612,-0.03829
613,-0.03829
614,-0.03829
615,-0.03829
616,-0.03829
617,-0.03829
618,-0.03829
619,-0.03829
620,-0.03829
621,-0.03829
622,-0.03829
623,-0.03829
624,-0.03829
625,-0.03829
626,-0.03829
627,-0.03829
628,-0.03829
629,-0.03829
630,-0.03829
631,-0.03829
632,-0.03829
633,-0.03829
634,-0.03829
635,-0.03829
636,-0.03829
637,-0.03829
638,-0.03829
639,-0.03829
640,-0.03829
641,-0.03829
642,-0.03829
643,-0.03829
644,-0.03829
645,-0.03829
646,-0.03829
647,-0.03829
648,-0.03829
649,-0.03829
650,-0.03829
651,-0.03829
652,-0.03829
653,-0.03829
654,-0.03829
655,-0.03829
656,-0.03829
657,-0.03829
658,-0.03829
659,-0.03829
660,-0.03829
661,-0.03829
662,-0.03829
663,-0.03829
664,-0.03829
665,-0.03829
666,-0.03829
667,-0.03829
668,-0.03829
669,-0.03829
670,-0.03829
671,-0.03829
672,-0.03829
673,-0.03829
674,-0.03829
675,-0.03829
676,-0.03829
677,-0.03829
678,-0.03829
679,-0.03829
680,-0.03829
681,-0.03829
682,-0.03829
683,-0.03829
684,-0.03829
685,-0.03829
686,-0.03829
687,-0.03829
688,-0.03829
689,-0.03829
690,-0.03829
691,-0.03829
692,-0.03829
693,-0.03829
694,-0.03829
695,-0.03829
696,-0.03829
697,-0.03829
698,-0.03829
699,-0.03829
700,-0.03829
701,-0.03829
702,-0.03829
703,-0.03829
704,-0.03829
705,-0.03829
706,-0.03829
707,-0.03829
708,-0.03829
709,-0.03829
710,-0.03829
711,-0.03829
712,-0.03829
713,-0.03829
714,-0.03829
715,-0.03829
716,-0.03829
717,-0.03829
718,-0.03829
719,-0.03829
