time,value
0,1.8613
1,1.7491
2,1.5304
3,1.3730000000000002
4,1.2161
5,1.061
6,0.96726
7,0.8209799999999999
8,0.74465
9,0.61897
10,0.45171000000000006
11,0.32973
12,0.37805
13,0.21983000000000003
14,0.13955
15,0.0013514000000000002
16,-0.081471
17,-0.082749
18,-0.14601
19,-0.23779
20,-0.35147
21,-0.41928999999999994
22,-0.47902
23,-0.51627
24,-0.5989399999999999
25,-0.62862
26,-0.76436
27,-0.7730600000000001
28,-0.88502
29,-0.97215
30,-1.0055
31,-1.1221
32,-1.1740000000000002
33,-1.2636
34,-1.327
35,-1.3818
36,-1.3717
37,-1.4101
38,-1.405
39,-1.3811
40,-1.3638
41,-1.3019999999999998
42,-1.2286
43,-1.0994
44,-0.96093
45,-0.7578600000000001
46,-0.59436
47,-0.44178
48,-0.22751
49,-0.074664
50,0.13955
51,0.30286
52,0.50674
53,0.66993
54,0.8841600000000001
55,1.0475
56,1.2618
57,1.4252
58,1.5779
59,1.8031
60,1.9667
61,2.088
62,2.0614
63,1.8478
64,1.6858
65,1.4724
66,1.318
67,1.1046
68,0.94286
69,0.73687
70,0.57511
71,0.41358999999999996
72,0.20736
73,0.045875
74,-0.16039
75,-0.32183
76,-0.5281399999999999
77,-0.68952
78,-0.9021899999999999
79,-1.0671
80,-1.176
81,-1.218
82,-1.2474
83,-1.2992
84,-1.2965
85,-1.3019999999999998
86,-1.3096
87,-1.2657
88,-1.234
89,-1.1766
90,-1.1342
91,-1.0919
92,-1.0352
93,-0.92064
94,-0.8192200000000001
95,-0.8443200000000001
96,-0.70644
97,-0.70803
98,-0.54006
99,-0.4693
100,-0.38001
101,-0.34218000000000004
102,-0.32875
103,-0.32045
104,-0.25621
105,-0.25081
106,-0.12565
107,-0.05264099999999999
108,0.00010592
109,0.13357
110,0.12718
111,0.12958
112,0.21243
113,0.31083
114,0.40731999999999996
115,0.5250199999999999
116,0.5368
117,0.55778
118,0.6836800000000001
119,0.80935
120,0.83852
121,0.9579700000000001
122,1.0701
123,1.2003
124,1.3345
125,1.4801
126,1.6715
127,1.8146
