time,value
0,-0.7661600000000001
1,-0.7661600000000001
2,-0.7661600000000001
3,-0.7661600000000001
4,-0.7661600000000001
5,-0.7661600000000001
6,-0.7661600000000001
7,-0.7661600000000001
8,-0.7661600000000001
9,-0.7661600000000001
10,-0.7661600000000001
11,-0.7661600000000001
12,-0.7661600000000001
13,-0.7661600000000001
14,-0.7661600000000001
15,-0.7661600000000001
16,-0.7661600000000001
17,-0.7661600000000001
18,-0.7661600000000001
19,-0.7661600000000001
20,-0.7661600000000001
21,-0.7661600000000001
22,-0.7661600000000001
23,-0.7661600000000001
24,-0.7661600000000001
25,-0.7661600000000001
26,-0.7661600000000001
27,-0.7661600000000001
28,-0.7661600000000001
29,-0.7661600000000001
30,-0.7661600000000001
31,-0.7661600000000001
32,-0.7661600000000001
33,-0.7661600000000001
34,-0.7661600000000001
35,-0.7661600000000001
36,-0.7661600000000001
37,-0.7661600000000001
38,-0.7661600000000001
39,-0.7661600000000001
40,-0.7661600000000001
41,-0.7661600000000001
42,-0.7661600000000001
43,-0.7661600000000001
44,-0.7661600000000001
45,-0.7661600000000001
46,-0.7661600000000001
47,-0.7661600000000001
48,-0.7661600000000001
49,-0.7661600000000001
50,-0.7661600000000001
51,-0.7661600000000001
52,-0.7661600000000001
53,-0.7661600000000001
54,-0.7661600000000001
55,-0.7661600000000001
56,-0.7661600000000001
57,-0.7661600000000001
58,-0.7661600000000001
59,-0.7661600000000001
60,-0.75674
61,-0.68196
62,-0.65533
63,-0.56958
64,-0.575
65,-0.5723
66,-0.56347
67,-0.40676
68,-0.53259
69,-0.44811000000000006
70,-0.53876
71,-0.53396
72,-0.4133
73,-0.43076000000000003
74,-0.34875
75,-0.47908
76,-0.59917
77,-0.48155
78,-0.56804
79,-0.54611
80,-0.52822
81,-0.55938
82,-0.64395
83,-0.51152
84,-0.5040600000000001
85,-0.61717
86,-0.29906
87,-0.50902
88,-0.5092
89,-0.6473899999999999
90,-0.5647300000000001
91,-0.61068
92,-0.65162
93,-0.56297
94,-0.55433
95,-0.62478
96,-0.48805
97,-0.5778300000000001
98,-0.5682
99,-0.60009
100,-0.6170800000000001
101,-0.62136
102,-0.61944
103,-0.5752
104,-0.53801
105,-0.51636
106,-0.42317
107,-0.4397
108,-0.51673
109,-0.5672699999999999
110,-0.51863
111,-0.49087
112,-0.42415
113,-0.18450999999999998
114,-0.5052
115,-0.62385
116,-0.5776899999999999
117,-0.6020399999999999
118,-0.62884
119,-0.60432
120,-0.26138
121,-0.46873000000000004
122,-0.5122
123,-0.48302
124,-0.54227
125,0.30365
126,2.2021
127,3.04
128,1.1896
129,1.2945
130,2.2786
131,1.7663
132,2.5442
133,4.325
134,2.7433
135,2.476
136,5.129
137,3.0126
138,4.273
139,3.2763
140,3.7552
141,4.6134
142,5.193
143,4.6208
144,1.7542
145,2.504
146,2.221
147,2.3274
148,1.6773
149,1.3319999999999999
150,1.6019999999999999
151,1.8148
152,1.7408
153,0.89649
154,1.6021
155,1.3652
156,0.74655
157,1.1523
158,0.9567399999999999
159,0.69796
160,0.7339399999999999
161,0.50031
162,0.63866
163,0.28452
164,0.4999
165,0.32724000000000003
166,0.6147100000000001
167,0.40358
168,0.51243
169,0.10380999999999999
170,0.31201999999999996
171,0.4752
172,0.19671
173,0.0055608
174,0.13424
175,0.035748
176,0.21481999999999998
177,-0.17645999999999998
178,-0.051107
179,-0.0037398
180,-0.046994
181,-0.10745
182,0.16706
183,0.25851
184,-0.083475
185,-0.060752999999999995
186,-0.10074
187,0.16388
188,0.49083000000000004
189,0.021936
190,-0.13710999999999998
191,0.041221
192,0.33388
193,0.015147999999999998
194,-0.02317
195,0.010471
196,0.037001
197,-0.098885
198,-0.076951
199,-0.082892
200,0.27088
201,-0.12897999999999998
202,-0.04977
203,-0.10303
204,0.21821999999999997
205,0.20593000000000003
206,-0.18930999999999998
207,-0.259
208,-0.023103
209,0.0059142
210,-0.24049
211,-0.15168
212,-0.28784
213,-0.10667
214,-0.27198
215,-0.12869
216,-0.20324
217,-0.30851
218,-0.34902
219,-0.10832
220,-0.34381999999999996
221,0.16872
222,-0.0032943000000000004
223,-0.12295999999999999
224,-0.29470999999999997
225,-0.22503
226,-0.0096545
227,0.0087995
228,-0.24727
229,-0.018609999999999998
230,-0.30023
231,-0.37875
232,-0.14859
233,0.026592
234,-0.27284
235,-0.29725
236,-0.25146
237,-0.3379
238,-0.23919
239,-0.33074000000000003
240,-0.25672
241,-0.25542
242,-0.070852
243,-0.11727
244,-0.18225
245,-0.26521999999999996
246,-0.020196000000000002
247,-0.20781999999999998
248,-0.28993
249,-0.15122
250,0.14217
251,0.10565
252,-0.043576
253,-0.18414
254,0.0063823000000000005
255,-0.087621
256,-0.024551
257,0.054562
258,-0.07130700000000001
259,0.11034000000000001
260,-0.027527999999999997
261,0.0028596
262,-0.048138
263,-0.06854199999999999
264,-0.0562
265,0.1535
266,0.088046
267,0.22005999999999998
268,0.25085999999999997
269,-0.16178
270,0.25089
271,0.014597
272,0.31943
273,-0.2542
274,0.10974
275,0.39555
276,0.017567
277,0.08734199999999999
278,0.13188
279,0.010902
280,0.0015419000000000001
281,0.10859
282,-0.16812
283,-0.07362300000000001
284,-0.048735
285,0.5140399999999999
286,0.054472
287,0.2633
288,-0.12424
289,-0.10484
290,-0.0076834
291,0.20175
292,0.34219
293,0.19657
294,-0.29334
295,-0.19177
296,0.41158999999999996
297,0.11656
298,-0.036295999999999995
299,-0.20628000000000002
300,0.18015
301,-0.28073000000000004
302,0.16321
303,-0.2504
304,0.035747
305,-0.25134
306,0.28949
307,-0.10899
308,-0.18012999999999998
309,-0.1751
310,0.14297
311,-0.10074
312,-0.15935
313,-0.14953
314,0.032041
315,-0.12821
316,-0.52969
317,-0.76583
318,-0.7661600000000001
