time,value
0,-0.7319
1,-0.7319
2,-0.7319
3,-0.7319
4,-0.7319
5,-0.7319
6,-0.7319
7,-0.7319
8,-0.7319
9,-0.7319
10,-0.7319
11,-0.7319
12,-0.7319
13,-0.7319
14,-0.7319
15,-0.7319
16,-0.7319
17,-0.7319
18,-0.7319
19,-0.7319
20,-0.7319
21,-0.7319
22,-0.7319
23,-0.7319
24,-0.7319
25,-0.7319
26,-0.7319
27,-0.7319
28,-0.7319
29,-0.7319
30,-0.7319
31,-0.7319
32,-0.7319
33,-0.7319
34,-0.7319
35,-0.7319
36,-0.7319
37,-0.7319
38,-0.7319
39,-0.7319
40,-0.7319
41,-0.7319
42,-0.7319
43,-0.7319
44,-0.7319
45,-0.7319
46,-0.7319
47,-0.7319
48,-0.7319
49,-0.7319
50,-0.7319
51,-0.7319
52,-0.7319
53,-0.7319
54,-0.7319
55,-0.7319
56,-0.7319
57,-0.7319
58,-0.7319
59,-0.7319
60,-0.7319
61,-0.7319
62,-0.7319
63,-0.7319
64,-0.7319
65,-0.7319
66,-0.7319
67,-0.7319
68,-0.7319
69,-0.7319
70,-0.7319
71,-0.7319
72,-0.7319
73,-0.7319
74,-0.7319
75,-0.7319
76,-0.7319
77,-0.7319
78,-0.7319
79,-0.7319
80,-0.7319
81,-0.7319
82,-0.7319
83,-0.7319
84,-0.7319
85,-0.7319
86,-0.7319
87,-0.7319
88,-0.7319
89,-0.7319
90,-0.7319
91,-0.7319
92,-0.7319
93,-0.7319
94,-0.7319
95,-0.7319
96,-0.7319
97,-0.7319
98,-0.7319
99,-0.7319
100,-0.7319
101,-0.7319
102,-0.7319
103,-0.7319
104,-0.7319
105,-0.7319
106,-0.7319
107,-0.7319
108,-0.7319
109,-0.7319
110,-0.7319
111,-0.7319
112,-0.7319
113,-0.7319
114,-0.7319
115,-0.7319
116,-0.7319
117,-0.7319
118,-0.7319
119,-0.7319
120,-0.7319
121,-0.7319
122,-0.7319
123,-0.7319
124,-0.7319
125,-0.7319
126,-0.7319
127,-0.7319
128,-0.7319
129,-0.7319
130,-0.7319
131,-0.7319
132,-0.7319
133,-0.7319
134,-0.7319
135,-0.7319
136,-0.7319
137,-0.7319
138,-0.7319
139,-0.7319
140,-0.7319
141,-0.7319
142,-0.7319
143,-0.7319
144,-0.7319
145,-0.7319
146,-0.7319
147,-0.7319
148,-0.7319
149,-0.7319
150,-0.7319
151,-0.7319
152,-0.7319
153,-0.7319
154,-0.7319
155,-0.7319
156,-0.7319
157,-0.7319
158,-0.7319
159,-0.7319
160,-0.7319
161,-0.7319
162,-0.7319
163,-0.7319
164,-0.7319
165,-0.7319
166,-0.7319
167,-0.7319
168,-0.7319
169,-0.7319
170,-0.7319
171,-0.7319
172,-0.7319
173,-0.7319
174,-0.7319
175,-0.7319
176,-0.7319
177,-0.7319
178,-0.7319
179,-0.7319
180,-0.7319
181,-0.7319
182,-0.7319
183,-0.7319
184,-0.7319
185,-0.7319
186,-0.7319
187,-0.7319
188,-0.7319
189,-0.7319
190,-0.7319
191,-0.7319
192,-0.7319
193,-0.7319
194,-0.7319
195,-0.7319
196,-0.7319
197,-0.7319
198,-0.7319
199,-0.7319
200,-0.7319
201,-0.7319
202,-0.7319
203,-0.7319
204,-0.7319
205,-0.7319
206,-0.7319
207,-0.7319
208,-0.7319
209,-0.7319
210,-0.7319
211,-0.7319
212,-0.7319
213,-0.7319
214,-0.7319
215,-0.7319
216,-0.7319
217,-0.7319
218,-0.7319
219,-0.7319
220,-0.7319
221,-0.7319
222,-0.7319
223,-0.7319
224,-0.7319
225,-0.7319
226,-0.7319
227,-0.7319
228,-0.7319
229,-0.7319
230,-0.7319
231,-0.7319
232,-0.7319
233,-0.7319
234,-0.7319
235,-0.7319
236,-0.7319
237,-0.7319
238,-0.7319
239,-0.7319
240,-0.7319
241,-0.7319
242,-0.7319
243,-0.7319
244,-0.7319
245,-0.7319
246,-0.7319
247,-0.7319
248,-0.7319
249,-0.7319
250,-0.7319
251,-0.7319
252,-0.7319
253,-0.7319
254,-0.7319
255,-0.7319
256,-0.7319
257,-0.7319
258,-0.7319
259,-0.7319
260,-0.7319
261,-0.7319
262,-0.7319
263,-0.7319
264,-0.7319
265,-0.7319
266,-0.7319
267,-0.7319
268,-0.7319
269,-0.7319
270,-0.7319
271,-0.7319
272,-0.7319
273,-0.7319
274,-0.7319
275,-0.7319
276,-0.7319
277,-0.7319
278,-0.7319
279,-0.7319
280,-0.7319
281,-0.7319
282,-0.7319
283,-0.7319
284,-0.7319
285,-0.7319
286,-0.7319
287,-0.7319
288,-0.7319
289,-0.7319
290,-0.7319
291,-0.7319
292,-0.7319
293,-0.55519
294,1.3887
295,1.3887
296,1.3887
297,1.9189
298,1.3887
299,1.3887
300,1.3887
301,1.3887
302,1.3887
303,1.9189
304,1.3887
305,1.3887
306,1.3887
307,1.3887
308,1.9189
309,1.3887
310,1.3887
311,1.3887
312,1.3887
313,-0.37847
314,0.3284
315,1.3887
316,1.3887
317,1.3887
318,1.3887
319,1.3887
320,1.3887
321,1.3887
322,1.9189
323,1.3887
324,1.3887
325,1.3887
326,1.3887
327,1.3887
328,1.3887
329,1.3887
330,1.9189
331,-0.37847
332,-0.7319
333,-0.55519
334,-0.7319
335,-0.7319
336,-0.55519
337,-0.7319
338,-0.7319
339,-0.55519
340,-0.7319
341,-0.7319
342,-0.55519
343,-0.7319
344,-0.7319
345,-0.55519
346,-0.7319
347,-0.7319
348,-0.55519
349,-0.7319
350,-0.7319
351,-0.55519
352,-0.7319
353,-0.7319
354,-0.55519
355,-0.7319
356,-0.7319
357,-0.55519
358,-0.7319
359,-0.7319
360,-0.55519
361,-0.7319
362,-0.7319
363,-0.55519
364,-0.7319
365,-0.7319
366,-0.55519
367,-0.7319
368,-0.7319
369,-0.55519
370,-0.7319
371,-0.7319
372,-0.55519
373,-0.7319
374,-0.7319
375,-0.55519
376,-0.7319
377,-0.7319
378,-0.55519
379,-0.7319
380,-0.7319
381,-0.55519
382,-0.7319
383,-0.7319
384,-0.55519
385,-0.7319
386,-0.7319
387,-0.55519
388,-0.7319
389,-0.7319
390,-0.55519
391,-0.7319
392,-0.7319
393,0.3284
394,1.3887
395,1.3887
396,1.3887
397,1.3887
398,1.9189
399,1.3887
400,1.3887
401,1.3887
402,1.3887
403,1.9189
404,1.3887
405,1.3887
406,1.3887
407,1.3887
408,1.9189
409,1.3887
410,-0.025034999999999998
411,1.3887
412,1.3887
413,1.3887
414,1.3887
415,1.3887
416,1.3887
417,1.3887
418,1.9189
419,1.3887
420,1.3887
421,1.3887
422,1.3887
423,1.3887
424,1.3887
425,1.3887
426,1.3887
427,1.0353
428,-0.37847
429,-0.7319
430,-0.7319
431,-0.55519
432,-0.7319
433,-0.7319
434,-0.55519
435,-0.7319
436,-0.7319
437,-0.55519
438,-0.7319
439,-0.7319
440,-0.55519
441,-0.7319
442,-0.7319
443,-0.55519
444,-0.7319
445,-0.7319
446,-0.55519
447,-0.7319
448,-0.7319
449,-0.55519
450,-0.7319
451,-0.7319
452,-0.55519
453,-0.7319
454,-0.7319
455,-0.55519
456,-0.7319
457,1.0353
458,1.3887
459,1.3887
460,1.3887
461,1.9189
462,1.3887
463,1.3887
464,1.3887
465,1.3887
466,1.3887
467,1.3887
468,1.9189
469,1.3887
470,1.3887
471,1.3887
472,1.3887
473,1.3887
474,1.3887
475,1.3887
476,1.3887
477,1.3887
478,1.3887
479,1.3887
480,1.3887
481,1.3887
482,1.3887
483,1.3887
484,1.3887
485,1.3887
486,1.3887
487,1.3887
488,1.3887
489,1.3887
490,1.3887
491,1.3887
492,1.3887
493,1.3887
494,1.3887
495,1.3887
496,1.3887
497,1.3887
498,1.3887
499,1.3887
500,1.3887
501,1.3887
502,1.3887
503,1.3887
504,1.3887
505,1.3887
506,1.3887
507,1.3887
508,1.3887
509,1.3887
510,1.3887
511,1.3887
512,1.3887
513,1.3887
514,1.3887
515,1.3887
516,1.3887
517,1.3887
518,1.3887
519,1.3887
520,1.3887
521,1.3887
522,1.3887
523,1.3887
524,1.3887
525,1.3887
526,1.3887
527,1.3887
528,1.3887
529,1.3887
530,1.3887
531,1.3887
532,1.3887
533,1.0353
534,1.3887
535,1.3887
536,1.3887
537,1.3887
538,1.3887
539,1.3887
540,1.3887
541,1.3887
542,1.0353
543,1.3887
544,1.3887
545,1.3887
546,1.3887
547,1.3887
548,1.3887
549,1.3887
550,1.3887
551,1.9189
552,1.3887
553,0.3284
554,-0.37847
555,-0.7319
556,-0.7319
557,-0.55519
558,-0.7319
559,-0.7319
560,-0.55519
561,-0.7319
562,-0.7319
563,-0.55519
564,-0.7319
565,-0.7319
566,-0.55519
567,-0.7319
568,-0.7319
569,-0.55519
570,-0.7319
571,-0.7319
572,-0.55519
573,-0.7319
574,-0.7319
575,-0.55519
576,-0.7319
577,-0.7319
578,-0.55519
579,-0.7319
580,-0.7319
581,-0.55519
582,-0.7319
583,-0.7319
584,-0.55519
585,-0.7319
586,-0.7319
587,-0.55519
588,-0.7319
589,-0.55519
590,-0.7319
591,-0.7319
592,-0.55519
593,-0.7319
594,-0.7319
595,-0.55519
596,-0.7319
597,-0.7319
598,-0.55519
599,-0.7319
600,-0.7319
601,-0.55519
602,-0.7319
603,-0.7319
604,-0.55519
605,-0.7319
606,-0.7319
607,-0.55519
608,-0.7319
609,-0.7319
610,-0.55519
611,-0.7319
612,-0.7319
613,-0.55519
614,-0.7319
615,-0.7319
616,-0.55519
617,-0.7319
618,-0.7319
619,-0.55519
620,-0.7319
621,-0.7319
622,-0.55519
623,-0.7319
624,-0.55519
625,-0.7319
626,-0.7319
627,-0.55519
628,-0.7319
629,0.68183
630,1.0353
631,1.3887
632,1.3887
633,1.9189
634,1.3887
635,1.3887
636,1.3887
637,1.3887
638,1.3887
639,1.9189
640,1.3887
641,1.3887
642,1.3887
643,1.3887
644,1.3887
645,1.3887
646,1.3887
647,1.3887
648,1.3887
649,1.3887
650,1.3887
651,1.3887
652,1.3887
653,1.3887
654,1.3887
655,1.3887
656,1.3887
657,1.3887
658,1.3887
659,1.3887
660,1.3887
661,1.3887
662,1.3887
663,1.3887
664,1.3887
665,1.3887
666,1.3887
667,1.3887
668,1.3887
669,1.3887
670,1.3887
671,1.3887
672,1.3887
673,1.3887
674,1.3887
675,1.3887
676,1.3887
677,1.0353
678,1.3887
679,1.3887
680,1.3887
681,1.3887
682,1.3887
683,1.3887
684,1.3887
685,1.3887
686,1.3887
687,1.3887
688,1.3887
689,1.3887
690,1.3887
691,1.3887
692,1.3887
693,1.3887
694,1.3887
695,1.3887
696,1.3887
697,1.3887
698,1.3887
699,1.3887
700,1.0353
701,1.3887
702,1.3887
703,1.3887
704,-0.025034999999999998
705,-0.55519
706,-0.7319
707,-0.7319
708,-0.7319
709,-0.7319
710,-0.7319
711,-0.7319
712,-0.7319
713,-0.7319
714,-0.7319
715,-0.7319
716,-0.7319
717,-0.7319
718,-0.7319
719,-0.7319
