time,value
0,2.2202
1,2.2911
2,2.3621
3,2.3835
4,2.4023
5,2.4043
6,2.4043
7,2.4043
8,2.4043
9,2.4043
10,2.4043
11,2.4043
12,2.4043
13,2.4043
14,2.4043
15,2.4043
16,2.4043
17,2.4012
18,2.3959
19,2.3747
20,2.3392
21,2.3187
22,2.3146
23,2.3122
24,2.3122
25,2.2982
26,2.2604
27,2.1996
28,2.09
29,1.9718
30,1.8299
31,1.685
32,1.5285
33,1.3748
34,1.2351
35,1.0972
36,0.97315
37,0.84916
38,0.72683
39,0.60483
40,0.53392
41,0.46301000000000003
42,0.3921
43,0.32119000000000003
44,0.25028
45,0.17937
46,0.10845999999999999
47,0.037548000000000005
48,-0.033362
49,-0.10427
50,-0.17518
51,-0.24609
52,-0.317
53,-0.38791
54,-0.45376000000000005
55,-0.51676
56,-0.57208
57,-0.6220399999999999
58,-0.66423
59,-0.69968
60,-0.73514
61,-0.77059
62,-0.80605
63,-0.8415
64,-0.87174
65,-0.8934200000000001
66,-0.90874
67,-0.91094
68,-0.9174
69,-0.9351200000000001
70,-0.95285
71,-0.9705799999999999
72,-0.98651
73,-0.99369
74,-1.0007
75,-1.0066
76,-1.0131
77,-1.0297
78,-1.046
79,-1.046
80,-1.046
81,-1.046
82,-1.046
83,-1.0374
84,-1.0279
85,-1.0072
86,-0.98461
87,-0.9518
88,-0.9164899999999999
89,-0.89439
90,-0.8766700000000001
91,-0.84972
92,-0.8188
93,-0.79045
94,-0.76349
95,-0.74203
96,-0.7243
97,-0.70657
98,-0.68884
99,-0.66286
100,-0.6282800000000001
101,-0.59864
102,-0.57535
103,-0.55996
104,-0.55718
105,-0.56309
106,-0.58638
107,-0.61808
108,-0.6712600000000001
109,-0.72082
110,-0.75818
111,-0.79128
112,-0.8044600000000001
113,-0.81521
114,-0.80877
115,-0.8015100000000001
116,-0.78378
117,-0.76605
118,-0.74833
119,-0.7306
120,-0.72718
121,-0.72425
122,-0.7240000000000001
123,-0.7240000000000001
124,-0.72868
125,-0.7341
126,-0.7489
127,-0.7659
128,-0.7700100000000001
129,-0.7700100000000001
130,-0.7602899999999999
131,-0.74652
132,-0.73016
133,-0.71243
134,-0.69206
135,-0.66994
136,-0.64049
137,-0.6050399999999999
138,-0.56958
139,-0.53413
140,-0.51
141,-0.5000399999999999
142,-0.49715
143,-0.5052
144,-0.5154
145,-0.52976
146,-0.53999
147,-0.53999
148,-0.54771
149,-0.58053
150,-0.61169
151,-0.63542
152,-0.65837
153,-0.6761
154,-0.6936399999999999
155,-0.70902
156,-0.7240000000000001
157,-0.7240000000000001
158,-0.7240000000000001
159,-0.7240000000000001
160,-0.7240000000000001
161,-0.7240000000000001
162,-0.7240000000000001
163,-0.7240000000000001
164,-0.7240000000000001
165,-0.7250800000000001
166,-0.7264
167,-0.74027
168,-0.7579899999999999
169,-0.78595
170,-0.81804
171,-0.8587299999999999
172,-0.90385
173,-0.95388
174,-1.0071
175,-1.0601
176,-1.113
177,-1.1571
178,-1.1925
179,-1.228
180,-1.2634
181,-1.2955
182,-1.3223
183,-1.3405
184,-1.3424
185,-1.3281
186,-1.2749
187,-1.2053
188,-1.0841
189,-0.9577100000000001
190,-0.809
191,-0.65776
192,-0.4906
193,-0.31585
194,-0.059458000000000004
195,0.20999
196,0.8659100000000001
197,1.5218
198,1.5985
199,1.6635
200,1.6368
201,1.6029
202,1.5522
203,1.499
204,1.4458
205,1.3926
206,1.3394
207,1.2862
208,1.2223
209,1.1542
210,1.0842
211,1.0133
212,0.94581
213,0.88046
214,0.82196
215,0.76877
216,0.71559
217,0.66241
218,0.60922
219,0.55604
220,0.5066
221,0.46265
222,0.42168999999999995
223,0.38624
224,0.35078000000000004
225,0.31533
226,0.27114
227,0.20052
228,0.13743
229,0.1052
230,0.075054
231,0.057326
232,0.039599
233,0.021871
234,0.0041438000000000004
235,-0.013584
236,-0.031311
237,-0.016361
238,-0.00097732
239,0.0055054
240,0.011366
241,0.012055
242,0.012055
243,0.0099879
244,0.007497199999999999
245,-0.0068443
246,-0.024572
247,-0.053565999999999996
248,-0.086824
249,-0.10695999999999999
250,-0.12074000000000001
251,-0.12214000000000001
252,-0.11598
253,-0.10240999999999999
254,-0.083221
255,-0.05563200000000001
256,-0.020177
257,0.0018168
258,0.0082632
259,0.020138999999999997
260,0.039771
261,0.063248
262,0.093575
263,0.11975999999999999
264,0.13660999999999998
265,0.14465
266,0.12692
267,0.10919000000000001
268,0.091463
269,0.07373500000000001
270,0.056008
271,0.038682
272,0.025057
273,0.012055
274,0.012055
275,0.012055
276,0.012055
277,0.012055
278,0.00033455
279,-0.012119
280,-0.02926
281,-0.046988
282,-0.062140999999999995
283,-0.076792
284,-0.079952
285,-0.079952
286,-0.09175
287,-0.10787000000000001
288,-0.11731
289,-0.12361
290,-0.12596
291,-0.12596
292,-0.12478
293,-0.12272999999999999
294,-0.11248
295,-0.09475
296,-0.07702200000000001
297,-0.05929500000000001
298,-0.045918
299,-0.038593
300,-0.036039999999999996
301,-0.041754
302,-0.050593
303,-0.06626900000000001
304,-0.073213
305,-0.055485
306,-0.040699
307,-0.037037
308,-0.033949
309,-0.033949
310,-0.034439
311,-0.039126999999999995
312,-0.044497
313,-0.062225
314,-0.079952
