time,value
0,-0.30583
1,-0.046119
2,0.43057
3,-0.52827
4,-0.74965
5,0.2007
6,-0.27085
7,0.32375
8,-0.19189
9,-0.14099
10,-0.1824
11,0.50641
12,-0.35645
13,0.5486800000000001
14,-0.36325999999999997
15,-0.72225
16,0.28348
17,0.031966
18,-0.11599999999999999
19,-0.30075999999999997
20,0.24599000000000001
21,-0.20267000000000002
22,-0.062226
23,0.012117000000000001
24,-0.20027999999999999
25,0.3731
26,-0.054457000000000005
27,0.43437
28,-0.18300999999999998
29,0.30666
30,0.11679
31,0.44308000000000003
32,0.018644
33,-0.020802
34,-0.33921
35,0.33691
36,0.23863
37,0.18278
38,0.37982
39,-0.14079
40,0.36624
41,-0.075722
42,0.28665999999999997
43,0.074619
44,0.17897000000000002
45,-0.19414
46,0.19535999999999998
47,0.063813
48,0.16855
49,-0.26288
50,0.10252
51,0.15074
52,0.14262
53,-0.77103
54,0.08039500000000001
55,-0.18683
56,1.4987
57,1.4987
58,1.4987
59,1.4987
60,1.4987
61,1.4987
62,1.4987
63,1.4987
64,1.4987
65,1.4987
66,1.4987
67,1.4987
68,1.4987
69,1.4987
70,-1.5424
71,-1.5424
72,-1.5424
73,-1.5424
74,-1.5424
75,-1.5424
76,-1.5424
77,-1.5424
78,-1.5424
79,-1.5424
80,-1.5424
81,-1.5424
82,-1.5424
83,-1.5424
84,-0.020703
85,-0.067758
86,0.26073
87,-0.5515800000000001
88,0.065902
89,-1.5424
90,-1.5424
91,-1.5424
92,-1.5424
93,-1.5424
94,-1.5424
95,-1.5424
96,-1.5424
97,-1.5424
98,-1.5424
99,-1.5424
100,-1.5424
101,1.4987
102,1.4987
103,1.4987
104,1.4987
105,1.4987
106,1.4987
107,1.4987
108,1.4987
109,1.4987
110,1.4987
111,1.4987
112,1.4987
113,0.055227
114,0.21295999999999998
115,-0.065197
116,0.12326
117,0.062038
118,0.13488
119,-0.52683
120,0.26866999999999996
121,-0.04809
122,-0.15822999999999998
123,-0.046827999999999995
124,0.095583
125,0.27209
126,0.63042
127,0.18365
