time,value
0,2.0793
1,2.9831
2,3.6456
3,3.8905
4,3.634
5,2.9227
6,1.9274
7,0.8895700000000001
8,0.041972
9,-0.46696000000000004
10,-0.61251
11,-0.48378999999999994
12,-0.23144
13,0.00096089
14,0.1303
15,0.15016
16,0.1082
17,0.063032
18,0.046995
19,0.055142
20,0.06314600000000001
21,0.059671
22,0.06965
23,0.15084
24,0.36173
25,0.71838
26,1.1655
27,1.5821
28,1.8232
29,1.781
30,1.4354
31,0.8695799999999999
32,0.24019000000000001
33,-0.28367
34,-0.58549
35,-0.64068
36,-0.5148
37,-0.32437
38,-0.18131
39,-0.14748
40,-0.21871999999999997
41,-0.34108
42,-0.44819
43,-0.49188000000000004
44,-0.4666
45,-0.40306
46,-0.34694
47,-0.32742
48,-0.35008
49,-0.39866
50,-0.44616000000000006
51,-0.47045
52,-0.46541000000000005
53,-0.44182
54,-0.41873
55,-0.41151000000000004
56,-0.42408999999999997
57,-0.44893
58,-0.47262
59,-0.48368
60,-0.47795
61,-0.46069
62,-0.44204
63,-0.43132
64,-0.43178
65,-0.44167
66,-0.45574
67,-0.46935
68,-0.47828000000000004
69,-0.48331
70,-0.48718999999999996
71,-0.49377
72,-0.5010100000000001
73,-0.5079100000000001
74,-0.5132899999999999
75,-0.51646
76,-0.51698
77,-0.51571
78,-0.51439
79,-0.5150399999999999
80,-0.51853
81,-0.52472
82,-0.53269
83,-0.54115
84,-0.5486300000000001
85,-0.55398
86,-0.55676
87,-0.55708
88,-0.55529
89,-0.55199
90,-0.54845
91,-0.5464100000000001
92,-0.54752
93,-0.55252
94,-0.5608
95,-0.56999
96,-0.5764
97,-0.57624
98,-0.56777
