time,value
0,1.5645
1,1.5645
2,1.5645
3,1.5645
4,1.5645
5,1.5645
6,1.5645
7,1.5645
8,1.5645
9,1.5645
10,1.5645
11,1.5645
12,1.5645
13,1.5645
14,1.5645
15,1.5645
16,1.5645
17,1.5645
18,1.5645
19,1.5645
20,1.5645
21,1.5645
22,1.5645
23,1.5645
24,1.5645
25,1.5645
26,1.5645
27,1.5645
28,1.5645
29,1.5645
30,1.5645
31,1.5645
32,1.5645
33,1.5645
34,1.5645
35,1.5645
36,1.5645
37,1.5645
38,1.5645
39,1.5645
40,1.5605
41,1.5299
42,1.435
43,1.3401
44,1.2452
45,1.1504
46,1.0555
47,0.96057
48,0.8710700000000001
49,0.8643700000000001
50,0.86345
51,0.86345
52,0.8260200000000001
53,0.7417699999999999
54,0.64688
55,0.55199
56,0.5202399999999999
57,0.5129199999999999
58,0.5129199999999999
59,0.5129199999999999
60,0.5129199999999999
61,0.5129199999999999
62,0.5129199999999999
63,0.47423000000000004
64,0.39905
65,0.30416
66,0.21339
67,0.16762
68,0.16238
69,0.16238
70,0.16238
71,0.16238
72,0.16238
73,0.16238
74,0.13247
75,0.056326
76,-0.038564999999999995
77,-0.12580999999999998
78,-0.18816
79,-0.18816
80,-0.18816
81,-0.18816
82,-0.18816
83,-0.18816
84,-0.18816
85,-0.18816
86,-0.18816
87,-0.18816
88,-0.18816
89,-0.18816
90,-0.18816
91,-0.18816
92,-0.18816
93,-0.18816
94,-0.18816
95,-0.18816
96,-0.18816
97,-0.18816
98,-0.18816
99,-0.18816
100,-0.26577
101,-0.42706000000000005
102,-0.6168399999999999
103,-0.80662
104,-0.87372
105,-0.88923
106,-0.88923
107,-0.88923
108,-0.88923
109,-0.88923
110,-0.88923
111,-0.81483
112,-0.66596
113,-0.47618
114,-0.2864
115,-0.096614
116,0.093166
117,0.28295
118,0.45371000000000006
119,0.5877100000000001
120,0.6826
121,0.77749
122,0.82125
123,0.75963
124,0.66474
125,0.56985
126,0.47496000000000005
127,0.38006999999999996
128,0.28518000000000004
129,0.18177000000000001
130,0.028417
131,-0.16136
132,-0.35058
133,-0.53701
134,-0.6347
135,-0.72959
136,-0.8244799999999999
137,-0.91937
138,-1.0143
139,-1.1091
140,-1.204
141,-1.2989
142,-1.3938
143,-1.4887
144,-1.5425
145,-1.413
146,-1.2241
147,-1.0344
148,-0.84457
149,-0.65479
150,-0.46501000000000003
151,-0.27523000000000003
152,-0.20288
153,-0.18816
154,-0.18816
155,-0.18816
156,-0.18816
157,-0.18816
158,-0.18816
159,-0.25795
160,-0.40696
161,-0.5967399999999999
162,-0.78652
163,-0.9763
164,-1.1661
165,-1.3559
166,-1.5286
167,-1.6629
168,-1.7578
169,-1.8519999999999999
170,-1.9067
171,-1.8392
172,-1.7444
173,-1.6443
174,-1.5189
175,-1.3291
176,-1.1393
177,-0.95319
178,-0.8244799999999999
179,-0.72959
180,-0.6347
181,-0.5426
182,-0.53925
183,-0.53869
184,-0.53869
185,-0.53869
186,-0.53869
187,-0.53869
188,-0.53869
189,-0.66618
190,-0.84234
191,-1.0321
192,-1.2219
193,-1.4117
194,-1.6015
195,-1.7912
196,-1.9028
197,-1.9408
198,-1.9408
199,-1.9380000000000002
200,-1.8856
201,-1.7968
202,-1.7019
203,-1.5866
204,-1.4340000000000002
205,-1.2442
206,-1.0544
207,-0.86467
208,-0.67489
209,-0.48511000000000004
210,-0.31859
211,-0.22946
212,-0.32435
213,-0.41923999999999995
214,-0.5283800000000001
215,-0.67935
216,-0.86913
217,-1.0589
218,-1.2487
219,-1.4385
220,-1.6283
221,-1.8127
222,-1.9408
223,-1.9408
224,-1.9408
225,-1.9408
226,-1.8772
227,-1.7834
228,-1.6885
229,-1.5781
230,-1.3135
231,-1.031
232,-0.74633
233,-0.46166
234,-0.17699
235,0.10768
236,0.39235
237,0.6146699999999999
238,0.8121
239,1.0019
240,1.1542
241,1.214
242,1.214
243,1.214
244,1.214
245,1.214
246,1.214
247,1.2087
248,1.163
249,1.0722
250,0.9773200000000001
251,0.9021299999999999
252,0.86345
253,0.86345
254,0.86345
255,0.8356100000000001
256,0.75851
257,0.66362
258,0.5687300000000001
259,0.47384
260,0.37895
261,0.28406
262,0.18917
263,0.094282
264,-0.00060791
265,-0.095498
266,-0.19039
267,-0.28528000000000003
268,-0.38017
269,-0.47506000000000004
270,-0.53774
271,-0.53869
272,-0.53869
273,-0.53869
274,-0.47439
275,-0.38351999999999997
276,-0.28863
277,-0.20567
278,-0.18892
279,-0.18816
280,-0.18816
281,-0.14895999999999998
282,-0.06982200000000001
283,0.025068
284,0.11996
285,0.21485
286,0.30974
287,0.40463000000000005
288,0.47948
289,0.5129199999999999
290,0.5129199999999999
291,0.5129199999999999
292,0.54906
293,0.62343
294,0.71832
295,0.7994899999999999
296,0.81624
297,0.72391
298,0.62902
299,0.5522600000000001
300,0.5129199999999999
301,0.5129199999999999
302,0.5129199999999999
303,0.5129199999999999
304,0.5129199999999999
305,0.5129199999999999
306,0.50683
307,0.47608
308,0.38119000000000003
309,0.2863
310,0.19760999999999998
311,0.16238
312,0.16238
313,0.16238
314,0.16238
