time,value
0,0.16489
1,0.16489
2,0.16489
3,0.16489
4,0.16489
5,0.16489
6,0.16489
7,0.16489
8,0.16489
9,0.16489
10,0.16489
11,0.16489
12,0.16489
13,0.16489
14,0.16489
15,0.16489
16,0.16489
17,0.16489
18,0.16489
19,0.16489
20,0.16489
21,0.16489
22,0.16489
23,0.16489
24,0.16489
25,0.16489
26,0.16489
27,0.16489
28,0.16489
29,0.16489
30,0.16489
31,0.16489
32,0.3056
33,0.16655
34,0.30903
35,0.43151999999999996
36,0.48453
37,0.092632
38,0.46976999999999997
39,0.40615999999999997
40,0.26359
41,0.099766
42,-0.084774
43,-0.38164000000000003
44,-0.14182999999999998
45,-0.19696
46,-0.22665
47,-0.25634
48,-0.27441
49,-0.25745
50,-0.23029000000000002
51,-0.20661999999999997
52,-0.1939
53,-0.19272
54,-0.19760999999999998
55,-0.20847
56,-0.23815999999999998
57,-0.26544
58,-0.28784
59,-0.28784
60,-0.28784
61,-0.29407
62,-0.32163
63,-0.35085
64,-0.38054
65,-0.41022
66,-0.43991
67,-0.4631
68,-0.47794
69,-0.47808
70,-0.47808
71,-0.47808
72,-0.47808
73,-0.47808
74,-0.47808
75,-0.47808
76,-0.47808
77,-0.47808
78,-0.47808
79,-0.47808
80,-0.47808
81,-0.47808
82,-0.47808
83,-0.4847
84,-0.49868
85,-0.52836
86,-0.55406
87,-0.5732
88,-0.5732
89,-0.5732
90,-0.58168
91,-0.61136
92,-0.64105
93,-0.67074
94,-0.7004199999999999
95,-0.73011
96,-0.7598
97,-0.7894800000000001
98,-0.81917
99,-0.84246
100,-0.85855
101,-0.85855
102,-0.85855
103,-0.85855
104,-0.85855
105,-0.85855
106,-0.84839
107,-0.8208200000000001
108,-0.7913
109,-0.77168
110,-0.76343
111,-0.76343
112,-0.77205
113,-0.78888
114,-0.8185600000000001
115,-0.8424299999999999
116,-0.85855
117,-0.85855
118,-0.85855
119,-0.85855
120,-0.85855
121,-0.85855
122,-0.85855
123,-0.85855
124,-0.85855
125,-0.85855
126,-0.85855
127,-0.85855
128,-0.8669899999999999
129,-0.88339
130,-0.9130799999999999
131,-0.94276
132,-0.97245
133,-1.0021
134,-1.0318
135,-1.0742
136,-1.1336
137,-1.193
138,-1.2399
139,-1.2754
140,-1.3051
141,-1.3239
142,-1.3341
143,-1.3341
144,-1.3262
145,-1.3099
146,-1.2802
147,-1.2505
148,-1.2208
149,-1.1912
150,-1.1615
151,-1.1459
152,-1.1439
153,-1.1439
154,-1.1439
155,-1.1439
156,-1.1439
157,-1.1546
158,-1.1736
159,-1.2033
160,-1.2119
161,-1.1918
162,-1.1324
163,-1.075
164,-1.0312
165,-1.0015
166,-0.9718399999999999
167,-0.94216
168,-0.9124700000000001
169,-0.8827799999999999
170,-0.83973
171,-0.78827
172,-0.7289
173,-0.67979
174,-0.63923
175,-0.60955
176,-0.57986
177,-0.5501699999999999
178,-0.52049
179,-0.4908
180,-0.5289699999999999
181,-0.61803
182,-0.70709
183,-0.78035
184,-0.84462
185,-0.90399
186,-0.9234899999999999
187,-0.91914
188,-0.88945
189,-0.8503299999999999
190,-0.8016
191,-0.7422300000000001
192,-0.68285
193,-0.62348
194,-0.56411
195,-0.50474
196,-0.44536000000000003
197,-0.38599
198,-0.32661
199,-0.28336999999999996
200,-0.24785
201,-0.21816999999999998
202,-0.20134000000000002
203,-0.19272
204,-0.19272
205,-0.20097
206,-0.22059
207,-0.25011
208,-0.27768000000000004
209,-0.28784
210,-0.28784
211,-0.28784
212,-0.3066
213,-0.33328
214,-0.36296999999999996
215,-0.39265
216,-0.42233999999999994
217,-0.45203000000000004
218,-0.45756
219,-0.44476000000000004
220,-0.41436999999999996
221,-0.37196
222,-0.30117
223,-0.21211
224,-0.12305
225,-0.17843
226,0.10595999999999998
227,0.22471
228,0.32432
229,0.41736999999999996
230,0.50643
231,0.54835
232,0.56822
233,0.5675399999999999
234,0.54633
235,0.50279
236,0.44342
237,0.38405
238,0.32466999999999996
239,0.2653
240,0.20593000000000003
241,0.19050999999999998
242,0.18775
243,0.18775
244,0.24520999999999998
245,0.32043
246,0.40949
247,0.49855
248,0.5876100000000001
249,0.67862
250,0.78465
251,0.91901
252,1.067
253,1.2133
254,1.3383
255,1.4569999999999999
256,1.5758
257,1.6945
258,1.8132
259,1.932
260,2.0507
261,2.1695
262,2.2871
263,2.3931
264,2.4882
265,2.5734
266,2.6434
267,2.6608
268,2.6608
269,2.6608
270,2.5845
271,2.4954
272,2.4064
273,2.3173
274,2.2282
275,2.1404
276,2.0683
277,2.0041
278,1.9447
279,1.8853
280,1.8259999999999998
281,1.7702
282,1.7235
283,1.7405
284,1.7702
285,1.7999
286,1.7778
287,1.7502
288,1.7205
289,1.6909
290,1.6612
291,1.6337
292,1.6189
293,1.6145
294,1.6123
295,1.6039
296,1.5782
297,1.5485
298,1.5188
299,1.4891
300,1.4594
301,1.4292
302,1.374
303,1.3164
304,1.2571
305,1.1977
306,1.1383
307,1.0849
308,1.051
309,1.0438
310,1.0351
311,1.0097
312,0.9008299999999999
313,0.78209
314,0.6633399999999999
315,0.36580999999999997
316,0.36580999999999997
317,0.36580999999999997
318,0.36580999999999997
319,0.36580999999999997
320,0.36580999999999997
321,0.36580999999999997
322,0.36580999999999997
323,0.36580999999999997
324,0.36580999999999997
325,0.36580999999999997
326,0.36580999999999997
327,0.36580999999999997
328,0.36580999999999997
329,0.36580999999999997
330,0.36580999999999997
331,0.36580999999999997
332,0.36580999999999997
333,0.36580999999999997
334,0.36580999999999997
335,0.36580999999999997
336,0.36580999999999997
337,0.36580999999999997
338,0.36580999999999997
339,0.36580999999999997
340,0.36580999999999997
341,0.36580999999999997
342,0.36580999999999997
343,0.36580999999999997
344,0.36580999999999997
345,0.36580999999999997
346,0.36580999999999997
347,0.37390999999999996
348,0.42277
349,0.47748999999999997
350,0.52453
351,0.54489
352,0.54845
353,0.5576800000000001
354,0.58211
355,0.6368699999999999
356,0.68796
357,0.7311
358,0.7311
359,0.7311
360,0.7311
361,0.7311
362,0.7311
363,0.7311
364,0.7311
365,0.7311
366,0.74265
367,0.77523
368,0.8299799999999999
369,0.8682200000000001
370,0.88349
371,0.82649
372,0.7741
373,0.7311
374,0.7311
375,0.7311
376,0.7311
377,0.7311
378,0.7311
379,0.7311
380,0.7311
381,0.7311
382,0.7311
383,0.7311
384,0.7311
385,0.7311
386,0.7311
387,0.7311
388,0.72845
389,0.71365
390,0.65664
391,0.59964
392,0.5426300000000001
393,0.48563
394,0.42863
395,0.38682
396,0.36646
397,0.36580999999999997
398,0.36580999999999997
399,0.36580999999999997
400,0.36580999999999997
401,0.36580999999999997
402,0.36580999999999997
403,0.36580999999999997
404,0.36580999999999997
405,0.36580999999999997
406,0.36580999999999997
407,0.36580999999999997
408,0.38335
409,0.42813999999999997
410,0.48446999999999996
411,0.5252600000000001
412,0.54845
413,0.54845
414,0.56074
415,0.5868399999999999
416,0.64385
417,0.70085
418,0.75785
419,0.81486
420,0.8718600000000001
421,0.88984
422,0.84098
423,0.78461
424,0.7276100000000001
425,0.6706
426,0.6136
427,0.5566
428,0.49959
429,0.44259
430,0.3744
431,0.29135
432,0.17735
433,0.37961
434,0.265
435,0.265
436,0.265
437,-0.07709400000000001
438,-0.32158000000000003
439,-0.12745
440,-0.18445
441,-0.24145999999999998
442,-0.29846
443,-0.37168
444,-0.46016999999999997
445,-0.57417
446,-0.67878
447,-0.76613
448,-0.8231299999999999
449,-0.88013
450,-0.96157
451,-1.0756
452,-1.1896
453,-1.3036
454,-1.4176
455,-1.5316
456,-1.6039
457,-1.6433
458,-1.6433
459,-1.6433
460,-1.6433
461,-1.6433
462,-1.6363
463,-1.6084
464,-1.5514
465,-1.4944
466,-1.4374
467,-1.3804
468,-1.3234
469,-1.2915
470,-1.278
471,-1.278
472,-1.278
473,-1.278
474,-1.278
475,-1.2645
476,-1.2326
477,-1.1756
478,-1.1186
479,-1.0616
480,-1.0046
481,-0.9476100000000001
482,-0.86156
483,-0.75449
484,-0.64049
485,-0.55215
486,-0.47994
487,-0.42294
488,-0.36594
489,-0.30893000000000004
490,-0.25193000000000004
491,-0.19492
492,-0.13792000000000001
493,-0.37393000000000004
494,-0.088915
495,-0.45537
496,-0.26821999999999996
497,-0.43923
498,-0.5799
499,-0.70331
500,-0.81731
501,-0.9058
502,-0.9790200000000001
503,-1.036
504,-1.0387
505,-0.986
506,-0.8719899999999999
507,-0.7660899999999999
508,-0.68702
509,-0.6300100000000001
510,-0.57301
511,-0.48136999999999996
512,-0.37059000000000003
513,-0.25658000000000003
514,-0.17353
515,-0.49609
516,-0.21106999999999998
517,-0.17298
518,-0.2925
519,-0.12163
520,-0.17864000000000002
521,-0.23564000000000002
522,-0.29233000000000003
523,-0.34526
524,-0.36477
525,-0.36477
526,-0.36477
527,-0.43682
528,-0.53927
529,-0.65328
530,-0.73639
531,-0.8056800000000001
532,-0.8626799999999999
533,-0.8733
534,-0.84872
535,-0.79104
536,-0.72183
537,-0.62536
538,-0.51135
539,-0.39735
540,-0.2019
541,0.1612
542,0.25413
543,0.4454
544,0.62407
545,0.79508
546,0.8454
547,0.83929
548,0.7809699999999999
549,0.68325
550,0.5426300000000001
551,0.37388000000000005
552,0.21915
553,0.13198
554,0.40551
555,0.12049000000000001
556,-0.12343
557,-0.28915
558,-0.46016999999999997
559,-0.48407
560,-0.46248999999999996
561,-0.40523000000000003
562,-0.31972
563,-0.21819000000000002
564,-0.45274
565,0.44303000000000003
566,0.37046
567,0.71158
568,1.0495
569,1.3465
570,1.6315
571,1.9165
572,2.1586
573,2.3912
574,2.6192
575,2.8111
576,2.9915
577,3.1557
578,3.2534
579,3.2881
580,3.2760000000000002
581,3.2149
582,2.9857
583,2.7006
584,2.4156
585,2.0817
586,1.7397
587,1.3977
588,1.0557
589,0.71365
590,0.37388000000000005
591,0.35278000000000004
592,-0.22981999999999997
593,-0.50415
594,-0.72809
595,-0.8719899999999999
596,-0.9814200000000001
597,-1.0791
598,-1.0954
599,-1.0954
600,-1.0954
601,-1.0456
602,-0.99065
603,-0.93552
604,-0.91924
605,-0.91271
606,-0.91271
607,-0.91271
608,-0.91271
609,-0.91271
610,-0.91271
611,-0.91271
612,-0.9156700000000001
613,-0.9238200000000001
614,-1.0290000000000001
615,-1.143
616,-1.2559
617,-1.3211
618,-1.3815
619,-1.4433
620,-1.5369
621,-1.6445
622,-1.7527
623,-1.8423
624,-1.9062
625,-1.9382
626,-1.9219
627,-1.6654
628,-1.3804
629,-1.0954
630,0.3013
631,0.3013
632,0.3013
633,0.3013
634,0.3013
635,0.3013
636,0.3013
637,0.3013
638,0.3013
639,0.3013
640,0.3013
641,0.3013
642,0.3013
643,0.3013
644,0.3013
645,0.3013
646,0.3013
647,0.3013
648,0.3013
649,0.3013
650,0.3013
651,0.3013
652,0.3013
653,0.3013
654,0.3013
655,0.3013
656,0.3013
657,0.3013
658,0.3013
659,0.3013
660,0.3013
661,0.3013
662,0.3061
663,0.33505999999999997
664,0.36749
665,0.39537
666,0.40744
667,0.40955
668,0.42596000000000006
669,0.4694
670,0.56675
671,0.66461
672,0.75774
673,0.82531
674,0.8928799999999999
675,0.9508
676,0.9508
677,0.9508
678,0.9442
679,0.91765
680,0.8853
681,0.8583700000000001
682,0.8438899999999999
683,0.84255
684,0.84255
685,0.84255
686,0.84255
687,0.84529
688,0.8535799999999999
689,0.8873700000000001
690,0.92115
691,0.94785
692,0.9502700000000001
693,0.9508
694,0.9508
695,0.9508
696,0.9508
697,0.9508
698,0.9508
699,0.9508
700,0.95605
701,0.96804
702,1.0018
703,1.034
704,1.0591
705,1.0591
706,1.0591
707,1.0501
708,1.0212
709,0.98803
710,0.96326
711,0.95119
712,0.9508
713,0.94326
714,0.9273600000000001
715,0.8935700000000001
716,0.8597899999999999
717,0.826
718,0.79222
719,0.75843
720,0.74395
721,0.77774
722,0.81152
723,0.83491
724,0.84215
725,0.84255
726,0.84255
727,0.84255
728,0.84255
729,0.8352700000000001
730,0.8198
731,0.78601
732,0.7522300000000001
733,0.71844
734,0.68466
735,0.65087
736,0.6170899999999999
737,0.5833
738,0.54952
739,0.5042800000000001
740,0.44609
741,0.37851999999999997
742,0.32076
743,0.27234
744,0.23855
745,0.19814
746,0.14892
747,0.4374
748,0.10910999999999998
749,-0.16246
750,-0.33139
751,-0.50031
752,-0.13998
753,-0.17376
754,-0.20755
755,-0.24133000000000002
756,-0.27512
757,-0.3089
758,-0.33308000000000004
759,-0.34820999999999996
760,-0.34820999999999996
761,-0.35378000000000004
762,-0.36958
763,-0.40336
764,-0.43715
765,-0.48541000000000006
766,-0.55299
767,-0.62056
768,-0.67394
769,-0.71433
770,-0.74811
771,-0.7819
772,-0.8156800000000001
773,-0.8494700000000001
774,-0.87424
775,-0.88946
776,-0.88946
777,-0.88946
778,-0.88946
779,-0.88946
780,-0.88946
781,-0.88946
782,-0.88946
783,-0.88946
784,-0.88946
785,-0.88946
786,-0.88946
787,-0.9016799999999999
788,-0.92324
789,-0.9570299999999999
790,-0.9908100000000001
791,-1.0246
792,-1.0584
793,-1.0877
794,-1.0859999999999999
795,-1.0522
796,-1.0184
797,-1.0018
798,-0.99771
799,-0.99771
800,-0.99771
801,-0.99771
802,-0.99771
803,-1.0094
804,-1.0308
805,-1.0646
806,-1.0918
807,-1.1059999999999999
808,-1.1059999999999999
809,-1.1059999999999999
810,-1.048
811,-0.9466899999999999
812,-0.8453299999999999
813,-0.8159
814,-0.8274
815,-0.86119
816,-0.92522
817,-1.0074
818,-1.1087
819,-1.2101
820,-1.3114
821,-1.4128
822,-1.5141
823,-1.6155
824,-1.7169
825,-1.8182
826,-1.858
827,-1.8637
828,-1.8637
829,-1.8637
830,-1.8637
831,-1.8637
832,-1.8491
833,-1.8251
834,-1.7913
835,-1.7575
836,-1.7237
837,-1.69
838,-1.6562
839,-1.6224
840,-1.5886
841,-1.5548
842,-1.4783
843,-1.3838
844,-1.2825
845,-1.2177
846,-1.1694
847,-1.1356
848,-1.1156
849,-1.1059999999999999
850,-1.1059999999999999
851,-1.1059999999999999
852,-1.1059999999999999
853,-1.1059999999999999
854,-1.1059999999999999
855,-1.1059999999999999
856,-1.1059999999999999
857,-1.1059999999999999
858,-1.0842
859,-1.0549
860,-1.0212
861,-0.9873700000000001
862,-0.9535799999999999
863,-0.9198
864,-0.8860100000000001
865,-0.8522299999999999
866,-0.81911
867,-0.79015
868,-0.7812100000000001
869,-0.7812100000000001
870,-0.7812100000000001
871,-0.7562
872,-0.7239800000000001
873,-0.69019
874,-0.65641
875,-0.62262
876,-0.5888399999999999
877,-0.55505
878,-0.52127
879,-0.48636999999999997
880,-0.44293000000000005
881,-0.38337
882,-0.31473
883,-0.24233000000000002
884,-0.12136
885,0.099549
886,0.14892
887,0.33504
888,0.53228
889,0.7349899999999999
890,0.9591200000000001
891,1.1901
892,1.4266
893,1.663
894,1.8995
895,2.1289
896,2.3292
897,2.4298
898,2.4973
899,2.5649
900,2.5456
901,2.5118
902,2.478
903,2.3675
904,2.2429
905,2.1091
906,1.9933
907,1.8864
908,1.7851
909,1.6837
910,1.5824
911,1.4809999999999999
912,1.3797
913,1.2783
914,1.177
915,1.0756
916,0.94475
917,0.81083
918,0.6745800000000001
919,0.51531
920,0.35025
921,0.18646
922,0.28726999999999997
923,-0.26933
924,-0.15637
925,-0.23842
926,-0.28131999999999996
927,-0.31423
928,-0.3456
929,-0.34820999999999996
930,-0.34820999999999996
931,-0.34754
932,-0.31858000000000003
933,-0.28684
934,-0.25025
935,-0.19475
936,-0.13101
937,-0.28657
938,0.051284
939,0.38914
940,0.14914000000000002
941,0.24566999999999997
942,0.43713
943,0.63984
944,0.84255
