time,value
0,-0.45492
1,-0.39161999999999997
2,-0.21589
3,0.019738
4,0.27702
5,0.53595
6,0.77978
7,1.0058
8,1.2261
9,1.4189
10,1.4385
11,1.3877
12,1.4238
13,1.4474
14,1.4136
15,1.2773
16,1.0088
17,0.78994
18,0.55419
19,0.30912
20,0.035081
21,-0.21066
22,-0.42643000000000003
23,-0.48007
24,-0.42646000000000006
25,-0.29003
26,-0.08797200000000001
27,0.1361
28,0.37209000000000003
29,0.62129
30,0.8552299999999999
31,1.0825
32,1.2990000000000002
33,1.367
34,1.2832
35,1.3442
36,1.3902
37,1.3694
38,1.3748
39,1.3409
40,1.3941
41,1.2805
42,1.1294
43,0.90238
44,0.6593399999999999
45,0.38904
46,0.17273
47,-0.033872
48,-0.24925999999999998
49,-0.38858000000000004
50,-1.0819
51,-1.0819
52,-1.0819
53,-1.0819
54,-1.0819
55,-1.0819
56,-1.0819
57,-1.0819
58,-1.0819
59,-1.0819
60,-1.0819
61,-1.0819
62,-1.0819
63,-1.0819
64,-1.0819
65,-1.0819
66,-1.0819
67,-1.0819
68,-1.0819
69,-1.0819
70,-1.0819
71,-1.0819
72,-1.0819
73,-1.0819
74,-1.0819
75,-1.0819
76,-1.0819
77,-1.0819
78,-1.0819
79,-1.0819
