time,value
0,-0.86631
1,-0.80955
2,-0.80955
3,-0.86631
4,-0.80955
5,-0.6392800000000001
6,1.4039
7,1.4039
8,1.6877
9,1.4039
10,1.4039
11,-0.52577
12,-0.75279
13,-0.86631
14,-0.80955
15,-0.6392800000000001
16,1.4039
17,1.4039
18,1.1769
19,1.4039
20,0.94986
21,1.1769
22,1.1769
23,1.1769
24,1.1769
25,0.94986
26,1.1769
27,0.94986
28,-0.86631
29,-0.80955
30,-0.80955
31,-0.86631
32,-0.80955
33,-0.80955
34,-0.86631
35,-0.80955
36,-0.80955
37,-0.86631
38,-0.80955
39,-0.80955
40,-0.80955
41,-0.86631
42,-0.80955
43,-0.80955
44,-0.86631
45,-0.80955
46,-0.18524000000000002
47,1.4039
48,1.4039
49,1.4039
50,1.6877
51,1.4039
52,-0.52577
53,-0.75279
54,-0.80955
55,-0.86631
56,-0.80955
57,1.6877
58,1.4039
59,1.1769
60,1.1769
61,1.1769
62,1.1769
63,1.1769
64,1.1769
65,1.1769
66,1.1769
67,0.94986
68,0.49582
69,-0.75279
70,-0.80955
71,-0.80955
72,-0.86631
73,-0.80955
74,-0.80955
75,-0.80955
76,-0.86631
77,-0.80955
78,-0.80955
79,-0.86631
80,-0.80955
81,-0.80955
82,-0.86631
83,-0.80955
84,-0.80955
85,-0.80955
86,0.7228399999999999
87,1.4039
88,1.4039
89,1.6877
90,1.4039
91,0.7228399999999999
92,-0.6392800000000001
93,-0.80955
94,-0.86631
95,-0.80955
96,0.32555
97,1.4039
98,1.1769
99,1.1769
100,1.1769
101,1.1769
102,1.1769
103,1.1769
104,1.1769
105,1.1769
106,0.94986
107,0.94986
108,-0.69604
109,-0.86631
110,-0.80955
111,-0.80955
112,-0.86631
113,-0.80955
114,-0.80955
115,-0.80955
116,-0.86631
117,-0.80955
118,-0.80955
119,-0.86631
120,-0.80955
121,-0.80955
122,-0.86631
123,-0.80955
124,-0.80955
125,-0.86631
126,-0.80955
127,-0.80955
128,1.6877
129,1.4039
130,1.4039
131,1.4039
132,1.6877
133,0.15529
134,-0.80955
135,-0.80955
136,-0.86631
137,-0.80955
138,0.7228399999999999
139,1.4039
140,1.1769
141,1.1769
142,1.1769
143,1.1769
144,1.1769
145,1.1769
146,1.1769
147,0.94986
148,1.1769
149,1.1769
150,-0.41226
151,-0.80955
152,-0.80955
153,-0.86631
154,-0.80955
155,-0.80955
156,-0.86631
157,-0.80955
158,-0.80955
159,-0.80955
160,-0.86631
161,-0.80955
162,-0.80955
163,-0.86631
164,-0.80955
165,-0.80955
166,-0.86631
167,-0.80955
168,-0.80955
169,-0.86631
170,-0.52577
171,1.4039
172,1.4039
173,1.4039
174,1.4039
175,1.6877
176,-0.014977
177,-0.80955
178,-0.80955
179,-0.80955
180,-0.86631
181,0.94986
182,1.4039
183,1.1769
184,1.1769
185,1.1769
186,1.1769
187,1.1769
188,0.94986
189,1.1769
190,0.94986
191,1.1769
192,0.94986
193,0.32555
194,-0.80955
195,-0.86631
196,-0.80955
197,-0.80955
198,-0.80955
199,-0.86631
200,-0.80955
201,-0.80955
202,-0.86631
203,-0.80955
204,-0.80955
205,-0.86631
206,-0.80955
207,-0.80955
208,-0.86631
209,-0.80955
210,-0.80955
211,-0.86631
212,-0.80955
213,-0.80955
214,-0.014977
215,1.4039
216,1.4039
217,1.4039
218,1.4039
219,1.4039
220,-0.6392800000000001
221,-0.75279
222,-0.86631
223,-0.80955
224,-0.6392800000000001
225,1.4039
226,1.4039
227,1.1769
228,1.1769
229,1.1769
230,1.1769
231,1.1769
232,0.94986
233,1.1769
234,1.1769
235,0.94986
236,1.1769
237,-0.52577
238,-0.80955
239,-0.80955
240,-0.86631
241,-0.80955
242,-0.80955
243,-0.80955
244,-0.86631
245,-0.80955
246,-0.80955
247,-0.86631
248,-0.80955
249,-0.80955
250,-0.86631
251,-0.80955
252,-0.80955
253,-0.86631
254,-0.80955
255,-0.80955
256,-0.86631
257,-0.80955
258,-0.80955
259,0.49582
260,1.4039
261,1.4039
262,1.4039
263,1.4039
264,1.6877
265,0.7228399999999999
266,-0.75279
267,-0.80955
268,-0.86631
269,-0.80955
270,0.32555
271,1.1769
272,1.4039
273,1.1769
274,1.1769
275,1.1769
276,1.1769
277,0.94986
278,1.1769
279,1.1769
280,0.94986
281,1.1769
282,0.7228399999999999
283,-0.69604
284,-0.80955
285,-0.80955
286,-0.86631
287,-0.80955
288,-0.80955
289,-0.86631
290,-0.80955
291,-0.80955
292,-0.86631
293,-0.80955
294,-0.80955
295,-0.86631
296,-0.80955
297,-0.80955
298,-0.80955
299,-0.86631
300,-0.80955
301,-0.80955
302,-0.86631
303,-0.80955
304,-0.80955
305,-0.86631
306,-0.80955
307,-0.80955
308,-0.86631
309,1.4039
310,1.4039
311,1.4039
312,1.6877
313,1.4039
314,1.4039
315,1.6877
316,1.1769
317,1.1769
318,1.1769
319,1.1769
320,1.1769
321,1.1769
322,0.94986
323,1.1769
324,1.1769
325,0.7228399999999999
326,-0.80955
327,-0.80955
328,-0.86631
329,-0.80955
330,-0.80955
331,-0.86631
332,-0.80955
333,-0.80955
334,-0.86631
335,-0.80955
336,-0.80955
337,-0.86631
338,-0.80955
339,-0.80955
340,-0.86631
341,-0.80955
342,-0.80955
343,-0.86631
344,-0.80955
345,-0.80955
346,-0.80955
347,-0.86631
348,-0.80955
349,-0.80955
350,-0.86631
351,-0.80955
352,-0.80955
353,-0.52577
354,1.4039
355,1.1769
356,1.4039
357,1.1769
358,1.4039
359,1.4039
360,1.6877
361,1.4039
362,1.4039
363,1.4039
364,1.1769
365,1.1769
366,1.1769
367,1.1769
368,0.94986
369,1.1769
370,0.49582
371,-0.69604
372,-0.86631
373,-0.80955
374,-0.80955
375,-0.86631
376,-0.80955
377,-0.80955
378,-0.86631
379,-0.80955
380,-0.80955
381,-0.86631
382,-0.80955
383,-0.80955
384,-0.86631
385,-0.80955
386,-0.80955
387,-0.86631
388,-0.80955
389,-0.80955
390,-0.86631
391,-0.80955
392,-0.80955
393,-0.86631
394,-0.80955
395,-0.80955
396,-0.86631
397,-0.41226
398,1.4039
399,1.4039
400,1.1769
401,1.1769
402,1.1769
403,1.1769
404,1.1769
405,1.4039
406,1.4039
407,1.4039
408,1.4039
409,1.4039
410,1.6877
411,0.49582
412,-0.69604
413,-0.80955
414,-0.86631
415,-0.80955
416,-0.80955
417,-0.86631
418,-0.80955
419,-0.80955
420,-0.86631
421,-0.80955
422,-0.80955
423,-0.86631
424,-0.29875
425,1.4039
426,1.1769
427,1.1769
428,1.1769
429,1.1769
430,1.1769
431,1.1769
432,1.1769
433,0.94986
434,1.1769
435,-0.18524000000000002
436,-0.75279
437,-0.80955
438,-0.86631
439,-0.80955
440,-0.80955
441,-0.86631
442,-0.80955
443,-0.80955
444,-0.86631
445,-0.80955
446,-0.80955
447,-0.86631
448,-0.80955
449,-0.80955
450,-0.86631
451,-0.80955
452,-0.80955
453,-0.86631
454,-0.80955
455,-0.80955
456,-0.86631
457,-0.80955
458,0.94986
459,1.4039
460,1.4039
461,1.6877
462,1.4039
463,1.4039
464,0.15529
465,-0.80955
466,-0.80955
467,-0.80955
468,-0.86631
469,0.94986
470,1.1769
471,1.4039
472,1.1769
473,1.1769
474,1.1769
475,1.1769
476,0.94986
477,1.1769
478,1.1769
479,1.1769
480,0.94986
481,0.15529
482,-0.80955
483,-0.86631
484,-0.80955
485,-0.80955
486,-0.86631
487,-0.80955
488,-0.80955
489,-0.86631
490,-0.80955
491,-0.80955
492,-0.86631
493,-0.80955
494,-0.80955
495,-0.86631
496,-0.80955
497,-0.80955
498,-0.86631
499,-0.80955
500,-0.80955
501,-0.86631
502,-0.80955
503,-0.80955
504,-0.86631
505,-0.80955
506,-0.80955
507,-0.86631
508,-0.80955
509,-0.80955
510,-0.86631
511,0.49582
512,1.4039
513,1.4039
514,1.6877
515,1.4039
516,1.4039
517,1.4039
518,1.4039
519,1.4039
520,1.1769
521,1.1769
522,1.1769
523,0.94986
524,1.1769
525,1.1769
526,0.94986
527,1.1769
528,1.1769
529,-0.014977
530,-0.75279
531,-0.80955
532,-0.80955
533,-0.86631
534,-0.80955
535,-0.80955
536,-0.86631
537,-0.80955
538,-0.80955
539,-0.86631
540,-0.80955
541,-0.80955
542,-0.86631
543,-0.80955
544,-0.80955
545,-0.86631
546,-0.80955
547,-0.80955
548,-0.86631
549,-0.80955
550,-0.80955
551,-0.86631
552,-0.80955
553,-0.80955
554,-0.86631
555,-0.80955
556,-0.80955
557,-0.86631
558,-0.80955
559,0.94986
560,1.4039
561,1.1769
562,1.1769
563,1.1769
564,1.1769
565,1.1769
566,1.1769
567,1.1769
568,1.4039
569,1.4039
570,1.4039
571,1.4039
572,0.94986
573,-0.75279
574,-0.80955
575,-0.86631
576,-0.80955
577,-0.80955
578,-0.86631
579,-0.80955
580,-0.6392800000000001
581,1.4039
582,1.1769
583,1.4039
584,0.94986
585,1.1769
586,1.1769
587,1.1769
588,0.94986
589,1.1769
590,-0.29875
591,-0.75279
592,-0.86631
593,-0.80955
594,-0.80955
595,-0.86631
596,-0.80955
597,-0.80955
598,-0.86631
599,-0.80955
600,-0.80955
601,-0.86631
602,-0.80955
603,-0.75279
604,-0.86631
605,-0.80955
606,-0.80955
607,-0.86631
608,-0.75279
609,-0.80955
610,-0.41226
611,1.4039
612,1.4039
613,1.4039
614,1.4039
615,1.6877
616,1.4039
617,0.7228399999999999
618,-0.6392800000000001
619,-0.80955
620,-0.86631
621,-0.80955
622,-0.014977
623,1.4039
624,1.1769
625,1.4039
626,0.94986
627,1.1769
628,1.1769
629,0.94986
630,1.1769
631,1.1769
632,0.94986
633,0.94986
634,-0.29875
635,-0.75279
636,-0.86631
637,-0.80955
638,-0.80955
639,-0.86631
640,-0.80955
641,-0.80955
642,-0.86631
643,-0.80955
644,-0.80955
645,-0.86631
646,-0.80955
647,-0.80955
648,-0.86631
649,-0.80955
650,-0.80955
651,-0.86631
652,-0.80955
653,-0.80955
654,-0.86631
655,-0.75279
656,-0.80955
657,-0.80955
658,-0.80955
659,0.32555
660,1.4039
661,1.4039
662,1.4039
663,1.4039
664,1.4039
665,1.4039
666,0.15529
667,-0.69604
668,-0.80955
669,-0.86631
670,-0.80955
671,0.94986
672,1.4039
673,1.1769
674,1.1769
675,1.1769
676,1.1769
677,1.1769
678,1.1769
679,0.94986
680,1.1769
681,1.1769
682,0.94986
683,0.94986
684,-0.80955
685,-0.80955
686,-0.80955
687,-0.86631
688,-0.80955
689,-0.80955
690,-0.80955
691,-0.86631
692,-0.80955
693,-0.86631
694,-0.80955
695,-0.80955
696,-0.80955
697,-0.86631
698,-0.80955
699,-0.80955
700,-0.86631
701,-0.80955
702,-0.80955
703,-0.86631
704,-0.80955
705,-0.80955
706,-0.86631
707,-0.80955
708,-0.80955
709,-0.86631
710,-0.80955
711,-0.80955
712,-0.86631
713,-0.80955
714,-0.80955
715,0.94986
716,1.4039
717,1.4039
718,1.6877
719,1.4039
