time,value
0,0.81387
1,0.7803899999999999
2,0.55357
3,0.22328
4,-0.11567000000000001
5,-0.38459
6,-0.51339
7,-0.58027
8,-0.70418
9,-0.9069799999999999
10,-1.2129
11,-1.5419
12,-1.7959
13,-1.8358
14,-1.5336
15,-0.92351
16,-0.10677
17,0.72144
18,1.3569
19,1.6233
20,1.4985
21,1.0724
22,0.44886000000000004
23,-0.12376
24,-0.53273
25,-0.69513
26,-0.5714600000000001
27,-0.26226
28,0.075785
29,0.33389
30,0.52847
31,0.65063
32,0.7252
33,0.78185
34,0.89615
35,1.028
36,1.0879
37,0.9767
38,0.6533899999999999
39,0.14908
40,-0.4564
41,-1.0124
42,-1.3569
43,-1.4773
44,-1.3748
45,-1.1568
46,-0.9693299999999999
47,-0.90569
48,-1.0489
49,-1.3069
50,-1.5541
51,-1.6547
52,-1.4899
53,-1.0094
54,-0.30562
55,0.44259
56,1.0607
57,1.4309
58,1.5845
59,1.5755
60,1.5349
61,1.6271
62,1.8731
63,2.2069
64,2.4329
65,2.3542
66,1.8058
67,0.79381
68,-0.48315
69,-1.7647
70,-2.7771
71,-3.2988
72,-3.2453
73,-2.7302
74,-1.9126
75,-1.0233
76,-0.27657
77,0.19851
78,0.40362
79,0.41303999999999996
80,0.30191
81,0.19657
82,0.13810999999999998
83,0.10632
84,0.082703
85,0.056326
86,0.062556
87,0.16838
88,0.37901
89,0.71057
90,1.1283
91,1.5107
92,1.7164
93,1.5978
94,1.1779
95,0.5346
96,-0.15972
97,-0.71805
98,-0.9426899999999999
99,-0.78564
100,-0.32358000000000003
101,0.24229
102,0.6392100000000001
103,0.65362
104,0.27602
105,-0.37101999999999996
106,-1.0158
107,-1.4419
108,-1.4608
109,-1.0159
110,-0.25261999999999996
111,0.57614
112,1.1742
113,1.4241
114,1.2543
115,0.74115
116,0.11834000000000001
117,-0.37669
118,-0.5787100000000001
119,-0.4465
120,-0.1718
121,0.05708099999999999
122,0.062411
123,-0.21422
124,-0.70423
125,-1.1854
126,-1.3824
127,-1.1708
128,-0.56802
129,0.24070999999999998
130,0.9959
131,1.4201
132,1.4068
133,0.97467
134,0.31601999999999997
135,-0.29619
136,-0.64783
137,-0.60324
138,-0.24327
139,0.23546
140,0.59439
141,0.6876899999999999
142,0.44361999999999996
143,0.011064000000000001
144,-0.45148
145,-0.69739
146,-0.6301100000000001
147,-0.29229
148,0.16427
149,0.59465
150,0.81587
151,0.76669
152,0.53768
153,0.30906
154,0.20745999999999998
155,0.32001999999999997
156,0.6008
157,0.92011
158,1.0673
159,0.9069799999999999
160,0.43343000000000004
161,-0.29593
162,-1.1373
163,-1.8999
164,-2.4417
165,-2.7027
166,-2.6837
167,-2.3748
168,-1.8366
169,-1.2119
170,-0.52976
171,0.17002
172,0.79347
173,1.2347
174,1.4845
175,1.473
176,1.2421
177,0.89331
178,0.53566
179,0.33269
180,0.36573
181,0.62405
182,1.0256
183,1.3345
184,1.3851
185,1.112
186,0.53567
187,-0.18241
188,-0.8014600000000001
189,-1.0949
190,-0.97569
191,-0.53055
192,0.06214
193,0.56798
194,0.8024399999999999
195,0.63151
196,0.12805999999999998
197,-0.50479
198,-1.0164
199,-1.2334
200,-1.1426
201,-0.83173
202,-0.4213
203,-0.087863
204,0.082379
205,0.027233999999999998
206,-0.17267000000000002
207,-0.37504
208,-0.41745
209,-0.21561
210,0.1568
211,0.5954
212,0.9113
213,0.9375399999999999
214,0.57475
215,-0.060895000000000005
216,-0.7357899999999999
217,-1.1882
218,-1.2404
219,-0.8640200000000001
220,-0.17440999999999998
221,0.6702600000000001
222,1.3296
223,1.5692
224,1.4142
225,0.93176
226,0.35616
227,-0.040467
228,-0.13294
229,0.07215099999999999
230,0.48203999999999997
231,0.90685
232,1.0765
233,0.8443200000000001
234,0.24978000000000003
235,-0.53601
236,-1.3337
237,-1.8297
238,-1.9092
239,-1.5534
240,-0.8987700000000001
241,-0.11058
242,0.54303
243,0.88765
244,0.8481700000000001
245,0.51435
246,-0.034793
247,-0.6208100000000001
248,-1.0709
249,-1.2645
250,-1.1961
251,-0.86718
252,-0.29484
253,0.39943
254,1.0427
255,1.5404
256,1.8004
257,1.7741
258,1.4869999999999999
259,1.0565
260,0.57347
261,0.13346
262,-0.19979
263,-0.34060999999999997
264,-0.34115999999999996
265,-0.27434000000000003
266,-0.22005999999999998
267,-0.19677
268,-0.28464
269,-0.54779
270,-0.78764
271,-0.94096
272,-1.0170000000000001
273,-0.98331
274,-0.8207
275,-0.603
276,-0.33166
277,-0.028539
278,0.29958
279,0.60955
280,0.87454
281,1.057
282,1.0836
283,0.90649
284,0.57399
285,0.1843
286,-0.17265999999999998
287,-0.36052
288,-0.36068
289,-0.20295
290,0.010531
291,0.13963
292,0.057204
293,-0.30387
294,-0.8565799999999999
295,-1.4672
296,-1.9829
297,-2.1822
298,-1.9977
299,-1.4269999999999998
300,-0.6097600000000001
301,0.32964
302,1.179
303,1.7623
304,2.0077
305,1.9412
306,1.6796
307,1.2972
308,0.8750899999999999
309,0.5006
310,0.17705
311,-0.028622
312,-0.14385
313,-0.15433
314,-0.050323
315,0.13727999999999999
316,0.33397
317,0.39299
318,0.23074
319,-0.17090999999999998
320,-0.79648
321,-1.4965
322,-2.0663
323,-2.2785
324,-2.0275
325,-1.4158
326,-0.60511
327,0.15946
328,0.6496
329,0.73435
330,0.51644
331,0.191
332,-0.06655900000000001
333,-0.089848
334,0.2288
335,0.83857
336,1.5356
337,2.1207
338,2.3741
339,2.2274
340,1.7025
341,0.9265899999999999
342,0.036462
343,-0.80801
344,-1.4074
345,-1.7732
346,-1.9398
347,-1.9293
348,-1.7938
349,-1.5277
350,-1.1724
351,-0.70807
352,-0.16738
353,0.33348
354,0.74995
355,0.98331
356,1.0182
357,0.8625200000000001
358,0.66076
359,0.53996
360,0.56908
361,0.76453
362,1.0307
363,1.2929
364,1.3571
365,1.1457
366,0.7164699999999999
367,0.20373
368,-0.29491999999999996
369,-0.63772
370,-0.70416
371,-0.61426
372,-0.52236
373,-0.4924
374,-0.61101
375,-0.8888299999999999
376,-1.1982
377,-1.4051
378,-1.3952
379,-1.0991
380,-0.49171000000000004
381,0.24301999999999999
382,0.8759399999999999
383,1.2924
384,1.3964
385,1.2392
386,0.9548200000000001
387,0.6612
388,0.42122
389,0.30784
390,0.30673
391,0.31098000000000003
392,0.17787999999999998
393,-0.055133
394,-0.35686999999999997
395,-0.6608
396,-0.86425
397,-0.8327600000000001
398,-0.5787
399,-0.19879000000000002
400,0.12102
401,0.27626
402,0.15709
403,-0.17574
404,-0.55803
405,-0.78698
406,-0.71454
407,-0.31051999999999996
408,0.33148
409,1.0186
410,1.4866
411,1.6016
412,1.2604
413,0.53979
414,-0.34608
415,-1.1292
416,-1.5928
417,-1.6569999999999998
418,-1.3247
419,-0.81795
420,-0.33308000000000004
421,0.010116
422,0.15087
423,0.083384
424,-0.065438
425,-0.1339
426,-0.042037
427,0.25217
428,0.67042
429,1.0411
430,1.2527
431,1.1989
432,0.8805299999999999
433,0.38334
434,-0.11180999999999999
435,-0.48343
436,-0.7330300000000001
437,-0.83973
438,-0.82516
439,-0.7843399999999999
440,-0.76566
441,-0.74554
442,-0.65487
443,-0.42607
444,-0.024169
445,0.47834
446,0.9794799999999999
447,1.3257
448,1.3822
449,1.1272
450,0.59495
451,-0.046407
452,-0.59927
453,-0.9033700000000001
454,-0.90165
455,-0.70605
456,-0.35531
457,-0.0077938999999999994
458,0.20965999999999999
459,0.26328
460,0.19582
461,0.08470499999999999
462,0.016291
463,0.10005
464,0.32143
465,0.60477
466,0.79266
467,0.77585
468,0.4537
469,-0.13072999999999999
470,-0.77636
471,-1.3008
472,-1.5296
473,-1.2865
474,-0.68267
475,0.12829000000000002
476,0.90765
477,1.4043
478,1.5022
479,1.2133
480,0.6492600000000001
481,0.039626
482,-0.40271999999999997
483,-0.50359
484,-0.23629
485,0.22760999999999998
486,0.6927
487,1.0121
488,1.0683
489,0.91219
490,0.65051
491,0.35913
492,0.10447999999999999
493,0.0054524
494,-0.0077442
495,-0.0037635999999999998
496,-0.065211
497,-0.2324
498,-0.49749
499,-0.8211
