time,value
0,-0.41413999999999995
1,-0.41413999999999995
2,-0.41413999999999995
3,-0.41413999999999995
4,-0.41413999999999995
5,-0.41413999999999995
6,-0.41413999999999995
7,-0.41413999999999995
8,0.038793
9,2.9829
10,2.6054
11,0.9446700000000001
12,-0.41413999999999995
13,-0.41413999999999995
14,-0.41413999999999995
15,-0.41413999999999995
16,-0.41413999999999995
17,-0.41413999999999995
18,-0.41413999999999995
19,-0.41413999999999995
20,-0.41413999999999995
21,-0.41413999999999995
22,-0.41413999999999995
23,-0.41413999999999995
24,-0.41413999999999995
25,-0.41413999999999995
26,-0.41413999999999995
27,-0.41413999999999995
28,0.9446700000000001
29,2.9829
30,2.6054
31,-0.41413999999999995
32,-0.41413999999999995
33,-0.41413999999999995
34,-0.41413999999999995
35,-0.41413999999999995
36,-0.41413999999999995
37,-0.41413999999999995
38,-0.41413999999999995
39,-0.41413999999999995
40,-0.41413999999999995
41,-0.41413999999999995
42,-0.41413999999999995
43,-0.41413999999999995
44,-0.41413999999999995
45,-0.41413999999999995
46,-0.41413999999999995
47,-0.41413999999999995
48,2.9829
49,2.6054
50,0.9446700000000001
51,-0.26316
52,-0.41413999999999995
53,-0.41413999999999995
54,-0.41413999999999995
55,-0.41413999999999995
56,-0.41413999999999995
57,-0.41413999999999995
58,-0.41413999999999995
59,-0.41413999999999995
60,-0.41413999999999995
61,-0.41413999999999995
62,-0.41413999999999995
63,-0.41413999999999995
64,-0.41413999999999995
65,-0.41413999999999995
66,-0.41413999999999995
67,0.34075
68,2.9829
69,2.6054
70,0.34075
71,-0.33865
72,-0.41413999999999995
73,-0.41413999999999995
74,-0.41413999999999995
75,-0.41413999999999995
76,-0.41413999999999995
77,-0.41413999999999995
78,-0.41413999999999995
79,-0.41413999999999995
80,-0.41413999999999995
81,-0.41413999999999995
82,-0.41413999999999995
83,-0.41413999999999995
84,-0.41413999999999995
85,-0.41413999999999995
86,-0.41413999999999995
87,-0.11219000000000001
88,2.9829
89,2.6054
90,0.9446700000000001
91,-0.41413999999999995
92,-0.41413999999999995
93,-0.41413999999999995
94,-0.41413999999999995
95,-0.41413999999999995
96,-0.41413999999999995
97,-0.41413999999999995
98,-0.41413999999999995
99,-0.41413999999999995
100,-0.41413999999999995
101,-0.41413999999999995
102,-0.41413999999999995
103,-0.41413999999999995
104,-0.41413999999999995
105,-0.41413999999999995
106,-0.41413999999999995
107,-0.41413999999999995
108,2.6054
109,2.9829
110,1.3976
111,-0.41413999999999995
112,-0.41413999999999995
113,-0.41413999999999995
114,-0.41413999999999995
115,-0.41413999999999995
116,-0.41413999999999995
117,-0.41413999999999995
118,-0.41413999999999995
119,-0.41413999999999995
120,-0.41413999999999995
121,-0.41413999999999995
122,-0.41413999999999995
123,-0.41413999999999995
124,-0.41413999999999995
125,-0.41413999999999995
126,-0.41413999999999995
127,-0.41413999999999995
128,0.18977
129,2.9829
130,2.6054
131,0.34075
132,-0.33865
133,-0.41413999999999995
134,-0.41413999999999995
135,-0.41413999999999995
136,-0.41413999999999995
137,-0.41413999999999995
138,-0.41413999999999995
139,-0.41413999999999995
140,-0.41413999999999995
141,-0.41413999999999995
142,-0.41413999999999995
143,-0.41413999999999995
144,-0.41413999999999995
145,-0.41413999999999995
146,-0.41413999999999995
147,-0.41413999999999995
148,-0.41413999999999995
149,1.1711
150,2.9829
151,2.6054
152,-0.26316
153,-0.41413999999999995
154,-0.41413999999999995
155,-0.41413999999999995
156,-0.41413999999999995
157,-0.41413999999999995
158,-0.41413999999999995
159,-0.41413999999999995
160,-0.41413999999999995
161,-0.41413999999999995
162,-0.41413999999999995
163,-0.41413999999999995
164,-0.41413999999999995
165,-0.41413999999999995
166,-0.41413999999999995
167,-0.41413999999999995
168,-0.41413999999999995
169,-0.41413999999999995
170,2.0015
171,2.9829
172,1.6996
173,-0.41413999999999995
174,-0.41413999999999995
175,-0.41413999999999995
176,-0.41413999999999995
177,-0.41413999999999995
178,-0.41413999999999995
179,-0.41413999999999995
180,-0.41413999999999995
181,-0.41413999999999995
182,-0.41413999999999995
183,-0.41413999999999995
184,-0.41413999999999995
185,-0.41413999999999995
186,-0.41413999999999995
187,-0.41413999999999995
188,-0.41413999999999995
189,-0.41413999999999995
190,-0.41413999999999995
191,2.9829
192,2.6054
193,1.1711
194,-0.26316
195,-0.41413999999999995
196,-0.41413999999999995
197,-0.41413999999999995
198,-0.41413999999999995
199,-0.41413999999999995
200,-0.41413999999999995
201,-0.41413999999999995
202,-0.41413999999999995
203,-0.41413999999999995
204,-0.41413999999999995
205,-0.41413999999999995
206,-0.41413999999999995
207,-0.41413999999999995
208,-0.41413999999999995
209,-0.41413999999999995
210,-0.41413999999999995
211,-0.41413999999999995
212,2.9829
213,2.9829
214,0.9446700000000001
215,-0.41413999999999995
216,-0.41413999999999995
217,-0.41413999999999995
218,-0.41413999999999995
219,-0.41413999999999995
220,-0.41413999999999995
221,-0.41413999999999995
222,-0.41413999999999995
223,-0.41413999999999995
224,-0.41413999999999995
225,-0.41413999999999995
226,-0.41413999999999995
227,-0.41413999999999995
228,-0.41413999999999995
229,-0.41413999999999995
230,-0.41413999999999995
231,-0.41413999999999995
232,-0.41413999999999995
233,2.9829
234,2.9829
235,0.49173
236,-0.26316
237,-0.41413999999999995
238,-0.41413999999999995
239,-0.41413999999999995
240,-0.41413999999999995
241,-0.41413999999999995
242,-0.41413999999999995
243,-0.41413999999999995
244,-0.41413999999999995
245,-0.41413999999999995
246,-0.41413999999999995
247,-0.41413999999999995
248,-0.41413999999999995
249,-0.41413999999999995
250,-0.41413999999999995
251,-0.41413999999999995
252,-0.41413999999999995
253,1.1711
254,2.9829
255,2.6054
256,-0.18767999999999999
257,-0.41413999999999995
258,-0.41413999999999995
259,-0.41413999999999995
260,-0.41413999999999995
261,-0.41413999999999995
262,-0.41413999999999995
263,-0.41413999999999995
264,-0.41413999999999995
265,-0.41413999999999995
266,-0.41413999999999995
267,-0.41413999999999995
268,-0.41413999999999995
269,-0.41413999999999995
270,-0.41413999999999995
271,-0.41413999999999995
272,-0.41413999999999995
273,-0.41413999999999995
274,2.9829
275,2.6054
276,0.9446700000000001
277,-0.33865
278,-0.41413999999999995
279,-0.41413999999999995
280,-0.41413999999999995
281,-0.41413999999999995
282,-0.41413999999999995
283,-0.41413999999999995
284,-0.41413999999999995
285,-0.41413999999999995
286,-0.41413999999999995
287,-0.41413999999999995
288,-0.41413999999999995
289,-0.41413999999999995
290,-0.41413999999999995
291,-0.41413999999999995
292,-0.41413999999999995
293,-0.41413999999999995
294,2.0015
295,2.9829
296,1.3976
297,-0.33865
298,-0.41413999999999995
299,-0.41413999999999995
300,-0.41413999999999995
301,-0.41413999999999995
302,-0.41413999999999995
303,-0.41413999999999995
304,-0.41413999999999995
305,-0.41413999999999995
306,-0.41413999999999995
307,-0.41413999999999995
308,-0.41413999999999995
309,-0.41413999999999995
310,-0.41413999999999995
311,-0.41413999999999995
312,-0.41413999999999995
313,-0.41413999999999995
314,2.9829
315,2.6054
316,0.9446700000000001
317,-0.33865
318,-0.41413999999999995
319,-0.41413999999999995
320,-0.41413999999999995
321,-0.41413999999999995
322,-0.41413999999999995
323,-0.41413999999999995
324,-0.41413999999999995
325,-0.41413999999999995
326,-0.41413999999999995
327,-0.41413999999999995
328,-0.41413999999999995
329,-0.41413999999999995
330,-0.41413999999999995
331,-0.41413999999999995
332,-0.41413999999999995
333,0.49173
334,2.9829
335,2.6054
336,0.038793
337,-0.41413999999999995
338,-0.41413999999999995
339,-0.41413999999999995
340,-0.41413999999999995
341,-0.41413999999999995
342,-0.41413999999999995
343,-0.41413999999999995
344,-0.41413999999999995
345,-0.41413999999999995
346,-0.41413999999999995
347,-0.41413999999999995
348,-0.41413999999999995
349,-0.41413999999999995
350,-0.41413999999999995
351,-0.41413999999999995
352,0.038793
353,2.9829
354,2.9829
355,0.18977
356,-0.33865
357,-0.41413999999999995
358,-0.41413999999999995
359,-0.41413999999999995
360,-0.41413999999999995
361,-0.41413999999999995
362,-0.41413999999999995
363,-0.41413999999999995
364,-0.41413999999999995
365,-0.41413999999999995
366,-0.41413999999999995
367,-0.41413999999999995
368,-0.41413999999999995
369,-0.41413999999999995
370,-0.41413999999999995
371,0.49173
372,2.9829
373,2.9829
374,-0.18767999999999999
375,-0.41413999999999995
376,-0.41413999999999995
377,-0.41413999999999995
378,-0.41413999999999995
379,-0.41413999999999995
380,-0.41413999999999995
381,-0.41413999999999995
382,-0.41413999999999995
383,-0.41413999999999995
384,-0.41413999999999995
385,-0.41413999999999995
386,-0.41413999999999995
387,-0.41413999999999995
388,-0.41413999999999995
389,-0.41413999999999995
390,2.0015
391,2.9829
392,1.6996
393,-0.18767999999999999
394,-0.41413999999999995
395,-0.41413999999999995
396,-0.41413999999999995
397,-0.41413999999999995
398,-0.41413999999999995
399,-0.41413999999999995
400,-0.41413999999999995
401,-0.41413999999999995
402,-0.41413999999999995
403,-0.41413999999999995
404,-0.41413999999999995
405,-0.41413999999999995
406,-0.41413999999999995
407,-0.41413999999999995
408,0.18977
409,2.9829
410,2.9829
411,0.18977
412,-0.33865
413,-0.41413999999999995
414,-0.41413999999999995
415,-0.41413999999999995
416,-0.41413999999999995
417,-0.41413999999999995
418,-0.41413999999999995
419,-0.41413999999999995
420,-0.41413999999999995
421,-0.41413999999999995
422,-0.41413999999999995
423,-0.41413999999999995
424,-0.41413999999999995
425,-0.41413999999999995
426,-0.41413999999999995
427,2.6054
428,2.9829
429,1.3976
430,-0.33865
431,-0.41413999999999995
432,-0.41413999999999995
433,-0.41413999999999995
434,-0.41413999999999995
435,-0.41413999999999995
436,-0.41413999999999995
437,-0.41413999999999995
438,-0.41413999999999995
439,-0.41413999999999995
440,-0.41413999999999995
441,-0.41413999999999995
442,-0.41413999999999995
443,-0.41413999999999995
444,-0.41413999999999995
445,2.0015
446,2.9829
447,1.6996
448,-0.33865
449,-0.41413999999999995
450,-0.41413999999999995
451,-0.41413999999999995
452,-0.41413999999999995
453,-0.41413999999999995
454,-0.41413999999999995
455,-0.41413999999999995
456,-0.41413999999999995
457,-0.41413999999999995
458,-0.41413999999999995
459,-0.41413999999999995
460,-0.41413999999999995
461,-0.41413999999999995
462,-0.41413999999999995
463,1.3976
464,2.9829
465,2.6054
466,-0.41413999999999995
467,-0.41413999999999995
468,-0.41413999999999995
469,-0.41413999999999995
470,-0.41413999999999995
471,-0.41413999999999995
472,-0.41413999999999995
473,-0.41413999999999995
474,-0.41413999999999995
475,-0.41413999999999995
476,-0.41413999999999995
477,-0.41413999999999995
478,-0.41413999999999995
479,-0.41413999999999995
480,-0.41413999999999995
481,0.34075
482,2.9829
483,2.6054
484,0.49173
485,-0.33865
486,-0.41413999999999995
487,-0.41413999999999995
488,-0.41413999999999995
489,-0.41413999999999995
490,-0.41413999999999995
491,-0.41413999999999995
492,-0.41413999999999995
493,-0.41413999999999995
494,-0.41413999999999995
495,-0.41413999999999995
496,-0.41413999999999995
497,-0.41413999999999995
498,-0.41413999999999995
499,0.7182
500,2.9829
501,2.6054
502,0.18977
503,-0.41413999999999995
504,-0.41413999999999995
505,-0.41413999999999995
506,-0.41413999999999995
507,-0.41413999999999995
508,-0.41413999999999995
509,-0.41413999999999995
510,-0.41413999999999995
511,-0.41413999999999995
512,-0.41413999999999995
513,-0.41413999999999995
514,-0.41413999999999995
515,-0.41413999999999995
516,-0.41413999999999995
517,0.18977
518,2.9829
519,2.6054
520,0.7182
521,-0.41413999999999995
522,-0.41413999999999995
523,-0.41413999999999995
524,-0.41413999999999995
525,-0.41413999999999995
526,-0.41413999999999995
527,-0.41413999999999995
528,-0.41413999999999995
529,-0.41413999999999995
530,-0.41413999999999995
531,-0.41413999999999995
532,-0.41413999999999995
533,-0.41413999999999995
534,-0.41413999999999995
535,-0.41413999999999995
536,1.6996
537,2.6054
538,2.6054
539,-0.33865
540,-0.41413999999999995
541,-0.41413999999999995
542,-0.41413999999999995
543,-0.41413999999999995
544,-0.41413999999999995
545,-0.41413999999999995
546,-0.41413999999999995
547,-0.41413999999999995
548,-0.41413999999999995
549,-0.41413999999999995
550,-0.41413999999999995
551,-0.41413999999999995
552,-0.41413999999999995
553,-0.41413999999999995
554,1.3976
555,2.9829
556,2.3035
557,-0.33865
558,-0.41413999999999995
559,-0.41413999999999995
560,-0.41413999999999995
561,-0.41413999999999995
562,-0.41413999999999995
563,-0.41413999999999995
564,-0.41413999999999995
565,-0.41413999999999995
566,-0.41413999999999995
567,-0.41413999999999995
568,-0.41413999999999995
569,-0.41413999999999995
570,-0.41413999999999995
571,-0.41413999999999995
572,-0.41413999999999995
573,2.9829
574,2.9829
575,0.9446700000000001
576,-0.26316
577,-0.41413999999999995
578,-0.41413999999999995
579,-0.41413999999999995
580,-0.41413999999999995
581,-0.41413999999999995
582,-0.41413999999999995
583,-0.41413999999999995
584,-0.41413999999999995
585,-0.41413999999999995
586,-0.41413999999999995
587,-0.41413999999999995
588,-0.41413999999999995
589,-0.41413999999999995
590,0.34075
591,2.9829
592,2.6054
593,0.49173
594,-0.41413999999999995
595,-0.41413999999999995
596,-0.41413999999999995
597,-0.41413999999999995
598,-0.41413999999999995
599,-0.41413999999999995
600,-0.41413999999999995
601,-0.41413999999999995
602,-0.41413999999999995
603,-0.41413999999999995
604,-0.41413999999999995
605,-0.41413999999999995
606,-0.41413999999999995
607,-0.41413999999999995
608,0.34075
609,2.9829
610,2.6054
611,0.34075
612,-0.33865
613,-0.41413999999999995
614,-0.41413999999999995
615,-0.41413999999999995
616,-0.41413999999999995
617,-0.41413999999999995
618,-0.41413999999999995
619,-0.41413999999999995
620,-0.41413999999999995
621,-0.41413999999999995
622,-0.41413999999999995
623,-0.41413999999999995
624,-0.41413999999999995
625,-0.41413999999999995
626,-0.41413999999999995
627,2.0015
628,2.6054
629,2.3035
630,-0.26316
631,-0.41413999999999995
632,-0.41413999999999995
633,-0.41413999999999995
634,-0.41413999999999995
635,-0.41413999999999995
636,-0.41413999999999995
637,-0.41413999999999995
638,-0.41413999999999995
639,-0.41413999999999995
640,-0.41413999999999995
641,-0.41413999999999995
642,-0.41413999999999995
643,-0.41413999999999995
644,-0.41413999999999995
645,-0.41413999999999995
646,2.6054
647,2.6054
648,1.6996
649,-0.41413999999999995
650,-0.41413999999999995
651,-0.41413999999999995
652,-0.41413999999999995
653,-0.41413999999999995
654,-0.41413999999999995
655,-0.41413999999999995
656,-0.41413999999999995
657,-0.41413999999999995
658,-0.41413999999999995
659,-0.41413999999999995
660,-0.41413999999999995
661,-0.41413999999999995
662,-0.41413999999999995
663,-0.41413999999999995
664,1.6996
665,2.6054
666,2.3035
667,-0.18767999999999999
668,-0.41413999999999995
669,-0.41413999999999995
670,-0.41413999999999995
671,-0.41413999999999995
672,-0.41413999999999995
673,-0.41413999999999995
674,-0.41413999999999995
675,-0.41413999999999995
676,-0.41413999999999995
677,-0.41413999999999995
678,-0.41413999999999995
679,-0.41413999999999995
680,-0.41413999999999995
681,-0.41413999999999995
682,-0.41413999999999995
683,2.9829
684,2.9829
685,0.7182
686,-0.41413999999999995
687,-0.41413999999999995
688,-0.41413999999999995
689,-0.41413999999999995
690,-0.41413999999999995
691,-0.41413999999999995
692,-0.41413999999999995
693,-0.41413999999999995
694,-0.41413999999999995
695,-0.41413999999999995
696,-0.41413999999999995
697,-0.41413999999999995
698,-0.41413999999999995
699,-0.41413999999999995
700,-0.41413999999999995
701,1.1711
702,2.9829
703,2.6054
704,-0.11219000000000001
705,-0.41413999999999995
706,-0.41413999999999995
707,-0.41413999999999995
708,-0.41413999999999995
709,-0.41413999999999995
710,-0.41413999999999995
711,-0.41413999999999995
712,-0.41413999999999995
713,-0.41413999999999995
714,-0.41413999999999995
715,-0.41413999999999995
716,-0.41413999999999995
717,-0.41413999999999995
718,-0.41413999999999995
719,-0.41413999999999995
