time,value
0,1.4584
1,1.459
2,1.3614
3,1.1478
4,0.97924
5,0.7662100000000001
6,0.54509
7,0.29838000000000003
8,0.46088999999999997
9,0.63202
10,0.63988
11,0.47039
12,0.26971
13,0.022122
14,-0.22487
15,-0.48832
16,-0.64069
17,-0.44851
18,-0.21114000000000002
19,-0.028426
20,0.09490499999999999
21,-0.01188
22,-0.12918
23,-0.30875
24,-0.50408
25,-0.7772
26,-1.0492
27,-1.3068
28,-1.5478
29,-1.8126
30,-1.9242
31,-1.7503
32,-1.5373
33,-1.2849
34,-1.0599
35,-0.87716
36,-0.89302
37,-0.9359299999999999
38,-1.0607
39,-1.1389
40,-1.1826
41,-1.2066
42,-1.1743
43,-1.0605
44,-0.909
45,-0.78313
46,-0.5798
47,-0.4044
48,-0.15129
49,-0.0037739000000000006
50,0.09696
51,0.15896
52,0.18102000000000001
53,0.14143
54,0.11794
55,0.10772000000000001
56,0.063278
57,0.25766
58,0.42595
59,0.54352
60,0.77515
61,0.99167
62,1.1552
63,1.3809
64,1.6423
65,1.8798
66,2.0736
67,2.1924
68,2.2163
69,2.1908
70,1.9597
71,1.7862
72,1.5922
73,1.3456
74,1.1467
75,0.9285899999999999
76,0.68915
77,0.49422
78,0.32034
79,0.09696
80,-0.082993
81,-0.30831
82,-0.47046000000000004
83,-0.6063
84,-0.72469
85,-0.78062
86,-0.8443
87,-0.86067
88,-0.9260799999999999
89,-1.1224
90,-1.3715
91,-1.5378
92,-1.7231
93,-1.7298
94,-1.5645
95,-1.3573
96,-1.097
97,-0.92801
98,-0.79505
99,-0.57207
100,-0.41378000000000004
101,-0.26809
102,-0.13389
103,-0.031639
104,-0.10764000000000001
105,-0.31764000000000003
106,-0.57617
107,-0.79089
108,-0.5552199999999999
109,-0.32299
110,-0.089545
111,0.13002
112,0.33383
113,0.50658
114,0.69731
115,0.8500700000000001
116,0.80185
117,0.5696399999999999
118,0.33895
119,0.2507
120,0.47188
121,0.72117
122,0.9391700000000001
123,1.1486
124,1.3012
125,1.1271
126,1.2438
127,1.4277
