time,value
0,-1.6135
1,-1.6135
2,-1.6135
3,-1.6135
4,-1.6135
5,-1.6135
6,-1.6135
7,-1.6135
8,-1.6135
9,-1.6135
10,-1.6135
11,-1.6135
12,-1.6135
13,-1.6135
14,-1.6135
15,-1.6135
16,-1.6135
17,-1.6135
18,-1.6135
19,-1.6135
20,-1.6135
21,-1.6135
22,-1.6135
23,-1.6135
24,-1.6135
25,-1.6135
26,-1.6135
27,-1.6135
28,-1.6135
29,-1.6135
30,-1.6135
31,-1.6135
32,-1.6135
33,-1.5373
34,-1.4314
35,-1.3256
36,-1.199
37,-1.0666
38,-0.93432
39,-0.8470200000000001
40,-0.76763
41,-0.68824
42,-0.68157
43,-0.68157
44,-0.68157
45,-0.70753
46,-0.7340000000000001
47,-0.7617
48,-0.81462
49,-0.86755
50,-0.9115700000000001
51,-0.8851100000000001
52,-0.85865
53,-0.8274799999999999
54,-0.77456
55,-0.72163
56,-0.6687
57,-0.61578
58,-0.56285
59,-0.48544
60,-0.35313
61,-0.22080999999999998
62,-0.10828
63,-0.028892
64,0.050498
65,0.08339099999999999
66,0.056928
67,0.030465
68,0.0040018
69,-0.022461000000000002
70,-0.048924
71,-0.045215
72,-0.018751
73,0.0077116
74,0.017357
75,0.017357
76,0.017357
77,-0.03829
78,-0.11767999999999999
79,-0.19707
80,-0.25618
81,-0.3091
82,-0.36203
83,-0.37093000000000004
84,-0.37093000000000004
85,-0.37093000000000004
86,-0.34719
87,-0.32073
88,-0.29425999999999997
89,-0.31875
90,-0.34521
91,-0.37316
92,-0.45255
93,-0.53194
94,-0.6138
95,-0.71965
96,-0.8255
97,-0.92715
98,-1.0065
99,-1.0859
100,-1.1594
101,-1.2123
102,-1.2652
103,-1.3182
104,-1.3711
105,-1.4240000000000002
106,-1.4581
107,-1.4581
108,-1.4581
109,-1.4248
110,-1.3454
111,-1.266
112,-1.148
113,-0.9892299999999999
114,-0.83045
115,-0.65708
116,-0.47184
117,-0.2866
118,-0.134
119,-0.0016864999999999998
120,0.13063
121,0.281
122,0.43978
123,0.59856
124,0.67819
125,0.73112
126,0.78404
127,0.72939
128,0.65
129,0.5706100000000001
130,0.51447
131,0.46153999999999995
132,0.40862
133,0.38067
134,0.3542
135,0.32824000000000003
136,0.3547
137,0.38116
138,0.41158
139,0.49096999999999996
140,0.5703600000000001
141,0.64975
142,0.72914
143,0.80853
144,0.88792
145,0.96731
146,1.0467
147,1.1404
148,1.2727
149,1.4051
150,1.5374
151,1.6697
152,1.8019999999999998
153,1.9024
154,1.9553
155,2.0083
156,2.0488
157,2.0753
158,2.1018
159,2.0859
160,2.033
161,1.9801
162,1.9588
163,1.9588
164,1.9588
165,2.0115
166,2.0909
167,2.1703
168,2.1918
169,2.1918
170,2.1918
171,2.1708
172,2.1443
173,2.1178
174,2.0231
175,1.9173
176,1.8114
177,1.7545
178,1.7016
179,1.6487
180,1.5433
181,1.4375
182,1.3316
183,1.2258
184,1.1199
185,1.0237
186,0.99723
187,0.97077
188,0.9393600000000001
189,0.8864299999999999
190,0.8335100000000001
191,0.80061
192,0.8270799999999999
193,0.85354
194,0.8968200000000001
195,0.97621
196,1.0556
197,1.1147
198,1.1412
199,1.1676
200,1.1704
201,1.1439
202,1.1174
203,1.0774
204,1.0244
205,0.97151
206,0.88792
207,0.7820699999999999
208,0.6762100000000001
209,0.60449
210,0.55156
211,0.49863999999999997
212,0.42691999999999997
213,0.34753
214,0.26814
215,0.2298
216,0.20334000000000002
217,0.17687999999999998
218,0.17267000000000002
219,0.17267000000000002
220,0.17267000000000002
221,0.17267000000000002
222,0.17267000000000002
223,0.17267000000000002
224,0.22411999999999999
225,0.27704
226,0.32600999999999997
227,0.27308000000000004
228,0.22016
229,0.17267000000000002
230,0.17267000000000002
231,0.17267000000000002
232,0.16822
233,0.14176
234,0.1153
235,0.08883200000000001
236,0.06236900000000001
237,0.035906
238,0.0094429
239,-0.01702
240,-0.043483
241,-0.06994600000000001
242,-0.09640900000000001
243,-0.12287000000000001
244,-0.14934
245,-0.1758
246,-0.20226
247,-0.22871999999999998
248,-0.25519000000000003
249,-0.28165
250,-0.27844
251,-0.25196999999999997
252,-0.22551
253,-0.21561999999999998
254,-0.21561999999999998
255,-0.21561999999999998
256,-0.21561999999999998
257,-0.21561999999999998
258,-0.21561999999999998
259,-0.23565
260,-0.26211
261,-0.28858
262,-0.31504
263,-0.3415
264,-0.36796999999999996
265,-0.37093000000000004
266,-0.37093000000000004
267,-0.37093000000000004
268,-0.37093000000000004
269,-0.37093000000000004
270,-0.37093000000000004
271,-0.37093000000000004
272,-0.37093000000000004
273,-0.37093000000000004
274,-0.37093000000000004
275,-0.37093000000000004
276,-0.36302
277,-0.31009000000000003
278,-0.25716999999999995
279,-0.20993
280,-0.18347
281,-0.157
282,-0.13796
283,-0.13796
284,-0.13796
285,-0.13796
286,-0.13796
287,-0.13796
288,-0.13796
289,-0.13796
290,-0.13796
291,-0.13796
292,-0.13796
293,-0.13796
294,-0.10927
295,-0.056344000000000005
296,-0.0034177
297,0.0012814
298,-0.025182
299,-0.051645
300,-0.042494
301,-0.016031
302,0.010431999999999999
303,0.056433000000000004
304,0.10935999999999998
305,0.16229000000000002
306,0.25775
307,0.3636
308,0.46946000000000004
309,0.5523100000000001
310,0.6317
311,0.71109
312,0.79047
313,0.8698600000000001
314,0.94925
