time,value
0,-0.52104
1,-0.52104
2,-0.52104
3,-0.52104
4,-0.52104
5,-0.52104
6,-0.52104
7,-0.52104
8,-0.52104
9,-0.13005999999999998
10,2.2159
11,2.2159
12,2.2159
13,2.2159
14,2.2159
15,1.8249
16,2.2159
17,1.8249
18,1.8249
19,1.8249
20,1.8249
21,1.8249
22,1.8249
23,1.8249
24,1.8249
25,1.8249
26,1.5316
27,1.8249
28,1.8249
29,-0.52104
30,-0.52104
31,-0.52104
32,-0.52104
33,-0.52104
34,-0.52104
35,-0.52104
36,-0.52104
37,-0.52104
38,-0.52104
39,-0.52104
40,-0.52104
41,-0.52104
42,-0.52104
43,-0.52104
44,-0.52104
45,-0.52104
46,-0.52104
47,-0.52104
48,-0.52104
49,-0.52104
50,-0.52104
51,-0.52104
52,-0.52104
53,-0.52104
54,-0.52104
55,-0.52104
56,-0.52104
57,-0.52104
58,-0.52104
59,-0.52104
60,-0.52104
61,-0.52104
62,-0.52104
63,-0.52104
64,-0.52104
65,-0.52104
66,-0.52104
67,-0.52104
68,-0.52104
69,-0.52104
70,-0.52104
71,-0.52104
72,-0.52104
73,-0.52104
74,-0.52104
75,-0.52104
76,-0.52104
77,-0.52104
78,-0.52104
79,-0.52104
80,-0.52104
81,-0.52104
82,-0.52104
83,-0.52104
84,-0.52104
85,-0.52104
86,-0.52104
87,-0.52104
88,-0.52104
89,-0.52104
90,-0.52104
91,-0.52104
92,-0.52104
93,-0.52104
94,-0.52104
95,-0.52104
96,-0.52104
97,-0.52104
98,0.94516
99,2.2159
100,2.2159
101,2.2159
102,2.2159
103,2.2159
104,1.8249
105,2.2159
106,1.8249
107,1.8249
108,1.8249
109,1.8249
110,1.8249
111,1.8249
112,1.8249
113,1.8249
114,1.8249
115,1.8249
116,0.6519199999999999
117,-0.52104
118,-0.52104
119,-0.52104
120,-0.52104
121,-0.52104
122,-0.52104
123,-0.52104
124,-0.52104
125,-0.52104
126,-0.52104
127,-0.52104
128,-0.52104
129,-0.52104
130,-0.52104
131,-0.52104
132,-0.52104
133,-0.52104
134,-0.52104
135,-0.52104
136,-0.52104
137,-0.52104
138,-0.52104
139,-0.52104
140,-0.52104
141,-0.52104
142,-0.52104
143,-0.52104
144,-0.52104
145,-0.52104
146,-0.52104
147,-0.52104
148,-0.52104
149,-0.52104
150,-0.52104
151,-0.52104
152,-0.52104
153,-0.52104
154,-0.52104
155,-0.52104
156,-0.52104
157,-0.52104
158,-0.52104
159,-0.52104
160,-0.52104
161,-0.52104
162,-0.52104
163,-0.52104
164,-0.52104
165,-0.52104
166,-0.52104
167,-0.52104
168,-0.52104
169,-0.52104
170,-0.52104
171,-0.52104
172,-0.52104
173,-0.52104
174,-0.52104
175,-0.52104
176,-0.52104
177,-0.52104
178,-0.52104
179,-0.52104
180,-0.52104
181,-0.52104
182,-0.52104
183,-0.52104
184,-0.52104
185,-0.52104
186,-0.52104
187,-0.52104
188,-0.52104
189,-0.52104
190,0.26093
191,2.2159
192,2.2159
193,2.2159
194,2.2159
195,2.2159
196,1.8249
197,1.8249
198,2.2159
199,1.8249
200,1.8249
201,1.8249
202,1.8249
203,1.5316
204,1.8249
205,1.8249
206,1.8249
207,1.5316
208,-0.13005999999999998
209,-0.52104
210,-0.52104
211,-0.52104
212,-0.52104
213,-0.52104
214,-0.52104
215,-0.52104
216,-0.52104
217,-0.52104
218,-0.4233
219,-0.52104
220,-0.4233
221,-0.52104
222,-0.52104
223,-0.52104
224,-0.52104
225,-0.52104
226,-0.52104
227,-0.52104
228,-0.52104
229,-0.52104
230,-0.52104
231,-0.52104
232,-0.52104
233,-0.52104
234,-0.52104
235,-0.52104
236,-0.52104
237,-0.52104
238,-0.52104
239,-0.52104
240,-0.52104
241,-0.52104
242,-0.52104
243,-0.52104
244,-0.52104
245,-0.52104
246,-0.52104
247,-0.52104
248,-0.52104
249,-0.52104
250,-0.32555
251,-0.52104
252,-0.52104
253,-0.52104
254,-0.52104
255,-0.52104
256,-0.52104
257,-0.52104
258,-0.52104
259,-0.52104
260,-0.52104
261,-0.52104
262,-0.52104
263,-0.52104
264,-0.52104
265,-0.52104
266,-0.52104
267,-0.52104
268,-0.52104
269,-0.52104
270,-0.52104
271,-0.52104
272,-0.52104
273,-0.52104
274,1.5316
275,2.2159
276,2.6068
277,1.8249
278,2.2159
279,2.2159
280,1.8249
281,1.8249
282,1.8249
283,2.2159
284,1.8249
285,1.8249
286,1.8249
287,1.5316
288,1.8249
289,1.8249
290,1.8249
291,1.5316
292,-0.2278
293,-0.52104
294,-0.52104
295,-0.52104
296,-0.52104
297,-0.52104
298,-0.52104
299,-0.52104
300,-0.52104
301,-0.52104
302,-0.52104
303,-0.52104
304,-0.52104
305,-0.52104
306,-0.52104
307,-0.52104
308,-0.52104
309,-0.52104
310,-0.52104
311,-0.52104
312,-0.52104
313,-0.52104
314,-0.52104
315,-0.52104
316,-0.52104
317,-0.52104
318,-0.52104
319,-0.52104
320,-0.52104
321,-0.52104
322,-0.52104
323,-0.52104
324,-0.52104
325,-0.52104
326,-0.52104
327,-0.52104
328,-0.52104
329,-0.52104
330,-0.52104
331,-0.52104
332,-0.52104
333,-0.52104
334,-0.52104
335,-0.52104
336,-0.52104
337,-0.52104
338,-0.52104
339,-0.52104
340,-0.52104
341,-0.52104
342,-0.52104
343,-0.52104
344,-0.52104
345,-0.52104
346,-0.52104
347,-0.52104
348,-0.52104
349,-0.52104
350,-0.52104
351,-0.52104
352,-0.52104
353,-0.52104
354,-0.52104
355,-0.52104
356,-0.52104
357,-0.52104
358,-0.52104
359,-0.52104
360,-0.52104
361,-0.52104
362,-0.52104
363,-0.52104
364,-0.52104
365,-0.52104
366,-0.52104
367,-0.52104
368,-0.52104
369,1.8249
370,2.2159
371,2.2159
372,2.2159
373,2.2159
374,1.8249
375,2.2159
376,1.8249
377,1.8249
378,1.8249
379,1.8249
380,1.8249
381,1.8249
382,1.8249
383,1.8249
384,1.8249
385,1.8249
386,0.94516
387,-0.32555
388,-0.52104
389,-0.52104
390,-0.52104
391,-0.52104
392,-0.52104
393,-0.52104
394,-0.52104
395,-0.52104
396,-0.52104
397,-0.52104
398,-0.52104
399,-0.52104
400,-0.52104
401,-0.52104
402,-0.52104
403,-0.52104
404,-0.52104
405,-0.52104
406,-0.52104
407,-0.52104
408,-0.52104
409,-0.4233
410,-0.52104
411,-0.52104
412,-0.52104
413,-0.52104
414,-0.52104
415,-0.52104
416,-0.52104
417,-0.52104
418,-0.52104
419,-0.52104
420,-0.52104
421,-0.52104
422,-0.52104
423,-0.52104
424,-0.52104
425,-0.52104
426,-0.52104
427,-0.52104
428,-0.52104
429,-0.52104
430,-0.52104
431,-0.52104
432,-0.52104
433,-0.52104
434,-0.52104
435,-0.52104
436,-0.52104
437,-0.52104
438,-0.52104
439,-0.52104
440,-0.52104
441,-0.52104
442,-0.52104
443,-0.52104
444,-0.52104
445,-0.52104
446,-0.52104
447,-0.52104
448,-0.52104
449,-0.52104
450,-0.52104
451,-0.52104
452,-0.52104
453,-0.52104
454,-0.52104
455,-0.52104
456,-0.52104
457,-0.52104
458,-0.52104
459,-0.52104
460,-0.52104
461,-0.52104
462,-0.52104
463,-0.52104
464,0.45642
465,2.2159
466,2.2159
467,2.2159
468,2.2159
469,2.2159
470,2.2159
471,1.8249
472,1.8249
473,1.8249
474,1.8249
475,1.8249
476,1.8249
477,1.8249
478,1.8249
479,1.8249
480,1.8249
481,1.8249
482,-0.52104
483,-0.52104
484,-0.52104
485,-0.52104
486,-0.32555
487,-0.52104
488,-0.52104
489,-0.52104
490,-0.52104
491,-0.52104
492,-0.52104
493,-0.52104
494,-0.52104
495,-0.52104
496,-0.52104
497,-0.52104
498,-0.52104
499,-0.52104
500,-0.52104
501,-0.52104
502,-0.52104
503,-0.52104
504,-0.52104
505,-0.52104
506,-0.52104
507,-0.52104
508,-0.52104
509,-0.52104
510,-0.52104
511,-0.52104
512,-0.52104
513,-0.52104
514,-0.52104
515,-0.52104
516,-0.52104
517,-0.52104
518,-0.52104
519,-0.52104
520,-0.52104
521,-0.52104
522,-0.52104
523,-0.52104
524,-0.52104
525,-0.52104
526,-0.52104
527,-0.52104
528,-0.52104
529,-0.52104
530,-0.52104
531,-0.52104
532,-0.52104
533,-0.52104
534,-0.52104
535,-0.52104
536,-0.52104
537,-0.52104
538,-0.52104
539,-0.52104
540,-0.52104
541,-0.52104
542,-0.52104
543,-0.52104
544,-0.52104
545,-0.4233
546,-0.52104
547,-0.52104
548,-0.52104
549,-0.52104
550,0.94516
551,2.2159
552,2.2159
553,2.2159
554,2.2159
555,1.8249
556,1.8249
557,2.2159
558,1.8249
559,1.8249
560,1.5316
561,2.2159
562,2.2159
563,1.8249
564,1.5316
565,1.8249
566,2.2159
567,1.5316
568,1.8249
569,1.8249
570,1.8249
571,1.8249
572,1.8249
573,1.5316
574,1.8249
575,1.5316
576,-0.52104
577,-0.52104
578,-0.52104
579,-0.52104
580,-0.52104
581,-0.52104
582,-0.52104
583,-0.52104
584,-0.52104
585,-0.52104
586,-0.52104
587,-0.52104
588,-0.52104
589,-0.52104
590,-0.52104
591,-0.52104
592,-0.52104
593,-0.52104
594,-0.52104
595,-0.52104
596,-0.52104
597,-0.52104
598,-0.52104
599,-0.52104
600,-0.52104
601,-0.52104
602,-0.52104
603,-0.52104
604,-0.52104
605,-0.52104
606,-0.52104
607,-0.52104
608,-0.52104
609,-0.52104
610,-0.52104
611,-0.52104
612,-0.52104
613,-0.52104
614,-0.52104
615,-0.52104
616,-0.52104
617,-0.52104
618,-0.52104
619,-0.52104
620,-0.52104
621,-0.52104
622,-0.52104
623,-0.52104
624,-0.52104
625,-0.52104
626,-0.52104
627,-0.52104
628,-0.52104
629,-0.52104
630,-0.52104
631,-0.52104
632,-0.52104
633,-0.52104
634,-0.52104
635,-0.52104
636,-0.52104
637,-0.52104
638,-0.52104
639,-0.52104
640,-0.52104
641,-0.52104
642,-0.52104
643,2.2159
644,2.6068
645,2.2159
646,2.2159
647,1.8249
648,2.2159
649,1.8249
650,1.8249
651,1.8249
652,2.2159
653,1.8249
654,1.8249
655,1.8249
656,1.8249
657,1.8249
658,1.5316
659,1.8249
660,1.8249
661,1.8249
662,-0.32555
663,-0.52104
664,-0.52104
665,-0.52104
666,-0.52104
667,-0.52104
668,-0.52104
669,-0.52104
670,-0.52104
671,-0.52104
672,-0.52104
673,-0.52104
674,-0.52104
675,-0.52104
676,-0.52104
677,-0.52104
678,-0.52104
679,-0.52104
680,-0.52104
681,-0.52104
682,-0.52104
683,-0.52104
684,-0.52104
685,-0.52104
686,-0.52104
687,-0.52104
688,-0.52104
689,-0.52104
690,-0.52104
691,-0.52104
692,-0.52104
693,-0.52104
694,-0.52104
695,-0.52104
696,-0.52104
697,-0.52104
698,-0.52104
699,-0.52104
700,-0.52104
701,-0.52104
702,-0.52104
703,-0.52104
704,-0.52104
705,-0.52104
706,-0.52104
707,-0.52104
708,-0.52104
709,-0.52104
710,-0.52104
711,-0.52104
712,-0.52104
713,-0.52104
714,-0.52104
715,-0.52104
716,-0.52104
717,-0.52104
718,-0.52104
719,-0.52104
