time,value
0,0.39999
1,0.48148
2,0.50063
3,0.44633
4,0.30941
5,0.09629800000000001
6,-0.15685
7,-0.40628000000000003
8,-0.60672
9,-0.72578
10,-0.74064
11,-0.6543899999999999
12,-0.49423
13,-0.29711
14,-0.10254
15,0.058437
16,0.17135999999999998
17,0.24845
18,0.30401999999999996
19,0.35008
20,0.40025
21,0.44725
22,0.4696
23,0.43923
24,0.34131
25,0.17728
26,-0.026771
27,-0.23729
28,-0.41621
29,-0.52289
30,-0.5422600000000001
31,-0.4583
32,-0.30718
33,-0.11946
34,0.072711
35,0.25509
36,0.40898
37,0.53022
38,0.62025
39,0.67345
40,0.67507
41,0.6028899999999999
42,0.44269
43,0.18753
44,-0.1393
45,-0.49795
46,-0.83494
47,-1.0988
48,-1.2443
49,-1.2503
50,-1.1414
51,-0.94419
52,-0.68537
53,-0.40545
54,-0.11823
55,0.17854
56,0.5027
57,0.8588100000000001
58,1.2353
59,1.5952
60,1.8811
61,2.0181
62,1.9603
63,1.6832
64,1.2013
65,0.5696
66,-0.12583
67,-0.792
68,-1.3522
69,-1.7527
70,-1.9633
71,-1.9913
72,-1.8607
73,-1.6
74,-1.2388
75,-0.81108
76,-0.3594
77,0.072891
78,0.445
79,0.72005
80,0.8716200000000001
81,0.90002
82,0.8191
83,0.65269
84,0.44297
85,0.22553
86,0.025013
87,-0.12721
88,-0.20704
89,-0.20199999999999999
90,-0.11149
91,0.066525
92,0.31501999999999997
93,0.59985
94,0.8691
95,1.0622
96,1.1158
97,0.99911
98,0.71613
99,0.28471
100,-0.22008000000000003
101,-0.71245
102,-1.1149
103,-1.3759
104,-1.48
105,-1.4414
106,-1.3034
107,-1.1079
108,-0.8900600000000001
109,-0.6566
110,-0.4029
111,-0.12330999999999999
112,0.18272
113,0.50505
114,0.81686
115,1.0797
116,1.2588
117,1.3315
118,1.298
119,1.1733
120,0.98526
121,0.7590100000000001
122,0.52665
123,0.30611
124,0.091978
125,-0.12274000000000002
126,-0.3418
127,-0.5652
128,-0.77993
129,-0.9597399999999999
130,-1.0776
131,-1.1199
132,-1.0865
133,-0.9716799999999999
134,-0.7935
135,-0.57122
136,-0.32631
137,-0.073922
138,0.17318
139,0.40016
140,0.59418
141,0.7406699999999999
142,0.8276
143,0.8477899999999999
144,0.80824
145,0.7094
146,0.56226
147,0.38299
148,0.20034000000000002
149,0.034113
150,-0.095622
151,-0.17635
152,-0.1891
153,-0.14104
154,-0.028317000000000002
155,0.12822
156,0.29307
157,0.42253
158,0.48053999999999997
159,0.44609
160,0.29572
161,0.034187999999999996
162,-0.30312
163,-0.67788
164,-1.0249
165,-1.2989
166,-1.4545
167,-1.4619
168,-1.3287
169,-1.0616
170,-0.6842600000000001
171,-0.23401999999999998
172,0.24839
173,0.7345
174,1.1891
175,1.5748
176,1.8619
177,2.0219
178,2.0372
179,1.8845
180,1.5663
181,1.099
182,0.51194
183,-0.14135
184,-0.79682
185,-1.3992
186,-1.8978
187,-2.2314
188,-2.3687
189,-2.3031
190,-2.0352
191,-1.575
192,-0.96567
193,-0.27452
194,0.42785
195,1.0649
196,1.5605
197,1.8653
198,1.9601
199,1.8447
200,1.5631
201,1.1676
202,0.71919
203,0.27613000000000004
204,-0.1183
205,-0.44958000000000004
206,-0.70815
207,-0.8799600000000001
208,-0.96383
209,-0.95296
210,-0.8433299999999999
211,-0.64363
212,-0.38117
213,-0.089897
214,0.17905
215,0.38332
216,0.48593000000000003
217,0.47108999999999995
218,0.3592
219,0.19524
220,0.019174
221,-0.12197000000000001
222,-0.19507
223,-0.19858
224,-0.1567
225,-0.10092000000000001
226,-0.053860000000000005
227,-0.031736
228,-0.034529000000000004
229,-0.043874
230,-0.042485
231,-0.02309
232,0.014190000000000001
233,0.056262
234,0.089171
235,0.09956799999999999
236,0.087772
237,0.060225
238,0.027294
239,0.007306100000000001
240,0.011786
241,0.036739
242,0.06728200000000001
243,0.083215
244,0.073713
245,0.032713
246,-0.027393999999999998
247,-0.07470399999999999
248,-0.079453
249,-0.028787
250,0.073961
251,0.20608
252,0.34073000000000003
253,0.42467
254,0.42488000000000004
255,0.3262
256,0.14400000000000002
257,-0.083052
258,-0.31890999999999997
259,-0.5270600000000001
260,-0.6824
261,-0.7659
262,-0.77417
263,-0.71943
264,-0.60143
265,-0.42945
266,-0.19709000000000002
267,0.10252
268,0.44675
269,0.8222299999999999
270,1.1785
271,1.4517
272,1.5819
273,1.5415
274,1.3147
275,0.9195
276,0.39548
277,-0.20665
278,-0.8153699999999999
279,-1.3793
280,-1.8459999999999999
281,-2.1709
282,-2.3185
283,-2.2667
284,-2.0027
285,-1.5221
286,-0.85711
287,-0.058565
288,0.78915
289,1.5855
290,2.2389
291,2.6689999999999996
292,2.8271
293,2.7016
294,2.3361
295,1.7892
296,1.1319
297,0.43418999999999996
298,-0.2473
299,-0.87255
300,-1.4051
301,-1.8201
302,-2.0849
303,-2.1821
304,-2.1042
305,-1.8691
306,-1.4946
307,-1.0171
308,-0.4982
309,0.0093168
310,0.45423
311,0.7926
312,1.0078
313,1.1015
314,1.0944
315,1.0059
316,0.8597799999999999
317,0.6798
318,0.49006000000000005
319,0.3113
320,0.15197
321,0.035821
322,-0.028260000000000004
323,-0.042309
324,-0.016856
325,0.029051
326,0.082107
327,0.12329000000000001
328,0.13248
329,0.09403500000000001
330,0.0033669000000000004
331,-0.13205999999999998
332,-0.29554
333,-0.46173000000000003
334,-0.6025699999999999
335,-0.6984199999999999
336,-0.72467
337,-0.6753899999999999
338,-0.5493
339,-0.35023000000000004
340,-0.10905999999999999
341,0.13310999999999998
342,0.33987
343,0.48036
344,0.54605
345,0.52972
346,0.4532
347,0.34779
348,0.23390999999999998
349,0.12293
350,0.01933
351,-0.072418
352,-0.15215
353,-0.22235
354,-0.26221
355,-0.26026
356,-0.19791
357,-0.0851
358,0.05839199999999999
359,0.21745
360,0.3508
361,0.43031
362,0.4414
363,0.39423
364,0.31364000000000003
365,0.22501999999999997
366,0.15605
367,0.10563
368,0.052425
369,-0.029266000000000004
370,-0.18195999999999998
371,-0.42278000000000004
372,-0.73118
373,-1.0562
374,-1.3376
375,-1.5032
376,-1.4992
377,-1.2992
378,-0.9086
379,-0.3728
380,0.23831999999999998
381,0.8593700000000001
382,1.4228
383,1.8796
384,2.1944
385,2.3465
386,2.3137
387,2.0896
388,1.6773
389,1.091
390,0.36885
391,-0.42633999999999994
392,-1.204
393,-1.8715
394,-2.3453
395,-2.5831
396,-2.5629
397,-2.3102
398,-1.8809
399,-1.3363
400,-0.74257
401,-0.15339
402,0.39228
403,0.8486299999999999
404,1.1911
405,1.411
406,1.5141
407,1.499
408,1.3833
409,1.1927
410,0.9463799999999999
411,0.67356
412,0.38855
413,0.10042000000000001
414,-0.17263
415,-0.41575
416,-0.60036
417,-0.7055899999999999
418,-0.7042
419,-0.58759
420,-0.37555
421,-0.10890999999999999
422,0.14542
423,0.32837
424,0.382
425,0.27602
426,0.036194
427,-0.28376
428,-0.62478
429,-0.9226700000000001
430,-1.1226
431,-1.1999
432,-1.146
433,-0.9741299999999999
434,-0.7019
435,-0.33792
436,0.1116
437,0.62225
438,1.1624
439,1.6802
440,2.0952
441,2.3306
442,2.3241
443,2.0526
444,1.5381
445,0.83175
446,0.036788999999999995
447,-0.74303
448,-1.4135
449,-1.9063
450,-2.1826
451,-2.2412
452,-2.112
453,-1.8444
454,-1.4762
455,-1.0547
456,-0.609
457,-0.17882
458,0.22487
459,0.59101
460,0.90275
461,1.1598
462,1.3579
463,1.5017
464,1.5741
465,1.5607
466,1.4467
467,1.2048
468,0.84567
469,0.38784
470,-0.12596
471,-0.61537
472,-1.0196
473,-1.2881
474,-1.3977
475,-1.3495
476,-1.1785
477,-0.93211
478,-0.64503
479,-0.35281999999999997
480,-0.073225
481,0.18972999999999998
482,0.42871000000000004
483,0.62736
484,0.75712
485,0.7979999999999999
486,0.72725
487,0.54172
488,0.27064
489,-0.029626999999999997
490,-0.29429
491,-0.46673000000000003
492,-0.5150399999999999
493,-0.45383999999999997
494,-0.32249
495,-0.16933
496,-0.04166
497,0.029266000000000004
498,0.052400999999999996
499,0.056682
