time,value
0,-1.062
1,-1.0303
2,-0.997
3,-0.9691700000000001
4,-0.9502799999999999
5,-0.9390799999999999
6,-0.9315700000000001
7,-0.92405
8,-0.9147799999999999
9,-0.90479
10,-0.89665
11,-0.89202
12,-0.8906700000000001
13,-0.89115
14,-0.8920100000000001
15,-0.89218
16,-0.8917799999999999
17,-0.89199
18,-0.89312
19,-0.89484
20,-0.89686
21,-0.8991
22,-0.9011299999999999
23,-0.9030600000000001
24,-0.90586
25,-0.9088
26,-0.9111899999999999
27,-0.91325
28,-0.9151
29,-0.91643
30,-0.9175700000000001
31,-0.9196700000000001
32,-0.9216200000000001
33,-0.92248
34,-0.9229799999999999
35,-0.9225700000000001
36,-0.92053
37,-0.9173600000000001
38,-0.91414
39,-0.9098
40,-0.90385
41,-0.89828
42,-0.8916700000000001
43,-0.8832
44,-0.8734700000000001
45,-0.86254
46,-0.8487600000000001
47,-0.8317100000000001
48,-0.8133199999999999
49,-0.7922
50,-0.76785
51,-0.74174
52,-0.71335
53,-0.6811699999999999
54,-0.6451399999999999
55,-0.60678
56,-0.56507
57,-0.52013
58,-0.47461000000000003
59,-0.42788999999999994
60,-0.37915
61,-0.32887
62,-0.27778
63,-0.22505999999999998
64,-0.17145
65,-0.12065
66,-0.072925
67,-0.028774
68,0.010729
69,0.046413
70,0.080809
71,0.11525
72,0.14887999999999998
73,0.1824
74,0.21513000000000002
75,0.24464
76,0.27075
77,0.29423
78,0.31539
79,0.33423
80,0.35173000000000004
81,0.36774
82,0.38058000000000003
83,0.39007
84,0.39557
85,0.39639
86,0.39281
87,0.38573
88,0.37590999999999997
89,0.36416
90,0.35231
91,0.34119
92,0.33076
93,0.32165
94,0.31342
95,0.30458
96,0.29396
97,0.28115999999999997
98,0.26509
99,0.24449
100,0.22079000000000001
101,0.19435999999999998
102,0.16502
103,0.1341
104,0.10300000000000001
105,0.071642
106,0.038889
107,0.0055305
108,-0.031074
109,-0.075403
110,-0.12979000000000002
111,-0.19642
112,-0.27660999999999997
113,-0.36832
114,-0.46471999999999997
115,-0.55971
116,-0.6483899999999999
117,-0.72423
118,-0.7850699999999999
119,-0.83242
120,-0.86797
121,-0.8931600000000001
122,-0.9112
123,-0.9259200000000001
124,-0.93655
125,-0.9444299999999999
126,-0.95142
127,-0.9566600000000001
128,-0.9591799999999999
129,-0.95957
130,-0.95905
131,-0.9558399999999999
132,-0.95084
133,-0.9462
134,-0.94075
135,-0.93401
136,-0.9270799999999999
137,-0.92086
138,-0.9137200000000001
139,-0.90607
140,-0.90049
141,-0.8947299999999999
142,-0.8879299999999999
143,-0.8812200000000001
144,-0.87492
145,-0.8671399999999999
146,-0.8580899999999999
147,-0.85159
148,-0.84514
149,-0.83831
150,-0.83335
151,-0.8304299999999999
152,-0.82721
153,-0.8231700000000001
154,-0.82086
155,-0.81686
156,-0.8093
157,-0.80077
158,-0.79038
159,-0.7760199999999999
160,-0.7580100000000001
161,-0.73837
162,-0.7137600000000001
163,-0.68202
164,-0.64576
165,-0.60235
166,-0.55019
167,-0.49035
168,-0.42418
169,-0.35036999999999996
170,-0.26911999999999997
171,-0.18385
172,-0.093324
173,0.0028640000000000002
174,0.10288
175,0.20681
176,0.3161
177,0.43015
178,0.54578
179,0.66319
180,0.78109
181,0.8947200000000001
182,1.0038
183,1.1088
184,1.2088
185,1.3026
186,1.3926
187,1.4795
188,1.5577
189,1.6274
190,1.6859
191,1.7266
192,1.7441
193,1.7376
194,1.7058
195,1.6454
196,1.5637
197,1.4679
198,1.3616
199,1.253
200,1.1506
201,1.0581
202,0.9754700000000001
203,0.9073399999999999
204,0.85539
205,0.8145
206,0.78778
207,0.77645
208,0.77787
209,0.79009
210,0.81426
211,0.84862
212,0.8879
213,0.93452
214,0.98824
215,1.0471
216,1.1136
217,1.1893
218,1.2726
219,1.3615
220,1.4574
221,1.558
222,1.6599
223,1.766
224,1.8751
225,1.9828
226,2.0859
227,2.1807
228,2.2603
229,2.318
230,2.3565
231,2.3764
232,2.3793
233,2.3722
234,2.3598
235,2.3426
236,2.3185
237,2.2863
238,2.2388
239,2.1674
240,2.0675
241,1.9340000000000002
242,1.7632
243,1.5569
244,1.3222
245,1.0679
246,0.8054399999999999
247,0.55171
248,0.31931
249,0.11638
250,-0.050783
251,-0.18154
252,-0.28160999999999997
253,-0.3592
254,-0.41898
255,-0.46911
256,-0.51758
257,-0.56576
258,-0.61568
259,-0.66988
260,-0.72741
261,-0.78351
262,-0.8376299999999999
263,-0.89113
264,-0.93885
265,-0.98088
266,-1.0192
267,-1.0509
268,-1.0726
269,-1.085
