time,value
0,0.23385
1,0.23385
2,0.18936
3,0.27834000000000003
4,0.21605
5,0.23385
6,0.19825
7,0.22495
8,0.20715
9,0.17156
10,0.19825
11,0.22495
12,0.18045999999999998
13,0.15375999999999998
14,0.14486
15,0.12707000000000002
16,0.17156
17,0.14486
18,0.16266
19,0.16266
20,0.17156
21,0.14486
22,0.10927
23,0.13596
24,0.15375999999999998
25,0.11817000000000001
26,0.16266
27,0.073675
28,0.12707000000000002
29,0.073675
30,0.073675
31,0.046979
32,0.038081
33,0.29614
34,0.33173
35,0.34953
36,0.13596
37,-0.086499
38,-0.27337
39,-0.24666999999999997
40,-0.068702
41,-0.068702
42,-0.024209
43,-0.059802999999999995
44,-0.068702
45,-0.0064122
46,-0.024209
47,-0.059802999999999995
48,0.011385
49,0.038081
50,0.020283000000000002
51,0.020283000000000002
52,0.37623
53,1.2127
54,-2.4090000000000003
55,-5.3811
56,-5.8528
57,-4.251
58,-2.2044
59,-1.2967
60,-0.57592
61,-0.068702
62,0.064776
63,0.15375999999999998
64,0.11817000000000001
65,0.26054
66,0.22495
67,0.27834000000000003
68,0.23385
69,0.33173
70,0.32283
71,0.26944
72,0.39402
73,0.42962
74,0.42072
75,0.46521
76,0.5897899999999999
77,0.73217
78,0.85675
79,1.0258
80,1.2216
81,1.4618
82,1.7377
83,1.9424
84,2.1915
85,2.1915
86,2.2449
87,1.8445
88,1.3462
89,0.8033600000000001
90,0.39402
91,0.12707000000000002
92,0.011385
93,-0.1043
94,-0.11319000000000001
95,-0.068702
96,-0.11319000000000001
97,-0.13099
98,-0.024209
99,-0.059802999999999995
100,-0.14879
101,-0.086499
102,-0.068702
103,-0.024209
104,-0.033108
105,-0.050905
106,-0.12209
107,-0.15769
108,-0.12209
109,-0.13989000000000001
110,-0.17548
111,-0.18438
112,-0.21998
113,-0.21998
114,-0.30006
115,-0.22888000000000003
116,-0.23776999999999998
117,-0.31786
118,-0.27337
119,-0.32676
120,-0.30006
121,-0.36235
122,-0.28226999999999997
123,-0.30006
124,-0.31786
125,-0.37125
126,-0.38905
127,-0.38905
128,-0.30896
129,-0.32676
130,-0.34456
131,-0.37125
132,-0.42463999999999996
133,-0.37125
134,-0.34456
135,-0.48693000000000003
