time,value
0,-0.13749
1,-0.12387999999999999
2,0.46534
3,0.088017
4,0.21166999999999997
5,0.59625
6,0.043107
7,0.12235
8,0.36417
9,-0.59536
10,0.038698
11,0.24779
12,-0.22793000000000002
13,0.36703
14,0.15592
15,0.18792
16,0.6380399999999999
17,-0.063992
18,-0.37871
19,-0.29251
20,0.11315
21,0.11911
22,0.22783
23,0.30507
24,0.37331
25,-0.22855
26,0.0053956
27,0.032339
28,-0.10880999999999999
29,-0.087811
30,-0.46185
31,-0.72013
32,0.14943
33,0.32384
34,0.14623
35,-0.057973000000000004
36,0.47255
37,-0.1032
38,-0.35564
39,0.033352
40,-0.67986
41,0.30687
42,0.31084
43,0.10479000000000001
44,-0.21054
45,0.43936000000000003
46,-0.6250899999999999
47,0.24205
48,0.37598000000000004
49,-0.7003
50,-0.1711
51,0.082587
52,-0.16
53,-0.063999
54,0.058017
55,-0.40888
56,0.47553999999999996
57,0.030409
58,0.45848999999999995
59,-0.62057
60,-0.082738
61,1.7098
62,1.7098
63,1.7098
64,1.7098
65,1.7098
66,1.7098
67,1.7098
68,1.7098
69,1.7098
70,1.7098
71,1.7098
72,1.7098
73,-1.7227
74,-1.7227
75,-1.7227
76,-1.7227
77,-1.7227
78,-1.7227
79,-1.7227
80,-1.7227
81,-1.7227
82,-1.7227
83,-1.7227
84,-1.7227
85,-0.055639999999999995
86,0.16946
87,-0.34545
88,-0.5312899999999999
89,0.33916
90,0.13061
91,-0.5350199999999999
92,0.20886
93,-0.43501000000000006
94,0.38054
95,-0.074857
96,0.029744999999999997
97,0.21498
98,-0.19344
99,-0.42863999999999997
100,0.009599700000000001
101,1.7098
102,1.7098
103,1.7098
104,1.7098
105,1.7098
106,1.7098
107,1.7098
108,1.7098
109,-1.7227
110,-1.7227
111,-1.7227
112,-1.7227
113,-1.7227
114,-1.7227
115,-1.7227
116,-1.7227
117,-0.25494
118,0.27825
119,-0.082475
120,-0.020737000000000002
121,-0.37727
122,-0.13530999999999999
123,0.70418
124,0.071062
125,-0.13138
126,0.043318
127,0.23290999999999998
