time,value
0,-0.21318
1,-0.26008000000000003
2,-0.28895
3,-0.31135999999999997
4,-0.33211999999999997
5,-0.35408
6,-0.37505
7,-0.39513000000000004
8,-0.39939
9,-0.38903000000000004
10,-0.34094
11,-0.26033
12,-0.13814
13,0.015806999999999998
14,0.19710999999999998
15,0.38659
16,0.55472
17,0.68585
18,0.75673
19,0.75672
20,0.70173
21,0.60541
22,0.47134
23,0.32402
24,0.17219
25,0.017678
26,-0.12997999999999998
27,-0.26476
28,-0.38693
29,-0.49162
30,-0.5655600000000001
31,-0.5918899999999999
32,-0.57311
33,-0.50939
34,-0.40087
35,-0.27205
36,-0.14159000000000002
37,-0.016683
38,0.086119
39,0.15132
40,0.18062
41,0.18900999999999998
42,0.17776
43,0.15647
44,0.13676
45,0.13797
46,0.1631
47,0.20745
48,0.27595
49,0.34906
50,0.41145
51,0.44093999999999994
52,0.43472
53,0.38487
54,0.29027
55,0.16915
56,0.035432
57,-0.10034
58,-0.21622
59,-0.31631
60,-0.39833
61,-0.45332
62,-0.5013
63,-0.5393
64,-0.54869
65,-0.51474
66,-0.44353000000000004
67,-0.31622
68,-0.13888
69,0.067429
70,0.27378
71,0.44845
72,0.5705399999999999
73,0.60858
74,0.56703
75,0.46493999999999996
76,0.33125
77,0.19607
78,0.10403
79,0.070891
80,0.090245
81,0.13788
82,0.19644
83,0.24131
84,0.22718000000000002
85,0.15767
86,0.041252
87,-0.098843
88,-0.25966
89,-0.39643
90,-0.49299
91,-0.55782
92,-0.5708300000000001
93,-0.53409
94,-0.44048999999999994
95,-0.30212
96,-0.11582
97,0.092395
98,0.30157
99,0.48133000000000004
100,0.60416
101,0.64071
102,0.5946899999999999
103,0.475
104,0.32056
105,0.17272
106,0.055327999999999995
107,-0.016794999999999997
108,-0.052787
109,-0.074148
110,-0.11762
111,-0.1995
112,-0.31281
113,-0.42677
114,-0.50247
115,-0.51485
116,-0.43005
117,-0.24919000000000002
118,0.0016634
119,0.27698
120,0.52307
121,0.70445
122,0.79122
123,0.78477
124,0.69535
125,0.541
126,0.34345
127,0.10375999999999999
128,-0.16680999999999999
129,-0.45816999999999997
130,-0.7420800000000001
131,-0.9878899999999999
132,-1.158
133,-1.2088
134,-1.1254
135,-0.90859
136,-0.5682699999999999
137,-0.14300000000000002
138,0.31489
139,0.75613
140,1.1373
141,1.4169
142,1.5533
143,1.5422
144,1.3761
145,1.0621
146,0.63066
147,0.12674000000000002
148,-0.38477
149,-0.85382
150,-1.2161
151,-1.4347
152,-1.5015
153,-1.4240000000000002
154,-1.2341
155,-0.9591200000000001
156,-0.63402
157,-0.28826999999999997
158,0.082006
159,0.44903000000000004
160,0.80758
161,1.1361
162,1.4057
163,1.599
164,1.6754
165,1.61
166,1.3855
167,1.0284
168,0.55171
169,-0.01265
170,-0.60572
171,-1.1718
172,-1.6625
173,-2.0394
174,-2.248
175,-2.2578
176,-2.0659
177,-1.6791
178,-1.1196
179,-0.45303000000000004
180,0.2539
181,0.94496
182,1.5547
183,2.0135
184,2.2772
185,2.3544
186,2.2377
187,1.9519
188,1.5343
189,1.0557
190,0.54155
191,0.034076999999999996
192,-0.42668999999999996
193,-0.83104
194,-1.1679
195,-1.4435
196,-1.6401
197,-1.7612
198,-1.7991
199,-1.7463
200,-1.5897
201,-1.3334
202,-0.97185
203,-0.52475
204,-0.010149
205,0.5271600000000001
206,1.0349
207,1.4855
208,1.8266
209,2.0407
210,2.1008
211,2.0151
212,1.7867
213,1.4373
214,0.99403
215,0.4896
216,-0.025622000000000002
217,-0.51849
218,-0.95235
219,-1.3095
220,-1.5626
221,-1.6999
222,-1.7324
223,-1.6806
224,-1.5490000000000002
225,-1.3598
226,-1.1203
227,-0.83145
228,-0.49104
229,-0.11023
230,0.29989
231,0.72787
232,1.1243
233,1.4702
234,1.7185
235,1.8535
236,1.8474
237,1.7078
238,1.4591
239,1.1127
240,0.71287
241,0.2844
242,-0.14198
243,-0.54552
244,-0.9010799999999999
245,-1.1997
246,-1.4182
247,-1.5419999999999998
248,-1.5518
249,-1.4566
250,-1.2514
251,-0.9616100000000001
252,-0.6178
253,-0.25474
254,0.084961
255,0.37987
256,0.6103
257,0.77769
258,0.89044
259,0.9567899999999999
260,0.9978899999999999
261,1.0259
262,1.0414
263,1.038
264,0.98806
265,0.88449
266,0.7078300000000001
267,0.45478
268,0.12541
269,-0.25575
270,-0.64744
271,-1.0198
272,-1.327
273,-1.5288
274,-1.5959999999999999
275,-1.5297
276,-1.3424
277,-1.0673
278,-0.7382
279,-0.39841
280,-0.063666
281,0.24416
282,0.52454
283,0.77875
284,1.0182
285,1.2487
286,1.4509999999999998
287,1.6102
288,1.6878
289,1.6612
290,1.4974
291,1.2036
292,0.7915
293,0.2912
294,-0.25588
295,-0.7893100000000001
296,-1.2581
297,-1.6226
298,-1.8417
299,-1.8915
300,-1.7790000000000001
301,-1.5172
302,-1.1477
303,-0.70599
304,-0.24846
305,0.17862
306,0.54397
307,0.83129
308,1.0239
309,1.1222
310,1.1408
311,1.0944
312,0.9979600000000001
313,0.8665700000000001
314,0.71864
315,0.5572699999999999
316,0.39957
317,0.24708000000000002
318,0.10067999999999999
319,-0.048352
320,-0.20778000000000002
321,-0.38556
322,-0.57398
323,-0.75815
324,-0.89041
325,-0.9452799999999999
326,-0.89928
327,-0.75166
328,-0.51723
329,-0.23934
330,0.033993999999999996
331,0.26181
332,0.40712
333,0.47555
334,0.46897
335,0.41818
336,0.35214
337,0.30338000000000004
338,0.28415
339,0.28137
340,0.29848
341,0.31524
342,0.33368000000000003
343,0.34733
344,0.36556
345,0.36827
346,0.35359
347,0.29556
348,0.17411
349,-0.022973
350,-0.27721
351,-0.55476
352,-0.80977
353,-0.9860899999999999
354,-1.0403
355,-0.96331
356,-0.77218
357,-0.5038600000000001
358,-0.21384
359,0.044489
360,0.245
361,0.38139
362,0.47255
363,0.54462
364,0.61736
365,0.70943
366,0.80592
367,0.87974
368,0.8968700000000001
369,0.8332799999999999
370,0.6832199999999999
371,0.45792
372,0.19203
373,-0.086874
374,-0.3429
375,-0.56363
376,-0.73238
377,-0.8601700000000001
378,-0.93301
379,-0.95568
380,-0.91254
381,-0.79974
382,-0.60121
383,-0.33852
384,-0.0355
385,0.26561999999999997
386,0.51639
387,0.6796399999999999
388,0.74627
389,0.72245
390,0.6171399999999999
391,0.47813
392,0.33039
393,0.19047999999999998
394,0.066754
395,-0.036747
396,-0.12615
397,-0.19546
398,-0.24151999999999998
399,-0.25558000000000003
400,-0.2223
401,-0.13321
402,-0.0073222999999999995
403,0.13948
404,0.26797
405,0.34145
406,0.34555
407,0.28725
408,0.19084
409,0.092835
410,0.034656
411,0.027407
412,0.058342
413,0.10097
414,0.11402000000000001
415,0.06467200000000001
416,-0.054333000000000006
417,-0.22878
418,-0.42245
419,-0.59277
420,-0.68726
421,-0.6856
422,-0.58411
423,-0.40792
424,-0.19119
425,0.019104
426,0.20424
427,0.36019
428,0.48878
429,0.59329
430,0.6812
431,0.74983
432,0.7706
433,0.73198
434,0.62667
435,0.45238999999999996
436,0.22863000000000003
437,-0.0098932
438,-0.22485
439,-0.40202
440,-0.52542
441,-0.59396
442,-0.6157199999999999
443,-0.60769
444,-0.57594
445,-0.52686
446,-0.45816
447,-0.36584
448,-0.24345999999999998
449,-0.089732
450,0.07549700000000001
451,0.25355
452,0.4266
453,0.59575
454,0.7499100000000001
455,0.88685
456,0.9939600000000001
457,1.0424
458,1.0212
459,0.90133
460,0.66973
461,0.32484
462,-0.10553
463,-0.58757
464,-1.0731
465,-1.4957
466,-1.7972
467,-1.9489
468,-1.9176
469,-1.694
470,-1.3059
471,-0.78878
472,-0.19002
473,0.43922
474,1.0418
475,1.5759999999999998
476,2.0111
477,2.3156
478,2.4839
479,2.4956
480,2.3595
481,2.0673
482,1.6088
483,0.99126
484,0.24263
485,-0.5974
486,-1.4769999999999999
487,-2.3135
488,-3.0223
489,-3.5366
490,-3.7849
491,-3.7253
492,-3.3639
493,-2.7260000000000004
494,-1.8441
495,-0.78604
496,0.3698
497,1.5438
498,2.6439999999999997
499,3.5927
