time,value
0,-0.6460899999999999
1,-0.6460899999999999
2,-0.6460899999999999
3,-0.6460899999999999
4,-0.6460899999999999
5,-0.6460899999999999
6,-0.6460899999999999
7,-0.6460899999999999
8,-0.6460899999999999
9,-0.6460899999999999
10,-0.6460899999999999
11,-0.6460899999999999
12,-0.6460899999999999
13,-0.6460899999999999
14,-0.6460899999999999
15,-0.64588
16,-0.64167
17,-0.6194
18,-0.51405
19,-0.40869
20,-0.30335
21,-0.23512
22,-0.21405
23,-0.20501999999999998
24,-0.20501999999999998
25,-0.20501999999999998
26,-0.20501999999999998
27,-0.20501999999999998
28,-0.20501999999999998
29,-0.20501999999999998
30,-0.20501999999999998
31,-0.20501999999999998
32,-0.20501999999999998
33,-0.20501999999999998
34,-0.20501999999999998
35,-0.20501999999999998
36,-0.20501999999999998
37,-0.20501999999999998
38,-0.20501999999999998
39,-0.20501999999999998
40,-0.20501999999999998
41,-0.20501999999999998
42,-0.20501999999999998
43,-0.20501999999999998
44,-0.20501999999999998
45,-0.20501999999999998
46,-0.20501999999999998
47,-0.20501999999999998
48,-0.20501999999999998
49,-0.20501999999999998
50,-0.20501999999999998
51,-0.20501999999999998
52,-0.20501999999999998
53,-0.20501999999999998
54,-0.20501999999999998
55,-0.24199
56,-0.28835
57,-0.34057
58,-0.39324000000000003
59,-0.44592
60,-0.49859
61,-0.5512699999999999
62,-0.59717
63,-0.62878
64,-0.6460899999999999
65,-0.6460899999999999
66,-0.63134
67,-0.60605
68,-0.48595
69,-0.32793
70,-0.1699
71,-0.066958
72,0.19346
73,0.4004
74,0.6111
75,0.8218
76,1.0325
77,1.2432
78,1.4539
79,1.6646
80,1.8753
81,2.086
82,2.2967
83,2.4994
84,2.6995
85,2.8621
86,3.0201
87,3.1781
88,3.3283
89,3.4358
90,3.5426
91,3.648
92,3.7059
93,3.6975
94,3.6649
95,3.6122
96,3.4909
97,3.3371
98,3.0946
99,2.8312
100,2.5559
101,2.2769999999999997
102,1.9609999999999999
103,1.6449
104,1.3289
105,1.0479
106,0.83725
107,0.62655
108,0.41585
109,0.22898000000000002
110,0.28396
111,-0.10318
112,-0.2612
113,-0.32532
114,-0.37378
115,-0.32231
116,-0.26611999999999997
117,-0.18395
118,-0.42163999999999996
119,0.36849
120,0.23163000000000003
121,0.38545
122,0.48749
123,0.5401600000000001
124,0.5928399999999999
125,0.64551
126,0.69819
127,0.7508600000000001
128,0.8035399999999999
129,0.85516
130,0.8783299999999999
131,0.89765
132,0.89765
133,0.8876200000000001
134,0.8539
135,0.7894899999999999
136,0.68414
137,0.57643
138,0.46687
139,0.32384
140,0.16582
141,0.19839
142,-0.15024
143,-0.30826
144,-0.46629
145,-0.62431
146,-0.77557
147,-0.90199
148,-1.0211
149,-1.1265
150,-1.2047
151,-1.2532
152,-1.2403
153,-1.1876
154,-1.1349
155,-1.0822
156,-1.0296
157,-0.9768899999999999
158,-0.9242100000000001
159,-0.86546
160,-0.76644
161,-0.66575
162,-0.5604
163,-0.46829
164,-0.39666
165,-0.33495
166,-0.28226999999999997
167,-0.2296
168,-0.17692
169,-0.12425
170,-0.36545
171,-0.17933
172,-0.15278
173,-0.28468000000000004
174,-0.1081
175,-0.16077
176,-0.24345
177,-0.39304
178,-0.54635
179,-0.70438
180,-0.8419399999999999
181,-0.96414
182,-1.0745
183,-1.1799
184,-1.2466
185,-1.3056
186,-1.3077
187,-1.3057
188,-1.2846
189,-1.2445
190,-1.1391
191,-1.0338
192,-0.92842
193,-0.8230700000000001
194,-0.71772
195,-0.61237
196,-0.50702
197,-0.45856
198,-0.42906000000000005
199,-0.42555
200,-0.42525
201,-0.39997
202,-0.37077
203,-0.31809
204,-0.26888
205,-0.22885
206,-0.20501999999999998
207,-0.20501999999999998
208,-0.20501999999999998
209,-0.20501999999999998
210,-0.20501999999999998
211,-0.20501999999999998
212,-0.20501999999999998
213,-0.20501999999999998
214,-0.24219000000000002
215,-0.28298
216,-0.33565
217,-0.38833
218,-0.441
219,-0.49368
220,-0.54635
221,-0.5990300000000001
222,-0.6517
223,-0.70438
224,-0.75705
225,-0.8082199999999999
226,-0.8587899999999999
227,-0.8666200000000001
228,-0.8666200000000001
229,-0.8666200000000001
230,-0.8666200000000001
231,-0.8666200000000001
232,-0.8666200000000001
233,-0.8666200000000001
234,-0.84485
235,-0.78585
236,-0.70368
237,-0.59833
238,-0.50361
239,-0.41512
240,-0.35391
241,-0.30124
242,-0.24856
243,-0.19589
244,-0.14321
245,-0.46026999999999996
246,-0.19689
247,0.070898
248,0.29203
249,0.069997
250,0.069997
251,-0.12100999999999999
252,-0.17457
253,-0.40408
254,-0.13198
255,-0.18465
256,-0.23733
257,-0.29
258,-0.34221999999999997
259,-0.38858000000000004
260,-0.42555
261,-0.42555
262,-0.42555
263,-0.42555
264,-0.42555
265,-0.42555
266,-0.42555
267,-0.42555
268,-0.42555
269,-0.42555
270,-0.42555
271,-0.42555
272,-0.42555
273,-0.42555
274,-0.42555
275,-0.42344
276,-0.41502
277,-0.38973
278,-0.33705999999999997
279,-0.28438
280,-0.23171
281,-0.21018
282,-0.20597
283,-0.20501999999999998
284,-0.20501999999999998
285,-0.17260999999999999
286,-0.13619
287,-0.42515
288,-0.18109
289,-0.23471999999999998
290,0.069997
291,0.069997
292,0.092572
293,0.14525
294,0.31582
295,0.11735
296,0.17003
297,0.2227
298,0.27538
299,0.32805
300,0.38073
301,0.43341
302,0.48608
303,0.53876
304,0.59143
305,0.62665
306,0.62876
307,0.60478
308,0.5521
309,0.5071
310,0.46707
311,0.45658000000000004
312,0.45658000000000004
313,0.45658000000000004
314,0.45658000000000004
315,0.9036
316,0.9036
317,0.9036
318,0.9036
319,0.9036
320,0.9036
321,0.9036
322,0.9036
323,0.9036
324,0.9036
325,0.9036
326,0.9036
327,0.9036
328,0.9036
329,0.9036
330,0.9036
331,0.9036
332,0.9036
333,0.9036
334,0.9036
335,0.9036
336,0.9036
337,0.9036
338,0.9036
339,0.9036
340,0.9036
341,0.9036
342,0.9036
343,0.9036
344,0.9036
345,0.9036
346,0.9036
347,0.9036
348,0.9036
349,0.9036
350,0.9036
351,0.9036
352,0.9036
353,0.9036
354,0.9036
355,0.9036
356,0.9036
357,0.9036
358,0.9036
359,0.9036
360,0.9036
361,0.9036
362,0.9036
363,0.9036
364,0.9036
365,0.9036
366,0.9036
367,0.9036
368,0.9036
369,0.9036
370,0.91091
371,0.9200799999999999
372,0.9304
373,0.9400200000000001
374,0.9371
375,0.93276
376,0.92235
377,0.91461
378,0.91253
379,0.9161
380,0.9265100000000001
381,0.9379
382,0.9499700000000001
383,0.9683
384,0.98913
385,1.01
386,1.0308
387,1.0516
388,1.0724
389,1.0933
390,1.1158
391,1.1437
392,1.1728
393,1.204
394,1.2353
395,1.2665
396,1.2978
397,1.329
398,1.3586
399,1.3878
400,1.4095
401,1.4303
402,1.4512
403,1.4704
404,1.4813
405,1.492
406,1.5024
407,1.5097
408,1.5126
409,1.5139
410,1.5139
411,1.5105
412,1.5055
413,1.4962
414,1.4857
415,1.473
416,1.4595
417,1.4387
418,1.4178
419,1.3969999999999998
420,1.3693
421,1.3276
422,1.286
423,1.2443
424,1.2027
425,1.161
426,1.1194
427,1.0777
428,1.0453
429,1.0145
430,0.9935700000000001
431,0.9727399999999999
432,0.9519200000000001
433,0.93109
434,0.91027
435,0.8896
436,0.86919
437,0.8539
438,0.84349
439,0.8330700000000001
440,0.8226600000000001
441,0.8058
442,0.78706
443,0.7664300000000001
444,0.74561
445,0.72478
446,0.70396
447,0.68313
448,0.6623100000000001
449,0.64148
450,0.62066
451,0.59983
452,0.57901
453,0.55818
454,0.5373600000000001
455,0.51653
456,0.4957
457,0.47488
458,0.45405
459,0.43323
460,0.4124
461,0.38756
462,0.34799
463,0.30411
464,0.25205
465,0.20534000000000002
466,0.16452
467,0.13584000000000002
468,0.11502000000000001
469,0.46338
470,0.35925
471,0.25513
472,0.151
473,0.30176
474,-0.31243000000000004
475,-0.057749
476,-0.066971
477,-0.066971
478,-0.093151
479,-0.15979000000000002
480,-0.24606999999999998
481,-0.3502
482,-0.46796000000000004
483,-0.11707000000000001
484,-0.14697000000000002
485,-0.1782
486,-0.20790999999999998
487,-0.23706999999999998
488,-0.25789
489,-0.27871999999999997
490,-0.29955
491,-0.32037
492,-0.3412
493,-0.36202
494,-0.38285
495,-0.40771999999999997
496,-0.43562
497,-0.46587
498,-0.49711000000000005
499,-0.52453
500,-0.55118
501,-0.57222
502,-0.59304
503,-0.61387
504,-0.63469
505,-0.65552
506,-0.6763399999999999
507,-0.69717
508,-0.71312
509,-0.72395
510,-0.73452
511,-0.74493
512,-0.75534
513,-0.76575
514,-0.77617
515,-0.7865800000000001
516,-0.79699
517,-0.8074100000000001
518,-0.81782
519,-0.8282299999999999
520,-0.8386399999999999
521,-0.84906
522,-0.8594700000000001
523,-0.8698799999999999
524,-0.88029
525,-0.89765
526,-0.9184700000000001
527,-0.9393
528,-0.9601200000000001
529,-0.9736
530,-0.98636
531,-0.9967799999999999
532,-1.0082
533,-1.024
534,-1.0415
535,-1.0623
536,-1.0818
537,-1.0997
538,-1.1133
539,-1.1237
540,-1.1344
541,-1.1452
542,-1.1645
543,-1.1853
544,-1.2061
545,-1.2252
546,-1.2293
547,-1.2325
548,-1.2325
549,-1.2325
550,-1.2325
551,-1.2325
552,-1.2325
553,-1.2325
554,-1.2325
555,-1.2325
556,-1.2325
557,-1.2325
558,-1.2325
559,-1.2325
560,-1.2325
561,-1.2325
562,-1.235
563,-1.2438
564,-1.2532
565,-1.2636
566,-1.274
567,-1.2844
568,-1.2949
569,-1.3053
570,-1.3126
571,-1.3193
572,-1.3197
573,-1.3197
574,-1.3197
575,-1.3197
576,-1.3197
577,-1.3197
578,-1.3197
579,-1.3197
580,-1.3197
581,-1.3197
582,-1.3197
583,-1.3149
584,-1.3082
585,-1.2983
586,-1.2879
587,-1.2775
588,-1.2671
589,-1.2567
590,-1.2463
591,-1.2359
592,-1.2254
593,-1.215
594,-1.2046
595,-1.1942
596,-1.1899
597,-1.1891
598,-1.1889
599,-1.1889
600,-1.1825
601,-1.1753
602,-1.1649
603,-1.1545
604,-1.1441
605,-1.1337
606,-1.1233
607,-1.1128
608,-1.1024
609,-1.092
610,-1.0816
611,-1.0712
612,-1.0608
613,-1.0504
614,-1.04
615,-1.0295
616,-1.0191
617,-1.0087
618,-0.9983
619,-0.9878899999999999
620,-0.98093
621,-0.98051
622,-0.98525
623,-0.99567
624,-1.0046
625,-1.0125
626,-1.0145
627,-1.0145
628,-1.0145
629,-1.0145
630,1.6686
631,1.6686
632,1.6686
633,1.6686
634,1.6686
635,1.6686
636,1.6686
637,1.6686
638,1.6686
639,1.6686
640,1.6686
641,1.6686
642,1.6686
643,1.6686
644,1.6686
645,1.6686
646,1.6696
647,1.675
648,1.7003
649,1.7255
650,1.7508
651,1.7672
652,1.7722
653,1.7744
654,1.7744
655,1.7744
656,1.7744
657,1.7744
658,1.7744
659,1.7744
660,1.7744
661,1.7744
662,1.7744
663,1.7744
664,1.7744
665,1.7744
666,1.7744
667,1.7744
668,1.7744
669,1.7744
670,1.7744
671,1.7744
672,1.7744
673,1.7744
674,1.7744
675,1.7744
676,1.7744
677,1.7744
678,1.7744
679,1.7744
680,1.7744
681,1.7744
682,1.7744
683,1.7744
684,1.7744
685,1.7788
686,1.7844
687,1.7906
688,1.7955
689,1.7776
690,1.757
691,1.7254
692,1.6914
693,1.6523
694,1.6079
695,1.5574
696,1.5057
697,1.4531
698,1.393
699,1.3298
700,1.2667
701,1.2035
702,1.1403
703,1.0771
704,1.014
705,0.95183
706,0.8929600000000001
707,0.83483
708,0.7779699999999999
709,0.7239
710,0.67261
711,0.62578
712,0.5815600000000001
713,0.5383
714,0.49533999999999995
715,0.4569
716,0.419
717,0.3811
718,0.34413
719,0.3123
720,0.28053
721,0.24894000000000002
722,0.21356999999999998
723,0.17289000000000002
724,0.13027
725,0.42267
726,0.20157
727,-0.14092000000000002
728,-0.24061999999999997
729,-0.46171999999999996
730,-0.1322
731,-0.1727
732,-0.20428
733,-0.23586999999999997
734,-0.26745
735,-0.29483000000000004
736,-0.31378
737,-0.33273
738,-0.35168
739,-0.3592
740,-0.35895
741,-0.35429
742,-0.34797
743,-0.34165999999999996
744,-0.33534
745,-0.32902
746,-0.3227
747,-0.31639
748,-0.31006999999999996
749,-0.30375
750,-0.29763
751,-0.29181999999999997
752,-0.29220999999999997
753,-0.29853
754,-0.30485
755,-0.31117
756,-0.32921
757,-0.35069
758,-0.3756
759,-0.40060999999999997
760,-0.41881
761,-0.43606999999999996
762,-0.44871000000000005
763,-0.46074
764,-0.47135
765,-0.48012
766,-0.48644
767,-0.49304
768,-0.49986
769,-0.5107
770,-0.5233300000000001
771,-0.53597
772,-0.5486
773,-0.55113
774,-0.55298
775,-0.55298
776,-0.55461
777,-0.56219
778,-0.5715100000000001
779,-0.58415
780,-0.5946100000000001
781,-0.6027
782,-0.60588
783,-0.60588
784,-0.60644
785,-0.60719
786,-0.61278
787,-0.6191
788,-0.62542
789,-0.6339199999999999
790,-0.65691
791,-0.6805
792,-0.70577
793,-0.7310399999999999
794,-0.75631
795,-0.78157
796,-0.80684
797,-0.83211
798,-0.8573799999999999
799,-0.88265
800,-0.90791
801,-0.9304
802,-0.95188
803,-0.9582
804,-0.9645100000000001
805,-0.97083
806,-0.97175
807,-0.9606299999999999
808,-0.94885
809,-0.93621
810,-0.9284899999999999
811,-0.92445
812,-0.92324
813,-0.92324
814,-0.91861
815,-0.91305
816,-0.9006700000000001
817,-0.8880399999999999
818,-0.8754
819,-0.86277
820,-0.8501299999999999
821,-0.8375
822,-0.8248700000000001
823,-0.81815
824,-0.81765
825,-0.81745
826,-0.81745
827,-0.8208700000000001
828,-0.8254100000000001
829,-0.83152
830,-0.83791
831,-0.85029
832,-0.86361
833,-0.88256
834,-0.9006799999999999
835,-0.9166
836,-0.92863
837,-0.93495
838,-0.94127
839,-0.94758
840,-0.9539
841,-0.9602200000000001
842,-0.96654
843,-0.97285
844,-0.97025
845,-0.9667899999999999
846,-0.96047
847,-0.9535299999999999
848,-0.9439299999999999
849,-0.93335
850,-0.9207200000000001
851,-0.90728
852,-0.8928799999999999
853,-0.87582
854,-0.85687
855,-0.8375600000000001
856,-0.8181
857,-0.7884
858,-0.75681
859,-0.72523
860,-0.69635
861,-0.69003
862,-0.6852199999999999
863,-0.6852199999999999
864,-0.68261
865,-0.67553
866,-0.66568
867,-0.65304
868,-0.6429600000000001
869,-0.63437
870,-0.63232
871,-0.63232
872,-0.63232
873,-0.63232
874,-0.63232
875,-0.63232
876,-0.63232
877,-0.63232
878,-0.63232
879,-0.63232
880,-0.63232
881,-0.63232
882,-0.63232
883,-0.63232
884,-0.63232
885,-0.63048
886,-0.62821
887,-0.6221300000000001
888,-0.6158100000000001
889,-0.6095
890,-0.60318
891,-0.5968600000000001
892,-0.59055
893,-0.58423
894,-0.57791
895,-0.5716
896,-0.56528
897,-0.55896
898,-0.5526399999999999
899,-0.54633
900,-0.54001
901,-0.53369
902,-0.5273800000000001
903,-0.5210600000000001
904,-0.51474
905,-0.50868
906,-0.50337
907,-0.5000899999999999
908,-0.5000899999999999
909,-0.5000899999999999
910,-0.5000899999999999
911,-0.5000899999999999
912,-0.5000899999999999
913,-0.5000899999999999
914,-0.5000899999999999
915,-0.4962
916,-0.49183000000000004
917,-0.48552
918,-0.48012
919,-0.47936999999999996
920,-0.48071
921,-0.48703
922,-0.49335
923,-0.49967
924,-0.50598
925,-0.5123
926,-0.51862
927,-0.52493
928,-0.52627
929,-0.52652
930,-0.52653
931,-0.52691
932,-0.53146
933,-0.5363899999999999
934,-0.54271
935,-0.54693
936,-0.54718
937,-0.5443100000000001
938,-0.53799
939,-0.53259
940,-0.52779
941,-0.52653
942,-0.52653
943,-0.52653
944,-0.52653
