time,value
0,-0.63561
1,-0.63561
2,-0.63561
3,-0.63561
4,-0.63561
5,-0.63561
6,-0.63561
7,-0.63561
8,-0.63561
9,-0.63561
10,-0.63561
11,-0.63561
12,-0.63561
13,-0.63561
14,-0.63561
15,-0.63561
16,-0.63561
17,-0.63561
18,-0.63561
19,-0.63561
20,-0.63561
21,-0.63561
22,-0.63188
23,-0.63243
24,-0.63038
25,-0.601
26,-0.58563
27,-0.61507
28,-0.61788
29,-0.61126
30,-0.6153
31,-0.61112
32,-0.6060800000000001
33,-0.58965
34,-0.58923
35,-0.61025
36,-0.6087
37,-0.60317
38,-0.6029100000000001
39,-0.59726
40,-0.58725
41,-0.5865600000000001
42,-0.5925699999999999
43,-0.54837
44,-0.53905
45,-0.5573899999999999
46,-0.49186
47,-0.49895
48,-0.52817
49,-0.51317
50,-0.5212600000000001
51,-0.49256000000000005
52,-0.47863
53,-0.52025
54,-0.49915
55,-0.5018699999999999
56,-0.50449
57,-0.54127
58,-0.5254
59,-0.48533999999999994
60,-0.47698
61,-0.48618
62,-0.46865
63,-0.47688
64,-0.47698
65,-0.50024
66,-0.50647
67,-0.50265
68,-0.51154
69,-0.53946
70,-0.50422
71,-0.24586999999999998
72,-0.35123000000000004
73,-0.40376999999999996
74,-0.48068
75,-0.38842
76,-0.43978999999999996
77,-0.45216000000000006
78,-0.46908
79,-0.4329
80,-0.44714
81,-0.4439
82,-0.4648
83,-0.49336
84,-0.4755
85,-0.47239
86,-0.4655
87,-0.47548999999999997
88,-0.42317
89,-0.42683000000000004
90,-0.43386
91,-0.46868999999999994
92,-0.49643999999999994
93,-0.43693000000000004
94,-0.42166000000000003
95,-0.42667
96,-0.45111999999999997
97,-0.45886000000000005
98,-0.49599
99,-0.50683
100,-0.44406999999999996
101,-0.37906999999999996
102,-0.4645
103,-0.4333
104,-0.42783000000000004
105,-0.36079
106,-0.43227
107,-0.44891000000000003
108,1.5490000000000002
109,6.9089
110,3.8614
111,2.8923
112,3.4302
113,2.9492
114,3.0286
115,2.4747
116,2.1337
117,1.8628
118,2.1686
119,1.7881
120,1.6740000000000002
121,1.3553
122,1.5607
123,1.5735
124,1.2639
125,1.5721
126,2.2354
127,1.527
128,1.2804
129,1.0057
130,1.3474
131,1.1894
132,1.3683
133,2.4838
134,1.0348
135,0.97639
136,1.4961
137,1.0764
138,0.96439
139,1.2894
140,1.5437
141,1.5729
142,1.7409999999999999
143,1.9623
144,3.9515
145,3.7344
146,3.1121
147,1.8423
148,1.0859999999999999
149,1.0564
150,0.8756299999999999
151,1.5481
152,1.9033
153,1.844
154,2.0989
155,1.2484
156,2.7185
157,2.6159
158,0.8142
159,0.58415
160,0.39666999999999997
161,0.3687
162,0.42028000000000004
163,0.45226000000000005
164,1.2712
165,1.0270000000000001
166,0.73516
167,0.43676000000000004
168,0.3409
169,0.28724
170,0.33878
171,0.38432
172,0.16813
173,0.2192
174,0.36782
175,0.28118000000000004
176,0.46786000000000005
177,0.12784
178,0.23675
179,0.35417
180,0.22232
181,0.40335
182,0.12220999999999999
183,0.065554
184,0.19222
185,0.044275
186,0.1713
187,0.18419000000000002
188,0.024505000000000002
189,-0.040006
190,-0.1439
191,-0.10705999999999999
192,-0.11773
193,-0.060141999999999994
194,-0.1748
195,-0.082808
196,-0.14745
197,-0.077628
198,-0.14307
199,-0.10833
200,-0.16717
201,-0.29391999999999996
202,-0.27858
203,-0.3474
204,-0.22241
205,-0.25322
206,-0.20945999999999998
207,-0.31956
208,-0.27771999999999997
209,-0.29645
210,-0.24715
211,-0.28720999999999997
212,-0.13831
213,-0.147
214,-0.19363
215,-0.34183
216,-0.34731999999999996
217,-0.32563000000000003
218,-0.34453
219,-0.35004
220,-0.40412
221,-0.30651999999999996
222,-0.22299000000000002
223,-0.22533000000000003
224,-0.25381
225,-0.36414
226,-0.40429
227,-0.44733
228,-0.3998
229,-0.43293000000000004
230,-0.40664
231,-0.46225
232,-0.47915
233,-0.46837
234,-0.35957
235,-0.32422
236,-0.4255
237,-0.43238000000000004
238,-0.35923
239,-0.32684
240,-0.3376
241,-0.34481999999999996
242,-0.42532
243,-0.39421
244,-0.36318
245,-0.42316000000000004
246,-0.44618
247,-0.45591000000000004
248,-0.43632
249,-0.44276000000000004
250,-0.46887
251,-0.50778
252,-0.44504
253,-0.5030399999999999
254,-0.46906000000000003
255,-0.49306000000000005
256,-0.51298
257,-0.51649
258,-0.48791
259,-0.47827
260,-0.53287
261,-0.5150600000000001
262,-0.53627
263,-0.53613
264,-0.5022800000000001
265,-0.47838
266,-0.46091000000000004
267,-0.4376
268,-0.43516000000000005
269,-0.37974
270,-0.39427
271,-0.44133999999999995
272,-0.39810999999999996
273,-0.40418000000000004
274,-0.47476999999999997
275,-0.48756000000000005
276,-0.49959
277,-0.49475
278,-0.50842
279,-0.52331
280,-0.53228
281,-0.48212
282,-0.51817
283,-0.48038000000000003
284,-0.49088000000000004
285,-0.49606999999999996
286,-0.51245
287,-0.50948
288,-0.48198
289,-0.51167
290,-0.5291100000000001
291,-0.53473
292,-0.54916
293,-0.5230600000000001
294,-0.50939
295,-0.52986
296,-0.51264
297,-0.51363
298,-0.52313
299,-0.50074
300,-0.49798000000000003
301,-0.47628000000000004
302,-0.52379
303,-0.50284
304,-0.5596
305,-0.58848
306,-0.63463
307,-0.63559
308,-0.63561
309,-0.63561
310,-0.63561
311,-0.63561
312,-0.63561
313,-0.63561
314,-0.63561
315,-0.63561
316,-0.63561
317,-0.63561
318,-0.63561
