time,value
0,1.411
1,1.2876
2,1.2778
3,1.3321
4,1.416
5,1.3419
6,1.3469
7,1.3123
8,1.2827
9,1.2975
10,1.2778
11,1.2728
12,1.2284
13,1.2185
14,1.1741
15,1.1889
16,1.1692
17,1.1396
18,1.1396
19,1.11
20,1.0853
21,1.0507
22,1.0112
23,1.0112
24,0.99644
25,0.8730399999999999
26,0.82862
27,0.81875
28,0.72004
29,0.65587
30,0.59664
31,0.5324800000000001
32,0.46831000000000006
33,0.40415
34,0.33998
35,0.27581999999999995
36,0.29063
37,0.27088
38,0.32024
39,0.37453000000000003
40,0.41402
41,0.43376000000000003
42,0.47325
43,0.48806000000000005
44,0.49299
45,0.45351
46,0.46831000000000006
47,0.41896000000000005
48,0.33998
49,0.37453000000000003
50,0.41402
51,0.31531
52,0.28569
53,0.34492
54,0.3696
55,0.39428
56,0.43376000000000003
57,0.44364
58,0.45351
59,0.34492
60,0.34492
61,0.33011
62,0.33998
63,0.26595
64,0.22646
65,0.12775
66,0.17217000000000002
67,0.10307000000000001
68,0.14256
69,0.10307000000000001
70,0.093198
71,0.053712
72,-0.010453
73,0.014225999999999999
74,-0.015388999999999998
75,-0.015388999999999998
76,-0.09436
77,-0.10917
78,-0.24243
79,-0.25724
80,-0.38556999999999997
81,-0.34608
82,-0.8396600000000001
83,-0.5089600000000001
84,-0.9778600000000001
85,-0.73107
86,-0.81004
87,-0.8594
88,-0.81498
89,-0.82485
90,-0.81498
91,-0.8594
92,-0.7853600000000001
93,-0.67184
94,-0.73601
95,-0.67184
96,-0.62248
97,-0.60768
98,-0.57806
99,-0.56819
100,-0.57806
101,-0.54351
102,-0.54845
103,-0.52871
104,-0.57313
105,-0.53364
106,-0.47935
107,-0.47935
108,-0.37076
109,-0.28192
110,-0.25724
111,-0.1832
112,-0.074617
113,-0.064746
114,0.038905
115,0.11294000000000001
116,0.20672
117,0.38441
118,0.46831000000000006
119,0.57196
120,0.59664
121,0.67068
122,0.65587
123,0.66574
124,0.6410600000000001
125,0.6311899999999999
126,0.60158
127,0.65587
128,0.61639
129,0.72497
130,0.76446
131,0.8631700000000001
132,0.99644
133,1.0112
134,0.99644
135,1.0853
136,1.1346
137,1.1544
138,1.1544
139,1.2185
140,1.2531
141,1.2827
142,1.2827
143,1.3469
144,1.3814
145,1.3962
146,1.4258
147,1.4357
148,1.3913
149,1.49
150,1.3716
151,1.3962
152,1.4012
153,1.3419
154,1.3913
155,1.4851
156,1.3814
157,1.5098
158,1.5295
159,1.4801
160,1.4061
161,1.3617
162,1.3271
163,1.2926
164,1.2679
165,1.2235
166,1.2432
167,1.1889
168,1.1544
169,1.0507
170,0.99644
171,1.0014
172,0.95695
173,0.91253
174,0.9816299999999999
175,0.9915
176,0.9520200000000001
177,0.94214
178,0.93721
179,0.9224
180,0.8631700000000001
181,0.81875
182,0.73978
183,0.65587
184,0.5472899999999999
185,0.41402
186,0.20672
187,0.26100999999999996
188,0.2314
189,0.17711
190,0.11788
191,0.07345499999999999
192,0.058648
193,0.058648
194,0.033969
195,0.053712
196,-0.015388999999999998
197,0.0092902
198,-0.089425
199,-0.1141
200,-0.25724
201,-0.22269
202,-0.33621
203,-0.38556999999999997
204,-0.54845
205,-0.64223
206,-0.7508100000000001
207,-0.76562
208,-0.8495299999999999
209,-0.82485
210,-0.86434
211,-0.89889
212,-0.9334399999999999
213,-0.96799
214,-1.0025
215,-1.0371
216,-0.95811
217,-0.83472
218,-0.62742
219,-0.30166
220,-0.12891
221,0.06851900000000001
222,0.20178
223,0.18698
224,0.22153
225,0.32024
226,0.27088
227,0.29063
228,0.22153
229,0.25114000000000003
230,0.32024
231,0.26595
232,0.33011
233,0.34492
234,0.27581999999999995
235,0.31037
236,0.23633
237,0.27581999999999995
238,0.14749
239,0.17217000000000002
240,0.13762
241,0.22153
242,0.26100999999999996
243,0.21659
244,0.19685
245,0.11788
246,0.1623
247,0.10307000000000001
248,0.078391
249,0.06851900000000001
250,0.029033
251,-0.00058132
252,-0.089425
253,-0.1684
254,-0.22763000000000003
255,-0.28685
256,-0.39544
257,-0.57313
258,-0.50403
259,-0.66691
260,-0.67184
261,-0.7804300000000001
262,-0.75575
263,-0.84459
264,-0.88408
265,-0.94824
266,-0.91369
267,-0.89395
268,-0.94331
269,-0.96305
270,-0.96799
271,-0.94331
272,-0.89889
273,-0.91369
274,-0.8791399999999999
275,-0.8791399999999999
276,-0.8890100000000001
277,-0.8495299999999999
278,-0.8495299999999999
279,-0.8495299999999999
280,-0.81991
281,-0.8495299999999999
282,-0.86434
283,-0.8791399999999999
284,-0.90876
285,-0.95811
286,-0.99266
287,-1.0272
288,-1.0766
289,-1.0815
290,-1.0963
291,-1.0914
292,-1.1062
293,-1.0272
294,-0.9531799999999999
295,-0.88408
296,-0.8495299999999999
297,-0.83472
298,-0.87421
299,-0.88408
300,-0.81498
301,-0.80511
302,-0.77056
303,-0.74588
304,-0.47441000000000005
305,-0.48428000000000004
306,-0.50403
307,-0.41518
308,-0.42012
309,-0.40531
310,-0.42012
311,-0.41025
312,-0.44973
313,-0.46948
314,-0.34608
315,-0.44973
316,-0.42012
317,-0.46453999999999995
318,-0.8594
319,-0.9729200000000001
320,-0.99266
321,-1.0173
322,-1.0322
323,-1.0272
324,-0.9976
325,-0.91369
326,-0.85446
327,-0.8001699999999999
328,-0.5385800000000001
329,-0.49909
330,-0.45961
331,-0.45466999999999996
332,-0.42505
333,-0.40531
334,-0.38556999999999997
335,-0.36583000000000004
336,-0.3757
337,-0.86434
338,-0.88408
339,-0.8692700000000001
340,-0.7853600000000001
341,-0.66197
342,-0.53364
343,-0.48922
344,-0.33621
345,-0.19308
346,-0.13385
347,0.078391
348,0.24126999999999998
349,0.38934
350,0.33011
351,0.41402
352,0.44364
353,0.47818999999999995
354,0.49793000000000004
355,0.51767
356,0.55716
357,0.5917100000000001
358,0.6311899999999999
359,0.67068
360,0.7447199999999999
361,0.80394
362,0.82862
363,0.8483700000000001
364,0.8236899999999999
365,0.8631700000000001
366,0.82862
367,0.8236899999999999
368,0.86811
369,0.79901
370,0.81875
371,0.81875
372,0.81382
373,0.76446
374,0.7842
375,0.77927
376,0.73978
377,0.7299100000000001
378,0.7447199999999999
379,0.77927
380,0.83849
381,0.8730399999999999
382,0.87798
383,0.85824
384,0.85824
385,0.81382
386,0.80888
387,0.8533
388,0.90759
389,0.83849
390,0.77433
391,0.8335600000000001
392,0.8533
393,0.87798
394,0.8977200000000001
395,0.9717600000000001
396,0.9273399999999999
397,1.0409
398,1.0409
399,0.99644
400,0.9767
401,0.9767
402,1.0014
403,1.0162
404,1.0162
405,1.0359
406,1.0655
407,1.031
408,1.0655
409,1.11
410,1.0705
411,1.1149
412,1.1544
413,1.1643
414,1.2432
415,1.2284
416,1.2531
417,1.1741
418,1.1001
419,1.1494
420,1.1791
421,1.1791
422,1.1198
423,1.1988
424,1.0952
425,1.1248
426,1.0507
427,0.9915
428,0.93227
429,0.86811
430,0.80888
431,0.74965
432,0.69042
433,0.5522199999999999
434,0.37453000000000003
435,0.038905
436,-0.025259999999999998
437,-0.089425
438,-0.37076
439,-0.31153000000000003
440,-0.48922
441,-0.68171
442,-0.8001699999999999
443,-0.9827899999999999
444,-1.0864
445,-1.2246
446,-1.2839
447,-1.3184
448,-1.4221
449,-1.4714
450,-1.501
451,-1.5307
452,-1.5603
453,-1.585
454,-1.6146
455,-1.6442
456,-1.6639
457,-1.659
458,-1.5998
459,-1.5504
460,-1.4319
461,-1.3036
462,-1.2345
463,-1.1062
464,-1.1901
465,-1.1457
466,-1.1013
467,-1.0618
468,-1.0124
469,-1.0272
470,-0.8791399999999999
471,-0.8001699999999999
472,-0.81498
473,-0.85446
474,-0.71133
475,-0.7508100000000001
476,-0.75575
477,-0.53364
478,-0.49909
479,-0.45961
480,-0.61261
481,-0.49909
482,-0.4448
483,-0.3757
484,-0.41518
485,-0.38063
486,-0.39544
487,-0.42012
488,-0.41025
489,-0.41518
490,-0.38556999999999997
491,-0.40038
492,-0.46948
493,-0.3757
494,-0.47935
495,-0.29179
496,-0.20295
497,-0.19308
498,-0.20788
499,-0.19801
500,-0.16346
501,-0.13878
502,-0.11904
503,-0.12397000000000001
504,-0.13878
505,-0.010453
506,-0.025259999999999998
507,-0.00058132
508,-0.00058132
509,-0.020324000000000002
510,-0.0055171000000000005
511,0.014225999999999999
512,-0.0055171000000000005
513,0.019162000000000002
514,0.04384
515,0.13762
516,0.13268
517,0.14749
518,0.22153
519,0.25608000000000003
520,0.34492
521,0.40909
522,0.47325
523,0.51767
524,0.5522199999999999
525,0.70523
526,0.68055
527,0.7348399999999999
528,0.7447199999999999
529,0.91253
530,0.90266
531,0.91253
532,0.93721
533,0.8730399999999999
534,0.91253
535,0.9273399999999999
536,0.9618899999999999
537,0.9915
538,1.105
539,1.0507
540,1.11
541,1.1396
542,1.1643
543,1.1889
544,1.2136
545,1.2383
546,1.2679
547,1.2334
548,1.263
549,1.2432
550,1.2284
551,1.2185
552,1.2482
553,1.1939
554,1.1791
555,1.1988
556,1.2037
557,1.1988
558,1.1840000000000002
559,1.1593
560,1.1643
561,1.1593
562,1.1791
563,1.0655
564,1.0853
565,1.0507
566,1.0162
567,1.0409
568,1.0014
569,0.90266
570,0.9618899999999999
571,0.93227
572,0.9767
573,0.9915
574,0.9470799999999999
575,0.9668200000000001
576,0.95695
577,0.9224
578,0.89279
579,0.9174700000000001
580,0.9174700000000001
581,0.9174700000000001
582,0.85824
583,0.82862
584,0.8434299999999999
585,0.83849
586,0.8434299999999999
587,0.75952
588,0.76446
589,0.75952
590,0.75952
591,0.75952
592,0.75459
593,0.65094
594,0.62626
595,0.67068
596,0.5818399999999999
597,0.54235
598,0.56209
599,0.59664
600,0.63613
601,0.6311899999999999
602,0.6953600000000001
603,0.6459999999999999
604,0.78914
605,0.71017
606,0.74965
607,0.75459
608,0.86811
609,0.81382
610,0.9470799999999999
611,1.0211
612,1.1149
613,1.1445
614,1.2087
615,1.2087
616,1.263
617,1.2235
618,1.2235
619,1.263
620,1.2778
621,1.1692
622,1.1494
623,1.0803
624,1.0112
625,0.63613
626,0.47818999999999995
627,0.35479
628,0.36466
629,0.35479
630,0.25608000000000003
631,0.053712
632,-0.049939
633,-0.14372000000000001
634,-0.28192
635,-0.37076
636,-0.49416000000000004
637,-0.5583199999999999
638,-0.64223
639,-0.7409399999999999
640,-0.8495299999999999
641,-0.9285
642,-1.0075
643,-1.0371
644,-1.0766
645,-1.121
646,-1.1654
647,-1.2098
648,-1.2543
649,-1.2987
650,-1.2592
651,-1.2641
652,-1.2345
653,-1.2395
654,-1.2641
655,-1.2296
656,-1.274
657,-1.2493
658,-1.2246
659,-1.2839
660,-1.2987
661,-1.3727
662,-1.4517
663,-1.5603
664,-1.7083
665,-1.7725
666,-1.8268
667,-1.8465
668,-1.886
669,-2.0094
670,-2.0242
671,-2.1427
672,-2.1575
673,-2.2463
674,-2.271
675,-2.276
676,-2.3303
677,-2.3549
678,-2.35
679,-2.3747
680,-2.4438
681,-2.4635
682,-2.4783
683,-2.4931
684,-2.4586
685,-2.4734
686,-2.4635
687,-2.4191
688,-2.3845
689,-2.35
690,-2.3303
691,-2.3154
692,-2.3154
693,-2.3056
694,-2.271
695,-2.197
696,-2.1575
697,-2.1427
698,-2.1032
699,-2.1180000000000003
700,-2.0588
701,-2.044
702,-2.0094
703,-1.9601
704,-1.9156
705,-1.886
706,-1.7774
707,-1.7034
708,-1.6689
709,-1.6047
710,-1.5899
711,-1.506
712,-1.4269999999999998
713,-1.4269999999999998
714,-1.4073
715,-1.3974
716,-1.4468
717,-1.4813
718,-1.506
719,-1.4912
720,-1.4961
721,-1.4714
722,-1.4517
723,-1.4665
724,-1.4269999999999998
725,-1.3974
726,-1.4269999999999998
727,-1.4418
728,-1.4862
729,-1.6195
730,-1.7774
731,-1.9058
732,-2.044
733,-2.1378
734,-2.1772
735,-2.2858
736,-2.35
737,-2.3253
738,-2.3549
739,-2.3747
740,-2.3944
741,-2.2562
742,-2.2217
743,-2.0835
744,-2.0341
745,-1.891
746,-1.5553
747,-1.4517
748,-1.3530000000000002
749,-1.4319
750,-1.2197
751,-1.1457
752,-1.1555
753,-1.0371
754,-0.87421
755,-0.7903
756,-0.70639
757,-0.62248
758,-0.5385800000000001
759,-0.45466999999999996
760,-0.37076
761,-0.26218
762,-0.1832
763,-0.10422999999999999
764,-0.035131
765,-0.010453
766,0.063583
767,0.14256
768,0.18698
769,0.22646
770,0.28569
771,0.35479
772,0.4387
773,0.44856999999999997
774,0.60651
775,0.68055
776,0.7940699999999999
777,0.8335600000000001
778,0.81875
779,0.90759
780,1.0261
781,0.9915
782,1.0409
783,1.0211
784,1.0902
785,1.1840000000000002
786,1.2284
787,1.1643
788,1.1840000000000002
789,1.1840000000000002
790,1.2087
791,1.1445
792,1.1643
793,1.1741
794,1.2235
795,1.2432
796,1.1939
797,1.2037
798,1.1791
799,1.1840000000000002
800,1.1791
801,1.1396
802,1.1248
803,1.0409
804,1.0261
805,1.0409
806,0.9915
807,0.9717600000000001
808,0.9470799999999999
809,0.9224
810,0.9273399999999999
811,0.94214
812,1.0112
813,1.105
814,1.2235
815,1.2383
816,1.2876
817,1.2778
818,1.3025
819,1.2284
820,1.1988
821,1.1445
822,1.0458
823,0.8335600000000001
824,0.81875
825,0.76446
826,0.6854899999999999
827,0.69042
828,0.66574
829,0.63613
830,0.5917100000000001
831,0.5917100000000001
832,0.5028600000000001
833,0.51274
834,0.47325
835,0.42883000000000004
836,0.34986
837,0.34986
838,0.31531
839,0.25608000000000003
840,0.28076
841,0.033969
842,-0.010453
843,-0.12397000000000001
844,-0.21281999999999998
845,-0.29673
846,-0.34608
847,-0.34608
848,-0.39544
849,-0.44973
850,-0.41025
851,-0.35102
852,-0.3757
853,-0.38063
854,-0.38556999999999997
855,-0.36089
856,-0.42012
857,-0.42999
858,-0.4448
859,-0.49909
860,-0.42012
861,-0.42012
862,-0.35595
863,-0.32634
864,-0.3066
865,-0.28685
866,-0.27205
867,-0.2523
868,-0.23256
869,-0.21281999999999998
870,-0.19308
871,-0.14865
872,-0.1684
873,-0.13878
874,0.033969
875,0.038905
876,0.078391
877,0.10800000000000001
878,0.14749
879,0.093198
880,0.10800000000000001
881,0.15736
882,0.16723
883,0.19685
884,0.18698
885,0.27088
886,0.24620999999999998
887,0.31531
888,0.28569
889,0.24126999999999998
890,0.24126999999999998
891,0.23633
892,0.19685
893,0.23633
894,0.19685
895,0.26100999999999996
896,0.24620999999999998
897,0.29063
898,0.31037
899,0.52754
