time,value
0,0.64523
1,0.16155999999999998
2,0.30641999999999997
3,0.26665
4,-0.030767000000000003
5,-0.6942699999999999
6,-0.069326
7,-0.26018
8,1.493
9,1.493
10,1.493
11,1.493
12,1.493
13,1.493
14,1.493
15,1.493
16,1.493
17,1.493
18,1.493
19,1.493
20,1.493
21,1.493
22,-1.4662
23,-1.4662
24,-1.4662
25,-1.4662
26,-1.4662
27,-1.4662
28,-1.4662
29,-1.4662
30,-1.4662
31,-1.4662
32,-1.4662
33,-1.4662
34,-1.4662
35,-0.029705000000000002
36,-0.46512
37,-0.16706
38,-0.10103
39,0.022524000000000002
40,-0.16203
41,0.13393
42,1.493
43,1.493
44,1.493
45,1.493
46,1.493
47,1.493
48,1.493
49,1.493
50,1.493
51,1.493
52,1.493
53,1.493
54,1.493
55,1.493
56,-1.4662
57,-1.4662
58,-1.4662
59,-1.4662
60,-1.4662
61,-1.4662
62,-1.4662
63,-1.4662
64,-1.4662
65,-1.4662
66,-1.4662
67,-1.4662
68,-1.4662
69,-1.4662
70,-0.060672000000000004
71,-0.091488
72,-0.011719
73,-0.66266
74,-0.43311000000000005
75,0.043154000000000005
76,0.16028
77,0.12137
78,-0.23324
79,-0.06264700000000001
80,0.20995999999999998
81,-0.085371
82,0.004014500000000001
83,-0.17985
84,-0.043594
85,-0.026723
86,-0.12042
87,-0.28192
88,-0.38708000000000004
89,-0.093214
90,-0.12532000000000001
91,-0.21978000000000003
92,-0.028082999999999997
93,-0.044181
94,-0.27385
95,-0.011062
96,-0.3243
97,0.00047136
98,0.16774
99,0.18323
100,0.53676
101,0.2392
102,0.5735899999999999
103,-0.46981000000000006
104,-0.040215
105,-0.66368
106,-0.32902
107,0.035851
108,-0.0067164
109,-0.061719
110,0.5996600000000001
111,-0.037852
112,0.45766
113,0.23176999999999998
114,-0.085603
115,0.47666000000000003
116,-0.15469000000000002
117,0.36880999999999997
118,-0.019962
119,0.27188
120,-0.35518
121,0.08667799999999999
122,-0.37606
123,0.48248
124,0.17682
125,-0.7122
126,-0.2687
127,0.17799
