time,value
0,0.99436
1,0.99436
2,0.99436
3,0.99436
4,0.99436
5,0.99436
6,0.99436
7,0.99436
8,0.99436
9,0.99436
10,0.99436
11,0.99436
12,0.99436
13,0.99436
14,0.99436
15,0.99436
16,0.99436
17,0.99436
18,0.99436
19,0.99436
20,0.99436
21,0.99436
22,0.9904799999999999
23,0.9771700000000001
24,0.9333100000000001
25,0.9041
26,0.8848
27,0.8842
28,0.8842
29,0.8842
30,0.8842
31,0.8842
32,0.8842
33,0.8842
34,0.8842
35,0.8842
36,0.8842
37,0.8842
38,0.86282
39,0.82599
40,0.79484
41,0.77404
42,0.77404
43,0.77404
44,0.7733800000000001
45,0.76426
46,0.73966
47,0.69581
48,0.65196
49,0.60811
50,0.56425
51,0.5204
52,0.47655
53,0.40901
54,0.33412
55,0.24641
56,0.15871
57,0.36798000000000003
58,-0.07054500000000001
59,-0.10440999999999999
60,-0.19211
61,-0.24656999999999998
62,-0.29245
63,-0.3363
64,-0.38015
65,-0.424
66,-0.50248
67,-0.58977
68,-0.69116
69,-0.81271
70,-0.9400799999999999
71,-0.9706
72,-0.9884700000000001
73,-0.9884700000000001
74,-0.9884700000000001
75,-0.9836799999999999
76,-0.95386
77,-0.9229200000000001
78,-0.89099
79,-0.9277799999999999
80,-0.9643700000000001
81,-0.98226
82,-0.9884700000000001
83,-0.9884700000000001
84,-0.9884700000000001
85,-0.9884700000000001
86,-0.9884700000000001
87,-0.9884700000000001
88,-0.9945799999999999
89,-1.0367
90,-1.0797
91,-1.1235
92,-1.1674
93,-1.2213
94,-1.3034
95,-1.3708
96,-1.4291
97,-1.4291
98,-1.4423
99,-1.4767
100,-1.5023
101,-1.5165
102,-1.4726
103,-1.4441
104,-1.4308
105,-1.4291
106,-1.4291
107,-1.4291
108,-1.4291
109,-1.4291
110,-1.4263
111,-1.4084
112,-1.3645
113,-1.3376
114,-1.3189
115,-1.3189
116,-1.3398
117,-1.3826
118,-1.41
119,-1.4291
120,-1.4291
121,-1.4291
122,-1.4291
123,-1.4291
124,-1.4291
125,-1.4291
126,-1.4291
127,-1.4291
128,-1.4291
129,-1.4291
130,-1.4291
131,-1.3764
132,-1.3116
133,-1.2387
134,-1.2088
135,-1.2088
136,-1.2088
137,-1.2088
138,-1.2088
139,-1.2088
140,-1.2107
141,-1.2342
142,-1.2670000000000001
143,-1.3109
144,-1.3187
145,-1.3189
146,-1.3189
147,-1.3189
148,-1.3189
149,-1.2814
150,-1.2353
151,-1.1756
152,-1.0965
153,-1.0088
154,-0.92111
155,-0.8386600000000001
156,-0.76288
157,-0.71308
158,-0.66327
159,-0.58749
160,-0.51859
161,-0.45508999999999994
162,-0.49171000000000004
163,-0.53556
164,-0.5794199999999999
165,-0.62041
166,-0.6579999999999999
167,-0.6579999999999999
168,-0.64771
169,-0.62351
170,-0.58363
171,-0.53977
172,-0.49591999999999997
173,-0.441
174,-0.3768
175,-0.29104
176,-0.20334000000000002
177,-0.11563
178,-0.18135
179,0.16977
180,0.38903000000000004
181,0.10413
182,0.1115
183,0.10322
184,0.44165
185,0.22239
186,0.08934
187,0.23976999999999998
188,0.20293
189,0.20293
190,0.20293
191,0.214
192,0.098468
193,0.19108
194,0.29903
195,0.43059
196,0.54305
197,0.6469
198,0.73355
199,0.79825
200,0.8421
201,0.88595
202,0.92981
203,0.9736600000000001
204,0.99156
205,0.99436
206,0.99436
207,0.99436
208,0.99436
209,0.99436
210,0.9960100000000001
211,1.0093
212,1.0379
213,1.0817
214,1.1546
215,1.232
216,1.3102
217,1.3673
218,1.4111
219,1.455
220,1.4968
221,1.535
222,1.5451
223,1.5479
224,1.5735
225,1.6062
226,1.6466
227,1.615
228,1.5761
229,1.554
230,1.5451
231,1.5451
232,1.5045
233,1.4682
234,1.4422
235,1.435
236,1.435
237,1.435
238,1.4284
239,1.4144
240,1.3753
241,1.3387
242,1.3289
243,1.3248
244,1.3248
245,1.3248
246,1.3248
247,1.3248
248,1.3248
249,1.3248
250,1.3248
251,1.3130000000000002
252,1.2867
253,1.2479
254,1.2147
255,1.2147
256,1.1891
257,1.1442
258,1.0589
259,0.98462
260,0.9393600000000001
261,0.89507
262,0.8512200000000001
263,0.80737
264,0.7467199999999999
265,0.66428
266,0.58949
267,0.5218
268,0.47795
269,0.41484
270,0.33626
271,0.2593
272,0.19239
273,0.14853
274,0.10468
275,0.31875
276,0.13457
277,0.20293
278,0.20293
279,0.20293
280,0.22038000000000002
281,0.32561999999999997
282,0.17152
283,0.39078
284,0.098301
285,0.1131
286,0.1131
287,0.1131
288,0.1131
289,0.1131
290,0.1131
291,0.1131
292,0.27309
293,-0.12668
294,-0.11563
295,-0.20334000000000002
296,-0.29104
297,-0.37875
298,-0.46645
299,-0.55416
300,-0.64186
301,-0.7295699999999999
302,-0.8172699999999999
303,-0.9019799999999999
304,-0.98196
305,-1.0344
306,-1.0783
307,-1.1221
308,-1.1621
309,-1.1982
310,-1.1639
311,-1.114
312,-1.0463
313,-0.9660200000000001
314,-0.87831
315,0.54752
316,0.54752
317,0.54752
318,0.54752
319,0.54752
320,0.54752
321,0.54752
322,0.54752
323,0.54752
324,0.54752
325,0.54752
326,0.54752
327,0.54752
328,0.54752
329,0.54752
330,0.54752
331,0.54752
332,0.54752
333,0.54752
334,0.54752
335,0.54752
336,0.54752
337,0.54752
338,0.54752
339,0.54752
340,0.54752
341,0.54752
342,0.54752
343,0.54752
344,0.54752
345,0.54752
346,0.54752
347,0.54752
348,0.57118
349,0.62247
350,0.65938
351,0.68637
352,0.68637
353,0.71332
354,0.75975
355,0.8146100000000001
356,0.8698799999999999
357,0.92515
358,0.9804299999999999
359,1.0357
360,1.091
361,1.1462
362,1.2015
363,1.2268
364,1.2418
365,1.2418
366,1.2418
367,1.2418
368,1.2418
369,1.2412
370,1.2394
371,1.2011
372,1.1489
373,1.1476
374,1.1706
375,1.2258
376,1.2811
377,1.3364
378,1.3917
379,1.4469
380,1.5022
381,1.5138
382,1.5195
383,1.5195
384,1.5195
385,1.5195
386,1.5195
387,1.5143
388,1.5019
389,1.4558
390,1.4005
391,1.3452
392,1.2819
393,1.2116
394,1.0547
395,0.9163600000000001
396,0.8487100000000001
397,0.8234899999999999
398,0.81947
399,0.7642
400,0.73115
401,0.73159
402,0.77437
403,0.82194
404,0.82415
405,0.8252200000000001
406,0.8252200000000001
407,0.8252200000000001
408,0.81248
409,0.7642800000000001
410,0.71158
411,0.6563
412,0.6010300000000001
413,0.54575
414,0.49048
415,0.44523999999999997
416,0.40868000000000004
417,0.40868000000000004
418,0.38934
419,0.35086999999999996
420,0.30504000000000003
421,0.26983
422,0.26983
423,0.29072
424,0.32433
425,0.37949
426,0.43477
427,0.49004
428,0.5240199999999999
429,0.54752
430,0.54752
431,0.54752
432,0.54752
433,0.52699
434,0.49578999999999995
435,0.44051
436,0.35548
437,0.25113
438,0.15933
439,0.41581999999999997
440,0.13945
441,-0.29729
442,-0.16124000000000002
443,-0.25764000000000004
444,-0.33465
445,-0.38992
446,-0.47843
447,-0.57248
448,-0.66446
449,-0.70211
450,-0.70211
451,-0.70211
452,-0.70211
453,-0.70211
454,-0.70211
455,-0.70211
456,-0.70211
457,-0.70211
458,-0.70211
459,-0.70211
460,-0.70711
461,-0.73187
462,-0.77418
463,-0.8294600000000001
464,-0.8847299999999999
465,-0.94
466,-0.9952799999999999
467,-1.0506
468,-1.1058
469,-1.1611
470,-1.2031
471,-1.2283
472,-1.1881
473,-1.1403
474,-1.1253
475,-1.1243
476,-1.1345
477,-1.1867
478,-1.2204
479,-1.2049
480,-1.1624
481,-1.1072
482,-1.0519
483,-1.0096
484,-0.9848
485,-0.98015
486,-0.9899700000000001
487,-1.0452
488,-1.1005
489,-1.1558
490,-1.2111
491,-1.2663
492,-1.3216
493,-1.3769
494,-1.4322
495,-1.4874
496,-1.5239
497,-1.5332
498,-1.5352
499,-1.5352
500,-1.5352
501,-1.5135
502,-1.4723
503,-1.4185
504,-1.3632
505,-1.3079
506,-1.2761
507,-1.2578
508,-1.2701
509,-1.3212
510,-1.4317
511,-1.5182
512,-1.5938
513,-1.6478
514,-1.6740000000000002
515,-1.6740000000000002
516,-1.6740000000000002
517,-1.6740000000000002
518,-1.6740000000000002
519,-1.6413
520,-1.5896
521,-1.5343
522,-1.479
523,-1.4238
524,-1.3685
525,-1.3153
526,-1.2768
527,-1.2575
528,-1.2575
529,-1.2575
530,-1.2604
531,-1.2723
532,-1.311
533,-1.3663
534,-1.4215
535,-1.4717
536,-1.5128
537,-1.483
538,-1.4277
539,-1.3725
540,-1.3172
541,-1.2619
542,-1.2066
543,-1.1576
544,-1.1298
545,-1.1186
546,-1.1186
547,-1.0674
548,-1.0295
549,-1.0193
550,-1.0563
551,-1.1071
552,-1.1146
553,-1.1104
554,-1.0927
555,-1.0435
556,-0.99731
557,-0.98493
558,-0.97229
559,-0.95947
560,-0.90595
561,-0.8506799999999999
562,-0.7954100000000001
563,-0.7401300000000001
564,-0.68486
565,-0.62959
566,-0.57431
567,-0.51904
568,-0.46376000000000006
569,-0.40849
570,-0.35322
571,-0.28181
572,-0.19824
573,-0.43318
574,0.11955999999999999
575,0.13185999999999998
576,0.21011
577,0.26983
578,0.26983
579,0.26983
580,0.26983
581,0.28484
582,0.31006999999999996
583,0.36534
584,0.37206999999999996
585,0.3398
586,0.2989
587,0.26983
588,0.26983
589,0.29604
590,0.3353
591,0.38173
592,0.40868000000000004
593,0.40868000000000004
594,0.43567
595,0.4739
596,0.53315
597,0.6200399999999999
598,0.73059
599,0.86775
600,1.0149
601,1.1807
602,1.3108
603,1.4207
604,1.4826
605,1.5195
606,1.5195
607,1.4809999999999999
608,1.4306
609,1.3753
610,1.32
611,1.2648
612,1.2095
613,1.1503
614,1.0804
615,0.98441
616,0.8751
617,0.84414
618,0.8252200000000001
619,0.8252200000000001
620,0.8252200000000001
621,0.82993
622,0.8648600000000001
623,0.91259
624,0.9727299999999999
625,1.0773
626,1.1725
627,1.2229999999999999
628,1.2418
629,1.2418
630,0.34869
631,0.34869
632,0.34869
633,0.34869
634,0.34869
635,0.34869
636,0.34869
637,0.34869
638,0.34869
639,0.34869
640,0.34869
641,0.34869
642,0.34869
643,0.34869
644,0.34869
645,0.34869
646,0.34869
647,0.34869
648,0.34869
649,0.34869
650,0.34869
651,0.34869
652,0.3566
653,0.38375
654,0.47317
655,0.53275
656,0.57209
657,0.5733199999999999
658,0.5733199999999999
659,0.5733199999999999
660,0.5733199999999999
661,0.5733199999999999
662,0.5733199999999999
663,0.59245
664,0.63394
665,0.67812
666,0.72283
667,0.76754
668,0.81225
669,0.85696
670,0.8764299999999999
671,0.8741200000000001
672,0.8294100000000001
673,0.8082199999999999
674,0.7972600000000001
675,0.78796
676,0.76289
677,0.71818
678,0.69777
679,0.68666
680,0.69202
681,0.7196100000000001
682,0.76432
683,0.80903
684,0.8541799999999999
685,0.9003200000000001
686,0.97606
687,1.0655
688,1.1549
689,1.2443
690,1.3337
691,1.3554
692,1.3595
693,1.3595
694,1.3595
695,1.3595
696,1.3595
697,1.3595
698,1.3595
699,1.3595
700,1.3581
701,1.3237
702,1.2768
703,1.2121
704,1.0927
705,0.97319
706,0.9302600000000001
707,0.9134899999999999
708,0.91958
709,0.96068
710,1.0054
711,1.0501
712,1.0948
713,1.1395
714,1.1842
715,1.22
716,1.2421
717,1.2472
718,1.2347
719,1.1489
720,1.0323
721,0.8870600000000001
722,0.67204
723,0.45879
724,0.27423000000000003
725,0.12135
726,-0.31393000000000004
727,-0.27339
728,-0.49693999999999994
729,-0.14669000000000001
730,-0.16705
731,-0.16635999999999998
732,-0.37176
733,0.07534199999999999
734,0.1019
735,0.19130999999999998
736,0.28073000000000004
737,0.37015
738,0.42577
739,0.46082
740,0.44677
741,0.35549000000000003
742,0.13194
743,-0.44508000000000003
744,-0.31516
745,-0.53871
746,-0.71975
747,-0.85603
748,-0.9738399999999999
749,-1.0827
750,-1.1722
751,-1.1894
752,-1.1597
753,-1.1153
754,-1.0706
755,-1.0259
756,-0.98116
757,-0.93532
758,-0.87916
759,-0.80733
760,-0.71791
761,-0.6822600000000001
762,-0.6621100000000001
763,-0.6621100000000001
764,-0.6621100000000001
765,-0.6621100000000001
766,-0.7158800000000001
767,-0.78541
768,-0.8819899999999999
769,-1.037
770,-1.2098
771,-1.3168
772,-1.3953
773,-1.4401
774,-1.4480000000000002
775,-1.4442
776,-1.4242
777,-1.39
778,-1.3453
779,-1.3006
780,-1.2559
781,-1.2111
782,-1.1664
783,-1.1217
784,-1.077
785,-1.0377
786,-1.0051
787,-0.9990399999999999
788,-1.0051
789,-1.0377
790,-1.077
791,-1.1217
792,-1.1664
793,-1.2199
794,-1.2932
795,-1.3746
796,-1.4576
797,-1.5023
798,-1.5365
799,-1.5565
800,-1.5603
801,-1.5524
802,-1.5077
803,-1.463
804,-1.4182
805,-1.3735
806,-1.3288
807,-1.2841
808,-1.2394
809,-1.1947
810,-1.15
811,-1.1357
812,-1.1654
813,-1.227
814,-1.3074
815,-1.4415
816,-1.558
817,-1.6589
818,-1.7414
819,-1.8119999999999998
820,-1.8568
821,-1.8445
822,-1.8001
823,-1.7057
824,-1.5956
825,-1.4615
826,-1.3274
827,-1.1936
828,-1.0616
829,-0.97436
830,-0.92965
831,-0.90396
832,-0.8867299999999999
833,-0.8867299999999999
834,-0.9396399999999999
835,-1.0235
836,-1.148
837,-1.2931
838,-1.4719
839,-1.5368
840,-1.5589
841,-1.5453
842,-1.5162
843,-1.4715
844,-1.3677
845,-1.2474
846,-1.1036
847,-0.93824
848,-0.7594
849,-0.64002
850,-0.53606
851,-0.45808999999999994
852,-0.43749
853,-0.43749
854,-0.43749
855,-0.43835
856,-0.44014
857,-0.47862
858,-0.5233300000000001
859,-0.56804
860,-0.61275
861,-0.65746
862,-0.66071
863,-0.65577
864,-0.63753
865,-0.60023
866,-0.55552
867,-0.51081
868,-0.4661
869,-0.42139
870,-0.37668
871,-0.3246
872,-0.24519000000000002
873,-0.166
874,-0.42178999999999994
875,-0.19113
876,0.23451
877,0.25597
878,0.47952
879,0.13802
880,0.18273
881,0.21535
882,0.23323000000000002
883,0.23638
884,0.23638
885,0.23638
886,0.23638
887,0.23638
888,0.23638
889,0.26374000000000003
890,0.3503
891,0.45188999999999996
892,0.56187
893,0.696
894,0.8643799999999999
895,1.0772
896,1.2623
897,1.4246
898,1.514
899,1.5838
900,1.6378
901,1.6626
902,1.665
903,1.6202
904,1.5543
905,1.4772
906,1.3806
907,1.2683
908,1.1342
909,1.0219
910,0.91919
911,0.8362
912,0.79794
913,0.79794
914,0.81947
915,0.84909
916,0.8938
917,0.96746
918,1.0568
919,1.1659
920,1.2851
921,1.4192
922,1.4911
923,1.5461
924,1.6065
925,1.6821
926,1.7715
927,1.7314
928,1.6639
929,1.5627
930,1.4403
931,1.3057
932,1.1394
933,0.96819
934,0.78935
935,0.61051
936,0.43928999999999996
937,0.31695999999999996
938,0.21534
939,0.13379000000000002
940,0.12407
941,0.13642
942,0.18507
943,0.25927
944,0.34869
