time,value
0,-0.76371
1,-0.7137399999999999
2,-0.66994
3,-0.6411899999999999
4,-0.62051
5,-0.5968600000000001
6,-0.5668300000000001
7,-0.5374
8,-0.51766
9,-0.5081899999999999
10,-0.50408
11,-0.5004
12,-0.49638000000000004
13,-0.4958
14,-0.49856000000000006
15,-0.50325
16,-0.50808
17,-0.51105
18,-0.51464
19,-0.5180100000000001
20,-0.52105
21,-0.52475
22,-0.5271399999999999
23,-0.52945
24,-0.53028
25,-0.5282399999999999
26,-0.52507
27,-0.51894
28,-0.51046
29,-0.49851
30,-0.48073
31,-0.45816
32,-0.42883999999999994
33,-0.39308000000000004
34,-0.35073000000000004
35,-0.30019
36,-0.2431
37,-0.17984
38,-0.11395
39,-0.049332
40,0.012456
41,0.07080499999999999
42,0.12802
43,0.18488
44,0.23969000000000001
45,0.28953
46,0.33069
47,0.36252
48,0.38597
49,0.4019
50,0.41041000000000005
51,0.40881999999999996
52,0.39465
53,0.36639
54,0.32359
55,0.26815
56,0.20149
57,0.126
58,0.044749000000000004
59,-0.039343
60,-0.12220999999999999
61,-0.20206
62,-0.27818000000000004
63,-0.35025
64,-0.41876
65,-0.48088000000000003
66,-0.53452
67,-0.57831
68,-0.61135
69,-0.63695
70,-0.65632
71,-0.6711699999999999
72,-0.6836399999999999
73,-0.69208
74,-0.69886
75,-0.70412
76,-0.70844
77,-0.71445
78,-0.72053
79,-0.72785
80,-0.73551
81,-0.74155
82,-0.74742
83,-0.7521
84,-0.75673
85,-0.76178
86,-0.76522
87,-0.76769
88,-0.7691100000000001
89,-0.77069
90,-0.77367
91,-0.77663
92,-0.77912
93,-0.78081
94,-0.7822600000000001
95,-0.78445
96,-0.78687
97,-0.7890199999999999
98,-0.79072
99,-0.7923399999999999
100,-0.7943
101,-0.79577
102,-0.7957
103,-0.79396
104,-0.79162
105,-0.79046
106,-0.7909999999999999
107,-0.79237
108,-0.79351
109,-0.79383
110,-0.79398
111,-0.79472
112,-0.79608
113,-0.79791
114,-0.7995
115,-0.80057
116,-0.8013899999999999
117,-0.8014100000000001
118,-0.80105
119,-0.80023
120,-0.79864
121,-0.79802
122,-0.7973100000000001
123,-0.79725
124,-0.79825
125,-0.79779
126,-0.79903
127,-0.79896
128,-0.79689
129,-0.7944100000000001
130,-0.78701
131,-0.7791100000000001
132,-0.77005
133,-0.75888
134,-0.75022
135,-0.73673
136,-0.7195
137,-0.69755
138,-0.66622
139,-0.63145
140,-0.58653
141,-0.5299699999999999
142,-0.46138
143,-0.3736
144,-0.26904
145,-0.14145
146,0.011835
147,0.18836
148,0.38799999999999996
149,0.60122
150,0.8200200000000001
151,1.0375
152,1.2467
153,1.4502
154,1.6506
155,1.8527
156,2.0604
157,2.2685
158,2.471
159,2.6545
160,2.8034
161,2.9061
162,2.9485
163,2.9274
164,2.8432
165,2.7014
166,2.5183
167,2.3081
168,2.0907
169,1.8822
170,1.6887
171,1.517
172,1.3618
173,1.2196
174,1.0899
175,0.9674
176,0.86077
177,0.77032
178,0.6988800000000001
179,0.65115
180,0.61878
181,0.60901
182,0.61731
183,0.6410899999999999
184,0.68288
185,0.7319899999999999
186,0.7929999999999999
187,0.86156
188,0.9335700000000001
189,1.0133
190,1.0924
191,1.1749
192,1.2605
193,1.3472
194,1.4434
195,1.5452
196,1.6528
197,1.7611
198,1.858
199,1.9406
200,2.0003
201,2.0352
202,2.0474
203,2.037
204,2.0118
205,1.9757
206,1.9324
207,1.8846
208,1.8259999999999998
209,1.7504
210,1.6469
211,1.5064
212,1.3289
213,1.1177
214,0.88686
215,0.65263
216,0.4289
217,0.23278000000000001
218,0.069748
219,-0.056496000000000005
220,-0.14842
221,-0.2169
222,-0.26708000000000004
223,-0.30964
224,-0.34923000000000004
225,-0.38524
226,-0.42182
227,-0.45433
228,-0.48413
229,-0.5122
230,-0.53323
231,-0.55092
232,-0.56301
233,-0.57165
234,-0.5827899999999999
235,-0.59217
236,-0.60343
237,-0.61456
238,-0.62439
239,-0.6363300000000001
240,-0.64658
241,-0.65673
242,-0.66694
243,-0.67599
244,-0.6856399999999999
245,-0.69389
246,-0.70011
247,-0.70432
248,-0.70594
249,-0.70639
250,-0.7052
251,-0.70221
252,-0.69839
253,-0.69423
254,-0.69148
255,-0.69028
256,-0.69026
257,-0.69233
258,-0.69747
259,-0.70681
260,-0.71904
261,-0.73111
262,-0.74134
263,-0.74938
264,-0.75574
265,-0.75942
266,-0.7585
267,-0.75452
268,-0.75295
269,-0.75985
