time,value
0,0.76651
1,0.76651
2,0.76651
3,0.76651
4,0.76651
5,0.76651
6,0.76651
7,0.76651
8,0.76651
9,0.76651
10,0.76651
11,0.76651
12,0.76651
13,0.76651
14,0.76651
15,0.76651
16,0.76651
17,0.76651
18,0.76651
19,0.76651
20,0.76651
21,0.76651
22,0.76651
23,0.76651
24,0.76651
25,0.76651
26,0.76651
27,0.76651
28,0.76651
29,0.76651
30,0.76651
31,0.76651
32,0.76651
33,0.76651
34,0.76651
35,0.76651
36,0.76651
37,0.76651
38,0.76651
39,0.76651
40,0.76651
41,0.76651
42,0.76651
43,0.76651
44,0.76651
45,0.76651
46,0.76651
47,0.77781
48,0.79152
49,0.81152
50,0.8316600000000001
51,0.8518
52,0.8715799999999999
53,0.89044
54,0.90109
55,0.90109
56,0.90109
57,0.90109
58,0.90109
59,0.90109
60,0.90109
61,0.90109
62,0.90109
63,0.90109
64,0.90109
65,0.90109
66,0.90109
67,0.9032
68,0.90738
69,0.91212
70,0.9171600000000001
71,0.9222
72,0.9272299999999999
73,0.9312299999999999
74,0.93473
75,0.93473
76,0.93473
77,0.93473
78,0.93473
79,0.93473
80,0.93819
81,0.94419
82,0.95316
83,0.9632299999999999
84,0.9733
85,0.9833799999999999
86,0.99345
87,1.0054
88,1.0253
89,1.0453
90,1.0654
91,1.0856
92,1.1057
93,1.1247
94,1.143
95,1.1588
96,1.1739
97,1.189
98,1.2041
99,1.2192
100,1.2333
101,1.2447
102,1.2555
103,1.2656
104,1.2757
105,1.2857
106,1.2949
107,1.3037
108,1.3048
109,1.3048
110,1.3048
111,1.3048
112,1.3048
113,1.3031
114,1.298
115,1.2905
116,1.2804
117,1.2703
118,1.2602
119,1.2502
120,1.2401
121,1.2173
122,1.1936
123,1.1684
124,1.1432
125,1.1181
126,1.0923
127,1.0657
128,1.0372
129,1.0069
130,0.9767299999999999
131,0.94652
132,0.9163
133,0.88613
134,0.8592299999999999
135,0.83262
136,0.8074399999999999
137,0.7822600000000001
138,0.7570899999999999
139,0.7319100000000001
140,0.70673
141,0.68155
142,0.65637
143,0.6311899999999999
144,0.60601
145,0.5808300000000001
146,0.55583
147,0.53279
148,0.51044
149,0.49028999999999995
150,0.47015
151,0.45001
152,0.42986
153,0.40972
154,0.38675
155,0.36254000000000003
156,0.33751
157,0.31233
158,0.28715
159,0.26211999999999996
160,0.2379
161,0.21493
162,0.19479000000000002
163,0.17464000000000002
164,0.1545
165,0.13435999999999998
166,0.11422
167,0.094072
168,0.073928
169,0.053785
170,0.033642
171,0.013499
172,-0.0066446
173,-0.026788
174,-0.043301
175,-0.053801
176,-0.064074
177,-0.074146
178,-0.084218
179,-0.094289
180,-0.10579000000000001
181,-0.11757999999999999
182,-0.13265
183,-0.14775
184,-0.16286
185,-0.17797000000000002
186,-0.19308
187,-0.20818000000000003
188,-0.22329000000000002
189,-0.2384
190,-0.25351
191,-0.26861
192,-0.28371999999999997
193,-0.29883000000000004
194,-0.31394
195,-0.32904
196,-0.34415
197,-0.35925999999999997
198,-0.37437
199,-0.38947
200,-0.40586
201,-0.42343000000000003
202,-0.44273
203,-0.46287
204,-0.48301000000000005
205,-0.50315
206,-0.5233
207,-0.5445800000000001
208,-0.5735100000000001
209,-0.6028
210,-0.6330100000000001
211,-0.66323
212,-0.69344
213,-0.7236600000000001
214,-0.7538699999999999
215,-0.78409
216,-0.8143
217,-0.84452
218,-0.8747299999999999
219,-0.90495
220,-0.9338799999999999
221,-0.9576600000000001
222,-0.98016
223,-1.0003
224,-1.0205
225,-1.0406
226,-1.0605
227,-1.0803
228,-1.0882
229,-1.0932
230,-1.0982
231,-1.1033
232,-1.1083
233,-1.1128
234,-1.1158
235,-1.1175
236,-1.1175
237,-1.1175
238,-1.1175
239,-1.1175
240,-1.1175
241,-1.1245
242,-1.1325
243,-1.1426
244,-1.1527
245,-1.1627
246,-1.1728
247,-1.1829
248,-1.193
249,-1.203
250,-1.2131
251,-1.2232
252,-1.2332
253,-1.2433
254,-1.2507
255,-1.2578
256,-1.2628
257,-1.2678
258,-1.2729
259,-1.2779
260,-1.2830000000000001
261,-1.2853
262,-1.2857
263,-1.2857
264,-1.2857
265,-1.2857
266,-1.2858
267,-1.2890000000000001
268,-1.2935
269,-1.3035
270,-1.3136
271,-1.3237
272,-1.3337
273,-1.3438
274,-1.3539
275,-1.364
276,-1.374
277,-1.3841
278,-1.3942
279,-1.4042
280,-1.4143
281,-1.4244
282,-1.4345
283,-1.4445
284,-1.4546
285,-1.4647
286,-1.4747
287,-1.4832
288,-1.4909
289,-1.4963
290,-1.5013
291,-1.5064
292,-1.5114
293,-1.5164
294,-1.5215
295,-1.5265
296,-1.5315
297,-1.5366
298,-1.5416
299,-1.5466
300,-1.5517
301,-1.5567
302,-1.5617
303,-1.5668
304,-1.5718
305,-1.5769
306,-1.5819
307,-1.5857
308,-1.5876
309,-1.5885
310,-1.5885
311,-1.5885
312,-1.5885
313,-1.5885
314,-1.5885
