time,value
0,-1.4071
1,-1.3446
2,-1.2433
3,-1.1092
4,-0.94645
5,-0.75644
6,-0.5491
7,-0.35084
8,-0.18017
9,-0.024142
10,0.13777999999999999
11,0.30289
12,0.44203000000000003
13,0.5092399999999999
14,0.46061
15,0.27879
16,-0.0082618
17,-0.32391
18,-0.57394
19,-0.7026
20,-0.728
21,-0.71449
22,-0.70886
23,-0.7188100000000001
24,-0.74163
25,-0.77954
26,-0.82339
27,-0.8602299999999999
28,-0.88954
29,-0.9093899999999999
30,-0.9209
31,-0.93221
32,-0.94071
33,-0.9479700000000001
34,-0.9574799999999999
35,-0.9656
36,-0.97178
37,-0.97465
38,-0.96977
39,-0.9587
40,-0.9431200000000001
41,-0.9217200000000001
42,-0.8960799999999999
43,-0.86749
44,-0.8383200000000001
45,-0.80972
46,-0.7765
47,-0.73234
48,-0.66633
49,-0.57822
50,-0.49531000000000003
51,-0.43606000000000006
52,-0.38836
53,-0.34528000000000003
54,-0.31253000000000003
55,-0.28872
56,-0.27355
57,-0.27121999999999996
58,-0.27769
59,-0.27376
60,-0.24497
61,-0.20836
62,-0.17692
63,-0.13974
64,-0.09718099999999999
65,-0.046401
66,0.032612
67,0.14642
68,0.2915
69,0.46507
70,0.6568
71,0.85052
72,1.0315
73,1.1938
74,1.3405
75,1.4806
76,1.6133
77,1.7280000000000002
78,1.8206
79,1.893
80,1.9418
81,1.9683
82,1.9580000000000002
83,1.8247
84,1.462
85,0.8951399999999999
86,0.30045
87,-0.15562
88,-0.42686999999999997
89,-0.5634
90,-0.63935
91,-0.69658
92,-0.74807
93,-0.78632
94,-0.7934399999999999
95,-0.7722399999999999
96,-0.73824
97,-0.69996
98,-0.67151
99,-0.6551
100,-0.63602
101,-0.6158100000000001
102,-0.5975
103,-0.58249
104,-0.58334
105,-0.61023
106,-0.65336
107,-0.68806
108,-0.7016600000000001
109,-0.69699
110,-0.6734399999999999
111,-0.63915
112,-0.60416
113,-0.5534899999999999
114,-0.47555
115,-0.37231
116,-0.23738
117,-0.080131
118,0.07689800000000001
119,0.23529
120,0.39654
121,0.55309
122,0.70962
123,0.8648600000000001
124,1.0195
125,1.1695
126,1.2839
127,1.3425
128,1.3552
129,1.3478
130,1.3454
131,1.3741
132,1.4481
133,1.5574
134,1.6788
135,1.7942
136,1.892
137,1.9516
138,1.9576
139,1.8918
140,1.6775
141,1.2261
142,0.58227
143,-0.056273000000000004
144,-0.49498000000000003
145,-0.6974100000000001
146,-0.76369
147,-0.78581
148,-0.7974899999999999
149,-0.80685
150,-0.8044399999999999
151,-0.79108
152,-0.78278
153,-0.7752399999999999
154,-0.7589199999999999
155,-0.7299
156,-0.6842600000000001
157,-0.63355
158,-0.5866600000000001
159,-0.54488
160,-0.50927
161,-0.4708
162,-0.42788000000000004
163,-0.38216
164,-0.32058000000000003
165,-0.23121
166,-0.12991
167,-0.042692
168,0.031332
169,0.10640999999999999
170,0.17263
171,0.21091999999999997
172,0.21633000000000002
173,0.1778
174,0.079841
175,-0.063435
176,-0.22074000000000002
177,-0.37177
178,-0.50332
179,-0.61727
180,-0.7258399999999999
181,-0.82457
182,-0.90738
183,-0.96624
184,-0.9826
185,-0.95395
186,-0.88969
187,-0.79775
188,-0.69086
189,-0.57268
190,-0.44563
191,-0.3187
192,-0.18525
193,-0.037266
194,0.13339
195,0.33444
196,0.5390199999999999
197,0.7278600000000001
198,0.9083899999999999
199,1.0735
200,1.2174
201,1.3636
202,1.5167
203,1.6526
204,1.7674
205,1.8603
206,1.9179
207,1.9413
208,1.8967
209,1.6897
210,1.2785
211,0.75629
212,0.27624
213,-0.065852
214,-0.26375
215,-0.36730999999999997
216,-0.43686
217,-0.4981
218,-0.54369
219,-0.57167
220,-0.58195
221,-0.57062
222,-0.5504600000000001
223,-0.5352
224,-0.53162
225,-0.54377
226,-0.55606
227,-0.5658
228,-0.57547
229,-0.5748300000000001
230,-0.5623100000000001
231,-0.53787
232,-0.50573
233,-0.4723
234,-0.42367
235,-0.35286
236,-0.26283
237,-0.13262000000000002
238,0.050166
239,0.28252
240,0.55753
241,0.85756
242,1.1684
243,1.4844
244,1.7923
245,2.0724
246,2.3117
247,2.5015
248,2.6418
249,2.745
250,2.7947
251,2.7037
252,2.35
253,1.6921
254,0.8659100000000001
255,0.11627
256,-0.40394
257,-0.7206100000000001
258,-0.9367200000000001
259,-1.1097
260,-1.2349
261,-1.304
262,-1.3227
263,-1.3045
264,-1.285
265,-1.2852
266,-1.2938
267,-1.3231
268,-1.3823
269,-1.431
