time,value
0,-0.77673
1,-0.67862
2,-0.5737899999999999
3,-0.30472
4,0.0064751
5,0.32939
6,0.53486
7,0.87508
8,1.0791
9,1.3353
10,1.4893
11,1.4556
12,1.4984
13,1.5546
14,1.5337
15,1.3331
16,1.1048
17,0.88844
18,0.58732
19,0.28726999999999997
20,0.013956
21,-0.28121999999999997
22,-0.50467
23,-0.6912
24,-0.71355
25,-0.62041
26,-0.40881
27,-0.16924
28,0.098842
29,0.3901
30,0.68075
31,0.96283
32,1.2621
33,1.3931
34,1.5015
35,1.4495
36,1.4151
37,1.4214
38,1.4681
39,1.5288
40,1.5543
41,1.4752
42,1.1363
43,0.8754
44,0.54343
45,0.26389
46,-0.050961
47,-0.28684
48,-0.5423600000000001
49,-0.69021
50,-0.31917
51,-0.45118
52,-0.60985
53,-0.79914
54,-0.94699
55,-1.1636
56,-1.3401
57,-1.4929
58,-1.4241
59,-1.2494
60,-1.1023
61,-0.9094200000000001
62,-0.69252
63,-0.50997
64,-0.3592
65,-0.42913
66,-0.59014
67,-0.81487
68,-1.0066
69,-1.1584
70,-1.3336
71,-1.4213
72,-1.4277
73,-1.3443
74,-1.2228
75,-1.0794
76,-0.9774200000000001
77,-0.78254
78,-0.63553
79,-0.44037
