time,value
0,-0.43188999999999994
1,0.29961
2,1.1546
3,2.0305
4,2.8132
5,3.3966
6,3.7018
7,3.6915
8,3.3765
9,2.8132
10,2.093
11,1.3253
12,0.61735
13,0.056303
14,-0.30455
15,-0.4519
16,-0.41058
17,-0.23451
18,0.007069800000000001
19,0.24498000000000003
20,0.42367
21,0.51044
22,0.4986
23,0.40488
24,0.26197
25,0.10872000000000001
26,-0.019767
27,-0.099618
28,-0.12211
29,-0.09335
30,-0.030413
31,0.044617000000000004
32,0.11101
33,0.15449000000000002
34,0.16987
35,0.16088
36,0.13766
37,0.11263
38,0.096323
39,0.094106
40,0.1048
41,0.12133
42,0.13307
43,0.12922999999999998
44,0.10207000000000001
45,0.049411000000000004
46,-0.024669999999999997
47,-0.11077000000000001
48,-0.1965
49,-0.26957
50,-0.32082
51,-0.34628000000000003
52,-0.34794
53,-0.33313000000000004
54,-0.31251999999999996
55,-0.29749000000000003
56,-0.29745
57,-0.31778
58,-0.35878000000000004
59,-0.41597
60,-0.48139
61,-0.54562
62,-0.60001
63,-0.63852
64,-0.65842
65,-0.6609999999999999
66,-0.65066
67,-0.6336
68,-0.61625
69,-0.60577
70,-0.6022
71,-0.60614
72,-0.61646
73,-0.63053
74,-0.6450600000000001
75,-0.65736
76,-0.6647
77,-0.6661199999999999
78,-0.66235
79,-0.6552899999999999
80,-0.64742
81,-0.64144
82,-0.6388699999999999
83,-0.6402100000000001
84,-0.64527
85,-0.65308
86,-0.66222
87,-0.67148
88,-0.6798
89,-0.6863199999999999
90,-0.69121
91,-0.69512
92,-0.6987899999999999
93,-0.7027899999999999
94,-0.70728
95,-0.71115
96,-0.71329
97,-0.7124199999999999
98,-0.70741
