time,value
0,-0.60539
1,-0.60539
2,-0.60539
3,-0.60539
4,-0.60539
5,-0.60539
6,-0.60539
7,-0.60539
8,-0.60539
9,-0.60539
10,-0.60539
11,-0.60539
12,-0.60539
13,-0.60539
14,-0.60539
15,-0.60539
16,-0.60539
17,-0.60539
18,-0.60539
19,-0.60539
20,-0.60539
21,-0.60539
22,-0.60539
23,-0.60539
24,-0.60539
25,-0.60539
26,-0.60539
27,-0.60539
28,-0.60539
29,-0.60539
30,-0.60539
31,-0.60539
32,-0.60539
33,-0.60539
34,-0.60539
35,-0.60539
36,-0.60539
37,-0.60539
38,-0.60539
39,-0.60539
40,-0.60539
41,-0.60539
42,-0.60539
43,-0.60539
44,-0.60539
45,-0.60539
46,-0.60539
47,-0.60539
48,-0.60539
49,-0.60539
50,-0.60539
51,-0.60539
52,-0.60539
53,-0.60539
54,-0.60539
55,-0.60539
56,-0.60539
57,-0.60539
58,-0.60539
59,-0.60539
60,-0.60539
61,-0.60539
62,-0.60539
63,-0.60539
64,-0.60539
65,-0.60539
66,-0.60539
67,-0.60539
68,-0.60539
69,-0.60539
70,-0.60539
71,-0.60539
72,-0.60539
73,-0.60539
74,-0.60539
75,-0.60539
76,-0.60539
77,-0.60539
78,-0.60539
79,-0.60539
80,-0.60539
81,-0.60539
82,-0.60539
83,-0.60539
84,-0.60539
85,-0.60539
86,-0.60539
87,-0.60539
88,-0.60539
89,-0.60539
90,-0.60539
91,-0.60539
92,-0.60539
93,-0.60539
94,-0.60539
95,-0.60539
96,-0.60539
97,-0.60539
98,-0.60539
99,-0.60539
100,-0.60539
101,-0.60539
102,-0.60539
103,-0.60539
104,-0.60539
105,-0.60539
106,-0.60539
107,-0.60539
108,-0.60539
109,-0.60539
110,-0.60539
111,-0.60539
112,-0.60539
113,-0.60539
114,-0.60539
115,-0.60539
116,-0.60539
117,-0.60539
118,-0.60539
119,-0.60539
120,-0.60539
121,-0.60539
122,-0.60539
123,-0.60539
124,-0.60539
125,-0.60539
126,-0.60539
127,-0.60539
128,-0.60539
129,-0.60539
130,-0.60539
131,-0.60539
132,-0.60539
133,-0.60539
134,-0.60539
135,-0.60539
136,-0.60539
137,-0.60539
138,-0.60539
139,-0.60539
140,-0.60539
141,-0.60539
142,-0.60539
143,-0.60539
144,-0.60539
145,-0.60539
146,-0.60539
147,-0.60539
148,-0.60539
149,-0.60539
150,-0.60539
151,-0.60539
152,-0.60539
153,-0.60539
154,-0.60539
155,-0.60539
156,-0.60539
157,-0.60539
158,-0.60539
159,-0.60539
160,-0.60539
161,-0.60539
162,-0.60539
163,-0.60539
164,-0.60539
165,-0.60539
166,-0.60539
167,-0.60539
168,-0.60539
169,-0.60539
170,-0.60539
171,-0.60539
172,-0.60539
173,-0.60539
174,-0.60539
175,-0.60539
176,-0.60539
177,-0.60539
178,-0.60539
179,-0.60539
180,-0.60539
181,-0.60539
182,-0.60539
183,-0.60539
184,-0.60539
185,-0.60539
186,-0.60539
187,-0.60539
188,-0.60539
189,-0.60539
190,-0.60539
191,-0.60539
192,-0.60539
193,-0.60539
194,-0.60539
195,-0.60539
196,-0.60539
197,-0.60539
198,-0.60539
199,-0.60539
200,-0.60539
201,-0.60539
202,-0.60539
203,-0.60539
204,-0.60539
205,-0.60539
206,-0.60539
207,-0.60539
208,-0.60539
209,-0.60539
210,-0.60539
211,-0.60539
212,-0.60539
213,-0.60539
214,-0.60539
215,-0.60539
216,-0.60539
217,-0.60539
218,-0.60539
219,-0.60539
220,-0.60539
221,-0.60539
222,-0.60539
223,-0.60539
224,-0.60539
225,-0.60539
226,-0.60539
227,-0.60539
228,-0.60539
229,-0.60539
230,-0.60539
231,-0.60539
232,-0.60539
233,-0.60539
234,-0.60539
235,-0.60539
236,-0.60539
237,-0.60539
238,-0.60539
239,-0.60539
240,-0.60539
241,-0.60539
242,-0.60539
243,-0.60539
244,-0.60539
245,-0.60539
246,-0.60539
247,-0.60539
248,-0.60539
249,-0.60539
250,-0.60539
251,-0.60539
252,-0.60539
253,-0.60539
254,-0.60539
255,-0.60539
256,-0.60539
257,-0.60539
258,-0.60539
259,-0.60539
260,-0.60539
261,-0.60539
262,-0.60539
263,-0.60539
264,-0.60539
265,-0.60539
266,-0.60539
267,-0.60539
268,-0.60539
269,-0.60539
270,-0.60539
271,-0.60539
272,-0.60539
273,-0.60539
274,-0.60539
275,-0.60539
276,-0.60539
277,-0.60539
278,-0.60539
279,-0.60539
280,-0.60539
281,-0.60539
282,-0.60539
283,-0.60539
284,-0.60539
285,-0.60539
286,-0.60539
287,-0.60539
288,-0.60539
289,-0.60539
290,-0.60539
291,-0.60539
292,-0.60539
293,-0.60539
294,-0.60539
295,-0.60539
296,-0.60539
297,-0.60539
298,-0.60539
299,-0.60539
300,-0.60539
301,-0.60539
302,-0.60539
303,-0.60539
304,-0.60539
305,-0.60539
306,-0.60539
307,-0.60539
308,-0.60539
309,-0.60539
310,-0.60539
311,-0.60539
312,-0.21785
313,-0.60539
314,-0.60539
315,-0.60539
316,-0.024086
317,1.7198
318,-0.41162
319,-0.60539
320,-0.60539
321,-0.60539
322,-0.60539
323,-0.60539
324,-0.60539
325,-0.60539
326,-0.60539
327,-0.60539
328,-0.60539
329,-0.60539
330,-0.60539
331,-0.60539
332,-0.60539
333,-0.60539
334,-0.60539
335,-0.60539
336,-0.60539
337,-0.60539
338,-0.60539
339,-0.60539
340,-0.60539
341,-0.60539
342,-0.60539
343,-0.60539
344,-0.60539
345,-0.60539
346,-0.60539
347,-0.60539
348,-0.60539
349,-0.60539
350,-0.60539
351,-0.60539
352,-0.60539
353,-0.60539
354,-0.60539
355,-0.60539
356,-0.60539
357,-0.60539
358,-0.60539
359,-0.60539
360,-0.60539
361,-0.60539
362,-0.60539
363,-0.60539
364,-0.60539
365,-0.60539
366,-0.60539
367,0.8478600000000001
368,1.7198
369,1.7198
370,2.1073
371,2.1073
372,2.4949
373,2.1073
374,1.7198
375,1.7198
376,1.7198
377,1.7198
378,1.7198
379,1.7198
380,1.4292
381,1.7198
382,1.7198
383,1.7198
384,1.7198
385,1.4292
386,1.7198
387,1.7198
388,1.7198
389,1.4292
390,1.7198
391,1.7198
392,1.7198
393,1.7198
394,1.7198
395,1.7198
396,1.7198
397,1.7198
398,1.7198
399,1.7198
400,1.7198
401,1.7198
402,2.1073
403,1.7198
404,2.1073
405,1.7198
406,1.7198
407,1.7198
408,1.7198
409,-0.024086
410,-0.5085
411,-0.60539
412,-0.60539
413,-0.60539
414,-0.60539
415,-0.60539
416,-0.60539
417,-0.60539
418,-0.60539
419,-0.60539
420,-0.60539
421,-0.60539
422,-0.60539
423,-0.60539
424,-0.60539
425,-0.60539
426,-0.60539
427,-0.60539
428,-0.60539
429,-0.60539
430,-0.60539
431,-0.60539
432,-0.60539
433,-0.60539
434,-0.60539
435,-0.60539
436,-0.60539
437,-0.60539
438,-0.60539
439,-0.60539
440,-0.60539
441,-0.60539
442,-0.60539
443,-0.60539
444,-0.60539
445,-0.60539
446,-0.60539
447,-0.60539
448,-0.60539
449,-0.60539
450,-0.60539
451,-0.60539
452,-0.60539
453,-0.60539
454,-0.60539
455,-0.60539
456,-0.60539
457,-0.60539
458,-0.60539
459,-0.60539
460,-0.60539
461,-0.60539
462,-0.60539
463,-0.60539
464,-0.60539
465,-0.60539
466,-0.60539
467,-0.60539
468,-0.60539
469,-0.60539
470,-0.60539
471,-0.60539
472,-0.60539
473,-0.60539
474,-0.60539
475,-0.60539
476,-0.60539
477,-0.60539
478,-0.60539
479,-0.60539
480,-0.60539
481,-0.60539
482,-0.60539
483,-0.60539
484,-0.60539
485,-0.60539
486,-0.60539
487,-0.60539
488,-0.60539
489,-0.60539
490,-0.60539
491,-0.60539
492,-0.60539
493,-0.60539
494,-0.60539
495,-0.60539
496,-0.60539
497,-0.60539
498,-0.60539
499,-0.60539
500,-0.60539
501,-0.60539
502,-0.60539
503,-0.60539
504,-0.60539
505,-0.21785
506,1.7198
507,1.7198
508,1.4292
509,1.4292
510,1.7198
511,1.7198
512,1.7198
513,1.7198
514,2.1073
515,1.7198
516,1.7198
517,1.7198
518,1.4292
519,1.7198
520,2.1073
521,1.4292
522,1.1385
523,1.4292
524,2.1073
525,1.7198
526,1.7198
527,1.7198
528,1.7198
529,1.4292
530,1.7198
531,2.1073
532,1.7198
533,1.7198
534,1.7198
535,2.1073
536,2.1073
537,1.7198
538,1.7198
539,1.7198
540,2.1073
541,2.1073
542,1.7198
543,2.4949
544,2.1073
545,2.1073
546,2.1073
547,1.7198
548,2.1073
549,-0.21785
550,-0.60539
551,-0.60539
552,-0.60539
553,-0.60539
554,-0.60539
555,-0.60539
556,-0.60539
557,-0.60539
558,-0.60539
559,-0.60539
560,-0.60539
561,-0.60539
562,-0.60539
563,-0.60539
564,-0.60539
565,-0.60539
566,-0.60539
567,-0.60539
568,-0.60539
569,-0.60539
570,-0.60539
571,-0.60539
572,-0.60539
573,-0.60539
574,-0.60539
575,-0.60539
576,-0.60539
577,-0.60539
578,-0.60539
579,-0.60539
580,-0.60539
581,-0.60539
582,-0.60539
583,0.16968
584,1.7198
585,1.4292
586,1.4292
587,1.4292
588,1.7198
589,1.4292
590,1.7198
591,1.4292
592,1.4292
593,1.4292
594,1.4292
595,1.4292
596,1.4292
597,1.4292
598,1.4292
599,1.4292
600,1.4292
601,1.4292
602,1.4292
603,1.7198
604,1.4292
605,1.4292
606,1.7198
607,1.4292
608,1.4292
609,1.7198
610,2.1073
611,1.4292
612,1.4292
613,1.4292
614,1.7198
615,1.4292
616,1.7198
617,1.4292
618,1.4292
619,1.7198
620,1.4292
621,1.4292
622,1.7198
623,1.4292
624,1.4292
625,1.4292
626,1.4292
627,1.4292
628,1.4292
629,1.7198
630,1.1385
631,1.7198
632,1.1385
633,1.7198
634,1.4292
635,1.7198
636,1.4292
637,1.4292
638,1.4292
639,1.4292
640,1.4292
641,1.7198
642,1.7198
643,1.7198
644,1.4292
645,1.7198
646,1.7198
647,1.7198
648,1.7198
649,1.7198
650,1.7198
651,1.4292
652,1.7198
653,1.7198
654,1.7198
655,1.7198
656,1.7198
657,1.7198
658,1.7198
659,1.7198
660,1.7198
661,1.1385
662,1.4292
663,1.4292
664,1.4292
665,1.4292
666,1.7198
667,1.7198
668,1.4292
669,1.4292
670,1.4292
671,1.1385
672,1.4292
673,1.4292
674,1.4292
675,1.7198
676,2.1073
677,1.7198
678,1.4292
679,1.4292
680,1.4292
681,1.4292
682,1.1385
683,1.4292
684,1.4292
685,2.1073
686,1.4292
687,1.4292
688,1.4292
689,1.4292
690,1.1385
691,-0.60539
692,-0.60539
693,-0.60539
694,-0.60539
695,-0.60539
696,-0.60539
697,-0.60539
698,-0.60539
699,-0.60539
700,-0.60539
701,-0.60539
702,-0.60539
703,-0.60539
704,-0.60539
705,-0.60539
706,-0.60539
707,-0.60539
708,-0.60539
709,-0.60539
710,-0.60539
711,-0.60539
712,-0.60539
713,-0.60539
714,-0.60539
715,-0.60539
716,-0.60539
717,-0.60539
718,-0.60539
719,-0.60539
