time,value
0,2.0788
1,1.9064
2,1.8568
3,1.7424
4,1.569
5,1.311
6,1.4034
7,1.1524
8,0.8054600000000001
9,0.43157
10,0.062614
11,0.074925
12,0.41713
13,0.68211
14,0.48968999999999996
15,0.07426100000000001
16,-0.35522
17,-0.77045
18,-1.1641
19,-1.0482
20,-0.67853
21,-0.43025
22,-0.23642
23,-0.20199999999999999
24,-0.49006000000000005
25,-0.71391
26,-1.0198
27,-1.4122
28,-1.7223
29,-2.0438
30,-1.8953
31,-1.5339
32,-1.1726
33,-0.83715
34,-0.47597
35,-0.18775
36,-0.13454000000000002
37,-0.20281
38,-0.3678
39,-0.58267
40,-0.72032
41,-0.9340299999999999
42,-1.0488
43,-1.165
44,-1.2915
45,-1.3476
46,-1.1276
47,-0.78078
48,-0.35326
49,0.031163999999999997
50,0.48253
51,0.9118299999999999
52,1.2622
53,1.5098
54,1.4109
55,1.275
56,1.05
57,0.8814299999999999
58,0.73539
59,0.66498
60,0.44437
61,0.22086
62,0.079988
63,-0.19211
64,-0.49103
65,-0.25356999999999996
66,0.11558
67,0.47853
68,0.8107300000000001
69,1.1687
70,1.3193
71,0.98765
72,0.63666
73,0.26891
74,-0.1066
75,-0.47386000000000006
76,-0.52671
77,-0.17055
78,0.063946
79,0.30362
80,0.44802
81,0.54504
82,0.71946
83,0.75461
84,0.36223
85,-0.015209
86,-0.37191
87,-0.7041
88,-0.98926
89,-1.1708
90,-1.2679
91,-1.3845
92,-1.6484
93,-1.5362
94,-1.4324
95,-1.3424
96,-1.2561
97,-1.1594
98,-1.0488
99,-0.9350299999999999
100,-0.83199
101,-0.79019
102,-0.9350299999999999
103,-0.8734799999999999
104,-0.71308
105,-0.5792
106,-0.4391
107,-0.07272999999999999
108,0.2367
109,0.48208
110,0.38001
111,0.10842
112,-0.2321
113,-0.6049
114,-0.44177
115,-0.025674000000000002
116,0.37754
117,0.7309
118,0.9825
119,1.2133
120,0.9630299999999999
121,1.1832
122,1.4824
123,1.6445
124,1.7213
125,1.9140000000000001
126,1.9882
127,2.0532
