time,value
0,0.024368
1,-0.07714700000000001
2,-0.14482
3,-0.2125
4,-0.28018000000000004
5,-0.31401999999999997
6,-0.28018000000000004
7,-0.34785
8,-0.48321000000000003
9,-0.51705
10,-0.58472
11,-0.6524
12,-0.68624
13,-0.72008
14,-0.8215899999999999
15,-0.8215899999999999
16,-0.8215899999999999
17,-0.8554299999999999
18,-0.8892700000000001
19,-0.95694
20,-1.0246
21,-1.0246
22,-1.0246
23,-1.0585
24,-1.0246
25,-0.9907799999999999
26,-1.0246
27,-1.0246
28,-1.0246
29,-1.0246
30,-1.0246
31,-1.0246
32,-1.0246
33,-1.0246
34,-1.0246
35,-1.0585
36,-1.0923
37,-1.0923
38,-1.0585
39,-1.0923
40,-1.0923
41,-1.0923
42,-1.0923
43,-1.0585
44,-1.0585
45,-1.0246
46,-1.0246
47,-1.0246
48,-1.0246
49,-1.0246
50,-1.0585
51,-1.0585
52,-1.0585
53,-1.0923
54,-1.1261
55,-1.0923
56,-1.0585
57,-1.0246
58,-1.0585
59,-1.0246
60,-0.9907799999999999
61,-0.95694
62,-0.95694
63,-0.92311
64,-0.8554299999999999
65,-0.8215899999999999
66,-0.8554299999999999
67,-0.8554299999999999
68,-0.8554299999999999
69,-0.78775
70,-0.7539100000000001
71,-0.72008
72,-0.7539100000000001
73,-0.8215899999999999
74,-0.8215899999999999
75,-0.7539100000000001
76,-0.72008
77,-0.68624
78,-0.61856
79,-0.58472
80,-0.58472
81,-0.72008
82,-0.78775
83,-0.68624
84,-0.7539100000000001
85,-0.8892700000000001
86,-0.7539100000000001
87,-0.41553
88,-0.31401999999999997
89,-0.41553
90,-0.48321000000000003
91,-0.41553
92,-0.48321000000000003
93,-0.55088
94,-0.51705
95,-0.51705
96,-0.55088
97,-0.44937
98,-0.55088
99,-0.61856
100,-0.6524
101,-0.58472
102,-0.55088
103,-0.6524
104,-0.7539100000000001
105,-0.68624
106,-0.58472
107,-0.48321000000000003
108,-0.44937
109,-0.38169000000000003
110,-0.31401999999999997
111,-0.31401999999999997
112,-0.24634
113,-0.14482
114,-0.07714700000000001
115,-0.0094708
116,-0.043309
117,-0.07714700000000001
118,-0.07714700000000001
119,0.024368
120,0.12588
121,0.12588
122,0.15972
123,0.15972
124,0.26124
125,0.36275
126,0.39659
127,0.39659
128,0.43043000000000003
129,0.46426999999999996
130,0.53194
131,0.5657800000000001
132,0.5996199999999999
133,0.63346
134,0.70113
135,0.73497
136,0.76881
137,0.80265
138,0.8703299999999999
139,0.9041600000000001
140,0.938
141,1.0057
142,1.0734
143,1.1749
144,1.2425
145,1.2764
146,1.3102
147,1.3779
148,1.4117
149,1.4456
150,1.4456
151,1.4794
152,1.4794
153,1.4794
154,1.5133
155,1.5471
156,1.6148
157,1.6486
158,1.6486
159,1.6824
160,1.6824
161,1.6824
162,1.6824
163,1.6824
164,1.6824
165,1.7163
166,1.7163
167,1.6824
168,1.6824
169,1.7163
170,1.7501
171,1.784
172,1.6824
173,1.6486
174,1.7163
175,1.7501
176,1.6824
177,1.5809
178,1.5471
179,1.5471
180,1.5809
181,1.6148
182,1.6148
183,1.5809
184,1.6148
185,1.6486
186,1.5809
187,1.4456
188,1.3441
189,1.3441
190,1.4117
191,1.4456
192,1.4794
193,1.5471
194,1.6148
195,1.6486
196,1.6486
197,1.6824
198,1.7501
199,1.8178
200,1.8178
201,1.8516
202,1.8855
203,1.9193
204,1.9193
205,1.8855
206,1.8178
207,1.8178
208,1.8178
209,1.784
210,1.7501
211,1.7163
212,1.6824
213,1.6824
214,1.6486
215,1.6148
216,1.5471
217,1.4456
218,1.3441
219,1.2764
220,1.1749
221,1.0734
222,0.9718399999999999
223,0.9041600000000001
224,0.80265
225,0.73497
226,0.63346
227,0.53194
228,0.43043000000000003
229,0.32891
230,0.19355999999999998
231,0.024368
232,-0.043309
233,-0.11099
234,-0.17865999999999999
235,-0.24634
236,-0.34785
237,-0.38169000000000003
238,-0.38169000000000003
239,-0.44937
240,-0.51705
241,-0.61856
242,-0.6524
243,-0.68624
244,-0.68624
245,-0.72008
246,-0.7539100000000001
247,-0.8215899999999999
248,-0.78775
249,-0.78775
250,-0.8215899999999999
251,-0.8215899999999999
252,-0.8554299999999999
253,-0.8892700000000001
254,-0.92311
255,-0.92311
256,-0.8892700000000001
257,-0.8554299999999999
258,-0.8554299999999999
259,-0.8554299999999999
260,-0.8554299999999999
261,-0.8215899999999999
262,-0.8215899999999999
263,-0.8554299999999999
264,-0.8554299999999999
265,-0.8554299999999999
266,-0.8215899999999999
267,-0.8215899999999999
268,-0.92311
269,-0.95694
270,-0.9907799999999999
271,-0.92311
272,-0.8554299999999999
273,-0.8554299999999999
274,-0.8554299999999999
275,-0.8554299999999999
276,-0.8554299999999999
277,-0.95694
278,-0.95694
279,-0.92311
280,-0.8554299999999999
281,-0.8215899999999999
282,-0.8215899999999999
283,-0.8215899999999999
284,-0.78775
285,-0.7539100000000001
286,-0.72008
287,-0.72008
288,-0.72008
289,-0.72008
290,-0.7539100000000001
291,-0.78775
292,-0.78775
293,-0.7539100000000001
294,-0.68624
295,-0.68624
296,-0.7539100000000001
297,-0.7539100000000001
298,-0.68624
299,-0.58472
300,-0.61856
301,-0.7539100000000001
302,-0.72008
303,-0.68624
304,-0.68624
305,-0.68624
306,-0.68624
307,-0.6524
308,-0.61856
309,-0.55088
310,-0.48321000000000003
311,-0.51705
312,-0.51705
313,-0.48321000000000003
314,-0.51705
315,-0.51705
316,-0.48321000000000003
317,-0.41553
318,-0.28018000000000004
319,-0.2125
320,-0.17865999999999999
321,-0.07714700000000001
322,-0.07714700000000001
323,-0.14482
324,-0.17865999999999999
325,-0.14482
326,-0.043309
327,-0.043309
328,-0.07714700000000001
329,-0.07714700000000001
330,-0.043309
331,0.058205999999999994
332,0.092044
333,0.12588
334,0.26124
335,0.32891
336,0.39659
337,0.46426999999999996
338,0.4981
339,0.63346
340,0.63346
341,0.5996199999999999
342,0.6673
