time,value
0,0.19158
1,-0.16726
2,0.7058
3,-0.28891999999999995
4,0.1753
5,-0.011144
6,0.5998899999999999
7,0.46296000000000004
8,-0.29136
9,-0.083039
10,0.17556
11,0.039876999999999996
12,-0.16314
13,-0.050884
14,-0.2992
15,0.014478999999999999
16,-0.43256999999999995
17,0.6861
18,-0.16904
19,0.35524
20,-0.40081
21,0.5123
22,-0.17590999999999998
23,0.56985
24,-0.04509
25,0.60655
26,-0.1653
27,0.032702999999999996
28,0.12524000000000002
29,-0.008773399999999999
30,0.201
31,0.31193000000000004
32,-0.071969
33,0.28629
34,0.052119000000000006
35,0.31063
36,0.28025
37,-1.1781
38,-0.21106999999999998
39,0.1298
40,0.5848
41,-0.6115
42,-0.037479000000000005
43,-0.36762
44,0.1936
45,-1.6211
46,-1.6211
47,-1.6211
48,-1.6211
49,-1.6211
50,-1.6211
51,-1.6211
52,-1.6211
53,-1.6211
54,-1.6211
55,1.672
56,1.672
57,1.672
58,1.672
59,1.672
60,1.672
61,1.672
62,1.672
63,1.672
64,1.672
65,0.30441999999999997
66,0.20920999999999998
67,-0.24974000000000002
68,-0.3438
69,0.18382
70,-0.06668400000000001
71,-0.17823
72,-0.23187
73,-0.31303000000000003
74,0.85487
75,0.11907999999999999
76,-0.10349000000000001
77,0.072821
78,0.57011
79,0.14376
80,-0.28324
81,-0.32502
82,-1.6211
83,-1.6211
84,-1.6211
85,-1.6211
86,-1.6211
87,-1.6211
88,-1.6211
89,-1.6211
90,-1.6211
91,-1.6211
92,-1.6211
93,-1.6211
94,1.672
95,1.672
96,1.672
97,1.672
98,1.672
99,1.672
100,1.672
101,1.672
102,1.672
103,1.672
104,1.672
105,-0.011281999999999999
106,0.063993
107,-0.33473
108,-0.9312600000000001
109,-0.12104000000000001
110,-0.06384
111,-0.0021096
112,-0.10902
113,-0.15305
114,-0.25459
115,0.009145799999999999
116,0.53085
117,0.17968
118,-0.001871
119,-0.45664
120,0.466
121,0.42941999999999997
122,-0.31208
123,-0.30273
124,-0.13302
125,-0.34315999999999997
126,-0.12395999999999999
127,-0.20920999999999998
