time,value
0,-0.43546999999999997
1,-0.43823
2,-0.31654
3,-0.067631
4,0.18463
5,0.44456999999999997
6,0.65673
7,0.9572
8,1.1328
9,1.3366
10,1.3842
11,1.3771
12,1.44
13,1.4592
14,1.3769
15,1.1895
16,0.9703299999999999
17,0.71643
18,0.48926000000000003
19,0.28898
20,0.036683
21,-0.23669
22,-0.42031999999999997
23,-0.48806000000000005
24,-0.37135999999999997
25,-0.22807
26,-0.06867000000000001
27,0.16213
28,0.40314
29,0.66262
30,0.8908299999999999
31,1.1286
32,1.37
33,1.4327
34,1.2735
35,1.2449
36,1.3343
37,1.3831
38,1.3257
39,1.3554
40,1.3343
41,1.4471
42,1.2887
43,1.0444
44,0.78927
45,0.51967
46,0.26971
47,0.027875999999999998
48,-0.17193
49,-0.36509
50,-1.084
51,-1.084
52,-1.084
53,-1.084
54,-1.084
55,-1.084
56,-1.084
57,-1.084
58,-1.084
59,-1.084
60,-1.084
61,-1.084
62,-1.084
63,-1.084
64,-1.084
65,-1.084
66,-1.084
67,-1.084
68,-1.084
69,-1.084
70,-1.084
71,-1.084
72,-1.084
73,-1.084
74,-1.084
75,-1.084
76,-1.084
77,-1.084
78,-1.084
79,-1.084
