time,value
0,-0.9308200000000001
1,-0.69926
2,-0.42028999999999994
3,-0.10578
4,0.20528000000000002
5,0.48068999999999995
6,0.69767
7,0.8589899999999999
8,0.9519799999999999
9,0.96959
10,0.93285
11,0.8304299999999999
12,0.65327
13,0.3806
14,0.036489
15,-0.35644000000000003
16,-0.73961
17,-1.0428
18,-1.1886
19,-1.1378
20,-0.86961
21,-0.41841999999999996
22,0.12519
23,0.6769
24,1.1353
25,1.4277
26,1.5088
27,1.3962
28,1.1443
29,0.8094399999999999
30,0.44911
31,0.10462
32,-0.1975
33,-0.46262
34,-0.68586
35,-0.87764
36,-1.0483
37,-1.1763
38,-1.2413
39,-1.2202
40,-1.1013
41,-0.8960299999999999
42,-0.6199600000000001
43,-0.31026
44,-0.012376
45,0.24923
46,0.44928999999999997
47,0.57987
48,0.65527
49,0.69488
50,0.7234
51,0.73552
52,0.75029
53,0.74303
54,0.70472
55,0.6218199999999999
56,0.5058199999999999
57,0.35262
58,0.17890999999999999
59,0.0057633
60,-0.1514
61,-0.28649
62,-0.38428
63,-0.44743
64,-0.46223000000000003
65,-0.43905
66,-0.39537
67,-0.33881
68,-0.2824
69,-0.25629
70,-0.25531
71,-0.28376
72,-0.3341
73,-0.3826
74,-0.38045999999999996
75,-0.30596
76,-0.16364
77,0.037689
78,0.25747
79,0.46213999999999994
80,0.60358
81,0.67245
82,0.67587
83,0.62416
84,0.53557
85,0.42976000000000003
86,0.30274
87,0.1441
88,-0.053305
89,-0.27493
90,-0.51305
91,-0.722
92,-0.8466799999999999
93,-0.8370700000000001
94,-0.6751699999999999
95,-0.36853
96,0.033642
97,0.46455
98,0.8337899999999999
99,1.0861
100,1.1882
101,1.1261
102,0.92253
103,0.6102
104,0.22424000000000002
105,-0.20306
106,-0.63439
107,-1.03
108,-1.3581
109,-1.5773
110,-1.6333
111,-1.5090000000000001
112,-1.2193
113,-0.79932
114,-0.29470999999999997
115,0.2186
116,0.67173
117,1.0241
118,1.262
119,1.3901
120,1.436
121,1.4141
122,1.3304
123,1.1859
124,0.9657399999999999
125,0.6682100000000001
126,0.30596
127,-0.086506
128,-0.45565
129,-0.76255
130,-0.98074
131,-1.104
132,-1.1335
133,-1.1108
134,-1.0577
135,-0.9998600000000001
136,-0.92427
137,-0.8145399999999999
138,-0.62249
139,-0.32589
140,0.067374
141,0.52281
142,0.9870200000000001
143,1.3953
144,1.6802
145,1.7937
146,1.7369
147,1.5086
148,1.1319
149,0.65782
150,0.12136
151,-0.45208999999999994
152,-1.0147
153,-1.514
154,-1.8876
155,-2.0782
156,-2.0574
157,-1.8192
158,-1.3903
159,-0.8577799999999999
160,-0.28991
161,0.23329
162,0.6453899999999999
163,0.9210799999999999
164,1.0756
165,1.1420000000000001
166,1.163
167,1.1846
168,1.2047
169,1.198
170,1.1397
171,1.0013
172,0.78259
173,0.49842
174,0.17759
175,-0.14528
176,-0.43168
177,-0.65291
178,-0.8189
179,-0.92953
180,-1.0028
181,-1.0424
182,-1.0547
183,-1.0193
184,-0.9205899999999999
185,-0.75965
186,-0.54302
187,-0.29934
188,-0.064749
189,0.12817
190,0.25982
191,0.34183
192,0.39889
193,0.44945
194,0.5068
195,0.58204
196,0.6513899999999999
197,0.7007800000000001
198,0.71959
199,0.70053
200,0.64293
201,0.56007
202,0.46296000000000004
203,0.3369
204,0.18332
205,-0.009704899999999999
206,-0.25201999999999997
207,-0.53545
208,-0.8231799999999999
209,-1.062
210,-1.1991
211,-1.1904
212,-1.031
213,-0.74138
214,-0.37466
215,9.868700000000001e-05
216,0.32194
217,0.56135
218,0.70862
219,0.7804300000000001
220,0.79655
221,0.7750199999999999
222,0.70736
223,0.58803
224,0.39965
225,0.12524000000000002
226,-0.2224
227,-0.5897100000000001
228,-0.90336
229,-1.103
230,-1.1371
231,-0.9760700000000001
232,-0.65425
233,-0.22939
234,0.22355
235,0.63271
236,0.9508700000000001
237,1.159
238,1.2602
239,1.2659
240,1.2
241,1.0733
242,0.88431
243,0.63208
244,0.30689
245,-0.089599
246,-0.53368
247,-0.99423
248,-1.4134
249,-1.7425
250,-1.9449
251,-1.9927
252,-1.869
253,-1.574
254,-1.1284
255,-0.57616
256,0.025255
257,0.61866
258,1.1335
259,1.5168
260,1.7536
261,1.8204
262,1.7396
263,1.5547
264,1.3035
265,1.0136
266,0.69428
267,0.35449
268,-0.016996
269,-0.42252
270,-0.84096
271,-1.2263
272,-1.5284
273,-1.6832
274,-1.661
275,-1.4418
276,-1.0521
277,-0.55634
278,-0.024825
279,0.47392
280,0.8800100000000001
281,1.1526
282,1.2849
283,1.2822
284,1.1578
285,0.9440000000000001
286,0.65558
287,0.32205
288,-0.025838
289,-0.35133000000000003
290,-0.60931
291,-0.76032
292,-0.78659
293,-0.70328
294,-0.52894
295,-0.30672
296,-0.10758
297,0.020935
298,0.04113
299,-0.06669800000000001
300,-0.26411
301,-0.50298
302,-0.71385
303,-0.83054
304,-0.80413
305,-0.61431
306,-0.28626999999999997
307,0.14221
308,0.60616
309,1.0248
310,1.3342
311,1.4957
312,1.4936
313,1.3538
314,1.126
315,0.84885
316,0.55418
317,0.26368
318,-0.012805
319,-0.28378000000000003
320,-0.57606
321,-0.8860600000000001
322,-1.208
323,-1.5036
324,-1.7279
325,-1.8372
326,-1.7905
327,-1.5751
328,-1.2101
329,-0.74303
330,-0.23116
331,0.27638
332,0.73753
333,1.1359
334,1.4649
335,1.7284
336,1.9105
337,1.9916
338,1.9554
339,1.7739
340,1.4296
341,0.9292799999999999
342,0.30394
343,-0.37439
344,-1.0275
345,-1.5693
346,-1.9273
347,-2.0667
348,-1.9929
349,-1.7585
350,-1.4202
351,-1.0345
352,-0.65115
353,-0.31317
354,-0.0084087
355,0.26079
356,0.51494
357,0.75445
358,0.98918
359,1.2185
360,1.4182
361,1.5633
362,1.6322
363,1.6119999999999999
364,1.4828
365,1.2314
366,0.8424299999999999
367,0.32269000000000003
368,-0.30696999999999997
369,-1.0019
370,-1.6888
371,-2.271
372,-2.6454
373,-2.7397
374,-2.5112
375,-1.9711
376,-1.1809
377,-0.25486
378,0.68281
379,1.4911
380,2.0764
381,2.3707
382,2.3695
383,2.0993
384,1.6218
385,1.0114
386,0.34794
387,-0.2801
388,-0.80589
389,-1.1603
390,-1.3056
391,-1.2389
392,-0.99956
393,-0.64525
394,-0.24913000000000002
395,0.10371
396,0.34113000000000004
397,0.43073999999999996
398,0.37617
399,0.20073
400,-0.029181
401,-0.24768
402,-0.39144
403,-0.42655
404,-0.34515999999999997
405,-0.15106
406,0.10296
407,0.36546999999999996
408,0.57491
409,0.68552
410,0.66887
411,0.52793
412,0.29954000000000003
413,0.039525
414,-0.19708
415,-0.36975
416,-0.44397
417,-0.41368
418,-0.30703
419,-0.18934
420,-0.11142
421,-0.10693
422,-0.19278
423,-0.34152
424,-0.50668
425,-0.64267
426,-0.6874
427,-0.61214
428,-0.41423999999999994
429,-0.10463
430,0.27268000000000003
431,0.6817300000000001
432,1.0613
433,1.3629
434,1.5481
435,1.5866
436,1.4509
437,1.133
438,0.6655399999999999
439,0.07535700000000001
440,-0.57615
441,-1.2023
442,-1.7237
443,-2.0657
444,-2.1844
445,-2.0692
446,-1.7512
447,-1.2893
448,-0.75039
449,-0.19555
450,0.33153
451,0.79983
452,1.194
453,1.5058
454,1.7422
455,1.8706
456,1.8856
457,1.7642
458,1.5249
459,1.1629
460,0.69822
461,0.1765
462,-0.36306
463,-0.8644299999999999
464,-1.2971
465,-1.6172
466,-1.7992
467,-1.8295
468,-1.7121
469,-1.4683
470,-1.1343
471,-0.75164
472,-0.36351999999999995
473,-0.014041
474,0.28886999999999996
475,0.52947
476,0.71224
477,0.84262
478,0.9354100000000001
479,0.9932700000000001
480,1.0197
481,0.9955299999999999
482,0.9101600000000001
483,0.75973
484,0.55053
485,0.3027
486,0.043279000000000005
487,-0.19519
488,-0.37368
489,-0.48407
490,-0.53473
491,-0.53827
492,-0.53018
493,-0.5215
494,-0.52649
495,-0.52659
496,-0.49401999999999996
497,-0.39651
498,-0.21486999999999998
499,0.05365399999999999
