time,value
0,0.9047299999999999
1,1.172
2,0.9047299999999999
3,0.9047299999999999
4,0.9047299999999999
5,1.172
6,0.9047299999999999
7,0.9047299999999999
8,0.9047299999999999
9,0.9047299999999999
10,1.172
11,0.9047299999999999
12,0.9047299999999999
13,0.9047299999999999
14,0.23649
15,-0.96636
16,-0.96636
17,-0.96636
18,-0.96636
19,-0.96636
20,-0.96636
21,-0.96636
22,-0.96636
23,-0.96636
24,-0.96636
25,-0.96636
26,-0.96636
27,-0.96636
28,-0.96636
29,-0.96636
30,-0.96636
31,-0.96636
32,-0.96636
33,-0.96636
34,-0.96636
35,-0.96636
36,-0.96636
37,-0.96636
38,-0.96636
39,-0.96636
40,-0.96636
41,-0.96636
42,0.036011
43,1.4393
44,1.172
45,1.172
46,1.172
47,1.172
48,1.172
49,0.9047299999999999
50,1.172
51,1.172
52,0.9047299999999999
53,1.172
54,0.9047299999999999
55,0.9047299999999999
56,1.172
57,0.9047299999999999
58,0.9047299999999999
59,1.172
60,0.9047299999999999
61,0.9047299999999999
62,0.9047299999999999
63,0.9047299999999999
64,0.9047299999999999
65,1.172
66,0.9047299999999999
67,0.9047299999999999
68,-0.8327100000000001
69,-0.96636
70,-0.96636
71,-0.96636
72,-0.96636
73,-0.96636
74,-0.96636
75,-0.96636
76,-0.96636
77,-0.96636
78,-0.96636
79,-0.96636
80,-0.96636
81,-0.96636
82,-0.96636
83,-0.96636
84,-0.96636
85,-0.96636
86,-0.96636
87,-0.96636
88,-0.96636
89,-0.96636
90,-0.96636
91,-0.96636
92,-0.96636
93,-0.96636
94,-0.96636
95,-0.96636
96,-0.96636
97,1.7066
98,1.172
99,1.172
100,1.4393
101,0.9047299999999999
102,1.172
103,1.172
104,1.172
105,0.9047299999999999
106,1.172
107,0.9047299999999999
108,1.172
109,0.9047299999999999
110,1.172
111,0.9047299999999999
112,0.9047299999999999
113,1.172
114,0.9047299999999999
115,0.9047299999999999
116,0.9047299999999999
117,0.9047299999999999
118,0.9047299999999999
119,1.172
120,0.9047299999999999
121,0.9047299999999999
122,-0.5654100000000001
123,-0.8995299999999999
124,-0.96636
125,-0.96636
126,-0.96636
127,-0.96636
128,-0.96636
129,-0.96636
130,-0.96636
131,-0.96636
132,-0.96636
133,-0.96636
134,-0.96636
135,-0.96636
136,-0.96636
137,-0.96636
138,-0.96636
139,-0.96636
140,-0.96636
141,-0.96636
142,-0.96636
143,-0.96636
144,-0.96636
145,-0.96636
146,-0.96636
147,-0.96636
148,-0.96636
149,-0.96636
150,-0.96636
151,-0.96636
152,0.9047299999999999
153,1.4393
154,1.172
155,1.172
156,1.172
157,1.172
158,1.172
159,0.9047299999999999
160,1.172
161,1.172
162,0.9047299999999999
163,1.172
164,0.9047299999999999
165,0.9047299999999999
166,1.172
167,0.9047299999999999
168,0.9047299999999999
169,1.172
170,0.9047299999999999
171,0.9047299999999999
172,0.9047299999999999
173,0.9047299999999999
174,0.9047299999999999
175,1.172
176,0.9047299999999999
177,-0.96636
178,-0.96636
179,-0.96636
180,-0.96636
181,-0.96636
182,-0.96636
183,-0.96636
184,-0.96636
185,-0.96636
186,-0.96636
187,-0.96636
188,-0.96636
189,-0.96636
190,-0.96636
191,-0.96636
192,-0.96636
193,-0.96636
194,-0.96636
195,-0.96636
196,-0.96636
197,-0.96636
198,-0.96636
199,-0.96636
200,-0.96636
201,-0.96636
202,-0.96636
203,-0.96636
204,-0.96636
205,-0.96636
206,-0.96636
207,-0.43176000000000003
208,1.172
209,1.4393
210,1.172
211,1.172
212,1.172
213,1.172
214,1.172
215,0.9047299999999999
216,1.172
217,1.172
218,0.9047299999999999
219,0.9047299999999999
220,1.172
221,0.9047299999999999
222,0.9047299999999999
223,1.172
224,0.9047299999999999
225,0.9047299999999999
226,0.9047299999999999
227,1.172
228,0.9047299999999999
229,0.9047299999999999
230,0.9047299999999999
231,0.9047299999999999
232,-0.16446
233,-0.8995299999999999
234,-0.96636
235,-0.96636
236,-0.96636
237,-0.96636
238,-0.96636
239,-0.96636
240,-0.96636
241,-0.96636
242,-0.96636
243,-0.96636
244,-0.96636
245,-0.96636
246,-0.96636
247,-0.96636
248,-0.96636
249,-0.96636
250,-0.96636
251,-0.96636
252,-0.96636
253,-0.96636
254,-0.96636
255,-0.96636
256,-0.96636
257,-0.96636
258,-0.96636
259,-0.96636
260,-0.16446
261,1.4393
262,1.172
263,1.172
264,1.4393
265,0.9047299999999999
266,1.172
267,1.172
268,1.172
269,0.9047299999999999
270,1.172
271,0.9047299999999999
272,1.172
273,0.9047299999999999
274,1.172
275,0.9047299999999999
276,0.9047299999999999
277,0.9047299999999999
278,1.172
279,0.9047299999999999
280,0.9047299999999999
281,0.9047299999999999
282,0.9047299999999999
283,0.9047299999999999
284,1.172
285,0.43696
286,-0.8995299999999999
287,-0.96636
288,-0.8995299999999999
289,-0.96636
290,-0.96636
291,-0.96636
292,-0.96636
293,-0.96636
294,-0.96636
295,-0.96636
296,-0.96636
297,-0.96636
298,-0.96636
299,-0.96636
300,-0.96636
301,-0.96636
302,-0.96636
303,-0.96636
304,-0.96636
305,-0.96636
306,-0.96636
307,-0.96636
308,-0.96636
309,-0.96636
310,-0.96636
311,-0.96636
312,-0.96636
313,0.43696
314,1.172
315,1.4393
316,1.172
317,1.172
318,1.172
319,1.172
320,1.172
321,1.172
322,0.9047299999999999
323,1.172
324,1.172
325,0.9047299999999999
326,0.9047299999999999
327,1.172
328,0.9047299999999999
329,1.172
330,0.9047299999999999
331,0.9047299999999999
332,1.172
333,0.9047299999999999
334,0.9047299999999999
335,1.172
336,0.9047299999999999
337,0.9047299999999999
338,0.9047299999999999
339,0.9047299999999999
340,0.9047299999999999
341,-0.5654100000000001
342,-0.96636
343,-0.96636
344,-0.96636
345,-0.96636
346,-0.96636
347,-0.96636
348,-0.96636
349,-0.96636
350,-0.96636
351,-0.96636
352,-0.96636
353,-0.96636
354,-0.96636
355,-0.96636
356,-0.96636
357,-0.96636
358,-0.96636
359,-0.96636
360,-0.96636
361,-0.96636
362,-0.96636
363,-0.96636
364,-0.96636
365,-0.96636
366,-0.96636
367,-0.96636
368,-0.96636
369,-0.16446
370,1.4393
371,1.172
372,1.172
373,1.172
374,1.172
375,1.172
376,1.172
377,1.172
378,0.9047299999999999
379,1.172
380,0.9047299999999999
381,1.172
382,0.9047299999999999
383,1.172
384,0.9047299999999999
385,1.172
386,0.9047299999999999
387,0.9047299999999999
388,0.9047299999999999
389,1.172
390,0.9047299999999999
391,0.9047299999999999
392,0.9047299999999999
393,0.9047299999999999
394,0.9047299999999999
395,1.172
396,0.23649
397,-0.8995299999999999
398,-0.96636
399,-0.96636
400,-0.96636
401,-0.96636
402,-0.96636
403,-0.96636
404,-0.96636
405,-0.96636
406,-0.96636
407,-0.96636
408,-0.96636
409,-0.96636
410,-0.96636
411,-0.96636
412,-0.96636
413,-0.96636
414,-0.96636
415,-0.96636
416,-0.96636
417,-0.96636
418,-0.96636
419,-0.96636
420,-0.96636
421,-0.96636
422,-0.96636
423,-0.96636
424,-0.96636
425,-0.96636
426,0.63743
427,1.172
428,1.4393
429,1.172
430,1.172
431,1.172
432,1.172
433,0.9047299999999999
434,1.172
435,1.172
436,0.9047299999999999
437,1.172
438,0.9047299999999999
439,1.172
440,0.9047299999999999
441,0.9047299999999999
442,1.172
443,0.9047299999999999
444,0.9047299999999999
445,0.9047299999999999
446,1.172
447,0.9047299999999999
448,0.9047299999999999
449,0.9047299999999999
450,0.9047299999999999
451,0.9047299999999999
452,0.43696
453,-0.8995299999999999
454,-0.96636
455,-0.96636
456,-0.96636
457,-0.96636
458,-0.96636
459,-0.96636
460,-0.96636
461,-0.96636
462,-0.96636
463,-0.96636
464,-0.96636
465,-0.96636
466,-0.96636
467,-0.96636
468,-0.96636
469,-0.96636
470,-0.96636
471,-0.96636
472,-0.96636
473,-0.96636
474,-0.96636
475,-0.96636
476,-0.96636
477,-0.96636
478,-0.96636
479,-0.96636
480,-0.96636
481,-0.96636
482,-0.96636
483,0.9047299999999999
484,1.4393
485,1.172
486,1.4393
487,1.172
488,0.9047299999999999
489,1.172
490,1.172
491,1.172
492,0.9047299999999999
493,1.172
494,0.9047299999999999
495,1.172
496,0.9047299999999999
497,1.172
498,0.9047299999999999
499,0.9047299999999999
500,0.9047299999999999
501,1.172
502,0.9047299999999999
503,0.9047299999999999
504,0.9047299999999999
505,0.9047299999999999
506,0.9047299999999999
507,1.172
508,0.63743
509,-0.76588
510,-0.96636
511,-0.96636
512,-0.96636
513,-0.96636
514,-0.96636
515,-0.96636
516,-0.96636
517,-0.96636
518,-0.96636
519,-0.96636
520,-0.96636
521,-0.96636
522,-0.96636
523,-0.96636
524,-0.96636
525,-0.96636
526,-0.96636
527,-0.96636
528,-0.96636
529,-0.96636
530,-0.96636
531,-0.96636
532,-0.96636
533,-0.96636
534,-0.96636
535,-0.96636
536,-0.96636
537,-0.96636
538,-0.96636
539,0.036011
540,1.172
541,1.4393
542,1.172
543,1.172
544,1.172
545,1.172
546,0.9047299999999999
547,1.172
548,1.172
549,0.9047299999999999
550,1.172
551,0.9047299999999999
552,1.172
553,0.9047299999999999
554,0.9047299999999999
555,1.172
556,0.9047299999999999
557,0.9047299999999999
558,0.9047299999999999
559,1.172
560,0.9047299999999999
561,0.9047299999999999
562,0.9047299999999999
563,0.9047299999999999
564,0.9047299999999999
565,1.172
566,0.9047299999999999
567,0.9047299999999999
568,-0.43176000000000003
569,-0.8995299999999999
570,-0.96636
571,-0.96636
572,-0.96636
573,-0.96636
574,-0.96636
575,-0.96636
576,-0.96636
577,-0.96636
578,-0.96636
579,-0.96636
580,-0.96636
581,-0.96636
582,-0.8995299999999999
583,-0.96636
584,-0.96636
585,-0.96636
586,-0.96636
587,-0.96636
588,-0.96636
589,-0.96636
590,-0.96636
591,-0.96636
592,-0.96636
593,-0.96636
594,-0.76588
595,1.172
596,1.4393
597,1.172
598,1.172
599,1.172
600,1.172
601,1.172
602,1.172
603,0.9047299999999999
604,1.172
605,0.9047299999999999
606,1.172
607,0.9047299999999999
608,1.172
609,0.9047299999999999
610,0.9047299999999999
611,1.172
612,0.9047299999999999
613,0.9047299999999999
614,0.9047299999999999
615,0.9047299999999999
616,0.9047299999999999
617,1.172
618,0.9047299999999999
619,0.9047299999999999
620,0.9047299999999999
621,0.9047299999999999
622,-0.69906
623,-0.96636
624,-0.96636
625,-0.96636
626,-0.96636
627,-0.96636
628,-0.96636
629,-0.96636
630,-0.96636
631,-0.96636
632,-0.96636
633,-0.96636
634,-0.96636
635,-0.96636
636,-0.96636
637,-0.96636
638,-0.96636
639,-0.96636
640,-0.96636
641,-0.96636
642,-0.96636
643,-0.96636
644,-0.96636
645,-0.96636
646,-0.96636
647,-0.96636
648,-0.96636
649,1.172
650,1.4393
651,1.172
652,1.172
653,1.172
654,1.172
655,1.172
656,0.9047299999999999
657,1.172
658,1.172
659,0.9047299999999999
660,1.172
661,0.9047299999999999
662,1.172
663,0.9047299999999999
664,1.172
665,0.9047299999999999
666,1.172
667,0.9047299999999999
668,1.172
669,0.9047299999999999
670,0.9047299999999999
671,1.172
672,0.9047299999999999
673,0.9047299999999999
674,1.172
675,0.9047299999999999
676,0.9047299999999999
677,1.172
678,0.9047299999999999
679,0.9047299999999999
680,0.9047299999999999
681,1.172
682,0.9047299999999999
683,0.9047299999999999
684,0.9047299999999999
685,0.9047299999999999
686,0.9047299999999999
687,0.036011
688,-0.96636
689,-0.96636
690,-0.96636
691,-0.96636
692,-0.96636
693,-0.96636
694,-0.96636
695,-0.96636
696,-0.96636
697,-0.96636
698,-0.96636
699,-0.96636
700,-0.96636
701,-0.96636
702,-0.96636
703,-0.96636
704,-0.96636
705,-0.96636
706,-0.96636
707,-0.96636
708,-0.96636
709,-0.96636
710,-0.96636
711,-0.96636
712,-0.96636
713,-0.96636
714,-0.96636
715,-0.96636
716,-0.16446
717,1.172
718,1.4393
719,1.172
