time,value
0,0.56994
1,0.56994
2,0.56994
3,0.56994
4,0.56994
5,0.56994
6,0.56994
7,0.56994
8,0.56994
9,0.56994
10,0.56994
11,0.56994
12,0.56994
13,0.56994
14,0.56994
15,0.56994
16,0.56994
17,0.56994
18,0.56994
19,0.56994
20,0.56994
21,0.56994
22,0.56994
23,0.56994
24,0.56994
25,0.56994
26,0.56994
27,0.56994
28,0.56994
29,0.5829300000000001
30,0.6118600000000001
31,0.6531399999999999
32,0.69443
33,0.7357100000000001
34,0.77699
35,0.81828
36,0.8514799999999999
37,0.86736
38,0.8690899999999999
39,0.83375
40,0.75731
41,0.67474
42,0.59217
43,0.51364
44,0.45331000000000005
45,0.40734000000000004
46,0.36606
47,0.32478
48,0.27778
49,0.21363000000000001
50,0.13193
51,0.068412
52,0.01864
53,-0.028706
54,-0.10175
55,-0.17964000000000002
56,-0.24620999999999998
57,-0.2875
58,-0.34321
59,-0.41262
60,-0.49518999999999996
61,-0.57775
62,-0.66032
63,-0.73463
64,-0.7759199999999999
65,-0.8172
66,-0.8584799999999999
67,-0.8997700000000001
68,-0.9177299999999999
69,-0.92581
70,-0.9282299999999999
71,-0.96634
72,-1.0004
73,-1.0255
74,-1.0255
75,-1.0081
76,-0.97916
77,-0.9378799999999999
78,-0.9289799999999999
79,-0.92581
80,-0.92581
81,-0.92581
82,-0.92581
83,-0.92581
84,-0.92581
85,-0.92581
86,-0.92696
87,-0.93014
88,-0.9690000000000001
89,-1.0184
90,-1.0776
91,-1.1602
92,-1.2615
93,-1.3755
94,-1.4993
95,-1.5571
96,-1.5984
97,-1.6397
98,-1.681
99,-1.7223
100,-1.7636
101,-1.8048
102,-1.8208
103,-1.8233
104,-1.8233
105,-1.8233
106,-1.8233
107,-1.8233
108,-1.8233
109,-1.8048
110,-1.7699
111,-1.735
112,-1.7235
113,-1.7235
114,-1.7235
115,-1.7235
116,-1.7235
117,-1.7235
118,-1.7235
119,-1.7235
120,-1.7218
121,-1.7059
122,-1.6727
123,-1.6314
124,-1.5902
125,-1.5489
126,-1.5076
127,-1.4663
128,-1.4374
129,-1.4244
130,-1.4244
131,-1.4244
132,-1.4244
133,-1.4244
134,-1.4244
135,-1.4164
136,-1.3939
137,-1.3526
138,-1.3113
139,-1.2701
140,-1.2288
141,-1.1875
142,-1.1506
143,-1.1252
144,-1.1252
145,-1.1091
146,-1.0808
147,-1.0395
148,-0.96675
149,-0.89013
150,-0.81593
151,-0.77465
152,-0.7221
153,-0.65778
154,-0.57521
155,-0.49265
156,-0.41008
157,-0.32750999999999997
158,-0.24494000000000002
159,-0.1551
160,-0.055671000000000005
161,0.06818099999999999
162,0.17379
163,0.26761
164,0.35018
165,0.39984000000000003
166,0.44291
167,0.4842
168,0.5254800000000001
169,0.56676
170,0.60805
171,0.64933
172,0.69062
173,0.7338100000000001
174,0.7814399999999999
175,0.85956
176,0.92515
177,0.9688100000000001
178,0.9688100000000001
179,0.9875700000000001
180,1.0204
181,1.0585
182,1.0685
183,1.0734
184,1.0893
185,1.1276
186,1.1689
187,1.2102
188,1.2514
189,1.268
190,1.2701
191,1.2829
192,1.3169
193,1.3501
194,1.3659
195,1.3677
196,1.3677
197,1.368
198,1.3775
199,1.4064
200,1.4437
201,1.4627
202,1.4674
203,1.4788
204,1.5138
205,1.5487
206,1.5671
207,1.5662
208,1.5472
209,1.5144
210,1.4792
211,1.4696
212,1.4698
213,1.4858
214,1.5271
215,1.5539
216,1.5671
217,1.5655
218,1.537
219,1.5004
220,1.4591
221,1.4178
222,1.3766
223,1.3353
224,1.294
225,1.2527
226,1.2114
227,1.1701
228,1.1289
229,1.0876
230,1.0463
231,1.005
232,0.94635
233,0.87608
234,0.79351
235,0.74333
236,0.6957
237,0.64552
238,0.56295
239,0.49268
240,0.43401999999999996
241,0.39274000000000003
242,0.35145
243,0.31017
244,0.26888
245,0.2276
246,0.17823
247,0.11899000000000001
248,0.036424
249,-0.027436000000000002
250,-0.078536
251,-0.11982000000000001
252,-0.12808
253,-0.13280999999999998
254,-0.14551
255,-0.18524000000000002
256,-0.23969000000000001
257,-0.30782
258,-0.39039
259,-0.44766999999999996
260,-0.49137
261,-0.53266
262,-0.57394
263,-0.61523
264,-0.65651
265,-0.6977899999999999
266,-0.7206600000000001
267,-0.7257399999999999
268,-0.71939
269,-0.6895399999999999
270,-0.65293
271,-0.6307
272,-0.62666
273,-0.60183
274,-0.53832
275,-0.45643999999999996
276,-0.37387
277,-0.29304
278,-0.22635
279,-0.17698
280,-0.12842
281,-0.058558000000000006
282,0.021816
283,0.10438
284,0.18695
285,0.26952
286,0.35209
287,0.43165
288,0.48882
289,0.53501
290,0.57629
291,0.61758
292,0.65886
293,0.70014
294,0.74143
295,0.73906
296,0.71475
297,0.67791
298,0.67156
299,0.6652100000000001
300,0.64933
301,0.60805
302,0.58287
303,0.56994
304,0.56994
305,0.56994
306,0.5717300000000001
307,0.5801
308,0.62139
309,0.65141
310,0.66966
311,0.66966
312,0.66966
313,0.66966
314,0.66966
