time,value
0,0.038267
1,-0.17278
2,-0.039137
3,0.4449
4,0.31342
5,0.098095
6,-0.35600000000000004
7,0.18517999999999998
8,-0.072077
9,-0.18828
10,0.56353
11,0.63043
12,0.59399
13,-0.5262
14,-0.042105000000000004
15,-0.43048000000000003
16,0.21247
17,-0.28074
18,-0.03787
19,0.25012
20,-0.034795
21,0.12254000000000001
22,0.20535
23,0.31534
24,0.24315
25,-0.35005
26,0.4464
27,0.05470800000000001
28,0.20429
29,-0.13925
30,-0.22516
31,0.00040066
32,0.14102
33,-0.40115
34,-0.32739
35,0.9307799999999999
36,-0.30585
37,0.47848999999999997
38,0.013365
39,-0.28015999999999996
40,0.14405
41,0.086739
42,-0.44267
43,-1.6645
44,-1.6645
45,-1.6645
46,-1.6645
47,-1.6645
48,-1.6645
49,-1.6645
50,-1.6645
51,1.7131
52,1.7131
53,1.7131
54,1.7131
55,1.7131
56,1.7131
57,1.7131
58,1.7131
59,0.0039976
60,-0.7012
61,-0.13864
62,-0.19234
63,0.5948100000000001
64,-0.49626000000000003
65,-0.59935
66,0.17397
67,0.033292
68,-0.057615
69,0.03809
70,0.042852999999999995
71,-0.27971
72,-0.37756
73,0.16693
74,-0.4724
75,0.12874000000000002
76,0.27121
77,0.29791
78,0.095465
79,0.09852000000000001
80,-1.6645
81,-1.6645
82,-1.6645
83,-1.6645
84,-1.6645
85,-1.6645
86,-1.6645
87,-1.6645
88,-1.6645
89,-1.6645
90,-1.6645
91,-1.6645
92,-1.6645
93,1.7131
94,1.7131
95,1.7131
96,1.7131
97,1.7131
98,1.7131
99,1.7131
100,1.7131
101,1.7131
102,1.7131
103,1.7131
104,1.7131
105,-0.029897000000000003
106,0.18207
107,-0.065621
108,0.13134
109,0.65054
110,0.45432
111,-0.40181
112,-0.42973999999999996
113,-0.063584
114,0.074085
115,-0.6087199999999999
116,-0.31489
117,0.053183
118,-0.15423
119,-0.38263
120,0.18099
121,0.289
122,-0.1762
123,0.2665
124,-0.0020671999999999995
125,-0.51781
126,-0.15041
127,1.0125
