time,value
0,-0.48754
1,-0.48754
2,-0.48754
3,-0.48754
4,-0.48754
5,-0.48754
6,-0.48754
7,-0.48754
8,-0.48754
9,-0.48754
10,-0.48754
11,1.3992
12,2.0281
13,2.4473
14,2.0281
15,2.4473
16,2.0281
17,2.0281
18,2.0281
19,-0.068277
20,-0.38273
21,-0.48754
22,-0.48754
23,-0.48754
24,-0.48754
25,-0.48754
26,-0.48754
27,-0.48754
28,-0.48754
29,-0.48754
30,-0.48754
31,-0.48754
32,-0.48754
33,-0.48754
34,-0.48754
35,-0.48754
36,-0.48754
37,-0.48754
38,-0.48754
39,-0.48754
40,-0.48754
41,-0.48754
42,-0.48754
43,-0.48754
44,-0.48754
45,-0.48754
46,-0.48754
47,-0.48754
48,-0.48754
49,-0.48754
50,-0.48754
51,-0.48754
52,-0.48754
53,-0.48754
54,-0.48754
55,-0.48754
56,0.56062
57,2.0281
58,2.0281
59,2.4473
60,2.0281
61,2.0281
62,2.4473
63,2.0281
64,1.0847
65,-0.48754
66,-0.48754
67,-0.48754
68,-0.48754
69,-0.48754
70,-0.48754
71,-0.48754
72,-0.48754
73,-0.48754
74,-0.48754
75,-0.48754
76,-0.48754
77,-0.48754
78,-0.48754
79,-0.48754
80,-0.48754
81,-0.48754
82,-0.48754
83,-0.48754
84,-0.48754
85,-0.48754
86,-0.48754
87,-0.48754
88,-0.48754
89,-0.48754
90,-0.48754
91,-0.48754
92,-0.48754
93,-0.48754
94,-0.48754
95,-0.48754
96,-0.48754
97,-0.48754
98,-0.48754
99,-0.48754
100,-0.48754
101,-0.48754
102,-0.48754
103,-0.48754
104,-0.27791
105,2.0281
106,2.4473
107,2.0281
108,2.0281
109,2.0281
110,2.0281
111,2.4473
112,2.0281
113,-0.38273
114,-0.48754
115,-0.48754
116,-0.48754
117,-0.48754
118,-0.48754
119,-0.48754
120,-0.48754
121,-0.48754
122,-0.48754
123,-0.48754
124,-0.48754
125,-0.48754
126,-0.48754
127,-0.48754
128,-0.48754
129,-0.48754
130,-0.48754
131,-0.48754
132,-0.48754
133,-0.48754
134,-0.48754
135,-0.48754
136,-0.48754
137,-0.48754
138,-0.48754
139,-0.48754
140,-0.48754
141,-0.48754
142,-0.48754
143,-0.48754
144,-0.48754
145,-0.48754
146,-0.48754
147,-0.48754
148,-0.48754
149,-0.48754
150,-0.48754
151,-0.48754
152,-0.48754
153,-0.48754
154,-0.48754
155,0.14135999999999999
156,2.0281
157,2.0281
158,2.4473
159,2.0281
160,2.0281
161,2.0281
162,2.0281
163,2.0281
164,-0.38273
165,-0.48754
166,-0.48754
167,-0.48754
168,-0.48754
169,-0.48754
170,-0.48754
171,-0.48754
172,-0.48754
173,-0.48754
174,-0.48754
175,-0.48754
176,-0.48754
177,-0.48754
178,-0.48754
179,-0.48754
180,-0.48754
181,-0.48754
182,-0.48754
183,-0.48754
184,-0.48754
185,-0.48754
186,-0.48754
187,-0.48754
188,-0.48754
189,-0.48754
190,-0.48754
191,-0.48754
192,-0.48754
193,-0.48754
194,-0.48754
195,-0.48754
196,-0.48754
197,-0.48754
198,-0.48754
199,-0.48754
200,-0.48754
201,-0.48754
202,-0.48754
203,-0.48754
204,-0.48754
205,-0.48754
206,-0.48754
207,0.14135999999999999
208,2.0281
209,2.0281
210,2.0281
211,2.4473
212,2.0281
213,2.0281
214,2.0281
215,2.0281
216,-0.27791
217,-0.48754
218,-0.48754
219,-0.48754
220,-0.48754
221,-0.48754
222,-0.48754
223,-0.48754
224,-0.48754
225,-0.48754
226,-0.48754
227,-0.48754
228,-0.48754
229,-0.48754
230,-0.48754
231,-0.48754
232,-0.48754
233,-0.48754
234,-0.48754
235,-0.48754
236,-0.48754
237,-0.48754
238,-0.48754
239,-0.48754
240,-0.48754
241,-0.48754
242,-0.48754
243,-0.48754
244,-0.48754
245,-0.48754
246,-0.48754
247,-0.48754
248,-0.48754
249,-0.48754
250,-0.48754
251,-0.48754
252,-0.48754
253,-0.48754
254,-0.48754
255,-0.48754
256,-0.48754
257,-0.48754
258,-0.48754
259,-0.48754
260,-0.48754
261,-0.068277
262,2.0281
263,2.0281
264,2.4473
265,2.0281
266,2.0281
267,2.0281
268,2.0281
269,2.0281
270,1.3992
271,-0.27791
272,-0.48754
273,-0.48754
274,-0.48754
275,-0.48754
276,-0.48754
277,-0.48754
278,-0.48754
279,-0.48754
280,-0.48754
281,-0.48754
282,-0.48754
283,-0.48754
284,-0.48754
285,-0.48754
286,-0.48754
287,-0.48754
288,-0.48754
289,-0.48754
290,-0.48754
291,-0.48754
292,-0.48754
293,-0.48754
294,-0.48754
295,-0.48754
296,-0.48754
297,-0.48754
298,-0.48754
299,-0.48754
300,-0.48754
301,-0.48754
302,-0.48754
303,-0.48754
304,-0.48754
305,-0.48754
306,-0.48754
307,-0.38273
308,-0.38273
309,-0.48754
310,-0.48754
311,-0.48754
312,1.7136
313,2.0281
314,2.0281
315,2.4473
316,2.0281
317,2.0281
318,2.0281
319,2.0281
320,1.3992
321,-0.27791
322,-0.48754
323,-0.48754
324,-0.48754
325,-0.48754
326,-0.48754
327,-0.48754
328,-0.48754
329,-0.48754
330,-0.48754
331,-0.48754
332,-0.48754
333,-0.48754
334,-0.48754
335,-0.48754
336,-0.48754
337,-0.48754
338,-0.48754
339,-0.48754
340,-0.48754
341,-0.48754
342,-0.48754
343,-0.48754
344,-0.48754
345,-0.48754
346,-0.48754
347,-0.48754
348,-0.48754
349,-0.48754
350,-0.48754
351,-0.48754
352,-0.48754
353,-0.48754
354,-0.48754
355,-0.48754
356,-0.48754
357,-0.48754
358,-0.48754
359,-0.48754
360,-0.48754
361,0.35099
362,2.0281
363,2.0281
364,2.4473
365,2.0281
366,2.0281
367,2.0281
368,2.4473
369,2.0281
370,-0.068277
371,-0.48754
372,-0.48754
373,-0.48754
374,-0.48754
375,-0.48754
376,-0.48754
377,-0.48754
378,-0.48754
379,-0.48754
380,-0.48754
381,-0.48754
382,-0.48754
383,-0.48754
384,-0.48754
385,-0.48754
386,-0.48754
387,-0.48754
388,-0.48754
389,-0.48754
390,-0.48754
391,-0.48754
392,-0.48754
393,-0.48754
394,-0.48754
395,-0.48754
396,-0.48754
397,-0.48754
398,-0.48754
399,-0.48754
400,-0.48754
401,-0.48754
402,-0.48754
403,-0.48754
404,-0.48754
405,-0.48754
406,-0.48754
407,0.7702600000000001
408,2.4473
409,2.0281
410,2.4473
411,2.0281
412,2.0281
413,2.4473
414,2.0281
415,1.0847
416,-0.27791
417,-0.48754
418,-0.48754
419,-0.48754
420,-0.48754
421,-0.48754
422,-0.48754
423,-0.48754
424,-0.48754
425,-0.48754
426,-0.48754
427,-0.48754
428,-0.48754
429,-0.48754
430,-0.48754
431,-0.48754
432,-0.48754
433,-0.48754
434,-0.48754
435,-0.48754
436,-0.48754
437,-0.48754
438,-0.48754
439,-0.48754
440,-0.48754
441,-0.48754
442,-0.48754
443,-0.48754
444,-0.48754
445,-0.48754
446,-0.48754
447,-0.48754
448,-0.48754
449,-0.48754
450,-0.17309000000000002
451,2.0281
452,2.4473
453,2.0281
454,2.4473
455,2.0281
456,2.0281
457,2.4473
458,2.0281
459,0.35099
460,-0.48754
461,-0.48754
462,-0.48754
463,-0.48754
464,-0.48754
465,-0.48754
466,-0.48754
467,-0.48754
468,-0.48754
469,-0.48754
470,-0.48754
471,-0.48754
472,-0.48754
473,-0.48754
474,-0.48754
475,-0.48754
476,-0.48754
477,-0.48754
478,-0.48754
479,-0.48754
480,-0.48754
481,-0.48754
482,-0.48754
483,-0.48754
484,-0.48754
485,-0.48754
486,-0.48754
487,-0.48754
488,-0.48754
489,-0.48754
490,-0.48754
491,-0.48754
492,0.14135999999999999
493,2.0281
494,2.4473
495,2.0281
496,2.4473
497,2.0281
498,2.0281
499,2.0281
500,1.7136
501,-0.38273
502,-0.48754
503,-0.48754
504,-0.48754
505,-0.48754
506,-0.48754
507,-0.48754
508,-0.48754
509,-0.48754
510,-0.48754
511,-0.48754
512,-0.48754
513,-0.48754
514,-0.48754
515,-0.48754
516,-0.38273
517,-0.48754
518,-0.48754
519,-0.48754
520,-0.48754
521,-0.48754
522,-0.48754
523,-0.48754
524,-0.48754
525,-0.48754
526,-0.48754
527,-0.48754
528,0.35099
529,2.0281
530,2.4473
531,2.0281
532,2.4473
533,2.0281
534,2.4473
535,2.0281
536,2.0281
537,-0.068277
538,-0.48754
539,-0.48754
540,-0.48754
541,-0.48754
542,-0.48754
543,-0.48754
544,-0.48754
545,-0.48754
546,-0.48754
547,-0.48754
548,-0.48754
549,-0.48754
550,-0.48754
551,-0.48754
552,-0.48754
553,-0.48754
554,-0.48754
555,-0.48754
556,-0.48754
557,-0.48754
558,-0.48754
559,-0.48754
560,-0.48754
561,-0.48754
562,-0.48754
563,-0.48754
564,-0.48754
565,-0.48754
566,-0.48754
567,-0.48754
568,1.0847
569,2.0281
570,2.4473
571,2.0281
572,2.4473
573,2.0281
574,2.4473
575,2.0281
576,2.0281
577,-0.17309000000000002
578,-0.48754
579,-0.48754
580,-0.48754
581,-0.48754
582,-0.48754
583,-0.48754
584,-0.48754
585,-0.48754
586,-0.48754
587,-0.48754
588,-0.48754
589,-0.48754
590,-0.48754
591,-0.48754
592,-0.48754
593,-0.48754
594,-0.48754
595,-0.48754
596,-0.48754
597,-0.48754
598,-0.48754
599,-0.48754
600,-0.48754
601,-0.48754
602,-0.48754
603,-0.48754
604,-0.48754
605,-0.48754
606,-0.48754
607,-0.48754
608,-0.48754
609,0.14135999999999999
610,2.0281
611,2.4473
612,2.0281
613,2.4473
614,2.0281
615,2.4473
616,2.0281
617,2.0281
618,-0.068277
619,-0.38273
620,-0.48754
621,-0.48754
622,-0.48754
623,-0.48754
624,-0.48754
625,-0.48754
626,-0.48754
627,-0.48754
628,-0.48754
629,-0.48754
630,-0.48754
631,-0.48754
632,-0.48754
633,-0.48754
634,-0.48754
635,-0.48754
636,-0.48754
637,-0.48754
638,-0.48754
639,-0.48754
640,-0.48754
641,-0.48754
642,-0.48754
643,-0.48754
644,-0.48754
645,-0.48754
646,-0.48754
647,1.7136
648,2.4473
649,2.0281
650,2.4473
651,2.0281
652,2.4473
653,2.0281
654,2.0281
655,0.14135999999999999
656,-0.48754
657,-0.48754
658,-0.48754
659,-0.48754
660,-0.48754
661,-0.48754
662,-0.38273
663,-0.48754
664,-0.48754
665,-0.48754
666,-0.48754
667,-0.48754
668,-0.48754
669,-0.48754
670,-0.48754
671,-0.48754
672,-0.48754
673,-0.48754
674,-0.48754
675,-0.48754
676,-0.48754
677,-0.48754
678,-0.48754
679,-0.48754
680,-0.48754
681,-0.48754
682,-0.48754
683,-0.48754
684,-0.27791
685,2.0281
686,2.4473
687,2.0281
688,2.4473
689,2.0281
690,2.4473
691,2.0281
692,1.3992
693,-0.27791
694,-0.48754
695,-0.48754
696,-0.48754
697,-0.48754
698,-0.48754
699,-0.48754
700,-0.48754
701,-0.48754
702,-0.48754
703,-0.48754
704,-0.48754
705,-0.48754
706,-0.48754
707,-0.48754
708,-0.48754
709,-0.48754
710,-0.48754
711,-0.48754
712,-0.48754
713,-0.48754
714,-0.48754
715,-0.48754
716,-0.48754
717,-0.48754
718,-0.48754
719,-0.48754
