time,value
0,-0.21314
1,-0.21314
2,-0.21314
3,-0.21314
4,-0.21314
5,-0.21314
6,-0.21314
7,-0.21314
8,-0.21314
9,-0.21314
10,-0.21314
11,-0.21314
12,-0.21314
13,-0.21314
14,-0.21314
15,-0.21314
16,-0.21314
17,-0.21314
18,-0.21314
19,-0.21314
20,-0.21314
21,-0.21314
22,-0.21314
23,-0.21314
24,-0.21314
25,-0.21314
26,-0.21314
27,-0.21314
28,-0.18877
29,-0.10590999999999999
30,-0.0058977
31,0.11534000000000001
32,0.25038
33,0.39461999999999997
34,0.50855
35,0.61254
36,0.66752
37,0.71503
38,0.72467
39,0.7278600000000001
40,0.70707
41,0.69299
42,0.69062
43,0.69491
44,0.70539
45,0.7278899999999999
46,0.7563
47,0.82983
48,0.91302
49,0.96616
50,1.0172
51,1.0588
52,1.1004
53,1.1420000000000001
54,1.1482
55,1.1087
56,1.0606
57,1.0067
58,0.9465
59,0.8841100000000001
60,0.82171
61,0.76337
62,0.78722
63,0.82205
64,0.90085
65,0.9958799999999999
66,1.1207
67,1.2455
68,1.3702
69,1.4482
70,1.5019999999999998
71,1.5239
72,1.5385
73,1.5390000000000001
74,1.5323
75,1.4749
76,1.4162
77,1.3538
78,1.2901
79,1.2245
80,1.1487
81,1.0655
82,0.9706299999999999
83,0.8713700000000001
84,0.7751
85,0.6796800000000001
86,0.59683
87,0.52174
88,0.48013999999999996
89,0.44298999999999994
90,0.41441000000000006
91,0.38968
92,0.36888000000000004
93,0.34808
94,0.32728
95,0.30648000000000003
96,0.28569
97,0.21735
98,0.14051
99,0.011664
100,-0.1269
101,-0.29329
102,-0.44128999999999996
103,-0.56304
104,-0.65127
105,-0.71367
106,-0.71636
107,-0.6955600000000001
108,-0.64031
109,-0.58018
110,-0.52962
111,-0.48339
112,-0.45735
113,-0.45358999999999994
114,-0.49518999999999996
115,-0.56908
116,-0.6776399999999999
117,-0.80209
118,-0.93568
119,-1.0774
120,-1.2213
121,-1.3276
122,-1.4265
123,-1.4757
124,-1.5136
125,-1.5171
126,-1.5026
127,-1.4609999999999999
128,-1.4092
129,-1.349
130,-1.3023
131,-1.2612
132,-1.2445
133,-1.2324
134,-1.274
135,-1.3207
136,-1.3935
137,-1.4719
138,-1.5627
139,-1.6597
140,-1.7637
141,-1.8422
142,-1.9053
143,-1.9387
144,-1.9635
145,-1.9609999999999999
146,-1.9551
147,-1.9343
148,-1.9012
149,-1.8282
150,-1.7512
151,-1.6680000000000001
152,-1.5873
153,-1.5087
154,-1.4702
155,-1.4494
156,-1.4529
157,-1.4609
158,-1.4752
159,-1.4874
160,-1.4874
161,-1.4933
162,-1.5126
163,-1.5222
164,-1.5203
165,-1.5089
166,-1.4915
167,-1.4874
168,-1.4874
169,-1.4576
170,-1.4251
171,-1.3918
172,-1.3614
173,-1.3409
174,-1.3281
175,-1.3281
176,-1.3142
177,-1.2878
178,-1.2475
179,-1.2006
180,-1.1408
181,-1.0784
182,-1.0339
183,-0.99282
184,-0.97151
185,-0.9571200000000001
186,-0.9593200000000001
187,-0.96983
188,-0.9906299999999999
189,-1.0114
190,-1.0322
191,-1.037
192,-1.0365
193,-0.99874
194,-0.9559700000000001
195,-0.8944200000000001
196,-0.8276100000000001
197,-0.7412
198,-0.6469
199,-0.53885
200,-0.42213999999999996
201,-0.29735
202,-0.17256
203,-0.047764999999999995
204,0.054884
205,0.15279
206,0.21305
207,0.26471999999999996
208,0.26471999999999996
209,0.24514
210,0.17582
211,0.09139800000000001
212,-0.012594
213,-0.11659000000000001
214,-0.22058000000000003
215,-0.28284000000000004
216,-0.33052
217,-0.34373000000000004
218,-0.35105
219,-0.32163
220,-0.28145
221,-0.19826
222,-0.10951
223,-0.010595
224,0.08695599999999999
225,0.18317
226,0.27081
227,0.354
228,0.4037
229,0.44564
230,0.46278
231,0.47598999999999997
232,0.46652
233,0.44835
234,0.40676
235,0.39495
236,0.4237
237,0.47096000000000005
238,0.53184
239,0.61023
240,0.69511
241,0.79685
242,0.90033
243,0.9897799999999999
244,1.0756
245,1.1456
246,1.2059
247,1.2475
248,1.2699
249,1.2726
250,1.2586
251,1.2357
252,1.1949
253,1.1498
254,1.0882
255,1.0275
256,0.98155
257,0.94326
258,0.9270299999999999
259,0.9266700000000001
260,0.94899
261,1.0057
262,1.0889
263,1.1721
264,1.2553
265,1.3385
266,1.4217
267,1.5048
268,1.5848
269,1.6497
270,1.7069999999999999
271,1.7488
272,1.7782
273,1.7942
274,1.7869
275,1.7661
276,1.7093
277,1.6429
278,1.5606
279,1.4775
280,1.3943
281,1.3111
282,1.2279
283,1.1495
284,1.0785
285,1.0170000000000001
286,0.96301
287,0.93247
288,0.9116700000000001
289,0.8468700000000001
290,0.77481
291,0.70075
292,0.62861
293,0.56621
294,0.5038199999999999
295,0.44142
296,0.37242
297,0.29599000000000003
298,0.22293000000000002
299,0.15192
300,0.10374000000000001
301,0.062145000000000006
302,0.020548
303,-0.020143
304,-0.050749
305,-0.079763
306,-0.10361
307,-0.13434000000000001
308,-0.17594
309,-0.20033
310,-0.21014000000000002
311,-0.21314
312,-0.21314
313,-0.21314
314,-0.21314
