time,value
0,1.8541
1,1.791
2,1.7416
3,1.5447
4,1.5626
5,1.2659
6,1.2573
7,1.1875
8,0.9056299999999999
9,0.73519
10,0.87677
11,0.73021
12,0.47518
13,0.15143
14,-0.15370999999999999
15,-0.38595
16,-0.018483000000000003
17,0.19889
18,0.32861
19,0.26903
20,0.062717
21,-0.19216
22,-0.49758
23,-0.8373
24,-1.1645
25,-1.3375
26,-1.0578
27,-0.7409
28,-0.49441
29,-0.27649
30,-0.2175
31,-0.34068000000000004
32,-0.56242
33,-0.61059
34,-0.7068300000000001
35,-0.73774
36,-0.8930600000000001
37,-0.9411700000000001
38,-0.92009
39,-0.9892299999999999
40,-1.0271
41,-0.78737
42,-0.55819
43,-0.31283
44,-0.16101
45,-0.044364999999999995
46,0.007223899999999999
47,0.12050999999999999
48,0.14327
49,0.22580999999999998
50,0.31865
51,0.40388
52,0.3987
53,0.24856999999999999
54,0.33486
55,0.60848
56,0.9157299999999999
57,1.19
58,1.5062
59,1.7830000000000001
60,2.0629
61,2.2299
62,1.9993
63,1.7051
64,1.3803
65,1.1
66,0.82111
67,0.50393
68,0.45723
69,0.46913999999999995
70,0.46555
71,0.43843999999999994
72,0.40465
73,0.30924
74,0.31316
75,0.36012
76,0.32256
77,0.17035999999999998
78,-0.18524000000000002
79,-0.41345
80,-0.59646
81,-0.7448600000000001
82,-0.85203
83,-0.8966700000000001
84,-1.0411
85,-1.0622
86,-1.0492
87,-1.012
88,-0.98665
89,-0.8889100000000001
90,-0.8577799999999999
91,-0.8175
92,-0.82752
93,-0.8283299999999999
94,-1.1371
95,-1.1691
96,-0.94681
97,-0.90084
98,-0.98665
99,-1.2466
100,-1.5096
101,-1.805
102,-2.0968
103,-2.3591
104,-2.0028
105,-1.6769999999999998
106,-1.2704
107,-0.95899
108,-0.63418
109,-0.34371
110,-0.19037
111,-0.21975
112,-0.43135
113,-0.66669
114,-0.44671000000000005
115,-0.068267
116,0.18899999999999997
117,0.4293
118,0.47461000000000003
119,0.67382
120,0.95115
121,0.98967
122,1.0392
123,1.3466
124,1.3622
125,1.5238
126,1.6406
127,1.8186
