time,value
0,0.33531
1,0.29816
2,0.29816
3,0.28886999999999996
4,0.30745
5,0.22386
6,0.24243
7,0.26100999999999996
8,0.15884
9,0.26100999999999996
10,0.25172
11,0.21456999999999998
12,0.23314000000000001
13,0.15884
14,0.21456999999999998
15,0.20528000000000002
16,0.20528000000000002
17,0.22386
18,0.17742
19,0.20528000000000002
20,0.21456999999999998
21,0.15884
22,0.20528000000000002
23,0.14027
24,0.15884
25,0.12169
26,0.08454400000000001
27,0.10312
28,0.13097999999999999
29,0.08454400000000001
30,0.047394
31,0.065969
32,0.19599
33,0.31673
34,0.32602
35,0.27958
36,-0.10121000000000001
37,-0.26838
38,-0.26838
39,-0.23123000000000002
40,-0.15693
41,-0.036194
42,-0.073344
43,-0.10121000000000001
44,-0.10121000000000001
45,-0.017619
46,-0.017619
47,-0.045482
48,-0.026907
49,0.00095607
50,-0.0083315
51,0.30745
52,1.2734
53,-1.9216
54,-5.3765
55,-6.0545
56,-4.1413
57,-2.5531
58,-1.4665
59,-0.6956100000000001
60,-0.15693
61,0.028819
62,0.14027
63,0.14027
64,0.17742
65,0.16813
66,0.22386
67,0.21456999999999998
68,0.21456999999999998
69,0.25172
70,0.32602
71,0.26100999999999996
72,0.40961000000000003
73,0.38175
74,0.54892
75,0.5210600000000001
76,0.66037
77,0.7439600000000001
78,0.9390000000000001
79,1.1619
80,1.3291
81,1.6449
82,1.8678
83,2.0814
84,2.2485
85,2.1557
86,1.9049
87,1.422
88,0.89256
89,0.4932
90,0.20528000000000002
91,0.056680999999999995
92,-0.017619
93,-0.10121000000000001
94,-0.064057
95,-0.10121000000000001
96,-0.20337
97,-0.10121000000000001
98,-0.026907
99,-0.091919
100,-0.10121000000000001
101,-0.054769000000000005
102,-0.073344
103,-0.064057
104,-0.064057
105,-0.11978
106,-0.08263200000000001
107,-0.19408
108,-0.017619
109,-0.15693
110,-0.19408
111,-0.15693
112,-0.23123000000000002
113,-0.16622
114,-0.21266
115,-0.22195
116,-0.23123000000000002
117,-0.28696
118,-0.17551
119,-0.23123000000000002
120,-0.31482
121,-0.28696
122,-0.26838
123,-0.28696
124,-0.34268000000000004
125,-0.2591
126,-0.30553
127,-0.37983
128,-0.3334
129,-0.35197
130,-0.32411
131,-0.31482
132,-0.35197
133,-0.32411
134,-0.37983
135,-0.4077
