time,value
0,-0.02076
1,-0.02076
2,-0.02076
3,-0.02076
4,-0.02076
5,-0.02076
6,-0.02076
7,-0.02076
8,-0.02076
9,-0.02076
10,-0.02076
11,-0.02076
12,-0.02076
13,-0.02076
14,-0.02076
15,-0.02076
16,-0.02076
17,-0.02076
18,-0.02076
19,-0.02076
20,-0.02076
21,-0.02076
22,-0.02076
23,-0.02076
24,-0.02076
25,-0.02076
26,-0.02076
27,-0.02076
28,-0.02076
29,-0.02076
30,-0.02076
31,-0.02076
32,-0.02076
33,-0.02076
34,-0.02076
35,-0.02076
36,-0.02076
37,-0.02076
38,-0.02076
39,-0.02076
40,-0.02076
41,-0.02076
42,-0.02076
43,-0.02076
44,-0.02076
45,-0.028335000000000003
46,-0.081363
47,-0.14778
48,-0.23287
49,-0.31795999999999996
50,-0.40305
51,-0.40705
52,-0.40798
53,-0.40798
54,-0.40798
55,-0.40798
56,-0.40798
57,-0.40798
58,-0.40798
59,-0.42857
60,-0.489
61,-0.5646
62,-0.64969
63,-0.72929
64,-0.7952100000000001
65,-0.7952100000000001
66,-0.7952100000000001
67,-0.7952100000000001
68,-0.82163
69,-0.8586299999999999
70,-0.94319
71,-1.0283
72,-1.1134
73,-1.1619
74,-1.1792
75,-1.1824
76,-1.1812
77,-1.1677
78,-1.1282
79,-1.0431
80,-0.95799
81,-0.8729
82,-0.8283
83,-0.7952100000000001
84,-0.7952100000000001
85,-0.7952100000000001
86,-0.7952100000000001
87,-0.7952100000000001
88,-0.7952100000000001
89,-0.7952100000000001
90,-0.7952100000000001
91,-0.7952100000000001
92,-0.7952100000000001
93,-0.7952100000000001
94,-0.7952100000000001
95,-0.7952100000000001
96,-0.7952100000000001
97,-0.7952100000000001
98,-0.7952100000000001
99,-0.7952100000000001
100,-0.7952100000000001
101,-0.7952100000000001
102,-0.7952100000000001
103,-0.7952100000000001
104,-0.76778
105,-0.71105
106,-0.5683
107,-0.39812
108,-0.22794
109,-0.07596900000000001
110,0.035018
111,0.13092
112,0.21600999999999998
113,0.29688000000000003
114,0.36646
115,0.36646
116,0.36646
117,0.36646
118,0.39083
119,0.42658999999999997
120,0.50951
121,0.5946100000000001
122,0.6797
123,0.73112
124,0.74962
125,0.75369
126,0.75437
127,0.7667
128,0.80302
129,0.8881100000000001
130,0.9732
131,1.0583
132,1.1434
133,1.2285
134,1.3136
135,1.3986
136,1.4837
137,1.6209
138,1.78
139,1.9499
140,2.1151
141,2.2655
142,2.3815
143,2.4666
144,2.5517
145,2.6289999999999996
146,2.613
147,2.5727
148,2.4876
149,2.4025
150,2.3174
151,2.2323
152,2.1472
153,2.0621
154,1.9769999999999999
155,1.8919
156,1.8068
157,1.7217
158,1.6367
159,1.5516
160,1.4665
161,1.3814
162,1.2963
163,1.2173
164,1.1557
165,1.2408
166,1.3259
167,1.411
168,1.4961
169,1.5812
170,1.6663
171,1.7513
172,1.8364
173,1.8906
174,1.9104
175,1.9154
176,1.9154
177,1.9154
178,1.9154
179,1.9154
180,1.9154
181,1.9154
182,1.8799
183,1.8327
184,1.7476
185,1.6626
186,1.5775
187,1.4924
188,1.4073
189,1.3222
190,1.2371
191,1.1520000000000001
192,1.0669
193,0.98183
194,0.89674
195,0.8073100000000001
196,0.62357
197,0.41702
198,0.16175
199,-0.093519
200,-0.34879
201,-0.46488999999999997
202,-0.55843
203,-0.64352
204,-0.7286199999999999
205,-0.81371
206,-0.8988
207,-0.9838899999999999
208,-1.069
209,-1.1129
210,-1.0278
211,-0.8988
212,-0.7286199999999999
213,-0.56234
214,-0.40798
215,-0.40798
216,-0.40798
217,-0.40798
218,-0.38749
219,-0.3542
220,-0.2748
221,-0.18971
222,-0.10462
223,-0.075902
224,-0.11905999999999999
225,-0.19217
226,-0.27726999999999996
227,-0.36236
228,-0.44745
229,-0.53254
230,-0.61763
231,-0.70272
232,-0.75472
233,-0.7952100000000001
234,-0.7952100000000001
235,-0.7952100000000001
236,-0.7952100000000001
237,-0.7952100000000001
238,-0.7952100000000001
239,-0.7952100000000001
240,-0.7952100000000001
241,-0.7952100000000001
242,-0.7952100000000001
243,-0.7952100000000001
244,-0.7952100000000001
245,-0.7952100000000001
246,-0.7952100000000001
247,-0.7952100000000001
248,-0.7952100000000001
249,-0.7952100000000001
250,-0.7952100000000001
251,-0.8611200000000001
252,-0.94073
253,-1.0258
254,-1.0919
255,-1.1277
256,-1.0838
257,-0.99869
258,-0.91359
259,-0.84009
260,-0.8104899999999999
261,-0.7952100000000001
262,-0.7952100000000001
263,-0.7952100000000001
264,-0.7952100000000001
265,-0.7952100000000001
266,-0.7952100000000001
267,-0.7952100000000001
268,-0.7578600000000001
269,-0.6937300000000001
270,-0.5387
271,-0.36851999999999996
272,-0.19834000000000002
273,-0.10487
274,-0.12337000000000001
275,-0.18724000000000002
276,-0.27233
277,-0.34092
278,-0.37345
279,-0.28836
280,-0.20327
281,-0.11818
282,-0.094671
283,-0.093519
284,-0.17861
285,-0.2637
286,-0.34879
287,-0.43388000000000004
288,-0.5189699999999999
289,-0.60406
290,-0.68915
291,-0.7742399999999999
292,-0.8593299999999999
293,-0.94442
294,-1.0295
295,-1.1146
296,-1.1539
297,-1.1824
298,-1.1824
299,-1.1824
300,-1.1824
301,-1.1201
302,-1.0418
303,-0.95676
304,-0.8799100000000001
305,-0.81825
306,-0.7952100000000001
307,-0.7952100000000001
308,-0.7952100000000001
309,-0.7952100000000001
310,-0.7952100000000001
311,-0.7952100000000001
312,-0.7952100000000001
313,-0.7952100000000001
314,-0.7952100000000001
