time,value
0,0.17507999999999999
1,0.32411999999999996
2,0.50773
3,0.6936399999999999
4,0.86164
5,0.9909399999999999
6,1.0583
7,1.0304
8,0.9041
9,0.6813899999999999
10,0.35862
11,-0.042314
12,-0.47691000000000006
13,-0.89026
14,-1.2269
15,-1.4481
16,-1.5297
17,-1.4764
18,-1.3086
19,-1.0752
20,-0.80583
21,-0.51618
22,-0.23373000000000002
23,0.054411
24,0.34579
25,0.64689
26,0.93752
27,1.198
28,1.3907
29,1.476
30,1.4291
31,1.2304
32,0.91295
33,0.49616000000000005
34,0.034133
35,-0.42021000000000003
36,-0.81725
37,-1.1152
38,-1.2911
39,-1.3293
40,-1.2359
41,-1.0238
42,-0.7221
43,-0.36535
44,0.0095211
45,0.35891999999999996
46,0.6495
47,0.87361
48,1.0203
49,1.1099
50,1.146
51,1.141
52,1.0941
53,0.9913
54,0.81887
55,0.55967
56,0.21126
57,-0.21579
58,-0.698
59,-1.1922
60,-1.6374
61,-1.9959
62,-2.2172
63,-2.2695
64,-2.1224
65,-1.7828
66,-1.2588
67,-0.5889
68,0.17787
69,0.9791799999999999
70,1.7263
71,2.3502
72,2.7785
73,2.9627
74,2.8857
75,2.5415
76,1.9857
77,1.2669
78,0.46955
79,-0.32932
80,-1.0589
81,-1.6686
82,-2.1166
83,-2.3834
84,-2.4721
85,-2.3809
86,-2.1249
87,-1.7375
88,-1.2288
89,-0.64065
90,0.00052477
91,0.6520699999999999
92,1.2564
93,1.7703
94,2.1358
95,2.3209
96,2.3045
97,2.0879
98,1.7048
99,1.2013
100,0.6184
101,0.0070585
102,-0.57225
103,-1.0932
104,-1.5322
105,-1.8653
106,-2.0709999999999997
107,-2.1462
108,-2.0749
109,-1.8401
110,-1.4595
111,-0.95321
112,-0.35979
113,0.26665
114,0.8758
115,1.4021
116,1.8159999999999998
117,2.0871
118,2.2082
119,2.1705
120,1.9802
121,1.6532
122,1.1924
123,0.63225
124,0.007325
125,-0.63256
126,-1.2389
127,-1.7536
128,-2.12
129,-2.3073
130,-2.2876
131,-2.0833
132,-1.7102
133,-1.2215
134,-0.6617
135,-0.075766
136,0.48835
137,0.99221
138,1.4073
139,1.7027
140,1.8630000000000002
141,1.8891
142,1.7959
143,1.6019999999999999
144,1.3198
145,0.97657
146,0.58695
147,0.16515
148,-0.28383
149,-0.74195
150,-1.1714
151,-1.5389
152,-1.7952
153,-1.9111
154,-1.8656
155,-1.6604
156,-1.3203
157,-0.87271
158,-0.35935
159,0.17682
160,0.70882
161,1.1742
162,1.5474
163,1.7775
164,1.8394
165,1.7127
166,1.4009
167,0.93809
168,0.38859
169,-0.17784
170,-0.6877300000000001
171,-1.0795
172,-1.3229
173,-1.4173
174,-1.3808
175,-1.2446
176,-1.0342
177,-0.76893
178,-0.4514
179,-0.08744199999999999
180,0.31481
181,0.72617
182,1.1097
183,1.4099
184,1.569
185,1.5561
186,1.3606
187,1.0053
188,0.54787
189,0.049112
190,-0.42682
191,-0.8451200000000001
192,-1.1761
193,-1.4083
194,-1.5327
195,-1.5449
196,-1.4444
197,-1.2214
198,-0.8857200000000001
199,-0.4544
200,0.029945999999999997
201,0.5314
202,0.9888
203,1.3447
204,1.5696
205,1.6592
206,1.6117
207,1.4304
208,1.1463
209,0.77799
210,0.34363
211,-0.12372000000000001
212,-0.59683
213,-1.0329
214,-1.3865
215,-1.6307
216,-1.7245
217,-1.6682
218,-1.4719
219,-1.165
220,-0.79243
221,-0.38509
222,0.015524000000000001
223,0.40047
224,0.75749
225,1.0724
226,1.3359999999999999
227,1.5279
228,1.6309
229,1.6097
230,1.4568
231,1.1707
232,0.7728
233,0.30672
234,-0.19067
235,-0.66848
236,-1.0882
237,-1.4192
238,-1.6364
239,-1.7353
240,-1.6919
241,-1.5053
242,-1.1808
243,-0.75263
244,-0.2707
245,0.2253
246,0.6693100000000001
247,1.0208
248,1.2487
249,1.3534
250,1.3526
251,1.2709
252,1.1362
253,0.95501
254,0.73636
255,0.47494
256,0.154
257,-0.21036
258,-0.59692
259,-0.96352
260,-1.2492
261,-1.421
262,-1.4315
263,-1.294
264,-1.0276
265,-0.68725
266,-0.3253
267,0.019077
268,0.31704
269,0.55072
270,0.73795
271,0.8759100000000001
272,0.96701
273,1.0081
274,0.9824799999999999
275,0.87674
276,0.6879
277,0.43599
278,0.13915
279,-0.16781
280,-0.45821000000000006
281,-0.70029
282,-0.87216
283,-0.96159
284,-0.96626
285,-0.8908799999999999
286,-0.7467600000000001
287,-0.54022
288,-0.29435
289,-0.030672
290,0.22236
291,0.42538000000000004
292,0.57357
293,0.6440100000000001
294,0.6501
295,0.5989300000000001
296,0.5130399999999999
297,0.42065
298,0.33205999999999997
299,0.25856
300,0.1909
301,0.12665
302,0.047356999999999996
303,-0.039193
304,-0.13313
305,-0.23221999999999998
306,-0.33712
307,-0.44048000000000004
308,-0.53974
309,-0.63003
310,-0.6984
311,-0.73423
312,-0.72036
313,-0.63561
314,-0.47634
315,-0.24090999999999999
316,0.049552
317,0.34518000000000004
318,0.60549
319,0.787
320,0.8640899999999999
321,0.84106
322,0.74505
323,0.60237
324,0.45474
325,0.32128
326,0.20546
327,0.10271
328,-0.0076479
329,-0.14887
330,-0.31266
331,-0.4804
332,-0.63998
333,-0.7427699999999999
334,-0.76575
335,-0.69596
336,-0.5346
337,-0.31169
338,-0.05966900000000001
339,0.18741
340,0.40103
341,0.56823
342,0.6713399999999999
343,0.69952
344,0.6574300000000001
345,0.55064
346,0.39371
347,0.19755
348,-0.011425
349,-0.21070999999999998
350,-0.38175
351,-0.50054
352,-0.5794199999999999
353,-0.61539
354,-0.61763
355,-0.59831
356,-0.56367
357,-0.49288000000000004
358,-0.38439
359,-0.23129
360,-0.027821
361,0.20925
362,0.45425
363,0.66942
364,0.83236
365,0.9142399999999999
366,0.9093100000000001
367,0.8187399999999999
368,0.65641
369,0.44106999999999996
370,0.20346
371,-0.043649
372,-0.27374
373,-0.47448
374,-0.63774
375,-0.74537
376,-0.78168
377,-0.7548199999999999
378,-0.6702100000000001
379,-0.53625
380,-0.3705
381,-0.18124
382,0.011608
383,0.19641
384,0.34996
385,0.46448
386,0.53757
387,0.56001
388,0.52064
389,0.42958999999999997
390,0.29703
391,0.13649
392,-0.022465
393,-0.16858
394,-0.27108000000000004
395,-0.32771999999999996
396,-0.33557
397,-0.31059000000000003
398,-0.27374
399,-0.23870999999999998
400,-0.21302
401,-0.18808
402,-0.15498
403,-0.092237
404,-1.701e-05
405,0.10885
406,0.21475999999999998
407,0.2895
408,0.3084
409,0.26524000000000003
410,0.16230999999999998
411,0.018653
412,-0.12337999999999999
413,-0.22249000000000002
414,-0.25776
415,-0.21051
416,-0.095669
417,0.043684
418,0.18602
419,0.29046
420,0.33607
421,0.30866
422,0.22635
423,0.099346
424,-0.037351
425,-0.16046
426,-0.24978000000000003
427,-0.30587
428,-0.32676
429,-0.3045
430,-0.2416
431,-0.15075999999999998
432,-0.053175
433,0.059852999999999996
434,0.15819
435,0.22919
436,0.27078
437,0.26169000000000003
438,0.20656
439,0.13032
440,0.046866000000000005
441,-0.023453
442,-0.067909
443,-0.070913
444,-0.039810000000000005
445,0.012102
446,0.070771
447,0.11180999999999999
448,0.12838
449,0.11997999999999999
450,0.097147
451,0.078079
452,0.063912
453,0.05902
454,0.044173000000000004
455,0.013163
456,-0.049477999999999994
457,-0.14502
458,-0.2722
459,-0.40293
460,-0.51172
461,-0.57105
462,-0.55761
463,-0.46843
464,-0.31687
465,-0.12795
466,0.070289
467,0.23711999999999997
468,0.36434
469,0.4509
470,0.48796999999999996
471,0.5012
472,0.4998
473,0.48853
474,0.47693
475,0.45185
476,0.40567
477,0.31956
478,0.19782
479,0.044614999999999995
480,-0.1378
481,-0.3174
482,-0.47329
483,-0.5674899999999999
484,-0.59187
485,-0.53052
486,-0.39501
487,-0.22699
488,-0.048443
489,0.10513
490,0.20767
491,0.24234
492,0.2135
493,0.14112
494,0.044654
495,-0.051977999999999996
496,-0.13405999999999998
497,-0.1869
498,-0.1958
499,-0.16465
