time,value
0,-0.84301
1,-0.7852899999999999
2,-0.84301
3,-0.7852899999999999
4,1.2349
5,1.2349
6,1.2349
7,1.2349
8,1.2349
9,1.2349
10,1.2349
11,1.004
12,1.2349
13,0.36908
14,-0.84301
15,-0.7852899999999999
16,-0.84301
17,-0.84301
18,-0.7852899999999999
19,-0.84301
20,-0.84301
21,-0.7852899999999999
22,-0.84301
23,-0.7852899999999999
24,-0.84301
25,-0.84301
26,-0.7852899999999999
27,-0.84301
28,-0.7852899999999999
29,-0.84301
30,1.2349
31,1.2349
32,1.2349
33,1.2349
34,1.2349
35,1.2349
36,1.2349
37,1.004
38,1.2349
39,-0.15039
40,-0.66985
41,-0.84301
42,-0.7852899999999999
43,-0.84301
44,-0.84301
45,-0.7852899999999999
46,-0.84301
47,-0.7852899999999999
48,-0.84301
49,-0.84301
50,-0.7852899999999999
51,-0.84301
52,-0.7852899999999999
53,-0.84301
54,-0.84301
55,-0.7852899999999999
56,1.2349
57,1.2349
58,1.2349
59,1.2349
60,1.2349
61,1.2349
62,1.2349
63,1.004
64,1.2349
65,0.022767
66,-0.7852899999999999
67,-0.84301
68,-0.7852899999999999
69,-0.84301
70,-0.84301
71,-0.7852899999999999
72,-0.84301
73,-0.7852899999999999
74,-0.84301
75,-0.84301
76,-0.7852899999999999
77,-0.84301
78,-0.7852899999999999
79,-0.84301
80,-0.84301
81,-0.7852899999999999
82,0.7731100000000001
83,1.2349
84,1.2349
85,1.2349
86,1.2349
87,1.2349
88,1.2349
89,1.2349
90,1.004
91,0.54223
92,-0.66985
93,-0.7852899999999999
94,-0.84301
95,-0.84301
96,-0.7852899999999999
97,-0.84301
98,-0.7852899999999999
99,-0.84301
100,-0.84301
101,-0.7852899999999999
102,-0.84301
103,-0.7852899999999999
104,-0.84301
105,-0.84301
106,-0.7852899999999999
107,-0.84301
108,0.36908
109,1.2349
110,1.2349
111,1.2349
112,1.2349
113,1.2349
114,1.2349
115,1.004
116,1.2349
117,0.7731100000000001
118,-0.66985
119,-0.7852899999999999
120,-0.84301
121,-0.84301
122,-0.7852899999999999
123,-0.84301
124,-0.7852899999999999
125,-0.84301
126,-0.84301
127,-0.7852899999999999
128,-0.84301
129,-0.84301
130,-0.7852899999999999
131,-0.84301
132,-0.7852899999999999
133,-0.84301
134,-0.38126
135,1.2349
136,1.2349
137,1.4657
138,1.2349
139,1.004
140,1.2349
141,1.2349
142,1.2349
143,1.004
144,-0.15039
145,-0.84301
146,-0.84301
147,-0.7852899999999999
148,-0.84301
149,-0.84301
150,-0.7852899999999999
151,-0.84301
152,-0.7852899999999999
153,-0.84301
154,-0.84301
155,-0.7852899999999999
156,-0.84301
157,-0.7852899999999999
158,-0.84301
159,-0.84301
160,-0.7852899999999999
161,0.36908
162,1.2349
163,1.2349
164,1.2349
165,1.2349
166,1.2349
167,1.2349
168,1.2349
169,1.004
170,0.7731100000000001
171,-0.7275699999999999
172,-0.7852899999999999
173,-0.84301
174,-0.84301
175,-0.7852899999999999
176,-0.84301
177,-0.84301
178,-0.7852899999999999
179,-0.84301
180,-0.7852899999999999
181,-0.84301
182,-0.84301
183,-0.7852899999999999
184,-0.84301
185,-0.84301
186,-0.7852899999999999
187,0.022767
188,1.2349
189,1.2349
190,1.2349
191,1.2349
192,1.2349
193,1.2349
194,1.2349
195,1.004
196,0.54223
197,-0.7275699999999999
198,-0.84301
199,-0.7852899999999999
200,-0.84301
201,-0.84301
202,-0.7852899999999999
203,-0.84301
204,-0.7852899999999999
205,-0.84301
206,-0.84301
207,-0.7852899999999999
208,-0.84301
209,-0.84301
210,-0.7852899999999999
211,-0.84301
212,-0.7852899999999999
213,-0.61214
214,1.2349
215,1.2349
216,1.2349
217,1.2349
218,1.2349
219,1.2349
220,1.2349
221,1.004
222,1.2349
223,-0.84301
224,-0.84301
225,-0.7852899999999999
226,-0.84301
227,-0.84301
228,-0.7852899999999999
229,-0.84301
230,-0.7852899999999999
231,-0.84301
232,-0.84301
233,-0.7852899999999999
234,-0.84301
235,-0.84301
236,-0.7852899999999999
237,-0.84301
238,-0.7852899999999999
239,0.36908
240,1.2349
241,1.2349
242,1.2349
243,1.2349
244,1.2349
245,1.004
246,1.2349
247,1.004
248,0.022767
249,-0.84301
250,-0.7852899999999999
251,-0.84301
252,-0.84301
253,-0.7852899999999999
254,-0.84301
255,-0.84301
256,-0.7852899999999999
257,-0.84301
258,-0.7852899999999999
259,-0.84301
260,-0.84301
261,-0.7852899999999999
262,-0.84301
263,-0.7852899999999999
264,-0.84301
265,-0.7852899999999999
266,1.2349
267,1.2349
268,1.2349
269,1.2349
270,1.2349
271,1.2349
272,1.004
273,1.2349
274,1.004
275,0.54223
276,-0.66985
277,-0.7852899999999999
278,-0.84301
279,-0.84301
280,-0.7852899999999999
281,-0.84301
282,-0.7852899999999999
283,-0.84301
284,-0.84301
285,-0.7852899999999999
286,-0.84301
287,-0.84301
288,-0.7852899999999999
289,-0.84301
290,-0.7852899999999999
291,-0.84301
292,-0.84301
293,0.022767
294,1.2349
295,1.2349
296,1.2349
297,1.004
298,1.2349
299,1.2349
300,1.004
301,1.2349
302,1.2349
303,0.19592
304,-0.7275699999999999
305,-0.84301
306,-0.84301
307,-0.7852899999999999
308,-0.84301
309,-0.84301
310,-0.7852899999999999
311,-0.84301
312,-0.7852899999999999
313,-0.84301
314,-0.84301
315,-0.7852899999999999
316,-0.84301
317,-0.7852899999999999
318,-0.7852899999999999
319,-0.84301
320,0.022767
321,1.2349
322,1.2349
323,1.2349
324,1.2349
325,1.2349
326,1.2349
327,1.2349
328,1.2349
329,1.004
330,1.2349
331,-0.4967
332,-0.7852899999999999
333,-0.7852899999999999
334,-0.84301
335,-0.84301
336,-0.7852899999999999
337,-0.84301
338,-0.7852899999999999
339,-0.84301
340,-0.84301
341,-0.7852899999999999
342,-0.84301
343,-0.7852899999999999
344,-0.84301
345,-0.84301
346,-0.7852899999999999
347,-0.84301
348,0.54223
349,1.2349
350,1.2349
351,1.2349
352,1.004
353,1.2349
354,1.2349
355,1.2349
356,1.004
357,1.2349
358,-0.15039
359,-0.84301
360,-0.7852899999999999
361,-0.84301
362,-0.84301
363,-0.7852899999999999
364,-0.84301
365,-0.7852899999999999
366,-0.84301
367,-0.84301
368,-0.7852899999999999
369,-0.84301
370,-0.84301
371,-0.7852899999999999
372,-0.84301
373,-0.84301
374,-0.7852899999999999
375,0.36908
376,1.2349
377,1.2349
378,1.2349
379,1.2349
380,1.2349
381,1.004
382,1.2349
383,1.004
384,1.2349
385,-0.7275699999999999
386,-0.84301
387,-0.7852899999999999
388,-0.84301
389,-0.84301
390,-0.7852899999999999
391,-0.84301
392,-0.7852899999999999
393,-0.84301
394,-0.7852899999999999
395,-0.84301
396,-0.84301
397,-0.7852899999999999
398,-0.84301
399,-0.84301
400,-0.7852899999999999
401,-0.84301
402,0.022767
403,1.2349
404,1.2349
405,1.2349
406,1.2349
407,1.2349
408,1.004
409,1.2349
410,1.2349
411,1.2349
412,1.004
413,0.7731100000000001
414,-0.7275699999999999
415,-0.7852899999999999
416,-0.84301
417,-0.7852899999999999
418,-0.84301
419,-0.84301
420,-0.7852899999999999
421,-0.84301
422,-0.84301
423,-0.7852899999999999
424,-0.84301
425,-0.7852899999999999
426,-0.84301
427,-0.84301
428,-0.7852899999999999
429,-0.84301
430,-0.66985
431,1.2349
432,1.2349
433,1.2349
434,1.2349
435,1.2349
436,1.004
437,1.2349
438,1.2349
439,1.004
440,0.7731100000000001
441,-0.61214
442,-0.84301
443,-0.84301
444,-0.7852899999999999
445,-0.84301
446,-0.84301
447,-0.7852899999999999
448,-0.84301
449,-0.7852899999999999
450,-0.84301
451,-0.84301
452,-0.7852899999999999
453,-0.84301
454,-0.7852899999999999
455,-0.84301
456,-0.84301
457,-0.26583
458,1.2349
459,1.2349
460,1.2349
461,1.2349
462,1.2349
463,1.004
464,1.2349
465,1.2349
466,1.004
467,0.7731100000000001
468,-0.61214
469,-0.84301
470,-0.84301
471,-0.7852899999999999
472,-0.84301
473,-0.7852899999999999
474,-0.84301
475,-0.84301
476,-0.7852899999999999
477,-0.84301
478,-0.84301
479,-0.7852899999999999
480,-0.84301
481,-0.7852899999999999
482,-0.84301
483,-0.84301
484,-0.7852899999999999
485,0.7731100000000001
486,1.2349
487,1.2349
488,1.2349
489,1.004
490,1.2349
491,1.2349
492,1.004
493,1.2349
494,1.004
495,-0.7852899999999999
496,-0.84301
497,-0.7852899999999999
498,-0.84301
499,-0.7852899999999999
500,-0.84301
501,-0.7852899999999999
502,-0.84301
503,-0.84301
504,-0.7852899999999999
505,-0.84301
506,-0.84301
507,-0.7852899999999999
508,-0.84301
509,-0.7852899999999999
510,-0.84301
511,-0.7852899999999999
512,0.7731100000000001
513,1.2349
514,1.2349
515,1.2349
516,1.2349
517,1.2349
518,1.2349
519,1.2349
520,1.2349
521,1.004
522,0.54223
523,-0.66985
524,-0.84301
525,-0.7852899999999999
526,-0.84301
527,-0.7852899999999999
528,-0.84301
529,-0.84301
530,-0.7852899999999999
531,-0.84301
532,-0.7852899999999999
533,-0.84301
534,-0.84301
535,-0.7852899999999999
536,-0.84301
537,-0.84301
538,-0.7852899999999999
539,0.54223
540,1.2349
541,1.2349
542,1.2349
543,1.2349
544,1.2349
545,1.2349
546,1.004
547,1.2349
548,1.004
549,-0.38126
550,-0.7275699999999999
551,-0.84301
552,-0.84301
553,-0.7852899999999999
554,-0.84301
555,-0.84301
556,-0.7852899999999999
557,-0.84301
558,-0.7852899999999999
559,-0.84301
560,-0.84301
561,-0.7852899999999999
562,-0.84301
563,-0.7852899999999999
564,-0.84301
565,-0.61214
566,1.2349
567,1.2349
568,1.2349
569,1.2349
570,1.2349
571,1.2349
572,1.004
573,1.2349
574,1.2349
575,-0.26583
576,-0.7852899999999999
577,-0.7852899999999999
578,-0.84301
579,-0.7852899999999999
580,-0.84301
581,-0.84301
582,-0.7852899999999999
583,-0.84301
584,-0.84301
585,-0.7852899999999999
586,-0.84301
587,-0.7852899999999999
588,-0.84301
589,-0.84301
590,-0.7852899999999999
591,-0.84301
592,1.004
593,1.2349
594,1.2349
595,1.2349
596,1.2349
597,1.2349
598,1.2349
599,1.004
600,1.2349
601,0.022767
602,-0.4967
603,2.6201
604,2.6201
605,2.9664
606,2.6201
607,2.6201
608,2.6201
609,2.9664
610,2.6201
611,2.6201
612,0.54223
613,-0.84301
614,-0.84301
615,-0.7852899999999999
616,-0.84301
617,-0.4967
618,1.4657
619,1.4657
620,1.4657
621,1.4657
622,1.2349
623,1.4657
624,1.4657
625,1.2349
626,1.2349
627,1.4657
628,1.2349
629,1.2349
630,1.2349
631,1.2349
632,1.2349
633,1.004
634,1.2349
635,1.2349
636,1.004
637,1.2349
638,1.004
639,1.2349
640,0.19592
641,-0.7275699999999999
642,-0.84301
643,-0.7852899999999999
644,-0.84301
645,-0.84301
646,-0.7852899999999999
647,-0.84301
648,-0.7852899999999999
649,-0.84301
650,-0.84301
651,-0.7852899999999999
652,-0.84301
653,-0.84301
654,0.54223
655,1.2349
656,1.2349
657,1.2349
658,1.2349
659,1.004
660,1.2349
661,1.2349
662,1.2349
663,1.004
664,0.19592
665,-0.7852899999999999
666,-0.84301
667,-0.7852899999999999
668,-0.84301
669,-0.84301
670,-0.7852899999999999
671,-0.84301
672,-0.7852899999999999
673,-0.84301
674,-0.84301
675,-0.7852899999999999
676,-0.84301
677,-0.84301
678,-0.7852899999999999
679,0.19592
680,1.2349
681,1.2349
682,1.2349
683,1.2349
684,1.2349
685,1.2349
686,1.004
687,1.2349
688,1.004
689,-0.7852899999999999
690,-0.84301
691,-0.84301
692,-0.7852899999999999
693,-0.84301
694,-0.7852899999999999
695,-0.84301
696,-0.84301
697,-0.7852899999999999
698,-0.84301
699,-0.84301
700,-0.7852899999999999
701,-0.84301
702,-0.7852899999999999
703,-0.84301
704,-0.61214
705,1.2349
706,1.2349
707,1.2349
708,1.2349
709,1.2349
710,1.2349
711,1.2349
712,1.004
713,1.2349
714,-0.66985
715,-0.84301
716,-0.7852899999999999
717,-0.84301
718,-0.84301
719,-0.7852899999999999
