time,value
0,0.0062576
1,0.71954
2,1.5337
3,2.3426
4,3.0322
5,3.503
6,3.6904
7,3.5774
8,3.1981
9,2.6298
10,1.9763
11,1.3464
12,0.8315899999999999
13,0.48965
14,0.3358
15,0.34406
16,0.45752
17,0.60463
18,0.7171
19,0.74538
20,0.66803
21,0.49341999999999997
22,0.2541
23,-0.0039674
24,-0.2343
25,-0.4013
26,-0.48763
27,-0.49623
28,-0.44687
29,-0.36905
30,-0.29331
31,-0.24345
32,-0.2316
33,-0.25705
34,-0.30861
35,-0.36935
36,-0.42223999999999995
37,-0.45488999999999996
38,-0.46232
39,-0.44727
40,-0.41826
41,-0.38636
42,-0.36168
43,-0.35063
44,-0.35470999999999997
45,-0.37091999999999997
46,-0.39331
47,-0.41523999999999994
48,-0.4315
49,-0.43958
50,-0.44006000000000006
51,-0.43593999999999994
52,-0.43133999999999995
53,-0.43004
54,-0.43433
55,-0.44442
56,-0.4586
57,-0.47394
58,-0.48723
59,-0.49612
60,-0.49901
61,-0.49596
62,-0.48836
63,-0.47828999999999994
64,-0.46788
65,-0.46073000000000003
66,-0.45463000000000003
67,-0.45
68,-0.44718
69,-0.4463
70,-0.4474
71,-0.45066000000000006
72,-0.4547
73,-0.45926999999999996
74,-0.46426000000000006
75,-0.46951000000000004
76,-0.47506000000000004
77,-0.48063
78,-0.48527
79,-0.48878999999999995
80,-0.49123999999999995
81,-0.49285
82,-0.49417
83,-0.49563999999999997
84,-0.49758
85,-0.50049
86,-0.50465
87,-0.5100600000000001
88,-0.51645
89,-0.5230600000000001
90,-0.52895
91,-0.53322
92,-0.53515
93,-0.5343600000000001
94,-0.53096
95,-0.5253800000000001
96,-0.51848
97,-0.51144
98,-0.5054
