time,value
0,-0.31213
1,-0.31213
2,-0.31213
3,-0.31213
4,-0.31213
5,-0.31213
6,-0.31213
7,-0.31213
8,-0.31213
9,-0.31213
10,-0.31213
11,-0.31213
12,-0.31213
13,-0.31213
14,-0.31213
15,-0.31213
16,-0.31213
17,-0.31213
18,-0.31213
19,-0.31213
20,-0.31213
21,-0.31213
22,-0.31213
23,-0.31213
24,-0.31213
25,-0.31213
26,-0.31213
27,-0.31213
28,-0.31213
29,-0.31213
30,-0.31213
31,-0.31213
32,-0.31213
33,-0.31213
34,-0.31213
35,-0.31213
36,-0.31213
37,-0.31213
38,-0.31213
39,-0.31213
40,-0.31213
41,-0.31213
42,-0.31213
43,-0.31213
44,-0.31213
45,-0.31213
46,-0.31213
47,-0.31213
48,-0.31213
49,-0.31213
50,-0.31213
51,-0.31213
52,-0.31213
53,-0.31213
54,-0.31213
55,-0.31213
56,-0.31213
57,-0.31213
58,-0.31213
59,-0.31213
60,-0.31213
61,-0.31213
62,-0.31213
63,-0.31213
64,-0.31213
65,-0.31213
66,-0.31213
67,-0.31213
68,-0.31213
69,-0.31213
70,-0.31213
71,-0.31213
72,-0.31213
73,-0.31213
74,-0.31213
75,-0.31213
76,-0.31213
77,-0.31213
78,-0.31213
79,-0.31213
80,-0.31213
81,-0.31213
82,-0.31213
83,-0.31213
84,-0.31213
85,-0.31213
86,-0.31213
87,-0.31213
88,-0.31213
89,-0.31213
90,-0.31213
91,-0.31213
92,-0.31213
93,-0.31213
94,-0.31213
95,-0.31213
96,-0.31213
97,-0.31213
98,-0.31213
99,-0.31213
100,-0.31213
101,-0.31213
102,-0.31213
103,-0.31213
104,-0.31213
105,-0.31213
106,-0.31213
107,-0.31213
108,-0.31213
109,-0.31213
110,-0.31213
111,-0.31213
112,-0.31213
113,-0.31213
114,-0.31213
115,-0.31213
116,-0.31213
117,-0.31213
118,-0.31213
119,-0.31213
120,-0.31213
121,-0.31213
122,-0.31213
123,-0.31213
124,-0.31213
125,-0.31213
126,-0.31213
127,-0.31213
128,-0.31213
129,-0.31213
130,-0.31213
131,-0.31213
132,-0.31213
133,-0.31213
134,-0.31213
135,-0.31213
136,-0.31213
137,-0.31213
138,-0.31213
139,-0.31213
140,-0.31213
141,-0.31213
142,-0.31213
143,-0.31213
144,-0.31213
145,-0.31213
146,-0.31213
147,-0.31213
148,-0.31213
149,-0.31213
150,-0.31213
151,-0.31213
152,-0.31213
153,-0.31213
154,-0.31213
155,-0.31213
156,-0.31213
157,-0.31213
158,-0.31213
159,-0.31213
160,-0.31213
161,-0.31213
162,-0.31213
163,-0.31213
164,-0.31213
165,-0.31213
166,-0.31213
167,-0.31213
168,-0.31213
169,-0.31213
170,-0.31213
171,-0.31213
172,-0.31213
173,-0.31213
174,-0.31213
175,-0.31213
176,-0.31213
177,-0.31213
178,-0.31213
179,-0.31213
180,-0.31213
181,-0.31213
182,-0.31213
183,-0.31213
184,-0.31213
185,-0.31213
186,-0.31213
187,-0.31213
188,-0.31213
189,-0.31213
190,-0.31213
191,-0.31213
192,-0.31213
193,-0.31213
194,-0.31213
195,-0.31213
196,-0.31213
197,-0.31213
198,-0.31213
199,-0.31213
200,-0.31213
201,-0.31213
202,-0.31213
203,-0.31213
204,-0.31213
205,-0.31213
206,-0.31213
207,-0.31213
208,-0.31213
209,-0.31213
210,-0.31213
211,-0.31213
212,-0.31213
213,-0.31213
214,-0.31213
215,-0.31213
216,-0.31213
217,-0.31213
218,-0.31213
219,-0.31213
220,-0.31213
221,-0.31213
222,-0.31213
223,-0.31213
224,-0.31213
225,-0.31213
226,-0.31213
227,-0.31213
228,-0.31213
229,-0.31213
230,-0.31213
231,-0.31213
232,-0.31213
233,-0.31213
234,-0.31213
235,-0.31213
236,-0.31213
237,-0.31213
238,-0.31213
239,-0.31213
240,-0.31213
241,-0.31213
242,-0.31213
243,-0.31213
244,-0.31213
245,-0.31213
246,-0.31213
247,-0.31213
248,-0.31213
249,-0.31213
250,-0.31213
251,-0.31213
252,-0.31213
253,-0.31213
254,-0.31213
255,-0.31213
256,-0.31213
257,-0.31213
258,-0.31213
259,-0.31213
260,-0.31213
261,-0.31213
262,-0.31213
263,-0.31213
264,-0.31213
265,-0.31213
266,-0.31213
267,-0.31213
268,-0.31213
269,-0.31213
270,-0.31213
271,-0.31213
272,-0.31213
273,-0.31213
274,-0.31213
275,-0.31213
276,-0.31213
277,-0.31213
278,-0.31213
279,-0.31213
280,-0.31213
281,-0.31213
282,-0.31213
283,-0.31213
284,-0.31213
285,-0.31213
286,-0.31213
287,-0.31213
288,-0.31213
289,-0.31213
290,-0.31213
291,-0.31213
292,-0.31213
293,-0.31213
294,-0.31213
295,-0.31213
296,-0.31213
297,-0.31213
298,-0.31213
299,-0.31213
300,-0.31213
301,-0.31213
302,-0.31213
303,-0.31213
304,-0.31213
305,-0.31213
306,-0.31213
307,-0.31213
308,-0.31213
309,1.2485
310,3.5895
311,3.5895
312,4.3698
313,3.5895
314,3.5895
315,3.5895
316,4.3698
317,3.5895
318,3.5895
319,3.5895
320,3.5895
321,3.5895
322,3.5895
323,3.5895
324,3.5895
325,3.5895
326,3.5895
327,3.5895
328,3.5895
329,3.5895
330,3.5895
331,2.8092
332,3.5895
333,3.5895
334,3.5895
335,3.5895
336,3.5895
337,3.5895
338,3.5895
339,3.5895
340,3.5895
341,2.8092
342,3.5895
343,3.5895
344,3.5895
345,3.5895
346,2.0288
347,0.078033
348,-0.31213
349,0.078033
350,-0.31213
351,-0.31213
352,-0.31213
353,-0.31213
354,-0.31213
355,-0.31213
356,0.078033
357,-0.31213
358,-0.31213
359,-0.31213
360,-0.31213
361,-0.31213
362,0.078033
363,-0.31213
364,-0.31213
365,-0.31213
366,-0.31213
367,-0.31213
368,0.078033
369,-0.31213
370,-0.31213
371,-0.31213
372,-0.31213
373,0.078033
374,-0.31213
375,-0.31213
376,-0.31213
377,-0.31213
378,0.078033
379,-0.31213
380,-0.31213
381,-0.31213
382,-0.31213
383,0.078033
384,-0.31213
385,-0.31213
386,-0.31213
387,-0.31213
388,-0.31213
389,0.078033
390,-0.31213
391,-0.31213
392,-0.31213
393,-0.31213
394,-0.31213
395,0.078033
396,-0.31213
397,-0.31213
398,-0.31213
399,-0.31213
400,0.078033
401,-0.31213
402,-0.31213
403,-0.31213
404,-0.31213
405,-0.31213
406,0.078033
407,-0.31213
408,-0.31213
409,-0.31213
410,-0.31213
411,0.078033
412,-0.31213
413,-0.31213
414,-0.31213
415,-0.31213
416,0.078033
417,-0.31213
418,-0.31213
419,-0.31213
420,-0.31213
421,0.078033
422,-0.31213
423,-0.31213
424,-0.31213
425,-0.31213
426,-0.31213
427,0.078033
428,-0.31213
429,-0.31213
430,-0.31213
431,-0.31213
432,-0.31213
433,0.078033
434,-0.31213
435,-0.31213
436,-0.31213
437,-0.31213
438,0.078033
439,-0.31213
440,-0.31213
441,-0.31213
442,-0.31213
443,0.078033
444,-0.31213
445,-0.31213
446,-0.31213
447,-0.31213
448,-0.31213
449,0.078033
450,-0.31213
451,-0.31213
452,-0.31213
453,-0.31213
454,-0.31213
455,0.078033
456,-0.31213
457,-0.31213
458,-0.31213
459,0.078033
460,-0.31213
461,-0.31213
462,-0.31213
463,-0.31213
464,-0.31213
465,0.078033
466,-0.31213
467,-0.31213
468,-0.31213
469,-0.31213
470,-0.31213
471,0.078033
472,-0.31213
473,-0.31213
474,-0.31213
475,-0.31213
476,-0.31213
477,0.078033
478,-0.31213
479,-0.31213
480,-0.31213
481,-0.31213
482,0.078033
483,-0.31213
484,-0.31213
485,-0.31213
486,-0.31213
487,-0.31213
488,0.078033
489,-0.31213
490,-0.31213
491,-0.31213
492,-0.31213
493,-0.31213
494,0.078033
495,-0.31213
496,-0.31213
497,-0.31213
498,-0.31213
499,-0.31213
500,0.078033
501,-0.31213
502,-0.31213
503,-0.31213
504,-0.31213
505,0.078033
506,-0.31213
507,-0.31213
508,-0.31213
509,-0.31213
510,0.078033
511,-0.31213
512,-0.31213
513,-0.31213
514,2.8092
515,3.5895
516,3.5895
517,4.3698
518,3.5895
519,3.5895
520,3.5895
521,3.5895
522,4.3698
523,3.5895
524,3.5895
525,3.5895
526,3.5895
527,3.5895
528,0.078033
529,-0.31213
530,-0.31213
531,-0.31213
532,-0.31213
533,0.078033
534,-0.31213
535,-0.31213
536,-0.31213
537,-0.31213
538,0.078033
539,-0.31213
540,-0.31213
541,-0.31213
542,-0.31213
543,-0.31213
544,0.078033
545,-0.31213
546,-0.31213
547,-0.31213
548,-0.31213
549,0.078033
550,-0.31213
551,-0.31213
552,-0.31213
553,-0.31213
554,-0.31213
555,0.078033
556,-0.31213
557,-0.31213
558,-0.31213
559,-0.31213
560,0.078033
561,-0.31213
562,-0.31213
563,-0.31213
564,-0.31213
565,0.078033
566,-0.31213
567,-0.31213
568,-0.31213
569,0.078033
570,-0.31213
571,-0.31213
572,-0.31213
573,-0.31213
574,0.078033
575,-0.31213
576,-0.31213
577,-0.31213
578,-0.31213
579,0.078033
580,-0.31213
581,-0.31213
582,-0.31213
583,0.078033
584,-0.31213
585,-0.31213
586,-0.31213
587,0.078033
588,-0.31213
589,-0.31213
590,-0.31213
591,-0.31213
592,0.078033
593,-0.31213
594,-0.31213
595,-0.31213
596,-0.31213
597,-0.31213
598,0.078033
599,-0.31213
600,-0.31213
601,-0.31213
602,-0.31213
603,0.078033
604,-0.31213
605,-0.31213
606,-0.31213
607,-0.31213
608,0.078033
609,-0.31213
610,-0.31213
611,-0.31213
612,-0.31213
613,-0.31213
614,0.078033
615,-0.31213
616,-0.31213
617,-0.31213
618,-0.31213
619,0.078033
620,-0.31213
621,-0.31213
622,-0.31213
623,-0.31213
624,0.078033
625,-0.31213
626,-0.31213
627,-0.31213
628,-0.31213
629,-0.31213
630,0.078033
631,-0.31213
632,-0.31213
633,-0.31213
634,-0.31213
635,-0.31213
636,0.078033
637,-0.31213
638,-0.31213
639,-0.31213
640,-0.31213
641,0.078033
642,-0.31213
643,-0.31213
644,-0.31213
645,-0.31213
646,0.078033
647,-0.31213
648,-0.31213
649,-0.31213
650,-0.31213
651,0.078033
652,-0.31213
653,-0.31213
654,-0.31213
655,-0.31213
656,0.078033
657,-0.31213
658,-0.31213
659,-0.31213
660,-0.31213
661,-0.31213
662,0.078033
663,-0.31213
664,-0.31213
665,-0.31213
666,-0.31213
667,0.078033
668,-0.31213
669,-0.31213
670,-0.31213
671,-0.31213
672,-0.31213
673,0.078033
674,-0.31213
675,-0.31213
676,-0.31213
677,-0.31213
678,-0.31213
679,0.078033
680,-0.31213
681,-0.31213
682,-0.31213
683,-0.31213
684,-0.31213
685,0.078033
686,-0.31213
687,-0.31213
688,-0.31213
689,-0.31213
690,0.078033
691,-0.31213
692,-0.31213
693,-0.31213
694,-0.31213
695,0.078033
696,-0.31213
697,-0.31213
698,-0.31213
699,-0.31213
700,-0.31213
701,-0.31213
702,-0.31213
703,-0.31213
704,-0.31213
705,-0.31213
706,-0.31213
707,-0.31213
708,-0.31213
709,-0.31213
710,-0.31213
711,-0.31213
712,-0.31213
713,-0.31213
714,-0.31213
715,-0.31213
716,-0.31213
717,-0.31213
718,-0.31213
719,-0.31213
