d3mIndex,type,repeat,fold
0,TEST,0,0
1,TEST,0,0
2,TEST,0,0
3,TEST,0,0
4,TEST,0,0
5,TRAIN,0,0
6,TEST,0,0
7,TEST,0,0
8,TRAIN,0,0
9,TRAIN,0,0
10,TEST,0,0
11,TEST,0,0
12,TEST,0,0
13,TEST,0,0
14,TEST,0,0
15,TEST,0,0
16,TEST,0,0
17,TRAIN,0,0
18,TEST,0,0
19,TEST,0,0
20,TEST,0,0
21,TEST,0,0
22,TEST,0,0
23,TEST,0,0
24,TEST,0,0
25,TEST,0,0
26,TEST,0,0
27,TEST,0,0
28,TRAIN,0,0
29,TEST,0,0
30,TEST,0,0
31,TEST,0,0
32,TEST,0,0
33,TEST,0,0
34,TRAIN,0,0
35,TEST,0,0
36,TEST,0,0
37,TRAIN,0,0
38,TEST,0,0
39,TRAIN,0,0
40,TEST,0,0
41,TEST,0,0
42,TEST,0,0
43,TEST,0,0
44,TEST,0,0
45,TEST,0,0
46,TEST,0,0
47,TRAIN,0,0
48,TRAIN,0,0
49,TEST,0,0
50,TEST,0,0
51,TEST,0,0
52,TEST,0,0
53,TEST,0,0
54,TEST,0,0
55,TEST,0,0
56,TEST,0,0
57,TEST,0,0
58,TEST,0,0
59,TEST,0,0
60,TEST,0,0
61,TEST,0,0
62,TEST,0,0
63,TEST,0,0
64,TEST,0,0
65,TEST,0,0
66,TEST,0,0
67,TEST,0,0
68,TRAIN,0,0
69,TEST,0,0
70,TEST,0,0
71,TRAIN,0,0
72,TEST,0,0
73,TRAIN,0,0
74,TEST,0,0
75,TRAIN,0,0
76,TEST,0,0
77,TEST,0,0
78,TRAIN,0,0
79,TEST,0,0
80,TEST,0,0
81,TEST,0,0
82,TEST,0,0
83,TEST,0,0
84,TRAIN,0,0
85,TEST,0,0
86,TEST,0,0
87,TRAIN,0,0
88,TEST,0,0
89,TEST,0,0
90,TRAIN,0,0
91,TEST,0,0
92,TEST,0,0
93,TEST,0,0
94,TEST,0,0
95,TEST,0,0
96,TEST,0,0
97,TEST,0,0
98,TEST,0,0
99,TEST,0,0
100,TEST,0,0
101,TEST,0,0
102,TEST,0,0
103,TEST,0,0
104,TEST,0,0
105,TEST,0,0
106,TEST,0,0
107,TEST,0,0
108,TEST,0,0
109,TRAIN,0,0
110,TRAIN,0,0
111,TEST,0,0
112,TRAIN,0,0
113,TEST,0,0
114,TEST,0,0
115,TEST,0,0
116,TEST,0,0
117,TRAIN,0,0
118,TEST,0,0
119,TRAIN,0,0
120,TEST,0,0
121,TEST,0,0
122,TRAIN,0,0
123,TRAIN,0,0
124,TEST,0,0
125,TEST,0,0
126,TRAIN,0,0
127,TEST,0,0
128,TEST,0,0
129,TEST,0,0
130,TEST,0,0
131,TRAIN,0,0
132,TRAIN,0,0
133,TEST,0,0
134,TRAIN,0,0
135,TEST,0,0
136,TEST,0,0
137,TEST,0,0
138,TEST,0,0
139,TEST,0,0
140,TEST,0,0
141,TEST,0,0
142,TEST,0,0
143,TEST,0,0
144,TEST,0,0
145,TEST,0,0
146,TRAIN,0,0
147,TEST,0,0
148,TRAIN,0,0
149,TEST,0,0
150,TEST,0,0
151,TEST,0,0
152,TEST,0,0
153,TEST,0,0
154,TEST,0,0
155,TEST,0,0
156,TEST,0,0
157,TEST,0,0
158,TEST,0,0
159,TEST,0,0
160,TEST,0,0
161,TEST,0,0
162,TEST,0,0
163,TEST,0,0
164,TEST,0,0
165,TEST,0,0
166,TEST,0,0
167,TRAIN,0,0
168,TEST,0,0
169,TRAIN,0,0
170,TEST,0,0
171,TEST,0,0
172,TRAIN,0,0
173,TEST,0,0
174,TRAIN,0,0
175,TEST,0,0
176,TEST,0,0
177,TEST,0,0
178,TRAIN,0,0
179,TEST,0,0
180,TRAIN,0,0
181,TEST,0,0
182,TEST,0,0
183,TEST,0,0
184,TEST,0,0
185,TRAIN,0,0
186,TEST,0,0
187,TRAIN,0,0
188,TEST,0,0
189,TEST,0,0
190,TEST,0,0
191,TEST,0,0
192,TEST,0,0
193,TEST,0,0
194,TEST,0,0
195,TRAIN,0,0
196,TEST,0,0
197,TEST,0,0
198,TEST,0,0
199,TEST,0,0
200,TEST,0,0
201,TEST,0,0
202,TEST,0,0
203,TEST,0,0
204,TEST,0,0
205,TEST,0,0
206,TEST,0,0
207,TEST,0,0
208,TRAIN,0,0
209,TEST,0,0
210,TRAIN,0,0
211,TEST,0,0
212,TEST,0,0
213,TEST,0,0
214,TRAIN,0,0
215,TRAIN,0,0
216,TEST,0,0
217,TRAIN,0,0
218,TEST,0,0
219,TEST,0,0
220,TEST,0,0
221,TRAIN,0,0
222,TRAIN,0,0
223,TRAIN,0,0
224,TEST,0,0
225,TEST,0,0
226,TEST,0,0
227,TEST,0,0
228,TEST,0,0
229,TEST,0,0
230,TEST,0,0
231,TEST,0,0
232,TEST,0,0
233,TEST,0,0
234,TEST,0,0
235,TRAIN,0,0
236,TEST,0,0
237,TEST,0,0
238,TEST,0,0
239,TEST,0,0
240,TEST,0,0
241,TEST,0,0
242,TEST,0,0
243,TEST,0,0
244,TEST,0,0
245,TEST,0,0
246,TEST,0,0
247,TEST,0,0
