time,value
0,1.84
1,1.6881
2,1.5289
3,1.3505
4,1.2231
5,1.1053
6,0.9868
7,0.8491299999999999
8,0.72233
9,0.57419
10,0.53076
11,0.4081
12,0.31771
13,0.20351
14,0.16146
15,0.047466
16,-0.0796
17,-0.22175999999999998
18,-0.17765
19,-0.27826999999999996
20,-0.36919
21,-0.46142
22,-0.58717
23,-0.64857
24,-0.68717
25,-0.75364
26,-0.83699
27,-0.9325700000000001
28,-1.0825
29,-1.1289
30,-1.161
31,-1.2088
32,-1.2699
33,-1.3496
34,-1.4321
35,-1.4906
36,-1.4868
37,-1.4499
38,-1.3933
39,-1.361
40,-1.3276
41,-1.2664
42,-1.2058
43,-1.0961
44,-0.94494
45,-0.81142
46,-0.64695
47,-0.5061100000000001
48,-0.32284
49,-0.15642999999999999
50,0.046237
51,0.25685
52,0.43909
53,0.6502100000000001
54,0.86069
55,1.0417
56,1.2524
57,1.4633
58,1.6444
59,1.8556
60,2.0667
61,2.248
62,2.1921
63,1.9799
64,1.798
65,1.5879
66,1.3781
67,1.1973
68,0.98635
69,0.7770100000000001
70,0.59816
71,0.40687
72,0.22294
73,0.072851
74,-0.082368
75,-0.22045
76,-0.3237
77,-0.43865
78,-0.55072
79,-0.65558
80,-0.73866
81,-0.82319
82,-0.9127799999999999
83,-0.96806
84,-0.9799899999999999
85,-0.96985
86,-0.97834
87,-0.9852200000000001
88,-1.0034
89,-1.0271
90,-1.0753
91,-1.0490000000000002
92,-1.0053
93,-0.95026
94,-0.8808
95,-0.86177
96,-0.88587
97,-0.89471
98,-0.81255
99,-0.7111
100,-0.59936
101,-0.5190600000000001
102,-0.44206999999999996
103,-0.45377
104,-0.41841000000000006
105,-0.3296
106,-0.27305
107,-0.18392
108,-0.18286
109,-0.10272
110,-0.033186
111,0.11877
112,0.16863
113,0.2193
114,0.29503
115,0.38206999999999997
116,0.47258
117,0.55198
118,0.60593
119,0.7606
120,0.86739
121,0.9809
122,1.0733
123,1.2023
124,1.3099
125,1.4471
126,1.6344
127,1.8055
