time,value
0,2.1537
1,2.0904
2,1.8625
3,1.6099
4,1.4528
5,1.262
6,1.0932
7,0.94357
8,0.77088
9,0.58783
10,0.52708
11,0.3621
12,0.20282999999999998
13,0.11074
14,-0.040349
15,-0.13078
16,-0.25647
17,-0.35033000000000003
18,-0.52477
19,-0.62139
20,-0.65456
21,-0.7500899999999999
22,-0.8336399999999999
23,-0.9611700000000001
24,-0.97893
25,-1.0336
26,-1.1759
27,-1.1923
28,-1.2235
29,-1.3329
30,-1.3317
31,-1.3719
32,-1.3649
33,-1.3406
34,-1.222
35,-1.2553
36,-1.1694
37,-1.1611
38,-1.0078
39,-0.9895299999999999
40,-0.88334
41,-0.80629
42,-0.63066
43,-0.55977
44,-0.42146000000000006
45,-0.38579
46,-0.24959
47,-0.049388
48,0.040242
49,0.14192000000000002
50,0.28565
51,0.4186
52,0.6079100000000001
53,0.8719100000000001
54,1.1111
55,1.3479
56,1.56
57,1.5929
58,1.3954
59,1.2902
60,1.3711
61,1.3667
62,1.3711
63,1.2878
64,1.281
65,1.2138
66,1.2218
67,1.14
68,1.0666
69,0.9822299999999999
70,0.9172899999999999
71,0.8719100000000001
72,0.7105899999999999
73,0.6260600000000001
74,0.58008
75,0.39888
76,0.34963
77,0.19294
78,0.10350999999999999
79,0.027404
80,-0.12678
81,-0.17499
82,-0.25998000000000004
83,-0.35958
84,-0.44864
85,-0.5263800000000001
86,-0.5756899999999999
87,-0.6262300000000001
88,-0.7749699999999999
89,-0.8025
90,-0.8465799999999999
91,-1.0253
92,-1.0478
93,-1.1139
94,-1.2608
95,-1.2648
96,-1.2215
97,-1.2129
98,-1.1772
99,-1.0881
100,-1.1539
101,-1.1174
102,-1.1266
103,-1.146
104,-1.0166
105,-1.0754
106,-1.0078
107,-0.8649100000000001
108,-0.78769
109,-0.65288
110,-0.5633
111,-0.43562
112,-0.25936
113,-0.15417
114,-0.0021550000000000002
115,0.057916999999999996
116,0.22275999999999999
117,0.32349
118,0.46648999999999996
119,0.6469
120,0.8329
121,0.86665
122,1.0289
123,1.1963
124,1.4267
125,1.6979
126,1.9017
127,2.1174
