time,value
0,0.5965199999999999
1,0.74598
2,0.89086
3,1.0291
4,1.1585
5,1.2772
6,1.3832
7,1.4749
8,1.5508
9,1.6097
10,1.6506
11,1.673
12,1.6766
13,1.6617
14,1.6287
15,1.5785
16,1.5124
17,1.4319
18,1.3391
19,1.236
20,1.125
21,1.0086
22,0.8895799999999999
23,0.77051
24,0.6540600000000001
25,0.54275
26,0.43896
27,0.34485
28,0.26227
29,0.19277
30,0.1375
31,0.097224
32,0.072274
33,0.062551
34,0.067503
35,0.086203
36,0.11732000000000001
37,0.15916
38,0.20974
39,0.26681
40,0.32795
41,0.39061
42,0.45218
43,0.5100899999999999
44,0.56186
45,0.60518
46,0.63795
47,0.65837
48,0.66496
49,0.65663
50,0.63265
51,0.59275
52,0.53708
53,0.46618000000000004
54,0.38101999999999997
55,0.2829
56,0.17347
57,0.054662999999999996
58,-0.071393
59,-0.20239000000000001
60,-0.33592
61,-0.46957
62,-0.60095
63,-0.72777
64,-0.8479
65,-0.9594299999999999
66,-1.0607
67,-1.1505
68,-1.2276
69,-1.2914
70,-1.3417
71,-1.3784
72,-1.4019
73,-1.4129
74,-1.4124
75,-1.4015
76,-1.3818
77,-1.3546
78,-1.3218
79,-1.285
80,-1.2458
81,-1.206
82,-1.1671
83,-1.1303
84,-1.097
85,-1.0681
86,-1.0444
87,-1.0264
88,-1.0144
89,-1.0083
90,-1.008
91,-1.0131
92,-1.023
93,-1.0369
94,-1.054
95,-1.0733
96,-1.0939
97,-1.1147
98,-1.1347
