time,value
0,0.39373
1,0.39373
2,0.39373
3,0.39373
4,0.39373
5,0.39373
6,0.39373
7,0.39373
8,0.39373
9,0.39373
10,0.39373
11,0.39373
12,0.39373
13,0.39373
14,0.39373
15,0.39678
16,0.40948
17,0.48775
18,0.54001
19,0.54592
20,0.5483100000000001
21,0.5483100000000001
22,0.63754
23,0.74967
24,0.9283799999999999
25,1.091
26,1.2168
27,1.2959
28,1.335
29,1.3615
30,1.3837
31,1.3411
32,1.2897
33,1.2114
34,1.0782
35,0.88621
36,0.76325
37,0.66725
38,0.66999
39,0.688
40,0.75102
41,0.80415
42,0.84403
43,0.8574700000000001
44,0.8574700000000001
45,0.8574700000000001
46,0.8574700000000001
47,0.8574700000000001
48,0.8574700000000001
49,0.8574700000000001
50,0.8574700000000001
51,0.8574700000000001
52,0.7691
53,0.66088
54,0.5131899999999999
55,0.38687
56,0.30712
57,0.24973
58,0.21059
59,0.18423
60,0.16133
61,0.1382
62,0.48548
63,0.094108
64,-0.29727
65,-0.13402
66,-0.21229
67,-0.29057
68,-0.47516
69,-0.66496
70,-0.86065
71,-1.0324
72,-1.1734
73,-1.2985
74,-1.416
75,-1.5497
76,-1.6921
77,-1.8752
78,-2.0649
79,-2.2653
80,-2.3829
81,-2.4494
82,-2.4257
83,-2.3865
84,-2.3474
85,-2.3082
86,-2.2691
87,-2.2789
88,-2.3269
89,-2.3796
90,-2.4324
91,-2.4518
92,-2.4539
93,-2.4088
94,-2.322
95,-2.1942
96,-2.0409
97,-1.8787
98,-1.6847
99,-1.4982
100,-1.3416
101,-1.2009999999999998
102,-1.0799
103,-0.9613200000000001
104,-0.84391
105,-0.72649
106,-0.6057100000000001
107,-0.46688999999999997
108,-0.31451
109,-0.14122
110,0.21226
111,0.24185
112,0.43754
113,0.63268
114,0.82295
115,0.98866
116,1.1061
117,1.2022
118,1.2824
119,1.3348
120,1.379
121,1.3904
122,1.392
123,1.3689
124,1.3375
125,1.2983
126,1.2488
127,1.1959
128,1.1269
129,1.0645
130,1.0253
131,0.9862
132,0.9470700000000001
133,0.88084
134,0.80281
135,0.75646
136,0.7182
137,0.7086
138,0.6928300000000001
139,0.66797
140,0.60811
141,0.52861
142,0.42946999999999996
143,0.33021999999999996
144,0.25194
145,0.17581
146,0.49988999999999995
147,0.23995999999999998
148,0.31806999999999996
149,0.092389
150,0.15800999999999998
151,-0.17198
152,-0.31068
153,-0.35006
154,-0.29846
155,-0.16554000000000002
156,0.07597899999999999
157,0.21103000000000002
158,0.32056
159,0.37463
160,0.2491
161,0.085013
162,-0.3353
163,-0.10482000000000001
164,-0.13435999999999998
165,-0.32927
166,-0.0733
167,-0.43513999999999997
168,-0.13071
169,-0.14302
170,-0.1842
171,-0.24081999999999998
172,-0.31666
173,-0.39493
174,-0.47321
175,-0.53608
176,-0.57153
177,-0.55684
178,-0.5081100000000001
179,-0.44299999999999995
180,-0.37916
181,-0.37892
182,-0.36687
183,-0.32774000000000003
184,-0.32603000000000004
185,-0.35631
186,-0.41673999999999994
187,-0.48658
188,-0.61556
189,-0.73602
190,-0.83054
191,-0.86739
192,-0.8425299999999999
193,-0.73483
194,-0.59477
195,-0.39523
196,-0.18782000000000001
197,0.18692999999999999
198,0.22241
199,0.33981999999999996
200,0.45723
201,0.5746399999999999
202,0.66351
203,0.7481800000000001
204,0.82645
205,0.8964200000000001
206,0.9523
207,0.9872700000000001
208,1.0087
209,1.045
210,1.0897
211,1.1987
212,1.2981
213,1.3763
214,1.4546
215,1.5329
216,1.6112
217,1.6887
218,1.7335
219,1.7619
220,1.7435
221,1.7029
222,1.6396
223,1.5654
224,1.4871
225,1.4088
226,1.3326
227,1.2644
228,1.2137
229,1.1854
230,1.2021
231,1.2405
232,1.2439
233,1.2336
234,1.1632
235,1.0665
236,0.92719
237,0.77722
238,0.6206699999999999
239,0.46412
240,0.30906
241,0.16899999999999998
242,0.18228
243,-0.34571
244,-0.14765999999999999
245,-0.21166
246,-0.2246
247,-0.2246
248,-0.2246
249,-0.2246
250,-0.2246
251,-0.25721
252,-0.3217
253,-0.39641
254,-0.47468999999999995
255,-0.55296
256,-0.6312399999999999
257,-0.7095100000000001
258,-0.78779
259,-0.86606
260,-0.93219
261,-0.99274
262,-1.0014
263,-1.011
264,-1.0502
265,-1.0589
266,-1.0208
267,-1.0034
268,-0.9982
269,-0.9975
270,-1.0025
271,-1.0517
272,-1.0973
273,-1.1357
274,-1.1608
275,-1.1761
276,-1.2021
277,-1.2294
278,-1.2294
279,-1.229
280,-1.2278
281,-1.207
282,-1.1678
283,-1.1287
284,-1.0896
285,-1.0198
286,-0.9537
287,-0.90176
288,-0.8357600000000001
289,-0.75331
290,-0.65833
291,-0.5579
292,-0.47813
293,-0.39986
294,-0.32158000000000003
295,-0.24331
296,-0.16502999999999998
297,-0.45233999999999996
298,-0.060965
299,0.16646
300,0.36979
301,0.11681
302,0.15595
303,0.19508
304,0.23421999999999998
305,0.27336
306,0.29715
307,0.31722
308,0.33125
309,0.34989000000000003
310,0.37967
311,0.39373
312,0.39373
313,0.39373
314,0.39373
315,0.46411
316,0.46411
317,0.46411
318,0.46411
319,0.46411
320,0.46411
321,0.46411
322,0.46411
323,0.46411
324,0.46411
325,0.46411
326,0.46411
327,0.46411
328,0.46411
329,0.46411
330,0.46626000000000006
331,0.47517
332,0.53015
333,0.56686
334,0.57101
335,0.57268
336,0.57268
337,0.63536
338,0.71727
339,0.8894700000000001
340,1.0687
341,1.2641
342,1.4333
343,1.5803
344,1.6809
345,1.767
346,1.767
347,1.767
348,1.767
349,1.7928
350,1.8459999999999999
351,1.8669
352,1.8752
353,1.8756
354,1.8692
355,1.8357
356,1.7930000000000001
357,1.7380000000000002
358,1.683
359,1.6280000000000001
360,1.5731
361,1.5181
362,1.4631
363,1.4079
364,1.3522
365,1.2636
366,1.1536
367,1.0436
368,0.9336899999999999
369,0.82373
370,0.70245
371,0.55653
372,0.41631999999999997
373,0.28076999999999996
374,0.14739000000000002
375,0.31294
376,-0.15105
377,-0.31349
378,-0.46875
379,-0.6000800000000001
380,-0.7069300000000001
381,-0.77589
382,-0.8308700000000001
383,-0.9356399999999999
384,-1.0247
385,-1.0447
386,-1.056
387,-1.056
388,-1.056
389,-1.056
390,-1.056
391,-1.0587
392,-1.0774
393,-1.1099
394,-1.1649
395,-1.2199
396,-1.2749
397,-1.3298
398,-1.38
399,-1.381
400,-1.3663
401,-1.3189
402,-1.2673
403,-1.2123
404,-1.1573
405,-1.1033
406,-1.0759
407,-1.056
408,-1.056
409,-1.0633
410,-1.0778
411,-1.1224
412,-1.1774
413,-1.2309999999999999
414,-1.2731
415,-1.2731
416,-1.2508
417,-1.2009999999999998
418,-1.1476
419,-1.0926
420,-1.0377
421,-0.98741
422,-0.9625100000000001
423,-0.95665
424,-0.9801700000000001
425,-1.0235
426,-1.0785
427,-1.1334
428,-1.188
429,-1.2392
430,-1.2731
431,-1.2731
432,-1.2731
433,-1.2731
434,-1.3101
435,-1.3544
436,-1.3703
437,-1.3726
438,-1.3401
439,-1.3094
440,-1.2803
441,-1.2731
442,-1.2731
443,-1.2858
444,-1.3067
445,-1.3554
446,-1.3817
447,-1.3817
448,-1.4198
449,-1.4744
450,-1.4397
451,-1.3892
452,-1.2928
453,-1.205
454,-1.1299
455,-1.0677
456,-1.0128
457,-0.9768700000000001
458,-0.9474
459,-0.9474
460,-0.9534299999999999
461,-0.97072
462,-1.0409
463,-1.1488
464,-1.2133
465,-1.2655
466,-1.27
467,-1.2603
468,-1.2164
469,-1.1272
470,-0.9975200000000001
471,-0.86441
472,-0.73025
473,-0.6687
474,-0.62583
475,-0.64347
476,-0.67873
477,-0.7337100000000001
478,-0.78551
479,-0.83599
480,-0.83883
481,-0.83883
482,-0.83883
483,-0.8003
484,-0.70763
485,-0.60369
486,-0.49373
487,-0.38377
488,-0.28039000000000003
489,-0.22368000000000002
490,-0.19457
491,-0.21463000000000002
492,-0.26350999999999997
493,-0.33198
494,-0.4292
495,-0.52898
496,-0.5836100000000001
497,-0.62167
498,-0.62167
499,-0.59538
500,-0.54662
501,-0.49304
502,-0.43846
503,-0.41908999999999996
504,-0.40452
505,-0.40452
506,-0.41538
507,-0.43785
508,-0.47226
509,-0.51134
510,-0.5130899999999999
511,-0.51256
512,-0.5098
513,-0.48473999999999995
514,-0.42976000000000003
515,-0.4087
516,-0.4049
517,-0.40452
518,-0.40452
519,-0.40452
520,-0.40452
521,-0.40452
522,-0.40452
523,-0.40452
524,-0.40452
525,-0.40359
526,-0.39183
527,-0.36811
528,-0.31832
529,-0.29594000000000004
530,-0.29594000000000004
531,-0.25378
532,-0.1991
533,-0.09709
534,0.082416
535,0.11692999999999999
536,0.21014000000000002
537,0.28622
538,0.36683000000000004
539,0.44913000000000003
540,0.5381100000000001
541,0.6204
542,0.67538
543,0.73036
544,0.7853399999999999
545,0.8403200000000001
546,0.8953
547,0.95029
548,1.0053
549,1.0602
550,1.0988
551,1.1109
552,1.138
553,1.1743
554,1.2266
555,1.2816
556,1.3365
557,1.3861
558,1.4245
559,1.4469
560,1.4569999999999999
561,1.5029
562,1.5578
563,1.6128
564,1.6538
565,1.6569
566,1.6356
567,1.5903
568,1.5378
569,1.4828
570,1.4593
571,1.4358
572,1.4103
573,1.38
574,1.344
575,1.3242
576,1.3117
577,1.2601
578,1.2051
579,1.1502
580,1.1165
581,1.1158
582,1.1156
583,1.1156
584,1.1156
585,1.1121
586,1.0775
587,1.036
588,0.98106
589,0.93837
590,0.9048200000000001
591,0.88639
592,0.86972
593,0.8147399999999999
594,0.7602399999999999
595,0.70699
596,0.6812600000000001
597,0.6812600000000001
598,0.64352
599,0.59338
600,0.53845
601,0.48346999999999996
602,0.42849
603,0.38753000000000004
604,0.36298
605,0.35553
606,0.35553
607,0.35553
608,0.35553
609,0.35553
610,0.35553
611,0.35553
612,0.35553
613,0.35553
614,0.35553
615,0.35553
616,0.35553
617,0.35553
618,0.35553
619,0.33634000000000003
620,0.30349
621,0.25248000000000004
622,0.19860999999999998
623,0.16334
624,0.13452999999999998
625,0.12139000000000001
626,0.42958
627,0.18753
628,0.13042
629,0.13042
630,2.2483
631,2.2483
632,2.2483
633,2.2483
634,2.2483
635,2.2483
636,2.2483
637,2.2483
638,2.2483
639,2.2483
640,2.2483
641,2.2483
642,2.2483
643,2.2483
644,2.2483
645,2.2512
646,2.2634
647,2.3388
648,2.3891
649,2.3947
650,2.397
651,2.397
652,2.4257
653,2.4573
654,2.4507
655,2.4172
656,2.3222
657,2.2015
658,2.0591
659,1.9338
660,1.8137
661,1.7132
662,1.6128
663,1.5123
664,1.3884
665,1.2393
666,1.0738
667,0.9017700000000001
668,0.74366
669,0.58457
670,0.41858999999999996
671,0.25895
672,0.10780999999999999
673,-0.1504
674,-0.15192
675,-0.27747
676,-0.40347
677,-0.5323399999999999
678,-0.66918
679,-0.81953
680,-0.95483
681,-1.0804
682,-1.187
683,-1.2869
684,-1.3485
685,-1.4013
686,-1.4351
687,-1.4715
688,-1.5101
689,-1.5414
690,-1.5701
691,-1.5701
692,-1.5678
693,-1.5590000000000002
694,-1.5297
695,-1.4795
696,-1.4292
697,-1.379
698,-1.3061
699,-1.2445
700,-1.2307
701,-1.2229999999999999
702,-1.2229999999999999
703,-1.2229999999999999
704,-1.2229999999999999
705,-1.202
706,-1.1725
707,-1.1052
708,-1.021
709,-0.90954
710,-0.7832100000000001
711,-0.64771
712,-0.62792
713,-0.6257
714,-0.60107
715,-0.59038
716,-0.60854
717,-0.6201300000000001
718,-0.62661
719,-0.62792
720,-0.62749
721,-0.6148600000000001
722,-0.5988600000000001
723,-0.57375
724,-0.55199
725,-0.53351
726,-0.52066
727,-0.50976
728,-0.43711000000000005
729,-0.37349
730,-0.34838
731,-0.33349
732,-0.33111999999999997
733,-0.34391
734,-0.36365
735,-0.40376
736,-0.44693
737,-0.49715
738,-0.5347
739,-0.55271
740,-0.53871
741,-0.5058699999999999
742,-0.46208999999999995
743,-0.41901000000000005
744,-0.39738
745,-0.3915
746,-0.41661000000000004
747,-0.45538
748,-0.50434
749,-0.57119
750,-0.64165
751,-0.69913
752,-0.75041
753,-0.78578
754,-0.8097300000000001
755,-0.823
756,-0.8196200000000001
757,-0.81077
758,-0.79162
759,-0.77733
760,-0.78017
761,-0.79327
762,-0.81838
763,-0.84349
764,-0.8686
765,-0.9141799999999999
766,-0.9649700000000001
767,-1.0341
768,-1.0865
769,-1.1139
770,-1.1238
771,-1.1238
772,-1.1151
773,-1.1034
774,-1.0783
775,-1.0546
776,-1.0334
777,-1.0241
778,-1.0231
779,-1.0024
780,-0.97726
781,-0.95214
782,-0.93289
783,-0.92784
784,-0.9254600000000001
785,-0.9254600000000001
786,-0.9147200000000001
787,-0.90066
788,-0.86449
789,-0.82121
790,-0.75488
791,-0.67484
792,-0.57945
793,-0.4968
794,-0.41941999999999996
795,-0.32027
796,-0.22416999999999998
797,-0.14789000000000002
798,-0.42258999999999997
799,-0.15175
800,0.16542
801,0.10518
802,0.17973
803,0.25356
804,0.31673
805,0.37195
806,0.41301000000000004
807,0.45191000000000003
808,0.48933999999999994
809,0.56091
810,0.64088
811,0.74132
812,0.84177
813,0.94221
814,1.0306
815,1.1088
816,1.1699
817,1.2258
818,1.2761
819,1.3197
820,1.3434
821,1.3557
822,1.3557
823,1.3504
824,1.3432
825,1.3148
826,1.2814
827,1.2312
828,1.181
829,1.1308
830,1.0496
831,0.9526
832,0.87082
833,0.7913899999999999
834,0.71606
835,0.63539
836,0.54569
837,0.46326999999999996
838,0.38556999999999997
839,0.32397
840,0.26533
841,0.20611
842,0.16552
843,0.16552
844,0.16552
845,0.16552
846,0.18477000000000002
847,0.2083
848,0.19045
849,0.17073
850,0.14562
851,0.11285
852,0.34278000000000003
853,0.15022
854,-0.28300000000000003
855,-0.16619
856,-0.29829
857,-0.45621999999999996
858,-0.12424
859,-0.16751
860,-0.18161
861,-0.18161
862,-0.18161
863,-0.18161
864,-0.18161
865,-0.18909
866,-0.20868
867,-0.23167
868,-0.25678
869,-0.2703
870,-0.28079
871,-0.28079
872,-0.28079
873,-0.28079
874,-0.28079
875,-0.28079
876,-0.27953
877,-0.27716
878,-0.25205
879,-0.22694
880,-0.20182999999999998
881,-0.17672000000000002
882,-0.1516
883,-0.12649000000000002
884,-0.10138
885,-0.10499000000000001
886,-0.1137
887,-0.13881
888,-0.15612
889,-0.16385
890,-0.15297
891,-0.13355
892,-0.12955
893,-0.12334
894,-0.098225
895,-0.43288000000000004
896,-0.43131
897,-0.43072
898,-0.43072
899,-0.43072
900,-0.4387
901,-0.09982200000000001
902,-0.11875999999999999
903,-0.14387
904,-0.15775999999999998
905,-0.16328
906,-0.14952000000000001
907,-0.13185
908,-0.12805999999999998
909,-0.1185
910,-0.48946999999999996
911,-0.43072
912,-0.43072
913,-0.34452
914,-0.23003
915,-0.1046
916,-0.12891
917,0.26058000000000003
918,0.065176
919,0.065176
920,0.15517
921,-0.20806
922,-0.11120999999999999
923,-0.1869
924,-0.21138
925,-0.27674
926,-0.40229000000000004
927,-0.10186
928,-0.12697
929,-0.15208
930,-0.17482999999999999
931,-0.17894000000000002
932,-0.18161
933,-0.18161
934,-0.18161
935,-0.18161
936,-0.18161
937,-0.18161
938,-0.18161
939,-0.17986
940,-0.17386
941,-0.15775999999999998
942,-0.13265
943,-0.10754000000000001
944,-0.43072
