time,value
0,3.1023
1,3.0901
2,3.0348
3,2.9377
4,2.8013
5,2.6287
6,2.424
7,2.1918
8,1.9374
9,1.6665
10,1.3849
11,1.0988
12,0.81419
13,0.53682
14,0.27221
15,0.025403
16,-0.19917
17,-0.39774
18,-0.56733
19,-0.70573
20,-0.81161
21,-0.88449
22,-0.9247299999999999
23,-0.9335
24,-0.9127200000000001
25,-0.8649600000000001
26,-0.79338
27,-0.70158
28,-0.59355
29,-0.47347
30,-0.34564
31,-0.21433000000000002
32,-0.083696
33,0.042373
34,0.1603
35,0.26698
36,0.35975999999999997
37,0.43655
38,0.49581000000000003
39,0.53662
40,0.55861
41,0.56199
42,0.54748
43,0.51627
44,0.46997
45,0.41052
46,0.34010999999999997
47,0.26113000000000003
48,0.17604
49,0.08732999999999999
50,-0.0026006000000000002
51,-0.09146599999999999
52,-0.17717
53,-0.25788
54,-0.33204
55,-0.39842
56,-0.45611999999999997
57,-0.50458
58,-0.54359
59,-0.57324
60,-0.5939
61,-0.60622
62,-0.61105
63,-0.60941
64,-0.60244
65,-0.59136
66,-0.57739
67,-0.56177
68,-0.54564
69,-0.53004
70,-0.5159
71,-0.5039600000000001
72,-0.49483999999999995
73,-0.48893000000000003
74,-0.48646000000000006
75,-0.48749
76,-0.49191
77,-0.49945
78,-0.50972
79,-0.52223
80,-0.5364300000000001
81,-0.55169
82,-0.56739
83,-0.5829
84,-0.59764
85,-0.6110800000000001
86,-0.62274
87,-0.63226
88,-0.63937
89,-0.6439
90,-0.64578
91,-0.6450600000000001
92,-0.6418699999999999
93,-0.63644
94,-0.62905
95,-0.62007
96,-0.6099
97,-0.5989399999999999
98,-0.58763
