time,value
0,1.9457
1,1.8465
2,1.5259
3,1.2498
4,0.9799899999999999
5,0.68377
6,0.43956999999999996
7,0.26944
8,0.10371
9,-0.080807
10,-0.14778
11,-0.11944
12,-0.30073
13,-0.44182
14,-0.55261
15,-0.3978
16,-0.09034500000000001
17,0.2903
18,0.16433
19,-0.060496
20,-0.25994
21,-0.47148
22,-0.51886
23,-0.6633899999999999
24,-0.65249
25,-0.81945
26,-0.7993600000000001
27,-0.8553200000000001
28,-0.8549899999999999
29,-0.9707100000000001
30,-1.0016
31,-1.1335
32,-1.3101
33,-1.1935
34,-1.2696
35,-1.2604
36,-1.2342
37,-1.2459
38,-1.224
39,-1.3233
40,-1.2375
41,-1.1156
42,-0.9703799999999999
43,-0.83429
44,-0.68307
45,-0.58053
46,-0.4752
47,-0.43225
48,-0.25754
49,-0.057916999999999996
50,0.11395
51,0.28246
52,0.48928
53,0.69744
54,0.91627
55,1.0854
56,1.2789
57,1.4928
58,1.6531
59,1.9205
60,2.1947
61,2.4639
62,2.545
63,2.273
64,2.0014
65,1.8819
66,1.6495
67,1.4167
68,1.1963
69,1.0837
70,1.1326
71,1.1054
72,0.9566600000000001
73,0.78713
74,0.62867
75,0.40196
76,0.24061
77,0.29657
78,0.2013
79,0.13003
80,0.2151
81,0.08092200000000001
82,-0.017932
83,-0.17119
84,-0.25792
85,-0.43513999999999997
86,-0.5764199999999999
87,-0.63744
88,-0.8043399999999999
89,-0.8737
90,-0.9920100000000001
91,-0.9602200000000001
92,-1.0957
93,-1.0359
94,-1.0733
95,-1.0919
96,-1.0868
97,-1.173
98,-1.1662
99,-1.1393
100,-1.1203
101,-1.0273
102,-0.85093
103,-0.7519399999999999
104,-0.63744
105,-0.8689600000000001
106,-0.7288600000000001
107,-0.61829
108,-0.5381
109,-0.34383
110,-0.5022399999999999
111,-0.35489
112,-0.48818999999999996
113,-0.35370999999999997
114,-0.47479
115,-0.23265
116,-0.19613
117,0.008668799999999999
118,-0.043941
119,0.098089
120,0.33799
121,0.44065
122,0.5544600000000001
123,0.82701
124,1.0998
125,1.3742
126,1.6531
127,1.9128
