time,value
0,3.0869
1,3.0869
2,3.0869
3,3.0869
4,-0.40112
5,3.0869
6,3.0869
7,3.0869
8,3.0869
9,-0.40112
10,3.0869
11,3.0869
12,3.0869
13,3.0869
14,-0.40112
15,3.0869
16,3.0869
17,3.0869
18,3.0869
19,-0.40112
20,3.0869
21,3.0869
22,3.0869
23,3.0869
24,-0.40112
25,3.0869
26,3.0869
27,3.0869
28,3.0869
29,-0.40112
30,3.0869
31,3.0869
32,3.0869
33,3.0869
34,-0.40112
35,3.0869
36,3.0869
37,3.0869
38,3.0869
39,-0.40112
40,3.0869
41,3.0869
42,3.0869
43,3.0869
44,-0.40112
45,2.7381
46,2.7381
47,2.7381
48,2.7381
49,-0.40112
50,3.0869
51,3.0869
52,3.0869
53,3.0869
54,-0.40112
55,3.0869
56,3.0869
57,3.0869
58,3.0869
59,-0.40112
60,3.0869
61,3.0869
62,3.0869
63,3.0869
64,-0.40112
65,3.0869
66,3.0869
67,3.0869
68,3.0869
69,-0.40112
70,3.0869
71,3.0869
72,3.0869
73,3.0869
74,-0.40112
75,3.0869
76,3.0869
77,3.0869
78,3.0869
79,-0.40112
80,2.7381
81,2.7381
82,2.7381
83,2.7381
84,-0.40112
85,-0.40112
86,-0.40112
87,-0.40112
88,-0.40112
89,-0.052320000000000005
90,-0.40112
91,-0.40112
92,-0.40112
93,-0.40112
94,-0.052320000000000005
95,-0.40112
96,-0.40112
97,-0.40112
98,-0.40112
99,0.29648
100,-0.40112
101,-0.40112
102,-0.40112
103,-0.40112
104,-0.052320000000000005
105,-0.40112
106,-0.40112
107,-0.40112
108,-0.40112
109,-0.052320000000000005
110,-0.40112
111,-0.40112
112,-0.40112
113,-0.40112
114,-0.052320000000000005
115,-0.40112
116,-0.40112
117,-0.40112
118,-0.40112
119,-0.052320000000000005
120,-0.40112
121,-0.40112
122,-0.40112
123,-0.40112
124,0.29648
125,-0.40112
126,-0.40112
127,-0.40112
128,-0.40112
129,-0.052320000000000005
130,-0.40112
131,-0.40112
132,-0.40112
133,-0.40112
134,-0.052320000000000005
135,-0.40112
136,-0.40112
137,-0.40112
138,-0.40112
139,-0.052320000000000005
140,-0.40112
141,-0.40112
142,-0.40112
143,-0.40112
144,0.29648
145,-0.40112
146,-0.40112
147,-0.40112
148,-0.40112
149,-0.052320000000000005
150,-0.40112
151,-0.40112
152,-0.40112
153,-0.40112
154,-0.052320000000000005
155,-0.40112
156,-0.40112
157,-0.40112
158,-0.40112
159,-0.052320000000000005
160,-0.40112
161,-0.40112
162,-0.40112
163,-0.40112
164,0.29648
165,-0.40112
166,-0.40112
167,-0.40112
168,-0.40112
169,-0.052320000000000005
170,-0.40112
171,-0.40112
172,-0.40112
173,-0.40112
174,-0.052320000000000005
175,-0.40112
176,-0.40112
177,-0.40112
178,-0.40112
179,-0.052320000000000005
180,-0.40112
181,-0.40112
182,-0.40112
183,-0.40112
184,-0.052320000000000005
185,-0.40112
186,-0.40112
187,-0.40112
188,-0.40112
189,0.29648
190,-0.40112
191,-0.40112
192,-0.40112
193,-0.40112
194,-0.052320000000000005
195,-0.40112
196,-0.40112
197,-0.40112
198,-0.40112
199,-0.052320000000000005
200,-0.40112
201,-0.40112
202,-0.40112
203,-0.40112
204,-0.052320000000000005
205,-0.40112
206,-0.40112
207,-0.40112
208,-0.40112
209,0.29648
210,-0.40112
211,-0.40112
212,-0.40112
213,-0.40112
214,-0.052320000000000005
215,-0.40112
216,-0.40112
217,-0.40112
218,-0.40112
219,-0.052320000000000005
220,-0.40112
221,-0.40112
222,-0.40112
223,-0.40112
224,-0.052320000000000005
225,-0.40112
226,-0.40112
227,-0.40112
228,-0.40112
229,0.29648
230,-0.40112
231,-0.40112
232,-0.40112
233,-0.40112
234,-0.052320000000000005
235,-0.40112
236,-0.40112
237,-0.40112
238,-0.40112
239,-0.052320000000000005
240,-0.40112
241,-0.40112
242,-0.40112
243,-0.40112
244,-0.052320000000000005
245,-0.40112
246,-0.40112
247,-0.40112
248,-0.40112
249,0.29648
250,-0.40112
251,-0.40112
252,-0.40112
253,-0.40112
254,-0.052320000000000005
255,-0.40112
256,-0.40112
257,-0.40112
258,-0.40112
259,-0.052320000000000005
260,-0.40112
261,-0.40112
262,-0.40112
263,-0.40112
264,-0.052320000000000005
265,-0.40112
266,-0.40112
267,-0.40112
268,-0.40112
269,-0.052320000000000005
270,-0.40112
271,-0.40112
272,-0.40112
273,-0.40112
274,0.29648
275,-0.40112
276,-0.40112
277,-0.40112
278,-0.40112
279,-0.052320000000000005
280,-0.40112
281,-0.40112
282,-0.40112
283,-0.40112
284,-0.052320000000000005
285,-0.40112
286,-0.40112
287,-0.40112
288,-0.40112
289,-0.052320000000000005
290,-0.40112
291,-0.40112
292,-0.40112
293,-0.40112
294,0.29648
295,-0.40112
296,-0.40112
297,-0.40112
298,-0.40112
299,-0.052320000000000005
300,-0.40112
301,-0.40112
302,-0.40112
303,-0.40112
304,-0.052320000000000005
305,-0.40112
306,-0.40112
307,-0.40112
308,-0.40112
309,-0.052320000000000005
310,-0.40112
311,-0.40112
312,-0.40112
313,-0.40112
314,0.29648
315,-0.40112
316,-0.40112
317,-0.40112
318,-0.40112
319,-0.052320000000000005
320,-0.40112
321,-0.40112
322,-0.40112
323,-0.40112
324,-0.052320000000000005
325,-0.40112
326,-0.40112
327,-0.40112
328,-0.40112
329,-0.052320000000000005
330,-0.40112
331,-0.40112
332,-0.40112
333,-0.40112
334,-0.052320000000000005
335,-0.40112
336,-0.40112
337,-0.40112
338,-0.40112
339,0.29648
340,-0.40112
341,-0.40112
342,-0.40112
343,-0.40112
344,-0.052320000000000005
345,-0.40112
346,-0.40112
347,-0.40112
348,-0.40112
349,-0.052320000000000005
350,-0.40112
351,-0.40112
352,-0.40112
353,-0.40112
354,-0.052320000000000005
355,-0.40112
356,-0.40112
357,-0.40112
358,-0.40112
359,-0.052320000000000005
360,-0.40112
361,-0.40112
362,-0.40112
363,-0.40112
364,0.29648
365,-0.40112
366,-0.40112
367,-0.40112
368,-0.40112
369,-0.052320000000000005
370,-0.40112
371,-0.40112
372,-0.40112
373,-0.40112
374,-0.052320000000000005
375,-0.40112
376,-0.40112
377,-0.40112
378,-0.40112
379,-0.052320000000000005
380,-0.40112
381,-0.40112
382,-0.40112
383,-0.40112
384,-0.052320000000000005
385,-0.40112
386,-0.40112
387,-0.40112
388,-0.40112
389,0.29648
390,-0.40112
391,-0.40112
392,-0.40112
393,-0.40112
394,-0.052320000000000005
395,-0.40112
396,-0.40112
397,-0.40112
398,-0.40112
399,-0.052320000000000005
400,-0.40112
401,-0.40112
402,-0.40112
403,-0.40112
404,-0.052320000000000005
405,-0.40112
406,-0.40112
407,-0.40112
408,-0.40112
409,-0.052320000000000005
410,-0.40112
411,-0.40112
412,-0.40112
413,-0.40112
414,0.29648
415,-0.40112
416,-0.40112
417,-0.40112
418,-0.40112
419,-0.052320000000000005
420,-0.40112
421,-0.40112
422,-0.40112
423,-0.40112
424,-0.052320000000000005
425,-0.40112
426,-0.40112
427,-0.40112
428,-0.40112
429,-0.052320000000000005
430,-0.40112
431,-0.40112
432,-0.40112
433,-0.40112
434,-0.052320000000000005
435,-0.40112
436,-0.40112
437,-0.40112
438,-0.40112
439,0.29648
440,-0.40112
441,-0.40112
442,-0.40112
443,-0.40112
444,-0.052320000000000005
445,-0.40112
446,-0.40112
447,-0.40112
448,-0.40112
449,-0.052320000000000005
450,-0.40112
451,-0.40112
452,-0.40112
453,-0.40112
454,-0.052320000000000005
455,-0.40112
456,-0.40112
457,-0.40112
458,-0.40112
459,0.29648
460,-0.40112
461,-0.40112
462,-0.40112
463,-0.40112
464,-0.052320000000000005
465,-0.40112
466,-0.40112
467,-0.40112
468,-0.40112
469,-0.052320000000000005
470,-0.40112
471,-0.40112
472,-0.40112
473,-0.40112
474,-0.052320000000000005
475,-0.40112
476,-0.40112
477,-0.40112
478,-0.40112
479,0.29648
480,-0.40112
481,-0.40112
482,-0.40112
483,-0.40112
484,-0.052320000000000005
485,-0.40112
486,-0.40112
487,-0.40112
488,-0.40112
489,-0.052320000000000005
490,-0.40112
491,-0.40112
492,-0.40112
493,-0.40112
494,-0.052320000000000005
495,-0.40112
496,-0.40112
497,-0.40112
498,-0.40112
499,0.29648
500,-0.40112
501,-0.40112
502,-0.40112
503,-0.40112
504,-0.052320000000000005
505,-0.40112
506,-0.40112
507,-0.40112
508,-0.40112
509,-0.052320000000000005
510,-0.40112
511,-0.40112
512,-0.40112
513,-0.40112
514,-0.052320000000000005
515,-0.40112
516,-0.40112
517,-0.40112
518,-0.40112
519,0.29648
520,-0.40112
521,-0.40112
522,-0.40112
523,-0.40112
524,-0.052320000000000005
525,-0.40112
526,-0.40112
527,-0.40112
528,-0.40112
529,-0.052320000000000005
530,-0.40112
531,-0.40112
532,-0.40112
533,-0.40112
534,-0.052320000000000005
535,-0.40112
536,-0.40112
537,-0.40112
538,-0.40112
539,0.29648
540,-0.40112
541,-0.40112
542,-0.40112
543,-0.40112
544,-0.052320000000000005
545,-0.40112
546,-0.40112
547,-0.40112
548,-0.40112
549,-0.052320000000000005
550,-0.40112
551,-0.40112
552,-0.40112
553,-0.40112
554,-0.052320000000000005
555,-0.40112
556,-0.40112
557,-0.40112
558,-0.40112
559,-0.052320000000000005
560,-0.40112
561,-0.40112
562,-0.40112
563,-0.40112
564,0.29648
565,-0.40112
566,-0.40112
567,-0.40112
568,-0.40112
569,-0.052320000000000005
570,-0.40112
571,-0.40112
572,-0.40112
573,-0.40112
574,-0.052320000000000005
575,-0.40112
576,-0.40112
577,-0.40112
578,-0.40112
579,-0.052320000000000005
580,-0.40112
581,-0.40112
582,-0.40112
583,-0.40112
584,0.29648
585,-0.40112
586,-0.40112
587,-0.40112
588,-0.40112
589,-0.052320000000000005
590,-0.40112
591,-0.40112
592,-0.40112
593,-0.40112
594,-0.052320000000000005
595,-0.40112
596,-0.40112
597,-0.40112
598,-0.40112
599,-0.052320000000000005
600,-0.40112
601,-0.40112
602,-0.40112
603,-0.40112
604,0.29648
605,-0.40112
606,-0.40112
607,-0.40112
608,-0.40112
609,-0.052320000000000005
610,-0.40112
611,-0.40112
612,-0.40112
613,-0.40112
614,-0.052320000000000005
615,-0.40112
616,-0.40112
617,-0.40112
618,-0.40112
619,-0.052320000000000005
620,-0.40112
621,-0.40112
622,-0.40112
623,-0.40112
624,0.29648
625,-0.40112
626,-0.40112
627,-0.40112
628,-0.40112
629,-0.052320000000000005
630,-0.40112
631,-0.40112
632,-0.40112
633,-0.40112
634,-0.052320000000000005
635,-0.40112
636,-0.40112
637,-0.40112
638,-0.40112
639,-0.052320000000000005
640,-0.40112
641,-0.40112
642,-0.40112
643,-0.40112
644,0.29648
645,-0.40112
646,-0.40112
647,-0.40112
648,-0.40112
649,-0.052320000000000005
650,-0.40112
651,-0.40112
652,-0.40112
653,-0.40112
654,-0.052320000000000005
655,-0.40112
656,-0.40112
657,-0.40112
658,-0.40112
659,-0.052320000000000005
660,-0.40112
661,-0.40112
662,-0.40112
663,-0.40112
664,0.29648
665,-0.40112
666,-0.40112
667,-0.40112
668,-0.40112
669,-0.052320000000000005
670,-0.40112
671,-0.40112
672,-0.40112
673,-0.40112
674,-0.052320000000000005
675,-0.40112
676,-0.40112
677,-0.40112
678,-0.40112
679,-0.052320000000000005
680,-0.40112
681,-0.40112
682,-0.40112
683,-0.40112
684,0.29648
685,-0.40112
686,-0.40112
687,-0.40112
688,-0.40112
689,-0.052320000000000005
690,-0.40112
691,-0.40112
692,-0.40112
693,-0.40112
694,-0.052320000000000005
695,-0.40112
696,-0.40112
697,-0.40112
698,-0.40112
699,-0.052320000000000005
700,-0.40112
701,-0.40112
702,-0.40112
703,-0.40112
704,-0.052320000000000005
705,-0.40112
706,-0.40112
707,-0.40112
708,-0.40112
709,0.29648
710,-0.40112
711,-0.40112
712,-0.40112
713,-0.40112
714,-0.052320000000000005
715,-0.40112
716,-0.40112
717,-0.40112
718,-0.40112
719,-0.052320000000000005
