time,value
0,1.5738
1,1.5813
2,1.5888
3,1.5962
4,1.6028
5,1.6083
6,1.6099
7,1.6099
8,1.6099
9,1.6099
10,1.6099
11,1.6099
12,1.6099
13,1.6099
14,1.6099
15,1.6099
16,1.6099
17,1.6099
18,1.6099
19,1.6099
20,1.6099
21,1.6099
22,1.6099
23,1.6099
24,1.6099
25,1.6099
26,1.6099
27,1.6099
28,1.6099
29,1.6099
30,1.6099
31,1.6099
32,1.6099
33,1.6099
34,1.6099
35,1.6099
36,1.6099
37,1.6099
38,1.6099
39,1.6099
40,1.6099
41,1.6099
42,1.6099
43,1.6099
44,1.6099
45,1.6099
46,1.6099
47,1.6099
48,1.6099
49,1.6099
50,1.6099
51,1.6099
52,1.6099
53,1.6094
54,1.6029
55,1.5959999999999999
56,1.5885
57,1.5805
58,1.5719999999999998
59,1.5584
60,1.5434
61,1.5285
62,1.5127
63,1.4948
64,1.4746
65,1.4522
66,1.4297
67,1.4073
68,1.3801
69,1.3522
70,1.3223
71,1.2923
72,1.2624
73,1.2278
74,1.1909999999999998
75,1.1537
76,1.1163
77,1.0789
78,1.0415
79,1.0041
80,0.9666799999999999
81,0.9292799999999999
82,0.8918799999999999
83,0.8544799999999999
84,0.81708
85,0.77969
86,0.74229
87,0.70489
88,0.6674899999999999
89,0.6300899999999999
90,0.5926899999999999
91,0.5553
92,0.5179
93,0.4805
94,0.4431
95,0.4057
96,0.37085999999999997
97,0.33692
98,0.31422
99,0.29178000000000004
100,0.26934
101,0.2469
102,0.22446
103,0.20202
104,0.17959
105,0.15715
106,0.13205
107,0.48865
108,0.28102
109,0.056628
110,-0.16849
111,-0.39403
112,-0.1417
113,-0.20153
114,-0.26137
115,-0.32051
116,-0.37827
117,-0.43293999999999994
118,-0.4853
119,-0.53766
120,-0.58911
121,-0.62133
122,-0.6487
123,-0.66366
124,-0.67862
125,-0.69358
126,-0.69503
127,-0.69203
128,-0.6846
129,-0.6775399999999999
130,-0.6719
131,-0.6792
132,-0.7016399999999999
133,-0.72407
134,-0.74651
135,-0.7712100000000001
136,-0.79691
137,-0.82683
138,-0.85675
139,-0.8866700000000001
140,-0.91099
141,-0.93216
142,-0.94789
143,-0.96285
144,-0.9778100000000001
145,-0.99056
146,-0.9991899999999999
147,-1.0072
148,-1.0146
149,-1.0208
150,-1.0259
151,-1.0184
152,-1.0109
153,-1.0035
154,-0.9959899999999999
155,-0.98851
156,-0.98103
157,-0.97355
158,-0.9660700000000001
159,-0.9585899999999999
160,-0.95111
161,-0.94363
162,-0.93615
163,-0.9286700000000001
164,-0.92119
165,-0.9263100000000001
166,-0.93247
167,-0.93995
168,-0.94839
169,-0.9581700000000001
170,-0.9762
171,-0.99864
172,-1.0211
173,-1.0439
174,-1.0694
175,-1.0966
176,-1.1265
177,-1.1564
178,-1.1863
179,-1.2078
180,-1.2273
181,-1.2422
182,-1.2572
183,-1.2722
184,-1.2758
185,-1.2697
186,-1.2625
187,-1.255
188,-1.246
189,-1.2356
190,-1.2206
191,-1.2057
192,-1.1907
193,-1.1732
194,-1.1548
195,-1.1326
196,-1.1101
197,-1.0877
198,-1.0653
199,-1.0428
200,-1.0204
201,-0.99795
202,-0.97551
203,-0.95406
204,-0.93899
205,-0.92395
206,-0.909
207,-0.89404
208,-0.87908
209,-0.8641200000000001
210,-0.84916
211,-0.8342
212,-0.8204299999999999
213,-0.8092699999999999
214,-0.80014
215,-0.79266
216,-0.78518
217,-0.7777
218,-0.77022
219,-0.76274
220,-0.75526
221,-0.74755
222,-0.73961
223,-0.72108
224,-0.6986399999999999
225,-0.6762
226,-0.6542100000000001
227,-0.6339600000000001
228,-0.61602
229,-0.60106
230,-0.5861
231,-0.57114
232,-0.55618
233,-0.54122
234,-0.52627
235,-0.51131
236,-0.49635
237,-0.48139
238,-0.46643
239,-0.45147
240,-0.43666000000000005
241,-0.42343000000000003
242,-0.41695
243,-0.42443000000000003
244,-0.43191
245,-0.43938999999999995
246,-0.44485
247,-0.44963000000000003
248,-0.44963000000000003
249,-0.44963000000000003
250,-0.44963000000000003
251,-0.4519
252,-0.45638
253,-0.46308999999999995
254,-0.47057
255,-0.47805
256,-0.48415
257,-0.48518999999999995
258,-0.48576
259,-0.48576
260,-0.48513
261,-0.48421000000000003
262,-0.47723999999999994
263,-0.46976999999999997
264,-0.46229
265,-0.45593999999999996
266,-0.45133
267,-0.44963000000000003
268,-0.44963000000000003
269,-0.44963000000000003
270,-0.44914
271,-0.44431000000000004
272,-0.43858
273,-0.4311
274,-0.42362
275,-0.41613999999999995
276,-0.40317
277,-0.38887
278,-0.37390999999999996
279,-0.35966
280,-0.34723000000000004
281,-0.34123000000000003
282,-0.34123000000000003
283,-0.34123000000000003
284,-0.34123000000000003
285,-0.33804
286,-0.33387
287,-0.32639
288,-0.31890999999999997
289,-0.31143000000000004
290,-0.30755
291,-0.30525
292,-0.3051
293,-0.3051
294,-0.3051
295,-0.3051
296,-0.3051
297,-0.3051
298,-0.3051
299,-0.30369
300,-0.30141999999999997
301,-0.29394000000000003
302,-0.28646
303,-0.27898
304,-0.2715
305,-0.26402
306,-0.25654
307,-0.24906
308,-0.24158000000000002
309,-0.2341
310,-0.22662
311,-0.21914
312,-0.21166
313,-0.20418
314,-0.1967
315,-0.43627
316,-0.097957
317,0.24036
318,0.1107
319,0.17001
320,0.21998
321,0.23456999999999997
322,0.23456999999999997
323,0.23456999999999997
324,0.23456999999999997
325,0.23456999999999997
326,0.23456999999999997
327,0.23456999999999997
328,0.23456999999999997
329,0.23456999999999997
330,0.23456999999999997
331,0.23456999999999997
332,0.23456999999999997
333,0.23456999999999997
334,0.23456999999999997
335,0.23456999999999997
336,0.23456999999999997
337,0.23456999999999997
338,0.23456999999999997
339,0.23456999999999997
340,0.23456999999999997
341,0.23456999999999997
342,0.23456999999999997
343,0.23456999999999997
344,0.23456999999999997
345,0.23456999999999997
346,0.23456999999999997
347,0.23456999999999997
348,0.23456999999999997
349,0.23456999999999997
350,0.23456999999999997
351,0.23456999999999997
352,0.23456999999999997
353,0.23456999999999997
354,0.23456999999999997
355,0.23456999999999997
356,0.23456999999999997
357,0.23456999999999997
358,0.23456999999999997
359,0.23456999999999997
360,0.23456999999999997
361,0.23456999999999997
362,0.23456999999999997
363,0.23456999999999997
364,0.23456999999999997
365,0.23456999999999997
366,0.23456999999999997
367,0.23456999999999997
368,0.2383
369,0.28576999999999997
370,0.33534
371,0.38947
372,0.44153000000000003
373,0.49191999999999997
374,0.52396
375,0.55103
376,0.57809
377,0.60656
378,0.63903
379,0.67553
380,0.71612
381,0.75672
382,0.79732
383,0.8292700000000001
384,0.8599899999999999
385,0.88705
386,0.91412
387,0.9411799999999999
388,0.96825
389,0.99531
390,1.0224
391,1.0491
392,1.0736
393,1.094
394,1.1075
395,1.1211
396,1.1346
397,1.1533
398,1.1735
399,1.2006
400,1.2277
401,1.2547
402,1.2764
403,1.2939
404,1.3082
405,1.3218
406,1.3353
407,1.3524
408,1.379
409,1.4059
410,1.4329
411,1.4646
412,1.4979
413,1.5516
414,1.6057
415,1.6599
416,1.705
417,1.7392
418,1.7592
419,1.7727
420,1.7862
421,1.7982
422,1.8015
423,1.8035
424,1.8035
425,1.8035
426,1.8035
427,1.8035
428,1.8035
429,1.8035
430,1.8023
431,1.7985
432,1.7892
433,1.7756
434,1.7621
435,1.7482
436,1.7274
437,1.7048
438,1.6778
439,1.6507
440,1.6236
441,1.5803
442,1.5316
443,1.4775
444,1.4235
445,1.3702
446,1.3228
447,1.2822
448,1.2416
449,1.2009999999999998
450,1.1604
451,1.1198
452,1.0792
453,1.0386
454,0.99802
455,0.96249
456,0.9298
457,0.90204
458,0.87498
459,0.84791
460,0.81686
461,0.7783399999999999
462,0.73861
463,0.69801
464,0.65861
465,0.62015
466,0.59308
467,0.56602
468,0.53895
469,0.50925
470,0.47718999999999995
471,0.4386
472,0.39799999999999996
473,0.35741
474,0.31681
475,0.27621
476,0.23560999999999999
477,0.19502
478,0.15442
479,0.11382
480,0.09601599999999999
481,0.42565
482,0.35799000000000003
483,0.28600000000000003
484,0.20792
485,0.092541
486,-0.24955
487,-0.17811
488,-0.31344
489,-0.44876000000000005
490,-0.12186
491,-0.14892
492,-0.17599
493,-0.20305
494,-0.23012
495,-0.25718
496,-0.28425
497,-0.31131
498,-0.33838
499,-0.37229
500,-0.41206000000000004
501,-0.45247
502,-0.49307
503,-0.53366
504,-0.57426
505,-0.6148600000000001
506,-0.65546
507,-0.69605
508,-0.73216
509,-0.76651
510,-0.79391
511,-0.8209700000000001
512,-0.84804
513,-0.8751
514,-0.90217
515,-0.9292299999999999
516,-0.9563
517,-0.98336
518,-1.005
519,-0.99213
520,-0.9789899999999999
521,-0.96546
522,-0.95395
523,-0.9437399999999999
524,-0.94214
525,-0.94214
526,-0.94214
527,-0.9378200000000001
528,-0.9240799999999999
529,-0.903
530,-0.8759299999999999
531,-0.8488700000000001
532,-0.8225100000000001
533,-0.8266700000000001
534,-0.83325
535,-0.8467899999999999
536,-0.86011
537,-0.87323
538,-0.87677
539,-0.87677
540,-0.87677
541,-0.8783700000000001
542,-0.88628
543,-0.9025799999999999
544,-0.92965
545,-0.9567100000000001
546,-0.9837799999999999
547,-1.004
548,-1.0227
549,-1.0362
550,-1.0498
551,-1.0633
552,-1.07
553,-1.0725
554,-1.0729
555,-1.073
556,-1.074
557,-1.0791
558,-1.0927
559,-1.1062
560,-1.1197
561,-1.1296
562,-1.1383
563,-1.1383
564,-1.1383
565,-1.1383
566,-1.1383
567,-1.1383
568,-1.1383
569,-1.1383
570,-1.1383
571,-1.1383
572,-1.1383
573,-1.1383
574,-1.1383
575,-1.1383
576,-1.1383
577,-1.1383
578,-1.1383
579,-1.1383
580,-1.1403
581,-1.1455
582,-1.156
583,-1.1695
584,-1.183
585,-1.1957
586,-1.2005
587,-1.2036
588,-1.2036
589,-1.2036
590,-1.2036
591,-1.2036
592,-1.2036
593,-1.2036
594,-1.2036
595,-1.2036
596,-1.2036
597,-1.2036
598,-1.2036
599,-1.2036
600,-1.2036
601,-1.2036
602,-1.2036
603,-1.2036
604,-1.2036
605,-1.2036
606,-1.2036
607,-1.2036
608,-1.2036
609,-1.2036
610,-1.2036
611,-1.2036
612,-1.2036
613,-1.2036
614,-1.2036
615,-1.2036
616,-1.2036
617,-1.2036
618,-1.2036
619,-1.1961
620,-1.1832
621,-1.1587
622,-1.1316
623,-1.1045
624,-1.0833
625,-1.0762
626,-1.0729
627,-1.0729
628,-1.0729
629,-1.0729
630,1.0869
631,1.17
632,1.2531
633,1.3363
634,1.4091
635,1.4705
636,1.4884
637,1.4884
638,1.4884
639,1.4884
640,1.4884
641,1.4884
642,1.4884
643,1.4884
644,1.4884
645,1.4884
646,1.4884
647,1.4884
648,1.4884
649,1.4884
650,1.4884
651,1.4884
652,1.4884
653,1.4884
654,1.4884
655,1.4884
656,1.4884
657,1.4884
658,1.4884
659,1.4884
660,1.4884
661,1.4884
662,1.4884
663,1.4884
664,1.4884
665,1.4884
666,1.4884
667,1.4884
668,1.4884
669,1.4884
670,1.4884
671,1.4884
672,1.4884
673,1.4884
674,1.4884
675,1.4884
676,1.4884
677,1.4884
678,1.4884
679,1.4884
680,1.4884
681,1.4884
682,1.4884
683,1.4884
684,1.4884
685,1.4884
686,1.4884
687,1.4948
688,1.5063
689,1.5741
690,1.6572
691,1.7403
692,1.8148
693,1.8647
694,1.8899
695,1.8899
696,1.8899
697,1.8899
698,1.8368
699,1.7761
700,1.693
701,1.6099
702,1.5268
703,1.4178
704,1.2963
705,1.172
706,1.0462
707,0.9138299999999999
708,0.76854
709,0.60232
710,0.4361
711,0.26988
712,0.11947999999999999
713,-0.10545999999999998
714,-0.1508
715,-0.27546
716,-0.40013000000000004
717,-0.5082800000000001
718,-0.60354
719,-0.68911
720,-0.77222
721,-0.8553299999999999
722,-0.9384399999999999
723,-1.0216
724,-1.1047
725,-1.1878
726,-1.2567
727,-1.3206
728,-1.3219999999999998
729,-1.3219999999999998
730,-1.3219999999999998
731,-1.2944
732,-1.2331
733,-1.1283
734,-1.0037
735,-0.8789799999999999
736,-0.76417
737,-0.70216
738,-0.6481899999999999
739,-0.60663
740,-0.56548
741,-0.52456
742,-0.51905
743,-0.51905
744,-0.51905
745,-0.51905
746,-0.51905
747,-0.51905
748,-0.51905
749,-0.51905
750,-0.52005
751,-0.54243
752,-0.57019
753,-0.61175
754,-0.6533
755,-0.69486
756,-0.73641
757,-0.7779699999999999
758,-0.81953
759,-0.86108
760,-0.90264
761,-0.94419
762,-0.98575
763,-1.0273
764,-1.0689
765,-1.0854
766,-1.0906
767,-1.0490000000000002
768,-1.0075
769,-0.96593
770,-0.9399299999999999
771,-0.9226700000000001
772,-0.9205399999999999
773,-0.9205399999999999
774,-0.9205399999999999
775,-0.9450299999999999
776,-1.0154
777,-1.0932
778,-1.1763
779,-1.2594
780,-1.3425
781,-1.4256
782,-1.5087
783,-1.5918
784,-1.6668
785,-1.7346
786,-1.7823
787,-1.8239
788,-1.8655
789,-1.8885
790,-1.8514
791,-1.7926
792,-1.7095
793,-1.6263
794,-1.5432
795,-1.4951
796,-1.4499
797,-1.4083
798,-1.3641
799,-1.3162
800,-1.2453
801,-1.1622
802,-1.0791
803,-1.0002
804,-0.9516600000000001
805,-0.9205399999999999
806,-0.9205399999999999
807,-0.9205399999999999
808,-0.9205399999999999
809,-0.9205399999999999
810,-0.9205399999999999
811,-0.9205399999999999
812,-0.9205399999999999
813,-0.9205399999999999
814,-0.9205399999999999
815,-0.9205399999999999
816,-0.9205399999999999
817,-0.92035
818,-0.9037299999999999
819,-0.87067
820,-0.78756
821,-0.70445
822,-0.62134
823,-0.53823
824,-0.45511
825,-0.37200000000000005
826,-0.28889000000000004
827,-0.20578000000000002
828,-0.14833
829,-0.12531
830,-0.11755
831,-0.11755
832,-0.11755
833,-0.11204000000000001
834,-0.33041
835,-0.12464000000000001
836,0.083139
837,0.22885
838,0.33434
839,0.17584
840,-0.17723
841,-0.23972
842,-0.4475
843,-0.13609000000000002
844,-0.17765
845,-0.2192
846,-0.26076
847,-0.30088000000000004
848,-0.2785
849,-0.25117
850,-0.20961999999999997
851,-0.16932
852,-0.13033
853,-0.15016
854,-0.19171
855,-0.23326999999999998
856,-0.27237
857,-0.30178
858,-0.3183
859,-0.3183
860,-0.3183
861,-0.3183
862,-0.27641
863,-0.22496
864,-0.14185
865,-0.26849
866,0.14707
867,0.35323000000000004
868,0.42995
869,0.44116000000000005
870,0.44403000000000004
871,0.47600000000000003
872,0.12155
873,0.20465999999999998
874,0.28778000000000004
875,0.37089
876,0.42033999999999994
877,0.45847
878,0.41691999999999996
879,0.37535999999999997
880,0.33381
881,0.29225
882,0.2507
883,0.20914000000000002
884,0.16758
885,0.12603
886,0.44755
887,0.23976999999999998
888,0.24896999999999997
889,-0.17579
890,-0.36604000000000003
891,-0.11469000000000001
892,-0.11755
893,-0.11755
894,-0.11755
895,-0.11755
896,-0.11755
897,-0.11755
898,-0.11755
899,-0.11755
900,-0.11484000000000001
901,-0.41473999999999994
902,-0.2557
903,-0.28379
904,0.15986
905,0.36764
906,0.42283999999999994
907,0.44116000000000005
908,0.44116000000000005
909,0.44116000000000005
910,0.44116000000000005
911,0.44116000000000005
912,0.44116000000000005
913,0.44116000000000005
914,0.44116000000000005
915,0.44116000000000005
916,0.44116000000000005
917,0.44116000000000005
918,0.44116000000000005
919,0.44116000000000005
920,0.24074
921,-0.27731999999999996
922,-0.45388999999999996
923,-0.17893
924,-0.26204
925,-0.29705
926,-0.26125
927,-0.22175999999999998
928,-0.18020999999999998
929,-0.15434
930,-0.13801
931,-0.17957
932,-0.22111999999999998
933,-0.26268
934,-0.30423
935,-0.34579
936,-0.38735
937,-0.4289
938,-0.47046000000000004
939,-0.52098
940,-0.59322
941,-0.6712
942,-0.75432
943,-0.8374299999999999
944,-0.9205399999999999
