time,value
0,-0.13737
1,-0.58187
2,0.05325800000000001
3,0.55367
4,-0.24861
5,-0.32848
6,0.10186
7,0.10004
8,-0.71767
9,-0.46553999999999995
10,0.033511
11,-0.46778000000000003
12,-0.46248999999999996
13,-0.18757000000000001
14,0.18164
15,0.37997
16,-0.040898000000000004
17,-0.083078
18,-0.13412000000000002
19,0.31821
20,-0.82855
21,-0.071264
22,-0.042192
23,-0.41703
24,0.10585
25,-0.35931
26,0.08103300000000001
27,0.1791
28,0.01669
29,-0.18982000000000002
30,-0.049184
31,0.072339
32,-0.26798
33,0.13324
34,0.20781
35,-0.42135
36,-0.40944
37,-0.12982
38,0.37096999999999997
39,0.49706999999999996
40,0.29047
41,-0.029762
42,-0.1083
43,-0.12412000000000001
44,0.21483000000000002
45,-0.06340900000000001
46,0.027610000000000003
47,-0.22408000000000003
48,0.028009
49,0.34870999999999996
50,-0.43687
51,-0.034726
52,0.18097
53,-0.35853
54,-0.12917
55,0.2323
56,-0.033779
57,-0.19935999999999998
58,-0.31715
59,0.51299
60,0.47651000000000004
61,-0.098965
62,-0.20435999999999999
63,-0.11249
64,0.014161000000000002
65,-0.061824000000000004
66,0.32471
67,0.31974
68,1.0091
69,0.30236999999999997
70,0.25863
71,0.8105
72,0.024346
73,0.43922
74,-0.11645
75,-0.22551999999999997
76,-0.12118
77,-1.7566
78,-1.7566
79,-1.7566
80,-1.7566
81,-1.7566
82,-1.7566
83,-1.7566
84,-1.7566
85,1.7213
86,1.7213
87,1.7213
88,1.7213
89,1.7213
90,1.7213
91,1.7213
92,1.7213
93,1.7213
94,1.7213
95,1.7213
96,1.7213
97,1.7213
98,1.7213
99,1.7213
100,1.7213
101,1.7213
102,1.7213
103,1.7213
104,1.7213
105,-1.7566
106,-1.7566
107,-1.7566
108,-1.7566
109,-1.7566
110,-1.7566
111,-1.7566
112,-1.7566
113,-1.7566
114,-1.7566
115,-1.7566
116,0.41923
117,-0.16694
118,-0.025918
119,0.12377
120,-0.31337
121,0.023662
122,-0.63871
123,-0.16351
124,0.24374
125,0.33497
126,0.18342
127,-0.23137
