time,value
0,0.18243
1,0.18243
2,0.18243
3,0.18243
4,0.18243
5,0.18243
6,0.18243
7,0.18243
8,0.18243
9,0.18243
10,0.18243
11,0.18243
12,0.18243
13,0.18243
14,0.18243
15,0.18797
16,0.30423
17,0.4027
18,0.41931
19,0.43078
20,0.43078
21,0.43078
22,0.43078
23,0.43078
24,0.43078
25,0.46578
26,0.51561
27,0.6727
28,0.85126
29,1.0538
30,1.2573
31,1.4608
32,1.6473
33,1.776
34,1.8855
35,1.9602
36,2.0025
37,2.0109
38,1.9883
39,1.9468
40,1.899
41,1.8492
42,1.814
43,1.7805
44,1.7224
45,1.6684
46,1.6393
47,1.6102
48,1.5812
49,1.5353
50,1.4647
51,1.3941
52,1.3235
53,1.2613
54,1.2031
55,1.1516
56,1.1018
57,1.0674
58,1.0327
59,0.97454
60,0.9164100000000001
61,0.8582799999999999
62,0.80815
63,0.77493
64,0.7342
65,0.68437
66,0.6297
67,0.5715600000000001
68,0.51343
69,0.4553
70,0.39716999999999997
71,0.33903
72,0.2809
73,0.22276999999999997
74,0.16463
75,0.099579
76,0.01238
77,-0.07482
78,-0.16202
79,-0.23884
80,-0.30528
81,-0.35599000000000003
82,-0.39752
83,-0.42006000000000004
84,-0.43667
85,-0.43103
86,-0.42223
87,-0.39316999999999996
88,-0.3641
89,-0.33504
90,-0.31427
91,-0.31427
92,-0.30389
93,-0.27898
94,-0.25179
95,-0.22271999999999997
96,-0.19366
97,-0.16459000000000001
98,-0.14561
99,-0.129
100,-0.13582
101,-0.14531
102,-0.17023
103,-0.1901
104,-0.1901
105,-0.20948000000000003
106,-0.26761
107,-0.31417
108,-0.34739000000000003
109,-0.3905
110,-0.44033
111,-0.50825
112,-0.58299
113,-0.6684100000000001
114,-0.75561
115,-0.8428100000000001
116,-0.9295200000000001
117,-1.0126
118,-1.0894
119,-1.1475
120,-1.2056
121,-1.2638
122,-1.2964
123,-1.3047
124,-1.321
125,-1.3418
126,-1.369
127,-1.3980000000000001
128,-1.4271
129,-1.4562
130,-1.4852
131,-1.515
132,-1.5482
133,-1.5889
134,-1.6469999999999998
135,-1.6927
136,-1.7217
137,-1.7369
138,-1.7409999999999999
139,-1.7423
140,-1.7423
141,-1.7423
142,-1.7423
143,-1.7304
144,-1.7166
145,-1.6875
146,-1.6593
147,-1.6344
148,-1.6181
149,-1.6181
150,-1.6181
151,-1.6181
152,-1.6030000000000002
153,-1.5781
154,-1.5654
155,-1.5571
156,-1.556
157,-1.556
158,-1.556
159,-1.5571
160,-1.5654
161,-1.5781
162,-1.6030000000000002
163,-1.6181
164,-1.6181
165,-1.6029
166,-1.5738
167,-1.5448
168,-1.5157
169,-1.4703
170,-1.4205
171,-1.3630000000000002
172,-1.3049
173,-1.2468
174,-1.1901
175,-1.1403
176,-1.0982
177,-1.0733
178,-1.0593
179,-1.0593
180,-1.0593
181,-1.0593
182,-1.0593
183,-1.0593
184,-1.0593
185,-1.0593
186,-1.0273
187,-0.9940700000000001
188,-0.96086
189,-0.93515
190,-0.93515
191,-0.9307
192,-0.91824
193,-0.86931
194,-0.7821100000000001
195,-0.67691
196,-0.56065
197,-0.38832
198,-0.19730999999999999
199,-0.013622
200,0.16839
201,0.29296
202,0.40685
203,0.45668000000000003
204,0.48605
205,0.46113000000000004
206,0.40933
207,0.31797
208,0.21327
209,0.097009
210,0.038876
211,0.009809100000000001
212,0.11985
213,0.26518
214,0.45678
215,0.65046
216,0.82071
217,0.98146
218,1.1019
219,1.2036
220,1.2659
221,1.2963
222,1.2879
223,1.2506
224,1.1924
225,1.1135
226,1.0263
227,1.0234
228,1.0358
229,1.1253
230,1.2229
231,1.3724
232,1.507
233,1.5942
234,1.6324
235,1.5867
236,1.5203
237,1.4331
238,1.3459
239,1.2587
240,1.1272
241,0.9818600000000001
242,0.8810100000000001
243,0.7867
244,0.74102
245,0.7082
246,0.74557
247,0.7865
248,0.8363299999999999
249,0.86885
250,0.87716
251,0.88774
252,0.9001899999999999
253,0.84503
254,0.75783
255,0.62357
256,0.47823999999999994
257,0.35633000000000004
258,0.24065999999999999
259,0.18667999999999998
260,0.15119000000000002
261,0.18855999999999998
262,0.25084
263,0.36296
264,0.49049
265,0.63583
266,0.77127
267,0.9
268,0.95635
269,0.9854200000000001
270,0.9646600000000001
271,0.9355899999999999
272,0.8819
273,0.8224899999999999
274,0.72283
275,0.62317
276,0.52352
277,0.42386
278,0.3242
279,0.23305
280,0.15
281,0.12568
282,0.13398
283,0.18085
284,0.23898000000000003
285,0.24452
286,0.24363
287,0.21871
288,0.18965
289,0.13982
290,0.092461
291,0.050937
292,0.014752000000000001
293,-0.014313999999999999
294,-0.038734
295,-0.059496
296,-0.068789
297,-0.07294199999999999
298,-0.097559
299,-0.12663
300,-0.21106
301,-0.29618
302,-0.35846999999999996
303,-0.41096000000000005
304,-0.42757
305,-0.43845
306,-0.43845
307,-0.43251999999999996
308,-0.42006000000000004
309,-0.39752
310,-0.36845
311,-0.33939
312,-0.31032
313,-0.28125
314,-0.25219
