time,value
0,1.0375
1,1.0375
2,1.0375
3,1.0375
4,1.0375
5,1.0375
6,1.0375
7,1.0375
8,1.0375
9,1.0426
10,1.0612
11,1.0804
12,1.1047
13,1.129
14,1.1388
15,1.1474
16,1.1497
17,1.1497
18,1.1497
19,1.1497
20,1.1497
21,1.1497
22,1.1497
23,1.1497
24,1.1497
25,1.1497
26,1.1497
27,1.1497
28,1.1497
29,1.1497
30,1.1497
31,1.1497
32,1.1497
33,1.1497
34,1.1497
35,1.1497
36,1.1497
37,1.1497
38,1.1497
39,1.1497
40,1.1497
41,1.1497
42,1.1497
43,1.1497
44,1.1497
45,1.1497
46,1.1497
47,1.1497
48,1.1497
49,1.1497
50,1.1497
51,1.1497
52,1.1497
53,1.1497
54,1.1497
55,1.1462
56,1.1391
57,1.1304
58,1.1182
59,1.1047
60,1.0811
61,1.0575
62,1.0217
63,0.98529
64,0.95539
65,0.9275100000000001
66,0.90881
67,0.89666
68,0.88451
69,0.87236
70,0.86021
71,0.84806
72,0.83596
73,0.82524
74,0.81452
75,0.81303
76,0.81303
77,0.81303
78,0.81303
79,0.83126
80,0.86771
81,0.9041600000000001
82,0.9406200000000001
83,0.9726
84,0.9768899999999999
85,0.9811799999999999
86,0.98136
87,0.98136
88,0.95245
89,0.91528
90,0.87129
91,0.82268
92,0.76753
93,0.7032
94,0.63684
95,0.56394
96,0.48889
97,0.37739
98,0.26588
99,0.12435999999999998
100,-0.021449
101,-0.14989
102,-0.27068000000000003
103,-0.37311
104,-0.45816999999999997
105,-0.54084
106,-0.61875
107,-0.69404
108,-0.75479
109,-0.81555
110,-0.87005
111,-0.92437
112,-0.9549200000000001
113,-0.9792299999999999
114,-1.0027
115,-1.0255
116,-1.0386
117,-1.0386
118,-1.0386
119,-1.0386
120,-1.0362
121,-1.0019
122,-0.96755
123,-0.93134
124,-0.8948799999999999
125,-0.87261
126,-0.8561700000000001
127,-0.84199
128,-0.8298399999999999
129,-0.82365
130,-0.82865
131,-0.8348399999999999
132,-0.847
133,-0.85915
134,-0.88539
135,-0.91184
136,-0.94635
137,-0.9828
138,-1.0228
139,-1.065
140,-1.11
141,-1.1586
142,-1.2072
143,-1.2558
144,-1.3044
145,-1.3530000000000002
146,-1.4016
147,-1.4477
148,-1.4934
149,-1.5325
150,-1.5689
151,-1.6054
152,-1.6418
153,-1.6783
154,-1.7147
155,-1.7512
156,-1.7876
157,-1.8241
158,-1.7998
159,-1.7755
160,-1.7512
161,-1.7269
162,-1.6957
163,-1.6607
164,-1.625
165,-1.5886
166,-1.5469
167,-1.4919
168,-1.4363
169,-1.3756
170,-1.3148
171,-1.2685
172,-1.2234
173,-1.1847
174,-1.1483
175,-1.1225
176,-1.1054
177,-1.0947
178,-1.0947
179,-1.0995
180,-1.1245
181,-1.1501
182,-1.2108
183,-1.2716
184,-1.3353
185,-1.3996
186,-1.4696
187,-1.5425
188,-1.6123
189,-1.6788
190,-1.7365
191,-1.7730000000000001
192,-1.8090000000000002
193,-1.8419
194,-1.8748
195,-1.8544
196,-1.8301
197,-1.8058
198,-1.7815
199,-1.7312
200,-1.6611
201,-1.59
202,-1.5171
203,-1.4421
204,-1.3592
205,-1.2762
206,-1.1912
207,-1.1061
208,-1.021
209,-0.9359799999999999
210,-0.85093
211,-0.7658699999999999
212,-0.68081
213,-0.5957600000000001
214,-0.5107
215,-0.42565
216,-0.3413
217,-0.26197
218,-0.18263
219,-0.10935999999999998
220,-0.036459
221,0.020066999999999998
222,0.07153
223,0.10006
224,0.11220999999999999
225,0.12320999999999999
226,0.1325
227,0.13973
228,0.13973
229,0.13967000000000002
230,0.13824
231,0.13681
232,0.12615
233,0.114
234,0.10185
235,0.089696
236,0.089696
237,0.10185
238,0.114
239,0.12615
240,0.14128
241,0.17487
242,0.20847
243,0.2448
244,0.28125
245,0.32493
246,0.37068
247,0.41813
248,0.46673000000000003
249,0.50878
250,0.54166
251,0.57252
252,0.59682
253,0.6207600000000001
254,0.63863
255,0.6565
256,0.66937
257,0.68152
258,0.69367
259,0.70582
260,0.71797
261,0.73012
262,0.7398899999999999
263,0.7448899999999999
264,0.74727
265,0.73512
266,0.72297
267,0.70665
268,0.69021
269,0.65793
270,0.62148
271,0.5854600000000001
272,0.54972
273,0.51891
274,0.49461000000000005
275,0.47031000000000006
276,0.446
277,0.4217
278,0.3974
279,0.3731
280,0.3488
281,0.32449
282,0.32145999999999997
283,0.32718
284,0.33629000000000003
285,0.34844
286,0.36357
287,0.3843
288,0.40562
289,0.42991999999999997
290,0.45421999999999996
291,0.47853
292,0.50283
293,0.52713
294,0.55143
295,0.56501
296,0.57216
297,0.5707300000000001
298,0.55858
299,0.54756
300,0.5397
301,0.53249
302,0.53249
303,0.53249
304,0.52991
305,0.52705
306,0.51748
307,0.5053300000000001
308,0.49318
309,0.48103
310,0.46888
311,0.45673
312,0.44456999999999997
313,0.43241999999999997
314,0.42027
