time,value
0,-1.6853
1,-1.6853
2,-1.6853
3,-1.6853
4,-1.6853
5,-1.6853
6,-1.6853
7,-1.6853
8,-1.6853
9,-1.6853
10,-1.6853
11,-1.6853
12,-1.6853
13,-1.6853
14,-1.6853
15,-1.6853
16,-1.6853
17,-1.6853
18,-1.6853
19,-1.6853
20,-1.6853
21,-1.6768
22,-1.6606
23,-1.6434
24,-1.6231
25,-1.6029
26,-1.5826
27,-1.5623
28,-1.5524
29,-1.547
30,-1.5439
31,-1.5439
32,-1.5439
33,-1.5439
34,-1.5439
35,-1.5439
36,-1.5439
37,-1.5439
38,-1.5439
39,-1.5439
40,-1.5439
41,-1.5439
42,-1.5439
43,-1.5439
44,-1.5439
45,-1.5439
46,-1.5439
47,-1.5439
48,-1.5439
49,-1.5439
50,-1.5439
51,-1.5439
52,-1.5439
53,-1.5439
54,-1.5439
55,-1.5439
56,-1.5439
57,-1.5439
58,-1.5439
59,-1.5439
60,-1.5439
61,-1.5439
62,-1.5439
63,-1.5439
64,-1.5439
65,-1.5439
66,-1.5439
67,-1.5439
68,-1.5439
69,-1.5372
70,-1.5282
71,-1.5109
72,-1.4838
73,-1.4568
74,-1.4298
75,-1.4028
76,-1.3741
77,-1.3453
78,-1.3133
79,-1.2795
80,-1.2457
81,-1.212
82,-1.178
83,-1.1415
84,-1.105
85,-1.0598
86,-1.0125
87,-0.9651799999999999
88,-0.91789
89,-0.8703700000000001
90,-0.8221799999999999
91,-0.774
92,-0.72004
93,-0.6659999999999999
94,-0.61195
95,-0.55791
96,-0.5032800000000001
97,-0.44788999999999995
98,-0.38948
99,-0.31517
100,-0.24086999999999997
101,-0.16655999999999999
102,-0.46263000000000004
103,-0.09109
104,0.28045
105,0.12392
106,0.17795999999999998
107,0.23199999999999998
108,0.28605
109,0.34009
110,0.39413000000000004
111,0.44816999999999996
112,0.48623
113,0.50874
114,0.53074
115,0.551
116,0.57127
117,0.59154
118,0.6118
119,0.62808
120,0.64249
121,0.65654
122,0.67005
123,0.6835600000000001
124,0.69707
125,0.71058
126,0.7194699999999999
127,0.7275699999999999
128,0.7349
129,0.74165
130,0.74841
131,0.75516
132,0.7619199999999999
133,0.76867
134,0.7754300000000001
135,0.78218
136,0.78894
137,0.79569
138,0.80245
139,0.8064600000000001
140,0.79971
141,0.79295
142,0.77993
143,0.76642
144,0.7529100000000001
145,0.7394
146,0.72436
147,0.7068
148,0.68896
149,0.6687
150,0.6484300000000001
151,0.62816
152,0.6079
153,0.5916
154,0.5785399999999999
155,0.56722
156,0.5604600000000001
157,0.55371
158,0.54695
159,0.5402
160,0.53572
161,0.5321199999999999
162,0.53014
163,0.53014
164,0.53014
165,0.53014
166,0.53014
167,0.53499
168,0.5404
169,0.55085
170,0.5643600000000001
171,0.57787
172,0.59139
173,0.6049
174,0.61841
175,0.63192
176,0.6454300000000001
177,0.65894
178,0.67245
179,0.68596
180,0.69903
181,0.71073
182,0.72244
183,0.72934
184,0.7361
185,0.74285
186,0.74961
187,0.75693
188,0.7650399999999999
189,0.77393
190,0.7874399999999999
191,0.80095
192,0.8144600000000001
193,0.8279700000000001
194,0.8409399999999999
195,0.85356
196,0.8643
197,0.87105
198,0.8778100000000001
199,0.88456
200,0.8913200000000001
201,0.8977299999999999
202,0.9040299999999999
203,0.90723
204,0.90723
205,0.90723
206,0.90723
207,0.90723
208,0.90723
209,0.90723
210,0.89822
211,0.88471
212,0.8712
213,0.85769
214,0.8441799999999999
215,0.83067
216,0.81716
217,0.80895
218,0.80175
219,0.79479
220,0.78804
221,0.78128
222,0.77453
223,0.76777
224,0.76102
225,0.75426
226,0.74751
227,0.74075
228,0.7340000000000001
229,0.72724
230,0.72049
231,0.71373
232,0.70698
233,0.70022
234,0.6934600000000001
235,0.68671
236,0.67995
237,0.67499
238,0.67319
239,0.67155
240,0.67155
241,0.67155
242,0.67155
243,0.67155
244,0.67155
245,0.67155
246,0.67155
247,0.67155
248,0.67155
249,0.67155
250,0.67155
251,0.67155
252,0.67155
253,0.67155
254,0.67155
255,0.67155
256,0.67155
257,0.67155
258,0.67155
259,0.67155
260,0.67155
261,0.67155
262,0.67155
263,0.67155
264,0.67173
265,0.67488
266,0.67804
267,0.68401
268,0.69076
269,0.69752
270,0.70427
271,0.7104
272,0.71446
273,0.71851
274,0.71868
275,0.71868
276,0.71868
277,0.71868
278,0.71777
279,0.7155199999999999
280,0.71268
281,0.70592
282,0.69917
283,0.6924100000000001
284,0.68566
285,0.67995
286,0.67499
287,0.67155
288,0.67155
289,0.67155
290,0.67155
291,0.67155
292,0.6705300000000001
293,0.66918
294,0.6652399999999999
295,0.6584899999999999
296,0.65173
297,0.64498
298,0.63822
299,0.63063
300,0.62298
301,0.6115
302,0.5979899999999999
303,0.58448
304,0.57097
305,0.5575
306,0.5444399999999999
307,0.53138
308,0.52353
309,0.51678
310,0.51002
311,0.50327
312,0.49651000000000006
313,0.48976000000000003
314,0.483
315,-1.7091
316,-1.7091
317,-1.7091
318,-1.7091
319,-1.7091
320,-1.7091
321,-1.7091
322,-1.7091
323,-1.7091
324,-1.7091
325,-1.7091
326,-1.7091
327,-1.7091
328,-1.7091
329,-1.7091
330,-1.7091
331,-1.7091
332,-1.7091
333,-1.7091
334,-1.7091
335,-1.7091
336,-1.6826
337,-1.6317
338,-1.5777
339,-1.5142
340,-1.4506
341,-1.3869999999999998
342,-1.3234
343,-1.2923
344,-1.2753
345,-1.2655
346,-1.2655
347,-1.2655
348,-1.2655
349,-1.2655
350,-1.2655
351,-1.2655
352,-1.2655
353,-1.2655
354,-1.2655
355,-1.2655
356,-1.2655
357,-1.2655
358,-1.2655
359,-1.2655
360,-1.2655
361,-1.2655
362,-1.2655
363,-1.2655
364,-1.2655
365,-1.2655
366,-1.2655
367,-1.2655
368,-1.2655
369,-1.2655
370,-1.2655
371,-1.2655
372,-1.2655
373,-1.2655
374,-1.2655
375,-1.2655
376,-1.2655
377,-1.2655
378,-1.2655
379,-1.2655
380,-1.2655
381,-1.2655
382,-1.2655
383,-1.2655
384,-1.2498
385,-1.2286
386,-1.1878
387,-1.1242
388,-1.0606
389,-0.99702
390,-0.9334399999999999
391,-0.86211
392,-0.79005
393,-0.70313
394,-0.60775
395,-0.5123800000000001
396,-0.41700000000000004
397,-0.32191
398,-0.22971
399,-0.13752
400,-0.2796
401,0.11779
402,0.10330999999999999
403,0.18279
404,0.26282
405,0.34442
406,0.42601999999999995
407,0.5211899999999999
408,0.61657
409,0.71194
410,0.8073100000000001
411,0.9017700000000001
412,0.9950200000000001
413,1.0835
414,1.1471
415,1.2107
416,1.2743
417,1.3379
418,1.4015
419,1.465
420,1.5127
421,1.5286
422,1.5445
423,1.5604
424,1.5763
425,1.5922
426,1.6081
427,1.6165
428,1.6175
429,1.6183
430,1.6183
431,1.6183
432,1.6183
433,1.6183
434,1.6183
435,1.6183
436,1.6183
437,1.6183
438,1.6183
439,1.6183
440,1.6183
441,1.5966
442,1.5712
443,1.5419999999999998
444,1.5103
445,1.4785
446,1.4467
447,1.4156
448,1.4071
449,1.3986
450,1.3965
451,1.3965
452,1.3965
453,1.3965
454,1.3922
455,1.371
456,1.3498
457,1.3188
458,1.287
459,1.2552
460,1.2234
461,1.1916
462,1.1598
463,1.1281
464,1.0963
465,1.0645
466,1.0327
467,1.0009
468,0.97377
469,0.95045
470,0.9291799999999999
471,0.9132899999999999
472,0.8973899999999999
473,0.88149
474,0.8656
475,0.8497
476,0.83381
477,0.81791
478,0.80202
479,0.7861199999999999
480,0.77022
481,0.7543300000000001
482,0.74415
483,0.73461
484,0.73102
485,0.73102
486,0.73102
487,0.73102
488,0.73102
489,0.73102
490,0.73102
491,0.73102
492,0.73102
493,0.73102
494,0.73102
495,0.73102
496,0.73102
497,0.73102
498,0.73102
499,0.73102
500,0.73102
501,0.73102
502,0.73102
503,0.73102
504,0.73102
505,0.73102
506,0.73102
507,0.73102
508,0.73102
509,0.73102
510,0.73102
511,0.73102
512,0.73102
513,0.73102
514,0.73102
515,0.73102
516,0.72939
517,0.72727
518,0.71053
519,0.67874
520,0.64695
521,0.61515
522,0.58336
523,0.55157
524,0.51978
525,0.49859
526,0.48268999999999995
527,0.46679
528,0.4509
529,0.435
530,0.41911000000000004
531,0.40321
532,0.37485
533,0.34410999999999997
534,0.31278
535,0.28099
536,0.2492
537,0.21741
538,0.18582
539,0.1678
540,0.14979
541,0.13334000000000001
542,0.11744
543,0.10155
544,0.42686999999999997
545,0.34739000000000003
546,0.26792
547,0.18844
548,0.10895999999999999
549,0.19458
550,-0.049998
551,-0.12947999999999998
552,-0.20895
553,-0.28843
554,-0.36791
555,-0.44738999999999995
556,-0.1051
557,-0.12099000000000001
558,-0.13689
559,-0.15278
560,-0.16868
561,-0.18457
562,-0.20047
563,-0.21636999999999998
564,-0.23226
565,-0.24816
566,-0.25728
567,-0.26364
568,-0.26723
569,-0.26723
570,-0.26723
571,-0.26723
572,-0.26723
573,-0.26723
574,-0.26723
575,-0.26723
576,-0.26723
577,-0.26723
578,-0.26723
579,-0.2668
580,-0.25938
581,-0.25196999999999997
582,-0.23790999999999998
583,-0.22202
584,-0.20611999999999997
585,-0.19022999999999998
586,-0.17728
587,-0.1741
588,-0.17092000000000002
589,-0.18599000000000002
590,-0.20188
591,-0.21778000000000003
592,-0.23367
593,-0.24741999999999997
594,-0.25801999999999997
595,-0.26723
596,-0.26723
597,-0.26723
598,-0.26723
599,-0.26723
600,-0.26723
601,-0.26723
602,-0.26723
603,-0.26723
604,-0.26723
605,-0.26723
606,-0.26723
607,-0.26963000000000004
608,-0.27281
609,-0.28207
610,-0.29796
611,-0.31386
612,-0.32976
613,-0.34565
614,-0.36155
615,-0.37744
616,-0.39334
617,-0.40923000000000004
618,-0.42513
619,-0.44101999999999997
620,-0.45692
621,-0.47281999999999996
622,-0.48871000000000003
623,-0.50461
624,-0.5205
625,-0.5364
626,-0.55229
627,-0.56819
628,-0.58409
629,-0.5999800000000001
630,1.4607
631,1.4607
632,1.4607
633,1.4607
634,1.4607
635,1.4607
636,1.4607
637,1.4607
638,1.4607
639,1.4607
640,1.4607
641,1.4607
642,1.4607
643,1.4607
644,1.4607
645,1.4607
646,1.4607
647,1.4607
648,1.4607
649,1.4607
650,1.4607
651,1.4123
652,1.3195
653,1.2209999999999999
654,1.1049
655,0.9889
656,0.87287
657,0.75685
658,0.70001
659,0.6690699999999999
660,0.65113
661,0.65113
662,0.65113
663,0.65113
664,0.65113
665,0.65113
666,0.65113
667,0.65113
668,0.65113
669,0.65113
670,0.65113
671,0.65113
672,0.65113
673,0.65113
674,0.65113
675,0.65113
676,0.65113
677,0.65113
678,0.65113
679,0.65113
680,0.65113
681,0.65113
682,0.65113
683,0.65113
684,0.65113
685,0.65113
686,0.65113
687,0.65113
688,0.65113
689,0.65113
690,0.65113
691,0.65113
692,0.65113
693,0.65113
694,0.65113
695,0.65113
696,0.65113
697,0.65113
698,0.65113
699,0.60825
700,0.55024
701,0.43842
702,0.26438
703,0.4503
704,-0.4199
705,-0.25774
706,-0.40353
707,-0.5466300000000001
708,-0.63547
709,-0.6934899999999999
710,-0.7515
711,-0.8095100000000001
712,-0.8675299999999999
713,-0.9255399999999999
714,-0.98355
715,-1.0416
716,-1.0996
717,-1.1576
718,-1.2156
719,-1.2676
720,-1.3024
721,-1.3372
722,-1.2233
723,-1.1073
724,-0.99129
725,-0.87526
726,-0.7609199999999999
727,-0.64876
728,-0.54523
729,-0.48722
730,-0.42921000000000004
731,-0.37119
732,-0.31318
733,-0.25516
734,-0.19715
735,-0.1198
736,-0.13699
737,0.11225
738,0.22828
739,0.34431
740,0.46033
741,0.57636
742,0.66492
743,0.7268
744,0.78779
745,0.8458
746,0.90381
747,0.96183
748,1.0198
749,1.0436
750,1.0513
751,1.0559
752,1.0559
753,1.0559
754,1.0559
755,1.0559
756,1.0163
757,0.9698399999999999
758,0.9167
759,0.85869
760,0.8006800000000001
761,0.74266
762,0.68465
763,0.62664
764,0.56863
765,0.51061
766,0.4526
767,0.39458000000000004
768,0.33657
769,0.29425
770,0.31359000000000004
771,0.33293
772,0.38814
773,0.44615
774,0.50417
775,0.56218
776,0.62019
777,0.6782100000000001
778,0.73622
779,0.79423
780,0.85225
781,0.9102600000000001
782,0.9682700000000001
783,1.0092
784,1.0363
785,1.0559
786,1.0559
787,1.0559
788,1.0559
789,1.0559
790,1.0363
791,1.0092
792,0.9682700000000001
793,0.9102600000000001
794,0.85225
795,0.79423
796,0.73622
797,0.69906
798,0.66425
799,0.65113
800,0.65113
801,0.65113
802,0.65113
803,0.65113
804,0.65113
805,0.65113
806,0.65113
807,0.65113
808,0.65113
809,0.65113
810,0.65113
811,0.65113
812,0.65113
813,0.65113
814,0.65113
815,0.65113
816,0.65113
817,0.65113
818,0.65113
819,0.65113
820,0.65113
821,0.65113
822,0.65113
823,0.65113
824,0.65113
825,0.65113
826,0.65113
827,0.65113
828,0.65113
829,0.65113
830,0.65113
831,0.6481600000000001
832,0.6442899999999999
833,0.61375
834,0.5557300000000001
835,0.49772
836,0.43971000000000005
837,0.38169000000000003
838,0.32368
839,0.26566999999999996
840,0.20765
841,0.14964
842,0.45674
843,0.16668
844,-0.12339000000000001
845,-0.41346000000000005
846,-0.14043
847,-0.28947
848,-0.45577
849,-0.62645
850,-0.8004899999999999
851,-0.9745299999999999
852,-1.1486
853,-1.3204
854,-1.3436
855,-1.3668
856,-1.3729
857,-1.3729
858,-1.3729
859,-1.3729
860,-1.3816
861,-1.4280000000000002
862,-1.4745
863,-1.5315
864,-1.5895
865,-1.6475
866,-1.7055
867,-1.7481
868,-1.7636
869,-1.7777
870,-1.7777
871,-1.7777
872,-1.7777
873,-1.7777
874,-1.7777
875,-1.7777
876,-1.7777
877,-1.7777
878,-1.7777
879,-1.7777
880,-1.7777
881,-1.7777
882,-1.7777
883,-1.7777
884,-1.7777
885,-1.7777
886,-1.7777
887,-1.7777
888,-1.7777
889,-1.7777
890,-1.7777
891,-1.7777
892,-1.7777
893,-1.7777
894,-1.7761
895,-1.7491
896,-1.722
897,-1.6707
898,-1.6127
899,-1.5547
900,-1.4967
901,-1.4386
902,-1.3806
903,-1.3226
904,-1.2646
905,-1.2066
906,-1.1486
907,-1.0906
908,-1.0325
909,-0.9745299999999999
910,-0.9165200000000001
911,-0.8585
912,-0.8004899999999999
913,-0.74248
914,-0.6844600000000001
915,-0.63542
916,-0.5928800000000001
917,-0.56328
918,-0.56328
919,-0.56328
920,-0.56328
921,-0.56328
922,-0.56328
923,-0.56328
924,-0.56328
925,-0.56328
926,-0.56328
927,-0.56328
928,-0.56328
929,-0.56328
930,-0.56328
931,-0.56328
932,-0.56328
933,-0.56328
934,-0.56328
935,-0.56328
936,-0.56328
937,-0.56328
938,-0.56328
939,-0.56328
940,-0.56328
941,-0.56328
942,-0.56328
943,-0.56328
944,-0.56328
