time,value
0,0.9879399999999999
1,0.9879399999999999
2,0.9879399999999999
3,0.9879399999999999
4,0.9879399999999999
5,0.9879399999999999
6,0.9879399999999999
7,0.9879399999999999
8,0.9879399999999999
9,0.9879399999999999
10,0.9879399999999999
11,0.9879399999999999
12,0.9879399999999999
13,0.9879399999999999
14,0.9879399999999999
15,0.9879399999999999
16,0.9879399999999999
17,0.9879399999999999
18,0.9879399999999999
19,0.9879399999999999
20,0.9879399999999999
21,0.9879399999999999
22,0.9879399999999999
23,0.9879399999999999
24,0.9879399999999999
25,0.9879399999999999
26,0.9879399999999999
27,0.9879399999999999
28,0.9879399999999999
29,0.9879399999999999
30,0.9879399999999999
31,0.9879399999999999
32,0.9879399999999999
33,0.9879399999999999
34,0.9879399999999999
35,0.9879399999999999
36,0.9879399999999999
37,0.9879399999999999
38,0.9879399999999999
39,0.9879399999999999
40,0.9879399999999999
41,0.9879399999999999
42,0.9879399999999999
43,0.9879399999999999
44,0.9879399999999999
45,0.9879399999999999
46,0.9879399999999999
47,0.9879399999999999
48,0.9879399999999999
49,0.9879399999999999
50,0.9879399999999999
51,0.9879399999999999
52,0.9879399999999999
53,0.9879399999999999
54,0.9879399999999999
55,0.9879399999999999
56,0.9879399999999999
57,0.9879399999999999
58,0.9879399999999999
59,0.9879399999999999
60,0.9879399999999999
61,0.9879399999999999
62,0.9879399999999999
63,0.9879399999999999
64,0.9879399999999999
65,0.9879399999999999
66,0.9879399999999999
67,0.9879399999999999
68,0.9879399999999999
69,0.9879399999999999
70,0.9879399999999999
71,0.9879399999999999
72,0.9879399999999999
73,0.9879399999999999
74,0.9890000000000001
75,0.99805
76,1.0076
77,1.0187
78,1.0298
79,1.0408
80,1.0519
81,1.0629
82,1.074
83,1.0851
84,1.0961
85,1.1072
86,1.1182
87,1.1293
88,1.1404
89,1.1514
90,1.1625
91,1.1676
92,1.1666
93,1.1591
94,1.148
95,1.1369
96,1.1259
97,1.1196
98,1.1142
99,1.1142
100,1.1142
101,1.1142
102,1.1126
103,1.1085
104,1.1005
105,1.0895
106,1.0784
107,1.0674
108,1.0537
109,1.0394
110,1.0173
111,0.99518
112,0.97306
113,0.95094
114,0.9288200000000001
115,0.9067
116,0.88459
117,0.8624700000000001
118,0.84035
119,0.81823
120,0.79611
121,0.774
122,0.75188
123,0.7297600000000001
124,0.7076399999999999
125,0.68552
126,0.66783
127,0.65677
128,0.64571
129,0.63465
130,0.62359
131,0.61253
132,0.60148
133,0.59042
134,0.57936
135,0.5683
136,0.55724
137,0.54618
138,0.5351199999999999
139,0.5240600000000001
140,0.513
141,0.5019399999999999
142,0.49088999999999994
143,0.48607
144,0.48306000000000004
145,0.48283999999999994
146,0.48283999999999994
147,0.48283999999999994
148,0.47953
149,0.46546000000000004
150,0.44826000000000005
151,0.42613999999999996
152,0.40402
153,0.3819
154,0.36396999999999996
155,0.34789000000000003
156,0.33605999999999997
157,0.325
158,0.31394
159,0.30134
160,0.28023000000000003
161,0.25543000000000005
162,0.22225
163,0.18908
164,0.1559
165,0.12517999999999999
166,0.4816
167,0.36273
168,0.25214000000000003
169,0.14155
170,0.20851
171,-0.079626
172,-0.19022
173,-0.30080999999999997
174,-0.4114
175,-0.10469
176,-0.12787
177,-0.152
178,-0.18231
179,-0.21548
180,-0.24866
181,-0.28184000000000003
182,-0.31303000000000003
183,-0.34135
184,-0.35241
185,-0.36346999999999996
186,-0.37453000000000003
187,-0.38559
188,-0.39665
189,-0.41434
190,-0.43646
191,-0.45858000000000004
192,-0.4807
193,-0.5028199999999999
194,-0.5243399999999999
195,-0.53641
196,-0.5482600000000001
197,-0.5593199999999999
198,-0.57038
199,-0.58144
200,-0.58313
201,-0.57609
202,-0.5663600000000001
203,-0.5553
204,-0.54424
205,-0.53318
206,-0.53783
207,-0.5436300000000001
208,-0.55469
209,-0.56575
210,-0.57681
211,-0.58787
212,-0.5989300000000001
213,-0.6099899999999999
214,-0.62105
215,-0.6321100000000001
216,-0.6431600000000001
217,-0.66501
218,-0.68861
219,-0.72178
220,-0.7549600000000001
221,-0.78814
222,-0.8195399999999999
223,-0.8476899999999999
224,-0.87279
225,-0.89491
226,-0.9170299999999999
227,-0.93914
228,-0.96126
229,-0.9833799999999999
230,-1.0055
231,-1.0276
232,-1.0497
233,-1.071
234,-1.0901
235,-1.1058
236,-1.1169
237,-1.128
238,-1.139
239,-1.1486
240,-1.1577
241,-1.1587
242,-1.1587
243,-1.1587
244,-1.1587
245,-1.1587
246,-1.1587
247,-1.1587
248,-1.1587
249,-1.1587
250,-1.1587
251,-1.1587
252,-1.1587
253,-1.1587
254,-1.1587
255,-1.1587
256,-1.1587
257,-1.1587
258,-1.1587
259,-1.1587
260,-1.1587
261,-1.1587
262,-1.1587
263,-1.1652
264,-1.1743
265,-1.1851
266,-1.1961
267,-1.2072
268,-1.2182
269,-1.2293
270,-1.2404
271,-1.2514
272,-1.2625
273,-1.2735
274,-1.2846
275,-1.2956
276,-1.3067
277,-1.3178
278,-1.3288
279,-1.3393
280,-1.3443
281,-1.3481
282,-1.3481
283,-1.3481
284,-1.3481
285,-1.3509
286,-1.3559
287,-1.3652
288,-1.3763
289,-1.3873
290,-1.3984
291,-1.4135
292,-1.4298
293,-1.4519
294,-1.474
295,-1.4961
296,-1.5182
297,-1.5404
298,-1.5625
299,-1.5846
300,-1.6067
301,-1.6288
302,-1.6528
303,-1.6777
304,-1.7109
305,-1.744
306,-1.7772
307,-1.81
308,-1.8422
309,-1.8689
310,-1.891
311,-1.9131
312,-1.9353
313,-1.9574
314,-1.9795
315,0.51326
316,0.51326
317,0.51326
318,0.51326
319,0.51326
320,0.51326
321,0.51326
322,0.51326
323,0.51326
324,0.51326
325,0.51326
326,0.51326
327,0.51326
328,0.51326
329,0.51326
330,0.51326
331,0.51326
332,0.51326
333,0.51326
334,0.51326
335,0.51326
336,0.51326
337,0.51326
338,0.51326
339,0.51326
340,0.51326
341,0.51326
342,0.51326
343,0.51326
344,0.51326
345,0.51326
346,0.51326
347,0.51326
348,0.51326
349,0.51326
350,0.51326
351,0.51326
352,0.51326
353,0.51326
354,0.51326
355,0.51326
356,0.51326
357,0.51326
358,0.51326
359,0.51326
360,0.51326
361,0.51326
362,0.51326
363,0.51326
364,0.51326
365,0.51326
366,0.51326
367,0.51326
368,0.51326
369,0.51326
370,0.51326
371,0.51326
372,0.51326
373,0.51326
374,0.51326
375,0.51326
376,0.51326
377,0.51326
378,0.51326
379,0.51326
380,0.51326
381,0.51326
382,0.51326
383,0.51326
384,0.53192
385,0.5602600000000001
386,0.5909
387,0.62207
388,0.6532399999999999
389,0.6844100000000001
390,0.71558
391,0.74675
392,0.77792
393,0.80909
394,0.84026
395,0.85836
396,0.8668600000000001
397,0.86916
398,0.86916
399,0.86916
400,0.8698600000000001
401,0.8897
402,0.9116700000000001
403,0.94284
404,0.97401
405,1.0052
406,1.0279
407,1.0421
408,1.0471
409,1.0471
410,1.0471
411,1.0471
412,1.0471
413,1.0471
414,1.0471
415,1.0471
416,1.0471
417,1.0471
418,1.0471
419,1.0471
420,1.0471
421,1.0471
422,1.0471
423,1.0471
424,1.0471
425,1.0471
426,1.0471
427,1.0471
428,1.0471
429,1.0471
430,1.0471
431,1.0471
432,1.0471
433,1.0471
434,1.0471
435,1.0471
436,1.0471
437,1.0471
438,1.0471
439,1.0471
440,1.0471
441,1.0346
442,1.0035
443,0.97231
444,0.94114
445,0.9099700000000001
446,0.8788
447,0.8719600000000001
448,0.86916
449,0.86916
450,0.86916
451,0.86916
452,0.86916
453,0.86916
454,0.86916
455,0.86916
456,0.86916
457,0.86916
458,0.86916
459,0.86916
460,0.86916
461,0.86916
462,0.86916
463,0.86916
464,0.86916
465,0.86916
466,0.86916
467,0.86916
468,0.86916
469,0.86916
470,0.86916
471,0.86916
472,0.86916
473,0.86916
474,0.86916
475,0.86916
476,0.86916
477,0.86916
478,0.86916
479,0.86916
480,0.86916
481,0.86916
482,0.86916
483,0.86916
484,0.86916
485,0.86856
486,0.86006
487,0.84649
488,0.8153199999999999
489,0.78415
490,0.75298
491,0.7218100000000001
492,0.6906399999999999
493,0.65947
494,0.6283
495,0.59713
496,0.56596
497,0.53199
498,0.49399
499,0.43165
500,0.36930999999999997
501,0.30696999999999997
502,0.24463000000000001
503,0.18229
504,0.11995
505,0.28951
506,-0.14585
507,-0.33389
508,-0.12941
509,-0.19009
510,-0.22409
511,-0.25749
512,-0.28865999999999997
513,-0.31983
514,-0.35100000000000003
515,-0.36896999999999996
516,-0.37464000000000003
517,-0.37651
518,-0.37651
519,-0.37651
520,-0.37651
521,-0.37651
522,-0.37651
523,-0.37651
524,-0.37651
525,-0.37651
526,-0.36787
527,-0.34804
528,-0.32153000000000004
529,-0.29036
530,-0.25919000000000003
531,-0.22801999999999997
532,-0.22726
533,-0.23142
534,-0.26259
535,-0.29375999999999997
536,-0.32493
537,-0.3561
538,-0.38727
539,-0.41844
540,-0.44961
541,-0.48078000000000004
542,-0.51195
543,-0.55232
544,-0.59483
545,-0.65647
546,-0.7188100000000001
547,-0.78115
548,-0.84349
549,-0.9058299999999999
550,-0.9681700000000001
551,-1.0305
552,-1.0928
553,-1.1552
554,-1.2093
555,-1.2603
556,-1.2663
557,-1.2663
558,-1.2663
559,-1.2668
560,-1.2696
561,-1.2821
562,-1.3133
563,-1.3445
564,-1.3756
565,-1.4068
566,-1.4380000000000002
567,-1.4193
568,-1.3881
569,-1.3569
570,-1.3258
571,-1.2946
572,-1.2781
573,-1.3036
574,-1.3314
575,-1.3626
576,-1.3938
577,-1.425
578,-1.4378
579,-1.4435
580,-1.4442
581,-1.4442
582,-1.4442
583,-1.4482
584,-1.4709
585,-1.4964
586,-1.5275
587,-1.5587
588,-1.5899
589,-1.621
590,-1.6522
591,-1.6834
592,-1.7146
593,-1.7457
594,-1.7753
595,-1.7895
596,-1.8001
597,-1.8001
598,-1.8001
599,-1.8001
600,-1.7923
601,-1.7781
602,-1.7519999999999998
603,-1.7208
604,-1.6896
605,-1.6586
606,-1.6387
607,-1.6222
608,-1.6222
609,-1.6222
610,-1.6222
611,-1.6222
612,-1.6222
613,-1.6222
614,-1.6222
615,-1.6222
616,-1.6222
617,-1.6274
618,-1.6352
619,-1.6664
620,-1.6975
621,-1.7287
622,-1.7599
623,-1.7911
624,-1.8222
625,-1.8534
626,-1.8846
627,-1.9157
628,-1.9469
629,-1.9781
630,1.2074
631,1.2074
632,1.2074
633,1.2074
634,1.2074
635,1.2074
636,1.2074
637,1.2074
638,1.2074
639,1.2074
640,1.2074
641,1.2074
642,1.2074
643,1.2074
644,1.2074
645,1.2074
646,1.2074
647,1.2074
648,1.2074
649,1.2074
650,1.2074
651,1.2074
652,1.2074
653,1.2074
654,1.2074
655,1.2074
656,1.2074
657,1.2074
658,1.2074
659,1.2074
660,1.2074
661,1.2074
662,1.2074
663,1.2074
664,1.2074
665,1.2074
666,1.2074
667,1.2074
668,1.2074
669,1.2074
670,1.2074
671,1.2074
672,1.2074
673,1.2074
674,1.2074
675,1.2074
676,1.2074
677,1.2074
678,1.2074
679,1.2074
680,1.2074
681,1.2074
682,1.2074
683,1.2074
684,1.2074
685,1.2074
686,1.2074
687,1.2074
688,1.2074
689,1.2074
690,1.2074
691,1.2074
692,1.2074
693,1.1952
694,1.1340000000000001
695,1.0728
696,1.0116
697,0.95047
698,0.88928
699,0.86475
700,0.8591799999999999
701,0.85814
702,0.85814
703,0.85814
704,0.85814
705,0.85814
706,0.85814
707,0.85814
708,0.85814
709,0.85814
710,0.88379
711,0.9282799999999999
712,0.98495
713,1.0461
714,1.1073
715,1.1658
716,1.1491
717,1.124
718,1.0628
719,1.0016
720,0.9404600000000001
721,0.8792700000000001
722,0.81809
723,0.7569100000000001
724,0.6957300000000001
725,0.63454
726,0.5733600000000001
727,0.53868
728,0.50884
729,0.50884
730,0.50884
731,0.50884
732,0.50884
733,0.50884
734,0.50884
735,0.50884
736,0.50884
737,0.50884
738,0.50884
739,0.50884
740,0.50884
741,0.50884
742,0.50884
743,0.5051800000000001
744,0.49405
745,0.45878
746,0.3976
747,0.33642
748,0.27524
749,0.21844
750,0.16282
751,0.15954000000000002
752,0.15954000000000002
753,0.15954000000000002
754,0.15954000000000002
755,0.15954000000000002
756,0.13507
757,0.37091999999999997
758,0.06500700000000001
759,-0.24090999999999999
760,-0.10966
761,-0.17084000000000002
762,-0.18425
763,-0.18975
764,-0.18975
765,-0.18975
766,-0.18975
767,-0.18975
768,-0.18975
769,-0.18975
770,-0.18975
771,-0.18975
772,-0.18975
773,-0.18975
774,-0.18975
775,-0.18975
776,-0.18975
777,-0.18975
778,-0.19891
779,-0.23785
780,-0.28542
781,-0.3466
782,-0.40778000000000003
783,-0.46897
784,-0.50698
785,-0.53479
786,-0.53905
787,-0.53905
788,-0.53905
789,-0.53905
790,-0.53905
791,-0.53905
792,-0.53905
793,-0.53905
794,-0.53905
795,-0.53905
796,-0.53905
797,-0.53905
798,-0.53905
799,-0.53905
800,-0.5414
801,-0.5747800000000001
802,-0.6280399999999999
803,-0.75041
804,-0.87277
805,-0.9951399999999999
806,-1.1175
807,-1.2399
808,-1.3622
809,-1.4846
810,-1.607
811,-1.7293
812,-1.8462
813,-1.9551
814,-2.0163
815,-2.0775
816,-2.1387
817,-2.1999
818,-2.2611
819,-2.2855
820,-2.2855
821,-2.2855
822,-2.2855
823,-2.2855
824,-2.2855
825,-2.2855
826,-2.2855
827,-2.2855
828,-2.2855
829,-2.2855
830,-2.2855
831,-2.2855
832,-2.2855
833,-2.2855
834,-2.2855
835,-2.2855
836,-2.1986
837,-2.1053
838,-1.983
839,-1.8606
840,-1.7382
841,-1.6159
842,-1.4935
843,-1.3711
844,-1.2488
845,-1.1264
846,-1.004
847,-0.8816700000000001
848,-0.7593
849,-0.63694
850,-0.51457
851,-0.39221
852,-0.27965999999999996
853,-0.18511
854,-0.10743
855,-0.22978
856,0.076132
857,0.38204
858,0.11924000000000001
859,0.15817
860,0.15954000000000002
861,0.15954000000000002
862,0.15954000000000002
863,0.15050999999999998
864,0.11714000000000001
865,0.23187
866,-0.37995999999999996
867,-0.19865
868,-0.32101999999999997
869,-0.43527
870,-0.54651
871,-0.61358
872,-0.67476
873,-0.7359399999999999
874,-0.79503
875,-0.84509
876,-0.8572
877,-0.79601
878,-0.73483
879,-0.67365
880,-0.61247
881,-0.55128
882,-0.44116000000000005
883,-0.31879
884,-0.19643
885,-0.36883
886,0.24299
887,0.14188
888,0.153
889,0.15954000000000002
890,0.15954000000000002
891,0.15954000000000002
892,0.15954000000000002
893,0.15954000000000002
894,0.15954000000000002
895,0.15954000000000002
896,0.15954000000000002
897,0.15954000000000002
898,0.15169000000000002
899,0.1072
900,0.28749
901,-0.12072999999999999
902,-0.32434
903,-0.12634
904,-0.18753
905,-0.24871
906,-0.30989
907,-0.37106999999999996
908,-0.43226000000000003
909,-0.4903
910,-0.5181100000000001
911,-0.53905
912,-0.53905
913,-0.53905
914,-0.53905
915,-0.53905
916,-0.53905
917,-0.53905
918,-0.53905
919,-0.53905
920,-0.53905
921,-0.53905
922,-0.53905
923,-0.53905
924,-0.53905
925,-0.53905
926,-0.5233399999999999
927,-0.48996999999999996
928,-0.40110999999999997
929,-0.27874
930,-0.15638
931,-0.1686
932,0.33984000000000003
933,0.15954000000000002
934,0.15954000000000002
935,0.15954000000000002
936,0.15954000000000002
937,0.15954000000000002
938,0.15954000000000002
939,0.15954000000000002
940,0.15954000000000002
941,0.15954000000000002
942,0.15954000000000002
943,0.15954000000000002
944,0.15954000000000002
