time,value
0,-0.47229
1,0.25255
2,1.1178
3,2.0191
4,2.8386
5,3.4656
6,3.8161
7,3.8479
8,3.568
9,3.0305
10,2.3254
11,1.5617
12,0.8472700000000001
13,0.26987
14,-0.11655
15,-0.2982
16,-0.29961
17,-0.1743
18,0.0092529
19,0.18325999999999998
20,0.29444000000000004
21,0.31318
22,0.23663
23,0.085576
24,-0.10343
25,-0.28857
26,-0.43313
27,-0.51348
28,-0.5231
29,-0.4721
30,-0.38297
31,-0.28386
32,-0.20134000000000002
33,-0.1544
34,-0.15093
35,-0.18731
36,-0.25077
37,-0.32366999999999996
38,-0.38871999999999995
39,-0.43238000000000004
40,-0.44814
41,-0.43708
42,-0.40659
43,-0.36773
44,-0.33225
45,-0.3092
46,-0.30315
47,-0.31388
48,-0.33697
49,-0.36551
50,-0.39234
51,-0.41162
52,-0.41986
53,-0.41681
54,-0.40494
55,-0.38845999999999997
56,-0.3722
57,-0.36039
58,-0.35548
59,-0.35813
60,-0.36726
61,-0.38049
62,-0.39485
63,-0.40765999999999997
64,-0.41648
65,-0.42001000000000005
66,-0.41815
67,-0.41186000000000006
68,-0.40299
69,-0.39594
70,-0.39011
71,-0.38766999999999996
72,-0.39046
73,-0.39928
74,-0.4135
75,-0.43158
76,-0.44987
77,-0.4647
78,-0.47318000000000005
79,-0.47375
80,-0.46674
81,-0.45471000000000006
82,-0.44151
83,-0.43182
84,-0.43027
85,-0.43998000000000004
86,-0.4615
87,-0.49231
88,-0.52678
89,-0.55684
90,-0.57375
91,-0.5696399999999999
92,-0.5392399999999999
93,-0.48118
94,-0.3986
95,-0.29852
96,-0.1911
97,-0.087715
98,0.0010899
