time,value
0,-0.54967
1,-0.54967
2,-0.54967
3,-0.54967
4,-0.54967
5,-0.54967
6,-0.54967
7,-0.54967
8,-0.54967
9,-0.54967
10,-0.54967
11,-0.54967
12,-0.54967
13,-0.54967
14,-0.54967
15,-0.54967
16,-0.54967
17,-0.5051100000000001
18,-0.36685999999999996
19,-0.11739000000000001
20,0.16324
21,0.44013
22,0.69714
23,0.92886
24,1.1477
25,1.337
26,1.5101
27,1.6773
28,1.7931
29,1.909
30,2.0248
31,2.1306
32,2.2048
33,2.2633
34,2.3011
35,2.3181
36,2.3181
37,2.3181
38,2.3181
39,2.3181
40,2.3181
41,2.3181
42,2.3181
43,2.2817
44,2.2273
45,2.1637
46,2.0661
47,1.9528
48,1.8530000000000002
49,1.7609
50,1.6587
51,1.5006
52,1.3735
53,1.2577
54,1.1418
55,1.0259
56,0.86062
57,0.68775
58,0.5139600000000001
59,0.33848
60,0.12711
61,-0.12389000000000001
62,-0.37525
63,-0.5969
64,-0.75112
65,-0.87011
66,-0.99561
67,-1.1601
68,-1.369
69,-1.369
70,-1.4961
71,-1.5907
72,-1.6243
73,-1.6658
74,-1.7229
75,-1.7416
76,-1.7457
77,-1.7635
78,-1.8269
79,-1.7907
80,-1.7328
81,-1.6749
82,-1.6169
83,-1.671
84,-1.7286
85,-1.7491
86,-1.7181
87,-1.6996
88,-1.6684
89,-1.6056
90,-1.5176
91,-1.4233
92,-1.3654
93,-1.3075
94,-1.2525
95,-1.2187
96,-1.2767
97,-1.3346
98,-1.3925
99,-1.396
100,-1.2788
101,-1.105
102,-0.93117
103,-0.78114
104,-0.67023
105,-0.6123
106,-0.56642
107,-0.54511
108,-0.52044
109,-0.46251000000000003
110,-0.40458
111,-0.30515
112,-0.19165
113,-0.093625
114,-0.060224
115,-0.025115000000000002
116,-0.013234000000000001
117,-0.026452999999999997
118,-0.058043
119,-0.058043
120,-0.048974000000000004
121,-0.010412000000000001
122,0.065647
123,0.18151
124,0.29736999999999997
125,0.3435
126,0.31553000000000003
127,0.23148000000000002
128,0.19391
129,0.18777
130,0.18777
131,0.18199
132,0.16085
133,0.11823
134,0.099346
135,0.070642
136,0.023895
137,0.023895
138,0.023895
139,-0.0047389
140,-0.030467
141,-0.0031902
142,-0.019369
143,-0.043452
144,-0.058043
145,-0.058043
146,-0.058043
147,-0.058043
148,-0.058043
149,-0.058043
150,-0.058043
151,-0.058043
152,-0.058043
153,-0.058043
154,-0.066403
155,-0.10737000000000001
156,-0.16399
157,-0.22191999999999998
158,-0.27985
159,-0.33909
160,-0.41398999999999997
161,-0.51276
162,-0.59351
163,-0.65144
164,-0.70937
165,-0.8755
166,-1.0145
167,-1.1173
168,-1.1828
169,-1.2018
170,-1.2052
171,-1.1906
172,-1.161
173,-1.124
174,-1.1378
175,-1.1765
176,-1.2052
177,-1.2052
178,-1.2052
179,-1.2052
180,-1.2052
181,-1.2052
182,-1.2052
183,-1.2052
184,-1.1604
185,-1.0857
186,-0.997
187,-0.9202799999999999
188,-0.8316
189,-0.79955
190,-0.82237
191,-0.8774200000000001
192,-0.8774200000000001
193,-0.8774200000000001
194,-0.8553
195,-0.79082
196,-0.6514800000000001
197,-0.48078000000000004
198,-0.32503000000000004
199,-0.19008
200,-0.075312
201,0.023847999999999998
202,0.099082
203,0.19142
204,0.30728
205,0.42315
206,0.53901
207,0.65487
208,0.80424
209,1.0082
210,1.2013
211,1.3787
212,1.5384
213,1.6675
214,1.7421
215,1.7446
216,1.7387
217,1.7101
218,1.6522
219,1.5943
220,1.4905
221,1.349
222,1.1938
223,1.0625
224,0.9466100000000001
225,0.83075
226,0.7255
227,0.6420100000000001
228,0.6026
229,0.59746
230,0.5897899999999999
231,0.54543
232,0.4315
233,0.37356999999999996
234,0.31563
235,0.27913000000000004
236,0.27697
237,0.31742
238,0.34263000000000005
239,0.36918
240,0.415
241,0.49638000000000004
242,0.5958
243,0.6471100000000001
244,0.63764
245,0.5797100000000001
246,0.52178
247,0.51608
248,0.51552
249,0.53164
250,0.57397
251,0.59354
252,0.57157
253,0.55328
254,0.55819
255,0.59577
256,0.61117
257,0.64362
258,0.64599
259,0.58806
260,0.53013
261,0.51718
262,0.54192
263,0.58155
264,0.5972
265,0.5617800000000001
266,0.53155
267,0.50532
268,0.47891000000000006
269,0.43925
270,0.43358
271,0.42998000000000003
272,0.40861
273,0.35165
274,0.35165
275,0.35165
276,0.35165
277,0.34492
278,0.30473
279,0.21855
280,0.12912
281,0.051033999999999996
282,-0.0062364
283,-0.047988
284,-0.058043
285,-0.058043
286,-0.058043
287,-0.058043
288,-0.058043
289,-0.058043
290,-0.073523
291,-0.11857999999999999
292,-0.17651
293,-0.20915999999999998
294,-0.22191999999999998
295,-0.22643000000000002
296,-0.24652
297,-0.289
298,-0.3092
299,-0.33542
300,-0.38579
301,-0.38579
302,-0.38579
303,-0.41147
304,-0.44073
305,-0.41463
306,-0.39259
307,-0.40649
308,-0.4381
309,-0.46773000000000003
310,-0.46773000000000003
311,-0.45758999999999994
312,-0.4231
313,-0.38579
314,-0.38579
