time,value
0,0.026045
1,-0.4945
2,0.031304000000000005
3,-0.045600999999999996
4,-0.21899000000000002
5,-0.057878
6,0.18489
7,0.2683
8,-0.035125
9,0.0025971999999999996
10,-0.69357
11,-0.25685
12,-0.06686
13,0.17931
14,-0.41341000000000006
15,0.020814
16,0.066087
17,0.1787
18,-0.36739
19,0.22858
20,0.078966
21,0.030604000000000003
22,0.30895
23,-0.16549
24,-0.050739
25,0.13726
26,-0.43537
27,0.312
28,0.22998000000000002
29,-0.63674
30,0.20135999999999998
31,0.18625999999999998
32,0.06179400000000001
33,-0.70813
34,-0.26548
35,0.1348
36,0.2755
37,-0.089324
38,-0.16249
39,-0.15034
40,0.38918
41,0.01757
42,-1.5483
43,-1.5483
44,-1.5483
45,-1.5483
46,-1.5483
47,-1.5483
48,-1.5483
49,-1.5483
50,-1.5483
51,1.56
52,1.56
53,1.56
54,1.56
55,1.56
56,1.56
57,1.56
58,1.56
59,1.56
60,-0.16924
61,-0.15533
62,0.42632
63,0.047562
64,0.0087801
65,-0.12012
66,-0.14552
67,-0.18475999999999998
68,0.022943
69,0.071662
70,0.27813000000000004
71,-0.71417
72,0.22091999999999998
73,0.23399999999999999
74,0.15122
75,-0.090935
76,0.11233
77,0.33168000000000003
78,-1.5483
79,-1.5483
80,-1.5483
81,-1.5483
82,-1.5483
83,-1.5483
84,-1.5483
85,-1.5483
86,-1.5483
87,-1.5483
88,-1.5483
89,-1.5483
90,-1.5483
91,-1.5483
92,-1.5483
93,-1.5483
94,1.56
95,1.56
96,1.56
97,1.56
98,1.56
99,1.56
100,1.56
101,1.56
102,1.56
103,1.56
104,1.56
105,1.56
106,1.56
107,1.56
108,1.56
109,1.56
110,0.5426300000000001
111,-0.28773000000000004
112,-0.00048199
113,0.3856
114,0.06714500000000001
115,-0.0036113
116,0.10079
117,0.45224
118,-0.017855000000000003
119,-0.11545
120,0.07595199999999999
121,0.31444
122,0.43382
123,-0.24993
124,0.53365
125,-0.30975
126,-0.52994
127,-0.244
