time,value
0,-0.072608
1,-0.072608
2,-0.072608
3,-0.072608
4,-0.072608
5,-0.072608
6,-0.072608
7,-0.072608
8,-0.072608
9,-0.072608
10,-0.072608
11,-0.072608
12,-0.072608
13,-0.072608
14,-0.072608
15,-0.072608
16,-0.072608
17,-0.072608
18,-0.072608
19,-0.072608
20,-0.072608
21,-0.072608
22,-0.072608
23,-0.072608
24,-0.072608
25,-0.072608
26,-0.072608
27,-0.072608
28,-0.072608
29,-0.072608
30,-0.072608
31,-0.072608
32,-0.072608
33,-0.072608
34,-0.072608
35,-0.072608
36,-0.072608
37,-0.072608
38,-0.072608
39,-0.072608
40,-0.072608
41,-0.072608
42,-0.072608
43,-0.072608
44,-0.072608
45,-0.072608
46,-0.072608
47,-0.072608
48,-0.072608
49,-0.072608
50,-0.072608
51,-0.072608
52,-0.072608
53,-0.072608
54,-0.072608
55,-0.072608
56,-0.072608
57,-0.072608
58,-0.072608
59,-0.072608
60,-0.072608
61,-0.072608
62,-0.072608
63,-0.072608
64,-0.072608
65,-0.072608
66,-0.072608
67,-0.072608
68,-0.072608
69,-0.072608
70,-0.072608
71,-0.072608
72,-0.072608
73,-0.072608
74,-0.072608
75,-0.072608
76,-0.072608
77,-0.072608
78,-0.072608
79,-0.072608
80,-0.072608
81,-0.072608
82,-0.072608
83,-0.072608
84,-0.072608
85,-0.072608
86,-0.072608
87,-0.072608
88,-0.072608
89,-0.072608
90,-0.072608
91,-0.072608
92,-0.072608
93,-0.072608
94,-0.072608
95,-0.072608
96,-0.072608
97,-0.072608
98,-0.072608
99,-0.072608
100,-0.072608
101,-0.072608
102,-0.072608
103,-0.072608
104,-0.072608
105,-0.072608
106,-0.072608
107,-0.072608
108,-0.072608
109,-0.072608
110,-0.072608
111,-0.072608
112,-0.072608
113,-0.072608
114,-0.072608
115,-0.072608
116,-0.072608
117,-0.072608
118,-0.072608
119,-0.072608
120,-0.072608
121,-0.072608
122,-0.072608
123,-0.072608
124,-0.072608
125,-0.072608
126,-0.072608
127,-0.072608
128,-0.072608
129,-0.072608
130,-0.072608
131,-0.072608
132,-0.072608
133,-0.072608
134,-0.072608
135,-0.072608
136,-0.072608
137,-0.072608
138,-0.072608
139,-0.072608
140,-0.072608
141,-0.072608
142,-0.072608
143,-0.072608
144,-0.072608
145,-0.072608
146,-0.072608
147,-0.072608
148,-0.072608
149,-0.072608
150,-0.072608
151,-0.072608
152,-0.072608
153,-0.072608
154,-0.072608
155,-0.072608
156,-0.072608
157,-0.072608
158,-0.072608
159,-0.072608
160,-0.072608
161,-0.072608
162,-0.072608
163,-0.072608
164,-0.072608
165,-0.072608
166,-0.072608
167,-0.072608
168,-0.072608
169,-0.072608
170,-0.072608
171,-0.072608
172,-0.072608
173,-0.072608
174,-0.072608
175,-0.072608
176,-0.072608
177,-0.072608
178,-0.072608
179,-0.072608
180,-0.072608
181,-0.072608
182,-0.072608
183,-0.072608
184,-0.072608
185,-0.072608
186,-0.072608
187,-0.072608
188,-0.072608
189,-0.072608
190,-0.072608
191,-0.072608
192,-0.072608
193,-0.072608
194,-0.072608
195,-0.072608
196,-0.072608
197,-0.072608
198,-0.072608
199,-0.072608
200,-0.072608
201,-0.072608
202,-0.072608
203,-0.072608
204,-0.072608
205,-0.072608
206,-0.072608
207,-0.072608
208,-0.072608
209,-0.072608
210,-0.072608
211,-0.072608
212,-0.072608
213,-0.072608
214,-0.072608
215,-0.072608
216,-0.072608
217,-0.072608
218,-0.072608
219,-0.072608
220,-0.072608
221,-0.072608
222,-0.072608
223,-0.072608
224,-0.072608
225,-0.072608
226,-0.072608
227,-0.072608
228,-0.072608
229,-0.072608
230,-0.072608
231,-0.072608
232,-0.072608
233,-0.072608
234,-0.072608
235,-0.072608
236,-0.072608
237,-0.072608
238,-0.072608
239,-0.072608
240,-0.072608
241,-0.072608
242,-0.072608
243,-0.072608
244,-0.072608
245,-0.072608
246,-0.072608
247,-0.072608
248,-0.072608
249,-0.072608
250,-0.072608
251,-0.072608
252,-0.072608
253,-0.072608
254,-0.072608
255,-0.072608
256,-0.072608
257,-0.072608
258,-0.072608
259,-0.072608
260,-0.072608
261,-0.072608
262,-0.072608
263,-0.072608
264,-0.072608
265,-0.072608
266,-0.072608
267,-0.072608
268,-0.072608
269,-0.072608
270,-0.072608
271,-0.072608
272,-0.072608
273,-0.072608
274,-0.072608
275,-0.072608
276,-0.072608
277,-0.072608
278,-0.072608
279,-0.072608
280,-0.072608
281,-0.072608
282,-0.072608
283,-0.072608
284,-0.072608
285,-0.072608
286,-0.072608
287,-0.072608
288,-0.072608
289,-0.072608
290,-0.072608
291,-0.072608
292,-0.072608
293,-0.072608
294,-0.072608
295,-0.072608
296,-0.072608
297,-0.072608
298,-0.072608
299,-0.072608
300,-0.072608
301,-0.072608
302,-0.072608
303,-0.072608
304,-0.072608
305,-0.072608
306,-0.072608
307,-0.072608
308,-0.072608
309,-0.072608
310,-0.072608
311,-0.072608
312,-0.072608
313,-0.072608
314,-0.072608
315,-0.072608
316,-0.072608
317,-0.072608
318,-0.072608
319,-0.072608
320,-0.072608
321,-0.072608
322,-0.072608
323,-0.072608
324,-0.072608
325,-0.072608
326,-0.072608
327,-0.072608
328,-0.072608
329,-0.072608
330,-0.072608
331,-0.072608
332,-0.072608
333,-0.072608
334,-0.072608
335,-0.072608
336,-0.072608
337,-0.072608
338,-0.072608
339,-0.072608
340,-0.072608
341,-0.072608
342,-0.072608
343,-0.072608
344,-0.072608
345,-0.072608
346,-0.072608
347,-0.072608
348,-0.072608
349,-0.072608
350,-0.072608
351,-0.072608
352,-0.072608
353,-0.072608
354,-0.072608
355,-0.072608
356,-0.072608
357,-0.072608
358,-0.072608
359,-0.072608
360,-0.072608
361,-0.072608
362,-0.072608
363,-0.072608
364,-0.072608
365,-0.072608
366,-0.072608
367,-0.072608
368,-0.072608
369,-0.072608
370,-0.072608
371,-0.072608
372,-0.072608
373,-0.072608
374,-0.072608
375,-0.072608
376,-0.072608
377,-0.072608
378,-0.072608
379,-0.072608
380,-0.072608
381,-0.072608
382,-0.072608
383,-0.072608
384,-0.072608
385,-0.072608
386,-0.072608
387,-0.072608
388,-0.072608
389,-0.072608
390,-0.072608
391,-0.072608
392,-0.072608
393,-0.072608
394,-0.072608
395,-0.072608
396,-0.072608
397,-0.072608
398,-0.072608
399,-0.072608
400,-0.072608
401,-0.072608
402,-0.072608
403,-0.072608
404,-0.072608
405,-0.072608
406,-0.072608
407,-0.072608
408,-0.072608
409,-0.072608
410,-0.072608
411,-0.072608
412,-0.072608
413,-0.072608
414,-0.072608
415,-0.072608
416,-0.072608
417,-0.072608
418,-0.072608
419,-0.072608
420,-0.072608
421,-0.072608
422,-0.072608
423,-0.072608
424,-0.072608
425,-0.072608
426,-0.072608
427,-0.072608
428,-0.072608
429,-0.072608
430,-0.072608
431,-0.072608
432,-0.072608
433,-0.072608
434,-0.072608
435,-0.072608
436,-0.072608
437,-0.072608
438,-0.072608
439,-0.072608
440,-0.072608
441,-0.072608
442,-0.072608
443,-0.072608
444,-0.072608
445,-0.072608
446,-0.072608
447,-0.072608
448,-0.072608
449,-0.072608
450,-0.072608
451,-0.072608
452,-0.072608
453,-0.072608
454,-0.072608
455,-0.072608
456,-0.072608
457,-0.072608
458,-0.072608
459,-0.072608
460,-0.072608
461,-0.072608
462,-0.072608
463,-0.072608
464,-0.072608
465,-0.072608
466,-0.072608
467,-0.072608
468,-0.072608
469,-0.072608
470,-0.072608
471,-0.072608
472,-0.072608
473,-0.072608
474,-0.072608
475,-0.072608
476,-0.072608
477,-0.072608
478,-0.072608
479,-0.072608
480,-0.072608
481,-0.072608
482,-0.072608
483,-0.072608
484,-0.072608
485,-0.072608
486,-0.072608
487,-0.072608
488,-0.072608
489,-0.072608
490,-0.072608
491,-0.072608
492,-0.072608
493,7.3276
494,13.43
495,13.992
496,16.892
497,0.2736
498,-0.072608
499,-0.072608
500,-0.072608
501,-0.072608
502,-0.072608
503,-0.072608
504,-0.072608
505,-0.072608
506,-0.072608
507,-0.072608
508,-0.072608
509,-0.072608
510,-0.072608
511,-0.072608
512,-0.072608
513,-0.072608
514,-0.072608
515,-0.072608
516,-0.072608
517,-0.072608
518,-0.072608
519,-0.072608
520,-0.072608
521,-0.072608
522,-0.072608
523,-0.072608
524,-0.072608
525,-0.072608
526,-0.072608
527,-0.072608
528,-0.072608
529,-0.072608
530,-0.072608
531,-0.072608
532,-0.072608
533,-0.072608
534,-0.072608
535,-0.072608
536,-0.072608
537,-0.072608
538,-0.072608
539,-0.072608
540,-0.072608
541,-0.072608
542,-0.072608
543,-0.072608
544,-0.072608
545,-0.072608
546,-0.072608
547,-0.072608
548,-0.072608
549,-0.072608
550,-0.072608
551,-0.072608
552,-0.072608
553,-0.072608
554,-0.072608
555,-0.072608
556,-0.072608
557,-0.072608
558,-0.072608
559,-0.072608
560,-0.072608
561,-0.072608
562,-0.072608
563,-0.072608
564,-0.072608
565,-0.072608
566,-0.072608
567,-0.072608
568,-0.072608
569,-0.072608
570,-0.072608
571,-0.072608
572,-0.072608
573,-0.072608
574,-0.072608
575,-0.072608
576,-0.072608
577,-0.072608
578,-0.072608
579,-0.072608
580,-0.072608
581,-0.072608
582,-0.072608
583,-0.072608
584,-0.072608
585,-0.072608
586,-0.072608
587,-0.072608
588,-0.072608
589,-0.072608
590,-0.072608
591,-0.072608
592,-0.072608
593,-0.072608
594,-0.072608
595,-0.072608
596,-0.072608
597,-0.072608
598,-0.072608
599,-0.072608
600,-0.072608
601,-0.072608
602,-0.072608
603,-0.072608
604,-0.072608
605,-0.072608
606,-0.072608
607,-0.072608
608,-0.072608
609,-0.072608
610,-0.072608
611,-0.072608
612,-0.072608
613,-0.072608
614,-0.072608
615,-0.072608
616,-0.072608
617,-0.072608
618,-0.072608
619,-0.072608
620,-0.072608
621,-0.072608
622,-0.072608
623,-0.072608
624,-0.072608
625,-0.072608
626,-0.072608
627,-0.072608
628,-0.072608
629,-0.072608
630,-0.072608
631,-0.072608
632,-0.072608
633,-0.072608
634,-0.072608
635,-0.072608
636,-0.072608
637,-0.072608
638,-0.072608
639,-0.072608
640,-0.072608
641,-0.072608
642,-0.072608
643,-0.072608
644,-0.072608
645,-0.072608
646,-0.072608
647,-0.072608
648,-0.072608
649,-0.072608
650,-0.072608
651,-0.072608
652,-0.072608
653,-0.072608
654,-0.072608
655,-0.072608
656,-0.072608
657,-0.072608
658,-0.072608
659,-0.072608
660,-0.072608
661,-0.072608
662,-0.072608
663,-0.072608
664,-0.072608
665,-0.072608
666,-0.072608
667,-0.072608
668,-0.072608
669,-0.072608
670,-0.072608
671,-0.072608
672,-0.072608
673,-0.072608
674,-0.072608
675,-0.072608
676,-0.072608
677,-0.072608
678,-0.072608
679,-0.072608
680,-0.072608
681,-0.072608
682,-0.072608
683,-0.072608
684,-0.072608
685,-0.072608
686,-0.072608
687,-0.072608
688,-0.072608
689,-0.072608
690,-0.072608
691,-0.072608
692,-0.072608
693,-0.072608
694,-0.072608
695,-0.072608
696,-0.072608
697,-0.072608
698,-0.072608
699,-0.072608
700,-0.072608
701,-0.072608
702,-0.072608
703,-0.072608
704,-0.072608
705,-0.072608
706,-0.072608
707,-0.072608
708,-0.072608
709,-0.072608
710,-0.072608
711,-0.072608
712,-0.072608
713,-0.072608
714,-0.072608
715,-0.072608
716,-0.072608
717,-0.072608
718,-0.072608
719,-0.072608
