time,value
0,-0.14394
1,-0.14394
2,-0.14394
3,-0.14394
4,-0.14394
5,-0.14394
6,-0.14394
7,-0.14394
8,-0.14394
9,-0.14394
10,-0.14394
11,-0.14394
12,-0.14394
13,-0.14394
14,-0.14394
15,-0.14394
16,-0.14394
17,-0.14394
18,-0.14394
19,-0.14394
20,-0.14394
21,-0.14394
22,-0.14394
23,-0.14394
24,-0.14394
25,-0.14394
26,-0.14394
27,-0.14394
28,-0.14394
29,-0.14394
30,-0.14394
31,-0.14394
32,-0.14394
33,-0.14394
34,-0.14394
35,-0.14394
36,-0.14394
37,-0.14394
38,-0.14394
39,-0.14394
40,-0.14394
41,-0.14394
42,-0.14394
43,-0.14394
44,-0.14394
45,-0.14394
46,-0.14394
47,-0.14394
48,-0.14394
49,-0.14394
50,-0.14394
51,-0.14394
52,-0.14394
53,-0.14394
54,-0.14394
55,-0.14394
56,-0.14394
57,-0.14394
58,-0.14394
59,-0.14394
60,-0.14394
61,-0.14394
62,-0.14394
63,-0.14394
64,-0.14394
65,-0.14394
66,-0.14394
67,-0.14394
68,-0.14394
69,-0.14394
70,-0.14394
71,-0.14394
72,-0.14394
73,-0.14394
74,-0.14394
75,-0.14394
76,-0.14394
77,-0.14394
78,-0.14394
79,-0.14394
80,-0.14394
81,-0.14394
82,-0.14394
83,-0.14394
84,-0.14394
85,-0.14394
86,-0.14394
87,-0.14394
88,-0.14394
89,-0.14394
90,-0.14394
91,-0.14394
92,-0.14394
93,-0.14394
94,-0.14394
95,-0.14394
96,-0.14394
97,-0.14394
98,-0.14394
99,-0.14394
100,-0.14394
101,-0.14394
102,-0.14394
103,-0.14394
104,-0.14394
105,-0.14394
106,-0.14394
107,-0.14394
108,-0.14394
109,-0.14394
110,-0.14394
111,-0.14394
112,-0.14394
113,-0.14394
114,-0.14394
115,-0.14394
116,-0.14394
117,-0.14394
118,-0.14394
119,-0.14394
120,-0.14394
121,-0.14394
122,-0.14394
123,-0.14394
124,-0.14394
125,-0.14394
126,-0.14394
127,-0.14394
128,-0.14394
129,-0.14394
130,-0.14394
131,-0.14394
132,-0.14394
133,-0.14394
134,-0.14394
135,-0.14394
136,-0.14394
137,-0.14394
138,-0.14394
139,-0.14394
140,-0.14394
141,-0.14394
142,-0.14394
143,-0.14394
144,-0.14394
145,-0.14394
146,-0.14394
147,-0.14394
148,-0.14394
149,-0.14394
150,-0.14394
151,-0.14394
152,-0.14394
153,-0.14394
154,-0.14394
155,-0.14394
156,-0.14394
157,-0.14394
158,-0.14394
159,-0.14394
160,-0.14394
161,-0.14394
162,-0.14394
163,-0.14394
164,-0.14394
165,-0.14394
166,-0.14394
167,-0.14394
168,-0.14394
169,-0.14394
170,-0.14394
171,-0.14394
172,-0.14394
173,-0.14394
174,-0.14394
175,-0.14394
176,-0.14394
177,-0.14394
178,-0.14394
179,-0.14394
180,-0.14394
181,-0.14394
182,-0.14394
183,6.1245
184,6.8619
185,0.22479000000000002
186,-0.14394
187,-0.14394
188,-0.061996
189,0.26576
190,-0.12345
191,-0.14394
192,-0.14394
193,-0.14394
194,-0.14394
195,-0.14394
196,-0.14394
197,-0.14394
198,-0.14394
199,-0.14394
200,-0.14394
201,-0.14394
202,-0.14394
203,-0.14394
204,-0.14394
205,-0.14394
206,-0.14394
207,-0.14394
208,-0.14394
209,-0.14394
210,-0.14394
211,-0.14394
212,-0.14394
213,-0.14394
214,-0.14394
215,-0.14394
216,-0.14394
217,-0.14394
218,-0.14394
219,-0.14394
220,-0.14394
221,-0.14394
222,-0.14394
223,-0.14394
224,-0.14394
225,-0.14394
226,-0.14394
227,1.6997
228,9.7708
229,1.0032
230,-0.14394
231,-0.14394
232,-0.14394
233,-0.14394
234,-0.14394
235,-0.14394
236,-0.14394
237,-0.14394
238,-0.14394
239,-0.14394
240,-0.14394
241,-0.14394
242,-0.14394
243,-0.14394
244,-0.14394
245,-0.14394
246,-0.14394
247,-0.14394
248,-0.14394
249,-0.14394
250,-0.14394
251,-0.14394
252,-0.14394
253,-0.14394
254,-0.14394
255,-0.14394
256,-0.14394
257,-0.14394
258,-0.14394
259,-0.14394
260,-0.14394
261,-0.14394
262,-0.14394
263,-0.14394
264,-0.14394
265,-0.14394
266,-0.14394
267,-0.14394
268,-0.14394
269,-0.14394
270,-0.14394
271,-0.14394
272,-0.14394
273,2.5601
274,9.5455
275,0.26576
276,-0.10297
277,-0.14394
278,-0.14394
279,-0.14394
280,-0.14394
281,-0.14394
282,-0.14394
283,-0.14394
284,-0.14394
285,-0.14394
286,-0.14394
287,-0.14394
288,-0.14394
289,-0.14394
290,-0.14394
291,-0.14394
292,-0.14394
293,-0.14394
294,-0.14394
295,-0.14394
296,-0.14394
297,4.7725
298,-0.061996
299,-0.14394
300,-0.14394
301,-0.14394
302,-0.14394
303,-0.14394
304,-0.14394
305,-0.14394
306,-0.14394
307,-0.14394
308,-0.14394
309,-0.14394
310,-0.14394
311,-0.14394
312,-0.14394
313,-0.14394
314,-0.14394
315,-0.14394
316,-0.14394
317,-0.14394
318,-0.14394
319,-0.14394
320,-0.14394
321,-0.14394
322,-0.14394
323,-0.14394
324,-0.14394
325,-0.14394
326,-0.14394
327,-0.14394
328,-0.14394
329,-0.14394
330,-0.14394
331,-0.14394
332,7.0565
333,1.8021
334,0.78813
335,-0.082481
336,-0.14394
337,-0.14394
338,-0.14394
339,-0.14394
340,-0.14394
341,-0.14394
342,-0.14394
343,-0.14394
344,-0.14394
345,-0.14394
346,-0.14394
347,-0.14394
348,-0.14394
349,-0.14394
350,-0.14394
351,-0.14394
352,7.2512
353,0.10188
354,-0.14394
355,-0.14394
356,-0.14394
357,-0.14394
358,-0.14394
359,-0.14394
360,-0.14394
361,-0.14394
362,-0.14394
363,-0.14394
364,-0.14394
365,-0.14394
366,-0.14394
367,-0.14394
368,-0.14394
369,-0.14394
370,-0.14394
371,-0.14394
372,-0.14394
373,-0.14394
374,-0.14394
375,-0.14394
376,-0.14394
377,-0.14394
378,-0.14394
379,-0.14394
380,-0.14394
381,-0.14394
382,-0.14394
383,-0.14394
384,-0.14394
385,-0.14394
386,-0.14394
387,-0.14394
388,-0.14394
389,-0.14394
390,-0.14394
391,-0.14394
392,-0.14394
393,-0.14394
394,-0.14394
395,-0.14394
396,-0.14394
397,-0.14394
398,-0.14394
399,-0.14394
400,-0.14394
401,-0.14394
402,-0.14394
403,-0.14394
404,-0.14394
405,-0.14394
406,-0.14394
407,-0.14394
408,-0.14394
409,-0.14394
410,-0.14394
411,-0.14394
412,-0.14394
413,-0.14394
414,-0.14394
415,-0.14394
416,-0.14394
417,-0.14394
418,-0.14394
419,-0.14394
420,-0.14394
421,-0.14394
422,-0.14394
423,-0.14394
424,-0.14394
425,-0.14394
426,-0.14394
427,-0.14394
428,-0.14394
429,-0.14394
430,-0.14394
431,-0.14394
432,-0.14394
433,-0.14394
434,-0.14394
435,-0.14394
436,-0.14394
437,-0.14394
438,-0.14394
439,-0.14394
440,-0.14394
441,-0.14394
442,-0.14394
443,-0.14394
444,-0.14394
445,-0.14394
446,-0.14394
447,-0.14394
448,-0.14394
449,-0.14394
450,-0.14394
451,-0.14394
452,-0.14394
453,-0.14394
454,-0.14394
455,-0.14394
456,-0.14394
457,-0.14394
458,-0.14394
459,-0.14394
460,-0.14394
461,-0.14394
462,-0.14394
463,3.5843
464,9.7708
465,0.65498
466,-0.11320999999999999
467,-0.14394
468,-0.14394
469,-0.14394
470,-0.14394
471,-0.14394
472,-0.14394
473,-0.14394
474,-0.14394
475,-0.14394
476,-0.14394
477,-0.14394
478,-0.14394
479,-0.14394
480,-0.14394
481,-0.14394
482,-0.14394
483,-0.14394
484,-0.14394
485,-0.14394
486,-0.14394
487,-0.14394
488,-0.14394
489,-0.14394
490,-0.14394
491,-0.14394
492,-0.14394
493,-0.14394
494,-0.14394
495,-0.14394
496,-0.14394
497,-0.14394
498,-0.14394
499,-0.14394
500,-0.14394
501,-0.14394
502,-0.14394
503,-0.14394
504,-0.14394
505,-0.14394
506,-0.14394
507,-0.14394
508,-0.14394
509,-0.14394
510,-0.14394
511,-0.14394
512,-0.14394
513,-0.14394
514,-0.14394
515,-0.14394
516,-0.14394
517,-0.14394
518,-0.14394
519,-0.14394
520,-0.14394
521,-0.14394
522,-0.14394
523,-0.14394
524,-0.14394
525,-0.14394
526,-0.14394
527,-0.14394
528,-0.14394
529,-0.14394
530,-0.14394
531,-0.14394
532,-0.14394
533,-0.14394
534,-0.14394
535,-0.14394
536,-0.14394
537,-0.14394
538,-0.14394
539,-0.14394
540,-0.14394
541,-0.14394
542,-0.14394
543,-0.14394
544,-0.14394
545,-0.14394
546,-0.14394
547,-0.14394
548,-0.14394
549,-0.14394
550,-0.14394
551,-0.14394
552,-0.14394
553,-0.14394
554,-0.14394
555,-0.14394
556,-0.14394
557,-0.14394
558,-0.14394
559,-0.14394
560,-0.14394
561,-0.14394
562,-0.14394
563,-0.14394
564,-0.14394
565,-0.14394
566,-0.14394
567,-0.14394
568,-0.14394
569,-0.14394
570,-0.14394
571,-0.14394
572,-0.14394
573,-0.14394
574,-0.14394
575,-0.14394
576,-0.14394
577,-0.14394
578,-0.14394
579,-0.14394
580,-0.14394
581,-0.14394
582,-0.14394
583,-0.14394
584,-0.14394
585,-0.14394
586,-0.14394
587,-0.14394
588,-0.14394
589,-0.14394
590,-0.14394
591,-0.14394
592,-0.14394
593,-0.14394
594,-0.14394
595,-0.14394
596,-0.14394
597,-0.14394
598,-0.14394
599,-0.14394
600,-0.14394
601,-0.14394
602,-0.14394
603,-0.14394
604,-0.14394
605,-0.14394
606,-0.14394
607,-0.14394
608,-0.14394
609,-0.14394
610,-0.14394
611,-0.14394
612,2.6830000000000003
613,9.5455
614,0.78813
615,-0.10297
616,-0.14394
617,-0.14394
618,-0.14394
619,-0.14394
620,-0.14394
621,-0.14394
622,-0.14394
623,-0.14394
624,-0.14394
625,-0.14394
626,-0.14394
627,-0.14394
628,-0.14394
629,-0.14394
630,-0.14394
631,-0.14394
632,-0.14394
633,-0.14394
634,-0.14394
635,-0.14394
636,-0.14394
637,-0.14394
638,-0.14394
639,-0.14394
640,-0.14394
641,-0.14394
642,-0.14394
643,-0.14394
644,-0.14394
645,-0.14394
646,-0.14394
647,-0.14394
648,-0.14394
649,-0.14394
650,-0.14394
651,-0.14394
652,-0.14394
653,-0.14394
654,-0.14394
655,-0.14394
656,-0.14394
657,-0.14394
658,-0.14394
659,-0.14394
660,-0.14394
661,-0.14394
662,-0.14394
663,-0.14394
664,-0.14394
665,-0.14394
666,-0.14394
667,-0.14394
668,-0.14394
669,-0.14394
670,-0.14394
671,-0.14394
672,-0.14394
673,-0.14394
674,-0.14394
675,-0.14394
676,-0.14394
677,-0.14394
678,-0.14394
679,-0.14394
680,4.6188
681,8.0501
682,-0.11320999999999999
683,-0.14394
684,-0.14394
685,-0.14394
686,-0.14394
687,-0.14394
688,-0.14394
689,-0.14394
690,-0.14394
691,-0.14394
692,-0.14394
693,-0.14394
694,-0.14394
695,-0.14394
696,-0.14394
697,-0.14394
698,-0.14394
699,-0.14394
700,-0.14394
701,-0.14394
702,-0.14394
703,-0.14394
704,-0.14394
705,-0.14394
706,-0.14394
707,-0.14394
708,-0.14394
709,-0.14394
710,-0.14394
711,-0.14394
712,-0.14394
713,-0.14394
714,-0.14394
715,-0.14394
716,-0.14394
717,-0.14394
718,-0.14394
719,-0.14394
