time,value
0,-0.7867
1,-0.76394
2,-0.74671
3,-0.7326699999999999
4,-0.71987
5,-0.70965
6,-0.69895
7,-0.68767
8,-0.67989
9,-0.67414
10,-0.66732
11,-0.65996
12,-0.6502
13,-0.63575
14,-0.61822
15,-0.5990300000000001
16,-0.58124
17,-0.56423
18,-0.546
19,-0.53022
20,-0.51195
21,-0.48682
22,-0.45751000000000003
23,-0.41553
24,-0.35631
25,-0.27787
26,-0.16635
27,-0.01885
28,0.17065999999999998
29,0.41197
30,0.69617
31,1.0111
32,1.3426
33,1.6726
34,1.9819
35,2.2586
36,2.4914
37,2.6696
38,2.7949
39,2.8729
40,2.9069
41,2.8998
42,2.8156
43,2.5533
44,2.0334
45,1.3168
46,0.58773
47,0.014894
48,-0.34241
49,-0.5214
50,-0.59449
51,-0.6117100000000001
52,-0.60411
53,-0.59597
54,-0.58659
55,-0.5764100000000001
56,-0.57399
57,-0.57449
58,-0.5785899999999999
59,-0.5884199999999999
60,-0.59444
61,-0.59443
62,-0.58831
63,-0.58154
64,-0.57562
65,-0.56586
66,-0.55503
67,-0.54813
68,-0.54432
69,-0.54119
70,-0.53876
71,-0.53756
72,-0.53946
73,-0.54547
74,-0.55385
75,-0.56387
76,-0.57423
77,-0.58192
78,-0.5857600000000001
79,-0.5874199999999999
80,-0.58787
81,-0.58413
82,-0.57694
83,-0.57126
84,-0.56508
85,-0.55312
86,-0.53368
87,-0.5069
88,-0.47511000000000003
89,-0.43905
90,-0.39626
91,-0.34944000000000003
92,-0.30421
93,-0.26164
94,-0.22329000000000002
95,-0.19279000000000002
96,-0.17064000000000001
97,-0.15625999999999998
98,-0.15578
99,-0.18361
100,-0.24739
101,-0.33332
102,-0.41546000000000005
103,-0.4732
104,-0.50003
105,-0.50645
106,-0.5061
107,-0.50259
108,-0.49828
109,-0.49700000000000005
110,-0.49792
111,-0.50134
112,-0.50634
113,-0.50745
114,-0.5029399999999999
115,-0.49566000000000004
116,-0.48894
117,-0.4833
118,-0.47725
119,-0.46753999999999996
120,-0.44723999999999997
121,-0.41433000000000003
122,-0.36888000000000004
123,-0.31123
124,-0.24994
125,-0.1972
126,-0.15775999999999998
127,-0.13454000000000002
128,-0.1316
129,-0.1456
130,-0.17215999999999998
131,-0.21654
132,-0.28884
133,-0.39300999999999997
134,-0.5172800000000001
135,-0.63525
136,-0.72263
137,-0.7726
138,-0.79538
139,-0.80384
140,-0.80245
141,-0.79405
142,-0.78488
143,-0.77609
144,-0.76747
145,-0.75935
146,-0.74848
147,-0.73538
148,-0.72402
149,-0.71506
150,-0.70732
151,-0.69795
152,-0.68609
153,-0.6734399999999999
154,-0.66105
155,-0.64887
156,-0.63698
157,-0.62669
158,-0.6179600000000001
159,-0.60707
160,-0.59141
161,-0.57017
162,-0.5416300000000001
163,-0.5100100000000001
164,-0.486
165,-0.47351000000000004
166,-0.46818999999999994
167,-0.46481999999999996
168,-0.4585
169,-0.4465
170,-0.42763999999999996
171,-0.40493
172,-0.38339
173,-0.3617
174,-0.3379
175,-0.31233
176,-0.28278000000000003
177,-0.24771999999999997
178,-0.2093
179,-0.16917000000000001
180,-0.13012
181,-0.094395
182,-0.060483
183,-0.034899
184,-0.025013999999999998
185,-0.031324
186,-0.063266
187,-0.12602
188,-0.20631999999999998
189,-0.28143
190,-0.32483
191,-0.32881
192,-0.3022
193,-0.24393
194,-0.1579
195,-0.041303
196,0.11485999999999999
197,0.30815
198,0.54648
199,0.83821
200,1.1655
201,1.4978
202,1.8092
203,2.0964
204,2.3775
205,2.6535
206,2.8941
207,3.0548
208,3.1049
209,3.0521
210,2.9344
211,2.7931
212,2.6389
213,2.4459
214,2.1909
215,1.8941
216,1.6049
217,1.3578
218,1.1587
219,0.97165
220,0.72554
221,0.38950999999999997
222,0.012555
223,-0.3076
224,-0.49717
225,-0.5737899999999999
226,-0.6008100000000001
227,-0.61446
228,-0.62762
229,-0.6380399999999999
230,-0.6413300000000001
231,-0.6419600000000001
232,-0.6370899999999999
233,-0.6299100000000001
234,-0.62398
235,-0.61293
236,-0.59972
237,-0.59116
238,-0.5865100000000001
239,-0.58822
240,-0.59131
241,-0.5884
242,-0.57702
243,-0.55345
244,-0.5198
245,-0.48268
246,-0.44351999999999997
247,-0.39978
248,-0.33703
249,-0.24681999999999998
250,-0.13146
251,0.020938
252,0.2207
253,0.46166
254,0.71668
255,0.9524600000000001
256,1.1566
257,1.3367
258,1.4934
259,1.6121
260,1.6796
261,1.6973
262,1.6731
263,1.5983
264,1.4257
265,1.0756
266,0.53617
267,-0.028743
268,-0.41866000000000003
269,-0.62907
