time,value
0,0.75822
1,0.64598
2,0.51788
3,0.40442
4,0.30745
5,0.26279
6,0.27904
7,0.30973
8,0.33213000000000004
9,0.2997
10,0.16887
11,-0.047918
12,-0.32253000000000004
13,-0.60216
14,-0.8324
15,-0.97854
16,-1.0111
17,-0.92065
18,-0.74151
19,-0.5055
20,-0.26605999999999996
21,-0.026113
22,0.18505
23,0.33942
24,0.44456
25,0.48441999999999996
26,0.47502
27,0.40660999999999997
28,0.30848000000000003
29,0.21811
30,0.14101
31,0.11572
32,0.14053
33,0.20169
34,0.24911999999999998
35,0.24455
36,0.14652
37,-0.052787
38,-0.33136
39,-0.62224
40,-0.83101
41,-0.8957
42,-0.7850699999999999
43,-0.51276
44,-0.1556
45,0.21034
46,0.49785
47,0.64749
48,0.65633
49,0.55847
50,0.40542
51,0.26769
52,0.14818
53,0.061667999999999994
54,-0.029461
55,-0.13451
56,-0.25906
57,-0.38458000000000003
58,-0.47126
59,-0.46176000000000006
60,-0.33432
61,-0.099281
62,0.19150999999999999
63,0.46028
64,0.61741
65,0.59604
66,0.38828
67,0.058759000000000006
68,-0.29335
69,-0.58316
70,-0.74824
71,-0.75183
72,-0.65193
73,-0.51969
74,-0.40023000000000003
75,-0.32627
76,-0.27899
77,-0.22080999999999998
78,-0.091775
79,0.14284000000000002
80,0.4936
81,0.8942100000000001
82,1.2635
83,1.4922
84,1.5082
85,1.306
86,0.9092399999999999
87,0.41534
88,-0.09702100000000001
89,-0.55129
90,-0.9063
91,-1.161
92,-1.3109
93,-1.4074
94,-1.4538
95,-1.4366
96,-1.3317
97,-1.0794
98,-0.66828
99,-0.13246
100,0.49418
101,1.0857
102,1.5448
103,1.7946
104,1.7822
105,1.5304
106,1.088
107,0.52199
108,-0.053364999999999996
109,-0.56818
110,-0.9527700000000001
111,-1.1712
112,-1.2175
113,-1.0949
114,-0.83625
115,-0.48343
116,-0.07735299999999999
117,0.33789
118,0.70672
119,0.9821
120,1.1297
121,1.1262
122,0.96281
123,0.6709999999999999
124,0.27828
125,-0.16530999999999998
126,-0.58814
127,-0.93779
128,-1.1547
129,-1.2239
130,-1.1396
131,-0.8934200000000001
132,-0.55655
133,-0.18139
134,0.16419
135,0.43682
136,0.59718
137,0.63949
138,0.6018899999999999
139,0.5290100000000001
140,0.42973
141,0.32204
142,0.22424000000000002
143,0.11835
144,-0.031996
145,-0.20828000000000002
146,-0.39186
147,-0.55962
148,-0.66068
149,-0.64274
150,-0.49101999999999996
151,-0.21904
152,0.10045
153,0.41223000000000004
154,0.64282
155,0.74085
156,0.67382
157,0.48335
158,0.23053
159,-0.040519
160,-0.28078000000000003
161,-0.44148000000000004
162,-0.53284
163,-0.5835199999999999
164,-0.58915
165,-0.52691
166,-0.37414000000000003
167,-0.11764000000000001
168,0.2529
169,0.6985100000000001
170,1.1471
171,1.5030000000000001
172,1.6448
173,1.5031
174,1.0481
175,0.3262
176,-0.55793
177,-1.4514
178,-2.199
179,-2.6814
180,-2.8143
181,-2.6065
182,-2.1127
183,-1.4036
184,-0.5582600000000001
185,0.34212
186,1.2116
187,1.9762
188,2.5661
189,2.9369
190,3.0306
191,2.835
192,2.3476
193,1.6188
194,0.7508100000000001
195,-0.13489
196,-0.92958
197,-1.53
198,-1.8849
199,-1.9918
200,-1.8897
201,-1.6526
202,-1.3414
203,-1.0218
204,-0.73645
205,-0.48586999999999997
206,-0.25595999999999997
207,-0.047867
208,0.15003
209,0.33510999999999996
210,0.4841
211,0.57275
212,0.59677
213,0.55715
214,0.47079
215,0.37295
216,0.30071
217,0.27708
218,0.31828
219,0.40397
220,0.52566
221,0.64679
222,0.74695
223,0.78187
224,0.73019
225,0.6041300000000001
226,0.39024000000000003
227,0.10392
228,-0.22846
229,-0.5603
230,-0.8562700000000001
231,-1.0974
232,-1.2517
233,-1.2874
234,-1.1958
235,-0.9952200000000001
236,-0.69662
237,-0.34905
238,0.0026548
239,0.30708
240,0.51402
241,0.59802
242,0.57171
243,0.46488999999999997
244,0.33810999999999997
245,0.2448
246,0.20412
247,0.23084000000000002
248,0.30839
249,0.40328
250,0.44914
251,0.41971
252,0.30895
253,0.13732
254,-0.045167
255,-0.21998
256,-0.35815
257,-0.44959
258,-0.50847
259,-0.5526800000000001
260,-0.56935
261,-0.5408
262,-0.43755
263,-0.20252
264,0.20010999999999998
265,0.7360399999999999
266,1.3202
267,1.8215
268,2.1003
269,2.033
270,1.567
271,0.77153
272,-0.22545
273,-1.2579
274,-2.1285
275,-2.6969
276,-2.898
277,-2.7621
278,-2.3642
279,-1.7984
280,-1.1593
281,-0.49168999999999996
282,0.16579000000000002
283,0.81388
284,1.4274
285,1.9585
286,2.3456
287,2.5299
288,2.4729
289,2.1696
290,1.6574
291,1.0384
292,0.40044
293,-0.17759
294,-0.6449
295,-0.97778
296,-1.2035
297,-1.3279
298,-1.3839
299,-1.3889
300,-1.3258
301,-1.1704
302,-0.9115700000000001
303,-0.5656
304,-0.14293
305,0.31748000000000004
306,0.74537
307,1.0633
308,1.2046
309,1.1541
310,0.90497
311,0.5261399999999999
312,0.1099
313,-0.23984
314,-0.45378999999999997
315,-0.48612
316,-0.34173000000000003
317,-0.086788
318,0.18984
319,0.39623
320,0.47008
321,0.37669
322,0.15314
323,-0.13283
324,-0.389
325,-0.5589
326,-0.62326
327,-0.5838
328,-0.49001999999999996
329,-0.39746
330,-0.34123000000000003
331,-0.3179
332,-0.28626999999999997
333,-0.21261
334,-0.069384
335,0.14234000000000002
336,0.38793
337,0.59721
338,0.73951
339,0.7952
340,0.75646
341,0.65954
342,0.57331
343,0.51951
344,0.49503
345,0.46786000000000005
346,0.39658000000000004
347,0.24163
348,-0.0014834000000000002
349,-0.30045
350,-0.5885699999999999
351,-0.8015800000000001
352,-0.89361
353,-0.86721
354,-0.7709600000000001
355,-0.67264
356,-0.61143
357,-0.60945
358,-0.6290100000000001
359,-0.621
360,-0.5318
361,-0.3132
362,0.051673000000000004
363,0.50863
364,0.96557
365,1.339
366,1.5823
367,1.6525
368,1.5637
369,1.3546
370,1.0464
371,0.66159
372,0.1856
373,-0.3677
374,-0.95806
375,-1.5335
376,-2.0093
377,-2.2892
378,-2.3040000000000003
379,-2.0394
380,-1.5315
381,-0.87216
382,-0.18930999999999998
383,0.41958
384,0.89386
385,1.2199
386,1.4378
387,1.5895
388,1.7129
389,1.8045
390,1.8164
391,1.7056
392,1.3908
393,0.8697299999999999
394,0.18464
395,-0.56319
396,-1.2513
397,-1.7607
398,-2.032
399,-2.0339
400,-1.8021
401,-1.4258
402,-0.9892200000000001
403,-0.55748
404,-0.18042
405,0.12017
406,0.33019
407,0.47607
408,0.56626
409,0.62488
410,0.6563399999999999
411,0.67743
412,0.68761
413,0.68324
414,0.6678
415,0.64417
416,0.5918100000000001
417,0.51215
418,0.40517
419,0.28083
420,0.13294
421,-0.007081100000000001
422,-0.12424
423,-0.21491999999999997
424,-0.29511
425,-0.37398000000000003
426,-0.46596000000000004
427,-0.60248
428,-0.77775
429,-0.9630700000000001
430,-1.1051
431,-1.1552
432,-1.0795
433,-0.8539399999999999
434,-0.50754
435,-0.094286
436,0.32504
437,0.6974199999999999
438,0.9787899999999999
439,1.1458
440,1.1869
441,1.1375
442,1.0266
443,0.86095
444,0.67937
445,0.48913999999999996
446,0.27626999999999996
447,0.033651
448,-0.1973
449,-0.41051000000000004
450,-0.5956
451,-0.72542
452,-0.7861199999999999
453,-0.7750199999999999
454,-0.71668
455,-0.6199600000000001
456,-0.5239199999999999
457,-0.46793999999999997
458,-0.45674
459,-0.49561000000000005
460,-0.53118
461,-0.49911000000000005
462,-0.36059
463,-0.089683
464,0.30913
465,0.78151
466,1.2025
467,1.4487
468,1.4395
469,1.1235
470,0.54793
471,-0.14905
472,-0.79696
473,-1.2388
474,-1.3812
475,-1.2001
476,-0.76602
477,-0.18984
478,0.38745
479,0.8345299999999999
480,1.0858
481,1.1066
482,0.9283
483,0.60633
484,0.20215999999999998
485,-0.24216999999999997
486,-0.70128
487,-1.1451
488,-1.5358
489,-1.8245
490,-1.9433
491,-1.8235
492,-1.4436
493,-0.81139
494,0.011170999999999999
495,0.9081100000000001
496,1.7286
497,2.3483
498,2.6725
499,2.6660000000000004
