time,value
0,-0.33107
1,-0.33107
2,-0.33107
3,-0.33107
4,-0.33107
5,-0.33107
6,-0.33107
7,-0.33107
8,-0.33107
9,-0.33107
10,-0.33107
11,-0.33107
12,-0.33107
13,-0.33107
14,-0.33107
15,-0.33107
16,-0.33107
17,-0.33107
18,-0.33107
19,-0.33107
20,-0.33107
21,-0.33107
22,-0.33107
23,-0.33107
24,-0.33107
25,-0.33107
26,-0.33107
27,-0.33107
28,-0.33107
29,-0.33107
30,-0.33107
31,-0.33107
32,-0.33107
33,-0.33107
34,-0.33107
35,-0.33107
36,-0.33107
37,-0.33107
38,-0.33107
39,-0.33107
40,-0.33107
41,-0.33107
42,-0.33107
43,-0.33107
44,-0.33107
45,-0.33107
46,-0.33107
47,-0.33107
48,-0.33107
49,-0.33107
50,-0.33107
51,-0.33107
52,-0.33107
53,-0.33107
54,-0.33107
55,-0.33107
56,-0.33107
57,-0.33107
58,-0.33107
59,-0.33107
60,-0.33107
61,-0.33107
62,-0.33107
63,-0.33107
64,-0.33107
65,-0.33107
66,-0.33107
67,-0.33107
68,-0.33107
69,-0.33107
70,-0.33107
71,-0.33107
72,-0.33107
73,-0.33107
74,-0.33107
75,-0.33107
76,-0.33107
77,-0.33107
78,-0.33107
79,-0.33107
80,-0.33107
81,-0.33107
82,-0.33107
83,-0.33107
84,-0.33107
85,-0.33107
86,-0.33107
87,-0.33107
88,-0.33107
89,-0.33107
90,-0.33107
91,-0.33107
92,-0.33107
93,-0.33107
94,-0.33107
95,-0.33107
96,-0.33107
97,-0.33107
98,-0.33107
99,-0.33107
100,-0.33107
101,-0.33107
102,-0.33107
103,-0.33107
104,-0.33107
105,-0.33107
106,-0.33107
107,-0.33107
108,-0.33107
109,-0.33107
110,-0.33107
111,-0.33107
112,-0.33107
113,-0.33107
114,-0.33107
115,-0.33107
116,-0.33107
117,-0.33107
118,-0.33107
119,-0.33107
120,-0.33107
121,-0.33107
122,-0.33107
123,-0.33107
124,-0.33107
125,-0.33107
126,-0.33107
127,-0.33107
128,-0.33107
129,-0.33107
130,-0.33107
131,-0.33107
132,-0.33107
133,-0.33107
134,-0.33107
135,-0.33107
136,-0.33107
137,-0.33107
138,-0.33107
139,-0.33107
140,-0.33107
141,-0.33107
142,-0.33107
143,-0.33107
144,-0.33107
145,-0.33107
146,-0.33107
147,-0.33107
148,-0.33107
149,-0.33107
150,-0.33107
151,-0.33107
152,-0.33107
153,-0.33107
154,-0.33107
155,-0.33107
156,-0.33107
157,-0.33107
158,-0.33107
159,-0.33107
160,-0.33107
161,-0.33107
162,-0.33107
163,-0.33107
164,-0.33107
165,-0.33107
166,-0.33107
167,-0.33107
168,-0.33107
169,-0.33107
170,-0.33107
171,-0.33107
172,-0.33107
173,-0.33107
174,-0.33107
175,-0.33107
176,-0.33107
177,-0.33107
178,-0.33107
179,-0.33107
180,-0.33107
181,-0.33107
182,-0.33107
183,-0.33107
184,-0.33107
185,-0.33107
186,-0.33107
187,-0.33107
188,-0.33107
189,-0.33107
190,-0.33107
191,-0.33107
192,-0.33107
193,-0.33107
194,-0.33107
195,-0.33107
196,-0.33107
197,-0.33107
198,-0.33107
199,-0.33107
200,-0.33107
201,-0.33107
202,-0.33107
203,2.9758
204,2.9758
205,2.9758
206,3.8026
207,2.9758
208,2.9758
209,3.8026
210,2.9758
211,2.9758
212,2.9758
213,3.8026
214,2.9758
215,2.9758
216,2.9758
217,2.9758
218,2.9758
219,3.8026
220,2.9758
221,2.9758
222,2.9758
223,2.4247
224,2.9758
225,1.8735
226,-0.055498
227,-0.33107
228,-0.33107
229,-0.33107
230,-0.33107
231,-0.33107
232,-0.33107
233,-0.33107
234,-0.33107
235,-0.33107
236,-0.33107
237,-0.33107
238,-0.33107
239,-0.33107
240,-0.33107
241,-0.33107
242,-0.33107
243,-0.33107
244,-0.33107
245,-0.33107
246,0.49565
247,2.9758
248,2.9758
249,2.9758
250,3.8026
251,2.9758
252,2.9758
253,3.8026
254,2.9758
255,2.9758
256,2.9758
257,3.8026
258,2.9758
259,2.9758
260,2.9758
261,2.9758
262,2.9758
263,3.8026
264,2.9758
265,2.9758
266,2.9758
267,2.9758
268,2.9758
269,2.9758
270,2.9758
271,2.9758
272,3.8026
273,2.9758
274,2.9758
275,2.9758
276,2.9758
277,1.8735
278,-0.055498
279,-0.33107
280,-0.33107
281,-0.33107
282,-0.33107
283,-0.33107
284,-0.33107
285,-0.33107
286,-0.33107
287,-0.33107
288,-0.33107
289,-0.33107
290,-0.33107
291,-0.33107
292,-0.33107
293,-0.33107
294,-0.33107
295,-0.33107
296,-0.33107
297,-0.33107
298,-0.33107
299,-0.33107
300,-0.33107
301,-0.33107
302,-0.33107
303,-0.33107
304,-0.33107
305,-0.33107
306,-0.33107
307,-0.33107
308,-0.33107
309,-0.33107
310,-0.33107
311,-0.33107
312,-0.33107
313,-0.33107
314,-0.33107
315,-0.33107
316,-0.33107
317,-0.33107
318,-0.33107
319,-0.33107
320,-0.33107
321,-0.33107
322,-0.33107
323,-0.33107
324,-0.33107
325,-0.33107
326,-0.33107
327,-0.33107
328,-0.33107
329,-0.33107
330,-0.33107
331,-0.33107
332,-0.33107
333,-0.33107
334,-0.33107
335,-0.33107
336,-0.33107
337,-0.33107
338,-0.33107
339,-0.33107
340,-0.33107
341,-0.33107
342,-0.33107
343,-0.33107
344,-0.33107
345,-0.33107
346,-0.33107
347,-0.33107
348,-0.33107
349,-0.33107
350,-0.33107
351,-0.33107
352,-0.33107
353,-0.33107
354,-0.33107
355,-0.33107
356,-0.33107
357,-0.33107
358,-0.33107
359,-0.33107
360,-0.33107
361,-0.33107
362,-0.33107
363,-0.33107
364,-0.33107
365,-0.33107
366,-0.33107
367,-0.33107
368,-0.33107
369,-0.33107
370,-0.33107
371,-0.33107
372,-0.33107
373,-0.33107
374,-0.33107
375,-0.33107
376,-0.33107
377,-0.33107
378,-0.33107
379,-0.33107
380,-0.33107
381,-0.33107
382,-0.33107
383,-0.33107
384,-0.33107
385,-0.33107
386,-0.33107
387,-0.33107
388,-0.33107
389,-0.33107
390,-0.33107
391,-0.33107
392,-0.33107
393,-0.33107
394,-0.33107
395,-0.33107
396,-0.33107
397,-0.33107
398,-0.33107
399,-0.33107
400,-0.33107
401,-0.33107
402,-0.33107
403,-0.33107
404,-0.33107
405,-0.33107
406,-0.33107
407,-0.33107
408,-0.33107
409,-0.33107
410,-0.33107
411,-0.33107
412,-0.33107
413,-0.33107
414,-0.33107
415,-0.33107
416,-0.33107
417,-0.33107
418,-0.33107
419,-0.33107
420,-0.33107
421,-0.33107
422,-0.33107
423,-0.33107
424,-0.33107
425,-0.33107
426,-0.33107
427,-0.33107
428,-0.33107
429,-0.33107
430,-0.33107
431,-0.33107
432,-0.33107
433,-0.33107
434,-0.33107
435,-0.33107
436,-0.33107
437,-0.33107
438,-0.33107
439,-0.33107
440,-0.33107
441,-0.33107
442,-0.33107
443,-0.33107
444,-0.33107
445,-0.33107
446,-0.33107
447,-0.33107
448,-0.33107
449,-0.33107
450,-0.33107
451,-0.33107
452,-0.33107
453,-0.33107
454,-0.33107
455,-0.33107
456,-0.33107
457,-0.33107
458,-0.33107
459,-0.33107
460,-0.33107
461,-0.33107
462,-0.33107
463,-0.33107
464,-0.33107
465,-0.33107
466,-0.33107
467,-0.33107
468,-0.33107
469,-0.33107
470,-0.33107
471,-0.33107
472,-0.33107
473,-0.33107
474,-0.33107
475,-0.33107
476,-0.33107
477,-0.33107
478,-0.33107
479,-0.33107
480,-0.33107
481,-0.33107
482,-0.33107
483,-0.33107
484,-0.33107
485,-0.33107
486,-0.33107
487,-0.33107
488,-0.33107
489,-0.33107
490,-0.33107
491,-0.33107
492,-0.33107
493,-0.33107
494,-0.33107
495,-0.33107
496,-0.33107
497,-0.33107
498,-0.33107
499,-0.33107
500,-0.33107
501,-0.33107
502,-0.33107
503,-0.33107
504,-0.33107
505,-0.33107
506,-0.33107
507,-0.33107
508,-0.33107
509,-0.33107
510,-0.33107
511,-0.33107
512,-0.33107
513,-0.33107
514,-0.33107
515,-0.33107
516,-0.33107
517,-0.33107
518,-0.33107
519,-0.33107
520,-0.33107
521,-0.33107
522,-0.33107
523,-0.33107
524,-0.33107
525,-0.33107
526,-0.33107
527,-0.33107
528,-0.33107
529,-0.33107
530,-0.33107
531,-0.33107
532,-0.33107
533,-0.33107
534,-0.33107
535,-0.33107
536,-0.33107
537,-0.33107
538,-0.33107
539,-0.33107
540,-0.33107
541,-0.33107
542,-0.33107
543,-0.33107
544,-0.33107
545,-0.33107
546,-0.33107
547,-0.33107
548,-0.33107
549,-0.33107
550,-0.33107
551,-0.33107
552,-0.33107
553,-0.33107
554,-0.33107
555,-0.33107
556,-0.33107
557,-0.33107
558,-0.33107
559,-0.33107
560,-0.33107
561,-0.33107
562,-0.33107
563,-0.33107
564,-0.33107
565,-0.33107
566,-0.33107
567,-0.33107
568,-0.33107
569,-0.33107
570,-0.33107
571,-0.33107
572,-0.33107
573,-0.33107
574,-0.33107
575,-0.33107
576,-0.33107
577,-0.33107
578,-0.33107
579,-0.33107
580,-0.33107
581,-0.33107
582,-0.33107
583,-0.33107
584,-0.33107
585,-0.33107
586,-0.33107
587,-0.33107
588,-0.33107
589,-0.33107
590,-0.33107
591,-0.33107
592,-0.33107
593,-0.33107
594,-0.33107
595,-0.33107
596,-0.33107
597,-0.33107
598,-0.33107
599,-0.33107
600,-0.33107
601,-0.33107
602,-0.33107
603,-0.33107
604,-0.33107
605,-0.33107
606,-0.33107
607,-0.33107
608,-0.33107
609,-0.33107
610,-0.33107
611,-0.33107
612,-0.33107
613,-0.33107
614,-0.33107
615,2.4247
616,2.9758
617,2.9758
618,2.9758
619,2.9758
620,2.9758
621,2.9758
622,1.3224
623,-0.33107
624,0.77123
625,2.9758
626,2.9758
627,2.9758
628,2.9758
629,3.8026
630,2.9758
631,2.9758
632,0.77123
633,-0.055498
634,-0.33107
635,-0.33107
636,-0.33107
637,-0.33107
638,-0.33107
639,-0.33107
640,-0.33107
641,-0.33107
642,-0.33107
643,-0.33107
644,-0.33107
645,-0.33107
646,-0.33107
647,-0.33107
648,1.8735
649,0.49565
650,-0.33107
651,-0.33107
652,-0.33107
653,-0.33107
654,-0.33107
655,-0.33107
656,-0.33107
657,-0.33107
658,-0.33107
659,-0.33107
660,-0.33107
661,-0.33107
662,-0.33107
663,-0.33107
664,-0.33107
665,-0.33107
666,-0.33107
667,-0.33107
668,-0.33107
669,-0.33107
670,-0.33107
671,-0.33107
672,-0.33107
673,-0.33107
674,-0.33107
675,-0.33107
676,-0.33107
677,-0.33107
678,-0.33107
679,-0.33107
680,-0.33107
681,-0.33107
682,-0.33107
683,-0.33107
684,-0.33107
685,-0.33107
686,-0.33107
687,-0.33107
688,-0.33107
689,-0.33107
690,-0.33107
691,-0.33107
692,-0.33107
693,-0.33107
694,-0.33107
695,-0.33107
696,-0.33107
697,-0.33107
698,-0.33107
699,-0.33107
700,-0.33107
701,-0.33107
702,-0.33107
703,-0.33107
704,-0.33107
705,-0.33107
706,-0.33107
707,-0.33107
708,-0.33107
709,-0.33107
710,-0.33107
711,-0.33107
712,-0.33107
713,-0.33107
714,-0.33107
715,-0.33107
716,-0.33107
717,-0.33107
718,-0.33107
719,-0.33107
