time,value
0,1.672
1,1.5754
2,1.3674
3,1.0658
4,0.70373
5,0.32939
6,-0.029947
7,-0.35796
8,-0.63013
9,-0.82152
10,-0.92786
11,-0.96221
12,-0.91401
13,-0.8005899999999999
14,-0.6263
15,-0.44861999999999996
16,-0.2765
17,-0.13632
18,-0.04363
19,0.016609
20,0.055809000000000004
21,0.091253
22,0.13342
23,0.20296
24,0.29696999999999996
25,0.39794
26,0.49965
27,0.5797
28,0.6257699999999999
29,0.63069
30,0.56615
31,0.45396000000000003
32,0.29352
33,0.11525
34,-0.07328899999999999
35,-0.24727
36,-0.37578
37,-0.45803
38,-0.48058999999999996
39,-0.44886000000000004
40,-0.38506
41,-0.30569
42,-0.2244
43,-0.15604
44,-0.11407
45,-0.089526
46,-0.089809
47,-0.10924
48,-0.13651
49,-0.17749
50,-0.22318000000000002
51,-0.24893
52,-0.25289
53,-0.21547
54,-0.12567
55,0.030924
56,0.25316
57,0.49388000000000004
58,0.72645
59,0.8883700000000001
60,0.93076
61,0.8370200000000001
62,0.60472
63,0.27276999999999996
64,-0.11502000000000001
65,-0.4842
66,-0.7708
67,-0.92704
68,-0.93663
69,-0.80637
70,-0.56142
71,-0.27814
72,0.012137
73,0.28121
74,0.4832
75,0.60583
76,0.6440600000000001
77,0.6102
78,0.50037
79,0.32559
80,0.12088
81,-0.077109
82,-0.23521
83,-0.33088
84,-0.35136999999999996
85,-0.32838
86,-0.27748
87,-0.23421999999999998
88,-0.21716999999999997
89,-0.2559
90,-0.33261
91,-0.41453999999999996
92,-0.45595
93,-0.42111000000000004
94,-0.29099
95,-0.068884
96,0.20689000000000002
97,0.47885
98,0.7058399999999999
99,0.8385799999999999
100,0.8761
101,0.8495299999999999
102,0.78286
103,0.70908
104,0.64331
105,0.57076
106,0.45638
107,0.26632
108,-0.00088137
109,-0.33528
110,-0.72068
111,-1.0802
112,-1.3465
113,-1.4842
114,-1.4799
115,-1.3553
116,-1.1427
117,-0.8941600000000001
118,-0.63931
119,-0.38594
120,-0.10407000000000001
121,0.23013000000000003
122,0.6411100000000001
123,1.1119
124,1.579
125,1.9624
126,2.1754
127,2.1511
128,1.8663
129,1.3543
130,0.6996
131,0.015550999999999999
132,-0.60542
133,-1.0981
134,-1.4359
135,-1.6176
136,-1.6595
137,-1.5917
138,-1.4375
139,-1.1949
140,-0.8874
141,-0.52362
142,-0.14879
143,0.20376
144,0.48577
145,0.6731199999999999
146,0.7577699999999999
147,0.764
148,0.7360899999999999
149,0.7085100000000001
150,0.70734
151,0.7260300000000001
152,0.74516
153,0.72059
154,0.61605
155,0.42015
156,0.13477999999999998
157,-0.19021
158,-0.5099199999999999
159,-0.76036
160,-0.9074399999999999
161,-0.9363
162,-0.86375
163,-0.72467
164,-0.56288
165,-0.40562
166,-0.26247
167,-0.13873
168,-0.028038999999999998
169,0.08630499999999999
170,0.20586
171,0.32842
172,0.45548
173,0.57231
174,0.6562100000000001
175,0.7040000000000001
176,0.70901
177,0.6664
178,0.56804
179,0.43088000000000004
180,0.26583
181,0.081187
182,-0.11713
183,-0.31076
184,-0.47553999999999996
185,-0.59616
186,-0.65578
187,-0.66994
188,-0.65118
189,-0.61944
190,-0.57713
191,-0.52976
192,-0.4614
193,-0.36712
194,-0.24255
195,-0.06855
196,0.15031
197,0.3835
198,0.59891
199,0.77115
200,0.88661
201,0.9475399999999999
202,0.9482
203,0.9131
204,0.8401299999999999
205,0.73145
206,0.59388
207,0.41621
208,0.18214
209,-0.11642000000000001
210,-0.46821
211,-0.8266899999999999
212,-1.1627
213,-1.4207
214,-1.5658
215,-1.5849
216,-1.4697
217,-1.2365
218,-0.91489
219,-0.53604
220,-0.12830999999999998
221,0.27844
222,0.6651699999999999
223,1.0255
224,1.3396
225,1.5938
226,1.7722
227,1.8321
228,1.757
229,1.5352
230,1.1655
231,0.67281
232,0.09202
233,-0.5223899999999999
234,-1.0992
235,-1.574
236,-1.8864
237,-2.0164
238,-1.9593
239,-1.7218
240,-1.355
241,-0.90541
242,-0.43261000000000005
243,0.024804
244,0.42656000000000005
245,0.74885
246,0.99087
247,1.1617
248,1.2668
249,1.3199
250,1.3152
251,1.2519
252,1.1404
253,0.9676600000000001
254,0.75669
255,0.49868999999999997
256,0.21028000000000002
257,-0.11035
258,-0.46341000000000004
259,-0.8298200000000001
260,-1.2081
261,-1.5456
262,-1.8033
263,-1.9242
264,-1.8551
265,-1.5666
266,-1.0733
267,-0.43967
268,0.24276
269,0.87382
270,1.3572
271,1.6357
272,1.6969999999999998
273,1.5843
274,1.3515
275,1.0752
276,0.81034
277,0.5828300000000001
278,0.38624
279,0.20665
280,0.019683000000000003
281,-0.19447
282,-0.43293999999999994
283,-0.6531100000000001
284,-0.83299
285,-0.9514
286,-0.9950100000000001
287,-0.9814
288,-0.91932
289,-0.83241
290,-0.73773
291,-0.63168
292,-0.50739
293,-0.34817
294,-0.13875
295,0.12479000000000001
296,0.4174
297,0.70455
298,0.95034
299,1.1224
300,1.1938
301,1.1559
302,1.0228
303,0.8291299999999999
304,0.5985
305,0.38125
306,0.20195
307,0.064777
308,-0.037781999999999996
309,-0.12725999999999998
310,-0.22835
311,-0.34458
312,-0.49854
313,-0.67174
314,-0.86082
315,-1.0278
316,-1.1461
317,-1.1928
318,-1.1495
319,-1.0321
320,-0.84267
321,-0.5958100000000001
322,-0.31536
323,-0.0062966
324,0.32239
325,0.66035
326,0.9883
327,1.2973
328,1.5611
329,1.7480000000000002
330,1.8337
331,1.7990000000000002
332,1.6280000000000001
333,1.3448
334,0.96275
335,0.49986
336,-0.021074000000000002
337,-0.56209
338,-1.0948
339,-1.5804
340,-1.9838
341,-2.2646
342,-2.3921
343,-2.3414
344,-2.1117
345,-1.7309
346,-1.2363
347,-0.6792600000000001
348,-0.096788
349,0.47366
350,1.0045
351,1.49
352,1.9196
353,2.2728
354,2.5248
355,2.617
356,2.5283
357,2.2266
358,1.732
359,1.0672
360,0.30641
361,-0.45773
362,-1.1596
363,-1.7181
364,-2.0994
365,-2.3008
366,-2.3413
367,-2.2558
368,-2.0605
369,-1.7794
370,-1.4229
371,-0.99185
372,-0.50198
373,0.021641
374,0.53875
375,1.008
376,1.3921
377,1.6576
378,1.8058
379,1.8539
380,1.8186
381,1.7133
382,1.5608
383,1.3625
384,1.1
385,0.75203
386,0.31406999999999996
387,-0.20659
388,-0.7739699999999999
389,-1.3314
390,-1.8152
391,-2.1608
392,-2.3227
393,-2.2795
394,-2.0389
395,-1.6271
396,-1.0905
397,-0.49136
398,0.1038
399,0.64346
400,1.0922
401,1.4273
402,1.6402
403,1.7255
404,1.6965
405,1.5753
406,1.3721
407,1.0964
408,0.77274
409,0.41808999999999996
410,0.058044000000000005
411,-0.2807
412,-0.58702
413,-0.82168
414,-0.9791
415,-1.0478
416,-1.0495
417,-0.98605
418,-0.87885
419,-0.75162
420,-0.60058
421,-0.42903
422,-0.24124
423,-0.035287
424,0.16452
425,0.34012
426,0.45473
427,0.4954
428,0.44803000000000004
429,0.33123
430,0.17495
431,0.031157
432,-0.058205999999999994
433,-0.043131
434,0.063484
435,0.24120999999999998
436,0.44825
437,0.63973
438,0.7649199999999999
439,0.80688
440,0.77063
441,0.6586
442,0.48268
443,0.26193
444,0.0060792
445,-0.28101
446,-0.5775
447,-0.8630399999999999
448,-1.1113
449,-1.2897
450,-1.3539
451,-1.2877
452,-1.0906
453,-0.78622
454,-0.42885
455,-0.062496
456,0.27774
457,0.57113
458,0.7996800000000001
459,0.96383
460,1.0781
461,1.1477
462,1.1754
463,1.1549
464,1.0737
465,0.92453
466,0.7023199999999999
467,0.39871999999999996
468,0.043146
469,-0.34262
470,-0.7156899999999999
471,-1.0385
472,-1.2764
473,-1.4019
474,-1.4173
475,-1.3227
476,-1.119
477,-0.8374
478,-0.49278999999999995
479,-0.11567999999999999
480,0.26254
481,0.62365
482,0.94285
483,1.1842
484,1.3273
485,1.3616
486,1.2908
487,1.1181
488,0.8696299999999999
489,0.56094
490,0.21441999999999997
491,-0.14937999999999999
492,-0.50948
493,-0.8368899999999999
494,-1.1104
495,-1.288
496,-1.3447
497,-1.256
498,-1.0168
499,-0.65864
