time,value
0,1.4469999999999998
1,1.3842
2,1.4147
3,1.3945
4,1.2637
5,1.1024
6,0.9728700000000001
7,0.865
8,0.82426
9,0.73897
10,0.64077
11,0.48988000000000004
12,0.31861999999999996
13,0.30016
14,0.39243
15,0.50376
16,0.5966899999999999
17,0.64956
18,0.57111
19,0.4963
20,0.3704
21,0.18658
22,0.045087999999999996
23,-0.13555
24,-0.26907
25,-0.4202
26,-0.59817
27,-0.8147
28,-1.0386
29,-1.1225
30,-1.0245
31,-0.9663799999999999
32,-0.97115
33,-1.0152
34,-1.0428
35,-1.1095
36,-1.2175
37,-1.2116
38,-1.2222
39,-1.2175
40,-1.2019
41,-1.0682
42,-0.90054
43,-0.75884
44,-0.64131
45,-0.5391
46,-0.48611000000000004
47,-0.41888000000000003
48,-0.28183
49,-0.11108
50,0.036338
51,0.2228
52,0.38815
53,0.51015
54,0.64498
55,0.82039
56,0.9834
57,1.1532
58,1.2978
59,1.3908
60,1.5657
61,1.7389
62,1.8492
63,1.9409999999999998
64,1.9829
65,1.8419
66,1.6981
67,1.5196
68,1.3532
69,1.2868
70,1.1395
71,1.0566
72,0.8997
73,0.71759
74,0.58373
75,0.44731000000000004
76,0.30002
77,0.1365
78,-0.028937
79,-0.18145999999999998
80,-0.33066
81,-0.50075
82,-0.6562600000000001
83,-0.8250700000000001
84,-0.9494299999999999
85,-0.9464600000000001
86,-0.9992700000000001
87,-1.0767
88,-1.1358
89,-1.1742
90,-1.1532
91,-1.2049
92,-1.2081
93,-1.3054
94,-1.4468
95,-1.6198
96,-1.7966
97,-1.9409999999999998
98,-1.8132
99,-1.6186
100,-1.4273
101,-1.2642
102,-1.0962
103,-0.93437
104,-0.81355
105,-0.68434
106,-0.58916
107,-0.5462899999999999
108,-0.61135
109,-0.7347100000000001
110,-0.61217
111,-0.41323000000000004
112,-0.20475
113,-0.026851999999999997
114,0.09761
115,0.24944000000000002
116,0.3658
117,0.35015999999999997
118,0.30002
119,0.304
120,0.4576
121,0.62657
122,0.77398
123,0.92622
124,0.9552200000000001
125,1.1168
126,1.2577
127,1.4196
