time,value
0,-1.0639
1,-1.0493
2,-1.0105
3,-0.9617
4,-0.90523
5,-0.84515
6,-0.7945
7,-0.75317
8,-0.71665
9,-0.6885399999999999
10,-0.66677
11,-0.64456
12,-0.62161
13,-0.60048
14,-0.5804600000000001
15,-0.5574899999999999
16,-0.5294
17,-0.5018199999999999
18,-0.48475
19,-0.48177
20,-0.48433000000000004
21,-0.48103
22,-0.47217
23,-0.46158999999999994
24,-0.44296
25,-0.41813
26,-0.39715
27,-0.38098000000000004
28,-0.37233
29,-0.36846999999999996
30,-0.35618
31,-0.33508000000000004
32,-0.30478
33,-0.25876
34,-0.19322999999999999
35,-0.094111
36,0.048145
37,0.23317
38,0.47291000000000005
39,0.76917
40,1.1081
41,1.4809
42,1.8719999999999999
43,2.2779
44,2.694
45,3.0829
46,3.3979
47,3.6260000000000003
48,3.7837
49,3.8969
50,3.9914
51,4.0759
52,4.1361
53,4.1164
54,3.8926
55,3.3377
56,2.4668
57,1.4843
58,0.66047
59,0.15037999999999999
60,-0.076606
61,-0.1376
62,-0.13079000000000002
63,-0.11219000000000001
64,-0.08878
65,-0.055969000000000005
66,-0.0231
67,0.017859
68,0.070161
69,0.12340999999999999
70,0.18647
71,0.25834
72,0.32674000000000003
73,0.39408000000000004
74,0.45841000000000004
75,0.52008
76,0.57552
77,0.6200399999999999
78,0.65267
79,0.66902
80,0.66118
81,0.62774
82,0.57218
83,0.50053
84,0.42353
85,0.34563
86,0.26139
87,0.16216
88,0.029445
89,-0.15036
90,-0.34929
91,-0.51589
92,-0.62216
93,-0.6725899999999999
94,-0.69206
95,-0.7046100000000001
96,-0.7179399999999999
97,-0.73418
98,-0.7541800000000001
99,-0.77636
100,-0.80314
101,-0.8311
102,-0.8499899999999999
103,-0.8597299999999999
104,-0.8663700000000001
105,-0.87097
106,-0.8692200000000001
107,-0.85556
108,-0.83345
109,-0.80815
110,-0.7795300000000001
111,-0.75207
112,-0.73005
113,-0.70526
114,-0.67225
115,-0.6358699999999999
116,-0.59996
117,-0.56608
118,-0.53625
119,-0.5119100000000001
120,-0.48888000000000004
121,-0.4622
122,-0.43588000000000005
123,-0.40931
124,-0.37314
125,-0.3284
126,-0.28096
127,-0.23056999999999997
128,-0.18417999999999998
129,-0.15192999999999998
130,-0.13118
131,-0.1211
132,-0.13414
133,-0.17570999999999998
134,-0.23696
135,-0.31099
136,-0.39424000000000003
137,-0.47943
138,-0.56052
139,-0.63667
140,-0.70562
141,-0.76263
142,-0.8064
143,-0.8340299999999999
144,-0.8407100000000001
145,-0.8349200000000001
146,-0.8303299999999999
147,-0.8240299999999999
148,-0.8111
149,-0.79593
150,-0.77435
151,-0.7401399999999999
152,-0.69334
153,-0.63243
154,-0.56576
155,-0.50457
156,-0.44373
157,-0.37827
158,-0.30687
159,-0.22389
160,-0.13221
161,-0.038056
162,0.054298
163,0.1423
164,0.22668000000000002
165,0.31015
166,0.39147
167,0.46886000000000005
168,0.54302
169,0.60861
170,0.6564
171,0.67729
172,0.64402
173,0.51455
174,0.27686
175,-0.024041
176,-0.30987
177,-0.52018
178,-0.64483
179,-0.7128399999999999
180,-0.76157
181,-0.80567
182,-0.8341200000000001
183,-0.8474299999999999
184,-0.8580200000000001
185,-0.86182
186,-0.8549100000000001
187,-0.8450799999999999
188,-0.8328200000000001
189,-0.8178
190,-0.80387
191,-0.78972
192,-0.77176
193,-0.74641
194,-0.71663
195,-0.69043
196,-0.67196
197,-0.6594399999999999
198,-0.64825
199,-0.63713
200,-0.63315
201,-0.63732
202,-0.64022
203,-0.64515
204,-0.6591600000000001
205,-0.67247
206,-0.68178
207,-0.69042
208,-0.68972
209,-0.67961
210,-0.66656
211,-0.6429699999999999
212,-0.60401
213,-0.5532
214,-0.48983999999999994
215,-0.41484
216,-0.3311
217,-0.23331
218,-0.11237
219,0.028327999999999996
220,0.17097
221,0.30438000000000004
222,0.4329
223,0.55443
224,0.65462
225,0.72024
226,0.73973
227,0.7188
228,0.68018
229,0.62965
230,0.56079
231,0.47994
232,0.39654
233,0.32369000000000003
234,0.28284000000000004
235,0.27662
236,0.29139
237,0.32355
238,0.36773
239,0.40799
240,0.42923
241,0.42203
242,0.39616999999999997
243,0.37655
244,0.37834
245,0.40553
246,0.45516999999999996
247,0.51641
248,0.5745899999999999
249,0.61757
250,0.64923
251,0.68014
252,0.71216
253,0.74324
254,0.76623
255,0.77005
256,0.75454
257,0.73023
258,0.6946399999999999
259,0.63522
260,0.5498
261,0.44585
262,0.33016999999999996
263,0.20371
264,0.060307000000000006
265,-0.11617999999999999
266,-0.34169
267,-0.59005
268,-0.79823
269,-0.94286
