time,value
0,0.8665200000000001
1,-0.27383
2,-0.39521
3,0.10278
4,-0.41043
5,0.1043
6,0.007243600000000001
7,-0.44273
8,0.092052
9,0.27741
10,-0.45023
11,-0.22043000000000001
12,-0.11274
13,-0.0076613
14,0.051687000000000004
15,-0.25403000000000003
16,0.11589
17,0.7835300000000001
18,0.0034972000000000002
19,-0.064104
20,-0.57209
21,0.11295
22,0.019716
23,0.35877
24,0.34218000000000004
25,0.24636
26,0.2429
27,0.19882
28,-0.074226
29,-0.17342
30,0.1996
31,1.6097
32,1.6097
33,1.6097
34,1.6097
35,1.6097
36,1.6097
37,1.6097
38,1.6097
39,1.6097
40,1.6097
41,1.6097
42,-1.6336
43,-1.6336
44,-1.6336
45,-1.6336
46,-1.6336
47,-1.6336
48,-1.6336
49,-1.6336
50,-1.6336
51,-1.6336
52,-1.6336
53,0.24331999999999998
54,-0.063403
55,0.0215
56,-0.53276
57,-0.6148
58,0.66983
59,0.11672
60,0.16492
61,0.068785
62,0.15955999999999998
63,-0.025494
64,0.63636
65,0.06460199999999999
66,-0.0054562
67,-0.09204
68,-0.1014
69,0.44782
70,-0.08746699999999999
71,-0.44137
72,0.007721899999999999
73,-0.0049168
74,0.14013
75,0.14145
76,-0.76777
77,0.19286
78,-0.14006
79,-0.076987
80,0.086685
81,0.061871
82,-0.15264
83,0.7275
84,0.016278
85,-0.31099
86,-1.6336
87,-1.6336
88,-1.6336
89,-1.6336
90,-1.6336
91,-1.6336
92,-1.6336
93,-1.6336
94,-1.6336
95,-1.6336
96,-1.6336
97,-1.6336
98,1.6097
99,1.6097
100,1.6097
101,1.6097
102,1.6097
103,1.6097
104,1.6097
105,1.6097
106,1.6097
107,1.6097
108,1.6097
109,0.22815
110,-0.5394800000000001
111,0.47785
112,-0.14479
113,-0.27563000000000004
114,0.31122
115,0.025438
116,0.33254
117,-0.32811999999999997
118,-0.32976
119,-0.30889
120,-0.0013229000000000001
121,-0.021296000000000002
122,0.079152
123,0.5342399999999999
124,0.4897
125,0.36756
126,-0.20240999999999998
127,0.24024
