time,value
0,1.1921
1,1.1921
2,1.1921
3,1.1921
4,1.1921
5,1.1921
6,1.1921
7,1.1921
8,1.1921
9,1.1921
10,1.1921
11,1.1921
12,1.1921
13,1.1921
14,1.1921
15,1.1921
16,1.1921
17,1.1921
18,1.1921
19,1.1921
20,1.1921
21,1.1921
22,1.1921
23,1.1921
24,1.1921
25,1.1921
26,1.1921
27,1.1921
28,1.1921
29,1.1921
30,1.1921
31,1.1921
32,1.1921
33,1.1921
34,1.1921
35,1.1921
36,1.1921
37,1.1921
38,1.1921
39,1.1921
40,1.1921
41,1.1921
42,1.1921
43,1.1921
44,1.1921
45,1.1921
46,1.1921
47,1.1921
48,1.1921
49,1.1921
50,1.1921
51,1.1921
52,1.1921
53,1.1921
54,1.1921
55,1.1921
56,1.1921
57,1.1921
58,1.1921
59,1.1921
60,1.1921
61,1.1921
62,1.1921
63,1.1921
64,1.1921
65,1.1921
66,1.1921
67,1.1921
68,1.1921
69,1.1921
70,1.1921
71,1.1921
72,1.1919
73,1.1913
74,1.1873
75,1.1823
76,1.1774
77,1.1724
78,1.1675
79,1.1625
80,1.1584
81,1.1566
82,1.156
83,1.156
84,1.156
85,1.156
86,1.156
87,1.1554
88,1.1541
89,1.1492
90,1.1442
91,1.1392
92,1.1343
93,1.1293
94,1.1244
95,1.1235
96,1.1251
97,1.13
98,1.135
99,1.1399
100,1.1449
101,1.1498
102,1.1548
103,1.1598
104,1.1647
105,1.1697
106,1.1746
107,1.1796
108,1.1845
109,1.1895
110,1.1811
111,1.1703
112,1.1555
113,1.1406
114,1.1258
115,1.1109
116,1.0929
117,1.0716
118,1.026
119,0.9764799999999999
120,0.92695
121,0.8774200000000001
122,0.82789
123,0.77835
124,0.72395
125,0.6606
126,0.5929
127,0.52355
128,0.45421000000000006
129,0.38486
130,0.31551999999999997
131,0.24791999999999997
132,0.18236
133,0.12292
134,0.06348
135,0.0040411
136,-0.055397
137,-0.11484000000000001
138,-0.17427
139,-0.2185
140,-0.25583
141,-0.28555
142,-0.31527
143,-0.34499
144,-0.37471
145,-0.40396
146,-0.43138000000000004
147,-0.45442
148,-0.47423000000000004
149,-0.49404
150,-0.51386
151,-0.53367
152,-0.55348
153,-0.57131
154,-0.5616300000000001
155,-0.5474899999999999
156,-0.52768
157,-0.5078699999999999
158,-0.48805
159,-0.46824
160,-0.45268
161,-0.44047
162,-0.44888999999999996
163,-0.4588
164,-0.4687
165,-0.47861000000000004
166,-0.48851999999999995
167,-0.49842
168,-0.51479
169,-0.5399
170,-0.5686899999999999
171,-0.59841
172,-0.62813
173,-0.65785
174,-0.68757
175,-0.72109
176,-0.7580600000000001
177,-0.8026399999999999
178,-0.8472200000000001
179,-0.8918
180,-0.9363799999999999
181,-0.98096
182,-1.0255
183,-1.064
184,-1.1004
185,-1.1351
186,-1.1698
187,-1.2044
188,-1.2391
189,-1.2725
190,-1.3027
191,-1.3262
192,-1.3459999999999999
193,-1.3658
194,-1.3856
195,-1.4054
196,-1.4252
197,-1.4428
198,-1.4465
199,-1.4483
200,-1.4483
201,-1.4483
202,-1.4483
203,-1.4483
204,-1.4462
205,-1.443
206,-1.4331
207,-1.4232
208,-1.4133
209,-1.4034
210,-1.3935
211,-1.3835
212,-1.3675
213,-1.3451
214,-1.3207
215,-1.2959
216,-1.2711
217,-1.2464
218,-1.2216
219,-1.1951
220,-1.1675
221,-1.1377
222,-1.1079999999999999
223,-1.0783
224,-1.0486
225,-1.0189
226,-0.98913
227,-0.9667
228,-0.9458200000000001
229,-0.92601
230,-0.9062
231,-0.88638
232,-0.8665700000000001
233,-0.8493200000000001
234,-0.83688
235,-0.8334
236,-0.8334
237,-0.8334
238,-0.8334
239,-0.8334
240,-0.8334
241,-0.8343299999999999
242,-0.8387
243,-0.8434200000000001
244,-0.8483700000000001
245,-0.8533200000000001
246,-0.8582799999999999
247,-0.8632299999999999
248,-0.86956
249,-0.87671
250,-0.8866200000000001
251,-0.8965200000000001
252,-0.90643
253,-0.91633
254,-0.92624
255,-0.93615
256,-0.9409299999999999
257,-0.94185
258,-0.94191
259,-0.94191
260,-0.94191
261,-0.94191
262,-0.94191
263,-0.94191
264,-0.94191
265,-0.94191
266,-0.94191
267,-0.94191
268,-0.94191
269,-0.94191
270,-0.94191
271,-0.92909
272,-0.91495
273,-0.90009
274,-0.88523
275,-0.8703700000000001
276,-0.85551
277,-0.84065
278,-0.8257899999999999
279,-0.81093
280,-0.7960699999999999
281,-0.78122
282,-0.76636
283,-0.7515
284,-0.73664
285,-0.72043
286,-0.70085
287,-0.68111
288,-0.6613
289,-0.64149
290,-0.62168
291,-0.6018600000000001
292,-0.5838399999999999
293,-0.5667300000000001
294,-0.55187
295,-0.53701
296,-0.52215
297,-0.50729
298,-0.49243000000000003
299,-0.47757
300,-0.46893
301,-0.46375
302,-0.4588
303,-0.45383999999999997
304,-0.44888999999999996
305,-0.44393999999999995
306,-0.43996
307,-0.44226000000000004
308,-0.44843
309,-0.45833999999999997
310,-0.46824
311,-0.47815
312,-0.48805
313,-0.49796
314,-0.5078699999999999
