time,value
0,-0.70252
1,-0.70252
2,-0.70252
3,-0.70252
4,-0.70252
5,-0.70252
6,-0.70252
7,-0.70252
8,-0.70252
9,-0.70252
10,-0.70252
11,-0.70252
12,-0.70252
13,-0.70252
14,-0.70252
15,-0.70252
16,-0.70252
17,-0.70252
18,-0.70252
19,-0.70252
20,-0.70252
21,-0.70252
22,-0.70252
23,-0.70252
24,-0.70252
25,-0.70252
26,-0.70252
27,-0.70252
28,-0.70252
29,-0.70252
30,-0.70252
31,-0.70252
32,-0.70252
33,-0.70252
34,-0.70252
35,-0.70252
36,-0.70252
37,-0.7006100000000001
38,-0.69755
39,-0.67878
40,-0.65351
41,-0.6282399999999999
42,-0.60297
43,-0.59182
44,-0.5826399999999999
45,-0.5823
46,-0.58249
47,-0.58631
48,-0.59302
49,-0.61829
50,-0.64356
51,-0.66882
52,-0.69409
53,-0.71936
54,-0.74463
55,-0.7699
56,-0.7951699999999999
57,-0.8204299999999999
58,-0.8457
59,-0.87097
60,-0.8962399999999999
61,-0.92151
62,-0.93389
63,-0.94155
64,-0.94295
65,-0.94295
66,-0.94295
67,-0.94295
68,-0.94295
69,-0.94295
70,-0.94295
71,-0.94586
72,-0.96424
73,-0.9843
74,-1.0096
75,-1.0348
76,-1.0601
77,-1.0854
78,-1.1106
79,-1.1359
80,-1.1612
81,-1.1976
82,-1.2421
83,-1.2906
84,-1.3411
85,-1.3812
86,-1.4180000000000001
87,-1.4238
88,-1.4238
89,-1.4238
90,-1.4241
91,-1.444
92,-1.4644
93,-1.4897
94,-1.5149
95,-1.5402
96,-1.5655
97,-1.5907
98,-1.6159999999999999
99,-1.6413
100,-1.6484
101,-1.6323
102,-1.6114
103,-1.5861
104,-1.5557
105,-1.5219999999999998
106,-1.4766
107,-1.4261
108,-1.3756
109,-1.325
110,-1.2745
111,-1.224
112,-1.1734
113,-1.1222
114,-1.0533
115,-0.9804700000000001
116,-0.87939
117,-0.77832
118,-0.67725
119,-0.57617
120,-0.4751
121,-0.37403000000000003
122,-0.27295
123,-0.18572
124,-0.11450999999999999
125,-0.06851
126,-0.043241
127,-0.017973
128,0.0072954
129,-0.00049244
130,-0.021167
131,-0.045538
132,-0.07080700000000001
133,-0.096075
134,-0.12134
135,-0.14661
136,-0.17188
137,-0.19715
138,-0.21894
139,-0.22046999999999997
140,-0.22165
141,-0.22165
142,-0.22165
143,-0.22165
144,-0.22165
145,-0.22165
146,-0.22165
147,-0.22165
148,-0.19355999999999998
149,-0.14456
150,-0.094544
151,-0.044007
152,0.061212
153,0.18525999999999998
154,0.37406999999999996
155,0.57622
156,0.77836
157,0.98051
158,0.98051
159,0.98051
160,0.98051
161,0.9960700000000001
162,1.0872
163,1.2003
164,1.3771
165,1.5532
166,1.7278
167,1.871
168,1.9721
169,2.0732
170,2.1742
171,2.2506
172,2.3103
173,2.3465
174,2.3718
175,2.3959
176,2.4196
177,2.4231
178,2.4231
179,2.4231
180,2.4227
181,2.4082
182,2.3925
183,2.3672
184,2.3415
185,2.3139
186,2.2799
187,2.2294
188,2.1788
189,2.1283
190,2.0639
191,1.9828
192,1.8909
193,1.7899
194,1.6888
195,1.5877
196,1.4866
197,1.3856
198,1.2845
199,1.1834
200,1.1247
201,1.0719
202,1.0456
203,1.0201
204,0.9910399999999999
205,0.9590700000000001
206,0.90853
207,0.858
208,0.8074600000000001
209,0.7620600000000001
210,0.72837
211,0.69796
212,0.67269
213,0.64961
214,0.6289399999999999
215,0.6198600000000001
216,0.6198600000000001
217,0.6198600000000001
218,0.6198600000000001
219,0.6198600000000001
220,0.6198600000000001
221,0.6198600000000001
222,0.6198600000000001
223,0.6247
224,0.6300600000000001
225,0.65508
226,0.68035
227,0.70562
228,0.72506
229,0.71358
230,0.6987300000000001
231,0.6734600000000001
232,0.6502100000000001
233,0.63107
234,0.6198600000000001
235,0.6198600000000001
236,0.6198600000000001
237,0.6198600000000001
238,0.6086600000000001
239,0.5895100000000001
240,0.56626
241,0.54099
242,0.52094
243,0.50256
244,0.49965
245,0.49965
246,0.49965
247,0.4994
248,0.47948999999999997
249,0.45906
250,0.43378999999999995
251,0.40993
252,0.39232
253,0.37943000000000005
254,0.37943000000000005
255,0.37943000000000005
256,0.37943000000000005
257,0.36128000000000005
258,0.31993
259,0.27376
260,0.22321999999999997
261,0.18295999999999998
262,0.14927
263,0.139
264,0.139
265,0.139
266,0.139
267,0.12043
268,0.098993
269,0.073912
270,0.04898
271,0.0329
272,0.018781
273,0.018781
274,0.018781
275,0.018781
276,0.012282
277,-0.0099237
278,-0.033287
279,-0.058554999999999996
280,-0.079211
281,-0.094525
282,-0.10144
283,-0.10144
284,-0.10144
285,-0.10144
286,-0.08490700000000001
287,-0.061936
288,-0.037116
289,-0.011847
290,0.0038777
291,0.018425999999999998
292,0.018781
293,0.018781
294,0.018781
295,0.015307
296,-0.0084296
297,-0.032521
298,-0.05779
299,-0.079416
300,-0.093199
301,-0.10144
302,-0.10144
303,-0.10144
304,-0.10144
305,-0.10144
306,-0.10144
307,-0.10144
308,-0.10144
309,-0.092321
310,-0.08007
311,-0.057024
312,-0.031756
313,-0.0064874
314,0.018781
