{
  "about": {
    "problemID": "LL1_cond_auth_network_problem",
    "problemName": "Predict_cond_auth_network",
    "problemDescription": "Predict condensed matter collaboration network ",
    "problemSchemaVersion": "4.0.0",
    "problemVersion": "4.0.0",
    "taskKeywords": [
      "linkPrediction"
    ]
  },
  "inputs": {
    "data": [
      {
        "datasetID": "LL1_cond_auth_network_dataset",
        "targets": [
          {
            "targetIndex": 0,
            "resID": "learningData",
            "colIndex": 2,
            "colName": "toNode"
          }
        ]
      }
    ],
    "dataSplits": {
      "method": "holdOut",
      "testSize": 0.2,
      "numRepeats": 0,
      "splitsFile": "dataSplits.csv"
    },
    "performanceMetrics": [
      {
        "metric": "rocAuc"
      }
    ]
  },
  "expectedOutputs": {
    "predictionsFile": "predictions.csv"
  }
}