time,value
0,0.6445
1,1.2038
2,1.9495
3,2.1359
4,2.1359
5,1.3902
6,0.45807
7,-0.6604800000000001
8,-1.2198
9,-1.4062
10,-1.2198
11,-0.8469
12,-0.8469
13,-1.4062
14,-1.7790000000000001
15,-1.5926
16,-1.2198
17,-0.8469
18,-0.47405
19,-0.47405
20,-0.28763
21,0.08522300000000001
22,0.27165
23,0.45807
24,0.45807
25,0.45807
26,0.45807
27,0.45807
28,0.27165
29,0.08522300000000001
30,0.08522300000000001
31,0.08522300000000001
32,0.08522300000000001
33,0.27165
34,0.08522300000000001
35,0.08522300000000001
36,0.08522300000000001
37,0.6445
38,1.0173
39,1.3902
40,1.2038
41,1.2038
42,1.7630000000000001
43,2.1359
44,1.7630000000000001
45,0.6445
46,-0.1012
47,-0.6604800000000001
48,-1.2198
49,-1.2198
50,-0.6604800000000001
51,-0.6604800000000001
52,-1.4062
53,-1.9655
54,-1.7790000000000001
55,-1.4062
56,-0.47405
57,0.08522300000000001
58,0.45807
59,0.27165
60,-0.28763
61,-0.1012
62,0.08522300000000001
63,0.27165
64,0.08522300000000001
65,-0.1012
66,-0.1012
67,-0.1012
68,-0.1012
69,-0.1012
