time,value
0,2.3617
1,3.6797
2,4.2381
3,3.699
4,2.2837
5,0.68628
6,-0.37504
7,-0.61028
8,-0.27426
9,0.1178
10,0.21311999999999998
11,0.028845
12,-0.18247
13,-0.22113000000000002
14,-0.10203
15,0.019706
16,0.032468000000000004
17,-0.040202
18,-0.1002
19,-0.082875
20,0.0040762
21,0.1224
22,0.24633000000000002
23,0.35663
24,0.43008
25,0.47778999999999994
26,0.59702
27,0.9394100000000001
28,1.5632
29,2.2851
30,2.7212
31,2.5265
32,1.6814
33,0.56965
34,-0.29203
35,-0.60511
36,-0.46153999999999995
37,-0.20723000000000003
38,-0.13080999999999998
39,-0.26111999999999996
40,-0.4253
41,-0.46102
42,-0.36687
43,-0.26739
44,-0.26364
45,-0.34203
46,-0.41501000000000005
47,-0.4223
48,-0.38403000000000004
49,-0.35963
50,-0.37539
51,-0.40763
52,-0.42038000000000003
53,-0.40651
54,-0.39304
55,-0.40339
56,-0.4318
57,-0.4565
58,-0.46024
59,-0.44871000000000005
60,-0.444
61,-0.45333999999999997
62,-0.47142
63,-0.48652
64,-0.4875
65,-0.47384
66,-0.45592
67,-0.44606
68,-0.45092
69,-0.46613000000000004
70,-0.48034
71,-0.48608
72,-0.48536999999999997
73,-0.48655
74,-0.49546999999999997
75,-0.5079199999999999
76,-0.5140899999999999
77,-0.5099100000000001
78,-0.5021399999999999
79,-0.50292
80,-0.517
81,-0.53463
82,-0.5405300000000001
83,-0.529
84,-0.51013
85,-0.50268
86,-0.51682
87,-0.5441199999999999
88,-0.56521
89,-0.56595
90,-0.54928
91,-0.53292
92,-0.5341600000000001
93,-0.55613
94,-0.58568
95,-0.6030800000000001
96,-0.59763
97,-0.57611
98,-0.55662
