time,value
0,-0.6806
1,-0.35486
2,0.19763
3,0.31740999999999997
4,-0.47773000000000004
5,-0.055859000000000006
6,0.35731
7,-0.15050999999999998
8,-0.3715
9,-0.2818
10,0.41408
11,0.0925
12,-0.10097
13,-0.33594
14,0.074115
15,-0.19845
16,0.57622
17,0.12629
18,-0.063828
19,0.062747
20,-0.41083000000000003
21,0.034936
22,0.44738999999999995
23,-0.06641699999999999
24,0.07854900000000001
25,-0.10372999999999999
26,0.47629
27,-0.028357999999999998
28,0.021459
29,0.11794
30,0.56038
31,-0.0010824
32,-0.27035
33,0.50531
34,0.19127
35,0.32598
36,-0.018466999999999997
37,-0.32461
38,0.18905
39,-0.49259
40,-0.17815999999999999
41,0.5534
42,0.30585
43,-0.0097564
44,-0.036461
45,-0.45403000000000004
46,0.17706
47,0.24216999999999997
48,0.48462
49,0.12745
50,0.20961
51,-0.059328
52,0.47705
53,0.25774
54,0.14686
55,-0.33458000000000004
56,-0.033764999999999996
57,-0.23665
58,-0.51151
59,-0.13003
60,0.42081
61,0.48751000000000005
62,0.018963999999999998
63,0.15207
64,1.4965
65,1.4965
66,1.4965
67,1.4965
68,1.4965
69,1.4965
70,1.4965
71,1.4965
72,1.4965
73,1.4965
74,1.4965
75,-1.6007
76,-1.6007
77,-1.6007
78,-1.6007
79,-1.6007
80,-1.6007
81,-1.6007
82,-1.6007
83,-1.6007
84,-1.6007
85,-0.12514
86,-0.26799
87,-0.064148
88,-0.26375
89,-0.49918
90,-0.3812
91,0.040438
92,0.1351
93,0.028506999999999998
94,-0.19417
95,-0.43905
96,-0.15625
97,1.4965
98,1.4965
99,1.4965
100,1.4965
101,1.4965
102,1.4965
103,1.4965
104,1.4965
105,1.4965
106,1.4965
107,1.4965
108,1.4965
109,1.4965
110,1.4965
111,1.4965
112,-1.6007
113,-1.6007
114,-1.6007
115,-1.6007
116,-1.6007
117,-1.6007
118,-1.6007
119,-1.6007
120,-1.6007
121,-1.6007
122,-1.6007
123,-1.6007
124,-1.6007
125,-1.6007
126,-0.16388
127,-0.59663
