time,value
0,0.23169
1,0.23169
2,0.23169
3,0.23169
4,0.23169
5,0.23169
6,0.23169
7,0.23169
8,0.23169
9,0.23169
10,0.23169
11,0.23169
12,0.23169
13,0.23169
14,0.23169
15,0.23169
16,0.23169
17,0.23169
18,0.23169
19,0.23169
20,0.23169
21,0.23169
22,0.23169
23,0.23169
24,0.23169
25,0.23169
26,0.23169
27,0.23169
28,0.23169
29,0.23169
30,0.23169
31,0.23169
32,0.23169
33,0.23169
34,0.23169
35,0.23169
36,0.23169
37,0.23169
38,0.23169
39,0.23169
40,0.23169
41,0.23169
42,0.23169
43,0.23169
44,0.23169
45,0.23169
46,0.23169
47,0.23169
48,0.23169
49,0.23169
50,0.23169
51,0.23169
52,0.23169
53,0.23169
54,0.23169
55,0.23169
56,0.23169
57,0.23169
58,0.23169
59,0.23169
60,0.23169
61,0.23169
62,0.23169
63,0.23169
64,0.23169
65,0.23169
66,0.23169
67,0.23169
68,0.23169
69,0.23169
70,0.23169
71,0.23169
72,0.23169
73,0.23206999999999997
74,0.24539
75,0.25871
76,0.31827
77,0.38821
78,0.45813999999999994
79,0.5280699999999999
80,0.598
81,0.66793
82,0.7378600000000001
83,0.8078
84,0.8777299999999999
85,0.9476600000000001
86,1.0176
87,1.0875
88,1.1575
89,1.2274
90,1.2973
91,1.3672
92,1.4372
93,1.5071
94,1.577
95,1.6469999999999998
96,1.7154
97,1.7836
98,1.8285
99,1.8634
100,1.8984
101,1.9334
102,1.9683
103,2.0033
104,2.0333
105,1.9984
106,1.9634
107,1.8984
108,1.8285
109,1.7585
110,1.6886
111,1.6099
112,1.52
113,1.4189
114,1.2790000000000001
115,1.1391
116,0.99928
117,0.85941
118,0.71955
119,0.5796899999999999
120,0.38368
121,0.14891
122,-0.43227
123,-0.33442
124,-0.57918
125,-0.82395
126,-1.0687
127,-1.2433
128,-1.4148
129,-1.5366
130,-1.6415
131,-1.7464
132,-1.8513
133,-1.9481
134,-2.028
135,-2.0909999999999997
136,-2.0211
137,-1.9512
138,-1.8812
139,-1.8113
140,-1.7414
141,-1.6715
142,-1.5888
143,-1.4922
144,-1.3934
145,-1.2885
146,-1.1836
147,-1.0787
148,-0.9738
149,-0.88016
150,-0.7885800000000001
151,-0.71072
152,-0.64079
153,-0.57086
154,-0.50093
155,-0.431
156,-0.36106
157,-0.29113
158,-0.2212
159,-0.15127000000000002
160,-0.39064
161,-0.2505
162,0.30867
163,0.12846
164,0.19046
165,0.23875
166,0.28497
167,0.31994
168,0.3549
169,0.38987
170,0.42483999999999994
171,0.4598
172,0.49477
173,0.52973
174,0.5647
175,0.5996600000000001
176,0.63463
177,0.6696
178,0.7045600000000001
179,0.73953
180,0.80109
181,0.86603
182,0.93434
183,1.0043
184,1.0742
185,1.1441
186,1.2098
187,1.2631
188,1.3156
189,1.3506
190,1.3856
191,1.4205
192,1.4555
193,1.4905
194,1.5254
195,1.5604
196,1.5954
197,1.6303
198,1.6653
199,1.7003
200,1.7352
201,1.7702
202,1.7278
203,1.6628
204,1.5754
205,1.4705
206,1.3656
207,1.2607
208,1.1541
209,1.0376
210,0.92104
211,0.78282
212,0.6429600000000001
213,0.5030899999999999
214,0.36323
215,0.22336999999999999
216,0.43355
217,-0.21652
218,-0.15307
219,-0.2595
220,-0.36439
221,-0.46929
222,-0.57419
223,-0.67909
224,-0.75753
225,-0.82247
226,-0.8739
227,-0.90886
228,-0.94383
229,-0.9787899999999999
230,-1.0136
231,-1.0419
232,-1.0702
233,-1.0754
234,-1.0754
235,-1.0754
236,-1.0754
237,-1.0754
238,-1.0754
239,-1.0805
240,-1.1089
241,-1.1372
242,-1.1719
243,-1.2069
244,-1.2419
245,-1.2768
246,-1.3036
247,-1.3236
248,-1.3368
249,-1.3368
250,-1.3368
251,-1.3368
252,-1.3368
253,-1.3353
254,-1.3336
255,-1.3085
256,-1.2735
257,-1.2385
258,-1.2036
259,-1.1686
260,-1.1336
261,-1.097
262,-1.0388
263,-0.9804799999999999
264,-0.91219
265,-0.84226
266,-0.7723300000000001
267,-0.7024
268,-0.63683
269,-0.57689
270,-0.52257
271,-0.48761000000000004
272,-0.45264
273,-0.41768
274,-0.38271
275,-0.34774
276,-0.31278
277,-0.29653
278,-0.2932
279,-0.29113
280,-0.29113
281,-0.29113
282,-0.29113
283,-0.29113
284,-0.30867
285,-0.32699
286,-0.35773
287,-0.3927
288,-0.42767
289,-0.46263000000000004
290,-0.4976
291,-0.53256
292,-0.56753
293,-0.60249
294,-0.63746
295,-0.67243
296,-0.70739
297,-0.74236
298,-0.77732
299,-0.82505
300,-0.88665
301,-0.95049
302,-1.0204
303,-1.0904
304,-1.1603
305,-1.2302
306,-1.2889
307,-1.3455
308,-1.3884
309,-1.4234
310,-1.4583
311,-1.4933
312,-1.5283
313,-1.5632
314,-1.5982
315,-1.3982
316,-1.3982
317,-1.3982
318,-1.3982
319,-1.3982
320,-1.3982
321,-1.3982
322,-1.3982
323,-1.3982
324,-1.3982
325,-1.3982
326,-1.3982
327,-1.3982
328,-1.3982
329,-1.3982
330,-1.3982
331,-1.3982
332,-1.3982
333,-1.3982
334,-1.3982
335,-1.3982
336,-1.3982
337,-1.3982
338,-1.3982
339,-1.3982
340,-1.3982
341,-1.3982
342,-1.3982
343,-1.3982
344,-1.3982
345,-1.3982
346,-1.3982
347,-1.3982
348,-1.3982
349,-1.3982
350,-1.3982
351,-1.3982
352,-1.3982
353,-1.3982
354,-1.3982
355,-1.3982
356,-1.3982
357,-1.3982
358,-1.3982
359,-1.3982
360,-1.3982
361,-1.3982
362,-1.3982
363,-1.3982
364,-1.3982
365,-1.3982
366,-1.3982
367,-1.3982
368,-1.3982
369,-1.3982
370,-1.3982
371,-1.3982
372,-1.3982
373,-1.3982
374,-1.3982
375,-1.3982
376,-1.3982
377,-1.3982
378,-1.3982
379,-1.3982
380,-1.3982
381,-1.3982
382,-1.3982
383,-1.3982
384,-1.3982
385,-1.3982
386,-1.3982
387,-1.3982
388,-1.3980000000000001
389,-1.3913
390,-1.3845
391,-1.3541
392,-1.3185
393,-1.2828
394,-1.2472
395,-1.2115
396,-1.1759
397,-1.1376
398,-1.0875
399,-1.0375
400,-0.9840899999999999
401,-0.9306200000000001
402,-0.87716
403,-0.8236899999999999
404,-0.77442
405,-0.72859
406,-0.68621
407,-0.65056
408,-0.61492
409,-0.57928
410,-0.5436300000000001
411,-0.50721
412,-0.47071999999999997
413,-0.42227
414,-0.36880999999999997
415,-0.31534
416,-0.26188
417,-0.20840999999999998
418,-0.15494000000000002
419,-0.49972
420,-0.3512
421,-0.20269
422,-0.10520999999999998
423,-0.084605
424,0.07301
425,0.16212000000000001
426,0.24011
427,0.30376
428,0.35307
429,0.35307
430,0.35307
431,0.35307
432,0.35307
433,0.35307
434,0.35307
435,0.25768
436,0.096437
437,-0.07126299999999999
438,-0.24948
439,-0.4277
440,-0.12439000000000001
441,-0.16004000000000002
442,-0.19568
443,-0.23131999999999997
444,-0.26697
445,-0.30261
446,-0.33825
447,-0.3739
448,-0.40789000000000003
449,-0.43843999999999994
450,-0.46555
451,-0.46555
452,-0.46555
453,-0.46555
454,-0.46555
455,-0.46555
456,-0.46555
457,-0.45255
458,-0.42539
459,-0.39596
460,-0.36032
461,-0.32468
462,-0.28903
463,-0.25339
464,-0.21774000000000002
465,-0.1821
466,-0.14645999999999998
467,-0.11080999999999999
468,-0.35980999999999996
469,-0.18159
470,0.028007
471,0.17485
472,0.35307
473,0.10305
474,0.13869
475,0.17434000000000002
476,0.20998000000000003
477,0.24563000000000001
478,0.28126999999999996
479,0.31690999999999997
480,0.35256
481,0.3882
482,0.42383999999999994
483,0.45948999999999995
484,0.49513
485,0.53078
486,0.56953
487,0.60941
488,0.65638
489,0.7098399999999999
490,0.76331
491,0.81677
492,0.87024
493,0.92371
494,0.9771700000000001
495,1.0171
496,1.0553
497,1.0917
498,1.1274
499,1.163
500,1.1987
501,1.2343
502,1.27
503,1.3056
504,1.3412
505,1.3769
506,1.4125
507,1.4482
508,1.4838
509,1.5195
510,1.5551
511,1.5908
512,1.6264
513,1.662
514,1.6977
515,1.7333
516,1.7690000000000001
517,1.7652
518,1.7499
519,1.7231
520,1.6875
521,1.6519
522,1.6162
523,1.5789
524,1.5314
525,1.4838
526,1.4142
527,1.3429
528,1.2717
529,1.2004
530,1.1291
531,1.0578
532,0.99655
533,0.95921
534,0.92201
535,0.88636
536,0.85072
537,0.81508
538,0.7794300000000001
539,0.75053
540,0.72507
541,0.70305
542,0.68523
543,0.6674100000000001
544,0.64959
545,0.6318600000000001
546,0.61743
547,0.60301
548,0.60037
549,0.60037
550,0.60037
551,0.60037
552,0.60037
553,0.60037
554,0.59772
555,0.5833
556,0.56887
557,0.55114
558,0.53332
559,0.5155
560,0.49768
561,0.48405
562,0.47386999999999996
563,0.46713000000000005
564,0.46713000000000005
565,0.46713000000000005
566,0.46713000000000005
567,0.46713000000000005
568,0.46868000000000004
569,0.47038
570,0.49598000000000003
571,0.53162
572,0.5672699999999999
573,0.6029100000000001
574,0.63856
575,0.6742
576,0.7098399999999999
577,0.74549
578,0.78113
579,0.81677
580,0.8524200000000001
581,0.8880600000000001
582,0.92371
583,0.9549
584,0.98036
585,1.0001
586,1.0001
587,1.0001
588,1.0001
589,1.0001
590,1.0001
591,1.0001
592,1.0001
593,1.0001
594,1.0001
595,1.0001
596,1.0001
597,1.0001
598,1.0001
599,0.99115
600,0.9818100000000001
601,0.96614
602,0.94832
603,0.9305
604,0.9126700000000001
605,0.89485
606,0.87703
607,0.85921
608,0.84139
609,0.8235600000000001
610,0.80574
611,0.78792
612,0.7701
613,0.7522800000000001
614,0.73445
615,0.71663
616,0.69881
617,0.68099
618,0.66317
619,0.64535
620,0.62752
621,0.6097
622,0.5918800000000001
623,0.57406
624,0.55624
625,0.53841
626,0.52059
627,0.5027699999999999
628,0.48495
629,0.46713000000000005
630,-1.234
631,-1.234
632,-1.234
633,-1.234
634,-1.234
635,-1.234
636,-1.234
637,-1.234
638,-1.234
639,-1.234
640,-1.234
641,-1.234
642,-1.234
643,-1.234
644,-1.234
645,-1.234
646,-1.234
647,-1.234
648,-1.234
649,-1.234
650,-1.234
651,-1.234
652,-1.234
653,-1.234
654,-1.234
655,-1.234
656,-1.234
657,-1.234
658,-1.234
659,-1.234
660,-1.234
661,-1.234
662,-1.234
663,-1.234
664,-1.234
665,-1.234
666,-1.234
667,-1.234
668,-1.234
669,-1.234
670,-1.234
671,-1.234
672,-1.234
673,-1.234
674,-1.234
675,-1.234
676,-1.234
677,-1.234
678,-1.234
679,-1.234
680,-1.234
681,-1.234
682,-1.234
683,-1.234
684,-1.234
685,-1.234
686,-1.234
687,-1.234
688,-1.234
689,-1.234
690,-1.234
691,-1.234
692,-1.234
693,-1.234
694,-1.234
695,-1.234
696,-1.234
697,-1.234
698,-1.234
699,-1.234
700,-1.234
701,-1.234
702,-1.234
703,-1.2341
704,-1.2357
705,-1.2373
706,-1.2446
707,-1.2531
708,-1.2616
709,-1.2701
710,-1.2786
711,-1.2871
712,-1.2931
713,-1.2878
714,-1.2825
715,-1.2741
716,-1.2656
717,-1.2571
718,-1.2486
719,-1.2381
720,-1.226
721,-1.2122
722,-1.1952
723,-1.1781
724,-1.1611
725,-1.1441
726,-1.1275
727,-1.1109
728,-1.1
729,-1.0915
730,-1.083
731,-1.0745
732,-1.0659999999999998
733,-1.0575
734,-1.0478
735,-1.0223
736,-0.99675
737,-0.96393
738,-0.9299200000000001
739,-0.8959
740,-0.8618899999999999
741,-0.82681
742,-0.7903600000000001
743,-0.75255
744,-0.71003
745,-0.66751
746,-0.6249899999999999
747,-0.5824699999999999
748,-0.53995
749,-0.49743000000000004
750,-0.44126000000000004
751,-0.37566
752,-0.30913
753,-0.2411
754,-0.17307
755,-0.10504000000000001
756,-0.16901
757,0.10715
758,0.38049
759,0.11849000000000001
760,0.16101
761,0.20353
762,0.24605
763,0.28739000000000003
764,0.32626
765,0.36267
766,0.37968
767,0.39669
768,0.41368999999999995
769,0.4307
770,0.44771000000000005
771,0.46471999999999997
772,0.46931000000000006
773,0.46041000000000004
774,0.44933
775,0.43232
776,0.41531
777,0.39831
778,0.3813
779,0.35882
780,0.33533
781,0.30517
782,0.27115
783,0.23714000000000002
784,0.20312
785,0.16910999999999998
786,0.13509000000000002
787,0.10107999999999999
788,0.43638000000000005
789,0.35134
790,0.2663
791,0.18127000000000001
792,0.096228
793,0.097319
794,-0.27683
795,-0.31733
796,-0.30763
797,-0.15519000000000002
798,0.25929
799,0.07800499999999999
800,0.12052
801,0.16304000000000002
802,0.20556
803,0.24808000000000002
804,0.2906
805,0.33311999999999997
806,0.37564000000000003
807,0.41816000000000003
808,0.46068000000000003
809,0.097432
810,0.11887
811,0.14195
812,0.16668
813,0.19219
814,0.2177
815,0.24320999999999998
816,0.2718
817,0.30946
818,0.34769
819,0.39871
820,0.44973
821,0.50076
822,0.55178
823,0.6008
824,0.64858
825,0.68379
826,0.7008
827,0.7178100000000001
828,0.73482
829,0.7518199999999999
830,0.76883
831,0.78584
832,0.8216700000000001
833,0.8629700000000001
834,0.90975
835,0.96078
836,1.0118
837,1.0628
838,1.1119
839,1.1487
840,1.1856
841,1.196
842,1.2046
843,1.2131
844,1.2216
845,1.2301
846,1.2386
847,1.2423
848,1.2346
849,1.2268
850,1.2183
851,1.2098
852,1.2013
853,1.1928
854,1.1875
855,1.1839
856,1.1819
857,1.1819
858,1.1819
859,1.1819
860,1.1819
861,1.1835
862,1.1852
863,1.1924
864,1.2009
865,1.2094
866,1.2179
867,1.2264
868,1.2349
869,1.2434
870,1.2519
871,1.2604
872,1.2689
873,1.2774
874,1.2859
875,1.2945
876,1.3030000000000002
877,1.3115
878,1.32
879,1.3285
880,1.337
881,1.3455
882,1.354
883,1.3621
884,1.3702
885,1.3726
886,1.3726
887,1.3726
888,1.3726
889,1.3726
890,1.3726
891,1.3718
892,1.3605
893,1.3491
894,1.3329
895,1.3159
896,1.2989
897,1.2819
898,1.2649
899,1.2479
900,1.2309
901,1.2139
902,1.1969
903,1.1799
904,1.1628
905,1.1458
906,1.1288
907,1.1118
908,1.0948
909,1.0778
910,1.0608
911,1.0438
912,1.0268
913,1.0098
914,0.9885
915,0.96704
916,0.94255
917,0.91704
918,0.8915299999999999
919,0.8660200000000001
920,0.8409
921,0.8166
922,0.79313
923,0.77612
924,0.7591100000000001
925,0.7421
926,0.7251
927,0.70809
928,0.69108
929,0.67097
930,0.64748
931,0.62346
932,0.5979399999999999
933,0.57243
934,0.54692
935,0.52141
936,0.49863999999999997
937,0.47636000000000006
938,0.45743
939,0.44042
940,0.42341000000000006
941,0.40641
942,0.3894
943,0.37239
944,0.35538000000000003
