time,value
0,-0.067959
1,0.39786
2,0.33609
3,-0.047675
4,0.036304
5,-0.65155
6,0.40143
7,0.43964
8,-0.21143
9,-0.20581
10,0.53738
11,-0.07750599999999999
12,0.053425
13,0.037342
14,-0.46307
15,0.030802
16,0.28511
17,0.27919
18,-0.019237999999999998
19,-0.28826999999999997
20,0.06271499999999999
21,-0.31482
22,0.29796999999999996
23,-0.3695
24,-0.29574
25,-0.33889
26,1.5955
27,1.5955
28,1.5955
29,1.5955
30,1.5955
31,1.5955
32,1.5955
33,1.5955
34,1.5955
35,1.5955
36,1.5955
37,1.5955
38,1.5955
39,1.5955
40,-1.6215
41,-1.6215
42,-1.6215
43,-1.6215
44,-1.6215
45,-1.6215
46,-1.6215
47,-1.6215
48,-1.6215
49,-1.6215
50,-1.6215
51,-1.6215
52,-1.6215
53,0.080926
54,-0.21251
55,0.34341
56,0.05281
57,-0.065932
58,-0.14385
59,-0.02961
60,-0.68891
61,0.09793099999999999
62,0.55579
63,0.11222
64,-0.48843000000000003
65,-0.26206999999999997
66,-0.51548
67,0.45353000000000004
68,0.18887
69,-0.15084
70,0.22291
71,-0.1536
72,-0.003513
73,-0.75736
74,0.41034
75,0.44771000000000005
76,0.041199
77,-0.1053
78,0.30645
79,0.24691
80,0.1449
81,0.084868
82,0.0086979
83,-0.34633
84,-0.51931
85,-0.18436
86,1.5955
87,1.5955
88,1.5955
89,1.5955
90,1.5955
91,1.5955
92,1.5955
93,1.5955
94,1.5955
95,1.5955
96,-1.6215
97,-1.6215
98,-1.6215
99,-1.6215
100,-1.6215
101,-1.6215
102,-1.6215
103,-1.6215
104,-1.6215
105,0.086953
106,-0.33604
107,0.38827
108,0.12868
109,-0.36036999999999997
110,-0.14149
111,-0.64313
112,0.2454
113,-0.48044
114,0.23169
115,0.122
116,0.033652
117,0.054683
118,-0.079302
119,-0.028162
120,-0.13788
121,-0.79666
122,-0.046714
123,-0.32109
124,0.16391
125,0.16418
126,-0.17785
127,0.29368
