time,value
0,1.0029
1,1.0029
2,1.0029
3,1.0029
4,1.0029
5,1.0029
6,1.0029
7,1.0029
8,1.0175
9,1.0971
10,1.227
11,1.227
12,1.227
13,1.3108
14,1.4018
15,1.4509999999999998
16,1.4535
17,1.4992
18,1.6331
19,1.7579
20,1.8645
21,1.9709999999999999
22,2.0776
23,2.1491
24,2.207
25,2.2496
26,2.2726
27,2.2726
28,2.2726
29,2.2726
30,2.2726
31,2.2880000000000003
32,2.3261
33,2.3033
34,2.2267
35,2.128
36,2.028
37,1.9444
38,1.8911
39,1.8378
40,1.7845
41,1.4922
42,1.0387
43,0.73078
44,0.57855
45,0.44558000000000003
46,0.29739
47,0.14052
48,-0.0042215
49,-0.11079000000000001
50,-0.2673
51,-0.45962
52,-0.6503800000000001
53,-0.8293799999999999
54,-1.0190000000000001
55,-1.1864
56,-1.3049
57,-1.4069999999999998
58,-1.4899
59,-1.5366
60,-1.5366
61,-1.5366
62,-1.5366
63,-1.5366
64,-1.5415
65,-1.5644
66,-1.6174
67,-1.6707
68,-1.724
69,-1.7606
70,-1.7606
71,-1.7606
72,-1.7279
73,-1.661
74,-1.5865
75,-1.5366
76,-1.5366
77,-1.5366
78,-1.5366
79,-1.5099
80,-1.4566
81,-1.4033
82,-1.3501
83,-1.2718
84,-1.1745
85,-1.0735
86,-0.98756
87,-0.9342799999999999
88,-0.8809899999999999
89,-0.8277100000000001
90,-0.7744300000000001
91,-0.72115
92,-0.6681
93,-0.64527
94,-0.62243
95,-0.59115
96,-0.56558
97,-0.56558
98,-0.56558
99,-0.56558
100,-0.56558
101,-0.54953
102,-0.5085
103,-0.45521000000000006
104,-0.37981
105,-0.30369
106,-0.26683
107,-0.26683
108,-0.27016
109,-0.32344
110,-0.33854
111,-0.34152
112,-0.32986
113,-0.29941
114,-0.26897
115,-0.25267
116,-0.21604
117,-0.19214
118,-0.17881
119,-0.12553
120,-0.072251
121,-0.079625
122,-0.10246
123,-0.1096
124,-0.084977
125,-0.046918
126,-0.035976999999999995
127,0.001963
128,0.031934
129,0.031934
130,0.031934
131,0.069398
132,0.09592
133,0.10662
134,0.10662
135,0.10662
136,0.10662
137,0.10662
138,0.10662
139,0.10662
140,0.10662
141,0.10662
142,0.10662
143,0.090211
144,0.05239
145,-0.00089143
146,-0.054173
147,-0.10745999999999999
148,-0.16074000000000002
149,-0.21402
150,-0.2673
151,-0.31654
152,-0.33937
153,-0.34152
154,-0.34152
155,-0.34152
156,-0.34152
157,-0.34152
158,-0.3948
159,-0.44808000000000003
160,-0.48055
161,-0.49088999999999994
162,-0.49088999999999994
163,-0.49088999999999994
164,-0.47768999999999995
165,-0.44783999999999996
166,-0.4476
167,-0.50088
168,-0.5541699999999999
169,-0.60745
170,-0.66073
171,-0.72947
172,-0.8132
173,-0.8961
174,-0.9646
175,-1.0646
176,-1.1712
177,-1.2578
178,-1.3111
179,-1.3643
180,-1.3124
181,-1.2409
182,-1.1862
183,-1.1631
184,-1.1631
185,-1.1631
186,-1.1631
187,-1.1931
188,-1.2309999999999999
189,-1.2336
190,-1.1956
191,-1.1441
192,-1.1058
193,-1.0819
194,-1.0574
195,-0.9964799999999999
196,-0.8909799999999999
197,-0.86434
198,-0.86434
199,-0.85305
200,-0.81392
201,-0.76063
202,-0.68809
203,-0.6025699999999999
204,-0.52313
205,-0.45474
206,-0.34818000000000005
207,-0.24161
208,-0.16752
209,-0.091875
210,0.0033902
211,0.11067
212,0.24006999999999998
213,0.38172
214,0.50874
215,0.6389699999999999
216,0.87208
217,1.618
218,1.7895
219,1.8245
220,1.8245
221,1.8245
222,1.8245
223,1.8094
224,1.765
225,1.7117
226,1.6918
227,1.7333
228,1.6495
229,1.5462
230,1.4204
231,1.2741
232,1.117
233,0.97234
234,0.8639899999999999
235,0.75742
236,0.65086
237,0.5443
238,0.43951999999999997
239,0.37101
240,0.33997
241,0.33069
242,0.33069
243,0.32961999999999997
244,0.32201
245,0.27265
246,0.256
247,0.256
248,0.26492
249,0.3031
250,0.35638000000000003
251,0.4275
252,0.51207
253,0.5884199999999999
254,0.62945
255,0.62945
256,0.5828300000000001
257,0.58878
258,0.60115
259,0.5723600000000001
260,0.51908
261,0.4658
262,0.41252
263,0.35924
264,0.30596
265,0.25267
266,0.19939
267,0.18429
268,0.18131
269,0.18131
270,0.17775
271,0.15491
272,0.10377
273,0.050488
274,-0.0027944000000000003
275,-0.056076
276,-0.10935999999999998
277,-0.16264
278,-0.18559
279,-0.19214
280,-0.19214
281,-0.19214
282,-0.19214
283,-0.19214
284,-0.19214
285,-0.19214
286,-0.20177
287,-0.24744000000000002
288,-0.26314
289,-0.2899
290,-0.33248
291,-0.38111999999999996
292,-0.4162
293,-0.4162
294,-0.4162
295,-0.4162
296,-0.39801
297,-0.35757
298,-0.34235
299,-0.34152
300,-0.3251
301,-0.29477
302,-0.2648
303,-0.25540999999999997
304,-0.20213
305,-0.14884
306,-0.068802
307,0.019208000000000003
308,0.081648
309,0.10447999999999999
310,0.08592999999999999
311,0.052747
312,0.028485000000000003
313,0.010526
314,-0.042756
