time,value
0,-0.18635
1,-0.40478000000000003
2,-0.6104
3,-0.77683
4,-0.88029
5,-0.90465
6,-0.85364
7,-0.7339399999999999
8,-0.55675
9,-0.34402
10,-0.12261
11,0.090903
12,0.28197
13,0.43982
14,0.5582600000000001
15,0.63225
16,0.66398
17,0.6542
18,0.6130800000000001
19,0.54487
20,0.4488
21,0.32213
22,0.16466
23,-0.014156
24,-0.20081
25,-0.37538
26,-0.5140399999999999
27,-0.59003
28,-0.59129
29,-0.5209699999999999
30,-0.38927
31,-0.22209
32,-0.044610000000000004
33,0.1178
34,0.24927
35,0.34597
36,0.40589000000000003
37,0.43423999999999996
38,0.42773999999999995
39,0.38
40,0.28271999999999997
41,0.13373
42,-0.061082000000000004
43,-0.2838
44,-0.50558
45,-0.68906
46,-0.78871
47,-0.78617
48,-0.67574
49,-0.46876
50,-0.1959
51,0.10059
52,0.37917
53,0.60753
54,0.7703399999999999
55,0.85244
56,0.8499399999999999
57,0.76457
58,0.6012
59,0.37235
60,0.10057
61,-0.18527000000000002
62,-0.45193
63,-0.65504
64,-0.7603800000000001
65,-0.757
66,-0.6531600000000001
67,-0.47061000000000003
68,-0.24689
69,-0.025894
70,0.1587
71,0.28129
72,0.33976
73,0.33992
74,0.29771
75,0.22783
76,0.14539000000000002
77,0.058041999999999996
78,-0.020587
79,-0.085754
80,-0.13326
81,-0.15947
82,-0.16249
83,-0.15086
84,-0.12925
85,-0.11747
86,-0.11778
87,-0.13189
88,-0.15274000000000001
89,-0.1625
90,-0.13949
91,-0.070199
92,0.040836000000000004
93,0.18472
94,0.32905
95,0.44247
96,0.5006
97,0.4901
98,0.41228000000000004
99,0.28029
100,0.11993
101,-0.050887
102,-0.21725999999999998
103,-0.36701
104,-0.49068
105,-0.58057
106,-0.6274
107,-0.61736
108,-0.54233
109,-0.40913
110,-0.22835999999999998
111,-0.01865
112,0.18205
113,0.34267
114,0.44545
115,0.48098
116,0.45552
117,0.38706
118,0.29825999999999997
119,0.20390999999999998
120,0.11227999999999999
121,0.016641
122,-0.08467000000000001
123,-0.19074000000000002
124,-0.29845
125,-0.39574000000000004
126,-0.46257
127,-0.47306000000000004
128,-0.41298999999999997
129,-0.27868000000000004
130,-0.076922
131,0.16172999999999998
132,0.40425
133,0.6136199999999999
134,0.7550100000000001
135,0.80935
136,0.7628699999999999
137,0.61992
138,0.39546
139,0.11699000000000001
140,-0.18950999999999998
141,-0.49103
142,-0.7550399999999999
143,-0.95605
144,-1.0733
145,-1.0951
146,-1.0176
147,-0.84834
148,-0.59973
149,-0.29425999999999997
150,0.043565
151,0.38035
152,0.68903
153,0.9394899999999999
154,1.1084
155,1.173
156,1.1266
157,0.9708600000000001
158,0.71901
159,0.40126999999999996
160,0.049566000000000006
161,-0.29948
162,-0.60728
163,-0.8398100000000001
164,-0.9734200000000001
165,-0.99577
166,-0.902
167,-0.7013
168,-0.43516000000000005
169,-0.13518
170,0.15828
171,0.39574000000000004
172,0.55311
173,0.6178100000000001
174,0.5898100000000001
175,0.47684
176,0.31169
177,0.12237
178,-0.060783000000000004
179,-0.22625
180,-0.35775
181,-0.44528
182,-0.48516000000000004
183,-0.4791
184,-0.42453
185,-0.33266
186,-0.20099
187,-0.04915
188,0.10753
189,0.24952
190,0.35702
191,0.41023000000000004
192,0.4047
193,0.34957
194,0.25236
195,0.13919
196,0.031058
197,-0.052141
198,-0.09497699999999999
199,-0.091414
200,-0.048652
201,0.019948
202,0.09535
203,0.15688
204,0.18258
205,0.15853
206,0.075678
207,-0.057516
208,-0.22341999999999998
209,-0.39419
210,-0.54438
211,-0.6494300000000001
212,-0.69604
213,-0.67145
214,-0.58165
215,-0.43408
216,-0.24486
217,-0.035656
218,0.17451
219,0.36822
220,0.52581
221,0.63769
222,0.7015899999999999
223,0.7158899999999999
224,0.68429
225,0.61961
226,0.52678
227,0.41917
228,0.2988
229,0.17422
230,0.039945999999999995
231,-0.107
232,-0.26518
233,-0.43788999999999995
234,-0.6141300000000001
235,-0.7782399999999999
236,-0.91194
237,-0.99234
238,-1.0018
239,-0.93747
240,-0.8026
241,-0.60922
242,-0.37590999999999997
243,-0.11629
244,0.15482
245,0.42422
246,0.68004
247,0.9114200000000001
248,1.0978
249,1.2213
250,1.2582
251,1.1928
252,1.026
253,0.7697
254,0.45453000000000005
255,0.11909000000000002
256,-0.20304
257,-0.48299
258,-0.7048800000000001
259,-0.8679399999999999
260,-0.9793799999999999
261,-1.0484
262,-1.0773
263,-1.0618
264,-0.9959899999999999
265,-0.86918
266,-0.6685800000000001
267,-0.40594
268,-0.10711
269,0.20785
270,0.49778999999999995
271,0.72659
272,0.87933
273,0.9470799999999999
274,0.92674
275,0.83693
276,0.69976
277,0.52879
278,0.33655
279,0.1383
280,-0.048449
281,-0.20656999999999998
282,-0.32732
283,-0.39658000000000004
284,-0.41333000000000003
285,-0.38449
286,-0.32184
287,-0.24931
288,-0.19044
289,-0.15709
290,-0.15886
291,-0.19685
292,-0.25555
293,-0.32544
294,-0.39435
295,-0.44703999999999994
296,-0.47203
297,-0.45718000000000003
298,-0.38856
299,-0.25808000000000003
300,-0.063465
301,0.18656
302,0.46865
303,0.7510399999999999
304,0.9922799999999999
305,1.1504
306,1.1962
307,1.1189
308,0.91909
309,0.62311
310,0.26761999999999997
311,-0.10405
312,-0.45026000000000005
313,-0.73098
314,-0.9283399999999999
315,-1.0306
316,-1.0453
317,-0.98456
318,-0.86784
319,-0.71965
320,-0.5627300000000001
321,-0.41198
322,-0.28029
323,-0.16764
324,-0.06536900000000001
325,0.035594
326,0.14492
327,0.27189
328,0.41063999999999995
329,0.55085
330,0.67266
331,0.75472
332,0.77876
333,0.7340300000000001
334,0.62949
335,0.47193
336,0.28317
337,0.08307200000000001
338,-0.10567
339,-0.26411
340,-0.38606
341,-0.47223999999999994
342,-0.52431
343,-0.54945
344,-0.55781
345,-0.55395
346,-0.53864
347,-0.50071
348,-0.43827
349,-0.34624
350,-0.22857
351,-0.097094
352,0.030489
353,0.13613
354,0.20939000000000002
355,0.24931999999999999
356,0.25965
357,0.26225
358,0.27129000000000003
359,0.29533000000000004
360,0.33816
361,0.3837
362,0.41391999999999995
363,0.41136999999999996
364,0.36395
365,0.27660999999999997
366,0.1703
367,0.058316
368,-0.042811
369,-0.12465999999999999
370,-0.19429000000000002
371,-0.267
372,-0.35667
373,-0.47116
374,-0.601
375,-0.72693
376,-0.82547
377,-0.8618899999999999
378,-0.81601
379,-0.68389
380,-0.47688
381,-0.21724000000000002
382,0.062242
383,0.34075
384,0.59945
385,0.83454
386,1.0382
387,1.2026
388,1.3098
389,1.3351
390,1.2495
391,1.0372
392,0.69758
393,0.2501
394,-0.26064
395,-0.7847
396,-1.2599
397,-1.635
398,-1.8791
399,-1.9819
400,-1.9433
401,-1.7768
402,-1.5043
403,-1.1367
404,-0.68999
405,-0.17545
406,0.39305
407,0.9849399999999999
408,1.5665
409,2.0956
410,2.5186
411,2.7858
412,2.8539
413,2.6967
414,2.3025
415,1.6933
416,0.91289
417,0.02647
418,-0.88549
419,-1.7345
420,-2.4382
421,-2.9376
422,-3.2016
423,-3.228
424,-3.0437
425,-2.6830000000000003
426,-2.1934
427,-1.6252
428,-1.0102
429,-0.37198000000000003
430,0.27194
431,0.89607
432,1.4771
433,1.9866
434,2.3848
435,2.6425
436,2.7485
437,2.6988
438,2.5123
439,2.2086
440,1.8111
441,1.3416
442,0.8143600000000001
443,0.23646
444,-0.38706999999999997
445,-1.0367
446,-1.6744
447,-2.2398
448,-2.67
449,-2.9073
450,-2.9156
451,-2.696
452,-2.2784
453,-1.7218
454,-1.1065
455,-0.50572
456,0.02366
457,0.45503999999999994
458,0.78315
459,1.0246
460,1.2035
461,1.338
462,1.4409999999999998
463,1.518
464,1.5675
465,1.5919
466,1.5932
467,1.5631
468,1.493
469,1.3626
470,1.1521
471,0.8376899999999999
472,0.40825
473,-0.12788
474,-0.74115
475,-1.3844
476,-1.9941
477,-2.4979
478,-2.8422
479,-2.9897
480,-2.9233
481,-2.6512
482,-2.1921
483,-1.5769
484,-0.84885
485,-0.056478999999999994
486,0.74392
487,1.4975
488,2.1453
489,2.6433
490,2.9631
491,3.0954
492,3.0446
493,2.8274
494,2.4664
495,1.9735
496,1.368
497,0.65677
498,-0.14772000000000002
499,-1.0146
