time,value
0,-0.036430000000000004
1,-0.012874000000000002
2,-0.18978
3,1.5694
4,1.5694
5,1.5694
6,1.5694
7,1.5694
8,1.5694
9,1.5694
10,1.5694
11,1.5694
12,1.5694
13,-1.5298
14,-1.5298
15,-1.5298
16,-1.5298
17,-1.5298
18,-1.5298
19,-1.5298
20,-1.5298
21,-1.5298
22,-1.5298
23,0.041976
24,-0.0072132
25,0.018591999999999997
26,0.24364
27,0.31059000000000003
28,-0.66484
29,-0.28010999999999997
30,-0.67888
31,-0.41200000000000003
32,0.42141999999999996
33,0.30901
34,-0.12667
35,-0.26674000000000003
36,0.020097
37,-0.37079
38,0.15256
39,0.0582
40,-0.31679
41,-0.1814
42,-0.18515
43,0.13712
44,0.19067
45,-0.46881000000000006
46,0.2192
47,-0.16108
48,0.07313
49,-0.18031
50,0.022443
51,-0.033663
52,-0.10126
53,-0.30429
54,-0.11155
55,-0.058168
56,-0.16457
57,0.072094
58,0.043220999999999996
59,-0.12979000000000002
60,0.42153999999999997
61,0.43928999999999996
62,0.32216999999999996
63,-0.057998
64,0.13166
65,1.5694
66,1.5694
67,1.5694
68,1.5694
69,1.5694
70,1.5694
71,1.5694
72,1.5694
73,1.5694
74,1.5694
75,1.5694
76,1.5694
77,1.5694
78,1.5694
79,1.5694
80,-1.5298
81,-1.5298
82,-1.5298
83,-1.5298
84,-1.5298
85,-1.5298
86,-1.5298
87,-1.5298
88,-1.5298
89,-1.5298
90,-1.5298
91,-1.5298
92,-1.5298
93,-1.5298
94,-1.5298
95,0.40305
96,0.1235
97,0.18016
98,-0.08894500000000001
99,0.40391
100,0.12542
101,0.1617
102,-0.00040631
103,0.3414
104,-0.093587
105,-0.051734
106,-0.47696000000000005
107,0.37973
108,-0.28818
109,-0.57085
110,-0.065187
111,-0.39805
112,0.18267
113,0.51078
114,0.040126999999999996
115,-0.13694
116,-0.16215
117,-0.093988
118,0.30002
119,-0.23663
120,0.68501
121,0.11622
122,0.067224
123,-0.49413
124,-0.1297
125,-0.7187600000000001
126,0.74787
127,0.099142
