time,value
0,0.46688999999999997
1,-0.28019
2,-1.0109
3,-1.5869
4,-1.8635
5,-1.7806
6,-1.3943
7,-0.8810399999999999
8,-0.37861
9,-0.089975
10,-0.087185
11,-0.38684
12,-0.8367600000000001
13,-1.206
14,-1.359
15,-1.2488
16,-0.8207899999999999
17,-0.12903
18,0.65365
19,1.3553
20,1.8528
21,2.0709
22,1.9701
23,1.5975
24,1.0696
25,0.52546
26,0.049526
27,-0.24869000000000002
28,-0.33966
29,-0.28125
30,-0.161
31,-0.094588
32,-0.1679
33,-0.44263
34,-0.8093600000000001
35,-1.1707
36,-1.3535
37,-1.2386
38,-0.81296
39,-0.1051
40,0.6983199999999999
41,1.3784
42,1.6637
43,1.4841
44,0.8618
45,-0.0010604000000000002
46,-0.84095
47,-1.4073
48,-1.5307
49,-1.2171
50,-0.5685100000000001
51,0.15295999999999998
52,0.6865100000000001
53,0.90689
54,0.78168
55,0.38632
56,-0.10561
57,-0.4556
58,-0.5766100000000001
59,-0.41566000000000003
60,-0.06829600000000001
61,0.33846
62,0.72345
63,0.97614
64,1.0576
65,0.95824
66,0.78684
67,0.57375
68,0.37321
69,0.18750999999999998
70,-0.004403100000000001
71,-0.18350999999999998
72,-0.35859
73,-0.50157
74,-0.5952
75,-0.6268600000000001
76,-0.6390600000000001
77,-0.64575
78,-0.65871
79,-0.75566
80,-0.92024
81,-1.1009
82,-1.2461
83,-1.227
84,-1.0449
85,-0.6876899999999999
86,-0.17115
87,0.43033999999999994
88,1.0054
89,1.445
90,1.6526
91,1.6171
92,1.3545
93,0.9305399999999999
94,0.39766
95,-0.09168899999999999
96,-0.46626999999999996
97,-0.6371399999999999
98,-0.6691699999999999
99,-0.49211000000000005
100,-0.19658
101,0.13035
102,0.44787
103,0.66273
104,0.73364
105,0.68189
106,0.55774
107,0.37684
108,0.20884
109,-0.012667
110,-0.23390999999999998
111,-0.3953
112,-0.47862
113,-0.45463000000000003
114,-0.39655
115,-0.29194000000000003
116,-0.16953
117,-0.082097
118,-0.089767
119,-0.22416999999999998
120,-0.43918999999999997
121,-0.79078
122,-1.1508
123,-1.403
124,-1.4388
125,-1.2112
126,-0.74831
127,-0.12736
128,0.52091
129,1.0356
130,1.2842
131,1.2371
132,0.92891
133,0.47128000000000003
134,0.027625
135,-0.24841999999999997
136,-0.33935
137,-0.20339000000000002
138,0.093568
139,0.4838
140,0.7919
141,0.92281
142,0.8595
143,0.6723600000000001
144,0.44738
145,0.30585
146,0.24685
147,0.29846
148,0.38111
149,0.37872
150,0.20661
151,-0.14348
152,-0.5877399999999999
153,-0.9960700000000001
154,-1.2572
155,-1.2664
156,-1.002
157,-0.5553600000000001
158,-0.17607
159,0.035192
160,-0.007411
161,-0.2722
162,-0.65105
163,-0.96619
164,-0.9775
165,-0.62726
166,0.021676
167,0.73318
168,1.2871
169,1.4318
170,1.1053
171,0.47467
172,-0.20724
173,-0.65051
174,-0.6741
175,-0.24744000000000002
176,0.47405
177,1.2464
178,1.7755
179,1.8311
180,1.4109
181,0.66659
182,-0.14498
183,-0.79103
184,-1.1376
185,-1.1435
186,-0.88392
187,-0.53341
188,-0.27874
189,-0.25892
190,-0.43996
191,-0.72418
192,-0.99997
193,-1.1954
194,-1.2161
195,-1.0115
196,-0.67743
197,-0.18437
198,0.40192
199,1.0715
200,1.6544
201,2.0986
202,2.2619
203,2.0541
204,1.4921
205,0.68652
206,-0.2199
207,-1.0469
208,-1.5563
209,-1.6862
210,-1.4214
211,-0.91153
212,-0.35285
213,0.060679
214,0.23004000000000002
215,0.17518
216,-0.042294
217,-0.25238
218,-0.35663
219,-0.33476999999999996
220,-0.22689
221,-0.10708
222,-0.0065466000000000005
223,-0.045679000000000004
224,-0.21063
225,-0.40045
226,-0.56594
227,-0.6017600000000001
228,-0.53794
229,-0.31794
230,0.0073187
231,0.37638
232,0.68491
233,0.91359
234,1.0305
235,1.0104
236,0.87382
237,0.7015399999999999
238,0.44508000000000003
239,0.10989000000000002
240,-0.2723
241,-0.62835
242,-0.9212899999999999
243,-1.1268
244,-1.1577
245,-1.0362
246,-0.71907
247,-0.22956999999999997
248,0.32998
249,0.8688
250,1.2924
251,1.5119999999999998
252,1.5019999999999998
253,1.2398
254,0.78195
255,0.22509
256,-0.37164
257,-0.9296200000000001
258,-1.3921
259,-1.6171
260,-1.5789
261,-1.3675
262,-0.9228700000000001
263,-0.27193
264,0.47723000000000004
265,1.1402
266,1.6161
267,1.7758
268,1.5555
269,1.0104
270,0.2779
271,-0.52012
272,-1.1861
273,-1.5805
274,-1.6358
275,-1.3727
276,-0.8733299999999999
277,-0.24325
278,0.32682
279,0.7296600000000001
280,0.93678
281,0.9501799999999999
282,0.8114600000000001
283,0.57696
284,0.30271
285,0.032325
286,-0.22078000000000003
287,-0.43268999999999996
288,-0.57412
289,-0.5787399999999999
290,-0.39829000000000003
291,-0.077053
292,0.32216999999999996
293,0.67975
294,0.86923
295,0.80479
296,0.48673
297,0.028377999999999997
298,-0.48436999999999997
299,-0.8982399999999999
300,-1.0678
301,-0.93616
302,-0.6532600000000001
303,-0.27960999999999997
304,0.042474
305,0.2151
306,0.25536
307,0.26025
308,0.34549
309,0.49537
310,0.6755800000000001
311,0.8316899999999999
312,0.82649
313,0.6259899999999999
314,0.23540999999999998
315,-0.27365
316,-0.7516
317,-1.0157
318,-1.0248
319,-0.8461
320,-0.59446
321,-0.3809
322,-0.36735999999999996
323,-0.5220100000000001
324,-0.76325
325,-0.9339
326,-0.9168
327,-0.66614
328,-0.19205
329,0.49135
330,1.1504
331,1.6509
332,1.9378
333,1.9559
334,1.757
335,1.4032
336,0.9618200000000001
337,0.46134
338,-0.083673
339,-0.58104
340,-0.95515
341,-1.1918
342,-1.226
343,-1.04
344,-0.67366
345,-0.21291
346,0.24924000000000002
347,0.5756100000000001
348,0.72019
349,0.66363
350,0.48581
351,0.1951
352,-0.12575
353,-0.44431000000000004
354,-0.71359
355,-0.8553
356,-0.8542799999999999
357,-0.64546
358,-0.20894000000000001
359,0.37929
360,0.97749
361,1.4126
362,1.6088
363,1.406
364,0.83301
365,0.016207
366,-0.8393700000000001
367,-1.4776
368,-1.714
369,-1.5158
370,-0.8995299999999999
371,-0.10822999999999999
372,0.66175
373,1.2231
374,1.4315
375,1.296
376,0.9047299999999999
377,0.44315
378,-0.020412
379,-0.3684
380,-0.55005
381,-0.58919
382,-0.53522
383,-0.47216
384,-0.36419
385,-0.12342
386,0.19959000000000002
387,0.57575
388,0.9462299999999999
389,1.1561
390,1.1168
391,0.82934
392,0.30808
393,-0.31937
394,-0.88949
395,-1.2358
396,-1.3246
397,-1.1999
398,-0.9126299999999999
399,-0.60292
400,-0.31269
401,-0.094967
402,0.070367
403,0.32641
404,0.60129
405,0.86826
406,1.0652
407,1.0235
408,0.65637
409,-0.026608
410,-0.79647
411,-1.3841
412,-1.597
413,-1.1322
414,-0.15968
415,1.0889
416,2.2517
417,2.9687
418,2.9545
419,2.1951
420,0.93926
421,-0.42483000000000004
422,-1.4826
423,-1.8871
424,-1.6288
425,-0.91466
426,-0.094912
427,0.43683999999999995
428,0.51903
429,0.046909
430,-0.79038
431,-1.6293
432,-2.1731
433,-2.1714
434,-1.6478
435,-0.83424
436,0.012121999999999999
437,0.58163
438,0.736
439,0.52365
440,0.1425
441,-0.15378
442,-0.13518
443,0.28979
444,1.0068
445,1.8325
446,2.484
447,2.7303
448,2.4597
449,1.7180000000000002
450,0.7041
451,-0.37853000000000003
452,-1.3258
453,-1.9741
454,-2.2894
455,-2.2946
456,-1.9965
457,-1.4572
458,-0.77025
459,-0.015665000000000002
460,0.8114600000000001
461,1.6162
462,2.2146
463,2.5252
464,2.4301
465,1.8684
466,0.97244
467,-0.10747000000000001
468,-1.1535
469,-1.9702
470,-2.3080000000000003
471,-2.222
472,-1.7223
473,-0.9267299999999999
474,-0.088064
475,0.62353
476,1.0839
477,1.2276
478,1.0099
479,0.58092
480,0.054161
481,-0.47313999999999995
482,-0.9396899999999999
483,-1.2203
484,-1.2319
485,-1.0582
486,-0.79567
487,-0.46316999999999997
488,-0.087269
489,0.26303000000000004
490,0.60925
491,0.91966
492,1.153
493,1.3477
494,1.4585
495,1.4418
496,1.2677
497,1.0153
498,0.7124699999999999
499,0.36587
