time,value
0,1.7595
1,1.5664
2,1.42
3,1.6501
4,1.2595
5,0.8997799999999999
6,0.67986
7,0.74965
8,0.4828
9,0.12437000000000001
10,-0.27216
11,-0.65649
12,-1.0255
13,-0.88684
14,-0.5301600000000001
15,-0.16218
16,0.21416
17,0.59683
18,0.40592
19,0.6027899999999999
20,0.69887
21,0.68599
22,0.40241
23,0.11482
24,-0.28461
25,-0.32649
26,-0.013968000000000001
27,0.32621
28,0.49587
29,0.78137
30,0.36745
31,-0.014048
32,-0.39423
33,-0.3032
34,0.15673
35,0.47811000000000003
36,0.75046
37,1.2278
38,1.3159999999999998
39,0.9357700000000001
40,0.61897
41,0.41571
42,0.25190999999999997
43,-0.040626999999999996
44,-0.11320999999999999
45,0.10974
46,-0.38201999999999997
47,-0.75572
48,-1.1001
49,-1.03
50,-0.7035899999999999
51,-0.29477
52,-0.5430699999999999
53,-1.0028
54,-1.3736
55,-1.608
56,-2.0
57,-2.386
58,-2.7680000000000002
59,-3.0338
60,-2.6322
61,-2.2243
62,-1.8215
63,-1.4231
64,-1.0461
65,-0.6468
66,-0.24725999999999998
67,0.15661
68,0.5604899999999999
69,0.9643700000000001
70,1.3683
71,1.6829
72,1.5802
73,1.2258
74,0.81287
75,0.40462
76,0.0010276
77,-0.40249
78,-0.80099
79,-1.1937
80,-1.5906
81,-1.8873
82,-1.4437
83,-1.2216
84,-0.8064100000000001
85,-0.5292899999999999
86,-0.8811700000000001
87,-1.0751
88,-0.87949
89,-0.52636
90,-0.18148
91,0.12935
92,-0.12568
93,0.14094
94,0.30039
95,0.6080899999999999
96,0.97541
97,1.0032
98,0.59323
99,0.26131
100,-0.1498
101,-0.44396
102,-0.084469
103,0.29056
104,0.14398
105,0.43059
106,0.7028300000000001
107,0.69119
108,0.907
109,0.68766
110,0.35176999999999997
111,0.38111
112,0.2539
113,-0.095343
114,-0.50171
115,-0.8488100000000001
116,-0.5708
117,-0.19418
118,0.17862999999999998
119,0.54793
120,0.9357700000000001
121,1.1304
122,0.9018
123,0.8866799999999999
124,1.1553
125,1.3203
126,1.5266
127,1.7421
