time,value
0,0.41608
1,0.26006999999999997
2,0.12697
3,0.015567
4,0.063113
5,-0.26283
6,-0.029602
7,0.24616999999999997
8,-0.2011
9,-0.21198000000000003
10,0.30607
11,-0.23822
12,-1.5224
13,-1.5224
14,-1.5224
15,-1.5224
16,-1.5224
17,-1.5224
18,-1.5224
19,-1.5224
20,-1.5224
21,-1.5224
22,-1.5224
23,-1.5224
24,-1.5224
25,1.5637
26,1.5637
27,1.5637
28,1.5637
29,1.5637
30,1.5637
31,1.5637
32,1.5637
33,1.5637
34,1.5637
35,1.5637
36,1.5637
37,1.5637
38,-0.12711
39,0.21996
40,0.31035999999999997
41,0.21191
42,-0.5019100000000001
43,0.20920999999999998
44,0.1984
45,0.35944
46,-0.11432
47,-0.20164
48,0.14607
49,-0.27785
50,0.17369
51,-0.16784000000000002
52,-0.12959
53,-0.23535
54,-0.62683
55,0.38368
56,0.60026
57,-0.38345
58,0.16567
59,-0.12285
60,-0.019638
61,0.6078600000000001
62,-0.025480000000000003
63,0.042037
64,0.27597
65,0.031314999999999996
66,0.26544
67,0.13756
68,-0.2589
69,-0.04155
70,0.029702999999999997
71,-0.16405
72,-0.010254000000000001
73,-1.5224
74,-1.5224
75,-1.5224
76,-1.5224
77,-1.5224
78,-1.5224
79,-1.5224
80,-1.5224
81,-1.5224
82,-1.5224
83,-1.5224
84,-1.5224
85,-1.5224
86,1.5637
87,1.5637
88,1.5637
89,1.5637
90,1.5637
91,1.5637
92,1.5637
93,1.5637
94,1.5637
95,1.5637
96,1.5637
97,1.5637
98,-0.24905
99,0.14675
100,0.22732
101,-0.12572
102,-0.19757
103,-0.043361000000000004
104,0.19347
105,0.18816
106,-0.10450999999999999
107,-0.16017
108,-0.19615
109,0.031401
110,-0.54643
111,-0.13047
112,-0.087802
113,-0.073892
114,-0.25556
115,0.33
116,0.06756799999999999
117,0.1759
118,0.47658
119,-0.47308999999999996
120,0.10905
121,0.42468
122,0.0012333
123,0.33232
124,-0.29391999999999996
125,-0.24939
126,-0.6918
127,0.21236999999999998
