time,value
0,0.63889
1,0.77158
2,0.8450200000000001
3,0.8600399999999999
4,0.8152699999999999
5,0.71921
6,0.57005
7,0.37945999999999996
8,0.15949000000000002
9,-0.07785
10,-0.31263
11,-0.5243399999999999
12,-0.69812
13,-0.8208799999999999
14,-0.88028
15,-0.8741899999999999
16,-0.80678
17,-0.6815100000000001
18,-0.5143
19,-0.31493000000000004
20,-0.094575
21,0.12473
22,0.33393
23,0.51351
24,0.64566
25,0.72531
26,0.73732
27,0.68847
28,0.58405
29,0.44083999999999995
30,0.27355999999999997
31,0.10479000000000001
32,-0.051124
33,-0.18145
34,-0.28169
35,-0.35494000000000003
36,-0.39694
37,-0.42171000000000003
38,-0.42186999999999997
39,-0.40452
40,-0.37041
41,-0.32111999999999996
42,-0.25661999999999996
43,-0.17937
44,-0.10105
45,-0.012957
46,0.082914
47,0.18458
48,0.28665
49,0.38866
50,0.47702
51,0.5345
52,0.5504
53,0.51235
54,0.42336999999999997
55,0.28331
56,0.11490999999999998
57,-0.063875
58,-0.2287
59,-0.36767
60,-0.47502
61,-0.54556
62,-0.58516
63,-0.59901
64,-0.58595
65,-0.5353399999999999
66,-0.445
67,-0.3086
68,-0.1306
69,0.07521900000000001
70,0.27928000000000003
71,0.45718000000000003
72,0.58711
73,0.65462
74,0.6582100000000001
75,0.6107100000000001
76,0.5259
77,0.42102
78,0.30393000000000003
79,0.17749
80,0.034797
81,-0.12129000000000001
82,-0.29051
83,-0.4555
84,-0.59518
85,-0.6823899999999999
86,-0.70744
87,-0.65476
88,-0.53678
89,-0.37624
90,-0.19164
91,-0.0078374
92,0.16211
93,0.31148000000000003
94,0.4409
95,0.55098
96,0.63763
97,0.6825399999999999
98,0.66691
99,0.5858899999999999
100,0.43116000000000004
101,0.22196
102,-0.021634
103,-0.25731
104,-0.4625
105,-0.6057899999999999
106,-0.67618
107,-0.6782600000000001
108,-0.62569
109,-0.53737
110,-0.42544
111,-0.3037
112,-0.17770999999999998
113,-0.043285000000000004
114,0.095687
115,0.24022
116,0.38137
117,0.5131
118,0.6150399999999999
119,0.67814
120,0.69297
121,0.6438699999999999
122,0.53163
123,0.35541
124,0.12402
125,-0.13868
126,-0.41973999999999995
127,-0.67483
128,-0.87335
129,-0.9850700000000001
130,-0.99479
131,-0.8952
132,-0.6947399999999999
133,-0.41918999999999995
134,-0.10062
135,0.23054000000000002
136,0.54035
137,0.80156
138,0.99266
139,1.0943
140,1.1018
141,1.0044
142,0.8112199999999999
143,0.53192
144,0.19947
145,-0.15045999999999998
146,-0.48428000000000004
147,-0.76918
148,-0.97469
149,-1.0897
150,-1.1164
151,-1.0584
152,-0.93006
153,-0.7433
154,-0.50905
155,-0.23989000000000002
156,0.045557
157,0.335
158,0.6041
159,0.83135
160,0.9993700000000001
161,1.0922
162,1.1042
163,1.0331
164,0.89507
165,0.70128
166,0.45974
167,0.18663
168,-0.11441
169,-0.42549
170,-0.73402
171,-1.0111
172,-1.2305
173,-1.3619999999999999
174,-1.3848
175,-1.2819
176,-1.0598
177,-0.73054
178,-0.32716999999999996
179,0.10432999999999999
180,0.53028
181,0.90917
182,1.2159
183,1.4232
184,1.5213
185,1.5016
186,1.3634
187,1.1224
188,0.78305
189,0.37396
190,-0.07472999999999999
191,-0.52493
192,-0.9401799999999999
193,-1.2805
194,-1.5191
195,-1.6339
196,-1.619
197,-1.4809999999999999
198,-1.2333
199,-0.89386
200,-0.49017
201,-0.048019
202,0.40426999999999996
203,0.8368700000000001
204,1.21
205,1.4937
206,1.6586
207,1.6789
208,1.5551
209,1.2957
210,0.9298
211,0.49166000000000004
212,0.025605000000000003
213,-0.42396999999999996
214,-0.82749
215,-1.1548
216,-1.3938
217,-1.534
218,-1.5723
219,-1.5009
220,-1.321
221,-1.0449
222,-0.6805100000000001
223,-0.25425
224,0.20034000000000002
225,0.64672
226,1.0455
227,1.3716
228,1.5907
229,1.6851
230,1.6540000000000001
231,1.4949
232,1.226
233,0.86085
234,0.42872
235,-0.037658
236,-0.50768
237,-0.9359799999999999
238,-1.2945
239,-1.5532
240,-1.6979
241,-1.726
242,-1.6424
243,-1.4601
244,-1.1888
245,-0.8532
246,-0.46789
247,-0.043036000000000005
248,0.4004
249,0.8372200000000001
250,1.2446
251,1.5919999999999999
252,1.8446
253,1.9731
254,1.9579
255,1.7828
256,1.4569
257,1.0026
258,0.44877
259,-0.15375999999999998
260,-0.75638
261,-1.3030000000000002
262,-1.7434
263,-2.0359
264,-2.1613
265,-2.112
266,-1.8994
267,-1.5474
268,-1.0921
269,-0.56797
270,-0.014221000000000001
271,0.5297
272,1.0289
273,1.4545
274,1.7737
275,1.9583
276,1.994
277,1.8726
278,1.6057
279,1.2172
280,0.75307
281,0.25522
282,-0.22889
283,-0.66646
284,-1.0298
285,-1.3036
286,-1.4926
287,-1.5916
288,-1.6076
289,-1.5364
290,-1.3769
291,-1.1277
292,-0.79502
293,-0.39771
294,0.034399
295,0.46618000000000004
296,0.8611700000000001
297,1.1835
298,1.4049
299,1.5132
300,1.5039
301,1.3827
302,1.1697
303,0.8793200000000001
304,0.5353399999999999
305,0.16887
306,-0.19502
307,-0.53475
308,-0.8259700000000001
309,-1.0551
310,-1.207
311,-1.272
312,-1.2488
313,-1.1368
314,-0.9473299999999999
315,-0.68943
316,-0.37824
317,-0.036815
318,0.30996999999999997
319,0.6329100000000001
320,0.9058799999999999
321,1.1063
322,1.2197
323,1.2367
324,1.1546
325,0.99221
326,0.76093
327,0.48277
328,0.17194
329,-0.15028
330,-0.47186999999999996
331,-0.78098
332,-1.0594
333,-1.2922
334,-1.4538
335,-1.5186
336,-1.4652
337,-1.2747
338,-0.9489
339,-0.50655
340,0.012338
341,0.5583100000000001
342,1.0667
343,1.4822
344,1.7575
345,1.8707
346,1.8252
347,1.6425
348,1.3469
349,0.9811700000000001
350,0.57426
351,0.14855
352,-0.28281
353,-0.70863
354,-1.1163
355,-1.4894
356,-1.8009
357,-2.0213
358,-2.1209
359,-2.0686
360,-1.8515
361,-1.4712
362,-0.95275
363,-0.33485
364,0.32988
365,0.9859600000000001
366,1.5769
367,2.0472
368,2.3639
369,2.4983
370,2.439
371,2.1936
372,1.7904
373,1.2604
374,0.64686
375,0.0017349
376,-0.6239
377,-1.1844
378,-1.6371
379,-1.9553
380,-2.124
381,-2.1385
382,-2.0058
383,-1.7463
384,-1.3898
385,-0.96726
386,-0.51682
387,-0.064126
388,0.36361
389,0.74858
390,1.0826
391,1.3554
392,1.5637
393,1.6962
394,1.7435
395,1.6903
396,1.5257
397,1.2439
398,0.84983
399,0.36661
400,-0.16564
401,-0.69643
402,-1.1736
403,-1.5525
404,-1.7948
405,-1.886
406,-1.83
407,-1.6398
408,-1.3387
409,-0.9518399999999999
410,-0.5009600000000001
411,-0.015548
412,0.47921
413,0.94885
414,1.3504
415,1.6476
416,1.8067
417,1.8030000000000002
418,1.6382
419,1.3413
420,0.95126
421,0.51554
422,0.07752300000000001
423,-0.32802
424,-0.68045
425,-0.97124
426,-1.2042
427,-1.3739
428,-1.4772
429,-1.4946
430,-1.4061
431,-1.1971
432,-0.8728299999999999
433,-0.45751000000000003
434,0.0021654
435,0.45219
436,0.83844
437,1.1244
438,1.2879
439,1.3327
440,1.2795
441,1.1540000000000001
442,0.98008
443,0.77395
444,0.53942
445,0.27482
446,-0.021908
447,-0.33984000000000003
448,-0.6543899999999999
449,-0.92899
450,-1.1283
451,-1.2189
452,-1.1923
453,-1.0519
454,-0.8205
455,-0.5380199999999999
456,-0.24702
457,0.023513
458,0.24527
459,0.41706000000000004
460,0.53577
461,0.61256
462,0.6531100000000001
463,0.67338
464,0.6706
465,0.6432
466,0.59073
467,0.50337
468,0.3845
469,0.23167
470,0.057089999999999995
471,-0.12786
472,-0.30787
473,-0.47283000000000003
474,-0.60345
475,-0.6917399999999999
476,-0.72883
477,-0.7053699999999999
478,-0.62361
479,-0.49196000000000006
480,-0.31414000000000003
481,-0.10538
482,0.11352000000000001
483,0.31948000000000004
484,0.49105
485,0.6119899999999999
486,0.6666300000000001
487,0.65166
488,0.58004
489,0.46333
490,0.32178
491,0.17349
492,0.036924
493,-0.079249
494,-0.17292000000000002
495,-0.24602
496,-0.30304000000000003
497,-0.35298
498,-0.39697
499,-0.43173
