time,value
0,2.136
1,2.136
2,2.136
3,2.136
4,2.136
5,2.136
6,2.136
7,2.136
8,2.136
9,2.136
10,2.136
11,2.136
12,2.136
13,2.1109999999999998
14,2.0745
15,2.0139
16,1.9393
17,1.8647
18,1.7902
19,1.7193
20,1.6517
21,1.5951
22,1.5503
23,1.5056
24,1.4608
25,1.4161
26,1.3714
27,1.3407
28,1.3397
29,1.339
30,1.339
31,1.339
32,1.339
33,1.339
34,1.339
35,1.339
36,1.339
37,1.339
38,1.339
39,1.339
40,1.339
41,1.339
42,1.339
43,1.339
44,1.339
45,1.339
46,1.339
47,1.339
48,1.339
49,1.339
50,1.339
51,1.339
52,1.339
53,1.339
54,1.339
55,1.339
56,1.339
57,1.339
58,1.339
59,1.339
60,1.339
61,1.339
62,1.339
63,1.339
64,1.339
65,1.339
66,1.339
67,1.339
68,1.339
69,1.339
70,1.339
71,1.339
72,1.338
73,1.3323
74,1.3238
75,1.2939
76,1.2641
77,1.2343
78,1.2045
79,1.1747
80,1.1448
81,1.0949
82,1.0441
83,0.99205
84,0.93986
85,0.8876700000000001
86,0.83547
87,0.79961
88,0.76772
89,0.7429899999999999
90,0.7206199999999999
91,0.69825
92,0.67588
93,0.65146
94,0.62592
95,0.59783
96,0.568
97,0.53818
98,0.50835
99,0.47853
100,0.4487
101,0.41888000000000003
102,0.38905
103,0.35923
104,0.32941
105,0.29958
106,0.26976
107,0.2361
108,0.19263
109,0.14887
110,0.10413
111,0.059397000000000005
112,0.01466
113,-0.028856
114,-0.06375700000000001
115,-0.09829299999999999
116,-0.12812
117,-0.15794
118,-0.18777
119,-0.21759
120,-0.24159
121,-0.26538
122,-0.28105
123,-0.29596
124,-0.31087
125,-0.32579
126,-0.3398
127,-0.3536
128,-0.36259
129,-0.37005
130,-0.3775
131,-0.38495999999999997
132,-0.39242
133,-0.39987
134,-0.40733
135,-0.41478000000000004
136,-0.42223999999999995
137,-0.4297
138,-0.43715
139,-0.44461000000000006
140,-0.45206999999999997
141,-0.45952
142,-0.46698
143,-0.47443
144,-0.48189
145,-0.48935
146,-0.4968
147,-0.50426
148,-0.51171
149,-0.51917
150,-0.52663
151,-0.53408
152,-0.5415399999999999
153,-0.5489999999999999
154,-0.55645
155,-0.56391
156,-0.5713600000000001
157,-0.57882
158,-0.58628
159,-0.59373
160,-0.60119
161,-0.60864
162,-0.6161
163,-0.62356
164,-0.6310100000000001
165,-0.63847
166,-0.64593
167,-0.6533800000000001
168,-0.66084
169,-0.6682899999999999
170,-0.67575
171,-0.68321
172,-0.69066
173,-0.69812
174,-0.70558
175,-0.71303
176,-0.72049
177,-0.7279399999999999
178,-0.7354
179,-0.7428600000000001
180,-0.75031
181,-0.7577699999999999
182,-0.76522
183,-0.77268
184,-0.78014
185,-0.78759
186,-0.79505
187,-0.80097
188,-0.80208
189,-0.80298
190,-0.80298
191,-0.80298
192,-0.80298
193,-0.80298
194,-0.80298
195,-0.80298
196,-0.80298
197,-0.80298
198,-0.80298
199,-0.80298
200,-0.80298
201,-0.80298
202,-0.80298
203,-0.80298
204,-0.80298
205,-0.80298
206,-0.80347
207,-0.80411
208,-0.8096399999999999
209,-0.8171
210,-0.8245600000000001
211,-0.83201
212,-0.83947
213,-0.84693
214,-0.8509
215,-0.8521700000000001
216,-0.8528
217,-0.8528
218,-0.8528
219,-0.8528
220,-0.8528
221,-0.8528
222,-0.8528
223,-0.8528
224,-0.8528
225,-0.8528
226,-0.8528
227,-0.8528
228,-0.8528
229,-0.8528
230,-0.8528
231,-0.8528
232,-0.8528
233,-0.8528
234,-0.8528
235,-0.8528
236,-0.8528
237,-0.8528
238,-0.8528
239,-0.8528
240,-0.8528
241,-0.8528
242,-0.8528
243,-0.8528
244,-0.8528
245,-0.8528
246,-0.8528
247,-0.8528
248,-0.8528
249,-0.8528
250,-0.8528
251,-0.8528
252,-0.8528
253,-0.8528
254,-0.8528
255,-0.8528
256,-0.8528
257,-0.8528
258,-0.8528
259,-0.8526600000000001
260,-0.85235
261,-0.84946
262,-0.84201
263,-0.83455
264,-0.8271
265,-0.8196399999999999
266,-0.81218
267,-0.80592
268,-0.80433
269,-0.80298
270,-0.80298
271,-0.80298
272,-0.80298
273,-0.8028
274,-0.79883
275,-0.79487
276,-0.78743
277,-0.77998
278,-0.77252
279,-0.76507
280,-0.75944
281,-0.75405
282,-0.75317
283,-0.75317
284,-0.75317
285,-0.75317
286,-0.75317
287,-0.75317
288,-0.75317
289,-0.75317
290,-0.75317
291,-0.75317
292,-0.75317
293,-0.75317
294,-0.75317
295,-0.75317
296,-0.75317
297,-0.75317
298,-0.75317
299,-0.75317
300,-0.75317
301,-0.75317
302,-0.75317
303,-0.75317
304,-0.75317
305,-0.75317
306,-0.7527699999999999
307,-0.7508699999999999
308,-0.7480899999999999
309,-0.74064
310,-0.73318
311,-0.72572
312,-0.71827
313,-0.71081
314,-0.70335
