time,value
0,-1.7803
1,-1.7163
2,-1.7536
3,-1.7505
4,-1.7678
5,-1.7283
6,-1.7628
7,-1.7367
8,-1.7536
9,-1.7078
10,-1.7741
11,-1.7629
12,-1.7890000000000001
13,-1.7735
14,-1.7256
15,-1.7589
16,-1.7930000000000001
17,-1.7382
18,-1.7618
19,-1.7183
20,-1.7597
21,-1.7279
22,-1.7784
23,-1.7668
24,-1.7552
25,-1.784
26,-1.8172
27,-1.7986
28,-1.7696
29,-1.786
30,-1.7853
31,-1.8531
32,-1.8162
33,-1.7823
34,-1.7882
35,-1.7619
36,-1.7207
37,-1.7578
38,-1.7907
39,-1.7465
40,-1.7546
41,-1.7809
42,-1.8017
43,-1.7576
44,-1.7503
45,-1.7678
46,-1.7414
47,-1.7024
48,-1.7547
49,-1.7126
50,-1.7207
51,-1.7387
52,-1.7052
53,-1.6998
54,-1.6726
55,-1.6625
56,-1.6352
57,-1.6879
58,-1.6072
59,-1.5586
60,-1.5116
61,-1.4457
62,-1.4811
63,-1.3472
64,-1.3112
65,-1.2133
66,-1.1518
67,-1.0371
68,-0.9427399999999999
69,-0.79933
70,-0.70815
71,-0.57225
72,-0.46481000000000006
73,-0.37751999999999997
74,-0.29024
75,-0.22551999999999997
76,-0.078955
77,0.05414
78,0.084487
79,0.17429
80,0.20978000000000002
81,0.25822
82,0.3432
83,0.3536
84,0.42405
85,0.46348
86,0.48411000000000004
87,0.52108
88,0.51342
89,0.53864
90,0.5653
91,0.60569
92,0.5321899999999999
93,0.58162
94,0.58577
95,0.63369
96,0.6088100000000001
97,0.63198
98,0.63965
99,0.60552
100,0.62657
101,0.54908
102,0.6270600000000001
103,0.63649
104,0.62978
105,0.67678
106,0.59222
107,0.61302
108,0.6029
109,0.63627
110,0.62335
111,0.65923
112,0.65966
113,0.6439199999999999
114,0.6012
115,0.6169399999999999
116,0.60213
117,0.67573
118,0.70252
119,0.61423
120,0.6348699999999999
121,0.64728
122,0.67607
123,0.5929800000000001
124,0.62021
125,0.59796
126,0.66723
127,0.5948399999999999
128,0.66823
129,0.60868
130,0.61364
131,0.62131
132,0.6289899999999999
133,0.6258600000000001
134,0.60387
135,0.65499
136,0.66032
137,0.6269600000000001
138,0.6389199999999999
139,0.62471
140,0.67392
141,0.67279
142,0.63563
143,0.63
144,0.60301
145,0.57602
146,0.6096600000000001
147,0.6202
148,0.64869
149,0.6037399999999999
150,0.62107
151,0.66342
152,0.59936
153,0.6299899999999999
154,0.5918
155,0.6379100000000001
156,0.58945
157,0.64481
158,0.60927
159,0.64161
160,0.65146
161,0.66204
162,0.66456
163,0.58753
164,0.67296
165,0.58319
166,0.61864
167,0.65081
168,0.65323
169,0.5655
170,0.6278
171,0.60416
172,0.66564
173,0.6147600000000001
174,0.6177699999999999
175,0.6139
176,0.6618
177,0.65992
178,0.66814
179,0.6201300000000001
180,0.63267
181,0.6140899999999999
182,0.5999800000000001
183,0.5716100000000001
184,0.63672
185,0.68295
186,0.61682
187,0.64807
188,0.63798
189,0.66762
190,0.60983
191,0.55203
192,0.66687
193,0.60322
194,0.6167199999999999
195,0.63021
196,0.6083
197,0.63372
198,0.59846
199,0.60492
200,0.61044
201,0.64472
202,0.62553
203,0.5969399999999999
204,0.60247
205,0.64323
206,0.62647
207,0.6112
208,0.5798300000000001
209,0.64773
210,0.6388199999999999
211,0.64867
212,0.61541
213,0.63015
214,0.59432
215,0.64661
216,0.65461
217,0.6521
218,0.68167
219,0.58033
220,0.58929
221,0.6069
222,0.62058
223,0.62713
224,0.57285
225,0.6118600000000001
226,0.64377
227,0.6179100000000001
228,0.6207699999999999
229,0.63865
230,0.62568
231,0.6453
232,0.64577
233,0.62211
234,0.62817
235,0.6410100000000001
236,0.6029100000000001
237,0.64566
238,0.65062
239,0.6107600000000001
240,0.67609
241,0.61277
242,0.55501
243,0.61469
244,0.58572
245,0.5926899999999999
246,0.5996600000000001
247,0.6017
248,0.69282
249,0.6087
250,0.57523
251,0.6025
252,0.63875
253,0.65876
254,0.58418
255,0.61115
256,0.60118
257,0.60117
258,0.59291
259,0.60664
260,0.60034
261,0.62883
262,0.61907
263,0.6704100000000001
264,0.59025
265,0.60528
266,0.6402899999999999
267,0.63773
268,0.61816
269,0.64551
270,0.60485
271,0.59264
272,0.6432
273,0.63576
274,0.6180100000000001
