time,value
0,-0.56355
1,-0.56355
2,-0.56355
3,-0.56355
4,-0.56355
5,-0.56355
6,-0.56355
7,-0.56355
8,-0.56355
9,-0.56355
10,-0.56355
11,-0.56355
12,-0.56355
13,-0.56355
14,-0.56355
15,-0.56355
16,-0.56355
17,-0.56355
18,-0.56355
19,-0.56355
20,-0.56355
21,-0.56355
22,-0.56355
23,-0.56355
24,-0.56355
25,-0.56355
26,-0.56355
27,-0.56355
28,-0.56355
29,-0.56355
30,-0.56355
31,-0.56355
32,-0.56355
33,-0.56355
34,-0.56355
35,-0.56355
36,-0.56355
37,-0.56355
38,-0.56355
39,-0.56355
40,-0.56355
41,-0.56355
42,-0.56355
43,-0.56355
44,-0.56355
45,-0.56355
46,-0.56355
47,-0.56355
48,-0.56355
49,-0.56355
50,-0.56355
51,-0.56355
52,-0.56355
53,-0.56355
54,-0.56355
55,-0.56355
56,-0.56355
57,-0.56355
58,-0.56355
59,-0.56355
60,-0.56355
61,-0.56355
62,-0.56355
63,-0.56355
64,-0.56355
65,-0.56355
66,-0.56355
67,-0.56355
68,-0.56355
69,-0.56355
70,-0.56355
71,-0.56355
72,-0.56355
73,-0.56355
74,-0.56355
75,-0.56355
76,-0.56355
77,-0.56355
78,-0.56355
79,-0.56355
80,-0.56355
81,-0.56355
82,-0.56355
83,-0.56355
84,-0.56355
85,-0.56355
86,-0.56355
87,-0.56355
88,-0.56355
89,-0.56355
90,-0.56355
91,-0.56355
92,-0.56355
93,-0.56355
94,-0.56355
95,-0.56355
96,-0.56355
97,-0.56355
98,-0.56355
99,-0.56355
100,-0.56355
101,-0.56355
102,-0.56355
103,-0.56355
104,-0.56355
105,-0.56355
106,-0.56355
107,-0.56355
108,-0.56355
109,-0.56355
110,-0.56355
111,-0.56355
112,-0.56355
113,-0.56355
114,-0.56355
115,-0.56355
116,-0.56355
117,-0.56355
118,-0.56355
119,-0.56355
120,-0.56355
121,-0.56355
122,-0.56355
123,-0.56355
124,-0.56355
125,-0.56355
126,-0.56355
127,-0.56355
128,-0.56355
129,-0.56355
130,-0.56355
131,-0.56355
132,-0.56355
133,-0.56355
134,-0.56355
135,-0.56355
136,-0.56355
137,-0.56355
138,-0.56355
139,-0.56355
140,-0.56355
141,-0.56355
142,-0.56355
143,-0.56355
144,-0.56355
145,-0.56355
146,-0.56355
147,-0.56355
148,-0.56355
149,-0.56355
150,-0.56355
151,-0.56355
152,-0.56355
153,-0.56355
154,-0.56355
155,-0.56355
156,-0.56355
157,-0.56355
158,-0.56355
159,-0.56355
160,-0.56355
161,-0.56355
162,-0.56355
163,-0.56355
164,-0.56355
165,-0.56355
166,-0.56355
167,-0.56355
168,-0.56355
169,-0.56355
170,-0.56355
171,-0.56355
172,-0.56355
173,-0.56355
174,-0.56355
175,-0.56355
176,-0.56355
177,-0.56355
178,-0.56355
179,-0.56355
180,-0.56355
181,-0.56355
182,-0.56355
183,-0.56355
184,-0.56355
185,-0.56355
186,-0.56355
187,-0.56355
188,-0.56355
189,-0.56355
190,-0.56355
191,-0.56355
192,-0.56355
193,-0.56355
194,-0.56355
195,-0.56355
196,-0.56355
197,-0.56355
198,-0.56355
199,-0.56355
200,-0.56355
201,-0.56355
202,-0.56355
203,-0.56355
204,-0.56355
205,-0.56355
206,-0.56355
207,-0.56355
208,-0.56355
209,-0.56355
210,-0.56355
211,-0.56355
212,-0.56355
213,-0.56355
214,-0.56355
215,-0.56355
216,-0.56355
217,-0.56355
218,-0.56355
219,-0.56355
220,-0.56355
221,-0.56355
222,-0.56355
223,-0.56355
224,-0.56355
225,-0.56355
226,-0.56355
227,-0.56355
228,-0.56355
229,-0.56355
230,-0.56355
231,-0.56355
232,-0.56355
233,-0.56355
234,-0.56355
235,-0.56355
236,-0.56355
237,-0.56355
238,-0.56355
239,-0.56355
240,-0.56355
241,-0.56355
242,-0.56355
243,-0.56355
244,-0.56355
245,-0.56355
246,-0.56355
247,-0.56355
248,-0.56355
249,-0.56355
250,-0.56355
251,-0.56355
252,-0.56355
253,-0.56355
254,-0.56355
255,-0.56355
256,-0.56355
257,-0.56355
258,-0.56355
259,-0.56355
260,-0.56355
261,-0.56355
262,-0.56355
263,-0.56355
264,-0.56355
265,-0.56355
266,-0.56355
267,-0.56355
268,-0.56355
269,-0.56355
270,-0.56355
271,-0.56355
272,-0.56355
273,-0.56355
274,-0.56355
275,-0.56355
276,-0.56355
277,-0.56355
278,-0.56355
279,-0.56355
280,-0.56355
281,-0.56355
282,-0.56355
283,-0.56355
284,-0.56355
285,-0.56355
286,-0.56355
287,-0.56355
288,-0.56355
289,-0.56355
290,-0.56355
291,-0.56355
292,-0.56355
293,-0.56355
294,-0.56355
295,-0.56355
296,-0.56355
297,-0.56355
298,-0.56355
299,-0.56355
300,-0.56355
301,-0.56355
302,-0.56355
303,-0.56355
304,-0.56355
305,-0.56355
306,-0.56355
307,-0.56355
308,-0.56355
309,-0.56355
310,-0.56355
311,-0.56355
312,-0.56355
313,-0.56355
314,-0.56355
315,-0.56355
316,-0.56355
317,-0.56355
318,-0.56355
319,-0.56355
320,-0.56355
321,-0.56355
322,-0.56355
323,-0.56355
324,-0.56355
325,-0.56355
326,-0.56355
327,-0.56355
328,-0.56355
329,-0.56355
330,-0.56355
331,-0.56355
332,-0.56355
333,-0.56355
334,-0.56355
335,-0.56355
336,-0.56355
337,-0.56355
338,-0.56355
339,-0.56355
340,-0.56355
341,-0.56355
342,-0.56355
343,-0.56355
344,-0.56355
345,-0.56355
346,-0.56355
347,-0.56355
348,-0.56355
349,-0.56355
350,-0.56355
351,-0.56355
352,-0.56355
353,-0.56355
354,-0.56355
355,-0.56355
356,-0.56355
357,-0.56355
358,-0.56355
359,-0.56355
360,-0.56355
361,-0.56355
362,-0.56355
363,-0.56355
364,-0.56355
365,-0.56355
366,-0.56355
367,-0.56355
368,-0.56355
369,-0.56355
370,-0.56355
371,-0.56355
372,-0.56355
373,-0.56355
374,-0.56355
375,-0.56355
376,-0.56355
377,-0.56355
378,-0.56355
379,-0.56355
380,-0.56355
381,-0.56355
382,-0.56355
383,-0.56355
384,-0.56355
385,-0.56355
386,-0.56355
387,-0.56355
388,-0.56355
389,-0.56355
390,-0.56355
391,-0.56355
392,-0.56355
393,-0.56355
394,-0.56355
395,-0.56355
396,-0.56355
397,-0.56355
398,-0.56355
399,-0.56355
400,-0.56355
401,-0.56355
402,-0.56355
403,-0.56355
404,-0.56355
405,-0.56355
406,-0.56355
407,-0.56355
408,-0.56355
409,-0.56355
410,-0.56355
411,-0.56355
412,-0.56355
413,-0.56355
414,-0.56355
415,-0.56355
416,-0.56355
417,-0.56355
418,-0.56355
419,-0.56355
420,-0.56355
421,-0.56355
422,-0.56355
423,-0.56355
424,-0.56355
425,-0.56355
426,-0.56355
427,-0.56355
428,-0.56355
429,-0.56355
430,-0.56355
431,-0.56355
432,-0.56355
433,-0.56355
434,-0.56355
435,-0.56355
436,-0.56355
437,-0.56355
438,-0.56355
439,-0.56355
440,-0.56355
441,-0.56355
442,-0.56355
443,-0.56355
444,-0.56355
445,-0.56355
446,-0.56355
447,-0.56355
448,-0.56355
449,-0.56355
450,-0.56355
451,-0.56355
452,-0.56355
453,-0.56355
454,-0.56355
455,-0.56355
456,-0.56355
457,-0.56355
458,-0.56355
459,-0.56355
460,-0.56355
461,-0.56355
462,-0.56355
463,-0.56355
464,-0.56355
465,-0.56355
466,-0.56355
467,-0.56355
468,-0.56355
469,-0.56355
470,-0.56355
471,-0.56355
472,-0.56355
473,-0.56355
474,-0.56355
475,-0.56355
476,-0.56355
477,-0.56355
478,-0.56355
479,-0.56355
480,-0.56355
481,-0.56355
482,-0.56355
483,-0.56355
484,-0.56355
485,-0.56355
486,-0.56355
487,-0.56355
488,-0.56355
489,-0.56355
490,-0.56355
491,-0.56355
492,-0.56355
493,-0.56355
494,-0.56355
495,-0.56355
496,-0.56355
497,-0.56355
498,-0.56355
499,-0.56355
500,-0.56355
501,-0.56355
502,-0.56355
503,-0.56355
504,0.43708
505,2.1048
506,1.7713
507,1.7713
508,1.7713
509,1.7713
510,1.7713
511,1.7713
512,2.1048
513,1.7713
514,1.7713
515,1.7713
516,1.7713
517,1.7713
518,1.7713
519,1.7713
520,2.1048
521,1.7713
522,1.7713
523,1.7713
524,1.7713
525,2.1048
526,1.7713
527,1.7713
528,1.7713
529,1.7713
530,2.1048
531,1.7713
532,1.7713
533,2.1048
534,1.7713
535,1.7713
536,1.7713
537,1.7713
538,1.7713
539,1.7713
540,1.7713
541,1.7713
542,1.7713
543,1.7713
544,1.7713
545,1.7713
546,2.1048
547,1.7713
548,1.7713
549,1.7713
550,1.7713
551,1.7713
552,1.7713
553,1.7713
554,1.7713
555,2.1048
556,1.7713
557,1.7713
558,1.7713
559,1.7713
560,2.1048
561,1.7713
562,1.7713
563,1.7713
564,1.7713
565,2.1048
566,1.7713
567,1.7713
568,1.7713
569,1.7713
570,1.7713
571,1.7713
572,1.7713
573,1.7713
574,1.7713
575,1.7713
576,1.7713
577,1.7713
578,1.7713
579,2.1048
580,1.7713
581,1.7713
582,1.7713
583,1.7713
584,1.7713
585,1.7713
586,1.7713
587,1.7713
588,1.7713
589,1.7713
590,1.7713
591,1.7713
592,1.7713
593,1.7713
594,1.7713
595,1.7713
596,1.7713
597,1.7713
598,1.7713
599,1.7713
600,1.7713
601,1.4377
602,1.7713
603,1.7713
604,1.7713
605,1.4377
606,1.7713
607,1.7713
608,1.7713
609,1.7713
610,1.7713
611,1.4377
612,1.7713
613,1.7713
614,1.7713
615,1.7713
616,1.4377
617,2.1048
618,1.7713
619,1.7713
620,1.4377
621,1.7713
622,1.7713
623,1.7713
624,1.7713
625,1.7713
626,1.7713
627,1.7713
628,1.7713
629,1.7713
630,1.7713
631,1.7713
632,1.7713
633,1.4377
634,1.7713
635,1.7713
636,1.7713
637,1.4377
638,1.7713
639,1.7713
640,1.7713
641,1.7713
642,1.4377
643,1.7713
644,1.7713
645,1.7713
646,1.4377
647,1.7713
648,1.7713
649,1.4377
650,1.7713
651,1.7713
652,1.7713
653,1.7713
654,1.4377
655,1.7713
656,1.7713
657,1.4377
658,1.7713
659,1.7713
660,1.7713
661,1.7713
662,1.7713
663,1.7713
664,1.4377
665,2.1048
666,1.7713
667,1.7713
668,1.7713
669,1.7713
670,1.7713
671,1.7713
672,1.7713
673,1.7713
674,1.7713
675,1.7713
676,1.7713
677,1.7713
678,0.27031
679,-0.56355
680,-0.56355
681,-0.56355
682,-0.56355
683,-0.56355
684,-0.56355
685,-0.56355
686,-0.56355
687,-0.56355
688,-0.56355
689,-0.56355
690,-0.56355
691,-0.56355
692,-0.56355
693,-0.56355
694,-0.56355
695,-0.56355
696,-0.56355
697,-0.56355
698,-0.56355
699,-0.56355
700,-0.56355
701,-0.56355
702,-0.56355
703,-0.56355
704,-0.56355
705,-0.56355
706,-0.56355
707,-0.56355
708,-0.56355
709,-0.56355
710,-0.56355
711,-0.56355
712,-0.56355
713,-0.56355
714,-0.56355
715,-0.56355
716,-0.56355
717,-0.56355
718,-0.56355
719,-0.56355
