time,value
0,-0.1258
1,-0.1258
2,-0.1258
3,-0.1258
4,-0.1258
5,-0.1258
6,-0.1258
7,-0.1258
8,-0.1258
9,-0.1258
10,-0.1258
11,-0.1258
12,-0.1258
13,-0.1258
14,-0.1258
15,-0.1258
16,-0.1258
17,-0.1258
18,-0.1258
19,-0.1258
20,-0.1258
21,-0.1258
22,-0.1258
23,-0.1258
24,-0.1258
25,-0.1258
26,-0.1258
27,-0.1258
28,-0.1258
29,-0.1258
30,-0.1258
31,-0.1258
32,-0.1258
33,-0.1258
34,-0.1258
35,-0.1258
36,-0.1258
37,-0.1258
38,-0.1258
39,-0.1258
40,-0.1258
41,-0.1258
42,-0.1258
43,-0.1258
44,-0.1258
45,-0.1258
46,-0.1258
47,-0.1258
48,-0.1258
49,-0.1258
50,-0.1258
51,-0.1258
52,-0.1258
53,-0.1258
54,-0.1258
55,-0.1258
56,-0.1258
57,-0.1258
58,-0.1258
59,-0.1258
60,-0.1258
61,-0.1258
62,-0.1258
63,-0.1258
64,-0.1258
65,-0.1258
66,-0.1258
67,-0.1258
68,-0.1258
69,-0.1258
70,-0.1258
71,-0.1258
72,-0.1258
73,-0.1258
74,-0.1258
75,-0.1258
76,-0.1258
77,-0.1258
78,-0.1258
79,-0.1258
80,-0.1258
81,-0.1258
82,-0.1258
83,-0.1258
84,-0.1258
85,-0.1258
86,-0.1258
87,-0.1258
88,-0.1258
89,-0.1258
90,-0.1258
91,-0.1258
92,-0.1258
93,-0.1258
94,-0.1258
95,-0.1258
96,-0.1258
97,-0.1258
98,-0.1258
99,-0.1258
100,-0.1258
101,-0.1258
102,-0.1258
103,-0.1258
104,-0.1258
105,-0.1258
106,-0.1258
107,-0.1258
108,-0.1258
109,-0.1258
110,-0.1258
111,-0.1258
112,-0.1258
113,-0.1258
114,-0.1258
115,-0.1258
116,-0.1258
117,-0.1258
118,-0.1258
119,-0.1258
120,-0.1258
121,-0.1258
122,-0.1258
123,-0.1258
124,-0.1258
125,-0.1258
126,-0.1258
127,-0.1258
128,-0.1258
129,-0.1258
130,-0.1258
131,-0.1258
132,-0.1258
133,-0.1258
134,-0.1258
135,-0.1258
136,-0.1258
137,-0.1258
138,-0.1258
139,-0.1258
140,-0.1258
141,-0.1258
142,-0.1258
143,-0.1258
144,-0.1258
145,-0.1258
146,-0.1258
147,-0.1258
148,-0.1258
149,-0.1258
150,-0.1258
151,-0.1258
152,-0.1258
153,-0.1258
154,-0.1258
155,-0.1258
156,-0.1258
157,-0.1258
158,-0.1258
159,-0.1258
160,-0.1258
161,-0.1258
162,-0.1258
163,-0.1258
164,-0.1258
165,-0.1258
166,-0.1258
167,-0.1258
168,-0.1258
169,-0.1258
170,-0.1258
171,-0.1258
172,-0.1258
173,-0.1258
174,-0.1258
175,-0.1258
176,-0.1258
177,-0.1258
178,-0.1258
179,-0.1258
180,-0.1258
181,-0.1258
182,-0.1258
183,-0.1258
184,-0.1258
185,-0.1258
186,-0.1258
187,-0.1258
188,-0.1258
189,-0.1258
190,-0.1258
191,-0.1258
192,-0.1258
193,-0.1258
194,-0.1258
195,-0.1258
196,-0.1258
197,-0.1258
198,-0.1258
199,-0.1258
200,-0.1258
201,-0.1258
202,-0.1258
203,-0.1258
204,-0.1258
205,-0.1258
206,-0.1258
207,-0.1258
208,-0.1258
209,-0.1258
210,-0.1258
211,-0.1258
212,-0.1258
213,-0.1258
214,-0.1258
215,-0.1258
216,-0.1258
217,-0.1258
218,-0.1258
219,-0.1258
220,-0.1258
221,-0.1258
222,-0.1258
223,-0.1258
224,-0.1258
225,-0.1258
226,-0.1258
227,-0.1258
228,-0.1258
229,-0.1258
230,-0.1258
231,-0.1258
232,-0.1258
233,-0.1258
234,-0.1258
235,-0.1258
236,-0.1258
237,-0.1258
238,-0.1258
239,-0.1258
240,-0.1258
241,-0.1258
242,-0.1258
243,-0.1258
244,-0.1258
245,-0.1258
246,-0.1258
247,-0.1258
248,-0.1258
249,-0.1258
250,-0.1258
251,-0.1258
252,-0.1258
253,-0.1258
254,-0.1258
255,-0.1258
256,-0.1258
257,-0.1258
258,7.0567
259,7.0567
260,-0.10811
261,-0.1258
262,-0.1258
263,-0.1258
264,-0.1258
265,-0.1258
266,-0.1258
267,-0.1258
268,11.019
269,3.7662
270,0.015725
271,-0.1258
272,-0.1258
273,-0.1258
274,-0.1258
275,-0.1258
276,-0.1258
277,-0.1258
278,-0.1258
279,-0.1258
280,-0.1258
281,-0.1258
282,-0.1258
283,-0.1258
284,-0.1258
285,-0.1258
286,-0.1258
287,7.8351
288,11.975
289,3.5893
290,0.015725
291,-0.1258
292,-0.1258
293,-0.1258
294,-0.1258
295,-0.1258
296,-0.1258
297,-0.1258
298,-0.1258
299,-0.1258
300,-0.1258
301,-0.1258
302,-0.1258
303,-0.1258
304,-0.1258
305,-0.1258
306,-0.1258
307,-0.1258
308,-0.1258
309,4.9692
310,2.2802
311,-0.1258
312,-0.1258
313,-0.1258
314,-0.1258
315,-0.1258
316,-0.1258
317,-0.1258
318,-0.1258
319,-0.1258
320,-0.1258
321,-0.1258
322,-0.1258
323,-0.1258
324,-0.1258
325,-0.1258
326,-0.1258
327,-0.1258
328,-0.1258
329,-0.1258
330,-0.1258
331,-0.1258
332,-0.1258
333,-0.1258
334,-0.1258
335,-0.1258
336,-0.1258
337,-0.1258
338,-0.1258
339,-0.1258
340,-0.1258
341,-0.1258
342,-0.1258
343,-0.1258
344,-0.1258
345,-0.1258
346,-0.1258
347,-0.1258
348,-0.1258
349,-0.1258
350,-0.1258
351,-0.1258
352,-0.1258
353,-0.1258
354,-0.1258
355,-0.1258
356,-0.1258
357,-0.1258
358,3.7662
359,4.9692
360,-0.055038
361,1.7317
362,-0.055038
363,-0.1258
364,-0.1258
365,-0.1258
366,-0.1258
367,-0.1258
368,-0.1258
369,-0.1258
370,-0.1258
371,-0.1258
372,-0.1258
373,-0.1258
374,-0.1258
375,-0.1258
376,6.3137
377,11.975
378,-0.055038
379,-0.1258
380,-0.1258
381,-0.1258
382,-0.1258
383,-0.1258
384,-0.1258
385,-0.1258
386,-0.1258
387,-0.1258
388,-0.1258
389,-0.1258
390,-0.1258
391,-0.1258
392,-0.1258
393,-0.1258
394,-0.1258
395,-0.1258
396,-0.1258
397,-0.1258
398,-0.1258
399,-0.1258
400,-0.1258
401,-0.1258
402,-0.1258
403,-0.1258
404,-0.1258
405,-0.1258
406,-0.1258
407,-0.1258
408,-0.1258
409,-0.1258
410,-0.1258
411,-0.1258
412,-0.1258
413,-0.1258
414,-0.1258
415,-0.1258
416,-0.1258
417,-0.1258
418,-0.1258
419,-0.1258
420,-0.1258
421,-0.1258
422,-0.1258
423,-0.1258
424,-0.1258
425,-0.1258
426,-0.1258
427,-0.1258
428,-0.1258
429,-0.1258
430,-0.1258
431,-0.1258
432,-0.1258
433,-0.1258
434,-0.1258
435,-0.1258
436,-0.1258
437,-0.1258
438,-0.1258
439,-0.1258
440,-0.1258
441,-0.1258
442,-0.1258
443,-0.1258
444,-0.1258
445,-0.1258
446,-0.1258
447,-0.1258
448,-0.1258
449,-0.1258
450,-0.1258
451,-0.1258
452,-0.1258
453,-0.1258
454,-0.1258
455,-0.1258
456,-0.1258
457,-0.1258
458,-0.1258
459,-0.1258
460,-0.1258
461,-0.1258
462,-0.1258
463,-0.1258
464,-0.1258
465,-0.1258
466,-0.1258
467,-0.1258
468,-0.1258
469,-0.1258
470,-0.1258
471,-0.1258
472,-0.1258
473,-0.1258
474,-0.1258
475,-0.1258
476,-0.1258
477,-0.1258
478,-0.1258
479,-0.1258
480,-0.1258
481,-0.1258
482,-0.1258
483,-0.1258
484,-0.1258
485,-0.1258
486,-0.1258
487,-0.1258
488,-0.1258
489,-0.1258
490,-0.1258
491,-0.1258
492,-0.1258
493,-0.1258
494,-0.1258
495,-0.1258
496,-0.1258
497,-0.1258
498,-0.1258
499,-0.1258
500,-0.1258
501,-0.1258
502,-0.1258
503,-0.1258
504,-0.1258
505,-0.1258
506,-0.1258
507,-0.1258
508,-0.1258
509,-0.1258
510,-0.1258
511,-0.1258
512,-0.1258
513,-0.1258
514,-0.1258
515,-0.1258
516,-0.1258
517,-0.1258
518,-0.1258
519,-0.1258
520,-0.1258
521,-0.1258
522,-0.1258
523,-0.1258
524,-0.1258
525,-0.1258
526,-0.1258
527,-0.1258
528,-0.1258
529,-0.1258
530,-0.1258
531,-0.1258
532,-0.1258
533,-0.1258
534,-0.1258
535,-0.1258
536,-0.1258
537,-0.1258
538,-0.1258
539,-0.1258
540,-0.1258
541,-0.1258
542,-0.1258
543,-0.1258
544,-0.1258
545,-0.1258
546,-0.1258
547,-0.1258
548,-0.1258
549,-0.1258
550,-0.1258
551,-0.1258
552,-0.1258
553,-0.1258
554,-0.1258
555,-0.1258
556,-0.1258
557,-0.1258
558,-0.1258
559,-0.1258
560,-0.1258
561,-0.1258
562,-0.1258
563,-0.1258
564,-0.1258
565,-0.1258
566,-0.1258
567,-0.1258
568,-0.1258
569,-0.1258
570,-0.1258
571,-0.1258
572,-0.1258
573,-0.1258
574,-0.1258
575,-0.1258
576,-0.1258
577,-0.1258
578,-0.1258
579,-0.1258
580,-0.1258
581,-0.1258
582,-0.1258
583,-0.1258
584,-0.1258
585,-0.1258
586,-0.1258
587,-0.1258
588,-0.1258
589,-0.1258
590,-0.1258
591,-0.1258
592,-0.1258
593,-0.1258
594,-0.1258
595,-0.1258
596,-0.1258
597,-0.1258
598,-0.1258
599,-0.1258
600,-0.1258
601,-0.1258
602,-0.1258
603,-0.1258
604,-0.1258
605,-0.1258
606,-0.1258
607,-0.1258
608,-0.1258
609,-0.1258
610,-0.1258
611,-0.1258
612,-0.1258
613,-0.1258
614,-0.1258
615,-0.1258
616,-0.1258
617,-0.1258
618,-0.1258
619,-0.1258
620,-0.1258
621,-0.1258
622,-0.1258
623,-0.1258
624,-0.1258
625,-0.1258
626,-0.1258
627,-0.1258
628,-0.1258
629,-0.1258
630,-0.1258
631,-0.1258
632,-0.1258
633,-0.1258
634,-0.1258
635,-0.1258
636,-0.1258
637,-0.1258
638,-0.1258
639,-0.1258
640,-0.1258
641,-0.1258
642,-0.1258
643,-0.1258
644,-0.1258
645,-0.1258
646,-0.1258
647,-0.1258
648,-0.1258
649,-0.1258
650,-0.1258
651,-0.1258
652,-0.1258
653,-0.1258
654,-0.1258
655,-0.1258
656,-0.1258
657,-0.1258
658,-0.1258
659,-0.1258
660,-0.1258
661,-0.1258
662,-0.1258
663,-0.1258
664,-0.1258
665,-0.1258
666,-0.1258
667,-0.1258
668,-0.1258
669,-0.1258
670,-0.1258
671,-0.1258
672,-0.1258
673,-0.1258
674,-0.1258
675,-0.1258
676,-0.1258
677,-0.1258
678,-0.1258
679,-0.1258
680,-0.1258
681,-0.1258
682,-0.1258
683,-0.1258
684,-0.1258
685,-0.1258
686,-0.1258
687,-0.1258
688,-0.1258
689,-0.1258
690,-0.1258
691,-0.1258
692,-0.1258
693,-0.1258
694,-0.1258
695,-0.1258
696,-0.1258
697,-0.1258
698,-0.1258
699,-0.1258
700,-0.1258
701,-0.1258
702,-0.1258
703,-0.1258
704,-0.1258
705,-0.1258
706,-0.1258
707,-0.1258
708,-0.1258
709,-0.1258
710,-0.1258
711,-0.1258
712,-0.1258
713,-0.1258
714,-0.1258
715,-0.1258
716,-0.1258
717,-0.1258
718,-0.1258
719,-0.1258
