time,value
0,-0.75653
1,-0.70873
2,-0.5828800000000001
3,-0.32882
4,-0.025976999999999997
5,0.25599
6,0.5714899999999999
7,0.90123
8,1.1471
9,1.3938
10,1.4129
11,1.4069999999999998
12,1.4358
13,1.4778
14,1.5053
15,1.3768
16,1.1215
17,0.81788
18,0.50284
19,0.19004000000000001
20,-0.10839000000000001
21,-0.40226
22,-0.67211
23,-0.7770600000000001
24,-0.75866
25,-0.63295
26,-0.43928999999999996
27,-0.20528000000000002
28,0.071378
29,0.34823000000000004
30,0.65422
31,0.94432
32,1.2149
33,1.4331
34,1.5133
35,1.4051
36,1.3765
37,1.3415
38,1.4115
39,1.4665
40,1.5591
41,1.5578
42,1.4148
43,1.0733
44,0.7478600000000001
45,0.41681999999999997
46,0.11091
47,-0.19303
48,-0.45178
49,-0.67878
50,-0.34444
51,-0.4545
52,-0.61329
53,-0.79809
54,-0.98464
55,-1.1958
56,-1.3623
57,-1.4662
58,-1.3907
59,-1.2402
60,-1.0861
61,-0.9374
62,-0.76512
63,-0.61762
64,-0.46393
65,-0.38771
66,-0.49436
67,-0.6806399999999999
68,-0.87072
69,-1.0554
70,-1.2009
71,-1.3202
72,-1.3995
73,-1.3693
74,-1.2748
75,-1.1325
76,-0.99905
77,-0.8203600000000001
78,-0.65654
79,-0.4737
