time,value
0,0.38906
1,0.035348000000000004
2,0.35661
3,-0.0067320999999999995
4,0.23515999999999998
5,-0.09128
6,-0.51064
7,0.27023
8,0.42744
9,-0.33326
10,-1.6156
11,-1.6156
12,-1.6156
13,-1.6156
14,-1.6156
15,-1.6156
16,-1.6156
17,-1.6156
18,-1.6156
19,1.639
20,1.639
21,1.639
22,1.639
23,1.639
24,1.639
25,1.639
26,1.639
27,-0.22626999999999997
28,0.15353
29,0.5130100000000001
30,-0.018305000000000002
31,0.36738000000000004
32,0.68893
33,-0.14979
34,0.045211
35,0.11715999999999999
36,-0.32598
37,0.12655999999999998
38,-0.39157
39,0.46543
40,0.51469
41,-0.27041
42,0.028794999999999998
43,0.41317
44,0.18153
45,0.33781
46,-0.18139
47,0.038105
48,0.49311000000000005
49,-0.26709
50,0.37637
51,0.67348
52,-0.17537
53,-1.6156
54,-1.6156
55,-1.6156
56,-1.6156
57,-1.6156
58,-1.6156
59,-1.6156
60,-1.6156
61,-1.6156
62,-1.6156
63,-1.6156
64,-1.6156
65,-1.6156
66,-1.6156
67,1.639
68,1.639
69,1.639
70,1.639
71,1.639
72,1.639
73,1.639
74,1.639
75,1.639
76,1.639
77,1.639
78,1.639
79,1.639
80,-0.51084
81,0.026935
82,0.025996
83,-0.3964
84,0.64693
85,0.52746
86,-0.051258000000000005
87,-0.12037
88,0.17765999999999998
89,0.23092
90,0.057896
91,-0.77076
92,-0.011761
93,-0.35014
94,-0.025566
95,-0.40673000000000004
96,0.18243
97,0.13289
98,0.85305
99,-0.23565
100,-0.41545
101,0.2985
102,-0.009247799999999999
103,0.22521999999999998
104,-0.5486300000000001
105,-0.44826000000000005
106,-0.29571
107,0.14432999999999999
108,-0.32961
109,-0.3861
110,-0.42477
111,-0.06250599999999999
112,-0.024425
113,0.21201
114,-0.26183
115,0.31743000000000005
116,0.61712
117,0.29118
118,-0.65204
119,-0.24103000000000002
120,-0.21925999999999998
121,-0.10851
122,0.31505
123,-0.44393999999999995
124,0.16426
125,0.59138
126,0.43842
127,-0.28600000000000003
