time,value
0,0.067197
1,0.58787
2,0.4223
3,0.1994
4,0.69599
5,-0.067165
6,-0.060863
7,0.157
8,0.063262
9,0.41875
10,-0.12612
11,-0.11154000000000001
12,-0.36703
13,-0.43318
14,-0.05064
15,-0.7288100000000001
16,0.17294
17,-0.11717000000000001
18,0.024819
19,0.26066
20,-0.14479
21,0.24100000000000002
22,0.007798899999999999
23,-0.042954
24,-0.14346
25,-0.51859
26,0.035315
27,-0.47596000000000005
28,-0.019355
29,0.48105
30,0.070337
31,0.032063999999999995
32,0.14048
33,0.13945
34,0.098996
35,-0.14535
36,0.25522
37,0.35838000000000003
38,-0.70333
39,0.35424
40,-0.22300999999999999
41,-0.16943
42,0.50879
43,0.28044
44,-1.6559
45,-1.6559
46,-1.6559
47,-1.6559
48,-1.6559
49,-1.6559
50,-1.6559
51,-1.6559
52,-1.6559
53,-1.6559
54,-1.6559
55,-1.6559
56,1.7257
57,1.7257
58,1.7257
59,1.7257
60,1.7257
61,1.7257
62,1.7257
63,1.7257
64,1.7257
65,1.7257
66,1.7257
67,-0.8936200000000001
68,-0.079523
69,0.42385
70,-0.029137
71,0.048805
72,-0.72278
73,1.7257
74,1.7257
75,1.7257
76,1.7257
77,1.7257
78,1.7257
79,1.7257
80,1.7257
81,1.7257
82,-1.6559
83,-1.6559
84,-1.6559
85,-1.6559
86,-1.6559
87,-1.6559
88,-1.6559
89,-1.6559
90,-1.6559
91,0.4551
92,-0.098036
93,0.10822000000000001
94,0.016902
95,-0.6603899999999999
96,0.43083999999999995
97,0.0046143
98,-0.39584
99,-0.13951
100,-0.54652
101,-0.36529
102,-0.11032
103,-0.5423600000000001
104,-0.20164
105,-0.13347
106,-0.031839
107,0.47408
108,-0.25011
109,0.20838
110,0.12163
111,0.28924
112,-0.37599
113,0.63866
114,0.40697
115,-0.17901
116,-0.19329000000000002
117,0.38733
118,0.41551000000000005
119,0.58295
120,-0.018882
121,-0.092012
122,-0.23376
123,-0.14288
124,-0.09079
125,0.35447
126,-0.13610999999999998
127,0.1302
