time,value
0,-1.52
1,-1.52
2,-1.52
3,-1.52
4,-1.52
5,-1.52
6,-1.52
7,-1.52
8,-1.52
9,-1.52
10,-1.52
11,-1.52
12,-1.52
13,-1.52
14,-1.52
15,-1.52
16,-1.52
17,-1.52
18,-1.52
19,-1.52
20,-1.52
21,-1.52
22,-1.52
23,-1.52
24,-1.52
25,-1.52
26,-1.52
27,-1.52
28,-1.52
29,-1.52
30,-1.52
31,-1.52
32,-1.52
33,-1.52
34,-1.52
35,-1.52
36,-1.52
37,-1.52
38,-1.52
39,-1.52
40,-1.52
41,-1.52
42,-1.52
43,-1.52
44,-1.52
45,-1.52
46,-1.52
47,-1.52
48,-1.52
49,-1.52
50,-1.52
51,-1.52
52,-1.52
53,-1.52
54,-1.52
55,-1.52
56,-1.52
57,-1.52
58,-1.4417
59,-1.3125
60,-1.0007
61,-0.32656999999999997
62,-0.7569899999999999
63,-0.68565
64,-0.46981000000000006
65,-0.44942
66,-0.56418
67,-0.41623000000000004
68,-0.081163
69,-0.14595
70,-0.29527
71,-0.051502
72,-0.17059000000000002
73,-0.10672000000000001
74,-0.2437
75,-0.16147999999999998
76,-0.16489
77,-0.16105999999999998
78,-0.2437
79,-0.14662
80,-0.28113
81,-0.1868
82,0.21279
83,-0.18408
84,-0.0463
85,-0.19239
86,-0.2109
87,-0.10567
88,-0.35333000000000003
89,-0.30322
90,-0.36046999999999996
91,-0.082577
92,0.051166
93,-0.32502
94,-0.20776
95,-0.16739
96,-0.22851999999999997
97,-0.53951
98,0.12689
99,-0.2835
100,-0.17190999999999998
101,0.058357000000000006
102,-0.28505
103,-0.42668999999999996
104,-0.54615
105,-0.19383
106,0.076278
107,-0.10753
108,-0.46562
109,-0.38549
110,-0.47201000000000004
111,-0.19526
112,-0.10942
113,-0.2957
114,0.10527
115,-0.36044
116,-0.30711
117,-0.29166
118,-0.32776
119,0.016656999999999998
120,0.11235
121,-0.2684
122,-0.32079
123,0.014457
124,0.19139
125,-0.33569
126,0.35148
127,-0.12514
128,0.18202000000000002
129,0.29294000000000003
130,-0.006312300000000001
131,-0.32886
132,-0.38692
133,0.044951
134,-0.040092
135,0.23163000000000003
136,-0.10452
137,-0.01099
138,-0.18934
139,-0.43015
140,-0.035573
141,-0.14622000000000002
142,0.045938
143,-0.14695999999999998
144,-0.060386
145,-0.030105
146,0.093284
147,-0.12178
148,-0.046879000000000004
149,-0.34194
150,-0.08051699999999999
151,-0.06086799999999999
152,-0.3531
153,0.056802
154,-0.30549
155,-0.18966
156,-0.23819
157,-0.5153399999999999
158,-0.1256
159,-0.26297
160,0.20189000000000001
161,-0.15509
162,-0.017647
163,-0.17962999999999998
164,0.31058
165,0.1887
166,0.60143
167,0.0041728
168,0.24949000000000002
169,-0.021999
170,-0.071742
171,0.0036201999999999996
172,0.074617
173,0.11044000000000001
174,0.0453
175,-0.093813
176,-0.26574000000000003
177,-0.14785
178,-0.12383
179,-0.27159
180,-0.26171
181,-0.044497
182,0.11857999999999999
183,0.15738
184,-0.14826
185,0.3679
186,-0.10037
187,0.13351
188,-0.15133
189,0.41573000000000004
190,-0.59513
191,0.23199
192,0.33461
193,0.019726
194,-0.07990499999999999
195,0.8802200000000001
196,-0.3133
197,0.29758
198,0.25088
199,0.60568
200,0.33885
201,0.20348
202,0.10407000000000001
203,-0.29148
204,0.27224
205,0.078687
206,-0.023909
207,-0.11137000000000001
208,-0.097194
209,0.45561999999999997
210,0.7017
211,0.5682
212,0.16591
213,0.68071
214,0.38608000000000003
215,0.60592
216,0.8382700000000001
217,0.42935
218,0.3833
219,0.31506
220,0.61946
221,0.60954
222,0.58465
223,0.45638
224,0.25701
225,0.75447
226,0.77474
227,-0.12283
228,0.81123
229,0.50665
230,0.5258
231,0.74822
232,0.33428
233,0.28118000000000004
234,-0.090401
235,0.38906
236,0.89018
237,0.6215
238,0.8203799999999999
239,0.53964
240,0.8085100000000001
241,0.61061
242,0.59606
243,0.51341
244,0.43235
245,0.54079
246,1.0731
247,1.3322
248,0.99172
249,1.1113
250,1.078
251,0.55505
252,0.77054
253,0.85329
254,0.67692
255,0.42987
256,1.4974
257,0.8153199999999999
258,1.3272
259,0.4244
260,0.61524
261,0.57689
262,0.7972600000000001
263,0.38587
264,0.30873
265,1.0455
266,0.74274
267,1.0314
268,0.62187
269,0.78247
270,1.3263
271,1.2101
272,0.28742
273,0.7158800000000001
274,0.70255
275,0.48956000000000005
276,1.4848
277,1.46
278,1.6737
279,1.1935
280,1.1342
281,1.4392
282,1.4862
283,1.7805
284,1.3437
285,1.8855
286,1.6187
287,1.7444
288,1.38
289,1.2865
290,1.1420000000000001
291,1.4025
292,1.5249
293,1.9838
294,2.2444
295,2.5998
296,3.0063
297,0.96011
298,3.455
299,1.9269999999999998
300,1.7613
301,1.6966
302,2.1702
303,1.9715
304,1.6946
305,1.3841
306,2.1088
307,2.6834
308,2.3769
309,1.5126
310,0.9045700000000001
311,0.593
312,1.4726
313,1.7458
314,1.5438
315,0.38249
316,-1.1694
317,-1.52
318,-1.52
