time,value
0,-0.78601
1,1.2905
2,3.5246
3,4.7805
4,4.4631
5,2.9253
6,1.1868
7,0.19801
8,0.23303000000000001
9,0.84436
10,1.3433
11,1.3651
12,1.0598
13,0.82385
14,0.88328
15,1.1066
16,1.1718
17,0.8910799999999999
18,0.38044
19,-0.057408
20,-0.1975
21,-0.059329999999999994
22,0.14753
23,0.22005999999999998
24,0.11508
25,-0.057086000000000005
26,-0.1555
27,-0.12114000000000001
28,0.004435499999999999
29,0.14165999999999998
30,0.24054
31,0.29485
32,0.31499
33,0.30541999999999997
34,0.26847
35,0.21821999999999997
36,0.19637000000000002
37,0.22133000000000003
38,0.27495
39,0.31246
40,0.28644000000000003
41,0.18577
42,0.052735000000000004
43,-0.051816999999999995
44,-0.093238
45,-0.08436
46,-0.077961
47,-0.12412999999999999
48,-0.22698000000000002
49,-0.34742
50,-0.43549
51,-0.46486000000000005
52,-0.44986000000000004
53,-0.42986
54,-0.43463999999999997
55,-0.46476999999999996
56,-0.49876000000000004
57,-0.51367
58,-0.50457
59,-0.48776
60,-0.48378999999999994
61,-0.50031
62,-0.52951
63,-0.55483
64,-0.5621
65,-0.5512
66,-0.53257
67,-0.5172399999999999
68,-0.51489
69,-0.52895
70,-0.55296
71,-0.57895
72,-0.60065
73,-0.61329
74,-0.61948
75,-0.62603
76,-0.6368
77,-0.65232
78,-0.66996
79,-0.6838
80,-0.68981
81,-0.68806
82,-0.68098
83,-0.6731600000000001
84,-0.67075
85,-0.67789
86,-0.69416
87,-0.71406
88,-0.7285699999999999
89,-0.73131
90,-0.72542
91,-0.7227600000000001
92,-0.7354
93,-0.7653800000000001
94,-0.79847
95,-0.80993
96,-0.78156
97,-0.71568
98,-0.63571
