time,value
0,0.49403
1,-0.036104000000000004
2,-0.40936
3,-0.91059
4,-0.026554
5,0.13392
6,0.12745
7,0.5969399999999999
8,0.22689
9,0.0051941
10,-0.18417999999999998
11,-0.15192
12,0.24659
13,-0.32716
14,0.52091
15,0.4606
16,0.086191
17,-0.46993
18,0.013493999999999999
19,0.58882
20,0.036856
21,-0.21505
22,-0.44536000000000003
23,0.43288000000000004
24,-0.23524
25,-0.26934
26,-0.5895
27,-0.010262
28,0.63389
29,0.070874
30,0.30729
31,0.4168
32,-0.042124
33,-0.12378
34,-1.5274
35,-1.5274
36,-1.5274
37,-1.5274
38,-1.5274
39,-1.5274
40,-1.5274
41,-1.5274
42,-1.5274
43,-1.5274
44,-1.5274
45,1.5362
46,1.5362
47,1.5362
48,1.5362
49,1.5362
50,1.5362
51,1.5362
52,1.5362
53,1.5362
54,1.5362
55,0.020155000000000003
56,0.54643
57,0.26164
58,0.73843
59,0.34526999999999997
60,-0.022722
61,-1.5274
62,-1.5274
63,-1.5274
64,-1.5274
65,-1.5274
66,-1.5274
67,-1.5274
68,-1.5274
69,-1.5274
70,-1.5274
71,-1.5274
72,-1.5274
73,-1.5274
74,-1.5274
75,-1.5274
76,1.5362
77,1.5362
78,1.5362
79,1.5362
80,1.5362
81,1.5362
82,1.5362
83,1.5362
84,1.5362
85,1.5362
86,1.5362
87,1.5362
88,1.5362
89,1.5362
90,2.8936e-05
91,0.0022444
92,-0.19605
93,-0.73688
94,0.8591799999999999
95,0.23306999999999997
96,-0.31163
97,0.16291
98,-0.10495
99,0.41748
100,-0.057544000000000005
101,-0.02019
102,0.1695
103,-0.18524000000000002
104,0.37135
105,-0.24568
106,0.030056
107,0.32368
108,-0.49318
109,-0.08594299999999999
110,0.010522
111,-0.22394
112,0.066828
113,-0.092681
114,-0.43016000000000004
115,-0.054486
116,-0.563
117,-0.18595
118,0.36394
119,0.068
120,0.34006
121,-0.044621
122,0.38394
123,0.3377
124,0.67757
125,-0.28315
126,-0.34224
127,-0.15937
