time,value
0,0.21072
1,0.44633
2,0.18398
3,-0.21661999999999998
4,0.5541
5,-0.18332
6,0.8226899999999999
7,0.032122000000000005
8,-0.086099
9,0.5532
10,0.29284
11,-0.38523
12,0.42639
13,0.3321
14,-0.0062188
15,0.14077
16,-0.6098
17,-0.27805
18,-0.28101
19,0.042088
20,-0.00012698
21,0.13005999999999998
22,-0.17115999999999998
23,-0.081252
24,-0.061713
25,0.42636999999999997
26,0.54283
27,-0.45608000000000004
28,-0.41821
29,0.32391
30,0.097624
31,-0.28913
32,0.22995
33,0.17148
34,-0.57967
35,-0.81477
36,0.79318
37,0.2381
38,0.3999
39,-0.30989
40,-0.71119
41,-0.08044
42,-0.19554000000000002
43,0.29461
44,-0.4319
45,-0.13166
46,0.090705
47,-0.018042
48,-0.271
49,-0.17879
50,0.33484
51,0.24914
52,-0.38679
53,-0.16242
54,-0.38499
55,-0.55613
56,0.077753
57,0.38006
58,0.081023
59,0.18512
60,0.12618
61,-0.18314
62,0.13392
63,-0.016354
64,-0.06794
65,-0.056192
66,0.32857
67,0.61258
68,-1.5969
69,-1.5969
70,-1.5969
71,-1.5969
72,-1.5969
73,-1.5969
74,-1.5969
75,-1.5969
76,-1.5969
77,-1.5969
78,-1.5969
79,1.5867
80,1.5867
81,1.5867
82,1.5867
83,1.5867
84,1.5867
85,1.5867
86,1.5867
87,1.5867
88,1.5867
89,1.5867
90,-0.2738
91,0.17581
92,-1.5969
93,-1.5969
94,-1.5969
95,-1.5969
96,-1.5969
97,-1.5969
98,-1.5969
99,-1.5969
100,-1.5969
101,-1.5969
102,-1.5969
103,-1.5969
104,1.5867
105,1.5867
106,1.5867
107,1.5867
108,1.5867
109,1.5867
110,1.5867
111,1.5867
112,1.5867
113,1.5867
114,1.5867
115,1.5867
116,-0.7779699999999999
117,0.041794
118,-0.21335
119,0.29991999999999996
120,-0.13524
121,0.40838
122,-0.65586
123,0.35909
124,0.47898
125,-0.36917
126,-0.31623
127,-0.011731
