time,value
0,-0.45072
1,-0.45072
2,-0.45072
3,-0.45072
4,-0.45072
5,1.1323
6,2.7153
7,2.7153
8,2.3195
9,2.3195
10,1.1323
11,-0.45072
12,-0.45072
13,-0.45072
14,-0.45072
15,-0.45072
16,-0.45072
17,-0.45072
18,-0.45072
19,-0.45072
20,-0.45072
21,-0.45072
22,-0.45072
23,-0.45072
24,-0.45072
25,-0.45072
26,-0.45072
27,-0.45072
28,-0.45072
29,-0.45072
30,-0.45072
31,-0.45072
32,-0.45072
33,-0.45072
34,-0.45072
35,-0.45072
36,-0.45072
37,-0.45072
38,0.076951
39,2.3195
40,2.7153
41,2.3195
42,2.7153
43,1.9238
44,-0.18688
45,-0.45072
46,-0.45072
47,-0.45072
48,-0.45072
49,-0.45072
50,-0.45072
51,-0.45072
52,-0.45072
53,-0.45072
54,-0.45072
55,-0.45072
56,-0.45072
57,-0.45072
58,-0.45072
59,-0.45072
60,-0.45072
61,-0.45072
62,-0.45072
63,-0.45072
64,-0.45072
65,-0.45072
66,-0.45072
67,-0.45072
68,-0.45072
69,-0.45072
70,-0.45072
71,1.528
72,2.7153
73,2.3195
74,2.7153
75,2.3195
76,1.1323
77,-0.45072
78,-0.45072
79,-0.45072
80,-0.45072
81,-0.45072
82,-0.45072
83,-0.45072
84,-0.45072
85,-0.45072
86,-0.45072
87,-0.45072
88,-0.45072
89,-0.45072
90,-0.45072
91,-0.45072
92,-0.45072
93,-0.45072
94,-0.45072
95,-0.45072
96,-0.45072
97,-0.45072
98,-0.45072
99,-0.45072
100,-0.45072
101,-0.45072
102,-0.45072
103,-0.054965
104,2.3195
105,2.7153
106,2.3195
107,2.7153
108,1.9238
109,-0.3188
110,-0.45072
111,-0.45072
112,-0.45072
113,-0.45072
114,-0.45072
115,-0.45072
116,-0.45072
117,-0.45072
118,-0.45072
119,-0.45072
120,-0.45072
121,-0.45072
122,-0.45072
123,-0.45072
124,-0.45072
125,-0.45072
126,-0.45072
127,-0.45072
128,-0.45072
129,-0.45072
130,-0.45072
131,-0.45072
132,-0.45072
133,-0.45072
134,-0.45072
135,-0.45072
136,0.6046199999999999
137,2.7153
138,2.3195
139,2.3195
140,2.7153
141,1.528
142,-0.3188
143,-0.45072
144,-0.45072
145,-0.45072
146,-0.45072
147,-0.45072
148,-0.45072
149,-0.45072
150,-0.45072
151,-0.45072
152,-0.45072
153,-0.45072
154,-0.45072
155,-0.45072
156,-0.45072
157,-0.45072
158,-0.45072
159,-0.45072
160,-0.45072
161,-0.45072
162,-0.45072
163,-0.45072
164,-0.45072
165,-0.45072
166,-0.45072
167,-0.45072
168,-0.45072
169,2.3195
170,2.7153
171,2.3195
172,2.3195
173,2.3195
174,0.076951
175,-0.45072
176,-0.45072
177,-0.45072
178,-0.45072
179,-0.45072
180,-0.45072
181,-0.45072
182,-0.45072
183,-0.45072
184,-0.45072
185,-0.45072
186,-0.45072
187,-0.45072
188,-0.45072
189,-0.45072
190,-0.45072
191,-0.45072
192,-0.45072
193,-0.45072
194,-0.45072
195,-0.45072
196,-0.45072
197,-0.45072
198,-0.45072
199,-0.45072
200,-0.45072
201,0.86845
202,2.7153
203,2.3195
204,2.3195
205,2.3195
206,1.1323
207,-0.18688
208,-0.45072
209,-0.45072
210,-0.45072
211,-0.45072
212,-0.45072
213,-0.45072
214,-0.45072
215,-0.45072
216,-0.45072
217,-0.45072
218,-0.45072
219,-0.45072
220,-0.45072
221,-0.45072
222,-0.45072
223,-0.45072
224,-0.45072
225,-0.45072
226,-0.45072
227,-0.45072
228,-0.45072
229,-0.45072
230,-0.45072
231,-0.45072
232,-0.45072
233,-0.45072
234,1.1323
235,2.7153
236,2.3195
237,2.3195
238,2.3195
239,0.86845
240,-0.3188
241,-0.45072
242,-0.45072
243,-0.45072
244,-0.45072
245,-0.45072
246,-0.45072
247,-0.45072
248,-0.45072
249,-0.45072
250,-0.45072
251,-0.45072
252,-0.45072
253,-0.45072
254,-0.45072
255,-0.45072
256,-0.45072
257,-0.45072
258,-0.45072
259,-0.45072
260,-0.45072
261,-0.45072
262,-0.45072
263,-0.45072
264,-0.45072
265,-0.45072
266,-0.45072
267,-0.45072
268,0.86845
269,2.3195
270,2.7153
271,2.3195
272,2.3195
273,0.86845
274,-0.45072
275,-0.45072
276,-0.45072
277,-0.45072
278,-0.45072
279,-0.45072
280,-0.45072
281,-0.45072
282,-0.45072
283,-0.45072
284,-0.45072
285,-0.45072
286,-0.45072
287,-0.45072
288,-0.45072
289,-0.45072
290,-0.45072
291,-0.45072
292,-0.45072
293,-0.45072
294,-0.45072
295,-0.45072
296,-0.45072
297,-0.45072
298,-0.45072
299,-0.45072
300,-0.45072
301,-0.45072
302,1.528
303,2.3195
304,2.7153
305,2.3195
306,2.3195
307,0.86845
308,-0.45072
309,-0.45072
310,-0.45072
311,-0.45072
312,-0.45072
313,-0.45072
314,-0.45072
315,-0.45072
316,-0.45072
317,-0.45072
318,-0.45072
319,-0.45072
320,-0.45072
321,-0.45072
322,-0.45072
323,-0.45072
324,-0.45072
325,-0.45072
326,-0.45072
327,-0.45072
328,-0.45072
329,-0.45072
330,-0.45072
331,-0.45072
332,-0.45072
333,-0.45072
334,-0.45072
335,-0.45072
336,2.3195
337,2.3195
338,2.7153
339,2.3195
340,2.3195
341,0.34079
342,-0.45072
343,-0.45072
344,-0.45072
345,-0.45072
346,-0.45072
347,-0.45072
348,-0.45072
349,-0.45072
350,-0.45072
351,-0.45072
352,-0.45072
353,-0.45072
354,-0.45072
355,-0.45072
356,-0.45072
357,-0.45072
358,-0.45072
359,-0.45072
360,-0.45072
361,-0.45072
362,-0.45072
363,-0.45072
364,-0.45072
365,-0.45072
366,-0.45072
367,-0.45072
368,-0.45072
369,0.34079
370,2.3195
371,2.7153
372,2.3195
373,2.3195
374,1.528
375,-0.18688
376,-0.45072
377,-0.45072
378,-0.45072
379,-0.45072
380,-0.45072
381,-0.45072
382,-0.45072
383,-0.45072
384,-0.45072
385,-0.45072
386,-0.45072
387,-0.45072
388,-0.45072
389,-0.45072
390,-0.45072
391,-0.45072
392,-0.45072
393,-0.45072
394,-0.45072
395,-0.45072
396,-0.45072
397,-0.45072
398,-0.45072
399,-0.45072
400,0.86845
401,2.7153
402,2.3195
403,2.3195
404,2.3195
405,1.528
406,-0.3188
407,-0.45072
408,-0.45072
409,-0.45072
410,-0.45072
411,-0.45072
412,-0.45072
413,-0.45072
414,-0.45072
415,-0.45072
416,-0.45072
417,-0.45072
418,-0.45072
419,-0.45072
420,-0.45072
421,-0.45072
422,-0.45072
423,-0.45072
424,-0.45072
425,-0.45072
426,-0.45072
427,-0.45072
428,-0.45072
429,-0.45072
430,-0.45072
431,-0.45072
432,1.528
433,2.7153
434,2.3195
435,2.3195
436,2.3195
437,0.6046199999999999
438,-0.3188
439,-0.45072
440,-0.45072
441,-0.45072
442,-0.45072
443,-0.45072
444,-0.45072
445,-0.45072
446,-0.45072
447,-0.45072
448,-0.45072
449,-0.45072
450,-0.45072
451,-0.45072
452,-0.45072
453,-0.45072
454,-0.45072
455,-0.45072
456,-0.45072
457,-0.45072
458,-0.45072
459,-0.45072
460,-0.45072
461,-0.45072
462,-0.45072
463,-0.45072
464,1.528
465,2.3195
466,2.7153
467,2.3195
468,2.3195
469,0.6046199999999999
470,-0.3188
471,-0.45072
472,-0.45072
473,-0.45072
474,-0.45072
475,-0.45072
476,-0.45072
477,-0.45072
478,-0.45072
479,-0.45072
480,-0.45072
481,-0.45072
482,-0.45072
483,-0.45072
484,-0.45072
485,-0.45072
486,-0.45072
487,-0.45072
488,-0.45072
489,-0.45072
490,-0.45072
491,-0.45072
492,-0.45072
493,-0.45072
494,-0.45072
495,-0.45072
496,0.34079
497,2.7153
498,2.3195
499,2.3195
500,2.3195
501,1.528
502,-0.18688
503,-0.45072
504,-0.45072
505,-0.45072
506,-0.45072
507,-0.45072
508,-0.45072
509,-0.45072
510,-0.45072
511,-0.45072
512,-0.45072
513,-0.45072
514,-0.45072
515,-0.45072
516,-0.45072
517,-0.45072
518,-0.45072
519,-0.45072
520,-0.45072
521,-0.45072
522,-0.45072
523,-0.45072
524,-0.45072
525,-0.45072
526,-0.45072
527,-0.45072
528,-0.45072
529,3.2430000000000003
530,2.3195
531,2.3195
532,2.3195
533,2.3195
534,-0.3188
535,-0.45072
536,-0.45072
537,-0.45072
538,-0.45072
539,-0.45072
540,-0.45072
541,-0.45072
542,-0.45072
543,-0.45072
544,-0.45072
545,-0.45072
546,-0.45072
547,-0.45072
548,-0.45072
549,-0.45072
550,-0.45072
551,-0.45072
552,-0.45072
553,-0.45072
554,-0.45072
555,-0.45072
556,-0.45072
557,-0.45072
558,-0.45072
559,-0.45072
560,-0.45072
561,0.076951
562,2.7153
563,2.3195
564,2.7153
565,2.3195
566,1.528
567,-0.18688
568,-0.45072
569,-0.45072
570,-0.45072
571,-0.45072
572,-0.45072
573,-0.45072
574,-0.45072
575,-0.45072
576,-0.45072
577,-0.45072
578,-0.45072
579,-0.45072
580,-0.45072
581,-0.45072
582,-0.45072
583,-0.45072
584,-0.45072
585,-0.45072
586,-0.45072
587,-0.45072
588,-0.45072
589,-0.45072
590,-0.45072
591,-0.45072
592,-0.45072
593,-0.45072
594,0.34079
595,2.7153
596,2.3195
597,2.3195
598,2.3195
599,1.9238
600,-0.45072
601,-0.45072
602,-0.45072
603,-0.45072
604,-0.45072
605,-0.45072
606,-0.45072
607,-0.45072
608,-0.45072
609,-0.45072
610,-0.45072
611,-0.45072
612,-0.45072
613,-0.45072
614,-0.45072
615,-0.45072
616,-0.45072
617,-0.45072
618,-0.45072
619,-0.45072
620,-0.45072
621,-0.45072
622,-0.45072
623,-0.45072
624,-0.45072
625,-0.45072
626,-0.45072
627,1.1323
628,2.3195
629,2.7153
630,2.3195
631,2.3195
632,1.1323
633,-0.45072
634,-0.45072
635,-0.45072
636,-0.45072
637,-0.45072
638,-0.45072
639,-0.45072
640,-0.45072
641,-0.45072
642,-0.45072
643,-0.45072
644,-0.45072
645,-0.45072
646,-0.45072
647,-0.45072
648,-0.45072
649,-0.45072
650,-0.45072
651,-0.45072
652,-0.45072
653,-0.45072
654,-0.45072
655,-0.45072
656,-0.45072
657,-0.45072
658,-0.45072
659,-0.45072
660,1.528
661,2.7153
662,2.3195
663,2.3195
664,2.3195
665,0.6046199999999999
666,-0.3188
667,-0.45072
668,-0.45072
669,-0.45072
670,-0.45072
671,-0.45072
672,-0.45072
673,-0.45072
674,-0.45072
675,-0.45072
676,-0.45072
677,-0.45072
678,-0.45072
679,-0.45072
680,-0.45072
681,-0.45072
682,-0.45072
683,-0.45072
684,-0.45072
685,-0.45072
686,-0.45072
687,-0.45072
688,-0.45072
689,-0.45072
690,-0.45072
691,-0.45072
692,-0.45072
693,1.1323
694,2.3195
695,2.7153
696,2.3195
697,2.3195
698,1.1323
699,-0.45072
700,-0.45072
701,-0.45072
702,-0.45072
703,-0.45072
704,-0.45072
705,-0.45072
706,-0.45072
707,-0.45072
708,-0.45072
709,-0.45072
710,-0.45072
711,-0.45072
712,-0.45072
713,-0.45072
714,-0.45072
715,-0.45072
716,-0.45072
717,-0.45072
718,-0.45072
719,-0.45072
