time,value
0,0.27836
1,0.27836
2,0.27836
3,0.27836
4,0.27836
5,0.27836
6,0.27836
7,0.27836
8,0.27836
9,0.27836
10,0.27836
11,0.27836
12,0.27836
13,0.27836
14,0.27836
15,0.27836
16,0.27836
17,0.27836
18,0.27836
19,0.27836
20,0.27836
21,0.27836
22,0.27836
23,0.27836
24,0.27836
25,0.27836
26,0.27836
27,0.27836
28,0.27836
29,0.27836
30,0.27836
31,0.27836
32,0.27836
33,0.27836
34,0.27836
35,0.27836
36,0.27836
37,0.27898
38,0.28945
39,0.32653000000000004
40,0.46265
41,0.5987600000000001
42,0.73488
43,0.8384799999999999
44,0.9117700000000001
45,0.9359200000000001
46,0.9359200000000001
47,0.9359200000000001
48,0.9359200000000001
49,0.9359200000000001
50,0.9359200000000001
51,0.9359200000000001
52,0.92705
53,0.89564
54,0.81865
55,0.68253
56,0.5464100000000001
57,0.41029
58,0.33626
59,0.28391
60,0.27836
61,0.27836
62,0.27836
63,0.25114000000000003
64,0.11502000000000001
65,-0.021098
66,-0.15722
67,-0.26685
68,-0.35061
69,-0.37919
70,-0.37919
71,-0.37919
72,-0.37919
73,-0.27818000000000004
74,-0.16978
75,-0.033662
76,0.091123
77,0.18536
78,0.18203
79,0.045913999999999996
80,-0.09020399999999999
81,-0.22632
82,-0.36244
83,-0.49856000000000006
84,-0.63468
85,-0.77079
86,-0.90691
87,-1.0194
88,-1.0299
89,-1.0367
90,-1.0367
91,-1.0367
92,-1.0367
93,-1.0367
94,-1.0367
95,-1.0367
96,-1.0367
97,-1.0367
98,-1.0367
99,-1.0367
100,-1.0367
101,-1.0367
102,-1.0367
103,-1.0367
104,-1.0367
105,-1.0367
106,-1.0367
107,-1.0367
108,-1.0367
109,-1.0367
110,-1.0367
111,-1.0571
112,-1.1723
113,-1.2943
114,-1.4304
115,-1.5514
116,-1.6561
117,-1.6943
118,-1.6943
119,-1.6943
120,-1.6943
121,-1.6943
122,-1.6943
123,-1.6943
124,-1.6943
125,-1.6943
126,-1.6943
127,-1.6943
128,-1.6943
129,-1.6943
130,-1.6943
131,-1.6943
132,-1.6943
133,-1.6943
134,-1.6943
135,-1.6943
136,-1.6943
137,-1.6943
138,-1.6943
139,-1.6844
140,-1.6635
141,-1.5708
142,-1.4346
143,-1.2985
144,-1.1624
145,-1.0944
146,-1.0367
147,-1.0367
148,-1.0367
149,-1.0367
150,-0.9879700000000001
151,-0.8623200000000001
152,-0.73101
153,-0.5948899999999999
154,-0.5169100000000001
155,-0.46456000000000003
156,-0.57185
157,-0.70797
158,-0.84409
159,-0.9658
160,-1.0077
161,-1.0367
162,-1.0367
163,-1.0367
164,-1.0367
165,-1.0367
166,-1.0367
167,-1.0367
168,-1.0367
169,-1.0367
170,-1.0367
171,-1.0367
172,-1.0367
173,-1.0367
174,-1.0367
175,-1.0367
176,-1.0367
177,-1.0367
178,-0.9938799999999999
179,-0.93106
180,-0.69331
181,-0.42108
182,-0.14884
183,0.1234
184,0.39563000000000004
185,0.66787
186,0.94011
187,1.2123
188,1.4846
189,1.5118
190,1.3757
191,1.2396
192,1.1034
193,0.9673299999999999
194,0.83121
195,0.69509
196,0.55897
197,0.42286
198,0.24855
199,0.0077272999999999994
200,-0.24936
201,-0.52159
202,-0.7517
203,-0.96111
204,-0.88597
205,-0.74985
206,-0.61374
207,-0.47762
208,-0.3415
209,-0.20538
210,-0.069263
211,0.066856
212,0.20297
213,0.33909
214,0.47521
215,0.61133
216,0.74745
217,0.8835700000000001
218,1.0197
219,1.1558
220,1.2919
221,1.4280000000000002
222,1.5309
223,1.5728
224,1.5935
225,1.5935
226,1.5935
227,1.5935
228,1.5935
229,1.5935
230,1.5935
231,1.6009
232,1.6637
233,1.7463
234,1.8825
235,2.0186
236,2.1547
237,2.0916
238,1.8822
239,1.6269999999999998
240,1.3547
241,1.1102
242,0.8730899999999999
243,0.73698
244,0.6008600000000001
245,0.46474
246,0.38578
247,0.41718999999999995
248,0.50034
249,0.63646
250,0.77258
251,0.90869
252,1.0448
253,1.1809
254,1.317
255,1.4476
256,1.5314
257,1.5935
258,1.5935
259,1.5935
260,1.5935
261,1.5935
262,1.5935
263,1.5935
264,1.5935
265,1.5935
266,1.5935
267,1.5935
268,1.5935
269,1.5935
270,1.5693
271,1.496
272,1.3924
273,1.2563
274,1.1202
275,0.98408
276,0.9470000000000001
277,0.93653
278,0.9359200000000001
279,0.9319799999999999
280,0.8900899999999999
281,0.8249299999999999
282,0.68881
283,0.55269
284,0.41657
285,0.28046
286,0.14434
287,0.00822
288,-0.1279
289,-0.25501999999999997
290,-0.37919
291,-0.37919
292,-0.37919
293,-0.37919
294,-0.37919
295,-0.37919
296,-0.37919
297,-0.37919
298,-0.37919
299,-0.37919
300,-0.28976
301,-0.17457999999999999
302,-0.039945
303,0.091
304,0.16429000000000002
305,0.18830999999999998
306,0.052197
307,-0.083922
308,-0.22004
309,-0.31083
310,-0.36318
311,-0.37919
312,-0.37919
313,-0.37919
314,-0.37919
