time,value
0,-0.11452999999999999
1,-0.17434000000000002
2,-0.24427
3,-0.30614
4,-0.34469
5,-0.34693
6,-0.3081
7,-0.22938000000000003
8,-0.1171
9,0.022719
10,0.18035
11,0.33923000000000003
12,0.48636999999999997
13,0.6077100000000001
14,0.69225
15,0.72264
16,0.69005
17,0.5874199999999999
18,0.42073999999999995
19,0.20217000000000002
20,-0.054127
21,-0.32109
22,-0.56608
23,-0.7564
24,-0.8723299999999999
25,-0.89895
26,-0.8357
27,-0.69623
28,-0.50169
29,-0.28002
30,-0.056554999999999994
31,0.14752
32,0.31817
33,0.44743
34,0.53523
35,0.5798800000000001
36,0.57806
37,0.5314399999999999
38,0.44465
39,0.3238
40,0.18562
41,0.050862
42,-0.063613
43,-0.13996
44,-0.17146
45,-0.16282
46,-0.12505
47,-0.077314
48,-0.041997
49,-0.030672
50,-0.045121
51,-0.07991000000000001
52,-0.1244
53,-0.16848
54,-0.20182999999999998
55,-0.22346
56,-0.2297
57,-0.22185
58,-0.19993
59,-0.16633
60,-0.12385999999999998
61,-0.071748
62,-0.012747
63,0.048559
64,0.10749
65,0.15928
66,0.19566
67,0.21683000000000002
68,0.22546
69,0.22685
70,0.22454000000000002
71,0.2208
72,0.21731999999999999
73,0.2055
74,0.1835
75,0.14698
76,0.095067
77,0.029738999999999998
78,-0.042689
79,-0.11578
80,-0.18589
81,-0.24877
82,-0.30229
83,-0.3481
84,-0.38306999999999997
85,-0.40083
86,-0.39187
87,-0.35097
88,-0.27435
89,-0.1656
90,-0.035061
91,0.10157999999999999
92,0.22768000000000002
93,0.33313000000000004
94,0.40700000000000003
95,0.44478
96,0.44223
97,0.4028
98,0.32445999999999997
99,0.21133000000000002
100,0.068801
101,-0.089646
102,-0.24600000000000002
103,-0.37617
104,-0.45851000000000003
105,-0.47568999999999995
106,-0.42566000000000004
107,-0.3154
108,-0.16658
109,-0.009919200000000001
110,0.12219000000000001
111,0.20998000000000003
112,0.24764
113,0.24978000000000003
114,0.22805999999999998
115,0.1976
116,0.17464000000000002
117,0.15922
118,0.14535
119,0.11767000000000001
120,0.061992
121,-0.016053
122,-0.11085999999999999
123,-0.20505
124,-0.27871999999999997
125,-0.30949
126,-0.29155
127,-0.2282
128,-0.13325
129,-0.029188
130,0.062199000000000004
131,0.12697
132,0.16278
133,0.17447000000000001
134,0.17006
135,0.15571
136,0.13508
137,0.10794000000000001
138,0.073503
139,0.026655
140,-0.031491000000000005
141,-0.099373
142,-0.1693
143,-0.22801
144,-0.2701
145,-0.28844000000000003
146,-0.28767
147,-0.27523000000000003
148,-0.25536
149,-0.22784000000000001
150,-0.19608
151,-0.15207
152,-0.089911
153,-0.0091441
154,0.087011
155,0.1902
156,0.29298
157,0.38256999999999997
158,0.44836000000000004
159,0.48618999999999996
160,0.49518999999999996
161,0.48327
162,0.45571000000000006
163,0.41673999999999994
164,0.36354000000000003
165,0.28956
166,0.19218
167,0.06604299999999999
168,-0.088821
169,-0.26863000000000004
170,-0.46001000000000003
171,-0.6429600000000001
172,-0.79819
173,-0.9139299999999999
174,-0.97414
175,-0.97064
176,-0.90251
177,-0.77149
178,-0.58127
179,-0.3474
180,-0.085354
181,0.18617999999999998
182,0.44261000000000006
183,0.6654800000000001
184,0.83925
185,0.9532200000000001
186,1.0104
187,1.0174
188,0.9867799999999999
189,0.92335
190,0.83462
191,0.71733
192,0.56362
193,0.36168
194,0.10897000000000001
195,-0.18587
196,-0.5052800000000001
197,-0.81804
198,-1.0911
199,-1.2917
200,-1.3969
201,-1.3987
202,-1.3041
203,-1.1304
204,-0.8976799999999999
205,-0.62756
206,-0.34081
207,-0.049763
208,0.23494
209,0.50632
210,0.76032
211,0.9905299999999999
212,1.1872
213,1.341
214,1.4319
215,1.4509999999999998
216,1.3869999999999998
217,1.2311
218,0.98351
219,0.64799
220,0.24056999999999998
221,-0.21016999999999997
222,-0.67369
223,-1.1062
224,-1.4682
225,-1.7234
226,-1.8508
227,-1.8407
228,-1.7
229,-1.4453
230,-1.1015
231,-0.69535
232,-0.25582
233,0.18519000000000002
234,0.59932
235,0.9644799999999999
236,1.2538
237,1.4469999999999998
238,1.5314
239,1.5035
240,1.3733
241,1.1635
242,0.9016200000000001
243,0.62115
244,0.3483
245,0.10388
246,-0.11197
247,-0.29689
248,-0.4602
249,-0.61098
250,-0.75259
251,-0.8765799999999999
252,-0.97396
253,-1.0379
254,-1.0552
255,-1.0185
256,-0.93106
257,-0.8005
258,-0.63467
259,-0.44045
260,-0.22968000000000002
261,-0.00051064
262,0.23861999999999997
263,0.48035
264,0.71112
265,0.91585
266,1.0753
267,1.1707
268,1.192
269,1.1340000000000001
270,1.0062
271,0.82211
272,0.5941
273,0.33475
274,0.05896799999999999
275,-0.22232
276,-0.50035
277,-0.75774
278,-0.98469
279,-1.1647
280,-1.2779
281,-1.3114
282,-1.2615
283,-1.1258
284,-0.91727
285,-0.65257
286,-0.34531
287,-0.013378999999999999
288,0.32561999999999997
289,0.6562600000000001
290,0.9655600000000001
291,1.232
292,1.4313
293,1.5395
294,1.5419999999999998
295,1.4235
296,1.1929
297,0.8698600000000001
298,0.48768999999999996
299,0.08440299999999999
300,-0.30304000000000003
301,-0.65067
302,-0.94381
303,-1.1797
304,-1.3595
305,-1.4912
306,-1.5729
307,-1.5958
308,-1.5451
309,-1.4012
310,-1.1521
311,-0.80013
312,-0.36104
313,0.13538
314,0.6468
315,1.1259
316,1.5268
317,1.8157
318,1.9719
319,1.9891
320,1.8793
321,1.6663
322,1.3694
323,1.0107
324,0.6106699999999999
325,0.1836
326,-0.25809
327,-0.69857
328,-1.1179
329,-1.4938
330,-1.8022
331,-2.0163
332,-2.1156
333,-2.0882
334,-1.9276
335,-1.6396
336,-1.2407
337,-0.75216
338,-0.19884000000000002
339,0.38647
340,0.96491
341,1.5
342,1.95
343,2.275
344,2.4415
345,2.4279
346,2.2314
347,1.8689
348,1.3642
349,0.7610100000000001
350,0.10869000000000001
351,-0.5413
352,-1.1415
353,-1.6461
354,-2.0182
355,-2.2343
356,-2.2859
357,-2.1714
358,-1.9128
359,-1.5423
360,-1.0964
361,-0.60911
362,-0.12158
363,0.34017
364,0.75179
365,1.0977
366,1.3691
367,1.5563
368,1.6505
369,1.6485
370,1.554
371,1.3755
372,1.1261
373,0.82894
374,0.51163
375,0.1959
376,-0.10257000000000001
377,-0.37266
378,-0.6171800000000001
379,-0.8305
380,-1.0078
381,-1.1472
382,-1.2423
383,-1.2838
384,-1.2657
385,-1.1843
386,-1.0386
387,-0.83778
388,-0.59329
389,-0.31713
390,-0.021056000000000002
391,0.2815
392,0.5748800000000001
393,0.84573
394,1.0796
395,1.2549
396,1.3583
397,1.3765
398,1.3082
399,1.1568
400,0.9378299999999999
401,0.6680699999999999
402,0.36841
403,0.056587
404,-0.25479
405,-0.5555399999999999
406,-0.83583
407,-1.0823
408,-1.2809
409,-1.4125
410,-1.466
411,-1.4324
412,-1.3084
413,-1.0987
414,-0.81491
415,-0.47672
416,-0.10432999999999999
417,0.28321999999999997
418,0.66461
419,1.015
420,1.3166
421,1.5509
422,1.6948
423,1.7364
424,1.6669999999999998
425,1.4828
426,1.1902
427,0.8023
428,0.34225
429,-0.16216
430,-0.6782199999999999
431,-1.165
432,-1.5816
433,-1.8934
434,-2.0676
435,-2.084
436,-1.9368
437,-1.641
438,-1.2219
439,-0.72014
440,-0.17903
441,0.35593
442,0.8419399999999999
443,1.2454
444,1.5475
445,1.7335
446,1.8039
447,1.7596
448,1.6097
449,1.3707
450,1.0615
451,0.70533
452,0.32608000000000004
453,-0.052041
454,-0.40658
455,-0.71438
456,-0.9700700000000001
457,-1.1678
458,-1.3136
459,-1.4087
460,-1.4583
461,-1.4666
462,-1.4280000000000002
463,-1.3302
464,-1.1617
465,-0.90343
466,-0.54808
467,-0.10701
468,0.3992
469,0.9321799999999999
470,1.4387
471,1.8626
472,2.1556
473,2.2845
474,2.2374
475,2.0206
476,1.6576
477,1.1801
478,0.62254
479,0.024273
480,-0.57875
481,-1.1552
482,-1.6673
483,-2.0768
484,-2.3501
485,-2.4594
486,-2.3873
487,-2.1393
488,-1.7358
489,-1.2139
490,-0.62074
491,-0.0087597
492,0.5767100000000001
493,1.0979999999999999
494,1.5292
495,1.8518
496,2.0587
497,2.1464
498,2.1143
499,1.9626
