time,value
0,-0.21453000000000003
1,0.09196499999999999
2,0.10964000000000002
3,-0.10159
4,-0.43404
5,-0.34362
6,-0.11198
7,0.29982
8,-0.31285
9,-0.54567
10,-0.1242
11,0.30335
12,0.085703
13,-0.09349600000000001
14,0.33177
15,0.099398
16,0.35317
17,-0.26571
18,0.20506999999999997
19,0.10023
20,-0.12155999999999999
21,0.5343899999999999
22,-0.9062600000000001
23,-0.33679000000000003
24,-0.23933000000000001
25,0.047793
26,0.25587
27,-0.37945
28,0.24835
29,-0.60721
30,0.12164000000000001
31,-0.047086
32,-0.21520999999999998
33,0.37582
34,-0.28052
35,-0.40803
36,0.1891
37,0.36746999999999996
38,0.16701
39,0.35698
40,0.68112
41,-0.041109
42,0.15563
43,-0.24958000000000002
44,-0.22369
45,0.18646
46,-1.5561
47,-1.5561
48,-1.5561
49,-1.5561
50,-1.5561
51,-1.5561
52,-1.5561
53,-1.5561
54,-1.5561
55,-1.5561
56,-1.5561
57,1.5473
58,1.5473
59,1.5473
60,1.5473
61,1.5473
62,1.5473
63,1.5473
64,1.5473
65,1.5473
66,1.5473
67,-0.035357
68,-0.16706
69,0.20132
70,0.12218
71,0.37761
72,-0.30073
73,0.11886
74,-0.1554
75,-0.20747
76,-0.071716
77,0.20017000000000001
78,0.21048000000000003
79,-0.028189
80,-0.22554000000000002
81,0.080985
82,-0.11967
83,-0.33773000000000003
84,0.032006
85,0.27233
86,0.44442
87,0.7302
88,0.40545
89,1.5473
90,1.5473
91,1.5473
92,1.5473
93,1.5473
94,1.5473
95,1.5473
96,1.5473
97,1.5473
98,1.5473
99,1.5473
100,1.5473
101,1.5473
102,1.5473
103,1.5473
104,-1.5561
105,-1.5561
106,-1.5561
107,-1.5561
108,-1.5561
109,-1.5561
110,-1.5561
111,-1.5561
112,-1.5561
113,-1.5561
114,-1.5561
115,-1.5561
116,-1.5561
117,-1.5561
118,0.081698
119,-0.010156
120,0.057859
121,0.097054
122,-0.3441
123,0.052464
124,-0.11249
125,-0.12328
126,-0.23931999999999998
127,0.14701
