time,value
0,0.49167
1,0.58944
2,0.62425
3,0.6299600000000001
4,0.6299600000000001
5,0.6299600000000001
6,0.6299600000000001
7,0.6299600000000001
8,0.6299600000000001
9,0.6299600000000001
10,0.6299600000000001
11,0.6299600000000001
12,0.6299600000000001
13,0.6299600000000001
14,0.6299600000000001
15,0.6299600000000001
16,0.6299600000000001
17,0.6299600000000001
18,0.62631
19,0.56245
20,0.47229
21,0.37451999999999996
22,0.27675
23,0.17897000000000002
24,0.10292000000000001
25,0.37506
26,0.38073
27,0.43672
28,0.1869
29,0.28467
30,0.34034000000000003
31,0.35338
32,0.35338
33,0.23763
34,0.4923
35,-0.060887000000000004
36,-0.31639
37,-0.31639
38,-0.3989
39,-0.14077
40,-0.23854
41,-0.33631
42,-0.43409
43,-0.40871
44,-0.35581999999999997
45,-0.33808
46,-0.33808
47,-0.33808
48,-0.36513
49,-0.41615
50,-0.4768
51,-0.50322
52,-0.57009
53,-0.6118600000000001
54,-0.58999
55,-0.49222
56,-0.31098000000000003
57,-0.16788
58,-0.31199
59,0.16264
60,0.3344
61,0.17169
62,-0.097945
63,-0.28336
64,-0.1182
65,0.34423000000000004
66,0.17654
67,0.31539
68,0.49167
69,0.49167
70,0.56316
71,0.57547
72,0.48888000000000004
73,0.32108000000000003
74,0.127
75,-0.14945999999999998
76,-0.31639
77,-0.30134
78,-0.1538
79,0.27376999999999996
80,0.14933
81,0.21509
82,0.21509
83,0.30961
84,0.34691
85,0.35338
86,0.32732
87,0.12780999999999998
88,-0.15134
89,-0.44466000000000006
90,-0.71734
91,-0.93771
92,-0.98351
93,-0.93705
94,-0.8912399999999999
95,-0.8912399999999999
96,-0.8912399999999999
97,-0.8912399999999999
98,-0.99045
99,-1.1661
100,-1.3616
101,-1.5571
102,-1.7924
103,-2.0218
104,-2.2151
105,-2.3454
106,-2.4942
107,-2.543
108,-2.5014
109,-2.4036
110,-2.3059
111,-2.2081
112,-2.1103
113,-2.0125
114,-1.9148
115,-1.7614
116,-1.5792
117,-1.3982
118,-1.2445
119,-1.1176
120,-0.9199799999999999
121,-0.6779
122,-0.47636999999999996
123,-0.47636999999999996
124,-0.5692699999999999
125,-0.6077899999999999
126,-0.61466
127,-0.6068399999999999
128,-0.54077
129,-0.44818
130,-0.32498
131,-0.16719
132,0.13283
133,0.19856
134,0.31726
135,0.41503999999999996
136,0.51281
137,0.61058
138,0.70835
139,0.80613
140,0.86
141,0.8126899999999999
142,0.77745
143,0.76825
144,0.7875800000000001
145,0.84524
146,0.97516
147,1.1441
148,1.2712
149,1.369
150,1.4668
151,1.5645
152,1.5937
153,1.5595
154,1.4906
155,1.4619
156,1.4597
157,1.4597
158,1.4736
159,1.5147
160,1.5839
161,1.6127
162,1.6634
163,1.7028
164,1.605
165,1.416
166,1.2209999999999999
167,1.0255
168,0.8368700000000001
169,0.70695
170,0.60354
171,0.50576
172,0.4264
173,0.39909
174,0.46971999999999997
175,0.50212
176,0.54955
177,0.6299600000000001
178,0.6299600000000001
179,0.6299600000000001
180,0.53584
181,0.40405
182,0.35389
183,0.41598
184,0.46624
185,0.47306000000000004
186,0.42208
187,0.32431
188,0.24556
189,0.21509
190,0.21509
191,0.21509
192,0.21509
193,0.21509
194,0.21509
195,0.18873
196,0.24766
197,-0.13901
198,-0.3041
199,-0.4075
200,-0.42271000000000003
201,-0.35313
202,-0.33808
203,-0.34206
204,-0.36978
205,-0.46756000000000003
206,-0.56533
207,-0.71925
208,-0.8788100000000001
209,-0.9969399999999999
210,-1.0947
211,-1.1925
212,-1.2664
213,-1.3061
214,-1.3061
215,-1.3061
216,-1.2961
217,-1.248
218,-1.1502
219,-1.0524
220,-0.87726
221,-0.73005
222,-0.6009
223,-0.43133999999999995
224,-0.35871
225,-0.30127
226,-0.22973000000000002
227,-0.13196
228,-0.17986
229,0.21711
230,0.37506
231,0.37371
232,0.35745
233,-0.13142
234,0.23619
235,0.47636000000000006
236,0.18257
237,0.21208000000000002
238,0.21509
239,0.24466999999999997
240,0.30934
241,0.40564
242,0.47566
243,0.51885
244,0.6289399999999999
245,0.7982
246,0.89597
247,0.9056
248,0.90654
249,0.87934
250,0.81317
251,0.84488
252,0.88575
253,0.9296
254,0.9867
255,1.0845
256,1.1822
257,1.2895
258,1.4326
259,1.6139
260,1.7116
261,1.8094
262,1.8626
263,1.8746
264,1.8746
265,1.8746
266,1.8387
267,1.768
268,1.6702
269,1.5725
270,1.5102
271,1.5364
272,1.5979
273,1.5962
274,1.4985
275,1.4007
276,1.3029
277,1.1824
278,0.9490200000000001
279,0.71365
280,0.5022399999999999
281,0.30669
282,0.11225999999999998
283,-0.2888
284,-0.15768
285,-0.20315
286,-0.22796999999999998
287,-0.32574000000000003
288,-0.5100899999999999
289,-0.6509999999999999
290,-0.75735
291,-0.8551200000000001
292,-0.9529
293,-1.0507
294,-1.1707
295,-1.317
296,-1.4786
297,-1.58
298,-1.6778
299,-1.7756
300,-1.8734
301,-1.9711
302,-1.9945
303,-1.9542
304,-1.869
305,-1.7712
306,-1.7325
307,-1.6511
308,-1.5279
309,-1.3839
310,-1.3166
311,-1.3061
312,-1.3004
313,-1.2656
314,-1.1678
315,0.33521
316,0.44523
317,0.4844
318,0.49082
319,0.49082
320,0.49082
321,0.49082
322,0.49082
323,0.49082
324,0.49082
325,0.49082
326,0.49082
327,0.49082
328,0.49082
329,0.49082
330,0.58649
331,0.6362800000000001
332,0.6464300000000001
333,0.65054
334,0.7224
335,0.77696
336,0.80205
337,0.80205
338,0.80205
339,0.82649
340,0.9071100000000001
341,1.0159
342,1.1133
343,1.1133
344,1.1954
345,1.3016
346,1.3925
347,1.4232
348,1.3594
349,1.3012
350,1.2689
351,1.2727
352,1.3064
353,1.3851
354,1.4245
355,1.4245
356,1.4245
357,1.4245
358,1.3552
359,1.3257
360,1.3958
361,1.5058
362,1.5057
363,1.4649
364,1.4122
365,1.37
366,1.26
367,1.1634
368,1.1133
369,1.1133
370,1.1133
371,1.1133
372,1.1133
373,1.1133
374,1.1101
375,1.0387
376,1.0294
377,1.0407
378,1.0365
379,0.9636100000000001
380,0.9576600000000001
381,0.9576600000000001
382,0.95555
383,0.9338700000000001
384,0.71383
385,0.7351300000000001
386,0.6487
387,0.43383999999999995
388,0.34018000000000004
389,0.14374
390,-0.10627
391,-0.30826
392,-0.38124
393,-0.33763000000000004
394,-0.38428
395,-0.36124
396,-0.28724
397,-0.28724
398,-0.28724
399,-0.2195
400,-0.18786
401,-0.26629
402,-0.45114
403,-0.61201
404,-0.77171
405,-0.92711
406,-1.0653
407,-1.0653
408,-1.0524
409,-0.9939399999999999
410,-0.88392
411,-0.7739
412,-0.8482799999999999
413,-0.9543
414,-1.0643
415,-1.1766
416,-1.3575
417,-1.5232
418,-1.6374
419,-1.6878
420,-1.6878
421,-1.6878
422,-1.6791
423,-1.6323
424,-1.5222
425,-1.4122
426,-1.3022
427,-1.1922
428,-1.0822
429,-0.97214
430,-0.8621200000000001
431,-0.7521
432,-0.65846
433,-0.59847
434,-0.59847
435,-0.59847
436,-0.60369
437,-0.63812
438,-0.7481300000000001
439,-0.9627
440,-1.0498
441,-1.0653
442,-1.0653
443,-1.0653
444,-1.0653
445,-1.0653
446,-1.0653
447,-1.0653
448,-1.0653
449,-1.0653
450,-1.0653
451,-1.0653
452,-1.0653
453,-1.1558
454,-1.2092
455,-1.2703
456,-1.4321
457,-1.5114
458,-1.5757
459,-1.6145
460,-1.6138
461,-1.54
462,-1.51
463,-1.4412
464,-1.3765
465,-1.3765
466,-1.3765
467,-1.3765
468,-1.3765
469,-1.3765
470,-1.3765
471,-1.3765
472,-1.3765
473,-1.3765
474,-1.3765
475,-1.3765
476,-1.3765
477,-1.3765
478,-1.3765
479,-1.3765
480,-1.4793
481,-1.524
482,-1.5652
483,-1.6531
484,-1.7631
485,-1.8731
486,-1.9277
487,-1.9048
488,-1.7948
489,-1.6848
490,-1.5748
491,-1.4647
492,-1.3547
493,-1.2447
494,-1.2235
495,-1.2209
496,-1.2209
497,-1.2203
498,-1.1505
499,-1.0514
500,-0.96236
501,-0.90969
502,-0.90969
503,-0.90969
504,-0.90196
505,-0.8586299999999999
506,-0.75408
507,-0.75408
508,-0.6784899999999999
509,-0.61569
510,-0.6133
511,-0.6906100000000001
512,-0.79769
513,-0.8391799999999999
514,-0.80166
515,-0.6916399999999999
516,-0.58162
517,-0.45568000000000003
518,-0.28478000000000003
519,-0.48866000000000004
520,0.06143200000000001
521,0.12409
522,0.17093
523,0.14777
524,0.32878
525,0.14542
526,0.11099
527,0.2451
528,0.10640999999999999
529,0.17728
530,0.23329
531,0.37919
532,0.49282
533,0.51064
534,0.62066
535,0.64359
536,0.6464300000000001
537,0.6240100000000001
538,0.54323
539,0.43333
540,0.36473
541,0.33521
542,0.34052
543,0.37571
544,0.45527
545,0.48353999999999997
546,0.44156999999999996
547,0.33521
548,0.33521
549,0.33521
550,0.33521
551,0.32141
552,0.2446
553,0.19671
554,0.1463
555,0.4301
556,0.11927
557,0.27538
558,0.16416
559,0.32993
560,0.49082
561,0.49082
562,0.49082
563,0.42913999999999997
564,0.32827
565,0.2242
566,0.18703
567,0.13043
568,0.33984000000000003
569,0.11099
570,0.11099
571,0.24115999999999999
572,0.14369
573,0.30296999999999996
574,0.49082
575,0.49082
576,0.49082
577,0.49082
578,0.51212
579,0.59241
580,0.63418
581,0.6464300000000001
582,0.6270600000000001
583,0.58173
584,0.54109
585,0.64955
586,0.8259299999999999
587,1.0052
588,1.1153
589,1.2253
590,1.2629
591,1.2689
592,1.2561
593,1.1798
594,1.1311
595,1.0809
596,1.0364
597,1.0149
598,1.0942
599,1.1279
600,1.1868
601,1.2689
602,1.2689
603,1.2689
604,1.2689
605,1.2689
606,1.2689
607,1.2689
608,1.2689
609,1.2689
610,1.2603
611,1.2222
612,1.1415
613,1.1031
614,1.0518
615,0.9418
616,0.83178
617,0.8055100000000001
618,0.75329
619,0.69772
620,0.74728
621,0.78913
622,0.84136
623,0.9013899999999999
624,0.9576600000000001
625,0.9576600000000001
626,0.9576600000000001
627,0.9576600000000001
628,0.9576600000000001
629,0.9576600000000001
630,-0.54603
631,-0.54603
632,-0.54603
633,-0.54603
634,-0.54603
635,-0.54603
636,-0.54603
637,-0.54603
638,-0.54603
639,-0.54603
640,-0.54603
641,-0.54603
642,-0.54603
643,-0.54603
644,-0.54603
645,-0.54603
646,-0.54603
647,-0.50159
648,-0.36369
649,-0.11485999999999999
650,0.16505
651,0.44123999999999997
652,0.6975899999999999
653,0.9287200000000001
654,1.147
655,1.3358
656,1.5085
657,1.6752
658,1.7908
659,1.9063
660,2.0219
661,2.1274
662,2.2014
663,2.2598
664,2.2975
665,2.3145
666,2.3145
667,2.3145
668,2.3145
669,2.3145
670,2.3145
671,2.3145
672,2.3145
673,2.2781
674,2.2239
675,2.1604
676,2.0631
677,1.9501
678,1.8505
679,1.7586
680,1.6567
681,1.499
682,1.3722
683,1.2567
684,1.1411
685,1.0255
686,0.86065
687,0.6882199999999999
688,0.5148699999999999
689,0.33984000000000003
690,0.12902
691,-0.12135
692,-0.37206
693,-0.59314
694,-0.74697
695,-0.86566
696,-0.9908299999999999
697,-1.155
698,-1.3633
699,-1.3633
700,-1.4901
701,-1.5844
702,-1.618
703,-1.6593
704,-1.7163
705,-1.7349
706,-1.7391
707,-1.7567
708,-1.82
709,-1.7839
710,-1.7261
711,-1.6684
712,-1.6106
713,-1.6645
714,-1.722
715,-1.7424
716,-1.7115
717,-1.693
718,-1.6619
719,-1.5992
720,-1.5115
721,-1.4175
722,-1.3597
723,-1.3019
724,-1.2471
725,-1.2134
726,-1.2712
727,-1.329
728,-1.3867
729,-1.3902
730,-1.2733
731,-1.0999
732,-0.92656
733,-0.7769199999999999
734,-0.66628
735,-0.6085
736,-0.56275
737,-0.5414800000000001
738,-0.51688
739,-0.4591
740,-0.40131999999999995
741,-0.30214
742,-0.18893
743,-0.4647
744,-0.29812
745,-0.12302
746,-0.06377000000000001
747,-0.1297
748,-0.28724
749,-0.28724
750,-0.24201999999999999
751,-0.049694
752,0.32963000000000003
753,0.18328
754,0.29884
755,0.34486
756,0.31695
757,0.23312
758,0.19564
759,0.18952
760,0.18952
761,0.18375999999999998
762,0.16267
763,0.12015999999999999
764,0.49768999999999997
765,0.35454
766,0.1214
767,0.1214
768,0.1214
769,-0.15533
770,-0.14972
771,-0.10384000000000002
772,-0.09436699999999999
773,-0.21447
774,-0.28724
775,-0.28724
776,-0.28724
777,-0.28724
778,-0.28724
779,-0.28724
780,-0.28724
781,-0.28724
782,-0.28724
783,-0.28724
784,-0.32894
785,-0.10487
786,-0.16134
787,-0.21911999999999998
788,-0.2769
789,-0.336
790,-0.4107
791,-0.50922
792,-0.5897600000000001
793,-0.64754
794,-0.70532
795,-0.87103
796,-1.0097
797,-1.1122
798,-1.1775
799,-1.1965
800,-1.1999
801,-1.1853
802,-1.1558
803,-1.1189
804,-1.1327
805,-1.1713
806,-1.1999
807,-1.1999
808,-1.1999
809,-1.1999
810,-1.1999
811,-1.1999
812,-1.1999
813,-1.1999
814,-1.1552
815,-1.0807
816,-0.9922200000000001
817,-0.9157
818,-0.82724
819,-0.79528
820,-0.81804
821,-0.87295
822,-0.87295
823,-0.87295
824,-0.8508899999999999
825,-0.78657
826,-0.64758
827,-0.47731999999999997
828,-0.32197
829,-0.18737
830,-0.37337
831,0.12117
832,0.49638000000000004
833,0.19317
834,0.30873
835,0.42428999999999994
836,0.53986
837,0.65542
838,0.80442
839,1.0079
840,1.2005
841,1.3774
842,1.5367
843,1.6655
844,1.7399
845,1.7424
846,1.7365
847,1.7080000000000002
848,1.6502
849,1.5924
850,1.4889
851,1.3478
852,1.193
853,1.062
854,0.94642
855,0.83085
856,0.72587
857,0.6426
858,0.6033
859,0.59816
860,0.5905100000000001
861,0.54627
862,0.43262
863,0.37484
864,0.31706
865,0.28065
866,0.2785
867,0.31884
868,0.34399
869,0.37046
870,0.41617
871,0.49733999999999995
872,0.59651
873,0.64769
874,0.63825
875,0.5804600000000001
876,0.52268
877,0.51699
878,0.5164300000000001
879,0.53251
880,0.5747399999999999
881,0.59426
882,0.57234
883,0.5541
884,0.5589999999999999
885,0.59648
886,0.6118399999999999
887,0.6442100000000001
888,0.64658
889,0.5887899999999999
890,0.53101
891,0.5180899999999999
892,0.54277
893,0.58229
894,0.59791
895,0.56257
896,0.5324300000000001
897,0.50626
898,0.47991999999999996
899,0.44036000000000003
900,0.43471000000000004
901,0.43111000000000005
902,0.4098
903,0.35298
904,0.35298
905,0.35298
906,0.35298
907,0.34626999999999997
908,0.30619
909,0.22023
910,0.13102
911,0.25675
912,-0.20511999999999997
913,-0.2371
914,-0.28724
915,-0.28724
916,-0.28724
917,-0.28724
918,-0.28724
919,-0.28724
920,-0.36444
921,-0.11605
922,-0.17382999999999998
923,-0.20639000000000002
924,-0.21911999999999998
925,-0.22361999999999999
926,-0.24366
927,-0.28603
928,-0.30618
929,-0.33233
930,-0.38258000000000003
931,-0.38258000000000003
932,-0.38258000000000003
933,-0.40818000000000004
934,-0.43737
935,-0.41134
936,-0.38936
937,-0.40321999999999997
938,-0.43475
939,-0.4643
940,-0.4643
941,-0.45419
942,-0.41978000000000004
943,-0.38258000000000003
944,-0.38258000000000003
