time,value
0,-0.052645000000000004
1,-0.052645000000000004
2,-0.052645000000000004
3,-0.052645000000000004
4,-0.052645000000000004
5,-0.052645000000000004
6,-0.052645000000000004
7,-0.052645000000000004
8,-0.052645000000000004
9,-0.052645000000000004
10,-0.052645000000000004
11,-0.052645000000000004
12,-0.052645000000000004
13,-0.052645000000000004
14,-0.052645000000000004
15,-0.052645000000000004
16,-0.052645000000000004
17,-0.052645000000000004
18,-0.052645000000000004
19,-0.052645000000000004
20,-0.052645000000000004
21,-0.052645000000000004
22,-0.052645000000000004
23,-0.052645000000000004
24,-0.052645000000000004
25,-0.052645000000000004
26,-0.052645000000000004
27,-0.052645000000000004
28,-0.052645000000000004
29,-0.052645000000000004
30,-0.052645000000000004
31,-0.052645000000000004
32,-0.052645000000000004
33,-0.052645000000000004
34,-0.052645000000000004
35,-0.052645000000000004
36,-0.052645000000000004
37,-0.052645000000000004
38,-0.052645000000000004
39,-0.052645000000000004
40,-0.052645000000000004
41,-0.052645000000000004
42,-0.052645000000000004
43,-0.052645000000000004
44,-0.052645000000000004
45,-0.052645000000000004
46,-0.052645000000000004
47,-0.052645000000000004
48,-0.052645000000000004
49,-0.052645000000000004
50,-0.052645000000000004
51,-0.052645000000000004
52,-0.052645000000000004
53,-0.052645000000000004
54,-0.052645000000000004
55,-0.052645000000000004
56,-0.052645000000000004
57,-0.052645000000000004
58,-0.052645000000000004
59,-0.052645000000000004
60,-0.052645000000000004
61,-0.052645000000000004
62,-0.052645000000000004
63,-0.052645000000000004
64,-0.052645000000000004
65,-0.052645000000000004
66,-0.052645000000000004
67,-0.052645000000000004
68,-0.052645000000000004
69,-0.052645000000000004
70,-0.052645000000000004
71,-0.052645000000000004
72,-0.052645000000000004
73,-0.052645000000000004
74,-0.052645000000000004
75,-0.052645000000000004
76,-0.052645000000000004
77,-0.052645000000000004
78,-0.052645000000000004
79,-0.052645000000000004
80,-0.052645000000000004
81,-0.052645000000000004
82,-0.052645000000000004
83,-0.052645000000000004
84,-0.052645000000000004
85,-0.052645000000000004
86,-0.052645000000000004
87,-0.052645000000000004
88,-0.052645000000000004
89,-0.052645000000000004
90,-0.052645000000000004
91,-0.052645000000000004
92,-0.052645000000000004
93,-0.052645000000000004
94,-0.052645000000000004
95,-0.052645000000000004
96,-0.052645000000000004
97,-0.052645000000000004
98,-0.052645000000000004
99,-0.052645000000000004
100,-0.052645000000000004
101,-0.052645000000000004
102,-0.052645000000000004
103,-0.052645000000000004
104,-0.052645000000000004
105,-0.052645000000000004
106,-0.052645000000000004
107,-0.052645000000000004
108,-0.052645000000000004
109,-0.052645000000000004
110,-0.052645000000000004
111,-0.052645000000000004
112,-0.052645000000000004
113,-0.052645000000000004
114,-0.052645000000000004
115,-0.052645000000000004
116,-0.052645000000000004
117,-0.052645000000000004
118,-0.052645000000000004
119,-0.052645000000000004
120,-0.052645000000000004
121,-0.052645000000000004
122,-0.052645000000000004
123,-0.052645000000000004
124,-0.052645000000000004
125,-0.052645000000000004
126,-0.052645000000000004
127,-0.052645000000000004
128,-0.052645000000000004
129,-0.052645000000000004
130,-0.052645000000000004
131,-0.052645000000000004
132,-0.052645000000000004
133,-0.052645000000000004
134,-0.052645000000000004
135,-0.052645000000000004
136,-0.052645000000000004
137,-0.052645000000000004
138,-0.052645000000000004
139,-0.052645000000000004
140,-0.052645000000000004
141,-0.052645000000000004
142,-0.052645000000000004
143,-0.052645000000000004
144,-0.052645000000000004
145,-0.052645000000000004
146,-0.052645000000000004
147,-0.052645000000000004
148,-0.052645000000000004
149,-0.052645000000000004
150,-0.052645000000000004
151,-0.052645000000000004
152,-0.052645000000000004
153,-0.052645000000000004
154,-0.052645000000000004
155,-0.052645000000000004
156,-0.052645000000000004
157,-0.052645000000000004
158,-0.052645000000000004
159,-0.052645000000000004
160,-0.052645000000000004
161,-0.052645000000000004
162,-0.052645000000000004
163,-0.052645000000000004
164,-0.052645000000000004
165,-0.052645000000000004
166,-0.052645000000000004
167,-0.052645000000000004
168,-0.052645000000000004
169,-0.052645000000000004
170,-0.052645000000000004
171,-0.052645000000000004
172,-0.052645000000000004
173,-0.052645000000000004
174,-0.052645000000000004
175,-0.052645000000000004
176,-0.052645000000000004
177,-0.052645000000000004
178,-0.052645000000000004
179,-0.052645000000000004
180,-0.052645000000000004
181,-0.052645000000000004
182,-0.052645000000000004
183,-0.052645000000000004
184,-0.052645000000000004
185,-0.052645000000000004
186,-0.052645000000000004
187,-0.052645000000000004
188,-0.052645000000000004
189,-0.052645000000000004
190,-0.052645000000000004
191,-0.052645000000000004
192,-0.052645000000000004
193,-0.052645000000000004
194,-0.052645000000000004
195,-0.052645000000000004
196,-0.052645000000000004
197,-0.052645000000000004
198,-0.052645000000000004
199,-0.052645000000000004
200,-0.052645000000000004
201,-0.052645000000000004
202,-0.052645000000000004
203,-0.052645000000000004
204,-0.052645000000000004
205,-0.052645000000000004
206,-0.052645000000000004
207,-0.052645000000000004
208,-0.052645000000000004
209,-0.052645000000000004
210,-0.052645000000000004
211,-0.052645000000000004
212,-0.052645000000000004
213,-0.052645000000000004
214,-0.052645000000000004
215,-0.052645000000000004
216,-0.052645000000000004
217,-0.052645000000000004
218,-0.052645000000000004
219,-0.052645000000000004
220,-0.052645000000000004
221,-0.052645000000000004
222,-0.052645000000000004
223,-0.052645000000000004
224,-0.052645000000000004
225,-0.052645000000000004
226,-0.052645000000000004
227,-0.052645000000000004
228,-0.052645000000000004
229,-0.052645000000000004
230,-0.052645000000000004
231,-0.052645000000000004
232,-0.052645000000000004
233,-0.052645000000000004
234,-0.052645000000000004
235,-0.052645000000000004
236,-0.052645000000000004
237,-0.052645000000000004
238,-0.052645000000000004
239,-0.052645000000000004
240,-0.052645000000000004
241,-0.052645000000000004
242,-0.052645000000000004
243,-0.052645000000000004
244,-0.052645000000000004
245,-0.052645000000000004
246,-0.052645000000000004
247,-0.052645000000000004
248,-0.052645000000000004
249,-0.052645000000000004
250,-0.052645000000000004
251,-0.052645000000000004
252,-0.052645000000000004
253,-0.052645000000000004
254,-0.052645000000000004
255,-0.052645000000000004
256,-0.052645000000000004
257,-0.052645000000000004
258,-0.052645000000000004
259,-0.052645000000000004
260,-0.052645000000000004
261,-0.052645000000000004
262,-0.052645000000000004
263,-0.052645000000000004
264,-0.052645000000000004
265,-0.052645000000000004
266,-0.052645000000000004
267,-0.052645000000000004
268,-0.052645000000000004
269,-0.052645000000000004
270,-0.052645000000000004
271,-0.052645000000000004
272,-0.052645000000000004
273,-0.052645000000000004
274,-0.052645000000000004
275,-0.052645000000000004
276,-0.052645000000000004
277,-0.052645000000000004
278,-0.052645000000000004
279,-0.052645000000000004
280,-0.052645000000000004
281,-0.052645000000000004
282,-0.052645000000000004
283,-0.052645000000000004
284,-0.052645000000000004
285,-0.052645000000000004
286,-0.052645000000000004
287,-0.052645000000000004
288,-0.052645000000000004
289,-0.052645000000000004
290,-0.052645000000000004
291,-0.052645000000000004
292,-0.052645000000000004
293,-0.052645000000000004
294,-0.052645000000000004
295,-0.052645000000000004
296,-0.052645000000000004
297,-0.052645000000000004
298,-0.052645000000000004
299,-0.052645000000000004
300,-0.052645000000000004
301,-0.052645000000000004
302,-0.052645000000000004
303,-0.052645000000000004
304,-0.052645000000000004
305,-0.052645000000000004
306,-0.052645000000000004
307,-0.052645000000000004
308,-0.052645000000000004
309,-0.052645000000000004
310,-0.052645000000000004
311,-0.052645000000000004
312,-0.052645000000000004
313,-0.052645000000000004
314,-0.052645000000000004
315,-0.052645000000000004
316,-0.052645000000000004
317,-0.052645000000000004
318,-0.052645000000000004
319,-0.052645000000000004
320,-0.052645000000000004
321,-0.052645000000000004
322,-0.052645000000000004
323,-0.052645000000000004
324,-0.052645000000000004
325,17.756
326,20.044
327,-0.052645000000000004
328,-0.052645000000000004
329,-0.052645000000000004
330,-0.052645000000000004
331,-0.052645000000000004
332,-0.052645000000000004
333,-0.052645000000000004
334,-0.052645000000000004
335,-0.052645000000000004
336,-0.052645000000000004
337,-0.052645000000000004
338,-0.052645000000000004
339,-0.052645000000000004
340,-0.052645000000000004
341,-0.052645000000000004
342,-0.052645000000000004
343,-0.052645000000000004
344,-0.052645000000000004
345,-0.052645000000000004
346,-0.052645000000000004
347,-0.052645000000000004
348,-0.052645000000000004
349,-0.052645000000000004
350,-0.052645000000000004
351,-0.052645000000000004
352,-0.052645000000000004
353,-0.052645000000000004
354,-0.052645000000000004
355,-0.052645000000000004
356,-0.052645000000000004
357,-0.052645000000000004
358,-0.052645000000000004
359,-0.052645000000000004
360,-0.052645000000000004
361,-0.052645000000000004
362,-0.052645000000000004
363,-0.052645000000000004
364,-0.052645000000000004
365,-0.052645000000000004
366,-0.052645000000000004
367,-0.052645000000000004
368,-0.052645000000000004
369,-0.052645000000000004
370,-0.052645000000000004
371,-0.052645000000000004
372,-0.052645000000000004
373,-0.052645000000000004
374,-0.052645000000000004
375,-0.052645000000000004
376,-0.052645000000000004
377,-0.052645000000000004
378,-0.052645000000000004
379,-0.052645000000000004
380,-0.052645000000000004
381,-0.052645000000000004
382,-0.052645000000000004
383,-0.052645000000000004
384,-0.052645000000000004
385,-0.052645000000000004
386,-0.052645000000000004
387,-0.052645000000000004
388,-0.052645000000000004
389,-0.052645000000000004
390,-0.052645000000000004
391,-0.052645000000000004
392,-0.052645000000000004
393,-0.052645000000000004
394,-0.052645000000000004
395,-0.052645000000000004
396,-0.052645000000000004
397,-0.052645000000000004
398,-0.052645000000000004
399,-0.052645000000000004
400,-0.052645000000000004
401,-0.052645000000000004
402,-0.052645000000000004
403,-0.052645000000000004
404,-0.052645000000000004
405,-0.052645000000000004
406,-0.052645000000000004
407,-0.052645000000000004
408,-0.052645000000000004
409,-0.052645000000000004
410,-0.052645000000000004
411,-0.052645000000000004
412,-0.052645000000000004
413,-0.052645000000000004
414,-0.052645000000000004
415,-0.052645000000000004
416,-0.052645000000000004
417,-0.052645000000000004
418,-0.052645000000000004
419,-0.052645000000000004
420,-0.052645000000000004
421,-0.052645000000000004
422,-0.052645000000000004
423,-0.052645000000000004
424,-0.052645000000000004
425,-0.052645000000000004
426,-0.052645000000000004
427,-0.052645000000000004
428,-0.052645000000000004
429,-0.052645000000000004
430,-0.052645000000000004
431,-0.052645000000000004
432,-0.052645000000000004
433,-0.052645000000000004
434,-0.052645000000000004
435,-0.052645000000000004
436,-0.052645000000000004
437,-0.052645000000000004
438,-0.052645000000000004
439,-0.052645000000000004
440,-0.052645000000000004
441,-0.052645000000000004
442,-0.052645000000000004
443,-0.052645000000000004
444,-0.052645000000000004
445,-0.052645000000000004
446,-0.052645000000000004
447,-0.052645000000000004
448,-0.052645000000000004
449,-0.052645000000000004
450,-0.052645000000000004
451,-0.052645000000000004
452,-0.052645000000000004
453,-0.052645000000000004
454,-0.052645000000000004
455,-0.052645000000000004
456,-0.052645000000000004
457,-0.052645000000000004
458,-0.052645000000000004
459,-0.052645000000000004
460,-0.052645000000000004
461,-0.052645000000000004
462,-0.052645000000000004
463,-0.052645000000000004
464,-0.052645000000000004
465,-0.052645000000000004
466,-0.052645000000000004
467,-0.052645000000000004
468,-0.052645000000000004
469,-0.052645000000000004
470,-0.052645000000000004
471,-0.052645000000000004
472,-0.052645000000000004
473,-0.052645000000000004
474,-0.052645000000000004
475,-0.052645000000000004
476,-0.052645000000000004
477,-0.052645000000000004
478,-0.052645000000000004
479,-0.052645000000000004
480,-0.052645000000000004
481,-0.052645000000000004
482,-0.052645000000000004
483,-0.052645000000000004
484,-0.052645000000000004
485,-0.052645000000000004
486,-0.052645000000000004
487,-0.052645000000000004
488,-0.052645000000000004
489,-0.052645000000000004
490,-0.052645000000000004
491,-0.052645000000000004
492,-0.052645000000000004
493,-0.052645000000000004
494,-0.052645000000000004
495,-0.052645000000000004
496,-0.052645000000000004
497,-0.052645000000000004
498,-0.052645000000000004
499,-0.052645000000000004
500,-0.052645000000000004
501,-0.052645000000000004
502,-0.052645000000000004
503,-0.052645000000000004
504,-0.052645000000000004
505,-0.052645000000000004
506,-0.052645000000000004
507,-0.052645000000000004
508,-0.052645000000000004
509,-0.052645000000000004
510,-0.052645000000000004
511,-0.052645000000000004
512,-0.052645000000000004
513,-0.052645000000000004
514,-0.052645000000000004
515,-0.052645000000000004
516,-0.052645000000000004
517,-0.052645000000000004
518,-0.052645000000000004
519,-0.052645000000000004
520,-0.052645000000000004
521,-0.052645000000000004
522,-0.052645000000000004
523,-0.052645000000000004
524,-0.052645000000000004
525,-0.052645000000000004
526,-0.052645000000000004
527,-0.052645000000000004
528,-0.052645000000000004
529,-0.052645000000000004
530,-0.052645000000000004
531,-0.052645000000000004
532,-0.052645000000000004
533,-0.052645000000000004
534,-0.052645000000000004
535,-0.052645000000000004
536,-0.052645000000000004
537,-0.052645000000000004
538,-0.052645000000000004
539,-0.052645000000000004
540,-0.052645000000000004
541,-0.052645000000000004
542,-0.052645000000000004
543,-0.052645000000000004
544,-0.052645000000000004
545,-0.052645000000000004
546,-0.052645000000000004
547,-0.052645000000000004
548,-0.052645000000000004
549,-0.052645000000000004
550,-0.052645000000000004
551,-0.052645000000000004
552,-0.052645000000000004
553,-0.052645000000000004
554,-0.052645000000000004
555,-0.052645000000000004
556,-0.052645000000000004
557,-0.052645000000000004
558,-0.052645000000000004
559,-0.052645000000000004
560,-0.052645000000000004
561,-0.052645000000000004
562,-0.052645000000000004
563,-0.052645000000000004
564,-0.052645000000000004
565,-0.052645000000000004
566,-0.052645000000000004
567,-0.052645000000000004
568,-0.052645000000000004
569,-0.052645000000000004
570,-0.052645000000000004
571,-0.052645000000000004
572,-0.052645000000000004
573,-0.052645000000000004
574,-0.052645000000000004
575,-0.052645000000000004
576,-0.052645000000000004
577,-0.052645000000000004
578,-0.052645000000000004
579,-0.052645000000000004
580,-0.052645000000000004
581,-0.052645000000000004
582,-0.052645000000000004
583,-0.052645000000000004
584,-0.052645000000000004
585,-0.052645000000000004
586,-0.052645000000000004
587,-0.052645000000000004
588,-0.052645000000000004
589,-0.052645000000000004
590,-0.052645000000000004
591,-0.052645000000000004
592,-0.052645000000000004
593,-0.052645000000000004
594,-0.052645000000000004
595,-0.052645000000000004
596,-0.052645000000000004
597,-0.052645000000000004
598,-0.052645000000000004
599,-0.052645000000000004
600,-0.052645000000000004
601,-0.052645000000000004
602,-0.052645000000000004
603,-0.052645000000000004
604,-0.052645000000000004
605,-0.052645000000000004
606,-0.052645000000000004
607,-0.052645000000000004
608,-0.052645000000000004
609,-0.052645000000000004
610,-0.052645000000000004
611,-0.052645000000000004
612,-0.052645000000000004
613,-0.052645000000000004
614,-0.052645000000000004
615,-0.052645000000000004
616,-0.052645000000000004
617,-0.052645000000000004
618,-0.052645000000000004
619,-0.052645000000000004
620,-0.052645000000000004
621,-0.052645000000000004
622,-0.052645000000000004
623,-0.052645000000000004
624,-0.052645000000000004
625,-0.052645000000000004
626,-0.052645000000000004
627,-0.052645000000000004
628,-0.052645000000000004
629,-0.052645000000000004
630,-0.052645000000000004
631,-0.052645000000000004
632,-0.052645000000000004
633,-0.052645000000000004
634,-0.052645000000000004
635,-0.052645000000000004
636,-0.052645000000000004
637,-0.052645000000000004
638,-0.052645000000000004
639,-0.052645000000000004
640,-0.052645000000000004
641,-0.052645000000000004
642,-0.052645000000000004
643,-0.052645000000000004
644,-0.052645000000000004
645,-0.052645000000000004
646,-0.052645000000000004
647,-0.052645000000000004
648,-0.052645000000000004
649,-0.052645000000000004
650,-0.052645000000000004
651,-0.052645000000000004
652,-0.052645000000000004
653,-0.052645000000000004
654,-0.052645000000000004
655,-0.052645000000000004
656,-0.052645000000000004
657,-0.052645000000000004
658,-0.052645000000000004
659,-0.052645000000000004
660,-0.052645000000000004
661,-0.052645000000000004
662,-0.052645000000000004
663,-0.052645000000000004
664,-0.052645000000000004
665,-0.052645000000000004
666,-0.052645000000000004
667,-0.052645000000000004
668,-0.052645000000000004
669,-0.052645000000000004
670,-0.052645000000000004
671,-0.052645000000000004
672,-0.052645000000000004
673,-0.052645000000000004
674,-0.052645000000000004
675,-0.052645000000000004
676,-0.052645000000000004
677,-0.052645000000000004
678,-0.052645000000000004
679,-0.052645000000000004
680,-0.052645000000000004
681,-0.052645000000000004
682,-0.052645000000000004
683,-0.052645000000000004
684,-0.052645000000000004
685,-0.052645000000000004
686,-0.052645000000000004
687,-0.052645000000000004
688,-0.052645000000000004
689,-0.052645000000000004
690,-0.052645000000000004
691,-0.052645000000000004
692,-0.052645000000000004
693,-0.052645000000000004
694,-0.052645000000000004
695,-0.052645000000000004
696,-0.052645000000000004
697,-0.052645000000000004
698,-0.052645000000000004
699,-0.052645000000000004
700,-0.052645000000000004
701,-0.052645000000000004
702,-0.052645000000000004
703,-0.052645000000000004
704,-0.052645000000000004
705,-0.052645000000000004
706,-0.052645000000000004
707,-0.052645000000000004
708,-0.052645000000000004
709,-0.052645000000000004
710,-0.052645000000000004
711,-0.052645000000000004
712,-0.052645000000000004
713,-0.052645000000000004
714,-0.052645000000000004
715,-0.052645000000000004
716,-0.052645000000000004
717,-0.052645000000000004
718,-0.052645000000000004
719,-0.052645000000000004
