time,value
0,-0.93939
1,-0.9301799999999999
2,-0.9194200000000001
3,-0.9078299999999999
4,-0.8961899999999999
5,-0.88592
6,-0.87846
7,-0.87271
8,-0.8679100000000001
9,-0.8630899999999999
10,-0.85731
11,-0.85165
12,-0.8453799999999999
13,-0.83768
14,-0.82831
15,-0.81719
16,-0.80474
17,-0.7932600000000001
18,-0.7812
19,-0.76798
20,-0.7528600000000001
21,-0.73517
22,-0.7157600000000001
23,-0.69521
24,-0.67227
25,-0.64653
26,-0.61763
27,-0.58534
28,-0.55188
29,-0.5158699999999999
30,-0.47628000000000004
31,-0.43222
32,-0.38303000000000004
33,-0.32905
34,-0.27229000000000003
35,-0.21193
36,-0.14848
37,-0.08256799999999999
38,-0.01492
39,0.052471000000000004
40,0.11894
41,0.18511
42,0.2515
43,0.31881
44,0.38776
45,0.45711999999999997
46,0.5284300000000001
47,0.60206
48,0.67816
49,0.75657
50,0.83626
51,0.91575
52,0.9950399999999999
53,1.0736
54,1.1508
55,1.2262
56,1.2981
57,1.3664
58,1.431
59,1.492
60,1.5495
61,1.6036
62,1.6537
63,1.7008
64,1.7455
65,1.7886
66,1.8305
67,1.8711
68,1.9106
69,1.9494
70,1.9878
71,2.0259
72,2.0641
73,2.1018
74,2.1394
75,2.1772
76,2.2149
77,2.2524
78,2.2886
79,2.3222
80,2.3521
81,2.3763
82,2.3927
83,2.3994
84,2.3942
85,2.3759
86,2.3436
87,2.2969
88,2.2362
89,2.1627
90,2.0777
91,1.9842
92,1.8846
93,1.7819
94,1.6787
95,1.5776
96,1.4809
97,1.3911
98,1.3092
99,1.2359
100,1.1713
101,1.1143
102,1.0648
103,1.0219
104,0.98403
105,0.9497200000000001
106,0.9173399999999999
107,0.8851899999999999
108,0.85356
109,0.82157
110,0.78841
111,0.75342
112,0.71548
113,0.6749
114,0.63232
115,0.58745
116,0.53999
117,0.48977
118,0.43566000000000005
119,0.37976
120,0.3225
121,0.26391
122,0.2039
123,0.14195
124,0.077684
125,0.012911
126,-0.052529
127,-0.11888
128,-0.18627
129,-0.2557
130,-0.32536
131,-0.39357
132,-0.45966
133,-0.52295
134,-0.58278
135,-0.6403300000000001
136,-0.6920000000000001
137,-0.73745
138,-0.77682
139,-0.8105399999999999
140,-0.83998
141,-0.86549
142,-0.8857299999999999
143,-0.9014200000000001
144,-0.9134200000000001
145,-0.92258
146,-0.9311
147,-0.9375600000000001
148,-0.94176
149,-0.9442799999999999
150,-0.94571
151,-0.9467899999999999
152,-0.94878
153,-0.94971
154,-0.94965
155,-0.9487899999999999
156,-0.94735
157,-0.9462200000000001
158,-0.94494
159,-0.9426
160,-0.9393100000000001
161,-0.9352799999999999
162,-0.93071
163,-0.9267700000000001
164,-0.9219700000000001
165,-0.91606
166,-0.9091100000000001
167,-0.90125
168,-0.8929
169,-0.8844700000000001
170,-0.87474
171,-0.8637299999999999
172,-0.85159
173,-0.83844
174,-0.82509
175,-0.8109
176,-0.79527
177,-0.7781600000000001
178,-0.75965
179,-0.73987
180,-0.72004
181,-0.69907
182,-0.6772199999999999
183,-0.65484
184,-0.63238
185,-0.61063
186,-0.59021
187,-0.57081
188,-0.55266
189,-0.53596
190,-0.52086
191,-0.50805
192,-0.49726000000000004
193,-0.48822
194,-0.48081
195,-0.4749
196,-0.47045
197,-0.46785
198,-0.46658999999999995
199,-0.46648999999999996
200,-0.4674
201,-0.46921
202,-0.4721
203,-0.47618999999999995
204,-0.48128000000000004
205,-0.48731
206,-0.49418
207,-0.50174
208,-0.5100399999999999
209,-0.51876
210,-0.52758
211,-0.53617
212,-0.54419
213,-0.55133
214,-0.5573600000000001
215,-0.56201
216,-0.56511
217,-0.56653
218,-0.56617
219,-0.56397
220,-0.55984
221,-0.55375
222,-0.54568
223,-0.53567
224,-0.52382
225,-0.51031
226,-0.49533999999999995
227,-0.47921
228,-0.46226000000000006
229,-0.44483999999999996
230,-0.42731
231,-0.40995
232,-0.39297
233,-0.37659000000000004
234,-0.36103
235,-0.3465
236,-0.33326
237,-0.32135
238,-0.31085999999999997
239,-0.30185
240,-0.29431
241,-0.28814
242,-0.2832
243,-0.27898
244,-0.27529000000000003
245,-0.27202
246,-0.26927
247,-0.26742
248,-0.26678
249,-0.26777
250,-0.27105
251,-0.27726999999999996
252,-0.28692
253,-0.30056
254,-0.31795
255,-0.33906
256,-0.36389
257,-0.3924
258,-0.42468999999999996
259,-0.46082
260,-0.50044
261,-0.54342
262,-0.58937
263,-0.63754
264,-0.68691
265,-0.73573
266,-0.78214
267,-0.8243799999999999
268,-0.8609899999999999
269,-0.89094
