time,value
0,0.6459600000000001
1,1.2958
2,1.7721
3,1.9794
4,1.8758
5,1.4522
6,0.83616
7,0.18919
8,-0.2336
9,-0.3781
10,-0.22438000000000002
11,0.12336
12,0.46998
13,0.5724100000000001
14,0.3293
15,-0.27581
16,-1.0883
17,-1.8347
18,-2.2266
19,-2.0997
20,-1.4694
21,-0.49223
22,0.56688
23,1.3493
24,1.6593
25,1.4801
26,0.92445
27,0.23839000000000002
28,-0.33133
29,-0.5826100000000001
30,-0.57582
31,-0.42589
32,-0.28767
33,-0.29396
34,-0.49742
35,-0.8147
36,-1.0809
37,-1.0752
38,-0.73978
39,-0.16303
40,0.53162
41,1.0646
42,1.2597
43,1.0874
44,0.5877
45,0.0017372
46,-0.40783
47,-0.51744
48,-0.33349
49,0.045408
50,0.47973000000000005
51,0.7392
52,0.77625
53,0.63395
54,0.3939
55,0.1694
56,0.054736
57,0.07658
58,0.091136
59,0.064604
60,-0.082724
61,-0.35317
62,-0.66892
63,-0.9176700000000001
64,-0.97441
65,-0.7840199999999999
66,-0.4813
67,-0.10914000000000001
68,0.18324000000000001
69,0.26588
70,0.16527
71,-0.016291
72,-0.2172
73,-0.3465
74,-0.30933
75,-0.15257
76,-0.018853
77,0.10065
78,0.15370999999999999
79,0.088759
80,-0.009416200000000001
81,-0.023799
82,0.068358
83,0.19399999999999998
84,0.26948
85,0.22445
86,0.038245999999999995
87,-0.25973
88,-0.55093
89,-0.6914600000000001
90,-0.61466
91,-0.26861999999999997
92,0.30326
93,0.88408
94,1.3579
95,1.5804
96,1.4912
97,1.0973
98,0.53122
99,-0.061836
100,-0.57989
101,-0.9424399999999999
102,-1.1112
103,-1.1740000000000002
104,-1.2401
105,-1.2803
106,-1.2719
107,-1.1276
108,-0.78446
109,-0.2978
110,0.31608
111,0.96044
112,1.4648
113,1.7188
114,1.6535
115,1.2495
116,0.60119
117,-0.11084000000000001
118,-0.70405
119,-1.0211
120,-0.9774299999999999
121,-0.63136
122,-0.03662
123,0.60416
124,1.1004
125,1.2988
126,1.1253
127,0.55991
128,-0.25251999999999997
129,-1.1102
130,-1.8611
131,-2.2951
132,-2.3079
133,-1.9283
134,-1.2919999999999998
135,-0.58718
136,0.015234000000000001
137,0.38763000000000003
138,0.51177
139,0.43671000000000004
140,0.28594
141,0.18638
142,0.23426
143,0.4582
144,0.77583
145,1.1371
146,1.4316
147,1.5928
148,1.6039
149,1.445
150,1.1872
151,0.80172
152,0.35651
153,-0.10975
154,-0.6071300000000001
155,-1.1225
156,-1.5499
157,-1.7981
158,-1.8407
159,-1.6659
160,-1.3297
161,-0.86823
162,-0.42586999999999997
163,-0.1346
164,-0.021649
165,-0.070096
166,-0.23795999999999998
167,-0.36875
168,-0.4139
169,-0.34978000000000004
170,-0.13159
171,0.23026999999999997
172,0.6693399999999999
173,1.0805
174,1.3593
175,1.4387
176,1.3223
177,1.0288
178,0.60356
179,0.15741
180,-0.15452
181,-0.31827
182,-0.30768
183,-0.16785
184,-0.01238
185,0.11975
186,0.11145
187,-0.075409
188,-0.37985
189,-0.70827
190,-0.9302799999999999
191,-0.94115
192,-0.71913
193,-0.36279
194,0.008500299999999999
195,0.24781
196,0.31616
197,0.20711999999999997
198,-0.048311
199,-0.29181
200,-0.41298
201,-0.32541
202,-0.045181
203,0.28956
204,0.59406
205,0.76247
206,0.6624800000000001
207,0.3725
208,-0.037317
209,-0.48712
210,-0.8155399999999999
211,-0.90135
212,-0.8024600000000001
213,-0.55197
214,-0.20789000000000002
215,0.13003
216,0.42896999999999996
217,0.66343
218,0.80658
219,0.80206
220,0.61321
221,0.24243
222,-0.24076999999999998
223,-0.78027
224,-1.2663
225,-1.5373
226,-1.4966
227,-1.114
228,-0.46429
229,0.29504
230,0.9753700000000001
231,1.3843
232,1.4448
233,1.1782
234,0.69886
235,0.20001
236,-0.15636
237,-0.32773
238,-0.33958
239,-0.28141
240,-0.2806
241,-0.3867
242,-0.65208
243,-0.9797799999999999
244,-1.2652
245,-1.2974
246,-1.0291
247,-0.49595
248,0.17372
249,0.78408
250,1.2006
251,1.3107
252,1.0702
253,0.59741
254,0.057583
255,-0.37432
256,-0.51683
257,-0.34473000000000004
258,0.041934
259,0.45148999999999995
260,0.73764
261,0.76658
262,0.46552
263,-0.066379
264,-0.67998
265,-1.1791
266,-1.4202
267,-1.3559999999999999
268,-1.0483
269,-0.58216
270,-0.0617
271,0.3999
272,0.7326
273,0.89239
274,0.9314100000000001
275,0.91674
276,0.82485
277,0.64264
278,0.41608999999999996
279,0.08431699999999999
280,-0.3124
281,-0.73745
282,-1.0175
283,-1.0678
284,-0.8251200000000001
285,-0.31918
286,0.2985
287,0.92063
288,1.3664
289,1.4935
290,1.3394
291,0.9282799999999999
292,0.40002
293,-0.085211
294,-0.43017
295,-0.54678
296,-0.5181
297,-0.45155
298,-0.39688
299,-0.39793
300,-0.51649
301,-0.7427699999999999
302,-1.0028
303,-1.2055
304,-1.2861
305,-1.2101
306,-0.94615
307,-0.56921
308,-0.19923
309,0.102
310,0.28759
311,0.34365999999999997
312,0.26888
313,0.20131
314,0.21341999999999997
315,0.31916
316,0.57117
317,0.8950299999999999
318,1.1746
319,1.2898
320,1.1677
321,0.82837
322,0.36375
323,-0.08090399999999999
324,-0.38816
325,-0.41765
326,-0.18993
327,0.14099
328,0.39995
329,0.44175
330,0.14954
331,-0.41356000000000004
332,-1.0347
333,-1.4929
334,-1.5633
335,-1.1141
336,-0.24588000000000002
337,0.79377
338,1.6634
339,2.0596
340,1.8079
341,0.96394
342,-0.21804
343,-1.3657
344,-2.1622
345,-2.3794
346,-2.0262
347,-1.2877
348,-0.44896
349,0.20808000000000001
350,0.55772
351,0.58525
352,0.41485
353,0.32199
354,0.45221000000000006
355,0.8111
356,1.2899
357,1.6539
358,1.6914
359,1.2502
360,0.47155
361,-0.43066000000000004
362,-1.1456
363,-1.3812
364,-1.0342
365,-0.22204000000000002
366,0.8102699999999999
367,1.6766
368,2.0676
369,1.8059
370,0.95544
371,-0.21058000000000002
372,-1.3126
373,-2.0188
374,-2.0881
375,-1.5404
376,-0.6359
377,0.3241
378,0.97178
379,1.0789
380,0.6722899999999999
381,-0.08151
382,-0.8991399999999999
383,-1.4938
384,-1.6903
385,-1.4806
386,-0.9534
387,-0.25263
388,0.35686999999999997
389,0.74664
390,0.93571
391,0.8887
392,0.8025100000000001
393,0.76851
394,0.7905300000000001
395,0.85103
396,0.8796700000000001
397,0.83116
398,0.69465
399,0.49331
400,0.26104
401,0.1234
402,0.13435
403,0.24672
404,0.40258
405,0.53957
406,0.54098
407,0.35191999999999996
408,-0.0066301
409,-0.43157
410,-0.8927200000000001
411,-1.265
412,-1.4958
413,-1.5717
414,-1.5611
415,-1.4366
416,-1.1974
417,-0.88634
418,-0.49808
419,-0.044419
420,0.44571000000000005
421,0.95334
422,1.3611
423,1.5744
424,1.5546
425,1.3271
426,0.8546299999999999
427,0.2551
428,-0.30295
429,-0.73393
430,-0.9192
431,-0.79779
432,-0.38699
433,0.24404
434,0.96586
435,1.5943
436,1.9432
437,1.9277
438,1.4459
439,0.5592600000000001
440,-0.5223899999999999
441,-1.5683
442,-2.3472
443,-2.6757
444,-2.4713
445,-1.7608
446,-0.70924
447,0.39884000000000003
448,1.3312
449,1.8837
450,1.9339
451,1.462
452,0.6130399999999999
453,-0.35794000000000004
454,-1.2244
455,-1.7436
456,-1.79
457,-1.3517
458,-0.50238
459,0.59821
460,1.7074
461,2.4944
462,2.7698
463,2.5025
464,1.7255
465,0.61216
466,-0.5655100000000001
467,-1.5453
468,-2.1661
469,-2.3193
470,-2.0296
471,-1.4949
472,-0.8809600000000001
473,-0.35843
474,-0.013556
475,0.12922
476,0.20536999999999997
477,0.36501999999999996
478,0.66613
479,1.0741
480,1.5175
481,1.8027
482,1.7179
483,1.2026
484,0.33171
485,-0.68509
486,-1.5551
487,-2.0134
488,-1.962
489,-1.4066
490,-0.52689
491,0.38894
492,1.1114
493,1.4198
494,1.2658
495,0.75962
496,0.15879000000000001
497,-0.35754
498,-0.60196
499,-0.53882
