time,value
0,1.052
1,0.77177
2,0.47886000000000006
3,0.401
4,0.17687999999999998
5,0.29763
6,0.22707
7,-0.082237
8,-0.35209
9,-0.61611
10,-0.35170999999999997
11,-0.11452000000000001
12,0.21277
13,0.30207
14,0.64336
15,0.6622399999999999
16,0.38971999999999996
17,0.23326999999999998
18,0.27447
19,0.0030888
20,0.018765999999999998
21,0.27652
22,0.050227999999999995
23,-0.30095
24,-0.61406
25,-0.6898
26,-0.45616
27,-0.18892
28,0.097366
29,-0.12415999999999999
30,-0.41411000000000003
31,-0.69458
32,-0.93184
33,-1.0411
34,-1.3256
35,-1.6396
36,-1.87
37,-1.9011
38,-1.615
39,-1.3492
40,-1.0661
41,-0.74295
42,-0.58098
43,-0.91617
44,-1.1449
45,-1.3064
46,-1.3130000000000002
47,-1.5898
48,-1.7618
49,-1.5598
50,-1.2821
51,-0.99303
52,-0.7035600000000001
53,-0.39274000000000003
54,-0.076184
55,0.24411999999999998
56,0.57026
57,0.8841600000000001
58,1.2105
59,1.5378
60,1.8658
61,2.1862
62,2.4936
63,2.7974
64,2.8174
65,2.5344
66,2.3414
67,2.0216
68,1.6983
69,1.3756
70,1.0502
71,0.73744
72,0.4155
73,0.093776
74,-0.2213
75,-0.53067
76,-0.8195399999999999
77,-1.107
78,-1.3803
79,-1.6267
80,-1.6529
81,-1.3749
82,-1.2532
83,-0.9812200000000001
84,-0.8808
85,-0.88469
86,-0.78965
87,-0.51658
88,-0.15512
89,-0.22798000000000002
90,-0.45706
91,-0.57996
92,-0.31353000000000003
93,-0.028593
94,-0.0644
95,0.005030300000000001
96,0.15716
97,0.45413000000000003
98,0.74408
99,0.49044
100,0.20976
101,-0.034419
102,-0.19068
103,0.065195
104,0.35759
105,0.6947300000000001
106,0.72609
107,0.48863
108,0.62537
109,0.72291
110,0.77393
111,1.0253
112,0.8811700000000001
113,0.5691
114,0.28399
115,0.30291
116,-0.010083
117,-0.34462
118,-0.23865
119,-0.1351
120,0.09109400000000001
121,0.40326
122,0.41086999999999996
123,0.20699
124,0.42353
125,0.5433100000000001
126,0.75962
127,1.0411
