time,value
0,0.90902
1,0.90902
2,0.90902
3,0.90902
4,0.90902
5,0.90902
6,0.90902
7,0.90902
8,0.90902
9,0.90902
10,0.90902
11,0.90902
12,0.90902
13,0.90902
14,0.90902
15,0.90902
16,0.90902
17,0.90902
18,0.90902
19,0.90902
20,0.90902
21,0.90902
22,0.90902
23,0.90902
24,0.90902
25,0.90902
26,0.90902
27,0.90902
28,0.90902
29,0.90902
30,0.90902
31,0.90902
32,0.90902
33,0.90902
34,0.90902
35,0.90902
36,0.90902
37,0.90902
38,0.90902
39,0.90902
40,0.90902
41,0.90902
42,0.90902
43,0.90902
44,0.90902
45,0.90902
46,0.90902
47,0.90902
48,0.90902
49,0.90902
50,0.90902
51,0.90902
52,0.90902
53,0.90902
54,0.90902
55,0.90902
56,0.90902
57,0.90902
58,0.90902
59,0.90902
60,0.90902
61,0.90902
62,0.90902
63,0.90902
64,0.90902
65,0.93455
66,0.9701799999999999
67,1.0087
68,1.0471
69,1.0856
70,1.1241
71,1.1625
72,1.1945
73,1.2182
74,1.2188
75,1.2188
76,1.2188
77,1.2188
78,1.2188
79,1.2188
80,1.2188
81,1.2414
82,1.276
83,1.3144
84,1.3529
85,1.3914
86,1.4299
87,1.4683
88,1.5017
89,1.5263
90,1.5285
91,1.5285
92,1.5285
93,1.5285
94,1.5285
95,1.5285
96,1.5285
97,1.5285
98,1.5285
99,1.5285
100,1.5261
101,1.5147
102,1.4762
103,1.4377
104,1.4032
105,1.3776
106,1.3736
107,1.3736
108,1.3736
109,1.3531
110,1.3233
111,1.2849
112,1.2464
113,1.1907
114,1.1201
115,1.0432
116,0.96777
117,0.8991600000000001
118,0.86069
119,0.8222200000000001
120,0.78375
121,0.74528
122,0.70681
123,0.66833
124,0.6298600000000001
125,0.59139
126,0.55292
127,0.51445
128,0.47598
129,0.45216000000000006
130,0.44442
131,0.44442
132,0.44442
133,0.44442
134,0.44442
135,0.44442
136,0.44442
137,0.44442
138,0.44442
139,0.44442
140,0.44442
141,0.44442
142,0.44442
143,0.44442
144,0.44442
145,0.43217
146,0.40257
147,0.36451999999999996
148,0.32605
149,0.28757
150,0.2491
151,0.21063
152,0.17215999999999998
153,0.13369
154,0.46098
155,0.26863000000000004
156,0.07627300000000001
157,-0.11607999999999999
158,-0.30843000000000004
159,-0.09713200000000001
160,-0.1356
161,-0.16409
162,-0.17396
163,-0.17506
164,-0.17506
165,-0.17506
166,-0.2118
167,-0.25003000000000003
168,-0.28809
169,-0.31768
170,-0.32993
171,-0.32993
172,-0.32993
173,-0.32993
174,-0.32993
175,-0.32993
176,-0.32993
177,-0.32993
178,-0.32993
179,-0.32993
180,-0.32993
181,-0.32993
182,-0.32993
183,-0.32993
184,-0.32993
185,-0.33766999999999997
186,-0.36149000000000003
187,-0.39996
188,-0.43843000000000004
189,-0.47691000000000006
190,-0.5153800000000001
191,-0.55385
192,-0.59232
193,-0.63079
194,-0.6692600000000001
195,-0.70773
196,-0.7462
197,-0.78467
198,-0.7929999999999999
199,-0.7945300000000001
200,-0.7945300000000001
201,-0.7945300000000001
202,-0.7945300000000001
203,-0.7945300000000001
204,-0.7945300000000001
205,-0.7945300000000001
206,-0.7945300000000001
207,-0.7945300000000001
208,-0.7945300000000001
209,-0.7945300000000001
210,-0.7945300000000001
211,-0.7945300000000001
212,-0.7945300000000001
213,-0.7945300000000001
214,-0.7945300000000001
215,-0.7945300000000001
216,-0.7945300000000001
217,-0.7945300000000001
218,-0.7945300000000001
219,-0.7945300000000001
220,-0.7945300000000001
221,-0.7945300000000001
222,-0.7945300000000001
223,-0.7945300000000001
224,-0.7945300000000001
225,-0.7945300000000001
226,-0.7945300000000001
227,-0.7945300000000001
228,-0.7945300000000001
229,-0.7945300000000001
230,-0.7945300000000001
231,-0.7945300000000001
232,-0.7945300000000001
233,-0.7984100000000001
234,-0.81426
235,-0.8527299999999999
236,-0.8912
237,-0.9296700000000001
238,-0.96814
239,-1.0066
240,-1.0451
241,-1.083
242,-1.0978
243,-1.1043
244,-1.1043
245,-1.1043
246,-1.1255
247,-1.1595
248,-1.198
249,-1.2308
250,-1.2434
251,-1.2049
252,-1.1664
253,-1.1325
254,-1.1073
255,-1.1043
256,-1.1043
257,-1.1043
258,-1.1043
259,-1.1043
260,-1.1043
261,-1.1043
262,-1.1043
263,-1.1043
264,-1.1043
265,-1.1043
266,-1.1043
267,-1.1043
268,-1.1043
269,-1.1077
270,-1.12
271,-1.1536
272,-1.1921
273,-1.2305
274,-1.2690000000000001
275,-1.3075
276,-1.3459
277,-1.3844
278,-1.4069999999999998
279,-1.4140000000000001
280,-1.4140000000000001
281,-1.4140000000000001
282,-1.4140000000000001
283,-1.4140000000000001
284,-1.4140000000000001
285,-1.4140000000000001
286,-1.4140000000000001
287,-1.4140000000000001
288,-1.4140000000000001
289,-1.4140000000000001
290,-1.4140000000000001
291,-1.4140000000000001
292,-1.4140000000000001
293,-1.4140000000000001
294,-1.4140000000000001
295,-1.4140000000000001
296,-1.4140000000000001
297,-1.4140000000000001
298,-1.4140000000000001
299,-1.4140000000000001
300,-1.4140000000000001
301,-1.4140000000000001
302,-1.4140000000000001
303,-1.4140000000000001
304,-1.4140000000000001
305,-1.4140000000000001
306,-1.4140000000000001
307,-1.4140000000000001
308,-1.4140000000000001
309,-1.4140000000000001
310,-1.4140000000000001
311,-1.4140000000000001
312,-1.4140000000000001
313,-1.4140000000000001
314,-1.4140000000000001
315,0.23196
316,0.23196
317,0.23196
318,0.23196
319,0.23196
320,0.23196
321,0.23196
322,0.23196
323,0.23196
324,0.23196
325,0.23196
326,0.23196
327,0.23196
328,0.23196
329,0.23196
330,0.23196
331,0.23196
332,0.23196
333,0.23196
334,0.23196
335,0.23196
336,0.23196
337,0.23196
338,0.23196
339,0.23196
340,0.23196
341,0.23196
342,0.23196
343,0.23196
344,0.23196
345,0.23196
346,0.23196
347,0.23196
348,0.23196
349,0.23196
350,0.23196
351,0.23196
352,0.23196
353,0.23196
354,0.23196
355,0.23196
356,0.23196
357,0.23196
358,0.23196
359,0.23196
360,0.23196
361,0.23196
362,0.23196
363,0.23196
364,0.23196
365,0.23196
366,0.23196
367,0.23196
368,0.23196
369,0.23196
370,0.23196
371,0.23196
372,0.23196
373,0.23196
374,0.23196
375,0.23767
376,0.28492
377,0.34869
378,0.42096000000000006
379,0.49322
380,0.5654899999999999
381,0.63775
382,0.71002
383,0.77394
384,0.8137800000000001
385,0.8137800000000001
386,0.8137800000000001
387,0.8259299999999999
388,0.8537299999999999
389,0.92496
390,0.9972200000000001
391,1.0695
392,1.1417
393,1.214
394,1.2863
395,1.3585
396,1.4308
397,1.5031
398,1.5753
399,1.6476
400,1.7199
401,1.7921
402,1.8644
403,1.9269999999999998
404,1.9733
405,1.9774
406,1.9774
407,1.9774
408,1.9343
409,1.8755
410,1.8032
411,1.7309999999999999
412,1.696
413,1.6865
414,1.6865
415,1.6865
416,1.6865
417,1.6865
418,1.6865
419,1.6865
420,1.6865
421,1.6865
422,1.6865
423,1.6865
424,1.6865
425,1.6865
426,1.6865
427,1.6865
428,1.6542
429,1.5939
430,1.5216
431,1.4493
432,1.3771
433,1.3048
434,1.2325
435,1.1657
436,1.1156
437,1.1047
438,1.1047
439,1.1047
440,1.0704
441,1.0176
442,0.94534
443,0.8730700000000001
444,0.8283299999999999
445,0.8137800000000001
446,0.8137800000000001
447,0.8137800000000001
448,0.8137800000000001
449,0.8137800000000001
450,0.8137800000000001
451,0.81018
452,0.7898
453,0.73225
454,0.65999
455,0.58772
456,0.54567
457,0.52287
458,0.52287
459,0.52287
460,0.52287
461,0.52287
462,0.52287
463,0.52287
464,0.52287
465,0.52287
466,0.52287
467,0.52287
468,0.52287
469,0.52287
470,0.52287
471,0.52287
472,0.49648000000000003
473,0.45061
474,0.37834
475,0.30608
476,0.25256
477,0.23403000000000002
478,0.23196
479,0.23196
480,0.23196
481,0.23196
482,0.23196
483,0.23118000000000002
484,0.21450999999999998
485,0.16525
486,0.44981000000000004
487,0.08849
488,-0.15883
489,-0.30989
490,-0.30989
491,-0.30989
492,-0.30989
493,-0.30989
494,-0.30989
495,-0.30989
496,-0.30989
497,-0.30989
498,-0.30989
499,-0.30989
500,-0.30989
501,-0.30989
502,-0.30989
503,-0.30989
504,-0.40717
505,-0.11639000000000001
506,-0.18866
507,-0.26092
508,-0.32225
509,-0.34449
510,-0.34986
511,-0.34986
512,-0.34986
513,-0.34986
514,-0.34986
515,-0.34986
516,-0.34986
517,-0.34986
518,-0.34986
519,-0.34986
520,-0.36622
521,-0.39989
522,-0.47216
523,-0.54442
524,-0.60929
525,-0.63338
526,-0.64077
527,-0.64077
528,-0.64077
529,-0.64077
530,-0.64077
531,-0.64077
532,-0.63131
533,-0.5963
534,-0.52404
535,-0.45177
536,-0.39299999999999996
537,-0.34986
538,-0.34986
539,-0.34986
540,-0.34986
541,-0.34986
542,-0.34986
543,-0.34986
544,-0.34986
545,-0.39505999999999997
546,-0.46103999999999995
547,-0.5333
548,-0.59829
549,-0.64077
550,-0.64077
551,-0.64077
552,-0.64077
553,-0.64077
554,-0.64077
555,-0.64077
556,-0.64181
557,-0.68628
558,-0.74639
559,-0.81866
560,-0.89092
561,-0.9631799999999999
562,-1.0354
563,-1.1077
564,-1.1746
565,-1.2226
566,-1.2226
567,-1.2226
568,-1.2226
569,-1.2226
570,-1.2226
571,-1.2226
572,-1.2226
573,-1.1818
574,-1.1244
575,-1.0521
576,-0.9798600000000001
577,-0.97706
578,-1.028
579,-1.1003
580,-1.1689
581,-1.2226
582,-1.2226
583,-1.2226
584,-1.2226
585,-1.2226
586,-1.2226
587,-1.2226
588,-1.2226
589,-1.2226
590,-1.2226
591,-1.2226
592,-1.2226
593,-1.2226
594,-1.2226
595,-1.2226
596,-1.2248
597,-1.2374
598,-1.3097
599,-1.3819
600,-1.4498
601,-1.5007
602,-1.5135
603,-1.5135
604,-1.5135
605,-1.5457
606,-1.5969
607,-1.6692
608,-1.7414
609,-1.7884
610,-1.8042
611,-1.8044
612,-1.8044
613,-1.8044
614,-1.8044
615,-1.8044
616,-1.8044
617,-1.8044
618,-1.8044
619,-1.8044
620,-1.8044
621,-1.8044
622,-1.8044
623,-1.8044
624,-1.8044
625,-1.8044
626,-1.8044
627,-1.8044
628,-1.8044
629,-1.8044
630,0.28664
631,0.28664
632,0.28664
633,0.28664
634,0.28664
635,0.28664
636,0.28664
637,0.28664
638,0.28664
639,0.28664
640,0.28664
641,0.28664
642,0.28664
643,0.28664
644,0.28664
645,0.28664
646,0.28664
647,0.28664
648,0.28664
649,0.28664
650,0.28664
651,0.28664
652,0.28664
653,0.28664
654,0.28664
655,0.28664
656,0.28664
657,0.28664
658,0.28664
659,0.28664
660,0.28664
661,0.28664
662,0.28664
663,0.28664
664,0.28664
665,0.28664
666,0.28664
667,0.28664
668,0.28664
669,0.28664
670,0.28664
671,0.28664
672,0.28664
673,0.28664
674,0.28664
675,0.28664
676,0.28664
677,0.28664
678,0.28664
679,0.19238
680,0.34425
681,-0.29028000000000004
682,-0.16325
683,-0.22424000000000002
684,-0.22424000000000002
685,-0.22424000000000002
686,-0.22424000000000002
687,-0.22424000000000002
688,-0.22424000000000002
689,-0.22424000000000002
690,-0.22424000000000002
691,-0.22424000000000002
692,-0.22424000000000002
693,-0.22424000000000002
694,-0.22424000000000002
695,-0.30846999999999997
696,-0.42599
697,-0.5529
698,-0.6651600000000001
699,-0.7351300000000001
700,-0.7351300000000001
701,-0.7351300000000001
702,-0.7351300000000001
703,-0.7351300000000001
704,-0.7351300000000001
705,-0.7351300000000001
706,-0.7351300000000001
707,-0.7351300000000001
708,-0.7351300000000001
709,-0.7351300000000001
710,-0.7351300000000001
711,-0.7351300000000001
712,-0.7351300000000001
713,-0.7351300000000001
714,-0.74616
715,-0.7937
716,-0.92061
717,-1.0475
718,-1.1575
719,-1.2388
720,-1.246
721,-1.246
722,-1.246
723,-1.246
724,-1.246
725,-1.246
726,-1.246
727,-1.246
728,-1.246
729,-1.246
730,-1.246
731,-1.246
732,-1.246
733,-1.246
734,-1.246
735,-1.246
736,-1.246
737,-1.246
738,-1.246
739,-1.246
740,-1.246
741,-1.246
742,-1.246
743,-1.246
744,-1.246
745,-1.246
746,-1.246
747,-1.246
748,-1.246
749,-1.246
750,-1.246
751,-1.246
752,-1.246
753,-1.246
754,-1.246
755,-1.3062
756,-1.3989
757,-1.5259
758,-1.6528
759,-1.7313
760,-1.7569
761,-1.7569
762,-1.7569
763,-1.7569
764,-1.7569
765,-1.7569
766,-1.7569
767,-1.7569
768,-1.7569
769,-1.7569
770,-1.7569
771,-1.7569
772,-1.7569
773,-1.7569
774,-1.7569
775,-1.6357
776,-1.3428
777,-0.96616
778,-0.58865
779,-0.23075
780,-0.35766
781,-0.48456000000000005
782,-0.6078399999999999
783,-0.70221
784,-0.7351300000000001
785,-0.7351300000000001
786,-0.7351300000000001
787,-0.68879
788,-0.60822
789,-0.48131
790,-0.3544
791,-0.29333000000000004
792,-0.35516
793,-0.4748
794,-0.6017100000000001
795,-0.7286199999999999
796,-0.73432
797,-0.7351300000000001
798,-0.7351300000000001
799,-0.7351300000000001
800,-0.7351300000000001
801,-0.7351300000000001
802,-0.7351300000000001
803,-0.7351300000000001
804,-0.7351300000000001
805,-0.7351300000000001
806,-0.7351300000000001
807,-0.7351300000000001
808,-0.7351300000000001
809,-0.7351300000000001
810,-0.7351300000000001
811,-0.7351300000000001
812,-0.7351300000000001
813,-0.7351300000000001
814,-0.7351300000000001
815,-0.70958
816,-0.631
817,-0.5040899999999999
818,-0.37718
819,-0.28444
820,-0.22424000000000002
821,-0.22424000000000002
822,-0.22424000000000002
823,-0.20503000000000002
824,-0.11717999999999999
825,-0.11270999999999999
826,0.1272
827,0.2541
828,0.28157
829,0.28664
830,0.28664
831,0.28664
832,0.28664
833,0.28664
834,0.28664
835,0.28664
836,0.28664
837,0.28664
838,0.28664
839,0.28664
840,0.28664
841,0.28664
842,0.28664
843,0.28664
844,0.28664
845,0.28664
846,0.28664
847,0.27002
848,0.20855
849,0.39305999999999996
850,-0.24147
851,-0.12479000000000001
852,-0.1494
853,-0.12758
854,0.10442
855,0.22414
856,0.26969
857,0.28664
858,0.28664
859,0.28664
860,0.36601
861,0.48188000000000003
862,0.6087899999999999
863,0.74849
864,0.92769
865,1.1815
866,1.4353
867,1.6509
868,1.8104
869,1.8193
870,1.8193
871,1.8193
872,1.8193
873,1.8193
874,1.8193
875,1.8193
876,1.7493
877,1.6371
878,1.5102
879,1.3926
880,1.3084
881,1.3084
882,1.3084
883,1.3084
884,1.3084
885,1.3084
886,1.3084
887,1.3084
888,1.2367
889,1.1359
890,1.0090000000000001
891,0.88213
892,0.81622
893,0.7975300000000001
894,0.7975300000000001
895,0.7975300000000001
896,0.7975300000000001
897,0.7975300000000001
898,0.7975300000000001
899,0.8086899999999999
900,0.8493700000000001
901,0.9602299999999999
902,1.0871
903,1.214
904,1.2770000000000001
905,1.3084
906,1.3084
907,1.3084
908,1.3609
909,1.4646
910,1.5915
911,1.7146
912,1.8193
913,1.8193
914,1.8193
915,1.8193
916,1.8193
917,1.8193
918,1.8193
919,1.8193
920,1.8193
921,1.8193
922,1.8193
923,1.8193
924,1.775
925,1.6757
926,1.5492
927,1.4240000000000002
928,1.3084
929,1.3084
930,1.3084
931,1.3035
932,1.2693
933,1.1717
934,1.0448
935,0.9179299999999999
936,0.8406600000000001
937,0.7975300000000001
938,0.7975300000000001
939,0.7975300000000001
940,0.7975300000000001
941,0.7975300000000001
942,0.7975300000000001
943,0.7975300000000001
944,0.7975300000000001
