time,value
0,-1.6594
1,-1.5763
2,-1.3549
3,-1.0247
4,-0.63841
5,-0.2414
6,0.1471
7,0.50775
8,0.8371200000000001
9,1.1213
10,1.3535
11,1.5023
12,1.5325
13,1.4308
14,1.1894
15,0.82344
16,0.38424
17,-0.067525
18,-0.47211000000000003
19,-0.78266
20,-0.95836
21,-0.99274
22,-0.91199
23,-0.76682
24,-0.6008
25,-0.43687
26,-0.2731
27,-0.10116
28,0.069837
29,0.23890999999999998
30,0.39608000000000004
31,0.50854
32,0.55245
33,0.50616
34,0.37126
35,0.17439000000000002
36,-0.041806
37,-0.23589000000000002
38,-0.36229
39,-0.39693
40,-0.34783000000000003
41,-0.23976
42,-0.10672000000000001
43,0.004278499999999999
44,0.07916799999999999
45,0.11964000000000001
46,0.13725
47,0.14390999999999998
48,0.14579
49,0.15082
50,0.14196
51,0.10425999999999999
52,0.02443
53,-0.087851
54,-0.20459000000000002
55,-0.28814
56,-0.29286
57,-0.19145
58,-0.0010557000000000001
59,0.23321
60,0.44814
61,0.55619
62,0.51598
63,0.30529
64,-0.032746
65,-0.43438000000000004
66,-0.8091
67,-1.0729
68,-1.1622
69,-1.0682
70,-0.81087
71,-0.44304
72,-0.022126
73,0.38672
74,0.76202
75,1.0691
76,1.2948
77,1.4296
78,1.4566
79,1.3507
80,1.0923
81,0.69627
82,0.17947000000000002
83,-0.39752
84,-0.9537700000000001
85,-1.4147
86,-1.714
87,-1.8123
88,-1.7079
89,-1.4293
90,-1.0190000000000001
91,-0.53155
92,-0.024508000000000002
93,0.43868
94,0.82715
95,1.1164
96,1.2977
97,1.357
98,1.3126
99,1.1811
100,0.9729399999999999
101,0.71285
102,0.4099
103,0.087234
104,-0.24388
105,-0.56808
106,-0.8627
107,-1.0996
108,-1.2493
109,-1.2962
110,-1.2304
111,-1.0589
112,-0.79965
113,-0.49175
114,-0.16178
115,0.15277000000000002
116,0.44218
117,0.68399
118,0.86215
119,0.9754700000000001
120,1.0204
121,0.9828899999999999
122,0.8627299999999999
123,0.66766
124,0.43868
125,0.21855
126,0.047317000000000005
127,-0.058809
128,-0.093012
129,-0.078289
130,-0.060949
131,-0.080689
132,-0.16688
133,-0.33851
134,-0.56785
135,-0.79204
136,-0.95295
137,-1.008
138,-0.9220299999999999
139,-0.71986
140,-0.4569
141,-0.1984
142,0.0019447
143,0.11598
144,0.16155999999999998
145,0.18523
146,0.24198000000000003
147,0.3834
148,0.63731
149,0.9803299999999999
150,1.3336
151,1.6116
152,1.7121
153,1.5768
154,1.1893
155,0.5747
156,-0.17499
157,-0.94816
158,-1.64
159,-2.1615
160,-2.444
161,-2.4632
162,-2.2199
163,-1.7576
164,-1.1340000000000001
165,-0.41275
166,0.33482
167,1.0406
168,1.6417
169,2.0646
170,2.2727
171,2.2604
172,2.0283
173,1.6067
174,1.0598
175,0.45206999999999997
176,-0.14396
177,-0.6693100000000001
178,-1.0843
179,-1.3728
180,-1.5176
181,-1.5276
182,-1.416
183,-1.1896
184,-0.8733299999999999
185,-0.48691
186,-0.061391999999999995
187,0.35741
188,0.71008
189,0.9571299999999999
190,1.0761
191,1.05
192,0.89607
193,0.65258
194,0.35962
195,0.066163
196,-0.19902999999999998
197,-0.42581
198,-0.59739
199,-0.69953
200,-0.73993
201,-0.6946
202,-0.55607
203,-0.3182
204,-0.01379
205,0.31506
206,0.61588
207,0.8389200000000001
208,0.9281799999999999
209,0.8539200000000001
210,0.64315
211,0.3336
212,-0.019523
213,-0.35603
214,-0.6318
215,-0.81676
216,-0.90075
217,-0.8922700000000001
218,-0.80753
219,-0.6577
220,-0.45688999999999996
221,-0.22085
222,0.05884299999999999
223,0.34792
224,0.61964
225,0.8424200000000001
226,0.9731799999999999
227,0.99279
228,0.90635
229,0.73106
230,0.5029100000000001
231,0.27296
232,0.06905800000000001
233,-0.082969
234,-0.18028
235,-0.24991
236,-0.32545
237,-0.4307
238,-0.5784100000000001
239,-0.77322
240,-0.9843700000000001
241,-1.159
242,-1.2555
243,-1.2176
244,-1.0225
245,-0.66414
246,-0.16634000000000002
247,0.41895
248,1.011
249,1.5123
250,1.84
251,1.9332
252,1.7703
253,1.3866
254,0.8444299999999999
255,0.25073
256,-0.2694
257,-0.6170899999999999
258,-0.7439899999999999
259,-0.64954
260,-0.37711
261,-0.026842
262,0.27416999999999997
263,0.41498
264,0.34552
265,0.054265999999999995
266,-0.41313999999999995
267,-0.9479700000000001
268,-1.4488
269,-1.8090000000000002
270,-1.9418
271,-1.8192
272,-1.4731
273,-0.9467899999999999
274,-0.30796999999999997
275,0.37373
276,1.0259
277,1.6066
278,2.074
279,2.3814
280,2.5047
281,2.4108
282,2.0976
283,1.5883
284,0.93075
285,0.20384000000000002
286,-0.5120100000000001
287,-1.1233
288,-1.5809
289,-1.8565
290,-1.9632
291,-1.9372
292,-1.8221
293,-1.6554
294,-1.4592
295,-1.2328
296,-0.95036
297,-0.58628
298,-0.12977
299,0.4052
300,0.96929
301,1.5016
302,1.9151
303,2.1555
304,2.1946
305,2.0404
306,1.7286
307,1.2932
308,0.78913
309,0.27560999999999997
310,-0.20619
311,-0.63941
312,-0.99223
313,-1.2432
314,-1.3839
315,-1.4044
316,-1.3234
317,-1.1574
318,-0.95468
319,-0.7509
320,-0.59525
321,-0.49656000000000006
322,-0.4476
323,-0.43993000000000004
324,-0.41703999999999997
325,-0.33625
326,-0.17828
327,0.07801799999999999
328,0.41697
329,0.7892899999999999
330,1.1397
331,1.4136
332,1.5730000000000002
333,1.6006
334,1.4998
335,1.2939
336,1.0199
337,0.71926
338,0.41543
339,0.12147000000000001
340,-0.15822
341,-0.41276999999999997
342,-0.6632899999999999
343,-0.89265
344,-1.097
345,-1.2567
346,-1.3412
347,-1.3354
348,-1.2403
349,-1.0485
350,-0.78704
351,-0.5013
352,-0.22579000000000002
353,0.01524
354,0.19977
355,0.33914
356,0.43545
357,0.51448
358,0.57834
359,0.6451899999999999
360,0.71265
361,0.76174
362,0.7811600000000001
363,0.75764
364,0.68237
365,0.55033
366,0.37303000000000003
367,0.15394000000000002
368,-0.10173
369,-0.37182
370,-0.63871
371,-0.87328
372,-1.0284
373,-1.0435
374,-0.8811200000000001
375,-0.5391600000000001
376,-0.055291999999999994
377,0.51058
378,1.0405
379,1.413
380,1.5507
381,1.4036
382,0.99121
383,0.39311999999999997
384,-0.27726
385,-0.89144
386,-1.3504
387,-1.5867
388,-1.6004
389,-1.4133
390,-1.0819
391,-0.6824100000000001
392,-0.28012
393,0.08766399999999999
394,0.39819
395,0.64467
396,0.83324
397,0.9596899999999999
398,1.0042
399,0.9672
400,0.84578
401,0.6472899999999999
402,0.39997
403,0.14719000000000002
404,-0.079152
405,-0.25453000000000003
406,-0.36426
407,-0.41701000000000005
408,-0.40953
409,-0.36789
410,-0.31545
411,-0.24706
412,-0.16798
413,-0.083369
414,-0.007892
415,0.047221
416,0.073384
417,0.055836000000000004
418,-0.013956999999999999
419,-0.13132
420,-0.28346
421,-0.42817
422,-0.53152
423,-0.55957
424,-0.50071
425,-0.35418
426,-0.1281
427,0.16002
428,0.46988
429,0.7647
430,1.02
431,1.2107
432,1.3319999999999999
433,1.3603
434,1.2772
435,1.0653
436,0.71763
437,0.24856
438,-0.30705
439,-0.87985
440,-1.3906
441,-1.7708
442,-1.9983
443,-2.0303
444,-1.8692
445,-1.569
446,-1.1775
447,-0.74997
448,-0.3213
449,0.088939
450,0.46168000000000003
451,0.7977
452,1.1043
453,1.3669
454,1.5545
455,1.6415
456,1.609
457,1.4619
458,1.2269
459,0.9425600000000001
460,0.65056
461,0.39347
462,0.1834
463,0.011885
464,-0.14302
465,-0.32203000000000004
466,-0.54627
467,-0.83088
468,-1.1522
469,-1.473
470,-1.7349
471,-1.8845
472,-1.8757
473,-1.6926
474,-1.3432
475,-0.86766
476,-0.30992
477,0.28026999999999996
478,0.83275
479,1.3001
480,1.6487
481,1.8389
482,1.8493
483,1.6744
484,1.3286
485,0.866
486,0.37101
487,-0.051272000000000005
488,-0.30399
489,-0.32115
490,-0.11864000000000001
491,0.22041
492,0.58406
493,0.8214299999999999
494,0.8012
495,0.45747
496,-0.1859
497,-1.0187
498,-1.8932
499,-2.6259
