time,value
0,2.1461
1,2.1387
2,2.0133
3,1.7802
4,1.4582
5,1.0722
6,0.65167
7,0.22814
8,-0.16721
9,-0.50603
10,-0.76502
11,-0.92743
12,-0.9843
13,-0.9347799999999999
14,-0.78596
15,-0.55193
16,-0.25239
17,0.089164
18,0.44743
19,0.7973399999999999
20,1.1161
21,1.3846
22,1.5889
23,1.7209999999999999
24,1.7786
25,1.7656
26,1.6908
27,1.567
28,1.4099
29,1.2362
30,1.0625
31,0.9037700000000001
32,0.7723899999999999
33,0.67699
34,0.62216
35,0.60827
36,0.63165
37,0.68512
38,0.75888
39,0.8414
40,0.92055
41,0.98472
42,1.0238
43,1.0301
44,0.9988100000000001
45,0.92861
46,0.8214600000000001
47,0.6825100000000001
48,0.51951
49,0.34210999999999997
50,0.16095
51,-0.013305
52,-0.1709
53,-0.30383000000000004
54,-0.4065
55,-0.4762
56,-0.51321
57,-0.52069
58,-0.50431
59,-0.47163999999999995
60,-0.43133
61,-0.39227
62,-0.36274
63,-0.34959
64,-0.3577
65,-0.38944
66,-0.44466000000000006
67,-0.52071
68,-0.61285
69,-0.7148100000000001
70,-0.81942
71,-0.9194399999999999
72,-1.0082
73,-1.0805
74,-1.1327
75,-1.1631
76,-1.1723
77,-1.1627
78,-1.1382
79,-1.104
80,-1.0654
81,-1.0277
82,-0.9955200000000001
83,-0.9723700000000001
84,-0.9602200000000001
85,-0.95957
86,-0.96941
87,-0.9875299999999999
88,-1.0108
89,-1.0357
90,-1.0587
91,-1.0778
92,-1.0891
93,-1.0913
94,-1.0845
95,-1.0695
96,-1.0484
97,-1.0236
98,-0.9981
