time,value
0,-0.4639
1,-0.4559
2,-0.42611000000000004
3,-0.41763999999999996
4,-0.46721999999999997
5,-0.58448
6,-0.74775
7,-0.8890399999999999
8,-0.94785
9,-0.8825700000000001
10,-0.65685
11,-0.28105
12,0.18681
13,0.66757
14,1.1045
15,1.4121
16,1.5407
17,1.495
18,1.2904
19,0.9635100000000001
20,0.55184
21,0.11721
22,-0.30927
23,-0.69207
24,-0.99556
25,-1.1852
26,-1.2499
27,-1.1881
28,-1.0029
29,-0.75174
30,-0.47952
31,-0.23864000000000002
32,-0.062513
33,0.025567
34,0.029985
35,0.019402000000000003
36,0.030726999999999997
37,0.10819000000000001
38,0.28169
39,0.5453399999999999
40,0.8651399999999999
41,1.175
42,1.4167
43,1.5338
44,1.4758
45,1.2347
46,0.82475
47,0.27204
48,-0.37019
49,-1.0421
50,-1.6454
51,-2.1093
52,-2.3641
53,-2.3478
54,-2.0624
55,-1.5268
56,-0.8233799999999999
57,-0.040326
58,0.71025
59,1.3284
60,1.7684
61,1.9944
62,2.0099
63,1.8527
64,1.5709
65,1.2052
66,0.78462
67,0.3541
68,-0.067177
69,-0.46057
70,-0.80687
71,-1.0642
72,-1.2451
73,-1.3349
74,-1.3453
75,-1.2954
76,-1.1948
77,-1.0611
78,-0.87385
79,-0.63083
80,-0.31629
81,0.077001
82,0.52263
83,0.9812799999999999
84,1.3805
85,1.6761
86,1.8163
87,1.7713
88,1.545
89,1.1681
90,0.67203
91,0.11838
92,-0.425
93,-0.9055799999999999
94,-1.2858
95,-1.541
96,-1.6319
97,-1.5675
98,-1.3619999999999999
99,-1.0436
100,-0.65972
101,-0.2564
102,0.10339000000000001
103,0.39863000000000004
104,0.6100399999999999
105,0.73955
106,0.81502
107,0.85482
108,0.87536
109,0.88333
110,0.88292
111,0.84116
112,0.72812
113,0.54568
114,0.28636
115,-0.036607
116,-0.40574
117,-0.76034
118,-1.0731
119,-1.3024
120,-1.4063
121,-1.3694
122,-1.1973
123,-0.9103899999999999
124,-0.53405
125,-0.11778
126,0.29406
127,0.6601
128,0.95424
129,1.1496
130,1.244
131,1.2312
132,1.1205
133,0.92032
134,0.6544800000000001
135,0.36585
136,0.074167
137,-0.19463
138,-0.41435
139,-0.58104
140,-0.6967399999999999
141,-0.77774
142,-0.8387399999999999
143,-0.8780100000000001
144,-0.90081
145,-0.8959299999999999
146,-0.8390299999999999
147,-0.70981
148,-0.5061
149,-0.21733000000000002
150,0.13575
151,0.5192
152,0.8922399999999999
153,1.2203
154,1.4768
155,1.6159
156,1.6194
157,1.4703
158,1.1469
159,0.66073
160,0.049573
161,-0.62961
162,-1.2912
163,-1.8272
164,-2.1532
165,-2.2232
166,-2.0243
167,-1.5815
168,-0.98516
169,-0.32385
170,0.3243
171,0.88712
172,1.3175
173,1.6091
174,1.7555
175,1.7601
176,1.6234
177,1.361
178,0.9922200000000001
179,0.5402399999999999
180,0.07331
181,-0.35978000000000004
182,-0.7034600000000001
183,-0.9352600000000001
184,-1.051
185,-1.0729
186,-1.062
187,-1.054
188,-1.069
189,-1.0937
190,-1.091
191,-0.9952700000000001
192,-0.75803
193,-0.37635
194,0.12917
195,0.69
196,1.2135
197,1.5956
198,1.7727
199,1.7278
200,1.469
201,1.0535
202,0.5691
203,0.10022
204,-0.29805
205,-0.5867100000000001
206,-0.75025
207,-0.82386
208,-0.81791
209,-0.74943
210,-0.65395
211,-0.55455
212,-0.45037
213,-0.33985
214,-0.23965999999999998
215,-0.15750999999999998
216,-0.084833
217,-0.010289
218,0.054028
219,0.13147999999999999
220,0.22865
221,0.3309
222,0.43371000000000004
223,0.51512
224,0.56401
225,0.54368
226,0.46187
227,0.3199
228,0.12205999999999999
229,-0.09766799999999999
230,-0.28986
231,-0.43501999999999996
232,-0.50088
233,-0.48933999999999994
234,-0.39735
235,-0.2659
236,-0.14115999999999998
237,-0.049155000000000004
238,-0.00037658
239,-0.0091444
240,-0.034008
241,-0.060693
242,-0.073812
243,-0.055929
244,-0.019438
245,0.047218
246,0.11044000000000001
247,0.17762999999999998
248,0.2401
249,0.29834
250,0.35298
251,0.38998
252,0.40571
253,0.36893000000000004
254,0.2736
255,0.10645999999999999
256,-0.1106
257,-0.361
258,-0.59178
259,-0.7532399999999999
260,-0.8192
261,-0.7730100000000001
262,-0.62732
263,-0.41085
264,-0.16644
265,0.07967300000000001
266,0.3205
267,0.5302600000000001
268,0.69613
269,0.83029
270,0.91107
271,0.90756
272,0.80997
273,0.6031
274,0.27469
275,-0.14225
276,-0.5888800000000001
277,-0.9950700000000001
278,-1.3209
279,-1.4995
280,-1.5004
281,-1.3314
282,-1.0065
283,-0.56262
284,-0.042296
285,0.49851
286,0.99846
287,1.415
288,1.6922
289,1.8025
290,1.7446
291,1.5262
292,1.1851
293,0.76526
294,0.3159
295,-0.1172
296,-0.52059
297,-0.86818
298,-1.1698
299,-1.4372
300,-1.6574
301,-1.8103
302,-1.8552
303,-1.7747
304,-1.5588
305,-1.2016
306,-0.74369
307,-0.22915
308,0.31335
309,0.83136
310,1.2997
311,1.7079
312,2.0472
313,2.2922
314,2.4056
315,2.3446
316,2.0859
317,1.6045
318,0.9397
319,0.16856
320,-0.60368
321,-1.2745
322,-1.7628
323,-2.0235
324,-2.0693
325,-1.9516
326,-1.7244
327,-1.4688
328,-1.2165
329,-0.97564
330,-0.72749
331,-0.45874
332,-0.15273
333,0.20608
334,0.58945
335,0.9508
336,1.2715
337,1.5105
338,1.6402
339,1.6411
340,1.5178
341,1.265
342,0.8973899999999999
343,0.45016000000000006
344,-0.028592000000000003
345,-0.48426
346,-0.86277
347,-1.1183
348,-1.2239
349,-1.1721
350,-0.99366
351,-0.7241
352,-0.41518
353,-0.11934000000000002
354,0.14626
355,0.34849
356,0.4977
357,0.58148
358,0.6188600000000001
359,0.60309
360,0.52408
361,0.40504
362,0.24094000000000002
363,0.049457999999999995
364,-0.15024
365,-0.34575
366,-0.51756
367,-0.67629
368,-0.8071
369,-0.88497
370,-0.9190799999999999
371,-0.88076
372,-0.75844
373,-0.55787
374,-0.28991
375,0.02046
376,0.3385
377,0.61579
378,0.8236899999999999
379,0.96725
380,1.0517
381,1.1084
382,1.1597
383,1.2094
384,1.2454
385,1.2344
386,1.1359
387,0.9361
388,0.62417
389,0.22021
390,-0.23501
391,-0.71014
392,-1.1504
393,-1.5444
394,-1.8611
395,-2.085
396,-2.2098
397,-2.2012
398,-2.0487
399,-1.7281
400,-1.2376
401,-0.6190100000000001
402,0.082676
403,0.77515
404,1.3808
405,1.8473
406,2.1106
407,2.1943
408,2.0966
409,1.8693
410,1.5572
411,1.1927
412,0.8264100000000001
413,0.46286000000000005
414,0.12722
415,-0.17569
416,-0.43046999999999996
417,-0.6529699999999999
418,-0.8262700000000001
419,-0.96815
420,-1.0733
421,-1.1486
422,-1.1708
423,-1.1237
424,-1.0046
425,-0.78158
426,-0.49538999999999994
427,-0.1701
428,0.14293
429,0.39403
430,0.56066
431,0.61928
432,0.60035
433,0.54609
434,0.46806000000000003
435,0.41678000000000004
436,0.39914
437,0.3935
438,0.38971
439,0.35766
440,0.29459
441,0.19368
442,0.075894
443,-0.044139
444,-0.15029
445,-0.24856999999999999
446,-0.35201
447,-0.46703
448,-0.59363
449,-0.71659
450,-0.8144600000000001
451,-0.82399
452,-0.72907
453,-0.5007
454,-0.15215
455,0.25263
456,0.6664800000000001
457,0.9959
458,1.2113
459,1.2705
460,1.1859
461,1.0138
462,0.77705
463,0.52803
464,0.29538000000000003
465,0.086344
466,-0.10514000000000001
467,-0.28975
468,-0.47773000000000004
469,-0.64957
470,-0.81045
471,-0.9263399999999999
472,-0.99472
473,-1.0136
474,-0.96639
475,-0.8829600000000001
476,-0.74474
477,-0.58644
478,-0.39278
479,-0.15434
480,0.11067
481,0.40578000000000003
482,0.69415
483,0.9479700000000001
484,1.1275
485,1.1993
486,1.1622
487,1.0118
488,0.77967
489,0.5151100000000001
490,0.25515
491,0.041483
492,-0.09259500000000001
493,-0.14529
494,-0.12688
495,-0.057257
496,0.030581999999999998
497,0.09311900000000001
498,0.095562
499,0.012454999999999999
