time,value
0,-1.1223
1,-1.067
2,-1.0142
3,-0.9703
4,-0.9234899999999999
5,-0.86626
6,-0.79723
7,-0.72658
8,-0.65705
9,-0.58311
10,-0.5008
11,-0.40876
12,-0.31390999999999997
13,-0.21823
14,-0.124
15,-0.033557
16,0.052283
17,0.1328
18,0.21329
19,0.29552
20,0.37714000000000003
21,0.45083
22,0.50842
23,0.54618
24,0.5623
25,0.55814
26,0.5351600000000001
27,0.49582
28,0.4421
29,0.37459000000000003
30,0.29549000000000003
31,0.20831
32,0.12264000000000001
33,0.047583
34,-0.0095405
35,-0.047693
36,-0.07365
37,-0.097072
38,-0.13363
39,-0.1928
40,-0.27876
41,-0.3835
42,-0.49023
43,-0.58739
44,-0.66346
45,-0.72095
46,-0.76126
47,-0.78781
48,-0.80552
49,-0.81376
50,-0.81966
51,-0.8212799999999999
52,-0.8210700000000001
53,-0.81968
54,-0.81552
55,-0.8142699999999999
56,-0.8117800000000001
57,-0.81048
58,-0.8072699999999999
59,-0.79913
60,-0.78563
61,-0.76161
62,-0.72963
63,-0.68781
64,-0.6401
65,-0.58999
66,-0.5374
67,-0.4836
68,-0.42283999999999994
69,-0.35451
70,-0.28006
71,-0.20515
72,-0.13712
73,-0.07836699999999999
74,-0.028030000000000003
75,0.019469999999999998
76,0.066461
77,0.11080999999999999
78,0.14556
79,0.16213
80,0.15743
81,0.13248
82,0.094932
83,0.053114999999999996
84,0.013279
85,-0.020743
86,-0.052207
87,-0.083496
88,-0.12043
89,-0.1671
90,-0.22688000000000003
91,-0.30532
92,-0.4015
93,-0.51439
94,-0.6321
95,-0.74157
96,-0.8317200000000001
97,-0.8943200000000001
98,-0.9337700000000001
99,-0.9506399999999999
100,-0.95189
101,-0.93889
102,-0.91285
103,-0.8769899999999999
104,-0.83067
105,-0.7803
106,-0.72446
107,-0.66542
108,-0.60347
109,-0.53779
110,-0.47373000000000004
111,-0.40856
112,-0.34349
113,-0.27312
114,-0.19444
115,-0.11144000000000001
116,-0.028568
117,0.040268
118,0.08894400000000001
119,0.111
120,0.10397
121,0.072173
122,0.019281
123,-0.040319
124,-0.094171
125,-0.12907000000000002
126,-0.13805
127,-0.1259
128,-0.098086
129,-0.068523
130,-0.039909
131,-0.014731000000000001
132,0.008402600000000001
133,0.034634
134,0.059726
135,0.088488
136,0.11477000000000001
137,0.1406
138,0.16639
139,0.1886
140,0.21338000000000001
141,0.23095
142,0.24891999999999997
143,0.26441
144,0.28102
145,0.30644
146,0.3356
147,0.37776
148,0.42646999999999996
149,0.48917
150,0.56868
151,0.66282
152,0.7773800000000001
153,0.90374
154,1.0492
155,1.2091
156,1.3811
157,1.5614
158,1.7415
159,1.9204
160,2.09
161,2.2492
162,2.3935
163,2.5249
164,2.6477
165,2.7626
166,2.8691
167,2.9559
168,3.0146
169,3.0359
170,3.0181
171,2.9672
172,2.89
173,2.8001
174,2.6999
175,2.5859
176,2.4389
177,2.2319999999999998
178,1.9474
179,1.5807
180,1.1608
181,0.72687
182,0.32345
183,-0.018449
184,-0.29169
185,-0.49218999999999996
186,-0.63563
187,-0.72968
188,-0.7895
189,-0.82735
190,-0.8478100000000001
191,-0.86313
192,-0.86854
193,-0.8718299999999999
194,-0.87141
195,-0.8685700000000001
196,-0.86924
197,-0.8654200000000001
198,-0.86303
199,-0.85482
200,-0.84393
201,-0.83239
202,-0.81871
203,-0.81217
204,-0.8079999999999999
205,-0.81106
206,-0.81952
207,-0.8296100000000001
208,-0.84385
209,-0.8571
210,-0.87265
211,-0.88961
212,-0.90635
213,-0.92405
214,-0.9359999999999999
215,-0.94537
216,-0.94701
217,-0.94048
218,-0.92574
219,-0.8981299999999999
220,-0.8634299999999999
221,-0.81791
222,-0.7648699999999999
223,-0.70104
224,-0.6228
225,-0.53268
226,-0.42706000000000005
227,-0.30912
228,-0.17405
229,-0.02368
230,0.13457
231,0.29085
232,0.43718
233,0.57672
234,0.7185199999999999
235,0.8721399999999999
236,1.0369
237,1.2009
238,1.3466
239,1.4593
240,1.5347
241,1.5773
242,1.5956
243,1.5944
244,1.5723
245,1.5231
246,1.4387
247,1.3142
248,1.1457
249,0.9330799999999999
250,0.67847
251,0.38878
252,0.08072
253,-0.22258000000000003
254,-0.491
255,-0.7042
256,-0.8549200000000001
257,-0.95115
258,-1.0113
259,-1.0462
260,-1.068
261,-1.0794
262,-1.0843
263,-1.0856
264,-1.0827
265,-1.0852
266,-1.0949
267,-1.1171
268,-1.1433
269,-1.1612
