time,value
0,-1.0274
1,-1.0716
2,-1.1335
3,-1.1335
4,-1.2793
5,-1.3588
6,-1.5179
7,-1.5312
8,-1.6947
9,-1.6903
10,-1.624
11,-1.7389
12,-1.7080000000000002
13,-1.7080000000000002
14,-1.7521
15,-1.7477
16,-1.6947
17,-1.7212
18,-1.6903
19,-1.6682
20,-1.6417
21,-1.5665
22,-1.5577
23,-1.4649
24,-1.4075
25,-1.3677
26,-1.7212
27,-1.3633
28,-1.3412
29,-1.3147
30,-1.266
31,-1.4605
32,-1.4119
33,-1.4075
34,-1.4119
35,-1.3544
36,-1.3412
37,-1.2837
38,-1.2837
39,-1.2174
40,-1.1246
41,-1.0937
42,-1.0407
43,-0.8462200000000001
44,-0.76226
45,-0.69597
46,-0.5634
47,-0.48385
48,-0.38663000000000003
49,-0.40873000000000004
50,-0.25406
51,-0.22754000000000002
52,-0.17893
53,-0.090548
54,-0.064033
55,-0.0021654
56,0.050864
57,0.11715
58,0.18344000000000002
59,0.24973
60,0.31601
61,0.3823
62,0.44859
63,0.5148699999999999
64,0.58116
65,0.6297699999999999
66,0.6695399999999999
67,0.7049
68,0.77118
69,0.7977
70,0.83305
71,0.83305
72,0.85515
73,0.82863
74,0.8065399999999999
75,0.81096
76,0.8065399999999999
77,0.81538
78,0.81096
79,0.8507299999999999
80,0.88608
81,0.94795
82,1.0054
83,1.0496
84,1.0805
85,1.0452
86,1.0628
87,1.0496
88,1.0098
89,1.0142
90,0.94795
91,0.86841
92,0.75351
93,0.6872199999999999
94,0.61651
95,0.59
96,0.5192899999999999
97,0.5148699999999999
98,0.32485
99,0.36462
100,0.28508
101,0.23205
102,0.20553000000000002
103,0.050864
104,-0.024261
105,-0.099387
106,-0.17451
107,-0.24964
108,-0.32918000000000003
109,-0.40431
110,-0.45733999999999997
111,-0.4485
112,-0.51479
113,-0.50153
114,-0.53246
115,-0.48827
116,-0.53246
117,-0.57665
118,-0.53688
119,-0.60759
120,-0.31151
121,-0.32918000000000003
122,-0.29825
123,-0.70039
124,-0.69155
125,-0.73574
126,-0.89925
127,-0.9390200000000001
128,-1.0274
129,-1.0053
130,-1.0053
131,-1.0318
132,-1.0759999999999998
133,-1.0672
134,-1.0583
135,-0.9964700000000001
136,-0.9522799999999999
137,-0.9036700000000001
138,-0.85064
139,-0.75784
140,-0.74458
141,-0.6562
142,-0.60759
143,-0.55456
144,-0.49711000000000005
145,-0.40873000000000004
146,-0.36012
147,-0.26731
148,-0.19660999999999998
149,-0.1259
150,-0.05519500000000001
151,0.015511000000000002
152,0.086217
153,0.15692
154,0.23646999999999999
155,0.24973
156,0.45743
157,0.52813
158,0.5767399999999999
159,0.62093
160,0.64303
161,0.66513
162,0.6341899999999999
163,0.61651
164,0.6872199999999999
165,0.6695399999999999
166,0.73141
167,0.7800199999999999
168,0.83305
169,0.89492
170,0.96121
171,1.0098
172,1.0187
173,1.1557
174,1.1601
175,1.1909999999999998
176,1.1512
177,1.1512
178,1.2087
179,1.1777
180,1.107
181,1.1026
182,1.0628
183,0.98772
184,0.95237
185,0.8905
186,0.81096
187,0.8065399999999999
188,0.79328
189,0.82421
190,0.86841
191,0.9081799999999999
192,0.9744700000000001
193,1.0673
194,1.1909999999999998
195,1.1247
196,1.0982
197,1.0231
198,0.9656299999999999
199,0.94795
200,0.9214399999999999
201,0.8418899999999999
202,0.8021199999999999
203,0.75351
204,0.67396
205,0.64303
206,0.6121
207,0.5413899999999999
208,0.52813
209,0.47068000000000004
210,0.42207
211,0.42207
212,0.39114
213,0.34695
214,0.38672
215,0.31159000000000003
216,0.34253
217,0.34695
218,0.4044
219,0.45743
220,0.5148699999999999
221,0.55023
222,0.58116
223,0.6695399999999999
224,0.7225699999999999
225,0.7844399999999999
226,0.9214399999999999
227,0.94795
228,1.0628
229,1.2131
230,1.3192
231,1.465
232,1.4915
233,1.571
234,1.6019999999999999
235,1.7567
236,1.7169
237,1.6992
238,1.6815
239,1.7169
240,1.6992
241,1.6904
242,1.7213
243,1.7125
244,1.6992
245,1.7301
246,1.6771
247,1.7080000000000002
248,1.6639
249,1.6992
250,1.6992
251,1.6992
252,1.7346
253,1.8627
254,1.8539
255,1.8495
256,1.8892
257,2.119
258,2.15
259,2.1853
260,2.1809
261,2.2162
262,2.2030000000000003
263,2.1941
264,2.1809
265,2.1676
266,2.1588
267,2.1455
268,2.1367
269,2.0925
270,2.0704
271,2.0572
272,2.0218
273,2.0218
274,1.9909
275,1.9467
276,1.929
277,1.8936
278,1.9069
279,1.8185
280,1.8008
281,1.6948
282,1.6639
283,1.5931
284,1.5224
285,1.5048
286,1.4429
287,1.3987
288,1.3413
289,1.328
290,1.2131
291,1.1645
292,1.1689
293,1.1645
294,1.1689
295,1.1733
296,1.1468
297,1.1733
298,1.0628
299,0.99656
300,0.8772399999999999
301,0.82863
302,0.78886
303,0.7490899999999999
304,0.69606
305,0.60326
306,0.5413899999999999
307,0.46626000000000006
308,0.39555999999999997
309,0.26298
310,0.16576
311,0.18786
312,0.20995
313,0.21436999999999998
314,0.25856
315,0.24973
316,0.20553000000000002
317,0.2895
318,0.23646999999999999
319,0.37346
320,0.39555999999999997
321,0.4044
322,0.48394
323,0.48836
324,0.48836
325,0.52813
326,0.46626000000000006
327,0.39998
328,0.33810999999999997
329,0.27624
330,0.20995
331,0.14809
332,0.081798
333,-0.0021654
334,0.0022538
335,0.01993
336,0.011092
337,0.07737899999999999
338,0.12599000000000002
339,0.09505599999999999
340,0.0066729
341,0.024349000000000003
342,-0.064033
343,-0.019842
344,-0.090548
345,-0.13915999999999998
346,-0.15684
347,-0.18777
348,-0.18777
349,-0.22311999999999999
350,-0.20986999999999997
351,-0.20986999999999997
352,-0.15684
353,-0.15242
354,-0.10380999999999999
355,-0.08171
356,-0.02868
357,0.024349000000000003
358,0.09505599999999999
359,0.12599000000000002
360,0.20553000000000002
361,0.23205
362,0.28065999999999997
363,0.2895
364,0.34253
365,0.34695
366,0.35579
367,0.36462
368,0.37346
369,0.45743
370,0.45301
371,0.4751
372,0.4972
373,0.5767399999999999
374,0.60768
375,0.58558
376,0.62093
377,0.7225699999999999
378,0.6695399999999999
379,0.67838
380,0.70932
381,0.75351
382,0.74025
383,0.6916399999999999
384,0.6695399999999999
385,0.6872199999999999
386,0.66071
387,0.64745
388,0.5634899999999999
389,0.55023
390,0.47068000000000004
391,0.44417
392,0.44859
393,0.41323000000000004
394,0.43975
395,0.46626000000000006
396,0.52813
397,0.53697
398,0.6341899999999999
399,0.6695399999999999
400,0.7269899999999999
401,0.7446699999999999
402,0.85515
403,0.88166
404,0.94795
405,0.93911
406,0.93911
407,0.9921399999999999
408,0.98772
409,0.9921399999999999
410,0.9921399999999999
411,0.9921399999999999
412,0.9921399999999999
413,0.9921399999999999
414,0.9921399999999999
415,0.9921399999999999
416,0.95237
417,0.96121
418,0.93911
419,0.90376
420,0.8418899999999999
421,0.7977
422,0.75793
423,0.77118
424,0.7446699999999999
425,0.75351
426,0.7049
427,0.7049
428,0.75351
429,0.7490899999999999
430,0.77118
431,0.76677
432,0.7490899999999999
433,0.73583
434,0.70048
435,0.67838
436,0.58116
437,0.54581
438,0.4972
439,0.46184
440,0.42207
441,0.36462
442,0.2674
443,0.18786
444,0.12599000000000002
445,0.081798
446,0.015511000000000002
447,-0.033099
448,-0.05519500000000001
449,-0.064033
450,-0.05519500000000001
451,0.011092
452,-0.0065845
453,0.011092
454,0.042026
455,-0.011004
456,-0.041937999999999996
457,-0.072872
458,-0.077291
459,-0.13915999999999998
460,-0.25848000000000004
461,-0.29825
462,-0.40431
463,-0.51479
464,-0.57223
465,-0.69597
466,-0.76668
467,-0.80645
468,-0.94786
469,-0.8948299999999999
470,-0.9257700000000001
471,-0.9611200000000001
472,-0.92135
473,-0.9743799999999999
474,-0.9390200000000001
475,-0.89041
476,-0.80645
477,-0.82855
478,-0.76668
479,-0.73574
480,-0.87716
481,-0.93019
482,-1.0053
483,-1.0628
484,-1.2307
485,-1.2616
486,-1.4516
487,-1.5886
488,-1.6063
489,-1.6284
490,-1.7124
491,-1.6991
492,-1.7168
493,-1.7301
494,-1.6769999999999998
495,-1.6549
496,-1.7080000000000002
497,-1.6859
498,-1.7080000000000002
499,-1.6769999999999998
500,-1.6859
501,-1.6549
502,-1.7035
503,-1.6505
504,-1.6063
505,-1.6284
506,-1.5975
507,-1.5931
508,-1.6417
509,-1.6638
510,-1.624
511,-1.6769999999999998
512,-1.5975
513,-1.5444
514,-1.5754
515,-1.5577
516,-1.4958
517,-1.4869999999999999
518,-1.4428
519,-1.4119
520,-1.3986
521,-1.3898
522,-1.3765
523,-1.3677
524,-1.3544
525,-1.3456
526,-1.3323
527,-1.2395
528,-1.297
529,-1.3014
530,-1.3102
531,-1.2837
532,-1.2439
533,-1.2837
534,-1.1865
535,-1.2042
536,-1.0937
537,-1.0759999999999998
538,-1.0274
539,-0.8373799999999999
540,-0.62968
541,-0.52362
542,-0.43966000000000005
543,-0.35128000000000004
544,-0.36454000000000003
545,-0.36454000000000003
546,-0.36895
547,-0.25848000000000004
548,-0.2187
549,-0.077291
550,-0.015423
551,0.050864
552,0.07296
553,0.16134
554,0.10830999999999999
555,0.2674
556,0.25856
557,0.30276
558,0.34695
559,0.38672
560,0.41323000000000004
561,0.44859
562,0.44417
563,0.45743
564,0.48836
565,0.4751
566,0.5767399999999999
567,0.60326
568,0.65187
569,0.75793
570,0.75793
571,0.81096
572,0.8993399999999999
573,0.9346899999999999
574,0.8905
575,0.95237
576,0.95237
577,0.99656
578,1.1026
579,1.0938
580,1.1159
581,1.2175
582,1.1822
583,1.0496
584,1.0231
585,0.97005
586,1.0142
587,1.0098
588,0.98772
589,0.96121
590,0.9346899999999999
591,0.9126
592,0.88608
593,0.8595700000000001
594,0.83747
595,0.82863
596,0.75793
597,0.7137399999999999
598,0.55907
599,0.49278
600,0.5679
601,0.45743
602,0.40881999999999996
603,0.36904000000000003
604,0.30276
605,0.20112
606,0.12599000000000002
607,0.024349000000000003
608,0.024349000000000003
609,-0.13032
610,-0.12147999999999999
611,-0.18335
612,-0.19219
613,-0.28499
614,-0.36012
615,-0.44408000000000003
616,-0.40431
617,-0.5192100000000001
618,-0.55456
619,-0.60317
620,-0.71807
621,-0.70923
622,-0.78877
623,-0.70923
624,-0.7269
625,-0.71807
626,-0.7490000000000001
627,-0.75342
628,-0.75784
629,-0.8594799999999999
630,-0.91251
631,-0.92135
632,-0.9257700000000001
633,-0.9346
634,-0.94344
635,-0.94786
636,-0.9567
637,-0.9611200000000001
638,-0.89925
639,-0.9036700000000001
640,-0.8683200000000001
641,-0.8241299999999999
642,-0.76226
643,-0.75342
644,-0.6562
645,-0.6562
646,-0.58549
647,-0.55456
648,-0.52362
649,-0.50153
650,-0.39547
651,-0.32918000000000003
652,-0.28941
653,-0.22311999999999999
654,-0.22311999999999999
655,-0.15242
656,-0.1259
657,-0.046357
658,-0.0065845
659,0.050864
660,0.042026
661,0.10389000000000001
662,0.1525
663,0.19228
664,0.2895
665,0.32485
666,0.32485
667,0.36904000000000003
668,0.43091
669,0.52813
670,0.55023
671,0.62093
672,0.6341899999999999
673,0.66071
674,0.67396
675,0.69606
676,0.7269899999999999
677,0.7844399999999999
678,0.8198
679,0.84631
680,0.8639899999999999
681,0.85515
682,0.8507299999999999
683,0.84631
684,0.8418899999999999
685,0.83747
686,0.82863
687,0.7800199999999999
688,0.74025
689,0.7446699999999999
690,0.73583
691,0.71816
692,0.70932
693,0.7049
694,0.7490899999999999
695,0.75793
696,0.83305
697,0.84631
698,0.9346899999999999
699,0.96121
700,1.0098
701,1.054
702,1.0628
703,0.9567899999999999
704,0.94795
705,0.92585
706,0.9081799999999999
707,0.8065399999999999
708,0.78886
709,0.69606
710,0.60768
711,0.58558
712,0.5413899999999999
713,0.52813
714,0.45301
715,0.39555999999999997
716,0.32043
717,0.24531
718,0.11715
719,0.055283000000000006
720,-0.019842
721,-0.11706
722,-0.17451
723,-0.28941
724,-0.36454000000000003
725,-0.42198
726,-0.46618000000000004
727,-0.57223
728,-0.64294
729,-0.6562
730,-0.68713
731,-0.65178
732,-0.62968
733,-0.58107
734,-0.53246
735,-0.47501000000000004
736,-0.41756000000000004
737,-0.3336
738,-0.37337
739,-0.36454000000000003
740,-0.3557
741,-0.3557
742,-0.32034
743,-0.28941
744,-0.28499
745,-0.31592
746,-0.37337
747,-0.48827
748,-0.60317
749,-0.74458
750,-0.8859899999999999
751,-0.89925
752,-1.0009
753,-1.023
754,-1.1202
755,-1.1379
756,-1.1511
757,-1.1688
758,-1.1865
759,-1.1998
760,-1.2174
761,-1.3102
762,-1.3942
763,-1.4649
764,-1.624
765,-1.7080000000000002
766,-1.7787
767,-1.8847
768,-1.9643
769,-2.0129
770,-2.0217
771,-2.0747
772,-2.0261
773,-2.0306
774,-2.0217
775,-1.9952
776,-2.0085
777,-2.0085
778,-2.0526
779,-2.0792
780,-2.1234
781,-2.1941
782,-2.2117
783,-2.2206
784,-2.2162
785,-2.2206
786,-2.2162
787,-2.2206
788,-2.2427
789,-2.2029
790,-2.1719999999999997
791,-2.1764
792,-2.0924
793,-2.0747
794,-1.9687
795,-1.9554
796,-1.9068
797,-1.8317
798,-1.7787
799,-1.6682
800,-1.5975
801,-1.4693
802,-1.403
803,-1.3765
804,-1.3854
805,-1.2439
806,-1.1644
807,-0.9743799999999999
808,-0.9346
809,-0.8683200000000001
810,-0.81087
811,-0.81529
812,-0.7490000000000001
813,-0.69155
814,-0.59433
815,-0.48827
816,-0.46618000000000004
817,-0.44408000000000003
818,-0.41756000000000004
819,-0.39547
820,-0.37337
821,-0.34686
822,-0.31151
823,-0.24964
824,-0.14357999999999999
825,-0.068453
826,0.011092
827,0.028769
828,0.028769
829,0.046445
830,0.24089000000000002
831,0.30276
832,0.38672
833,0.46626000000000006
834,0.53697
835,0.55907
836,0.5634899999999999
837,0.58558
838,0.59
839,0.5192899999999999
840,0.5723199999999999
841,0.5634899999999999
842,0.58116
843,0.59442
844,0.55907
845,0.55023
846,0.55465
847,0.55023
848,0.59442
849,0.59
850,0.60768
851,0.58558
852,0.54581
853,0.50162
854,0.41765
855,0.35579
856,0.32043
857,0.24973
858,0.19228
859,0.1746
860,0.14367
861,0.12599000000000002
862,0.13483
863,0.09505599999999999
864,0.13483
865,0.19228
866,0.17018
867,0.16576
868,0.15692
869,0.1525
870,0.14809
871,0.13925
872,0.13483
873,0.16134
874,0.12599000000000002
875,0.090637
876,-0.0021654
877,-0.094967
878,-0.21428000000000003
879,-0.28499
880,-0.42198
881,-0.53246
882,-0.57223
883,-0.73574
884,-0.79761
885,-0.82855
886,-0.9169299999999999
887,-1.0981
888,-1.1777
889,-1.2218
890,-1.2705
891,-1.2174
892,-1.2263
893,-1.1998
894,-1.2307
895,-1.1953
896,-1.1688
897,-1.1467
898,-1.0804
899,-1.0628
