time,value
0,-0.57967
1,-0.57967
2,-0.57967
3,-0.57967
4,-0.57967
5,-0.57967
6,-0.57967
7,-0.57967
8,-0.57967
9,-0.57967
10,-0.57967
11,-0.57967
12,-0.57967
13,-0.57967
14,-0.57967
15,-0.57967
16,-0.57967
17,-0.57967
18,-0.56543
19,-0.54204
20,-0.51436
21,-0.47907
22,-0.43599
23,-0.38063
24,-0.32527
25,-0.29061
26,-0.28688
27,-0.28670999999999996
28,-0.28670999999999996
29,-0.28670999999999996
30,-0.28670999999999996
31,-0.28670999999999996
32,-0.28670999999999996
33,-0.28670999999999996
34,-0.28670999999999996
35,-0.28670999999999996
36,-0.28670999999999996
37,-0.28670999999999996
38,-0.28670999999999996
39,-0.28670999999999996
40,-0.28670999999999996
41,-0.28670999999999996
42,-0.28595
43,-0.26543
44,-0.24068
45,-0.213
46,-0.18532
47,-0.15765
48,-0.12997
49,-0.10228999999999999
50,-0.10340999999999999
51,-0.11364
52,-0.12747999999999998
53,-0.14132
54,-0.15516
55,-0.16899999999999998
56,-0.18284
57,-0.20443
58,-0.23196999999999998
59,-0.25965
60,-0.2822
61,-0.30086
62,-0.3147
63,-0.32854
64,-0.34238
65,-0.35622
66,-0.37006
67,-0.37981
68,-0.38432
69,-0.38436
70,-0.38436
71,-0.38436
72,-0.38436
73,-0.38436
74,-0.38211999999999996
75,-0.37108
76,-0.35793
77,-0.34563
78,-0.33676
79,-0.33554
80,-0.33554
81,-0.33554
82,-0.34788
83,-0.36119
84,-0.37553000000000003
85,-0.39605
86,-0.42106000000000005
87,-0.44863000000000003
88,-0.47568999999999995
89,-0.49306000000000005
90,-0.5069
91,-0.52074
92,-0.54162
93,-0.56599
94,-0.59367
95,-0.6169399999999999
96,-0.6285
97,-0.6285
98,-0.6285
99,-0.6224
100,-0.6117
101,-0.5978600000000001
102,-0.58402
103,-0.57018
104,-0.55635
105,-0.54251
106,-0.52867
107,-0.51483
108,-0.5009899999999999
109,-0.48988000000000004
110,-0.48202
111,-0.48202
112,-0.48202
113,-0.48202
114,-0.48202
115,-0.48202
116,-0.48558999999999997
117,-0.50052
118,-0.52556
119,-0.55275
120,-0.57903
121,-0.59413
122,-0.60797
123,-0.62185
124,-0.6448699999999999
125,-0.67048
126,-0.69816
127,-0.7258399999999999
128,-0.75352
129,-0.7812
130,-0.80888
131,-0.84493
132,-0.88445
133,-0.9259700000000001
134,-0.95904
135,-0.98319
136,-0.99703
137,-1.0109
138,-1.0247
139,-1.0385
140,-1.0524
141,-1.0662
142,-1.0801
143,-1.0939
144,-1.1077
145,-1.1216
146,-1.1354
147,-1.1493
148,-1.1631
149,-1.1769
150,-1.1908
151,-1.2035
152,-1.2144
153,-1.2144
154,-1.2144
155,-1.2161
156,-1.2261
157,-1.2388
158,-1.2516
159,-1.2615
160,-1.2632
161,-1.2632
162,-1.2632
163,-1.2742
164,-1.2869
165,-1.3007
166,-1.3146
167,-1.3284
168,-1.3422
169,-1.3561
170,-1.3793
171,-1.4066
172,-1.4343
173,-1.4443
174,-1.443
175,-1.4292
176,-1.4131
177,-1.385
178,-1.3435
179,-1.3019999999999998
180,-1.2553
181,-1.2042
182,-1.1488
183,-1.0914
184,-1.0306
185,-0.96142
186,-0.8922200000000001
187,-0.8266399999999999
188,-0.76817
189,-0.7124699999999999
190,-0.6571100000000001
191,-0.60175
192,-0.5463899999999999
193,-0.49104
194,-0.43568
195,-0.38032
196,-0.32495999999999997
197,-0.2696
198,-0.21425
199,-0.15889
200,-0.10353
201,-0.23173000000000002
202,0.31335
203,0.32185
204,0.1179
205,0.17326
206,0.22862
207,0.2835
208,0.33279000000000003
209,0.3597
210,0.37354
211,0.38738
212,0.37233
213,0.34228000000000003
214,0.30077
215,0.26554
216,0.2395
217,0.22566
218,0.21181999999999998
219,0.20954
220,0.21896999999999997
221,0.23281
222,0.24996
223,0.2706
224,0.29828000000000005
225,0.32595999999999997
226,0.35364
227,0.38132
228,0.40899
229,0.43667
230,0.46435
231,0.49203
232,0.52023
233,0.5494100000000001
234,0.5909300000000001
235,0.63245
236,0.67151
237,0.69531
238,0.71222
239,0.7267399999999999
240,0.74338
241,0.76882
242,0.7965
243,0.8241799999999999
244,0.84231
245,0.8579200000000001
246,0.8717600000000001
247,0.8856
248,0.89944
249,0.91328
250,0.92712
251,0.94096
252,0.9548
253,0.96864
254,0.98729
255,1.0098
256,1.0375
257,1.0655
258,1.1053
259,1.1607
260,1.216
261,1.2799
262,1.3523
263,1.4353
264,1.5207
265,1.6122
266,1.723
267,1.8337
268,1.9356
269,2.0174
270,2.0884
271,2.1488
272,2.1965
273,2.185
274,2.1711
275,2.1581
276,2.1556
277,2.1546
278,2.1546
279,2.1546
280,2.1546
281,2.1546
282,2.1546
283,2.1437
284,2.1304
285,2.1165
286,2.1027
287,2.0889
288,2.0749
289,2.0592
290,2.0281
291,1.9865
292,1.945
293,1.9035
294,1.8619999999999999
295,1.8205
296,1.7789
297,1.7374
298,1.6959
299,1.6544
300,1.6031
301,1.5406
302,1.4714
303,1.4072
304,1.3491
305,1.3076
306,1.2661
307,1.2331
308,1.228
309,1.2269
310,1.2269
311,1.2269
312,1.2269
313,1.2269
314,1.2269
315,-1.8558
316,-1.8558
317,-1.8558
318,-1.8558
319,-1.8558
320,-1.8558
321,-1.8558
322,-1.8558
323,-1.8558
324,-1.8558
325,-1.8558
326,-1.8558
327,-1.8558
328,-1.8558
329,-1.8558
330,-1.8558
331,-1.8558
332,-1.8558
333,-1.8347
334,-1.8
335,-1.7589
336,-1.6953
337,-1.6086
338,-1.4855
339,-1.3623
340,-1.2852
341,-1.2769
342,-1.2766
343,-1.2766
344,-1.2766
345,-1.2766
346,-1.2766
347,-1.2766
348,-1.2766
349,-1.2766
350,-1.2766
351,-1.2766
352,-1.2766
353,-1.2766
354,-1.2766
355,-1.2766
356,-1.2766
357,-1.2721
358,-1.1503
359,-1.0036
360,-0.84116
361,-0.6894399999999999
362,-0.55761
363,-0.43448000000000003
364,-0.31135
365,-0.21669000000000002
366,-0.13104000000000002
367,-0.2356
368,0.17482999999999999
369,0.11523
370,0.19730999999999999
371,0.2794
372,0.36149000000000003
373,0.44356999999999996
374,0.52566
375,0.57734
376,0.6059
377,0.6059
378,0.60949
379,0.6261899999999999
380,0.6672399999999999
381,0.70828
382,0.73721
383,0.75058
384,0.75071
385,0.75597
386,0.76869
387,0.80974
388,0.85078
389,0.88518
390,0.8934799999999999
391,0.89551
392,0.89095
393,0.8762
394,0.8387899999999999
395,0.79774
396,0.7567
397,0.7156600000000001
398,0.67461
399,0.6321100000000001
400,0.57124
401,0.49706999999999996
402,0.41531
403,0.33507
404,0.28355
405,0.24251
406,0.20146
407,0.16042
408,0.11938
409,0.4008
410,0.19558
411,-0.051285000000000004
412,-0.21485
413,-0.42007
414,-0.10879000000000001
415,-0.11812
416,-0.11812
417,-0.10960999999999999
418,-0.44082
419,-0.2356
420,-0.18963
421,0.17482999999999999
422,0.38005
423,0.11523
424,0.15627
425,0.19730999999999999
426,0.23836
427,0.2794
428,0.32044
429,0.36149000000000003
430,0.40253
431,0.44356999999999996
432,0.48462
433,0.52566
434,0.56814
435,0.61333
436,0.6916800000000001
437,0.77376
438,0.85598
439,0.9652700000000001
440,1.0823
441,1.2044
442,1.3183
443,1.4111
444,1.4932
445,1.5753
446,1.6325
447,1.6795
448,1.7205
449,1.7741
450,1.8409
451,1.923
452,2.0051
453,2.0672
454,2.1116
455,2.1526
456,2.1813
457,2.1988
458,2.1988
459,2.1977
460,2.1845
461,2.1434
462,2.1024
463,2.0613
464,2.0203
465,1.9792
466,1.9349
467,1.8852
468,1.8031
469,1.7209999999999999
470,1.6389
471,1.5568
472,1.4747
473,1.3926
474,1.3106
475,1.2285
476,1.1464
477,1.0643
478,0.94985
479,0.8300299999999999
480,0.70758
481,0.60106
482,0.5090600000000001
483,0.42696999999999996
484,0.34488
485,0.2628
486,0.18070999999999998
487,0.098623
488,0.26661999999999997
489,0.14255
490,0.14255
491,0.14255
492,0.14255
493,0.14255
494,0.14255
495,0.21896999999999997
496,0.3616
497,0.11154000000000001
498,0.15850999999999998
499,0.21575999999999998
500,0.29784
501,0.37993000000000005
502,0.45131000000000004
503,0.50158
504,0.54364
505,0.57857
506,0.60578
507,0.6059
508,0.6059
509,0.60964
510,0.64653
511,0.68614
512,0.72719
513,0.76823
514,0.8092699999999999
515,0.85003
516,0.89015
517,0.89551
518,0.89551
519,0.89551
520,0.89551
521,0.89551
522,0.8941
523,0.8761200000000001
524,0.79175
525,0.66862
526,0.5454899999999999
527,0.35809
528,0.13735999999999998
529,-0.1089
530,-0.32716
531,-0.50458
532,-0.62771
533,-0.75084
534,-0.83968
535,-0.8938
536,-0.93484
537,-0.9660700000000001
538,-0.98695
539,-0.98695
540,-0.98695
541,-0.9764700000000001
542,-0.9372799999999999
543,-0.89656
544,-0.8555200000000001
545,-0.81448
546,-0.7734300000000001
547,-0.7308399999999999
548,-0.68535
549,-0.60327
550,-0.52118
551,-0.44273
552,-0.38693
553,-0.34133
554,-0.30230999999999997
555,-0.26957
556,-0.26293
557,-0.26293
558,-0.26293
559,-0.29125
560,-0.32703000000000004
561,-0.36795
562,-0.39561999999999997
563,-0.40773000000000004
564,-0.40773000000000004
565,-0.40773000000000004
566,-0.45642
567,-0.53132
568,-0.61341
569,-0.6955
570,-0.77758
571,-0.85967
572,-0.94095
573,-0.98695
574,-0.98695
575,-0.98695
576,-0.94891
577,-0.87351
578,-0.75038
579,-0.62368
580,-0.48796999999999996
581,-0.3238
582,-0.15963
583,-0.055091999999999995
584,0.47986
585,0.17979
586,0.24881999999999999
587,0.29909
588,0.26141
589,0.22036999999999998
590,0.17933
591,0.13828
592,0.49533999999999995
593,0.29012
594,0.08490299999999999
595,-0.12030999999999999
596,-0.32553000000000004
597,-0.10797999999999999
598,-0.11671
599,-0.11812
600,-0.11812
601,-0.15714
602,-0.21866
603,-0.30049000000000003
604,-0.37704
605,-0.40773000000000004
606,-0.40773000000000004
607,-0.40773000000000004
608,-0.40773000000000004
609,-0.40773000000000004
610,-0.40773000000000004
611,-0.41408999999999996
612,-0.43401999999999996
613,-0.47506000000000004
614,-0.5161100000000001
615,-0.5862
616,-0.6895
617,-0.81263
618,-0.9283299999999999
619,-1.0349
620,-1.117
621,-1.1991
622,-1.2474
623,-1.1856
624,-1.1078
625,-0.9827600000000001
626,-0.77477
627,-0.42249
628,-0.25636
629,0.31629
630,-1.7425
631,-1.7425
632,-1.7425
633,-1.7425
634,-1.7425
635,-1.7425
636,-1.7425
637,-1.7425
638,-1.7425
639,-1.7425
640,-1.7425
641,-1.7425
642,-1.7425
643,-1.7425
644,-1.7425
645,-1.7425
646,-1.7425
647,-1.7425
648,-1.7311
649,-1.7123
650,-1.6901
651,-1.6434
652,-1.5718
653,-1.4607
654,-1.3496
655,-1.28
656,-1.2725
657,-1.2722
658,-1.2722
659,-1.2722
660,-1.2722
661,-1.2722
662,-1.2722
663,-1.2722
664,-1.2722
665,-1.2722
666,-1.2722
667,-1.2722
668,-1.2722
669,-1.2722
670,-1.2722
671,-1.2722
672,-1.2691
673,-1.1867
674,-1.0874
675,-0.9782200000000001
676,-0.88059
677,-0.8045100000000001
678,-0.73785
679,-0.67119
680,-0.60452
681,-0.53786
682,-0.4712
683,-0.39592
684,-0.3139
685,-0.22501999999999997
686,-0.13614
687,-0.22710999999999998
688,0.21731
689,0.13052
690,0.21116999999999997
691,0.28557
692,0.35223000000000004
693,0.41889
694,0.48556000000000005
695,0.5522199999999999
696,0.61888
697,0.6855399999999999
698,0.75221
699,0.81887
700,0.8798299999999999
701,0.9327200000000001
702,0.95494
703,0.97716
704,0.9922
705,0.97896
706,0.95894
707,0.9367200000000001
708,0.9145
709,0.8922700000000001
710,0.87005
711,0.84783
712,0.86524
713,0.8857799999999999
714,0.9072100000000001
715,0.9187
716,0.92299
717,0.92263
718,0.92063
719,0.8875299999999999
720,0.84309
721,0.79865
722,0.77682
723,0.7661899999999999
724,0.7661899999999999
725,0.7661899999999999
726,0.7661899999999999
727,0.7661899999999999
728,0.7661899999999999
729,0.75639
730,0.73922
731,0.7170000000000001
732,0.6947800000000001
733,0.67256
734,0.6503399999999999
735,0.62812
736,0.6128899999999999
737,0.60965
738,0.60939
739,0.61378
740,0.62338
741,0.6456
742,0.66782
743,0.69004
744,0.71226
745,0.73448
746,0.75957
747,0.79378
748,0.8361
749,0.88054
750,0.9249799999999999
751,0.9694200000000001
752,1.0139
753,1.0583
754,1.1027
755,1.1472
756,1.1911
757,1.2305
758,1.2585
759,1.2808
760,1.3030000000000002
761,1.3118
762,1.315
763,1.315
764,1.315
765,1.315
766,1.315
767,1.315
768,1.3042
769,1.2838
770,1.2615
771,1.246
772,1.2366
773,1.2366
774,1.2366
775,1.2366
776,1.2366
777,1.2366
778,1.2312
779,1.218
780,1.1961
781,1.1739
782,1.1517
783,1.1295
784,1.1072
785,1.0877
786,1.0815
787,1.0798
788,1.0781
789,1.0718
790,1.0523
791,1.0301
792,1.0079
793,0.98565
794,0.9634299999999999
795,0.94158
796,0.92835
797,0.92299
798,0.92299
799,0.92299
800,0.92299
801,0.92299
802,0.92299
803,0.92299
804,0.92299
805,0.92299
806,0.92299
807,0.92299
808,0.92299
809,0.92299
810,0.91471
811,0.8992700000000001
812,0.8770399999999999
813,0.8580399999999999
814,0.84459
815,0.84459
816,0.84459
817,0.8387899999999999
818,0.8215600000000001
819,0.79989
820,0.77105
821,0.73385
822,0.66732
823,0.6006600000000001
824,0.5319699999999999
825,0.44533
826,0.35722
827,0.27258000000000004
828,0.20417000000000002
829,0.15399000000000002
830,0.1097
831,0.33793
832,0.21231999999999998
833,0.10121000000000001
834,-0.053021000000000006
835,-0.18412
836,-0.38441
837,-0.12340999999999999
838,-0.17109000000000002
839,-0.23076
840,-0.29741999999999996
841,-0.36409
842,-0.45395
843,-0.55584
844,-0.66694
845,-0.7831
846,-0.9066299999999999
847,-1.04
848,-1.1733
849,-1.3159
850,-1.4679
851,-1.6234
852,-1.7577
853,-1.8696
854,-1.9363
855,-2.003
856,-2.0583
857,-2.0825
858,-2.1051
859,-2.1016
860,-2.0549
861,-1.9485
862,-1.8357
863,-1.7198
864,-1.5643
865,-1.4087
866,-1.2532
867,-1.0976
868,-0.9420799999999999
869,-0.78873
870,-0.64217
871,-0.52388
872,-0.41276999999999997
873,-0.30167
874,-0.2519
875,-0.21828000000000003
876,-0.19619
877,-0.18845
878,-0.19755
879,-0.21978000000000003
880,-0.242
881,-0.2774
882,-0.3199
883,-0.36434
884,-0.40878000000000003
885,-0.45321999999999996
886,-0.49766000000000005
887,-0.5425399999999999
888,-0.60652
889,-0.6954100000000001
890,-0.7842899999999999
891,-0.85944
892,-0.92111
893,-0.96555
894,-0.99646
895,-0.9932700000000001
896,-0.88216
897,-0.7710600000000001
898,-0.6552399999999999
899,-0.52866
900,-0.3963
901,-0.26532
902,-0.13774
903,-0.121
904,0.43453
905,0.19492
906,0.2878
907,0.3782
908,0.46411
909,0.53601
910,0.58792
911,0.63236
912,0.67681
913,0.66877
914,0.64884
915,0.62662
916,0.5938399999999999
917,0.55496
918,0.5103800000000001
919,0.46295
920,0.39068
921,0.30179
922,0.21291
923,0.13388
924,0.31468
925,-0.11127999999999999
926,-0.35195
927,-0.13888
928,-0.20554
929,-0.27221
930,-0.31528
931,-0.33138
932,-0.33138
933,-0.32735
934,-0.3184
935,-0.29618
936,-0.27396
937,-0.24258000000000002
938,-0.18141
939,-0.11590999999999999
940,-0.17069
941,0.35736999999999997
942,0.2199
943,0.37545
944,0.531
