time,value
0,-0.4725
1,-0.69996
2,-0.43954
3,-0.6046
4,-0.030093
5,-0.46043999999999996
6,0.087005
7,-0.25094
8,0.33587
9,0.3889
10,-0.31947
11,-0.0010924
12,-0.011674
13,-0.071314
14,-0.33836
15,0.059336
16,-0.097445
17,-0.060666
18,-0.30421
19,-0.2188
20,-0.087336
21,-0.10991
22,0.09235800000000001
23,0.4894
24,0.031045999999999997
25,0.054551
26,-0.11909000000000002
27,-0.0072718
28,-0.21623
29,0.19067
30,0.23628000000000002
31,-0.11057
32,-0.05942000000000001
33,0.099632
34,0.24591
35,-0.052186
36,-0.2326
37,-0.13915999999999998
38,-0.088545
39,0.027657
40,0.14594000000000001
41,-0.38996
42,-0.14925
43,-0.031463
44,-0.062751
45,-0.41358
46,-0.17933
47,0.28307
48,0.18744
49,0.11585
50,-0.31006999999999996
51,0.24756
52,0.033538
53,0.11850999999999999
54,-0.23131999999999997
55,1.524
56,1.524
57,1.524
58,1.524
59,1.524
60,1.524
61,1.524
62,1.524
63,1.524
64,1.524
65,1.524
66,1.524
67,-1.4809999999999999
68,-1.4809999999999999
69,-1.4809999999999999
70,-1.4809999999999999
71,-1.4809999999999999
72,-1.4809999999999999
73,-1.4809999999999999
74,-1.4809999999999999
75,-1.4809999999999999
76,-1.4809999999999999
77,-1.4809999999999999
78,1.524
79,1.524
80,1.524
81,1.524
82,1.524
83,1.524
84,1.524
85,1.524
86,1.524
87,1.524
88,1.524
89,1.524
90,1.524
91,1.524
92,1.524
93,1.524
94,-1.4809999999999999
95,-1.4809999999999999
96,-1.4809999999999999
97,-1.4809999999999999
98,-1.4809999999999999
99,-1.4809999999999999
100,-1.4809999999999999
101,-1.4809999999999999
102,-1.4809999999999999
103,-1.4809999999999999
104,-1.4809999999999999
105,-1.4809999999999999
106,-1.4809999999999999
107,-1.4809999999999999
108,-1.4809999999999999
109,-0.041631
110,-0.33731
111,0.12724000000000002
112,0.28584
113,-0.055279999999999996
114,0.40761
115,-0.099726
116,-0.1495
117,0.46687
118,0.41452
119,-0.46299999999999997
120,-0.23373000000000002
121,0.16432
122,-0.31945
123,-0.12243
124,0.016045
125,-0.26605999999999996
126,0.19687000000000002
127,-0.25718
