time,value
0,-0.41962
1,-0.45786000000000004
2,-0.53978
3,-0.53432
4,-0.56709
5,-0.58894
6,-0.5944
7,-0.57802
8,-0.5234
9,-0.49063
10,-0.4797
11,-0.44693
12,-0.39776999999999996
13,-0.35954
14,-0.37046999999999997
15,-0.34315999999999997
16,-0.32677
17,-0.294
18,-0.35408
19,-0.34862
20,-0.32677
21,-0.28308
22,-0.29946
23,-0.23938
24,-0.24484
25,-0.21753000000000003
26,-0.21753000000000003
27,-0.23938
28,-0.27215
29,-0.26123
30,-0.294
31,-0.30491999999999997
32,-0.31585
33,-0.28308
34,-0.31585
35,-0.35954
36,-0.34862
37,-0.39231
38,-0.34315999999999997
39,-0.37593000000000004
40,-0.32131
41,-0.32677
42,-0.31585
43,-0.30491999999999997
44,-0.26123
45,-0.27760999999999997
46,-0.22846
47,-0.20115
48,-0.20661
49,-0.17384000000000002
50,-0.15199000000000001
51,-0.13560999999999998
52,-0.17384000000000002
53,-0.12468
54,-0.13560999999999998
55,-0.15199000000000001
56,-0.11375999999999999
57,-0.13014
58,-0.1083
59,-0.080987
60,-0.086449
61,-0.0099831
62,-0.0045211999999999995
63,0.017325999999999998
64,0.055559000000000004
65,0.099254
66,0.033712
67,0.017325999999999998
68,0.022788
69,0.055559000000000004
70,0.050097
71,0.07194500000000001
72,0.1211
73,0.08832999999999999
74,0.10472000000000001
75,0.077407
76,0.061021000000000006
77,0.13749
78,0.099254
79,0.13203
80,0.14295
81,0.15387
82,0.12655999999999998
83,0.15387
84,0.11018
85,0.10472000000000001
86,0.10472000000000001
87,0.033712
88,0.017325999999999998
89,-0.0099831
90,-0.053678
91,-0.053678
92,-0.042754
93,-0.037292
94,-0.020907
95,-0.0099831
96,0.011864
97,0.033712
98,0.0064025
99,-0.037292
100,-0.048216
101,-0.05914
102,0.011864
103,0.11018
104,0.11018
105,0.11018
106,0.13203
107,0.15933
108,0.1648
109,0.15387
110,0.15933
111,0.14295
112,0.17572000000000002
113,0.23034000000000002
114,0.21395
115,0.26311
116,0.25219
117,0.2358
118,0.23034000000000002
119,0.25765
120,0.23034000000000002
121,0.25765
122,0.22488000000000002
123,0.23034000000000002
124,0.29041999999999996
125,0.2795
126,0.29588000000000003
127,0.30134
128,0.34504
129,0.28496
130,0.31773
131,0.26311
132,0.24126
133,0.25765
134,0.24672
135,0.24672
136,0.23034000000000002
137,0.26857
138,0.24672
139,0.2795
140,0.29041999999999996
141,0.34504
142,0.43788999999999995
143,0.49796999999999997
144,0.59628
145,0.70006
146,0.72737
147,0.72191
148,0.74922
149,0.74375
150,0.7601399999999999
151,0.7656
152,0.7601399999999999
153,0.78745
154,0.8420700000000001
155,0.88576
156,0.89669
157,0.8912200000000001
158,0.90761
159,0.90215
160,0.90215
161,0.87484
162,0.89669
163,0.92399
164,0.9676899999999999
165,0.9513
166,1.0005
167,1.0769
168,1.1862
169,1.2299
170,1.3118
171,1.3118
172,1.4101
173,1.421
174,1.4538
175,1.4811
176,1.5084
177,1.5576
178,1.5849
179,1.6231
180,1.6832
181,1.6668
182,1.645
183,1.6887
184,1.7323
185,1.716
186,1.7542
187,1.7706
188,1.7542
189,1.7487
190,1.8034
191,1.7597
192,1.8197
193,1.8088
194,1.8252
195,1.8525
196,1.8907
197,1.9071
198,1.9781
199,2.0218
200,2.0601
201,2.1038
202,2.1475
203,2.1857
204,2.2294
205,2.2676
206,2.2731
207,2.1966
208,2.1911
209,2.1201
210,2.1529
211,2.1802
212,2.1529
213,2.1475
214,2.1038
215,2.0928
216,2.0491
217,2.0109
218,1.9781
219,1.9836
220,1.9235
221,1.9508
222,1.8962
223,1.8307
224,1.8252
225,1.7924
226,1.7597
227,1.6996
228,1.6504
229,1.6177
230,1.6122
231,1.574
232,1.5849
233,1.5412
234,1.4265
235,1.3883
236,1.3336
237,1.3118
238,1.3118
239,1.2626
240,1.2189
241,1.1752
242,1.0879
243,1.0442
244,0.98954
245,0.87484
246,0.7656
247,0.81476
248,0.78745
249,0.6946
250,0.6181300000000001
251,0.57444
252,0.54166
253,0.49251000000000006
254,0.40512
255,0.39966
256,0.36141999999999996
257,0.30134
258,0.21395
259,0.13203
260,0.1211
261,0.033712
262,0.0064025
263,-0.053678
264,-0.070063
265,-0.12468
266,-0.15745
267,-0.33769
268,-0.38685
269,-0.56709
270,-0.5998600000000001
271,-0.64356
272,-0.57802
273,-0.53432
274,-0.5234
275,-0.54525
276,-0.52886
277,-0.5616300000000001
278,-0.52886
279,-0.51794
280,-0.54525
281,-0.55071
282,-0.6490199999999999
283,-0.74733
284,-0.79103
285,-0.8784200000000001
286,-1.0587
287,-1.1952
288,-1.3154
289,-1.5229
290,-1.6212
291,-1.6103
292,-1.7195
293,-1.7523
294,-1.7414
295,-1.7687
296,-1.7796
297,-1.796
298,-1.8069
299,-1.8233
300,-1.8397
301,-1.8506
302,-1.8069
303,-1.8124
304,-1.7905
305,-1.7851
306,-1.7578
307,-1.7086
308,-1.7032
309,-1.6485
310,-1.6376
311,-1.4738
312,-1.4628
313,-1.4137
314,-1.3536
315,-1.2935
316,-1.2007
317,-1.0914
318,-1.075
319,-0.98219
320,-0.9002700000000001
321,-0.81834
322,-0.7801
323,-0.7528
324,-0.58348
325,-0.54525
326,-0.43055
327,-0.39231
328,-0.33223
329,-0.28854
330,-0.30491999999999997
331,-0.05914
332,-0.070063
333,0.066483
334,0.1648
335,0.23034000000000002
336,0.32319000000000003
337,0.37781
338,0.43788999999999995
339,0.49251000000000006
340,0.5525899999999999
341,0.60721
342,0.6672899999999999
343,0.72191
344,0.79291
345,0.80383
346,0.85845
347,0.91853
348,0.98408
349,0.9513
350,1.0223
351,0.995
352,1.0223
353,0.98954
354,1.0278
355,0.995
356,1.0278
357,0.9786100000000001
358,0.9786100000000001
359,0.9513
360,0.9786100000000001
361,0.9676899999999999
362,0.8803
363,0.8639100000000001
364,0.8639100000000001
365,0.81476
366,0.79837
367,0.77652
368,0.74375
369,0.63452
370,0.58536
371,0.51982
372,0.4652
373,0.44335
374,0.40512
375,0.37781
376,0.25765
377,0.21941
378,0.18118
379,0.21395
380,0.14295
381,0.19211
382,0.14841
383,0.13203
384,0.11018
385,0.13749
386,0.055559000000000004
387,0.033712
388,0.02825
389,0.07194500000000001
390,0.017325999999999998
391,-0.031830000000000004
392,-0.06460199999999999
393,-0.020907
394,-0.086449
395,-0.097373
396,-0.075525
397,-0.16292
398,-0.17384000000000002
399,-0.1793
400,-0.22846
401,-0.17384000000000002
402,-0.14653
403,-0.14653
404,-0.22846
405,-0.33223
406,-0.35408
407,-0.38685
408,-0.49609
409,-0.51794
410,-0.5234
411,-0.5616300000000001
412,-0.58894
413,-0.5561699999999999
414,-0.5998600000000001
415,-0.58894
416,-0.5561699999999999
417,-0.5234
418,-0.48516000000000004
419,-0.45238999999999996
420,-0.41962
421,-0.38139
422,-0.5070100000000001
423,-0.46331999999999995
424,-0.56709
425,-0.6654100000000001
426,-0.79103
427,-0.85657
428,-0.8948
429,-0.9111899999999999
430,-1.0259
431,-1.0641
432,-1.1297
433,-1.1351
434,-1.1788
435,-1.1515
436,-1.1952
437,-1.157
438,-1.1351
439,-1.146
440,-1.157
441,-1.1351
442,-1.1515
443,-1.2116
444,-1.2007
445,-1.2116
446,-1.1624
447,-1.1679
448,-1.157
449,-1.157
450,-1.1133
451,-1.1515
452,-1.1788
453,-1.2171
454,-1.2389
455,-1.228
456,-1.2607
457,-1.3099
458,-1.3864
459,-1.4628
460,-1.4409999999999998
461,-1.4301
462,-1.4028
463,-1.3372
464,-1.2553
465,-1.1788
466,-1.157
467,-1.157
468,-1.1734
469,-1.1187
470,-1.0696
471,-1.0477
472,-0.9985799999999999
473,-0.9385
474,-0.86203
475,-0.8074100000000001
476,-0.76918
477,-0.69818
478,-0.68179
479,-0.62171
480,-0.56709
481,-0.5070100000000001
482,-0.45238999999999996
483,-0.39776999999999996
484,-0.34315999999999997
485,-0.28854
486,-0.27760999999999997
487,-0.17384000000000002
488,-0.13560999999999998
489,0.055559000000000004
490,0.18118
491,0.27403
492,0.31227
493,0.40512
494,0.38327
495,0.41603999999999997
496,0.45974
497,0.48158
498,0.47612
499,0.49796999999999997
500,0.51436
501,0.51982
502,0.59082
503,0.6672899999999999
504,0.8529899999999999
505,0.9403799999999999
506,1.0605
507,1.1698
508,1.2462
509,1.3227
510,1.4429
511,1.4756
512,1.421
513,1.5357
514,1.6013
515,1.6177
516,1.6395
517,1.6013
518,1.6013
519,1.5303
520,1.5248
521,1.492
522,1.5303
523,1.5303
524,1.492
525,1.4374
526,1.4319
527,1.3937
528,1.3664
529,1.35
530,1.3664
531,1.3118
532,1.2845
533,1.2626
534,1.2353
535,1.208
536,1.1807
537,1.1534
538,1.0824
539,1.0879
540,0.995
541,0.8693799999999999
542,0.8420700000000001
543,0.73829
544,0.71644
545,0.68913
546,0.6126699999999999
547,0.55805
548,0.51436
549,0.45974
550,0.41603999999999997
551,0.29041999999999996
552,0.19211
553,0.13749
554,0.022788
555,0.022788
556,-0.14107
557,-0.16838
558,-0.2503
559,-0.30491999999999997
560,-0.49609
561,-0.51247
562,-0.55071
563,-0.62717
564,-0.7036399999999999
565,-0.7091
566,-0.72002
567,-0.7091
568,-0.6544800000000001
569,-0.6544800000000001
570,-0.5998600000000001
571,-0.62171
572,-0.5998600000000001
573,-0.69818
574,-0.82926
575,-0.9767299999999999
576,-1.0859999999999999
577,-1.0914
578,-1.1952
579,-1.2717
580,-1.3645
581,-1.5011
582,-1.5448
583,-1.6376
584,-1.6813
585,-1.5994
586,-1.6158
587,-1.5994
588,-1.5885
589,-1.5666
590,-1.6267
591,-1.6267
592,-1.6322
593,-1.6322
594,-1.6376
595,-1.6376
596,-1.6376
597,-1.6431
598,-1.6485
599,-1.6376
600,-1.6267
601,-1.5830000000000002
602,-1.5666
603,-1.5448
604,-1.5502
605,-1.5011
606,-1.4683
607,-1.4409999999999998
608,-1.37
609,-1.3536
610,-1.2662
611,-1.2607
612,-1.1515
613,-1.1133
614,-0.9985799999999999
615,-0.8893399999999999
616,-0.8238
617,-0.7091
618,-0.5944
619,-0.53978
620,-0.50155
621,-0.41962
622,-0.30491999999999997
623,-0.10282999999999999
624,-0.080987
625,0.022788
626,0.11564
627,0.14295
628,0.2358
629,0.35596
630,0.35596
631,0.37781
632,0.40512
633,0.42696999999999996
634,0.44881000000000004
635,0.47612
636,0.49796999999999997
637,0.6181300000000001
638,0.6946
639,0.78199
640,0.89669
641,0.87484
642,0.8912200000000001
643,0.89669
644,0.9676899999999999
645,1.0824
646,1.0551
647,1.1206
648,1.1862
649,1.1643
650,1.1698
651,1.1643
652,1.2025
653,1.2462
654,1.1698
655,1.0659999999999998
656,1.0059
657,1.0059
658,0.97315
659,0.91307
660,0.8475299999999999
661,0.78745
662,0.75468
663,0.68367
664,0.58536
665,0.45974
666,0.37235
667,0.34504
668,0.30134
669,0.29588000000000003
670,0.2358
671,0.1648
672,0.093792
673,0.017325999999999998
674,-0.053678
675,-0.12468
676,-0.19569
677,-0.21206999999999998
678,-0.294
679,-0.31585
680,-0.45786000000000004
681,-0.56709
682,-0.62171
683,-0.6544800000000001
684,-0.74733
685,-0.8074100000000001
686,-0.8784200000000001
687,-0.91665
688,-0.9712700000000001
689,-0.94396
690,-0.9658100000000001
691,-1.1187
692,-1.004
693,-0.98219
694,-0.94396
695,-0.94942
696,-0.94396
697,-0.92211
698,-1.0204
699,-1.075
700,-1.2826
701,-1.3536
702,-1.5175
703,-1.5666
704,-1.6485
705,-1.6595
706,-1.7305
707,-1.8616
708,-1.8015
709,-1.8233
710,-1.7851
711,-1.8288
712,-1.8779
713,-1.9653
714,-1.9708
715,-1.9763
716,-1.9544
717,-1.9380000000000002
718,-1.9216
719,-1.8998
720,-1.8834
721,-1.8616
722,-1.8015
723,-1.7469
724,-1.6431
725,-1.5557
726,-1.4683
727,-1.3481
728,-1.3645
729,-1.2990000000000002
730,-1.2171
731,-1.146
732,-1.0259
733,-0.9002700000000001
734,-0.80195
735,-0.61625
736,-0.5998600000000001
737,-0.47423999999999994
738,-0.30491999999999997
739,-0.19022
740,-0.091911
741,0.022788
742,0.19211
743,0.26311
744,0.38873
745,0.32865
746,0.31773
747,0.40512
748,0.43243000000000004
749,0.55805
750,0.79837
751,0.92399
752,0.94584
753,0.995
754,1.0442
755,1.0933
756,1.1479
757,1.1971
758,1.2462
759,1.3009
760,1.3282
761,1.3664
762,1.3282
763,1.421
764,1.3937
765,1.2954
766,1.2845
767,1.3118
768,1.3009
769,1.2899
770,1.2790000000000001
771,1.2353
772,1.1807
773,1.1315
774,1.1152
775,1.1097
776,1.1206
777,1.0769
778,1.0551
779,1.0442
780,0.97315
781,0.94584
782,0.9403799999999999
783,0.9294600000000001
784,0.91307
785,0.8803
786,0.80383
787,0.79837
788,0.79291
789,0.78745
790,0.79291
791,0.68367
792,0.62905
793,0.54166
794,0.48705
795,0.43243000000000004
796,0.36689
797,0.33958
798,0.33958
799,0.29041999999999996
800,0.23034000000000002
801,0.12655999999999998
802,0.022788
803,-0.020907
804,-0.11375999999999999
805,-0.17384000000000002
806,-0.28854
807,-0.365
808,-0.37046999999999997
809,-0.39776999999999996
810,-0.43055
811,-0.46331999999999995
812,-0.49609
813,-0.53432
814,-0.56709
815,-0.5998600000000001
816,-0.57802
817,-0.57802
818,-0.57255
819,-0.58348
820,-0.5944
821,-0.6544800000000001
822,-0.68179
823,-0.7801
824,-0.77464
825,-0.86203
826,-0.91665
827,-1.0259
828,-1.1515
829,-1.1734
830,-1.2061
831,-1.3099
832,-1.4191
833,-1.3536
834,-1.3044
835,-1.2498
836,-1.2116
837,-1.2061
838,-1.2171
839,-1.2607
840,-1.3208
841,-1.3208
842,-1.2826
843,-1.1843
844,-1.0969
845,-1.0805
846,-1.1133
847,-1.0696
848,-1.0095
849,-0.93304
850,-0.8948
851,-0.86203
852,-0.84019
853,-0.76918
854,-0.7036399999999999
855,-0.7091
856,-0.7145600000000001
857,-0.67087
858,-0.5998600000000001
859,-0.46878000000000003
860,-0.42508
861,-0.35408
862,-0.294
863,-0.24484
864,-0.1793
865,-0.11375999999999999
866,-0.048216
867,0.017325999999999998
868,0.08832999999999999
869,0.15387
870,0.21395
871,0.25219
872,0.29588000000000003
873,0.30134
874,0.36689
875,0.45427
876,0.59082
877,0.7109800000000001
878,0.8693799999999999
879,0.9513
880,1.0824
881,1.0442
882,1.1698
883,1.0659999999999998
884,1.0933
885,1.0387
886,1.0059
887,0.8420700000000001
888,0.6782100000000001
889,0.48705
890,0.30134
891,0.022788
892,-0.16838
893,-0.294
894,-0.41962
895,-0.53978
896,-0.62171
897,-0.7145600000000001
898,-0.76918
899,-0.85111
