time,value
0,1.1246
1,2.5810000000000004
2,2.2744
3,1.9678
4,0.66473
5,-0.40838
6,-0.48503
7,-0.48503
8,-0.48503
9,-0.48503
10,-0.48503
11,-0.48503
12,-0.48503
13,-0.48503
14,-0.48503
15,-0.48503
16,-0.48503
17,-0.48503
18,-0.48503
19,-0.48503
20,-0.48503
21,-0.48503
22,2.9642
23,2.2744
24,1.9678
25,1.6612
26,-0.25508000000000003
27,-0.48503
28,-0.48503
29,-0.48503
30,-0.48503
31,-0.48503
32,-0.48503
33,-0.48503
34,-0.48503
35,-0.48503
36,-0.48503
37,-0.48503
38,-0.48503
39,-0.48503
40,-0.48503
41,-0.48503
42,-0.48503
43,1.3546
44,2.5810000000000004
45,2.2744
46,1.9678
47,-0.025124
48,-0.48503
49,-0.48503
50,-0.48503
51,-0.48503
52,-0.48503
53,-0.48503
54,-0.48503
55,-0.48503
56,-0.48503
57,-0.48503
58,-0.48503
59,-0.48503
60,-0.48503
61,-0.48503
62,-0.48503
63,-0.48503
64,1.1246
65,2.5810000000000004
66,2.2744
67,1.9678
68,0.12818
69,-0.48503
70,-0.48503
71,-0.48503
72,-0.48503
73,-0.48503
74,-0.48503
75,-0.48503
76,-0.48503
77,-0.48503
78,-0.48503
79,-0.48503
80,-0.48503
81,-0.48503
82,-0.48503
83,-0.48503
84,-0.48503
85,1.1246
86,2.5810000000000004
87,1.9678
88,2.2744
89,-0.17843
90,-0.40838
91,-0.48503
92,-0.48503
93,-0.48503
94,-0.48503
95,-0.48503
96,-0.48503
97,-0.48503
98,-0.48503
99,-0.48503
100,-0.48503
101,-0.48503
102,-0.48503
103,-0.48503
104,-0.48503
105,-0.48503
106,1.1246
107,2.5810000000000004
108,2.2744
109,1.9678
110,-0.025124
111,-0.48503
112,-0.48503
113,-0.48503
114,-0.48503
115,-0.48503
116,-0.48503
117,-0.48503
118,-0.48503
119,-0.48503
120,-0.48503
121,-0.48503
122,-0.48503
123,-0.48503
124,-0.48503
125,-0.48503
126,-0.48503
127,0.8946799999999999
128,2.5810000000000004
129,2.2744
130,1.9678
131,0.12818
132,-0.48503
133,-0.48503
134,-0.48503
135,-0.48503
136,-0.48503
137,-0.48503
138,-0.48503
139,-0.48503
140,-0.48503
141,-0.48503
142,-0.48503
143,-0.48503
144,-0.48503
145,-0.48503
146,-0.48503
147,-0.48503
148,0.28148
149,2.5810000000000004
150,2.2744
151,2.2744
152,0.43478
153,-0.48503
154,-0.48503
155,-0.48503
156,-0.48503
157,-0.48503
158,-0.48503
159,-0.48503
160,-0.48503
161,-0.48503
162,-0.48503
163,-0.48503
164,-0.48503
165,-0.48503
166,-0.48503
167,-0.48503
168,-0.48503
169,-0.48503
170,2.5810000000000004
171,2.2744
172,2.2744
173,0.28148
174,-0.48503
175,-0.48503
176,-0.48503
177,-0.48503
178,-0.48503
179,-0.48503
180,-0.48503
181,-0.48503
182,-0.48503
183,-0.48503
184,-0.48503
185,-0.48503
186,-0.48503
187,-0.48503
188,-0.48503
189,-0.48503
190,-0.48503
191,1.6612
192,2.5810000000000004
193,1.9678
194,0.8946799999999999
195,-0.40838
196,-0.48503
197,-0.48503
198,-0.48503
199,-0.48503
200,-0.48503
201,-0.48503
202,-0.48503
203,-0.48503
204,-0.48503
205,-0.48503
206,-0.48503
207,-0.48503
208,-0.48503
209,-0.48503
210,-0.48503
211,-0.48503
212,0.12818
213,2.5810000000000004
214,2.2744
215,1.9678
216,-0.48503
217,-0.48503
218,-0.48503
219,-0.48503
220,-0.48503
221,-0.48503
222,-0.48503
223,-0.48503
224,-0.48503
225,-0.48503
226,-0.48503
227,-0.48503
228,-0.48503
229,-0.48503
230,-0.48503
231,-0.48503
232,-0.48503
233,-0.48503
234,1.1246
235,2.5810000000000004
236,2.2744
237,0.66473
238,-0.33173
239,-0.48503
240,-0.48503
241,-0.48503
242,-0.48503
243,-0.48503
244,-0.48503
245,-0.48503
246,-0.48503
247,-0.48503
248,-0.48503
249,-0.48503
250,-0.48503
251,-0.48503
252,-0.40838
253,-0.48503
254,2.5810000000000004
255,2.5810000000000004
256,1.9678
257,0.28148
258,-0.40838
259,-0.48503
260,-0.48503
261,-0.48503
262,-0.48503
263,-0.48503
264,-0.48503
265,-0.48503
266,-0.48503
267,-0.48503
268,-0.48503
269,-0.48503
270,-0.48503
271,-0.48503
272,-0.48503
273,-0.48503
274,-0.48503
275,-0.48503
276,2.5810000000000004
277,2.5810000000000004
278,1.9678
279,0.28148
280,-0.48503
281,-0.48503
282,-0.48503
283,-0.48503
284,-0.48503
285,-0.48503
286,-0.48503
287,-0.48503
288,-0.48503
289,-0.48503
290,-0.48503
291,-0.48503
292,-0.48503
293,-0.48503
294,-0.48503
295,-0.48503
296,-0.48503
297,-0.17843
298,2.5810000000000004
299,2.5810000000000004
300,1.9678
301,-0.025124
302,-0.40838
303,-0.48503
304,-0.48503
305,-0.48503
306,-0.48503
307,-0.48503
308,-0.48503
309,-0.48503
310,-0.48503
311,-0.48503
312,-0.48503
313,-0.48503
314,-0.48503
315,-0.48503
316,-0.48503
317,-0.48503
318,-0.48503
319,0.66473
320,2.5810000000000004
321,2.2744
322,1.9678
323,-0.40838
324,-0.48503
325,-0.48503
326,-0.48503
327,-0.48503
328,-0.48503
329,-0.48503
330,-0.48503
331,-0.48503
332,-0.48503
333,-0.48503
334,-0.48503
335,-0.48503
336,-0.48503
337,-0.48503
338,-0.48503
339,-0.48503
340,-0.48503
341,1.6612
342,2.5810000000000004
343,2.2744
344,0.8946799999999999
345,-0.33173
346,-0.48503
347,-0.48503
348,-0.48503
349,-0.48503
350,-0.48503
351,-0.48503
352,-0.48503
353,-0.48503
354,-0.48503
355,-0.48503
356,-0.48503
357,-0.48503
358,-0.48503
359,-0.48503
360,-0.48503
361,-0.48503
362,0.43478
363,2.5810000000000004
364,2.2744
365,1.9678
366,-0.025124
367,-0.48503
368,-0.48503
369,-0.48503
370,-0.48503
371,-0.48503
372,-0.48503
373,-0.48503
374,-0.48503
375,-0.48503
376,-0.48503
377,-0.48503
378,-0.48503
379,-0.48503
380,-0.48503
381,-0.48503
382,-0.48503
383,-0.48503
384,1.9678
385,2.5810000000000004
386,2.2744
387,0.8946799999999999
388,-0.40838
389,-0.48503
390,-0.48503
391,-0.48503
392,-0.48503
393,-0.48503
394,-0.48503
395,-0.48503
396,-0.48503
397,-0.48503
398,-0.48503
399,-0.48503
400,-0.48503
401,-0.48503
402,-0.48503
403,-0.48503
404,-0.48503
405,0.8946799999999999
406,2.5810000000000004
407,2.2744
408,1.9678
409,-0.17843
410,-0.48503
411,-0.48503
412,-0.48503
413,-0.48503
414,-0.48503
415,-0.48503
416,-0.48503
417,-0.48503
418,-0.48503
419,-0.48503
420,-0.48503
421,-0.48503
422,-0.48503
423,-0.48503
424,-0.48503
425,-0.48503
426,-0.48503
427,2.2744
428,2.5810000000000004
429,1.9678
430,1.3546
431,-0.48503
432,-0.48503
433,-0.48503
434,-0.48503
435,-0.48503
436,-0.48503
437,-0.48503
438,-0.48503
439,-0.48503
440,-0.48503
441,-0.48503
442,-0.48503
443,-0.48503
444,-0.48503
445,-0.48503
446,-0.48503
447,-0.48503
448,1.1246
449,2.5810000000000004
450,2.2744
451,1.9678
452,-0.33173
453,-0.48503
454,-0.48503
455,-0.48503
456,-0.48503
457,-0.48503
458,-0.48503
459,-0.48503
460,-0.48503
461,-0.48503
462,-0.48503
463,-0.48503
464,-0.48503
465,-0.48503
466,-0.48503
467,-0.48503
468,-0.48503
469,0.28148
470,2.5810000000000004
471,2.2744
472,2.2744
473,0.28148
474,-0.40838
475,-0.48503
476,-0.48503
477,-0.48503
478,-0.48503
479,-0.48503
480,-0.48503
481,-0.48503
482,-0.48503
483,-0.48503
484,-0.48503
485,-0.48503
486,-0.48503
487,-0.48503
488,-0.48503
489,-0.48503
490,-0.48503
491,2.2744
492,2.5810000000000004
493,1.9678
494,1.3546
495,-0.40838
496,-0.48503
497,-0.48503
498,-0.48503
499,-0.48503
500,-0.48503
501,-0.48503
502,-0.48503
503,-0.48503
504,-0.48503
505,-0.48503
506,-0.48503
507,-0.48503
508,-0.48503
509,-0.48503
510,-0.48503
511,-0.48503
512,1.6612
513,2.5810000000000004
514,2.2744
515,1.6612
516,-0.25508000000000003
517,-0.48503
518,-0.48503
519,-0.48503
520,-0.48503
521,-0.48503
522,-0.48503
523,-0.48503
524,-0.48503
525,-0.48503
526,-0.48503
527,-0.48503
528,-0.48503
529,-0.48503
530,-0.48503
531,-0.48503
532,-0.48503
533,0.66473
534,2.5810000000000004
535,2.2744
536,1.9678
537,-0.025124
538,-0.48503
539,-0.48503
540,-0.48503
541,-0.48503
542,-0.48503
543,-0.48503
544,-0.48503
545,-0.48503
546,-0.48503
547,-0.48503
548,-0.48503
549,-0.48503
550,-0.48503
551,-0.48503
552,-0.48503
553,-0.48503
554,0.12818
555,2.5810000000000004
556,2.2744
557,1.9678
558,0.43478
559,-0.48503
560,-0.48503
561,-0.48503
562,-0.48503
563,-0.48503
564,-0.48503
565,-0.48503
566,-0.48503
567,-0.48503
568,-0.48503
569,-0.48503
570,-0.48503
571,-0.48503
572,-0.48503
573,-0.48503
574,-0.48503
575,-0.48503
576,2.5810000000000004
577,2.5810000000000004
578,1.9678
579,0.66473
580,-0.40838
581,-0.48503
582,-0.48503
583,-0.48503
584,-0.48503
585,-0.48503
586,-0.48503
587,-0.48503
588,-0.48503
589,-0.48503
590,-0.48503
591,-0.48503
592,-0.48503
593,-0.48503
594,-0.48503
595,-0.48503
596,-0.48503
597,2.2744
598,2.2744
599,2.2744
600,1.3546
601,-0.48503
602,-0.48503
603,-0.48503
604,-0.48503
605,-0.48503
606,-0.48503
607,-0.48503
608,-0.48503
609,-0.48503
610,-0.40838
611,-0.48503
612,-0.48503
613,-0.48503
614,2.5810000000000004
615,2.2744
616,2.2744
617,1.9678
618,0.43478
619,-0.40838
620,-0.48503
621,-0.48503
622,-0.48503
623,-0.48503
624,-0.48503
625,-0.48503
626,-0.48503
627,-0.48503
628,-0.48503
629,-0.48503
630,-0.48503
631,-0.48503
632,-0.48503
633,-0.48503
634,-0.48503
635,0.28148
636,2.5810000000000004
637,2.2744
638,2.2744
639,1.9678
640,1.9678
641,1.1246
642,-0.33173
643,-0.48503
644,-0.48503
645,-0.48503
646,-0.48503
647,-0.48503
648,-0.48503
649,-0.48503
650,-0.48503
651,-0.48503
652,-0.48503
653,-0.48503
654,-0.48503
655,-0.48503
656,-0.48503
657,-0.48503
658,-0.48503
659,-0.48503
660,1.9678
661,2.2744
662,2.2744
663,1.9678
664,0.12818
665,-0.48503
666,-0.48503
667,-0.48503
668,-0.48503
669,-0.48503
670,-0.48503
671,-0.48503
672,-0.48503
673,-0.48503
674,-0.48503
675,-0.48503
676,-0.48503
677,-0.48503
678,-0.48503
679,-0.48503
680,-0.48503
681,-0.48503
682,1.9678
683,2.2744
684,2.2744
685,1.9678
686,0.12818
687,-0.40838
688,-0.48503
689,-0.48503
690,-0.48503
691,-0.48503
692,-0.48503
693,-0.48503
694,-0.48503
695,-0.48503
696,-0.48503
697,-0.48503
698,-0.48503
699,-0.48503
700,-0.48503
701,-0.48503
702,-0.48503
703,-0.48503
704,1.9678
705,2.2744
706,2.2744
707,1.9678
708,0.28148
709,-0.40838
710,-0.48503
711,-0.48503
712,-0.48503
713,-0.48503
714,-0.48503
715,-0.48503
716,-0.48503
717,-0.48503
718,-0.48503
719,-0.48503
