time,value
0,-0.020799
1,-0.020799
2,-0.020799
3,-0.020799
4,-0.020799
5,-0.020799
6,-0.020799
7,-0.020799
8,-0.020799
9,-0.020799
10,-0.020799
11,-0.020799
12,-0.020799
13,-0.020799
14,-0.020799
15,-0.020799
16,-0.020799
17,-0.020799
18,-0.020799
19,-0.020799
20,-0.020966
21,-0.04319
22,-0.10708
23,-0.17942
24,-0.25175
25,-0.32409
26,-0.39199
27,-0.42946999999999996
28,-0.43128999999999995
29,-0.4068
30,-0.36672
31,-0.30971
32,-0.24911999999999998
33,-0.22604000000000002
34,-0.22604000000000002
35,-0.22604000000000002
36,-0.20317000000000002
37,-0.14935
38,-0.099085
39,-0.089214
40,-0.089214
41,-0.089214
42,-0.10786
43,-0.13918
44,-0.15763
45,-0.15316
46,-0.13584000000000002
47,-0.099673
48,0.018596
49,0.16852999999999999
50,0.36224
51,0.58816
52,0.82981
53,1.0803
54,1.2986
55,1.4809
56,1.6085
57,1.7022
58,1.7765
59,1.8264
60,1.8273
61,1.8656
62,1.9327
63,1.9380000000000002
64,1.9006
65,1.8451
66,1.7692
67,1.6714
68,1.5666
69,1.4874
70,1.4259
71,1.3793
72,1.3348
73,1.2673
74,1.2048
75,1.1662
76,1.1301
77,1.0939
78,1.0577
79,1.0216
80,0.9853799999999999
81,0.94921
82,0.91305
83,0.8768799999999999
84,0.8407100000000001
85,0.8045399999999999
86,0.76831
87,0.7317
88,0.6603
89,0.58796
90,0.51563
91,0.44328999999999996
92,0.37095
93,0.29862
94,0.22628
95,0.15394000000000002
96,0.081606
97,0.0092685
98,-0.063068
99,-0.13541
100,-0.20672
101,-0.25182
102,-0.29374
103,-0.35634
104,-0.42868
105,-0.5010100000000001
106,-0.57863
107,-0.68452
108,-0.78164
109,-0.8587799999999999
110,-0.91494
111,-0.95347
112,-0.9642299999999999
113,-0.9262600000000001
114,-0.8722200000000001
115,-0.80125
116,-0.7529100000000001
117,-0.72072
118,-0.70495
119,-0.7103
120,-0.73502
121,-0.7711899999999999
122,-0.8073600000000001
123,-0.84352
124,-0.87969
125,-0.9262600000000001
126,-0.9938600000000001
127,-1.0662
128,-1.1385
129,-1.1925
130,-1.2335
131,-1.2697
132,-1.3059
133,-1.3419999999999999
134,-1.3782
135,-1.4414
136,-1.5119999999999998
137,-1.5843
138,-1.6396
139,-1.6628
140,-1.6646
141,-1.6999
142,-1.736
143,-1.7721
144,-1.8083
145,-1.8445
146,-1.8806
147,-1.9168
148,-1.9334
149,-1.9364
150,-1.9147
151,-1.8798
152,-1.8436
153,-1.8074
154,-1.7713
155,-1.7351
156,-1.6989
157,-1.6734
158,-1.6628
159,-1.6628
160,-1.6628
161,-1.6628
162,-1.6628
163,-1.68
164,-1.7081
165,-1.7155
166,-1.6793
167,-1.6432
168,-1.607
169,-1.5962
170,-1.5887
171,-1.5669
172,-1.5307
173,-1.4946
174,-1.4584
175,-1.4222
176,-1.3861
177,-1.3499
178,-1.3015
179,-1.2362
180,-1.173
181,-1.1368
182,-1.0816
183,-1.0135
184,-0.96029
185,-0.9237
186,-0.88754
187,-0.85106
188,-0.78722
189,-0.71628
190,-0.64394
191,-0.55245
192,-0.43041999999999997
193,-0.28129
194,-0.10263
195,0.07811900000000001
196,0.25895999999999997
197,0.4398
198,0.61711
199,0.7736
200,0.8766200000000001
201,0.9119200000000001
202,0.8829799999999999
203,0.79988
204,0.70617
205,0.63764
206,0.6158600000000001
207,0.6543
208,0.73187
209,0.86598
210,1.0107
211,1.1553
212,1.2903
213,1.3996
214,1.4813
215,1.4843
216,1.3935
217,1.2381
218,1.0573
219,0.90009
220,0.8211
221,0.8572700000000001
222,0.94676
223,1.0624
224,1.2176
225,1.3822
226,1.514
227,1.6197
228,1.621
229,1.5628
230,1.4185
231,1.2377
232,1.0568
233,0.8760100000000001
234,0.69516
235,0.6504300000000001
236,0.69952
237,0.81414
238,0.94045
239,1.0294
240,1.0632
241,1.073
242,1.0659
243,1.0102
244,0.8962700000000001
245,0.7226199999999999
246,0.50561
247,0.29003
248,0.11573
249,0.028877999999999997
250,0.041197000000000004
251,0.12312999999999999
252,0.24545
253,0.39013000000000003
254,0.5348
255,0.67948
256,0.82415
257,0.95165
258,1.0324
259,1.0622
260,1.0737
261,1.0724
262,1.0390000000000001
263,1.0028
264,0.9666399999999999
265,0.93048
266,0.8976200000000001
267,0.8790600000000001
268,0.91522
269,0.95139
270,0.98756
271,0.9868399999999999
272,0.9415600000000001
273,0.87034
274,0.76184
275,0.68102
276,0.6022
277,0.50473
278,0.40549
279,0.32171
280,0.25299
281,0.21506999999999998
282,0.17878
283,0.14261
284,0.12178
285,0.1142
286,0.10252
287,0.066354
288,0.030185000000000003
289,-0.0059832
290,-0.042151999999999995
291,-0.07832
292,-0.11449000000000001
293,-0.15066
294,-0.18683
295,-0.21996999999999997
296,-0.22604000000000002
297,-0.21502
298,-0.18899999999999997
299,-0.16188
300,-0.15763
301,-0.15763
302,-0.15763
303,-0.17552
304,-0.20733000000000001
305,-0.25916
306,-0.32421
307,-0.36288000000000004
308,-0.36288000000000004
309,-0.36288000000000004
310,-0.3684
311,-0.3912
312,-0.41962
313,-0.43128999999999995
314,-0.43128999999999995
