time,value
0,0.96791
1,2.9959
2,4.696000000000001
3,5.1101
4,3.9521
5,1.8559
6,-0.053822
7,-0.93086
8,-0.7155100000000001
9,-0.031375
10,0.38916
11,0.25355
12,-0.19454000000000002
13,-0.5127
14,-0.4727
15,-0.20706
16,-0.021771000000000002
17,-0.097988
18,-0.35986999999999997
19,-0.5784699999999999
20,-0.57276
21,-0.33526
22,-0.0019387
23,0.27159
24,0.40805
25,0.42751000000000006
26,0.40633
27,0.41539
28,0.47981
29,0.57377
30,0.64331
31,0.64483
32,0.58355
33,0.50474
34,0.46019
35,0.48283999999999994
36,0.541
37,0.57644
38,0.54956
39,0.45597
40,0.31931
41,0.17475
42,0.052365999999999996
43,-0.024878
44,-0.042127
45,-0.0059076
46,0.050768
47,0.083242
48,0.060568
49,-0.010359
50,-0.087528
51,-0.12936
52,-0.12944
53,-0.1207
54,-0.14792
55,-0.2274
56,-0.32844
57,-0.4026
58,-0.42223999999999995
59,-0.3987
60,-0.37368
61,-0.38072
62,-0.41558
63,-0.45051
64,-0.46136000000000005
65,-0.44692
66,-0.43195
67,-0.44025
68,-0.46978000000000003
69,-0.50059
70,-0.51267
71,-0.50112
72,-0.48289
73,-0.47839
74,-0.49261000000000005
75,-0.51656
76,-0.53704
77,-0.5465899999999999
78,-0.55066
79,-0.5596
80,-0.57655
81,-0.59814
82,-0.61678
83,-0.62513
84,-0.62361
85,-0.61871
86,-0.61626
87,-0.62016
88,-0.62956
89,-0.63951
90,-0.6469199999999999
91,-0.6530100000000001
92,-0.66098
93,-0.6736800000000001
94,-0.68916
95,-0.7003
96,-0.7017399999999999
97,-0.69497
98,-0.68774
