time,value
0,-2.2669
1,-1.7635
2,-1.1502
3,-0.47418000000000005
4,0.20768000000000003
5,0.84655
6,1.3897
7,1.7937
8,2.0314
9,2.085
10,1.9636
11,1.7012
12,1.3357
13,0.91464
14,0.49023
15,0.10689000000000001
16,-0.20845999999999998
17,-0.44072
18,-0.5917100000000001
19,-0.67204
20,-0.7048300000000001
21,-0.7088300000000001
22,-0.6995899999999999
23,-0.6894100000000001
24,-0.67773
25,-0.6652600000000001
26,-0.64545
27,-0.6139100000000001
28,-0.5582
29,-0.47003999999999996
30,-0.34701
31,-0.18124
32,0.029852999999999998
33,0.27476
34,0.53569
35,0.78882
36,0.99726
37,1.1221
38,1.1428
39,1.0531
40,0.8549899999999999
41,0.57863
42,0.26432
43,-0.052835
44,-0.33809
45,-0.5725399999999999
46,-0.75146
47,-0.88355
48,-0.98203
49,-1.0464
50,-1.0745
51,-1.0548
52,-0.97598
53,-0.8306899999999999
54,-0.61088
55,-0.33079000000000003
56,-0.0086336
57,0.32705
58,0.65028
59,0.9336399999999999
60,1.1626
61,1.3249
62,1.4201
63,1.4493
64,1.4116
65,1.2905
66,1.0816
67,0.78456
68,0.4028
69,-0.041738
70,-0.51553
71,-0.97178
72,-1.3687
73,-1.6689
74,-1.8446
75,-1.8941
76,-1.8319999999999999
77,-1.6798
78,-1.4676
79,-1.2065
80,-0.90507
81,-0.5633600000000001
82,-0.16885999999999998
83,0.28966
84,0.80118
85,1.3383
86,1.8648
87,2.3249
88,2.6608
89,2.8241
90,2.7798
91,2.5105
92,2.019
93,1.3315
94,0.48918999999999996
95,-0.44014
96,-1.3759
97,-2.2315
98,-2.9192
99,-3.362
100,-3.5152
101,-3.3596
102,-2.9165
103,-2.2446
104,-1.4253
105,-0.54711
106,0.29867
107,1.0422
108,1.6376
109,2.0576
110,2.2991
111,2.375
112,2.3007
113,2.1066
114,1.8239
115,1.4858
116,1.1249
117,0.77148
118,0.44538999999999995
119,0.15586
120,-0.094582
121,-0.32214
122,-0.5419
123,-0.77489
124,-1.0306
125,-1.3028
126,-1.569
127,-1.7978
128,-1.9566
129,-2.0164
130,-1.9594
131,-1.7725
132,-1.4623
133,-1.0497
134,-0.5598
135,-0.020763999999999998
136,0.52461
137,1.0323
138,1.4677
139,1.7965
140,1.9975
141,2.0705
142,2.0259
143,1.881
144,1.6705
145,1.4203
146,1.1464
147,0.8569700000000001
148,0.55948
149,0.24861999999999998
150,-0.08224
151,-0.42881
152,-0.7823399999999999
153,-1.1285
154,-1.4421
155,-1.7033
156,-1.8879
157,-1.9795
158,-1.9678
159,-1.8495
160,-1.6244
161,-1.304
162,-0.9104399999999999
163,-0.47123999999999994
164,-0.021606999999999998
165,0.39947
166,0.76823
167,1.0686
168,1.2912
169,1.4359
170,1.5099
171,1.5238
172,1.4819
173,1.3863
174,1.237
175,1.0321
176,0.78042
177,0.49737
178,0.20669
179,-0.065407
180,-0.30308
181,-0.49646
182,-0.64604
183,-0.7581100000000001
184,-0.8410299999999999
185,-0.8975200000000001
186,-0.9234899999999999
187,-0.91364
188,-0.86175
189,-0.76536
190,-0.63678
191,-0.49978999999999996
192,-0.38076
193,-0.30141999999999997
194,-0.27366
195,-0.29136
196,-0.3295
197,-0.35352
198,-0.3249
199,-0.21441999999999997
200,-0.020328
201,0.24275
202,0.54145
203,0.8363200000000001
204,1.0893
205,1.2746
206,1.3812
207,1.4083
208,1.3627
209,1.2471
210,1.0685
211,0.8262
212,0.52127
213,0.16274
214,-0.23071999999999998
215,-0.62836
216,-0.99105
217,-1.2778
218,-1.4545
219,-1.5022
220,-1.4215
221,-1.2414
222,-0.9965799999999999
223,-0.7368
224,-0.49775
225,-0.30912
226,-0.18495999999999999
227,-0.11495999999999999
228,-0.078192
229,-0.037737
230,0.027618
231,0.13903
232,0.29796
233,0.49146999999999996
234,0.69772
235,0.8910100000000001
236,1.0413
237,1.1337
238,1.1591
239,1.1153
240,1.0074
241,0.83986
242,0.62331
243,0.36717
244,0.087286
245,-0.2046
246,-0.4852
247,-0.72968
248,-0.9139
249,-1.0271
250,-1.0616
251,-1.0208
252,-0.9208200000000001
253,-0.77853
254,-0.61621
255,-0.44801
256,-0.28597
257,-0.13719
258,-0.0034658000000000002
259,0.11825
260,0.22680999999999998
261,0.3189
262,0.38700999999999997
263,0.4276
264,0.4385
265,0.41945
266,0.37797
267,0.32513000000000003
268,0.2666
269,0.21253000000000002
270,0.16945
271,0.13818
272,0.11227999999999999
273,0.089034
274,0.0683
275,0.046377999999999996
276,0.018818
277,-0.02011
278,-0.065166
279,-0.12154000000000001
280,-0.18335
281,-0.2394
282,-0.27719
283,-0.28451
284,-0.25196999999999997
285,-0.17578
286,-0.063306
287,0.074913
288,0.2221
289,0.35794000000000004
290,0.46026999999999996
291,0.5072300000000001
292,0.48953
293,0.40096
294,0.23689000000000002
295,0.0058328
296,-0.27533
297,-0.5858399999999999
298,-0.89074
299,-1.1566
300,-1.3459
301,-1.4137
302,-1.3315
303,-1.0913
304,-0.70236
305,-0.19416
306,0.37784
307,0.9476899999999999
308,1.4505
309,1.8164
310,2.0074
311,2.0021
312,1.8108
313,1.4654
314,1.0198
315,0.52992
316,0.051754999999999995
317,-0.36875
318,-0.70124
319,-0.93453
320,-1.0716
321,-1.1305
322,-1.126
323,-1.0782
324,-0.9988799999999999
325,-0.8963700000000001
326,-0.7821899999999999
327,-0.6561
328,-0.52878
329,-0.39860999999999996
330,-0.27326
331,-0.14822000000000002
332,-0.025823000000000002
333,0.09559
334,0.22828
335,0.37135999999999997
336,0.52264
337,0.6829
338,0.83868
339,0.9702799999999999
340,1.061
341,1.0926
342,1.0435
343,0.9075200000000001
344,0.68795
345,0.40264
346,0.082135
347,-0.23676
348,-0.51727
349,-0.736
350,-0.8741399999999999
351,-0.93096
352,-0.9187
353,-0.8569200000000001
354,-0.76058
355,-0.6403399999999999
356,-0.50753
357,-0.36386999999999997
358,-0.21533000000000002
359,-0.063041
360,0.086263
361,0.2259
362,0.3417
363,0.42495
364,0.47323999999999994
365,0.48765
366,0.4736
367,0.43221000000000004
368,0.36763
369,0.28526999999999997
370,0.1852
371,0.071254
372,-0.051055
373,-0.16899
374,-0.26893
375,-0.34331
376,-0.38189
377,-0.38036
378,-0.3385
379,-0.2714
380,-0.18935
381,-0.10397999999999999
382,-0.021633000000000003
383,0.056138
384,0.13473
385,0.22685
386,0.32829
387,0.42712
388,0.50379
389,0.53896
390,0.51308
391,0.41951000000000005
392,0.26903
393,0.085141
394,-0.09867000000000001
395,-0.24779
396,-0.34169
397,-0.37266
398,-0.34738
399,-0.29299000000000003
400,-0.23381
401,-0.1913
402,-0.19119
403,-0.23333
404,-0.30617
405,-0.39311
406,-0.47618999999999995
407,-0.53568
408,-0.55888
409,-0.53791
410,-0.46343
411,-0.33815
412,-0.16130999999999998
413,0.063545
414,0.32379
415,0.60247
416,0.87644
417,1.1173
418,1.298
419,1.3962
420,1.3948
421,1.2806
422,1.0567
423,0.7277399999999999
424,0.31251999999999996
425,-0.16252
426,-0.66081
427,-1.1283
428,-1.5196
429,-1.7805
430,-1.8771
431,-1.7912
432,-1.5330000000000001
433,-1.1314
434,-0.6414
435,-0.13327999999999998
436,0.33734000000000003
437,0.71826
438,0.9793700000000001
439,1.1108
440,1.1303
441,1.0578
442,0.91915
443,0.74927
444,0.5657800000000001
445,0.38054
446,0.20257
447,0.035733
448,-0.12097000000000001
449,-0.25934
450,-0.36911
451,-0.44151
452,-0.47513
453,-0.46643999999999997
454,-0.42003
455,-0.35236
456,-0.27846
457,-0.21305
458,-0.16815
459,-0.14271
460,-0.13043
461,-0.12717
462,-0.12387000000000001
463,-0.10685
464,-0.065243
465,-0.00015681
466,0.081981
467,0.17002
468,0.25143000000000004
469,0.31708000000000003
470,0.36115
471,0.38005
472,0.37651999999999997
473,0.35722
474,0.32652
475,0.28534
476,0.24318
477,0.20177
478,0.15913
479,0.10937999999999999
480,0.047054
481,-0.030077
482,-0.12825999999999999
483,-0.24804
484,-0.37921
485,-0.5070600000000001
486,-0.61939
487,-0.69344
488,-0.71413
489,-0.66884
490,-0.56812
491,-0.42157
492,-0.25219
493,-0.078467
494,0.081231
495,0.21053000000000002
496,0.30453
497,0.36717
498,0.40492
499,0.41913999999999996
