time,value
0,-0.16203
1,-0.33221999999999996
2,0.52274
3,-0.12021
4,-0.66227
5,0.26319000000000004
6,-0.14211
7,0.27638
8,-0.13783
9,-0.14784
10,-0.10321
11,-0.076038
12,0.35105
13,0.40216999999999997
14,-0.25239
15,0.52815
16,-0.09710099999999999
17,0.12397000000000001
18,0.069995
19,-0.38684
20,-0.32195999999999997
21,0.38934
22,0.50815
23,0.40644
24,0.48078000000000004
25,-0.10155
26,0.07477400000000001
27,0.10402
28,-0.29915
29,-0.1889
30,0.33516
31,0.08293500000000001
32,0.24683000000000002
33,-0.8844799999999999
34,0.82601
35,0.23800000000000002
36,-0.43823
37,0.53969
38,0.14965
39,0.088009
40,0.17648
41,-0.061474
42,0.013963999999999999
43,0.32633
44,0.05854500000000001
45,-0.34006
46,-0.29413
47,-0.22574
48,0.13585
49,0.1856
50,0.11108
51,-0.09172999999999999
52,0.30293000000000003
53,0.064024
54,-0.16510999999999998
55,-0.18248
56,-0.44051
57,-0.07951
58,0.18538
59,0.11015
60,-0.36675
61,0.31665
62,0.05394500000000001
63,0.47702
64,0.46766
65,-0.32831
66,0.0038146
67,-0.47966000000000003
68,0.5482
69,-0.86625
70,-0.040168999999999996
71,0.31455
72,-0.026099
73,0.25631
74,-0.17685
75,0.15277000000000002
76,-0.17504
77,0.12509
78,-0.48241999999999996
79,-0.66264
80,-0.079653
81,0.13799
82,0.11026
83,-1.6957
84,-1.6957
85,-1.6957
86,-1.6957
87,-1.6957
88,-1.6957
89,-1.6957
90,-1.6957
91,-1.6957
92,-1.6957
93,-1.6957
94,-1.6957
95,-1.6957
96,1.6876
97,1.6876
98,1.6876
99,1.6876
100,1.6876
101,1.6876
102,1.6876
103,1.6876
104,1.6876
105,1.6876
106,1.6876
107,1.6876
108,1.6876
109,1.6876
110,1.6876
111,1.6876
112,1.6876
113,1.6876
114,1.6876
115,1.6876
116,-1.6957
117,-1.6957
118,-1.6957
119,-1.6957
120,-1.6957
121,-1.6957
122,-1.6957
123,-1.6957
124,0.6241899999999999
125,-0.28415999999999997
126,0.30675
127,-0.012775
