time,value
0,0.14916
1,0.36708
2,0.41673999999999994
3,-0.15645
4,-0.5018100000000001
5,-0.49318999999999996
6,0.13906
7,0.048997000000000006
8,-0.55412
9,0.57406
10,0.48541000000000006
11,0.2216
12,0.010159
13,-0.6134
14,-0.058439
15,0.6420399999999999
16,0.17477
17,-0.029323000000000002
18,0.27465
19,-0.0932
20,-0.30884
21,0.25631
22,-0.01287
23,-0.10413
24,0.18305
25,-0.16064
26,-0.1352
27,-0.051948
28,1.6581
29,1.6581
30,1.6581
31,1.6581
32,1.6581
33,1.6581
34,1.6581
35,1.6581
36,1.6581
37,1.6581
38,1.6581
39,1.6581
40,1.6581
41,-1.6013
42,-1.6013
43,-1.6013
44,-1.6013
45,-1.6013
46,-1.6013
47,-1.6013
48,-1.6013
49,-1.6013
50,-1.6013
51,-1.6013
52,-1.6013
53,0.19376
54,-0.80528
55,0.6272
56,0.30295
57,-0.9191299999999999
58,-0.026467
59,-0.14469
60,0.26169000000000003
61,-0.38240999999999997
62,0.27509
63,-0.56639
64,0.5606399999999999
65,0.092954
66,0.46369
67,0.51647
68,0.41198999999999997
69,0.004675899999999999
70,0.039330000000000004
71,0.06522
72,-1.6013
73,-1.6013
74,-1.6013
75,-1.6013
76,-1.6013
77,-1.6013
78,-1.6013
79,-1.6013
80,-1.6013
81,-1.6013
82,1.6581
83,1.6581
84,1.6581
85,1.6581
86,1.6581
87,1.6581
88,1.6581
89,1.6581
90,1.6581
91,-0.58819
92,-0.50864
93,0.032936
94,-0.24766
95,0.23611
96,0.16647
97,0.23861
98,-0.01344
99,0.077914
100,-0.43878
101,-0.18968
102,-0.16983
103,0.49011000000000005
104,0.10613
105,-0.24231999999999998
106,-0.37599
107,-0.5274
108,-0.046301
109,-0.3951
110,0.22678
111,0.35039000000000003
112,-0.14765999999999999
113,-0.52764
114,0.030519
115,-0.27601
116,0.47752
117,-0.22794
118,0.01769
119,0.40705
120,0.20509000000000002
121,-0.27466
122,0.19513
123,-0.2345
124,-0.46106
125,-0.03915
126,0.13077
127,-0.34796
