time,value
0,0.78398
1,0.8338700000000001
2,0.81477
3,0.79566
4,0.74334
5,0.69102
6,0.8483200000000001
7,0.77547
8,0.73727
9,0.80757
10,0.8235299999999999
11,0.7488199999999999
12,0.76331
13,0.7778
14,0.74097
15,0.8104899999999999
16,0.75551
17,0.87577
18,0.75229
19,0.81317
20,0.79915
21,0.76979
22,0.7581399999999999
23,0.80027
24,0.79588
25,0.7802899999999999
26,0.7993399999999999
27,0.77849
28,0.75765
29,0.7579100000000001
30,0.80957
31,0.73646
32,0.7399899999999999
33,0.7580600000000001
34,0.77613
35,0.79582
36,0.81552
37,0.75653
38,0.74525
39,0.78879
40,0.79997
41,0.72468
42,0.77954
43,0.76749
44,0.7949
45,0.7973399999999999
46,0.7683300000000001
47,0.76657
48,0.80991
49,0.80416
50,0.84878
51,0.74702
52,0.77062
53,0.82901
54,0.75813
55,0.79399
56,0.8298399999999999
57,0.8272299999999999
58,0.82462
59,0.8439700000000001
60,0.81686
61,0.82101
62,0.75743
63,0.7891199999999999
64,0.7739199999999999
65,0.81947
66,0.8383
67,0.8273
68,0.80575
69,0.77951
70,0.75862
71,0.7589100000000001
72,0.7592
73,0.86249
74,0.7975899999999999
75,0.8520700000000001
76,0.75837
77,0.8004899999999999
78,0.48281999999999997
79,-0.54699
80,-1.6184
81,-1.9655
82,-1.9649
83,-1.9931
84,-2.0722
85,-1.962
86,-1.984
87,-2.0054
88,-1.9713
89,-1.9708
90,-1.9283
91,-1.942
92,-1.9468
93,-1.9336
94,-1.9473
95,-1.9611
96,-1.9068
97,-1.8822
98,-1.9875
99,-1.8836
100,-1.8723
101,-1.8953
102,-1.9105
103,-1.8417
104,-1.8486
105,-1.8829
106,-1.8611
107,-1.7881
108,-1.8037
109,-1.7672
110,-1.7844
111,-1.7937
112,-1.7312
113,-1.6964
114,-1.6697
115,-1.643
116,-1.6091
117,-1.6396
118,-1.6921
119,-1.5776
120,-1.5619
121,-1.5814
122,-1.5515
123,-1.5189
124,-1.5237
125,-1.4914
126,-1.4618
127,-1.4838
128,-1.3561
129,-1.3564
130,-1.3607
131,-1.3273
132,-1.3252
133,-1.268
134,-1.2029
135,-1.1924
136,-1.2151
137,-1.1475
138,-1.0851
139,-1.0997
140,-1.0157
141,-0.9800200000000001
142,-1.0308
143,-0.9403299999999999
144,-0.8968700000000001
145,-0.8603
146,-0.8479200000000001
147,-0.83555
148,-0.80614
149,-0.77672
150,-0.75347
151,-0.6613
152,-0.7078
153,-0.6899
154,-0.60673
155,-0.59048
156,-0.49013999999999996
157,-0.51867
158,-0.51831
159,-0.45916999999999997
160,-0.39736
161,-0.40978000000000003
162,-0.31008
163,-0.34265999999999996
164,-0.32556999999999997
165,-0.27057
166,-0.1876
167,-0.18519000000000002
168,-0.13676
169,-0.09578300000000001
170,-0.1373
171,-0.048563999999999996
172,0.021807
173,-0.019868
174,0.049405000000000004
175,0.040107
176,0.029332999999999998
177,0.046263
178,0.17762
179,0.12343
180,0.11452000000000001
181,0.20146
182,0.12793
183,0.18923
184,0.18619000000000002
185,0.27305999999999997
186,0.34217
187,0.36108
188,0.36018
189,0.40209
190,0.37654
191,0.35099
192,0.37609000000000004
193,0.37115
194,0.42435
195,0.43856999999999996
196,0.4351
197,0.49687
198,0.48422
199,0.50492
200,0.50268
201,0.50044
202,0.5212
203,0.54195
204,0.49068
205,0.5342100000000001
206,0.53674
207,0.56742
208,0.57765
209,0.5804199999999999
210,0.60829
211,0.56418
212,0.58385
213,0.60353
214,0.5634
215,0.63165
216,0.6288100000000001
217,0.58231
218,0.65004
219,0.6531600000000001
220,0.58024
221,0.6489699999999999
222,0.6022
223,0.64042
224,0.6643399999999999
225,0.70802
226,0.6462600000000001
227,0.64444
228,0.73244
229,0.6414300000000001
230,0.66028
231,0.72421
232,0.63626
233,0.73754
234,0.73854
235,0.70418
236,0.62833
237,0.71216
238,0.71329
239,0.66182
240,0.71649
241,0.72163
242,0.70102
243,0.6804100000000001
244,0.69876
245,0.7017
246,0.7416699999999999
247,0.6991
248,0.69328
249,0.69265
250,0.73325
251,0.76512
252,0.66693
253,0.75173
254,0.70763
255,0.79319
256,0.67804
257,0.73197
258,0.75083
259,0.71617
260,0.78493
261,0.7671899999999999
262,0.74946
263,0.6753399999999999
264,0.80794
265,0.7679
266,0.7628199999999999
267,0.71017
268,0.7296600000000001
269,0.75163
270,0.70082
271,0.74359
272,0.7138800000000001
273,0.74759
274,0.7813100000000001
