time,value
0,2.7665
1,2.5751
2,2.2638
3,1.8929
4,1.6024
5,1.2825
6,0.9787100000000001
7,0.75458
8,0.44299999999999995
9,0.3578
10,0.15955
11,0.39381
12,0.15541
13,0.050328
14,0.082413
15,-0.029845999999999998
16,0.20496
17,0.23573000000000002
18,0.17404
19,0.24186999999999997
20,0.14970999999999998
21,0.28920999999999997
22,0.16214
23,0.09865299999999999
24,-0.014897
25,0.067707
26,0.0016090999999999998
27,0.1258
28,0.028136
29,0.032369
30,-0.096509
31,0.11640999999999999
32,0.10127
33,0.20239000000000001
34,0.15074
35,0.07874
36,-0.03252
37,-0.11167
38,-0.30572
39,-0.35529
40,-0.31189
41,-0.4673
42,-0.41673000000000004
43,-0.39788
44,-0.52827
45,-0.77567
46,-0.97345
47,-1.2571
48,-1.5751
49,-2.0501
50,-2.4018
51,-2.822
52,-2.9096
53,-2.5099
54,-2.1033
55,-1.7714
56,-1.3678
57,-1.0427
58,-0.62727
59,-0.30123
60,0.10336
61,0.5079899999999999
62,0.8343200000000001
63,1.2263
64,1.5288
65,1.5941
66,1.3156
67,0.91081
68,0.50603
69,0.17869000000000002
70,-0.24326
71,-0.57048
72,-0.9913
73,-1.3183
74,-1.7375
75,-1.8449
76,-1.4777
77,-0.9811
78,-0.79652
79,-0.6362
80,-0.42073
81,-0.22111
82,-0.11220999999999999
83,1.3745999999999998e-05
84,0.024959000000000002
85,0.028136
86,0.075589
87,0.084511
88,0.14970999999999998
89,0.14555
90,0.05876
91,0.074014
92,0.1388
93,0.052437
94,0.15904000000000001
95,0.040826999999999995
96,0.028136
97,0.036071
98,-0.008502299999999999
99,0.11640999999999999
100,0.042412
101,0.050328
102,0.029724
103,-0.026105
104,-0.03252
105,-0.017564
106,0.084511
107,0.012765
108,-0.019165
109,-0.031985
110,-0.13122
111,-0.25825
112,-0.24547
113,-0.45174
114,-0.20951999999999998
115,-0.19191
116,-0.025571
117,-0.034658999999999995
118,0.038185000000000004
119,0.30693000000000004
120,0.35329
121,0.74278
122,0.9878299999999999
123,1.3195
124,1.6496
125,1.9122
126,2.2476
127,2.6753
