time,value
0,-0.47655
1,-0.47655
2,-0.47655
3,-0.47655
4,-0.47655
5,-0.47655
6,-0.47655
7,-0.47655
8,-0.47655
9,-0.47655
10,-0.47655
11,-0.47655
12,-0.47655
13,-0.47655
14,-0.47655
15,-0.47655
16,-0.47655
17,-0.47655
18,-0.47655
19,-0.47655
20,-0.47655
21,-0.47655
22,-0.47655
23,-0.47655
24,-0.47655
25,-0.47655
26,-0.47655
27,-0.47655
28,-0.47655
29,-0.47655
30,-0.47655
31,-0.47655
32,-0.47655
33,-0.47655
34,-0.47655
35,-0.47655
36,-0.47655
37,-0.47655
38,-0.47655
39,-0.47655
40,-0.47655
41,-0.47655
42,-0.47655
43,-0.47655
44,-0.47655
45,-0.47655
46,-0.47655
47,-0.47655
48,-0.47655
49,-0.47655
50,-0.47655
51,-0.47655
52,-0.47655
53,-0.47655
54,-0.47655
55,-0.47655
56,-0.47655
57,-0.47655
58,-0.48063
59,-0.48791
60,-0.50266
61,-0.5215
62,-0.5375800000000001
63,-0.55265
64,-0.5554
65,-0.5554
66,-0.5554
67,-0.5554
68,-0.5554
69,-0.5554
70,-0.5554
71,-0.55787
72,-0.57344
73,-0.5898100000000001
74,-0.60864
75,-0.62351
76,-0.63029
77,-0.63426
78,-0.63426
79,-0.63426
80,-0.63426
81,-0.63426
82,-0.63426
83,-0.63426
84,-0.63426
85,-0.63426
86,-0.63426
87,-0.63426
88,-0.63426
89,-0.63426
90,-0.63426
91,-0.63426
92,-0.63097
93,-0.59732
94,-0.56294
95,-0.52527
96,-0.49117
97,-0.46681000000000006
98,-0.4444
99,-0.42557
100,-0.40673000000000004
101,-0.3879
102,-0.36906
103,-0.35023000000000004
104,-0.33139
105,-0.31256
106,-0.29372
107,-0.27489
108,-0.26036
109,-0.24705
110,-0.26158000000000003
111,-0.28041
112,-0.29925
113,-0.31742
114,-0.31817
115,-0.31884
116,-0.31884
117,-0.32186
118,-0.33642
119,-0.35224
120,-0.37106999999999996
121,-0.38573
122,-0.39350999999999997
123,-0.39769
124,-0.39769
125,-0.40183
126,-0.40936
127,-0.42406000000000005
128,-0.44288999999999995
129,-0.45883999999999997
130,-0.47366
131,-0.47655
132,-0.47655
133,-0.47655
134,-0.47655
135,-0.47655
136,-0.47655
137,-0.47655
138,-0.47655
139,-0.47655
140,-0.47655
141,-0.47655
142,-0.47655
143,-0.47655
144,-0.47655
145,-0.47655
146,-0.48512
147,-0.5027
148,-0.5318
149,-0.56947
150,-0.60714
151,-0.64481
152,-0.68248
153,-0.72014
154,-0.75927
155,-0.7987
156,-0.85375
157,-0.91025
158,-0.9667600000000001
159,-1.0218
160,-1.0612
161,-1.1004
162,-1.138
163,-1.1722
164,-1.1963
165,-1.2186
166,-1.2375
167,-1.2563
168,-1.2751
169,-1.294
170,-1.3128
171,-1.3278
172,-1.3401
173,-1.344
174,-1.344
175,-1.3393
176,-1.3333
177,-1.3003
178,-1.2626
179,-1.2249
180,-1.1873
181,-1.1496
182,-1.1119
183,-1.0742
184,-1.0337
185,-0.98119
186,-0.92758
187,-0.87108
188,-0.81457
189,-0.75807
190,-0.7015600000000001
191,-0.6450600000000001
192,-0.58855
193,-0.53205
194,-0.47553999999999996
195,-0.41903999999999997
196,-0.36555
197,-0.31332
198,-0.27263000000000004
199,-0.23496
200,-0.19729000000000002
201,-0.15962
202,-0.12195
203,-0.08427799999999999
204,-0.046608
205,-0.0089385
206,0.028731
207,0.066401
208,0.10407000000000001
209,0.14557
210,0.1958
211,0.24846999999999997
212,0.30498000000000003
213,0.37438
214,0.45801000000000003
215,0.55812
216,0.67113
217,0.78771
218,0.9062399999999999
219,1.0345
220,1.1664
221,1.2982
222,1.43
223,1.5619
224,1.6937
225,1.8256
226,1.9562
227,2.0707
228,2.185
229,2.298
230,2.4009
231,2.4724
232,2.539
233,2.5956
234,2.6393
235,2.6649
236,2.6777
237,2.6777
238,2.6737
239,2.6669
240,2.6521
241,2.6332
242,2.6119
243,2.5898
244,2.5546
245,2.5169
246,2.4793
247,2.4414
248,2.3851
249,2.3289
250,2.2723
251,2.2131
252,2.1415
253,2.0689
254,1.9936
255,1.9183
256,1.8429
257,1.7676
258,1.6922
259,1.6211
260,1.5538
261,1.4931
262,1.4366
263,1.3769
264,1.3159
265,1.2437
266,1.1684
267,1.093
268,1.0177
269,0.94235
270,0.8670100000000001
271,0.79167
272,0.71832
273,0.6593100000000001
274,0.6008100000000001
275,0.5443100000000001
276,0.4953
277,0.46441000000000004
278,0.43808
279,0.41923999999999995
280,0.40041
281,0.38156999999999996
282,0.36274
283,0.3439
284,0.32873
285,0.31567
286,0.31201
287,0.31201
288,0.31019
289,0.30793000000000004
290,0.29091
291,0.27208000000000004
292,0.25324
293,0.23548000000000002
294,0.23421999999999998
295,0.23315
296,0.23315
297,0.22664
298,0.19851
299,0.16735999999999998
300,0.12969
301,0.10475
302,0.098724
303,0.10482000000000001
304,0.12365999999999999
305,0.13846
306,0.15027000000000001
307,0.1543
308,0.1543
309,0.14907
310,0.14203
311,0.1096
312,0.071926
313,0.034256
314,-0.0034135999999999997
