time,value
0,0.28957
1,-0.18947
2,-0.17690999999999998
3,-0.10692
4,-0.20878000000000002
5,0.30083000000000004
6,0.29020999999999997
7,0.046557999999999995
8,-0.17078
9,0.017273
10,-0.15835
11,-0.06869199999999999
12,-0.03656
13,1.5316
14,1.5316
15,1.5316
16,1.5316
17,1.5316
18,1.5316
19,1.5316
20,1.5316
21,1.5316
22,-1.6122
23,-1.6122
24,-1.6122
25,-1.6122
26,-1.6122
27,-1.6122
28,-1.6122
29,-1.6122
30,0.038626
31,0.12078
32,-0.39161
33,0.13267
34,0.34281
35,-0.033529
36,0.37928
37,-0.18828
38,-0.17494
39,-0.21336
40,-0.51334
41,-0.11484000000000001
42,0.035358999999999995
43,-0.13697
44,0.26508000000000004
45,0.17048
46,0.17767
47,-0.43066000000000004
48,-0.35233000000000003
49,0.019854
50,-0.042483
51,-0.5586899999999999
52,-0.29875
53,0.26445
54,0.47348999999999997
55,-0.05847
56,0.32268
57,-0.071876
58,0.42745
59,-0.34303
60,0.31071
61,0.6983699999999999
62,-0.21379
63,0.16547
64,0.37384
65,0.46047
66,-0.2144
67,0.49927
68,-0.12655999999999998
69,0.17599
70,0.11877
71,-0.5332600000000001
72,0.19252
73,-0.11055
74,-0.32278
75,-0.23761999999999997
76,0.28363
77,-0.22860999999999998
78,0.21991999999999998
79,1.5316
80,1.5316
81,1.5316
82,1.5316
83,1.5316
84,1.5316
85,1.5316
86,1.5316
87,1.5316
88,1.5316
89,1.5316
90,1.5316
91,1.5316
92,1.5316
93,1.5316
94,1.5316
95,-1.6122
96,-1.6122
97,-1.6122
98,-1.6122
99,-1.6122
100,-1.6122
101,-1.6122
102,-1.6122
103,-1.6122
104,-1.6122
105,-1.6122
106,-1.6122
107,-1.6122
108,-1.6122
109,-1.6122
110,-0.40157
111,0.3222
112,0.60649
113,0.2391
114,-0.30067
115,-1.0192
116,-0.49428999999999995
117,0.8733700000000001
118,0.00097965
119,0.36689
120,-0.13233
121,-0.094311
122,-0.45028999999999997
123,-0.19666
124,-0.036333
125,-0.56581
126,-0.27351
127,-0.2395
