time,value
0,-0.5261
1,-0.5261
2,-0.5261
3,-0.5261
4,-0.5261
5,-0.5261
6,-0.5261
7,-0.5261
8,-0.5261
9,-0.5261
10,-0.5261
11,-0.5261
12,-0.5261
13,-0.5261
14,-0.5261
15,-0.5261
16,-0.5261
17,-0.5261
18,-0.5261
19,-0.5261
20,-0.5261
21,-0.5261
22,-0.5261
23,-0.5261
24,-0.5261
25,-0.5261
26,-0.5261
27,-0.5261
28,-0.5261
29,-0.5261
30,-0.5261
31,-0.5261
32,-0.5261
33,-0.5261
34,-0.5261
35,-0.5261
36,-0.5261
37,-0.5261
38,-0.5261
39,-0.5261
40,-0.5261
41,-0.5261
42,-0.5261
43,-0.5261
44,-0.5261
45,-0.5261
46,-0.5261
47,-0.5261
48,-0.5261
49,-0.5261
50,-0.5261
51,-0.5261
52,-0.5261
53,-0.5261
54,-0.5261
55,-0.5261
56,-0.5261
57,-0.5261
58,-0.5261
59,-0.5261
60,-0.5261
61,-0.5261
62,-0.5261
63,-0.5261
64,-0.5261
65,-0.5261
66,-0.5261
67,-0.5261
68,-0.5261
69,-0.5261
70,-0.5261
71,-0.5261
72,-0.5261
73,-0.5261
74,-0.5261
75,-0.5261
76,-0.5261
77,-0.5261
78,-0.5261
79,-0.5261
80,-0.5261
81,-0.5261
82,-0.5261
83,-0.5261
84,-0.5261
85,-0.5261
86,-0.5261
87,-0.5261
88,-0.5261
89,-0.5261
90,-0.5261
91,-0.5261
92,-0.5261
93,-0.5261
94,-0.5261
95,-0.5261
96,-0.5261
97,-0.5261
98,-0.5261
99,-0.5261
100,-0.5261
101,-0.5261
102,-0.5261
103,-0.5261
104,-0.5261
105,-0.5261
106,-0.5261
107,-0.5261
108,-0.5261
109,-0.5261
110,-0.5261
111,-0.5261
112,-0.5261
113,-0.5261
114,-0.5261
115,-0.5261
116,-0.5261
117,-0.5261
118,-0.5261
119,-0.5261
120,-0.5261
121,-0.5261
122,-0.5261
123,-0.5261
124,-0.5261
125,-0.5261
126,-0.5261
127,-0.5261
128,-0.5261
129,-0.5261
130,-0.5261
131,-0.5261
132,-0.5261
133,-0.5261
134,-0.5261
135,-0.5261
136,-0.5261
137,-0.5261
138,-0.5261
139,-0.5261
140,-0.5261
141,-0.5261
142,-0.5261
143,-0.5261
144,-0.5261
145,-0.5261
146,-0.5261
147,-0.5261
148,-0.5261
149,-0.5261
150,-0.5261
151,-0.5261
152,-0.5261
153,-0.5261
154,-0.5261
155,-0.5261
156,-0.5261
157,-0.5261
158,-0.5261
159,-0.5261
160,-0.5261
161,-0.5261
162,-0.5261
163,-0.5261
164,-0.5261
165,-0.5261
166,-0.5261
167,-0.5261
168,-0.5261
169,-0.5261
170,-0.5261
171,-0.5261
172,-0.5261
173,-0.5261
174,-0.5261
175,-0.5261
176,-0.5261
177,-0.5261
178,-0.5261
179,-0.5261
180,-0.5261
181,-0.5261
182,-0.5261
183,-0.5261
184,-0.5261
185,-0.5261
186,-0.5261
187,-0.5261
188,-0.5261
189,-0.5261
190,-0.5261
191,-0.5261
192,-0.5261
193,-0.5261
194,-0.5261
195,-0.5261
196,-0.5261
197,-0.5261
198,-0.5261
199,-0.5261
200,-0.5261
201,-0.5261
202,-0.5261
203,-0.5261
204,-0.5261
205,-0.5261
206,-0.5261
207,-0.5261
208,-0.5261
209,-0.5261
210,-0.5261
211,-0.5261
212,-0.5261
213,-0.5261
214,-0.5261
215,-0.5261
216,-0.5261
217,-0.5261
218,-0.5261
219,-0.5261
220,-0.5261
221,-0.5261
222,-0.5261
223,-0.5261
224,-0.5261
225,-0.5261
226,-0.5261
227,-0.5261
228,-0.5261
229,-0.5261
230,-0.5261
231,-0.5261
232,-0.5261
233,-0.5261
234,-0.5261
235,-0.5261
236,-0.5261
237,-0.5261
238,-0.5261
239,-0.5261
240,-0.5261
241,-0.5261
242,-0.5261
243,-0.5261
244,-0.5261
245,-0.5261
246,-0.5261
247,-0.5261
248,-0.5261
249,-0.5261
250,-0.5261
251,-0.5261
252,-0.5261
253,-0.5261
254,-0.5261
255,-0.5261
256,-0.5261
257,-0.5261
258,-0.5261
259,-0.5261
260,-0.5261
261,-0.5261
262,-0.5261
263,-0.5261
264,-0.5261
265,-0.5261
266,-0.5261
267,-0.5261
268,-0.5261
269,-0.5261
270,-0.5261
271,-0.5261
272,-0.5261
273,-0.5261
274,-0.5261
275,-0.5261
276,-0.5261
277,-0.5261
278,-0.5261
279,-0.5261
280,-0.5261
281,-0.5261
282,-0.5261
283,-0.5261
284,-0.5261
285,-0.5261
286,-0.5261
287,-0.5261
288,-0.5261
289,-0.5261
290,-0.5261
291,-0.5261
292,-0.5261
293,-0.5261
294,-0.5261
295,-0.5261
296,-0.5261
297,-0.5261
298,-0.5261
299,-0.5261
300,-0.5261
301,-0.5261
302,-0.5261
303,-0.5261
304,-0.5261
305,-0.5261
306,-0.5261
307,-0.5261
308,-0.5261
309,-0.5261
310,-0.5261
311,0.12812
312,1.7637
313,1.7637
314,1.7637
315,1.4366
316,2.0908
317,1.7637
318,1.7637
319,2.0908
320,1.7637
321,2.0908
322,1.7637
323,2.0908
324,2.0908
325,1.7637
326,2.0908
327,1.7637
328,2.0908
329,1.7637
330,2.0908
331,2.0908
332,1.7637
333,1.7637
334,1.4366
335,1.7637
336,1.7637
337,1.7637
338,1.7637
339,1.4366
340,2.0908
341,2.0908
342,1.7637
343,1.4366
344,1.4366
345,1.7637
346,1.7637
347,2.0908
348,1.7637
349,2.0908
350,2.0908
351,1.7637
352,2.0908
353,2.0908
354,2.0908
355,1.7637
356,2.0908
357,2.0908
358,2.0908
359,1.7637
360,2.0908
361,2.0908
362,2.0908
363,2.0908
364,1.7637
365,2.0908
366,2.0908
367,1.7637
368,2.0908
369,1.7637
370,2.0908
371,2.0908
372,1.4366
373,1.7637
374,1.7637
375,2.0908
376,1.7637
377,2.0908
378,1.7637
379,2.0908
380,1.7637
381,2.0908
382,1.7637
383,2.0908
384,2.0908
385,2.0908
386,1.7637
387,2.0908
388,2.0908
389,1.7637
390,2.0908
391,1.7637
392,2.0908
393,2.0908
394,2.0908
395,2.0908
396,1.7637
397,1.7637
398,2.0908
399,2.0908
400,1.7637
401,1.7637
402,2.0908
403,2.0908
404,1.4366
405,1.7637
406,1.7637
407,1.7637
408,1.7637
409,2.0908
410,1.7637
411,2.0908
412,2.0908
413,1.7637
414,2.0908
415,2.0908
416,1.7637
417,2.0908
418,2.0908
419,2.0908
420,2.0908
421,2.0908
422,1.7637
423,1.7637
424,1.7637
425,2.0908
426,2.0908
427,2.0908
428,1.7637
429,2.0908
430,1.7637
431,2.0908
432,1.7637
433,2.0908
434,2.0908
435,2.0908
436,1.7637
437,1.7637
438,1.7637
439,1.7637
440,1.7637
441,1.7637
442,1.7637
443,1.7637
444,1.7637
445,1.7637
446,1.7637
447,1.7637
448,1.7637
449,2.0908
450,1.7637
451,1.7637
452,2.0908
453,1.7637
454,1.7637
455,1.7637
456,1.7637
457,2.0908
458,1.4366
459,2.0908
460,1.7637
461,1.7637
462,1.7637
463,1.7637
464,1.4366
465,1.7637
466,1.7637
467,1.7637
468,0.7823399999999999
469,-0.5261
470,-0.5261
471,-0.5261
472,-0.5261
473,-0.5261
474,-0.5261
475,-0.5261
476,-0.5261
477,-0.5261
478,-0.5261
479,-0.5261
480,-0.5261
481,-0.5261
482,-0.5261
483,-0.5261
484,-0.5261
485,-0.5261
486,-0.5261
487,-0.5261
488,-0.5261
489,-0.5261
490,-0.5261
491,-0.5261
492,-0.5261
493,-0.5261
494,-0.5261
495,-0.5261
496,-0.5261
497,-0.5261
498,-0.5261
499,-0.5261
500,-0.5261
501,-0.5261
502,-0.5261
503,-0.5261
504,-0.5261
505,-0.5261
506,-0.5261
507,-0.5261
508,-0.5261
509,-0.5261
510,-0.5261
511,-0.5261
512,-0.5261
513,-0.5261
514,-0.5261
515,-0.5261
516,-0.5261
517,-0.5261
518,-0.5261
519,-0.5261
520,-0.5261
521,-0.5261
522,-0.5261
523,-0.5261
524,-0.5261
525,-0.5261
526,-0.5261
527,-0.5261
528,-0.5261
529,-0.5261
530,-0.5261
531,-0.5261
532,-0.5261
533,-0.5261
534,-0.5261
535,-0.5261
536,-0.5261
537,-0.5261
538,-0.5261
539,-0.5261
540,-0.5261
541,-0.5261
542,-0.5261
543,-0.5261
544,-0.5261
545,-0.5261
546,-0.5261
547,-0.5261
548,-0.5261
549,-0.5261
550,-0.5261
551,-0.5261
552,-0.5261
553,-0.5261
554,-0.5261
555,-0.5261
556,-0.5261
557,-0.5261
558,-0.5261
559,-0.5261
560,-0.5261
561,-0.5261
562,-0.5261
563,-0.5261
564,-0.5261
565,-0.5261
566,-0.5261
567,-0.5261
568,-0.5261
569,-0.5261
570,-0.5261
571,-0.5261
572,-0.5261
573,-0.5261
574,-0.5261
575,-0.5261
576,-0.5261
577,-0.5261
578,-0.5261
579,-0.5261
580,-0.5261
581,-0.5261
582,-0.5261
583,-0.5261
584,-0.5261
585,-0.5261
586,-0.5261
587,-0.5261
588,-0.5261
589,-0.5261
590,-0.5261
591,-0.5261
592,-0.5261
593,-0.5261
594,-0.5261
595,-0.5261
596,-0.5261
597,-0.5261
598,-0.5261
599,-0.5261
600,-0.5261
601,-0.5261
602,-0.5261
603,-0.5261
604,-0.5261
605,-0.5261
606,-0.5261
607,-0.5261
608,-0.5261
609,-0.5261
610,-0.5261
611,-0.5261
612,-0.5261
613,-0.5261
614,-0.5261
615,-0.5261
616,-0.5261
617,-0.5261
618,-0.5261
619,-0.5261
620,-0.5261
621,-0.5261
622,-0.5261
623,-0.5261
624,-0.5261
625,-0.5261
626,-0.5261
627,-0.5261
628,-0.5261
629,-0.5261
630,-0.5261
631,-0.5261
632,-0.5261
633,-0.5261
634,-0.5261
635,-0.5261
636,-0.5261
637,-0.5261
638,-0.5261
639,-0.5261
640,-0.5261
641,-0.5261
642,-0.5261
643,-0.5261
644,-0.5261
645,-0.5261
646,-0.5261
647,-0.5261
648,-0.5261
649,-0.5261
650,-0.5261
651,-0.5261
652,-0.5261
653,-0.5261
654,-0.5261
655,-0.5261
656,-0.5261
657,-0.5261
658,-0.5261
659,-0.5261
660,-0.5261
661,-0.5261
662,-0.5261
663,-0.5261
664,-0.5261
665,-0.5261
666,-0.5261
667,-0.5261
668,-0.5261
669,-0.5261
670,-0.5261
671,-0.5261
672,-0.5261
673,-0.5261
674,-0.5261
675,-0.5261
676,-0.5261
677,-0.5261
678,-0.5261
679,-0.5261
680,-0.5261
681,-0.5261
682,-0.5261
683,-0.5261
684,-0.5261
685,-0.5261
686,-0.5261
687,-0.5261
688,-0.5261
689,-0.5261
690,-0.5261
691,-0.5261
692,-0.5261
693,-0.5261
694,-0.5261
695,-0.5261
696,-0.5261
697,-0.5261
698,-0.5261
699,-0.5261
700,-0.5261
701,-0.5261
702,-0.5261
703,-0.5261
704,-0.5261
705,-0.5261
706,-0.5261
707,-0.5261
708,-0.5261
709,-0.5261
710,-0.5261
711,-0.5261
712,-0.5261
713,-0.5261
714,-0.5261
715,-0.5261
716,-0.5261
717,-0.5261
718,-0.5261
719,-0.5261
