time,value
0,0.8966200000000001
1,0.37635
2,-0.21363000000000001
3,-0.75725
4,-1.1422
5,-1.3041
6,-1.2305
7,-0.97555
8,-0.6030300000000001
9,-0.1928
10,0.20045
11,0.5313399999999999
12,0.7954
13,0.97145
14,1.0581
15,1.0473
16,0.9338200000000001
17,0.71875
18,0.43633999999999995
19,0.14045
20,-0.12364000000000001
21,-0.27453
22,-0.27887
23,-0.16155999999999998
24,0.0095646
25,0.14279
26,0.16309
27,0.0049091000000000004
28,-0.31301999999999996
29,-0.72593
30,-1.1231
31,-1.4009
32,-1.4784
33,-1.3312
34,-1.011
35,-0.57727
36,-0.11107
37,0.31884
38,0.67904
39,0.9660799999999999
40,1.1787
41,1.3341
42,1.4265
43,1.4249
44,1.3188
45,1.0919
46,0.7708699999999999
47,0.39002
48,0.014093000000000001
49,-0.30444
50,-0.53055
51,-0.66473
52,-0.7479600000000001
53,-0.84349
54,-0.98254
55,-1.1647
56,-1.3536
57,-1.4804
58,-1.4524
59,-1.2064
60,-0.72882
61,-0.071751
62,0.6611
63,1.3443
64,1.8616
65,2.1192
66,2.1019
67,1.8387
68,1.3873
69,0.83609
70,0.27193
71,-0.2354
72,-0.64188
73,-0.9257700000000001
74,-1.0734
75,-1.0996
76,-1.0173
77,-0.8541200000000001
78,-0.63542
79,-0.39335
80,-0.17339000000000002
81,0.0034146999999999997
82,0.10067999999999999
83,0.12506
84,0.092942
85,0.022557
86,-0.041194999999999996
87,-0.061732
88,-0.023953
89,0.071604
90,0.21509
91,0.37961
92,0.51576
93,0.59267
94,0.57133
95,0.45048
96,0.23335
97,-0.050544
98,-0.33546
99,-0.56289
100,-0.65441
101,-0.583
102,-0.35643
103,-0.020725999999999998
104,0.34526999999999997
105,0.64381
106,0.80633
107,0.78814
108,0.6046699999999999
109,0.29967
110,-0.047527
111,-0.3667
112,-0.61068
113,-0.74995
114,-0.76042
115,-0.65568
116,-0.46875
117,-0.22753
118,0.062551
119,0.37032
120,0.66468
121,0.9081799999999999
122,1.0451
123,1.0361
124,0.85806
125,0.52108
126,0.084781
127,-0.40212
128,-0.85282
129,-1.1772
130,-1.329
131,-1.3012
132,-1.1029
133,-0.7830699999999999
134,-0.39155999999999996
135,0.022537
136,0.41235
137,0.7354
138,0.96924
139,1.091
140,1.0957
141,0.99682
142,0.81276
143,0.58799
144,0.37112
145,0.18425999999999998
146,0.047775
147,-0.036117
148,-0.093218
149,-0.18749000000000002
150,-0.34571999999999997
151,-0.57852
152,-0.85683
153,-1.1261
154,-1.3219
155,-1.3787
156,-1.2527
157,-0.92225
158,-0.41691999999999996
159,0.18081
160,0.79206
161,1.3283
162,1.7179
163,1.8993
164,1.8519999999999999
165,1.5697
166,1.0904
167,0.46867
168,-0.20845999999999998
169,-0.8366100000000001
170,-1.3293
171,-1.6130000000000002
172,-1.6580000000000001
173,-1.4886
174,-1.1676
175,-0.7862600000000001
176,-0.42376
177,-0.13985
178,0.07343200000000001
179,0.22228
180,0.35579
181,0.54367
182,0.80405
183,1.1366
184,1.4769
185,1.7474
186,1.8629
187,1.7636
188,1.4265
189,0.88564
190,0.22221
191,-0.47335
192,-1.1195
193,-1.6371
194,-1.9917
195,-2.1851
196,-2.2188
197,-2.0999
198,-1.8389
199,-1.4471
200,-0.9503299999999999
201,-0.39871999999999996
202,0.1742
203,0.7115600000000001
204,1.1773
205,1.5401
206,1.7878
207,1.9094
208,1.9065
209,1.7951
210,1.5785
211,1.2495
212,0.8322200000000001
213,0.34862
214,-0.16721
215,-0.64649
216,-1.0321
217,-1.2637
218,-1.3243
219,-1.2466
220,-1.0833
221,-0.90665
222,-0.74993
223,-0.64315
224,-0.5773699999999999
225,-0.5038100000000001
226,-0.36245
227,-0.12688
228,0.18667999999999998
229,0.53887
230,0.8401
231,1.0095
232,0.99945
233,0.80398
234,0.46617
235,0.083079
236,-0.24244000000000002
237,-0.42677
238,-0.43785
239,-0.3049
240,-0.093952
241,0.11435999999999999
242,0.25179
243,0.29779
244,0.25939
245,0.17865999999999999
246,0.11150999999999998
247,0.087866
248,0.11639000000000001
249,0.17005
250,0.22043000000000001
251,0.22832
252,0.17527
253,0.061742
254,-0.07425
255,-0.17089000000000001
256,-0.20447
257,-0.17920999999999998
258,-0.12677
259,-0.094091
260,-0.1117
261,-0.20690999999999998
262,-0.37708
263,-0.58786
264,-0.7810600000000001
265,-0.9314600000000001
266,-0.9925799999999999
267,-0.9380799999999999
268,-0.76991
269,-0.50749
270,-0.17981
271,0.19272
272,0.586
273,0.9387
274,1.2095
275,1.3619999999999999
276,1.3623
277,1.2079
278,0.93822
279,0.60726
280,0.28920999999999997
281,0.059226999999999995
282,-0.051641
283,-0.039822
284,0.046755
285,0.14569000000000001
286,0.19068
287,0.13756
288,-0.023284
289,-0.24493
290,-0.4535
291,-0.58785
292,-0.61866
293,-0.55482
294,-0.44115
295,-0.34708
296,-0.31511999999999996
297,-0.36317
298,-0.46798
299,-0.58846
300,-0.6564300000000001
301,-0.6012
302,-0.41308
303,-0.12928
304,0.18839
305,0.44332
306,0.55905
307,0.51164
308,0.32769000000000004
309,0.060330999999999996
310,-0.2246
311,-0.46046000000000004
312,-0.57463
313,-0.56708
314,-0.42946999999999996
315,-0.16804000000000002
316,0.18525
317,0.6008399999999999
318,1.0435
319,1.4587
320,1.7804
321,1.9339
322,1.8766
323,1.5778
324,1.0696
325,0.40865
326,-0.30353
327,-0.9757399999999999
328,-1.5248
329,-1.901
330,-2.081
331,-2.0951
332,-1.9738
333,-1.7684
334,-1.506
335,-1.1941
336,-0.85321
337,-0.46926999999999996
338,-0.051061
339,0.38488
340,0.83629
341,1.2898
342,1.7015
343,2.0267
344,2.1935
345,2.1430000000000002
346,1.8592
347,1.3625
348,0.71306
349,0.016302
350,-0.6038899999999999
351,-1.0518
352,-1.2841
353,-1.2963
354,-1.1509
355,-0.92911
356,-0.71206
357,-0.53341
358,-0.3736
359,-0.21381
360,-0.022121000000000002
361,0.19284
362,0.38436
363,0.4771
364,0.41176
365,0.15825
366,-0.22027
367,-0.60816
368,-0.87669
369,-0.90207
370,-0.6376
371,-0.14685
372,0.43621000000000004
373,0.9267299999999999
374,1.2016
375,1.1874
376,0.9274
377,0.54198
378,0.18261
379,-0.02729
380,-0.035743000000000004
381,0.13627999999999998
382,0.36746999999999996
383,0.53594
384,0.5312600000000001
385,0.30307
386,-0.09335700000000001
387,-0.56003
388,-0.96734
389,-1.2178
390,-1.2594
391,-1.1246
392,-0.8658600000000001
393,-0.5656
394,-0.26495
395,0.010291
396,0.24156999999999998
397,0.45332
398,0.65767
399,0.8329700000000001
400,0.958
401,1.0108
402,0.94868
403,0.76052
404,0.47536000000000006
405,0.12244000000000001
406,-0.23269
407,-0.53581
408,-0.73844
409,-0.81504
410,-0.75461
411,-0.57335
412,-0.31296999999999997
413,-0.04018
414,0.17994000000000002
415,0.31695
416,0.35597
417,0.30123
418,0.20222
419,0.10902
420,0.075541
421,0.11698
422,0.21402
423,0.30468
424,0.30106
425,0.15807000000000002
426,-0.12426
427,-0.51473
428,-0.91504
429,-1.2218
430,-1.3298
431,-1.2088
432,-0.84285
433,-0.29638000000000003
434,0.34321
435,0.98364
436,1.5374
437,1.9340000000000002
438,2.1312
439,2.1009
440,1.8445
441,1.3719999999999999
442,0.71478
443,-0.041438
444,-0.80478
445,-1.4579
446,-1.9052
447,-2.1053
448,-2.0793
449,-1.865
450,-1.5444
451,-1.1976
452,-0.87011
453,-0.56248
454,-0.26166999999999996
455,0.092931
456,0.52163
457,1.0127
458,1.5212
459,1.9753
460,2.2836
461,2.3884
462,2.2702
463,1.9558
464,1.4868
465,0.91735
466,0.30823
467,-0.31226
468,-0.9223399999999999
469,-1.4898
470,-2.0012
471,-2.4157
472,-2.6541
473,-2.6718
474,-2.4577
475,-2.0151
476,-1.3771
477,-0.6308
478,0.13877
479,0.84804
480,1.4445
481,1.8617
482,2.0726
483,2.1045
484,1.9808
485,1.7379
486,1.4167
487,1.0504
488,0.67435
489,0.31988
490,0.017058
491,-0.23143000000000002
492,-0.42599
493,-0.60113
494,-0.75602
495,-0.9162799999999999
496,-1.0892
497,-1.2423
498,-1.3417
499,-1.3359999999999999
