time,value
0,-0.43998999999999994
1,-0.46151000000000003
2,-0.28841
3,-0.072015
4,0.17187
5,0.41171
6,0.64573
7,0.8959600000000001
8,1.1061
9,1.2670000000000001
10,1.5125
11,1.4832
12,1.4413
13,1.4939
14,1.554
15,1.4489
16,1.2396
17,1.038
18,0.8044
19,0.57053
20,0.30128
21,0.016687
22,-0.24839
23,-0.44458000000000003
24,-0.50371
25,-0.41781
26,-0.29845
27,-0.11562
28,0.090757
29,0.31143000000000004
30,0.5437
31,0.78862
32,0.9541299999999999
33,1.1415
34,1.2864
35,1.3674
36,1.4213
37,1.4271
38,1.4394
39,1.4038
40,1.3536
41,1.3275
42,1.1518
43,1.0135
44,0.76782
45,0.51063
46,0.26559
47,0.049004
48,-0.16585
49,-0.34117
50,-1.074
51,-1.074
52,-1.074
53,-1.074
54,-1.074
55,-1.074
56,-1.074
57,-1.074
58,-1.074
59,-1.074
60,-1.074
61,-1.074
62,-1.074
63,-1.074
64,-1.074
65,-1.074
66,-1.074
67,-1.074
68,-1.074
69,-1.074
70,-1.074
71,-1.074
72,-1.074
73,-1.074
74,-1.074
75,-1.074
76,-1.074
77,-1.074
78,-1.074
79,-1.074
