time,value
0,-0.071984
1,-0.071984
2,-0.071984
3,-0.071984
4,-0.071984
5,-0.071984
6,-0.071984
7,-0.071984
8,-0.071984
9,-0.071984
10,-0.071984
11,-0.071984
12,-0.071984
13,-0.071984
14,-0.071984
15,-0.071984
16,-0.071984
17,-0.071984
18,-0.071984
19,-0.071984
20,-0.071984
21,-0.071984
22,-0.071984
23,-0.071984
24,-0.071984
25,-0.071984
26,-0.071984
27,-0.071984
28,-0.071984
29,-0.071984
30,-0.071984
31,-0.071984
32,-0.071984
33,-0.071984
34,-0.071984
35,-0.071984
36,-0.071984
37,-0.071984
38,-0.071984
39,-0.071984
40,-0.071984
41,-0.071984
42,-0.071984
43,-0.071984
44,-0.071984
45,-0.071984
46,-0.071984
47,-0.071984
48,-0.071984
49,-0.071984
50,-0.071984
51,-0.071984
52,-0.071984
53,-0.071984
54,-0.071984
55,-0.071984
56,-0.071984
57,-0.071984
58,-0.071984
59,-0.071984
60,-0.071984
61,-0.071984
62,-0.071984
63,-0.071984
64,-0.071984
65,-0.071984
66,-0.071984
67,-0.071984
68,-0.071984
69,-0.071984
70,-0.071984
71,-0.071984
72,-0.071984
73,-0.071984
74,-0.071984
75,-0.071984
76,-0.071984
77,-0.071984
78,-0.071984
79,-0.071984
80,-0.071984
81,-0.071984
82,-0.071984
83,-0.071984
84,-0.071984
85,-0.071984
86,-0.071984
87,-0.071984
88,-0.071984
89,-0.071984
90,-0.071984
91,-0.071984
92,-0.071984
93,-0.071984
94,-0.071984
95,-0.071984
96,-0.071984
97,-0.071984
98,-0.071984
99,-0.071984
100,-0.071984
101,-0.071984
102,-0.071984
103,-0.071984
104,-0.071984
105,-0.071984
106,-0.071984
107,-0.071984
108,-0.071984
109,-0.071984
110,-0.071984
111,-0.071984
112,-0.071984
113,-0.071984
114,-0.071984
115,-0.071984
116,-0.071984
117,-0.071984
118,-0.071984
119,-0.071984
120,-0.071984
121,-0.071984
122,-0.071984
123,-0.071984
124,-0.071984
125,-0.071984
126,-0.071984
127,-0.071984
128,-0.071984
129,-0.071984
130,-0.071984
131,-0.071984
132,-0.071984
133,-0.071984
134,-0.071984
135,-0.071984
136,-0.071984
137,-0.071984
138,-0.071984
139,-0.071984
140,-0.071984
141,-0.071984
142,-0.071984
143,-0.071984
144,-0.071984
145,-0.071984
146,-0.071984
147,-0.071984
148,-0.071984
149,-0.071984
150,-0.071984
151,-0.071984
152,-0.071984
153,-0.071984
154,-0.071984
155,-0.071984
156,-0.071984
157,-0.071984
158,-0.071984
159,-0.071984
160,-0.071984
161,-0.071984
162,-0.071984
163,-0.071984
164,-0.071984
165,-0.071984
166,-0.071984
167,-0.071984
168,-0.071984
169,-0.071984
170,-0.071984
171,-0.071984
172,-0.071984
173,-0.071984
174,-0.071984
175,-0.071984
176,-0.071984
177,-0.071984
178,-0.071984
179,-0.071984
180,-0.071984
181,-0.071984
182,-0.071984
183,-0.071984
184,-0.071984
185,-0.071984
186,-0.071984
187,-0.071984
188,-0.071984
189,-0.071984
190,-0.071984
191,-0.071984
192,-0.071984
193,-0.071984
194,-0.071984
195,-0.071984
196,-0.071984
197,-0.071984
198,-0.071984
199,-0.071984
200,-0.071984
201,-0.071984
202,-0.071984
203,-0.071984
204,-0.071984
205,-0.071984
206,-0.071984
207,-0.071984
208,-0.071984
209,-0.071984
210,-0.071984
211,-0.071984
212,2.9676
213,10.216000000000001
214,3.4742
215,-0.071984
216,16.879
217,17.464000000000002
218,0.39564
219,-0.071984
220,-0.071984
221,-0.071984
222,-0.071984
223,-0.071984
224,-0.071984
225,-0.071984
226,-0.071984
227,-0.071984
228,-0.071984
229,-0.071984
230,-0.071984
231,-0.071984
232,-0.071984
233,-0.071984
234,-0.071984
235,-0.071984
236,-0.071984
237,-0.071984
238,-0.071984
239,-0.071984
240,-0.071984
241,-0.071984
242,-0.071984
243,-0.071984
244,-0.071984
245,-0.071984
246,-0.071984
247,-0.071984
248,-0.071984
249,-0.071984
250,-0.071984
251,-0.071984
252,-0.071984
253,-0.071984
254,-0.071984
255,-0.071984
256,-0.071984
257,-0.071984
258,-0.071984
259,-0.071984
260,-0.071984
261,-0.071984
262,-0.071984
263,-0.071984
264,-0.071984
265,-0.071984
266,-0.071984
267,-0.071984
268,-0.071984
269,-0.071984
270,-0.071984
271,-0.071984
272,-0.071984
273,-0.071984
274,-0.071984
275,-0.071984
276,-0.071984
277,-0.071984
278,-0.071984
279,-0.071984
280,-0.071984
281,-0.071984
282,-0.071984
283,-0.071984
284,-0.071984
285,-0.071984
286,-0.071984
287,-0.071984
288,-0.071984
289,-0.071984
290,-0.071984
291,-0.071984
292,-0.071984
293,-0.071984
294,-0.071984
295,-0.071984
296,-0.071984
297,-0.071984
298,-0.071984
299,-0.071984
300,-0.071984
301,-0.071984
302,-0.071984
303,-0.071984
304,-0.071984
305,-0.071984
306,-0.071984
307,-0.071984
308,-0.071984
309,-0.071984
310,-0.071984
311,-0.071984
312,-0.071984
313,-0.071984
314,-0.071984
315,-0.071984
316,-0.071984
317,-0.071984
318,-0.071984
319,-0.071984
320,-0.071984
321,-0.071984
322,-0.071984
323,-0.071984
324,-0.071984
325,-0.071984
326,-0.071984
327,-0.071984
328,-0.071984
329,-0.071984
330,-0.071984
331,-0.071984
332,-0.071984
333,-0.071984
334,-0.071984
335,-0.071984
336,-0.071984
337,-0.071984
338,-0.071984
339,-0.071984
340,-0.071984
341,-0.071984
342,-0.071984
343,-0.071984
344,-0.071984
345,-0.071984
346,-0.071984
347,-0.071984
348,-0.071984
349,-0.071984
350,-0.071984
351,-0.071984
352,-0.071984
353,-0.071984
354,-0.071984
355,-0.071984
356,-0.071984
357,-0.071984
358,-0.071984
359,-0.071984
360,-0.071984
361,-0.071984
362,-0.071984
363,-0.071984
364,-0.071984
365,-0.071984
366,-0.071984
367,-0.071984
368,-0.071984
369,-0.071984
370,-0.071984
371,-0.071984
372,-0.071984
373,-0.071984
374,-0.071984
375,-0.071984
376,-0.071984
377,-0.071984
378,-0.071984
379,-0.071984
380,-0.071984
381,-0.071984
382,-0.071984
383,-0.071984
384,-0.071984
385,-0.071984
386,-0.071984
387,-0.071984
388,-0.071984
389,-0.071984
390,-0.071984
391,-0.071984
392,-0.071984
393,-0.071984
394,-0.071984
395,-0.071984
396,-0.071984
397,-0.071984
398,-0.071984
399,-0.071984
400,-0.071984
401,-0.071984
402,-0.071984
403,-0.071984
404,-0.071984
405,-0.071984
406,-0.071984
407,-0.071984
408,-0.071984
409,-0.071984
410,-0.071984
411,-0.071984
412,-0.071984
413,-0.071984
414,-0.071984
415,-0.071984
416,-0.071984
417,-0.071984
418,-0.071984
419,-0.071984
420,-0.071984
421,-0.071984
422,-0.071984
423,-0.071984
424,-0.071984
425,-0.071984
426,-0.071984
427,-0.071984
428,-0.071984
429,-0.071984
430,-0.071984
431,-0.071984
432,-0.071984
433,-0.071984
434,-0.071984
435,-0.071984
436,-0.071984
437,-0.071984
438,-0.071984
439,-0.071984
440,-0.071984
441,-0.071984
442,-0.071984
443,-0.071984
444,-0.071984
445,-0.071984
446,-0.071984
447,-0.071984
448,-0.071984
449,-0.071984
450,-0.071984
451,-0.071984
452,-0.071984
453,-0.071984
454,-0.071984
455,-0.071984
456,-0.071984
457,-0.071984
458,-0.071984
459,-0.071984
460,-0.071984
461,-0.071984
462,-0.071984
463,-0.071984
464,-0.071984
465,-0.071984
466,-0.071984
467,-0.071984
468,-0.071984
469,-0.071984
470,-0.071984
471,-0.071984
472,-0.071984
473,-0.071984
474,-0.071984
475,-0.071984
476,-0.071984
477,-0.071984
478,-0.071984
479,-0.071984
480,-0.071984
481,-0.071984
482,-0.071984
483,-0.071984
484,-0.071984
485,-0.071984
486,-0.071984
487,-0.071984
488,-0.071984
489,-0.071984
490,-0.071984
491,-0.071984
492,-0.071984
493,-0.071984
494,-0.071984
495,-0.071984
496,-0.071984
497,-0.071984
498,-0.071984
499,-0.071984
500,-0.071984
501,-0.071984
502,-0.071984
503,-0.071984
504,-0.071984
505,-0.071984
506,-0.071984
507,-0.071984
508,-0.071984
509,-0.071984
510,-0.071984
511,-0.071984
512,-0.071984
513,-0.071984
514,-0.071984
515,-0.071984
516,-0.071984
517,-0.071984
518,-0.071984
519,-0.071984
520,-0.071984
521,-0.071984
522,-0.071984
523,-0.071984
524,-0.071984
525,-0.071984
526,-0.071984
527,-0.071984
528,-0.071984
529,-0.071984
530,-0.071984
531,-0.071984
532,-0.071984
533,-0.071984
534,-0.071984
535,-0.071984
536,-0.071984
537,-0.071984
538,-0.071984
539,-0.071984
540,-0.071984
541,-0.071984
542,-0.071984
543,-0.071984
544,-0.071984
545,-0.071984
546,-0.071984
547,-0.071984
548,-0.071984
549,-0.071984
550,-0.071984
551,-0.071984
552,-0.071984
553,-0.071984
554,-0.071984
555,-0.071984
556,-0.071984
557,-0.071984
558,-0.071984
559,-0.071984
560,-0.071984
561,-0.071984
562,-0.071984
563,-0.071984
564,-0.071984
565,-0.071984
566,-0.071984
567,-0.071984
568,-0.071984
569,-0.071984
570,-0.071984
571,-0.071984
572,-0.071984
573,-0.071984
574,-0.071984
575,-0.071984
576,-0.071984
577,-0.071984
578,-0.071984
579,-0.071984
580,-0.071984
581,-0.071984
582,-0.071984
583,-0.071984
584,-0.071984
585,-0.071984
586,-0.071984
587,-0.071984
588,-0.071984
589,-0.071984
590,-0.071984
591,-0.071984
592,-0.071984
593,-0.071984
594,-0.071984
595,-0.071984
596,-0.071984
597,-0.071984
598,-0.071984
599,-0.071984
600,-0.071984
601,-0.071984
602,-0.071984
603,-0.071984
604,-0.071984
605,-0.071984
606,-0.071984
607,-0.071984
608,-0.071984
609,-0.071984
610,-0.071984
611,-0.071984
612,-0.071984
613,-0.071984
614,-0.071984
615,-0.071984
616,-0.071984
617,-0.071984
618,-0.071984
619,-0.071984
620,-0.071984
621,-0.071984
622,-0.071984
623,-0.071984
624,-0.071984
625,-0.071984
626,-0.071984
627,-0.071984
628,-0.071984
629,-0.071984
630,-0.071984
631,-0.071984
632,-0.071984
633,-0.071984
634,-0.071984
635,-0.071984
636,-0.071984
637,-0.071984
638,-0.071984
639,-0.071984
640,-0.071984
641,-0.071984
642,-0.071984
643,-0.071984
644,-0.071984
645,-0.071984
646,-0.071984
647,-0.071984
648,-0.071984
649,-0.071984
650,-0.071984
651,-0.071984
652,-0.071984
653,-0.071984
654,-0.071984
655,-0.071984
656,-0.071984
657,-0.071984
658,-0.071984
659,-0.071984
660,-0.071984
661,-0.071984
662,-0.071984
663,-0.071984
664,-0.071984
665,-0.071984
666,-0.071984
667,-0.071984
668,-0.071984
669,-0.071984
670,-0.071984
671,-0.071984
672,-0.071984
673,-0.071984
674,-0.071984
675,-0.071984
676,-0.071984
677,-0.071984
678,-0.071984
679,-0.071984
680,-0.071984
681,-0.071984
682,-0.071984
683,-0.071984
684,-0.071984
685,-0.071984
686,-0.071984
687,-0.071984
688,-0.071984
689,-0.071984
690,-0.071984
691,-0.071984
692,-0.071984
693,-0.071984
694,-0.071984
695,-0.071984
696,-0.071984
697,-0.071984
698,-0.071984
699,-0.071984
700,-0.071984
701,-0.071984
702,-0.071984
703,-0.071984
704,-0.071984
705,-0.071984
706,-0.071984
707,-0.071984
708,-0.071984
709,-0.071984
710,-0.071984
711,-0.071984
712,-0.071984
713,-0.071984
714,-0.071984
715,-0.071984
716,-0.071984
717,-0.071984
718,-0.071984
719,-0.071984
