time,value
0,-0.03505
1,0.059701
2,0.22044
3,0.016645
4,1.8389
5,1.8389
6,1.8389
7,1.8389
8,1.8389
9,1.8389
10,1.8389
11,1.8389
12,1.8389
13,1.8389
14,-1.8090000000000002
15,-1.8090000000000002
16,-1.8090000000000002
17,-1.8090000000000002
18,-1.8090000000000002
19,-1.8090000000000002
20,-1.8090000000000002
21,-1.8090000000000002
22,-1.8090000000000002
23,-0.8996299999999999
24,0.3533
25,-0.43855
26,0.29026
27,0.28625
28,-0.69475
29,0.44675
30,0.12394000000000001
31,0.32619000000000004
32,-0.23143000000000002
33,0.21133000000000002
34,-0.021861000000000002
35,-0.4569
36,0.46674
37,0.078548
38,-0.29061
39,0.35561
40,-0.15375999999999998
41,-0.3733
42,0.6935100000000001
43,-0.096532
44,0.21072
45,-0.74674
46,1.8389
47,1.8389
48,1.8389
49,1.8389
50,1.8389
51,1.8389
52,1.8389
53,1.8389
54,-1.8090000000000002
55,-1.8090000000000002
56,-1.8090000000000002
57,-1.8090000000000002
58,-1.8090000000000002
59,-1.8090000000000002
60,-1.8090000000000002
61,-1.8090000000000002
62,-0.036903
63,-0.22841
64,-0.11198
65,0.09870599999999999
66,0.017661000000000003
67,-0.12505
68,0.19543
69,-0.30437
70,0.15220999999999998
71,-0.3876
72,-0.09128700000000001
73,-0.039082
74,0.046355
75,0.25192
76,0.15536
77,-0.25331
78,0.45498
79,-0.44941000000000003
80,0.019943000000000002
81,0.17663
82,0.006398600000000001
83,-0.13007
84,0.037002999999999994
85,-0.19794
86,-0.16424
87,-0.4344
88,-0.14618
89,-0.1276
90,0.08292200000000001
91,-0.52384
92,-0.74439
93,0.36901999999999996
94,0.5214
95,-0.39995
96,-0.051792
97,-0.08427899999999999
98,0.62107
99,0.094216
100,0.064427
101,-0.12602
102,-0.8423
103,0.55862
104,-0.09049299999999999
105,0.21718
106,0.27685
107,0.028194999999999998
108,-0.10544
109,0.21065
110,0.10298
111,-0.21195999999999998
112,0.11840999999999999
113,-0.4115
114,0.10467
115,-0.16103
116,0.26258000000000004
117,-0.24445
118,-0.15442
119,-0.3582
120,0.099143
121,0.1001
122,0.38789
123,0.1675
124,-0.15542999999999998
125,-0.09581100000000001
126,0.75011
127,-0.80919
