time,value
0,0.0088337
1,0.40818000000000004
2,-0.10097
3,-0.063404
4,-0.90617
5,0.14789000000000002
6,-0.036052
7,0.087033
8,-0.47756000000000004
9,0.28183
10,0.14495
11,-0.026032999999999997
12,0.089827
13,0.40696
14,-0.44581000000000004
15,-0.32819
16,-0.22376
17,0.28029
18,-0.20417000000000002
19,0.0069962
20,0.10564000000000001
21,-0.48493
22,0.18527000000000002
23,-0.37217
24,0.43033999999999994
25,0.099401
26,0.27806
27,-0.1789
28,-0.47211000000000003
29,0.16114
30,0.11861
31,0.077638
32,-0.26291
33,-0.26165
34,0.36418
35,0.27555
36,1.922
37,1.922
38,1.922
39,1.922
40,1.922
41,1.922
42,1.922
43,1.922
44,-1.8891
45,-1.8891
46,-1.8891
47,-1.8891
48,-1.8891
49,-1.8891
50,-1.8891
51,-1.8891
52,-0.086645
53,-0.27481
54,1.922
55,1.922
56,1.922
57,1.922
58,1.922
59,1.922
60,1.922
61,1.922
62,-1.8891
63,-1.8891
64,-1.8891
65,-1.8891
66,-1.8891
67,-1.8891
68,-1.8891
69,-1.8891
70,0.28605
71,0.5945699999999999
72,0.11325
73,0.29456
74,-0.85696
75,-0.033387
76,-0.13898
77,-0.1777
78,-0.18124
79,-0.54322
80,-0.7190000000000001
81,0.0019752
82,1.0439
83,-0.37542
84,-0.057803
85,-0.07708999999999999
86,0.014603999999999999
87,-0.52077
88,0.22509
89,-0.009320700000000001
90,-0.052884
91,-0.14222
92,-0.10432000000000001
93,-0.091696
94,-0.069472
95,0.40401
96,0.65652
97,0.035878
98,-0.0042744
99,0.17129
100,0.5138
101,0.32506
102,0.36443000000000003
103,-0.11632
104,0.24916
105,-0.43559
106,-0.13030999999999998
107,-0.2511
108,0.30018
109,0.051914
110,0.21844
111,-0.20057
112,0.21841
113,-0.041274
114,-0.6077199999999999
115,0.5190899999999999
116,0.61342
117,-0.31665
118,0.11638
119,0.18283
120,0.40356
121,0.10679000000000001
122,-0.4736
123,0.22066999999999998
124,-0.42688999999999994
125,-0.20589000000000002
126,0.057529
127,-0.22021999999999997
