time,value
0,-0.91199
1,-0.89941
2,-0.88646
3,-0.8768600000000001
4,-0.8672700000000001
5,-0.85887
6,-0.8459
7,-0.8301
8,-0.81398
9,-0.79494
10,-0.7780100000000001
11,-0.7559100000000001
12,-0.7305
13,-0.7012
14,-0.66418
15,-0.62451
16,-0.57282
17,-0.51137
18,-0.43613
19,-0.34359
20,-0.23985
21,-0.11846
22,0.013066
23,0.15639
24,0.31126
25,0.47398999999999997
26,0.65283
27,0.84652
28,1.0611
29,1.2931
30,1.5318
31,1.7695
32,1.9954
33,2.2074
34,2.4033
35,2.5812
36,2.74
37,2.8803
38,3.0063
39,3.1207
40,3.2219
41,3.302
42,3.3489
43,3.3515
44,3.3007
45,3.193
46,3.0285
47,2.8153
48,2.5702
49,2.3129
50,2.0639
51,1.8259
52,1.5884
53,1.3319
54,1.0396
55,0.72039
56,0.39124000000000003
57,0.08265800000000001
58,-0.18209
59,-0.39413000000000004
60,-0.54506
61,-0.6470899999999999
62,-0.70687
63,-0.73923
64,-0.75847
65,-0.76567
66,-0.7713800000000001
67,-0.76962
68,-0.76378
69,-0.75472
70,-0.7368899999999999
71,-0.7179399999999999
72,-0.6905100000000001
73,-0.65894
74,-0.62316
75,-0.57906
76,-0.53357
77,-0.48153999999999997
78,-0.42826000000000003
79,-0.37506
80,-0.32093
81,-0.27359
82,-0.23089
83,-0.19738
84,-0.17438
85,-0.1588
86,-0.15261
87,-0.15150999999999998
88,-0.15402000000000002
89,-0.15652
90,-0.15288
91,-0.1421
92,-0.1217
93,-0.09404
94,-0.060622
95,-0.022262
96,0.017626
97,0.058285000000000003
98,0.097039
99,0.13496
100,0.1738
101,0.21495999999999998
102,0.26226
103,0.31723
104,0.38236
105,0.45236000000000004
106,0.51565
107,0.5594600000000001
108,0.57386
109,0.56215
110,0.53014
111,0.48473999999999995
112,0.42912
113,0.36291999999999996
114,0.29125999999999996
115,0.21796999999999997
116,0.14869000000000002
117,0.085829
118,0.028582
119,-0.022080000000000002
120,-0.069285
121,-0.11385999999999999
122,-0.15847999999999998
123,-0.2041
124,-0.24768
125,-0.28909
126,-0.3252
127,-0.3575
128,-0.38627
129,-0.41015
130,-0.43098000000000003
131,-0.44565
132,-0.45638999999999996
133,-0.46257
134,-0.46388999999999997
135,-0.46442
136,-0.46285
137,-0.46379
138,-0.46733
139,-0.47352
140,-0.48396000000000006
141,-0.49533
142,-0.5083
143,-0.51988
144,-0.52923
145,-0.5390199999999999
146,-0.54956
147,-0.56424
148,-0.58021
149,-0.59373
150,-0.6030300000000001
151,-0.60553
152,-0.60537
153,-0.6035699999999999
154,-0.60139
155,-0.5997100000000001
156,-0.59568
157,-0.59148
158,-0.58612
159,-0.5808800000000001
160,-0.57663
161,-0.57111
162,-0.5644
163,-0.55291
164,-0.53538
165,-0.51005
166,-0.47579
167,-0.43341
168,-0.38311
169,-0.32714
170,-0.26684
171,-0.20468
172,-0.14412
173,-0.088305
174,-0.040787000000000004
175,-0.0018187000000000001
176,0.029822
177,0.056047
178,0.07720199999999999
179,0.08895
180,0.08565299999999999
181,0.061279999999999994
182,0.013451
183,-0.056136
184,-0.1451
185,-0.24884
186,-0.36284
187,-0.47953
188,-0.58862
189,-0.68199
190,-0.75295
191,-0.80187
192,-0.8321299999999999
193,-0.8488
194,-0.8589700000000001
195,-0.8649600000000001
196,-0.8698899999999999
197,-0.87218
198,-0.8697
199,-0.8638899999999999
200,-0.85321
201,-0.8424799999999999
202,-0.83135
203,-0.81934
204,-0.80796
205,-0.79251
206,-0.7765
207,-0.75698
208,-0.7340899999999999
209,-0.71118
210,-0.6845899999999999
211,-0.65922
212,-0.63053
213,-0.5969899999999999
214,-0.55989
215,-0.51422
216,-0.46428
217,-0.40576
218,-0.3389
219,-0.26604
220,-0.18407
221,-0.092349
222,0.013786000000000001
223,0.13371
224,0.2616
225,0.39100999999999997
226,0.51881
227,0.64727
228,0.77775
229,0.90741
230,1.0303
231,1.1425
232,1.2439
233,1.3333
234,1.4069999999999998
235,1.4603
236,1.4942
237,1.5144
238,1.5225
239,1.5089
240,1.4504
241,1.3229
242,1.1123
243,0.82337
244,0.48346999999999996
245,0.13416
246,-0.1775
247,-0.41838000000000003
248,-0.58036
249,-0.6764899999999999
250,-0.73327
251,-0.76862
252,-0.79242
253,-0.80734
254,-0.81365
255,-0.81881
256,-0.8237899999999999
257,-0.83142
258,-0.83949
259,-0.8445299999999999
260,-0.8510700000000001
261,-0.85693
262,-0.8652799999999999
263,-0.87236
264,-0.8744799999999999
265,-0.87698
266,-0.88061
267,-0.89238
268,-0.9080799999999999
269,-0.91976
