time,value
0,1.0337
1,1.0337
2,1.0337
3,1.0337
4,1.0337
5,1.0337
6,1.0337
7,1.0337
8,1.0337
9,1.0366
10,1.0494
11,1.0711
12,1.1025
13,1.1340000000000001
14,1.1654
15,1.1784
16,1.188
17,1.188
18,1.188
19,1.188
20,1.188
21,1.188
22,1.188
23,1.188
24,1.188
25,1.188
26,1.188
27,1.188
28,1.188
29,1.188
30,1.188
31,1.188
32,1.188
33,1.188
34,1.188
35,1.188
36,1.188
37,1.188
38,1.188
39,1.1934
40,1.2065
41,1.2247
42,1.2457
43,1.2667
44,1.2851
45,1.2887
46,1.2909
47,1.2909
48,1.2909
49,1.2909
50,1.2909
51,1.2909
52,1.2909
53,1.2909
54,1.2909
55,1.2909
56,1.2909
57,1.2909
58,1.2909
59,1.2909
60,1.2909
61,1.2909
62,1.2909
63,1.2909
64,1.2966
65,1.3037
66,1.3142
67,1.3247
68,1.3352
69,1.3405
70,1.3421
71,1.3424
72,1.3423
73,1.3413
74,1.3339
75,1.3129
76,1.2919
77,1.2709
78,1.2478
79,1.2238
80,1.1923
81,1.1608
82,1.1294
83,1.1006
84,1.0739
85,1.0517
86,1.0308
87,1.0098
88,0.98882
89,0.96785
90,0.9468799999999999
91,0.92591
92,0.9049299999999999
93,0.8842200000000001
94,0.87226
95,0.8607
96,0.85021
97,0.83973
98,0.82924
99,0.81876
100,0.8082699999999999
101,0.79779
102,0.7880199999999999
103,0.7803100000000001
104,0.77649
105,0.77649
106,0.77649
107,0.77649
108,0.7716
109,0.76535
110,0.7548600000000001
111,0.74437
112,0.7338899999999999
113,0.71309
114,0.68852
115,0.6572100000000001
116,0.62576
117,0.5943
118,0.55423
119,0.50442
120,0.45274
121,0.40032
122,0.34631
123,0.28825
124,0.21485
125,0.14145
126,0.31375
127,-0.053249
128,-0.42025
129,-0.15214
130,-0.22554000000000002
131,-0.29894
132,-0.37234
133,-0.44573999999999997
134,-0.5191399999999999
135,-0.59254
136,-0.66594
137,-0.7368399999999999
138,-0.79582
139,-0.85206
140,-0.90449
141,-0.95691
142,-1.0093
143,-1.0533
144,-1.0962
145,-1.1381
146,-1.1793
147,-1.2192
148,-1.2469
149,-1.2679
150,-1.2888
151,-1.3098
152,-1.3308
153,-1.3518
154,-1.3727
155,-1.3937
156,-1.4147
157,-1.431
158,-1.4461
159,-1.4566
160,-1.4671
161,-1.4776
162,-1.4971
163,-1.5224
164,-1.5530000000000002
165,-1.5844
166,-1.6159
167,-1.6440000000000001
168,-1.6659
169,-1.6873
170,-1.7083
171,-1.7283
172,-1.7473
173,-1.7578
174,-1.7682
175,-1.7787
176,-1.7873
177,-1.7945
178,-1.7958
179,-1.7958
180,-1.7958
181,-1.7923
182,-1.7815
183,-1.765
184,-1.744
185,-1.723
186,-1.7016
187,-1.6731
188,-1.6437
189,-1.6123
190,-1.5808
191,-1.5493
192,-1.5179
193,-1.4864
194,-1.455
195,-1.4231
196,-1.3904
197,-1.3527
198,-1.3108
199,-1.2689
200,-1.227
201,-1.1885
202,-1.1519
203,-1.1204
204,-1.089
205,-1.0575
206,-1.0261
207,-0.9946
208,-0.96314
209,-0.93168
210,-0.90023
211,-0.86877
212,-0.83731
213,-0.80586
214,-0.7744
215,-0.7429399999999999
216,-0.71149
217,-0.68003
218,-0.64857
219,-0.61712
220,-0.58673
221,-0.55675
222,-0.53552
223,-0.51455
224,-0.49358
225,-0.47428000000000003
226,-0.45691000000000004
227,-0.44443
228,-0.43393999999999994
229,-0.42346000000000006
230,-0.41297
231,-0.40249
232,-0.392
233,-0.38151999999999997
234,-0.37103
235,-0.36055
236,-0.35006
237,-0.33957
238,-0.32909
239,-0.3186
240,-0.30812
241,-0.29088
242,-0.2704
243,-0.24946
244,-0.22904000000000002
245,-0.21135
246,-0.20097
247,-0.20097
248,-0.20097
249,-0.20097
250,-0.19755999999999999
251,-0.19278
252,-0.18229
253,-0.1718
254,-0.16132
255,-0.15083
256,-0.14035
257,-0.12986
258,-0.11938
259,-0.10889000000000001
260,-0.10146000000000001
261,-0.098997
262,-0.098078
263,-0.098078
264,-0.098078
265,-0.096887
266,-0.46016
267,-0.40878000000000003
268,-0.35635
269,-0.30941
270,-0.26599
271,-0.25968
272,-0.25968
273,-0.25968
274,-0.25968
275,-0.25968
276,-0.25968
277,-0.25968
278,-0.25968
279,-0.25968
280,-0.25968
281,-0.25968
282,-0.25968
283,-0.25968
284,-0.25968
285,-0.25968
286,-0.25968
287,-0.25968
288,-0.25968
289,-0.25968
290,-0.28852
291,-0.34012
292,-0.39239
293,-0.44433
294,-0.48691999999999996
295,-0.098078
296,-0.098078
297,-0.098078
298,-0.098078
299,-0.098078
300,-0.098078
301,-0.098078
302,-0.098078
303,-0.098078
304,-0.10135
305,-0.10757
306,-0.11707999999999999
307,-0.12757000000000002
308,-0.13805
309,-0.14635
310,-0.14848
311,-0.14952000000000001
312,-0.14952000000000001
313,-0.14952000000000001
314,-0.14952000000000001
315,0.3375
316,0.3375
317,0.3375
318,0.3375
319,0.3375
320,0.3375
321,0.3375
322,0.3375
323,0.3375
324,0.34105
325,0.35653
326,0.38277
327,0.42089
328,0.45901000000000003
329,0.49713
330,0.5128
331,0.52453
332,0.52453
333,0.52453
334,0.52453
335,0.52453
336,0.52453
337,0.52453
338,0.52453
339,0.52453
340,0.52453
341,0.52453
342,0.52453
343,0.52453
344,0.52453
345,0.52453
346,0.52453
347,0.52453
348,0.52453
349,0.52453
350,0.52453
351,0.52453
352,0.52453
353,0.52453
354,0.5391
355,0.57484
356,0.62459
357,0.68177
358,0.73895
359,0.7892600000000001
360,0.79908
361,0.80507
362,0.80507
363,0.80507
364,0.80507
365,0.80507
366,0.80507
367,0.80507
368,0.80507
369,0.80507
370,0.80507
371,0.80507
372,0.80507
373,0.80507
374,0.80507
375,0.80507
376,0.80507
377,0.80507
378,0.80507
379,0.82581
380,0.8515299999999999
381,0.88965
382,0.9277700000000001
383,0.9658899999999999
384,0.98514
385,0.9911
386,0.9921
387,0.9921700000000001
388,0.99306
389,0.99984
390,1.0189
391,1.038
392,1.057
393,1.0722
394,1.0856
395,1.0856
396,1.0856
397,1.0856
398,1.0904
399,1.099
400,1.1159999999999999
401,1.135
402,1.1541
403,1.1732
404,1.1922
405,1.2113
406,1.2304
407,1.2494
408,1.2685
409,1.2875
410,1.3066
411,1.3257
412,1.3447
413,1.3638
414,1.3828
415,1.4019
416,1.421
417,1.4413
418,1.4654
419,1.4966
420,1.5347
421,1.5728
422,1.611
423,1.6402
424,1.6669
425,1.686
426,1.7051
427,1.7241
428,1.7432
429,1.7622
430,1.7813
431,1.8004
432,1.8194
433,1.8307
434,1.8330000000000002
435,1.8337
436,1.8337
437,1.8323
438,1.8272
439,1.8081
440,1.7891
441,1.77
442,1.7434
443,1.7137
444,1.6580000000000001
445,1.6008
446,1.5437
447,1.4784
448,1.4028
449,1.3137
450,1.2184
451,1.1231
452,1.0301
453,0.94791
454,0.86821
455,0.79197
456,0.71572
457,0.63948
458,0.56324
459,0.48700000000000004
460,0.41076
461,0.33452
462,0.25828
463,0.18204
464,0.50247
465,0.12127
466,-0.25203000000000003
467,-0.11002999999999999
468,-0.16462000000000002
469,-0.20274
470,-0.24086
471,-0.27898
472,-0.32545999999999997
473,-0.37428
474,-0.43146
475,-0.48863999999999996
476,-0.54582
477,-0.603
478,-0.66018
479,-0.71736
480,-0.77454
481,-0.83173
482,-0.8889100000000001
483,-0.94609
484,-1.0033
485,-1.0604
486,-1.1159
487,-1.1694
488,-1.2076
489,-1.2457
490,-1.2838
491,-1.3185
492,-1.3506
493,-1.3719999999999999
494,-1.391
495,-1.4101
496,-1.426
497,-1.4352
498,-1.4393
499,-1.4393
500,-1.4393
501,-1.4393
502,-1.4393
503,-1.4393
504,-1.4393
505,-1.4393
506,-1.4393
507,-1.4253
508,-1.4077
509,-1.3886
510,-1.3696
511,-1.3505
512,-1.3315
513,-1.3124
514,-1.2933
515,-1.2743
516,-1.2552
517,-1.2362
518,-1.2171
519,-1.198
520,-1.179
521,-1.1599
522,-1.1409
523,-1.1218
524,-1.1027
525,-1.0837
526,-1.0646
527,-1.0456
528,-1.0265
529,-1.0074
530,-0.9883799999999999
531,-0.9693200000000001
532,-0.95026
533,-0.9312
534,-0.91214
535,-0.89502
536,-0.87864
537,-0.8781899999999999
538,-0.8781899999999999
539,-0.8781899999999999
540,-0.8781899999999999
541,-0.8781899999999999
542,-0.8781899999999999
543,-0.8781899999999999
544,-0.8781899999999999
545,-0.8781899999999999
546,-0.8781899999999999
547,-0.8781899999999999
548,-0.8781899999999999
549,-0.8781899999999999
550,-0.8781899999999999
551,-0.86477
552,-0.84959
553,-0.8305299999999999
554,-0.81147
555,-0.7924100000000001
556,-0.78563
557,-0.78474
558,-0.78467
559,-0.78417
560,-0.7811899999999999
561,-0.77157
562,-0.75251
563,-0.73345
564,-0.71439
565,-0.70153
566,-0.69116
567,-0.69116
568,-0.69116
569,-0.69116
570,-0.69116
571,-0.69116
572,-0.69116
573,-0.69116
574,-0.69116
575,-0.68561
576,-0.67102
577,-0.65363
578,-0.63457
579,-0.61551
580,-0.5986199999999999
581,-0.59802
582,-0.59764
583,-0.59764
584,-0.59764
585,-0.59764
586,-0.59764
587,-0.59764
588,-0.59764
589,-0.60012
590,-0.60727
591,-0.62147
592,-0.64053
593,-0.65959
594,-0.67773
595,-0.68577
596,-0.69116
597,-0.69116
598,-0.69116
599,-0.69116
600,-0.69116
601,-0.69116
602,-0.69116
603,-0.69116
604,-0.69116
605,-0.7016399999999999
606,-0.7204
607,-0.7394
608,-0.7582800000000001
609,-0.77377
610,-0.78467
611,-0.78467
612,-0.78467
613,-0.78467
614,-0.78467
615,-0.78467
616,-0.78467
617,-0.78467
618,-0.78467
619,-0.78467
620,-0.78467
621,-0.78467
622,-0.78467
623,-0.78467
624,-0.78467
625,-0.78467
626,-0.78467
627,-0.78467
628,-0.78467
629,-0.78467
630,-0.6388199999999999
631,-0.6388199999999999
632,-0.6388199999999999
633,-0.6388199999999999
634,-0.6388199999999999
635,-0.6388199999999999
636,-0.6388199999999999
637,-0.6388199999999999
638,-0.6388199999999999
639,-0.64283
640,-0.6603600000000001
641,-0.69005
642,-0.73318
643,-0.77632
644,-0.8194600000000001
645,-0.83719
646,-0.85046
647,-0.85046
648,-0.85046
649,-0.85046
650,-0.85046
651,-0.85046
652,-0.85046
653,-0.85046
654,-0.85046
655,-0.85046
656,-0.85046
657,-0.85046
658,-0.85046
659,-0.85046
660,-0.85046
661,-0.85046
662,-0.85046
663,-0.85046
664,-0.85046
665,-0.85046
666,-0.85046
667,-0.85046
668,-0.85046
669,-0.85046
670,-0.85046
671,-0.85046
672,-0.85046
673,-0.85046
674,-0.85046
675,-0.85046
676,-0.85046
677,-0.85046
678,-0.85046
679,-0.85046
680,-0.85046
681,-0.85046
682,-0.85046
683,-0.85046
684,-0.85046
685,-0.85046
686,-0.85046
687,-0.85046
688,-0.85046
689,-0.85046
690,-0.85046
691,-0.85046
692,-0.85046
693,-0.85046
694,-0.8739299999999999
695,-0.90304
696,-0.9461799999999999
697,-0.98931
698,-1.0325
699,-1.0542
700,-1.061
701,-1.0621
702,-1.0626
703,-1.0686
704,-1.1147
705,-1.2441
706,-1.3735
707,-1.5029
708,-1.6059
709,-1.6969999999999998
710,-1.6969999999999998
711,-1.6969999999999998
712,-1.6969999999999998
713,-1.6969999999999998
714,-1.6969999999999998
715,-1.6969999999999998
716,-1.6969999999999998
717,-1.6969999999999998
718,-1.6969999999999998
719,-1.6969999999999998
720,-1.6969999999999998
721,-1.6969999999999998
722,-1.6969999999999998
723,-1.696
724,-1.6589
725,-1.6202
726,-1.5771
727,-1.5339
728,-1.4908
729,-1.4477
730,-1.4045
731,-1.3614
732,-1.3212
733,-1.2895
734,-1.2738
735,-1.2738
736,-1.2738
737,-1.2738
738,-1.2536
739,-1.2279
740,-1.1848
741,-1.1416
742,-1.0985
743,-1.0129
744,-0.91184
745,-0.7830600000000001
746,-0.65365
747,-0.52423
748,-0.39482
749,-0.26541
750,-0.13599
751,-0.059427
752,0.12283
753,0.25225
754,0.38166
755,0.51107
756,0.64049
757,0.7699
758,0.89931
759,1.0287
760,1.1581
761,1.2876
762,1.4169999999999998
763,1.5464
764,1.6758
765,1.8052
766,1.9346
767,2.0486
768,2.0891
769,2.1126
770,2.1126
771,2.1126
772,2.1126
773,2.0776
774,2.0384
775,1.9953
776,1.9521
777,1.909
778,1.8659
779,1.8227
780,1.7796
781,1.7382
782,1.7079
783,1.6893
784,1.6893
785,1.6893
786,1.6893
787,1.6893
788,1.6893
789,1.6893
790,1.6893
791,1.6893
792,1.6893
793,1.6893
794,1.6893
795,1.6893
796,1.6893
797,1.6755
798,1.6364
799,1.5949
800,1.5518
801,1.5086
802,1.4655
803,1.4224
804,1.3792
805,1.3361
806,1.2929
807,1.2498
808,1.2067
809,1.1635
810,1.1204
811,1.0702
812,1.0048
813,0.9276200000000001
814,0.84135
815,0.75507
816,0.6705300000000001
817,0.61526
818,0.56365
819,0.52051
820,0.47736999999999996
821,0.43423
822,0.42263999999999996
823,0.4194
824,0.4194
825,0.41633000000000003
826,0.40555
827,0.3547
828,0.26842
829,0.18215
830,0.45442
831,0.093812
832,-0.22793000000000002
833,-0.44361999999999996
834,-0.12655999999999998
835,-0.1697
836,-0.19542
837,-0.21553000000000003
838,-0.21553000000000003
839,-0.21553000000000003
840,-0.21553000000000003
841,-0.19977999999999999
842,-0.1681
843,-0.12791
844,-0.45036000000000004
845,-0.23467
846,-0.16413
847,0.1967
848,0.41239
849,0.13092
850,0.16965
851,0.20672
852,0.20776
853,0.20776
854,0.20776
855,0.20776
856,0.20776
857,0.20776
858,0.20776
859,0.20776
860,0.20776
861,0.20776
862,0.20776
863,0.20776
864,0.20776
865,0.20776
866,0.23811999999999997
867,0.27247
868,0.3156
869,0.35874
870,0.40188
871,0.41722
872,0.41925
873,0.4194
874,0.42053
875,0.42727
876,0.44906
877,0.4922
878,0.5353399999999999
879,0.57848
880,0.60758
881,0.63105
882,0.63105
883,0.63105
884,0.63105
885,0.63105
886,0.63105
887,0.63105
888,0.63105
889,0.63105
890,0.6185
891,0.5854699999999999
892,0.5461199999999999
893,0.50298
894,0.45985
895,0.42161000000000004
896,0.42026
897,0.4194
898,0.4194
899,0.41489
900,0.40747
901,0.36953
902,0.32639
903,0.28325
904,0.24572
905,0.21875
906,0.20776
907,0.20776
908,0.20776
909,0.20567
910,0.18073
911,0.14979
912,0.10665999999999999
913,0.29107
914,0.07537999999999999
915,-0.050413
916,-0.045946
917,-0.045946
918,-0.045946
919,-0.045946
920,0.072668
921,0.28499
922,0.50002
923,0.14804
924,0.18309
925,0.20776
926,0.20776
927,0.20776
928,0.20776
929,0.20776
930,0.20776
931,0.20776
932,0.20776
933,0.20776
934,0.20776
935,0.20776
936,0.20776
937,0.20776
938,0.20776
939,0.19873
940,0.16435999999999998
941,0.12553
942,0.38543
943,0.16974
944,-0.045946
