time,value
0,1.111
1,1.0325
2,0.9026299999999999
3,0.7173
4,0.47605
5,0.18325999999999998
6,-0.14751
7,-0.49033000000000004
8,-0.81425
9,-1.0891
10,-1.2877
11,-1.3892
12,-1.3827
13,-1.2697
14,-1.0636
15,-0.77845
16,-0.44048999999999994
17,-0.075361
18,0.28826999999999997
19,0.6253
20,0.91332
21,1.1306
22,1.2655
23,1.3106
24,1.2651
25,1.1422
26,0.9486600000000001
27,0.7028
28,0.41568
29,0.10444
30,-0.21611
31,-0.5281399999999999
32,-0.8087
33,-1.0385
34,-1.1917
35,-1.2496
36,-1.202
37,-1.0551
38,-0.82286
39,-0.53004
40,-0.20758000000000001
41,0.10732
42,0.39302
43,0.6299399999999999
44,0.80834
45,0.9245899999999999
46,0.9873
47,0.9895200000000001
48,0.93614
49,0.8211
50,0.64661
51,0.41647
52,0.14995999999999998
53,-0.12504
54,-0.38553000000000004
55,-0.60039
56,-0.75163
57,-0.82736
58,-0.83488
59,-0.7867
60,-0.6967800000000001
61,-0.5839
62,-0.46152
63,-0.3245
64,-0.17521
65,-0.012735
66,0.16403
67,0.34912
68,0.52671
69,0.67189
70,0.7682899999999999
71,0.79856
72,0.75751
73,0.65017
74,0.49383
75,0.31282
76,0.12716
77,-0.045623000000000004
78,-0.18978
79,-0.30208
80,-0.38416999999999996
81,-0.43693000000000004
82,-0.46192
83,-0.4599
84,-0.43463
85,-0.38066
86,-0.30755
87,-0.22632
88,-0.14851
89,-0.086211
90,-0.041046
91,-0.020716
92,-0.013285
93,-0.012661
94,-0.0021141
95,0.027844999999999998
96,0.086005
97,0.16823
98,0.26621
99,0.36944
100,0.4565
101,0.51157
102,0.52598
103,0.49341999999999997
104,0.41334
105,0.29213
106,0.14054
107,-0.028506
108,-0.1982
109,-0.35054
110,-0.46681000000000006
111,-0.53191
112,-0.54084
113,-0.49427
114,-0.40421999999999997
115,-0.28488
116,-0.15632000000000001
117,-0.027712999999999998
118,0.084227
119,0.17745999999999998
120,0.25545
121,0.3163
122,0.36134
123,0.38538
124,0.38147
125,0.34288
126,0.2663
127,0.1546
128,0.018917
129,-0.13047
130,-0.27368000000000003
131,-0.3952
132,-0.48243
133,-0.52828
134,-0.52507
135,-0.47107
136,-0.36371
137,-0.20726999999999998
138,-0.0052553999999999995
139,0.22988000000000003
140,0.4692
141,0.68608
142,0.85041
143,0.93319
144,0.91966
145,0.81201
146,0.6191
147,0.35614
148,0.059204999999999994
149,-0.25098000000000004
150,-0.54781
151,-0.80907
152,-1.0066
153,-1.1306
154,-1.1648
155,-1.0989
156,-0.9346200000000001
157,-0.6813600000000001
158,-0.35761
159,0.0021376999999999998
160,0.36601999999999996
161,0.6924899999999999
162,0.9561799999999999
163,1.1416
164,1.2306
165,1.2284
166,1.1443
167,0.98521
168,0.76308
169,0.48873
170,0.17714000000000002
171,-0.15711
172,-0.48808
173,-0.79268
174,-1.0464
175,-1.2217
176,-1.3059
177,-1.2842
178,-1.1592
179,-0.9415
180,-0.6475
181,-0.30114
182,0.074934
183,0.4463
184,0.78603
185,1.0767
186,1.2909
187,1.4095
188,1.4227
189,1.3215
190,1.111
191,0.80094
192,0.41976
193,-0.0027299
194,-0.4264
195,-0.80889
196,-1.1144
197,-1.3205
198,-1.4088
199,-1.3809
200,-1.2485
201,-1.0326
202,-0.75658
203,-0.45064
204,-0.1353
205,0.16819
206,0.44461000000000006
207,0.68418
208,0.8826
209,1.0285
210,1.1144
211,1.1420000000000001
212,1.1072
213,1.0132
214,0.8664200000000001
215,0.67811
216,0.45655
217,0.21368
218,-0.046952
219,-0.31218
220,-0.5711
221,-0.80955
222,-1.0129
223,-1.1589
224,-1.2356
225,-1.2298
226,-1.1364
227,-0.9608200000000001
228,-0.71577
229,-0.41995
230,-0.091866
231,0.24168
232,0.55928
233,0.8417399999999999
234,1.0676
235,1.224
236,1.3007
237,1.2890000000000001
238,1.1924
239,1.0188
240,0.78562
241,0.512
242,0.22563000000000002
243,-0.059181
244,-0.32606
245,-0.5737399999999999
246,-0.79614
247,-0.98906
248,-1.1447
249,-1.2537
250,-1.2995
251,-1.2646
252,-1.1437
253,-0.94334
254,-0.67238
255,-0.35241999999999996
256,-0.0089468
257,0.34034000000000003
258,0.67055
259,0.9720799999999999
260,1.2321
261,1.439
262,1.5879
263,1.6588
264,1.6365
265,1.5108
266,1.2733
267,0.9316
268,0.51051
269,0.033405000000000004
270,-0.4518
271,-0.90543
272,-1.2887
273,-1.5839
274,-1.7674
275,-1.8441
276,-1.8184
277,-1.6987
278,-1.4942
279,-1.2185
280,-0.88103
281,-0.49238999999999994
282,-0.069084
283,0.36803
284,0.7972600000000001
285,1.2026
286,1.5434
287,1.8030000000000002
288,1.9574
289,1.9957
290,1.9031
291,1.6778
292,1.3301
293,0.8774299999999999
294,0.35585
295,-0.1885
296,-0.70505
297,-1.1474
298,-1.4709999999999999
299,-1.6535
300,-1.6881
301,-1.5971
302,-1.4035
303,-1.1458
304,-0.85714
305,-0.55986
306,-0.27005
307,0.0059462
308,0.27414
309,0.53308
310,0.77762
311,1.0004
312,1.1807
313,1.2869
314,1.3042
315,1.2205
316,1.0304
317,0.7438
318,0.38504
319,-0.012125
320,-0.40948
321,-0.76452
322,-1.0509
323,-1.24
324,-1.3255
325,-1.3013
326,-1.1775
327,-0.96978
328,-0.69704
329,-0.3785
330,-0.038245
331,0.30222
332,0.6248199999999999
333,0.90691
334,1.1292
335,1.276
336,1.3351
337,1.2994
338,1.1722
339,0.9649200000000001
340,0.70038
341,0.39918000000000003
342,0.098591
343,-0.18277000000000002
344,-0.41456000000000004
345,-0.59101
346,-0.70089
347,-0.76081
348,-0.78281
349,-0.78938
350,-0.79596
351,-0.8111
352,-0.8495299999999999
353,-0.89366
354,-0.92743
355,-0.92399
356,-0.86366
357,-0.71973
358,-0.49528999999999995
359,-0.18800999999999998
360,0.1691
361,0.55429
362,0.93111
363,1.2645
364,1.5317
365,1.7117
366,1.798
367,1.7828
368,1.6657
369,1.4434
370,1.1325
371,0.73938
372,0.2947
373,-0.16841
374,-0.6038899999999999
375,-0.9842
376,-1.2649
377,-1.4361
378,-1.4987
379,-1.4792
380,-1.3973
381,-1.2806
382,-1.1567
383,-1.0225
384,-0.8794299999999999
385,-0.71542
386,-0.53182
387,-0.31126
388,-0.06788200000000001
389,0.19735999999999998
390,0.46142
391,0.7145699999999999
392,0.94425
393,1.1383
394,1.2898
395,1.386
396,1.4253
397,1.4002
398,1.3076
399,1.1420000000000001
400,0.91314
401,0.6258199999999999
402,0.30312
403,-0.042073
404,-0.38595
405,-0.7037800000000001
406,-0.9759
407,-1.1771
408,-1.2885
409,-1.2991
410,-1.2112
411,-1.026
412,-0.76891
413,-0.47136000000000006
414,-0.1597
415,0.12769
416,0.35814
417,0.51
418,0.57705
419,0.56055
420,0.46592
421,0.31095
422,0.11167
423,-0.11037999999999999
424,-0.32782
425,-0.5180100000000001
426,-0.64823
427,-0.69505
428,-0.6342800000000001
429,-0.45993999999999996
430,-0.17365
431,0.20313
432,0.63447
433,1.0752
434,1.4745
435,1.7769
436,1.9389
437,1.9240000000000002
438,1.7167
439,1.3277
440,0.7854800000000001
441,0.14087
442,-0.5422
443,-1.1974
444,-1.7621
445,-2.1917
446,-2.4525
447,-2.5391
448,-2.4528
449,-2.2096
450,-1.829
451,-1.3313
452,-0.74048
453,-0.072939
454,0.63335
455,1.3336
456,1.9703
457,2.4794
458,2.7947
459,2.8767
460,2.7031
461,2.2907
462,1.6882
463,0.9581
464,0.18617
465,-0.5502100000000001
466,-1.1876
467,-1.6862
468,-2.0189
469,-2.1788
470,-2.1726
471,-2.0089
472,-1.7001
473,-1.2682
474,-0.74559
475,-0.1719
476,0.40568000000000004
477,0.9268200000000001
478,1.3438
479,1.6175
480,1.7329
481,1.6877
482,1.4959
483,1.1945
484,0.80491
485,0.36080999999999996
486,-0.10905
487,-0.57099
488,-1.0022
489,-1.3559
490,-1.6069
491,-1.7176
492,-1.67
493,-1.4591
494,-1.1033
495,-0.63725
496,-0.10293
497,0.44168
498,0.94668
499,1.3752
