time,value
0,-0.083194
1,0.23739000000000002
2,-0.23820999999999998
3,-1.6562
4,-1.6562
5,-1.6562
6,-1.6562
7,-1.6562
8,-1.6562
9,-1.6562
10,-1.6562
11,-1.6562
12,-1.6562
13,-1.6562
14,1.6726
15,1.6726
16,1.6726
17,1.6726
18,1.6726
19,1.6726
20,1.6726
21,1.6726
22,1.6726
23,1.6726
24,0.069312
25,0.058279
26,-0.5323
27,0.16021
28,0.010541
29,-0.67006
30,0.02758
31,0.40871999999999997
32,0.47085
33,0.11010999999999999
34,0.27036
35,0.23346999999999998
36,-0.9574
37,0.018317
38,0.046375
39,-0.37432
40,-0.19276
41,-0.22838000000000003
42,-0.50505
43,-0.10071000000000001
44,-0.061426
45,-0.47941999999999996
46,0.12122000000000001
47,0.12294000000000001
48,0.15908
49,-0.099338
50,-0.36196
51,-0.22086
52,-0.35059
53,0.5789300000000001
54,-0.72493
55,-0.052775
56,0.22177
57,0.07988300000000001
58,0.20815
59,0.42931
60,1.6726
61,1.6726
62,1.6726
63,1.6726
64,1.6726
65,1.6726
66,1.6726
67,1.6726
68,1.6726
69,1.6726
70,1.6726
71,-1.6562
72,-1.6562
73,-1.6562
74,-1.6562
75,-1.6562
76,-1.6562
77,-1.6562
78,-1.6562
79,-1.6562
80,-1.6562
81,0.080498
82,0.774
83,0.20818000000000003
84,0.2145
85,-0.29041999999999996
86,-0.40984
87,-0.33825
88,-0.51139
89,-0.50275
90,0.51753
91,0.21503000000000003
92,0.36884
93,-0.11387
94,0.4793
95,0.093289
96,0.024894
97,-0.011548000000000001
98,0.32608000000000004
99,0.32250999999999996
100,0.26682
101,0.1587
102,0.20426
103,-0.52833
104,-0.50597
105,-0.033277
106,0.30864
107,0.1954
108,-0.38471
109,-0.25753000000000004
110,0.60447
111,0.43956999999999996
112,-0.5171899999999999
113,0.19985999999999998
114,-0.42302
115,0.23571
116,0.15305
117,-0.15536
118,0.33497
119,0.44177
120,0.20288
121,-1.0024
122,0.051972000000000004
123,-0.006054100000000001
124,0.15528
125,0.0060833
126,0.11074
127,0.1425
