time,value
0,0.3234
1,0.3234
2,0.3234
3,0.3234
4,0.3234
5,0.3234
6,0.3234
7,0.3234
8,0.3234
9,0.3234
10,0.3234
11,0.3234
12,0.3234
13,0.3234
14,0.32506999999999997
15,0.34078
16,0.36072
17,0.38121
18,0.39938
19,0.4005
20,0.4005
21,0.4005
22,0.4005
23,0.4005
24,0.4005
25,0.4005
26,0.4005
27,0.4005
28,0.4005
29,0.4005
30,0.4005
31,0.4005
32,0.4005
33,0.4005
34,0.4005
35,0.4005
36,0.4005
37,0.4005
38,0.4005
39,0.4005
40,0.4005
41,0.4005
42,0.40175
43,0.40568000000000004
44,0.42604
45,0.44765
46,0.47125
47,0.50612
48,0.5473399999999999
49,0.5907399999999999
50,0.63445
51,0.68829
52,0.74231
53,0.79843
54,0.8627600000000001
55,0.93629
56,1.0119
57,1.0875
58,1.1632
59,1.2388
60,1.3163
61,1.3993
62,1.4947
63,1.5919
64,1.6854
65,1.7409
66,1.7879
67,1.8304
68,1.8714
69,1.9045
70,1.9369
71,1.9683
72,1.9939
73,2.0165
74,2.0383
75,2.0607
76,2.0928
77,2.1252
78,2.1587
79,2.1965
80,2.2387
81,2.2819
82,2.3235
83,2.3063
84,2.2863
85,2.2628
86,2.2333
87,2.1919999999999997
88,2.1488
89,2.1042
90,2.0438
91,1.9804
92,1.9155
93,1.8507
94,1.7859
95,1.7211
96,1.6572
97,1.5995
98,1.5445
99,1.4915
100,1.4405
101,1.4178
102,1.3962
103,1.3756
104,1.3597
105,1.3478
106,1.337
107,1.3259999999999998
108,1.3049
109,1.2835
110,1.2599
111,1.2299
112,1.1887
113,1.1455
114,1.1017
115,1.0496
116,0.9962
117,0.94376
118,0.8951399999999999
119,0.86115
120,0.8287399999999999
121,0.7945
122,0.74736
123,0.69516
124,0.64072
125,0.5854699999999999
126,0.52107
127,0.45624
128,0.39142
129,0.32659
130,0.26177
131,0.19694
132,0.1324
133,0.099248
134,0.06655499999999999
135,0.034143
136,0.00173
137,-0.030682
138,-0.063095
139,-0.09550700000000001
140,-0.12792
141,-0.16033
142,-0.19525
143,-0.2365
144,-0.29882
145,-0.36365
146,-0.42583999999999994
147,-0.46783
148,-0.5028699999999999
149,-0.5343
150,-0.56376
151,-0.5755600000000001
152,-0.58636
153,-0.59716
154,-0.60797
155,-0.6187699999999999
156,-0.62958
157,-0.6403800000000001
158,-0.6511899999999999
159,-0.66199
160,-0.67486
161,-0.69499
162,-0.72534
163,-0.75775
164,-0.78967
165,-0.81275
166,-0.83486
167,-0.85646
168,-0.8780700000000001
169,-0.8996799999999999
170,-0.9212899999999999
171,-0.9429
172,-0.9645100000000001
173,-0.98611
174,-1.0066
175,-1.0248
176,-1.0259
177,-1.0259
178,-1.0269
179,-1.0333
180,-1.0431
181,-1.0538
182,-1.0644
183,-1.0644
184,-1.0644
185,-1.0634
186,-1.0585
187,-1.0487
188,-1.0379
189,-1.0271
190,-1.0163
191,-1.0055
192,-0.9956200000000001
193,-0.98825
194,-0.98734
195,-0.98734
196,-0.98734
197,-0.98734
198,-0.98734
199,-0.98672
200,-0.98475
201,-0.97457
202,-0.9637700000000001
203,-0.9519700000000001
204,-0.93453
205,-0.9139200000000001
206,-0.89231
207,-0.87071
208,-0.8491
209,-0.82749
210,-0.80798
211,-0.79668
212,-0.79459
213,-0.79459
214,-0.79459
215,-0.79459
216,-0.79459
217,-0.79459
218,-0.79459
219,-0.79459
220,-0.79459
221,-0.79459
222,-0.79459
223,-0.79459
224,-0.7939
225,-0.79169
226,-0.78157
227,-0.77077
228,-0.7589899999999999
229,-0.74131
230,-0.72068
231,-0.6996
232,-0.67947
233,-0.67893
234,-0.67893
235,-0.67893
236,-0.67893
237,-0.67893
238,-0.67893
239,-0.6792
240,-0.6892699999999999
241,-0.6998
242,-0.7086600000000001
243,-0.7116100000000001
244,-0.70275
245,-0.69195
246,-0.68114
247,-0.6703399999999999
248,-0.6595300000000001
249,-0.64873
250,-0.63793
251,-0.62712
252,-0.61632
253,-0.60646
254,-0.60278
255,-0.60183
256,-0.60218
257,-0.60316
258,-0.6136199999999999
259,-0.62442
260,-0.63627
261,-0.65273
262,-0.67328
263,-0.69489
264,-0.7165
265,-0.73811
266,-0.75972
267,-0.78133
268,-0.80293
269,-0.8245399999999999
270,-0.84615
271,-0.86651
272,-0.87044
273,-0.87169
274,-0.87169
275,-0.87169
276,-0.87169
277,-0.87169
278,-0.87169
279,-0.87169
280,-0.87169
281,-0.87169
282,-0.87169
283,-0.87169
284,-0.87169
285,-0.87065
286,-0.86475
287,-0.8549899999999999
288,-0.84419
289,-0.8333799999999999
290,-0.82258
291,-0.81177
292,-0.80097
293,-0.7901699999999999
294,-0.77936
295,-0.76856
296,-0.75775
297,-0.74695
298,-0.73615
299,-0.72701
300,-0.7221
301,-0.73123
302,-0.7420399999999999
303,-0.75284
304,-0.76365
305,-0.77445
306,-0.78476
307,-0.79409
308,-0.79459
309,-0.79459
310,-0.79459
311,-0.79459
312,-0.79459
313,-0.79459
314,-0.79459
