time,value
0,-0.90038
1,-0.8559899999999999
2,-0.7227
3,-0.39435
4,-0.14572000000000002
5,0.21445
6,0.57222
7,0.9035799999999999
8,1.1656
9,1.4329
10,1.3872
11,1.3922
12,1.4379
13,1.5856
14,1.5315
15,1.2954
16,1.0378
17,0.77032
18,0.45913999999999994
19,0.15867
20,-0.17828
21,-0.49111000000000005
22,-0.7400399999999999
23,-0.8683700000000001
24,-0.79073
25,-0.59465
26,-0.32637
27,-0.04654
28,0.2587
29,0.5696
30,0.7935300000000001
31,1.1379
32,1.4671
33,1.6141
34,1.524
35,1.3797
36,1.3423
37,1.3124
38,1.3997
39,1.4269
40,1.6146
41,1.5065
42,1.226
43,0.9038299999999999
44,0.5606399999999999
45,0.25158
46,-0.048362
47,-0.33139
48,-0.59707
49,-0.79342
50,-0.41981
51,-0.59205
52,-0.7289899999999999
53,-0.84236
54,-1.0145
55,-1.2362
56,-1.4144
57,-1.4074
58,-1.3615
59,-1.1617
60,-0.9478
61,-0.85906
62,-0.72737
63,-0.50543
64,-0.35774
65,-0.22801999999999997
66,-0.3644
67,-0.56942
68,-0.81538
69,-0.9968100000000001
70,-1.1834
71,-1.2724
72,-1.2925
73,-1.2775
74,-1.1906
75,-1.1807
76,-1.0235
77,-0.84631
78,-0.57715
79,-0.41389
