time,value
0,-0.047179
1,0.017336
2,0.054035
3,0.069245
4,0.069245
5,0.069245
6,0.069245
7,0.069245
8,0.069245
9,0.069245
10,0.069245
11,0.069245
12,0.069245
13,0.069245
14,0.069245
15,0.069245
16,0.069245
17,0.069245
18,0.069245
19,0.069245
20,0.069245
21,0.069245
22,0.069245
23,0.070966
24,0.090061
25,0.10682
26,0.10372999999999999
27,0.072861
28,0.07007999999999999
29,0.043306
30,0.0045976
31,-0.036797
32,-0.0045396
33,0.027718
34,0.065532
35,0.11577
36,0.18650999999999998
37,0.27354
38,0.36277
39,0.43118
40,0.46399999999999997
41,0.47673000000000004
42,0.47673000000000004
43,0.47673000000000004
44,0.47673000000000004
45,0.47673000000000004
46,0.47673000000000004
47,0.47673000000000004
48,0.47673000000000004
49,0.45028999999999997
50,0.3989
51,0.36701
52,0.35606
53,0.3388
54,0.30906
55,0.3035
56,0.31386
57,0.33813000000000004
58,0.37661999999999995
59,0.44113
60,0.54245
61,0.65818
62,0.77187
63,0.86864
64,0.96541
65,1.0542
66,1.1254
67,1.1618
68,1.1776
69,1.189
70,1.2212
71,1.2766
72,1.3218
73,1.3499
74,1.3499
75,1.3499
76,1.3239
77,1.2695
78,1.1915
79,1.0978
80,1.001
81,0.9076200000000001
82,0.8347600000000001
83,0.78914
84,0.7687
85,0.77372
86,0.80598
87,0.8206899999999999
88,0.826
89,0.82583
90,0.8228700000000001
91,0.7763100000000001
92,0.72002
93,0.67797
94,0.61012
95,0.5028
96,0.39553
97,0.33100999999999997
98,0.22334
99,0.12299000000000002
100,0.045042
101,0.012414
102,-0.049774
103,-0.10172
104,-0.13960999999999998
105,-0.16111
106,-0.1636
107,-0.1464
108,-0.11828
109,-0.10715999999999999
110,-0.12255
111,-0.16471
112,-0.22923000000000002
113,-0.29374
114,-0.42396999999999996
115,-0.57447
116,-0.72014
117,-0.78465
118,-0.82578
119,-0.8588100000000001
120,-0.89161
121,-0.93295
122,-0.9908
123,-1.0442
124,-1.079
125,-1.1502
126,-1.2271
127,-1.2915
128,-1.3238
129,-1.3559999999999999
130,-1.3883
131,-1.4228
132,-1.463
133,-1.5258
134,-1.5903
135,-1.6505
136,-1.6967
137,-1.7305
138,-1.7628
139,-1.7895
140,-1.7930000000000001
141,-1.7935
142,-1.7969
143,-1.8076
144,-1.8399
145,-1.8495
146,-1.8517
147,-1.8531
148,-1.8657
149,-1.9177
150,-1.9709
151,-2.0075
152,-2.0397
153,-2.0679
154,-2.0846
155,-2.084
156,-2.0569
157,-2.0155
158,-1.9602
159,-1.8905
160,-1.7943
161,-1.7142
162,-1.6544
163,-1.621
164,-1.6276
165,-1.6693
166,-1.7276
167,-1.7662
168,-1.7723
169,-1.749
170,-1.6879
171,-1.5588
172,-1.4298
173,-1.3008
174,-1.1728
175,-1.0508
176,-0.9752299999999999
177,-0.92212
178,-0.8817299999999999
179,-0.83557
180,-0.7753800000000001
181,-0.71087
182,-0.64635
183,-0.5818399999999999
184,-0.51732
185,-0.45191000000000003
186,-0.38421
187,-0.28744000000000003
188,-0.19067
189,-0.089669
190,0.019895
191,0.15041
192,0.30061
193,0.45523
194,0.59335
195,0.7114199999999999
196,0.81405
197,0.88421
198,0.88421
199,0.86392
200,0.83601
201,0.8039
202,0.7723899999999999
203,0.76779
204,0.77896
205,0.80087
206,0.82201
207,0.82615
208,0.8412
209,0.87844
210,0.9537100000000001
211,1.0374
212,1.1145
213,1.1767
214,1.2093
215,1.272
216,1.3509
217,1.4369999999999998
218,1.5016
219,1.5661
220,1.6169
221,1.6407
222,1.6130000000000002
223,1.5409
224,1.4531
225,1.3871
226,1.3037
227,1.2226
228,1.1552
229,1.123
230,1.2269
231,1.5542
232,2.1055
233,2.8725
234,3.701
235,3.6307
236,2.7009
237,1.8289
238,1.1908
239,0.78892
240,0.60937
241,0.53225
242,0.4789
243,0.4539
244,0.46746000000000004
245,0.59649
246,0.7046899999999999
247,0.77684
248,0.80001
249,0.73438
250,0.58092
251,0.36839
252,0.11886
253,-0.088403
254,-0.25018
255,-0.35604
256,-0.38829
257,-0.3685
258,-0.33018000000000003
259,-0.27743
260,-0.21291999999999997
261,-0.1484
262,-0.098884
263,-0.06238099999999999
264,-0.030123
265,-0.0065018
266,-0.012326
267,-0.044583
268,-0.07684099999999999
269,-0.096485
270,-0.10749
271,-0.1154
272,-0.14765999999999999
273,-0.1599
274,-0.1636
275,-0.1636
276,-0.1636
277,-0.1636
278,-0.1636
279,-0.16415
280,-0.17843
281,-0.20282
282,-0.22180999999999998
283,-0.22180999999999998
284,-0.22180999999999998
285,-0.22180999999999998
286,-0.22180999999999998
287,-0.22180999999999998
288,-0.22180999999999998
289,-0.2364
290,-0.2626
291,-0.29486
292,-0.32509
293,-0.33824
294,-0.33319
295,-0.30964
296,-0.26761
297,-0.21254
298,-0.14803
299,-0.08351499999999999
300,-0.056886
301,-0.047179
302,-0.047322
303,-0.048434
304,-0.073875
305,-0.11585999999999999
306,-0.16942000000000002
307,-0.21094000000000002
308,-0.22221999999999997
309,-0.23515999999999998
310,-0.26554
311,-0.25405
312,-0.22812
313,-0.19585999999999998
314,-0.1636
