time,value
0,1.2512
1,1.1732
2,1.0283
3,0.87508
4,0.89007
5,0.7422
6,0.6862
7,0.77412
8,0.72952
9,0.61954
10,0.71888
11,0.61228
12,0.58596
13,0.63827
14,0.5163800000000001
15,0.5152100000000001
16,0.43282
17,0.33532
18,0.43341999999999997
19,0.33794
20,0.21397
21,0.1553
22,0.20915999999999998
23,0.011063
24,-0.036315
25,-0.051113
26,-0.21186
27,-0.36209
28,-0.49927
29,-0.6925100000000001
30,-0.74574
31,-0.61792
32,-0.73754
33,-0.9027200000000001
34,-1.0483
35,-1.2383
36,-1.3392
37,-1.3692
38,-1.4546
39,-1.5614
40,-1.6834
41,-1.7556
42,-1.7262
43,-1.531
44,-1.3101
45,-1.1148
46,-0.9194700000000001
47,-0.72937
48,-0.5071
49,-0.32028
50,-0.13539
51,0.051811
52,0.273
53,0.46328
54,0.6563399999999999
55,0.8532299999999999
56,1.0858
57,1.2894
58,1.4917
59,1.6952
60,1.9267
61,2.1267
62,2.1276
63,1.9582
64,1.7056
65,1.4875
66,1.2774
67,1.0735
68,0.8356899999999999
69,0.63275
70,0.43341999999999997
71,0.23854
72,0.014309
73,-0.1761
74,-0.36677
75,-0.55672
76,-0.7807
77,-0.97534
78,-1.1699
79,-1.3642
80,-1.5885
81,-1.7806
82,-1.8468
83,-1.7890000000000001
84,-1.7523
85,-1.6663
86,-1.5852
87,-1.46
88,-1.3219999999999998
89,-1.2053
90,-1.195
91,-1.0483
92,-0.8922
93,-0.86264
94,-0.99295
95,-0.8152699999999999
96,-0.62765
97,-0.46474
98,-0.51144
99,-0.41648999999999997
100,-0.19328
101,-0.008830500000000002
102,0.084522
103,0.027427999999999998
104,0.011747
105,0.17820999999999998
106,0.28148
107,0.27064
108,0.39118
109,0.35685
110,0.38023
111,0.5234
112,0.47618
113,0.45077
114,0.58022
115,0.73159
116,0.72952
117,0.71015
118,0.8551
119,0.8645700000000001
120,0.7803899999999999
121,0.86177
122,0.99661
123,0.93834
124,0.9530799999999999
125,1.0733
126,1.1084
127,1.2164
