time,value
0,2.0569
1,1.8929
2,1.6818
3,1.4743
4,1.3213
5,1.1761
6,1.0395
7,0.9056700000000001
8,0.82744
9,0.7156899999999999
10,0.6152
11,0.51158
12,0.38605
13,0.3222
14,0.20477
15,0.099713
16,-0.019538
17,-0.12913
18,-0.22821999999999998
19,-0.31592
20,-0.42718
21,-0.52936
22,-0.5898100000000001
23,-0.6736
24,-0.74597
25,-0.80614
26,-0.89886
27,-0.93394
28,-1.0028
29,-1.0102
30,-1.0524
31,-1.0809
32,-1.0952
33,-1.1455
34,-1.1309
35,-1.102
36,-1.12
37,-1.0661
38,-1.0462
39,-1.0115
40,-0.96257
41,-0.9420299999999999
42,-0.82496
43,-0.73798
44,-0.67633
45,-0.6005
46,-0.51144
47,-0.43883
48,-0.32403000000000004
49,-0.22271999999999997
50,-0.13215
51,0.01126
52,0.14494
53,0.28946
54,0.4318
55,0.53814
56,0.50613
57,0.6937399999999999
58,0.88907
59,1.0854
60,1.2826
61,1.4780000000000002
62,1.6757
63,1.876
64,2.0263
65,2.0297
66,1.8283
67,1.6242
68,1.4218
69,1.2205
70,1.0211
71,0.82155
72,0.6227600000000001
73,0.4658
74,0.31471
75,0.2238
76,0.093392
77,-0.025075
78,-0.15332
79,-0.29905
80,-0.42755
81,-0.5575600000000001
82,-0.6732
83,-0.7992199999999999
84,-0.8846
85,-0.98325
86,-1.0675
87,-1.0984
88,-1.1875
89,-1.2212
90,-1.2806
91,-1.2787
92,-1.2884
93,-1.3024
94,-1.3494
95,-1.3312
96,-1.2966
97,-1.2966
98,-1.2311
99,-1.2009999999999998
100,-1.1078
101,-1.0028
102,-0.8871100000000001
103,-0.80777
104,-0.7620100000000001
105,-0.6177600000000001
106,-0.57877
107,-0.50251
108,-0.37701999999999997
109,-0.28191
110,-0.17767
111,-0.09845
112,0.023511
113,0.15242
114,0.25949
115,0.37572
116,0.50039
117,0.6107199999999999
118,0.75197
119,0.86366
120,0.9088299999999999
121,1.0712
122,1.1769
123,1.3384
124,1.5069
125,1.6891
126,1.8811
127,2.0122
