time,value
0,2.4043
1,2.3547
2,2.1272
3,1.7414
4,1.2335
5,0.6514800000000001
6,0.053972000000000006
7,-0.50713
8,-0.98769
9,-1.3528
10,-1.5879
11,-1.6832
12,-1.6389
13,-1.4685
14,-1.1943
15,-0.84767
16,-0.46691000000000005
17,-0.098462
18,0.21436999999999998
19,0.44215
20,0.56772
21,0.59455
22,0.54008
23,0.43918999999999997
24,0.32361999999999996
25,0.21523
26,0.13467
27,0.080583
28,0.051737
29,0.040857
30,0.038778
31,0.042461
32,0.052176
33,0.073022
34,0.10440999999999999
35,0.14926
36,0.20251
37,0.25092
38,0.28358
39,0.28924
40,0.25715
41,0.18502000000000002
42,0.07142899999999999
43,-0.082312
44,-0.26361999999999997
45,-0.45431000000000005
46,-0.63908
47,-0.7893100000000001
48,-0.87849
49,-0.8846700000000001
50,-0.79496
51,-0.59951
52,-0.3114
53,0.038415
54,0.4152
55,0.77294
56,1.062
57,1.2449
58,1.2967
59,1.2023
60,0.9695600000000001
61,0.62237
62,0.19328
63,-0.2738
64,-0.73288
65,-1.1328
66,-1.4313
67,-1.5868
68,-1.5785
69,-1.3994
70,-1.0628
71,-0.60619
72,-0.079263
73,0.45887
74,0.9489299999999999
75,1.3306
76,1.5691
77,1.6478
78,1.5673
79,1.3472
80,1.0172
81,0.61529
82,0.17803
83,-0.25301999999999997
84,-0.64541
85,-0.9777899999999999
86,-1.2243
87,-1.3711
88,-1.4139
89,-1.3491
90,-1.1826
91,-0.92776
92,-0.59887
93,-0.21661999999999998
94,0.19232
95,0.5977
96,0.9648200000000001
97,1.2584
98,1.4394
99,1.4834
100,1.3707
101,1.101
102,0.6983699999999999
103,0.20282999999999998
104,-0.33166
105,-0.8462200000000001
106,-1.2761
107,-1.5751
108,-1.7052
109,-1.6518
110,-1.4264
111,-1.0452
112,-0.54856
113,0.011681
114,0.57877
115,1.0953
116,1.5126
117,1.7853
118,1.8918
119,1.8256
120,1.5941
121,1.2256
122,0.7578
123,0.23259000000000002
124,-0.31221
125,-0.83105
126,-1.285
127,-1.645
128,-1.8827
129,-1.9822
130,-1.9358
131,-1.7407
132,-1.4118
133,-0.9737399999999999
134,-0.46138999999999997
135,0.08533500000000001
136,0.6239600000000001
137,1.1066
138,1.4984
139,1.7643
140,1.8816
141,1.8434
142,1.6528
143,1.3364
144,0.93343
145,0.49022
146,0.052830999999999996
147,-0.33236
148,-0.63661
149,-0.85041
150,-0.9808399999999999
151,-1.0399
152,-1.0454
153,-1.0178
154,-0.9661
155,-0.8961
156,-0.80783
157,-0.70385
158,-0.58419
159,-0.45298
160,-0.31034
161,-0.15388
162,0.025954
163,0.23984
164,0.48801000000000005
165,0.76847
166,1.056
167,1.3134
168,1.4946
169,1.5599
170,1.4852
171,1.2687
172,0.93063
173,0.5131399999999999
174,0.062235000000000006
175,-0.37761
176,-0.77336
177,-1.1019
178,-1.3485
179,-1.5087
180,-1.5771
181,-1.5459
182,-1.4076
183,-1.1644
184,-0.83339
185,-0.44403000000000004
186,-0.038988
187,0.33131
188,0.6193
189,0.80483
190,0.8858
191,0.8839799999999999
192,0.83388
193,0.7662399999999999
194,0.7065600000000001
195,0.66625
196,0.63888
197,0.6071300000000001
198,0.55287
199,0.46346000000000004
200,0.33587
201,0.18044000000000002
202,0.011941
203,-0.15385
204,-0.3088
205,-0.45908999999999994
206,-0.60927
207,-0.77117
208,-0.9438799999999999
209,-1.1194
210,-1.2698
211,-1.3562
212,-1.3464
213,-1.2105
214,-0.93485
215,-0.53072
216,-0.028168000000000002
217,0.52656
218,1.081
219,1.5816
220,1.9794
221,2.242
222,2.3389
223,2.2559
224,1.9892
225,1.5518
226,0.9666399999999999
227,0.27148
228,-0.47991000000000006
229,-1.2264
230,-1.8989
231,-2.4331
232,-2.782
233,-2.9105
234,-2.8041
235,-2.4718
236,-1.9412
237,-1.2588
238,-0.47689
239,0.33595
240,1.1115
241,1.7861
242,2.2962
243,2.6004
244,2.6769
245,2.5306
246,2.1849
247,1.6892
248,1.0981
249,0.46851000000000004
250,-0.14547000000000002
251,-0.69867
252,-1.1591
253,-1.5037
254,-1.7157
255,-1.7853
256,-1.7119
257,-1.5073
258,-1.1913
259,-0.79304
260,-0.35932
261,0.063792
262,0.4331
263,0.71365
264,0.88315
265,0.9386700000000001
266,0.88715
267,0.74687
268,0.54088
269,0.29593
270,0.0368
271,-0.2099
272,-0.41828999999999994
273,-0.56048
274,-0.61971
275,-0.58312
276,-0.45452
277,-0.24691999999999997
278,0.0097819
279,0.27676
280,0.52061
281,0.70716
282,0.81894
283,0.84305
284,0.77805
285,0.63443
286,0.41963999999999996
287,0.15591
288,-0.13844
289,-0.43662
290,-0.71387
291,-0.94326
292,-1.0969
293,-1.1586
294,-1.1105
295,-0.9508200000000001
296,-0.69447
297,-0.37022
298,-0.01015
299,0.34265
300,0.65564
301,0.90335
302,1.0622
303,1.1226
304,1.0837
305,0.9478
306,0.73002
307,0.44888
308,0.13195
309,-0.19857
310,-0.50732
311,-0.7642399999999999
312,-0.9414899999999999
313,-1.0190000000000001
314,-0.98951
315,-0.85811
316,-0.64717
317,-0.38848
318,-0.11382
319,0.14438
320,0.3623
321,0.52937
322,0.63641
323,0.68574
324,0.67937
325,0.62327
326,0.5157
327,0.36271
328,0.17625
329,-0.026806
330,-0.22339
331,-0.3885
332,-0.49915
333,-0.54097
334,-0.50898
335,-0.41543
336,-0.27874
337,-0.12319000000000001
338,0.030869999999999998
339,0.16697
340,0.26927
341,0.33294
342,0.34767
343,0.31346
344,0.23146
345,0.10298
346,-0.064485
347,-0.24958000000000002
348,-0.43233
349,-0.57989
350,-0.66775
351,-0.67365
352,-0.59329
353,-0.42715
354,-0.19368
355,0.08490299999999999
356,0.38066
357,0.66163
358,0.9044200000000001
359,1.0856
360,1.1766
361,1.1652
362,1.0387
363,0.80381
364,0.46776
365,0.063716
366,-0.37713
367,-0.80456
368,-1.1758
369,-1.4519
370,-1.6032
371,-1.615
372,-1.4885
373,-1.2333
374,-0.87982
375,-0.46203999999999995
376,-0.027596
377,0.3889
378,0.74933
379,1.0331
380,1.2262
381,1.3249
382,1.3401
383,1.2832
384,1.1658
385,0.9999899999999999
386,0.78533
387,0.5333
388,0.24444000000000002
389,-0.065613
390,-0.37729
391,-0.65793
392,-0.88461
393,-1.0401
394,-1.1101
395,-1.0978
396,-1.02
397,-0.8941899999999999
398,-0.74106
399,-0.5768
400,-0.40801
401,-0.23558
402,-0.06790700000000001
403,0.098432
404,0.25667
405,0.39782
406,0.5159100000000001
407,0.6036
408,0.6590199999999999
409,0.68219
410,0.68558
411,0.66833
412,0.63176
413,0.5759
414,0.49745
415,0.38838
416,0.24320999999999998
417,0.060259
418,-0.15434
419,-0.39107
420,-0.62863
421,-0.8454200000000001
422,-1.0168
423,-1.1122
424,-1.1118
425,-1.0079
426,-0.7994600000000001
427,-0.50144
428,-0.14376
429,0.22871999999999998
430,0.578
431,0.86734
432,1.0711
433,1.1749
434,1.1840000000000002
435,1.1068
436,0.95483
437,0.74357
438,0.48468999999999995
439,0.1846
440,-0.13783
441,-0.45833999999999997
442,-0.75036
443,-0.9785299999999999
444,-1.1107
445,-1.13
446,-1.0390000000000001
447,-0.84983
448,-0.59875
449,-0.32193
450,-0.057646
451,0.16639
452,0.33363000000000004
453,0.4391
454,0.47834
455,0.45619
456,0.37378
457,0.24006
458,0.067996
459,-0.11829
460,-0.29219
461,-0.41525
462,-0.45287
463,-0.38437
464,-0.21119000000000002
465,0.053972000000000006
466,0.37049
467,0.69995
468,0.9849600000000001
469,1.1913
470,1.2934
471,1.2771
472,1.1422
473,0.89356
474,0.54081
475,0.10762999999999999
476,-0.37327
477,-0.85951
478,-1.3046
479,-1.6538
480,-1.8633
481,-1.9031
482,-1.7619999999999998
483,-1.4593
484,-1.0373
485,-0.55724
486,-0.077586
487,0.34906
488,0.6824
489,0.9057200000000001
490,1.0197
491,1.0374
492,0.9708
493,0.84749
494,0.69029
495,0.52037
496,0.35636999999999996
497,0.21746
498,0.1169
499,0.062461
