time,value
0,-1.3468
1,-1.3468
2,-1.3468
3,-1.3468
4,-1.3468
5,-1.3468
6,-1.3468
7,-1.3468
8,-1.3468
9,-1.3468
10,-1.3468
11,-1.3468
12,-1.3468
13,-1.3468
14,-1.3468
15,-1.3468
16,-1.3468
17,-1.3468
18,-1.3468
19,-1.3468
20,-1.3468
21,-1.3468
22,-1.3468
23,-1.3468
24,-1.3468
25,-1.3468
26,-1.3468
27,-1.3468
28,-1.3468
29,-1.3468
30,-1.3468
31,-1.3468
32,-1.3468
33,-1.3468
34,-1.3468
35,-1.3468
36,-1.3468
37,-1.3468
38,-1.3468
39,-1.3468
40,-1.3468
41,-1.3468
42,-1.3468
43,-1.3468
44,-1.3468
45,-1.3468
46,-1.3468
47,-1.3468
48,-1.3468
49,-1.3468
50,-1.3468
51,-1.3468
52,-1.3468
53,-1.3468
54,-1.3468
55,-1.3468
56,-1.3468
57,-1.3468
58,-1.3188
59,-1.2635
60,-1.2083
61,-1.1531
62,-1.101
63,-1.0826
64,-1.0642
65,-1.0458
66,-1.0274
67,-0.92371
68,-0.77647
69,-0.6292300000000001
70,-0.48200000000000004
71,-0.36561
72,-0.3472
73,-0.3288
74,-0.31039
75,-0.29199
76,-0.28862
77,-0.28862
78,-0.28862
79,-0.28862
80,-0.28136
81,-0.26295
82,-0.24455
83,-0.22614
84,-0.20774
85,-0.20722
86,-0.20722
87,-0.20722
88,-0.20722
89,-0.17689000000000002
90,-0.12168
91,-0.066464
92,-0.01125
93,0.053296
94,0.18213
95,0.31096
96,0.43978999999999996
97,0.56863
98,0.63266
99,0.66946
100,0.70627
101,0.74308
102,0.7591600000000001
103,0.72235
104,0.6855399999999999
105,0.64873
106,0.61192
107,0.59092
108,0.57252
109,0.55411
110,0.53571
111,0.5414100000000001
112,0.57822
113,0.61503
114,0.65184
115,0.69202
116,0.96809
117,1.2442
118,1.5202
119,1.7963
120,1.9308
121,1.9676
122,2.0045
123,2.0413
124,2.0781
125,2.1149
126,2.1517
127,2.1885
128,2.2253
129,2.2484
130,2.2668
131,2.2852
132,2.3036
133,2.2982
134,2.2429
135,2.1877
136,2.1325
137,2.0773
138,1.9723
139,1.8619
140,1.7515
141,1.641
142,1.5394
143,1.4474
144,1.3554
145,1.2633
146,1.1713
147,1.0793
148,0.9872700000000001
149,0.89525
150,0.8032199999999999
151,0.7461899999999999
152,0.70939
153,0.6725800000000001
154,0.63577
155,0.61451
156,0.65132
157,0.68813
158,0.7249399999999999
159,0.76175
160,0.81307
161,0.86829
162,0.9235
163,0.97872
164,1.0205
165,1.0389
166,1.0573
167,1.0757
168,1.0941
169,1.1125
170,1.1309
171,1.1493
172,1.1677
173,1.1381
174,1.0645
175,0.9909
176,0.9172799999999999
177,0.8436600000000001
178,0.77004
179,0.6964199999999999
180,0.6228100000000001
181,0.54919
182,0.5129
183,0.49449
184,0.47608999999999996
185,0.45768000000000003
186,0.44393999999999995
187,0.44393999999999995
188,0.44393999999999995
189,0.44393999999999995
190,0.44393999999999995
191,0.41335
192,0.37654
193,0.33974
194,0.30293000000000003
195,0.27363000000000004
196,0.25523
197,0.23681999999999997
198,0.21841999999999998
199,0.20002
200,0.23605
201,0.27286
202,0.30967
203,0.34648
204,0.39365
205,0.44887
206,0.50408
207,0.5593
208,0.59636
209,0.52275
210,0.44913000000000003
211,0.37551
212,0.30189
213,0.17539000000000002
214,0.028151
215,-0.11909000000000002
216,-0.26632
217,-0.39723
218,-0.48925
219,-0.58128
220,-0.6733
221,-0.7653300000000001
222,-0.79306
223,-0.81147
224,-0.8298700000000001
225,-0.8482799999999999
226,-0.85839
227,-0.85839
228,-0.85839
229,-0.85839
230,-0.8589
231,-0.87731
232,-0.89571
233,-0.91412
234,-0.9325200000000001
235,-0.9509299999999999
236,-0.9693299999999999
237,-0.98774
238,-1.0061
239,-1.0178
240,-0.9994
241,-0.981
242,-0.96259
243,-0.94419
244,-0.89779
245,-0.84257
246,-0.7873600000000001
247,-0.73214
248,-0.68315
249,-0.6463399999999999
250,-0.60953
251,-0.57272
252,-0.53591
253,-0.54965
254,-0.56806
255,-0.58646
256,-0.60487
257,-0.59605
258,-0.55924
259,-0.5224300000000001
260,-0.48563
261,-0.44622
262,-0.3726
263,-0.29899000000000003
264,-0.22537
265,-0.15175
266,-0.10198
267,-0.06516799999999999
268,-0.028359
269,0.0084506
270,0.041113
271,0.059516999999999994
272,0.077922
273,0.096327
274,0.11473
275,0.13314
276,0.15154
277,0.16995
278,0.18835
279,0.19976
280,0.19976
281,0.19976
282,0.19976
283,0.19976
284,0.19976
285,0.19976
286,0.19976
287,0.19976
288,0.20961
289,0.22801
290,0.24641999999999997
291,0.26482
292,0.28323000000000004
293,0.30163
294,0.32003000000000004
295,0.33844
296,0.35684
297,0.38795
298,0.42476
299,0.46157
300,0.49838000000000005
301,0.5351899999999999
302,0.5720000000000001
303,0.6088100000000001
304,0.64562
305,0.68243
306,0.71924
307,0.7560399999999999
308,0.79285
309,0.8296600000000001
310,0.8509200000000001
311,0.8509200000000001
312,0.8509200000000001
313,0.8509200000000001
314,0.8509200000000001
