time,value
0,1.4768
1,1.4768
2,1.4768
3,1.4768
4,1.4768
5,1.4768
6,1.4768
7,1.4768
8,1.4768
9,1.4768
10,1.4768
11,1.4768
12,1.4768
13,1.4768
14,1.4768
15,1.4768
16,1.4768
17,1.4768
18,1.4768
19,1.4768
20,1.4768
21,1.4768
22,1.4768
23,1.4768
24,1.4768
25,1.4768
26,1.4768
27,1.4768
28,1.4768
29,1.4768
30,1.4768
31,1.4768
32,1.4768
33,1.4768
34,1.4768
35,1.4768
36,1.4768
37,1.4635
38,1.4501
39,1.4071
40,1.364
41,1.3172
42,1.2703
43,1.2186
44,1.1669
45,1.1202
46,1.0734
47,1.0304
48,0.98731
49,0.95635
50,0.92538
51,0.89954
52,0.87371
53,0.8622200000000001
54,0.8507399999999999
55,0.8421299999999999
56,0.8335100000000001
57,0.8166
58,0.7996800000000001
59,0.77999
60,0.76031
61,0.71724
62,0.67418
63,0.62917
64,0.58416
65,0.5324800000000001
66,0.48081
67,0.42298
68,0.36515
69,0.29625
70,0.22735
71,0.15845
72,0.08955
73,0.020649
74,-0.048251999999999996
75,-0.11182
76,-0.17539000000000002
77,-0.23568000000000003
78,-0.29596999999999996
79,-0.34334000000000003
80,-0.39071
81,-0.43377
82,-0.47683000000000003
83,-0.50472
84,-0.53261
85,-0.55834
86,-0.58408
87,-0.6013
88,-0.61853
89,-0.63575
90,-0.65298
91,-0.6702100000000001
92,-0.68743
93,-0.7046600000000001
94,-0.72188
95,-0.73911
96,-0.7563300000000001
97,-0.77704
98,-0.79775
99,-0.8235899999999999
100,-0.8494299999999999
101,-0.87065
102,-0.8918799999999999
103,-0.9091
104,-0.9263299999999999
105,-0.93781
106,-0.94929
107,-0.95791
108,-0.96652
109,-0.98887
110,-1.0112
111,-1.0371
112,-1.0629
113,-1.0727
114,-1.0826
115,-1.0917
116,-1.1008
117,-1.1181
118,-1.1353
119,-1.1509
120,-1.1665
121,-1.1751
122,-1.1837
123,-1.1923
124,-1.2009
125,-1.2095
126,-1.2181
127,-1.2267
128,-1.2354
129,-1.244
130,-1.2526
131,-1.2612
132,-1.2698
133,-1.2784
134,-1.287
135,-1.2956
136,-1.3043
137,-1.3129
138,-1.3215
139,-1.3301
140,-1.3387
141,-1.3473
142,-1.3559
143,-1.3645
144,-1.3732
145,-1.3808
146,-1.3885
147,-1.3885
148,-1.3885
149,-1.3885
150,-1.3885
151,-1.3885
152,-1.3885
153,-1.3854
154,-1.3822
155,-1.3736
156,-1.365
157,-1.3606
158,-1.3563
159,-1.3563
160,-1.3563
161,-1.3509
162,-1.3455
163,-1.3369
164,-1.3282
165,-1.3262
166,-1.3241
167,-1.3241
168,-1.3241
169,-1.3165
170,-1.3088
171,-1.3
172,-1.2911
173,-1.2739
174,-1.2567
175,-1.2395
176,-1.2222
177,-1.205
178,-1.1878
179,-1.1706
180,-1.1533
181,-1.1361
182,-1.1189
183,-1.1052
184,-1.0916
185,-1.083
186,-1.0744
187,-1.0658
188,-1.0572
189,-1.0485
190,-1.0399
191,-1.0255
192,-1.011
193,-0.99379
194,-0.97657
195,-0.95237
196,-0.92817
197,-0.9023399999999999
198,-0.8765
199,-0.8344600000000001
200,-0.79242
201,-0.74874
202,-0.70507
203,-0.6533899999999999
204,-0.6017100000000001
205,-0.5483
206,-0.49488000000000004
207,-0.43459
208,-0.3743
209,-0.32263000000000003
210,-0.27095
211,-0.2365
212,-0.20205
213,-0.17959
214,-0.15714
215,-0.14853
216,-0.13990999999999998
217,-0.1313
218,-0.12269000000000001
219,-0.11408
220,-0.10545999999999998
221,-0.090597
222,-0.07572999999999999
223,-0.058504999999999995
224,-0.041280000000000004
225,-0.0019081
226,0.037464
227,0.080527
228,0.12359
229,0.21771
230,0.31184
231,0.3994
232,0.48696000000000006
233,0.52141
234,0.55586
235,0.59031
236,0.62476
237,0.6592100000000001
238,0.69366
239,0.72155
240,0.74944
241,0.76666
242,0.78389
243,0.80111
244,0.81834
245,0.83557
246,0.8527899999999999
247,0.8644799999999999
248,0.8761700000000001
249,0.8847799999999999
250,0.89339
251,0.8953399999999999
252,0.8972899999999999
253,0.8972899999999999
254,0.8972899999999999
255,0.9050799999999999
256,0.9128700000000001
257,0.9221
258,0.9313299999999999
259,0.9571700000000001
260,0.98301
261,1.006
262,1.0289
263,1.0376
264,1.0462
265,1.0522
266,1.0583
267,1.0583
268,1.0583
269,1.0583
270,1.0583
271,1.0583
272,1.0583
273,1.0438
274,1.0293
275,1.0035
276,0.97767
277,0.9518399999999999
278,0.9259999999999999
279,0.9001600000000001
280,0.8743200000000001
281,0.84141
282,0.8085
283,0.77405
284,0.7396
285,0.71335
286,0.6871
287,0.6612600000000001
288,0.63542
289,0.60959
290,0.58375
291,0.55607
292,0.5283800000000001
293,0.49393000000000004
294,0.45948
295,0.42503
296,0.39058000000000004
297,0.35613
298,0.32168
299,0.28313
300,0.24458000000000002
301,0.20151
302,0.15845
303,0.12062
304,0.08278300000000001
305,0.048332
306,0.013881999999999999
307,-0.014212
308,-0.042305
309,-0.068143
310,-0.093981
311,-0.11982000000000001
312,-0.14565999999999998
313,-0.17149
314,-0.19733
