time,value
0,0.60653
1,0.62571
2,0.6330399999999999
3,0.62139
4,0.60973
5,0.5683600000000001
6,0.61511
7,0.62784
8,0.61174
9,0.5617300000000001
10,0.5976199999999999
11,0.63602
12,0.65279
13,0.5959
14,0.66719
15,0.62529
16,0.59222
17,0.61863
18,0.63375
19,0.63352
20,0.61728
21,0.60104
22,0.61073
23,0.6313300000000001
24,0.6519199999999999
25,0.65527
26,0.6008
27,0.60083
28,0.58305
29,0.63802
30,0.6400600000000001
31,0.58849
32,0.59515
33,0.65284
34,0.63752
35,0.60446
36,0.60445
37,0.60518
38,0.68358
39,0.67411
40,0.62215
41,0.59134
42,0.6294
43,0.62041
44,0.5686399999999999
45,0.61698
46,0.6297699999999999
47,0.6059399999999999
48,0.6114
49,0.6202300000000001
50,0.62905
51,0.63267
52,0.69296
53,0.56316
54,0.65572
55,0.58907
56,0.63579
57,0.62184
58,0.62651
59,0.60175
60,0.61364
61,0.62554
62,0.63376
63,0.67184
64,0.63268
65,0.5935199999999999
66,0.58939
67,0.64755
68,0.67683
69,0.68582
70,0.64723
71,0.60865
72,0.6623
73,0.61664
74,0.6560600000000001
75,0.63912
76,0.5925600000000001
77,0.6531100000000001
78,0.59237
79,0.6133
80,0.65122
81,0.61928
82,0.66179
83,0.61871
84,0.6557
85,0.64546
86,0.65065
87,0.6764
88,0.6580199999999999
89,0.67828
90,0.88295
91,1.0876
92,2.2612
93,3.4829
94,3.7747
95,3.7746
96,3.1625
97,0.98105
98,-1.1714
99,-1.7772
100,-1.8352
101,-1.8602
102,-1.8518
103,-1.9034
104,-1.8825
105,-1.8615
106,-1.7661
107,-1.8234
108,-1.9179
109,-1.835
110,-1.785
111,-1.8435
112,-1.7685
113,-1.7623
114,-1.8409
115,-1.8206
116,-1.7976
117,-1.7547
118,-1.7711
119,-1.714
120,-1.775
121,-1.7665
122,-1.6796
123,-1.7009
124,-1.6431
125,-1.6288
126,-1.6802
127,-1.6394
128,-1.6593
129,-1.6598
130,-1.6568
131,-1.5871
132,-1.6288
133,-1.5396
134,-1.6044
135,-1.5314
136,-1.4364
137,-1.4703
138,-1.4413
139,-1.4645
140,-1.4275
141,-1.3994
142,-1.4361
143,-1.3448
144,-1.3034
145,-1.3534
146,-1.2708
147,-1.2888
148,-1.2933
149,-1.2231
150,-1.1719
151,-1.159
152,-1.146
153,-1.2002
154,-1.1749
155,-1.0513
156,-1.0203
157,-1.0245
158,-1.0451
159,-1.0315
160,-0.9100799999999999
161,-0.94781
162,-0.8437100000000001
163,-0.8983899999999999
164,-0.88856
165,-0.7510399999999999
166,-0.7430100000000001
167,-0.74842
168,-0.64693
169,-0.66184
170,-0.6327699999999999
171,-0.53825
172,-0.60347
173,-0.57463
174,-0.5128199999999999
175,-0.48503
176,-0.45123
177,-0.37827
178,-0.43782
179,-0.36506
180,-0.31666
181,-0.33202
182,-0.28434
183,-0.27182
184,-0.16846
185,-0.17799
186,-0.15423
187,-0.13945
188,-0.12664
189,-0.10603
190,-0.023133
191,-0.033283999999999994
192,-0.031094999999999998
193,0.009308
194,0.06770599999999999
195,0.065807
196,0.092189
197,0.089383
198,0.105
199,0.14168
200,0.17708
201,0.14945
202,0.12182
203,0.18247
204,0.17985
205,0.19985
206,0.21883000000000002
207,0.249
208,0.26507
209,0.23151999999999998
210,0.30258
211,0.30576
212,0.3204
213,0.33503
214,0.37637
215,0.42426
216,0.38534
217,0.34754
218,0.36667
219,0.41303
220,0.3577
221,0.37219
222,0.45733999999999997
223,0.45143
224,0.44553000000000004
225,0.46223000000000003
226,0.4171
227,0.45896000000000003
228,0.46506000000000003
229,0.49235
230,0.5165
231,0.45883999999999997
232,0.55081
233,0.50355
234,0.45628
235,0.5394
236,0.47076
237,0.45985
238,0.55102
239,0.5364399999999999
240,0.5866100000000001
241,0.51349
242,0.51878
243,0.55152
244,0.52052
245,0.5008100000000001
246,0.52896
247,0.55711
248,0.50131
249,0.64851
250,0.55347
251,0.6098100000000001
252,0.57945
253,0.57919
254,0.5474100000000001
255,0.52965
256,0.60046
257,0.61611
258,0.54581
259,0.5365
260,0.6099100000000001
261,0.5663699999999999
262,0.59683
263,0.5542699999999999
264,0.56243
265,0.57223
266,0.65894
267,0.5575899999999999
268,0.53845
269,0.54657
270,0.55469
271,0.56967
272,0.58465
273,0.63383
274,0.5585899999999999
