time,value
0,-0.0048707
1,1.2563
2,2.6802
3,3.8843
4,4.5272
5,4.44
6,3.6908
7,2.5522
8,1.3885
9,0.51302
10,0.08026900000000001
11,0.052837
12,0.25201999999999997
13,0.45928
14,0.51805
15,0.38961999999999997
16,0.14484
17,-0.093821
18,-0.22405999999999998
19,-0.21236999999999998
20,-0.099994
21,0.030133
22,0.10203999999999999
23,0.08395
24,-0.0038131999999999997
25,-0.10865999999999999
26,-0.17878
27,-0.18945
28,-0.15104
29,-0.09702000000000001
30,-0.062323
31,-0.064577
32,-0.098776
33,-0.14467
34,-0.18105
35,-0.19698
36,-0.19571
37,-0.18959
38,-0.19125999999999999
39,-0.20608
40,-0.23059000000000002
41,-0.25606
42,-0.27473000000000003
43,-0.2829
44,-0.28297
45,-0.28073000000000004
46,-0.28353
47,-0.28975
48,-0.29722
49,-0.30505
50,-0.31275
51,-0.3187
52,-0.32226
53,-0.32486
54,-0.32834
55,-0.33333
56,-0.33923000000000003
57,-0.34578000000000003
58,-0.35291999999999996
59,-0.36091
60,-0.36983
61,-0.38038
62,-0.39265
63,-0.4056
64,-0.41639
65,-0.42258
66,-0.42246000000000006
67,-0.41641000000000006
68,-0.40533
69,-0.39246
70,-0.38168
71,-0.37675
72,-0.37889
73,-0.38789
74,-0.40189
75,-0.41828000000000004
76,-0.43356999999999996
77,-0.44548000000000004
78,-0.45352
79,-0.45908000000000004
80,-0.46401000000000003
81,-0.47018999999999994
82,-0.47863999999999995
83,-0.48895
84,-0.49901
85,-0.5062800000000001
86,-0.50964
87,-0.5102399999999999
88,-0.51105
89,-0.51541
90,-0.52557
91,-0.5408
92,-0.55708
93,-0.5682
94,-0.56935
95,-0.5596899999999999
96,-0.54346
97,-0.5280600000000001
98,-0.5213399999999999
