time,value
0,0.12255
1,-0.034192
2,0.16151
3,-0.52717
4,-0.11109000000000001
5,-0.26169000000000003
6,-0.13430999999999998
7,-0.0033732
8,-0.24256
9,0.18206
10,-0.10184
11,0.082254
12,0.022872999999999998
13,0.007557300000000001
14,-0.19141
15,0.019316999999999997
16,0.016812
17,0.066912
18,-0.021188
19,0.36817
20,0.13138
21,-0.32225
22,0.45808000000000004
23,1.4567
24,1.4567
25,1.4567
26,1.4567
27,1.4567
28,1.4567
29,1.4567
30,1.4567
31,1.4567
32,1.4567
33,1.4567
34,1.4567
35,1.4567
36,1.4567
37,1.4567
38,1.4567
39,-1.4192
40,-1.4192
41,-1.4192
42,-1.4192
43,-1.4192
44,-1.4192
45,-1.4192
46,-1.4192
47,-1.4192
48,-1.4192
49,-1.4192
50,-1.4192
51,-1.4192
52,-1.4192
53,-1.4192
54,-0.64027
55,-0.6431600000000001
56,0.15447
57,0.30438000000000004
58,-0.057429999999999995
59,0.15865
60,0.25218
61,0.088765
62,-0.11513
63,-0.24327
64,0.35996999999999996
65,0.13576
66,0.16734000000000002
67,-0.0032018
68,-0.022403
69,-0.019691999999999998
70,-0.22149000000000002
71,0.30458
72,0.042176
73,-0.45508999999999994
74,-0.30716
75,-0.10424000000000001
76,-0.34564
77,0.37215
78,0.54867
79,-0.41612
80,-0.22229000000000002
81,0.034957999999999996
82,-0.2201
83,-1.4192
84,-1.4192
85,-1.4192
86,-1.4192
87,-1.4192
88,-1.4192
89,-1.4192
90,-1.4192
91,-1.4192
92,-1.4192
93,-1.4192
94,-1.4192
95,-1.4192
96,-1.4192
97,1.4567
98,1.4567
99,1.4567
100,1.4567
101,1.4567
102,1.4567
103,1.4567
104,1.4567
105,1.4567
106,1.4567
107,1.4567
108,1.4567
109,1.4567
110,1.4567
111,0.19147999999999998
112,0.35197
113,-0.01616
114,0.20310999999999998
115,-0.042276
116,-0.61314
117,-0.074909
118,-0.058404
119,-0.34196
120,-0.025319
121,0.25489
122,0.16485999999999998
123,-0.16097
124,-0.60187
125,0.10907
126,-0.13659000000000002
127,-0.32328
