time,value
0,1.7946
1,1.7946
2,1.7946
3,0.50672
4,-0.4781
5,-0.62961
6,-0.62961
7,-0.62961
8,-0.62961
9,-0.62961
10,-0.62961
11,-0.62961
12,-0.62961
13,-0.62961
14,-0.62961
15,1.4915
16,1.7946
17,1.7946
18,1.4915
19,-0.4781
20,-0.62961
21,-0.62961
22,-0.62961
23,-0.62961
24,-0.62961
25,-0.62961
26,-0.62961
27,-0.62961
28,-0.62961
29,-0.62961
30,2.0976
31,1.7946
32,1.7946
33,0.73398
34,-0.62961
35,-0.62961
36,-0.62961
37,-0.62961
38,-0.62961
39,-0.62961
40,-0.62961
41,-0.62961
42,-0.62961
43,-0.62961
44,0.73398
45,2.0976
46,1.7946
47,1.7946
48,-0.4781
49,-0.62961
50,-0.62961
51,-0.62961
52,-0.62961
53,-0.62961
54,-0.62961
55,-0.62961
56,-0.62961
57,-0.62961
58,-0.62961
59,1.7946
60,1.7946
61,1.7946
62,1.1885
63,-0.62961
64,-0.62961
65,-0.62961
66,-0.62961
67,-0.62961
68,-0.62961
69,-0.62961
70,-0.62961
71,-0.62961
72,-0.62961
73,-0.023568000000000002
74,1.7946
75,2.0976
76,1.4915
77,0.50672
78,-0.55385
79,-0.62961
80,-0.62961
81,-0.62961
82,-0.62961
83,-0.62961
84,-0.62961
85,-0.62961
86,-0.62961
87,-0.62961
88,0.50672
89,2.0976
90,1.7946
91,1.4915
92,-0.17507999999999999
93,-0.62961
94,-0.62961
95,-0.62961
96,-0.62961
97,-0.62961
98,-0.62961
99,-0.62961
100,-0.62961
101,-0.62961
102,-0.17507999999999999
103,2.0976
104,1.7946
105,1.7946
106,0.27945
107,-0.62961
108,-0.62961
109,-0.62961
110,-0.62961
111,-0.62961
112,-0.62961
113,-0.62961
114,-0.62961
115,-0.62961
116,-0.62961
117,0.96125
118,1.7946
119,1.7946
120,1.4915
121,-0.55385
122,-0.62961
123,-0.62961
124,-0.62961
125,-0.62961
126,-0.62961
127,-0.62961
128,-0.62961
129,-0.62961
130,-0.62961
131,-0.62961
132,1.1885
133,1.7946
134,2.0976
135,1.4915
136,-0.4781
137,-0.62961
138,-0.62961
139,-0.62961
140,-0.62961
141,-0.62961
142,-0.62961
143,-0.62961
144,-0.62961
145,-0.62961
146,-0.62961
147,0.96125
148,1.7946
149,1.7946
150,1.7946
151,-0.32659
152,-0.55385
153,-0.62961
154,-0.62961
155,-0.62961
156,-0.62961
157,-0.62961
158,-0.62961
159,-0.62961
160,-0.62961
161,-0.62961
162,0.96125
163,1.7946
164,1.7946
165,1.7946
166,-0.4781
167,-0.62961
168,-0.62961
169,-0.62961
170,-0.62961
171,-0.62961
172,-0.62961
173,-0.62961
174,-0.62961
175,-0.62961
176,-0.62961
177,0.12794
178,1.7946
179,2.0976
180,1.7946
181,-0.023568000000000002
182,-0.62961
183,-0.62961
184,-0.62961
185,-0.62961
186,-0.62961
187,-0.62961
188,-0.62961
189,-0.62961
190,-0.62961
191,-0.62961
192,-0.32659
193,2.0976
194,1.7946
195,1.7946
196,0.12794
197,-0.55385
198,-0.62961
199,-0.62961
200,-0.62961
201,-0.62961
202,-0.62961
203,-0.62961
204,-0.62961
205,-0.62961
206,-0.62961
207,0.73398
208,1.7946
209,1.7946
210,1.4915
211,-0.4781
212,-0.62961
213,-0.62961
214,-0.62961
215,-0.62961
216,-0.62961
217,-0.62961
218,-0.62961
219,-0.62961
220,-0.62961
221,-0.62961
222,0.27945
223,1.7946
224,1.7946
225,1.7946
226,-0.32659
227,-0.55385
228,-0.62961
229,-0.62961
230,-0.62961
231,-0.62961
232,-0.62961
233,-0.62961
234,-0.62961
235,-0.62961
236,-0.62961
237,-0.023568000000000002
238,1.7946
239,2.0976
240,1.4915
241,0.27945
242,-0.62961
243,-0.62961
244,-0.62961
245,-0.62961
246,-0.62961
247,-0.62961
248,-0.62961
249,-0.62961
250,-0.62961
251,-0.62961
252,-0.023568000000000002
253,2.0976
254,1.7946
255,1.7946
256,0.27945
257,-0.62961
258,-0.62961
259,-0.62961
260,-0.62961
261,-0.62961
262,-0.62961
263,-0.62961
264,-0.62961
265,-0.62961
266,-0.62961
267,1.1885
268,2.0976
269,1.7946
270,1.1885
271,-0.4781
272,-0.62961
273,-0.62961
274,-0.62961
275,-0.62961
276,-0.62961
277,-0.62961
278,-0.62961
279,-0.62961
280,-0.62961
281,-0.17507999999999999
282,2.0976
283,1.7946
284,1.4915
285,0.27945
286,-0.4781
287,-0.62961
288,-0.62961
289,-0.62961
290,-0.62961
291,-0.62961
292,-0.62961
293,-0.62961
294,-0.62961
295,-0.62961
296,0.50672
297,1.7946
298,1.7946
299,1.7946
300,-0.17507999999999999
301,-0.55385
302,-0.62961
303,-0.62961
304,-0.62961
305,-0.62961
306,-0.62961
307,-0.62961
308,-0.62961
309,-0.62961
310,-0.62961
311,1.1885
312,1.7946
313,1.7946
314,1.1885
315,-0.4781
316,-0.62961
317,-0.62961
318,-0.62961
319,-0.62961
320,-0.62961
321,-0.62961
322,-0.62961
323,-0.62961
324,-0.62961
325,0.27945
326,1.7946
327,1.7946
328,1.7946
329,-0.40234000000000003
330,-0.62961
331,-0.62961
332,-0.62961
333,-0.62961
334,-0.62961
335,-0.62961
336,-0.62961
337,-0.62961
338,-0.62961
339,-0.62961
340,1.4915
341,1.7946
342,1.7946
343,1.1885
344,-0.55385
345,-0.62961
346,-0.62961
347,-0.62961
348,-0.62961
349,-0.62961
350,-0.62961
351,-0.62961
352,-0.62961
353,-0.62961
354,0.96125
355,1.7946
356,1.7946
357,1.4915
358,-0.62961
359,-0.62961
360,-0.62961
361,-0.62961
362,-0.62961
363,-0.62961
364,-0.62961
365,-0.62961
366,-0.62961
367,-0.62961
368,-0.62961
369,1.7946
370,1.7946
371,1.7946
372,1.1885
373,-0.62961
374,-0.62961
375,-0.62961
376,-0.62961
377,-0.62961
378,-0.62961
379,-0.62961
380,-0.62961
381,-0.62961
382,-0.62961
383,0.73398
384,1.7946
385,1.7946
386,1.7946
387,-0.32659
388,-0.62961
389,-0.62961
390,-0.62961
391,-0.62961
392,-0.62961
393,-0.62961
394,-0.62961
395,-0.62961
396,-0.62961
397,-0.62961
398,-0.023568000000000002
399,2.0976
400,1.7946
401,1.7946
402,0.50672
403,-0.55385
404,-0.62961
405,-0.62961
406,-0.62961
407,-0.62961
408,-0.62961
409,-0.62961
410,-0.62961
411,-0.62961
412,-0.62961
413,1.7946
414,1.7946
415,1.7946
416,1.1885
417,-0.4781
418,-0.62961
419,-0.62961
420,-0.62961
421,-0.62961
422,-0.62961
423,-0.62961
424,-0.62961
425,-0.62961
426,-0.62961
427,-0.62961
428,2.0976
429,1.7946
430,1.7946
431,0.73398
432,-0.55385
433,-0.62961
434,-0.62961
435,-0.62961
436,-0.62961
437,-0.62961
438,-0.62961
439,-0.62961
440,-0.62961
441,-0.62961
442,1.4915
443,1.7946
444,1.7946
445,1.7946
446,-0.4781
447,-0.62961
448,-0.62961
449,-0.62961
450,-0.62961
451,-0.62961
452,-0.62961
453,-0.62961
454,-0.62961
455,-0.62961
456,0.73398
457,2.0976
458,1.7946
459,1.7946
460,-0.17507999999999999
461,-0.62961
462,-0.62961
463,-0.62961
464,-0.62961
465,-0.62961
466,-0.62961
467,-0.62961
468,-0.62961
469,-0.62961
470,0.27945
471,1.7946
472,1.7946
473,1.7946
474,0.27945
475,-0.55385
476,-0.62961
477,-0.62961
478,-0.62961
479,-0.62961
480,-0.62961
481,-0.62961
482,-0.62961
483,-0.62961
484,0.12794
485,1.7946
486,1.7946
487,1.7946
488,0.27945
489,-0.55385
490,-0.62961
491,-0.62961
492,-0.62961
493,-0.62961
494,-0.62961
495,-0.62961
496,-0.62961
497,-0.62961
498,0.27945
499,2.0976
500,1.7946
501,1.4915
502,0.50672
503,-0.62961
504,-0.62961
505,-0.62961
506,-0.62961
507,-0.62961
508,-0.62961
509,-0.62961
510,-0.62961
511,-0.62961
512,-0.023568000000000002
513,2.0976
514,1.7946
515,1.4915
516,0.73398
517,-0.62961
518,-0.62961
519,-0.62961
520,-0.62961
521,-0.62961
522,-0.62961
523,-0.62961
524,-0.62961
525,-0.62961
526,-0.62961
527,1.1885
528,1.7946
529,1.7946
530,1.4915
531,-0.32659
532,-0.55385
533,-0.62961
534,-0.62961
535,-0.62961
536,-0.62961
537,-0.62961
538,-0.62961
539,-0.62961
540,-0.62961
541,0.27945
542,1.7946
543,1.7946
544,1.7946
545,0.50672
546,-0.55385
547,-0.62961
548,-0.62961
549,-0.62961
550,-0.62961
551,-0.62961
552,-0.62961
553,-0.62961
554,-0.62961
555,-0.62961
556,2.0976
557,1.7946
558,1.7946
559,1.1885
560,-0.40234000000000003
561,-0.62961
562,-0.62961
563,-0.62961
564,-0.62961
565,-0.62961
566,-0.62961
567,-0.62961
568,-0.62961
569,-0.62961
570,0.96125
571,2.0976
572,1.7946
573,1.4915
574,-0.17507999999999999
575,-0.55385
576,-0.62961
577,-0.62961
578,-0.62961
579,-0.62961
580,-0.62961
581,-0.62961
582,-0.62961
583,-0.62961
584,0.73398
585,1.7946
586,1.7946
587,1.7946
588,0.50672
589,-0.62961
590,-0.62961
591,-0.62961
592,-0.62961
593,-0.62961
594,-0.62961
595,-0.62961
596,-0.62961
597,-0.62961
598,0.27945
599,1.7946
600,2.0976
601,1.4915
602,0.50672
603,-0.62961
604,-0.62961
605,-0.62961
606,-0.62961
607,-0.62961
608,-0.62961
609,-0.62961
610,-0.62961
611,-0.62961
612,0.50672
613,1.7946
614,1.7946
615,1.7946
616,0.12794
617,-0.55385
618,-0.62961
619,-0.62961
620,-0.62961
621,-0.62961
622,-0.62961
623,-0.62961
624,-0.62961
625,-0.62961
626,0.50672
627,1.7946
628,1.7946
629,1.7946
630,-0.023568000000000002
631,-0.55385
632,-0.62961
633,-0.62961
634,-0.62961
635,-0.62961
636,-0.62961
637,-0.62961
638,-0.62961
639,-0.62961
640,-0.4781
641,1.7946
642,2.0976
643,1.4915
644,0.96125
645,-0.4781
646,-0.62961
647,-0.62961
648,-0.62961
649,-0.62961
650,-0.62961
651,-0.62961
652,-0.62961
653,-0.62961
654,-0.62961
655,1.4915
656,2.0976
657,1.7946
658,1.1885
659,-0.55385
660,-0.62961
661,-0.62961
662,-0.62961
663,-0.62961
664,-0.62961
665,-0.62961
666,-0.62961
667,-0.62961
668,-0.62961
669,0.50672
670,2.0976
671,1.7946
672,1.7946
673,-0.023568000000000002
674,-0.62961
675,-0.62961
676,-0.62961
677,-0.62961
678,-0.62961
679,-0.62961
680,-0.62961
681,-0.62961
682,-0.62961
683,-0.62961
684,2.0976
685,1.7946
686,1.7946
687,0.96125
688,-0.55385
689,-0.62961
690,-0.62961
691,-0.62961
692,-0.62961
693,-0.62961
694,-0.62961
695,-0.62961
696,-0.62961
697,-0.62961
698,1.1885
699,1.7946
700,1.7946
701,1.7946
702,-0.62961
703,-0.62961
704,-0.62961
705,-0.62961
706,-0.62961
707,-0.62961
708,-0.62961
709,-0.62961
710,-0.62961
711,-0.62961
712,-0.023568000000000002
713,2.0976
714,1.7946
715,1.7946
716,0.50672
717,-0.62961
718,-0.62961
719,-0.62961
