time,value
0,0.68025
1,0.8380799999999999
2,0.99172
3,1.1388
4,1.2771
5,1.4042
6,1.5182
7,1.6169
8,1.6987
9,1.7621
10,1.8059
11,1.8294
12,1.8322
13,1.8143
14,1.776
15,1.7183
16,1.6424
17,1.5498
18,1.4426
19,1.3230000000000002
20,1.1937
21,1.0574
22,0.9168700000000001
23,0.7752100000000001
24,0.63534
25,0.50013
26,0.37232
27,0.25440999999999997
28,0.14862
29,0.056848
30,-0.019418
31,-0.079106
32,-0.1216
33,-0.14676
34,-0.15492999999999998
35,-0.14686
36,-0.12378
37,-0.08730700000000001
38,-0.03941
39,0.017641999999999998
40,0.081346
41,0.14904
42,0.21796
43,0.28535
44,0.34852
45,0.40488
46,0.45211
47,0.48811000000000004
48,0.5111399999999999
49,0.51982
50,0.5131600000000001
51,0.49062
52,0.45211
53,0.39796
54,0.32892
55,0.24613000000000002
56,0.1511
57,0.045637
58,-0.068201
59,-0.18816
60,-0.31188
61,-0.43692
62,-0.56086
63,-0.6813899999999999
64,-0.7963
65,-0.90361
66,-1.0016
67,-1.0888
68,-1.1641
69,-1.2267
70,-1.2762
71,-1.3125
72,-1.3359
73,-1.3471
74,-1.3468
75,-1.3362
76,-1.3167
77,-1.2899
78,-1.2572
79,-1.2205
80,-1.1813
81,-1.1414
82,-1.1022
83,-1.0651
84,-1.0314
85,-1.0021
86,-0.9778700000000001
87,-0.9593700000000001
88,-0.94685
89,-0.94037
90,-0.9397399999999999
91,-0.94458
92,-0.95431
93,-0.9682
94,-0.98539
95,-1.0049
96,-1.0258
97,-1.0471
98,-1.0678
