time,value
0,1.6444
1,-0.46241000000000004
2,-0.6332399999999999
3,-0.6332399999999999
4,-0.6332399999999999
5,-0.6332399999999999
6,-0.6332399999999999
7,-0.6332399999999999
8,-0.6332399999999999
9,1.9291
10,1.9291
11,0.73336
12,-0.46241000000000004
13,-0.6332399999999999
14,-0.6332399999999999
15,-0.6332399999999999
16,-0.6332399999999999
17,-0.6332399999999999
18,-0.6332399999999999
19,0.5625399999999999
20,1.9291
21,1.9291
22,-0.29159
23,-0.5763
24,-0.6332399999999999
25,-0.6332399999999999
26,-0.6332399999999999
27,-0.6332399999999999
28,-0.6332399999999999
29,-0.6332399999999999
30,1.4167
31,1.9291
32,1.4167
33,-0.51936
34,-0.6332399999999999
35,-0.6332399999999999
36,-0.6332399999999999
37,-0.6332399999999999
38,-0.6332399999999999
39,-0.6332399999999999
40,-0.40547
41,1.9291
42,1.9291
43,0.39171
44,-0.51936
45,-0.6332399999999999
46,-0.6332399999999999
47,-0.6332399999999999
48,-0.6332399999999999
49,-0.6332399999999999
50,-0.6332399999999999
51,0.73336
52,1.9291
53,1.6444
54,-0.40547
55,-0.5763
56,-0.6332399999999999
57,-0.6332399999999999
58,-0.6332399999999999
59,-0.6332399999999999
60,-0.6332399999999999
61,-0.6332399999999999
62,0.9611299999999999
63,1.9291
64,1.6444
65,-0.40547
66,-0.6332399999999999
67,-0.6332399999999999
68,-0.6332399999999999
69,-0.6332399999999999
70,-0.6332399999999999
71,-0.6332399999999999
72,-0.6332399999999999
73,1.9291
74,1.9291
75,0.9611299999999999
76,-0.51936
77,-0.6332399999999999
78,-0.6332399999999999
79,-0.6332399999999999
80,-0.6332399999999999
81,-0.6332399999999999
82,-0.6332399999999999
83,0.050061
84,1.9291
85,1.9291
86,0.050061
87,-0.6332399999999999
88,-0.6332399999999999
89,-0.6332399999999999
90,-0.6332399999999999
91,-0.6332399999999999
92,-0.6332399999999999
93,-0.6332399999999999
94,0.5625399999999999
95,1.9291
96,1.9291
97,-0.46241000000000004
98,-0.6332399999999999
99,-0.6332399999999999
100,-0.6332399999999999
101,-0.6332399999999999
102,-0.6332399999999999
103,-0.6332399999999999
104,-0.6332399999999999
105,0.73336
106,1.9291
107,1.9291
108,-0.5763
109,-0.6332399999999999
110,-0.6332399999999999
111,-0.6332399999999999
112,-0.6332399999999999
113,-0.6332399999999999
114,-0.6332399999999999
115,-0.6332399999999999
116,1.4167
117,1.9291
118,1.4167
119,-0.5763
120,-0.6332399999999999
121,-0.6332399999999999
122,-0.6332399999999999
123,-0.6332399999999999
124,-0.6332399999999999
125,-0.6332399999999999
126,-0.6332399999999999
127,1.4167
128,1.9291
129,1.4167
130,-0.5763
131,-0.6332399999999999
132,-0.6332399999999999
133,-0.6332399999999999
134,-0.6332399999999999
135,-0.6332399999999999
136,-0.6332399999999999
137,-0.40547
138,1.9291
139,1.9291
140,0.73336
141,-0.5763
142,-0.6332399999999999
143,-0.6332399999999999
144,-0.6332399999999999
145,-0.6332399999999999
146,-0.6332399999999999
147,-0.6332399999999999
148,-0.6332399999999999
149,1.9291
150,1.9291
151,0.9611299999999999
152,-0.5763
153,-0.6332399999999999
154,-0.6332399999999999
155,-0.6332399999999999
156,-0.6332399999999999
157,-0.6332399999999999
158,-0.6332399999999999
159,-0.6332399999999999
160,1.9291
161,1.9291
162,0.9611299999999999
163,-0.6332399999999999
164,-0.6332399999999999
165,-0.6332399999999999
166,-0.6332399999999999
167,-0.6332399999999999
168,-0.6332399999999999
169,-0.6332399999999999
170,-0.6332399999999999
171,2.2138
172,1.9291
173,0.73336
174,-0.5763
175,-0.6332399999999999
176,-0.6332399999999999
177,-0.6332399999999999
178,-0.6332399999999999
179,-0.6332399999999999
180,-0.6332399999999999
181,-0.40547
182,1.9291
183,1.9291
184,0.73336
185,-0.6332399999999999
186,-0.6332399999999999
187,-0.6332399999999999
188,-0.6332399999999999
189,-0.6332399999999999
190,-0.6332399999999999
191,-0.6332399999999999
192,-0.17770999999999998
193,1.9291
194,1.9291
195,0.39171
196,-0.6332399999999999
197,-0.6332399999999999
198,-0.6332399999999999
199,-0.6332399999999999
200,-0.6332399999999999
201,-0.6332399999999999
202,-0.6332399999999999
203,-0.063822
204,1.9291
205,1.9291
206,0.39171
207,-0.6332399999999999
208,-0.6332399999999999
209,-0.6332399999999999
210,-0.6332399999999999
211,-0.6332399999999999
212,-0.6332399999999999
213,-0.6332399999999999
214,0.050061
215,1.9291
216,1.9291
217,0.22089
218,-0.6332399999999999
219,-0.6332399999999999
220,-0.6332399999999999
221,-0.6332399999999999
222,-0.6332399999999999
223,-0.6332399999999999
224,-0.6332399999999999
225,-0.29159
226,1.9291
227,1.9291
228,0.39171
229,-0.6332399999999999
230,-0.6332399999999999
231,-0.6332399999999999
232,-0.6332399999999999
233,-0.6332399999999999
234,-0.6332399999999999
235,-0.6332399999999999
236,0.5625399999999999
237,1.9291
238,1.6444
239,-0.17770999999999998
240,-0.5763
241,-0.6332399999999999
242,-0.6332399999999999
243,-0.6332399999999999
244,-0.6332399999999999
245,-0.6332399999999999
246,-0.6332399999999999
247,0.73336
248,1.9291
249,1.9291
250,-0.5763
251,-0.6332399999999999
252,-0.6332399999999999
253,-0.6332399999999999
254,-0.6332399999999999
255,-0.6332399999999999
256,-0.6332399999999999
257,-0.6332399999999999
258,1.4167
259,1.9291
260,1.4167
261,-0.5763
262,-0.6332399999999999
263,-0.6332399999999999
264,-0.6332399999999999
265,-0.6332399999999999
266,-0.6332399999999999
267,-0.6332399999999999
268,-0.6332399999999999
269,1.9291
270,1.6444
271,0.9611299999999999
272,-0.6332399999999999
273,-0.6332399999999999
274,-0.6332399999999999
275,-0.6332399999999999
276,-0.6332399999999999
277,-0.6332399999999999
278,-0.6332399999999999
279,0.050061
280,1.9291
281,1.9291
282,0.050061
283,-0.51936
284,-0.6332399999999999
285,-0.6332399999999999
286,-0.6332399999999999
287,-0.6332399999999999
288,-0.6332399999999999
289,-0.6332399999999999
290,0.5625399999999999
291,1.9291
292,1.6444
293,-0.063822
294,-0.6332399999999999
295,-0.6332399999999999
296,-0.6332399999999999
297,-0.6332399999999999
298,-0.6332399999999999
299,-0.6332399999999999
300,-0.6332399999999999
301,0.73336
302,1.9291
303,1.9291
304,-0.29159
305,-0.6332399999999999
306,-0.6332399999999999
307,-0.6332399999999999
308,-0.6332399999999999
309,-0.6332399999999999
310,-0.6332399999999999
311,-0.6332399999999999
312,0.73336
313,1.9291
314,1.9291
315,-0.40547
316,-0.6332399999999999
317,-0.6332399999999999
318,-0.6332399999999999
319,-0.6332399999999999
320,-0.6332399999999999
321,-0.6332399999999999
322,-0.6332399999999999
323,0.9611299999999999
324,1.9291
325,1.6444
326,-0.29159
327,-0.6332399999999999
328,-0.6332399999999999
329,-0.6332399999999999
330,-0.6332399999999999
331,-0.6332399999999999
332,-0.6332399999999999
333,-0.6332399999999999
334,1.1889
335,1.9291
336,1.4167
337,-0.5763
338,-0.6332399999999999
339,-0.6332399999999999
340,-0.6332399999999999
341,-0.6332399999999999
342,-0.6332399999999999
343,-0.6332399999999999
344,-0.6332399999999999
345,1.6444
346,1.9291
347,1.1889
348,-0.6332399999999999
349,-0.6332399999999999
350,-0.6332399999999999
351,-0.6332399999999999
352,-0.6332399999999999
353,-0.6332399999999999
354,-0.6332399999999999
355,-0.51936
356,1.9291
357,1.6444
358,0.73336
359,-0.46241000000000004
360,-0.6332399999999999
361,-0.6332399999999999
362,-0.6332399999999999
363,-0.6332399999999999
364,-0.6332399999999999
365,-0.6332399999999999
366,-0.063822
367,1.9291
368,1.9291
369,0.5625399999999999
370,-0.6332399999999999
371,-0.6332399999999999
372,-0.6332399999999999
373,-0.6332399999999999
374,-0.6332399999999999
375,-0.6332399999999999
376,-0.6332399999999999
377,0.5625399999999999
378,1.9291
379,1.9291
380,-0.29159
381,-0.5763
382,-0.6332399999999999
383,-0.6332399999999999
384,-0.6332399999999999
385,-0.6332399999999999
386,-0.6332399999999999
387,-0.6332399999999999
388,1.1889
389,1.9291
390,1.9291
391,-0.5763
392,-0.6332399999999999
393,-0.6332399999999999
394,-0.6332399999999999
395,-0.6332399999999999
396,-0.6332399999999999
397,-0.6332399999999999
398,-0.6332399999999999
399,1.1889
400,1.9291
401,1.6444
402,-0.6332399999999999
403,-0.6332399999999999
404,-0.6332399999999999
405,-0.6332399999999999
406,-0.6332399999999999
407,-0.6332399999999999
408,-0.6332399999999999
409,-0.6332399999999999
410,1.6444
411,1.9291
412,1.1889
413,-0.46241000000000004
414,-0.6332399999999999
415,-0.6332399999999999
416,-0.6332399999999999
417,-0.6332399999999999
418,-0.6332399999999999
419,-0.6332399999999999
420,-0.6332399999999999
421,1.9291
422,1.9291
423,0.9611299999999999
424,-0.6332399999999999
425,-0.6332399999999999
426,-0.6332399999999999
427,-0.6332399999999999
428,-0.6332399999999999
429,-0.6332399999999999
430,-0.6332399999999999
431,-0.6332399999999999
432,1.9291
433,1.9291
434,0.9611299999999999
435,-0.5763
436,-0.6332399999999999
437,-0.6332399999999999
438,-0.6332399999999999
439,-0.6332399999999999
440,-0.6332399999999999
441,-0.6332399999999999
442,-0.6332399999999999
443,1.6444
444,1.9291
445,1.1889
446,-0.5763
447,-0.6332399999999999
448,-0.6332399999999999
449,-0.6332399999999999
450,-0.6332399999999999
451,-0.6332399999999999
452,-0.6332399999999999
453,-0.40547
454,1.9291
455,1.9291
456,0.73336
457,-0.51936
458,-0.6332399999999999
459,-0.6332399999999999
460,-0.6332399999999999
461,-0.6332399999999999
462,-0.6332399999999999
463,-0.6332399999999999
464,0.39171
465,1.9291
466,1.9291
467,-0.063822
468,-0.5763
469,-0.6332399999999999
470,-0.6332399999999999
471,-0.6332399999999999
472,-0.6332399999999999
473,-0.6332399999999999
474,-0.6332399999999999
475,1.1889
476,1.9291
477,1.6444
478,-0.51936
479,-0.6332399999999999
480,-0.6332399999999999
481,-0.6332399999999999
482,-0.6332399999999999
483,-0.6332399999999999
484,-0.6332399999999999
485,-0.6332399999999999
486,1.6444
487,1.9291
488,0.9611299999999999
489,-0.46241000000000004
490,-0.6332399999999999
491,-0.6332399999999999
492,-0.6332399999999999
493,-0.6332399999999999
494,-0.6332399999999999
495,-0.6332399999999999
496,-0.6332399999999999
497,1.9291
498,1.6444
499,0.9611299999999999
500,-0.46241000000000004
501,-0.6332399999999999
502,-0.6332399999999999
503,-0.6332399999999999
504,-0.6332399999999999
505,-0.6332399999999999
506,-0.6332399999999999
507,-0.40547
508,1.9291
509,1.9291
510,0.5625399999999999
511,-0.51936
512,-0.6332399999999999
513,-0.6332399999999999
514,-0.6332399999999999
515,-0.6332399999999999
516,-0.6332399999999999
517,-0.6332399999999999
518,0.050061
519,1.9291
520,1.9291
521,0.22089
522,-0.51936
523,-0.6332399999999999
524,-0.6332399999999999
525,-0.6332399999999999
526,-0.6332399999999999
527,-0.6332399999999999
528,-0.6332399999999999
529,0.39171
530,1.9291
531,1.6444
532,0.39171
533,-0.5763
534,-0.6332399999999999
535,-0.6332399999999999
536,-0.6332399999999999
537,-0.6332399999999999
538,-0.6332399999999999
539,-0.6332399999999999
540,0.73336
541,1.9291
542,1.9291
543,-0.40547
544,-0.5763
545,-0.6332399999999999
546,-0.6332399999999999
547,-0.6332399999999999
548,-0.6332399999999999
549,-0.6332399999999999
550,-0.6332399999999999
551,1.4167
552,1.9291
553,1.4167
554,-0.6332399999999999
555,-0.6332399999999999
556,-0.6332399999999999
557,-0.6332399999999999
558,-0.6332399999999999
559,-0.6332399999999999
560,-0.6332399999999999
561,-0.40547
562,1.9291
563,1.9291
564,0.73336
565,-0.5763
566,-0.6332399999999999
567,-0.6332399999999999
568,-0.6332399999999999
569,-0.6332399999999999
570,-0.6332399999999999
571,-0.6332399999999999
572,0.39171
573,1.9291
574,1.9291
575,0.22089
576,-0.6332399999999999
577,-0.6332399999999999
578,-0.6332399999999999
579,-0.6332399999999999
580,-0.6332399999999999
581,-0.6332399999999999
582,-0.6332399999999999
583,1.1889
584,1.9291
585,1.4167
586,-0.46241000000000004
587,-0.6332399999999999
588,-0.6332399999999999
589,-0.6332399999999999
590,-0.6332399999999999
591,-0.6332399999999999
592,-0.6332399999999999
593,0.22089
594,1.9291
595,1.9291
596,0.39171
597,-0.6332399999999999
598,-0.6332399999999999
599,-0.6332399999999999
600,-0.6332399999999999
601,-0.6332399999999999
602,-0.6332399999999999
603,-0.6332399999999999
604,1.4167
605,1.9291
606,1.4167
607,-0.46241000000000004
608,-0.6332399999999999
609,-0.6332399999999999
610,-0.6332399999999999
611,-0.6332399999999999
612,-0.6332399999999999
613,-0.6332399999999999
614,0.050061
615,1.9291
616,1.9291
617,0.22089
618,-0.51936
619,-0.6332399999999999
620,-0.6332399999999999
621,-0.6332399999999999
622,-0.6332399999999999
623,-0.6332399999999999
624,-0.46241000000000004
625,1.9291
626,1.9291
627,1.6444
628,-0.29159
629,-0.5763
630,-0.6332399999999999
631,-0.6332399999999999
632,-0.6332399999999999
633,-0.6332399999999999
634,1.6444
635,1.9291
636,1.6444
637,-0.5763
638,-0.6332399999999999
639,-0.6332399999999999
640,-0.6332399999999999
641,-0.6332399999999999
642,-0.6332399999999999
643,-0.17770999999999998
644,1.9291
645,1.6444
646,0.9611299999999999
647,-0.6332399999999999
648,-0.6332399999999999
649,-0.6332399999999999
650,-0.6332399999999999
651,-0.6332399999999999
652,-0.6332399999999999
653,-0.29159
654,1.9291
655,1.9291
656,0.9611299999999999
657,-0.51936
658,-0.6332399999999999
659,-0.6332399999999999
660,-0.6332399999999999
661,-0.6332399999999999
662,-0.6332399999999999
663,-0.6332399999999999
664,1.6444
665,1.9291
666,1.6444
667,-0.6332399999999999
668,-0.6332399999999999
669,-0.6332399999999999
670,-0.6332399999999999
671,-0.6332399999999999
672,-0.6332399999999999
673,-0.6332399999999999
674,0.73336
675,1.9291
676,1.9291
677,-0.063822
678,-0.5763
679,-0.6332399999999999
680,-0.6332399999999999
681,-0.6332399999999999
682,-0.6332399999999999
683,-0.6332399999999999
684,-0.063822
685,1.9291
686,1.9291
687,0.5625399999999999
688,-0.5763
689,-0.6332399999999999
690,-0.6332399999999999
691,-0.6332399999999999
692,-0.6332399999999999
693,-0.6332399999999999
694,-0.6332399999999999
695,1.6444
696,1.9291
697,1.4167
698,-0.5763
699,-0.6332399999999999
700,-0.6332399999999999
701,-0.6332399999999999
702,-0.6332399999999999
703,-0.6332399999999999
704,-0.6332399999999999
705,1.4167
706,1.9291
707,1.9291
708,-0.5763
709,-0.6332399999999999
710,-0.6332399999999999
711,-0.6332399999999999
712,-0.6332399999999999
713,-0.6332399999999999
714,-0.6332399999999999
715,0.5625399999999999
716,1.9291
717,1.9291
718,-0.17770999999999998
719,-0.5763
