time,value
0,-1.0170000000000001
1,-1.0170000000000001
2,-1.0170000000000001
3,-1.0170000000000001
4,-1.0170000000000001
5,-1.0170000000000001
6,-1.0170000000000001
7,-1.0170000000000001
8,-1.0170000000000001
9,-1.0170000000000001
10,-1.0170000000000001
11,-1.0170000000000001
12,-1.0170000000000001
13,-1.0170000000000001
14,-1.0170000000000001
15,-1.0170000000000001
16,-1.0170000000000001
17,-1.0170000000000001
18,-1.0170000000000001
19,-1.0170000000000001
20,-1.0170000000000001
21,-1.0170000000000001
22,-1.0170000000000001
23,-1.0170000000000001
24,-1.0170000000000001
25,-1.0170000000000001
26,-1.0170000000000001
27,-1.0170000000000001
28,-1.0170000000000001
29,-1.0170000000000001
30,-1.0170000000000001
31,-1.0170000000000001
32,-1.0170000000000001
33,-1.0170000000000001
34,-1.0170000000000001
35,-1.0170000000000001
36,-1.0170000000000001
37,-1.0170000000000001
38,-1.0170000000000001
39,-1.0337
40,-1.0505
41,-1.0479
42,-1.0453
43,-1.0107
44,-0.97605
45,-0.9414299999999999
46,-0.90681
47,-0.87954
48,-0.85226
49,-0.85226
50,-0.85226
51,-0.8631
52,-0.8739399999999999
53,-0.89195
54,-0.90996
55,-0.94458
56,-0.9792
57,-1.0059
58,-1.0327
59,-1.05
60,-1.0673
61,-1.0846
62,-1.1019
63,-1.1095
64,-1.117
65,-1.0997
66,-1.0824
67,-1.0409
68,-0.9994799999999999
69,-0.9494799999999999
70,-0.8994700000000001
71,-0.86485
72,-0.8302299999999999
73,-0.78652
74,-0.7428100000000001
75,-0.69089
76,-0.6389600000000001
77,-0.60329
78,-0.56762
79,-0.52076
80,-0.47391000000000005
81,-0.40467
82,-0.33543
83,-0.27948
84,-0.22353
85,-0.17160999999999998
86,-0.11968
87,-0.37011
88,-0.11047
89,0.26236
90,0.2025
91,0.28905
92,0.37559000000000003
93,0.46213999999999994
94,0.11600999999999999
95,0.12597
96,0.13594
97,0.13594
98,0.13594
99,0.13594
100,0.13594
101,0.14031
102,0.14468
103,0.16199000000000002
104,0.1793
105,0.20815
106,0.237
107,0.27301
108,0.30903
109,0.36096
110,0.41289
111,0.47338
112,0.53388
113,0.60311
114,0.67235
115,0.74159
116,0.81083
117,0.8800600000000001
118,0.9493
119,1.0185
120,1.0878
121,1.0804
122,1.0731
123,1.0437
124,1.0143
125,1.0143
126,1.0143
127,0.9555899999999999
128,0.89685
129,0.79299
130,0.68914
131,0.51744
132,0.34575
133,0.1522
134,-0.2381
135,-0.26637
136,-0.49138999999999994
137,-0.67445
138,-0.85751
139,-1.0075
140,-1.1575
141,-1.2268
142,-1.296
143,-1.3102
144,-1.3243
145,-1.3053
146,-1.2862
147,-1.2343
148,-1.1824
149,-1.1063
150,-1.0303
151,-0.9264
152,-0.8225399999999999
153,-0.7339
154,-0.64525
155,-0.5637800000000001
156,-0.4823
157,-0.41306000000000004
158,-0.34383
159,-0.32354
160,-0.30326
161,-0.30956
162,-0.31585
163,-0.36778
164,-0.41971
165,-0.4809
166,-0.5421
167,-0.61133
168,-0.68057
169,-0.7169399999999999
170,-0.7533
171,-0.77533
172,-0.7973600000000001
173,-0.7973600000000001
174,-0.7973600000000001
175,-0.77044
176,-0.74351
177,-0.7088899999999999
178,-0.67428
179,-0.63966
180,-0.6050399999999999
181,-0.53895
182,-0.47286000000000006
183,-0.38595999999999997
184,-0.29907
185,-0.19521
186,-0.48812
187,0.16329000000000002
188,0.11635999999999999
189,0.22021
190,0.32406999999999997
191,0.41323999999999994
192,0.50241
193,0.57531
194,0.64822
195,0.68284
196,0.71746
197,0.74036
198,0.76327
199,0.7774300000000001
200,0.79159
201,0.77428
202,0.75697
203,0.74841
204,0.7398399999999999
205,0.7398399999999999
206,0.7398399999999999
207,0.75575
208,0.77166
209,0.79474
210,0.81782
211,0.85244
212,0.8870600000000001
213,0.94755
214,1.008
215,1.0773
216,1.1465
217,1.2158
218,1.285
219,1.3642
220,1.4434
221,1.5299
222,1.6165
223,1.6859
224,1.7553
225,1.8106
226,1.8658
227,1.9004
228,1.9351
229,1.9555
230,1.976
231,1.9812
232,1.9865
233,1.9518
234,1.9172
235,1.849
236,1.7808
237,1.6974
238,1.614
239,1.5794
240,1.5448
241,1.5266
242,1.5084
243,1.5084
244,1.5084
245,1.5546
246,1.6008
247,1.6527
248,1.7046
249,1.7565
250,1.8085
251,1.8604
252,1.9123
253,1.962
254,2.0116
255,2.0463
256,2.0809
257,2.0777
258,2.0746
259,2.04
260,2.0053
261,1.9043
262,1.8032
263,1.68
264,1.5567
265,1.4009
266,1.2451
267,1.0893
268,0.9335600000000001
269,0.77778
270,0.622
271,0.46621
272,0.31043000000000004
273,0.2293
274,0.14818
275,0.11565999999999999
276,0.38433
277,0.11775
278,0.15237
279,0.18699000000000002
280,0.22161
281,0.25623
282,0.29085
283,0.2363
284,0.18175
285,0.46038999999999997
286,0.24488000000000001
287,-0.10622000000000001
288,-0.22738000000000003
289,-0.36044
290,-0.49349
291,-0.62322
292,-0.75295
293,-0.80488
294,-0.8568100000000001
295,-0.8819899999999999
296,-0.9071600000000001
297,-0.9071600000000001
298,-0.9071600000000001
299,-0.8428200000000001
300,-0.7784800000000001
301,-0.71519
302,-0.6519
303,-0.59997
304,-0.54804
305,-0.5223399999999999
306,-0.49663999999999997
307,-0.48823999999999995
308,-0.47985
309,-0.51447
310,-0.54909
311,-0.5837100000000001
312,-0.61833
313,-0.65295
314,-0.6875600000000001
315,-0.31576
316,-0.31576
317,-0.31576
318,-0.31576
319,-0.31576
320,-0.31576
321,-0.31576
322,-0.31576
323,-0.31576
324,-0.31576
325,-0.31576
326,-0.31576
327,-0.31576
328,-0.31576
329,-0.31576
330,-0.31576
331,-0.31576
332,-0.31576
333,-0.31576
334,-0.31576
335,-0.31576
336,-0.31576
337,-0.31576
338,-0.31576
339,-0.31576
340,-0.31576
341,-0.31576
342,-0.31576
343,-0.31576
344,-0.31576
345,-0.31576
346,-0.31576
347,-0.31576
348,-0.31576
349,-0.31576
350,-0.31576
351,-0.31576
352,-0.31576
353,-0.31576
354,0.065631
355,0.17197
356,0.32371
357,0.47546000000000005
358,0.14522000000000002
359,0.18909
360,0.23295
361,0.27681
362,0.31601999999999997
363,0.35523000000000005
364,0.37716
365,0.39909
366,0.40729
367,0.41548999999999997
368,0.4146
369,0.41371
370,0.39178
371,0.36985
372,0.35789
373,0.34593
374,0.34593
375,0.34593
376,0.32688
377,0.30782
378,0.28589000000000003
379,0.26396
380,0.24203000000000002
381,0.2201
382,0.22874
383,0.23738
384,0.25931
385,0.28124
386,0.30317
387,0.3251
388,0.33552
389,0.34593
390,0.34593
391,0.34593
392,0.32533
393,0.30472
394,0.27504
395,0.24535
396,0.20149
397,0.15763
398,0.14744000000000002
399,0.13725
400,0.13326
401,0.12927
402,0.50536
403,0.39571
404,0.3514
405,0.3071
406,0.30488000000000004
407,0.30267
408,0.083354
409,-0.13596
410,-0.35527
411,-0.10865
412,-0.15250999999999998
413,-0.19637000000000002
414,-0.25861999999999996
415,-0.32087
416,-0.3922
417,-0.46353
418,-0.5512600000000001
419,-0.63898
420,-0.71209
421,-0.7851899999999999
422,-0.84921
423,-0.9132399999999999
424,-0.9571
425,-1.001
426,-1.034
427,-1.067
428,-1.0889
429,-1.1108
430,-1.0929
431,-1.075
432,-1.053
433,-1.0311
434,-1.0092
435,-0.9872299999999999
436,-0.9814700000000001
437,-0.9757100000000001
438,-0.9757100000000001
439,-0.9757100000000001
440,-0.9757100000000001
441,-0.9757100000000001
442,-1.0129
443,-1.0501
444,-1.1159
445,-1.1817
446,-1.2690000000000001
447,-1.3563
448,-1.4354
449,-1.5145
450,-1.5803
451,-1.646
452,-1.7473
453,-1.8485
454,-1.9387
455,-2.0289
456,-2.0508
457,-2.0727
458,-2.0528
459,-2.0328
460,-1.9879
461,-1.9429
462,-1.8771
463,-1.8113
464,-1.7455
465,-1.6797
466,-1.6139
467,-1.5481
468,-1.5016
469,-1.4551
470,-1.4048
471,-1.3545
472,-1.2887
473,-1.2229
474,-1.2037
475,-1.1844
476,-1.187
477,-1.1897
478,-1.2116
479,-1.2336
480,-1.2555
481,-1.2774
482,-1.2994
483,-1.3213
484,-1.3432
485,-1.3652
486,-1.3711
487,-1.3771
488,-1.3552
489,-1.3333
490,-1.2772
491,-1.2212
492,-1.1554
493,-1.0896
494,-1.0238
495,-0.9579799999999999
496,-0.8789
497,-0.79981
498,-0.71209
499,-0.62436
500,-0.53664
501,-0.44891000000000003
502,-0.36119
503,-0.27346
504,-0.18574000000000002
505,-0.098014
506,-0.17583
507,0.16975
508,0.44111999999999996
509,0.14877
510,0.1707
511,0.19263
512,0.21456
513,0.23649
514,0.25643
515,0.27637
516,0.27637
517,0.27637
518,0.28744000000000003
519,0.29852
520,0.32045
521,0.34238
522,0.38447
523,0.42656000000000005
524,0.47043
525,0.5142899999999999
526,0.55815
527,0.60201
528,0.66227
529,0.72253
530,0.78832
531,0.85411
532,0.91991
533,0.9857
534,1.0515
535,1.1173
536,1.1831
537,1.2489
538,1.3147
539,1.3805
540,1.4463
541,1.5119999999999998
542,1.5778
543,1.6436
544,1.6915
545,1.7393
546,1.7679
547,1.7965
548,1.7746
549,1.7526
550,1.7449
551,1.7371
552,1.7371
553,1.7371
554,1.7371
555,1.7371
556,1.7371
557,1.7371
558,1.7371
559,1.7371
560,1.7566
561,1.7761
562,1.798
563,1.82
564,1.8419
565,1.8638
566,1.8858
567,1.9077
568,1.9296
569,1.9516
570,1.9735
571,1.9954
572,1.9815
573,1.9675
574,1.9236
575,1.8798
576,1.7728
577,1.6658
578,1.5807
579,1.4957
580,1.4518
581,1.4079
582,1.3122
583,1.2165
584,1.1157
585,1.0149
586,0.94915
587,0.88335
588,0.8175600000000001
589,0.7517699999999999
590,0.68797
591,0.62417
592,0.62417
593,0.62417
594,0.61442
595,0.6046699999999999
596,0.5827399999999999
597,0.56081
598,0.52005
599,0.47928999999999994
600,0.41748
601,0.35568
602,0.24602
603,0.13635999999999998
604,0.1775
605,-0.29546
606,-0.14055
607,-0.22826999999999997
608,-0.316
609,-0.40371999999999997
610,-0.44626000000000005
611,-0.48878999999999995
612,-0.48878999999999995
613,-0.48878999999999995
614,-0.48878999999999995
615,-0.48878999999999995
616,-0.47372
617,-0.45866
618,-0.4148
619,-0.37094
620,-0.37692
621,-0.3829
622,-0.40105999999999997
623,-0.41923
624,-0.41923
625,-0.41923
626,-0.44493
627,-0.47062
628,-0.51449
629,-0.55835
630,0.8493700000000001
631,0.8493700000000001
632,0.8493700000000001
633,0.8493700000000001
634,0.8493700000000001
635,0.8493700000000001
636,0.8493700000000001
637,0.8493700000000001
638,0.8493700000000001
639,0.8493700000000001
640,0.8493700000000001
641,0.8493700000000001
642,0.8493700000000001
643,0.8493700000000001
644,0.8493700000000001
645,0.8493700000000001
646,0.8493700000000001
647,0.8493700000000001
648,0.8493700000000001
649,0.8493700000000001
650,0.8493700000000001
651,0.8493700000000001
652,0.8493700000000001
653,0.8493700000000001
654,0.8493700000000001
655,0.8493700000000001
656,0.8493700000000001
657,0.8493700000000001
658,0.8493700000000001
659,0.8493700000000001
660,0.8493700000000001
661,0.8493700000000001
662,0.8493700000000001
663,0.8493700000000001
664,0.8493700000000001
665,0.8493700000000001
666,0.8493700000000001
667,0.8493700000000001
668,0.8493700000000001
669,0.80558
670,0.7618
671,0.72964
672,0.6974899999999999
673,0.6862
674,0.67492
675,0.6726300000000001
676,0.67035
677,0.66796
678,0.66556
679,0.65428
680,0.64299
681,0.61049
682,0.578
683,0.53285
684,0.48768999999999996
685,0.44254
686,0.39739
687,0.35224
688,0.30708
689,0.26193
690,0.21678000000000003
691,0.18143
692,0.14609
693,0.11861
694,0.4243
695,0.36785999999999996
696,0.31142
697,0.17631
698,0.2302
699,-0.14067000000000002
700,-0.32254
701,-0.11467999999999999
702,-0.17112
703,-0.22755999999999998
704,-0.284
705,-0.34044
706,-0.39688
707,-0.43211000000000005
708,-0.46734
709,-0.49722
710,-0.52709
711,-0.54967
712,-0.57224
713,-0.58615
714,-0.60006
715,-0.61135
716,-0.62264
717,-0.63393
718,-0.6452100000000001
719,-0.6565
720,-0.66779
721,-0.67885
722,-0.68991
723,-0.67862
724,-0.66733
725,-0.66563
726,-0.66391
727,-0.6752
728,-0.6864899999999999
729,-0.6977800000000001
730,-0.70907
731,-0.7232
732,-0.73734
733,-0.7599199999999999
734,-0.7825
735,-0.8126
736,-0.8427
737,-0.87656
738,-0.91043
739,-0.94429
740,-0.97816
741,-0.99526
742,-1.0124
743,-1.0124
744,-1.0124
745,-1.0226
746,-1.0329
747,-1.0332
748,-1.0336
749,-1.011
750,-0.9884200000000001
751,-0.9159
752,-0.8433799999999999
753,-0.76676
754,-0.69014
755,-0.69014
756,-0.69014
757,-0.6646
758,-0.6390600000000001
759,-0.59391
760,-0.54875
761,-0.5036
762,-0.45845
763,-0.4133
764,-0.36814
765,-0.32299
766,-0.27784000000000003
767,-0.25093000000000004
768,-0.22401999999999997
769,-0.2165
770,-0.20897
771,-0.25411999999999996
772,-0.29928
773,-0.37316
774,-0.44705
775,-0.5350699999999999
776,-0.6231
777,-0.66825
778,-0.7134
779,-0.74282
780,-0.77223
781,-0.78352
782,-0.79481
783,-0.79618
784,-0.79755
785,-0.79424
786,-0.79093
787,-0.77965
788,-0.76836
789,-0.75707
790,-0.74578
791,-0.73723
792,-0.72868
793,-0.73997
794,-0.75125
795,-0.76859
796,-0.78592
797,-0.8084899999999999
798,-0.8310700000000001
799,-0.85364
800,-0.8762200000000001
801,-0.8988
802,-0.92137
803,-0.94395
804,-0.9665299999999999
805,-0.9978799999999999
806,-1.0292
807,-1.0609
808,-1.0926
809,-1.1152
810,-1.1378
811,-1.1604
812,-1.1829
813,-1.2051
814,-1.2272
815,-1.2272
816,-1.2272
817,-1.237
818,-1.2468
819,-1.2694
820,-1.2919
821,-1.3049
822,-1.3179
823,-1.3292
824,-1.3405
825,-1.3518
826,-1.3631
827,-1.3744
828,-1.3857
829,-1.3959
830,-1.4062
831,-1.4062
832,-1.4062
833,-1.4119
834,-1.4176
835,-1.4289
836,-1.4402
837,-1.4411
838,-1.442
839,-1.4382
840,-1.4345
841,-1.4232
842,-1.4119
843,-1.3922
844,-1.3724
845,-1.3499
846,-1.3273
847,-1.3047
848,-1.2821
849,-1.2531
850,-1.224
851,-1.1901
852,-1.1563
853,-1.1112
854,-1.0662
855,-1.0073
856,-0.9485100000000001
857,-0.86949
858,-0.7904800000000001
859,-0.68375
860,-0.57703
861,-0.46415
862,-0.35126999999999997
863,-0.23839000000000002
864,-0.12550999999999998
865,-0.09449400000000001
866,0.46991000000000005
867,0.21108000000000002
868,0.32191
869,0.40092
870,0.47994
871,0.54824
872,0.61654
873,0.67298
874,0.72942
875,0.80592
876,0.8824299999999999
877,0.9546100000000001
878,1.0268
879,1.0832
880,1.1397
881,1.188
882,1.2364
883,1.2815
884,1.3267
885,1.3718
886,1.4169999999999998
887,1.4498
888,1.4826
889,1.5052
890,1.5278
891,1.5504
892,1.5729
893,1.5913
894,1.6097
895,1.6209
896,1.6322
897,1.6435
898,1.6548
899,1.6684
900,1.6819
901,1.7045
902,1.7271
903,1.7219
904,1.7166
905,1.6944
906,1.6721
907,1.6609
908,1.6496
909,1.6383
910,1.6269999999999998
911,1.6157
912,1.6044
913,1.6125
914,1.6206
915,1.6319
916,1.6432
917,1.6545
918,1.6658
919,1.6615
920,1.6573
921,1.6426
922,1.6279
923,1.5827
924,1.5376
925,1.475
926,1.4124
927,1.3334
928,1.2544
929,1.1544
930,1.0544
931,0.9566600000000001
932,0.8589399999999999
933,0.76864
934,0.6783399999999999
935,0.6393399999999999
936,0.60035
937,0.5855199999999999
938,0.5707
939,0.59328
940,0.61585
941,0.63181
942,0.64778
943,0.6590699999999999
944,0.67035
