time,value
0,-0.41471
1,-0.41471
2,-0.41471
3,-0.41471
4,-0.41471
5,-0.41471
6,-0.41471
7,-0.41471
8,-0.41471
9,-0.41471
10,-0.41471
11,-0.41471
12,-0.41471
13,-0.41471
14,-0.41471
15,-0.41471
16,-0.41471
17,-0.41471
18,-0.41471
19,-0.41471
20,-0.41471
21,-0.41471
22,-0.41471
23,-0.41471
24,-0.41471
25,-0.41471
26,-0.41471
27,-0.41471
28,-0.41471
29,-0.41471
30,-0.41471
31,-0.41471
32,-0.41471
33,-0.41471
34,-0.41471
35,-0.41471
36,-0.41471
37,-0.41471
38,-0.41471
39,-0.41471
40,-0.41471
41,-0.41471
42,-0.41471
43,-0.41471
44,-0.41471
45,-0.41471
46,-0.41471
47,-0.41471
48,-0.41471
49,-0.41471
50,-0.41471
51,-0.41471
52,-0.41471
53,-0.41471
54,-0.41471
55,-0.41471
56,-0.41471
57,-0.41471
58,-0.41471
59,-0.41471
60,-0.41471
61,-0.41471
62,-0.41471
63,-0.41471
64,-0.41471
65,-0.41471
66,-0.41471
67,-0.41471
68,-0.41471
69,-0.41471
70,-0.41471
71,-0.41471
72,-0.41471
73,-0.41471
74,-0.41471
75,-0.41471
76,-0.41471
77,-0.41471
78,-0.41471
79,-0.41471
80,-0.41471
81,-0.41471
82,-0.41471
83,-0.41471
84,-0.41471
85,-0.41471
86,-0.41471
87,-0.41471
88,-0.41471
89,-0.41471
90,-0.41471
91,-0.41471
92,-0.41471
93,-0.41471
94,-0.41471
95,-0.41471
96,-0.41471
97,-0.41471
98,-0.41471
99,-0.41471
100,-0.41471
101,-0.41471
102,-0.41471
103,-0.41471
104,-0.41471
105,-0.41471
106,-0.41471
107,-0.41471
108,-0.41471
109,-0.41471
110,-0.41471
111,-0.41471
112,-0.41471
113,-0.41471
114,-0.41471
115,-0.41471
116,-0.41471
117,-0.41471
118,-0.41471
119,-0.41471
120,-0.41371
121,-0.39926
122,-0.38482
123,-0.36235
124,-0.33888
125,-0.31540999999999997
126,-0.29194000000000003
127,-0.26847
128,-0.24500999999999998
129,-0.22154000000000001
130,-0.19807
131,-0.17369
132,-0.14481
133,-0.11592000000000001
134,-0.022946
135,0.07093200000000001
136,0.16480999999999998
137,0.25869000000000003
138,0.35257
139,0.44645
140,0.54033
141,0.6342
142,0.7280800000000001
143,0.82196
144,0.9105700000000001
145,0.94126
146,0.97196
147,0.95375
148,0.9302799999999999
149,0.90681
150,0.88334
151,0.85987
152,0.8364
153,0.81293
154,0.78946
155,0.76599
156,0.74252
157,0.71906
158,0.6251800000000001
159,0.5313
160,0.43742
161,0.34354
162,0.24966
163,0.15578
164,0.061905999999999996
165,-0.031973
166,-0.12585
167,-0.21973
168,-0.31256
169,-0.3956
170,-0.47865
171,-0.55011
172,-0.62052
173,-0.69093
174,-0.76134
175,-0.83175
176,-0.90215
177,-0.9725600000000001
178,-1.043
179,-1.1134
180,-1.1838
181,-1.2539
182,-1.3026
183,-1.3514
184,-1.3986
185,-1.4456
186,-1.4925
187,-1.5394
188,-1.5864
189,-1.6333
190,-1.6803
191,-1.7272
192,-1.7721
193,-1.801
194,-1.8299
195,-1.8319
196,-1.8319
197,-1.8319
198,-1.8319
199,-1.8319
200,-1.8319
201,-1.8319
202,-1.8319
203,-1.8319
204,-1.8319
205,-1.8308
206,-1.7911
207,-1.7514
208,-1.7055
209,-1.6586
210,-1.6117
211,-1.5647
212,-1.5178
213,-1.4708
214,-1.4239
215,-1.3769999999999998
216,-1.3273
217,-1.2587
218,-1.1901
219,-1.0755
220,-0.9581200000000001
221,-0.84077
222,-0.72342
223,-0.6060800000000001
224,-0.48873
225,-0.37138000000000004
226,-0.25403000000000003
227,-0.13668
228,-0.019334999999999998
229,0.09726
230,0.19655999999999998
231,0.29585
232,0.39048
233,0.48436
234,0.57824
235,0.6721199999999999
236,0.76599
237,0.85987
238,0.95375
239,1.0476
240,1.14
241,1.2231
242,1.3061
243,1.3545
244,1.4015
245,1.4484
246,1.4954
247,1.5423
248,1.5892
249,1.6362
250,1.6831
251,1.7301
252,1.777
253,1.8221
254,1.8366
255,1.851
256,1.8528
257,1.8528
258,1.8528
259,1.8528
260,1.8528
261,1.8528
262,1.8528
263,1.8528
264,1.8523
265,1.8487
266,1.845
267,1.8221
268,1.7987
269,1.7752
270,1.7517
271,1.7282
272,1.7048
273,1.6813
274,1.6578
275,1.6344
276,1.6109
277,1.5874
278,1.564
279,1.5405
280,1.517
281,1.4936
282,1.4701
283,1.4466
284,1.4231
285,1.3997
286,1.3762
287,1.3527
288,1.3293
289,1.3058
290,1.2823
291,1.2589
292,1.2354
293,1.2119
294,1.1884
295,1.165
296,1.1415
297,1.1179999999999999
298,1.0946
299,1.0711
300,1.0476
301,1.0242
302,1.0007
303,0.9772200000000001
304,0.95375
305,0.9302799999999999
306,0.90681
307,0.88334
308,0.85987
309,0.8364
310,0.81293
311,0.78946
312,0.76599
313,0.74252
314,0.71906
