time,value
0,-0.72137
1,-0.6702
2,-0.45435
3,-0.20406
4,0.047851
5,0.32844
6,0.63732
7,0.8835299999999999
8,1.082
9,1.19
10,1.2266
11,1.3314
12,1.4172
13,1.3675
14,1.2664
15,1.0365
16,0.7306199999999999
17,0.51991
18,0.20951
19,-0.1031
20,-0.37288000000000004
21,-0.61302
22,-0.71642
23,-0.61916
24,-0.43062
25,-0.1845
26,0.07289
27,0.36401
28,0.6332
29,0.89991
30,1.2355
31,1.496
32,1.4804
33,1.3547
34,1.3141
35,1.2585
36,1.2332
37,1.3271
38,1.5632
39,1.671
40,1.6912
41,1.5143
42,1.3274
43,0.98272
44,0.65669
45,0.38874000000000003
46,0.09824
47,-0.19380999999999998
48,-0.44476000000000004
49,-0.59985
50,-0.40944
51,-0.40608
52,-0.5191600000000001
53,-0.69692
54,-0.9083200000000001
55,-1.0611
56,-1.2395
57,-1.3558
58,-1.4203
59,-1.4234
60,-1.2642
61,-1.0727
62,-0.88754
63,-0.75615
64,-0.68393
65,-0.8128
66,-0.89112
67,-1.0258
68,-1.1294
69,-1.226
70,-1.2334
71,-1.2274
72,-1.2007
73,-1.2208
74,-1.1841
75,-1.1436
76,-0.99769
77,-0.8980100000000001
78,-0.6821
79,-0.53236
