time,value
0,-0.82115
1,-0.8216700000000001
2,-0.8217700000000001
3,-0.8211700000000001
4,-0.8198
5,-0.81775
6,-0.81515
7,-0.81225
8,-0.80937
9,-0.80702
10,-0.80519
11,-0.8038
12,-0.8026399999999999
13,-0.80169
14,-0.8009
15,-0.80001
16,-0.79892
17,-0.7976300000000001
18,-0.7966
19,-0.79557
20,-0.7944100000000001
21,-0.79293
22,-0.7913
23,-0.78968
24,-0.78774
25,-0.78538
26,-0.7825300000000001
27,-0.78012
28,-0.77762
29,-0.77482
30,-0.77153
31,-0.76822
32,-0.76532
33,-0.76221
34,-0.75853
35,-0.75402
36,-0.75022
37,-0.74592
38,-0.74052
39,-0.73354
40,-0.7258600000000001
41,-0.71833
42,-0.71009
43,-0.7008
44,-0.69029
45,-0.68118
46,-0.67184
47,-0.66159
48,-0.64983
49,-0.63777
50,-0.62657
51,-0.61497
52,-0.60243
53,-0.58855
54,-0.57657
55,-0.56411
56,-0.55004
57,-0.53327
58,-0.51495
59,-0.49628
60,-0.47555
61,-0.45203999999999994
62,-0.42531
63,-0.39901
64,-0.37046999999999997
65,-0.33834000000000003
66,-0.30123
67,-0.25998000000000004
68,-0.21548
69,-0.16582
70,-0.11026
71,-0.048527999999999995
72,0.015632
73,0.084239
74,0.15803
75,0.23786
76,0.32273
77,0.41158
78,0.50547
79,0.60417
80,0.70672
81,0.80897
82,0.9104700000000001
83,1.0098
84,1.1061
85,1.198
86,1.2851
87,1.3688
88,1.4504
89,1.5313
90,1.6117
91,1.6929
92,1.7751
93,1.8581
94,1.9409
95,2.0226
96,2.1025
97,2.1795
98,2.253
99,2.3216
100,2.3851
101,2.4428
102,2.4943
103,2.5385
104,2.575
105,2.6036
106,2.6244
107,2.6371
108,2.6412
109,2.6376
110,2.6265
111,2.6078
112,2.5813
113,2.5469999999999997
114,2.505
115,2.4551
116,2.3967
117,2.3285
118,2.2508
119,2.1626
120,2.0628
121,1.9496
122,1.8225
123,1.6817
124,1.5272
125,1.3602
126,1.1822
127,0.99854
128,0.8135399999999999
129,0.63175
130,0.45696000000000003
131,0.29416
132,0.14759
133,0.019021
134,-0.091014
135,-0.1843
136,-0.25913
137,-0.31743000000000005
138,-0.36175
139,-0.39566
140,-0.42036999999999997
141,-0.43672
142,-0.44713
143,-0.45382
144,-0.46021000000000006
145,-0.4638
146,-0.4657
147,-0.46706000000000003
148,-0.46986000000000006
149,-0.47298999999999997
150,-0.47502
151,-0.47673999999999994
152,-0.47898
153,-0.48426
154,-0.48886
155,-0.49338000000000004
156,-0.49871000000000004
157,-0.50671
158,-0.5160399999999999
159,-0.5250100000000001
160,-0.5341100000000001
161,-0.54383
162,-0.5562199999999999
163,-0.56742
164,-0.5775899999999999
165,-0.5872
166,-0.5976100000000001
167,-0.60756
168,-0.61545
169,-0.62163
170,-0.62657
171,-0.6321100000000001
172,-0.63584
173,-0.6381899999999999
174,-0.6398199999999999
175,-0.6419199999999999
176,-0.64427
177,-0.64607
178,-0.6473899999999999
179,-0.64837
180,-0.65008
181,-0.65145
182,-0.65253
183,-0.65347
184,-0.65495
185,-0.65713
186,-0.65947
187,-0.6618
188,-0.6640199999999999
189,-0.66715
190,-0.6702199999999999
191,-0.6731
192,-0.67569
193,-0.67856
194,-0.68185
195,-0.68483
196,-0.68717
197,-0.68862
198,-0.6903600000000001
199,-0.69119
200,-0.69081
201,-0.68898
202,-0.68629
203,-0.6829999999999999
204,-0.67833
205,-0.67204
206,-0.6640199999999999
207,-0.65571
208,-0.6461399999999999
209,-0.6351899999999999
210,-0.62274
211,-0.60934
212,-0.59528
213,-0.57985
214,-0.56277
215,-0.54383
216,-0.52394
217,-0.50236
218,-0.47898999999999997
219,-0.45374
220,-0.42688000000000004
221,-0.39851
222,-0.36846
223,-0.33686
224,-0.304
225,-0.2706
226,-0.23694
227,-0.20367000000000002
228,-0.17143
229,-0.14077
230,-0.11185999999999999
231,-0.084613
232,-0.058802
233,-0.033993
234,-0.0096994
235,0.014852
236,0.040146
237,0.066473
238,0.093836
239,0.12211
240,0.15093
241,0.17965
242,0.20751
243,0.23363
244,0.25737
245,0.27797
246,0.29470999999999997
247,0.3069
248,0.31411
249,0.31606
250,0.31256999999999996
251,0.30366
252,0.28938
253,0.27004
254,0.24561
255,0.21573
256,0.17970999999999998
257,0.13684000000000002
258,0.086501
259,0.028335000000000003
260,-0.037347000000000005
261,-0.10955999999999999
262,-0.18613
263,-0.26478
264,-0.34321999999999997
265,-0.41953999999999997
266,-0.49201000000000006
267,-0.55933
268,-0.6208100000000001
269,-0.67576
