time,value
0,-0.71136
1,-0.71136
2,-0.71136
3,-0.71136
4,-0.71136
5,-0.71136
6,-0.71136
7,-0.71136
8,-0.71136
9,-0.71136
10,-0.71136
11,-0.71136
12,-0.71136
13,-0.71136
14,-0.71136
15,-0.71136
16,-0.71136
17,-0.71136
18,-0.71136
19,-0.71136
20,-0.71136
21,-0.71136
22,-0.71136
23,-0.71136
24,-0.71136
25,-0.71136
26,-0.71136
27,-0.71136
28,-0.71136
29,-0.71136
30,-0.71136
31,-0.71136
32,-0.7116899999999999
33,-0.71912
34,-0.73423
35,-0.75339
36,-0.77255
37,-0.79145
38,-0.80114
39,-0.80114
40,-0.80114
41,-0.80114
42,-0.80114
43,-0.80114
44,-0.80114
45,-0.80114
46,-0.80114
47,-0.80114
48,-0.80114
49,-0.80114
50,-0.80114
51,-0.80114
52,-0.80623
53,-0.81501
54,-0.8245899999999999
55,-0.83416
56,-0.8437399999999999
57,-0.8533200000000001
58,-0.8629
59,-0.8724799999999999
60,-0.88169
61,-0.88984
62,-0.89092
63,-0.89092
64,-0.89092
65,-0.89092
66,-0.9013200000000001
67,-0.9175200000000001
68,-0.9366700000000001
69,-0.95583
70,-0.9708899999999999
71,-0.9807100000000001
72,-0.9807100000000001
73,-0.9807100000000001
74,-0.9805
75,-0.97993
76,-0.96126
77,-0.9421
78,-0.92295
79,-0.90379
80,-0.8846299999999999
81,-0.8654700000000001
82,-0.8463200000000001
83,-0.82716
84,-0.8114600000000001
85,-0.80114
86,-0.80114
87,-0.80114
88,-0.80114
89,-0.80183
90,-0.8105600000000001
91,-0.8198700000000001
92,-0.82945
93,-0.8390299999999999
94,-0.8533
95,-0.87034
96,-0.88949
97,-0.90865
98,-0.9266399999999999
99,-0.94139
100,-0.9509700000000001
101,-0.96055
102,-0.9701299999999999
103,-0.9797100000000001
104,-0.9892799999999999
105,-0.9988600000000001
106,-1.0084
107,-1.0181
108,-1.0317
109,-1.0488
110,-1.0679
111,-1.0871
112,-1.1055
113,-1.1154
114,-1.1154
115,-1.1154
116,-1.1154
117,-1.1154
118,-1.1154
119,-1.1154
120,-1.1154
121,-1.115
122,-1.1122
123,-1.1044
124,-1.0948
125,-1.0852
126,-1.0756
127,-1.0761
128,-1.0845
129,-1.0941
130,-1.1037
131,-1.1196
132,-1.1451
133,-1.1834
134,-1.2217
135,-1.2585
136,-1.2899
137,-1.2949
138,-1.2949
139,-1.2949
140,-1.2949
141,-1.2846
142,-1.2681
143,-1.2489
144,-1.2298
145,-1.2106
146,-1.1914
147,-1.1723
148,-1.1531
149,-1.133
150,-1.111
151,-1.0463
152,-0.9792799999999999
153,-0.91222
154,-0.8451700000000001
155,-0.76276
156,-0.67247
157,-0.57668
158,-0.48089
159,-0.38511
160,-0.28931999999999997
161,-0.19353
162,-0.48715
163,-0.052489999999999995
164,0.47551000000000004
165,0.20859
166,0.32315
167,0.43809
168,0.55304
169,0.65837
170,0.75834
171,0.85413
172,0.94991
173,1.0390000000000001
174,1.1129
175,1.1608
176,1.2087
177,1.2566
178,1.3045
179,1.3524
180,1.4003
181,1.4482
182,1.496
183,1.5142
184,1.5098
185,1.4906
186,1.4715
187,1.4517
188,1.4280000000000002
189,1.3993
190,1.3705
191,1.3418
192,1.3148
193,1.2928
194,1.2733
195,1.2541
196,1.2365
197,1.2331
198,1.2524
199,1.2812
200,1.3099
201,1.3386
202,1.3723
203,1.4103
204,1.4486
205,1.4869
206,1.5211
207,1.5482
208,1.5675
209,1.5867
210,1.6063
211,1.6274
212,1.6547
213,1.6835
214,1.7122
215,1.7409
216,1.7438
217,1.7305
218,1.7114
219,1.6922
220,1.673
221,1.6539
222,1.6347
223,1.6156
224,1.5961
225,1.5761
226,1.5481
227,1.5194
228,1.4906
229,1.4619
230,1.4331
231,1.4044
232,1.3757
233,1.3469
234,1.3219999999999998
235,1.3023
236,1.2927
237,1.2832
238,1.2736
239,1.2643
240,1.264
241,1.2639
242,1.2639
243,1.2639
244,1.2491
245,1.2266
246,1.1978
247,1.1691
248,1.1389
249,1.1057
250,1.0674
251,1.0291
252,0.9908
253,0.95249
254,0.91417
255,0.8758600000000001
256,0.83754
257,0.79923
258,0.7653300000000001
259,0.73446
260,0.70573
261,0.67699
262,0.64746
263,0.61423
264,0.57591
265,0.5376
266,0.49928
267,0.46431999999999995
268,0.44001
269,0.42008
270,0.40092
271,0.38201
272,0.36628
273,0.35474
274,0.34517
275,0.33559
276,0.32600999999999997
277,0.32127
278,0.32115
279,0.32115
280,0.32115
281,0.32115
282,0.32115
283,0.32115
284,0.32115
285,0.32115
286,0.32115
287,0.32115
288,0.32115
289,0.32115
290,0.32115
291,0.32115
292,0.32115
293,0.32115
294,0.32115
295,0.32328
296,0.3283
297,0.33787
298,0.34745
299,0.35736
300,0.36808
301,0.38634
302,0.4055
303,0.42466000000000004
304,0.44381000000000004
305,0.46297
306,0.48213
307,0.50129
308,0.52044
309,0.53761
310,0.55218
311,0.56176
312,0.57134
313,0.58092
314,0.5905
315,0.13575
316,0.13575
317,0.13575
318,0.13575
319,0.13575
320,0.13575
321,0.13575
322,0.13575
323,0.13575
324,0.13575
325,0.13575
326,0.13575
327,0.13575
328,0.13575
329,0.13575
330,0.13575
331,0.13575
332,0.13575
333,0.13575
334,0.13575
335,0.13575
336,0.13575
337,0.13575
338,0.13575
339,0.13575
340,0.13575
341,0.13575
342,0.13575
343,0.13575
344,0.13575
345,0.13575
346,0.13575
347,0.13575
348,0.13575
349,0.13575
350,0.13575
351,0.13575
352,0.13575
353,0.13575
354,0.13575
355,0.13575
356,0.13575
357,0.13575
358,0.13575
359,0.13575
360,0.13575
361,0.13575
362,0.13575
363,0.13575
364,0.13575
365,0.13575
366,0.13575
367,0.15104
368,0.17744000000000001
369,0.20624
370,0.23503000000000002
371,0.25744
372,0.27071
373,0.27071
374,0.27071
375,0.27071
376,0.27071
377,0.27071
378,0.27071
379,0.27071
380,0.27071
381,0.28633000000000003
382,0.31068
383,0.33948
384,0.36827
385,0.40323000000000003
386,0.44606999999999997
387,0.50367
388,0.56126
389,0.61854
390,0.67528
391,0.70482
392,0.73361
393,0.76241
394,0.7912100000000001
395,0.80477
396,0.81055
397,0.81055
398,0.81055
399,0.80535
400,0.7920699999999999
401,0.76327
402,0.73447
403,0.70568
404,0.67479
405,0.6197699999999999
406,0.56298
407,0.50538
408,0.44778999999999997
409,0.4043
410,0.36913
411,0.34034000000000003
412,0.31154
413,0.27923000000000003
414,0.23718000000000003
415,0.17959
416,0.12199000000000002
417,0.32356999999999997
418,0.098428
419,-0.38744
420,-0.16297
421,-0.24936
422,-0.33554
423,-0.4099
424,-0.47372
425,-0.53132
426,-0.58891
427,-0.64541
428,-0.68906
429,-0.71786
430,-0.74665
431,-0.77545
432,-0.7986
433,-0.80806
434,-0.80898
435,-0.80898
436,-0.80898
437,-0.80898
438,-0.80898
439,-0.80898
440,-0.80898
441,-0.80898
442,-0.83916
443,-0.8932200000000001
444,-0.95081
445,-1.0084
446,-1.0787
447,-1.1683
448,-1.2835
449,-1.3987
450,-1.5103
451,-1.61
452,-1.6501
453,-1.6789
454,-1.7077
455,-1.7365
456,-1.7653
457,-1.7941
458,-1.8229
459,-1.8517
460,-1.8679
461,-1.868
462,-1.8392
463,-1.8104
464,-1.7782
465,-1.7391
466,-1.5461
467,-1.3445
468,-1.1429
469,-0.9413600000000001
470,-0.73978
471,-0.5382
472,-0.33660999999999996
473,-0.13502999999999998
474,0.30676
475,0.24921999999999997
476,0.42200000000000004
477,0.59478
478,0.76757
479,0.94035
480,1.1131
481,1.2859
482,1.4587
483,1.6315
484,1.7754
485,1.9031
486,2.0183
487,2.1335
488,2.2327
489,2.2951
490,2.2951
491,2.2951
492,2.2951
493,2.3026
494,2.3499
495,2.4051
496,2.4627
497,2.5203
498,2.5524
499,2.565
500,2.565
501,2.565
502,2.5544
503,2.4722
504,2.2994
505,2.1266
506,1.9538
507,1.7757
508,1.5827
509,1.3822
510,1.1806
511,0.9854799999999999
512,0.85009
513,0.81055
514,0.81055
515,0.81055
516,0.81055
517,0.84025
518,0.89565
519,0.95325
520,1.0108
521,1.056
522,1.08
523,1.0805
524,1.0805
525,1.0792
526,1.0732
527,1.0487
528,1.0199
529,0.9910700000000001
530,0.9622700000000001
531,0.90238
532,0.82301
533,0.7366199999999999
534,0.65023
535,0.5511
536,0.43532
537,0.29134
538,0.14735
539,0.15155
540,-0.13724
541,-0.25451999999999997
542,-0.36971
543,-0.4849
544,-0.60009
545,-0.66872
546,-0.71313
547,-0.74193
548,-0.77072
549,-0.77065
550,-0.73161
551,-0.61642
552,-0.5012300000000001
553,-0.38604
554,-0.27159
555,-0.18434
556,-0.48662
557,-0.054664
558,0.3773
559,0.11725999999999999
560,0.13575
561,0.13575
562,0.13575
563,0.1224
564,0.41598
565,-0.10430999999999999
566,-0.44793999999999995
567,-0.17629
568,-0.26269000000000003
569,-0.34908
570,-0.43546999999999997
571,-0.52186
572,-0.60825
573,-0.68138
574,-0.74536
575,-0.80296
576,-0.86055
577,-0.91815
578,-0.9757399999999999
579,-1.0333
580,-1.0909
581,-1.1485
582,-1.2011
583,-1.2376
584,-1.2676
585,-1.2964
586,-1.3237
587,-1.3319
588,-1.3149
589,-1.2861
590,-1.2573
591,-1.2285
592,-1.1997
593,-1.1709
594,-1.1421
595,-1.1133
596,-1.0845
597,-1.0557
598,-1.0269
599,-0.9980899999999999
600,-0.96929
601,-0.9405
602,-0.9117
603,-0.8829
604,-0.85411
605,-0.82531
606,-0.81195
607,-0.80898
608,-0.80898
609,-0.80898
610,-0.81538
611,-0.83047
612,-0.85926
613,-0.8880600000000001
614,-0.9158799999999999
615,-0.94124
616,-0.94394
617,-0.94394
618,-0.94394
619,-0.94394
620,-0.91275
621,-0.86485
622,-0.8072600000000001
623,-0.74966
624,-0.68608
625,-0.6147
626,-0.5283100000000001
627,-0.44192
628,-0.35553
629,-0.26913000000000004
630,0.853
631,0.853
632,0.853
633,0.853
634,0.853
635,0.853
636,0.853
637,0.853
638,0.853
639,0.853
640,0.853
641,0.853
642,0.853
643,0.853
644,0.853
645,0.853
646,0.853
647,0.853
648,0.853
649,0.853
650,0.853
651,0.853
652,0.853
653,0.853
654,0.853
655,0.853
656,0.853
657,0.853
658,0.853
659,0.853
660,0.853
661,0.853
662,0.853
663,0.853
664,0.853
665,0.853
666,0.853
667,0.853
668,0.853
669,0.853
670,0.853
671,0.853
672,0.853
673,0.853
674,0.853
675,0.853
676,0.853
677,0.853
678,0.853
679,0.853
680,0.853
681,0.853
682,0.853
683,0.853
684,0.853
685,0.853
686,0.8427100000000001
687,0.81771
688,0.77135
689,0.7249800000000001
690,0.6804
691,0.64095
692,0.63572
693,0.63572
694,0.63572
695,0.63572
696,0.63572
697,0.63572
698,0.63572
699,0.63572
700,0.64564
701,0.66824
702,0.7146
703,0.76097
704,0.80683
705,0.8518
706,0.853
707,0.853
708,0.853
709,0.853
710,0.8775200000000001
711,0.91458
712,0.96095
713,1.0073
714,1.0453
715,1.0703
716,1.0703
717,1.0703
718,1.0703
719,1.077
720,1.1614
721,1.2516
722,1.3443
723,1.4369999999999998
724,1.4843
725,1.5048
726,1.5048
727,1.5048
728,1.4992
729,1.4779
730,1.4315
731,1.3851
732,1.3388
733,1.2924
734,1.246
735,1.1997
736,1.1533
737,1.1066
738,1.0409
739,0.9581799999999999
740,0.86545
741,0.77273
742,0.68177
743,0.6115
744,0.56514
745,0.51877
746,0.47241000000000005
747,0.42605
748,0.37969
749,0.33332
750,0.28696
751,0.24574000000000001
752,0.2409
753,0.30772
754,0.40045
755,0.49317
756,0.5859
757,0.63002
758,0.63572
759,0.63572
760,0.63572
761,0.62552
762,0.5997399999999999
763,0.55337
764,0.5070100000000001
765,0.45874
766,0.40407
767,0.31740999999999997
768,0.22468000000000002
769,0.13196
770,0.19774
771,-0.39154
772,-0.21126
773,-0.35035
774,-0.48944
775,-0.63865
776,-0.80083
777,-0.9862799999999999
778,-1.1717
779,-1.3544
780,-1.5315
781,-1.5848
782,-1.6312
783,-1.6776
784,-1.7239
785,-1.7207
786,-1.6921
787,-1.6457
788,-1.5994
789,-1.5530000000000002
790,-1.5066
791,-1.4603
792,-1.4139
793,-1.3676
794,-1.3166
795,-1.183
796,-1.0458
797,-0.9067
798,-0.76761
799,-0.62852
800,-0.48944
801,-0.35035
802,-0.21126
803,-0.42378000000000005
804,0.059348000000000005
805,0.29116
806,0.10428
807,0.15064
808,0.16669
809,0.11538
810,-0.15314
811,-0.33859
812,-0.52404
813,-0.68891
814,-0.83819
815,-0.9772799999999999
816,-1.1164
817,-1.2526
818,-1.3696
819,-1.4624
820,-1.5551
821,-1.6478
822,-1.6628
823,-1.4628
824,-1.1537
825,-0.8292
826,-0.5061399999999999
827,-0.19683
828,0.45377
829,0.36861
830,0.64679
831,0.92496
832,1.0358
833,1.0018
834,0.95541
835,0.90905
836,0.8526600000000001
837,0.7793100000000001
838,0.68692
839,0.5942
840,0.4995
841,0.39709
842,0.26482
843,0.12573
844,-0.065209
845,-0.15244000000000002
846,-0.2665
847,-0.36488000000000004
848,-0.45761
849,-0.55033
850,-0.6430600000000001
851,-0.73578
852,-0.8285100000000001
853,-0.9212299999999999
854,-1.0114
855,-1.0958
856,-1.1025
857,-1.1025
858,-1.1025
859,-1.1025
860,-1.0775
861,-1.0396
862,-0.9932
863,-0.94683
864,-0.89118
865,-0.8229700000000001
866,-0.73025
867,-0.63752
868,-0.5448
869,-0.45565
870,-0.49786
871,-0.54272
872,-0.58908
873,-0.63544
874,-0.70557
875,-0.78837
876,-0.8811
877,-0.97382
878,-1.0665
879,-1.1593
880,-1.252
881,-1.3447
882,-1.4374
883,-1.5249
884,-1.5782
885,-1.6264
886,-1.6727
887,-1.7191
888,-1.7654
889,-1.8118
890,-1.8582
891,-1.9045
892,-1.9509
893,-1.9973
894,-2.0436
895,-2.09
896,-2.1363
897,-2.1584
898,-2.103
899,-2.0159
900,-1.9232
901,-1.8293
902,-1.72
903,-1.5904
904,-1.4513
905,-1.3122
906,-1.1731
907,-1.0809
908,-1.0333
909,-0.9869700000000001
910,-0.9406100000000001
911,-0.90404
912,-0.8860399999999999
913,-0.88525
914,-0.88525
915,-0.88133
916,-0.85919
917,-0.78145
918,-0.6887300000000001
919,-0.596
920,-0.5032800000000001
921,-0.41055
922,-0.31783
923,-0.2251
924,-0.13238
925,-0.19668
926,0.26694
927,0.1458
928,0.23851999999999998
929,0.33125
930,0.42396999999999996
931,0.5167
932,0.60942
933,0.70215
934,0.79487
935,0.86249
936,0.91666
937,0.9630200000000001
938,1.0094
939,1.0365
940,1.0384
941,0.9920899999999999
942,0.9457200000000001
943,0.89936
944,0.853
