time,value
0,1.821
1,1.6788
2,1.4831
3,1.2631
4,1.0675
5,0.85196
6,0.71635
7,0.49738000000000004
8,0.35401
9,0.34036
10,0.13744
11,0.16046
12,-0.034259
13,-0.011142
14,-0.17371
15,-0.053525
16,-0.076752
17,-0.10092999999999999
18,-0.09952000000000001
19,-0.2555
20,-0.29941999999999996
21,-0.45587
22,-0.64105
23,-0.69738
24,-0.8486299999999999
25,-0.9556899999999999
26,-1.008
27,-1.1222
28,-1.0888
29,-1.2183
30,-1.2543
31,-1.2993
32,-1.2748
33,-1.2786
34,-1.2841
35,-1.1664
36,-1.1579
37,-1.0629
38,-1.0390000000000001
39,-0.9679700000000001
40,-0.9038
41,-0.80323
42,-0.70767
43,-0.52108
44,-0.43427
45,-0.2617
46,-0.15178
47,0.00087388
48,0.16906
49,0.33966
50,0.5099
51,0.67135
52,0.8604299999999999
53,1.0298
54,1.2101
55,1.3783
56,1.5591
57,1.7848
58,1.9864
59,2.0855
60,1.9185
61,1.9724
62,1.9375
63,1.8622
64,1.7695
65,1.709
66,1.5802
67,1.4905
68,1.306
69,1.1252
70,0.94029
71,0.82755
72,0.72602
73,0.5534399999999999
74,0.41058
75,0.28607
76,0.088625
77,0.02895
78,-0.10772999999999999
79,-0.21261999999999998
80,-0.37911999999999996
81,-0.46998999999999996
82,-0.62985
83,-0.69172
84,-0.7570600000000001
85,-0.92396
86,-0.9407700000000001
87,-0.94863
88,-1.1263
89,-1.1405
90,-1.1177
91,-1.1684
92,-1.3226
93,-1.2512
94,-1.2333
95,-1.1705
96,-1.2512
97,-1.1542
98,-1.0738
99,-1.0902
100,-0.9647700000000001
101,-0.7570600000000001
102,-0.80824
103,-1.0055
104,-0.9075
105,-0.8325100000000001
106,-0.7125100000000001
107,-0.54929
108,-0.44643
109,-0.23229
110,-0.061977
111,-0.22935999999999998
112,-0.40333
113,-0.44319
114,-0.25153000000000003
115,-0.1165
116,-0.14114000000000002
117,0.040744999999999996
118,0.13291
119,0.32094
120,0.45452
121,0.64305
122,0.81087
123,0.9552
124,1.1508
125,1.3715
126,1.5691
127,1.7952
