time,value
0,0.18085
1,-0.060580999999999996
2,-0.060580999999999996
3,-0.060580999999999996
4,-0.060580999999999996
5,-0.060580999999999996
6,-0.060580999999999996
7,-0.060580999999999996
8,-0.060580999999999996
9,-0.060580999999999996
10,-0.060580999999999996
11,-0.060580999999999996
12,-0.060580999999999996
13,-0.060580999999999996
14,-0.060580999999999996
15,-0.060580999999999996
16,-0.060580999999999996
17,-0.060580999999999996
18,-0.060580999999999996
19,-0.14106
20,-0.060580999999999996
21,-0.060580999999999996
22,-0.060580999999999996
23,-0.060580999999999996
24,-0.060580999999999996
25,-0.060580999999999996
26,-0.060580999999999996
27,-0.060580999999999996
28,-0.14106
29,-0.060580999999999996
30,-0.060580999999999996
31,-0.060580999999999996
32,-0.060580999999999996
33,-0.060580999999999996
34,-0.060580999999999996
35,-0.060580999999999996
36,-0.060580999999999996
37,-0.060580999999999996
38,-0.060580999999999996
39,-0.14106
40,-0.060580999999999996
41,-0.060580999999999996
42,-0.060580999999999996
43,-0.060580999999999996
44,-0.060580999999999996
45,-0.060580999999999996
46,-0.060580999999999996
47,-0.060580999999999996
48,-0.060580999999999996
49,-0.060580999999999996
50,-0.14106
51,-0.060580999999999996
52,-0.060580999999999996
53,-0.060580999999999996
54,-0.060580999999999996
55,-0.060580999999999996
56,-0.060580999999999996
57,-0.060580999999999996
58,-0.060580999999999996
59,-0.14106
60,-0.060580999999999996
61,-0.060580999999999996
62,-0.060580999999999996
63,-0.060580999999999996
64,-0.060580999999999996
65,-0.060580999999999996
66,-0.060580999999999996
67,-0.14106
68,-0.060580999999999996
69,-0.060580999999999996
70,-0.060580999999999996
71,-0.060580999999999996
72,-0.060580999999999996
73,-0.060580999999999996
74,-0.060580999999999996
75,-0.14106
76,-0.060580999999999996
77,15.149000000000001
78,0.8246600000000001
79,0.019896
80,-0.060580999999999996
81,-0.060580999999999996
82,-0.14106
83,-0.060580999999999996
84,-0.060580999999999996
85,-0.060580999999999996
86,-0.060580999999999996
87,-0.060580999999999996
88,-0.060580999999999996
89,-0.060580999999999996
90,-0.14106
91,-0.060580999999999996
92,-0.060580999999999996
93,-0.060580999999999996
94,-0.060580999999999996
95,-0.060580999999999996
96,-0.060580999999999996
97,-0.14106
98,-0.060580999999999996
99,-0.060580999999999996
100,-0.060580999999999996
101,-0.060580999999999996
102,-0.060580999999999996
103,-0.060580999999999996
104,-0.060580999999999996
105,-0.060580999999999996
106,-0.14106
107,-0.060580999999999996
108,-0.060580999999999996
109,-0.060580999999999996
110,-0.060580999999999996
111,-0.060580999999999996
112,-0.060580999999999996
113,-0.060580999999999996
114,-0.060580999999999996
115,-0.14106
116,-0.060580999999999996
117,-0.060580999999999996
118,-0.060580999999999996
119,-0.060580999999999996
120,-0.060580999999999996
121,-0.060580999999999996
122,-0.060580999999999996
123,-0.060580999999999996
124,-0.060580999999999996
125,-0.14106
126,-0.060580999999999996
127,-0.060580999999999996
128,-0.060580999999999996
129,-0.060580999999999996
130,-0.060580999999999996
131,-0.060580999999999996
132,-0.060580999999999996
133,-0.060580999999999996
134,-0.14106
135,-0.060580999999999996
136,-0.060580999999999996
137,-0.060580999999999996
138,-0.060580999999999996
139,-0.060580999999999996
140,-0.060580999999999996
141,-0.060580999999999996
142,-0.060580999999999996
143,-0.060580999999999996
144,-0.14106
145,-0.060580999999999996
146,-0.060580999999999996
147,-0.060580999999999996
148,-0.060580999999999996
149,-0.060580999999999996
150,-0.060580999999999996
151,-0.14106
152,-0.060580999999999996
153,-0.060580999999999996
154,-0.060580999999999996
155,-0.060580999999999996
156,-0.060580999999999996
157,-0.060580999999999996
158,-0.060580999999999996
159,-0.060580999999999996
160,-0.14106
161,-0.060580999999999996
162,-0.060580999999999996
163,-0.060580999999999996
164,-0.060580999999999996
165,-0.060580999999999996
166,-0.060580999999999996
167,-0.14106
168,-0.060580999999999996
169,-0.060580999999999996
170,-0.060580999999999996
171,-0.060580999999999996
172,-0.060580999999999996
173,-0.060580999999999996
174,-0.14106
175,-0.060580999999999996
176,-0.060580999999999996
177,-0.060580999999999996
178,-0.060580999999999996
179,-0.14106
180,-0.060580999999999996
181,-0.060580999999999996
182,-0.060580999999999996
183,-0.060580999999999996
184,-0.060580999999999996
185,-0.060580999999999996
186,-0.14106
187,-0.060580999999999996
188,-0.060580999999999996
189,-0.060580999999999996
190,-0.060580999999999996
191,-0.060580999999999996
192,-0.060580999999999996
193,-0.060580999999999996
194,-0.060580999999999996
195,-0.060580999999999996
196,-0.14106
197,-0.060580999999999996
198,-0.060580999999999996
199,-0.060580999999999996
200,-0.060580999999999996
201,-0.060580999999999996
202,-0.060580999999999996
203,-0.060580999999999996
204,-0.060580999999999996
205,-0.060580999999999996
206,-0.060580999999999996
207,-0.060580999999999996
208,-0.14106
209,-0.060580999999999996
210,-0.060580999999999996
211,-0.060580999999999996
212,-0.060580999999999996
213,-0.060580999999999996
214,-0.060580999999999996
215,-0.060580999999999996
216,-0.14106
217,-0.060580999999999996
218,-0.060580999999999996
219,-0.060580999999999996
220,-0.060580999999999996
221,-0.060580999999999996
222,-0.060580999999999996
223,-0.060580999999999996
224,-0.060580999999999996
225,-0.060580999999999996
226,-0.060580999999999996
227,-0.14106
228,-0.060580999999999996
229,-0.060580999999999996
230,-0.060580999999999996
231,-0.060580999999999996
232,-0.14106
233,-0.060580999999999996
234,-0.060580999999999996
235,-0.060580999999999996
236,-0.060580999999999996
237,-0.14106
238,-0.060580999999999996
239,-0.060580999999999996
240,-0.060580999999999996
241,-0.14106
242,-0.060580999999999996
243,-0.060580999999999996
244,-0.060580999999999996
245,-0.14106
246,-0.060580999999999996
247,-0.060580999999999996
248,-0.14106
249,-0.060580999999999996
250,-0.060580999999999996
251,-0.14106
252,-0.14106
253,-0.14106
254,-0.14106
255,-0.14106
256,-0.14106
257,-0.14106
258,-0.14106
259,-0.14106
260,-0.14106
261,-0.14106
262,-0.14106
263,-0.14106
264,-0.14106
265,-0.14106
266,-0.14106
267,-0.14106
268,-0.14106
269,-0.14106
270,-0.14106
271,-0.14106
272,-0.14106
273,-0.14106
274,-0.14106
275,-0.14106
276,-0.14106
277,-0.14106
278,-0.14106
279,-0.14106
280,-0.14106
281,-0.14106
282,-0.14106
283,-0.14106
284,-0.14106
285,-0.14106
286,-0.14106
287,-0.14106
288,-0.14106
289,-0.14106
290,15.954
291,0.019896
292,-0.060580999999999996
293,-0.060580999999999996
294,-0.14106
295,-0.060580999999999996
296,-0.060580999999999996
297,-0.060580999999999996
298,-0.14106
299,-0.060580999999999996
300,-0.060580999999999996
301,-0.060580999999999996
302,-0.14106
303,-0.060580999999999996
304,-0.14106
305,-0.14106
306,-0.14106
307,-0.14106
308,-0.14106
309,-0.14106
310,-0.14106
311,-0.14106
312,-0.14106
313,-0.14106
314,-0.14106
315,-0.14106
316,-0.14106
317,-0.14106
318,-0.14106
319,-0.14106
320,-0.14106
321,-0.14106
322,-0.14106
323,-0.14106
324,-0.14106
325,-0.14106
326,-0.14106
327,-0.14106
328,-0.14106
329,-0.14106
330,-0.14106
331,-0.14106
332,-0.14106
333,-0.14106
334,-0.14106
335,-0.14106
336,-0.14106
337,-0.14106
338,-0.14106
339,-0.14106
340,-0.14106
341,-0.14106
342,-0.14106
343,-0.14106
344,-0.14106
345,-0.14106
346,-0.14106
347,-0.14106
348,-0.14106
349,-0.14106
350,-0.14106
351,-0.14106
352,-0.14106
353,-0.14106
354,-0.14106
355,-0.14106
356,-0.14106
357,-0.14106
358,-0.14106
359,-0.14106
360,-0.14106
361,-0.14106
362,-0.14106
363,-0.14106
364,-0.14106
365,-0.14106
366,-0.14106
367,-0.14106
368,-0.14106
369,-0.14106
370,-0.14106
371,-0.14106
372,-0.14106
373,7.7456
374,0.8246600000000001
375,0.019896
376,-0.060580999999999996
377,-0.14106
378,-0.060580999999999996
379,-0.060580999999999996
380,-0.14106
381,-0.060580999999999996
382,-0.060580999999999996
383,-0.060580999999999996
384,-0.14106
385,-0.060580999999999996
386,-0.060580999999999996
387,-0.14106
388,-0.060580999999999996
389,-0.060580999999999996
390,-0.060580999999999996
391,-0.14106
392,-0.060580999999999996
393,-0.060580999999999996
394,-0.060580999999999996
395,-0.14106
396,-0.060580999999999996
397,-0.060580999999999996
398,-0.060580999999999996
399,-0.14106
400,-0.060580999999999996
401,-0.060580999999999996
402,-0.060580999999999996
403,-0.14106
404,-0.060580999999999996
405,-0.060580999999999996
406,-0.060580999999999996
407,-0.14106
408,-0.060580999999999996
409,-0.060580999999999996
410,-0.060580999999999996
411,-0.14106
412,-0.060580999999999996
413,-0.060580999999999996
414,-0.060580999999999996
415,-0.14106
416,-0.060580999999999996
417,-0.060580999999999996
418,-0.14106
419,-0.060580999999999996
420,-0.060580999999999996
421,-0.060580999999999996
422,-0.14106
423,-0.060580999999999996
424,-0.060580999999999996
425,-0.14106
426,-0.060580999999999996
427,-0.060580999999999996
428,-0.14106
429,-0.060580999999999996
430,-0.060580999999999996
431,-0.060580999999999996
432,-0.14106
433,-0.060580999999999996
434,-0.060580999999999996
435,-0.14106
436,-0.060580999999999996
437,-0.060580999999999996
438,-0.14106
439,-0.060580999999999996
440,-0.060580999999999996
441,-0.060580999999999996
442,-0.14106
443,-0.060580999999999996
444,-0.060580999999999996
445,-0.060580999999999996
446,-0.14106
447,-0.060580999999999996
448,-0.060580999999999996
449,-0.14106
450,-0.060580999999999996
451,-0.060580999999999996
452,-0.060580999999999996
453,-0.060580999999999996
454,-0.14106
455,-0.060580999999999996
456,-0.060580999999999996
457,-0.060580999999999996
458,-0.14106
459,-0.060580999999999996
460,-0.060580999999999996
461,-0.14106
462,-0.060580999999999996
463,-0.060580999999999996
464,-0.060580999999999996
465,-0.14106
466,-0.060580999999999996
467,-0.060580999999999996
468,-0.060580999999999996
469,-0.14106
470,-0.060580999999999996
471,-0.060580999999999996
472,-0.060580999999999996
473,-0.14106
474,-0.060580999999999996
475,-0.060580999999999996
476,-0.060580999999999996
477,-0.14106
478,-0.060580999999999996
479,-0.060580999999999996
480,-0.060580999999999996
481,-0.14106
482,-0.060580999999999996
483,-0.060580999999999996
484,-0.060580999999999996
485,-0.14106
486,-0.060580999999999996
487,-0.060580999999999996
488,-0.060580999999999996
489,-0.060580999999999996
490,-0.14106
491,-0.060580999999999996
492,-0.060580999999999996
493,-0.060580999999999996
494,-0.14106
495,-0.060580999999999996
496,-0.060580999999999996
497,-0.060580999999999996
498,-0.060580999999999996
499,-0.14106
500,-0.060580999999999996
501,-0.060580999999999996
502,-0.060580999999999996
503,-0.14106
504,-0.060580999999999996
505,-0.060580999999999996
506,-0.060580999999999996
507,-0.14106
508,-0.060580999999999996
509,-0.060580999999999996
510,-0.060580999999999996
511,-0.14106
512,-0.060580999999999996
513,-0.060580999999999996
514,-0.060580999999999996
515,-0.14106
516,-0.060580999999999996
517,-0.060580999999999996
518,-0.060580999999999996
519,-0.14106
520,-0.060580999999999996
521,-0.060580999999999996
522,-0.060580999999999996
523,-0.14106
524,-0.060580999999999996
525,-0.060580999999999996
526,-0.060580999999999996
527,-0.14106
528,-0.060580999999999996
529,-0.060580999999999996
530,-0.14106
531,-0.060580999999999996
532,-0.060580999999999996
533,-0.14106
534,-0.060580999999999996
535,-0.060580999999999996
536,-0.14106
537,-0.060580999999999996
538,-0.14106
539,-0.060580999999999996
540,-0.060580999999999996
541,-0.14106
542,-0.060580999999999996
543,-0.060580999999999996
544,-0.14106
545,-0.060580999999999996
546,-0.14106
547,-0.060580999999999996
548,-0.060580999999999996
549,-0.060580999999999996
550,-0.14106
551,-0.060580999999999996
552,-0.14106
553,-0.060580999999999996
554,-0.060580999999999996
555,-0.14106
556,-0.060580999999999996
557,-0.060580999999999996
558,-0.14106
559,-0.060580999999999996
560,-0.060580999999999996
561,-0.060580999999999996
562,-0.14106
563,-0.060580999999999996
564,-0.060580999999999996
565,-0.060580999999999996
566,-0.14106
567,-0.060580999999999996
568,-0.060580999999999996
569,-0.14106
570,-0.060580999999999996
571,-0.060580999999999996
572,-0.14106
573,-0.060580999999999996
574,-0.060580999999999996
575,-0.14106
576,-0.060580999999999996
577,-0.14106
578,-0.060580999999999996
579,-0.14106
580,-0.060580999999999996
581,-0.060580999999999996
582,-0.14106
583,-0.060580999999999996
584,-0.060580999999999996
585,-0.060580999999999996
586,-0.14106
587,-0.060580999999999996
588,-0.060580999999999996
589,-0.14106
590,-0.060580999999999996
591,5.1704
592,3.0780000000000003
593,0.18085
594,0.019896
595,-0.060580999999999996
596,-0.14106
597,-0.060580999999999996
598,-0.060580999999999996
599,-0.060580999999999996
600,-0.14106
601,-0.060580999999999996
602,-0.060580999999999996
603,-0.14106
604,-0.060580999999999996
605,-0.060580999999999996
606,-0.14106
607,-0.060580999999999996
608,-0.060580999999999996
609,-0.060580999999999996
610,-0.14106
611,11.448
612,0.18085
613,0.019896
614,-0.060580999999999996
615,-0.14106
616,-0.060580999999999996
617,-0.060580999999999996
618,-0.14106
619,-0.060580999999999996
620,-0.060580999999999996
621,-0.060580999999999996
622,-0.14106
623,-0.060580999999999996
624,-0.060580999999999996
625,-0.060580999999999996
626,-0.14106
627,-0.060580999999999996
628,-0.060580999999999996
629,-0.060580999999999996
630,-0.14106
631,-0.060580999999999996
632,-0.060580999999999996
633,-0.060580999999999996
634,-0.060580999999999996
635,-0.14106
636,-0.060580999999999996
637,-0.060580999999999996
638,-0.060580999999999996
639,-0.060580999999999996
640,-0.14106
641,-0.060580999999999996
642,-0.060580999999999996
643,-0.060580999999999996
644,-0.060580999999999996
645,-0.060580999999999996
646,-0.14106
647,-0.060580999999999996
648,-0.060580999999999996
649,-0.060580999999999996
650,-0.060580999999999996
651,-0.14106
652,-0.060580999999999996
653,-0.060580999999999996
654,-0.060580999999999996
655,-0.14106
656,-0.060580999999999996
657,-0.060580999999999996
658,-0.060580999999999996
659,-0.060580999999999996
660,-0.14106
661,-0.060580999999999996
662,-0.060580999999999996
663,-0.060580999999999996
664,-0.060580999999999996
665,-0.060580999999999996
666,-0.060580999999999996
667,-0.14106
668,-0.060580999999999996
669,-0.060580999999999996
670,-0.060580999999999996
671,-0.060580999999999996
672,-0.060580999999999996
673,-0.060580999999999996
674,-0.060580999999999996
675,-0.060580999999999996
676,-0.14106
677,-0.060580999999999996
678,-0.060580999999999996
679,-0.060580999999999996
680,-0.060580999999999996
681,-0.060580999999999996
682,-0.060580999999999996
683,-0.14106
684,-0.060580999999999996
685,-0.060580999999999996
686,-0.060580999999999996
687,-0.060580999999999996
688,-0.060580999999999996
689,-0.060580999999999996
690,-0.14106
691,-0.060580999999999996
692,-0.060580999999999996
693,-0.060580999999999996
694,-0.060580999999999996
695,-0.060580999999999996
696,-0.060580999999999996
697,-0.14106
698,-0.060580999999999996
699,-0.060580999999999996
700,-0.060580999999999996
701,-0.060580999999999996
702,-0.14106
703,-0.060580999999999996
704,-0.060580999999999996
705,-0.060580999999999996
706,-0.060580999999999996
707,-0.060580999999999996
708,-0.060580999999999996
709,-0.060580999999999996
710,-0.14106
711,-0.060580999999999996
712,-0.060580999999999996
713,-0.060580999999999996
714,-0.060580999999999996
715,-0.060580999999999996
716,-0.060580999999999996
717,-0.060580999999999996
718,-0.14106
719,-0.060580999999999996
