time,value
0,-0.085971
1,-0.085971
2,-0.085971
3,-0.085971
4,-0.085971
5,-0.085971
6,-0.085971
7,-0.085971
8,-0.085971
9,-0.085971
10,-0.085971
11,-0.085971
12,-0.085971
13,-0.085971
14,-0.085971
15,-0.085971
16,-0.085971
17,-0.085971
18,-0.085971
19,-0.085971
20,-0.085971
21,-0.085971
22,-0.085971
23,-0.085971
24,-0.085971
25,-0.085971
26,-0.085971
27,-0.085971
28,-0.085971
29,-0.085971
30,-0.085971
31,-0.085971
32,-0.085971
33,-0.085971
34,-0.085971
35,-0.085971
36,-0.085971
37,-0.085971
38,-0.085971
39,-0.085971
40,-0.085971
41,-0.085971
42,-0.085971
43,-0.085971
44,-0.085971
45,-0.085971
46,-0.085971
47,-0.085971
48,-0.085971
49,-0.085971
50,-0.085971
51,-0.085971
52,-0.085971
53,-0.085971
54,-0.085971
55,-0.085971
56,-0.085971
57,-0.085971
58,-0.085971
59,-0.085971
60,-0.085971
61,-0.085971
62,-0.085971
63,-0.085971
64,-0.085971
65,-0.085971
66,-0.085971
67,-0.085971
68,-0.085971
69,-0.085971
70,-0.085971
71,-0.085971
72,-0.085971
73,-0.085971
74,-0.085971
75,-0.085971
76,-0.085971
77,-0.085971
78,-0.085971
79,-0.085971
80,-0.085971
81,-0.085971
82,-0.085971
83,-0.085971
84,-0.085971
85,-0.085971
86,-0.085971
87,-0.085971
88,-0.085971
89,-0.085971
90,-0.085971
91,-0.085971
92,-0.085971
93,-0.085971
94,-0.085971
95,-0.085971
96,-0.085971
97,-0.085971
98,-0.085971
99,-0.085971
100,-0.085971
101,-0.085971
102,-0.085971
103,-0.085971
104,-0.085971
105,-0.085971
106,-0.085971
107,-0.085971
108,-0.085971
109,-0.085971
110,-0.085971
111,-0.085971
112,-0.085971
113,-0.085971
114,-0.085971
115,-0.085971
116,-0.085971
117,-0.085971
118,-0.085971
119,-0.085971
120,-0.085971
121,-0.085971
122,-0.085971
123,-0.085971
124,-0.085971
125,-0.085971
126,-0.085971
127,-0.085971
128,-0.085971
129,-0.085971
130,-0.085971
131,-0.085971
132,-0.085971
133,-0.085971
134,-0.085971
135,-0.085971
136,-0.085971
137,-0.085971
138,-0.085971
139,-0.085971
140,-0.085971
141,-0.085971
142,-0.085971
143,-0.085971
144,-0.085971
145,-0.085971
146,-0.085971
147,-0.085971
148,-0.085971
149,-0.085971
150,-0.085971
151,-0.085971
152,-0.085971
153,-0.085971
154,-0.085971
155,-0.085971
156,-0.085971
157,-0.085971
158,-0.085971
159,-0.085971
160,-0.085971
161,-0.085971
162,-0.085971
163,-0.085971
164,-0.085971
165,-0.085971
166,-0.085971
167,-0.085971
168,-0.085971
169,-0.085971
170,-0.085971
171,-0.085971
172,-0.085971
173,-0.085971
174,-0.085971
175,-0.085971
176,-0.085971
177,-0.085971
178,-0.085971
179,-0.085971
180,-0.085971
181,-0.085971
182,-0.085971
183,-0.085971
184,-0.085971
185,-0.085971
186,-0.085971
187,-0.085971
188,-0.085971
189,-0.085971
190,-0.085971
191,-0.085971
192,-0.085971
193,-0.085971
194,-0.085971
195,-0.085971
196,-0.085971
197,-0.085971
198,-0.085971
199,-0.085971
200,-0.085971
201,-0.085971
202,-0.085971
203,-0.085971
204,-0.085971
205,-0.085971
206,-0.085971
207,-0.085971
208,-0.085971
209,-0.085971
210,-0.085971
211,-0.085971
212,-0.085971
213,-0.085971
214,-0.085971
215,-0.085971
216,-0.085971
217,-0.085971
218,-0.085971
219,-0.085971
220,-0.085971
221,-0.085971
222,-0.085971
223,-0.085971
224,-0.085971
225,-0.085971
226,-0.085971
227,-0.085971
228,-0.085971
229,-0.085971
230,-0.085971
231,-0.085971
232,-0.085971
233,-0.085971
234,-0.085971
235,-0.085971
236,-0.085971
237,-0.085971
238,-0.085971
239,-0.085971
240,-0.085971
241,-0.085971
242,-0.085971
243,-0.085971
244,-0.085971
245,-0.085971
246,-0.085971
247,-0.085971
248,-0.085971
249,-0.085971
250,-0.085971
251,-0.085971
252,-0.085971
253,-0.085971
254,-0.085971
255,-0.085971
256,-0.085971
257,-0.085971
258,-0.085971
259,-0.085971
260,-0.085971
261,-0.085971
262,-0.085971
263,-0.085971
264,-0.085971
265,-0.085971
266,-0.085971
267,-0.085971
268,-0.085971
269,-0.085971
270,-0.085971
271,-0.085971
272,-0.085971
273,-0.085971
274,-0.085971
275,-0.085971
276,-0.085971
277,-0.085971
278,-0.085971
279,-0.085971
280,-0.085971
281,-0.085971
282,-0.085971
283,-0.085971
284,-0.085971
285,-0.085971
286,-0.085971
287,-0.085971
288,-0.085971
289,-0.085971
290,-0.085971
291,-0.085971
292,-0.085971
293,-0.085971
294,-0.085971
295,-0.085971
296,-0.085971
297,-0.085971
298,-0.085971
299,-0.085971
300,-0.085971
301,-0.085971
302,-0.085971
303,-0.085971
304,-0.085971
305,-0.085971
306,-0.085971
307,-0.085971
308,-0.085971
309,-0.085971
310,-0.085971
311,-0.085971
312,-0.085971
313,-0.085971
314,-0.085971
315,-0.085971
316,-0.085971
317,-0.085971
318,-0.085971
319,-0.085971
320,-0.085971
321,-0.085971
322,-0.085971
323,-0.085971
324,-0.085971
325,-0.085971
326,-0.085971
327,-0.085971
328,-0.085971
329,-0.085971
330,-0.085971
331,-0.085971
332,-0.085971
333,-0.085971
334,-0.085971
335,-0.085971
336,-0.085971
337,-0.085971
338,-0.085971
339,-0.085971
340,-0.085971
341,-0.085971
342,-0.085971
343,-0.085971
344,-0.085971
345,-0.085971
346,-0.085971
347,-0.085971
348,-0.085971
349,-0.085971
350,-0.085971
351,-0.085971
352,-0.085971
353,-0.085971
354,-0.085971
355,-0.085971
356,-0.085971
357,-0.085971
358,-0.085971
359,-0.085971
360,-0.085971
361,-0.085971
362,-0.085971
363,-0.085971
364,-0.085971
365,-0.085971
366,-0.085971
367,-0.085971
368,-0.085971
369,-0.085971
370,-0.085971
371,-0.085971
372,-0.085971
373,-0.085971
374,-0.085971
375,-0.085971
376,-0.085971
377,-0.085971
378,-0.085971
379,-0.085971
380,-0.085971
381,-0.085971
382,-0.085971
383,-0.085971
384,-0.085971
385,-0.085971
386,-0.085971
387,-0.085971
388,-0.085971
389,-0.085971
390,-0.085971
391,-0.085971
392,-0.085971
393,-0.085971
394,-0.085971
395,-0.085971
396,-0.085971
397,-0.085971
398,-0.085971
399,-0.085971
400,-0.085971
401,-0.085971
402,-0.085971
403,-0.085971
404,-0.085971
405,-0.085971
406,-0.085971
407,-0.085971
408,-0.085971
409,-0.085971
410,-0.085971
411,6.7917
412,12.81
413,12.81
414,12.81
415,12.81
416,3.3529
417,-0.085971
418,-0.085971
419,-0.085971
420,-0.085971
421,-0.085971
422,-0.085971
423,-0.085971
424,-0.085971
425,-0.085971
426,-0.085971
427,-0.085971
428,-0.085971
429,-0.085971
430,-0.085971
431,-0.085971
432,-0.085971
433,-0.085971
434,-0.085971
435,-0.085971
436,-0.085971
437,-0.085971
438,-0.085971
439,-0.085971
440,-0.085971
441,-0.085971
442,-0.085971
443,-0.085971
444,-0.085971
445,-0.085971
446,-0.085971
447,-0.085971
448,-0.085971
449,-0.085971
450,-0.085971
451,-0.085971
452,-0.085971
453,-0.085971
454,-0.085971
455,-0.085971
456,-0.085971
457,-0.085971
458,-0.085971
459,-0.085971
460,-0.085971
461,-0.085971
462,-0.085971
463,-0.085971
464,-0.085971
465,-0.085971
466,-0.085971
467,-0.085971
468,-0.085971
469,-0.085971
470,-0.085971
471,-0.085971
472,-0.085971
473,-0.085971
474,-0.085971
475,-0.085971
476,-0.085971
477,-0.085971
478,-0.085971
479,-0.085971
480,-0.085971
481,-0.085971
482,-0.085971
483,-0.085971
484,-0.085971
485,-0.085971
486,-0.085971
487,-0.085971
488,-0.085971
489,-0.085971
490,-0.085971
491,-0.085971
492,-0.085971
493,-0.085971
494,-0.085971
495,-0.085971
496,-0.085971
497,-0.085971
498,-0.085971
499,-0.085971
500,-0.085971
501,-0.085971
502,-0.085971
503,-0.085971
504,-0.085971
505,-0.085971
506,-0.085971
507,-0.085971
508,-0.085971
509,-0.085971
510,-0.085971
511,-0.085971
512,-0.085971
513,-0.085971
514,-0.085971
515,-0.085971
516,-0.085971
517,-0.085971
518,-0.085971
519,-0.085971
520,-0.085971
521,-0.085971
522,-0.085971
523,-0.085971
524,-0.085971
525,-0.085971
526,-0.085971
527,-0.085971
528,-0.085971
529,-0.085971
530,-0.085971
531,-0.085971
532,-0.085971
533,-0.085971
534,-0.085971
535,-0.085971
536,-0.085971
537,-0.085971
538,-0.085971
539,-0.085971
540,-0.085971
541,-0.085971
542,-0.085971
543,-0.085971
544,-0.085971
545,-0.085971
546,-0.085971
547,-0.085971
548,-0.085971
549,-0.085971
550,-0.085971
551,-0.085971
552,-0.085971
553,-0.085971
554,-0.085971
555,-0.085971
556,-0.085971
557,-0.085971
558,-0.085971
559,-0.085971
560,-0.085971
561,-0.085971
562,-0.085971
563,-0.085971
564,-0.085971
565,-0.085971
566,-0.085971
567,-0.085971
568,-0.085971
569,-0.085971
570,-0.085971
571,-0.085971
572,-0.085971
573,-0.085971
574,-0.085971
575,-0.085971
576,-0.085971
577,-0.085971
578,-0.085971
579,-0.085971
580,-0.085971
581,-0.085971
582,-0.085971
583,-0.085971
584,-0.085971
585,-0.085971
586,-0.085971
587,-0.085971
588,-0.085971
589,-0.085971
590,-0.085971
591,-0.085971
592,-0.085971
593,-0.085971
594,-0.085971
595,-0.085971
596,-0.085971
597,-0.085971
598,-0.085971
599,-0.085971
600,-0.085971
601,-0.085971
602,-0.085971
603,-0.085971
604,-0.085971
605,-0.085971
606,-0.085971
607,-0.085971
608,-0.085971
609,-0.085971
610,-0.085971
611,-0.085971
612,-0.085971
613,-0.085971
614,-0.085971
615,-0.085971
616,-0.085971
617,-0.085971
618,-0.085971
619,-0.085971
620,-0.085971
621,-0.085971
622,-0.085971
623,-0.085971
624,-0.085971
625,-0.085971
626,-0.085971
627,-0.085971
628,-0.085971
629,-0.085971
630,-0.085971
631,-0.085971
632,-0.085971
633,-0.085971
634,-0.085971
635,-0.085971
636,-0.085971
637,-0.085971
638,-0.085971
639,-0.085971
640,-0.085971
641,-0.085971
642,-0.085971
643,-0.085971
644,-0.085971
645,-0.085971
646,-0.085971
647,-0.085971
648,-0.085971
649,-0.085971
650,-0.085971
651,-0.085971
652,-0.085971
653,-0.085971
654,-0.085971
655,-0.085971
656,-0.085971
657,-0.085971
658,-0.085971
659,-0.085971
660,-0.085971
661,-0.085971
662,-0.085971
663,-0.085971
664,-0.085971
665,-0.085971
666,-0.085971
667,-0.085971
668,-0.085971
669,-0.085971
670,-0.085971
671,-0.085971
672,-0.085971
673,-0.085971
674,-0.085971
675,-0.085971
676,-0.085971
677,-0.085971
678,-0.085971
679,-0.085971
680,-0.085971
681,-0.085971
682,-0.085971
683,-0.085971
684,-0.085971
685,-0.085971
686,-0.085971
687,-0.085971
688,-0.085971
689,-0.085971
690,-0.085971
691,-0.085971
692,-0.085971
693,-0.085971
694,-0.085971
695,-0.085971
696,-0.085971
697,-0.085971
698,-0.085971
699,-0.085971
700,-0.085971
701,-0.085971
702,-0.085971
703,-0.085971
704,-0.085971
705,-0.085971
706,-0.085971
707,-0.085971
708,-0.085971
709,-0.085971
710,-0.085971
711,-0.085971
712,-0.085971
713,-0.085971
714,-0.085971
715,-0.085971
716,-0.085971
717,-0.085971
718,-0.085971
719,-0.085971
