time,value
0,2.612
1,2.4212
2,1.6063
3,1.0325
4,0.61557
5,0.21191999999999997
6,-0.42626000000000003
7,-0.70352
8,-0.69302
9,-0.78337
10,-0.94637
11,-0.68852
12,-0.66456
13,-0.83946
14,-0.60339
15,-0.58407
16,-0.77128
17,-0.83794
18,-0.40285
19,-0.6511
20,-0.80911
21,-0.54552
22,-0.26484
23,-0.38095
24,-0.43799
25,-0.28653
26,-0.28653
27,-0.25618
28,-0.38095
29,-0.11848
30,0.02888
31,-0.0077883
32,0.15633
33,0.072451
34,0.12844
35,0.21191999999999997
36,0.32235
37,0.40996000000000005
38,0.7290800000000001
39,0.5240199999999999
40,0.6008100000000001
41,0.6008100000000001
42,0.75962
43,0.7290800000000001
44,0.7117899999999999
45,0.88628
46,0.6196
47,0.45897
48,0.40996000000000005
49,0.21608000000000002
50,0.16747
51,0.02888
52,-0.085734
53,-0.17565999999999998
54,0.32235
55,0.8665700000000001
56,1.1873
57,0.6209399999999999
58,0.073854
59,-0.47323000000000004
60,-0.45119
61,-0.74262
62,-1.0157
63,-1.2547
64,-1.8046
65,-2.1299
66,-2.5599
67,-3.049
68,-2.6178
69,-2.1714
70,-1.7117
71,-1.2721
72,-1.0590000000000002
73,-0.68852
74,-0.29811
75,-0.012027
76,0.29484
77,0.6209399999999999
78,0.91906
79,0.95436
80,1.1873
81,1.2231
82,1.5415
83,1.5465
84,1.5764
85,1.5951
86,1.6818
87,1.6112
88,1.3694
89,1.3504
90,1.1719
91,1.2129
92,0.88628
93,0.6008100000000001
94,0.70113
95,0.51861
96,0.50237
97,0.2783
98,0.051387999999999996
99,-0.034656
100,-0.42626000000000003
101,-0.29811
102,-0.32855999999999996
103,-0.26918000000000003
104,-0.55588
105,-0.55588
106,-0.50268
107,-0.9848100000000001
108,-0.75468
109,-0.8333799999999999
110,-0.77128
111,-0.6705399999999999
112,-0.7652399999999999
113,-0.7592
114,-0.90043
115,-0.8683799999999999
116,-0.7652399999999999
117,-0.6331899999999999
118,-0.47323000000000004
119,-0.46147
120,-0.24031999999999998
121,-0.35618
122,0.12844
123,0.42632
124,0.56853
125,1.0791
126,1.8366
127,2.3743
