time,value
0,-1.0232
1,-1.0232
2,-1.0232
3,-1.0232
4,-1.0232
5,-1.0232
6,-1.0232
7,-1.0232
8,-1.0232
9,-1.0232
10,-1.0232
11,-1.0232
12,-1.0232
13,-1.0232
14,-1.0232
15,-1.0232
16,-1.0232
17,-1.0232
18,-1.0232
19,-1.0232
20,-1.0232
21,-1.0232
22,-1.0232
23,-1.0232
24,-1.0232
25,-1.0232
26,-1.0232
27,-1.0232
28,-1.0232
29,-1.0232
30,-1.0232
31,-1.0232
32,-1.0232
33,-1.0232
34,-1.0232
35,-1.0232
36,-1.0232
37,-1.0232
38,-1.0232
39,-1.0232
40,-1.0232
41,-1.0232
42,-1.0232
43,-1.0232
44,-1.0232
45,-1.0232
46,-1.0232
47,-1.0232
48,-1.0232
49,-1.0232
50,-1.0232
51,-1.0232
52,-1.0232
53,-1.0232
54,-1.0232
55,-1.0232
56,-1.0232
57,-1.0232
58,-1.0232
59,-1.0232
60,-1.0232
61,-1.0232
62,-1.0232
63,-1.0232
64,-1.0232
65,-1.0232
66,-1.0232
67,-1.0232
68,-1.0232
69,-1.0232
70,-1.0232
71,-1.0232
72,-1.0232
73,-1.0232
74,-1.0232
75,-1.0232
76,-1.0232
77,-1.0232
78,-1.0232
79,-1.0232
80,-1.0232
81,-1.0232
82,-1.0232
83,-1.0232
84,-1.0232
85,-1.0232
86,-1.0232
87,-1.0232
88,-1.0232
89,-1.0232
90,-1.0232
91,-1.0232
92,-1.0232
93,-1.0232
94,-1.0232
95,-1.0232
96,-1.0232
97,-1.0232
98,-1.0232
99,-1.0232
100,-1.0232
101,-1.0232
102,-1.0232
103,-1.0232
104,-1.0232
105,-1.0232
106,-1.0232
107,-1.0232
108,-1.0232
109,-1.0232
110,-1.0232
111,-1.0232
112,-1.0232
113,-1.0232
114,-1.0232
115,-1.0232
116,-1.0232
117,-1.0232
118,-1.0232
119,-1.0232
120,-1.0232
121,-1.0232
122,-1.0232
123,-1.0232
124,-1.0232
125,-1.0232
126,-1.0232
127,-1.0232
128,-1.0232
129,-1.0232
130,-1.0232
131,-1.0232
132,-1.0232
133,-1.0232
134,-1.0232
135,-1.0232
136,-1.0232
137,-1.0232
138,-1.0232
139,-1.0232
140,-1.0232
141,-1.0232
142,-1.0232
143,-1.0232
144,-1.0232
145,-1.0232
146,-1.0232
147,-1.0232
148,-1.0232
149,-1.0232
150,-1.0232
151,-1.0232
152,-1.0232
153,-1.0232
154,-1.0232
155,-1.0232
156,-1.0232
157,-1.0232
158,-1.0232
159,-1.0232
160,-1.0232
161,-1.0232
162,-1.0232
163,-1.0232
164,-1.0232
165,-1.0232
166,-1.0232
167,-1.0232
168,-1.0232
169,-1.0232
170,-1.0232
171,-1.0232
172,-1.0232
173,-1.0232
174,-1.0232
175,-1.0232
176,-1.0232
177,-1.0232
178,-1.0232
179,-1.0232
180,-1.0232
181,-1.0232
182,-1.0232
183,-1.0232
184,-1.0232
185,-1.0232
186,-1.0232
187,-1.0232
188,-1.0232
189,-1.0232
190,-1.0232
191,-1.0232
192,-1.0232
193,-1.0232
194,-1.0232
195,-1.0232
196,-1.0232
197,-1.0232
198,-1.0232
199,-1.0232
200,-1.0232
201,-1.0232
202,-1.0232
203,-1.0232
204,-1.0232
205,-1.0232
206,-1.0232
207,-1.0232
208,-1.0232
209,-1.0232
210,-1.0232
211,-1.0232
212,-1.0232
213,-1.0232
214,-1.0232
215,-1.0232
216,-1.0232
217,-1.0232
218,-1.0232
219,-1.0232
220,-1.0232
221,-1.0232
222,-1.0232
223,-1.0232
224,-1.0232
225,-1.0232
226,-1.0232
227,-1.0232
228,-1.0232
229,-1.0232
230,-1.0232
231,-1.0232
232,-1.0232
233,-1.0232
234,-1.0232
235,-1.0232
236,-1.0232
237,-1.0232
238,-1.0232
239,-1.0232
240,-1.0232
241,-1.0232
242,-1.0232
243,-1.0232
244,-1.0232
245,-1.0232
246,-1.0232
247,-1.0232
248,-1.0232
249,-1.0232
250,-1.0232
251,-1.0232
252,-1.0232
253,-1.0232
254,-1.0232
255,-1.0232
256,-1.0232
257,-1.0232
258,-1.0232
259,-1.0232
260,-1.0232
261,-1.0232
262,-1.0232
263,-1.0232
264,-1.0232
265,-1.0232
266,-1.0232
267,-1.0232
268,-1.0232
269,-1.0232
270,-1.0232
271,-1.0232
272,-1.0232
273,-1.0232
274,-1.0232
275,-1.0232
276,-1.0232
277,-1.0232
278,-1.0232
279,-1.0232
280,-1.0232
281,-1.0232
282,-1.0232
283,-1.0232
284,-1.0232
285,-1.0232
286,-1.0232
287,-1.0232
288,-1.0232
289,-1.0232
290,-1.0232
291,-1.0232
292,-0.6962
293,1.2657
294,0.9387200000000001
295,0.9387200000000001
296,0.9387200000000001
297,0.9387200000000001
298,1.2657
299,1.5927
300,1.2657
301,1.5927
302,1.2657
303,0.9387200000000001
304,1.5927
305,0.9387200000000001
306,1.2657
307,1.2657
308,0.9387200000000001
309,1.2657
310,0.9387200000000001
311,1.2657
312,0.9387200000000001
313,0.9387200000000001
314,0.9387200000000001
315,1.2657
316,0.9387200000000001
317,0.9387200000000001
318,0.9387200000000001
319,0.9387200000000001
320,0.9387200000000001
321,0.9387200000000001
322,0.9387200000000001
323,0.9387200000000001
324,0.9387200000000001
325,1.2657
326,1.5927
327,1.5927
328,0.9387200000000001
329,0.9387200000000001
330,0.9387200000000001
331,0.9387200000000001
332,0.9387200000000001
333,0.9387200000000001
334,0.9387200000000001
335,0.9387200000000001
336,0.69348
337,0.9387200000000001
338,0.9387200000000001
339,0.9387200000000001
340,0.9387200000000001
341,0.9387200000000001
342,0.9387200000000001
343,0.9387200000000001
344,0.9387200000000001
345,0.9387200000000001
346,0.9387200000000001
347,0.9387200000000001
348,0.9387200000000001
349,0.9387200000000001
350,0.9387200000000001
351,0.9387200000000001
352,0.9387200000000001
353,0.9387200000000001
354,0.9387200000000001
355,0.9387200000000001
356,0.9387200000000001
357,0.9387200000000001
358,0.9387200000000001
359,0.9387200000000001
360,0.9387200000000001
361,0.9387200000000001
362,0.9387200000000001
363,0.9387200000000001
364,0.9387200000000001
365,0.9387200000000001
366,0.9387200000000001
367,0.9387200000000001
368,0.9387200000000001
369,0.9387200000000001
370,0.9387200000000001
371,0.9387200000000001
372,0.9387200000000001
373,0.9387200000000001
374,0.9387200000000001
375,0.69348
376,0.9387200000000001
377,0.9387200000000001
378,0.9387200000000001
379,0.9387200000000001
380,0.9387200000000001
381,0.9387200000000001
382,0.9387200000000001
383,0.9387200000000001
384,0.9387200000000001
385,0.9387200000000001
386,0.9387200000000001
387,0.9387200000000001
388,0.9387200000000001
389,0.9387200000000001
390,0.9387200000000001
391,0.9387200000000001
392,0.9387200000000001
393,0.69348
394,0.9387200000000001
395,0.9387200000000001
396,0.9387200000000001
397,0.9387200000000001
398,0.9387200000000001
399,0.9387200000000001
400,0.9387200000000001
401,0.9387200000000001
402,0.9387200000000001
403,0.9387200000000001
404,0.69348
405,0.9387200000000001
406,0.9387200000000001
407,0.9387200000000001
408,0.9387200000000001
409,0.9387200000000001
410,0.9387200000000001
411,0.9387200000000001
412,0.69348
413,0.9387200000000001
414,0.9387200000000001
415,0.9387200000000001
416,0.9387200000000001
417,0.9387200000000001
418,0.9387200000000001
419,0.9387200000000001
420,0.9387200000000001
421,0.9387200000000001
422,0.9387200000000001
423,0.9387200000000001
424,0.69348
425,0.9387200000000001
426,0.9387200000000001
427,0.9387200000000001
428,1.5927
429,0.9387200000000001
430,0.9387200000000001
431,1.2657
432,0.9387200000000001
433,0.9387200000000001
434,0.9387200000000001
435,1.2657
436,0.9387200000000001
437,0.9387200000000001
438,0.9387200000000001
439,1.2657
440,1.5927
441,1.5927
442,1.2657
443,1.2657
444,1.9197
445,1.2657
446,0.9387200000000001
447,1.2657
448,0.9387200000000001
449,0.9387200000000001
450,1.2657
451,0.9387200000000001
452,1.2657
453,0.9387200000000001
454,0.9387200000000001
455,0.9387200000000001
456,0.9387200000000001
457,0.9387200000000001
458,0.9387200000000001
459,0.9387200000000001
460,0.9387200000000001
461,0.9387200000000001
462,0.9387200000000001
463,0.9387200000000001
464,0.9387200000000001
465,0.9387200000000001
466,0.9387200000000001
467,0.9387200000000001
468,0.9387200000000001
469,0.9387200000000001
470,0.9387200000000001
471,0.9387200000000001
472,0.9387200000000001
473,0.9387200000000001
474,0.69348
475,0.9387200000000001
476,0.9387200000000001
477,0.9387200000000001
478,0.9387200000000001
479,0.9387200000000001
480,0.9387200000000001
481,0.9387200000000001
482,0.9387200000000001
483,0.9387200000000001
484,0.69348
485,0.9387200000000001
486,0.9387200000000001
487,0.9387200000000001
488,0.9387200000000001
489,0.9387200000000001
490,0.9387200000000001
491,0.9387200000000001
492,0.9387200000000001
493,0.9387200000000001
494,0.9387200000000001
495,0.9387200000000001
496,0.9387200000000001
497,0.9387200000000001
498,0.9387200000000001
499,0.9387200000000001
500,0.69348
501,0.9387200000000001
502,0.9387200000000001
503,0.9387200000000001
504,0.9387200000000001
505,0.9387200000000001
506,0.9387200000000001
507,0.9387200000000001
508,0.9387200000000001
509,0.9387200000000001
510,0.9387200000000001
511,0.9387200000000001
512,0.9387200000000001
513,0.9387200000000001
514,0.9387200000000001
515,1.2657
516,0.9387200000000001
517,0.9387200000000001
518,0.9387200000000001
519,0.9387200000000001
520,0.9387200000000001
521,0.9387200000000001
522,0.9387200000000001
523,0.9387200000000001
524,0.9387200000000001
525,0.9387200000000001
526,0.9387200000000001
527,0.9387200000000001
528,0.9387200000000001
529,0.9387200000000001
530,0.9387200000000001
531,0.9387200000000001
532,1.2657
533,0.9387200000000001
534,0.9387200000000001
535,0.9387200000000001
536,0.9387200000000001
537,0.9387200000000001
538,0.9387200000000001
539,0.9387200000000001
540,0.9387200000000001
541,0.9387200000000001
542,0.9387200000000001
543,0.9387200000000001
544,0.9387200000000001
545,0.9387200000000001
546,0.9387200000000001
547,0.9387200000000001
548,0.9387200000000001
549,0.9387200000000001
550,0.9387200000000001
551,0.9387200000000001
552,0.9387200000000001
553,0.9387200000000001
554,0.9387200000000001
555,0.9387200000000001
556,0.9387200000000001
557,0.69348
558,0.9387200000000001
559,0.9387200000000001
560,0.9387200000000001
561,0.9387200000000001
562,0.9387200000000001
563,0.9387200000000001
564,0.9387200000000001
565,0.9387200000000001
566,0.9387200000000001
567,0.9387200000000001
568,0.9387200000000001
569,0.9387200000000001
570,0.9387200000000001
571,0.9387200000000001
572,0.9387200000000001
573,0.9387200000000001
574,0.9387200000000001
575,0.9387200000000001
576,0.9387200000000001
577,0.9387200000000001
578,0.9387200000000001
579,0.9387200000000001
580,0.9387200000000001
581,0.9387200000000001
582,0.9387200000000001
583,0.9387200000000001
584,0.9387200000000001
585,0.9387200000000001
586,0.9387200000000001
587,0.9387200000000001
588,0.9387200000000001
589,0.9387200000000001
590,0.9387200000000001
591,0.9387200000000001
592,0.69348
593,0.9387200000000001
594,0.9387200000000001
595,0.9387200000000001
596,0.9387200000000001
597,0.9387200000000001
598,0.9387200000000001
599,0.9387200000000001
600,0.9387200000000001
601,0.9387200000000001
602,0.9387200000000001
603,0.9387200000000001
604,0.9387200000000001
605,0.9387200000000001
606,0.9387200000000001
607,0.9387200000000001
608,0.9387200000000001
609,0.9387200000000001
610,0.9387200000000001
611,0.9387200000000001
612,0.9387200000000001
613,0.9387200000000001
614,0.9387200000000001
615,0.9387200000000001
616,0.9387200000000001
617,0.9387200000000001
618,0.9387200000000001
619,1.2657
620,0.9387200000000001
621,0.9387200000000001
622,0.9387200000000001
623,0.9387200000000001
624,0.9387200000000001
625,0.9387200000000001
626,0.9387200000000001
627,0.9387200000000001
628,0.9387200000000001
629,0.9387200000000001
630,0.9387200000000001
631,0.9387200000000001
632,0.9387200000000001
633,0.9387200000000001
634,0.9387200000000001
635,0.9387200000000001
636,0.9387200000000001
637,0.9387200000000001
638,0.9387200000000001
639,0.9387200000000001
640,0.9387200000000001
641,0.9387200000000001
642,0.9387200000000001
643,0.9387200000000001
644,0.9387200000000001
645,0.9387200000000001
646,0.9387200000000001
647,0.9387200000000001
648,0.9387200000000001
649,0.9387200000000001
650,0.9387200000000001
651,0.9387200000000001
652,0.9387200000000001
653,0.9387200000000001
654,0.9387200000000001
655,0.9387200000000001
656,0.9387200000000001
657,0.9387200000000001
658,0.9387200000000001
659,0.9387200000000001
660,0.9387200000000001
661,0.9387200000000001
662,0.69348
663,-1.0232
664,-1.0232
665,-1.0232
666,-1.0232
667,-1.0232
668,-1.0232
669,-1.0232
670,-1.0232
671,-1.0232
672,-1.0232
673,-1.0232
674,-1.0232
675,-1.0232
676,-1.0232
677,-1.0232
678,-1.0232
679,-1.0232
680,-1.0232
681,-1.0232
682,-1.0232
683,-1.0232
684,-1.0232
685,-1.0232
686,-1.0232
687,-1.0232
688,-1.0232
689,-1.0232
690,-1.0232
691,-1.0232
692,-1.0232
693,-1.0232
694,-1.0232
695,-1.0232
696,-1.0232
697,-1.0232
698,-1.0232
699,-1.0232
700,-1.0232
701,-1.0232
702,-1.0232
703,-1.0232
704,-1.0232
705,-1.0232
706,-1.0232
707,-1.0232
708,-1.0232
709,-1.0232
710,-1.0232
711,-1.0232
712,-1.0232
713,-1.0232
714,-1.0232
715,-1.0232
716,-1.0232
717,-1.0232
718,-1.0232
719,-1.0232
