time,value
0,-1.0943
1,-1.0959
2,-1.0966
3,-1.0959
4,-1.0931
5,-1.0887
6,-1.0825
7,-1.0747
8,-1.0659999999999998
9,-1.0567
10,-1.0479
11,-1.0396
12,-1.0318
13,-1.0241
14,-1.0161
15,-1.0081
16,-0.99989
17,-0.9910700000000001
18,-0.9816299999999999
19,-0.97164
20,-0.9617700000000001
21,-0.9522200000000001
22,-0.94266
23,-0.9328799999999999
24,-0.92264
25,-0.9122899999999999
26,-0.9021
27,-0.8917700000000001
28,-0.8813200000000001
29,-0.8708600000000001
30,-0.8609399999999999
31,-0.85215
32,-0.84406
33,-0.8364299999999999
34,-0.82893
35,-0.82153
36,-0.81453
37,-0.80715
38,-0.79902
39,-0.78979
40,-0.77946
41,-0.76858
42,-0.75653
43,-0.74305
44,-0.72793
45,-0.7112
46,-0.6936899999999999
47,-0.67494
48,-0.65494
49,-0.63369
50,-0.61137
51,-0.58909
52,-0.5665100000000001
53,-0.54369
54,-0.52067
55,-0.49756999999999996
56,-0.47545
57,-0.45393999999999995
58,-0.43293999999999994
59,-0.41226999999999997
60,-0.39171999999999996
61,-0.37183
62,-0.35204
63,-0.33185
64,-0.31088000000000005
65,-0.2889
66,-0.26641
67,-0.24341999999999997
68,-0.22008000000000003
69,-0.19677999999999998
70,-0.17407999999999998
71,-0.15292999999999998
72,-0.13389
73,-0.11732000000000001
74,-0.10352
75,-0.09261799999999999
76,-0.084694
77,-0.07942300000000001
78,-0.07625499999999999
79,-0.07467599999999999
80,-0.074154
81,-0.07431
82,-0.074697
83,-0.074903
84,-0.074811
85,-0.074443
86,-0.074016
87,-0.073686
88,-0.073436
89,-0.073414
90,-0.07371699999999999
91,-0.07445800000000001
92,-0.075629
93,-0.076821
94,-0.077874
95,-0.078667
96,-0.079226
97,-0.079749
98,-0.07990900000000001
99,-0.079843
100,-0.079762
101,-0.079996
102,-0.081221
103,-0.083101
104,-0.08589400000000001
105,-0.089933
106,-0.09565
107,-0.10425
108,-0.1154
109,-0.1296
110,-0.1474
111,-0.16931
112,-0.19664
113,-0.22871999999999998
114,-0.26550999999999997
115,-0.30695
116,-0.35284
117,-0.40379
118,-0.4584
119,-0.51561
120,-0.57434
121,-0.63334
122,-0.6922
123,-0.74864
124,-0.80062
125,-0.84678
126,-0.88626
127,-0.91985
128,-0.94729
129,-0.9684
130,-0.9839100000000001
131,-0.99465
132,-1.0025
133,-1.0079
134,-1.0103
135,-1.0095
136,-1.0056
137,-0.9999
138,-0.99313
139,-0.98456
140,-0.97451
141,-0.9632299999999999
142,-0.9516399999999999
143,-0.94035
144,-0.9275200000000001
145,-0.9124700000000001
146,-0.89469
147,-0.87465
148,-0.8537899999999999
149,-0.8310799999999999
150,-0.80698
151,-0.78193
152,-0.7565
153,-0.73201
154,-0.70633
155,-0.67871
156,-0.64856
157,-0.61595
158,-0.58306
159,-0.54918
160,-0.51553
161,-0.48336
162,-0.45366000000000006
163,-0.42867
164,-0.40596
165,-0.38376
166,-0.35979
167,-0.3317
168,-0.29952
169,-0.26056
170,-0.21393
171,-0.16
172,-0.10023
173,-0.038874
174,0.022509
175,0.082587
176,0.14015999999999998
177,0.19457
178,0.2436
179,0.2878
180,0.32900999999999997
181,0.36861
182,0.40775
183,0.44509
184,0.48028999999999994
185,0.5143800000000001
186,0.54742
187,0.57924
188,0.60769
189,0.6313300000000001
190,0.65147
191,0.66862
192,0.68316
193,0.69363
194,0.69799
195,0.6974600000000001
196,0.69199
197,0.68153
198,0.66503
199,0.64068
200,0.61093
201,0.57744
202,0.5423
203,0.5070899999999999
204,0.47198999999999997
205,0.44055
206,0.41488
207,0.3969
208,0.38792
209,0.38777
210,0.39865
211,0.42146000000000006
212,0.45683
213,0.505
214,0.56498
215,0.6372
216,0.72075
217,0.8143199999999999
218,0.91627
219,1.0243
220,1.137
221,1.2522
222,1.3675
223,1.4803
224,1.5877
225,1.6888
226,1.7819999999999998
227,1.8665
228,1.9424
229,2.0101
230,2.0726
231,2.1324
232,2.1918
233,2.2526
234,2.3154
235,2.3813
236,2.4496
237,2.5179
238,2.583
239,2.6404
240,2.6873
241,2.7207
242,2.7377
243,2.7359
244,2.7133
245,2.67
246,2.6069999999999998
247,2.5247
248,2.4237
249,2.3047
250,2.169
251,2.0186
252,1.8547
253,1.6782
254,1.49
255,1.2917
256,1.0862
257,0.87605
258,0.66381
259,0.45252
260,0.2455
261,0.047525
262,-0.13807
263,-0.30855
264,-0.46198999999999996
265,-0.59764
266,-0.71368
267,-0.81065
268,-0.8898299999999999
269,-0.9529700000000001
