time,value
0,1.4701
1,1.9424
2,2.3484
3,2.6472
4,2.8049
5,2.7994
6,2.6247
7,2.2927
8,1.8328
9,1.2896
10,0.71737
11,0.17427
12,-0.28536
13,-0.6177
14,-0.79514
15,-0.80971
16,-0.67388
17,-0.41847
18,-0.088198
19,0.26481
20,0.58829
21,0.8369700000000001
22,0.9785200000000001
23,0.9973799999999999
24,0.89613
25,0.69416
26,0.42402
27,0.12602
28,-0.15792
29,-0.39034
30,-0.54325
31,-0.60148
32,-0.56387
33,-0.44241
34,-0.25944
35,-0.043639
36,0.17465
37,0.36795
38,0.51536
39,0.6049800000000001
40,0.63483
41,0.61215
42,0.5515
43,0.47184
44,0.39327
45,0.33382
46,0.30680999999999997
47,0.31906
48,0.37018
49,0.45288999999999996
50,0.55429
51,0.65787
52,0.74583
53,0.8014899999999999
54,0.8115100000000001
55,0.76747
56,0.66693
57,0.51358
58,0.31678
59,0.09033300000000001
60,-0.14917
61,-0.38427
62,-0.59865
63,-0.77888
64,-0.9157700000000001
65,-1.0052
66,-1.0481
67,-1.0504
68,-1.0212
69,-0.9722799999999999
70,-0.91565
71,-0.86275
72,-0.82244
73,-0.79909
74,-0.7945800000000001
75,-0.8074399999999999
76,-0.8334799999999999
77,-0.86679
78,-0.90123
79,-0.9314399999999999
80,-0.9515899999999999
81,-0.9596899999999999
82,-0.9562299999999999
83,-0.94376
84,-0.92627
85,-0.90823
86,-0.89375
87,-0.88571
88,-0.88545
89,-0.89264
90,-0.9054200000000001
91,-0.9209700000000001
92,-0.93614
93,-0.9486
94,-0.95519
95,-0.9550700000000001
96,-0.9487200000000001
97,-0.93778
98,-0.92461
