time,value
0,-0.485
1,-0.485
2,0.28392
3,1.5654
4,3.1032
5,1.8217
6,-0.2287
7,-2.0228
8,-1.5102
9,0.54022
10,2.3343
11,2.3343
12,0.79652
13,-0.99755
14,-1.5102
15,-1.7666
16,-1.2539
17,-0.74135
18,-0.74135
19,-0.74135
20,-0.74135
21,-0.485
22,0.027599000000000002
23,0.027599000000000002
24,0.027599000000000002
25,0.027599000000000002
26,0.027599000000000002
27,0.28392
28,0.28392
29,0.28392
30,0.027599000000000002
31,-0.485
32,-0.2287
33,0.027599000000000002
34,-0.2287
35,0.027599000000000002
36,0.027599000000000002
37,0.027599000000000002
38,-0.2287
39,-0.485
40,-0.74135
41,-0.99755
42,-0.74135
43,0.54022
44,1.8217
45,1.3091
46,0.027599000000000002
47,0.28392
48,1.0528
49,1.3091
50,1.3091
51,0.54022
52,-0.485
53,-0.99755
54,-1.5102
55,-1.2539
56,-0.485
57,-0.2287
58,0.027599000000000002
59,-0.2287
60,-0.2287
61,-0.2287
62,0.28392
63,0.54022
64,0.54022
