time,value
0,-0.39038
1,-0.39038
2,-0.39038
3,-0.39038
4,-0.39038
5,-0.39038
6,-0.39038
7,-0.39038
8,-0.39038
9,-0.39038
10,-0.39038
11,-0.39038
12,-0.39038
13,-0.39038
14,-0.39038
15,-0.39038
16,2.8939
17,3.2224
18,2.5655
19,0.39786
20,-0.32469000000000003
21,-0.39038
22,-0.39038
23,-0.39038
24,-0.39038
25,-0.39038
26,-0.39038
27,-0.39038
28,-0.39038
29,-0.39038
30,-0.39038
31,-0.39038
32,-0.39038
33,-0.39038
34,-0.39038
35,-0.39038
36,-0.39038
37,-0.39038
38,-0.39038
39,-0.39038
40,-0.39038
41,-0.39038
42,-0.39038
43,1.9743
44,3.2224
45,2.8939
46,0.79198
47,-0.25901
48,-0.39038
49,-0.39038
50,-0.39038
51,-0.39038
52,-0.39038
53,-0.39038
54,-0.39038
55,-0.39038
56,-0.39038
57,-0.39038
58,-0.39038
59,-0.39038
60,-0.39038
61,-0.39038
62,-0.39038
63,-0.39038
64,-0.39038
65,-0.39038
66,-0.39038
67,-0.39038
68,-0.39038
69,-0.39038
70,1.9743
71,2.8939
72,2.8939
73,1.4488
74,-0.32469000000000003
75,-0.39038
76,-0.39038
77,-0.39038
78,-0.39038
79,-0.39038
80,-0.39038
81,-0.39038
82,-0.39038
83,-0.39038
84,-0.39038
85,-0.39038
86,-0.39038
87,-0.39038
88,-0.39038
89,-0.39038
90,-0.39038
91,-0.39038
92,-0.39038
93,-0.39038
94,-0.39038
95,-0.39038
96,-0.39038
97,1.4488
98,3.2224
99,2.8939
100,1.4488
101,-0.25901
102,-0.39038
103,-0.39038
104,-0.39038
105,-0.39038
106,-0.39038
107,-0.39038
108,-0.39038
109,-0.39038
110,-0.39038
111,-0.39038
112,-0.39038
113,-0.39038
114,-0.39038
115,-0.39038
116,-0.39038
117,-0.39038
118,-0.39038
119,-0.39038
120,-0.39038
121,-0.39038
122,-0.39038
123,-0.39038
124,1.4488
125,2.8939
126,2.8939
127,1.4488
128,-0.39038
129,-0.39038
130,-0.39038
131,-0.39038
132,-0.39038
133,-0.39038
134,-0.39038
135,-0.39038
136,-0.39038
137,-0.39038
138,-0.39038
139,-0.39038
140,-0.39038
141,-0.39038
142,-0.39038
143,-0.39038
144,-0.39038
145,-0.39038
146,-0.39038
147,-0.39038
148,-0.39038
149,-0.39038
150,-0.39038
151,0.9890399999999999
152,3.2224
153,2.8939
154,1.9743
155,-0.39038
156,-0.39038
157,-0.39038
158,-0.39038
159,-0.39038
160,-0.39038
161,-0.39038
162,-0.39038
163,-0.39038
164,-0.39038
165,-0.39038
166,-0.39038
167,-0.39038
168,-0.39038
169,-0.39038
170,-0.39038
171,-0.39038
172,-0.39038
173,-0.39038
174,-0.39038
175,-0.39038
176,-0.39038
177,-0.39038
178,0.26649
179,3.2224
180,2.8939
181,2.5655
182,-0.39038
183,-0.39038
184,-0.39038
185,-0.39038
186,-0.39038
187,-0.39038
188,-0.39038
189,-0.39038
190,-0.39038
191,-0.39038
192,-0.39038
193,-0.39038
194,-0.39038
195,-0.39038
196,-0.39038
197,-0.39038
198,-0.39038
199,-0.39038
200,-0.39038
201,-0.39038
202,-0.39038
203,-0.39038
204,-0.39038
205,-0.39038
206,2.8939
207,3.2224
208,2.5655
209,0.26649
210,-0.39038
211,-0.39038
212,-0.39038
213,-0.39038
214,-0.39038
215,-0.39038
216,-0.39038
217,-0.39038
218,-0.39038
219,-0.39038
220,-0.39038
221,-0.39038
222,-0.39038
223,-0.39038
224,-0.39038
225,-0.39038
226,-0.39038
227,-0.39038
228,-0.39038
229,-0.39038
230,-0.39038
231,-0.39038
232,-0.39038
233,2.2371
234,2.8939
235,2.8939
236,0.59492
237,-0.39038
238,-0.39038
239,-0.39038
240,-0.39038
241,-0.39038
242,-0.39038
243,-0.39038
244,-0.39038
245,-0.39038
246,-0.39038
247,-0.39038
248,-0.39038
249,-0.39038
250,-0.39038
251,-0.39038
252,-0.39038
253,-0.39038
254,-0.39038
255,-0.39038
256,-0.39038
257,-0.39038
258,-0.39038
259,-0.39038
260,2.2371
261,2.8939
262,2.8939
263,0.59492
264,-0.25901
265,-0.39038
266,-0.39038
267,-0.39038
268,-0.39038
269,-0.39038
270,-0.39038
271,-0.39038
272,-0.39038
273,-0.39038
274,-0.39038
275,-0.39038
276,-0.39038
277,-0.39038
278,-0.39038
279,-0.39038
280,-0.39038
281,-0.39038
282,-0.39038
283,-0.39038
284,-0.39038
285,-0.39038
286,-0.39038
287,2.8939
288,2.8939
289,2.8939
290,0.13510999999999998
291,-0.39038
292,-0.39038
293,-0.39038
294,-0.39038
295,-0.39038
296,-0.39038
297,-0.39038
298,-0.39038
299,-0.39038
300,-0.39038
301,-0.39038
302,-0.39038
303,-0.39038
304,-0.39038
305,-0.39038
306,-0.39038
307,-0.39038
308,-0.39038
309,-0.39038
310,-0.39038
311,-0.39038
312,-0.39038
313,-0.39038
314,2.2371
315,2.8939
316,2.8939
317,0.59492
318,-0.32469000000000003
319,-0.39038
320,-0.39038
321,-0.39038
322,-0.39038
323,-0.39038
324,-0.39038
325,-0.39038
326,-0.39038
327,-0.39038
328,-0.39038
329,-0.39038
330,-0.39038
331,-0.39038
332,-0.39038
333,-0.39038
334,-0.39038
335,-0.39038
336,-0.39038
337,-0.39038
338,-0.39038
339,-0.39038
340,-0.39038
341,2.8939
342,3.2224
343,2.5655
344,0.13510999999999998
345,-0.32469000000000003
346,-0.39038
347,-0.39038
348,-0.39038
349,-0.39038
350,-0.39038
351,-0.39038
352,-0.39038
353,-0.39038
354,-0.39038
355,-0.39038
356,-0.39038
357,-0.39038
358,-0.39038
359,-0.39038
360,-0.39038
361,-0.39038
362,-0.39038
363,-0.39038
364,-0.39038
365,-0.39038
366,-0.39038
367,-0.12763
368,3.2224
369,2.8939
370,2.5655
371,-0.19332
372,-0.39038
373,-0.39038
374,-0.39038
375,-0.39038
376,-0.39038
377,-0.39038
378,-0.39038
379,-0.39038
380,-0.39038
381,-0.39038
382,-0.39038
383,-0.39038
384,-0.39038
385,-0.39038
386,-0.39038
387,-0.39038
388,-0.39038
389,-0.39038
390,-0.39038
391,-0.39038
392,-0.39038
393,-0.39038
394,1.4488
395,3.2224
396,2.8939
397,0.9890399999999999
398,-0.39038
399,-0.39038
400,-0.39038
401,-0.39038
402,-0.39038
403,-0.39038
404,-0.39038
405,-0.39038
406,-0.39038
407,-0.39038
408,-0.39038
409,-0.39038
410,-0.39038
411,-0.39038
412,-0.39038
413,-0.39038
414,-0.39038
415,-0.39038
416,-0.39038
417,-0.39038
418,-0.39038
419,-0.39038
420,0.9890399999999999
421,2.8939
422,2.8939
423,1.9743
424,-0.39038
425,-0.39038
426,-0.39038
427,-0.39038
428,-0.39038
429,-0.39038
430,-0.39038
431,-0.39038
432,-0.39038
433,-0.39038
434,-0.39038
435,-0.39038
436,-0.39038
437,-0.39038
438,-0.39038
439,-0.39038
440,-0.39038
441,-0.39038
442,-0.39038
443,-0.39038
444,-0.39038
445,-0.39038
446,0.79198
447,2.8939
448,2.8939
449,1.9743
450,-0.25901
451,-0.39038
452,-0.39038
453,-0.39038
454,-0.39038
455,-0.39038
456,-0.39038
457,-0.39038
458,-0.39038
459,-0.39038
460,-0.39038
461,-0.39038
462,-0.39038
463,-0.39038
464,-0.39038
465,-0.39038
466,-0.39038
467,-0.39038
468,-0.39038
469,-0.39038
470,-0.39038
471,-0.39038
472,0.79198
473,3.2224
474,2.8939
475,1.7116
476,-0.19332
477,-0.39038
478,-0.39038
479,-0.39038
480,-0.39038
481,-0.39038
482,-0.39038
483,-0.39038
484,-0.39038
485,-0.39038
486,-0.39038
487,-0.39038
488,-0.39038
489,-0.39038
490,-0.39038
491,-0.39038
492,-0.39038
493,-0.39038
494,-0.39038
495,-0.39038
496,-0.39038
497,-0.39038
498,1.9743
499,2.8939
500,2.8939
501,1.1861
502,-0.32469000000000003
503,-0.39038
504,-0.39038
505,-0.39038
506,-0.39038
507,-0.39038
508,-0.39038
509,-0.39038
510,-0.39038
511,-0.39038
512,-0.39038
513,-0.39038
514,-0.39038
515,-0.39038
516,-0.39038
517,-0.39038
518,-0.39038
519,-0.39038
520,-0.39038
521,-0.39038
522,-0.39038
523,-0.12763
524,3.2224
525,2.8939
526,2.5655
527,0.0037405
528,-0.39038
529,-0.39038
530,-0.39038
531,-0.39038
532,-0.39038
533,-0.39038
534,-0.39038
535,-0.39038
536,-0.39038
537,-0.39038
538,-0.39038
539,-0.39038
540,-0.39038
541,-0.39038
542,-0.39038
543,-0.39038
544,-0.39038
545,-0.39038
546,-0.39038
547,-0.39038
548,-0.39038
549,1.4488
550,2.8939
551,2.8939
552,1.4488
553,-0.39038
554,-0.39038
555,-0.39038
556,-0.39038
557,-0.39038
558,-0.39038
559,-0.39038
560,-0.39038
561,-0.39038
562,-0.39038
563,-0.39038
564,-0.39038
565,-0.39038
566,-0.39038
567,-0.39038
568,-0.39038
569,-0.39038
570,-0.39038
571,-0.39038
572,-0.39038
573,-0.39038
574,0.79198
575,3.2224
576,2.8939
577,1.9743
578,-0.39038
579,-0.39038
580,-0.39038
581,-0.39038
582,-0.39038
583,-0.39038
584,-0.39038
585,-0.39038
586,-0.39038
587,-0.39038
588,-0.39038
589,-0.39038
590,-0.39038
591,-0.39038
592,-0.39038
593,-0.39038
594,-0.39038
595,-0.39038
596,-0.39038
597,-0.39038
598,-0.39038
599,0.39786
600,3.2224
601,2.5655
602,2.2371
603,-0.12763
604,-0.39038
605,-0.39038
606,-0.39038
607,-0.39038
608,-0.39038
609,-0.39038
610,-0.39038
611,-0.39038
612,-0.39038
613,-0.39038
614,-0.39038
615,-0.39038
616,-0.39038
617,-0.39038
618,-0.39038
619,-0.39038
620,-0.39038
621,-0.39038
622,-0.39038
623,-0.39038
624,-0.39038
625,2.8939
626,2.8939
627,2.8939
628,0.0037405
629,-0.39038
630,-0.39038
631,-0.39038
632,-0.39038
633,-0.39038
634,-0.39038
635,-0.39038
636,-0.39038
637,-0.39038
638,-0.39038
639,-0.39038
640,-0.39038
641,-0.39038
642,-0.39038
643,-0.39038
644,-0.39038
645,-0.39038
646,-0.39038
647,-0.39038
648,-0.39038
649,-0.39038
650,2.2371
651,3.2224
652,2.8939
653,0.59492
654,-0.32469000000000003
655,-0.39038
656,-0.39038
657,-0.39038
658,-0.39038
659,-0.39038
660,-0.39038
661,-0.39038
662,-0.39038
663,-0.39038
664,-0.39038
665,-0.39038
666,-0.39038
667,-0.39038
668,-0.39038
669,-0.39038
670,-0.39038
671,-0.39038
672,-0.39038
673,-0.39038
674,-0.39038
675,1.1861
676,2.8939
677,2.8939
678,1.7116
679,-0.39038
680,-0.39038
681,-0.39038
682,-0.39038
683,-0.39038
684,-0.39038
685,-0.39038
686,-0.39038
687,-0.39038
688,-0.39038
689,-0.39038
690,-0.39038
691,-0.39038
692,-0.39038
693,-0.39038
694,-0.39038
695,-0.39038
696,-0.39038
697,-0.39038
698,-0.39038
699,-0.39038
700,0.13510999999999998
701,3.2224
702,2.8939
703,2.2371
704,-0.12763
705,-0.39038
706,-0.39038
707,-0.39038
708,-0.39038
709,-0.39038
710,-0.39038
711,-0.39038
712,-0.39038
713,-0.39038
714,-0.39038
715,-0.39038
716,-0.39038
717,-0.39038
718,-0.39038
719,-0.39038
