time,value
0,-1.2782
1,-1.2707
2,-1.2754
3,-1.244
4,-1.2965
5,-1.2244
6,-1.2484
7,-1.216
8,-1.2532
9,-1.2904
10,-1.2263
11,-1.2746
12,-1.2483
13,-1.2257
14,-1.2577
15,-1.2812
16,-1.2055
17,-1.2769
18,-1.2829
19,-1.2144
20,-1.2923
21,-1.27
22,-1.2385
23,-1.2754
24,-1.2495
25,-1.2756
26,-1.2739
27,-1.2922
28,-1.2607
29,-1.3002
30,-1.2766
31,-1.3056
32,-1.2832
33,-1.2613
34,-1.2458
35,-1.2537
36,-1.2655
37,-1.2357
38,-1.2012
39,-1.2698
40,-1.2513
41,-1.2166
42,-1.3415
43,-1.249
44,-1.2911
45,-1.2578
46,-1.296
47,-1.2625
48,-1.2466
49,-1.2281
50,-1.3090000000000002
51,-1.2789
52,-1.2488
53,-1.2293
54,-1.2817
55,-1.2776
56,-1.2601
57,-1.2081
58,-1.2684
59,-1.2339
60,-1.228
61,-1.2825
62,-1.2242
63,-1.2752
64,-1.2755
65,-1.2297
66,-1.2608
67,-1.3054
68,-1.2181
69,-1.2089
70,-1.2566
71,-1.2589
72,-1.2448
73,-1.2890000000000001
74,-1.3105
75,-1.2621
76,-1.2569
77,-1.2231
78,-1.2393
79,-1.2434
80,-1.2144
81,-1.2368
82,-1.2427
83,-1.2486
84,-1.281
85,-1.2374
86,-1.2341
87,-1.2358
88,-1.2066
89,-1.2189
90,-1.2657
91,-1.2189
92,-1.2177
93,-1.2124
94,-1.1924
95,-1.1674
96,-1.1679
97,-1.0716
98,-1.094
99,-1.0775
100,-1.0661
101,-0.9653200000000001
102,-0.91351
103,-0.8892399999999999
104,-0.75592
105,-0.7243
106,-0.6926800000000001
107,-0.60782
108,-0.4884
109,-0.46898
110,-0.26299
111,-0.1728
112,-0.07636799999999999
113,0.013446000000000001
114,0.090737
115,0.12447000000000001
116,0.28792
117,0.37162
118,0.42386
119,0.523
120,0.56845
121,0.64455
122,0.63913
123,0.63371
124,0.66103
125,0.71134
126,0.75146
127,0.71058
128,0.7881600000000001
129,0.8054600000000001
130,0.78355
131,0.84111
132,0.8438200000000001
133,0.84698
134,0.87023
135,0.8810899999999999
136,0.82165
137,0.8641700000000001
138,0.8724299999999999
139,0.8667299999999999
140,0.8380200000000001
141,0.8680899999999999
142,0.8929600000000001
143,0.79833
144,0.8255399999999999
145,0.93263
146,0.87555
147,0.86992
148,0.8291299999999999
149,0.8367100000000001
150,0.84429
151,0.8688
152,0.8559
153,0.87526
154,0.85139
155,0.8951
156,0.89707
157,0.82804
158,0.8528600000000001
159,0.9163600000000001
160,0.82109
161,0.8404799999999999
162,0.85988
163,0.8727
164,0.89395
165,0.86159
166,0.83473
167,0.8726200000000001
168,0.81924
169,0.9071
170,0.8761200000000001
171,0.8593799999999999
172,0.8523299999999999
173,0.82801
174,0.84439
175,0.8493700000000001
176,0.8653700000000001
177,0.8318399999999999
178,0.84821
179,0.89115
180,0.9341
181,0.86675
182,0.82978
183,0.8478700000000001
184,0.85606
185,0.8972
186,0.8434200000000001
187,0.83845
188,0.87231
189,0.8449200000000001
190,0.9065200000000001
191,0.82045
192,0.89917
193,0.81133
194,0.85808
195,0.89751
196,0.9035
197,0.8393
198,0.8678600000000001
199,0.84785
200,0.8302799999999999
201,0.86679
202,0.8449700000000001
203,0.84185
204,0.88454
205,0.88541
206,0.85867
207,0.8330200000000001
208,0.9062600000000001
209,0.8466899999999999
210,0.8668799999999999
211,0.8745
212,0.80248
213,0.81628
214,0.85541
215,0.8570200000000001
216,0.85054
217,0.84406
218,0.87151
219,0.86959
220,0.86767
221,0.92391
222,0.83091
223,0.86766
224,0.8639399999999999
225,0.88644
226,0.87613
227,0.86103
228,0.81612
229,0.8413
230,0.8089
231,0.83188
232,0.8770600000000001
233,0.8706299999999999
234,0.86692
235,0.8573
236,0.82434
237,0.8285600000000001
238,0.89879
239,0.81978
240,0.8502299999999999
241,0.8527100000000001
242,0.8552
243,0.80213
244,0.8389
245,0.8348
246,0.8517100000000001
247,0.8455799999999999
248,0.8204299999999999
249,0.8747
250,0.8562200000000001
251,0.8873700000000001
252,0.82945
253,0.84952
254,0.85757
255,0.8395799999999999
256,0.8610700000000001
257,0.8187
258,0.8343799999999999
259,0.85995
260,0.85813
261,0.8094600000000001
262,0.84449
263,0.8632
264,0.8397100000000001
265,0.87784
266,0.8723200000000001
267,0.8668100000000001
268,0.9067299999999999
269,0.82481
270,0.8579600000000001
271,0.8263799999999999
272,0.8625200000000001
273,0.8396299999999999
274,0.8722
