time,value
0,2.2319999999999998
1,2.8633
2,3.2297
3,3.2841
4,3.0252
5,2.4882
6,1.7426
7,0.89012
8,0.062662
9,-0.58939
10,-0.92506
11,-0.85436
12,-0.37842
13,0.39169
14,1.253
15,1.9658
16,2.3289
17,2.2477
18,1.7665
19,1.0502
20,0.32202
21,-0.21808000000000002
22,-0.46056
23,-0.41391000000000006
24,-0.18479
25,0.07752200000000001
26,0.24593
27,0.26263000000000003
28,0.15022
29,-0.012223999999999999
30,-0.13376
31,-0.15450999999999998
32,-0.06994299999999999
33,0.072516
34,0.19943
35,0.24724000000000002
36,0.1908
37,0.054437
38,-0.098503
39,-0.19186
40,-0.16842000000000001
41,-0.014466999999999999
42,0.23078
43,0.4924
44,0.68002
45,0.72183
46,0.59045
47,0.31813
48,-0.021075
49,-0.33908
50,-0.5638
51,-0.662
52,-0.64708
53,-0.56807
54,-0.4852
55,-0.44366000000000005
56,-0.4578
57,-0.51167
58,-0.5725899999999999
59,-0.60919
60,-0.60516
61,-0.56958
62,-0.52623
63,-0.49942
64,-0.50073
65,-0.52657
66,-0.56179
67,-0.58959
68,-0.5988
69,-0.59046
70,-0.5744600000000001
71,-0.56343
72,-0.56458
73,-0.57858
74,-0.60002
75,-0.62152
76,-0.63641
77,-0.6431
78,-0.64432
79,-0.64483
80,-0.6474300000000001
81,-0.65289
82,-0.6603100000000001
83,-0.66824
84,-0.67493
85,-0.6797
86,-0.68342
87,-0.6876
88,-0.6925
89,-0.69728
90,-0.70228
91,-0.70798
92,-0.7147899999999999
93,-0.72247
94,-0.73056
95,-0.7379600000000001
96,-0.74316
97,-0.74442
98,-0.7412
