time,value
0,0.17820999999999998
1,0.5243399999999999
2,-0.37056
3,-0.01996
4,0.06068099999999999
5,-0.34423000000000004
6,0.33663000000000004
7,0.61403
8,-0.063631
9,0.38095
10,0.15529
11,-0.10052
12,-0.052770000000000004
13,-0.11614000000000001
14,0.027160000000000004
15,0.36383000000000004
16,-0.25645999999999997
17,0.20848000000000003
18,-0.066357
19,-0.44808000000000003
20,-0.36069
21,-0.21600000000000003
22,-0.037982
23,-0.37871
24,0.026638
25,0.23615
26,0.14904
27,0.25806999999999997
28,-0.62358
29,0.16641
30,0.092218
31,-0.28898
32,0.30683
33,-0.57494
34,-0.15752
35,0.14427
36,-0.026816000000000003
37,-0.53299
38,0.25023
39,0.006523100000000001
40,0.10722999999999999
41,-0.42873999999999995
42,0.4305
43,-0.25619000000000003
44,-0.75502
45,-0.43787
46,0.29212
47,-0.025856999999999998
48,0.019734
49,-1.3701
50,-1.3701
51,-1.3701
52,-1.3701
53,-1.3701
54,-1.3701
55,-1.3701
56,-1.3701
57,-1.3701
58,-1.3701
59,-1.3701
60,-1.3701
61,-1.3701
62,-1.3701
63,-1.3701
64,1.4219
65,1.4219
66,1.4219
67,1.4219
68,1.4219
69,1.4219
70,1.4219
71,1.4219
72,1.4219
73,1.4219
74,1.4219
75,1.4219
76,1.4219
77,1.4219
78,1.4219
79,-1.3701
80,-1.3701
81,-1.3701
82,-1.3701
83,-1.3701
84,-1.3701
85,-1.3701
86,-1.3701
87,-1.3701
88,-1.3701
89,-1.3701
90,-1.3701
91,-1.3701
92,-1.3701
93,-1.3701
94,-1.3701
95,1.4219
96,1.4219
97,1.4219
98,1.4219
99,1.4219
100,1.4219
101,1.4219
102,1.4219
103,1.4219
104,1.4219
105,1.4219
106,1.4219
107,1.4219
108,1.4219
109,1.4219
110,1.4219
111,0.1219
112,0.41267
113,-0.053986
114,0.20584000000000002
115,-0.5042300000000001
116,-0.0075571
117,0.27408000000000005
118,0.083333
119,-0.096074
120,-0.49276000000000003
121,-0.27512
122,0.093289
123,0.32511
124,0.13045
125,0.25006999999999996
126,0.031589
127,-0.50152
