time,value
0,-0.6916399999999999
1,-0.68643
2,-0.67993
3,-0.6724100000000001
4,-0.66425
5,-0.65723
6,-0.6511399999999999
7,-0.64545
8,-0.6396
9,-0.633
10,-0.6265
11,-0.6201
12,-0.61279
13,-0.60422
14,-0.59425
15,-0.58406
16,-0.57508
17,-0.56625
18,-0.55719
19,-0.54747
20,-0.53742
21,-0.529
22,-0.5203800000000001
23,-0.5109
24,-0.49993000000000004
25,-0.48723999999999995
26,-0.47573000000000004
27,-0.46352
28,-0.45008000000000004
29,-0.43481000000000003
30,-0.4173
31,-0.39982
32,-0.38126
33,-0.36067
34,-0.33732
35,-0.31066
36,-0.28212
37,-0.25164000000000003
38,-0.21805
39,-0.18064000000000002
40,-0.13874
41,-0.09284400000000001
42,-0.043377
43,0.011266
44,0.071961
45,0.13945
46,0.21365
47,0.2932
48,0.37877
49,0.46993999999999997
50,0.56602
51,0.66588
52,0.76695
53,0.86872
54,0.97014
55,1.0704
56,1.1687
57,1.264
58,1.3566
59,1.4469
60,1.5356
61,1.6237
62,1.7118
63,1.8005
64,1.8906
65,1.9819
66,2.0739
67,2.1651
68,2.2534
69,2.3368
70,2.4130000000000003
71,2.48
72,2.536
73,2.5802
74,2.6125
75,2.6334
76,2.6436
77,2.6443
78,2.6365
79,2.6213
80,2.5994
81,2.5713
82,2.5372
83,2.4975
84,2.4526
85,2.403
86,2.3491
87,2.2912
88,2.2293
89,2.1639
90,2.0948
91,2.0216
92,1.9439
93,1.8609
94,1.7726
95,1.6791
96,1.5806
97,1.4772
98,1.3693
99,1.2581
100,1.1449
101,1.0309
102,0.9172
103,0.80501
104,0.6953
105,0.59032
106,0.4909
107,0.39739
108,0.30975
109,0.22665
110,0.14908
111,0.076012
112,0.0061513
113,-0.061647
114,-0.12909
115,-0.19473
116,-0.25791
117,-0.31831
118,-0.37535999999999997
119,-0.4293
120,-0.47813
121,-0.5203
122,-0.55591
123,-0.58544
124,-0.61035
125,-0.63084
126,-0.64593
127,-0.65672
128,-0.66447
129,-0.6707
130,-0.67677
131,-0.6807
132,-0.68316
133,-0.68489
134,-0.6864899999999999
135,-0.68998
136,-0.69225
137,-0.69345
138,-0.69396
139,-0.69421
140,-0.69585
141,-0.6967800000000001
142,-0.6967399999999999
143,-0.69618
144,-0.69558
145,-0.69623
146,-0.69691
147,-0.6967399999999999
148,-0.69592
149,-0.6947300000000001
150,-0.6940000000000001
151,-0.6934600000000001
152,-0.69209
153,-0.69017
154,-0.68806
155,-0.6863100000000001
156,-0.6853
157,-0.68385
158,-0.682
159,-0.67984
160,-0.67753
161,-0.67572
162,-0.6734600000000001
163,-0.67084
164,-0.66801
165,-0.6651100000000001
166,-0.66262
167,-0.65995
168,-0.65688
169,-0.65333
170,-0.6492399999999999
171,-0.64489
172,-0.64017
173,-0.6350100000000001
174,-0.62956
175,-0.6239899999999999
176,-0.61857
177,-0.61348
178,-0.6085699999999999
179,-0.60372
180,-0.5988100000000001
181,-0.59382
182,-0.58891
183,-0.58387
184,-0.57872
185,-0.5734899999999999
186,-0.5683199999999999
187,-0.5636399999999999
188,-0.55933
189,-0.55542
190,-0.55187
191,-0.54865
192,-0.546
193,-0.54377
194,-0.54184
195,-0.5401
196,-0.53845
197,-0.53703
198,-0.53579
199,-0.53454
200,-0.53317
201,-0.53162
202,-0.52999
203,-0.5283899999999999
204,-0.52675
205,-0.52507
206,-0.52335
207,-0.52166
208,-0.5201
209,-0.5185
210,-0.51673
211,-0.51463
212,-0.5120600000000001
213,-0.509
214,-0.5052800000000001
215,-0.50085
216,-0.4957
217,-0.48986999999999997
218,-0.48344
219,-0.47648
220,-0.46907
221,-0.46126999999999996
222,-0.45314
223,-0.4447
224,-0.43593999999999994
225,-0.42683000000000004
226,-0.4174
227,-0.40771999999999997
228,-0.39792
229,-0.38814
230,-0.37856
231,-0.36941
232,-0.36091
233,-0.35325
234,-0.34656
235,-0.34081999999999996
236,-0.33605999999999997
237,-0.33231
238,-0.32959
239,-0.32793
240,-0.32727
241,-0.32761
242,-0.32897
243,-0.33126
244,-0.33443
245,-0.33816999999999997
246,-0.34231999999999996
247,-0.34675
248,-0.35148
249,-0.35668
250,-0.36244
251,-0.36904000000000003
252,-0.37678
253,-0.38593
254,-0.3967
255,-0.40908
256,-0.42296000000000006
257,-0.4383
258,-0.45508000000000004
259,-0.47335
260,-0.49313
261,-0.51436
262,-0.53695
263,-0.5606300000000001
264,-0.58487
265,-0.60885
266,-0.63142
267,-0.65151
268,-0.66824
269,-0.68104
