time,value
0,0.04961
1,-0.099255
2,-0.26052
3,-0.40164
4,-0.48403999999999997
5,-0.49573
6,-0.43911999999999995
7,-0.31843
8,-0.16235
9,0.018478
10,0.21969
11,0.43933999999999995
12,0.6723100000000001
13,0.89195
14,1.0787
15,1.1993
16,1.2195
17,1.1069
18,0.8400299999999999
19,0.45001
20,-0.032451999999999995
21,-0.54204
22,-1.0045
23,-1.3672
24,-1.5839
25,-1.6247
26,-1.5146
27,-1.2756
28,-0.9527200000000001
29,-0.58492
30,-0.20674
31,0.1557
32,0.49158
33,0.77999
34,1.0089
35,1.1629
36,1.2245
37,1.1881
38,1.0554
39,0.85052
40,0.59728
41,0.33497
42,0.095898
43,-0.10802
44,-0.28163
45,-0.4441
46,-0.61056
47,-0.78593
48,-0.95531
49,-1.0895
50,-1.1468
51,-1.0853
52,-0.88955
53,-0.5705399999999999
54,-0.16351
55,0.2591
56,0.63949
57,0.91599
58,1.0491
59,1.0364
60,0.9090299999999999
61,0.71186
62,0.49051000000000006
63,0.29116
64,0.13219
65,0.020026
66,-0.041644
67,-0.074573
68,-0.093282
69,-0.10787999999999999
70,-0.13527999999999998
71,-0.163
72,-0.20243
73,-0.24534
74,-0.27926999999999996
75,-0.30951
76,-0.32525
77,-0.32806
78,-0.31629
79,-0.28434
80,-0.2311
81,-0.15334
82,-0.06237
83,0.040908
84,0.14501
85,0.22523
86,0.2725
87,0.26336
88,0.19435999999999998
89,0.081814
90,-0.05973200000000001
91,-0.18825
92,-0.27698
93,-0.28891
94,-0.20654
95,-0.041277
96,0.1693
97,0.37066
98,0.53189
99,0.61416
100,0.59333
101,0.48586999999999997
102,0.31889
103,0.12639
104,-0.056557
105,-0.2114
106,-0.32528
107,-0.39097
108,-0.40302
109,-0.35449
110,-0.23665
111,-0.059815
112,0.16515
113,0.40009
114,0.6037899999999999
115,0.72185
116,0.70204
117,0.51922
118,0.17789000000000002
119,-0.2777
120,-0.79051
121,-1.2782
122,-1.6569
123,-1.8714
124,-1.8713
125,-1.6515
126,-1.2463
127,-0.69688
128,-0.07575
129,0.55471
130,1.127
131,1.5883
132,1.9035
133,2.0577
134,2.0695
135,1.9515
136,1.7278
137,1.4327
138,1.0964
139,0.74421
140,0.37981
141,0.013615
142,-0.36130999999999996
143,-0.75541
144,-1.1606
145,-1.5585
146,-1.9113
147,-2.1845
148,-2.3352
149,-2.3232
150,-2.1226
151,-1.7331
152,-1.1837
153,-0.5163399999999999
154,0.20986
155,0.9098200000000001
156,1.5107
157,1.9369999999999998
158,2.1455
159,2.1197
160,1.8757
161,1.4564
162,0.93991
163,0.40942
164,-0.062854
165,-0.40700000000000003
166,-0.58927
167,-0.6152
168,-0.51558
169,-0.34822
170,-0.18028
171,-0.055249
172,-0.009581999999999999
173,-0.035704
174,-0.11074
175,-0.19493
176,-0.23847
177,-0.22225999999999999
178,-0.13114
179,0.011747
180,0.15805
181,0.27111999999999997
182,0.30338000000000004
183,0.23769
184,0.07109299999999999
185,-0.17861
186,-0.47026
187,-0.7739
188,-1.0258
189,-1.1889
190,-1.2256
191,-1.1024
192,-0.8114600000000001
193,-0.35416
194,0.2198
195,0.8451799999999999
196,1.4275
197,1.8752
198,2.1022
199,2.0412
200,1.6946
201,1.1035
202,0.36029
203,-0.42299
204,-1.1251
205,-1.6387
206,-1.903
207,-1.8833
208,-1.6091
209,-1.1381
210,-0.5542199999999999
211,0.043397000000000005
212,0.5861
213,1.0002
214,1.2506
215,1.3335
216,1.2651
217,1.0918
218,0.8521299999999999
219,0.58695
220,0.32394
221,0.073047
222,-0.15953
223,-0.39803
224,-0.64678
225,-0.9105
226,-1.1886
227,-1.4478
228,-1.6472
229,-1.7362
230,-1.6672
231,-1.4140000000000001
232,-0.96857
233,-0.35686
234,0.36976
235,1.1298
236,1.8293
237,2.3803
238,2.6975
239,2.7285
240,2.4569
241,1.9192
242,1.1917
243,0.37183
244,-0.42499
245,-1.0933
246,-1.5654
247,-1.8221
248,-1.8704
249,-1.7537
250,-1.5467
251,-1.3139
252,-1.1035
253,-0.92461
254,-0.76753
255,-0.60673
256,-0.40794
257,-0.14728
258,0.1816
259,0.55275
260,0.9341299999999999
261,1.2742
262,1.5212
263,1.6392
264,1.6053
265,1.4268
266,1.1226
267,0.73641
268,0.32053000000000004
269,-0.060122
270,-0.35554
271,-0.52671
272,-0.5697300000000001
273,-0.49578
274,-0.35846999999999996
275,-0.22653
276,-0.16674
277,-0.23554
278,-0.44051
279,-0.76346
280,-1.1367
281,-1.4737
282,-1.6896
283,-1.7008
284,-1.4746
285,-1.0192
286,-0.39239
287,0.3283
288,1.041
289,1.6436
290,2.0629
291,2.2506
292,2.1952
293,1.9219
294,1.4866
295,0.9523299999999999
296,0.38715
297,-0.13748
298,-0.59042
299,-0.9358799999999999
300,-1.1786
301,-1.3265
302,-1.3967
303,-1.4156
304,-1.3827
305,-1.3019
306,-1.1613
307,-0.94737
308,-0.65693
309,-0.29354
310,0.12934
311,0.5867100000000001
312,1.0441
313,1.4489
314,1.7469999999999999
315,1.8969999999999998
316,1.8558
317,1.6122
318,1.1819
319,0.60531
320,-0.044663999999999995
321,-0.67752
322,-1.2053
323,-1.5603
324,-1.6966
325,-1.6189
326,-1.3657
327,-1.0027
328,-0.61511
329,-0.27568000000000004
330,-0.03013
331,0.10298
332,0.14914000000000002
333,0.15214
334,0.16489
335,0.22305999999999998
336,0.3511
337,0.53778
338,0.73685
339,0.8971299999999999
340,0.9688
341,0.9156799999999999
342,0.72275
343,0.41962
344,0.06368
345,-0.27059
346,-0.51363
347,-0.60827
348,-0.53538
349,-0.31305
350,-0.0084958
351,0.30268
352,0.52667
353,0.59865
354,0.48275
355,0.17864000000000002
356,-0.25695999999999997
357,-0.74579
358,-1.1993
359,-1.5313
360,-1.6692
361,-1.5839
362,-1.2864
363,-0.80447
364,-0.20724
365,0.42678999999999995
366,1.0237
367,1.5167
368,1.8376
369,1.9564
370,1.8593
371,1.5798
372,1.1637
373,0.68481
374,0.20124
375,-0.22486
376,-0.55279
377,-0.78499
378,-0.9351200000000001
379,-1.0421
380,-1.1338
381,-1.2278
382,-1.3129
383,-1.3569
384,-1.3259999999999998
385,-1.1715
386,-0.8799100000000001
387,-0.44685
388,0.076209
389,0.63071
390,1.1374
391,1.5178
392,1.7247
393,1.7282
394,1.5531
395,1.2209
396,0.80137
397,0.34836999999999996
398,-0.087232
399,-0.46006
400,-0.75288
401,-0.9395
402,-1.0242
403,-1.0086
404,-0.9109
405,-0.74262
406,-0.52575
407,-0.29206
408,-0.074037
409,0.10096000000000001
410,0.22078000000000003
411,0.2729
412,0.27483
413,0.24074
414,0.20006
415,0.19228
416,0.21938000000000002
417,0.28283
418,0.35199
419,0.38369000000000003
420,0.34568000000000004
421,0.20886999999999997
422,-0.026631000000000002
423,-0.32404
424,-0.61412
425,-0.83063
426,-0.8977
427,-0.78776
428,-0.5019600000000001
429,-0.0858
430,0.37999
431,0.79884
432,1.0834
433,1.1682
434,1.0325
435,0.69762
436,0.22560999999999998
437,-0.30889
438,-0.80888
439,-1.1848
440,-1.3684
441,-1.3168
442,-1.0392
443,-0.56862
444,0.023233
445,0.63502
446,1.1645
447,1.5245
448,1.6502
449,1.5268
450,1.1789
451,0.68393
452,0.13255999999999998
453,-0.37008
454,-0.75051
455,-0.97446
456,-1.033
457,-0.97501
458,-0.85746
459,-0.73657
460,-0.65361
461,-0.62754
462,-0.63556
463,-0.63512
464,-0.57805
465,-0.41949
466,-0.14993
467,0.20654
468,0.59949
469,0.9737
470,1.2616
471,1.4145
472,1.4097
473,1.2513
474,0.96891
475,0.59849
476,0.19343
477,-0.21126999999999999
478,-0.57265
479,-0.8657799999999999
480,-1.0653
481,-1.1628
482,-1.1603
483,-1.0572
484,-0.8691700000000001
485,-0.62225
486,-0.3488
487,-0.089263
488,0.12584
489,0.27876
490,0.37149
491,0.41393
492,0.44048000000000004
493,0.47501000000000004
494,0.53745
495,0.61525
496,0.70963
497,0.78203
498,0.8056300000000001
499,0.75862
