time,value
0,-1.2243
1,-1.2334
2,-1.2662
3,-1.2376
4,-1.3047
5,-1.2369
6,-1.2587
7,-1.2543
8,-1.3069
9,-1.2998
10,-1.2376
11,-1.2465
12,-1.2719
13,-1.2974
14,-1.2669
15,-1.2369
16,-1.2764
17,-1.2525
18,-1.1999
19,-1.2286
20,-1.2573
21,-1.2706
22,-1.2839
23,-1.2231
24,-1.236
25,-1.2393
26,-1.2634
27,-1.3018
28,-1.2522
29,-1.2587
30,-1.2235
31,-1.2354
32,-1.2144
33,-1.2288
34,-1.2108
35,-1.2622
36,-1.2614
37,-1.2263
38,-1.2541
39,-1.2488
40,-1.235
41,-1.2285
42,-1.2824
43,-1.2271
44,-1.2625
45,-1.2306
46,-1.2898
47,-1.2189
48,-1.2581
49,-1.2343
50,-1.2019
51,-1.1894
52,-1.2616
53,-1.2619
54,-1.2267
55,-1.2897
56,-1.2248
57,-1.2334
58,-1.2756
59,-1.2713
60,-1.2394
61,-1.266
62,-1.2663
63,-1.2723
64,-1.2784
65,-1.2305
66,-1.2676
67,-1.2624
68,-1.2572
69,-1.2313
70,-1.2667
71,-1.2934
72,-1.2269
73,-1.2568
74,-1.2595
75,-1.2077
76,-1.249
77,-1.2705
78,-1.2511
79,-1.2162
80,-1.2118
81,-1.2193
82,-1.2149
83,-1.2187
84,-1.2248
85,-1.2606
86,-1.2219
87,-1.2565
88,-1.2081
89,-1.1785
90,-1.2027
91,-1.2683
92,-1.2001
93,-1.1932
94,-1.1383
95,-1.1625
96,-1.1665
97,-1.1482
98,-1.1321
99,-1.0931
100,-1.0389
101,-1.0103
102,-0.99211
103,-0.92932
104,-0.8610899999999999
105,-0.8539399999999999
106,-0.74102
107,-0.68257
108,-0.60656
109,-0.5041
110,-0.41573000000000004
111,-0.25695
112,-0.215
113,-0.032152999999999994
114,0.040665
115,0.16344
116,0.2162
117,0.29047
118,0.36772
119,0.41578000000000004
120,0.49785
121,0.56453
122,0.54983
123,0.61775
124,0.65875
125,0.7309399999999999
126,0.75032
127,0.74271
128,0.78992
129,0.81595
130,0.79776
131,0.8045399999999999
132,0.82489
133,0.79997
134,0.8205399999999999
135,0.8518100000000001
136,0.8739899999999999
137,0.86961
138,0.8632
139,0.82342
140,0.87944
141,0.87279
142,0.88679
143,0.8481700000000001
144,0.8339799999999999
145,0.84521
146,0.9097
147,0.85472
148,0.83642
149,0.87445
150,0.84034
151,0.84126
152,0.8424200000000001
153,0.84303
154,0.8448700000000001
155,0.8290700000000001
156,0.8688799999999999
157,0.8864799999999999
158,0.8247700000000001
159,0.86101
160,0.84621
161,0.86065
162,0.88676
163,0.87398
164,0.81839
165,0.8872700000000001
166,0.8774
167,0.8461700000000001
168,0.82495
169,0.85709
170,0.92779
171,0.86016
172,0.85498
173,0.8858799999999999
174,0.85555
175,0.92624
176,0.86467
177,0.8658
178,0.8549700000000001
179,0.8990100000000001
180,0.84167
181,0.8656
182,0.83
183,0.88249
184,0.8789100000000001
185,0.87534
186,0.86516
187,0.84872
188,0.83691
189,0.8674
190,0.88287
191,0.84157
192,0.8809799999999999
193,0.86269
194,0.8528899999999999
195,0.86551
196,0.8623799999999999
197,0.88808
198,0.8439200000000001
199,0.8232
200,0.8419700000000001
201,0.8965700000000001
202,0.90585
203,0.9162399999999999
204,0.8887799999999999
205,0.8396899999999999
206,0.92133
207,0.8583799999999999
208,0.83024
209,0.8895700000000001
210,0.8665200000000001
211,0.91233
212,0.81776
213,0.8857700000000001
214,0.8940600000000001
215,0.8580399999999999
216,0.82325
217,0.8097
218,0.84644
219,0.87823
220,0.81877
221,0.8716700000000001
222,0.85844
223,0.90649
224,0.8393799999999999
225,0.81534
226,0.91806
227,0.8608
228,0.8531
229,0.87892
230,0.8543
231,0.87613
232,0.8979600000000001
233,0.8921899999999999
234,0.8864299999999999
235,0.8604200000000001
236,0.8689600000000001
237,0.8870899999999999
238,0.83219
239,0.83915
240,0.8741899999999999
241,0.8455299999999999
242,0.90048
243,0.85024
244,0.8615799999999999
245,0.85955
246,0.9158700000000001
247,0.86936
248,0.9056700000000001
249,0.8777299999999999
250,0.8637100000000001
251,0.8496799999999999
252,0.82683
253,0.8618600000000001
254,0.83868
255,0.8685200000000001
256,0.86666
257,0.8885700000000001
258,0.87113
259,0.8536799999999999
260,0.8730399999999999
261,0.8962399999999999
262,0.83239
263,0.85101
264,0.85898
265,0.8901700000000001
266,0.8414299999999999
267,0.8537799999999999
268,0.8217
269,0.8549
270,0.8361299999999999
271,0.8496299999999999
272,0.8816
273,0.8810399999999999
274,0.8177300000000001
