time,value
0,1.2725
1,1.2725
2,1.2725
3,1.2725
4,1.2725
5,1.2725
6,1.2725
7,1.2725
8,1.2725
9,1.2725
10,1.2725
11,1.2725
12,1.2725
13,1.2725
14,1.2725
15,1.2725
16,1.2725
17,1.2725
18,1.2725
19,1.2725
20,1.2725
21,1.2725
22,1.2725
23,1.2725
24,1.2725
25,1.2725
26,1.2725
27,1.2725
28,1.2725
29,1.2725
30,1.2725
31,1.2725
32,1.2725
33,1.2725
34,1.2725
35,1.2725
36,1.2725
37,1.2725
38,1.2725
39,1.2725
40,1.2725
41,1.2725
42,1.2725
43,1.2725
44,1.2725
45,1.2725
46,1.2725
47,1.2725
48,1.2725
49,1.2725
50,1.2725
51,1.2725
52,1.2725
53,1.2725
54,1.2725
55,1.2725
56,1.2725
57,1.2725
58,1.2725
59,1.2725
60,1.2642
61,1.2506
62,1.2347
63,1.2199
64,1.2096
65,1.2093
66,1.2093
67,1.2083
68,1.2025
69,1.1866
70,1.1707
71,1.1548
72,1.1472
73,1.1461
74,1.1461
75,1.1461
76,1.1556
77,1.1697
78,1.1856
79,1.1988
80,1.2006
81,1.1854
82,1.1695
83,1.1519
84,1.1292
85,1.0974
86,1.0656
87,1.0339
88,1.011
89,0.9950200000000001
90,0.9791200000000001
91,0.9632299999999999
92,0.93673
93,0.90628
94,0.87449
95,0.84426
96,0.8209200000000001
97,0.80467
98,0.78877
99,0.77288
100,0.75698
101,0.7410899999999999
102,0.72519
103,0.70929
104,0.6934
105,0.6775
106,0.66161
107,0.64571
108,0.62981
109,0.61392
110,0.59802
111,0.58213
112,0.56623
113,0.55033
114,0.5344399999999999
115,0.51854
116,0.50265
117,0.48675
118,0.47085
119,0.45496000000000003
120,0.43906000000000006
121,0.42317
122,0.40726999999999997
123,0.39137
124,0.38832
125,0.38795
126,0.38795
127,0.38605
128,0.37479
129,0.35918
130,0.34328000000000003
131,0.33102
132,0.32477
133,0.32477
134,0.32477
135,0.32163
136,0.31109000000000003
137,0.29519
138,0.2793
139,0.2634
140,0.24750999999999998
141,0.23160999999999998
142,0.21570999999999999
143,0.20185999999999998
144,0.19864
145,0.19841
146,0.19841
147,0.18996
148,0.16863
149,0.13684000000000002
150,0.10505
151,0.451
152,0.40299999999999997
153,0.40299999999999997
154,0.40229000000000004
155,0.39323
156,0.32452
157,0.24504
158,0.16557
159,0.08608500000000001
160,0.10462
161,-0.072875
162,-0.15236
163,-0.23183
164,-0.31131
165,-0.39079
166,-0.47026999999999997
167,-0.1185
168,-0.1344
169,-0.1503
170,-0.16642
171,-0.18553
172,-0.21529
173,-0.24708000000000002
174,-0.27887
175,-0.31066
176,-0.34246
177,-0.37425
178,-0.40604
179,-0.43783
180,-0.46962
181,-0.50141
182,-0.5332100000000001
183,-0.55875
184,-0.57828
185,-0.59417
186,-0.61036
187,-0.63089
188,-0.66078
189,-0.69257
190,-0.7236199999999999
191,-0.74931
192,-0.74931
193,-0.74931
194,-0.74931
195,-0.7552
196,-0.76903
197,-0.78493
198,-0.80082
199,-0.80948
200,-0.8124899999999999
201,-0.8124899999999999
202,-0.81282
203,-0.81886
204,-0.8330200000000001
205,-0.84891
206,-0.8648100000000001
207,-0.8807
208,-0.8966
209,-0.9125
210,-0.9283899999999999
211,-0.93789
212,-0.93886
213,-0.93886
214,-0.93886
215,-0.93065
216,-0.91712
217,-0.90123
218,-0.8856799999999999
219,-0.87723
220,-0.8756700000000001
221,-0.8756700000000001
222,-0.87702
223,-0.88231
224,-0.8982100000000001
225,-0.9141100000000001
226,-0.93
227,-0.9459
228,-0.9617899999999999
229,-0.97769
230,-0.99359
231,-1.0003
232,-1.002
233,-1.002
234,-1.002
235,-1.002
236,-1.002
237,-1.002
238,-1.0002
239,-0.99379
240,-0.9778899999999999
241,-0.96199
242,-0.9482
243,-0.9475100000000001
244,-0.9634
245,-0.9793
246,-0.9952
247,-1.001
248,-1.002
249,-1.002
250,-1.0024
251,-1.0126
252,-1.0274
253,-1.0433
254,-1.0592
255,-1.0751
256,-1.091
257,-1.1069
258,-1.1228
259,-1.1387
260,-1.1546
261,-1.1705
262,-1.1863
263,-1.1803
264,-1.165
265,-1.1491
266,-1.1335
267,-1.1293
268,-1.1284
269,-1.1284
270,-1.1284
271,-1.1284
272,-1.1284
273,-1.1284
274,-1.1312
275,-1.1403
276,-1.1562
277,-1.1721
278,-1.1872
279,-1.1916
280,-1.1916
281,-1.1916
282,-1.1918
283,-1.2049
284,-1.2202
285,-1.236
286,-1.2519
287,-1.2678
288,-1.2837
289,-1.2996
290,-1.3119
291,-1.3179
292,-1.3179
293,-1.3179
294,-1.32
295,-1.3318
296,-1.3477
297,-1.3636
298,-1.3795
299,-1.3954
300,-1.4113
301,-1.4272
302,-1.4397
303,-1.4443
304,-1.4443
305,-1.4443
306,-1.4443
307,-1.4443
308,-1.4443
309,-1.4443
310,-1.4477
311,-1.4598
312,-1.4757
313,-1.4916
314,-1.5075
315,-0.4072
316,-0.4072
317,-0.4072
318,-0.4072
319,-0.4072
320,-0.4072
321,-0.4072
322,-0.4072
323,-0.4072
324,-0.4072
325,-0.4072
326,-0.4072
327,-0.4072
328,-0.4072
329,-0.4072
330,-0.4072
331,-0.4072
332,-0.4072
333,-0.4072
334,-0.4072
335,-0.4072
336,-0.4072
337,-0.4072
338,-0.4072
339,-0.4072
340,-0.4072
341,-0.4072
342,-0.4072
343,-0.4072
344,-0.4072
345,-0.4072
346,-0.4072
347,-0.4072
348,-0.4072
349,-0.4072
350,-0.4072
351,-0.4072
352,-0.4072
353,-0.4072
354,-0.4072
355,-0.38231
356,-0.33468000000000003
357,-0.27681
358,-0.21895
359,-0.18685
360,-0.1772
361,-0.1772
362,-0.174
363,-0.15862
364,-0.466
365,-0.17667
366,0.10701
367,0.30677
368,0.30677
369,0.30677
370,0.30677
371,0.30677
372,0.30677
373,0.30677
374,0.30677
375,0.4574
376,0.13264
377,0.19050999999999998
378,0.24427
379,0.28163
380,0.2828
381,0.2828
382,0.2828
383,0.2828
384,0.2828
385,0.2828
386,0.2828
387,0.2828
388,0.2828
389,0.2828
390,0.2828
391,0.2828
392,0.2828
393,0.2828
394,0.28773000000000004
395,0.31335999999999997
396,0.36996
397,0.42783000000000004
398,0.47948999999999997
399,0.5128
400,0.5128
401,0.5128
402,0.5128
403,0.5128
404,0.5128
405,0.5128
406,0.5128
407,0.5128
408,0.5128
409,0.5128
410,0.5128
411,0.5128
412,0.5128
413,0.5128
414,0.5128
415,0.5128
416,0.5128
417,0.5128
418,0.5128
419,0.5128
420,0.5128
421,0.5128
422,0.5128
423,0.5128
424,0.5128
425,0.5128
426,0.51913
427,0.55502
428,0.61168
429,0.66955
430,0.7055100000000001
431,0.70031
432,0.64245
433,0.58458
434,0.53422
435,0.5128
436,0.5128
437,0.5128
438,0.5128
439,0.60632
440,0.71936
441,0.83509
442,0.9439
443,1.0186
444,1.0775
445,1.1354
446,1.1801
447,1.2028
448,1.2028
449,1.2028
450,1.2142
451,1.2526
452,1.3105
453,1.3682
454,1.4246
455,1.4328
456,1.4328
457,1.4328
458,1.4328
459,1.4328
460,1.4328
461,1.4328
462,1.4328
463,1.4328
464,1.4328
465,1.4328
466,1.4328
467,1.4328
468,1.4328
469,1.4333
470,1.4399
471,1.4899
472,1.5478
473,1.6057
474,1.6557
475,1.6623
476,1.6628
477,1.6628
478,1.6628
479,1.6628
480,1.6628
481,1.6628
482,1.6628
483,1.6628
484,1.6628
485,1.662
486,1.6502
487,1.5998
488,1.5419
489,1.4841
490,1.4262
491,1.3683
492,1.3105
493,1.2526
494,1.1947
495,1.1369
496,1.079
497,1.0211
498,0.986
499,0.9727899999999999
500,0.9727899999999999
501,0.9717399999999999
502,0.95489
503,0.90394
504,0.8460700000000001
505,0.7882100000000001
506,0.73034
507,0.67248
508,0.61461
509,0.55675
510,0.49888000000000005
511,0.44101
512,0.38315
513,0.32528
514,0.26742
515,0.20955
516,0.15168
517,0.095026
518,0.33843
519,0.30677
520,0.30677
521,0.30677
522,0.30677
523,0.30677
524,0.30677
525,0.30677
526,0.30677
527,0.30677
528,0.30677
529,0.30677
530,0.30677
531,0.30677
532,0.30677
533,0.30677
534,0.30677
535,0.30677
536,0.30677
537,0.28221
538,0.18591
539,-0.10342
540,-0.39275
541,-0.14497000000000002
542,-0.20282999999999998
543,-0.2607
544,-0.31856999999999996
545,-0.37643000000000004
546,-0.401
547,-0.4072
548,-0.4072
549,-0.4072
550,-0.4072
551,-0.4072
552,-0.4072
553,-0.4072
554,-0.4072
555,-0.4072
556,-0.4072
557,-0.41101000000000004
558,-0.43868999999999997
559,-0.49656000000000006
560,-0.55442
561,-0.61229
562,-0.63349
563,-0.6371899999999999
564,-0.6371899999999999
565,-0.63837
566,-0.67572
567,-0.72949
568,-0.78735
569,-0.8452200000000001
570,-0.90309
571,-0.96095
572,-1.0188
573,-1.0696
574,-1.0972
575,-1.0972
576,-1.0972
577,-1.0972
578,-1.0972
579,-1.0972
580,-1.0972
581,-1.0972
582,-1.0972
583,-1.0972
584,-1.0972
585,-1.0972
586,-1.0972
587,-1.0972
588,-1.0972
589,-1.1074
590,-1.1404
591,-1.1983
592,-1.2561
593,-1.314
594,-1.3719
595,-1.4297
596,-1.4876
597,-1.5447
598,-1.555
599,-1.5572
600,-1.5572
601,-1.5683
602,-1.6048
603,-1.6627
604,-1.7205
605,-1.7651
606,-1.7872
607,-1.7872
608,-1.7872
609,-1.7947
610,-1.8377
611,-1.8956
612,-1.9535
613,-2.0109
614,-2.016
615,-2.0172
616,-2.0172
617,-2.0296
618,-2.0707
619,-2.1285
620,-2.1864
621,-2.2279
622,-2.2472
623,-2.2472
624,-2.2472
625,-2.235
626,-2.1908
627,-2.1329
628,-2.0751
629,-2.0172
630,-0.47562
631,-0.47562
632,-0.47562
633,-0.47562
634,-0.47562
635,-0.47562
636,-0.47562
637,-0.47562
638,-0.47562
639,-0.47562
640,-0.47562
641,-0.47562
642,-0.47562
643,-0.47562
644,-0.47562
645,-0.47562
646,-0.47562
647,-0.47562
648,-0.47562
649,-0.47562
650,-0.47562
651,-0.47562
652,-0.47562
653,-0.47562
654,-0.47562
655,-0.47562
656,-0.47562
657,-0.47562
658,-0.47562
659,-0.47562
660,-0.47562
661,-0.47562
662,-0.47562
663,-0.47562
664,-0.47562
665,-0.47562
666,-0.47562
667,-0.47562
668,-0.47562
669,-0.47562
670,-0.42523999999999995
671,-0.32882
672,-0.21168
673,-0.42991999999999997
674,0.1558
675,0.13975
676,0.25689
677,0.36756
678,0.45357
679,0.45558999999999994
680,0.45558999999999994
681,0.45558999999999994
682,0.45558999999999994
683,0.45558999999999994
684,0.45558999999999994
685,0.45558999999999994
686,0.45558999999999994
687,0.45558999999999994
688,0.45558999999999994
689,0.45558999999999994
690,0.3946
691,0.29396
692,0.17682
693,0.34115
694,-0.24456
695,-0.17461
696,-0.29175
697,-0.40139
698,-0.47562
699,-0.47562
700,-0.47562
701,-0.47562
702,-0.47562
703,-0.47562
704,-0.47562
705,-0.47562
706,-0.54527
707,-0.6491100000000001
708,-0.76625
709,-0.8534799999999999
710,-0.81492
711,-0.58831
712,-0.35403
713,-0.1323
714,0.30408
715,0.16940999999999998
716,0.28655
717,0.40369
718,0.45461
719,0.45558999999999994
720,0.45558999999999994
721,0.45558999999999994
722,0.37744
723,0.27024000000000004
724,0.1531
725,0.27992
726,0.09789400000000001
727,0.15822999999999998
728,0.15822999999999998
729,-0.094537
730,-0.37801999999999997
731,-0.2013
732,-0.31844
733,-0.4285
734,-0.47562
735,-0.47562
736,-0.47562
737,-0.47562
738,-0.47562
739,-0.47562
740,-0.47562
741,-0.47562
742,-0.47562
743,-0.47562
744,-0.47562
745,-0.49778999999999995
746,-0.56162
747,-0.67877
748,-0.79591
749,-0.91305
750,-1.0302
751,-1.1473
752,-1.2645
753,-1.3816
754,-1.4988
755,-1.6159
756,-1.7331
757,-1.8222
758,-1.7733
759,-1.6604
760,-1.5433
761,-1.4528
762,-1.4068
763,-1.4068
764,-1.4068
765,-1.3837
766,-1.306
767,-1.1889
768,-1.072
769,-0.9577899999999999
770,-0.9412299999999999
771,-0.9412299999999999
772,-0.9412299999999999
773,-0.95625
774,-1.0497
775,-1.1651
776,-1.2823
777,-1.3371
778,-1.2971
779,-1.18
780,-1.0628
781,-0.9766
782,-0.9412299999999999
783,-0.9412299999999999
784,-0.9412299999999999
785,-0.9412299999999999
786,-0.9412299999999999
787,-0.9412299999999999
788,-0.9412299999999999
789,-0.9412299999999999
790,-0.9412299999999999
791,-0.9412299999999999
792,-0.9412299999999999
793,-0.9412299999999999
794,-0.9412299999999999
795,-0.9412299999999999
796,-0.9412299999999999
797,-0.9412299999999999
798,-0.9412299999999999
799,-0.9412299999999999
800,-0.9412299999999999
801,-0.9412299999999999
802,-0.9412299999999999
803,-0.9412299999999999
804,-0.9412299999999999
805,-0.92466
806,-0.81048
807,-0.6936
808,-0.57645
809,-0.45931000000000005
810,-0.34217
811,-0.22501999999999997
812,-0.49663999999999997
813,-0.141
814,0.15822999999999998
815,0.15822999999999998
816,-0.059498
817,-0.18854
818,-0.1494
819,-0.26654
820,-0.38095
821,-0.47562
822,-0.47562
823,-0.47562
824,-0.47562
825,-0.51899
826,-0.6209399999999999
827,-0.7380800000000001
828,-0.8552200000000001
829,-0.91905
830,-0.9412299999999999
831,-0.9412299999999999
832,-0.9412299999999999
833,-0.9412299999999999
834,-0.9412299999999999
835,-0.9412299999999999
836,-0.9412299999999999
837,-0.9412299999999999
838,-0.9412299999999999
839,-0.9412299999999999
840,-0.9412299999999999
841,-0.8941100000000001
842,-0.78405
843,-0.6669
844,-0.54976
845,-0.49307
846,-0.47562
847,-0.47562
848,-0.47562
849,-0.47562
850,-0.47562
851,-0.47562
852,-0.46568000000000004
853,-0.42668999999999996
854,-0.30955
855,-0.1924
856,-0.33842
857,0.15822999999999998
858,0.15822999999999998
859,0.15822999999999998
860,0.15822999999999998
861,0.15822999999999998
862,0.15822999999999998
863,0.15822999999999998
864,0.15822999999999998
865,0.15822999999999998
866,0.15822999999999998
867,0.15822999999999998
868,0.059210000000000006
869,0.29666
870,0.16792
871,0.28507
872,0.40993
873,0.58311
874,0.8174
875,1.0517
876,1.286
877,1.3718
878,1.3868
879,1.3868
880,1.3868
881,1.3868
882,1.3868
883,1.3868
884,1.3868
885,1.3868
886,1.3868
887,1.3868
888,1.3868
889,1.3868
890,1.3868
891,1.3868
892,1.3868
893,1.3868
894,1.3868
895,1.3868
896,1.3868
897,1.3868
898,1.3868
899,1.3868
900,1.4063
901,1.4713
902,1.5885
903,1.7056
904,1.8019999999999998
905,1.8524
906,1.8524
907,1.8524
908,1.8524
909,1.8524
910,1.8524
911,1.8524
912,1.8524
913,1.8524
914,1.8524
915,1.8524
916,1.8524
917,1.8524
918,1.8524
919,1.8524
920,1.8524
921,1.8524
922,1.8524
923,1.8524
924,1.8524
925,1.8524
926,1.8524
927,1.8524
928,1.8524
929,1.8524
930,1.8524
931,1.8524
932,1.8524
933,1.8524
934,1.8524
935,1.8524
936,1.8193
937,1.7412
938,1.6241
939,1.5069
940,1.4392
941,1.501
942,1.6181
943,1.7353
944,1.8524
