time,value
0,-0.40478000000000003
1,-0.05248
2,0.046771
3,-0.040473
4,-0.086324
5,0.063079
6,-0.46458
7,-0.26525
8,0.35039000000000003
9,-1.4491
10,-1.4491
11,-1.4491
12,-1.4491
13,-1.4491
14,-1.4491
15,-1.4491
16,-1.4491
17,-1.4491
18,-1.4491
19,-1.4491
20,-1.4491
21,-1.4491
22,-1.4491
23,1.4585
24,1.4585
25,1.4585
26,1.4585
27,1.4585
28,1.4585
29,1.4585
30,1.4585
31,1.4585
32,1.4585
33,1.4585
34,1.4585
35,1.4585
36,-0.10307000000000001
37,0.6600699999999999
38,0.084959
39,-0.088886
40,-1.4491
41,-1.4491
42,-1.4491
43,-1.4491
44,-1.4491
45,-1.4491
46,-1.4491
47,-1.4491
48,-1.4491
49,-1.4491
50,-1.4491
51,-1.4491
52,-1.4491
53,-1.4491
54,-1.4491
55,1.4585
56,1.4585
57,1.4585
58,1.4585
59,1.4585
60,1.4585
61,1.4585
62,1.4585
63,1.4585
64,1.4585
65,1.4585
66,1.4585
67,1.4585
68,1.4585
69,1.4585
70,0.10859
71,-0.046752999999999996
72,-0.27241
73,-0.25648000000000004
74,-0.45116999999999996
75,0.077323
76,0.024741
77,-0.13796
78,0.025124
79,-0.37158
80,-0.042334
81,0.33164
82,0.15456
83,-0.18817
84,0.7983399999999999
85,0.24789
86,0.19213
87,0.2955
88,0.46526000000000006
89,-0.049966
90,-0.15092
91,-0.2444
92,-0.0057171999999999995
93,0.2216
94,-0.11135999999999999
95,0.56125
96,-0.10518
97,0.30246
98,-0.42635
99,-0.083326
100,0.15574000000000002
101,0.18516
102,-0.60559
103,0.089151
104,0.15632000000000001
105,0.16218
106,0.036351999999999995
107,-0.29832
108,0.37935
109,-0.87869
110,0.35235
111,0.16629000000000002
112,-0.1083
113,-0.11445
114,4.7291000000000005e-05
115,-0.09473999999999999
116,-0.11940999999999999
117,-0.038916
118,0.015399000000000001
119,0.29406
120,0.19741
121,-0.2427
122,0.66375
123,0.31327
124,0.23176999999999998
125,0.36828
126,-0.014367
127,-0.62831
