time,value
0,-0.7324
1,-0.76473
2,-0.62522
3,-0.47285
4,-0.21868
5,0.09557
6,0.39584
7,0.63952
8,0.97959
9,1.2195
10,1.5327
11,1.514
12,1.42
13,1.4185
14,1.5146
15,1.5338
16,1.4680000000000002
17,1.2224
18,0.8963899999999999
19,0.6017600000000001
20,0.26539
21,-0.049721
22,-0.32589
23,-0.59882
24,-0.70638
25,-0.72668
26,-0.58846
27,-0.3919
28,-0.14143
29,0.12211
30,0.39271
31,0.71222
32,1.0371
33,1.2949
34,1.4234
35,1.422
36,1.4159
37,1.4237
38,1.4142
39,1.4185
40,1.4329
41,1.5232
42,1.3696
43,1.0352
44,0.71587
45,0.39921
46,0.090537
47,-0.20772
48,-0.48217
49,-0.66442
50,-0.17707
51,-0.37585
52,-0.5100399999999999
53,-0.66281
54,-0.8440799999999999
55,-1.0384
56,-1.2533
57,-1.462
58,-1.5457
59,-1.3802
60,-1.1865
61,-0.96009
62,-0.84011
63,-0.6471600000000001
64,-0.50688
65,-0.49848000000000003
66,-0.66965
67,-0.92529
68,-1.1147
69,-1.2376
70,-1.3271
71,-1.3718
72,-1.3252
73,-1.2604
74,-1.1894
75,-1.0534
76,-0.89187
77,-0.66005
78,-0.45681000000000005
79,-0.29124
