time,value
0,-0.76567
1,-0.59158
2,-0.36793000000000003
3,-0.10199
4,0.19495
5,0.50798
6,0.81453
7,1.093
8,1.3109
9,1.4294
10,1.4264
11,1.3018
12,1.0663
13,0.75003
14,0.38256999999999997
15,0.011837
16,-0.34979
17,-0.6836800000000001
18,-0.9803700000000001
19,-1.2394
20,-1.4508
21,-1.5964
22,-1.6517
23,-1.6038
24,-1.4371
25,-1.1544
26,-0.77581
27,-0.34479
28,0.10117999999999999
29,0.51586
30,0.8698
31,1.1524
32,1.3648
33,1.5099
34,1.5926
35,1.6091
36,1.545
37,1.383
38,1.1114
39,0.73963
40,0.28983000000000003
41,-0.19854000000000002
42,-0.67777
43,-1.0932
44,-1.4119
45,-1.6168
46,-1.6941
47,-1.6485
48,-1.4974
49,-1.2595
50,-0.9412799999999999
51,-0.56808
52,-0.16460999999999998
53,0.24006999999999998
54,0.60672
55,0.89218
56,1.0731
57,1.1352
58,1.1001
59,0.9837
60,0.8213299999999999
61,0.6490199999999999
62,0.4839
63,0.33475
64,0.20081
65,0.071629
66,-0.06704199999999999
67,-0.21781999999999999
68,-0.37021
69,-0.51146
70,-0.62359
71,-0.69417
72,-0.71838
73,-0.69748
74,-0.63776
75,-0.54179
76,-0.42445
77,-0.28602
78,-0.12738
79,0.039813999999999995
80,0.20231
81,0.3557
82,0.48241000000000006
83,0.56762
84,0.60121
85,0.58306
86,0.52596
87,0.431
88,0.3211
89,0.21015999999999999
90,0.1104
91,0.026626999999999998
92,-0.038762
93,-0.09274500000000001
94,-0.15232
95,-0.22603
96,-0.31814000000000003
97,-0.42987
98,-0.54947
99,-0.66013
100,-0.73923
101,-0.76791
102,-0.73756
103,-0.63358
104,-0.46461
105,-0.24228000000000002
106,0.016022
107,0.28526
108,0.53818
109,0.75817
110,0.9312799999999999
111,1.0483
112,1.1042
113,1.0948
114,1.0196
115,0.8892200000000001
116,0.69266
117,0.44546
118,0.15822
119,-0.16452
120,-0.49873999999999996
121,-0.81714
122,-1.0986
123,-1.3229
124,-1.4629
125,-1.5107
126,-1.4643
127,-1.3293
128,-1.1117
129,-0.82405
130,-0.47994
131,-0.092065
132,0.32823
133,0.7540600000000001
134,1.1597
135,1.5179
136,1.7836
137,1.9122
138,1.8806
139,1.6861
140,1.3275
141,0.8399200000000001
142,0.27692
143,-0.30069
144,-0.83178
145,-1.2658
146,-1.5586
147,-1.6958
148,-1.6814
149,-1.5283
150,-1.2525
151,-0.8981
152,-0.5030600000000001
153,-0.10343
154,0.25822
155,0.55092
156,0.75258
157,0.84849
158,0.8456799999999999
159,0.75938
160,0.6215
161,0.46765
162,0.32094
163,0.20039
164,0.11127999999999999
165,0.048409
166,-0.0081435
167,-0.06741699999999999
168,-0.1266
169,-0.19037
170,-0.24176999999999998
171,-0.26456
172,-0.2521
173,-0.19734000000000002
174,-0.11091
175,-0.010886
176,0.079201
177,0.14315
178,0.16452
179,0.13982
180,0.07205
181,-0.025258000000000003
182,-0.14242
183,-0.26053000000000004
184,-0.37051999999999996
185,-0.45347
186,-0.5000899999999999
187,-0.51279
188,-0.46917
189,-0.36572
190,-0.21178000000000002
191,-0.0056693
192,0.2289
193,0.46101000000000003
194,0.66889
195,0.8218
196,0.8854200000000001
197,0.84354
198,0.69785
199,0.46178
200,0.17227
201,-0.12759
202,-0.39912
203,-0.59397
204,-0.70463
205,-0.73046
206,-0.67632
207,-0.57729
208,-0.44971000000000005
209,-0.30988000000000004
210,-0.17361
211,-0.035955
212,0.1066
213,0.25356
214,0.39781
215,0.53428
216,0.64355
217,0.70817
218,0.71291
219,0.6410899999999999
220,0.49163999999999997
221,0.27709
222,0.0010191
223,-0.30956999999999996
224,-0.6239899999999999
225,-0.9136
226,-1.1511
227,-1.3047
228,-1.3528
229,-1.2849
230,-1.101
231,-0.80919
232,-0.42804
233,0.015221
234,0.48518999999999995
235,0.94363
236,1.3548
237,1.6796
238,1.8992
239,1.9881
240,1.9242
241,1.7066
242,1.3457
243,0.86151
244,0.28781999999999996
245,-0.33618000000000003
246,-0.95086
247,-1.5081
248,-1.9629
249,-2.2758
250,-2.4218
251,-2.3988
252,-2.2124
253,-1.8752
254,-1.4134
255,-0.86567
256,-0.26573
257,0.34601
258,0.93376
259,1.4667
260,1.9105
261,2.2437
262,2.4388
263,2.4826
264,2.3739
265,2.1097
266,1.6937
267,1.1532
268,0.51869
269,-0.1756
270,-0.87674
271,-1.5256
272,-2.0677
273,-2.4555
274,-2.6616
275,-2.6684
276,-2.4729
277,-2.0996
278,-1.58
279,-0.95549
280,-0.28129
281,0.4013
282,1.0385
283,1.5822
284,1.9894
285,2.2382
286,2.3101
287,2.2076
288,1.9539
289,1.5755
290,1.1044
291,0.57928
292,0.033393
293,-0.5022300000000001
294,-0.99293
295,-1.415
296,-1.739
297,-1.9263
298,-1.9556
299,-1.8174
300,-1.5132
301,-1.0842
302,-0.58328
303,-0.064335
304,0.4162
305,0.8044100000000001
306,1.0846
307,1.2475
308,1.3054
309,1.2725
310,1.1671
311,1.002
312,0.77691
313,0.50327
314,0.19577999999999998
315,-0.12002
316,-0.41347
317,-0.65485
318,-0.8122
319,-0.8783200000000001
320,-0.861
321,-0.77803
322,-0.66423
323,-0.53905
324,-0.42241999999999996
325,-0.31825
326,-0.2197
327,-0.11184000000000001
328,0.013397
329,0.1477
330,0.28371999999999997
331,0.40401
332,0.49261000000000005
333,0.54413
334,0.55655
335,0.54195
336,0.51905
337,0.48718999999999996
338,0.44392
339,0.38011
340,0.27763000000000004
341,0.12549000000000002
342,-0.06349400000000001
343,-0.27401
344,-0.47861000000000004
345,-0.63834
346,-0.72115
347,-0.72282
348,-0.64712
349,-0.51625
350,-0.36475
351,-0.22054
352,-0.10442
353,-0.02503
354,0.027010000000000003
355,0.055525
356,0.08428200000000001
357,0.12573
358,0.17952
359,0.25359
360,0.3421
361,0.43162
362,0.51126
363,0.56613
364,0.58595
365,0.55388
366,0.46262
367,0.30451
368,0.091409
369,-0.16013
370,-0.43283
371,-0.67909
372,-0.8758
373,-0.99729
374,-1.0189
375,-0.93637
376,-0.75637
377,-0.5002
378,-0.20047
379,0.11557
380,0.40998
381,0.66218
382,0.83775
383,0.9249200000000001
384,0.9294600000000001
385,0.8539700000000001
386,0.7090000000000001
387,0.5182100000000001
388,0.30918
389,0.10046000000000001
390,-0.090901
391,-0.25902
392,-0.39699
393,-0.50945
394,-0.5987399999999999
395,-0.66476
396,-0.69995
397,-0.7017
398,-0.66562
399,-0.58011
400,-0.4528
401,-0.28688
402,-0.089197
403,0.13103
404,0.35519
405,0.5637
406,0.7447199999999999
407,0.88216
408,0.95219
409,0.94584
410,0.85506
411,0.6694100000000001
412,0.39707
413,0.068965
414,-0.2923
415,-0.64504
416,-0.94555
417,-1.1609
418,-1.2608
419,-1.2413
420,-1.1134
421,-0.89066
422,-0.6101
423,-0.2961
424,0.029869999999999997
425,0.34756
426,0.65091
427,0.9292
428,1.1687
429,1.35
430,1.4449
431,1.4284
432,1.2853
433,1.0038
434,0.60645
435,0.12753
436,-0.39192
437,-0.88702
438,-1.3087
439,-1.6104
440,-1.7663
441,-1.7693
442,-1.6238
443,-1.3532
444,-0.98913
445,-0.5581699999999999
446,-0.09104
447,0.36761
448,0.78666
449,1.1339
450,1.3748
451,1.5005
452,1.4973
453,1.3722
454,1.1599
455,0.8760100000000001
456,0.56061
457,0.24194000000000002
458,-0.081372
459,-0.38678
460,-0.67529
461,-0.95089
462,-1.1911
463,-1.381
464,-1.4869999999999999
465,-1.4818
466,-1.3487
467,-1.0856
468,-0.69294
469,-0.21070999999999998
470,0.3151
471,0.83499
472,1.2821
473,1.6149
474,1.7914
475,1.7871
476,1.6159999999999999
477,1.2867
478,0.83285
479,0.31189
480,-0.23044
481,-0.74152
482,-1.1867
483,-1.5216
484,-1.7186
485,-1.7664
486,-1.6587
487,-1.3927
488,-0.995
489,-0.50693
490,0.028303
491,0.5450699999999999
492,0.9924799999999999
493,1.3186
494,1.4856
495,1.4925
496,1.3485
497,1.082
498,0.74783
499,0.39434
