time,value
0,-0.037002
1,0.15370999999999999
2,-0.12505
3,0.45924
4,-0.29048
5,0.06743099999999999
6,0.35172
7,-0.86036
8,-0.23465999999999998
9,-0.19451
10,-0.44423999999999997
11,-0.17489000000000002
12,-0.025892000000000002
13,-0.37529
14,0.38258000000000003
15,0.16214
16,0.042086
17,-0.31096
18,0.30511
19,-0.048849000000000004
20,-0.11490999999999998
21,-0.42053
22,0.18832000000000002
23,-0.082116
24,0.40168000000000004
25,0.2101
26,0.32463000000000003
27,0.37456
28,0.36711
29,-0.067226
30,0.23665
31,0.28618000000000005
32,-0.066601
33,-0.29949000000000003
34,-0.31748000000000004
35,-0.010495
36,-0.012928
37,0.18965
38,-0.39815
39,-0.61114
40,-0.42522
41,0.055865
42,-0.15957000000000002
43,0.26352
44,-0.07851799999999999
45,-0.1401
46,0.096527
47,0.34335
48,-0.09914500000000001
49,-0.12733
50,-0.17807
51,0.49113999999999997
52,0.19312
53,0.0013151
54,-0.52279
55,0.39705999999999997
56,-0.19802
57,-0.024908
58,0.066008
59,0.12369000000000001
60,0.44404
61,0.40383
62,0.065957
63,-0.55812
64,-0.29548
65,0.20683
66,0.3683
67,-0.014891999999999999
68,-0.38874000000000003
69,1.6980000000000002
70,1.6980000000000002
71,1.6980000000000002
72,1.6980000000000002
73,1.6980000000000002
74,1.6980000000000002
75,1.6980000000000002
76,1.6980000000000002
77,1.6980000000000002
78,1.6980000000000002
79,1.6980000000000002
80,-1.7228
81,-1.7228
82,-1.7228
83,-1.7228
84,-1.7228
85,-1.7228
86,-1.7228
87,-1.7228
88,-1.7228
89,-1.7228
90,1.6980000000000002
91,1.6980000000000002
92,1.6980000000000002
93,1.6980000000000002
94,1.6980000000000002
95,1.6980000000000002
96,1.6980000000000002
97,1.6980000000000002
98,1.6980000000000002
99,1.6980000000000002
100,-1.7228
101,-1.7228
102,-1.7228
103,-1.7228
104,-1.7228
105,-1.7228
106,-1.7228
107,-1.7228
108,-1.7228
109,-1.7228
110,0.29722
111,0.025865
112,0.06289299999999999
113,-0.091727
114,-0.34569
115,-0.036718
116,-0.057897000000000004
117,0.21175
118,-0.11640999999999999
119,-0.040823000000000005
120,0.036137
121,-0.22196
122,-0.17687
123,-0.10317
124,-0.20596
125,0.56048
126,0.17515
127,-0.46308999999999995
