time,value
0,-1.0522
1,-1.0522
2,-1.0522
3,-1.0522
4,-1.0522
5,-1.0522
6,-1.0522
7,-1.0522
8,-1.0522
9,-1.0522
10,-1.0522
11,-1.0522
12,-1.0522
13,-1.0522
14,-1.0522
15,-1.0522
16,-1.0522
17,-1.0522
18,-1.0522
19,-1.0522
20,-1.0522
21,-1.0522
22,-1.0522
23,-1.0522
24,-1.0522
25,-1.0522
26,-1.0522
27,-1.0522
28,-1.0522
29,-1.0522
30,-1.0522
31,-1.0522
32,-1.0522
33,-1.0522
34,-1.0522
35,-1.0522
36,-1.0522
37,-1.0522
38,-1.0522
39,-1.0522
40,-1.0522
41,-1.0522
42,-1.0522
43,-1.0522
44,-1.0522
45,-1.0522
46,-1.0522
47,-1.0522
48,-1.0522
49,-1.0522
50,-1.0522
51,-1.0522
52,-1.0522
53,-1.0522
54,-1.0522
55,-1.0522
56,-1.0522
57,-1.0522
58,-1.0522
59,-1.0522
60,-1.0522
61,-1.0522
62,-1.0522
63,-1.0522
64,-1.0522
65,-1.0494
66,-1.0426
67,-1.0356
68,-1.0275
69,-1.0194
70,-1.0143
71,-1.0094
72,-1.0081
73,-1.0081
74,-1.0081
75,-1.0081
76,-1.0081
77,-1.0081
78,-1.0081
79,-1.0081
80,-1.0081
81,-1.0045
82,-1.0002
83,-0.9935299999999999
84,-0.98539
85,-0.97757
86,-0.9702700000000001
87,-0.96406
88,-0.96406
89,-0.96406
90,-0.96406
91,-0.96406
92,-0.96406
93,-0.96406
94,-0.96406
95,-0.96406
96,-0.96406
97,-0.96406
98,-0.96406
99,-0.96406
100,-0.96406
101,-0.96406
102,-0.96406
103,-0.96406
104,-0.96406
105,-0.96406
106,-0.96406
107,-0.9634
108,-0.9572200000000001
109,-0.95105
110,-0.9359799999999999
111,-0.9197
112,-0.9034200000000001
113,-0.88713
114,-0.87085
115,-0.85457
116,-0.83829
117,-0.8220000000000001
118,-0.80572
119,-0.7935300000000001
120,-0.78146
121,-0.77231
122,-0.76417
123,-0.75567
124,-0.74683
125,-0.73582
126,-0.71954
127,-0.70325
128,-0.68697
129,-0.67069
130,-0.65441
131,-0.63812
132,-0.62184
133,-0.60556
134,-0.5899800000000001
135,-0.57552
136,-0.56205
137,-0.5539
138,-0.54576
139,-0.53762
140,-0.5294800000000001
141,-0.5213399999999999
142,-0.5132
143,-0.5050600000000001
144,-0.49692
145,-0.48804
146,-0.47695
147,-0.46575
148,-0.44947
149,-0.43318999999999996
150,-0.41691000000000006
151,-0.40062
152,-0.38434
153,-0.36806
154,-0.35178000000000004
155,-0.33549
156,-0.31921
157,-0.30293000000000003
158,-0.28665
159,-0.27036
160,-0.25408000000000003
161,-0.2378
162,-0.22152
163,-0.20523000000000002
164,-0.18895
165,-0.17267000000000002
166,-0.15639
167,-0.1401
168,-0.11365
169,-0.086984
170,-0.055883
171,-0.023318000000000002
172,0.0074794
173,0.036676
174,0.062025
175,0.078308
176,0.09459
177,0.11087000000000001
178,0.12716
179,0.14344
180,0.15972
181,0.17600000000000002
182,0.19229000000000002
183,0.20856999999999998
184,0.22485
185,0.24113
186,0.25742
187,0.2737
188,0.28998
189,0.30626
190,0.31727
191,0.32611
192,0.33462
193,0.34276
194,0.35291
195,0.36891
196,0.38515
197,0.40957
198,0.434
199,0.45876000000000006
200,0.4836
201,0.51288
202,0.54545
203,0.57801
204,0.61058
205,0.64253
206,0.67005
207,0.6975600000000001
208,0.72231
209,0.74673
210,0.77013
211,0.79301
212,0.81299
213,0.8292700000000001
214,0.84555
215,0.8618399999999999
216,0.8781200000000001
217,0.8822200000000001
218,0.88615
219,0.8871
220,0.8871
221,0.88994
222,0.8952700000000001
223,0.90395
224,0.9202299999999999
225,0.9365100000000001
226,0.9527899999999999
227,0.9690799999999999
228,0.97915
229,0.98813
230,0.99659
231,1.0047
232,1.0129
233,1.021
234,1.0292
235,1.0373
236,1.0454
237,1.0538
238,1.0623
239,1.0763
240,1.0926
241,1.1089
242,1.1252
243,1.1414
244,1.1577
245,1.1740000000000002
246,1.1903
247,1.2066
248,1.224
249,1.2417
250,1.2633
251,1.2877
252,1.3121
253,1.3366
254,1.3602
255,1.3786
256,1.3969999999999998
257,1.4135
258,1.4298
259,1.4443
260,1.4581
261,1.4693
262,1.4775
263,1.4856
264,1.4938
265,1.5019
266,1.5029
267,1.5039
268,1.5042
269,1.5042
270,1.5061
271,1.5098
272,1.5148
273,1.5230000000000001
274,1.5311
275,1.5392
276,1.5474
277,1.5555
278,1.5637
279,1.5718
280,1.58
281,1.5862
282,1.5895
283,1.5923
284,1.5923
285,1.5923
286,1.5899
287,1.5874
288,1.5749
289,1.5586
290,1.5423
291,1.5261
292,1.5082
293,1.486
294,1.4637
295,1.4393
296,1.4149
297,1.3905
298,1.3659999999999999
299,1.3416
300,1.3172
301,1.2928
302,1.2683
303,1.2449
304,1.2275
305,1.21
306,1.1937
307,1.1774
308,1.1635
309,1.1507
310,1.14
311,1.1319
312,1.1238
313,1.1156
314,1.1075
