time,value
0,-0.335
1,0.016207
2,0.016207
3,-0.335
4,-0.6862
5,0.71863
6,0.71863
7,0.016207
8,-0.6862
9,-0.335
10,0.71863
11,1.0698
12,1.0698
13,0.71863
14,0.36743000000000003
15,0.016207
16,-0.6862
17,-1.0375
18,-0.6862
19,-0.6862
20,-0.335
21,-0.6862
22,-0.6862
23,0.016207
24,0.016207
25,0.016207
26,0.016207
27,0.016207
28,0.016207
29,0.016207
30,-0.335
31,-0.335
32,-0.335
33,0.016207
34,0.016207
35,0.016207
36,-0.335
37,0.016207
38,-0.335
39,-0.335
40,-0.335
41,-0.6862
42,-1.0375
43,0.016207
44,1.0698
45,0.016207
46,-2.0911
47,-0.6862
48,1.7722
49,4.2307
50,3.5283
51,2.1234
52,-0.335
53,-1.7398
54,-1.7398
55,-1.0375
56,-0.335
57,0.016207
58,0.016207
59,-0.335
60,-0.335
61,0.016207
62,0.36743000000000003
63,0.71863
64,0.36743000000000003
