time,value
0,-0.10211
1,-0.10211
2,-0.10211
3,-0.10211
4,-0.10211
5,-0.10211
6,-0.10211
7,-0.10211
8,-0.10211
9,-0.10211
10,-0.10211
11,-0.10211
12,-0.10211
13,-0.10211
14,-0.10211
15,-0.10211
16,-0.10211
17,-0.10211
18,-0.10211
19,-0.10211
20,-0.10211
21,-0.024258000000000002
22,0.07004500000000001
23,0.073335
24,0.20820999999999998
25,0.39353
26,0.62764
27,0.8973899999999999
28,1.1671
29,1.5608
30,1.9221
31,2.21
32,2.3942
33,2.3942
34,2.1749
35,1.9051
36,1.6705
37,1.5356
38,1.5997
39,1.6672
40,1.7637
41,1.8985
42,2.0334
43,2.1683
44,2.222
45,2.222
46,2.2187
47,2.1513
48,2.0318
49,1.8969
50,1.7619999999999998
51,1.6271
52,1.4923
53,1.3124
54,1.1101
55,0.9001399999999999
56,0.63038
57,0.5865199999999999
58,0.5108600000000001
59,0.39516999999999997
60,0.32774000000000003
61,0.2603
62,0.14351
63,0.0086384
64,-0.1383
65,-0.34060999999999997
66,-0.54293
67,-0.70302
68,-0.8379
69,-0.97278
70,-1.1077
71,-1.1888
72,-1.2562
73,-1.3401
74,-1.475
75,-1.5446
76,-1.6587
77,-1.7656
78,-1.8330000000000002
79,-1.9005
80,-1.9098
81,-1.8703
82,-1.8237
83,-1.8237
84,-1.8237
85,-1.8747
86,-1.9098
87,-1.9235
88,-1.9909
89,-1.9334
90,-1.9098
91,-1.8846
92,-1.8171
93,-1.7497
94,-1.6822
95,-1.6515
96,-1.6515
97,-1.6515
98,-1.5847
99,-1.5172
100,-1.4498
101,-1.3823
102,-1.3149
103,-1.1877
104,-1.0528
105,-0.9404299999999999
106,-0.8729899999999999
107,-0.80555
108,-0.79075
109,-0.75676
110,-0.6893199999999999
111,-0.62188
112,-0.5544399999999999
113,-0.4415
114,-0.33349
115,-0.25782
116,-0.12295
117,-0.045093
118,0.060725
119,0.17586
120,0.2422
121,0.2422
122,0.2422
123,0.27346
124,0.32828
125,0.32828
126,0.32828
127,0.32828
128,0.32828
129,0.32828
130,0.32828
131,0.32828
132,0.32828
133,0.32828
134,0.32828
135,0.39408000000000004
136,0.36721
137,0.32828
138,0.32828
139,0.32828
140,0.32828
141,0.40833
142,0.50044
143,0.50044
144,0.50044
145,0.4489
146,0.41436000000000006
147,0.40010999999999997
148,0.33266999999999997
149,0.20218
150,0.11170999999999999
151,0.044275999999999996
152,-0.023162000000000002
153,-0.0906
154,-0.15804
155,-0.26276
156,-0.39763000000000004
157,-0.53251
158,-0.6673899999999999
159,-0.8022600000000001
160,-0.93714
161,-1.0605
162,-1.1279
163,-1.1351
164,-1.1767
165,-1.2211
166,-1.2211
167,-1.2211
168,-1.2211
169,-1.2211
170,-1.237
171,-1.3045
172,-1.3719
173,-1.3933
174,-1.3659
175,-1.3159999999999998
176,-1.3834
177,-1.4509
178,-1.5183
179,-1.5655
180,-1.5638
181,-1.4964
182,-1.3785
183,-1.2118
184,-1.0490000000000002
185,-1.0490000000000002
186,-1.0490000000000002
187,-1.0490000000000002
188,-1.0243
189,-0.92069
190,-0.44861999999999996
191,-0.36035
192,-0.25179
193,-0.067024
194,0.067852
195,0.07004500000000001
196,0.11775
197,0.18517999999999998
198,0.25261999999999996
199,0.32006
200,0.44671000000000005
201,0.50044
202,0.52237
203,0.5865199999999999
204,0.5865199999999999
205,0.5344399999999999
206,0.50044
207,0.51525
208,0.58268
209,0.65012
210,0.76252
211,0.92371
212,1.126
213,1.3283
214,1.4177
215,1.4851
216,1.5142
217,1.4473
218,1.4473
219,1.4473
220,1.4780000000000002
221,1.5455
222,1.6129
223,1.7412
224,1.7916
225,1.7681
226,1.7006
227,1.6332
228,1.5657
229,1.4983
230,1.4144
231,1.2795
232,1.1447
233,1.0098
234,0.84695
235,0.65396
236,0.51908
237,0.38421
238,0.20986
239,0.07004500000000001
240,0.067852
241,0.00041425
242,-0.016034
243,-0.016034
244,-0.029741000000000004
245,-0.097179
246,-0.10211
247,-0.10211
248,-0.10211
249,-0.10211
250,-0.10211
251,-0.10211
252,-0.10211
253,-0.08402000000000001
254,-0.016582
255,0.050856
256,0.07004500000000001
257,0.07004500000000001
258,0.059079999999999994
259,-0.008358200000000001
260,-0.075796
261,-0.14323
262,-0.18819
263,-0.18435
264,-0.11692000000000001
265,-0.10211
266,-0.10211
267,-0.086762
268,-0.019324
269,0.048114
270,0.07004500000000001
271,0.096911
272,0.15612
273,0.15612
274,0.099104
275,0.07004500000000001
276,0.089783
277,0.15722
278,0.22466
279,0.2921
280,0.32828
281,0.32828
282,0.32828
283,0.20546999999999999
284,0.11335999999999999
285,0.07004500000000001
286,0.075528
287,0.14297
288,0.26468
289,0.32828
290,0.31129
291,0.24385
292,0.17640999999999998
293,0.15612
294,0.15612
295,0.15612
296,0.15612
297,0.097459
298,0.030021
299,-0.037417
300,-0.10211
301,-0.10211
302,-0.15365
303,-0.18819
304,-0.18819
305,-0.18819
306,-0.18819
307,-0.14378
308,-0.10211
309,-0.10211
310,-0.10211
311,-0.046189
312,-0.053316999999999996
313,-0.10211
314,-0.10211
