time,value
0,-0.92475
1,-0.8351799999999999
2,-0.62855
3,-0.32428
4,0.015927
5,0.34121
6,0.6342
7,0.8929
8,1.2803
9,1.445
10,1.3566
11,1.3975
12,1.4762
13,1.6117
14,1.5512
15,1.4680000000000002
16,1.1727
17,0.87559
18,0.5689
19,0.25899
20,-0.082814
21,-0.42941999999999997
22,-0.7057899999999999
23,-0.9558
24,-0.92642
25,-0.79448
26,-0.58449
27,-0.30406
28,-0.017747
29,0.2651
30,0.5748800000000001
31,0.9033899999999999
32,1.2244
33,1.3755
34,1.5079
35,1.3972
36,1.3943
37,1.3555
38,1.3972
39,1.5034
40,1.5853
41,1.5538
42,1.2438
43,0.9125700000000001
44,0.57698
45,0.24952
46,-0.048773000000000004
47,-0.34260999999999997
48,-0.6067
49,-0.84872
50,-0.27851
51,-0.33878
52,-0.5426300000000001
53,-0.74292
54,-0.99275
55,-1.2053
56,-1.4039
57,-1.4627
58,-1.433
59,-1.2316
60,-1.0227
61,-0.7893100000000001
62,-0.61447
63,-0.40665
64,-0.29957
65,-0.38384
66,-0.46015
67,-0.60219
68,-0.81315
69,-1.0682
70,-1.2315
71,-1.2819
72,-1.266
73,-1.3184
74,-1.228
75,-1.1283
76,-0.94486
77,-0.67673
78,-0.47753999999999996
79,-0.36133000000000004
