time,value
0,-0.61884
1,-0.61884
2,-0.61884
3,-0.61884
4,-0.61884
5,-0.61884
6,-0.61884
7,-0.61884
8,-0.61884
9,-0.61884
10,-0.61884
11,-0.61884
12,-0.61884
13,-0.61884
14,-0.61884
15,-0.61884
16,-0.61884
17,-0.61884
18,-0.61884
19,-0.61884
20,-0.61884
21,-0.61884
22,-0.61884
23,-0.61884
24,-0.61884
25,-0.61884
26,-0.61884
27,-0.61884
28,-0.61884
29,-0.61884
30,-0.61884
31,-0.61884
32,-0.61884
33,-0.61884
34,-0.61884
35,-0.6106
36,-0.59809
37,-0.58358
38,-0.56908
39,-0.5545800000000001
40,-0.54008
41,-0.52557
42,-0.51107
43,-0.49656999999999996
44,-0.48207
45,-0.46756000000000003
46,-0.44886000000000004
47,-0.42539
48,-0.39642
49,-0.37154
50,-0.35327
51,-0.33805999999999997
52,-0.3209
53,-0.29314
54,-0.26413000000000003
55,-0.23513
56,-0.20611999999999997
57,-0.17712
58,-0.11889000000000001
59,-0.018655
60,0.082862
61,0.15024
62,0.19862
63,0.24211999999999997
64,0.28563
65,0.32914
66,0.37445
67,0.4278
68,0.48494
69,0.54665
70,0.61346
71,0.68598
72,0.75849
73,0.831
74,0.90351
75,0.98124
76,1.0645
77,1.1515
78,1.2385
79,1.3255
80,1.4102
81,1.4897
82,1.5477
83,1.6042
84,1.6505
85,1.6795
86,1.7085
87,1.7288
88,1.7436
89,1.7581
90,1.7505
91,1.7379
92,1.7219
93,1.6962
94,1.6680000000000001
95,1.6428
96,1.6236
97,1.6091
98,1.5839
99,1.5495
100,1.506
101,1.4747
102,1.453
103,1.4385
104,1.4240000000000002
105,1.4095
106,1.3918
107,1.3685
108,1.325
109,1.2831
110,1.2457
111,1.2167
112,1.1868
113,1.1493
114,1.1057
115,1.0622
116,1.0187
117,0.9752299999999999
118,0.9327
119,0.9017
120,0.87211
121,0.8394
122,0.79935
123,0.7559600000000001
124,0.71814
125,0.6853100000000001
126,0.6563100000000001
127,0.6273
128,0.5983
129,0.56929
130,0.5402899999999999
131,0.5112800000000001
132,0.48418
133,0.46037
134,0.44582
135,0.42667
136,0.39925
137,0.35575
138,0.31224
139,0.26873
140,0.22534
141,0.18263
142,0.15045
143,0.12145
144,0.092079
145,0.049237
146,0.005959600000000001
147,-0.037548000000000005
148,-0.081055
149,-0.12455999999999999
150,-0.16216
151,-0.19415
152,-0.22315
153,-0.25971
154,-0.30032
155,-0.34292
156,-0.37046
157,-0.38906999999999997
158,-0.40562
159,-0.42663999999999996
160,-0.45519
161,-0.4813
162,-0.50335
163,-0.51786
164,-0.53236
165,-0.54686
166,-0.56155
167,-0.57818
168,-0.6036699999999999
169,-0.63245
170,-0.66079
171,-0.67565
172,-0.69016
173,-0.7078300000000001
174,-0.7360399999999999
175,-0.76493
176,-0.79394
177,-0.82294
178,-0.85195
179,-0.8729
180,-0.8897299999999999
181,-0.90423
182,-0.91874
183,-0.93324
184,-0.94568
185,-0.95234
186,-0.95306
187,-0.9563799999999999
188,-0.9639700000000001
189,-0.9784799999999999
190,-0.98915
191,-0.99484
192,-0.9949600000000001
193,-0.9984200000000001
194,-1.0092
195,-1.0231
196,-1.0356
197,-1.0366
198,-1.0366
199,-1.0366
200,-1.0366
201,-1.0366
202,-1.0425
203,-1.0562
204,-1.0707
205,-1.0852
206,-1.0997
207,-1.1142
208,-1.1287
209,-1.1432
210,-1.1558
211,-1.1611
212,-1.162
213,-1.1583
214,-1.15
215,-1.1355
216,-1.1255
217,-1.1202
218,-1.1202
219,-1.1202
220,-1.1202
221,-1.121
222,-1.1243
223,-1.1373
224,-1.1518
225,-1.1663
226,-1.1808
227,-1.195
228,-1.2037
229,-1.2037
230,-1.2037
231,-1.1951
232,-1.1814
233,-1.1669
234,-1.1524
235,-1.1379
236,-1.125
237,-1.121
238,-1.1202
239,-1.1127
240,-1.0941
241,-1.0651
242,-1.0361
243,-1.0071
244,-0.97808
245,-0.9490700000000001
246,-0.92007
247,-0.89194
248,-0.86759
249,-0.8512799999999999
250,-0.83536
251,-0.81682
252,-0.78782
253,-0.76003
254,-0.7369899999999999
255,-0.72249
256,-0.70824
257,-0.7024
258,-0.7024
259,-0.7024
260,-0.69113
261,-0.67725
262,-0.66399
263,-0.66133
264,-0.66062
265,-0.6493399999999999
266,-0.6182
267,-0.5748
268,-0.52577
269,-0.47196000000000005
270,-0.41395
271,-0.3494
272,-0.28036
273,-0.20704
274,-0.12854000000000002
275,-0.043535000000000004
276,0.04348
277,0.13049000000000002
278,0.21750999999999998
279,0.30451999999999996
280,0.39154
281,0.47855
282,0.56702
283,0.66256
284,0.76412
285,0.8659
286,0.9905299999999999
287,1.121
288,1.2509
289,1.3682
290,1.4847
291,1.5862
292,1.6554
293,1.7141
294,1.7546
295,1.7794
296,1.7939
297,1.8156
298,1.8415
299,1.8681
300,1.8678
301,1.8471
302,1.8301
303,1.8362
304,1.8926
305,1.9401
306,1.9714
307,1.9714
308,1.9664
309,1.9493
310,1.9204
311,1.8929
312,1.875
313,1.8605
314,1.8459999999999999
