{
  "about": {
    "problemID": "LL1_kaggle_open_powerlifting_competition_ages_problem",
    "problemName": "Open Powerlifting Ages",
    "problemSchemaVersion": "4.0.0",
    "problemVersion": "4.0.0",
    "taskKeywords": [
      "regression",
      "univariate"
    ]
  },
  "inputs": {
    "data": [
      {
        "datasetID": "LL1_kaggle_open_powerlifting_competition_ages_dataset",
        "targets": [
          {
            "targetIndex": 0,
            "resID": "learningData",
            "colIndex": 5,
            "colName": "Age"
          }
        ]
      }
    ],
    "dataSplits": {
      "method": "holdOut",
      "testSize": 0.2,
      "numRepeats": 0,
      "splitsFile": "dataSplits.csv",
      "datasetViewMaps": {
        "train": [
          {
            "from": "LL1_kaggle_open_powerlifting_competition_ages_dataset",
            "to": "LL1_kaggle_open_powerlifting_competition_ages_dataset_TRAIN"
          }
        ],
        "test": [
          {
            "from": "LL1_kaggle_open_powerlifting_competition_ages_dataset",
            "to": "LL1_kaggle_open_powerlifting_competition_ages_dataset_TEST"
          }
        ],
        "score": [
          {
            "from": "LL1_kaggle_open_powerlifting_competition_ages_dataset",
            "to": "LL1_kaggle_open_powerlifting_competition_ages_dataset_SCORE"
          }
        ]
      }
    },
    "performanceMetrics": [
      {
        "metric": "rootMeanSquaredError"
      }
    ]
  },
  "expectedOutputs": {
    "predictionsFile": "predictions.csv"
  }
}