time,value
0,-0.60939
1,-0.60939
2,-0.60939
3,-0.60939
4,-0.60939
5,-0.60939
6,-0.60939
7,-0.60939
8,-0.60939
9,-0.60939
10,-0.60939
11,-0.60939
12,-0.60939
13,-0.60939
14,-0.60939
15,-0.60939
16,-0.60939
17,-0.60939
18,-0.60939
19,-0.60939
20,-0.60939
21,-0.60939
22,-0.60939
23,-0.60939
24,-0.60939
25,-0.60939
26,-0.60939
27,-0.60939
28,-0.60939
29,-0.60939
30,-0.60939
31,-0.60939
32,-0.60939
33,-0.60939
34,-0.60939
35,-0.60939
36,-0.60939
37,-0.60939
38,-0.60939
39,-0.60939
40,-0.60939
41,-0.60939
42,-0.60939
43,-0.60939
44,-0.60939
45,-0.60939
46,-0.60939
47,-0.60939
48,-0.60939
49,-0.60939
50,-0.60939
51,-0.60939
52,-0.60939
53,-0.60939
54,-0.60939
55,-0.60939
56,-0.60939
57,-0.60939
58,-0.60939
59,-0.60939
60,-0.60939
61,-0.60939
62,-0.60939
63,-0.60939
64,-0.60939
65,-0.60939
66,-0.60939
67,-0.60939
68,-0.60939
69,-0.60939
70,-0.60939
71,-0.60939
72,-0.60939
73,-0.60939
74,-0.60939
75,-0.60939
76,-0.60939
77,-0.60939
78,-0.60939
79,-0.60939
80,-0.60939
81,-0.60939
82,-0.60939
83,-0.60939
84,-0.60939
85,-0.60939
86,-0.60939
87,-0.60939
88,-0.60939
89,-0.60939
90,-0.60939
91,-0.60939
92,-0.60939
93,-0.60939
94,-0.60939
95,-0.60939
96,-0.60939
97,-0.60939
98,-0.60939
99,-0.60939
100,-0.60939
101,-0.60939
102,-0.60939
103,-0.60939
104,-0.60939
105,-0.60939
106,-0.60939
107,-0.60939
108,-0.60939
109,-0.60939
110,-0.60939
111,-0.60939
112,-0.60939
113,-0.60939
114,-0.60939
115,-0.60939
116,-0.60939
117,-0.60939
118,-0.60939
119,-0.60939
120,-0.60939
121,-0.60939
122,-0.60939
123,-0.60939
124,-0.60939
125,-0.60939
126,-0.60939
127,-0.60939
128,-0.60939
129,-0.60939
130,-0.60939
131,-0.60939
132,-0.60939
133,-0.60939
134,-0.60939
135,-0.60939
136,-0.60939
137,-0.60939
138,-0.60939
139,-0.60939
140,-0.60939
141,-0.60939
142,-0.60939
143,-0.60939
144,-0.60939
145,-0.60939
146,-0.60939
147,-0.60939
148,-0.60939
149,-0.60939
150,-0.60939
151,-0.60939
152,-0.60939
153,-0.60939
154,-0.60939
155,-0.60939
156,-0.60939
157,-0.60939
158,-0.60939
159,-0.60939
160,-0.60939
161,-0.60939
162,-0.60939
163,-0.60939
164,-0.60939
165,-0.60939
166,-0.60939
167,-0.60939
168,-0.60939
169,-0.60939
170,-0.60939
171,-0.60939
172,-0.60939
173,-0.60939
174,-0.60939
175,-0.60939
176,-0.60939
177,-0.60939
178,-0.60939
179,-0.60939
180,-0.60939
181,-0.60939
182,-0.60939
183,-0.60939
184,-0.60939
185,-0.60939
186,-0.60939
187,-0.60939
188,-0.60939
189,-0.60939
190,-0.60939
191,-0.60939
192,-0.60939
193,-0.60939
194,-0.60939
195,-0.60939
196,-0.60939
197,-0.60939
198,-0.60939
199,-0.60939
200,-0.60939
201,-0.60939
202,-0.60939
203,-0.60939
204,-0.60939
205,-0.60939
206,-0.60939
207,-0.60939
208,-0.60939
209,-0.60939
210,-0.60939
211,-0.60939
212,-0.60939
213,-0.60939
214,-0.60939
215,-0.60939
216,-0.60939
217,-0.60939
218,-0.60939
219,-0.60939
220,-0.60939
221,-0.60939
222,-0.60939
223,-0.60939
224,-0.60939
225,-0.60939
226,-0.60939
227,-0.60939
228,-0.60939
229,-0.60939
230,-0.60939
231,-0.60939
232,-0.60939
233,-0.60939
234,-0.60939
235,-0.60939
236,-0.60939
237,-0.60939
238,-0.60939
239,-0.60939
240,-0.60939
241,-0.60939
242,-0.60939
243,-0.60939
244,-0.60939
245,-0.60939
246,-0.60939
247,-0.60939
248,-0.60939
249,-0.60939
250,-0.60939
251,-0.60939
252,-0.60939
253,-0.60939
254,-0.60939
255,-0.60939
256,-0.47977
257,-0.60939
258,-0.60939
259,-0.60939
260,-0.60939
261,-0.60939
262,-0.60939
263,-0.60939
264,-0.60939
265,-0.60939
266,-0.60939
267,-0.60939
268,-0.60939
269,0.94604
270,1.7238
271,2.1126
272,1.7238
273,2.1126
274,1.7238
275,2.1126
276,1.7238
277,2.1126
278,2.1126
279,1.7238
280,2.1126
281,1.3349
282,1.7238
283,1.7238
284,1.7238
285,1.7238
286,1.7238
287,2.1126
288,1.7238
289,1.7238
290,1.7238
291,1.7238
292,1.7238
293,1.7238
294,1.7238
295,2.1126
296,1.7238
297,2.1126
298,1.7238
299,1.7238
300,1.7238
301,2.1126
302,1.7238
303,1.7238
304,1.7238
305,1.7238
306,1.3349
307,1.7238
308,1.7238
309,0.94604
310,-0.60939
311,-0.60939
312,-0.60939
313,-0.60939
314,-0.60939
315,-0.60939
316,-0.60939
317,-0.60939
318,-0.60939
319,-0.60939
320,-0.60939
321,-0.60939
322,-0.60939
323,-0.60939
324,-0.60939
325,-0.60939
326,-0.60939
327,-0.60939
328,-0.090913
329,1.7238
330,1.7238
331,1.7238
332,1.7238
333,1.7238
334,1.7238
335,1.7238
336,2.1126
337,1.7238
338,1.3349
339,1.7238
340,1.7238
341,1.3349
342,1.7238
343,1.7238
344,1.3349
345,1.7238
346,1.7238
347,1.7238
348,1.7238
349,1.7238
350,1.3349
351,1.7238
352,0.94604
353,1.7238
354,-0.60939
355,-0.60939
356,-0.60939
357,-0.60939
358,-0.60939
359,-0.60939
360,-0.60939
361,-0.60939
362,-0.60939
363,-0.60939
364,-0.60939
365,-0.60939
366,-0.60939
367,-0.60939
368,-0.60939
369,-0.60939
370,-0.60939
371,-0.60939
372,-0.60939
373,-0.60939
374,-0.60939
375,-0.60939
376,-0.60939
377,-0.60939
378,-0.60939
379,-0.60939
380,-0.60939
381,-0.60939
382,-0.60939
383,-0.60939
384,-0.60939
385,-0.60939
386,-0.60939
387,-0.60939
388,-0.60939
389,-0.60939
390,-0.60939
391,-0.60939
392,-0.60939
393,-0.60939
394,-0.60939
395,-0.60939
396,-0.60939
397,-0.60939
398,-0.60939
399,-0.60939
400,-0.60939
401,-0.60939
402,-0.60939
403,-0.60939
404,-0.60939
405,-0.60939
406,-0.60939
407,-0.60939
408,-0.60939
409,-0.60939
410,-0.60939
411,-0.60939
412,-0.60939
413,-0.60939
414,-0.60939
415,-0.60939
416,-0.60939
417,-0.60939
418,-0.60939
419,-0.60939
420,-0.60939
421,-0.60939
422,-0.60939
423,-0.60939
424,-0.60939
425,-0.60939
426,-0.60939
427,-0.60939
428,-0.60939
429,-0.60939
430,-0.60939
431,-0.60939
432,-0.60939
433,-0.60939
434,-0.60939
435,-0.60939
436,-0.60939
437,-0.60939
438,-0.60939
439,-0.60939
440,-0.60939
441,-0.60939
442,-0.60939
443,-0.60939
444,-0.60939
445,-0.60939
446,-0.60939
447,-0.60939
448,-0.60939
449,-0.60939
450,-0.60939
451,-0.60939
452,-0.60939
453,-0.60939
454,-0.60939
455,-0.60939
456,-0.60939
457,-0.60939
458,-0.60939
459,-0.60939
460,-0.60939
461,-0.60939
462,-0.60939
463,-0.60939
464,-0.60939
465,-0.60939
466,-0.60939
467,-0.60939
468,-0.60939
469,-0.60939
470,-0.60939
471,-0.60939
472,-0.60939
473,-0.60939
474,-0.60939
475,-0.60939
476,-0.60939
477,-0.60939
478,-0.60939
479,-0.60939
480,-0.60939
481,-0.60939
482,-0.60939
483,-0.60939
484,-0.60939
485,-0.35015
486,1.7238
487,1.7238
488,1.3349
489,1.7238
490,1.7238
491,2.1126
492,1.7238
493,2.1126
494,1.7238
495,1.7238
496,2.1126
497,1.7238
498,1.7238
499,1.7238
500,2.1126
501,1.7238
502,1.7238
503,1.7238
504,2.1126
505,1.7238
506,2.1126
507,1.7238
508,2.1126
509,1.7238
510,1.7238
511,2.1126
512,1.7238
513,1.7238
514,1.7238
515,1.7238
516,1.7238
517,1.7238
518,1.7238
519,1.7238
520,1.7238
521,1.7238
522,1.7238
523,1.7238
524,2.1126
525,1.7238
526,0.94604
527,0.94604
528,1.3349
529,0.94604
530,1.7238
531,1.3349
532,0.94604
533,1.3349
534,1.3349
535,1.7238
536,1.3349
537,1.3349
538,1.3349
539,1.3349
540,1.3349
541,1.7238
542,1.3349
543,1.3349
544,1.3349
545,1.3349
546,0.94604
547,1.3349
548,1.3349
549,1.3349
550,1.7238
551,1.3349
552,1.3349
553,1.7238
554,1.3349
555,1.3349
556,1.7238
557,1.3349
558,1.3349
559,1.3349
560,0.94604
561,1.3349
562,1.3349
563,1.3349
564,1.7238
565,1.3349
566,1.7238
567,1.3349
568,1.7238
569,1.3349
570,1.3349
571,1.3349
572,1.3349
573,1.3349
574,0.94604
575,1.3349
576,1.7238
577,-0.090913
578,-0.60939
579,-0.60939
580,-0.090913
581,1.7238
582,1.3349
583,1.7238
584,1.3349
585,2.1126
586,1.7238
587,1.7238
588,1.7238
589,1.7238
590,1.7238
591,1.3349
592,1.7238
593,1.7238
594,1.7238
595,1.3349
596,1.7238
597,1.7238
598,-0.090913
599,-0.60939
600,-0.60939
601,-0.47977
602,-0.60939
603,-0.35015
604,1.3349
605,1.7238
606,0.94604
607,1.3349
608,1.3349
609,1.7238
610,1.3349
611,1.3349
612,1.3349
613,1.3349
614,1.7238
615,1.3349
616,1.3349
617,1.7238
618,1.7238
619,1.7238
620,1.7238
621,1.7238
622,1.7238
623,1.7238
624,1.7238
625,1.7238
626,-0.60939
627,-0.60939
628,-0.60939
629,-0.60939
630,-0.60939
631,-0.60939
632,-0.60939
633,-0.60939
634,-0.60939
635,-0.60939
636,-0.60939
637,-0.60939
638,-0.60939
639,-0.60939
640,-0.60939
641,-0.60939
642,-0.60939
643,-0.60939
644,-0.60939
645,-0.60939
646,-0.60939
647,-0.60939
648,-0.60939
649,-0.60939
650,-0.60939
651,-0.60939
652,-0.60939
653,-0.60939
654,-0.60939
655,-0.60939
656,-0.60939
657,-0.60939
658,-0.60939
659,-0.60939
660,-0.60939
661,-0.60939
662,-0.60939
663,-0.60939
664,-0.60939
665,-0.60939
666,-0.60939
667,-0.60939
668,-0.60939
669,-0.60939
670,-0.60939
671,-0.60939
672,-0.60939
673,-0.60939
674,-0.60939
675,-0.60939
676,-0.60939
677,-0.60939
678,-0.60939
679,-0.60939
680,-0.60939
681,-0.60939
682,-0.60939
683,-0.60939
684,-0.60939
685,-0.60939
686,-0.60939
687,-0.60939
688,-0.60939
689,-0.60939
690,-0.60939
691,-0.60939
692,-0.60939
693,-0.60939
694,-0.60939
695,-0.60939
696,-0.60939
697,-0.60939
698,-0.60939
699,-0.60939
700,-0.60939
701,-0.60939
702,-0.60939
703,-0.60939
704,-0.60939
705,-0.60939
706,-0.60939
707,-0.60939
708,-0.60939
709,-0.60939
710,-0.60939
711,-0.60939
712,-0.60939
713,-0.60939
714,-0.60939
715,-0.60939
716,-0.60939
717,-0.60939
718,-0.60939
719,-0.60939
