time,value
0,0.66771
1,0.66771
2,0.66771
3,0.66771
4,0.66771
5,0.66771
6,0.66771
7,0.66771
8,0.66771
9,0.66771
10,0.66771
11,0.66771
12,0.66771
13,0.66771
14,0.66771
15,0.66771
16,0.66771
17,0.66771
18,0.66771
19,0.66771
20,0.66771
21,0.66771
22,0.66771
23,0.66771
24,0.66771
25,0.66771
26,0.66771
27,0.66771
28,0.66771
29,0.66771
30,0.66771
31,0.66771
32,0.66771
33,0.66771
34,0.66771
35,0.66771
36,0.66771
37,0.61053
38,0.53298
39,0.44328
40,0.36118
41,0.3372
42,0.3372
43,0.3372
44,0.3372
45,0.3372
46,0.3372
47,0.3372
48,0.3372
49,0.3372
50,0.3372
51,0.31859
52,0.25721
53,0.16669
54,0.4026
55,-0.30254000000000003
56,-0.5026
57,-0.19539
58,-0.28591
59,-0.43218999999999996
60,-0.6101
61,-0.79114
62,-0.92106
63,-0.9848100000000001
64,-0.9848100000000001
65,-0.9848100000000001
66,-0.89651
67,-0.75325
68,-0.57221
69,-0.37954
70,-0.4605
71,0.26563000000000003
72,0.62771
73,0.9597100000000001
74,1.2635
75,1.535
76,1.8066
77,2.0351
78,2.2297
79,2.4108
80,2.5647
81,2.6507
82,2.6507
83,2.6507
84,2.6185
85,2.5581
86,2.4676
87,2.3771
88,2.2471
89,2.0718
90,1.8908
91,1.7097
92,1.5287
93,1.3477
94,1.1666
95,1.0175
96,0.90138
97,0.81086
98,0.72973
99,0.74349
100,0.92453
101,1.1056
102,1.2648
103,1.3982
104,1.4887
105,1.5792
106,1.6115
107,1.5582
108,1.4677
109,1.3679
110,1.2445
111,1.0635
112,0.8824299999999999
113,0.70139
114,0.52035
115,0.33931
116,0.15827
117,-0.092106
118,-0.20381
119,-0.38485
120,-0.56589
121,-0.74693
122,-0.9279799999999999
123,-1.109
124,-1.3104
125,-1.5504
126,-1.8205
127,-2.0885
128,-2.3068
129,-2.3068
130,-2.3068
131,-2.3211
132,-2.3574
133,-2.4479
134,-2.5384
135,-2.5969
136,-2.5485
137,-2.4647
138,-2.3685
139,-2.2605
140,-2.0795
141,-1.8984
142,-1.7043
143,-1.4769
144,-1.2101
145,-0.9385
146,-0.68535
147,-0.57377
148,-0.47748
149,-0.40253
150,-0.35831999999999997
151,-0.44168999999999997
152,-0.5322100000000001
153,-0.62273
154,-0.71325
155,-0.80377
156,-0.8942899999999999
157,-0.9848100000000001
158,-1.0753
159,-1.1659
160,-1.2489
161,-1.3058
162,-1.3153
163,-1.3153
164,-1.3225
165,-1.4572
166,-1.6227
167,-1.795
168,-1.9445
169,-1.8816
170,-1.7911
171,-1.6959
172,-1.5611
173,-1.3932
174,-1.2122
175,-1.0311
176,-0.85009
177,-0.66905
178,-0.49136
179,-0.33137
180,-0.22486
181,-0.13434000000000001
182,-0.19735999999999998
183,0.25524
184,0.13722
185,0.22774
186,0.31826
187,0.33601
188,0.3372
189,0.33441
190,0.27126
191,0.1309
192,-0.22894
193,-0.23118000000000002
194,-0.35505
195,-0.45853
196,-0.54905
197,-0.63957
198,-0.73009
199,-0.8206100000000001
200,-0.9111299999999999
201,-0.9625299999999999
202,-0.9848100000000001
203,-0.9848100000000001
204,-0.9848100000000001
205,-0.86946
206,-0.70694
207,-0.5259
208,-0.36346999999999996
209,-0.24381
210,-0.15329
211,-0.29209
212,-0.32737
213,0.055253
214,0.055253
215,0.055253
216,0.055253
217,0.055253
218,0.055253
219,0.055253
220,0.055253
221,0.055253
222,0.055253
223,-0.16551
224,-0.10908
225,-0.1996
226,-0.2785
227,-0.26697
228,-0.17645
229,-0.40786999999999995
230,-0.1057
231,0.055253
232,0.055253
233,0.055253
234,0.055253
235,0.055253
236,0.055253
237,0.055253
238,0.055253
239,0.055253
240,0.055253
241,0.055253
242,0.055253
243,0.055253
244,0.055253
245,0.25272
246,0.1309
247,0.22141999999999998
248,0.29305
249,0.3372
250,0.3372
251,0.3372
252,0.30533000000000005
253,0.24036999999999997
254,0.14985
255,0.33404
256,0.055253
257,0.055253
258,0.055253
259,0.055253
260,0.055253
261,0.055253
262,0.055253
263,0.20093
264,0.10775
265,0.19827
266,0.27953
267,0.3372
268,0.3372
269,0.3372
270,0.3372
271,0.3372
272,0.3372
273,0.3372
274,0.36118
275,0.44328
276,0.53298
277,0.5975699999999999
278,0.6214
279,0.53088
280,0.44036000000000003
281,0.34983000000000003
282,0.25931
283,0.16879
284,0.41908
285,0.055253
286,0.055253
287,0.055253
288,0.055253
289,0.055253
290,0.055253
291,0.055253
292,0.055253
293,0.055253
294,0.055253
295,0.20915
296,-0.060529
297,-0.10697999999999999
298,-0.1975
299,-0.28802
300,-0.37854
301,-0.46906000000000003
302,-0.55958
303,-0.6409
304,-0.65142
305,-0.6543100000000001
306,-0.64652
307,-0.62337
308,-0.53642
309,-0.4459
310,-0.34583
311,-0.19847
312,-0.10263
313,0.15616
314,0.3372
315,0.39496
316,0.39496
317,0.39496
318,0.39496
319,0.39496
320,0.39496
321,0.39496
322,0.39496
323,0.39496
324,0.39496
325,0.39496
326,0.39496
327,0.39496
328,0.39496
329,0.39496
330,0.39496
331,0.39496
332,0.39496
333,0.39496
334,0.39496
335,0.39496
336,0.39496
337,0.39496
338,0.39496
339,0.39496
340,0.39496
341,0.39496
342,0.39496
343,0.39496
344,0.39496
345,0.39496
346,0.39496
347,0.39496
348,0.39496
349,0.39496
350,0.39496
351,0.39496
352,0.38383
353,0.36874
354,0.35128000000000004
355,0.33531
356,0.33064
357,0.33064
358,0.33064
359,0.33064
360,0.33064
361,0.33064
362,0.33064
363,0.31942
364,0.30361
365,0.28599
366,0.272
367,0.26633
368,0.26633
369,0.26633
370,0.26633
371,0.26633
372,0.26633
373,0.26633
374,0.26633
375,0.26633
376,0.26633
377,0.26633
378,0.26633
379,0.26633
380,0.26633
381,0.26633
382,0.26633
383,0.26633
384,0.26633
385,0.26633
386,0.26633
387,0.26633
388,0.27218000000000003
389,0.28353
390,0.30115
391,0.31876
392,0.33638
393,0.35399
394,0.37161
395,0.38658000000000003
396,0.39496
397,0.39496
398,0.39496
399,0.40749
400,0.43101000000000006
401,0.46624
402,0.50147
403,0.5290100000000001
404,0.54776
405,0.5653699999999999
406,0.59034
407,0.626
408,0.67885
409,0.73169
410,0.80314
411,0.89391
412,0.9996
413,1.1053
414,1.2109999999999999
415,1.3167
416,1.4224
417,1.5238
418,1.6202
419,1.7083
420,1.7964
421,1.8674
422,1.9135
423,1.9488
424,1.9804
425,2.0028
426,2.0028
427,2.0028
428,2.0028
429,2.0028
430,2.0028
431,2.0028
432,1.9935
433,1.9616
434,1.9266
435,1.8914
436,1.8562
437,1.821
438,1.7857
439,1.7545
440,1.7307
441,1.7128
442,1.6952
443,1.6776
444,1.66
445,1.6423
446,1.6247
447,1.6071
448,1.5895
449,1.5719
450,1.5449
451,1.4868
452,1.4183
453,1.3489
454,1.2819
455,1.229
456,1.1762
457,1.1259
458,1.082
459,1.0459
460,1.0107
461,0.9754299999999999
462,0.9402
463,0.90497
464,0.86823
465,0.82849
466,0.7763399999999999
467,0.7235
468,0.67065
469,0.6178100000000001
470,0.56496
471,0.51212
472,0.45926999999999996
473,0.42404
474,0.38881
475,0.35213
476,0.31035
477,0.25936
478,0.20651999999999998
479,0.15437
480,0.11463
481,0.4112
482,0.24067
483,0.085001
484,0.067092
485,0.067092
486,0.067092
487,0.067092
488,0.067092
489,0.067092
490,0.067092
491,0.13818
492,0.22071
493,0.30551999999999996
494,0.37312
495,0.38866999999999996
496,0.38866999999999996
497,0.38866999999999996
498,0.38866999999999996
499,0.38866999999999996
500,0.38866999999999996
501,0.38866999999999996
502,0.31787
503,0.23095
504,0.14424
505,0.086886
506,0.067092
507,0.067092
508,0.067092
509,-0.26361999999999997
510,-0.19508
511,-0.37203
512,-0.11563
513,-0.16380999999999998
514,-0.21665
515,-0.2695
516,-0.32234
517,-0.37519
518,-0.42803
519,-0.48086999999999996
520,-0.51127
521,-0.53249
522,-0.55011
523,-0.5641
524,-0.56977
525,-0.56977
526,-0.56977
527,-0.58645
528,-0.61319
529,-0.64842
530,-0.68365
531,-0.71888
532,-0.7541100000000001
533,-0.7893399999999999
534,-0.82457
535,-0.8598
536,-0.8950299999999999
537,-0.9302600000000001
538,-0.96549
539,-1.0007
540,-1.036
541,-1.0701
542,-1.0954
543,-1.113
544,-1.1306
545,-1.1423
546,-1.1486
547,-1.1486
548,-1.1486
549,-1.1486
550,-1.1486
551,-1.1486
552,-1.1539
553,-1.1724
554,-1.2076
555,-1.2428
556,-1.2718
557,-1.2953
558,-1.3129
559,-1.3305
560,-1.3404
561,-1.3416
562,-1.3416
563,-1.3416
564,-1.3416
565,-1.3416
566,-1.3416
567,-1.3478
568,-1.3604
569,-1.3780000000000001
570,-1.3944
571,-1.3985
572,-1.3809
573,-1.3633
574,-1.3499
575,-1.3416
576,-1.3416
577,-1.3416
578,-1.3472
579,-1.3612
580,-1.3788
581,-1.3946
582,-1.4059
583,-1.4059
584,-1.4059
585,-1.4015
586,-1.3915
587,-1.3739
588,-1.3563
589,-1.3387
590,-1.3211
591,-1.3035
592,-1.2884
593,-1.2772
594,-1.2772
595,-1.2772
596,-1.2812
597,-1.2927
598,-1.31
599,-1.3274
600,-1.3416
601,-1.3416
602,-1.3416
603,-1.3416
604,-1.3416
605,-1.3416
606,-1.3416
607,-1.3384
608,-1.3249
609,-1.308
610,-1.2915
611,-1.2772
612,-1.2772
613,-1.2772
614,-1.2772
615,-1.2772
616,-1.2772
617,-1.2772
618,-1.2737
619,-1.2425
620,-1.2084
621,-1.1717
622,-1.1319
623,-1.0798
624,-1.0269
625,-0.97595
626,-0.9341700000000001
627,-0.89749
628,-0.86226
629,-0.8270299999999999
630,0.14798
631,0.14798
632,0.14798
633,0.14798
634,0.14798
635,0.14798
636,0.14798
637,0.14798
638,0.14798
639,0.14798
640,0.14798
641,0.14798
642,0.14798
643,0.14798
644,0.14798
645,0.14798
646,0.14798
647,0.14798
648,0.14798
649,0.14798
650,0.14798
651,0.14798
652,0.14798
653,0.14798
654,0.14798
655,0.14798
656,0.14798
657,0.14798
658,0.14798
659,0.14798
660,0.14798
661,0.14798
662,0.14798
663,0.14798
664,0.14798
665,0.14798
666,0.14798
667,0.15329
668,0.16049000000000002
669,0.16882
670,0.17644
671,0.17867
672,0.17867
673,0.17867
674,0.1823
675,0.18863
676,0.19704000000000002
677,0.20544
678,0.2192
679,0.23515
680,0.25196
681,0.27395
682,0.30785999999999997
683,0.34988
684,0.3919
685,0.44983999999999996
686,0.5173800000000001
687,0.59302
688,0.66866
689,0.7443
690,0.81994
691,0.8955799999999999
692,0.9664799999999999
693,1.0312
694,1.0901
695,1.1489
696,1.1954
697,1.2343
698,1.2679
699,1.301
700,1.3299
701,1.3551
702,1.3803
703,1.4055
704,1.4307
705,1.4559
706,1.4812
707,1.5064
708,1.5316
709,1.5568
710,1.587
711,1.6299
712,1.6887
713,1.7476
714,1.8213
715,1.9082
716,2.0091
717,2.1099
718,2.2144
719,2.3232
720,2.4324
721,2.5294
722,2.6085
723,2.6589
724,2.7094
725,2.7302
726,2.7203
727,2.6867
728,2.6511
729,2.5948
730,2.5024
731,2.4099
732,2.3175
733,2.225
734,2.1326
735,2.0401
736,1.9504
737,1.8646
738,1.7806
739,1.7
740,1.6281
741,1.5777
742,1.5273
743,1.4727
744,1.4127
745,1.3455
746,1.2783
747,1.2133
748,1.1537
749,1.0947
750,1.0371
751,0.98139
752,0.93096
753,0.8805299999999999
754,0.8320000000000001
755,0.78704
756,0.7448899999999999
757,0.70265
758,0.65733
759,0.5985
760,0.53967
761,0.47818999999999995
762,0.41262
763,0.33698
764,0.26134
765,0.18719
766,0.11800000000000001
767,0.27399999999999997
768,-0.05687999999999999
769,-0.37685
770,-0.13015
771,-0.18057
772,-0.231
773,-0.28143
774,-0.33185
775,-0.38228
776,-0.43271000000000004
777,-0.48313
778,-0.53356
779,-0.58326
780,-0.63154
781,-0.67389
782,-0.71592
783,-0.75705
784,-0.7938
785,-0.82811
786,-0.86172
787,-0.8953399999999999
788,-0.8953399999999999
789,-0.8953399999999999
790,-0.8953399999999999
791,-0.8953399999999999
792,-0.8953399999999999
793,-0.8953399999999999
794,-0.8950100000000001
795,-0.88875
796,-0.88107
797,-0.8729399999999999
798,-0.86551
799,-0.86466
800,-0.86466
801,-0.8642200000000001
802,-0.8601200000000001
803,-0.85293
804,-0.84452
805,-0.8361200000000001
806,-0.8209299999999999
807,-0.80465
808,-0.78784
809,-0.77103
810,-0.7542300000000001
811,-0.73742
812,-0.7206100000000001
813,-0.71387
814,-0.71123
815,-0.71123
816,-0.71123
817,-0.7179800000000001
818,-0.72628
819,-0.73455
820,-0.74002
821,-0.7419100000000001
822,-0.7419100000000001
823,-0.7419100000000001
824,-0.74722
825,-0.75442
826,-0.76267
827,-0.76951
828,-0.76556
829,-0.75716
830,-0.74875
831,-0.74398
832,-0.7419100000000001
833,-0.7419100000000001
834,-0.7419100000000001
835,-0.74727
836,-0.75481
837,-0.76322
838,-0.77162
839,-0.7800199999999999
840,-0.78843
841,-0.79683
842,-0.8012600000000001
843,-0.80328
844,-0.80328
845,-0.80328
846,-0.80328
847,-0.80328
848,-0.80328
849,-0.80091
850,-0.79547
851,-0.78706
852,-0.77866
853,-0.77845
854,-0.78335
855,-0.79175
856,-0.79962
857,-0.80328
858,-0.80328
859,-0.80328
860,-0.80328
861,-0.80328
862,-0.80328
863,-0.80328
864,-0.80328
865,-0.80328
866,-0.80328
867,-0.8045399999999999
868,-0.80895
869,-0.8173600000000001
870,-0.82576
871,-0.82819
872,-0.82537
873,-0.81697
874,-0.8085600000000001
875,-0.80382
876,-0.80328
877,-0.80328
878,-0.80504
879,-0.80934
880,-0.81775
881,-0.82615
882,-0.8286399999999999
883,-0.8249799999999999
884,-0.81657
885,-0.8081699999999999
886,-0.79977
887,-0.7913600000000001
888,-0.78296
889,-0.77658
890,-0.7726
891,-0.7726
892,-0.7726
893,-0.7753
894,-0.78198
895,-0.79038
896,-0.79707
897,-0.79937
898,-0.79097
899,-0.78257
900,-0.7741600000000001
901,-0.76576
902,-0.75735
903,-0.74895
904,-0.7427699999999999
905,-0.7419899999999999
906,-0.7419100000000001
907,-0.7419100000000001
908,-0.7419100000000001
909,-0.7419100000000001
910,-0.7419100000000001
911,-0.74002
912,-0.73455
913,-0.72628
914,-0.7179800000000001
915,-0.71123
916,-0.71123
917,-0.71123
918,-0.7099
919,-0.70653
920,-0.69813
921,-0.6897300000000001
922,-0.68281
923,-0.68085
924,-0.6805399999999999
925,-0.68107
926,-0.68269
927,-0.69109
928,-0.6995
929,-0.7054699999999999
930,-0.70527
931,-0.6977399999999999
932,-0.68934
933,-0.68008
934,-0.6642399999999999
935,-0.6477
936,-0.6309
937,-0.6140899999999999
938,-0.59728
939,-0.5804699999999999
940,-0.5663199999999999
941,-0.56534
942,-0.57167
943,-0.58008
944,-0.58848
