time,value
0,-0.16197
1,-0.015083000000000001
2,-0.20082
3,-0.23788
4,0.19614
5,-0.17219
6,0.43331000000000003
7,-0.46793999999999997
8,0.15933
9,0.14394
10,-0.2427
11,-0.61521
12,0.29447
13,-0.56915
14,-0.36365
15,-0.53841
16,0.091448
17,-0.38669000000000003
18,-0.24469000000000002
19,-0.11642999999999999
20,-0.18267
21,0.25966999999999996
22,-0.41791999999999996
23,-0.17745
24,-0.58085
25,0.33071999999999996
26,-0.5571
27,0.22361999999999999
28,0.21166
29,0.42426
30,0.073492
31,0.31285999999999997
32,-0.51241
33,-0.13253
34,-0.80555
35,-0.01198
36,-0.015321000000000001
37,-0.17892
38,-0.17651
39,-0.34688
40,-0.19169
41,0.010463
42,0.048412000000000004
43,-0.14664000000000002
44,0.1172
45,-0.063191
46,0.42549
47,0.70924
48,0.13713
49,0.16952
50,0.15932000000000002
51,0.26322
52,-0.22821999999999998
53,-0.15585
54,0.01113
55,0.41286999999999996
56,0.45532
57,-0.60255
58,-0.17496
59,0.41968999999999995
60,0.37678
61,-0.40323000000000003
62,0.043677999999999995
63,0.22105999999999998
64,0.18723
65,0.015275
66,0.027892
67,0.19557
68,0.2343
69,-0.11291
70,0.18553
71,0.47229
72,0.024023
73,0.22621999999999998
74,-0.16242
75,1.7180000000000002
76,1.7180000000000002
77,1.7180000000000002
78,1.7180000000000002
79,1.7180000000000002
80,1.7180000000000002
81,1.7180000000000002
82,1.7180000000000002
83,1.7180000000000002
84,1.7180000000000002
85,1.7180000000000002
86,1.7180000000000002
87,-1.6734
88,-1.6734
89,-1.6734
90,-1.6734
91,-1.6734
92,-1.6734
93,-1.6734
94,-1.6734
95,-1.6734
96,-1.6734
97,-1.6734
98,0.10708
99,0.22737
100,0.76077
101,-0.28019
102,0.1087
103,-0.2709
104,0.29722
105,-0.44332
106,-0.51576
107,-0.37594
108,-0.20984
109,-1.6734
110,-1.6734
111,-1.6734
112,-1.6734
113,-1.6734
114,-1.6734
115,-1.6734
116,-1.6734
117,-1.6734
118,1.7180000000000002
119,1.7180000000000002
120,1.7180000000000002
121,1.7180000000000002
122,1.7180000000000002
123,1.7180000000000002
124,1.7180000000000002
125,1.7180000000000002
126,1.7180000000000002
127,-0.04866
