time,value
0,2.7642
1,2.5447
2,2.2256
3,1.9123
4,1.6008
5,1.3466
6,1.0023
7,0.7006899999999999
8,0.5835899999999999
9,0.37440999999999997
10,0.32463000000000003
11,0.1893
12,0.047905
13,0.010811
14,0.032287
15,0.060598
16,-0.13721
17,-0.19474
18,-0.22810999999999998
19,-0.050018
20,-0.1676
21,-0.10779000000000001
22,-0.19313
23,-0.23623000000000002
24,-0.11572
25,-0.10719000000000001
26,-0.14818
27,-0.22223
28,-0.13482
29,-0.15578
30,-0.15578
31,-0.043943
32,0.0028572
33,0.06367
34,0.023785
35,0.011975
36,-0.032205000000000004
37,-0.091159
38,-0.044726999999999996
39,-0.094124
40,-0.032205000000000004
41,-0.0012216
42,0.098117
43,0.15730999999999998
44,0.039042
45,-0.05511900000000001
46,-0.19011
47,-0.36693000000000003
48,-0.55328
49,-0.77795
50,-1.1148
51,-1.4609999999999999
52,-1.8466
53,-1.9342
54,-1.564
55,-1.2382
56,-0.86605
57,-0.49323
58,-0.17060999999999998
59,0.2028
60,0.53133
61,0.90546
62,1.2734
63,1.5962
64,1.8506
65,2.1964
66,1.9698
67,1.611
68,1.28
69,0.89615
70,0.5656899999999999
71,0.19043
72,-0.18467
73,-0.51445
74,-0.8823
75,-1.2118
76,-1.5859999999999999
77,-1.9145
78,-2.2703
79,-2.0191
80,-1.7539
81,-1.5386
82,-1.4019
83,-1.182
84,-0.9424600000000001
85,-0.75031
86,-0.54809
87,-0.51725
88,-0.45041000000000003
89,-0.43686
90,-0.44088
91,-0.3939
92,-0.30846999999999997
93,-0.33409
94,-0.37632
95,-0.34031
96,-0.37695
97,-0.43283999999999995
98,-0.41934
99,-0.48211000000000004
100,-0.46571
101,-0.42186999999999997
102,-0.45275
103,-0.35714
104,-0.33886
105,-0.19514
106,-0.13063
107,-0.17260999999999999
108,-0.29016
109,-0.35881
110,-0.30723
111,-0.34156
112,-0.32395
113,-0.51617
114,-0.40209
115,-0.23196
116,-0.046882
117,0.0073208
118,0.09525399999999999
119,0.35768
120,0.59601
121,0.83745
122,1.1916
123,1.5481
124,1.7674
125,2.0332
126,2.3515
127,2.7177
