time,value
0,0.37382
1,0.14465999999999998
2,-0.1769
3,0.36439
4,-0.096711
5,-0.54433
6,-0.28373000000000004
7,0.12190999999999999
8,-0.19710999999999998
9,-0.09711
10,-0.15717
11,0.039352
12,1.4191
13,1.4191
14,1.4191
15,1.4191
16,1.4191
17,1.4191
18,1.4191
19,1.4191
20,1.4191
21,1.4191
22,1.4191
23,1.4191
24,1.4191
25,1.4191
26,1.4191
27,-1.4413
28,-1.4413
29,-1.4413
30,-1.4413
31,-1.4413
32,-1.4413
33,-1.4413
34,-1.4413
35,-1.4413
36,-1.4413
37,-1.4413
38,-1.4413
39,-1.4413
40,-1.4413
41,-1.4413
42,-0.41716000000000003
43,0.29593
44,-0.057119
45,0.55996
46,-0.025738999999999998
47,-0.044715
48,-0.27655
49,0.33733
50,-0.45678
51,-0.38524
52,-0.006162
53,0.13047999999999998
54,0.22175
55,0.20747
56,-0.46648999999999996
57,-0.75968
58,-0.33707
59,0.44048000000000004
60,0.14635
61,-0.26992
62,0.22041
63,-0.17783
64,0.11220999999999999
65,0.2313
66,-0.048676
67,-0.073125
68,-0.48762
69,-0.37575
70,-0.16723
71,-0.018591999999999997
72,0.099813
73,0.68947
74,-0.051117
75,-0.23823000000000003
76,-0.012548
77,-0.14737999999999998
78,0.06297
79,-0.13998
80,0.12666
81,0.17432
82,0.33024000000000003
83,0.50557
84,-0.21241
85,1.4191
86,1.4191
87,1.4191
88,1.4191
89,1.4191
90,1.4191
91,1.4191
92,1.4191
93,1.4191
94,1.4191
95,1.4191
96,1.4191
97,1.4191
98,1.4191
99,1.4191
100,-1.4413
101,-1.4413
102,-1.4413
103,-1.4413
104,-1.4413
105,-1.4413
106,-1.4413
107,-1.4413
108,-1.4413
109,-1.4413
110,-1.4413
111,-1.4413
112,-1.4413
113,-1.4413
114,-0.013855000000000001
115,-0.30279
116,-0.31026
117,0.048509
118,0.10563
119,0.22538000000000002
120,0.21023000000000003
121,0.50784
122,-0.47025
123,0.019517
124,-0.48171
125,0.43553000000000003
126,0.5549
127,-0.034255
