time,value
0,0.06692999999999999
1,-0.32175
2,0.11815
3,-0.2308
4,0.42862
5,-0.08163
6,0.37594
7,-0.20221
8,-0.34826999999999997
9,-0.09575499999999999
10,-0.010468
11,-0.38635
12,0.014266999999999998
13,-0.14820999999999998
14,0.08589400000000001
15,-0.40407
16,0.41703
17,0.34648
18,-0.36266
19,0.031568
20,0.47248999999999997
21,0.15947999999999998
22,0.34336
23,0.68577
24,-0.55256
25,-0.23371
26,0.49916000000000005
27,-0.13779
28,-0.37467
29,0.16751
30,0.054079999999999996
31,-0.13902
32,-0.43817
33,-0.42766000000000004
34,0.28763
35,-0.23894
36,0.43687
37,-0.15091
38,0.27279000000000003
39,-0.39263000000000003
40,0.62756
41,-0.07534099999999999
42,0.045391
43,-0.31025
44,0.52256
45,-0.4281
46,-1.639
47,-1.639
48,-1.639
49,-1.639
50,-1.639
51,-1.639
52,-1.639
53,-1.639
54,-1.639
55,-1.639
56,1.6931
57,1.6931
58,1.6931
59,1.6931
60,1.6931
61,1.6931
62,1.6931
63,1.6931
64,1.6931
65,0.1241
66,-0.098845
67,0.25196999999999997
68,-0.11780999999999998
69,-0.53727
70,0.18464
71,0.4251
72,0.024235
73,0.29493
74,0.092645
75,0.096673
76,-0.15044000000000002
77,-0.29041999999999996
78,1.6931
79,1.6931
80,1.6931
81,1.6931
82,1.6931
83,1.6931
84,1.6931
85,1.6931
86,1.6931
87,1.6931
88,1.6931
89,1.6931
90,-1.639
91,-1.639
92,-1.639
93,-1.639
94,-1.639
95,-1.639
96,-1.639
97,-1.639
98,-1.639
99,-1.639
100,-1.639
101,-0.36784
102,0.03524
103,-0.5566300000000001
104,0.19693
105,0.19444
106,-0.20555
107,-0.23425
108,0.021676
109,0.050806
110,0.31479
111,0.76151
112,-0.45898999999999995
113,0.5360199999999999
114,0.096403
115,0.13857
116,0.56413
117,-0.63052
118,0.61088
119,-0.6895899999999999
120,-0.29539
121,-0.12525999999999998
122,0.18482
123,0.21558000000000002
124,-0.35838000000000003
125,-0.82109
126,-0.36562
127,-0.21661
