time,value
0,-0.6715
1,-0.6715
2,-0.6715
3,-0.6715
4,-0.6715
5,-0.6715
6,-0.6715
7,-0.6715
8,-0.6715
9,-0.6715
10,-0.6715
11,-0.6715
12,-0.6715
13,-0.6715
14,-0.6715
15,-0.6715
16,-0.6715
17,-0.6715
18,-0.6715
19,-0.6715
20,-0.6715
21,-0.6715
22,-0.6715
23,-0.6715
24,-0.6715
25,-0.6715
26,-0.6715
27,-0.6715
28,-0.6715
29,-0.6715
30,-0.6715
31,-0.6715
32,-0.6715
33,-0.6715
34,-0.6715
35,-0.6715
36,-0.6715
37,-0.6715
38,-0.6715
39,-0.6715
40,-0.6715
41,-0.6715
42,-0.6715
43,-0.6715
44,-0.6715
45,-0.6715
46,-0.6715
47,-0.6715
48,-0.6715
49,-0.6715
50,-0.6715
51,-0.6715
52,-0.6715
53,-0.6715
54,-0.6715
55,-0.6715
56,-0.6715
57,-0.6715
58,-0.6715
59,-0.6715
60,-0.6715
61,-0.6715
62,-0.6715
63,-0.6715
64,-0.6715
65,-0.6715
66,-0.6715
67,-0.6715
68,-0.6715
69,-0.6715
70,-0.6715
71,-0.6715
72,-0.6715
73,-0.6715
74,-0.6715
75,-0.6715
76,-0.6715
77,-0.6715
78,-0.6715
79,-0.6715
80,-0.6715
81,-0.6715
82,-0.6715
83,-0.6715
84,-0.6715
85,-0.6715
86,-0.6715
87,-0.6715
88,-0.6715
89,-0.6715
90,-0.6715
91,-0.6715
92,-0.6715
93,-0.6715
94,-0.6715
95,-0.6715
96,-0.6715
97,-0.6715
98,-0.6715
99,-0.6715
100,-0.6715
101,-0.6715
102,-0.6715
103,-0.6715
104,-0.6715
105,-0.6715
106,-0.6715
107,-0.6715
108,-0.6715
109,-0.6715
110,-0.6715
111,-0.6715
112,-0.6715
113,-0.6715
114,-0.6715
115,-0.6715
116,-0.6715
117,-0.6715
118,-0.6715
119,-0.6715
120,-0.6715
121,-0.6715
122,-0.6715
123,-0.6715
124,-0.6715
125,-0.6715
126,-0.6715
127,-0.6715
128,-0.6715
129,-0.6715
130,-0.6715
131,-0.6715
132,-0.6715
133,-0.6715
134,-0.6715
135,-0.6715
136,-0.6715
137,-0.6715
138,-0.6715
139,-0.6715
140,-0.6715
141,-0.6715
142,-0.6715
143,-0.6715
144,-0.6715
145,-0.6715
146,-0.6715
147,-0.6715
148,-0.6715
149,-0.6715
150,-0.6715
151,-0.6715
152,-0.6715
153,-0.6715
154,-0.6715
155,-0.6715
156,-0.6715
157,-0.6715
158,-0.6715
159,-0.6715
160,-0.6715
161,-0.6715
162,-0.6715
163,-0.6715
164,-0.6715
165,-0.6715
166,-0.6715
167,-0.6715
168,-0.6715
169,-0.6715
170,-0.6715
171,-0.6715
172,-0.6715
173,-0.6715
174,-0.6715
175,-0.6715
176,-0.6715
177,-0.6715
178,-0.6715
179,-0.6715
180,-0.6715
181,-0.6715
182,-0.6715
183,-0.6715
184,-0.6715
185,-0.6715
186,-0.6715
187,-0.6715
188,-0.6715
189,-0.6715
190,-0.6715
191,-0.6715
192,-0.6715
193,-0.6715
194,-0.6715
195,-0.6715
196,-0.6715
197,-0.6715
198,-0.6715
199,-0.6715
200,-0.6715
201,-0.6715
202,-0.6715
203,-0.6715
204,-0.6715
205,-0.6715
206,-0.6715
207,-0.6715
208,-0.6715
209,-0.6715
210,-0.6715
211,-0.6715
212,-0.6715
213,-0.6715
214,-0.6715
215,-0.6715
216,-0.6715
217,-0.6715
218,-0.6715
219,-0.6715
220,-0.6715
221,-0.6715
222,-0.6715
223,-0.6715
224,-0.6715
225,-0.6715
226,-0.6715
227,-0.6715
228,-0.6715
229,-0.6715
230,-0.6715
231,-0.6715
232,-0.6715
233,-0.6715
234,-0.6715
235,-0.6715
236,-0.6715
237,-0.6715
238,-0.6715
239,-0.6715
240,-0.6715
241,-0.6715
242,-0.6715
243,-0.6715
244,-0.6715
245,-0.6715
246,-0.6715
247,-0.6715
248,-0.6715
249,-0.6715
250,-0.6715
251,-0.6715
252,-0.6715
253,-0.6715
254,-0.6715
255,-0.6715
256,-0.6715
257,-0.6715
258,-0.6715
259,-0.6715
260,-0.6715
261,-0.6715
262,-0.6715
263,-0.6715
264,-0.6715
265,-0.6715
266,-0.6715
267,-0.6715
268,-0.6715
269,-0.6715
270,-0.6715
271,-0.6715
272,-0.6715
273,-0.6715
274,-0.6715
275,-0.6715
276,-0.6715
277,-0.6715
278,-0.6715
279,-0.6715
280,-0.6715
281,-0.6715
282,-0.6715
283,-0.6715
284,-0.6715
285,-0.6715
286,-0.6715
287,-0.6715
288,-0.6715
289,-0.6715
290,-0.6715
291,-0.6715
292,-0.6715
293,-0.6715
294,-0.6715
295,-0.6715
296,-0.6715
297,-0.6715
298,-0.6715
299,-0.6715
300,-0.6715
301,-0.6715
302,-0.6715
303,-0.6715
304,-0.6715
305,-0.6715
306,-0.6715
307,-0.6715
308,-0.6715
309,-0.6715
310,-0.6715
311,-0.6715
312,-0.6715
313,-0.6715
314,-0.6715
315,-0.6715
316,-0.6715
317,-0.6715
318,-0.6715
319,-0.6715
320,-0.6715
321,-0.6715
322,-0.6715
323,-0.6715
324,-0.6715
325,-0.6715
326,-0.6715
327,-0.6715
328,-0.6715
329,-0.6715
330,-0.6715
331,-0.6715
332,-0.6715
333,-0.6715
334,-0.6715
335,-0.6715
336,-0.6715
337,-0.6715
338,-0.6715
339,-0.6715
340,-0.6715
341,-0.6715
342,-0.6715
343,-0.6715
344,-0.6715
345,-0.6715
346,-0.6715
347,-0.6715
348,-0.6715
349,-0.6715
350,-0.6715
351,-0.6715
352,-0.6715
353,-0.6715
354,-0.6715
355,-0.6715
356,-0.6715
357,-0.6715
358,-0.6715
359,-0.6715
360,-0.6715
361,-0.6715
362,-0.6715
363,-0.6715
364,-0.6715
365,-0.6715
366,-0.6715
367,-0.6715
368,-0.6715
369,-0.6715
370,-0.6715
371,-0.6715
372,-0.6715
373,-0.6715
374,-0.6715
375,-0.6715
376,-0.6715
377,-0.6715
378,-0.6715
379,-0.6715
380,-0.6715
381,-0.6715
382,-0.6715
383,-0.6715
384,-0.6715
385,-0.6715
386,-0.6715
387,-0.6715
388,-0.6715
389,-0.6715
390,-0.6715
391,-0.6715
392,-0.6715
393,-0.6715
394,-0.6715
395,-0.6715
396,-0.6715
397,-0.6715
398,-0.6715
399,-0.6715
400,-0.6715
401,-0.6715
402,-0.6715
403,-0.6715
404,-0.6715
405,-0.6715
406,-0.6715
407,-0.6715
408,-0.6715
409,-0.6715
410,-0.6715
411,-0.6715
412,-0.6715
413,-0.6715
414,-0.6715
415,-0.6715
416,-0.6715
417,-0.6715
418,-0.6715
419,-0.6715
420,-0.6715
421,-0.6715
422,-0.6715
423,-0.6715
424,-0.6715
425,-0.6715
426,-0.6715
427,-0.6715
428,-0.6715
429,-0.6715
430,-0.6715
431,-0.6715
432,-0.6715
433,-0.6715
434,-0.6715
435,-0.6715
436,-0.6715
437,-0.6715
438,-0.6715
439,-0.6715
440,-0.6715
441,-0.6715
442,-0.6715
443,-0.6715
444,-0.6715
445,-0.6715
446,-0.6715
447,-0.6715
448,-0.6715
449,-0.6715
450,-0.6715
451,-0.6715
452,-0.6715
453,-0.6715
454,-0.6715
455,-0.6715
456,-0.6715
457,-0.6715
458,-0.6715
459,-0.6715
460,-0.6715
461,-0.6715
462,-0.6715
463,0.11017
464,1.3757
465,1.3757
466,1.3757
467,1.3757
468,1.3757
469,1.3757
470,1.3757
471,1.3757
472,1.3757
473,1.3757
474,1.3757
475,1.1896
476,1.3757
477,1.3757
478,1.3757
479,1.3757
480,1.3757
481,1.3757
482,1.3757
483,1.3757
484,1.3757
485,1.1896
486,1.3757
487,1.3757
488,1.3757
489,1.3757
490,1.3757
491,1.3757
492,1.1896
493,1.3757
494,1.3757
495,1.5618
496,1.5618
497,1.5618
498,1.5618
499,1.5618
500,1.3757
501,1.5618
502,1.5618
503,1.5618
504,1.5618
505,1.5618
506,1.5618
507,1.5618
508,1.5618
509,1.5618
510,1.5618
511,1.5618
512,1.5618
513,1.5618
514,1.5618
515,1.5618
516,1.5618
517,1.5618
518,1.5618
519,1.5618
520,1.5618
521,1.5618
522,1.5618
523,1.5618
524,1.5618
525,1.5618
526,1.5618
527,1.5618
528,1.5618
529,1.5618
530,1.5618
531,1.5618
532,1.5618
533,1.5618
534,1.5618
535,1.5618
536,1.5618
537,1.5618
538,1.5618
539,1.5618
540,1.5618
541,1.5618
542,1.5618
543,1.5618
544,1.5618
545,1.5618
546,1.5618
547,1.5618
548,1.5618
549,1.5618
550,1.5618
551,1.5618
552,1.5618
553,1.5618
554,1.5618
555,1.5618
556,1.5618
557,1.5618
558,1.5618
559,1.5618
560,1.5618
561,1.5618
562,1.5618
563,1.5618
564,1.5618
565,1.5618
566,1.5618
567,1.5618
568,1.5618
569,1.5618
570,1.5618
571,1.5618
572,1.5618
573,1.5618
574,1.5618
575,1.5618
576,1.5618
577,1.5618
578,1.5618
579,1.5618
580,1.5618
581,1.5618
582,1.5618
583,1.5618
584,1.5618
585,1.5618
586,1.5618
587,1.5618
588,1.3757
589,1.5618
590,1.5618
591,1.5618
592,1.5618
593,1.5618
594,1.5618
595,1.5618
596,1.5618
597,1.5618
598,1.5618
599,1.5618
600,1.5618
601,1.5618
602,1.5618
603,1.5618
604,1.5618
605,1.5618
606,1.5618
607,1.5618
608,1.5618
609,1.5618
610,1.5618
611,1.5618
612,1.5618
613,1.5618
614,1.5618
615,1.5618
616,1.5618
617,1.5618
618,1.5618
619,1.5618
620,1.5618
621,1.5618
622,1.5618
623,1.5618
624,1.5618
625,1.5618
626,1.5618
627,1.5618
628,1.5618
629,1.5618
630,1.5618
631,1.5618
632,1.5618
633,1.5618
634,1.5618
635,1.5618
636,1.5618
637,1.5618
638,1.5618
639,1.5618
640,1.5618
641,1.5618
642,1.5618
643,1.1896
644,1.3757
645,1.3757
646,1.3757
647,1.1896
648,1.3757
649,1.3757
650,1.3757
651,1.1896
652,1.3757
653,1.3757
654,1.3757
655,1.3757
656,1.3757
657,1.1896
658,1.3757
659,1.3757
660,1.3757
661,1.1896
662,1.3757
663,1.3757
664,0.81739
665,1.3757
666,1.3757
667,1.3757
668,1.3757
669,1.1896
670,1.3757
671,1.3757
672,1.3757
673,1.3757
674,1.3757
675,1.1896
676,1.3757
677,1.3757
678,1.3757
679,1.3757
680,1.3757
681,1.1896
682,1.3757
683,1.3757
684,1.3757
685,1.3757
686,1.1896
687,1.0035
688,-0.55983
689,-0.6715
690,-0.6715
691,-0.6715
692,-0.6715
693,-0.6715
694,-0.6715
695,-0.6715
696,-0.6715
697,-0.6715
698,-0.6715
699,-0.6715
700,-0.6715
701,-0.6715
702,-0.6715
703,-0.6715
704,-0.6715
705,-0.6715
706,-0.6715
707,-0.6715
708,-0.6715
709,-0.6715
710,-0.6715
711,-0.6715
712,-0.6715
713,-0.6715
714,-0.6715
715,-0.6715
716,-0.6715
717,-0.6715
718,-0.6715
719,-0.6715
