time,value
0,1.2046
1,1.2046
2,1.2046
3,1.2046
4,1.2046
5,1.2046
6,1.2046
7,1.2046
8,1.2046
9,1.2046
10,1.2046
11,1.2046
12,1.2046
13,1.2046
14,1.2046
15,1.2046
16,1.2046
17,1.2046
18,1.2046
19,1.2082
20,1.2151
21,1.2258
22,1.2385
23,1.2511
24,1.2638
25,1.2649
26,1.2657
27,1.2657
28,1.2657
29,1.2657
30,1.2657
31,1.2657
32,1.2657
33,1.2657
34,1.2657
35,1.2657
36,1.2657
37,1.2656
38,1.2647
39,1.2612
40,1.2486
41,1.236
42,1.2233
43,1.2137
44,1.2069
45,1.2046
46,1.2046
47,1.2046
48,1.2046
49,1.2046
50,1.2046
51,1.2046
52,1.2038
53,1.2009
54,1.1938
55,1.1811
56,1.1685
57,1.1558
58,1.1432
59,1.1306
60,1.1179
61,1.1053
62,1.0926
63,1.08
64,1.0674
65,1.0547
66,1.0421
67,1.0319
68,1.0241
69,1.0215
70,1.0215
71,1.0215
72,1.0215
73,1.0121
74,1.002
75,0.98939
76,0.9772700000000001
77,0.9665799999999999
78,0.96041
79,0.96041
80,0.96041
81,0.96041
82,0.9653799999999999
83,0.9721799999999999
84,0.98414
85,0.9967799999999999
86,1.0094
87,1.0199
88,1.0208
89,1.0215
90,1.0215
91,1.0215
92,1.0215
93,1.0215
94,1.0215
95,1.0215
96,1.0215
97,1.0048
98,0.9864700000000001
99,0.96119
100,0.93566
101,0.90941
102,0.87835
103,0.8404299999999999
104,0.80252
105,0.7646
106,0.72668
107,0.68876
108,0.65084
109,0.61292
110,0.575
111,0.53897
112,0.51175
113,0.48517
114,0.45988999999999997
115,0.43742
116,0.41798
117,0.41089
118,0.41089
119,0.41089
120,0.41089
121,0.41089
122,0.41089
123,0.41089
124,0.41089
125,0.41089
126,0.42100000000000004
127,0.44628
128,0.47156000000000003
129,0.49683
130,0.51525
131,0.53081
132,0.5329999999999999
133,0.5329999999999999
134,0.5329999999999999
135,0.5329999999999999
136,0.5329999999999999
137,0.5329999999999999
138,0.5329999999999999
139,0.53209
140,0.53014
141,0.52153
142,0.50889
143,0.49625
144,0.48361000000000004
145,0.45832
146,0.43111000000000005
147,0.39319
148,0.35527
149,0.31735
150,0.27944
151,0.24151999999999998
152,0.2036
153,0.16568
154,0.12775999999999998
155,0.44786000000000004
156,0.25827
157,0.068675
158,-0.12092
159,-0.29713
160,-0.39921999999999996
161,-0.48941
162,-0.11025
163,-0.122
164,-0.13269
165,-0.12911
166,-0.11647
167,-0.10382999999999999
168,-0.45732
169,-0.34059
170,-0.21425999999999998
171,-0.16634000000000002
172,0.16493
173,0.35452
174,0.10103999999999999
175,0.11757000000000001
176,0.13204000000000002
177,0.14468
178,0.15135
179,0.15524000000000002
180,0.13476
181,0.10948
182,0.41966000000000003
183,0.27131
184,-0.072924
185,-0.3212
186,-0.13981
187,-0.21564
188,-0.29148
189,-0.35973
190,-0.42293000000000003
191,-0.48613
192,-0.54933
193,-0.60812
194,-0.6659999999999999
195,-0.7165600000000001
196,-0.7671100000000001
197,-0.81767
198,-0.85405
199,-0.8657100000000001
200,-0.87134
201,-0.87134
202,-0.87265
203,-0.87459
204,-0.88534
205,-0.8979799999999999
206,-0.9106200000000001
207,-0.9232600000000001
208,-0.9359
209,-0.9485399999999999
210,-0.9611799999999999
211,-0.97382
212,-0.98646
213,-0.9991
214,-1.0117
215,-1.0244
216,-1.037
217,-1.0531
218,-1.0701
219,-1.0954
220,-1.1206
221,-1.1459
222,-1.165
223,-1.1728
224,-1.1766
225,-1.1766
226,-1.1773
227,-1.1782
228,-1.1887
229,-1.2013
230,-1.214
231,-1.2266
232,-1.2392
233,-1.2519
234,-1.2645
235,-1.2772
236,-1.2898
237,-1.2963
238,-1.2982
239,-1.2988
240,-1.2988
241,-1.3013
242,-1.3046
243,-1.3172
244,-1.3299
245,-1.3425
246,-1.3578
247,-1.3782
248,-1.401
249,-1.4263
250,-1.4516
251,-1.4769
252,-1.4819
253,-1.4819
254,-1.4819
255,-1.4819
256,-1.4819
257,-1.4819
258,-1.4819
259,-1.4819
260,-1.4819
261,-1.4819
262,-1.4819
263,-1.4819
264,-1.4819
265,-1.4802
266,-1.4780000000000002
267,-1.4654
268,-1.4528
269,-1.4401
270,-1.4275
271,-1.4148
272,-1.4022
273,-1.3896
274,-1.3769
275,-1.3643
276,-1.3516
277,-1.339
278,-1.3264
279,-1.3134
280,-1.2968
281,-1.2781
282,-1.2529
283,-1.2276
284,-1.2023
285,-1.1819
286,-1.1653
287,-1.1515
288,-1.1389
289,-1.1254
290,-1.1117
291,-1.0864
292,-1.0611
293,-1.0359
294,-1.0124
295,-0.99298
296,-0.9767399999999999
297,-0.9641
298,-0.9514600000000001
299,-0.9388200000000001
300,-0.9178700000000001
301,-0.89454
302,-0.8694
303,-0.8441200000000001
304,-0.81884
305,-0.79356
306,-0.76828
307,-0.743
308,-0.71772
309,-0.69665
310,-0.67915
311,-0.66503
312,-0.6523899999999999
313,-0.63975
314,-0.6271100000000001
315,0.6816300000000001
316,0.6816300000000001
317,0.6816300000000001
318,0.6816300000000001
319,0.6816300000000001
320,0.6816300000000001
321,0.6816300000000001
322,0.6816300000000001
323,0.6816300000000001
324,0.6816300000000001
325,0.6816300000000001
326,0.6816300000000001
327,0.6816300000000001
328,0.6816300000000001
329,0.6816300000000001
330,0.6816300000000001
331,0.6816300000000001
332,0.6816300000000001
333,0.6816300000000001
334,0.69015
335,0.70626
336,0.7317899999999999
337,0.7617
338,0.79161
339,0.82152
340,0.82415
341,0.8261299999999999
342,0.8261299999999999
343,0.8261299999999999
344,0.8261299999999999
345,0.8261299999999999
346,0.8261299999999999
347,0.8261299999999999
348,0.8261299999999999
349,0.8261299999999999
350,0.8261299999999999
351,0.8261299999999999
352,0.8264
353,0.831
354,0.84729
355,0.90712
356,0.9669399999999999
357,1.0268
358,1.0723
359,1.1045
360,1.1151
361,1.1151
362,1.1151
363,1.1151
364,1.1151
365,1.1151
366,1.1151
367,1.1151
368,1.1151
369,1.1151
370,1.1151
371,1.1151
372,1.1151
373,1.1015
374,1.0831
375,1.0544
376,1.0245
377,0.99455
378,0.9646399999999999
379,0.93473
380,0.9048200000000001
381,0.8749
382,0.8508100000000001
383,0.83241
384,0.8261299999999999
385,0.8261299999999999
386,0.8261299999999999
387,0.8261299999999999
388,0.80393
389,0.7801100000000001
390,0.7501899999999999
391,0.72153
392,0.69622
393,0.6816300000000001
394,0.6816300000000001
395,0.6816300000000001
396,0.6816300000000001
397,0.6816300000000001
398,0.6816300000000001
399,0.6816300000000001
400,0.6816300000000001
401,0.6816300000000001
402,0.6816300000000001
403,0.6816300000000001
404,0.6816300000000001
405,0.6816300000000001
406,0.6816300000000001
407,0.6816300000000001
408,0.6816300000000001
409,0.6816300000000001
410,0.6816300000000001
411,0.6816300000000001
412,0.70136
413,0.72304
414,0.7529600000000001
415,0.78168
416,0.80699
417,0.8095600000000001
418,0.77965
419,0.74973
420,0.71982
421,0.68
422,0.6362899999999999
423,0.57855
424,0.51872
425,0.4589
426,0.40354
427,0.36903
428,0.33603
429,0.30612
430,0.27953
431,0.25653000000000004
432,0.24813000000000002
433,0.24813000000000002
434,0.24813000000000002
435,0.24813000000000002
436,0.24813000000000002
437,0.24813000000000002
438,0.24813000000000002
439,0.24813000000000002
440,0.24813000000000002
441,0.2601
442,0.29001
443,0.31992
444,0.34983000000000003
445,0.37975
446,0.40966
447,0.43956999999999996
448,0.46948
449,0.49938999999999995
450,0.52552
451,0.53242
452,0.53713
453,0.53713
454,0.5392899999999999
455,0.5439
456,0.56428
457,0.59419
458,0.6241
459,0.6540199999999999
460,0.66896
461,0.6816300000000001
462,0.6816300000000001
463,0.6816300000000001
464,0.6816300000000001
465,0.67091
466,0.6433
467,0.61444
468,0.58453
469,0.55462
470,0.5247
471,0.49478999999999995
472,0.46488
473,0.43496999999999997
474,0.40821999999999997
475,0.39902
476,0.39263000000000003
477,0.39263000000000003
478,0.39369
479,0.39599
480,0.41518
481,0.44509
482,0.475
483,0.50492
484,0.53483
485,0.5647399999999999
486,0.59465
487,0.62456
488,0.6544800000000001
489,0.69392
490,0.7491399999999999
491,0.8068
492,0.8666200000000001
493,0.9170299999999999
494,0.96304
495,0.97062
496,0.97062
497,0.97062
498,0.9680200000000001
499,0.94962
500,0.9278299999999999
501,0.89791
502,0.868
503,0.83809
504,0.79023
505,0.73041
506,0.6705800000000001
507,0.6107600000000001
508,0.55093
509,0.49111000000000005
510,0.43128999999999995
511,0.37146
512,0.31164000000000003
513,0.26021
514,0.22339
515,0.19015
516,0.16024000000000002
517,0.13033
518,0.10041
519,0.35115
520,0.20159000000000002
521,0.052033
522,-0.097527
523,-0.24709
524,-0.39665
525,-0.10897000000000001
526,-0.13888
527,-0.16879
528,-0.19871
529,-0.22862
530,-0.25853000000000004
531,-0.28844000000000003
532,-0.32658000000000004
533,-0.36667
534,-0.4265
535,-0.48632
536,-0.54615
537,-0.5986600000000001
538,-0.63778
539,-0.67224
540,-0.70215
541,-0.73206
542,-0.76197
543,-0.79188
544,-0.8218
545,-0.8517100000000001
546,-0.88
547,-0.8961
548,-0.90785
549,-0.90785
550,-0.90785
551,-0.90785
552,-0.9224399999999999
553,-0.94775
554,-0.9764200000000001
555,-1.0063
556,-1.0362
557,-1.0662
558,-1.0961
559,-1.126
560,-1.1559
561,-1.1858
562,-1.2157
563,-1.2456
564,-1.2755
565,-1.3054
566,-1.3354
567,-1.3653
568,-1.3952
569,-1.4251
570,-1.455
571,-1.4849
572,-1.5148
573,-1.5447
574,-1.5747
575,-1.6046
576,-1.6345
577,-1.6644
578,-1.6943
579,-1.7242
580,-1.7501
581,-1.7748
582,-1.7748
583,-1.7748
584,-1.7748
585,-1.7801
586,-1.7963
587,-1.819
588,-1.8489
589,-1.8788
590,-1.9088
591,-1.9169
592,-1.9192
593,-1.9193
594,-1.9185
595,-1.9093
596,-1.8949
597,-1.865
598,-1.8351
599,-1.8052
600,-1.7868
601,-1.7775
602,-1.7748
603,-1.7748
604,-1.7748
605,-1.7748
606,-1.7748
607,-1.7748
608,-1.7748
609,-1.7705
610,-1.7566
611,-1.7353
612,-1.7054
613,-1.6754
614,-1.6455
615,-1.6156
616,-1.5857
617,-1.5558
618,-1.5264
619,-1.5034
620,-1.4858
621,-1.4858
622,-1.4858
623,-1.4858
624,-1.4759
625,-1.4575
626,-1.4311
627,-1.4012
628,-1.3713
629,-1.3413
630,0.27851
631,0.27851
632,0.27851
633,0.27851
634,0.27851
635,0.27851
636,0.27851
637,0.27851
638,0.27851
639,0.27851
640,0.27851
641,0.27851
642,0.27851
643,0.27851
644,0.27851
645,0.27851
646,0.27851
647,0.27851
648,0.27851
649,0.27851
650,0.27851
651,0.27851
652,0.27851
653,0.27851
654,0.27851
655,0.27851
656,0.27851
657,0.27851
658,0.27851
659,0.27851
660,0.27851
661,0.27851
662,0.27851
663,0.27851
664,0.27851
665,0.27851
666,0.27851
667,0.27912
668,0.28959
669,0.32664
670,0.46266
671,0.5986899999999999
672,0.7347100000000001
673,0.8382299999999999
674,0.91148
675,0.9356
676,0.9356
677,0.9356
678,0.9356
679,0.9356
680,0.9356
681,0.9356
682,0.92674
683,0.89535
684,0.81842
685,0.6823899999999999
686,0.54637
687,0.41035
688,0.33636
689,0.28405
690,0.27851
691,0.27851
692,0.27851
693,0.2513
694,0.11528
695,-0.10507999999999999
696,-0.15677
697,-0.26633
698,-0.35003
699,-0.37859
700,-0.37859
701,-0.37859
702,-0.37859
703,-0.27765
704,-0.16932
705,-0.16785999999999998
706,0.45564
707,0.18557
708,0.18224
709,0.22975
710,-0.45037
711,-0.22583000000000003
712,-0.36185
713,-0.49787
714,-0.6339
715,-0.7699199999999999
716,-0.90594
717,-1.0183
718,-1.0288
719,-1.0357
720,-1.0357
721,-1.0357
722,-1.0357
723,-1.0357
724,-1.0357
725,-1.0357
726,-1.0357
727,-1.0357
728,-1.0357
729,-1.0357
730,-1.0357
731,-1.0357
732,-1.0357
733,-1.0357
734,-1.0357
735,-1.0357
736,-1.0357
737,-1.0357
738,-1.0357
739,-1.0357
740,-1.0357
741,-1.056
742,-1.1711
743,-1.2931
744,-1.4291
745,-1.55
746,-1.6546
747,-1.6928
748,-1.6928
749,-1.6928
750,-1.6928
751,-1.6928
752,-1.6928
753,-1.6928
754,-1.6928
755,-1.6928
756,-1.6928
757,-1.6928
758,-1.6928
759,-1.6928
760,-1.6928
761,-1.6928
762,-1.6928
763,-1.6928
764,-1.6928
765,-1.6928
766,-1.6928
767,-1.6928
768,-1.6928
769,-1.6829
770,-1.662
771,-1.5693
772,-1.4333
773,-1.2973
774,-1.1612
775,-1.0933
776,-1.0357
777,-1.0357
778,-1.0357
779,-1.0357
780,-0.9869399999999999
781,-0.8613799999999999
782,-0.73016
783,-0.59413
784,-0.5162100000000001
785,-0.4639
786,-0.57112
787,-0.70714
788,-0.84316
789,-0.96478
790,-1.0066
791,-1.0357
792,-1.0357
793,-1.0357
794,-1.0357
795,-1.0357
796,-1.0357
797,-1.0357
798,-1.0357
799,-1.0357
800,-1.0357
801,-1.0357
802,-1.0357
803,-1.0357
804,-1.0357
805,-1.0357
806,-1.0357
807,-1.0357
808,-0.99285
809,-0.9300700000000001
810,-0.6924899999999999
811,-0.42044
812,-0.1484
813,0.12365
814,0.3957
815,0.66774
816,0.93979
817,1.2118
818,1.4839
819,1.5111
820,1.3751
821,1.239
822,1.103
823,0.96699
824,0.8309700000000001
825,0.69495
826,0.55892
827,0.4229
828,0.24871999999999997
829,0.25774
830,-0.24884
831,-0.52089
832,-0.75084
833,-0.9601
834,-0.88502
835,-0.7489899999999999
836,-0.61297
837,-0.47695
838,-0.34092
839,-0.2049
840,-0.34573000000000004
841,0.33438
842,0.20317000000000002
843,0.33919
844,0.47522
845,0.61124
846,0.74726
847,0.8832899999999999
848,1.0193
849,1.1553
850,1.2914
851,1.4274
852,1.5302
853,1.5719999999999998
854,1.5927
855,1.5927
856,1.5927
857,1.5927
858,1.5927
859,1.5927
860,1.5927
861,1.6001
862,1.6629
863,1.7455
864,1.8815
865,2.0175
866,2.1535
867,2.0905
868,1.8812
869,1.6262
870,1.3541
871,1.1098
872,0.87282
873,0.7368
874,0.60078
875,0.46475
876,0.38585
877,0.41723999999999994
878,0.50033
879,0.63635
880,0.7723800000000001
881,0.9084
882,1.0444
883,1.1804
884,1.3165
885,1.4469999999999998
886,1.5307
887,1.5927
888,1.5927
889,1.5927
890,1.5927
891,1.5927
892,1.5927
893,1.5927
894,1.5927
895,1.5927
896,1.5927
897,1.5927
898,1.5927
899,1.5927
900,1.5686
901,1.4953
902,1.3918
903,1.2558
904,1.1198
905,0.98374
906,0.94668
907,0.93622
908,0.9356
909,0.9316700000000001
910,0.88981
911,0.8246899999999999
912,0.68867
913,0.55265
914,0.41662
915,0.2806
916,0.14458
917,0.27415
918,-0.12747
919,-0.25451
920,-0.37859
921,-0.37859
922,-0.37859
923,-0.37859
924,-0.37859
925,-0.37859
926,-0.37859
927,-0.37859
928,-0.37859
929,-0.37859
930,-0.28922
931,-0.17412
932,-0.19925
933,0.45502
934,0.16452
935,0.18852
936,0.26114
937,-0.41898
938,-0.21955
939,-0.31027
940,-0.36259
941,-0.37859
942,-0.37859
943,-0.37859
944,-0.37859
