time,value
0,-0.072437
1,0.31358
2,-0.11124
3,-0.12705
4,0.5536399999999999
5,-0.14387
6,0.24634
7,-0.061778999999999994
8,0.1786
9,0.58575
10,0.32655
11,-0.16469
12,-0.11205999999999999
13,0.10457999999999999
14,0.1395
15,0.07487200000000001
16,-0.50262
17,0.27883
18,-0.010278
19,-0.092749
20,-0.21800999999999998
21,0.66078
22,-0.079025
23,0.067425
24,0.39511999999999997
25,-0.2857
26,-0.24738000000000002
27,-0.20546999999999999
28,0.6998
29,-0.18538
30,-0.13068
31,-0.33451
32,-0.37121
33,0.21074
34,-0.26409
35,0.1214
36,0.39384
37,-0.15337
38,0.018634
39,0.2073
40,0.20744
41,-0.25051
42,-0.42013999999999996
43,0.27641
44,-0.51059
45,0.11227999999999999
46,0.11604
47,1.4836
48,1.4836
49,1.4836
50,1.4836
51,1.4836
52,1.4836
53,1.4836
54,1.4836
55,1.4836
56,1.4836
57,1.4836
58,-1.5419
59,-1.5419
60,-1.5419
61,-1.5419
62,-1.5419
63,-1.5419
64,-1.5419
65,-1.5419
66,-1.5419
67,-1.5419
68,-1.5419
69,-0.25735
70,-0.044726
71,-0.10672999999999999
72,0.11889000000000001
73,0.092968
74,-0.37379
75,0.51549
76,0.13510999999999998
77,0.42895
78,-0.47763999999999995
79,-0.0912
80,-0.00031889
81,0.099906
82,-0.29481999999999997
83,0.052062
84,-0.13853
85,-0.13243
86,-0.095336
87,0.22601999999999997
88,-0.11283
89,1.4836
90,1.4836
91,1.4836
92,1.4836
93,1.4836
94,1.4836
95,1.4836
96,1.4836
97,1.4836
98,1.4836
99,1.4836
100,1.4836
101,1.4836
102,1.4836
103,1.4836
104,1.4836
105,-1.5419
106,-1.5419
107,-1.5419
108,-1.5419
109,-1.5419
110,-1.5419
111,-1.5419
112,-1.5419
113,-1.5419
114,-1.5419
115,-1.5419
116,-1.5419
117,-1.5419
118,-1.5419
119,-1.5419
120,-0.43301999999999996
121,-0.47005
122,0.19054000000000001
123,-0.10947
124,-0.11484000000000001
125,-0.057262
126,0.2834
127,-0.035759
