time,value
0,1.3157
1,1.189
2,0.9618899999999999
3,0.61521
4,0.15050999999999998
5,-0.40997
6,-0.99003
7,-1.5068
8,-1.855
9,-1.9567
10,-1.7790000000000001
11,-1.3329
12,-0.67907
13,0.043202
14,0.71031
15,1.1978
16,1.4299
17,1.3944
18,1.1244
19,0.68801
20,0.18027
21,-0.30832
22,-0.71282
23,-0.9991
24,-1.1520000000000001
25,-1.1884
26,-1.1283
27,-0.98651
28,-0.76188
29,-0.45888999999999996
30,-0.075861
31,0.3767
32,0.8615799999999999
33,1.3174
34,1.6819
35,1.8961
36,1.9022
37,1.6809
38,1.2505
39,0.67304
40,0.021427
41,-0.62083
42,-1.1843
43,-1.6157
44,-1.8884
45,-1.9951
46,-1.9462
47,-1.7614
48,-1.4428
49,-1.0154
50,-0.49108999999999997
51,0.10400000000000001
52,0.7157600000000001
53,1.2859
54,1.7427
55,2.0227
56,2.0869
57,1.9334
58,1.5881
59,1.1155
60,0.58941
61,0.07832599999999999
62,-0.3666
63,-0.71595
64,-0.9567399999999999
65,-1.0975
66,-1.1436
67,-1.1161
68,-1.0289
69,-0.92281
70,-0.8272
71,-0.7660399999999999
72,-0.76615
73,-0.81058
74,-0.85655
75,-0.84921
76,-0.7228100000000001
77,-0.4317
78,0.024541999999999998
79,0.6038
80,1.2111
81,1.7291
82,2.0489
83,2.0988
84,1.8672
85,1.4083
86,0.8189
87,0.22487
88,-0.27214
89,-0.59042
90,-0.7225600000000001
91,-0.69827
92,-0.59967
93,-0.50751
94,-0.47478000000000004
95,-0.53341
96,-0.65242
97,-0.78752
98,-0.88128
99,-0.8719399999999999
100,-0.7394
101,-0.49598000000000003
102,-0.18688
103,0.12261
104,0.37184
105,0.52207
106,0.5747800000000001
107,0.5492100000000001
108,0.4955
109,0.44886000000000004
110,0.42445
111,0.42056000000000004
112,0.39188
113,0.2872
114,0.093207
115,-0.17995
116,-0.48427
117,-0.7472
118,-0.8977700000000001
119,-0.8828799999999999
120,-0.6896
121,-0.35531999999999997
122,0.029795
123,0.36969
124,0.59318
125,0.6543399999999999
126,0.57171
127,0.39676
128,0.19696
129,0.034221
130,-0.045013
131,-0.035509
132,0.040853
133,0.14515999999999998
134,0.24006
135,0.30273
136,0.31235
137,0.28393
138,0.22498
139,0.13865
140,0.019533000000000002
141,-0.14290999999999998
142,-0.34802
143,-0.5846
144,-0.84149
145,-1.0848
146,-1.2775
147,-1.3769999999999998
148,-1.3426
149,-1.1542
150,-0.82095
151,-0.36738000000000004
152,0.1701
153,0.73853
154,1.2794
155,1.7341
156,2.0691
157,2.2629
158,2.2986
159,2.1785
160,1.9029
161,1.4863
162,0.9353299999999999
163,0.29391
164,-0.4018
165,-1.1184
166,-1.79
167,-2.3576
168,-2.7618
169,-2.9672
170,-2.9412
171,-2.6941
172,-2.2506
173,-1.6578
174,-0.98414
175,-0.28601
176,0.39034
177,1.0072
178,1.5492
179,2.0001
180,2.3429
181,2.5562
182,2.6210000000000004
183,2.5287
184,2.2735
185,1.8684
186,1.3492
187,0.76062
188,0.14590999999999998
189,-0.43536
190,-0.95701
191,-1.3863
192,-1.6983
193,-1.8844
194,-1.9495
195,-1.896
196,-1.7416
197,-1.5262
198,-1.2718
199,-0.98882
200,-0.70296
201,-0.41571
202,-0.11986
203,0.19699
204,0.53408
205,0.88077
206,1.2063
207,1.4713
208,1.6325
209,1.6628
210,1.5545
211,1.3203
212,0.9808600000000001
213,0.5776600000000001
214,0.15077000000000002
215,-0.26216
216,-0.63876
217,-0.9505399999999999
218,-1.1688
219,-1.2664
220,-1.2264
221,-1.0525
222,-0.7791100000000001
223,-0.44813000000000003
224,-0.10534
225,0.18955999999999998
226,0.4057
227,0.55214
228,0.64405
229,0.71053
230,0.77115
231,0.8135100000000001
232,0.8211299999999999
233,0.74444
234,0.55286
235,0.25016
236,-0.14243
237,-0.5526300000000001
238,-0.91569
239,-1.1668
240,-1.2655
241,-1.2223
242,-1.0713
243,-0.8651200000000001
244,-0.65127
245,-0.45138999999999996
246,-0.26261999999999996
247,-0.061501
248,0.17242000000000002
249,0.43651
250,0.70526
251,0.94158
252,1.0953
253,1.1396
254,1.0747
255,0.92415
256,0.74275
257,0.57221
258,0.43112
259,0.31866
260,0.20701
261,0.06242
262,-0.1371
263,-0.38379
264,-0.64579
265,-0.8603
266,-0.96798
267,-0.9463600000000001
268,-0.8044100000000001
269,-0.59083
270,-0.37184
271,-0.20923000000000003
272,-0.1278
273,-0.12703
274,-0.17354
275,-0.19995
276,-0.15015
277,-0.0049503
278,0.21829
279,0.47678000000000004
280,0.70576
281,0.85731
282,0.89865
283,0.8284600000000001
284,0.67428
285,0.47801000000000005
286,0.28436999999999996
287,0.1052
288,-0.0564
289,-0.2041
290,-0.35828000000000004
291,-0.51708
292,-0.6655800000000001
293,-0.78373
294,-0.84491
295,-0.82363
296,-0.70998
297,-0.51681
298,-0.25604
299,0.037199
300,0.32286
301,0.56817
302,0.7606
303,0.8870600000000001
304,0.9383100000000001
305,0.92606
306,0.86064
307,0.74859
308,0.58913
309,0.38611999999999996
310,0.13360999999999998
311,-0.15467
312,-0.46955
313,-0.78351
314,-1.0606
315,-1.2533
316,-1.3204
317,-1.2308
318,-0.9855700000000001
319,-0.6019100000000001
320,-0.14484
321,0.31679
322,0.70529
323,0.9636299999999999
324,1.0728
325,1.0327
326,0.88649
327,0.6947
328,0.50593
329,0.36476
330,0.29323
331,0.27854
332,0.28966
333,0.28187
334,0.22791
335,0.10217999999999999
336,-0.10262
337,-0.36388000000000004
338,-0.64777
339,-0.91371
340,-1.1211
341,-1.2432
342,-1.2444
343,-1.1345
344,-0.92138
345,-0.62495
346,-0.28433
347,0.056074
348,0.35394000000000003
349,0.57813
350,0.71978
351,0.78276
352,0.78996
353,0.77164
354,0.76088
355,0.77381
356,0.82183
357,0.89541
358,0.96249
359,0.9897600000000001
360,0.94183
361,0.80011
362,0.5525
363,0.21486999999999998
364,-0.20179
365,-0.6649
366,-1.1426
367,-1.5804
368,-1.9325
369,-2.1404
370,-2.1507
371,-1.9393
372,-1.5132
373,-0.91959
374,-0.23037
375,0.45858000000000004
376,1.0408
377,1.4422
378,1.6359
379,1.6285
380,1.4597
381,1.1988
382,0.9098299999999999
383,0.6500199999999999
384,0.44869
385,0.30618
386,0.21894
387,0.14711
388,0.070618
389,-0.018071
390,-0.12711
391,-0.24843
392,-0.36025
393,-0.46092
394,-0.55132
395,-0.6130800000000001
396,-0.6464
397,-0.6561100000000001
398,-0.6431600000000001
399,-0.60497
400,-0.53469
401,-0.43228
402,-0.28736
403,-0.11579
404,0.065599
405,0.24341
406,0.39698
407,0.49615
408,0.55008
409,0.57234
410,0.57405
411,0.57667
412,0.58594
413,0.61516
414,0.65018
415,0.67192
416,0.64999
417,0.55613
418,0.38326
419,0.1431
420,-0.14909
421,-0.46108000000000005
422,-0.76286
423,-1.0294
424,-1.2319
425,-1.3638
426,-1.4062
427,-1.348
428,-1.1733
429,-0.88023
430,-0.47833000000000003
431,-0.0044453
432,0.48838000000000004
433,0.94471
434,1.2884
435,1.4637
436,1.4521
437,1.2789
438,1.0023
439,0.7008300000000001
440,0.44787
441,0.29656
442,0.2532
443,0.27542
444,0.31806999999999996
445,0.31416
446,0.19814
447,-0.038357
448,-0.36777
449,-0.74434
450,-1.0944
451,-1.3534
452,-1.4832
453,-1.4763
454,-1.3375
455,-1.0981
456,-0.79256
457,-0.44136000000000003
458,-0.070344
459,0.31043000000000004
460,0.69629
461,1.062
462,1.3662
463,1.5698
464,1.6198
465,1.5055
466,1.2188
467,0.79873
468,0.30669
469,-0.16507
470,-0.5455
471,-0.78957
472,-0.88261
473,-0.8515299999999999
474,-0.7492800000000001
475,-0.62892
476,-0.53797
477,-0.48888000000000004
478,-0.48349
479,-0.49785
480,-0.49218
481,-0.43476000000000004
482,-0.29745
483,-0.092093
484,0.15957000000000002
485,0.42858
486,0.67474
487,0.8558399999999999
488,0.95509
489,0.9762
490,0.9118299999999999
491,0.77765
492,0.59817
493,0.39250999999999997
494,0.19022999999999998
495,0.014916
496,-0.12189000000000001
497,-0.22432
498,-0.30768
499,-0.39193
