time,value
0,-0.4657
1,-0.42157
2,-0.28784
3,-0.067935
4,0.18261
5,0.41501000000000005
6,0.66801
7,0.92366
8,1.1516
9,1.3696
10,1.4402
11,1.4657
12,1.4254
13,1.4865
14,1.4731
15,1.2993
16,1.0868
17,0.8364799999999999
18,0.61174
19,0.3666
20,0.08975599999999999
21,-0.15322
22,-0.32792
23,-0.44486000000000003
24,-0.44737
25,-0.32986
26,-0.18893
27,0.014803
28,0.24609
29,0.47823000000000004
30,0.71905
31,0.9741299999999999
32,1.2325
33,1.4329
34,1.3543
35,1.3528
36,1.3766
37,1.4251
38,1.4417
39,1.3748
40,1.4065
41,1.385
42,1.193
43,0.9242100000000001
44,0.69114
45,0.43278
46,0.1865
47,-0.036661
48,-0.23606999999999997
49,-0.37287
50,-1.0718
51,-1.0718
52,-1.0718
53,-1.0718
54,-1.0718
55,-1.0718
56,-1.0718
57,-1.0718
58,-1.0718
59,-1.0718
60,-1.0718
61,-1.0718
62,-1.0718
63,-1.0718
64,-1.0718
65,-1.0718
66,-1.0718
67,-1.0718
68,-1.0718
69,-1.0718
70,-1.0718
71,-1.0718
72,-1.0718
73,-1.0718
74,-1.0718
75,-1.0718
76,-1.0718
77,-1.0718
78,-1.0718
79,-1.0718
