time,value
0,-0.12782000000000002
1,-0.12782000000000002
2,-0.12782000000000002
3,-0.12782000000000002
4,-0.12782000000000002
5,-0.12782000000000002
6,-0.12782000000000002
7,-0.12782000000000002
8,-0.12782000000000002
9,-0.12782000000000002
10,-0.12782000000000002
11,-0.12782000000000002
12,-0.12782000000000002
13,-0.12782000000000002
14,-0.12782000000000002
15,-0.12782000000000002
16,-0.12782000000000002
17,-0.12782000000000002
18,-0.12782000000000002
19,-0.12782000000000002
20,-0.12782000000000002
21,-0.12782000000000002
22,-0.12782000000000002
23,-0.12782000000000002
24,-0.12782000000000002
25,-0.12782000000000002
26,-0.12782000000000002
27,-0.12782000000000002
28,-0.12782000000000002
29,-0.12782000000000002
30,-0.12782000000000002
31,-0.12782000000000002
32,-0.12782000000000002
33,-0.12782000000000002
34,-0.12782000000000002
35,-0.12782000000000002
36,-0.12782000000000002
37,-0.12782000000000002
38,-0.12782000000000002
39,-0.12782000000000002
40,-0.12782000000000002
41,-0.12782000000000002
42,-0.12782000000000002
43,-0.12782000000000002
44,-0.12782000000000002
45,-0.12782000000000002
46,-0.12782000000000002
47,-0.12782000000000002
48,-0.12782000000000002
49,-0.12782000000000002
50,-0.12782000000000002
51,-0.12782000000000002
52,-0.12782000000000002
53,-0.12782000000000002
54,-0.12782000000000002
55,-0.12782000000000002
56,-0.12782000000000002
57,-0.12782000000000002
58,-0.12782000000000002
59,-0.12782000000000002
60,-0.12782000000000002
61,-0.12782000000000002
62,-0.12782000000000002
63,-0.12782000000000002
64,-0.12782000000000002
65,-0.12782000000000002
66,-0.12782000000000002
67,-0.12782000000000002
68,-0.12782000000000002
69,-0.12782000000000002
70,-0.12782000000000002
71,-0.12782000000000002
72,-0.12782000000000002
73,-0.12782000000000002
74,-0.12782000000000002
75,-0.12782000000000002
76,-0.12782000000000002
77,-0.12782000000000002
78,-0.12782000000000002
79,-0.12782000000000002
80,-0.12782000000000002
81,-0.12782000000000002
82,-0.12782000000000002
83,-0.12782000000000002
84,-0.12782000000000002
85,-0.12782000000000002
86,-0.12782000000000002
87,-0.12782000000000002
88,-0.12782000000000002
89,-0.12782000000000002
90,-0.12782000000000002
91,-0.12782000000000002
92,-0.12782000000000002
93,-0.12782000000000002
94,-0.12782000000000002
95,-0.12782000000000002
96,-0.12782000000000002
97,-0.12782000000000002
98,-0.12782000000000002
99,-0.12782000000000002
100,-0.12782000000000002
101,-0.12782000000000002
102,-0.12782000000000002
103,-0.12782000000000002
104,-0.12782000000000002
105,-0.12782000000000002
106,-0.12782000000000002
107,-0.12782000000000002
108,-0.12782000000000002
109,-0.12782000000000002
110,-0.12782000000000002
111,-0.12782000000000002
112,-0.12782000000000002
113,-0.12782000000000002
114,-0.12782000000000002
115,-0.12782000000000002
116,-0.12782000000000002
117,-0.12782000000000002
118,-0.12782000000000002
119,-0.12782000000000002
120,-0.12782000000000002
121,-0.12782000000000002
122,-0.12782000000000002
123,-0.12782000000000002
124,-0.12782000000000002
125,-0.12782000000000002
126,-0.12782000000000002
127,-0.12782000000000002
128,-0.12782000000000002
129,-0.12782000000000002
130,-0.12782000000000002
131,-0.12782000000000002
132,-0.12782000000000002
133,-0.12782000000000002
134,-0.12782000000000002
135,-0.12782000000000002
136,-0.12782000000000002
137,-0.12782000000000002
138,-0.12782000000000002
139,-0.12782000000000002
140,-0.12782000000000002
141,-0.12782000000000002
142,-0.12782000000000002
143,-0.12782000000000002
144,-0.12782000000000002
145,-0.12782000000000002
146,-0.12782000000000002
147,-0.12782000000000002
148,-0.12782000000000002
149,-0.12782000000000002
150,-0.12782000000000002
151,-0.12782000000000002
152,-0.12782000000000002
153,-0.12782000000000002
154,-0.12782000000000002
155,-0.12782000000000002
156,-0.12782000000000002
157,-0.12782000000000002
158,-0.12782000000000002
159,-0.12782000000000002
160,-0.12782000000000002
161,-0.12782000000000002
162,-0.12782000000000002
163,-0.12782000000000002
164,-0.12782000000000002
165,-0.12782000000000002
166,-0.12782000000000002
167,-0.12782000000000002
168,-0.12782000000000002
169,-0.12782000000000002
170,-0.12782000000000002
171,-0.12782000000000002
172,-0.12782000000000002
173,-0.12782000000000002
174,-0.12782000000000002
175,-0.12782000000000002
176,-0.12782000000000002
177,-0.12782000000000002
178,-0.12782000000000002
179,-0.12782000000000002
180,-0.12782000000000002
181,-0.12782000000000002
182,-0.12782000000000002
183,-0.12782000000000002
184,-0.12782000000000002
185,-0.12782000000000002
186,-0.12782000000000002
187,-0.12782000000000002
188,-0.12782000000000002
189,-0.12782000000000002
190,-0.12782000000000002
191,-0.12782000000000002
192,-0.12782000000000002
193,-0.12782000000000002
194,-0.12782000000000002
195,-0.12782000000000002
196,-0.12782000000000002
197,-0.12782000000000002
198,-0.12782000000000002
199,-0.12782000000000002
200,-0.12782000000000002
201,-0.12782000000000002
202,-0.12782000000000002
203,-0.12782000000000002
204,-0.12782000000000002
205,-0.12782000000000002
206,-0.12782000000000002
207,-0.12782000000000002
208,-0.12782000000000002
209,-0.12782000000000002
210,-0.12782000000000002
211,-0.12782000000000002
212,-0.12782000000000002
213,-0.12782000000000002
214,-0.12782000000000002
215,-0.12782000000000002
216,-0.12782000000000002
217,-0.12782000000000002
218,-0.12782000000000002
219,-0.12782000000000002
220,-0.12782000000000002
221,-0.12782000000000002
222,-0.12782000000000002
223,-0.12782000000000002
224,-0.12782000000000002
225,-0.12782000000000002
226,-0.12782000000000002
227,-0.12782000000000002
228,-0.12782000000000002
229,-0.12782000000000002
230,-0.12782000000000002
231,-0.12782000000000002
232,-0.12782000000000002
233,-0.12782000000000002
234,-0.12782000000000002
235,-0.12782000000000002
236,-0.12782000000000002
237,-0.12782000000000002
238,-0.12782000000000002
239,-0.12782000000000002
240,-0.12782000000000002
241,-0.12782000000000002
242,-0.12782000000000002
243,-0.12782000000000002
244,-0.12782000000000002
245,-0.12782000000000002
246,-0.12782000000000002
247,-0.12782000000000002
248,-0.12782000000000002
249,-0.12782000000000002
250,-0.12782000000000002
251,-0.12782000000000002
252,-0.12782000000000002
253,-0.12782000000000002
254,-0.12782000000000002
255,-0.12782000000000002
256,-0.12782000000000002
257,-0.12782000000000002
258,-0.12782000000000002
259,-0.12782000000000002
260,-0.12782000000000002
261,-0.12782000000000002
262,-0.12782000000000002
263,-0.12782000000000002
264,-0.12782000000000002
265,-0.12782000000000002
266,-0.12782000000000002
267,-0.12782000000000002
268,-0.12782000000000002
269,-0.12782000000000002
270,-0.12782000000000002
271,-0.12782000000000002
272,0.38444
273,10.245
274,7.8122
275,-0.11180999999999999
276,-0.12782000000000002
277,-0.12782000000000002
278,-0.12782000000000002
279,-0.12782000000000002
280,-0.12782000000000002
281,-0.12782000000000002
282,-0.12782000000000002
283,-0.12782000000000002
284,-0.12782000000000002
285,-0.12782000000000002
286,-0.12782000000000002
287,-0.12782000000000002
288,-0.12782000000000002
289,-0.12782000000000002
290,-0.12782000000000002
291,-0.12782000000000002
292,-0.12782000000000002
293,-0.12782000000000002
294,-0.12782000000000002
295,-0.12782000000000002
296,-0.12782000000000002
297,-0.12782000000000002
298,-0.12782000000000002
299,-0.12782000000000002
300,-0.12782000000000002
301,7.0759
302,8.5806
303,0.032261
304,-0.12782000000000002
305,-0.12782000000000002
306,-0.12782000000000002
307,-0.12782000000000002
308,-0.12782000000000002
309,-0.12782000000000002
310,-0.12782000000000002
311,-0.12782000000000002
312,-0.12782000000000002
313,-0.12782000000000002
314,-0.12782000000000002
315,-0.12782000000000002
316,-0.12782000000000002
317,-0.12782000000000002
318,3.2339
319,3.2339
320,-0.095804
321,-0.12782000000000002
322,-0.12782000000000002
323,-0.12782000000000002
324,-0.12782000000000002
325,-0.12782000000000002
326,-0.12782000000000002
327,-0.12782000000000002
328,-0.12782000000000002
329,-0.12782000000000002
330,-0.12782000000000002
331,-0.12782000000000002
332,-0.12782000000000002
333,-0.12782000000000002
334,-0.12782000000000002
335,-0.12782000000000002
336,-0.12782000000000002
337,-0.12782000000000002
338,-0.12782000000000002
339,-0.12782000000000002
340,-0.12782000000000002
341,-0.12782000000000002
342,-0.12782000000000002
343,-0.12782000000000002
344,-0.12782000000000002
345,-0.12782000000000002
346,-0.12782000000000002
347,-0.12782000000000002
348,-0.12782000000000002
349,-0.12782000000000002
350,-0.12782000000000002
351,-0.12782000000000002
352,-0.12782000000000002
353,-0.12782000000000002
354,-0.12782000000000002
355,-0.12782000000000002
356,-0.12782000000000002
357,-0.12782000000000002
358,-0.12782000000000002
359,-0.12782000000000002
360,-0.12782000000000002
361,-0.12782000000000002
362,-0.12782000000000002
363,-0.12782000000000002
364,-0.12782000000000002
365,-0.12782000000000002
366,-0.12782000000000002
367,-0.12782000000000002
368,-0.12782000000000002
369,-0.12782000000000002
370,-0.12782000000000002
371,-0.12782000000000002
372,-0.12782000000000002
373,-0.12782000000000002
374,-0.12782000000000002
375,-0.12782000000000002
376,-0.12782000000000002
377,-0.12782000000000002
378,-0.12782000000000002
379,-0.12782000000000002
380,-0.12782000000000002
381,-0.12782000000000002
382,-0.12782000000000002
383,-0.12782000000000002
384,-0.12782000000000002
385,-0.12782000000000002
386,-0.12782000000000002
387,-0.12782000000000002
388,-0.12782000000000002
389,-0.12782000000000002
390,-0.12782000000000002
391,-0.12782000000000002
392,-0.12782000000000002
393,-0.12782000000000002
394,-0.12782000000000002
395,-0.12782000000000002
396,-0.12782000000000002
397,-0.12782000000000002
398,-0.12782000000000002
399,-0.12782000000000002
400,-0.12782000000000002
401,-0.12782000000000002
402,-0.12782000000000002
403,-0.12782000000000002
404,-0.12782000000000002
405,-0.12782000000000002
406,-0.12782000000000002
407,-0.12782000000000002
408,-0.12782000000000002
409,-0.12782000000000002
410,-0.12782000000000002
411,-0.12782000000000002
412,-0.12782000000000002
413,-0.12782000000000002
414,-0.12782000000000002
415,-0.12782000000000002
416,-0.12782000000000002
417,-0.12782000000000002
418,-0.12782000000000002
419,-0.12782000000000002
420,-0.12782000000000002
421,-0.12782000000000002
422,-0.12782000000000002
423,-0.12782000000000002
424,-0.12782000000000002
425,-0.12782000000000002
426,-0.12782000000000002
427,-0.12782000000000002
428,-0.12782000000000002
429,-0.12782000000000002
430,-0.12782000000000002
431,-0.12782000000000002
432,-0.12782000000000002
433,-0.12782000000000002
434,-0.12782000000000002
435,-0.12782000000000002
436,-0.12782000000000002
437,-0.12782000000000002
438,-0.12782000000000002
439,-0.12782000000000002
440,-0.12782000000000002
441,-0.12782000000000002
442,-0.12782000000000002
443,-0.12782000000000002
444,-0.12782000000000002
445,-0.12782000000000002
446,2.7536
447,10.534
448,4.2904
449,-0.031772
450,-0.12782000000000002
451,-0.12782000000000002
452,-0.12782000000000002
453,-0.12782000000000002
454,-0.12782000000000002
455,-0.12782000000000002
456,-0.12782000000000002
457,-0.12782000000000002
458,-0.12782000000000002
459,-0.12782000000000002
460,-0.12782000000000002
461,-0.12782000000000002
462,-0.12782000000000002
463,-0.12782000000000002
464,-0.12782000000000002
465,-0.12782000000000002
466,-0.12782000000000002
467,-0.12782000000000002
468,-0.12782000000000002
469,-0.12782000000000002
470,-0.12782000000000002
471,-0.12782000000000002
472,-0.12782000000000002
473,-0.12782000000000002
474,-0.12782000000000002
475,-0.12782000000000002
476,-0.12782000000000002
477,-0.12782000000000002
478,-0.12782000000000002
479,-0.12782000000000002
480,-0.12782000000000002
481,-0.12782000000000002
482,-0.12782000000000002
483,-0.12782000000000002
484,-0.12782000000000002
485,-0.12782000000000002
486,-0.12782000000000002
487,-0.12782000000000002
488,-0.12782000000000002
489,-0.12782000000000002
490,-0.12782000000000002
491,-0.12782000000000002
492,-0.12782000000000002
493,-0.12782000000000002
494,-0.12782000000000002
495,-0.12782000000000002
496,-0.12782000000000002
497,-0.12782000000000002
498,-0.12782000000000002
499,-0.12782000000000002
500,-0.12782000000000002
501,-0.12782000000000002
502,-0.12782000000000002
503,-0.12782000000000002
504,-0.12782000000000002
505,-0.12782000000000002
506,-0.12782000000000002
507,-0.12782000000000002
508,-0.12782000000000002
509,-0.12782000000000002
510,-0.12782000000000002
511,-0.12782000000000002
512,-0.12782000000000002
513,-0.12782000000000002
514,-0.12782000000000002
515,-0.12782000000000002
516,-0.12782000000000002
517,-0.12782000000000002
518,-0.12782000000000002
519,-0.12782000000000002
520,-0.12782000000000002
521,-0.12782000000000002
522,-0.12782000000000002
523,-0.12782000000000002
524,-0.12782000000000002
525,-0.12782000000000002
526,-0.12782000000000002
527,-0.12782000000000002
528,-0.12782000000000002
529,-0.12782000000000002
530,-0.12782000000000002
531,-0.12782000000000002
532,-0.12782000000000002
533,-0.12782000000000002
534,-0.12782000000000002
535,-0.12782000000000002
536,-0.12782000000000002
537,-0.12782000000000002
538,-0.12782000000000002
539,-0.12782000000000002
540,-0.12782000000000002
541,-0.12782000000000002
542,-0.12782000000000002
543,-0.12782000000000002
544,-0.12782000000000002
545,-0.12782000000000002
546,-0.12782000000000002
547,-0.12782000000000002
548,-0.12782000000000002
549,-0.12782000000000002
550,-0.12782000000000002
551,-0.12782000000000002
552,-0.12782000000000002
553,-0.12782000000000002
554,-0.12782000000000002
555,-0.12782000000000002
556,-0.12782000000000002
557,-0.12782000000000002
558,-0.12782000000000002
559,-0.12782000000000002
560,-0.12782000000000002
561,-0.12782000000000002
562,-0.12782000000000002
563,-0.12782000000000002
564,-0.12782000000000002
565,-0.12782000000000002
566,-0.12782000000000002
567,-0.12782000000000002
568,-0.12782000000000002
569,-0.12782000000000002
570,-0.12782000000000002
571,-0.12782000000000002
572,-0.12782000000000002
573,-0.12782000000000002
574,-0.12782000000000002
575,-0.12782000000000002
576,-0.12782000000000002
577,-0.12782000000000002
578,-0.12782000000000002
579,-0.12782000000000002
580,-0.12782000000000002
581,-0.12782000000000002
582,-0.12782000000000002
583,-0.12782000000000002
584,-0.12782000000000002
585,-0.12782000000000002
586,-0.12782000000000002
587,-0.12782000000000002
588,-0.12782000000000002
589,-0.12782000000000002
590,-0.12782000000000002
591,-0.12782000000000002
592,-0.12782000000000002
593,-0.12782000000000002
594,-0.12782000000000002
595,-0.12782000000000002
596,-0.12782000000000002
597,-0.12782000000000002
598,-0.12782000000000002
599,8.0684
600,8.5806
601,0.32041
602,-0.12782000000000002
603,-0.12782000000000002
604,-0.12782000000000002
605,-0.12782000000000002
606,-0.12782000000000002
607,-0.12782000000000002
608,-0.12782000000000002
609,-0.12782000000000002
610,-0.12782000000000002
611,-0.12782000000000002
612,-0.12782000000000002
613,-0.12782000000000002
614,-0.12782000000000002
615,-0.12782000000000002
616,-0.12782000000000002
617,-0.12782000000000002
618,-0.12782000000000002
619,-0.12782000000000002
620,-0.12782000000000002
621,-0.12782000000000002
622,-0.12782000000000002
623,-0.12782000000000002
624,-0.12782000000000002
625,-0.12782000000000002
626,-0.12782000000000002
627,-0.12782000000000002
628,-0.12782000000000002
629,-0.12782000000000002
630,-0.12782000000000002
631,-0.12782000000000002
632,-0.12782000000000002
633,-0.12782000000000002
634,-0.12782000000000002
635,-0.12782000000000002
636,-0.12782000000000002
637,-0.12782000000000002
638,-0.12782000000000002
639,-0.12782000000000002
640,-0.12782000000000002
641,-0.12782000000000002
642,-0.12782000000000002
643,-0.12782000000000002
644,-0.12782000000000002
645,-0.12782000000000002
646,-0.12782000000000002
647,-0.12782000000000002
648,-0.12782000000000002
649,-0.12782000000000002
650,-0.12782000000000002
651,-0.12782000000000002
652,-0.12782000000000002
653,-0.12782000000000002
654,-0.12782000000000002
655,-0.12782000000000002
656,-0.12782000000000002
657,-0.12782000000000002
658,-0.12782000000000002
659,-0.12782000000000002
660,-0.12782000000000002
661,9.9573
662,4.6746
663,-0.063788
664,-0.12782000000000002
665,-0.12782000000000002
666,-0.12782000000000002
667,-0.12782000000000002
668,-0.12782000000000002
669,-0.12782000000000002
670,-0.12782000000000002
671,-0.12782000000000002
672,-0.12782000000000002
673,-0.12782000000000002
674,-0.12782000000000002
675,-0.12782000000000002
676,-0.12782000000000002
677,-0.12782000000000002
678,-0.12782000000000002
679,-0.12782000000000002
680,-0.12782000000000002
681,-0.12782000000000002
682,-0.12782000000000002
683,-0.12782000000000002
684,-0.12782000000000002
685,-0.12782000000000002
686,-0.12782000000000002
687,-0.12782000000000002
688,-0.12782000000000002
689,-0.12782000000000002
690,-0.12782000000000002
691,-0.12782000000000002
692,-0.12782000000000002
693,-0.12782000000000002
694,-0.12782000000000002
695,-0.12782000000000002
696,-0.12782000000000002
697,-0.12782000000000002
698,-0.12782000000000002
699,-0.12782000000000002
700,-0.12782000000000002
701,-0.12782000000000002
702,-0.12782000000000002
703,-0.12782000000000002
704,-0.12782000000000002
705,-0.12782000000000002
706,-0.12782000000000002
707,-0.12782000000000002
708,-0.12782000000000002
709,-0.12782000000000002
710,-0.12782000000000002
711,-0.12782000000000002
712,-0.12782000000000002
713,-0.12782000000000002
714,-0.12782000000000002
715,-0.12782000000000002
716,-0.12782000000000002
717,-0.12782000000000002
718,-0.12782000000000002
719,-0.12782000000000002
