time,value
0,-1.4274
1,-1.4067
2,-1.2708
3,-1.0264
4,-0.69479
5,-0.31156999999999996
6,0.091891
7,0.48551000000000005
8,0.85862
9,1.194
10,1.485
11,1.7168
12,1.8587
13,1.8803
14,1.7599
15,1.4833
16,1.0517
17,0.50292
18,-0.10809
19,-0.70121
20,-1.203
21,-1.5706
22,-1.7811
23,-1.8441
24,-1.7989
25,-1.6846
26,-1.5229
27,-1.3218
28,-1.0694
29,-0.74433
30,-0.34645
31,0.13217
32,0.65059
33,1.1615
34,1.6138
35,1.9557
36,2.1598
37,2.2095
38,2.1104
39,1.8756
40,1.5185
41,1.0647
42,0.53777
43,-0.031439
44,-0.61136
45,-1.1604
46,-1.6325
47,-1.9997
48,-2.2275
49,-2.3066
50,-2.2476
51,-2.0557
52,-1.7478
53,-1.3256
54,-0.80505
55,-0.19312
56,0.47426
57,1.1325
58,1.7226
59,2.1589
60,2.3882
61,2.3907
62,2.1773
63,1.7998
64,1.3181
65,0.8182699999999999
66,0.34144
67,-0.090272
68,-0.48063999999999996
69,-0.84478
70,-1.1911
71,-1.5177
72,-1.7897
73,-1.954
74,-1.9695
75,-1.8093
76,-1.4724
77,-0.9968
78,-0.44218999999999997
79,0.11699000000000001
80,0.63034
81,1.0473
82,1.3538
83,1.5605
84,1.6668
85,1.6877
86,1.6195
87,1.4581
88,1.1936
89,0.8214100000000001
90,0.36186
91,-0.15035
92,-0.66908
93,-1.1342
94,-1.5039
95,-1.7375
96,-1.8183
97,-1.7421
98,-1.5336
99,-1.2141
100,-0.80478
101,-0.33149
102,0.16746
103,0.6593100000000001
104,1.104
105,1.4525
106,1.6687
107,1.7206
108,1.5959
109,1.2973
110,0.85655
111,0.32787
112,-0.21226
113,-0.6872
114,-1.0277
115,-1.1936
116,-1.1732
117,-0.9771799999999999
118,-0.6582399999999999
119,-0.271
120,0.11024
121,0.43656999999999996
122,0.6647
123,0.77464
124,0.77288
125,0.67051
126,0.4742
127,0.19333
128,-0.14631
129,-0.527
130,-0.91089
131,-1.2281
132,-1.4274
133,-1.4633
134,-1.31
135,-0.97536
136,-0.5046
137,0.028872000000000002
138,0.55999
139,1.0231
140,1.3786
141,1.6191
142,1.7416
143,1.7561
144,1.6676
145,1.4688
146,1.159
147,0.72915
148,0.19958
149,-0.39916999999999997
150,-1.0147
151,-1.5681
152,-1.9987
153,-2.2499
154,-2.3047
155,-2.1598
156,-1.844
157,-1.4
158,-0.85785
159,-0.26036
160,0.35848
161,0.95821
162,1.4966
163,1.9358
164,2.2287
165,2.3544
166,2.2905
167,2.0404
168,1.6303
169,1.0981
170,0.48821000000000003
171,-0.15980999999999998
172,-0.79328
173,-1.3686
174,-1.8512
175,-2.1932
176,-2.3699
177,-2.3542
178,-2.1427
179,-1.7528
180,-1.216
181,-0.5969
182,0.059988
183,0.69125
184,1.2476
185,1.6966
186,2.0033
187,2.1573
188,2.142
189,1.9618
190,1.6333
191,1.1685
192,0.61642
193,0.02683
194,-0.54233
195,-1.0284
196,-1.3912
197,-1.604
198,-1.6745
199,-1.5963
200,-1.4078
201,-1.1318
202,-0.80187
203,-0.45115
204,-0.10171000000000001
205,0.21325
206,0.48586999999999997
207,0.69693
208,0.84047
209,0.92958
210,0.96199
211,0.95396
212,0.9032600000000001
213,0.8047300000000001
214,0.6524399999999999
215,0.4431
216,0.19605
217,-0.071509
218,-0.31878
219,-0.50876
220,-0.62647
221,-0.6574
222,-0.63349
223,-0.56766
224,-0.5015
225,-0.46253
226,-0.44432
227,-0.43201999999999996
228,-0.39164
229,-0.30717
230,-0.16128
231,0.042421
232,0.26456
233,0.4646
234,0.61344
235,0.69228
236,0.70599
237,0.68409
238,0.65251
239,0.61816
240,0.58036
241,0.52258
242,0.41343
243,0.23776
244,-0.0019088
245,-0.2957
246,-0.59631
247,-0.85582
248,-1.0381
249,-1.1144
250,-1.0822
251,-0.9548
252,-0.76856
253,-0.55362
254,-0.32978
255,-0.11108
256,0.10608
257,0.30929
258,0.50468
259,0.68403
260,0.8319
261,0.94278
262,1.002
263,1.0154
264,0.9780700000000001
265,0.88334
266,0.74107
267,0.54308
268,0.30291999999999997
269,0.014778999999999999
270,-0.28945
271,-0.5917899999999999
272,-0.85805
273,-1.056
274,-1.173
275,-1.1939
276,-1.1405
277,-1.0231
278,-0.86331
279,-0.6723100000000001
280,-0.45097
281,-0.19380999999999998
282,0.10835
283,0.4403
284,0.7885800000000001
285,1.1057
286,1.3479
287,1.4773
288,1.4644
289,1.3166
290,1.0554
291,0.7136399999999999
292,0.34021999999999997
293,-0.032472
294,-0.3824
295,-0.7025399999999999
296,-0.98383
297,-1.2247
298,-1.4009
299,-1.4752
300,-1.422
301,-1.2099
302,-0.84944
303,-0.38115
304,0.13621
305,0.6236
306,1.0213
307,1.2642
308,1.3454
309,1.2703
310,1.0748
311,0.8112199999999999
312,0.51371
313,0.22741999999999998
314,-0.036989999999999995
315,-0.26438
316,-0.45603
317,-0.61445
318,-0.7117100000000001
319,-0.74607
320,-0.70512
321,-0.5954699999999999
322,-0.42781
323,-0.23256
324,-0.054123000000000004
325,0.08817
326,0.17472000000000001
327,0.20576999999999998
328,0.20575
329,0.19752999999999998
330,0.20271
331,0.22655999999999998
332,0.26137
333,0.29138000000000003
334,0.30106
335,0.27310999999999996
336,0.21111999999999997
337,0.13248
338,0.046421
339,-0.017499
340,-0.048093000000000004
341,-0.048327999999999996
342,-0.035082
343,-0.023421
344,-0.029419
345,-0.069453
346,-0.12667
347,-0.19122
348,-0.24305
349,-0.26436
350,-0.23943000000000003
351,-0.18132
352,-0.097699
353,-0.008937700000000002
354,0.065103
355,0.11588
356,0.12866
357,0.10687999999999999
358,0.06514500000000001
359,0.020047
360,-0.015088999999999998
361,-0.02855
362,-0.015878
363,0.022344
364,0.083737
365,0.15047
366,0.21668
367,0.2628
368,0.28396
369,0.26761999999999997
370,0.22264
371,0.13932999999999998
372,0.034824
373,-0.075494
374,-0.18842
375,-0.28836
376,-0.36086999999999997
377,-0.39855999999999997
378,-0.38832
379,-0.33311999999999997
380,-0.22876999999999997
381,-0.09725
382,0.055175999999999996
383,0.19893
384,0.31408
385,0.38393
386,0.40292
387,0.37703000000000003
388,0.30307
389,0.20165
390,0.081475
391,-0.048887
392,-0.17339000000000002
393,-0.28053
394,-0.36214
395,-0.42286
396,-0.44175
397,-0.41336000000000006
398,-0.32913000000000003
399,-0.18554
400,0.0034582000000000002
401,0.23126999999999998
402,0.45255
403,0.64064
404,0.75897
405,0.7904899999999999
406,0.72728
407,0.57535
408,0.35739
409,0.09134
410,-0.1812
411,-0.44468
412,-0.65851
413,-0.79948
414,-0.867
415,-0.84129
416,-0.7388100000000001
417,-0.5662
418,-0.34331
419,-0.10608
420,0.11527000000000001
421,0.29803
422,0.43246
423,0.5079100000000001
424,0.54022
425,0.5389
426,0.5069
427,0.45842
428,0.38497
429,0.28075
430,0.14017000000000002
431,-0.025055
432,-0.19623
433,-0.34695
434,-0.44773999999999997
435,-0.46943
436,-0.3985
437,-0.2463
438,-0.043474
439,0.17556
440,0.35525999999999996
441,0.46126000000000006
442,0.47808
443,0.41056000000000004
444,0.27734000000000003
445,0.10717
446,-0.060717999999999994
447,-0.21343
448,-0.33428
449,-0.4285
450,-0.49268999999999996
451,-0.53692
452,-0.5573899999999999
453,-0.53871
454,-0.4662
455,-0.32237
456,-0.11319000000000001
457,0.14415
458,0.42238000000000003
459,0.6847
460,0.8845700000000001
461,0.9958
462,1.0058
463,0.91155
464,0.7289
465,0.48258999999999996
466,0.20004
467,-0.096289
468,-0.38116
469,-0.64845
470,-0.8741399999999999
471,-1.0477
472,-1.1420000000000001
473,-1.1471
474,-1.0522
475,-0.85582
476,-0.56445
477,-0.21174
478,0.16492
479,0.5265
480,0.82889
481,1.0417
482,1.1571
483,1.1628
484,1.0839
485,0.93679
486,0.74674
487,0.53189
488,0.30625
489,0.088937
490,-0.12519
491,-0.32624000000000003
492,-0.50243
493,-0.64098
494,-0.7408
495,-0.80069
496,-0.81411
497,-0.7902399999999999
498,-0.7368
499,-0.65684
