time,value
0,-2.6625
1,-2.9794
2,-3.0837
3,-2.9738
4,-2.6796
5,-2.2477
6,-1.7247
7,-1.1582
8,-0.57904
9,-0.02026
10,0.49267
11,0.93606
12,1.3023
13,1.5773
14,1.7477
15,1.8253
16,1.8441
17,1.8137
18,1.7383
19,1.6202
20,1.4452
21,1.1965
22,0.8779899999999999
23,0.50474
24,0.10497000000000001
25,-0.27338
26,-0.59155
27,-0.82699
28,-0.98183
29,-1.0613
30,-1.0899
31,-1.084
32,-1.0544
33,-0.9946299999999999
34,-0.8944200000000001
35,-0.7467600000000001
36,-0.55755
37,-0.34357
38,-0.12546
39,0.065308
40,0.21397
41,0.31224
42,0.38416
43,0.43728999999999996
44,0.47698
45,0.50766
46,0.50646
47,0.44061999999999996
48,0.30701999999999996
49,0.086313
50,-0.20669
51,-0.51272
52,-0.7689
53,-0.9086299999999999
54,-0.88034
55,-0.66914
56,-0.31055
57,0.14127
58,0.61731
59,1.057
60,1.4182
61,1.6616
62,1.7716
63,1.7372
64,1.5424
65,1.2044
66,0.73498
67,0.16767
68,-0.44311000000000006
69,-1.0378
70,-1.5348
71,-1.895
72,-2.0822
73,-2.1028
74,-1.9747
75,-1.7409999999999999
76,-1.4438
77,-1.1091
78,-0.74731
79,-0.36329
80,0.028836
81,0.41436000000000006
82,0.76915
83,1.0686
84,1.2919999999999998
85,1.4448
86,1.5321
87,1.5789
88,1.6145
89,1.6523
90,1.6783
91,1.6526
92,1.5278
93,1.2636
94,0.84036
95,0.27867
96,-0.36148
97,-1.0090000000000001
98,-1.5883
99,-2.0355
100,-2.3201
101,-2.4264
102,-2.3811
103,-2.1966
104,-1.8985
105,-1.5079
106,-1.0483
107,-0.53977
108,-0.018568
109,0.47021999999999997
110,0.8786700000000001
111,1.1709
112,1.3437
113,1.412
114,1.4188
115,1.4179
116,1.4426
117,1.4979
118,1.5679
119,1.6056
120,1.5477
121,1.3501
122,1.0033
123,0.521
124,-0.047774000000000004
125,-0.6247199999999999
126,-1.1404
127,-1.5351
128,-1.7879
129,-1.8971
130,-1.8869999999999998
131,-1.7826
132,-1.6113
133,-1.3769
134,-1.0895
135,-0.76094
136,-0.3994
137,-0.037358999999999996
138,0.3057
139,0.59842
140,0.8355899999999999
141,1.0062
142,1.1368
143,1.2321
144,1.3102
145,1.3585
146,1.3504
147,1.2531
148,1.0457
149,0.71124
150,0.29186999999999996
151,-0.16068
152,-0.57224
153,-0.88775
154,-1.0626
155,-1.0759999999999998
156,-0.95019
157,-0.71954
158,-0.45911
159,-0.21334
160,-0.033769
161,0.053585
162,0.04401
163,-0.038801999999999996
164,-0.17121
165,-0.31364000000000003
166,-0.43714
167,-0.50217
168,-0.47705
169,-0.34678000000000003
170,-0.091781
171,0.26083
172,0.67574
173,1.0749
174,1.3943
175,1.5492
176,1.4873
177,1.1979
178,0.71144
179,0.10934
180,-0.52759
181,-1.0823
182,-1.4741
183,-1.6480000000000001
184,-1.6029
185,-1.3664
186,-1.0038
187,-0.56539
188,-0.10109
189,0.34141
190,0.72663
191,1.0319
192,1.2344
193,1.3079
194,1.2321
195,1.0065
196,0.65694
197,0.22764
198,-0.18865
199,-0.50558
200,-0.6594300000000001
201,-0.6116
202,-0.39554
203,-0.074814
204,0.22471999999999998
205,0.41086999999999996
206,0.42015
207,0.24925
208,-0.053782
209,-0.39511999999999997
210,-0.67812
211,-0.83326
212,-0.8237700000000001
213,-0.67799
214,-0.46234
215,-0.24286999999999997
216,-0.063858
217,0.047574
218,0.11095999999999999
219,0.17139000000000001
220,0.26113000000000003
221,0.38335
222,0.52261
223,0.64035
224,0.70104
225,0.67162
226,0.54715
227,0.35691999999999996
228,0.15361
229,-0.010343999999999999
230,-0.095737
231,-0.091932
232,-0.025342
233,0.059177999999999994
234,0.11865999999999999
235,0.11710999999999999
236,0.045029
237,-0.067982
238,-0.19343
239,-0.30673
240,-0.37913
241,-0.41918999999999995
242,-0.42871000000000004
243,-0.44706999999999997
244,-0.47035
245,-0.50674
246,-0.5334899999999999
247,-0.52603
248,-0.45821999999999996
249,-0.32003000000000004
250,-0.12312999999999999
251,0.10592
252,0.33510999999999996
253,0.53866
254,0.7077
255,0.84885
256,0.96536
257,1.0678
258,1.1428
259,1.1804
260,1.1429
261,1.0009
262,0.7418600000000001
263,0.385
264,-0.029407
265,-0.43128
266,-0.75483
267,-0.94401
268,-0.99429
269,-0.924
270,-0.79891
271,-0.70231
272,-0.6853199999999999
273,-0.78215
274,-0.97646
275,-1.2248
276,-1.4409999999999998
277,-1.5437
278,-1.4713
279,-1.1919
280,-0.72085
281,-0.085872
282,0.63674
283,1.3765
284,2.0369
285,2.5536
286,2.8567
287,2.9119
288,2.6886
289,2.2142
290,1.5447
291,0.7615
292,-0.02459
293,-0.72317
294,-1.2476
295,-1.5611
296,-1.6701
297,-1.6103
298,-1.4277
299,-1.1909999999999998
300,-0.9347200000000001
301,-0.6831
302,-0.44773999999999997
303,-0.23889000000000002
304,-0.070452
305,0.053982
306,0.097376
307,0.053502999999999995
308,-0.08194
309,-0.25971
310,-0.41961000000000004
311,-0.50156
312,-0.44601
313,-0.24578000000000003
314,0.078391
315,0.45683999999999997
316,0.8045800000000001
317,1.0449
318,1.1449
319,1.0937
320,0.9291
321,0.70753
322,0.48936
323,0.31418
324,0.18686
325,0.084859
326,-0.021308
327,-0.15395
328,-0.32337
329,-0.5120600000000001
330,-0.67882
331,-0.7933100000000001
332,-0.82547
333,-0.76058
334,-0.61045
335,-0.41428000000000004
336,-0.2073
337,-0.015552000000000002
338,0.13057
339,0.23365999999999998
340,0.29949000000000003
341,0.34667
342,0.40173000000000003
343,0.46606000000000003
344,0.54401
345,0.61297
346,0.6470199999999999
347,0.62883
348,0.5656100000000001
349,0.44683999999999996
350,0.29815
351,0.14852
352,0.015957
353,-0.090544
354,-0.18068
355,-0.26829000000000003
356,-0.37949
357,-0.5183399999999999
358,-0.67701
359,-0.826
360,-0.9303600000000001
361,-0.95536
362,-0.8913700000000001
363,-0.73527
364,-0.50302
365,-0.21813000000000002
366,0.076949
367,0.36022
368,0.60206
369,0.80088
370,0.9323299999999999
371,0.99431
372,0.98464
373,0.8943700000000001
374,0.72485
375,0.48991999999999997
376,0.22699999999999998
377,-0.027295999999999997
378,-0.24243
379,-0.39371999999999996
380,-0.46663000000000004
381,-0.47939
382,-0.47068999999999994
383,-0.46626000000000006
384,-0.48893000000000003
385,-0.51964
386,-0.5434100000000001
387,-0.5048199999999999
388,-0.36921
389,-0.1096
390,0.24645999999999998
391,0.64607
392,1.0197
393,1.2655
394,1.3235
395,1.1627
396,0.80718
397,0.32109
398,-0.20897
399,-0.69076
400,-1.0458
401,-1.237
402,-1.2559
403,-1.1301
404,-0.90276
405,-0.6198
406,-0.32948
407,-0.062004
408,0.15192999999999998
409,0.31222
410,0.38944
411,0.39387
412,0.34134000000000003
413,0.25158
414,0.15306
415,0.077129
416,0.058271
417,0.11068
418,0.22695
419,0.39109
420,0.58219
421,0.74374
422,0.8407399999999999
423,0.8474700000000001
424,0.741
425,0.52249
426,0.21183000000000002
427,-0.15874000000000002
428,-0.54381
429,-0.88392
430,-1.1425
431,-1.2743
432,-1.2545
433,-1.0761
434,-0.7583
435,-0.34151
436,0.1169
437,0.55273
438,0.8985700000000001
439,1.1074
440,1.1486
441,1.0379
442,0.79747
443,0.47507
444,0.13009
445,-0.19024000000000002
446,-0.44555
447,-0.61805
448,-0.70891
449,-0.74933
450,-0.74966
451,-0.7217899999999999
452,-0.67684
453,-0.60497
454,-0.49588999999999994
455,-0.33702
456,-0.12368
457,0.14032
458,0.4371
459,0.75052
460,1.0359
461,1.2609
462,1.3905
463,1.4114
464,1.3044
465,1.0698
466,0.72364
467,0.30553
468,-0.13865
469,-0.56257
470,-0.9201299999999999
471,-1.177
472,-1.3186
473,-1.3474
474,-1.2862
475,-1.1665
476,-1.0137
477,-0.8537100000000001
478,-0.70699
479,-0.5624899999999999
480,-0.40719
481,-0.22780999999999998
482,-0.0051523
483,0.26766999999999996
484,0.5825
485,0.9149299999999999
486,1.2251
487,1.4787
488,1.6392
489,1.6783
490,1.5895
491,1.385
492,1.0881
493,0.73298
494,0.35754
495,-0.014966
496,-0.37939
497,-0.7356
498,-1.0733
499,-1.3819
