time,value
0,1.8569
1,1.7217
2,1.5634
3,1.4474
4,1.3302
5,1.1302
6,1.1104
7,1.0349
8,0.9396200000000001
9,0.8901899999999999
10,0.9620299999999999
11,0.8448
12,0.68406
13,0.5181399999999999
14,0.52688
15,0.45346000000000003
16,0.27416
17,0.12611
18,0.01253
19,0.037418
20,-0.055213
21,-0.18473
22,-0.31614000000000003
23,-0.28184000000000003
24,-0.40314
25,-0.36772
26,-0.28238
27,-0.35618
28,-0.47945
29,-0.48622
30,-0.61433
31,-0.80474
32,-0.8023600000000001
33,-0.68487
34,-0.6857
35,-0.8406100000000001
36,-0.9928299999999999
37,-1.1535
38,-1.3339
39,-1.3068
40,-1.2373
41,-1.3409
42,-1.46
43,-1.5806
44,-1.6334
45,-1.6309
46,-1.6427
47,-1.7266
48,-1.7188
49,-1.4785
50,-1.2766
51,-1.072
52,-0.8301299999999999
53,-0.621
54,-0.3763
55,-0.16768
56,0.043861000000000004
57,0.28717
58,0.49621000000000004
59,0.7053
60,0.94873
61,1.1616
62,1.3709
63,1.6106
64,1.8128
65,1.9689
66,1.8251
67,1.6212
68,1.3821
69,1.1778
70,0.96926
71,0.72644
72,0.5181399999999999
73,0.30998000000000003
74,0.06755
75,-0.14026
76,-0.38285
77,-0.58959
78,-0.7931
79,-1.0262
80,-1.2238
81,-1.4174
82,-1.6393
83,-1.6131
84,-1.5339
85,-1.4199
86,-1.3339
87,-1.2095
88,-1.0679
89,-0.9631
90,-0.8573
91,-0.75783
92,-0.64051
93,-0.48796000000000006
94,-0.55612
95,-0.51071
96,-0.38566
97,-0.30515
98,-0.17611
99,-0.13557
100,-0.04843
101,0.055889
102,0.032123
103,-0.12030999999999999
104,-0.0080086
105,0.10296
106,0.1608
107,0.18755
108,0.26966
109,0.23063000000000003
110,0.1584
111,0.22357
112,0.39676
113,0.43996
114,0.5612199999999999
115,0.66214
116,0.67396
117,0.77733
118,0.80452
119,0.79525
120,0.9588700000000001
121,1.1104
122,1.0291
123,1.1941
124,1.3748
125,1.4576
126,1.6212
127,1.8227
