time,value
0,0.11331
1,0.11331
2,0.11331
3,0.11331
4,0.11331
5,0.11331
6,0.11331
7,0.11331
8,0.11331
9,0.11331
10,0.11331
11,0.11331
12,0.11331
13,0.11331
14,0.11331
15,0.11331
16,0.11331
17,0.14615999999999998
18,0.19558
19,0.203
20,0.203
21,0.203
22,0.203
23,0.203
24,0.223
25,0.27241
26,0.29269
27,0.29269
28,0.29269
29,0.29269
30,0.24528000000000003
31,0.19585999999999998
32,0.14645
33,0.11331
34,0.11331
35,0.11331
36,0.11331
37,0.14787
38,0.19729000000000002
39,0.203
40,0.203
41,0.203
42,0.21556999999999998
43,0.26499
44,0.33610999999999996
45,0.43493999999999994
46,0.56462
47,0.71287
48,0.78113
49,0.83055
50,0.8799600000000001
51,0.94709
52,1.0953
53,1.2256
54,1.3244
55,1.4504
56,1.5986
57,1.7469
58,1.8951
59,1.9071
60,1.902
61,1.8526
62,1.8031
63,1.7537
64,1.7512
65,1.8006
66,1.9151
67,2.0634
68,2.1282
69,2.1762
70,2.1762
71,2.1762
72,2.1762
73,2.1565
74,2.1071
75,2.0288
76,1.93
77,1.8311
78,1.7323
79,1.5863
80,1.4381
81,1.2899
82,1.1416
83,0.99336
84,0.8451200000000001
85,0.69687
86,0.5829
87,0.48407
88,0.34181999999999996
89,0.19672
90,0.097888
91,-0.00094215
92,-0.099773
93,-0.1986
94,-0.29743
95,-0.42683000000000004
96,-0.57507
97,-0.68362
98,-0.78245
99,-0.88128
100,-0.98011
101,-1.0789
102,-1.1778
103,-1.2766
104,-1.3754
105,-1.4743
106,-1.5011
107,-1.5011
108,-1.5462
109,-1.6005
110,-1.6993
111,-1.7842
112,-1.8336
113,-1.8599
114,-1.8599
115,-1.8599
116,-1.8599
117,-1.8599
118,-1.8599
119,-1.8599
120,-1.8496
121,-1.8002
122,-1.7508
123,-1.7013
124,-1.6805
125,-1.6805
126,-1.6428
127,-1.5934
128,-1.4971
129,-1.4114
130,-1.4114
131,-1.4114
132,-1.4114
133,-1.4114
134,-1.4114
135,-1.4114
136,-1.4114
137,-1.3683
138,-1.3159999999999998
139,-1.2172
140,-1.1304
141,-1.0809
142,-1.0527
143,-1.0527
144,-1.0224
145,-0.9729700000000001
146,-0.9629700000000001
147,-0.9629700000000001
148,-0.9629700000000001
149,-0.9629700000000001
150,-0.9629700000000001
151,-0.9281200000000001
152,-0.82929
153,-0.75702
154,-0.7076100000000001
155,-0.6581899999999999
156,-0.60878
157,-0.5593600000000001
158,-0.50995
159,-0.46053
160,-0.39741
161,-0.29858
162,-0.2226
163,-0.17318
164,-0.18775
165,-0.23715999999999998
166,-0.28658
167,-0.33599
168,-0.38541
169,-0.41483000000000003
170,-0.36541999999999997
171,-0.316
172,-0.26658000000000004
173,-0.27373000000000003
174,-0.32314
175,-0.37256
176,-0.42196999999999996
177,-0.47139
178,-0.51452
179,-0.51452
180,-0.52994
181,-0.57936
182,-0.6287699999999999
183,-0.67819
184,-0.7276
185,-0.7770199999999999
186,-0.78359
187,-0.78359
188,-0.78359
189,-0.78359
190,-0.78359
191,-0.76274
192,-0.71332
193,-0.66391
194,-0.61449
195,-0.56508
196,-0.51566
197,-0.41797
198,-0.32714
199,-0.27771999999999997
200,-0.22830999999999999
201,-0.17889000000000002
202,-0.1032
203,-0.0043698
204,0.094461
205,0.19329000000000002
206,0.33668000000000003
207,0.48493
208,0.63317
209,0.76799
210,0.86682
211,0.8979600000000001
212,0.84854
213,0.83083
214,0.83083
215,0.8716799999999999
216,0.9205200000000001
217,0.9205200000000001
218,0.93024
219,0.97965
220,1.0291
221,1.0785
222,1.0999
223,1.0999
224,1.0628
225,1.0134
226,0.96394
227,0.9205200000000001
228,0.9205200000000001
229,0.9508
230,1.0496
231,1.1242
232,1.1736
233,1.2229999999999999
234,1.2724
235,1.2793
236,1.2770000000000001
237,1.2276
238,1.2009999999999998
239,1.2504
240,1.2793
241,1.2793
242,1.2496
243,1.2002
244,1.1896
245,1.1896
246,1.1416
247,1.0999
248,1.0999
249,1.0999
250,1.0999
251,1.0739
252,1.0245
253,0.97508
254,0.92566
255,0.87625
256,0.82284
257,0.72401
258,0.63831
259,0.5889
260,0.5394800000000001
261,0.49007
262,0.47207
263,0.47207
264,0.43151000000000006
265,0.3821
266,0.33268000000000003
267,0.27384000000000003
268,0.17501
269,0.094746
270,0.045331
271,-0.031791
272,-0.13062
273,-0.1926
274,-0.24201999999999999
275,-0.29144000000000003
276,-0.34085
277,-0.39027
278,-0.42483000000000004
279,-0.42483000000000004
280,-0.44882
281,-0.49823999999999996
282,-0.54765
283,-0.59707
284,-0.64648
285,-0.6939
286,-0.6939
287,-0.70504
288,-0.75445
289,-0.78359
290,-0.78359
291,-0.78359
292,-0.78359
293,-0.74503
294,-0.6956100000000001
295,-0.6462
296,-0.61163
297,-0.66105
298,-0.7104600000000001
299,-0.75988
300,-0.78359
301,-0.78359
302,-0.81844
303,-0.86785
304,-0.82929
305,-0.78359
306,-0.78359
307,-0.77073
308,-0.72132
309,-0.6939
310,-0.6939
311,-0.66276
312,-0.61335
313,-0.56393
314,-0.51452
