time,value
0,-0.80192
1,-0.7155600000000001
2,-0.48765
3,-0.20057
4,0.084579
5,0.33027
6,0.65066
7,0.94585
8,1.2736
9,1.3942
10,1.3576
11,1.3681
12,1.4558
13,1.5654
14,1.5147
15,1.328
16,1.0756
17,0.81076
18,0.49531000000000003
19,0.22744
20,-0.11849000000000001
21,-0.42651999999999995
22,-0.64255
23,-0.78918
24,-0.7208600000000001
25,-0.51798
26,-0.27228
27,0.008174200000000001
28,0.29145
29,0.5906100000000001
30,0.85275
31,1.1574
32,1.2394
33,1.2917
34,1.3454
35,1.3505
36,1.3558
37,1.3699
38,1.4303
39,1.5575
40,1.5264
41,1.4336
42,1.1338
43,0.79561
44,0.48768
45,0.17482999999999999
46,-0.08607200000000001
47,-0.35588000000000003
48,-0.5804699999999999
49,-0.74938
50,-0.21004
51,-0.25688
52,-0.44848000000000005
53,-0.7020000000000001
54,-0.88999
55,-1.1426
56,-1.3938
57,-1.5443
58,-1.5741
59,-1.3868
60,-1.1901
61,-0.97485
62,-0.75562
63,-0.5738800000000001
64,-0.36586
65,-0.36044
66,-0.5219699999999999
67,-0.71034
68,-0.90225
69,-1.1231
70,-1.3030000000000002
71,-1.4097
72,-1.47
73,-1.3968
74,-1.2943
75,-1.1355
76,-0.98455
77,-0.80138
78,-0.59058
79,-0.39214
