time,value
0,-0.65958
1,-0.65958
2,-0.65958
3,-0.65958
4,-0.65958
5,-0.65958
6,-0.65958
7,-0.65958
8,-0.65958
9,-0.65958
10,-0.65958
11,-0.65958
12,-0.65958
13,-0.65958
14,-0.65958
15,-0.65958
16,-0.65958
17,-0.65958
18,-0.65958
19,-0.65958
20,-0.65958
21,-0.65958
22,-0.65958
23,-0.65958
24,-0.65958
25,-0.65958
26,-0.55329
27,-0.42006000000000004
28,-0.26424000000000003
29,-0.08835
30,0.078693
31,0.23676
32,0.38471
33,0.51364
34,0.63722
35,0.75467
36,0.8629
37,0.9613799999999999
38,1.0507
39,1.1289
40,1.1797
41,1.2224
42,1.2579
43,1.2849
44,1.3119999999999998
45,1.339
46,1.3661
47,1.3931
48,1.4202
49,1.4473
50,1.4743
51,1.5014
52,1.5284
53,1.5555
54,1.5826
55,1.6135
56,1.6606
57,1.7280000000000002
58,1.7895
59,1.8462
60,1.892
61,1.9139
62,1.9255
63,1.9242
64,1.9101
65,1.8902
66,1.8653
67,1.8416
68,1.8255
69,1.8063
70,1.7684
71,1.7124
72,1.6452
73,1.5674
74,1.4903
75,1.4203
76,1.3547
77,1.2959
78,1.2378
79,1.1634
80,1.0726
81,0.97319
82,0.86708
83,0.75884
84,0.65061
85,0.54237
86,0.43413
87,0.3259
88,0.21766
89,0.11004000000000001
90,0.009562399999999999
91,-0.068254
92,-0.1359
93,-0.20355
94,-0.2712
95,-0.32045999999999997
96,-0.35255
97,-0.38239
98,-0.42022
99,-0.46081000000000005
100,-0.5014
101,-0.54199
102,-0.58945
103,-0.6411600000000001
104,-0.6893100000000001
105,-0.7206600000000001
106,-0.7477199999999999
107,-0.77478
108,-0.80184
109,-0.8212700000000001
110,-0.83662
111,-0.85334
112,-0.87884
113,-0.89876
114,-0.90948
115,-0.90948
116,-0.92629
117,-0.9506700000000001
118,-0.97435
119,-0.98887
120,-1.0065
121,-1.0287
122,-1.0557
123,-1.0644
124,-1.0681
125,-1.0753
126,-1.1015
127,-1.1332
128,-1.1693
129,-1.2099
130,-1.2304
131,-1.2449
132,-1.2585
133,-1.272
134,-1.2803
135,-1.2843
136,-1.2843
137,-1.2952
138,-1.3066
139,-1.3156
140,-1.3156
141,-1.3156
142,-1.3156
143,-1.3156
144,-1.3273
145,-1.3385
146,-1.3468
147,-1.3468
148,-1.3468
149,-1.3468
150,-1.3468
151,-1.3721
152,-1.3989
153,-1.426
154,-1.4531
155,-1.4731
156,-1.4895
157,-1.5030000000000001
158,-1.4895
159,-1.4703
160,-1.4437
161,-1.4031
162,-1.3625
163,-1.3219
164,-1.2813
165,-1.2408
166,-1.2033
167,-1.1699
168,-1.1429
169,-1.1075
170,-1.0691
171,-1.0285
172,-0.98787
173,-0.9544100000000001
174,-0.9293799999999999
175,-0.91585
176,-0.91128
177,-0.90981
178,-0.91246
179,-0.92599
180,-0.93952
181,-0.95305
182,-0.9665799999999999
183,-0.9607899999999999
184,-0.94931
185,-0.9287799999999999
186,-0.8881899999999999
187,-0.8387600000000001
188,-0.78035
189,-0.7127
190,-0.64505
191,-0.57545
192,-0.49483999999999995
193,-0.3866
194,-0.28324
195,-0.18445
196,-0.092706
197,-0.028439999999999997
198,0.026951999999999997
199,0.070823
200,0.09788200000000001
201,0.12494000000000001
202,0.152
203,0.18217
204,0.22991999999999999
205,0.2804
206,0.32271
207,0.34976999999999997
208,0.37683
209,0.40389
210,0.4331
211,0.4707
212,0.51203
213,0.55928
214,0.6134
215,0.66752
216,0.72164
217,0.7702399999999999
218,0.80287
219,0.82757
220,0.8398200000000001
221,0.8398200000000001
222,0.8398200000000001
223,0.8398200000000001
224,0.8398200000000001
225,0.8398200000000001
226,0.8343299999999999
227,0.80998
228,0.7731100000000001
229,0.75878
230,0.76541
231,0.7910699999999999
232,0.8380200000000001
233,0.9068700000000001
234,1.0227
235,1.1768
236,1.3527
237,1.5503
238,1.7533
239,1.9555
240,2.1322
241,2.2308
242,2.2625
243,2.2261
244,2.1164
245,1.973
246,1.805
247,1.6369
248,1.4914
249,1.3583
250,1.2302
251,1.1078
252,0.9983200000000001
253,0.9001399999999999
254,0.80265
255,0.69717
256,0.59414
257,0.50063
258,0.41901000000000005
259,0.33783
260,0.25721
261,0.17902
262,0.10922
263,0.04773
264,-0.0045853000000000005
265,-0.045174
266,-0.085763
267,-0.12483
268,-0.15905
269,-0.1757
270,-0.18923
271,-0.20275
272,-0.21628000000000003
273,-0.24663000000000002
274,-0.28454
275,-0.32174
276,-0.34979
277,-0.37276
278,-0.39118
279,-0.4047
280,-0.40903
281,-0.40721
282,-0.40004
283,-0.37387
284,-0.34219
285,-0.30601999999999996
286,-0.26543
287,-0.23487
288,-0.20733000000000001
289,-0.18027
290,-0.15320999999999999
291,-0.13651
292,-0.12854000000000002
293,-0.12854000000000002
294,-0.12854000000000002
295,-0.12854000000000002
296,-0.12854000000000002
297,-0.12854000000000002
298,-0.12854000000000002
299,-0.12854000000000002
300,-0.12854000000000002
301,-0.14028
302,-0.15361
303,-0.16714
304,-0.18067
305,-0.1942
306,-0.20773000000000003
307,-0.22125999999999998
308,-0.17167000000000002
309,-0.12532000000000001
310,-0.088947
311,-0.075417
312,-0.054915
313,-0.03065
314,-0.0035905
