time,value
0,-0.082541
1,-0.39626
2,-0.009965
3,-0.14489000000000002
4,-0.75229
5,0.096065
6,0.15422
7,0.41444
8,0.26675
9,0.029825
10,0.6378
11,0.54368
12,0.4587
13,-0.36054
14,-0.3973
15,0.11825999999999999
16,0.20814000000000002
17,0.11352000000000001
18,-0.49076000000000003
19,0.19813
20,0.052330999999999996
21,-0.26955
22,0.60327
23,-0.0067664000000000005
24,0.18732000000000001
25,0.34665
26,0.50468
27,-0.13466
28,-0.15239
29,0.60923
30,-0.53851
31,0.29174
32,0.0077708
33,-0.31976
34,0.081329
35,0.17178
36,0.30441
37,0.54304
38,0.004657199999999999
39,0.047769
40,0.043637
41,0.18638
42,-0.18812
43,-0.5351600000000001
44,-0.20881
45,0.043404000000000005
46,0.15585
47,-0.30704000000000004
48,0.12240999999999999
49,0.032822000000000004
50,-0.5251899999999999
51,0.19163
52,0.072411
53,-0.09252200000000001
54,0.089713
55,0.13525
56,-0.08734199999999999
57,1.3718
58,1.3718
59,1.3718
60,1.3718
61,1.3718
62,1.3718
63,1.3718
64,1.3718
65,1.3718
66,1.3718
67,1.3718
68,1.3718
69,1.3718
70,1.3718
71,1.3718
72,-1.415
73,-1.415
74,-1.415
75,-1.415
76,-1.415
77,-1.415
78,-1.415
79,-1.415
80,-1.415
81,-1.415
82,-1.415
83,-1.415
84,-1.415
85,-1.415
86,-1.415
87,-0.45368
88,1.3718
89,1.3718
90,1.3718
91,1.3718
92,1.3718
93,1.3718
94,1.3718
95,1.3718
96,1.3718
97,1.3718
98,1.3718
99,1.3718
100,1.3718
101,1.3718
102,1.3718
103,1.3718
104,-1.415
105,-1.415
106,-1.415
107,-1.415
108,-1.415
109,-1.415
110,-1.415
111,-1.415
112,-1.415
113,-1.415
114,-1.415
115,-1.415
116,-1.415
117,-1.415
118,-1.415
119,-1.415
120,-0.12858
121,0.037723
122,-0.32182
123,0.31182
124,-0.42177
125,0.24536999999999998
126,0.37761
127,-0.37755
