time,value
0,-0.29131999999999997
1,-0.070278
2,0.21666999999999997
3,0.6210100000000001
4,-0.46406000000000003
5,-0.22787
6,0.023285
7,0.18254
8,-0.75454
9,0.014831
10,-0.1832
11,-0.145
12,-0.00020185
13,0.06744
14,0.34585
15,0.023542
16,0.081387
17,0.3154
18,-0.28968
19,-0.19014
20,-0.18026
21,-0.19641
22,0.38925
23,0.0079984
24,-0.33011999999999997
25,-0.14897
26,0.21395
27,-0.11079000000000001
28,0.026157
29,-0.020541
30,-0.049845
31,0.17712999999999998
32,-0.32619000000000004
33,-0.16305
34,0.13007
35,-0.097302
36,0.091184
37,-0.31483
38,-0.5929
39,0.48033000000000003
40,0.13296
41,-0.019879
42,0.16958
43,0.11787
44,-0.49448000000000003
45,0.037797000000000004
46,-0.28296
47,-0.02554
48,-0.80608
49,-0.10029
50,0.17127
51,-0.57703
52,-0.11562
53,-0.18070999999999998
54,-0.31337
55,-0.32913000000000003
56,-0.23914000000000002
57,0.52818
58,-0.35353
59,-0.39087
60,-0.06780499999999999
61,1.7625
62,1.7625
63,1.7625
64,1.7625
65,1.7625
66,1.7625
67,1.7625
68,1.7625
69,1.7625
70,1.7625
71,1.7625
72,1.7625
73,-1.6763
74,-1.6763
75,-1.6763
76,-1.6763
77,-1.6763
78,-1.6763
79,-1.6763
80,-1.6763
81,-1.6763
82,-1.6763
83,-1.6763
84,-0.68213
85,0.60426
86,0.24411999999999998
87,0.21076
88,0.059583000000000004
89,-0.35523000000000005
90,0.17837
91,0.22024000000000002
92,-0.010331
93,0.5018199999999999
94,-0.15603
95,-0.95675
96,-0.28291
97,0.17842
98,-0.068004
99,-0.081841
100,-0.018129
101,0.091407
102,-0.2366
103,1.7625
104,1.7625
105,1.7625
106,1.7625
107,1.7625
108,1.7625
109,1.7625
110,1.7625
111,1.7625
112,-1.6763
113,-1.6763
114,-1.6763
115,-1.6763
116,-1.6763
117,-1.6763
118,-1.6763
119,-1.6763
120,-0.15186
121,-0.34969
122,-0.020184999999999998
123,0.23938
124,0.41207
125,-0.19946
126,0.21428000000000003
127,0.12977
