time,value
0,0.79809
1,0.6501600000000001
2,0.45293
3,0.25569000000000003
4,0.025588999999999997
5,-0.12234
6,-0.22095
7,-0.40175
8,-0.45106
9,-0.56611
10,-0.68116
11,-0.82909
12,-0.8455299999999999
13,-0.7962199999999999
14,-0.7469100000000001
15,-0.7469100000000001
16,-0.7469100000000001
17,-0.73047
18,-0.66473
19,-0.6482899999999999
20,-0.66473
21,-0.6482899999999999
22,-0.68116
23,-0.6976
24,-0.7469100000000001
25,-0.77978
26,-0.68116
27,-0.58255
28,-0.46748999999999996
29,-0.40175
30,-0.45106
31,-0.45106
32,-0.5168
33,-0.58255
34,-0.61542
35,-0.58255
36,-0.5496800000000001
37,-0.56611
38,-0.5989800000000001
39,-0.61542
40,-0.68116
41,-0.71404
42,-0.73047
43,-0.73047
44,-0.6976
45,-0.68116
46,-0.6976
47,-0.6482899999999999
48,-0.6318600000000001
49,-0.68116
50,-0.68116
51,-0.6318600000000001
52,-0.66473
53,-0.61542
54,-0.5989800000000001
55,-0.6318600000000001
56,-0.58255
57,-0.5332399999999999
58,-0.5332399999999999
59,-0.5496800000000001
60,-0.5168
61,-0.48393
62,-0.45106
63,-0.38531
64,-0.40175
65,-0.41818999999999995
66,-0.35244000000000003
67,-0.30313
68,-0.23739000000000002
69,-0.20452
70,-0.27026
71,-0.2867
72,-0.33601
73,-0.40175
74,-0.50037
75,-0.66473
76,-0.8948299999999999
77,-0.76334
78,-0.82909
79,-0.8619600000000001
80,-0.8619600000000001
81,-0.7469100000000001
82,-0.5989800000000001
83,-0.46748999999999996
84,-0.25383
85,-0.1059
86,0.009152500000000001
87,0.14064000000000002
88,0.25569000000000003
89,0.305
90,0.35431
91,0.40362
92,0.45293
93,0.38718
94,0.37075
95,0.28857
96,0.23926
97,0.20639000000000002
98,0.18995
99,0.22282
100,0.22282
101,0.20639000000000002
102,0.18995
103,0.15708
104,0.17351
105,0.10777
106,-0.13877
107,0.17351
108,0.38718
109,0.43649
110,0.42006000000000004
111,0.4858
112,0.56798
113,0.6501600000000001
114,0.71591
115,0.79809
116,1.0118
117,1.2912
118,1.5377
119,1.7843
120,2.1294
121,2.491
122,2.7211
123,2.9019
124,3.017
125,3.4936
126,3.6087
127,3.6415
128,3.4114
129,3.0005
130,2.6882
131,2.5239
132,2.3431
133,2.1458
134,1.9815
135,1.8171
136,1.587
137,1.3076
138,1.0939
139,0.94601
140,0.71591
141,0.45293
142,0.28857
143,0.15708
144,0.025588999999999997
145,-0.1059
146,-0.17164000000000001
147,-0.22095
148,-0.31956999999999997
149,-0.41818999999999995
150,-0.41818999999999995
151,-0.41818999999999995
152,-0.45106
153,-0.41818999999999995
154,-0.41818999999999995
155,-0.48393
156,-0.5332399999999999
157,-0.61542
158,-0.5989800000000001
159,-0.5168
160,-0.45106
161,-0.35244000000000003
162,-0.40175
163,-0.45106
164,-0.46748999999999996
165,-0.46748999999999996
166,-0.50037
167,-0.5168
168,-0.56611
169,-0.56611
170,-0.5168
171,-0.48393
172,-0.56611
173,-0.58255
174,-0.5168
175,-0.50037
176,-0.48393
177,-0.48393
178,-0.50037
179,-0.5168
180,-0.48393
181,-0.43462
182,-0.43462
183,-0.48393
184,-0.5332399999999999
185,-0.5168
186,-0.48393
187,-0.46748999999999996
188,-0.45106
189,-0.5332399999999999
190,-0.68116
191,-0.71404
192,-0.68116
193,-0.68116
194,-0.6482899999999999
195,-0.6318600000000001
196,-0.58255
197,-0.48393
198,-0.33601
199,-0.2867
200,-0.23739000000000002
201,-0.17164000000000001
202,-0.17164000000000001
203,-0.23739000000000002
204,-0.20452
205,-0.12234
206,-0.13877
207,-0.13877
208,-0.17164000000000001
209,-0.22095
210,-0.33601
211,-0.45106
212,-0.5332399999999999
213,-0.58255
214,-0.6318600000000001
215,-0.71404
216,-0.71404
217,-0.61542
218,-0.43462
219,-0.18808
220,0.042025
221,0.25569000000000003
222,0.45293
223,0.4858
224,0.71591
225,0.84739
226,0.9295700000000001
227,0.9953200000000001
228,1.0118
229,1.0118
230,1.0118
231,1.0282
232,0.84739
233,0.6666
234,0.5844199999999999
235,0.51867
236,0.45293
237,0.40362
238,0.38718
239,0.33787
240,0.33787
241,0.42006000000000004
242,0.40362
243,0.5022399999999999
244,0.96245
245,0.51867
246,0.28857
247,0.28857
248,0.35431
249,0.38718
250,0.38718
251,0.38718
252,0.4858
253,0.6501600000000001
254,0.8638299999999999
255,1.0939
256,1.2912
257,1.5048
258,1.7185
259,2.0144
260,2.4746
261,2.7047
262,2.9348
263,3.0827
264,3.0991
265,2.9841
266,2.7047
267,2.4253
268,2.2445
269,2.0144
270,1.7843
271,1.587
272,1.3898
273,1.1104
274,0.91314
275,0.63372
276,0.33787
277,0.058461
278,-0.12234
279,-0.36888000000000004
280,-0.5332399999999999
281,-0.71404
282,-0.82909
283,-0.8784
284,-0.8948299999999999
285,-0.8784
286,-0.91127
287,-0.92771
288,-0.92771
289,-0.91127
290,-0.8948299999999999
291,-0.8948299999999999
292,-0.91127
293,-0.8948299999999999
294,-0.8948299999999999
295,-0.8455299999999999
296,-0.8619600000000001
297,-0.8619600000000001
298,-0.8455299999999999
299,-0.82909
300,-0.7962199999999999
301,-0.82909
302,-0.8455299999999999
303,-0.8619600000000001
304,-0.8619600000000001
305,-0.82909
306,-0.82909
307,-0.8455299999999999
308,-0.8619600000000001
309,-0.8619600000000001
310,-0.82909
311,-0.82909
312,-0.82909
313,-0.8455299999999999
314,-0.8455299999999999
315,-0.8619600000000001
316,-0.8784
317,-0.8619600000000001
318,-0.8784
319,-0.8455299999999999
320,-0.82909
321,-0.8455299999999999
322,-0.8948299999999999
323,-0.8948299999999999
324,-0.8784
325,-0.8948299999999999
326,-0.8784
327,-0.8784
328,-0.8455299999999999
329,-0.77978
330,-0.68116
331,-0.6318600000000001
332,-0.61542
333,-0.5989800000000001
334,-0.5496800000000001
335,-0.48393
336,-0.41818999999999995
337,-0.45106
338,-0.50037
339,-0.48393
340,-0.45106
341,-0.41818999999999995
342,-0.38531
