time,value
0,0.30896999999999997
1,-0.1773
2,0.34936
3,-0.047893
4,-0.053489
5,-0.13845
6,0.093986
7,-0.20348
8,0.19389
9,-0.06018099999999999
10,-0.13153
11,0.34697
12,0.26543
13,-0.25585
14,-0.40614
15,-0.076882
16,-0.051177999999999994
17,0.07046799999999999
18,1.5428
19,1.5428
20,1.5428
21,1.5428
22,1.5428
23,1.5428
24,1.5428
25,1.5428
26,1.5428
27,1.5428
28,1.5428
29,1.5428
30,-1.4893
31,-1.4893
32,-1.4893
33,-1.4893
34,-1.4893
35,-1.4893
36,-1.4893
37,-1.4893
38,-1.4893
39,-1.4893
40,-1.4893
41,-1.4893
42,-0.40898
43,-0.013266
44,-0.21156999999999998
45,0.096094
46,0.7255
47,0.34795
48,-0.31154
49,-0.027407
50,0.22164
51,0.1276
52,0.0059856
53,-0.080631
54,-0.12207
55,0.042401999999999995
56,1.5428
57,1.5428
58,1.5428
59,1.5428
60,1.5428
61,1.5428
62,1.5428
63,1.5428
64,1.5428
65,1.5428
66,1.5428
67,1.5428
68,1.5428
69,1.5428
70,-1.4893
71,-1.4893
72,-1.4893
73,-1.4893
74,-1.4893
75,-1.4893
76,-1.4893
77,-1.4893
78,-1.4893
79,-1.4893
80,-1.4893
81,-1.4893
82,-1.4893
83,-1.4893
84,0.64093
85,0.27431
86,-0.20461
87,0.69191
88,0.26953
89,-0.69348
90,-0.35462
91,-0.56295
92,0.66098
93,-0.21422
94,0.17648
95,0.27426999999999996
96,-0.1773
97,-0.032402999999999994
98,0.021711
99,0.30175
100,-0.53256
101,-0.15525
102,0.3079
103,-0.52277
104,0.13366
105,0.16483
106,-0.23446
107,-0.60238
108,-0.32711999999999997
109,-0.26425
110,0.010759000000000001
111,0.36911
112,-0.11173
113,-0.027487
114,-0.26492
115,-0.37119
116,0.42715
117,-0.30214
118,-0.12493
119,0.45553999999999994
120,-0.096983
121,0.08870800000000001
122,0.29323
123,-0.69396
124,0.015688
125,-0.13546
126,-0.10074
127,-0.27989
