time,value
0,2.5509
1,2.0908
2,1.6847
3,1.3611
4,1.1927
5,0.96099
6,0.78476
7,0.66625
8,0.25654
9,-0.10947
10,-0.11832000000000001
11,0.093526
12,0.42265
13,0.38101999999999997
14,0.32177
15,0.16909000000000002
16,0.06962
17,-0.1338
18,-0.168
19,-0.1376
20,-0.20242000000000002
21,-0.39851
22,-0.40191
23,-0.38022
24,-0.52952
25,-0.44615
26,-0.48925
27,-0.38081
28,-0.38081
29,-0.40915999999999997
30,-0.3873
31,-0.39733
32,-0.34778000000000003
33,-0.36214
34,-0.27216999999999997
35,-0.15850999999999998
36,-0.1496
37,-0.07797899999999999
38,-0.06376
39,-0.065849
40,-0.070168
41,-0.059306
42,0.049033
43,0.17739000000000002
44,0.23499
45,0.3015
46,0.33585
47,0.39303
48,0.38683
49,0.3202
50,0.36391999999999997
51,0.44432
52,0.29088
53,0.15556
54,-0.034179
55,-0.31974
56,-0.67983
57,-1.0504
58,-1.4046
59,-1.2447
60,-0.9061100000000001
61,-0.55318
62,-0.19657
63,0.16293
64,0.52585
65,0.89081
66,1.2575
67,1.6256
68,1.992
69,2.3478
70,2.5293
71,2.2258
72,1.8174
73,1.4411
74,1.0702
75,0.7004199999999999
76,0.33011999999999997
77,-0.035842
78,-0.3997
79,-0.7609999999999999
80,-1.1192
81,-1.4762
82,-1.5247
83,-1.5829
84,-1.6491
85,-1.7585
86,-1.8283
87,-1.8564
88,-1.8193
89,-1.7287
90,-1.6031
91,-1.4456
92,-1.2592
93,-1.1789
94,-1.2106
95,-1.1712
96,-1.1347
97,-1.0574
98,-1.0744
99,-0.9119799999999999
100,-0.8820600000000001
101,-0.6256
102,-0.6415
103,-0.54528
104,-0.37728
105,-0.27360999999999996
106,-0.23848000000000003
107,-0.32746
108,-0.25559
109,-0.07574600000000001
110,-0.057498
111,-0.053049
112,-0.08091
113,-0.067938
114,0.05231
115,0.07846
116,0.20365999999999998
117,0.2994
118,0.52522
119,0.4433
120,0.34574
121,0.41905
122,0.8144600000000001
123,1.1125
124,1.4119
125,1.7928
126,2.1739
127,2.5268
