time,value
0,-0.81315
1,-0.7751399999999999
2,-0.6897800000000001
3,-0.58596
4,-0.48565
5,-0.40195
6,-0.34306
7,-0.30169
8,-0.27236
9,-0.25261999999999996
10,-0.23304
11,-0.21428000000000003
12,-0.20152
13,-0.18484
14,-0.16080999999999998
15,-0.14797000000000002
16,-0.15714
17,-0.17369
18,-0.18217
19,-0.18763
20,-0.20381
21,-0.23528000000000002
22,-0.27201
23,-0.29980999999999997
24,-0.31803000000000003
25,-0.33625
26,-0.35302
27,-0.35633000000000004
28,-0.34513
29,-0.32928
30,-0.3099
31,-0.28226
32,-0.25301
33,-0.23264
34,-0.22241999999999998
35,-0.22445
36,-0.24179
37,-0.27089
38,-0.31056999999999996
39,-0.35977
40,-0.41011000000000003
41,-0.46065
42,-0.51332
43,-0.55872
44,-0.58973
45,-0.6025699999999999
46,-0.59062
47,-0.56018
48,-0.52355
49,-0.47502
50,-0.39875
51,-0.2841
52,-0.13945
53,0.0033985
54,0.11932000000000001
55,0.21366
56,0.3013
57,0.38034
58,0.43633999999999995
59,0.46076000000000006
60,0.45913000000000004
61,0.4345
62,0.3641
63,0.2132
64,-0.017394
65,-0.27226
66,-0.48268
67,-0.61663
68,-0.68505
69,-0.71896
70,-0.74198
71,-0.75661
72,-0.7616
73,-0.76056
74,-0.75364
75,-0.7461800000000001
76,-0.74261
77,-0.73464
78,-0.7247
79,-0.7205600000000001
80,-0.71023
81,-0.68721
82,-0.65737
83,-0.61944
84,-0.57477
85,-0.52751
86,-0.47189
87,-0.40359
88,-0.32133
89,-0.21952
90,-0.09333
91,0.049464
92,0.18937
93,0.31945
94,0.44828999999999997
95,0.58129
96,0.70785
97,0.7965399999999999
98,0.8288399999999999
99,0.83073
100,0.80418
101,0.67357
102,0.38075
103,-0.020201
104,-0.40066
105,-0.6553399999999999
106,-0.77077
107,-0.80608
108,-0.81399
109,-0.81224
110,-0.80599
111,-0.7975800000000001
112,-0.7863399999999999
113,-0.7732600000000001
114,-0.76248
115,-0.75407
116,-0.74146
117,-0.72426
118,-0.70668
119,-0.6842699999999999
120,-0.6574399999999999
121,-0.63234
122,-0.60932
123,-0.5893
124,-0.5744199999999999
125,-0.56529
126,-0.56834
127,-0.58368
128,-0.6000300000000001
129,-0.61553
130,-0.62795
131,-0.62066
132,-0.59053
133,-0.5457
134,-0.48341999999999996
135,-0.39942
136,-0.28603
137,-0.12457
138,0.080136
139,0.28073000000000004
140,0.44359
141,0.59321
142,0.75855
143,0.9007200000000001
144,0.9445600000000001
145,0.8743
146,0.74754
147,0.61622
148,0.49754
149,0.41018000000000004
150,0.37356999999999996
151,0.38311
152,0.41757
153,0.46331999999999995
154,0.5188
155,0.57938
156,0.6436
157,0.72277
158,0.81198
159,0.8699100000000001
160,0.8522299999999999
161,0.75029
162,0.5875600000000001
163,0.39659
164,0.21111
165,0.047723
166,-0.10683
167,-0.26443
168,-0.40694
169,-0.5092899999999999
170,-0.56915
171,-0.59741
172,-0.6045
173,-0.60223
174,-0.59716
175,-0.58725
176,-0.57265
177,-0.5583100000000001
178,-0.55108
179,-0.55225
180,-0.55893
181,-0.57281
182,-0.59438
183,-0.6241
184,-0.6681199999999999
185,-0.7186100000000001
186,-0.75488
187,-0.77599
188,-0.79199
189,-0.79742
190,-0.7915800000000001
191,-0.78955
192,-0.79297
193,-0.79172
194,-0.78728
195,-0.77959
196,-0.76013
197,-0.73127
198,-0.7025100000000001
199,-0.67084
200,-0.62943
201,-0.58191
202,-0.52642
203,-0.44921000000000005
204,-0.34101
205,-0.19374
206,-0.00053297
207,0.21746999999999997
208,0.41451000000000005
209,0.56202
210,0.66559
211,0.7366
212,0.76781
213,0.7471300000000001
214,0.68311
215,0.59918
216,0.49591999999999997
217,0.3478
218,0.15935
219,-0.0248
220,-0.18051
221,-0.31238
222,-0.41707
223,-0.49568
224,-0.5565399999999999
225,-0.5866600000000001
226,-0.57539
227,-0.5365800000000001
228,-0.46962
229,-0.36002
230,-0.21079
231,-0.0029353
232,0.29998
233,0.68998
234,1.1404
235,1.6436
236,2.1524
237,2.5919
238,2.9563
239,3.2844
240,3.582
241,3.85
242,4.1182
243,4.3738
244,4.4993
245,4.3539
246,3.9245
247,3.3672
248,2.8729
249,2.4984
250,2.1758
251,1.8535
252,1.5359
253,1.2241
254,0.90015
255,0.55811
256,0.21170999999999998
257,-0.12042
258,-0.402
259,-0.58194
260,-0.65986
261,-0.6863
262,-0.6904
263,-0.69052
264,-0.69925
265,-0.70909
266,-0.72304
267,-0.7399399999999999
268,-0.74335
269,-0.7568199999999999
