time,value
0,-0.070391
1,-0.070391
2,-0.070391
3,-0.070391
4,-0.070391
5,-0.070391
6,-0.070391
7,-0.070391
8,-0.070391
9,-0.070391
10,-0.070391
11,-0.070391
12,-0.070391
13,-0.070391
14,-0.070391
15,-0.070391
16,-0.070391
17,-0.070391
18,-0.070391
19,-0.070391
20,-0.070391
21,-0.070391
22,-0.070391
23,-0.070391
24,-0.070391
25,-0.070391
26,-0.070391
27,-0.070391
28,-0.070391
29,-0.070391
30,-0.070391
31,-0.070391
32,-0.070391
33,-0.070391
34,-0.070391
35,-0.070391
36,-0.070391
37,-0.070391
38,-0.070391
39,-0.070391
40,-0.070391
41,-0.070391
42,-0.070391
43,-0.070391
44,-0.070391
45,-0.070391
46,-0.070391
47,-0.070391
48,-0.070391
49,-0.070391
50,-0.070391
51,-0.070391
52,-0.070391
53,-0.070391
54,-0.070391
55,-0.070391
56,-0.070391
57,-0.070391
58,-0.070391
59,-0.070391
60,-0.070391
61,-0.070391
62,-0.070391
63,-0.070391
64,-0.070391
65,-0.070391
66,-0.070391
67,-0.070391
68,-0.070391
69,-0.070391
70,-0.070391
71,-0.070391
72,-0.070391
73,-0.070391
74,-0.070391
75,-0.070391
76,-0.070391
77,-0.070391
78,-0.070391
79,-0.070391
80,-0.070391
81,-0.070391
82,-0.070391
83,-0.070391
84,-0.070391
85,-0.070391
86,-0.070391
87,-0.070391
88,-0.070391
89,-0.070391
90,-0.070391
91,-0.070391
92,-0.070391
93,-0.070391
94,-0.070391
95,-0.070391
96,-0.070391
97,-0.070391
98,-0.070391
99,-0.070391
100,-0.070391
101,-0.070391
102,-0.070391
103,-0.070391
104,-0.070391
105,-0.070391
106,-0.070391
107,-0.070391
108,-0.070391
109,-0.070391
110,-0.070391
111,-0.070391
112,-0.070391
113,-0.070391
114,-0.070391
115,-0.070391
116,-0.070391
117,-0.070391
118,-0.070391
119,-0.070391
120,-0.070391
121,-0.070391
122,-0.070391
123,-0.070391
124,-0.070391
125,-0.070391
126,-0.070391
127,-0.070391
128,-0.070391
129,-0.070391
130,-0.070391
131,-0.070391
132,-0.070391
133,-0.070391
134,-0.070391
135,-0.070391
136,-0.070391
137,-0.070391
138,-0.070391
139,-0.070391
140,-0.070391
141,-0.070391
142,-0.070391
143,-0.070391
144,-0.070391
145,-0.070391
146,-0.070391
147,-0.070391
148,-0.070391
149,-0.070391
150,-0.070391
151,-0.070391
152,-0.070391
153,-0.070391
154,-0.070391
155,-0.070391
156,-0.070391
157,-0.070391
158,-0.070391
159,-0.070391
160,-0.070391
161,-0.070391
162,-0.070391
163,-0.070391
164,-0.070391
165,-0.070391
166,-0.070391
167,-0.070391
168,-0.070391
169,-0.070391
170,-0.070391
171,-0.070391
172,-0.070391
173,-0.070391
174,-0.070391
175,-0.070391
176,-0.070391
177,-0.070391
178,-0.070391
179,-0.070391
180,-0.070391
181,-0.070391
182,-0.070391
183,-0.070391
184,-0.070391
185,-0.070391
186,-0.070391
187,-0.070391
188,-0.070391
189,-0.070391
190,-0.070391
191,-0.070391
192,-0.070391
193,-0.070391
194,-0.070391
195,-0.070391
196,-0.070391
197,-0.070391
198,-0.070391
199,-0.070391
200,-0.070391
201,-0.070391
202,-0.070391
203,-0.070391
204,-0.070391
205,-0.070391
206,-0.070391
207,-0.070391
208,-0.070391
209,-0.070391
210,-0.070391
211,-0.070391
212,-0.070391
213,-0.070391
214,-0.070391
215,-0.070391
216,-0.070391
217,17.94
218,10.645999999999999
219,15.558
220,6.1811
221,0.0040311999999999995
222,-0.070391
223,-0.070391
224,-0.070391
225,-0.070391
226,-0.070391
227,-0.070391
228,-0.070391
229,-0.070391
230,-0.070391
231,-0.070391
232,-0.070391
233,-0.070391
234,-0.070391
235,-0.070391
236,-0.070391
237,-0.070391
238,-0.070391
239,-0.070391
240,-0.070391
241,-0.070391
242,-0.070391
243,-0.070391
244,-0.070391
245,-0.070391
246,-0.070391
247,-0.070391
248,-0.070391
249,-0.070391
250,-0.070391
251,-0.070391
252,-0.070391
253,-0.070391
254,-0.070391
255,-0.070391
256,-0.070391
257,-0.070391
258,-0.070391
259,-0.070391
260,-0.070391
261,-0.070391
262,-0.070391
263,-0.070391
264,-0.070391
265,-0.070391
266,-0.070391
267,-0.070391
268,-0.070391
269,-0.070391
270,-0.070391
271,-0.070391
272,-0.070391
273,-0.070391
274,-0.070391
275,-0.070391
276,-0.070391
277,-0.070391
278,-0.070391
279,-0.070391
280,-0.070391
281,-0.070391
282,-0.070391
283,-0.070391
284,-0.070391
285,-0.070391
286,-0.070391
287,-0.070391
288,-0.070391
289,-0.070391
290,-0.070391
291,-0.070391
292,-0.070391
293,-0.070391
294,-0.070391
295,-0.070391
296,-0.070391
297,-0.070391
298,-0.070391
299,-0.070391
300,-0.070391
301,-0.070391
302,-0.070391
303,-0.070391
304,-0.070391
305,-0.070391
306,-0.070391
307,-0.070391
308,-0.070391
309,-0.070391
310,-0.070391
311,-0.070391
312,-0.070391
313,-0.070391
314,-0.070391
315,-0.070391
316,-0.070391
317,-0.070391
318,-0.070391
319,-0.070391
320,-0.070391
321,-0.070391
322,-0.070391
323,-0.070391
324,-0.070391
325,-0.070391
326,-0.070391
327,-0.070391
328,-0.070391
329,-0.070391
330,-0.070391
331,-0.070391
332,-0.070391
333,-0.070391
334,-0.070391
335,-0.070391
336,-0.070391
337,-0.070391
338,-0.070391
339,-0.070391
340,-0.070391
341,-0.070391
342,-0.070391
343,-0.070391
344,-0.070391
345,-0.070391
346,-0.070391
347,-0.070391
348,-0.070391
349,-0.070391
350,-0.070391
351,-0.070391
352,-0.070391
353,-0.070391
354,-0.070391
355,-0.070391
356,-0.070391
357,-0.070391
358,-0.070391
359,-0.070391
360,-0.070391
361,-0.070391
362,-0.070391
363,-0.070391
364,-0.070391
365,-0.070391
366,-0.070391
367,-0.070391
368,-0.070391
369,-0.070391
370,-0.070391
371,-0.070391
372,-0.070391
373,-0.070391
374,-0.070391
375,-0.070391
376,-0.070391
377,-0.070391
378,-0.070391
379,-0.070391
380,-0.070391
381,-0.070391
382,-0.070391
383,-0.070391
384,-0.070391
385,-0.070391
386,-0.070391
387,-0.070391
388,-0.070391
389,-0.070391
390,-0.070391
391,-0.070391
392,-0.070391
393,-0.070391
394,-0.070391
395,-0.070391
396,-0.070391
397,-0.070391
398,-0.070391
399,-0.070391
400,-0.070391
401,-0.070391
402,-0.070391
403,-0.070391
404,-0.070391
405,-0.070391
406,-0.070391
407,-0.070391
408,-0.070391
409,-0.070391
410,-0.070391
411,-0.070391
412,-0.070391
413,-0.070391
414,-0.070391
415,-0.070391
416,-0.070391
417,-0.070391
418,-0.070391
419,-0.070391
420,-0.070391
421,-0.070391
422,-0.070391
423,-0.070391
424,-0.070391
425,-0.070391
426,-0.070391
427,-0.070391
428,-0.070391
429,-0.070391
430,-0.070391
431,-0.070391
432,-0.070391
433,-0.070391
434,-0.070391
435,-0.070391
436,-0.070391
437,-0.070391
438,-0.070391
439,-0.070391
440,-0.070391
441,-0.070391
442,-0.070391
443,-0.070391
444,-0.070391
445,-0.070391
446,-0.070391
447,-0.070391
448,-0.070391
449,-0.070391
450,-0.070391
451,-0.070391
452,-0.070391
453,-0.070391
454,-0.070391
455,-0.070391
456,-0.070391
457,-0.070391
458,-0.070391
459,-0.070391
460,-0.070391
461,-0.070391
462,-0.070391
463,-0.070391
464,-0.070391
465,-0.070391
466,-0.070391
467,-0.070391
468,-0.070391
469,-0.070391
470,-0.070391
471,-0.070391
472,-0.070391
473,-0.070391
474,-0.070391
475,-0.070391
476,-0.070391
477,-0.070391
478,-0.070391
479,-0.070391
480,-0.070391
481,-0.070391
482,-0.070391
483,-0.070391
484,-0.070391
485,-0.070391
486,-0.070391
487,-0.070391
488,-0.070391
489,-0.070391
490,-0.070391
491,-0.070391
492,-0.070391
493,-0.070391
494,-0.070391
495,-0.070391
496,-0.070391
497,-0.070391
498,-0.070391
499,-0.070391
500,-0.070391
501,-0.070391
502,-0.070391
503,-0.070391
504,-0.070391
505,-0.070391
506,-0.070391
507,-0.070391
508,-0.070391
509,-0.070391
510,-0.070391
511,-0.070391
512,-0.070391
513,-0.070391
514,-0.070391
515,-0.070391
516,-0.070391
517,-0.070391
518,-0.070391
519,-0.070391
520,-0.070391
521,-0.070391
522,-0.070391
523,-0.070391
524,-0.070391
525,-0.070391
526,-0.070391
527,-0.070391
528,-0.070391
529,-0.070391
530,-0.070391
531,-0.070391
532,-0.070391
533,-0.070391
534,-0.070391
535,-0.070391
536,-0.070391
537,-0.070391
538,-0.070391
539,-0.070391
540,-0.070391
541,-0.070391
542,-0.070391
543,-0.070391
544,-0.070391
545,-0.070391
546,-0.070391
547,-0.070391
548,-0.070391
549,-0.070391
550,-0.070391
551,-0.070391
552,-0.070391
553,-0.070391
554,-0.070391
555,-0.070391
556,-0.070391
557,-0.070391
558,-0.070391
559,-0.070391
560,-0.070391
561,-0.070391
562,-0.070391
563,-0.070391
564,-0.070391
565,-0.070391
566,-0.070391
567,-0.070391
568,-0.070391
569,-0.070391
570,-0.070391
571,-0.070391
572,-0.070391
573,-0.070391
574,-0.070391
575,-0.070391
576,-0.070391
577,-0.070391
578,-0.070391
579,-0.070391
580,-0.070391
581,-0.070391
582,-0.070391
583,-0.070391
584,-0.070391
585,-0.070391
586,-0.070391
587,-0.070391
588,-0.070391
589,-0.070391
590,-0.070391
591,-0.070391
592,-0.070391
593,-0.070391
594,-0.070391
595,-0.070391
596,-0.070391
597,-0.070391
598,-0.070391
599,-0.070391
600,-0.070391
601,-0.070391
602,-0.070391
603,-0.070391
604,-0.070391
605,-0.070391
606,-0.070391
607,-0.070391
608,-0.070391
609,-0.070391
610,-0.070391
611,-0.070391
612,-0.070391
613,-0.070391
614,-0.070391
615,-0.070391
616,-0.070391
617,-0.070391
618,-0.070391
619,-0.070391
620,-0.070391
621,-0.070391
622,-0.070391
623,-0.070391
624,-0.070391
625,-0.070391
626,-0.070391
627,-0.070391
628,-0.070391
629,-0.070391
630,-0.070391
631,-0.070391
632,-0.070391
633,-0.070391
634,-0.070391
635,-0.070391
636,-0.070391
637,-0.070391
638,-0.070391
639,-0.070391
640,-0.070391
641,-0.070391
642,-0.070391
643,-0.070391
644,-0.070391
645,-0.070391
646,-0.070391
647,-0.070391
648,-0.070391
649,-0.070391
650,-0.070391
651,-0.070391
652,-0.070391
653,-0.070391
654,-0.070391
655,-0.070391
656,-0.070391
657,-0.070391
658,-0.070391
659,-0.070391
660,-0.070391
661,-0.070391
662,-0.070391
663,-0.070391
664,-0.070391
665,-0.070391
666,-0.070391
667,-0.070391
668,-0.070391
669,-0.070391
670,-0.070391
671,-0.070391
672,-0.070391
673,-0.070391
674,-0.070391
675,-0.070391
676,-0.070391
677,-0.070391
678,-0.070391
679,-0.070391
680,-0.070391
681,-0.070391
682,-0.070391
683,-0.070391
684,-0.070391
685,-0.070391
686,-0.070391
687,-0.070391
688,-0.070391
689,-0.070391
690,-0.070391
691,-0.070391
692,-0.070391
693,-0.070391
694,-0.070391
695,-0.070391
696,-0.070391
697,-0.070391
698,-0.070391
699,-0.070391
700,-0.070391
701,-0.070391
702,-0.070391
703,-0.070391
704,-0.070391
705,-0.070391
706,-0.070391
707,-0.070391
708,-0.070391
709,-0.070391
710,-0.070391
711,-0.070391
712,-0.070391
713,-0.070391
714,-0.070391
715,-0.070391
716,-0.070391
717,-0.070391
718,-0.070391
719,-0.070391
