time,value
0,0.58295
1,0.74478
2,0.90379
3,1.0575
4,1.2035
5,1.3393
6,1.4626
7,1.5712
8,1.6631
9,1.7367
10,1.7905
11,1.8234
12,1.835
13,1.825
14,1.7936
15,1.7416
16,1.67
17,1.5804
18,1.4748
19,1.3555
20,1.2251
21,1.0864
22,0.94239
23,0.7962600000000001
24,0.6511100000000001
25,0.51003
26,0.37594
27,0.25159000000000004
28,0.13942000000000002
29,0.041539
30,-0.040351
31,-0.10499000000000001
32,-0.15159
33,-0.17987
34,-0.19005999999999998
35,-0.18284
36,-0.15939
37,-0.12132000000000001
38,-0.070635
39,-0.009665799999999999
40,0.058987
41,0.13253
42,0.20806
43,0.28264
44,0.35338
45,0.41753
46,0.47252
47,0.5160899999999999
48,0.5462899999999999
49,0.56155
50,0.56075
51,0.54318
52,0.50864
53,0.45738
54,0.39009
55,0.30788000000000004
56,0.21227
57,0.10509
58,-0.011528
59,-0.13525
60,-0.2636
61,-0.39400999999999997
62,-0.5239199999999999
63,-0.65084
64,-0.77242
65,-0.8865
66,-0.9911700000000001
67,-1.0849
68,-1.1663
69,-1.2345
70,-1.2890000000000001
71,-1.3296
72,-1.3565
73,-1.3703
74,-1.3718
75,-1.3622
76,-1.3427
77,-1.3151
78,-1.281
79,-1.2421
80,-1.2002
81,-1.157
82,-1.1142
83,-1.0734
84,-1.0358
85,-1.0027
86,-0.97483
87,-0.9529700000000001
88,-0.9375100000000001
89,-0.92861
90,-0.92619
91,-0.92995
92,-0.93937
93,-0.95378
94,-0.97236
95,-0.9942
96,-1.0183
97,-1.0436
98,-1.0693
