time,value
0,0.026449
1,0.007942900000000001
2,-0.20936999999999997
3,-0.326
4,0.08152999999999999
5,0.6975399999999999
6,-0.33024000000000003
7,-0.30987
8,-0.009013
9,0.095295
10,0.32378
11,-0.46875
12,-0.17727
13,0.16925
14,0.18372
15,-0.3095
16,-0.10239
17,0.098957
18,0.3922
19,0.21556999999999998
20,0.057812
21,0.090674
22,0.16278
23,0.15837
24,0.6566
25,0.11382
26,-0.6914399999999999
27,0.024437
28,-0.33389
29,0.31795
30,0.62407
31,0.41999
32,0.27541
33,-0.9217700000000001
34,-0.36826
35,-0.12329000000000001
36,-0.091059
37,0.81791
38,0.6473300000000001
39,-0.090748
40,-0.2262
41,0.14219
42,-0.3873
43,-0.32068
44,-1.5341
45,-1.5341
46,-1.5341
47,-1.5341
48,-1.5341
49,-1.5341
50,-1.5341
51,-1.5341
52,-1.5341
53,-1.5341
54,1.5153
55,1.5153
56,1.5153
57,1.5153
58,1.5153
59,1.5153
60,1.5153
61,1.5153
62,1.5153
63,1.5153
64,0.4137
65,-0.37146999999999997
66,-0.36613
67,-0.12012
68,0.20110999999999998
69,0.0011077
70,1.5153
71,1.5153
72,1.5153
73,1.5153
74,1.5153
75,1.5153
76,1.5153
77,1.5153
78,1.5153
79,1.5153
80,1.5153
81,1.5153
82,1.5153
83,1.5153
84,1.5153
85,1.5153
86,-1.5341
87,-1.5341
88,-1.5341
89,-1.5341
90,-1.5341
91,-1.5341
92,-1.5341
93,-1.5341
94,-1.5341
95,-1.5341
96,-1.5341
97,-1.5341
98,-1.5341
99,-1.5341
100,-1.5341
101,-0.18069000000000002
102,-0.11825
103,-0.32968000000000003
104,-0.22480999999999998
105,-0.46692
106,-0.34498
107,-0.33046
108,-0.014303999999999999
109,0.009436700000000001
110,-0.037558
111,0.24886999999999998
112,0.060545
113,0.048014
114,-0.004739
115,-0.31801
116,0.64967
117,-0.17035999999999998
118,0.36951999999999996
119,-0.5854600000000001
120,0.14262
121,0.12063
122,-0.32989
123,-0.23403000000000002
124,-0.25039
125,0.14248
126,0.11015
127,0.23137
