time,value
0,1.5251
1,1.5316
2,1.4832
3,1.3496
4,1.1524
5,0.97898
6,0.9911700000000001
7,0.95224
8,0.81375
9,0.65992
10,0.48538000000000003
11,0.27075
12,0.059663
13,0.16918
14,0.25875
15,0.25093000000000004
16,0.15137
17,0.042667000000000004
18,-0.10121000000000001
19,-0.23584000000000002
20,-0.41098
21,-0.60656
22,-0.8239799999999999
23,-1.0203
24,-1.1292
25,-1.2953
26,-1.4336
27,-1.3288
28,-1.1474
29,-0.9854799999999999
30,-0.92066
31,-0.86893
32,-0.89233
33,-0.96055
34,-1.0090000000000001
35,-1.0654
36,-1.1671
37,-1.2408
38,-1.3047
39,-1.3352
40,-1.3078
41,-1.169
42,-1.0222
43,-0.8671
44,-0.70529
45,-0.47858
46,-0.33425
47,-0.20613
48,-0.12542999999999999
49,-0.052705999999999996
50,-0.052705999999999996
51,0.066851
52,0.26536
53,0.46635
54,0.6341
55,0.81066
56,0.9933799999999999
57,1.1733
58,1.3548
59,1.5355
60,1.7502
61,1.9357
62,2.1255
63,2.2176
64,2.029
65,1.84
66,1.6511
67,1.4971
68,1.2842
69,1.104
70,0.92296
71,0.74378
72,0.5667
73,0.39825
74,0.23476999999999998
75,0.046844
76,-0.13377999999999998
77,-0.15895
78,-0.14043
79,-0.24913000000000002
80,-0.37782
81,-0.5877
82,-0.7570100000000001
83,-0.9295700000000001
84,-1.1126
85,-1.1991
86,-1.2557
87,-1.1711
88,-1.1273
89,-1.0264
90,-0.96604
91,-0.9396899999999999
92,-0.92371
93,-0.95199
94,-1.0894
95,-1.2446
96,-1.4598
97,-1.597
98,-1.4585
99,-1.2761
100,-1.0843
101,-0.858
102,-0.6549
103,-0.45661999999999997
104,-0.29586999999999997
105,-0.15483
106,-0.055029999999999996
107,0.031391
108,0.066851
109,0.00041246
110,-0.15070999999999998
111,-0.27643
112,-0.26748
113,-0.070011
114,0.12768
115,0.31240999999999997
116,0.49787
117,0.70096
118,0.86524
119,1.0216
120,1.1543
121,1.1977
122,1.1891
123,1.0645
124,1.0069
125,1.1877
126,1.37
127,1.4933
