time,value
0,0.725
1,0.41726
2,0.1633
3,0.020256
4,0.012889
5,0.10269
6,0.19387000000000001
7,0.22748000000000002
8,0.16227
9,-0.0093015
10,-0.24896999999999997
11,-0.50797
12,-0.73338
13,-0.8920299999999999
14,-0.96893
15,-0.97
16,-0.8991299999999999
17,-0.74068
18,-0.49033000000000004
19,-0.13537000000000002
20,0.28021999999999997
21,0.70872
22,1.0849
23,1.3207
24,1.3764
25,1.2353
26,0.95336
27,0.64352
28,0.41068000000000005
29,0.2945
30,0.29095
31,0.3308
32,0.31381
33,0.15524000000000002
34,-0.17778
35,-0.63381
36,-1.1097
37,-1.4667
38,-1.619
39,-1.5296
40,-1.2244
41,-0.83047
42,-0.47038
43,-0.23195
44,-0.10035
45,-0.0659
46,-0.038464
47,0.10454000000000001
48,0.37823
49,0.75838
50,1.2004
51,1.5766
52,1.7867
53,1.7672
54,1.5523
55,1.2106
56,0.8217399999999999
57,0.45388999999999996
58,0.16509000000000001
59,-0.045999
60,-0.2086
61,-0.32506
62,-0.44914
63,-0.6278600000000001
64,-0.86208
65,-1.1261
66,-1.3916
67,-1.6093
68,-1.7173
69,-1.6784
70,-1.4545
71,-1.056
72,-0.51654
73,0.08820399999999999
74,0.68109
75,1.1482
76,1.4748
77,1.6358
78,1.6463
79,1.5718
80,1.465
81,1.3594
82,1.2648
83,1.1283
84,0.90095
85,0.54945
86,0.053860000000000005
87,-0.5585399999999999
88,-1.1501
89,-1.6127
90,-1.8472
91,-1.8459
92,-1.6074
93,-1.2214
94,-0.78875
95,-0.39084
96,-0.07224
97,0.15927
98,0.35927
99,0.55792
100,0.78275
101,1.0082
102,1.1821
103,1.2648
104,1.2214
105,1.0359
106,0.74463
107,0.43482
108,0.16114
109,-0.049881
110,-0.20948000000000003
111,-0.36491999999999997
112,-0.54898
113,-0.7943100000000001
114,-1.0755
115,-1.3225
116,-1.482
117,-1.4691
118,-1.2519
119,-0.8163600000000001
120,-0.2629
121,0.319
122,0.81852
123,1.1836
124,1.3963
125,1.4518
126,1.416
127,1.3284
128,1.1918
129,1.0338
130,0.8188300000000001
131,0.5260199999999999
132,0.15147
133,-0.28076999999999996
134,-0.70929
135,-1.0713
136,-1.3087
137,-1.4118
138,-1.3944
139,-1.2849
140,-1.1021
141,-0.8931100000000001
142,-0.66633
143,-0.4048
144,-0.11212000000000001
145,0.15965
146,0.41628000000000004
147,0.6117
148,0.71965
149,0.7508699999999999
150,0.73548
151,0.69662
152,0.72042
153,0.8268200000000001
154,1.0122
155,1.1872
156,1.2409999999999999
157,1.0985
158,0.7419600000000001
159,0.20359000000000002
160,-0.40254
161,-0.9273600000000001
162,-1.2542
163,-1.3149
164,-1.1375
165,-0.8280299999999999
166,-0.51954
167,-0.32315
168,-0.29064
169,-0.37794
170,-0.48396000000000006
171,-0.46079
172,-0.25808000000000003
173,0.113
174,0.57182
175,0.9829899999999999
176,1.217
177,1.1659
178,0.8593700000000001
179,0.40016
180,-0.04595
181,-0.36916
182,-0.47711000000000003
183,-0.38042
184,-0.15842
185,0.057746000000000006
186,0.1531
187,0.073259
188,-0.15880999999999998
189,-0.47806000000000004
190,-0.73912
191,-0.8569899999999999
192,-0.77545
193,-0.49718
194,-0.069513
195,0.37364
196,0.7133
197,0.87385
198,0.8362700000000001
199,0.65336
200,0.39481
201,0.19593
202,0.11964000000000001
203,0.21185
204,0.41431999999999997
205,0.6382899999999999
206,0.78266
207,0.75273
208,0.52973
209,0.15435
210,-0.28851
211,-0.69711
212,-0.96735
213,-1.0729
214,-1.0255
215,-0.9009999999999999
216,-0.76455
217,-0.65186
218,-0.5845199999999999
219,-0.53275
220,-0.43846
221,-0.23718000000000003
222,0.073488
223,0.47203999999999996
224,0.87139
225,1.1637
226,1.2808
227,1.194
228,0.92832
229,0.54906
230,0.14992
231,-0.20288
232,-0.45983
233,-0.61028
234,-0.6644899999999999
235,-0.66576
236,-0.64793
237,-0.59209
238,-0.47238
239,-0.27379000000000003
240,0.01462
241,0.35465
242,0.69762
243,0.9724299999999999
244,1.1143
245,1.0821
246,0.9013399999999999
247,0.6028100000000001
248,0.24754
249,-0.12582000000000002
250,-0.46232
251,-0.73437
252,-0.92453
253,-1.0744
254,-1.1792
255,-1.2266
256,-1.1926
257,-1.0634
258,-0.8694700000000001
259,-0.61517
260,-0.32163
261,0.0043113
262,0.35904
263,0.72297
264,1.0857
265,1.4506
266,1.7834
267,2.0095
268,2.0651
269,1.9133
270,1.5433
271,1.008
272,0.36935
273,-0.24238
274,-0.74269
275,-1.0977
276,-1.3076
277,-1.4214
278,-1.5002
279,-1.5835
280,-1.656
281,-1.6779
282,-1.5538
283,-1.2291
284,-0.70481
285,-0.039847
286,0.6793399999999999
287,1.3373
288,1.8187
289,2.0637
290,2.0481
291,1.7864
292,1.3895
293,0.9341299999999999
294,0.4681
295,0.031043
296,-0.34785
297,-0.67891
298,-0.96729
299,-1.203
300,-1.379
301,-1.4741
302,-1.4943
303,-1.4169
304,-1.2570000000000001
305,-1.0147
306,-0.6893100000000001
307,-0.28281
308,0.19712000000000002
309,0.71985
310,1.2521
311,1.7398
312,2.0987
313,2.2791
314,2.2362
315,1.9591
316,1.4762
317,0.8643299999999999
318,0.22459
319,-0.32214
320,-0.70376
321,-0.904
322,-0.92299
323,-0.84025
324,-0.7308600000000001
325,-0.67092
326,-0.70573
327,-0.82252
328,-0.9941
329,-1.1651
330,-1.2678
331,-1.2678
332,-1.1461
333,-0.92556
334,-0.65037
335,-0.36417
336,-0.077837
337,0.21721999999999997
338,0.50995
339,0.82301
340,1.1346
341,1.4152
342,1.6198
343,1.6851
344,1.5743
345,1.2885
346,0.88846
347,0.46112
348,0.084323
349,-0.17084000000000002
350,-0.27976
351,-0.29008
352,-0.267
353,-0.31458
354,-0.47596000000000005
355,-0.76381
356,-1.1215
357,-1.4626
358,-1.6553
359,-1.5839
360,-1.2633
361,-0.7191
362,-0.052539999999999996
363,0.6061
364,1.1433
365,1.5001
366,1.6343
367,1.5603
368,1.331
369,0.99924
370,0.59091
371,0.15337
372,-0.26852
373,-0.60774
374,-0.80974
375,-0.82331
376,-0.6299899999999999
377,-0.27275
378,0.15675
379,0.53138
380,0.74888
381,0.73652
382,0.48978999999999995
383,0.07998200000000001
384,-0.36486
385,-0.70105
386,-0.8408100000000001
387,-0.7735
388,-0.56748
389,-0.32286
390,-0.13465
391,-0.059330999999999995
392,-0.066756
393,-0.13517
394,-0.18667999999999998
395,-0.15188
396,-0.012395999999999999
397,0.20961
398,0.47689
399,0.7225
400,0.8916200000000001
401,0.9555600000000001
402,0.9388
403,0.8696200000000001
404,0.77742
405,0.63393
406,0.4359
407,0.17399
408,-0.15153
409,-0.50497
410,-0.8403
411,-1.0927
412,-1.2171
413,-1.1569
414,-0.94353
415,-0.6422
416,-0.3275
417,-0.024714
418,0.21453000000000003
419,0.36504000000000003
420,0.44185
421,0.47721
422,0.50392
423,0.52727
424,0.54779
425,0.55916
426,0.53976
427,0.50145
428,0.44354
429,0.37638
430,0.30722
431,0.23560999999999999
432,0.13212000000000002
433,-0.0015243000000000001
434,-0.17154
435,-0.37448000000000004
436,-0.6279600000000001
437,-0.9012600000000001
438,-1.1852
439,-1.4234
440,-1.5957
441,-1.6309
442,-1.504
443,-1.205
444,-0.74264
445,-0.15521
446,0.5038600000000001
447,1.1619
448,1.7299
449,2.1265
450,2.3207
451,2.3018
452,2.0816
453,1.7135
454,1.2679
455,0.80437
456,0.37947
457,0.010723
458,-0.29971
459,-0.58897
460,-0.86374
461,-1.1121
462,-1.3488
463,-1.5642
464,-1.7399
465,-1.8483
466,-1.8929
467,-1.8415
468,-1.6679
469,-1.3554
470,-0.9160200000000001
471,-0.35996999999999996
472,0.28536999999999996
473,0.9407
474,1.5399
475,2.0243
476,2.334
477,2.4248
478,2.3081
479,2.0089
480,1.5897
481,1.083
482,0.55307
483,0.061961
484,-0.34206
485,-0.6176699999999999
486,-0.76649
487,-0.79196
488,-0.7588699999999999
489,-0.7369899999999999
490,-0.78298
491,-0.9424899999999999
492,-1.1955
493,-1.5147
494,-1.8005
495,-1.9432
496,-1.8593
497,-1.4834
498,-0.83157
499,0.0093921
