time,value
0,-0.19667
1,-0.6590699999999999
2,0.42561000000000004
3,-0.36735
4,-0.3804
5,0.35945
6,0.17331
7,-1.6181
8,-1.6181
9,-1.6181
10,-1.6181
11,-1.6181
12,-1.6181
13,-1.6181
14,-1.6181
15,-1.6181
16,-1.6181
17,-1.6181
18,-1.6181
19,-1.6181
20,1.6054
21,1.6054
22,1.6054
23,1.6054
24,1.6054
25,1.6054
26,1.6054
27,1.6054
28,1.6054
29,1.6054
30,1.6054
31,1.6054
32,1.6054
33,-0.0744
34,0.018555000000000002
35,-0.29553
36,0.028057
37,-0.14348
38,-0.084738
39,-0.30738000000000004
40,0.30288000000000004
41,0.32216
42,-0.43246999999999997
43,-0.18808
44,0.1211
45,0.05563200000000001
46,0.36565
47,-0.10236
48,-0.012546
49,-0.38923
50,0.56558
51,-0.41345
52,0.028076
53,0.45982
54,0.099286
55,0.33299
56,-0.31158
57,0.20156
58,0.5052399999999999
59,-0.44477
60,-0.4806
61,-0.39866999999999997
62,-0.69253
63,0.2739
64,-0.18442
65,-0.13410999999999998
66,-0.023813
67,0.085847
68,-0.2785
69,0.0053935
70,-0.28743
71,0.14994000000000002
72,0.12229000000000001
73,0.39379000000000003
74,0.012624
75,0.10023
76,-0.19791
77,0.19311
78,0.0042106999999999995
79,-0.29352
80,-0.0037391999999999994
81,0.025117
82,-0.57714
83,1.6054
84,1.6054
85,1.6054
86,1.6054
87,1.6054
88,1.6054
89,1.6054
90,1.6054
91,1.6054
92,1.6054
93,-1.6181
94,-1.6181
95,-1.6181
96,-1.6181
97,-1.6181
98,-1.6181
99,-1.6181
100,-1.6181
101,-1.6181
102,-1.6181
103,0.15927
104,0.21185
105,-0.24092
106,-0.19402
107,0.21395999999999998
108,0.013284
109,-0.081956
110,0.33732
111,0.51271
112,0.12468
113,0.258
114,0.5334899999999999
115,0.0010304000000000001
116,-0.040849
117,0.45663000000000004
118,0.5784
119,-0.44082
120,-0.10174
121,-0.0042559
122,0.40303
123,0.22207
124,0.17104
125,0.32874000000000003
126,-0.25645999999999997
127,-0.24835
