time,value
0,0.66269
1,1.808
2,1.808
3,1.808
4,1.4556
5,1.808
6,1.4556
7,1.808
8,1.4556
9,1.4556
10,1.4556
11,1.4556
12,1.4556
13,1.4556
14,1.4556
15,1.4556
16,0.92699
17,-0.57068
18,-0.65878
19,-0.65878
20,-0.65878
21,-0.65878
22,-0.65878
23,-0.65878
24,-0.65878
25,-0.65878
26,-0.65878
27,-0.65878
28,-0.65878
29,-0.65878
30,-0.65878
31,-0.65878
32,-0.65878
33,-0.65878
34,-0.65878
35,-0.65878
36,-0.65878
37,-0.65878
38,-0.65878
39,-0.65878
40,-0.65878
41,-0.65878
42,-0.65878
43,-0.65878
44,-0.65878
45,-0.65878
46,-0.65878
47,-0.65878
48,-0.65878
49,-0.65878
50,-0.65878
51,-0.65878
52,-0.65878
53,-0.65878
54,-0.65878
55,-0.65878
56,-0.65878
57,-0.65878
58,-0.65878
59,-0.65878
60,-0.65878
61,1.1913
62,1.808
63,1.808
64,1.808
65,1.808
66,1.4556
67,1.808
68,1.4556
69,1.4556
70,1.808
71,1.4556
72,1.4556
73,1.4556
74,1.4556
75,1.4556
76,1.4556
77,0.046007
78,-0.57068
79,-0.65878
80,-0.65878
81,-0.65878
82,-0.65878
83,-0.65878
84,-0.65878
85,-0.65878
86,-0.65878
87,-0.65878
88,-0.65878
89,-0.65878
90,-0.65878
91,-0.65878
92,-0.65878
93,-0.65878
94,-0.65878
95,-0.65878
96,-0.65878
97,-0.65878
98,-0.65878
99,-0.65878
100,-0.65878
101,-0.65878
102,-0.65878
103,-0.65878
104,-0.65878
105,-0.65878
106,-0.65878
107,-0.65878
108,-0.65878
109,-0.65878
110,-0.65878
111,-0.65878
112,-0.65878
113,-0.65878
114,-0.65878
115,-0.65878
116,-0.65878
117,-0.65878
118,-0.65878
119,-0.65878
120,-0.65878
121,-0.65878
122,0.3984
123,1.808
124,1.808
125,1.808
126,1.4556
127,1.808
128,1.808
129,1.4556
130,1.4556
131,1.808
132,1.4556
133,1.4556
134,1.4556
135,1.4556
136,1.4556
137,1.4556
138,1.4556
139,0.92699
140,-0.57068
141,-0.65878
142,-0.65878
143,-0.65878
144,-0.65878
145,-0.65878
146,-0.65878
147,-0.65878
148,-0.65878
149,-0.65878
150,-0.65878
151,-0.65878
152,-0.65878
153,-0.65878
154,-0.65878
155,-0.65878
156,-0.65878
157,-0.65878
158,-0.65878
159,-0.65878
160,-0.65878
161,-0.65878
162,-0.65878
163,-0.65878
164,-0.65878
165,-0.65878
166,-0.65878
167,-0.65878
168,-0.65878
169,-0.65878
170,-0.65878
171,-0.65878
172,-0.65878
173,-0.65878
174,-0.65878
175,-0.65878
176,-0.65878
177,-0.65878
178,-0.65878
179,-0.65878
180,-0.65878
181,-0.65878
182,-0.65878
183,-0.65878
184,1.808
185,1.808
186,1.808
187,1.808
188,1.808
189,1.4556
190,1.808
191,1.4556
192,1.4556
193,1.4556
194,1.4556
195,1.4556
196,1.4556
197,1.4556
198,1.4556
199,1.4556
200,0.3984
201,-0.48258
202,-0.65878
203,-0.65878
204,-0.65878
205,-0.65878
206,-0.65878
207,-0.65878
208,-0.65878
209,-0.65878
210,-0.65878
211,-0.65878
212,-0.65878
213,-0.65878
214,-0.65878
215,-0.65878
216,-0.65878
217,-0.65878
218,-0.65878
219,-0.65878
220,-0.65878
221,-0.65878
222,-0.65878
223,-0.65878
224,-0.65878
225,-0.65878
226,-0.65878
227,-0.65878
228,-0.65878
229,-0.65878
230,-0.65878
231,-0.65878
232,-0.65878
233,-0.65878
234,-0.65878
235,-0.65878
236,-0.65878
237,-0.65878
238,-0.65878
239,0.66269
240,1.808
241,1.808
242,1.4556
243,1.808
244,1.4556
245,1.808
246,1.4556
247,1.4556
248,1.4556
249,1.4556
250,1.4556
251,1.4556
252,1.4556
253,1.4556
254,1.1913
255,0.92699
256,-0.48258
257,-0.65878
258,-0.65878
259,-0.65878
260,-0.65878
261,-0.65878
262,-0.65878
263,-0.65878
264,-0.65878
265,-0.65878
266,-0.65878
267,-0.65878
268,-0.65878
269,-0.65878
270,-0.65878
271,-0.65878
272,-0.65878
273,-0.65878
274,-0.65878
275,-0.65878
276,-0.65878
277,-0.65878
278,-0.65878
279,-0.65878
280,-0.65878
281,-0.65878
282,-0.65878
283,-0.65878
284,-0.65878
285,-0.65878
286,-0.65878
287,-0.65878
288,-0.65878
289,-0.65878
290,-0.65878
291,-0.65878
292,-0.65878
293,-0.65878
294,-0.65878
295,-0.65878
296,-0.65878
297,0.3984
298,1.808
299,1.808
300,1.4556
301,1.808
302,1.808
303,1.4556
304,1.4556
305,1.4556
306,1.4556
307,1.4556
308,1.4556
309,1.4556
310,1.4556
311,1.1913
312,1.4556
313,1.4556
314,0.2222
315,-0.57068
316,-0.65878
317,-0.65878
318,-0.65878
319,-0.65878
320,-0.65878
321,-0.65878
322,-0.65878
323,-0.65878
324,-0.65878
325,-0.65878
326,-0.65878
327,-0.65878
328,-0.65878
329,-0.65878
330,-0.65878
331,-0.65878
332,-0.39448
333,-0.48258
334,-0.65878
335,-0.65878
336,-0.65878
337,-0.65878
338,-0.65878
339,-0.65878
340,-0.65878
341,-0.65878
342,-0.48258
343,-0.65878
344,-0.65878
345,1.1913
346,1.808
347,1.808
348,1.808
349,1.808
350,1.4556
351,1.4556
352,1.808
353,1.4556
354,1.4556
355,1.4556
356,1.4556
357,1.4556
358,1.1913
359,1.4556
360,1.4556
361,1.1913
362,1.4556
363,1.1913
364,-0.39448
365,-0.65878
366,-0.65878
367,-0.65878
368,-0.65878
369,-0.65878
370,-0.65878
371,-0.65878
372,-0.65878
373,-0.65878
374,-0.65878
375,-0.65878
376,-0.65878
377,-0.65878
378,-0.65878
379,-0.65878
380,-0.65878
381,-0.65878
382,-0.65878
383,-0.65878
384,-0.65878
385,-0.65878
386,-0.65878
387,-0.65878
388,-0.65878
389,-0.65878
390,-0.65878
391,-0.65878
392,-0.65878
393,-0.65878
394,-0.65878
395,-0.65878
396,-0.65878
397,-0.65878
398,-0.65878
399,-0.65878
400,-0.65878
401,-0.65878
402,-0.65878
403,-0.65878
404,0.2222
405,1.808
406,1.808
407,1.4556
408,1.808
409,1.808
410,1.4556
411,1.4556
412,1.4556
413,1.4556
414,1.808
415,1.4556
416,1.808
417,1.4556
418,1.4556
419,1.4556
420,1.4556
421,1.1913
422,1.4556
423,1.4556
424,1.1913
425,1.4556
426,0.66269
427,-0.57068
428,-0.65878
429,-0.65878
430,-0.65878
431,-0.65878
432,-0.65878
433,-0.65878
434,-0.65878
435,-0.65878
436,-0.65878
437,-0.65878
438,-0.65878
439,-0.65878
440,-0.65878
441,-0.65878
442,-0.65878
443,-0.65878
444,-0.65878
445,-0.65878
446,-0.65878
447,-0.65878
448,-0.65878
449,-0.65878
450,-0.65878
451,-0.65878
452,-0.65878
453,-0.65878
454,-0.65878
455,-0.65878
456,-0.65878
457,-0.65878
458,-0.65878
459,-0.65878
460,-0.65878
461,-0.65878
462,-0.65878
463,-0.65878
464,-0.65878
465,-0.65878
466,-0.65878
467,-0.65878
468,-0.65878
469,1.4556
470,1.808
471,1.808
472,1.4556
473,1.808
474,1.808
475,1.4556
476,1.4556
477,1.4556
478,1.808
479,1.4556
480,1.4556
481,1.4556
482,1.4556
483,1.1913
484,1.4556
485,1.4556
486,0.92699
487,-0.65878
488,-0.65878
489,-0.65878
490,-0.65878
491,-0.65878
492,-0.65878
493,-0.65878
494,-0.65878
495,-0.65878
496,-0.65878
497,-0.65878
498,-0.65878
499,-0.65878
500,-0.65878
501,-0.65878
502,-0.65878
503,-0.65878
504,-0.65878
505,-0.65878
506,-0.65878
507,-0.65878
508,-0.65878
509,-0.65878
510,-0.65878
511,-0.65878
512,-0.65878
513,-0.65878
514,-0.65878
515,-0.65878
516,-0.65878
517,-0.65878
518,-0.65878
519,-0.65878
520,-0.65878
521,-0.65878
522,-0.65878
523,-0.65878
524,-0.65878
525,-0.65878
526,-0.65878
527,-0.65878
528,-0.65878
529,-0.65878
530,-0.65878
531,1.4556
532,1.808
533,1.808
534,1.808
535,1.4556
536,1.808
537,1.4556
538,1.4556
539,1.4556
540,1.4556
541,1.4556
542,1.4556
543,1.4556
544,1.4556
545,1.4556
546,1.4556
547,1.1913
548,0.046007
549,-0.57068
550,-0.65878
551,-0.65878
552,-0.65878
553,-0.65878
554,-0.65878
555,-0.65878
556,-0.65878
557,-0.65878
558,-0.65878
559,-0.65878
560,-0.65878
561,-0.65878
562,-0.65878
563,-0.65878
564,-0.65878
565,-0.65878
566,-0.65878
567,-0.65878
568,-0.65878
569,-0.65878
570,-0.65878
571,-0.65878
572,-0.65878
573,-0.65878
574,-0.65878
575,-0.65878
576,-0.65878
577,-0.65878
578,-0.65878
579,-0.65878
580,-0.65878
581,-0.65878
582,-0.65878
583,-0.65878
584,-0.65878
585,-0.65878
586,-0.65878
587,-0.65878
588,-0.65878
589,0.046007
590,1.4556
591,1.808
592,1.808
593,1.808
594,1.4556
595,1.808
596,1.4556
597,1.4556
598,1.4556
599,1.4556
600,1.4556
601,1.4556
602,1.4556
603,1.4556
604,1.1913
605,1.4556
606,-0.13019
607,-0.65878
608,-0.65878
609,-0.65878
610,-0.65878
611,-0.65878
612,-0.65878
613,-0.65878
614,-0.65878
615,-0.65878
616,-0.65878
617,-0.65878
618,-0.65878
619,-0.65878
620,-0.65878
621,-0.65878
622,-0.65878
623,-0.65878
624,-0.65878
625,-0.65878
626,-0.65878
627,-0.65878
628,-0.65878
629,-0.65878
630,-0.65878
631,-0.65878
632,-0.65878
633,-0.65878
634,-0.65878
635,-0.65878
636,-0.65878
637,-0.65878
638,-0.65878
639,-0.65878
640,-0.65878
641,-0.65878
642,-0.65878
643,-0.65878
644,-0.65878
645,-0.65878
646,-0.65878
647,-0.65878
648,-0.65878
649,-0.65878
650,-0.65878
651,0.92699
652,1.808
653,1.808
654,1.808
655,1.4556
656,1.808
657,1.4556
658,1.4556
659,1.808
660,1.4556
661,1.4556
662,1.4556
663,1.4556
664,1.1913
665,1.4556
666,1.4556
667,1.4556
668,-0.65878
669,-0.65878
670,-0.65878
671,-0.65878
672,-0.65878
673,-0.65878
674,-0.65878
675,-0.65878
676,-0.65878
677,-0.65878
678,-0.65878
679,-0.65878
680,-0.65878
681,-0.65878
682,-0.65878
683,-0.65878
684,-0.65878
685,-0.65878
686,-0.65878
687,-0.65878
688,-0.65878
689,-0.65878
690,-0.65878
691,-0.65878
692,-0.65878
693,-0.65878
694,-0.65878
695,-0.65878
696,-0.65878
697,-0.65878
698,-0.65878
699,-0.65878
700,-0.65878
701,-0.65878
702,-0.65878
703,-0.65878
704,-0.65878
705,-0.65878
706,-0.65878
707,-0.65878
708,-0.65878
709,-0.65878
710,-0.65878
711,-0.65878
712,-0.65878
713,-0.65878
714,-0.13019
715,1.4556
716,2.1604
717,1.808
718,1.4556
719,1.808
