time,value
0,2.2959
1,3.3144
2,4.0952
3,4.4246
4,4.1874
5,3.4163
6,2.2922
7,1.0882
8,0.080457
9,-0.5423600000000001
10,-0.7326699999999999
11,-0.58263
12,-0.27111
13,0.015487
14,0.15389
15,0.11797
16,-0.033108
17,-0.20025
18,-0.29786
19,-0.29015
20,-0.19699999999999998
21,-0.07231599999999999
22,0.029501999999999997
23,0.080109
24,0.08441799999999999
25,0.068877
26,0.06049500000000001
27,0.07005399999999999
28,0.08759199999999999
29,0.091315
30,0.062666
31,-0.0015691
32,-0.087157
33,-0.17006
34,-0.22888000000000003
35,-0.25445999999999996
36,-0.25255
37,-0.23865999999999998
38,-0.22906999999999997
39,-0.23288000000000003
40,-0.24941
41,-0.27092
42,-0.28969
43,-0.29786
44,-0.29579
45,-0.28917
46,-0.28622
47,-0.28713
48,-0.29100000000000004
49,-0.29719
50,-0.30424
51,-0.31035999999999997
52,-0.31453000000000003
53,-0.31699
54,-0.31886
55,-0.32113
56,-0.3242
57,-0.32800999999999997
58,-0.33195
59,-0.33514
60,-0.33668000000000003
61,-0.33666999999999997
62,-0.33599
63,-0.33598
64,-0.33755
65,-0.34168000000000004
66,-0.34864
67,-0.35824
68,-0.36834
69,-0.37725
70,-0.38348000000000004
71,-0.38656
72,-0.38582
73,-0.38205
74,-0.3767
75,-0.37146
76,-0.36705
77,-0.36391
78,-0.36234
79,-0.36279
80,-0.36553
81,-0.37076
82,-0.37836
83,-0.38756999999999997
84,-0.39675
85,-0.40412
86,-0.40876
87,-0.41123000000000004
88,-0.41331
89,-0.4172
90,-0.42446000000000006
91,-0.43478999999999995
92,-0.44573
93,-0.4535
94,-0.45516
95,-0.45024
96,-0.4414
97,-0.43341999999999997
98,-0.43121000000000004
