d3mIndex,time,value
0,0,6317.7000
1,1,5934.7000
2,2,5850.5000
3,3,5234.4000
4,4,5257.2000
5,5,5585.6000
6,6,6285.8000
7,7,6249.3000
8,8,5700.8000
9,9,5545.9000
10,10,5646.4000
11,11,6297.8000
12,12,6723.7000
13,13,5943.1000
14,14,5975.6000
15,15,5436.5000
16,16,5475.2000
17,17,5942.1000
18,18,6706.6000
19,19,6552.8000
20,20,5933.2000
21,21,5878.5000
22,22,5829.3000
23,23,6457.8000
24,24,6835.8000
25,25,5945.6000
26,26,5795.8000
27,27,5302.4000
28,28,5459.0000
29,29,5573.5000
30,30,6353.2000
31,31,6324.2000
32,32,5649.1000
33,33,5476.4000
34,34,5652.9000
35,35,5988.1000
36,36,6277.4000
37,37,5447.2000
38,38,5522.3000
39,39,5255.5000
40,40,5410.7000
41,41,5804.9000
42,42,6926.6000
43,43,7273.6000
44,44,6308.5000
45,45,6019.8000
46,46,6115.0000
47,47,7023.5000
48,48,7159.3000
49,49,6271.8000
50,50,6480.2000
51,51,5867.8000
52,52,5993.8000
53,53,6649.6000
54,54,7020.0000
55,55,7334.3000
56,56,6391.0000
57,57,6439.4000
58,58,6432.4000
59,59,6780.6000
60,60,7456.0000
61,61,6552.9000
62,62,6464.0000
63,63,6148.6000
64,64,6457.5000
65,65,6678.3000
66,66,7396.1000
67,67,7289.8000
68,68,6647.4000
69,69,6476.4000
70,70,6458.9000
71,71,7487.4000
72,72,7560.9000
73,73,6568.8000
74,74,6429.4000
75,75,5867.3000
76,76,6137.8000
77,77,6803.3000
78,78,7662.5000
79,79,7043.4000
80,80,6513.6000
81,81,6297.0000
82,82,6343.8000
83,83,6950.3000
84,84,7240.8000
85,85,6286.4000
86,86,6358.8000
87,87,6125.6000
88,88,6576.1000
89,89,7202.1000
90,90,8025.2000
91,91,7972.2000
92,92,6876.8000
93,93,6708.9000
94,94,6642.1000
95,95,7418.7000
96,96,7877.7000
97,97,7178.2000
98,98,6929.6000
99,99,6398.2000
100,100,6615.9000
101,101,7474.0000
102,102,8163.7000
103,103,8510.7000
104,104,7122.1000
105,105,7000.9000
106,106,6974.2000
107,107,7779.2000
108,108,7749.1000
109,109,7322.0000
110,110,7273.5000
111,111,6614.0000
112,112,6827.0000
113,113,7336.1000
114,114,7960.3000
115,115,8014.8000
116,116,7239.3000
117,117,7118.0000
118,118,7154.3000
119,119,8341.0000
120,120,7689.0000
121,121,6825.2000
122,122,7117.1000
123,123,6769.0000
124,124,6900.7000
125,125,7490.8000
126,126,8126.0000
127,127,8295.1000
128,128,7646.9000
129,129,7498.2000
130,130,7172.9000
131,131,7940.5000
132,132,8173.4000
133,133,6830.9000
134,134,6932.1000
135,135,6439.4000
136,136,7021.4000
137,137,7471.6000
138,138,8124.5000
139,139,8124.4000
140,140,7394.3000
