time,value
0,0.34223000000000003
1,0.34223000000000003
2,0.34223000000000003
3,0.34223000000000003
4,0.34223000000000003
5,0.34223000000000003
6,0.34223000000000003
7,0.34223000000000003
8,0.34223000000000003
9,0.34223000000000003
10,0.34223000000000003
11,0.34223000000000003
12,0.34223000000000003
13,0.34223000000000003
14,0.34223000000000003
15,0.34223000000000003
16,0.34223000000000003
17,0.34223000000000003
18,0.34223000000000003
19,0.34223000000000003
20,0.34223000000000003
21,0.34223000000000003
22,0.34223000000000003
23,0.34223000000000003
24,0.34223000000000003
25,0.34223000000000003
26,0.34223000000000003
27,0.34223000000000003
28,0.34223000000000003
29,0.34223000000000003
30,0.34223000000000003
31,0.34223000000000003
32,0.34223000000000003
33,0.34223000000000003
34,0.34223000000000003
35,0.34223000000000003
36,0.34223000000000003
37,0.34223000000000003
38,0.34223000000000003
39,0.34223000000000003
40,0.34223000000000003
41,0.34223000000000003
42,0.34223000000000003
43,0.34223000000000003
44,0.34223000000000003
45,0.34223000000000003
46,0.34223000000000003
47,0.34223000000000003
48,0.34223000000000003
49,0.32784
50,0.287
51,0.20947
52,0.12684
53,0.044216000000000005
54,-0.038411
55,-0.12104000000000001
56,-0.20365999999999998
57,-0.28629
58,-0.36891999999999997
59,-0.45069
60,-0.50732
61,-0.5323100000000001
62,-0.5323100000000001
63,-0.5323100000000001
64,-0.5323100000000001
65,-0.5323100000000001
66,-0.5323100000000001
67,-0.5323100000000001
68,-0.5323100000000001
69,-0.5323100000000001
70,-0.5323100000000001
71,-0.5323100000000001
72,-0.5323100000000001
73,-0.5323100000000001
74,-0.5323100000000001
75,-0.5323100000000001
76,-0.5323100000000001
77,-0.52245
78,-0.49367
79,-0.41812
80,-0.33549
81,-0.25287
82,-0.24286
83,-0.2408
84,-0.2408
85,-0.2408
86,-0.2408
87,-0.2408
88,-0.2408
89,-0.2408
90,-0.2408
91,-0.2408
92,-0.27929
93,-0.34571
94,-0.42833000000000004
95,-0.46976
96,-0.47103999999999996
97,-0.38841
98,-0.30579
99,-0.26075
100,-0.34152
101,-0.42368999999999996
102,-0.49246
103,-0.52588
104,-0.5323100000000001
105,-0.5323100000000001
106,-0.5323100000000001
107,-0.5323100000000001
108,-0.5323100000000001
109,-0.5323100000000001
110,-0.59319
111,-0.66693
112,-0.74955
113,-0.8321799999999999
114,-0.91481
115,-0.99741
116,-1.0782
117,-1.1153
118,-1.1153
119,-1.1153
120,-1.0846
121,-1.0290000000000001
122,-0.94637
123,-0.86375
124,-0.78112
125,-0.6984899999999999
126,-0.61587
127,-0.5486
128,-0.53561
129,-0.5323100000000001
130,-0.5323100000000001
131,-0.5323100000000001
132,-0.5323100000000001
133,-0.5323100000000001
134,-0.5323100000000001
135,-0.5323100000000001
136,-0.5323100000000001
137,-0.5323100000000001
138,-0.5323100000000001
139,-0.5323100000000001
140,-0.5323100000000001
141,-0.5323100000000001
142,-0.5323100000000001
143,-0.5323100000000001
144,-0.5323100000000001
145,-0.5323100000000001
146,-0.5323100000000001
147,-0.5323100000000001
148,-0.55555
149,-0.6000800000000001
150,-0.68271
151,-0.76063
152,-0.82383
153,-0.82383
154,-0.82383
155,-0.81167
156,-0.7541100000000001
157,-0.67807
158,-0.59544
159,-0.5128199999999999
160,-0.43018999999999996
161,-0.34756
162,-0.26494
163,-0.24550999999999998
164,-0.2408
165,-0.2408
166,-0.2408
167,-0.2408
168,-0.2408
169,-0.2408
170,-0.2408
171,-0.2408
172,-0.2408
173,-0.2408
174,-0.2408
175,-0.2408
176,-0.20889000000000002
177,-0.14239000000000002
178,0.022862
179,0.18812
180,0.34165
181,0.42891999999999997
182,0.51305
183,0.58649
184,0.62363
185,0.63374
186,0.6370399999999999
187,0.65003
188,0.7173
189,0.79992
190,0.88255
191,1.0701
192,1.2929
193,1.5408
194,1.7346
195,1.8787
196,1.9613
197,2.044
198,2.1266
199,2.2092
200,2.2918
201,2.3745
202,2.4571
203,2.5397
204,2.6135
205,2.6743
206,2.6743
207,2.6743
208,2.6651
209,2.5991
210,2.5221
211,2.4459
212,2.3967
213,2.3828
214,2.3828
215,2.3828
216,2.3828
217,2.3828
218,2.3828
219,2.3828
220,2.3828
221,2.3828
222,2.3666
223,2.3225
224,2.2398
225,2.1572
226,2.0436
227,1.8923
228,1.7274
229,1.5803
230,1.4526
231,1.37
232,1.2853
233,1.1926
234,1.0274
235,0.8621200000000001
236,0.70395
237,0.59254
238,0.50005
239,0.41743
240,0.3348
241,0.25217
242,0.16955
243,0.086921
244,0.058664
245,0.050713999999999995
246,0.050713999999999995
247,0.019044
248,-0.034697000000000006
249,-0.11732000000000001
250,-0.19995
251,-0.28258
252,-0.3652
253,-0.44783
254,-0.53046
255,-0.6130800000000001
256,-0.69571
257,-0.77833
258,-0.8609600000000001
259,-0.9435899999999999
260,-1.0262
261,-1.1036
262,-1.112
263,-1.1153
264,-1.1153
265,-1.1153
266,-1.1153
267,-1.1153
268,-1.1153
269,-1.1153
270,-1.1153
271,-1.1153
272,-1.1153
273,-1.1153
274,-1.1153
275,-1.1153
276,-1.1153
277,-1.1153
278,-1.1153
279,-1.0859999999999999
280,-1.0090000000000001
281,-0.9268799999999999
282,-0.8635
283,-0.8254299999999999
284,-0.82383
285,-0.82383
286,-0.82383
287,-0.82383
288,-0.82383
289,-0.82383
290,-0.82383
291,-0.82383
292,-0.82383
293,-0.82383
294,-0.82383
295,-0.82383
296,-0.82383
297,-0.82383
298,-0.82383
299,-0.82383
300,-0.82383
301,-0.82383
302,-0.82383
303,-0.82383
304,-0.82383
305,-0.82383
306,-0.82383
307,-0.84793
308,-0.9129200000000001
309,-0.99372
310,-1.0763
311,-1.159
312,-1.2416
313,-1.3242
314,-1.4069
