time,value
0,-1.1452
1,-1.1294
2,-1.1102
3,-1.0889
4,-1.0668
5,-1.0462
6,-1.0267
7,-1.0077
8,-0.9880200000000001
9,-0.96629
10,-0.9425399999999999
11,-0.9156700000000001
12,-0.8850100000000001
13,-0.8505299999999999
14,-0.81262
15,-0.7730600000000001
16,-0.73244
17,-0.69077
18,-0.6481600000000001
19,-0.6046699999999999
20,-0.5614600000000001
21,-0.51907
22,-0.47731999999999997
23,-0.43642
24,-0.39657
25,-0.35875999999999997
26,-0.32339
27,-0.28936
28,-0.25569000000000003
29,-0.22133000000000003
30,-0.18605
31,-0.14997
32,-0.11208
33,-0.072285
34,-0.030888
35,0.010919
36,0.051276
37,0.089763
38,0.12550999999999998
39,0.15777
40,0.18564
41,0.20783000000000001
42,0.22482
43,0.23699
44,0.24506
45,0.24981
46,0.25156
47,0.25201
48,0.25248000000000004
49,0.25415
50,0.25783
51,0.26325
52,0.27098
53,0.28097
54,0.29294000000000003
55,0.30644
56,0.32028
57,0.33447
58,0.34885
59,0.36344
60,0.37835
61,0.3932
62,0.40858
63,0.42483000000000004
64,0.44213
65,0.46045
66,0.47905
67,0.49788999999999994
68,0.51671
69,0.53497
70,0.55213
71,0.56711
72,0.5797399999999999
73,0.58986
74,0.59704
75,0.60078
76,0.60004
77,0.5946199999999999
78,0.58455
79,0.5694600000000001
80,0.54913
81,0.52299
82,0.49138000000000004
83,0.45538999999999996
84,0.41558999999999996
85,0.37261
86,0.32658000000000004
87,0.27807
88,0.22851999999999997
89,0.17840999999999999
90,0.12807000000000002
91,0.077445
92,0.026619999999999998
93,-0.022784
94,-0.07031799999999999
95,-0.11564
96,-0.1588
97,-0.20021
98,-0.23836999999999997
99,-0.27325
100,-0.30504000000000003
101,-0.3342
102,-0.36198
103,-0.38702
104,-0.40953
105,-0.42987
106,-0.44853000000000004
107,-0.4674
108,-0.48507
109,-0.5019100000000001
110,-0.5183399999999999
111,-0.53471
112,-0.5526800000000001
113,-0.5702699999999999
114,-0.58691
115,-0.60213
116,-0.61551
117,-0.6282800000000001
118,-0.63847
119,-0.6453899999999999
120,-0.64898
121,-0.64946
122,-0.64896
123,-0.64658
124,-0.64193
125,-0.63539
126,-0.62747
127,-0.62058
128,-0.61434
129,-0.60792
130,-0.60142
131,-0.59501
132,-0.59059
133,-0.5879800000000001
134,-0.58531
135,-0.58206
136,-0.5778300000000001
137,-0.57408
138,-0.57143
139,-0.5676399999999999
140,-0.56219
141,-0.55477
142,-0.54673
143,-0.5398
144,-0.53157
145,-0.5216
146,-0.50963
147,-0.49672
148,-0.48553999999999997
149,-0.47373000000000004
150,-0.46098999999999996
151,-0.44703000000000004
152,-0.43233999999999995
153,-0.41988000000000003
154,-0.40671
155,-0.39193
156,-0.37456
157,-0.35412
158,-0.33343
159,-0.30949
160,-0.28151
161,-0.24878000000000003
162,-0.21093
163,-0.17071
164,-0.12600999999999998
165,-0.076436
166,-0.021658
167,0.03851
168,0.10246
169,0.171
170,0.24406
171,0.32118
172,0.4017
173,0.48411000000000004
174,0.56818
175,0.65361
176,0.74019
177,0.8281
178,0.9174899999999999
179,1.0097
180,1.1059
181,1.2072
182,1.3143
183,1.4269
184,1.5446
185,1.666
186,1.7889
187,1.9102
188,2.0264
189,2.1344
190,2.2318
191,2.3165
192,2.3872
193,2.4439
194,2.4875
195,2.5201
196,2.5438
197,2.5608
198,2.573
199,2.5818
200,2.5882
201,2.5919
202,2.5914
203,2.5844
204,2.568
205,2.5395
206,2.4956
207,2.4329
208,2.3486
209,2.2406
210,2.1085
211,1.9525
212,1.774
213,1.5755
214,1.3605
215,1.1348
216,0.9039299999999999
217,0.67364
218,0.44966000000000006
219,0.23668000000000003
220,0.040227
221,-0.13642
222,-0.29147
223,-0.42448
224,-0.53686
225,-0.62897
226,-0.70312
227,-0.7623300000000001
228,-0.8097300000000001
229,-0.84905
230,-0.8812700000000001
231,-0.9079999999999999
232,-0.9309299999999999
233,-0.9512799999999999
234,-0.97075
235,-0.9882200000000001
236,-1.0032
237,-1.0162
238,-1.0278
239,-1.0395
240,-1.0501
241,-1.0590000000000002
242,-1.0668
243,-1.074
244,-1.0822
245,-1.0902
246,-1.0964
247,-1.101
248,-1.1046
249,-1.1086
250,-1.1126
251,-1.1148
252,-1.1159999999999999
253,-1.1168
254,-1.1186
255,-1.1217
256,-1.1235
257,-1.1245
258,-1.1251
259,-1.1264
260,-1.1293
261,-1.1312
262,-1.1329
263,-1.1349
264,-1.1379
265,-1.1431
266,-1.1477
267,-1.1515
268,-1.1545
269,-1.1567
