time,value
0,1.306
1,1.306
2,1.306
3,1.306
4,1.306
5,1.306
6,1.306
7,1.306
8,1.306
9,1.306
10,1.306
11,1.306
12,1.306
13,1.306
14,1.306
15,1.306
16,1.306
17,1.306
18,1.306
19,1.306
20,1.306
21,1.306
22,1.306
23,1.306
24,1.306
25,1.306
26,1.306
27,1.306
28,1.306
29,1.306
30,1.306
31,1.306
32,1.306
33,1.306
34,1.306
35,1.306
36,1.306
37,1.306
38,1.306
39,1.306
40,1.306
41,1.306
42,1.306
43,1.306
44,1.306
45,1.306
46,1.306
47,1.306
48,1.306
49,1.306
50,1.306
51,1.306
52,1.306
53,1.306
54,1.306
55,1.306
56,1.306
57,1.306
58,1.306
59,1.306
60,1.306
61,1.306
62,1.306
63,1.306
64,1.306
65,1.306
66,1.306
67,1.306
68,1.306
69,1.306
70,1.306
71,1.306
72,1.306
73,1.306
74,1.306
75,1.306
76,1.3043
77,1.3026
78,1.2746
79,1.2461
80,1.2175
81,1.189
82,1.1605
83,1.1333
84,1.128
85,1.1232
86,1.1232
87,1.1232
88,1.1232
89,1.1211
90,1.1048
91,1.0865
92,1.058
93,1.0295
94,1.001
95,0.9743799999999999
96,0.9551700000000001
97,0.9404299999999999
98,0.9404299999999999
99,0.9404299999999999
100,0.9404299999999999
101,0.9404299999999999
102,0.9404299999999999
103,0.9404299999999999
104,0.9404299999999999
105,0.9404299999999999
106,0.9404299999999999
107,0.9404299999999999
108,0.9404299999999999
109,0.92211
110,0.8743799999999999
111,0.82283
112,0.76578
113,0.70873
114,0.65168
115,0.57913
116,0.48831
117,0.38622
118,0.27212
119,0.15802
120,0.043920999999999995
121,-0.07547000000000001
122,-0.19947
123,-0.33389
124,-0.47652
125,-0.6191399999999999
126,-0.76177
127,-0.8972899999999999
128,-1.0283
129,-1.0942
130,-1.1227
131,-1.1512
132,-1.1798
133,-1.2083
134,-1.2368
135,-1.1784
136,-1.0847
137,-0.976
138,-0.8619
139,-0.7478
140,-0.6337
141,-0.53333
142,-0.43668999999999997
143,-0.34903
144,-0.26345
145,-0.17787999999999998
146,-0.092301
147,-0.051870000000000006
148,-0.018688
149,-0.065523
150,-0.12257
151,-0.17962
152,-0.23667
153,-0.30682
154,-0.37784
155,-0.5452100000000001
156,-0.71636
157,-0.88751
158,-1.0587
159,-1.2298
160,-1.3981
161,-1.4942
162,-1.5896
163,-1.6752
164,-1.7607
165,-1.8463
166,-1.9217
167,-1.9169999999999998
168,-1.9051
169,-1.8481
170,-1.791
171,-1.734
172,-1.6748
173,-1.6067
174,-1.5349
175,-1.4493
176,-1.3637
177,-1.2781
178,-1.1926
179,-1.107
180,-1.0214
181,-0.9358299999999999
182,-0.85026
183,-0.76468
184,-0.67911
185,-0.59353
186,-0.52664
187,-0.49228999999999995
188,-0.46021999999999996
189,-0.43168999999999996
190,-0.40317
191,-0.37464000000000003
192,-0.35431999999999997
193,-0.34442
194,-0.33913000000000004
195,-0.33913000000000004
196,-0.33913000000000004
197,-0.33913000000000004
198,-0.33913000000000004
199,-0.33913000000000004
200,-0.33913000000000004
201,-0.33913000000000004
202,-0.33913000000000004
203,-0.33913000000000004
204,-0.34464
205,-0.35395
206,-0.39269
207,-0.44974
208,-0.50679
209,-0.56384
210,-0.6208899999999999
211,-0.67794
212,-0.7349899999999999
213,-0.79204
214,-0.84909
215,-0.90614
216,-0.96319
217,-1.0202
218,-1.0626
219,-1.1004
220,-1.1309
221,-1.1594
222,-1.1879
223,-1.2164
224,-1.2346
225,-1.2509
226,-1.2531
227,-1.2531
228,-1.2531
229,-1.2531
230,-1.2483
231,-1.2431
232,-1.2158
233,-1.1873
234,-1.1588
235,-1.1303
236,-1.1017
237,-1.0732
238,-1.0447
239,-1.0162
240,-0.98764
241,-0.9591200000000001
242,-0.9305899999999999
243,-0.9002
244,-0.85188
245,-0.80252
246,-0.74547
247,-0.68842
248,-0.63137
249,-0.5743199999999999
250,-0.51727
251,-0.46021999999999996
252,-0.40317
253,-0.34612
254,-0.28907
255,-0.23487
256,-0.18947
257,-0.15634
258,-0.15634
259,-0.15634
260,-0.15634
261,-0.15634
262,-0.15634
263,-0.15634
264,-0.15634
265,-0.15634
266,-0.15634
267,-0.15634
268,-0.15634
269,-0.16492
270,-0.1853
271,-0.20931
272,-0.23784
273,-0.26636
274,-0.29489
275,-0.32341
276,-0.35194000000000003
277,-0.38045999999999996
278,-0.40899
279,-0.43751
280,-0.46603999999999995
281,-0.49456000000000006
282,-0.5230899999999999
283,-0.55162
284,-0.58014
285,-0.6086699999999999
286,-0.6371899999999999
287,-0.66572
288,-0.69424
289,-0.72277
290,-0.75129
291,-0.77982
292,-0.80834
293,-0.8368700000000001
294,-0.86539
295,-0.86255
296,-0.84916
297,-0.82406
298,-0.7955300000000001
299,-0.7670100000000001
300,-0.73848
301,-0.70996
302,-0.68143
303,-0.65291
304,-0.62438
305,-0.5958600000000001
306,-0.56733
307,-0.53881
308,-0.5102800000000001
309,-0.48176
310,-0.45323
311,-0.42471000000000003
312,-0.39618000000000003
313,-0.36766
314,-0.33913000000000004
