time,value
0,0.05922
1,0.11615
2,0.20621
3,0.29846999999999996
4,0.36209
5,0.35447
6,0.25390999999999997
7,0.066001
8,-0.17472000000000001
9,-0.42389
10,-0.62116
11,-0.7197
12,-0.70706
13,-0.57509
14,-0.34922
15,-0.06493099999999999
16,0.23997
17,0.52765
18,0.77979
19,0.97729
20,1.1034
21,1.1453
22,1.0842
23,0.9110799999999999
24,0.61832
25,0.21677
26,-0.25633
27,-0.75944
28,-1.2428
29,-1.6511
30,-1.9313
31,-2.0497
32,-1.9746
33,-1.7046
34,-1.2595
35,-0.6700699999999999
36,0.0022103
37,0.67742
38,1.2894
39,1.775
40,2.0812
41,2.1829
42,2.0896
43,1.8241
44,1.4349
45,0.9737
46,0.49746
47,0.051275
48,-0.33096
49,-0.6342800000000001
50,-0.85135
51,-0.99271
52,-1.069
53,-1.0938
54,-1.069
55,-1.0089
56,-0.9348799999999999
57,-0.8539
58,-0.75889
59,-0.6466
60,-0.50983
61,-0.33445
62,-0.10902
63,0.15967
64,0.45178999999999997
65,0.74455
66,1.0003
67,1.1726
68,1.2429
69,1.1979
70,1.0446
71,0.81481
72,0.53593
73,0.24928000000000003
74,-0.018331
75,-0.25216
76,-0.44991000000000003
77,-0.61522
78,-0.75338
79,-0.8705200000000001
80,-0.95263
81,-0.9921399999999999
82,-0.9681700000000001
83,-0.8732200000000001
84,-0.69463
85,-0.44837
86,-0.1632
87,0.12169
88,0.37532
89,0.57424
90,0.7098399999999999
91,0.78369
92,0.81192
93,0.8133199999999999
94,0.8056399999999999
95,0.79062
96,0.74457
97,0.65476
98,0.5131899999999999
99,0.31413
100,0.079082
101,-0.1684
102,-0.40352
103,-0.60048
104,-0.73554
105,-0.8122699999999999
106,-0.8456899999999999
107,-0.86172
108,-0.87697
109,-0.89689
110,-0.8986299999999999
111,-0.86264
112,-0.75963
113,-0.56691
114,-0.28449
115,0.073963
116,0.46501000000000003
117,0.83829
118,1.1417
119,1.3281
120,1.375
121,1.2815
122,1.0635
123,0.7568699999999999
124,0.41297
125,0.083351
126,-0.19301
127,-0.39082
128,-0.499
129,-0.5272
130,-0.49053
131,-0.42053999999999997
132,-0.33301
133,-0.25636
134,-0.20390999999999998
135,-0.17325
136,-0.16704000000000002
137,-0.18332
138,-0.21505
139,-0.25438
140,-0.30445
141,-0.35515
142,-0.39115
143,-0.39377
144,-0.34818000000000005
145,-0.25149
146,-0.10151
147,0.08711100000000001
148,0.28792
149,0.47426999999999997
150,0.62043
151,0.70817
152,0.73639
153,0.71496
154,0.6530600000000001
155,0.5572699999999999
156,0.42944
157,0.28223000000000004
158,0.10848
159,-0.091764
160,-0.30896
161,-0.5243399999999999
162,-0.70736
163,-0.81929
164,-0.8284799999999999
165,-0.7247
166,-0.51754
167,-0.24251999999999999
168,0.05726799999999999
169,0.32905999999999996
170,0.52659
171,0.62131
172,0.60573
173,0.49293000000000003
174,0.30399
175,0.076731
176,-0.15573
177,-0.36754000000000003
178,-0.53214
179,-0.6280100000000001
180,-0.6363
181,-0.54082
182,-0.33589
183,-0.045182
184,0.29746
185,0.62043
186,0.8592700000000001
187,0.9638899999999999
188,0.90156
189,0.67301
190,0.31443000000000004
191,-0.10957
192,-0.51274
193,-0.81955
194,-0.97651
195,-0.97254
196,-0.83129
197,-0.58713
198,-0.30048
199,-0.029211
200,0.18913
201,0.33474
202,0.42399
203,0.4831
204,0.5405
205,0.5987600000000001
206,0.65169
207,0.68303
208,0.6752
209,0.6069399999999999
210,0.46966
211,0.2646
212,0.016212999999999998
213,-0.25173
214,-0.51164
215,-0.74416
216,-0.92617
217,-1.0457
218,-1.0936
219,-1.0616
220,-0.9375700000000001
221,-0.7179399999999999
222,-0.40421999999999997
223,-0.012149
224,0.40693
225,0.80338
226,1.1065
227,1.272
228,1.2674
229,1.0835
230,0.7450899999999999
231,0.29448
232,-0.19783
233,-0.6621600000000001
234,-1.0389
235,-1.2828
236,-1.3687
237,-1.2813
238,-1.0159
239,-0.59114
240,-0.053087999999999996
241,0.54675
242,1.1441
243,1.6676
244,2.0267
245,2.1767
246,2.0877
247,1.7598
248,1.2258
249,0.54668
250,-0.19791
251,-0.93973
252,-1.6179
253,-2.1721
254,-2.5679
255,-2.7811
256,-2.7939999999999996
257,-2.5864
258,-2.1630000000000003
259,-1.5421
260,-0.76641
261,0.10214
262,0.97925
263,1.7811
264,2.4306
265,2.8599
266,3.0439
267,2.9788
268,2.6860000000000004
269,2.2013
270,1.5617
271,0.81363
272,0.0096551
273,-0.78655
274,-1.4939
275,-2.0287
276,-2.3213
277,-2.3397
278,-2.0871
279,-1.6237
280,-1.0522
281,-0.48476
282,-0.031424
283,0.24156
284,0.32868
285,0.27426
286,0.15875
287,0.062473
288,0.042604
289,0.12328
290,0.27885
291,0.46299999999999997
292,0.61937
293,0.7074699999999999
294,0.70628
295,0.62624
296,0.49636
297,0.34863
298,0.20124
299,0.06664199999999999
300,-0.050775
301,-0.15018
302,-0.22519
303,-0.26048000000000004
304,-0.23988
305,-0.15905
306,-0.019382
307,0.14770999999999998
308,0.29852
309,0.38532
310,0.36635
311,0.23525
312,0.01348
313,-0.26097
314,-0.53594
315,-0.75359
316,-0.8795799999999999
317,-0.91358
318,-0.8612299999999999
319,-0.7348100000000001
320,-0.54685
321,-0.31033
322,-0.041888999999999996
323,0.24054
324,0.5142399999999999
325,0.76097
326,0.94421
327,1.0379
328,1.0332
329,0.9430200000000001
330,0.79557
331,0.63081
332,0.47803999999999996
333,0.35255
334,0.24233000000000002
335,0.12683
336,-0.022829
337,-0.2275
338,-0.48598
339,-0.7785
340,-1.0656
341,-1.3013
342,-1.4446
343,-1.4711
344,-1.3753
345,-1.1514
346,-0.8122199999999999
347,-0.38145
348,0.11459000000000001
349,0.63695
350,1.1269
351,1.5102
352,1.7364
353,1.7685
354,1.5899
355,1.2361
356,0.78409
357,0.33376999999999996
358,-0.038937
359,-0.28094
360,-0.38495
361,-0.38902
362,-0.36444
363,-0.37032
364,-0.45698
365,-0.62376
366,-0.81558
367,-0.9690700000000001
368,-1.0259
369,-0.9496
370,-0.74142
371,-0.4383
372,-0.09878300000000001
373,0.21979
374,0.46378
375,0.60992
376,0.66337
377,0.63377
378,0.54084
379,0.39339
380,0.20002999999999999
381,-0.015050999999999998
382,-0.23021999999999998
383,-0.40013000000000004
384,-0.47178000000000003
385,-0.40178
386,-0.17806
387,0.17440999999999998
388,0.60355
389,1.0197
390,1.3241
391,1.4408
392,1.3305
393,0.99941
394,0.49396999999999996
395,-0.10196000000000001
396,-0.71633
397,-1.2694
398,-1.7028
399,-1.9782
400,-2.075
401,-1.9813
402,-1.6963
403,-1.2378
404,-0.65074
405,0.016432
406,0.6929
407,1.3
408,1.7729
409,2.0617
410,2.1447
411,2.0274
412,1.7472
413,1.3468
414,0.8687799999999999
415,0.36143000000000003
416,-0.14968
417,-0.63917
418,-1.0813
419,-1.4471
420,-1.7095
421,-1.8393
422,-1.8195
423,-1.6376
424,-1.2976
425,-0.83636
426,-0.29955
427,0.25637
428,0.78491
429,1.2241
430,1.5333
431,1.6811
432,1.6538
433,1.4645
434,1.1365
435,0.70958
436,0.23584000000000002
437,-0.23409000000000002
438,-0.65472
439,-0.9909600000000001
440,-1.2159
441,-1.3128
442,-1.2776
443,-1.107
444,-0.80933
445,-0.41915
446,0.032386
447,0.49291999999999997
448,0.90546
449,1.1984
450,1.3212
451,1.2575
452,1.0137
453,0.62946
454,0.16812
455,-0.29399000000000003
456,-0.6896399999999999
457,-0.97305
458,-1.1326
459,-1.1723
460,-1.1087
461,-0.9645299999999999
462,-0.75489
463,-0.49846
464,-0.20396
465,0.12070999999999998
466,0.46283
467,0.79038
468,1.0731
469,1.2886
470,1.403
471,1.3980000000000001
472,1.2628
473,0.99715
474,0.61783
475,0.16351
476,-0.33042
477,-0.81839
478,-1.2439
479,-1.5442
480,-1.6797
481,-1.6315
482,-1.3981
483,-1.0013
484,-0.48589
485,0.081081
486,0.63955
487,1.1338
488,1.5108
489,1.7381
490,1.7838
491,1.6388
492,1.3172
493,0.84844
494,0.28136
495,-0.32306999999999997
496,-0.8993700000000001
497,-1.3667
498,-1.6729
499,-1.7916
