time,value
0,-0.089334
1,-0.042419
2,-0.089334
3,-0.042419
4,-0.042419
5,-0.089334
6,-0.042419
7,-0.042419
8,-0.089334
9,-0.042419
10,-0.089334
11,-0.042419
12,-0.042419
13,-0.089334
14,-0.042419
15,-0.042419
16,-0.089334
17,-0.042419
18,-0.042419
19,-0.089334
20,-0.042419
21,-0.042419
22,-0.089334
23,-0.042419
24,-0.042419
25,-0.089334
26,-0.042419
27,-0.089334
28,-0.042419
29,-0.042419
30,-0.089334
31,-0.042419
32,-0.042419
33,-0.089334
34,-0.042419
35,-0.089334
36,-0.042419
37,-0.042419
38,-0.089334
39,-0.042419
40,-0.042419
41,-0.089334
42,-0.042419
43,-0.042419
44,-0.089334
45,-0.042419
46,-0.042419
47,-0.089334
48,-0.042419
49,-0.042419
50,-0.089334
51,-0.042419
52,-0.042419
53,-0.089334
54,-0.042419
55,-0.042419
56,-0.089334
57,-0.042419
58,-0.042419
59,-0.042419
60,-0.089334
61,-0.042419
62,-0.042419
63,-0.089334
64,-0.042419
65,-0.042419
66,-0.089334
67,-0.042419
68,-0.042419
69,-0.089334
70,-0.042419
71,-0.042419
72,-0.089334
73,-0.042419
74,-0.042419
75,-0.089334
76,-0.042419
77,-0.042419
78,-0.089334
79,-0.042419
80,-0.042419
81,-0.089334
82,-0.042419
83,-0.042419
84,-0.089334
85,-0.042419
86,-0.042419
87,-0.089334
88,-0.042419
89,-0.042419
90,-0.089334
91,-0.042419
92,-0.042419
93,-0.089334
94,-0.042419
95,-0.042419
96,-0.089334
97,-0.042419
98,-0.042419
99,-0.089334
100,-0.042419
101,-0.042419
102,-0.089334
103,-0.042419
104,-0.042419
105,-0.089334
106,-0.042419
107,-0.042419
108,-0.089334
109,-0.042419
110,-0.042419
111,-0.089334
112,-0.042419
113,-0.042419
114,-0.089334
115,-0.042419
116,-0.042419
117,-0.089334
118,-0.042419
119,-0.042419
120,-0.089334
121,-0.042419
122,-0.042419
123,-0.089334
124,-0.042419
125,-0.042419
126,-0.089334
127,-0.042419
128,-0.042419
129,-0.042419
130,-0.089334
131,-0.042419
132,-0.042419
133,-0.089334
134,-0.042419
135,-0.042419
136,-0.089334
137,-0.042419
138,-0.042419
139,-0.089334
140,-0.042419
141,-0.042419
142,-0.089334
143,-0.042419
144,-0.042419
145,-0.089334
146,-0.042419
147,-0.042419
148,-0.089334
149,-0.042419
150,-0.042419
151,-0.089334
152,-0.042419
153,-0.042419
154,-0.089334
155,-0.042419
156,-0.042419
157,-0.089334
158,-0.042419
159,-0.042419
160,-0.089334
161,-0.042419
162,-0.042419
163,-0.089334
164,-0.042419
165,-0.042419
166,-0.042419
167,-0.089334
168,-0.042419
169,-0.042419
170,-0.089334
171,-0.042419
172,-0.042419
173,-0.089334
174,-0.042419
175,-0.042419
176,-0.089334
177,-0.042419
178,-0.042419
179,-0.089334
180,-0.042419
181,-0.042419
182,-0.089334
183,-0.042419
184,-0.042419
185,-0.089334
186,-0.042419
187,-0.042419
188,-0.089334
189,-0.042419
190,-0.042419
191,-0.089334
192,-0.042419
193,-0.042419
194,-0.089334
195,-0.042419
196,-0.089334
197,-0.042419
198,-0.042419
199,-0.089334
200,-0.042419
201,-0.042419
202,-0.089334
203,-0.042419
204,-0.042419
205,-0.089334
206,-0.042419
207,-0.042419
208,-0.089334
209,-0.042419
210,-0.042419
211,-0.089334
212,-0.042419
213,-0.042419
214,-0.089334
215,-0.042419
216,-0.042419
217,-0.089334
218,-0.042419
219,-0.042419
220,-0.089334
221,-0.042419
222,-0.042419
223,-0.089334
224,-0.042419
225,-0.042419
226,-0.089334
227,-0.042419
228,-0.042419
229,-0.089334
230,-0.042419
231,-0.042419
232,-0.089334
233,-0.042419
234,-0.042419
235,-0.089334
236,-0.042419
237,-0.042419
238,-0.089334
239,-0.042419
240,-0.042419
241,-0.089334
242,-0.042419
243,-0.042419
244,-0.089334
245,-0.042419
246,-0.042419
247,-0.089334
248,-0.042419
249,-0.089334
250,-0.042419
251,-0.042419
252,-0.089334
253,-0.042419
254,-0.042419
255,-0.089334
256,-0.042419
257,-0.042419
258,-0.089334
259,-0.042419
260,-0.089334
261,-0.042419
262,-0.042419
263,-0.089334
264,-0.042419
265,-0.042419
266,-0.089334
267,-0.042419
268,-0.089334
269,-0.042419
270,-0.042419
271,-0.089334
272,-0.042419
273,-0.089334
274,-0.042419
275,-0.042419
276,-0.089334
277,-0.042419
278,-0.089334
279,-0.042419
280,-0.042419
281,-0.089334
282,-0.042419
283,-0.042419
284,-0.089334
285,-0.042419
286,-0.089334
287,-0.042419
288,-0.042419
289,-0.089334
290,-0.042419
291,-0.042419
292,-0.089334
293,-0.042419
294,-0.089334
295,-0.042419
296,-0.042419
297,-0.089334
298,-0.042419
299,-0.042419
300,-0.089334
301,-0.042419
302,-0.089334
303,-0.042419
304,-0.042419
305,-0.089334
306,-0.042419
307,-0.042419
308,-0.089334
309,-0.042419
310,-0.089334
311,-0.042419
312,-0.042419
313,-0.089334
314,-0.042419
315,-0.089334
316,-0.042419
317,-0.042419
318,-0.089334
319,-0.042419
320,-0.042419
321,-0.089334
322,-0.042419
323,-0.089334
324,-0.042419
325,-0.042419
326,-0.089334
327,-0.042419
328,-0.089334
329,-0.042419
330,-0.042419
331,-0.089334
332,-0.042419
333,-0.089334
334,-0.042419
335,-0.042419
336,-0.089334
337,-0.042419
338,-0.042419
339,-0.089334
340,-0.042419
341,-0.089334
342,-0.042419
343,-0.042419
344,-0.089334
345,-0.042419
346,-0.089334
347,-0.042419
348,-0.042419
349,-0.089334
350,-0.042419
351,-0.089334
352,-0.042419
353,-0.042419
354,-0.089334
355,-0.042419
356,-0.089334
357,-0.042419
358,-0.042419
359,-0.089334
360,-0.042419
361,-0.089334
362,-0.042419
363,-0.042419
364,-0.089334
365,-0.042419
366,-0.089334
367,-0.042419
368,-0.042419
369,-0.089334
370,-0.042419
371,-0.089334
372,-0.042419
373,-0.042419
374,-0.089334
375,-0.042419
376,-0.089334
377,-0.042419
378,-0.042419
379,-0.089334
380,-0.042419
381,-0.089334
382,-0.042419
383,-0.042419
384,-0.089334
385,-0.042419
386,-0.042419
387,-0.089334
388,-0.042419
389,-0.089334
390,-0.042419
391,-0.042419
392,-0.089334
393,-0.042419
394,-0.089334
395,-0.042419
396,-0.042419
397,-0.089334
398,-0.042419
399,-0.089334
400,-0.042419
401,-0.042419
402,-0.089334
403,-0.042419
404,-0.089334
405,-0.042419
406,-0.042419
407,-0.089334
408,-0.042419
409,-0.042419
410,-0.089334
411,-0.042419
412,-0.089334
413,-0.042419
414,-0.042419
415,-0.089334
416,-0.042419
417,-0.042419
418,-0.089334
419,-0.042419
420,-0.089334
421,-0.042419
422,-0.042419
423,-0.089334
424,-0.042419
425,-0.089334
426,-0.042419
427,-0.042419
428,-0.089334
429,-0.042419
430,-0.089334
431,-0.042419
432,-0.042419
433,-0.089334
434,-0.042419
435,-0.042419
436,-0.089334
437,-0.042419
438,-0.089334
439,-0.042419
440,-0.042419
441,-0.089334
442,-0.042419
443,-0.042419
444,-0.089334
445,-0.042419
446,-0.089334
447,-0.042419
448,-0.042419
449,-0.089334
450,-0.042419
451,-0.089334
452,-0.042419
453,-0.042419
454,-0.089334
455,-0.042419
456,-0.042419
457,-0.089334
458,-0.042419
459,-0.089334
460,-0.042419
461,-0.042419
462,-0.089334
463,-0.042419
464,-0.042419
465,-0.089334
466,-0.042419
467,-0.042419
468,-0.089334
469,-0.042419
470,-0.089334
471,-0.042419
472,-0.042419
473,-0.089334
474,-0.042419
475,-0.042419
476,-0.089334
477,-0.042419
478,-0.042419
479,-0.089334
480,-0.042419
481,-0.089334
482,-0.042419
483,-0.042419
484,-0.089334
485,-0.042419
486,-0.042419
487,-0.089334
488,-0.042419
489,-0.089334
490,-0.042419
491,-0.042419
492,-0.089334
493,-0.042419
494,-0.042419
495,-0.089334
496,-0.042419
497,-0.089334
498,-0.042419
499,-0.042419
500,-0.089334
501,-0.042419
502,-0.089334
503,-0.042419
504,-0.042419
505,-0.089334
506,-0.042419
507,-0.089334
508,-0.042419
509,-0.042419
510,-0.089334
511,-0.042419
512,-0.089334
513,-0.042419
514,-0.042419
515,-0.089334
516,-0.042419
517,-0.089334
518,-0.042419
519,-0.089334
520,-0.042419
521,-0.042419
522,-0.089334
523,-0.042419
524,-0.089334
525,-0.042419
526,-0.042419
527,-0.089334
528,-0.042419
529,-0.089334
530,-0.042419
531,-0.089334
532,-0.042419
533,-0.042419
534,-0.089334
535,-0.042419
536,-0.089334
537,-0.042419
538,-0.042419
539,-0.089334
540,-0.042419
541,-0.089334
542,-0.042419
543,-0.089334
544,-0.042419
545,-0.042419
546,-0.089334
547,-0.042419
548,-0.089334
549,-0.042419
550,-0.042419
551,-0.089334
552,-0.042419
553,-0.089334
554,-0.042419
555,16.378
556,20.319000000000003
557,5.9158
558,0.098326
559,-0.089334
560,-0.042419
561,-0.042419
562,-0.089334
563,-0.042419
564,-0.089334
565,-0.042419
566,-0.042419
567,-0.089334
568,-0.042419
569,-0.042419
570,-0.089334
571,-0.042419
572,-0.089334
573,-0.042419
574,-0.042419
575,-0.089334
576,-0.042419
577,-0.042419
578,-0.089334
579,-0.042419
580,-0.089334
581,-0.042419
582,-0.042419
583,-0.089334
584,-0.042419
585,-0.042419
586,-0.089334
587,-0.042419
588,-0.089334
589,-0.042419
590,-0.042419
591,-0.089334
592,-0.042419
593,-0.042419
594,-0.089334
595,-0.042419
596,-0.042419
597,-0.089334
598,-0.042419
599,-0.089334
600,-0.042419
601,-0.042419
602,-0.089334
603,-0.042419
604,-0.089334
605,-0.042419
606,-0.042419
607,-0.089334
608,-0.042419
609,-0.089334
610,-0.042419
611,-0.042419
612,-0.089334
613,-0.042419
614,-0.042419
615,-0.089334
616,-0.042419
617,-0.089334
618,-0.042419
619,-0.042419
620,-0.089334
621,-0.042419
622,-0.089334
623,-0.042419
624,-0.042419
625,-0.089334
626,-0.042419
627,-0.042419
628,-0.089334
629,-0.042419
630,-0.089334
631,-0.042419
632,-0.042419
633,-0.089334
634,-0.042419
635,-0.042419
636,-0.089334
637,-0.042419
638,-0.089334
639,-0.042419
640,-0.042419
641,-0.089334
642,-0.042419
643,-0.042419
644,-0.089334
645,-0.042419
646,-0.042419
647,-0.089334
648,-0.042419
649,-0.042419
650,-0.089334
651,-0.042419
652,-0.042419
653,-0.089334
654,-0.042419
655,-0.089334
656,-0.042419
657,-0.042419
658,-0.089334
659,-0.042419
660,-0.042419
661,-0.089334
662,-0.042419
663,-0.042419
664,-0.089334
665,-0.042419
666,-0.089334
667,-0.042419
668,-0.042419
669,-0.089334
670,-0.042419
671,-0.042419
672,-0.089334
673,-0.042419
674,-0.042419
675,-0.089334
676,-0.042419
677,-0.089334
678,-0.042419
679,-0.042419
680,-0.089334
681,-0.042419
682,-0.089334
683,-0.042419
684,-0.042419
685,-0.089334
686,-0.042419
687,-0.042419
688,-0.089334
689,-0.042419
690,-0.042419
691,-0.089334
692,-0.042419
693,-0.089334
694,-0.042419
695,-0.042419
696,-0.089334
697,-0.042419
698,-0.042419
699,-0.089334
700,-0.042419
701,-0.042419
702,-0.089334
703,-0.042419
704,-0.042419
705,-0.089334
706,-0.042419
707,-0.089334
708,-0.042419
709,-0.042419
710,-0.089334
711,-0.042419
712,-0.042419
713,-0.089334
714,-0.042419
715,-0.042419
716,-0.089334
717,-0.042419
718,-0.042419
719,-0.089334
