time,value
0,2.0156
1,2.1701
2,1.7043
3,0.8686200000000001
4,-0.012875
5,-0.52889
6,-0.5072
7,-0.014513999999999999
8,0.73212
9,1.4626
10,1.8397
11,1.6927
12,1.0614
13,0.15158
14,-0.75964
15,-1.4653
16,-1.7885
17,-1.7627
18,-1.4588
19,-1.0
20,-0.59224
21,-0.30865
22,-0.12015
23,-0.012498
24,0.068486
25,0.12621
26,0.18891
27,0.23826999999999998
28,0.25187
29,0.20645
30,0.10178999999999999
31,-0.0053327
32,-0.082361
33,-0.15083
34,-0.24381
35,-0.38485
36,-0.54055
37,-0.66567
38,-0.74987
39,-0.73997
40,-0.54092
41,-0.14006
42,0.36978
43,0.89645
44,1.2978
45,1.4724
46,1.3855
47,1.0963
48,0.73919
49,0.41385
50,0.25011
51,0.25048000000000004
52,0.32439
53,0.43033999999999994
54,0.41641999999999996
55,0.27242
56,0.031466
57,-0.2769
58,-0.506
59,-0.5010600000000001
60,-0.33612
61,-0.037038
62,0.25361999999999996
63,0.34905
64,0.16139
65,-0.32215
66,-0.9376700000000001
67,-1.4884
68,-1.8181
69,-1.8439
70,-1.4983
71,-0.8842399999999999
72,-0.19881
73,0.39302
74,0.81099
75,0.93653
76,0.8571
77,0.65247
78,0.37146
79,0.10999
80,-0.090152
81,-0.23559000000000002
82,-0.33945
83,-0.33628
84,-0.24813000000000002
85,-0.081997
86,0.12229000000000001
87,0.34243
88,0.45548999999999995
89,0.45297
90,0.33503
91,0.12451
92,-0.10966
93,-0.23958000000000002
94,-0.18512
95,0.08043099999999999
96,0.45543999999999996
97,0.79225
98,0.9492700000000001
99,0.80078
100,0.39425
101,-0.20979
102,-0.81652
103,-1.1915
104,-1.2156
105,-0.9312
106,-0.4516
107,0.019108
108,0.34471
109,0.43631000000000003
110,0.27088
111,-0.037882
112,-0.32113
113,-0.47481
114,-0.44455
115,-0.31037
116,-0.15635
117,-0.06904
118,-0.011725
119,0.04625
120,0.14917
121,0.37016
122,0.67077
123,0.9687100000000001
124,1.0747
125,0.8437
126,0.27001
127,-0.50785
128,-1.3175
129,-1.913
130,-2.001
131,-1.5456
132,-0.67475
133,0.34036
134,1.2153
135,1.6968
136,1.6984
137,1.3056
138,0.74612
139,0.22107
140,-0.031281
141,-0.019834
142,0.17689000000000002
143,0.39389
144,0.44543999999999995
145,0.26121
146,-0.11628
147,-0.5074
148,-0.7330399999999999
149,-0.69514
150,-0.43809
151,-0.07443
152,0.24836999999999998
153,0.42981
154,0.39616999999999997
155,0.17731
156,-0.1109
157,-0.36614
158,-0.53081
159,-0.57191
160,-0.57927
161,-0.59735
162,-0.67609
163,-0.76515
164,-0.7363
165,-0.47948
166,0.12214000000000001
167,0.91335
168,1.7075
169,2.2997
170,2.4787
171,2.0956
172,1.1534
173,-0.14816
174,-1.4769999999999999
175,-2.5398
176,-3.082
177,-3.0254
178,-2.4857
179,-1.6109
180,-0.64489
181,0.1914
182,0.7903399999999999
183,1.1228
184,1.1883
185,1.0755
186,0.8705299999999999
187,0.66855
188,0.44148000000000004
189,0.2035
190,-0.043863
191,-0.30671
192,-0.5139
193,-0.59735
194,-0.56034
195,-0.41195
196,-0.22580999999999998
197,-0.052375
198,0.091428
199,0.15699000000000002
200,0.18619000000000002
201,0.22266
202,0.31928
203,0.45332
204,0.59588
205,0.7094
206,0.74275
207,0.71329
208,0.67233
209,0.5588
210,0.39582
211,0.23926
212,0.067208
213,-0.16314
214,-0.45953999999999995
215,-0.8165899999999999
216,-1.1912
217,-1.4579
218,-1.5493
219,-1.4925
220,-1.2801
221,-0.98918
222,-0.71758
223,-0.5401199999999999
224,-0.43028
225,-0.37412
226,-0.29886
227,-0.092277
228,0.22405
229,0.62997
230,1.0703
231,1.3661
232,1.4195
233,1.1737
234,0.72829
235,0.16951
236,-0.36953
237,-0.7441800000000001
238,-0.89659
239,-0.8636299999999999
240,-0.62917
241,-0.26542
242,0.15026
243,0.51212
244,0.73095
245,0.79904
246,0.6736
247,0.36785
248,-0.046596
249,-0.52346
250,-0.92956
251,-1.1334
252,-0.99672
253,-0.52361
254,0.26233
255,1.16
256,1.939
257,2.3805
258,2.3317
259,1.8318
260,0.9497899999999999
261,-0.12639
262,-1.1239
263,-1.8482
264,-2.1869
265,-2.1777
266,-1.8811
267,-1.526
268,-1.2386
269,-1.0836
270,-1.0548
271,-1.0592
272,-1.0149
273,-0.85119
274,-0.5168
275,-0.10875
276,0.32395999999999997
277,0.71629
278,0.97457
279,1.1031
280,1.1318
281,1.1375
282,1.1848
283,1.2704
284,1.459
285,1.6834
286,1.8503
287,1.8931
288,1.7228
289,1.3374
290,0.8775799999999999
291,0.35311
292,-0.21158000000000002
293,-0.73036
294,-1.2082
295,-1.6572
296,-2.0857
297,-2.4209
298,-2.5412
299,-2.4365
300,-1.9929
301,-1.3105
302,-0.46943
303,0.33739
304,0.96578
305,1.2904
306,1.2289
307,0.94516
308,0.48015
309,0.037117000000000004
310,-0.23046
311,-0.25574
312,-0.10854000000000001
313,0.12883
314,0.32283
315,0.36655
316,0.32392
317,0.21777
318,0.09171900000000001
319,0.0068322
320,0.01039
321,0.029525
322,-0.015828000000000002
323,-0.13421
324,-0.34259
325,-0.64259
326,-0.87544
327,-0.90448
328,-0.7477600000000001
329,-0.38644
330,0.15056
331,0.64215
332,0.98703
333,1.1281
334,1.0337
335,0.7104600000000001
336,0.26328
337,-0.1676
338,-0.5204300000000001
339,-0.71539
340,-0.75405
341,-0.6584
342,-0.49018999999999996
343,-0.28806
344,-0.062403
345,0.13835
346,0.20218
347,0.13483
348,-0.094481
349,-0.46158000000000005
350,-0.79259
351,-0.9879600000000001
352,-0.86513
353,-0.43493000000000004
354,0.20122
355,0.80807
356,1.2007
357,1.2737
358,0.9784200000000001
359,0.44866999999999996
360,-0.13563
361,-0.54592
362,-0.61117
363,-0.38
364,-0.035122
365,0.22186999999999998
366,0.25906
367,-0.014048
368,-0.52865
369,-1.062
370,-1.3898
371,-1.4013
372,-1.1085
373,-0.6324
374,-0.15308
375,0.13137000000000001
376,0.22048
377,0.22135
378,0.21253000000000002
379,0.33823000000000003
380,0.59873
381,0.9279700000000001
382,1.1438
383,1.0731
384,0.72048
385,0.12641
386,-0.46947
387,-0.80411
388,-0.6896800000000001
389,-0.15947
390,0.6168899999999999
391,1.2669
392,1.5383
393,1.3308
394,0.68509
395,-0.12397999999999999
396,-0.7580899999999999
397,-0.95111
398,-0.6026
399,0.10735
400,0.82124
401,1.1153
402,0.8346299999999999
403,-0.016415
404,-1.1785
405,-2.2373
406,-2.7945
407,-2.6045
408,-1.8246
409,-0.66459
410,0.38577
411,0.97462
412,0.95009
413,0.41955
414,-0.33023
415,-0.9351
416,-1.0134
417,-0.5656899999999999
418,0.32885
419,1.3795
420,2.2305
421,2.6352
422,2.5013
423,1.9141
424,1.0601
425,0.24669000000000002
426,-0.35941999999999996
427,-0.6846899999999999
428,-0.76121
429,-0.69944
430,-0.59415
431,-0.51367
432,-0.38498000000000004
433,-0.18736
434,0.087728
435,0.43541
436,0.77766
437,0.97867
438,0.8929799999999999
439,0.47467
440,-0.21349
441,-0.9661
442,-1.5913
443,-1.8814
444,-1.7186
445,-1.2455
446,-0.63671
447,-0.1029
448,0.16796
449,0.082936
450,-0.2847
451,-0.75972
452,-1.1308
453,-1.2307
454,-0.99436
455,-0.49632
456,0.074633
457,0.5898
458,0.91132
459,1.0082
460,0.9543299999999999
461,0.90045
462,0.96042
463,1.0906
464,1.2762
465,1.4625
466,1.4295
467,1.0835
468,0.46328
469,-0.29616
470,-1.0485
471,-1.6064
472,-1.7932
473,-1.5894
474,-1.1097
475,-0.46183
476,0.19633
477,0.6673600000000001
478,0.82621
479,0.71668
480,0.43227
481,0.1074
482,-0.20160999999999998
483,-0.42232
484,-0.54091
485,-0.58909
486,-0.64144
487,-0.72343
488,-0.84793
489,-0.9927
490,-1.0066
491,-0.80113
492,-0.35695
493,0.31433
494,1.1377
495,1.9748
496,2.6341
497,2.9683
498,2.8945
499,2.3319
