time,value
0,1.3218
1,1.3218
2,1.3218
3,1.3218
4,1.3218
5,1.3218
6,1.3218
7,1.3218
8,1.3218
9,1.3218
10,1.3218
11,1.3218
12,1.3218
13,1.3218
14,1.3218
15,1.3218
16,1.3218
17,1.3218
18,1.3218
19,1.3218
20,1.3218
21,1.3218
22,1.3285
23,1.3478
24,1.3702
25,1.3905
26,1.4026
27,1.4062
28,1.4062
29,1.4062
30,1.4062
31,1.4062
32,1.4062
33,1.4062
34,1.4062
35,1.4062
36,1.4062
37,1.4062
38,1.4062
39,1.4062
40,1.4062
41,1.4062
42,1.4062
43,1.4062
44,1.4062
45,1.4062
46,1.4062
47,1.4105
48,1.4185
49,1.4416
50,1.4648
51,1.4879
52,1.4899
53,1.4905
54,1.4905
55,1.5024
56,1.5190000000000001
57,1.5421
58,1.5611
59,1.5749
60,1.5749
61,1.5749
62,1.5723
63,1.5522
64,1.5303
65,1.5072
66,1.4841
67,1.4609999999999999
68,1.4379
69,1.4115
70,1.3772
71,1.331
72,1.2847
73,1.2385
74,1.1923
75,1.1461
76,1.102
77,1.0657
78,1.0381
79,1.015
80,0.9918899999999999
81,0.96878
82,0.94568
83,0.9225700000000001
84,0.89946
85,0.87636
86,0.85325
87,0.8332
88,0.81816
89,0.8156399999999999
90,0.8156399999999999
91,0.8156399999999999
92,0.79876
93,0.77587
94,0.7527699999999999
95,0.73903
96,0.73128
97,0.73128
98,0.73128
99,0.73128
100,0.73128
101,0.73128
102,0.73128
103,0.71218
104,0.6904399999999999
105,0.66733
106,0.65455
107,0.64691
108,0.64691
109,0.6438
110,0.6361600000000001
111,0.61306
112,0.58995
113,0.56685
114,0.54374
115,0.52063
116,0.49753000000000003
117,0.46378
118,0.42445
119,0.37824
120,0.33419
121,0.29764
122,0.27453
123,0.25142
124,0.22832
125,0.20521
126,0.18211
127,0.16044
128,0.1462
129,0.14073
130,0.14069
131,0.14015999999999998
132,0.12783
133,0.10472999999999999
134,0.41295
135,0.33023
136,0.29128000000000004
137,0.28667
138,0.27497
139,0.24004
140,0.14159000000000002
141,0.18058
142,-0.089472
143,-0.205
144,-0.32053000000000004
145,-0.43606000000000006
146,-0.11936
147,-0.15642
148,-0.20264000000000001
149,-0.24885
150,-0.29506
151,-0.34126999999999996
152,-0.38748
153,-0.4337
154,-0.46266999999999997
155,-0.48796999999999996
156,-0.51107
157,-0.53418
158,-0.55729
159,-0.58039
160,-0.6013
161,-0.61854
162,-0.61854
163,-0.61854
164,-0.61925
165,-0.63725
166,-0.65777
167,-0.68088
168,-0.6948300000000001
169,-0.70291
170,-0.70291
171,-0.70291
172,-0.70291
173,-0.70291
174,-0.70291
175,-0.70632
176,-0.72244
177,-0.74321
178,-0.76631
179,-0.78942
180,-0.81253
181,-0.8356299999999999
182,-0.85874
183,-0.90341
184,-0.97165
185,-1.0409
186,-1.0993
187,-1.1401
188,-1.1661
189,-1.1858
190,-1.1971
191,-1.1828
192,-1.1597
193,-1.1365
194,-1.1134
195,-1.0903
196,-1.0672
197,-1.051
198,-1.0404
199,-1.0404
200,-1.0422
201,-1.0463
202,-1.0678
203,-1.0909
204,-1.114
205,-1.1371
206,-1.1602
207,-1.1833
208,-1.2064
209,-1.2295
210,-1.2526
211,-1.2744
212,-1.2935
213,-1.2935
214,-1.2935
215,-1.2935
216,-1.2935
217,-1.2935
218,-1.2935
219,-1.2935
220,-1.2935
221,-1.2935
222,-1.2932
223,-1.287
224,-1.2639
225,-1.2408
226,-1.2202
227,-1.2121
228,-1.2091
229,-1.2086
230,-1.2019
231,-1.1865
232,-1.1634
233,-1.1403
234,-1.1265
235,-1.1249
236,-1.1247
237,-1.1247
238,-1.1247
239,-1.1247
240,-1.1259
241,-1.1308
242,-1.1484
243,-1.1715
244,-1.1946
245,-1.2058
246,-1.2091
247,-1.2091
248,-1.2033
249,-1.192
250,-1.1693
251,-1.1475
252,-1.1273
253,-1.1247
254,-1.1247
255,-1.1247
256,-1.1109
257,-1.0919
258,-1.0688
259,-1.0457
260,-1.0226
261,-0.9995200000000001
262,-0.9764200000000001
263,-0.95331
264,-0.9302
265,-0.9071
266,-0.8839899999999999
267,-0.8608899999999999
268,-0.83778
269,-0.81467
270,-0.79157
271,-0.76846
272,-0.74536
273,-0.72225
274,-0.69914
275,-0.67604
276,-0.65293
277,-0.63155
278,-0.62241
279,-0.61854
280,-0.61838
281,-0.61273
282,-0.5986600000000001
283,-0.57555
284,-0.55245
285,-0.5372899999999999
286,-0.5346
287,-0.53418
288,-0.5306
289,-0.51852
290,-0.49818
291,-0.47583000000000003
292,-0.45648999999999995
293,-0.44982
294,-0.44982
295,-0.44982
296,-0.44982
297,-0.44982
298,-0.44982
299,-0.44504
300,-0.43483
301,-0.41273999999999994
302,-0.38963000000000003
303,-0.36653
304,-0.34342
305,-0.32031
306,-0.29721
307,-0.28633000000000003
308,-0.28109
309,-0.28109
310,-0.28109
311,-0.28109
312,-0.28109
313,-0.28109
314,-0.28109
315,0.61531
316,0.61531
317,0.61531
318,0.61531
319,0.61531
320,0.61531
321,0.61531
322,0.61531
323,0.61531
324,0.61531
325,0.61531
326,0.61531
327,0.61531
328,0.61531
329,0.61531
330,0.61531
331,0.61531
332,0.61531
333,0.61531
334,0.61531
335,0.61531
336,0.61531
337,0.63232
338,0.68167
339,0.73868
340,0.79057
341,0.8214100000000001
342,0.8305299999999999
343,0.8305299999999999
344,0.8305299999999999
345,0.8305299999999999
346,0.8305299999999999
347,0.8305299999999999
348,0.8305299999999999
349,0.8305299999999999
350,0.8305299999999999
351,0.8305299999999999
352,0.8305299999999999
353,0.8305299999999999
354,0.8305299999999999
355,0.8305299999999999
356,0.8305299999999999
357,0.8305299999999999
358,0.8305299999999999
359,0.8305299999999999
360,0.8305299999999999
361,0.8305299999999999
362,0.8415600000000001
363,0.86206
364,0.9209999999999999
365,0.97995
366,1.0389
367,1.0441
368,1.0457
369,1.0457
370,1.0759
371,1.1184
372,1.1773
373,1.2258
374,1.261
375,1.261
376,1.261
377,1.261
378,1.261
379,1.261
380,1.2599
381,1.2298
382,1.1856
383,1.1266
384,1.0761
385,1.0457
386,1.0457
387,1.0457
388,1.0457
389,1.0457
390,1.0457
391,1.0405
392,1.0151
393,0.9676100000000001
394,0.9091299999999999
395,0.8543
396,0.8305299999999999
397,0.8305299999999999
398,0.8305299999999999
399,0.81075
400,0.76894
401,0.71126
402,0.6601199999999999
403,0.62174
404,0.61531
405,0.61531
406,0.61531
407,0.6583600000000001
408,0.71675
409,0.77569
410,0.81075
411,0.8305299999999999
412,0.8305299999999999
413,0.8305299999999999
414,0.8305299999999999
415,0.8305299999999999
416,0.8305299999999999
417,0.8305299999999999
418,0.8305299999999999
419,0.8305299999999999
420,0.8305299999999999
421,0.8305299999999999
422,0.8305299999999999
423,0.8305299999999999
424,0.83847
425,0.8579399999999999
426,0.91689
427,0.97583
428,1.0266
429,0.98825
430,0.9388200000000001
431,0.8798799999999999
432,0.84808
433,0.8305299999999999
434,0.8305299999999999
435,0.8305299999999999
436,0.8305299999999999
437,0.8305299999999999
438,0.8305299999999999
439,0.8417600000000001
440,0.8856299999999999
441,0.94019
442,0.99546
443,1.0318
444,1.0457
445,1.0457
446,1.0457
447,1.0457
448,1.0457
449,1.0457
450,1.0457
451,1.0457
452,1.0457
453,1.0457
454,1.0457
455,1.0457
456,1.0457
457,1.0457
458,1.0457
459,1.0457
460,1.0457
461,1.0252
462,0.98954
463,0.9306
464,0.87826
465,0.83234
466,0.8305299999999999
467,0.8305299999999999
468,0.8305299999999999
469,0.78655
470,0.7332
471,0.67425
472,0.6381
473,0.61531
474,0.61531
475,0.6097199999999999
476,0.5947399999999999
477,0.5358
478,0.47685
479,0.41972
480,0.40669
481,0.40009
482,0.40009
483,0.37675
484,0.3384
485,0.27945
486,0.22343000000000002
487,0.18487
488,0.18487
489,0.18487
490,0.19358
491,0.2347
492,0.28768
493,0.33957
494,0.33889
495,0.27123
496,0.15334
497,0.18207
498,-0.26983
499,-0.11525
500,-0.17429
501,-0.23324
502,-0.29218
503,-0.35113
504,-0.40569
505,-0.44956
506,-0.46079
507,-0.46079
508,-0.46079
509,-0.46079
510,-0.46079
511,-0.46079
512,-0.44323999999999997
513,-0.41144
514,-0.3525
515,-0.30307
516,-0.26469000000000004
517,-0.31549
518,-0.37443000000000004
519,-0.43338000000000004
520,-0.49232
521,-0.5512699999999999
522,-0.61021
523,-0.6691600000000001
524,-0.72811
525,-0.78705
526,-0.846
527,-0.90494
528,-0.9638899999999999
529,-1.0228
530,-1.0818
531,-1.0978
532,-1.1065
533,-1.1065
534,-1.1065
535,-1.1065
536,-1.1065
537,-1.1065
538,-1.1065
539,-1.1065
540,-1.1065
541,-1.1129
542,-1.1513
543,-1.2024
544,-1.2601
545,-1.3019
546,-1.3217
547,-1.3217
548,-1.3217
549,-1.3217
550,-1.3217
551,-1.3217
552,-1.3217
553,-1.3217
554,-1.3217
555,-1.3217
556,-1.3217
557,-1.3217
558,-1.3217
559,-1.3217
560,-1.3519999999999999
561,-1.4026
562,-1.4615
563,-1.5057
564,-1.5359
565,-1.5369
566,-1.5369
567,-1.5369
568,-1.5369
569,-1.5369
570,-1.5369
571,-1.5369
572,-1.5369
573,-1.5369
574,-1.5369
575,-1.5369
576,-1.5369
577,-1.5369
578,-1.5369
579,-1.5369
580,-1.5369
581,-1.5369
582,-1.4984
583,-1.4505
584,-1.3916
585,-1.3491
586,-1.3217
587,-1.3217
588,-1.3217
589,-1.3217
590,-1.3217
591,-1.3217
592,-1.3217
593,-1.3217
594,-1.3217
595,-1.3217
596,-1.3217
597,-1.3217
598,-1.3217
599,-1.3217
600,-1.3217
601,-1.3217
602,-1.3217
603,-1.3217
604,-1.3217
605,-1.3217
606,-1.3217
607,-1.3217
608,-1.3217
609,-1.3217
610,-1.3217
611,-1.3217
612,-1.3217
613,-1.3217
614,-1.3217
615,-1.3217
616,-1.3217
617,-1.3199
618,-1.3151
619,-1.2655
620,-1.2065
621,-1.1476
622,-1.1198
623,-1.1065
624,-1.1065
625,-1.1065
626,-1.1065
627,-1.1065
628,-1.1065
629,-1.1065
630,-1.0535
631,-1.0535
632,-1.0535
633,-1.0535
634,-1.0535
635,-1.0535
636,-1.0535
637,-1.0535
638,-1.0535
639,-1.0535
640,-1.0535
641,-1.0535
642,-1.0535
643,-1.0535
644,-1.0535
645,-1.0535
646,-1.0535
647,-1.0535
648,-1.0535
649,-1.0535
650,-1.0535
651,-1.0535
652,-1.0535
653,-1.0535
654,-1.0535
655,-1.0535
656,-1.0535
657,-1.0535
658,-1.0535
659,-1.0535
660,-1.0535
661,-1.0535
662,-1.0535
663,-1.0535
664,-1.0535
665,-1.0535
666,-1.0325
667,-0.9830200000000001
668,-0.86715
669,-0.7434
670,-0.62258
671,-0.59639
672,-0.59639
673,-0.59639
674,-0.59639
675,-0.59639
676,-0.59639
677,-0.59639
678,-0.59639
679,-0.59639
680,-0.59639
681,-0.59639
682,-0.59639
683,-0.59639
684,-0.59639
685,-0.59639
686,-0.59639
687,-0.59639
688,-0.59639
689,-0.59639
690,-0.59639
691,-0.59639
692,-0.59639
693,-0.59639
694,-0.59639
695,-0.59639
696,-0.59639
697,-0.59639
698,-0.59639
699,-0.59639
700,-0.59639
701,-0.59639
702,-0.59639
703,-0.59639
704,-0.59639
705,-0.59639
706,-0.58524
707,-0.53138
708,-0.43044
709,-0.30723
710,-0.1995
711,-0.22373
712,-0.34892
713,-0.47411000000000003
714,-0.5573100000000001
715,-0.5937
716,-0.59639
717,-0.59639
718,-0.59639
719,-0.59639
720,-0.59639
721,-0.59639
722,-0.68782
723,-0.81183
724,-0.9370200000000001
725,-1.0115
726,-1.0535
727,-1.0535
728,-1.0535
729,-1.0535
730,-1.0535
731,-1.0535
732,-1.0535
733,-1.0535
734,-1.0535
735,-1.0535
736,-1.0535
737,-1.0535
738,-1.0535
739,-1.0535
740,-1.0535
741,-1.0535
742,-1.0535
743,-1.0535
744,-1.0535
745,-1.0535
746,-1.0535
747,-0.9958299999999999
748,-0.90791
749,-0.78272
750,-0.66927
751,-0.59639
752,-0.59639
753,-0.59639
754,-0.59639
755,-0.59639
756,-0.59639
757,-0.6042
758,-0.65223
759,-0.74778
760,-0.87277
761,-0.99505
762,-1.0535
763,-1.0535
764,-1.0535
765,-1.0179
766,-0.93494
767,-0.8147399999999999
768,-0.70223
769,-0.6148899999999999
770,-0.59639
771,-0.59639
772,-0.59639
773,-0.51449
774,-0.3955
775,-0.27031
776,-0.14512
777,-0.094789
778,0.10525999999999999
779,0.24449
780,0.39734
781,0.64388
782,0.89426
783,1.1446
784,1.3016
785,1.4387
786,1.5639
787,1.5438
788,1.4387
789,1.1883
790,0.9379299999999999
791,0.68755
792,0.43717
793,0.18678
794,-0.31315
795,-0.31398000000000004
796,-0.5643600000000001
797,-0.8147399999999999
798,-0.96599
799,-1.0535
800,-1.0535
801,-1.0411
802,-0.95449
803,-0.70411
804,-0.45373
805,-0.20335
806,0.24001999999999998
807,0.29741999999999996
808,0.55279
809,0.84539
810,1.1854
811,1.561
812,1.9365
813,2.1953
814,2.3263
815,2.4519
816,2.5474
817,2.5955
818,2.6033
819,2.594
820,2.5619
821,2.4606
822,2.3354
823,2.2102
824,2.0121
825,1.7735
826,1.5231
827,1.2727
828,1.0224
829,0.77198
830,0.54182
831,0.33510999999999996
832,0.3178
833,0.3178
834,0.3178
835,0.48546000000000006
836,0.70211
837,0.95249
838,1.1615
839,1.3426
840,1.4678
841,1.5930000000000002
842,1.7182
843,1.8434
844,1.9686
845,2.0938
846,2.1277
847,2.1462
848,2.1462
849,2.1042
850,2.0297
851,1.9045
852,1.7793
853,1.6541
854,1.5290000000000001
855,1.4038
856,1.2786
857,1.1534
858,1.0282
859,0.9056799999999999
860,0.81689
861,0.77489
862,0.77489
863,0.77489
864,0.77489
865,0.77489
866,0.77489
867,0.79914
868,0.8704700000000001
869,0.98451
870,1.1033
871,1.2022
872,1.232
873,1.232
874,1.232
875,1.232
876,1.232
877,1.232
878,1.232
879,1.232
880,1.232
881,1.2253
882,1.2093
883,1.0981
884,0.9728700000000001
885,0.8476799999999999
886,0.79727
887,0.77489
888,0.77489
889,0.7400100000000001
890,0.67882
891,0.55362
892,0.43188000000000004
893,0.3178
894,0.3178
895,0.3178
896,0.3178
897,0.3178
898,0.3178
899,0.3178
900,0.28286
901,0.2159
902,0.45838
903,-0.16758
904,-0.13349
905,-0.13785
906,-0.13929
907,-0.12997
908,-0.26653000000000004
909,0.25458000000000003
910,0.17332999999999998
911,0.23738
912,0.21008000000000002
913,0.42927
914,-0.19669
915,-0.12244000000000001
916,-0.13699999999999998
917,-0.13929
918,-0.13929
919,-0.13929
920,-0.13929
921,-0.13929
922,-0.13929
923,-0.13929
924,-0.13929
925,-0.13929
926,-0.13929
927,-0.13929
928,-0.13929
929,-0.13929
930,-0.13929
931,-0.13929
932,-0.13929
933,-0.13929
934,-0.13929
935,-0.13929
936,-0.13929
937,-0.13929
938,-0.13929
939,-0.13929
940,-0.16819
941,-0.22080999999999998
942,-0.34601
943,-0.4712
944,-0.59639
