time,value
0,0.94624
1,-0.090412
2,-0.2722
3,0.13938
4,-0.013850999999999999
5,0.031644
6,-0.21873
7,0.3367
8,-0.09594
9,-0.41215
10,-0.51688
11,0.52715
12,-0.30254000000000003
13,0.0061511000000000005
14,-0.06512000000000001
15,-0.10740999999999999
16,0.02468
17,0.041451999999999996
18,-0.31871
19,-0.040072
20,-0.4101
21,-0.62071
22,0.13401
23,0.045235000000000004
24,-0.1152
25,-0.079762
26,0.17305
27,0.22978
28,-0.30803
29,-0.23133
30,0.010079000000000001
31,-0.5017
32,-0.2289
33,0.24120999999999998
34,0.22313000000000002
35,0.13889
36,0.018287
37,-0.10214
38,0.10056
39,0.061967999999999995
40,-0.6765899999999999
41,0.016826
42,0.49266000000000004
43,0.012671
44,-0.041825
45,1.8204
46,1.8204
47,1.8204
48,1.8204
49,1.8204
50,1.8204
51,1.8204
52,1.8204
53,1.8204
54,-1.7511
55,-1.7511
56,-1.7511
57,-1.7511
58,-1.7511
59,-1.7511
60,-1.7511
61,-1.7511
62,-0.1123
63,-0.22253
64,0.18641
65,-0.34909
66,-0.0098242
67,-0.12546
68,-0.45618000000000003
69,-0.25351999999999997
70,0.039718
71,-0.22321
72,-0.12189000000000001
73,-0.48662
74,0.051068999999999996
75,0.56765
76,0.26239
77,0.5340199999999999
78,0.48253999999999997
79,-0.071386
80,0.022168
81,0.044933
82,-0.35784
83,-0.0032328
84,0.17376
85,0.092668
86,0.50463
87,-0.41885
88,-0.6057899999999999
89,-0.32643
90,-0.41273000000000004
91,-0.28656
92,-0.018556
93,-0.5785899999999999
94,-0.18308
95,0.13143
96,-0.1259
97,-0.15600999999999998
98,0.25697
99,0.15312
100,0.0028006
101,0.23045
102,1.8204
103,1.8204
104,1.8204
105,1.8204
106,1.8204
107,1.8204
108,1.8204
109,1.8204
110,1.8204
111,1.8204
112,-1.7511
113,-1.7511
114,-1.7511
115,-1.7511
116,-1.7511
117,-1.7511
118,-1.7511
119,-1.7511
120,-1.7511
121,-1.7511
122,0.73768
123,0.39941
124,-0.25382
125,-0.47548
126,0.16217
127,0.35061
