time,value
0,0.35216
1,0.35216
2,0.35216
3,0.35216
4,0.35216
5,0.35216
6,0.35216
7,0.35216
8,0.35216
9,0.35216
10,0.35216
11,0.35216
12,0.35216
13,0.35216
14,0.35216
15,0.35216
16,0.35216
17,0.35216
18,0.35216
19,0.35216
20,0.35216
21,0.35216
22,0.36007
23,0.38724000000000003
24,0.47672
25,0.5363399999999999
26,0.57571
27,0.57693
28,0.57693
29,0.57693
30,0.57693
31,0.57693
32,0.57693
33,0.59608
34,0.63759
35,0.6818
36,0.72654
37,0.77127
38,0.81601
39,0.86075
40,0.8802399999999999
41,0.8779299999999999
42,0.83319
43,0.81199
44,0.80102
45,0.79172
46,0.76662
47,0.72188
48,0.7014600000000001
49,0.69034
50,0.69571
51,0.72331
52,0.76805
53,0.81279
54,0.85798
55,0.90415
56,0.9799399999999999
57,1.0694
58,1.1589
59,1.2484
60,1.3378
61,1.3595
62,1.3636
63,1.3636
64,1.3636
65,1.3636
66,1.3636
67,1.3636
68,1.3636
69,1.3636
70,1.3622
71,1.3278
72,1.2809
73,1.2161
74,1.0966
75,0.97706
76,0.93411
77,0.91733
78,0.9234100000000001
79,0.96455
80,1.0093
81,1.054
82,1.0988
83,1.1435
84,1.1882
85,1.224
86,1.2462
87,1.2512
88,1.2388
89,1.1529
90,1.0362
91,0.8908799999999999
92,0.67571
93,0.46233
94,0.27765
95,0.12467
96,-0.0093267
97,-0.054064999999999995
98,-0.098804
99,-0.14354
100,-0.16391
101,-0.16323
102,-0.07375
103,0.015727
104,0.1052
105,0.19468
106,0.28415999999999997
107,0.37364
108,0.42928999999999995
109,0.46436000000000005
110,0.4503
111,0.35896
112,0.13527
113,-0.088425
114,-0.31212
115,-0.53581
116,-0.71697
117,-0.85334
118,-0.9712299999999999
119,-1.0802
120,-1.1697
121,-1.1869
122,-1.1572
123,-1.1128
124,-1.068
125,-1.0233
126,-0.97855
127,-0.93268
128,-0.87649
129,-0.8046
130,-0.71513
131,-0.67945
132,-0.6592899999999999
133,-0.6592899999999999
134,-0.6592899999999999
135,-0.6592899999999999
136,-0.7131
137,-0.78268
138,-0.87931
139,-1.0344
140,-1.2074
141,-1.3144
142,-1.393
143,-1.4377
144,-1.4457
145,-1.4419
146,-1.4219
147,-1.3876
148,-1.3429
149,-1.2982
150,-1.2534
151,-1.2087
152,-1.1639
153,-1.1192
154,-1.0745
155,-1.0351
156,-1.0025
157,-0.99644
158,-1.0025
159,-1.0351
160,-1.0745
161,-1.1192
162,-1.1639
163,-1.2174
164,-1.2908
165,-1.3722
166,-1.4553
167,-1.5
168,-1.5343
169,-1.5543
170,-1.5581
171,-1.5501
172,-1.5054
173,-1.4607
174,-1.4159
175,-1.3712
176,-1.3264
177,-1.2817
178,-1.237
179,-1.1922
180,-1.1475
181,-1.1332
182,-1.1629
183,-1.2245
184,-1.305
185,-1.4392
186,-1.5558
187,-1.6567
188,-1.7393
189,-1.81
190,-1.8547
191,-1.8424
192,-1.7981
193,-1.7036
194,-1.5934
195,-1.4592
196,-1.325
197,-1.1911
198,-1.0590000000000002
199,-0.97175
200,-0.92701
201,-0.9013
202,-0.8840600000000001
203,-0.8840600000000001
204,-0.937
205,-1.021
206,-1.1455
207,-1.2906
208,-1.4696
209,-1.5345
210,-1.5567
211,-1.5431
212,-1.514
213,-1.4692
214,-1.3653
215,-1.245
216,-1.1011
217,-0.9356
218,-0.75664
219,-0.6371899999999999
220,-0.53317
221,-0.45514
222,-0.43451999999999996
223,-0.43451999999999996
224,-0.43451999999999996
225,-0.43538999999999994
226,-0.43718
227,-0.47568
228,-0.52042
229,-0.56516
230,-0.6099
231,-0.65464
232,-0.65789
233,-0.65295
234,-0.6347
235,-0.59737
236,-0.5526300000000001
237,-0.5079
238,-0.46316
239,-0.41841999999999996
240,-0.37368
241,-0.32156999999999997
242,-0.24211
243,-0.16286
244,-0.08376499999999999
245,-0.037602
246,0.0071372
247,0.051876
248,0.09661499999999999
249,0.14135
250,0.18609
251,0.21873
252,0.23663
253,0.23978000000000002
254,0.23978000000000002
255,0.23978000000000002
256,0.23978000000000002
257,0.23978000000000002
258,0.23978000000000002
259,0.26715
260,0.35377
261,0.45543
262,0.56548
263,0.6996899999999999
264,0.86818
265,1.0811
266,1.2663
267,1.4288
268,1.5182
269,1.5881
270,1.6421
271,1.6669
272,1.6693
273,1.6245
274,1.5586
275,1.4814
276,1.3848
277,1.2723
278,1.1381
279,1.0258
280,0.9230200000000001
281,0.83999
282,0.8017
283,0.8017
284,0.82324
285,0.85288
286,0.8976200000000001
287,0.9713200000000001
288,1.0607
289,1.1699
290,1.2892
291,1.4234
292,1.4953
293,1.5503
294,1.6108
295,1.6865
296,1.7759
297,1.7358
298,1.6682
299,1.5669
300,1.4445
301,1.3098
302,1.1434
303,0.97206
304,0.79311
305,0.61415
306,0.44282
307,0.32041
308,0.21871999999999997
309,0.13712
310,0.12739
311,0.13975
312,0.18843
313,0.26268
314,0.35216
