time,value
0,-0.12267
1,-0.12267
2,0.057763
3,4.9595
4,0.14798
5,-0.12267
6,-0.12267
7,-0.12267
8,-0.12267
9,-0.12267
10,-0.12267
11,-0.12267
12,-0.12267
13,-0.12267
14,-0.12267
15,-0.12267
16,-0.12267
17,-0.12267
18,-0.12267
19,-0.12267
20,-0.12267
21,-0.12267
22,-0.12267
23,-0.12267
24,-0.12267
25,-0.12267
26,-0.12267
27,-0.12267
28,-0.12267
29,-0.12267
30,-0.12267
31,-0.12267
32,-0.12267
33,-0.12267
34,-0.12267
35,-0.12267
36,-0.12267
37,-0.12267
38,-0.12267
39,-0.12267
40,-0.12267
41,-0.12267
42,-0.12267
43,-0.12267
44,-0.12267
45,-0.12267
46,-0.12267
47,-0.12267
48,-0.12267
49,-0.12267
50,-0.12267
51,-0.12267
52,-0.12267
53,-0.12267
54,-0.12267
55,-0.12267
56,-0.12267
57,-0.12267
58,-0.12267
59,-0.12267
60,-0.12267
61,-0.12267
62,-0.12267
63,-0.12267
64,-0.12267
65,-0.12267
66,-0.12267
67,-0.12267
68,-0.12267
69,-0.12267
70,-0.12267
71,-0.12267
72,-0.12267
73,-0.12267
74,-0.12267
75,-0.12267
76,-0.12267
77,-0.12267
78,-0.12267
79,-0.12267
80,-0.12267
81,-0.12267
82,-0.12267
83,-0.12267
84,-0.12267
85,-0.12267
86,-0.12267
87,-0.12267
88,-0.12267
89,-0.12267
90,-0.12267
91,-0.12267
92,-0.12267
93,-0.12267
94,-0.12267
95,-0.12267
96,-0.12267
97,-0.12267
98,-0.12267
99,-0.12267
100,-0.12267
101,-0.12267
102,-0.12267
103,-0.12267
104,-0.12267
105,-0.12267
106,-0.12267
107,-0.12267
108,-0.12267
109,-0.12267
110,-0.12267
111,-0.12267
112,-0.12267
113,-0.12267
114,-0.12267
115,-0.12267
116,-0.12267
117,-0.12267
118,-0.12267
119,-0.12267
120,-0.12267
121,-0.12267
122,-0.12267
123,-0.12267
124,-0.12267
125,-0.12267
126,-0.12267
127,-0.12267
128,-0.12267
129,-0.12267
130,-0.12267
131,-0.12267
132,-0.12267
133,-0.12267
134,-0.12267
135,-0.12267
136,-0.12267
137,-0.12267
138,-0.12267
139,-0.12267
140,-0.12267
141,-0.12267
142,-0.12267
143,-0.12267
144,-0.12267
145,-0.12267
146,-0.12267
147,-0.12267
148,-0.12267
149,-0.12267
150,-0.12267
151,-0.12267
152,-0.12267
153,-0.12267
154,-0.12267
155,-0.12267
156,-0.12267
157,-0.12267
158,-0.12267
159,-0.12267
160,-0.12267
161,-0.12267
162,-0.12267
163,-0.12267
164,-0.12267
165,-0.12267
166,-0.12267
167,-0.12267
168,-0.12267
169,-0.12267
170,-0.12267
171,-0.12267
172,-0.12267
173,-0.12267
174,-0.12267
175,-0.12267
176,-0.12267
177,-0.12267
178,-0.12267
179,-0.12267
180,-0.12267
181,-0.12267
182,-0.12267
183,-0.12267
184,-0.12267
185,-0.12267
186,-0.12267
187,-0.12267
188,-0.12267
189,2.1778
190,7.0945
191,0.057763
192,-0.12267
193,-0.12267
194,-0.12267
195,-0.12267
196,-0.12267
197,-0.12267
198,-0.12267
199,-0.12267
200,-0.12267
201,-0.12267
202,-0.12267
203,-0.12267
204,-0.12267
205,-0.12267
206,-0.12267
207,-0.12267
208,-0.12267
209,-0.12267
210,-0.12267
211,-0.12267
212,-0.12267
213,-0.12267
214,-0.12267
215,-0.12267
216,-0.12267
217,-0.12267
218,-0.12267
219,-0.12267
220,-0.12267
221,-0.12267
222,-0.12267
223,-0.12267
224,-0.12267
225,-0.12267
226,-0.12267
227,-0.12267
228,-0.12267
229,-0.12267
230,-0.12267
231,-0.12267
232,-0.12267
233,-0.12267
234,-0.12267
235,-0.12267
236,-0.12267
237,-0.12267
238,-0.12267
239,-0.12267
240,-0.12267
241,-0.12267
242,-0.12267
243,-0.12267
244,-0.12267
245,-0.12267
246,-0.12267
247,-0.12267
248,-0.12267
249,-0.12267
250,-0.12267
251,-0.12267
252,-0.12267
253,-0.12267
254,-0.12267
255,-0.12267
256,-0.12267
257,-0.12267
258,9.6206
259,11.905999999999999
260,-0.032451999999999995
261,-0.12267
262,-0.12267
263,-0.12267
264,2.4485
265,-0.092596
266,-0.12267
267,-0.12267
268,-0.12267
269,-0.12267
270,-0.12267
271,-0.12267
272,-0.12267
273,-0.12267
274,-0.12267
275,-0.12267
276,-0.12267
277,-0.12267
278,-0.12267
279,-0.12267
280,-0.12267
281,-0.12267
282,-0.12267
283,-0.12267
284,-0.12267
285,-0.12267
286,-0.12267
287,-0.12267
288,-0.12267
289,-0.12267
290,-0.12267
291,-0.12267
292,-0.12267
293,-0.12267
294,-0.12267
295,-0.12267
296,-0.12267
297,-0.12267
298,-0.12267
299,-0.12267
300,-0.12267
301,-0.12267
302,-0.12267
303,-0.12267
304,-0.12267
305,-0.12267
306,-0.12267
307,-0.12267
308,-0.12267
309,-0.12267
310,-0.12267
311,-0.12267
312,-0.12267
313,-0.12267
314,-0.12267
315,-0.12267
316,-0.12267
317,-0.12267
318,-0.12267
319,-0.12267
320,-0.12267
321,-0.12267
322,-0.12267
323,-0.12267
324,-0.12267
325,-0.12267
326,-0.12267
327,-0.12267
328,-0.12267
329,-0.12267
330,-0.12267
331,-0.12267
332,10.448
333,5.5609
334,0.057763
335,-0.12267
336,-0.12267
337,-0.12267
338,1.4561
339,-0.092596
340,-0.12267
341,-0.12267
342,-0.12267
343,-0.12267
344,-0.12267
345,-0.12267
346,-0.12267
347,-0.12267
348,-0.12267
349,-0.12267
350,-0.12267
351,-0.12267
352,-0.12267
353,-0.12267
354,-0.12267
355,-0.12267
356,-0.12267
357,-0.12267
358,-0.12267
359,-0.12267
360,-0.12267
361,-0.12267
362,-0.12267
363,-0.12267
364,-0.12267
365,-0.12267
366,-0.12267
367,-0.12267
368,-0.12267
369,-0.12267
370,-0.12267
371,-0.12267
372,-0.12267
373,-0.12267
374,-0.12267
375,-0.12267
376,-0.12267
377,-0.12267
378,-0.12267
379,-0.12267
380,-0.12267
381,-0.12267
382,-0.12267
383,-0.12267
384,-0.12267
385,-0.12267
386,-0.12267
387,-0.12267
388,-0.12267
389,-0.12267
390,-0.12267
391,-0.12267
392,-0.12267
393,-0.12267
394,-0.12267
395,-0.12267
396,-0.12267
397,-0.12267
398,-0.12267
399,-0.12267
400,-0.12267
401,-0.12267
402,-0.12267
403,-0.12267
404,-0.12267
405,-0.12267
406,-0.12267
407,-0.12267
408,-0.12267
409,-0.12267
410,-0.12267
411,7.8163
412,3.3506
413,0.95991
414,-0.07756
415,-0.12267
416,-0.12267
417,-0.12267
418,-0.12267
419,-0.12267
420,-0.12267
421,-0.12267
422,-0.12267
423,-0.12267
424,-0.12267
425,-0.12267
426,-0.12267
427,-0.12267
428,-0.12267
429,-0.12267
430,-0.12267
431,-0.12267
432,-0.12267
433,-0.12267
434,-0.12267
435,-0.12267
436,-0.12267
437,-0.12267
438,-0.12267
439,-0.12267
440,-0.12267
441,-0.12267
442,-0.12267
443,-0.12267
444,-0.12267
445,-0.12267
446,-0.12267
447,-0.12267
448,-0.12267
449,-0.12267
450,-0.12267
451,-0.12267
452,-0.12267
453,-0.12267
454,-0.12267
455,-0.12267
456,-0.12267
457,-0.12267
458,-0.12267
459,-0.12267
460,-0.12267
461,-0.12267
462,-0.12267
463,-0.12267
464,-0.12267
465,-0.12267
466,-0.12267
467,-0.12267
468,-0.12267
469,-0.12267
470,-0.12267
471,-0.12267
472,-0.12267
473,-0.12267
474,-0.12267
475,-0.12267
476,-0.12267
477,-0.12267
478,-0.12267
479,-0.12267
480,-0.12267
481,-0.12267
482,-0.12267
483,-0.12267
484,-0.12267
485,-0.12267
486,-0.12267
487,-0.12267
488,-0.12267
489,-0.12267
490,-0.12267
491,-0.12267
492,-0.12267
493,-0.12267
494,-0.12267
495,-0.12267
496,-0.12267
497,-0.12267
498,-0.12267
499,-0.12267
500,-0.12267
501,-0.12267
502,-0.12267
503,-0.12267
504,-0.12267
505,-0.12267
506,-0.12267
507,-0.12267
508,-0.12267
509,-0.12267
510,-0.12267
511,-0.12267
512,-0.12267
513,-0.12267
514,-0.12267
515,-0.12267
516,-0.12267
517,-0.12267
518,-0.12267
519,-0.12267
520,-0.12267
521,-0.12267
522,-0.12267
523,-0.12267
524,-0.12267
525,-0.12267
526,-0.12267
527,-0.12267
528,-0.12267
529,-0.12267
530,-0.12267
531,-0.12267
532,-0.12267
533,-0.12267
534,-0.12267
535,-0.12267
536,-0.12267
537,-0.12267
538,-0.12267
539,-0.12267
540,-0.12267
541,-0.12267
542,-0.12267
543,-0.12267
544,-0.12267
545,-0.12267
546,-0.12267
547,-0.12267
548,-0.12267
549,-0.12267
550,-0.12267
551,-0.12267
552,-0.12267
553,-0.12267
554,-0.12267
555,-0.12267
556,-0.12267
557,-0.12267
558,-0.12267
559,-0.12267
560,-0.12267
561,-0.12267
562,-0.12267
563,-0.12267
564,-0.12267
565,-0.12267
566,-0.12267
567,-0.12267
568,-0.12267
569,-0.12267
570,-0.12267
571,-0.12267
572,-0.12267
573,-0.12267
574,-0.12267
575,-0.12267
576,-0.12267
577,-0.12267
578,-0.12267
579,-0.12267
580,-0.12267
581,-0.12267
582,-0.12267
583,-0.12267
584,-0.12267
585,-0.12267
586,-0.12267
587,-0.12267
588,-0.12267
589,-0.12267
590,-0.12267
591,-0.12267
592,-0.12267
593,-0.12267
594,-0.12267
595,-0.12267
596,-0.12267
597,-0.12267
598,-0.12267
599,-0.12267
600,-0.12267
601,-0.12267
602,-0.12267
603,-0.12267
604,-0.12267
605,-0.12267
606,-0.12267
607,-0.12267
608,-0.12267
609,-0.12267
610,-0.12267
611,-0.12267
612,-0.12267
613,-0.12267
614,-0.12267
615,6.1924
616,11.605
617,-0.12267
618,-0.12267
619,-0.12267
620,-0.12267
621,-0.12267
622,-0.12267
623,-0.12267
624,-0.12267
625,-0.12267
626,-0.12267
627,-0.12267
628,-0.12267
629,-0.12267
630,-0.12267
631,-0.12267
632,-0.12267
633,-0.12267
634,-0.12267
635,-0.12267
636,-0.12267
637,-0.12267
638,-0.12267
639,-0.12267
640,-0.12267
641,-0.12267
642,-0.12267
643,-0.12267
644,-0.12267
645,-0.12267
646,-0.12267
647,-0.12267
648,-0.12267
649,-0.12267
650,-0.12267
651,-0.12267
652,-0.12267
653,-0.12267
654,-0.12267
655,-0.12267
656,-0.12267
657,-0.12267
658,-0.12267
659,-0.12267
660,-0.12267
661,-0.12267
662,-0.12267
663,-0.12267
664,-0.12267
665,-0.12267
666,-0.12267
667,-0.12267
668,-0.12267
669,-0.12267
670,-0.12267
671,-0.12267
672,-0.12267
673,-0.12267
674,-0.12267
675,-0.12267
676,-0.12267
677,-0.12267
678,-0.12267
679,-0.12267
680,-0.12267
681,-0.12267
682,-0.12267
683,-0.12267
684,-0.12267
685,-0.12267
686,-0.12267
687,-0.12267
688,-0.12267
689,-0.12267
690,-0.12267
691,-0.12267
692,-0.12267
693,-0.12267
694,-0.12267
695,-0.12267
696,-0.12267
697,-0.12267
698,-0.12267
699,-0.12267
700,-0.12267
701,-0.12267
702,-0.12267
703,-0.12267
704,-0.12267
705,-0.12267
706,-0.12267
707,-0.12267
708,-0.12267
709,-0.12267
710,-0.12267
711,-0.12267
712,-0.12267
713,-0.12267
714,-0.12267
715,-0.12267
716,-0.12267
717,-0.12267
718,-0.12267
719,-0.12267
