time,value
0,0.7319399999999999
1,0.7319399999999999
2,0.7319399999999999
3,0.7319399999999999
4,0.7319399999999999
5,0.7319399999999999
6,0.7319399999999999
7,0.7319399999999999
8,0.7319399999999999
9,0.7319399999999999
10,0.7319399999999999
11,0.7319399999999999
12,0.7319399999999999
13,0.7319399999999999
14,0.7319399999999999
15,0.7319399999999999
16,0.7319399999999999
17,0.7319399999999999
18,0.7319399999999999
19,0.7319399999999999
20,0.7319399999999999
21,0.7319399999999999
22,0.7319399999999999
23,0.7319399999999999
24,0.7319399999999999
25,0.7319399999999999
26,0.7319399999999999
27,0.7319399999999999
28,0.7319399999999999
29,0.7319399999999999
30,0.7319399999999999
31,0.7319399999999999
32,0.7319399999999999
33,0.7319399999999999
34,0.7319399999999999
35,0.7319399999999999
36,0.7319399999999999
37,0.7319399999999999
38,0.7319399999999999
39,0.7319399999999999
40,0.7319399999999999
41,0.7319399999999999
42,0.7319399999999999
43,0.7319399999999999
44,0.7319399999999999
45,0.7319399999999999
46,0.7319399999999999
47,0.7319399999999999
48,0.7319399999999999
49,0.7319399999999999
50,0.7319399999999999
51,0.7319399999999999
52,0.78572
53,0.8508700000000001
54,0.9288799999999999
55,1.0069
56,1.0817
57,1.1494
58,1.2051
59,1.2571
60,1.3091
61,1.36
62,1.4071
63,1.4331
64,1.4591
65,1.4851
66,1.5111
67,1.5371
68,1.5632
69,1.5892
70,1.6152
71,1.6412
72,1.6672
73,1.6932
74,1.7192
75,1.7452
76,1.7707
77,1.7946
78,1.8027
79,1.8027
80,1.8027
81,1.8027
82,1.8023
83,1.7827
84,1.7601
85,1.7341
86,1.7081
87,1.68
88,1.6484
89,1.6107
90,1.5717
91,1.5327
92,1.4937
93,1.4547
94,1.4157
95,1.3767
96,1.3377
97,1.2987
98,1.2652
99,1.2362
100,1.2102
101,1.1842
102,1.1582
103,1.1427
104,1.1335
105,1.1335
106,1.1335
107,1.1327
108,1.1297
109,1.11
110,1.084
111,1.058
112,1.032
113,1.006
114,0.98003
115,0.9540200000000001
116,0.9280200000000001
117,0.90202
118,0.87602
119,0.8500200000000001
120,0.8240200000000001
121,0.79801
122,0.7720100000000001
123,0.7460100000000001
124,0.72001
125,0.69401
126,0.6679999999999999
127,0.642
128,0.616
129,0.59643
130,0.58105
131,0.56805
132,0.55505
133,0.54204
134,0.52904
135,0.5160399999999999
136,0.5030399999999999
137,0.49004
138,0.4764
139,0.46148
140,0.43782
141,0.41181999999999996
142,0.38582
143,0.35982
144,0.33224000000000004
145,0.29558
146,0.25751999999999997
147,0.21850999999999998
148,0.17951
149,0.14375
150,0.11114
151,0.084882
152,0.058879999999999995
153,0.032878
154,0.0050282
155,-0.026585
156,-0.065588
157,-0.10459
158,-0.14359
159,-0.1826
160,-0.20681999999999998
161,-0.22351999999999997
162,-0.23651999999999998
163,-0.24952
164,-0.26304
165,-0.28926
166,-0.32177
167,-0.36077
168,-0.39978
169,-0.43878
170,-0.47778000000000004
171,-0.51678
172,-0.55579
173,-0.5947899999999999
174,-0.63379
175,-0.6728
176,-0.7118
177,-0.7508
178,-0.7898
179,-0.82881
180,-0.8639100000000001
181,-0.89594
182,-0.92194
183,-0.94795
184,-0.97395
185,-0.99519
186,-1.008
187,-1.008
188,-1.008
189,-1.008
190,-1.008
191,-1.008
192,-1.008
193,-1.008
194,-1.008
195,-1.008
196,-1.008
197,-1.008
198,-1.008
199,-1.008
200,-1.0093
201,-1.0121
202,-1.0242
203,-1.0372
204,-1.0502
205,-1.0632
206,-1.0762
207,-1.0893
208,-1.1023
209,-1.1153
210,-1.1283
211,-1.1366
212,-1.1419
213,-1.1419
214,-1.1419
215,-1.1419
216,-1.1419
217,-1.1419
218,-1.1419
219,-1.1419
220,-1.1419
221,-1.1419
222,-1.1514
223,-1.1634
224,-1.1764
225,-1.1894
226,-1.2024
227,-1.2154
228,-1.2284
229,-1.2414
230,-1.2544
231,-1.2641
232,-1.2707
233,-1.258
234,-1.245
235,-1.232
236,-1.219
237,-1.206
238,-1.193
239,-1.18
240,-1.167
241,-1.1540000000000001
242,-1.141
243,-1.128
244,-1.115
245,-1.102
246,-1.089
247,-1.0759999999999998
248,-1.063
249,-1.05
250,-1.037
251,-1.024
252,-1.011
253,-1.0086
254,-1.008
255,-1.008
256,-1.008
257,-1.0062
258,-0.99834
259,-0.98695
260,-0.97395
261,-0.96095
262,-0.95009
263,-0.9411299999999999
264,-0.9411299999999999
265,-0.9411299999999999
266,-0.9411299999999999
267,-0.9411299999999999
268,-0.9361299999999999
269,-0.9237700000000001
270,-0.91086
271,-0.89786
272,-0.8848600000000001
273,-0.8780399999999999
274,-0.8742
275,-0.8742
276,-0.8742
277,-0.8742
278,-0.8742
279,-0.8742
280,-0.8742
281,-0.8742
282,-0.8742
283,-0.8742
284,-0.8742
285,-0.8742
286,-0.8742
287,-0.8742
288,-0.8742
289,-0.8742
290,-0.8742
291,-0.8742
292,-0.8742
293,-0.8742
294,-0.8742
295,-0.8742
296,-0.8742
297,-0.8742
298,-0.8742
299,-0.8801899999999999
300,-0.89297
301,-0.90596
302,-0.91896
303,-0.93196
304,-0.93085
305,-0.92429
306,-0.9112899999999999
307,-0.8982899999999999
308,-0.88608
309,-0.87735
310,-0.8742
311,-0.8742
312,-0.8742
313,-0.8742
314,-0.8742
