time,value
0,-1.7077
1,-1.666
2,-1.6242
3,-1.6307
4,-1.6817
5,-1.6556
6,-1.6130000000000002
7,-1.6327
8,-1.7431
9,-1.6587
10,-1.6619
11,-1.6533
12,-1.6617
13,-1.6733
14,-1.6763
15,-1.6375
16,-1.6259
17,-1.6256
18,-1.6934
19,-1.6596
20,-1.6525
21,-1.6025
22,-1.6642
23,-1.6502
24,-1.6873
25,-1.6428
26,-1.6309
27,-1.6466
28,-1.6584
29,-1.5989
30,-1.6537
31,-1.6647
32,-1.6281
33,-1.6508
34,-1.6697
35,-1.6422
36,-1.6558
37,-1.6933
38,-1.6571
39,-1.6686
40,-1.5932
41,-1.6455
42,-1.7176
43,-1.6134
44,-1.6598
45,-1.6014
46,-1.6372
47,-1.6402
48,-1.6265
49,-1.6827
50,-1.6432
51,-1.5941
52,-1.6428
53,-1.61
54,-1.6365
55,-1.6543
56,-1.6346
57,-1.6292
58,-1.6582
59,-1.6238
60,-1.6044
61,-1.5984
62,-1.5703
63,-1.4904
64,-1.4702
65,-1.495
66,-1.4342
67,-1.4614
68,-1.3959
69,-1.3644
70,-1.3123
71,-1.232
72,-1.1016
73,-1.0390000000000001
74,-0.92884
75,-0.81914
76,-0.73657
77,-0.61919
78,-0.50307
79,-0.31703000000000003
80,-0.28476
81,-0.13154000000000002
82,-0.044085
83,0.063386
84,0.065106
85,0.20886
86,0.25554
87,0.31467
88,0.40654
89,0.49368999999999996
90,0.47817
91,0.5464899999999999
92,0.5537
93,0.53809
94,0.64342
95,0.59229
96,0.62697
97,0.61448
98,0.62334
99,0.65684
100,0.69147
101,0.6268699999999999
102,0.64054
103,0.6085699999999999
104,0.65741
105,0.67571
106,0.6682600000000001
107,0.61629
108,0.69409
109,0.6493899999999999
110,0.62713
111,0.70318
112,0.70121
113,0.68662
114,0.6462100000000001
115,0.67798
116,0.6706
117,0.6240100000000001
118,0.67413
119,0.6110399999999999
120,0.6907
121,0.70885
122,0.66768
123,0.61848
124,0.6723100000000001
125,0.68475
126,0.5778300000000001
127,0.62292
128,0.66664
129,0.60273
130,0.67171
131,0.59588
132,0.6584899999999999
133,0.63902
134,0.64952
135,0.65787
136,0.62005
137,0.66635
138,0.7051
139,0.70641
140,0.6632600000000001
141,0.63262
142,0.61733
143,0.64922
144,0.6732199999999999
145,0.64413
146,0.6552100000000001
147,0.65051
148,0.7047100000000001
149,0.6754
150,0.67805
151,0.6486
152,0.6914100000000001
153,0.6436
154,0.65484
155,0.69155
156,0.61952
157,0.64579
158,0.69293
159,0.6196699999999999
160,0.63285
161,0.66701
162,0.62629
163,0.66065
164,0.66885
165,0.63167
166,0.72151
167,0.6077199999999999
168,0.638
169,0.6352399999999999
170,0.65328
171,0.6463800000000001
172,0.6836
173,0.7499
174,0.66447
175,0.6561899999999999
176,0.65477
177,0.65828
178,0.60721
179,0.7061
180,0.67201
181,0.68283
182,0.72454
183,0.59942
184,0.64683
185,0.7072
186,0.59105
187,0.6009
188,0.65778
189,0.68037
190,0.67409
191,0.67504
192,0.65545
193,0.6696
194,0.65638
195,0.64495
196,0.6270899999999999
197,0.64987
198,0.66842
199,0.7343
200,0.61711
201,0.6928300000000001
202,0.69831
203,0.63463
204,0.66196
205,0.70352
206,0.65674
207,0.6339199999999999
208,0.62936
209,0.6754100000000001
210,0.70686
211,0.67467
212,0.70714
213,0.63621
214,0.64622
215,0.62336
216,0.67604
217,0.62602
218,0.64454
219,0.66647
220,0.63872
221,0.66845
222,0.7135199999999999
223,0.6338199999999999
224,0.64171
225,0.67205
226,0.67405
227,0.62638
228,0.63335
229,0.62252
230,0.64718
231,0.67925
232,0.6582899999999999
233,0.66752
234,0.647
235,0.63503
236,0.6270899999999999
237,0.64954
238,0.66964
239,0.6433800000000001
240,0.65387
241,0.68448
242,0.64654
243,0.6138399999999999
244,0.67124
245,0.6308199999999999
246,0.64693
247,0.66437
248,0.6799
249,0.67206
250,0.68601
251,0.64755
252,0.6202300000000001
253,0.70053
254,0.6300100000000001
255,0.66893
256,0.66855
257,0.66183
258,0.67937
259,0.62876
260,0.6583899999999999
261,0.67064
262,0.7140000000000001
263,0.6439699999999999
264,0.69422
265,0.6463899999999999
266,0.6482399999999999
267,0.685
268,0.65418
269,0.66127
270,0.64867
271,0.69447
272,0.64257
273,0.65556
274,0.70985
