time,value
0,-0.030971
1,-0.08644099999999999
2,-0.030971
3,-0.030971
4,-0.08644099999999999
5,-0.030971
6,-0.030971
7,-0.030971
8,-0.08644099999999999
9,-0.030971
10,-0.030971
11,-0.08644099999999999
12,-0.030971
13,-0.030971
14,-0.08644099999999999
15,-0.030971
16,-0.030971
17,-0.030971
18,-0.08644099999999999
19,-0.030971
20,-0.030971
21,-0.08644099999999999
22,-0.030971
23,-0.030971
24,-0.030971
25,-0.08644099999999999
26,-0.030971
27,-0.030971
28,-0.08644099999999999
29,-0.030971
30,-0.030971
31,-0.030971
32,-0.08644099999999999
33,-0.030971
34,-0.030971
35,-0.08644099999999999
36,-0.030971
37,-0.030971
38,-0.08644099999999999
39,-0.030971
40,-0.030971
41,-0.08644099999999999
42,-0.030971
43,-0.030971
44,-0.030971
45,-0.08644099999999999
46,-0.030971
47,-0.030971
48,-0.08644099999999999
49,-0.030971
50,-0.030971
51,-0.030971
52,-0.08644099999999999
53,-0.030971
54,-0.030971
55,-0.08644099999999999
56,-0.030971
57,-0.030971
58,-0.08644099999999999
59,-0.030971
60,-0.030971
61,-0.030971
62,-0.08644099999999999
63,-0.030971
64,-0.030971
65,-0.08644099999999999
66,-0.030971
67,-0.030971
68,-0.030971
69,-0.08644099999999999
70,-0.030971
71,-0.030971
72,-0.08644099999999999
73,-0.030971
74,-0.030971
75,-0.030971
76,-0.08644099999999999
77,-0.030971
78,-0.030971
79,-0.030971
80,-0.08644099999999999
81,-0.030971
82,-0.030971
83,-0.030971
84,-0.08644099999999999
85,-0.030971
86,-0.030971
87,-0.08644099999999999
88,-0.030971
89,-0.030971
90,-0.030971
91,-0.08644099999999999
92,-0.030971
93,-0.030971
94,-0.030971
95,-0.08644099999999999
96,-0.030971
97,-0.030971
98,-0.030971
99,-0.08644099999999999
100,-0.030971
101,-0.030971
102,-0.08644099999999999
103,-0.030971
104,-0.030971
105,-0.030971
106,-0.08644099999999999
107,-0.030971
108,-0.030971
109,-0.030971
110,-0.08644099999999999
111,-0.030971
112,-0.030971
113,-0.030971
114,-0.08644099999999999
115,-0.030971
116,-0.030971
117,-0.030971
118,-0.08644099999999999
119,-0.030971
120,-0.030971
121,-0.08644099999999999
122,-0.030971
123,-0.030971
124,-0.030971
125,-0.08644099999999999
126,-0.030971
127,-0.030971
128,-0.030971
129,-0.08644099999999999
130,-0.030971
131,-0.030971
132,-0.030971
133,-0.08644099999999999
134,-0.030971
135,-0.030971
136,-0.030971
137,-0.08644099999999999
138,-0.030971
139,-0.030971
140,-0.08644099999999999
141,-0.030971
142,-0.030971
143,-0.030971
144,-0.08644099999999999
145,-0.030971
146,-0.030971
147,-0.030971
148,-0.08644099999999999
149,-0.030971
150,-0.030971
151,-0.030971
152,-0.08644099999999999
153,-0.030971
154,-0.030971
155,-0.08644099999999999
156,-0.030971
157,-0.030971
158,-0.030971
159,-0.08644099999999999
160,-0.030971
161,-0.030971
162,-0.030971
163,-0.08644099999999999
164,-0.030971
165,-0.030971
166,-0.08644099999999999
167,-0.030971
168,-0.030971
169,-0.030971
170,-0.08644099999999999
171,-0.030971
172,-0.030971
173,-0.030971
174,-0.08644099999999999
175,-0.030971
176,-0.030971
177,-0.08644099999999999
178,-0.030971
179,-0.030971
180,-0.030971
181,-0.08644099999999999
182,-0.030971
183,-0.030971
184,-0.030971
185,-0.08644099999999999
186,-0.030971
187,-0.030971
188,-0.08644099999999999
189,-0.030971
190,-0.030971
191,-0.030971
192,-0.08644099999999999
193,-0.030971
194,-0.030971
195,-0.08644099999999999
196,-0.030971
197,-0.030971
198,-0.08644099999999999
199,-0.030971
200,-0.030971
201,-0.08644099999999999
202,-0.030971
203,-0.030971
204,-0.030971
205,-0.08644099999999999
206,-0.030971
207,-0.030971
208,-0.08644099999999999
209,-0.030971
210,-0.030971
211,-0.08644099999999999
212,-0.030971
213,-0.030971
214,-0.030971
215,-0.08644099999999999
216,-0.030971
217,-0.030971
218,-0.08644099999999999
219,-0.030971
220,-0.08644099999999999
221,-0.030971
222,-0.030971
223,-0.030971
224,-0.08644099999999999
225,-0.030971
226,-0.030971
227,-0.08644099999999999
228,-0.030971
229,-0.030971
230,-0.08644099999999999
231,-0.030971
232,-0.030971
233,-0.08644099999999999
234,-0.030971
235,-0.030971
236,-0.08644099999999999
237,-0.030971
238,-0.030971
239,-0.08644099999999999
240,-0.030971
241,-0.08644099999999999
242,-0.030971
243,-0.030971
244,-0.030971
245,-0.08644099999999999
246,-0.030971
247,-0.030971
248,-0.08644099999999999
249,-0.030971
250,-0.030971
251,-0.08644099999999999
252,-0.030971
253,-0.030971
254,-0.08644099999999999
255,-0.030971
256,-0.08644099999999999
257,-0.030971
258,-0.030971
259,-0.08644099999999999
260,-0.030971
261,-0.030971
262,-0.08644099999999999
263,-0.030971
264,-0.030971
265,-0.08644099999999999
266,-0.030971
267,-0.030971
268,-0.08644099999999999
269,-0.030971
270,-0.030971
271,-0.08644099999999999
272,-0.030971
273,-0.030971
274,-0.030971
275,-0.08644099999999999
276,-0.030971
277,-0.030971
278,-0.030971
279,-0.08644099999999999
280,-0.030971
281,-0.030971
282,-0.08644099999999999
283,-0.030971
284,-0.030971
285,-0.030971
286,-0.08644099999999999
287,-0.030971
288,-0.030971
289,-0.08644099999999999
290,-0.030971
291,-0.030971
292,-0.030971
293,-0.08644099999999999
294,-0.030971
295,-0.030971
296,-0.08644099999999999
297,-0.030971
298,-0.030971
299,-0.08644099999999999
300,-0.030971
301,-0.030971
302,-0.030971
303,-0.08644099999999999
304,-0.030971
305,-0.030971
306,-0.08644099999999999
307,-0.030971
308,-0.030971
309,-0.030971
310,-0.08644099999999999
311,-0.030971
312,-0.030971
313,-0.08644099999999999
314,-0.030971
315,-0.030971
316,-0.08644099999999999
317,-0.030971
318,-0.030971
319,-0.08644099999999999
320,-0.030971
321,-0.030971
322,-0.08644099999999999
323,-0.030971
324,-0.030971
325,-0.08644099999999999
326,-0.030971
327,-0.030971
328,-0.08644099999999999
329,-0.030971
330,-0.030971
331,-0.08644099999999999
332,-0.030971
333,-0.030971
334,-0.08644099999999999
335,-0.030971
336,-0.030971
337,-0.08644099999999999
338,-0.030971
339,-0.030971
340,-0.08644099999999999
341,-0.030971
342,-0.030971
343,-0.08644099999999999
344,-0.030971
345,-0.030971
346,-0.08644099999999999
347,-0.030971
348,-0.030971
349,-0.08644099999999999
350,-0.030971
351,-0.030971
352,-0.08644099999999999
353,-0.030971
354,-0.030971
355,-0.08644099999999999
356,-0.030971
357,-0.030971
358,-0.030971
359,-0.08644099999999999
360,-0.030971
361,-0.030971
362,-0.08644099999999999
363,-0.030971
364,-0.030971
365,-0.08644099999999999
366,-0.030971
367,-0.030971
368,-0.08644099999999999
369,-0.030971
370,-0.030971
371,-0.08644099999999999
372,-0.030971
373,-0.030971
374,-0.08644099999999999
375,-0.030971
376,-0.030971
377,-0.08644099999999999
378,-0.030971
379,-0.030971
380,-0.08644099999999999
381,-0.030971
382,-0.030971
383,-0.08644099999999999
384,-0.030971
385,-0.030971
386,-0.030971
387,-0.08644099999999999
388,-0.030971
389,-0.030971
390,-0.08644099999999999
391,-0.030971
392,-0.030971
393,-0.08644099999999999
394,-0.030971
395,-0.030971
396,-0.08644099999999999
397,-0.030971
398,-0.030971
399,-0.08644099999999999
400,-0.030971
401,-0.030971
402,-0.030971
403,-0.08644099999999999
404,-0.030971
405,-0.030971
406,-0.08644099999999999
407,-0.030971
408,-0.030971
409,-0.08644099999999999
410,-0.030971
411,-0.030971
412,-0.08644099999999999
413,-0.030971
414,-0.030971
415,-0.08644099999999999
416,-0.030971
417,-0.030971
418,-0.08644099999999999
419,-0.030971
420,-0.030971
421,-0.030971
422,-0.08644099999999999
423,-0.030971
424,-0.030971
425,-0.08644099999999999
426,-0.030971
427,-0.030971
428,-0.08644099999999999
429,-0.030971
430,-0.030971
431,-0.08644099999999999
432,-0.030971
433,-0.030971
434,-0.08644099999999999
435,-0.030971
436,-0.030971
437,-0.030971
438,-0.08644099999999999
439,-0.030971
440,-0.030971
441,-0.08644099999999999
442,-0.030971
443,-0.030971
444,-0.08644099999999999
445,-0.030971
446,-0.030971
447,-0.08644099999999999
448,-0.030971
449,-0.030971
450,-0.08644099999999999
451,-0.030971
452,-0.030971
453,-0.030971
454,-0.08644099999999999
455,-0.030971
456,-0.030971
457,-0.08644099999999999
458,-0.030971
459,-0.030971
460,-0.08644099999999999
461,-0.030971
462,-0.030971
463,-0.030971
464,-0.08644099999999999
465,-0.030971
466,-0.030971
467,-0.08644099999999999
468,-0.030971
469,-0.030971
470,-0.08644099999999999
471,-0.030971
472,-0.030971
473,-0.08644099999999999
474,-0.030971
475,-0.030971
476,-0.08644099999999999
477,-0.030971
478,-0.030971
479,-0.030971
480,-0.08644099999999999
481,-0.030971
482,-0.030971
483,-0.08644099999999999
484,-0.030971
485,-0.030971
486,-0.08644099999999999
487,-0.030971
488,-0.030971
489,-0.08644099999999999
490,-0.030971
491,-0.030971
492,-0.08644099999999999
493,-0.030971
494,-0.030971
495,-0.08644099999999999
496,-0.030971
497,-0.030971
498,-0.08644099999999999
499,-0.030971
500,-0.030971
501,-0.08644099999999999
502,-0.030971
503,-0.030971
504,-0.08644099999999999
505,-0.030971
506,-0.030971
507,-0.08644099999999999
508,-0.030971
509,-0.030971
510,-0.08644099999999999
511,-0.030971
512,-0.030971
513,-0.030971
514,-0.08644099999999999
515,-0.030971
516,-0.030971
517,-0.08644099999999999
518,-0.030971
519,-0.030971
520,-0.08644099999999999
521,-0.030971
522,-0.08644099999999999
523,-0.030971
524,-0.030971
525,-0.08644099999999999
526,-0.030971
527,-0.08644099999999999
528,-0.030971
529,-0.08644099999999999
530,-0.030971
531,-0.030971
532,-0.08644099999999999
533,-0.030971
534,-0.08644099999999999
535,-0.030971
536,-0.08644099999999999
537,-0.030971
538,-0.030971
539,-0.08644099999999999
540,-0.030971
541,-0.030971
542,-0.08644099999999999
543,-0.030971
544,-0.08644099999999999
545,-0.030971
546,-0.030971
547,-0.08644099999999999
548,-0.030971
549,-0.030971
550,-0.08644099999999999
551,-0.030971
552,-0.08644099999999999
553,-0.030971
554,-0.030971
555,-0.08644099999999999
556,-0.030971
557,-0.08644099999999999
558,-0.030971
559,-0.030971
560,-0.08644099999999999
561,-0.030971
562,-0.08644099999999999
563,-0.030971
564,-0.030971
565,-0.08644099999999999
566,-0.030971
567,-0.030971
568,-0.08644099999999999
569,-0.030971
570,-0.030971
571,-0.08644099999999999
572,-0.030971
573,-0.08644099999999999
574,-0.030971
575,-0.030971
576,-0.08644099999999999
577,-0.030971
578,-0.030971
579,-0.08644099999999999
580,-0.030971
581,-0.08644099999999999
582,-0.030971
583,-0.030971
584,-0.08644099999999999
585,-0.030971
586,-0.030971
587,-0.08644099999999999
588,-0.030971
589,-0.08644099999999999
590,-0.030971
591,-0.030971
592,-0.08644099999999999
593,-0.030971
594,-0.030971
595,-0.08644099999999999
596,-0.030971
597,-0.08644099999999999
598,-0.030971
599,-0.030971
600,-0.08644099999999999
601,-0.030971
602,-0.030971
603,-0.08644099999999999
604,-0.030971
605,-0.030971
606,-0.08644099999999999
607,-0.030971
608,-0.030971
609,-0.08644099999999999
610,-0.030971
611,-0.030971
612,-0.08644099999999999
613,-0.030971
614,-0.08644099999999999
615,-0.030971
616,-0.030971
617,-0.08644099999999999
618,-0.030971
619,-0.030971
620,-0.08644099999999999
621,-0.030971
622,-0.08644099999999999
623,-0.030971
624,-0.030971
625,-0.08644099999999999
626,-0.030971
627,-0.08644099999999999
628,-0.030971
629,-0.030971
630,-0.08644099999999999
631,-0.030971
632,-0.08644099999999999
633,-0.030971
634,-0.030971
635,-0.08644099999999999
636,-0.030971
637,-0.08644099999999999
638,-0.030971
639,-0.030971
640,-0.08644099999999999
641,-0.030971
642,-0.08644099999999999
643,-0.030971
644,-0.08644099999999999
645,-0.030971
646,-0.030971
647,-0.08644099999999999
648,-0.030971
649,-0.08644099999999999
650,-0.030971
651,-0.08644099999999999
652,-0.030971
653,-0.030971
654,-0.08644099999999999
655,-0.030971
656,-0.08644099999999999
657,-0.030971
658,-0.08644099999999999
659,-0.030971
660,-0.08644099999999999
661,-0.030971
662,-0.030971
663,-0.08644099999999999
664,-0.030971
665,-0.08644099999999999
666,-0.030971
667,9.8982
668,24.875
669,0.24638000000000002
670,0.024499
671,-0.08644099999999999
672,-0.030971
673,-0.08644099999999999
674,-0.030971
675,-0.08644099999999999
676,-0.030971
677,-0.030971
678,-0.08644099999999999
679,-0.030971
680,-0.08644099999999999
681,-0.030971
682,-0.030971
683,-0.08644099999999999
684,-0.030971
685,-0.08644099999999999
686,-0.030971
687,-0.030971
688,-0.08644099999999999
689,-0.030971
690,-0.030971
691,-0.08644099999999999
692,-0.030971
693,-0.030971
694,-0.08644099999999999
695,-0.030971
696,-0.030971
697,-0.08644099999999999
698,-0.030971
699,-0.030971
700,-0.08644099999999999
701,-0.030971
702,-0.030971
703,-0.030971
704,-0.08644099999999999
705,-0.030971
706,-0.030971
707,-0.08644099999999999
708,-0.030971
709,-0.030971
710,-0.08644099999999999
711,-0.030971
712,-0.030971
713,-0.030971
714,-0.08644099999999999
715,-0.030971
716,-0.030971
717,-0.08644099999999999
718,-0.030971
719,-0.030971
