time,value
0,1.4412
1,1.7344
2,0.12177
3,-0.61127
4,-0.61127
5,-0.61127
6,-0.61127
7,-0.61127
8,-0.61127
9,-0.61127
10,-0.61127
11,-0.61127
12,-0.61127
13,-0.61127
14,-0.61127
15,-0.61127
16,-0.61127
17,-0.61127
18,-0.61127
19,-0.61127
20,-0.61127
21,-0.61127
22,-0.61127
23,-0.61127
24,-0.61127
25,-0.61127
26,-0.61127
27,-0.61127
28,-0.61127
29,-0.61127
30,-0.61127
31,-0.61127
32,-0.61127
33,-0.61127
34,-0.61127
35,-0.61127
36,-0.61127
37,-0.61127
38,0.26837
39,2.0277
40,1.7344
41,1.7344
42,1.7344
43,1.7344
44,1.7344
45,1.7344
46,1.7344
47,1.7344
48,1.4412
49,1.7344
50,1.4412
51,1.4412
52,-0.61127
53,-0.61127
54,-0.61127
55,-0.61127
56,-0.61127
57,-0.61127
58,-0.61127
59,-0.61127
60,-0.61127
61,-0.61127
62,-0.61127
63,-0.61127
64,-0.61127
65,-0.61127
66,-0.61127
67,-0.61127
68,-0.61127
69,-0.61127
70,-0.61127
71,-0.61127
72,-0.61127
73,-0.61127
74,-0.61127
75,-0.61127
76,-0.61127
77,-0.61127
78,-0.61127
79,-0.61127
80,-0.61127
81,-0.61127
82,-0.61127
83,-0.61127
84,-0.61127
85,-0.61127
86,-0.61127
87,-0.61127
88,-0.61127
89,-0.61127
90,0.26837
91,1.7344
92,2.0277
93,1.7344
94,1.7344
95,1.7344
96,1.7344
97,1.7344
98,1.7344
99,1.7344
100,1.4412
101,1.7344
102,1.4412
103,0.70819
104,-0.46466
105,-0.61127
106,-0.61127
107,-0.61127
108,-0.61127
109,-0.61127
110,-0.61127
111,-0.61127
112,-0.61127
113,-0.61127
114,-0.61127
115,-0.61127
116,-0.61127
117,-0.61127
118,-0.61127
119,-0.61127
120,-0.61127
121,-0.61127
122,-0.61127
123,-0.61127
124,-0.61127
125,-0.61127
126,-0.61127
127,-0.61127
128,-0.61127
129,-0.61127
130,-0.61127
131,-0.61127
132,-0.61127
133,-0.61127
134,-0.61127
135,-0.61127
136,-0.61127
137,-0.61127
138,-0.61127
139,-0.61127
140,-0.61127
141,-0.61127
142,-0.61127
143,-0.61127
144,0.26837
145,2.0277
146,1.7344
147,1.7344
148,1.7344
149,1.7344
150,1.7344
151,1.7344
152,1.7344
153,1.4412
154,1.7344
155,1.4412
156,1.7344
157,1.4412
158,-0.31806
159,-0.61127
160,-0.61127
161,-0.61127
162,-0.61127
163,-0.61127
164,-0.61127
165,-0.61127
166,-0.61127
167,-0.61127
168,-0.61127
169,-0.61127
170,-0.61127
171,-0.61127
172,-0.61127
173,-0.61127
174,-0.61127
175,-0.61127
176,-0.61127
177,-0.61127
178,-0.61127
179,-0.61127
180,-0.61127
181,-0.61127
182,-0.61127
183,-0.61127
184,-0.61127
185,-0.61127
186,-0.61127
187,-0.61127
188,-0.61127
189,-0.61127
190,-0.61127
191,-0.61127
192,-0.61127
193,-0.61127
194,-0.61127
195,-0.61127
196,-0.61127
197,-0.61127
198,-0.61127
199,-0.61127
200,-0.61127
201,1.148
202,2.0277
203,1.7344
204,1.7344
205,1.7344
206,2.0277
207,1.7344
208,1.4412
209,1.7344
210,1.7344
211,1.4412
212,1.7344
213,1.4412
214,1.4412
215,-0.39136
216,-0.61127
217,-0.61127
218,-0.61127
219,-0.61127
220,-0.61127
221,-0.61127
222,-0.61127
223,-0.61127
224,-0.61127
225,-0.61127
226,-0.61127
227,-0.61127
228,-0.61127
229,-0.61127
230,-0.61127
231,-0.61127
232,-0.61127
233,-0.61127
234,-0.61127
235,-0.61127
236,-0.53797
237,-0.61127
238,-0.61127
239,-0.61127
240,-0.61127
241,-0.61127
242,-0.61127
243,-0.61127
244,-0.61127
245,-0.61127
246,-0.61127
247,-0.61127
248,-0.61127
249,-0.61127
250,-0.61127
251,1.148
252,1.7344
253,2.0277
254,1.7344
255,1.7344
256,1.7344
257,1.7344
258,1.7344
259,1.7344
260,1.4412
261,1.7344
262,1.4412
263,1.7344
264,1.4412
265,1.7344
266,-0.31806
267,-0.53797
268,-0.61127
269,-0.61127
270,-0.61127
271,-0.61127
272,-0.61127
273,-0.61127
274,-0.61127
275,-0.61127
276,-0.61127
277,-0.61127
278,-0.61127
279,-0.61127
280,-0.61127
281,-0.61127
282,-0.61127
283,-0.61127
284,-0.61127
285,-0.61127
286,-0.61127
287,-0.61127
288,-0.61127
289,-0.61127
290,-0.61127
291,-0.61127
292,-0.61127
293,-0.61127
294,-0.61127
295,-0.61127
296,-0.61127
297,-0.61127
298,-0.61127
299,-0.61127
300,-0.61127
301,-0.61127
302,-0.61127
303,-0.61127
304,1.148
305,2.0277
306,1.7344
307,2.0277
308,1.7344
309,1.7344
310,1.7344
311,1.4412
312,1.7344
313,1.7344
314,1.4412
315,1.7344
316,1.4412
317,1.148
318,-0.46466
319,-0.61127
320,-0.61127
321,-0.61127
322,-0.61127
323,-0.61127
324,-0.61127
325,-0.61127
326,-0.61127
327,-0.61127
328,-0.61127
329,-0.61127
330,-0.61127
331,-0.61127
332,-0.61127
333,-0.61127
334,-0.61127
335,-0.61127
336,-0.61127
337,-0.61127
338,-0.61127
339,-0.61127
340,-0.61127
341,-0.61127
342,-0.61127
343,-0.61127
344,-0.61127
345,-0.61127
346,-0.61127
347,-0.61127
348,-0.61127
349,-0.61127
350,-0.61127
351,-0.61127
352,-0.61127
353,-0.61127
354,-0.61127
355,-0.61127
356,-0.61127
357,0.12177
358,1.7344
359,2.0277
360,1.7344
361,1.7344
362,1.7344
363,1.7344
364,1.7344
365,1.7344
366,1.7344
367,1.4412
368,1.7344
369,1.4412
370,1.4412
371,0.26837
372,-0.61127
373,-0.61127
374,-0.61127
375,-0.61127
376,-0.61127
377,-0.61127
378,-0.61127
379,-0.61127
380,-0.61127
381,-0.61127
382,-0.61127
383,-0.61127
384,-0.61127
385,-0.61127
386,-0.61127
387,-0.61127
388,-0.61127
389,-0.61127
390,-0.61127
391,-0.61127
392,-0.61127
393,-0.61127
394,-0.61127
395,-0.61127
396,-0.61127
397,-0.61127
398,-0.61127
399,-0.61127
400,-0.61127
401,-0.61127
402,-0.61127
403,-0.61127
404,-0.61127
405,-0.61127
406,-0.61127
407,-0.61127
408,-0.61127
409,-0.61127
410,-0.61127
411,-0.61127
412,-0.024842
413,2.0277
414,1.7344
415,2.0277
416,1.7344
417,1.7344
418,1.7344
419,1.7344
420,1.7344
421,1.4412
422,1.7344
423,1.4412
424,1.7344
425,1.4412
426,0.12177
427,-0.61127
428,-0.61127
429,-0.61127
430,-0.61127
431,-0.61127
432,-0.61127
433,-0.61127
434,-0.61127
435,-0.61127
436,-0.61127
437,-0.61127
438,-0.61127
439,-0.61127
440,-0.61127
441,-0.61127
442,-0.61127
443,-0.61127
444,-0.61127
445,-0.61127
446,-0.61127
447,-0.61127
448,-0.61127
449,-0.61127
450,-0.61127
451,-0.61127
452,-0.61127
453,-0.61127
454,-0.61127
455,-0.61127
456,-0.61127
457,-0.61127
458,-0.61127
459,-0.61127
460,-0.61127
461,-0.61127
462,-0.61127
463,-0.61127
464,-0.61127
465,-0.61127
466,-0.61127
467,-0.61127
468,-0.61127
469,1.148
470,1.7344
471,2.0277
472,1.7344
473,1.7344
474,1.7344
475,1.4412
476,1.7344
477,1.7344
478,1.4412
479,1.7344
480,1.4412
481,1.7344
482,1.4412
483,1.148
484,-0.46466
485,-0.61127
486,-0.61127
487,-0.61127
488,-0.61127
489,-0.61127
490,-0.61127
491,-0.61127
492,-0.61127
493,-0.61127
494,-0.61127
495,-0.61127
496,-0.61127
497,-0.61127
498,-0.61127
499,-0.61127
500,-0.61127
501,-0.61127
502,-0.61127
503,-0.61127
504,-0.61127
505,-0.61127
506,-0.61127
507,-0.61127
508,-0.53797
509,-0.61127
510,-0.61127
511,-0.61127
512,-0.53797
513,-0.61127
514,-0.61127
515,-0.61127
516,-0.61127
517,1.7344
518,2.0277
519,1.7344
520,1.7344
521,1.7344
522,1.7344
523,1.7344
524,1.4412
525,1.7344
526,1.4412
527,1.7344
528,1.4412
529,1.4412
530,0.48828
531,-0.46466
532,-0.61127
533,-0.53797
534,-0.61127
535,-0.61127
536,-0.61127
537,-0.61127
538,-0.61127
539,-0.61127
540,-0.61127
541,-0.61127
542,-0.61127
543,-0.61127
544,-0.61127
545,-0.61127
546,-0.61127
547,-0.61127
548,-0.61127
549,-0.61127
550,-0.61127
551,-0.61127
552,-0.61127
553,-0.61127
554,-0.61127
555,-0.61127
556,-0.61127
557,-0.61127
558,-0.61127
559,-0.61127
560,-0.61127
561,-0.61127
562,-0.61127
563,-0.61127
564,-0.61127
565,-0.61127
566,0.9281
567,1.7344
568,2.0277
569,1.7344
570,1.7344
571,1.7344
572,1.7344
573,1.7344
574,1.7344
575,1.4412
576,1.7344
577,1.4412
578,1.4412
579,1.4412
580,-0.53797
581,-0.61127
582,-0.61127
583,-0.61127
584,-0.46466
585,-0.61127
586,-0.61127
587,-0.61127
588,-0.61127
589,-0.61127
590,-0.53797
591,-0.61127
592,-0.61127
593,-0.61127
594,-0.61127
595,-0.61127
596,-0.61127
597,-0.61127
598,-0.61127
599,-0.61127
600,-0.61127
601,-0.61127
602,-0.61127
603,-0.61127
604,-0.61127
605,-0.61127
606,-0.61127
607,-0.61127
608,-0.61127
609,0.26837
610,1.7344
611,1.7344
612,1.7344
613,1.7344
614,1.7344
615,1.7344
616,1.4412
617,1.7344
618,1.7344
619,1.4412
620,1.4412
621,1.4412
622,1.7344
623,-0.39136
624,-0.61127
625,-0.61127
626,-0.61127
627,-0.61127
628,-0.61127
629,-0.61127
630,-0.61127
631,-0.61127
632,-0.61127
633,-0.61127
634,-0.61127
635,-0.61127
636,-0.61127
637,-0.61127
638,-0.61127
639,-0.61127
640,-0.61127
641,-0.61127
642,-0.61127
643,-0.61127
644,-0.61127
645,-0.61127
646,-0.61127
647,-0.61127
648,-0.61127
649,-0.61127
650,-0.61127
651,-0.61127
652,-0.61127
653,-0.61127
654,-0.61127
655,-0.61127
656,-0.61127
657,-0.61127
658,-0.61127
659,1.7344
660,1.7344
661,1.7344
662,2.0277
663,1.7344
664,1.7344
665,1.7344
666,1.4412
667,1.7344
668,1.4412
669,1.7344
670,1.4412
671,1.7344
672,0.9281
673,-0.53797
674,-0.61127
675,-0.61127
676,-0.61127
677,-0.61127
678,-0.61127
679,-0.61127
680,-0.61127
681,-0.61127
682,-0.61127
683,-0.61127
684,-0.61127
685,-0.61127
686,-0.61127
687,-0.61127
688,-0.61127
689,-0.61127
690,-0.61127
691,-0.61127
692,-0.61127
693,-0.61127
694,-0.61127
695,-0.61127
696,-0.61127
697,-0.61127
698,-0.61127
699,-0.61127
700,-0.61127
701,-0.61127
702,-0.61127
703,-0.61127
704,-0.61127
705,-0.61127
706,-0.61127
707,-0.61127
708,-0.61127
709,0.48828
710,1.7344
711,1.7344
712,1.7344
713,1.7344
714,1.7344
715,1.7344
716,1.7344
717,1.7344
718,1.7344
719,1.4412
