time,value
0,0.79886
1,0.62445
2,0.45005
3,0.27564
4,0.097596
5,-0.076812
6,-0.25122
7,-0.42563
8,-0.51283
9,-0.64727
10,-0.9125200000000001
11,-1.0143
12,-1.0797
13,-1.1233
14,-1.1887
15,-1.2214
16,-1.3049
17,-1.4139
18,-1.4648
19,-1.5375
20,-1.5375
21,-1.5738
22,-1.5811
23,-1.5447
24,-1.5775
25,-1.5702
26,-1.5993
27,-1.6211
28,-1.6501
29,-1.6283
30,-1.6065
31,-1.5519999999999998
32,-1.4648
33,-1.4103
34,-1.3667
35,-1.3086
36,-1.2831
37,-1.4648
38,-1.1996
39,-1.1051
40,-1.0215
41,-1.2032
42,-1.1487
43,-0.7562800000000001
44,-0.65817
45,-0.65091
46,-0.60004
47,-0.86892
48,-0.62184
49,-0.56007
50,-0.78171
51,-0.46923000000000004
52,-0.6654399999999999
53,-0.6291100000000001
54,-0.5201
55,-0.14585
56,-0.12768
57,-0.16765
58,-0.13132
59,-0.14222
60,-0.13132
61,-0.13858
62,-0.055011000000000004
63,-0.087713
64,-0.007775700000000001
65,0.05399400000000001
66,0.1194
67,0.18117
68,0.24294000000000002
69,0.30471
70,0.36648000000000003
71,0.37738
72,0.43551000000000006
73,0.47548
74,0.50455
75,0.54088
76,0.69713
77,0.7116600000000001
78,0.75526
79,0.7698
80,0.53362
81,0.72619
82,0.48638000000000003
83,0.51908
84,0.52635
85,0.51545
86,0.79523
87,0.50092
88,0.47185
89,0.42461000000000004
90,0.40281
91,0.41734
92,0.42825
93,0.70076
94,0.45005
95,0.45368
96,0.43188000000000004
97,0.45368
98,0.39918000000000003
99,0.40281
100,0.67896
101,0.7370899999999999
102,0.49728
103,0.54815
104,0.54815
105,0.54088
106,0.52998
107,0.46458
108,0.43915
109,0.42098
110,0.41008
111,0.39554
112,0.38101
113,0.37738
114,0.39918000000000003
115,0.44641000000000003
116,0.50455
117,0.54815
118,0.52998
119,0.52635
120,0.73346
121,0.70439
122,0.70076
123,0.66806
124,0.63536
125,0.58812
126,0.52272
127,0.50818
128,0.50455
129,0.5118199999999999
130,0.52998
131,0.55178
132,0.51545
133,0.54452
134,0.55178
135,0.49001999999999996
136,0.42098
137,0.34831
138,0.25384
139,0.1848
140,0.11213
141,0.028558999999999998
142,-0.00050869
143,-0.02231
144,-0.051378
145,0.010392
146,0.11575999999999999
147,0.2284
148,0.33741
149,0.45005
150,0.62445
151,0.8315600000000001
152,0.9587399999999999
153,0.8352
154,0.99144
155,1.0423
156,1.0968
157,1.1368
158,1.2276
159,1.5147
160,1.3984
161,1.4129
162,1.4456
163,1.482
164,1.4856
165,1.5292
166,1.5619
167,1.5619
168,1.4565
169,1.4166
170,1.3330000000000002
171,1.3039
172,1.2676
173,1.2458
174,1.2385
175,1.1985
176,1.1368
177,1.0859
178,1.1004
179,1.1222
180,1.0895
181,1.1186
182,1.0605
183,1.0677
184,0.9878100000000001
185,0.966
186,0.9224
187,0.8824299999999999
188,0.73346
189,0.6280899999999999
190,0.62445
191,0.60992
192,0.66079
193,0.6862199999999999
194,0.71529
195,0.98054
196,0.99871
197,1.0205
198,0.96964
199,0.8606299999999999
200,0.75526
201,0.63172
202,0.54088
203,0.42825
204,0.28654
205,0.20297
206,0.10123
207,0.072161
208,0.010392
209,-0.098613
210,-0.20399
211,-0.36749
212,-0.4983
213,-0.63274
214,-0.70541
215,-0.80715
216,-0.92705
217,-0.9670200000000001
218,-1.0615
219,-1.1596
220,-1.2323
221,-1.2977
222,-1.4139
223,-1.5157
224,-1.5411
225,-1.4939
226,-1.4684
227,-1.5157
228,-1.5484
229,-1.8136
230,-1.9226
231,-2.1152
232,-2.2933
233,-2.3986
234,-2.5222
235,-2.6312
236,-2.7329
237,-2.7910000000000004
238,-2.8492
239,-2.8528
240,-2.8564
241,-2.8564
242,-2.8601
243,-2.8637
244,-2.8673
245,-2.8710000000000004
246,-2.8746
247,-2.8782
248,-2.8782
249,-2.8819
250,-2.8855
251,-2.8891
252,-2.8928
253,-2.8964
254,-2.8964
255,-2.9
256,-2.9037
257,-2.9073
258,-2.9109
259,-2.9146
260,-2.9146
261,-2.9182
262,-2.9218
263,-2.9255
264,-2.9291
265,-2.9328
266,-2.9364
267,-2.9364
268,-2.94
269,-2.9437
270,-2.9473
271,-2.9509
272,-2.9546
273,-2.9546
274,-2.9582
275,-2.9618
276,-2.9655
277,-2.9691
278,-2.9727
279,-2.9328
280,-2.8492
281,-2.7147
282,-2.6094
283,-2.5367
284,-2.4786
285,-2.3841
286,-2.3078
287,-2.2242
288,-2.0789
289,-1.8572
290,-1.7991
291,-1.6792
292,-1.5557
293,-1.4357
294,-1.403
295,-1.2795
296,-1.2395
297,-1.2214
298,-1.0179
299,-0.8107800000000001
300,-0.6036699999999999
301,-0.36023
302,-0.025943
303,0.09032899999999999
304,0.1521
305,0.22114
306,0.30834
307,0.41734
308,0.47911000000000004
309,0.49728
310,0.46458
311,0.42825
312,0.39191
313,0.35921
314,0.32287
315,0.28654
316,0.2502
317,0.2175
318,0.20297
319,0.097596
320,0.06489400000000001
321,0.014025
322,0.014025
323,-0.0041421999999999995
324,-0.098613
325,-0.14585
326,-0.17855
327,-0.17128
328,-0.20035
329,-0.20399
330,-0.22941999999999999
331,-0.24395
332,-0.26211999999999996
333,-0.33843
334,-0.38566
335,-0.45833
336,-0.5455399999999999
337,-0.53463
338,-0.52373
339,-0.51283
340,-0.50193
341,-0.49467
342,-0.48377
343,-0.47286000000000006
344,-0.46196000000000004
345,-0.45106
346,-0.39293
347,-0.33479000000000003
348,-0.27666
349,-0.21489
350,-0.15675
351,-0.076812
352,0.0031248
353,0.083062
354,0.16663
355,0.23567
356,0.30471
357,0.37374
358,0.44641000000000003
359,0.50092
360,0.55542
361,0.60992
362,0.59539
363,0.58449
364,0.5735899999999999
365,0.5626899999999999
366,0.54815
367,0.53725
368,0.52635
369,0.5118199999999999
370,0.50092
371,0.49001999999999996
372,0.41008
373,0.33376999999999996
374,0.30834
375,0.31924
376,0.29744
377,0.24656999999999998
378,0.22114
379,0.1739
380,0.12666
381,0.06489400000000001
382,0.014025
383,-0.080446
384,-0.17128
385,-0.23669
386,-0.28756
387,-0.31661999999999996
388,-0.29119
389,-0.36023
390,-0.39293
391,-0.42200000000000004
392,-0.48013
393,-0.48377
394,-0.46196000000000004
395,-0.4983
396,-0.45106
397,-0.41473000000000004
398,-0.40019
399,-0.38203000000000004
400,-0.36023
401,-0.34206
402,-0.32026
403,-0.30209
404,-0.28029
405,-0.22941999999999999
406,-0.17855
407,-0.18218
408,-0.10225
409,-0.11678
410,0.09032899999999999
411,0.028558999999999998
412,0.24656999999999998
413,0.28654
414,0.35921
415,0.36284
416,0.32650999999999997
417,0.31924
418,0.34831
419,0.34831
420,0.39918000000000003
421,0.39918000000000003
422,0.51545
423,0.64262
424,0.7116600000000001
425,0.7370899999999999
426,0.7370899999999999
427,0.75889
428,0.72619
429,0.7734300000000001
430,0.7661600000000001
431,0.7807
432,0.7734300000000001
433,0.7698
434,0.7661600000000001
435,0.76253
436,0.75526
437,0.75163
438,0.7479899999999999
439,0.74073
440,0.7370899999999999
441,0.73346
442,0.72619
443,0.7225600000000001
444,0.7189300000000001
445,0.7116600000000001
446,0.70803
447,0.70439
448,0.69713
449,0.6934899999999999
450,0.68986
451,0.7189300000000001
452,0.7189300000000001
453,0.74436
454,0.7770600000000001
455,0.80613
456,0.79523
457,0.7916
458,0.8897
459,0.8679
460,0.89333
461,0.8788
462,0.8824299999999999
463,0.9187700000000001
464,0.92604
465,1.0895
466,0.9115
467,0.99871
468,0.89697
469,1.1658
470,1.1404
471,1.1404
472,1.1840000000000002
473,1.1731
474,1.1767
475,1.1804
476,1.224
477,1.264
478,1.2603
479,1.2858
480,1.3076
481,1.3148
482,1.264
483,1.2276
484,1.2022
485,1.1658
486,1.1259
487,1.1041
488,1.1186
489,1.115
490,1.1622
491,1.1985
492,1.2603
493,1.224
494,1.224
495,1.1731
496,1.1368
497,1.1004
498,1.0496
499,1.075
500,1.075
501,1.0387
502,1.0532
503,0.9769100000000001
504,0.966
505,0.9442
506,0.9333
507,0.91514
508,0.88607
509,0.8788
510,0.8533700000000001
511,0.8824299999999999
512,0.8461
513,0.84247
514,0.8461
515,0.84247
516,0.8279299999999999
517,0.7916
518,0.75526
519,0.7225600000000001
520,0.6862199999999999
521,0.65352
522,0.63536
523,0.35558
524,0.31561
525,0.45368
526,0.49001999999999996
527,0.43915
528,0.43188000000000004
529,0.42825
530,0.42098
531,0.41734
532,0.41008
533,0.40644
534,0.40644
535,0.49365
536,0.55542
537,0.53725
538,0.54452
539,0.55178
540,0.55905
541,0.5663199999999999
542,0.5735899999999999
543,0.58085
544,0.58812
545,0.59902
546,0.60629
547,0.61355
548,0.6208199999999999
549,0.6280899999999999
550,0.63536
551,0.64262
552,0.64989
553,0.6571600000000001
554,0.66442
555,0.63899
556,0.63536
557,0.64262
558,0.61719
559,0.60992
560,0.61719
561,0.62445
562,0.6280899999999999
563,0.63172
564,0.62445
565,0.58449
566,0.58812
567,0.5663199999999999
568,0.51545
569,0.51908
570,0.48638000000000003
571,0.53725
572,0.58085
573,0.56995
574,0.59539
575,0.58812
576,0.59902
577,0.60629
578,0.60265
579,0.59902
580,0.55905
581,0.51908
582,0.47548
583,0.37738
584,0.34104
585,0.23567
586,0.1739
587,0.09032899999999999
588,0.05036
589,0.014025
590,-0.062278
591,-0.12040999999999999
592,-0.18582
593,-0.20399
594,-0.24031999999999998
595,-0.24759
596,-0.28756
597,-0.26575
598,-0.34933000000000003
599,-0.32752
600,-0.36749
601,-0.37113
602,-0.38929
603,-0.4111
604,-0.44016000000000005
605,-0.44016000000000005
606,-0.44743
607,-0.48377
608,-0.45833
609,-0.42563
610,-0.41473000000000004
611,-0.4111
612,-0.37113
613,-0.29846
614,-0.26575
615,-0.24031999999999998
616,-0.19308
617,-0.047744
618,-0.018675999999999998
619,0.014025
620,0.06852799999999999
621,0.06852799999999999
622,0.072161
623,0.17753
624,0.1957
625,0.24656999999999998
626,0.29017
627,0.37374
628,0.38464
629,0.40281
630,0.41008
631,0.41734
632,0.42461000000000004
633,0.43188000000000004
634,0.43915
635,0.44641000000000003
636,0.45368
637,0.44641000000000003
638,0.46095
639,0.46458
640,0.50818
641,0.54088
642,0.58085
643,0.61719
644,0.6571600000000001
645,0.68986
646,0.74073
647,0.73346
648,0.83883
649,0.88607
650,0.98054
651,1.0096
652,0.9841700000000001
653,0.9878100000000001
654,0.9187700000000001
655,0.84247
656,0.83883
657,0.8134
658,0.75889
659,0.70439
660,0.69713
661,0.74436
662,0.6825899999999999
663,0.67532
664,0.67169
665,0.66806
666,0.70439
667,0.68986
668,0.74073
669,0.7734300000000001
670,0.7661600000000001
671,0.7661600000000001
672,0.7770600000000001
673,0.75889
674,0.68986
675,0.67896
676,0.67532
677,0.66079
678,0.6571600000000001
679,0.67896
680,0.64989
681,0.63899
682,0.60992
683,0.61719
684,0.6280899999999999
685,0.60629
686,0.6280899999999999
687,0.57722
688,0.58812
689,0.58449
690,0.58085
691,0.58085
692,0.57722
693,0.58085
694,0.58085
695,0.59539
696,0.60992
697,0.58812
698,0.55178
699,0.50092
700,0.46095
701,0.45368
702,0.42825
703,0.43551000000000006
704,0.43915
705,0.41008
706,0.40281
707,0.39918000000000003
708,0.36648000000000003
709,0.33376999999999996
710,0.29744
711,0.26474000000000003
712,0.23204
713,0.1957
714,0.1739
715,0.15573
716,0.17027
717,0.18117
718,0.19207
719,0.22476999999999997
720,0.21386999999999998
721,0.2175
722,0.21386999999999998
723,0.22114
724,0.22476999999999997
725,0.20297
726,0.23204
727,0.2284
728,0.21023000000000003
729,0.2393
730,0.23204
731,0.21023000000000003
732,0.19933
733,0.2066
734,0.1739
735,0.2175
736,0.1848
737,0.22114
738,0.2175
739,0.21386999999999998
740,0.2175
741,0.22114
742,0.22114
743,0.1957
744,0.18843
745,0.18117
746,0.18117
747,0.19207
748,0.18843
749,0.1739
750,0.1521
751,0.12666
752,0.10123
753,0.1085
754,0.1194
755,0.03946
756,0.024926
757,-0.015043
758,-0.10951
759,-0.16402
760,-0.18582
761,-0.27302
762,-0.35296
763,-0.32752
764,-0.4111
765,-0.4329
766,-0.46923000000000004
767,-0.48013
768,-0.50557
769,-0.531
770,-0.58187
771,-0.63274
772,-0.67271
773,-0.70541
774,-0.7599100000000001
775,-0.87255
776,-0.8907200000000001
777,-1.0106
778,-1.0143
779,-1.0215
780,-0.9960899999999999
781,-1.0833
782,-1.0833
783,-1.1015
784,-1.0797
785,-1.1015
786,-1.0869
787,-1.0288
788,-1.0542
789,-1.0397
790,-1.0179
791,-1.0106
792,-0.98519
793,-0.97429
794,-0.95249
795,-0.9125200000000001
796,-0.92705
797,-0.90525
798,-0.92342
799,-0.8907200000000001
800,-0.87618
801,-0.86165
802,-0.8471200000000001
803,-0.8362200000000001
804,-0.8362200000000001
805,-0.85075
806,-0.88345
807,-0.91615
808,-0.88345
809,-0.90525
810,-0.87618
811,-0.8580200000000001
812,-0.8580200000000001
813,-0.83985
814,-0.81805
815,-0.82168
816,-0.8144100000000001
817,-0.73448
818,-0.69814
819,-0.61457
820,-0.58187
821,-0.48013
822,-0.52373
823,-0.46196000000000004
824,-0.4329
825,-0.42926000000000003
826,-0.38566
827,-0.28029
828,-0.26211999999999996
829,-0.22941999999999999
830,-0.19308
831,-0.15675
832,-0.12040999999999999
833,-0.087713
834,-0.051378
835,-0.015043
836,-0.11315
837,-0.20399
838,-0.12405
839,-0.13132
840,-0.087713
841,-0.09134600000000001
842,-0.044111000000000004
843,-0.047744
844,0.024926
845,0.028558999999999998
846,0.021292
847,0.043093
848,0.11575999999999999
849,0.057627
850,0.093963
851,0.072161
852,0.13393
853,0.21023000000000003
854,0.11575999999999999
855,0.163
856,0.20297
857,0.27926999999999996
858,0.29381
859,0.48275
860,0.49728
861,0.56995
862,0.5663199999999999
863,0.65352
864,0.66079
865,0.7225600000000001
866,0.8134
867,0.857
868,0.9042399999999999
869,0.9333
870,0.966
871,0.94784
872,0.9623700000000001
873,0.9442
874,0.9333
875,0.88607
876,0.9841700000000001
877,0.8897
878,0.76253
879,0.79886
880,0.8134
881,0.75526
882,0.75889
883,0.75163
884,0.7479899999999999
885,0.71529
886,0.71529
887,0.71529
888,0.6862199999999999
889,0.7661600000000001
890,0.67532
891,0.63536
892,0.61719
893,0.67896
894,0.64262
895,0.63899
896,0.66806
897,0.67896
898,0.7225600000000001
899,0.72619
