time,value
0,2.1651
1,1.9594
2,1.7066
3,1.3976
4,1.0637
5,0.7985800000000001
6,0.5629
7,0.45702
8,0.23795999999999998
9,0.24366999999999997
10,0.095288
11,-0.047957
12,-0.26456
13,-0.21908000000000002
14,-0.38638
15,-0.64273
16,-0.66892
17,-0.6584300000000001
18,-0.81598
19,-0.8677
20,-0.78715
21,-0.84925
22,-0.94806
23,-1.0904
24,-0.9482700000000001
25,-0.96236
26,-0.99172
27,-1.0979
28,-1.2072
29,-1.0582
30,-1.1151
31,-1.0996
32,-1.1585
33,-1.3668
34,-1.1683
35,-1.0861
36,-0.9054399999999999
37,-0.9233
38,-0.79994
39,-0.7474
40,-0.70996
41,-0.54791
42,-0.49491
43,-0.37172
44,-0.30863
45,-0.17806
46,-0.084332
47,0.025751999999999997
48,0.090937
49,0.26139
50,0.35462
51,0.4891
52,0.6139899999999999
53,0.75575
54,0.79576
55,0.96929
56,1.0808
57,1.2269
58,1.3864
59,1.3694
60,1.4605
61,1.5130000000000001
62,1.672
63,1.7159
64,1.7232
65,1.703
66,1.6486
67,1.5641
68,1.402
69,1.4256
70,1.7159
71,1.5468
72,1.2642
73,0.9427
74,0.6661600000000001
75,0.34631
76,0.052797000000000004
77,-0.14436
78,-0.22264
79,-0.36386
80,-0.41398
81,-0.54298
82,-0.67671
83,-0.74839
84,-0.87929
85,-0.9408299999999999
86,-1.0582
87,-1.1288
88,-1.2341
89,-1.2563
90,-1.3869999999999998
91,-1.4028
92,-1.3361
93,-1.3595
94,-1.3485
95,-1.1934
96,-1.15
97,-1.0403
98,-0.95634
99,-0.8950100000000001
100,-0.8632299999999999
101,-0.80816
102,-0.69331
103,-0.65688
104,-0.51126
105,-0.46721999999999997
106,-0.38748
107,-0.4271
108,-0.26276
109,-0.11243
110,-0.08537
111,-0.009610299999999999
112,-0.040574
113,0.12315
114,0.059369000000000005
115,0.12914
116,0.32949
117,0.36419
118,0.50717
119,0.49283999999999994
120,0.60711
121,0.68007
122,0.80879
123,1.045
124,1.3451
125,1.6251
126,1.8651
127,2.1313
