time,value
0,1.3336
1,1.3336
2,1.3336
3,1.3336
4,1.3336
5,1.3336
6,1.3336
7,1.3336
8,1.3336
9,1.3336
10,1.3336
11,1.3336
12,1.3336
13,1.3336
14,1.3336
15,1.3336
16,1.3336
17,1.3336
18,1.3336
19,1.3336
20,1.3336
21,1.3336
22,1.3336
23,1.3336
24,1.3336
25,1.3336
26,1.3336
27,1.3336
28,1.3336
29,1.3336
30,1.3336
31,1.3336
32,1.3336
33,1.3336
34,1.3336
35,1.3336
36,1.3336
37,1.3336
38,1.3336
39,1.3336
40,1.3336
41,1.3336
42,1.3336
43,1.3336
44,1.3336
45,1.3336
46,1.3336
47,1.3336
48,1.3336
49,1.3336
50,1.3336
51,1.3336
52,1.3336
53,1.3336
54,1.3336
55,1.3336
56,1.3336
57,1.3336
58,1.3336
59,1.3336
60,1.3336
61,1.3336
62,1.3338
63,1.3404
64,1.3471
65,1.358
66,1.3691
67,1.3802
68,1.3913
69,1.4003
70,1.409
71,1.411
72,1.411
73,1.411
74,1.411
75,1.411
76,1.411
77,1.4057
78,1.3963
79,1.3861
80,1.375
81,1.3639
82,1.3528
83,1.3417
84,1.3307
85,1.3196
86,1.3085
87,1.2974
88,1.2863
89,1.275
90,1.263
91,1.2498
92,1.2276
93,1.2055
94,1.1833
95,1.1611
96,1.1389
97,1.1167
98,1.0802
99,1.0423
100,0.9989399999999999
101,0.9545799999999999
102,0.91022
103,0.8658600000000001
104,0.8215
105,0.7771399999999999
106,0.73278
107,0.6884100000000001
108,0.64405
109,0.59969
110,0.55533
111,0.51097
112,0.47135
113,0.43759
114,0.40402
115,0.37075
116,0.33748
117,0.30421
118,0.27414
119,0.25368
120,0.23495
121,0.22386
122,0.21277
123,0.20168
124,0.19047999999999998
125,0.17717
126,0.16385999999999998
127,0.1418
128,0.11962
129,0.48700000000000004
130,0.3761
131,0.2652
132,0.1543
133,0.049105
134,-0.14909
135,-0.31272
136,-0.47907
137,-0.12905
138,-0.16232
139,-0.19559
140,-0.22885999999999998
141,-0.26213000000000003
142,-0.2954
143,-0.32866999999999996
144,-0.36194
145,-0.39521
146,-0.42848
147,-0.46175
148,-0.49501999999999996
149,-0.5282899999999999
150,-0.5615600000000001
151,-0.59483
152,-0.6281
153,-0.6603600000000001
154,-0.68599
155,-0.7114
156,-0.73358
157,-0.75576
158,-0.77794
159,-0.8001199999999999
160,-0.81908
161,-0.8378
162,-0.8499
163,-0.8609899999999999
164,-0.87208
165,-0.8831700000000001
166,-0.89426
167,-0.90535
168,-0.9233899999999999
169,-0.94483
170,-0.96672
171,-0.9889
172,-1.0111
173,-1.0333
174,-1.0496
175,-1.0595
176,-1.0653
177,-1.0653
178,-1.0653
179,-1.0653
180,-1.0653
181,-1.0653
182,-1.0653
183,-1.0653
184,-1.0653
185,-1.0653
186,-1.0653
187,-1.0653
188,-1.0653
189,-1.0653
190,-1.0653
191,-1.0653
192,-1.0653
193,-1.0653
194,-1.0653
195,-1.0653
196,-1.0653
197,-1.0653
198,-1.0653
199,-1.0653
200,-1.0653
201,-1.0653
202,-1.0653
203,-1.0653
204,-1.0653
205,-1.0653
206,-1.0653
207,-1.0653
208,-1.0653
209,-1.0627
210,-1.0553
211,-1.0468
212,-1.0357
213,-1.0246
214,-1.0135
215,-1.0025
216,-0.99136
217,-0.9802700000000001
218,-0.9691799999999999
219,-0.95809
220,-0.9470000000000001
221,-0.93591
222,-0.9248200000000001
223,-0.9137299999999999
224,-0.9116799999999999
225,-0.91069
226,-0.91053
227,-0.91053
228,-0.91053
229,-0.91053
230,-0.9064
231,-0.90049
232,-0.8913
233,-0.88021
234,-0.8691200000000001
235,-0.85803
236,-0.8478
237,-0.83844
238,-0.83314
239,-0.83314
240,-0.83314
241,-0.83314
242,-0.83314
243,-0.83314
244,-0.8351799999999999
245,-0.8438100000000001
246,-0.8528600000000001
247,-0.86395
248,-0.8750399999999999
249,-0.88613
250,-0.89704
251,-0.9037
252,-0.91035
253,-0.91053
254,-0.91053
255,-0.91053
256,-0.91053
257,-0.91053
258,-0.91053
259,-0.91053
260,-0.91053
261,-0.91053
262,-0.91053
263,-0.91053
264,-0.91053
265,-0.9063899999999999
266,-0.8992399999999999
267,-0.89007
268,-0.8789799999999999
269,-0.8678899999999999
270,-0.8568
271,-0.8468399999999999
272,-0.8387100000000001
273,-0.83314
274,-0.83314
275,-0.83314
276,-0.83314
277,-0.83314
278,-0.83314
279,-0.83081
280,-0.81109
281,-0.79125
282,-0.76907
283,-0.7468899999999999
284,-0.7247100000000001
285,-0.70253
286,-0.69079
287,-0.67994
288,-0.67837
289,-0.67837
290,-0.67837
291,-0.67837
292,-0.67837
293,-0.67837
294,-0.67837
295,-0.67837
296,-0.67837
297,-0.67837
298,-0.67837
299,-0.67837
300,-0.6668
301,-0.64166
302,-0.61331
303,-0.58004
304,-0.54677
305,-0.5135
306,-0.48133000000000004
307,-0.45225
308,-0.42453
309,-0.40235
310,-0.38017
311,-0.35799000000000003
312,-0.33581
313,-0.31363
314,-0.29145
315,-0.53859
316,-0.53859
317,-0.53859
318,-0.53859
319,-0.53859
320,-0.53859
321,-0.53859
322,-0.53859
323,-0.53859
324,-0.53859
325,-0.53859
326,-0.53859
327,-0.53859
328,-0.53859
329,-0.53859
330,-0.53859
331,-0.53859
332,-0.53859
333,-0.53859
334,-0.53859
335,-0.53859
336,-0.53859
337,-0.53859
338,-0.53859
339,-0.53859
340,-0.53859
341,-0.53859
342,-0.53859
343,-0.53859
344,-0.53859
345,-0.53859
346,-0.53859
347,-0.53859
348,-0.53859
349,-0.53859
350,-0.53859
351,-0.53859
352,-0.53859
353,-0.53859
354,-0.53859
355,-0.53859
356,-0.53859
357,-0.53859
358,-0.53859
359,-0.53859
360,-0.53859
361,-0.53859
362,-0.53859
363,-0.53859
364,-0.53859
365,-0.53859
366,-0.53859
367,-0.53859
368,-0.53859
369,-0.53859
370,-0.53859
371,-0.53859
372,-0.53859
373,-0.53859
374,-0.53859
375,-0.53859
376,-0.53859
377,-0.53742
378,-0.49313999999999997
379,-0.44885
380,-0.3762
381,-0.30239
382,-0.22858
383,-0.15477
384,-0.405
385,-0.23992
386,0.3331
387,0.14047
388,0.21428000000000003
389,0.28809
390,0.3619
391,0.43571000000000004
392,0.49188999999999994
393,0.5345300000000001
394,0.57431
395,0.61121
396,0.64812
397,0.68502
398,0.7219300000000001
399,0.75883
400,0.79574
401,0.8326399999999999
402,0.86955
403,0.90645
404,0.9433600000000001
405,0.9802700000000001
406,1.0172
407,1.0541
408,1.091
409,1.1279
410,1.1648
411,1.2017
412,1.2386
413,1.2755
414,1.3124
415,1.3493
416,1.3862
417,1.4231
418,1.46
419,1.4882
420,1.5128
421,1.5215
422,1.5215
423,1.5215
424,1.5215
425,1.5215
426,1.5215
427,1.5215
428,1.5215
429,1.5215
430,1.5215
431,1.5215
432,1.5215
433,1.5269
434,1.5482
435,1.5724
436,1.6093
437,1.6462
438,1.6831
439,1.72
440,1.7569
441,1.7938
442,1.8307
443,1.8676
444,1.9045
445,1.9414
446,1.9783
447,2.0152
448,2.0042
449,1.9805
450,1.9472
451,1.9103
452,1.8734
453,1.8365
454,1.8093
455,1.7888
456,1.7791
457,1.7791
458,1.7791
459,1.7791
460,1.7781
461,1.7756
462,1.7618
463,1.7249
464,1.6880000000000002
465,1.6511
466,1.6142
467,1.5773
468,1.5371
469,1.4747
470,1.4116
471,1.3378
472,1.264
473,1.1902
474,1.1164
475,1.0533
476,0.9909899999999999
477,0.9507399999999999
478,0.91384
479,0.8769299999999999
480,0.8400299999999999
481,0.80312
482,0.76622
483,0.72931
484,0.6924
485,0.6555
486,0.61859
487,0.5816899999999999
488,0.54478
489,0.50788
490,0.47097
491,0.43406999999999996
492,0.39716
493,0.36025999999999997
494,0.32335
495,0.28645
496,0.24954
497,0.21264
498,0.17573
499,0.13883
500,0.10192000000000001
501,0.3249
502,0.14038
503,-0.2946
504,-0.22868000000000002
505,-0.4132
506,-0.11950999999999999
507,-0.15641
508,-0.19332
509,-0.23021999999999998
510,-0.25442
511,-0.27574
512,-0.28107
513,-0.28107
514,-0.28107
515,-0.28107
516,-0.28107
517,-0.28107
518,-0.28107
519,-0.28107
520,-0.28107
521,-0.28107
522,-0.28107
523,-0.28107
524,-0.28107
525,-0.28107
526,-0.28107
527,-0.28107
528,-0.28107
529,-0.28107
530,-0.28107
531,-0.28107
532,-0.28107
533,-0.28107
534,-0.28107
535,-0.28107
536,-0.28107
537,-0.28107
538,-0.28107
539,-0.31116
540,-0.34478000000000003
541,-0.38111999999999996
542,-0.41803
543,-0.45493999999999996
544,-0.49183999999999994
545,-0.52875
546,-0.56565
547,-0.60256
548,-0.63946
549,-0.67637
550,-0.71327
551,-0.7501800000000001
552,-0.78708
553,-0.82399
554,-0.8608899999999999
555,-0.8978
556,-0.9347
557,-0.9716100000000001
558,-1.0085
559,-1.0454
560,-1.0823
561,-1.1192
562,-1.1561
563,-1.193
564,-1.2299
565,-1.2668
566,-1.3038
567,-1.3407
568,-1.3776
569,-1.4145
570,-1.4514
571,-1.4883
572,-1.5238
573,-1.5591
574,-1.5383
575,-1.5014
576,-1.4645
577,-1.4276
578,-1.3907
579,-1.3538
580,-1.3169
581,-1.28
582,-1.2431
583,-1.2062
584,-1.1693
585,-1.1323
586,-1.0992
587,-1.0721
588,-1.0536
589,-1.0536
590,-1.0536
591,-1.0536
592,-1.0536
593,-1.0536
594,-1.0497
595,-1.0169
596,-0.9839100000000001
597,-0.9470000000000001
598,-0.9101
599,-0.8731899999999999
600,-0.83629
601,-0.8341299999999999
602,-0.83495
603,-0.8666299999999999
604,-0.90354
605,-0.9404399999999999
606,-0.97735
607,-1.0107
608,-1.0427
609,-1.0536
610,-1.0536
611,-1.0536
612,-1.0536
613,-1.0536
614,-1.0536
615,-1.0408
616,-1.0129
617,-0.98145
618,-0.9445399999999999
619,-0.90764
620,-0.8707299999999999
621,-0.8375
622,-0.81453
623,-0.7961
624,-0.7961
625,-0.7961
626,-0.7961
627,-0.7961
628,-0.7961
629,-0.7961
630,-0.26068
631,-0.26068
632,-0.26068
633,-0.26068
634,-0.26068
635,-0.26068
636,-0.26068
637,-0.26068
638,-0.26068
639,-0.26068
640,-0.26068
641,-0.26068
642,-0.26068
643,-0.26068
644,-0.26068
645,-0.26068
646,-0.26068
647,-0.26068
648,-0.26068
649,-0.26068
650,-0.26068
651,-0.26068
652,-0.26068
653,-0.26068
654,-0.26068
655,-0.26068
656,-0.26068
657,-0.26068
658,-0.26068
659,-0.26068
660,-0.26068
661,-0.26068
662,-0.26068
663,-0.26068
664,-0.26068
665,-0.26068
666,-0.26068
667,-0.26068
668,-0.26068
669,-0.26068
670,-0.26068
671,-0.26068
672,-0.26068
673,-0.26068
674,-0.26068
675,-0.26068
676,-0.26068
677,-0.26068
678,-0.26068
679,-0.26068
680,-0.26068
681,-0.26068
682,-0.26068
683,-0.26068
684,-0.26068
685,-0.26068
686,-0.26068
687,-0.26068
688,-0.26068
689,-0.26068
690,-0.26068
691,-0.26068
692,-0.26068
693,-0.26068
694,-0.26068
695,-0.26068
696,-0.26068
697,-0.26068
698,-0.26068
699,-0.27434000000000003
700,-0.29081999999999997
701,-0.35131
702,-0.42545
703,-0.49959
704,-0.5737399999999999
705,-0.64788
706,-0.7220300000000001
707,-0.77846
708,-0.8213
709,-0.86126
710,-0.89833
711,-0.9354
712,-0.9724700000000001
713,-1.0159
714,-1.0703
715,-1.1306
716,-1.2048
717,-1.2789
718,-1.3531
719,-1.4261
720,-1.4937
721,-1.5541
722,-1.5541
723,-1.5541
724,-1.5541
725,-1.5541
726,-1.5541
727,-1.5541
728,-1.5541
729,-1.5541
730,-1.5541
731,-1.5541
732,-1.5541
733,-1.5541
734,-1.5541
735,-1.5541
736,-1.5541
737,-1.5541
738,-1.5541
739,-1.5541
740,-1.5541
741,-1.5541
742,-1.5382
743,-1.5028
744,-1.4668
745,-1.4297
746,-1.3926
747,-1.3556
748,-1.3238
749,-1.3082
750,-1.2954
751,-1.2954
752,-1.2954
753,-1.2954
754,-1.2954
755,-1.2954
756,-1.2954
757,-1.2954
758,-1.2954
759,-1.2954
760,-1.2954
761,-1.2954
762,-1.2954
763,-1.2954
764,-1.2954
765,-1.2954
766,-1.2954
767,-1.2954
768,-1.2954
769,-1.2857
770,-1.2692
771,-1.2419
772,-1.2048
773,-1.1677
774,-1.1306
775,-1.0936
776,-1.0565
777,-1.0194
778,-0.98236
779,-0.94529
780,-0.9082100000000001
781,-0.8711399999999999
782,-0.8340700000000001
783,-0.79028
784,-0.70213
785,-0.61246
786,-0.50124
787,-0.39002
788,-0.27881
789,-0.16759000000000002
790,-0.44368
791,-0.060596000000000004
792,-0.06819700000000001
793,-0.06819700000000001
794,-0.06819700000000001
795,-0.06819700000000001
796,-0.06819700000000001
797,-0.06819700000000001
798,0.1059
799,0.27891
800,0.45938999999999997
801,0.12899000000000002
802,0.16605999999999999
803,0.20313
804,0.23045
805,0.24693
806,0.25668
807,0.25668
808,0.25668
809,0.25668
810,0.25668
811,0.25668
812,0.25668
813,0.25668
814,0.25668
815,0.25668
816,0.25668
817,0.25668
818,0.25668
819,0.25668
820,0.25668
821,0.25668
822,0.25668
823,0.25668
824,0.25668
825,0.24391
826,0.22826
827,0.19654000000000002
828,0.15947
829,0.1224
830,0.42644
831,0.24616999999999997
832,0.06905
833,-0.06819700000000001
834,-0.06819700000000001
835,-0.06819700000000001
836,-0.06819700000000001
837,-0.06819700000000001
838,-0.06819700000000001
839,-0.06819700000000001
840,-0.06819700000000001
841,-0.06819700000000001
842,-0.06819700000000001
843,-0.06819700000000001
844,-0.06819700000000001
845,-0.08902
846,0.051815
847,0.11750999999999999
848,0.30287
849,0.48823
850,0.13476
851,0.17182999999999998
852,0.2089
853,0.24597
854,0.28304
855,0.32011999999999996
856,0.35719
857,0.39426
858,0.43133
859,0.46841000000000005
860,0.50548
861,0.54255
862,0.57962
863,0.6167
864,0.65377
865,0.69084
866,0.7279100000000001
867,0.76498
868,0.80206
869,0.8391299999999999
870,0.8762
871,0.91327
872,0.95035
873,0.9874200000000001
874,1.0245
875,1.0616
876,1.0986
877,1.1357
878,1.1728
879,1.2099
880,1.2463
881,1.2686
882,1.2908
883,1.2914
884,1.2914
885,1.2914
886,1.2914
887,1.2914
888,1.2914
889,1.2914
890,1.2914
891,1.2914
892,1.2914
893,1.2914
894,1.2914
895,1.2776
896,1.2537
897,1.2229999999999999
898,1.186
899,1.1489
900,1.1118
901,1.0785
902,1.0513
903,1.0327
904,1.0327
905,1.0327
906,1.0327
907,1.0327
908,1.0327
909,1.0366
910,1.0696
911,1.1028
912,1.1398
913,1.1769
914,1.214
915,1.251
916,1.2881
917,1.3252
918,1.3623
919,1.3993
920,1.4364
921,1.4735
922,1.5141
923,1.5561
924,1.6193
925,1.6934
926,1.7676
927,1.8417
928,1.9159
929,1.99
930,2.0513
931,2.0974
932,2.14
933,2.177
934,2.2141
935,2.2512
936,2.2772
937,2.2722
938,2.2536
939,2.1795
940,2.1054
941,2.0312
942,1.9571
943,1.8829
944,1.8088
