time,value
0,-1.5583
1,-0.30106
2,1.2701
3,2.5164
4,3.0514
5,2.9687
6,2.6487
7,2.3767
8,2.1431
9,1.768
10,1.1822
11,0.5544899999999999
12,0.14622000000000002
13,0.074097
14,0.21953000000000003
15,0.35228000000000004
16,0.33371
17,0.19704000000000002
18,0.063056
19,0.012903999999999999
20,0.030268
21,0.047636000000000005
22,0.025952
23,-0.024259
24,-0.071769
25,-0.09675399999999999
26,-0.11179000000000001
27,-0.14109000000000002
28,-0.19116
29,-0.25255
30,-0.30091999999999997
31,-0.31514000000000003
32,-0.30594
33,-0.2927
34,-0.30785
35,-0.36922
36,-0.44506
37,-0.5044
38,-0.53303
39,-0.53751
40,-0.54783
41,-0.57802
42,-0.6128100000000001
43,-0.63454
44,-0.63679
45,-0.63041
46,-0.62715
47,-0.60354
48,-0.51055
49,-0.3076
50,0.013533000000000002
51,0.40604
52,0.78732
53,1.0797
54,1.227
55,1.2201
56,1.111
57,0.99784
58,0.98756
59,1.1229
60,1.3275
61,1.439
62,1.3141
63,0.9417399999999999
64,0.47203
65,0.10815
66,-0.040011
67,-0.017611
68,0.034355000000000004
69,0.012626
70,-0.07381599999999999
71,-0.15147
72,-0.17649
73,-0.17870999999999998
74,-0.22099000000000002
75,-0.3184
76,-0.41989
77,-0.47011000000000003
78,-0.47267
79,-0.4948
80,-0.6007600000000001
81,-0.77686
82,-0.94371
83,-1.0249
84,-1.0056
85,-0.9534600000000001
86,-0.94973
87,-1.0183
88,-1.1194
89,-1.1824
90,-1.1699
91,-1.12
92,-1.1094
93,-1.1951
94,-1.3618
95,-1.5136
96,-1.5436
97,-1.4168
98,-1.1951
