time,value
0,0.21699000000000002
1,0.21699000000000002
2,0.21699000000000002
3,0.21699000000000002
4,0.21699000000000002
5,0.21699000000000002
6,0.21699000000000002
7,0.21699000000000002
8,0.21699000000000002
9,0.21699000000000002
10,0.21699000000000002
11,0.21699000000000002
12,0.21699000000000002
13,0.21699000000000002
14,0.21699000000000002
15,0.21699000000000002
16,0.21699000000000002
17,0.21699000000000002
18,0.21699000000000002
19,0.21699000000000002
20,0.27055
21,0.38291
22,0.39979000000000003
23,0.39979000000000003
24,0.39979000000000003
25,0.39979000000000003
26,0.39979000000000003
27,0.39979000000000003
28,0.36136999999999997
29,0.24900999999999998
30,0.13665
31,0.22436999999999999
32,0.22436999999999999
33,0.22436999999999999
34,0.22436999999999999
35,0.22436999999999999
36,0.34081
37,0.16984000000000002
38,0.21699000000000002
39,0.21699000000000002
40,0.21699000000000002
41,0.21699000000000002
42,0.21699000000000002
43,0.1384
44,0.22436999999999999
45,0.22436999999999999
46,0.22436999999999999
47,0.22436999999999999
48,0.22436999999999999
49,0.33207
50,0.16809000000000002
51,0.21699000000000002
52,0.21699000000000002
53,0.32236
54,0.39979000000000003
55,0.39979000000000003
56,0.47663999999999995
57,0.57619
58,0.46383
59,0.35147
60,0.23911
61,0.12675999999999998
62,0.22436999999999999
63,0.22436999999999999
64,0.22436999999999999
65,0.22436999999999999
66,0.22436999999999999
67,0.39029
68,0.17973
69,0.21699000000000002
70,0.21699000000000002
71,0.21699000000000002
72,0.17042000000000002
73,0.34371999999999997
74,0.22436999999999999
75,0.13414
76,-0.42765
77,-0.14861
78,-0.14861
79,-0.14861
80,-0.14861
81,-0.14861
82,-0.32286
83,0.23893000000000003
84,0.14945999999999998
85,0.21699000000000002
86,0.21699000000000002
87,0.21699000000000002
88,0.20069
89,0.08833200000000001
90,0.22436999999999999
91,0.22436999999999999
92,0.22436999999999999
93,0.075919
94,-0.48586999999999997
95,-0.14861
96,-0.14861
97,-0.14861
98,-0.14861
99,-0.14861
100,-0.23360999999999998
101,-0.33141
102,-0.33141
103,-0.38788
104,-0.50024
105,-0.6126
106,-0.72495
107,-0.83731
108,-0.87981
109,-0.87981
110,-0.99159
111,-1.0213
112,-0.9089200000000001
113,-0.96306
114,-1.0626
115,-1.0626
116,-1.1173
117,-1.2297
118,-1.4387
119,-1.6896
120,-2.0267
121,-2.2275
122,-2.3399
123,-2.5623
124,-2.6682
125,-2.5559
126,-2.4435
127,-2.3312
128,-2.2188
129,-2.1064
130,-1.9941
131,-1.9766
132,-2.0011
133,-2.1134
134,-2.2258
135,-2.3381
136,-2.3422
137,-2.3044
138,-2.1919999999999997
139,-1.9999
140,-1.7472
141,-1.1854
142,-0.77735
143,-0.5526300000000001
144,-0.32792
145,-0.46258
146,0.12152
147,0.21699000000000002
148,0.21699000000000002
149,0.21699000000000002
150,0.25308
151,0.36544
152,0.55581
153,0.7805300000000001
154,1.0052
155,1.23
156,1.4547
157,1.6794
158,1.8832
159,1.9955
160,2.045
161,2.045
162,1.9402
163,1.8278
164,1.7155
165,1.6031
166,1.4791
167,1.1421
168,0.94819
169,0.94819
170,0.85854
171,0.76539
172,0.76539
173,0.70426
174,0.59191
175,0.47955
176,0.36719
177,0.25483
178,0.14247
179,0.204
180,-0.35779
181,-0.14861
182,-0.14861
183,-0.14861
184,-0.14861
185,-0.14861
186,-0.39271999999999996
187,0.16907
188,0.13549
189,0.18614
190,0.42231
191,0.22436999999999999
192,0.22436999999999999
193,0.22436999999999999
194,0.096671
195,-0.12240999999999999
196,-0.14861
197,-0.13289
198,-0.25263
199,0.091825
200,0.20418
201,0.11744
202,0.07883
203,-0.48296000000000006
204,-0.29066
205,-0.5142100000000001
206,-0.5142100000000001
207,-0.47171
208,-0.35935
209,-0.247
210,-0.13464
211,-0.31084
212,0.09007899999999999
213,0.20244
214,0.21699000000000002
215,0.21699000000000002
216,0.21699000000000002
217,0.21699000000000002
218,0.21699000000000002
219,0.21699000000000002
220,0.17624
221,0.37282
222,0.22436999999999999
223,0.2855
224,0.15877
225,0.27113000000000004
226,0.38349
227,0.49585
228,0.5825899999999999
229,0.5825899999999999
230,0.5150600000000001
231,0.4027
232,0.39979000000000003
233,0.32178
234,0.097065
235,0.22436999999999999
236,0.22436999999999999
237,0.22436999999999999
238,0.08658500000000001
239,0.19894
240,0.3113
241,0.44753000000000004
242,0.67224
243,0.8311799999999999
244,0.94353
245,1.0559
246,1.2055
247,1.4302
248,1.4966
249,1.5053
250,1.6177
251,1.6794
252,1.6794
253,1.7719999999999998
254,1.8843
255,1.9967
256,2.109
257,2.2214
258,2.2278
259,2.1923
260,2.0799
261,1.9676
262,1.8552
263,1.7428
264,1.6794
265,1.6794
266,1.5886
267,1.4762
268,1.3639
269,1.1892
270,0.96449
271,0.63557
272,0.33226
273,0.10754000000000001
274,-0.19285
275,-0.52993
276,-0.867
277,-1.1098
278,-1.2221
279,-1.1563
280,-1.044
281,-0.9316200000000001
282,-0.87981
283,-0.87981
284,-0.87981
285,-0.94385
286,-1.1686
287,-1.3933
288,-1.6145
289,-1.7269
290,-1.8846
291,-2.1093
292,-2.2467
293,-2.3253
294,-2.213
295,-1.983
296,-1.6459
297,-1.3089
298,-0.9717899999999999
299,-0.63472
300,-0.36983
301,-0.14861
302,-0.14861
303,-0.47131999999999996
304,0.090474
305,-0.20352
306,-0.16375
307,-0.2761
308,-0.33141
309,-0.33141
310,-0.33141
311,-0.27436
312,-0.19479000000000002
313,0.10463
314,0.21699000000000002
315,0.75398
316,0.75398
317,0.75398
318,0.75398
319,0.75398
320,0.75398
321,0.75398
322,0.75398
323,0.75398
324,0.75398
325,0.7799
326,0.88864
327,0.93089
328,0.93089
329,0.93089
330,0.93089
331,0.93089
332,0.93089
333,0.93089
334,0.93089
335,0.93089
336,0.93089
337,1.0233
338,1.1078
339,1.1078
340,1.043
341,0.93427
342,0.93089
343,0.93089
344,0.93089
345,0.93089
346,0.93089
347,0.93089
348,0.93089
349,0.93089
350,0.93089
351,0.93089
352,0.93089
353,0.93089
354,0.93089
355,0.93089
356,0.93089
357,0.93089
358,0.93089
359,0.92301
360,0.8142699999999999
361,0.75398
362,0.75398
363,0.75398
364,0.75398
365,0.75398
366,0.75398
367,0.75398
368,0.75398
369,0.75398
370,0.75398
371,0.75398
372,0.75398
373,0.75398
374,0.70721
375,0.59847
376,0.57706
377,0.57706
378,0.57706
379,0.57706
380,0.57706
381,0.47676999999999997
382,0.40015
383,0.40015
384,0.40015
385,0.40015
386,0.40015
387,0.40015
388,0.40015
389,0.40015
390,0.40015
391,0.40015
392,0.34212
393,0.23337
394,0.32183
395,0.36972
396,0.26098000000000005
397,0.29422
398,0.40015
399,0.40015
400,0.35675999999999997
401,0.24802
402,0.22323
403,0.22323
404,0.22323
405,0.22323
406,0.22323
407,0.22323
408,0.1945
409,0.48221
410,0.28501
411,0.27937
412,-0.26433
413,-0.21398000000000003
414,-0.43146999999999996
415,-0.48443
416,-0.48443
417,-0.48443
418,-0.48443
419,-0.48443
420,-0.48443
421,-0.51147
422,-0.62021
423,-0.6613399999999999
424,-0.6613399999999999
425,-0.76952
426,-0.83826
427,-0.83826
428,-0.9188299999999999
429,-1.0152
430,-1.0152
431,-1.0152
432,-1.0152
433,-1.0152
434,-1.0152
435,-1.0152
436,-1.0152
437,-1.0152
438,-1.1217
439,-1.1921
440,-1.1921
441,-1.271
442,-1.3797
443,-1.4884
444,-1.5459
445,-1.5459
446,-1.4541
447,-1.369
448,-1.369
449,-1.369
450,-1.369
451,-1.369
452,-1.4056
453,-1.5144
454,-1.6231
455,-1.7318
456,-1.8406
457,-1.8997
458,-1.8997
459,-1.8997
460,-1.8778
461,-1.7690000000000001
462,-1.7228
463,-1.7228
464,-1.6197
465,-1.5459
466,-1.5459
467,-1.5459
468,-1.5459
469,-1.5459
470,-1.5459
471,-1.5459
472,-1.5459
473,-1.5459
474,-1.5459
475,-1.4851
476,-1.3763
477,-1.4704
478,-1.5459
479,-1.5459
480,-1.6197
481,-1.7341
482,-1.9516
483,-2.1229
484,-2.2316
485,-2.2536
486,-2.235
487,-2.1262
488,-2.0175
489,-1.9088
490,-1.8
491,-1.6913
492,-1.5825
493,-1.5459
494,-1.5459
495,-1.5459
496,-1.5459
497,-1.5459
498,-1.4608
499,-1.3521
500,-1.2434
501,-1.1921
502,-1.1921
503,-1.0941
504,-0.98531
505,-0.8765700000000001
506,-0.76783
507,-0.65909
508,-0.55035
509,-0.48443
510,-0.48443
511,-0.56781
512,-0.6613399999999999
513,-0.6613399999999999
514,-0.6613399999999999
515,-0.6613399999999999
516,-0.6613399999999999
517,-0.63317
518,-0.5244300000000001
519,-0.41568999999999995
520,-0.30695
521,-0.19821
522,-0.1306
523,-0.1306
524,-0.21229
525,-0.30751
526,-0.30751
527,-0.30751
528,-0.30751
529,-0.21286
530,-0.1306
531,-0.1306
532,-0.26433
533,0.27937
534,0.28501
535,0.28501
536,0.28501
537,-0.11502000000000001
538,-0.1306
539,-0.1306
540,-0.1306
541,-0.1306
542,-0.1306
543,-0.47561000000000003
544,0.068091
545,0.28501
546,0.28501
547,0.28501
548,0.47376
549,0.19280999999999998
550,0.22323
551,0.22323
552,0.22323
553,0.22323
554,0.22323
555,0.22323
556,0.22323
557,0.22323
558,0.2869
559,0.39564
560,0.40015
561,0.40015
562,0.40015
563,0.47676999999999997
564,0.5855100000000001
565,0.69426
566,0.75398
567,0.75398
568,0.75398
569,0.7753899999999999
570,0.88413
571,0.93089
572,0.93089
573,0.93089
574,0.96526
575,1.074
576,1.1078
577,1.1078
578,1.1078
579,1.1078
580,1.1078
581,1.1957
582,1.2847
583,1.2847
584,1.2847
585,1.2847
586,1.3856
587,1.429
588,1.3202
589,1.2847
590,1.2797
591,1.1709
592,1.1078
593,1.1078
594,1.0216
595,0.9489200000000001
596,1.0577
597,1.1078
598,1.1078
599,1.1078
600,1.1078
601,1.1078
602,1.1078
603,1.1044
604,0.99569
605,0.93089
606,0.93089
607,0.8463799999999999
608,0.75398
609,0.75398
610,0.75398
611,0.75398
612,0.75398
613,0.75398
614,0.75398
615,0.82384
616,0.93258
617,1.0413
618,1.1078
619,1.1078
620,1.025
621,0.9162399999999999
622,0.8075
623,0.69876
624,0.59002
625,0.57706
626,0.57706
627,0.57706
628,0.57706
629,0.57706
630,0.54524
631,0.54524
632,0.54524
633,0.54524
634,0.54524
635,0.54524
636,0.54524
637,0.54524
638,0.54524
639,0.54524
640,0.52067
641,0.41757
642,0.37751
643,0.37751
644,0.37751
645,0.37751
646,0.37751
647,0.37751
648,0.37751
649,0.37751
650,0.42665
651,0.52975
652,0.63285
653,0.7589199999999999
654,0.96511
655,1.0484
656,1.0484
657,1.0484
658,0.97793
659,0.77174
660,0.5655399999999999
661,0.36843000000000004
662,0.26533
663,0.16222999999999999
664,0.3491
665,0.26363000000000003
666,0.26363000000000003
667,0.26363000000000003
668,0.26363000000000003
669,0.26363000000000003
670,0.26363000000000003
671,0.26363000000000003
672,0.26363000000000003
673,-0.096942
674,-0.12569
675,-0.12569
676,-0.12569
677,-0.12569
678,-0.12569
679,-0.37739
680,0.12003
681,0.268
682,0.3711
683,0.57088
684,0.77708
685,0.9832700000000001
686,1.119
687,1.2221
688,1.3251
689,1.3839
690,1.3839
691,1.4667
692,1.5698
693,1.6729
694,1.8326
695,2.0388
696,2.1499
697,2.2226
698,2.2226
699,2.2226
700,2.2183
701,2.1152
702,2.0121
703,1.909
704,1.8059
705,1.7028
706,1.5997
707,1.4966
708,1.3935
709,1.2904
710,1.1873
711,1.0842
712,1.0484
713,1.0404
714,0.73114
715,0.46298
716,0.25678
717,0.30637
718,-0.17056
719,-0.47985
720,-0.73573
721,-0.9419200000000001
722,-1.1481
723,-1.3271
724,-1.4302
725,-1.5333
726,-1.6353
727,-1.6353
728,-1.6353
729,-1.6353
730,-1.6353
731,-1.6353
732,-1.6353
733,-1.6871
734,-1.7902
735,-1.8933
736,-1.9451
737,-1.8419999999999999
738,-1.7389
739,-1.6358
740,-1.4302
741,-1.2998
742,-1.2998
743,-1.147
744,-0.96436
745,-0.96436
746,-0.96436
747,-0.96436
748,-0.96436
749,-0.96436
750,-0.96436
751,-0.96436
752,-0.96436
753,-0.8634
754,-0.7603
755,-0.6572
756,-0.55411
757,-0.46116
758,-0.46116
759,-0.50977
760,-0.61287
761,-0.62889
762,-0.65133
763,-0.75442
764,-0.9184200000000001
765,-1.1246
766,-1.1321
767,-1.0974
768,-0.9942700000000001
769,-0.89117
770,-0.77098
771,-0.46169
772,-0.19941
773,0.087351
774,-0.16371
775,-0.14652
776,-0.24961999999999998
777,-0.35272
778,-0.45582
779,-0.65667
780,-0.76351
781,-0.66041
782,-0.48573
783,-0.27954
784,-0.31329
785,0.087448
786,0.19055
787,0.29364
788,0.35828000000000004
789,0.25518
790,0.15208
791,0.29835
792,-0.24641999999999997
793,-0.49267
794,-0.59577
795,-0.69887
796,-0.79128
797,-0.68819
798,-0.58509
799,-0.48199
800,-0.37889
801,-0.31105
802,-0.41415
803,-0.51725
804,-0.62034
805,-0.81799
806,-1.0541
807,-1.3634
808,-1.5359
809,-1.6353
810,-1.6353
811,-1.6353
812,-1.6353
813,-1.5546
814,-1.4676
815,-1.4676
816,-1.5219999999999998
817,-1.6251
818,-1.7282
819,-1.8596
820,-2.0658
821,-2.2053
822,-2.3062
823,-2.3062
824,-2.2656
825,-2.1625
826,-1.9804
827,-1.7742
828,-1.568
829,-1.3618
830,-1.1556
831,-0.9494
832,-0.74321
833,-0.53701
834,-0.39599
835,-0.29236
836,-0.37739
837,0.45861
838,0.18414
839,0.36469
840,0.55806
841,0.6611600000000001
842,0.76426
843,0.86735
844,0.97045
845,1.0735
846,1.1766
847,1.2162
848,1.2162
849,1.4202
850,1.5516
851,1.5516
852,1.6275
853,1.7082
854,1.6051
855,1.5516
856,1.5516
857,1.5516
858,1.5516
859,1.5516
860,1.4897
861,1.3866
862,1.2835
863,1.1804
864,1.0773
865,1.0484
866,1.0484
867,1.0484
868,1.0484
869,1.0484
870,0.8753700000000001
871,0.7129800000000001
872,0.7129800000000001
873,0.65261
874,0.54952
875,0.44642
876,0.34331999999999996
877,0.24022
878,0.13713
879,0.1835
880,-0.18018
881,-0.29341999999999996
882,-0.29341999999999996
883,-0.29341999999999996
884,-0.27313000000000004
885,-0.17003
886,-0.28123000000000004
887,0.23425
888,0.26363000000000003
889,0.26363000000000003
890,0.26363000000000003
891,-0.0916
892,-0.1321
893,-0.2352
894,-0.29341999999999996
895,-0.29341999999999996
896,-0.21009
897,-0.48155
898,0.3019
899,0.0992
900,0.2023
901,0.20978000000000002
902,0.20978000000000002
903,0.20978000000000002
904,0.14032999999999998
905,0.23959
906,-0.27589
907,-0.12569
908,-0.12569
909,-0.12569
910,-0.48957
911,0.24848
912,0.26363000000000003
913,0.26363000000000003
914,0.26363000000000003
915,0.26363000000000003
916,0.26363000000000003
917,0.26363000000000003
918,0.26363000000000003
919,0.26363000000000003
920,0.47196000000000005
921,0.18681
922,0.20978000000000002
923,0.20978000000000002
924,0.20978000000000002
925,0.15582000000000001
926,0.31705
927,0.26363000000000003
928,0.26363000000000003
929,0.26363000000000003
930,0.26363000000000003
931,0.26363000000000003
932,0.26363000000000003
933,0.063313
934,-0.45216999999999996
935,-0.12569
936,-0.12569
937,-0.12569
938,-0.31329
939,0.2022
940,0.22366
941,0.37751
942,0.37751
943,0.31287
944,0.20978000000000002
