time,value
0,-0.7081
1,-1.022
2,-1.2842
3,-1.4788
4,-1.5894
5,-1.6005
6,-1.5054
7,-1.3048
8,-1.0087
9,-0.63193
10,-0.20174
11,0.24579
12,0.67261
13,1.0418
14,1.3205
15,1.4859
16,1.5318
17,1.4682
18,1.3092
19,1.0808
20,0.8102
21,0.52468
22,0.24068
23,-0.031501
24,-0.28492
25,-0.51385
26,-0.71496
27,-0.87729
28,-0.99055
29,-1.0423
30,-1.0263
31,-0.9423799999999999
32,-0.79648
33,-0.6047600000000001
34,-0.38334
35,-0.15233
36,0.073857
37,0.27934000000000003
38,0.45793999999999996
39,0.60453
40,0.71721
41,0.79388
42,0.83142
43,0.8255600000000001
44,0.77399
45,0.6766300000000001
46,0.53943
47,0.37028
48,0.18552000000000002
49,0.0020462
50,-0.16376
51,-0.29527
52,-0.38935
53,-0.4421
54,-0.45606
55,-0.43661000000000005
56,-0.39459
57,-0.33945
58,-0.27548
59,-0.21143
60,-0.15128
61,-0.095236
62,-0.042927
63,0.0049799
64,0.048165
65,0.087102
66,0.12152
67,0.15195999999999998
68,0.17776
69,0.1994
70,0.21869
71,0.23353000000000002
72,0.24579
73,0.25648000000000004
74,0.27038
75,0.28520999999999996
76,0.3013
77,0.31987
78,0.33652
79,0.3426
80,0.32671
81,0.27728
82,0.18263
83,0.041423
84,-0.14077
85,-0.34756
86,-0.55404
87,-0.7283
88,-0.8421200000000001
89,-0.87334
90,-0.81477
91,-0.66893
92,-0.4529
93,-0.19269
94,0.085982
95,0.35574
96,0.59197
97,0.77704
98,0.90666
99,0.9779100000000001
100,0.98835
101,0.9413100000000001
102,0.84321
103,0.6975899999999999
104,0.51485
105,0.30791
106,0.0869
107,-0.13879
108,-0.35608
109,-0.5555399999999999
110,-0.73418
111,-0.88731
112,-1.0023
113,-1.0656
114,-1.0663
115,-0.9869
116,-0.81839
117,-0.56665
118,-0.2494
119,0.10952
120,0.47161000000000003
121,0.79551
122,1.0458
123,1.2032
124,1.2633
125,1.2343
126,1.135
127,0.99146
128,0.81842
129,0.62288
130,0.4075
131,0.16962
132,-0.09498200000000001
133,-0.38139
134,-0.66835
135,-0.9320799999999999
136,-1.1435
137,-1.2751
138,-1.3049
139,-1.2307
140,-1.0595
141,-0.81102
142,-0.51074
143,-0.18469000000000002
144,0.14445999999999998
145,0.45658000000000004
146,0.73817
147,0.9731
148,1.1488
149,1.25
150,1.2698
151,1.2057
152,1.0587
153,0.84888
154,0.59529
155,0.3201
156,0.044128
157,-0.21486999999999998
158,-0.44706
159,-0.6493
160,-0.81318
161,-0.93286
162,-1.0023
163,-1.0105
164,-0.9487399999999999
165,-0.81506
166,-0.61466
167,-0.36164
168,-0.080691
169,0.20422
170,0.46958
171,0.69199
172,0.8585200000000001
173,0.9607
174,0.9948100000000001
175,0.9571700000000001
176,0.8506100000000001
177,0.6807
178,0.45775
179,0.19713
180,-0.075728
181,-0.33426
182,-0.55008
183,-0.6976
184,-0.75744
185,-0.72805
186,-0.61659
187,-0.44113
188,-0.23054000000000002
189,-0.013047
190,0.18078
191,0.33692
192,0.4407
193,0.49107
194,0.4942
195,0.45731000000000005
196,0.38995
197,0.29935
198,0.19635
199,0.084589
200,-0.033264
201,-0.15217999999999998
202,-0.26181
203,-0.35488000000000003
204,-0.42217
205,-0.45182
206,-0.43832
207,-0.38178
208,-0.28044
209,-0.13954
210,0.031244
211,0.21777
212,0.40831999999999996
213,0.5826100000000001
214,0.72151
215,0.80883
216,0.8282200000000001
217,0.77246
218,0.64436
219,0.45319
220,0.21583000000000002
221,-0.041734
222,-0.29069
223,-0.50579
224,-0.66787
225,-0.7649199999999999
226,-0.79465
227,-0.76547
228,-0.69118
229,-0.58437
230,-0.45518000000000003
231,-0.31346999999999997
232,-0.16179000000000002
233,-0.0012914
234,0.16601
235,0.33697
236,0.50664
237,0.66688
238,0.80407
239,0.90405
240,0.9554799999999999
241,0.9439700000000001
242,0.86336
243,0.71562
244,0.5100100000000001
245,0.25843
246,-0.016578
247,-0.28954
248,-0.5351
249,-0.73017
250,-0.85657
251,-0.90714
252,-0.88702
253,-0.80312
254,-0.67118
255,-0.5051899999999999
256,-0.31779
257,-0.1215
258,0.073228
259,0.25898000000000004
260,0.42833999999999994
261,0.57082
262,0.6772199999999999
263,0.74308
264,0.76702
265,0.75378
266,0.70878
267,0.63775
268,0.5454
269,0.43391
270,0.30046
271,0.13975
272,-0.044042000000000005
273,-0.242
274,-0.44472
275,-0.6331399999999999
276,-0.7834300000000001
277,-0.87469
278,-0.89476
279,-0.8389
280,-0.71006
281,-0.52765
282,-0.30990999999999996
283,-0.076169
284,0.1516
285,0.35585
286,0.52755
287,0.6623100000000001
288,0.7560899999999999
289,0.80637
290,0.81197
291,0.7804300000000001
292,0.71028
293,0.6068399999999999
294,0.47672
295,0.32685
296,0.16496
297,-0.0036906
298,-0.16710999999999998
299,-0.31887
300,-0.45183
301,-0.5563100000000001
302,-0.61854
303,-0.6403800000000001
304,-0.61651
305,-0.54352
306,-0.43001999999999996
307,-0.28274
308,-0.11327999999999999
309,0.065836
310,0.23709000000000002
311,0.38044
312,0.48303999999999997
313,0.53191
314,0.52213
315,0.45383999999999997
316,0.34062
317,0.19993
318,0.052952
319,-0.07545299999999999
320,-0.16557
321,-0.20564000000000002
322,-0.19759000000000002
323,-0.14711
324,-0.064549
325,0.034966000000000004
326,0.1351
327,0.22576
328,0.30056
329,0.34963
330,0.36682
331,0.34444
332,0.28259
333,0.18136
334,0.052709000000000006
335,-0.08604400000000001
336,-0.21811
337,-0.32364
338,-0.39187
339,-0.41728999999999994
340,-0.41026999999999997
341,-0.38592
342,-0.35368
343,-0.31923
344,-0.28036
345,-0.22638000000000003
346,-0.13625
347,0.0034770000000000005
348,0.1935
349,0.42336
350,0.66481
351,0.8797799999999999
352,1.0296
353,1.0903
354,1.0485
355,0.90023
356,0.66205
357,0.36278
358,0.032635000000000004
359,-0.29564
360,-0.59353
361,-0.8416399999999999
362,-1.0219
363,-1.1226
364,-1.1358
365,-1.062
366,-0.91138
367,-0.69827
368,-0.44123999999999997
369,-0.16515
370,0.10815
371,0.36109
372,0.58044
373,0.76056
374,0.8993700000000001
375,1.0015
376,1.0671
377,1.0933
378,1.0702
379,0.98665
380,0.8366899999999999
381,0.61731
382,0.34210999999999997
383,0.029508999999999997
384,-0.29177
385,-0.58662
386,-0.8267100000000001
387,-0.9887
388,-1.0664
389,-1.0633
390,-0.9916799999999999
391,-0.8671700000000001
392,-0.713
393,-0.54176
394,-0.36418
395,-0.18345
396,-0.0036381
397,0.17207
398,0.34453
399,0.50495
400,0.64657
401,0.76265
402,0.85244
403,0.9107799999999999
404,0.94599
405,0.96357
406,0.9623700000000001
407,0.93758
408,0.8785700000000001
409,0.77017
410,0.59532
411,0.35306
412,0.052109
413,-0.28729
414,-0.6340600000000001
415,-0.9548200000000001
416,-1.2203
417,-1.4143
418,-1.5290000000000001
419,-1.5659999999999998
420,-1.5308
421,-1.4277
422,-1.2528
423,-0.9996700000000001
424,-0.6645300000000001
425,-0.24786999999999998
426,0.23558
427,0.76013
428,1.2845
429,1.7608
430,2.1458
431,2.3998
432,2.4968
433,2.4253
434,2.1886
435,1.7971
436,1.2761
437,0.66087
438,-0.010634000000000001
439,-0.69403
440,-1.3437
441,-1.9089
442,-2.3507
443,-2.6395
444,-2.7508
445,-2.6781
446,-2.4287
447,-2.0227
448,-1.48
449,-0.8335299999999999
450,-0.12353
451,0.61085
452,1.327
453,1.973
454,2.4926
455,2.8459
456,3.0069
457,2.9581
458,2.6975
459,2.2495
460,1.6483
461,0.94124
462,0.18105
463,-0.58321
464,-1.301
465,-1.9284
466,-2.4293
467,-2.7706
468,-2.9232
469,-2.8741
470,-2.6179
471,-2.1696
472,-1.5618
473,-0.84147
474,-0.06692000000000001
475,0.69968
476,1.3979
477,1.9856
478,2.4295
479,2.7141
480,2.8388
481,2.8058
482,2.6215
483,2.2906
484,1.8234
485,1.2302
486,0.53394
487,-0.22641
488,-1.0029
489,-1.7372
490,-2.364
491,-2.8276
492,-3.0878
493,-3.1214
494,-2.9304
495,-2.5385
496,-1.9831
497,-1.3117
498,-0.57401
499,0.1811
