time,value
0,1.0515
1,0.9819700000000001
2,0.77725
3,0.66808
4,0.7146100000000001
5,0.5079899999999999
6,0.6098399999999999
7,0.56193
8,0.7880699999999999
9,0.91925
10,0.77532
11,0.59748
12,0.76367
13,0.73183
14,0.55181
15,0.43626000000000004
16,0.46351000000000003
17,0.57439
18,0.44321000000000005
19,0.23521
20,0.3974
21,0.33171999999999996
22,0.16274
23,0.33878
24,0.22351999999999997
25,-0.044998
26,0.11888
27,0.052298000000000004
28,-0.20393
29,-0.39549
30,-0.36023
31,-0.30409
32,-0.52405
33,-0.7538600000000001
34,-0.96342
35,-1.1652
36,-1.1906
37,-1.3385
38,-1.4786
39,-1.4965
40,-1.5749
41,-1.7124
42,-1.798
43,-1.899
44,-1.9892
45,-2.0919
46,-1.8147
47,-1.5483
48,-1.2828
49,-1.015
50,-0.74671
51,-0.47603
52,-0.20359000000000002
53,0.069914
54,0.31905
55,0.5956100000000001
56,0.8721899999999999
57,1.1514
58,1.4366
59,1.7278
60,2.0223
61,2.2046
62,2.1503
63,1.8742
64,1.6212
65,1.3425
66,1.0643
67,0.789
68,0.51568
69,0.24468
70,-0.024842
71,-0.29231
72,-0.55723
73,-0.81892
74,-1.0564
75,-1.3201
76,-1.5756
77,-1.8459
78,-1.9824
79,-1.8306
80,-1.7511
81,-1.6717
82,-1.3935
83,-1.2348
84,-1.2129
85,-1.0613
86,-0.9144
87,-0.99805
88,-0.75873
89,-0.5474399999999999
90,-0.37259000000000003
91,-0.54632
92,-0.42553
93,-0.32201
94,-0.054711
95,0.1018
96,-0.1025
97,-0.057386
98,0.1589
99,0.15353
100,0.33143
101,0.47555
102,0.37656999999999996
103,0.37853000000000003
104,0.55712
105,0.45009
106,0.36680999999999997
107,0.5934
108,0.6967899999999999
109,0.51737
110,0.38522
111,0.62485
112,0.63988
113,0.51856
114,0.71023
115,0.84273
116,0.70112
117,0.59506
118,0.621
119,0.82809
120,0.68643
121,0.8517
122,0.8395100000000001
123,0.65117
124,0.8382700000000001
125,0.89286
126,0.9135
127,1.023
