time,value
0,1.7711
1,1.3899
2,0.9188200000000001
3,0.38527
4,-0.17647000000000002
5,-0.72841
6,-1.2325
7,-1.6537
8,-1.9691
9,-2.1601
10,-2.2148
11,-2.1267
12,-1.8935
13,-1.5268
14,-1.0418
15,-0.46948
16,0.14865
17,0.76447
18,1.3228
19,1.7734
20,2.0849
21,2.2332
22,2.2129
23,2.039
24,1.7356
25,1.3333
26,0.86387
27,0.35819
28,-0.15405
29,-0.6461399999999999
30,-1.0932
31,-1.47
32,-1.7611
33,-1.9492
34,-2.0191
35,-1.9611
36,-1.7786
37,-1.4781
38,-1.0725
39,-0.5847
40,-0.043637
41,0.51254
42,1.0403
43,1.4976
44,1.847
45,2.0554
46,2.1105
47,2.0075
48,1.7619
49,1.3995
50,0.9565299999999999
51,0.46998999999999996
52,-0.020978999999999998
53,-0.48083000000000004
54,-0.8774700000000001
55,-1.1844
56,-1.3896
57,-1.4754
58,-1.4495
59,-1.3219
60,-1.1187
61,-0.8698100000000001
62,-0.60765
63,-0.36004
64,-0.14548
65,0.031289
66,0.17114000000000001
67,0.2889
68,0.4
69,0.51394
70,0.6290399999999999
71,0.73819
72,0.82993
73,0.88871
74,0.90479
75,0.87036
76,0.7881
77,0.66118
78,0.49888000000000005
79,0.30706
80,0.09267
81,-0.13871
82,-0.37567
83,-0.6069100000000001
84,-0.81466
85,-0.97745
86,-1.0781
87,-1.1046
88,-1.0534
89,-0.9331299999999999
90,-0.7559999999999999
91,-0.5333
92,-0.28307
93,-0.016501
94,0.25906
95,0.53637
96,0.80645
97,1.0583
98,1.2737
99,1.4293
100,1.5021
101,1.4778
102,1.3559999999999999
103,1.1423
104,0.85178
105,0.50425
106,0.12393
107,-0.26858000000000004
108,-0.65773
109,-1.0256
110,-1.3576
111,-1.6374
112,-1.8492
113,-1.9791
114,-2.0069
115,-1.9192
116,-1.7176
117,-1.3999
118,-0.97939
119,-0.47881
120,0.08089199999999999
121,0.66243
122,1.2347
123,1.7581
124,2.1998
125,2.5226
126,2.6974
127,2.7001
128,2.5291
129,2.1934
130,1.7186
131,1.1453
132,0.5198699999999999
133,-0.10987999999999999
134,-0.70915
135,-1.2477
136,-1.7135
137,-2.088
138,-2.3628
139,-2.5231
140,-2.5533
141,-2.4402
142,-2.1811
143,-1.7793
144,-1.2568
145,-0.65415
146,-0.015641
147,0.60347
148,1.1664
149,1.6374
150,1.9977
151,2.2349
152,2.3416
153,2.3121
154,2.1439
155,1.8397
156,1.4076
157,0.8759299999999999
158,0.28268000000000004
159,-0.31283
160,-0.8546
161,-1.2888
162,-1.5787
163,-1.7111
164,-1.6938
165,-1.5538
166,-1.3199
167,-1.0296
168,-0.71246
169,-0.39446
170,-0.091176
171,0.18744
172,0.42876000000000003
173,0.6239399999999999
174,0.76212
175,0.8377100000000001
176,0.8533799999999999
177,0.81098
178,0.72839
179,0.6218899999999999
180,0.5089100000000001
181,0.39762
182,0.29281999999999997
183,0.1863
184,0.07632
185,-0.042957999999999996
186,-0.16947
187,-0.29567
188,-0.41172
189,-0.49956000000000006
190,-0.54998
191,-0.5535100000000001
192,-0.51872
193,-0.44492
194,-0.34467
195,-0.22271999999999997
196,-0.087189
197,0.053842999999999995
198,0.19372999999999999
199,0.32244
200,0.43023999999999996
201,0.5022399999999999
202,0.53032
203,0.502
204,0.42633000000000004
205,0.31514000000000003
206,0.18575
207,0.062149
208,-0.043657
209,-0.11882000000000001
210,-0.16635999999999998
211,-0.19268
212,-0.21463000000000002
213,-0.23769
214,-0.26592
215,-0.29903
216,-0.33179000000000003
217,-0.34981999999999996
218,-0.34781999999999996
219,-0.32247
220,-0.26789
221,-0.19053
222,-0.093214
223,0.018275
224,0.14160999999999999
225,0.26878
226,0.39144
227,0.49899
228,0.59315
229,0.65857
230,0.69475
231,0.70005
232,0.67361
233,0.61766
234,0.5340600000000001
235,0.42252
236,0.28006
237,0.10555
238,-0.10353
239,-0.34156
240,-0.5946899999999999
241,-0.8355899999999999
242,-1.0407
243,-1.1841
244,-1.2522
245,-1.2458
246,-1.1699
247,-1.0417
248,-0.86845
249,-0.6623100000000001
250,-0.41694
251,-0.12333
252,0.22115
253,0.61879
254,1.0473
255,1.4680000000000002
256,1.8298
257,2.0766
258,2.1627
259,2.0643
260,1.7847
261,1.3545
262,0.8236
263,0.24985
264,-0.31055
265,-0.8142699999999999
266,-1.229
267,-1.5419999999999998
268,-1.7411
269,-1.8257
270,-1.7954
271,-1.6581
272,-1.4238
273,-1.1078
274,-0.74028
275,-0.34717
276,0.037880000000000004
277,0.38554
278,0.6812600000000001
279,0.90653
280,1.0512
281,1.1128
282,1.0935
283,1.0009
284,0.8521700000000001
285,0.66508
286,0.46681999999999996
287,0.28142
288,0.13155
289,0.026562
290,-0.039126999999999995
291,-0.078345
292,-0.11592999999999999
293,-0.1702
294,-0.257
295,-0.37174
296,-0.50161
297,-0.61549
298,-0.67907
299,-0.66173
300,-0.5446300000000001
301,-0.33195
302,-0.043987
303,0.27843
304,0.59225
305,0.84898
306,1.0087
307,1.0474
308,0.9542700000000001
309,0.73965
310,0.42496999999999996
311,0.047671
312,-0.34897
313,-0.7148100000000001
314,-1.0096
315,-1.1966
316,-1.2590000000000001
317,-1.1964
318,-1.0203
319,-0.7552399999999999
320,-0.42833999999999994
321,-0.073598
322,0.27628
323,0.59705
324,0.86341
325,1.0562
326,1.1551
327,1.1561
328,1.0637
329,0.88535
330,0.64412
331,0.36494
332,0.07511699999999999
333,-0.19635999999999998
334,-0.43345
335,-0.62388
336,-0.7568699999999999
337,-0.8324600000000001
338,-0.848
339,-0.8003
340,-0.68706
341,-0.51079
342,-0.28498
343,-0.025533
344,0.24236999999999997
345,0.4933
346,0.70001
347,0.8362799999999999
348,0.8887700000000001
349,0.84525
350,0.71019
351,0.49731000000000003
352,0.22612
353,-0.069383
354,-0.35628000000000004
355,-0.59605
356,-0.75694
357,-0.82416
358,-0.7942
359,-0.68265
360,-0.51559
361,-0.33038
362,-0.1589
363,-0.023274
364,0.070868
365,0.13972
366,0.20371
367,0.28405
368,0.39516
369,0.53105
370,0.6722199999999999
371,0.78187
372,0.8343
373,0.80356
374,0.67977
375,0.47485
376,0.21603000000000003
377,-0.060926999999999995
378,-0.31877
379,-0.53215
380,-0.6814399999999999
381,-0.76275
382,-0.77699
383,-0.7318
384,-0.6350899999999999
385,-0.49958
386,-0.33605999999999997
387,-0.15589
388,0.029908999999999998
389,0.20102
390,0.34334000000000003
391,0.44104
392,0.49081
393,0.48951000000000006
394,0.44118
395,0.35508
396,0.24288
397,0.11947999999999999
398,-0.0029517
399,-0.11238
400,-0.20103
401,-0.26083
402,-0.28363
403,-0.26282
404,-0.19542
405,-0.079802
406,0.069336
407,0.23403000000000002
408,0.39336
409,0.52374
410,0.60702
411,0.6312300000000001
412,0.58916
413,0.48477
414,0.32627
415,0.12485999999999998
416,-0.10605999999999999
417,-0.34589000000000003
418,-0.57473
419,-0.7771899999999999
420,-0.93234
421,-1.0224
422,-1.0337
423,-0.9534299999999999
424,-0.78251
425,-0.53479
426,-0.23385999999999998
427,0.09351799999999999
428,0.40962
429,0.68012
430,0.88656
431,1.0172
432,1.0714
433,1.0589
434,0.9930700000000001
435,0.8849
436,0.7416
437,0.5633600000000001
438,0.35034
439,0.10800000000000001
440,-0.15733
441,-0.42965
442,-0.68295
443,-0.89285
444,-1.0337
445,-1.0903
446,-1.0571
447,-0.93801
448,-0.74458
449,-0.49881000000000003
450,-0.21739
451,0.07968
452,0.36484
453,0.61987
454,0.82294
455,0.9554299999999999
456,1.0068
457,0.97172
458,0.8559
459,0.67423
460,0.44913000000000003
461,0.20382
462,-0.038023
463,-0.25765
464,-0.4426
465,-0.58619
466,-0.6918300000000001
467,-0.75973
468,-0.7901
469,-0.78283
470,-0.73482
471,-0.64776
472,-0.5152800000000001
473,-0.34699
474,-0.14937
475,0.070661
476,0.2997
477,0.52512
478,0.74034
479,0.93353
480,1.0903
481,1.1932
482,1.2329
483,1.1899
484,1.05
485,0.8074
486,0.47407
487,0.07384
488,-0.35802
489,-0.77687
490,-1.1299
491,-1.3749
492,-1.4811
493,-1.4406
494,-1.2646
495,-0.97639
496,-0.6160800000000001
497,-0.22887
498,0.14468
499,0.46983
