time,value
0,0.24351
1,0.24351
2,0.24351
3,0.24351
4,0.24351
5,0.24351
6,0.24351
7,0.24351
8,0.24351
9,0.24351
10,0.24351
11,0.24351
12,0.24351
13,0.24351
14,0.24351
15,0.24351
16,0.24351
17,0.24351
18,0.24351
19,0.24351
20,0.24351
21,0.24351
22,0.24351
23,0.24351
24,0.30766
25,0.35173000000000004
26,0.37622
27,0.43033000000000005
28,0.47251000000000004
29,0.50098
30,0.50098
31,0.47507
32,0.43423999999999996
33,0.3793
34,0.37224
35,0.37224
36,0.37224
37,0.37224
38,0.37315
39,0.38372
40,0.46653999999999995
41,0.49718999999999997
42,0.50098
43,0.50098
44,0.50098
45,0.50098
46,0.50098
47,0.50098
48,0.50098
49,0.50098
50,0.50098
51,0.50098
52,0.50098
53,0.50098
54,0.50098
55,0.50098
56,0.50098
57,0.49623999999999996
58,0.4608
59,0.37798000000000004
60,0.37265
61,0.37224
62,0.37224
63,0.37224
64,0.41112
65,0.46697
66,0.49403
67,0.50098
68,0.47516
69,0.38988
70,0.26642
71,0.16905
72,0.11575
73,0.44525
74,0.16845
75,-0.24065999999999999
76,-0.11792000000000001
77,-0.14053
78,-0.11974000000000001
79,-0.20052999999999999
80,0.21355
81,0.10394
82,0.11377999999999999
83,0.11477000000000001
84,0.42065
85,0.12414000000000001
86,-0.17890999999999999
87,0.3063
88,0.2802
89,0.49338999999999994
90,0.44073
91,0.2442
92,-0.25313
93,-0.16943
94,-0.36291
95,-0.13827
96,-0.1496
97,-0.19395
98,-0.27143
99,-0.27143
100,-0.31881
101,-0.38459
102,-0.39689
103,-0.4471
104,-0.49975
105,-0.52517
106,-0.57227
107,-0.61803
108,-0.65657
109,-0.69431
110,-0.77261
111,-0.8913200000000001
112,-1.057
113,-1.2226
114,-1.3858
115,-1.54
116,-1.6391
117,-1.7219
118,-1.8048
119,-1.9598
120,-2.0575
121,-2.0743
122,-2.1424
123,-2.1839
124,-2.2024
125,-2.2024
126,-2.1692
127,-2.1122
128,-2.0294
129,-1.9181
130,-1.8037
131,-1.6955
132,-1.6669999999999998
133,-1.6154
134,-1.5325
135,-1.4497
136,-1.3654
137,-1.2669
138,-1.1012
139,-0.87855
140,-0.65356
141,-0.47726
142,-0.2546
143,0.11823
144,0.3149
145,0.54419
146,0.7387699999999999
147,0.90115
148,1.0274
149,1.1258
150,1.2086
151,1.2914
152,1.3742
153,1.4571
154,1.5399
155,1.6227
156,1.7055
157,1.7883
158,1.7883
159,1.7883
160,1.78
161,1.7103
162,1.6746
163,1.6461
164,1.5895
165,1.5119999999999998
166,1.4292
167,1.3464
168,1.2297
169,1.117
170,1.015
171,0.99126
172,0.9322799999999999
173,0.84946
174,0.76665
175,0.68676
176,0.62971
177,0.62971
178,0.56262
179,0.51041
180,0.50139
181,0.50098
182,0.50098
183,0.50098
184,0.50098
185,0.47086999999999996
186,0.41652
187,0.3337
188,0.25089
189,0.16807
190,0.41034
191,0.089164
192,-0.085737
193,-0.085737
194,-0.12636
195,-0.36821
196,-0.14269
197,-0.14269
198,-0.46856000000000003
199,-0.15525
200,-0.097848
201,0.16981
202,0.32218
203,0.15408
204,-0.23743000000000003
205,-0.14822000000000002
206,-0.27716999999999997
207,-0.4428
208,-0.62721
209,-0.8248200000000001
210,-1.0224
211,-1.1256
212,-1.166
213,-1.1414
214,-1.0051
215,-0.87492
216,-0.7921100000000001
217,-0.70929
218,-0.6645399999999999
219,-0.66206
220,-0.73093
221,-0.76963
222,-0.78637
223,-0.78637
224,-0.8229299999999999
225,-0.8823
226,-0.9651200000000001
227,-0.9857100000000001
228,-0.9444600000000001
229,-0.8321299999999999
230,-0.71255
231,-0.64876
232,-0.62565
233,-0.54284
234,-0.46002
235,-0.3772
236,-0.29439
237,-0.21156999999999998
238,-0.15353
239,-0.14369
240,-0.14269
241,-0.14269
242,-0.14074
243,-0.18665
244,0.38187
245,0.19349
246,0.27631
247,0.35912
248,0.43499
249,0.49075
250,0.51772
251,0.56165
252,0.64447
253,0.72038
254,0.75885
255,0.7641899999999999
256,0.847
257,0.9298200000000001
258,1.0126
259,1.0955
260,1.2252
261,1.3607
262,1.4689
263,1.5555
264,1.6383
265,1.7211
266,1.8039
267,1.9033
268,2.0175
269,2.1339
270,2.1628
271,2.1286
272,2.0343
273,1.8889
274,1.7539
275,1.6711
276,1.516
277,1.3848
278,1.2939
279,1.2111
280,1.1283
281,1.0243
282,0.77664
283,0.6046100000000001
284,0.4699
285,0.34445
286,0.11969
287,-0.12875999999999999
288,-0.3772
289,-0.66668
290,-0.99569
291,-1.3538
292,-1.5194
293,-1.6821
294,-1.8162
295,-1.8162
296,-1.8162
297,-1.8162
298,-1.8162
299,-1.7609
300,-1.736
301,-1.7712
302,-1.8018
303,-1.7922
304,-1.74
305,-1.6178
306,-1.5099
307,-1.4247
308,-1.3985
309,-1.3292
310,-1.2464
311,-1.1635
312,-1.0807
313,-0.99792
314,-0.9151
315,0.4305
316,0.4305
317,0.4305
318,0.4305
319,0.4305
320,0.4305
321,0.4305
322,0.4305
323,0.4305
324,0.4305
325,0.4305
326,0.4305
327,0.4305
328,0.4305
329,0.4305
330,0.4305
331,0.4305
332,0.4305
333,0.4305
334,0.4305
335,0.4305
336,0.4305
337,0.4305
338,0.4305
339,0.53122
340,0.60041
341,0.63262
342,0.63262
343,0.63262
344,0.62022
345,0.55585
346,0.48276
347,0.4305
348,0.4305
349,0.40133
350,0.33621
351,0.22935999999999998
352,0.22838000000000003
353,0.22838000000000003
354,0.22838000000000003
355,0.22838000000000003
356,0.22838000000000003
357,0.22838000000000003
358,0.22838000000000003
359,0.22838000000000003
360,0.19652
361,0.10511
362,0.24553000000000003
363,-0.050275
364,-0.40413000000000004
365,-0.14715999999999999
366,-0.17586
367,-0.17586
368,-0.17586
369,-0.17586
370,-0.17586
371,-0.17586
372,-0.17586
373,-0.17586
374,-0.17586
375,-0.17586
376,-0.17586
377,-0.17586
378,-0.17586
379,-0.11482
380,-0.15161
381,0.06080599999999999
382,0.40238
383,0.15662
384,0.2197
385,0.17953
386,0.11148
387,0.12305
388,0.11537
389,0.28201
390,-0.12007999999999999
391,-0.11996
392,-0.35452
393,0.29561
394,0.19233
395,0.32236
396,0.41348999999999997
397,0.42894
398,0.52425
399,0.59723
400,0.63262
401,0.63262
402,0.59021
403,0.51771
404,0.45077
405,0.3937
406,0.31016
407,0.13765
408,-0.41623000000000004
409,-0.27111999999999997
410,-0.40115
411,-0.5203300000000001
412,-0.58073
413,-0.58911
414,-0.71913
415,-0.84916
416,-0.9598899999999999
417,-0.9792
418,-1.058
419,-1.1407
420,-1.1806
421,-1.2546
422,-1.3264
423,-1.3869
424,-1.3886
425,-1.3886
426,-1.3921
427,-1.4307
428,-1.5289
429,-1.6589
430,-1.7889
431,-1.913
432,-1.9949
433,-1.9949
434,-2.1083
435,-2.237
436,-2.366
437,-2.3892
438,-2.4541
439,-2.5439
440,-2.5876
441,-2.549
442,-2.4759
443,-2.4116
444,-2.3098
445,-2.1773
446,-2.0074
447,-1.9949
448,-1.983
449,-1.9544
450,-1.8385
451,-1.7905
452,-1.7658
453,-1.6358
454,-1.4162
455,-1.1929
456,-1.0462
457,-0.91353
458,-0.7835
459,-0.6534800000000001
460,-0.60282
461,-0.5801
462,-0.5801
463,-0.5801
464,-0.61317
465,-0.6722
466,-0.76103
467,-0.78222
468,-0.78222
469,-0.78222
470,-0.78222
471,-0.78222
472,-0.78222
473,-0.78222
474,-0.71521
475,-0.62036
476,-0.70919
477,-0.89328
478,-1.0662
479,-1.0598
480,-1.0174
481,-1.0087
482,-1.077
483,-1.1488
484,-1.1865
485,-1.1865
486,-1.1865
487,-1.1703
488,-1.1298
489,-1.0166
490,-0.9843299999999999
491,-0.9843299999999999
492,-0.9843299999999999
493,-0.9843299999999999
494,-0.93863
495,-0.82276
496,-0.69339
497,-0.6123
498,-0.5801
499,-0.5801
500,-0.62736
501,-0.70029
502,-0.76595
503,-0.78222
504,-0.76856
505,-0.7247899999999999
506,-0.63502
507,-0.5701
508,-0.54693
509,-0.41789
510,-0.28786
511,-0.15783
512,-0.15498
513,0.085609
514,0.11537
515,0.11537
516,0.11537
517,0.2747
518,0.14953
519,0.20235
520,0.22838000000000003
521,0.22838000000000003
522,0.22838000000000003
523,0.22838000000000003
524,0.22252
525,0.18261
526,0.48386999999999997
527,0.11537
528,0.11537
529,0.15258
530,0.43078
531,0.21936999999999998
532,0.22774
533,0.28814
534,0.40038
535,0.42227
536,0.49154
537,0.57922
538,0.62171
539,0.63262
540,0.63262
541,0.63262
542,0.63262
543,0.63262
544,0.63262
545,0.63262
546,0.64656
547,0.6812699999999999
548,0.79585
549,0.8347399999999999
550,0.8347399999999999
551,0.8347399999999999
552,0.73736
553,0.64963
554,0.63418
555,0.63262
556,0.63262
557,0.6341600000000001
558,0.71783
559,0.78589
560,0.8347399999999999
561,0.8347399999999999
562,0.87154
563,0.9441700000000001
564,1.0742
565,1.1779
566,1.2307
567,1.2089
568,1.0966
569,1.0375
570,1.0459
571,1.1759
572,1.2315
573,1.239
574,1.239
575,1.239
576,1.2654
577,1.3555
578,1.4116
579,1.4411
580,1.4411
581,1.4987
582,1.5956
583,1.7221
584,1.8135
585,1.8453
586,1.8453
587,1.8453
588,1.8394
589,1.7913
590,1.6612
591,1.6446
592,1.6432
593,1.6432
594,1.6432
595,1.6981
596,1.7879
597,1.8317
598,1.8453
599,1.8453
600,1.8453
601,1.8006
602,1.7013
603,1.5263
604,1.2724
605,1.0243
606,0.79289
607,0.64871
608,0.43904
609,0.22838000000000003
610,0.22838000000000003
611,0.31795
612,0.41115
613,0.42788999999999994
614,0.4305
615,0.4305
616,0.4305
617,0.4305
618,0.4305
619,0.4356
620,0.4974
621,0.56994
622,0.63262
623,0.63262
624,0.63262
625,0.63262
626,0.63262
627,0.63262
628,0.63262
629,0.63262
630,-0.3562
631,-0.3562
632,-0.3562
633,-0.3562
634,-0.3562
635,-0.3562
636,-0.3562
637,-0.3562
638,-0.3562
639,-0.3562
640,-0.3562
641,-0.3562
642,-0.3562
643,-0.3562
644,-0.3562
645,-0.3562
646,-0.3562
647,-0.3562
648,-0.3562
649,-0.3562
650,-0.3562
651,-0.09893500000000001
652,0.1013
653,0.13589
654,0.13748
655,0.25701999999999997
656,0.48071
657,0.12134
658,0.15250999999999998
659,0.18814
660,0.22021
661,0.24802
662,0.28601
663,0.34953
664,0.3988
665,0.43051000000000006
666,0.44183
667,0.5048699999999999
668,0.56908
669,0.64071
670,0.76774
671,0.8947799999999999
672,1.0093
673,1.0816
674,1.147
675,1.226
676,1.3342
677,1.4235
678,1.4836
679,1.5117
680,1.5117
681,1.5117
682,1.5146
683,1.5341
684,1.5847
685,1.6507
686,1.7237
687,1.8376
688,1.9375
689,2.001
690,2.0051
691,1.9469999999999998
692,1.8374
693,1.8159999999999998
694,1.7483
695,1.6548
696,1.5705
697,1.5017
698,1.4381
699,1.3746
700,1.2872
701,1.1714
702,1.0217
703,0.83189
704,0.6413399999999999
705,0.45153999999999994
706,0.26854
707,0.1225
708,-0.28
709,-0.13157
710,-0.21104
711,-0.31421
712,-0.48968
713,-0.67871
714,-0.8482
715,-0.9932700000000001
716,-1.1612
717,-1.3007
718,-1.4162
719,-1.5106
720,-1.6097
721,-1.7013
722,-1.7648
723,-1.8283
724,-1.8918
725,-1.9554
726,-2.0083
727,-2.0032
728,-1.9396
729,-1.8761
730,-1.8126
731,-1.7491
732,-1.6856
733,-1.6219999999999999
734,-1.5585
735,-1.495
736,-1.4315
737,-1.368
738,-1.3045
739,-1.2128
740,-1.1147
741,-1.0152
742,-0.95165
743,-0.88813
744,-0.82275
745,-0.75043
746,-0.63885
747,-0.53532
748,-0.4718
749,-0.46369
750,-0.46299999999999997
751,-0.46252
752,-0.41031999999999996
753,-0.37851
754,-0.35885
755,-0.31671
756,-0.2854
757,-0.25758000000000003
758,-0.22551
759,-0.18988
760,-0.16679000000000002
761,-0.16679000000000002
762,-0.15106
763,-0.11145
764,-0.25716999999999995
765,0.14965
766,0.14319
767,0.20351
768,0.10740999999999999
769,0.12717
770,0.12942
771,0.12942
772,0.12942
773,0.11114
774,0.31335999999999997
775,0.19297999999999998
776,0.28004
777,-0.12992
778,-0.29657
779,-0.3562
780,-0.3562
781,-0.3562
782,-0.3562
783,-0.37235999999999997
784,-0.42267
785,-0.13405999999999998
786,-0.16679000000000002
787,-0.16679000000000002
788,-0.16679000000000002
789,-0.16679000000000002
790,-0.17954
791,-0.28645
792,-0.34126999999999996
793,-0.36426
794,-0.36426
795,-0.36426
796,-0.36426
797,-0.36426
798,-0.39021999999999996
799,-0.42422
800,-0.46366999999999997
801,-0.4819
802,-0.5271399999999999
803,-0.5906600000000001
804,-0.65418
805,-0.7177
806,-0.78122
807,-0.84473
808,-0.90825
809,-0.97177
810,-1.0353
811,-1.0988
812,-1.1623
813,-1.2289
814,-1.3339
815,-1.4298
816,-1.5151
817,-1.5786
818,-1.6422
819,-1.6923
820,-1.7131
821,-1.6604
822,-1.5969
823,-1.5334
824,-1.4636
825,-1.3637
826,-1.2529
827,-1.2529
828,-1.2529
829,-1.2529
830,-1.2529
831,-1.2529
832,-1.2529
833,-1.2529
834,-1.2169
835,-1.1499
836,-1.051
837,-0.9239700000000001
838,-0.78254
839,-0.6281100000000001
840,-0.45705
841,-0.32731
842,-0.2303
843,-0.17622000000000002
844,-0.16315
845,-0.13597
846,-0.37821
847,-0.35775999999999997
848,-0.21023000000000003
849,0.097839
850,0.1391
851,0.29193
852,0.4775
853,0.71081
854,0.98759
855,1.2773
856,1.5622
857,1.7728
858,1.9317
859,2.0361
860,2.0831
861,2.1041
862,2.1041
863,2.1041
864,2.1058
865,2.1217
866,2.1853
867,2.2012
868,2.1839
869,2.1279
870,2.0651
871,1.9806
872,1.8708
873,1.7438
874,1.6167
875,1.4939
876,1.3977
877,1.3063
878,1.2073
879,1.0803
880,0.9661
881,0.86472
882,0.77982
883,0.6119399999999999
884,0.52405
885,0.5199600000000001
886,0.45643999999999996
887,0.39292
888,0.32941
889,0.26589
890,0.16637000000000002
891,0.29643
892,-0.11864000000000001
893,-0.45053999999999994
894,-0.15044000000000002
895,-0.21395999999999998
896,-0.27747
897,-0.34099
898,-0.40278
899,-0.44743
900,-0.46299999999999997
901,-0.46113999999999994
902,-0.45233
903,-0.40718000000000004
904,-0.39066999999999996
905,-0.45419
906,-0.4623
907,-0.46299999999999997
908,-0.46252
909,-0.41031999999999996
910,-0.37851
911,-0.35344000000000003
912,-0.26916999999999996
913,-0.20653000000000002
914,-0.1509
915,-0.4497
916,0.082334
917,0.48916000000000004
918,0.18655
919,0.29481
920,0.37642
921,0.42531
922,0.41839
923,0.37834
924,0.32689
925,0.32689
926,0.32689
927,0.32689
928,0.32689
929,0.28443
930,0.22878
931,0.16527
932,0.14052
933,0.12942
934,0.12693
935,0.46776
936,0.29057
937,0.13748
938,0.13748
939,0.19494
940,0.34815
941,0.13634000000000002
942,0.19099000000000002
943,0.19294
944,0.12942
