time,value
0,0.41434
1,-0.21291999999999997
2,-0.49312
3,0.11649000000000001
4,-0.33537
5,-0.015681
6,0.5310699999999999
7,-0.08891399999999999
8,-0.26975
9,-0.12968
10,0.24075
11,0.25017
12,-0.16684000000000002
13,-0.54773
14,-0.022897999999999998
15,-0.10459
16,0.42396999999999996
17,-0.7897
18,-0.29281
19,0.15285
20,0.12455
21,-0.17073
22,0.03368
23,0.62124
24,-0.23664000000000002
25,0.25851
26,-0.18506
27,-0.1668
28,0.39105999999999996
29,0.26629
30,-0.39083
31,-0.6489
32,1.4128
33,1.4128
34,1.4128
35,1.4128
36,1.4128
37,1.4128
38,1.4128
39,1.4128
40,1.4128
41,1.4128
42,1.4128
43,1.4128
44,1.4128
45,1.4128
46,-1.4465
47,-1.4465
48,-1.4465
49,-1.4465
50,-1.4465
51,-1.4465
52,-1.4465
53,-1.4465
54,-1.4465
55,-1.4465
56,-1.4465
57,-1.4465
58,-1.4465
59,0.25806
60,0.28689000000000003
61,0.34443
62,0.25625
63,0.26671999999999996
64,-0.29283000000000003
65,-0.013697999999999998
66,-0.10485
67,0.09426799999999999
68,-0.2725
69,-0.29851
70,0.39993
71,-0.28608
72,-1.4465
73,-1.4465
74,-1.4465
75,-1.4465
76,-1.4465
77,-1.4465
78,-1.4465
79,-1.4465
80,-1.4465
81,-1.4465
82,-1.4465
83,-1.4465
84,-1.4465
85,-1.4465
86,-1.4465
87,-1.4465
88,1.4128
89,1.4128
90,1.4128
91,1.4128
92,1.4128
93,1.4128
94,1.4128
95,1.4128
96,1.4128
97,1.4128
98,1.4128
99,1.4128
100,1.4128
101,1.4128
102,1.4128
103,1.4128
104,0.70015
105,-0.46848
106,0.16972
107,-0.023696000000000002
108,-0.088449
109,-0.018321
110,0.19261
111,0.03402
112,0.14393
113,-0.24183000000000002
114,-0.43246999999999997
115,-0.10729000000000001
116,-0.058091
117,0.24902
118,0.15161
119,0.0020674
120,-0.034333999999999996
121,-0.42258999999999997
122,0.63142
123,0.033464
124,0.12168
125,0.015611000000000002
126,-0.016857
127,-0.16337000000000002
