time,value
0,0.7830699999999999
1,0.76726
2,0.74751
3,0.77517
4,0.76331
5,0.74355
6,0.73565
7,0.67243
8,0.54203
9,0.40373000000000003
10,0.26147
11,0.18244000000000002
12,0.13502999999999998
13,0.048094
14,-0.038839
15,-0.12972
16,-0.21666
17,-0.30359
18,-0.39052
19,-0.4814
20,-0.5446300000000001
21,-0.596
22,-0.68293
23,-0.78567
24,-0.84099
25,-0.8488899999999999
26,-0.84099
27,-0.8647
28,-0.9002600000000001
29,-0.8647
30,-0.89236
31,-0.8449399999999999
32,-0.82914
33,-0.8212299999999999
34,-0.78172
35,-0.74615
36,-0.65922
37,-0.63551
38,-0.56439
39,-0.49326000000000003
40,-0.42213
41,-0.33125
42,-0.25617
43,-0.17714000000000002
44,-0.098111
45,-0.019081
46,0.059948
47,0.13898
48,0.21800999999999998
49,0.3326
50,0.39187
51,0.43533999999999995
52,0.4551
53,0.44323999999999997
54,0.4709
55,0.44719
56,0.46299999999999997
57,0.53413
58,0.6013
59,0.64082
60,0.64082
61,0.65662
62,0.65662
63,0.69614
64,0.70799
65,0.69614
66,0.70799
67,0.68428
68,0.64872
69,0.61316
70,0.5657399999999999
71,0.54203
72,0.5934
73,0.61711
74,0.68823
75,0.77122
76,0.82258
77,0.87
78,0.9174200000000001
79,0.9648399999999999
80,1.0123
81,1.0597
82,1.1071
83,1.1545
84,1.2019
85,1.2493
86,1.2335
87,1.0873
88,1.0399
89,1.0004
90,1.036
91,1.0676
92,1.0518
93,0.9648399999999999
94,0.86605
95,0.7317
96,0.59735
97,0.51042
98,0.40373000000000003
99,0.32075
100,0.22985999999999998
101,0.11132
102,0.032288
103,-0.094159
104,-0.15738
105,-0.31939
106,-0.35496
107,-0.31939
108,-0.35891
109,-0.41028000000000003
110,-0.48931
111,-0.56834
112,-0.64737
113,-0.7264
114,-0.80543
115,-0.88446
116,-0.96349
117,-0.97929
118,-1.0267
119,-1.0070000000000001
120,-1.0149
121,-0.9358299999999999
122,-0.9200200000000001
123,-0.89236
124,-0.8212299999999999
125,-0.76986
126,-0.74615
127,-0.7264
128,-0.67898
129,-0.59995
130,-0.48536
131,-0.41818
132,-0.29173000000000004
133,-0.23246
134,-0.16529000000000002
135,-0.094159
136,-0.023033
137,0.048094
138,0.11922
139,0.19035
140,0.26147
141,0.30889
142,0.39978
143,0.44323999999999997
144,0.51832
145,0.53017
146,0.51042
147,0.51042
148,0.54598
149,0.6013
150,0.63686
151,0.64477
152,0.68428
153,0.71985
154,0.77517
155,0.79492
156,0.7870199999999999
157,0.67243
158,0.6092
159,0.53808
160,0.49461000000000005
161,0.43928999999999996
162,0.38792
163,0.3326
164,0.27728
165,0.22196
166,0.17059000000000002
167,0.14293
168,0.08365700000000001
169,0.020434
170,-0.098111
171,-0.31939
172,-0.43793999999999994
173,-0.58019
174,-0.61971
175,-0.73035
176,-0.75011
177,-0.7343
178,-0.7619600000000001
179,-0.8251799999999999
180,-0.8449399999999999
181,-0.89236
182,-0.93978
183,-0.9239700000000001
184,-0.97534
185,-1.0228
186,-1.0702
187,-1.1136
188,-1.1611
189,-1.2085
190,-1.2519
191,-1.2994
192,-1.2994
193,-1.3349
194,-1.3665
195,-1.3981
196,-1.4179
197,-1.4298
198,-1.3902
199,-1.327
200,-1.2717
201,-1.2361
202,-1.2164
203,-1.1532
204,-1.0386
205,-0.93978
206,-0.8449399999999999
207,-0.73825
208,-0.61971
209,-0.47745
210,-0.40238
211,-0.28778000000000004
212,-0.17319
213,-0.10601
214,-0.011178
215,0.059948
216,0.12712
217,0.19825
218,0.26938
219,0.3405
220,0.41163
221,0.46299999999999997
222,0.55784
223,0.56179
224,0.55388
225,0.6013
226,0.70009
227,0.76331
228,0.79888
229,0.8542
230,0.9371799999999999
231,1.0281
232,1.0439
233,1.0676
234,1.0676
235,1.0241
236,0.9490299999999999
237,0.86605
238,0.80283
239,0.77122
240,0.70404
241,0.64082
242,0.5696899999999999
243,0.50251
244,0.43138999999999994
245,0.36025999999999997
246,0.29309
247,0.22196
248,0.0639
249,-0.070451
250,-0.15738
251,-0.22851
252,-0.31149
253,-0.41028000000000003
254,-0.46165
255,-0.59205
256,-0.67108
257,-0.80938
258,-0.79357
259,-0.8647
260,-0.91607
261,-0.94768
262,-0.98324
263,-1.0504
264,-1.1453
265,-1.1215
266,-1.1097
267,-1.0978
268,-1.0899
269,-1.0781
270,-1.0662
271,-1.0544
272,-1.0149
273,-0.97139
274,-0.9239700000000001
275,-0.8568
276,-0.7580100000000001
277,-0.71454
278,-0.6671199999999999
279,-0.65132
280,-0.57229
281,-0.5051100000000001
282,-0.39052
283,-0.31939
284,-0.1969
285,-0.17319
286,-0.12577
287,-0.046742
288,0.020434
289,0.087609
290,0.17849
291,0.28123000000000004
292,0.28123000000000004
293,0.31679
294,0.44323999999999997
295,0.49856000000000006
296,0.47485
297,0.43138999999999994
298,0.3326
299,0.21406
300,0.14687999999999998
301,0.14293
302,0.14293
303,0.13898
304,0.13502999999999998
305,0.13502999999999998
306,0.13108
307,0.11527000000000001
308,0.055997000000000005
309,-0.011178
310,-0.08230499999999999
311,-0.16924
312,-0.30359
313,-0.44583999999999996
314,-0.53673
315,-0.6039
316,-0.68688
317,-0.75011
318,-0.81728
319,-0.88841
320,-0.9239700000000001
321,-0.98324
322,-0.99905
323,-1.0307
324,-1.0267
325,-1.0662
326,-1.0583
327,-0.9951
328,-0.88446
329,-0.81728
330,-0.7580100000000001
331,-0.63946
332,-0.56439
333,-0.48931
334,-0.41423000000000004
335,-0.33915
336,-0.26406999999999997
337,-0.18504
338,-0.10997
339,-0.026983999999999998
340,0.016482
341,0.087609
342,0.18244000000000002
343,0.21406
344,0.24961999999999998
345,0.30099000000000004
346,0.30494
347,0.32865
348,0.31679
349,0.30494
350,0.29309
351,0.28123000000000004
352,0.26938
353,0.25356999999999996
354,0.24172
355,0.17849
356,0.15478
357,0.040191000000000004
358,-0.034887
359,-0.12972
360,-0.22061
361,-0.26802
362,-0.35101
363,-0.4656
364,-0.53277
365,-0.60785
366,-0.66317
367,-0.71454
368,-0.76986
369,-0.8212299999999999
370,-0.87655
371,-0.9279200000000001
372,-0.94373
373,-0.9951
374,-1.0386
375,-1.0504
376,-1.0859999999999999
377,-1.0939
378,-1.0702
379,-1.0386
380,-0.94373
381,-0.9042100000000001
382,-0.8726
383,-0.80543
384,-0.7026899999999999
385,-0.62761
386,-0.55253
387,-0.4814
388,-0.40633
389,-0.33125
390,-0.26011999999999996
391,-0.2127
392,-0.15342999999999998
393,-0.13763
394,-0.09020800000000001
395,-0.098111
396,-0.086256
397,-0.09020800000000001
398,-0.086256
399,-0.11787
400,-0.14948
401,-0.17319
402,-0.27593
403,-0.27198
404,-0.26011999999999996
405,-0.2127
406,-0.24431999999999998
407,-0.20875
408,-0.16529000000000002
409,-0.14157999999999998
410,-0.058596
411,0.028337
412,0.10737000000000001
413,0.1864
414,0.25751999999999997
415,0.32865
416,0.36421
417,0.36025999999999997
418,0.37212
419,0.34841
420,0.29704
421,0.28913
422,0.22985999999999998
423,0.15874000000000002
424,0.020434
425,-0.042789999999999995
426,-0.15342999999999998
427,-0.33125
428,-0.48536
429,-0.56043
430,-0.64342
431,-0.71454
432,-0.76986
433,-0.82914
434,-0.89631
435,-0.93978
436,-1.0149
437,-1.082
438,-1.1769
439,-1.2282
440,-1.3112
441,-1.3468
442,-1.3468
443,-1.3981
444,-1.3744
445,-1.3705
446,-1.3033
447,-1.2717
448,-1.2638
449,-1.2559
450,-1.2006
451,-1.2124
452,-1.2124
453,-1.165
454,-1.1334
455,-1.0544
456,-1.0307
457,-0.97139
458,-0.9358299999999999
459,-0.88446
460,-0.82914
461,-0.79357
462,-0.78172
463,-0.68293
464,-0.62366
465,-0.56439
466,-0.5051100000000001
467,-0.43793999999999994
468,-0.33125
469,-0.23640999999999998
470,-0.16133
471,-0.078354
472,0.020434
473,0.040191000000000004
474,0.028337
475,0.040191000000000004
476,0.05204500000000001
477,0.067851
478,0.079706
479,0.09156
480,0.10340999999999999
481,0.14293
482,0.17849
483,0.22591
484,0.32865
485,0.47881
486,0.53017
487,0.58154
488,0.55388
489,0.5736399999999999
490,0.58154
491,0.5696899999999999
492,0.51042
493,0.42348
494,0.40768000000000004
495,0.36816
496,0.32075
497,0.27728
498,0.23776999999999998
499,0.20615
500,0.14293
501,0.14293
502,0.13502999999999998
503,0.11132
504,0.08365700000000001
505,0.028337
506,-0.015130000000000001
507,-0.038839
508,-0.078354
509,-0.11392000000000001
510,-0.15342999999999998
511,-0.18899999999999997
512,-0.22851
513,-0.26406999999999997
514,-0.35496
515,-0.38261999999999996
516,-0.41818
517,-0.48536
518,-0.63156
519,-0.6671199999999999
520,-0.71849
521,-0.7066399999999999
522,-0.6671199999999999
523,-0.7026899999999999
524,-0.67108
525,-0.66317
526,-0.58809
527,-0.5446300000000001
528,-0.56834
529,-0.6157600000000001
530,-0.6947800000000001
531,-0.78962
532,-0.9002600000000001
533,-1.0307
534,-1.0859999999999999
535,-1.1255
536,-1.1887
537,-1.3033
538,-1.3823
539,-1.4574
540,-1.5009
541,-1.5799
542,-1.6155
543,-1.6471
544,-1.7419
545,-1.7696
546,-1.8131
547,-1.821
548,-1.8763
549,-1.896
550,-1.9237
551,-1.9553
552,-1.9356
553,-1.9197
554,-1.9118
555,-1.8763
556,-1.8407
557,-1.8052
558,-1.7696
559,-1.734
560,-1.6945
561,-1.6827
562,-1.6906
563,-1.6906
564,-1.6748
565,-1.6629
566,-1.6392
567,-1.6392
568,-1.6273
569,-1.5602
570,-1.5127
571,-1.4495
572,-1.3626
573,-1.3073
574,-1.2203
575,-1.1532
576,-1.082
577,-0.98324
578,-0.93978
579,-0.8568
580,-0.89631
581,-0.97534
582,-0.9951
583,-0.97139
584,-0.8726
585,-0.77381
586,-0.60785
587,-0.5169699999999999
588,-0.43004
589,-0.40633
590,-0.35496
591,-0.38261999999999996
592,-0.45374
593,-0.55648
594,-0.63946
595,-0.74615
596,-0.89631
597,-0.99905
598,-1.169
599,-1.2796
600,-1.3586
601,-1.4416
602,-1.5009
603,-1.6115
604,-1.6708
605,-1.7103
606,-1.7419
607,-1.7182
608,-1.6906
609,-1.6589
610,-1.5602
611,-1.4851
612,-1.4061
613,-1.3586
614,-1.2203
615,-1.082
616,-1.0425
617,-0.9002600000000001
618,-0.80543
619,-0.73825
620,-0.58414
621,-0.5051100000000001
622,-0.35891
623,-0.28778000000000004
624,-0.19295
625,-0.094159
626,-0.015130000000000001
627,0.048094
628,0.12317
629,0.19825
630,0.20615
631,0.21800999999999998
632,0.22591
633,0.23381
634,0.24566999999999997
635,0.25356999999999996
636,0.29309
637,0.17454
638,0.13108
639,0.05204500000000001
640,-0.070451
641,-0.17714000000000002
642,-0.25617
643,-0.33125
644,-0.43004
645,-0.53277
646,-0.64342
647,-0.74615
648,-0.8488899999999999
649,-0.9081600000000001
650,-0.96744
651,-1.0228
652,-1.082
653,-1.1413
654,-1.1966
655,-1.2243
656,-1.2401
657,-1.2559
658,-1.2638
659,-1.2875
660,-1.3191
661,-1.2401
662,-1.2006
663,-1.2164
664,-1.082
665,-1.0623
666,-0.93978
667,-0.8647
668,-0.79752
669,-0.73035
670,-0.66317
671,-0.596
672,-0.52882
673,-0.46165
674,-0.40238
675,-0.30754000000000004
676,-0.22455999999999998
677,-0.12577
678,-0.011178
679,0.13108
680,0.2101
681,0.30494
682,0.32865
683,0.38001999999999997
684,0.4709
685,0.56179
686,0.5934
687,0.6210600000000001
688,0.66848
689,0.67638
690,0.7396
691,0.77122
692,0.87395
693,0.9332299999999999
694,0.9687899999999999
695,1.0044
696,0.98064
697,1.036
698,1.0399
699,1.0162
700,1.0162
701,1.0636
702,1.0913
703,1.1308
704,1.1822
705,1.2572
706,1.3521
707,1.4509
708,1.5299
709,1.5655
710,1.5813
711,1.5813
712,1.6208
713,1.6287
714,1.6405
715,1.6722
716,1.6801
717,1.6919
718,1.6840000000000002
719,1.6959
720,1.7038
721,1.6998
722,1.6959
723,1.6801
724,1.6880000000000002
725,1.6959
726,1.7117
727,1.7235
728,1.6919
729,1.6563
730,1.6089
731,1.5694
732,1.4904
733,1.4667
734,1.3797
735,1.3323
736,1.3363
737,1.3205
738,1.281
739,1.2217
740,1.194
741,1.1031
742,1.0913
743,1.0241
744,0.95694
745,0.87395
746,0.8107300000000001
747,0.73565
748,0.70404
749,0.6210600000000001
750,0.61711
751,0.64082
752,0.5736399999999999
753,0.6289600000000001
754,0.66848
755,0.70009
756,0.71985
757,0.79492
758,0.80283
759,0.8146800000000001
760,0.83839
761,0.87
762,0.92137
763,0.9411299999999999
764,0.97669
765,1.0004
766,1.0399
767,1.1071
768,1.1427
769,1.2256
770,1.2731
771,1.3797
772,1.4311
773,1.4667
774,1.5101
775,1.5734
776,1.6326
777,1.6603
778,1.7235
779,1.7591
780,1.8342
781,1.8579
782,1.9527
783,1.9764
784,2.0001
785,2.0238
786,2.0436
787,2.0673
788,2.0909999999999997
789,2.0673
790,2.0792
791,2.0989
792,2.0989
793,2.0831
794,2.0831
795,2.0871
796,2.1226
797,2.1503
798,2.1898
799,2.2649
800,2.4941
801,2.4941
802,2.4545
803,2.4466
804,2.4545
805,2.4704
806,2.4901
807,2.5099
808,2.5217
809,2.5296
810,2.5533
811,2.6245
812,2.6482
813,2.6916
814,2.7272
815,2.7035
816,2.6166
817,2.5454
818,2.502
819,2.4545
820,2.3874
821,2.3083
822,2.2649
823,2.2096
824,2.1503
825,2.095
826,2.0317
827,2.008
828,2.008
829,1.9883
830,1.9211
831,1.85
832,1.8026
833,1.6326
834,1.5773
835,1.4667
836,1.4351
837,1.4627
838,1.3797
839,1.3007
840,1.2177
841,1.1348
842,1.0518
843,0.9648399999999999
844,0.8818600000000001
845,0.79888
846,0.71985
847,0.67243
848,0.6289600000000001
849,0.6210600000000001
850,0.6289600000000001
851,0.60525
852,0.6250100000000001
853,0.55784
854,0.49461000000000005
855,0.38397
856,0.29704
857,0.1943
858,0.12317
859,0.10340999999999999
860,0.05204500000000001
861,0.016482
862,-0.050693
863,-0.22851
864,-0.23246
865,-0.3273
866,-0.35101
867,-0.35101
868,-0.31149
869,-0.36286
870,-0.35891
871,-0.39052
872,-0.39842
873,-0.43004
874,-0.43399
875,-0.43399
876,-0.4656
877,-0.50116
878,-0.49326000000000003
879,-0.46165
880,-0.44188999999999995
881,-0.43793999999999994
882,-0.41028000000000003
883,-0.40633
884,-0.36286
885,-0.3431
886,-0.33125
887,-0.33915
888,-0.29964
889,-0.28383
890,-0.28383
891,-0.24036
892,-0.17714000000000002
893,-0.11787
894,-0.10601
895,-0.070451
896,-0.034887
897,-0.023033
898,-0.019081
899,0.0046276
