time,value
0,-0.12111
1,-0.46813999999999995
2,-0.65545
3,-0.68329
4,-0.61165
5,-0.50657
6,-0.42413
7,-0.41348999999999997
8,-0.47386999999999996
9,-0.57702
10,-0.6592399999999999
11,-0.6751699999999999
12,-0.57527
13,-0.35785
14,-0.060196000000000006
15,0.26463000000000003
16,0.55753
17,0.76548
18,0.8578600000000001
19,0.83472
20,0.7229300000000001
21,0.57005
22,0.39894
23,0.23066
24,0.04974
25,-0.14396
26,-0.36198
27,-0.58892
28,-0.81477
29,-0.9852700000000001
30,-1.033
31,-0.94625
32,-0.71938
33,-0.3672
34,0.058991999999999996
35,0.49427
36,0.8910100000000001
37,1.1973
38,1.3812
39,1.4274
40,1.3535
41,1.159
42,0.8528600000000001
43,0.46079
44,0.0039893
45,-0.4743
46,-0.91655
47,-1.278
48,-1.51
49,-1.5939
50,-1.5313
51,-1.3612
52,-1.1262
53,-0.85531
54,-0.57343
55,-0.26882
56,0.054590999999999994
57,0.40794
58,0.7912399999999999
59,1.1740000000000002
60,1.5077
61,1.7307
62,1.8121
63,1.7358
64,1.4828
65,1.0974
66,0.6288199999999999
67,0.12582000000000002
68,-0.35848
69,-0.7824
70,-1.136
71,-1.3975
72,-1.5465
73,-1.5692
74,-1.4523
75,-1.1899
76,-0.79543
77,-0.30976
78,0.21005
79,0.69439
80,1.062
81,1.2775
82,1.3171
83,1.1998
84,0.9519200000000001
85,0.60534
86,0.21309
87,-0.18362
88,-0.51722
89,-0.75265
90,-0.88359
91,-0.9070299999999999
92,-0.8385
93,-0.7065899999999999
94,-0.56153
95,-0.41567
96,-0.27002
97,-0.12189000000000001
98,0.056748
99,0.2822
100,0.5481699999999999
101,0.8082600000000001
102,1.0042
103,1.0882
104,1.0106
105,0.7904
106,0.46687
107,0.098483
108,-0.22774
109,-0.44702
110,-0.52879
111,-0.49275
112,-0.38318
113,-0.26406999999999997
114,-0.18475999999999998
115,-0.17232999999999998
116,-0.22321
117,-0.31625
118,-0.42186999999999997
119,-0.51664
120,-0.5872
121,-0.61095
122,-0.5839
123,-0.4767
124,-0.28544
125,-9.109799999999999e-05
126,0.37690999999999997
127,0.8053600000000001
128,1.2156
129,1.5398
130,1.6915
131,1.6056
132,1.2839
133,0.77954
134,0.18206
135,-0.41223000000000004
136,-0.9037299999999999
137,-1.2306
138,-1.3849
139,-1.3936
140,-1.2974
141,-1.1581
142,-0.9917600000000001
143,-0.8214
144,-0.64468
145,-0.43672
146,-0.19623
147,0.06780800000000001
148,0.3532
149,0.62275
150,0.85085
151,1.0307
152,1.1465
153,1.192
154,1.1791
155,1.1105
156,0.97893
157,0.79278
158,0.5663
159,0.3089
160,0.021988999999999998
161,-0.25576
162,-0.48545
163,-0.65578
164,-0.75994
165,-0.7793800000000001
166,-0.74639
167,-0.6795399999999999
168,-0.60255
169,-0.53081
170,-0.47256000000000004
171,-0.42102
172,-0.35509
173,-0.27036
174,-0.14867
175,0.00098961
176,0.16452999999999998
177,0.31899
178,0.43095
179,0.47661000000000003
180,0.44583999999999996
181,0.34531
182,0.1976
183,0.049412
184,-0.068557
185,-0.11209000000000001
186,-0.068992
187,0.040225
188,0.18646
189,0.30831
190,0.34904
191,0.30049000000000003
192,0.16467
193,-0.027476999999999998
194,-0.22271999999999997
195,-0.36724
196,-0.4309
197,-0.40896
198,-0.30361
199,-0.15591
200,-0.0017888
201,0.13087000000000001
202,0.24827
203,0.35511
204,0.46143999999999996
205,0.56865
206,0.64883
207,0.67492
208,0.62758
209,0.47462
210,0.20583
211,-0.13621
212,-0.49931000000000003
213,-0.8245299999999999
214,-1.0476
215,-1.1416
216,-1.1116
217,-0.98159
218,-0.80492
219,-0.62321
220,-0.46063000000000004
221,-0.31683
222,-0.18432
223,-0.029084
224,0.18492999999999998
225,0.46188
226,0.79202
227,1.1265
228,1.4015
229,1.5495
230,1.5301
231,1.3362
232,0.98734
233,0.52359
234,0.0018544
235,-0.50889
236,-0.93494
237,-1.2338
238,-1.3904
239,-1.3959
240,-1.2726
241,-1.0557
242,-0.77253
243,-0.46643999999999997
244,-0.15724000000000002
245,0.13760999999999998
246,0.41978999999999994
247,0.67852
248,0.9062
249,1.0848
250,1.193
251,1.2208
252,1.1519
253,0.99692
254,0.7770699999999999
255,0.5023
256,0.20072
257,-0.11267
258,-0.42332
259,-0.73197
260,-1.0406
261,-1.3197
262,-1.5446
263,-1.6777
264,-1.6828
265,-1.5362
266,-1.2361
267,-0.79738
268,-0.2585
269,0.32186
270,0.8713
271,1.3239
272,1.6406
273,1.7822
274,1.7448
275,1.5523
276,1.2537
277,0.8896
278,0.5092399999999999
279,0.17052
280,-0.09727899999999999
281,-0.29698
282,-0.4294
283,-0.51647
284,-0.5876
285,-0.67079
286,-0.7803
287,-0.8961899999999999
288,-1.0006
289,-1.0358
290,-0.95939
291,-0.73611
292,-0.38456999999999997
293,0.070355
294,0.56479
295,1.0059
296,1.3396
297,1.507
298,1.4846
299,1.2698
300,0.9054200000000001
301,0.43917
302,-0.067938
303,-0.5701
304,-1.0142
305,-1.3482
306,-1.5416
307,-1.5655
308,-1.4238
309,-1.1552
310,-0.8065
311,-0.44203000000000003
312,-0.12368
313,0.10775
314,0.25971
315,0.35345
316,0.45245
317,0.61212
318,0.84454
319,1.1456
320,1.4602
321,1.7118
322,1.8129
323,1.723
324,1.4312
325,0.93406
326,0.30325
327,-0.3919
328,-1.0761
329,-1.6636
330,-2.0976
331,-2.3551
332,-2.4174
333,-2.2779
334,-1.9354
335,-1.4161
336,-0.7589
337,-0.027024
338,0.70631
339,1.3651
340,1.8714
341,2.1748
342,2.2633
343,2.1413
344,1.8374
345,1.4251
346,0.96405
347,0.47872
348,0.013241
349,-0.40966
350,-0.79086
351,-1.1198
352,-1.3937
353,-1.6039
354,-1.7364
355,-1.7712
356,-1.6952
357,-1.5082
358,-1.2001
359,-0.78488
360,-0.28115
361,0.26826
362,0.81666
363,1.3030000000000002
364,1.6696
365,1.8843
366,1.9538
367,1.8756
368,1.6762
369,1.3746
370,0.99866
371,0.5736899999999999
372,0.11432
373,-0.36451
374,-0.8370700000000001
375,-1.2754
376,-1.6585
377,-1.949
378,-2.1028
379,-2.0934
380,-1.9056
381,-1.5539
382,-1.0571
383,-0.46268000000000004
384,0.17248
385,0.7863600000000001
386,1.3281
387,1.7591
388,2.0416
389,2.1583
390,2.0997
391,1.896
392,1.5707
393,1.1694
394,0.74244
395,0.32464
396,-0.048047
397,-0.38266
398,-0.67488
399,-0.94878
400,-1.2168
401,-1.4861
402,-1.7395
403,-1.9380000000000002
404,-2.0329
405,-1.9684
406,-1.7248
407,-1.2890000000000001
408,-0.6987399999999999
409,-0.018915
410,0.67872
411,1.3033
412,1.8017
413,2.116
414,2.2366
415,2.1748
416,1.96
417,1.6213
418,1.1958
419,0.72126
420,0.22679000000000002
421,-0.26209
422,-0.73275
423,-1.1492
424,-1.4792
425,-1.7187
426,-1.8349
427,-1.8215
428,-1.6737
429,-1.403
430,-1.0413
431,-0.60863
432,-0.11797
433,0.39221
434,0.8992100000000001
435,1.3467
436,1.6923
437,1.8796
438,1.8653
439,1.6381
440,1.2228
441,0.6904
442,0.11925
443,-0.40598
444,-0.81347
445,-1.0511
446,-1.1225
447,-1.0529
448,-0.89512
449,-0.70508
450,-0.51389
451,-0.33326999999999996
452,-0.16934000000000002
453,-0.004007999999999999
454,0.1653
455,0.32394
456,0.43662
457,0.49015
458,0.47607
459,0.39498
460,0.27203
461,0.14365999999999998
462,0.053205999999999996
463,0.018885
464,0.036761
465,0.078066
466,0.11871
467,0.11070999999999999
468,0.042638999999999996
469,-0.076217
470,-0.21800999999999998
471,-0.34484000000000004
472,-0.42353999999999997
473,-0.42236
474,-0.36707
475,-0.27684000000000003
476,-0.17077
477,-0.068937
478,0.011447
479,0.068771
480,0.11662
481,0.13108
482,0.12125
483,0.08283
484,0.020291999999999998
485,-0.056567
486,-0.14057999999999998
487,-0.19165
488,-0.19607
489,-0.13677999999999998
490,-0.0035018000000000002
491,0.17800000000000002
492,0.35983000000000004
493,0.49746999999999997
494,0.5716600000000001
495,0.57123
496,0.5172800000000001
497,0.43056000000000005
498,0.3418
499,0.26743
