time,value
0,-0.039478
1,-0.42353999999999997
2,-0.21695
3,-0.23939000000000002
4,-0.25217
5,0.25922
6,-0.4607
7,-0.82773
8,0.00091956
9,0.14761
10,0.49413999999999997
11,-0.18713
12,-0.15345999999999999
13,0.3014
14,0.13126
15,-0.24456
16,-0.48415
17,-0.061676
18,0.20879
19,-0.2501
20,-0.6026199999999999
21,-0.38841
22,0.06807
23,0.079178
24,-0.46697
25,-0.51425
26,0.1932
27,-0.28765999999999997
28,-0.00068216
29,0.14505
30,-0.070984
31,-0.0073245
32,-0.1671
33,-0.04582
34,0.32342
35,-0.2339
36,-0.44228
37,0.21934
38,0.2507
39,-0.27088
40,0.26273
41,-0.39958
42,-0.15943
43,0.08002100000000001
44,0.13822
45,-0.5553899999999999
46,-0.27119
47,0.38548000000000004
48,0.035342
49,-0.6114
50,-0.7722100000000001
51,0.075509
52,0.21335
53,1.6352
54,1.6352
55,1.6352
56,1.6352
57,1.6352
58,1.6352
59,1.6352
60,1.6352
61,1.6352
62,-1.7058
63,-1.7058
64,-1.7058
65,-1.7058
66,-1.7058
67,-1.7058
68,-1.7058
69,-1.7058
70,0.06080599999999999
71,0.17755
72,0.16155
73,0.44768
74,0.17840999999999999
75,0.45825
76,0.30334
77,-0.24084
78,0.16197
79,-0.20203
80,0.36424
81,-0.38025
82,0.22641
83,0.7125199999999999
84,-0.19969
85,-0.48418
86,0.4933
87,0.68887
88,-0.23064
89,0.8567799999999999
90,0.322
91,0.13008
92,0.16176
93,1.6352
94,1.6352
95,1.6352
96,1.6352
97,1.6352
98,1.6352
99,1.6352
100,1.6352
101,1.6352
102,1.6352
103,1.6352
104,1.6352
105,1.6352
106,-1.7058
107,-1.7058
108,-1.7058
109,-1.7058
110,-1.7058
111,-1.7058
112,-1.7058
113,-1.7058
114,-1.7058
115,-1.7058
116,-1.7058
117,-1.7058
118,0.29093
119,-0.40431999999999996
120,0.12307
121,0.38841
122,0.028168000000000002
123,0.083328
124,-0.048063999999999996
125,-0.26879000000000003
126,0.31618
127,-0.43926000000000004
