time,value
0,-1.1821
1,-1.1821
2,-1.1821
3,-1.1821
4,-1.1821
5,-1.1821
6,-1.1821
7,-1.1821
8,-1.1821
9,-1.1821
10,-1.1821
11,-1.1821
12,-1.1821
13,-1.1821
14,-1.1821
15,-1.1821
16,-1.1821
17,-1.1821
18,-1.1821
19,-1.1861
20,-1.1957
21,-1.2321
22,-1.2685
23,-1.3049
24,-1.3412
25,-1.3559
26,-1.3606
27,-1.3606
28,-1.3606
29,-1.3606
30,-1.3606
31,-1.3606
32,-1.3606
33,-1.3606
34,-1.3606
35,-1.3606
36,-1.3606
37,-1.3606
38,-1.3606
39,-1.3606
40,-1.3606
41,-1.3606
42,-1.3606
43,-1.3606
44,-1.3606
45,-1.3606
46,-1.3606
47,-1.3606
48,-1.3606
49,-1.3606
50,-1.3606
51,-1.3606
52,-1.3606
53,-1.3606
54,-1.3606
55,-1.3606
56,-1.3606
57,-1.3606
58,-1.3606
59,-1.3343
60,-1.2787
61,-1.2059
62,-1.1332
63,-1.0604
64,-0.98764
65,-0.9148700000000001
66,-0.8421
67,-0.7693300000000001
68,-0.6965600000000001
69,-0.60816
70,-0.50327
71,-0.39411
72,-0.28496
73,-0.1758
74,-0.32936
75,0.21641
76,0.15166
77,0.26081
78,0.36996999999999997
79,0.46093
80,0.5337
81,0.60647
82,0.67924
83,0.74308
84,0.77491
85,0.78157
86,0.78157
87,0.78157
88,0.77305
89,0.73154
90,0.65877
91,0.586
92,0.51323
93,0.44046
94,0.36769
95,0.29491999999999996
96,0.22215
97,0.14937999999999999
98,0.34396
99,-0.13607
100,-0.13714
101,-0.2463
102,-0.35545
103,-0.46461
104,-0.57376
105,-0.68292
106,-0.7920699999999999
107,-0.90122
108,-0.99735
109,-1.0809
110,-1.1536
111,-1.2264
112,-1.2992
113,-1.3468
114,-1.3173
115,-1.2821
116,-1.2457
117,-1.2094
118,-1.1554
119,-1.0911
120,-1.0183
121,-0.94557
122,-0.87125
123,-0.78752
124,-0.67837
125,-0.56921
126,-0.46006
127,-0.35091
128,-0.24175
129,-0.1326
130,-0.11333
131,0.43244
132,0.19015
133,0.28469
134,0.35746
135,0.43023
136,0.503
137,0.57577
138,0.64854
139,0.72131
140,0.79408
141,0.8668399999999999
142,0.91574
143,0.9339299999999999
144,0.89754
145,0.86116
146,0.8247700000000001
147,0.7883899999999999
148,0.72046
149,0.64967
150,0.5769
151,0.5041399999999999
152,0.40879
153,0.29265
154,0.14711
155,0.083813
156,-0.14397000000000001
157,-0.28951
158,-0.47143
159,-0.65335
160,-0.8352799999999999
161,-1.0172
162,-1.1256
163,-1.1821
164,-1.1821
165,-1.1821
166,-1.1761
167,-1.1616
168,-1.0524
169,-0.94329
170,-0.83414
171,-0.7249899999999999
172,-0.59764
173,-0.46006
174,-0.31451999999999997
175,-0.16898
176,-0.093066
177,0.13574
178,0.31766
179,0.49959
180,0.6815100000000001
181,0.8634299999999999
182,1.0018
183,1.1204
184,1.2296
185,1.3387
186,1.4355
187,1.5161
188,1.5525
189,1.5889
190,1.6252
191,1.6616
192,1.6726
193,1.6741
194,1.6741
195,1.6741
196,1.6657
197,1.6468
198,1.6105
199,1.5741
200,1.5377
201,1.5013
202,1.4649
203,1.4285
204,1.3921
205,1.3558
206,1.3409
207,1.3512
208,1.3876
209,1.4240000000000002
210,1.4604
211,1.4968
212,1.5331
213,1.5695
214,1.6059
215,1.6423
216,1.6787
217,1.7151
218,1.7514
219,1.7878
220,1.8197
221,1.8333
222,1.8083
223,1.7719
224,1.7355
225,1.6991
226,1.6471
227,1.5786
228,1.5059
229,1.4331
230,1.3636
231,1.3068
232,1.2659
233,1.2296
234,1.1932
235,1.1568
236,1.1204
237,1.084
238,1.0476
239,1.0112
240,0.9748600000000001
241,0.93848
242,0.90209
243,0.8657100000000001
244,0.8293200000000001
245,0.78868
246,0.73154
247,0.65877
248,0.586
249,0.51323
250,0.45183
251,0.42908999999999997
252,0.42454
253,0.42454
254,0.42454
255,0.41594
256,0.39271
257,0.35631999999999997
258,0.31994
259,0.28355
260,0.25416
261,0.24733000000000002
262,0.24603000000000003
263,0.24603000000000003
264,0.24603000000000003
265,0.24603000000000003
266,0.24603000000000003
267,0.24603000000000003
268,0.24603000000000003
269,0.24603000000000003
270,0.2544
271,0.28851
272,0.32449
273,0.36086999999999997
274,0.39725
275,0.41611000000000004
276,0.42454
277,0.42454
278,0.42454
279,0.42299
280,0.41203999999999996
281,0.37565
282,0.33926999999999996
283,0.30288000000000004
284,0.2665
285,0.25223
286,0.24603000000000003
287,0.24603000000000003
288,0.24603000000000003
289,0.24131999999999998
290,0.2267
291,0.19032000000000002
292,0.15392999999999998
293,0.11755
294,0.4097
295,0.093818
296,-0.24977
297,-0.1235
298,-0.19627
299,-0.26108000000000003
300,-0.31566
301,-0.35204
302,-0.38843
303,-0.42481
304,-0.4612
305,-0.46603
306,-0.46802
307,-0.46802
308,-0.46802
309,-0.47931
310,-0.5009899999999999
311,-0.53738
312,-0.57376
313,-0.61015
314,-0.64653
315,-1.5539
316,-1.5539
317,-1.5539
318,-1.5539
319,-1.5539
320,-1.5539
321,-1.5539
322,-1.5539
323,-1.5539
324,-1.5539
325,-1.5539
326,-1.5539
327,-1.5539
328,-1.5539
329,-1.5539
330,-1.5539
331,-1.5539
332,-1.5539
333,-1.5539
334,-1.5539
335,-1.5539
336,-1.5539
337,-1.5539
338,-1.5539
339,-1.5539
340,-1.5539
341,-1.5539
342,-1.5539
343,-1.5539
344,-1.5539
345,-1.5539
346,-1.5539
347,-1.5539
348,-1.5539
349,-1.5539
350,-1.5539
351,-1.5539
352,-1.5539
353,-1.5539
354,-1.5539
355,-1.5539
356,-1.5539
357,-1.5539
358,-1.5539
359,-1.5539
360,-1.5539
361,-1.5539
362,-1.5539
363,-1.5539
364,-1.5539
365,-1.5539
366,-1.5539
367,-1.5539
368,-1.5539
369,-1.5539
370,-1.5539
371,-1.5539
372,-1.5539
373,-1.5539
374,-1.5429
375,-1.5196
376,-1.4891
377,-1.4586
378,-1.4281
379,-1.3976
380,-1.367
381,-1.3365
382,-1.306
383,-1.2755
384,-1.2384
385,-1.1945
386,-1.1487
387,-1.1029
388,-1.0571
389,-1.0114
390,-0.9656100000000001
391,-0.91984
392,-0.87408
393,-0.82831
394,-0.79779
395,-0.78254
396,-0.7672800000000001
397,-0.75203
398,-0.7349
399,-0.71106
400,-0.68194
401,-0.6514300000000001
402,-0.62092
403,-0.5939800000000001
404,-0.58087
405,-0.58087
406,-0.58087
407,-0.58087
408,-0.57849
409,-0.568
410,-0.5537
411,-0.5384399999999999
412,-0.52318
413,-0.51153
414,-0.50602
415,-0.50602
416,-0.50602
417,-0.50602
418,-0.50602
419,-0.50602
420,-0.50602
421,-0.50602
422,-0.50602
423,-0.50056
424,-0.48981
425,-0.47456000000000004
426,-0.4593
427,-0.44404
428,-0.4323
429,-0.43133999999999995
430,-0.43117
431,-0.43117
432,-0.43117
433,-0.40912
434,-0.37396
435,-0.32819
436,-0.28242
437,-0.23731
438,-0.19613
439,-0.16562000000000002
440,-0.13510999999999998
441,-0.1046
442,-0.36653
443,-0.26034
444,-0.17106
445,-0.094777
446,-0.1178
447,0.077549
448,0.21511
449,0.44396
450,0.13377999999999998
451,0.17955
452,0.22532
453,0.24861999999999998
454,0.26727
455,0.28253
456,0.29778000000000004
457,0.31304
458,0.3283
459,0.34355
460,0.35881
461,0.37406999999999996
462,0.38932
463,0.39135
464,0.39218000000000003
465,0.39218000000000003
466,0.39218000000000003
467,0.38745
468,0.37836
469,0.3631
470,0.34784
471,0.33259
472,0.31733
473,0.30208
474,0.28681999999999996
475,0.27155999999999997
476,0.25631
477,0.25338
478,0.25916999999999996
479,0.27442
480,0.28968
481,0.30577
482,0.32305
483,0.35357
484,0.38408000000000003
485,0.41458999999999996
486,0.4451
487,0.47561000000000003
488,0.50613
489,0.53664
490,0.56715
491,0.5976600000000001
492,0.6281800000000001
493,0.65869
494,0.6892
495,0.7197100000000001
496,0.75022
497,0.78074
498,0.81125
499,0.8417600000000001
500,0.8722700000000001
501,0.9001899999999999
502,0.9247200000000001
503,0.9399700000000001
504,0.9552299999999999
505,0.97049
506,0.98574
507,1.001
508,1.0163
509,1.0315
510,1.0468
511,1.0585
512,1.0658
513,1.0658
514,1.0658
515,1.0658
516,1.0658
517,1.0658
518,1.0658
519,1.0658
520,1.0658
521,1.0703
522,1.0801
523,1.0954
524,1.1107
525,1.1265
526,1.1446
527,1.1722
528,1.2027
529,1.2332
530,1.2637
531,1.2832
532,1.2904
533,1.2904
534,1.2904
535,1.2904
536,1.2904
537,1.2904
538,1.2904
539,1.2904
540,1.2904
541,1.2838
542,1.2704
543,1.2551
544,1.2399
545,1.2246
546,1.2093
547,1.1941
548,1.1788
549,1.1636
550,1.1483
551,1.1331
552,1.1178
553,1.1025
554,1.0873
555,1.072
556,1.0568
557,1.0415
558,1.0263
559,1.011
560,0.99575
561,0.9805
562,0.96524
563,0.9499799999999999
564,0.93473
565,0.9194700000000001
566,0.90422
567,0.8889600000000001
568,0.8737
569,0.85845
570,0.8468
571,0.84129
572,0.84129
573,0.84129
574,0.84129
575,0.84129
576,0.84129
577,0.84129
578,0.84129
579,0.84129
580,0.84129
581,0.84129
582,0.84129
583,0.84129
584,0.84129
585,0.8448
586,0.8591
587,0.87418
588,0.88944
589,0.90469
590,0.90525
591,0.8970600000000001
592,0.88181
593,0.86655
594,0.85195
595,0.84129
596,0.84129
597,0.84129
598,0.84129
599,0.84129
600,0.83201
601,0.81935
602,0.8041
603,0.78884
604,0.77359
605,0.7583300000000001
606,0.74307
607,0.72782
608,0.7125600000000001
609,0.6973
610,0.67081
611,0.642
612,0.61149
613,0.58098
614,0.5538
615,0.53092
616,0.51566
617,0.50041
618,0.48515
619,0.46989
620,0.45464
621,0.43938
622,0.42412
623,0.40886999999999996
624,0.39361
625,0.37836
626,0.3631
627,0.34784
628,0.33259
629,0.31733
630,-1.3898
631,-1.3898
632,-1.3898
633,-1.3898
634,-1.3898
635,-1.3898
636,-1.3898
637,-1.3898
638,-1.3898
639,-1.3898
640,-1.3898
641,-1.3898
642,-1.3898
643,-1.3898
644,-1.3898
645,-1.3898
646,-1.3898
647,-1.3898
648,-1.3898
649,-1.3898
650,-1.3898
651,-1.3898
652,-1.3898
653,-1.3898
654,-1.3898
655,-1.3898
656,-1.3898
657,-1.3898
658,-1.3898
659,-1.3898
660,-1.3898
661,-1.3898
662,-1.3898
663,-1.3898
664,-1.3898
665,-1.3898
666,-1.3898
667,-1.3898
668,-1.3898
669,-1.3927
670,-1.3993
671,-1.4121
672,-1.4248
673,-1.4374
674,-1.4494
675,-1.4523
676,-1.4523
677,-1.4523
678,-1.4523
679,-1.4523
680,-1.4523
681,-1.4523
682,-1.4523
683,-1.4523
684,-1.4523
685,-1.4523
686,-1.4523
687,-1.4523
688,-1.4523
689,-1.4615
690,-1.4809999999999999
691,-1.5065
692,-1.5319999999999998
693,-1.5558
694,-1.5734
695,-1.5774
696,-1.5774
697,-1.5774
698,-1.5774
699,-1.5719
700,-1.5606
701,-1.5479
702,-1.5351
703,-1.5212
704,-1.5029
705,-1.479
706,-1.4535
707,-1.4280000000000002
708,-1.4025
709,-1.3769999999999998
710,-1.3515
711,-1.3261
712,-1.3006
713,-1.2751
714,-1.2496
715,-1.2241
716,-1.1986
717,-1.1731
718,-1.1461
719,-1.1134
720,-1.0751
721,-1.0369
722,-0.9986799999999999
723,-0.9584600000000001
724,-0.9114700000000001
725,-0.86129
726,-0.8103100000000001
727,-0.7593300000000001
728,-0.70835
729,-0.65738
730,-0.6064
731,-0.55542
732,-0.50445
733,-0.45592
734,-0.4153
735,-0.37661
736,-0.33837
737,-0.30014
738,-0.25735
739,-0.21013
740,-0.15916
741,-0.10818
742,-0.28213
743,-0.056572000000000004
744,0.078835
745,0.20773000000000003
746,0.33516999999999997
747,0.46261
748,0.10495
749,0.11085999999999999
750,0.11085999999999999
751,0.11085999999999999
752,0.11195
753,0.11962
754,0.14511
755,0.1706
756,0.19609000000000001
757,0.22158000000000003
758,0.24706999999999998
759,0.27255
760,0.29804
761,0.32353000000000004
762,0.34736999999999996
763,0.36774
764,0.38048000000000004
765,0.39323
766,0.40597
767,0.41871
768,0.41268999999999995
769,0.40278
770,0.39004
771,0.3773
772,0.37013
773,0.37013
774,0.38287
775,0.39561999999999997
776,0.40836
777,0.4211
778,0.45595
779,0.49278999999999995
780,0.5310199999999999
781,0.56926
782,0.60749
783,0.64572
784,0.68395
785,0.72219
786,0.76042
787,0.79865
788,0.8114
789,0.82414
790,0.83688
791,0.8496299999999999
792,0.85208
793,0.84724
794,0.83449
795,0.82175
796,0.81109
797,0.80343
798,0.8289200000000001
799,0.85441
800,0.8799
801,0.9053899999999999
802,0.9436200000000001
803,0.9890200000000001
804,1.04
805,1.091
806,1.1405
807,1.1881
808,1.2264
809,1.2646
810,1.3028
811,1.3411
812,1.3717
813,1.3988
814,1.4243
815,1.4498
816,1.4731
817,1.4936
818,1.5064
819,1.5191
820,1.5318
821,1.5446
822,1.5217
823,1.4856
824,1.4474
825,1.4092
826,1.368
827,1.3232
828,1.2722
829,1.2212
830,1.1704
831,1.1202
832,1.079
833,1.0408
834,1.0026
835,0.9643299999999999
836,0.92986
837,0.89981
838,0.8743200000000001
839,0.84883
840,0.8238
841,0.8007
842,0.78551
843,0.77277
844,0.76002
845,0.74728
846,0.7391399999999999
847,0.7361300000000001
848,0.7361300000000001
849,0.7361300000000001
850,0.7377199999999999
851,0.74568
852,0.7671899999999999
853,0.79268
854,0.81817
855,0.8436600000000001
856,0.86367
857,0.8779
858,0.89065
859,0.9033899999999999
860,0.9173
861,0.9356200000000001
862,0.95955
863,0.9850399999999999
864,1.0105
865,1.036
866,1.0424
867,1.0296
868,1.0169
869,1.0042
870,0.9898399999999999
871,0.96993
872,0.9456100000000001
873,0.92012
874,0.8946299999999999
875,0.8691399999999999
876,0.8436600000000001
877,0.81817
878,0.79268
879,0.7671899999999999
880,0.7397100000000001
881,0.7054600000000001
882,0.66802
883,0.62979
884,0.5915600000000001
885,0.5623600000000001
886,0.54855
887,0.54855
888,0.54855
889,0.54855
890,0.55099
891,0.56135
892,0.5736399999999999
893,0.58638
894,0.59913
895,0.60731
896,0.61107
897,0.61107
898,0.61107
899,0.61107
900,0.60814
901,0.59619
902,0.5835899999999999
903,0.57085
904,0.5581
905,0.5453600000000001
906,0.53262
907,0.5198699999999999
908,0.50713
909,0.49546999999999997
910,0.4904
911,0.5031399999999999
912,0.51589
913,0.52863
914,0.54138
915,0.54637
916,0.54855
917,0.54855
918,0.54855
919,0.54524
920,0.53501
921,0.50952
922,0.48403
923,0.45853999999999995
924,0.43305
925,0.41695
926,0.40278
927,0.39004
928,0.3773
929,0.36455
930,0.35181
931,0.33906
932,0.32632
933,0.31356999999999996
934,0.30083000000000004
935,0.28809
936,0.27534000000000003
937,0.2626
938,0.24985
939,0.23711
940,0.22436
941,0.21161999999999997
942,0.19888
943,0.18613
944,0.17339000000000002
