time,value
0,1.818
1,1.6632
2,1.4512
3,1.3981
4,1.195
5,1.1228
6,0.95065
7,0.75052
8,0.57652
9,0.65766
10,0.54628
11,0.37449
12,0.16330999999999998
13,-0.030298000000000002
14,-0.26377
15,-0.39329000000000003
16,-0.19058
17,-0.087103
18,-0.09930599999999999
19,-0.25648000000000004
20,-0.42454
21,-0.6266
22,-0.9091799999999999
23,-1.1274
24,-1.3881
25,-1.625
26,-1.6118
27,-1.4005
28,-1.2283
29,-1.0546
30,-0.9354899999999999
31,-1.0314
32,-1.1061
33,-1.2489
34,-1.3984
35,-1.5522
36,-1.381
37,-1.1578
38,-1.0437
39,-1.0094
40,-0.9965700000000001
41,-0.98014
42,-0.99731
43,-0.8562
44,-0.71324
45,-0.56876
46,-0.43099
47,-0.26591
48,-0.14917
49,-0.08127100000000001
50,0.025727
51,0.13746
52,0.12972999999999998
53,0.13746
54,0.28851
55,0.50669
56,0.72302
57,0.9419799999999999
58,1.1645
59,1.3507
60,1.5709
61,1.7994
62,2.0297
63,2.2418
64,2.2786
65,2.0585
66,1.8359
67,1.6168
68,1.3981
69,1.2105
70,0.99284
71,0.77704
72,0.5597300000000001
73,0.34468000000000004
74,0.16116
75,0.29513
76,0.29041999999999996
77,0.2705
78,0.23686999999999997
79,0.14117000000000002
80,0.030374
81,-0.076116
82,-0.1673
83,-0.28629
84,-0.38731
85,-0.57763
86,-0.7267899999999999
87,-0.8243299999999999
88,-0.85116
89,-0.88089
90,-0.93096
91,-1.0144
92,-0.98674
93,-1.1258
94,-1.2993
95,-1.4686
96,-1.3408
97,-1.2429
98,-1.1497
99,-1.0344
100,-0.96919
101,-0.90143
102,-0.96652
103,-0.71645
104,-0.4873
105,-0.344
106,-0.19543
107,-0.08177100000000001
108,-0.21913000000000002
109,-0.37112
110,-0.5233300000000001
111,-0.39179
112,-0.14457
113,0.072504
114,0.29041999999999996
115,0.42695
116,0.56895
117,0.46063999999999994
118,0.43076000000000003
119,0.6451
120,0.82183
121,1.0062
122,0.99718
123,1.1674
124,1.3657
125,1.4361
126,1.6122
127,1.7883
