time,value
0,-0.43388000000000004
1,-0.43388000000000004
2,-0.43388000000000004
3,-0.43388000000000004
4,-0.43388000000000004
5,-0.43388000000000004
6,-0.43388000000000004
7,-0.43388000000000004
8,-0.43388000000000004
9,-0.43388000000000004
10,-0.43388000000000004
11,-0.43388000000000004
12,-0.43388000000000004
13,-0.43388000000000004
14,-0.43388000000000004
15,-0.43388000000000004
16,-0.43388000000000004
17,-0.43388000000000004
18,-0.43388000000000004
19,-0.43388000000000004
20,-0.43388000000000004
21,-0.43388000000000004
22,-0.43388000000000004
23,-0.43388000000000004
24,-0.43388000000000004
25,-0.43388000000000004
26,-0.43388000000000004
27,-0.43388000000000004
28,-0.43388000000000004
29,-0.43388000000000004
30,-0.43388000000000004
31,-0.43388000000000004
32,-0.43388000000000004
33,-0.43388000000000004
34,-0.43388000000000004
35,-0.43388000000000004
36,-0.43388000000000004
37,-0.43388000000000004
38,-0.43388000000000004
39,-0.43388000000000004
40,-0.43388000000000004
41,-0.43388000000000004
42,-0.43388000000000004
43,-0.43388000000000004
44,-0.43388000000000004
45,-0.43388000000000004
46,-0.43388000000000004
47,-0.43388000000000004
48,-0.43388000000000004
49,-0.43388000000000004
50,-0.43388000000000004
51,-0.43388000000000004
52,-0.50818
53,-0.5982
54,-0.70598
55,-0.81375
56,-0.92153
57,-1.0293
58,-1.1371
59,-1.2449
60,-1.3526
61,-1.4604
62,-1.5682
63,-1.676
64,-1.7837
65,-1.8915
66,-1.9993
67,-2.0295
68,-1.9783
69,-1.8739
70,-1.7661
71,-1.6583
72,-1.5505
73,-1.4427
74,-1.335
75,-1.2272
76,-1.1194
77,-1.0116
78,-0.90386
79,-0.79609
80,-0.6883100000000001
81,-0.58053
82,-0.47436000000000006
83,-0.44785
84,-0.43388000000000004
85,-0.43388000000000004
86,-0.43388000000000004
87,-0.43388000000000004
88,-0.43388000000000004
89,-0.43388000000000004
90,-0.43388000000000004
91,-0.43388000000000004
92,-0.43388000000000004
93,-0.43388000000000004
94,-0.43388000000000004
95,-0.43388000000000004
96,-0.43388000000000004
97,-0.43388000000000004
98,-0.4797
99,-0.56286
100,-0.67064
101,-0.77842
102,-0.8861899999999999
103,-0.99397
104,-1.1017
105,-1.2095
106,-1.3173
107,-1.4184
108,-1.5014
109,-1.4463
110,-1.3385
111,-1.2307
112,-1.1229
113,-1.0223
114,-0.99931
115,-0.98867
116,-0.98867
117,-0.98867
118,-0.98867
119,-0.98867
120,-0.98867
121,-0.98867
122,-0.98867
123,-0.98867
124,-0.98867
125,-0.98867
126,-0.98867
127,-0.98867
128,-0.98867
129,-0.98867
130,-0.98867
131,-0.98867
132,-0.98867
133,-0.98867
134,-0.98867
135,-0.98867
136,-0.98867
137,-0.98867
138,-0.98867
139,-0.98867
140,-0.98867
141,-0.98867
142,-0.98867
143,-0.98867
144,-0.98867
145,-0.98867
146,-0.98867
147,-0.98867
148,-0.98867
149,-0.98867
150,-0.98867
151,-0.98867
152,-0.98867
153,-0.98867
154,-0.97335
155,-0.9268299999999999
156,-0.81905
157,-0.71128
158,-0.6035
159,-0.49572
160,-0.4492
161,-0.43388000000000004
162,-0.43388000000000004
163,-0.43388000000000004
164,-0.43388000000000004
165,-0.43388000000000004
166,-0.43388000000000004
167,-0.43388000000000004
168,-0.43388000000000004
169,-0.43388000000000004
170,-0.43388000000000004
171,-0.43388000000000004
172,-0.43388000000000004
173,-0.43388000000000004
174,-0.43388000000000004
175,-0.43388000000000004
176,-0.43388000000000004
177,-0.43388000000000004
178,-0.43388000000000004
179,-0.43388000000000004
180,-0.43388000000000004
181,-0.43388000000000004
182,-0.43388000000000004
183,-0.43388000000000004
184,-0.43388000000000004
185,-0.3944
186,-0.28547
187,-0.34765999999999997
188,0.14564000000000002
189,0.36119
190,0.5767399999999999
191,0.65299
192,0.67569
193,0.67569
194,0.67569
195,0.68172
196,0.74002
197,0.8258700000000001
198,0.93365
199,1.0414
200,1.1279
201,1.1898
202,1.0962
203,0.9884200000000001
204,0.88064
205,0.77286
206,0.6914100000000001
207,0.67904
208,0.67569
209,0.67569
210,0.67569
211,0.67569
212,0.67569
213,0.67569
214,0.67569
215,0.67569
216,0.67569
217,0.67569
218,0.67569
219,0.67569
220,0.67569
221,0.67569
222,0.7541899999999999
223,0.85414
224,0.9619200000000001
225,1.0697
226,1.1568
227,1.1409
228,1.0679
229,0.96015
230,0.8523700000000001
231,0.75856
232,0.67729
233,0.67569
234,0.67569
235,0.67569
236,0.67569
237,0.67569
238,0.67569
239,0.67569
240,0.67569
241,0.67569
242,0.67569
243,0.67569
244,0.67569
245,0.67569
246,0.6773600000000001
247,0.70563
248,0.77463
249,0.88241
250,0.99018
251,1.0979999999999999
252,1.2057
253,1.2257
254,1.2305
255,1.2305
256,1.2305
257,1.2305
258,1.2305
259,1.2305
260,1.2305
261,1.2305
262,1.2305
263,1.2305
264,1.2305
265,1.2305
266,1.2305
267,1.2305
268,1.2305
269,1.2305
270,1.2305
271,1.2305
272,1.2305
273,1.2305
274,1.2305
275,1.2305
276,1.2305
277,1.2344
278,1.2662
279,1.3418
280,1.4496
281,1.5573
282,1.6651
283,1.7729
284,1.7831
285,1.7853
286,1.7853
287,1.7853
288,1.7853
289,1.7853
290,1.7853
291,1.7853
292,1.7853
293,1.7853
294,1.7853
295,1.7853
296,1.7853
297,1.7853
298,1.7853
299,1.7853
300,1.7853
301,1.7853
302,1.7853
303,1.7853
304,1.7268
305,1.6457
306,1.5379
307,1.4301
308,1.329
309,1.2565
310,1.2305
311,1.2305
312,1.2305
313,1.2305
314,1.2305
315,0.93604
316,0.93604
317,0.93604
318,0.93604
319,0.93604
320,0.93604
321,0.93604
322,0.93604
323,0.93604
324,0.93604
325,0.93604
326,0.93604
327,0.93604
328,0.93604
329,0.93604
330,0.93604
331,0.93604
332,0.93604
333,0.93604
334,0.93604
335,0.93604
336,0.93604
337,0.93604
338,0.93604
339,0.93604
340,0.93604
341,0.93604
342,0.93604
343,0.93604
344,0.93604
345,0.93604
346,0.93604
347,0.93604
348,0.93604
349,0.93604
350,0.93604
351,0.93604
352,0.93604
353,0.93604
354,0.93604
355,0.93604
356,0.93604
357,0.93604
358,0.93604
359,0.93604
360,0.93604
361,0.93604
362,0.93604
363,0.93604
364,0.93604
365,0.93604
366,0.93604
367,0.94614
368,0.95836
369,0.973
370,0.98764
371,1.0023
372,1.0169
373,1.0316
374,1.0462
375,1.0608
376,1.0755
377,1.0901
378,1.1048
379,1.1194
380,1.1340000000000001
381,1.1487
382,1.1686
383,1.194
384,1.2231
385,1.2524
386,1.2816
387,1.3008
388,1.3128
389,1.3128
390,1.3128
391,1.3128
392,1.3128
393,1.3128
394,1.3128
395,1.3128
396,1.3128
397,1.3126
398,1.3016
399,1.2888
400,1.2742
401,1.2596
402,1.2449
403,1.2303
404,1.2156
405,1.2009999999999998
406,1.1864
407,1.1717
408,1.1571
409,1.1424
410,1.1278
411,1.1132
412,1.0985
413,1.0839
414,1.0692
415,1.0546
416,1.04
417,1.0253
418,1.0166
419,1.0114
420,1.0114
421,1.0114
422,1.0109
423,1.0093
424,0.9982
425,0.98356
426,0.9689200000000001
427,0.9542799999999999
428,0.9396399999999999
429,0.925
430,0.9103600000000001
431,0.8957200000000001
432,0.88108
433,0.86644
434,0.8518
435,0.83716
436,0.82252
437,0.80788
438,0.79324
439,0.7786
440,0.7639600000000001
441,0.74932
442,0.73468
443,0.72004
444,0.71265
445,0.70996
446,0.70996
447,0.70996
448,0.70996
449,0.70318
450,0.69293
451,0.67829
452,0.66365
453,0.64828
454,0.63148
455,0.60485
456,0.57557
457,0.5462899999999999
458,0.5170100000000001
459,0.48773
460,0.45845
461,0.42917
462,0.39989
463,0.37061
464,0.34498
465,0.3229
466,0.30796999999999997
467,0.29333000000000004
468,0.27869
469,0.26405
470,0.24941
471,0.23476999999999998
472,0.22013000000000002
473,0.20549
474,0.19085
475,0.17620999999999998
476,0.16157
477,0.14693
478,0.13229000000000002
479,0.11765
480,0.10300999999999999
481,0.44377
482,0.37056999999999995
483,0.29736999999999997
484,0.21891
485,0.13251
486,-0.22766
487,-0.15142
488,-0.29782
489,-0.44422
490,-0.12115
491,-0.16291
492,-0.20611
493,-0.25003000000000003
494,-0.29395
495,-0.33348
496,-0.36955
497,-0.39883
498,-0.42811000000000005
499,-0.45738999999999996
500,-0.48667
501,-0.51595
502,-0.54523
503,-0.5745100000000001
504,-0.6037899999999999
505,-0.63307
506,-0.65289
507,-0.6690699999999999
508,-0.68371
509,-0.69835
510,-0.71217
511,-0.7188899999999999
512,-0.72187
513,-0.72187
514,-0.72187
515,-0.72331
516,-0.72643
517,-0.74011
518,-0.75475
519,-0.76939
520,-0.78403
521,-0.79867
522,-0.8133100000000001
523,-0.82795
524,-0.84259
525,-0.8572299999999999
526,-0.87187
527,-0.88651
528,-0.90115
529,-0.91579
530,-0.93042
531,-0.9417200000000001
532,-0.94794
533,-0.94794
534,-0.94794
535,-0.94794
536,-0.94794
537,-0.9586100000000001
538,-0.97219
539,-0.98682
540,-1.0015
541,-1.0161
542,-1.0307
543,-1.0454
544,-1.06
545,-1.0747
546,-1.0893
547,-1.1039
548,-1.1186
549,-1.1332
550,-1.1479
551,-1.1625
552,-1.1771
553,-1.1918
554,-1.2064
555,-1.2211
556,-1.2357
557,-1.2443
558,-1.2494
559,-1.2494
560,-1.2494
561,-1.2494
562,-1.2494
563,-1.2494
564,-1.2494
565,-1.2494
566,-1.2494
567,-1.2494
568,-1.2375
569,-1.2235
570,-1.2088
571,-1.1942
572,-1.1837
573,-1.1868
574,-1.1978
575,-1.2124
576,-1.2271
577,-1.2393
578,-1.2494
579,-1.2494
580,-1.2494
581,-1.2494
582,-1.2494
583,-1.2494
584,-1.2494
585,-1.2494
586,-1.2494
587,-1.2494
588,-1.2563
589,-1.2667
590,-1.2813
591,-1.2959
592,-1.3095
593,-1.3155
594,-1.3096
595,-1.295
596,-1.2803
597,-1.2657
598,-1.2511
599,-1.2497
600,-1.2494
601,-1.2494
602,-1.2494
603,-1.2521
604,-1.2615
605,-1.2748
606,-1.2895
607,-1.3041
608,-1.3158
609,-1.3247
610,-1.3247
611,-1.3247
612,-1.3247
613,-1.3247
614,-1.3315
615,-1.3459
616,-1.3605
617,-1.3751
618,-1.3898
619,-1.3965
620,-1.4001
621,-1.4001
622,-1.4001
623,-1.4001
624,-1.4001
625,-1.4001
626,-1.4001
627,-1.4001
628,-1.4001
629,-1.4001
630,0.7317100000000001
631,0.7317100000000001
632,0.7317100000000001
633,0.7317100000000001
634,0.7317100000000001
635,0.7317100000000001
636,0.7317100000000001
637,0.7317100000000001
638,0.7317100000000001
639,0.7317100000000001
640,0.7317100000000001
641,0.7317100000000001
642,0.7317100000000001
643,0.7317100000000001
644,0.7317100000000001
645,0.7317100000000001
646,0.7317100000000001
647,0.7317100000000001
648,0.7317100000000001
649,0.7317100000000001
650,0.7317100000000001
651,0.7317100000000001
652,0.7317100000000001
653,0.7317100000000001
654,0.7317100000000001
655,0.7317100000000001
656,0.7317100000000001
657,0.7317100000000001
658,0.7317100000000001
659,0.7317100000000001
660,0.7317100000000001
661,0.7317100000000001
662,0.7317100000000001
663,0.7317100000000001
664,0.7317100000000001
665,0.7317100000000001
666,0.7317100000000001
667,0.7317100000000001
668,0.7317100000000001
669,0.7317100000000001
670,0.7317100000000001
671,0.7317100000000001
672,0.7317100000000001
673,0.7317100000000001
674,0.7317100000000001
675,0.7317100000000001
676,0.7317100000000001
677,0.7317100000000001
678,0.7317100000000001
679,0.7317100000000001
680,0.7317100000000001
681,0.7317100000000001
682,0.7855
683,0.8506799999999999
684,0.92871
685,1.0067
686,1.0815
687,1.1493
688,1.205
689,1.2570000000000001
690,1.3091
691,1.3599
692,1.4071
693,1.4331
694,1.4592
695,1.4852
696,1.5112
697,1.5372
698,1.5632
699,1.5892
700,1.6152
701,1.6412
702,1.6672
703,1.6932
704,1.7193
705,1.7453
706,1.7708
707,1.7947
708,1.8028
709,1.8028
710,1.8028
711,1.8028
712,1.8024
713,1.7828
714,1.7602
715,1.7342
716,1.7082
717,1.6801
718,1.6485
719,1.6107
720,1.5717
721,1.5327
722,1.4937
723,1.4547
724,1.4157
725,1.3766
726,1.3376
727,1.2986
728,1.2651
729,1.2361
730,1.2101
731,1.1841
732,1.1581
733,1.1426
734,1.1334
735,1.1334
736,1.1334
737,1.1326
738,1.1296
739,1.1099
740,1.0839
741,1.0579
742,1.0319
743,1.0059
744,0.97988
745,0.9538700000000001
746,0.92785
747,0.90184
748,0.8758299999999999
749,0.84982
750,0.82381
751,0.7978
752,0.77179
753,0.74578
754,0.71977
755,0.69376
756,0.66775
757,0.64174
758,0.61573
759,0.59615
760,0.58076
761,0.56776
762,0.55475
763,0.54175
764,0.52874
765,0.51574
766,0.50273
767,0.48972
768,0.47608
769,0.46115
770,0.43749
771,0.41148
772,0.38547
773,0.35946
774,0.33187
775,0.2952
776,0.25711999999999996
777,0.21811
778,0.17909
779,0.14332
780,0.1107
781,0.42407
782,0.29402
783,0.16396
784,0.16718
785,-0.13345
786,-0.32853000000000004
787,-0.10511
788,-0.14412
789,-0.18314
790,-0.20736999999999997
791,-0.22407
792,-0.23708
793,-0.25009000000000003
794,-0.26361
795,-0.28984
796,-0.32236
797,-0.36138000000000003
798,-0.40039
799,-0.43941
800,-0.47841999999999996
801,-0.51744
802,-0.5564600000000001
803,-0.5954699999999999
804,-0.63449
805,-0.6735
806,-0.7125199999999999
807,-0.75154
808,-0.79055
809,-0.82957
810,-0.86469
811,-0.8967299999999999
812,-0.92274
813,-0.94875
814,-0.9747600000000001
815,-0.9960100000000001
816,-1.0089
817,-1.0089
818,-1.0089
819,-1.0089
820,-1.0089
821,-1.0089
822,-1.0089
823,-1.0089
824,-1.0089
825,-1.0089
826,-1.0089
827,-1.0089
828,-1.0089
829,-1.0089
830,-1.0102
831,-1.0129
832,-1.0251
833,-1.0381
834,-1.0511
835,-1.0641
836,-1.0771
837,-1.0901
838,-1.1031
839,-1.1161
840,-1.1291
841,-1.1375
842,-1.1428
843,-1.1428
844,-1.1428
845,-1.1428
846,-1.1428
847,-1.1428
848,-1.1428
849,-1.1428
850,-1.1428
851,-1.1428
852,-1.1522
853,-1.1643
854,-1.1773
855,-1.1903
856,-1.2033
857,-1.2163
858,-1.2293
859,-1.2423
860,-1.2553
861,-1.265
862,-1.2716
863,-1.2590000000000001
864,-1.246
865,-1.2329
866,-1.2199
867,-1.2069
868,-1.1939
869,-1.1809
870,-1.1679
871,-1.1549
872,-1.1419
873,-1.1289
874,-1.1159
875,-1.1029
876,-1.0899
877,-1.0769
878,-1.0639
879,-1.0509
880,-1.0379
881,-1.0249
882,-1.0119
883,-1.0094
884,-1.0089
885,-1.0089
886,-1.0089
887,-1.0070000000000001
888,-0.99916
889,-0.9877600000000001
890,-0.9747600000000001
891,-0.96175
892,-0.95089
893,-0.9419299999999999
894,-0.9419299999999999
895,-0.9419299999999999
896,-0.9419299999999999
897,-0.9419299999999999
898,-0.9369299999999999
899,-0.92456
900,-0.91165
901,-0.89865
902,-0.88564
903,-0.87882
904,-0.87498
905,-0.87498
906,-0.87498
907,-0.87498
908,-0.87498
909,-0.87498
910,-0.87498
911,-0.87498
912,-0.87498
913,-0.87498
914,-0.87498
915,-0.87498
916,-0.87498
917,-0.87498
918,-0.87498
919,-0.87498
920,-0.87498
921,-0.87498
922,-0.87498
923,-0.87498
924,-0.87498
925,-0.87498
926,-0.87498
927,-0.87498
928,-0.87498
929,-0.88097
930,-0.89376
931,-0.90675
932,-0.91975
933,-0.93276
934,-0.93165
935,-0.9250799999999999
936,-0.9120799999999999
937,-0.89907
938,-0.88686
939,-0.8781200000000001
940,-0.87498
941,-0.87498
942,-0.87498
943,-0.87498
944,-0.87498
