time,value
0,-0.68004
1,-0.15254
2,0.4635
3,1.1257
4,1.7845
5,2.3878
6,2.8866
7,3.2396
8,3.4179
9,3.4078
10,3.2123
11,2.8509
12,2.3571
13,1.775
14,1.1549
15,0.54742
16,-0.00087412
17,-0.45238999999999996
18,-0.78161
19,-0.97695
20,-1.041
21,-0.98908
22,-0.84665
23,-0.64558
24,-0.42008999999999996
25,-0.20269
26,-0.020653
27,0.10661
28,0.16899
29,0.16589
30,0.10522000000000001
31,0.0015129000000000002
32,-0.12669
33,-0.25963
34,-0.37911
35,-0.4706
36,-0.52489
37,-0.53872
38,-0.51462
39,-0.45997
40,-0.38549
41,-0.30349
42,-0.22599
43,-0.16308
44,-0.12178
45,-0.10536
46,-0.11329000000000002
47,-0.14171
48,-0.18431
49,-0.23348000000000002
50,-0.28152
51,-0.32173
52,-0.3492
53,-0.36136999999999997
54,-0.35806
55,-0.34126999999999996
56,-0.31458
57,-0.28246
58,-0.2495
59,-0.21971999999999997
60,-0.19602999999999998
61,-0.17995999999999998
62,-0.17157
63,-0.16974
64,-0.17243
65,-0.17726
66,-0.18192
67,-0.18467999999999998
68,-0.18462
69,-0.18182
70,-0.17731
71,-0.17287
72,-0.17076
73,-0.17328
74,-0.18249
75,-0.19984000000000002
76,-0.22594
77,-0.26050999999999996
78,-0.3024
79,-0.34970999999999997
80,-0.40008
81,-0.45091000000000003
82,-0.49967
83,-0.54415
84,-0.5826600000000001
85,-0.61412
86,-0.63812
87,-0.65483
88,-0.66493
89,-0.66946
90,-0.66965
91,-0.66723
92,-0.66387
93,-0.65901
94,-0.65354
95,-0.64822
96,-0.64364
97,-0.64018
98,-0.63799
