time,value
0,0.61903
1,0.61903
2,0.61903
3,0.61903
4,0.61903
5,0.61903
6,0.61903
7,0.61903
8,0.61903
9,0.61903
10,0.61903
11,0.61903
12,0.61903
13,0.61903
14,0.61903
15,0.61903
16,0.61903
17,0.61903
18,0.61903
19,0.61903
20,0.61903
21,0.61903
22,0.61903
23,0.61903
24,0.61903
25,0.61903
26,0.61903
27,0.61903
28,0.61903
29,0.61903
30,0.61903
31,0.61903
32,0.61903
33,0.61903
34,0.61903
35,0.61903
36,0.61903
37,0.61903
38,0.61903
39,0.61903
40,0.61903
41,0.61903
42,0.61903
43,0.6209
44,0.6228
45,0.62679
46,0.63138
47,0.63598
48,0.64057
49,0.6451600000000001
50,0.64976
51,0.65435
52,0.65894
53,0.6635300000000001
54,0.66592
55,0.66814
56,0.66876
57,0.66876
58,0.66876
59,0.66876
60,0.66876
61,0.66876
62,0.66876
63,0.66876
64,0.66876
65,0.66876
66,0.66876
67,0.66876
68,0.66876
69,0.66876
70,0.66876
71,0.66876
72,0.66876
73,0.66876
74,0.66876
75,0.66876
76,0.66876
77,0.66876
78,0.66876
79,0.66876
80,0.66876
81,0.66876
82,0.66876
83,0.66876
84,0.66876
85,0.66876
86,0.66876
87,0.66876
88,0.66876
89,0.66876
90,0.66876
91,0.66876
92,0.66876
93,0.66876
94,0.66876
95,0.66876
96,0.66876
97,0.66876
98,0.66876
99,0.66876
100,0.66876
101,0.66876
102,0.66876
103,0.66876
104,0.66876
105,0.66876
106,0.66876
107,0.66876
108,0.66876
109,0.66876
110,0.66876
111,0.66876
112,0.66876
113,0.66876
114,0.66876
115,0.66876
116,0.66876
117,0.66876
118,0.66876
119,0.66876
120,0.66876
121,0.66876
122,0.66876
123,0.66876
124,0.66876
125,0.66876
126,0.66876
127,0.66876
128,0.66876
129,0.66876
130,0.66876
131,0.66876
132,0.66876
133,0.66876
134,0.66876
135,0.66876
136,0.66876
137,0.66876
138,0.66876
139,0.66876
140,0.66985
141,0.6714399999999999
142,0.6744600000000001
143,0.67906
144,0.68365
145,0.68824
146,0.69284
147,0.69743
148,0.70202
149,0.7066100000000001
150,0.71121
151,0.7145
152,0.7170300000000001
153,0.71849
154,0.71849
155,0.71849
156,0.71849
157,0.71849
158,0.71849
159,0.71849
160,0.71849
161,0.71849
162,0.7155699999999999
163,0.7105
164,0.70392
165,0.6947399999999999
166,0.68555
167,0.6763600000000001
168,0.66718
169,0.65799
170,0.6488
171,0.63962
172,0.63043
173,0.62125
174,0.61206
175,0.60287
176,0.5936899999999999
177,0.5845
178,0.5753199999999999
179,0.56613
180,0.55694
181,0.54776
182,0.53857
183,0.5293800000000001
184,0.52344
185,0.52122
186,0.51956
187,0.51956
188,0.51956
189,0.51956
190,0.51956
191,0.51956
192,0.51956
193,0.51956
194,0.51956
195,0.51795
196,0.51399
197,0.5099
198,0.50531
199,0.5007199999999999
200,0.49612
201,0.49153
202,0.48694
203,0.48234
204,0.47775
205,0.47316
206,0.4592
207,0.42799
208,0.39666
209,0.36451
210,0.33236
211,0.3002
212,0.26805
213,0.2359
214,0.20375
215,0.17127
216,0.13849
217,0.10317
218,0.061836
219,0.020498
220,-0.02084
221,-0.062178
222,-0.10352
223,-0.14485
224,-0.18619000000000002
225,-0.22753
226,-0.26923
227,-0.31135999999999997
228,-0.3544
229,-0.40033
230,-0.44626000000000005
231,-0.49218999999999996
232,-0.5381199999999999
233,-0.58405
234,-0.62998
235,-0.67591
236,-0.7218399999999999
237,-0.7662800000000001
238,-0.8084100000000001
239,-0.8487100000000001
240,-0.8808600000000001
241,-0.91301
242,-0.9451700000000001
243,-0.9773200000000001
244,-1.0095
245,-1.0416
246,-1.0738
247,-1.1059
248,-1.1375
249,-1.1679
250,-1.1979
251,-1.2255
252,-1.2531
253,-1.2806
254,-1.3082
255,-1.3357
256,-1.3633
257,-1.3909
258,-1.4184
259,-1.4453
260,-1.4707
261,-1.4959
262,-1.5188
263,-1.5418
264,-1.5648
265,-1.5877
266,-1.6107
267,-1.6337
268,-1.6566
269,-1.6796
270,-1.7007
271,-1.7156
272,-1.7304
273,-1.7396
274,-1.7488
275,-1.758
276,-1.7672
277,-1.7764
278,-1.7855
279,-1.7947
280,-1.8039
281,-1.8131
282,-1.8223
283,-1.8315
284,-1.8407
285,-1.8499
286,-1.859
287,-1.8682
288,-1.8774
289,-1.8866
290,-1.8958
291,-1.905
292,-1.9146
293,-1.9274
294,-1.9402
295,-1.9539
296,-1.9677
297,-1.9815
298,-1.9952
299,-2.009
300,-2.0228
301,-2.0366
302,-2.0504
303,-2.0641
304,-2.0779
305,-2.0917
306,-2.1055
307,-2.1193
308,-2.133
309,-2.1468
310,-2.1606
311,-2.1744
312,-2.1882
313,-2.2019
314,-2.2157
