time,value
0,-0.060328999999999994
1,-0.060328999999999994
2,-0.060328999999999994
3,-0.060328999999999994
4,-0.060328999999999994
5,-0.060328999999999994
6,-0.060328999999999994
7,-0.060328999999999994
8,-0.060328999999999994
9,-0.060328999999999994
10,-0.060328999999999994
11,-0.060328999999999994
12,-0.060328999999999994
13,-0.060328999999999994
14,-0.060328999999999994
15,-0.060328999999999994
16,-0.060328999999999994
17,-0.060328999999999994
18,-0.060328999999999994
19,-0.060328999999999994
20,-0.060328999999999994
21,-0.060328999999999994
22,-0.060328999999999994
23,-0.060328999999999994
24,-0.060328999999999994
25,-0.060328999999999994
26,-0.060328999999999994
27,-0.060328999999999994
28,-0.060328999999999994
29,-0.060328999999999994
30,-0.060328999999999994
31,-0.060328999999999994
32,-0.060328999999999994
33,-0.060328999999999994
34,-0.060328999999999994
35,-0.060328999999999994
36,-0.060328999999999994
37,-0.060328999999999994
38,-0.060328999999999994
39,-0.060328999999999994
40,-0.060328999999999994
41,-0.060328999999999994
42,-0.060328999999999994
43,-0.060328999999999994
44,-0.060328999999999994
45,-0.060328999999999994
46,-0.060328999999999994
47,-0.060328999999999994
48,-0.060328999999999994
49,-0.060328999999999994
50,-0.060328999999999994
51,-0.060328999999999994
52,-0.060328999999999994
53,-0.060328999999999994
54,-0.060328999999999994
55,-0.060328999999999994
56,-0.060328999999999994
57,-0.060328999999999994
58,-0.060328999999999994
59,-0.060328999999999994
60,-0.060328999999999994
61,-0.060328999999999994
62,-0.060328999999999994
63,-0.060328999999999994
64,-0.060328999999999994
65,-0.060328999999999994
66,-0.060328999999999994
67,-0.060328999999999994
68,-0.060328999999999994
69,-0.060328999999999994
70,-0.060328999999999994
71,-0.060328999999999994
72,-0.060328999999999994
73,-0.060328999999999994
74,-0.060328999999999994
75,-0.060328999999999994
76,-0.060328999999999994
77,-0.060328999999999994
78,-0.060328999999999994
79,-0.060328999999999994
80,-0.060328999999999994
81,-0.060328999999999994
82,-0.060328999999999994
83,-0.060328999999999994
84,-0.060328999999999994
85,-0.060328999999999994
86,-0.060328999999999994
87,-0.060328999999999994
88,-0.060328999999999994
89,-0.060328999999999994
90,-0.060328999999999994
91,-0.060328999999999994
92,-0.060328999999999994
93,-0.060328999999999994
94,-0.060328999999999994
95,-0.060328999999999994
96,-0.060328999999999994
97,-0.060328999999999994
98,-0.060328999999999994
99,-0.060328999999999994
100,-0.060328999999999994
101,-0.060328999999999994
102,-0.060328999999999994
103,-0.060328999999999994
104,-0.060328999999999994
105,-0.060328999999999994
106,-0.060328999999999994
107,-0.060328999999999994
108,-0.060328999999999994
109,-0.060328999999999994
110,-0.060328999999999994
111,-0.060328999999999994
112,-0.060328999999999994
113,-0.060328999999999994
114,-0.060328999999999994
115,-0.060328999999999994
116,-0.060328999999999994
117,-0.060328999999999994
118,-0.060328999999999994
119,-0.060328999999999994
120,-0.060328999999999994
121,-0.060328999999999994
122,-0.060328999999999994
123,-0.060328999999999994
124,-0.060328999999999994
125,-0.060328999999999994
126,-0.060328999999999994
127,-0.060328999999999994
128,-0.060328999999999994
129,-0.060328999999999994
130,-0.060328999999999994
131,-0.060328999999999994
132,-0.060328999999999994
133,-0.060328999999999994
134,-0.060328999999999994
135,-0.060328999999999994
136,-0.060328999999999994
137,-0.060328999999999994
138,-0.060328999999999994
139,-0.060328999999999994
140,-0.060328999999999994
141,-0.060328999999999994
142,-0.060328999999999994
143,-0.060328999999999994
144,-0.060328999999999994
145,-0.060328999999999994
146,-0.060328999999999994
147,-0.060328999999999994
148,-0.060328999999999994
149,-0.060328999999999994
150,-0.060328999999999994
151,-0.060328999999999994
152,-0.060328999999999994
153,-0.060328999999999994
154,-0.060328999999999994
155,-0.060328999999999994
156,-0.060328999999999994
157,-0.060328999999999994
158,-0.060328999999999994
159,-0.060328999999999994
160,-0.060328999999999994
161,-0.060328999999999994
162,-0.060328999999999994
163,-0.060328999999999994
164,-0.060328999999999994
165,-0.060328999999999994
166,-0.060328999999999994
167,-0.060328999999999994
168,-0.060328999999999994
169,-0.060328999999999994
170,-0.060328999999999994
171,-0.060328999999999994
172,-0.060328999999999994
173,-0.060328999999999994
174,-0.060328999999999994
175,-0.060328999999999994
176,-0.060328999999999994
177,-0.060328999999999994
178,-0.060328999999999994
179,-0.060328999999999994
180,-0.060328999999999994
181,-0.060328999999999994
182,-0.060328999999999994
183,-0.060328999999999994
184,-0.060328999999999994
185,-0.060328999999999994
186,-0.060328999999999994
187,-0.060328999999999994
188,-0.060328999999999994
189,-0.060328999999999994
190,-0.060328999999999994
191,-0.060328999999999994
192,-0.060328999999999994
193,-0.060328999999999994
194,-0.060328999999999994
195,-0.060328999999999994
196,-0.060328999999999994
197,-0.060328999999999994
198,-0.060328999999999994
199,-0.060328999999999994
200,-0.060328999999999994
201,-0.060328999999999994
202,-0.060328999999999994
203,-0.060328999999999994
204,-0.060328999999999994
205,-0.060328999999999994
206,-0.060328999999999994
207,-0.060328999999999994
208,-0.060328999999999994
209,-0.060328999999999994
210,-0.060328999999999994
211,-0.060328999999999994
212,-0.060328999999999994
213,-0.060328999999999994
214,-0.060328999999999994
215,-0.060328999999999994
216,-0.060328999999999994
217,-0.060328999999999994
218,-0.060328999999999994
219,-0.060328999999999994
220,-0.060328999999999994
221,-0.060328999999999994
222,-0.060328999999999994
223,-0.060328999999999994
224,-0.060328999999999994
225,-0.060328999999999994
226,-0.060328999999999994
227,-0.060328999999999994
228,-0.060328999999999994
229,-0.060328999999999994
230,-0.060328999999999994
231,-0.060328999999999994
232,-0.060328999999999994
233,-0.060328999999999994
234,-0.060328999999999994
235,-0.060328999999999994
236,-0.060328999999999994
237,-0.060328999999999994
238,-0.060328999999999994
239,-0.060328999999999994
240,-0.060328999999999994
241,-0.060328999999999994
242,-0.060328999999999994
243,-0.060328999999999994
244,-0.060328999999999994
245,-0.060328999999999994
246,-0.060328999999999994
247,-0.060328999999999994
248,-0.060328999999999994
249,-0.060328999999999994
250,-0.060328999999999994
251,-0.060328999999999994
252,-0.060328999999999994
253,5.5264
254,18.19
255,18.840999999999998
256,-0.013772999999999999
257,-0.060328999999999994
258,-0.060328999999999994
259,-0.060328999999999994
260,-0.060328999999999994
261,-0.060328999999999994
262,-0.060328999999999994
263,-0.060328999999999994
264,-0.060328999999999994
265,-0.060328999999999994
266,-0.060328999999999994
267,-0.060328999999999994
268,-0.060328999999999994
269,-0.060328999999999994
270,-0.060328999999999994
271,-0.060328999999999994
272,-0.060328999999999994
273,-0.060328999999999994
274,-0.060328999999999994
275,-0.060328999999999994
276,-0.060328999999999994
277,-0.060328999999999994
278,-0.060328999999999994
279,-0.060328999999999994
280,-0.060328999999999994
281,-0.060328999999999994
282,-0.060328999999999994
283,-0.060328999999999994
284,-0.060328999999999994
285,-0.060328999999999994
286,-0.060328999999999994
287,-0.060328999999999994
288,-0.060328999999999994
289,-0.060328999999999994
290,-0.060328999999999994
291,-0.060328999999999994
292,-0.060328999999999994
293,-0.060328999999999994
294,-0.060328999999999994
295,-0.060328999999999994
296,-0.060328999999999994
297,-0.060328999999999994
298,-0.060328999999999994
299,-0.060328999999999994
300,-0.060328999999999994
301,-0.060328999999999994
302,-0.060328999999999994
303,-0.060328999999999994
304,-0.060328999999999994
305,-0.060328999999999994
306,-0.060328999999999994
307,-0.060328999999999994
308,-0.060328999999999994
309,-0.060328999999999994
310,-0.060328999999999994
311,-0.060328999999999994
312,-0.060328999999999994
313,-0.060328999999999994
314,-0.060328999999999994
315,-0.060328999999999994
316,-0.060328999999999994
317,-0.060328999999999994
318,-0.060328999999999994
319,-0.060328999999999994
320,-0.060328999999999994
321,-0.060328999999999994
322,-0.060328999999999994
323,-0.060328999999999994
324,-0.060328999999999994
325,-0.060328999999999994
326,-0.060328999999999994
327,-0.060328999999999994
328,-0.060328999999999994
329,-0.060328999999999994
330,-0.060328999999999994
331,-0.060328999999999994
332,-0.060328999999999994
333,-0.060328999999999994
334,-0.060328999999999994
335,-0.060328999999999994
336,-0.060328999999999994
337,-0.060328999999999994
338,-0.060328999999999994
339,-0.060328999999999994
340,-0.060328999999999994
341,-0.060328999999999994
342,-0.060328999999999994
343,-0.060328999999999994
344,-0.060328999999999994
345,-0.060328999999999994
346,-0.060328999999999994
347,-0.060328999999999994
348,-0.060328999999999994
349,-0.060328999999999994
350,-0.060328999999999994
351,-0.060328999999999994
352,-0.060328999999999994
353,-0.060328999999999994
354,-0.060328999999999994
355,-0.060328999999999994
356,-0.060328999999999994
357,-0.060328999999999994
358,-0.060328999999999994
359,-0.060328999999999994
360,-0.060328999999999994
361,-0.060328999999999994
362,-0.060328999999999994
363,-0.060328999999999994
364,-0.060328999999999994
365,-0.060328999999999994
366,-0.060328999999999994
367,-0.060328999999999994
368,-0.060328999999999994
369,-0.060328999999999994
370,-0.060328999999999994
371,-0.060328999999999994
372,-0.060328999999999994
373,-0.060328999999999994
374,-0.060328999999999994
375,-0.060328999999999994
376,-0.060328999999999994
377,-0.060328999999999994
378,-0.060328999999999994
379,-0.060328999999999994
380,-0.060328999999999994
381,-0.060328999999999994
382,-0.060328999999999994
383,-0.060328999999999994
384,-0.060328999999999994
385,-0.060328999999999994
386,-0.060328999999999994
387,-0.060328999999999994
388,-0.060328999999999994
389,-0.060328999999999994
390,-0.060328999999999994
391,-0.060328999999999994
392,-0.060328999999999994
393,-0.060328999999999994
394,-0.060328999999999994
395,-0.060328999999999994
396,-0.060328999999999994
397,-0.060328999999999994
398,-0.060328999999999994
399,-0.060328999999999994
400,-0.060328999999999994
401,-0.060328999999999994
402,-0.060328999999999994
403,-0.060328999999999994
404,-0.060328999999999994
405,-0.060328999999999994
406,-0.060328999999999994
407,-0.060328999999999994
408,-0.060328999999999994
409,-0.060328999999999994
410,-0.060328999999999994
411,-0.060328999999999994
412,-0.060328999999999994
413,-0.060328999999999994
414,-0.060328999999999994
415,-0.060328999999999994
416,-0.060328999999999994
417,-0.060328999999999994
418,-0.060328999999999994
419,-0.060328999999999994
420,-0.060328999999999994
421,-0.060328999999999994
422,-0.060328999999999994
423,-0.060328999999999994
424,-0.060328999999999994
425,-0.060328999999999994
426,-0.060328999999999994
427,-0.060328999999999994
428,-0.060328999999999994
429,-0.060328999999999994
430,-0.060328999999999994
431,-0.060328999999999994
432,-0.060328999999999994
433,-0.060328999999999994
434,-0.060328999999999994
435,-0.060328999999999994
436,-0.060328999999999994
437,-0.060328999999999994
438,-0.060328999999999994
439,-0.060328999999999994
440,-0.060328999999999994
441,-0.060328999999999994
442,-0.060328999999999994
443,-0.060328999999999994
444,-0.060328999999999994
445,-0.060328999999999994
446,-0.060328999999999994
447,-0.060328999999999994
448,-0.060328999999999994
449,-0.060328999999999994
450,-0.060328999999999994
451,-0.060328999999999994
452,-0.060328999999999994
453,-0.060328999999999994
454,-0.060328999999999994
455,-0.060328999999999994
456,-0.060328999999999994
457,-0.060328999999999994
458,-0.060328999999999994
459,-0.060328999999999994
460,-0.060328999999999994
461,-0.060328999999999994
462,-0.060328999999999994
463,-0.060328999999999994
464,-0.060328999999999994
465,-0.060328999999999994
466,-0.060328999999999994
467,-0.060328999999999994
468,-0.060328999999999994
469,-0.060328999999999994
470,-0.060328999999999994
471,-0.060328999999999994
472,-0.060328999999999994
473,-0.060328999999999994
474,-0.060328999999999994
475,-0.060328999999999994
476,-0.060328999999999994
477,-0.060328999999999994
478,-0.060328999999999994
479,-0.060328999999999994
480,-0.060328999999999994
481,-0.060328999999999994
482,-0.060328999999999994
483,-0.060328999999999994
484,-0.060328999999999994
485,-0.060328999999999994
486,-0.060328999999999994
487,-0.060328999999999994
488,-0.060328999999999994
489,-0.060328999999999994
490,-0.060328999999999994
491,-0.060328999999999994
492,-0.060328999999999994
493,-0.060328999999999994
494,-0.060328999999999994
495,-0.060328999999999994
496,-0.060328999999999994
497,-0.060328999999999994
498,-0.060328999999999994
499,-0.060328999999999994
500,-0.060328999999999994
501,-0.060328999999999994
502,-0.060328999999999994
503,-0.060328999999999994
504,-0.060328999999999994
505,-0.060328999999999994
506,-0.060328999999999994
507,-0.060328999999999994
508,-0.060328999999999994
509,-0.060328999999999994
510,-0.060328999999999994
511,-0.060328999999999994
512,-0.060328999999999994
513,-0.060328999999999994
514,-0.060328999999999994
515,-0.060328999999999994
516,-0.060328999999999994
517,-0.060328999999999994
518,-0.060328999999999994
519,-0.060328999999999994
520,-0.060328999999999994
521,-0.060328999999999994
522,-0.060328999999999994
523,-0.060328999999999994
524,-0.060328999999999994
525,-0.060328999999999994
526,-0.060328999999999994
527,-0.060328999999999994
528,-0.060328999999999994
529,-0.060328999999999994
530,-0.060328999999999994
531,-0.060328999999999994
532,-0.060328999999999994
533,-0.060328999999999994
534,-0.060328999999999994
535,-0.060328999999999994
536,-0.060328999999999994
537,-0.060328999999999994
538,-0.060328999999999994
539,-0.060328999999999994
540,-0.060328999999999994
541,-0.060328999999999994
542,-0.060328999999999994
543,-0.060328999999999994
544,-0.060328999999999994
545,-0.060328999999999994
546,-0.060328999999999994
547,-0.060328999999999994
548,-0.060328999999999994
549,-0.060328999999999994
550,-0.060328999999999994
551,-0.060328999999999994
552,-0.060328999999999994
553,-0.060328999999999994
554,-0.060328999999999994
555,-0.060328999999999994
556,-0.060328999999999994
557,-0.060328999999999994
558,-0.060328999999999994
559,-0.060328999999999994
560,-0.060328999999999994
561,-0.060328999999999994
562,-0.060328999999999994
563,-0.060328999999999994
564,-0.060328999999999994
565,0.12589
566,0.032783
567,0.032783
568,0.032783
569,0.032783
570,0.032783
571,-0.060328999999999994
572,-0.060328999999999994
573,-0.060328999999999994
574,-0.060328999999999994
575,-0.060328999999999994
576,-0.060328999999999994
577,-0.060328999999999994
578,-0.060328999999999994
579,-0.060328999999999994
580,-0.060328999999999994
581,-0.060328999999999994
582,-0.060328999999999994
583,-0.060328999999999994
584,-0.060328999999999994
585,-0.060328999999999994
586,-0.060328999999999994
587,-0.060328999999999994
588,-0.060328999999999994
589,-0.060328999999999994
590,-0.060328999999999994
591,-0.060328999999999994
592,-0.060328999999999994
593,-0.060328999999999994
594,-0.060328999999999994
595,-0.060328999999999994
596,-0.060328999999999994
597,-0.060328999999999994
598,-0.060328999999999994
599,-0.060328999999999994
600,-0.060328999999999994
601,-0.060328999999999994
602,-0.060328999999999994
603,-0.060328999999999994
604,-0.060328999999999994
605,-0.060328999999999994
606,-0.060328999999999994
607,-0.060328999999999994
608,-0.060328999999999994
609,-0.060328999999999994
610,-0.060328999999999994
611,-0.060328999999999994
612,-0.060328999999999994
613,-0.060328999999999994
614,-0.060328999999999994
615,-0.060328999999999994
616,-0.060328999999999994
617,-0.060328999999999994
618,-0.060328999999999994
619,-0.060328999999999994
620,-0.060328999999999994
621,-0.060328999999999994
622,-0.060328999999999994
623,-0.060328999999999994
624,-0.060328999999999994
625,-0.060328999999999994
626,-0.060328999999999994
627,-0.060328999999999994
628,-0.060328999999999994
629,-0.060328999999999994
630,-0.060328999999999994
631,-0.060328999999999994
632,-0.060328999999999994
633,-0.060328999999999994
634,-0.060328999999999994
635,-0.060328999999999994
636,-0.060328999999999994
637,-0.060328999999999994
638,-0.060328999999999994
639,-0.060328999999999994
640,-0.060328999999999994
641,-0.060328999999999994
642,-0.060328999999999994
643,-0.060328999999999994
644,-0.060328999999999994
645,-0.060328999999999994
646,-0.060328999999999994
647,-0.060328999999999994
648,-0.060328999999999994
649,-0.060328999999999994
650,-0.060328999999999994
651,-0.060328999999999994
652,-0.060328999999999994
653,-0.060328999999999994
654,-0.060328999999999994
655,-0.060328999999999994
656,-0.060328999999999994
657,-0.060328999999999994
658,-0.060328999999999994
659,-0.060328999999999994
660,-0.060328999999999994
661,-0.060328999999999994
662,-0.060328999999999994
663,-0.060328999999999994
664,-0.060328999999999994
665,-0.060328999999999994
666,-0.060328999999999994
667,-0.060328999999999994
668,-0.060328999999999994
669,-0.060328999999999994
670,-0.060328999999999994
671,-0.060328999999999994
672,-0.060328999999999994
673,-0.060328999999999994
674,-0.060328999999999994
675,-0.060328999999999994
676,-0.060328999999999994
677,-0.060328999999999994
678,-0.060328999999999994
679,-0.060328999999999994
680,-0.060328999999999994
681,-0.060328999999999994
682,-0.060328999999999994
683,-0.060328999999999994
684,-0.060328999999999994
685,-0.060328999999999994
686,-0.060328999999999994
687,-0.060328999999999994
688,-0.060328999999999994
689,-0.060328999999999994
690,-0.060328999999999994
691,-0.060328999999999994
692,-0.060328999999999994
693,-0.060328999999999994
694,-0.060328999999999994
695,-0.060328999999999994
696,-0.060328999999999994
697,-0.060328999999999994
698,-0.060328999999999994
699,-0.060328999999999994
700,-0.060328999999999994
701,-0.060328999999999994
702,-0.060328999999999994
703,-0.060328999999999994
704,-0.060328999999999994
705,-0.060328999999999994
706,-0.060328999999999994
707,-0.060328999999999994
708,-0.060328999999999994
709,-0.060328999999999994
710,-0.060328999999999994
711,-0.060328999999999994
712,-0.060328999999999994
713,-0.060328999999999994
714,-0.060328999999999994
715,-0.060328999999999994
716,-0.060328999999999994
717,-0.060328999999999994
718,-0.060328999999999994
719,-0.060328999999999994
