time,value
0,1.526
1,1.4792
2,1.3348
3,1.1384
4,1.0656
5,0.8409200000000001
6,0.62469
7,0.35743
8,0.36888000000000004
9,0.60483
10,0.79593
11,0.84891
12,0.74721
13,0.59131
14,0.40762
15,0.17833
16,0.0038586
17,-0.18966
18,-0.40559
19,-0.22757
20,-0.022537
21,0.098808
22,0.18619000000000002
23,0.089229
24,-0.025702
25,-0.08957799999999999
26,-0.22421999999999997
27,-0.42508999999999997
28,-0.58687
29,-0.74083
30,-0.93424
31,-1.1395
32,-1.3117
33,-1.4711
34,-1.5614
35,-1.288
36,-1.081
37,-0.8753299999999999
38,-0.772
39,-0.75464
40,-0.77598
41,-0.78047
42,-0.8186399999999999
43,-0.8369
44,-0.9002
45,-0.9548700000000001
46,-0.97619
47,-0.9633799999999999
48,-0.87172
49,-0.64875
50,-0.41001000000000004
51,-0.22757
52,-0.020166
53,0.1471
54,0.31965
55,0.47706000000000004
56,0.71049
57,0.9138799999999999
58,1.1023
59,1.2934
60,1.4491
61,1.459
62,1.6002
63,1.8127
64,2.0786
65,2.2915
66,2.4322
67,2.3101
68,2.0472
69,1.8387
70,1.6193
71,1.4946
72,1.217
73,1.0012
74,0.79108
75,0.58759
76,0.33157
77,0.13347
78,-0.048727
79,-0.23344
80,-0.37745
81,-0.4988
82,-0.54783
83,-0.61883
84,-0.7017100000000001
85,-0.82421
86,-0.97405
87,-1.2413
88,-1.4321
89,-1.6515
90,-1.7744
91,-1.6853
92,-1.5724
93,-1.3913
94,-1.2395
95,-1.0743
96,-0.91115
97,-0.74822
98,-0.66071
99,-0.6108100000000001
100,-0.5995199999999999
101,-0.72316
102,-0.91115
103,-1.1056
104,-1.3117
105,-1.1693
106,-0.88566
107,-0.64589
108,-0.40162
109,-0.17106
110,-0.0071493
111,0.077317
112,0.17271
113,0.1255
114,-0.023328
115,-0.20626999999999998
116,-0.34215999999999996
117,-0.15666
118,0.051829999999999994
119,0.29063
120,0.47289
121,0.55562
122,0.58182
123,0.77813
124,0.95586
125,1.1695
126,1.3236
127,1.4869999999999999
