time,value
0,-0.6914600000000001
1,0.037369
2,0.28031
3,0.28031
4,0.5232399999999999
5,0.5232399999999999
6,0.5232399999999999
7,0.5232399999999999
8,0.28031
9,-0.6914600000000001
10,-0.44848999999999994
11,0.76617
12,1.7379
13,-0.20556
14,-2.392
15,-1.906
16,0.037369
17,1.252
18,2.2238
19,1.9808
20,1.0091
21,0.5232399999999999
22,0.037369
23,-0.44848999999999994
24,-0.44848999999999994
25,-0.44848999999999994
26,-0.6914600000000001
27,-0.93429
28,-0.6914600000000001
29,-0.44848999999999994
30,-0.44848999999999994
31,-0.6914600000000001
32,-0.6914600000000001
33,-0.44848999999999994
34,-0.20556
35,0.28031
36,0.28031
37,0.5232399999999999
38,0.28031
39,0.28031
40,0.28031
41,-0.44848999999999994
42,-1.1773
43,-0.93429
44,0.28031
45,0.76617
46,0.5232399999999999
47,-0.20556
48,0.037369
49,0.76617
50,1.7379
51,1.9808
52,1.0091
53,-1.906
54,-1.906
55,0.76617
56,1.7379
57,0.037369
58,-2.392
59,-1.4202
60,-0.93429
61,-0.44848999999999994
62,0.5232399999999999
63,0.28031
64,-0.20556
