time,value
0,0.67185
1,0.67185
2,0.67185
3,0.67185
4,0.67185
5,0.67185
6,0.67185
7,0.67185
8,0.67185
9,0.67185
10,0.67185
11,0.67185
12,0.67185
13,0.67185
14,0.67185
15,0.67185
16,0.67185
17,0.67185
18,0.67185
19,0.67185
20,0.67185
21,0.67185
22,0.67185
23,0.67185
24,0.67185
25,0.67185
26,0.67185
27,0.67185
28,0.43868999999999997
29,0.17734
30,-0.42098
31,-0.34536999999999995
32,-0.52525
33,-0.56881
34,-0.59231
35,-0.46163999999999994
36,-0.33096
37,-0.1257
38,0.45961
39,0.23187
40,0.31898000000000004
41,0.37665
42,0.37665
43,0.38009
44,0.42365
45,0.46721
46,0.43932
47,0.39576
48,0.37665
49,0.37665
50,0.35031999999999996
51,0.2632
52,0.18361
53,0.27071999999999996
54,0.35784
55,0.5474399999999999
56,0.76523
57,0.96015
58,1.1344
59,1.2854
60,1.3726
61,1.459
62,1.459
63,1.459
64,1.3939
65,1.3067
66,1.2196
67,1.1325
68,1.0554
69,1.0119
70,0.9683
71,1.0094
72,1.0529
73,1.1275
74,1.2146
75,1.3412
76,1.5155
77,1.6728
78,1.7599
79,1.847
80,1.8934
81,1.9369
82,1.9509999999999998
83,1.9509999999999998
84,1.9692
85,2.0128
86,2.0357
87,1.9485
88,1.8614
89,1.7743
90,1.6872
91,1.6837
92,1.7273
93,1.7709
94,1.8144
95,1.858
96,1.9015
97,1.9451
98,1.9509999999999998
99,1.9509999999999998
100,1.8984
101,1.8113
102,1.6941
103,1.5198
104,1.3456
105,1.1714
106,0.99713
107,0.85893
108,0.72825
109,0.67185
110,0.67185
111,0.72575
112,0.8999799999999999
113,1.072
114,1.2027
115,1.3334
116,1.3262
117,1.2826
118,1.1463
119,0.9285
120,0.68689
121,0.38197
122,0.39066
123,-0.13949
124,-0.35728000000000004
125,-0.47636999999999996
126,-0.56348
127,-0.6506
128,-0.7377199999999999
129,-0.8145
130,-0.85806
131,-0.9016200000000001
132,-0.9451799999999999
133,-0.98874
134,-1.0636
135,-1.1508
136,-1.2579
137,-1.3886
138,-1.5368
139,-1.7546
140,-1.9724
141,-2.1902
142,-2.408
143,-2.5663
144,-2.697
145,-2.7352
146,-2.6481
147,-2.5465
148,-2.3723
149,-2.1981
150,-1.9448
151,-1.6835
152,-1.4503
153,-1.2325
154,-1.0317
155,-0.8574299999999999
156,-0.70012
157,-0.65656
158,-0.613
159,-0.75903
160,-0.93327
161,-1.1075
162,-1.2817
163,-1.4253
164,-1.5124
165,-1.5832
166,-1.4961
167,-1.409
168,-1.2855
169,-1.1548
170,-1.0241
171,-0.8934700000000001
172,-0.76279
173,-0.6321100000000001
174,-0.50645
175,-0.46288999999999997
176,-0.41933000000000004
177,-0.48013
178,-0.56725
179,-0.72487
180,-0.9426700000000001
181,-1.1238
182,-1.2109
183,-1.2962
184,-1.2962
185,-1.2962
186,-1.2297
187,-1.1426
188,-1.0994
189,-1.0994
190,-1.078
191,-0.99093
192,-0.90381
193,-0.8166899999999999
194,-0.7295699999999999
195,-0.73741
196,-0.7809699999999999
197,-0.8245299999999999
198,-0.8680899999999999
199,-0.90256
200,-0.90256
201,-0.90256
202,-0.9439200000000001
203,-0.9874799999999999
204,-1.001
205,-1.001
206,-0.98216
207,-0.9386
208,-0.86495
209,-0.6471600000000001
210,-0.42936
211,-0.41056000000000004
212,-0.41056000000000004
213,-0.43906999999999996
214,-0.48263
215,-0.54343
216,-0.63055
217,-0.7117100000000001
218,-0.75527
219,-0.79883
220,-0.84239
221,-0.88595
222,-0.8486600000000001
223,-0.76154
224,-0.65875
225,-0.5280699999999999
226,-0.40178
227,-0.31466
228,-0.22755
229,-0.17709
230,-0.13352999999999998
231,-0.45075
232,-0.23295
233,-0.085668
234,-0.085668
235,-0.12797
236,-0.15609
237,-0.28676999999999997
238,-0.34725
239,-0.39081
240,-0.38674000000000003
241,-0.34318000000000004
242,-0.27455
243,-0.14387
244,-0.066866
245,0.11748
246,0.24816
247,0.31178
248,0.35534
249,0.37665
250,0.37665
251,0.35470999999999997
252,0.26759
253,0.18047
254,0.46588
255,0.20062
256,-0.11285
257,-0.24353000000000002
258,-0.33284
259,-0.3764
260,-0.40116
261,-0.3576
262,-0.31404
263,-0.2288
264,-0.14168
265,-0.27369
266,0.1619
267,0.11968
268,0.2068
269,0.27041
270,0.22685
271,0.18329
272,0.13973
273,0.47998
274,0.11803
275,-0.31756999999999996
276,-0.1329
277,-0.17645999999999998
278,-0.21375999999999998
279,-0.21375999999999998
280,-0.21375999999999998
281,-0.13667
282,-0.24861999999999998
283,-0.085668
284,-0.085668
285,0.074155
286,0.10213
287,0.17984
288,0.17984
289,0.17984
290,0.17984
291,0.17984
292,0.15415
293,0.11059000000000001
294,0.1901
295,-0.46329
296,-0.21689
297,-0.26045
298,-0.30401
299,-0.34757
300,-0.39113000000000003
301,-0.38643
302,-0.34287
303,-0.28646
304,-0.19934000000000002
305,-0.11222
306,-0.12641
307,0.30919
308,0.40633
309,0.40633
310,0.40633
311,0.40633
312,0.29352
313,-0.14207999999999998
314,-0.11535999999999999
315,0.54082
316,0.54082
317,0.54082
318,0.54082
319,0.54082
320,0.54082
321,0.54082
322,0.54082
323,0.54082
324,0.54082
325,0.54082
326,0.54082
327,0.54082
328,0.54082
329,0.54082
330,0.54082
331,0.54082
332,0.54082
333,0.54082
334,0.54082
335,0.54082
336,0.54082
337,0.54082
338,0.54082
339,0.54082
340,0.52123
341,0.39155
342,0.26188
343,-0.49668
344,-0.48818
345,-0.8772
346,-1.2662
347,-1.5582
348,-1.6879
349,-1.7877
350,-1.6581
351,-1.5284
352,-1.2877
353,-1.0283
354,-0.8464200000000001
355,-0.7167399999999999
356,-0.67476
357,-0.8044399999999999
358,-0.91359
359,-0.78391
360,-0.6542399999999999
361,-0.73727
362,-0.8669399999999999
363,-0.9966200000000001
364,-1.1263
365,-1.256
366,-1.3856
367,-1.5041
368,-1.3744
369,-1.2448
370,-1.0134
371,-0.7540600000000001
372,-0.49471000000000004
373,-0.23535999999999999
374,-0.053546
375,0.11914000000000001
376,0.24695
377,0.11728
378,-0.062875
379,-0.22613000000000003
380,-0.22613000000000003
381,-0.10849
382,-0.23815999999999998
383,-0.33798
384,-0.33798
385,-0.33798
386,-0.33798
387,-0.33798
388,-0.33798
389,-0.33798
390,-0.27921
391,-0.14953
392,-0.10019
393,0.10980999999999999
394,0.23949
395,0.24788000000000002
396,0.24788000000000002
397,0.42327
398,0.68262
399,0.88786
400,1.0175
401,1.1267
402,1.1267
403,1.1267
404,1.0101
405,0.8804
406,0.9167799999999999
407,1.0465
408,1.1267
409,1.1267
410,1.1584
411,1.4178
412,1.6771
413,1.7126
414,1.7126
415,1.7126
416,1.7126
417,1.7126
418,1.7126
419,1.7014
420,1.5717
421,1.442
422,1.4196
423,1.4196
424,1.4933
425,1.6230000000000002
426,1.7928
427,2.0521
428,2.318
429,2.707
430,3.0961
431,3.1772
432,3.1772
433,3.1082
434,2.9785
435,2.7779
436,2.3889
437,2.0018
438,1.7424
439,1.4831
440,1.4196
441,1.4196
442,1.3552
443,1.2256
444,1.1267
445,1.1267
446,1.1267
447,0.9998100000000001
448,0.8701399999999999
449,0.64717
450,0.38782
451,0.12847
452,-0.13088
453,-0.39023
454,-0.64957
455,-0.9089200000000001
456,-1.1683
457,-1.4276
458,-1.5097
459,-1.5097
460,-1.3996
461,-1.1403
462,-0.8594799999999999
463,-0.47046000000000004
464,-0.40805
465,0.42513999999999996
466,0.94384
467,1.3786
468,1.7676
469,2.0055
470,2.0055
471,2.0055
472,2.0055
473,2.0055
474,1.554
475,1.0353
476,0.67516
477,0.41581
478,0.15646
479,-0.10289000000000001
480,-0.32585
481,-0.19618
482,-0.33342
483,0.31495
484,0.19284
485,0.32252
486,0.45219
487,0.54082
488,0.54082
489,0.54082
490,0.54082
491,0.54082
492,0.33371
493,0.37093000000000004
494,-0.18499000000000002
495,-0.44433999999999996
496,-0.70368
497,-0.9630299999999999
498,-1.2168
499,-1.2168
500,-1.2168
501,-1.2168
502,-1.2168
503,-1.2168
504,-1.2168
505,-1.2168
506,-1.2168
507,-1.2168
508,-1.089
509,-0.9593
510,-0.82963
511,-0.69995
512,-0.6915600000000001
513,-0.8212299999999999
514,-0.8968
515,-0.76712
516,-0.63745
517,-0.5077699999999999
518,-0.3781
519,-0.33798
520,-0.33798
521,-0.33798
522,-0.33798
523,-0.33798
524,-0.33798
525,-0.33798
526,-0.33798
527,-0.33798
528,-0.33798
529,-0.33798
530,-0.38929
531,-0.5189699999999999
532,-0.64864
533,-0.77832
534,-0.90799
535,-1.0377
536,-1.1673
537,-1.2168
538,-1.2168
539,-1.1701
540,-1.0405
541,-0.92385
542,-0.92385
543,-0.92385
544,-0.8147
545,-0.68503
546,-0.55535
547,-0.42568
548,-0.33798
549,-0.33798
550,-0.33798
551,-0.33798
552,-0.33798
553,-0.44247
554,-0.57214
555,-0.63092
556,-0.63092
557,-0.5936
558,-0.46393
559,-0.33425
560,-0.20457999999999998
561,-0.3754
562,-0.14487
563,-0.27454
564,-0.33798
565,-0.33798
566,-0.33798
567,-0.33798
568,-0.33798
569,-0.46671999999999997
570,-0.5964
571,-0.72607
572,-0.85575
573,-0.92385
574,-0.92385
575,-0.92385
576,-0.92385
577,-0.92385
578,-0.79977
579,-0.6701
580,-0.54042
581,-0.41075
582,-0.28107
583,-0.1514
584,-0.34275
585,-0.19805
586,-0.32771999999999996
587,-0.33798
588,-0.33798
589,-0.42381
590,-0.5534899999999999
591,-0.68316
592,-0.81283
593,-0.92385
594,-0.92385
595,-0.92385
596,-0.8091
597,-0.67943
598,-0.63092
599,-0.63092
600,-0.58334
601,-0.45366000000000006
602,-0.33798
603,-0.33798
604,-0.33798
605,-0.33798
606,-0.33798
607,-0.33798
608,-0.33798
609,-0.3809
610,-0.51057
611,-0.63092
612,-0.63092
613,-0.63092
614,-0.63092
615,-0.63092
616,-0.55908
617,-0.42941
618,-0.33798
619,-0.33798
620,-0.33332
621,-0.20364000000000002
622,-0.37074
623,0.27764
624,0.18538
625,0.31505
626,0.44473
627,0.5744
628,0.70408
629,0.83375
630,1.0476
631,1.0476
632,1.0476
633,1.0476
634,1.0476
635,1.0476
636,1.0476
637,1.0476
638,1.0476
639,1.0476
640,1.0476
641,1.0476
642,1.0476
643,1.0476
644,1.0476
645,1.0476
646,1.0476
647,1.0476
648,1.0476
649,1.0476
650,1.0476
651,1.0476
652,1.0476
653,1.0476
654,1.0476
655,1.0225
656,0.85674
657,0.69095
658,0.5251600000000001
659,0.35938000000000003
660,0.29855
661,0.29855
662,0.23651999999999998
663,0.3528
664,-0.11414
665,-0.44571000000000005
666,-0.7772899999999999
667,-0.96693
668,-1.1327
669,-1.1005
670,-0.93473
671,-0.7128800000000001
672,-0.38131
673,-0.31513
674,0.10294
675,0.26873
676,0.43451999999999996
677,0.60031
678,0.58003
679,0.41423999999999994
680,0.24845
681,0.41243
682,-0.45228999999999997
683,-0.42186
684,-0.75344
685,-0.825
686,-0.825
687,-0.825
688,-0.825
689,-0.78087
690,-0.6150800000000001
691,-0.45048
692,-0.45048
693,-0.45048
694,-0.45048
695,-0.45048
696,-0.53159
697,-0.69738
698,-0.8631700000000001
699,-1.0290000000000001
700,-1.1947
701,-1.3605
702,-1.5263
703,-1.574
704,-1.574
705,-1.574
706,-1.574
707,-1.574
708,-1.574
709,-1.574
710,-1.2639
711,-0.93234
712,-0.48865
713,0.28331999999999996
714,0.36772
715,0.53351
716,0.67306
717,0.67306
718,0.67306
719,0.37488
720,0.21563000000000002
721,-0.28826999999999997
722,-0.61985
723,-0.825
724,-0.825
725,-0.80472
726,-0.63893
727,-0.47313999999999995
728,-0.45048
729,-0.45048
730,-0.55067
731,-0.71646
732,-0.825
733,-0.825
734,-0.83931
735,-1.0051
736,-1.1709
737,-1.4738
738,-1.8054
739,-2.0428
740,-2.2086
741,-2.2205
742,-1.8889
743,-1.5657
744,-1.3999
745,-1.2341
746,-1.0683
747,-0.9025200000000001
748,-0.825
749,-0.825
750,-0.825
751,-0.825
752,-0.825
753,-0.825
754,-0.825
755,-0.69976
756,-0.53397
757,-0.45048
758,-0.45048
759,-0.45048
760,-0.45048
761,-0.45048
762,-0.28826999999999997
763,-0.12247999999999999
764,0.21563000000000002
765,0.20909
766,0.37488
767,0.54067
768,0.7064600000000001
769,0.87225
770,1.038
771,1.3601
772,1.6916
773,1.7966
774,1.7966
775,1.7966
776,1.7966
777,1.824
778,1.9898
779,2.1556
780,2.0208
781,1.8551
782,1.7966
783,1.7966
784,1.7322
785,1.5664
786,1.4006
787,1.2348
788,1.069
789,1.0476
790,1.0476
791,1.2503
792,1.5819
793,1.7382
794,1.5724
795,1.3911
796,1.0595
797,0.72793
798,0.53471
799,0.36891999999999997
800,0.39396
801,0.55975
802,0.67306
803,0.67306
804,0.67306
805,0.67306
806,0.67306
807,0.93785
808,1.2694
809,1.601
810,1.9326
811,2.1246
812,1.9588
813,1.7895
814,1.4579
815,1.1263
816,0.79472
817,0.46313999999999994
818,0.29855
819,0.29855
820,0.21744000000000002
821,-0.11414
822,-0.44571000000000005
823,-1.1041
824,-1.7672
825,-2.069
826,-2.2348
827,-2.2455
828,-2.0797
829,-1.8794
830,-1.5478
831,-1.2162
832,-0.8846299999999999
833,-0.55306
834,-0.33598
835,-0.17019
836,0.3349
837,0.39874
838,0.64444
839,0.47865
840,0.31285999999999997
841,0.29855
842,0.29855
843,0.19000999999999998
844,0.12021
845,-0.20717
846,-0.53874
847,-0.825
848,-0.825
849,-0.825
850,-0.825
851,-0.825
852,-0.72242
853,-0.5566399999999999
854,-0.45048
855,-0.45048
856,-0.43378
857,-0.268
858,-0.10221000000000001
859,0.31701999999999997
860,0.22937
861,0.39516
862,0.56095
863,0.56572
864,0.23414000000000001
865,-0.4344
866,-0.25249
867,-0.41828000000000004
868,-0.45048
869,-0.45048
870,-0.45048
871,-0.45048
872,-0.45048
873,-0.45048
874,-0.45048
875,-0.45048
876,-0.45048
877,-0.32286
878,-0.15707000000000002
879,-0.38073
880,-0.38073
881,-0.11771
882,-0.2835
883,-0.44928999999999997
884,-0.45048
885,-0.45048
886,-0.45048
887,-0.45048
888,-0.37176
889,-0.20597
890,-0.20182
891,0.1256
892,0.29139
893,0.6158100000000001
894,0.94739
895,1.1633
896,1.3291
897,1.4221
898,1.4221
899,1.3923
900,1.2265
901,1.0607
902,0.5895699999999999
903,0.46013999999999994
904,-0.29543
905,-0.6270100000000001
906,-0.9585799999999999
907,-1.2902
908,-1.5979
909,-1.7637
910,-1.9295
911,-1.8018
912,-1.6361
913,-1.574
914,-1.574
915,-1.4524
916,-1.1208
917,-0.80711
918,-0.64132
919,-0.47553
920,-0.16899999999999998
921,0.16258
922,0.39635
923,0.56214
924,0.6182
925,0.45241000000000003
926,0.27469
927,-0.28531
928,-0.38845999999999997
929,-0.45048
930,-0.45048
931,-0.35864
932,-0.19286
933,-0.13622
934,0.13872
935,0.30451
936,0.4703
937,0.6360899999999999
938,0.80188
939,0.96767
940,1.0476
941,1.0476
942,1.0476
943,1.0476
944,1.0476
