time,value
0,0.7027899999999999
1,1.5699
2,2.4507
3,3.2048
4,3.702
5,3.8539
6,3.6363
7,3.0982
8,2.3501
9,1.5372
10,0.80484
11,0.26432
12,-0.030012999999999998
13,-0.08794199999999999
14,0.026266
15,0.21741
16,0.38854
17,0.46753
18,0.42432
19,0.27271999999999996
20,0.06021
21,-0.15120999999999998
22,-0.30616
23,-0.37101999999999996
24,-0.3421
25,-0.24266999999999997
26,-0.11227000000000001
27,0.006910600000000001
28,0.08413
29,0.10649000000000002
30,0.079672
31,0.022494
32,-0.041906
33,-0.09422799999999999
34,-0.12454000000000001
35,-0.13333
36,-0.12857000000000002
37,-0.12054000000000001
38,-0.11685999999999999
39,-0.11955999999999999
40,-0.12512
41,-0.12716
42,-0.12013
43,-0.10259000000000001
44,-0.07850399999999999
45,-0.05614500000000001
46,-0.045119
47,-0.052689
48,-0.080946
49,-0.12566
50,-0.17769000000000001
51,-0.22595
52,-0.2611
53,-0.27934000000000003
54,-0.28054
55,-0.27111999999999997
56,-0.26039
57,-0.25704
58,-0.26804
59,-0.29074
60,-0.31971
61,-0.34858
62,-0.37106
63,-0.38345999999999997
64,-0.38465
65,-0.37682
66,-0.36538000000000004
67,-0.35612
68,-0.35328000000000004
69,-0.35766
70,-0.3657
71,-0.37259000000000003
72,-0.37340999999999996
73,-0.36535
74,-0.34959
75,-0.33037
76,-0.31590999999999997
77,-0.31558
78,-0.33712
79,-0.38461999999999996
80,-0.45583
81,-0.54397
82,-0.63895
83,-0.7297
84,-0.80714
85,-0.86506
86,-0.90212
87,-0.9216
88,-0.92947
89,-0.9325
90,-0.9356399999999999
91,-0.94099
92,-0.9482799999999999
93,-0.95511
94,-0.95835
95,-0.95537
96,-0.94445
97,-0.92661
98,-0.9047
