time,value
0,0.58886
1,0.35669
2,-0.023752000000000002
3,-0.13379000000000002
4,-0.29172
5,0.8301
6,0.14697000000000002
7,-0.21083000000000002
8,0.18184
9,0.006887899999999999
10,-0.035351
11,-0.33776
12,-0.13254000000000002
13,-0.14514000000000002
14,-0.02223
15,0.29764
16,-0.054327999999999994
17,-0.25642
18,0.12532000000000001
19,-0.13469
20,1.4774
21,1.4774
22,1.4774
23,1.4774
24,1.4774
25,1.4774
26,1.4774
27,1.4774
28,1.4774
29,1.4774
30,1.4774
31,1.4774
32,-1.4754
33,-1.4754
34,-1.4754
35,-1.4754
36,-1.4754
37,-1.4754
38,-1.4754
39,-1.4754
40,-1.4754
41,-1.4754
42,-1.4754
43,-1.4754
44,0.061663
45,-0.041767
46,-0.072732
47,-0.24625
48,0.34638
49,0.44321000000000005
50,-0.25306
51,-0.17165999999999998
52,0.2614
53,0.32159
54,0.5102
55,-0.05395
56,0.66627
57,-0.19705999999999999
58,0.16430999999999998
59,-0.38938
60,0.019844999999999998
61,-0.29495
62,0.06726599999999999
63,-0.013627
64,0.8205399999999999
65,-0.18283
66,-0.51483
67,0.62053
68,0.19565
69,0.23206
70,0.49781000000000003
71,-0.12054000000000001
72,0.34456
73,-0.085254
74,-0.48954
75,-0.044119
76,-0.47217
77,-1.4754
78,-1.4754
79,-1.4754
80,-1.4754
81,-1.4754
82,-1.4754
83,-1.4754
84,-1.4754
85,-1.4754
86,-1.4754
87,-1.4754
88,-1.4754
89,-1.4754
90,-1.4754
91,-1.4754
92,-1.4754
93,1.4774
94,1.4774
95,1.4774
96,1.4774
97,1.4774
98,1.4774
99,1.4774
100,1.4774
101,1.4774
102,1.4774
103,1.4774
104,1.4774
105,1.4774
106,1.4774
107,1.4774
108,0.036733
109,0.33716999999999997
110,-0.1666
111,-0.21884
112,0.06946799999999999
113,-0.18664
114,0.072573
115,-0.77442
116,0.057162
117,0.10869000000000001
118,-0.12971
119,-0.14974
120,0.31188
121,-0.016619
122,-0.46053
123,0.16760999999999998
124,0.063471
125,-0.11132
126,-0.40681999999999996
127,0.13218
