time,value
0,-0.22553
1,-0.22553
2,-0.22553
3,-0.22553
4,-0.22553
5,-0.22553
6,-0.22553
7,-0.22553
8,-0.22553
9,-0.22553
10,-0.22553
11,-0.22553
12,-0.22553
13,-0.22553
14,-0.22553
15,-0.22553
16,-0.22553
17,-0.22553
18,-0.22553
19,-0.22553
20,-0.22553
21,-0.22553
22,-0.22553
23,-0.22553
24,-0.22553
25,-0.22553
26,-0.22553
27,-0.22553
28,-0.22553
29,-0.22553
30,-0.22553
31,-0.22553
32,-0.22553
33,-0.22553
34,-0.22553
35,-0.22553
36,-0.22553
37,-0.22553
38,-0.22553
39,-0.22553
40,-0.22553
41,-0.22553
42,-0.22553
43,-0.22553
44,-0.22553
45,-0.051596
46,-0.11082
47,-0.18815
48,-0.2438
49,-0.27021
50,-0.27021
51,-0.27021
52,-0.32879
53,-0.40436
54,-0.47744
55,-0.091238
56,-0.092875
57,-0.092875
58,-0.092875
59,-0.092875
60,-0.092875
61,-0.092875
62,-0.092875
63,-0.092875
64,-0.092875
65,-0.092875
66,-0.092875
67,-0.092875
68,-0.092875
69,-0.092875
70,-0.092875
71,-0.10278
72,-0.11623
73,-0.1317
74,-0.14717
75,-0.16263
76,-0.1781
77,-0.19355999999999998
78,-0.20903000000000002
79,-0.2245
80,-0.23995999999999998
81,-0.25543000000000005
82,-0.27089
83,-0.28636
84,-0.30183000000000004
85,-0.31729
86,-0.33276
87,-0.34823000000000004
88,-0.36369
89,-0.37916
90,-0.39461999999999997
91,-0.41008999999999995
92,-0.42527
93,-0.43976000000000004
94,-0.43976000000000004
95,-0.43976000000000004
96,-0.44638
97,-0.46721
98,-0.49783999999999995
99,-0.5259199999999999
100,-0.54929
101,-0.56475
102,-0.58022
103,-0.61214
104,-0.6566
105,-0.703
106,-0.7494
107,-0.7958
108,-0.84172
109,-0.88559
110,-0.91858
111,-0.94952
112,-0.97867
113,-0.99745
114,-1.0136
115,-1.0319
116,-1.0546
117,-1.0856
118,-1.1165
119,-1.1474
120,-1.1784
121,-1.2093
122,-1.2329999999999999
123,-1.2519
124,-1.2674
125,-1.2872
126,-1.3144
127,-1.3453
128,-1.3763
129,-1.3801
130,-1.3813
131,-1.3813
132,-1.3813
133,-1.3813
134,-1.3813
135,-1.3813
136,-1.3813
137,-1.3813
138,-1.3813
139,-1.3813
140,-1.3813
141,-1.3813
142,-1.3813
143,-1.3813
144,-1.3813
145,-1.3813
146,-1.3813
147,-1.3803
148,-1.3705
149,-1.3564
150,-1.3425
151,-1.3318
152,-1.3318
153,-1.3318
154,-1.3318
155,-1.3318
156,-1.3318
157,-1.3265
158,-1.3163
159,-1.3008
160,-1.2854
161,-1.2699
162,-1.2544
163,-1.239
164,-1.2127
165,-1.1834
166,-1.1552
167,-1.1356
168,-1.1335
169,-1.1335
170,-1.1305
171,-1.1152
172,-1.0998
173,-1.0843
174,-1.0688
175,-1.0534
176,-1.0379
177,-1.0224
178,-1.0070000000000001
179,-0.99149
180,-0.97603
181,-0.9605600000000001
182,-0.9456100000000001
183,-0.9375600000000001
184,-0.9353100000000001
185,-0.9335399999999999
186,-0.92774
187,-0.88134
188,-0.83494
189,-0.78484
190,-0.72723
191,-0.6654399999999999
192,-0.5967600000000001
193,-0.51835
194,-0.42556000000000005
195,-0.33276
196,-0.23108
197,-0.12318
198,-0.12818
199,0.41313999999999995
200,0.20160999999999998
201,0.30787
202,0.40619
203,0.47338
204,0.5352399999999999
205,0.59916
206,0.67397
207,0.7508199999999999
208,0.82486
209,0.89412
210,0.95599
211,1.0198
212,1.0961
213,1.1889
214,1.2817
215,1.3903
216,1.5084
217,1.6318
218,1.7454
219,1.8448
220,1.9376
221,2.0304
222,2.1087
223,2.1863
224,2.2559
225,2.3068
226,2.3388
227,2.3661
228,2.3849
229,2.3849
230,2.3849
231,2.3779
232,2.3647
233,2.3492
234,2.3163
235,2.2671
236,2.2054
237,2.1445
238,2.0954
239,2.049
240,2.0014
241,1.9444
242,1.8836
243,1.8238
244,1.7675
245,1.7211
246,1.6747
247,1.6283
248,1.5819
249,1.5355
250,1.4891
251,1.4427
252,1.3963
253,1.3499
254,1.3035
255,1.2571
256,1.2107
257,1.1293
258,1.0403
259,0.9573
260,0.9033200000000001
261,0.89822
262,0.89717
263,0.88592
264,0.83952
265,0.7931199999999999
266,0.752
267,0.71673
268,0.6858
269,0.65487
270,0.6239399999999999
271,0.593
272,0.56207
273,0.54205
274,0.52577
275,0.51031
276,0.49483999999999995
277,0.47936999999999996
278,0.46481999999999996
279,0.45223
280,0.45223
281,0.45223
282,0.45223
283,0.45223
284,0.45223
285,0.45223
286,0.45223
287,0.45223
288,0.45193
289,0.44243999999999994
290,0.42698
291,0.41151000000000004
292,0.39605
293,0.38058000000000003
294,0.36599
295,0.35463
296,0.35312
297,0.35312
298,0.35312
299,0.35312
300,0.35312
301,0.34936
302,0.34049
303,0.32503000000000004
304,0.31277
305,0.31303000000000003
306,0.3285
307,0.34397
308,0.35081
309,0.35312
310,0.35336999999999996
311,0.35921
312,0.37174
313,0.38721
314,0.40267
315,-0.73172
316,-0.73172
317,-0.73172
318,-0.73172
319,-0.73172
320,-0.73172
321,-0.73172
322,-0.73172
323,-0.73172
324,-0.73172
325,-0.73172
326,-0.73172
327,-0.73172
328,-0.73172
329,-0.73172
330,-0.73172
331,-0.73172
332,-0.73172
333,-0.73172
334,-0.73172
335,-0.73172
336,-0.73172
337,-0.73172
338,-0.73172
339,-0.73172
340,-0.73172
341,-0.73172
342,-0.73172
343,-0.73172
344,-0.73172
345,-0.73172
346,-0.73172
347,-0.73172
348,-0.73172
349,-0.73172
350,-0.73172
351,-0.73172
352,-0.73172
353,-0.7279899999999999
354,-0.71395
355,-0.68535
356,-0.6570199999999999
357,-0.6359199999999999
358,-0.6359199999999999
359,-0.6359199999999999
360,-0.6359199999999999
361,-0.6359199999999999
362,-0.6359199999999999
363,-0.64431
364,-0.66399
365,-0.69389
366,-0.7237899999999999
367,-0.7310399999999999
368,-0.73172
369,-0.73172
370,-0.73172
371,-0.73172
372,-0.73172
373,-0.73172
374,-0.73172
375,-0.73172
376,-0.72292
377,-0.69816
378,-0.6682600000000001
379,-0.6472399999999999
380,-0.6359199999999999
381,-0.6359199999999999
382,-0.6338600000000001
383,-0.61457
384,-0.58467
385,-0.55477
386,-0.56316
387,-0.58528
388,-0.61303
389,-0.63347
390,-0.6359199999999999
391,-0.6359199999999999
392,-0.6359199999999999
393,-0.6359199999999999
394,-0.6359199999999999
395,-0.6359199999999999
396,-0.6359199999999999
397,-0.6359199999999999
398,-0.6359199999999999
399,-0.6359199999999999
400,-0.6359199999999999
401,-0.6359199999999999
402,-0.6359199999999999
403,-0.6359199999999999
404,-0.63521
405,-0.6224
406,-0.59748
407,-0.56814
408,-0.54013
409,-0.54013
410,-0.54013
411,-0.53373
412,-0.5136
413,-0.48399
414,-0.4596
415,-0.44433
416,-0.44433
417,-0.44433
418,-0.44433
419,-0.44433
420,-0.44433
421,-0.44433
422,-0.44433
423,-0.44433
424,-0.44433
425,-0.44433
426,-0.44433
427,-0.44776000000000005
428,-0.47125
429,-0.49985
430,-0.52425
431,-0.54013
432,-0.54013
433,-0.54013
434,-0.54013
435,-0.54013
436,-0.54013
437,-0.52622
438,-0.5029100000000001
439,-0.47315
440,-0.45148999999999995
441,-0.44433
442,-0.44433
443,-0.44433
444,-0.41817
445,-0.38941
446,-0.36385
447,-0.34952
448,-0.34853
449,-0.34604
450,-0.33571999999999996
451,-0.30582
452,-0.27592
453,-0.25839
454,-0.25273
455,-0.25273
456,-0.24293
457,-0.22221999999999997
458,-0.19233
459,-0.16243
460,-0.13253
461,-0.10263
462,-0.41726
463,-0.26777
464,-0.11827
465,0.11882999999999999
466,0.1197
467,0.1197
468,0.1197
469,0.16812
470,0.2997
471,0.4492
472,0.12039000000000001
473,0.13046
474,0.13046
475,0.13404000000000002
476,0.15425999999999998
477,0.18416
478,0.21405
479,0.26479
480,0.32145
481,0.3786
482,0.42741999999999997
483,0.45935
484,0.48925
485,0.5191399999999999
486,0.54904
487,0.57894
488,0.6088399999999999
489,0.63874
490,0.66864
491,0.6985399999999999
492,0.72844
493,0.7583300000000001
494,0.78823
495,0.79855
496,0.80105
497,0.80203
498,0.8163699999999999
499,0.84193
500,0.87297
501,0.90661
502,0.9664
503,1.0262
504,1.0932
505,1.1746
506,1.2642
507,1.3605
508,1.4661
509,1.5857
510,1.7053
511,1.8249
512,1.9445
513,2.0641
514,2.1678
515,2.263
516,2.3501
517,2.427
518,2.4638
519,2.4937
520,2.5196
521,2.5245
522,2.5254
523,2.5254
524,2.5254
525,2.5254
526,2.5254
527,2.5254
528,2.5254
529,2.5254
530,2.5407
531,2.5651
532,2.5944
533,2.6048
534,2.5876
535,2.5578
536,2.5279
537,2.4699
538,2.4107
539,2.3459
540,2.269
541,2.1801
542,2.0904
543,2.0007
544,1.911
545,1.8213
546,1.7181
547,1.6028
548,1.4832
549,1.3636
550,1.244
551,1.1244
552,1.0048
553,0.88525
554,0.76566
555,0.64852
556,0.5493600000000001
557,0.45752
558,0.37171
559,0.29277
560,0.23296999999999998
561,0.17317000000000002
562,0.11337
563,0.21428000000000003
564,-0.084711
565,-0.32713000000000003
566,-0.093477
567,-0.12337000000000001
568,-0.15327000000000002
569,-0.18317
570,-0.21306999999999998
571,-0.24297
572,-0.27287
573,-0.30277
574,-0.3295
575,-0.34689000000000003
576,-0.34853
577,-0.34853
578,-0.34853
579,-0.34853
580,-0.34853
581,-0.36896
582,-0.41198999999999997
583,-0.47179
584,-0.52458
585,-0.56575
586,-0.59565
587,-0.62555
588,-0.63436
589,-0.6359199999999999
590,-0.6359199999999999
591,-0.6359199999999999
592,-0.6359199999999999
593,-0.6359199999999999
594,-0.6359199999999999
595,-0.6359199999999999
596,-0.6359199999999999
597,-0.6359199999999999
598,-0.6359199999999999
599,-0.6359199999999999
600,-0.62821
601,-0.6109100000000001
602,-0.58101
603,-0.5522699999999999
604,-0.55904
605,-0.58894
606,-0.61884
607,-0.63125
608,-0.6359199999999999
609,-0.6359199999999999
610,-0.6359199999999999
611,-0.6359199999999999
612,-0.6359199999999999
613,-0.6359199999999999
614,-0.6359199999999999
615,-0.6359199999999999
616,-0.6359199999999999
617,-0.6359199999999999
618,-0.6359199999999999
619,-0.6359199999999999
620,-0.6359199999999999
621,-0.6359199999999999
622,-0.6359199999999999
623,-0.6359199999999999
624,-0.6359199999999999
625,-0.6359199999999999
626,-0.6359199999999999
627,-0.6359199999999999
628,-0.6359199999999999
629,-0.6359199999999999
630,0.15182
631,0.15182
632,0.15182
633,0.15182
634,0.15182
635,0.15182
636,0.15182
637,0.15182
638,0.15182
639,0.15182
640,0.15182
641,0.15182
642,0.15182
643,0.15182
644,0.15182
645,0.15182
646,0.15182
647,0.15182
648,0.15182
649,0.15182
650,0.15182
651,0.15182
652,0.16614
653,0.20414000000000002
654,0.29568
655,0.38723
656,0.44337
657,0.44515
658,0.44515
659,0.44515
660,0.44515
661,0.44515
662,0.44515
663,0.44515
664,0.44515
665,0.44515
666,0.44515
667,0.44515
668,0.44515
669,0.44515
670,0.44515
671,0.44515
672,0.44515
673,0.44515
674,0.44515
675,0.41063
676,0.34052
677,0.24898
678,0.1831
679,0.15182
680,0.15182
681,0.15182
682,0.15182
683,0.15182
684,0.15182
685,0.15182
686,0.15182
687,0.15182
688,0.15182
689,0.15182
690,0.15182
691,0.15182
692,0.15182
693,0.15182
694,0.17899
695,0.2359
696,0.32745
697,0.41268
698,0.44515
699,0.44515
700,0.44515
701,0.44515
702,0.44515
703,0.43856000000000006
704,0.4096
705,0.32558000000000004
706,0.23403000000000002
707,0.15834
708,0.15274000000000001
709,0.15182
710,0.15182
711,0.15182
712,0.15182
713,0.15182
714,0.15182
715,0.15182
716,0.15182
717,0.15182
718,0.15182
719,0.15400999999999998
720,0.19325
721,0.26953
722,0.35939
723,0.44515
724,0.44515
725,0.44515
726,0.46473000000000003
727,0.5263899999999999
728,0.6170399999999999
729,0.70858
730,0.80013
731,0.8916799999999999
732,0.9832299999999999
733,1.0748
734,1.1663
735,1.2579
736,1.3056
737,1.3251
738,1.3223
739,1.3074
740,1.228
741,1.1364
742,1.0554
743,1.0358
744,1.0318
745,1.0318
746,1.0318
747,1.0318
748,1.0318
749,1.0318
750,1.0318
751,1.0318
752,1.0318
753,1.0318
754,1.0318
755,1.0318
756,1.0318
757,1.0318
758,1.0318
759,1.0318
760,1.0318
761,1.0185
762,0.9708700000000001
763,0.88234
764,0.79079
765,0.69924
766,0.60769
767,0.51615
768,0.46248999999999996
769,0.44515
770,0.44515
771,0.41513999999999995
772,0.35173000000000004
773,0.26033
774,0.16971
775,0.15182
776,0.15182
777,0.15182
778,0.15182
779,0.15182
780,0.1422
781,0.11445999999999999
782,0.33028
783,-0.39681
784,-0.13053
785,-0.1415
786,-0.1415
787,-0.11066
788,-0.30339
789,0.15435
790,0.14411
791,0.29755
792,0.48065
793,0.66375
794,0.78304
795,0.88421
796,0.9757600000000001
797,1.0673
798,1.1589
799,1.2504
800,1.3241
801,1.325
802,1.3251
803,1.297
804,1.2355
805,1.1439
806,1.035
807,0.88981
808,0.70672
809,0.52362
810,0.34052
811,0.15743
812,-0.1518
813,-0.11492000000000001
814,-0.1415
815,-0.1415
816,-0.1415
817,-0.1415
818,-0.1415
819,-0.1415
820,-0.1415
821,-0.1415
822,-0.18185
823,-0.27976
824,-0.46286000000000005
825,-0.64595
826,-0.82905
827,-1.0121
828,-1.1952
829,-1.4269
830,-1.6847
831,-1.9515
832,-2.1869
833,-2.2994
834,-2.391
835,-2.4947
836,-2.6628
837,-2.8431
838,-3.0067
839,-3.142
840,-3.2336
841,-3.3137
842,-3.3195
843,-3.228
844,-3.1364
845,-3.0449
846,-2.9533
847,-2.8627
848,-2.801
849,-2.7815
850,-2.7815
851,-2.7815
852,-2.6099
853,-2.4302
854,-2.2471
855,-2.064
856,-1.8809
857,-1.6872
858,-1.4680000000000002
859,-1.1934
860,-0.9187299999999999
861,-0.7268399999999999
862,-0.60859
863,-0.5170399999999999
864,-0.45997
865,-0.43483
866,-0.43575
867,-0.44135
868,-0.5170399999999999
869,-0.60859
870,-0.70014
871,-0.79168
872,-0.88323
873,-0.9628700000000001
874,-1.0215
875,-1.0215
876,-1.0215
877,-1.0215
878,-1.0215
879,-1.0215
880,-1.0215
881,-1.0215
882,-1.0215
883,-1.0057
884,-0.94115
885,-0.8496
886,-0.75805
887,-0.52828
888,-0.26855
889,-0.16862
890,0.13674
891,0.15182
892,0.15182
893,0.15182
894,0.15182
895,0.15182
896,0.15182
897,0.15182
898,0.15182
899,0.15182
900,0.15182
901,0.15182
902,0.15182
903,0.15182
904,0.15182
905,0.15182
906,0.15182
907,0.15182
908,0.15724000000000002
909,0.17424
910,0.26579
911,0.35734
912,0.42451000000000005
913,0.44506
914,0.44515
915,0.44515
916,0.44515
917,0.44515
918,0.44515
919,0.44515
920,0.44515
921,0.44515
922,0.4987
923,0.57593
924,0.66227
925,0.72953
926,0.73848
927,0.73848
928,0.73848
929,0.73848
930,0.73848
931,0.73848
932,0.73848
933,0.73848
934,0.7289899999999999
935,0.68243
936,0.5908800000000001
937,0.49933
938,0.45881000000000005
939,0.44515
940,0.44515
941,0.44515
942,0.44515
943,0.44515
944,0.44515
