time,value
0,1.9739
1,1.8605
2,1.6849
3,1.5383
4,1.3629
5,1.2184
6,1.0739
7,0.9028799999999999
8,0.76417
9,0.59835
10,0.45885
11,0.32504
12,0.1713
13,0.036728
14,-0.10826
15,-0.21866
16,-0.32163
17,-0.42905
18,-0.53005
19,-0.63156
20,-0.7315699999999999
21,-0.8052699999999999
22,-0.88712
23,-0.9113399999999999
24,-0.8930100000000001
25,-0.93355
26,-0.9338200000000001
27,-0.92542
28,-0.92175
29,-0.90538
30,-0.9304
31,-0.9991200000000001
32,-1.0795
33,-1.1508
34,-1.2559
35,-1.3459
36,-1.3801
37,-1.4557
38,-1.4644
39,-1.3919
40,-1.3178
41,-1.1875
42,-1.0146
43,-0.86754
44,-0.6916
45,-0.5443899999999999
46,-0.3971
47,-0.2172
48,-0.065451
49,0.11537
50,0.26303000000000004
51,0.41568999999999995
52,0.5919
53,0.7396
54,0.92105
55,1.0743
56,1.2277
57,1.4097
58,1.5634
59,1.7457
60,1.9062
61,2.0349
62,1.9446
63,1.7919999999999998
64,1.6157
65,1.4681
66,1.2918
67,1.1395
68,0.98746
69,0.8071
70,0.65964
71,0.47972
72,0.33239
73,0.18185
74,0.0031265
75,-0.14373
76,-0.32144
77,-0.46921999999999997
78,-0.6139399999999999
79,-0.78878
80,-0.93434
81,-1.1084
82,-1.2451
83,-1.3054
84,-1.3335
85,-1.3455
86,-1.315
87,-1.2373
88,-1.148
89,-1.1058
90,-1.0249
91,-0.8807299999999999
92,-0.75793
93,-0.7409399999999999
94,-0.6017
95,-0.54079
96,-0.5271100000000001
97,-0.44128
98,-0.43225
99,-0.43686
100,-0.49733999999999995
101,-0.39336
102,-0.4621
103,-0.455
104,-0.37165
105,-0.40618000000000004
106,-0.38766999999999996
107,-0.33516999999999997
108,-0.27309
109,-0.17973
110,-0.18062
111,-0.052702
112,0.016191
113,0.063263
114,0.19591
115,0.25927
116,0.39466
117,0.50085
118,0.62069
119,0.7396
120,0.8645
121,1.0236
122,1.1587
123,1.2990000000000002
124,1.4705
125,1.6153
126,1.7923
127,1.943
