time,value
0,0.16715
1,0.16715
2,0.16715
3,0.16715
4,0.16715
5,0.16715
6,0.16715
7,0.16715
8,0.16715
9,0.16715
10,0.16715
11,0.16715
12,0.16715
13,0.16715
14,0.16715
15,0.16715
16,0.16715
17,0.16715
18,0.16715
19,0.16715
20,0.16715
21,0.16715
22,0.16715
23,0.16715
24,0.16715
25,0.16715
26,0.16715
27,0.16715
28,0.16715
29,0.16715
30,0.16715
31,0.16715
32,0.16715
33,0.16771
34,0.16962
35,0.17992
36,0.1946
37,0.20928000000000002
38,0.22396
39,0.23864000000000002
40,0.25332
41,0.26639
42,0.26703000000000005
43,0.26736
44,0.26736
45,0.27813000000000004
46,0.29129
47,0.30596999999999996
48,0.32066
49,0.33534
50,0.35002
51,0.3647
52,0.37938
53,0.39405999999999997
54,0.40846
55,0.4142
56,0.41767
57,0.41767
58,0.4235
59,0.43203
60,0.44671000000000005
61,0.45826999999999996
62,0.46657
63,0.46778000000000003
64,0.46778000000000003
65,0.46778000000000003
66,0.46778000000000003
67,0.46778000000000003
68,0.47141000000000005
69,0.47863
70,0.49331
71,0.50626
72,0.51788
73,0.51788
74,0.5184
75,0.51968
76,0.5312899999999999
77,0.54597
78,0.56065
79,0.56799
80,0.56799
81,0.56799
82,0.56799
83,0.56799
84,0.56799
85,0.56799
86,0.5796100000000001
87,0.5925600000000001
88,0.60724
89,0.62192
90,0.6366
91,0.65128
92,0.66197
93,0.66708
94,0.6682
95,0.6694100000000001
96,0.6777
97,0.68926
98,0.70394
99,0.71862
100,0.7333
101,0.74798
102,0.76613
103,0.78656
104,0.8156399999999999
105,0.845
106,0.87436
107,0.9037200000000001
108,0.9330799999999999
109,0.96244
110,0.9918
111,1.0212
112,1.0505
113,1.0799
114,1.1092
115,1.1389
116,1.1689
117,1.2114
118,1.2554
119,1.2995
120,1.3435
121,1.3875
122,1.4316
123,1.4756
124,1.5197
125,1.5637
126,1.6069
127,1.6395
128,1.6706
129,1.7
130,1.7129
131,1.7204
132,1.7204
133,1.7204
134,1.7204
135,1.7204
136,1.7164
137,1.7011
138,1.6769999999999998
139,1.6476
140,1.6183
141,1.5889
142,1.5595
143,1.5302
144,1.5008
145,1.4715
146,1.4438
147,1.4183
148,1.4016
149,1.3869
150,1.3722
151,1.3575
152,1.3429
153,1.3259
154,1.3014
155,1.2573
156,1.2133
157,1.1692
158,1.1546
159,1.1399
160,1.1252
161,1.1007
162,1.0725
163,1.0432
164,1.0138
165,0.98446
166,0.9551
167,0.9277799999999999
168,0.90927
169,0.89287
170,0.8781899999999999
171,0.84596
172,0.8092600000000001
173,0.7652100000000001
174,0.72653
175,0.69086
176,0.6614899999999999
177,0.63213
178,0.60277
179,0.5734100000000001
180,0.54345
181,0.50835
182,0.46905
183,0.42501000000000005
184,0.3847
185,0.34714
186,0.31778
187,0.28483
188,0.24909
189,0.19204000000000002
190,0.13388
191,0.077073
192,0.028644
193,-0.015397
194,-0.059438
195,-0.10347999999999999
196,-0.14752
197,-0.19155999999999998
198,-0.2356
199,-0.27964
200,-0.32368
201,-0.36773
202,-0.401
203,-0.43187
204,-0.46123000000000003
205,-0.49718
206,-0.53803
207,-0.58187
208,-0.6259100000000001
209,-0.66995
210,-0.71399
211,-0.75775
212,-0.79286
213,-0.8256899999999999
214,-0.85505
215,-0.88441
216,-0.9137700000000001
217,-0.9431299999999999
218,-0.97562
219,-1.0114
220,-1.0542
221,-1.0982
222,-1.1423
223,-1.1863
224,-1.2304
225,-1.2635
226,-1.2859
227,-1.2859
228,-1.2876
229,-1.2907
230,-1.3054
231,-1.3195
232,-1.3329
233,-1.3359999999999999
234,-1.3359999999999999
235,-1.3359999999999999
236,-1.3359999999999999
237,-1.3359999999999999
238,-1.3359999999999999
239,-1.3329
240,-1.3195
241,-1.3054
242,-1.2907
243,-1.2992
244,-1.3105
245,-1.3251
246,-1.3324
247,-1.3359999999999999
248,-1.3359999999999999
249,-1.34
250,-1.3496
251,-1.3631
252,-1.3778
253,-1.3925
254,-1.4072
255,-1.4218
256,-1.4304
257,-1.4362
258,-1.4362
259,-1.4362
260,-1.4362
261,-1.4362
262,-1.4362
263,-1.4362
264,-1.4362
265,-1.4362
266,-1.4362
267,-1.4362
268,-1.4362
269,-1.4347
270,-1.4308
271,-1.4161
272,-1.4014
273,-1.3867
274,-1.3721
275,-1.3574
276,-1.3427
277,-1.3366
278,-1.3359999999999999
279,-1.3359999999999999
280,-1.3316
281,-1.3188
282,-1.3047
283,-1.2909
284,-1.2877
285,-1.2859
286,-1.2859
287,-1.2859
288,-1.2859
289,-1.2859
290,-1.2811
291,-1.2722
292,-1.2581
293,-1.2454
294,-1.2384
295,-1.2358
296,-1.2358
297,-1.2295
298,-1.2201
299,-1.2055
300,-1.1908
301,-1.1761
302,-1.1614
303,-1.1467
304,-1.1321
305,-1.1174
306,-1.1027
307,-1.088
308,-1.0733
309,-1.0587
310,-1.044
311,-1.0293
312,-1.0146
313,-0.9999399999999999
314,-0.98526
