time,value
0,-0.40952
1,-0.40952
2,-0.40952
3,-0.40952
4,-0.40952
5,-0.40952
6,-0.40952
7,-0.40952
8,-0.40952
9,-0.40952
10,-0.40952
11,-0.40952
12,-0.40952
13,-0.40952
14,-0.40952
15,-0.40952
16,-0.40952
17,-0.48278000000000004
18,-0.14319
19,-0.15098
20,-0.15311
21,-0.1747
22,-0.22193000000000002
23,-0.23046
24,-0.23185999999999998
25,-0.23185999999999998
26,-0.21857
27,-0.16791
28,-0.15639
29,-0.15311
30,-0.15311
31,-0.14753
32,-0.098879
33,-0.4383
34,-0.40952
35,-0.46942
36,-0.1335
37,-0.19374
38,-0.22304000000000002
39,-0.23185999999999998
40,-0.22705
41,-0.18191
42,-0.47484
43,-0.2069
44,0.23551999999999998
45,0.10260999999999999
46,-0.11397
47,-0.25587
48,-0.37211
49,-0.44135
50,-0.41878000000000004
51,-0.1984
52,0.16186
53,0.62632
54,1.1520000000000001
55,1.5088
56,1.683
57,1.6785
58,1.5092
59,1.1902
60,0.80474
61,0.42941
62,0.45255
63,-0.16879
64,-0.37888
65,-0.47600000000000003
66,-0.43978
67,-0.27598
68,-0.13705
69,-0.47489
70,-0.40952
71,-0.48278000000000004
72,-0.15523
73,-0.33391
74,-0.47373000000000004
75,-0.59242
76,-0.72511
77,-0.93676
78,-1.077
79,-1.1226
80,-1.0735
81,-0.9521
82,-0.85767
83,-0.7673
84,-0.66671
85,-0.54533
86,-0.42396000000000006
87,-0.32366999999999996
88,-0.2459
89,-0.19055999999999998
90,-0.15595
91,-0.1766
92,-0.22434
93,-0.28502
94,-0.34433
95,-0.38094
96,-0.37119
97,-0.34081999999999996
98,-0.3106
99,-0.3106
100,-0.37084
101,-0.48235
102,-0.58791
103,-0.62457
104,-0.60401
105,-0.56815
106,-0.5747399999999999
107,-0.66027
108,-0.8614
109,-1.0833
110,-1.2927
111,-1.5011
112,-1.7238
113,-1.8888
114,-2.0209
115,-2.1423
116,-2.2693
117,-2.4218
118,-2.628
119,-2.7677
120,-2.8215
121,-2.7899
122,-2.655
123,-2.4849
124,-2.3086
125,-2.1473
126,-2.0259
127,-1.8943
128,-1.732
129,-1.55
130,-1.3679
131,-1.1858
132,-0.98267
133,-0.71096
134,-0.38182
135,-0.13907
136,0.11775999999999999
137,0.45205
138,0.88925
139,1.443
140,2.0304
141,2.4728
142,2.7041
143,2.695
144,2.4573
145,2.2718
146,2.1293
147,2.0266
148,1.9579
149,1.7698
150,1.5003
151,1.2255
152,0.9939
153,0.81484
154,0.73766
155,0.6772600000000001
156,0.63434
157,0.63434
158,0.5129600000000001
159,0.39158000000000004
160,0.24475999999999998
161,0.32136
162,-0.29305
163,-0.12265
164,-0.1184
165,-0.26394
166,0.3279
167,0.19447
168,0.3558
169,0.48856000000000005
170,0.5424899999999999
171,0.49183000000000004
172,0.38613000000000003
173,0.23671999999999999
174,0.25756
175,-0.12302
176,-0.14673
177,-0.43283
178,0.45341000000000004
179,0.37413
180,0.62541
181,0.8263799999999999
182,0.9282299999999999
183,0.90945
184,0.75748
185,0.42938999999999994
186,0.16685999999999998
187,-0.23911999999999997
188,-0.29944
189,-0.20214000000000001
190,0.13574
191,0.29508
192,0.51163
193,0.6129399999999999
194,0.58473
195,0.50163
196,0.44293999999999994
197,0.47773000000000004
198,0.67384
199,0.8716
200,1.0141
201,1.0891
202,1.1061
203,1.0654
204,1.0105
205,0.9498200000000001
206,0.90551
207,1.0113
208,1.1457
209,1.2337
210,1.2357
211,1.1153
212,0.86093
213,0.5976100000000001
214,0.38511
215,0.26761999999999997
216,0.24505
217,0.27083
218,0.33953
219,0.45955
220,0.65415
221,0.8601
222,0.9805799999999999
223,1.0151
224,0.9750700000000001
225,0.87977
226,0.76374
227,0.6594399999999999
228,0.58498
229,0.5574
230,0.5555899999999999
231,0.57638
232,0.61879
233,0.67948
234,0.74016
235,0.8249299999999999
236,0.9162100000000001
237,1.0073
238,1.0976
239,1.1358
240,1.1093
241,1.0387
242,0.94781
243,0.8264299999999999
244,0.74724
245,0.71308
246,0.72377
247,0.77593
248,0.91512
249,1.0842
250,1.2663
251,1.4456
252,1.5795
253,1.6025
254,1.5386
255,1.4128
256,1.2689
257,1.1103
258,1.0147
259,0.99039
260,1.0291
261,1.0496
262,1.0855
263,1.0603
264,0.9273299999999999
265,0.64294
266,0.39609
267,0.14224
268,-0.10377
269,-0.3134
270,-0.38161
271,-0.58145
272,-0.8092
273,-0.99815
274,-1.0884
275,-1.0981
276,-1.1157
277,-1.1788
278,-1.3153
279,-1.4838
280,-1.6172
281,-1.7328
282,-1.8292
283,-1.8658
284,-1.8163
285,-1.749
286,-1.6618
287,-1.5404
288,-1.4191
289,-1.3047
290,-1.22
291,-1.1740000000000002
292,-1.1569
293,-1.0414
294,-0.8808799999999999
295,-0.69881
296,-0.51685
297,-0.34131
298,-0.20967
299,-0.12095
300,-0.40952
301,-0.40952
302,-0.40952
303,-0.42118999999999995
304,-0.09744
305,-0.1581
306,-0.21578000000000003
307,-0.23185999999999998
308,-0.23012
309,-0.20923000000000003
310,-0.090862
311,-0.4052
312,-0.2304
313,-0.15867
314,-0.15867
315,0.43486
316,0.43486
317,0.43486
318,0.43486
319,0.43486
320,0.43486
321,0.43486
322,0.43486
323,0.43486
324,0.43486
325,0.43486
326,0.43486
327,0.43486
328,0.43486
329,0.43486
330,0.43486
331,0.43486
332,0.43486
333,0.43486
334,0.43486
335,0.43486
336,0.39455999999999997
337,0.30638000000000004
338,0.29046
339,0.20720999999999998
340,0.15395999999999999
341,0.14084000000000002
342,0.14084000000000002
343,0.14084000000000002
344,0.14084000000000002
345,0.14084000000000002
346,0.15125999999999998
347,0.24209
348,0.2771
349,0.28785
350,0.31021
351,0.39823000000000003
352,0.42648
353,0.49346999999999996
354,0.55677
355,0.59085
356,0.6751199999999999
357,0.7148800000000001
358,0.72888
359,0.70885
360,0.62739
361,0.43816000000000005
362,0.32929
363,0.28785
364,0.28785
365,0.28785
366,0.53708
367,0.92084
368,1.374
369,1.8273
370,2.2101
371,2.5632
372,2.7944
373,2.8246
374,2.6402
375,2.4219
376,2.1595
377,1.8848
378,1.6817
379,1.5632
380,1.5807
381,1.6703
382,1.758
383,1.758
384,1.7073
385,1.6184
386,1.5051
387,1.3918
388,0.93729
389,0.52672
390,0.20275
391,-0.2625
392,-0.44011999999999996
393,-0.65696
394,-0.76932
395,-0.8259
396,-0.8839600000000001
397,-0.8882399999999999
398,-0.81999
399,-0.70797
400,-0.5908399999999999
401,-0.5393399999999999
402,-0.47908999999999996
403,-0.44721000000000005
404,-0.44721000000000005
405,-0.44721000000000005
406,-0.53489
407,-0.6835899999999999
408,-0.8562799999999999
409,-1.0142
410,-1.1509
411,-1.2162
412,-1.2729
413,-1.3376
414,-1.3797
415,-1.5241
416,-1.6733
417,-1.7571
418,-1.7141
419,-1.6008
420,-1.4875
421,-1.3742
422,-1.2609
423,-1.1476
424,-1.0343
425,-0.9210200000000001
426,-0.80771
427,-0.6944100000000001
428,-0.58111
429,-0.51441
430,-0.52591
431,-0.60469
432,-0.66274
433,-0.82119
434,-0.87177
435,-0.8087
436,-0.66715
437,-0.46583
438,-0.312
439,-0.15500999999999998
440,-0.049205
441,0.063161
442,0.48223
443,0.11617999999999999
444,0.26997
445,-0.20890999999999998
446,-0.41678000000000004
447,-0.55489
448,-0.66819
449,-0.7841
450,-0.91332
451,-1.1148
452,-1.2518
453,-1.2689
454,-1.1261
455,-0.78618
456,-0.47906000000000004
457,-0.37392
458,-0.53699
459,-0.8581700000000001
460,-1.0061
461,-1.1845
462,-1.3723
463,-1.4857
464,-1.599
465,-1.7156
466,-1.8792
467,-2.0859
468,-2.1992
469,-2.3092
470,-2.2909
471,-2.1776
472,-2.0643
473,-2.0643
474,-2.0643
475,-2.1118
476,-2.2081
477,-2.2109
478,-2.2113
479,-2.0885
480,-1.8386
481,-1.5043
482,-1.1645
483,-0.82457
484,-0.57235
485,-0.45803
486,-0.44866999999999996
487,-0.53417
488,-0.75669
489,-1.0255
490,-1.1631
491,-1.3754
492,-1.2522
493,-0.9537899999999999
494,-0.61388
495,-0.27398
496,-0.11122
497,0.273
498,-0.3447
499,-0.36385
500,-0.7028399999999999
501,-0.9789200000000001
502,-1.181
503,-1.2925
504,-1.2242
505,-0.89533
506,-0.37811999999999996
507,0.24301
508,0.8348
509,1.0652
510,1.1534
511,1.1699
512,1.1879
513,1.3564
514,1.4359
515,1.42
516,1.3501
517,1.3182
518,1.2397
519,1.1371
520,1.0238
521,0.9181799999999999
522,0.8826
523,0.9382
524,0.99435
525,1.0051
526,0.93019
527,0.74844
528,0.53505
529,0.30845
530,0.40363000000000004
531,-0.37356
532,-0.13235
533,-0.44578
534,0.34814
535,0.30377
536,0.53037
537,0.71338
538,0.80788
539,0.77696
540,0.59905
541,0.43305
542,0.29534
543,0.18204
544,0.30601
545,0.10572000000000001
546,0.12548
547,0.41498999999999997
548,0.14512
549,0.20317000000000002
550,0.21481
551,0.18578
552,0.15261
553,0.20786
554,0.21627
555,0.17964000000000002
556,0.14084000000000002
557,0.13408
558,0.11773
559,-0.12879000000000002
560,-0.27398
561,-0.38728
562,-0.50058
563,-0.5262
564,-0.46125
565,-0.33216
566,-0.17426
567,-0.22543000000000002
568,-0.40764
569,-0.22903
570,-0.45564
571,-0.68224
572,-0.8338700000000001
573,-0.76283
574,-0.5048600000000001
575,-0.14941
576,-0.40081
577,0.11835999999999999
578,0.31024
579,0.43486
580,0.43486
581,0.49733999999999995
582,0.7047800000000001
583,1.008
584,1.3182
585,1.3501
586,1.3967
587,1.3992
588,1.3759
589,1.4892
590,1.5774
591,1.5945
592,1.5482
593,1.4615
594,1.3856
595,1.131
596,0.8777200000000001
597,0.72501
598,0.7025399999999999
599,0.61873
600,0.5695399999999999
601,0.5261899999999999
602,0.43486
603,0.43486
604,0.42173999999999995
605,0.36089
606,0.24758000000000002
607,0.13427999999999998
608,0.19863
609,0.32074
610,0.14481
611,0.15955999999999998
612,0.27287
613,0.37797
614,0.43486
615,0.4334
616,0.42404
617,0.33169
618,0.28349
619,0.24670999999999998
620,0.14084000000000002
621,0.14084000000000002
622,0.13746
623,0.39842
624,-0.066474
625,-0.052427999999999995
626,0.4371
627,0.20826
628,0.32156
629,0.43486
630,-0.1689
631,-0.1689
632,-0.1689
633,-0.1689
634,-0.1689
635,-0.1689
636,-0.1689
637,-0.1689
638,-0.1689
639,-0.1689
640,-0.1689
641,-0.1689
642,-0.1689
643,-0.1689
644,-0.1689
645,-0.1689
646,-0.1689
647,-0.11245999999999999
648,0.096175
649,0.32950999999999997
650,0.42058999999999996
651,0.43768999999999997
652,0.43768999999999997
653,0.43768999999999997
654,0.43768999999999997
655,0.43768999999999997
656,0.38652
657,0.1914
658,-0.22983
659,-0.28965
660,-0.20823000000000003
661,-0.1689
662,-0.1689
663,-0.1558
664,0.096934
665,0.1344
666,0.1344
667,0.30817
668,0.40371
669,0.10890999999999999
670,0.14901
671,0.23053
672,0.32187
673,0.41536999999999996
674,0.51713
675,0.64425
676,0.78396
677,0.9242100000000001
678,1.077
679,1.2542
680,1.4733
681,1.7043
682,1.9216
683,2.113
684,2.2691
685,2.4102
686,2.5504
687,2.6682
688,2.7353
689,2.6646
690,2.5148
691,2.3216
692,2.1148
693,1.9374
694,1.7688
695,1.6064
696,1.4539
697,1.318
698,1.2311
699,1.1552
700,1.0192
701,0.79238
702,0.46088
703,-0.12154000000000001
704,-0.57545
705,-0.87626
706,-1.0547
707,-1.334
708,-1.5775
709,-1.7765
710,-1.9256
711,-2.0191
712,-2.0503
713,-2.0299
714,-1.9755
715,-1.9027
716,-1.7667
717,-1.6235
718,-1.5138
719,-1.4585
720,-1.472
721,-1.5047
722,-1.4513
723,-1.3248
724,-1.1583
725,-1.018
726,-0.9057700000000001
727,-0.8209
728,-0.7540899999999999
729,-0.67798
730,-0.64405
731,-0.63283
732,-0.63283
733,-0.63361
734,-0.64945
735,-0.67707
736,-0.6791699999999999
737,-0.6260100000000001
738,-0.47378000000000003
739,-0.2059
740,0.42081
741,0.40381999999999996
742,0.7172
743,0.8779299999999999
744,0.97834
745,1.0374
746,1.0635
747,1.0515
748,1.0084
749,0.9752799999999999
750,0.96329
751,0.97439
752,0.8913200000000001
753,0.82785
754,0.7409100000000001
755,0.59608
756,0.34379
757,0.27131
758,-0.32626
759,-0.63143
760,-0.8376100000000001
761,-0.91566
762,-0.9253
763,-0.87508
764,-0.78158
765,-0.68808
766,-0.60001
767,-0.53663
768,-0.4948
769,-0.46638999999999997
770,-0.56492
771,-0.6837300000000001
772,-0.74663
773,-0.70315
774,-0.51615
775,-0.34124
776,-0.27428
777,-0.32299999999999995
778,-0.46625
779,-0.6463
780,-0.72602
781,-0.7078899999999999
782,-0.60617
783,-0.46592
784,-0.327
785,-0.24151
786,-0.22213000000000002
787,-0.26888
788,-0.36238000000000004
789,-0.45588
790,-0.5101899999999999
791,-0.49881000000000003
792,-0.40763
793,-0.31446999999999997
794,-0.29701
795,-0.33958
796,-0.38633
797,-0.47676999999999997
798,-0.63102
799,-0.81442
800,-0.9958
801,-1.1399
802,-1.2449
803,-1.3637
804,-1.5232
805,-1.7469
806,-1.8991
807,-2.0141
808,-2.0778
809,-2.0886
810,-2.0886
811,-1.9888
812,-1.8363
813,-1.6343
814,-1.3692
815,-1.2022
816,-1.028
817,-0.8917299999999999
818,-0.82568
819,-0.8164100000000001
820,-0.7534
821,-0.58934
822,-0.29267
823,0.16942000000000002
824,0.7167100000000001
825,1.2501
826,1.7849
827,2.3171
828,2.7042
829,2.8449
830,2.8492
831,2.7418
832,2.5139
833,2.2674
834,1.963
835,1.6146
836,1.2501
837,0.97231
838,0.83309
839,0.79052
840,0.82105
841,0.89871
842,0.9914299999999999
843,1.0649
844,1.0996
845,1.0785
846,0.973
847,0.86287
848,0.73125
849,0.5787
850,0.41991000000000006
851,0.25237
852,0.50167
853,-0.08776
854,-0.099146
855,-0.13932999999999998
856,-0.12667
857,-0.089994
858,-0.28210999999999997
859,-0.17586
860,-0.1689
861,-0.24896
862,-0.4562
863,-0.15645
864,-0.24995
865,-0.34345
866,-0.43695
867,-0.52559
868,-0.59629
869,-0.62405
870,-0.6046699999999999
871,-0.5432
872,-0.45109
873,-0.37884
874,-0.32645
875,-0.2797
876,-0.24118
877,-0.23460999999999999
878,-0.31317
879,-0.43346999999999997
880,-0.57372
881,-0.71078
882,-0.7953899999999999
883,-0.78683
884,-0.71426
885,-0.59045
886,-0.41543
887,-0.21791
888,-0.10697000000000001
889,-0.48527
890,-0.1499
891,-0.19742
892,-0.28029
893,-0.32238
894,-0.29303
895,-0.20224
896,-0.096722
897,0.18379
898,0.33464
899,0.39891
900,0.41203999999999996
901,0.44091
902,0.4648
903,0.47905
904,0.50184
905,0.4625
906,0.41575
907,0.369
908,0.3226
909,0.28628000000000003
910,0.27705
911,0.28592
912,0.31640999999999997
913,0.40064
914,0.44382
915,0.45903
916,0.4565
917,0.44763000000000003
918,0.4086
919,0.38754
920,0.34359
921,0.27705
922,0.27705
923,0.27705
924,0.27363000000000004
925,0.25540999999999997
926,0.20875
927,0.16702
928,0.15235
929,0.12907000000000002
930,0.37695
931,0.16252
932,0.1344
933,0.1344
934,0.1344
935,0.1344
936,0.1344
937,0.1344
938,0.12769
939,0.2616
940,-0.40865999999999997
941,-0.47552
942,-0.1145
943,-0.14756
944,-0.14756
