time,value
0,-0.44537
1,-0.44537
2,-0.44537
3,-0.44537
4,-0.44537
5,-0.44537
6,-0.44537
7,-0.44537
8,-0.44537
9,-0.44537
10,-0.44537
11,-0.44537
12,-0.44537
13,-0.44537
14,-0.44537
15,-0.44537
16,-0.44537
17,-0.44537
18,-0.44537
19,-0.44537
20,-0.44537
21,-0.44537
22,-0.44537
23,-0.44537
24,-0.44537
25,-0.44537
26,-0.44537
27,-0.44537
28,-0.44537
29,-0.44537
30,-0.44537
31,-0.44537
32,-0.44537
33,-0.44537
34,-0.44537
35,-0.44537
36,-0.44537
37,-0.44537
38,-0.44537
39,-0.44537
40,-0.44537
41,-0.44537
42,-0.44537
43,-0.44537
44,-0.44537
45,-0.44537
46,-0.44537
47,-0.44537
48,-0.44537
49,-0.44537
50,-0.44537
51,-0.44537
52,-0.44702
53,-0.45375
54,-0.46631000000000006
55,-0.47888000000000003
56,-0.48602
57,-0.48921000000000003
58,-0.48921000000000003
59,-0.48921000000000003
60,-0.49795
61,-0.51043
62,-0.52299
63,-0.53556
64,-0.5481199999999999
65,-0.5606899999999999
66,-0.57325
67,-0.58582
68,-0.59838
69,-0.61095
70,-0.62351
71,-0.63608
72,-0.64864
73,-0.6612100000000001
74,-0.67377
75,-0.68634
76,-0.6986100000000001
77,-0.7084
78,-0.7084
79,-0.7084
80,-0.7084
81,-0.7084
82,-0.7084
83,-0.7084
84,-0.7035399999999999
85,-0.69248
86,-0.67992
87,-0.6725899999999999
88,-0.67433
89,-0.6869
90,-0.6994600000000001
91,-0.71203
92,-0.72459
93,-0.73714
94,-0.74845
95,-0.7522300000000001
96,-0.7522300000000001
97,-0.7522300000000001
98,-0.76469
99,-0.78518
100,-0.8103100000000001
101,-0.83544
102,-0.8605700000000001
103,-0.8857
104,-0.9118
105,-0.9411200000000001
106,-0.9778399999999999
107,-1.0155
108,-1.0515
109,-1.0798
110,-1.1054
111,-1.1306
112,-1.1557
113,-1.1808
114,-1.206
115,-1.2247
116,-1.2344
117,-1.2344
118,-1.2344
119,-1.2294
120,-1.2171
121,-1.2046
122,-1.192
123,-1.1794
124,-1.1669
125,-1.1543
126,-1.1485
127,-1.1468
128,-1.1468
129,-1.1468
130,-1.1468
131,-1.1468
132,-1.1468
133,-1.1468
134,-1.1468
135,-1.1468
136,-1.1468
137,-1.1468
138,-1.1468
139,-1.1457
140,-1.1401
141,-1.1286
142,-1.1161
143,-1.1019
144,-1.0786
145,-1.0538
146,-1.0271
147,-0.9976700000000001
148,-0.9599700000000001
149,-0.9222799999999999
150,-0.8845799999999999
151,-0.8468899999999999
152,-0.80919
153,-0.7731
154,-0.7460899999999999
155,-0.73353
156,-0.72096
157,-0.71263
158,-0.7084
159,-0.7084
160,-0.7084
161,-0.71562
162,-0.72738
163,-0.73995
164,-0.7487199999999999
165,-0.7522300000000001
166,-0.7522300000000001
167,-0.7522300000000001
168,-0.7522300000000001
169,-0.7522300000000001
170,-0.75116
171,-0.74571
172,-0.71286
173,-0.6751699999999999
174,-0.63855
175,-0.6078399999999999
176,-0.58163
177,-0.5565
178,-0.52866
179,-0.47923999999999994
180,-0.42918
181,-0.38089
182,-0.33592
183,-0.29822
184,-0.26053000000000004
185,-0.22653
186,-0.19882
187,-0.17369
188,-0.15197
189,-0.13851
190,-0.13851
191,-0.13851
192,-0.14826
193,-0.16643
194,-0.19155999999999998
195,-0.2159
196,-0.21836
197,-0.2058
198,-0.19322999999999999
199,-0.16602
200,-0.12538
201,-0.075124
202,-0.024865
203,0.034457
204,0.096317
205,0.15965
206,0.22569
207,0.29930999999999996
208,0.3747
209,0.45203000000000004
210,0.5441699999999999
211,0.64275
212,0.7420399999999999
213,0.83709
214,0.89991
215,0.9627399999999999
216,1.0163
217,1.0538
218,1.0663
219,1.0789
220,1.0801
221,1.0587
222,1.0337
223,1.011
224,0.9923299999999999
225,0.97977
226,0.9672
227,0.97629
228,1.0035
229,1.0412
230,1.0864
231,1.1627
232,1.2632
233,1.3637
234,1.4701
235,1.5804
236,1.6935
237,1.8065
238,1.8903
239,1.9665
240,2.0403
241,2.1018
242,2.145
243,2.1827
244,2.2181
245,2.2265
246,2.2287
247,2.2278
248,2.2251
249,2.2125
250,2.2
251,2.1848
252,2.1647
253,2.1397
254,2.1145
255,2.0894
256,2.0643
257,2.0391
258,2.0140000000000002
259,1.9889
260,1.9637
261,1.9386
262,1.9076
263,1.8716
264,1.8339
265,1.7989
266,1.7691
267,1.744
268,1.7189
269,1.6869999999999998
270,1.6516
271,1.6136
272,1.5734
273,1.5058
274,1.4304
275,1.3559999999999999
276,1.2926
277,1.2389
278,1.1886
279,1.1392
280,1.1113
281,1.0853
282,1.0589
283,1.03
284,0.9923299999999999
285,0.9546399999999999
286,0.9223100000000001
287,0.90249
288,0.8895799999999999
289,0.8760899999999999
290,0.85915
291,0.8340200000000001
292,0.80889
293,0.78376
294,0.75863
295,0.7335
296,0.7083699999999999
297,0.68324
298,0.6581100000000001
299,0.63298
300,0.60417
301,0.57071
302,0.5330199999999999
303,0.49532
304,0.47268000000000004
305,0.45679
306,0.44403000000000004
307,0.42923
308,0.40681
309,0.38168
310,0.35655
311,0.33142
312,0.30629
313,0.28115999999999997
314,0.25603000000000004
