time,value
0,0.43696999999999997
1,0.43696999999999997
2,0.44369
3,0.42351000000000005
4,0.32934
5,0.34279
6,0.31589
7,0.33607
8,0.44369
9,0.34279
10,0.31589
11,0.29571
12,0.2688
13,0.24861999999999998
14,0.17463
15,0.141
16,0.093911
17,0.046825
18,0.19480999999999998
19,0.006465
20,-0.1617
21,-0.16843
22,-0.17515
23,-0.18188
24,-0.2626
25,-0.19533
26,-0.38368
27,-0.23569
28,-0.24241999999999997
29,-0.25587
30,-0.32986
31,-0.24915
32,-0.23569
33,-0.2895
34,-0.37695
35,-0.4644
36,-0.39713000000000004
37,-0.47112
38,-0.51148
39,-0.41058
40,-0.42404
41,-0.43076000000000003
42,-0.5854699999999999
43,-0.55857
44,-0.57875
45,-0.6460100000000001
46,-0.57875
47,-0.5854699999999999
48,-0.60565
49,-0.57875
50,-0.61238
51,-0.5922
52,-0.5922
53,-0.62583
54,-0.61238
55,-0.65274
56,-0.62583
57,-0.67292
58,-0.72001
59,-0.72673
60,-0.77382
61,-0.7670899999999999
62,-0.81418
63,-0.81418
64,-0.85454
65,-0.87472
66,-0.8949
67,-0.8478100000000001
68,-0.82763
69,-0.78055
70,-0.7469100000000001
71,-0.80745
72,-0.85454
73,-0.80745
74,-0.75364
75,-0.70655
76,-0.6392899999999999
77,-0.70655
78,-0.68637
79,-0.7469100000000001
80,-0.70655
81,-0.6998300000000001
82,-0.6931
83,-0.67292
84,-0.63256
85,-0.61238
86,-0.67965
87,-0.5922
88,-0.61238
89,-0.63256
90,-0.63256
91,-0.66619
92,-0.6931
93,-0.72001
94,-0.72673
95,-0.70655
96,-0.72001
97,-0.6998300000000001
98,-0.67292
99,-0.72673
100,-0.63256
101,-0.62583
102,-0.61911
103,-0.48458
104,-0.50476
105,-0.53166
106,-0.5383899999999999
107,-0.39713000000000004
108,-0.35004
109,-0.33659
110,-0.31640999999999997
111,-0.28278000000000003
112,-0.29623
113,-0.25587
114,-0.33659
115,-0.26933
116,-0.16843
117,-0.11460999999999999
118,-0.10116
119,-0.12807000000000002
120,-0.12134
121,-0.14825
122,-0.18188
123,-0.12807000000000002
124,-0.08770700000000001
125,-0.00026159
126,-0.080981
127,0.006465
128,-0.020441
129,-0.047348
130,0.026645
131,-0.027168
132,-0.054074000000000004
133,-0.020441
134,-0.027168
135,0.026645
136,0.046825
137,0.053551
138,0.10736
139,0.10736
140,0.10064
141,0.12082000000000001
142,0.17463
143,0.23517
144,0.26208000000000004
145,0.28226
146,0.35625
147,0.3697
148,0.32261
149,0.27553
150,0.30243000000000003
151,0.33607
152,0.3697
153,0.40333
154,0.39661
155,0.41678999999999994
156,0.43696999999999997
157,0.45715
158,0.47733000000000003
159,0.49751000000000006
160,0.51769
161,0.5109600000000001
162,0.51769
163,0.5715
164,0.5042300000000001
165,0.62531
166,0.6118600000000001
167,0.5984
168,0.6320399999999999
169,0.71948
170,0.70603
171,0.69258
172,0.67912
173,0.6051300000000001
174,0.59168
175,0.54459
176,0.49751000000000006
177,0.44369
178,0.39661
179,0.36296999999999996
180,0.37643000000000004
181,0.34952
182,0.32261
183,0.34952
184,0.37643000000000004
185,0.30243000000000003
186,0.30243000000000003
187,0.30243000000000003
188,0.30916
189,0.32261
190,0.32934
191,0.34279
192,0.6118600000000001
193,0.8741899999999999
194,1.1433
195,0.8674700000000001
196,0.59168
197,0.31589
198,0.33607
199,0.36296999999999996
200,0.38315
201,0.40333
202,0.41006000000000004
203,0.36296999999999996
204,0.31589
205,0.39661
206,0.43696999999999997
207,0.3697
208,0.33607
209,0.30243000000000003
210,0.36296999999999996
211,0.41678999999999994
212,0.47733000000000003
213,0.4706
214,0.46387
215,0.42351000000000005
216,0.46387
217,0.5042300000000001
218,0.49751000000000006
219,0.44369
220,0.47733000000000003
221,0.5109600000000001
222,0.54459
223,0.57822
224,0.6118600000000001
225,0.64549
226,0.62531
227,0.6051300000000001
228,0.58495
229,0.56477
230,0.53787
231,0.5042300000000001
232,0.49078
233,0.42351000000000005
234,0.36296999999999996
235,0.30243000000000003
236,0.32261
237,0.34279
238,0.35625
239,0.37643000000000004
240,0.39661
241,0.41006000000000004
242,0.42351000000000005
243,0.37643000000000004
244,0.32934
245,0.28226
246,0.44369
247,0.37643000000000004
248,0.36296999999999996
249,0.34279
250,0.37643000000000004
251,0.41678999999999994
252,0.41678999999999994
253,0.46387
254,0.5109600000000001
255,0.55132
256,0.5984
257,0.64549
258,0.59168
259,0.8002
260,0.81366
261,0.81366
262,0.8203799999999999
263,0.82711
264,0.93473
265,0.97509
266,1.0222
267,1.0222
268,1.0491
269,1.0759999999999998
270,1.0962
271,1.1231
272,1.1433
273,1.1634
274,1.2845
275,1.224
276,1.2778
277,1.1903
278,1.224
279,1.2576
280,1.2845
281,1.3114
282,1.298
283,1.2845
284,1.2643
285,1.2778
286,1.2912
287,1.3047
288,1.2576
289,1.2576
290,1.2576
291,1.2576
292,1.2576
293,1.3249
294,1.3989
295,1.3518
296,1.3989
297,1.4392
298,1.446
299,1.4527
300,1.4594
301,1.4594
302,1.446
303,1.4258
304,1.4123
305,1.3989
306,1.4325
307,1.4661
308,1.4998
309,1.493
310,1.4863
311,1.4796
312,1.4729
313,1.3921
314,1.3181
315,1.2374
316,1.1567
317,1.0827
318,1.002
319,0.92801
320,0.84729
321,0.78675
322,0.65222
323,0.5109600000000001
324,0.37643000000000004
325,0.2419
326,0.13427
327,0.026645
328,-0.080981
329,-0.18861
330,-0.29623
331,-0.40386
332,-0.51148
333,-0.61911
334,-0.72673
335,-0.8410799999999999
336,-0.94871
337,-1.0563
338,-1.0227
339,-0.98234
340,-0.94871
341,-0.9150799999999999
342,-0.88144
343,-0.8478100000000001
344,-0.80745
345,-0.77382
346,-0.74019
347,-0.70655
348,-0.67292
349,-0.6392899999999999
350,-0.5989300000000001
351,-0.56529
352,-0.53166
353,-0.49803000000000003
354,-0.4644
355,-0.42404
356,-0.3904
357,-0.35677
358,-0.32314
359,-0.2895
360,-0.25587
361,-0.21550999999999998
362,-0.18188
363,-0.14825
364,-0.11460999999999999
365,-0.080981
366,-0.040621
367,-0.006988200000000001
368,0.026645
369,0.060278
370,0.093911
371,0.12754000000000001
372,0.1679
373,0.20154
374,0.23517
375,0.2688
376,0.30243000000000003
377,0.34279
378,0.37643000000000004
379,0.41006000000000004
380,0.44369
381,0.47733000000000003
382,0.5109600000000001
383,0.55132
384,0.58495
385,0.61858
386,0.65222
387,0.68585
388,0.72621
389,0.75984
390,0.79348
391,0.82711
392,0.86074
393,0.9011
394,0.9414600000000001
395,0.98182
396,1.0289
397,1.0693
398,1.1231
399,1.1702
400,1.224
401,1.2643
402,1.3114
403,1.2307
404,1.3249
405,1.3114
406,1.3854
407,1.4392
408,1.5738
409,1.5872
410,1.5536
411,1.5939
412,1.6679
413,1.6747
414,1.641
415,1.6074
416,1.7419
417,1.6612
418,1.641
419,1.6141
420,1.7016
421,1.6679
422,1.6343
423,1.5939
424,1.5805
425,1.5536
426,1.4729
427,1.3989
428,1.3181
429,1.2442
430,1.1702
431,1.0894
432,1.0625
433,1.0289
434,1.002
435,0.97509
436,0.9414600000000001
437,0.93473
438,0.92801
439,1.0558
440,1.0222
441,1.0424
442,1.1298
443,1.1365
444,1.1433
445,1.15
446,1.2173
447,1.2105
448,1.1634
449,1.1971
450,1.1702
451,1.1769
452,1.2374
453,1.2778
454,1.1298
455,1.0356
456,1.0087
457,0.88092
458,0.78675
459,0.82711
460,0.8674700000000001
461,0.5715
462,0.8002
463,0.69258
464,0.69258
465,0.65222
466,0.6993
467,0.57822
468,0.56477
469,0.5715
470,0.55805
471,0.6724
472,0.79348
473,0.5715
474,0.66567
475,0.53787
476,0.5984
477,0.48405
478,0.59168
479,0.5042300000000001
480,0.5042300000000001
481,0.6118600000000001
482,0.43023999999999996
483,0.47733000000000003
484,0.52441
485,0.63876
486,0.57822
487,0.55805
488,0.5715
489,0.55805
490,0.59168
491,0.5109600000000001
492,0.49078
493,0.49751000000000006
494,0.53787
495,0.54459
496,0.59168
497,0.49751000000000006
498,0.49751000000000006
499,0.51769
500,0.43023999999999996
501,0.5984
502,0.66567
503,0.47733000000000003
504,0.5984
505,0.5984
506,0.62531
507,0.65222
508,0.63876
509,0.6993
510,0.6993
511,0.45042
512,0.64549
513,0.57822
514,0.57822
515,0.46387
516,0.53787
517,0.30916
518,0.45042
519,0.58495
520,0.58495
521,0.52441
522,0.53787
523,0.55805
524,0.54459
525,0.55132
526,0.48405
527,0.46387
528,0.4706
529,0.5109600000000001
530,0.47733000000000003
531,0.41678999999999994
532,0.32934
533,0.43696999999999997
534,0.20826
535,0.22171999999999997
536,0.18808
537,0.2688
538,0.10064
539,0.006465
540,0.060278
541,0.10736
542,0.19480999999999998
543,0.20826
544,0.28898
545,0.28226
546,0.31589
547,0.25535
548,0.32261
549,0.34279
550,0.39661
551,0.43023999999999996
552,0.45715
553,0.46387
554,0.32261
555,0.4706
556,0.54459
557,0.55805
558,0.36296999999999996
559,0.53114
560,0.45715
561,0.5984
562,0.49751000000000006
563,0.6320399999999999
564,0.54459
565,0.54459
566,0.57822
567,0.42351000000000005
568,0.4706
569,0.4706
570,0.54459
571,0.41006000000000004
572,0.38988
573,0.56477
574,0.51769
575,0.5984
576,0.6320399999999999
577,0.5715
578,0.59168
579,0.82711
580,0.6051300000000001
581,0.75984
582,0.6993
583,0.82711
584,0.71948
585,0.73966
586,0.88092
587,0.8405600000000001
588,0.9952700000000001
589,0.9414600000000001
590,0.9212799999999999
591,0.97509
592,0.93473
593,0.91455
594,0.75984
595,0.70603
596,0.9011
597,0.8405600000000001
598,0.82711
599,0.97509
600,0.97509
601,0.7800199999999999
602,1.0289
603,0.94819
604,1.0155
605,0.98182
606,1.1365
607,1.1769
608,1.1567
609,1.2374
610,1.1231
611,1.4056
612,1.3451
613,1.2845
614,1.298
615,1.3114
616,1.3249
617,1.2307
618,1.1702
619,1.2845
620,1.1971
621,1.2576
622,1.2374
623,1.2038
624,1.1567
625,1.3249
626,1.2711
627,1.2778
628,1.2845
629,1.2845
630,1.2509
631,1.2643
632,1.2643
633,1.2038
634,1.15
635,0.9078299999999999
636,0.9683700000000001
637,0.95491
638,0.9078299999999999
639,0.88765
640,0.86074
641,0.73966
642,0.59168
643,0.7800199999999999
644,0.55132
645,0.55805
646,0.55805
647,0.56477
648,0.5715
649,0.57822
650,0.58495
651,0.21499000000000001
652,0.58495
653,0.32261
654,0.59168
655,0.13427
656,-0.32314
657,0.12082000000000001
658,0.5715
659,0.53787
660,0.58495
661,0.6051300000000001
662,0.59168
663,0.57822
664,0.6051300000000001
665,0.53114
666,0.43696999999999997
667,0.41006000000000004
668,0.56477
669,0.6118600000000001
670,0.6320399999999999
671,0.61858
672,0.55805
673,0.44369
674,0.32261
675,0.35625
676,0.38988
677,0.42351000000000005
678,0.34279
679,0.35625
680,0.37643000000000004
681,0.33607
682,0.28898
683,0.24861999999999998
684,0.20826
685,0.1679
686,0.12082000000000001
687,0.080457
688,0.12082000000000001
689,0.060278
690,-0.00026159
691,-0.08770700000000001
692,-0.10116
693,-0.11460999999999999
694,-0.1617
695,-0.20879
696,-0.19533
697,-0.24241999999999997
698,-0.27605
699,-0.30968
700,-0.34331999999999996
701,-0.37695
702,-0.41058
703,-0.44422
704,-0.47785
705,-0.51148
706,-0.5451199999999999
707,-0.57875
708,-0.61238
709,-0.6460100000000001
710,-0.67965
711,-0.71328
712,-0.7469100000000001
713,-0.78055
714,-0.81418
715,-0.8478100000000001
716,-0.88144
717,-0.9150799999999999
718,-0.94871
719,-0.98234
720,-1.016
721,-1.0496
722,-1.0832
723,-1.1169
724,-1.1505
725,-1.1841
726,-1.1976
727,-1.2109999999999999
728,-1.2312
729,-1.2447
730,-1.2581
731,-1.2649
732,-1.2716
733,-1.285
734,-1.2918
735,-1.2985
736,-1.2043
737,-1.2043
738,-1.2043
739,-1.2043
740,-1.1976
741,-1.1976
742,-1.1976
743,-1.1976
744,-1.1976
745,-1.2043
746,-1.2649
747,-1.3187
748,-1.3725
749,-1.4263
750,-1.4801
751,-1.5339
752,-1.5877
753,-1.6483
754,-1.655
755,-1.6685
756,-1.6819
757,-1.6886
758,-1.7021
759,-1.7155
760,-1.7223
761,-1.7357
762,-1.7492
763,-1.7559
764,-1.7694
765,-1.7828
766,-1.7895
767,-1.8030000000000002
768,-1.8164
769,-1.8232
770,-1.8366
771,-1.8501
772,-1.8568
773,-1.8837
774,-1.9106
775,-1.9308
776,-1.9577
777,-1.9779
778,-2.0048
779,-1.9712
780,-2.0384
781,-2.1057
782,-2.1662
783,-2.1124
784,-2.0653
785,-2.0115
786,-1.9577
787,-1.9106
788,-1.8568
789,-1.8030000000000002
790,-1.7559
791,-1.7021
792,-1.6483
793,-1.5945
794,-1.5272
795,-1.4532
796,-1.4801
797,-1.5003
798,-1.3658
799,-1.4061
800,-1.4128
801,-1.3927
802,-1.3859
803,-1.7155
804,-1.5003
805,-1.3321
806,-1.3119
807,-1.3052
808,-1.2245
809,-1.238
810,-1.1303
811,-1.2716
812,-1.1236
813,-1.1303
814,-1.581
815,-1.1841
816,-1.3254
817,-1.4667
818,-1.6483
819,-1.7559
820,-1.2447
821,-1.6752
822,-1.4128
823,-1.3052
824,-1.2716
825,-1.3187
826,-1.2447
827,-1.1707
828,-1.2109999999999999
829,-1.2109999999999999
830,-1.238
831,-1.238
832,-1.2918
833,-1.2245
834,-1.1034
835,-1.285
836,-1.4398
837,-1.2716
838,-1.0765
839,-1.2043
840,-1.1034
841,-1.5137
842,-1.2178
843,-1.1640000000000001
844,-1.1841
845,-1.6617
846,-1.6954
847,-1.729
848,-1.655
849,-1.4398
850,-1.6079
851,-1.3859
852,-1.285
853,-1.3456
854,-1.7694
855,-1.5743
856,-1.4801
857,-1.6685
858,-1.6954
859,-1.7088
860,-1.6012
861,-1.6685
862,-1.6819
863,-1.6685
864,-1.6685
865,-1.9173
866,-1.7895
867,-1.7492
868,-1.8568
869,-1.9039
870,-1.9577
871,-1.9644
872,-2.0721
873,-2.1057
874,-2.1259
875,-1.9712
876,-1.9846
877,-1.8837
878,-2.1259
879,-2.0384
880,-1.9509999999999998
881,-2.1124
882,-1.8568
883,-2.0317
884,-1.9913
885,-2.1191
886,-2.1729
887,-2.1259
888,-2.099
889,-2.1393
890,-2.1729
891,-2.1528
892,-2.1864
893,-2.146
894,-2.1057
895,-2.1191
896,-2.1393
897,-2.1595
898,-2.1797
899,-2.1999
