time,value
0,0.080555
1,0.17859
2,0.1726
3,0.047559
4,-0.1803
5,-0.45747
6,-0.73393
7,-0.9817299999999999
8,-1.0929
9,-1.0293
10,-0.79127
11,-0.38794
12,0.13089
13,0.68796
14,1.18
15,1.5418
16,1.7063
17,1.6626
18,1.4180000000000001
19,1.0618
20,0.65349
21,0.24738000000000002
22,-0.099477
23,-0.34655
24,-0.51477
25,-0.636
26,-0.7219899999999999
27,-0.77472
28,-0.82804
29,-0.8840899999999999
30,-0.91246
31,-0.90585
32,-0.8844
33,-0.80815
34,-0.68008
35,-0.50529
36,-0.26998
37,0.015361000000000001
38,0.35836999999999997
39,0.70807
40,1.0675
41,1.3656
42,1.5545
43,1.5857
44,1.445
45,1.1238
46,0.65551
47,0.095759
48,-0.50149
49,-1.046
50,-1.4585
51,-1.6857
52,-1.6738
53,-1.4222
54,-0.93465
55,-0.29203
56,0.40273000000000003
57,1.0262
58,1.466
59,1.6321
60,1.4748
61,1.0198
62,0.36851999999999996
63,-0.35989
64,-1.03
65,-1.5537
66,-1.8421
67,-1.89
68,-1.7408
69,-1.4365
70,-1.0337
71,-0.5715
72,-0.070758
73,0.4596
74,1.013
75,1.5607
76,2.0462
77,2.4134
78,2.5924
79,2.5052
80,2.1423
81,1.5115
82,0.69017
83,-0.2073
84,-1.0659999999999998
85,-1.7769
86,-2.2542
87,-2.4832
88,-2.4709
89,-2.2474
90,-1.8776
91,-1.4109
92,-0.8887299999999999
93,-0.34942
94,0.18308
95,0.66914
96,1.0689
97,1.3294
98,1.4202
99,1.328
100,1.0672
101,0.6751699999999999
102,0.24036
103,-0.15889
104,-0.45383
105,-0.5854
106,-0.5495899999999999
107,-0.37213
108,-0.094279
109,0.23814000000000002
110,0.5486800000000001
111,0.79971
112,0.94595
113,0.9829399999999999
114,0.8980299999999999
115,0.69568
116,0.37261
117,-0.033542
118,-0.46276999999999996
119,-0.8760399999999999
120,-1.22
121,-1.4274
122,-1.4494
123,-1.2805
124,-0.9737100000000001
125,-0.5656
126,-0.14224
127,0.22416
128,0.48098
129,0.62989
130,0.67743
131,0.6403800000000001
132,0.5694
133,0.48238000000000003
134,0.38595
135,0.29165
136,0.18825
137,0.07552
138,-0.033554
139,-0.11717000000000001
140,-0.15479
141,-0.14965
142,-0.11631
143,-0.08828
144,-0.09153700000000001
145,-0.14711
146,-0.25944
147,-0.40648
148,-0.53669
149,-0.59311
150,-0.56019
151,-0.4367
152,-0.22414
153,0.030614999999999996
154,0.29031999999999997
155,0.48201000000000005
156,0.58049
157,0.58235
158,0.47551000000000004
159,0.29339
160,0.061511
161,-0.15517
162,-0.31496
163,-0.37053
164,-0.27466
165,-0.031170999999999997
166,0.33351
167,0.73673
168,1.0804
169,1.2699
170,1.2284
171,0.89269
172,0.29985
173,-0.48601000000000005
174,-1.3422
175,-2.1171
176,-2.6918
177,-2.9712
178,-2.9086
179,-2.4908
180,-1.7657
181,-0.80725
182,0.27693
183,1.3519
184,2.296
185,2.9989999999999997
186,3.3839
187,3.3969
188,3.0593
189,2.4376
190,1.6354
191,0.76266
192,-0.069686
193,-0.76849
194,-1.2974
195,-1.653
196,-1.8605
197,-1.9624
198,-1.9849
199,-1.9429
200,-1.8048
201,-1.5477
202,-1.1611
203,-0.65788
204,-0.039654
205,0.6127100000000001
206,1.2014
207,1.6501
208,1.9151
209,1.9567
210,1.7606
211,1.3655
212,0.8343200000000001
213,0.23338000000000003
214,-0.35959
215,-0.8589899999999999
216,-1.2059
217,-1.3493
218,-1.2734
219,-0.99736
220,-0.56692
221,-0.057041999999999995
222,0.42993000000000003
223,0.80219
224,1.0001
225,0.98124
226,0.74571
227,0.35164
228,-0.098393
229,-0.51457
230,-0.82895
231,-0.97567
232,-0.9281799999999999
233,-0.73034
234,-0.43841
235,-0.11592999999999999
236,0.14690999999999999
237,0.32094
238,0.39588
239,0.39813000000000004
240,0.37216
241,0.35401
242,0.35884
243,0.3825
244,0.40584000000000003
245,0.40068000000000004
246,0.34526999999999997
247,0.24479
248,0.10487
249,-0.046613
250,-0.20468
251,-0.33394
252,-0.43066000000000004
253,-0.50703
254,-0.56316
255,-0.60593
256,-0.62162
257,-0.60109
258,-0.51849
259,-0.37368
260,-0.18993
261,0.0241
262,0.2359
263,0.41298999999999997
264,0.52869
265,0.57906
266,0.58072
267,0.54901
268,0.49433999999999995
269,0.41271
270,0.29470999999999997
271,0.12320999999999999
272,-0.091782
273,-0.33239
274,-0.5352600000000001
275,-0.64867
276,-0.63634
277,-0.47316
278,-0.18001
279,0.19573
280,0.5502199999999999
281,0.80412
282,0.9017799999999999
283,0.8220700000000001
284,0.5938399999999999
285,0.2617
286,-0.096832
287,-0.41246000000000005
288,-0.64794
289,-0.76878
290,-0.78591
291,-0.72177
292,-0.5973
293,-0.43401999999999996
294,-0.25891
295,-0.087184
296,0.088651
297,0.247
298,0.3948
299,0.52658
300,0.6432399999999999
301,0.72111
302,0.75925
303,0.76439
304,0.72927
305,0.61847
306,0.4357
307,0.19079000000000002
308,-0.11135999999999999
309,-0.4574
310,-0.78405
311,-1.0444
312,-1.1866
313,-1.1845
314,-1.021
315,-0.72626
316,-0.36049000000000003
317,0.020082
318,0.37453000000000003
319,0.65623
320,0.84226
321,0.93885
322,0.95641
323,0.8922399999999999
324,0.7481
325,0.51149
326,0.21896
327,-0.10797999999999999
328,-0.40624
329,-0.63303
330,-0.72623
331,-0.65223
332,-0.41463
333,-0.087813
334,0.26199
335,0.5706600000000001
336,0.75776
337,0.79579
338,0.69023
339,0.48767
340,0.21577
341,-0.091829
342,-0.39796
343,-0.67524
344,-0.91696
345,-1.0929
346,-1.1774
347,-1.1587
348,-1.0123
349,-0.74197
350,-0.38424
351,0.011385
352,0.39023
353,0.68942
354,0.88589
355,0.97439
356,0.9798600000000001
357,0.92771
358,0.85665
359,0.78173
360,0.69797
361,0.5837899999999999
362,0.41561000000000003
363,0.17586
364,-0.12163
365,-0.43067
366,-0.72148
367,-0.92606
368,-1.0286
369,-1.0345
370,-0.9456
371,-0.7877
372,-0.59002
373,-0.3485
374,-0.075066
375,0.21474000000000001
376,0.5200600000000001
377,0.8065100000000001
378,1.043
379,1.1931
380,1.2104
381,1.1015
382,0.88046
383,0.55378
384,0.15375999999999998
385,-0.29880999999999996
386,-0.73349
387,-1.1026
388,-1.3481
389,-1.4015
390,-1.2214
391,-0.7912100000000001
392,-0.18116
393,0.5194300000000001
394,1.1738
395,1.6464
396,1.8308
397,1.6769
398,1.213
399,0.51977
400,-0.26011999999999996
401,-1.0068
402,-1.5830000000000002
403,-1.9377
404,-2.053
405,-1.936
406,-1.625
407,-1.16
408,-0.57167
409,0.10415999999999999
410,0.82991
411,1.4999
412,2.0544
413,2.4114
414,2.51
415,2.3321
416,1.9137
417,1.3291
418,0.67105
419,0.02094
420,-0.54473
421,-0.9942200000000001
422,-1.3284
423,-1.5625
424,-1.6949
425,-1.7274
426,-1.6333
427,-1.4229
428,-1.0821
429,-0.6374
430,-0.15294000000000002
431,0.30758
432,0.68901
433,0.94809
434,1.0714
435,1.0562
436,0.93066
437,0.7238600000000001
438,0.47081999999999996
439,0.20635
440,-0.058097
441,-0.27731
442,-0.42577
443,-0.48845
444,-0.43633999999999995
445,-0.28167
446,-0.058794000000000006
447,0.19
448,0.41105
449,0.55114
450,0.57411
451,0.48545
452,0.31375
453,0.072251
454,-0.16815
455,-0.37038000000000004
456,-0.49973999999999996
457,-0.54953
458,-0.51303
459,-0.38148000000000004
460,-0.20259000000000002
461,-0.016875
462,0.17948
463,0.35238
464,0.47798
465,0.54303
466,0.5213
467,0.42901999999999996
468,0.25442
469,0.035982
470,-0.17344
471,-0.34376999999999996
472,-0.44813000000000003
473,-0.47995
474,-0.4561
475,-0.38894
476,-0.29891
477,-0.2038
478,-0.10369
479,-0.004628899999999999
480,0.10384000000000002
481,0.24545
482,0.39874
483,0.53914
484,0.6523899999999999
485,0.70878
486,0.69466
487,0.60717
488,0.46934
489,0.28970999999999997
490,0.09447699999999999
491,-0.11098
492,-0.3039
493,-0.46601000000000004
494,-0.59021
495,-0.65509
496,-0.65081
497,-0.5364800000000001
498,-0.30582
499,0.036197
