time,value
0,0.39615
1,-0.40676
2,-0.12792
3,-0.49613999999999997
4,-0.17363
5,-0.14495
6,0.12974000000000002
7,-0.09781000000000001
8,0.31473
9,0.56338
10,-0.84959
11,-0.33758
12,0.17371
13,0.46069
14,0.18646
15,-0.20401
16,0.044813
17,0.17555
18,0.63421
19,-0.21354
20,0.153
21,0.41268
22,-0.13960999999999998
23,0.24011
24,0.64193
25,0.17824
26,-0.24931
27,1.5383
28,1.5383
29,1.5383
30,1.5383
31,1.5383
32,1.5383
33,1.5383
34,1.5383
35,1.5383
36,1.5383
37,1.5383
38,1.5383
39,1.5383
40,1.5383
41,1.5383
42,-1.5144
43,-1.5144
44,-1.5144
45,-1.5144
46,-1.5144
47,-1.5144
48,-1.5144
49,-1.5144
50,-1.5144
51,-1.5144
52,-1.5144
53,-1.5144
54,-1.5144
55,-1.5144
56,-1.5144
57,-0.30496
58,0.14665999999999998
59,-0.10968
60,-0.20135999999999998
61,-0.27102
62,0.5131600000000001
63,0.68375
64,0.16097
65,0.14365999999999998
66,0.037895
67,-0.022135
68,-0.26666
69,-0.27089
70,-0.41677
71,-0.27874
72,0.43345
73,-0.31013
74,-0.24814
75,0.39502
76,-0.21175
77,-0.44538999999999995
78,0.32736
79,0.48941999999999997
80,0.056051
81,-0.29994
82,-0.17743
83,0.018547
84,-0.071663
85,-0.34736
86,0.29354
87,-0.090652
88,-0.22444
89,-0.1574
90,0.011867
91,0.47981
92,-0.23325
93,-0.6230399999999999
94,0.38799
95,0.07595299999999999
96,0.3195
97,-0.075353
98,-0.28283
99,-0.27057
100,-0.018838
101,0.27168000000000003
102,-0.25771
103,0.48373999999999995
104,-1.5144
105,-1.5144
106,-1.5144
107,-1.5144
108,-1.5144
109,-1.5144
110,-1.5144
111,-1.5144
112,-1.5144
113,-1.5144
114,-1.5144
115,1.5383
116,1.5383
117,1.5383
118,1.5383
119,1.5383
120,1.5383
121,1.5383
122,1.5383
123,1.5383
124,1.5383
125,0.33748
126,0.35796999999999995
127,-0.28455
