time,value
0,-0.045073
1,-0.045073
2,-0.045073
3,-0.045073
4,-0.045073
5,-0.045073
6,-0.045073
7,-0.045073
8,-0.045073
9,-0.045073
10,-0.045073
11,-0.045073
12,-0.045073
13,-0.045073
14,-0.045073
15,-0.045073
16,-0.045073
17,-0.045073
18,-0.045073
19,-0.045073
20,-0.045073
21,-0.045073
22,-0.045073
23,-0.045073
24,-0.045073
25,-0.045073
26,-0.045073
27,-0.045073
28,-0.045073
29,-0.045073
30,-0.045073
31,-0.045073
32,-0.045073
33,-0.045073
34,-0.045073
35,-0.045073
36,-0.045073
37,-0.045073
38,-0.045073
39,-0.045073
40,-0.045073
41,-0.045073
42,-0.045073
43,-0.045073
44,-0.045073
45,-0.045073
46,-0.045073
47,-0.045073
48,-0.045073
49,-0.045073
50,-0.045073
51,-0.045073
52,-0.045073
53,-0.045073
54,-0.045073
55,-0.045073
56,-0.045073
57,-0.045073
58,-0.045073
59,-0.045073
60,-0.045073
61,-0.045073
62,-0.045073
63,-0.045073
64,-0.045073
65,-0.045073
66,-0.045073
67,-0.045073
68,-0.045073
69,-0.045073
70,-0.045073
71,-0.045073
72,-0.045073
73,-0.045073
74,-0.045073
75,-0.045073
76,-0.045073
77,-0.045073
78,-0.045073
79,-0.045073
80,-0.045073
81,-0.045073
82,-0.045073
83,-0.045073
84,-0.045073
85,-0.045073
86,-0.045073
87,-0.045073
88,-0.045073
89,-0.045073
90,-0.045073
91,-0.045073
92,-0.045073
93,-0.045073
94,-0.045073
95,-0.045073
96,-0.045073
97,-0.045073
98,-0.045073
99,-0.045073
100,-0.045073
101,-0.045073
102,-0.045073
103,-0.045073
104,-0.045073
105,-0.045073
106,-0.045073
107,-0.045073
108,-0.045073
109,-0.045073
110,-0.045073
111,-0.045073
112,-0.045073
113,-0.045073
114,-0.045073
115,-0.045073
116,-0.045073
117,-0.045073
118,-0.045073
119,-0.045073
120,-0.045073
121,-0.045073
122,-0.045073
123,-0.045073
124,-0.045073
125,-0.045073
126,-0.045073
127,-0.045073
128,-0.045073
129,-0.045073
130,-0.045073
131,-0.045073
132,-0.045073
133,-0.045073
134,-0.045073
135,-0.045073
136,-0.045073
137,-0.045073
138,-0.045073
139,-0.045073
140,-0.045073
141,-0.045073
142,-0.045073
143,-0.045073
144,-0.045073
145,-0.045073
146,-0.045073
147,-0.045073
148,-0.045073
149,-0.045073
150,-0.045073
151,-0.045073
152,-0.045073
153,-0.045073
154,-0.045073
155,-0.045073
156,-0.045073
157,-0.045073
158,-0.045073
159,-0.045073
160,-0.045073
161,-0.045073
162,-0.045073
163,-0.045073
164,-0.045073
165,-0.045073
166,-0.045073
167,-0.045073
168,-0.045073
169,-0.045073
170,-0.045073
171,-0.045073
172,-0.045073
173,-0.045073
174,-0.045073
175,-0.045073
176,-0.045073
177,-0.045073
178,-0.045073
179,-0.045073
180,-0.045073
181,-0.045073
182,-0.045073
183,-0.045073
184,-0.045073
185,-0.045073
186,-0.045073
187,-0.045073
188,-0.045073
189,-0.045073
190,-0.045073
191,-0.045073
192,-0.045073
193,-0.045073
194,-0.045073
195,-0.045073
196,-0.045073
197,-0.045073
198,-0.045073
199,-0.045073
200,-0.045073
201,-0.045073
202,-0.045073
203,-0.045073
204,-0.045073
205,-0.045073
206,-0.045073
207,-0.045073
208,-0.045073
209,-0.045073
210,-0.045073
211,-0.045073
212,-0.045073
213,-0.045073
214,-0.045073
215,-0.045073
216,-0.045073
217,-0.045073
218,-0.045073
219,-0.045073
220,-0.045073
221,-0.045073
222,-0.045073
223,-0.045073
224,-0.045073
225,-0.045073
226,-0.045073
227,-0.045073
228,-0.045073
229,-0.045073
230,-0.045073
231,-0.045073
232,-0.045073
233,-0.045073
234,-0.045073
235,-0.045073
236,-0.045073
237,-0.045073
238,-0.045073
239,-0.045073
240,-0.045073
241,-0.045073
242,-0.045073
243,-0.045073
244,-0.045073
245,-0.045073
246,-0.045073
247,-0.045073
248,-0.045073
249,-0.045073
250,-0.045073
251,-0.045073
252,-0.045073
253,-0.045073
254,-0.045073
255,-0.045073
256,-0.045073
257,-0.045073
258,-0.045073
259,-0.045073
260,-0.045073
261,-0.045073
262,-0.045073
263,-0.045073
264,-0.045073
265,-0.045073
266,-0.045073
267,-0.045073
268,-0.045073
269,-0.045073
270,-0.045073
271,-0.045073
272,-0.045073
273,-0.045073
274,-0.045073
275,-0.045073
276,-0.045073
277,-0.045073
278,-0.045073
279,-0.045073
280,-0.045073
281,-0.045073
282,-0.045073
283,-0.045073
284,-0.045073
285,-0.045073
286,-0.045073
287,-0.045073
288,-0.045073
289,-0.045073
290,-0.045073
291,-0.045073
292,26.066
293,6.1719
294,0.079266
295,-0.045073
296,-0.045073
297,-0.045073
298,-0.045073
299,-0.045073
300,-0.045073
301,-0.045073
302,-0.045073
303,-0.045073
304,-0.045073
305,-0.045073
306,-0.045073
307,-0.045073
308,-0.045073
309,-0.045073
310,-0.045073
311,-0.045073
312,-0.045073
313,-0.045073
314,-0.045073
315,-0.045073
316,-0.045073
317,-0.045073
318,-0.045073
319,-0.045073
320,-0.045073
321,-0.045073
322,-0.045073
323,-0.045073
324,-0.045073
325,-0.045073
326,-0.045073
327,-0.045073
328,-0.045073
329,-0.045073
330,-0.045073
331,-0.045073
332,-0.045073
333,-0.045073
334,-0.045073
335,-0.045073
336,-0.045073
337,-0.045073
338,-0.045073
339,-0.045073
340,-0.045073
341,-0.045073
342,-0.045073
343,-0.045073
344,-0.045073
345,-0.045073
346,-0.045073
347,-0.045073
348,-0.045073
349,-0.045073
350,-0.045073
351,-0.045073
352,-0.045073
353,-0.045073
354,-0.045073
355,-0.045073
356,-0.045073
357,-0.045073
358,-0.045073
359,-0.045073
360,-0.045073
361,-0.045073
362,-0.045073
363,-0.045073
364,-0.045073
365,-0.045073
366,-0.045073
367,-0.045073
368,-0.045073
369,-0.045073
370,-0.045073
371,-0.045073
372,-0.045073
373,-0.045073
374,-0.045073
375,-0.045073
376,-0.045073
377,-0.045073
378,-0.045073
379,-0.045073
380,-0.045073
381,-0.045073
382,-0.045073
383,-0.045073
384,-0.045073
385,-0.045073
386,-0.045073
387,-0.045073
388,-0.045073
389,-0.045073
390,-0.045073
391,-0.045073
392,-0.045073
393,-0.045073
394,-0.045073
395,-0.045073
396,-0.045073
397,-0.045073
398,-0.045073
399,-0.045073
400,-0.045073
401,-0.045073
402,-0.045073
403,-0.045073
404,-0.045073
405,-0.045073
406,-0.045073
407,-0.045073
408,-0.045073
409,-0.045073
410,-0.045073
411,-0.045073
412,-0.045073
413,-0.045073
414,-0.045073
415,-0.045073
416,-0.045073
417,-0.045073
418,-0.045073
419,-0.045073
420,-0.045073
421,-0.045073
422,-0.045073
423,-0.045073
424,-0.045073
425,-0.045073
426,-0.045073
427,-0.045073
428,-0.045073
429,-0.045073
430,-0.045073
431,-0.045073
432,-0.045073
433,-0.045073
434,-0.045073
435,-0.045073
436,-0.045073
437,-0.045073
438,-0.045073
439,-0.045073
440,-0.045073
441,-0.045073
442,-0.045073
443,-0.045073
444,-0.045073
445,-0.045073
446,-0.045073
447,-0.045073
448,-0.045073
449,-0.045073
450,-0.045073
451,-0.045073
452,-0.045073
453,-0.045073
454,-0.045073
455,-0.045073
456,-0.045073
457,-0.045073
458,-0.045073
459,-0.045073
460,-0.045073
461,-0.045073
462,-0.045073
463,-0.045073
464,-0.045073
465,-0.045073
466,-0.045073
467,-0.045073
468,-0.045073
469,-0.045073
470,-0.045073
471,-0.045073
472,-0.045073
473,-0.045073
474,-0.045073
475,-0.045073
476,-0.045073
477,-0.045073
478,-0.045073
479,-0.045073
480,-0.045073
481,-0.045073
482,-0.045073
483,-0.045073
484,-0.045073
485,-0.045073
486,-0.045073
487,-0.045073
488,-0.045073
489,-0.045073
490,-0.045073
491,-0.045073
492,-0.045073
493,-0.045073
494,-0.045073
495,-0.045073
496,-0.045073
497,-0.045073
498,-0.045073
499,-0.045073
500,-0.045073
501,-0.045073
502,-0.045073
503,-0.045073
504,-0.045073
505,-0.045073
506,-0.045073
507,-0.045073
508,-0.045073
509,-0.045073
510,-0.045073
511,-0.045073
512,-0.045073
513,-0.045073
514,-0.045073
515,-0.045073
516,-0.045073
517,-0.045073
518,-0.045073
519,-0.045073
520,-0.045073
521,-0.045073
522,-0.045073
523,-0.045073
524,-0.045073
525,-0.045073
526,-0.045073
527,-0.045073
528,-0.045073
529,-0.045073
530,-0.045073
531,-0.045073
532,-0.045073
533,-0.045073
534,-0.045073
535,-0.045073
536,-0.045073
537,-0.045073
538,-0.045073
539,-0.045073
540,-0.045073
541,-0.045073
542,-0.045073
543,-0.045073
544,-0.045073
545,-0.045073
546,-0.045073
547,-0.045073
548,-0.045073
549,-0.045073
550,-0.045073
551,-0.045073
552,-0.045073
553,-0.045073
554,-0.045073
555,-0.045073
556,-0.045073
557,-0.045073
558,-0.045073
559,-0.045073
560,-0.045073
561,-0.045073
562,-0.045073
563,-0.045073
564,-0.045073
565,-0.045073
566,-0.045073
567,-0.045073
568,-0.045073
569,-0.045073
570,-0.045073
571,-0.045073
572,-0.045073
573,-0.045073
574,-0.045073
575,-0.045073
576,-0.045073
577,-0.045073
578,-0.045073
579,-0.045073
580,-0.045073
581,-0.045073
582,-0.045073
583,-0.045073
584,-0.045073
585,-0.045073
586,-0.045073
587,-0.045073
588,-0.045073
589,-0.045073
590,-0.045073
591,-0.045073
592,-0.045073
593,-0.045073
594,-0.045073
595,-0.045073
596,-0.045073
597,-0.045073
598,-0.045073
599,-0.045073
600,-0.045073
601,-0.045073
602,-0.045073
603,-0.045073
604,-0.045073
605,-0.045073
606,-0.045073
607,-0.045073
608,-0.045073
609,-0.045073
610,-0.045073
611,-0.045073
612,-0.045073
613,-0.045073
614,-0.045073
615,-0.045073
616,-0.045073
617,-0.045073
618,-0.045073
619,-0.045073
620,-0.045073
621,-0.045073
622,-0.045073
623,-0.045073
624,-0.045073
625,-0.045073
626,-0.045073
627,-0.045073
628,-0.045073
629,-0.045073
630,-0.045073
631,-0.045073
632,-0.045073
633,-0.045073
634,-0.045073
635,-0.045073
636,-0.045073
637,-0.045073
638,-0.045073
639,-0.045073
640,-0.045073
641,-0.045073
642,-0.045073
643,-0.045073
644,-0.045073
645,-0.045073
646,-0.045073
647,-0.045073
648,-0.045073
649,-0.045073
650,-0.045073
651,-0.045073
652,-0.045073
653,-0.045073
654,-0.045073
655,-0.045073
656,-0.045073
657,-0.045073
658,-0.045073
659,-0.045073
660,-0.045073
661,-0.045073
662,-0.045073
663,-0.045073
664,-0.045073
665,-0.045073
666,-0.045073
667,-0.045073
668,-0.045073
669,-0.045073
670,-0.045073
671,-0.045073
672,-0.045073
673,-0.045073
674,-0.045073
675,-0.045073
676,-0.045073
677,-0.045073
678,-0.045073
679,-0.045073
680,-0.045073
681,-0.045073
682,-0.045073
683,-0.045073
684,-0.045073
685,-0.045073
686,-0.045073
687,-0.045073
688,-0.045073
689,-0.045073
690,-0.045073
691,-0.045073
692,-0.045073
693,-0.045073
694,-0.045073
695,-0.045073
696,-0.045073
697,-0.045073
698,-0.045073
699,-0.045073
700,-0.045073
701,-0.045073
702,-0.045073
703,-0.045073
704,-0.045073
705,-0.045073
706,-0.045073
707,-0.045073
708,-0.045073
709,-0.045073
710,-0.045073
711,-0.045073
712,-0.045073
713,-0.045073
714,-0.045073
715,-0.045073
716,-0.045073
717,-0.045073
718,-0.045073
719,-0.045073
