time,value
0,-0.37435
1,-0.37435
2,0.052124000000000004
3,-0.37435
4,-0.37435
5,-0.37435
6,-0.37435
7,0.052124000000000004
8,-0.37435
9,-0.37435
10,-0.37435
11,-0.37435
12,0.052124000000000004
13,-0.37435
14,-0.37435
15,-0.37435
16,-0.37435
17,-0.37435
18,0.052124000000000004
19,-0.37435
20,-0.37435
21,-0.37435
22,-0.37435
23,0.052124000000000004
24,-0.37435
25,-0.37435
26,-0.37435
27,-0.37435
28,0.052124000000000004
29,-0.37435
30,-0.37435
31,-0.37435
32,-0.37435
33,0.052124000000000004
34,-0.37435
35,-0.37435
36,-0.37435
37,-0.37435
38,0.052124000000000004
39,-0.37435
40,-0.37435
41,-0.37435
42,-0.37435
43,0.052124000000000004
44,-0.37435
45,-0.37435
46,-0.37435
47,-0.37435
48,0.052124000000000004
49,-0.37435
50,-0.37435
51,-0.37435
52,-0.37435
53,0.052124000000000004
54,-0.37435
55,-0.37435
56,-0.37435
57,-0.37435
58,-0.37435
59,0.052124000000000004
60,-0.37435
61,-0.37435
62,-0.37435
63,-0.37435
64,0.052124000000000004
65,-0.37435
66,-0.37435
67,-0.37435
68,-0.37435
69,0.052124000000000004
70,-0.37435
71,-0.37435
72,-0.37435
73,-0.37435
74,0.052124000000000004
75,-0.37435
76,-0.37435
77,-0.37435
78,-0.37435
79,0.052124000000000004
80,-0.37435
81,-0.37435
82,-0.37435
83,-0.37435
84,0.052124000000000004
85,-0.37435
86,-0.37435
87,-0.37435
88,-0.37435
89,0.052124000000000004
90,-0.37435
91,-0.37435
92,-0.37435
93,-0.37435
94,0.052124000000000004
95,-0.37435
96,-0.37435
97,-0.37435
98,-0.37435
99,0.052124000000000004
100,-0.37435
101,-0.37435
102,-0.37435
103,-0.37435
104,0.052124000000000004
105,-0.37435
106,-0.37435
107,-0.37435
108,-0.37435
109,0.052124000000000004
110,-0.37435
111,-0.37435
112,-0.37435
113,-0.37435
114,0.052124000000000004
115,-0.37435
116,-0.37435
117,-0.37435
118,-0.37435
119,0.052124000000000004
120,-0.37435
121,-0.37435
122,-0.37435
123,-0.37435
124,0.052124000000000004
125,-0.37435
126,-0.37435
127,-0.37435
128,-0.37435
129,0.052124000000000004
130,-0.37435
131,-0.37435
132,-0.37435
133,-0.37435
134,0.052124000000000004
135,-0.37435
136,-0.37435
137,-0.37435
138,-0.37435
139,-0.37435
140,0.052124000000000004
141,-0.37435
142,-0.37435
143,-0.37435
144,-0.37435
145,0.052124000000000004
146,-0.37435
147,-0.37435
148,-0.37435
149,-0.37435
150,0.052124000000000004
151,-0.37435
152,-0.37435
153,-0.37435
154,-0.37435
155,0.052124000000000004
156,-0.37435
157,-0.37435
158,-0.37435
159,-0.37435
160,0.052124000000000004
161,-0.37435
162,-0.37435
163,-0.37435
164,-0.37435
165,0.052124000000000004
166,-0.37435
167,-0.37435
168,-0.37435
169,-0.37435
170,0.052124000000000004
171,-0.37435
172,-0.37435
173,-0.37435
174,-0.37435
175,-0.37435
176,0.052124000000000004
177,-0.37435
178,-0.37435
179,-0.37435
180,-0.37435
181,0.052124000000000004
182,-0.37435
183,-0.37435
184,-0.37435
185,-0.37435
186,0.052124000000000004
187,-0.37435
188,-0.37435
189,-0.37435
190,-0.37435
191,0.052124000000000004
192,-0.37435
193,0.052124000000000004
194,3.0374
195,3.8903
196,3.0374
197,3.0374
198,3.8903
199,3.0374
200,3.0374
201,3.8903
202,3.0374
203,3.0374
204,3.8903
205,3.0374
206,3.0374
207,3.8903
208,3.0374
209,3.0374
210,3.8903
211,3.0374
212,3.0374
213,3.8903
214,3.0374
215,3.0374
216,3.8903
217,3.0374
218,3.8903
219,3.0374
220,3.0374
221,3.8903
222,3.0374
223,0.47858999999999996
224,-0.37435
225,-0.37435
226,-0.37435
227,0.052124000000000004
228,-0.37435
229,-0.37435
230,-0.37435
231,-0.37435
232,0.052124000000000004
233,-0.37435
234,-0.37435
235,-0.37435
236,-0.37435
237,0.052124000000000004
238,-0.37435
239,-0.37435
240,-0.37435
241,-0.37435
242,0.052124000000000004
243,-0.37435
244,-0.37435
245,-0.37435
246,-0.37435
247,0.052124000000000004
248,-0.37435
249,-0.37435
250,-0.37435
251,-0.37435
252,0.052124000000000004
253,-0.37435
254,-0.37435
255,-0.37435
256,-0.37435
257,0.052124000000000004
258,-0.37435
259,-0.37435
260,-0.37435
261,-0.37435
262,0.052124000000000004
263,-0.37435
264,-0.37435
265,-0.37435
266,-0.37435
267,0.052124000000000004
268,-0.37435
269,-0.37435
270,-0.37435
271,-0.37435
272,-0.37435
273,0.052124000000000004
274,-0.37435
275,-0.37435
276,-0.37435
277,-0.37435
278,0.052124000000000004
279,-0.37435
280,-0.37435
281,-0.37435
282,-0.37435
283,0.052124000000000004
284,-0.37435
285,-0.37435
286,-0.37435
287,-0.37435
288,0.052124000000000004
289,-0.37435
290,-0.37435
291,-0.37435
292,-0.37435
293,0.052124000000000004
294,-0.37435
295,-0.37435
296,-0.37435
297,-0.37435
298,0.052124000000000004
299,-0.37435
300,-0.37435
301,-0.37435
302,-0.37435
303,0.052124000000000004
304,-0.37435
305,-0.37435
306,-0.37435
307,-0.37435
308,0.052124000000000004
309,-0.37435
310,-0.37435
311,-0.37435
312,-0.37435
313,0.052124000000000004
314,-0.37435
315,-0.37435
316,-0.37435
317,-0.37435
318,0.052124000000000004
319,-0.37435
320,-0.37435
321,-0.37435
322,-0.37435
323,-0.37435
324,0.052124000000000004
325,-0.37435
326,-0.37435
327,-0.37435
328,-0.37435
329,0.052124000000000004
330,-0.37435
331,-0.37435
332,-0.37435
333,-0.37435
334,0.052124000000000004
335,-0.37435
336,-0.37435
337,-0.37435
338,-0.37435
339,0.052124000000000004
340,-0.37435
341,-0.37435
342,-0.37435
343,-0.37435
344,0.052124000000000004
345,-0.37435
346,-0.37435
347,-0.37435
348,-0.37435
349,0.052124000000000004
350,-0.37435
351,-0.37435
352,-0.37435
353,-0.37435
354,0.052124000000000004
355,-0.37435
356,-0.37435
357,-0.37435
358,-0.37435
359,-0.37435
360,0.052124000000000004
361,-0.37435
362,-0.37435
363,-0.37435
364,-0.37435
365,0.052124000000000004
366,-0.37435
367,-0.37435
368,-0.37435
369,-0.37435
370,0.052124000000000004
371,-0.37435
372,-0.37435
373,-0.37435
374,-0.37435
375,0.052124000000000004
376,-0.37435
377,-0.37435
378,-0.37435
379,-0.37435
380,0.052124000000000004
381,-0.37435
382,-0.37435
383,-0.37435
384,-0.37435
385,-0.37435
386,0.052124000000000004
387,-0.37435
388,-0.37435
389,-0.37435
390,-0.37435
391,0.052124000000000004
392,-0.37435
393,-0.37435
394,-0.37435
395,-0.37435
396,0.052124000000000004
397,-0.37435
398,-0.37435
399,-0.37435
400,-0.37435
401,0.052124000000000004
402,-0.37435
403,-0.37435
404,-0.37435
405,-0.37435
406,0.052124000000000004
407,-0.37435
408,-0.37435
409,-0.37435
410,-0.37435
411,-0.37435
412,0.052124000000000004
413,-0.37435
414,-0.37435
415,-0.37435
416,-0.37435
417,0.052124000000000004
418,-0.37435
419,-0.37435
420,-0.37435
421,-0.37435
422,0.052124000000000004
423,-0.37435
424,-0.37435
425,-0.37435
426,-0.37435
427,0.052124000000000004
428,-0.37435
429,-0.37435
430,-0.37435
431,-0.37435
432,0.052124000000000004
433,-0.37435
434,-0.37435
435,-0.37435
436,-0.37435
437,0.052124000000000004
438,-0.37435
439,-0.37435
440,-0.37435
441,-0.37435
442,-0.37435
443,0.052124000000000004
444,-0.37435
445,-0.37435
446,-0.37435
447,-0.37435
448,0.052124000000000004
449,-0.37435
450,-0.37435
451,-0.37435
452,-0.37435
453,0.052124000000000004
454,-0.37435
455,-0.37435
456,-0.37435
457,-0.37435
458,0.052124000000000004
459,-0.37435
460,-0.37435
461,-0.37435
462,-0.37435
463,-0.37435
464,0.052124000000000004
465,-0.37435
466,-0.37435
467,-0.37435
468,-0.37435
469,0.052124000000000004
470,-0.37435
471,-0.37435
472,-0.37435
473,-0.37435
474,0.052124000000000004
475,-0.37435
476,-0.37435
477,-0.37435
478,-0.37435
479,0.052124000000000004
480,-0.37435
481,-0.37435
482,-0.37435
483,-0.37435
484,0.052124000000000004
485,-0.37435
486,-0.37435
487,-0.37435
488,-0.37435
489,0.052124000000000004
490,-0.37435
491,-0.37435
492,-0.37435
493,-0.37435
494,-0.37435
495,0.052124000000000004
496,-0.37435
497,-0.37435
498,-0.37435
499,-0.37435
500,0.052124000000000004
501,-0.37435
502,-0.37435
503,-0.37435
504,-0.37435
505,0.052124000000000004
506,-0.37435
507,-0.37435
508,-0.37435
509,-0.37435
510,0.052124000000000004
511,0.47858999999999996
512,3.0374
513,3.8903
514,3.0374
515,3.0374
516,3.8903
517,3.0374
518,3.0374
519,3.8903
520,3.0374
521,3.0374
522,3.8903
523,3.0374
524,3.0374
525,3.8903
526,3.0374
527,3.0374
528,3.8903
529,3.0374
530,3.0374
531,3.8903
532,3.0374
533,3.0374
534,3.8903
535,3.0374
536,3.8903
537,3.0374
538,3.0374
539,3.8903
540,0.052124000000000004
541,-0.37435
542,-0.37435
543,-0.37435
544,-0.37435
545,0.052124000000000004
546,-0.37435
547,-0.37435
548,-0.37435
549,-0.37435
550,0.052124000000000004
551,-0.37435
552,-0.37435
553,-0.37435
554,-0.37435
555,0.052124000000000004
556,-0.37435
557,-0.37435
558,-0.37435
559,-0.37435
560,0.052124000000000004
561,-0.37435
562,-0.37435
563,-0.37435
564,-0.37435
565,0.052124000000000004
566,-0.37435
567,-0.37435
568,-0.37435
569,-0.37435
570,0.052124000000000004
571,-0.37435
572,-0.37435
573,-0.37435
574,-0.37435
575,0.052124000000000004
576,-0.37435
577,-0.37435
578,-0.37435
579,-0.37435
580,0.052124000000000004
581,-0.37435
582,-0.37435
583,-0.37435
584,-0.37435
585,0.052124000000000004
586,-0.37435
587,-0.37435
588,-0.37435
589,-0.37435
590,0.052124000000000004
591,-0.37435
592,-0.37435
593,-0.37435
594,-0.37435
595,0.052124000000000004
596,-0.37435
597,-0.37435
598,-0.37435
599,-0.37435
600,0.052124000000000004
601,-0.37435
602,-0.37435
603,-0.37435
604,-0.37435
605,0.052124000000000004
606,-0.37435
607,-0.37435
608,-0.37435
609,-0.37435
610,-0.37435
611,0.052124000000000004
612,-0.37435
613,-0.37435
614,-0.37435
615,0.052124000000000004
616,-0.37435
617,-0.37435
618,-0.37435
619,-0.37435
620,-0.37435
621,0.052124000000000004
622,-0.37435
623,-0.37435
624,-0.37435
625,-0.37435
626,0.052124000000000004
627,-0.37435
628,-0.37435
629,-0.37435
630,-0.37435
631,0.052124000000000004
632,-0.37435
633,-0.37435
634,-0.37435
635,-0.37435
636,0.052124000000000004
637,-0.37435
638,-0.37435
639,-0.37435
640,-0.37435
641,0.052124000000000004
642,-0.37435
643,-0.37435
644,-0.37435
645,0.052124000000000004
646,-0.37435
647,-0.37435
648,-0.37435
649,-0.37435
650,0.052124000000000004
651,-0.37435
652,-0.37435
653,-0.37435
654,-0.37435
655,0.052124000000000004
656,-0.37435
657,-0.37435
658,-0.37435
659,-0.37435
660,0.052124000000000004
661,-0.37435
662,-0.37435
663,-0.37435
664,-0.37435
665,0.052124000000000004
666,-0.37435
667,-0.37435
668,-0.37435
669,-0.37435
670,0.052124000000000004
671,-0.37435
672,-0.37435
673,-0.37435
674,-0.37435
675,0.052124000000000004
676,-0.37435
677,-0.37435
678,-0.37435
679,-0.37435
680,0.052124000000000004
681,-0.37435
682,-0.37435
683,-0.37435
684,-0.37435
685,0.052124000000000004
686,-0.37435
687,-0.37435
688,-0.37435
689,-0.37435
690,0.052124000000000004
691,-0.37435
692,-0.37435
693,-0.37435
694,-0.37435
695,0.052124000000000004
696,-0.37435
697,-0.37435
698,-0.37435
699,-0.37435
700,0.052124000000000004
701,-0.37435
702,-0.37435
703,-0.37435
704,-0.37435
705,0.052124000000000004
706,-0.37435
707,-0.37435
708,-0.37435
709,-0.37435
710,0.052124000000000004
711,-0.37435
712,-0.37435
713,-0.37435
714,0.052124000000000004
715,-0.37435
716,-0.37435
717,-0.37435
718,-0.37435
719,0.052124000000000004
