time,value
0,0.14892
1,0.53656
2,0.9009299999999999
3,1.2041
4,1.4215
5,1.531
6,1.5131
7,1.3642
8,1.0979
9,0.73678
10,0.32149
11,-0.10325
12,-0.4941
13,-0.8246899999999999
14,-1.0611
15,-1.2107
16,-1.2779
17,-1.2804
18,-1.2313
19,-1.1459
20,-1.0236
21,-0.8670700000000001
22,-0.67782
23,-0.4568
24,-0.1943
25,0.10346
26,0.41552
27,0.7278399999999999
28,1.0191
29,1.2552
30,1.4203
31,1.5079
32,1.5161
33,1.4366
34,1.2676
35,1.018
36,0.68089
37,0.27591
38,-0.16135
39,-0.5878
40,-0.97185
41,-1.2763
42,-1.4666
43,-1.528
44,-1.4864
45,-1.3592
46,-1.1779
47,-0.96959
48,-0.75668
49,-0.53743
50,-0.30351999999999996
51,-0.044056
52,0.23656
53,0.51962
54,0.7658699999999999
55,0.9545399999999999
56,1.0617
57,1.0808
58,1.0286
59,0.94204
60,0.8522799999999999
61,0.78569
62,0.74627
63,0.70922
64,0.63947
65,0.49737
66,0.26461
67,-0.054553
68,-0.41731999999999997
69,-0.77004
70,-1.064
71,-1.2583
72,-1.3435
73,-1.3419999999999999
74,-1.2794
75,-1.1888
76,-1.0759
77,-0.9407200000000001
78,-0.75935
79,-0.50859
80,-0.18366
81,0.21728000000000003
82,0.65584
83,1.0738
84,1.4195
85,1.6525
86,1.7518
87,1.7193
88,1.5718
89,1.3308
90,1.0107
91,0.6266
92,0.19336
93,-0.2771
94,-0.7599
95,-1.2123
96,-1.5801
97,-1.8141
98,-1.8879
99,-1.7844
100,-1.5198
101,-1.1359
102,-0.67791
103,-0.19549
104,0.27486
105,0.69768
106,1.0467
107,1.3006
108,1.4387
109,1.4368
110,1.285
111,0.99108
112,0.58487
113,0.12158
114,-0.31811999999999996
115,-0.67051
116,-0.8766
117,-0.90886
118,-0.77425
119,-0.52083
120,-0.19052
121,0.1502
122,0.45892
123,0.7013699999999999
124,0.8529100000000001
125,0.8806299999999999
126,0.76693
127,0.498
128,0.07938400000000001
129,-0.44659
130,-1.0138
131,-1.5394
132,-1.9228
133,-2.0873
134,-1.9873
135,-1.6241
136,-1.0519
137,-0.35767
138,0.36315
139,1.0151
140,1.5325
141,1.8882
142,2.081
143,2.1257
144,2.0376
145,1.8423
146,1.5478
147,1.1677
148,0.71662
149,0.22589
150,-0.26433
151,-0.7072
152,-1.0715
153,-1.3362
154,-1.4951
155,-1.5601
156,-1.5617
157,-1.5284
158,-1.4729
159,-1.3861
160,-1.2478
161,-1.0377
162,-0.7484
163,-0.38282
164,0.037984
165,0.47326
166,0.8737
167,1.1949
168,1.4069999999999998
169,1.4969999999999999
170,1.4745
171,1.3636
172,1.1928
173,0.9920399999999999
174,0.78088
175,0.56939
176,0.37188000000000004
177,0.1809
178,0.0035079
179,-0.156
180,-0.28788
181,-0.38685
182,-0.45614
183,-0.5122899999999999
184,-0.57617
185,-0.66976
186,-0.8109999999999999
187,-0.99431
188,-1.2029
189,-1.3987
190,-1.5276
191,-1.5387
192,-1.4017
193,-1.1098
194,-0.68813
195,-0.18217
196,0.35366
197,0.8645799999999999
198,1.3094
199,1.6729
200,1.9499
201,2.1412
202,2.2382
203,2.2185
204,2.0485
205,1.7012
206,1.165
207,0.46371
208,-0.34173000000000003
209,-1.1628
210,-1.8919
211,-2.4394
212,-2.7339
213,-2.7528
214,-2.5145
215,-2.0735
216,-1.5008
217,-0.86919
218,-0.23638
219,0.35249
220,0.8805799999999999
221,1.3259
222,1.6748
223,1.9073
224,2.0031
225,1.9425
226,1.7166
227,1.3383
228,0.8377399999999999
229,0.26094
230,-0.33862
231,-0.8841700000000001
232,-1.3159999999999998
233,-1.587
234,-1.6687
235,-1.5602
236,-1.2855
237,-0.8919299999999999
238,-0.43359
239,0.030168
240,0.44832
241,0.77594
242,0.98845
243,1.0874
244,1.0662
245,0.9388
246,0.71939
247,0.43382
248,0.11200999999999998
249,-0.2132
250,-0.50192
251,-0.71904
252,-0.8423700000000001
253,-0.8533200000000001
254,-0.75966
255,-0.58521
256,-0.35594000000000003
257,-0.10672999999999999
258,0.12737
259,0.31564000000000003
260,0.4405
261,0.49078999999999995
262,0.47456000000000004
263,0.40838
264,0.31361
265,0.19868
266,0.076581
267,-0.038868
268,-0.13237000000000002
269,-0.1917
270,-0.21438000000000001
271,-0.19527
272,-0.13246
273,-0.037009
274,0.078775
275,0.20806999999999998
276,0.33389
277,0.42489
278,0.47002
279,0.4526
280,0.36658
281,0.20624
282,-0.01026
283,-0.26738
284,-0.53338
285,-0.76498
286,-0.9264700000000001
287,-0.99449
288,-0.9669700000000001
289,-0.8538100000000001
290,-0.6759999999999999
291,-0.47078000000000003
292,-0.26471999999999996
293,-0.076127
294,0.08948400000000001
295,0.24173000000000003
296,0.39941
297,0.57936
298,0.77342
299,0.96444
300,1.1247
301,1.2192
302,1.2138
303,1.0907
304,0.85424
305,0.53063
306,0.15352000000000002
307,-0.2309
308,-0.5837399999999999
309,-0.88189
310,-1.1166
311,-1.2875
312,-1.4015
313,-1.4558
314,-1.4427
315,-1.3435
316,-1.1407
317,-0.82857
318,-0.40515
319,0.10228999999999999
320,0.64456
321,1.1572
322,1.5817
323,1.8644
324,1.9716
325,1.8979
326,1.6712
327,1.3305
328,0.9116799999999999
329,0.45006
330,-0.017774
331,-0.46917
332,-0.8923200000000001
333,-1.2586
334,-1.5506
335,-1.7467
336,-1.8339
337,-1.7965
338,-1.6329
339,-1.3585
340,-0.99198
341,-0.56361
342,-0.097304
343,0.37556
344,0.82455
345,1.2259
346,1.5502
347,1.7778
348,1.8856
349,1.8575
350,1.6918
351,1.3979
352,0.9980899999999999
353,0.52668
354,0.016623
355,-0.4908
356,-0.94932
357,-1.3269
358,-1.5889
359,-1.709
360,-1.6689
361,-1.464
362,-1.121
363,-0.69015
364,-0.23168000000000002
365,0.1794
366,0.48996999999999996
367,0.67484
368,0.74592
369,0.7240300000000001
370,0.64523
371,0.55067
372,0.46481000000000006
373,0.38981
374,0.32519000000000003
375,0.2656
376,0.20292000000000002
377,0.14590999999999998
378,0.10577
379,0.087804
380,0.090761
381,0.091098
382,0.06367300000000001
383,-0.01925
384,-0.16015
385,-0.34394
386,-0.53278
387,-0.6743100000000001
388,-0.72055
389,-0.64475
390,-0.45631000000000005
391,-0.19866
392,0.067614
393,0.2762
394,0.39371999999999996
395,0.4091
396,0.34567
397,0.23986999999999997
398,0.1295
399,0.049301
400,0.013526
401,0.014105000000000001
402,0.03279
403,0.044116
404,0.046563
405,0.041134
406,0.037192
407,0.034542
408,0.031611
409,0.012941
410,-0.031596
411,-0.10334000000000002
412,-0.19893
413,-0.28847
414,-0.35194000000000003
415,-0.35406
416,-0.28071999999999997
417,-0.14114000000000002
418,0.042477999999999995
419,0.23319
420,0.38566999999999996
421,0.46765
422,0.48201000000000005
423,0.42935
424,0.33829000000000004
425,0.2367
426,0.15052000000000001
427,0.07903400000000001
428,0.012391
429,-0.065822
430,-0.16646
431,-0.29922
432,-0.44722
433,-0.58891
434,-0.69228
435,-0.73082
436,-0.68942
437,-0.56224
438,-0.37233
439,-0.14995
440,0.08162
441,0.29177
442,0.48263
443,0.64825
444,0.79918
445,0.9296700000000001
446,1.0341
447,1.0815
448,1.0352
449,0.8631700000000001
450,0.5484899999999999
451,0.11012000000000001
452,-0.39718000000000003
453,-0.90909
454,-1.3398
455,-1.6214
456,-1.7102
457,-1.6049
458,-1.3349
459,-0.9528700000000001
460,-0.5173300000000001
461,-0.076014
462,0.32227
463,0.66233
464,0.93435
465,1.1313
466,1.2581
467,1.3092
468,1.2699
469,1.136
470,0.91994
471,0.63573
472,0.30708
473,-0.026101999999999997
474,-0.33411
475,-0.59065
476,-0.77432
477,-0.88712
478,-0.9280200000000001
479,-0.90259
480,-0.8212
481,-0.6913699999999999
482,-0.5190899999999999
483,-0.31358
484,-0.090056
485,0.12924000000000002
486,0.32697
487,0.47021
488,0.53691
489,0.5183800000000001
490,0.40857
491,0.22021
492,-0.004285
493,-0.22005
494,-0.37269
495,-0.4291
496,-0.37913
497,-0.23092
498,-0.015706
499,0.21875
