time,value
0,0.33251
1,-0.074838
2,-0.18627
3,-0.64408
4,-1.0294
5,0.14481
6,-0.087782
7,0.00017111
8,-0.054282000000000004
9,-0.29248
10,-0.19767
11,0.30332
12,-0.074977
13,-0.1797
14,-0.0036631
15,0.33148
16,-0.47723000000000004
17,-0.22964
18,0.51958
19,0.055854999999999995
20,0.081651
21,0.6663899999999999
22,0.15768
23,0.23428000000000002
24,-0.28886999999999996
25,0.17708
26,0.29047
27,0.051358
28,-1.7002
29,-1.7002
30,-1.7002
31,-1.7002
32,-1.7002
33,-1.7002
34,-1.7002
35,-1.7002
36,-1.7002
37,-1.7002
38,-1.7002
39,1.6634
40,1.6634
41,1.6634
42,1.6634
43,1.6634
44,1.6634
45,1.6634
46,1.6634
47,1.6634
48,1.6634
49,0.4922
50,-0.10484
51,-0.46691000000000005
52,0.016122
53,-0.21833000000000002
54,0.65942
55,-0.005052399999999999
56,0.5231399999999999
57,0.35205
58,-0.39136
59,0.034524
60,0.15466
61,-0.12024000000000001
62,-0.18317
63,-0.11095999999999999
64,-0.25342
65,0.24283000000000002
66,0.054761000000000004
67,0.19464
68,-0.64684
69,0.40993999999999997
70,-0.71296
71,0.045404
72,-0.30018
73,0.39526
74,0.43378
75,-0.17282999999999998
76,-0.098703
77,-0.17473
78,0.75627
79,0.34189
80,0.0038169000000000002
81,0.13632
82,0.16197
83,-0.032743
84,-0.5129600000000001
85,0.49217
86,0.047349
87,-0.13738
88,0.77861
89,0.26671999999999996
90,1.6634
91,1.6634
92,1.6634
93,1.6634
94,1.6634
95,1.6634
96,1.6634
97,1.6634
98,1.6634
99,1.6634
100,-1.7002
101,-1.7002
102,-1.7002
103,-1.7002
104,-1.7002
105,-1.7002
106,-1.7002
107,-1.7002
108,-1.7002
109,-1.7002
110,0.30941
111,-0.41802
112,-0.06675299999999999
113,0.27521
114,0.61757
115,-0.29175999999999996
116,0.29813
117,-0.25331
118,0.21061
119,-0.48658999999999997
120,0.065639
121,0.5715899999999999
122,-0.42886
123,-0.43943000000000004
124,0.09586900000000001
125,-0.21704
126,0.15669
127,0.56297
