time,value
0,-0.27037
1,-0.27037
2,-0.27037
3,-0.27037
4,-0.27037
5,-0.27037
6,-0.27037
7,-0.27037
8,-0.27037
9,-0.27037
10,-0.27037
11,-0.27037
12,-0.27037
13,-0.27037
14,-0.27037
15,-0.27037
16,-0.27037
17,-0.27037
18,-0.27037
19,-0.27037
20,-0.27037
21,-0.27037
22,-0.27037
23,-0.27037
24,-0.27037
25,-0.27037
26,-0.27037
27,-0.27037
28,-0.27037
29,-0.27037
30,-0.27037
31,-0.27037
32,-0.27037
33,-0.27037
34,-0.27037
35,-0.27037
36,-0.27037
37,-0.27037
38,-0.27037
39,-0.27037
40,-0.27037
41,-0.27037
42,-0.27037
43,-0.27037
44,-0.27037
45,-0.27037
46,-0.27037
47,-0.27037
48,-0.27037
49,-0.27037
50,-0.27037
51,-0.27037
52,-0.27037
53,-0.27037
54,-0.27037
55,-0.27037
56,-0.27037
57,-0.27037
58,-0.27037
59,-0.27037
60,-0.27037
61,-0.27037
62,-0.27037
63,-0.27037
64,-0.27037
65,-0.27037
66,-0.27037
67,-0.27037
68,-0.27037
69,-0.27037
70,-0.27037
71,-0.27037
72,-0.27037
73,-0.27037
74,-0.27037
75,-0.27037
76,-0.27037
77,-0.27037
78,-0.27037
79,-0.27037
80,-0.27037
81,-0.27037
82,-0.27037
83,-0.27037
84,-0.27037
85,-0.27037
86,-0.27037
87,-0.27037
88,-0.27037
89,-0.27037
90,-0.27037
91,-0.27037
92,-0.27037
93,-0.27037
94,-0.27037
95,-0.27037
96,-0.27037
97,-0.27037
98,-0.27037
99,-0.27037
100,-0.27037
101,-0.27037
102,-0.27037
103,-0.27037
104,-0.27037
105,-0.27037
106,-0.27037
107,-0.27037
108,-0.27037
109,-0.27037
110,-0.27037
111,-0.27037
112,-0.27037
113,-0.27037
114,-0.27037
115,-0.27037
116,-0.27037
117,-0.27037
118,-0.27037
119,-0.27037
120,-0.27037
121,-0.27037
122,-0.27037
123,-0.27037
124,-0.27037
125,-0.27037
126,-0.27037
127,-0.27037
128,-0.27037
129,-0.27037
130,-0.27037
131,-0.27037
132,-0.27037
133,-0.27037
134,-0.27037
135,-0.27037
136,-0.27037
137,-0.27037
138,-0.27037
139,-0.27037
140,-0.27037
141,-0.27037
142,-0.27037
143,-0.27037
144,-0.27037
145,-0.27037
146,-0.27037
147,-0.27037
148,-0.27037
149,-0.27037
150,-0.27037
151,-0.27037
152,-0.27037
153,-0.27037
154,-0.27037
155,-0.27037
156,-0.27037
157,-0.27037
158,-0.27037
159,-0.27037
160,-0.27037
161,-0.27037
162,-0.27037
163,-0.27037
164,-0.27037
165,-0.27037
166,-0.27037
167,-0.27037
168,-0.27037
169,-0.27037
170,-0.27037
171,-0.27037
172,-0.27037
173,-0.27037
174,-0.27037
175,-0.27037
176,-0.27037
177,-0.27037
178,-0.27037
179,-0.27037
180,-0.27037
181,-0.27037
182,-0.27037
183,-0.27037
184,-0.27037
185,-0.27037
186,-0.27037
187,-0.27037
188,-0.27037
189,-0.27037
190,-0.27037
191,-0.27037
192,-0.27037
193,-0.27037
194,-0.27037
195,-0.27037
196,-0.27037
197,-0.27037
198,-0.27037
199,-0.27037
200,-0.27037
201,-0.27037
202,-0.27037
203,-0.27037
204,-0.27037
205,-0.27037
206,-0.27037
207,-0.27037
208,-0.27037
209,-0.27037
210,-0.27037
211,-0.27037
212,-0.27037
213,-0.27037
214,-0.27037
215,-0.27037
216,-0.27037
217,-0.27037
218,-0.27037
219,-0.27037
220,-0.27037
221,-0.27037
222,-0.27037
223,-0.27037
224,-0.27037
225,-0.27037
226,-0.27037
227,-0.27037
228,-0.27037
229,-0.27037
230,-0.27037
231,-0.27037
232,-0.27037
233,-0.27037
234,-0.27037
235,-0.27037
236,-0.27037
237,-0.27037
238,-0.27037
239,-0.27037
240,-0.27037
241,-0.27037
242,-0.27037
243,-0.27037
244,-0.27037
245,-0.27037
246,-0.27037
247,-0.27037
248,-0.27037
249,-0.27037
250,-0.27037
251,-0.27037
252,-0.27037
253,-0.27037
254,-0.27037
255,-0.27037
256,-0.27037
257,-0.27037
258,-0.27037
259,-0.27037
260,-0.27037
261,-0.27037
262,-0.27037
263,-0.27037
264,-0.27037
265,-0.27037
266,-0.27037
267,-0.27037
268,-0.27037
269,-0.27037
270,-0.27037
271,-0.27037
272,-0.27037
273,-0.27037
274,-0.27037
275,-0.27037
276,-0.27037
277,-0.27037
278,-0.27037
279,-0.27037
280,-0.27037
281,-0.27037
282,-0.27037
283,-0.27037
284,-0.27037
285,-0.27037
286,-0.27037
287,-0.27037
288,-0.27037
289,-0.27037
290,-0.27037
291,-0.27037
292,-0.27037
293,-0.27037
294,-0.27037
295,-0.27037
296,-0.27037
297,-0.27037
298,-0.27037
299,-0.27037
300,-0.27037
301,-0.27037
302,-0.27037
303,-0.27037
304,-0.27037
305,-0.27037
306,-0.27037
307,-0.27037
308,-0.27037
309,-0.27037
310,-0.27037
311,-0.27037
312,-0.27037
313,-0.27037
314,-0.27037
315,-0.27037
316,-0.27037
317,-0.27037
318,-0.27037
319,-0.27037
320,-0.27037
321,-0.27037
322,-0.27037
323,-0.27037
324,-0.27037
325,-0.27037
326,-0.27037
327,-0.27037
328,-0.27037
329,-0.27037
330,-0.27037
331,-0.27037
332,-0.27037
333,-0.27037
334,-0.27037
335,-0.27037
336,-0.27037
337,-0.27037
338,-0.27037
339,-0.27037
340,-0.27037
341,-0.27037
342,-0.27037
343,-0.27037
344,-0.27037
345,-0.27037
346,-0.27037
347,-0.27037
348,-0.27037
349,-0.27037
350,-0.27037
351,-0.27037
352,-0.27037
353,-0.27037
354,-0.27037
355,-0.27037
356,-0.27037
357,-0.27037
358,-0.27037
359,-0.27037
360,-0.27037
361,-0.27037
362,-0.27037
363,-0.27037
364,-0.27037
365,-0.27037
366,-0.27037
367,-0.27037
368,-0.27037
369,-0.27037
370,-0.27037
371,-0.27037
372,-0.27037
373,-0.27037
374,-0.27037
375,-0.27037
376,-0.27037
377,-0.27037
378,-0.27037
379,-0.27037
380,-0.27037
381,-0.27037
382,-0.27037
383,-0.27037
384,-0.27037
385,-0.27037
386,-0.27037
387,-0.27037
388,-0.27037
389,-0.27037
390,-0.27037
391,-0.27037
392,-0.27037
393,-0.27037
394,-0.27037
395,-0.27037
396,-0.27037
397,1.1221
398,-0.27037
399,-0.27037
400,-0.27037
401,-0.27037
402,-0.27037
403,-0.27037
404,-0.27037
405,-0.27037
406,-0.27037
407,-0.27037
408,-0.27037
409,-0.27037
410,-0.27037
411,-0.27037
412,1.4006
413,3.6285
414,4.1855
415,3.6285
416,4.1855
417,3.6285
418,3.6285
419,3.6285
420,3.6285
421,3.6285
422,3.6285
423,3.6285
424,3.6285
425,3.6285
426,4.1855
427,3.6285
428,3.6285
429,3.6285
430,3.6285
431,4.1855
432,3.6285
433,3.6285
434,3.6285
435,3.6285
436,4.1855
437,3.6285
438,3.6285
439,3.6285
440,3.6285
441,3.6285
442,3.6285
443,4.1855
444,3.6285
445,3.6285
446,3.6285
447,3.6285
448,4.1855
449,3.6285
450,3.6285
451,3.6285
452,3.6285
453,3.6285
454,3.6285
455,4.1855
456,3.6285
457,3.6285
458,3.6285
459,3.6285
460,3.6285
461,-0.27037
462,-0.27037
463,-0.27037
464,-0.27037
465,-0.27037
466,-0.27037
467,-0.27037
468,-0.27037
469,-0.27037
470,-0.27037
471,-0.27037
472,-0.27037
473,-0.27037
474,-0.27037
475,-0.27037
476,-0.27037
477,-0.27037
478,-0.27037
479,-0.27037
480,-0.27037
481,-0.27037
482,-0.27037
483,-0.27037
484,-0.27037
485,-0.27037
486,-0.27037
487,-0.27037
488,-0.27037
489,-0.27037
490,-0.27037
491,-0.27037
492,-0.27037
493,-0.27037
494,-0.27037
495,-0.27037
496,-0.27037
497,-0.27037
498,-0.27037
499,-0.27037
500,-0.27037
501,-0.27037
502,-0.27037
503,-0.27037
504,-0.27037
505,-0.27037
506,-0.27037
507,-0.27037
508,-0.27037
509,-0.27037
510,-0.27037
511,-0.27037
512,-0.27037
513,-0.27037
514,-0.27037
515,-0.27037
516,-0.27037
517,-0.27037
518,-0.27037
519,-0.27037
520,-0.27037
521,-0.27037
522,-0.27037
523,-0.27037
524,-0.27037
525,-0.27037
526,-0.27037
527,-0.27037
528,-0.27037
529,-0.27037
530,-0.27037
531,-0.27037
532,-0.27037
533,-0.27037
534,-0.27037
535,-0.27037
536,-0.27037
537,-0.27037
538,-0.27037
539,-0.27037
540,-0.27037
541,-0.27037
542,-0.27037
543,-0.27037
544,-0.27037
545,-0.27037
546,-0.27037
547,-0.27037
548,-0.27037
549,-0.27037
550,-0.27037
551,-0.27037
552,-0.27037
553,-0.27037
554,-0.27037
555,-0.27037
556,-0.27037
557,-0.27037
558,-0.27037
559,-0.27037
560,-0.27037
561,-0.27037
562,-0.27037
563,-0.27037
564,-0.27037
565,-0.27037
566,-0.27037
567,-0.27037
568,-0.27037
569,-0.27037
570,-0.27037
571,-0.27037
572,-0.27037
573,-0.27037
574,-0.27037
575,-0.27037
576,-0.27037
577,-0.27037
578,-0.27037
579,-0.27037
580,-0.27037
581,-0.27037
582,-0.27037
583,-0.27037
584,-0.27037
585,-0.27037
586,-0.27037
587,-0.27037
588,-0.27037
589,-0.27037
590,-0.27037
591,-0.27037
592,-0.27037
593,-0.27037
594,-0.27037
595,-0.27037
596,-0.27037
597,-0.27037
598,-0.27037
599,-0.27037
600,-0.27037
601,-0.27037
602,-0.27037
603,-0.27037
604,-0.27037
605,-0.27037
606,-0.27037
607,-0.27037
608,-0.27037
609,-0.27037
610,-0.27037
611,-0.27037
612,-0.27037
613,-0.27037
614,-0.27037
615,-0.27037
616,-0.27037
617,-0.27037
618,-0.27037
619,-0.27037
620,-0.27037
621,-0.27037
622,-0.27037
623,-0.27037
624,-0.27037
625,-0.27037
626,-0.27037
627,-0.27037
628,-0.27037
629,-0.27037
630,-0.27037
631,-0.27037
632,-0.27037
633,-0.27037
634,-0.27037
635,-0.27037
636,-0.27037
637,-0.27037
638,-0.27037
639,-0.27037
640,-0.27037
641,-0.27037
642,-0.27037
643,-0.27037
644,-0.27037
645,-0.27037
646,-0.27037
647,-0.27037
648,-0.27037
649,-0.27037
650,-0.27037
651,-0.27037
652,-0.27037
653,-0.27037
654,-0.27037
655,-0.27037
656,-0.27037
657,-0.27037
658,-0.27037
659,-0.27037
660,-0.27037
661,-0.27037
662,-0.27037
663,-0.27037
664,-0.27037
665,-0.27037
666,-0.27037
667,-0.27037
668,-0.27037
669,-0.27037
670,-0.27037
671,-0.27037
672,-0.27037
673,-0.27037
674,-0.27037
675,-0.27037
676,-0.27037
677,-0.27037
678,-0.27037
679,-0.27037
680,-0.27037
681,-0.27037
682,-0.27037
683,-0.27037
684,-0.27037
685,-0.27037
686,-0.27037
687,-0.27037
688,-0.27037
689,-0.27037
690,-0.27037
691,-0.27037
692,-0.27037
693,-0.27037
694,-0.27037
695,-0.27037
696,-0.27037
697,-0.27037
698,-0.27037
699,-0.27037
700,-0.27037
701,-0.27037
702,-0.27037
703,-0.27037
704,-0.27037
705,-0.27037
706,-0.27037
707,-0.27037
708,-0.27037
709,-0.27037
710,-0.27037
711,-0.27037
712,-0.27037
713,-0.27037
714,-0.27037
715,-0.27037
716,-0.27037
717,-0.27037
718,-0.27037
719,-0.27037
