time,value
0,-0.033622000000000006
1,-0.18258
2,-0.38201
3,-0.57967
4,-0.67829
5,-0.6723399999999999
6,-0.5611
7,-0.38649
8,-0.23535999999999999
9,-0.1814
10,-0.23323000000000002
11,-0.35854
12,-0.50722
13,-0.59067
14,-0.5643600000000001
15,-0.36217
16,-0.034172
17,0.3788
18,0.7580899999999999
19,1.0646
20,1.2455
21,1.2699
22,1.2025
23,1.045
24,0.83991
25,0.60746
26,0.3364
27,-0.035421
28,-0.5391100000000001
29,-1.0827
30,-1.5792
31,-1.8854
32,-1.8732
33,-1.4725
34,-0.7575
35,0.09937
36,0.88574
37,1.3868
38,1.4691
39,1.1642
40,0.55719
41,-0.15113
42,-0.73974
43,-1.0631
44,-1.1117
45,-0.93511
46,-0.6418699999999999
47,-0.34881999999999996
48,-0.12175
49,0.073893
50,0.26227
51,0.47163
52,0.71385
53,0.96596
54,1.1844
55,1.2658
56,1.1871
57,0.9180799999999999
58,0.5321899999999999
59,0.093234
60,-0.29191
61,-0.59191
62,-0.77532
63,-0.8487899999999999
64,-0.8412200000000001
65,-0.80053
66,-0.74565
67,-0.63931
68,-0.45191000000000003
69,-0.19860999999999998
70,0.094834
71,0.33610999999999996
72,0.39889
73,0.21056
74,-0.20754
75,-0.7825300000000001
76,-1.3805
77,-1.8027
78,-1.849
79,-1.4180000000000001
80,-0.55245
81,0.61021
82,1.8147
83,2.7576
84,3.1878
85,2.9991
86,2.2274
87,1.0616
88,-0.21895
89,-1.3092
90,-1.9721
91,-2.1111
92,-1.7732
93,-1.0987
94,-0.26683
95,0.5042
96,1.0689
97,1.3419999999999999
98,1.341
99,1.1452
100,0.7531100000000001
101,0.25540999999999997
102,-0.3157
103,-0.9029799999999999
104,-1.4253
105,-1.8064
106,-1.9271
107,-1.7380000000000002
108,-1.2109
109,-0.38793
110,0.54885
111,1.4123
112,2.0029
113,2.1579
114,1.828
115,1.0632
116,-0.0093411
117,-1.1275
118,-2.0568
119,-2.549
120,-2.5061
121,-1.9107
122,-0.90699
123,0.28826999999999997
124,1.4374
125,2.2821
126,2.6584
127,2.5154
128,1.9266
129,1.0388
130,0.06718400000000001
131,-0.7711
132,-1.3233
133,-1.524
134,-1.3780000000000001
135,-0.9580200000000001
136,-0.38489
137,0.22423
138,0.7036
139,1.0075
140,1.0823
141,0.9438200000000001
142,0.62405
143,0.16792
144,-0.3588
145,-0.9005700000000001
146,-1.4014
147,-1.7819
148,-1.9806
149,-1.9149
150,-1.5819
151,-0.99749
152,-0.21955
153,0.5973
154,1.2705
155,1.6538
156,1.6824
157,1.3374
158,0.7460100000000001
159,0.039173
160,-0.5661
161,-0.91365
162,-0.9186
163,-0.60924
164,-0.087933
165,0.4776
166,0.94799
167,1.2309
168,1.2662
169,1.0838
170,0.75025
171,0.35453
172,-0.016913
173,-0.27802
174,-0.39873000000000003
175,-0.42462
176,-0.36680999999999997
177,-0.20007
178,0.010877
179,0.26041
180,0.48541999999999996
181,0.62084
182,0.62042
183,0.45158999999999994
184,0.08407200000000001
185,-0.45383999999999997
186,-1.0562
187,-1.609
188,-1.9798
189,-2.0779
190,-1.8329
191,-1.2734
192,-0.5335300000000001
193,0.25864000000000004
194,0.93058
195,1.3632
196,1.5253
197,1.3944
198,1.0756
199,0.6319100000000001
200,0.15123
201,-0.22915
202,-0.47708
203,-0.52341
204,-0.34315
205,0.036298000000000004
206,0.56763
207,1.1465
208,1.6748
209,2.0034
210,1.9974
211,1.6178
212,0.84885
213,-0.20033
214,-1.3382
215,-2.3414
216,-2.9809
217,-3.0767
218,-2.6087
219,-1.6599
220,-0.46508
221,0.68838
222,1.5519
223,1.9762
224,1.9077
225,1.4180000000000001
226,0.69803
227,-0.00911
228,-0.5378
229,-0.75846
230,-0.6633
231,-0.38415
232,-0.045869
233,0.21304
234,0.2934
235,0.17079
236,-0.08494199999999999
237,-0.36525
238,-0.5822
239,-0.64185
240,-0.5565100000000001
241,-0.36189
242,-0.12278
243,0.055376999999999996
244,0.14162
245,0.15452
246,0.15334
247,0.17795
248,0.25561
249,0.42746999999999996
250,0.6369600000000001
251,0.7774399999999999
252,0.79442
253,0.62185
254,0.29772
255,-0.09099600000000001
256,-0.49151999999999996
257,-0.76703
258,-0.81176
259,-0.64218
260,-0.30111
261,0.10411
262,0.44346
263,0.6403399999999999
264,0.66562
265,0.5354800000000001
266,0.33568000000000003
267,0.13452999999999998
268,-0.0085395
269,-0.05445
270,-0.052047
271,-0.0091949
272,0.031089
273,0.06576900000000001
274,0.11627
275,0.18773
276,0.29191999999999996
277,0.41288
278,0.49355
279,0.48063999999999996
280,0.2932
281,-0.06928200000000001
282,-0.51548
283,-0.97864
284,-1.3541
285,-1.5187
286,-1.4467
287,-1.1548
288,-0.7134699999999999
289,-0.20839000000000002
290,0.29345
291,0.71983
292,1.0354
293,1.2404
294,1.3403
295,1.325
296,1.1609
297,0.846
298,0.45998999999999995
299,0.064967
300,-0.23685
301,-0.37765
302,-0.31194
303,-0.074036
304,0.19746
305,0.36041
306,0.32633
307,0.073236
308,-0.34285
309,-0.7774
310,-1.0521
311,-1.0733
312,-0.80911
313,-0.34439000000000003
314,0.14142000000000002
315,0.5194
316,0.6772699999999999
317,0.62747
318,0.41372
319,0.18859
320,0.10555999999999999
321,0.21677
322,0.49665
323,0.7611899999999999
324,0.82955
325,0.58204
326,0.0013793
327,-0.77378
328,-1.5193
329,-1.9691
330,-1.9561
331,-1.4154
332,-0.43537
333,0.71246
334,1.7107
335,2.2649
336,2.2233
337,1.5943
338,0.5591
339,-0.57275
340,-1.4887
341,-1.9511
342,-1.8687
343,-1.3227
344,-0.44968
345,0.47134
346,1.1717
347,1.5176
348,1.4571
349,1.0587
350,0.44373
351,-0.18137
352,-0.61334
353,-0.7845300000000001
354,-0.6641699999999999
355,-0.31768
356,0.12475
357,0.58646
358,0.9191600000000001
359,1.0713
360,1.0726
361,0.94305
362,0.75485
363,0.53705
364,0.28643
365,-0.004453
366,-0.33660999999999996
367,-0.73075
368,-1.143
369,-1.4684
370,-1.6181
371,-1.5430000000000001
372,-1.2658
373,-0.80845
374,-0.27865
375,0.19475
376,0.53274
377,0.69065
378,0.70567
379,0.6322
380,0.57918
381,0.59548
382,0.6963600000000001
383,0.80211
384,0.8930600000000001
385,0.87208
386,0.69658
387,0.41312
388,0.063968
389,-0.28651
390,-0.58373
391,-0.80758
392,-0.92971
393,-0.97134
394,-0.91381
395,-0.79206
396,-0.60712
397,-0.3459
398,-0.025409
399,0.30446
400,0.5878800000000001
401,0.76156
402,0.80702
403,0.67971
404,0.39252
405,0.040115
406,-0.27125
407,-0.49925
408,-0.5979899999999999
409,-0.48741999999999996
410,-0.2046
411,0.1893
412,0.62563
413,0.98887
414,1.2298
415,1.2861
416,1.1047
417,0.72192
418,0.17173
419,-0.43641
420,-1.0141
421,-1.4775
422,-1.7302
423,-1.7289
424,-1.4363
425,-0.9182600000000001
426,-0.31655
427,0.27066999999999997
428,0.76015
429,1.0649
430,1.1369
431,1.035
432,0.80433
433,0.5149100000000001
434,0.22501
435,-0.024166
436,-0.20023
437,-0.29668
438,-0.29598
439,-0.17749
440,0.011929
441,0.21329
442,0.34293
443,0.35767
444,0.22049000000000002
445,-0.095813
446,-0.50672
447,-0.9202100000000001
448,-1.2445
449,-1.3656
450,-1.2104
451,-0.76394
452,-0.14483
453,0.49478999999999995
454,1.012
455,1.3185
456,1.3631
457,1.1795
458,0.8208200000000001
459,0.42273999999999995
460,0.066592
461,-0.2215
462,-0.38923
463,-0.46591000000000005
464,-0.44273999999999997
465,-0.35794000000000004
466,-0.21389
467,-0.02705
468,0.19382
469,0.44228
470,0.62083
471,0.66167
472,0.55279
473,0.32416999999999996
474,-0.0018884
475,-0.35039000000000003
476,-0.63218
477,-0.76708
478,-0.70501
479,-0.47453
480,-0.15370999999999999
481,0.14226
482,0.34360999999999997
483,0.37237
484,0.2537
485,-0.015505000000000001
486,-0.32199
487,-0.58189
488,-0.74334
489,-0.79052
490,-0.71529
491,-0.53462
492,-0.27073
493,0.0061012
494,0.25943
495,0.44491
496,0.55553
497,0.58891
498,0.50975
499,0.33610999999999996
