time,value
0,1.0141
1,0.87836
2,0.52691
3,0.06348999999999999
4,-0.39288
5,-0.6836899999999999
6,-0.68706
7,-0.4413
8,-0.054851
9,0.35255
10,0.68013
11,0.73448
12,0.56439
13,0.26863000000000004
14,-0.020956
15,-0.22075
16,-0.22812
17,-0.050524
18,0.23104
19,0.46298
20,0.53028
21,0.40397
22,0.058251
23,-0.39085
24,-0.78195
25,-0.9988299999999999
26,-0.9860700000000001
27,-0.77822
28,-0.40489
29,0.024589
30,0.32056
31,0.49522
32,0.54455
33,0.49417
34,0.41241000000000005
35,0.41236999999999996
36,0.51007
37,0.65682
38,0.8172
39,0.90941
40,0.86641
41,0.6470600000000001
42,0.31638
43,-0.056945
44,-0.39882
45,-0.64818
46,-0.80398
47,-0.87879
48,-0.8911100000000001
49,-0.8564799999999999
50,-0.87382
51,-0.89197
52,-0.8135100000000001
53,-0.64768
54,-0.38704
55,0.024931000000000002
56,0.4816
57,0.87759
58,1.1436
59,1.2463
60,1.1049
61,0.76364
62,0.37445
63,0.024214
64,-0.2413
65,-0.38405
66,-0.39705
67,-0.30929
68,-0.20898000000000003
69,-0.12340999999999999
70,-0.042723000000000004
71,0.029439999999999997
72,0.10400000000000001
73,0.19196
74,0.31049
75,0.35686999999999997
76,0.37678
77,0.35004
78,0.28356
79,0.22562
80,0.18529
81,0.22791999999999998
82,0.35320999999999997
83,0.48975
84,0.55406
85,0.51832
86,0.29919
87,-0.092058
88,-0.6090899999999999
89,-1.0867
90,-1.4419
91,-1.598
92,-1.534
93,-1.2216
94,-0.81896
95,-0.39925
96,0.048906
97,0.47123000000000004
98,0.78089
99,1.0235
100,1.1984
101,1.2701
102,1.1866
103,0.98372
104,0.68993
105,0.35398
106,0.060437
107,-0.12967
108,-0.16368
109,-0.052298000000000004
110,0.16161
111,0.34081
112,0.40301
113,0.31232
114,0.03687
115,-0.35656
116,-0.7278
117,-0.9569700000000001
118,-0.9733200000000001
119,-0.78032
120,-0.41988000000000003
121,0.00027704
122,0.38821
123,0.6814
124,0.8401
125,0.84114
126,0.73526
127,0.53763
128,0.24946999999999997
129,-0.13078
130,-0.5723199999999999
131,-0.991
132,-1.3646
133,-1.5478
134,-1.4384
135,-1.0103
136,-0.25029
137,0.6928300000000001
138,1.6679
139,2.4192
140,2.8087
141,2.7256
142,2.1412
143,1.2109
144,0.11710999999999999
145,-0.9499
146,-1.8525
147,-2.4184
148,-2.6241
149,-2.5377
150,-2.1971
151,-1.6449
152,-1.0209
153,-0.41791000000000006
154,0.15077000000000002
155,0.67743
156,1.1089
157,1.4528
158,1.7173
159,1.8772
160,1.9022
161,1.8609
162,1.7009999999999998
163,1.4021
164,0.95488
165,0.41788000000000003
166,-0.1889
167,-0.8061699999999999
168,-1.3505
169,-1.7066
170,-1.8601
171,-1.7693
172,-1.4685
173,-1.0305
174,-0.56408
175,-0.11907999999999999
176,0.24628000000000003
177,0.48778
178,0.64012
179,0.71686
180,0.7134199999999999
181,0.67876
182,0.5960300000000001
183,0.45366000000000006
184,0.27892
185,0.096001
186,-0.077606
187,-0.19655999999999998
188,-0.22535
189,-0.14227
190,-0.028068
191,0.056434000000000005
192,0.079614
193,0.040349
194,-0.1093
195,-0.22025
196,-0.27762
197,-0.26839
198,-0.16744
199,0.027745999999999996
200,0.26705999999999996
201,0.45916
202,0.57503
203,0.60859
204,0.51754
205,0.38783
206,0.27821
207,0.23206999999999997
208,0.21518
209,0.24068
210,0.25187
211,0.21827
212,0.11062000000000001
213,-0.030336000000000002
214,-0.1848
215,-0.35701
216,-0.5191399999999999
217,-0.66483
218,-0.80324
219,-0.9420000000000001
220,-1.0247
221,-1.0357
222,-0.9325600000000001
223,-0.7031
224,-0.34347
225,0.086306
226,0.5322
227,0.91909
228,1.1855
229,1.2989
230,1.2843
231,1.1739
232,0.97985
233,0.7519600000000001
234,0.50727
235,0.21524000000000001
236,-0.12175
237,-0.5225
238,-0.9121
239,-1.2539
240,-1.406
241,-1.3257
242,-1.0081
243,-0.5139699999999999
244,0.048706
245,0.54762
246,0.85655
247,0.94914
248,0.83935
249,0.60455
250,0.31969000000000003
251,0.07233099999999999
252,-0.1228
253,-0.28007
254,-0.43337
255,-0.65552
256,-0.93004
257,-1.2181
258,-1.4431
259,-1.4859
260,-1.2544
261,-0.74385
262,-0.083585
263,0.69414
264,1.3887
265,1.8684
266,2.0742
267,2.0443
268,1.8281
269,1.4854
270,1.1176
271,0.76998
272,0.42808
273,0.053322
274,-0.3538
275,-0.77066
276,-1.2016
277,-1.5578
278,-1.7664
279,-1.7874
280,-1.6232
281,-1.3191
282,-0.95129
283,-0.60865
284,-0.32388
285,-0.12094
286,0.038376
287,0.20813
288,0.40979
289,0.66861
290,0.90109
291,1.0855
292,1.1555
293,1.0928
294,0.86561
295,0.58657
296,0.27809
297,0.029412
298,-0.12887
299,-0.19409
300,-0.17970999999999998
301,-0.19155
302,-0.20815
303,-0.29420999999999997
304,-0.38074
305,-0.41568999999999995
306,-0.37878
307,-0.24425
308,-0.030129000000000003
309,0.22805999999999998
310,0.45121999999999995
311,0.59044
312,0.6227600000000001
313,0.54977
314,0.3691
315,0.13228
316,-0.070016
317,-0.23440999999999998
318,-0.32811999999999997
319,-0.40142
320,-0.46298
321,-0.5351600000000001
322,-0.59309
323,-0.6030399999999999
324,-0.51349
325,-0.33589
326,-0.07371799999999999
327,0.22874
328,0.43073999999999996
329,0.49745
330,0.3818
331,0.09601599999999999
332,-0.28099
333,-0.6148100000000001
334,-0.76483
335,-0.71586
336,-0.46637
337,-0.073908
338,0.33137
339,0.6109399999999999
340,0.7188100000000001
341,0.62992
342,0.40609
343,0.17131
344,0.0083286
345,-0.049428
346,-0.014430000000000002
347,0.052826
348,0.095122
349,0.037127
350,-0.076128
351,-0.14318
352,-0.11515
353,0.074284
354,0.43398000000000003
355,0.83485
356,1.1409
357,1.1885
358,0.91769
359,0.30496999999999996
360,-0.55171
361,-1.4217
362,-2.1256
363,-2.5029
364,-2.5167
365,-2.1745
366,-1.6127
367,-0.99572
368,-0.39986
369,0.11762
370,0.57691
371,1.0079
372,1.4732
373,1.9459
374,2.3665
375,2.6422
376,2.6578
377,2.366
378,1.7869
379,1.005
380,0.11035
381,-0.74007
382,-1.4537
383,-1.9965
384,-2.3429
385,-2.5216
386,-2.5695
387,-2.4413
388,-2.1246
389,-1.6082
390,-0.9307799999999999
391,-0.12834
392,0.68055
393,1.3947
394,1.8743
395,2.0905
396,2.0111
397,1.694
398,1.2439
399,0.76223
400,0.36684
401,0.065478
402,-0.10657
403,-0.18792
404,-0.18642999999999998
405,-0.15427000000000002
406,-0.12024000000000001
407,-0.097972
408,-0.10849
409,-0.16969
410,-0.27061
411,-0.39664
412,-0.51202
413,-0.61937
414,-0.6653100000000001
415,-0.63802
416,-0.56588
417,-0.43699
418,-0.30299
419,-0.19027
420,-0.08552
421,0.031065
422,0.17748
423,0.34085
424,0.53637
425,0.7300300000000001
426,0.8504700000000001
427,0.8382
428,0.6907300000000001
429,0.43803000000000003
430,0.10554000000000001
431,-0.20121
432,-0.41635
433,-0.51012
434,-0.46878000000000003
435,-0.35705
436,-0.20901
437,-0.075002
438,0.00017063
439,-0.0085314
440,-0.057655
441,-0.13685
442,-0.19891
443,-0.20249
444,-0.13230999999999998
445,0.030249
446,0.26521
447,0.52756
448,0.77094
449,0.93574
450,0.98679
451,0.8847200000000001
452,0.5944699999999999
453,0.14584
454,-0.4096
455,-0.998
456,-1.5179
457,-1.8337
458,-1.8571
459,-1.5929
460,-1.0321
461,-0.2393
462,0.64022
463,1.4481
464,2.0679
465,2.3737
466,2.3104
467,1.8908
468,1.2079
469,0.34792
470,-0.56345
471,-1.3543
472,-1.9194
473,-2.2109
474,-2.2061
475,-1.9405
476,-1.4727
477,-0.9034399999999999
478,-0.2845
479,0.30126
480,0.83205
481,1.2790000000000001
482,1.6095
483,1.8295
484,1.9087
485,1.8426
486,1.5972
487,1.1995
488,0.61011
489,-0.092347
490,-0.8062
491,-1.4517
492,-1.9419
493,-2.2037
494,-2.2148
495,-1.9849
496,-1.5705
497,-1.0125
498,-0.38915
499,0.22129000000000001
