time,value
0,1.6221
1,1.7697
2,1.7769
3,1.6412
4,1.3868
5,1.036
6,0.6309
7,0.21195
8,-0.17507999999999999
9,-0.5108600000000001
10,-0.76956
11,-0.95349
12,-1.0725
13,-1.1474
14,-1.1823
15,-1.1878
16,-1.1591
17,-1.074
18,-0.90685
19,-0.65004
20,-0.29830999999999996
21,0.13067
22,0.59696
23,1.0352
24,1.3895
25,1.5985
26,1.6440000000000001
27,1.5101
28,1.2362
29,0.8472799999999999
30,0.40358
31,-0.051966
32,-0.47591999999999995
33,-0.82621
34,-1.0975
35,-1.2727
36,-1.3574
37,-1.3511
38,-1.265
39,-1.1094
40,-0.89955
41,-0.6483899999999999
42,-0.37138000000000004
43,-0.088509
44,0.18077000000000001
45,0.43238000000000004
46,0.6565300000000001
47,0.85855
48,1.0366
49,1.1772
50,1.2736
51,1.3055
52,1.2522
53,1.1013
54,0.84436
55,0.50013
56,0.099196
57,-0.31301999999999996
58,-0.69633
59,-0.99802
60,-1.1988
61,-1.278
62,-1.2476
63,-1.1162
64,-0.92769
65,-0.70714
66,-0.48596999999999996
67,-0.2773
68,-0.10425999999999999
69,0.038284
70,0.14381
71,0.22103000000000003
72,0.27265
73,0.31275
74,0.34221999999999997
75,0.37066
76,0.39915
77,0.42727
78,0.44803000000000004
79,0.4657
80,0.47507
81,0.46966
82,0.43933
83,0.38859
84,0.32006999999999997
85,0.23664000000000002
86,0.14362
87,0.046849
88,-0.072103
89,-0.20722
90,-0.36684
91,-0.54374
92,-0.72282
93,-0.88108
94,-0.9908299999999999
95,-1.0173
96,-0.9470299999999999
97,-0.78795
98,-0.5460699999999999
99,-0.2517
100,0.063403
101,0.35831
102,0.6266
103,0.84551
104,1.0115
105,1.1066
106,1.1355
107,1.0884
108,0.9598
109,0.74893
110,0.47462
111,0.14802
112,-0.19402
113,-0.52523
114,-0.8098
115,-1.0318
116,-1.1746
117,-1.2348
118,-1.2269
119,-1.1524
120,-1.0079
121,-0.79418
122,-0.51972
123,-0.19642
124,0.1572
125,0.50857
126,0.8264100000000001
127,1.0659
128,1.2122
129,1.2425
130,1.1758
131,1.0192
132,0.81074
133,0.5606800000000001
134,0.30272
135,0.059368
136,-0.15489
137,-0.3346
138,-0.47536000000000006
139,-0.5774699999999999
140,-0.65045
141,-0.706
142,-0.7388
143,-0.7521
144,-0.73511
145,-0.67072
146,-0.5512199999999999
147,-0.38226
148,-0.17477
149,0.04962
150,0.26421
151,0.43551000000000006
152,0.54727
153,0.59368
154,0.57558
155,0.51145
156,0.41081000000000006
157,0.28895
158,0.14165
159,-0.019814
160,-0.19517
161,-0.36162
162,-0.51052
163,-0.60793
164,-0.64744
165,-0.6095
166,-0.50252
167,-0.35034
168,-0.1802
169,-0.0080998
170,0.15084
171,0.28762
172,0.41413
173,0.53705
174,0.64999
175,0.7394
176,0.78179
177,0.7502300000000001
178,0.62739
179,0.42296999999999996
180,0.16792
181,-0.097535
182,-0.30738000000000004
183,-0.42913999999999997
184,-0.44638
185,-0.37755
186,-0.26042
187,-0.15172
188,-0.10415
189,-0.12792
190,-0.23658
191,-0.4052
192,-0.60317
193,-0.80292
194,-0.98251
195,-1.1275
196,-1.22
197,-1.2354
198,-1.1391
199,-0.92104
200,-0.56286
201,-0.068969
202,0.51771
203,1.123
204,1.6755
205,2.0914
206,2.3194
207,2.3478
208,2.1816
209,1.8645
210,1.4586
211,1.0133
212,0.55257
213,0.09840399999999999
214,-0.34811
215,-0.79565
216,-1.2353
217,-1.6512
218,-2.016
219,-2.2889
220,-2.4362
221,-2.4395
222,-2.2882
223,-1.9882
224,-1.5475
225,-0.99466
226,-0.36873
227,0.2926
228,0.95044
229,1.5458
230,2.031
231,2.3558
232,2.4769
233,2.3888
234,2.1168
235,1.6907
236,1.1768
237,0.63575
238,0.12432
239,-0.32104
240,-0.6803100000000001
241,-0.9535600000000001
242,-1.1476
243,-1.2846
244,-1.3739
245,-1.4186
246,-1.4095
247,-1.3354
248,-1.1845
249,-0.95578
250,-0.6509199999999999
251,-0.29225999999999996
252,0.095484
253,0.48084
254,0.82796
255,1.1088
256,1.2975
257,1.3823
258,1.3441
259,1.1942
260,0.9385899999999999
261,0.5988100000000001
262,0.20761
263,-0.18892
264,-0.5484600000000001
265,-0.82455
266,-0.9910700000000001
267,-1.0464
268,-0.99995
269,-0.87687
270,-0.72569
271,-0.59133
272,-0.49328999999999995
273,-0.4509
274,-0.4406
275,-0.43206999999999995
276,-0.37479
277,-0.22788000000000003
278,0.036208
279,0.42765
280,0.91525
281,1.4343
282,1.9041
283,2.2266
284,2.327
285,2.1478
286,1.6726
287,0.93155
288,0.0065188
289,-0.9823299999999999
290,-1.9189
291,-2.6703
292,-3.1318
293,-3.2521
294,-3.0265
295,-2.494
296,-1.7388
297,-0.87087
298,-7.4138e-05
299,0.76246
300,1.3602
301,1.7639
302,1.9763
303,2.0281
304,1.9655
305,1.8229
306,1.6424
307,1.4444
308,1.2161
309,0.96109
310,0.66594
311,0.30564
312,-0.12439000000000001
313,-0.60117
314,-1.0992
315,-1.5757
316,-1.9685
317,-2.2274
318,-2.3064
319,-2.1805
320,-1.8628
321,-1.3756
322,-0.7788
323,-0.14013
324,0.47425
325,0.99631
326,1.3773
327,1.607
328,1.6814
329,1.6187
330,1.4592
331,1.237
332,0.98703
333,0.73529
334,0.4892
335,0.24769000000000002
336,0.010081999999999999
337,-0.23638
338,-0.49661000000000005
339,-0.7662899999999999
340,-1.0216
341,-1.2335
342,-1.3702
343,-1.3940000000000001
344,-1.2934
345,-1.0643
346,-0.7257
347,-0.32173
348,0.09487899999999999
349,0.48343
350,0.80637
351,1.041
352,1.1779
353,1.2114
354,1.1409
355,0.9735299999999999
356,0.72377
357,0.41223999999999994
358,0.06782200000000001
359,-0.26899999999999996
360,-0.54875
361,-0.73193
362,-0.7964600000000001
363,-0.74922
364,-0.6166
365,-0.45022
366,-0.30683
367,-0.23226
368,-0.23176999999999998
369,-0.29469
370,-0.37355
371,-0.40168000000000004
372,-0.33557
373,-0.14577
374,0.16275
375,0.53576
376,0.9091799999999999
377,1.2083
378,1.3665
379,1.3438
380,1.1312
381,0.75413
382,0.26215
383,-0.27779
384,-0.8103199999999999
385,-1.2637
386,-1.5834
387,-1.7309
388,-1.6796
389,-1.449
390,-1.0627
391,-0.5725399999999999
392,-0.047398
393,0.43511000000000005
394,0.82736
395,1.0984
396,1.2257
397,1.2285
398,1.1328
399,0.9675600000000001
400,0.77457
401,0.5771
402,0.38316999999999996
403,0.1902
404,0.005668600000000001
405,-0.18512
406,-0.37842
407,-0.57317
408,-0.7674300000000001
409,-0.9369
410,-1.0704
411,-1.149
412,-1.1413
413,-1.0327
414,-0.8143600000000001
415,-0.5018199999999999
416,-0.1133
417,0.30107
418,0.69229
419,1.0078
420,1.2042
421,1.2703
422,1.1968
423,1.0066
424,0.73065
425,0.40489
426,0.074226
427,-0.22553
428,-0.47189
429,-0.63525
430,-0.7116899999999999
431,-0.6986600000000001
432,-0.6087199999999999
433,-0.47456000000000004
434,-0.32474000000000003
435,-0.19124000000000002
436,-0.10092000000000001
437,-0.06361900000000001
438,-0.06919
439,-0.096072
440,-0.095925
441,-0.043954
442,0.065207
443,0.2216
444,0.38335
445,0.51659
446,0.5746100000000001
447,0.53987
448,0.4136
449,0.21996999999999997
450,-0.0039211
451,-0.21866
452,-0.39249
453,-0.51037
454,-0.55984
455,-0.54938
456,-0.4811
457,-0.37264
458,-0.22638000000000003
459,-0.057659
460,0.1219
461,0.28486999999999996
462,0.41315
463,0.48533999999999994
464,0.48435
465,0.41666000000000003
466,0.29609
467,0.15494000000000002
468,0.029013
469,-0.06576699999999999
470,-0.10098
471,-0.083911
472,-0.034533
473,0.038755
474,0.11169000000000001
475,0.15832000000000002
476,0.15871
477,0.10091
478,-0.026264
479,-0.21322
480,-0.43759
481,-0.66985
482,-0.8638100000000001
483,-0.98008
484,-0.9862
485,-0.8580700000000001
486,-0.60109
487,-0.25648000000000004
488,0.13037
489,0.49653
490,0.80253
491,1.0115
492,1.1147
493,1.1225
494,1.0466
495,0.89487
496,0.68295
497,0.42668999999999996
498,0.13788
499,-0.15675999999999998
