time,value
0,1.0838
1,1.0838
2,1.0838
3,1.0838
4,1.0838
5,1.0838
6,1.0838
7,1.0838
8,1.0838
9,1.0838
10,1.0838
11,1.0838
12,1.0838
13,1.0838
14,1.0838
15,1.0838
16,1.0838
17,1.0838
18,1.0838
19,1.0838
20,1.0838
21,1.0838
22,1.0838
23,1.0838
24,1.0838
25,1.0838
26,1.0838
27,1.0838
28,1.0838
29,1.0838
30,1.0838
31,1.0838
32,1.0838
33,1.0838
34,1.0838
35,1.0888
36,1.0959
37,1.1068
38,1.1177
39,1.1287
40,1.1396
41,1.1495
42,1.1576
43,1.16
44,1.16
45,1.16
46,1.16
47,1.16
48,1.16
49,1.162
50,1.1727
51,1.1835
52,1.1944
53,1.2053
54,1.2163
55,1.2272
56,1.2329999999999999
57,1.2362
58,1.2362
59,1.2362
60,1.2362
61,1.2362
62,1.2362
63,1.2362
64,1.2362
65,1.2362
66,1.2362
67,1.2362
68,1.2362
69,1.2362
70,1.2362
71,1.2362
72,1.2362
73,1.2362
74,1.2362
75,1.2362
76,1.2362
77,1.2362
78,1.2362
79,1.2362
80,1.2362
81,1.2362
82,1.2362
83,1.2362
84,1.2362
85,1.2362
86,1.2362
87,1.2362
88,1.2362
89,1.2362
90,1.2348
91,1.2321
92,1.2221
93,1.2112
94,1.2002
95,1.1893
96,1.1784
97,1.1675
98,1.1566
99,1.1456
100,1.1347
101,1.1238
102,1.1129
103,1.102
104,1.091
105,1.0833
106,1.0765
107,1.071
108,1.0656
109,1.0601
110,1.0546
111,1.0484
112,1.0409
113,1.0309
114,1.0199
115,1.0090000000000001
116,0.9981
117,0.98718
118,0.9754299999999999
119,0.9612200000000001
120,0.9393799999999999
121,0.9175399999999999
122,0.8957
123,0.8738600000000001
124,0.8520200000000001
125,0.8301799999999999
126,0.7861600000000001
127,0.7329899999999999
128,0.67293
129,0.61287
130,0.55281
131,0.49273999999999996
132,0.43572
133,0.38961
134,0.35139000000000004
135,0.31863
136,0.28586999999999996
137,0.25311
138,0.22035
139,0.18759
140,0.15483
141,0.12207
142,0.08930700000000001
143,0.056546000000000006
144,0.023786
145,-0.008974600000000001
146,-0.041735
147,-0.08035700000000001
148,-0.12330999999999999
149,-0.16695
150,-0.21063
151,-0.25431
152,-0.29799000000000003
153,-0.34049
154,-0.36658
155,-0.38839
156,-0.40476999999999996
157,-0.42115
158,-0.43753000000000003
159,-0.45391000000000004
160,-0.4692
161,-0.48363999999999996
162,-0.4948
163,-0.50572
164,-0.51664
165,-0.52756
166,-0.5384399999999999
167,-0.5486300000000001
168,-0.5545
169,-0.5545
170,-0.5545
171,-0.5545
172,-0.5545
173,-0.5545
174,-0.5545
175,-0.56228
176,-0.57148
177,-0.5824
178,-0.59332
179,-0.60424
180,-0.61516
181,-0.62936
182,-0.6482899999999999
183,-0.67377
184,-0.70107
185,-0.72837
186,-0.75567
187,-0.7829699999999999
188,-0.81125
189,-0.84085
190,-0.87361
191,-0.9063700000000001
192,-0.9391299999999999
193,-0.9718899999999999
194,-1.0046
195,-1.0374
196,-1.0702
197,-1.1029
198,-1.1357
199,-1.1684
200,-1.2012
201,-1.234
202,-1.2632
203,-1.2824
204,-1.2963
205,-1.3073
206,-1.3182
207,-1.3291
208,-1.34
209,-1.3482
210,-1.3546
211,-1.3546
212,-1.3546
213,-1.3546
214,-1.3546
215,-1.3545
216,-1.354
217,-1.3471
218,-1.3361
219,-1.3252
220,-1.3143
221,-1.3034
222,-1.2925
223,-1.2815
224,-1.2706
225,-1.2597
226,-1.2488
227,-1.2379
228,-1.2269
229,-1.216
230,-1.202
231,-1.186
232,-1.1643
233,-1.1425
234,-1.1206
235,-1.0988
236,-1.0772
237,-1.0583
238,-1.0457
239,-1.0402
240,-1.0347
241,-1.0293
242,-1.0238
243,-1.0184
244,-1.0129
245,-1.0121
246,-1.0117
247,-1.0117
248,-1.0117
249,-1.0117
250,-1.0117
251,-1.0132
252,-1.0164
253,-1.0215
254,-1.0270000000000001
255,-1.0324
256,-1.0379
257,-1.0434
258,-1.0504
259,-1.0588
260,-1.0697
261,-1.0806
262,-1.0915
263,-1.1024
264,-1.1132
265,-1.1236
266,-1.1168
267,-1.1058
268,-1.0949
269,-1.084
270,-1.0731
271,-1.0622
272,-1.05
273,-1.0351
274,-1.0192
275,-1.0028
276,-0.98645
277,-0.9700700000000001
278,-0.9536899999999999
279,-0.9373100000000001
280,-0.9209299999999999
281,-0.90455
282,-0.8881700000000001
283,-0.87179
284,-0.85541
285,-0.8392700000000001
286,-0.8237399999999999
287,-0.81124
288,-0.80032
289,-0.7894
290,-0.7784800000000001
291,-0.76756
292,-0.75664
293,-0.7457199999999999
294,-0.7348
295,-0.72388
296,-0.71296
297,-0.70204
298,-0.69112
299,-0.6802
300,-0.6713
301,-0.6635800000000001
302,-0.6581199999999999
303,-0.65266
304,-0.6472
305,-0.64174
306,-0.63627
307,-0.63081
308,-0.62535
309,-0.6198899999999999
310,-0.61443
311,-0.60897
312,-0.60351
313,-0.59805
314,-0.59259
