time,value
0,-0.98314
1,-0.98314
2,-0.98314
3,-0.98314
4,-0.98314
5,-0.98314
6,-0.98314
7,-0.98314
8,-0.98314
9,-0.98314
10,-0.98314
11,-0.98314
12,-0.98314
13,-0.98314
14,-0.98314
15,-0.98314
16,-0.98314
17,-0.98314
18,-0.98314
19,-0.98314
20,-0.98314
21,-0.98314
22,-0.98314
23,-0.98314
24,-0.98314
25,-0.98314
26,-0.98314
27,-0.98314
28,-0.98314
29,-0.98314
30,-0.98314
31,-0.98314
32,-0.98314
33,-0.98314
34,-0.98314
35,-0.98314
36,-0.98314
37,-0.98314
38,-0.98314
39,-0.98314
40,-0.98314
41,-0.98314
42,-0.98314
43,-0.98314
44,-0.98314
45,-0.98314
46,-0.98314
47,-0.98314
48,-0.98314
49,-0.98314
50,-0.98314
51,-0.98314
52,-0.98314
53,-0.9828
54,-0.8684200000000001
55,-0.9627899999999999
56,-0.93
57,-0.83962
58,-0.74911
59,-0.86134
60,-0.52059
61,-0.55538
62,-0.57592
63,-0.60395
64,-0.52927
65,-0.63689
66,-0.6641699999999999
67,-0.60002
68,-0.62003
69,-0.6655
70,-0.67506
71,-0.48891999999999997
72,-0.73252
73,-0.60658
74,-0.54491
75,-0.7314
76,-0.6309600000000001
77,-0.53879
78,-0.6009
79,-0.67302
80,-0.67816
81,-0.67209
82,-0.6825
83,-0.59039
84,-0.57205
85,-0.67518
86,-0.76075
87,-0.68515
88,-0.55834
89,-0.638
90,-0.6837
91,-0.67384
92,-0.5556300000000001
93,-0.5668
94,-0.6166699999999999
95,-0.589
96,-0.69962
97,-0.6734
98,-0.59564
99,-0.68115
100,-0.69511
101,-0.61121
102,-0.64572
103,-0.68487
104,-0.67308
105,-0.55632
106,-0.63547
107,-0.73742
108,-0.55547
109,-0.50367
110,-0.6249399999999999
111,-0.62452
112,-0.6552399999999999
113,-0.67019
114,-0.7376
115,-0.47175
116,-0.68084
117,-0.57018
118,-0.6885600000000001
119,-0.61834
120,-0.65591
121,-0.74751
122,-0.70093
123,-0.56706
124,-0.56948
125,-0.7369
126,-0.6580699999999999
127,-0.68918
128,-0.7682899999999999
129,-0.61248
130,-0.70049
131,-0.68386
132,-0.69982
133,-0.59258
134,-0.64527
135,-0.67051
136,-0.6423399999999999
137,-0.71032
138,-0.7255199999999999
139,-0.62975
140,-0.5052300000000001
141,-0.65765
142,-0.5482600000000001
143,-0.60382
144,-0.65783
145,-0.7299899999999999
146,-0.57549
147,-0.65658
148,-0.62568
149,-0.54243
150,-0.66388
151,-0.57176
152,-0.50288
153,-0.60788
154,-0.40452
155,-0.3797
156,-0.5851
157,-0.63835
158,-0.58836
159,-0.54555
160,-0.22663000000000003
161,-0.42183000000000004
162,-0.41558
163,-0.0028909
164,-0.038823
165,-0.011389
166,0.084298
167,-0.27716999999999997
168,-0.0034878
169,-0.12786
170,-0.20828000000000002
171,-0.30349
172,-0.15878
173,0.028421
174,0.39371
175,-0.26893
176,-0.10062
177,-0.20993
178,-0.07606
179,-0.1292
180,-0.18332
181,-0.21358000000000002
182,-0.27526
183,-0.17134000000000002
184,-0.073563
185,0.12377
186,-0.018721
187,-0.013826
188,-0.32538
189,0.27631999999999995
190,0.14811
191,-0.07079400000000001
192,0.36129
193,0.038014
194,0.66262
195,0.31629
196,0.11502000000000001
197,0.067673
198,0.45307
199,0.19683
200,0.056034
201,0.16050999999999999
202,-0.033616
203,0.092694
204,0.18555
205,0.39723
206,0.14805
207,0.18492999999999998
208,0.11012000000000001
209,0.0088243
210,0.34362
211,0.57538
212,0.80099
213,0.26375
214,0.35035
215,0.74845
216,0.78845
217,0.34952
218,0.64035
219,0.6320100000000001
220,0.6391600000000001
221,1.03
222,1.4286
223,0.48418999999999995
224,1.0702
225,0.44758000000000003
226,0.8224100000000001
227,1.6248
228,1.6579
229,1.6214
230,1.3133
231,1.4521
232,0.8428399999999999
233,1.5365
234,1.2686
235,1.4759
236,0.9735
237,1.5751
238,1.7112
239,1.1279
240,1.8795
241,2.4093
242,1.8475
243,1.2082
244,1.1631
245,1.1514
246,0.70219
247,1.9115
248,2.9417
249,1.4949
250,1.2109999999999999
251,0.8317
252,0.8912200000000001
253,1.4297
254,0.8557899999999999
255,1.0586
256,1.1982
257,0.9402200000000001
258,0.9283
259,2.1907
260,1.3473
261,0.97116
262,1.35
263,2.4530000000000003
264,1.8837
265,2.0521
266,1.432
267,2.3456
268,2.5849
269,2.7667
270,2.5483
271,3.4627
272,2.7559
273,2.5858
274,2.5518
275,1.7229
276,2.7508
277,1.091
278,1.8959
279,1.5869
280,0.9028700000000001
281,1.2673
282,0.46812
283,0.6978300000000001
284,0.28024
285,0.54045
286,0.68209
287,0.7449899999999999
288,0.7905300000000001
289,0.42295
290,0.7903899999999999
291,0.72438
292,0.38134
293,1.3939
294,0.9362
295,0.85764
296,0.85135
297,0.71281
298,0.9716899999999999
299,1.7009
300,1.1858
301,0.46826999999999996
302,1.0588
303,1.0222
304,2.6499
305,2.3463
306,0.9657
307,0.78728
308,0.71872
309,-0.16471
310,0.019823
311,-0.41915
312,-0.5310699999999999
313,-0.66991
314,-0.87075
315,-0.98265
316,-0.98314
317,-0.98314
318,-0.98314
