time,value
0,0.8555799999999999
1,0.8555799999999999
2,0.8555799999999999
3,0.8555799999999999
4,0.8555799999999999
5,0.8555799999999999
6,0.8555799999999999
7,0.8555799999999999
8,0.8555799999999999
9,0.8555799999999999
10,0.8555799999999999
11,0.8555799999999999
12,0.8555799999999999
13,0.8555799999999999
14,0.8555799999999999
15,0.8555799999999999
16,0.8555799999999999
17,0.8555799999999999
18,0.8555799999999999
19,0.8555799999999999
20,0.8555799999999999
21,0.8555799999999999
22,0.8555799999999999
23,0.86014
24,0.87665
25,0.90476
26,0.9763700000000001
27,1.0321
28,0.9941
29,0.95867
30,0.95336
31,0.94949
32,1.0532
33,1.157
34,1.2339
35,1.3094
36,1.3183
37,1.3183
38,1.3183
39,1.3183
40,1.3183
41,1.3183
42,1.2931
43,1.2563
44,1.2187
45,1.1807
46,1.104
47,0.99618
48,0.88285
49,0.76378
50,0.66692
51,0.6006100000000001
52,0.5453899999999999
53,0.51032
54,0.4854
55,0.4854
56,0.5007
57,0.56907
58,0.63866
59,0.7147
60,0.79074
61,0.8667799999999999
62,0.9428200000000001
63,1.0189
64,1.0949
65,1.1641
66,1.2331
67,1.2739
68,1.3113
69,1.2862
70,1.2482
71,1.1139
72,0.94971
73,0.76746
74,0.57736
75,0.39860999999999996
76,0.22649
77,0.091054
78,-0.016228
79,-0.06765800000000001
80,-0.063237
81,-0.044226999999999995
82,-0.006207
83,0.058091
84,0.16744
85,0.27821
86,0.39227
87,0.5010899999999999
88,0.59305
89,0.68228
90,0.75832
91,0.8316600000000001
92,0.8820600000000001
93,0.92855
94,0.87992
95,0.83129
96,0.57087
97,0.30473
98,0.038592
99,-0.22755
100,-0.42741999999999997
101,-0.61487
102,-0.74466
103,-0.8578399999999999
104,-0.91761
105,-0.95563
106,-0.94463
107,-0.90661
108,-0.86859
109,-0.83057
110,-0.79255
111,-0.75453
112,-0.7165
113,-0.67848
114,-0.64046
115,-0.60244
116,-0.56442
117,-0.5264
118,-0.5009100000000001
119,-0.51299
120,-0.5514600000000001
121,-0.7067899999999999
122,-0.8662299999999999
123,-1.0563
124,-1.2428
125,-1.3639
126,-1.4851
127,-1.5719
128,-1.6582
129,-1.7158
130,-1.7709
131,-1.7751
132,-1.7707
133,-1.6923
134,-1.5941
135,-1.4295
136,-1.2394
137,-1.0493
138,-0.85915
139,-0.74444
140,-0.68166
141,-0.67147
142,-0.7086100000000001
143,-0.78049
144,-0.8930799999999999
145,-1.0258
146,-1.1894
147,-1.3586
148,-1.5392
149,-1.7024
150,-1.8164
151,-1.9163
152,-1.9584
153,-1.9885
154,-1.939
155,-1.8819
156,-1.7162
157,-1.5506
158,-1.3068
159,-1.0631
160,-0.848
161,-0.6349100000000001
162,-0.58102
163,-0.55125
164,-0.63693
165,-0.7509899999999999
166,-0.88959
167,-1.037
168,-1.2231
169,-1.4282
170,-1.6114
171,-1.7803
172,-1.9126
173,-2.0137
174,-2.0912
175,-2.1425
176,-2.1418
177,-2.0658
178,-1.9129
179,-1.6123
180,-1.3191
181,-1.0456
182,-0.79881
183,-0.65204
184,-0.5303399999999999
185,-0.55687
186,-0.59412
187,-0.75652
188,-0.9192799999999999
189,-1.1094
190,-1.2995
191,-1.4896
192,-1.6797
193,-1.8085
194,-1.929
195,-2.0214
196,-2.1075
197,-2.1064
198,-2.0764
199,-1.9296
200,-1.7289
201,-1.4501
202,-1.1233
203,-0.83144
204,-0.56795
205,-0.3587
206,-0.20661999999999997
207,-0.12218
208,-0.13072
209,-0.16775
210,-0.25645999999999997
211,-0.35251
212,-0.46657
213,-0.57536
214,-0.66584
215,-0.74725
216,-0.7802600000000001
217,-0.81023
218,-0.81023
219,-0.8064100000000001
220,-0.66141
221,-0.5164
222,-0.3646
223,-0.21252
224,-0.060437
225,0.09164299999999999
226,0.21734
227,0.33759
228,0.41015
229,0.46792
230,0.48211000000000004
231,0.4774
232,0.42763
233,0.35159
234,0.25654
235,0.1469
236,0.075286
237,0.041687
238,0.048783
239,0.10890999999999999
240,0.19379000000000002
241,0.32111
242,0.45397
243,0.59956
244,0.73769
245,0.85175
246,0.95936
247,1.0357
248,1.1055
249,1.1196
250,1.1284
251,1.0076
252,0.8867700000000001
253,0.78315
254,0.67999
255,0.68012
256,0.6907399999999999
257,0.72765
258,0.76951
259,0.8379
260,0.91394
261,0.98998
262,1.0659999999999998
263,1.1238
264,1.1716
265,1.1888
266,1.1838
267,1.1542
268,1.1015
269,1.0419
270,0.9737899999999999
271,0.9167299999999999
272,0.8775299999999999
273,0.8267
274,0.75066
275,0.68272
276,0.6391
277,0.60596
278,0.61922
279,0.63542
280,0.6734399999999999
281,0.71082
282,0.7367600000000001
283,0.7627
284,0.76827
285,0.77358
286,0.80901
287,0.84703
288,0.8538
289,0.8552700000000001
290,0.8320799999999999
291,0.8023100000000001
292,0.7499399999999999
293,0.68893
294,0.62869
295,0.56886
296,0.52195
297,0.48393
298,0.4473
299,0.41194
300,0.39286
301,0.39286
302,0.40624
303,0.44013
304,0.47538
305,0.5134
306,0.53537
307,0.5123800000000001
308,0.47891999999999996
309,0.40288
310,0.32861999999999997
311,0.26614
312,0.20776999999999998
313,0.20776999999999998
314,0.20776999999999998
