time,value
0,1.0013
1,1.4054
2,1.6762
3,1.7506
4,1.6384
5,1.3623
6,1.0041
7,0.6219600000000001
8,0.26850999999999997
9,-0.033509
10,-0.29228000000000004
11,-0.52512
12,-0.7449
13,-0.9444799999999999
14,-1.0949
15,-1.167
16,-1.1324
17,-0.98435
18,-0.76351
19,-0.51149
20,-0.28852
21,-0.12779000000000001
22,-0.041422
23,-0.029119
24,-0.043087
25,-0.047747000000000005
26,-0.020063
27,0.044892
28,0.11603
29,0.16635999999999998
30,0.18445
31,0.18409
32,0.18166
33,0.20974
34,0.28862
35,0.42728999999999995
36,0.61953
37,0.82445
38,1.0009
39,1.1076
40,1.1043
41,0.98051
42,0.7348
43,0.38724000000000003
44,-0.027937
45,-0.48753
46,-0.95496
47,-1.3971
48,-1.7624
49,-2.0039
50,-2.0877
51,-1.9757
52,-1.6766
53,-1.2106
54,-0.6330100000000001
55,-0.004672600000000001
56,0.60201
57,1.1311
58,1.5451
59,1.8346
60,2.0024
61,2.0493
62,1.9793
63,1.7742
64,1.4262
65,0.9401
66,0.33391
67,-0.34345
68,-1.0331
69,-1.6472
70,-2.1108
71,-2.3679
72,-2.4043
73,-2.2192
74,-1.8347
75,-1.3155
76,-0.70396
77,-0.049789
78,0.58925
79,1.1637
80,1.6252
81,1.946
82,2.0709999999999997
83,1.9898
84,1.7189
85,1.2874
86,0.7518699999999999
87,0.18858
88,-0.32647
89,-0.73415
90,-0.98424
91,-1.0701
92,-1.0156
93,-0.86677
94,-0.67608
95,-0.49323
96,-0.34994000000000003
97,-0.26299
98,-0.23373000000000002
99,-0.23806999999999998
100,-0.26232
101,-0.28681999999999996
102,-0.30071
103,-0.30496
104,-0.29139
105,-0.25471
106,-0.17336
107,-0.057429999999999995
108,0.12005
109,0.34931999999999996
110,0.60309
111,0.85
112,1.0426
113,1.1463
114,1.1347
115,1.0164
116,0.8136899999999999
117,0.55709
118,0.28873000000000004
119,0.043874
120,-0.1728
121,-0.36491
122,-0.54357
123,-0.71575
124,-0.87164
125,-1.0098
126,-1.1063
127,-1.1465
128,-1.1282
129,-1.0455
130,-0.90009
131,-0.71542
132,-0.51334
133,-0.30209
134,-0.077081
135,0.16904
136,0.42782
137,0.68782
138,0.9364
139,1.1565
140,1.328
141,1.4321
142,1.4576
143,1.393
144,1.2397
145,0.9848100000000001
146,0.63679
147,0.209
148,-0.2762
149,-0.78514
150,-1.2579
151,-1.6241
152,-1.8388
153,-1.8644
154,-1.6951
155,-1.3552
156,-0.8939600000000001
157,-0.39732
158,0.076567
159,0.47463
160,0.7602
161,0.9183600000000001
162,0.9664799999999999
163,0.9167
164,0.79481
165,0.62164
166,0.40936
167,0.16447
168,-0.11679
169,-0.40184000000000003
170,-0.66669
171,-0.8615
172,-0.9364
173,-0.85201
174,-0.602
175,-0.21164000000000002
176,0.27604
177,0.78179
178,1.2391
179,1.574
180,1.7348
181,1.7041
182,1.4673
183,1.0636
184,0.5349
185,-0.06928
186,-0.68926
187,-1.2569
188,-1.7169
189,-2.0342
190,-2.1891
191,-2.1748
192,-1.9992
193,-1.6739
194,-1.2331
195,-0.7057
196,-0.12082999999999999
197,0.48371000000000003
198,1.0509
199,1.53
200,1.8651
201,2.0111
202,1.9363
203,1.6429
204,1.1828
205,0.6383
206,0.10347
207,-0.32765
208,-0.57103
209,-0.61678
210,-0.50047
211,-0.27260999999999996
212,-0.038293
213,0.12693
214,0.16852
215,0.095943
216,-0.067699
217,-0.27273000000000003
218,-0.46468000000000004
219,-0.6087899999999999
220,-0.69711
221,-0.75166
222,-0.78627
223,-0.81817
224,-0.8361799999999999
225,-0.81119
226,-0.72556
227,-0.55697
228,-0.304
229,0.01236
230,0.34836
231,0.63741
232,0.8410700000000001
233,0.9480700000000001
234,0.96121
235,0.9003700000000001
236,0.80237
237,0.69614
238,0.60326
239,0.53846
240,0.4874
241,0.43356999999999996
242,0.36707
243,0.28581
244,0.18841
245,0.05853200000000001
246,-0.10222
247,-0.30307
248,-0.54218
249,-0.80184
250,-1.0482
251,-1.2405
252,-1.3414
253,-1.3237
254,-1.1733
255,-0.9101
256,-0.5735899999999999
257,-0.23244
258,0.07585800000000001
259,0.31527
260,0.46818999999999994
261,0.54742
262,0.5755
263,0.56753
264,0.5421199999999999
265,0.51188
266,0.48468999999999995
267,0.45183999999999996
268,0.43406000000000006
269,0.44855
270,0.50131
271,0.60297
272,0.72597
273,0.83806
274,0.8912
275,0.8526100000000001
276,0.6866
277,0.39948
278,0.020971
279,-0.4167
280,-0.86255
281,-1.2769
282,-1.6304
283,-1.8823
284,-2.0209
285,-2.0368
286,-1.9258
287,-1.6848
288,-1.3123
289,-0.8406600000000001
290,-0.29525
291,0.29604
292,0.88513
293,1.4206
294,1.858
295,2.1845
296,2.381
297,2.4283
298,2.3212
299,2.066
300,1.6676
301,1.1395
302,0.5142
303,-0.1649
304,-0.85056
305,-1.4634
306,-1.9464
307,-2.2498
308,-2.3383
309,-2.2209
310,-1.9119
311,-1.4591
312,-0.94216
313,-0.42767
314,0.013280000000000002
315,0.34792
316,0.54094
317,0.60327
318,0.5633199999999999
319,0.4636
320,0.33874
321,0.21333000000000002
322,0.12517999999999999
323,0.077512
324,0.066856
325,0.086734
326,0.13994
327,0.25106999999999996
328,0.42155
329,0.63954
330,0.86164
331,1.0483
332,1.15
333,1.1123
334,0.91209
335,0.55586
336,0.098179
337,-0.3933
338,-0.8286
339,-1.1368
340,-1.2803
341,-1.2674
342,-1.1237
343,-0.9033399999999999
344,-0.6692600000000001
345,-0.47111000000000003
346,-0.34018000000000004
347,-0.27898
348,-0.27692
349,-0.30695
350,-0.33
351,-0.32616
352,-0.28662
353,-0.19776
354,-0.050411000000000004
355,0.14063
356,0.37524
357,0.6231800000000001
358,0.8495
359,1.0337
360,1.1559
361,1.2115
362,1.19
363,1.0927
364,0.9241799999999999
365,0.69794
366,0.42057
367,0.099727
368,-0.23053
369,-0.55345
370,-0.84435
371,-1.0755
372,-1.2245
373,-1.2812
374,-1.2649
375,-1.1957
376,-1.1037
377,-1.0132
378,-0.9277
379,-0.84511
380,-0.74347
381,-0.5978100000000001
382,-0.37329
383,-0.059762
384,0.32143
385,0.73837
386,1.1448
387,1.5066
388,1.7676
389,1.8940000000000001
390,1.8711
391,1.7054
392,1.4229
393,1.0547
394,0.6428
395,0.22566999999999998
396,-0.17012
397,-0.5277
398,-0.84231
399,-1.1202
400,-1.3634
401,-1.5756
402,-1.7381
403,-1.8257
404,-1.8043
405,-1.6414
406,-1.3529
407,-0.9597600000000001
408,-0.50571
409,-0.053828999999999995
410,0.35181999999999997
411,0.6723100000000001
412,0.89354
413,1.0376
414,1.136
415,1.2128
416,1.2661
417,1.2766
418,1.2115
419,1.0511
420,0.7841
421,0.43795
422,0.06966599999999999
423,-0.26734
424,-0.51542
425,-0.64473
426,-0.6685399999999999
427,-0.6236
428,-0.56719
429,-0.54022
430,-0.55378
431,-0.58609
432,-0.60687
433,-0.58875
434,-0.51008
435,-0.38095
436,-0.22601999999999997
437,-0.086437
438,0.015867
439,0.073145
440,0.096617
441,0.11799000000000001
442,0.17883
443,0.29044000000000003
444,0.43993000000000004
445,0.57401
446,0.6541
447,0.64851
448,0.52783
449,0.3157
450,0.046439999999999995
451,-0.2422
452,-0.49413
453,-0.6749
454,-0.77191
455,-0.78597
456,-0.71967
457,-0.59583
458,-0.40794
459,-0.15363
460,0.1579
461,0.50022
462,0.81526
463,1.0524
464,1.1769
465,1.1568
466,0.9895200000000001
467,0.6994100000000001
468,0.33702
469,-0.039297000000000006
470,-0.37778
471,-0.63588
472,-0.80219
473,-0.8841100000000001
474,-0.9118799999999999
475,-0.90499
476,-0.89002
477,-0.8847299999999999
478,-0.87403
479,-0.83975
480,-0.76146
481,-0.62142
482,-0.40554
483,-0.1304
484,0.17618
485,0.47703999999999996
486,0.7318100000000001
487,0.9122
488,1.0006
489,1.0058
490,0.95304
491,0.8826299999999999
492,0.81529
493,0.7716
494,0.74862
495,0.72618
496,0.6724899999999999
497,0.54889
498,0.33481
499,0.020405
