time,value
0,-0.14252
1,-0.14252
2,-0.14252
3,-0.14252
4,-0.14252
5,-0.14252
6,-0.14252
7,-0.14252
8,-0.14252
9,-0.14252
10,-0.14252
11,-0.14252
12,-0.14252
13,-0.14252
14,-0.14252
15,-0.14252
16,-0.14252
17,-0.14252
18,-0.14252
19,-0.14252
20,-0.14252
21,-0.14252
22,-0.14252
23,-0.14252
24,-0.14252
25,-0.14252
26,-0.14252
27,-0.14252
28,-0.14252
29,-0.14252
30,-0.14252
31,-0.14252
32,-0.14252
33,-0.14252
34,-0.14252
35,-0.14252
36,-0.14252
37,-0.14252
38,-0.14252
39,-0.14252
40,-0.14252
41,-0.14252
42,-0.14252
43,-0.14252
44,-0.14252
45,-0.14252
46,-0.14252
47,-0.14252
48,-0.14252
49,-0.14252
50,-0.14252
51,-0.14252
52,-0.14252
53,-0.14252
54,-0.14252
55,-0.14252
56,-0.14252
57,-0.14252
58,-0.14252
59,-0.14252
60,-0.14252
61,-0.14252
62,-0.14252
63,-0.14252
64,-0.14252
65,-0.14252
66,-0.14252
67,-0.14252
68,-0.14252
69,-0.14252
70,-0.14252
71,-0.14252
72,-0.14252
73,-0.14252
74,-0.14252
75,-0.14252
76,-0.14252
77,-0.14252
78,-0.14252
79,-0.14252
80,-0.14252
81,-0.14252
82,-0.14252
83,-0.14252
84,-0.14252
85,-0.14252
86,-0.14252
87,-0.14252
88,-0.14252
89,-0.14252
90,6.1422
91,4.1901
92,0.10744000000000001
93,-0.14252
94,-0.14252
95,-0.14252
96,-0.14252
97,-0.14252
98,-0.14252
99,-0.14252
100,-0.14252
101,-0.14252
102,-0.14252
103,-0.14252
104,-0.14252
105,-0.14252
106,-0.14252
107,-0.14252
108,-0.14252
109,-0.14252
110,-0.14252
111,-0.14252
112,-0.14252
113,-0.14252
114,-0.14252
115,-0.14252
116,-0.14252
117,-0.14252
118,-0.14252
119,-0.14252
120,-0.14252
121,-0.14252
122,-0.14252
123,-0.14252
124,-0.14252
125,-0.14252
126,-0.14252
127,-0.14252
128,-0.14252
129,-0.14252
130,-0.14252
131,-0.14252
132,-0.14252
133,-0.14252
134,-0.14252
135,-0.14252
136,-0.14252
137,-0.14252
138,-0.14252
139,-0.14252
140,-0.14252
141,-0.14252
142,-0.14252
143,-0.14252
144,-0.14252
145,-0.14252
146,-0.14252
147,-0.14252
148,-0.14252
149,-0.14252
150,-0.14252
151,-0.14252
152,-0.14252
153,-0.14252
154,-0.14252
155,-0.14252
156,-0.14252
157,-0.14252
158,-0.14252
159,-0.14252
160,-0.14252
161,-0.14252
162,-0.14252
163,7.5705
164,7.142
165,0.14315
166,1.1906
167,-0.071103
168,-0.14252
169,-0.14252
170,-0.14252
171,-0.14252
172,-0.14252
173,-0.14252
174,-0.14252
175,-0.14252
176,-0.14252
177,-0.14252
178,0.71448
179,2.4761
180,0.0003141
181,-0.14252
182,-0.14252
183,-0.14252
184,-0.14252
185,-0.14252
186,-0.14252
187,-0.14252
188,-0.14252
189,-0.14252
190,-0.14252
191,-0.14252
192,-0.14252
193,-0.14252
194,-0.14252
195,-0.14252
196,-0.14252
197,-0.14252
198,-0.14252
199,-0.14252
200,-0.14252
201,-0.14252
202,-0.14252
203,-0.14252
204,-0.14252
205,-0.14252
206,-0.14252
207,-0.14252
208,-0.14252
209,-0.14252
210,-0.14252
211,-0.14252
212,-0.14252
213,-0.14252
214,-0.14252
215,-0.14252
216,9.1417
217,5.5708
218,0.0003141
219,-0.14252
220,-0.14252
221,-0.14252
222,-0.14252
223,-0.14252
224,-0.14252
225,-0.14252
226,-0.14252
227,-0.14252
228,-0.14252
229,-0.14252
230,-0.14252
231,-0.14252
232,-0.14252
233,-0.14252
234,-0.14252
235,-0.14252
236,-0.14252
237,-0.14252
238,-0.14252
239,-0.14252
240,-0.14252
241,-0.14252
242,-0.14252
243,-0.14252
244,-0.14252
245,-0.14252
246,-0.14252
247,-0.14252
248,-0.14252
249,-0.14252
250,-0.14252
251,-0.14252
252,-0.14252
253,-0.14252
254,-0.14252
255,-0.14252
256,-0.14252
257,-0.14252
258,-0.14252
259,-0.14252
260,-0.14252
261,-0.14252
262,-0.14252
263,-0.14252
264,-0.14252
265,-0.14252
266,-0.14252
267,-0.14252
268,-0.14252
269,-0.14252
270,-0.14252
271,-0.14252
272,-0.14252
273,-0.14252
274,-0.14252
275,-0.14252
276,8.4513
277,6.7373
278,0.6430600000000001
279,-0.13062
280,-0.14252
281,-0.14252
282,-0.14252
283,-0.14252
284,-0.14252
285,-0.14252
286,-0.14252
287,-0.14252
288,-0.14252
289,-0.14252
290,-0.14252
291,-0.14252
292,-0.14252
293,-0.14252
294,-0.14252
295,-0.14252
296,-0.14252
297,-0.14252
298,-0.14252
299,-0.14252
300,-0.14252
301,-0.14252
302,-0.14252
303,-0.14252
304,-0.14252
305,-0.14252
306,-0.14252
307,-0.14252
308,-0.14252
309,-0.14252
310,-0.14252
311,-0.14252
312,-0.14252
313,-0.14252
314,-0.14252
315,-0.14252
316,-0.14252
317,-0.14252
318,-0.14252
319,-0.14252
320,-0.14252
321,-0.14252
322,-0.14252
323,-0.14252
324,-0.14252
325,-0.14252
326,-0.14252
327,-0.14252
328,-0.14252
329,-0.14252
330,-0.14252
331,-0.14252
332,-0.14252
333,-0.14252
334,-0.14252
335,-0.14252
336,-0.14252
337,-0.14252
338,-0.14252
339,-0.14252
340,-0.14252
341,-0.14252
342,-0.14252
343,-0.14252
344,-0.14252
345,-0.14252
346,-0.14252
347,-0.14252
348,-0.14252
349,-0.14252
350,-0.14252
351,-0.14252
352,-0.14252
353,-0.14252
354,-0.14252
355,-0.14252
356,-0.14252
357,-0.14252
358,-0.14252
359,-0.14252
360,-0.14252
361,-0.14252
362,-0.14252
363,-0.14252
364,-0.14252
365,-0.14252
366,-0.14252
367,-0.14252
368,-0.14252
369,-0.14252
370,-0.14252
371,-0.14252
372,-0.14252
373,-0.14252
374,-0.14252
375,-0.14252
376,-0.14252
377,-0.14252
378,-0.14252
379,-0.14252
380,-0.14252
381,-0.14252
382,-0.14252
383,-0.14252
384,-0.14252
385,-0.14252
386,-0.14252
387,-0.14252
388,-0.14252
389,-0.14252
390,-0.14252
391,10.356
392,-0.11871
393,-0.14252
394,-0.14252
395,-0.14252
396,-0.14252
397,-0.14252
398,-0.14252
399,0.6430600000000001
400,1.7857
401,-0.071103
402,-0.14252
403,-0.14252
404,-0.14252
405,-0.14252
406,-0.14252
407,-0.14252
408,-0.14252
409,-0.14252
410,-0.14252
411,-0.14252
412,-0.14252
413,-0.14252
414,-0.14252
415,-0.14252
416,-0.14252
417,-0.14252
418,-0.14252
419,-0.14252
420,-0.14252
421,-0.14252
422,-0.14252
423,-0.14252
424,-0.14252
425,-0.14252
426,-0.14252
427,-0.14252
428,-0.14252
429,-0.14252
430,-0.14252
431,-0.14252
432,-0.14252
433,-0.14252
434,-0.14252
435,-0.14252
436,-0.14252
437,-0.14252
438,-0.14252
439,-0.14252
440,-0.14252
441,-0.14252
442,-0.14252
443,-0.14252
444,5.0352
445,0.036022000000000005
446,-0.14252
447,-0.14252
448,-0.14252
449,-0.14252
450,-0.14252
451,-0.14252
452,-0.14252
453,-0.14252
454,-0.14252
455,-0.14252
456,-0.14252
457,-0.14252
458,-0.14252
459,-0.14252
460,-0.14252
461,-0.14252
462,-0.14252
463,-0.14252
464,-0.14252
465,-0.14252
466,-0.14252
467,-0.14252
468,-0.14252
469,-0.14252
470,-0.14252
471,-0.14252
472,-0.14252
473,-0.14252
474,-0.14252
475,-0.14252
476,-0.14252
477,-0.14252
478,-0.14252
479,-0.14252
480,-0.14252
481,-0.14252
482,-0.14252
483,-0.14252
484,-0.14252
485,-0.14252
486,-0.14252
487,-0.14252
488,-0.14252
489,-0.14252
490,-0.14252
491,-0.14252
492,-0.14252
493,-0.14252
494,-0.14252
495,-0.14252
496,-0.14252
497,-0.14252
498,-0.14252
499,-0.14252
500,-0.14252
501,-0.14252
502,-0.14252
503,-0.14252
504,-0.14252
505,-0.14252
506,-0.14252
507,-0.14252
508,-0.14252
509,-0.14252
510,-0.14252
511,-0.14252
512,-0.14252
513,-0.14252
514,-0.14252
515,-0.14252
516,-0.14252
517,-0.14252
518,-0.14252
519,-0.14252
520,-0.13062
521,-0.14252
522,-0.14252
523,-0.14252
524,-0.14252
525,-0.14252
526,-0.14252
527,-0.14252
528,-0.14252
529,-0.14252
530,-0.14252
531,-0.14252
532,-0.14252
533,-0.14252
534,-0.14252
535,-0.14252
536,-0.14252
537,-0.14252
538,-0.14252
539,-0.14252
540,-0.14252
541,-0.14252
542,-0.14252
543,-0.14252
544,-0.14252
545,-0.14252
546,-0.14252
547,-0.14252
548,-0.14252
549,-0.14252
550,-0.14252
551,-0.14252
552,-0.14252
553,-0.14252
554,0.0003141
555,10.106
556,2.9998
557,0.0003141
558,-0.14252
559,-0.14252
560,-0.14252
561,-0.14252
562,-0.14252
563,-0.14252
564,-0.14252
565,-0.14252
566,-0.14252
567,-0.14252
568,-0.14252
569,-0.14252
570,-0.14252
571,-0.14252
572,-0.14252
573,-0.14252
574,-0.14252
575,-0.14252
576,-0.14252
577,-0.14252
578,-0.14252
579,-0.14252
580,-0.14252
581,-0.14252
582,-0.14252
583,-0.14252
584,-0.14252
585,-0.14252
586,-0.14252
587,-0.14252
588,-0.14252
589,-0.14252
590,-0.14252
591,-0.14252
592,-0.14252
593,-0.14252
594,-0.14252
595,-0.14252
596,-0.14252
597,-0.14252
598,-0.14252
599,-0.14252
600,-0.14252
601,-0.14252
602,-0.14252
603,-0.14252
604,-0.14252
605,-0.14252
606,-0.14252
607,-0.14252
608,-0.14252
609,-0.14252
610,-0.14252
611,-0.14252
612,-0.14252
613,-0.14252
614,7.3562
615,0.036022000000000005
616,-0.14252
617,-0.14252
618,-0.14252
619,-0.14252
620,-0.14252
621,-0.14252
622,-0.14252
623,-0.14252
624,-0.14252
625,-0.14252
626,-0.14252
627,-0.14252
628,-0.14252
629,-0.14252
630,-0.14252
631,-0.14252
632,-0.14252
633,-0.14252
634,-0.14252
635,-0.14252
636,-0.14252
637,-0.14252
638,-0.14252
639,-0.14252
640,-0.14252
641,-0.14252
642,-0.14252
643,-0.14252
644,-0.14252
645,-0.14252
646,-0.14252
647,-0.14252
648,-0.14252
649,-0.14252
650,-0.14252
651,-0.14252
652,-0.14252
653,-0.14252
654,-0.14252
655,-0.14252
656,-0.14252
657,-0.14252
658,-0.14252
659,-0.14252
660,-0.14252
661,-0.14252
662,-0.14252
663,-0.14252
664,-0.14252
665,-0.14252
666,-0.14252
667,-0.14252
668,-0.14252
669,-0.14252
670,-0.14252
671,-0.14252
672,-0.14252
673,-0.14252
674,-0.14252
675,-0.14252
676,-0.14252
677,-0.14252
678,-0.14252
679,-0.14252
680,-0.14252
681,-0.14252
682,-0.14252
683,-0.14252
684,-0.14252
685,-0.14252
686,-0.14252
687,-0.14252
688,-0.14252
689,-0.14252
690,-0.14252
691,-0.14252
692,-0.14252
693,-0.14252
694,-0.14252
695,-0.14252
696,-0.14252
697,-0.14252
698,-0.14252
699,-0.14252
700,-0.14252
701,-0.14252
702,-0.14252
703,-0.14252
704,-0.14252
705,-0.14252
706,-0.14252
707,-0.14252
708,-0.14252
709,-0.14252
710,-0.14252
711,-0.14252
712,-0.14252
713,-0.14252
714,-0.14252
715,-0.14252
716,-0.14252
717,-0.14252
718,-0.14252
719,-0.14252
