time,value
0,1.8907
1,1.8907
2,1.8907
3,1.8907
4,1.8907
5,1.8907
6,1.8907
7,1.8907
8,1.8907
9,1.8907
10,1.8907
11,1.8907
12,1.8907
13,1.8907
14,1.8907
15,1.8907
16,1.8907
17,1.8907
18,1.8907
19,1.8907
20,1.8907
21,1.8907
22,1.8907
23,1.8907
24,1.8907
25,1.8907
26,1.8907
27,1.8907
28,1.8907
29,1.8907
30,1.8907
31,1.8907
32,1.8907
33,1.8907
34,1.8907
35,1.8907
36,1.8907
37,1.8907
38,1.8907
39,1.8907
40,1.8907
41,1.8907
42,1.8907
43,1.8907
44,1.8907
45,1.8883
46,1.8709
47,1.8535
48,1.8361
49,1.8188
50,1.8014
51,1.784
52,1.7666
53,1.7382
54,1.7043
55,1.6627
56,1.6193
57,1.5685
58,1.5167
59,1.4558
60,1.395
61,1.3342
62,1.2734
63,1.2126
64,1.1525
65,1.0933
66,1.0433
67,0.9998600000000001
68,0.9564299999999999
69,0.91299
70,0.86956
71,0.8261299999999999
72,0.7827
73,0.73926
74,0.6958300000000001
75,0.6524
76,0.6089600000000001
77,0.56728
78,0.52859
79,0.49187
80,0.45711999999999997
81,0.42236999999999997
82,0.38763000000000003
83,0.35288
84,0.31813
85,0.28198
86,0.24548000000000003
87,0.20205
88,0.15862
89,0.11517999999999999
90,0.061824000000000004
91,-0.016355
92,-0.094534
93,-0.17271
94,-0.25089
95,-0.32907
96,-0.40725
97,-0.48543000000000003
98,-0.55018
99,-0.61178
100,-0.66446
101,-0.71545
102,-0.75178
103,-0.78427
104,-0.8016399999999999
105,-0.81823
106,-0.8332299999999999
107,-0.8453
108,-0.8539899999999999
109,-0.8622
110,-0.8701
111,-0.87226
112,-0.87226
113,-0.87226
114,-0.87226
115,-0.87226
116,-0.87226
117,-0.87226
118,-0.8691
119,-0.8564700000000001
120,-0.84203
121,-0.8246600000000001
122,-0.8145600000000001
123,-0.8114
124,-0.81586
125,-0.8245399999999999
126,-0.8332299999999999
127,-0.8419200000000001
128,-0.8506
129,-0.8594
130,-0.87125
131,-0.88546
132,-0.9115200000000001
133,-0.93758
134,-0.9636399999999999
135,-0.98225
136,-0.9909399999999999
137,-0.9996299999999999
138,-1.0083
139,-1.0121
140,-1.0137
141,-1.014
142,-1.014
143,-0.99816
144,-0.9807899999999999
145,-0.95473
146,-0.9278200000000001
147,-0.89781
148,-0.8661700000000001
149,-0.83142
150,-0.79893
151,-0.76893
152,-0.74659
153,-0.72922
154,-0.71301
155,-0.69722
156,-0.69515
157,-0.69515
158,-0.69515
159,-0.69722
160,-0.71301
161,-0.72922
162,-0.74659
163,-0.7639600000000001
164,-0.7813399999999999
165,-0.79871
166,-0.81608
167,-0.83035
168,-0.84299
169,-0.8525200000000001
170,-0.86121
171,-0.867
172,-0.87226
173,-0.87226
174,-0.87198
175,-0.8704
176,-0.8666200000000001
177,-0.8579399999999999
178,-0.84925
179,-0.8405600000000001
180,-0.83188
181,-0.82319
182,-0.8145
183,-0.80582
184,-0.78528
185,-0.7623800000000001
186,-0.73644
187,-0.7109
188,-0.6903699999999999
189,-0.67055
190,-0.65318
191,-0.63722
192,-0.62379
193,-0.61268
194,-0.6039899999999999
195,-0.59677
196,-0.59046
197,-0.5888800000000001
198,-0.5888800000000001
199,-0.5888800000000001
200,-0.5888800000000001
201,-0.5888800000000001
202,-0.5888800000000001
203,-0.5888800000000001
204,-0.5888800000000001
205,-0.5888800000000001
206,-0.5888800000000001
207,-0.5888800000000001
208,-0.58549
209,-0.57918
210,-0.57128
211,-0.5625899999999999
212,-0.55391
213,-0.5452199999999999
214,-0.5365300000000001
215,-0.52785
216,-0.5191600000000001
217,-0.51047
218,-0.50179
219,-0.4931
220,-0.48441000000000006
221,-0.47573000000000004
222,-0.46703999999999996
223,-0.45835
224,-0.44966999999999996
225,-0.43478
226,-0.4174
227,-0.40003
228,-0.38266
229,-0.37916
230,-0.37634
231,-0.37634
232,-0.37634
233,-0.37634
234,-0.37634
235,-0.37634
236,-0.37831
237,-0.38226
238,-0.3892
239,-0.39789
240,-0.40476999999999996
241,-0.41108999999999996
242,-0.41176
243,-0.41176
244,-0.41176
245,-0.41176
246,-0.41176
247,-0.41176
248,-0.41176
249,-0.40847
250,-0.40058
251,-0.39225
252,-0.38356
253,-0.37487
254,-0.36619
255,-0.3575
256,-0.34881
257,-0.34013000000000004
258,-0.33144
259,-0.32275
260,-0.31471
261,-0.30918
262,-0.30549
263,-0.30549
264,-0.30549
265,-0.30549
266,-0.30549
267,-0.30549
268,-0.30549
269,-0.30549
270,-0.31294
271,-0.32163
272,-0.33031
273,-0.33815
274,-0.33973000000000003
275,-0.34092
276,-0.34092
277,-0.34302
278,-0.34855
279,-0.35569
280,-0.36438000000000004
281,-0.37306999999999996
282,-0.38175
283,-0.39044
284,-0.39913000000000004
285,-0.40567
286,-0.41176
287,-0.41176
288,-0.41176
289,-0.41176
290,-0.41176
291,-0.41176
292,-0.41176
293,-0.41176
294,-0.41176
295,-0.41176
296,-0.41176
297,-0.41176
298,-0.40657
299,-0.40026
300,-0.39168000000000003
301,-0.38378
302,-0.38456999999999997
303,-0.38706
304,-0.39574000000000004
305,-0.40334000000000003
306,-0.40886999999999996
307,-0.41176
308,-0.41176
309,-0.41272
310,-0.4143
311,-0.42113
312,-0.42981
313,-0.4385
314,-0.44719
