time,value
0,-0.28315
1,-0.25842
2,-0.21957
3,-0.15182
4,-0.040147
5,0.1191
6,0.28376
7,0.42185
8,0.48291000000000006
9,0.42928999999999995
10,0.26186
11,0.037218
12,-0.16292
13,-0.26208000000000004
14,-0.20651999999999998
15,-0.016123
16,0.23476
17,0.42651999999999995
18,0.44728
19,0.24791
20,-0.14042000000000002
21,-0.6271399999999999
22,-1.0668
23,-1.3087
24,-1.2715
25,-0.9681299999999999
26,-0.47505
27,0.080967
28,0.55904
29,0.86475
30,1.0001
31,0.9908299999999999
32,0.90284
33,0.78687
34,0.67015
35,0.53795
36,0.35508
37,0.10744000000000001
38,-0.1925
39,-0.49249
40,-0.69295
41,-0.69934
42,-0.45643
43,0.011228
44,0.61188
45,1.1826
46,1.5754
47,1.6567
48,1.3701
49,0.7561
50,-0.068957
51,-0.93284
52,-1.6739
53,-2.1797
54,-2.3956
55,-2.3366
56,-2.0636
57,-1.6397
58,-1.1143
59,-0.51874
60,0.1185
61,0.7763100000000001
62,1.4218
63,1.9741
64,2.3632
65,2.531
66,2.4217
67,2.0662
68,1.5211
69,0.8867200000000001
70,0.25295
71,-0.3091
72,-0.76488
73,-1.115
74,-1.3846
75,-1.5896
76,-1.7288
77,-1.7645
78,-1.6552
79,-1.3719999999999999
80,-0.91695
81,-0.32525
82,0.31671
83,0.9051100000000001
84,1.3459999999999999
85,1.56
86,1.5302
87,1.2819
88,0.883
89,0.43051999999999996
90,-0.0076675
91,-0.37482
92,-0.63313
93,-0.76707
94,-0.78275
95,-0.6915899999999999
96,-0.4959
97,-0.21254
98,0.12138
99,0.44641000000000003
100,0.6971
101,0.83167
102,0.8224600000000001
103,0.65815
104,0.37155
105,0.014913999999999998
106,-0.34707
107,-0.6398199999999999
108,-0.8124600000000001
109,-0.8431299999999999
110,-0.74356
111,-0.5511
112,-0.3089
113,-0.072654
114,0.11535
115,0.22735
116,0.273
117,0.27571
118,0.26489
119,0.26123
120,0.2986
121,0.3642
122,0.43593999999999994
123,0.47726
124,0.44614
125,0.33516
126,0.17098
127,-0.021931
128,-0.18781
129,-0.27884000000000003
130,-0.2668
131,-0.18857000000000002
132,-0.071506
133,0.035375
134,0.084382
135,0.049922
136,-0.078205
137,-0.28160999999999997
138,-0.52055
139,-0.74217
140,-0.88544
141,-0.9102600000000001
142,-0.79475
143,-0.53787
144,-0.13656
145,0.37725
146,0.96035
147,1.5326
148,2.022
149,2.3324
150,2.3664
151,2.0768
152,1.462
153,0.58509
154,-0.45193999999999995
155,-1.49
156,-2.3684
157,-2.9471
158,-3.1615
159,-2.9992
160,-2.4987
161,-1.7328
162,-0.82219
163,0.11880999999999999
164,1.0070000000000001
165,1.7530000000000001
166,2.2881
167,2.5935
168,2.6466
169,2.4621
170,2.065
171,1.5253
172,0.9096
173,0.2821
174,-0.30162
175,-0.80481
176,-1.2079
177,-1.5148
178,-1.7455
179,-1.8942
180,-1.9426
181,-1.8657
182,-1.6376
183,-1.2474
184,-0.71443
185,-0.10107999999999999
186,0.5270100000000001
187,1.0838
188,1.5087
189,1.7478
190,1.7762
191,1.6192
192,1.3154
193,0.9277799999999999
194,0.50358
195,0.10198
196,-0.21984
197,-0.4405
198,-0.55413
199,-0.55707
200,-0.46717
201,-0.32455
202,-0.19322999999999999
203,-0.09472
204,-0.045731
205,-0.059262
206,-0.13105
207,-0.21921
208,-0.30343000000000003
209,-0.36783000000000005
210,-0.40076999999999996
211,-0.40481
212,-0.38177
213,-0.35039000000000003
214,-0.3134
215,-0.24971
216,-0.1417
217,0.02775
218,0.25279
219,0.51574
220,0.78447
221,0.98274
222,1.0639
223,1.0148
224,0.83034
225,0.54337
226,0.19771
227,-0.12975
228,-0.39074000000000003
229,-0.55291
230,-0.6090399999999999
231,-0.5882
232,-0.51884
233,-0.44626000000000005
234,-0.40057
235,-0.3642
236,-0.32108000000000003
237,-0.24447
238,-0.115
239,0.061796000000000004
240,0.24944000000000002
241,0.40060999999999997
242,0.47653999999999996
243,0.44896
244,0.32752
245,0.14025
246,-0.06309
247,-0.22539
248,-0.2901
249,-0.2605
250,-0.15089
251,0.014464
252,0.19377
253,0.33724
254,0.40731999999999996
255,0.40747
256,0.33581
257,0.21311
258,0.057422
259,-0.10697000000000001
260,-0.25575
261,-0.39137
262,-0.51359
263,-0.61168
264,-0.67819
265,-0.70472
266,-0.6705800000000001
267,-0.5504100000000001
268,-0.3452
269,-0.055
270,0.29069
271,0.66769
272,1.0153
273,1.2814
274,1.4311
275,1.4352
276,1.2762
277,0.95781
278,0.51365
279,0.012718
280,-0.48568999999999996
281,-0.9232799999999999
282,-1.2422
283,-1.4315
284,-1.4846
285,-1.4144
286,-1.2437
287,-1.0097
288,-0.7199399999999999
289,-0.39352
290,-0.040908
291,0.32285
292,0.68655
293,1.0048
294,1.2319
295,1.3478
296,1.3132
297,1.1307
298,0.84111
299,0.49167
300,0.13651
301,-0.1647
302,-0.38067
303,-0.47193999999999997
304,-0.46903
305,-0.41106000000000004
306,-0.32303000000000004
307,-0.22175
308,-0.14664000000000002
309,-0.10843
310,-0.11599999999999999
311,-0.16343
312,-0.24169000000000002
313,-0.32692
314,-0.37522
315,-0.36064
316,-0.26576
317,-0.082525
318,0.15909
319,0.39676
320,0.5675600000000001
321,0.61944
322,0.54206
323,0.35207
324,0.10368
325,-0.11799000000000001
326,-0.24416999999999997
327,-0.23449
328,-0.12117
329,0.047382
330,0.17507
331,0.18565
332,0.044717
333,-0.21669000000000002
334,-0.51171
335,-0.72941
336,-0.80455
337,-0.68977
338,-0.40297
339,-0.033167
340,0.31171
341,0.53673
342,0.60443
343,0.5192100000000001
344,0.34928000000000003
345,0.16810999999999998
346,0.044936000000000004
347,0.012375
348,0.06252
349,0.13365
350,0.1823
351,0.16405999999999998
352,0.083324
353,-0.024322999999999997
354,-0.08870800000000001
355,-0.064677
356,0.056652999999999995
357,0.26434
358,0.49283999999999994
359,0.65084
360,0.6741
361,0.54123
362,0.27271999999999996
363,-0.075436
364,-0.44637
365,-0.7824800000000001
366,-1.0365
367,-1.2045
368,-1.3093
369,-1.3611
370,-1.3656
371,-1.3081
372,-1.1514
373,-0.85485
374,-0.39166999999999996
375,0.20967
376,0.89497
377,1.5783
378,2.1566
379,2.5384
380,2.6588
381,2.4917
382,2.0716
383,1.4517
384,0.71459
385,-0.050848000000000004
386,-0.76388
387,-1.3677
388,-1.8142
389,-2.0948
390,-2.1943
391,-2.1211
392,-1.8758
393,-1.4891
394,-0.98769
395,-0.43236
396,0.10727
397,0.58778
398,0.951
399,1.1467
400,1.1943
401,1.1299
402,0.99041
403,0.82831
404,0.66909
405,0.52471
406,0.38918
407,0.22613000000000003
408,0.020497
409,-0.20781999999999998
410,-0.43372
411,-0.62133
412,-0.7136100000000001
413,-0.6848
414,-0.53425
415,-0.29862
416,-0.022078
417,0.22841
418,0.39032
419,0.43731000000000003
420,0.38115
421,0.24006
422,0.05330700000000001
423,-0.13808
424,-0.2908
425,-0.40158
426,-0.4718
427,-0.48965
428,-0.44616999999999996
429,-0.34123000000000003
430,-0.19372999999999999
431,-0.013977000000000002
432,0.16643
433,0.3317
434,0.45348
435,0.50557
436,0.48841
437,0.43149
438,0.35511
439,0.26439
440,0.16405999999999998
441,0.05076
442,-0.088887
443,-0.26783
444,-0.46458
445,-0.64439
446,-0.7502
447,-0.72309
448,-0.53422
449,-0.20590999999999998
450,0.18635
451,0.54669
452,0.80095
453,0.8875200000000001
454,0.7794300000000001
455,0.5200100000000001
456,0.18261
457,-0.13656
458,-0.39688
459,-0.5523899999999999
460,-0.59847
461,-0.5624100000000001
462,-0.47101000000000004
463,-0.31676
464,-0.10417
465,0.18557
466,0.54919
467,0.92635
468,1.2179
469,1.325
470,1.1701
471,0.70502
472,-0.021727
473,-0.8847299999999999
474,-1.702
475,-2.306
476,-2.5577
477,-2.4163
478,-1.9186
479,-1.1737
480,-0.31799
481,0.52647
482,1.2547
483,1.8069
484,2.1849
485,2.3825
486,2.3945
487,2.2067
488,1.8154
489,1.2329
490,0.5133
491,-0.25687
492,-0.96483
493,-1.5118
494,-1.8361
495,-1.9092
496,-1.7730000000000001
497,-1.5057
498,-1.1966
499,-0.91495
