time,value
0,0.036542000000000005
1,0.16258
2,0.25804
3,0.32127
4,0.32127
5,0.32127
6,0.32127
7,0.32127
8,0.32127
9,0.32127
10,0.32127
11,0.32127
12,0.32127
13,0.32127
14,0.32127
15,0.32127
16,0.32127
17,0.32127
18,0.32127
19,0.32127
20,0.32127
21,0.32127
22,0.32127
23,0.32127
24,0.32127
25,0.32127
26,0.32127
27,0.34926999999999997
28,0.41966000000000003
29,0.53061
30,0.652
31,0.77625
32,0.9022899999999999
33,1.0283
34,1.1412
35,1.2449
36,1.3381
37,1.3804
38,1.4092
39,1.4334
40,1.4498
41,1.4518
42,1.4385
43,1.4068
44,1.3566
45,1.2936
46,1.2305
47,1.1675
48,1.1045
49,1.0415
50,0.97846
51,0.91701
52,0.8584
53,0.8387
54,0.82681
55,0.8195399999999999
56,0.8195399999999999
57,0.8368899999999999
58,0.8683799999999999
59,0.90635
60,0.95057
61,0.99784
62,1.0451
63,1.0853
64,1.1161
65,1.1318
66,1.1476
67,1.1633
68,1.1791
69,1.1948
70,1.2002
71,1.1956
72,1.1785
73,1.1418
74,1.0976
75,1.0655
76,1.0458
77,1.0345
78,1.0333
79,1.038
80,1.0478
81,1.0636
82,1.0672
83,1.0687
84,1.0687
85,1.0687
86,1.0687
87,1.0684
88,1.0665
89,1.0545
90,1.0288
91,0.9781200000000001
92,0.9038799999999999
93,0.8251
94,0.74632
95,0.67397
96,0.60645
97,0.54274
98,0.466
99,0.39392
100,0.3283
101,0.28103
102,0.21704
103,0.14332999999999999
104,0.061612
105,-0.030558999999999996
106,-0.12872999999999998
107,-0.23312
108,-0.34294
109,-0.45323
110,-0.56286
111,-0.6493399999999999
112,-0.7222
113,-0.7832399999999999
114,-0.83141
115,-0.87484
116,-0.91376
117,-0.94527
118,-0.96654
119,-0.9813299999999999
120,-0.98892
121,-0.9755299999999999
122,-0.9647399999999999
123,-0.96001
124,-0.96001
125,-0.96001
126,-0.96001
127,-0.96001
128,-0.96016
129,-0.96375
130,-0.9795
131,-1.0008
132,-1.0264
133,-1.0579
134,-1.1141
135,-1.1707
136,-1.2233
137,-1.2552
138,-1.2867
139,-1.3179
140,-1.3461
141,-1.3664
142,-1.3861
143,-1.4222
144,-1.4657
145,-1.5072
146,-1.5388
147,-1.5562
148,-1.5651
149,-1.5651
150,-1.5651
151,-1.5586
152,-1.5447
153,-1.5131
154,-1.4980000000000002
155,-1.4939
156,-1.4939
157,-1.4939
158,-1.4907
159,-1.4794
160,-1.4644
161,-1.4486
162,-1.4329
163,-1.4347
164,-1.4437
165,-1.4583
166,-1.4583
167,-1.4494
168,-1.432
169,-1.4005
170,-1.3589
171,-1.314
172,-1.2723
173,-1.2388
174,-1.2208
175,-1.2267
176,-1.2416
177,-1.2573
178,-1.2729
179,-1.2781
180,-1.2803
181,-1.2803
182,-1.2803
183,-1.2745
184,-1.2642
185,-1.2485
186,-1.2327
187,-1.2125
188,-1.1833
189,-1.1381
190,-1.0968
191,-1.0632
192,-1.0411
193,-1.0312
194,-1.0312
195,-1.0312
196,-1.0275
197,-1.0165
198,-0.9849399999999999
199,-0.9534299999999999
200,-0.9222100000000001
201,-0.8916
202,-0.8738600000000001
203,-0.86139
204,-0.85345
205,-0.8532299999999999
206,-0.84549
207,-0.83114
208,-0.8212799999999999
209,-0.8176399999999999
210,-0.82
211,-0.83281
212,-0.8477899999999999
213,-0.86355
214,-0.8793
215,-0.8950600000000001
216,-0.9092
217,-0.9208700000000001
218,-0.90651
219,-0.88625
220,-0.8611700000000001
221,-0.8296600000000001
222,-0.79815
223,-0.7655
224,-0.72696
225,-0.68219
226,-0.63865
227,-0.60533
228,-0.58186
229,-0.5685
230,-0.5685
231,-0.5685
232,-0.5654600000000001
233,-0.5583
234,-0.52679
235,-0.48346999999999996
236,-0.43038999999999994
237,-0.36862
238,-0.31687
239,-0.27359
240,-0.24265
241,-0.22382
242,-0.20806
243,-0.19230999999999998
244,-0.16529000000000002
245,-0.12838
246,-0.08087000000000001
247,-0.007307200000000001
248,0.07403
249,0.16405999999999998
250,0.27434000000000003
251,0.37713
252,0.47413999999999995
253,0.56391
254,0.63298
255,0.69904
256,0.77135
257,0.84936
258,0.9281299999999999
259,1.0069
260,1.0784
261,1.1453
262,1.207
263,1.2557
264,1.2965
265,1.3288
266,1.3446
267,1.3418
268,1.3307
269,1.315
270,1.2992
271,1.2835
272,1.2677
273,1.2596
274,1.2883
275,1.3531
276,1.4417
277,1.5437
278,1.6405
279,1.6737
280,1.6913
281,1.6954
282,1.6796
283,1.6414
284,1.5951
285,1.5432
286,1.4808
287,1.4121
288,1.3371
289,1.2528
290,1.153
291,1.0457
292,0.9546399999999999
293,0.87225
294,0.79348
295,0.7147
296,0.6359199999999999
297,0.55715
298,0.47836999999999996
299,0.38618
300,0.30041
301,0.22391
302,0.17664000000000002
303,0.13669
304,0.10350999999999999
305,0.079702
306,0.072133
307,0.072133
308,0.072133
309,0.064541
310,0.031329
311,-0.047448000000000004
312,-0.11832000000000001
313,-0.18516
314,-0.24819000000000002
