time,value
0,0.029154000000000003
1,0.18003
2,-0.1794
3,0.49013
4,-0.16127
5,0.38495
6,-0.042152999999999996
7,0.020189
8,0.12100999999999999
9,-0.11457
10,0.75717
11,0.014458000000000002
12,-0.32087
13,-0.21253000000000002
14,0.07792400000000001
15,0.14669000000000001
16,-0.79333
17,0.5311
18,0.049964
19,0.35616
20,-0.035327
21,0.38555
22,-0.18854
23,-0.50033
24,0.13909000000000002
25,0.0027600000000000003
26,0.35191999999999996
27,-0.50259
28,0.12234
29,0.2441
30,0.26957
31,0.65427
32,0.14252
33,-0.062215999999999994
34,-0.056905
35,0.44776000000000005
36,-0.0028295
37,0.21959
38,0.25532
39,0.17477
40,0.020794
41,-0.14093
42,-0.32691
43,0.070653
44,0.027696
45,0.0011359999999999999
46,-0.002918
47,0.3305
48,0.23926
49,0.33488
50,-0.0033045
51,0.34010999999999997
52,0.46105
53,-0.44961
54,0.11049
55,0.14577
56,0.049238
57,-0.0099661
58,-0.018763
59,0.13888
60,0.10217999999999999
61,-0.24689
62,-0.0036372
63,-0.15017
64,0.055379
65,-0.26238
66,-0.16495
67,-0.049119
68,-0.17365
69,-0.17223
70,-0.54623
71,0.42172
72,0.20197
73,1.524
74,1.524
75,1.524
76,1.524
77,1.524
78,1.524
79,1.524
80,1.524
81,1.524
82,1.524
83,1.524
84,1.524
85,1.524
86,1.524
87,1.524
88,-1.6480000000000001
89,-1.6480000000000001
90,-1.6480000000000001
91,-1.6480000000000001
92,-1.6480000000000001
93,-1.6480000000000001
94,-1.6480000000000001
95,-1.6480000000000001
96,-1.6480000000000001
97,-1.6480000000000001
98,-1.6480000000000001
99,-1.6480000000000001
100,-1.6480000000000001
101,-1.6480000000000001
102,-1.6480000000000001
103,0.10795999999999999
104,-0.36219
105,-0.16463
106,0.040866
107,1.524
108,1.524
109,1.524
110,1.524
111,1.524
112,1.524
113,1.524
114,1.524
115,1.524
116,-1.6480000000000001
117,-1.6480000000000001
118,-1.6480000000000001
119,-1.6480000000000001
120,-1.6480000000000001
121,-1.6480000000000001
122,-1.6480000000000001
123,-1.6480000000000001
124,-1.6480000000000001
125,-0.16255
126,-0.040413
127,-0.16884000000000002
