time,value
0,0.46666
1,0.46666
2,0.25
3,0.46666
4,0.25
5,0.25
6,0.46666
7,0.25
8,0.25
9,0.46666
10,0.25
11,0.25
12,0.25
13,0.25
14,0.25
15,0.25
16,0.6833100000000001
17,0.89997
18,0.89997
19,0.6833100000000001
20,0.89997
21,0.6833100000000001
22,-0.5733
23,-1.4399
24,-1.4399
25,-1.3966
26,-1.4399
27,-1.4399
28,-1.4399
29,-1.4399
30,-1.4399
31,-1.4399
32,-1.4399
33,-1.4399
34,-1.4399
35,-0.096653
36,0.89997
37,0.89997
38,0.89997
39,0.89997
40,0.6833100000000001
41,0.6833100000000001
42,0.25
43,0.46666
44,0.25
45,0.25
46,0.25
47,0.46666
48,0.25
49,0.25
50,0.25
51,0.46666
52,0.25
53,0.25
54,0.25
55,0.25
56,0.25
57,0.6833100000000001
58,0.6833100000000001
59,0.89997
60,0.89997
61,0.6833100000000001
62,0.89997
63,-0.26998
64,-1.3533
65,-1.4399
66,-1.4399
67,-1.3966
68,-1.4399
69,-1.4399
70,-1.4399
71,-1.4399
72,-1.4399
73,-1.4399
74,-1.4399
75,-1.4399
76,-1.4399
77,0.6833100000000001
78,0.6833100000000001
79,0.89997
80,0.89997
81,0.89997
82,0.6833100000000001
83,0.46666
84,0.25
85,0.25
86,0.25
87,0.25
88,0.46666
89,0.25
90,0.25
91,0.25
92,0.46666
93,0.25
94,0.25
95,0.25
96,0.25
97,0.25
98,0.46666
99,0.89997
100,0.89997
101,0.6833100000000001
102,0.89997
103,0.89997
104,0.46666
105,-1.3533
106,-1.4399
107,-1.4399
108,-1.4399
109,-1.3966
110,-1.4399
111,-1.4399
112,-1.4399
113,-1.4399
114,-1.4399
115,-1.4399
116,-1.4399
117,-1.4399
118,-0.096653
119,0.89997
120,0.6833100000000001
121,0.89997
122,0.89997
123,0.89997
124,0.89997
125,0.6833100000000001
126,0.89997
127,0.6833100000000001
128,0.46666
129,0.6833100000000001
130,0.46666
131,0.46666
132,0.46666
133,0.46666
134,0.46666
135,0.46666
136,-0.26998
137,-0.26998
138,-0.44331000000000004
139,-0.26998
140,-0.096653
141,0.076673
142,0.076673
143,0.25
144,0.25
145,0.25
146,0.25
147,0.25
148,0.46666
149,0.6833100000000001
150,0.89997
151,0.6833100000000001
152,0.89997
153,0.6833100000000001
154,0.89997
155,-1.3099
156,-1.4399
157,-1.4399
158,-1.4399
159,-1.4399
160,-1.4399
161,-1.4399
162,-1.4399
163,-1.3966
164,-1.4399
165,-1.4399
166,-1.4399
167,-0.9632799999999999
168,0.89997
169,0.6833100000000001
170,0.89997
171,0.89997
172,0.89997
173,0.6833100000000001
174,0.89997
175,0.89997
176,0.89997
177,0.89997
178,0.6833100000000001
179,0.6833100000000001
180,0.6833100000000001
181,0.46666
182,0.6833100000000001
183,0.46666
184,0.46666
185,0.46666
186,0.46666
187,0.25
188,-0.096653
189,-0.26998
190,-0.44331000000000004
191,-0.26998
192,-0.26998
193,0.076673
194,0.076673
195,0.25
196,3.0665
197,4.7565
198,4.7565
199,5.1465
200,5.1465
201,4.7565
202,2.4599
203,0.89997
204,0.89997
205,0.6833100000000001
206,0.89997
207,0.89997
208,-0.9632799999999999
209,-1.3533
210,-1.4833
211,-1.4399
212,-1.4833
213,0.46666
214,1.1166
215,0.89997
216,0.89997
217,1.1166
218,1.1166
219,0.46666
220,0.25
221,0.46666
222,0.46666
223,0.6833100000000001
224,0.6833100000000001
225,0.6833100000000001
226,0.46666
227,0.6833100000000001
228,0.6833100000000001
229,0.6833100000000001
230,0.46666
231,0.25
232,0.46666
233,0.25
234,0.25
235,0.25
236,0.25
237,0.25
238,0.46666
239,0.25
240,0.25
241,0.25
242,0.46666
243,0.46666
244,0.46666
245,0.6833100000000001
246,0.46666
247,0.46666
248,0.46666
249,0.46666
250,0.46666
251,0.25
252,0.25
253,0.89997
254,0.89997
255,0.6833100000000001
256,0.89997
257,0.6833100000000001
258,0.89997
259,0.25
260,-1.4399
261,-1.4399
262,-1.4399
263,-1.4399
264,-1.4399
265,-1.4399
266,-1.4399
267,-1.4399
268,-1.4399
269,-0.096653
270,0.89997
271,0.89997
272,0.89997
273,0.89997
274,0.89997
275,0.46666
276,0.46666
277,0.25
278,0.46666
279,0.25
280,0.46666
281,0.25
282,0.46666
283,0.25
284,0.25
285,0.25
286,0.46666
287,0.25
288,0.25
289,0.25
290,0.25
291,0.25
292,0.6833100000000001
293,0.6833100000000001
294,0.89997
295,0.89997
296,0.6833100000000001
297,0.89997
298,0.076673
299,-1.3966
300,-1.4399
301,-1.4399
302,-1.4399
303,-1.4399
304,-1.4399
305,-1.4399
306,-1.3966
307,-1.4399
308,-1.4399
309,-1.4399
310,-0.70329
311,0.89997
312,0.6833100000000001
313,0.89997
314,0.89997
315,0.89997
316,0.6833100000000001
317,0.46666
318,0.25
319,0.46666
320,0.46666
321,0.46666
322,0.25
323,0.46666
324,0.25
325,0.25
326,0.46666
327,0.25
328,0.25
329,0.25
330,0.25
331,0.25
332,0.25
333,0.6833100000000001
334,0.46666
335,0.6833100000000001
336,0.89997
337,0.89997
338,0.89997
339,0.46666
340,-1.4399
341,-1.4399
342,-1.4399
343,-1.4399
344,-1.4399
345,-1.4399
346,-1.3966
347,-1.4399
348,-1.4399
349,-1.4399
350,-1.4399
351,-1.4399
352,-0.26998
353,0.89997
354,0.89997
355,0.89997
356,0.89997
357,0.89997
358,0.46666
359,0.46666
360,0.25
361,0.46666
362,0.46666
363,0.46666
364,0.46666
365,0.25
366,0.25
367,0.46666
368,0.25
369,0.25
370,0.25
371,0.25
372,0.46666
373,0.25
374,0.25
375,0.25
376,0.25
377,0.46666
378,0.89997
379,0.89997
380,0.6833100000000001
381,0.89997
382,0.89997
383,0.6833100000000001
384,-1.4399
385,-1.4399
386,-1.4399
387,-1.3966
388,-1.4399
389,-1.4399
390,-1.4399
391,-1.4399
392,-1.4399
393,-1.4399
394,-1.4399
395,0.076673
396,0.89997
397,0.6833100000000001
398,0.89997
399,0.89997
400,0.89997
401,0.6833100000000001
402,0.25
403,0.46666
404,0.46666
405,0.46666
406,0.6833100000000001
407,0.46666
408,0.25
409,0.25
410,0.46666
411,0.25
412,0.25
413,0.25
414,0.25
415,0.25
416,0.25
417,0.25
418,0.6833100000000001
419,0.89997
420,0.6833100000000001
421,0.89997
422,0.89997
423,0.89997
424,0.89997
425,-1.3533
426,-1.4399
427,-1.4399
428,-1.3966
429,-1.4399
430,-1.4399
431,-1.4399
432,-1.4399
433,-1.4399
434,-1.4399
435,-1.4399
436,-1.4399
437,-0.5733
438,0.89997
439,0.6833100000000001
440,0.89997
441,0.89997
442,0.89997
443,0.6833100000000001
444,0.46666
445,0.46666
446,0.46666
447,0.46666
448,0.46666
449,0.25
450,0.25
451,0.46666
452,0.25
453,0.25
454,0.25
455,0.25
456,0.46666
457,0.25
458,0.25
459,0.46666
460,0.6833100000000001
461,0.89997
462,0.6833100000000001
463,0.89997
464,0.6833100000000001
465,0.6833100000000001
466,-1.3966
467,-1.4399
468,-1.4399
469,-1.4399
470,-1.4399
471,-1.4399
472,-1.4399
473,-1.3966
474,-1.4399
475,-1.4399
476,-1.4399
477,-1.4399
478,0.46666
479,0.89997
480,0.6833100000000001
481,0.89997
482,0.89997
483,0.89997
484,0.46666
485,0.46666
486,0.46666
487,0.46666
488,0.46666
489,0.6833100000000001
490,0.25
491,0.46666
492,0.25
493,0.25
494,0.46666
495,0.25
496,0.25
497,0.25
498,0.25
499,0.25
500,0.25
501,0.89997
502,0.6833100000000001
503,0.89997
504,0.89997
505,0.6833100000000001
506,0.89997
507,-0.096653
508,-1.4399
509,-1.4399
510,-1.4399
511,-1.4399
512,0.46666
513,0.6833100000000001
514,0.89997
515,0.89997
516,0.6833100000000001
517,0.89997
518,0.46666
519,-1.4399
520,-1.4399
521,-1.4833
522,-1.4399
523,-1.0499
524,0.6833100000000001
525,0.6833100000000001
526,0.6833100000000001
527,0.89997
528,0.89997
529,0.6833100000000001
530,0.46666
531,0.46666
532,0.46666
533,0.46666
534,0.6833100000000001
535,0.6833100000000001
536,0.46666
537,0.6833100000000001
538,0.46666
539,0.6833100000000001
540,0.25
541,0.46666
542,0.25
543,0.25
544,0.25
545,0.25
546,0.46666
547,0.25
548,0.25
549,0.46666
550,0.6833100000000001
551,0.89997
552,0.6833100000000001
553,0.89997
554,0.6833100000000001
555,0.25
556,-1.3099
557,-1.3966
558,-1.4399
559,-1.4399
560,-1.3966
561,-1.4399
562,-1.4399
563,-1.4399
564,-1.4399
565,-1.4399
566,-1.4399
567,-1.4399
568,0.25
569,0.89997
570,0.89997
571,0.89997
572,0.6833100000000001
573,0.89997
574,0.46666
575,0.46666
576,0.46666
577,0.46666
578,0.46666
579,0.46666
580,0.46666
581,0.25
582,0.25
583,0.25
584,0.46666
585,0.25
586,0.25
587,0.25
588,0.25
589,0.25
590,0.6833100000000001
591,0.6833100000000001
592,0.89997
593,0.6833100000000001
594,0.89997
595,0.89997
596,-0.26998
597,-1.3099
598,-1.4399
599,-1.3966
600,-1.4399
601,-1.4399
602,-1.4399
603,-1.4399
604,-1.4399
605,-1.4399
606,-1.4399
607,-1.3966
608,-0.83329
609,0.89997
610,0.6833100000000001
611,0.89997
612,0.89997
613,0.89997
614,0.6833100000000001
615,0.46666
616,0.46666
617,0.46666
618,0.46666
619,0.46666
620,0.46666
621,0.25
622,0.46666
623,0.25
624,0.25
625,0.25
626,0.25
627,0.25
628,0.25
629,0.46666
630,0.25
631,0.6833100000000001
632,0.6833100000000001
633,0.89997
634,0.89997
635,0.6833100000000001
636,0.89997
637,-0.70329
638,-1.3966
639,-1.4399
640,-1.4399
641,-1.4399
642,-1.4399
643,-1.4399
644,-1.3966
645,-1.4399
646,-1.4399
647,-1.4399
648,-1.4399
649,-0.26998
650,0.6833100000000001
651,0.89997
652,0.89997
653,0.89997
654,0.89997
655,0.6833100000000001
656,0.25
657,0.46666
658,0.25
659,0.25
660,0.25
661,0.46666
662,0.25
663,0.25
664,0.25
665,0.46666
666,0.25
667,0.25
668,0.25
669,0.25
670,0.25
671,0.25
672,-0.83329
673,-1.4399
674,-1.4399
675,-1.4399
676,-1.4399
677,-1.4833
678,-1.4833
679,-1.4399
680,-1.4833
681,-1.4833
682,-1.4399
683,-1.4833
684,-1.4399
685,-1.4833
686,-1.4833
687,-1.4399
688,-1.4833
689,-1.4833
690,0.6833100000000001
691,0.46666
692,0.46666
693,0.25
694,0.25
695,0.25
696,0.25
697,0.46666
698,0.25
699,0.25
700,0.25
701,0.25
702,0.25
703,0.25
704,-0.26998
705,-1.3966
706,-1.4399
707,-1.4399
708,-1.4399
709,-1.4833
710,-1.4399
711,-1.4833
712,-1.4833
713,-1.4399
714,-1.4833
715,-1.4399
716,-1.4833
717,-1.4833
718,-1.4399
719,-1.4833
