time,value
0,1.1213
1,1.4212
2,1.6757
3,1.8707
4,1.9931
5,2.0311
6,1.9735
7,1.8117
8,1.5417
9,1.1681
10,0.70702
11,0.18857000000000002
12,-0.34304
13,-0.83242
14,-1.219
15,-1.4456
16,-1.4683
17,-1.2655
18,-0.84467
19,-0.24472
20,0.46718999999999994
21,1.2038
22,1.8704
23,2.3792
24,2.6635
25,2.6887
26,2.458
27,2.0113
28,1.4183
29,0.76598
30,0.14365999999999998
31,-0.37175
32,-0.72773
33,-0.90305
34,-0.9085200000000001
35,-0.78184
36,-0.57789
37,-0.35656
38,-0.17076
39,-0.056901
40,-0.029542000000000002
41,-0.080926
42,-0.18506
43,-0.30511
44,-0.40237
45,-0.44469
46,-0.41296000000000005
47,-0.30423
48,-0.13151
49,0.07975
50,0.29708
51,0.48739
52,0.6227699999999999
53,0.68482
54,0.66678
55,0.57347
56,0.41923999999999995
57,0.22478
58,0.013288
59,-0.19314
60,-0.37632
61,-0.52379
62,-0.62954
63,-0.69397
64,-0.72077
65,-0.71826
66,-0.6965899999999999
67,-0.66602
68,-0.63549
69,-0.61279
70,-0.5999399999999999
71,-0.59791
72,-0.60542
73,-0.6194
74,-0.63577
75,-0.6504
76,-0.65978
77,-0.66189
78,-0.65654
79,-0.64525
80,-0.6309
81,-0.6169899999999999
82,-0.60678
83,-0.60255
84,-0.60521
85,-0.61407
86,-0.62708
87,-0.64205
88,-0.65577
89,-0.6643899999999999
90,-0.66684
91,-0.66347
92,-0.65577
93,-0.6459199999999999
94,-0.6362
95,-0.62826
96,-0.6232300000000001
97,-0.62143
98,-0.62247
