time,value
0,-0.8535799999999999
1,-0.8535799999999999
2,-0.8535799999999999
3,-0.8535799999999999
4,-0.8535799999999999
5,-0.8535799999999999
6,-0.8535799999999999
7,-0.8535799999999999
8,-0.8535799999999999
9,-0.8535799999999999
10,-0.8535799999999999
11,-0.8535799999999999
12,-0.8535799999999999
13,-0.8535799999999999
14,-0.8535799999999999
15,-0.8535799999999999
16,-0.8535799999999999
17,-0.8535799999999999
18,-0.8535799999999999
19,-0.8535799999999999
20,-0.8535799999999999
21,-0.8535799999999999
22,-0.8535799999999999
23,-0.8535799999999999
24,-0.8535799999999999
25,-0.8535799999999999
26,-0.8535799999999999
27,-0.8535799999999999
28,-0.8535799999999999
29,-0.8535799999999999
30,-0.8535799999999999
31,-0.8535799999999999
32,-0.8535799999999999
33,-0.8535799999999999
34,-0.8535799999999999
35,-0.8535799999999999
36,-0.8535799999999999
37,-0.8535799999999999
38,-0.8535799999999999
39,-0.8535799999999999
40,-0.8535799999999999
41,-0.8594
42,-0.86845
43,-0.8827
44,-0.8969600000000001
45,-0.9100299999999999
46,-0.9160200000000001
47,-0.9184399999999999
48,-0.9184399999999999
49,-0.9184399999999999
50,-0.92301
51,-0.93209
52,-0.9461200000000001
53,-0.9603700000000001
54,-0.97462
55,-0.9803299999999999
56,-0.9833
57,-0.9833
58,-0.9833
59,-0.9833
60,-0.9833
61,-0.9833
62,-0.9833
63,-0.9833
64,-0.9900200000000001
65,-1.0017
66,-1.0159
67,-1.0302
68,-1.0444
69,-1.047
70,-1.0482
71,-1.0482
72,-1.0482
73,-1.0482
74,-1.0482
75,-1.0482
76,-1.0482
77,-1.0482
78,-1.0482
79,-1.0482
80,-1.0482
81,-1.0478
82,-1.0469
83,-1.0327
84,-1.0184
85,-1.0042
86,-0.99125
87,-0.9833
88,-0.9833
89,-0.9833
90,-0.9833
91,-0.9833
92,-0.9833
93,-0.9833
94,-0.9833
95,-0.9813
96,-0.9771
97,-0.96285
98,-0.9486
99,-0.93434
100,-0.92009
101,-0.90584
102,-0.89159
103,-0.8773299999999999
104,-0.86654
105,-0.86179
106,-0.8725799999999999
107,-0.8868299999999999
108,-0.90109
109,-0.9072600000000001
110,-0.90728
111,-0.8930299999999999
112,-0.8787799999999999
113,-0.86506
114,-0.85721
115,-0.8535799999999999
116,-0.8535799999999999
117,-0.8535799999999999
118,-0.8535799999999999
119,-0.8535799999999999
120,-0.8535799999999999
121,-0.8535799999999999
122,-0.8535799999999999
123,-0.8406399999999999
124,-0.82135
125,-0.79285
126,-0.7643399999999999
127,-0.73728
128,-0.7176600000000001
129,-0.70134
130,-0.68709
131,-0.67284
132,-0.65351
133,-0.62955
134,-0.60116
135,-0.57265
136,-0.54415
137,-0.52493
138,-0.50821
139,-0.49395
140,-0.4797
141,-0.46271
142,-0.43709
143,-0.40947
144,-0.38095999999999997
145,-0.35246
146,-0.32395
147,-0.29545
148,-0.26694
149,-0.23844
150,-0.20993
151,-0.16892000000000001
152,-0.12689
153,-0.084134
154,-0.041375
155,-0.0030483
156,0.025869999999999997
157,0.054470000000000005
158,0.082788
159,0.11047
160,0.11932999999999999
161,0.11932999999999999
162,0.11932999999999999
163,0.12005999999999999
164,0.12180999999999999
165,0.13606
166,0.15031
167,0.16457
168,0.17882
169,0.19307
170,0.20733000000000001
171,0.22158000000000003
172,0.23671
173,0.25386
174,0.27962
175,0.30813
176,0.33663000000000004
177,0.36761
178,0.40108
179,0.44383999999999996
180,0.4866
181,0.52947
182,0.57677
183,0.62871
184,0.68572
185,0.74274
186,0.79975
187,0.8567600000000001
188,0.9137700000000001
189,0.97078
190,1.0278
191,1.0848
192,1.1418
193,1.1988
194,1.2558
195,1.3128
196,1.3699
197,1.4269
198,1.4839
199,1.5409
200,1.5943
201,1.6434
202,1.6867
203,1.7295
204,1.7722
205,1.8221
206,1.8751
207,1.9321
208,1.9891
209,2.0427
210,2.0807
211,2.1127
212,2.1412
213,2.1697
214,2.1926
215,2.2108
216,2.225
217,2.2393
218,2.2535
219,2.2477
220,2.2374
221,2.2232
222,2.2089
223,2.1884
224,2.1502
225,2.1087
226,2.066
227,2.0232
228,1.9805
229,1.9377
230,1.8949
231,1.8522
232,1.8094
233,1.7533
234,1.6966
235,1.6396
236,1.5828
237,1.5308
238,1.4880000000000002
239,1.4453
240,1.4025
241,1.3597
242,1.317
243,1.2742
244,1.2315
245,1.1887
246,1.1459
247,1.1032
248,1.0604
249,1.0177
250,0.9723200000000001
251,0.9220299999999999
252,0.8650200000000001
253,0.80801
254,0.7532800000000001
255,0.70329
256,0.67003
257,0.64152
258,0.61301
259,0.58154
260,0.54733
261,0.50457
262,0.46181000000000005
263,0.41951000000000005
264,0.38708000000000004
265,0.36369
266,0.34944000000000003
267,0.33519
268,0.31851999999999997
269,0.29827
270,0.27095
271,0.24244000000000002
272,0.21394000000000002
273,0.19063
274,0.17056
275,0.1563
276,0.14205
277,0.12874000000000002
278,0.12212999999999999
279,0.11932999999999999
280,0.11932999999999999
281,0.11932999999999999
282,0.11932999999999999
283,0.11932999999999999
284,0.11932999999999999
285,0.11932999999999999
286,0.11932999999999999
287,0.12716
288,0.13792000000000001
289,0.15217
290,0.16643
291,0.17046
292,0.1341
293,0.084215
294,0.027202999999999998
295,-0.029807999999999998
296,-0.056079
297,-0.058107000000000006
298,-0.043854000000000004
299,-0.029601
300,-0.015347999999999999
301,-0.022788
302,-0.033939
303,-0.048192
304,-0.06244500000000001
305,-0.073159
306,-0.074812
307,-0.075252
308,-0.075252
309,-0.075252
310,-0.066653
311,-0.053149
312,-0.038897
313,-0.024644
314,-0.010391
