time,value
0,1.9726
1,1.9380000000000002
2,1.9869999999999999
3,1.9101
4,1.8754
5,1.6514
6,1.7165
7,1.4306
8,1.2418
9,1.2118
10,0.92143
11,0.56487
12,0.62259
13,0.55411
14,0.38498000000000004
15,0.07331599999999999
16,-0.30354000000000003
17,-0.58843
18,-0.34563
19,-0.23344
20,-0.23969000000000001
21,-0.40863
22,-0.70243
23,-0.91522
24,-0.7710199999999999
25,-0.76568
26,-0.8214100000000001
27,-1.0962
28,-1.1052
29,-0.99559
30,-0.93771
31,-0.90599
32,-0.97393
33,-1.0451
34,-1.1686
35,-1.2918
36,-1.3439
37,-1.4008
38,-1.4275
39,-1.1483
40,-0.87385
41,-0.5187
42,-0.17232999999999998
43,0.1845
44,0.48202
45,0.58467
46,0.68648
47,0.5858300000000001
48,0.51886
49,0.4164
50,0.33401
51,0.2792
52,0.15442999999999998
53,0.092816
54,-0.030275999999999997
55,-0.13014
56,-0.28531
57,-0.42106000000000005
58,-0.10786
59,0.22289
60,0.51402
61,0.82542
62,1.1675
63,1.4595
64,1.7409
65,1.7394
66,1.4358
67,1.0816
68,0.79304
69,0.46586000000000005
70,0.11150999999999998
71,-0.1758
72,-0.50098
73,-0.36995
74,-0.23793000000000003
75,-0.20831
76,-0.11547
77,-0.086641
78,6.1043e-05
79,-0.031584
80,-0.046551
81,0.060148
82,0.13427999999999998
83,0.10081
84,-0.0049504
85,-0.30096
86,-0.5807899999999999
87,-0.8859799999999999
88,-1.1711
89,-1.3899
90,-1.607
91,-1.6681
92,-1.6335
93,-1.5544
94,-1.5544
95,-1.5263
96,-1.4219
97,-1.3754
98,-1.2525
99,-1.1788
100,-1.0573
101,-1.1632
102,-1.3596
103,-1.1412
104,-0.88323
105,-0.6691199999999999
106,-0.47197
107,-0.15752
108,0.068016
109,0.17307
110,0.056301
111,-0.15445
112,-0.37399
113,-0.34663
114,-0.0049504
115,0.29702
116,0.6049
117,0.8562
118,1.043
119,1.0792
120,0.9307
121,1.0051
122,1.3356
123,1.5895
124,1.5290000000000001
125,1.6863
126,1.7328
127,1.9227
