time,value
0,-1.8715
1,-1.8552
2,-1.839
3,-1.8281
4,-1.8118
5,-1.7955
6,-1.7792
7,-1.7630000000000001
8,-1.7467
9,-1.7304
10,-1.7141
11,-1.6978
12,-1.6815
13,-1.6652
14,-1.6489
15,-1.6327
16,-1.6164
17,-1.6055
18,-1.5892
19,-1.6761
20,-1.7412
21,-1.6489
22,-1.7575
23,-1.7467
24,-1.7521
25,-1.7249
26,-1.8118
27,-1.839
28,-1.9258
29,-1.953
30,-1.9258
31,-1.8607
32,-1.9095
33,-1.9095
34,-1.7412
35,-1.7087
36,-1.6924
37,-1.5621
38,-1.4644
39,-1.4481
40,-1.3015
41,-1.3286
42,-1.2146
43,-1.1006
44,-0.9866299999999999
45,-0.8726299999999999
46,-0.75862
47,-0.64462
48,-0.53062
49,-0.41661000000000004
50,-0.30261
51,-0.1886
52,-0.058311
53,-0.058311
54,0.0068341999999999995
55,0.13713
56,0.16427
57,0.26199
58,0.33799
59,0.45742
60,0.5062800000000001
61,0.6148600000000001
62,0.62029
63,0.70715
64,0.7885800000000001
65,0.81029
66,0.82115
67,0.8645799999999999
68,0.80487
69,0.83744
70,0.7288600000000001
71,0.79401
72,0.8700100000000001
73,0.8863
74,0.9025799999999999
75,0.8971600000000001
76,0.8917299999999999
77,0.8863
78,0.88087
79,0.87544
80,0.8700100000000001
81,0.93516
82,1.0057
83,0.94601
84,0.8700100000000001
85,0.9568700000000001
86,0.9568700000000001
87,0.85915
88,0.8645799999999999
89,0.83744
90,0.7885800000000001
91,0.82658
92,0.7397199999999999
93,0.78315
94,0.7288600000000001
95,0.6582899999999999
96,0.5660000000000001
97,0.41941999999999996
98,0.41398999999999997
99,0.42485
100,0.29999000000000003
101,0.2837
102,0.18598
103,0.07198
104,0.028549
105,-0.074598
106,-0.16146
107,-0.27003
108,-0.33518000000000003
109,-0.33518000000000003
110,-0.41118000000000005
111,-0.48718999999999996
112,-0.56319
113,-0.6391899999999999
114,-0.71519
115,-0.7912
116,-0.8672
117,-0.94863
118,-1.0246
119,-1.1006
120,-1.1712
121,-1.0844
122,-1.1061
123,-1.1332
124,-1.1224
125,-1.1441
126,-1.2201
127,-1.2798
128,-1.3504
129,-1.3395
130,-1.5024
131,-1.4644
132,-1.4969
133,-1.5078
134,-1.5729
135,-1.4807
136,-1.4969
137,-1.5132
138,-1.4427
139,-1.3829
140,-1.2961
141,-1.2906
142,-1.2364
143,-1.1766
144,-1.1169
145,-1.0572
146,-0.99749
147,-0.9377700000000001
148,-0.8780600000000001
149,-0.81834
150,-0.7206199999999999
151,-0.56319
152,-0.38947
153,-0.38404
154,-0.31889
155,-0.19403
156,-0.10174
157,-0.031167
158,0.033977999999999994
159,0.061122
160,0.19684000000000001
161,0.25656
162,0.31628
163,0.39771
164,0.40314
165,0.46828000000000003
166,0.604
167,0.642
168,0.7885800000000001
169,0.8917299999999999
170,1.0057
171,1.1197
172,1.1577
173,1.2012
174,1.2446
175,1.288
176,1.3043
177,1.3152
178,1.3097
179,1.3369
180,1.3369
181,1.3695
182,1.3369
183,1.3966
184,1.4509
185,1.4455
186,1.44
187,1.4346
188,1.4292
189,1.4237
190,1.3803
191,1.4129
192,1.402
193,1.3477
194,1.2337
195,1.2175
196,1.1740000000000002
197,1.022
198,0.9568700000000001
199,0.9243
200,0.85915
201,0.9025799999999999
202,0.7994399999999999
203,0.72343
204,0.72343
205,0.6257199999999999
206,0.56057
207,0.47913999999999995
208,0.43571000000000004
209,0.38685
210,0.35428000000000004
211,0.28913
212,0.22941
213,0.1697
214,0.10455
215,0.044836
216,-0.020309999999999998
217,-0.080026
218,-0.13974
219,-0.20489000000000002
220,-0.26461
221,-0.3949
222,-0.51976
223,-0.54147
224,-0.53604
225,-0.67176
226,-0.75862
227,-0.85634
228,-0.9052
229,-0.9377700000000001
230,-0.9214899999999999
231,-0.9866299999999999
232,-0.95949
233,-1.0355
234,-1.0464
235,-1.1821
236,-1.1929
237,-1.2635
238,-1.2364
239,-1.2798
240,-1.2472
241,-1.3612
242,-1.3124
243,-1.3286
244,-1.3015
245,-1.3232
246,-1.3449
247,-1.3612
248,-1.3829
249,-1.4047
250,-1.3938
251,-1.3286
252,-1.2581
253,-1.1929
254,-1.2201
255,-1.1929
256,-1.2146
257,-1.1006
258,-1.0681
259,-1.0246
260,-0.9269200000000001
261,-0.97578
262,-0.88349
263,-0.7912
264,-0.74234
265,-0.66091
266,-0.68805
267,-0.5794699999999999
268,-0.51976
269,-0.42746999999999996
270,-0.37318
271,-0.24289000000000002
272,-0.13974
273,-0.17774
274,-0.06916900000000001
275,0.05569299999999999
276,0.17513
277,0.25656
278,0.29999000000000003
279,0.33255999999999997
280,0.39771
281,0.46285
282,0.528
283,0.5877100000000001
284,0.65286
285,0.71801
286,0.78315
287,0.7560100000000001
288,0.82115
289,0.9025799999999999
290,0.9025799999999999
291,0.9188700000000001
292,0.95144
293,0.93516
294,0.97316
295,0.9568700000000001
296,0.9623
297,0.95144
298,0.9568700000000001
299,1.0329
300,1.0274
301,1.1849
302,1.2555
303,1.2772
304,1.288
305,1.2663
306,1.2772
307,1.2717
308,1.3097
309,1.3912
310,1.4237
311,1.4346
312,1.3966
313,1.3749
314,1.3423
315,1.3423
316,1.2229
317,1.2609
318,1.2175
319,1.1849
320,1.1306
321,1.1197
322,1.1034
323,1.0437
324,1.0654
325,1.0383
326,0.93516
327,0.93516
328,0.8971600000000001
329,0.82658
330,0.8428700000000001
331,0.80487
332,0.7560100000000001
333,0.76686
334,0.77772
335,0.70715
336,0.65286
337,0.642
338,0.6311399999999999
339,0.62029
340,0.60943
341,0.5334300000000001
342,0.46828000000000003
343,0.41941999999999996
344,0.23484000000000002
345,0.14798
346,0.039407
347,-0.042025
348,-0.06916900000000001
349,-0.014881
350,-0.23203000000000001
351,-0.2266
352,-0.18317
353,-0.21575
354,-0.34060999999999997
355,-0.29175
356,-0.41118000000000005
357,-0.4329
358,-0.4709
359,-0.6229100000000001
360,-0.68805
361,-0.8346299999999999
362,-1.0301
363,-1.0518
364,-1.1766
365,-1.2581
366,-1.3449
367,-1.3938
368,-1.4807
369,-1.4372
370,-1.4861
371,-1.4155
372,-1.3775
373,-1.4372
374,-1.3558
375,-1.4101
376,-1.3449
377,-1.3232
378,-1.3232
379,-1.3449
380,-1.3612
381,-1.3775
382,-1.4101
383,-1.4535
384,-1.4372
385,-1.5078
386,-1.4427
387,-1.4535
388,-1.3829
389,-1.3829
390,-1.3449
391,-1.4047
392,-1.3612
393,-1.3829
394,-1.2635
395,-1.2526
396,-1.2472
397,-1.3069
398,-1.2472
399,-1.2255
400,-1.2092
401,-1.1386
402,-1.1332
403,-1.1821
404,-1.2092
405,-1.2906
406,-1.3721
407,-1.4209
408,-1.4372
409,-1.3775
410,-1.4318
411,-1.4264
412,-1.4481
413,-1.4589
414,-1.4698
415,-1.4209
416,-1.3938
417,-1.4155
418,-1.3395
419,-1.3015
420,-1.1441
421,-1.0192
422,-0.91606
423,-0.88892
424,-0.84006
425,-0.76948
426,-0.7966300000000001
427,-0.7803399999999999
428,-0.71519
429,-0.7369100000000001
430,-0.6391899999999999
431,-0.67176
432,-0.6391899999999999
433,-0.48176
434,-0.5143300000000001
435,-0.4709
436,-0.43833
437,-0.36775
438,-0.28089000000000003
439,-0.25918
440,-0.25918
441,-0.25375
442,-0.24831999999999999
443,-0.24831999999999999
444,-0.24289000000000002
445,-0.23746
446,-0.23746
447,-0.18317
448,-0.15603
449,-0.20489000000000002
450,-0.25918
451,-0.32432
452,-0.37861
453,-0.37861
454,-0.3949
455,-0.46003999999999995
456,-0.45461
457,-0.41118000000000005
458,-0.42203999999999997
459,-0.35147
460,-0.35147
461,-0.30261
462,-0.30261
463,-0.32975
464,-0.37861
465,-0.41661000000000004
466,-0.41118000000000005
467,-0.47633000000000003
468,-0.41118000000000005
469,-0.46003999999999995
470,-0.45461
471,-0.4329
472,-0.4709
473,-0.47633000000000003
474,-0.4709
475,-0.48718999999999996
476,-0.45461
477,-0.46003999999999995
478,-0.50347
479,-0.50347
480,-0.49804
481,-0.48718999999999996
482,-0.44376000000000004
483,-0.42203999999999997
484,-0.49261000000000005
485,-0.49804
486,-0.45461
487,-0.44376000000000004
488,-0.44918
489,-0.48718999999999996
490,-0.45461
491,-0.48718999999999996
492,-0.49804
493,-0.46547
494,-0.55233
495,-0.55233
496,-0.53062
497,-0.56862
498,-0.47633000000000003
499,-0.5469
500,-0.50347
501,-0.5143300000000001
502,-0.49804
503,-0.43833
504,-0.46003999999999995
505,-0.43833
506,-0.41118000000000005
507,-0.27003
508,-0.37318
509,-0.28089000000000003
510,-0.25375
511,-0.19946
512,-0.1506
513,-0.080026
514,0.023121
515,0.10455
516,0.19684000000000001
517,0.28913
518,0.37056
519,0.42485
520,0.50085
521,0.60943
522,0.68
523,0.71258
524,0.70172
525,0.69629
526,0.68543
527,0.68
528,0.6582899999999999
529,0.70715
530,0.73429
531,0.68543
532,0.7288600000000001
533,0.70715
534,0.78315
535,0.7560100000000001
536,0.68543
537,0.6257199999999999
538,0.5334300000000001
539,0.53886
540,0.44114
541,0.43028
542,0.36513
543,0.18056
544,0.10998
545,0.039407
546,-0.031167
547,-0.10174
548,-0.17232
549,-0.19946
550,-0.24831999999999999
551,-0.28631999999999996
552,-0.34604
553,-0.45461
554,-0.5089
555,-0.6229100000000001
556,-0.76948
557,-0.85091
558,-0.95406
559,-1.0844
560,-1.0898
561,-1.0626
562,-1.1386
563,-1.2038
564,-1.2309
565,-1.3015
566,-1.2906
567,-1.3558
568,-1.3829
569,-1.3666
570,-1.3178
571,-1.3449
572,-1.3015
573,-1.2961
574,-1.2472
575,-1.1984
576,-1.1224
577,-1.1441
578,-1.0518
579,-1.0464
580,-1.0518
581,-1.0301
582,-1.0083
583,-0.97035
584,-0.9269200000000001
585,-0.9106299999999999
586,-0.8292
587,-0.77491
588,-0.7532
589,-0.6663399999999999
590,-0.60119
591,-0.57405
592,-0.4329
593,-0.40032
594,-0.32432
595,-0.24831999999999999
596,-0.23746
597,-0.047454
598,-0.014881
599,0.044836
600,0.12627
601,0.13713
602,0.2077
603,0.24026999999999998
604,0.34342
605,0.41941999999999996
606,0.45742
607,0.59314
608,0.6582899999999999
609,0.72343
610,0.7722899999999999
611,0.87544
612,0.81572
613,0.85915
614,0.8645799999999999
615,0.87544
616,0.8863
617,0.8700100000000001
618,0.92973
619,0.9568700000000001
620,0.94601
621,1.0166
622,1.0979999999999999
623,1.1849
624,1.2663
625,1.3477
626,1.4346
627,1.4563
628,1.516
629,1.554
630,1.6355
631,1.6409
632,1.6518
633,1.744
634,1.6680000000000001
635,1.5975
636,1.6192
637,1.6138
638,1.5052
639,1.5323
640,1.4998
641,1.5106
642,1.4889
643,1.5812
644,1.5703
645,1.6029
646,1.6192
647,1.63
648,1.6083
649,1.5919999999999999
650,1.6192
651,1.5975
652,1.554
653,1.5378
654,1.516
655,1.5052
656,1.5106
657,1.5269
658,1.4835
659,1.4509
660,1.4617
661,1.4509
662,1.4726
663,1.5703
664,1.5812
665,1.5595
666,1.5595
667,1.5323
668,1.516
669,1.5269
670,1.4943
671,1.4672
672,1.3966
673,1.3477
674,1.3259999999999998
675,1.2826
676,1.2717
677,1.2392
678,1.25
679,1.1903
680,1.212
681,1.2012
682,1.1469
683,1.1469
684,1.1252
685,1.0926
686,1.0709
687,1.0709
688,1.0546
689,1.0329
690,1.022
691,1.0437
692,0.97859
693,0.9568700000000001
694,0.85915
695,0.8428700000000001
696,0.81572
697,0.7560100000000001
698,0.69086
699,0.6257199999999999
700,0.5660000000000001
701,0.50085
702,0.43571000000000004
703,0.37599
704,0.31085
705,0.2457
706,0.26199
707,0.27284
708,0.28913
709,0.29999000000000003
710,0.31085
711,0.32713000000000003
712,0.33799
713,0.35428000000000004
714,0.36513
715,0.37599
716,0.39228
717,0.40314
718,0.41941999999999996
719,0.43028
720,0.44656999999999997
721,0.45742
722,0.46828000000000003
723,0.48457
724,0.49543000000000004
725,0.51171
726,0.52257
727,0.5334300000000001
728,0.54971
729,0.56057
730,0.57686
731,0.5877100000000001
732,0.604
733,0.6148600000000001
734,0.6257199999999999
735,0.642
736,0.65286
737,0.66915
738,0.68
739,0.69086
740,0.70715
741,0.71801
742,0.73429
743,0.74515
744,0.76144
745,0.7722899999999999
746,0.78315
747,0.7994399999999999
748,0.81029
749,0.82658
750,0.83744
751,0.8537299999999999
752,0.8645799999999999
753,0.87544
754,0.8917299999999999
755,0.9025799999999999
756,0.9188700000000001
757,0.92973
758,0.9405899999999999
759,0.9568700000000001
760,0.96773
761,0.9840200000000001
762,0.99487
763,1.0112
764,1.022
765,1.0329
766,1.0492
767,1.06
768,1.0763
769,1.0872
770,1.0979999999999999
771,1.1143
772,1.1252
773,1.1415
774,1.1523
775,1.1686
776,1.1795
777,1.1903
778,1.2066
779,1.2175
780,1.2337
781,1.2446
782,1.2555
783,1.2717
784,1.2826
785,1.2989
786,1.3097
787,1.3259999999999998
788,1.3369
789,1.3477
790,1.364
791,1.3749
792,1.3912
793,1.402
794,1.4129
795,1.4292
796,1.44
797,1.4563
798,1.4672
799,1.4835
800,1.4943
801,1.5052
802,1.5215
803,1.5323
804,1.5486
805,1.5595
806,1.5703
807,1.4943
808,1.4183
809,1.3423
810,1.2663
811,1.1903
812,1.1089
813,1.0329
814,0.9568700000000001
815,0.88087
816,0.80487
817,0.72343
818,0.6474300000000001
819,0.57143
820,0.49543000000000004
821,0.41941999999999996
822,0.34342
823,0.26199
824,0.18598
825,0.10998
826,0.033977999999999994
827,-0.042025
828,-0.12345999999999999
829,-0.19946
830,-0.27546
831,-0.35147
832,-0.42746999999999996
833,-0.5089
834,-0.5849
835,-0.56862
836,-0.5957600000000001
837,-0.61748
838,-0.64462
839,-0.6663399999999999
840,-0.69348
841,-0.7206199999999999
842,-0.74234
843,-0.76948
844,-0.7912
845,-0.81834
846,-0.84006
847,-0.8672
848,-0.8943399999999999
849,-0.91606
850,-0.9432
851,-0.9649200000000001
852,-0.99206
853,-1.0138
854,-1.0409
855,-1.0626
856,-1.0898
857,-1.1169
858,-1.1386
859,-1.1658
860,-1.1875
861,-1.2146
862,-1.2364
863,-1.2635
864,-1.2906
865,-1.2635
866,-1.2092
867,-1.1766
868,-1.1712
869,-1.1332
870,-1.1332
871,-1.0572
872,-0.98121
873,-0.9866299999999999
874,-0.95949
875,-0.8672
876,-0.8346299999999999
877,-0.7477699999999999
878,-0.64462
879,-0.5251899999999999
880,-0.46003999999999995
881,-0.41118000000000005
882,-0.38404
883,-0.29718
884,-0.31889
885,-0.34060999999999997
886,-0.28631999999999996
887,-0.23203000000000001
888,-0.17774
889,-0.12345999999999999
890,-0.06916900000000001
891,-0.014881
892,0.039407
893,0.093695
894,0.14798
895,0.20227
896,0.24026999999999998
897,0.31628
898,0.36513
899,0.34885
