time,value
0,0.022581999999999998
1,0.12538
2,0.21815
3,0.28352
4,0.29991999999999996
5,0.25793
6,0.16765
7,0.05645599999999999
8,-0.048759
9,-0.13233
10,-0.19292
11,-0.23560999999999999
12,-0.27176
13,-0.31477
14,-0.35958
15,-0.39307
16,-0.39026
17,-0.33402
18,-0.21483000000000002
19,-0.038988999999999996
20,0.16229000000000002
21,0.35778000000000004
22,0.51077
23,0.59668
24,0.6019
25,0.53523
26,0.41406000000000004
27,0.26282
28,0.10238
29,-0.047403
30,-0.17145
31,-0.27221999999999996
32,-0.33771
33,-0.36466
34,-0.35489
35,-0.30922
36,-0.22974
37,-0.13372
38,-0.034845999999999995
39,0.049795
40,0.10752
41,0.13391
42,0.12904000000000002
43,0.097302
44,0.052217999999999994
45,0.0045978
46,-0.032024000000000004
47,-0.050293
48,-0.044379
49,-0.026213
50,0.0037872
51,0.044062
52,0.076974
53,0.10005
54,0.10427
55,0.08947999999999999
56,0.06327
57,0.033691000000000006
58,0.0075326
59,-0.0059960000000000005
60,-0.008677200000000001
61,-0.0083759
62,-0.015372
63,-0.034986
64,-0.07663099999999999
65,-0.13766
66,-0.19788
67,-0.24286
68,-0.25448000000000004
69,-0.22304000000000002
70,-0.14908
71,-0.043758
72,0.069744
73,0.1748
74,0.25531
75,0.30184
76,0.3218
77,0.31486
78,0.29049
79,0.25404
80,0.20565999999999998
81,0.14169
82,0.058176
83,-0.044935
84,-0.15734
85,-0.26406
86,-0.35217
87,-0.40976
88,-0.43316000000000004
89,-0.42446000000000006
90,-0.38950999999999997
91,-0.34155
92,-0.28171999999999997
93,-0.20675
94,-0.11763
95,-0.0099321
96,0.12465999999999999
97,0.2805
98,0.44411999999999996
99,0.59058
100,0.69707
101,0.74707
102,0.72818
103,0.64326
104,0.49818
105,0.3072
106,0.090962
107,-0.13389
108,-0.36018
109,-0.57536
110,-0.76205
111,-0.90643
112,-0.97995
113,-0.9642200000000001
114,-0.84855
115,-0.6328
116,-0.33423
117,0.009571399999999999
118,0.35715
119,0.65288
120,0.85335
121,0.9269299999999999
122,0.86579
123,0.68517
124,0.42183999999999994
125,0.12846
126,-0.14590999999999998
127,-0.35189000000000004
128,-0.45193999999999995
129,-0.43161000000000005
130,-0.30937
131,-0.1161
132,0.1144
133,0.32127
134,0.45761999999999997
135,0.49943000000000004
136,0.44254
137,0.30264
138,0.10916
139,-0.10332999999999999
140,-0.3025
141,-0.46158999999999994
142,-0.5665600000000001
143,-0.6109
144,-0.58783
145,-0.5066
146,-0.37133
147,-0.21597
148,-0.06644800000000001
149,0.046519
150,0.11465999999999998
151,0.12844
152,0.10073
153,0.078197
154,0.09543099999999999
155,0.18759
156,0.36034
157,0.59019
158,0.82509
159,0.9956
160,1.0403
161,0.92086
162,0.63355
163,0.22834000000000002
164,-0.22451999999999997
165,-0.6518
166,-0.98856
167,-1.1987
168,-1.2862
169,-1.2745
170,-1.1953
171,-1.0653
172,-0.8889600000000001
173,-0.65382
174,-0.3462
175,0.028983
176,0.46165
177,0.9010299999999999
178,1.2974
179,1.5848
180,1.7264
181,1.7034
182,1.5234
183,1.2179
184,0.83101
185,0.41453
186,0.0045667
187,-0.38028
188,-0.72805
189,-1.0297
190,-1.2958
191,-1.5252
192,-1.7033
193,-1.805
194,-1.8064
195,-1.6769
196,-1.4027
197,-0.98721
198,-0.4611
199,0.12542999999999999
200,0.72482
201,1.2743
202,1.7209999999999999
203,2.0308
204,2.1897
205,2.1991
206,2.0768
207,1.8482
208,1.5484
209,1.1986
210,0.8196399999999999
211,0.41431999999999997
212,-0.013082
213,-0.47075
214,-0.96135
215,-1.4784
216,-2.0109
217,-2.51
218,-2.9207
219,-3.1666
220,-3.1719999999999997
221,-2.8753
222,-2.2621
223,-1.358
224,-0.26716
225,0.8849100000000001
226,1.9353
227,2.7633
228,3.2805
229,3.4633
230,3.3504
231,3.0292
232,2.5815
233,2.062
234,1.5114
235,0.92289
236,0.27874
237,-0.43931000000000003
238,-1.2029
239,-1.9537
240,-2.6003
241,-3.0527
242,-3.2411
243,-3.1427
244,-2.7821
245,-2.2393
246,-1.5756
247,-0.8829299999999999
248,-0.1862
249,0.47345
250,1.0973
251,1.6581
252,2.1393
253,2.492
254,2.6748
255,2.6519
256,2.4288
257,2.0262
258,1.5098
259,0.9326
260,0.35728000000000004
261,-0.20009000000000002
262,-0.71615
263,-1.1927
264,-1.6207
265,-1.9912
266,-2.2613
267,-2.3824
268,-2.3211
269,-2.0678
270,-1.6428
271,-1.0907
272,-0.48513
273,0.10538
274,0.64123
275,1.0902
276,1.4635
277,1.7536
278,1.969
279,2.0807
280,2.0733
281,1.9180000000000001
282,1.6057
283,1.1466
284,0.59075
285,-0.010407
286,-0.58632
287,-1.1002
288,-1.5021
289,-1.7909
290,-1.9638
291,-2.0201
292,-1.9588
293,-1.774
294,-1.4689
295,-1.034
296,-0.49700000000000005
297,0.1146
298,0.72702
299,1.2830000000000001
300,1.7093
301,1.9592
302,2.0053
303,1.8612
304,1.5611
305,1.1661
306,0.72659
307,0.28586
308,-0.11800000000000001
309,-0.47685
310,-0.77581
311,-1.0222
312,-1.1927
313,-1.2836
314,-1.2786
315,-1.1909999999999998
316,-1.0218
317,-0.7872600000000001
318,-0.50222
319,-0.19921
320,0.11209000000000001
321,0.41341999999999995
322,0.68266
323,0.9129700000000001
324,1.0607
325,1.1218
326,1.0532
327,0.88935
328,0.62154
329,0.31029
330,-0.0034610999999999995
331,-0.26197
332,-0.44576000000000005
333,-0.5446300000000001
334,-0.5814
335,-0.5917600000000001
336,-0.5986600000000001
337,-0.61759
338,-0.61753
339,-0.59063
340,-0.48262
341,-0.30405
342,-0.047913
343,0.22424000000000002
344,0.4695
345,0.61217
346,0.63334
347,0.52676
348,0.34574
349,0.15667
350,0.024814
351,-0.006193199999999999
352,0.0583
353,0.18879
354,0.31446999999999997
355,0.36845
356,0.31743000000000005
357,0.15913
358,-0.062669
359,-0.30038000000000004
360,-0.47391000000000005
361,-0.56242
362,-0.54113
363,-0.44785
364,-0.30687
365,-0.17825
366,-0.064322
367,0.011791
368,0.06126
369,0.092407
370,0.1166
371,0.13971
372,0.13957999999999998
373,0.1173
374,0.073558
375,0.025265
376,-0.0068703
377,0.0047728
378,0.06989400000000001
379,0.18003
380,0.31159000000000003
381,0.40995
382,0.42616000000000004
383,0.3313
384,0.14527
385,-0.10194
386,-0.33547
387,-0.50583
388,-0.54796
389,-0.48016000000000003
390,-0.31081
391,-0.10627
392,0.074793
393,0.18207
394,0.19488
395,0.12483
396,-0.0085764
397,-0.15600999999999998
398,-0.29223000000000005
399,-0.37613
400,-0.4147
401,-0.39526
402,-0.33526
403,-0.23087
404,-0.095289
405,0.07497999999999999
406,0.26424000000000003
407,0.47197
408,0.68174
409,0.8611700000000001
410,0.9798
411,1.0046
412,0.9357200000000001
413,0.7559
414,0.49208999999999997
415,0.16366
416,-0.17014
417,-0.47453
418,-0.70844
419,-0.8653299999999999
420,-0.9349799999999999
421,-0.94011
422,-0.90028
423,-0.83294
424,-0.76008
425,-0.67643
426,-0.58102
427,-0.44323
428,-0.26946
429,-0.032448000000000005
430,0.25161
431,0.5697
432,0.86784
433,1.1098
434,1.2538
435,1.2781
436,1.1751
437,0.9594299999999999
438,0.66957
439,0.33614
440,0.004710499999999999
441,-0.31319
442,-0.58062
443,-0.80182
444,-0.95899
445,-1.0605
446,-1.0821
447,-1.0192
448,-0.8697
449,-0.64518
450,-0.38403000000000004
451,-0.10302
452,0.15134
453,0.37485999999999997
454,0.5361899999999999
455,0.65174
456,0.73254
457,0.79233
458,0.82631
459,0.8296600000000001
460,0.78881
461,0.67427
462,0.48635
463,0.22968000000000002
464,-0.054002
465,-0.33933
466,-0.57611
467,-0.75461
468,-0.84454
469,-0.8516600000000001
470,-0.78997
471,-0.66998
472,-0.52037
473,-0.34278000000000003
474,-0.15439
475,0.034227999999999995
476,0.20540999999999998
477,0.34776
478,0.44003000000000003
479,0.47831999999999997
480,0.45798
481,0.38295
482,0.27562
483,0.1623
484,0.067744
485,-0.00083948
486,-0.032437
487,-0.031495999999999996
488,-0.011768
489,0.0089686
490,0.028959
491,0.037423000000000005
492,0.030873
493,0.010609
494,-0.014409
495,-0.039957
496,-0.066228
497,-0.088975
498,-0.11874000000000001
499,-0.15565
