time,value
0,-0.037511
1,-0.037511
2,-0.037511
3,-0.037511
4,-0.037511
5,-0.037511
6,-0.037511
7,-0.037511
8,-0.037511
9,-0.037511
10,-0.037511
11,-0.037511
12,-0.037511
13,-0.037511
14,-0.037511
15,-0.037511
16,-0.037511
17,-0.037511
18,-0.037511
19,-0.037511
20,-0.037511
21,-0.037511
22,-0.037511
23,-0.037511
24,-0.037511
25,-0.037511
26,-0.037511
27,-0.037511
28,-0.037511
29,-0.037511
30,-0.037511
31,-0.037511
32,-0.037511
33,-0.037511
34,-0.037511
35,-0.037511
36,-0.037511
37,-0.037511
38,-0.037511
39,-0.037511
40,-0.037511
41,-0.037511
42,-0.037511
43,-0.037511
44,-0.037511
45,-0.037511
46,-0.037511
47,-0.037511
48,-0.037511
49,-0.037511
50,-0.037511
51,-0.037511
52,-0.037511
53,-0.037511
54,-0.037511
55,-0.037511
56,-0.037511
57,-0.037511
58,-0.037511
59,-0.037511
60,-0.037511
61,-0.037511
62,-0.037511
63,-0.037511
64,-0.037511
65,-0.037511
66,-0.037511
67,-0.037511
68,-0.037511
69,-0.037511
70,-0.037511
71,-0.037511
72,-0.037511
73,-0.037511
74,-0.037511
75,-0.037511
76,-0.037511
77,-0.037511
78,-0.037511
79,-0.037511
80,-0.037511
81,-0.037511
82,-0.037511
83,-0.037511
84,-0.037511
85,-0.037511
86,-0.037511
87,-0.037511
88,-0.037511
89,-0.037511
90,-0.037511
91,-0.037511
92,-0.037511
93,-0.037511
94,-0.037511
95,-0.037511
96,-0.037511
97,-0.037511
98,-0.037511
99,-0.037511
100,-0.037511
101,-0.037511
102,-0.037511
103,-0.037511
104,-0.037511
105,-0.037511
106,-0.037511
107,-0.037511
108,-0.037511
109,-0.037511
110,-0.037511
111,-0.037511
112,-0.037511
113,-0.037511
114,-0.037511
115,-0.037511
116,-0.037511
117,-0.037511
118,-0.037511
119,-0.037511
120,-0.037511
121,-0.037511
122,-0.037511
123,-0.037511
124,-0.037511
125,-0.037511
126,-0.037511
127,-0.037511
128,-0.037511
129,-0.037511
130,-0.037511
131,-0.037511
132,-0.037511
133,-0.037511
134,-0.037511
135,-0.037511
136,-0.037511
137,-0.037511
138,-0.037511
139,-0.037511
140,-0.037511
141,-0.037511
142,-0.037511
143,-0.037511
144,-0.037511
145,-0.037511
146,-0.037511
147,-0.037511
148,-0.037511
149,-0.037511
150,-0.037511
151,-0.037511
152,-0.037511
153,-0.037511
154,-0.037511
155,-0.037511
156,-0.037511
157,-0.037511
158,-0.037511
159,-0.037511
160,-0.037511
161,-0.037511
162,-0.037511
163,-0.037511
164,-0.037511
165,-0.037511
166,-0.037511
167,-0.037511
168,-0.037511
169,-0.037511
170,-0.037511
171,-0.037511
172,-0.037511
173,-0.037511
174,-0.037511
175,-0.037511
176,-0.037511
177,-0.037511
178,-0.037511
179,-0.037511
180,-0.037511
181,-0.037511
182,-0.037511
183,-0.037511
184,-0.037511
185,-0.037511
186,-0.037511
187,-0.037511
188,-0.037511
189,-0.037511
190,-0.037511
191,-0.037511
192,-0.037511
193,-0.037511
194,-0.037511
195,-0.037511
196,-0.037511
197,-0.037511
198,-0.037511
199,-0.037511
200,-0.037511
201,-0.037511
202,-0.037511
203,-0.037511
204,-0.037511
205,-0.037511
206,-0.037511
207,-0.037511
208,-0.037511
209,-0.037511
210,-0.037511
211,-0.037511
212,-0.037511
213,-0.037511
214,-0.037511
215,-0.037511
216,-0.037511
217,-0.037511
218,-0.037511
219,-0.037511
220,-0.037511
221,-0.037511
222,-0.037511
223,-0.037511
224,-0.037511
225,-0.037511
226,-0.037511
227,-0.037511
228,-0.037511
229,-0.037511
230,-0.037511
231,-0.037511
232,-0.037511
233,-0.037511
234,-0.037511
235,-0.037511
236,-0.037511
237,-0.037511
238,-0.037511
239,-0.037511
240,-0.037511
241,-0.037511
242,-0.037511
243,-0.037511
244,-0.037511
245,-0.037511
246,-0.037511
247,-0.037511
248,-0.037511
249,-0.037511
250,-0.037511
251,-0.037511
252,-0.037511
253,-0.037511
254,-0.037511
255,-0.037511
256,-0.037511
257,-0.037511
258,-0.037511
259,-0.037511
260,-0.037511
261,-0.037511
262,-0.037511
263,-0.037511
264,-0.037511
265,-0.037511
266,-0.037511
267,-0.037511
268,-0.037511
269,-0.037511
270,-0.037511
271,-0.037511
272,-0.037511
273,-0.037511
274,-0.037511
275,-0.037511
276,-0.037511
277,-0.037511
278,-0.037511
279,-0.037511
280,-0.037511
281,-0.037511
282,-0.037511
283,-0.037511
284,-0.037511
285,-0.037511
286,-0.037511
287,-0.037511
288,-0.037511
289,-0.037511
290,-0.037511
291,-0.037511
292,-0.037511
293,-0.037511
294,-0.037511
295,-0.037511
296,-0.037511
297,-0.037511
298,-0.037511
299,-0.037511
300,-0.037511
301,-0.037511
302,-0.037511
303,-0.037511
304,-0.037511
305,-0.037511
306,-0.037511
307,-0.037511
308,-0.037511
309,-0.037511
310,-0.037511
311,-0.037511
312,-0.037511
313,-0.037511
314,-0.037511
315,-0.037511
316,-0.037511
317,-0.037511
318,-0.037511
319,-0.037511
320,-0.037511
321,-0.037511
322,-0.037511
323,-0.037511
324,-0.037511
325,-0.037511
326,-0.037511
327,-0.037511
328,-0.037511
329,-0.037511
330,-0.037511
331,-0.037511
332,-0.037511
333,-0.037511
334,-0.037511
335,-0.037511
336,-0.037511
337,-0.037511
338,-0.037511
339,-0.037511
340,-0.037511
341,-0.037511
342,-0.037511
343,-0.037511
344,-0.037511
345,-0.037511
346,-0.037511
347,-0.037511
348,-0.037511
349,-0.037511
350,-0.037511
351,-0.037511
352,-0.037511
353,-0.037511
354,-0.037511
355,-0.037511
356,-0.037511
357,-0.037511
358,-0.037511
359,-0.037511
360,-0.037511
361,-0.037511
362,-0.037511
363,-0.037511
364,-0.037511
365,-0.037511
366,-0.037511
367,-0.037511
368,-0.037511
369,-0.037511
370,-0.037511
371,-0.037511
372,-0.037511
373,-0.037511
374,-0.037511
375,-0.037511
376,-0.037511
377,-0.037511
378,-0.037511
379,-0.037511
380,-0.037511
381,-0.037511
382,-0.037511
383,-0.037511
384,-0.037511
385,-0.037511
386,-0.037511
387,-0.037511
388,-0.037511
389,-0.037511
390,-0.037511
391,-0.037511
392,-0.037511
393,-0.037511
394,-0.037511
395,-0.037511
396,-0.037511
397,-0.037511
398,-0.037511
399,-0.037511
400,-0.037511
401,-0.037511
402,-0.037511
403,-0.037511
404,-0.037511
405,-0.037511
406,-0.037511
407,-0.037511
408,-0.037511
409,-0.037511
410,-0.037511
411,-0.037511
412,-0.037511
413,-0.037511
414,-0.037511
415,-0.037511
416,-0.037511
417,-0.037511
418,-0.037511
419,-0.037511
420,-0.037511
421,-0.037511
422,-0.037511
423,-0.037511
424,-0.037511
425,-0.037511
426,-0.037511
427,-0.037511
428,-0.037511
429,-0.037511
430,-0.037511
431,-0.037511
432,-0.037511
433,-0.037511
434,-0.037511
435,-0.037511
436,-0.037511
437,-0.037511
438,-0.037511
439,-0.037511
440,-0.037511
441,-0.037511
442,-0.037511
443,-0.037511
444,-0.037511
445,-0.037511
446,-0.037511
447,-0.037511
448,-0.037511
449,-0.037511
450,-0.037511
451,-0.037511
452,-0.037511
453,-0.037511
454,-0.037511
455,-0.037511
456,-0.037511
457,-0.037511
458,-0.037511
459,-0.037511
460,-0.037511
461,-0.037511
462,-0.037511
463,-0.037511
464,-0.037511
465,-0.037511
466,-0.037511
467,-0.037511
468,-0.037511
469,-0.037511
470,-0.037511
471,-0.037511
472,-0.037511
473,-0.037511
474,-0.037511
475,-0.037511
476,-0.037511
477,-0.037511
478,-0.037511
479,-0.037511
480,-0.037511
481,-0.037511
482,-0.037511
483,-0.037511
484,-0.037511
485,-0.037511
486,-0.037511
487,-0.037511
488,-0.037511
489,-0.037511
490,-0.037511
491,-0.037511
492,-0.037511
493,-0.037511
494,-0.037511
495,-0.037511
496,-0.037511
497,-0.037511
498,-0.037511
499,-0.037511
500,-0.037511
501,-0.037511
502,-0.037511
503,-0.037511
504,-0.037511
505,-0.037511
506,-0.037511
507,-0.037511
508,-0.037511
509,-0.037511
510,-0.037511
511,-0.037511
512,-0.037511
513,-0.037511
514,-0.037511
515,-0.037511
516,-0.037511
517,-0.037511
518,-0.037511
519,-0.037511
520,-0.037511
521,-0.037511
522,-0.037511
523,-0.037511
524,-0.037511
525,-0.037511
526,-0.037511
527,-0.037511
528,-0.037511
529,-0.037511
530,-0.037511
531,-0.037511
532,-0.037511
533,-0.037511
534,-0.037511
535,-0.037511
536,-0.037511
537,-0.037511
538,-0.037511
539,-0.037511
540,26.795
541,0.13785999999999998
542,-0.037511
543,-0.037511
544,-0.037511
545,-0.037511
546,-0.037511
547,-0.037511
548,-0.037511
549,-0.037511
550,-0.037511
551,-0.037511
552,-0.037511
553,-0.037511
554,-0.037511
555,-0.037511
556,-0.037511
557,-0.037511
558,-0.037511
559,-0.037511
560,-0.037511
561,-0.037511
562,-0.037511
563,-0.037511
564,-0.037511
565,-0.037511
566,-0.037511
567,-0.037511
568,-0.037511
569,-0.037511
570,-0.037511
571,-0.037511
572,-0.037511
573,-0.037511
574,-0.037511
575,-0.037511
576,-0.037511
577,-0.037511
578,-0.037511
579,-0.037511
580,-0.037511
581,-0.037511
582,-0.037511
583,-0.037511
584,-0.037511
585,-0.037511
586,-0.037511
587,-0.037511
588,-0.037511
589,-0.037511
590,-0.037511
591,-0.037511
592,-0.037511
593,-0.037511
594,-0.037511
595,-0.037511
596,-0.037511
597,-0.037511
598,-0.037511
599,-0.037511
600,-0.037511
601,-0.037511
602,-0.037511
603,-0.037511
604,-0.037511
605,-0.037511
606,-0.037511
607,-0.037511
608,-0.037511
609,-0.037511
610,-0.037511
611,-0.037511
612,-0.037511
613,-0.037511
614,-0.037511
615,-0.037511
616,-0.037511
617,-0.037511
618,-0.037511
619,-0.037511
620,-0.037511
621,-0.037511
622,-0.037511
623,-0.037511
624,-0.037511
625,-0.037511
626,-0.037511
627,-0.037511
628,-0.037511
629,-0.037511
630,-0.037511
631,-0.037511
632,-0.037511
633,-0.037511
634,-0.037511
635,-0.037511
636,-0.037511
637,-0.037511
638,-0.037511
639,-0.037511
640,-0.037511
641,-0.037511
642,-0.037511
643,-0.037511
644,-0.037511
645,-0.037511
646,-0.037511
647,-0.037511
648,-0.037511
649,-0.037511
650,-0.037511
651,-0.037511
652,-0.037511
653,-0.037511
654,-0.037511
655,-0.037511
656,-0.037511
657,-0.037511
658,-0.037511
659,-0.037511
660,-0.037511
661,-0.037511
662,-0.037511
663,-0.037511
664,-0.037511
665,-0.037511
666,-0.037511
667,-0.037511
668,-0.037511
669,-0.037511
670,-0.037511
671,-0.037511
672,-0.037511
673,-0.037511
674,-0.037511
675,-0.037511
676,-0.037511
677,-0.037511
678,-0.037511
679,-0.037511
680,-0.037511
681,-0.037511
682,-0.037511
683,-0.037511
684,-0.037511
685,-0.037511
686,-0.037511
687,-0.037511
688,-0.037511
689,-0.037511
690,-0.037511
691,-0.037511
692,-0.037511
693,-0.037511
694,-0.037511
695,-0.037511
696,-0.037511
697,-0.037511
698,-0.037511
699,-0.037511
700,-0.037511
701,-0.037511
702,-0.037511
703,-0.037511
704,-0.037511
705,-0.037511
706,-0.037511
707,-0.037511
708,-0.037511
709,-0.037511
710,-0.037511
711,-0.037511
712,-0.037511
713,-0.037511
714,-0.037511
715,-0.037511
716,-0.037511
717,-0.037511
718,-0.037511
719,-0.037511
