time,value
0,1.2837
1,0.9227299999999999
2,0.9227299999999999
3,1.2837
4,0.9227299999999999
5,0.9227299999999999
6,1.2837
7,0.9227299999999999
8,0.9227299999999999
9,0.9227299999999999
10,1.2837
11,0.9227299999999999
12,-0.40095
13,-0.88228
14,-0.88228
15,-0.88228
16,-0.88228
17,-0.88228
18,-0.88228
19,-0.88228
20,-0.88228
21,-0.88228
22,-0.88228
23,-0.88228
24,-0.88228
25,-0.88228
26,-0.88228
27,-0.88228
28,-0.88228
29,-0.88228
30,-0.88228
31,-0.88228
32,-0.88228
33,-0.88228
34,-0.88228
35,-0.88228
36,-0.88228
37,-0.88228
38,-0.88228
39,0.9227299999999999
40,1.2837
41,1.2837
42,1.2837
43,1.2837
44,1.2837
45,1.2837
46,0.9227299999999999
47,1.2837
48,1.2837
49,0.9227299999999999
50,1.2837
51,1.2837
52,0.9227299999999999
53,1.2837
54,0.9227299999999999
55,1.2837
56,0.9227299999999999
57,0.9227299999999999
58,1.2837
59,0.9227299999999999
60,1.2837
61,0.9227299999999999
62,0.9227299999999999
63,1.2837
64,0.9227299999999999
65,1.2837
66,0.9227299999999999
67,0.9227299999999999
68,1.2837
69,0.9227299999999999
70,0.9227299999999999
71,1.2837
72,0.9227299999999999
73,1.2837
74,0.9227299999999999
75,0.5617300000000001
76,-0.88228
77,-0.88228
78,-0.88228
79,-0.88228
80,-0.88228
81,-0.88228
82,-0.88228
83,-0.88228
84,-0.88228
85,-0.88228
86,-0.88228
87,-0.76195
88,-0.88228
89,-0.88228
90,-0.88228
91,-0.88228
92,-0.88228
93,-0.88228
94,-0.88228
95,-0.88228
96,-0.88228
97,-0.88228
98,-0.88228
99,-0.88228
100,-0.88228
101,-0.88228
102,-0.88228
103,-0.88228
104,-0.88228
105,-0.88228
106,-0.88228
107,0.9227299999999999
108,1.2837
109,1.2837
110,1.2837
111,1.2837
112,1.2837
113,1.2837
114,1.2837
115,0.9227299999999999
116,1.2837
117,1.2837
118,0.9227299999999999
119,1.2837
120,0.9227299999999999
121,1.2837
122,0.9227299999999999
123,1.2837
124,0.9227299999999999
125,1.2837
126,0.9227299999999999
127,0.08039
128,-0.88228
129,-0.88228
130,-0.88228
131,-0.88228
132,-0.88228
133,-0.88228
134,-0.88228
135,-0.88228
136,-0.88228
137,-0.88228
138,-0.88228
139,-0.88228
140,-0.88228
141,-0.88228
142,-0.88228
143,-0.88228
144,-0.88228
145,-0.88228
146,-0.76195
147,-0.88228
148,-0.88228
149,-0.88228
150,-0.88228
151,-0.88228
152,-0.88228
153,-0.88228
154,-0.88228
155,-0.88228
156,-0.88228
157,-0.88228
158,-0.88228
159,-0.40095
160,1.2837
161,1.2837
162,1.2837
163,1.2837
164,1.2837
165,0.9227299999999999
166,1.2837
167,1.2837
168,1.2837
169,1.2837
170,0.9227299999999999
171,1.2837
172,1.2837
173,0.9227299999999999
174,1.2837
175,0.9227299999999999
176,1.2837
177,0.9227299999999999
178,0.32106
179,-0.88228
180,-0.76195
181,-0.88228
182,-0.88228
183,-0.88228
184,-0.88228
185,-0.88228
186,-0.88228
187,-0.88228
188,-0.88228
189,-0.88228
190,-0.88228
191,-0.88228
192,-0.88228
193,-0.88228
194,-0.88228
195,-0.88228
196,-0.88228
197,-0.88228
198,-0.88228
199,-0.88228
200,-0.88228
201,-0.88228
202,-0.88228
203,-0.88228
204,-0.88228
205,-0.88228
206,-0.88228
207,-0.88228
208,-0.88228
209,-0.88228
210,-0.88228
211,-0.16028
212,1.2837
213,1.2837
214,1.2837
215,1.2837
216,0.9227299999999999
217,1.2837
218,1.2837
219,1.2837
220,1.2837
221,0.9227299999999999
222,1.2837
223,1.2837
224,0.9227299999999999
225,1.2837
226,0.9227299999999999
227,1.2837
228,0.9227299999999999
229,1.2837
230,-0.64161
231,-0.88228
232,-0.88228
233,-0.88228
234,-0.88228
235,-0.88228
236,-0.88228
237,-0.88228
238,-0.76195
239,-0.88228
240,-0.88228
241,-0.88228
242,-0.88228
243,-0.88228
244,-0.88228
245,-0.88228
246,-0.88228
247,-0.88228
248,-0.88228
249,-0.88228
250,-0.88228
251,-0.88228
252,-0.76195
253,-0.88228
254,-0.88228
255,0.5617300000000001
256,1.2837
257,1.2837
258,1.2837
259,0.9227299999999999
260,1.2837
261,1.2837
262,1.2837
263,1.2837
264,1.2837
265,1.2837
266,0.9227299999999999
267,1.2837
268,0.9227299999999999
269,1.2837
270,0.9227299999999999
271,1.2837
272,0.9227299999999999
273,0.9227299999999999
274,1.2837
275,0.9227299999999999
276,0.5617300000000001
277,-0.64161
278,-0.88228
279,-0.88228
280,-0.88228
281,-0.88228
282,-0.88228
283,-0.88228
284,-0.88228
285,-0.88228
286,-0.88228
287,-0.88228
288,-0.88228
289,-0.88228
290,-0.88228
291,-0.88228
292,-0.88228
293,-0.88228
294,-0.88228
295,-0.88228
296,-0.88228
297,-0.88228
298,-0.88228
299,-0.88228
300,-0.88228
301,-0.88228
302,-0.88228
303,-0.88228
304,-0.88228
305,-0.88228
306,-0.88228
307,-0.88228
308,-0.76195
309,0.32106
310,1.2837
311,1.2837
312,1.2837
313,1.2837
314,1.2837
315,0.9227299999999999
316,1.2837
317,1.2837
318,1.2837
319,1.2837
320,1.2837
321,0.9227299999999999
322,1.2837
323,1.2837
324,0.9227299999999999
325,1.2837
326,0.9227299999999999
327,1.2837
328,0.9227299999999999
329,1.2837
330,0.9227299999999999
331,1.2837
332,0.9227299999999999
333,1.2837
334,0.9227299999999999
335,-0.40095
336,-0.88228
337,-0.88228
338,-0.88228
339,-0.88228
340,-0.88228
341,-0.88228
342,-0.88228
343,-0.88228
344,-0.88228
345,-0.88228
346,-0.88228
347,-0.88228
348,-0.88228
349,-0.88228
350,-0.88228
351,-0.88228
352,-0.88228
353,-0.88228
354,-0.88228
355,-0.88228
356,-0.88228
357,-0.88228
358,-0.88228
359,-0.88228
360,-0.88228
361,-0.88228
362,-0.88228
363,-0.88228
364,-0.88228
365,-0.88228
366,-0.88228
367,-0.16028
368,1.2837
369,1.2837
370,1.2837
371,0.9227299999999999
372,1.2837
373,1.2837
374,1.2837
375,1.2837
376,1.2837
377,0.9227299999999999
378,1.2837
379,1.2837
380,0.9227299999999999
381,1.2837
382,0.9227299999999999
383,1.2837
384,0.9227299999999999
385,1.2837
386,0.9227299999999999
387,0.32106
388,-0.88228
389,-0.88228
390,-0.88228
391,-0.88228
392,-0.88228
393,-0.88228
394,-0.88228
395,-0.88228
396,-0.88228
397,-0.88228
398,-0.88228
399,-0.88228
400,-0.88228
401,-0.88228
402,-0.88228
403,-0.88228
404,-0.88228
405,-0.88228
406,-0.88228
407,-0.88228
408,-0.88228
409,-0.88228
410,-0.88228
411,-0.88228
412,-0.88228
413,-0.88228
414,-0.88228
415,-0.88228
416,-0.88228
417,-0.88228
418,-0.88228
419,-0.88228
420,0.9227299999999999
421,1.2837
422,1.2837
423,0.9227299999999999
424,1.2837
425,1.2837
426,1.2837
427,1.2837
428,1.2837
429,1.2837
430,0.9227299999999999
431,1.2837
432,1.2837
433,0.9227299999999999
434,1.2837
435,0.9227299999999999
436,1.2837
437,0.9227299999999999
438,1.2837
439,0.9227299999999999
440,-0.16028
441,-0.88228
442,-0.88228
443,-0.88228
444,-0.88228
445,-0.88228
446,-0.88228
447,-0.88228
448,-0.88228
449,-0.88228
450,-0.88228
451,-0.76195
452,-0.88228
453,-0.88228
454,-0.88228
455,-0.88228
456,-0.88228
457,-0.88228
458,-0.88228
459,-0.88228
460,-0.88228
461,-0.88228
462,-0.88228
463,-0.88228
464,-0.88228
465,-0.88228
466,-0.88228
467,-0.88228
468,-0.88228
469,-0.88228
470,-0.88228
471,-0.88228
472,1.2837
473,1.2837
474,1.2837
475,1.2837
476,1.2837
477,1.2837
478,0.9227299999999999
479,1.2837
480,1.2837
481,1.2837
482,0.9227299999999999
483,1.2837
484,1.2837
485,0.9227299999999999
486,1.2837
487,0.9227299999999999
488,1.2837
489,0.9227299999999999
490,0.9227299999999999
491,-0.76195
492,-0.88228
493,-0.88228
494,-0.88228
495,-0.88228
496,-0.88228
497,-0.88228
498,-0.88228
499,-0.88228
500,-0.88228
501,-0.88228
502,-0.88228
503,-0.88228
504,-0.88228
505,-0.88228
506,-0.88228
507,-0.88228
508,-0.88228
509,-0.88228
510,-0.88228
511,-0.88228
512,-0.88228
513,-0.88228
514,-0.88228
515,-0.88228
516,-0.88228
517,-0.88228
518,-0.88228
519,-0.88228
520,-0.88228
521,-0.76195
522,-0.88228
523,-0.88228
524,-0.88228
525,0.9227299999999999
526,1.2837
527,1.2837
528,1.2837
529,1.2837
530,0.9227299999999999
531,1.2837
532,1.2837
533,1.2837
534,0.9227299999999999
535,1.2837
536,1.6447
537,0.9227299999999999
538,1.2837
539,1.2837
540,0.9227299999999999
541,1.2837
542,1.2837
543,0.9227299999999999
544,1.2837
545,0.9227299999999999
546,0.9227299999999999
547,1.2837
548,-0.16028
549,-0.76195
550,-0.88228
551,-0.88228
552,-0.88228
553,-0.88228
554,-0.88228
555,-0.76195
556,-0.88228
557,-0.88228
558,-0.76195
559,-0.88228
560,-0.88228
561,-0.88228
562,-0.88228
563,-0.88228
564,-0.88228
565,-0.88228
566,-0.88228
567,-0.88228
568,-0.88228
569,-0.88228
570,-0.88228
571,-0.76195
572,0.5617300000000001
573,1.2837
574,0.9227299999999999
575,1.2837
576,1.2837
577,1.2837
578,1.2837
579,0.9227299999999999
580,1.2837
581,1.2837
582,0.9227299999999999
583,1.2837
584,1.2837
585,0.9227299999999999
586,0.9227299999999999
587,1.2837
588,0.9227299999999999
589,1.2837
590,0.9227299999999999
591,0.9227299999999999
592,1.2837
593,0.9227299999999999
594,1.2837
595,0.9227299999999999
596,0.9227299999999999
597,-0.16028
598,-0.88228
599,-0.88228
600,-0.88228
601,-0.88228
602,-0.88228
603,-0.88228
604,-0.88228
605,-0.88228
606,-0.88228
607,-0.88228
608,-0.88228
609,-0.88228
610,-0.88228
611,-0.88228
612,-0.88228
613,-0.76195
614,-0.88228
615,-0.88228
616,-0.88228
617,-0.88228
618,-0.88228
619,-0.88228
620,-0.88228
621,-0.88228
622,-0.88228
623,-0.88228
624,-0.88228
625,-0.88228
626,0.5617300000000001
627,1.2837
628,1.2837
629,1.2837
630,1.2837
631,0.9227299999999999
632,1.2837
633,1.2837
634,1.2837
635,1.2837
636,1.2837
637,0.9227299999999999
638,1.2837
639,1.2837
640,1.2837
641,0.9227299999999999
642,1.2837
643,0.9227299999999999
644,1.2837
645,0.9227299999999999
646,0.9227299999999999
647,1.2837
648,0.5617300000000001
649,-0.76195
650,-0.76195
651,-0.88228
652,-0.88228
653,-0.88228
654,-0.88228
655,-0.88228
656,-0.88228
657,-0.88228
658,-0.88228
659,-0.88228
660,-0.88228
661,-0.88228
662,-0.88228
663,-0.88228
664,-0.88228
665,-0.88228
666,-0.88228
667,-0.88228
668,-0.88228
669,-0.88228
670,-0.88228
671,-0.64161
672,-0.64161
673,1.6447
674,1.2837
675,1.2837
676,1.2837
677,1.2837
678,1.2837
679,1.2837
680,1.2837
681,0.9227299999999999
682,1.2837
683,1.2837
684,0.9227299999999999
685,1.2837
686,0.9227299999999999
687,1.2837
688,0.9227299999999999
689,1.2837
690,0.9227299999999999
691,1.2837
692,0.9227299999999999
693,1.2837
694,0.9227299999999999
695,0.9227299999999999
696,1.2837
697,0.9227299999999999
698,0.9227299999999999
699,0.32106
700,-0.76195
701,-0.88228
702,-0.88228
703,-0.76195
704,-0.88228
705,-0.88228
706,-0.88228
707,-0.88228
708,-0.88228
709,-0.88228
710,-0.88228
711,-0.88228
712,-0.88228
713,-0.88228
714,-0.88228
715,-0.88228
716,-0.88228
717,-0.88228
718,-0.88228
719,-0.88228
