{
  "about": {
    "datasetID": "LL1_ECGFiveDays_dataset",
    "datasetName": "LL1_ECGFiveDays",
    "description": "one of UCR datasets for timeseries classification",
    "citation": "\n@misc{UCRArchive,\ntitle={The UCR Time Series Classification Archive},\nauthor={ Chen, Yanping and Keogh, Eamonn and Hu, Bing and Begum, Nurjahan and Bagnall, Anthony and Mueen, Abdullah and Batista, Gustavo},\nyear={2015},\nmonth={July},\nnote = {url{www.cs.ucr.edu/~eamonn/time_series_data/}}}",
    "license": "Unknown public",
    "source": "UCR",
    "sourceURI": "http://www.cs.ucr.edu/~eamonn/time_series_data/",
    "datasetSchemaVersion": "4.0.0",
    "redacted": false,
    "datasetVersion": "4.0.0",
    "digest": "a6c5821e966839a50fe4fbf1ae762c8fe073f82581a394e355f492bd3c6c4e0a"
  },
  "dataResources": [
    {
      "resID": "0",
      "resPath": "timeseries/",
      "resType": "timeseries",
      "resFormat": {
        "text/csv": [
          "csv"
        ]
      },
      "isCollection": true
    },
    {
      "resID": "learningData",
      "resPath": "tables/learningData.csv",
      "resType": "table",
      "resFormat": {
        "text/csv": [
          "csv"
        ]
      },
      "isCollection": false,
      "columns": [
        {
          "colIndex": 0,
          "colName": "d3mIndex",
          "colType": "integer",
          "role": [
            "index"
          ]
        },
        {
          "colIndex": 1,
          "colName": "timeseries_file",
          "colType": "string",
          "role": [
            "attribute"
          ],
          "refersTo": {
            "resID": "0",
            "resObject": "item"
          }
        },
        {
          "colIndex": 2,
          "colName": "label",
          "colType": "categorical",
          "role": [
            "suggestedTarget"
          ]
        }
      ],
      "columnsCount": 3
    }
  ]
}