time,value
0,-0.15875
1,0.14218
2,0.23611
3,0.06673899999999999
4,-0.25265
5,-0.55576
6,-0.69035
7,-0.75129
8,-0.55165
9,-0.21736
10,0.13947
11,0.4713
12,0.7346699999999999
13,0.91184
14,0.98285
15,1.0112
16,0.99239
17,0.9055799999999999
18,0.70234
19,0.36864
20,-0.047747000000000005
21,-0.46755
22,-0.81616
23,-1.0085
24,-0.99465
25,-0.91299
26,-0.8113600000000001
27,-0.75036
28,-0.71734
29,-0.70367
30,-0.67716
31,-0.5723
32,-0.34018000000000004
33,-0.029347
34,0.23655
35,0.39709
36,0.40452
37,0.24031999999999998
38,-0.011893
39,-0.20082
40,-0.18713
41,0.049883
42,0.47726999999999997
43,0.98272
44,1.4683
45,1.6973
46,1.6157
47,1.2223
48,0.65236
49,0.09044400000000001
50,-0.33885
51,-0.59791
52,-0.6995899999999999
53,-0.76242
54,-0.80648
55,-0.80508
56,-0.8329799999999999
57,-0.8057300000000001
58,-0.57923
59,-0.14825
60,0.38271
61,0.86455
62,1.2590000000000001
63,1.4071
64,1.3287
65,0.9505899999999999
66,0.34164
67,-0.36307
68,-1.0376
69,-1.5748
70,-1.8228
71,-1.703
72,-1.3033
73,-0.7059300000000001
74,-0.04408
75,0.5110600000000001
76,0.7739699999999999
77,0.6359199999999999
78,0.23069
79,-0.35281999999999997
80,-0.9385399999999999
81,-1.2875
82,-1.2388
83,-0.87864
84,-0.25888
85,0.43159
86,0.9812799999999999
87,1.2032
88,1.1905
89,1.0694
90,0.9066700000000001
91,0.8064100000000001
92,0.92086
93,1.1014
94,1.2962
95,1.2833
96,0.89779
97,0.12473
98,-0.86285
99,-1.8444
100,-2.6176
101,-2.9116
102,-2.6805
103,-2.0262
104,-1.1740000000000002
105,-0.29618
106,0.2964
107,0.49511000000000005
108,0.44771000000000005
109,0.16548
110,-0.13823
111,-0.26526
112,-0.15169000000000002
113,0.14437
114,0.60349
115,1.1306
116,1.5976
117,1.8912
118,1.975
119,1.7951
120,1.3917
121,0.81138
122,0.12768
123,-0.54268
124,-1.1998
125,-1.7508
126,-2.0874
127,-2.1565
128,-2.0709999999999997
129,-1.8609
130,-1.5681
131,-1.2313
132,-0.8413700000000001
133,-0.44848000000000005
134,-0.055843
135,0.33493
136,0.64866
137,0.8143199999999999
138,0.81708
139,0.69733
140,0.5532699999999999
141,0.36773
142,0.25764000000000004
143,0.25608000000000003
144,0.43431000000000003
145,0.6464
146,0.8606799999999999
147,0.9688899999999999
148,0.9012
149,0.70836
150,0.46967
151,0.29399000000000003
152,0.18739
153,0.17885
154,0.2721
155,0.31727
156,0.2068
157,-0.040111
158,-0.32568
159,-0.64288
160,-0.86425
161,-0.92166
162,-0.83152
163,-0.75837
164,-0.72752
165,-0.81609
166,-1.0309
167,-1.2896
168,-1.5576
169,-1.6421
170,-1.4215
171,-0.93381
172,-0.26595
173,0.46348
174,1.1204
175,1.5568
176,1.642
177,1.4464
178,1.0712
179,0.5953
180,0.19825
181,0.039466
182,0.09656
183,0.3094
184,0.66418
185,0.9507
186,1.0817
187,1.0361
188,0.8463299999999999
189,0.5472100000000001
190,0.20988
191,-0.028092000000000002
192,-0.1382
193,-0.20514000000000002
194,-0.24081
195,-0.33691
196,-0.57357
197,-0.9451299999999999
198,-1.3619
199,-1.7786
200,-2.0118
201,-1.9702
202,-1.6487
203,-1.1077
204,-0.5323899999999999
205,-0.017287999999999998
206,0.20399
207,0.19802999999999998
208,-0.015243000000000001
209,-0.35145
210,-0.61697
211,-0.7477
212,-0.60706
213,-0.27748
214,0.22280999999999998
215,0.67204
216,1.0128
217,1.1687
218,1.1625
219,1.0435
220,0.8458700000000001
221,0.6348600000000001
222,0.38566
223,0.17189000000000002
224,-0.065241
225,-0.14324
226,-0.11017
227,0.05937100000000001
228,0.3297
229,0.64556
230,0.92494
231,1.0196
232,0.8931899999999999
233,0.54595
234,0.051168
235,-0.36641
236,-0.5625600000000001
237,-0.4753
238,-0.1127
239,0.38822
240,0.82109
241,0.8995200000000001
242,0.59642
243,-0.057966
244,-0.88902
245,-1.732
246,-2.4144
247,-2.8007
248,-2.8315
249,-2.5539
250,-2.0214
251,-1.4516
252,-0.8519700000000001
253,-0.28895
254,0.25296
255,0.77975
256,1.2825
257,1.6787
258,1.9108
259,1.8857
260,1.5612
261,1.0129
262,0.40846
263,-0.13657
264,-0.38782
265,-0.37503000000000003
266,-0.13355
267,0.28554
268,0.75105
269,1.2396
270,1.6064
271,1.7777
272,1.7827
273,1.5704
274,1.1798
275,0.61487
276,-0.060926999999999995
277,-0.73992
278,-1.3324
279,-1.7747
280,-1.9894
281,-1.9359
282,-1.6649
283,-1.2784
284,-0.83329
285,-0.42398
286,-0.089209
287,0.17210999999999999
288,0.27491
289,0.28798
290,0.20744
291,0.1326
292,0.066245
293,0.023236
294,0.046928
295,0.1917
296,0.41597
297,0.61988
298,0.7914800000000001
299,0.80967
300,0.67262
301,0.32949
302,-0.13047
303,-0.5866100000000001
304,-0.9576100000000001
305,-1.0714
306,-0.8609899999999999
307,-0.29378000000000004
308,0.39521
309,1.0038
310,1.3818
311,1.4891
312,1.2805
313,0.743
314,0.11745
315,-0.45668000000000003
316,-0.7904100000000001
317,-0.95252
318,-0.9339799999999999
319,-0.81434
320,-0.65863
321,-0.41073999999999994
322,-0.19817
323,0.10279
324,0.48748
325,0.9373
326,1.3014
327,1.5002
328,1.4526
329,1.058
330,0.42091000000000006
331,-0.31855
332,-0.95457
333,-1.355
334,-1.3581
335,-0.9402299999999999
336,-0.27778
337,0.3974
338,0.922
339,1.1163
340,0.93686
341,0.40905
342,-0.21825999999999998
343,-0.74808
344,-1.0222
345,-1.0097
346,-0.72018
347,-0.2357
348,0.26377
349,0.60042
350,0.79408
351,0.74617
352,0.54574
353,0.28654
354,0.15433
355,0.1534
356,0.21668
357,0.32853000000000004
358,0.42153999999999997
359,0.46302
360,0.35261
361,0.22696999999999998
362,0.14118
363,0.1305
364,0.23471
365,0.37155
366,0.50859
367,0.5230100000000001
368,0.39378
369,0.10279
370,-0.2861
371,-0.67808
372,-0.9389
373,-0.98387
374,-0.79245
375,-0.44377
376,-0.12208
377,0.043924
378,-0.005489899999999999
379,-0.29386
380,-0.64658
381,-0.9163100000000001
382,-0.94406
383,-0.65309
384,-0.055162
385,0.65145
386,1.2499
387,1.5448
388,1.3521
389,0.76568
390,-0.033662
391,-0.69572
392,-1.0493
393,-1.0237
394,-0.5815
395,0.11217
396,0.75344
397,1.1483
398,1.1916
399,0.8825
400,0.35577
401,-0.10152
402,-0.28578000000000003
403,-0.16262000000000001
404,0.20197
405,0.68891
406,1.1226
407,1.3406
408,1.1741
409,0.71844
410,0.17135999999999998
411,-0.32253000000000004
412,-0.71595
413,-0.88792
414,-0.75227
415,-0.42928
416,-0.037362
417,0.33366999999999997
418,0.68125
419,0.8712200000000001
420,0.89702
421,0.67614
422,0.17905
423,-0.48641999999999996
424,-1.2425
425,-1.9267
426,-2.3883
427,-2.5182
428,-2.3025
429,-1.7652
430,-1.0951
431,-0.41878000000000004
432,0.17677
433,0.6085699999999999
434,0.9921
435,1.3989
436,1.8624
437,2.3337
438,2.7632
439,2.9508
440,2.7776
441,2.1905
442,1.2939
443,0.20477
444,-0.87926
445,-1.7164
446,-2.176
447,-2.2606
448,-2.0154
449,-1.5667
450,-1.0102
451,-0.44338999999999995
452,0.094183
453,0.6581899999999999
454,1.1748
455,1.4857
456,1.5058
457,1.2075
458,0.5623
459,-0.26521
460,-1.0691
461,-1.5854
462,-1.6738
463,-1.2899
464,-0.61516
465,0.17654
466,0.7989
467,1.0174
468,0.8947299999999999
469,0.50015
470,0.0454
471,-0.30019
472,-0.40776
473,-0.27162
474,-0.036509
475,0.13507
476,0.085374
477,-0.14081
478,-0.44716999999999996
479,-0.66698
480,-0.61421
481,-0.29832
482,0.20949
483,0.6844899999999999
484,0.93834
485,0.87611
486,0.51756
487,-0.0012937
488,-0.43171000000000004
489,-0.57655
490,-0.36825
491,0.14276
492,0.68132
493,0.9918600000000001
494,0.9990700000000001
495,0.67274
496,0.081009
497,-0.5393
498,-1.0322
499,-1.2525
