time,value
0,-2.0815
1,-1.0822
2,0.10854000000000001
3,1.3219
4,2.3679
5,3.0891
6,3.3931
7,3.2603
8,2.7218
9,1.9038
10,0.93796
11,-0.042741
12,-0.92243
13,-1.6252
14,-2.0943
15,-2.3068
16,-2.2635
17,-1.9729
18,-1.4776
19,-0.8352
20,-0.12805
21,0.5418
22,1.0836
23,1.4066
24,1.4705
25,1.2882
26,0.9217299999999999
27,0.46792
28,0.026675
29,-0.30568
30,-0.4756
31,-0.46973000000000004
32,-0.30975
33,-0.057790999999999995
34,0.20364000000000002
35,0.40386
36,0.49671000000000004
37,0.44865
38,0.24759
39,-0.079212
40,-0.48331999999999997
41,-0.8967200000000001
42,-1.247
43,-1.4829
44,-1.5646
45,-1.462
46,-1.1868
47,-0.7664300000000001
48,-0.26705999999999996
49,0.23651999999999998
50,0.66768
51,0.96226
52,1.1052
53,1.0999
54,0.98198
55,0.8234899999999999
56,0.68325
57,0.60347
58,0.60196
59,0.6702
60,0.77266
61,0.85236
62,0.85206
63,0.7327899999999999
64,0.47315
65,0.08004700000000001
66,-0.41078000000000003
67,-0.9488200000000001
68,-1.4699
69,-1.9082
70,-2.2043
71,-2.3177
72,-2.2223
73,-1.923
74,-1.4346
75,-0.8114899999999999
76,-0.13129000000000002
77,0.52673
78,1.0807
79,1.4655
80,1.6540000000000001
81,1.6381
82,1.4532
83,1.1571
84,0.8215899999999999
85,0.50545
86,0.24065999999999999
87,0.051773
88,-0.056004
89,-0.092414
90,-0.068354
91,0.0037454999999999997
92,0.10027
93,0.21261
94,0.30776
95,0.35125
96,0.32095
97,0.18656
98,-0.057874
99,-0.39053000000000004
100,-0.7733800000000001
101,-1.1469
102,-1.4369
103,-1.5933
104,-1.5769
105,-1.383
106,-1.0331
107,-0.5866600000000001
108,-0.11008
109,0.33783
110,0.7011
111,0.9531799999999999
112,1.0805
113,1.0936
114,1.0129
115,0.8662799999999999
116,0.6706
117,0.45446000000000003
118,0.23917
119,0.045606
120,-0.11018
121,-0.22191
122,-0.28969
123,-0.32103000000000004
124,-0.33509
125,-0.33541
126,-0.32534
127,-0.31029
128,-0.28249
129,-0.21608000000000002
130,-0.1083
131,0.033533
132,0.19541
133,0.3474
134,0.45956
135,0.50778
136,0.4896
137,0.40714
138,0.27302
139,0.12139000000000001
140,-0.029033
141,-0.18261
142,-0.3438
143,-0.51207
144,-0.6846399999999999
145,-0.8442299999999999
146,-0.97867
147,-1.0521
148,-1.0444
149,-0.94385
150,-0.7509600000000001
151,-0.49963
152,-0.21366999999999997
153,0.07370700000000001
154,0.34243
155,0.58872
156,0.80778
157,1.0152
158,1.207
159,1.361
160,1.439
161,1.4103
162,1.256
163,0.9699
164,0.57948
165,0.13972
166,-0.29679
167,-0.67228
168,-0.95547
169,-1.1352
170,-1.2263
171,-1.2424
172,-1.1859
173,-1.0682
174,-0.87498
175,-0.60492
176,-0.26741
177,0.097591
178,0.43593999999999994
179,0.6683899999999999
180,0.74535
181,0.63969
182,0.37478
183,0.016069999999999997
184,-0.34481
185,-0.63189
186,-0.77644
187,-0.74556
188,-0.55809
189,-0.24946
190,0.12029000000000001
191,0.49268
192,0.8245100000000001
193,1.0997
194,1.2847
195,1.3658
196,1.3252
197,1.1451
198,0.8271299999999999
199,0.38661999999999996
200,-0.13059
201,-0.66176
202,-1.1432
203,-1.5096
204,-1.7117
205,-1.7442
206,-1.6119999999999999
207,-1.3491
208,-0.9862700000000001
209,-0.56862
210,-0.12564
211,0.3056
212,0.69192
213,1.0037
214,1.2091
215,1.2914
216,1.2441
217,1.0877
218,0.8573
219,0.60383
220,0.3745
221,0.21255
222,0.12647
223,0.094421
224,0.082966
225,0.055077999999999995
226,-0.038923
227,-0.22135
228,-0.47763999999999995
229,-0.76972
230,-1.0607
231,-1.2976
232,-1.4239
233,-1.4142
234,-1.2632
235,-0.9880700000000001
236,-0.63318
237,-0.23363
238,0.16563
239,0.5403899999999999
240,0.86075
241,1.1111
242,1.295
243,1.4106
244,1.4383
245,1.3786
246,1.2334
247,1.0229
248,0.76945
249,0.49404
250,0.2184
251,-0.046111
252,-0.2925
253,-0.5316
254,-0.7763100000000001
255,-1.0317
256,-1.2846
257,-1.4975
258,-1.6384
259,-1.6545
260,-1.5227
261,-1.2411
262,-0.8371799999999999
263,-0.37448000000000004
264,0.08178400000000001
265,0.47288
266,0.76184
267,0.95255
268,1.0609
269,1.1166
270,1.1463
271,1.1569
272,1.141
273,1.0705
274,0.93409
275,0.7300800000000001
276,0.47461000000000003
277,0.20245
278,-0.042643
279,-0.2456
280,-0.39004
281,-0.4979
282,-0.59378
283,-0.70899
284,-0.8573700000000001
285,-1.0367
286,-1.2204
287,-1.3589
288,-1.3966
289,-1.3055
290,-1.0763
291,-0.7177899999999999
292,-0.26345
293,0.25301999999999997
294,0.78177
295,1.2777
296,1.706
297,2.0145
298,2.1638
299,2.1196
300,1.8552
301,1.3749
302,0.71742
303,-0.054141999999999996
304,-0.8388200000000001
305,-1.5376
306,-2.0562
307,-2.3329
308,-2.3517
309,-2.1392
310,-1.7398
311,-1.2319
312,-0.6766399999999999
313,-0.13205
314,0.36156
315,0.78722
316,1.1312
317,1.3907
318,1.5577
319,1.6388
320,1.6308
321,1.5372
322,1.3563
323,1.0986
324,0.78578
325,0.44267
326,0.084244
327,-0.26824000000000003
328,-0.61027
329,-0.9286200000000001
330,-1.2125
331,-1.4409
332,-1.5908
333,-1.6524
334,-1.6018
335,-1.4411
336,-1.1758
337,-0.81584
338,-0.4004
339,0.042696
340,0.47111000000000003
341,0.85659
342,1.177
343,1.4073
344,1.5419999999999998
345,1.5791
346,1.5138
347,1.3529
348,1.0958
349,0.74889
350,0.3474
351,-0.087189
352,-0.5148
353,-0.88065
354,-1.1573
355,-1.3273
356,-1.3822
357,-1.3353
358,-1.2066
359,-1.0185
360,-0.80472
361,-0.57476
362,-0.34385
363,-0.12792
364,0.082174
365,0.27929
366,0.46037
367,0.61987
368,0.74612
369,0.84726
370,0.9296
371,0.9869
372,1.0170000000000001
373,1.0022
374,0.9384899999999999
375,0.80019
376,0.57977
377,0.2823
378,-0.067517
379,-0.42991
380,-0.7468100000000001
381,-0.9786799999999999
382,-1.0938
383,-1.0904
384,-0.9825299999999999
385,-0.80178
386,-0.59408
387,-0.39359
388,-0.24261
389,-0.1574
390,-0.13033
391,-0.14677
392,-0.18467999999999998
393,-0.20872
394,-0.20629
395,-0.17303
396,-0.09467300000000001
397,0.023795
398,0.19029000000000001
399,0.40042
400,0.64426
401,0.91299
402,1.1685
403,1.3699
404,1.4745
405,1.4291
406,1.2093
407,0.8151
408,0.26991
409,-0.36434
410,-0.99877
411,-1.5505
412,-1.9298
413,-2.0921
414,-2.0162
415,-1.719
416,-1.2507
417,-0.69052
418,-0.1102
419,0.43361000000000005
420,0.88575
421,1.2187
422,1.4144
423,1.4837
424,1.4391
425,1.3033
426,1.0807
427,0.7913100000000001
428,0.46578
429,0.13314
430,-0.18083
431,-0.45483
432,-0.6688
433,-0.8114600000000001
434,-0.8798799999999999
435,-0.8835
436,-0.83557
437,-0.7542399999999999
438,-0.64608
439,-0.51288
440,-0.3711
441,-0.22491
442,-0.085392
443,0.035312
444,0.13943
445,0.21334
446,0.26411999999999997
447,0.30796999999999997
448,0.35231999999999997
449,0.38358000000000003
450,0.40712
451,0.40623000000000004
452,0.38431
453,0.33092
454,0.24197
455,0.13159
456,0.023077
457,-0.065237
458,-0.10754000000000001
459,-0.096722
460,-0.039827
461,0.048117
462,0.14595
463,0.23404
464,0.29083000000000003
465,0.30641999999999997
466,0.28269
467,0.2172
468,0.10912000000000001
469,-0.037305
470,-0.22235
471,-0.43791
472,-0.65708
473,-0.8563299999999999
474,-0.9969100000000001
475,-1.0634
476,-1.0306
477,-0.8976
478,-0.68134
479,-0.40163000000000004
480,-0.086156
481,0.23154
482,0.5414399999999999
483,0.8232799999999999
484,1.0543
485,1.2019
486,1.2391
487,1.1539
488,0.9461799999999999
489,0.64623
490,0.29861
491,-0.036514
492,-0.31113
493,-0.48378999999999994
494,-0.53795
495,-0.49046999999999996
496,-0.38266
497,-0.27196
498,-0.20922
499,-0.22332
