time,value
0,1.1715
1,1.1715
2,1.1715
3,1.1715
4,1.1715
5,1.1715
6,1.1715
7,1.1715
8,1.1715
9,1.1715
10,1.1715
11,1.1715
12,1.1715
13,1.1715
14,1.1715
15,1.1715
16,1.1715
17,1.1715
18,1.1715
19,1.1715
20,1.1715
21,1.1715
22,1.1715
23,1.1715
24,1.1715
25,1.1715
26,1.1715
27,1.1715
28,1.1715
29,1.1715
30,1.1715
31,1.1715
32,1.1715
33,1.1715
34,1.1715
35,1.1715
36,1.1715
37,1.1715
38,1.1715
39,1.1715
40,1.1715
41,1.1715
42,1.1715
43,1.1715
44,1.1715
45,1.1715
46,1.1715
47,1.1715
48,1.1715
49,1.1715
50,1.1715
51,1.1715
52,1.1715
53,1.1715
54,1.1715
55,1.1715
56,1.1715
57,1.1715
58,1.1715
59,1.1715
60,1.1715
61,1.1715
62,1.1715
63,1.1715
64,1.1715
65,1.1715
66,1.1715
67,1.1715
68,1.1715
69,1.1715
70,1.1715
71,1.1715
72,1.1715
73,1.1715
74,1.1715
75,1.1715
76,1.1715
77,1.1715
78,1.1715
79,1.1715
80,1.1715
81,1.1715
82,1.1715
83,1.1715
84,1.1715
85,1.1702
86,1.1661
87,1.1619
88,1.1575
89,1.153
90,1.1485
91,1.1440000000000001
92,1.1396
93,1.135
94,1.1269
95,1.1188
96,1.1098
97,1.1009
98,1.0919
99,1.083
100,1.0741
101,1.0651
102,1.0513
103,1.0361
104,1.0189
105,1.0011
106,0.98316
107,0.9652700000000001
108,0.9473799999999999
109,0.9294899999999999
110,0.9143399999999999
111,0.90176
112,0.8908200000000001
113,0.88187
114,0.8729299999999999
115,0.86398
116,0.8550399999999999
117,0.84609
118,0.8366100000000001
119,0.82549
120,0.81394
121,0.80053
122,0.7871100000000001
123,0.77369
124,0.7602800000000001
125,0.7468600000000001
126,0.73344
127,0.71335
128,0.69316
129,0.66273
130,0.63143
131,0.60012
132,0.56882
133,0.53751
134,0.50621
135,0.47228000000000003
136,0.43733999999999995
137,0.39597
138,0.35125
139,0.30653
140,0.26181
141,0.21708000000000002
142,0.17235999999999999
143,0.12864
144,0.086095
145,0.047985
146,0.01668
147,-0.014625999999999998
148,-0.045931
149,-0.077237
150,-0.10854000000000001
151,-0.13975
152,-0.17057
153,-0.20027999999999999
154,-0.22264
155,-0.24500999999999998
156,-0.26737
157,-0.28973000000000004
158,-0.31209000000000003
159,-0.33445
160,-0.35681
161,-0.37917
162,-0.39786
163,-0.41598999999999997
164,-0.43393000000000004
165,-0.45181000000000004
166,-0.4697
167,-0.48758999999999997
168,-0.50548
169,-0.52337
170,-0.5321899999999999
171,-0.53509
172,-0.53642
173,-0.53642
174,-0.53642
175,-0.53642
176,-0.53642
177,-0.53642
178,-0.5353100000000001
179,-0.53204
180,-0.52845
181,-0.5239699999999999
182,-0.5195
183,-0.51503
184,-0.51056
185,-0.5060899999999999
186,-0.50205
187,-0.5031399999999999
188,-0.50427
189,-0.50874
190,-0.51322
191,-0.51769
192,-0.5221600000000001
193,-0.52663
194,-0.5311100000000001
195,-0.53933
196,-0.5483899999999999
197,-0.56072
198,-0.57414
199,-0.58755
200,-0.60097
201,-0.61439
202,-0.6278
203,-0.64222
204,-0.65745
205,-0.67397
206,-0.69186
207,-0.70975
208,-0.72764
209,-0.74553
210,-0.76342
211,-0.78169
212,-0.80091
213,-0.82083
214,-0.84319
215,-0.86555
216,-0.88792
217,-0.91028
218,-0.9326399999999999
219,-0.95493
220,-0.9747600000000001
221,-0.9945799999999999
222,-1.004
223,-1.0129
224,-1.0218
225,-1.0308
226,-1.0397
227,-1.0487
228,-1.0573
229,-1.0659
230,-1.0716
231,-1.0761
232,-1.0806
233,-1.0851
234,-1.0895
235,-1.094
236,-1.0985
237,-1.1029
238,-1.1074
239,-1.1119
240,-1.1164
241,-1.1208
242,-1.1253
243,-1.1298
244,-1.1343
245,-1.1387
246,-1.1425
247,-1.1431
248,-1.1437
249,-1.1437
250,-1.1437
251,-1.1437
252,-1.1437
253,-1.1437
254,-1.1437
255,-1.1406
256,-1.1372
257,-1.1329
258,-1.1284
259,-1.124
260,-1.1195
261,-1.115
262,-1.1106
263,-1.1117
264,-1.1159
265,-1.1229
266,-1.1318
267,-1.1408
268,-1.1497
269,-1.1587
270,-1.1676
271,-1.1766
272,-1.1855
273,-1.1944
274,-1.2034
275,-1.2123
276,-1.2213
277,-1.2302
278,-1.2392
279,-1.2479
280,-1.2549
281,-1.2618
282,-1.2662
283,-1.2707
284,-1.2752
285,-1.2797
286,-1.2841
287,-1.2886
288,-1.2906
289,-1.2922
290,-1.2890000000000001
291,-1.2845
292,-1.28
293,-1.2755
294,-1.2711
295,-1.2666
296,-1.2616
297,-1.2561
298,-1.2488
299,-1.2399
300,-1.2309
301,-1.222
302,-1.2131
303,-1.2041
304,-1.1955
305,-1.1875
306,-1.1816
307,-1.1816
308,-1.1816
309,-1.1816
310,-1.1816
311,-1.1816
312,-1.1816
313,-1.1816
314,-1.1816
