time,value
0,-0.001475
1,0.12703
2,0.11441
3,0.053892999999999996
4,-0.076066
5,0.3879
6,0.22676
7,0.16502999999999998
8,0.20606
9,0.043767
10,0.00025003
11,0.36527
12,-0.072765
13,-0.21846
14,-0.26182
15,-0.11450999999999999
16,-0.040719
17,-0.071587
18,0.054102
19,0.42772
20,0.44608000000000003
21,-0.5100600000000001
22,-0.40303
23,0.3722
24,-0.38735
25,0.12941
26,0.28238
27,-0.078286
28,-0.40166
29,0.048927
30,-0.006027899999999999
31,0.38014000000000003
32,-0.35538000000000003
33,-0.22906999999999997
34,-0.23664000000000002
35,-0.11945
36,-0.07766100000000001
37,-0.50021
38,0.27533
39,0.51659
40,0.13632
41,-0.55766
42,-0.35824
43,-0.099887
44,-0.51642
45,-0.082925
46,-0.10722999999999999
47,0.7702
48,1.6349
49,1.6349
50,1.6349
51,1.6349
52,1.6349
53,1.6349
54,1.6349
55,1.6349
56,1.6349
57,1.6349
58,1.6349
59,1.6349
60,1.6349
61,-1.6262
62,-1.6262
63,-1.6262
64,-1.6262
65,-1.6262
66,-1.6262
67,-1.6262
68,-1.6262
69,-1.6262
70,-1.6262
71,-1.6262
72,-1.6262
73,-1.6262
74,-0.16417
75,0.020794
76,0.13375
77,0.14345
78,-1.6262
79,-1.6262
80,-1.6262
81,-1.6262
82,-1.6262
83,-1.6262
84,-1.6262
85,-1.6262
86,-1.6262
87,-1.6262
88,1.6349
89,1.6349
90,1.6349
91,1.6349
92,1.6349
93,1.6349
94,1.6349
95,1.6349
96,1.6349
97,0.54748
98,0.30949
99,-0.047077
100,0.087234
101,-0.49909
102,-0.44269
103,-0.32692
104,0.31856
105,-0.43188000000000004
106,-0.19365
107,-0.45685
108,0.006804800000000001
109,0.68466
110,0.033354
111,0.0022271
112,0.041043
113,0.088055
114,0.098148
115,0.41884
116,0.40026
117,0.1994
118,0.042729
119,0.43961999999999996
120,0.14374
121,-0.3371
122,0.43938999999999995
123,0.29688000000000003
124,-0.2167
125,-0.077208
126,0.08023
127,0.006770999999999999
