time,value
0,-1.1142
1,-1.1142
2,-1.1142
3,-1.1142
4,-1.1142
5,-1.1142
6,-1.1142
7,-1.1142
8,-1.1142
9,-1.1142
10,-1.1142
11,-1.1142
12,-1.1142
13,-1.1142
14,-1.1142
15,-1.1142
16,-1.1142
17,-1.1142
18,-1.1142
19,-1.1142
20,-1.1142
21,-1.1078
22,-1.1014
23,-0.9640299999999999
24,-0.82668
25,-0.6893199999999999
26,-0.55196
27,-0.4146
28,-0.27725
29,-0.19419
30,-0.11114
31,-0.11114
32,-0.11114
33,-0.11114
34,-0.11114
35,-0.11114
36,-0.11114
37,-0.11114
38,-0.11114
39,-0.11114
40,-0.11114
41,-0.11114
42,-0.11114
43,-0.11114
44,-0.11114
45,-0.11114
46,-0.11114
47,-0.11114
48,-0.11114
49,-0.11114
50,-0.11114
51,-0.11114
52,-0.11114
53,-0.11114
54,-0.11114
55,-0.11114
56,-0.11114
57,-0.11114
58,-0.11114
59,-0.11114
60,-0.11114
61,-0.11114
62,-0.11114
63,-0.11114
64,-0.11114
65,-0.11114
66,-0.11114
67,-0.11114
68,-0.11114
69,-0.11114
70,-0.11114
71,-0.11114
72,-0.11114
73,-0.11114
74,-0.11114
75,-0.11114
76,-0.11114
77,-0.11114
78,-0.11114
79,-0.11114
80,-0.11114
81,-0.11114
82,-0.11114
83,-0.11114
84,-0.11114
85,-0.11114
86,-0.11114
87,-0.072806
88,-0.034474
89,0.17156
90,0.3776
91,0.5836399999999999
92,0.78967
93,0.99571
94,1.2017
95,1.2976
96,1.3934
97,1.3934
98,1.3934
99,1.3934
100,1.3934
101,1.3934
102,1.3934
103,1.5148
104,1.6362
105,1.7735
106,1.9109
107,2.0483
108,2.1856
109,2.291
110,2.3964
111,2.3964
112,2.3964
113,2.3964
114,2.3964
115,2.3964
116,2.3964
117,2.3166
118,2.2367
119,2.0994
120,1.962
121,1.8246
122,1.6873
123,1.5499
124,1.4126
125,1.2113
126,1.0101
127,0.80405
128,0.59801
129,0.39197
130,0.18594000000000002
131,-0.020099000000000002
132,-0.22614
133,-0.43217
134,-0.63821
135,-0.84424
136,-1.0503
137,-1.2563
138,-1.4624
139,-1.4959
140,-1.5294
141,-1.4608
142,-1.3921
143,-1.3234
144,-1.2547
145,-1.186
146,-1.1174
147,-1.2499
148,-1.3825
149,-1.5199
150,-1.6572
151,-1.7946
152,-1.9319
153,-2.0246
154,-2.1172
155,-2.1172
156,-2.1172
157,-2.1172
158,-2.1172
159,-2.1172
160,-2.1172
161,-2.0709
162,-2.0246
163,-1.9559
164,-1.8872
165,-1.8185
166,-1.7498
167,-1.6812
168,-1.6125
169,-1.5438
170,-1.4751
171,-1.4065
172,-1.3378
173,-1.2691
174,-1.2004
175,-1.1062
176,-1.0119
177,-0.87459
178,-0.73723
179,-0.59988
180,-0.46252
181,-0.32516
182,-0.1878
183,-0.14947
184,-0.11114
185,-0.11114
186,-0.11114
187,-0.11114
188,-0.11114
189,-0.10635
190,-0.10156
191,-0.032876999999999997
192,0.035802
193,0.10447999999999999
194,0.17315999999999998
195,0.24184
196,0.31051999999999996
197,0.3217
198,0.33288
199,0.2642
200,0.19552
201,0.12684
202,0.058163
203,-0.010516
204,-0.079195
205,-0.042460000000000005
206,-0.0057246
207,0.062954
208,0.13163
209,0.20031
210,0.26899
211,0.32968000000000003
212,0.39038
213,0.39038
214,0.39038
215,0.39038
216,0.39038
217,0.39038
218,0.39038
219,0.35843
220,0.32649
221,0.25781
222,0.18913
223,0.12045
224,0.051774
225,-0.016905
226,-0.08558400000000001
227,-0.042460000000000005
228,0.00066424
229,0.069343
230,0.13802
231,0.2067
232,0.27538
233,0.33288
234,0.39038
235,0.39038
236,0.39038
237,0.39038
238,0.39038
239,0.39038
240,0.39038
241,0.39038
242,0.39038
243,0.39038
244,0.39038
245,0.39038
246,0.39038
247,0.39038
248,0.39038
249,0.39038
250,0.39038
251,0.39038
252,0.39038
253,0.39038
254,0.39038
255,0.376
256,0.36163
257,0.29295
258,0.22426999999999997
259,0.15559
260,0.086912
261,0.018233000000000003
262,-0.050446
263,-0.11912
264,-0.1878
265,-0.25648000000000004
266,-0.32516
267,-0.39384
268,-0.46252
269,-0.5312
270,-0.59988
271,-0.54397
272,-0.48807
273,-0.41939
274,-0.35072
275,-0.28204
276,-0.21336
277,-0.16225
278,-0.11114
279,-0.11114
280,-0.11114
281,-0.11114
282,-0.11114
283,-0.11114
284,-0.11114
285,-0.028085000000000002
286,0.054967999999999996
287,0.19233
288,0.32968000000000003
289,0.46703999999999996
290,0.6044
291,0.7417600000000001
292,0.8791100000000001
293,0.95099
294,1.0229
295,1.0915
296,1.1602
297,1.2289
298,1.2976
299,1.3455
300,1.3934
301,1.3934
302,1.3934
303,1.3934
304,1.3934
305,1.3934
306,1.3934
307,1.3934
308,1.3934
309,1.3934
310,1.3934
311,1.3934
312,1.3934
313,1.3934
314,1.3934
