time,value
0,-0.08385
1,-0.032666
2,-0.1478
3,0.13865999999999998
4,0.41648
5,0.7196899999999999
6,0.10206
7,0.24261999999999997
8,-0.23553000000000002
9,0.21169000000000002
10,0.022359999999999998
11,0.6177
12,-0.092039
13,0.27762
14,-0.59224
15,0.13672
16,0.051241999999999996
17,0.7450600000000001
18,-0.39213000000000003
19,0.7076399999999999
20,-0.34804
21,0.29286
22,0.5415
23,-0.34859
24,0.21515
25,-0.11152999999999999
26,-0.35141999999999995
27,0.27710999999999997
28,0.072531
29,-0.36073
30,0.085625
31,0.21577
32,-0.15032
33,1.8275
34,1.8275
35,1.8275
36,1.8275
37,1.8275
38,1.8275
39,1.8275
40,1.8275
41,1.8275
42,-1.8639
43,-1.8639
44,-1.8639
45,-1.8639
46,-1.8639
47,-1.8639
48,-1.8639
49,-1.8639
50,-0.24291999999999997
51,-0.042145
52,0.017488999999999998
53,-0.059978
54,0.10912999999999999
55,-0.15420999999999999
56,0.08707100000000001
57,-0.044851999999999996
58,0.06205700000000001
59,-0.22812
60,-0.30482
61,-0.06244299999999999
62,0.4317
63,-0.6957300000000001
64,0.14009000000000002
65,-0.20240999999999998
66,-0.14137
67,0.12859
68,0.55169
69,-0.055982000000000004
70,-0.7055899999999999
71,-0.14057999999999998
72,-0.13188
73,0.24043
74,-0.22396
75,-0.31927
76,-0.34264
77,0.64737
78,-0.31417
79,-0.10702
80,0.13559000000000002
81,-0.18308
82,0.78166
83,0.082483
84,0.17564000000000002
85,0.25334
86,-0.19523
87,0.30395
88,0.22257
89,0.028754000000000002
90,0.31798000000000004
91,-0.28071999999999997
92,0.45783999999999997
93,0.45948
94,-0.31618
95,-0.80694
96,-0.14018
97,-0.059237
98,-0.57494
99,0.19324000000000002
100,-0.47581999999999997
101,0.28811
102,0.028364999999999998
103,0.15755999999999998
104,0.34681
105,-0.65365
106,0.42968999999999996
107,-0.33388
108,0.20874
109,-0.5304399999999999
110,-1.8639
111,-1.8639
112,-1.8639
113,-1.8639
114,-1.8639
115,-1.8639
116,-1.8639
117,-1.8639
118,-1.8639
119,1.8275
120,1.8275
121,1.8275
122,1.8275
123,1.8275
124,1.8275
125,1.8275
126,1.8275
127,-0.44177
