d3mIndex,type,repeat,fold
0,TRAIN,0,0
1,TRAIN,0,0
2,TRAIN,0,0
3,TRAIN,0,0
4,TRAIN,0,0
5,TRAIN,0,0
6,TRAIN,0,0
7,TRAIN,0,0
8,TRAIN,0,0
9,TRAIN,0,0
10,TRAIN,0,0
11,TRAIN,0,0
12,TRAIN,0,0
13,TRAIN,0,0
14,TRAIN,0,0
15,TRAIN,0,0
16,TRAIN,0,0
17,TRAIN,0,0
18,TRAIN,0,0
19,TRAIN,0,0
20,TRAIN,0,0
21,TRAIN,0,0
22,TRAIN,0,0
23,TRAIN,0,0
24,TRAIN,0,0
25,TRAIN,0,0
26,TRAIN,0,0
27,TRAIN,0,0
28,TRAIN,0,0
29,TRAIN,0,0
30,TRAIN,0,0
31,TRAIN,0,0
32,TRAIN,0,0
33,TRAIN,0,0
34,TRAIN,0,0
35,TRAIN,0,0
36,TRAIN,0,0
37,TRAIN,0,0
38,TRAIN,0,0
39,TRAIN,0,0
40,TRAIN,0,0
41,TRAIN,0,0
42,TRAIN,0,0
43,TRAIN,0,0
44,TRAIN,0,0
45,TRAIN,0,0
46,TRAIN,0,0
47,TRAIN,0,0
48,TRAIN,0,0
49,TRAIN,0,0
50,TRAIN,0,0
51,TRAIN,0,0
52,TRAIN,0,0
53,TRAIN,0,0
54,TRAIN,0,0
55,TRAIN,0,0
56,TRAIN,0,0
57,TRAIN,0,0
58,TRAIN,0,0
59,TRAIN,0,0
60,TRAIN,0,0
61,TRAIN,0,0
62,TRAIN,0,0
63,TRAIN,0,0
64,TRAIN,0,0
65,TRAIN,0,0
66,TRAIN,0,0
67,TRAIN,0,0
68,TRAIN,0,0
69,TRAIN,0,0
70,TRAIN,0,0
71,TRAIN,0,0
72,TRAIN,0,0
73,TRAIN,0,0
74,TRAIN,0,0
75,TRAIN,0,0
76,TRAIN,0,0
77,TRAIN,0,0
78,TRAIN,0,0
79,TRAIN,0,0
80,TRAIN,0,0
81,TRAIN,0,0
82,TRAIN,0,0
83,TRAIN,0,0
84,TRAIN,0,0
85,TRAIN,0,0
86,TRAIN,0,0
87,TRAIN,0,0
88,TRAIN,0,0
89,TRAIN,0,0
90,TRAIN,0,0
91,TRAIN,0,0
92,TRAIN,0,0
93,TRAIN,0,0
94,TRAIN,0,0
95,TRAIN,0,0
96,TRAIN,0,0
97,TRAIN,0,0
98,TRAIN,0,0
99,TRAIN,0,0
100,TRAIN,0,0
101,TRAIN,0,0
102,TRAIN,0,0
103,TRAIN,0,0
104,TRAIN,0,0
105,TRAIN,0,0
106,TRAIN,0,0
107,TRAIN,0,0
108,TRAIN,0,0
109,TRAIN,0,0
110,TRAIN,0,0
111,TRAIN,0,0
112,TRAIN,0,0
113,TRAIN,0,0
114,TRAIN,0,0
115,TRAIN,0,0
116,TRAIN,0,0
117,TRAIN,0,0
118,TRAIN,0,0
119,TRAIN,0,0
120,TRAIN,0,0
121,TRAIN,0,0
122,TRAIN,0,0
123,TRAIN,0,0
124,TRAIN,0,0
125,TRAIN,0,0
126,TRAIN,0,0
127,TRAIN,0,0
128,TRAIN,0,0
129,TRAIN,0,0
130,TRAIN,0,0
131,TRAIN,0,0
132,TRAIN,0,0
133,TRAIN,0,0
134,TRAIN,0,0
135,TRAIN,0,0
136,TRAIN,0,0
137,TRAIN,0,0
138,TRAIN,0,0
139,TRAIN,0,0
140,TRAIN,0,0
141,TRAIN,0,0
142,TRAIN,0,0
143,TRAIN,0,0
144,TRAIN,0,0
145,TRAIN,0,0
146,TRAIN,0,0
147,TRAIN,0,0
148,TRAIN,0,0
149,TRAIN,0,0
150,TRAIN,0,0
151,TRAIN,0,0
152,TRAIN,0,0
153,TRAIN,0,0
154,TRAIN,0,0
155,TRAIN,0,0
156,TRAIN,0,0
157,TRAIN,0,0
158,TRAIN,0,0
159,TRAIN,0,0
160,TRAIN,0,0
161,TRAIN,0,0
162,TRAIN,0,0
163,TRAIN,0,0
164,TRAIN,0,0
165,TRAIN,0,0
166,TRAIN,0,0
167,TRAIN,0,0
168,TRAIN,0,0
169,TRAIN,0,0
170,TRAIN,0,0
171,TRAIN,0,0
172,TRAIN,0,0
173,TRAIN,0,0
174,TRAIN,0,0
175,TRAIN,0,0
176,TRAIN,0,0
177,TRAIN,0,0
178,TRAIN,0,0
179,TRAIN,0,0
180,TRAIN,0,0
181,TRAIN,0,0
182,TRAIN,0,0
183,TRAIN,0,0
184,TRAIN,0,0
185,TRAIN,0,0
186,TRAIN,0,0
187,TRAIN,0,0
188,TRAIN,0,0
189,TRAIN,0,0
190,TRAIN,0,0
191,TRAIN,0,0
192,TRAIN,0,0
193,TRAIN,0,0
194,TRAIN,0,0
195,TRAIN,0,0
196,TRAIN,0,0
197,TRAIN,0,0
198,TRAIN,0,0
199,TRAIN,0,0
200,TRAIN,0,0
201,TRAIN,0,0
202,TRAIN,0,0
203,TRAIN,0,0
204,TRAIN,0,0
205,TRAIN,0,0
206,TRAIN,0,0
207,TRAIN,0,0
208,TRAIN,0,0
209,TRAIN,0,0
210,TRAIN,0,0
211,TRAIN,0,0
212,TRAIN,0,0
213,TRAIN,0,0
214,TRAIN,0,0
215,TRAIN,0,0
216,TRAIN,0,0
217,TRAIN,0,0
218,TRAIN,0,0
219,TRAIN,0,0
220,TRAIN,0,0
221,TRAIN,0,0
222,TRAIN,0,0
223,TRAIN,0,0
224,TRAIN,0,0
225,TRAIN,0,0
226,TRAIN,0,0
227,TRAIN,0,0
228,TRAIN,0,0
229,TRAIN,0,0
230,TRAIN,0,0
231,TRAIN,0,0
232,TRAIN,0,0
233,TRAIN,0,0
234,TRAIN,0,0
235,TRAIN,0,0
236,TRAIN,0,0
237,TRAIN,0,0
238,TRAIN,0,0
239,TRAIN,0,0
240,TRAIN,0,0
241,TRAIN,0,0
242,TRAIN,0,0
243,TRAIN,0,0
244,TRAIN,0,0
245,TRAIN,0,0
246,TRAIN,0,0
247,TRAIN,0,0
248,TRAIN,0,0
249,TRAIN,0,0
250,TRAIN,0,0
251,TRAIN,0,0
252,TRAIN,0,0
253,TRAIN,0,0
254,TRAIN,0,0
255,TRAIN,0,0
256,TRAIN,0,0
257,TRAIN,0,0
258,TRAIN,0,0
259,TRAIN,0,0
260,TRAIN,0,0
261,TRAIN,0,0
262,TRAIN,0,0
263,TRAIN,0,0
264,TRAIN,0,0
265,TRAIN,0,0
266,TRAIN,0,0
267,TRAIN,0,0
268,TRAIN,0,0
269,TRAIN,0,0
270,TRAIN,0,0
271,TRAIN,0,0
272,TRAIN,0,0
273,TRAIN,0,0
274,TRAIN,0,0
275,TRAIN,0,0
276,TRAIN,0,0
277,TRAIN,0,0
278,TRAIN,0,0
279,TRAIN,0,0
280,TRAIN,0,0
281,TRAIN,0,0
282,TRAIN,0,0
283,TRAIN,0,0
284,TRAIN,0,0
285,TRAIN,0,0
286,TRAIN,0,0
287,TRAIN,0,0
288,TRAIN,0,0
289,TRAIN,0,0
290,TRAIN,0,0
291,TRAIN,0,0
292,TRAIN,0,0
293,TRAIN,0,0
294,TRAIN,0,0
295,TRAIN,0,0
296,TRAIN,0,0
297,TRAIN,0,0
298,TRAIN,0,0
299,TRAIN,0,0
300,TRAIN,0,0
301,TRAIN,0,0
302,TRAIN,0,0
303,TRAIN,0,0
304,TRAIN,0,0
305,TRAIN,0,0
306,TRAIN,0,0
307,TRAIN,0,0
308,TRAIN,0,0
309,TRAIN,0,0
310,TRAIN,0,0
311,TRAIN,0,0
312,TRAIN,0,0
313,TRAIN,0,0
314,TRAIN,0,0
315,TRAIN,0,0
316,TRAIN,0,0
317,TRAIN,0,0
318,TRAIN,0,0
319,TRAIN,0,0
320,TRAIN,0,0
321,TRAIN,0,0
322,TRAIN,0,0
323,TRAIN,0,0
324,TRAIN,0,0
325,TRAIN,0,0
326,TRAIN,0,0
327,TRAIN,0,0
328,TRAIN,0,0
329,TRAIN,0,0
330,TRAIN,0,0
331,TRAIN,0,0
332,TRAIN,0,0
333,TRAIN,0,0
334,TRAIN,0,0
335,TRAIN,0,0
336,TRAIN,0,0
337,TRAIN,0,0
338,TRAIN,0,0
339,TRAIN,0,0
340,TRAIN,0,0
341,TRAIN,0,0
342,TRAIN,0,0
343,TRAIN,0,0
344,TRAIN,0,0
345,TRAIN,0,0
346,TRAIN,0,0
347,TRAIN,0,0
348,TRAIN,0,0
349,TRAIN,0,0
350,TRAIN,0,0
351,TRAIN,0,0
352,TRAIN,0,0
353,TRAIN,0,0
354,TRAIN,0,0
355,TRAIN,0,0
356,TRAIN,0,0
357,TRAIN,0,0
358,TRAIN,0,0
359,TRAIN,0,0
360,TRAIN,0,0
361,TRAIN,0,0
362,TRAIN,0,0
363,TRAIN,0,0
364,TRAIN,0,0
365,TRAIN,0,0
366,TRAIN,0,0
367,TRAIN,0,0
368,TRAIN,0,0
369,TRAIN,0,0
370,TRAIN,0,0
371,TRAIN,0,0
372,TRAIN,0,0
373,TRAIN,0,0
374,TRAIN,0,0
375,TEST,0,0
376,TEST,0,0
377,TEST,0,0
378,TEST,0,0
379,TEST,0,0
380,TEST,0,0
381,TEST,0,0
382,TEST,0,0
383,TEST,0,0
384,TEST,0,0
385,TEST,0,0
386,TEST,0,0
387,TEST,0,0
388,TEST,0,0
389,TEST,0,0
390,TEST,0,0
391,TEST,0,0
392,TEST,0,0
393,TEST,0,0
394,TEST,0,0
395,TEST,0,0
396,TEST,0,0
397,TEST,0,0
398,TEST,0,0
399,TEST,0,0
400,TEST,0,0
401,TEST,0,0
402,TEST,0,0
403,TEST,0,0
404,TEST,0,0
405,TEST,0,0
406,TEST,0,0
407,TEST,0,0
408,TEST,0,0
409,TEST,0,0
410,TEST,0,0
411,TEST,0,0
412,TEST,0,0
413,TEST,0,0
414,TEST,0,0
415,TEST,0,0
416,TEST,0,0
417,TEST,0,0
418,TEST,0,0
419,TEST,0,0
420,TEST,0,0
421,TEST,0,0
422,TEST,0,0
423,TEST,0,0
424,TEST,0,0
425,TEST,0,0
426,TEST,0,0
427,TEST,0,0
428,TEST,0,0
429,TEST,0,0
430,TEST,0,0
431,TEST,0,0
432,TEST,0,0
433,TEST,0,0
434,TEST,0,0
435,TEST,0,0
436,TEST,0,0
437,TEST,0,0
438,TEST,0,0
439,TEST,0,0
440,TEST,0,0
441,TEST,0,0
442,TEST,0,0
443,TEST,0,0
444,TEST,0,0
445,TEST,0,0
446,TEST,0,0
447,TEST,0,0
448,TEST,0,0
449,TEST,0,0
450,TEST,0,0
451,TEST,0,0
452,TEST,0,0
453,TEST,0,0
454,TEST,0,0
455,TEST,0,0
456,TEST,0,0
457,TEST,0,0
458,TEST,0,0
459,TEST,0,0
460,TEST,0,0
461,TEST,0,0
462,TEST,0,0
463,TEST,0,0
464,TEST,0,0
465,TEST,0,0
466,TEST,0,0
467,TEST,0,0
468,TEST,0,0
469,TEST,0,0
470,TEST,0,0
471,TEST,0,0
472,TEST,0,0
473,TEST,0,0
474,TEST,0,0
475,TEST,0,0
476,TEST,0,0
477,TEST,0,0
478,TEST,0,0
479,TEST,0,0
480,TEST,0,0
481,TEST,0,0
482,TEST,0,0
483,TEST,0,0
484,TEST,0,0
485,TEST,0,0
486,TEST,0,0
487,TEST,0,0
488,TEST,0,0
489,TEST,0,0
490,TEST,0,0
491,TEST,0,0
492,TEST,0,0
493,TEST,0,0
494,TEST,0,0
495,TEST,0,0
496,TEST,0,0
497,TEST,0,0
498,TEST,0,0
499,TEST,0,0
500,TEST,0,0
501,TEST,0,0
502,TEST,0,0
503,TEST,0,0
504,TEST,0,0
505,TEST,0,0
506,TEST,0,0
507,TEST,0,0
508,TEST,0,0
509,TEST,0,0
510,TEST,0,0
511,TEST,0,0
512,TEST,0,0
513,TEST,0,0
514,TEST,0,0
515,TEST,0,0
516,TEST,0,0
517,TEST,0,0
518,TEST,0,0
519,TEST,0,0
520,TEST,0,0
521,TEST,0,0
522,TEST,0,0
523,TEST,0,0
524,TEST,0,0
525,TEST,0,0
526,TEST,0,0
527,TEST,0,0
528,TEST,0,0
529,TEST,0,0
530,TEST,0,0
531,TEST,0,0
532,TEST,0,0
533,TEST,0,0
534,TEST,0,0
535,TEST,0,0
536,TEST,0,0
537,TEST,0,0
538,TEST,0,0
539,TEST,0,0
540,TEST,0,0
541,TEST,0,0
542,TEST,0,0
543,TEST,0,0
544,TEST,0,0
545,TEST,0,0
546,TEST,0,0
547,TEST,0,0
548,TEST,0,0
549,TEST,0,0
550,TEST,0,0
551,TEST,0,0
552,TEST,0,0
553,TEST,0,0
554,TEST,0,0
555,TEST,0,0
556,TEST,0,0
557,TEST,0,0
558,TEST,0,0
559,TEST,0,0
560,TEST,0,0
561,TEST,0,0
562,TEST,0,0
563,TEST,0,0
564,TEST,0,0
565,TEST,0,0
566,TEST,0,0
567,TEST,0,0
568,TEST,0,0
569,TEST,0,0
570,TEST,0,0
571,TEST,0,0
572,TEST,0,0
573,TEST,0,0
574,TEST,0,0
575,TEST,0,0
576,TEST,0,0
577,TEST,0,0
578,TEST,0,0
579,TEST,0,0
580,TEST,0,0
581,TEST,0,0
582,TEST,0,0
583,TEST,0,0
584,TEST,0,0
585,TEST,0,0
586,TEST,0,0
587,TEST,0,0
588,TEST,0,0
589,TEST,0,0
590,TEST,0,0
591,TEST,0,0
592,TEST,0,0
593,TEST,0,0
594,TEST,0,0
595,TEST,0,0
596,TEST,0,0
597,TEST,0,0
598,TEST,0,0
599,TEST,0,0
600,TEST,0,0
601,TEST,0,0
602,TEST,0,0
603,TEST,0,0
604,TEST,0,0
605,TEST,0,0
606,TEST,0,0
607,TEST,0,0
608,TEST,0,0
609,TEST,0,0
610,TEST,0,0
611,TEST,0,0
612,TEST,0,0
613,TEST,0,0
614,TEST,0,0
615,TEST,0,0
616,TEST,0,0
617,TEST,0,0
618,TEST,0,0
619,TEST,0,0
620,TEST,0,0
621,TEST,0,0
622,TEST,0,0
623,TEST,0,0
624,TEST,0,0
625,TEST,0,0
626,TEST,0,0
627,TEST,0,0
628,TEST,0,0
629,TEST,0,0
630,TEST,0,0
631,TEST,0,0
632,TEST,0,0
633,TEST,0,0
634,TEST,0,0
635,TEST,0,0
636,TEST,0,0
637,TEST,0,0
638,TEST,0,0
639,TEST,0,0
640,TEST,0,0
641,TEST,0,0
642,TEST,0,0
643,TEST,0,0
644,TEST,0,0
645,TEST,0,0
646,TEST,0,0
647,TEST,0,0
648,TEST,0,0
649,TEST,0,0
650,TEST,0,0
651,TEST,0,0
652,TEST,0,0
653,TEST,0,0
654,TEST,0,0
655,TEST,0,0
656,TEST,0,0
657,TEST,0,0
658,TEST,0,0
659,TEST,0,0
660,TEST,0,0
661,TEST,0,0
662,TEST,0,0
663,TEST,0,0
664,TEST,0,0
665,TEST,0,0
666,TEST,0,0
667,TEST,0,0
668,TEST,0,0
669,TEST,0,0
670,TEST,0,0
671,TEST,0,0
672,TEST,0,0
673,TEST,0,0
674,TEST,0,0
675,TEST,0,0
676,TEST,0,0
677,TEST,0,0
678,TEST,0,0
679,TEST,0,0
680,TEST,0,0
681,TEST,0,0
682,TEST,0,0
683,TEST,0,0
684,TEST,0,0
685,TEST,0,0
686,TEST,0,0
687,TEST,0,0
688,TEST,0,0
689,TEST,0,0
690,TEST,0,0
691,TEST,0,0
692,TEST,0,0
693,TEST,0,0
694,TEST,0,0
695,TEST,0,0
696,TEST,0,0
697,TEST,0,0
698,TEST,0,0
699,TEST,0,0
700,TEST,0,0
701,TEST,0,0
702,TEST,0,0
703,TEST,0,0
704,TEST,0,0
705,TEST,0,0
706,TEST,0,0
707,TEST,0,0
708,TEST,0,0
709,TEST,0,0
710,TEST,0,0
711,TEST,0,0
712,TEST,0,0
713,TEST,0,0
714,TEST,0,0
715,TEST,0,0
716,TEST,0,0
717,TEST,0,0
718,TEST,0,0
719,TEST,0,0
720,TEST,0,0
721,TEST,0,0
722,TEST,0,0
723,TEST,0,0
724,TEST,0,0
725,TEST,0,0
726,TEST,0,0
727,TEST,0,0
728,TEST,0,0
729,TEST,0,0
730,TEST,0,0
731,TEST,0,0
732,TEST,0,0
733,TEST,0,0
734,TEST,0,0
735,TEST,0,0
736,TEST,0,0
737,TEST,0,0
738,TEST,0,0
739,TEST,0,0
740,TEST,0,0
741,TEST,0,0
742,TEST,0,0
743,TEST,0,0
744,TEST,0,0
745,TEST,0,0
746,TEST,0,0
747,TEST,0,0
748,TEST,0,0
749,TEST,0,0
