time,value
0,1.304
1,1.1909
2,1.0882
3,1.0755
4,0.9917299999999999
5,1.0262
6,1.0137
7,0.9093100000000001
8,0.85126
9,0.9292799999999999
10,0.76972
11,0.82944
12,0.72083
13,0.75295
14,0.6794600000000001
15,0.69592
16,0.5373
17,0.60793
18,0.51962
19,0.46016999999999997
20,0.46962
21,0.35161
22,0.4425
23,0.39248
24,0.26845
25,0.11732000000000001
26,0.13451
27,-0.098299
28,-0.16185
29,-0.05439
30,-0.2292
31,-0.41675
32,-0.56975
33,-0.77313
34,-0.96773
35,-0.8525200000000001
36,-0.90017
37,-1.0428
38,-1.2103
39,-1.2488
40,-1.3992
41,-1.5533
42,-1.671
43,-1.7867
44,-1.7825
45,-1.5754
46,-1.3822
47,-1.1905
48,-0.99371
49,-0.7931
50,-0.58963
51,-0.41023999999999994
52,-0.20398
53,0.0049608000000000005
54,0.21661
55,0.43006000000000005
56,0.64491
57,0.8325899999999999
58,1.0492
59,1.2641
60,1.482
61,1.6915
62,1.9068
63,2.0651
64,2.0912
65,1.8792
66,1.6445
67,1.4202
68,1.2042
69,0.9848100000000001
70,0.76615
71,0.57713
72,0.35767
73,0.14197
74,-0.072322
75,-0.28488
76,-0.49525
77,-0.67788
78,-0.8852
79,-1.0903
80,-1.2925
81,-1.4957
82,-1.6961
83,-1.8211
84,-1.7603
85,-1.7211
86,-1.6246
87,-1.5271
88,-1.4528
89,-1.3545
90,-1.3298
91,-1.3957
92,-1.2568
93,-1.0775
94,-0.9973
95,-0.9921700000000001
96,-0.81372
97,-0.6895899999999999
98,-0.5316
99,-0.59991
100,-0.5209
101,-0.32726
102,-0.27463000000000004
103,-0.30931
104,-0.11531
105,-0.09865399999999999
106,0.029945999999999997
107,0.16817000000000001
108,0.18767
109,0.066092
110,0.14765999999999999
111,0.26423
112,0.40475
113,0.40475
114,0.51031
115,0.47923999999999994
116,0.60678
117,0.73443
118,0.62956
119,0.5579
120,0.7286100000000001
121,0.8604799999999999
122,0.76615
123,0.90569
124,0.86155
125,0.97736
126,1.0833
127,1.2794
