time,value
0,-0.29899000000000003
1,-0.29899000000000003
2,-0.29899000000000003
3,-0.29899000000000003
4,-0.29899000000000003
5,-0.29899000000000003
6,-0.29899000000000003
7,-0.29899000000000003
8,-0.29899000000000003
9,-0.29899000000000003
10,-0.29899000000000003
11,-0.29899000000000003
12,-0.29899000000000003
13,-0.29899000000000003
14,-0.29899000000000003
15,-0.29899000000000003
16,-0.29899000000000003
17,-0.29899000000000003
18,-0.29899000000000003
19,-0.29899000000000003
20,-0.33091
21,-0.3845
22,-0.25985
23,-0.10268
24,0.15892
25,0.47827
26,0.14904
27,0.11592000000000001
28,0.29944
29,-0.49126000000000003
30,-0.20505
31,-0.25864000000000004
32,-0.29899000000000003
33,-0.29899000000000003
34,-0.35078000000000004
35,-0.45797
36,-0.52662
37,-0.58022
38,-0.5314399999999999
39,-0.46761
40,-0.36041999999999996
41,-0.23034000000000002
42,-0.34673000000000004
43,-0.075745
44,-0.075745
45,-0.075745
46,-0.16129000000000002
47,0.10629000000000001
48,0.15386
49,0.10026
50,0.23439000000000002
51,-0.22246
52,-0.10569
53,-0.20023
54,-0.14664000000000002
55,-0.46416
56,-0.19618
57,-0.37082
58,-0.18156
59,-0.20445
60,-0.20204
61,-0.47318999999999994
62,-0.075745
63,-0.075745
64,-0.075745
65,-0.075745
66,-0.46717
67,-0.20083
68,-0.15266
69,-0.38588
70,0.41805
71,0.19722
72,0.25081
73,0.26828
74,0.26828
75,0.31705
76,0.35499
77,0.3014
78,0.22733000000000003
79,0.12014000000000001
80,0.23137
81,-0.24254
82,-0.075745
83,-0.16129000000000002
84,0.15988
85,0.35559
86,0.62357
87,0.8313299999999999
88,0.99211
89,1.1101
90,1.2155
91,1.2691
92,1.2649
93,1.1041
94,0.8891399999999999
95,0.62116
96,0.39293
97,0.17855
98,0.34579
99,-0.075745
100,-0.075745
101,0.28557
102,0.21769000000000002
103,0.45195
104,0.71992
105,0.93852
106,1.136
107,1.2432
108,1.2872
109,1.2336
110,1.1126
111,0.9517700000000001
112,0.74461
113,0.48145
114,-0.21529
115,-0.73137
116,-0.89215
117,-0.9608
118,-0.9608
119,-0.83073
120,-0.67476
121,-0.62117
122,-0.62779
123,-0.7885800000000001
124,-1.2541
125,-2.0044
126,-2.3109
127,-2.4717
128,-2.4205
129,-2.3308
130,-2.1164
131,-1.8773
132,-1.6094
133,-1.4161
134,-1.2553
135,-1.1945
136,-1.1589
137,-1.2125
138,-1.2661
139,-1.3197
140,-1.2703
141,-1.1631
142,-0.91504
143,-0.65308
144,-0.4387
145,-0.24299
146,-0.40996000000000005
147,0.2374
148,0.15446
149,0.17373
150,0.17373
151,0.17373
152,0.18939
153,0.24298000000000003
154,0.32488
155,0.43206999999999995
156,0.49831000000000003
157,0.55191
158,0.6055
159,0.64645
160,0.64645
161,0.62116
162,0.56757
163,0.5139699999999999
164,0.46038
165,0.45736000000000004
166,0.45736000000000004
167,0.45736000000000004
168,0.50193
169,0.60912
170,0.71631
171,0.8235
172,0.93069
173,1.0445
174,1.2053
175,1.3661
176,1.5269
177,1.6557
178,1.7629
179,1.8256
180,1.8755
181,1.8755
182,1.8755
183,1.8755
184,1.8466
185,1.7930000000000001
186,1.8225
187,1.8749
188,1.8213
189,1.7412
190,1.5805
191,1.4974
192,1.4974
193,1.6130000000000002
194,1.7738
195,1.8834
196,1.9598
197,1.9062
198,1.8298
199,1.7226
200,1.6864
201,1.6864
202,1.7346
203,1.8027
204,1.9635
205,2.0845
206,2.1381
207,1.9641
208,1.6425
209,1.1403
210,0.6043
211,0.34278000000000003
212,-0.41702
213,-0.79219
214,-1.0198
215,-1.127
216,-1.0234
217,-0.86385
218,-0.75666
219,-0.71872
220,-0.87951
221,-1.1198
222,-1.4414
223,-1.9978
224,-2.6409
225,-2.6626
226,-2.6626
227,-2.6626
228,-2.5452
229,-2.2772
230,-1.9731
231,-1.6515
232,-1.3787
233,-1.1499
234,-1.1499
235,-1.1908
236,-1.298
237,-1.4383
238,-1.5991
239,-1.6684
240,-1.6883
241,-1.3667
242,-1.1499
243,-1.1499
244,-1.0897
245,-0.9824799999999999
246,-0.9608
247,-0.9608
248,-0.9608
249,-0.97526
250,-1.0289
251,-1.0282
252,-0.9746600000000001
253,-0.92106
254,-0.86746
255,-0.76148
256,-0.6771699999999999
257,-0.6771699999999999
258,-0.65308
259,-0.59949
260,-0.54589
261,-0.4923
262,-0.48808
263,-0.47965
264,-0.42605
265,-0.37246
266,-0.31886
267,-0.26527
268,-0.21166999999999997
269,-0.11170999999999999
270,0.059748
271,0.27971999999999997
272,0.4935
273,0.60069
274,0.64645
275,0.64645
276,0.6031
277,0.54709
278,0.4399
279,0.33271
280,0.22551999999999997
281,0.17373
282,0.17373
283,0.25443000000000005
284,0.36162
285,0.5218
286,0.6585
287,0.71209
288,0.69162
289,0.58443
290,0.51457
291,0.46098
292,0.45736000000000004
293,0.45736000000000004
294,0.45736000000000004
295,0.43568999999999997
296,0.38209
297,0.25985
298,0.49633999999999995
299,-0.07273400000000001
300,-0.10388
301,-0.25038
302,0.20428
303,0.20143
304,0.36222
305,0.523
306,0.55191
307,0.55191
308,0.55191
309,0.5206
310,0.4134
311,0.33452
312,0.28092
313,0.18638
314,0.39698
315,-1.7531
316,-1.7531
317,-1.7531
318,-1.7531
319,-1.7531
320,-1.7531
321,-1.7531
322,-1.7531
323,-1.7531
324,-1.7531
325,-1.7531
326,-1.7531
327,-1.7531
328,-1.7531
329,-1.7531
330,-1.7531
331,-1.7531
332,-1.7531
333,-1.7728
334,-1.8278
335,-1.8173
336,-1.7623
337,-1.6159
338,-1.4546
339,-1.3447
340,-1.2514
341,-1.1964
342,-1.2007
343,-1.2557
344,-1.3107
345,-1.3657
346,-1.4207
347,-1.4756
348,-1.5306
349,-1.5856
350,-1.6406
351,-1.6561
352,-1.6561
353,-1.6035
354,-1.538
355,-1.4281
356,-1.3416
357,-1.2866
358,-1.268
359,-1.268
360,-1.268
361,-1.268
362,-1.268
363,-1.2884
364,-1.3434
365,-1.3984
366,-1.4534
367,-1.5084
368,-1.5547
369,-1.4997
370,-1.4448
371,-1.3898
372,-1.3953
373,-1.4503
374,-1.4188
375,-1.3638
376,-1.3088
377,-1.2538
378,-1.1988
379,-1.1982
380,-1.2532
381,-1.3484
382,-1.4583
383,-1.4089
384,-1.3428
385,-1.2328
386,-1.1469
387,-1.092
388,-1.037
389,-0.98198
390,-0.92699
391,-0.872
392,-0.81701
393,-0.80403
394,-0.8590200000000001
395,-0.88003
396,-0.88003
397,-0.92699
398,-0.96715
399,-0.8571700000000001
400,-0.7471899999999999
401,-0.63721
402,-0.55813
403,-0.5031399999999999
404,-0.40428000000000003
405,-0.29616
406,-0.24117
407,-0.20101
408,-0.20101
409,-0.22880999999999999
410,-0.2838
411,-0.29801
412,-0.29801
413,-0.24425999999999998
414,-0.20101
415,-0.20101
416,-0.20101
417,-0.20101
418,-0.25021
419,0.16971
420,0.49099
421,0.8036300000000001
422,1.0236
423,1.2219
424,1.3869
425,1.5518
426,1.7168
427,1.8342
428,1.9108
429,1.6909
430,1.4709
431,1.251
432,1.031
433,0.81104
434,0.72454
435,0.66955
436,0.61456
437,0.54413
438,0.43415
439,0.34293
440,-0.5365
441,-0.76882
442,-0.87879
443,-0.8256600000000001
444,-0.75831
445,-0.6483399999999999
446,-0.5636899999999999
447,-0.5087
448,-0.45371000000000006
449,-0.39871999999999996
450,-0.34373000000000004
451,-0.30728
452,-0.36227
453,-0.41726
454,-0.47225
455,-0.4568
456,-0.40181
457,-0.29863
458,-0.19483
459,-0.13984000000000002
460,-0.42321000000000003
461,-0.14826
462,-0.22491
463,-0.22491
464,-0.22491
465,-0.22491
466,-0.22491
467,-0.22491
468,-0.22491
469,0.11124
470,0.38618
471,0.13202
472,0.18700999999999998
473,0.18700999999999998
474,0.18700999999999998
475,0.18700999999999998
476,0.13510999999999998
477,0.12668
478,-0.22491
479,-0.22491
480,-0.22491
481,-0.22491
482,-0.22491
483,0.080345
484,0.35529
485,0.16167
486,0.27165
487,0.33282
488,0.38781
489,0.4428
490,0.47802
491,0.47802
492,0.54351
493,0.65349
494,0.67202
495,0.67202
496,0.67202
497,0.6553399999999999
498,0.60035
499,0.57502
500,0.57502
501,0.61765
502,0.6714100000000001
503,0.61642
504,0.54783
505,0.43786
506,0.30130999999999997
507,0.13634000000000002
508,0.45106
509,0.45106
510,0.19504000000000002
511,0.28401
512,0.28401
513,0.28401
514,0.28401
515,0.35691999999999996
516,0.46688999999999997
517,0.47802
518,0.4706
519,0.41561000000000003
520,0.42178999999999994
521,0.53177
522,0.67511
523,0.8400799999999999
524,0.9123700000000001
525,0.9630299999999999
526,0.9630299999999999
527,0.9630299999999999
528,0.9630299999999999
529,0.9630299999999999
530,0.9630299999999999
531,1.0928
532,1.2565
533,1.3665
534,1.4623
535,1.5172
536,1.4635
537,1.2985
538,1.0131
539,0.68314
540,0.67202
541,0.64978
542,0.5398
543,0.5503100000000001
544,0.71527
545,0.9173100000000001
546,1.1373
547,1.2571
548,1.351
549,1.351
550,1.33
551,1.2751
552,1.1521
553,0.98713
554,0.9160799999999999
555,0.86603
556,0.86603
557,0.86603
558,0.86603
559,0.89692
560,0.95191
561,0.9630299999999999
562,0.9630299999999999
563,0.9630299999999999
564,0.9630299999999999
565,0.9630299999999999
566,0.9630299999999999
567,0.9630299999999999
568,0.9630299999999999
569,0.9630299999999999
570,0.90928
571,0.84255
572,0.7325699999999999
573,0.64731
574,0.59232
575,0.53733
576,0.48234
577,0.52868
578,0.5663699999999999
579,0.5113800000000001
580,0.47802
581,0.47802
582,0.51262
583,0.5676
584,0.62259
585,0.68314
586,0.7931199999999999
587,0.9031
588,1.0131
589,1.0285
590,0.97354
591,0.9630299999999999
592,0.9605600000000001
593,0.9055700000000001
594,0.8505799999999999
595,0.7955899999999999
596,0.7406
597,0.68562
598,0.7134199999999999
599,0.76841
600,0.87777
601,0.97539
602,1.0304
603,1.0347
604,0.9797100000000001
605,0.9630299999999999
606,0.9630299999999999
607,0.91175
608,0.8753
609,0.93029
610,0.94079
611,0.8858
612,0.83081
613,0.77582
614,0.72083
615,0.67202
616,0.67202
617,0.69118
618,0.74617
619,0.80115
620,0.85614
621,0.9111299999999999
622,0.9630299999999999
623,0.9630299999999999
624,0.9791
625,1.0341
626,1.031
627,0.97601
628,0.9630299999999999
629,0.9630299999999999
630,-0.47891999999999996
631,-0.47891999999999996
632,-0.47891999999999996
633,-0.47891999999999996
634,-0.47891999999999996
635,-0.47891999999999996
636,-0.47891999999999996
637,-0.47891999999999996
638,-0.47891999999999996
639,-0.47891999999999996
640,-0.47891999999999996
641,-0.47891999999999996
642,-0.47891999999999996
643,-0.47891999999999996
644,-0.47891999999999996
645,-0.47891999999999996
646,-0.47891999999999996
647,-0.47891999999999996
648,-0.49473999999999996
649,-0.53874
650,-0.5827399999999999
651,-0.62674
652,-0.59758
653,-0.5565399999999999
654,-0.5565399999999999
655,-0.5565399999999999
656,-0.5565399999999999
657,-0.50908
658,-0.42108
659,-0.33308000000000004
660,-0.24606999999999998
661,-0.24606999999999998
662,-0.25694
663,-0.30094
664,-0.30243000000000003
665,-0.25843
666,-0.24606999999999998
667,-0.24606999999999998
668,-0.20404
669,-0.16845
670,-0.16845
671,-0.13088
672,-0.21333000000000002
673,-0.21086
674,-0.43086
675,-0.13038
676,-0.18031
677,-0.26832
678,-0.32369000000000003
679,-0.32369000000000003
680,-0.29699000000000003
681,-0.25299
682,-0.24606999999999998
683,-0.24261
684,-0.19860999999999998
685,-0.15461
686,-0.11060999999999999
687,-0.21086
688,0.22914
689,0.15004
690,-0.079849
691,-0.14818
692,-0.26881
693,-0.35681
694,-0.46656000000000003
695,-0.59856
696,-0.6663
697,-0.7103
698,-0.79681
699,-0.8759100000000001
700,-0.91991
701,-0.92535
702,-0.88135
703,-0.83735
704,-0.79335
705,-0.70931
706,-0.62773
707,-0.58373
708,-0.59016
709,-0.67816
710,-0.73897
711,-0.7829699999999999
712,-0.97726
713,-1.1933
714,-1.3693
715,-1.5596
716,-1.7797
717,-1.9255
718,-2.0135
719,-1.9962
720,-1.9492
721,-1.8172
722,-1.6852
723,-1.5532
724,-1.4212
725,-1.2892
726,-1.2877
727,-1.3317
728,-1.4188
729,-1.4974
730,-1.5414
731,-1.6051
732,-1.6931
733,-1.751
734,-1.795
735,-1.7579
736,-1.7069999999999999
737,-1.619
738,-1.4099
739,-1.0138
740,-0.53479
741,-0.21774000000000002
742,0.52122
743,1.1338
744,2.4978
745,3.5503
746,3.9903
747,4.2286
748,4.3166
749,4.0131
750,3.6210000000000004
751,3.313
752,3.0421
753,2.8661
754,2.6901
755,2.5141
756,2.4043
757,2.3163
758,2.0978
759,1.8679
760,1.6039
761,1.4007
762,1.2687
763,1.1674
764,1.0794
765,1.1145
766,1.1733
767,1.3053
768,1.3839
769,1.3839
770,1.2712
771,1.0952
772,0.8420700000000001
773,0.58796
774,0.41196000000000005
775,0.28194
776,0.23794
777,0.24535
778,0.28935
779,0.36944
780,0.46733
781,0.73133
782,0.9182100000000001
783,0.9182100000000001
784,0.89497
785,0.8509700000000001
786,0.70612
787,0.53012
788,0.39812
789,0.28688
790,0.24288
791,0.26116999999999996
792,0.34917
793,0.43717
794,0.52517
795,0.61317
796,0.70117
797,0.78918
798,0.84059
799,0.84059
800,0.81192
801,0.7679199999999999
802,0.68486
803,0.6023
804,0.5583
805,0.5143
806,0.4703
807,0.4787
808,0.5227
809,0.49353
810,0.44953000000000004
811,0.40553
812,0.33483
813,0.20282999999999998
814,0.23656
815,-0.1289
816,-0.27079000000000003
817,-0.4013
818,-0.4013
819,-0.37955
820,-0.29155
821,-0.30984
822,-0.44183999999999996
823,-0.5422
824,-0.63021
825,-0.71821
826,-0.7894
827,-0.7894
828,-0.77061
829,-0.7266100000000001
830,-0.71178
831,-0.71178
832,-0.79088
833,-0.88481
834,-1.0168
835,-1.1325
836,-1.2205
837,-1.2551
838,-1.2551
839,-1.0326
840,-0.76517
841,-0.45716999999999997
842,-0.16301
843,0.10099
844,0.19542
845,0.15142
846,-0.32704
847,-0.32961999999999997
848,-0.59362
849,-0.8235100000000001
850,-0.9555100000000001
851,-0.97875
852,-0.89075
853,-0.41713
854,0.19888
855,0.21964
856,0.23744
857,0.32544
858,0.33632
859,0.24831999999999999
860,0.16032000000000002
861,0.36263
862,-0.077378
863,-0.42098
864,-0.20097
865,0.10307000000000001
866,0.10840999999999999
867,0.2236
868,0.3556
869,0.41245
870,0.44459
871,0.35659
872,0.29725999999999997
873,0.29725999999999997
874,0.24781999999999998
875,0.15982000000000002
876,0.14202
877,0.14351
878,0.18750999999999998
879,0.24336999999999998
880,0.33137
881,0.41936999999999997
882,0.50737
883,0.56275
884,0.60675
885,0.56472
886,0.5019399999999999
887,0.36994
888,0.23794
889,0.10593
890,0.14481
891,-0.4185
892,-0.13137000000000001
893,-0.16845
894,-0.16845
895,-0.15115
896,-0.10715
897,-0.17625
898,0.26375
899,0.14054
900,0.21519000000000002
901,0.17119
902,0.12719
903,0.41701000000000005
904,0.32306999999999997
905,0.32306999999999997
906,0.1451
907,-0.05513
908,0.16487000000000002
909,0.38487
910,0.12077
911,0.16477
912,0.20876999999999998
913,0.21964
914,0.21964
915,0.17614000000000002
916,0.12225
917,0.17229
918,-0.06501699999999999
919,-0.06501699999999999
920,0.088242
921,0.30824
922,0.32306999999999997
923,0.32306999999999997
924,0.32306999999999997
925,0.23409000000000002
926,0.095373
927,-0.06501699999999999
928,-0.06501699999999999
929,0.12779000000000001
930,0.32306999999999997
931,0.32306999999999997
932,0.3997
933,0.12372999999999999
934,0.11632
935,0.36263
936,0.14262
937,-0.06501699999999999
938,-0.06501699999999999
939,0.06352200000000001
940,0.1005
941,0.21173000000000003
942,0.34373000000000004
943,0.44211999999999996
944,0.53012
