time,value
0,1.7309999999999999
1,1.7022
2,1.5530000000000002
3,1.3872
4,1.1446
5,0.9513799999999999
6,0.7330300000000001
7,0.55974
8,0.85339
9,1.0373
10,0.99211
11,0.85036
12,0.6432899999999999
13,0.44756999999999997
14,0.20343
15,-0.034712
16,-0.27144
17,-0.58421
18,-0.52915
19,-0.31483
20,-0.11402000000000001
21,0.02315
22,0.034174
23,-0.099625
24,-0.29046
25,-0.44916000000000006
26,-0.6523100000000001
27,-0.88531
28,-1.0571
29,-1.2446
30,-1.4773
31,-1.6462
32,-1.8254
33,-1.6436
34,-1.4629
35,-1.2256
36,-0.9934200000000001
37,-0.7875300000000001
38,-0.72259
39,-0.6699
40,-0.62976
41,-0.60821
42,-0.62789
43,-0.62256
44,-0.58973
45,-0.5766100000000001
46,-0.5979
47,-0.33079000000000003
48,-0.10780999999999999
49,0.09641799999999999
50,0.32424000000000003
51,0.52854
52,0.7410100000000001
53,0.9789
54,1.1951
55,1.4441
56,1.584
57,1.8049
58,2.025
59,2.2474
60,2.1479
61,1.9307
62,1.7706
63,1.6291
64,1.4602
65,1.2502
66,1.0392
67,0.86516
68,0.6511
69,0.41917
70,0.22505999999999998
71,0.099116
72,-0.076739
73,0.018475
74,0.11400999999999999
75,0.11546
76,0.018262
77,-0.0099371
78,-0.031686
79,-0.084642
80,-0.21122
81,-0.50689
82,-0.70903
83,-0.91253
84,-1.0261
85,-1.1759
86,-1.3899
87,-1.2972
88,-1.2176
89,-1.1
90,-0.98035
91,-0.79782
92,-0.69445
93,-0.64074
94,-0.60556
95,-0.62256
96,-0.82981
97,-1.0337
98,-1.2987
99,-1.5598
100,-1.7761
101,-1.6788
102,-1.5425
103,-1.3118
104,-1.0755
105,-0.86077
106,-0.6359199999999999
107,-0.39289
108,-0.18043
109,0.025910000000000002
110,0.21625999999999998
111,0.42596000000000006
112,0.57822
113,0.59824
114,0.41236000000000006
115,0.14095
116,-0.14345
117,-0.32936
118,-0.15761
119,0.10222
120,0.31706
121,0.5695399999999999
122,0.7863100000000001
123,0.99845
124,1.2177
125,1.3388
126,1.5837
127,1.6886
