time,value
0,1.8469
1,1.6966
2,1.6149
3,1.5159
4,1.3289
5,1.1043
6,1.1423
7,1.0107
8,0.82725
9,0.6099
10,0.36700000000000005
11,0.36985
12,0.51405
13,0.40396
14,0.22271999999999997
15,0.028725
16,-0.20401
17,-0.46686000000000005
18,-0.73577
19,-0.9830700000000001
20,-0.94842
21,-0.71067
22,-0.5320699999999999
23,-0.3492
24,-0.22055999999999998
25,-0.3971
26,-0.56429
27,-0.7046
28,-0.92696
29,-1.0739
30,-1.0881
31,-1.0942
32,-1.2006
33,-1.2521
34,-1.37
35,-1.515
36,-1.6303
37,-1.5209
38,-1.3298
39,-1.1326
40,-1.0481
41,-0.95811
42,-0.8658600000000001
43,-0.76249
44,-0.72082
45,-0.67697
46,-0.57325
47,-0.49366000000000004
48,-0.29522
49,-0.11789000000000001
50,0.060971000000000004
51,0.21154
52,0.34934
53,0.45418000000000003
54,0.55967
55,0.63372
56,0.60331
57,0.67204
58,0.57503
59,0.49017
60,0.7309399999999999
61,0.9391
62,1.179
63,1.3898
64,1.6304
65,1.8361
66,2.0713
67,2.2623
68,2.0761
69,1.8381
70,1.6294
71,1.3795
72,1.1746
73,0.93281
74,0.72054
75,0.47921
76,0.40631
77,0.44753999999999994
78,0.38138
79,0.32966
80,0.21154
81,0.087241
82,-0.047312
83,-0.17271
84,-0.29115
85,-0.45087
86,-0.55728
87,-0.76663
88,-0.8394299999999999
89,-0.8606600000000001
90,-0.94119
91,-1.0171
92,-1.033
93,-1.0924
94,-1.3296
95,-1.5239
96,-1.4505
97,-1.3736
98,-1.3005
99,-1.208
100,-1.1733
101,-1.0984
102,-1.0845
103,-0.8606600000000001
104,-0.71828
105,-0.57085
106,-0.62061
107,-0.71472
108,-0.8658600000000001
109,-0.9830700000000001
110,-0.76094
111,-0.51303
112,-0.23463
113,-0.06954
114,0.12684
115,0.21154
116,0.12493
117,0.1714
118,0.41443
119,0.64071
120,0.82439
121,0.80051
122,0.9979899999999999
123,1.2209
124,1.2551
125,1.4486
126,1.5854
127,1.8185
