time,value
0,0.6510600000000001
1,0.6510600000000001
2,0.6510600000000001
3,0.6510600000000001
4,0.6510600000000001
5,0.64689
6,0.6119
7,0.52244
8,0.3768
9,0.35555
10,0.35411
11,0.35411
12,0.35411
13,0.35411
14,0.33781
15,0.30115
16,0.22833
17,0.20733000000000001
18,0.20563
19,0.20563
20,0.20563
21,0.20563
22,0.19237
23,0.16402
24,0.091199
25,0.060078999999999994
26,0.057241999999999994
27,0.10709
28,0.16591
29,0.23873000000000003
30,0.31155
31,0.38437
32,0.45719
33,0.46634
34,0.40108
35,0.32952
36,0.2567
37,0.18388
38,0.11105999999999999
39,0.038239999999999996
40,-0.03458
41,-0.085173
42,-0.089902
43,-0.091323
44,-0.089059
45,-0.057851
46,-0.0024114
47,0.083176
48,0.21791999999999997
49,0.37644
50,0.58922
51,0.77771
52,0.9474600000000001
53,1.0946
54,1.2366
55,1.3704
56,1.4625
57,1.5315
58,1.5381
59,1.5419
60,1.5419
61,1.5419
62,1.5419
63,1.5419
64,1.5419
65,1.5419
66,1.6623
67,1.7973
68,1.9429
69,2.0696
70,2.1838
71,2.2268
72,2.1916
73,2.046
74,1.9003
75,1.7473
76,1.5558
77,1.3499
78,1.1315
79,0.92117
80,0.72956
81,0.58392
82,0.43828
83,0.2938
84,0.19308
85,0.092929
86,-0.0063707
87,-0.14145
88,-0.28709
89,-0.43273
90,-0.51368
91,-0.5344899999999999
92,-0.57594
93,-0.6342899999999999
94,-0.73264
95,-0.86113
96,-1.0068
97,-1.1524
98,-1.2745
99,-1.3587
100,-1.4342
101,-1.5039
102,-1.5521
103,-1.5761
104,-1.5761
105,-1.5761
106,-1.5761
107,-1.5761
108,-1.5499
109,-1.5078
110,-1.4587
111,-1.4257
112,-1.4205
113,-1.3652
114,-1.2924
115,-1.2196
116,-1.1668
117,-1.1351
118,-1.1111
119,-1.0777
120,-1.0092
121,-0.9821799999999999
122,-0.9821799999999999
123,-0.9247700000000001
124,-0.86113
125,-0.7883100000000001
126,-0.71549
127,-0.64267
128,-0.56985
129,-0.49703
130,-0.42421000000000003
131,-0.35139000000000004
132,-0.28711
133,-0.25354
134,-0.2398
135,-0.2398
136,-0.24436
137,-0.29654
138,-0.44218
139,-0.5475399999999999
140,-0.6351100000000001
141,-0.7079300000000001
142,-0.7898
143,-0.8824799999999999
144,-1.0167
145,-1.1307
146,-1.1307
147,-1.1307
148,-1.1307
149,-1.0952
150,-1.0465
151,-0.97367
152,-0.90085
153,-0.8280299999999999
154,-0.75521
155,-0.6823899999999999
156,-0.60957
157,-0.5663699999999999
158,-0.53675
159,-0.53675
160,-0.53675
161,-0.53675
162,-0.46928000000000003
163,-0.41326999999999997
164,-0.39435
165,-0.36421
166,-0.32769000000000004
167,-0.27189
168,-0.2398
169,-0.2398
170,-0.2398
171,-0.2398
172,-0.2398
173,-0.27736
174,-0.3464
175,-0.48568999999999996
176,-0.63132
177,-0.77696
178,-0.9226
179,-1.0664
180,-1.16
181,-1.2451
182,-1.3179
183,-1.3907
184,-1.4636
185,-1.5364
186,-1.6459
187,-1.7883
188,-1.8415
189,-1.8641
190,-1.8315
191,-1.7819999999999998
192,-1.7246
193,-1.7246
194,-1.7246
195,-1.7246
196,-1.6861
197,-1.6328
198,-1.56
199,-1.4872
200,-1.4144
201,-1.3416
202,-1.2863
203,-1.2811
204,-1.2481
205,-1.1989
206,-1.1568
207,-1.1214
208,-1.0968
209,-0.98124
210,-0.8107300000000001
211,-0.46507
212,-0.23019
213,-0.10725
214,-0.01353
215,0.10450999999999999
216,0.31162
217,0.48083000000000004
218,0.62647
219,0.70707
220,0.80156
221,0.92166
222,1.1242
223,1.3651
224,1.6772
225,1.8389
226,1.8389
227,1.8943
228,1.9503
229,1.9768
230,1.9706
231,1.9427
232,1.871
233,1.7982
234,1.7254
235,1.6526
236,1.5798
237,1.5069
238,1.4341
239,1.3613
240,1.3028
241,1.2743
242,1.3471
243,1.3831
244,1.393
245,1.3934
246,1.3503
247,1.2203
248,0.9466399999999999
249,0.6330899999999999
250,0.5602699999999999
251,0.5153800000000001
252,0.5045
253,0.50258
254,0.49765
255,0.47258999999999995
256,0.42408
257,0.35788000000000003
258,0.35411
259,0.35411
260,0.35411
261,0.32478
262,0.27884000000000003
263,0.18191
264,0.068713
265,-0.065578
266,-0.091323
267,-0.10221000000000001
268,-0.16227
269,-0.2294
270,-0.30222
271,-0.35355
272,-0.38686
273,-0.38213
274,-0.33153
275,-0.26147
276,-0.24775999999999998
277,-0.2398
278,-0.2398
279,-0.2398
280,-0.24043
281,-0.24420999999999998
282,-0.28519
283,-0.35801
284,-0.43083
285,-0.48102
286,-0.4744
287,-0.42421000000000003
288,-0.35131
289,-0.27565
290,-0.17171
291,-0.026069
292,0.11957000000000001
293,0.26521
294,0.41085
295,0.54585
296,0.6711600000000001
297,0.74942
298,0.8222299999999999
299,0.89505
300,0.9317200000000001
301,0.9474299999999999
302,0.9096
303,0.8581700000000001
304,0.78535
305,0.71253
306,0.63971
307,0.56689
308,0.5221600000000001
309,0.50467
310,0.50258
311,0.4979
312,0.47946000000000005
313,0.42693000000000003
314,0.35411
