time,value
0,-0.027757999999999998
1,-0.23651
2,0.042043000000000004
3,0.081353
4,0.3364
5,0.16484000000000001
6,-0.13234
7,-0.22121999999999997
8,-0.49682
9,0.13840999999999998
10,-0.39333
11,-0.20139
12,-0.043226
13,0.029488999999999998
14,-0.064416
15,0.59829
16,0.52008
17,-0.15869
18,-0.65222
19,0.021728
20,1.4348
21,1.4348
22,1.4348
23,1.4348
24,1.4348
25,1.4348
26,1.4348
27,1.4348
28,1.4348
29,1.4348
30,1.4348
31,1.4348
32,1.4348
33,1.4348
34,1.4348
35,-1.3946
36,-1.3946
37,-1.3946
38,-1.3946
39,-1.3946
40,-1.3946
41,-1.3946
42,-1.3946
43,-1.3946
44,-1.3946
45,-1.3946
46,-1.3946
47,-1.3946
48,-1.3946
49,-0.21831
50,-0.10198
51,0.13609000000000002
52,0.024034
53,0.14145
54,-0.064532
55,0.11363
56,-0.0055506
57,-0.15959
58,-0.17849
59,0.11062999999999999
60,0.24755
61,-0.29075
62,0.29370999999999997
63,-0.057349000000000004
64,0.0028793000000000004
65,0.057027999999999995
66,0.071396
67,0.19510999999999998
68,0.32454
69,-0.17532999999999999
70,0.21106999999999998
71,-0.13552999999999998
72,0.23642
73,0.10943
74,0.47126999999999997
75,-0.31931
76,0.056739
77,-0.051373
78,-0.74031
79,0.16217
80,-0.45227
81,-0.45311999999999997
82,0.034866
83,-0.40149
84,-0.30272
85,0.19319
86,1.4348
87,1.4348
88,1.4348
89,1.4348
90,1.4348
91,1.4348
92,1.4348
93,1.4348
94,1.4348
95,1.4348
96,1.4348
97,1.4348
98,1.4348
99,1.4348
100,1.4348
101,1.4348
102,-1.3946
103,-1.3946
104,-1.3946
105,-1.3946
106,-1.3946
107,-1.3946
108,-1.3946
109,-1.3946
110,-1.3946
111,-1.3946
112,-1.3946
113,-1.3946
114,-1.3946
115,-1.3946
116,-1.3946
117,-1.3946
118,-0.66977
119,-0.075323
120,0.074215
121,-0.019485
122,-0.16136
123,0.30351
124,-0.14303
125,0.049192
126,-0.1789
127,-0.2117
