time,value
0,0.68093
1,0.45076000000000005
2,0.1176
3,-0.24505
4,-0.57018
5,-0.79171
6,-0.8969600000000001
7,-0.8976799999999999
8,-0.82381
9,-0.71383
10,-0.58812
11,-0.45707
12,-0.31986
13,-0.14682
14,0.074442
15,0.35053
16,0.66297
17,0.96014
18,1.1922
19,1.3199
20,1.2986
21,1.1218
22,0.80567
23,0.40975
24,-0.016429
25,-0.39939
26,-0.70867
27,-0.9173600000000001
28,-1.0319
29,-1.0562
30,-1.0143
31,-0.91285
32,-0.76907
33,-0.57402
34,-0.32525
35,-0.029518
36,0.29054
37,0.61027
38,0.8779600000000001
39,1.0275
40,1.0229
41,0.8498700000000001
42,0.52413
43,0.098548
44,-0.35134
45,-0.7470100000000001
46,-1.0233
47,-1.1193
48,-1.0123
49,-0.7220300000000001
50,-0.27964
51,0.25044
52,0.75815
53,1.1606
54,1.4068
55,1.45
56,1.3125
57,1.0208
58,0.6352300000000001
59,0.21438000000000001
60,-0.16671
61,-0.47167
62,-0.6937
63,-0.8579899999999999
64,-0.98134
65,-1.0969
66,-1.2161
67,-1.3094
68,-1.3351
69,-1.2466
70,-0.9925
71,-0.57463
72,-0.028301999999999997
73,0.57272
74,1.1419
75,1.5728
76,1.7912
77,1.7691
78,1.5167
79,1.0919
80,0.59604
81,0.12003
82,-0.27396
83,-0.56448
84,-0.7489
85,-0.8540700000000001
86,-0.92576
87,-0.97765
88,-0.99313
89,-0.94052
90,-0.78388
91,-0.49841
92,-0.09241
93,0.37367
94,0.83509
95,1.2042
96,1.4177
97,1.4381
98,1.2824
99,0.98869
100,0.6259899999999999
101,0.24981
102,-0.09529299999999999
103,-0.39450999999999997
104,-0.6732100000000001
105,-0.93184
106,-1.1746
107,-1.369
108,-1.4707
109,-1.4284
110,-1.2028
111,-0.81088
112,-0.29281
113,0.26776
114,0.76561
115,1.1107
116,1.2489
117,1.1942
118,0.9973
119,0.74959
120,0.5138699999999999
121,0.34961
122,0.25735
123,0.23759
124,0.21882
125,0.16025
126,0.039188
127,-0.13084
128,-0.31058
129,-0.45028999999999997
130,-0.5134
131,-0.48496999999999996
132,-0.38315
133,-0.24373000000000003
134,-0.10976
135,-0.02599
136,-0.026513
137,-0.091294
138,-0.19505999999999998
139,-0.29625999999999997
140,-0.34499
141,-0.31208
142,-0.19508
143,-0.019001
144,0.17123
145,0.33765
146,0.43906999999999996
147,0.46495
148,0.42605
149,0.34654
150,0.24825
151,0.16677
152,0.10522000000000001
153,0.071535
154,0.058012
155,0.032352
156,-0.018501
157,-0.10991
158,-0.22388000000000002
159,-0.34415999999999997
160,-0.43062
161,-0.46942
162,-0.44556
163,-0.36345
164,-0.2388
165,-0.095774
166,0.056562
167,0.20525
168,0.33983
169,0.46193
170,0.56225
171,0.6054
172,0.58411
173,0.48978
174,0.33491
175,0.14225
176,-0.041843
177,-0.16587000000000002
178,-0.20626999999999998
179,-0.15045999999999998
180,-0.035142
181,0.072482
182,0.10484
183,0.029835000000000004
184,-0.14853
185,-0.40210999999999997
186,-0.65471
187,-0.8226899999999999
188,-0.8537600000000001
189,-0.74762
190,-0.53137
191,-0.2556
192,0.018501
193,0.22205
194,0.35762
195,0.43893000000000004
196,0.47707
197,0.52049
198,0.59213
199,0.6845600000000001
200,0.7770100000000001
201,0.84154
202,0.86685
203,0.82994
204,0.73927
205,0.60932
206,0.43282
207,0.2148
208,-0.067911
209,-0.40465
210,-0.7945800000000001
211,-1.218
212,-1.6155
213,-1.9349
214,-2.0976
215,-2.0653
216,-1.7956
217,-1.2999
218,-0.62497
219,0.15893
220,0.94895
221,1.6621
222,2.2101
223,2.5524
224,2.6451
225,2.5102
226,2.2006
227,1.7603
228,1.2463
229,0.69296
230,0.14564000000000002
231,-0.3831
232,-0.88674
233,-1.3488
234,-1.7447
235,-2.0463
236,-2.2111
237,-2.1941
238,-2.0086
239,-1.6701
240,-1.2185
241,-0.71309
242,-0.20895999999999998
243,0.25403000000000003
244,0.65174
245,0.9789700000000001
246,1.2309
247,1.3992
248,1.4801
249,1.4467
250,1.2943
251,1.0429
252,0.71432
253,0.35972
254,0.045288999999999996
255,-0.18621
256,-0.31303000000000003
257,-0.3556
258,-0.33805999999999997
259,-0.30538000000000004
260,-0.27005999999999997
261,-0.25046
262,-0.22788000000000003
263,-0.18704
264,-0.14285
265,-0.10292000000000001
266,-0.10465
267,-0.18792999999999999
268,-0.35196
269,-0.5683
270,-0.7790600000000001
271,-0.90433
272,-0.8631700000000001
273,-0.63079
274,-0.22551999999999997
275,0.27355
276,0.7691600000000001
277,1.1708
278,1.4101
279,1.4725
280,1.3815
281,1.1869
282,0.95025
283,0.69594
284,0.41507
285,0.081815
286,-0.33338
287,-0.82235
288,-1.3563
289,-1.8543
290,-2.2076
291,-2.3431
292,-2.2098
293,-1.8281
294,-1.2356
295,-0.5303399999999999
296,0.18852
297,0.85761
298,1.403
299,1.8107
300,2.0657
301,2.1705
302,2.1428
303,1.9733
304,1.6954
305,1.3142
306,0.86785
307,0.4094
308,-0.035563
309,-0.43811000000000005
310,-0.81152
311,-1.1451
312,-1.4393
313,-1.679
314,-1.8230000000000002
315,-1.8567
316,-1.7305
317,-1.4525
318,-1.0381
319,-0.5425300000000001
320,-0.034099000000000004
321,0.41795
322,0.76342
323,0.9935799999999999
324,1.1054
325,1.149
326,1.1623
327,1.1518
328,1.121
329,1.0604
330,0.9587200000000001
331,0.78773
332,0.55566
333,0.2948
334,0.035198
335,-0.19832
336,-0.38626
337,-0.5602199999999999
338,-0.7578699999999999
339,-0.98518
340,-1.2542
341,-1.5299
342,-1.7457
343,-1.8181
344,-1.6813
345,-1.2852
346,-0.66075
347,0.099912
348,0.87569
349,1.5337
350,1.9879
351,2.1972
352,2.1761
353,1.9842
354,1.6851
355,1.3282
356,0.9199799999999999
357,0.46003999999999995
358,-0.066163
359,-0.67008
360,-1.3088
361,-1.8977
362,-2.3341
363,-2.5227
364,-2.3968
365,-1.9407
366,-1.2455
367,-0.43578
368,0.34704
369,0.97026
370,1.3586
371,1.501
372,1.4436
373,1.2633
374,1.0419
375,0.8435799999999999
376,0.70577
377,0.60625
378,0.51057
379,0.38542
380,0.20443
381,-0.038445
382,-0.31486
383,-0.60795
384,-0.88146
385,-1.0935
386,-1.2104
387,-1.2133
388,-1.1144
389,-0.9188700000000001
390,-0.65232
391,-0.35700000000000004
392,-0.052609
393,0.20585
394,0.40053
395,0.52488
396,0.58813
397,0.6140399999999999
398,0.6290100000000001
399,0.66737
400,0.72558
401,0.7998
402,0.86231
403,0.86819
404,0.7913899999999999
405,0.60515
406,0.30838000000000004
407,-0.07576799999999999
408,-0.5052800000000001
409,-0.90661
410,-1.2252
411,-1.4094
412,-1.4480000000000002
413,-1.3461
414,-1.1424
415,-0.88535
416,-0.60521
417,-0.33447
418,-0.057277
419,0.23478000000000002
420,0.5498
421,0.88823
422,1.2289
423,1.5269
424,1.7138
425,1.7448
426,1.5768
427,1.2127
428,0.7
429,0.13283
430,-0.39269
431,-0.81353
432,-1.0843
433,-1.199
434,-1.2033
435,-1.1656
436,-1.1281
437,-1.1281
438,-1.1418
439,-1.1146
440,-0.9974
441,-0.73459
442,-0.32111999999999996
443,0.21455
444,0.79483
445,1.3343
446,1.7182
447,1.8931
448,1.8381
449,1.5746
450,1.1495
451,0.62079
452,0.070632
453,-0.45319
454,-0.8946
455,-1.212
456,-1.3947
457,-1.4280000000000002
458,-1.34
459,-1.1472
460,-0.8858299999999999
461,-0.59607
462,-0.32194
463,-0.08189600000000001
464,0.1256
465,0.30734
466,0.47731
467,0.65489
468,0.8410700000000001
469,1.0122
470,1.1333
471,1.1609
472,1.0628
473,0.8456299999999999
474,0.52488
475,0.15754
476,-0.19351
477,-0.48381
478,-0.65537
479,-0.69965
480,-0.62459
481,-0.47006000000000003
482,-0.29008
483,-0.14400000000000002
484,-0.070772
485,-0.094
486,-0.21353000000000003
487,-0.39688
488,-0.60542
489,-0.78118
490,-0.88261
491,-0.87515
492,-0.75295
493,-0.5282899999999999
494,-0.20972
495,0.16705
496,0.57728
497,0.9688899999999999
498,1.3071
499,1.55
