time,value
0,-1.1898
1,-1.1813
2,-1.1702
3,-1.1569
4,-1.1424
5,-1.1278
6,-1.1127
7,-1.0966
8,-1.079
9,-1.0602
10,-1.0401
11,-1.0182
12,-0.99408
13,-0.9679399999999999
14,-0.94145
15,-0.9147299999999999
16,-0.8875700000000001
17,-0.8598
18,-0.83141
19,-0.80416
20,-0.77694
21,-0.74939
22,-0.72122
23,-0.69294
24,-0.66588
25,-0.63923
26,-0.6128100000000001
27,-0.58646
28,-0.56115
29,-0.53735
30,-0.51437
31,-0.49191
32,-0.46979
33,-0.44926000000000005
34,-0.42983999999999994
35,-0.41098
36,-0.39218000000000003
37,-0.37306
38,-0.35441
39,-0.33495
40,-0.31396999999999997
41,-0.29078000000000004
42,-0.26535
43,-0.23811
44,-0.2085
45,-0.17648
46,-0.14215
47,-0.10630999999999999
48,-0.069391
49,-0.031307999999999996
50,0.0078811
51,0.048108
52,0.088548
53,0.12943
54,0.17088
55,0.21297
56,0.25569000000000003
57,0.29849000000000003
58,0.34176
59,0.38535
60,0.42888999999999994
61,0.47141000000000005
62,0.51173
63,0.54901
64,0.58198
65,0.60943
66,0.6298699999999999
67,0.64288
68,0.64844
69,0.64675
70,0.63832
71,0.62321
72,0.60301
73,0.5786399999999999
74,0.55081
75,0.51984
76,0.48563999999999996
77,0.44915
78,0.41048
79,0.36964
80,0.32619000000000004
81,0.28034000000000003
82,0.23295
83,0.1844
84,0.13516
85,0.085033
86,0.035305
87,-0.013094
88,-0.059697
89,-0.10422999999999999
90,-0.14769000000000002
91,-0.18874000000000002
92,-0.22754000000000002
93,-0.26444
94,-0.30023
95,-0.33576
96,-0.37019
97,-0.40371
98,-0.43646
99,-0.46934
100,-0.50192
101,-0.53313
102,-0.56276
103,-0.59067
104,-0.61816
105,-0.64368
106,-0.6665800000000001
107,-0.6867800000000001
108,-0.7044600000000001
109,-0.72155
110,-0.73561
111,-0.74653
112,-0.75435
113,-0.7601100000000001
114,-0.7648
115,-0.76654
116,-0.76547
117,-0.76198
118,-0.75831
119,-0.75434
120,-0.7489899999999999
121,-0.74248
122,-0.7351300000000001
123,-0.72997
124,-0.72488
125,-0.7190000000000001
126,-0.71202
127,-0.70419
128,-0.6984
129,-0.69152
130,-0.68308
131,-0.67282
132,-0.66214
133,-0.65257
134,-0.64179
135,-0.6293300000000001
136,-0.61485
137,-0.6006600000000001
138,-0.58637
139,-0.57016
140,-0.55137
141,-0.52965
142,-0.50848
143,-0.48568
144,-0.46037
145,-0.43198000000000003
146,-0.40071999999999997
147,-0.3694
148,-0.3351
149,-0.29685
150,-0.25384
151,-0.20717
152,-0.15818
153,-0.10495
154,-0.047119
155,0.015316999999999999
156,0.079502
157,0.14503
158,0.21252
159,0.28178000000000003
160,0.3524
161,0.42061000000000004
162,0.48799
163,0.55515
164,0.62298
165,0.69192
166,0.7609199999999999
167,0.8330200000000001
168,0.90966
169,0.99177
170,1.0782
171,1.1673
172,1.2587
173,1.3506
174,1.4408
175,1.5258
176,1.6045
177,1.6765
178,1.7415
179,1.8001
180,1.8517
181,1.8983
182,1.9408
183,1.9797
184,2.0149
185,2.0456
186,2.0724
187,2.0948
188,2.1127
189,2.1259
190,2.1349
191,2.141
192,2.1451
193,2.1478
194,2.1489
195,2.1492
196,2.1485
197,2.1459
198,2.1401
199,2.1296
200,2.1143
201,2.0935
202,2.0667
203,2.0335
204,1.9943
205,1.9502
206,1.9017
207,1.8485
208,1.7902
209,1.7269999999999999
210,1.6591
211,1.5856
212,1.5052
213,1.4164
214,1.32
215,1.2159
216,1.1035
217,0.98274
218,0.8534700000000001
219,0.71895
220,0.58057
221,0.44001999999999997
222,0.29875999999999997
223,0.15987
224,0.027605
225,-0.09595
226,-0.20926
227,-0.31237
228,-0.40288
229,-0.48006000000000004
230,-0.54528
231,-0.60051
232,-0.6493800000000001
233,-0.6907800000000001
234,-0.72649
235,-0.75858
236,-0.7890699999999999
237,-0.81955
238,-0.8475799999999999
239,-0.87372
240,-0.89866
241,-0.9238299999999999
242,-0.94857
243,-0.9712299999999999
244,-0.99245
245,-1.0129
246,-1.0343
247,-1.0544
248,-1.0722
249,-1.088
250,-1.1023
251,-1.1168
252,-1.1285
253,-1.1378
254,-1.1456
255,-1.1531
256,-1.1611
257,-1.1674
258,-1.1723
259,-1.1765
260,-1.181
261,-1.1851
262,-1.1876
263,-1.1891
264,-1.1902
265,-1.1923
266,-1.194
267,-1.1949
268,-1.1953
269,-1.1956
