time,value
0,1.6444
1,1.3134
2,0.98546
3,0.65799
4,0.65284
5,0.33050999999999997
6,0.15464
7,0.28506
8,0.6145
9,0.38658000000000003
10,0.031923
11,-0.25127
12,-0.57304
13,-0.8271799999999999
14,-0.44677
15,-0.027214
16,0.008820399999999999
17,0.27424
18,0.62526
19,1.0237
20,1.3667
21,0.9985799999999999
22,0.6654100000000001
23,0.49678999999999995
24,0.31544
25,0.3892
26,0.69786
27,0.3151
28,-0.033838
29,-0.33938
30,-0.16455999999999998
31,0.13285
32,0.15422
33,-0.059005999999999996
34,-0.0021044
35,-0.062764
36,-0.35379
37,-0.63225
38,-0.63008
39,-0.37299
40,-0.59138
41,-0.8999
42,-1.2012
43,-1.4571
44,-1.7052
45,-1.8504
46,-1.5682
47,-1.2697
48,-0.97726
49,-0.66683
50,-0.35028000000000004
51,-0.042754
52,0.28765
53,0.6038100000000001
54,0.9426899999999999
55,1.2634
56,1.6059
57,1.9492
58,2.2719
59,2.6146
60,2.9398
61,2.6434
62,2.2979
63,1.9729
64,1.6281
65,1.3038
66,0.9605299999999999
67,0.6189100000000001
68,0.29951
69,-0.037313
70,-0.35042
71,-0.67518
72,-0.9948299999999999
73,-1.2901
74,-1.5995
75,-1.902
76,-1.8557
77,-1.6611
78,-1.3948
79,-1.1181
80,-0.75681
81,-1.1124
82,-1.3312
83,-1.1728
84,-0.94455
85,-0.7085100000000001
86,-0.8999
87,-0.72896
88,-0.44569
89,-0.13599
90,0.18387
91,-0.043958
92,-0.37638
93,-0.7551800000000001
94,-1.1387
95,-1.2718
96,-0.9870200000000001
97,-0.67132
98,-0.33032
99,-0.0074241
100,-0.08520900000000001
101,-0.41508
102,-0.4219
103,-0.19345
104,-0.039716
105,0.21894
106,0.56386
107,0.84001
108,0.57715
109,0.17421
110,-0.12869
111,-0.36896999999999996
112,-0.21552
113,-0.5549
114,-0.9333
115,-1.0286
116,-0.65304
117,-0.33534
118,0.022503
119,0.39277
120,0.26287
121,0.07471599999999999
122,0.25535
123,0.58044
124,0.6652600000000001
125,0.97551
126,1.2889
127,1.6261
