time,value
0,1.5083
1,1.5083
2,1.5083
3,1.5083
4,1.5083
5,1.5083
6,1.5083
7,1.5083
8,1.5083
9,1.5083
10,1.5083
11,1.5083
12,1.5083
13,1.5083
14,1.5083
15,1.5083
16,1.5083
17,1.5083
18,1.5083
19,1.5083
20,1.5083
21,1.5083
22,1.5083
23,1.5083
24,1.5083
25,1.5085
26,1.51
27,1.5188
28,1.5276
29,1.5364
30,1.5425
31,1.5451
32,1.5462
33,1.5462
34,1.5462
35,1.5462
36,1.5462
37,1.5462
38,1.5462
39,1.5462
40,1.5462
41,1.5462
42,1.5462
43,1.5430000000000001
44,1.5367
45,1.5287
46,1.5199
47,1.5111
48,1.5022
49,1.4934
50,1.4846
51,1.4753
52,1.4636
53,1.446
54,1.4283
55,1.4107
56,1.4006
57,1.3958
58,1.3945
59,1.3945
60,1.3945
61,1.3945
62,1.3945
63,1.3942
64,1.3923
65,1.3818
66,1.3554
67,1.3289
68,1.3025
69,1.2803
70,1.2604
71,1.2423
72,1.2247
73,1.2106
74,1.1972
75,1.1884
76,1.1791
77,1.1689
78,1.1518
79,1.1253
80,1.0989
81,1.0724
82,1.0411
83,1.008
84,0.97301
85,0.93761
86,0.8986
87,0.8586299999999999
88,0.81455
89,0.77104
90,0.72865
91,0.69414
92,0.66769
93,0.6412399999999999
94,0.61479
95,0.59375
96,0.57406
97,0.55633
98,0.5387
99,0.5210600000000001
100,0.50343
101,0.4858
102,0.46856000000000003
103,0.45188999999999996
104,0.43966000000000005
105,0.43083999999999995
106,0.42203
107,0.41321
108,0.39241
109,0.36973
110,0.34328000000000003
111,0.31542
112,0.281
113,0.2434
114,0.19932
115,0.15366
116,0.10630999999999999
117,0.21941999999999998
118,-0.13325
119,-0.48591999999999996
120,-0.16735999999999998
121,-0.21811999999999998
122,-0.26711999999999997
123,-0.31121
124,-0.3492
125,-0.36865
126,-0.37679
127,-0.36796999999999996
128,-0.35781999999999997
129,-0.34659
130,-0.32461
131,-0.29816
132,-0.27171
133,-0.2456
134,-0.24765
135,-0.25082
136,-0.25964
137,-0.27785
138,-0.31626
139,-0.36978
140,-0.44032
141,-0.51168
142,-0.58354
143,-0.66122
144,-0.74057
145,-0.8199200000000001
146,-0.8974799999999999
147,-0.95509
148,-1.0116
149,-1.0645
150,-1.1123
151,-1.1522
152,-1.1848
153,-1.2112
154,-1.2357
155,-1.2592
156,-1.2703
157,-1.2791
158,-1.2879
159,-1.2967
160,-1.3056
161,-1.3144
162,-1.3232
163,-1.3341
164,-1.3473
165,-1.3633
166,-1.3809
167,-1.3962
168,-1.4106
169,-1.4118
170,-1.4118
171,-1.4118
172,-1.4018
173,-1.3569
174,-1.3089
175,-1.256
176,-1.2201
177,-1.1994
178,-1.1988
179,-1.2076
180,-1.215
181,-1.2221
182,-1.2222
183,-1.2222
184,-1.2222
185,-1.2267
186,-1.2419
187,-1.2582
188,-1.2758
189,-1.2793
190,-1.2734
191,-1.2521
192,-1.2256
193,-1.2041
194,-1.1843
195,-1.1843
196,-1.1843
197,-1.1843
198,-1.1843
199,-1.1843
200,-1.1843
201,-1.1843
202,-1.1811
203,-1.1762
204,-1.1681
205,-1.1593
206,-1.1467
207,-1.1322
208,-1.1058
209,-1.0793
210,-1.0529
211,-1.0264
212,-0.9999899999999999
213,-0.97354
214,-0.94709
215,-0.9243100000000001
216,-0.9028200000000001
217,-0.8847700000000001
218,-0.8671399999999999
219,-0.84951
220,-0.8318700000000001
221,-0.81424
222,-0.79661
223,-0.7789699999999999
224,-0.76134
225,-0.74371
226,-0.72607
227,-0.70844
228,-0.6866899999999999
229,-0.66398
230,-0.63767
231,-0.61147
232,-0.58719
233,-0.56472
234,-0.54708
235,-0.52945
236,-0.5118199999999999
237,-0.48951999999999996
238,-0.46379
239,-0.43754
240,-0.41108999999999996
241,-0.38464
242,-0.35819
243,-0.33174000000000003
244,-0.30615
245,-0.28429
246,-0.26688
247,-0.25806
248,-0.24925
249,-0.24043
250,-0.23693000000000003
251,-0.23633
252,-0.2362
253,-0.2362
254,-0.2362
255,-0.2362
256,-0.2362
257,-0.2362
258,-0.2362
259,-0.2362
260,-0.2362
261,-0.2362
262,-0.2362
263,-0.2362
264,-0.2362
265,-0.2362
266,-0.23633
267,-0.24176999999999998
268,-0.2478
269,-0.25661999999999996
270,-0.26543
271,-0.27425
272,-0.28307
273,-0.29188000000000003
274,-0.3007
275,-0.30951999999999996
276,-0.31833
277,-0.32715
278,-0.33597
279,-0.34426
280,-0.34752
281,-0.34998
282,-0.34998
283,-0.35104
284,-0.3537
285,-0.35975999999999997
286,-0.36858
287,-0.37739
288,-0.38621
289,-0.39503
290,-0.40384000000000003
291,-0.41266
292,-0.42148
293,-0.43028999999999995
294,-0.43911000000000006
295,-0.44793
296,-0.45674
297,-0.46556000000000003
298,-0.47438
299,-0.48318999999999995
300,-0.49201000000000006
301,-0.50083
302,-0.50156
303,-0.50167
304,-0.50167
305,-0.50167
306,-0.50167
307,-0.50167
308,-0.50167
309,-0.50167
310,-0.50167
311,-0.50167
312,-0.50167
313,-0.50167
314,-0.50167
315,-0.99311
316,-0.99311
317,-0.99311
318,-0.99311
319,-0.99311
320,-0.99311
321,-0.99311
322,-0.99311
323,-0.99311
324,-0.99311
325,-0.99311
326,-0.99311
327,-0.99311
328,-0.99311
329,-0.99311
330,-0.99311
331,-0.99311
332,-0.99311
333,-0.99311
334,-0.99311
335,-0.99311
336,-0.99311
337,-0.99311
338,-0.99311
339,-0.99311
340,-0.99218
341,-0.9865
342,-0.95201
343,-0.91753
344,-0.8830399999999999
345,-0.8593299999999999
346,-0.84893
347,-0.84478
348,-0.84478
349,-0.84478
350,-0.84478
351,-0.84478
352,-0.84478
353,-0.84478
354,-0.84478
355,-0.84478
356,-0.84478
357,-0.84478
358,-0.83206
359,-0.8075
360,-0.77628
361,-0.74179
362,-0.70005
363,-0.65674
364,-0.5996
365,-0.5422100000000001
366,-0.48536
367,-0.43158
368,-0.3856
369,-0.33962
370,-0.29364
371,-0.24766
372,-0.20168
373,-0.1557
374,-0.10972
375,-0.32048000000000004
376,-0.09057899999999999
377,0.13932
378,0.36923
379,0.12018
380,0.16616
381,0.21214
382,0.25811999999999996
383,0.3041
384,0.34448
385,0.38195999999999997
386,0.41701000000000005
387,0.45148999999999995
388,0.49509
389,0.54062
390,0.59809
391,0.65582
392,0.71424
393,0.77713
394,0.8461
395,0.91507
396,0.9840399999999999
397,1.0467
398,1.107
399,1.1648
400,1.2221
401,1.2747
402,1.3261
403,1.3719999999999999
404,1.4173
405,1.4609999999999999
406,1.4946
407,1.5175
408,1.5405
409,1.5635
410,1.5865
411,1.6095
412,1.6325
413,1.655
414,1.6729
415,1.6892
416,1.7007
417,1.7117
418,1.7219
419,1.7263
420,1.7263
421,1.7263
422,1.7263
423,1.742
424,1.76
425,1.7830000000000001
426,1.8051
427,1.8229
428,1.8386
429,1.8501
430,1.8616
431,1.8731
432,1.8846
433,1.8961
434,1.9076
435,1.9191
436,1.922
437,1.9241
438,1.9241
439,1.9215
440,1.9108
441,1.8951
442,1.8722
443,1.8492
444,1.8262
445,1.8032
446,1.7802
447,1.7572
448,1.7342
449,1.7112
450,1.6882
451,1.6652
452,1.6440000000000001
453,1.6265
454,1.6119
455,1.6004
456,1.5856
457,1.5689
458,1.5295
459,1.4835
460,1.4375
461,1.3916
462,1.3456
463,1.2996
464,1.2536
465,1.2054
466,1.1538
467,1.099
468,1.0415
469,0.98536
470,0.9297700000000001
471,0.8823200000000001
472,0.83634
473,0.7903600000000001
474,0.7429100000000001
475,0.6873199999999999
476,0.63116
477,0.5736899999999999
478,0.52156
479,0.47573000000000004
480,0.43685
481,0.40236
482,0.36788000000000004
483,0.33339
484,0.29891
485,0.26442
486,0.22994
487,0.19763
488,0.17290999999999998
489,0.14884
490,0.12585
491,0.10286
492,0.39757
493,0.28262
494,0.16767
495,0.052716
496,-0.062235000000000006
497,-0.17719000000000001
498,-0.29214
499,-0.40709
500,-0.10405
501,-0.12704000000000001
502,-0.15003
503,-0.17302
504,-0.19601
505,-0.21899999999999997
506,-0.24199
507,-0.26498
508,-0.28797
509,-0.31096
510,-0.33395
511,-0.35694000000000004
512,-0.37993000000000005
513,-0.39925
514,-0.41216
515,-0.42433999999999994
516,-0.43583999999999995
517,-0.44733
518,-0.45883
519,-0.47031999999999996
520,-0.48181999999999997
521,-0.49331
522,-0.50481
523,-0.5163
524,-0.5278
525,-0.5392899999999999
526,-0.55524
527,-0.57697
528,-0.59944
529,-0.62243
530,-0.64064
531,-0.65717
532,-0.6692
533,-0.68082
534,-0.69499
535,-0.7109300000000001
536,-0.73392
537,-0.7569100000000001
538,-0.7799
539,-0.79238
540,-0.7945800000000001
541,-0.79533
542,-0.79533
543,-0.79533
544,-0.79533
545,-0.79533
546,-0.79533
547,-0.79533
548,-0.79533
549,-0.79533
550,-0.79533
551,-0.79533
552,-0.79533
553,-0.79533
554,-0.79533
555,-0.79533
556,-0.7893600000000001
557,-0.78242
558,-0.77093
559,-0.76056
560,-0.7550399999999999
561,-0.75534
562,-0.76683
563,-0.77833
564,-0.78982
565,-0.80132
566,-0.81281
567,-0.82431
568,-0.8358
569,-0.8473
570,-0.8587899999999999
571,-0.87029
572,-0.88097
573,-0.88931
574,-0.8942200000000001
575,-0.8942200000000001
576,-0.8942200000000001
577,-0.8942200000000001
578,-0.90202
579,-0.9128799999999999
580,-0.9243
581,-0.93579
582,-0.94729
583,-0.95878
584,-0.9702799999999999
585,-0.97959
586,-0.9844799999999999
587,-0.98146
588,-0.96996
589,-0.95847
590,-0.9469700000000001
591,-0.93548
592,-0.9239799999999999
593,-0.9124899999999999
594,-0.90031
595,-0.8815700000000001
596,-0.8617799999999999
597,-0.8387899999999999
598,-0.8158
599,-0.79281
600,-0.76982
601,-0.74683
602,-0.7238399999999999
603,-0.70085
604,-0.67786
605,-0.65487
606,-0.63188
607,-0.61133
608,-0.60314
609,-0.59755
610,-0.59755
611,-0.59585
612,-0.59223
613,-0.5837
614,-0.5722
615,-0.56071
616,-0.5492100000000001
617,-0.54825
618,-0.54811
619,-0.54811
620,-0.54811
621,-0.54811
622,-0.54811
623,-0.54811
624,-0.54811
625,-0.54811
626,-0.54811
627,-0.54811
628,-0.54811
629,-0.54811
630,-1.1887
631,-1.1887
632,-1.1887
633,-1.1887
634,-1.1887
635,-1.1887
636,-1.1887
637,-1.1887
638,-1.1887
639,-1.1887
640,-1.1887
641,-1.1887
642,-1.1887
643,-1.1887
644,-1.1887
645,-1.1887
646,-1.1887
647,-1.1887
648,-1.1887
649,-1.1887
650,-1.1887
651,-1.1887
652,-1.1887
653,-1.1887
654,-1.1887
655,-1.1911
656,-1.2056
657,-1.2939
658,-1.3822
659,-1.4704
660,-1.5311
661,-1.5577
662,-1.5684
663,-1.5684
664,-1.5684
665,-1.5684
666,-1.5684
667,-1.5684
668,-1.5684
669,-1.5684
670,-1.5684
671,-1.5684
672,-1.5684
673,-1.5846
674,-1.6161
675,-1.656
676,-1.7002
677,-1.7164
678,-1.7267
679,-1.6838
680,-1.6391
681,-1.5901
682,-1.5176
683,-1.3852
684,-1.2528
685,-1.1204
686,-0.9691299999999999
687,-0.8047
688,-0.63129
689,-0.45476000000000005
690,-0.29391
691,-0.13616
692,-0.13982
693,0.12743
694,0.25378
695,0.35111
696,0.39524000000000004
697,0.43938
698,0.48351000000000005
699,0.50613
700,0.51762
701,0.51978
702,0.51978
703,0.50229
704,0.48108999999999996
705,0.43696
706,0.39381
707,0.3533
708,0.32995
709,0.32995
710,0.32995
711,0.32995
712,0.32995
713,0.32995
714,0.32995
715,0.33061
716,0.34935
717,0.37287
718,0.41701000000000005
719,0.4597
720,0.4996
721,0.51978
722,0.51978
723,0.51978
724,0.51978
725,0.4927
726,0.45883999999999997
727,0.41518999999999995
728,0.37106
729,0.32693
730,0.2828
731,0.23865999999999998
732,0.19652
733,0.15723
734,0.14012
735,0.14012
736,0.14012
737,0.14012
738,0.14012
739,0.14012
740,0.14012
741,0.1366
742,0.11665
743,0.44188999999999995
744,0.22123
745,0.048285
746,-0.2201
747,-0.44076000000000004
748,-0.13193
749,-0.17606
750,-0.2202
751,-0.29733000000000004
752,-0.37738
753,-0.46565
754,-0.55391
755,-0.64218
756,-0.73044
757,-0.81871
758,-0.90697
759,-0.99524
760,-1.0835
761,-1.1718
762,-1.26
763,-1.3475
764,-1.3644
765,-1.3785
766,-1.3785
767,-1.3584
768,-1.2949
769,-1.199
770,-1.0666
771,-0.9258799999999999
772,-0.7801899999999999
773,-0.57628
774,-0.35562
775,-0.13495
776,0.3969
777,0.22785
778,0.37227
779,0.50467
780,0.6117199999999999
781,0.67882
782,0.7096100000000001
783,0.7096100000000001
784,0.6945100000000001
785,0.67274
786,0.5572600000000001
787,0.42486999999999997
788,0.29247
789,0.16007000000000002
790,0.13659000000000002
791,-0.10472000000000001
792,-0.23711999999999997
793,-0.34899
794,-0.43665
795,-0.49768999999999997
796,-0.54182
797,-0.57393
798,-0.60235
799,-0.56419
800,-0.5200600000000001
801,-0.47591999999999995
802,-0.42341000000000006
803,-0.3418
804,-0.25768
805,-0.16940999999999998
806,-0.40751
807,0.22291
808,0.47513999999999995
809,0.18365
810,0.25777
811,0.32911
812,0.32995
813,0.32995
814,0.32995
815,0.31875
816,0.28065999999999997
817,0.23986999999999997
818,0.19574
819,0.10917
820,-0.20431
821,-0.16699
822,-0.34352
823,-0.50363
824,-0.65789
825,-0.74616
826,-0.8344299999999999
827,-0.92269
828,-0.99685
829,-1.0464
830,-1.0932
831,-1.1373
832,-1.1166
833,-1.064
834,-0.9456600000000001
835,-0.8132699999999999
836,-0.67142
837,-0.52489
838,-0.34836
839,-0.17182999999999998
840,0.14231
841,0.19834000000000002
842,0.41416000000000003
843,0.63283
844,0.8535
845,1.0558
846,1.2517
847,1.4302
848,1.6058
849,1.7618
850,1.9042
851,1.9925
852,2.0807
853,2.169
854,2.2371
855,2.2855
856,2.331
857,2.3752
858,2.3369
859,2.2794
860,2.1497
861,2.016
862,1.8727
863,1.7204
864,1.5439
865,1.3674
866,1.1908
867,1.0377
868,0.90164
869,0.76826
870,0.6358600000000001
871,0.57227
872,0.51978
873,0.51978
874,0.52194
875,0.5334300000000001
876,0.55606
877,0.60019
878,0.64432
879,0.68845
880,0.73259
881,0.77672
882,0.82085
883,0.86498
884,0.8837700000000001
885,0.89944
886,0.89944
887,0.9025700000000001
888,0.91466
889,0.93995
890,0.98408
891,1.0282
892,1.0723
893,1.0865
894,1.089
895,1.0893
896,1.0912
897,1.1728
898,1.2634
899,1.3958
900,1.5198
901,1.6268
902,1.7035
903,1.7476
904,1.7918
905,1.8359
906,1.8133
907,1.7728
908,1.7289
909,1.6821
910,1.6102
911,1.5342
912,1.446
913,1.3524
914,1.2508
915,1.1322
916,0.9998
917,0.8674
918,0.735
919,0.6026100000000001
920,0.47021
921,0.33781
922,0.21009
923,0.10611
924,0.22291
925,-0.40751
926,-0.16287000000000001
927,-0.23723000000000002
928,-0.29274
929,-0.33688
930,-0.38101
931,-0.42513999999999996
932,-0.38836
933,-0.34534000000000004
934,-0.30121
935,-0.2639
936,-0.24879
937,-0.23954
938,-0.23954
939,-0.23169
940,-0.21718
941,-0.18211
942,-0.13798
943,-0.47098999999999996
944,-0.25033
