time,value
0,-0.8703700000000001
1,-0.63217
2,-0.42844
3,-0.28289000000000003
4,-0.18686
5,-0.12932000000000002
6,-0.081012
7,-0.0080824
8,0.09878200000000001
9,0.24753000000000003
10,0.43259
11,0.63388
12,0.8332299999999999
13,1.0068
14,1.1275
15,1.1691
16,1.1176
17,0.9802200000000001
18,0.76155
19,0.48071
20,0.17153
21,-0.13144
22,-0.39794
23,-0.60459
24,-0.7381
25,-0.8031699999999999
26,-0.8045399999999999
27,-0.75618
28,-0.66038
29,-0.50997
30,-0.30888000000000004
31,-0.064068
32,0.20314000000000002
33,0.45833
34,0.65291
35,0.7421
36,0.69989
37,0.51977
38,0.22858
39,-0.11864000000000001
40,-0.45675
41,-0.7376699999999999
42,-0.91625
43,-0.98172
44,-0.9424399999999999
45,-0.816
46,-0.6197199999999999
47,-0.37724
48,-0.10587
49,0.18633
50,0.49388000000000004
51,0.79623
52,1.0621
53,1.2518
54,1.328
55,1.2634
56,1.0558
57,0.7301300000000001
58,0.31643000000000004
59,-0.12140999999999999
60,-0.51266
61,-0.8015899999999999
62,-0.96673
63,-0.99344
64,-0.89576
65,-0.70513
66,-0.46795
67,-0.22528
68,-0.0011455
69,0.18220999999999998
70,0.30791999999999997
71,0.37116
72,0.38008000000000003
73,0.3473
74,0.28818
75,0.22426
76,0.16602999999999998
77,0.11622
78,0.073362
79,0.033269
80,-0.019022999999999998
81,-0.09010599999999999
82,-0.1828
83,-0.29420999999999997
84,-0.41513999999999995
85,-0.52241
86,-0.59085
87,-0.5895699999999999
88,-0.49768999999999997
89,-0.30783
90,-0.036579
91,0.27292
92,0.58301
93,0.8477
94,1.0136
95,1.0465
96,0.93909
97,0.70518
98,0.37601
99,-0.007110300000000001
100,-0.39563000000000004
101,-0.7451399999999999
102,-1.021
103,-1.1804
104,-1.205
105,-1.0998
106,-0.86544
107,-0.51493
108,-0.08757899999999999
109,0.3777
110,0.83037
111,1.2124
112,1.4752
113,1.5746
114,1.4847
115,1.2025
116,0.7576
117,0.19823
118,-0.41202
119,-1.0009
120,-1.4931
121,-1.8238
122,-1.9544
123,-1.8798
124,-1.6057
125,-1.1745
126,-0.6411399999999999
127,-0.063485
128,0.50874
129,1.0169
130,1.4195
131,1.6911
132,1.8129
133,1.7739
134,1.5716
135,1.2278
136,0.78264
137,0.28574
138,-0.19898
139,-0.60675
140,-0.89304
141,-1.0403
142,-1.0559
143,-0.9725600000000001
144,-0.8382
145,-0.6917800000000001
146,-0.5583
147,-0.4582
148,-0.37393000000000004
149,-0.28071999999999997
150,-0.15789
151,0.00096053
152,0.17583
153,0.3285
154,0.42646000000000006
155,0.44593
156,0.38197
157,0.25805
158,0.11314
159,0.006298699999999999
160,-0.024927
161,0.022695
162,0.14265999999999998
163,0.30346999999999996
164,0.45361999999999997
165,0.55535
166,0.5895600000000001
167,0.54786
168,0.44443999999999995
169,0.29658
170,0.11682000000000001
171,-0.08090399999999999
172,-0.29368
173,-0.51527
174,-0.7359
175,-0.93814
176,-1.0982
177,-1.1845
178,-1.1645
179,-1.0394
180,-0.81952
181,-0.53565
182,-0.23119
183,0.048017000000000004
184,0.28799
185,0.49118999999999996
186,0.67455
187,0.8655
188,1.0861
189,1.3337
190,1.5719
191,1.7578
192,1.8242
193,1.7076
194,1.3727
195,0.83215
196,0.1318
197,-0.66283
198,-1.4575
199,-2.1549
200,-2.6892
201,-2.9973
202,-3.0461
203,-2.8304
204,-2.3694
205,-1.6943
206,-0.84739
207,0.1069
208,1.0783
209,1.9672
210,2.6692
211,3.0961
212,3.1887
213,2.9352
214,2.379
215,1.6178
216,0.77228
217,-0.028854
218,-0.68519
219,-1.1381
220,-1.3858
221,-1.4683
222,-1.4479
223,-1.3837
224,-1.3154
225,-1.2613
226,-1.1999
227,-1.1025
228,-0.94401
229,-0.70891
230,-0.39864
231,-0.045798
232,0.3092
233,0.6281
234,0.88523
235,1.0713
236,1.1859
237,1.2397
238,1.2371
239,1.1806
240,1.0575
241,0.85705
242,0.57445
243,0.2199
244,-0.17445
245,-0.55611
246,-0.8764799999999999
247,-1.091
248,-1.1621
249,-1.0847
250,-0.88185
251,-0.59596
252,-0.2892
253,-0.01927
254,0.17499
255,0.27301
256,0.28212
257,0.22981999999999997
258,0.13883
259,0.036844999999999996
260,-0.055514
261,-0.12949000000000002
262,-0.17705
263,-0.1937
264,-0.16987
265,-0.086272
266,0.066596
267,0.28508
268,0.56066
269,0.8523
270,1.0948
271,1.2256
272,1.1943
273,0.9739700000000001
274,0.57905
275,0.05516
276,-0.52193
277,-1.0681
278,-1.5074
279,-1.7912
280,-1.8965
281,-1.8356
282,-1.6273
283,-1.3073
284,-0.8894
285,-0.4039
286,0.11825
287,0.66506
288,1.2048
289,1.685
290,2.0596
291,2.2779
292,2.2846
293,2.0639
294,1.6343
295,1.0399
296,0.33899999999999997
297,-0.38845
298,-1.0551
299,-1.5906
300,-1.9513
301,-2.1084
302,-2.0758
303,-1.8812
304,-1.5579
305,-1.1625
306,-0.7392
307,-0.32493
308,0.050579
309,0.37596999999999997
310,0.64858
311,0.8638299999999999
312,1.0252
313,1.1402
314,1.2098
315,1.2414
316,1.2356
317,1.1909999999999998
318,1.1026
319,0.95842
320,0.7485
321,0.46363999999999994
322,0.11222
323,-0.2857
324,-0.6924899999999999
325,-1.0553
326,-1.3283
327,-1.4785
328,-1.4881
329,-1.3655
330,-1.1492
331,-0.8775799999999999
332,-0.58663
333,-0.30017
334,-0.026860000000000002
335,0.23613
336,0.4802
337,0.69613
338,0.85449
339,0.9272299999999999
340,0.89284
341,0.74395
342,0.50757
343,0.24015999999999998
344,0.0042377
345,-0.13832
346,-0.15902
347,-0.06930499999999999
348,0.07862999999999999
349,0.22678
350,0.31204
351,0.28764
352,0.15022
353,-0.067713
354,-0.31521
355,-0.53759
356,-0.6956100000000001
357,-0.77995
358,-0.80687
359,-0.79099
360,-0.7357100000000001
361,-0.64055
362,-0.48652
363,-0.24331999999999998
364,0.10065
365,0.52837
366,0.98762
367,1.4089
368,1.725
369,1.8656
370,1.7981
371,1.5331
372,1.1111
373,0.59511
374,0.047587
375,-0.47292
376,-0.93021
377,-1.3072
378,-1.5959
379,-1.7925
380,-1.8976
381,-1.8938
382,-1.7763
383,-1.5593
384,-1.2429999999999999
385,-0.85534
386,-0.42445
387,0.024480000000000002
388,0.46056
389,0.85569
390,1.2035
391,1.4897
392,1.6961
393,1.8123
394,1.8223
395,1.7103
396,1.4602
397,1.0841
398,0.62759
399,0.13423
400,-0.33813000000000004
401,-0.72933
402,-1.0046
403,-1.1455
404,-1.1668
405,-1.0972
406,-0.9565299999999999
407,-0.77299
408,-0.56838
409,-0.35620999999999997
410,-0.14175
411,0.05727
412,0.23376
413,0.37159000000000003
414,0.45974
415,0.48728999999999995
416,0.45273
417,0.36738000000000004
418,0.24023000000000003
419,0.082427
420,-0.087779
421,-0.26111
422,-0.41903999999999997
423,-0.54325
424,-0.6229399999999999
425,-0.63281
426,-0.55513
427,-0.38183
428,-0.13135
429,0.15838
430,0.44106000000000006
431,0.6831
432,0.84446
433,0.90294
434,0.8538
435,0.7108399999999999
436,0.48707
437,0.20978000000000002
438,-0.10006
439,-0.4159
440,-0.71824
441,-0.97152
442,-1.1231
443,-1.1272
444,-0.9576100000000001
445,-0.61252
446,-0.11835
447,0.45545
448,1.0154
449,1.4655
450,1.7158
451,1.7076
452,1.4424
453,0.9690700000000001
454,0.36122
455,-0.28723000000000004
456,-0.8736200000000001
457,-1.3259999999999998
458,-1.5953
459,-1.6648
460,-1.5505
461,-1.3061
462,-0.98067
463,-0.61306
464,-0.2518
465,0.066625
466,0.33348
467,0.54887
468,0.72153
469,0.8546600000000001
470,0.96147
471,1.0477
472,1.1021
473,1.1157
474,1.0542
475,0.91832
476,0.6957399999999999
477,0.40059
478,0.05267
479,-0.3132
480,-0.64915
481,-0.91917
482,-1.1053
483,-1.1928
484,-1.1733
485,-1.063
486,-0.8836799999999999
487,-0.6554300000000001
488,-0.39896
489,-0.14937
490,0.077774
491,0.2639
492,0.3935
493,0.47638
494,0.5193399999999999
495,0.52975
496,0.5163
497,0.48846999999999996
498,0.45082
499,0.3872
