time,value
0,0.0236
1,0.60632
2,1.2645
3,1.9292
4,2.5245
5,2.9796
6,3.2416
7,3.2838
8,3.1112
9,2.7585
10,2.2841
11,1.7595
12,1.2574
13,0.8389200000000001
14,0.54545
15,0.39307
16,0.37278
17,0.45505
18,0.59755
19,0.7544
20,0.88494
21,0.9602799999999999
22,0.9666600000000001
23,0.90535
24,0.78962
25,0.63975
26,0.4776
27,0.32184
28,0.18483
29,0.071534
30,-0.019524
31,-0.094046
32,-0.15911
33,-0.22058000000000003
34,-0.28144
35,-0.34129
36,-0.397
37,-0.44414
38,-0.4787
39,-0.49845
40,-0.50379
41,-0.49776000000000004
42,-0.48518999999999995
43,-0.47158
44,-0.46174
45,-0.45874
46,-0.4634
47,-0.47443
48,-0.48901000000000006
49,-0.50378
50,-0.51578
51,-0.5231899999999999
52,-0.52566
53,-0.52425
54,-0.52089
55,-0.51778
56,-0.51676
57,-0.51881
58,-0.52373
59,-0.53045
60,-0.53741
61,-0.54308
62,-0.54647
63,-0.54761
64,-0.5465899999999999
65,-0.5448
66,-0.54394
67,-0.54565
68,-0.55102
69,-0.5621
70,-0.57552
71,-0.59
72,-0.60423
73,-0.61692
74,-0.62695
75,-0.6343
76,-0.63783
77,-0.63763
78,-0.63474
79,-0.6306
80,-0.62675
81,-0.62498
82,-0.6258100000000001
83,-0.62921
84,-0.6351100000000001
85,-0.6430600000000001
86,-0.6523
87,-0.66223
88,-0.67188
89,-0.67988
90,-0.68579
91,-0.6894100000000001
92,-0.6906899999999999
93,-0.68971
94,-0.68661
95,-0.68107
96,-0.6732899999999999
97,-0.66379
98,-0.6534399999999999
