time,value
0,0.31925
1,-0.3765
2,0.10734
3,-0.16914
4,-0.082227
5,0.09705
6,-0.27093
7,0.26611
8,-0.23624
9,-0.51956
10,0.22326999999999997
11,0.14347000000000001
12,-0.0015260999999999999
13,0.018559
14,0.076907
15,0.48868999999999996
16,-0.50436
17,0.07638099999999999
18,0.23999
19,0.035601
20,-0.56809
21,-0.11319000000000001
22,0.31851999999999997
23,-0.23956
24,-0.5765100000000001
25,-0.13927
26,0.12514
27,0.17611
28,0.18095
29,0.43653000000000003
30,0.052653
31,0.0025120999999999997
32,-0.6025699999999999
33,0.26871999999999996
34,0.26865
35,0.035093
36,0.008392499999999999
37,-0.30596999999999996
38,0.16869
39,-0.5526
40,0.5432
41,0.26297
42,0.16788
43,-0.49691
44,-0.029414999999999997
45,-0.023032
46,-0.016836
47,0.7528600000000001
48,-0.23774
49,-0.18894
50,0.10842
51,-0.08748099999999999
52,-0.92038
53,-0.0038298000000000004
54,0.12842
55,0.7432300000000001
56,-0.40944
57,0.026869999999999998
58,0.29136999999999996
59,-1.7006
60,-1.7006
61,-1.7006
62,-1.7006
63,-1.7006
64,-1.7006
65,-1.7006
66,-1.7006
67,-1.7006
68,1.7
69,1.7
70,1.7
71,1.7
72,1.7
73,1.7
74,1.7
75,1.7
76,0.4483
77,-0.31061
78,-0.44873
79,-0.053360000000000005
80,-0.06905399999999999
81,-0.4783
82,-0.058119000000000004
83,-0.52213
84,0.39971
85,-0.74588
86,0.36066
87,-0.077081
88,-0.3147
89,0.34825
90,-0.11915999999999999
91,1.7
92,1.7
93,1.7
94,1.7
95,1.7
96,1.7
97,1.7
98,1.7
99,1.7
100,1.7
101,1.7
102,1.7
103,-1.7006
104,-1.7006
105,-1.7006
106,-1.7006
107,-1.7006
108,-1.7006
109,-1.7006
110,-1.7006
111,-1.7006
112,-1.7006
113,-1.7006
114,0.18532
115,-0.18444000000000002
116,-0.7056
117,0.16791
118,0.7042
119,0.37998000000000004
120,-0.035726
121,0.16482
122,0.86136
123,0.20735
124,-0.35404
125,0.14569000000000001
126,0.7733899999999999
127,-0.14382
