time,value
0,2.0755
1,1.9456
2,1.7733
3,1.5779
4,1.475
5,1.3137
6,1.15
7,1.0215
8,0.90304
9,0.71682
10,0.6039899999999999
11,0.44823
12,0.33739
13,0.24827
14,0.13824
15,0.012208
16,-0.07334299999999999
17,-0.17645
18,-0.23179
19,-0.28265999999999997
20,-0.34391
21,-0.46567
22,-0.48071
23,-0.5387
24,-0.62236
25,-0.68145
26,-0.73897
27,-0.7813100000000001
28,-0.8893700000000001
29,-0.90305
30,-0.90031
31,-0.9701200000000001
32,-0.9787299999999999
33,-1.0115
34,-0.99741
35,-1.0362
36,-1.054
37,-1.0339
38,-1.0845
39,-1.1327
40,-1.097
41,-1.0941
42,-1.0654
43,-0.95457
44,-0.84386
45,-0.73042
46,-0.59344
47,-0.51283
48,-0.44432
49,-0.32871999999999996
50,-0.19579000000000002
51,-0.12939
52,0.031468
53,0.12085
54,0.21916
55,0.28899
56,0.52399
57,0.7406
58,0.99918
59,1.2578
60,1.4744
61,1.7262
62,1.9605
63,2.1768
64,2.2571
65,2.0708
66,1.8205
67,1.5707
68,1.3539
69,1.0956
70,0.82852
71,0.6117600000000001
72,0.36221
73,0.09500399999999999
74,0.019625
75,-0.12519
76,-0.29453
77,-0.40681
78,-0.5384899999999999
79,-0.64804
80,-0.6998800000000001
81,-0.7904100000000001
82,-0.8594200000000001
83,-0.9103700000000001
84,-1.0058
85,-1.1551
86,-1.1976
87,-1.2453
88,-1.2734
89,-1.2278
90,-1.2179
91,-1.1806
92,-1.1347
93,-1.0702
94,-1.1163
95,-1.1047
96,-1.0759
97,-1.0391
98,-0.9798899999999999
99,-0.86485
100,-0.79196
101,-0.73042
102,-0.69119
103,-0.65771
104,-0.65685
105,-0.5683
106,-0.46216999999999997
107,-0.37847
108,-0.27852
109,-0.19676
110,-0.12805
111,-0.0088053
112,0.089162
113,0.12484
114,0.17895
115,0.27844
116,0.4564
117,0.61737
118,0.68675
119,0.81181
120,1.0013
121,1.1063
122,1.1804
123,1.3072
124,1.5282
125,1.5892
126,1.7811
127,2.0268
