time,value
0,-0.37058
1,-0.37058
2,-0.37058
3,-0.37058
4,-0.37058
5,-0.37058
6,-0.37058
7,-0.37058
8,-0.37058
9,-0.37058
10,-0.37058
11,-0.37058
12,-0.37058
13,-0.37058
14,-0.37058
15,-0.37058
16,-0.37058
17,-0.37058
18,-0.37058
19,-0.37058
20,-0.37058
21,-0.37058
22,-0.37058
23,-0.37058
24,-0.37058
25,-0.37058
26,-0.37058
27,-0.37058
28,-0.37058
29,-0.37058
30,-0.37058
31,-0.37058
32,-0.37058
33,-0.37058
34,-0.37058
35,-0.37058
36,-0.37058
37,-0.37058
38,-0.37058
39,-0.37058
40,-0.37058
41,-0.37058
42,-0.37058
43,-0.37058
44,-0.37058
45,-0.37058
46,-0.37058
47,-0.37058
48,-0.37058
49,-0.37058
50,-0.37058
51,-0.37058
52,-0.37058
53,-0.37058
54,-0.37058
55,-0.37058
56,-0.37058
57,-0.37058
58,-0.37058
59,-0.37058
60,-0.37058
61,-0.37058
62,-0.37058
63,-0.37058
64,-0.37058
65,-0.37058
66,-0.37058
67,-0.37058
68,-0.37058
69,-0.37058
70,-0.37058
71,-0.37058
72,-0.37058
73,-0.37058
74,-0.37058
75,-0.37058
76,-0.37058
77,-0.37058
78,-0.37058
79,-0.37058
80,-0.37058
81,-0.37058
82,-0.37058
83,-0.37058
84,-0.37058
85,-0.37058
86,-0.37058
87,-0.37058
88,-0.37058
89,-0.37058
90,-0.37058
91,-0.37058
92,-0.37058
93,-0.37058
94,-0.37058
95,-0.37058
96,-0.37058
97,-0.37058
98,-0.37058
99,-0.37058
100,-0.37058
101,-0.37058
102,-0.37058
103,-0.37058
104,-0.37058
105,-0.37058
106,-0.37058
107,-0.37058
108,-0.37058
109,-0.37058
110,-0.37058
111,-0.37058
112,-0.37058
113,-0.37058
114,-0.37058
115,-0.37058
116,-0.37058
117,-0.37058
118,-0.37058
119,-0.37058
120,-0.37058
121,-0.37058
122,-0.37058
123,-0.37058
124,-0.37058
125,-0.37058
126,-0.37058
127,-0.37058
128,-0.37058
129,-0.37058
130,-0.37058
131,-0.37058
132,-0.37058
133,-0.37058
134,-0.37058
135,-0.37058
136,-0.37058
137,-0.37058
138,-0.37058
139,-0.37058
140,-0.37058
141,-0.37058
142,-0.37058
143,-0.37058
144,-0.37058
145,-0.37058
146,-0.37058
147,-0.37058
148,-0.37058
149,-0.37058
150,-0.37058
151,-0.37058
152,-0.37058
153,-0.37058
154,-0.37058
155,-0.37058
156,-0.37058
157,-0.37058
158,-0.37058
159,-0.37058
160,-0.37058
161,-0.37058
162,-0.37058
163,-0.37058
164,-0.37058
165,-0.37058
166,-0.37058
167,-0.37058
168,-0.37058
169,-0.37058
170,-0.37058
171,-0.37058
172,-0.37058
173,-0.37058
174,-0.37058
175,-0.37058
176,-0.37058
177,-0.37058
178,-0.37058
179,-0.37058
180,-0.37058
181,-0.37058
182,-0.37058
183,-0.37058
184,-0.37058
185,-0.37058
186,-0.37058
187,-0.37058
188,-0.37058
189,-0.37058
190,-0.37058
191,-0.37058
192,-0.37058
193,-0.37058
194,-0.37058
195,-0.37058
196,-0.37058
197,-0.37058
198,-0.37058
199,-0.37058
200,-0.37058
201,-0.37058
202,-0.37058
203,-0.37058
204,-0.37058
205,-0.37058
206,-0.37058
207,-0.37058
208,-0.37058
209,-0.37058
210,-0.37058
211,-0.37058
212,-0.37058
213,-0.37058
214,-0.37058
215,-0.37058
216,-0.37058
217,-0.37058
218,-0.37058
219,-0.37058
220,-0.37058
221,-0.37058
222,-0.37058
223,-0.37058
224,-0.37058
225,-0.37058
226,-0.37058
227,-0.37058
228,-0.37058
229,-0.37058
230,-0.37058
231,-0.37058
232,-0.37058
233,-0.37058
234,-0.37058
235,-0.37058
236,-0.37058
237,-0.37058
238,-0.37058
239,-0.37058
240,-0.37058
241,-0.37058
242,-0.37058
243,-0.37058
244,-0.37058
245,-0.37058
246,-0.37058
247,-0.37058
248,-0.37058
249,-0.37058
250,-0.37058
251,-0.37058
252,-0.37058
253,-0.37058
254,-0.37058
255,-0.37058
256,-0.37058
257,-0.37058
258,-0.37058
259,-0.37058
260,-0.37058
261,-0.37058
262,-0.37058
263,-0.37058
264,-0.37058
265,-0.37058
266,-0.37058
267,-0.37058
268,-0.37058
269,-0.37058
270,-0.37058
271,-0.37058
272,-0.37058
273,-0.37058
274,-0.37058
275,-0.37058
276,-0.37058
277,-0.37058
278,-0.37058
279,-0.37058
280,-0.37058
281,-0.37058
282,-0.37058
283,-0.37058
284,-0.37058
285,-0.37058
286,-0.37058
287,-0.37058
288,-0.37058
289,-0.37058
290,-0.37058
291,-0.37058
292,-0.37058
293,-0.37058
294,-0.37058
295,-0.37058
296,-0.37058
297,-0.37058
298,-0.37058
299,-0.37058
300,-0.37058
301,-0.37058
302,-0.37058
303,-0.37058
304,-0.37058
305,-0.37058
306,-0.37058
307,-0.37058
308,-0.37058
309,-0.37058
310,-0.37058
311,-0.37058
312,-0.37058
313,-0.37058
314,-0.37058
315,-0.37058
316,-0.37058
317,-0.37058
318,-0.37058
319,-0.37058
320,-0.37058
321,-0.37058
322,-0.37058
323,-0.37058
324,-0.37058
325,-0.37058
326,-0.37058
327,-0.37058
328,-0.37058
329,-0.37058
330,-0.37058
331,-0.37058
332,-0.37058
333,-0.37058
334,-0.37058
335,-0.37058
336,-0.37058
337,-0.37058
338,-0.37058
339,-0.37058
340,-0.37058
341,-0.37058
342,-0.37058
343,-0.37058
344,-0.37058
345,-0.37058
346,-0.37058
347,-0.37058
348,-0.37058
349,-0.37058
350,-0.37058
351,-0.37058
352,-0.37058
353,-0.37058
354,-0.37058
355,-0.37058
356,-0.37058
357,-0.37058
358,-0.37058
359,-0.37058
360,-0.37058
361,-0.37058
362,-0.37058
363,-0.37058
364,-0.37058
365,-0.37058
366,-0.37058
367,-0.37058
368,-0.37058
369,-0.37058
370,-0.37058
371,-0.37058
372,-0.37058
373,-0.37058
374,-0.37058
375,-0.37058
376,-0.37058
377,-0.37058
378,-0.37058
379,-0.37058
380,-0.37058
381,-0.37058
382,-0.37058
383,-0.37058
384,-0.37058
385,-0.37058
386,-0.37058
387,-0.37058
388,-0.37058
389,-0.37058
390,-0.37058
391,-0.37058
392,-0.37058
393,-0.37058
394,-0.37058
395,-0.37058
396,-0.37058
397,-0.37058
398,-0.37058
399,-0.37058
400,-0.37058
401,-0.37058
402,-0.37058
403,-0.37058
404,-0.37058
405,-0.37058
406,-0.37058
407,-0.37058
408,-0.37058
409,-0.37058
410,-0.37058
411,-0.37058
412,-0.37058
413,-0.37058
414,-0.37058
415,-0.37058
416,-0.37058
417,-0.37058
418,-0.37058
419,-0.37058
420,-0.37058
421,-0.37058
422,-0.37058
423,-0.37058
424,-0.37058
425,-0.37058
426,-0.37058
427,-0.37058
428,-0.37058
429,-0.37058
430,-0.37058
431,-0.37058
432,-0.37058
433,-0.37058
434,-0.37058
435,-0.37058
436,-0.37058
437,-0.37058
438,-0.37058
439,-0.37058
440,-0.37058
441,-0.37058
442,-0.37058
443,-0.37058
444,-0.37058
445,-0.37058
446,-0.37058
447,-0.37058
448,-0.37058
449,-0.37058
450,-0.37058
451,-0.37058
452,-0.37058
453,-0.37058
454,-0.37058
455,-0.37058
456,-0.37058
457,-0.37058
458,-0.37058
459,-0.37058
460,-0.37058
461,-0.37058
462,-0.37058
463,-0.37058
464,-0.37058
465,-0.37058
466,-0.37058
467,-0.37058
468,-0.37058
469,-0.37058
470,-0.37058
471,-0.37058
472,-0.37058
473,-0.37058
474,-0.37058
475,-0.37058
476,-0.37058
477,-0.37058
478,-0.37058
479,-0.37058
480,-0.37058
481,-0.37058
482,-0.37058
483,-0.37058
484,-0.37058
485,-0.37058
486,-0.37058
487,-0.37058
488,-0.37058
489,-0.37058
490,-0.37058
491,-0.37058
492,-0.37058
493,-0.37058
494,-0.37058
495,-0.37058
496,-0.37058
497,-0.37058
498,-0.37058
499,-0.37058
500,-0.37058
501,-0.37058
502,-0.37058
503,-0.37058
504,-0.37058
505,-0.37058
506,-0.37058
507,-0.37058
508,-0.37058
509,-0.37058
510,-0.37058
511,-0.37058
512,-0.37058
513,-0.37058
514,-0.37058
515,-0.37058
516,-0.37058
517,-0.37058
518,-0.37058
519,-0.37058
520,-0.37058
521,-0.37058
522,-0.37058
523,-0.37058
524,-0.37058
525,-0.37058
526,-0.37058
527,-0.37058
528,-0.37058
529,-0.37058
530,-0.37058
531,-0.37058
532,-0.37058
533,-0.37058
534,-0.37058
535,-0.37058
536,-0.37058
537,-0.37058
538,-0.37058
539,-0.37058
540,-0.37058
541,-0.37058
542,-0.37058
543,-0.37058
544,-0.37058
545,-0.37058
546,-0.37058
547,-0.37058
548,-0.37058
549,-0.37058
550,-0.37058
551,-0.37058
552,-0.37058
553,-0.37058
554,-0.37058
555,-0.37058
556,-0.37058
557,-0.37058
558,-0.37058
559,-0.37058
560,-0.37058
561,-0.37058
562,-0.37058
563,-0.37058
564,-0.37058
565,-0.37058
566,-0.37058
567,-0.37058
568,-0.37058
569,-0.37058
570,-0.37058
571,-0.37058
572,-0.37058
573,-0.37058
574,-0.37058
575,-0.37058
576,-0.37058
577,-0.37058
578,-0.37058
579,-0.37058
580,1.6784
581,1.6784
582,1.6784
583,1.6784
584,-0.37058
585,2.8167
586,2.8167
587,2.8167
588,2.8167
589,-0.14292
590,2.8167
591,2.8167
592,2.8167
593,2.8167
594,-0.14292
595,2.8167
596,2.8167
597,2.8167
598,2.8167
599,-0.14292
600,2.589
601,2.589
602,2.589
603,2.589
604,-0.14292
605,2.8167
606,2.8167
607,2.8167
608,2.8167
609,-0.14292
610,2.8167
611,2.8167
612,2.8167
613,2.8167
614,-0.14292
615,3.0444
616,3.0444
617,3.0444
618,3.0444
619,0.3124
620,2.8167
621,2.8167
622,2.8167
623,2.8167
624,-0.14292
625,2.8167
626,2.8167
627,2.8167
628,2.8167
629,-0.14292
630,2.8167
631,2.8167
632,2.8167
633,2.8167
634,-0.14292
635,2.8167
636,2.8167
637,2.8167
638,2.8167
639,-0.14292
640,3.0444
641,3.0444
642,3.0444
643,3.0444
644,0.3124
645,2.8167
646,2.8167
647,2.8167
648,2.8167
649,-0.14292
650,2.589
651,2.589
652,2.589
653,2.589
654,-0.14292
655,2.8167
656,2.8167
657,2.8167
658,2.8167
659,-0.14292
660,2.589
661,2.589
662,2.589
663,2.589
664,-0.14292
665,2.8167
666,2.8167
667,2.8167
668,2.8167
669,-0.14292
670,3.0444
671,3.0444
672,3.0444
673,3.0444
674,0.3124
675,2.8167
676,2.8167
677,2.8167
678,2.8167
679,-0.14292
680,2.1337
681,2.1337
682,2.1337
683,2.1337
684,-0.37058
685,-0.37058
686,-0.37058
687,-0.37058
688,-0.37058
689,0.3124
690,-0.37058
691,-0.37058
692,-0.37058
693,-0.37058
694,-0.37058
695,-0.37058
696,-0.37058
697,-0.37058
698,-0.37058
699,-0.37058
700,-0.37058
701,-0.37058
702,-0.37058
703,-0.37058
704,-0.37058
705,-0.37058
706,-0.37058
707,-0.37058
708,-0.37058
709,-0.37058
710,-0.37058
711,-0.37058
712,-0.37058
713,-0.37058
714,-0.37058
715,-0.37058
716,-0.37058
717,-0.37058
718,-0.37058
719,-0.37058
