time,value
0,0.30296999999999996
1,0.30296999999999996
2,0.30296999999999996
3,0.51713
4,0.30296999999999996
5,0.30296999999999996
6,0.30296999999999996
7,0.30296999999999996
8,0.30296999999999996
9,0.73128
10,0.73128
11,0.94544
12,0.94544
13,0.73128
14,0.94544
15,0.94544
16,0.13165
17,-1.2818
18,-1.3674
19,-1.3674
20,-1.3674
21,-1.3674
22,-1.3674
23,-1.3246
24,-1.3674
25,-1.3674
26,-1.239
27,0.73128
28,0.94544
29,0.94544
30,0.94544
31,0.94544
32,0.73128
33,0.51713
34,0.30296999999999996
35,0.51713
36,0.51713
37,0.51713
38,0.30296999999999996
39,0.51713
40,0.30296999999999996
41,0.30296999999999996
42,0.30296999999999996
43,0.30296999999999996
44,0.30296999999999996
45,0.51713
46,0.30296999999999996
47,0.51713
48,0.73128
49,0.94544
50,0.94544
51,0.94544
52,0.94544
53,0.51713
54,-1.239
55,-1.3674
56,-1.3674
57,-1.3674
58,-1.3246
59,-1.3674
60,-1.3674
61,-1.3674
62,-1.3674
63,-1.3674
64,-1.3674
65,0.73128
66,0.94544
67,0.73128
68,0.94544
69,0.94544
70,0.73128
71,0.51713
72,0.51713
73,0.30296999999999996
74,0.51713
75,0.30296999999999996
76,0.30296999999999996
77,0.51713
78,0.30296999999999996
79,0.30296999999999996
80,0.30296999999999996
81,0.30296999999999996
82,0.30296999999999996
83,0.30296999999999996
84,0.30296999999999996
85,0.73128
86,0.94544
87,0.73128
88,0.94544
89,0.94544
90,0.94544
91,0.30296999999999996
92,-1.239
93,-1.3246
94,-1.3674
95,-1.3674
96,-1.3674
97,-1.3674
98,-1.3246
99,-1.3674
100,-1.3674
101,-1.3674
102,-1.3674
103,0.51713
104,0.94544
105,0.94544
106,0.94544
107,0.73128
108,0.94544
109,0.51713
110,0.30296999999999996
111,0.30296999999999996
112,0.30296999999999996
113,0.30296999999999996
114,0.51713
115,0.30296999999999996
116,0.30296999999999996
117,0.51713
118,0.30296999999999996
119,0.30296999999999996
120,0.30296999999999996
121,0.30296999999999996
122,0.30296999999999996
123,0.73128
124,0.94544
125,0.94544
126,0.94544
127,0.73128
128,0.94544
129,0.13165
130,-1.3246
131,-1.3674
132,-1.3674
133,-1.3674
134,-1.3674
135,-1.3674
136,-1.3246
137,-1.3674
138,-1.3674
139,-1.3674
140,-1.0676
141,0.73128
142,0.94544
143,0.94544
144,0.94544
145,0.73128
146,0.73128
147,0.51713
148,0.51713
149,0.30296999999999996
150,0.13165
151,0.30296999999999996
152,0.30296999999999996
153,0.51713
154,0.30296999999999996
155,0.30296999999999996
156,0.30296999999999996
157,0.30296999999999996
158,0.30296999999999996
159,0.30296999999999996
160,0.30296999999999996
161,0.73128
162,0.94544
163,0.73128
164,0.94544
165,0.94544
166,0.73128
167,0.13165
168,-1.239
169,-1.3674
170,-1.3674
171,-1.3674
172,-1.3674
173,-1.3674
174,-1.3674
175,-1.3674
176,-1.3674
177,-1.3246
178,-0.98196
179,0.73128
180,0.94544
181,0.94544
182,0.94544
183,0.73128
184,0.73128
185,0.51713
186,0.30296999999999996
187,0.30296999999999996
188,0.30296999999999996
189,0.30296999999999996
190,0.30296999999999996
191,0.30296999999999996
192,0.51713
193,0.30296999999999996
194,0.30296999999999996
195,0.30296999999999996
196,0.30296999999999996
197,0.30296999999999996
198,0.30296999999999996
199,0.30296999999999996
200,0.94544
201,0.94544
202,0.73128
203,0.94544
204,0.94544
205,0.73128
206,-0.76781
207,-0.8963
208,0.73128
209,0.94544
210,0.73128
211,0.94544
212,0.73128
213,0.94544
214,-0.21100000000000002
215,-1.4103
216,-1.4103
217,-1.3674
218,-1.4103
219,-0.21100000000000002
220,0.51713
221,0.73128
222,0.73128
223,0.94544
224,0.94544
225,0.73128
226,0.94544
227,0.94544
228,0.73128
229,0.94544
230,0.94544
231,0.73128
232,0.94544
233,0.94544
234,0.94544
235,0.73128
236,0.73128
237,0.51713
238,0.13165
239,-0.21100000000000002
240,-0.38233
241,-0.039678
242,-0.039678
243,0.13165
244,0.30296999999999996
245,0.30296999999999996
246,0.30296999999999996
247,0.51713
248,0.30296999999999996
249,0.30296999999999996
250,0.30296999999999996
251,0.30296999999999996
252,0.30296999999999996
253,0.73128
254,0.94544
255,0.94544
256,0.73128
257,0.94544
258,0.73128
259,-0.5108199999999999
260,-1.239
261,-1.3674
262,-1.3674
263,-1.3674
264,-1.3674
265,-1.3674
266,-1.3674
267,-1.3674
268,-0.21100000000000002
269,0.94544
270,0.73128
271,0.94544
272,0.94544
273,0.94544
274,0.73128
275,0.30296999999999996
276,0.51713
277,0.30296999999999996
278,0.51713
279,0.73128
280,0.73128
281,0.30296999999999996
282,0.51713
283,0.30296999999999996
284,0.30296999999999996
285,0.30296999999999996
286,0.30296999999999996
287,0.30296999999999996
288,0.51713
289,0.30296999999999996
290,0.13165
291,0.51713
292,0.73128
293,0.94544
294,0.73128
295,0.94544
296,0.94544
297,0.73128
298,-0.8963
299,-1.3674
300,-1.3674
301,-1.3674
302,-1.3674
303,-1.3674
304,-1.3674
305,-1.3674
306,-1.3246
307,-1.3674
308,-0.8963
309,0.73128
310,0.94544
311,0.94544
312,0.94544
313,0.94544
314,0.73128
315,0.51713
316,0.30296999999999996
317,0.51713
318,0.30296999999999996
319,0.51713
320,0.30296999999999996
321,0.30296999999999996
322,0.51713
323,0.30296999999999996
324,0.30296999999999996
325,0.30296999999999996
326,0.30296999999999996
327,0.30296999999999996
328,0.30296999999999996
329,0.30296999999999996
330,0.94544
331,0.73128
332,0.94544
333,0.94544
334,0.73128
335,0.94544
336,-0.5108199999999999
337,-1.239
338,-1.3674
339,-1.3674
340,-1.3674
341,-1.3246
342,-1.3674
343,-1.3674
344,-1.3246
345,-1.3674
346,-1.3674
347,0.30296999999999996
348,0.94544
349,0.94544
350,0.94544
351,0.94544
352,0.94544
353,0.51713
354,0.30296999999999996
355,0.51713
356,0.51713
357,0.51713
358,0.51713
359,0.30296999999999996
360,0.51713
361,0.51713
362,0.51713
363,0.30296999999999996
364,0.30296999999999996
365,0.30296999999999996
366,0.30296999999999996
367,0.30296999999999996
368,0.30296999999999996
369,0.51713
370,0.73128
371,0.94544
372,0.94544
373,0.73128
374,0.94544
375,0.73128
376,-1.3246
377,-1.3674
378,-1.3246
379,-1.3674
380,-1.3674
381,-1.3674
382,-1.3674
383,-1.3674
384,-1.3674
385,-1.239
386,-1.3674
387,-0.8963
388,0.73128
389,0.94544
390,0.94544
391,0.94544
392,0.94544
393,0.73128
394,0.51713
395,0.51713
396,0.51713
397,0.51713
398,0.73128
399,0.73128
400,0.51713
401,0.73128
402,0.51713
403,0.30296999999999996
404,0.51713
405,0.30296999999999996
406,0.30296999999999996
407,0.30296999999999996
408,0.30296999999999996
409,0.51713
410,0.30296999999999996
411,0.30296999999999996
412,0.51713
413,0.73128
414,0.94544
415,0.94544
416,0.94544
417,0.73128
418,0.94544
419,-0.98196
420,-1.3674
421,-1.3674
422,-1.3674
423,-1.3674
424,-1.3674
425,-1.3674
426,-1.3246
427,-1.3674
428,-1.3674
429,-0.5108199999999999
430,0.94544
431,0.94544
432,0.94544
433,0.73128
434,0.94544
435,0.73128
436,0.51713
437,0.30296999999999996
438,0.30296999999999996
439,0.30296999999999996
440,0.51713
441,0.30296999999999996
442,0.30296999999999996
443,0.51713
444,0.30296999999999996
445,0.30296999999999996
446,0.30296999999999996
447,0.30296999999999996
448,0.30296999999999996
449,0.30296999999999996
450,0.51713
451,0.94544
452,0.73128
453,0.94544
454,0.94544
455,0.73128
456,0.94544
457,-1.2818
458,-1.3674
459,-1.3674
460,-1.3674
461,-1.3674
462,-1.3246
463,-1.3674
464,-1.3674
465,-1.3674
466,-1.3674
467,-1.1533
468,0.73128
469,0.94544
470,0.94544
471,0.94544
472,0.94544
473,0.73128
474,0.51713
475,0.30296999999999996
476,0.51713
477,0.30296999999999996
478,0.30296999999999996
479,0.51713
480,0.30296999999999996
481,0.30296999999999996
482,0.30296999999999996
483,0.51713
484,0.30296999999999996
485,0.30296999999999996
486,0.30296999999999996
487,0.30296999999999996
488,0.30296999999999996
489,0.51713
490,0.94544
491,0.94544
492,0.73128
493,0.94544
494,0.73128
495,-0.21100000000000002
496,-1.3246
497,-1.3246
498,-1.3674
499,-1.3674
500,-1.3674
501,-1.3246
502,-1.2818
503,-1.3674
504,-1.3674
505,-1.3674
506,0.30296999999999996
507,0.94544
508,0.94544
509,0.94544
510,0.94544
511,0.73128
512,0.73128
513,0.51713
514,0.30296999999999996
515,0.51713
516,0.73128
517,0.51713
518,1.9306
519,4.7574
520,5.1429
521,4.7574
522,5.1429
523,4.7574
524,3.3868
525,0.73128
526,-1.1533
527,-1.3674
528,-1.4103
529,-1.3674
530,-1.4103
531,1.1596
532,1.1596
533,0.94544
534,0.94544
535,0.73128
536,0.73128
537,0.30296999999999996
538,0.13165
539,0.30296999999999996
540,0.13165
541,0.30296999999999996
542,0.51713
543,0.30296999999999996
544,0.51713
545,0.51713
546,0.30296999999999996
547,0.30296999999999996
548,0.51713
549,0.30296999999999996
550,0.30296999999999996
551,0.51713
552,0.30296999999999996
553,0.30296999999999996
554,0.30296999999999996
555,0.30296999999999996
556,0.30296999999999996
557,0.30296999999999996
558,0.30296999999999996
559,0.30296999999999996
560,0.30296999999999996
561,0.30296999999999996
562,-0.76781
563,-1.3674
564,-1.3674
565,-1.3674
566,-1.4103
567,-1.4103
568,-1.3674
569,-1.4103
570,-1.4103
571,-1.3246
572,-1.4103
573,-1.4103
574,-1.3674
575,-1.4103
576,-1.4103
577,0.13165
578,0.73128
579,0.73128
580,0.73128
581,0.51713
582,0.73128
583,0.30296999999999996
584,0.30296999999999996
585,0.51713
586,0.30296999999999996
587,0.30296999999999996
588,0.30296999999999996
589,0.30296999999999996
590,0.30296999999999996
591,0.30296999999999996
592,0.30296999999999996
593,0.30296999999999996
594,-0.63931
595,-1.2818
596,-1.3246
597,-1.3674
598,-1.239
599,-1.3674
600,-1.4103
601,-1.3674
602,-1.4103
603,-1.4103
604,-1.3674
605,-1.4103
606,-1.3674
607,-1.4103
608,-1.4103
609,-1.3674
610,-0.63931
611,0.73128
612,0.73128
613,0.51713
614,0.51713
615,0.51713
616,0.30296999999999996
617,0.30296999999999996
618,0.51713
619,0.30296999999999996
620,0.30296999999999996
621,0.30296999999999996
622,0.30296999999999996
623,0.30296999999999996
624,0.30296999999999996
625,0.30296999999999996
626,-1.239
627,-1.3674
628,-1.3674
629,-1.3674
630,-1.3674
631,-1.3674
632,-1.4103
633,-1.3674
634,-1.4103
635,-1.4103
636,-1.3674
637,-1.4103
638,-1.3674
639,-1.4103
640,-1.4103
641,-1.3674
642,-0.98196
643,0.51713
644,0.51713
645,0.30296999999999996
646,0.30296999999999996
647,0.30296999999999996
648,0.30296999999999996
649,0.51713
650,0.30296999999999996
651,0.30296999999999996
652,0.30296999999999996
653,0.30296999999999996
654,0.13165
655,0.30296999999999996
656,-0.8963
657,-1.2818
658,-1.3674
659,-1.3674
660,-1.3674
661,-1.3674
662,-1.4103
663,-1.3674
664,-1.4103
665,-1.4103
666,-1.3674
667,-1.4103
668,-1.3674
669,-1.4103
670,-1.4103
671,-1.3674
672,-1.4103
673,0.73128
674,0.51713
675,0.30296999999999996
676,0.51713
677,0.30296999999999996
678,0.30296999999999996
679,0.30296999999999996
680,0.30296999999999996
681,0.51713
682,0.30296999999999996
683,0.30296999999999996
684,0.30296999999999996
685,0.13165
686,-0.8963
687,-1.3246
688,-1.3674
689,-1.3674
690,-1.3674
691,-1.3674
692,-1.4103
693,-1.4103
694,-1.3674
695,-1.4103
696,-1.4103
697,-1.3674
698,-1.4103
699,-1.3674
700,-1.4103
701,-1.4103
702,-1.3674
703,-1.4103
704,-1.4103
705,0.13165
706,0.73128
707,0.73128
708,0.94544
709,0.94544
710,0.73128
711,0.51713
712,0.51713
713,0.30296999999999996
714,0.51713
715,0.51713
716,0.30296999999999996
717,0.30296999999999996
718,0.30296999999999996
719,0.30296999999999996
