time,value
0,-0.051184
1,-0.051184
2,-0.051184
3,-0.051184
4,-0.051184
5,-0.051184
6,-0.051184
7,-0.051184
8,-0.051184
9,-0.051184
10,-0.051184
11,-0.051184
12,-0.051184
13,-0.051184
14,-0.051184
15,-0.051184
16,-0.051184
17,-0.051184
18,-0.051184
19,-0.051184
20,-0.051184
21,-0.051184
22,-0.051184
23,-0.051184
24,-0.051184
25,-0.051184
26,-0.051184
27,-0.051184
28,-0.051184
29,-0.051184
30,-0.051184
31,-0.051184
32,-0.051184
33,-0.051184
34,-0.051184
35,-0.051184
36,-0.051184
37,-0.051184
38,-0.051184
39,-0.051184
40,-0.051184
41,-0.051184
42,-0.051184
43,-0.051184
44,-0.051184
45,-0.051184
46,-0.051184
47,-0.051184
48,-0.051184
49,-0.051184
50,-0.051184
51,-0.051184
52,-0.051184
53,-0.051184
54,-0.051184
55,-0.051184
56,-0.051184
57,-0.051184
58,-0.051184
59,-0.051184
60,-0.051184
61,-0.051184
62,-0.051184
63,-0.051184
64,-0.051184
65,-0.051184
66,-0.051184
67,-0.051184
68,-0.051184
69,-0.051184
70,-0.051184
71,-0.051184
72,-0.051184
73,-0.051184
74,-0.051184
75,-0.051184
76,-0.051184
77,-0.051184
78,-0.051184
79,-0.051184
80,-0.051184
81,-0.051184
82,-0.051184
83,-0.051184
84,-0.051184
85,-0.051184
86,-0.051184
87,-0.051184
88,-0.051184
89,-0.051184
90,-0.051184
91,-0.051184
92,-0.051184
93,-0.051184
94,-0.051184
95,-0.051184
96,-0.051184
97,-0.051184
98,-0.051184
99,-0.051184
100,-0.051184
101,-0.051184
102,-0.051184
103,-0.051184
104,-0.051184
105,-0.051184
106,-0.051184
107,-0.051184
108,-0.051184
109,-0.051184
110,-0.051184
111,-0.051184
112,-0.051184
113,-0.051184
114,-0.051184
115,-0.051184
116,-0.051184
117,-0.051184
118,-0.051184
119,-0.051184
120,-0.051184
121,-0.051184
122,-0.051184
123,-0.051184
124,-0.051184
125,-0.051184
126,-0.051184
127,-0.051184
128,-0.051184
129,-0.051184
130,-0.051184
131,-0.051184
132,-0.051184
133,-0.051184
134,-0.051184
135,-0.051184
136,-0.051184
137,-0.051184
138,-0.051184
139,-0.051184
140,-0.051184
141,-0.051184
142,-0.051184
143,-0.051184
144,-0.051184
145,-0.051184
146,-0.051184
147,-0.051184
148,-0.051184
149,-0.051184
150,-0.051184
151,-0.051184
152,-0.051184
153,-0.051184
154,-0.051184
155,-0.051184
156,-0.051184
157,-0.051184
158,-0.051184
159,-0.051184
160,-0.051184
161,-0.051184
162,-0.051184
163,-0.051184
164,-0.051184
165,-0.051184
166,-0.051184
167,-0.051184
168,-0.051184
169,-0.051184
170,-0.051184
171,-0.051184
172,-0.051184
173,-0.051184
174,-0.051184
175,-0.051184
176,-0.051184
177,-0.051184
178,-0.051184
179,-0.051184
180,-0.051184
181,-0.051184
182,-0.051184
183,-0.051184
184,-0.051184
185,-0.051184
186,-0.051184
187,-0.051184
188,-0.051184
189,-0.051184
190,-0.051184
191,-0.051184
192,-0.051184
193,-0.051184
194,-0.051184
195,-0.051184
196,-0.051184
197,-0.051184
198,-0.051184
199,-0.051184
200,-0.051184
201,-0.051184
202,-0.051184
203,-0.051184
204,-0.051184
205,-0.051184
206,-0.051184
207,-0.051184
208,-0.051184
209,-0.051184
210,-0.051184
211,-0.051184
212,-0.051184
213,-0.051184
214,-0.051184
215,-0.051184
216,-0.051184
217,-0.051184
218,-0.051184
219,-0.051184
220,-0.051184
221,-0.051184
222,-0.051184
223,-0.051184
224,-0.051184
225,-0.051184
226,-0.051184
227,-0.051184
228,-0.051184
229,-0.051184
230,-0.051184
231,-0.051184
232,-0.051184
233,-0.051184
234,-0.051184
235,-0.051184
236,-0.051184
237,-0.051184
238,-0.051184
239,-0.051184
240,-0.051184
241,-0.051184
242,-0.051184
243,-0.051184
244,-0.051184
245,-0.051184
246,-0.051184
247,-0.051184
248,-0.051184
249,-0.051184
250,-0.051184
251,-0.051184
252,-0.051184
253,-0.051184
254,-0.051184
255,-0.051184
256,-0.051184
257,-0.051184
258,-0.051184
259,-0.051184
260,-0.051184
261,-0.051184
262,-0.051184
263,-0.051184
264,-0.051184
265,-0.051184
266,-0.051184
267,-0.051184
268,-0.051184
269,-0.051184
270,-0.051184
271,-0.051184
272,-0.051184
273,-0.051184
274,-0.051184
275,-0.051184
276,-0.051184
277,-0.051184
278,-0.051184
279,-0.051184
280,-0.051184
281,-0.051184
282,-0.051184
283,-0.051184
284,-0.051184
285,-0.051184
286,-0.051184
287,-0.051184
288,-0.051184
289,-0.051184
290,-0.051184
291,-0.051184
292,-0.051184
293,-0.051184
294,-0.051184
295,-0.051184
296,-0.051184
297,-0.051184
298,-0.051184
299,-0.051184
300,-0.051184
301,-0.051184
302,-0.051184
303,-0.051184
304,-0.051184
305,-0.051184
306,-0.051184
307,-0.051184
308,-0.051184
309,-0.051184
310,-0.051184
311,-0.051184
312,-0.051184
313,-0.051184
314,-0.051184
315,-0.051184
316,-0.051184
317,-0.051184
318,-0.051184
319,-0.051184
320,-0.051184
321,-0.051184
322,-0.051184
323,-0.051184
324,-0.051184
325,-0.051184
326,-0.051184
327,-0.051184
328,-0.051184
329,-0.051184
330,-0.051184
331,-0.051184
332,-0.051184
333,-0.051184
334,-0.051184
335,-0.051184
336,-0.051184
337,-0.051184
338,-0.051184
339,-0.051184
340,-0.051184
341,-0.051184
342,-0.051184
343,-0.051184
344,-0.051184
345,-0.051184
346,-0.051184
347,-0.051184
348,-0.051184
349,-0.051184
350,-0.051184
351,-0.051184
352,-0.051184
353,-0.051184
354,-0.051184
355,-0.051184
356,-0.051184
357,-0.051184
358,-0.051184
359,-0.051184
360,-0.051184
361,-0.051184
362,-0.051184
363,-0.051184
364,-0.051184
365,-0.051184
366,-0.051184
367,-0.051184
368,-0.051184
369,-0.051184
370,-0.051184
371,-0.051184
372,-0.051184
373,-0.051184
374,-0.051184
375,-0.051184
376,-0.051184
377,-0.051184
378,-0.051184
379,-0.051184
380,-0.051184
381,-0.051184
382,-0.051184
383,-0.051184
384,-0.051184
385,-0.051184
386,-0.051184
387,-0.051184
388,-0.051184
389,-0.051184
390,-0.051184
391,-0.051184
392,-0.051184
393,-0.051184
394,-0.051184
395,-0.051184
396,-0.051184
397,-0.051184
398,-0.051184
399,-0.051184
400,-0.051184
401,-0.051184
402,-0.051184
403,-0.051184
404,-0.051184
405,-0.051184
406,-0.051184
407,-0.051184
408,-0.051184
409,-0.051184
410,-0.051184
411,-0.051184
412,-0.051184
413,-0.051184
414,-0.051184
415,-0.051184
416,-0.051184
417,-0.051184
418,-0.051184
419,-0.051184
420,-0.051184
421,-0.051184
422,-0.051184
423,-0.051184
424,-0.051184
425,-0.051184
426,-0.051184
427,-0.051184
428,-0.051184
429,-0.051184
430,-0.051184
431,-0.051184
432,-0.051184
433,-0.051184
434,-0.051184
435,2.9917
436,25.305999999999997
437,8.2322
438,0.11785999999999999
439,-0.051184
440,-0.051184
441,-0.051184
442,-0.051184
443,-0.051184
444,-0.051184
445,-0.051184
446,-0.051184
447,-0.051184
448,-0.051184
449,-0.051184
450,-0.051184
451,-0.051184
452,-0.051184
453,-0.051184
454,-0.051184
455,-0.051184
456,-0.051184
457,-0.051184
458,-0.051184
459,-0.051184
460,-0.051184
461,-0.051184
462,-0.051184
463,-0.051184
464,-0.051184
465,-0.051184
466,-0.051184
467,-0.051184
468,-0.051184
469,-0.051184
470,-0.051184
471,-0.051184
472,-0.051184
473,-0.051184
474,-0.051184
475,-0.051184
476,-0.051184
477,-0.051184
478,-0.051184
479,-0.051184
480,-0.051184
481,-0.051184
482,-0.051184
483,-0.051184
484,-0.051184
485,-0.051184
486,-0.051184
487,-0.051184
488,-0.051184
489,-0.051184
490,-0.051184
491,-0.051184
492,-0.051184
493,-0.051184
494,-0.051184
495,-0.051184
496,-0.051184
497,-0.051184
498,-0.051184
499,-0.051184
500,-0.051184
501,-0.051184
502,-0.051184
503,-0.051184
504,-0.051184
505,-0.051184
506,-0.051184
507,-0.051184
508,-0.051184
509,-0.051184
510,-0.051184
511,-0.051184
512,-0.051184
513,-0.051184
514,-0.051184
515,-0.051184
516,-0.051184
517,-0.051184
518,-0.051184
519,-0.051184
520,-0.051184
521,-0.051184
522,-0.051184
523,-0.051184
524,-0.051184
525,-0.051184
526,-0.051184
527,-0.051184
528,-0.051184
529,-0.051184
530,-0.051184
531,-0.051184
532,-0.051184
533,-0.051184
534,-0.051184
535,-0.051184
536,-0.051184
537,-0.051184
538,-0.051184
539,-0.051184
540,-0.051184
541,-0.051184
542,-0.051184
543,-0.051184
544,-0.051184
545,-0.051184
546,-0.051184
547,-0.051184
548,-0.051184
549,-0.051184
550,-0.051184
551,-0.051184
552,-0.051184
553,-0.051184
554,-0.051184
555,-0.051184
556,-0.051184
557,-0.051184
558,-0.051184
559,-0.051184
560,-0.051184
561,-0.051184
562,-0.051184
563,-0.051184
564,-0.051184
565,-0.051184
566,-0.051184
567,-0.051184
568,-0.051184
569,-0.051184
570,-0.051184
571,-0.051184
572,-0.051184
573,-0.051184
574,-0.051184
575,-0.051184
576,-0.051184
577,-0.051184
578,-0.051184
579,-0.051184
580,-0.051184
581,-0.051184
582,-0.051184
583,-0.051184
584,-0.051184
585,-0.051184
586,-0.051184
587,-0.051184
588,-0.051184
589,-0.051184
590,-0.051184
591,-0.051184
592,-0.051184
593,-0.051184
594,-0.051184
595,-0.051184
596,-0.051184
597,-0.051184
598,-0.051184
599,-0.051184
600,-0.051184
601,-0.051184
602,-0.051184
603,-0.051184
604,-0.051184
605,-0.051184
606,-0.051184
607,-0.051184
608,-0.051184
609,-0.051184
610,-0.051184
611,-0.051184
612,-0.051184
613,-0.051184
614,-0.051184
615,-0.051184
616,-0.051184
617,-0.051184
618,-0.051184
619,-0.051184
620,-0.051184
621,-0.051184
622,-0.051184
623,-0.051184
624,-0.051184
625,-0.051184
626,-0.051184
627,-0.051184
628,-0.051184
629,-0.051184
630,-0.051184
631,-0.051184
632,-0.051184
633,-0.051184
634,-0.051184
635,-0.051184
636,-0.051184
637,-0.051184
638,-0.051184
639,-0.051184
640,-0.051184
641,-0.051184
642,-0.051184
643,-0.051184
644,-0.051184
645,-0.051184
646,-0.051184
647,-0.051184
648,-0.051184
649,-0.051184
650,-0.051184
651,-0.051184
652,-0.051184
653,-0.051184
654,-0.051184
655,-0.051184
656,-0.051184
657,-0.051184
658,-0.051184
659,-0.051184
660,-0.051184
661,-0.051184
662,-0.051184
663,-0.051184
664,-0.051184
665,-0.051184
666,-0.051184
667,-0.051184
668,-0.051184
669,-0.051184
670,-0.051184
671,-0.051184
672,-0.051184
673,-0.051184
674,-0.051184
675,-0.051184
676,-0.051184
677,-0.051184
678,-0.051184
679,-0.051184
680,-0.051184
681,-0.051184
682,-0.051184
683,-0.051184
684,-0.051184
685,-0.051184
686,-0.051184
687,-0.051184
688,-0.051184
689,-0.051184
690,-0.051184
691,-0.051184
692,-0.051184
693,-0.051184
694,-0.051184
695,-0.051184
696,-0.051184
697,-0.051184
698,-0.051184
699,-0.051184
700,-0.051184
701,-0.051184
702,-0.051184
703,-0.051184
704,-0.051184
705,-0.051184
706,-0.051184
707,-0.051184
708,-0.051184
709,-0.051184
710,-0.051184
711,-0.051184
712,-0.051184
713,-0.051184
714,-0.051184
715,-0.051184
716,-0.051184
717,-0.051184
718,-0.051184
719,-0.051184
