time,value
0,0.37836
1,0.37836
2,0.37836
3,0.37836
4,0.37836
5,0.37836
6,0.37836
7,0.37836
8,0.37836
9,0.37836
10,0.37836
11,0.37836
12,0.37836
13,0.37836
14,0.37836
15,0.37836
16,0.37836
17,0.37836
18,0.37836
19,0.37836
20,0.37836
21,0.37836
22,0.37836
23,0.37836
24,0.37836
25,0.37836
26,0.37836
27,0.37836
28,0.37836
29,0.37836
30,0.37836
31,0.37836
32,0.37836
33,0.37836
34,0.37836
35,0.37836
36,0.38742
37,0.40356
38,0.42268999999999995
39,0.44181000000000004
40,0.46093999999999996
41,0.48006000000000004
42,0.49918999999999997
43,0.5333
44,0.5826399999999999
45,0.6400100000000001
46,0.69595
47,0.74268
48,0.78127
49,0.81952
50,0.8638399999999999
51,0.9160200000000001
52,0.97339
53,1.03
54,1.0781
55,1.1173
56,1.1555
57,1.1985
58,1.2494
59,1.3068
60,1.364
61,1.4133
62,1.4532
63,1.4915
64,1.5334
65,1.5828
66,1.6401
67,1.6975
68,1.7419
69,1.7662
70,1.7853
71,1.8018
72,1.8114
73,1.8114
74,1.8114
75,1.8114
76,1.8114
77,1.8114
78,1.8096
79,1.8018
80,1.7827
81,1.7636
82,1.7409
83,1.7075
84,1.6693
85,1.631
86,1.5928
87,1.5545
88,1.5163
89,1.4825
90,1.4702
91,1.4702
92,1.4702
93,1.4702
94,1.4702
95,1.4702
96,1.4702
97,1.4702
98,1.4702
99,1.47
100,1.4685
101,1.4493
102,1.4302
103,1.4111
104,1.392
105,1.3728
106,1.3537
107,1.3346
108,1.2971
109,1.2590000000000001
110,1.2207
111,1.1825
112,1.1442
113,1.1059999999999999
114,1.0677
115,1.0455
116,1.026
117,1.0069
118,0.98109
119,0.9447
120,0.90645
121,0.8682
122,0.84393
123,0.8238700000000001
124,0.80475
125,0.78562
126,0.7665
127,0.74737
128,0.72825
129,0.69711
130,0.6604399999999999
131,0.6221899999999999
132,0.58797
133,0.56438
134,0.5452600000000001
135,0.5261399999999999
136,0.49682
137,0.46093999999999996
138,0.42268999999999995
139,0.3903
140,0.37836
141,0.37836
142,0.37836
143,0.36983
144,0.35402
145,0.33489
146,0.31775
147,0.31014
148,0.31012
149,0.31012
150,0.29612
151,0.26665
152,0.2284
153,0.19015
154,0.1519
155,0.11365
156,0.37471
157,0.18345999999999998
158,-0.055188
159,-0.19902999999999998
160,-0.39028
161,-0.11584000000000001
162,-0.15409
163,-0.19234
164,-0.23059000000000002
165,-0.26884
166,-0.30708
167,-0.34528000000000003
168,-0.36830999999999997
169,-0.37228
170,-0.37228
171,-0.37228
172,-0.37228
173,-0.37228
174,-0.37228
175,-0.37228
176,-0.37228
177,-0.37228
178,-0.37228
179,-0.37228
180,-0.37228
181,-0.37228
182,-0.38119000000000003
183,-0.4114
184,-0.44965
185,-0.48632
186,-0.51745
187,-0.5365800000000001
188,-0.5557
189,-0.5748300000000001
190,-0.59395
191,-0.6130800000000001
192,-0.6322
193,-0.65133
194,-0.67045
195,-0.68958
196,-0.7068399999999999
197,-0.71348
198,-0.71348
199,-0.71348
200,-0.71348
201,-0.71348
202,-0.71348
203,-0.71427
204,-0.72522
205,-0.74434
206,-0.76347
207,-0.78259
208,-0.80171
209,-0.82084
210,-0.83996
211,-0.8590899999999999
212,-0.87821
213,-0.8973399999999999
214,-0.91646
215,-0.9355899999999999
216,-0.9547100000000001
217,-0.9738399999999999
218,-0.9929600000000001
219,-1.0121
220,-1.0312
221,-1.0503
222,-1.0541
223,-1.0547
224,-1.0547
225,-1.0547
226,-1.0547
227,-1.0547
228,-1.0547
229,-1.068
230,-1.0859999999999999
231,-1.1051
232,-1.1194
233,-1.1229
234,-1.1229
235,-1.1229
236,-1.1229
237,-1.1229
238,-1.1229
239,-1.1156
240,-1.0873
241,-1.0490000000000002
242,-1.0108
243,-0.98215
244,-0.96036
245,-0.94124
246,-0.91951
247,-0.8877700000000001
248,-0.8495299999999999
249,-0.81128
250,-0.78103
251,-0.75825
252,-0.7391300000000001
253,-0.7217
254,-0.7136600000000001
255,-0.71348
256,-0.71348
257,-0.71348
258,-0.71348
259,-0.71348
260,-0.71539
261,-0.73495
262,-0.77172
263,-0.80997
264,-0.8482200000000001
265,-0.8864700000000001
266,-0.9247200000000001
267,-0.96262
268,-0.99239
269,-1.013
270,-1.0321
271,-1.0552
272,-1.0859999999999999
273,-1.1242
274,-1.1625
275,-1.1937
276,-1.2151
277,-1.2342
278,-1.2533
279,-1.2724
280,-1.2916
281,-1.3107
282,-1.3298
283,-1.3489
284,-1.3681
285,-1.3872
286,-1.4063
287,-1.4254
288,-1.4446
289,-1.4597
290,-1.4641
291,-1.4641
292,-1.4641
293,-1.4641
294,-1.4641
295,-1.4641
296,-1.4615
297,-1.4480000000000002
298,-1.4289
299,-1.4083
300,-1.3802
301,-1.3229
302,-1.2655
303,-1.2126
304,-1.1912
305,-1.1912
306,-1.1912
307,-1.1912
308,-1.1912
309,-1.1912
310,-1.1912
311,-1.1912
312,-1.1912
313,-1.1912
314,-1.1912
315,-1.3385
316,-1.3385
317,-1.3385
318,-1.3385
319,-1.3385
320,-1.3385
321,-1.3385
322,-1.3385
323,-1.3385
324,-1.3385
325,-1.3385
326,-1.3385
327,-1.3385
328,-1.3385
329,-1.3385
330,-1.3385
331,-1.3385
332,-1.3385
333,-1.3385
334,-1.3385
335,-1.3385
336,-1.3385
337,-1.3385
338,-1.3385
339,-1.3385
340,-1.3385
341,-1.3385
342,-1.3385
343,-1.3385
344,-1.3385
345,-1.3385
346,-1.3385
347,-1.3385
348,-1.3385
349,-1.3385
350,-1.3385
351,-1.3385
352,-1.3385
353,-1.3385
354,-1.3385
355,-1.3385
356,-1.3385
357,-1.3385
358,-1.3204
359,-1.2839
360,-1.2378
361,-1.195
362,-1.1746
363,-1.1737
364,-1.1737
365,-1.1591
366,-1.1254
367,-1.0792
368,-1.0313
369,-0.9625
370,-0.8724200000000001
371,-0.78004
372,-0.68765
373,-0.59527
374,-0.50288
375,-0.4105
376,-0.31811999999999996
377,-0.22573000000000001
378,-0.13335
379,-0.29538000000000003
380,-0.10216
381,-0.10216
382,-0.10216
383,-0.16025
384,0.17604
385,0.40700000000000003
386,0.12805999999999998
387,0.17425
388,0.22044
389,0.26663000000000003
390,0.30088000000000004
391,0.30968
392,0.30968
393,0.30968
394,0.30968
395,0.30968
396,0.30968
397,0.30968
398,0.30968
399,0.30968
400,0.30968
401,0.30968
402,0.30968
403,0.30968
404,0.30968
405,0.30968
406,0.30968
407,0.31109000000000003
408,0.32016999999999995
409,0.36635999999999996
410,0.41256000000000004
411,0.45602
412,0.4745
413,0.4745
414,0.47495
415,0.4787
416,0.52489
417,0.57108
418,0.6169100000000001
419,0.63932
420,0.63932
421,0.63932
422,0.63932
423,0.68361
424,0.7296
425,0.77579
426,0.80224
427,0.80414
428,0.80414
429,0.80414
430,0.84299
431,0.88813
432,0.93432
433,0.98051
434,1.0267
435,1.0729
436,1.1191
437,1.0978
438,1.0561
439,1.0099
440,0.97641
441,0.96896
442,0.96896
443,0.96896
444,0.93995
445,0.8975700000000001
446,0.8513799999999999
447,0.8246100000000001
448,0.8492799999999999
449,0.8954700000000001
450,0.9416700000000001
451,0.9878600000000001
452,1.0341
453,1.0802
454,1.1335
455,1.2115
456,1.3039
457,1.3962
458,1.4886
459,1.581
460,1.6734
461,1.7562
462,1.7929
463,1.7931
464,1.7931
465,1.7762
466,1.7406
467,1.6944
468,1.6482
469,1.6019999999999999
470,1.5558
471,1.5096
472,1.4498
473,1.371
474,1.2787
475,1.1889
476,1.1395
477,1.1338
478,1.1338
479,1.1338
480,1.1338
481,1.1338
482,1.1339
483,1.1522
484,1.1936
485,1.2398
486,1.286
487,1.3322
488,1.3784
489,1.4246
490,1.4419
491,1.4099
492,1.3637
493,1.3175
494,1.2713
495,1.2251
496,1.1789
497,1.1435
498,1.1338
499,1.1338
500,1.1338
501,1.1338
502,1.1338
503,1.1338
504,1.1338
505,1.1338
506,1.1338
507,1.136
508,1.1485
509,1.1947
510,1.2409
511,1.2781
512,1.264
513,1.2178
514,1.1705
515,1.117
516,1.0246
517,0.93222
518,0.84173
519,0.77579
520,0.7296
521,0.68361
522,0.63932
523,0.63932
524,0.63932
525,0.63932
526,0.63932
527,0.63932
528,0.63932
529,0.63932
530,0.63932
531,0.63932
532,0.63932
533,0.62085
534,0.57738
535,0.5311899999999999
536,0.48499
537,0.32747
538,0.14695
539,-0.1914
540,-0.17790999999999998
541,-0.24043
542,-0.28662
543,-0.33281
544,-0.34686999999999996
545,-0.34961
546,-0.34961
547,-0.34961
548,-0.34961
549,-0.34961
550,-0.34961
551,-0.34961
552,-0.34961
553,-0.34961
554,-0.34081999999999996
555,-0.30657
556,-0.26038
557,-0.21418
558,-0.19122999999999998
559,-0.18479
560,-0.18479
561,-0.18479
562,-0.18479
563,-0.18479
564,-0.18479
565,-0.18479
566,-0.18479
567,-0.18479
568,-0.18479
569,-0.18479
570,-0.18479
571,-0.18479
572,-0.20055
573,-0.23518000000000003
574,-0.28137
575,-0.32526
576,-0.34784
577,-0.34961
578,-0.34961
579,-0.36216
580,-0.3937
581,-0.4399
582,-0.48608999999999997
583,-0.53228
584,-0.5784699999999999
585,-0.62466
586,-0.67086
587,-0.71705
588,-0.7632399999999999
589,-0.80943
590,-0.8385600000000001
591,-0.8440799999999999
592,-0.8440799999999999
593,-0.8512700000000001
594,-0.8755700000000001
595,-0.92176
596,-0.96795
597,-1.0141
598,-1.0603
599,-1.1065
600,-1.1527
601,-1.1989
602,-1.2451
603,-1.2913
604,-1.3375
605,-1.3837
606,-1.4299
607,-1.4761
608,-1.5223
609,-1.5685
610,-1.6146
611,-1.6480000000000001
612,-1.6293
613,-1.5831
614,-1.5333
615,-1.4656
616,-1.327
617,-1.1884
618,-1.057
619,-0.97635
620,-0.93016
621,-0.8854299999999999
622,-0.8503700000000001
623,-0.8965700000000001
624,-0.94276
625,-0.9878399999999999
626,-1.0089
627,-1.0089
628,-1.0089
629,-1.0089
630,-0.68386
631,-0.68386
632,-0.68386
633,-0.68386
634,-0.68386
635,-0.68386
636,-0.68386
637,-0.68386
638,-0.68386
639,-0.68386
640,-0.68386
641,-0.68386
642,-0.68386
643,-0.68386
644,-0.68386
645,-0.68386
646,-0.68386
647,-0.68386
648,-0.68386
649,-0.68386
650,-0.68386
651,-0.68386
652,-0.68386
653,-0.68386
654,-0.68386
655,-0.68386
656,-0.68386
657,-0.68386
658,-0.68386
659,-0.68386
660,-0.68386
661,-0.68386
662,-0.68386
663,-0.68386
664,-0.68386
665,-0.68386
666,-0.73612
667,-0.8292
668,-0.93945
669,-1.0365
670,-1.0773
671,-1.0773
672,-1.0773
673,-1.1205
674,-1.2076
675,-1.3178
676,-1.4198
677,-1.4687
678,-1.4707
679,-1.4707
680,-1.4707
681,-1.4707
682,-1.4707
683,-1.4707
684,-1.4707
685,-1.4707
686,-1.4707
687,-1.4431
688,-1.3705
689,-1.2602
690,-1.151
691,-1.0871
692,-1.0773
693,-1.0773
694,-1.0773
695,-1.0773
696,-1.0773
697,-1.0773
698,-1.0773
699,-1.0773
700,-1.0773
701,-1.0619
702,-1.0071
703,-0.89685
704,-0.7866
705,-0.6763399999999999
706,-0.56608
707,-0.45583
708,-0.33504
709,-0.18019000000000002
710,0.19931
711,0.26084
712,0.4407
713,0.49638999999999994
714,0.49638999999999994
715,0.48986
716,0.45629
717,0.34604
718,0.23578000000000002
719,0.12552
720,0.074014
721,-0.47726999999999997
722,-0.20525
723,-0.3155
724,-0.42576
725,-0.53601
726,-0.64627
727,-0.75653
728,-0.8667799999999999
729,-0.9759700000000001
730,-1.0773
731,-1.0773
732,-1.0773
733,-1.0781
734,-1.1349
735,-1.2452
736,-1.3554
737,-1.4657
738,-1.4702
739,-1.4707
740,-1.4707
741,-1.4707
742,-1.4707
743,-1.4707
744,-1.4707
745,-1.3780000000000001
746,-1.2702
747,-1.16
748,-1.088
749,-1.0773
750,-1.0773
751,-1.0773
752,-0.99671
753,-0.89184
754,-0.78159
755,-0.70165
756,-0.68386
757,-0.68386
758,-0.68386
759,-0.6146199999999999
760,-0.51346
761,-0.40321
762,-0.31613
763,-0.29044000000000003
764,-0.29044000000000003
765,-0.29044000000000003
766,-0.29044000000000003
767,-0.29044000000000003
768,-0.29044000000000003
769,-0.27355999999999997
770,-0.19773
771,-0.43968
772,0.1116
773,0.41718
774,0.10297
775,0.10297
776,0.45533
777,0.12330999999999999
778,-0.42715
779,-0.19522
780,-0.30548000000000003
781,-0.41573999999999994
782,-0.52599
783,-0.62941
784,-0.68078
785,-0.68386
786,-0.68386
787,-0.65144
788,-0.5736
789,-0.46335
790,-0.35001
791,-0.18838
792,0.12412999999999999
793,0.2458
794,0.41567
795,0.49638999999999994
796,0.49638999999999994
797,0.49638999999999994
798,0.49638999999999994
799,0.49638999999999994
800,0.49638999999999994
801,0.49638999999999994
802,0.49638999999999994
803,0.49638999999999994
804,0.49638999999999994
805,0.49638999999999994
806,0.49638999999999994
807,0.49638999999999994
808,0.49638999999999994
809,0.49638999999999994
810,0.49638999999999994
811,0.49638999999999994
812,0.52207
813,0.60915
814,0.71941
815,0.8387700000000001
816,0.9900399999999999
817,1.2105
818,1.4311
819,1.6159999999999999
820,1.6766
821,1.6766
822,1.6659
823,1.6065
824,1.386
825,1.1654
826,0.9449299999999999
827,0.72442
828,0.5039
829,0.28841999999999995
830,0.10297
831,0.10297
832,0.10297
833,0.10297
834,0.10297
835,0.10297
836,0.10346
837,0.10797999999999999
838,0.21824000000000002
839,0.3285
840,0.43875
841,0.49553
842,0.49638999999999994
843,0.49638999999999994
844,0.49638999999999994
845,0.49638999999999994
846,0.49638999999999994
847,0.49638999999999994
848,0.4082
849,0.2007
850,-0.10139
851,-0.24033000000000002
852,-0.46083999999999997
853,-0.68135
854,-0.9018700000000001
855,-1.0157
856,-0.9444600000000001
857,-0.83421
858,-0.72395
859,-0.4603
860,-0.1426
861,0.18817
862,0.49108999999999997
863,0.7319399999999999
864,0.95245
865,1.173
866,1.3935
867,1.614
868,1.8345
869,2.013
870,2.07
871,2.07
872,2.07
873,1.9591
874,1.7693
875,1.5488
876,1.3283
877,1.1078
878,0.8873
879,0.66678
880,0.44627
881,0.22576
882,0.15604
883,-0.20546
884,-0.36207
885,-0.47336999999999996
886,-0.58363
887,-0.61865
888,-0.56358
889,-0.45332
890,-0.34307
891,-0.23281
892,-0.12255
893,-0.06380599999999999
894,0.12792
895,0.31346
896,0.53397
897,0.75046
898,0.87325
899,0.8898
900,0.8898
901,0.91295
902,0.98001
903,1.0903
904,1.2005
905,1.2701
906,1.2832
907,1.2832
908,1.3004
909,1.3584
910,1.4686
911,1.5789
912,1.6577
913,1.6766
914,1.6766
915,1.6766
916,1.6766
917,1.6766
918,1.6766
919,1.6996
920,1.7844
921,1.8946
922,1.9971
923,2.07
924,2.07
925,2.07
926,2.07
927,2.07
928,2.07
929,2.0657
930,2.04
931,1.9297
932,1.8195
933,1.7092
934,1.599
935,1.4887
936,1.3767
937,1.2531
938,1.0326
939,0.81212
940,0.5916100000000001
941,0.3711
942,0.15058
943,-0.35198
944,-0.29044000000000003
