time,value
0,2.1442
1,2.0224
2,1.7992
3,1.6137
4,1.4138
5,1.2539
6,1.0882
7,0.95257
8,0.8234299999999999
9,0.70301
10,0.6447
11,0.51032
12,0.41786
13,0.25685
14,0.20745999999999998
15,0.091426
16,-0.045221
17,-0.11837
18,-0.2056
19,-0.289
20,-0.35168
21,-0.44873
22,-0.50348
23,-0.5986100000000001
24,-0.66801
25,-0.73863
26,-0.74878
27,-0.82339
28,-0.89166
29,-0.94284
30,-0.98129
31,-1.0066
32,-1.0509
33,-1.0111
34,-1.0335
35,-1.0277
36,-1.0543
37,-1.0448
38,-1.0361
39,-1.0159
40,-0.9711
41,-0.9111
42,-0.85244
43,-0.80043
44,-0.69291
45,-0.58363
46,-0.43738999999999995
47,-0.34734
48,-0.24361999999999998
49,-0.09500800000000001
50,0.035052999999999994
51,0.17381
52,0.28665
53,0.40998
54,0.46384
55,0.4873
56,0.4881
57,0.5665
58,0.80007
59,0.9961899999999999
60,1.2386
61,1.4347
62,1.6308
63,1.8644
64,2.0875
65,2.0259
66,1.8304
67,1.6349
68,1.3917
69,1.1962
70,0.96399
71,0.75758
72,0.5253899999999999
73,0.45083999999999996
74,0.40867
75,0.27245
76,0.11590999999999999
77,-0.052530999999999994
78,-0.20009000000000002
79,-0.35425
80,-0.44468
81,-0.54801
82,-0.6701699999999999
83,-0.75254
84,-0.84857
85,-0.96803
86,-1.0369
87,-1.1364
88,-1.2264
89,-1.285
90,-1.3502
91,-1.4122
92,-1.4117
93,-1.3999
94,-1.3682
95,-1.3231
96,-1.3357
97,-1.2622
98,-1.2401
99,-1.2133
100,-1.1572
101,-1.1028
102,-1.0369
103,-0.90623
104,-0.81888
105,-0.7245699999999999
106,-0.6701699999999999
107,-0.5526
108,-0.46763999999999994
109,-0.37546
110,-0.25804
111,-0.14224
112,-0.047961000000000004
113,0.07496599999999999
114,0.20849
115,0.29559
116,0.44301999999999997
117,0.55825
118,0.69005
119,0.7905399999999999
120,0.86372
121,0.9828100000000001
122,1.1118
123,1.2074
124,1.3912
125,1.6063
126,1.8692
127,2.0980000000000003
