time,value
0,0.012318
1,0.14089000000000002
2,0.44872
3,-0.045729
4,0.31194
5,-0.074607
6,0.39849
7,-0.19943
8,-0.11875999999999999
9,0.017855000000000003
10,-0.38201999999999997
11,-0.27334
12,0.09731000000000001
13,0.11367999999999999
14,0.31162
15,0.1483
16,-0.27243
17,-0.46126999999999996
18,-0.018938
19,0.44038
20,0.17151
21,0.0022505
22,0.1644
23,-0.46358999999999995
24,-0.046204
25,0.21886999999999998
26,0.011526
27,0.28422
28,-0.61473
29,0.35903
30,-0.10945
31,0.15089
32,-0.35120999999999997
33,0.19793
34,0.24714
35,-0.26854
36,0.34306
37,-0.19005999999999998
38,-0.10487
39,-0.12754000000000001
40,-0.8009
41,0.18989
42,0.29225
43,0.11649000000000001
44,0.033941000000000006
45,0.57165
46,0.17603
47,0.37846
48,0.29291
49,-1.6948
50,-1.6948
51,-1.6948
52,-1.6948
53,-1.6948
54,-1.6948
55,-1.6948
56,-1.6948
57,-1.6948
58,-1.6948
59,-1.6948
60,-1.6948
61,-1.6948
62,1.6119
63,1.6119
64,1.6119
65,1.6119
66,1.6119
67,1.6119
68,1.6119
69,1.6119
70,1.6119
71,1.6119
72,1.6119
73,1.6119
74,0.58646
75,-0.34528000000000003
76,0.41352
77,-0.17965
78,-0.59196
79,-0.16204000000000002
80,0.09194
81,0.45395
82,-0.20484000000000002
83,-0.27071
84,-0.4737
85,0.15306
86,0.09158
87,0.20876999999999998
88,0.024034
89,-0.41173999999999994
90,0.089133
91,0.56557
92,0.063903
93,0.17902
94,-0.018033
95,0.5368
96,0.59021
97,0.022713999999999998
98,-0.090165
99,0.5363100000000001
100,-0.35328000000000004
101,0.44888
102,0.41821
103,0.47643
104,-0.72106
105,-0.1183
106,-0.49723999999999996
107,-1.6948
108,-1.6948
109,-1.6948
110,-1.6948
111,-1.6948
112,-1.6948
113,-1.6948
114,-1.6948
115,-1.6948
116,1.6119
117,1.6119
118,1.6119
119,1.6119
120,1.6119
121,1.6119
122,1.6119
123,1.6119
124,1.6119
125,0.47817
126,0.14469
127,-0.42038000000000003
