time,value
0,1.4299
1,1.4299
2,1.4299
3,1.5232
4,1.5979
5,1.6166
6,1.6166
7,1.6166
8,1.6166
9,1.5792
10,1.5232
11,1.5232
12,1.4672
13,1.4112
14,1.3738
15,1.2805
16,1.1871
17,1.1311
18,1.0378
19,0.88838
20,0.7390100000000001
21,0.6269899999999999
22,0.47761000000000003
23,0.34692
24,0.2909
25,0.25356
26,0.19755
27,0.12286
28,-0.0078387
29,-0.11987
30,-0.23189
31,-0.30658
32,-0.39994
33,-0.45595
34,-0.39994
35,-0.32525
36,-0.36259
37,-0.36259
38,-0.36259
39,-0.39994
40,-0.43728
41,-0.47462
42,-0.49328999999999995
43,-0.49328999999999995
44,-0.53063
45,-0.5493100000000001
46,-0.56798
47,-0.68
48,-0.6239899999999999
49,-0.56798
50,-0.6239899999999999
51,-0.68
52,-0.69868
53,-0.6239899999999999
54,-0.56798
55,-0.5493100000000001
56,-0.56798
57,-0.56798
58,-0.5493100000000001
59,-0.49328999999999995
60,-0.47462
61,-0.5119600000000001
62,-0.49328999999999995
63,-0.39994
64,-0.36259
65,-0.45595
66,-0.60532
67,-0.66133
68,-0.6239899999999999
69,-0.56798
70,-0.5493100000000001
71,-0.53063
72,-0.53063
73,-0.53063
74,-0.5119600000000001
75,-0.53063
76,-0.5493100000000001
77,-0.5119600000000001
78,-0.47462
79,-0.5119600000000001
80,-0.60532
81,-0.69868
82,-0.75469
83,-0.75469
84,-0.75469
85,-0.77336
86,-0.8107
87,-0.8293799999999999
88,-0.8293799999999999
89,-0.8293799999999999
90,-0.79203
91,-0.75469
92,-0.75469
93,-0.77336
94,-0.84805
95,-0.9040600000000001
96,-0.88539
97,-0.88539
98,-0.9414
99,-0.9600700000000001
100,-1.0161
101,-1.0721
102,-1.1468
103,-1.1655
104,-1.1841
105,-1.2215
106,-1.0721
107,-1.2215
108,-1.2775
109,-1.3335
110,-1.4082
111,-1.4642
112,-1.5576
113,-1.6509
114,-1.4269
115,-1.2962
116,-1.2401
117,-1.0348
118,-0.8107
119,-0.56798
120,-0.30658
121,-0.082524
122,0.12286
123,0.32824000000000003
124,0.53363
125,0.66433
126,0.77636
127,0.88838
128,0.98174
129,1.0191
130,1.0191
131,1.0191
132,1.0004
133,0.9444
134,0.88838
135,0.90705
136,0.88838
137,0.8137
138,0.7390100000000001
139,0.66433
140,0.5896399999999999
141,0.5523
142,0.47761000000000003
143,0.4216
144,0.36559
145,0.27223
146,0.25356
147,0.32824000000000003
148,0.47761000000000003
149,0.5149600000000001
150,0.45893999999999996
151,0.47761000000000003
152,0.64566
153,0.77636
154,0.86971
155,1.0191
156,1.2245
157,1.3925
158,1.7846
159,1.9713
160,2.046
161,2.102
162,2.1954
163,2.3261
164,2.4008
165,2.3447
166,2.1954
167,2.0273
168,1.7846
169,1.5232
170,1.2992
171,0.9257299999999999
172,0.53363
173,0.36559
174,0.25356
175,0.066846
176,-0.026510000000000002
177,-0.21322
178,-0.38126
179,-0.39994
180,-0.39994
181,-0.45595
182,-0.47462
183,-0.47462
184,-0.43728
185,-0.38126
186,-0.39994
187,-0.45595
188,-0.49328999999999995
189,-0.5119600000000001
190,-0.49328999999999995
191,-0.49328999999999995
192,-0.47462
193,-0.43728
194,-0.43728
195,-0.43728
196,-0.43728
197,-0.45595
198,-0.45595
199,-0.47462
200,-0.41861000000000004
201,-0.34392
202,-0.36259
203,-0.39994
204,-0.38126
205,-0.34392
206,-0.34392
207,-0.38126
208,-0.45595
209,-0.5119600000000001
210,-0.5493100000000001
211,-0.56798
212,-0.6239899999999999
213,-0.66133
214,-0.66133
215,-0.68
216,-0.69868
217,-0.68
218,-0.68
219,-0.69868
220,-0.69868
221,-0.66133
222,-0.68
223,-0.75469
224,-0.79203
225,-0.86672
226,-0.9414
227,-0.9974200000000001
228,-1.0348
229,-1.0908
230,-1.1655
231,-1.2028
232,-1.2588
233,-1.3522
234,-1.4269
235,-1.3895
236,-1.2588
237,-1.2401
238,-1.2775
239,-1.2775
240,-1.2775
241,-1.3895
242,-1.5762
243,-1.6322
244,-1.6136
245,-1.5576
246,-1.4642
247,-1.3148
248,-1.0721
249,-0.77336
250,-0.53063
251,-0.28791
252,0.029504000000000002
253,0.4216
254,0.83237
255,1.0564
256,1.1685
257,1.2245
258,1.4299
259,1.5979
260,1.5792
261,1.6539
262,1.7099
263,1.7286
264,1.7473
265,1.7286
266,1.5792
267,1.4859
268,1.3738
269,1.1498
270,1.1124
271,1.1124
272,1.0191
273,0.9257299999999999
274,0.83237
275,0.7390100000000001
276,0.64566
277,0.5896399999999999
278,0.5896399999999999
279,0.64566
280,0.6829999999999999
281,0.6829999999999999
282,0.72034
283,0.72034
284,0.75768
285,0.90705
286,1.0938
287,1.2431
288,1.4112
289,1.5792
290,1.7659
291,1.9713
292,2.1207
293,2.214
294,2.2514
295,2.1954
296,2.102
297,1.9713
298,1.7473
299,1.4485
300,1.0564
301,0.7390100000000001
302,0.5523
303,0.38426
304,0.10419
305,-0.13854
306,-0.38126
307,-0.56798
308,-0.71735
309,-0.75469
310,-0.77336
311,-0.79203
312,-0.8107
313,-0.79203
314,-0.8107
315,-0.8293799999999999
316,-0.84805
317,-0.8107
318,-0.79203
319,-0.79203
320,-0.73602
321,-0.73602
322,-0.75469
323,-0.73602
324,-0.69868
325,-0.69868
326,-0.68
327,-0.64266
328,-0.64266
329,-0.66133
330,-0.6239899999999999
331,-0.6239899999999999
332,-0.64266
333,-0.6239899999999999
334,-0.58665
335,-0.64266
336,-0.69868
337,-0.66133
338,-0.68
339,-0.71735
340,-0.75469
341,-0.75469
342,-0.75469
