time,value
0,0.6604399999999999
1,-0.43201000000000006
2,0.32366
3,-0.041181
4,-0.080786
5,0.54456
6,-0.20561999999999997
7,0.060939
8,-0.60554
9,-0.3266
10,-0.3974
11,-0.083928
12,-0.22580999999999998
13,-0.11557
14,0.008867100000000001
15,-0.40254
16,-0.41321
17,0.0045788999999999995
18,0.55824
19,0.39034
20,0.37065
21,0.22733000000000003
22,0.3318
23,-0.28014
24,0.41916000000000003
25,0.57263
26,-0.29893000000000003
27,-0.37406
28,-0.23924
29,-0.38719000000000003
30,-0.066235
31,-1.7584
32,-1.7584
33,-1.7584
34,-1.7584
35,-1.7584
36,-1.7584
37,-1.7584
38,-1.7584
39,-1.7584
40,1.8346
41,1.8346
42,1.8346
43,1.8346
44,1.8346
45,1.8346
46,1.8346
47,1.8346
48,1.8346
49,0.28831999999999997
50,-0.52971
51,-0.10166
52,0.58421
53,0.37853000000000003
54,-0.37809
55,-0.13527999999999998
56,0.8578899999999999
57,0.138
58,0.03946
59,0.26123
60,0.00038132
61,-0.24197
62,-0.070796
63,0.059466
64,0.3278
65,1.3783
66,-0.64408
67,-1.7584
68,-1.7584
69,-1.7584
70,-1.7584
71,-1.7584
72,-1.7584
73,-1.7584
74,-1.7584
75,-1.7584
76,1.8346
77,1.8346
78,1.8346
79,1.8346
80,1.8346
81,1.8346
82,1.8346
83,1.8346
84,0.067694
85,-0.48831
86,-0.46535
87,0.21699000000000002
88,-1.0
89,0.064154
90,-0.45695
91,0.29393
92,0.070629
93,0.54118
94,0.097947
95,-0.68474
96,0.062347
97,0.089017
98,0.513
99,0.47193
100,0.4972
101,-0.52507
102,0.058084000000000004
103,-0.20121
104,-0.7991199999999999
105,-0.23986
106,-0.098315
107,0.18797
108,-0.11010999999999999
109,0.25067
110,0.46573000000000003
111,0.09033
112,0.40105
113,0.05622100000000001
114,-0.7853399999999999
115,0.21303000000000002
116,-0.10727
117,-0.13507
118,0.16019
119,0.019905000000000003
120,0.31132
121,0.21574000000000002
122,-0.25366
123,-0.15741
124,0.020084
125,-0.12636
126,0.16244
127,-0.21097
