time,value
0,0.24388
1,0.060504999999999996
2,0.4333
3,-0.097014
4,-0.34215999999999996
5,-0.14256
6,0.67965
7,-0.0017928
8,0.27543
9,-0.10357000000000001
10,0.68069
11,0.38149
12,-0.22152
13,-0.31785
14,-0.6348699999999999
15,-0.026979000000000003
16,-0.5919
17,-0.54147
18,0.095525
19,-0.42293000000000003
20,0.31251999999999996
21,-0.28874
22,-0.1757
23,-0.066258
24,-0.44127
25,0.014006000000000001
26,-0.08479600000000001
27,0.14752
28,-0.10243
29,-0.14765
30,-0.011438
31,-0.26045
32,0.31475
33,0.14843
34,0.25163
35,-0.24585
36,-0.046608
37,0.33419
38,-0.37594
39,0.15986
40,0.098551
41,-0.091168
42,0.025788
43,0.11258
44,0.30056
45,0.9807899999999999
46,-0.12493
47,0.27241
48,-0.9688899999999999
49,0.51244
50,-0.30955
51,1.0895
52,-0.36235
53,0.5562699999999999
54,0.34010999999999997
55,-0.12752
56,-0.23567
57,-0.0026774999999999998
58,-0.17476
59,0.5506300000000001
60,-0.11469000000000001
61,0.10268
62,0.10555999999999999
63,-1.5819999999999999
64,-1.5819999999999999
65,-1.5819999999999999
66,-1.5819999999999999
67,-1.5819999999999999
68,-1.5819999999999999
69,-1.5819999999999999
70,-1.5819999999999999
71,-1.5819999999999999
72,-1.5819999999999999
73,-1.5819999999999999
74,-1.5819999999999999
75,-1.5819999999999999
76,-1.5819999999999999
77,-1.5819999999999999
78,1.6089
79,1.6089
80,1.6089
81,1.6089
82,1.6089
83,1.6089
84,1.6089
85,1.6089
86,1.6089
87,1.6089
88,1.6089
89,1.6089
90,1.6089
91,1.6089
92,-0.37298000000000003
93,-0.087818
94,-0.17889000000000002
95,-1.5819999999999999
96,-1.5819999999999999
97,-1.5819999999999999
98,-1.5819999999999999
99,-1.5819999999999999
100,-1.5819999999999999
101,-1.5819999999999999
102,-1.5819999999999999
103,-1.5819999999999999
104,1.6089
105,1.6089
106,1.6089
107,1.6089
108,1.6089
109,1.6089
110,1.6089
111,1.6089
112,0.27616999999999997
113,0.21324
114,0.3272
115,0.40103
116,0.19968
117,0.059458000000000004
118,0.37598000000000004
119,-0.029086
120,-0.15088
121,0.26188
122,-0.15408
123,-0.38948
124,0.48098
125,0.12389000000000001
126,0.065856
127,-0.22784000000000001
