time,value
0,1.8529
1,3.3364
2,4.1593
3,3.8643
4,2.5498
5,0.86151
6,-0.41368999999999995
7,-0.8467899999999999
8,-0.57796
9,-0.11764000000000001
10,0.08090399999999999
11,-0.074671
12,-0.35744000000000004
13,-0.49332
14,-0.39429000000000003
15,-0.18581
16,-0.046312
17,-0.042178
18,-0.10926
19,-0.1447
20,-0.10337
21,-0.026514
22,0.01927
23,0.010223000000000001
24,-0.025391999999999998
25,-0.034944
26,0.01095
27,0.089849
28,0.14752
29,0.14589000000000002
30,0.10051
31,0.084704
32,0.15852
33,0.30976
34,0.46687
35,0.54065
36,0.51865
37,0.48143
38,0.51322
39,0.60852
40,0.67514
41,0.63464
42,0.52777
43,0.49968999999999997
44,0.65959
45,0.9618899999999999
46,1.2335
47,1.3314
48,1.2819
49,1.2459
50,1.3339
51,1.4624
52,1.4011
53,0.98577
54,0.30204000000000003
55,-0.35265
56,-0.69705
57,-0.67687
58,-0.48212
59,-0.36198
60,-0.41666000000000003
61,-0.5588
62,-0.64025
63,-0.60121
64,-0.51074
65,-0.47252
66,-0.51276
67,-0.57463
68,-0.59106
69,-0.55381
70,-0.51749
71,-0.5298
72,-0.57855
73,-0.61568
74,-0.61038
75,-0.58229
76,-0.58412
77,-0.64268
78,-0.73312
79,-0.80807
80,-0.8345899999999999
81,-0.82055
82,-0.80324
83,-0.80701
84,-0.83021
85,-0.8571799999999999
86,-0.8746799999999999
87,-0.8839899999999999
88,-0.89533
89,-0.91296
90,-0.9325399999999999
91,-0.9479299999999999
92,-0.9577
93,-0.96741
94,-0.98175
95,-0.9959100000000001
96,-0.9997799999999999
97,-0.9866799999999999
98,-0.9594
