time,value
0,-1.6014
1,-1.6014
2,-1.6014
3,-1.6014
4,-1.6014
5,-1.6014
6,-1.6014
7,-1.6014
8,-1.6014
9,-1.6014
10,-1.6014
11,-1.6014
12,1.7094
13,1.7094
14,1.7094
15,1.7094
16,1.7094
17,1.7094
18,1.7094
19,1.7094
20,1.7094
21,1.7094
22,1.7094
23,0.16042
24,-0.17482999999999999
25,-0.11957000000000001
26,0.16161
27,-0.26644
28,0.4174
29,-0.15849000000000002
30,0.13595
31,-0.23724
32,0.81898
33,-0.025281
34,-0.11979000000000001
35,-0.018938
36,0.031461
37,-0.21134
38,0.15637
39,-0.004172100000000001
40,0.090585
41,0.47341000000000005
42,0.09915399999999999
43,-0.05193300000000001
44,0.087266
45,0.15902
46,-0.076208
47,-0.43371000000000004
48,0.22958
49,-0.23415999999999998
50,0.14171
51,0.21479
52,-0.078439
53,0.030487
54,-0.34458
55,-0.18131
56,-0.14404
57,-0.13505
58,0.49163999999999997
59,-0.38306999999999997
60,0.60401
61,0.12075999999999999
62,0.069952
63,-0.9060299999999999
64,-0.060489
65,0.34915
66,-1.6014
67,-1.6014
68,-1.6014
69,-1.6014
70,-1.6014
71,-1.6014
72,-1.6014
73,-1.6014
74,-1.6014
75,-1.6014
76,-1.6014
77,1.7094
78,1.7094
79,1.7094
80,1.7094
81,1.7094
82,1.7094
83,1.7094
84,1.7094
85,1.7094
86,1.7094
87,0.18136
88,-0.045848
89,0.0029415
90,0.33378
91,0.5352899999999999
92,-0.082567
93,-0.015182
94,-0.23676999999999998
95,0.063415
96,0.436
97,0.15449000000000002
98,-0.022032
99,0.013558
100,-0.26585
101,-0.40298
102,0.23556
103,0.33214
104,-0.062275
105,-0.20798000000000003
106,-0.069881
107,0.14602
108,0.21040999999999999
109,0.06396900000000001
110,0.13271
111,0.18698
112,-0.30777
113,0.0010159
114,-0.038493
115,0.25364000000000003
116,0.3547
117,-0.38777
118,0.10732
119,-0.16314
120,-0.065108
121,-0.37208
122,-0.8427600000000001
123,-0.2218
124,-0.18363
125,0.020215
126,0.43327
127,0.051186
