time,value
0,2.3621
1,2.1022
2,1.8417
3,1.5491
4,1.3254
5,1.0724
6,0.9303799999999999
7,0.75708
8,0.56423
9,0.40521
10,0.37314
11,0.24226
12,0.26803
13,0.18836
14,0.12608
15,0.028031999999999998
16,-0.09377200000000001
17,-0.19365
18,-0.3041
19,-0.28306
20,-0.38535
21,-0.47179
22,-0.61374
23,-0.72265
24,-0.8604700000000001
25,-0.90766
26,-0.97729
27,-1.1196
28,-1.1023
29,-1.1409
30,-1.1227
31,-1.0204
32,-0.99326
33,-0.8604700000000001
34,-0.7952199999999999
35,-0.75085
36,-0.59924
37,-0.4812
38,-0.44781000000000004
39,-0.4871
40,-0.46866
41,-0.41826
42,-0.35257
43,-0.29351
44,-0.3152
45,-0.3516
46,-0.33069
47,-0.43773
48,-0.42383000000000004
49,-0.43127
50,-0.51132
51,-0.5663100000000001
52,-0.7063
53,-0.82668
54,-0.66723
55,-0.37395
56,-0.11302000000000001
57,0.18066
58,0.47448
59,0.73587
60,1.0299
61,1.2904
62,1.5845
63,1.8787
64,2.1391
65,2.4333
66,2.4463
67,2.184
68,1.8893
69,1.6271
70,1.3324
71,1.0378
72,0.77773
73,0.48308
74,0.22303
75,-0.071627
76,-0.36624
77,-0.6282800000000001
78,-0.92095
79,-1.0211
80,-1.1344
81,-1.2143
82,-1.306
83,-1.4095
84,-1.3893
85,-1.3322
86,-1.2511
87,-1.2064
88,-1.237
89,-1.15
90,-1.1641
91,-1.0907
92,-1.0406
93,-1.0325
94,-1.0081
95,-0.894
96,-0.8251799999999999
97,-0.7347899999999999
98,-0.59834
99,-0.47179
100,-0.40998
101,-0.41727
102,-0.44966999999999996
103,-0.52512
104,-0.39912
105,-0.33373
106,-0.26332
107,-0.10609
108,-0.051639
109,-0.052779
110,-0.014291
111,0.010519
112,0.1638
113,0.22098
114,0.25136
115,0.34926999999999997
116,0.40521
117,0.33119
118,0.41681999999999997
119,0.50868
120,0.68091
121,0.8127300000000001
122,0.9473
123,1.2293
124,1.4868
125,1.7787
126,2.0376
127,2.3296
