time,value
0,-0.39657
1,0.36705
2,1.2726
3,2.2056
4,3.0380000000000003
5,3.6507
6,3.9548
7,3.9087
8,3.5249
9,2.8674
10,2.0399
11,1.1659
12,0.3662
13,-0.26152
14,-0.6584300000000001
15,-0.8114100000000001
16,-0.7507699999999999
17,-0.53985
18,-0.25915
19,0.011399
20,0.20801999999999998
21,0.29372
22,0.26208000000000004
23,0.1341
24,-0.050314
25,-0.24397
26,-0.40405
27,-0.50126
28,-0.52472
29,-0.48203
30,-0.39497
31,-0.29247
32,-0.20288
33,-0.14724
34,-0.13534000000000002
35,-0.16484000000000001
36,-0.22354000000000002
37,-0.2937
38,-0.35713
39,-0.39968000000000004
40,-0.41423000000000004
41,-0.40144
42,-0.36859000000000003
43,-0.32681
44,-0.28784
45,-0.26106999999999997
46,-0.25148000000000004
47,-0.25916
48,-0.27994
49,-0.30709000000000003
50,-0.33342
51,-0.35307
52,-0.3628
53,-0.36235
54,-0.35395
55,-0.34138
56,-0.32866999999999996
57,-0.31908000000000003
58,-0.31439
59,-0.31476
60,-0.31904
61,-0.32532
62,-0.33166999999999996
63,-0.33665
64,-0.3396
65,-0.34068000000000004
66,-0.3406
67,-0.34031999999999996
68,-0.34066
69,-0.34401
70,-0.34739000000000003
71,-0.35056
72,-0.35355
73,-0.35641
74,-0.3592
75,-0.36215
76,-0.36493000000000003
77,-0.36738000000000004
78,-0.36944
79,-0.3711
80,-0.37239
81,-0.37353000000000003
82,-0.37458
83,-0.37566
84,-0.37696999999999997
85,-0.37868
86,-0.38087
87,-0.38353000000000004
88,-0.38643
89,-0.38918
90,-0.39141
91,-0.39278
92,-0.39299999999999996
93,-0.39196
94,-0.38973
95,-0.38645999999999997
96,-0.38256999999999997
97,-0.37855
98,-0.37496
