time,value
0,-0.071254
1,0.31246999999999997
2,0.57045
3,0.6694100000000001
4,0.6156699999999999
5,0.46878000000000003
6,0.27457
7,0.10061
8,0.0038468000000000005
9,-0.030335
10,-0.023818000000000002
11,-0.0039779
12,-0.018862999999999998
13,-0.079199
14,-0.16749
15,-0.23794
16,-0.22743000000000002
17,-0.10484
18,0.11260999999999999
19,0.40761
20,0.71336
21,0.96652
22,1.1166
23,1.1429
24,1.07
25,0.91151
26,0.6905899999999999
27,0.42882
28,0.11772
29,-0.25756
30,-0.69092
31,-1.1764
32,-1.6698
33,-2.1017
34,-2.38
35,-2.4235
36,-2.2131
37,-1.7236
38,-1.0115
39,-0.17015
40,0.71057
41,1.5068
42,2.1305
43,2.541
44,2.6908
45,2.5867
46,2.2783
47,1.7992
48,1.2144
49,0.59528
50,-0.0075843
51,-0.55181
52,-1.0055
53,-1.3499
54,-1.5696
55,-1.6813
56,-1.6607
57,-1.534
58,-1.3069
59,-0.99795
60,-0.64427
61,-0.27768000000000004
62,0.064569
63,0.35188
64,0.55667
65,0.67273
66,0.7120000000000001
67,0.69397
68,0.65715
69,0.60785
70,0.54583
71,0.48558999999999997
72,0.40954
73,0.29031999999999997
74,0.14354
75,-0.024419999999999997
76,-0.19815
77,-0.32661999999999997
78,-0.39573
79,-0.36608
80,-0.24013
81,-0.052078
82,0.18417999999999998
83,0.41135
84,0.56626
85,0.62773
86,0.56366
87,0.37682
88,0.082659
89,-0.28874
90,-0.67876
91,-1.0379
92,-1.3002
93,-1.411
94,-1.3463
95,-1.0926
96,-0.6953699999999999
97,-0.20025
98,0.32966
99,0.81681
100,1.1969
101,1.4238
102,1.4781
103,1.3778
104,1.1505
105,0.8331299999999999
106,0.44603999999999994
107,0.048989
108,-0.31772
109,-0.63761
110,-0.84698
111,-0.94101
112,-0.9289200000000001
113,-0.80129
114,-0.6085699999999999
115,-0.40699
116,-0.2312
117,-0.11164
118,-0.040831
119,0.0077308
120,0.06841799999999999
121,0.17899
122,0.33357
123,0.51665
124,0.69521
125,0.80661
126,0.81177
127,0.71801
128,0.5281399999999999
129,0.28024
130,0.034255
131,-0.18933
132,-0.35707
133,-0.47181000000000006
134,-0.54996
135,-0.59833
136,-0.64212
137,-0.66363
138,-0.65581
139,-0.61183
140,-0.53676
141,-0.43246999999999997
142,-0.30403
143,-0.16028
144,-0.029769999999999998
145,0.11009000000000001
146,0.27342
147,0.44733999999999996
148,0.64525
149,0.85515
150,1.0308
151,1.1535
152,1.1933
153,1.1309
154,0.968
155,0.71735
156,0.39876
157,0.032915
158,-0.34685
159,-0.7158399999999999
160,-1.0533
161,-1.3264
162,-1.5088
163,-1.5926
164,-1.5648
165,-1.4198
166,-1.1765
167,-0.87154
168,-0.53101
169,-0.18414
170,0.15492999999999998
171,0.47923999999999994
172,0.7762899999999999
173,1.0321
174,1.249
175,1.3983
176,1.4558
177,1.4209
178,1.2875
179,1.0892
180,0.85225
181,0.61192
182,0.40571
183,0.22641
184,0.058927
185,-0.12172000000000001
186,-0.35839
187,-0.64027
188,-0.94915
189,-1.2384
190,-1.4432
191,-1.5101
192,-1.4125
193,-1.1799
194,-0.8454
195,-0.46842
196,-0.13202
197,0.11757000000000001
198,0.25795999999999997
199,0.29206
200,0.27255999999999997
201,0.24756
202,0.26377
203,0.36519
204,0.5566300000000001
205,0.82947
206,1.1198
207,1.3812
208,1.5186
209,1.4625
210,1.1876
211,0.6862
212,0.015872
213,-0.72188
214,-1.4375
215,-2.0118
216,-2.3319
217,-2.3716
218,-2.1121
219,-1.6075
220,-0.94076
221,-0.20369
222,0.51047
223,1.1256
224,1.5912
225,1.8925
226,2.0189
227,1.9908
228,1.8127
229,1.5167
230,1.1314
231,0.6855600000000001
232,0.2117
233,-0.26733
234,-0.70149
235,-1.0693
236,-1.3575
237,-1.5428
238,-1.6277
239,-1.6294
240,-1.5430000000000001
241,-1.3563
242,-1.1223
243,-0.8234899999999999
244,-0.47943
245,-0.11233
246,0.25323
247,0.59767
248,0.90205
249,1.1261
250,1.2515
251,1.278
252,1.1816
253,0.99539
254,0.75005
255,0.48825
256,0.24564
257,0.057765
258,-0.052704999999999995
259,-0.10712999999999999
260,-0.10321
261,-0.08766
262,-0.07813099999999999
263,-0.10495
264,-0.17103
265,-0.24945
266,-0.35504
267,-0.45627
268,-0.53081
269,-0.57809
270,-0.59229
271,-0.59231
272,-0.56248
273,-0.51405
274,-0.42113
275,-0.27868000000000004
276,-0.087399
277,0.1517
278,0.41188
279,0.65166
280,0.8405799999999999
281,0.9411
282,0.94096
283,0.8296600000000001
284,0.62855
285,0.37399
286,0.08836000000000001
287,-0.1824
288,-0.41700000000000004
289,-0.61625
290,-0.7954899999999999
291,-0.9431200000000001
292,-1.0567
293,-1.1188
294,-1.1068
295,-1.0015
296,-0.78968
297,-0.49341
298,-0.12244000000000001
299,0.30232
300,0.73196
301,1.1102
302,1.4294
303,1.6721
304,1.8223
305,1.8782
306,1.8178
307,1.6444
308,1.3209
309,0.8554799999999999
310,0.27519
311,-0.395
312,-1.0921
313,-1.7284
314,-2.2324
315,-2.5302
316,-2.5748
317,-2.3703
318,-1.9476
319,-1.3909
320,-0.78145
321,-0.20096
322,0.27778
323,0.60487
324,0.7915
325,0.87023
326,0.88285
327,0.88085
328,0.9071799999999999
329,0.98064
330,1.0777
331,1.17
332,1.1991
333,1.1396
334,0.9708399999999999
335,0.67801
336,0.30885
337,-0.06890800000000001
338,-0.40642
339,-0.65205
340,-0.79109
341,-0.84154
342,-0.8474799999999999
343,-0.81608
344,-0.80219
345,-0.8056
346,-0.80187
347,-0.75568
348,-0.63383
349,-0.4237
350,-0.12764
351,0.20651999999999998
352,0.52148
353,0.78193
354,0.93343
355,0.9602200000000001
356,0.8718799999999999
357,0.69271
358,0.46948999999999996
359,0.21435
360,-0.026573000000000003
361,-0.26557
362,-0.49198000000000003
363,-0.6977899999999999
364,-0.87698
365,-0.9955799999999999
366,-1.0566
367,-1.0301
368,-0.9142299999999999
369,-0.71425
370,-0.44461999999999996
371,-0.12037
372,0.23721
373,0.59204
374,0.9487
375,1.261
376,1.4944
377,1.6223
378,1.6102
379,1.4487
380,1.1465
381,0.73334
382,0.25831
383,-0.22428
384,-0.66105
385,-1.0172
386,-1.2764
387,-1.4173
388,-1.4614
389,-1.4229
390,-1.3090000000000002
391,-1.1085
392,-0.84675
393,-0.54532
394,-0.22803
395,0.079875
396,0.34091
397,0.5336
398,0.6671199999999999
399,0.75805
400,0.8222299999999999
401,0.88813
402,0.96593
403,1.0253
404,1.0372
405,0.9747399999999999
406,0.8076300000000001
407,0.53895
408,0.19328
409,-0.17965
410,-0.53555
411,-0.8334799999999999
412,-1.0342
413,-1.1438
414,-1.1682
415,-1.1169
416,-1.0071
417,-0.83434
418,-0.61785
419,-0.34686999999999996
420,-0.020941
421,0.32946
422,0.66509
423,0.9262299999999999
424,1.0807
425,1.0896
426,0.95145
427,0.69557
428,0.37854
429,0.065914
430,-0.16859000000000002
431,-0.28839000000000004
432,-0.27446
433,-0.14038
434,0.061528
435,0.26926
436,0.41376
437,0.43367
438,0.28861
439,0.0035872
440,-0.39066
441,-0.82799
442,-1.2363
443,-1.5422
444,-1.6956
445,-1.6529
446,-1.4033
447,-0.9677
448,-0.3879
449,0.27039
450,0.93485
451,1.5183
452,1.9469
453,2.1706
454,2.1649
455,1.9479
456,1.5653
457,1.0863
458,0.57417
459,0.08344299999999999
460,-0.36075
461,-0.74921
462,-1.0945
463,-1.4011
464,-1.6672
465,-1.8656
466,-1.9575
467,-1.8885
468,-1.6236
469,-1.1716
470,-0.57985
471,0.073483
472,0.67597
473,1.1566
474,1.4666
475,1.5947
476,1.5835
477,1.4779
478,1.3189
479,1.1361
480,0.93581
481,0.71018
482,0.42681
483,0.085326
484,-0.29675
485,-0.6763
486,-1.0062
487,-1.2356
488,-1.3432
489,-1.325
490,-1.1913
491,-0.9710700000000001
492,-0.7037800000000001
493,-0.4116
494,-0.12968
495,0.12155999999999999
496,0.33269
497,0.48366000000000003
498,0.57758
499,0.61764
