time,value
0,-1.3062
1,-1.3062
2,-1.3062
3,-1.3062
4,-1.3062
5,-1.3062
6,-1.3062
7,-1.3062
8,-1.3062
9,-1.3062
10,-1.3062
11,-1.3062
12,-1.3062
13,-1.3062
14,-1.3062
15,-1.3062
16,-1.3062
17,-1.3062
18,-1.3062
19,-1.3062
20,-1.3062
21,-1.3062
22,-1.3062
23,-1.3062
24,-1.3062
25,-1.3062
26,-1.3062
27,-1.3062
28,-1.3062
29,-1.3062
30,-1.3062
31,-1.3062
32,-1.3207
33,-1.3794
34,-1.4517
35,-1.5384
36,-1.6215
37,-1.7032
38,-1.7069
39,-1.7069
40,-1.7069
41,-1.715
42,-1.7342
43,-1.7694
44,-1.8128
45,-1.8562
46,-1.8947
47,-1.9024
48,-1.9072
49,-1.9072
50,-1.9072
51,-1.9072
52,-1.9072
53,-1.9072
54,-1.9072
55,-1.8911
56,-1.8401
57,-1.7694
58,-1.6826
59,-1.5959
60,-1.5072
61,-1.3362
62,-1.1646
63,-0.9910399999999999
64,-0.8175100000000001
65,-0.64398
66,-0.47043999999999997
67,-0.29691
68,-0.12337999999999999
69,0.037255
70,0.14699
71,0.24666
72,0.33343
73,0.42018999999999995
74,0.5069600000000001
75,0.59373
76,0.6804899999999999
77,0.76726
78,0.85403
79,0.9408
80,1.0276
81,1.1143
82,1.2011
83,1.281
84,1.2912
85,1.2981
86,1.2981
87,1.2916
88,1.2801
89,1.2432
90,1.1998
91,1.1564
92,1.1055
93,1.034
94,0.95483
95,0.86806
96,0.7822399999999999
97,0.69675
98,0.65242
99,0.6090399999999999
100,0.56566
101,0.53833
102,0.53067
103,0.5579999999999999
104,0.60138
105,0.64477
106,0.69357
107,0.77141
108,0.85275
109,0.93952
110,1.0311
111,1.1255
112,1.2509
113,1.381
114,1.5112
115,1.625
116,1.7066
117,1.7664
118,1.8097
119,1.8531
120,1.8928
121,1.8546
122,1.8148
123,1.7715
124,1.7208
125,1.6634
126,1.5839
127,1.4971
128,1.4104
129,1.3167
130,1.1993
131,1.0759999999999998
132,0.9459
133,0.81575
134,0.6856
135,0.55545
136,0.4253
137,0.29515
138,0.17326
139,0.06352100000000001
140,-0.031504000000000004
141,-0.11827
142,-0.20504
143,-0.29181
144,-0.37856999999999996
145,-0.46534
146,-0.55211
147,-0.6329100000000001
148,-0.7094699999999999
149,-0.7588199999999999
150,-0.8022
151,-0.8455799999999999
152,-0.8811399999999999
153,-0.8977299999999999
154,-0.90555
155,-0.90555
156,-0.90555
157,-0.90555
158,-0.90555
159,-0.90555
160,-0.90555
161,-0.91338
162,-0.9299700000000001
163,-0.96552
164,-1.0089
165,-1.0523
166,-1.0897
167,-1.0999
168,-1.1059
169,-1.1059
170,-1.1059
171,-1.1059
172,-1.1059
173,-1.1059
174,-1.1059
175,-1.0894
176,-1.0434
177,-0.9731799999999999
178,-0.88641
179,-0.79965
180,-0.70755
181,-0.54167
182,-0.37346999999999997
183,-0.19993
184,-0.053926999999999996
185,0.06856699999999999
186,0.096094
187,0.096094
188,0.096094
189,0.096094
190,0.096094
191,0.096094
192,0.096094
193,0.097929
194,0.10048
195,0.14203
196,0.18541
197,0.2288
198,0.28852
199,0.37019
200,0.48399
201,0.6141399999999999
202,0.74429
203,0.8648100000000001
204,0.92351
205,0.97652
206,1.0199
207,1.0579
208,1.0923
209,1.0977
210,1.0977
211,1.0977
212,1.0897
213,1.0642
214,1.0288
215,0.98545
216,0.9420700000000001
217,0.89869
218,0.8553
219,0.81192
220,0.76854
221,0.72515
222,0.68177
223,0.63839
224,0.595
225,0.55162
226,0.50179
227,0.4265
228,0.34619
229,0.25942
230,0.17953
231,0.10298
232,0.096094
233,0.096094
234,0.096094
235,0.10438
236,0.12607000000000002
237,0.16117
238,0.20455
239,0.24794000000000002
240,0.29475999999999997
241,0.37642
242,0.45975
243,0.54652
244,0.62683
245,0.70211
246,0.75195
247,0.79533
248,0.83872
249,0.8745299999999999
250,0.88984
251,0.89741
252,0.89741
253,0.89741
254,0.89741
255,0.89741
256,0.89741
257,0.89741
258,0.88938
259,0.8715200000000001
260,0.8361700000000001
261,0.79278
262,0.7494
263,0.71143
264,0.7025
265,0.69708
266,0.69708
267,0.6922699999999999
268,0.68461
269,0.64604
270,0.6026600000000001
271,0.55928
272,0.5240600000000001
273,0.50493
274,0.49675
275,0.49675
276,0.49675
277,0.49675
278,0.49675
279,0.49675
280,0.49675
281,0.4895
282,0.47546000000000005
283,0.43933
284,0.39595
285,0.35257
286,0.30918
287,0.2658
288,0.22241999999999998
289,0.17903
290,0.13565
291,0.092266
292,0.048882999999999996
293,0.005499100000000001
294,-0.037883999999999994
295,-0.064752
296,-0.067304
297,-0.040436
298,0.0029471
299,0.046331
300,0.085556
301,0.091936
302,0.096094
303,0.096094
304,0.10206
305,0.11227000000000001
306,0.14969000000000002
307,0.19307
308,0.23645
309,0.27201
310,0.2886
311,0.29641999999999996
312,0.29641999999999996
313,0.29641999999999996
314,0.29641999999999996
