time,value
0,-0.21569000000000002
1,-0.21569000000000002
2,-0.21569000000000002
3,-0.21569000000000002
4,-0.21569000000000002
5,-0.21569000000000002
6,-0.21569000000000002
7,-0.21569000000000002
8,-0.21569000000000002
9,-0.21569000000000002
10,-0.21569000000000002
11,-0.21569000000000002
12,-0.21569000000000002
13,-0.21569000000000002
14,-0.21569000000000002
15,-0.21569000000000002
16,-0.21569000000000002
17,-0.21569000000000002
18,-0.21569000000000002
19,-0.21569000000000002
20,-0.21569000000000002
21,-0.21569000000000002
22,-0.21569000000000002
23,-0.21569000000000002
24,-0.21569000000000002
25,-0.21569000000000002
26,-0.21569000000000002
27,-0.21569000000000002
28,-0.21569000000000002
29,-0.21569000000000002
30,-0.21569000000000002
31,-0.21569000000000002
32,-0.21569000000000002
33,-0.21569000000000002
34,-0.21569000000000002
35,-0.21569000000000002
36,-0.21569000000000002
37,-0.21569000000000002
38,-0.21569000000000002
39,-0.21569000000000002
40,-0.21569000000000002
41,-0.21569000000000002
42,-0.21569000000000002
43,-0.21569000000000002
44,-0.21569000000000002
45,-0.21569000000000002
46,-0.21569000000000002
47,-0.21569000000000002
48,-0.21569000000000002
49,-0.21569000000000002
50,-0.21569000000000002
51,-0.21569000000000002
52,-0.21569000000000002
53,-0.21569000000000002
54,-0.21569000000000002
55,-0.21569000000000002
56,-0.21569000000000002
57,-0.21569000000000002
58,-0.21569000000000002
59,-0.21569000000000002
60,-0.21569000000000002
61,-0.21569000000000002
62,-0.21569000000000002
63,-0.21569000000000002
64,-0.21569000000000002
65,-0.21569000000000002
66,-0.21569000000000002
67,-0.21569000000000002
68,-0.21569000000000002
69,-0.21569000000000002
70,-0.21569000000000002
71,-0.21569000000000002
72,-0.21569000000000002
73,-0.21569000000000002
74,-0.21569000000000002
75,-0.21569000000000002
76,-0.21569000000000002
77,-0.21569000000000002
78,-0.21569000000000002
79,-0.21569000000000002
80,-0.21569000000000002
81,-0.21569000000000002
82,-0.21569000000000002
83,-0.21569000000000002
84,-0.21569000000000002
85,-0.21569000000000002
86,-0.21569000000000002
87,-0.21569000000000002
88,-0.21569000000000002
89,-0.21569000000000002
90,-0.21569000000000002
91,-0.21569000000000002
92,-0.21569000000000002
93,-0.21569000000000002
94,-0.21569000000000002
95,-0.21569000000000002
96,-0.21569000000000002
97,-0.21569000000000002
98,-0.21569000000000002
99,-0.21569000000000002
100,-0.21569000000000002
101,-0.21569000000000002
102,-0.21569000000000002
103,-0.21569000000000002
104,-0.21569000000000002
105,-0.21569000000000002
106,-0.21569000000000002
107,-0.21569000000000002
108,-0.21569000000000002
109,-0.21569000000000002
110,4.2439
111,4.2439
112,4.2439
113,4.2439
114,-0.21569000000000002
115,7.0819
116,7.0819
117,7.0819
118,7.0819
119,-0.14812
120,0.12215999999999999
121,0.12215999999999999
122,0.12215999999999999
123,0.12215999999999999
124,-0.14812
125,-0.21569000000000002
126,-0.21569000000000002
127,-0.21569000000000002
128,-0.21569000000000002
129,-0.21569000000000002
130,-0.21569000000000002
131,-0.21569000000000002
132,-0.21569000000000002
133,-0.21569000000000002
134,-0.21569000000000002
135,-0.21569000000000002
136,-0.21569000000000002
137,-0.21569000000000002
138,-0.21569000000000002
139,-0.21569000000000002
140,-0.21569000000000002
141,-0.21569000000000002
142,-0.21569000000000002
143,-0.21569000000000002
144,-0.21569000000000002
145,-0.21569000000000002
146,-0.21569000000000002
147,-0.21569000000000002
148,-0.21569000000000002
149,-0.21569000000000002
150,-0.21569000000000002
151,-0.21569000000000002
152,-0.21569000000000002
153,-0.21569000000000002
154,-0.21569000000000002
155,-0.21569000000000002
156,-0.21569000000000002
157,-0.21569000000000002
158,-0.21569000000000002
159,-0.21569000000000002
160,-0.21569000000000002
161,-0.21569000000000002
162,-0.21569000000000002
163,-0.21569000000000002
164,-0.21569000000000002
165,-0.21569000000000002
166,-0.21569000000000002
167,-0.21569000000000002
168,-0.21569000000000002
169,-0.21569000000000002
170,-0.21569000000000002
171,-0.21569000000000002
172,-0.21569000000000002
173,-0.21569000000000002
174,-0.21569000000000002
175,-0.21569000000000002
176,-0.21569000000000002
177,-0.21569000000000002
178,-0.21569000000000002
179,-0.21569000000000002
180,-0.21569000000000002
181,-0.21569000000000002
182,-0.21569000000000002
183,-0.21569000000000002
184,-0.21569000000000002
185,-0.21569000000000002
186,-0.21569000000000002
187,-0.21569000000000002
188,-0.21569000000000002
189,-0.21569000000000002
190,-0.21569000000000002
191,-0.21569000000000002
192,-0.21569000000000002
193,-0.21569000000000002
194,-0.21569000000000002
195,-0.21569000000000002
196,-0.21569000000000002
197,-0.21569000000000002
198,-0.21569000000000002
199,-0.21569000000000002
200,6.8341
201,6.8341
202,6.8341
203,6.8341
204,-0.14812
205,-0.1256
206,-0.1256
207,-0.1256
208,-0.1256
209,-0.21569000000000002
210,-0.21569000000000002
211,-0.21569000000000002
212,-0.21569000000000002
213,-0.21569000000000002
214,-0.21569000000000002
215,0.032064999999999996
216,0.032064999999999996
217,0.032064999999999996
218,0.032064999999999996
219,-0.21569000000000002
220,1.6763
221,1.6763
222,1.6763
223,1.6763
224,-0.21569000000000002
225,-0.14812
226,-0.14812
227,-0.14812
228,-0.14812
229,-0.21569000000000002
230,-0.21569000000000002
231,-0.21569000000000002
232,-0.21569000000000002
233,-0.21569000000000002
234,-0.21569000000000002
235,-0.21569000000000002
236,-0.21569000000000002
237,-0.21569000000000002
238,-0.21569000000000002
239,-0.21569000000000002
240,-0.21569000000000002
241,-0.21569000000000002
242,-0.21569000000000002
243,-0.21569000000000002
244,-0.21569000000000002
245,-0.21569000000000002
246,-0.21569000000000002
247,-0.21569000000000002
248,-0.21569000000000002
249,-0.21569000000000002
250,-0.21569000000000002
251,-0.21569000000000002
252,-0.21569000000000002
253,-0.21569000000000002
254,-0.21569000000000002
255,-0.21569000000000002
256,-0.21569000000000002
257,-0.21569000000000002
258,-0.21569000000000002
259,-0.21569000000000002
260,-0.21569000000000002
261,-0.21569000000000002
262,-0.21569000000000002
263,-0.21569000000000002
264,-0.21569000000000002
265,-0.21569000000000002
266,-0.21569000000000002
267,-0.21569000000000002
268,-0.21569000000000002
269,-0.21569000000000002
270,-0.21569000000000002
271,-0.21569000000000002
272,-0.21569000000000002
273,-0.21569000000000002
274,-0.21569000000000002
275,-0.21569000000000002
276,-0.21569000000000002
277,-0.21569000000000002
278,-0.21569000000000002
279,-0.21569000000000002
280,-0.21569000000000002
281,-0.21569000000000002
282,-0.21569000000000002
283,-0.21569000000000002
284,-0.21569000000000002
285,-0.21569000000000002
286,-0.21569000000000002
287,-0.21569000000000002
288,-0.21569000000000002
289,-0.21569000000000002
290,-0.21569000000000002
291,-0.21569000000000002
292,-0.21569000000000002
293,-0.21569000000000002
294,-0.21569000000000002
295,-0.21569000000000002
296,-0.21569000000000002
297,-0.21569000000000002
298,-0.21569000000000002
299,-0.21569000000000002
300,-0.21569000000000002
301,-0.21569000000000002
302,-0.21569000000000002
303,-0.21569000000000002
304,-0.21569000000000002
305,-0.21569000000000002
306,-0.21569000000000002
307,-0.21569000000000002
308,-0.21569000000000002
309,-0.21569000000000002
310,-0.21569000000000002
311,-0.21569000000000002
312,-0.21569000000000002
313,-0.21569000000000002
314,-0.21569000000000002
315,-0.21569000000000002
316,-0.21569000000000002
317,-0.21569000000000002
318,-0.21569000000000002
319,-0.21569000000000002
320,-0.21569000000000002
321,-0.21569000000000002
322,-0.21569000000000002
323,-0.21569000000000002
324,-0.21569000000000002
325,-0.21569000000000002
326,-0.21569000000000002
327,-0.21569000000000002
328,-0.21569000000000002
329,-0.21569000000000002
330,-0.21569000000000002
331,-0.21569000000000002
332,-0.21569000000000002
333,-0.21569000000000002
334,-0.21569000000000002
335,-0.21569000000000002
336,-0.21569000000000002
337,-0.21569000000000002
338,-0.21569000000000002
339,-0.21569000000000002
340,-0.21569000000000002
341,-0.21569000000000002
342,-0.21569000000000002
343,-0.21569000000000002
344,-0.21569000000000002
345,-0.21569000000000002
346,-0.21569000000000002
347,-0.21569000000000002
348,-0.21569000000000002
349,-0.21569000000000002
350,-0.21569000000000002
351,-0.21569000000000002
352,-0.21569000000000002
353,-0.21569000000000002
354,-0.21569000000000002
355,-0.21569000000000002
356,-0.21569000000000002
357,-0.21569000000000002
358,-0.21569000000000002
359,-0.21569000000000002
360,-0.21569000000000002
361,-0.21569000000000002
362,-0.21569000000000002
363,-0.21569000000000002
364,-0.21569000000000002
365,-0.21569000000000002
366,-0.21569000000000002
367,-0.21569000000000002
368,-0.21569000000000002
369,-0.21569000000000002
370,-0.21569000000000002
371,-0.21569000000000002
372,-0.21569000000000002
373,-0.21569000000000002
374,-0.21569000000000002
375,-0.21569000000000002
376,-0.21569000000000002
377,-0.21569000000000002
378,-0.21569000000000002
379,-0.21569000000000002
380,-0.21569000000000002
381,-0.21569000000000002
382,-0.21569000000000002
383,-0.21569000000000002
384,-0.21569000000000002
385,-0.21569000000000002
386,-0.21569000000000002
387,-0.21569000000000002
388,-0.21569000000000002
389,-0.21569000000000002
390,-0.21569000000000002
391,-0.21569000000000002
392,-0.21569000000000002
393,-0.21569000000000002
394,-0.21569000000000002
395,-0.21569000000000002
396,-0.21569000000000002
397,-0.21569000000000002
398,-0.21569000000000002
399,-0.21569000000000002
400,-0.21569000000000002
401,-0.21569000000000002
402,-0.21569000000000002
403,-0.21569000000000002
404,-0.21569000000000002
405,-0.21569000000000002
406,-0.21569000000000002
407,-0.21569000000000002
408,-0.21569000000000002
409,-0.21569000000000002
410,-0.21569000000000002
411,-0.21569000000000002
412,-0.21569000000000002
413,-0.21569000000000002
414,-0.21569000000000002
415,-0.21569000000000002
416,-0.21569000000000002
417,-0.21569000000000002
418,-0.21569000000000002
419,-0.21569000000000002
420,-0.21569000000000002
421,-0.21569000000000002
422,-0.21569000000000002
423,-0.21569000000000002
424,-0.21569000000000002
425,-0.21569000000000002
426,-0.21569000000000002
427,-0.21569000000000002
428,-0.21569000000000002
429,-0.21569000000000002
430,-0.21569000000000002
431,-0.21569000000000002
432,-0.21569000000000002
433,-0.21569000000000002
434,-0.21569000000000002
435,-0.21569000000000002
436,-0.21569000000000002
437,-0.21569000000000002
438,-0.21569000000000002
439,-0.21569000000000002
440,-0.21569000000000002
441,-0.21569000000000002
442,-0.21569000000000002
443,-0.21569000000000002
444,-0.21569000000000002
445,4.5367
446,4.5367
447,4.5367
448,4.5367
449,-0.14812
450,-0.19317
451,-0.19317
452,-0.19317
453,-0.19317
454,-0.14812
455,-0.21569000000000002
456,-0.21569000000000002
457,-0.21569000000000002
458,-0.21569000000000002
459,-0.21569000000000002
460,-0.21569000000000002
461,-0.21569000000000002
462,-0.21569000000000002
463,-0.21569000000000002
464,-0.21569000000000002
465,-0.21569000000000002
466,-0.21569000000000002
467,-0.21569000000000002
468,-0.21569000000000002
469,-0.21569000000000002
470,-0.21569000000000002
471,-0.21569000000000002
472,-0.21569000000000002
473,-0.21569000000000002
474,-0.21569000000000002
475,-0.21569000000000002
476,-0.21569000000000002
477,-0.21569000000000002
478,-0.21569000000000002
479,-0.21569000000000002
480,2.3069
481,2.3069
482,2.3069
483,2.3069
484,-0.21569000000000002
485,-0.17065
486,-0.17065
487,-0.17065
488,-0.17065
489,-0.21569000000000002
490,-0.21569000000000002
491,-0.21569000000000002
492,-0.21569000000000002
493,-0.21569000000000002
494,-0.21569000000000002
495,-0.21569000000000002
496,-0.21569000000000002
497,-0.21569000000000002
498,-0.21569000000000002
499,-0.21569000000000002
500,-0.21569000000000002
501,-0.21569000000000002
502,-0.21569000000000002
503,-0.21569000000000002
504,-0.21569000000000002
505,3.7484
506,3.7484
507,3.7484
508,3.7484
509,-0.19317
510,-0.21569000000000002
511,-0.21569000000000002
512,-0.21569000000000002
513,-0.21569000000000002
514,-0.19317
515,-0.21569000000000002
516,-0.21569000000000002
517,-0.21569000000000002
518,-0.21569000000000002
519,-0.21569000000000002
520,-0.21569000000000002
521,-0.21569000000000002
522,-0.21569000000000002
523,-0.21569000000000002
524,-0.21569000000000002
525,0.39244
526,0.39244
527,0.39244
528,0.39244
529,-0.19317
530,1.2483
531,1.2483
532,1.2483
533,1.2483
534,-0.21569000000000002
535,-0.21569000000000002
536,-0.21569000000000002
537,-0.21569000000000002
538,-0.21569000000000002
539,-0.19317
540,-0.21569000000000002
541,-0.21569000000000002
542,-0.21569000000000002
543,-0.21569000000000002
544,-0.21569000000000002
545,-0.21569000000000002
546,-0.21569000000000002
547,-0.21569000000000002
548,-0.21569000000000002
549,-0.21569000000000002
550,-0.21569000000000002
551,-0.21569000000000002
552,-0.21569000000000002
553,-0.21569000000000002
554,-0.21569000000000002
555,-0.21569000000000002
556,-0.21569000000000002
557,-0.21569000000000002
558,-0.21569000000000002
559,-0.21569000000000002
560,-0.21569000000000002
561,-0.21569000000000002
562,-0.21569000000000002
563,-0.21569000000000002
564,-0.21569000000000002
565,-0.21569000000000002
566,-0.21569000000000002
567,-0.21569000000000002
568,-0.21569000000000002
569,-0.21569000000000002
570,-0.21569000000000002
571,-0.21569000000000002
572,-0.21569000000000002
573,-0.21569000000000002
574,-0.21569000000000002
575,-0.21569000000000002
576,-0.21569000000000002
577,-0.21569000000000002
578,-0.21569000000000002
579,-0.21569000000000002
580,-0.21569000000000002
581,-0.21569000000000002
582,-0.21569000000000002
583,-0.21569000000000002
584,-0.21569000000000002
585,3.5682
586,3.5682
587,3.5682
588,3.5682
589,-0.21569000000000002
590,-0.1256
591,-0.1256
592,-0.1256
593,-0.1256
594,-0.1256
595,-0.21569000000000002
596,-0.21569000000000002
597,-0.21569000000000002
598,-0.21569000000000002
599,-0.21569000000000002
600,-0.21569000000000002
601,-0.21569000000000002
602,-0.21569000000000002
603,-0.21569000000000002
604,-0.21569000000000002
605,-0.21569000000000002
606,-0.21569000000000002
607,-0.21569000000000002
608,-0.21569000000000002
609,-0.21569000000000002
610,-0.21569000000000002
611,-0.21569000000000002
612,-0.21569000000000002
613,-0.21569000000000002
614,-0.21569000000000002
615,-0.21569000000000002
616,-0.21569000000000002
617,-0.21569000000000002
618,-0.21569000000000002
619,-0.21569000000000002
620,-0.21569000000000002
621,-0.21569000000000002
622,-0.21569000000000002
623,-0.21569000000000002
624,-0.21569000000000002
625,-0.21569000000000002
626,-0.21569000000000002
627,-0.21569000000000002
628,-0.21569000000000002
629,-0.21569000000000002
630,-0.21569000000000002
631,-0.21569000000000002
632,-0.21569000000000002
633,-0.21569000000000002
634,-0.21569000000000002
635,-0.21569000000000002
636,-0.21569000000000002
637,-0.21569000000000002
638,-0.21569000000000002
639,-0.21569000000000002
640,-0.21569000000000002
641,-0.21569000000000002
642,-0.21569000000000002
643,-0.21569000000000002
644,-0.21569000000000002
645,-0.21569000000000002
646,-0.21569000000000002
647,-0.21569000000000002
648,-0.21569000000000002
649,-0.21569000000000002
650,-0.21569000000000002
651,-0.21569000000000002
652,-0.21569000000000002
653,-0.21569000000000002
654,-0.21569000000000002
655,-0.21569000000000002
656,-0.21569000000000002
657,-0.21569000000000002
658,-0.21569000000000002
659,-0.21569000000000002
660,-0.21569000000000002
661,-0.21569000000000002
662,-0.21569000000000002
663,-0.21569000000000002
664,-0.21569000000000002
665,-0.21569000000000002
666,-0.21569000000000002
667,-0.21569000000000002
668,-0.21569000000000002
669,-0.21569000000000002
670,-0.21569000000000002
671,-0.21569000000000002
672,-0.21569000000000002
673,-0.21569000000000002
674,-0.21569000000000002
675,-0.21569000000000002
676,-0.21569000000000002
677,-0.21569000000000002
678,-0.21569000000000002
679,-0.21569000000000002
680,-0.21569000000000002
681,-0.21569000000000002
682,-0.21569000000000002
683,-0.21569000000000002
684,-0.21569000000000002
685,-0.21569000000000002
686,-0.21569000000000002
687,-0.21569000000000002
688,-0.21569000000000002
689,-0.21569000000000002
690,-0.21569000000000002
691,-0.21569000000000002
692,-0.21569000000000002
693,-0.21569000000000002
694,-0.21569000000000002
695,-0.21569000000000002
696,-0.21569000000000002
697,-0.21569000000000002
698,-0.21569000000000002
699,-0.21569000000000002
700,-0.21569000000000002
701,-0.21569000000000002
702,-0.21569000000000002
703,-0.21569000000000002
704,-0.21569000000000002
705,-0.21569000000000002
706,-0.21569000000000002
707,-0.21569000000000002
708,-0.21569000000000002
709,-0.21569000000000002
710,-0.21569000000000002
711,-0.21569000000000002
712,-0.21569000000000002
713,-0.21569000000000002
714,-0.21569000000000002
715,-0.21569000000000002
716,-0.21569000000000002
717,-0.21569000000000002
718,-0.21569000000000002
719,-0.21569000000000002
