time,value
0,1.7714
1,1.7069
2,1.6072
3,1.4654
4,1.3538
5,1.2204
6,1.0897
7,0.9830899999999999
8,0.85383
9,0.7469600000000001
10,0.62038
11,0.49463
12,0.39086
13,0.26864
14,0.16746
15,0.04664
16,-0.072479
17,-0.16884000000000002
18,-0.28846
19,-0.40669
20,-0.49681000000000003
21,-0.61057
22,-0.70194
23,-0.7911600000000001
24,-0.8809
25,-0.96914
26,-1.0428
27,-1.1192
28,-1.1853
29,-1.2353
30,-1.2788
31,-1.2923
32,-1.3034
33,-1.2957
34,-1.266
35,-1.226
36,-1.1452
37,-1.0835
38,-0.9996799999999999
39,-0.90754
40,-0.8258200000000001
41,-0.7348600000000001
42,-0.6453899999999999
43,-0.53517
44,-0.43168999999999996
45,-0.34415999999999997
46,-0.23465
47,-0.14268
48,-0.035189
49,0.080833
50,0.17774
51,0.29624
52,0.4116
53,0.51158
54,0.63305
55,0.72836
56,0.8491299999999999
57,0.9691299999999999
58,1.0713
59,1.1933
60,1.2976
61,1.4236
62,1.5502
63,1.656
64,1.7625
65,1.6809
66,1.5518
67,1.4239
68,1.3177
69,1.1908
70,1.0852
71,0.9585799999999999
72,0.83215
73,0.72705
74,0.60104
75,0.49642
76,0.36975
77,0.2444
78,0.13894
79,0.014086000000000001
80,-0.11027
81,-0.2154
82,-0.33891
83,-0.44068
84,-0.5624
85,-0.68707
86,-0.7859999999999999
87,-0.9036700000000001
88,-0.99856
89,-1.1102
90,-1.226
91,-1.3088
92,-1.4004
93,-1.4779
94,-1.5372
95,-1.5655
96,-1.5785
97,-1.5396
98,-1.5002
99,-1.4136
100,-1.3137
101,-1.2353
102,-1.1335
103,-1.0442
104,-0.9329700000000001
105,-0.8186100000000001
106,-0.7215199999999999
107,-0.60336
108,-0.51054
109,-0.38954
110,-0.26771
111,-0.16567
112,-0.042704
113,0.08072599999999999
114,0.18388
115,0.30796999999999997
116,0.41577
117,0.54427
118,0.66868
119,0.7764800000000001
120,0.9011
121,1.0051
122,1.1337
123,1.2623
124,1.3738
125,1.5103
126,1.6264
127,1.7549
