time,value
0,1.3832
1,1.3832
2,1.3832
3,1.3832
4,1.3832
5,1.3832
6,1.3832
7,1.3832
8,1.3832
9,1.3832
10,1.3832
11,1.3832
12,1.3832
13,1.3832
14,1.3832
15,1.3832
16,1.3832
17,1.3832
18,1.3832
19,1.3832
20,1.3832
21,1.3832
22,1.3832
23,1.3832
24,1.3832
25,1.3832
26,1.3832
27,1.3832
28,1.3832
29,1.3832
30,1.3832
31,1.3832
32,1.3832
33,1.3832
34,1.3832
35,1.3832
36,1.3832
37,1.3832
38,1.3832
39,1.3832
40,1.3832
41,1.3832
42,1.3832
43,1.3832
44,1.3832
45,1.3832
46,1.3832
47,1.3832
48,1.3832
49,1.3832
50,1.3832
51,1.3832
52,1.3832
53,1.3832
54,1.3832
55,1.3832
56,1.3832
57,1.3832
58,1.3832
59,1.3832
60,1.3832
61,1.3832
62,1.3832
63,1.3832
64,1.3813
65,1.3724
66,1.3553
67,1.3321
68,1.3089
69,1.2881
70,1.2727
71,1.2677
72,1.2677
73,1.2677
74,1.265
75,1.2584
76,1.239
77,1.2158
78,1.1927
79,1.1695
80,1.1463
81,1.1232
82,1.1
83,1.0768
84,1.0549
85,1.034
86,1.022
87,1.0104
88,0.9988299999999999
89,0.98611
90,0.97235
91,0.9491700000000001
92,0.9259999999999999
93,0.9028299999999999
94,0.8805200000000001
95,0.85998
96,0.84839
97,0.8368
98,0.8252200000000001
99,0.81363
100,0.80204
101,0.79046
102,0.77887
103,0.7672899999999999
104,0.7557
105,0.74411
106,0.73253
107,0.7209399999999999
108,0.70935
109,0.69777
110,0.68618
111,0.6745899999999999
112,0.66301
113,0.65142
114,0.63983
115,0.62279
116,0.60072
117,0.57767
118,0.5545
119,0.53133
120,0.50815
121,0.48498
122,0.46181000000000005
123,0.43863
124,0.41546000000000005
125,0.38564
126,0.35293
127,0.31817
128,0.28341
129,0.24865
130,0.22096999999999997
131,0.1955
132,0.17232999999999998
133,0.14916
134,0.12598
135,0.09539600000000001
136,0.063085
137,0.028326
138,-0.0064339
139,-0.041193
140,-0.06830900000000001
141,-0.093976
142,-0.11715
143,-0.14032
144,-0.1635
145,-0.18667
146,-0.20984
147,-0.23301
148,-0.25619000000000003
149,-0.27936
150,-0.30253
151,-0.32571
152,-0.34888
153,-0.37205
154,-0.39358000000000004
155,-0.41068000000000005
156,-0.42428
157,-0.43587
158,-0.44746
159,-0.46307
160,-0.48568999999999996
161,-0.5171600000000001
162,-0.55192
163,-0.58668
164,-0.61916
165,-0.64895
166,-0.6733
167,-0.69647
168,-0.71965
169,-0.74038
170,-0.7591399999999999
171,-0.7713300000000001
172,-0.78291
173,-0.7945
174,-0.81107
175,-0.83054
176,-0.8653
177,-0.9000600000000001
178,-0.9348200000000001
179,-0.9671299999999999
180,-0.99772
181,-1.0209
182,-1.0441
183,-1.0672
184,-1.0858
185,-1.1
186,-1.1
187,-1.1
188,-1.1
189,-1.1
190,-1.1
191,-1.1
192,-1.1
193,-1.1
194,-1.1
195,-1.1
196,-1.1
197,-1.1
198,-1.0999
199,-1.0987
200,-1.0926
201,-1.081
202,-1.0694
203,-1.058
204,-1.0469
205,-1.0422
206,-1.0422
207,-1.0422
208,-1.0422
209,-1.0422
210,-1.0422
211,-1.0422
212,-1.0422
213,-1.0422
214,-1.0422
215,-1.0506
216,-1.0617
217,-1.0733
218,-1.0849
219,-1.0965
220,-1.1081
221,-1.1197
222,-1.1312
223,-1.1428
224,-1.1544
225,-1.1566
226,-1.1577
227,-1.1577
228,-1.1577
229,-1.1573
230,-1.148
231,-1.1377
232,-1.1261
233,-1.1145
234,-1.1029
235,-1.0913
236,-1.0797
237,-1.0682
238,-1.0566
239,-1.045
240,-1.0334
241,-1.0218
242,-1.0102
243,-0.99864
244,-0.98705
245,-0.9754700000000001
246,-0.96388
247,-0.95229
248,-0.94071
249,-0.9291200000000001
250,-0.9175399999999999
251,-0.90595
252,-0.89436
253,-0.8827799999999999
254,-0.8745700000000001
255,-0.8696
256,-0.86898
257,-0.86898
258,-0.86898
259,-0.86898
260,-0.86898
261,-0.86898
262,-0.86898
263,-0.86898
264,-0.86898
265,-0.86898
266,-0.86898
267,-0.86898
268,-0.86898
269,-0.86505
270,-0.85905
271,-0.84746
272,-0.83588
273,-0.82429
274,-0.8166100000000001
275,-0.81123
276,-0.81123
277,-0.81123
278,-0.81123
279,-0.80745
280,-0.80094
281,-0.78935
282,-0.77776
283,-0.76666
284,-0.76169
285,-0.7639699999999999
286,-0.77556
287,-0.78714
288,-0.79827
289,-0.8071
290,-0.81123
291,-0.81123
292,-0.81123
293,-0.81123
294,-0.81123
295,-0.81123
296,-0.81123
297,-0.81123
298,-0.81006
299,-0.80675
300,-0.7891600000000001
301,-0.76599
302,-0.74282
303,-0.72014
304,-0.69807
305,-0.68452
306,-0.67293
307,-0.66135
308,-0.64946
309,-0.63732
310,-0.6151800000000001
311,-0.59201
312,-0.56884
313,-0.54566
314,-0.52249
