time,value
0,0.54567
1,0.54567
2,0.54567
3,0.54567
4,0.54567
5,0.54567
6,0.54567
7,0.54567
8,0.54567
9,0.54567
10,0.54567
11,0.54567
12,0.57465
13,0.67682
14,0.779
15,0.80606
16,0.82835
17,0.83734
18,0.83734
19,0.83734
20,0.83734
21,0.83734
22,0.83734
23,0.83734
24,0.83734
25,0.83734
26,0.84449
27,0.87645
28,0.9084
29,0.9279200000000001
30,0.94575
31,0.9462200000000001
32,0.93173
33,0.9127
34,0.8748
35,0.8369
36,0.73483
37,0.62151
38,0.51102
39,0.40326999999999996
40,0.30339
41,0.24356999999999998
42,0.18375
43,0.1224
44,0.27605
45,-0.04173
46,-0.24191
47,-0.09865299999999999
48,-0.20269
49,-0.30672
50,-0.44748999999999994
51,-0.59797
52,-0.6995399999999999
53,-0.74078
54,-0.7751899999999999
55,-0.7510399999999999
56,-0.7268899999999999
57,-0.70755
58,-0.68971
59,-0.67933
60,-0.67933
61,-0.68005
62,-0.68971
63,-0.6993699999999999
64,-0.74028
65,-0.79267
66,-0.85414
67,-0.92994
68,-1.0067
69,-1.1033
70,-1.1999
71,-1.2952
72,-1.3899
73,-1.4763
74,-1.5476
75,-1.6186
76,-1.6665
77,-1.7145
78,-1.7464
79,-1.7706
80,-1.8025
81,-1.8505
82,-1.8984
83,-1.9240000000000002
84,-1.9493
85,-1.9881
86,-2.0346
87,-2.0751
88,-2.1019
89,-2.1286
90,-2.1529
91,-2.1771
92,-2.1766
93,-2.1607
94,-2.1269
95,-2.0448
96,-1.9627
97,-1.764
98,-1.556
99,-1.3077
100,-1.0305
101,-0.71765
102,-0.2911
103,0.13543
104,0.40759
105,0.66173
106,0.84693
107,0.9762299999999999
108,1.1006
109,1.2065
110,1.3124
111,1.3980000000000001
112,1.4805
113,1.5438
114,1.5895
115,1.6223
116,1.5959
117,1.5695
118,1.5046
119,1.4322
120,1.3597
121,1.2873
122,1.2164
123,1.1543
124,1.0923
125,1.0335
126,0.97557
127,0.91091
128,0.83845
129,0.7659999999999999
130,0.69355
131,0.6211
132,0.5544100000000001
133,0.48938999999999994
134,0.43161000000000005
135,0.3833
136,0.335
137,0.2867
138,0.2384
139,0.1901
140,0.1418
141,0.44887
142,0.22966
143,0.062340999999999994
144,-0.12412000000000001
145,-0.26345
146,-0.48663
147,-0.14307999999999998
148,-0.20143
149,-0.27165
150,-0.34118000000000004
151,-0.38799
152,-0.43481000000000003
153,-0.46453
154,-0.48645
155,-0.48427
156,-0.43596999999999997
157,-0.38766
158,-0.31521
159,-0.24276
160,-0.18567999999999998
161,-0.13663
162,-0.094926
163,-0.37403000000000003
164,-0.24584
165,-0.2312
166,-0.22005999999999998
167,-0.2159
168,-0.2159
169,-0.2159
170,-0.2159
171,-0.2159
172,-0.2159
173,-0.2159
174,-0.2159
175,-0.2159
176,-0.23899
177,-0.33002
178,-0.42105
179,-0.10231
180,-0.12646
181,-0.15061
182,-0.17477
183,-0.19534
184,-0.20351
185,-0.21169000000000002
186,-0.19925
187,-0.18402000000000002
188,-0.1562
189,-0.11756
190,-0.45283
191,-0.41753
192,-0.38224
193,-0.4797
194,-0.11457
195,-0.12628
196,-0.12591
197,-0.12163
198,-0.097483
199,-0.39424000000000003
200,-0.27349
201,-0.15273
202,-0.25228
203,0.088774
204,0.20953000000000002
205,0.33028
206,0.45103999999999994
207,0.13339
208,0.17464000000000002
209,0.22635999999999998
210,0.29101
211,0.35395
212,0.40225
213,0.45055
214,0.50366
215,0.55828
216,0.61802
217,0.6849
218,0.7500399999999999
219,0.79351
220,0.83698
221,0.8633299999999999
222,0.88339
223,0.89438
224,0.8910299999999999
225,0.88687
226,0.8653200000000001
227,0.84377
228,0.84125
229,0.8468200000000001
230,0.87675
231,0.95032
232,1.0242
233,1.1216
234,1.2189
235,1.3482
236,1.4931
237,1.6693
238,1.9093
239,2.1493
240,2.1866
241,2.2207
242,2.2056
243,2.1628
244,2.0927
245,1.9582
246,1.8237
247,1.6594
248,1.4937
249,1.3137
250,1.1245
251,0.9395
252,0.76562
253,0.59173
254,0.42232
255,0.25326
256,0.34154
257,-0.11307
258,-0.2933
259,-0.45233
260,-0.61135
261,-0.7430899999999999
262,-0.87165
263,-1.0045
264,-1.1409
265,-1.2790000000000001
266,-1.4239
267,-1.5688
268,-1.6771
269,-1.7796
270,-1.8455
271,-1.8778
272,-1.8998
273,-1.8745
274,-1.8493
275,-1.7849
276,-1.7128
277,-1.6341
278,-1.5487
279,-1.4636
280,-1.3808
281,-1.2979
282,-1.204
283,-1.1074
284,-0.99425
285,-0.86198
286,-0.72634
287,-0.56583
288,-0.40531999999999996
289,-0.30017
290,-0.21100000000000002
291,-0.13196
292,-0.35856
293,-0.28943
294,0.20395
295,0.44546
296,0.13903
297,0.18213
298,0.2158
299,0.23549
300,0.25423
301,0.25794
302,0.26166
303,0.28001
304,0.30416
305,0.32748
306,0.3494
307,0.37063
308,0.36914
309,0.36765
310,0.35061
311,0.32646
312,0.30230999999999997
313,0.27816
314,0.254
315,1.0939
316,1.0939
317,1.0939
318,1.0939
319,1.0939
320,1.0939
321,1.0939
322,1.0939
323,1.0939
324,1.0939
325,1.0939
326,1.0939
327,1.1027
328,1.1336
329,1.1645
330,1.1727
331,1.1795
332,1.1822
333,1.1822
334,1.1822
335,1.1822
336,1.1822
337,1.1822
338,1.1822
339,1.1822
340,1.1822
341,1.193
342,1.2414
343,1.2898
344,1.3193
345,1.3463
346,1.3706
347,1.3926
348,1.4214
349,1.4788
350,1.5361
351,1.5399
352,1.5343
353,1.4756
354,1.3653
355,1.2491
356,1.1029
357,0.95662
358,0.82375
359,0.6938
360,0.56628
361,0.44138999999999995
362,0.31175
363,0.15143
364,-0.07206599999999999
365,-0.14608
366,-0.27715
367,-0.3712
368,-0.41957
369,-0.47053999999999996
370,-0.54367
371,-0.6168
372,-0.68265
373,-0.74622
374,-0.79497
375,-0.8231
376,-0.8491299999999999
377,-0.8491299999999999
378,-0.8491299999999999
379,-0.8491299999999999
380,-0.8491299999999999
381,-0.85109
382,-0.85615
383,-0.8628
384,-0.9033100000000001
385,-0.94381
386,-1.0052
387,-1.0755
388,-1.1332
389,-1.168
390,-1.2024
391,-1.2018
392,-1.2013
393,-1.1765
394,-1.14
395,-1.1152
396,-1.1147
397,-1.1141
398,-1.1141
399,-1.1141
400,-1.1357
401,-1.1695
402,-1.2041
403,-1.2407
404,-1.2772
405,-1.2837
406,-1.2888
407,-1.2907
408,-1.2907
409,-1.2829
410,-1.2536
411,-1.2244
412,-1.1623
413,-1.0976
414,-1.028
415,-0.95488
416,-0.8879299999999999
417,-0.8406799999999999
418,-0.79343
419,-0.80008
420,-0.81301
421,-0.8390000000000001
422,-0.8755700000000001
423,-0.9121299999999999
424,-0.9486899999999999
425,-0.98526
426,-1.0403
427,-1.0983
428,-1.1536
429,-1.2064
430,-1.2564
431,-1.2930000000000001
432,-1.3295
433,-1.3661
434,-1.4027
435,-1.4309
436,-1.4506
437,-1.4697
438,-1.4855
439,-1.5012
440,-1.5219
441,-1.5439
442,-1.5557
443,-1.5557
444,-1.5572
445,-1.5695
446,-1.5819
447,-1.6043
448,-1.6296
449,-1.6396
450,-1.6295
451,-1.617
452,-1.5804
453,-1.5439
454,-1.5014
455,-1.4569999999999999
456,-1.4037
457,-1.3373
458,-1.2724
459,-1.2302
460,-1.188
461,-1.1204
462,-1.0428
463,-0.9557100000000001
464,-0.85277
465,-0.75174
466,-0.71292
467,-0.67411
468,-0.61173
469,-0.53861
470,-0.46548
471,-0.39235
472,-0.31922
473,-0.28265
474,-0.24609
475,-0.23279
476,-0.23167
477,-0.22014
478,-0.18583
479,-0.15150999999999998
480,-0.11500999999999999
481,-0.41983000000000004
482,-0.33751
483,-0.31501
484,-0.25501999999999997
485,-0.10032
486,0.32345
487,0.09535199999999999
488,0.1291
489,0.31399
490,0.12569
491,0.20106
492,0.32931
493,0.45757
494,0.53
495,0.59695
496,0.6323
497,0.64355
498,0.64145
499,0.59308
500,0.5447
501,0.5151399999999999
502,0.48813999999999996
503,0.49923
504,0.5431
505,0.58458
506,0.6160800000000001
507,0.64758
508,0.61879
509,0.5794100000000001
510,0.5229
511,0.44977
512,0.37378
513,0.28321
514,0.19264
515,0.47123999999999994
516,-0.12095
517,-0.45048
518,-0.1729
519,-0.25842
520,-0.32592
521,-0.39343
522,-0.40753
523,-0.40753
524,-0.40753
525,-0.40753
526,-0.4053
527,-0.38392
528,-0.36255
529,-0.31634
530,-0.26233
531,-0.2309
532,-0.2309
533,-0.23199
534,-0.24661
535,-0.26124
536,-0.3096
537,-0.37035999999999997
538,-0.4095
539,-0.41456000000000004
540,-0.42086
541,-0.45348999999999995
542,-0.48611000000000004
543,-0.49191
544,-0.48628000000000005
545,-0.45587
546,-0.38105
547,-0.30571
548,-0.19545
549,-0.45353999999999994
550,0.21865
551,0.19551
552,0.36541
553,0.58367
554,0.80194
555,0.8838799999999999
556,0.9637600000000001
557,0.9959899999999999
558,1.0016
559,1.025
560,1.0903
561,1.1555
562,1.2283
563,1.3015
564,1.3932
565,1.4967
566,1.6097
567,1.7487
568,1.8876
569,2.0073
570,2.1254
571,2.1915
572,2.2202
573,2.242
574,2.242
575,2.242
576,2.1755
577,2.1013
578,2.0074
579,1.8977
580,1.788
581,1.6784
582,1.5687
583,1.459
584,1.3493
585,1.2396
586,1.1299
587,1.0202
588,0.9104899999999999
589,0.8008
590,0.6911
591,0.58141
592,0.48002
593,0.38721
594,0.29968
595,0.2423
596,0.18492
597,0.1561
598,0.13416
599,0.12862
600,0.14212
601,0.1569
602,0.18109
603,0.20528000000000002
604,0.20196
605,0.19071
606,0.17289000000000002
607,0.14645
608,0.12237999999999999
609,0.12237999999999999
610,0.12237999999999999
611,0.12825
612,0.13613
613,0.15012
614,0.17319
615,0.19303
616,0.16209
617,0.13115
618,0.1256
619,0.1301
620,0.14405
621,0.17386
622,0.20176
623,0.16745
624,0.13313
625,0.12315
626,0.12427
627,0.13756
628,0.17413
629,0.21069000000000002
630,2.0045
631,2.0045
632,2.0045
633,2.0045
634,2.0045
635,2.0045
636,2.0045
637,2.0045
638,2.0045
639,2.0045
640,2.0045
641,2.0045
642,1.9613
643,1.8089
644,1.6566
645,1.6162
646,1.5830000000000002
647,1.5696
648,1.5696
649,1.5696
650,1.5696
651,1.5696
652,1.5696
653,1.5696
654,1.5696
655,1.5696
656,1.54
657,1.4076
658,1.2753
659,1.1945
660,1.1206
661,1.0155
662,0.88346
663,0.73435
664,0.5143
665,0.29425
666,-0.38971
667,-0.46481999999999996
668,-0.8188
669,-1.1355
670,-1.4135
671,-1.4944
672,-1.5754
673,-1.6171
674,-1.6504
675,-1.6677
676,-1.6677
677,-1.6698
678,-1.6852
679,-1.7006
680,-1.7242
681,-1.7501
682,-1.7557
683,-1.7363
684,-1.7127
685,-1.6527
686,-1.5926
687,-1.5127
688,-1.4265
689,-1.3249
690,-1.2018
691,-1.087
692,-1.075
693,-1.063
694,-1.0134
695,-0.9500200000000001
696,-0.88125
697,-0.804
698,-0.72752
699,-0.66751
700,-0.60749
701,-0.54856
702,-0.49008999999999997
703,-0.43856000000000006
704,-0.39947
705,-0.36067
706,-0.34098
707,-0.32128
708,-0.31481
709,-0.31481
710,-0.30835
711,-0.28865
712,-0.26895
713,-0.24895
714,-0.22895
715,-0.18524000000000002
716,-0.1283
717,-0.40648
718,-0.19566
719,0.061979
720,0.13337000000000002
721,0.24724000000000002
722,0.25094
723,0.18477000000000002
724,0.10951
725,0.13637
726,-0.090538
727,-0.26176
728,-0.43872
729,-0.12030999999999999
730,-0.16032000000000002
731,-0.21047
732,-0.29295
733,-0.37543000000000004
734,-0.43723999999999996
735,-0.49663999999999997
736,-0.53105
737,-0.5452100000000001
738,-0.55383
739,-0.54152
740,-0.5292100000000001
741,-0.48999
742,-0.4466
743,-0.38874000000000003
744,-0.31764000000000003
745,-0.2487
746,-0.18961
747,-0.13052
748,-0.11207
749,-0.10161
750,-0.10615
751,-0.12616
752,-0.15002000000000001
753,-0.19587000000000002
754,-0.24173000000000003
755,-0.30867
756,-0.38069000000000003
757,-0.44373
758,-0.49636
759,-0.54667
760,-0.57991
761,-0.61315
762,-0.63134
763,-0.6451899999999999
764,-0.6554399999999999
765,-0.66098
766,-0.66782
767,-0.68782
768,-0.7078300000000001
769,-0.73105
770,-0.75536
771,-0.78451
772,-0.8208200000000001
773,-0.8565299999999999
774,-0.88269
775,-0.90885
776,-0.9592700000000001
777,-1.0193
778,-1.0786
779,-1.1368
780,-1.1944
781,-1.2331
782,-1.2719
783,-1.2982
784,-1.3188
785,-1.3461
786,-1.3861
787,-1.4261
788,-1.4261
789,-1.4261
790,-1.4261
791,-1.4261
792,-1.4261
793,-1.4261
794,-1.4261
795,-1.4085
796,-1.3904
797,-1.3711
798,-1.351
799,-1.331
800,-1.311
801,-1.291
802,-1.225
803,-1.1561
804,-1.043
805,-0.9002399999999999
806,-0.6995
807,-0.32834
808,0.18654
809,0.33189
810,0.61287
811,0.84359
812,1.0359
813,1.2166
814,1.357
815,1.4973
816,1.5642
817,1.6212
818,1.6647
819,1.6967
820,1.7281
821,1.7567
822,1.7853
823,1.7974
824,1.8067
825,1.8061
826,1.7959
827,1.7826
828,1.7530000000000001
829,1.7235
830,1.6853
831,1.6453
832,1.6093
833,1.5776
834,1.5475
835,1.5274
836,1.5074
837,1.4706
838,1.4294
839,1.3679
840,1.2814
841,1.1929
842,1.087
843,0.9811799999999999
844,0.8725
845,0.76293
846,0.66957
847,0.5987899999999999
848,0.5306
849,0.49459
850,0.45858000000000004
851,0.43675
852,0.42013999999999996
853,0.40997
854,0.40997
855,0.40976999999999997
856,0.40546
857,0.40116
858,0.37072
859,0.32918000000000003
860,0.28101
861,0.221
862,0.16099000000000002
863,0.47884
864,0.18032
865,-0.052066999999999995
866,-0.25211
867,-0.09785
868,-0.17725
869,-0.25666
870,-0.24268
871,-0.22729000000000002
872,-0.18524000000000002
873,-0.1283
874,-0.43312
875,-0.31155
876,-0.18999000000000002
877,-0.088999
878,0.21331
879,0.060197
880,0.077124
881,0.27098
882,-0.11352999999999999
883,-0.27355999999999997
884,-0.10285
885,-0.15824000000000002
886,-0.20773000000000003
887,-0.25297
888,-0.29358
889,-0.31943
890,-0.34529
891,-0.34165
892,-0.33457
893,-0.31321
894,-0.28028000000000003
895,-0.24845
896,-0.22075
897,-0.19305
898,-0.16189
899,-0.13019
900,-0.094148
901,-0.29828000000000005
902,-0.1076
903,0.22841999999999998
904,0.18785
905,0.2957
906,0.39573
907,0.47301000000000004
908,0.11089
909,0.11748
910,0.47365
911,0.38748
912,0.20953000000000002
913,0.13637
914,-0.15638
915,-0.28257
916,-0.39368000000000003
917,-0.39368000000000003
918,-0.39368000000000003
919,-0.39368000000000003
920,-0.39368000000000003
921,-0.38169000000000003
922,-0.354
923,-0.31982
924,-0.2198
925,-0.11977
926,-0.27794
927,0.24525999999999998
928,0.096945
929,0.11540999999999998
930,0.13875
931,0.23876999999999998
932,0.33879000000000004
933,0.44763000000000003
934,0.11750999999999999
935,0.14514000000000002
936,0.18145999999999998
937,0.21665
938,0.21541999999999997
939,0.21419000000000002
940,0.20092000000000002
941,0.18214
942,0.17668
943,0.19669
944,0.21669000000000002
