time,value
0,-0.49508
1,-0.49508
2,-0.49508
3,-0.49508
4,-0.49508
5,-0.49508
6,-0.49508
7,-0.49508
8,-0.49508
9,-0.49508
10,-0.49508
11,-0.49508
12,-0.49508
13,-0.49508
14,-0.49508
15,-0.49508
16,-0.49508
17,-0.49508
18,-0.49508
19,-0.49508
20,-0.49508
21,-0.49508
22,-0.49508
23,-0.49508
24,-0.49508
25,-0.49508
26,-0.49508
27,-0.49508
28,-0.49508
29,-0.49508
30,-0.49508
31,-0.49508
32,-0.49508
33,-0.49508
34,-0.49508
35,-0.49508
36,-0.49508
37,-0.49508
38,-0.49508
39,-0.49508
40,-0.49508
41,-0.49508
42,-0.49508
43,-0.49508
44,-0.49508
45,-0.49508
46,-0.49508
47,-0.49508
48,-0.49508
49,-0.49508
50,-0.49508
51,-0.49508
52,-0.49508
53,-0.49508
54,-0.49508
55,-0.49508
56,-0.49508
57,-0.49508
58,-0.49508
59,-0.49508
60,-0.49508
61,-0.49508
62,-0.49508
63,-0.49508
64,-0.49508
65,-0.49508
66,-0.49508
67,-0.49508
68,-0.49508
69,-0.49508
70,-0.49508
71,-0.49508
72,-0.49508
73,-0.49508
74,-0.49508
75,-0.49508
76,-0.49508
77,-0.49508
78,-0.49508
79,-0.49508
80,-0.49508
81,-0.49508
82,-0.49508
83,-0.49508
84,-0.49508
85,-0.49508
86,-0.49508
87,-0.49508
88,-0.49508
89,-0.49508
90,-0.49508
91,-0.49508
92,-0.49508
93,-0.49508
94,-0.49508
95,-0.49508
96,-0.49508
97,-0.49508
98,-0.49508
99,-0.49508
100,-0.49508
101,-0.49508
102,-0.49508
103,-0.49508
104,-0.49508
105,-0.49508
106,-0.49508
107,-0.49508
108,-0.49508
109,-0.49508
110,-0.49508
111,-0.49508
112,-0.49508
113,-0.49508
114,-0.49508
115,-0.49508
116,-0.49508
117,-0.49508
118,-0.49508
119,-0.49508
120,-0.49508
121,-0.49508
122,-0.49508
123,-0.49508
124,-0.49508
125,-0.49508
126,-0.49508
127,-0.49508
128,-0.49508
129,-0.49508
130,-0.49508
131,-0.49508
132,-0.49508
133,-0.49508
134,-0.49508
135,-0.49508
136,-0.49508
137,-0.49508
138,-0.49508
139,-0.49508
140,-0.49508
141,-0.49508
142,-0.49508
143,-0.49508
144,-0.49508
145,-0.49508
146,-0.49508
147,-0.49508
148,-0.49508
149,-0.49508
150,-0.49508
151,-0.49508
152,-0.49508
153,-0.49508
154,-0.49508
155,-0.49508
156,-0.49508
157,-0.49508
158,-0.49508
159,-0.49508
160,-0.49508
161,-0.49508
162,-0.49508
163,-0.49508
164,-0.49508
165,-0.49508
166,-0.49508
167,-0.49508
168,-0.49508
169,-0.49508
170,-0.49508
171,-0.49508
172,-0.49508
173,-0.49508
174,-0.49508
175,-0.49508
176,-0.49508
177,-0.49508
178,-0.49508
179,-0.49508
180,-0.49508
181,-0.49508
182,-0.49508
183,-0.49508
184,-0.49508
185,-0.49508
186,-0.49508
187,-0.49508
188,-0.49508
189,-0.49508
190,-0.49508
191,-0.49508
192,-0.49508
193,-0.49508
194,-0.49508
195,-0.49508
196,-0.49508
197,-0.49508
198,-0.49508
199,-0.49508
200,-0.49508
201,-0.49508
202,-0.49508
203,-0.49508
204,-0.49508
205,-0.49508
206,-0.49508
207,-0.49508
208,-0.49508
209,-0.49508
210,-0.49508
211,-0.49508
212,-0.49508
213,-0.49508
214,-0.49508
215,-0.49508
216,-0.49508
217,-0.49508
218,-0.49508
219,-0.49508
220,-0.49508
221,-0.49508
222,-0.49508
223,-0.49508
224,-0.49508
225,-0.49508
226,-0.49508
227,-0.49508
228,-0.49508
229,-0.49508
230,-0.49508
231,-0.49508
232,-0.49508
233,-0.49508
234,-0.49508
235,-0.49508
236,-0.49508
237,-0.49508
238,-0.49508
239,-0.49508
240,-0.49508
241,-0.49508
242,-0.49508
243,-0.49508
244,-0.49508
245,-0.49508
246,-0.49508
247,-0.49508
248,-0.49508
249,-0.49508
250,-0.49508
251,-0.49508
252,-0.49508
253,-0.49508
254,-0.49508
255,-0.49508
256,-0.49508
257,-0.49508
258,-0.49508
259,-0.49508
260,-0.49508
261,-0.49508
262,-0.49508
263,-0.49508
264,-0.49508
265,-0.49508
266,-0.49508
267,-0.49508
268,-0.49508
269,-0.49508
270,-0.49508
271,-0.49508
272,-0.49508
273,-0.49508
274,-0.49508
275,-0.49508
276,-0.49508
277,-0.49508
278,-0.49508
279,-0.49508
280,-0.49508
281,-0.49508
282,-0.49508
283,-0.49508
284,-0.49508
285,-0.49508
286,-0.49508
287,-0.49508
288,-0.49508
289,-0.49508
290,-0.49508
291,-0.49508
292,-0.49508
293,-0.49508
294,-0.49508
295,-0.49508
296,-0.49508
297,-0.49508
298,-0.49508
299,-0.49508
300,-0.49508
301,-0.49508
302,-0.49508
303,-0.49508
304,-0.49508
305,-0.49508
306,-0.49508
307,-0.49508
308,-0.49508
309,-0.49508
310,-0.49508
311,-0.49508
312,-0.49508
313,-0.49508
314,-0.49508
315,-0.49508
316,-0.49508
317,-0.49508
318,-0.49508
319,-0.49508
320,-0.49508
321,-0.49508
322,-0.49508
323,-0.49508
324,-0.49508
325,-0.49508
326,-0.49508
327,-0.49508
328,-0.49508
329,-0.49508
330,-0.49508
331,-0.49508
332,-0.49508
333,-0.49508
334,-0.49508
335,-0.49508
336,-0.49508
337,-0.49508
338,-0.49508
339,-0.49508
340,-0.49508
341,-0.49508
342,-0.49508
343,-0.49508
344,-0.49508
345,-0.49508
346,-0.49508
347,-0.49508
348,-0.49508
349,-0.49508
350,-0.49508
351,-0.49508
352,-0.49508
353,-0.49508
354,-0.49508
355,-0.49508
356,-0.49508
357,-0.49508
358,-0.49508
359,-0.49508
360,-0.49508
361,-0.49508
362,-0.49508
363,-0.49508
364,-0.49508
365,-0.49508
366,-0.49508
367,-0.49508
368,-0.49508
369,-0.49508
370,-0.49508
371,-0.49508
372,-0.49508
373,-0.49508
374,-0.49508
375,-0.49508
376,-0.49508
377,-0.49508
378,-0.49508
379,-0.49508
380,-0.49508
381,-0.49508
382,-0.49508
383,-0.49508
384,-0.49508
385,-0.49508
386,-0.49508
387,-0.49508
388,-0.49508
389,-0.49508
390,-0.49508
391,-0.49508
392,-0.49508
393,-0.49508
394,-0.49508
395,-0.49508
396,-0.49508
397,-0.49508
398,-0.49508
399,-0.49508
400,-0.49508
401,-0.49508
402,-0.49508
403,-0.49508
404,-0.49508
405,-0.49508
406,-0.49508
407,-0.49508
408,-0.49508
409,-0.49508
410,-0.49508
411,-0.49508
412,-0.49508
413,-0.49508
414,-0.49508
415,-0.49508
416,-0.49508
417,-0.49508
418,-0.49508
419,-0.49508
420,-0.49508
421,-0.49508
422,-0.49508
423,-0.49508
424,-0.49508
425,-0.49508
426,-0.49508
427,-0.49508
428,-0.49508
429,-0.49508
430,-0.49508
431,-0.49508
432,-0.49508
433,-0.49508
434,-0.49508
435,-0.49508
436,-0.49508
437,-0.49508
438,-0.49508
439,-0.49508
440,-0.49508
441,-0.49508
442,-0.49508
443,-0.49508
444,-0.49508
445,-0.49508
446,-0.49508
447,-0.49508
448,-0.49508
449,-0.49508
450,-0.49508
451,-0.49508
452,-0.49508
453,-0.49508
454,-0.49508
455,-0.49508
456,-0.49508
457,-0.49508
458,-0.49508
459,-0.49508
460,-0.49508
461,-0.49508
462,-0.49508
463,-0.49508
464,-0.49508
465,-0.49508
466,-0.49508
467,-0.49508
468,-0.49508
469,-0.49508
470,-0.49508
471,-0.49508
472,-0.49508
473,-0.49508
474,-0.49508
475,-0.49508
476,-0.49508
477,-0.49508
478,-0.49508
479,-0.49508
480,-0.49508
481,-0.49508
482,-0.49508
483,-0.49508
484,-0.49508
485,-0.49508
486,-0.49508
487,-0.49508
488,-0.49508
489,-0.49508
490,-0.49508
491,-0.49508
492,-0.49508
493,-0.49508
494,-0.49508
495,-0.49508
496,-0.49508
497,-0.49508
498,-0.49508
499,-0.49508
500,-0.49508
501,-0.49508
502,-0.49508
503,-0.49508
504,-0.49508
505,-0.49508
506,-0.49508
507,-0.49508
508,-0.49508
509,-0.49508
510,-0.49508
511,-0.49508
512,-0.49508
513,-0.49508
514,-0.49508
515,-0.49508
516,-0.49508
517,-0.49508
518,-0.49508
519,-0.49508
520,-0.49508
521,-0.49508
522,-0.49508
523,-0.49508
524,-0.49508
525,-0.49508
526,-0.49508
527,-0.49508
528,-0.49508
529,-0.49508
530,-0.49508
531,2.0709
532,2.0709
533,2.356
534,2.356
535,2.0709
536,2.356
537,2.356
538,2.0709
539,2.356
540,2.356
541,2.356
542,2.356
543,2.0709
544,2.356
545,2.356
546,2.356
547,2.356
548,2.356
549,2.356
550,2.0709
551,2.356
552,2.356
553,2.356
554,2.356
555,2.0709
556,2.356
557,2.356
558,2.356
559,2.356
560,2.356
561,2.356
562,2.0709
563,2.356
564,2.356
565,2.356
566,2.356
567,2.356
568,2.356
569,2.0709
570,2.356
571,2.356
572,2.356
573,2.0709
574,2.356
575,2.0709
576,2.356
577,2.0709
578,2.0709
579,2.0709
580,2.0709
581,2.0709
582,2.0709
583,2.0709
584,1.7858
585,2.0709
586,1.7858
587,2.0709
588,1.7858
589,2.0709
590,1.7858
591,1.7858
592,1.7858
593,1.7858
594,1.7858
595,1.7858
596,1.7858
597,1.7858
598,1.5007
599,1.7858
600,1.7858
601,1.5007
602,1.7858
603,1.5007
604,1.7858
605,1.7858
606,1.5007
607,1.7858
608,1.7858
609,1.5007
610,1.7858
611,1.7858
612,1.5007
613,1.7858
614,1.5007
615,2.0709
616,1.7858
617,2.0709
618,1.7858
619,2.0709
620,1.7858
621,1.7858
622,2.0709
623,1.7858
624,2.0709
625,1.7858
626,2.0709
627,1.7858
628,2.0709
629,1.7858
630,2.0709
631,1.7858
632,2.0709
633,1.7858
634,2.0709
635,1.7858
636,2.0709
637,1.7858
638,1.7858
639,2.0709
640,1.7858
641,2.0709
642,1.7858
643,2.0709
644,1.7858
645,2.0709
646,1.7858
647,2.0709
648,1.7858
649,1.7858
650,2.0709
651,1.7858
652,2.0709
653,1.7858
654,2.0709
655,1.7858
656,2.0709
657,1.7858
658,2.0709
659,2.0709
660,1.7858
661,2.0709
662,1.7858
663,2.0709
664,1.5007
665,1.7858
666,1.7858
667,1.5007
668,1.7858
669,1.5007
670,1.7858
671,1.7858
672,1.5007
673,1.7858
674,0.075139
675,-0.42381
676,-0.49508
677,-0.49508
678,-0.49508
679,-0.49508
680,-0.49508
681,-0.49508
682,-0.49508
683,-0.49508
684,-0.49508
685,-0.49508
686,-0.49508
687,-0.49508
688,-0.49508
689,-0.49508
690,-0.49508
691,-0.49508
692,-0.49508
693,-0.49508
694,-0.49508
695,-0.49508
696,-0.49508
697,-0.49508
698,-0.49508
699,-0.49508
700,-0.49508
701,-0.49508
702,-0.49508
703,-0.49508
704,-0.49508
705,-0.49508
706,-0.49508
707,-0.49508
708,-0.49508
709,-0.49508
710,-0.49508
711,-0.49508
712,-0.49508
713,-0.49508
714,-0.49508
715,-0.49508
716,-0.49508
717,-0.49508
718,-0.49508
719,-0.49508
