time,value
0,0.24838000000000002
1,-0.23561999999999997
2,-0.39209
3,0.11525999999999999
4,-0.068008
5,0.056754
6,0.10787999999999999
7,0.0040438
8,-0.11840999999999999
9,0.32294
10,0.6378
11,0.42218999999999995
12,-0.80003
13,0.074875
14,0.5516
15,-0.92901
16,0.20442000000000002
17,0.024243999999999998
18,0.05751799999999999
19,-0.41085
20,0.40399
21,0.13163
22,0.041868
23,0.35099
24,0.15129
25,0.42861000000000005
26,0.02939
27,-0.027451999999999997
28,0.18584
29,-0.20039
30,0.33281
31,-0.45607
32,0.10196000000000001
33,-0.15454
34,-0.046954
35,0.28035
36,-0.20092000000000002
37,-0.010889
38,0.31651999999999997
39,-0.0098102
40,0.1413
41,-0.14633
42,-0.050926
43,0.54303
44,-0.094193
45,-0.2385
46,-0.26721999999999996
47,-0.053853
48,-0.26015
49,0.42855
50,0.66069
51,-0.016263999999999997
52,0.41011000000000003
53,-0.35497
54,0.23540999999999998
55,-0.074147
56,0.16391
57,-0.020611
58,-0.16885999999999998
59,-0.21861
60,0.26066
61,-0.11231
62,-0.29499000000000003
63,0.10139
64,-0.19346
65,-0.053501
66,-0.13228
67,-0.50815
68,-0.028631999999999998
69,0.11828
70,-0.43664
71,-0.27771999999999997
72,-1.5637
73,-1.5637
74,-1.5637
75,-1.5637
76,-1.5637
77,-1.5637
78,-1.5637
79,-1.5637
80,-1.5637
81,-1.5637
82,-1.5637
83,-1.5637
84,-1.5637
85,-1.5637
86,-1.5637
87,-1.5637
88,1.6167
89,1.6167
90,1.6167
91,1.6167
92,1.6167
93,1.6167
94,1.6167
95,1.6167
96,1.6167
97,1.6167
98,1.6167
99,1.6167
100,1.6167
101,1.6167
102,1.6167
103,-0.077856
104,-0.49512
105,-1.5637
106,-1.5637
107,-1.5637
108,-1.5637
109,-1.5637
110,-1.5637
111,-1.5637
112,-1.5637
113,1.6167
114,1.6167
115,1.6167
116,1.6167
117,1.6167
118,1.6167
119,1.6167
120,1.6167
121,1.0044
122,-0.32844
123,-0.13554000000000002
124,-0.0048404
125,-0.42625
126,0.059940999999999994
127,0.1647
