time,value
0,0.17952
1,0.17952
2,0.17952
3,0.17952
4,0.17952
5,0.17952
6,0.17952
7,0.17952
8,0.17952
9,0.17952
10,0.17952
11,0.17952
12,0.17952
13,0.17952
14,0.17755
15,0.15897
16,0.48034
17,0.4705
18,0.18112
19,0.28123000000000004
20,0.34371999999999997
21,0.35549000000000003
22,0.26866
23,0.17217000000000002
24,0.48613
25,0.14606
26,-0.19401
27,-0.11193
28,-0.17994000000000002
29,-0.24206999999999998
30,-0.27487
31,-0.27487
32,-0.27487
33,-0.14668
34,-0.19599
35,0.096025
36,0.16045
37,0.18199
38,0.22396
39,0.22760999999999998
40,0.20342000000000002
41,0.17952
42,0.17701
43,0.1582
44,0.09501
45,0.18479
46,0.15320999999999999
47,0.09396399999999999
48,0.43404
49,0.14970999999999998
50,0.21771999999999997
51,0.25898000000000004
52,0.2704
53,0.2704
54,0.2704
55,0.2704
56,0.25337
57,0.20223
58,0.10979000000000001
59,0.068001
60,0.066129
61,0.31103000000000003
62,0.12511
63,0.20673000000000002
64,0.34276
65,0.41851000000000005
66,0.44643999999999995
67,0.42653
68,0.35881
69,0.24661999999999998
70,0.14966
71,0.40654
72,0.14626
73,0.13202
74,0.069594
75,-0.07458300000000001
76,-0.38503000000000004
77,-0.14729
78,-0.18399000000000001
79,-0.19679000000000002
80,-0.26335
81,-0.27292
82,-0.31498000000000004
83,-0.37646
84,-0.44447
85,-0.5111600000000001
86,-0.54155
87,-0.5731
88,-0.61074
89,-0.63839
90,-0.63998
91,-0.65445
92,-0.72358
93,-0.83867
94,-0.9747
95,-1.1107
96,-1.2468
97,-1.4959
98,-1.7631
99,-2.0117
100,-2.2091
101,-2.3268
102,-2.3586
103,-2.3409
104,-2.3031
105,-2.2805
106,-2.3043
107,-2.3723
108,-2.434
109,-2.456
110,-2.456
111,-2.4447
112,-2.3811
113,-2.3133
114,-2.2453
115,-2.1996
116,-2.1630000000000003
117,-2.0809
118,-1.9448
119,-1.8088
120,-1.6857
121,-1.5818
122,-1.4938
123,-1.3809
124,-1.3604
125,-1.3153
126,-1.2745
127,-1.2536
128,-1.1291
129,-1.0467
130,-0.93952
131,-0.81262
132,-0.6765899999999999
133,-0.54056
134,-0.40453
135,-0.26850999999999997
136,-0.13248
137,0.068597
138,0.1633
139,0.34709
140,0.43561000000000005
141,0.54767
142,0.6837
143,0.8197200000000001
144,0.95575
145,1.0918
146,1.1935
147,1.2918
148,1.3913
149,1.4521
150,1.5157
151,1.6152
152,1.7025
153,1.766
154,1.8147
155,1.806
156,1.7469999999999999
157,1.679
158,1.611
159,1.5430000000000001
160,1.475
161,1.4069999999999998
162,1.306
163,1.1809
164,1.0531
165,0.9532700000000001
166,0.8548600000000001
167,0.7465
168,0.6481899999999999
169,0.5504399999999999
170,0.43183
171,0.37105
172,0.36006
173,0.31816
174,0.27410999999999996
175,0.262
176,0.20412
177,0.18458
178,0.21111999999999997
179,0.28549
180,0.39243
181,0.49373
182,0.50493
183,0.45592
184,0.38791
185,0.31649
186,0.23408
187,0.10962999999999999
188,0.46876999999999996
189,0.12945
190,0.19747
191,0.27323000000000003
192,0.39768000000000003
193,0.48673999999999995
194,0.53014
195,0.50841
196,0.41801000000000005
197,0.28198
198,0.1729
199,0.12724000000000002
200,0.15058
201,0.21569000000000002
202,0.2704
203,0.2704
204,0.2704
205,0.23098000000000002
206,0.16389
207,0.10299000000000001
208,0.47541000000000005
209,0.46876999999999996
210,0.11757999999999999
211,0.18809
212,0.29991999999999996
213,0.43595
214,0.54665
215,0.59549
216,0.56692
217,0.46711
218,0.31974
219,0.11859000000000001
220,-0.12165999999999999
221,-0.12742
222,-0.15542999999999998
223,-0.48778
224,-0.1477
225,0.40492
226,0.14969000000000002
227,0.21045
228,0.28933000000000003
229,0.39497
230,0.48805
231,0.58491
232,0.64045
233,0.6644399999999999
234,0.71327
235,0.64671
236,0.6339199999999999
237,0.6339199999999999
238,0.67387
239,0.7860199999999999
240,0.86995
241,1.0216
242,1.2368
243,1.4783
244,1.704
245,1.8791
246,1.9946
247,2.075
248,2.1315
249,2.1467
250,2.0787
251,2.0107
252,1.8883
253,1.8230000000000002
254,1.7773
255,1.6673
256,1.5819
257,1.4725
258,1.3699
259,1.2711
260,1.1685
261,1.06
262,0.96931
263,0.84635
264,0.71032
265,0.5754
266,0.44521000000000005
267,0.3772
268,0.36191
269,0.32719000000000004
270,0.24591999999999997
271,0.12646
272,0.22371999999999997
273,-0.31701999999999997
274,-0.17167000000000002
275,-0.2578
276,-0.31682
277,-0.33274000000000004
278,-0.28873000000000004
279,-0.28514
280,-0.32523
281,-0.39325
282,-0.46126000000000006
283,-0.52928
284,-0.64836
285,-0.81591
286,-0.99684
287,-1.1503
288,-1.3341
289,-1.4993
290,-1.645
291,-1.757
292,-1.8198
293,-1.8198
294,-1.8023
295,-1.7398
296,-1.6328
297,-1.4968
298,-1.3608
299,-1.2248
300,-1.1382
301,-1.0682
302,-0.9674799999999999
303,-0.80409
304,-0.73897
305,-0.6258199999999999
306,-0.51772
307,-0.43416000000000005
308,-0.36765
309,-0.25477
310,-0.16734000000000002
311,-0.24866
312,0.24301999999999999
313,0.11150999999999998
314,0.17952
315,0.17611
316,0.17611
317,0.17611
318,0.17611
319,0.17611
320,0.17611
321,0.17611
322,0.17611
323,0.17611
324,0.17611
325,0.17611
326,0.17611
327,0.17611
328,0.17611
329,0.18937
330,0.31413
331,0.14908
332,0.24045
333,0.33182
334,0.42318999999999996
335,0.49486
336,0.51456
337,0.45624
338,0.32809
339,0.16153
340,-0.065923
341,-0.14028
342,-0.17720999999999998
343,-0.46153
344,0.078845
345,0.46953999999999996
346,0.22568000000000002
347,0.49978
348,0.6016699999999999
349,0.81499
350,1.0404
351,1.2183
352,1.3386
353,1.4864
354,1.5827
355,1.6172
356,1.6172
357,1.6138
358,1.5886
359,1.5195
360,1.4886
361,1.443
362,1.3516
363,1.2603
364,1.3359999999999999
365,1.3085
366,1.2303
367,1.139
368,1.0476
369,0.95624
370,0.86487
371,0.79637
372,0.74041
373,0.66894
374,0.53286
375,0.50454
376,0.4439
377,0.39636
378,0.39636
379,0.39636
380,0.31539
381,0.22607
382,0.1347
383,0.24220999999999998
384,-0.22596
385,-0.19416
386,-0.36958
387,-0.53088
388,-0.66786
389,-0.79067
390,-0.9306399999999999
391,-0.9465600000000001
392,-0.9465600000000001
393,-0.9465600000000001
394,-0.9637399999999999
395,-1.0532
396,-1.1445
397,-1.1819
398,-1.1907
399,-1.1907
400,-1.1907
401,-1.1907
402,-1.2251
403,-1.2556
404,-1.2386
405,-1.1515
406,-1.099
407,-1.1626
408,-1.1932
409,-1.2335
410,-1.3249
411,-1.4162
412,-1.5076
413,-1.599
414,-1.7218
415,-1.8698
416,-1.9938
417,-2.0366
418,-1.9803
419,-1.8789
420,-1.8011
421,-1.7994
422,-1.7819
423,-1.7085
424,-1.6791
425,-1.6791
426,-1.6640000000000001
427,-1.5784
428,-1.5609
429,-1.557
430,-1.527
431,-1.4574
432,-1.3661
433,-1.2747
434,-1.214
435,-1.1907
436,-1.1907
437,-1.1907
438,-1.1907
439,-1.1840000000000002
440,-1.1235
441,-1.0686
442,-1.0827
443,-1.1663
444,-1.1862
445,-1.1907
446,-1.1907
447,-1.178
448,-1.1255
449,-1.0789
450,-1.0398
451,-0.9890100000000001
452,-0.9465600000000001
453,-0.94773
454,-0.96134
455,-1.0364
456,-1.0686
457,-1.0686
458,-1.0686
459,-1.0686
460,-0.9999899999999999
461,-0.96004
462,-0.9465600000000001
463,-0.95845
464,-1.0090000000000001
465,-1.0576
466,-1.0686
467,-1.0686
468,-1.0626
469,-1.0385
470,-0.95875
471,-0.9465600000000001
472,-0.9465600000000001
473,-0.9801799999999999
474,-1.0561
475,-1.0677
476,-1.0686
477,-1.0686
478,-1.0686
479,-1.0686
480,-1.0686
481,-1.0686
482,-1.0434
483,-0.9927
484,-0.9465600000000001
485,-0.9465600000000001
486,-0.9465600000000001
487,-0.9465600000000001
488,-0.9465600000000001
489,-0.9143600000000001
490,-0.8279799999999999
491,-0.73661
492,-0.70918
493,-0.70239
494,-0.7269399999999999
495,-0.76899
496,-0.76705
497,-0.67673
498,-0.56182
499,-0.41994
500,-0.27597
501,-0.16527
502,0.27053
503,0.17611
504,-0.3721
505,-0.20064
506,-0.19324000000000002
507,-0.1825
508,0.1382
509,0.32094
510,0.48041000000000006
511,0.59296
512,0.63962
513,0.56811
514,0.43453
515,0.32423
516,0.27817
517,0.29605
518,0.38742
519,0.47878999999999994
520,0.57016
521,0.63207
522,0.62141
523,0.47367
524,0.2945
525,0.15064
526,0.44861
527,0.11098
528,0.20235
529,0.29372
530,0.36491999999999997
531,0.38645
532,0.34374
533,0.23695
534,0.29664
535,-0.12852
536,-0.31126
537,-0.4096
538,-0.34897
539,-0.2576
540,-0.16623
541,-0.34876999999999997
542,0.064186
543,0.21613000000000002
544,0.42025
545,0.13664
546,0.17073
547,0.2204
548,0.27428
549,0.27428
550,0.27428
551,0.27428
552,0.27428
553,0.27428
554,0.27428
555,0.27428
556,0.32916999999999996
557,0.44578999999999996
558,0.56794
559,0.64785
560,0.6867300000000001
561,0.77583
562,0.8672
563,0.95857
564,1.0499
565,1.1413
566,1.2327
567,1.324
568,1.3679
569,1.3730000000000002
570,1.3658
571,1.2978
572,1.262
573,1.2509
574,1.2509
575,1.2509
576,1.2509
577,1.2786
578,1.3371
579,1.3730000000000002
580,1.3745
581,1.3824
582,1.4737
583,1.4943
584,1.4951
585,1.4951
586,1.4951
587,1.4951
588,1.4951
589,1.4951
590,1.4951
591,1.5012
592,1.5361
593,1.6242
594,1.7156
595,1.8069
596,1.8973
597,1.9835
598,1.9835
599,1.8462
600,1.6669999999999998
601,1.4842
602,1.3015
603,1.1188
604,0.98444
605,0.84954
606,0.7088
607,0.57521
608,0.48383999999999994
609,0.41606000000000004
610,0.39636
611,0.39636
612,0.39683
613,0.39947
614,0.49083999999999994
615,0.51579
616,0.56083
617,0.6209100000000001
618,0.64053
619,0.64053
620,0.64053
621,0.64053
622,0.65563
623,0.69786
624,0.75812
625,0.76261
626,0.76261
627,0.76261
628,0.76261
629,0.76261
630,0.31899
631,0.31899
632,0.31899
633,0.31899
634,0.31899
635,0.31899
636,0.31899
637,0.31899
638,0.31899
639,0.31899
640,0.32158000000000003
641,0.33896
642,0.37869
643,0.39178
644,0.39336
645,0.40824
646,0.46271999999999996
647,0.5172
648,0.6087100000000001
649,0.73826
650,0.94135
651,1.2711
652,1.722
653,2.1806
654,2.5491
655,2.7801
656,2.8667
657,2.8667
658,2.8667
659,2.8667
660,2.8657
661,2.8521
662,2.7976
663,2.6405
664,2.4782
665,2.2924
666,2.0938
667,1.9151
668,1.7517
669,1.6122
670,1.4784
671,1.327
672,1.1412
673,0.93834
674,0.78045
675,0.6531
676,0.51645
677,0.34078
678,0.12286
679,-0.44969
680,-0.24386999999999998
681,-0.33928
682,-0.38195999999999997
683,-0.3638
684,-0.37423
685,-0.42076
686,-0.48888000000000004
687,-0.5777100000000001
688,-0.68666
689,-0.79562
690,-0.9045799999999999
691,-1.0135
692,-1.1225
693,-1.2206
694,-1.275
695,-1.3295
696,-1.3507
697,-1.3552
698,-1.3454
699,-1.31
700,-1.2868
701,-1.3041
702,-1.3469
703,-1.4014
704,-1.4529
705,-1.4818
706,-1.4368
707,-1.3824
708,-1.3279
709,-1.2734
710,-1.2189
711,-1.2112
712,-1.2097
713,-1.19
714,-1.1466
715,-1.0921
716,-1.0376
717,-1.0037
718,-0.9912799999999999
719,-1.0024
720,-1.0407
721,-1.1264
722,-1.143
723,-1.1777
724,-1.1842
725,-1.1393
726,-1.137
727,-1.0916
728,-1.0390000000000001
729,-1.0033
730,-0.9912799999999999
731,-0.9920700000000001
732,-1.0211
733,-1.0316
734,-1.0033
735,-0.94885
736,-0.89331
737,-0.8284
738,-0.73524
739,-0.70011
740,-0.70011
741,-0.70011
742,-0.70011
743,-0.74393
744,-0.7663
745,-0.79079
746,-0.83225
747,-0.88618
748,-0.91284
749,-0.9184899999999999
750,-0.9184899999999999
751,-0.9184899999999999
752,-0.91761
753,-0.9083399999999999
754,-0.8520700000000001
755,-0.72538
756,-0.58373
757,-0.47478000000000004
758,-0.36582
759,-0.3416
760,-0.30751
761,-0.27739
762,-0.24813000000000002
763,-0.18531
764,-0.48951000000000006
765,-0.10064
766,0.37096
767,0.17399
768,0.26589
769,0.31226
770,0.31601
771,0.28074
772,0.26808000000000004
773,0.32061
774,0.37509000000000003
775,0.42957
776,0.42901999999999996
777,0.37439
778,0.2805
779,0.17145
780,0.2105
781,-0.49313
782,-0.21933000000000002
783,-0.30021
784,-0.35524
785,-0.41667
786,-0.51639
787,-0.59092
788,-0.6854899999999999
789,-0.83773
790,-0.9536399999999999
791,-1.0236
792,-1.0817
793,-1.1207
794,-1.1369
795,-1.1369
796,-1.1369
797,-1.1369
798,-1.1449
799,-1.1719
800,-1.2263
801,-1.2808
802,-1.3353
803,-1.3898
804,-1.4251
805,-1.4146
806,-1.3218
807,-1.2143
808,-1.156
809,-1.1515
810,-1.1949
811,-1.2772
812,-1.34
813,-1.3272
814,-1.245
815,-1.1075
816,-0.93222
817,-0.71895
818,-0.5471
819,-0.48173
820,-0.48173
821,-0.48173
822,-0.48173
823,-0.48173
824,-0.43326000000000003
825,-0.30335
826,-0.40333
827,0.18661
828,0.43742
829,0.62441
830,0.71936
831,0.72444
832,0.67035
833,0.6228199999999999
834,0.6593
835,0.74535
836,0.8887
837,1.0851
838,1.2149
839,1.2552
840,1.1957
841,1.105
842,1.0469
843,1.0469
844,1.1078
845,1.2571
846,1.4563
847,1.6704
848,1.8697
849,1.974
850,1.9932
851,1.9627
852,1.8762
853,1.7302
854,1.6097
855,1.4994
856,1.3905
857,1.2691
858,1.131
859,0.99187
860,0.88185
861,0.7729
862,0.66918
863,0.5857100000000001
864,0.54664
865,0.60111
866,0.65559
867,0.68067
868,0.68295
869,0.6782
870,0.63647
871,0.5835
872,0.55015
873,0.51402
874,0.44833999999999996
875,0.33939
876,0.24818
877,0.19392
878,0.17798
879,0.19792
880,0.24619000000000002
881,0.24619000000000002
882,0.20260999999999998
883,0.17647000000000002
884,0.15816
885,0.11197
886,0.313
887,0.30695
888,-0.13114
889,-0.25421
890,-0.4126
891,-0.14211
892,-0.16359
893,-0.13005
894,-0.37206
895,-0.19933
896,-0.19933
897,-0.19933
898,-0.19933
899,-0.19933
900,-0.19933
901,-0.18001
902,0.14982
903,0.1287
904,0.16464
905,0.16464
906,0.16464
907,0.16464
908,0.24100000000000002
909,0.41676
910,0.10394
911,0.12205999999999999
912,0.1734
913,0.1734
914,0.21431
915,0.24148000000000003
916,0.24619000000000002
917,0.23929
918,0.16279000000000002
919,0.46198
920,0.15073
921,-0.073459
922,-0.19933
923,-0.19933
924,-0.19933
925,-0.16271
926,-0.03257
927,0.26409
928,0.10061
929,0.10061
930,0.10061
931,0.10061
932,0.46313999999999994
933,0.26453000000000004
934,0.17759
935,0.16464
936,0.16464
937,0.11964000000000001
938,0.038732
939,-0.18594000000000002
940,-0.26369000000000004
941,-0.47403999999999996
942,-0.15225
943,-0.19055999999999998
944,-0.19055999999999998
