time,value
0,-1.1775
1,-1.1775
2,-1.1775
3,-1.1775
4,-1.1775
5,-1.1775
6,-1.1775
7,-1.1775
8,-1.1775
9,-1.1775
10,-1.1773
11,-1.1747
12,-1.1708
13,-1.1527
14,-1.1346
15,-1.1166
16,-1.0989
17,-1.0848
18,-1.0724
19,-1.0724
20,-1.0724
21,-1.0724
22,-1.0724
23,-1.0724
24,-1.0724
25,-1.0724
26,-1.0724
27,-1.0724
28,-1.0724
29,-1.0724
30,-1.0724
31,-1.0724
32,-1.0724
33,-1.0724
34,-1.0724
35,-1.0724
36,-1.0724
37,-1.0724
38,-1.0724
39,-1.0724
40,-1.0724
41,-1.0724
42,-1.0724
43,-1.0724
44,-1.0724
45,-1.0724
46,-1.0724
47,-1.0724
48,-1.0724
49,-1.0724
50,-1.0724
51,-1.0724
52,-1.0724
53,-1.0724
54,-1.0724
55,-1.0724
56,-1.0724
57,-1.0724
58,-1.0724
59,-1.0724
60,-1.0724
61,-1.0724
62,-1.0724
63,-1.0724
64,-1.0724
65,-1.0724
66,-1.0724
67,-1.0724
68,-1.0724
69,-1.0724
70,-1.0652
71,-1.0492
72,-1.0322
73,-1.0141
74,-0.99603
75,-0.97795
76,-0.9598700000000001
77,-0.94179
78,-0.92371
79,-0.9056299999999999
80,-0.88756
81,-0.8694799999999999
82,-0.8514
83,-0.8333200000000001
84,-0.81524
85,-0.7971600000000001
86,-0.78017
87,-0.7641
88,-0.75698
89,-0.75698
90,-0.75698
91,-0.75698
92,-0.75698
93,-0.75698
94,-0.75698
95,-0.75698
96,-0.75698
97,-0.75698
98,-0.75989
99,-0.76458
100,-0.77774
101,-0.79582
102,-0.8139
103,-0.8319799999999999
104,-0.85006
105,-0.8681399999999999
106,-0.8862200000000001
107,-0.9043
108,-0.92238
109,-0.9404600000000001
110,-0.9585299999999999
111,-0.9766100000000001
112,-0.99469
113,-1.0128
114,-1.0309
115,-1.0489
116,-1.0606
117,-1.07
118,-1.0724
119,-1.0724
120,-1.0724
121,-1.0724
122,-1.0491
123,-1.0190000000000001
124,-0.9699200000000001
125,-0.9156799999999999
126,-0.86144
127,-0.8072
128,-0.7529600000000001
129,-0.69872
130,-0.64448
131,-0.59025
132,-0.53601
133,-0.48177
134,-0.42753
135,-0.37329
136,-0.31905
137,-0.26481
138,-0.21056999999999998
139,-0.15633
140,-0.13948
141,-0.12742
142,-0.1262
143,-0.1262
144,-0.1262
145,-0.1262
146,-0.1689
147,-0.2151
148,-0.26883
149,-0.32306999999999997
150,-0.37731
151,-0.43155
152,-0.45358000000000004
153,-0.47433000000000003
154,-0.49248000000000003
155,-0.51056
156,-0.52864
157,-0.54672
158,-0.54672
159,-0.54672
160,-0.54672
161,-0.54665
162,-0.54397
163,-0.54002
164,-0.5038699999999999
165,-0.46771
166,-0.43155
167,-0.39539
168,-0.35923
169,-0.32306999999999997
170,-0.28691
171,-0.25075
172,-0.21459
173,-0.17843
174,-0.14227
175,-0.10611
176,-0.3505
177,-0.16971
178,0.0729
179,0.19189
180,0.37268
181,0.11084000000000001
182,0.147
183,0.18316
184,0.21932
185,0.25667
186,0.29952
187,0.34454
188,0.39878
189,0.45302
190,0.50726
191,0.5614899999999999
192,0.61573
193,0.66997
194,0.72421
195,0.77845
196,0.8326899999999999
197,0.8869299999999999
198,0.9411700000000001
199,0.99541
200,1.0496
201,1.1039
202,1.1581
203,1.2124
204,1.2666
205,1.3208
206,1.3751
207,1.4293
208,1.4836
209,1.5299
210,1.56
211,1.5859999999999999
212,1.6041
213,1.6222
214,1.6402
215,1.6485
216,1.6398
217,1.6275
218,1.6094
219,1.5914
220,1.5733
221,1.5433
222,1.4957
223,1.4454
224,1.3912
225,1.3369
226,1.2827
227,1.2356
228,1.1974
229,1.1601
230,1.124
231,1.0878
232,1.0517
233,1.0239
234,1.0051
235,0.9867
236,0.96862
237,0.95088
238,0.93347
239,0.9251
240,0.9251
241,0.9251
242,0.9251
243,0.92619
244,0.9282
245,0.93916
246,0.95724
247,0.9753200000000001
248,0.9934
249,1.0115
250,1.0296
251,1.0476
252,1.0657
253,1.0838
254,1.1019
255,1.117
256,1.1304
257,1.1354
258,1.1354
259,1.1354
260,1.1354
261,1.1393
262,1.1453
263,1.1595
264,1.1775
265,1.1956
266,1.2137
267,1.2318
268,1.2499
269,1.2679
270,1.286
271,1.3041
272,1.3222
273,1.3339
274,1.3432
275,1.3456
276,1.3456
277,1.3456
278,1.3456
279,1.3379
280,1.3278
281,1.3115
282,1.2934
283,1.2753
284,1.2572
285,1.2391
286,1.2211
287,1.203
288,1.1849
289,1.1668
290,1.1487
291,1.1307
292,1.1126
293,1.0945
294,1.0764
295,1.0584
296,1.0403
297,1.0347
298,1.0306
299,1.0302
300,1.0302
301,1.0302
302,1.0302
303,1.016
304,1.0006
305,0.9826799999999999
306,0.9646
307,0.94652
308,0.92845
309,0.95868
310,0.99082
311,1.0269
312,1.063
313,1.0992
314,1.1354
315,-1.2059
316,-1.2059
317,-1.2059
318,-1.2059
319,-1.2059
320,-1.2059
321,-1.2059
322,-1.2059
323,-1.2059
324,-1.2059
325,-1.2059
326,-1.2059
327,-1.2059
328,-1.2059
329,-1.2059
330,-1.2059
331,-1.2059
332,-1.2059
333,-1.2059
334,-1.2059
335,-1.2059
336,-1.2059
337,-1.2059
338,-1.2059
339,-1.2059
340,-1.2059
341,-1.2059
342,-1.2059
343,-1.2059
344,-1.2059
345,-1.2059
346,-1.2059
347,-1.2059
348,-1.2059
349,-1.2059
350,-1.2059
351,-1.2059
352,-1.2059
353,-1.2059
354,-1.2059
355,-1.2059
356,-1.2059
357,-1.2059
358,-1.2059
359,-1.2059
360,-1.2059
361,-1.2059
362,-1.2059
363,-1.2059
364,-1.2059
365,-1.2059
366,-1.2059
367,-1.2059
368,-1.2059
369,-1.2059
370,-1.2059
371,-1.2059
372,-1.2059
373,-1.2059
374,-1.2059
375,-1.2059
376,-1.2059
377,-1.2059
378,-1.2059
379,-1.2059
380,-1.2059
381,-1.2059
382,-1.2059
383,-1.2059
384,-1.2059
385,-1.2059
386,-1.2059
387,-1.2059
388,-1.2059
389,-1.2059
390,-1.2059
391,-1.2059
392,-1.2059
393,-1.2059
394,-1.2059
395,-1.2055
396,-1.2046
397,-1.1927
398,-1.1704
399,-1.1481
400,-1.1259
401,-1.1036
402,-1.0813
403,-1.0591
404,-1.0368
405,-1.0145
406,-0.99226
407,-0.97239
408,-0.95424
409,-0.94689
410,-0.94689
411,-0.94689
412,-0.94689
413,-0.94331
414,-0.9375399999999999
415,-0.92132
416,-0.8990600000000001
417,-0.87679
418,-0.8545200000000001
419,-0.8371299999999999
420,-0.82229
421,-0.8174
422,-0.8174
423,-0.8174
424,-0.8174
425,-0.8174
426,-0.8174
427,-0.8174
428,-0.8174
429,-0.8174
430,-0.8174
431,-0.8174
432,-0.8174
433,-0.8174
434,-0.8174
435,-0.8174
436,-0.8174
437,-0.80785
438,-0.79548
439,-0.7753399999999999
440,-0.75307
441,-0.7308
442,-0.70853
443,-0.66354
444,-0.61323
445,-0.5493399999999999
446,-0.48253
447,-0.41572
448,-0.34892
449,-0.28210999999999997
450,-0.2153
451,-0.14849
452,-0.40915
453,-0.07511
454,0.25893
455,0.10339000000000001
456,0.15288
457,0.19792
458,0.24245999999999998
459,0.287
460,0.33154
461,0.35855
462,0.38411999999999996
463,0.4066
464,0.42886
465,0.45113000000000003
466,0.4734
467,0.456
468,0.43703000000000003
469,0.41484
470,0.39257
471,0.3703
472,0.34804
473,0.34804
474,0.34804
475,0.34804
476,0.34804
477,0.34804
478,0.34804
479,0.34804
480,0.34804
481,0.34804
482,0.34804
483,0.34804
484,0.34804
485,0.34804
486,0.34804
487,0.34804
488,0.34904
489,0.35893
490,0.37278
491,0.41731999999999997
492,0.46186000000000005
493,0.5064
494,0.55093
495,0.5954699999999999
496,0.6400100000000001
497,0.68455
498,0.72909
499,0.77363
500,0.81963
501,0.8724200000000001
502,0.9278700000000001
503,0.99467
504,1.0615
505,1.1283
506,1.193
507,1.2499
508,1.304
509,1.3485
510,1.393
511,1.4376
512,1.4821
513,1.5267
514,1.5712
515,1.6157
516,1.6603
517,1.7048
518,1.7455
519,1.7769
520,1.8054
521,1.8277
522,1.85
523,1.8723
524,1.8896
525,1.8971
526,1.9019
527,1.9019
528,1.9019
529,1.9019
530,1.8838
531,1.8343
532,1.7782
533,1.7114
534,1.6446
535,1.5778
536,1.511
537,1.4442
538,1.3774
539,1.3106
540,1.2438
541,1.177
542,1.1189
543,1.0719
544,1.026
545,0.9814799999999999
546,0.93694
547,0.8924
548,0.8581799999999999
549,0.8350799999999999
550,0.81239
551,0.79013
552,0.76827
553,0.74683
554,0.73651
555,0.73651
556,0.73651
557,0.73651
558,0.73651
559,0.73651
560,0.73651
561,0.73651
562,0.73651
563,0.73651
564,0.73651
565,0.73651
566,0.73651
567,0.73651
568,0.73651
569,0.73651
570,0.73293
571,0.72716
572,0.71094
573,0.6886800000000001
574,0.6664100000000001
575,0.6441399999999999
576,0.62675
577,0.6119100000000001
578,0.60702
579,0.60702
580,0.60702
581,0.60702
582,0.60702
583,0.60702
584,0.60702
585,0.60702
586,0.60702
587,0.60702
588,0.60702
589,0.60702
590,0.60702
591,0.60702
592,0.60702
593,0.60702
594,0.60702
595,0.60702
596,0.60702
597,0.60702
598,0.60702
599,0.60702
600,0.5956600000000001
601,0.5816399999999999
602,0.56083
603,0.53856
604,0.5162899999999999
605,0.49401999999999996
606,0.49833999999999995
607,0.50741
608,0.52784
609,0.55011
610,0.57238
611,0.59465
612,0.61692
613,0.6391899999999999
614,0.66146
615,0.6837300000000001
616,0.706
617,0.72827
618,0.733
619,0.7363
620,0.73651
621,0.73651
622,0.73651
623,0.73651
624,0.79602
625,0.85788
626,0.9245700000000001
627,0.9913700000000001
628,1.0582
629,1.125
630,-1.32
631,-1.32
632,-1.32
633,-1.32
634,-1.32
635,-1.32
636,-1.32
637,-1.32
638,-1.32
639,-1.32
640,-1.32
641,-1.32
642,-1.32
643,-1.32
644,-1.32
645,-1.32
646,-1.32
647,-1.32
648,-1.32
649,-1.32
650,-1.32
651,-1.32
652,-1.32
653,-1.32
654,-1.32
655,-1.32
656,-1.32
657,-1.32
658,-1.32
659,-1.32
660,-1.32
661,-1.32
662,-1.32
663,-1.32
664,-1.32
665,-1.32
666,-1.32
667,-1.32
668,-1.32
669,-1.32
670,-1.32
671,-1.32
672,-1.32
673,-1.32
674,-1.32
675,-1.32
676,-1.32
677,-1.32
678,-1.32
679,-1.32
680,-1.32
681,-1.32
682,-1.32
683,-1.32
684,-1.32
685,-1.32
686,-1.32
687,-1.32
688,-1.32
689,-1.32
690,-1.32
691,-1.32
692,-1.32
693,-1.32
694,-1.32
695,-1.32
696,-1.32
697,-1.32
698,-1.32
699,-1.32
700,-1.3171
701,-1.3105
702,-1.3035
703,-1.296
704,-1.2886
705,-1.2812
706,-1.2806
707,-1.2875
708,-1.2947
709,-1.3021
710,-1.3093
711,-1.3161
712,-1.3156
713,-1.3082
714,-1.3007
715,-1.2933
716,-1.285
717,-1.2759
718,-1.2595
719,-1.2372
720,-1.2149
721,-1.1926
722,-1.1703
723,-1.148
724,-1.1257
725,-1.1035
726,-1.0812
727,-1.0589
728,-1.0354
729,-1.0112
730,-0.9835
731,-0.9537899999999999
732,-0.9240799999999999
733,-0.89436
734,-0.86465
735,-0.83494
736,-0.8052199999999999
737,-0.77551
738,-0.7458
739,-0.71608
740,-0.68005
741,-0.64125
742,-0.5931
743,-0.5411
744,-0.4891
745,-0.4371
746,-0.39298
747,-0.35170999999999997
748,-0.31906999999999996
749,-0.28936
750,-0.25965
751,-0.22993000000000002
752,-0.20978000000000002
753,-0.19245
754,-0.18289
755,-0.17545999999999998
756,-0.16802999999999998
757,-0.1606
758,-0.15696
759,-0.15420999999999999
760,-0.15372
761,-0.15372
762,-0.15372
763,-0.15372
764,-0.15372
765,-0.15372
766,-0.15372
767,-0.15372
768,-0.15372
769,-0.15372
770,-0.12301
771,-0.44243999999999994
772,-0.2246
773,-0.096375
774,0.22111
775,0.44396
776,0.15105
777,0.2146
778,0.28125
779,0.34811
780,0.41496000000000005
781,0.48181999999999997
782,0.52882
783,0.57504
784,0.61966
785,0.66423
786,0.7088
787,0.75337
788,0.77565
789,0.79794
790,0.8202200000000001
791,0.84247
792,0.8631
793,0.88295
794,0.88295
795,0.88295
796,0.88295
797,0.88281
798,0.88061
799,0.87745
800,0.86259
801,0.8477399999999999
802,0.83288
803,0.8176899999999999
804,0.79953
805,0.7800600000000001
806,0.75034
807,0.72063
808,0.69092
809,0.6612
810,0.63149
811,0.60177
812,0.57206
813,0.54235
814,0.51263
815,0.48536
816,0.4694
817,0.45788
818,0.46531000000000006
819,0.47273999999999994
820,0.48017
821,0.48973
822,0.5070600000000001
823,0.52722
824,0.55693
825,0.5866399999999999
826,0.61636
827,0.64704
828,0.68061
829,0.71513
830,0.75227
831,0.7894100000000001
832,0.82655
833,0.86241
834,0.89515
835,0.9269700000000001
836,0.9566899999999999
837,0.9864
838,1.0161
839,1.0426
840,1.0624
841,1.0805
842,1.0954
843,1.1102
844,1.1251
845,1.1359
846,1.1397
847,1.1421
848,1.1421
849,1.1421
850,1.1421
851,1.1372
852,1.1251
853,1.1119
854,1.097
855,1.0821
856,1.0673
857,1.0554
858,1.0471
859,1.0392
860,1.0318
861,1.0244
862,1.0169
863,1.0026
864,0.9809
865,0.9588899999999999
866,0.9366
867,0.91432
868,0.8920299999999999
869,0.86975
870,0.84746
871,0.8251799999999999
872,0.80289
873,0.78061
874,0.75832
875,0.7360399999999999
876,0.71375
877,0.69147
878,0.66918
879,0.6493
880,0.6311399999999999
881,0.62378
882,0.62378
883,0.62378
884,0.62378
885,0.62617
886,0.63003
887,0.64084
888,0.6557
889,0.67056
890,0.6854100000000001
891,0.7019
892,0.71923
893,0.7398899999999999
894,0.76217
895,0.78446
896,0.80674
897,0.8248200000000001
898,0.84105
899,0.85104
900,0.8584700000000001
901,0.8659
902,0.8733200000000001
903,0.8833799999999999
904,0.89438
905,0.9082600000000001
906,0.92312
907,0.9379799999999999
908,0.9528399999999999
909,0.97088
910,0.9898600000000001
911,1.0114
912,1.0337
913,1.056
914,1.0783
915,1.093
916,1.1059
917,1.1143
918,1.1218
919,1.1292
920,1.1366
921,1.1440000000000001
922,1.1515
923,1.1589
924,1.1663
925,1.1738
926,1.1812
927,1.1835
928,1.1852
929,1.1853
930,1.1853
931,1.1853
932,1.1853
933,1.1795
934,1.1731
935,1.1658
936,1.1584
937,1.1509
938,1.1435
939,1.1559
940,1.1691
941,1.1839
942,1.1988
943,1.2137
944,1.2285
