time,value
0,-0.76036
1,-0.76036
2,-0.76036
3,-0.76036
4,1.2908
5,1.5472
6,1.5472
7,1.5472
8,1.5472
9,1.2908
10,1.2908
11,-0.60652
12,-0.76036
13,-0.76036
14,-0.76036
15,-0.76036
16,-0.76036
17,-0.76036
18,-0.76036
19,-0.76036
20,-0.76036
21,0.008831499999999999
22,1.5472
23,1.2908
24,1.2908
25,1.2908
26,1.2908
27,1.2908
28,0.16267
29,-0.70908
30,-0.76036
31,-0.76036
32,-0.76036
33,-0.76036
34,-0.76036
35,-0.76036
36,-0.76036
37,-0.76036
38,-0.76036
39,0.8805799999999999
40,1.5472
41,1.5472
42,1.5472
43,1.5472
44,1.2908
45,1.2908
46,-0.55524
47,-0.76036
48,-0.76036
49,-0.76036
50,-0.76036
51,-0.76036
52,-0.76036
53,-0.76036
54,-0.76036
55,-0.76036
56,-0.55524
57,1.5472
58,1.5472
59,1.5472
60,1.5472
61,1.2908
62,1.5472
63,0.008831499999999999
64,-0.6578
65,-0.76036
66,-0.76036
67,-0.76036
68,-0.76036
69,-0.76036
70,-0.76036
71,-0.76036
72,-0.76036
73,-0.76036
74,0.67547
75,1.5472
76,1.5472
77,1.2908
78,1.5472
79,1.5472
80,1.0857
81,-0.60652
82,-0.76036
83,-0.76036
84,-0.76036
85,-0.76036
86,-0.76036
87,-0.76036
88,-0.76036
89,-0.76036
90,-0.76036
91,-0.70908
92,1.5472
93,1.5472
94,1.5472
95,1.5472
96,1.2908
97,1.5472
98,0.008831499999999999
99,-0.76036
100,-0.76036
101,-0.76036
102,-0.76036
103,-0.76036
104,-0.76036
105,-0.76036
106,-0.76036
107,-0.76036
108,-0.76036
109,0.67547
110,1.5472
111,1.5472
112,1.5472
113,1.5472
114,1.2908
115,0.67547
116,-0.70908
117,-0.76036
118,-0.76036
119,-0.76036
120,-0.76036
121,-0.76036
122,-0.76036
123,-0.76036
124,-0.76036
125,-0.76036
126,-0.24756999999999998
127,1.5472
128,1.5472
129,1.5472
130,1.5472
131,1.2908
132,1.5472
133,-0.60652
134,-0.76036
135,-0.76036
136,-0.76036
137,-0.76036
138,-0.76036
139,-0.76036
140,-0.76036
141,-0.76036
142,-0.76036
143,-0.76036
144,1.2908
145,1.5472
146,1.2908
147,1.2908
148,1.2908
149,1.2908
150,-0.35013
151,-0.76036
152,-0.76036
153,-0.76036
154,-0.76036
155,-0.76036
156,-0.76036
157,-0.76036
158,-0.76036
159,-0.76036
160,-0.76036
161,0.8805799999999999
162,1.5472
163,1.5472
164,1.5472
165,1.5472
166,1.2908
167,0.008831499999999999
168,-0.6578
169,-0.76036
170,-0.76036
171,-0.76036
172,-0.76036
173,-0.76036
174,-0.76036
175,-0.76036
176,-0.76036
177,-0.76036
178,0.47035
179,1.5472
180,1.2908
181,1.2908
182,1.2908
183,1.2908
184,0.47035
185,-0.60652
186,-0.76036
187,-0.76036
188,-0.76036
189,-0.76036
190,-0.76036
191,-0.76036
192,-0.76036
193,-0.76036
194,-0.76036
195,-0.76036
196,1.2908
197,1.5472
198,1.5472
199,1.5472
200,1.2908
201,1.2908
202,-0.60652
203,-0.76036
204,-0.76036
205,-0.76036
206,-0.76036
207,-0.76036
208,-0.76036
209,-0.76036
210,-0.76036
211,-0.76036
212,-0.76036
213,0.67547
214,1.5472
215,1.5472
216,1.2908
217,1.5472
218,1.2908
219,-0.14501
220,-0.6578
221,-0.76036
222,-0.76036
223,-0.76036
224,-0.76036
225,-0.76036
226,-0.76036
227,-0.76036
228,-0.76036
229,-0.76036
230,-0.35013
231,1.5472
232,1.5472
233,1.5472
234,1.2908
235,1.2908
236,0.47035
237,-0.76036
238,-0.76036
239,-0.76036
240,-0.76036
241,-0.76036
242,-0.76036
243,-0.76036
244,-0.76036
245,-0.76036
246,-0.76036
247,-0.76036
248,1.2908
249,1.5472
250,1.5472
251,1.2908
252,1.5472
253,0.8805799999999999
254,-0.76036
255,-0.76036
256,-0.76036
257,-0.76036
258,-0.76036
259,-0.76036
260,-0.76036
261,-0.76036
262,-0.76036
263,-0.76036
264,-0.76036
265,0.8805799999999999
266,1.2908
267,1.5472
268,1.0857
269,1.2908
270,1.2908
271,-0.45268
272,-0.76036
273,-0.76036
274,-0.76036
275,-0.76036
276,-0.76036
277,-0.76036
278,-0.76036
279,-0.76036
280,-0.76036
281,-0.76036
282,0.008831499999999999
283,1.5472
284,1.5472
285,1.2908
286,1.5472
287,1.2908
288,0.31651
289,-0.6578
290,-0.76036
291,-0.76036
292,-0.76036
293,-0.76036
294,-0.76036
295,-0.76036
296,-0.76036
297,-0.76036
298,-0.76036
299,-0.24756999999999998
300,1.5472
301,1.5472
302,1.5472
303,1.2908
304,1.5472
305,1.0857
306,-0.70908
307,-0.76036
308,-0.76036
309,-0.76036
310,-0.76036
311,-0.76036
312,-0.76036
313,-0.76036
314,-0.76036
315,-0.76036
316,-0.76036
317,0.67547
318,1.5472
319,1.5472
320,1.2908
321,1.2908
322,1.2908
323,0.16267
324,-0.6578
325,-0.76036
326,-0.76036
327,-0.76036
328,-0.76036
329,-0.76036
330,-0.76036
331,-0.76036
332,-0.76036
333,-0.76036
334,-0.45268
335,1.5472
336,1.5472
337,1.5472
338,1.2908
339,1.5472
340,1.0857
341,-0.70908
342,-0.76036
343,-0.76036
344,-0.76036
345,-0.76036
346,-0.76036
347,-0.76036
348,-0.76036
349,-0.76036
350,-0.76036
351,-0.76036
352,0.8805799999999999
353,1.5472
354,1.2908
355,1.2908
356,1.2908
357,1.0857
358,-0.14501
359,-0.6578
360,-0.76036
361,-0.76036
362,-0.76036
363,-0.76036
364,-0.76036
365,-0.76036
366,-0.76036
367,-0.76036
368,-0.76036
369,-0.76036
370,1.5472
371,1.5472
372,1.2908
373,1.2908
374,1.2908
375,1.0857
376,-0.55524
377,-0.76036
378,-0.76036
379,-0.76036
380,-0.76036
381,-0.76036
382,-0.76036
383,-0.76036
384,-0.76036
385,-0.76036
386,-0.76036
387,-0.14501
388,1.5472
389,1.5472
390,1.5472
391,1.2908
392,1.5472
393,1.2908
394,-0.76036
395,-0.76036
396,-0.76036
397,-0.76036
398,-0.76036
399,-0.76036
400,-0.76036
401,-0.76036
402,-0.76036
403,-0.76036
404,-0.76036
405,-0.35013
406,1.5472
407,1.5472
408,1.5472
409,1.2908
410,1.5472
411,0.67547
412,-0.6578
413,-0.76036
414,-0.76036
415,-0.76036
416,-0.76036
417,-0.76036
418,-0.76036
419,-0.76036
420,-0.76036
421,-0.76036
422,-0.76036
423,-0.14501
424,1.5472
425,1.5472
426,1.5472
427,1.2908
428,1.5472
429,0.8805799999999999
430,-0.70908
431,-0.76036
432,-0.76036
433,-0.76036
434,-0.76036
435,-0.76036
436,-0.76036
437,-0.76036
438,-0.76036
439,-0.76036
440,-0.76036
441,0.008831499999999999
442,1.5472
443,1.5472
444,1.2908
445,1.5472
446,1.2908
447,0.8805799999999999
448,-0.6578
449,-0.76036
450,-0.76036
451,-0.76036
452,-0.76036
453,-0.76036
454,-0.76036
455,-0.76036
456,-0.76036
457,-0.76036
458,-0.76036
459,-0.76036
460,0.8805799999999999
461,1.5472
462,1.5472
463,1.2908
464,1.2908
465,1.5472
466,0.008831499999999999
467,-0.6578
468,-0.76036
469,-0.76036
470,-0.76036
471,-0.76036
472,-0.76036
473,-0.76036
474,-0.76036
475,-0.76036
476,-0.76036
477,-0.76036
478,0.8805799999999999
479,1.5472
480,1.2908
481,1.5472
482,1.2908
483,1.5472
484,0.47035
485,-0.70908
486,-0.76036
487,-0.76036
488,-0.76036
489,-0.76036
490,-0.76036
491,-0.76036
492,-0.76036
493,-0.76036
494,-0.76036
495,-0.76036
496,-0.76036
497,1.2908
498,1.5472
499,1.5472
500,1.2908
501,1.5472
502,1.2908
503,0.47035
504,-0.76036
505,-0.76036
506,-0.76036
507,-0.76036
508,-0.76036
509,-0.76036
510,-0.76036
511,-0.76036
512,-0.76036
513,-0.76036
514,-0.76036
515,-0.76036
516,1.2908
517,1.2908
518,1.2908
519,1.2908
520,1.2908
521,1.2908
522,0.47035
523,-0.6578
524,-0.76036
525,-0.76036
526,-0.76036
527,-0.76036
528,-0.76036
529,-0.76036
530,-0.76036
531,-0.76036
532,-0.76036
533,-0.76036
534,-0.55524
535,1.5472
536,1.5472
537,1.5472
538,1.2908
539,1.5472
540,1.2908
541,-0.24756999999999998
542,-0.70908
543,-0.76036
544,-0.76036
545,-0.76036
546,-0.76036
547,-0.76036
548,-0.76036
549,-0.76036
550,-0.76036
551,-0.76036
552,-0.76036
553,0.47035
554,1.2908
555,1.5472
556,1.2908
557,1.2908
558,1.2908
559,0.47035
560,-0.6578
561,-0.76036
562,-0.76036
563,-0.76036
564,-0.76036
565,-0.76036
566,-0.76036
567,-0.76036
568,-0.76036
569,-0.76036
570,-0.76036
571,-0.76036
572,1.2908
573,1.2908
574,1.2908
575,1.2908
576,1.2908
577,1.2908
578,0.008831499999999999
579,-0.6578
580,-0.76036
581,-0.76036
582,-0.76036
583,-0.76036
584,-0.76036
585,-0.76036
586,-0.76036
587,-0.76036
588,-0.76036
589,-0.76036
590,-0.14501
591,1.5472
592,1.5472
593,1.2908
594,1.5472
595,1.2908
596,1.2908
597,-0.76036
598,-0.76036
599,-0.76036
600,-0.76036
601,-0.76036
602,-0.76036
603,-0.76036
604,-0.76036
605,-0.76036
606,-0.76036
607,-0.76036
608,-0.76036
609,-0.76036
610,1.2908
611,1.5472
612,1.5472
613,1.2908
614,1.5472
615,1.2908
616,0.31651
617,-0.70908
618,-0.76036
619,-0.76036
620,-0.76036
621,-0.76036
622,-0.76036
623,-0.76036
624,-0.76036
625,-0.76036
626,-0.76036
627,-0.76036
628,-0.76036
629,-0.14501
630,1.2908
631,1.5472
632,1.2908
633,1.2908
634,1.2908
635,1.0857
636,-0.76036
637,-0.76036
638,-0.76036
639,-0.76036
640,-0.76036
641,-0.76036
642,-0.76036
643,-0.76036
644,-0.76036
645,-0.76036
646,-0.76036
647,-0.76036
648,0.16267
649,1.5472
650,1.5472
651,1.2908
652,1.5472
653,1.2908
654,1.0857
655,-0.76036
656,-0.76036
657,-0.76036
658,-0.76036
659,-0.76036
660,-0.76036
661,-0.76036
662,-0.76036
663,-0.76036
664,-0.76036
665,-0.76036
666,-0.76036
667,0.67547
668,1.5472
669,1.5472
670,1.2908
671,1.5472
672,1.2908
673,0.47035
674,-0.6578
675,-0.76036
676,-0.76036
677,-0.76036
678,-0.76036
679,-0.76036
680,-0.76036
681,-0.76036
682,-0.76036
683,-0.76036
684,-0.76036
685,-0.60652
686,1.5472
687,1.5472
688,1.5472
689,1.5472
690,1.2908
691,1.5472
692,-0.24756999999999998
693,-0.76036
694,-0.76036
695,-0.76036
696,-0.76036
697,-0.76036
698,-0.76036
699,-0.76036
700,-0.76036
701,-0.76036
702,-0.76036
703,-0.76036
704,-0.76036
705,0.16267
706,1.5472
707,1.5472
708,1.5472
709,1.5472
710,1.2908
711,1.2908
712,-0.45268
713,-0.70908
714,-0.76036
715,-0.76036
716,-0.76036
717,-0.76036
718,-0.76036
719,-0.76036
