time,value
0,-0.030922
1,-0.8577
2,-0.8577
3,-0.8577
4,-0.91676
5,-0.8577
6,-0.8577
7,-0.91676
8,-0.8577
9,-0.8577
10,-0.91676
11,-0.8577
12,1.0321
13,1.2683
14,1.2683
15,1.2683
16,1.2683
17,1.2683
18,1.0321
19,1.0321
20,1.2683
21,1.0321
22,-0.38526
23,-0.8577
24,-0.8577
25,-0.8577
26,-0.8577
27,-0.91676
28,-0.8577
29,-0.91676
30,-0.8577
31,-0.8577
32,-0.91676
33,-0.8577
34,0.79586
35,1.2683
36,1.5636
37,1.2683
38,1.0321
39,1.2683
40,1.2683
41,1.0321
42,0.32341
43,-0.73959
44,-0.8577
45,-0.91676
46,-0.8577
47,-0.8577
48,-0.91676
49,-0.8577
50,-0.91676
51,-0.8577
52,-0.8577
53,-0.91676
54,0.14624
55,1.2683
56,1.5636
57,1.2683
58,1.2683
59,1.0321
60,1.2683
61,1.0321
62,1.2683
63,1.0321
64,0.14624
65,-0.8577
66,-0.91676
67,-0.8577
68,-0.91676
69,-0.8577
70,-0.8577
71,-0.91676
72,-0.8577
73,-0.8577
74,-0.91676
75,-0.8577
76,-0.50337
77,1.2683
78,1.2683
79,1.2683
80,1.2683
81,1.2683
82,1.2683
83,1.0321
84,1.2683
85,1.0321
86,0.14624
87,-0.8577
88,-0.8577
89,-0.8577
90,-0.8577
91,-0.91676
92,-0.8577
93,-0.8577
94,-0.91676
95,-0.8577
96,-0.8577
97,-0.91676
98,-0.62148
99,1.2683
100,1.2683
101,1.2683
102,1.2683
103,1.2683
104,1.2683
105,1.0321
106,1.2683
107,-0.20809
108,-0.8577
109,-0.8577
110,-0.8577
111,-0.8577
112,-0.8577
113,-0.91676
114,-0.8577
115,-0.8577
116,-0.91676
117,-0.8577
118,-0.91676
119,-0.20809
120,1.2683
121,1.2683
122,1.2683
123,1.2683
124,1.2683
125,1.2683
126,1.0321
127,1.2683
128,0.79586
129,-0.8577
130,-0.91676
131,-0.8577
132,-0.91676
133,-0.8577
134,-0.8577
135,-0.91676
136,-0.8577
137,-0.8577
138,-0.91676
139,-0.8577
140,-0.91676
141,0.5596300000000001
142,1.2683
143,1.5636
144,1.2683
145,1.0321
146,1.2683
147,1.0321
148,1.2683
149,0.79586
150,-0.8577
151,-0.8577
152,-0.8577
153,-0.8577
154,-0.8577
155,-0.91676
156,-0.8577
157,-0.91676
158,-0.8577
159,-0.8577
160,-0.91676
161,-0.8577
162,0.79586
163,1.2683
164,1.2683
165,1.2683
166,1.2683
167,1.2683
168,1.0321
169,1.2683
170,0.79586
171,-0.8577
172,-0.8577
173,-0.8577
174,-0.91676
175,-0.8577
176,-0.8577
177,-0.91676
178,-0.8577
179,-0.91676
180,-0.8577
181,-0.91676
182,-0.8577
183,-0.030922
184,1.5636
185,1.2683
186,1.2683
187,1.2683
188,1.0321
189,1.2683
190,0.79586
191,-0.73959
192,-0.8577
193,-0.91676
194,-0.8577
195,-0.91676
196,-0.8577
197,-0.8577
198,-0.91676
199,-0.8577
200,-0.91676
201,-0.8577
202,-0.8577
203,1.0321
204,1.2683
205,1.2683
206,1.2683
207,1.2683
208,1.2683
209,1.0321
210,1.2683
211,0.32341
212,-0.8577
213,-0.8577
214,-0.8577
215,-0.8577
216,-0.8577
217,-0.91676
218,-0.8577
219,-0.8577
220,-0.91676
221,-0.8577
222,-0.8577
223,-0.91676
224,1.2683
225,1.2683
226,1.2683
227,1.2683
228,1.2683
229,1.0321
230,1.2683
231,1.0321
232,-0.030922
233,-0.8577
234,-0.8577
235,-0.91676
236,-0.8577
237,-0.8577
238,-0.8577
239,-0.8577
240,-0.91676
241,-0.8577
242,-0.91676
243,-0.8577
244,0.79586
245,1.2683
246,1.5636
247,1.0321
248,1.2683
249,1.2683
250,1.0321
251,1.0321
252,0.14624
253,-0.73959
254,-0.91676
255,-0.8577
256,-0.8577
257,-0.91676
258,-0.8577
259,-0.91676
260,-0.8577
261,-0.91676
262,-0.8577
263,-0.8577
264,-0.91676
265,0.32341
266,1.2683
267,1.5636
268,1.0321
269,1.2683
270,1.2683
271,1.0321
272,1.0321
273,1.0321
274,-0.20809
275,-0.8577
276,-0.8577
277,-0.8577
278,-0.8577
279,-0.8577
280,-0.91676
281,-0.8577
282,-0.91676
283,-0.8577
284,-0.8577
285,-0.91676
286,-0.8577
287,0.79586
288,1.2683
289,1.5636
290,1.2683
291,1.0321
292,1.2683
293,1.0321
294,-0.030922
295,-0.8577
296,-0.8577
297,-0.91676
298,-0.8577
299,-0.8577
300,-0.91676
301,-0.8577
302,-0.8577
303,-0.91676
304,-0.8577
305,-0.91676
306,-0.8577
307,1.0321
308,1.2683
309,1.2683
310,1.2683
311,1.2683
312,1.0321
313,1.2683
314,1.0321
315,-0.20809
316,-0.91676
317,-0.8577
318,-0.91676
319,-0.8577
320,-0.8577
321,-0.91676
322,-0.8577
323,-0.8577
324,-0.91676
325,-0.8577
326,-0.91676
327,-0.8577
328,1.2683
329,1.2683
330,1.2683
331,1.2683
332,1.2683
333,1.2683
334,1.0321
335,1.2683
336,1.0321
337,1.2683
338,0.32341
339,-0.8577
340,-0.91676
341,-0.8577
342,-0.91676
343,-0.8577
344,-0.8577
345,-0.91676
346,-0.8577
347,-0.8577
348,-0.8577
349,-0.8577
350,0.79586
351,1.5636
352,1.2683
353,1.2683
354,1.0321
355,1.2683
356,1.0321
357,1.0321
358,-0.8577
359,-0.8577
360,-0.8577
361,-0.8577
362,-0.91676
363,-0.8577
364,-0.8577
365,-0.91676
366,-0.8577
367,-0.91676
368,-0.8577
369,-0.8577
370,0.32341
371,1.2683
372,1.2683
373,1.2683
374,1.2683
375,1.2683
376,1.0321
377,1.2683
378,0.5596300000000001
379,-0.91676
380,-0.8577
381,-0.91676
382,-0.8577
383,-0.8577
384,-0.91676
385,-0.8577
386,-0.8577
387,-0.91676
388,-0.8577
389,-0.8577
390,1.2683
391,1.2683
392,1.2683
393,1.2683
394,1.2683
395,1.2683
396,1.0321
397,1.2683
398,1.0321
399,-0.20809
400,-0.8577
401,-0.91676
402,-0.8577
403,-0.91676
404,-0.8577
405,-0.91676
406,-0.8577
407,-0.91676
408,-0.8577
409,-0.91676
410,-0.8577
411,-0.38526
412,1.2683
413,1.5636
414,1.0321
415,1.2683
416,1.2683
417,1.0321
418,1.0321
419,1.0321
420,-0.38526
421,-0.91676
422,-0.8577
423,-0.8577
424,-0.91676
425,-0.8577
426,-0.8577
427,-0.91676
428,-0.8577
429,-0.91676
430,-0.8577
431,-0.91676
432,0.79586
433,1.5636
434,1.2683
435,1.2683
436,1.0321
437,1.2683
438,1.0321
439,0.79586
440,-0.8577
441,-0.8577
442,-0.8577
443,-0.8577
444,-0.91676
445,-0.8577
446,-0.91676
447,-0.8577
448,-0.91676
449,-0.8577
450,-0.8577
451,-0.50337
452,1.2683
453,1.2683
454,1.2683
455,1.2683
456,1.2683
457,1.2683
458,1.0321
459,1.0321
460,1.0321
461,-0.030922
462,-0.8577
463,-0.8577
464,-0.91676
465,-0.8577
466,-0.8577
467,-0.91676
468,-0.8577
469,-0.91676
470,-0.8577
471,-0.8577
472,-0.91676
473,0.79586
474,1.2683
475,1.2683
476,1.2683
477,1.2683
478,1.0321
479,1.2683
480,1.0321
481,0.14624
482,-0.8577
483,-0.8577
484,-0.8577
485,-0.91676
486,-0.8577
487,-0.91676
488,-0.8577
489,-0.91676
490,-0.8577
491,-0.91676
492,-0.8577
493,-0.030922
494,1.2683
495,1.5636
496,1.2683
497,1.0321
498,1.2683
499,1.0321
500,1.2683
501,1.0321
502,-0.20809
503,-0.8577
504,-0.8577
505,-0.8577
506,-0.8577
507,-0.8577
508,-0.91676
509,-0.8577
510,-0.91676
511,-0.8577
512,-0.91676
513,-0.8577
514,1.0321
515,1.5636
516,1.2683
517,1.0321
518,1.2683
519,1.2683
520,1.0321
521,1.0321
522,0.14624
523,-0.73959
524,-0.91676
525,-0.8577
526,-0.8577
527,-0.91676
528,-0.8577
529,-0.91676
530,-0.8577
531,-0.8577
532,-0.91676
533,-0.8577
534,0.79586
535,1.2683
536,1.5636
537,1.2683
538,1.0321
539,1.2683
540,1.0321
541,1.2683
542,-0.73959
543,-0.91676
544,-0.8577
545,-0.8577
546,-0.91676
547,-0.8577
548,-0.91676
549,-0.8577
550,-0.8577
551,-0.91676
552,-0.91676
553,-0.62148
554,1.2683
555,1.2683
556,1.2683
557,1.2683
558,1.2683
559,1.2683
560,1.0321
561,1.0321
562,0.79586
563,-0.8577
564,-0.91676
565,-0.8577
566,-0.8577
567,-0.8577
568,-0.91676
569,-0.8577
570,-0.8577
571,-0.73959
572,0.5596300000000001
573,1.2683
574,1.2683
575,1.2683
576,1.2683
577,1.2683
578,1.0321
579,1.2683
580,1.0321
581,1.0321
582,-0.030922
583,-0.91676
584,-0.8577
585,-0.8577
586,-0.91676
587,-0.8577
588,-0.91676
589,-0.91676
590,-0.8577
591,-0.8577
592,-0.91676
593,0.32341
594,1.2683
595,1.2683
596,1.2683
597,1.2683
598,1.0321
599,1.2683
600,1.0321
601,1.0321
602,1.0321
603,-0.8577
604,-0.8577
605,-0.8577
606,-0.8577
607,-0.8577
608,-0.91676
609,-0.8577
610,-0.91676
611,-0.8577
612,-0.91676
613,-0.8577
614,-0.030922
615,1.2683
616,1.5636
617,1.2683
618,1.0321
619,1.2683
620,1.0321
621,1.2683
622,1.0321
623,1.0321
624,-0.20809
625,-0.8577
626,-0.91676
627,-0.8577
628,-0.91676
629,-0.8577
630,-0.91676
631,-0.8577
632,-0.8577
633,-0.91676
634,-0.8577
635,-0.91676
636,1.2683
637,1.2683
638,1.2683
639,1.2683
640,1.2683
641,1.2683
642,1.0321
643,1.2683
644,1.0321
645,0.79586
646,-0.73959
647,-0.91676
648,-0.8577
649,-0.8577
650,-0.8577
651,-0.91676
652,-0.8577
653,-0.8577
654,-0.91676
655,-0.8577
656,-0.8577
657,-0.030922
658,1.2683
659,1.2683
660,1.2683
661,1.2683
662,1.2683
663,1.2683
664,1.0321
665,1.0321
666,1.2683
667,1.0321
668,-0.50337
669,-0.8577
670,-0.8577
671,-0.8577
672,-0.8577
673,-0.91676
674,-0.8577
675,-0.91676
676,-0.8577
677,-0.8577
678,-0.91676
679,-0.8577
680,0.79586
681,1.2683
682,1.5636
683,1.0321
684,1.2683
685,1.2683
686,1.0321
687,1.2683
688,1.0321
689,0.14624
690,-0.91676
691,-0.8577
692,-0.8577
693,-0.91676
694,-0.8577
695,-0.8577
696,-0.91676
697,-0.8577
698,-0.91676
699,-0.8577
700,-0.8577
701,0.32341
702,1.5636
703,1.2683
704,1.2683
705,1.2683
706,1.0321
707,1.2683
708,1.0321
709,1.2683
710,-0.62148
711,-0.8577
712,-0.8577
713,-0.8577
714,-0.8577
715,-0.91676
716,-0.8577
717,-0.8577
718,-0.91676
719,-0.8577
