time,value
0,0.32643
1,0.32643
2,0.32643
3,0.32643
4,0.32643
5,0.32643
6,0.32643
7,0.32643
8,0.32643
9,0.32643
10,0.32903000000000004
11,0.34648
12,0.38633
13,0.39946
14,0.40105
15,0.41597
16,0.47063
17,0.5252899999999999
18,0.6171
19,0.74707
20,0.9508200000000001
21,1.2816
22,1.734
23,2.1941
24,2.5638
25,2.7956
26,2.8825
27,2.8825
28,2.8825
29,2.8825
30,2.8814
31,2.8678
32,2.8131
33,2.6555
34,2.4927
35,2.3062
36,2.1069999999999998
37,1.9277
38,1.7638
39,1.6238
40,1.4896
41,1.3377
42,1.1513
43,0.9478
44,0.7894
45,0.66163
46,0.52454
47,0.34829
48,0.12967
49,-0.088949
50,-0.23825
51,-0.33398
52,-0.3768
53,-0.35857
54,-0.36904000000000003
55,-0.41572
56,-0.48406000000000005
57,-0.57317
58,-0.6824899999999999
59,-0.7918
60,-0.9011100000000001
61,-1.0104
62,-1.1197
63,-1.2181
64,-1.2728
65,-1.3274
66,-1.3486
67,-1.3532
68,-1.3433
69,-1.3078
70,-1.2846
71,-1.3019
72,-1.3449
73,-1.3995
74,-1.4512
75,-1.4802
76,-1.4351
77,-1.3804
78,-1.3258
79,-1.2711
80,-1.2165
81,-1.2088
82,-1.2072
83,-1.1875
84,-1.1439
85,-1.0893
86,-1.0346
87,-1.0005
88,-0.9880899999999999
89,-0.9992
90,-1.0376
91,-1.1237
92,-1.1403
93,-1.1751
94,-1.1816
95,-1.1366
96,-1.1343
97,-1.0887
98,-1.036
99,-1.0002
100,-0.9880899999999999
101,-0.9888899999999999
102,-1.018
103,-1.0285
104,-1.0002
105,-0.94553
106,-0.88981
107,-0.8246899999999999
108,-0.73122
109,-0.69597
110,-0.69597
111,-0.69597
112,-0.69597
113,-0.7399399999999999
114,-0.7623800000000001
115,-0.78695
116,-0.8285399999999999
117,-0.88265
118,-0.9094
119,-0.91506
120,-0.91506
121,-0.91506
122,-0.91419
123,-0.9048799999999999
124,-0.8484299999999999
125,-0.72133
126,-0.57922
127,-0.46991000000000005
128,-0.3606
129,-0.3363
130,-0.3021
131,-0.27188
132,-0.24253000000000002
133,-0.1795
134,-0.096939
135,-0.018912
136,0.075715
137,0.18095999999999998
138,0.27316999999999997
139,0.31968
140,0.32345
141,0.28806
142,0.27536
143,0.32806
144,0.38272
145,0.43737
146,0.43683
147,0.38201999999999997
148,0.28781999999999996
149,0.17840999999999999
150,0.043519
151,-0.097664
152,-0.21364
153,-0.29478000000000004
154,-0.34998
155,-0.41162
156,-0.51166
157,-0.58643
158,-0.6813100000000001
159,-0.83404
160,-0.9503299999999999
161,-1.0205
162,-1.0788
163,-1.1179999999999999
164,-1.1341
165,-1.1341
166,-1.1341
167,-1.1341
168,-1.1422
169,-1.1693
170,-1.2239
171,-1.2786
172,-1.3332
173,-1.3879
174,-1.4233
175,-1.4128
176,-1.3197
177,-1.2118
178,-1.1533
179,-1.1488
180,-1.1924
181,-1.2749
182,-1.338
183,-1.3251
184,-1.2426
185,-1.1047
186,-0.92884
187,-0.71487
188,-0.54247
189,-0.47689
190,-0.47689
191,-0.47689
192,-0.47689
193,-0.47689
194,-0.42826000000000003
195,-0.29793000000000003
196,-0.07964600000000001
197,0.19363
198,0.44525
199,0.63285
200,0.72811
201,0.73321
202,0.67894
203,0.63126
204,0.66786
205,0.7541899999999999
206,0.898
207,1.0951
208,1.2253
209,1.2657
210,1.206
211,1.115
212,1.0567
213,1.0567
214,1.1178
215,1.2676
216,1.4675
217,1.6822
218,1.8822
219,1.9868
220,2.0061
221,1.9755
222,1.8887
223,1.7422
224,1.6213
225,1.5107
226,1.4014
227,1.2797
228,1.1411
229,1.0015
230,0.89113
231,0.78182
232,0.67776
233,0.59402
234,0.55482
235,0.60948
236,0.66413
237,0.68929
238,0.69158
239,0.68682
240,0.64495
241,0.5918
242,0.55834
243,0.5221
244,0.45621000000000006
245,0.3469
246,0.25539
247,0.20096
248,0.18497
249,0.20496999999999999
250,0.2534
251,0.2534
252,0.20968
253,0.18345999999999998
254,0.16508
255,0.11874000000000001
256,0.064086
257,0.009430599999999999
258,-0.025032
259,-0.049726
260,-0.08150700000000001
261,-0.13616
262,-0.15771
263,-0.12407
264,-0.073371
265,-0.038713
266,-0.038713
267,-0.038713
268,-0.038713
269,-0.038713
270,-0.038713
271,-0.034837
272,0.0047015
273,0.027106
274,0.034316
275,0.034316
276,0.034316
277,0.034316
278,0.049638999999999996
279,0.084904
280,0.11068
281,0.12887
282,0.18037
283,0.18037
284,0.22141999999999998
285,0.24866999999999997
286,0.2534
287,0.24648
288,0.16973
289,0.093979
290,0.031525
291,-0.013458000000000001
292,-0.038713
293,-0.038713
294,-0.038713
295,-0.031366000000000005
296,-0.00010507
297,0.054272
298,0.10735
299,0.10735
300,0.10735
301,0.10735
302,0.094212
303,0.054359000000000005
304,0.036916000000000004
305,0.034316
306,0.034316
307,0.025287
308,2.2634e-05
309,-0.036026999999999997
310,-0.051628
311,-0.093833
312,-0.14634
313,-0.18477000000000002
314,-0.18477000000000002
