time,value
0,-0.19264
1,0.38151999999999997
2,1.0422
3,1.7298
4,2.3772
5,2.9182
6,3.2967
7,3.475
8,3.4384
9,3.1981
10,2.7884
11,2.2626
12,1.6845
13,1.1197
14,0.62637
15,0.24793
16,0.007841899999999999
17,-0.092008
18,-0.069765
19,0.040938999999999996
20,0.19754000000000002
21,0.35594000000000003
22,0.4776
23,0.53503
24,0.5150899999999999
25,0.4196
26,0.26348
27,0.07082999999999999
28,-0.13007
29,-0.31208
30,-0.45361
31,-0.54173
32,-0.57353
33,-0.5555
34,-0.50134
35,-0.42878999999999995
36,-0.35613
37,-0.2988
38,-0.26705
39,-0.26485
40,-0.28995
41,-0.33510999999999996
42,-0.39011
43,-0.44409
44,-0.48767
45,-0.51448
46,-0.5221399999999999
47,-0.51213
48,-0.48908999999999997
49,-0.45953
50,-0.4304
51,-0.40765999999999997
52,-0.39526
53,-0.39465
54,-0.40486
55,-0.42296999999999996
56,-0.44493
57,-0.4665
58,-0.48411000000000004
59,-0.49535
60,-0.49938999999999995
61,-0.49685
62,-0.48951000000000006
63,-0.47978999999999994
64,-0.47021999999999997
65,-0.46293
66,-0.45925
67,-0.45965
68,-0.46376999999999996
69,-0.47061000000000003
70,-0.47878999999999994
71,-0.48700000000000004
72,-0.49408
73,-0.49911000000000005
74,-0.5018
75,-0.50236
76,-0.50138
77,-0.49971000000000004
78,-0.49871000000000004
79,-0.49988
80,-0.50198
81,-0.50565
82,-0.5113800000000001
83,-0.5193800000000001
84,-0.52945
85,-0.54101
86,-0.55324
87,-0.56413
88,-0.57216
89,-0.57595
90,-0.57439
91,-0.5669
92,-0.55352
93,-0.53523
94,-0.51275
95,-0.48786
96,-0.46268000000000004
97,-0.43938
98,-0.41986999999999997
