time,value
0,-0.95791
1,-0.95791
2,-0.95791
3,-0.95791
4,-0.95791
5,-0.95791
6,-0.95791
7,-0.95791
8,-0.97239
9,-0.99265
10,-1.0172
11,-1.0196
12,-1.0206
13,-1.0206
14,-1.0206
15,-1.0206
16,-1.0206
17,-1.0206
18,-1.0206
19,-1.0206
20,-1.0206
21,-1.0206
22,-1.0206
23,-1.0206
24,-1.0206
25,-1.0206
26,-1.0206
27,-1.0206
28,-1.0206
29,-1.0206
30,-1.0216
31,-1.0567
32,-1.1005
33,-1.146
34,-1.1724
35,-1.1945
36,-1.2087
37,-1.2087
38,-1.2087
39,-1.2087
40,-1.2082
41,-1.193
42,-1.172
43,-1.1472
44,-1.1224
45,-1.0977
46,-1.0729
47,-1.0482
48,-1.0299
49,-1.0206
50,-1.0206
51,-1.0206
52,-1.0206
53,-1.0206
54,-1.0206
55,-1.0206
56,-1.0125
57,-0.98859
58,-0.95954
59,-0.92037
60,-0.87141
61,-0.8322799999999999
62,-0.80216
63,-0.7742
64,-0.73347
65,-0.68595
66,-0.63643
67,-0.58691
68,-0.5351899999999999
69,-0.47229
70,-0.39852
71,-0.33223
72,-0.27660999999999997
73,-0.22709000000000001
74,-0.17757
75,-0.12805
76,-0.42272
77,-0.27097
78,-0.14513
79,-0.083233
80,-0.0812
81,-0.05324500000000001
82,0.24933000000000002
83,0.16037
84,0.28417
85,0.40797
86,0.099478
87,0.10745999999999999
88,0.10797000000000001
89,0.11936
90,0.14192000000000002
91,0.16668
92,0.19144
93,0.2162
94,0.24095999999999998
95,0.26571999999999996
96,0.3012
97,0.35470999999999997
98,0.42786
99,0.49178999999999995
100,0.54567
101,0.59519
102,0.64471
103,0.6957399999999999
104,0.75165
105,0.82242
106,0.89213
107,0.9544299999999999
108,1.0045
109,1.0448
110,1.0759999999999998
111,1.1008
112,1.1411
113,1.1884
114,1.234
115,1.2625
116,1.291
117,1.3254
118,1.3743
119,1.4239
120,1.4734
121,1.5229
122,1.5583
123,1.5859999999999999
124,1.6107
125,1.6355
126,1.6574
127,1.675
128,1.6754
129,1.6824
130,1.6966
131,1.7214
132,1.7207
133,1.7054
134,1.6806
135,1.6759
136,1.6735
137,1.6687
138,1.6443
139,1.6195
140,1.5948
141,1.57
142,1.5564
143,1.55
144,1.55
145,1.5318
146,1.5109
147,1.4909
148,1.5153
149,1.5356
150,1.55
151,1.55
152,1.55
153,1.55
154,1.55
155,1.5664
156,1.588
157,1.6127
158,1.588
159,1.5664
160,1.55
161,1.55
162,1.55
163,1.55
164,1.55
165,1.5356
166,1.5153
167,1.4907
168,1.4884
169,1.4855
170,1.479
171,1.4542
172,1.4231
173,1.3847
174,1.3352
175,1.2731
176,1.2046
177,1.13
178,1.0357
179,0.9391
180,0.84478
181,0.7705
182,0.69622
183,0.6219399999999999
184,0.54766
185,0.48395
186,0.42746000000000006
187,0.37842
188,0.34647
189,0.31883
190,0.29407
191,0.26931
192,0.24753000000000003
193,0.23337
194,0.23337
195,0.20775
196,0.15789
197,0.42471000000000003
198,0.12919
199,-0.13715
200,-0.38475
201,-0.12725
202,-0.17677
203,-0.22629000000000002
204,-0.27581
205,-0.32533
206,-0.37485
207,-0.42436999999999997
208,-0.47389
209,-0.52341
210,-0.57644
211,-0.6443300000000001
212,-0.7171
213,-0.79138
214,-0.86566
215,-0.93558
216,-0.99545
217,-1.045
218,-1.0945
219,-1.1440000000000001
220,-1.1935
221,-1.2429999999999999
222,-1.2926
223,-1.3346
224,-1.3626
225,-1.3876
226,-1.4124
227,-1.4366
228,-1.4534
229,-1.4595
230,-1.4595
231,-1.4595
232,-1.4595
233,-1.4595
234,-1.4595
235,-1.4595
236,-1.4719
237,-1.4962
238,-1.5154
239,-1.5222
240,-1.5198
241,-1.5086
242,-1.4867
243,-1.4558
244,-1.4143
245,-1.3653
246,-1.2816
247,-1.1639
248,-1.0337
249,-0.87524
250,-0.70791
251,-0.56095
252,-0.45232
253,-0.36935999999999997
254,-0.31345
255,-0.28699
256,-0.27258000000000004
257,-0.26829000000000003
258,-0.26909
259,-0.28579
260,-0.31055
261,-0.33531
262,-0.36007
263,-0.38026
264,-0.39304
265,-0.39361999999999997
266,-0.38435
267,-0.36606
268,-0.3413
269,-0.30096
270,-0.25264000000000003
271,-0.20312
272,-0.1536
273,-0.10407999999999999
274,-0.26893
275,-0.13671
276,0.22626999999999997
277,0.47386999999999996
278,0.14352
279,0.17887999999999998
280,0.20661
281,0.23137
282,0.25613
283,0.28089000000000003
284,0.30565
285,0.33041
286,0.3482
287,0.35877
288,0.35877
289,0.35877
290,0.35877
291,0.35877
292,0.35877
293,0.35877
294,0.35877
295,0.35877
296,0.35877
297,0.35877
298,0.35877
299,0.35877
300,0.35877
301,0.35877
302,0.34054
303,0.31663
304,0.28948
305,0.24015999999999998
306,0.19514
307,0.1559
308,0.13114
309,0.10638
310,0.41197
311,0.28817
312,0.082462
313,-0.14912999999999998
314,-0.39673
315,0.65049
316,0.65049
317,0.65049
318,0.65049
319,0.65049
320,0.65049
321,0.65049
322,0.65049
323,0.6065699999999999
324,0.54514
325,0.47067
326,0.46341000000000004
327,0.46037
328,0.46037
329,0.46037
330,0.46037
331,0.46037
332,0.46037
333,0.46037
334,0.46037
335,0.46037
336,0.46037
337,0.46037
338,0.46037
339,0.46037
340,0.46037
341,0.46037
342,0.46037
343,0.46037
344,0.46037
345,0.45891000000000004
346,0.40563
347,0.33926999999999996
348,0.28845
349,0.35385
350,0.42646000000000006
351,0.50154
352,0.57662
353,0.6517
354,0.72678
355,0.8035399999999999
356,0.92463
357,1.0634
358,1.2021
359,1.2893
360,1.3637
361,1.411
362,1.411
363,1.3914
364,1.3444
365,1.2693
366,1.1942
367,1.1191
368,1.0228
369,0.8363
370,0.62022
371,0.46829
372,0.46103
373,0.44716000000000006
374,0.40345
375,0.33009
376,0.28649
377,0.27024000000000004
378,0.27024000000000004
379,0.27024000000000004
380,0.27024000000000004
381,0.27024000000000004
382,0.27024000000000004
383,0.27691
384,0.31747
385,0.39100999999999997
386,0.44187
387,0.46037
388,0.46037
389,0.46037
390,0.46037
391,0.46037
392,0.46037
393,0.46037
394,0.42283000000000004
395,0.34775
396,0.27266999999999997
397,0.19758
398,0.1225
399,0.24101
400,-0.1344
401,-0.10274000000000001
402,-0.17782
403,-0.2529
404,-0.29346
405,-0.30013
406,-0.30013
407,-0.30013
408,-0.30013
409,-0.30013
410,-0.30013
411,-0.30013
412,-0.30013
413,-0.30013
414,-0.30013
415,-0.30035
416,-0.30277
417,-0.35341
418,-0.42391
419,-0.47962
420,-0.49025
421,-0.49025
422,-0.49025
423,-0.49025
424,-0.51835
425,-0.57381
426,-0.64889
427,-0.67672
428,-0.68335
429,-0.6954600000000001
430,-0.7590899999999999
431,-0.82281
432,-0.8688299999999999
433,-0.8705
434,-0.8705
435,-0.8705
436,-0.8705
437,-0.91343
438,-0.97825
439,-1.0485
440,-1.0606
441,-1.0693
442,-1.0911
443,-1.1648
444,-1.2398
445,-1.3149
446,-1.39
447,-1.4651
448,-1.5402
449,-1.6152
450,-1.6903
451,-1.7654
452,-1.8405
453,-1.9156
454,-1.9907
455,-2.0657
456,-2.1408
457,-2.182
458,-2.2014
459,-2.2014
460,-2.2567
461,-2.3231
462,-2.3909
463,-2.3915
464,-2.3778
465,-2.3467
466,-2.2716
467,-2.2257
468,-2.2014
469,-2.2014
470,-2.2014
471,-2.2014
472,-2.2014
473,-2.2014
474,-2.2014
475,-2.2014
476,-2.2014
477,-2.177
478,-2.1311
479,-2.056
480,-1.9809999999999999
481,-1.9059
482,-1.8296
483,-1.6189
484,-1.3997
485,-1.1745
486,-0.94921
487,-0.74335
488,-0.55928
489,-0.40911
490,-0.297
491,-0.20446
492,-0.13047999999999998
493,-0.11595
494,-0.11143
495,-0.12575
496,-0.20083
497,-0.29018
498,-0.40185
499,-0.55201
500,-0.67014
501,-0.76635
502,-0.83998
503,-0.8617799999999999
504,-0.8705
505,-0.8583700000000001
506,-0.78813
507,-0.70525
508,-0.5980300000000001
509,-0.44787
510,-0.3236
511,-0.22384
512,-0.15043
513,-0.12137
514,-0.11
515,-0.11
516,-0.11
517,-0.11
518,-0.11
519,-0.11
520,-0.11
521,-0.11
522,-0.11
523,-0.11
524,-0.11
525,-0.43978
526,0.11727
527,0.16368
528,0.2894
529,0.3669
530,0.42899
531,0.46037
532,0.46208
533,0.49357
534,0.5524
535,0.61779
536,0.64444
537,0.65049
538,0.6279
539,0.5625100000000001
540,0.49488999999999994
541,0.46037
542,0.45883
543,0.43461000000000005
544,0.37801999999999997
545,0.31155
546,0.27764
547,0.27024000000000004
548,0.24964
549,0.19150999999999999
550,0.11765999999999999
551,0.21679
552,-0.14629
553,-0.35215
554,-0.18284
555,0.22956
556,0.15412
557,0.29567
558,0.44583999999999996
559,0.596
560,0.74616
561,0.9653700000000001
562,1.2523
563,1.5527
564,1.8530000000000002
565,2.123
566,2.2902
567,2.2635
568,2.1884
569,2.1134
570,2.0383
571,1.9318
572,1.7949
573,1.6447
574,1.4945
575,1.3444
576,1.1942
577,1.0441
578,0.9077700000000001
579,0.79394
580,0.71709
581,0.67011
582,0.65049
583,0.65049
584,0.65049
585,0.65049
586,0.65049
587,0.65049
588,0.65049
589,0.65049
590,0.65049
591,0.6751699999999999
592,0.72436
593,0.7994399999999999
594,0.8315899999999999
595,0.8406100000000001
596,0.8406100000000001
597,0.8406100000000001
598,0.8319
599,0.8101
600,0.73647
601,0.68253
602,0.65049
603,0.65049
604,0.65049
605,0.65049
606,0.65049
607,0.65049
608,0.65049
609,0.65049
610,0.65049
611,0.65049
612,0.65049
613,0.65049
614,0.65049
615,0.65049
616,0.65049
617,0.65049
618,0.64745
619,0.6401899999999999
620,0.56572
621,0.49063999999999997
622,0.41556000000000004
623,0.34048
624,0.2946
625,0.27024000000000004
626,0.27024000000000004
627,0.22057
628,0.1552
629,0.40449
630,0.47484
631,0.47484
632,0.47484
633,0.47484
634,0.47484
635,0.47484
636,0.47484
637,0.47484
638,0.43176000000000003
639,0.37151
640,0.29848
641,0.29136
642,0.28838
643,0.28838
644,0.28838
645,0.28838
646,0.28838
647,0.28838
648,0.28838
649,0.28838
650,0.28838
651,0.28838
652,0.28838
653,0.28838
654,0.28838
655,0.28838
656,0.28838
657,0.28838
658,0.28838
659,0.28838
660,0.28765999999999997
661,0.26153000000000004
662,0.22899
663,0.19217
664,0.15536
665,0.11854
666,0.4125
667,0.22841
668,0.30099000000000004
669,-0.13977
670,-0.32386
671,-0.10237
672,-0.13918
673,-0.17039
674,-0.17633
675,-0.17958
676,-0.19322
677,-0.23004000000000002
678,-0.26686
679,-0.30368
680,-0.33963000000000004
681,-0.35745
682,-0.36425
683,-0.37468
684,-0.42931
685,-0.49845
686,-0.5481199999999999
687,-0.5505
688,-0.55719
689,-0.57862
690,-0.6146
691,-0.63597
692,-0.64394
693,-0.64869
694,-0.67245
695,-0.7063
696,-0.7320399999999999
697,-0.73679
698,-0.74045
699,-0.7603300000000001
700,-0.7964
701,-0.82134
702,-0.83041
703,-0.83041
704,-0.83041
705,-0.83041
706,-0.8405100000000001
707,-0.8690200000000001
708,-0.90523
709,-0.92364
710,-0.92364
711,-0.92364
712,-0.92364
713,-0.92364
714,-0.92364
715,-0.92364
716,-0.93271
717,-0.95765
718,-0.99371
719,-1.0136
720,-1.0169
721,-1.0169
722,-1.0169
723,-1.0198
724,-1.0329
725,-1.065
726,-1.0938
727,-1.1093
728,-1.1101
729,-1.1255
730,-1.1557
731,-1.1913
732,-1.2033
733,-1.2056
734,-1.2151
735,-1.2467
736,-1.2767
737,-1.2957
738,-1.2966
739,-1.2966
740,-1.2966
741,-1.2966
742,-1.2734
743,-1.2398
744,-1.2089
745,-1.2033
746,-1.1978
747,-1.1835
748,-1.1475
749,-1.1107
750,-1.0739
751,-1.0371
752,-1.0002
753,-0.9640299999999999
754,-0.9295899999999999
755,-0.92364
756,-0.92364
757,-0.92364
758,-0.92364
759,-0.91327
760,-0.8921600000000001
761,-0.85535
762,-0.8374
763,-0.83041
764,-0.83041
765,-0.77081
766,-0.69858
767,-0.6249399999999999
768,-0.5513100000000001
769,-0.48623
770,-0.43076000000000003
771,-0.39394
772,-0.35712
773,-0.3203
774,-0.28349
775,-0.24666999999999997
776,-0.20836
777,-0.16798
778,-0.46934
779,-0.13464
780,0.15715
781,0.34124
782,0.1186
783,0.1803
784,0.25393000000000004
785,0.30321
786,0.34479
787,0.38161
788,0.41843
789,0.45524
790,0.49206000000000005
791,0.52888
792,0.55376
793,0.56807
794,0.56807
795,0.5896100000000001
796,0.61974
797,0.65686
798,0.72693
799,0.79907
800,0.87271
801,0.94634
802,1.02
803,1.0936
804,1.1672
805,1.2222
806,1.2676
807,1.3055
808,1.4017
809,1.5042
810,1.5936
811,1.5936
812,1.6006
813,1.6186
814,1.6554
815,1.6765
816,1.6869
817,1.6869
818,1.6869
819,1.6869
820,1.6869
821,1.6869
822,1.6824
823,1.6667
824,1.6298
825,1.6057
826,1.5936
827,1.5936
828,1.5936
829,1.5936
830,1.5936
831,1.5936
832,1.5918
833,1.5782
834,1.5414
835,1.5238
836,1.5331
837,1.5699
838,1.6067
839,1.6435
840,1.6855
841,1.7497
842,1.8211
843,1.8827
844,1.9207
845,1.9447
846,1.9386
847,1.9018
848,1.865
849,1.8282
850,1.7914
851,1.7546
852,1.7177
853,1.6698
854,1.601
855,1.5277
856,1.4541
857,1.3812
858,1.3194
859,1.2735
860,1.2367
861,1.1999
862,1.1631
863,1.1162
864,1.0508
865,0.97782
866,0.9225899999999999
867,0.88456
868,0.8311200000000001
869,0.74088
870,0.63405
871,0.54023
872,0.46237
873,0.3978
874,0.34911
875,0.31154
876,0.27471999999999996
877,0.23751
878,0.19594
879,0.13339
880,0.22841
881,-0.46638
882,-0.32802
883,-0.5777800000000001
884,-0.81412
885,-1.0359
886,-1.226
887,-1.386
888,-1.5309
889,-1.6285
890,-1.6977
891,-1.7523
892,-1.7627
893,-1.7559
894,-1.7381
895,-1.7022
896,-1.6516
897,-1.5875
898,-1.5139
899,-1.4634
900,-1.4263
901,-1.3954
902,-1.3898
903,-1.3842
904,-1.37
905,-1.334
906,-1.2851
907,-1.2241
908,-1.1505
909,-1.0558
910,-0.95037
911,-0.84229
912,-0.76271
913,-0.69335
914,-0.6304
915,-0.59287
916,-0.54569
917,-0.48776
918,-0.41413
919,-0.34049
920,-0.26686
921,-0.19322
922,-0.14939000000000002
923,-0.11187000000000001
924,-0.37135999999999997
925,-0.18727
926,-0.11160999999999999
927,0.1809
928,0.36499000000000004
929,0.46593999999999997
930,0.10191
931,0.10191
932,0.12902
933,0.16159
934,0.19484
935,0.19514
936,0.19514
937,0.19514
938,0.19514
939,0.18083
940,0.15595
941,0.11913
942,0.10667
943,0.10191
944,0.10191
