time,value
0,-0.53695
1,-0.53695
2,-0.53695
3,-0.53695
4,-0.53695
5,-0.53695
6,-0.53695
7,-0.53695
8,-0.53695
9,-0.53695
10,-0.53695
11,-0.53695
12,-0.53695
13,-0.53695
14,-0.53695
15,-0.53695
16,-0.53695
17,-0.53695
18,-0.53695
19,-0.53695
20,-0.53695
21,-0.53695
22,-0.53695
23,-0.53695
24,-0.53695
25,-0.53695
26,-0.53695
27,-0.53695
28,-0.53695
29,-0.53695
30,-0.53695
31,-0.53695
32,-0.53695
33,-0.53695
34,-0.53695
35,-0.53695
36,-0.53695
37,-0.53695
38,-0.53695
39,-0.53695
40,-0.53695
41,-0.53695
42,-0.53695
43,-0.53695
44,-0.53695
45,-0.53695
46,-0.53695
47,-0.53695
48,-0.5345
49,-0.52805
50,-0.5152
51,-0.50234
52,-0.49208
53,-0.48565
54,-0.4852
55,-0.4852
56,-0.4852
57,-0.4949
58,-0.50629
59,-0.5191399999999999
60,-0.5315
61,-0.53695
62,-0.53695
63,-0.53695
64,-0.53695
65,-0.53695
66,-0.53695
67,-0.53695
68,-0.53556
69,-0.5281399999999999
70,-0.51684
71,-0.5039899999999999
72,-0.49113
73,-0.4866
74,-0.4852
75,-0.4852
76,-0.4852
77,-0.4852
78,-0.4852
79,-0.4852
80,-0.4852
81,-0.4852
82,-0.4852
83,-0.4852
84,-0.4852
85,-0.4852
86,-0.4852
87,-0.4852
88,-0.4852
89,-0.49171000000000004
90,-0.50366
91,-0.51651
92,-0.52789
93,-0.53695
94,-0.53695
95,-0.53695
96,-0.53695
97,-0.53695
98,-0.53695
99,-0.53695
100,-0.53695
101,-0.54406
102,-0.55443
103,-0.56728
104,-0.58014
105,-0.5887100000000001
106,-0.5887100000000001
107,-0.5887100000000001
108,-0.5887100000000001
109,-0.5887100000000001
110,-0.5887100000000001
111,-0.5887100000000001
112,-0.5887100000000001
113,-0.5887100000000001
114,-0.5887100000000001
115,-0.5887100000000001
116,-0.5887100000000001
117,-0.5887100000000001
118,-0.5887100000000001
119,-0.5887100000000001
120,-0.5887100000000001
121,-0.5887100000000001
122,-0.5887100000000001
123,-0.5887100000000001
124,-0.5887100000000001
125,-0.5887100000000001
126,-0.5887100000000001
127,-0.5887100000000001
128,-0.5887100000000001
129,-0.60053
130,-0.6190399999999999
131,-0.64476
132,-0.67047
133,-0.68513
134,-0.67673
135,-0.6645399999999999
136,-0.65242
137,-0.64155
138,-0.64047
139,-0.64047
140,-0.64047
141,-0.64047
142,-0.64047
143,-0.64047
144,-0.64047
145,-0.6452
146,-0.65432
147,-0.66718
148,-0.68003
149,-0.6915600000000001
150,-0.69205
151,-0.69223
152,-0.69271
153,-0.69567
154,-0.7054199999999999
155,-0.71828
156,-0.7311300000000001
157,-0.7439899999999999
158,-0.75685
159,-0.76971
160,-0.78256
161,-0.7985300000000001
162,-0.8212799999999999
163,-0.84652
164,-0.87205
165,-0.8972700000000001
166,-0.9114700000000001
167,-0.92432
168,-0.9371799999999999
169,-0.94631
170,-0.9510299999999999
171,-0.9510299999999999
172,-0.9510299999999999
173,-0.95489
174,-0.96257
175,-0.9754200000000001
176,-0.9882799999999999
177,-0.9989899999999999
178,-0.9900899999999999
179,-0.97872
180,-0.96609
181,-0.9547100000000001
182,-0.9510299999999999
183,-0.9510299999999999
184,-0.9510299999999999
185,-0.94383
186,-0.9299299999999999
187,-0.9042100000000001
188,-0.8785
189,-0.85535
190,-0.83804
191,-0.8244299999999999
192,-0.81157
193,-0.79872
194,-0.7753800000000001
195,-0.75026
196,-0.72454
197,-0.6988300000000001
198,-0.67311
199,-0.6474
200,-0.62168
201,-0.5929300000000001
202,-0.56102
203,-0.52245
204,-0.48388000000000003
205,-0.44614
206,-0.41697
207,-0.38992
208,-0.3642
209,-0.33849
210,-0.3042
211,-0.26563000000000003
212,-0.22705999999999998
213,-0.19097
214,-0.15816
215,-0.13244
216,-0.10672999999999999
217,-0.08306000000000001
218,-0.06426799999999999
219,-0.050352
220,-0.037495
221,-0.024638
222,-0.01178
223,0.0010772
224,0.013935
225,0.027707
226,0.046902
227,0.072617
228,0.098332
229,0.12628
230,0.15667999999999999
231,0.19526
232,0.23383
233,0.27303
234,0.31951999999999997
235,0.369
236,0.42043
237,0.47185
238,0.54571
239,0.63208
240,0.72208
241,0.80928
242,0.8902100000000001
243,0.9545
244,1.0188
245,1.0831
246,1.1474
247,1.2116
248,1.2759
249,1.3402
250,1.3968
251,1.4507
252,1.5021
253,1.5535
254,1.594
255,1.6207
256,1.6465
257,1.6722
258,1.6979
259,1.7236
260,1.7494
261,1.7751
262,1.8008
263,1.8265
264,1.8522
265,1.8779
266,1.9036
267,1.9294
268,1.9551
269,1.9808
270,2.0065
271,2.0322
272,2.0579
273,2.0815
274,2.0993
275,2.1028
276,2.1028
277,2.1028
278,2.1028
279,2.1028
280,2.1028
281,2.1028
282,2.1028
283,2.1028
284,2.1028
285,2.1013
286,2.0981
287,2.0724
288,2.0467
289,2.0213
290,2.0005
291,1.9844
292,1.9716
293,1.9587
294,1.9351
295,1.9040000000000001
296,1.8654
297,1.8268
298,1.7883
299,1.7497
300,1.7111
301,1.6725
302,1.6340000000000001
303,1.5954
304,1.5568
305,1.5182
306,1.4847
307,1.4546
308,1.4289
309,1.4032
310,1.3775
311,1.3518
312,1.3259999999999998
313,1.3003
314,1.2746
