time,value
0,-1.3653
1,-1.3628
2,-1.399
3,-1.4306
4,-1.3421
5,-1.3523
6,-1.3561
7,-1.4080000000000001
8,-1.3854
9,-1.4018
10,-1.3376
11,-1.3641
12,-1.376
13,-1.3891
14,-1.3806
15,-1.3780000000000001
16,-1.357
17,-1.3754
18,-1.3839
19,-1.4183
20,-1.3519999999999999
21,-1.4118
22,-1.3877
23,-1.3928
24,-1.3428
25,-1.3992
26,-1.4028
27,-1.3495
28,-1.3515
29,-1.3754
30,-1.3799
31,-1.3915
32,-1.3516
33,-1.3874
34,-1.3781
35,-1.3798
36,-1.3634
37,-1.3558
38,-1.3936
39,-1.3776
40,-1.3157
41,-1.4068
42,-1.4093
43,-1.3798
44,-1.383
45,-1.3538
46,-1.3475
47,-1.4023
48,-1.3591
49,-1.3997
50,-1.3230000000000002
51,-1.3577
52,-1.4149
53,-1.4021
54,-1.3768
55,-1.3886
56,-1.3818
57,-1.3717
58,-1.3498
59,-1.4146
60,-1.3572
61,-1.4164
62,-1.3217
63,-1.3251
64,-1.381
65,-1.3525
66,-1.4047
67,-1.3766
68,-1.3427
69,-1.3858
70,-1.3767
71,-1.4091
72,-1.3935
73,-1.4240000000000002
74,-1.3465
75,-1.3506
76,-1.3452
77,-1.3417
78,-1.361
79,-1.3643
80,-1.3285
81,-1.3084
82,-1.3156
83,-1.3519999999999999
84,-1.2671
85,-1.3243
86,-1.2986
87,-1.2121
88,-1.1606
89,-1.0899
90,-1.078
91,-1.0568
92,-0.96786
93,-0.84391
94,-0.8184
95,-0.71209
96,-0.6409199999999999
97,-0.49283999999999994
98,-0.3813
99,-0.29445
100,-0.11840999999999999
101,-0.077583
102,0.11598
103,0.18363
104,0.49012
105,0.4861
106,0.6722100000000001
107,0.66594
108,0.6977899999999999
109,0.67296
110,0.68103
111,0.73288
112,0.70907
113,0.7567699999999999
114,0.71197
115,0.7531399999999999
116,0.7380399999999999
117,0.7525
118,0.76045
119,0.75766
120,0.78287
121,0.7176
122,0.76117
123,0.72816
124,0.8333
125,0.80066
126,0.77657
127,0.74853
128,0.7389899999999999
129,0.76051
130,0.7336
131,0.7751100000000001
132,0.7833
133,0.75958
134,0.79447
135,0.75977
136,0.74533
137,0.75145
138,0.73733
139,0.76744
140,0.75492
141,0.75773
142,0.73044
143,0.77066
144,0.79122
145,0.7971
146,0.78457
147,0.78495
148,0.7663399999999999
149,0.75208
150,0.77251
151,0.75926
152,0.7679
153,0.73249
154,0.72863
155,0.76778
156,0.7854399999999999
157,0.76736
158,0.79292
159,0.77936
160,0.74993
161,0.76163
162,0.79632
163,0.67261
164,0.7468199999999999
165,0.7541
166,0.73441
167,0.77356
168,0.73352
169,0.72963
170,0.75945
171,0.7532800000000001
172,0.74238
173,0.81807
174,0.77991
175,0.73234
176,0.7600899999999999
177,0.76198
178,0.75483
179,0.79343
180,0.7594
181,0.77236
182,0.85625
183,1.0151
184,1.0757
185,1.2024
186,1.182
187,1.2061
188,1.131
189,1.0013
190,0.8386600000000001
191,0.75174
192,0.67711
193,0.38198000000000004
194,0.36052
195,0.34636999999999996
196,0.31863
197,0.55425
198,0.67002
199,0.70097
200,0.72819
201,0.73323
202,0.75571
203,0.7538199999999999
204,0.7417600000000001
205,0.79269
206,0.72402
207,0.79656
208,0.78593
209,0.7964399999999999
210,0.73616
211,0.74631
212,0.762
213,0.7315699999999999
214,0.77213
215,0.77874
216,0.79261
217,0.74653
218,0.73902
219,0.7570399999999999
220,0.81298
221,0.74239
222,0.75567
223,0.77441
224,0.75155
225,0.7461399999999999
226,0.7468100000000001
227,0.76142
228,0.81877
229,0.75457
230,0.78266
231,0.78706
232,0.7731
233,0.77474
234,0.7627
235,0.84839
236,0.72439
237,0.74343
238,0.73549
239,0.74897
240,0.76343
241,0.74731
242,0.74763
243,0.76178
244,0.78261
245,0.7564
246,0.75064
247,0.71938
248,0.74236
249,0.77213
250,0.77989
251,0.74475
252,0.75742
253,0.8047300000000001
254,0.77078
255,0.75737
256,0.7377600000000001
257,0.75111
258,0.76472
259,0.7758
260,0.78838
261,0.77823
262,0.81292
263,0.74961
264,0.76548
265,0.77836
266,0.79837
267,0.73416
268,0.76048
269,0.74834
270,0.74306
271,0.8264299999999999
272,0.77828
273,0.7481
274,0.77956
