time,value
0,-0.17659
1,0.13466
2,-0.029167000000000002
3,0.4395
4,-0.43556000000000006
5,0.099655
6,-0.061901
7,-0.1456
8,0.074561
9,0.095924
10,-1.6145
11,-1.6145
12,-1.6145
13,-1.6145
14,-1.6145
15,-1.6145
16,-1.6145
17,-1.6145
18,-1.6145
19,-1.6145
20,-1.6145
21,-1.6145
22,1.6509
23,1.6509
24,1.6509
25,1.6509
26,1.6509
27,1.6509
28,1.6509
29,1.6509
30,1.6509
31,1.6509
32,1.6509
33,0.028276999999999997
34,-0.11025
35,0.22524
36,-0.22248
37,-0.27587
38,-0.033591
39,0.10490999999999999
40,-0.080212
41,-0.22236999999999998
42,0.57833
43,-0.12394000000000001
44,0.11999000000000001
45,0.30951999999999996
46,-0.39455
47,0.72018
48,-0.032637
49,0.37366
50,-0.1872
51,0.3374
52,-0.06949
53,0.1232
54,0.033991
55,0.13227
56,-0.1795
57,0.27817
58,0.012581
59,0.25206999999999996
60,-0.31256999999999996
61,0.033173
62,0.050705
63,0.25425
64,-0.87675
65,-0.031851
66,0.05577000000000001
67,-0.2177
68,0.042581
69,0.20956
70,-0.11962
71,0.52522
72,-0.06277100000000001
73,-0.24921999999999997
74,-0.69163
75,-1.6145
76,-1.6145
77,-1.6145
78,-1.6145
79,-1.6145
80,-1.6145
81,-1.6145
82,-1.6145
83,-1.6145
84,-1.6145
85,-1.6145
86,1.6509
87,1.6509
88,1.6509
89,1.6509
90,1.6509
91,1.6509
92,1.6509
93,1.6509
94,1.6509
95,1.6509
96,1.6509
97,0.23956
98,0.17246
99,0.019614
100,-0.24398000000000003
101,-0.36791
102,0.15025
103,0.6339100000000001
104,-0.03576
105,-0.13263
106,-0.3256
107,0.065201
108,-0.17720999999999998
109,-0.79494
110,0.5917399999999999
111,-0.25229
112,-0.39783
113,0.12936
114,0.30967
115,-0.007737899999999999
116,0.40742
117,0.49887
118,-0.025695
119,0.31901
120,0.033416
121,0.17992
122,-0.17357999999999998
123,-0.15169000000000002
124,-0.031431
125,-0.023153
126,-0.20720999999999998
127,0.11087999999999999
