time,value
0,-1.5891
1,-1.0433
2,-0.46636000000000005
3,0.056947000000000005
4,0.47698
5,0.7937
6,1.0190000000000001
7,1.175
8,1.2642
9,1.2772
10,1.1992
11,1.0151
12,0.72277
13,0.34334000000000003
14,-0.082692
15,-0.50239
16,-0.8660700000000001
17,-1.1309
18,-1.2731
19,-1.2723
20,-1.127
21,-0.85055
22,-0.4637
23,-0.0095089
24,0.44956999999999997
25,0.8467600000000001
26,1.1265
27,1.2429999999999999
28,1.1777
29,0.9418200000000001
30,0.5766
31,0.14647000000000002
32,-0.28626999999999997
33,-0.66059
34,-0.9271799999999999
35,-1.0599
36,-1.0457
37,-0.8869100000000001
38,-0.60935
39,-0.23628000000000002
40,0.18078
41,0.58112
42,0.91309
43,1.1275
44,1.199
45,1.1226
46,0.92255
47,0.64127
48,0.30651999999999996
49,-0.050078
50,-0.40397
51,-0.74215
52,-1.0391
53,-1.2744
54,-1.4229
55,-1.4627
56,-1.3776
57,-1.1777
58,-0.88851
59,-0.54418
60,-0.18848
61,0.14649
62,0.44422
63,0.70611
64,0.94594
65,1.1584
66,1.3264
67,1.4102
68,1.3728
69,1.1844
70,0.86692
71,0.46853999999999996
72,0.073288
73,-0.2159
74,-0.33295
75,-0.26259
76,-0.042044
77,0.24289000000000002
78,0.49432
79,0.61716
80,0.56267
81,0.33333
82,-0.038513
83,-0.48098
84,-0.9259299999999999
85,-1.3265
86,-1.6563
87,-1.9054
88,-2.0712
89,-2.141
90,-2.0835
91,-1.8653
92,-1.4651
93,-0.8920299999999999
94,-0.18254
95,0.5980800000000001
96,1.3542
97,2.0094
98,2.4973
99,2.7879
100,2.8824
101,2.7996
102,2.582
103,2.2555
104,1.8479
105,1.3693
106,0.8202299999999999
107,0.20874
108,-0.43778999999999996
109,-1.0727
110,-1.6416
111,-2.0897
112,-2.38
113,-2.4833
114,-2.4066
115,-2.1817
116,-1.8537
117,-1.4753
118,-1.0947
119,-0.7379399999999999
120,-0.41812
121,-0.12249000000000002
122,0.17124
123,0.4776
124,0.79692
125,1.1191
126,1.4025
127,1.601
128,1.6691
129,1.5962
130,1.3983
131,1.1183
132,0.81839
133,0.5548
134,0.35825
135,0.22473
136,0.12622
137,0.0096505
138,-0.1643
139,-0.42045
140,-0.74478
141,-1.0902
142,-1.3888
143,-1.5783
144,-1.6211
145,-1.5043
146,-1.2449
147,-0.8746799999999999
148,-0.44783999999999996
149,-0.0019983
150,0.43756000000000006
151,0.8438200000000001
152,1.2138
153,1.5187
154,1.742
155,1.8605
156,1.8482
157,1.6931
158,1.3986
159,0.9807799999999999
160,0.46793999999999997
161,-0.093579
162,-0.65786
163,-1.1853
164,-1.6424
165,-2.0021
166,-2.2366
167,-2.3261
168,-2.258
169,-2.0235
170,-1.6234
171,-1.0859999999999999
172,-0.44983999999999996
173,0.22753
174,0.87905
175,1.4408
176,1.8665
177,2.1192
178,2.1835
179,2.0698
180,1.8184
181,1.4771
182,1.0874
183,0.70872
184,0.37574
185,0.10389000000000001
186,-0.1034
187,-0.25874
188,-0.39316999999999996
189,-0.53546
190,-0.69881
191,-0.8823200000000001
192,-1.0733
193,-1.2408
194,-1.3414
195,-1.3469
196,-1.2477
197,-1.0438
198,-0.76974
199,-0.47215
200,-0.18466
201,0.058367999999999996
202,0.24463000000000001
203,0.38419000000000003
204,0.50516
205,0.63622
206,0.79196
207,0.9827100000000001
208,1.1871
209,1.3592
210,1.4526
211,1.4303
212,1.2715
213,0.9862200000000001
214,0.60983
215,0.18425
216,-0.24474
217,-0.64182
218,-0.9884200000000001
219,-1.274
220,-1.4888
221,-1.6143
222,-1.6372
223,-1.541
224,-1.3029
225,-0.9265100000000001
226,-0.43982
227,0.10885
228,0.6551
229,1.1287
230,1.4554
231,1.5948
232,1.5227
233,1.2493
234,0.81333
235,0.28138
236,-0.27019
237,-0.76532
238,-1.1293
239,-1.3125
240,-1.2796
241,-1.0372
242,-0.62473
243,-0.10912000000000001
244,0.42846000000000006
245,0.90096
246,1.2473
247,1.4267
248,1.4280000000000002
249,1.2799
250,1.0214
251,0.69112
252,0.33264
253,-0.035601
254,-0.39508000000000004
255,-0.7368899999999999
256,-1.0413
257,-1.2779
258,-1.421
259,-1.4385
260,-1.3153
261,-1.057
262,-0.6965100000000001
263,-0.29435
264,0.075409
265,0.35822
266,0.51181
267,0.52949
268,0.44691000000000003
269,0.32119000000000003
270,0.22075999999999998
271,0.19493
272,0.26428
273,0.42089
274,0.6175
275,0.7916
276,0.89192
277,0.8750700000000001
278,0.7325
279,0.49843999999999994
280,0.22734000000000001
281,-0.028341
282,-0.22366
283,-0.32228
284,-0.33881
285,-0.30512
286,-0.26100999999999996
287,-0.24575999999999998
288,-0.29407
289,-0.4038
290,-0.55489
291,-0.71982
292,-0.86345
293,-0.94994
294,-0.9522299999999999
295,-0.85824
296,-0.66097
297,-0.3639
298,0.012283
299,0.43901999999999997
300,0.8728299999999999
301,1.2571
302,1.5341
303,1.6574
304,1.6058
305,1.3867
306,1.0301
307,0.59296
308,0.12719
309,-0.31644
310,-0.6998300000000001
311,-0.99785
312,-1.2044
313,-1.3167
314,-1.3255
315,-1.2275
316,-1.014
317,-0.69204
318,-0.27713000000000004
319,0.18184
320,0.6242300000000001
321,0.9819100000000001
322,1.1985
323,1.2328
324,1.0849
325,0.78645
326,0.39814
327,-0.014753
328,-0.38783
329,-0.67492
330,-0.85914
331,-0.93235
332,-0.91012
333,-0.80601
334,-0.63513
335,-0.42078000000000004
336,-0.19209
337,0.038488
338,0.25383
339,0.44465
340,0.60412
341,0.7248600000000001
342,0.80429
343,0.8422799999999999
344,0.8360799999999999
345,0.76828
346,0.64456
347,0.46503
348,0.2371
349,-0.014486
350,-0.26303000000000004
351,-0.47534
352,-0.6206
353,-0.68255
354,-0.65646
355,-0.5622699999999999
356,-0.42858999999999997
357,-0.28764
358,-0.1668
359,-0.083567
360,-0.046619
361,-0.044036
362,-0.07270800000000001
363,-0.11789000000000001
364,-0.1709
365,-0.22035
366,-0.26623
367,-0.29865
368,-0.30313
369,-0.28078000000000003
370,-0.20776
371,-0.08732899999999999
372,0.085869
373,0.30158
374,0.53757
375,0.77376
376,0.9772299999999999
377,1.1246
378,1.1853
379,1.1426
380,0.98005
381,0.69989
382,0.31665
383,-0.13241
384,-0.60268
385,-1.037
386,-1.3776
387,-1.5739
388,-1.6076
389,-1.4823
390,-1.222
391,-0.8702200000000001
392,-0.47086999999999996
393,-0.060269
394,0.33810999999999997
395,0.70945
396,1.0368
397,1.3039
398,1.4825
399,1.5423
400,1.4571
401,1.2225
402,0.85052
403,0.37793000000000004
404,-0.12111
405,-0.5796100000000001
406,-0.94573
407,-1.172
408,-1.2426
409,-1.1716
410,-0.99651
411,-0.75659
412,-0.49456000000000006
413,-0.25025
414,-0.047830000000000004
415,0.10764000000000001
416,0.21525
417,0.28147
418,0.31851999999999997
419,0.33266
420,0.3424
421,0.35070999999999997
422,0.36285
423,0.36805
424,0.36084
425,0.33445
426,0.28218000000000004
427,0.20288
428,0.11861
429,0.055859000000000006
430,0.025682
431,0.032865
432,0.071639
433,0.11439
434,0.13162000000000001
435,0.084852
436,-0.028961
437,-0.19483
438,-0.38634
439,-0.56421
440,-0.70038
441,-0.7631100000000001
442,-0.7459899999999999
443,-0.65277
444,-0.49846
445,-0.30015
446,-0.058080999999999994
447,0.21536999999999998
448,0.50742
449,0.79932
450,1.0563
451,1.2339
452,1.3002
453,1.2248
454,1.0097
455,0.67133
456,0.25216
457,-0.19304000000000002
458,-0.6166699999999999
459,-0.9829899999999999
460,-1.2583
461,-1.4287
462,-1.4871
463,-1.4219
464,-1.2356
465,-0.93755
466,-0.5561
467,-0.13239
468,0.27988
469,0.61583
470,0.8432700000000001
471,0.93273
472,0.89784
473,0.77595
474,0.61911
475,0.47906000000000004
476,0.38586
477,0.34199
478,0.32278
479,0.30544
480,0.2729
481,0.21898
482,0.14975
483,0.091823
484,0.063065
485,0.06581000000000001
486,0.084826
487,0.095998
488,0.06437899999999999
489,-0.027752
490,-0.17472000000000001
491,-0.36453
492,-0.55943
493,-0.71825
494,-0.81708
495,-0.85688
496,-0.8500200000000001
497,-0.80977
498,-0.75688
499,-0.69117
