time,value
0,-0.46488999999999997
1,-0.46488999999999997
2,-0.46488999999999997
3,-0.46488999999999997
4,-0.46488999999999997
5,-0.46488999999999997
6,-0.46488999999999997
7,-0.46488999999999997
8,-0.46488999999999997
9,-0.46488999999999997
10,-0.46488999999999997
11,-0.46488999999999997
12,-0.46488999999999997
13,-0.46488999999999997
14,-0.46488999999999997
15,-0.46488999999999997
16,-0.46488999999999997
17,-0.46488999999999997
18,-0.46488999999999997
19,-0.46488999999999997
20,-0.46488999999999997
21,-0.46488999999999997
22,-0.46488999999999997
23,-0.46488999999999997
24,-0.46488999999999997
25,-0.46488999999999997
26,-0.46488999999999997
27,-0.46488999999999997
28,-0.46488999999999997
29,-0.46488999999999997
30,-0.46488999999999997
31,-0.46488999999999997
32,-0.46488999999999997
33,-0.46488999999999997
34,-0.46488999999999997
35,-0.46488999999999997
36,-0.46488999999999997
37,-0.46488999999999997
38,-0.46488999999999997
39,-0.46488999999999997
40,-0.46488999999999997
41,-0.46488999999999997
42,-0.46488999999999997
43,-0.46488999999999997
44,-0.46488999999999997
45,-0.46488999999999997
46,-0.46488999999999997
47,-0.46488999999999997
48,-0.46488999999999997
49,-0.46488999999999997
50,-0.46488999999999997
51,-0.46488999999999997
52,-0.46488999999999997
53,-0.46488999999999997
54,-0.46488999999999997
55,-0.46488999999999997
56,-0.46488999999999997
57,-0.46488999999999997
58,-0.46488999999999997
59,-0.46488999999999997
60,-0.46488999999999997
61,-0.43245
62,-0.29641999999999996
63,-0.045457
64,-0.1024
65,-0.090777
66,-0.063823
67,-0.023683000000000003
68,-0.09666799999999999
69,-0.043355
70,-0.026844999999999997
71,-0.11373
72,-0.13124
73,-0.080595
74,-0.07458200000000001
75,0.0010924
76,-0.046448
77,-0.11145999999999999
78,-0.055509
79,-0.13259
80,-0.059194000000000004
81,-0.022724
82,-0.040622000000000005
83,-0.14382999999999999
84,-0.070022
85,0.19746
86,-0.17649
87,-0.12017
88,-0.10240999999999999
89,-0.13914
90,0.038161
91,-0.17645
92,-0.10236
93,-0.08123
94,-0.041956
95,-0.11752
96,-0.06895599999999999
97,-0.1014
98,-0.040654
99,-0.042289
100,-0.058665999999999996
101,-0.044354000000000005
102,-0.09057899999999999
103,-0.10007
104,-0.13806
105,0.00040303
106,-0.011086
107,-0.11915
108,-0.052354
109,0.07116499999999999
110,-0.062178
111,-0.11132
112,-0.010254000000000001
113,-0.042092000000000004
114,-0.067054
115,-0.11564
116,-0.10519
117,-0.052315
118,-0.078682
119,-0.078931
120,0.13865
121,-0.049186
122,-0.071108
123,-0.044282
124,-0.093597
125,-0.13497
126,-0.065402
127,-0.048333999999999995
128,-0.042207999999999996
129,-0.049
130,-0.059329999999999994
131,-0.086595
132,-0.084852
133,-0.055459
134,0.06969199999999999
135,-0.058553999999999995
136,-0.017336
137,-0.11682999999999999
138,-0.12301
139,0.027908
140,-0.072534
141,0.0074986
142,-0.05325800000000001
143,-0.001393
144,0.1319
145,0.05285
146,-0.02754
147,0.0052376
148,-0.10332999999999999
149,-0.055517
150,-0.055332000000000006
151,-0.098881
152,-0.10425
153,-0.022914
154,-0.088492
155,-0.069353
156,-0.10152
157,-0.094169
158,-0.015706
159,-0.11148
160,-0.09001
161,-0.039162999999999996
162,-0.066426
163,-0.05115
164,-0.0042753
165,-0.088124
166,-0.099137
167,-0.0050581
168,-0.029698000000000002
169,-0.12057999999999999
170,-0.050546
171,-0.08238999999999999
172,-0.095465
173,-0.095111
174,-0.029105000000000002
175,-0.038789
176,0.037482999999999995
177,-0.09804700000000001
178,-0.055777999999999994
179,-0.08670499999999999
180,-0.041451
181,-0.081066
182,0.033998
183,-0.087005
184,-0.10209
185,-0.060808
186,-0.018783
187,-0.061673
188,-0.064313
189,4.8658
190,-0.15495
191,-0.009112899999999998
192,-0.12254000000000001
193,-0.1023
194,-0.093249
195,0.014500999999999998
196,-0.10122
197,-0.08316599999999999
198,-0.12945
199,-0.0014280999999999999
200,-0.06842100000000001
201,0.048895999999999995
202,-0.05499299999999999
203,-0.17608
204,-0.13615
205,0.055727
206,-0.060552999999999996
207,0.07383300000000001
208,-0.057562999999999996
209,-0.08453200000000001
210,-0.060325
211,-0.068603
212,-0.018037
213,-0.041672
214,-0.009468700000000002
215,-0.073088
216,-0.0021902
217,0.044544
218,-0.10011
219,-0.1264
220,0.046804000000000005
221,0.08985900000000001
222,-0.09087100000000001
223,0.007684699999999999
224,11.702
225,1.0334
226,-0.065712
227,-0.048648000000000004
228,0.038091
229,0.06260399999999999
230,-0.0016694000000000004
231,0.028362000000000002
232,-0.019318000000000002
233,-0.018154
234,-0.068772
235,0.026882999999999997
236,-0.007679999999999999
237,0.090421
238,0.022668999999999998
239,-0.028045999999999998
240,-0.05928200000000001
241,-0.0061785
242,0.069827
243,-0.06116
244,-0.0021229
245,0.054907000000000004
246,0.074661
247,-0.10273
248,0.75515
249,1.7864
250,-0.029786
251,-0.13510999999999998
252,0.044176
253,0.10475
254,0.044186
255,-0.05969
256,0.0070816
257,-0.11815999999999999
258,-0.0015364
259,0.0051241
260,-0.050594
261,-0.049437
262,0.2029
263,-0.020179
264,0.12563
265,-0.053489
266,-0.0095887
267,-0.082041
268,-0.033343
269,-0.102
270,-0.069297
271,-0.0027107
272,0.011249
273,0.047611
274,0.033499
275,0.038138
276,-0.045847000000000006
277,0.029910000000000003
278,-0.10176
279,0.39952
280,1.8005
281,-0.047261000000000004
282,-0.05385499999999999
283,-0.10289000000000001
284,-0.005310199999999999
285,-0.062149
286,-0.081971
287,-0.06959299999999999
288,-0.049444999999999996
289,8.4848
290,7.8337
291,0.037882
292,0.039415
293,0.3458
294,0.094661
295,-0.06039
296,0.054607
297,-0.027385000000000003
298,0.10213
299,0.023563
300,-0.033593
301,-0.027533
302,0.050105000000000004
303,-0.018078999999999998
304,0.077669
305,-0.028068
306,-0.08143500000000001
307,0.02309
308,0.067102
309,-0.05036
310,0.05839199999999999
311,0.085977
312,-0.025799000000000002
313,-0.12047000000000001
314,0.6320600000000001
315,0.059078
316,-0.18231
317,-0.3679
318,-0.46488999999999997
