time,value
0,0.9595600000000001
1,0.9595600000000001
2,0.9595600000000001
3,0.67562
4,0.67562
5,-0.7440399999999999
6,-0.95699
7,-0.95699
8,-0.95699
9,-0.95699
10,-0.95699
11,-0.95699
12,-0.95699
13,-0.95699
14,-0.95699
15,-0.95699
16,-0.95699
17,-1.028
18,-0.95699
19,-0.95699
20,-0.95699
21,-0.95699
22,-0.95699
23,-0.95699
24,-0.95699
25,-0.95699
26,-0.95699
27,-0.95699
28,-0.95699
29,-0.95699
30,-1.028
31,-0.95699
32,-0.95699
33,-0.95699
34,-0.95699
35,-0.95699
36,-0.95699
37,-0.95699
38,-0.95699
39,-0.95699
40,-0.95699
41,-0.95699
42,-0.95699
43,-0.95699
44,-0.95699
45,-0.95699
46,-0.95699
47,-1.028
48,-0.95699
49,-0.95699
50,-0.95699
51,-0.95699
52,-0.95699
53,-0.95699
54,-0.95699
55,-0.95699
56,-0.95699
57,-0.95699
58,-0.95699
59,-0.95699
60,-0.95699
61,-0.95699
62,-0.95699
63,-0.95699
64,-0.95699
65,-1.028
66,-0.95699
67,-0.95699
68,-0.95699
69,-0.95699
70,-0.95699
71,-0.95699
72,-0.95699
73,-0.95699
74,-0.95699
75,-0.95699
76,-0.95699
77,-0.95699
78,-0.95699
79,-0.95699
80,-1.028
81,-0.95699
82,-0.95699
83,-0.95699
84,-0.95699
85,-0.95699
86,-0.95699
87,-0.95699
88,-0.95699
89,-0.95699
90,-0.95699
91,-0.95699
92,-0.95699
93,-0.95699
94,-0.95699
95,-0.95699
96,-0.95699
97,-0.95699
98,-0.95699
99,-1.028
100,-0.95699
101,-0.95699
102,-0.95699
103,-0.95699
104,-0.95699
105,-0.95699
106,-0.95699
107,-0.95699
108,-0.95699
109,-0.95699
110,-0.95699
111,-0.95699
112,-0.95699
113,-0.95699
114,-0.95699
115,-0.95699
116,-0.95699
117,-1.028
118,-0.95699
119,-0.95699
120,-0.95699
121,-0.95699
122,-0.95699
123,-0.95699
124,-0.95699
125,-0.95699
126,-0.95699
127,-0.95699
128,-0.95699
129,-0.95699
130,-0.95699
131,-0.95699
132,-0.95699
133,-0.95699
134,-1.028
135,-0.95699
136,-0.95699
137,-0.95699
138,-0.95699
139,-0.95699
140,-0.95699
141,-0.95699
142,-0.95699
143,-0.95699
144,-0.95699
145,-0.95699
146,-0.95699
147,-0.95699
148,-0.95699
149,-0.95699
150,-0.95699
151,-1.028
152,-0.95699
153,-0.95699
154,-0.95699
155,-0.95699
156,-0.95699
157,-0.95699
158,-0.95699
159,-0.95699
160,-0.95699
161,-0.95699
162,-0.95699
163,-0.95699
164,-0.95699
165,-1.028
166,-0.95699
167,-0.95699
168,-0.95699
169,-0.95699
170,-0.95699
171,-0.95699
172,-0.95699
173,-0.95699
174,-0.95699
175,-0.95699
176,-0.95699
177,-1.028
178,-0.95699
179,-0.95699
180,-0.95699
181,-0.95699
182,-0.95699
183,-0.95699
184,-0.95699
185,-0.95699
186,-0.95699
187,-0.95699
188,-0.95699
189,-0.95699
190,-0.95699
191,-0.95699
192,-0.95699
193,-1.028
194,-0.95699
195,-0.95699
196,-0.95699
197,-0.95699
198,-0.95699
199,-0.95699
200,-0.95699
201,-0.95699
202,-0.95699
203,-0.95699
204,-0.95699
205,-0.95699
206,-0.95699
207,-0.95699
208,-0.95699
209,-1.028
210,-0.95699
211,-0.95699
212,-0.95699
213,-0.95699
214,-0.95699
215,-0.95699
216,-0.95699
217,-0.95699
218,-0.95699
219,-0.95699
220,-0.95699
221,-0.95699
222,-0.95699
223,-0.95699
224,-0.95699
225,-0.95699
226,-1.028
227,-0.95699
228,-0.95699
229,-0.95699
230,0.46266999999999997
231,0.67562
232,0.67562
233,0.46266999999999997
234,0.46266999999999997
235,0.46266999999999997
236,0.9595600000000001
237,1.2435
238,0.9595600000000001
239,0.9595600000000001
240,0.9595600000000001
241,0.9595600000000001
242,0.67562
243,0.67562
244,1.5274
245,0.9595600000000001
246,0.9595600000000001
247,0.9595600000000001
248,0.67562
249,0.9595600000000001
250,0.036773
251,-0.8860100000000001
252,-0.95699
253,-0.95699
254,-1.028
255,-0.95699
256,-0.95699
257,-0.95699
258,-0.95699
259,-0.95699
260,-0.95699
261,-0.95699
262,-0.95699
263,-0.95699
264,-0.95699
265,-0.95699
266,-0.95699
267,-0.95699
268,-0.95699
269,-0.95699
270,-0.95699
271,-1.028
272,-0.95699
273,-0.95699
274,-0.95699
275,-0.95699
276,-0.95699
277,-0.95699
278,-0.95699
279,-0.95699
280,-0.95699
281,-0.95699
282,-0.95699
283,-0.95699
284,-0.95699
285,-0.95699
286,-0.95699
287,-0.95699
288,-0.95699
289,-1.028
290,-0.95699
291,0.036773
292,1.2435
293,0.9595600000000001
294,1.5274
295,0.9595600000000001
296,1.2435
297,0.9595600000000001
298,1.2435
299,1.2435
300,1.2435
301,1.2435
302,1.2435
303,0.9595600000000001
304,1.2435
305,0.9595600000000001
306,1.2435
307,1.2435
308,1.2435
309,1.2435
310,1.5274
311,1.5274
312,0.9595600000000001
313,1.2435
314,1.2435
315,1.2435
316,0.9595600000000001
317,1.2435
318,1.2435
319,1.2435
320,1.2435
321,1.2435
322,1.2435
323,0.9595600000000001
324,1.2435
325,0.9595600000000001
326,1.2435
327,0.9595600000000001
328,1.5274
329,1.2435
330,0.9595600000000001
331,0.9595600000000001
332,0.9595600000000001
333,0.9595600000000001
334,0.9595600000000001
335,0.67562
336,1.2435
337,0.9595600000000001
338,1.2435
339,0.67562
340,-0.7440399999999999
341,-0.95699
342,-1.028
343,-0.95699
344,-0.95699
345,-0.95699
346,-0.95699
347,-0.95699
348,-0.95699
349,-0.95699
350,-0.95699
351,-0.95699
352,-0.95699
353,-0.95699
354,-0.95699
355,-0.95699
356,-0.95699
357,-0.95699
358,-0.95699
359,-0.95699
360,-0.95699
361,-0.95699
362,-0.95699
363,-0.95699
364,-0.95699
365,-1.028
366,-0.95699
367,-0.95699
368,-0.95699
369,-0.95699
370,-0.95699
371,-0.95699
372,-0.95699
373,-0.17618
374,0.67562
375,0.24971999999999997
376,1.2435
377,1.2435
378,1.2435
379,1.2435
380,1.2435
381,1.2435
382,1.5274
383,1.2435
384,1.2435
385,1.2435
386,1.2435
387,0.9595600000000001
388,1.2435
389,0.9595600000000001
390,1.2435
391,0.9595600000000001
392,0.9595600000000001
393,1.2435
394,1.2435
395,0.9595600000000001
396,1.2435
397,1.2435
398,0.9595600000000001
399,1.2435
400,1.2435
401,1.2435
402,1.2435
403,0.9595600000000001
404,1.2435
405,1.2435
406,1.2435
407,0.9595600000000001
408,1.2435
409,1.2435
410,1.2435
411,1.2435
412,0.9595600000000001
413,0.9595600000000001
414,0.67562
415,-0.17618
416,-0.8860100000000001
417,-1.028
418,-0.95699
419,-0.95699
420,-0.95699
421,-0.95699
422,-0.95699
423,-0.95699
424,-0.95699
425,-0.95699
426,-0.95699
427,-0.95699
428,-0.95699
429,-0.95699
430,-0.95699
431,-0.95699
432,-0.95699
433,-0.95699
434,-0.95699
435,-0.95699
436,-0.95699
437,-0.95699
438,-0.95699
439,-0.95699
440,-1.028
441,-0.95699
442,-0.95699
443,-0.95699
444,-0.95699
445,-0.95699
446,-0.95699
447,-0.95699
448,-0.95699
449,-0.95699
450,-0.95699
451,-0.95699
452,-0.95699
453,-0.95699
454,-0.81503
455,1.2435
456,0.9595600000000001
457,1.5274
458,0.67562
459,0.67562
460,0.67562
461,0.67562
462,0.67562
463,0.9595600000000001
464,-0.46011
465,-0.95699
466,-0.95699
467,-0.95699
468,-0.95699
469,-0.95699
470,-0.95699
471,-0.95699
472,-0.95699
473,-0.95699
474,-0.95699
475,-0.95699
476,-0.95699
477,-0.95699
478,-0.95699
479,-0.95699
480,-0.95699
481,-0.95699
482,-0.95699
483,-0.95699
484,-0.95699
485,-0.95699
486,-0.6020800000000001
487,1.2435
488,1.2435
489,1.2435
490,1.2435
491,1.2435
492,1.5274
493,0.9595600000000001
494,1.2435
495,0.9595600000000001
496,1.2435
497,1.2435
498,1.5274
499,1.2435
500,1.5274
501,1.2435
502,1.2435
503,1.2435
504,1.2435
505,1.2435
506,1.2435
507,1.2435
508,1.2435
509,0.9595600000000001
510,0.9595600000000001
511,0.67562
512,0.9595600000000001
513,0.9595600000000001
514,1.5274
515,0.9595600000000001
516,0.67562
517,0.9595600000000001
518,0.9595600000000001
519,0.9595600000000001
520,0.67562
521,0.9595600000000001
522,1.2435
523,1.2435
524,1.2435
525,-0.6020800000000001
526,-0.8860100000000001
527,-0.95699
528,-0.95699
529,-0.95699
530,-0.95699
531,-0.95699
532,-0.46011
533,0.67562
534,0.9595600000000001
535,0.67562
536,0.9595600000000001
537,0.9595600000000001
538,1.2435
539,0.9595600000000001
540,1.2435
541,1.2435
542,1.2435
543,0.9595600000000001
544,1.2435
545,1.2435
546,0.67562
547,1.2435
548,0.9595600000000001
549,1.5274
550,0.9595600000000001
551,0.9595600000000001
552,0.67562
553,0.9595600000000001
554,1.2435
555,1.2435
556,0.46266999999999997
557,0.67562
558,0.9595600000000001
559,0.46266999999999997
560,0.67562
561,0.67562
562,1.5274
563,1.2435
564,0.67562
565,0.67562
566,0.67562
567,1.5274
568,1.2435
569,1.2435
570,1.2435
571,0.67562
572,1.2435
573,0.9595600000000001
574,0.9595600000000001
575,1.2435
576,1.2435
577,0.9595600000000001
578,0.67562
579,0.67562
580,0.67562
581,0.9595600000000001
582,0.9595600000000001
583,1.2435
584,1.2435
585,0.9595600000000001
586,1.2435
587,1.2435
588,1.2435
589,1.2435
590,1.2435
591,1.2435
592,1.2435
593,1.2435
594,1.2435
595,0.9595600000000001
596,0.67562
597,1.2435
598,0.9595600000000001
599,0.9595600000000001
600,1.2435
601,0.9595600000000001
602,0.9595600000000001
603,1.2435
604,1.2435
605,0.9595600000000001
606,0.9595600000000001
607,0.9595600000000001
608,0.9595600000000001
609,0.9595600000000001
610,0.9595600000000001
611,0.9595600000000001
612,0.9595600000000001
613,0.9595600000000001
614,0.9595600000000001
615,0.67562
616,0.9595600000000001
617,0.67562
618,0.9595600000000001
619,0.9595600000000001
620,0.9595600000000001
621,0.67562
622,0.67562
623,0.9595600000000001
624,0.9595600000000001
625,0.9595600000000001
626,0.67562
627,0.9595600000000001
628,0.9595600000000001
629,0.9595600000000001
630,1.2435
631,1.2435
632,0.67562
633,0.67562
634,0.67562
635,0.67562
636,1.2435
637,0.9595600000000001
638,0.67562
639,0.67562
640,0.67562
641,0.67562
642,0.67562
643,1.2435
644,1.2435
645,0.67562
646,0.9595600000000001
647,0.67562
648,0.9595600000000001
649,0.67562
650,0.9595600000000001
651,0.67562
652,1.2435
653,0.9595600000000001
654,0.9595600000000001
655,0.67562
656,0.67562
657,0.67562
658,0.9595600000000001
659,1.2435
660,0.9595600000000001
661,0.9595600000000001
662,0.9595600000000001
663,1.2435
664,0.9595600000000001
665,0.9595600000000001
666,0.9595600000000001
667,0.9595600000000001
668,0.9595600000000001
669,0.9595600000000001
670,1.2435
671,0.67562
672,0.9595600000000001
673,0.9595600000000001
674,0.9595600000000001
675,0.9595600000000001
676,0.9595600000000001
677,0.9595600000000001
678,0.9595600000000001
679,0.9595600000000001
680,1.2435
681,0.9595600000000001
682,1.2435
683,0.67562
684,0.9595600000000001
685,0.9595600000000001
686,0.67562
687,1.2435
688,0.9595600000000001
689,0.9595600000000001
690,0.9595600000000001
691,0.9595600000000001
692,0.9595600000000001
693,0.9595600000000001
694,0.9595600000000001
695,0.9595600000000001
696,0.9595600000000001
697,1.2435
698,0.9595600000000001
699,0.9595600000000001
700,0.9595600000000001
701,1.2435
702,0.9595600000000001
703,0.9595600000000001
704,1.2435
705,0.9595600000000001
706,0.9595600000000001
707,0.9595600000000001
708,1.2435
709,0.9595600000000001
710,0.9595600000000001
711,0.9595600000000001
712,0.9595600000000001
713,0.9595600000000001
714,0.67562
715,0.9595600000000001
716,0.9595600000000001
717,0.036773
718,-0.81503
719,-0.95699
