time,value
0,-1.4912
1,-1.4912
2,-1.4912
3,-1.4912
4,-1.4912
5,-1.4912
6,-1.4912
7,-1.4912
8,-1.4912
9,-1.4912
10,-1.4912
11,-1.4912
12,-1.4912
13,-1.4912
14,-1.4912
15,-1.4912
16,-1.4912
17,-1.4912
18,-1.4912
19,-1.4912
20,-1.4912
21,-1.4912
22,-1.4912
23,-1.4912
24,-1.4912
25,-1.4912
26,-1.4912
27,-1.4912
28,-1.4912
29,-1.4912
30,-1.4912
31,-1.4912
32,-1.4912
33,-1.4912
34,-1.4912
35,-1.4912
36,-1.4912
37,-1.4912
38,-1.4317
39,-1.3212
40,-1.1924
41,-1.1206
42,-1.0868
43,-1.0868
44,-1.0868
45,-1.0868
46,-1.0868
47,-1.0868
48,-1.0868
49,-1.0864
50,-1.0709
51,-0.98895
52,-0.86016
53,-0.73138
54,-0.68811
55,-0.6824399999999999
56,-0.6824399999999999
57,-0.60163
58,-0.49183999999999994
59,-0.36306
60,-0.30485999999999996
61,-0.27806
62,-0.27475
63,-0.22324000000000002
64,-0.12352
65,0.0052618000000000005
66,0.13405
67,0.26283
68,0.39005
69,0.51369
70,0.5307
71,0.5307
72,0.5307
73,0.63942
74,0.75993
75,0.8798799999999999
76,0.92109
77,0.9350799999999999
78,0.94926
79,1.0136
80,1.1283
81,1.2291
82,1.2754
83,1.1643
84,1.0438
85,0.9350799999999999
86,0.9350799999999999
87,0.9350799999999999
88,0.9350799999999999
89,0.9350799999999999
90,0.9350799999999999
91,0.90928
92,0.80882
93,0.68524
94,0.61458
95,0.6403399999999999
96,0.76251
97,0.8645
98,0.9350799999999999
99,0.9350799999999999
100,0.9540799999999999
101,1.002
102,1.1308
103,1.2596
104,1.3884
105,1.5172
106,1.646
107,1.6812
108,1.5833
109,1.4554
110,1.3745
111,1.3395
112,1.3395
113,1.3395
114,1.3395
115,1.3395
116,1.3057
117,1.2339
118,1.1051
119,1.013
120,1.0227
121,1.1514
122,1.2802
123,1.3372
124,1.3395
125,1.3395
126,1.2686
127,1.1592
128,1.0304
129,0.96606
130,0.9350799999999999
131,0.9350799999999999
132,0.9350799999999999
133,0.9350799999999999
134,0.9335399999999999
135,0.9000600000000001
136,0.80887
137,0.68179
138,0.5633100000000001
139,0.5307
140,0.5307
141,0.5307
142,0.5307
143,0.5307
144,0.5307
145,0.44138
146,0.3298
147,0.20675
148,0.14751
149,0.12632000000000002
150,0.11696
151,0.070599
152,-0.038525
153,-0.15986
154,-0.26547
155,-0.27806
156,-0.27806
157,-0.27806
158,-0.14928
159,-0.020495
160,0.095694
161,0.11887
162,0.12632000000000002
163,0.12632000000000002
164,0.12632000000000002
165,0.12632000000000002
166,0.12632000000000002
167,0.12632000000000002
168,0.12632000000000002
169,0.10912000000000001
170,0.069654
171,-0.059129999999999995
172,-0.17255
173,-0.23943000000000003
174,-0.11064
175,0.01814
176,0.11431
177,0.12462000000000001
178,0.12632000000000002
179,0.12632000000000002
180,0.12632000000000002
181,0.12632000000000002
182,0.12632000000000002
183,0.12632000000000002
184,0.12632000000000002
185,0.1573
186,0.22161999999999998
187,0.3504
188,0.45981000000000005
189,0.5307
190,0.5307
191,0.5307
192,0.5307
193,0.5307
194,0.5307
195,0.59025
196,0.7006899999999999
197,0.8294799999999999
198,0.84441
199,0.7831100000000001
200,0.65433
201,0.5743199999999999
202,0.5307
203,0.5307
204,0.5307
205,0.5307
206,0.5307
207,0.5307
208,0.5307
209,0.5307
210,0.5307
211,0.61622
212,0.73933
213,0.86811
214,0.9969
215,1.1257
216,1.2545
217,1.3832
218,1.5119999999999998
219,1.6375
220,1.7148
221,1.7438
222,1.7438
223,1.7438
224,1.7438
225,1.7423
226,1.7371
227,1.6254
228,1.4966
229,1.3678
230,1.239
231,1.1102
232,0.98144
233,0.8526600000000001
234,0.72387
235,0.60927
236,0.54488
237,0.5307
238,0.51671
239,0.4755
240,0.35555
241,0.24331
242,0.15465
243,0.28343
244,0.41222
245,0.52399
246,0.5291399999999999
247,0.5307
248,0.50489
249,0.40444
250,0.28086
251,0.18114
252,0.12963
253,0.12632000000000002
254,0.12632000000000002
255,0.12632000000000002
256,0.12632000000000002
257,0.10732
258,0.059351
259,-0.06943300000000001
260,-0.19254000000000002
261,-0.27806
262,-0.27806
263,-0.27806
264,-0.27806
265,-0.27806
266,-0.27806
267,-0.27806
268,-0.27806
269,-0.27806
270,-0.27806
271,-0.27806
272,-0.27806
273,-0.31181
274,-0.38366
275,-0.51245
276,-0.6228899999999999
277,-0.6824399999999999
278,-0.6824399999999999
279,-0.6824399999999999
280,-0.6824399999999999
281,-0.6824399999999999
282,-0.6824399999999999
283,-0.75333
284,-0.86274
285,-0.9915200000000001
286,-1.1203
287,-1.2491
288,-1.3779
289,-1.4542
290,-1.4912
291,-1.4912
292,-1.4912
293,-1.4912
294,-1.4929
295,-1.5032
296,-1.5994
297,-1.7282
298,-1.8569
299,-1.7901
300,-1.6767
301,-1.5479
302,-1.5084
303,-1.4912
304,-1.4855
305,-1.4159
306,-1.3083
307,-1.1889
308,-1.1065
309,-1.0868
310,-1.0943
311,-1.1174
312,-1.2336
313,-1.3624
314,-1.4912
