time,value
0,-0.80115
1,-0.80115
2,-0.80115
3,-0.80115
4,-0.80115
5,-0.80115
6,-0.80115
7,-0.80115
8,-0.80115
9,-0.80115
10,-0.80115
11,-0.80115
12,-0.80115
13,-0.80115
14,-0.80115
15,-0.80115
16,-0.80115
17,-0.80115
18,-0.80115
19,-0.80115
20,-0.80115
21,-0.80115
22,-0.80115
23,-0.80115
24,-0.80115
25,-0.80115
26,-0.80115
27,-0.80115
28,-0.80115
29,-0.80115
30,-0.80115
31,-0.80115
32,-0.80115
33,-0.80115
34,-0.80115
35,-0.80115
36,-0.80115
37,-0.80115
38,-0.80115
39,0.55004
40,1.0004
41,1.2578
42,1.2578
43,1.2578
44,1.2578
45,1.2578
46,1.0004
47,1.2578
48,1.0004
49,1.2578
50,1.0004
51,1.0004
52,1.2578
53,1.0004
54,1.0004
55,1.0004
56,1.0004
57,1.2578
58,1.0004
59,0.35701
60,-0.67247
61,-0.80115
62,-0.80115
63,-0.80115
64,-0.80115
65,-0.80115
66,-0.80115
67,-0.80115
68,-0.80115
69,-0.80115
70,-0.80115
71,-0.80115
72,-0.80115
73,-0.80115
74,-0.80115
75,-0.80115
76,-0.80115
77,-0.80115
78,-0.80115
79,-0.80115
80,-0.80115
81,-0.80115
82,-0.80115
83,-0.80115
84,-0.80115
85,-0.80115
86,-0.80115
87,-0.80115
88,-0.80115
89,-0.80115
90,-0.80115
91,-0.80115
92,-0.80115
93,-0.80115
94,-0.80115
95,-0.80115
96,-0.80115
97,-0.80115
98,-0.80115
99,-0.80115
100,-0.80115
101,-0.80115
102,-0.80115
103,-0.80115
104,-0.80115
105,-0.80115
106,-0.80115
107,-0.80115
108,-0.80115
109,-0.80115
110,0.74306
111,1.2578
112,1.2578
113,1.2578
114,1.2578
115,1.2578
116,1.2578
117,1.0004
118,1.2578
119,1.0004
120,1.2578
121,1.0004
122,1.2578
123,1.0004
124,1.0004
125,1.0004
126,1.2578
127,1.0004
128,1.0004
129,1.0004
130,1.0004
131,-0.80115
132,-0.80115
133,-0.80115
134,-0.80115
135,-0.80115
136,-0.80115
137,-0.80115
138,-0.80115
139,-0.80115
140,-0.80115
141,-0.80115
142,-0.80115
143,-0.80115
144,-0.80115
145,-0.80115
146,-0.80115
147,-0.80115
148,-0.80115
149,-0.80115
150,-0.80115
151,-0.80115
152,-0.80115
153,-0.80115
154,-0.80115
155,-0.80115
156,-0.80115
157,-0.80115
158,-0.80115
159,-0.80115
160,-0.80115
161,-0.80115
162,-0.80115
163,-0.80115
164,-0.80115
165,-0.80115
166,-0.80115
167,-0.80115
168,-0.80115
169,-0.80115
170,-0.80115
171,-0.80115
172,-0.80115
173,-0.80115
174,-0.80115
175,-0.80115
176,-0.80115
177,-0.80115
178,-0.80115
179,-0.80115
180,-0.80115
181,-0.80115
182,-0.80115
183,-0.28641
184,1.2578
185,1.2578
186,1.2578
187,1.0004
188,1.2578
189,1.2578
190,1.2578
191,1.0004
192,1.2578
193,1.0004
194,1.2578
195,1.0004
196,1.0004
197,1.0004
198,1.0004
199,1.2578
200,1.0004
201,1.0004
202,1.0004
203,-0.67247
204,-0.80115
205,-0.80115
206,-0.80115
207,-0.80115
208,-0.80115
209,-0.80115
210,-0.80115
211,-0.80115
212,-0.80115
213,-0.80115
214,-0.80115
215,-0.80115
216,-0.80115
217,-0.80115
218,-0.80115
219,-0.80115
220,-0.80115
221,-0.80115
222,-0.80115
223,-0.80115
224,-0.80115
225,-0.80115
226,-0.80115
227,-0.80115
228,-0.80115
229,-0.80115
230,-0.80115
231,-0.80115
232,-0.80115
233,-0.80115
234,-0.80115
235,-0.80115
236,-0.80115
237,-0.80115
238,-0.80115
239,-0.80115
240,-0.80115
241,-0.80115
242,-0.80115
243,-0.80115
244,-0.80115
245,-0.80115
246,-0.80115
247,-0.80115
248,-0.80115
249,-0.80115
250,-0.80115
251,-0.80115
252,-0.80115
253,-0.80115
254,-0.80115
255,-0.7368100000000001
256,1.2578
257,1.2578
258,1.2578
259,1.2578
260,1.2578
261,1.2578
262,1.0004
263,1.2578
264,1.0004
265,1.2578
266,1.0004
267,1.2578
268,1.0004
269,1.0004
270,1.0004
271,1.2578
272,1.0004
273,1.0004
274,1.0004
275,1.0004
276,-0.4151
277,-0.80115
278,-0.80115
279,-0.80115
280,-0.80115
281,-0.80115
282,-0.80115
283,-0.80115
284,-0.80115
285,-0.80115
286,-0.80115
287,-0.80115
288,-0.80115
289,-0.80115
290,-0.80115
291,-0.80115
292,-0.80115
293,-0.80115
294,-0.80115
295,-0.80115
296,-0.80115
297,-0.80115
298,-0.80115
299,-0.80115
300,-0.80115
301,-0.80115
302,-0.80115
303,-0.80115
304,-0.80115
305,-0.80115
306,-0.80115
307,-0.80115
308,-0.80115
309,-0.80115
310,-0.80115
311,-0.80115
312,-0.80115
313,-0.80115
314,-0.80115
315,-0.80115
316,-0.029043
317,1.2578
318,1.2578
319,1.0004
320,1.2578
321,1.2578
322,1.2578
323,1.0004
324,1.2578
325,1.0004
326,1.0004
327,1.2578
328,1.0004
329,1.0004
330,1.0004
331,1.2578
332,1.0004
333,1.0004
334,1.0004
335,1.0004
336,1.0004
337,-0.67247
338,-0.80115
339,-0.80115
340,-0.80115
341,-0.80115
342,-0.80115
343,-0.80115
344,-0.80115
345,-0.80115
346,-0.80115
347,-0.80115
348,-0.80115
349,-0.80115
350,-0.80115
351,-0.80115
352,-0.80115
353,-0.80115
354,-0.80115
355,-0.80115
356,-0.80115
357,-0.80115
358,-0.80115
359,-0.80115
360,-0.80115
361,-0.80115
362,-0.80115
363,-0.60812
364,-0.7368100000000001
365,-0.80115
366,-0.80115
367,-0.80115
368,-0.80115
369,-0.80115
370,-0.80115
371,-0.80115
372,-0.80115
373,-0.80115
374,0.55004
375,1.2578
376,1.0004
377,1.2578
378,1.2578
379,1.0004
380,1.2578
381,1.0004
382,1.2578
383,1.0004
384,1.0004
385,1.7725
386,2.7377
387,2.7377
388,3.0594
389,2.7377
390,2.7377
391,2.7377
392,2.7377
393,2.7377
394,3.0594
395,2.7377
396,2.7377
397,2.7377
398,2.7377
399,2.7377
400,-0.4151
401,-0.7368100000000001
402,-0.80115
403,-0.80115
404,-0.80115
405,-0.80115
406,-0.80115
407,-0.80115
408,-0.80115
409,-0.80115
410,-0.80115
411,-0.80115
412,-0.80115
413,-0.80115
414,-0.80115
415,-0.80115
416,-0.80115
417,-0.80115
418,-0.80115
419,1.0004
420,1.5152
421,1.5152
422,1.2578
423,1.5152
424,1.2578
425,1.5152
426,1.2578
427,1.5152
428,1.2578
429,1.2578
430,1.2578
431,1.2578
432,1.0004
433,1.2578
434,1.2578
435,1.2578
436,1.0004
437,1.2578
438,1.0004
439,1.2578
440,1.0004
441,1.2578
442,1.2578
443,1.0004
444,1.0004
445,1.2578
446,1.0004
447,1.0004
448,1.2578
449,1.0004
450,1.2578
451,1.0004
452,1.2578
453,1.0004
454,1.2578
455,1.0004
456,1.0004
457,1.2578
458,0.16398
459,-0.80115
460,-0.80115
461,-0.67247
462,-0.80115
463,-0.80115
464,-0.80115
465,-0.80115
466,-0.80115
467,-0.80115
468,-0.80115
469,-0.80115
470,-0.80115
471,-0.80115
472,-0.80115
473,-0.80115
474,-0.80115
475,-0.80115
476,-0.80115
477,-0.80115
478,-0.80115
479,-0.80115
480,-0.80115
481,-0.80115
482,-0.80115
483,-0.80115
484,-0.80115
485,-0.80115
486,-0.80115
487,0.16398
488,1.2578
489,1.0004
490,1.2578
491,1.2578
492,1.2578
493,1.0004
494,1.2578
495,1.0004
496,1.0004
497,1.2578
498,1.0004
499,1.0004
500,1.0004
501,1.0004
502,1.0004
503,1.0004
504,1.2578
505,0.16398
506,-0.4151
507,-0.54378
508,-0.54378
509,-0.7368100000000001
510,-0.80115
511,-0.80115
512,-0.80115
513,-0.80115
514,-0.80115
515,-0.80115
516,-0.80115
517,-0.80115
518,-0.80115
519,-0.80115
520,-0.80115
521,-0.80115
522,-0.60812
523,1.0004
524,1.2578
525,1.2578
526,1.2578
527,1.0004
528,1.2578
529,1.0004
530,1.2578
531,1.0004
532,1.0004
533,1.0004
534,1.0004
535,1.0004
536,1.2578
537,1.0004
538,1.0004
539,1.0004
540,1.2578
541,1.0004
542,1.0004
543,1.0004
544,1.0004
545,1.0004
546,1.2578
547,1.0004
548,1.0004
549,1.0004
550,1.0004
551,1.0004
552,1.0004
553,1.0004
554,1.0004
555,1.2578
556,1.0004
557,1.0004
558,1.2578
559,1.0004
560,1.0004
561,1.0004
562,1.0004
563,1.0004
564,1.0004
565,1.0004
566,1.0004
567,1.2578
568,1.0004
569,1.0004
570,0.74306
571,1.0004
572,-0.67247
573,-0.80115
574,-0.80115
575,-0.80115
576,-0.80115
577,-0.80115
578,-0.80115
579,-0.80115
580,-0.80115
581,-0.80115
582,-0.80115
583,-0.80115
584,-0.80115
585,-0.80115
586,-0.80115
587,-0.80115
588,-0.80115
589,-0.80115
590,-0.80115
591,-0.80115
592,-0.80115
593,-0.80115
594,-0.80115
595,-0.80115
596,-0.80115
597,-0.80115
598,-0.80115
599,-0.80115
600,-0.80115
601,-0.80115
602,0.74306
603,1.2578
604,1.0004
605,1.2578
606,1.2578
607,1.2578
608,1.0004
609,1.2578
610,1.0004
611,1.2578
612,1.0004
613,1.2578
614,1.0004
615,1.0004
616,1.0004
617,1.2578
618,1.0004
619,1.0004
620,1.0004
621,1.0004
622,1.0004
623,1.2578
624,1.0004
625,1.0004
626,1.0004
627,1.0004
628,1.0004
629,1.0004
630,1.0004
631,-0.15773
632,-0.7368100000000001
633,-0.80115
634,-0.80115
635,-0.80115
636,-0.80115
637,-0.80115
638,-0.80115
639,-0.80115
640,-0.80115
641,-0.80115
642,-0.80115
643,-0.80115
644,-0.80115
645,-0.80115
646,-0.80115
647,-0.80115
648,-0.80115
649,-0.80115
650,-0.80115
651,-0.80115
652,-0.80115
653,-0.80115
654,-0.80115
655,-0.80115
656,-0.80115
657,-0.80115
658,-0.80115
659,-0.80115
660,-0.80115
661,-0.80115
662,-0.80115
663,-0.28641
664,1.2578
665,1.2578
666,1.2578
667,1.2578
668,1.0004
669,1.2578
670,1.2578
671,1.0004
672,1.2578
673,1.0004
674,1.2578
675,1.0004
676,1.2578
677,1.0004
678,1.2578
679,1.0004
680,1.0004
681,1.2578
682,1.0004
683,1.0004
684,1.2578
685,1.0004
686,1.0004
687,1.0004
688,-0.15773
689,-0.7368100000000001
690,-0.80115
691,-0.80115
692,-0.80115
693,-0.80115
694,-0.80115
695,-0.80115
696,-0.80115
697,-0.80115
698,-0.80115
699,-0.80115
700,-0.80115
701,-0.80115
702,-0.80115
703,-0.80115
704,-0.80115
705,-0.80115
706,-0.80115
707,-0.80115
708,-0.80115
709,-0.80115
710,-0.80115
711,-0.80115
712,-0.80115
713,-0.80115
714,-0.80115
715,-0.80115
716,-0.80115
717,-0.80115
718,-0.80115
719,-0.80115
