{
  "about": {
    "datasetID": "LL1_enron_email_network_dataset",
    "datasetName": "enron_email_network",
    "description": "Enron, email",
    "citation": " Bryan Klimt ; Yiming Yang (2004), The Enron Corpus: A New Dataset for Email Classification Research}, Proc. European Conf. on Machine Learning",
    "license": "Creative Commons Attribution-ShareAlike 2.0",
    "source": "Koblenz Network Collection",
    "sourceURI": "http://konect.uni-koblenz.de/networks/enron/",
    "approximateSize": "",
    "datasetSchemaVersion": "4.0.0",
    "redacted": false,
    "datasetVersion": "4.0.0",
    "digest": "72873380ec78dd286cb18fbe499f03631f1c9bc38b6cec301fb7ce78cd7c7ffe"
  },
  "dataResources": [
    {
      "resID": "learningData",
      "resPath": "tables/learningData.csv",
      "resType": "table",
      "resFormat": {
        "text/csv": [
          "csv"
        ]
      },
      "isCollection": false,
      "columns": [
        {
          "colIndex": 0,
          "colName": "d3mIndex",
          "colType": "integer",
          "role": [
            "index"
          ]
        },
        {
          "colIndex": 1,
          "colName": "fromNode",
          "colType": "integer",
          "role": [
            "attribute"
          ]
        },
        {
          "colIndex": 2,
          "colName": "toNode",
          "colType": "integer",
          "role": [
            "attribute"
          ]
        }
      ],
      "columnsCount": 3
    }
  ]
}