time,value
0,1.1338
1,1.1338
2,1.1338
3,1.1338
4,1.1338
5,1.1338
6,1.1338
7,1.1338
8,1.1338
9,1.1338
10,1.1338
11,1.1338
12,1.1338
13,1.1338
14,1.1414
15,1.1519
16,1.1797
17,1.2234
18,1.2672
19,1.311
20,1.3505
21,1.3512
22,1.3519
23,1.3519
24,1.3519
25,1.3519
26,1.3519
27,1.3519
28,1.3519
29,1.3519
30,1.3519
31,1.3519
32,1.3519
33,1.3519
34,1.3519
35,1.3519
36,1.3519
37,1.3519
38,1.3519
39,1.3519
40,1.3519
41,1.3519
42,1.3519
43,1.3519
44,1.3519
45,1.3519
46,1.3519
47,1.3519
48,1.3519
49,1.3519
50,1.3519
51,1.3519
52,1.3519
53,1.3519
54,1.3519
55,1.3519
56,1.3519
57,1.3519
58,1.3519
59,1.3519
60,1.3602
61,1.3880000000000001
62,1.4159
63,1.445
64,1.4742
65,1.4856
66,1.4944
67,1.4974
68,1.4974
69,1.4886
70,1.4692
71,1.4439
72,1.4001
73,1.3562
74,1.3069
75,1.2575
76,1.1889
77,1.1159999999999999
78,1.043
79,0.9700799999999999
80,0.88636
81,0.78609
82,0.68548
83,0.58336
84,0.48123
85,0.36943000000000004
86,0.25735
87,0.14175
88,0.11897
89,-0.43025
90,-0.18900999999999998
91,-0.28759
92,-0.37512
93,-0.46103999999999995
94,-0.53584
95,-0.61064
96,-0.63031
97,-0.6449
98,-0.6594899999999999
99,-0.67408
100,-0.69529
101,-0.72331
102,-0.75166
103,-0.78083
104,-0.80796
105,-0.80796
106,-0.80796
107,-0.79542
108,-0.78083
109,-0.77015
110,-0.76158
111,-0.75675
112,-0.75675
113,-0.75727
114,-0.75959
115,-0.76208
116,-0.77667
117,-0.7912600000000001
118,-0.80584
119,-0.8204299999999999
120,-0.84283
121,-0.8706200000000001
122,-0.89894
123,-0.92811
124,-0.9556899999999999
125,-0.9753700000000001
126,-0.99505
127,-1.0099
128,-1.0244
129,-1.0390000000000001
130,-1.0536
131,-1.0682
132,-1.0828
133,-1.0987
134,-1.1175
135,-1.1391
136,-1.1828
137,-1.2266
138,-1.2704
139,-1.3141
140,-1.349
141,-1.3798
142,-1.4098
143,-1.439
144,-1.4632
145,-1.4738
146,-1.4839
147,-1.4839
148,-1.4839
149,-1.4745
150,-1.4634
151,-1.4408
152,-1.4116
153,-1.3809
154,-1.348
155,-1.3097
156,-1.2514
157,-1.193
158,-1.1347
159,-1.0763
160,-1.028
161,-0.98239
162,-0.93784
163,-0.89407
164,-0.847
165,-0.7942
166,-0.74054
167,-0.68218
168,-0.62383
169,-0.5705
170,-0.51747
171,-0.47121999999999997
172,-0.42745
173,-0.38453000000000004
174,-0.34239
175,-0.30426
176,-0.27508
177,-0.2459
178,-0.21671999999999997
179,-0.18755
180,-0.16946
181,-0.15279
182,-0.13752999999999999
183,-0.12294000000000001
184,-0.10835
185,-0.47501000000000004
186,-0.40207
187,-0.32911999999999997
188,-0.2551
189,-0.15667999999999999
190,-0.058265
191,0.07960199999999999
192,0.22549
193,0.37999
194,0.1092
195,0.15194000000000002
196,0.21029
197,0.26865
198,0.32700999999999997
199,0.38536
200,0.41952
201,0.45333
202,0.48355
203,0.51273
204,0.54191
205,0.57108
206,0.60026
207,0.62944
208,0.65793
209,0.68225
210,0.7065600000000001
211,0.7218399999999999
212,0.73643
213,0.7501800000000001
214,0.76362
215,0.7702399999999999
216,0.7702399999999999
217,0.7702399999999999
218,0.7702399999999999
219,0.7682
220,0.74412
221,0.7200300000000001
222,0.6915
223,0.66232
224,0.64418
225,0.63168
226,0.6248100000000001
227,0.6248100000000001
228,0.6248100000000001
229,0.6248100000000001
230,0.6248100000000001
231,0.6248100000000001
232,0.6248100000000001
233,0.62557
234,0.62649
235,0.63569
236,0.65028
237,0.66487
238,0.6794600000000001
239,0.6875600000000001
240,0.66672
241,0.64588
242,0.6169399999999999
243,0.5877600000000001
244,0.5524100000000001
245,0.51513
246,0.47429
247,0.43051999999999996
248,0.38229
249,0.32532
250,0.26448
251,0.17695
252,0.44085
253,0.054816
254,-0.42118
255,-0.14957
256,-0.20792
257,-0.26628
258,-0.32464
259,-0.37321
260,-0.39683
261,-0.41981
262,-0.4344
263,-0.44898999999999994
264,-0.47035
265,-0.49281
266,-0.51962
267,-0.5488
268,-0.58162
269,-0.6191300000000001
270,-0.6613399999999999
271,-0.7197
272,-0.7780600000000001
273,-0.83641
274,-0.8947700000000001
275,-0.9531200000000001
276,-1.0115
277,-1.0698
278,-1.1282
279,-1.1865
280,-1.2449
281,-1.3033
282,-1.3616
283,-1.42
284,-1.4564
285,-1.4918
286,-1.5117
287,-1.5263
288,-1.5366
289,-1.5434
290,-1.5432
291,-1.5286
292,-1.5139
293,-1.4989
294,-1.4838
295,-1.4429
296,-1.3991
297,-1.3554
298,-1.3116
299,-1.2732
300,-1.2405
301,-1.2088
302,-1.1796
303,-1.1504
304,-1.1212
305,-1.0921
306,-1.0629
307,-1.0337
308,-1.0045
309,-0.97535
310,-0.9461799999999999
311,-0.917
312,-0.88782
313,-0.85864
314,-0.8294600000000001
315,-1.4185
316,-1.4185
317,-1.4185
318,-1.4185
319,-1.4185
320,-1.4185
321,-1.4185
322,-1.4185
323,-1.4185
324,-1.4185
325,-1.4185
326,-1.4185
327,-1.4185
328,-1.4185
329,-1.3966
330,-1.3667
331,-1.2871
332,-1.1617
333,-1.0363
334,-0.91085
335,-0.79761
336,-0.79562
337,-0.7936300000000001
338,-0.7934100000000001
339,-0.7934100000000001
340,-0.7934100000000001
341,-0.7934100000000001
342,-0.7934100000000001
343,-0.7934100000000001
344,-0.7934100000000001
345,-0.7934100000000001
346,-0.7934100000000001
347,-0.7934100000000001
348,-0.7934100000000001
349,-0.7934100000000001
350,-0.7934100000000001
351,-0.7934100000000001
352,-0.7934100000000001
353,-0.7934100000000001
354,-0.7934100000000001
355,-0.7934100000000001
356,-0.7934100000000001
357,-0.7934100000000001
358,-0.7934100000000001
359,-0.7934100000000001
360,-0.7934100000000001
361,-0.7934100000000001
362,-0.7934100000000001
363,-0.7934100000000001
364,-0.7934100000000001
365,-0.7934100000000001
366,-0.7934100000000001
367,-0.7934100000000001
368,-0.7934100000000001
369,-0.7934100000000001
370,-0.7934100000000001
371,-0.7934100000000001
372,-0.7934100000000001
373,-0.7934100000000001
374,-0.7934100000000001
375,-0.7651399999999999
376,-0.66959
377,-0.5736399999999999
378,-0.47331000000000006
379,-0.37298000000000003
380,-0.27265
381,-0.17232
382,-0.36619
383,0.13545
384,0.11359000000000001
385,0.18048
386,0.23735
387,0.26243
388,0.28752
389,0.3126
390,0.33768000000000004
391,0.36275999999999997
392,0.38784
393,0.41293
394,0.43801
395,0.45383
396,0.45542
397,0.45671999999999996
398,0.45671999999999996
399,0.45671999999999996
400,0.39016999999999996
401,0.32169000000000003
402,0.22899
403,0.12866
404,0.1945
405,-0.19965
406,-0.10783
407,-0.15799000000000002
408,-0.20704
409,-0.24845
410,-0.28986
411,-0.29336
412,-0.29336
413,-0.29336
414,-0.29336
415,-0.27059
416,-0.22441
417,-0.1771
418,-0.12694
419,-0.39008000000000004
420,-0.13926
421,0.11157
422,0.36239
423,0.12387999999999999
424,0.17405
425,0.22421
426,0.27438
427,0.32454
428,0.37381
429,0.41999
430,0.46588
431,0.49096000000000006
432,0.5160399999999999
433,0.5411199999999999
434,0.56621
435,0.5644399999999999
436,0.54414
437,0.5220100000000001
438,0.49693000000000004
439,0.47185
440,0.44677
441,0.42168999999999995
442,0.3966
443,0.37151999999999996
444,0.33158000000000004
445,0.28659
446,0.22541
447,0.15016
448,0.35675
449,-0.055312
450,-0.4916
451,-0.22249000000000002
452,-0.3479
453,-0.47331000000000006
454,-0.59872
455,-0.6933600000000001
456,-0.77418
457,-0.8523299999999999
458,-0.92758
459,-0.9943
460,-1.0377
461,-1.0801
462,-1.1051
463,-1.1302
464,-1.1392
465,-1.1451
466,-1.1314
467,-1.1063
468,-1.0786
469,-1.0471
470,-1.0064
471,-0.93116
472,-0.8559100000000001
473,-0.78067
474,-0.7054199999999999
475,-0.66471
476,-0.63326
477,-0.60549
478,-0.58041
479,-0.55532
480,-0.5302399999999999
481,-0.50516
482,-0.48008
483,-0.455
484,-0.43855
485,-0.42263
486,-0.41836999999999996
487,-0.41836999999999996
488,-0.41981999999999997
489,-0.42261000000000004
490,-0.4323
491,-0.45738
492,-0.48246999999999995
493,-0.50755
494,-0.53263
495,-0.53864
496,-0.54222
497,-0.54338
498,-0.54338
499,-0.53635
500,-0.52122
501,-0.50357
502,-0.47848
503,-0.45303000000000004
504,-0.41918999999999995
505,-0.38535
506,-0.33794
507,-0.28778000000000004
508,-0.23614000000000002
509,-0.18358
510,-0.12176
511,-0.23879
512,0.13744
513,0.10397999999999999
514,0.17922000000000002
515,0.23367
516,0.28781
517,0.33887
518,0.38904
519,0.4392
520,0.48936999999999997
521,0.5395300000000001
522,0.5897
523,0.6410399999999999
524,0.6995600000000001
525,0.7580899999999999
526,0.83216
527,0.9074
528,0.9797899999999999
529,1.0511
530,1.0989
531,1.124
532,1.1491
533,1.1741
534,1.2009999999999998
535,1.2468
536,1.2926
537,1.3422
538,1.3923
539,1.4425
540,1.4927
541,1.5428
542,1.5930000000000002
543,1.6431
544,1.6933
545,1.7435
546,1.7936
547,1.8438
548,1.8927
549,1.9412
550,1.9756
551,2.0007
552,2.0257
553,2.0508
554,2.0796
555,2.125
556,2.1704
557,2.2204
558,2.2706
559,2.2996
560,2.3219
561,2.3319
562,2.3319
563,2.3268
564,2.3117
565,2.2921
566,2.2419
567,2.1918
568,2.1416
569,2.0914
570,2.0413
571,1.9911
572,1.9409
573,1.8908
574,1.835
575,1.7649
576,1.6945
577,1.6193
578,1.544
579,1.4688
580,1.3935
581,1.3183
582,1.2429999999999999
583,1.1615
584,1.0719
585,0.97429
586,0.84888
587,0.72346
588,0.59725
589,0.47103999999999996
590,0.32534
591,0.17485
592,0.11555
593,-0.12614
594,-0.26921999999999996
595,-0.4002
596,-0.5302399999999999
597,-0.65565
598,-0.7810600000000001
599,-0.86872
600,-0.9547200000000001
601,-1.014
602,-1.0641
603,-1.1071
604,-1.1437
605,-1.1684
606,-1.1684
607,-1.1684
608,-1.1676
609,-1.1668
610,-1.1215
611,-1.0713
612,-1.0211
613,-0.9709700000000001
614,-0.91166
615,-0.8423799999999999
616,-0.77151
617,-0.69626
618,-0.6203
619,-0.5323100000000001
620,-0.44432
621,-0.34591
622,-0.24558000000000002
623,-0.15333
624,-0.3349
625,0.15105
626,0.2748
627,0.10637
628,0.15653
629,0.2067
630,-1.4528
631,-1.4528
632,-1.4528
633,-1.4528
634,-1.4528
635,-1.4528
636,-1.4528
637,-1.4528
638,-1.4528
639,-1.4528
640,-1.4528
641,-1.4528
642,-1.4528
643,-1.4528
644,-1.4494
645,-1.4447
646,-1.4322
647,-1.4125
648,-1.3928
649,-1.3731
650,-1.3554
651,-1.355
652,-1.3547
653,-1.3547
654,-1.3547
655,-1.3547
656,-1.3547
657,-1.3547
658,-1.3547
659,-1.3547
660,-1.3547
661,-1.3547
662,-1.3547
663,-1.3547
664,-1.3547
665,-1.3547
666,-1.3547
667,-1.3547
668,-1.3547
669,-1.3547
670,-1.3547
671,-1.3547
672,-1.3547
673,-1.3547
674,-1.3547
675,-1.3547
676,-1.3547
677,-1.3547
678,-1.3547
679,-1.3547
680,-1.3547
681,-1.3547
682,-1.3547
683,-1.3547
684,-1.3547
685,-1.3547
686,-1.3547
687,-1.3547
688,-1.3547
689,-1.3547
690,-1.3492
691,-1.3304
692,-1.3116
693,-1.2919
694,-1.2722
695,-1.2465
696,-1.22
697,-1.1915
698,-1.1619
699,-1.1305
700,-1.0966
701,-1.0614
702,-1.022
703,-0.9826299999999999
704,-0.94327
705,-0.90391
706,-0.86455
707,-0.8251799999999999
708,-0.78582
709,-0.74646
710,-0.7034600000000001
711,-0.65489
712,-0.60619
713,-0.55699
714,-0.50779
715,-0.43246999999999997
716,-0.35641
717,-0.27083
718,-0.18227000000000002
719,-0.46315
720,-0.037837
721,0.47418000000000005
722,0.19448
723,0.29202
724,0.38355
725,0.47508
726,0.53687
727,0.59592
728,0.65496
729,0.7140000000000001
730,0.7507199999999999
731,0.76446
732,0.7771100000000001
733,0.78695
734,0.79633
735,0.79961
736,0.80289
737,0.80335
738,0.80335
739,0.80598
740,0.81004
741,0.81663
742,0.82647
743,0.83631
744,0.84615
745,0.8559899999999999
746,0.8658299999999999
747,0.8756700000000001
748,0.88551
749,0.89535
750,0.91046
751,0.9292
752,0.9483
753,0.96798
754,0.9909100000000001
755,1.0298
756,1.0687
757,1.1175
758,1.1667
759,1.2159
760,1.2651
761,1.3143
762,1.3635
763,1.4118
764,1.4582
765,1.5027
766,1.5322
767,1.5617
768,1.5912
769,1.6207
770,1.6201
771,1.6059
772,1.589
773,1.5693
774,1.5463
775,1.5141
776,1.4816
777,1.4422
778,1.4028
779,1.3635
780,1.3241
781,1.2848
782,1.2454
783,1.2055
784,1.1649
785,1.1225
786,1.0733
787,1.0241
788,0.9748600000000001
789,0.92565
790,0.89
791,0.85798
792,0.8274
793,0.79788
794,0.76836
795,0.7388399999999999
796,0.70932
797,0.6798
798,0.65027
799,0.63092
800,0.6121800000000001
801,0.60716
802,0.60716
803,0.60773
804,0.60883
805,0.61263
806,0.62247
807,0.63231
808,0.64215
809,0.65199
810,0.66932
811,0.6875899999999999
812,0.70682
813,0.7265
814,0.7461800000000001
815,0.76586
816,0.78554
817,0.8052199999999999
818,0.8249
819,0.84459
820,0.8642700000000001
821,0.88395
822,0.9036299999999999
823,0.9233100000000001
824,0.94299
825,0.96267
826,0.98235
827,1.002
828,1.0217
829,1.0414
830,1.0448
831,1.0479
832,1.0486
833,1.0486
834,1.0453
835,1.0395
836,1.0323
837,1.0225
838,1.0136
839,1.0103
840,1.0070000000000001
841,1.0159
842,1.0258
843,1.0345
844,1.0428
845,1.0419
846,1.032
847,1.0222
848,1.0123
849,1.0018
850,0.98385
851,0.9658899999999999
852,0.9464299999999999
853,0.92675
854,0.9070600000000001
855,0.88738
856,0.8677
857,0.8480200000000001
858,0.8275899999999999
859,0.80479
860,0.78179
861,0.75227
862,0.72275
863,0.6937399999999999
864,0.66484
865,0.64153
866,0.62185
867,0.60216
868,0.58248
869,0.56426
870,0.55255
871,0.54083
872,0.53094
873,0.5211
874,0.49878
875,0.47253999999999996
876,0.43909
877,0.39973000000000003
878,0.35836
879,0.31306
880,0.26602
881,0.20698000000000003
882,0.14794000000000002
883,0.43826000000000004
884,0.14304
885,-0.15217999999999998
886,-0.44738999999999995
887,-0.14728
888,-0.20631999999999998
889,-0.26316999999999996
890,-0.3144
891,-0.36549
892,-0.41468999999999995
893,-0.46388999999999997
894,-0.50854
895,-0.55243
896,-0.59338
897,-0.63275
898,-0.67211
899,-0.7114699999999999
900,-0.75083
901,-0.79019
902,-0.82955
903,-0.86829
904,-0.90702
905,-0.9304600000000001
906,-0.95014
907,-0.9698200000000001
908,-0.9895
909,-1.0063
910,-1.0183
911,-1.03
912,-1.0398
913,-1.0496
914,-1.0397
915,-1.0290000000000001
916,-1.0042
917,-0.97467
918,-0.9437200000000001
919,-0.91155
920,-0.8770399999999999
921,-0.83768
922,-0.79832
923,-0.7589600000000001
924,-0.71959
925,-0.68023
926,-0.6408699999999999
927,-0.60151
928,-0.56214
929,-0.52278
930,-0.48341999999999996
931,-0.44406
932,-0.4047
933,-0.36505
934,-0.32069000000000003
935,-0.27633
936,-0.22788000000000003
937,-0.17868
938,-0.12947
939,-0.40756
940,-0.16155
941,0.084464
942,0.33048
943,0.11654
944,0.16574
