time,value
0,0.97304
1,-0.20923000000000003
2,0.10224
3,-0.090534
4,-0.37975
5,-0.22478
6,-0.29149
7,0.072701
8,0.19130999999999998
9,-0.20709
10,-0.37701
11,0.35081
12,-0.49283000000000005
13,-0.31522
14,-0.11098
15,0.10045
16,-0.50132
17,0.92166
18,-0.18864
19,0.31637
20,-0.2731
21,-0.21825
22,0.48527
23,-0.11375
24,-0.09423
25,0.6761699999999999
26,0.099459
27,-0.12427
28,0.087074
29,-0.043655
30,0.064364
31,-0.12412999999999999
32,0.11
33,0.067159
34,-0.40585
35,0.54265
36,0.053312
37,0.40060999999999997
38,-0.25809
39,-0.30291999999999997
40,-0.67782
41,-0.062501
42,0.34425
43,-0.8032699999999999
44,-0.63069
45,0.32124
46,-0.17854
47,0.31156
48,0.057491999999999994
49,0.6968
50,0.074241
51,-0.71796
52,-0.3912
53,0.28657
54,0.18098
55,0.0084285
56,0.54387
57,0.2187
58,-0.40681
59,0.048799
60,0.55813
61,-0.06676900000000001
62,-0.0012281
63,0.35652
64,-0.3287
65,-0.61454
66,0.043302
67,0.36737
68,-0.12775999999999998
69,0.70919
70,0.4521
71,-0.24541
72,0.19061
73,0.18531
74,0.19931
75,0.040838
76,0.7238399999999999
77,-0.41491999999999996
78,-1.6401
79,-1.6401
80,-1.6401
81,-1.6401
82,-1.6401
83,-1.6401
84,-1.6401
85,-1.6401
86,-1.6401
87,-1.6401
88,-1.6401
89,1.7042
90,1.7042
91,1.7042
92,1.7042
93,1.7042
94,1.7042
95,1.7042
96,1.7042
97,1.7042
98,1.7042
99,-1.6401
100,-1.6401
101,-1.6401
102,-1.6401
103,-1.6401
104,-1.6401
105,-1.6401
106,-1.6401
107,-1.6401
108,-1.6401
109,1.7042
110,1.7042
111,1.7042
112,1.7042
113,1.7042
114,1.7042
115,1.7042
116,1.7042
117,1.7042
118,1.7042
119,0.27124000000000004
120,-0.089645
121,-0.071372
122,-0.48833999999999994
123,-0.83973
124,-0.33021999999999996
125,0.16385
126,0.15669
127,0.066188
