time,value
0,1.1918
1,1.1918
2,1.1918
3,1.1921
4,1.1959
5,1.2152
6,1.2439
7,1.2726
8,1.296
9,1.3121
10,1.3121
11,1.3121
12,1.3121
13,1.3121
14,1.3121
15,1.3121
16,1.3121
17,1.3121
18,1.3121
19,1.3121
20,1.3121
21,1.3121
22,1.3121
23,1.3121
24,1.3121
25,1.3121
26,1.3121
27,1.3121
28,1.3121
29,1.3121
30,1.3121
31,1.3121
32,1.3121
33,1.3121
34,1.3121
35,1.3121
36,1.3121
37,1.3121
38,1.3121
39,1.3121
40,1.3121
41,1.3121
42,1.3121
43,1.3121
44,1.3121
45,1.3121
46,1.3218
47,1.3393
48,1.3681
49,1.3968
50,1.4255
51,1.4543
52,1.483
53,1.5118
54,1.5405
55,1.5490000000000002
56,1.5528
57,1.5528
58,1.5528
59,1.5672
60,1.5926
61,1.6214
62,1.6501
63,1.6731
64,1.6731
65,1.6731
66,1.672
67,1.6682
68,1.6440000000000001
69,1.6152
70,1.5865
71,1.5577
72,1.5290000000000001
73,1.5003
74,1.4715
75,1.4369
76,1.3957
77,1.3382
78,1.2807
79,1.2232
80,1.1657
81,1.1083
82,1.0508
83,0.99329
84,0.93581
85,0.8783299999999999
86,0.82085
87,0.76337
88,0.70589
89,0.64841
90,0.5909300000000001
91,0.53345
92,0.47597
93,0.47163999999999995
94,0.46984
95,0.46984
96,0.46984
97,0.46984
98,0.46984
99,0.46984
100,0.47379
101,0.48478000000000004
102,0.51352
103,0.5422600000000001
104,0.56806
105,0.58722
106,0.59016
107,0.59016
108,0.59016
109,0.59016
110,0.59016
111,0.59016
112,0.59016
113,0.58078
114,0.56257
115,0.53383
116,0.5050899999999999
117,0.47635
118,0.44761000000000006
119,0.41886999999999996
120,0.39013000000000003
121,0.36139
122,0.31319
123,0.25831
124,0.20083
125,0.14335
126,0.46176999999999996
127,0.31806999999999996
128,0.17437
129,0.16899999999999998
130,-0.11302999999999999
131,-0.25673
132,-0.40043
133,-0.10307000000000001
134,-0.12414000000000001
135,-0.13179000000000002
136,-0.13179000000000002
137,-0.13179000000000002
138,-0.13179000000000002
139,-0.13179000000000002
140,-0.13179000000000002
141,-0.13179000000000002
142,-0.13179000000000002
143,-0.13179000000000002
144,-0.13179000000000002
145,-0.13179000000000002
146,-0.13179000000000002
147,-0.11352000000000001
148,-0.47323999999999994
149,-0.32954
150,-0.18584
151,-0.17367
152,-0.26631
153,-0.41001000000000004
154,-0.10572999999999999
155,-0.12424
156,-0.099334
157,-0.38319000000000003
158,-0.24206999999999998
159,-0.10795
160,-0.082373
161,-0.082373
162,-0.082373
163,-0.082373
164,-0.082373
165,-0.082373
166,-0.082373
167,-0.082373
168,-0.082373
169,-0.082373
170,-0.082373
171,-0.090795
172,-0.15785
173,-0.27589
174,-0.41958999999999996
175,-0.10765
176,-0.14922
177,-0.19847
178,-0.25595
179,-0.31343000000000004
180,-0.36325999999999997
181,-0.39966999999999997
182,-0.42916000000000004
183,-0.4579
184,-0.48663999999999996
185,-0.5153800000000001
186,-0.5441199999999999
187,-0.57286
188,-0.6016
189,-0.6130899999999999
190,-0.6130899999999999
191,-0.6130899999999999
192,-0.6130899999999999
193,-0.6130899999999999
194,-0.6130899999999999
195,-0.6130899999999999
196,-0.6130899999999999
197,-0.6130899999999999
198,-0.6130899999999999
199,-0.6130899999999999
200,-0.6130899999999999
201,-0.6130899999999999
202,-0.6130899999999999
203,-0.6130899999999999
204,-0.6130899999999999
205,-0.6130899999999999
206,-0.6130899999999999
207,-0.6130899999999999
208,-0.6130899999999999
209,-0.6130899999999999
210,-0.6130899999999999
211,-0.6130899999999999
212,-0.6130899999999999
213,-0.6130899999999999
214,-0.63084
215,-0.65563
216,-0.68437
217,-0.71311
218,-0.73137
219,-0.73328
220,-0.73342
221,-0.73252
222,-0.73035
223,-0.7016100000000001
224,-0.67287
225,-0.64515
226,-0.6279
227,-0.63953
228,-0.66827
229,-0.69701
230,-0.74607
231,-0.81772
232,-0.93268
233,-1.0476
234,-1.1451
235,-1.2065
236,-1.2147
237,-1.2147
238,-1.2147
239,-1.2147
240,-1.2147
241,-1.2147
242,-1.2147
243,-1.2029
244,-1.181
245,-1.1523
246,-1.1235
247,-1.0993
248,-1.0955
249,-1.0944
250,-1.0944
251,-1.0944
252,-1.0944
253,-1.0944
254,-1.0944
255,-1.0944
256,-1.0944
257,-1.0944
258,-1.0944
259,-1.0944
260,-1.0944
261,-1.0944
262,-1.0944
263,-1.0957
264,-1.1072
265,-1.13
266,-1.1588
267,-1.1875
268,-1.205
269,-1.2147
270,-1.2147
271,-1.2147
272,-1.2147
273,-1.2147
274,-1.2147
275,-1.2147
276,-1.2147
277,-1.2147
278,-1.2147
279,-1.2147
280,-1.2147
281,-1.1989
282,-1.1718
283,-1.1431
284,-1.1156
285,-1.0944
286,-1.0944
287,-1.0944
288,-1.0961
289,-1.1018
290,-1.1266
291,-1.1553
292,-1.1841
293,-1.2041
294,-1.2147
295,-1.2147
296,-1.2147
297,-1.2147
298,-1.2147
299,-1.2147
300,-1.2147
301,-1.2172
302,-1.2345
303,-1.2596
304,-1.2883
305,-1.317
306,-1.3458
307,-1.3745
308,-1.4033
309,-1.432
310,-1.4607
311,-1.4895
312,-1.5182
313,-1.547
314,-1.5757
315,0.85241
316,0.85241
317,0.85241
318,0.85295
319,0.8598
320,0.8942100000000001
321,0.9456100000000001
322,0.9970100000000001
323,1.0388
324,1.0676
325,1.0676
326,1.0676
327,1.0676
328,1.0676
329,1.0676
330,1.0676
331,1.0676
332,1.0676
333,1.0676
334,1.0676
335,1.0676
336,1.0676
337,1.0676
338,1.0676
339,1.0676
340,1.0676
341,1.0676
342,1.0676
343,1.0676
344,1.0676
345,1.0676
346,1.0676
347,1.0676
348,1.0676
349,1.0676
350,1.0676
351,1.0676
352,1.0676
353,1.0676
354,1.0676
355,1.0676
356,1.0676
357,1.0676
358,1.0676
359,1.0676
360,1.0676
361,1.0676
362,1.0676
363,1.0676
364,1.0676
365,1.0782
366,1.1091
367,1.1581
368,1.2095
369,1.2609
370,1.276
371,1.2828
372,1.2828
373,1.2828
374,1.3087
375,1.3541
376,1.4055
377,1.4569
378,1.4877
379,1.4363
380,1.3849
381,1.3354
382,1.2909
383,1.2828
384,1.2828
385,1.2828
386,1.2828
387,1.2828
388,1.2828
389,1.2828
390,1.2828
391,1.2828
392,1.2828
393,1.2828
394,1.2754
395,1.2206
396,1.1334
397,1.0306
398,0.92779
399,0.8766299999999999
400,0.85241
401,0.85241
402,0.85241
403,0.83711
404,0.79599
405,0.7455
406,0.6941
407,0.6427
408,0.63883
409,0.63722
410,0.63722
411,0.63722
412,0.63722
413,0.63722
414,0.63722
415,0.63722
416,0.63722
417,0.63722
418,0.63722
419,0.63722
420,0.63722
421,0.63722
422,0.63722
423,0.63722
424,0.63722
425,0.63722
426,0.63722
427,0.63722
428,0.63722
429,0.63722
430,0.63722
431,0.63722
432,0.63108
433,0.59339
434,0.5460699999999999
435,0.49467
436,0.44327
437,0.42668
438,0.42203
439,0.42203
440,0.42203
441,0.38090999999999997
442,0.27810999999999997
443,0.17531
444,0.37035
445,-0.06682
446,-0.06682
447,-0.06682
448,-0.073514
449,-0.14205
450,-0.33066999999999996
451,-0.11252000000000001
452,-0.16392
453,-0.2006
454,-0.22355
455,-0.22355
456,-0.22355
457,-0.22355
458,-0.22355
459,-0.22355
460,-0.22355
461,-0.22355
462,-0.22355
463,-0.22355
464,-0.22355
465,-0.22355
466,-0.20002
467,-0.15775
468,-0.10636
469,-0.29983000000000004
470,-0.088575
471,-0.07144199999999999
472,-0.06682
473,-0.062198
474,-0.045064
475,0.16619
476,0.42318
477,0.14105
478,0.18331
479,0.20684
480,0.20684
481,0.20684
482,0.21552
483,0.23425
484,0.28565
485,0.33705
486,0.38543
487,0.41285
488,0.42203
489,0.42203
490,0.42203
491,0.39908000000000005
492,0.3624
493,0.311
494,0.25961
495,0.20820999999999998
496,0.15680999999999998
497,0.502
498,0.245
499,-0.11544000000000001
500,-0.050404000000000004
501,-0.06682
502,-0.06682
503,-0.06682
504,-0.06682
505,-0.06682
506,-0.06682
507,-0.06682
508,-0.06682
509,-0.06682
510,-0.06682
511,-0.06682
512,-0.06682
513,-0.06682
514,-0.06682
515,-0.06682
516,-0.06682
517,-0.06682
518,-0.06682
519,-0.06682
520,-0.06682
521,-0.06682
522,-0.06682
523,-0.06682
524,-0.06682
525,-0.06682
526,-0.06682
527,-0.06682
528,-0.06682
529,-0.06682
530,-0.06682
531,-0.06682
532,-0.06682
533,-0.16053
534,-0.4004
535,-0.12623
536,-0.17440999999999998
537,-0.21806
538,-0.16666
539,-0.11525999999999999
540,-0.35346
541,-0.19926
542,-0.30326
543,-0.10704000000000001
544,-0.15844
545,-0.24618
546,-0.37432
547,-0.57991
548,-0.78551
549,-0.9598700000000001
550,-1.0695
551,-1.0843
552,-1.0843
553,-1.0843
554,-1.0843
555,-1.0843
556,-1.0843
557,-1.0843
558,-1.0843
559,-1.0843
560,-1.0843
561,-1.0843
562,-1.0924
563,-1.1369
564,-1.1864
565,-1.2378
566,-1.2892
567,-1.3406
568,-1.392
569,-1.4434
570,-1.4948
571,-1.5462
572,-1.5976
573,-1.649
574,-1.6936
575,-1.7299
576,-1.7299
577,-1.7299
578,-1.7299
579,-1.7299
580,-1.7299
581,-1.7299
582,-1.7299
583,-1.75
584,-1.784
585,-1.8354
586,-1.8868
587,-1.9261
588,-1.9432
589,-1.9451
590,-1.9451
591,-1.9451
592,-1.9051
593,-1.8587
594,-1.8073
595,-1.7559
596,-1.7329
597,-1.7299
598,-1.7299
599,-1.7276
600,-1.7141
601,-1.6627
602,-1.6113
603,-1.5599
604,-1.5085
605,-1.4571
606,-1.4057
607,-1.3543
608,-1.3185
609,-1.2995
610,-1.2995
611,-1.2995
612,-1.2995
613,-1.2995
614,-1.2995
615,-1.2995
616,-1.2995
617,-1.2995
618,-1.2995
619,-1.2995
620,-1.2995
621,-1.3282
622,-1.3701
623,-1.4215
624,-1.4729
625,-1.5073
626,-1.5141
627,-1.5147
628,-1.5147
629,-1.5147
630,-1.0476
631,-1.0476
632,-1.0476
633,-1.0476
634,-1.0476
635,-1.0476
636,-1.0476
637,-1.0476
638,-1.0476
639,-1.0476
640,-1.0476
641,-1.0476
642,-1.0476
643,-1.0476
644,-1.0476
645,-1.0476
646,-1.0476
647,-1.0476
648,-1.0476
649,-1.0476
650,-1.0476
651,-1.0476
652,-1.0476
653,-1.0476
654,-1.0476
655,-1.0476
656,-1.0476
657,-1.0476
658,-1.0476
659,-1.0476
660,-1.0476
661,-1.0476
662,-1.0476
663,-1.0476
664,-1.0476
665,-1.0476
666,-1.0476
667,-1.0476
668,-1.0476
669,-1.0476
670,-1.0476
671,-1.0476
672,-1.0476
673,-1.0476
674,-1.0476
675,-1.0476
676,-1.0476
677,-1.0476
678,-1.0476
679,-1.0476
680,-1.0476
681,-1.0476
682,-1.0476
683,-1.0476
684,-1.0476
685,-1.0476
686,-1.0476
687,-1.0476
688,-1.0476
689,-1.0476
690,-1.0476
691,-1.0476
692,-1.0476
693,-1.0476
694,-1.0476
695,-1.0476
696,-1.0429
697,-1.0257
698,-0.9171799999999999
699,-0.7884399999999999
700,-0.6597
701,-0.59259
702,-0.61507
703,-0.7438100000000001
704,-0.87255
705,-0.9481200000000001
706,-0.96525
707,-0.8365
708,-0.7077600000000001
709,-0.58828
710,-0.5282
711,-0.50864
712,-0.50864
713,-0.50864
714,-0.44397
715,-0.34557
716,-0.21681999999999998
717,-0.46545
718,-0.20496999999999999
719,-0.11323
720,-0.23742
721,-0.36616
722,-0.49491
723,-0.50461
724,-0.50864
725,-0.50864
726,-0.50864
727,-0.50864
728,-0.50864
729,-0.50864
730,-0.50864
731,-0.50864
732,-0.50864
733,-0.50864
734,-0.50864
735,-0.50864
736,-0.50864
737,-0.50864
738,-0.50864
739,-0.56425
740,-0.65627
741,-0.78501
742,-0.91375
743,-1.0005
744,-1.0476
745,-1.0476
746,-1.0476
747,-1.0476
748,-1.0476
749,-1.0476
750,-1.0476
751,-1.0476
752,-0.9604600000000001
753,-0.8433700000000001
754,-0.71463
755,-0.5858899999999999
756,-0.50864
757,-0.50864
758,-0.50864
759,-0.51686
760,-0.5361100000000001
761,-0.66485
762,-0.79359
763,-0.9223299999999999
764,-1.0511
765,-1.1798
766,-1.3086
767,-1.4373
768,-1.5292
769,-1.5866
770,-1.5866
771,-1.5866
772,-1.5866
773,-1.5866
774,-1.5866
775,-1.5866
776,-1.5866
777,-1.5048
778,-1.3978
779,-1.2691
780,-1.1403
781,-1.0116
782,-0.88285
783,-0.7541100000000001
784,-0.62537
785,-0.51954
786,-0.5109600000000001
787,-0.50864
788,-0.50632
789,-0.49773999999999996
790,-0.39191
791,-0.26316999999999996
792,-0.13443
793,-0.16784000000000002
794,0.12677
795,0.12677
796,0.12677
797,0.12677
798,0.12677
799,0.12677
800,0.12677
801,0.16449
802,0.46488999999999997
803,0.20374
804,0.33248
805,0.46121999999999996
806,0.58996
807,0.7187100000000001
808,0.84745
809,0.97619
810,1.0707
811,1.105
812,1.1084
813,1.1084
814,1.1084
815,1.1084
816,1.1084
817,1.1084
818,1.1084
819,1.1084
820,1.1084
821,1.1084
822,1.1084
823,1.1084
824,1.1084
825,1.1084
826,1.1084
827,1.1084
828,1.1084
829,1.1084
830,1.1084
831,1.1556
832,1.2423
833,1.371
834,1.4997
835,1.5918
836,1.6474
837,1.6474
838,1.6474
839,1.6474
840,1.6474
841,1.6474
842,1.6474
843,1.6474
844,1.6474
845,1.6474
846,1.6474
847,1.6474
848,1.6004
849,1.4803
850,1.3521
851,1.2274
852,1.1084
853,1.1084
854,1.1084
855,1.1061
856,1.0803
857,0.98993
858,0.86118
859,0.73244
860,0.66438
861,0.66378
862,0.79252
863,0.9212600000000001
864,1.0304
865,1.0991
866,1.1084
867,1.1084
868,1.1084
869,1.1084
870,1.1084
871,1.1084
872,1.1084
873,1.1084
874,1.1084
875,1.1084
876,1.1084
877,1.1084
878,1.1084
879,1.1084
880,1.1084
881,1.1084
882,1.0054
883,0.8766299999999999
884,0.7478899999999999
885,0.6342399999999999
886,0.5693699999999999
887,0.5693699999999999
888,0.5693699999999999
889,0.5693699999999999
890,0.5693699999999999
891,0.5693699999999999
892,0.5693699999999999
893,0.5693699999999999
894,0.5693699999999999
895,0.5693699999999999
896,0.5693699999999999
897,0.5693699999999999
898,0.5693699999999999
899,0.5693699999999999
900,0.5693699999999999
901,0.5693699999999999
902,0.5997100000000001
903,0.68553
904,0.8096899999999999
905,0.9384299999999999
906,1.0672
907,0.99567
908,0.8920799999999999
909,0.76334
910,0.6346
911,0.5768300000000001
912,0.5693699999999999
913,0.5693699999999999
914,0.5693699999999999
915,0.5693699999999999
916,0.5693699999999999
917,0.5693699999999999
918,0.5767899999999999
919,0.60254
920,0.7135600000000001
921,0.8423
922,0.97104
923,1.0609
924,1.1084
925,1.1084
926,1.1084
927,1.1084
928,1.1084
929,1.1084
930,1.1084
931,1.1084
932,1.1084
933,1.1084
934,1.1084
935,1.1084
936,1.1804
937,1.2852
938,1.4139
939,1.5427
940,1.6288
941,1.646
942,1.6474
943,1.6474
944,1.6474
