d3mIndex,fromNode,toNode
0,9,22
1,9,148
2,9,151
3,9,135
4,9,58
5,9,175
6,9,177
7,9,8
8,9,316
9,9,132
10,9,318
11,9,52
12,9,262
13,9,97
14,9,311
15,9,358
16,9,368
17,9,405
18,9,389
19,9,460
20,9,527
21,9,514
22,9,569
23,9,598
24,9,409
25,9,601
26,9,626
27,9,711
28,9,282
29,9,683
30,9,788
31,9,753
32,9,681
33,9,142
34,9,56
35,9,617
36,9,212
37,9,835
38,9,260
39,9,652
40,9,977
41,9,938
42,9,997
43,9,834
44,9,32
45,9,72
46,9,1196
47,9,1169
48,9,1181
49,9,1279
50,9,477
51,9,1323
52,9,1312
53,9,1265
54,9,1402
55,9,1420
56,9,1423
57,9,317
58,9,1338
59,36,40
60,36,60
61,36,84
62,36,124
63,36,214
64,36,6
65,36,222
66,36,291
67,36,211
68,36,299
69,36,413
70,36,119
71,36,3
72,36,400
73,36,73
74,36,189
75,36,770
76,36,1127
77,41,43
78,41,58
79,41,132
80,41,166
81,41,63
82,41,177
83,41,180
84,41,168
85,41,188
86,41,215
87,41,97
88,41,265
89,41,184
90,41,325
91,41,419
92,41,389
93,41,503
94,41,523
95,41,528
96,41,355
97,41,513
98,41,460
99,41,567
100,41,502
101,41,90
102,41,603
103,41,598
104,41,754
105,41,766
106,41,599
107,41,713
108,41,183
109,41,495
110,41,928
111,41,283
112,41,151
113,41,975
114,41,938
115,41,1041
116,41,1043
117,41,1018
118,41,1215
119,41,1236
120,41,1255
121,41,943
122,41,913
123,44,59
124,44,84
125,44,92
126,44,79
127,44,60
128,44,127
129,44,214
130,44,88
131,44,308
132,44,174
133,44,372
134,44,296
135,44,74
136,44,34
137,44,770
138,44,249
139,44,189
140,44,129
141,44,1271
142,59,104
143,60,296
144,60,308
145,60,1281
146,58,32
147,58,19
148,58,38
149,58,51
150,58,48
151,58,8
152,58,199
153,32,67
154,32,96
155,32,143
156,32,177
157,32,175
158,32,243
159,32,184
160,32,263
161,32,400
162,32,430
163,32,474
164,32,209
165,32,527
166,32,8
167,32,713
168,32,711
169,32,605
170,32,681
171,32,68
172,32,940
173,32,1034
174,32,825
175,32,1093
176,32,12
177,32,1103
178,32,462
179,32,1042
180,32,683
181,32,546
182,32,317
183,32,281
184,32,377
185,32,1232
186,32,1211
187,32,638
188,32,1234
189,32,799
190,32,1255
191,32,118
192,32,220
193,32,105
194,32,1260
195,32,1227
196,32,523
197,68,56
198,68,204
199,68,308
200,68,97
201,68,323
202,68,832
203,68,475
204,68,638
205,68,598
206,68,599
207,68,173
208,68,969
209,68,938
210,68,783
211,68,495
212,68,1402
213,56,105
214,56,90
215,56,57
216,67,215
217,67,143
218,67,172
219,67,90
220,67,396
221,67,8
222,67,440
223,67,72
224,67,424
225,67,521
226,67,475
227,67,313
228,67,212
229,67,683
230,67,806
231,67,323
232,67,282
233,67,536
234,67,679
235,67,281
236,67,938
237,67,63
238,67,595
239,67,598
240,67,1034
241,67,1039
242,67,1206
243,67,1184
244,67,1255
245,67,1402
246,71,72
247,72,106
248,72,310
249,72,160
250,72,337
251,72,30
252,72,372
253,72,335
254,72,263
255,72,266
256,72,652
257,72,683
258,72,704
259,72,686
260,72,611
261,72,644
262,72,583
263,72,768
264,72,679
265,72,861
266,72,103
267,72,1039
268,72,834
269,72,318
270,72,1068
271,72,3
272,72,1227
273,72,42
274,72,883
275,72,1253
276,72,392
277,73,74
278,73,252
279,73,463
280,73,697
281,73,617
282,73,605
283,73,787
284,73,773
285,73,379
286,73,926
287,73,142
288,73,63
289,73,596
290,73,1281
291,74,63
292,74,408
293,74,379
294,74,503
295,74,302
296,74,617
297,74,638
298,74,316
299,74,599
300,74,713
301,74,753
302,74,758
303,74,592
304,74,635
305,74,860
306,74,598
307,74,561
308,74,686
309,74,1281
310,19,82
311,19,120
312,19,111
313,19,302
314,19,331
315,19,365
316,19,478
317,19,409
318,19,593
319,19,114
320,19,924
321,19,711
322,19,654
323,19,806
324,19,525
325,19,1078
326,19,1098
327,19,986
328,19,997
329,19,583
330,19,527
331,19,1132
332,19,859
333,19,886
334,19,1016
335,19,443
336,19,1260
337,82,400
338,51,70
339,51,215
340,51,260
341,51,204
342,51,267
343,51,307
344,51,212
345,51,324
346,51,314
347,51,530
348,51,528
349,51,561
350,51,525
351,51,588
352,51,523
353,51,913
354,51,919
355,51,969
356,70,124
357,70,573
358,70,90
359,70,400
360,70,163
361,38,288
362,38,175
363,38,405
364,38,177
365,38,313
366,38,502
367,38,302
368,38,128
369,38,475
370,38,343
371,38,783
372,84,391
373,84,639
374,84,765
375,84,1103
376,84,598
377,48,86
378,48,52
379,48,175
380,48,220
381,48,204
382,48,307
383,48,314
384,48,256
385,48,6
386,48,447
387,48,538
388,48,144
389,48,621
390,48,683
391,48,753
392,48,758
393,48,762
394,48,721
395,48,212
396,48,986
397,48,1136
398,48,152
399,48,1184
400,48,323
401,91,81
402,81,400
403,97,98
404,97,228
405,97,349
406,97,542
407,97,325
408,97,509
409,97,372
410,97,629
411,97,651
412,97,726
413,97,181
414,97,644
415,97,770
416,97,194
417,97,563
418,97,559
419,97,1326
420,97,124
421,98,335
422,98,102
423,98,1069
424,104,817
425,105,61
426,105,454
427,105,1039
428,105,563
429,105,212
430,105,1132
431,105,323
432,105,1134
433,105,155
434,105,1131
435,105,1142
436,105,1144
437,105,1148
438,105,1152
439,105,992
440,105,475
441,105,487
442,105,343
443,105,758
444,105,498
445,105,128
446,105,915
447,105,569
448,105,288
449,105,964
450,105,463
451,105,621
452,105,697
453,105,1021
454,105,701
455,105,474
456,105,1083
457,61,325
458,61,542
459,101,115
460,101,190
461,101,208
462,101,12
463,101,176
464,101,1
465,101,733
466,101,514
467,101,847
468,101,214
469,101,1002
470,101,282
471,101,370
472,101,1283
473,101,1281
474,90,594
475,90,479
476,90,6
477,90,1283
478,90,605
479,90,1339
480,119,120
481,119,447
482,119,596
483,119,617
484,120,222
485,124,85
486,124,135
487,124,109
488,124,114
489,124,318
490,124,323
491,124,396
492,124,452
493,124,551
494,124,605
495,124,711
496,124,713
497,124,1234
498,79,260
499,103,63
500,103,109
501,103,215
502,103,168
503,103,175
504,103,66
505,103,228
506,103,299
507,103,318
508,103,158
509,103,365
510,103,371
511,103,344
512,103,417
513,103,392
514,103,464
515,103,480
516,103,502
517,103,503
518,103,393
519,103,128
520,103,378
521,103,577
522,103,402
523,103,489
524,103,569
525,103,598
526,103,462
527,103,593
528,103,538
529,103,447
530,103,277
531,103,372
532,103,673
533,103,683
534,103,712
535,103,731
536,103,617
537,103,260
538,103,758
539,103,799
540,103,601
541,103,605
542,103,841
543,103,920
544,103,686
545,103,783
546,103,386
547,103,599
548,103,525
549,103,853
550,103,256
551,103,561
552,103,969
553,103,973
554,103,596
555,103,809
556,103,151
557,103,988
558,103,144
559,103,975
560,103,638
561,103,1078
562,103,1097
563,103,1060
564,103,974
565,103,475
566,103,954
567,103,1244
568,103,1231
569,103,1215
570,103,1302
571,103,1195
572,103,1313
573,103,1280
574,103,1312
575,63,161
576,63,174
577,63,185
578,63,199
579,63,176
580,63,127
581,63,296
582,63,155
583,63,337
584,63,430
585,63,193
586,63,704
587,63,385
588,63,514
589,63,801
590,63,547
591,63,242
592,63,297
593,63,990
594,63,847
595,63,865
596,63,814
597,63,290
598,63,963
599,63,95
600,63,26
601,63,342
602,132,30
603,132,3
604,132,449
605,132,589
606,132,263
607,132,333
608,132,398
609,132,42
610,30,392
611,30,644
612,30,679
613,30,161
614,30,1014
615,96,224
616,96,6
617,135,1
618,143,95
619,143,542
620,143,201
621,143,1037
622,143,479
623,143,442
624,109,1000
625,145,95
626,145,88
627,145,830
628,145,994
629,95,220
630,95,447
631,95,371
632,95,682
633,95,712
634,95,592
635,95,175
636,95,713
637,95,1246
638,95,859
639,1,397
640,1,477
641,1,146
642,1,1014
643,1,312
644,1,1271
645,8,164
646,8,254
647,8,249
648,8,99
649,8,624
650,8,12
651,8,250
652,8,834
653,8,986
654,166,400
655,164,177
656,175,50
657,175,176
658,175,12
659,175,191
660,175,395
661,175,424
662,175,398
663,175,640
664,175,224
665,175,1421
666,50,288
667,50,311
668,50,376
669,50,386
670,50,409
671,50,626
672,50,654
673,50,102
674,50,697
675,50,1100
676,50,586
677,50,755
678,50,234
679,50,596
680,50,1253
681,50,481
682,50,701
683,50,758
684,50,1284
685,161,221
686,161,617
687,161,679
688,177,514
689,180,242
690,168,400
691,168,834
692,174,335
693,174,260
694,174,1260
695,185,308
696,188,400
697,190,652
698,176,201
699,176,202
700,176,181
701,176,283
702,176,378
703,176,396
704,176,392
705,176,445
706,176,928
707,176,815
708,176,204
709,176,975
710,176,840
711,176,1001
712,176,1026
713,176,277
714,176,154
715,176,638
716,176,502
717,176,1161
718,176,12
719,176,3
720,176,1142
721,176,1236
722,176,1423
723,201,410
724,201,52
725,201,140
726,181,260
727,181,454
728,181,495
729,181,323
730,181,355
731,181,204
732,181,783
733,181,766
734,199,209
735,199,536
736,199,546
737,199,194
738,199,445
739,199,212
740,199,569
741,199,460
742,199,978
743,199,971
744,199,1050
745,199,1060
746,199,652
747,199,713
748,199,1244
749,199,1237
750,199,1375
751,209,242
752,209,365
753,209,194
754,209,321
755,209,355
756,209,598
757,209,1072
758,209,823
759,209,594
760,211,93
761,211,288
762,211,221
763,211,525
764,211,597
765,211,1281
766,214,220
767,214,396
768,214,437
769,214,525
770,214,583
771,214,475
772,214,862
773,214,713
774,215,62
775,62,220
776,62,266
777,62,502
778,62,194
779,62,481
780,62,465
781,62,368
782,62,475
783,62,204
784,62,567
785,62,596
786,62,551
787,62,1224
788,62,1373
789,224,605
790,224,144
791,224,220
792,221,204
793,221,6
794,221,286
795,220,271
796,220,308
797,220,479
798,220,1189
799,220,1018
800,220,346
801,220,1310
802,3,88
803,3,99
804,3,385
805,3,590
806,3,498
807,3,194
808,3,1192
809,3,487
810,3,257
811,228,121
812,228,304
813,228,311
814,228,392
815,228,626
816,228,1246
817,228,498
818,52,644
819,52,681
820,52,309
821,12,288
822,12,593
823,12,480
824,12,569
825,12,527
826,12,391
827,12,658
828,12,402
829,12,617
830,12,823
831,12,140
832,12,830
833,12,757
834,12,711
835,12,817
836,12,713
837,12,998
838,12,319
839,12,142
840,12,543
841,12,282
842,12,536
843,12,926
844,12,1039
845,12,389
846,12,599
847,12,814
848,12,343
849,12,308
850,12,415
851,12,605
852,12,1255
853,12,1344
854,12,969
855,12,1118
856,12,1379
857,12,1138
858,12,392
859,12,1281
860,12,1214
861,144,222
862,144,99
863,144,189
864,144,805
865,144,142
866,144,515
867,144,479
868,144,975
869,144,873
870,144,1127
871,144,42
872,144,645
873,144,834
874,144,644
875,144,1185
876,222,263
877,191,237
878,191,323
879,191,396
880,191,393
881,191,405
882,191,409
883,191,536
884,191,738
885,191,365
886,191,371
887,191,913
888,191,501
889,191,1060
890,191,1097
891,191,765
892,191,1049
893,243,266
894,247,248
895,248,375
896,248,603
897,248,374
898,212,252
899,212,34
900,212,6
901,212,263
902,212,388
903,212,303
904,212,413
905,212,376
906,212,422
907,212,372
908,212,321
909,212,472
910,212,305
911,212,368
912,212,646
913,212,704
914,212,678
915,212,236
916,212,712
917,212,439
918,212,274
919,212,765
920,212,590
921,212,289
922,212,299
923,212,306
924,212,741
925,212,532
926,252,456
927,252,277
928,252,389
929,252,376
930,252,598
931,252,638
932,252,463
933,252,542
934,252,713
935,252,935
936,252,391
937,252,297
938,252,765
939,252,783
940,252,687
941,252,1026
942,252,815
943,252,1236
944,252,1056
945,252,481
946,252,350
947,252,1283
948,34,314
949,34,286
950,34,335
951,34,313
952,34,502
953,34,551
954,34,592
955,34,802
956,34,843
957,34,768
958,34,1072
959,34,483
960,34,282
961,88,358
962,88,323
963,88,427
964,88,701
965,254,263
966,254,308
967,254,281
968,254,311
969,254,317
970,254,337
971,254,302
972,254,353
973,254,307
974,254,378
975,254,447
976,254,638
977,254,673
978,254,701
979,254,626
980,254,561
981,254,697
982,254,605
983,254,408
984,254,1039
985,254,654
986,254,986
987,254,277
988,254,576
989,254,1215
990,254,1234
991,254,1260
992,254,358
993,254,1338
994,254,1247
995,254,1136
996,254,1402
997,254,1184
998,254,659
999,260,267
1000,260,386
1001,260,250
1002,260,949
1003,260,509
1004,263,317
1005,263,281
1006,263,316
1007,263,405
1008,263,297
1009,263,605
1010,263,686
1011,263,513
1012,263,337
1013,263,277
1014,263,638
1015,263,272
1016,263,840
1017,263,762
1018,263,843
1019,263,391
1020,263,449
1021,204,266
1022,204,271
1023,204,482
1024,204,242
1025,204,571
1026,204,298
1027,204,794
1028,204,198
1029,204,830
1030,204,498
1031,204,777
1032,204,949
1033,204,667
1034,204,725
1035,204,250
1036,204,1189
1037,204,615
1038,6,325
1039,6,378
1040,6,376
1041,6,335
1042,6,413
1043,6,398
1044,6,274
1045,6,481
1046,6,343
1047,6,636
1048,6,597
1049,6,639
1050,6,479
1051,6,591
1052,6,642
1053,6,603
1054,6,317
1055,6,69
1056,6,712
1057,6,686
1058,6,794
1059,6,1180
1060,6,753
1061,6,422
1062,256,259
1063,256,242
1064,259,299
1065,259,598
1066,266,475
1067,266,626
1068,266,321
1069,266,573
1070,266,583
1071,266,680
1072,69,271
1073,69,368
1074,69,996
1075,69,1296
1076,271,194
1077,283,375
1078,283,628
1079,283,475
1080,283,766
1081,283,194
1082,283,445
1083,283,297
1084,283,815
1085,283,583
1086,283,594
1087,283,843
1088,114,250
1089,114,357
1090,114,770
1091,291,393
1092,291,1168
1093,277,299
1094,277,184
1095,277,362
1096,277,352
1097,277,649
1098,277,673
1099,277,602
1100,277,609
1101,277,603
1102,277,448
1103,277,770
1104,277,777
1105,277,871
1106,277,1004
1107,277,605
1108,277,990
1109,277,950
1110,277,1032
1111,277,615
1112,277,1023
1113,277,423
1114,277,80
1115,277,993
1116,277,1014
1117,277,1186
1118,277,1185
1119,277,687
1120,277,1213
1121,277,644
1122,299,462
1123,299,431
1124,299,321
1125,184,194
1126,184,573
1127,184,713
1128,184,1026
1129,302,138
1130,302,193
1131,302,281
1132,302,393
1133,302,497
1134,302,509
1135,302,557
1136,302,456
1137,302,617
1138,302,155
1139,302,1185
1140,302,1187
1141,302,1238
1142,302,733
1143,302,128
1144,288,249
1145,288,42
1146,288,1183
1147,288,1190
1148,288,470
1149,172,713
1150,172,598
1151,172,638
1152,172,544
1153,307,281
1154,307,317
1155,307,341
1156,307,431
1157,281,308
1158,281,323
1159,281,332
1160,281,337
1161,281,317
1162,281,402
1163,281,561
1164,281,1280
1165,308,314
1166,308,311
1167,308,332
1168,308,317
1169,308,337
1170,308,316
1171,308,140
1172,308,540
1173,308,739
1174,308,155
1175,308,823
1176,308,859
1177,308,583
1178,308,863
1179,308,586
1180,308,520
1181,308,1004
1182,308,373
1183,308,1068
1184,308,595
1185,308,1042
1186,308,333
1187,308,523
1188,308,753
1189,308,835
1190,308,1281
1191,308,701
1192,308,278
1193,193,355
1194,193,593
1195,193,538
1196,193,595
1197,193,686
1198,193,233
1199,193,847
1200,193,658
1201,193,118
1202,193,483
1203,193,378
1204,310,405
1205,314,333
1206,314,479
1207,314,966
1208,314,542
1209,314,131
1210,296,823
1211,296,355
1212,296,194
1213,296,42
1214,296,544
1215,296,445
1216,296,353
1217,296,516
1218,296,1138
1219,296,1236
1220,316,303
1221,316,355
1222,316,102
1223,316,317
1224,316,325
1225,316,726
1226,316,327
1227,286,400
1228,83,313
1229,83,835
1230,313,75
1231,313,398
1232,313,801
1233,313,733
1234,318,345
1235,99,561
1236,99,626
1237,99,654
1238,99,194
1239,155,1281
1240,324,128
1241,324,329
1242,324,400
1243,324,652
1244,297,325
1245,297,131
1246,297,372
1247,297,289
1248,297,272
1249,297,422
1250,297,321
1251,297,234
1252,297,242
1253,297,834
1254,297,777
1255,297,714
1256,297,337
1257,297,448
1258,297,484
1259,297,482
1260,297,814
1261,297,950
1262,297,999
1263,297,609
1264,297,542
1265,297,598
1266,297,640
1267,297,1158
1268,297,1189
1269,297,1283
1270,297,1339
1271,297,733
1272,325,378
1273,325,447
1274,325,482
1275,325,542
1276,325,549
1277,325,560
1278,325,583
1279,325,607
1280,325,625
1281,325,194
1282,325,642
1283,325,53
1284,325,644
1285,325,645
1286,325,713
1287,325,823
1288,325,859
1289,325,783
1290,325,760
1291,325,938
1292,325,1033
1293,325,42
1294,325,1072
1295,325,1169
1296,325,1248
1297,325,1181
1298,325,1283
1299,325,1281
1300,325,1402
1301,128,344
1302,128,423
1303,128,236
1304,128,334
1305,128,715
1306,128,372
1307,128,542
1308,128,629
1309,128,687
1310,128,873
1311,128,944
1312,128,934
1313,128,573
1314,128,685
1315,128,338
1316,128,569
1317,128,1113
1318,128,503
1319,128,1381
1320,128,1415
1321,128,738
1322,128,733
1323,128,706
1324,128,1354
1325,128,1153
1326,128,1101
1327,323,372
1328,323,458
1329,323,642
1330,323,367
1331,323,640
1332,323,678
1333,323,400
1334,323,638
1335,323,728
1336,323,753
1337,323,431
1338,323,645
1339,323,834
1340,323,557
1341,323,373
1342,323,341
1343,323,966
1344,323,999
1345,323,687
1346,323,1014
1347,323,250
1348,323,1036
1349,323,339
1350,323,632
1351,323,779
1352,323,810
1353,323,1237
1354,323,350
1355,323,1047
1356,323,950
1357,323,42
1358,323,741
1359,323,1267
1360,323,298
1361,323,1297
1362,323,758
1363,323,1083
1364,323,991
1365,323,725
1366,323,1339
1367,323,1044
1368,323,1113
1369,303,194
1370,336,333
1371,336,536
1372,333,329
1373,333,317
1374,329,415
1375,329,142
1376,335,365
1377,335,368
1378,335,356
1379,335,631
1380,311,400
1381,311,1037
1382,317,368
1383,317,343
1384,317,1111
1385,317,679
1386,317,477
1387,317,1069
1388,317,605
1389,317,1283
1390,317,617
1391,317,398
1392,337,673
1393,337,598
1394,337,739
1395,337,605
1396,337,771
1397,337,504
1398,337,1283
1399,337,142
1400,337,1168
1401,337,777
1402,337,1233
1403,160,638
1404,353,950
1405,353,194
1406,353,372
1407,353,341
1408,353,1183
1409,353,261
1410,353,713
1411,353,1365
1412,353,42
1413,353,645
1414,357,358
1415,357,396
1416,357,460
1417,357,409
1418,357,501
1419,357,502
1420,357,538
1421,357,598
1422,357,758
1423,357,818
1424,357,1068
1425,357,626
1426,357,988
1427,357,1118
1428,357,1111
1429,357,1181
1430,357,1161
1431,357,802
1432,357,474
1433,357,1253
1434,357,525
1435,357,1402
1436,358,479
1437,358,719
1438,358,249
1439,131,753
1440,131,734
1441,131,686
1442,131,439
1443,131,504
1444,131,990
1445,131,1281
1446,131,654
1447,131,1284
1448,131,792
1449,242,429
1450,242,573
1451,242,638
1452,242,823
1453,242,389
1454,242,219
1455,242,454
1456,355,102
1457,355,194
1458,53,305
1459,53,481
1460,53,785
1461,53,1018
1462,53,834
1463,53,26
1464,53,343
1465,53,1314
1466,53,620
1467,349,648
1468,349,655
1469,349,942
1470,344,321
1471,365,399
1472,365,431
1473,365,400
1474,365,422
1475,365,350
1476,365,321
1477,365,540
1478,365,615
1479,345,518
1480,345,346
1481,345,1058
1482,75,321
1483,75,475
1484,75,1041
1485,367,368
1486,367,393
1487,367,479
1488,367,1184
1489,368,340
1490,368,398
1491,368,294
1492,368,372
1493,368,236
1494,368,483
1495,368,309
1496,368,359
1497,368,539
1498,368,542
1499,368,594
1500,368,371
1501,368,482
1502,368,404
1503,368,514
1504,368,162
1505,368,454
1506,368,648
1507,368,300
1508,368,605
1509,368,992
1510,372,376
1511,372,389
1512,372,429
1513,372,407
1514,372,392
1515,372,482
1516,372,484
1517,372,508
1518,372,375
1519,372,514
1520,372,652
1521,372,679
1522,372,713
1523,372,495
1524,372,753
1525,372,639
1526,372,569
1527,372,758
1528,372,761
1529,372,536
1530,372,766
1531,372,799
1532,372,765
1533,372,823
1534,372,605
1535,372,826
1536,372,396
1537,372,988
1538,372,818
1539,372,595
1540,372,1111
1541,372,393
1542,372,546
1543,372,454
1544,372,1163
1545,372,919
1546,372,1246
1547,372,527
1548,372,1244
1549,372,473
1550,372,1189
1551,372,1362
1552,372,233
1553,372,1352
1554,372,475
1555,372,1358
1556,372,1236
1557,372,1354
1558,372,1018
1559,372,592
1560,376,194
1561,375,496
1562,375,194
1563,375,1189
1564,378,398
1565,378,396
1566,378,425
1567,378,481
1568,378,498
1569,378,586
1570,386,387
1571,386,586
1572,386,514
1573,386,755
1574,386,790
1575,388,513
1576,388,636
1577,388,761
1578,388,681
1579,388,439
1580,388,627
1581,388,859
1582,388,795
1583,388,639
1584,396,407
1585,396,400
1586,396,425
1587,396,481
1588,396,679
1589,396,1113
1590,289,371
1591,289,419
1592,289,391
1593,289,392
1594,289,379
1595,289,536
1596,289,538
1597,289,463
1598,289,598
1599,289,599
1600,289,149
1601,289,646
1602,289,673
1603,289,429
1604,289,339
1605,289,449
1606,289,460
1607,289,835
1608,289,183
1609,289,377
1610,289,1126
1611,371,306
1612,371,636
1613,371,789
1614,371,448
1615,371,871
1616,371,551
1617,371,590
1618,400,441
1619,400,472
1620,400,429
1621,400,638
1622,400,474
1623,400,598
1624,400,683
1625,400,392
1626,400,783
1627,400,551
1628,400,617
1629,400,596
1630,400,626
1631,400,504
1632,400,835
1633,400,420
1634,400,360
1635,400,154
1636,400,895
1637,400,743
1638,400,443
1639,400,901
1640,400,284
1641,400,587
1642,400,682
1643,400,556
1644,400,707
1645,400,449
1646,400,910
1647,400,809
1648,400,734
1649,400,173
1650,400,823
1651,400,859
1652,400,447
1653,400,639
1654,400,543
1655,400,495
1656,400,799
1657,400,776
1658,400,822
1659,398,405
1660,398,134
1661,398,465
1662,398,771
1663,398,679
1664,398,354
1665,399,76
1666,393,679
1667,393,431
1668,393,915
1669,393,498
1670,393,800
1671,393,462
1672,393,1111
1673,393,1190
1674,405,497
1675,405,950
1676,409,542
1677,409,147
1678,409,1283
1679,27,406
1680,27,414
1681,27,278
1682,27,953
1683,27,652
1684,27,479
1685,27,794
1686,402,1201
1687,321,392
1688,321,460
1689,321,343
1690,321,487
1691,321,236
1692,321,491
1693,321,437
1694,321,507
1695,321,454
1696,321,593
1697,321,306
1698,321,609
1699,321,639
1700,321,595
1701,321,219
1702,321,686
1703,321,616
1704,321,758
1705,321,801
1706,321,765
1707,414,475
1708,413,683
1709,413,690
1710,413,654
1711,413,479
1712,419,1000
1713,249,474
1714,249,454
1715,249,659
1716,249,779
1717,249,598
1718,249,1181
1719,249,1209
1720,249,1260
1721,249,1304
1722,249,1255
1723,249,1402
1724,249,1421
1725,249,1138
1726,249,569
1727,422,607
1728,422,389
1729,422,697
1730,422,194
1731,422,1060
1732,422,615
1733,422,800
1734,422,1041
1735,422,1283
1736,422,1281
1737,57,596
1738,294,250
1739,294,830
1740,294,42
1741,389,236
1742,389,456
1743,389,509
1744,389,482
1745,389,586
1746,389,727
1747,389,644
1748,389,640
1749,389,830
1750,389,652
1751,389,1042
1752,389,1059
1753,423,392
1754,423,454
1755,423,938
1756,236,407
1757,236,501
1758,236,552
1759,236,509
1760,236,147
1761,236,617
1762,236,638
1763,236,1183
1764,236,549
1765,356,711
1766,356,543
1767,356,474
1768,356,1255
1769,356,1281
1770,194,342
1771,194,456
1772,194,482
1773,194,683
1774,194,836
1775,194,913
1776,194,173
1777,194,884
1778,194,621
1779,194,42
1780,194,334
1781,194,498
1782,194,619
1783,194,652
1784,194,794
1785,194,586
1786,194,573
1787,194,575
1788,194,679
1789,194,768
1790,194,817
1791,194,644
1792,194,567
1793,194,1185
1794,194,80
1795,194,465
1796,194,706
1797,194,1270
1798,194,1406
1799,392,466
1800,392,502
1801,392,475
1802,392,815
1803,392,1054
1804,392,950
1805,392,1315
1806,392,42
1807,392,871
1808,392,1383
1809,392,1295
1810,431,407
1811,431,617
1812,431,605
1813,431,627
1814,431,595
1815,431,859
1816,431,1402
1817,431,1117
1818,429,494
1819,429,481
1820,429,950
1821,407,425
1822,407,765
1823,391,234
1824,391,309
1825,391,555
1826,391,1154
1827,441,442
1828,442,753
1829,234,183
1830,234,1183
1831,425,765
1832,425,1103
1833,140,276
1834,140,574
1835,140,847
1836,274,703
1837,274,720
1838,424,495
1839,474,642
1840,474,679
1841,474,646
1842,474,346
1843,474,834
1844,474,1310
1845,474,1349
1846,474,847
1847,474,1339
1848,474,42
1849,460,440
1850,460,608
1851,460,770
1852,460,542
1853,460,586
1854,460,546
1855,483,42
1856,483,782
1857,483,821
1858,481,517
1859,481,638
1860,481,639
1861,481,387
1862,481,701
1863,481,233
1864,481,687
1865,481,769
1866,481,988
1867,481,561
1868,481,815
1869,481,975
1870,481,783
1871,481,1402
1872,481,1236
1873,343,735
1874,343,755
1875,343,377
1876,343,1110
1877,343,350
1878,343,1242
1879,482,532
1880,482,598
1881,482,713
1882,482,823
1883,482,901
1884,482,1189
1885,482,1217
1886,482,1283
1887,484,770
1888,484,706
1889,487,437
1890,487,1026
1891,494,1189
1892,475,496
1893,475,363
1894,475,502
1895,475,594
1896,475,678
1897,475,642
1898,475,697
1899,475,250
1900,475,770
1901,475,821
1902,475,468
1903,475,841
1904,475,640
1905,475,1105
1906,475,733
1907,475,1281
1908,475,1189
1909,475,339
1910,496,588
1911,497,551
1912,497,1280
1913,437,514
1914,437,631
1915,437,625
1916,437,934
1917,437,1004
1918,437,1033
1919,437,1113
1920,437,1189
1921,437,546
1922,379,432
1923,379,995
1924,501,456
1925,501,241
1926,309,502
1927,309,586
1928,309,848
1929,309,600
1930,309,1182
1931,309,1136
1932,309,1131
1933,309,1103
1934,309,80
1935,309,1421
1936,502,539
1937,502,594
1938,502,468
1939,502,555
1940,502,752
1941,502,250
1942,502,733
1943,502,1038
1944,502,1018
1945,502,87
1946,502,1233
1947,502,1189
1948,502,1213
1949,502,42
1950,502,1438
1951,342,1068
1952,342,598
1953,342,713
1954,342,1039
1955,342,626
1956,342,784
1957,342,1097
1958,342,495
1959,342,1040
1960,342,1384
1961,342,783
1962,342,239
1963,453,264
1964,453,679
1965,507,1317
1966,503,1316
1967,503,102
1968,503,272
1969,479,687
1970,479,758
1971,479,711
1972,479,432
1973,479,788
1974,479,642
1975,479,1033
1976,479,1236
1977,479,683
1978,479,1184
1979,509,454
1980,509,536
1981,509,698
1982,509,272
1983,509,364
1984,509,872
1985,509,306
1986,509,975
1987,509,758
1988,509,616
1989,454,539
1990,454,363
1991,454,770
1992,454,586
1993,454,733
1994,454,797
1995,454,830
1996,454,338
1997,454,950
1998,454,942
1999,454,448
2000,454,467
2001,454,777
2002,454,1043
2003,454,1036
2004,454,1127
2005,454,1236
2006,454,725
2007,454,1340
2008,456,457
2009,456,527
2010,456,465
2011,456,654
2012,456,394
2013,456,697
2014,456,1246
2015,508,1113
2016,513,440
2017,513,542
2018,513,545
2019,513,627
2020,513,588
2021,513,439
2022,513,649
2023,513,723
2024,513,762
2025,513,834
2026,513,586
2027,513,950
2028,513,990
2029,513,1101
2030,513,514
2031,513,681
2032,440,588
2033,440,590
2034,440,523
2035,440,1103
2036,465,679
2037,523,565
2038,523,791
2039,523,549
2040,523,724
2041,523,1093
2042,523,1283
2043,523,1189
2044,457,939
2045,350,592
2046,350,632
2047,350,617
2048,350,626
2049,350,1102
2050,350,1353
2051,527,1042
2052,527,923
2053,447,1037
2054,447,719
2055,532,536
2056,532,463
2057,532,364
2058,532,765
2059,532,1236
2060,517,1048
2061,517,709
2062,517,714
2063,539,765
2064,539,985
2065,539,1103
2066,539,495
2067,539,1021
2068,539,952
2069,536,537
2070,536,765
2071,536,882
2072,536,921
2073,536,940
2074,536,782
2075,536,884
2076,536,1113
2077,536,1127
2078,536,615
2079,536,1240
2080,536,1224
2081,536,1236
2082,536,994
2083,542,543
2084,542,546
2085,542,548
2086,542,598
2087,542,567
2088,542,583
2089,542,783
2090,542,659
2091,542,788
2092,542,816
2093,542,686
2094,542,1033
2095,542,504
2096,542,549
2097,542,1070
2098,542,1158
2099,542,495
2100,543,418
2101,545,713
2102,546,823
2103,546,1041
2104,546,1380
2105,546,538
2106,546,544
2107,548,567
2108,537,939
2109,552,765
2110,552,986
2111,552,1231
2112,549,969
2113,557,708
2114,557,605
2115,557,969
2116,557,583
2117,557,926
2118,557,1231
2119,560,638
2120,560,1072
2121,560,598
2122,560,1402
2123,540,538
2124,540,571
2125,540,495
2126,540,616
2127,540,739
2128,540,831
2129,525,1246
2130,555,562
2131,555,463
2132,555,607
2133,555,514
2134,555,641
2135,555,992
2136,555,964
2137,555,1047
2138,555,802
2139,555,856
2140,555,1236
2141,555,1281
2142,562,638
2143,562,762
2144,538,567
2145,538,586
2146,538,42
2147,563,239
2148,561,956
2149,561,448
2150,561,1177
2151,363,713
2152,189,712
2153,189,579
2154,189,862
2155,189,1068
2156,189,1339
2157,571,638
2158,551,319
2159,551,592
2160,551,673
2161,551,676
2162,551,1190
2163,319,338
2164,573,42
2165,573,928
2166,573,1292
2167,567,595
2168,567,598
2169,567,47
2170,567,544
2171,583,739
2172,583,754
2173,495,498
2174,495,871
2175,495,1000
2176,495,884
2177,495,1049
2178,495,815
2179,495,1113
2180,495,1185
2181,495,1367
2182,498,598
2183,498,823
2184,498,686
2185,498,985
2186,498,831
2187,498,869
2188,498,449
2189,498,1158
2190,498,881
2191,498,639
2192,498,626
2193,498,1293
2194,498,638
2195,498,864
2196,498,1402
2197,498,1215
2198,588,727
2199,588,1019
2200,590,681
2201,590,626
2202,590,835
2203,590,840
2204,590,964
2205,590,346
2206,590,439
2207,590,595
2208,590,753
2209,590,596
2210,590,638
2211,590,760
2212,590,893
2213,586,673
2214,586,616
2215,586,774
2216,586,598
2217,586,804
2218,586,244
2219,586,687
2220,586,768
2221,586,952
2222,586,654
2223,586,783
2224,586,394
2225,586,1178
2226,586,1316
2227,586,118
2228,586,639
2229,593,768
2230,272,605
2231,272,617
2232,272,377
2233,272,654
2234,298,687
2235,306,679
2236,306,1120
2237,306,616
2238,306,871
2239,594,468
2240,594,882
2241,594,1171
2242,594,1038
2243,569,606
2244,569,949
2245,569,448
2246,569,944
2247,569,250
2248,569,1181
2249,463,687
2250,463,339
2251,463,469
2252,463,770
2253,598,652
2254,598,644
2255,598,834
2256,598,250
2257,598,687
2258,598,1070
2259,598,1303
2260,598,878
2261,598,1033
2262,598,1379
2263,598,603
2264,598,1093
2265,598,1403
2266,598,1006
2267,596,619
2268,596,644
2269,596,989
2270,596,1004
2271,596,605
2272,596,1153
2273,596,782
2274,596,704
2275,596,1179
2276,599,534
2277,599,250
2278,599,770
2279,599,998
2280,599,1381
2281,514,626
2282,514,649
2283,514,648
2284,514,617
2285,514,853
2286,514,439
2287,149,679
2288,149,823
2289,404,787
2290,404,679
2291,601,448
2292,603,638
2293,603,628
2294,603,814
2295,592,622
2296,605,341
2297,605,734
2298,605,704
2299,605,29
2300,605,681
2301,605,770
2302,605,881
2303,605,830
2304,605,462
2305,605,700
2306,605,1290
2307,607,609
2308,607,625
2309,607,728
2310,607,1113
2311,609,449
2312,609,840
2313,609,836
2314,609,783
2315,609,1026
2316,609,713
2317,609,815
2318,609,638
2319,609,80
2320,609,1097
2321,462,638
2322,462,617
2323,462,675
2324,462,1034
2325,462,339
2326,462,1281
2327,462,1255
2328,462,913
2329,621,772
2330,621,719
2331,621,470
2332,621,834
2333,621,686
2334,621,958
2335,625,631
2336,625,534
2337,625,662
2338,626,655
2339,626,632
2340,626,649
2341,626,644
2342,626,758
2343,626,762
2344,626,795
2345,626,770
2346,626,700
2347,626,681
2348,626,834
2349,626,1189
2350,626,810
2351,626,1281
2352,627,648
2353,627,762
2354,627,779
2355,468,914
2356,639,632
2357,639,401
2358,639,687
2359,639,740
2360,639,980
2361,591,711
2362,638,643
2363,638,651
2364,638,520
2365,638,110
2366,638,385
2367,638,726
2368,638,646
2369,638,341
2370,638,744
2371,638,697
2372,638,87
2373,638,758
2374,638,719
2375,638,753
2376,638,830
2377,638,991
2378,638,346
2379,638,1080
2380,638,881
2381,638,950
2382,638,984
2383,638,980
2384,638,1186
2385,638,1189
2386,638,511
2387,638,706
2388,638,1300
2389,638,725
2390,638,1285
2391,638,1236
2392,638,1406
2393,642,758
2394,642,774
2395,642,781
2396,642,652
2397,642,784
2398,642,766
2399,642,547
2400,642,753
2401,642,1338
2402,646,651
2403,646,753
2404,646,758
2405,646,942
2406,617,677
2407,617,112
2408,617,640
2409,617,728
2410,617,644
2411,617,704
2412,617,681
2413,617,805
2414,617,734
2415,617,770
2416,617,26
2417,617,966
2418,219,1127
2419,574,652
2420,574,1042
2421,643,1283
2422,652,654
2423,652,756
2424,652,831
2425,652,986
2426,652,761
2427,652,822
2428,652,753
2429,652,954
2430,667,658
2431,667,840
2432,667,1435
2433,658,351
2434,658,163
2435,658,884
2436,655,640
2437,640,783
2438,640,712
2439,640,701
2440,640,687
2441,640,1118
2442,640,1103
2443,640,1253
2444,640,576
2445,619,986
2446,619,654
2447,654,738
2448,654,762
2449,654,700
2450,654,733
2451,654,632
2452,654,87
2453,654,1045
2454,654,810
2455,654,42
2456,654,644
2457,654,1248
2458,654,1173
2459,654,142
2460,654,1283
2461,673,620
2462,673,1113
2463,660,659
2464,660,725
2465,439,795
2466,683,1189
2467,683,758
2468,697,698
2469,697,741
2470,697,966
2471,697,927
2472,697,1034
2473,697,779
2474,697,915
2475,697,719
2476,697,782
2477,697,923
2478,698,990
2479,339,713
2480,339,245
2481,339,1402
2482,339,1236
2483,701,771
2484,701,858
2485,701,1006
2486,701,915
2487,701,1036
2488,701,1034
2489,701,233
2490,589,327
2491,704,788
2492,704,713
2493,704,1092
2494,704,958
2495,704,1131
2496,704,1209
2497,704,1214
2498,704,1231
2499,704,1295
2500,704,1306
2501,704,1302
2502,704,1400
2503,704,1297
2504,704,1423
2505,704,1395
2506,704,1403
2507,644,711
2508,644,154
2509,644,708
2510,644,1253
2511,644,1279
2512,644,719
2513,644,1283
2514,644,1295
2515,644,1184
2516,686,924
2517,686,1000
2518,686,341
2519,686,950
2520,687,616
2521,687,950
2522,687,1056
2523,687,1032
2524,616,794
2525,616,800
2526,616,118
2527,678,570
2528,678,1302
2529,570,1065
2530,394,576
2531,394,42
2532,394,1190
2533,394,1236
2534,520,1168
2535,713,712
2536,713,716
2537,713,717
2538,713,718
2539,713,706
2540,713,738
2541,713,727
2542,713,842
2543,713,1043
2544,713,950
2545,713,1042
2546,713,725
2547,713,998
2548,713,1158
2549,713,1036
2550,713,1059
2551,713,994
2552,713,999
2553,713,1263
2554,713,762
2555,713,666
2556,712,728
2557,712,834
2558,712,492
2559,712,250
2560,712,1042
2561,711,547
2562,711,341
2563,711,1034
2564,711,1339
2565,711,1184
2566,711,1018
2567,720,679
2568,183,916
2569,183,769
2570,726,1236
2571,728,788
2572,728,758
2573,731,824
2574,679,787
2575,679,714
2576,679,504
2577,679,859
2578,679,841
2579,679,792
2580,679,949
2581,679,962
2582,679,346
2583,679,42
2584,679,1178
2585,679,1281
2586,679,1310
2587,679,146
2588,725,547
2589,725,928
2590,725,840
2591,725,1132
2592,725,1217
2593,725,1260
2594,725,1280
2595,725,835
2596,725,986
2597,725,1434
2598,735,790
2599,738,1283
2600,739,755
2601,739,1136
2602,706,1256
2603,706,800
2604,706,740
2605,752,278
2606,752,835
2607,752,1142
2608,752,821
2609,282,1071
2610,753,758
2611,753,984
2612,753,250
2613,753,834
2614,753,719
2615,753,1283
2616,753,1373
2617,758,741
2618,758,681
2619,681,788
2620,681,859
2621,681,986
2622,681,988
2623,681,1118
2624,681,1402
2625,415,244
2626,415,997
2627,415,840
2628,415,377
2629,415,1127
2630,415,1350
2631,244,808
2632,768,924
2633,768,801
2634,768,1189
2635,741,928
2636,776,401
2637,774,492
2638,774,824
2639,762,142
2640,492,817
2641,492,835
2642,142,997
2643,142,257
2644,781,721
2645,781,1038
2646,781,1253
2647,781,1281
2648,770,798
2649,770,708
2650,770,928
2651,770,840
2652,770,841
2653,770,1255
2654,770,1260
2655,770,1217
2656,770,938
2657,770,1291
2658,770,315
2659,770,1384
2660,770,1402
2661,770,1021
2662,785,786
2663,785,793
2664,783,843
2665,783,871
2666,783,933
2667,783,998
2668,783,1004
2669,783,1064
2670,783,939
2671,783,1032
2672,783,1381
2673,783,1213
2674,154,547
2675,787,851
2676,771,504
2677,771,473
2678,771,988
2679,278,370
2680,278,1248
2681,755,377
2682,250,1097
2683,250,954
2684,784,327
2685,364,815
2686,364,830
2687,364,939
2688,733,859
2689,733,1231
2690,733,1255
2691,733,1426
2692,733,1302
2693,733,544
2694,733,840
2695,794,42
2696,721,923
2697,721,777
2698,615,765
2699,615,1213
2700,615,1185
2701,615,1026
2702,615,1072
2703,615,840
2704,615,1236
2705,615,823
2706,615,1190
2707,547,1169
2708,547,1246
2709,547,1260
2710,766,800
2711,799,42
2712,799,994
2713,802,1310
2714,801,42
2715,341,950
2716,341,1072
2717,341,1132
2718,341,1136
2719,341,1093
2720,341,1255
2721,341,1437
2722,341,1338
2723,805,821
2724,805,807
2725,795,1025
2726,795,1384
2727,327,765
2728,714,840
2729,714,815
2730,714,284
2731,714,1189
2732,714,1236
2733,714,1284
2734,714,1255
2735,714,1376
2736,815,939
2737,815,1066
2738,815,1113
2739,815,950
2740,814,47
2741,814,925
2742,814,1281
2743,448,967
2744,448,835
2745,448,817
2746,448,986
2747,448,971
2748,448,831
2749,793,1383
2750,777,798
2751,777,840
2752,777,992
2753,777,908
2754,798,878
2755,734,1023
2756,734,871
2757,823,29
2758,823,950
2759,823,915
2760,823,1033
2761,823,1113
2762,823,1222
2763,823,1185
2764,823,1268
2765,700,749
2766,29,1248
2767,29,1302
2768,765,830
2769,765,871
2770,765,933
2771,765,1033
2772,830,877
2773,830,924
2774,830,913
2775,830,809
2776,830,1072
2777,830,840
2778,830,1340
2779,87,1260
2780,719,708
2781,719,838
2782,719,1184
2783,719,1236
2784,719,1251
2785,719,1260
2786,719,1246
2787,719,1036
2788,708,810
2789,708,1052
2790,835,1189
2791,835,1283
2792,835,261
2793,757,876
2794,641,1127
2795,843,885
2796,843,871
2797,843,1235
2798,845,808
2799,26,1176
2800,26,1281
2801,26,1033
2802,847,471
2803,859,1168
2804,859,1403
2805,859,1373
2806,862,834
2807,831,871
2808,831,980
2809,831,1004
2810,831,939
2811,831,1049
2812,831,1281
2813,826,925
2814,403,769
2815,881,1218
2816,338,1302
2817,420,1000
2818,901,915
2819,834,874
2820,834,1074
2821,834,1068
2822,834,1118
2823,834,1196
2824,834,1246
2825,834,1280
2826,834,986
2827,834,1365
2828,707,1031
2829,809,884
2830,913,950
2831,913,940
2832,884,928
2833,884,1050
2834,800,1281
2835,800,1072
2836,800,1384
2837,841,792
2838,346,1284
2839,838,853
2840,853,1034
2841,792,903
2842,792,846
2843,792,1297
2844,792,1036
2845,903,933
2846,928,965
2847,928,1113
2848,928,42
2849,934,1026
2850,824,1236
2851,824,1284
2852,938,1034
2853,944,1236
2854,42,961
2855,42,995
2856,42,1229
2857,42,1183
2858,42,1266
2859,42,600
2860,42,1050
2861,42,1224
2862,42,1307
2863,42,1308
2864,42,1294
2865,42,1284
2866,42,1325
2867,42,1340
2868,42,1097
2869,42,1334
2870,42,1346
2871,42,257
2872,42,1178
2873,42,1402
2874,840,950
2875,840,871
2876,840,933
2877,840,1031
2878,840,1032
2879,840,1043
2880,840,1066
2881,840,1167
2882,840,1241
2883,933,1214
2884,933,1113
2885,950,1281
2886,950,1283
2887,950,1346
2888,950,1402
2889,966,418
2890,871,1237
2891,871,1302
2892,871,969
2893,871,1142
2894,871,1350
2895,871,981
2896,871,1138
2897,871,1384
2898,871,1376
2899,871,1313
2900,974,971
2901,974,978
2902,974,778
2903,980,544
2904,975,939
2905,975,1089
2906,975,1283
2907,817,1248
2908,986,991
2909,986,418
2910,939,1050
2911,939,855
2912,939,1021
2913,990,1113
2914,990,1142
2915,993,994
2916,994,1375
2917,994,1402
2918,997,1042
2919,997,1425
2920,926,992
2921,962,1204
2922,978,979
2923,1004,1008
2924,1004,1032
2925,1004,1056
2926,869,1205
2927,992,373
2928,418,1402
2929,1018,1227
2930,1018,1281
2931,1018,1402
2932,1003,1000
2933,1003,1199
2934,1000,1040
2935,1000,1034
2936,1000,118
2937,779,600
2938,779,1181
2939,1034,1118
2940,1034,1189
2941,1034,1283
2942,1033,1072
2943,1033,1188
2944,1033,1211
2945,1033,1292
2946,1033,1377
2947,1033,1355
2948,1033,1281
2949,1033,1137
2950,1033,1402
2951,1032,1213
2952,1037,900
2953,118,943
2954,118,1379
2955,1042,1260
2956,1042,1281
2957,377,1060
2958,377,856
2959,1039,1036
2960,1056,1186
2961,1072,1105
2962,927,600
2963,927,1281
2964,1019,1185
2965,810,1351
2966,575,576
2967,1093,1132
2968,1103,1118
2969,1105,963
2970,1097,1283
2971,984,1236
2972,1100,674
2973,822,1236
2974,822,819
2975,822,1339
2976,1069,878
2977,878,1255
2978,878,1355
2979,1023,1117
2980,1023,1402
2981,1117,1227
2982,1117,856
2983,1117,1335
2984,1118,1052
2985,1118,1236
2986,1118,749
2987,1113,1255
2988,1113,1214
2989,1113,1283
2990,1113,1131
2991,1113,576
2992,544,1273
2993,544,1236
2994,1087,1131
2995,1087,1283
2996,1132,1136
2997,1052,1184
2998,1158,1136
2999,1158,152
3000,1127,1137
3001,1127,322
3002,1127,1291
3003,1127,1189
3004,1127,1083
3005,1127,1383
3006,1136,1283
3007,856,122
3008,856,1176
3009,1178,257
3010,1180,852
3011,1181,1083
3012,1181,1189
3013,1181,1184
3014,80,1189
3015,1189,1217
3016,1189,899
3017,1189,1370
3018,1189,1244
3019,1110,1146
3020,1110,1434
3021,1167,1283
3022,1167,1424
3023,1183,1225
3024,1183,1230
3025,1183,1354
3026,1190,1352
3027,1126,285
3028,576,1339
3029,1213,1281
3030,1153,152
3031,1153,1236
3032,1185,1226
3033,1185,1350
3034,1089,1365
3035,1227,1237
3036,1237,1236
3037,1234,1254
3038,1234,1339
3039,1236,1214
3040,1236,1224
3041,1236,1372
3042,1236,1340
3043,1236,1379
3044,1236,1274
3045,1236,1302
3046,1236,1287
3047,1236,912
3048,963,1246
3049,1214,1239
3050,1248,1281
3051,1231,1339
3052,1231,1281
3053,1255,1332
3054,1255,1349
3055,1255,1339
3056,1255,1403
3057,1260,1272
3058,1246,1281
3059,1246,1386
3060,245,1264
3061,245,1146
3062,1244,1280
3063,1280,1326
3064,1280,1281
3065,1280,1339
3066,1281,1173
3067,1281,1283
3068,1281,1272
3069,1281,1005
3070,1281,732
3071,1281,1349
3072,1281,1274
3073,1281,354
3074,1253,1287
3075,1285,912
3076,1284,585
3077,1292,1423
3078,1295,1283
3079,1297,1301
3080,1306,1373
3081,1271,1329
3082,1268,1313
3083,1313,1312
3084,1312,1091
3085,1326,1325
3086,1326,983
3087,1325,1283
3088,1325,1340
3089,1325,983
3090,1272,1402
3091,285,1328
3092,1328,1421
3093,1283,1350
3094,1283,1383
3095,1283,1138
3096,1283,1402
3097,1339,1286
3098,1339,1344
3099,1339,1402
3100,1350,1373
3101,740,1375
3102,1359,1342
3103,1359,1335
3104,1359,1399
3105,1342,1335
3106,1349,366
3107,516,94
3108,983,1441
3109,1358,1381
3110,1379,1138
3111,1379,1402
3112,1138,1381
3113,1138,1383
3114,1138,1367
3115,1381,1383
3116,1402,1319
3117,1317,1417
3118,1113,128
3119,1113,495
3120,1113,823
3121,1113,990
3122,1113,135
3123,1113,437
3124,1113,815
3125,1113,1395
3126,1113,969
3127,128,236
3128,128,1101
3129,128,32
3130,128,1153
3131,128,797
3132,128,548
3133,128,779
3134,161,679
3135,679,792
3136,679,1176
3137,679,67
3138,679,1281
3139,733,1402
3140,733,1142
3141,733,1423
3142,733,626
3143,1402,644
3144,1402,224
3145,1402,105
3146,1402,993
3147,1313,1406
3148,1313,507
3149,1313,871
3150,1313,569
3151,1313,67
3152,1313,12
3153,1313,42
3154,1313,9
3155,1313,1403
3156,1313,1285
3157,1313,1312
3158,1313,1034
3159,1313,19
3160,1313,1332
3161,1406,821
3162,1406,771
3163,1406,1421
3164,1406,173
3165,1406,1185
3166,1406,809
3167,1406,495
3168,1406,260
3169,1338,341
3170,1338,681
3171,1338,252
3172,1338,12
3173,1338,557
3174,341,1423
3175,341,443
3176,1184,479
3177,1184,644
3178,1184,605
3179,1184,442
3180,479,683
3181,644,711
3182,644,773
3183,644,312
3184,644,626
3185,644,8
3186,1142,797
3187,1142,1268
3188,1142,1185
3189,1142,1415
3190,1142,249
3191,711,257
3192,711,547
3193,711,642
3194,681,1042
3195,681,52
3196,681,758
3197,681,1118
3198,681,402
3199,681,109
3200,1036,1325
3201,1036,557
3202,1036,792
3203,1340,454
3204,1340,840
3205,454,778
3206,285,843
3207,843,372
3208,843,1424
3209,843,1237
3210,843,557
3211,843,871
3212,843,249
3213,843,193
3214,843,342
3215,843,847
3216,605,317
3217,605,431
3218,605,734
3219,821,483
3220,821,583
3221,714,204
3222,714,495
3223,714,639
3224,204,611
3225,204,542
3226,495,1367
3227,495,67
3228,495,1043
3229,495,950
3230,495,1332
3231,495,127
3232,495,249
3233,980,639
3234,639,878
3235,639,994
3236,639,160
3237,639,749
3238,639,105
3239,194,503
3240,194,1127
3241,194,794
3242,194,465
3243,503,352
3244,503,1316
3245,749,475
3246,749,317
3247,749,173
3248,749,474
3249,475,400
3250,475,598
3251,475,704
3252,475,249
3253,475,176
3254,317,538
3255,317,1281
3256,538,224
3257,1189,835
3258,1189,546
3259,1189,626
3260,1189,473
3261,1189,346
3262,1189,305
3263,1189,523
3264,1189,864
3265,1189,595
3266,1189,878
3267,1189,975
3268,1189,543
3269,1189,429
3270,1189,1068
3271,835,261
3272,792,1006
3273,792,32
3274,792,1274
3275,792,557
3276,792,1190
3277,1,42
3278,1,477
3279,1,3
3280,1,312
3281,1,135
3282,1,652
3283,1,132
3284,1,44
3285,1,211
3286,1,36
3287,1,146
3288,42,135
3289,42,323
3290,42,1183
3291,42,72
3292,42,950
3293,42,852
3294,42,374
3295,42,257
3296,42,1255
3297,42,1329
3298,42,344
3299,42,144
3300,477,482
3301,252,389
3302,252,766
3303,252,1362
3304,252,277
3305,878,1050
3306,878,713
3307,878,1362
3308,878,372
3309,878,1072
3310,878,1255
3311,794,1381
3312,1381,277
3313,372,569
3314,372,536
3315,372,482
3316,372,3
3317,800,1072
3318,800,3
3319,1072,809
3320,1072,370
3321,1072,1158
3322,1335,1006
3323,1335,3
3324,1006,841
3325,1006,919
3326,841,90
3327,1295,392
3328,1295,431
3329,392,321
3330,569,249
3331,569,3
3332,1101,713
3333,1101,595
3334,603,598
3335,598,342
3336,598,1093
3337,598,649
3338,598,542
3339,598,546
3340,598,1070
3341,546,713
3342,306,305
3343,306,513
3344,306,871
3345,306,272
3346,338,1302
3347,919,303
3348,919,103
3349,781,1403
3350,781,1279
3351,781,1042
3352,781,1136
3353,1403,1272
3354,1403,859
3355,1403,1280
3356,1403,673
3357,1403,357
3358,1403,67
3359,1403,95
3360,12,282
3361,12,1118
3362,12,343
3363,12,32
3364,12,1297
3365,12,9
3366,12,1312
3367,12,144
3368,12,143
3369,12,27
3370,12,398
3371,793,783
3372,783,1032
3373,783,242
3374,9,282
3375,9,788
3376,9,32
3377,9,617
3378,9,1308
3379,9,1265
3380,9,1346
3381,9,8
3382,9,1118
3383,9,1190
3384,1033,1281
3385,1033,463
3386,1281,683
3387,1281,725
3388,1281,281
3389,1281,3
3390,1281,140
3391,536,532
3392,536,778
3393,536,993
3394,536,933
3395,536,492
3396,532,765
3397,615,823
3398,615,1026
3399,615,1042
3400,615,105
3401,32,3
3402,32,1021
3403,32,8
3404,32,249
3405,32,525
3406,32,443
3407,32,1042
3408,32,1238
3409,32,105
3410,32,1127
3411,32,673
3412,871,1417
3413,871,988
3414,871,297
3415,952,1328
3416,952,191
3417,1328,765
3418,1328,239
3419,502,1438
3420,502,994
3421,502,933
3422,502,704
3423,1438,277
3424,1438,389
3425,332,908
3426,809,1354
3427,809,342
3428,809,1379
3429,809,847
3430,809,1240
3431,809,127
3432,809,198
3433,809,1167
3434,342,626
3435,342,797
3436,342,638
3437,342,1362
3438,342,389
3439,342,1039
3440,342,561
3441,105,337
3442,105,367
3443,105,576
3444,105,398
3445,105,626
3446,105,621
3447,105,52
3448,105,44
3449,105,1168
3450,105,557
3451,105,474
3452,105,713
3453,105,72
3454,105,995
3455,105,1132
3456,105,561
3457,105,697
3458,105,415
3459,105,456
3460,337,263
3461,337,398
3462,224,654
3463,224,447
3464,224,175
3465,224,621
3466,1365,1089
3467,1365,810
3468,704,712
3469,704,958
3470,704,288
3471,704,297
3472,704,63
3473,704,822
3474,704,1231
3475,704,734
3476,704,617
3477,704,447
3478,367,1346
3479,706,523
3480,706,1236
3481,706,740
3482,523,176
3483,523,609
3484,523,84
3485,523,629
3486,523,899
3487,523,920
3488,523,111
3489,523,418
3490,523,708
3491,523,1032
3492,249,547
3493,249,402
3494,249,44
3495,249,1312
3496,249,1304
3497,249,474
3498,249,447
3499,249,1238
3500,249,1060
3501,249,63
3502,249,1244
3503,249,1136
3504,249,1395
3505,249,592
3506,249,525
3507,249,393
3508,249,212
3509,249,561
3510,249,708
3511,249,1344
3512,249,1231
3513,249,1280
3514,249,394
3515,249,518
3516,249,3
3517,547,1434
3518,547,1246
3519,547,527
3520,547,525
3521,547,1280
3522,547,1127
3523,1280,725
3524,1280,497
3525,1280,48
3526,1280,1287
3527,1280,768
3528,1280,400
3529,635,1052
3530,1434,1379
3531,1434,174
3532,1434,732
3533,1434,1312
3534,1434,85
3535,1434,193
3536,1434,81
3537,626,95
3538,101,482
3539,101,198
3540,101,176
3541,101,899
3542,101,193
3543,36,3
3544,36,211
3545,36,1127
3546,36,642
3547,135,3
3548,135,257
3549,431,1215
3550,431,544
3551,431,617
3552,431,1346
3553,431,396
3554,431,561
3555,431,969
3556,431,358
3557,431,1190
3558,431,1312
3559,431,483
3560,431,773
3561,431,429
3562,431,983
3563,1181,296
3564,1181,131
3565,1181,620
3566,296,1346
3567,323,298
3568,323,950
3569,323,68
3570,358,847
3571,358,991
3572,847,600
3573,847,969
3574,847,1021
3575,847,1132
3576,277,497
3577,277,103
3578,277,283
3579,823,498
3580,823,482
3581,823,1032
3582,823,549
3583,19,220
3584,19,353
3585,19,1246
3586,220,1042
3587,220,234
3588,398,405
3589,398,465
3590,398,447
3591,398,27
3592,398,90
3593,398,1291
3594,498,708
3595,498,3
3596,199,1060
3597,199,1375
3598,199,1346
3599,481,838
3600,797,974
3601,797,544
3602,482,389
3603,482,41
3604,482,463
3605,517,709
3606,517,778
3607,1060,191
3608,1060,1117
3609,191,1021
3610,191,595
3611,191,429
3612,473,1217
3613,697,542
3614,697,642
3615,697,95
3616,697,67
3617,1375,357
3618,52,1235
3619,52,762
3620,52,67
3621,52,1283
3622,52,509
3623,52,966
3624,52,1285
3625,1183,376
3626,621,470
3627,621,768
3628,621,593
3629,72,3
3630,72,430
3631,50,1190
3632,357,1253
3633,357,986
3634,357,1304
3635,357,617
3636,357,1359
3637,357,143
3638,357,592
3639,357,1426
3640,357,708
3641,1253,768
3642,1253,674
3643,389,573
3644,389,830
3645,389,640
3646,389,950
3647,389,494
3648,1138,966
3649,966,852
3650,257,298
3651,60,308
3652,483,189
3653,573,297
3654,573,298
3655,314,103
3656,314,333
3657,103,893
3658,103,1362
3659,103,114
3660,103,44
3661,103,658
3662,103,1238
3663,103,462
3664,103,1231
3665,353,504
3666,353,298
3667,353,950
3668,504,1167
3669,1118,95
3670,1118,308
3671,1021,1285
3672,1246,95
3673,1042,67
3674,1211,254
3675,1211,84
3676,254,1190
3677,762,514
3678,831,325
3679,325,549
3680,1050,127
3681,1050,1049
3682,990,864
3683,1167,713
3684,1167,429
3685,1167,97
3686,544,1285
3687,41,1185
3688,41,176
3689,41,3
3690,152,993
3691,810,233
3692,810,175
3693,840,1105
3694,840,509
3695,840,172
3696,463,469
3697,67,1255
3698,67,822
3699,67,1426
3700,67,318
3701,67,394
3702,67,180
3703,1089,882
3704,27,1425
3705,27,620
3706,27,234
3707,27,1158
3708,27,1285
3709,27,652
3710,27,430
3711,27,1332
3712,27,995
3713,1425,1132
3714,765,425
3715,638,271
3716,654,1173
3717,447,124
3718,447,95
3719,609,80
3720,373,311
3721,176,3
3722,1244,131
3723,131,1255
3724,250,713
3725,250,1255
3726,6,753
3727,1190,1349
3728,1190,393
3729,1190,1111
3730,1190,394
3731,1190,1285
3732,245,1283
3733,1283,1344
3734,1283,713
3735,400,822
3736,400,601
3737,400,474
3738,822,700
3739,1344,1312
3740,322,1056
3741,1018,755
3742,1395,509
3743,1395,1332
3744,1339,132
3745,1339,474
3746,1168,520
3747,1168,735
3748,142,1415
3749,142,144
3750,142,1127
3751,509,316
3752,509,1026
3753,509,1255
3754,3,687
3755,3,1285
3756,3,234
3757,3,1373
3758,3,790
3759,3,846
3760,3,645
3761,3,173
3762,3,180
3763,3,44
3764,3,83
3765,3,26
3766,311,770
3767,617,73
3768,617,272
3769,617,734
3770,617,1332
3771,393,738
3772,393,394
3773,393,1111
3774,393,1285
3775,393,193
3776,394,193
3777,132,162
3778,557,1260
3779,557,63
3780,557,1346
3781,557,708
3782,557,525
3783,557,302
3784,557,140
3785,557,561
3786,1349,366
3787,1237,1236
3788,1217,242
3789,1217,768
3790,1217,1285
3791,713,666
3792,713,87
3793,713,462
3794,713,1441
3795,713,884
3796,713,842
3797,713,716
3798,713,912
3799,713,1326
3800,713,339
3801,713,1185
3802,713,1373
3803,713,104
3804,713,1059
3805,462,1255
3806,1185,1329
3807,1185,1312
3808,852,276
3809,1260,321
3810,1260,1127
3811,90,967
3812,1132,1285
3813,1132,456
3814,1255,1158
3815,1255,1231
3816,1255,234
3817,1255,124
3818,1255,1342
3819,594,752
3820,1158,1423
3821,405,1127
3822,912,375
3823,1417,752
3824,8,1238
3825,8,430
3826,8,1285
3827,1383,1127
3828,1127,1350
3829,1127,818
3830,1127,1227
3831,708,281
3832,708,234
3833,145,586
3834,1178,1332
3835,114,770
3836,307,189
3837,189,44
3838,124,449
3839,1323,938
3840,193,233
3841,193,63
3842,193,967
3843,193,144
3844,193,118
3845,233,155
3846,233,1136
3847,233,127
3848,429,494
3849,1332,537
3850,1332,1342
3851,768,886
3852,768,1304
3853,768,686
3854,768,593
3855,48,1346
3856,1346,1314
3857,1346,308
3858,1346,518
3859,63,494
3860,29,85
3861,53,413
3862,1312,281
3863,1312,308
3864,1312,234
3865,1312,127
3866,1231,1254
3867,1231,984
3868,44,525
3869,44,95
3870,1342,942
3871,967,549
3872,967,303
3873,967,620
3874,620,874
3875,278,1039
3876,95,299
3877,95,525
3878,95,592
3879,95,561
3880,95,719
3881,95,175
3882,286,202
3883,525,214
3884,525,652
3885,525,211
3886,525,469
3887,801,313
3888,1059,548
3889,175,430
3890,409,563
3891,561,727
3892,561,1310
3893,143,201
3894,1136,1052
3895,415,997
3896,415,673
3897,211,673
3898,468,537
3899,777,537
3900,1254,1234
3901,172,969
3902,440,1384
3903,84,901
3904,799,302
3905,652,1317
3906,652,1372
3907,652,585
3908,969,739
3909,430,69
3910,430,260
3911,492,61
