time,value
0,-0.57402
1,0.57865
2,0.75773
3,0.43981000000000003
4,-0.12114000000000001
5,0.14498
6,0.19955
7,0.4102
8,-0.023274
9,0.036451
10,-0.076766
11,0.18007
12,0.51454
13,-0.32500999999999997
14,0.16263
15,-0.26315
16,-0.1756
17,0.10583
18,0.17082
19,-0.22576
20,-0.35175
21,-0.09849400000000001
22,0.33196
23,0.4855
24,-0.056911
25,-0.62507
26,-0.13209
27,0.13681
28,0.13658
29,-0.19618
30,-0.15162
31,-0.08088200000000001
32,0.2866
33,0.14749
34,0.13452
35,-0.11705
36,-0.13179000000000002
37,0.31153000000000003
38,0.075395
39,-0.029661
40,0.32037
41,1.5128
42,1.5128
43,1.5128
44,1.5128
45,1.5128
46,1.5128
47,1.5128
48,1.5128
49,1.5128
50,1.5128
51,1.5128
52,1.5128
53,1.5128
54,1.5128
55,-1.5604
56,-1.5604
57,-1.5604
58,-1.5604
59,-1.5604
60,-1.5604
61,-1.5604
62,-1.5604
63,-1.5604
64,-1.5604
65,-1.5604
66,-1.5604
67,-1.5604
68,-0.29529
69,-0.47526999999999997
70,-0.34941
71,0.71734
72,-0.063848
73,0.24736
74,-0.2063
75,-0.0014479
76,-0.12864
77,0.028293000000000002
78,-0.2175
79,-0.29808
80,-0.1884
81,-0.26321
82,-0.20733000000000001
83,-0.1572
84,0.46868000000000004
85,-0.099536
86,-0.0052063000000000005
87,0.12097999999999999
88,-0.22984000000000002
89,0.12785
90,-0.10236
91,-0.21144000000000002
92,0.049236
93,0.37798000000000004
94,0.2976
95,-0.4445
96,0.024846
97,-0.17143
98,-0.42249
99,0.31911
100,-0.14665
101,1.5128
102,1.5128
103,1.5128
104,1.5128
105,1.5128
106,1.5128
107,1.5128
108,1.5128
109,1.5128
110,1.5128
111,1.5128
112,1.5128
113,-1.5604
114,-1.5604
115,-1.5604
116,-1.5604
117,-1.5604
118,-1.5604
119,-1.5604
120,-1.5604
121,-1.5604
122,-1.5604
123,-1.5604
124,-1.5604
125,-0.66092
126,0.019641
127,-0.087095
