time,value
0,-1.2927
1,-1.2927
2,-1.2927
3,-1.2927
4,-1.2927
5,-1.2927
6,-1.2927
7,-1.2927
8,-1.2927
9,-1.2927
10,-1.2927
11,-1.2927
12,-1.2927
13,-1.2927
14,-1.2927
15,-1.2927
16,-1.2927
17,-1.2927
18,-1.2927
19,-1.2927
20,-1.2927
21,-1.2927
22,-1.2927
23,-1.2927
24,-1.2927
25,-1.2927
26,-1.2927
27,-1.2927
28,-1.2927
29,-1.2927
30,-1.2927
31,-1.2927
32,-1.2927
33,-1.2927
34,-1.2927
35,-1.2927
36,-1.2927
37,-1.2927
38,-1.2927
39,-1.2927
40,-1.2927
41,-1.2927
42,-1.2927
43,-1.2927
44,-1.2927
45,-1.2927
46,-1.2927
47,-1.2927
48,-1.2927
49,-1.2927
50,-1.2927
51,-1.2927
52,-1.2927
53,-1.2927
54,-1.2927
55,-1.2927
56,-1.2927
57,-1.28
58,-1.2571
59,-1.2298
60,-1.2026
61,-1.1761
62,-1.1609
63,-1.1472
64,-1.1336
65,-1.12
66,-1.1063
67,-1.0927
68,-1.079
69,-1.0654
70,-1.0518
71,-1.0381
72,-1.0245
73,-1.0109
74,-0.9989299999999999
75,-0.99534
76,-0.99534
77,-0.99534
78,-0.99467
79,-0.98785
80,-0.9748899999999999
81,-0.96125
82,-0.94762
83,-0.9339799999999999
84,-0.92035
85,-0.90671
86,-0.8930799999999999
87,-0.87944
88,-0.8658100000000001
89,-0.8521700000000001
90,-0.83854
91,-0.8249
92,-0.81855
93,-0.81695
94,-0.81695
95,-0.81695
96,-0.8153699999999999
97,-0.8024899999999999
98,-0.78892
99,-0.77528
100,-0.76165
101,-0.7480100000000001
102,-0.73438
103,-0.7207399999999999
104,-0.7071
105,-0.70013
106,-0.69801
107,-0.69801
108,-0.69796
109,-0.69758
110,-0.68476
111,-0.6711199999999999
112,-0.65749
113,-0.64567
114,-0.63855
115,-0.63855
116,-0.63855
117,-0.63855
118,-0.63293
119,-0.6215
120,-0.60787
121,-0.59423
122,-0.5806
123,-0.56696
124,-0.55333
125,-0.53969
126,-0.5260600000000001
127,-0.51242
128,-0.49878
129,-0.48515
130,-0.47151000000000004
131,-0.45371000000000006
132,-0.42833000000000004
133,-0.40105999999999997
134,-0.37379
135,-0.34857
136,-0.33023
137,-0.3166
138,-0.30296
139,-0.28933000000000003
140,-0.2831
141,-0.28175
142,-0.28175
143,-0.28175
144,-0.28175
145,-0.28175
146,-0.28175
147,-0.28175
148,-0.27953
149,-0.27191
150,-0.25827
151,-0.24463000000000001
152,-0.231
153,-0.21736
154,-0.20373
155,-0.19009
156,-0.17645999999999998
157,-0.16282
158,-0.13555
159,-0.10828
160,-0.4035
161,-0.26714
162,-0.13079000000000002
163,0.039297000000000006
164,0.14192000000000002
165,0.27828
166,0.41463
167,0.10989000000000002
168,0.13716
169,0.16443
170,0.1917
171,0.21896999999999997
172,0.24624000000000001
173,0.27351
174,0.29944
175,0.32048000000000004
176,0.33412
177,0.34775
178,0.36139
179,0.37501999999999996
180,0.38866
181,0.40229000000000004
182,0.41593
183,0.42956000000000005
184,0.4432
185,0.45683999999999997
186,0.47047
187,0.48438000000000003
188,0.50521
189,0.53145
190,0.55872
191,0.58599
192,0.6103
193,0.62538
194,0.63902
195,0.65266
196,0.6662899999999999
197,0.67993
198,0.6935600000000001
199,0.7072
200,0.72083
201,0.73447
202,0.7481
203,0.76174
204,0.7753800000000001
205,0.78901
206,0.80265
207,0.81628
208,0.8299200000000001
209,0.84567
210,0.8662799999999999
211,0.89355
212,0.9208200000000001
213,0.94809
214,0.9690000000000001
215,0.9848299999999999
216,0.9984700000000001
217,1.0122
218,1.0266
219,1.0523
220,1.0795
221,1.1068
222,1.1325
223,1.1534
224,1.167
225,1.1807
226,1.1943
227,1.2079
228,1.2216
229,1.2352
230,1.2488
231,1.2625
232,1.2761
233,1.2897
234,1.3034
235,1.317
236,1.3306
237,1.3443
238,1.3579
239,1.3715
240,1.3816
241,1.3833
242,1.3833
243,1.3833
244,1.3833
245,1.3833
246,1.3833
247,1.3833
248,1.3833
249,1.3833
250,1.3833
251,1.3833
252,1.3833
253,1.3864
254,1.4122
255,1.4393
256,1.4666
257,1.4895
258,1.5022
259,1.5022
260,1.5022
261,1.5022
262,1.5022
263,1.5022
264,1.5022
265,1.5021
266,1.5014
267,1.4757
268,1.4484
269,1.4212
270,1.3957
271,1.375
272,1.3613
273,1.3477
274,1.3341
275,1.3204
276,1.3068
277,1.2931
278,1.2795
279,1.2644
280,1.2401
281,1.2128
282,1.1856
283,1.1583
284,1.131
285,1.1038
286,1.0765
287,1.0492
288,1.0261
289,1.0106
290,0.99695
291,0.9833200000000001
292,0.96764
293,0.94506
294,0.91779
295,0.8905200000000001
296,0.86325
297,0.8433799999999999
298,0.8284
299,0.81477
300,0.80113
301,0.7875
302,0.77386
303,0.76022
304,0.74659
305,0.73073
306,0.7094699999999999
307,0.6822
308,0.65493
309,0.62766
310,0.61422
311,0.61023
312,0.61023
313,0.61023
314,0.61023
315,-1.4484
316,-1.4484
317,-1.4484
318,-1.4484
319,-1.4484
320,-1.4484
321,-1.4484
322,-1.4484
323,-1.4484
324,-1.4484
325,-1.4484
326,-1.4484
327,-1.4484
328,-1.4484
329,-1.4484
330,-1.4484
331,-1.4484
332,-1.4484
333,-1.4484
334,-1.4484
335,-1.4484
336,-1.4484
337,-1.4484
338,-1.4484
339,-1.4484
340,-1.4484
341,-1.4484
342,-1.4484
343,-1.4484
344,-1.4484
345,-1.4484
346,-1.4484
347,-1.4484
348,-1.4484
349,-1.4484
350,-1.4484
351,-1.4484
352,-1.4484
353,-1.4484
354,-1.4484
355,-1.4484
356,-1.4484
357,-1.4484
358,-1.4484
359,-1.4484
360,-1.4484
361,-1.4484
362,-1.4484
363,-1.4462
364,-1.4106
365,-1.3741
366,-1.3375
367,-1.3009
368,-1.2643
369,-1.2276
370,-1.1909999999999998
371,-1.1544
372,-1.1007
373,-1.0333
374,-0.9601
375,-0.8870100000000001
376,-0.8158
377,-0.77496
378,-0.73833
379,-0.7017100000000001
380,-0.66509
381,-0.62847
382,-0.59185
383,-0.5552199999999999
384,-0.5186
385,-0.4959
386,-0.49012
387,-0.49012
388,-0.49012
389,-0.48558
390,-0.45858000000000004
391,-0.42196000000000006
392,-0.38534
393,-0.35053
394,-0.33221999999999996
395,-0.3304
396,-0.3304
397,-0.3304
398,-0.32078
399,-0.2887
400,-0.25206999999999996
401,-0.21545
402,-0.17883
403,-0.14221
404,-0.10558
405,-0.34326999999999996
406,-0.16016
407,0.15523
408,0.20606999999999998
409,0.38918
410,0.11415
411,0.15077000000000002
412,0.18739
413,0.22401999999999997
414,0.26064
415,0.29136999999999996
416,0.30845
417,0.30845
418,0.30845
419,0.30845
420,0.32634
421,0.35728000000000004
422,0.3939
423,0.43038000000000004
424,0.46598999999999996
425,0.46816
426,0.46816
427,0.46816
428,0.46816
429,0.46816
430,0.46816
431,0.46816
432,0.46816
433,0.48326
434,0.51394
435,0.55056
436,0.58719
437,0.6238100000000001
438,0.6604300000000001
439,0.69705
440,0.73368
441,0.7703
442,0.80692
443,0.84354
444,0.88016
445,0.91679
446,0.9534100000000001
447,0.99003
448,1.0267
449,1.0633
450,1.0999
451,1.1365
452,1.1731
453,1.2098
454,1.2464
455,1.2432
456,1.2138
457,1.1772
458,1.1406
459,1.1101
460,1.1071
461,1.107
462,1.107
463,1.113
464,1.1335
465,1.1701
466,1.2067
467,1.2433
468,1.2614
469,1.2667
470,1.2667
471,1.2667
472,1.2667
473,1.2667
474,1.2667
475,1.2667
476,1.2721
477,1.2901
478,1.3268
479,1.3634
480,1.4
481,1.4205
482,1.4264
483,1.4264
484,1.4265
485,1.4295
486,1.46
487,1.4966
488,1.5333
489,1.5663
490,1.5862
491,1.5862
492,1.5862
493,1.5862
494,1.5735
495,1.5424
496,1.5058
497,1.4692
498,1.4376
499,1.4264
500,1.4264
501,1.4264
502,1.425
503,1.3863
504,1.3186
505,1.2454
506,1.1721
507,1.1148
508,1.107
509,1.107
510,1.107
511,1.107
512,1.107
513,1.107
514,1.107
515,1.107
516,1.0879
517,1.0562
518,1.0195
519,0.9829100000000001
520,0.9484600000000001
521,0.94744
522,0.9473
523,0.9473
524,0.9416200000000001
525,0.92289
526,0.8862700000000001
527,0.84965
528,0.81302
529,0.81057
530,0.8354
531,0.87203
532,0.9083399999999999
533,0.94089
534,0.9127200000000001
535,0.8761
536,0.83947
537,0.80716
538,0.78759
539,0.78759
540,0.78759
541,0.78759
542,0.77368
543,0.74283
544,0.70621
545,0.66959
546,0.6329600000000001
547,0.59634
548,0.55972
549,0.5231
550,0.48646999999999996
551,0.44985
552,0.41323000000000004
553,0.37661
554,0.33999
555,0.30336
556,0.26674000000000003
557,0.23012
558,0.1935
559,0.15688
560,0.12025
561,0.4197
562,0.23659000000000002
563,0.053475
564,-0.12964
565,-0.31275
566,-0.49586
567,-0.1361
568,-0.1685
569,-0.17053
570,-0.17069
571,-0.17069
572,-0.17069
573,-0.17069
574,-0.17069
575,-0.17069
576,-0.17069
577,-0.17069
578,-0.17069
579,-0.17069
580,-0.17082999999999998
581,-0.17185
582,-0.2063
583,-0.24291999999999997
584,-0.27954
585,-0.31616
586,-0.35278000000000004
587,-0.38941
588,-0.42603
589,-0.46265
590,-0.48418
591,-0.49012
592,-0.49012
593,-0.49012
594,-0.494
595,-0.52267
596,-0.55929
597,-0.59592
598,-0.63254
599,-0.6691600000000001
600,-0.70578
601,-0.7424
602,-0.77903
603,-0.81565
604,-0.8522700000000001
605,-0.88889
606,-0.9255200000000001
607,-0.95665
608,-0.96926
609,-0.96926
610,-0.96926
611,-0.96926
612,-0.9891399999999999
613,-1.0222
614,-1.0588
615,-1.0954
616,-1.1259
617,-1.1289
618,-1.129
619,-1.129
620,-1.129
621,-1.129
622,-1.129
623,-1.129
624,-1.129
625,-1.1104
626,-1.0791
627,-1.0425
628,-1.0059
629,-0.96926
630,-1.3034
631,-1.3034
632,-1.3034
633,-1.3034
634,-1.3034
635,-1.3034
636,-1.3034
637,-1.3034
638,-1.3034
639,-1.3034
640,-1.3034
641,-1.3034
642,-1.3034
643,-1.3034
644,-1.3034
645,-1.3034
646,-1.3034
647,-1.3034
648,-1.3034
649,-1.3034
650,-1.3034
651,-1.3034
652,-1.3034
653,-1.3034
654,-1.3034
655,-1.3034
656,-1.3034
657,-1.3034
658,-1.3034
659,-1.3034
660,-1.3034
661,-1.3034
662,-1.3034
663,-1.3034
664,-1.3034
665,-1.3034
666,-1.3034
667,-1.3034
668,-1.3034
669,-1.3034
670,-1.3034
671,-1.3034
672,-1.3034
673,-1.3034
674,-1.3034
675,-1.3034
676,-1.3034
677,-1.3034
678,-1.2931
679,-1.1253
680,-0.95329
681,-0.78065
682,-0.6214
683,-0.49291
684,-0.40659
685,-0.32027
686,-0.23395
687,-0.10736
688,0.2585
689,0.22403
690,0.39631
691,0.56415
692,0.6604300000000001
693,0.74675
694,0.8330700000000001
695,0.9092399999999999
696,0.95536
697,0.95536
698,0.95536
699,0.95536
700,0.92256
701,0.8498600000000001
702,0.76354
703,0.6772199999999999
704,0.5909
705,0.50457
706,0.41825
707,0.33193
708,0.2499
709,0.20673000000000002
710,0.20245
711,0.20245
712,0.20245
713,0.20245
714,0.20245
715,0.20245
716,0.20245
717,0.20245
718,0.20245
719,0.20245
720,0.20245
721,0.20245
722,0.24858000000000002
723,0.32474000000000003
724,0.41106000000000004
725,0.49738000000000004
726,0.57375
727,0.5785399999999999
728,0.57891
729,0.57891
730,0.57891
731,0.57891
732,0.57891
733,0.57891
734,0.57891
735,0.57891
736,0.57891
737,0.57891
738,0.57891
739,0.57891
740,0.57891
741,0.57891
742,0.57891
743,0.59044
744,0.63166
745,0.7179800000000001
746,0.8043
747,0.8906200000000001
748,0.9769399999999999
749,1.0633
750,1.1496
751,1.2359
752,1.3131
753,1.3318
754,1.3318
755,1.3318
756,1.3318
757,1.3318
758,1.3318
759,1.3318
760,1.3318
761,1.3318
762,1.3318
763,1.3318
764,1.3318
765,1.3189
766,1.2623
767,1.176
768,1.0896
769,1.0033
770,0.96385
771,0.95536
772,0.95536
773,0.95536
774,0.95536
775,0.95536
776,0.95536
777,0.95536
778,0.96946
779,1.0177
780,1.104
781,1.1903
782,1.2767
783,1.3630000000000002
784,1.4493
785,1.5356
786,1.6219999999999999
787,1.7083
788,1.7083
789,1.7083
790,1.7083
791,1.7083
792,1.7083
793,1.7083
794,1.7083
795,1.7083
796,1.7083
797,1.7083
798,1.7083
799,1.7082
800,1.7009999999999998
801,1.6291
802,1.5428
803,1.4565
804,1.3787
805,1.3318
806,1.3318
807,1.3318
808,1.3318
809,1.3318
810,1.3318
811,1.3318
812,1.3318
813,1.3198
814,1.2599
815,1.1736
816,1.0872
817,0.99918
818,0.8673
819,0.70119
820,0.52855
821,0.35591
822,0.18327000000000002
823,0.054683
824,-0.16201
825,-0.33466
826,-0.46529
827,-0.48572
828,-0.3994
829,-0.31308
830,-0.22675
831,-0.18553
832,-0.174
833,-0.174
834,-0.174
835,-0.16888
836,-0.42323
837,0.047033
838,0.43833
839,0.17368
840,0.26
841,0.34631999999999996
842,0.43263999999999997
843,0.5189600000000001
844,0.52475
845,0.46621
846,0.37989
847,0.29393
848,0.21241
849,0.20245
850,0.20245
851,0.20245
852,0.19229000000000002
853,0.1521
854,0.33043
855,-0.10117000000000001
856,-0.10687
857,-0.16039
858,-0.174
859,-0.174
860,-0.174
861,-0.174
862,-0.174
863,-0.174
864,-0.174
865,-0.16972
866,-0.12655999999999998
867,-0.22105999999999998
868,0.21054
869,0.12812
870,0.19174000000000002
871,0.20245
872,0.20245
873,0.20245
874,0.20245
875,0.20245
876,0.20245
877,0.20245
878,0.20245
879,0.15633
880,0.40236
881,-0.19275
882,-0.46083999999999997
883,-0.16884000000000002
884,-0.17364000000000002
885,-0.174
886,-0.174
887,-0.1879
888,-0.23395
889,-0.32027
890,-0.40659
891,-0.49291
892,-0.53706
893,-0.5504600000000001
894,-0.5504600000000001
895,-0.5504600000000001
896,-0.5504600000000001
897,-0.5504600000000001
898,-0.5504600000000001
899,-0.5504600000000001
900,-0.5504600000000001
901,-0.5504600000000001
902,-0.5504600000000001
903,-0.5504600000000001
904,-0.5504600000000001
905,-0.5504600000000001
906,-0.5504600000000001
907,-0.5504600000000001
908,-0.5504600000000001
909,-0.55961
910,-0.6271899999999999
911,-0.7135100000000001
912,-0.79983
913,-0.88615
914,-0.9724700000000001
915,-1.0588
916,-1.1451
917,-1.2314
918,-1.2914
919,-1.3034
920,-1.3034
921,-1.3034
922,-1.3163
923,-1.3729
924,-1.4592
925,-1.5455
926,-1.6319
927,-1.6713
928,-1.6798
929,-1.6798
930,-1.6798
931,-1.6798
932,-1.6798
933,-1.6798
934,-1.6798
935,-1.6657
936,-1.6175
937,-1.5312
938,-1.4448
939,-1.3585
940,-1.3159999999999998
941,-1.3034
942,-1.3034
943,-1.3034
944,-1.3034
