time,value
0,3.6525
1,4.1787
2,4.3873
3,4.3179
4,4.0187
5,3.5351
6,2.8955
7,2.1329
8,1.2781
9,0.35146
10,-0.61619
11,-1.5505
12,-2.3799
13,-3.0289
14,-3.4361
15,-3.5688
16,-3.4268
17,-3.0186
18,-2.4294
19,-1.7359
20,-1.0243
21,-0.36199000000000003
22,0.21129
23,0.6844399999999999
24,1.0507
25,1.3167
26,1.4946
27,1.5879
28,1.6043
29,1.5225
30,1.3430000000000002
31,1.0763
32,0.74707
33,0.41113
34,0.10586
35,-0.14146
36,-0.28401
37,-0.31747
38,-0.26955
39,-0.18395
40,-0.10243
41,-0.07521
42,-0.13588
43,-0.25519000000000003
44,-0.41423999999999994
45,-0.5634399999999999
46,-0.6499199999999999
47,-0.66437
48,-0.60918
49,-0.52896
50,-0.46033999999999997
51,-0.4355
52,-0.47329
53,-0.54919
54,-0.6039800000000001
55,-0.58525
56,-0.46108999999999994
57,-0.20856999999999998
58,0.1505
59,0.5672699999999999
60,0.97203
61,1.2955
62,1.483
63,1.5209
64,1.4151
65,1.1939
66,0.88526
67,0.52174
68,0.11804
69,-0.34492
70,-0.85157
71,-1.3683
72,-1.8544
73,-2.23
74,-2.4202
75,-2.3792
76,-2.0818
77,-1.5643
78,-0.9003399999999999
79,-0.19269
80,0.46361
81,0.9961200000000001
82,1.3826
83,1.6547
84,1.8413
85,1.9745
86,2.0552
87,2.0540000000000003
88,1.9086
89,1.5818
90,1.0557
91,0.36058
92,-0.41436999999999996
93,-1.1488
94,-1.7385
95,-2.0816
96,-2.1485
97,-1.9707
98,-1.6267
99,-1.2094
100,-0.79456
101,-0.44054
102,-0.15913
103,0.093311
104,0.33678
105,0.59413
106,0.86836
107,1.1313
108,1.3164
109,1.3639
110,1.2411
111,0.94181
112,0.49696
113,-0.033051
114,-0.57553
115,-1.0556
116,-1.4064
117,-1.6002
118,-1.6355
119,-1.4941
120,-1.193
121,-0.76868
122,-0.25834
123,0.26366999999999996
124,0.72988
125,1.0794
126,1.2744
127,1.2807
128,1.1204
129,0.84775
130,0.5253899999999999
131,0.21961999999999998
132,-0.026292000000000003
133,-0.18358
134,-0.25421
135,-0.27726999999999996
136,-0.27284
137,-0.28331
138,-0.29554
139,-0.3028
140,-0.29394000000000003
141,-0.26971
142,-0.21599000000000002
143,-0.14286
144,-0.08063200000000001
145,-0.02454
146,0.015311000000000002
147,0.037805
148,0.06962
149,0.11955999999999999
150,0.17426
151,0.21731
152,0.18937
153,0.076651
154,-0.14152
155,-0.44797
156,-0.76842
157,-1.0222
158,-1.1355
159,-1.0592
160,-0.80821
161,-0.43746999999999997
162,-0.028928
163,0.33074000000000003
164,0.57535
165,0.6866300000000001
166,0.69518
167,0.6524399999999999
168,0.5969899999999999
169,0.55035
170,0.52718
171,0.50322
172,0.42926000000000003
173,0.28125
174,0.087798
175,-0.11757999999999999
176,-0.28946
177,-0.36518
178,-0.32811999999999997
179,-0.18924000000000002
180,-0.0021554
181,0.1676
182,0.27996
183,0.30459
184,0.24684
185,0.13028
186,-0.010686
187,-0.14414000000000002
188,-0.26466
189,-0.38576
190,-0.5423600000000001
191,-0.74933
192,-0.97321
193,-1.1884
194,-1.337
195,-1.3392
196,-1.1945
197,-0.9043
198,-0.5272899999999999
199,-0.13282
200,0.21434
201,0.47291000000000005
202,0.65946
203,0.7913100000000001
204,0.9065
205,1.0502
206,1.2214
207,1.3698
208,1.4381
209,1.3603
210,1.0936
211,0.63372
212,0.045204
213,-0.57495
214,-1.1094
215,-1.4475
216,-1.5173
217,-1.3253
218,-0.90069
219,-0.34872
220,0.2068
221,0.63652
222,0.87287
223,0.8884
224,0.70504
225,0.39426
226,0.036948
227,-0.30015
228,-0.55316
229,-0.71599
230,-0.81805
231,-0.87231
232,-0.90894
233,-0.95001
234,-0.97925
235,-0.9933700000000001
236,-0.95816
237,-0.8402799999999999
238,-0.62222
239,-0.33302
240,0.0034326
241,0.33157
242,0.62855
243,0.8662
244,1.0431
245,1.1695
246,1.2391
247,1.2679
248,1.2576
249,1.1907
250,1.0526
251,0.86503
252,0.62298
253,0.36430999999999997
254,0.11772
255,-0.0993
256,-0.26639
257,-0.41667
258,-0.55613
259,-0.70694
260,-0.8875200000000001
261,-1.0685
262,-1.2207
263,-1.319
264,-1.3113
265,-1.1602
266,-0.8964799999999999
267,-0.5738
268,-0.24770999999999999
269,0.029236
270,0.19843
271,0.24269000000000002
272,0.17982
273,0.05800399999999999
274,-0.054139
275,-0.12305999999999999
276,-0.10325
277,0.022616
278,0.23503000000000002
279,0.49182
280,0.7541
281,0.9801799999999999
282,1.1377
283,1.1795
284,1.1108
285,0.92137
286,0.62805
287,0.28586
288,-0.085355
289,-0.44548999999999994
290,-0.74907
291,-0.98054
292,-1.1168
293,-1.192
294,-1.1968
295,-1.1298
296,-1.0052
297,-0.80706
298,-0.551
299,-0.23642
300,0.09296499999999999
301,0.39264
302,0.6272800000000001
303,0.74839
304,0.76526
305,0.69948
306,0.59834
307,0.51031
308,0.47521
309,0.48483999999999994
310,0.5132
311,0.50402
312,0.41789
313,0.23046
314,-0.046555
315,-0.36289
316,-0.6549
317,-0.87805
318,-0.98874
319,-1.0139
320,-0.9744299999999999
321,-0.91915
322,-0.86374
323,-0.81398
324,-0.74935
325,-0.62295
326,-0.41073999999999994
327,-0.095637
328,0.2993
329,0.7015899999999999
330,1.0371
331,1.2503
332,1.3012
333,1.1933
334,0.98598
335,0.72447
336,0.47758
337,0.28
338,0.13367
339,0.027981
340,-0.07253
341,-0.21556999999999998
342,-0.38774000000000003
343,-0.58491
344,-0.78142
345,-0.92768
346,-0.99346
347,-0.95531
348,-0.80469
349,-0.58086
350,-0.32682
351,-0.080315
352,0.09841699999999999
353,0.18658
354,0.18207
355,0.077713
356,-0.08086499999999999
357,-0.21921999999999997
358,-0.2892
359,-0.25956999999999997
360,-0.11091
361,0.13625
362,0.42196999999999996
363,0.67262
364,0.8347100000000001
365,0.8604
366,0.72364
367,0.48097
368,0.19762000000000002
369,-0.049595
370,-0.20126
371,-0.21153000000000002
372,-0.092209
373,0.10811
374,0.31406
375,0.45158999999999994
376,0.47541000000000005
377,0.36348
378,0.14374
379,-0.15042
380,-0.45763000000000004
381,-0.7270300000000001
382,-0.9323600000000001
383,-1.0615
384,-1.0944
385,-1.0555
386,-0.95296
387,-0.78657
388,-0.58778
389,-0.3657
390,-0.14737999999999998
391,0.043952
392,0.20518000000000003
393,0.31271
394,0.38692
395,0.44283
396,0.49175
397,0.55333
398,0.62871
399,0.71226
400,0.7747
401,0.80248
402,0.76667
403,0.65087
404,0.46738
405,0.2325
406,-0.0025859999999999998
407,-0.21299
408,-0.38459
409,-0.49823999999999996
410,-0.56115
411,-0.59228
412,-0.61121
413,-0.62812
414,-0.6224
415,-0.57262
416,-0.45285
417,-0.25234
418,0.025432
419,0.32921
420,0.60534
421,0.78137
422,0.8117800000000001
423,0.67005
424,0.37877
425,-0.006644499999999999
426,-0.41707
427,-0.7649199999999999
428,-0.99093
429,-1.0818
430,-1.0170000000000001
431,-0.82226
432,-0.54642
433,-0.22857
434,0.089804
435,0.36058
436,0.5559
437,0.64173
438,0.61492
439,0.48746999999999996
440,0.28443
441,0.051383000000000005
442,-0.15049
443,-0.26271
444,-0.24773
445,-0.098501
446,0.13877
447,0.4084
448,0.6420600000000001
449,0.7753399999999999
450,0.7724300000000001
451,0.64944
452,0.44536000000000003
453,0.20363
454,-0.032472
455,-0.23326999999999998
456,-0.38819000000000004
457,-0.5000399999999999
458,-0.60177
459,-0.69434
460,-0.7710899999999999
461,-0.80907
462,-0.7761100000000001
463,-0.65279
464,-0.43688999999999995
465,-0.16171
466,0.11982000000000001
467,0.33847
468,0.44976000000000005
469,0.42996999999999996
470,0.31437
471,0.16276
472,0.03417
473,0.0023476
474,0.083821
475,0.27604
476,0.52004
477,0.7388
478,0.84593
479,0.77937
480,0.5435
481,0.16116
482,-0.31963
483,-0.80604
484,-1.2064
485,-1.444
486,-1.4844
487,-1.3316
488,-1.0084
489,-0.58932
490,-0.13884000000000002
491,0.29122
492,0.64912
493,0.9116700000000001
494,1.0815
495,1.1696
496,1.1840000000000002
497,1.1502
498,1.0724
499,0.9694299999999999
