d3mIndex,type,repeat,fold
0,TEST,0,0
1,TEST,0,0
2,TEST,0,0
3,TEST,0,0
4,TEST,0,0
5,TEST,0,0
6,TEST,0,0
7,TEST,0,0
8,TEST,0,0
9,TEST,0,0
10,TEST,0,0
11,TEST,0,0
12,TEST,0,0
13,TEST,0,0
14,TEST,0,0
15,TEST,0,0
16,TEST,0,0
17,TEST,0,0
18,TEST,0,0
19,TEST,0,0
20,TEST,0,0
21,TEST,0,0
22,TRAIN,0,0
23,TRAIN,0,0
24,TEST,0,0
25,TEST,0,0
26,TEST,0,0
27,TEST,0,0
28,TEST,0,0
29,TEST,0,0
30,TRAIN,0,0
31,TEST,0,0
32,TEST,0,0
33,TRAIN,0,0
34,TEST,0,0
35,TEST,0,0
36,TEST,0,0
37,TEST,0,0
38,TEST,0,0
39,TEST,0,0
40,TEST,0,0
41,TEST,0,0
42,TEST,0,0
43,TEST,0,0
44,TEST,0,0
45,TEST,0,0
46,TEST,0,0
47,TEST,0,0
48,TEST,0,0
49,TEST,0,0
50,TEST,0,0
51,TEST,0,0
52,TEST,0,0
53,TEST,0,0
54,TEST,0,0
55,TEST,0,0
56,TRAIN,0,0
57,TEST,0,0
58,TEST,0,0
59,TEST,0,0
60,TRAIN,0,0
61,TEST,0,0
62,TEST,0,0
63,TEST,0,0
64,TEST,0,0
65,TEST,0,0
66,TEST,0,0
67,TEST,0,0
68,TEST,0,0
69,TEST,0,0
70,TEST,0,0
71,TRAIN,0,0
72,TEST,0,0
73,TEST,0,0
74,TRAIN,0,0
75,TEST,0,0
76,TEST,0,0
77,TEST,0,0
78,TEST,0,0
79,TEST,0,0
80,TEST,0,0
81,TEST,0,0
82,TEST,0,0
83,TEST,0,0
84,TEST,0,0
85,TEST,0,0
86,TEST,0,0
87,TEST,0,0
88,TEST,0,0
89,TEST,0,0
90,TEST,0,0
91,TEST,0,0
92,TRAIN,0,0
93,TEST,0,0
94,TEST,0,0
95,TEST,0,0
96,TEST,0,0
97,TEST,0,0
98,TEST,0,0
99,TEST,0,0
100,TEST,0,0
101,TEST,0,0
102,TEST,0,0
103,TEST,0,0
104,TRAIN,0,0
105,TEST,0,0
106,TEST,0,0
107,TEST,0,0
108,TEST,0,0
109,TEST,0,0
110,TEST,0,0
111,TEST,0,0
112,TEST,0,0
113,TEST,0,0
114,TEST,0,0
115,TEST,0,0
116,TEST,0,0
117,TRAIN,0,0
118,TRAIN,0,0
119,TEST,0,0
120,TEST,0,0
121,TEST,0,0
122,TEST,0,0
123,TEST,0,0
124,TEST,0,0
125,TEST,0,0
126,TEST,0,0
127,TEST,0,0
128,TEST,0,0
129,TEST,0,0
130,TEST,0,0
131,TEST,0,0
132,TEST,0,0
133,TEST,0,0
134,TEST,0,0
135,TEST,0,0
136,TEST,0,0
137,TEST,0,0
138,TEST,0,0
139,TEST,0,0
140,TEST,0,0
141,TEST,0,0
142,TEST,0,0
143,TEST,0,0
144,TEST,0,0
145,TEST,0,0
146,TRAIN,0,0
147,TEST,0,0
148,TEST,0,0
149,TEST,0,0
150,TEST,0,0
151,TEST,0,0
152,TEST,0,0
153,TEST,0,0
154,TEST,0,0
155,TEST,0,0
156,TRAIN,0,0
157,TEST,0,0
158,TEST,0,0
159,TEST,0,0
160,TEST,0,0
161,TEST,0,0
162,TEST,0,0
163,TEST,0,0
164,TEST,0,0
165,TEST,0,0
166,TEST,0,0
167,TEST,0,0
168,TEST,0,0
169,TEST,0,0
170,TEST,0,0
171,TEST,0,0
172,TEST,0,0
173,TEST,0,0
174,TEST,0,0
175,TEST,0,0
176,TEST,0,0
177,TEST,0,0
178,TEST,0,0
179,TEST,0,0
180,TRAIN,0,0
181,TEST,0,0
182,TEST,0,0
183,TEST,0,0
184,TEST,0,0
185,TEST,0,0
186,TEST,0,0
187,TEST,0,0
188,TEST,0,0
189,TEST,0,0
190,TEST,0,0
191,TEST,0,0
192,TEST,0,0
193,TEST,0,0
194,TEST,0,0
195,TRAIN,0,0
196,TEST,0,0
197,TEST,0,0
198,TEST,0,0
199,TEST,0,0
200,TEST,0,0
201,TEST,0,0
202,TEST,0,0
203,TEST,0,0
204,TEST,0,0
205,TEST,0,0
206,TEST,0,0
207,TEST,0,0
208,TEST,0,0
209,TEST,0,0
210,TEST,0,0
211,TEST,0,0
212,TEST,0,0
213,TRAIN,0,0
214,TEST,0,0
215,TEST,0,0
216,TRAIN,0,0
217,TRAIN,0,0
218,TEST,0,0
219,TEST,0,0
220,TEST,0,0
221,TEST,0,0
222,TEST,0,0
223,TEST,0,0
224,TRAIN,0,0
225,TRAIN,0,0
226,TEST,0,0
227,TEST,0,0
228,TEST,0,0
229,TEST,0,0
230,TRAIN,0,0
231,TEST,0,0
232,TEST,0,0
233,TEST,0,0
234,TEST,0,0
235,TEST,0,0
236,TEST,0,0
237,TEST,0,0
238,TEST,0,0
239,TEST,0,0
240,TEST,0,0
241,TEST,0,0
242,TEST,0,0
243,TRAIN,0,0
244,TEST,0,0
245,TEST,0,0
246,TEST,0,0
247,TEST,0,0
248,TRAIN,0,0
249,TEST,0,0
250,TEST,0,0
251,TEST,0,0
252,TEST,0,0
253,TRAIN,0,0
254,TEST,0,0
255,TEST,0,0
256,TEST,0,0
257,TRAIN,0,0
258,TRAIN,0,0
259,TEST,0,0
260,TEST,0,0
261,TEST,0,0
262,TEST,0,0
263,TRAIN,0,0
264,TEST,0,0
265,TEST,0,0
266,TRAIN,0,0
267,TEST,0,0
268,TEST,0,0
269,TEST,0,0
270,TEST,0,0
271,TEST,0,0
272,TEST,0,0
273,TEST,0,0
274,TEST,0,0
275,TEST,0,0
276,TEST,0,0
277,TEST,0,0
278,TEST,0,0
279,TEST,0,0
280,TEST,0,0
281,TEST,0,0
282,TEST,0,0
283,TEST,0,0
284,TEST,0,0
285,TEST,0,0
286,TEST,0,0
287,TEST,0,0
288,TRAIN,0,0
289,TEST,0,0
290,TEST,0,0
291,TEST,0,0
292,TRAIN,0,0
293,TEST,0,0
294,TEST,0,0
295,TEST,0,0
296,TEST,0,0
297,TEST,0,0
298,TRAIN,0,0
299,TEST,0,0
300,TEST,0,0
301,TEST,0,0
302,TEST,0,0
303,TEST,0,0
304,TEST,0,0
305,TRAIN,0,0
306,TRAIN,0,0
307,TRAIN,0,0
308,TRAIN,0,0
309,TEST,0,0
310,TEST,0,0
311,TEST,0,0
312,TEST,0,0
313,TEST,0,0
314,TEST,0,0
315,TEST,0,0
316,TRAIN,0,0
317,TRAIN,0,0
318,TEST,0,0
319,TRAIN,0,0
320,TEST,0,0
321,TEST,0,0
322,TEST,0,0
323,TEST,0,0
324,TEST,0,0
325,TEST,0,0
326,TEST,0,0
327,TEST,0,0
328,TEST,0,0
329,TRAIN,0,0
330,TEST,0,0
331,TEST,0,0
332,TEST,0,0
333,TRAIN,0,0
334,TEST,0,0
335,TEST,0,0
336,TEST,0,0
337,TRAIN,0,0
338,TEST,0,0
339,TEST,0,0
340,TEST,0,0
341,TEST,0,0
342,TEST,0,0
343,TRAIN,0,0
344,TEST,0,0
345,TEST,0,0
346,TEST,0,0
347,TEST,0,0
348,TEST,0,0
349,TEST,0,0
350,TEST,0,0
351,TEST,0,0
352,TRAIN,0,0
353,TEST,0,0
354,TEST,0,0
355,TEST,0,0
356,TRAIN,0,0
357,TEST,0,0
358,TEST,0,0
359,TEST,0,0
360,TEST,0,0
361,TRAIN,0,0
362,TEST,0,0
363,TEST,0,0
364,TEST,0,0
365,TEST,0,0
366,TEST,0,0
367,TEST,0,0
368,TEST,0,0
369,TEST,0,0
370,TEST,0,0
371,TEST,0,0
372,TEST,0,0
373,TEST,0,0
374,TRAIN,0,0
375,TEST,0,0
376,TEST,0,0
377,TEST,0,0
378,TEST,0,0
379,TEST,0,0
380,TRAIN,0,0
381,TEST,0,0
382,TEST,0,0
383,TEST,0,0
384,TEST,0,0
385,TEST,0,0
386,TEST,0,0
387,TEST,0,0
388,TEST,0,0
389,TEST,0,0
390,TEST,0,0
391,TEST,0,0
392,TEST,0,0
393,TEST,0,0
394,TEST,0,0
395,TEST,0,0
396,TEST,0,0
397,TEST,0,0
398,TEST,0,0
399,TEST,0,0
400,TEST,0,0
401,TEST,0,0
402,TEST,0,0
403,TEST,0,0
404,TRAIN,0,0
405,TEST,0,0
406,TEST,0,0
407,TEST,0,0
408,TEST,0,0
409,TEST,0,0
410,TRAIN,0,0
411,TEST,0,0
412,TEST,0,0
413,TEST,0,0
414,TEST,0,0
415,TEST,0,0
416,TEST,0,0
417,TEST,0,0
418,TEST,0,0
419,TEST,0,0
420,TEST,0,0
421,TEST,0,0
422,TRAIN,0,0
423,TRAIN,0,0
424,TEST,0,0
425,TEST,0,0
426,TEST,0,0
427,TEST,0,0
428,TEST,0,0
429,TRAIN,0,0
430,TEST,0,0
431,TEST,0,0
432,TEST,0,0
433,TEST,0,0
434,TEST,0,0
435,TEST,0,0
436,TRAIN,0,0
437,TEST,0,0
438,TEST,0,0
439,TEST,0,0
440,TEST,0,0
441,TEST,0,0
442,TEST,0,0
443,TEST,0,0
444,TEST,0,0
445,TEST,0,0
446,TEST,0,0
447,TEST,0,0
448,TEST,0,0
449,TRAIN,0,0
450,TEST,0,0
451,TEST,0,0
452,TEST,0,0
453,TEST,0,0
454,TEST,0,0
455,TEST,0,0
456,TEST,0,0
457,TEST,0,0
458,TEST,0,0
459,TEST,0,0
460,TEST,0,0
461,TEST,0,0
462,TEST,0,0
463,TRAIN,0,0
464,TEST,0,0
465,TEST,0,0
466,TEST,0,0
467,TRAIN,0,0
468,TEST,0,0
469,TEST,0,0
470,TRAIN,0,0
471,TRAIN,0,0
472,TEST,0,0
473,TEST,0,0
474,TEST,0,0
475,TEST,0,0
476,TEST,0,0
477,TEST,0,0
478,TEST,0,0
479,TEST,0,0
480,TEST,0,0
481,TRAIN,0,0
482,TEST,0,0
483,TRAIN,0,0
484,TEST,0,0
485,TEST,0,0
486,TEST,0,0
487,TEST,0,0
488,TEST,0,0
489,TEST,0,0
490,TEST,0,0
491,TEST,0,0
492,TEST,0,0
493,TEST,0,0
494,TEST,0,0
495,TEST,0,0
496,TEST,0,0
497,TEST,0,0
498,TEST,0,0
499,TEST,0,0
500,TEST,0,0
501,TEST,0,0
502,TEST,0,0
503,TEST,0,0
504,TEST,0,0
505,TEST,0,0
506,TEST,0,0
507,TEST,0,0
508,TEST,0,0
509,TEST,0,0
510,TEST,0,0
511,TEST,0,0
512,TEST,0,0
513,TEST,0,0
514,TRAIN,0,0
515,TEST,0,0
516,TEST,0,0
517,TEST,0,0
518,TEST,0,0
519,TEST,0,0
520,TEST,0,0
521,TEST,0,0
522,TEST,0,0
523,TEST,0,0
524,TEST,0,0
525,TEST,0,0
526,TEST,0,0
527,TRAIN,0,0
528,TEST,0,0
529,TRAIN,0,0
530,TEST,0,0
531,TEST,0,0
532,TEST,0,0
533,TRAIN,0,0
534,TEST,0,0
535,TEST,0,0
536,TEST,0,0
537,TEST,0,0
538,TEST,0,0
539,TRAIN,0,0
540,TEST,0,0
541,TEST,0,0
542,TEST,0,0
543,TEST,0,0
544,TEST,0,0
545,TEST,0,0
546,TEST,0,0
547,TRAIN,0,0
548,TEST,0,0
549,TEST,0,0
550,TEST,0,0
551,TEST,0,0
552,TEST,0,0
553,TEST,0,0
554,TEST,0,0
555,TEST,0,0
556,TEST,0,0
557,TEST,0,0
558,TRAIN,0,0
559,TEST,0,0
560,TEST,0,0
561,TEST,0,0
562,TEST,0,0
563,TEST,0,0
564,TEST,0,0
565,TEST,0,0
566,TEST,0,0
567,TEST,0,0
568,TEST,0,0
569,TRAIN,0,0
570,TEST,0,0
571,TEST,0,0
572,TEST,0,0
573,TEST,0,0
574,TEST,0,0
575,TEST,0,0
576,TRAIN,0,0
577,TEST,0,0
578,TRAIN,0,0
579,TEST,0,0
580,TEST,0,0
581,TEST,0,0
582,TEST,0,0
583,TEST,0,0
584,TEST,0,0
585,TEST,0,0
586,TEST,0,0
587,TEST,0,0
588,TEST,0,0
589,TEST,0,0
590,TEST,0,0
591,TEST,0,0
592,TEST,0,0
593,TEST,0,0
594,TEST,0,0
595,TEST,0,0
596,TEST,0,0
597,TEST,0,0
598,TEST,0,0
599,TEST,0,0
600,TEST,0,0
601,TEST,0,0
602,TEST,0,0
603,TEST,0,0
604,TRAIN,0,0
605,TEST,0,0
606,TEST,0,0
607,TEST,0,0
608,TEST,0,0
609,TEST,0,0
610,TEST,0,0
611,TEST,0,0
612,TEST,0,0
613,TEST,0,0
614,TEST,0,0
615,TEST,0,0
616,TEST,0,0
617,TRAIN,0,0
618,TEST,0,0
619,TEST,0,0
620,TEST,0,0
621,TEST,0,0
622,TEST,0,0
623,TEST,0,0
624,TEST,0,0
625,TEST,0,0
626,TEST,0,0
627,TEST,0,0
628,TEST,0,0
629,TEST,0,0
630,TEST,0,0
631,TEST,0,0
632,TEST,0,0
633,TEST,0,0
634,TEST,0,0
635,TEST,0,0
636,TEST,0,0
637,TEST,0,0
638,TEST,0,0
639,TEST,0,0
640,TEST,0,0
641,TEST,0,0
642,TEST,0,0
643,TEST,0,0
644,TEST,0,0
645,TEST,0,0
646,TEST,0,0
647,TRAIN,0,0
648,TEST,0,0
649,TEST,0,0
650,TEST,0,0
651,TEST,0,0
652,TRAIN,0,0
653,TEST,0,0
654,TEST,0,0
655,TEST,0,0
656,TEST,0,0
657,TEST,0,0
658,TEST,0,0
659,TEST,0,0
660,TEST,0,0
661,TEST,0,0
662,TEST,0,0
663,TEST,0,0
664,TEST,0,0
665,TEST,0,0
666,TEST,0,0
667,TRAIN,0,0
668,TEST,0,0
669,TEST,0,0
670,TEST,0,0
671,TEST,0,0
672,TEST,0,0
673,TEST,0,0
674,TEST,0,0
675,TEST,0,0
676,TEST,0,0
677,TEST,0,0
678,TEST,0,0
679,TEST,0,0
680,TEST,0,0
681,TEST,0,0
682,TEST,0,0
683,TEST,0,0
684,TEST,0,0
685,TEST,0,0
686,TEST,0,0
687,TRAIN,0,0
688,TRAIN,0,0
689,TEST,0,0
690,TEST,0,0
691,TEST,0,0
692,TEST,0,0
693,TEST,0,0
694,TEST,0,0
695,TRAIN,0,0
696,TEST,0,0
697,TEST,0,0
698,TEST,0,0
699,TEST,0,0
700,TEST,0,0
701,TRAIN,0,0
702,TRAIN,0,0
703,TEST,0,0
704,TEST,0,0
705,TEST,0,0
706,TEST,0,0
707,TRAIN,0,0
708,TEST,0,0
709,TEST,0,0
710,TEST,0,0
711,TEST,0,0
712,TEST,0,0
713,TEST,0,0
714,TEST,0,0
715,TEST,0,0
716,TEST,0,0
717,TEST,0,0
718,TEST,0,0
719,TRAIN,0,0
720,TEST,0,0
721,TEST,0,0
722,TEST,0,0
723,TEST,0,0
724,TEST,0,0
725,TEST,0,0
726,TEST,0,0
727,TEST,0,0
728,TEST,0,0
729,TEST,0,0
730,TEST,0,0
731,TEST,0,0
732,TEST,0,0
733,TEST,0,0
734,TEST,0,0
735,TEST,0,0
736,TEST,0,0
737,TEST,0,0
738,TEST,0,0
739,TEST,0,0
740,TEST,0,0
741,TEST,0,0
742,TEST,0,0
743,TEST,0,0
744,TEST,0,0
745,TEST,0,0
746,TEST,0,0
747,TEST,0,0
748,TEST,0,0
749,TEST,0,0
750,TEST,0,0
751,TEST,0,0
752,TEST,0,0
753,TEST,0,0
754,TEST,0,0
755,TEST,0,0
756,TEST,0,0
757,TEST,0,0
758,TEST,0,0
759,TEST,0,0
760,TEST,0,0
761,TEST,0,0
762,TEST,0,0
763,TEST,0,0
764,TEST,0,0
765,TEST,0,0
766,TEST,0,0
767,TEST,0,0
768,TEST,0,0
769,TEST,0,0
770,TEST,0,0
771,TEST,0,0
772,TEST,0,0
773,TEST,0,0
774,TEST,0,0
775,TRAIN,0,0
776,TEST,0,0
777,TEST,0,0
778,TEST,0,0
779,TEST,0,0
780,TEST,0,0
781,TEST,0,0
782,TEST,0,0
783,TEST,0,0
784,TEST,0,0
785,TEST,0,0
786,TEST,0,0
787,TEST,0,0
788,TEST,0,0
789,TEST,0,0
790,TEST,0,0
791,TEST,0,0
792,TEST,0,0
793,TEST,0,0
794,TEST,0,0
795,TEST,0,0
796,TEST,0,0
797,TEST,0,0
798,TEST,0,0
799,TEST,0,0
800,TRAIN,0,0
801,TEST,0,0
802,TEST,0,0
803,TEST,0,0
804,TEST,0,0
805,TEST,0,0
806,TEST,0,0
807,TEST,0,0
808,TEST,0,0
809,TEST,0,0
810,TEST,0,0
811,TEST,0,0
812,TEST,0,0
813,TEST,0,0
814,TEST,0,0
815,TEST,0,0
816,TEST,0,0
817,TEST,0,0
818,TEST,0,0
819,TEST,0,0
820,TEST,0,0
821,TEST,0,0
822,TEST,0,0
823,TEST,0,0
824,TEST,0,0
825,TEST,0,0
826,TEST,0,0
827,TRAIN,0,0
828,TEST,0,0
829,TEST,0,0
830,TEST,0,0
831,TEST,0,0
832,TEST,0,0
833,TEST,0,0
834,TRAIN,0,0
835,TEST,0,0
836,TEST,0,0
837,TEST,0,0
838,TEST,0,0
839,TEST,0,0
840,TEST,0,0
841,TEST,0,0
842,TEST,0,0
843,TEST,0,0
844,TEST,0,0
845,TEST,0,0
846,TEST,0,0
847,TEST,0,0
848,TEST,0,0
849,TEST,0,0
850,TRAIN,0,0
851,TEST,0,0
852,TEST,0,0
853,TEST,0,0
854,TEST,0,0
855,TEST,0,0
856,TEST,0,0
857,TEST,0,0
858,TEST,0,0
859,TEST,0,0
860,TEST,0,0
861,TEST,0,0
862,TEST,0,0
863,TEST,0,0
864,TEST,0,0
865,TRAIN,0,0
866,TEST,0,0
867,TRAIN,0,0
868,TEST,0,0
869,TEST,0,0
870,TEST,0,0
871,TEST,0,0
872,TEST,0,0
873,TEST,0,0
874,TEST,0,0
875,TEST,0,0
876,TEST,0,0
877,TEST,0,0
878,TEST,0,0
879,TEST,0,0
880,TEST,0,0
881,TEST,0,0
882,TEST,0,0
883,TEST,0,0
884,TEST,0,0
885,TEST,0,0
886,TEST,0,0
887,TEST,0,0
888,TEST,0,0
889,TEST,0,0
890,TRAIN,0,0
891,TEST,0,0
892,TEST,0,0
893,TEST,0,0
894,TEST,0,0
895,TEST,0,0
896,TEST,0,0
897,TEST,0,0
898,TEST,0,0
899,TEST,0,0
900,TEST,0,0
901,TEST,0,0
902,TEST,0,0
903,TEST,0,0
904,TEST,0,0
905,TEST,0,0
906,TEST,0,0
907,TEST,0,0
908,TEST,0,0
909,TEST,0,0
910,TEST,0,0
911,TEST,0,0
912,TEST,0,0
913,TRAIN,0,0
914,TEST,0,0
915,TEST,0,0
916,TEST,0,0
917,TEST,0,0
918,TEST,0,0
919,TEST,0,0
920,TEST,0,0
921,TEST,0,0
922,TEST,0,0
923,TEST,0,0
924,TEST,0,0
925,TRAIN,0,0
926,TEST,0,0
927,TEST,0,0
928,TEST,0,0
929,TRAIN,0,0
930,TEST,0,0
931,TEST,0,0
932,TEST,0,0
933,TEST,0,0
934,TRAIN,0,0
935,TEST,0,0
936,TEST,0,0
937,TRAIN,0,0
938,TRAIN,0,0
939,TEST,0,0
940,TEST,0,0
941,TRAIN,0,0
942,TEST,0,0
943,TEST,0,0
944,TEST,0,0
945,TEST,0,0
946,TEST,0,0
947,TEST,0,0
948,TEST,0,0
949,TEST,0,0
950,TEST,0,0
951,TEST,0,0
952,TEST,0,0
953,TEST,0,0
954,TEST,0,0
955,TEST,0,0
956,TEST,0,0
957,TEST,0,0
958,TEST,0,0
959,TEST,0,0
960,TEST,0,0
961,TEST,0,0
962,TEST,0,0
963,TRAIN,0,0
964,TEST,0,0
965,TEST,0,0
966,TEST,0,0
967,TEST,0,0
968,TEST,0,0
969,TRAIN,0,0
970,TEST,0,0
971,TEST,0,0
972,TEST,0,0
973,TEST,0,0
974,TEST,0,0
975,TEST,0,0
976,TEST,0,0
977,TRAIN,0,0
978,TEST,0,0
979,TEST,0,0
980,TEST,0,0
981,TEST,0,0
982,TEST,0,0
983,TEST,0,0
984,TEST,0,0
985,TEST,0,0
986,TEST,0,0
987,TEST,0,0
988,TEST,0,0
989,TEST,0,0
990,TEST,0,0
991,TRAIN,0,0
992,TEST,0,0
993,TEST,0,0
994,TEST,0,0
995,TEST,0,0
996,TEST,0,0
997,TRAIN,0,0
998,TEST,0,0
999,TEST,0,0
1000,TEST,0,0
1001,TEST,0,0
1002,TEST,0,0
1003,TEST,0,0
1004,TEST,0,0
1005,TEST,0,0
1006,TEST,0,0
1007,TEST,0,0
1008,TRAIN,0,0
1009,TEST,0,0
1010,TEST,0,0
1011,TEST,0,0
1012,TEST,0,0
1013,TEST,0,0
1014,TEST,0,0
1015,TEST,0,0
1016,TEST,0,0
1017,TEST,0,0
1018,TEST,0,0
1019,TEST,0,0
1020,TEST,0,0
1021,TEST,0,0
1022,TEST,0,0
1023,TEST,0,0
1024,TEST,0,0
1025,TEST,0,0
1026,TEST,0,0
1027,TRAIN,0,0
1028,TEST,0,0
1029,TEST,0,0
1030,TEST,0,0
1031,TEST,0,0
1032,TEST,0,0
1033,TEST,0,0
1034,TEST,0,0
1035,TEST,0,0
1036,TEST,0,0
1037,TEST,0,0
1038,TEST,0,0
1039,TEST,0,0
1040,TEST,0,0
1041,TEST,0,0
1042,TEST,0,0
1043,TEST,0,0
1044,TEST,0,0
1045,TEST,0,0
1046,TEST,0,0
1047,TRAIN,0,0
1048,TEST,0,0
1049,TEST,0,0
1050,TEST,0,0
1051,TEST,0,0
1052,TEST,0,0
1053,TEST,0,0
1054,TEST,0,0
1055,TEST,0,0
1056,TEST,0,0
1057,TEST,0,0
1058,TEST,0,0
1059,TEST,0,0
1060,TEST,0,0
1061,TEST,0,0
1062,TEST,0,0
1063,TEST,0,0
1064,TEST,0,0
1065,TEST,0,0
1066,TEST,0,0
1067,TEST,0,0
1068,TEST,0,0
1069,TEST,0,0
1070,TRAIN,0,0
1071,TRAIN,0,0
1072,TEST,0,0
1073,TEST,0,0
1074,TEST,0,0
1075,TEST,0,0
1076,TEST,0,0
1077,TEST,0,0
1078,TEST,0,0
1079,TEST,0,0
1080,TEST,0,0
1081,TEST,0,0
1082,TEST,0,0
1083,TEST,0,0
1084,TRAIN,0,0
1085,TEST,0,0
1086,TEST,0,0
1087,TEST,0,0
1088,TEST,0,0
1089,TEST,0,0
1090,TRAIN,0,0
1091,TEST,0,0
1092,TEST,0,0
1093,TEST,0,0
1094,TRAIN,0,0
1095,TEST,0,0
1096,TEST,0,0
1097,TEST,0,0
1098,TEST,0,0
1099,TEST,0,0
1100,TEST,0,0
1101,TRAIN,0,0
1102,TEST,0,0
1103,TRAIN,0,0
1104,TEST,0,0
1105,TRAIN,0,0
1106,TEST,0,0
1107,TEST,0,0
1108,TEST,0,0
1109,TEST,0,0
1110,TEST,0,0
1111,TEST,0,0
1112,TEST,0,0
1113,TEST,0,0
1114,TEST,0,0
1115,TEST,0,0
1116,TEST,0,0
1117,TEST,0,0
1118,TEST,0,0
1119,TEST,0,0
1120,TEST,0,0
1121,TEST,0,0
1122,TEST,0,0
1123,TEST,0,0
1124,TEST,0,0
1125,TRAIN,0,0
1126,TEST,0,0
1127,TEST,0,0
1128,TRAIN,0,0
1129,TEST,0,0
1130,TEST,0,0
1131,TRAIN,0,0
1132,TEST,0,0
1133,TEST,0,0
1134,TEST,0,0
1135,TEST,0,0
1136,TEST,0,0
1137,TEST,0,0
1138,TEST,0,0
1139,TEST,0,0
1140,TRAIN,0,0
1141,TEST,0,0
1142,TEST,0,0
1143,TRAIN,0,0
1144,TEST,0,0
1145,TEST,0,0
1146,TEST,0,0
1147,TEST,0,0
1148,TEST,0,0
1149,TEST,0,0
1150,TEST,0,0
1151,TEST,0,0
1152,TEST,0,0
1153,TEST,0,0
1154,TEST,0,0
1155,TEST,0,0
1156,TEST,0,0
1157,TEST,0,0
1158,TEST,0,0
1159,TEST,0,0
1160,TEST,0,0
1161,TEST,0,0
1162,TEST,0,0
1163,TEST,0,0
1164,TRAIN,0,0
1165,TEST,0,0
1166,TEST,0,0
1167,TRAIN,0,0
1168,TEST,0,0
1169,TEST,0,0
1170,TEST,0,0
1171,TEST,0,0
1172,TEST,0,0
1173,TEST,0,0
1174,TEST,0,0
1175,TEST,0,0
1176,TEST,0,0
1177,TEST,0,0
1178,TEST,0,0
1179,TEST,0,0
1180,TEST,0,0
1181,TEST,0,0
1182,TEST,0,0
1183,TEST,0,0
1184,TEST,0,0
1185,TEST,0,0
1186,TEST,0,0
1187,TEST,0,0
1188,TEST,0,0
1189,TEST,0,0
1190,TEST,0,0
1191,TEST,0,0
1192,TEST,0,0
1193,TEST,0,0
1194,TEST,0,0
1195,TEST,0,0
1196,TEST,0,0
1197,TEST,0,0
1198,TEST,0,0
1199,TEST,0,0
1200,TEST,0,0
1201,TEST,0,0
1202,TEST,0,0
1203,TEST,0,0
1204,TEST,0,0
1205,TEST,0,0
1206,TEST,0,0
1207,TRAIN,0,0
1208,TEST,0,0
1209,TEST,0,0
1210,TEST,0,0
1211,TEST,0,0
1212,TEST,0,0
1213,TEST,0,0
1214,TEST,0,0
1215,TRAIN,0,0
1216,TEST,0,0
1217,TEST,0,0
1218,TRAIN,0,0
1219,TEST,0,0
1220,TEST,0,0
1221,TEST,0,0
1222,TEST,0,0
1223,TEST,0,0
1224,TEST,0,0
1225,TEST,0,0
1226,TEST,0,0
1227,TEST,0,0
1228,TEST,0,0
1229,TEST,0,0
1230,TEST,0,0
1231,TEST,0,0
1232,TEST,0,0
1233,TEST,0,0
1234,TEST,0,0
1235,TEST,0,0
1236,TEST,0,0
1237,TEST,0,0
1238,TEST,0,0
1239,TEST,0,0
1240,TRAIN,0,0
1241,TEST,0,0
1242,TEST,0,0
1243,TEST,0,0
1244,TEST,0,0
1245,TEST,0,0
1246,TEST,0,0
1247,TEST,0,0
1248,TEST,0,0
1249,TEST,0,0
1250,TEST,0,0
1251,TEST,0,0
1252,TRAIN,0,0
1253,TEST,0,0
1254,TEST,0,0
1255,TEST,0,0
1256,TEST,0,0
1257,TRAIN,0,0
1258,TEST,0,0
1259,TEST,0,0
1260,TEST,0,0
1261,TEST,0,0
1262,TEST,0,0
1263,TRAIN,0,0
1264,TEST,0,0
1265,TEST,0,0
1266,TEST,0,0
1267,TRAIN,0,0
1268,TEST,0,0
1269,TEST,0,0
1270,TEST,0,0
1271,TEST,0,0
1272,TEST,0,0
1273,TRAIN,0,0
1274,TEST,0,0
1275,TEST,0,0
1276,TEST,0,0
1277,TEST,0,0
1278,TEST,0,0
1279,TEST,0,0
1280,TRAIN,0,0
1281,TEST,0,0
1282,TRAIN,0,0
1283,TEST,0,0
1284,TEST,0,0
1285,TEST,0,0
1286,TRAIN,0,0
1287,TEST,0,0
1288,TEST,0,0
1289,TEST,0,0
1290,TEST,0,0
1291,TEST,0,0
1292,TEST,0,0
1293,TEST,0,0
1294,TEST,0,0
1295,TEST,0,0
1296,TEST,0,0
1297,TEST,0,0
1298,TEST,0,0
1299,TEST,0,0
1300,TEST,0,0
1301,TRAIN,0,0
1302,TEST,0,0
1303,TEST,0,0
1304,TEST,0,0
1305,TRAIN,0,0
1306,TEST,0,0
1307,TEST,0,0
1308,TEST,0,0
1309,TEST,0,0
1310,TRAIN,0,0
1311,TEST,0,0
1312,TEST,0,0
1313,TEST,0,0
1314,TEST,0,0
1315,TEST,0,0
1316,TEST,0,0
1317,TEST,0,0
1318,TRAIN,0,0
1319,TEST,0,0
1320,TEST,0,0
1321,TEST,0,0
1322,TEST,0,0
1323,TRAIN,0,0
1324,TEST,0,0
1325,TEST,0,0
1326,TEST,0,0
1327,TRAIN,0,0
1328,TEST,0,0
1329,TEST,0,0
1330,TRAIN,0,0
1331,TEST,0,0
1332,TEST,0,0
1333,TEST,0,0
1334,TEST,0,0
1335,TEST,0,0
1336,TEST,0,0
1337,TRAIN,0,0
1338,TEST,0,0
1339,TEST,0,0
1340,TEST,0,0
1341,TEST,0,0
1342,TEST,0,0
1343,TEST,0,0
1344,TEST,0,0
1345,TEST,0,0
1346,TEST,0,0
1347,TEST,0,0
1348,TEST,0,0
1349,TEST,0,0
1350,TEST,0,0
1351,TRAIN,0,0
1352,TRAIN,0,0
1353,TEST,0,0
1354,TEST,0,0
1355,TEST,0,0
1356,TEST,0,0
1357,TEST,0,0
1358,TEST,0,0
1359,TEST,0,0
1360,TEST,0,0
1361,TEST,0,0
1362,TEST,0,0
1363,TEST,0,0
1364,TRAIN,0,0
1365,TEST,0,0
1366,TEST,0,0
1367,TEST,0,0
1368,TEST,0,0
1369,TEST,0,0
1370,TEST,0,0
1371,TEST,0,0
1372,TEST,0,0
1373,TEST,0,0
1374,TEST,0,0
1375,TEST,0,0
1376,TEST,0,0
1377,TEST,0,0
1378,TEST,0,0
1379,TEST,0,0
1380,TEST,0,0
1381,TEST,0,0
1382,TEST,0,0
1383,TEST,0,0
1384,TEST,0,0
1385,TEST,0,0
1386,TEST,0,0
1387,TEST,0,0
1388,TEST,0,0
1389,TEST,0,0
1390,TEST,0,0
1391,TEST,0,0
1392,TEST,0,0
1393,TEST,0,0
1394,TEST,0,0
1395,TEST,0,0
1396,TEST,0,0
1397,TEST,0,0
1398,TRAIN,0,0
1399,TEST,0,0
1400,TEST,0,0
1401,TEST,0,0
1402,TEST,0,0
1403,TEST,0,0
1404,TEST,0,0
1405,TEST,0,0
1406,TEST,0,0
1407,TEST,0,0
1408,TEST,0,0
1409,TEST,0,0
1410,TEST,0,0
1411,TEST,0,0
1412,TRAIN,0,0
1413,TEST,0,0
1414,TEST,0,0
1415,TEST,0,0
1416,TEST,0,0
1417,TEST,0,0
1418,TEST,0,0
1419,TEST,0,0
1420,TEST,0,0
1421,TRAIN,0,0
1422,TEST,0,0
1423,TEST,0,0
1424,TEST,0,0
1425,TEST,0,0
1426,TEST,0,0
1427,TEST,0,0
1428,TEST,0,0
1429,TEST,0,0
1430,TEST,0,0
1431,TEST,0,0
1432,TEST,0,0
1433,TEST,0,0
1434,TRAIN,0,0
1435,TEST,0,0
1436,TEST,0,0
1437,TEST,0,0
1438,TEST,0,0
1439,TEST,0,0
1440,TEST,0,0
1441,TEST,0,0
1442,TEST,0,0
1443,TEST,0,0
1444,TEST,0,0
1445,TEST,0,0
1446,TEST,0,0
1447,TEST,0,0
1448,TEST,0,0
1449,TEST,0,0
1450,TEST,0,0
1451,TEST,0,0
1452,TEST,0,0
1453,TEST,0,0
1454,TEST,0,0
1455,TEST,0,0
1456,TEST,0,0
1457,TEST,0,0
1458,TEST,0,0
1459,TEST,0,0
1460,TEST,0,0
1461,TEST,0,0
1462,TEST,0,0
1463,TEST,0,0
1464,TEST,0,0
1465,TRAIN,0,0
1466,TEST,0,0
1467,TEST,0,0
1468,TEST,0,0
1469,TEST,0,0
1470,TEST,0,0
1471,TEST,0,0
1472,TEST,0,0
1473,TEST,0,0
1474,TEST,0,0
1475,TEST,0,0
1476,TEST,0,0
1477,TEST,0,0
1478,TEST,0,0
1479,TEST,0,0
1480,TEST,0,0
1481,TEST,0,0
1482,TEST,0,0
1483,TEST,0,0
1484,TEST,0,0
1485,TEST,0,0
1486,TEST,0,0
1487,TEST,0,0
1488,TEST,0,0
1489,TEST,0,0
1490,TEST,0,0
1491,TEST,0,0
1492,TEST,0,0
1493,TEST,0,0
1494,TRAIN,0,0
1495,TRAIN,0,0
1496,TEST,0,0
1497,TEST,0,0
1498,TEST,0,0
1499,TRAIN,0,0
1500,TEST,0,0
1501,TEST,0,0
1502,TEST,0,0
1503,TEST,0,0
1504,TRAIN,0,0
1505,TEST,0,0
1506,TEST,0,0
1507,TEST,0,0
1508,TRAIN,0,0
1509,TEST,0,0
1510,TEST,0,0
1511,TEST,0,0
1512,TRAIN,0,0
1513,TEST,0,0
1514,TEST,0,0
1515,TEST,0,0
1516,TEST,0,0
1517,TEST,0,0
1518,TEST,0,0
1519,TEST,0,0
1520,TEST,0,0
1521,TRAIN,0,0
1522,TEST,0,0
1523,TEST,0,0
1524,TRAIN,0,0
1525,TEST,0,0
1526,TEST,0,0
1527,TEST,0,0
1528,TEST,0,0
1529,TEST,0,0
1530,TEST,0,0
1531,TEST,0,0
1532,TEST,0,0
1533,TEST,0,0
1534,TEST,0,0
1535,TEST,0,0
1536,TEST,0,0
1537,TEST,0,0
1538,TEST,0,0
1539,TEST,0,0
1540,TEST,0,0
1541,TEST,0,0
1542,TRAIN,0,0
1543,TRAIN,0,0
1544,TRAIN,0,0
1545,TEST,0,0
1546,TEST,0,0
1547,TEST,0,0
1548,TEST,0,0
1549,TEST,0,0
1550,TEST,0,0
1551,TEST,0,0
1552,TEST,0,0
1553,TEST,0,0
1554,TEST,0,0
1555,TEST,0,0
1556,TEST,0,0
1557,TEST,0,0
1558,TEST,0,0
1559,TEST,0,0
1560,TEST,0,0
1561,TEST,0,0
1562,TEST,0,0
1563,TEST,0,0
1564,TEST,0,0
1565,TEST,0,0
1566,TEST,0,0
1567,TEST,0,0
1568,TEST,0,0
1569,TEST,0,0
1570,TEST,0,0
1571,TEST,0,0
1572,TRAIN,0,0
1573,TEST,0,0
1574,TEST,0,0
1575,TEST,0,0
1576,TEST,0,0
1577,TEST,0,0
1578,TEST,0,0
1579,TRAIN,0,0
1580,TEST,0,0
1581,TEST,0,0
1582,TEST,0,0
1583,TEST,0,0
1584,TEST,0,0
1585,TEST,0,0
1586,TEST,0,0
1587,TEST,0,0
1588,TEST,0,0
1589,TEST,0,0
1590,TEST,0,0
1591,TEST,0,0
1592,TEST,0,0
1593,TEST,0,0
1594,TEST,0,0
1595,TEST,0,0
1596,TEST,0,0
1597,TEST,0,0
1598,TEST,0,0
1599,TEST,0,0
1600,TEST,0,0
1601,TEST,0,0
1602,TEST,0,0
1603,TEST,0,0
1604,TEST,0,0
1605,TEST,0,0
1606,TEST,0,0
1607,TEST,0,0
1608,TEST,0,0
1609,TEST,0,0
1610,TEST,0,0
1611,TEST,0,0
1612,TRAIN,0,0
1613,TEST,0,0
1614,TEST,0,0
1615,TEST,0,0
1616,TEST,0,0
1617,TEST,0,0
1618,TEST,0,0
1619,TEST,0,0
1620,TEST,0,0
1621,TEST,0,0
1622,TEST,0,0
1623,TEST,0,0
1624,TEST,0,0
1625,TEST,0,0
1626,TEST,0,0
1627,TEST,0,0
1628,TEST,0,0
1629,TEST,0,0
1630,TEST,0,0
1631,TRAIN,0,0
1632,TEST,0,0
1633,TEST,0,0
1634,TEST,0,0
1635,TEST,0,0
1636,TEST,0,0
1637,TEST,0,0
1638,TEST,0,0
1639,TEST,0,0
1640,TEST,0,0
1641,TEST,0,0
1642,TRAIN,0,0
1643,TEST,0,0
1644,TEST,0,0
1645,TEST,0,0
1646,TEST,0,0
1647,TEST,0,0
1648,TEST,0,0
1649,TRAIN,0,0
1650,TEST,0,0
1651,TEST,0,0
1652,TEST,0,0
1653,TEST,0,0
1654,TEST,0,0
1655,TEST,0,0
1656,TEST,0,0
1657,TEST,0,0
1658,TEST,0,0
1659,TEST,0,0
1660,TEST,0,0
1661,TEST,0,0
1662,TEST,0,0
1663,TEST,0,0
1664,TEST,0,0
1665,TRAIN,0,0
1666,TEST,0,0
1667,TEST,0,0
1668,TEST,0,0
1669,TEST,0,0
1670,TEST,0,0
1671,TEST,0,0
1672,TRAIN,0,0
1673,TEST,0,0
1674,TEST,0,0
1675,TEST,0,0
1676,TEST,0,0
1677,TRAIN,0,0
1678,TEST,0,0
1679,TEST,0,0
1680,TEST,0,0
1681,TEST,0,0
1682,TRAIN,0,0
1683,TEST,0,0
1684,TEST,0,0
1685,TEST,0,0
1686,TEST,0,0
1687,TEST,0,0
1688,TEST,0,0
1689,TEST,0,0
1690,TEST,0,0
1691,TEST,0,0
1692,TRAIN,0,0
1693,TEST,0,0
1694,TRAIN,0,0
1695,TEST,0,0
1696,TEST,0,0
1697,TEST,0,0
1698,TEST,0,0
1699,TEST,0,0
1700,TEST,0,0
1701,TRAIN,0,0
1702,TEST,0,0
1703,TEST,0,0
1704,TEST,0,0
1705,TEST,0,0
1706,TEST,0,0
1707,TEST,0,0
1708,TEST,0,0
1709,TEST,0,0
1710,TEST,0,0
1711,TEST,0,0
1712,TEST,0,0
1713,TRAIN,0,0
1714,TEST,0,0
1715,TEST,0,0
1716,TEST,0,0
1717,TEST,0,0
1718,TEST,0,0
1719,TEST,0,0
1720,TEST,0,0
1721,TEST,0,0
1722,TEST,0,0
1723,TRAIN,0,0
1724,TEST,0,0
1725,TEST,0,0
1726,TEST,0,0
1727,TEST,0,0
1728,TEST,0,0
1729,TEST,0,0
1730,TEST,0,0
1731,TEST,0,0
1732,TEST,0,0
1733,TEST,0,0
1734,TEST,0,0
1735,TEST,0,0
1736,TEST,0,0
1737,TEST,0,0
1738,TEST,0,0
1739,TEST,0,0
1740,TEST,0,0
1741,TEST,0,0
1742,TEST,0,0
1743,TRAIN,0,0
1744,TEST,0,0
1745,TEST,0,0
1746,TEST,0,0
1747,TEST,0,0
1748,TEST,0,0
1749,TEST,0,0
1750,TRAIN,0,0
1751,TEST,0,0
1752,TEST,0,0
1753,TEST,0,0
1754,TEST,0,0
1755,TEST,0,0
1756,TEST,0,0
1757,TEST,0,0
1758,TRAIN,0,0
1759,TEST,0,0
1760,TEST,0,0
1761,TEST,0,0
1762,TEST,0,0
1763,TEST,0,0
1764,TEST,0,0
1765,TEST,0,0
1766,TEST,0,0
1767,TEST,0,0
1768,TRAIN,0,0
1769,TEST,0,0
1770,TEST,0,0
1771,TEST,0,0
1772,TEST,0,0
1773,TEST,0,0
1774,TEST,0,0
1775,TEST,0,0
1776,TEST,0,0
1777,TEST,0,0
1778,TEST,0,0
1779,TEST,0,0
1780,TEST,0,0
1781,TEST,0,0
1782,TEST,0,0
1783,TEST,0,0
1784,TEST,0,0
1785,TRAIN,0,0
1786,TEST,0,0
1787,TEST,0,0
1788,TRAIN,0,0
1789,TEST,0,0
1790,TEST,0,0
1791,TEST,0,0
1792,TRAIN,0,0
1793,TEST,0,0
1794,TEST,0,0
1795,TEST,0,0
1796,TEST,0,0
1797,TEST,0,0
1798,TRAIN,0,0
1799,TEST,0,0
1800,TRAIN,0,0
1801,TEST,0,0
1802,TEST,0,0
1803,TEST,0,0
1804,TEST,0,0
1805,TEST,0,0
1806,TEST,0,0
1807,TEST,0,0
1808,TEST,0,0
1809,TEST,0,0
1810,TEST,0,0
1811,TEST,0,0
1812,TEST,0,0
1813,TEST,0,0
1814,TEST,0,0
1815,TEST,0,0
1816,TRAIN,0,0
1817,TEST,0,0
1818,TEST,0,0
1819,TEST,0,0
1820,TRAIN,0,0
1821,TEST,0,0
1822,TEST,0,0
1823,TRAIN,0,0
1824,TEST,0,0
1825,TEST,0,0
1826,TEST,0,0
1827,TEST,0,0
1828,TEST,0,0
1829,TEST,0,0
1830,TEST,0,0
1831,TEST,0,0
1832,TEST,0,0
1833,TEST,0,0
1834,TEST,0,0
1835,TEST,0,0
1836,TEST,0,0
1837,TRAIN,0,0
1838,TEST,0,0
1839,TEST,0,0
1840,TEST,0,0
1841,TEST,0,0
1842,TEST,0,0
1843,TRAIN,0,0
1844,TRAIN,0,0
1845,TEST,0,0
1846,TEST,0,0
1847,TEST,0,0
1848,TEST,0,0
1849,TEST,0,0
1850,TRAIN,0,0
1851,TRAIN,0,0
1852,TEST,0,0
1853,TEST,0,0
1854,TRAIN,0,0
1855,TEST,0,0
1856,TEST,0,0
1857,TEST,0,0
1858,TEST,0,0
1859,TEST,0,0
1860,TEST,0,0
1861,TEST,0,0
1862,TEST,0,0
1863,TEST,0,0
1864,TEST,0,0
1865,TEST,0,0
1866,TEST,0,0
1867,TEST,0,0
1868,TEST,0,0
1869,TEST,0,0
1870,TEST,0,0
1871,TEST,0,0
1872,TEST,0,0
1873,TEST,0,0
1874,TEST,0,0
1875,TEST,0,0
1876,TEST,0,0
1877,TEST,0,0
1878,TEST,0,0
1879,TEST,0,0
1880,TRAIN,0,0
1881,TEST,0,0
1882,TEST,0,0
1883,TEST,0,0
1884,TEST,0,0
1885,TEST,0,0
1886,TEST,0,0
1887,TEST,0,0
1888,TEST,0,0
1889,TEST,0,0
1890,TEST,0,0
1891,TEST,0,0
1892,TEST,0,0
1893,TEST,0,0
1894,TEST,0,0
1895,TEST,0,0
1896,TEST,0,0
1897,TEST,0,0
1898,TEST,0,0
1899,TEST,0,0
1900,TEST,0,0
1901,TEST,0,0
1902,TEST,0,0
1903,TEST,0,0
1904,TRAIN,0,0
1905,TEST,0,0
1906,TEST,0,0
1907,TEST,0,0
1908,TEST,0,0
1909,TEST,0,0
1910,TEST,0,0
1911,TEST,0,0
1912,TEST,0,0
1913,TEST,0,0
1914,TEST,0,0
1915,TEST,0,0
1916,TEST,0,0
1917,TEST,0,0
1918,TEST,0,0
1919,TEST,0,0
1920,TEST,0,0
1921,TEST,0,0
1922,TRAIN,0,0
1923,TEST,0,0
1924,TEST,0,0
1925,TRAIN,0,0
1926,TRAIN,0,0
1927,TEST,0,0
1928,TRAIN,0,0
1929,TEST,0,0
1930,TEST,0,0
1931,TEST,0,0
1932,TEST,0,0
1933,TRAIN,0,0
1934,TEST,0,0
1935,TEST,0,0
1936,TEST,0,0
1937,TEST,0,0
1938,TEST,0,0
1939,TEST,0,0
1940,TEST,0,0
1941,TEST,0,0
1942,TRAIN,0,0
1943,TEST,0,0
1944,TEST,0,0
1945,TEST,0,0
1946,TEST,0,0
1947,TEST,0,0
1948,TRAIN,0,0
1949,TEST,0,0
1950,TEST,0,0
1951,TEST,0,0
1952,TEST,0,0
1953,TEST,0,0
1954,TEST,0,0
1955,TRAIN,0,0
1956,TEST,0,0
1957,TEST,0,0
1958,TEST,0,0
1959,TEST,0,0
1960,TEST,0,0
1961,TEST,0,0
1962,TEST,0,0
1963,TEST,0,0
1964,TEST,0,0
1965,TEST,0,0
1966,TEST,0,0
1967,TRAIN,0,0
1968,TEST,0,0
1969,TEST,0,0
1970,TEST,0,0
1971,TEST,0,0
1972,TEST,0,0
1973,TEST,0,0
1974,TEST,0,0
1975,TEST,0,0
1976,TEST,0,0
1977,TEST,0,0
1978,TEST,0,0
1979,TEST,0,0
1980,TEST,0,0
1981,TRAIN,0,0
1982,TEST,0,0
1983,TEST,0,0
1984,TEST,0,0
1985,TEST,0,0
1986,TEST,0,0
1987,TEST,0,0
1988,TEST,0,0
1989,TEST,0,0
1990,TEST,0,0
1991,TEST,0,0
1992,TEST,0,0
1993,TEST,0,0
1994,TEST,0,0
1995,TEST,0,0
1996,TEST,0,0
1997,TEST,0,0
1998,TEST,0,0
1999,TEST,0,0
2000,TEST,0,0
2001,TEST,0,0
2002,TRAIN,0,0
2003,TEST,0,0
2004,TEST,0,0
2005,TEST,0,0
2006,TEST,0,0
2007,TEST,0,0
2008,TEST,0,0
2009,TRAIN,0,0
2010,TEST,0,0
2011,TEST,0,0
2012,TEST,0,0
2013,TEST,0,0
2014,TEST,0,0
2015,TEST,0,0
2016,TRAIN,0,0
2017,TRAIN,0,0
2018,TEST,0,0
2019,TEST,0,0
2020,TRAIN,0,0
2021,TEST,0,0
2022,TEST,0,0
2023,TEST,0,0
2024,TEST,0,0
2025,TEST,0,0
2026,TEST,0,0
2027,TEST,0,0
2028,TRAIN,0,0
2029,TEST,0,0
2030,TEST,0,0
2031,TEST,0,0
2032,TEST,0,0
2033,TEST,0,0
2034,TEST,0,0
2035,TEST,0,0
2036,TEST,0,0
2037,TEST,0,0
2038,TEST,0,0
2039,TEST,0,0
2040,TEST,0,0
2041,TEST,0,0
2042,TEST,0,0
2043,TRAIN,0,0
2044,TRAIN,0,0
2045,TEST,0,0
2046,TEST,0,0
2047,TRAIN,0,0
2048,TRAIN,0,0
2049,TEST,0,0
2050,TEST,0,0
2051,TEST,0,0
2052,TEST,0,0
2053,TEST,0,0
2054,TEST,0,0
2055,TEST,0,0
2056,TEST,0,0
2057,TRAIN,0,0
2058,TEST,0,0
2059,TEST,0,0
2060,TEST,0,0
2061,TEST,0,0
2062,TRAIN,0,0
2063,TEST,0,0
2064,TRAIN,0,0
2065,TRAIN,0,0
2066,TEST,0,0
2067,TEST,0,0
2068,TRAIN,0,0
2069,TEST,0,0
2070,TEST,0,0
2071,TEST,0,0
2072,TEST,0,0
2073,TEST,0,0
2074,TEST,0,0
2075,TEST,0,0
2076,TEST,0,0
2077,TEST,0,0
2078,TEST,0,0
2079,TEST,0,0
2080,TEST,0,0
2081,TEST,0,0
2082,TEST,0,0
2083,TEST,0,0
2084,TEST,0,0
2085,TEST,0,0
2086,TEST,0,0
2087,TEST,0,0
2088,TEST,0,0
2089,TEST,0,0
2090,TEST,0,0
2091,TEST,0,0
2092,TEST,0,0
2093,TEST,0,0
2094,TEST,0,0
2095,TEST,0,0
2096,TEST,0,0
2097,TEST,0,0
2098,TEST,0,0
2099,TEST,0,0
2100,TEST,0,0
2101,TEST,0,0
2102,TEST,0,0
2103,TEST,0,0
2104,TEST,0,0
2105,TEST,0,0
2106,TEST,0,0
2107,TEST,0,0
2108,TEST,0,0
2109,TEST,0,0
2110,TEST,0,0
2111,TEST,0,0
2112,TEST,0,0
2113,TEST,0,0
2114,TEST,0,0
2115,TEST,0,0
2116,TEST,0,0
2117,TEST,0,0
2118,TEST,0,0
2119,TRAIN,0,0
2120,TEST,0,0
2121,TEST,0,0
2122,TEST,0,0
2123,TEST,0,0
2124,TRAIN,0,0
2125,TEST,0,0
2126,TEST,0,0
2127,TEST,0,0
2128,TEST,0,0
2129,TEST,0,0
2130,TEST,0,0
2131,TEST,0,0
2132,TEST,0,0
2133,TEST,0,0
2134,TEST,0,0
2135,TEST,0,0
2136,TEST,0,0
2137,TEST,0,0
2138,TEST,0,0
2139,TEST,0,0
2140,TEST,0,0
2141,TRAIN,0,0
2142,TEST,0,0
2143,TEST,0,0
2144,TEST,0,0
2145,TRAIN,0,0
2146,TEST,0,0
2147,TEST,0,0
2148,TEST,0,0
2149,TEST,0,0
2150,TEST,0,0
2151,TEST,0,0
2152,TEST,0,0
2153,TEST,0,0
2154,TEST,0,0
2155,TEST,0,0
2156,TEST,0,0
2157,TEST,0,0
2158,TEST,0,0
2159,TEST,0,0
2160,TRAIN,0,0
2161,TEST,0,0
2162,TEST,0,0
2163,TEST,0,0
2164,TEST,0,0
2165,TEST,0,0
2166,TEST,0,0
2167,TEST,0,0
2168,TEST,0,0
2169,TRAIN,0,0
2170,TEST,0,0
2171,TEST,0,0
2172,TEST,0,0
2173,TEST,0,0
2174,TEST,0,0
2175,TEST,0,0
2176,TEST,0,0
2177,TRAIN,0,0
2178,TEST,0,0
2179,TEST,0,0
2180,TEST,0,0
2181,TEST,0,0
2182,TEST,0,0
2183,TEST,0,0
2184,TEST,0,0
2185,TEST,0,0
2186,TEST,0,0
2187,TEST,0,0
2188,TEST,0,0
2189,TEST,0,0
2190,TEST,0,0
2191,TEST,0,0
2192,TEST,0,0
2193,TRAIN,0,0
2194,TRAIN,0,0
2195,TEST,0,0
2196,TEST,0,0
2197,TEST,0,0
2198,TEST,0,0
2199,TEST,0,0
2200,TEST,0,0
2201,TEST,0,0
2202,TEST,0,0
2203,TEST,0,0
2204,TEST,0,0
2205,TEST,0,0
2206,TEST,0,0
2207,TEST,0,0
2208,TEST,0,0
2209,TEST,0,0
2210,TEST,0,0
2211,TEST,0,0
2212,TEST,0,0
2213,TEST,0,0
2214,TRAIN,0,0
2215,TEST,0,0
2216,TRAIN,0,0
2217,TEST,0,0
2218,TEST,0,0
2219,TEST,0,0
2220,TEST,0,0
2221,TEST,0,0
2222,TEST,0,0
2223,TEST,0,0
2224,TEST,0,0
2225,TEST,0,0
2226,TEST,0,0
2227,TEST,0,0
2228,TEST,0,0
2229,TEST,0,0
2230,TEST,0,0
2231,TEST,0,0
2232,TEST,0,0
2233,TEST,0,0
2234,TEST,0,0
2235,TEST,0,0
2236,TEST,0,0
2237,TEST,0,0
2238,TEST,0,0
2239,TEST,0,0
2240,TEST,0,0
2241,TRAIN,0,0
2242,TEST,0,0
2243,TEST,0,0
2244,TEST,0,0
2245,TEST,0,0
2246,TEST,0,0
2247,TEST,0,0
2248,TEST,0,0
2249,TEST,0,0
2250,TRAIN,0,0
2251,TEST,0,0
2252,TEST,0,0
2253,TEST,0,0
2254,TRAIN,0,0
2255,TEST,0,0
2256,TEST,0,0
2257,TEST,0,0
2258,TEST,0,0
2259,TEST,0,0
2260,TEST,0,0
2261,TEST,0,0
2262,TEST,0,0
2263,TEST,0,0
2264,TEST,0,0
2265,TEST,0,0
2266,TEST,0,0
2267,TEST,0,0
2268,TEST,0,0
2269,TEST,0,0
2270,TEST,0,0
2271,TEST,0,0
2272,TEST,0,0
2273,TEST,0,0
2274,TRAIN,0,0
2275,TRAIN,0,0
2276,TEST,0,0
2277,TEST,0,0
2278,TEST,0,0
2279,TRAIN,0,0
2280,TEST,0,0
2281,TEST,0,0
2282,TEST,0,0
2283,TEST,0,0
2284,TEST,0,0
2285,TEST,0,0
2286,TEST,0,0
2287,TEST,0,0
2288,TEST,0,0
2289,TEST,0,0
2290,TEST,0,0
2291,TEST,0,0
2292,TEST,0,0
2293,TEST,0,0
2294,TEST,0,0
2295,TEST,0,0
2296,TEST,0,0
2297,TEST,0,0
2298,TEST,0,0
2299,TEST,0,0
2300,TEST,0,0
2301,TEST,0,0
2302,TEST,0,0
2303,TEST,0,0
2304,TEST,0,0
2305,TEST,0,0
2306,TEST,0,0
2307,TEST,0,0
2308,TEST,0,0
2309,TEST,0,0
2310,TRAIN,0,0
2311,TEST,0,0
2312,TEST,0,0
2313,TEST,0,0
2314,TEST,0,0
2315,TEST,0,0
2316,TEST,0,0
2317,TEST,0,0
2318,TEST,0,0
2319,TEST,0,0
2320,TEST,0,0
2321,TEST,0,0
2322,TEST,0,0
2323,TEST,0,0
2324,TEST,0,0
2325,TEST,0,0
2326,TEST,0,0
2327,TEST,0,0
2328,TEST,0,0
2329,TEST,0,0
2330,TEST,0,0
2331,TEST,0,0
2332,TEST,0,0
2333,TEST,0,0
2334,TEST,0,0
2335,TEST,0,0
2336,TRAIN,0,0
2337,TEST,0,0
2338,TEST,0,0
2339,TEST,0,0
2340,TEST,0,0
2341,TEST,0,0
2342,TEST,0,0
2343,TEST,0,0
2344,TEST,0,0
2345,TEST,0,0
2346,TEST,0,0
2347,TEST,0,0
2348,TEST,0,0
2349,TEST,0,0
2350,TEST,0,0
2351,TEST,0,0
2352,TEST,0,0
2353,TEST,0,0
2354,TEST,0,0
2355,TEST,0,0
2356,TEST,0,0
2357,TRAIN,0,0
2358,TEST,0,0
2359,TEST,0,0
2360,TEST,0,0
2361,TEST,0,0
2362,TEST,0,0
2363,TEST,0,0
2364,TRAIN,0,0
2365,TEST,0,0
2366,TEST,0,0
2367,TEST,0,0
2368,TEST,0,0
2369,TEST,0,0
2370,TEST,0,0
2371,TEST,0,0
2372,TEST,0,0
2373,TEST,0,0
2374,TEST,0,0
2375,TEST,0,0
2376,TEST,0,0
2377,TEST,0,0
2378,TEST,0,0
2379,TEST,0,0
2380,TEST,0,0
2381,TRAIN,0,0
2382,TEST,0,0
2383,TEST,0,0
2384,TEST,0,0
2385,TEST,0,0
2386,TEST,0,0
2387,TRAIN,0,0
2388,TEST,0,0
2389,TRAIN,0,0
2390,TEST,0,0
2391,TEST,0,0
2392,TEST,0,0
2393,TEST,0,0
2394,TEST,0,0
2395,TEST,0,0
2396,TEST,0,0
2397,TRAIN,0,0
2398,TEST,0,0
2399,TEST,0,0
2400,TEST,0,0
2401,TRAIN,0,0
2402,TEST,0,0
2403,TRAIN,0,0
2404,TEST,0,0
2405,TEST,0,0
2406,TEST,0,0
2407,TEST,0,0
2408,TEST,0,0
2409,TEST,0,0
2410,TEST,0,0
2411,TRAIN,0,0
2412,TEST,0,0
2413,TEST,0,0
2414,TEST,0,0
2415,TEST,0,0
2416,TEST,0,0
2417,TRAIN,0,0
2418,TEST,0,0
2419,TEST,0,0
2420,TEST,0,0
2421,TEST,0,0
2422,TEST,0,0
2423,TEST,0,0
2424,TEST,0,0
2425,TRAIN,0,0
2426,TEST,0,0
2427,TEST,0,0
2428,TEST,0,0
2429,TEST,0,0
2430,TEST,0,0
2431,TEST,0,0
2432,TEST,0,0
2433,TEST,0,0
2434,TEST,0,0
2435,TEST,0,0
2436,TEST,0,0
2437,TEST,0,0
2438,TEST,0,0
2439,TEST,0,0
2440,TEST,0,0
2441,TEST,0,0
2442,TEST,0,0
2443,TEST,0,0
2444,TEST,0,0
2445,TEST,0,0
2446,TEST,0,0
2447,TEST,0,0
2448,TEST,0,0
2449,TEST,0,0
2450,TRAIN,0,0
2451,TEST,0,0
2452,TEST,0,0
2453,TRAIN,0,0
2454,TEST,0,0
2455,TEST,0,0
2456,TEST,0,0
2457,TEST,0,0
2458,TEST,0,0
2459,TEST,0,0
2460,TEST,0,0
2461,TEST,0,0
2462,TEST,0,0
2463,TEST,0,0
2464,TEST,0,0
2465,TEST,0,0
2466,TEST,0,0
2467,TEST,0,0
2468,TEST,0,0
2469,TEST,0,0
2470,TEST,0,0
2471,TEST,0,0
2472,TEST,0,0
2473,TEST,0,0
2474,TEST,0,0
2475,TRAIN,0,0
2476,TEST,0,0
2477,TEST,0,0
2478,TEST,0,0
2479,TEST,0,0
2480,TEST,0,0
2481,TEST,0,0
2482,TEST,0,0
2483,TRAIN,0,0
2484,TEST,0,0
2485,TEST,0,0
2486,TEST,0,0
2487,TEST,0,0
2488,TEST,0,0
2489,TEST,0,0
2490,TEST,0,0
2491,TEST,0,0
2492,TEST,0,0
2493,TEST,0,0
2494,TEST,0,0
2495,TEST,0,0
2496,TEST,0,0
2497,TEST,0,0
2498,TEST,0,0
2499,TEST,0,0
2500,TRAIN,0,0
2501,TRAIN,0,0
2502,TEST,0,0
2503,TEST,0,0
2504,TEST,0,0
2505,TEST,0,0
2506,TEST,0,0
2507,TEST,0,0
2508,TEST,0,0
2509,TEST,0,0
2510,TEST,0,0
2511,TRAIN,0,0
2512,TEST,0,0
2513,TEST,0,0
2514,TRAIN,0,0
2515,TEST,0,0
2516,TEST,0,0
2517,TEST,0,0
2518,TEST,0,0
2519,TEST,0,0
2520,TEST,0,0
2521,TRAIN,0,0
2522,TEST,0,0
2523,TEST,0,0
2524,TEST,0,0
2525,TEST,0,0
2526,TEST,0,0
2527,TEST,0,0
2528,TEST,0,0
2529,TEST,0,0
2530,TEST,0,0
2531,TEST,0,0
2532,TEST,0,0
2533,TEST,0,0
2534,TEST,0,0
2535,TEST,0,0
2536,TEST,0,0
2537,TEST,0,0
2538,TEST,0,0
2539,TEST,0,0
2540,TRAIN,0,0
2541,TEST,0,0
2542,TEST,0,0
2543,TEST,0,0
2544,TEST,0,0
2545,TEST,0,0
2546,TEST,0,0
2547,TEST,0,0
2548,TEST,0,0
2549,TEST,0,0
2550,TEST,0,0
2551,TEST,0,0
2552,TEST,0,0
2553,TEST,0,0
2554,TEST,0,0
2555,TEST,0,0
2556,TEST,0,0
2557,TEST,0,0
2558,TEST,0,0
2559,TEST,0,0
2560,TEST,0,0
2561,TEST,0,0
2562,TEST,0,0
2563,TEST,0,0
2564,TRAIN,0,0
2565,TEST,0,0
2566,TEST,0,0
2567,TEST,0,0
2568,TEST,0,0
2569,TEST,0,0
2570,TEST,0,0
2571,TEST,0,0
2572,TEST,0,0
2573,TEST,0,0
2574,TEST,0,0
2575,TEST,0,0
2576,TRAIN,0,0
2577,TEST,0,0
2578,TEST,0,0
2579,TEST,0,0
2580,TEST,0,0
2581,TRAIN,0,0
2582,TEST,0,0
2583,TRAIN,0,0
2584,TEST,0,0
2585,TEST,0,0
2586,TEST,0,0
2587,TEST,0,0
2588,TRAIN,0,0
2589,TEST,0,0
2590,TRAIN,0,0
2591,TEST,0,0
2592,TRAIN,0,0
2593,TEST,0,0
2594,TEST,0,0
2595,TRAIN,0,0
2596,TEST,0,0
2597,TEST,0,0
2598,TEST,0,0
2599,TRAIN,0,0
2600,TEST,0,0
2601,TEST,0,0
2602,TEST,0,0
2603,TEST,0,0
2604,TEST,0,0
2605,TEST,0,0
2606,TEST,0,0
2607,TEST,0,0
2608,TEST,0,0
2609,TEST,0,0
2610,TEST,0,0
2611,TEST,0,0
2612,TEST,0,0
2613,TEST,0,0
2614,TEST,0,0
2615,TEST,0,0
2616,TEST,0,0
2617,TRAIN,0,0
2618,TEST,0,0
2619,TEST,0,0
2620,TEST,0,0
2621,TEST,0,0
2622,TEST,0,0
2623,TRAIN,0,0
2624,TEST,0,0
2625,TEST,0,0
2626,TRAIN,0,0
2627,TRAIN,0,0
2628,TEST,0,0
2629,TEST,0,0
2630,TEST,0,0
2631,TEST,0,0
2632,TEST,0,0
2633,TEST,0,0
2634,TEST,0,0
2635,TEST,0,0
2636,TEST,0,0
2637,TEST,0,0
2638,TEST,0,0
2639,TEST,0,0
2640,TRAIN,0,0
2641,TEST,0,0
2642,TEST,0,0
2643,TEST,0,0
2644,TEST,0,0
2645,TEST,0,0
2646,TEST,0,0
2647,TEST,0,0
2648,TEST,0,0
2649,TEST,0,0
2650,TEST,0,0
2651,TEST,0,0
2652,TEST,0,0
2653,TEST,0,0
2654,TEST,0,0
2655,TEST,0,0
2656,TEST,0,0
2657,TEST,0,0
2658,TEST,0,0
2659,TEST,0,0
2660,TRAIN,0,0
2661,TEST,0,0
2662,TEST,0,0
2663,TEST,0,0
2664,TEST,0,0
2665,TEST,0,0
2666,TEST,0,0
2667,TEST,0,0
2668,TEST,0,0
2669,TEST,0,0
2670,TEST,0,0
2671,TEST,0,0
2672,TRAIN,0,0
2673,TEST,0,0
2674,TEST,0,0
2675,TEST,0,0
2676,TEST,0,0
2677,TRAIN,0,0
2678,TEST,0,0
2679,TEST,0,0
2680,TEST,0,0
2681,TEST,0,0
2682,TEST,0,0
2683,TEST,0,0
2684,TEST,0,0
2685,TEST,0,0
2686,TEST,0,0
2687,TEST,0,0
2688,TEST,0,0
2689,TEST,0,0
2690,TEST,0,0
2691,TEST,0,0
2692,TEST,0,0
2693,TEST,0,0
2694,TEST,0,0
2695,TEST,0,0
2696,TEST,0,0
2697,TEST,0,0
2698,TEST,0,0
2699,TEST,0,0
2700,TEST,0,0
2701,TEST,0,0
2702,TEST,0,0
2703,TEST,0,0
2704,TEST,0,0
2705,TEST,0,0
2706,TEST,0,0
2707,TEST,0,0
2708,TEST,0,0
2709,TEST,0,0
2710,TEST,0,0
2711,TEST,0,0
2712,TEST,0,0
2713,TEST,0,0
2714,TEST,0,0
2715,TEST,0,0
2716,TEST,0,0
2717,TRAIN,0,0
2718,TEST,0,0
2719,TEST,0,0
2720,TEST,0,0
2721,TEST,0,0
2722,TEST,0,0
2723,TEST,0,0
2724,TEST,0,0
2725,TEST,0,0
2726,TEST,0,0
2727,TRAIN,0,0
2728,TEST,0,0
2729,TEST,0,0
2730,TEST,0,0
2731,TEST,0,0
2732,TEST,0,0
2733,TEST,0,0
2734,TEST,0,0
2735,TEST,0,0
2736,TEST,0,0
2737,TEST,0,0
2738,TEST,0,0
2739,TEST,0,0
2740,TEST,0,0
2741,TEST,0,0
2742,TEST,0,0
2743,TEST,0,0
2744,TRAIN,0,0
2745,TRAIN,0,0
2746,TEST,0,0
2747,TEST,0,0
2748,TEST,0,0
2749,TEST,0,0
2750,TEST,0,0
2751,TEST,0,0
2752,TEST,0,0
2753,TEST,0,0
2754,TEST,0,0
2755,TEST,0,0
2756,TEST,0,0
2757,TEST,0,0
2758,TEST,0,0
2759,TEST,0,0
2760,TEST,0,0
2761,TEST,0,0
2762,TEST,0,0
2763,TEST,0,0
2764,TEST,0,0
2765,TEST,0,0
2766,TEST,0,0
2767,TEST,0,0
2768,TEST,0,0
2769,TEST,0,0
2770,TEST,0,0
2771,TEST,0,0
2772,TEST,0,0
2773,TEST,0,0
2774,TEST,0,0
2775,TEST,0,0
2776,TEST,0,0
2777,TEST,0,0
2778,TEST,0,0
2779,TEST,0,0
2780,TEST,0,0
2781,TEST,0,0
2782,TRAIN,0,0
2783,TEST,0,0
2784,TRAIN,0,0
2785,TEST,0,0
2786,TEST,0,0
2787,TEST,0,0
2788,TRAIN,0,0
2789,TEST,0,0
2790,TEST,0,0
2791,TEST,0,0
2792,TEST,0,0
2793,TEST,0,0
2794,TEST,0,0
2795,TEST,0,0
2796,TEST,0,0
2797,TEST,0,0
2798,TEST,0,0
2799,TEST,0,0
2800,TEST,0,0
2801,TEST,0,0
2802,TEST,0,0
2803,TEST,0,0
2804,TRAIN,0,0
2805,TEST,0,0
2806,TEST,0,0
2807,TEST,0,0
2808,TEST,0,0
2809,TRAIN,0,0
2810,TEST,0,0
2811,TEST,0,0
2812,TEST,0,0
2813,TEST,0,0
2814,TEST,0,0
2815,TEST,0,0
2816,TEST,0,0
2817,TEST,0,0
2818,TEST,0,0
2819,TEST,0,0
2820,TEST,0,0
2821,TEST,0,0
2822,TEST,0,0
2823,TEST,0,0
2824,TEST,0,0
2825,TRAIN,0,0
2826,TRAIN,0,0
2827,TEST,0,0
2828,TEST,0,0
2829,TEST,0,0
2830,TEST,0,0
2831,TEST,0,0
2832,TEST,0,0
2833,TEST,0,0
2834,TEST,0,0
2835,TEST,0,0
2836,TEST,0,0
2837,TEST,0,0
2838,TEST,0,0
2839,TEST,0,0
2840,TEST,0,0
2841,TEST,0,0
2842,TEST,0,0
2843,TEST,0,0
2844,TEST,0,0
2845,TEST,0,0
2846,TEST,0,0
2847,TEST,0,0
2848,TEST,0,0
2849,TEST,0,0
2850,TEST,0,0
2851,TRAIN,0,0
2852,TEST,0,0
2853,TEST,0,0
2854,TEST,0,0
2855,TEST,0,0
2856,TRAIN,0,0
2857,TEST,0,0
2858,TEST,0,0
2859,TEST,0,0
2860,TEST,0,0
2861,TEST,0,0
2862,TEST,0,0
2863,TEST,0,0
2864,TEST,0,0
2865,TEST,0,0
2866,TEST,0,0
2867,TEST,0,0
2868,TEST,0,0
2869,TEST,0,0
2870,TEST,0,0
2871,TRAIN,0,0
2872,TEST,0,0
2873,TEST,0,0
2874,TEST,0,0
2875,TEST,0,0
2876,TEST,0,0
2877,TEST,0,0
2878,TEST,0,0
2879,TEST,0,0
2880,TEST,0,0
2881,TEST,0,0
2882,TEST,0,0
2883,TEST,0,0
2884,TEST,0,0
2885,TEST,0,0
2886,TRAIN,0,0
2887,TEST,0,0
2888,TEST,0,0
2889,TEST,0,0
2890,TEST,0,0
2891,TEST,0,0
2892,TEST,0,0
2893,TEST,0,0
2894,TEST,0,0
2895,TEST,0,0
2896,TEST,0,0
2897,TEST,0,0
2898,TEST,0,0
2899,TEST,0,0
2900,TEST,0,0
2901,TEST,0,0
2902,TEST,0,0
2903,TEST,0,0
2904,TEST,0,0
2905,TEST,0,0
2906,TEST,0,0
2907,TEST,0,0
2908,TEST,0,0
2909,TEST,0,0
2910,TEST,0,0
2911,TEST,0,0
2912,TEST,0,0
2913,TEST,0,0
2914,TEST,0,0
2915,TEST,0,0
2916,TEST,0,0
2917,TEST,0,0
2918,TEST,0,0
2919,TEST,0,0
2920,TEST,0,0
2921,TEST,0,0
2922,TRAIN,0,0
2923,TRAIN,0,0
2924,TEST,0,0
2925,TRAIN,0,0
2926,TEST,0,0
2927,TEST,0,0
2928,TEST,0,0
2929,TEST,0,0
2930,TEST,0,0
2931,TEST,0,0
2932,TEST,0,0
2933,TEST,0,0
2934,TEST,0,0
2935,TEST,0,0
2936,TEST,0,0
2937,TRAIN,0,0
2938,TEST,0,0
2939,TEST,0,0
2940,TEST,0,0
2941,TEST,0,0
2942,TEST,0,0
2943,TEST,0,0
2944,TEST,0,0
2945,TEST,0,0
2946,TEST,0,0
2947,TEST,0,0
2948,TEST,0,0
2949,TEST,0,0
2950,TRAIN,0,0
2951,TEST,0,0
2952,TEST,0,0
2953,TEST,0,0
2954,TEST,0,0
2955,TEST,0,0
2956,TEST,0,0
2957,TEST,0,0
2958,TEST,0,0
2959,TEST,0,0
2960,TEST,0,0
2961,TEST,0,0
2962,TEST,0,0
2963,TEST,0,0
2964,TEST,0,0
2965,TEST,0,0
2966,TEST,0,0
2967,TEST,0,0
2968,TEST,0,0
2969,TEST,0,0
2970,TEST,0,0
2971,TEST,0,0
2972,TEST,0,0
2973,TEST,0,0
2974,TEST,0,0
2975,TEST,0,0
2976,TEST,0,0
2977,TEST,0,0
2978,TEST,0,0
2979,TRAIN,0,0
