time,value
0,-0.50947
1,-0.50947
2,-0.50947
3,-0.50947
4,-0.50947
5,-0.50947
6,-0.50947
7,-0.50947
8,-0.50947
9,-0.50947
10,-0.50947
11,-0.55462
12,-0.61575
13,-0.65781
14,-0.69115
15,-0.70335
16,-0.70335
17,-0.70335
18,-0.70335
19,-0.6964899999999999
20,-0.68352
21,-0.6679
22,-0.6493800000000001
23,-0.63873
24,-0.63873
25,-0.63597
26,-0.62856
27,-0.61403
28,-0.58439
29,-0.55475
30,-0.5251100000000001
31,-0.49587
32,-0.46808999999999995
33,-0.44483999999999996
34,-0.44483999999999996
35,-0.44483999999999996
36,-0.44483999999999996
37,-0.44483999999999996
38,-0.44483999999999996
39,-0.44466999999999995
40,-0.41873999999999995
41,-0.39281
42,-0.38632
43,-0.38076
44,-0.34012
45,-0.29566
46,-0.25592
47,-0.21702
48,-0.17074
49,-0.12258
50,-0.37555
51,-0.16253
52,0.061585
53,0.15377000000000002
54,0.30196
55,0.45015
56,0.12276
57,0.16352
58,0.20427
59,0.24502
60,0.2589
61,0.24408000000000002
62,0.20768000000000003
63,0.14285
64,0.36165
65,-0.082924
66,-0.10834
67,-0.1954
68,-0.27483
69,-0.33411
70,-0.39997
71,-0.48889
72,-0.5778
73,-0.66672
74,-0.75258
75,-0.8155600000000001
76,-0.8783
77,-0.93758
78,-0.9971399999999999
79,-1.0787
80,-1.1602
81,-1.2488
82,-1.3377
83,-1.4266
84,-1.5155
85,-1.5902
86,-1.6624
87,-1.7242
88,-1.7835
89,-1.8428
90,-1.9021
91,-1.9536
92,-2.0017
93,-2.0199
94,-2.0218
95,-1.9829
96,-1.9162
97,-1.8344
98,-1.7399
99,-1.63
100,-1.5041
101,-1.3554
102,-1.1776
103,-0.99974
104,-0.82191
105,-0.64408
106,-0.46625
107,-0.28060999999999997
108,-0.35775999999999997
109,0.13104000000000002
110,0.33851
111,0.54598
112,0.75345
113,0.95815
114,1.1434
115,1.3237
116,1.4404
117,1.5558
118,1.6077
119,1.6596
120,1.6738
121,1.6868
122,1.6879
123,1.6879
124,1.6879
125,1.6879
126,1.6789
127,1.6678
128,1.6285
129,1.5804
130,1.5087
131,1.4272
132,1.3566
133,1.2917
134,1.2147
135,1.1294
136,1.0595
137,1.0021
138,0.95844
139,0.92881
140,0.9123399999999999
141,0.9123399999999999
142,0.9123399999999999
143,0.9123399999999999
144,0.92115
145,0.94709
146,0.96716
147,0.97272
148,0.9769700000000001
149,0.9769700000000001
150,0.97324
151,0.95286
152,0.92643
153,0.85975
154,0.7926300000000001
155,0.72038
156,0.6484800000000001
157,0.5892
158,0.52993
159,0.48328000000000004
160,0.43696999999999997
161,0.41626
162,0.39774
163,0.38727
164,0.37801
165,0.3521
166,0.32245999999999997
167,0.29707
168,0.27299
169,0.26342
170,0.25972
171,0.23645
172,0.20310999999999998
173,0.13598
174,0.25256
175,0.1373
176,0.2855
177,0.1672
178,0.36355
179,0.49473999999999996
180,0.54661
181,0.5704100000000001
182,0.55189
183,0.52181
184,0.46995
185,0.40991000000000005
186,0.33025
187,0.24836
188,0.15945
189,0.40148
190,0.12362000000000001
191,-0.12627
192,-0.20035999999999998
193,-0.26265
194,-0.19782
195,-0.13208
196,-0.23867
197,0.05316
198,0.10038
199,0.14669000000000001
200,0.32194
201,0.097992
202,0.15937
203,0.22421
204,0.30582
205,0.39103000000000004
206,0.45624
207,0.51552
208,0.5747899999999999
209,0.63407
210,0.6735899999999999
211,0.70323
212,0.7157899999999999
213,0.71765
214,0.71846
215,0.71846
216,0.70618
217,0.6821
218,0.67582
219,0.69063
220,0.71972
221,0.76973
222,0.82301
223,0.88229
224,0.93655
225,0.97916
226,1.0185
227,1.0482
228,1.0804
229,1.123
230,1.1664
231,1.2145
232,1.2627
233,1.3109
234,1.3603
235,1.4418
236,1.5233
237,1.5829
238,1.6422
239,1.6945
240,1.7464
241,1.7492
242,1.7455
243,1.6957
244,1.6364
245,1.5771
246,1.5179
247,1.4384
248,1.3514
249,1.2805
250,1.2175
251,1.1569
252,1.0976
253,1.0257
254,0.94416
255,0.86935
256,0.80081
257,0.71938
258,0.62305
259,0.51071
260,0.37549
261,0.22495
262,0.25281
263,-0.1438
264,-0.36423
265,-0.59458
266,-0.8539200000000001
267,-1.117
268,-1.3949
269,-1.6644
270,-1.8867
271,-2.1013
272,-2.2458
273,-2.383
274,-2.3682
275,-2.3534
276,-2.2336
277,-2.1132
278,-1.9667
279,-1.8185
280,-1.6703
281,-1.5221
282,-1.4204
283,-1.3278
284,-1.2584
285,-1.1954
286,-1.1528
287,-1.1176
288,-1.0711
289,-1.0192
290,-0.9754700000000001
291,-0.9365700000000001
292,-0.89235
293,-0.8441799999999999
294,-0.79893
295,-0.75632
296,-0.71285
297,-0.6683899999999999
298,-0.61773
299,-0.5584600000000001
300,-0.50325
301,-0.45508999999999994
302,-0.41273000000000004
303,-0.3831
304,-0.35539
305,-0.33316999999999997
306,-0.31442
307,-0.30887
308,-0.30011
309,-0.27418000000000003
310,-0.25077
311,-0.24891
312,-0.24561
313,-0.21597
314,-0.18633
315,0.47675
316,0.47675
317,0.47675
318,0.47675
319,0.47675
320,0.47675
321,0.47675
322,0.47675
323,0.47675
324,0.47675
325,0.47675
326,0.47675
327,0.47675
328,0.47675
329,0.47675
330,0.47675
331,0.47675
332,0.47675
333,0.47675
334,0.46663999999999994
335,0.44753999999999994
336,0.42454
337,0.39725
338,0.38156
339,0.38156
340,0.38563000000000003
341,0.39654
342,0.41531999999999997
343,0.45078999999999997
344,0.47822
345,0.48367
346,0.4956
347,0.5310699999999999
348,0.54648
349,0.45916999999999997
350,0.37185999999999997
351,0.28455
352,0.19965
353,0.15325999999999998
354,0.1069
355,0.33344
356,0.11515999999999998
357,0.06612
358,0.19235
359,0.1656
360,0.1656
361,0.1656
362,0.1656
363,0.12996
364,0.26638
365,0.37231
366,0.46781000000000006
367,0.095985
368,0.095985
369,0.10822000000000001
370,0.12732000000000002
371,0.15123
372,0.17852
373,0.18387
374,0.17022
375,0.14207
376,0.09841
377,0.29099
378,0.07271799999999999
379,-0.1559
380,-0.40146
381,-0.14533
382,-0.23264
383,-0.31995
384,-0.40726
385,-0.49456999999999995
386,-0.5818800000000001
387,-0.6622399999999999
388,-0.70862
389,-0.75918
390,-0.8410299999999999
391,-0.92324
392,-1.0105
393,-1.0979
394,-1.1852
395,-1.2725
396,-1.3598
397,-1.4471
398,-1.5592
399,-1.6738
400,-1.7814
401,-1.8878
402,-1.9613
403,-2.0268
404,-2.0759
405,-2.1195
406,-2.1517
407,-2.1790000000000003
408,-2.1798
409,-2.1662
410,-2.1282
411,-2.0736
412,-2.0013
413,-1.9140000000000001
414,-1.824
415,-1.7312
416,-1.6229
417,-1.4947
418,-1.3822
419,-1.2949
420,-1.1785
421,-1.0039
422,-0.8407600000000001
423,-0.70707
424,-0.574
425,-0.44303000000000003
426,-0.31206999999999996
427,-0.1811
428,-0.27413000000000004
429,0.053279999999999994
430,0.36206
431,0.43027
432,0.09545
433,0.35805
434,0.22161999999999998
435,0.06454800000000001
436,-0.21225
437,-0.43053
438,-0.1332
439,-0.17686
440,-0.22050999999999998
441,-0.26416999999999996
442,-0.30782
443,-0.35148
444,-0.39513000000000004
445,-0.44648999999999994
446,-0.5010600000000001
447,-0.57168
448,-0.65081
449,-0.7086
450,-0.75226
451,-0.7944100000000001
452,-0.83534
453,-0.8559399999999999
454,-0.8559399999999999
455,-0.8559399999999999
456,-0.8559399999999999
457,-0.8559399999999999
458,-0.8559399999999999
459,-0.84296
460,-0.80476
461,-0.7751899999999999
462,-0.7670100000000001
463,-0.76075
464,-0.76075
465,-0.76075
466,-0.76075
467,-0.76431
468,-0.7916
469,-0.8201700000000001
470,-0.86382
471,-0.90691
472,-0.9287299999999999
473,-0.9505600000000001
474,-0.9511299999999999
475,-0.9511299999999999
476,-0.93604
477,-0.9196700000000001
478,-0.8795799999999999
479,-0.83593
480,-0.79227
481,-0.74862
482,-0.70496
483,-0.6613100000000001
484,-0.6137699999999999
485,-0.56465
486,-0.48853
487,-0.39849
488,-0.28357
489,-0.15261
490,0.15154
491,0.24514
492,0.5664
493,0.98931
494,1.2461
495,1.3007
496,1.3052
497,1.2343
498,1.135
499,0.9821799999999999
500,0.82296
501,0.6483399999999999
502,0.45393
503,0.19745
504,-0.20806
505,-0.22785999999999998
506,-0.39455999999999997
507,-0.46005
508,-0.52367
509,-0.56733
510,-0.61098
511,-0.65464
512,-0.69829
513,-0.7152
514,-0.7315699999999999
515,-0.69223
516,-0.64858
517,-0.59775
518,-0.54591
519,-0.46935
520,-0.3875
521,-0.33510999999999996
522,-0.29145
523,-0.2478
524,-0.20414000000000002
525,-0.16049000000000002
526,-0.11682999999999999
527,-0.4744
528,-0.46075
529,-0.34743
530,-0.15642999999999999
531,-0.25526
532,0.15989
533,0.17098
534,0.096234
535,0.18272
536,0.30005
537,0.41256000000000004
538,0.5162399999999999
539,0.60761
540,0.67037
541,0.7338
542,0.79928
543,0.8690399999999999
544,0.95635
545,1.0413
546,1.1122
547,1.1832
548,1.2541
549,1.3266
550,1.4357
551,1.5448
552,1.5974
553,1.6493
554,1.7343
555,1.8216
556,1.9065
557,1.9911
558,2.0417
559,2.0853
560,2.129
561,2.1726
562,2.2163
563,2.2599
564,2.2779
565,2.2833
566,2.2854
567,2.2854
568,2.2668
569,2.234
570,2.2112
571,2.1975
572,2.1776
573,2.1503
574,2.1365
575,2.1419
576,2.1533
577,2.1751
578,2.1785
579,2.1403
580,2.0812
581,1.9612
582,1.8218
583,1.6062
584,1.3673
585,0.99623
586,0.61312
587,0.11927
588,-0.35922
589,-0.51747
590,-0.67572
591,-0.7147
592,-0.7529
593,-0.71406
594,-0.6704
595,-0.66555
596,-0.66555
597,-0.59707
598,-0.51522
599,-0.45905
600,-0.40993999999999997
601,-0.39078
602,-0.3826
603,-0.35772
604,-0.32498
605,-0.30422
606,-0.29058
607,-0.26909
608,-0.24181
609,-0.20596
610,-0.16230999999999998
611,-0.11865
612,-0.35777
613,-0.13949
614,0.07878099999999999
615,0.2671
616,0.40352
617,0.095985
618,0.095985
619,0.095985
620,0.095985
621,0.48858
622,0.44766000000000006
623,0.38319000000000003
624,0.1922
625,0.15609
626,0.06514199999999999
627,-0.097137
628,-0.2365
629,-0.45478
630,1.7478
631,1.7478
632,1.7478
633,1.7478
634,1.7478
635,1.7478
636,1.7478
637,1.7478
638,1.7478
639,1.7478
640,1.7478
641,1.6765
642,1.58
643,1.5136
644,1.4609999999999999
645,1.4417
646,1.4417
647,1.4417
648,1.4417
649,1.4027
650,1.329
651,1.2403
652,1.135
653,1.0745
654,1.0745
655,1.0588
656,1.0167
657,0.93245
658,0.75877
659,0.5771
660,0.37359000000000003
661,0.16063
662,-0.41645
663,-0.3212
664,-0.48962
665,-0.64556
666,-0.7017
667,-0.75629
668,-0.7861100000000001
669,-0.8156
670,-0.79455
671,-0.7735
672,-0.78928
673,-0.80682
674,-0.85285
675,-0.90197
676,-0.95705
677,-1.0132
678,-1.0693
679,-1.1255
680,-1.1934
681,-1.2653
682,-1.3263
683,-1.3824
684,-1.4206
685,-1.4487
686,-1.4705
687,-1.4881
688,-1.4962
689,-1.4962
690,-1.4928
691,-1.4858
692,-1.4674
693,-1.4341
694,-1.3921
695,-1.3359999999999999
696,-1.2804
697,-1.226
698,-1.1789
699,-1.1508
700,-1.1227
701,-1.0947
702,-1.0666
703,-1.0385
704,-1.0134
705,-1.0098
706,-1.0066
707,-1.0066
708,-1.0063
709,-0.98524
710,-0.9641799999999999
711,-0.91785
712,-0.8704799999999999
713,-0.7992100000000001
714,-0.7255199999999999
715,-0.65635
716,-0.5879300000000001
717,-0.56323
718,-0.54919
719,-0.54835
720,-0.55185
721,-0.54064
722,-0.5231
723,-0.52258
724,-0.53135
725,-0.54743
726,-0.56848
727,-0.58097
728,-0.58623
729,-0.6026699999999999
730,-0.63074
731,-0.65881
732,-0.68688
733,-0.71495
734,-0.74302
735,-0.75238
736,-0.72431
737,-0.69624
738,-0.6681699999999999
739,-0.6288600000000001
740,-0.55167
741,-0.47726999999999997
742,-0.41586000000000006
743,-0.3525
744,-0.27531
745,-0.19899999999999998
746,-0.13409000000000001
747,-0.33126
748,-0.13828
749,0.0547
750,0.31797
751,0.20101
752,-0.10342
753,-0.24377
754,-0.38411999999999996
755,-0.10834
756,-0.12787
757,-0.14542
758,-0.13635999999999998
759,-0.11882000000000001
760,-0.3777
761,-0.13209
762,0.20789000000000002
763,0.14156
764,0.17647000000000002
765,0.15893
766,0.073964
767,-0.066385
768,-0.20673000000000002
769,-0.34708
770,-0.48743000000000003
771,-0.129
772,-0.15707000000000002
773,-0.18514
774,-0.21320999999999998
775,-0.24128000000000002
776,-0.27591
777,-0.32678
778,-0.37394
779,-0.40903
780,-0.44283
781,-0.4709
782,-0.49668
783,-0.50721
784,-0.5181399999999999
785,-0.53393
786,-0.5504100000000001
787,-0.59251
788,-0.63462
789,-0.69039
790,-0.74653
791,-0.8220700000000001
792,-0.8992600000000001
793,-1.0070000000000001
794,-1.1192
795,-1.2429999999999999
796,-1.3693
797,-1.5359
798,-1.7148
799,-1.9262
800,-2.1508
801,-2.3672
802,-2.5795
803,-2.6798
804,-2.7079
805,-2.58
806,-2.3274
807,-1.7702
808,-0.9122899999999999
809,-0.19128
810,0.36309
811,0.88879
812,1.3712
813,1.8081
814,2.1590000000000003
815,2.4407
816,2.5565
817,2.6044
818,2.4395
819,2.2736
820,2.1034
821,1.945
822,1.8608
823,1.7777
824,1.7057
825,1.6340000000000001
826,1.5673
827,1.5006
828,1.4254
829,1.3499
830,1.2924
831,1.2363
832,1.1709
833,1.1043
834,1.0087
835,0.90694
836,0.86201
837,0.83394
838,0.80588
839,0.77781
840,0.76845
841,0.76845
842,0.7522800000000001
843,0.72597
844,0.69867
845,0.6705899999999999
846,0.6309
847,0.58002
848,0.53637
849,0.5012800000000001
850,0.47686000000000006
851,0.46808999999999995
852,0.45003000000000004
853,0.41494
854,0.37353000000000003
855,0.31739
856,0.26125
857,0.20511
858,0.14656
859,0.40792
860,0.062038
861,-0.30638000000000004
862,-0.1368
863,-0.19294
864,-0.2488
865,-0.29791999999999996
866,-0.34704
867,-0.365
868,-0.38254
869,-0.35417
870,-0.3226
871,-0.27244
872,-0.21980999999999998
873,-0.21086999999999997
874,-0.21086999999999997
875,-0.2327
876,-0.26077
877,-0.30793000000000004
878,-0.36232
879,-0.40135
880,-0.43293000000000004
881,-0.44816000000000006
882,-0.45343
883,-0.43176000000000003
884,-0.38965
885,-0.35026999999999997
886,-0.31342
887,-0.26437
888,-0.20121
889,-0.12939
890,-0.20868
891,0.21236
892,0.12324
893,0.20745
894,0.29165
895,0.3866
896,0.5129100000000001
897,0.6481100000000001
898,0.81828
899,0.97659
900,1.0678
901,1.1513
902,1.1636
903,1.1726
904,1.1129
905,1.0533
906,0.9674799999999999
907,0.8815200000000001
908,0.77079
909,0.65851
910,0.59613
911,0.53999
912,0.52789
913,0.5243800000000001
914,0.50436
915,0.4798
916,0.45266999999999996
917,0.4246
918,0.38222
919,0.33309
920,0.29168
921,0.25484
922,0.23313000000000003
923,0.22261
924,0.21758000000000002
925,0.21758000000000002
926,0.21758000000000002
927,0.21758000000000002
928,0.21758000000000002
929,0.21758000000000002
930,0.22144
931,0.23196
932,0.24249
933,0.25301
934,0.25345
935,0.22538000000000002
936,0.19621
937,0.16288
938,0.12762
939,0.42723999999999995
940,0.23586999999999997
941,0.35867
942,0.46771999999999997
943,0.32737
944,0.18702
