time,value
0,0.18569000000000002
1,0.18569000000000002
2,0.18569000000000002
3,0.18569000000000002
4,0.18569000000000002
5,0.18569000000000002
6,0.18569000000000002
7,0.18569000000000002
8,0.18569000000000002
9,0.18569000000000002
10,0.18569000000000002
11,0.18569000000000002
12,0.18569000000000002
13,0.18569000000000002
14,0.18569000000000002
15,0.18569000000000002
16,0.20626999999999998
17,0.30323
18,0.23485999999999999
19,0.58392
20,0.83514
21,1.0452
22,1.0558
23,1.0558
24,1.0558
25,1.0596
26,1.0681
27,1.1413
28,1.244
29,1.3385
30,1.4303
31,1.5124
32,1.5879
33,1.6542
34,1.7143
35,1.7714
36,1.7949
37,1.8125
38,1.8144
39,1.8071
40,1.7866
41,1.7447
42,1.6914
43,1.6307
44,1.5691
45,1.5075
46,1.442
47,1.3705
48,1.2923
49,1.2102
50,1.143
51,1.0782
52,1.0166
53,0.9550200000000001
54,0.8934200000000001
55,0.8447899999999999
56,0.80411
57,0.78087
58,0.76034
59,0.7398100000000001
60,0.7207
61,0.70416
62,0.6976
63,0.6976
64,0.6976
65,0.6976
66,0.6976
67,0.68529
68,0.64917
69,0.61015
70,0.56909
71,0.5280199999999999
72,0.48605
73,0.43338999999999994
74,0.37783
75,0.31623
76,0.26525
77,0.22229000000000002
78,0.17668
79,0.12954000000000002
80,0.32066999999999996
81,0.057565
82,-0.2953
83,-0.11685
84,-0.17845
85,-0.2247
86,-0.26704
87,-0.3081
88,-0.34917
89,-0.39023
90,-0.42446999999999996
91,-0.45278999999999997
92,-0.47503
93,-0.49611000000000005
94,-0.53641
95,-0.57693
96,-0.6179899999999999
97,-0.6590600000000001
98,-0.70012
99,-0.731
100,-0.75868
101,-0.7792100000000001
102,-0.79974
103,-0.8202799999999999
104,-0.8408100000000001
105,-0.86134
106,-0.88187
107,-0.9024
108,-0.9919399999999999
109,-1.0897
110,-1.2121
111,-1.315
112,-1.3971
113,-1.4792
114,-1.5613
115,-1.6435
116,-1.7191
117,-1.7724
118,-1.8195
119,-1.8596
120,-1.8857
121,-1.9062
122,-1.9191
123,-1.929
124,-1.929
125,-1.9494
126,-1.9945
127,-2.0479
128,-2.1049
129,-2.1081
130,-2.1065
131,-2.0979
132,-2.0842
133,-2.0636
134,-2.0537
135,-2.0488
136,-2.0484
137,-2.0484
138,-2.0484
139,-2.0408
140,-2.0225
141,-1.9891
142,-1.9480000000000002
143,-1.8923
144,-1.8343
145,-1.7728
146,-1.7112
147,-1.6496
148,-1.588
149,-1.5264
150,-1.4648
151,-1.4055
152,-1.3606
153,-1.3172
154,-1.2762
155,-1.2351
156,-1.194
157,-1.153
158,-1.1119
159,-1.0708
160,-1.0362
161,-1.0124
162,-0.9859399999999999
163,-0.95781
164,-0.9008799999999999
165,-0.83814
166,-0.7657
167,-0.68986
168,-0.60773
169,-0.5256
170,-0.44347
171,-0.35765
172,-0.2697
173,-0.16704000000000002
174,-0.36005
175,0.096227
176,0.10901
177,0.19114
178,0.27326999999999996
179,0.35504
180,0.43223
181,0.50445
182,0.56604
183,0.62764
184,0.68924
185,0.75084
186,0.81243
187,0.87403
188,0.93729
189,1.0044
190,1.0797
191,1.1619
192,1.234
193,1.3033
194,1.3649
195,1.4209
196,1.4629
197,1.4980000000000002
198,1.5269
199,1.5333
200,1.5333
201,1.5333
202,1.5333
203,1.5333
204,1.5126
205,1.4723
206,1.4314
207,1.3904
208,1.3493
209,1.3048
210,1.2501
211,1.1919
212,1.1303
213,1.0687
214,1.0071
215,0.93837
216,0.8664299999999999
217,0.7843
218,0.70902
219,0.64115
220,0.57838
221,0.51755
222,0.47593
223,0.43486
224,0.3938
225,0.35274
226,0.31167
227,0.28113
228,0.25489
229,0.2341
230,0.21356999999999998
231,0.19304000000000002
232,0.17251
233,0.15197
234,0.13144
235,0.11091
236,0.36057
237,0.17969000000000002
238,-0.071161
239,-0.11279000000000002
240,-0.11279000000000002
241,-0.14299
242,-0.18767
243,-0.2858
244,-0.37508
245,-0.39789
246,-0.41126999999999997
247,-0.41126999999999997
248,-0.41126999999999997
249,-0.41126999999999997
250,-0.36826
251,-0.31240999999999997
252,-0.20975
253,-0.13989000000000001
254,-0.11993
255,-0.10302
256,-0.087813
257,0.13108
258,0.10098
259,0.15327000000000002
260,0.18569000000000002
261,0.18569000000000002
262,0.13216
263,0.28371999999999997
264,-0.2811
265,-0.11279000000000002
266,-0.11279000000000002
267,-0.13212000000000002
268,-0.18536
269,-0.26869
270,-0.37135
271,-0.39845
272,-0.41126999999999997
273,-0.41126999999999997
274,-0.41126999999999997
275,-0.41126999999999997
276,-0.41126999999999997
277,-0.41126999999999997
278,-0.41126999999999997
279,-0.41126999999999997
280,-0.41126999999999997
281,-0.40344
282,-0.37968
283,-0.31051
284,-0.20785
285,-0.10519
286,-0.04383
287,0.10013999999999999
288,0.17336
289,0.18191
290,0.18569000000000002
291,0.18569000000000002
292,0.18569000000000002
293,0.18569000000000002
294,0.18569000000000002
295,0.18569000000000002
296,0.18569000000000002
297,0.18569000000000002
298,0.18569000000000002
299,0.18569000000000002
300,0.18569000000000002
301,0.18569000000000002
302,0.18569000000000002
303,0.18569000000000002
304,0.18569000000000002
305,0.18569000000000002
306,0.18569000000000002
307,0.18569000000000002
308,0.18569000000000002
309,0.18569000000000002
310,0.18569000000000002
311,0.18569000000000002
312,0.18569000000000002
313,0.18569000000000002
314,0.18569000000000002
315,-0.16099000000000002
316,-0.16099000000000002
317,-0.16099000000000002
318,-0.16099000000000002
319,-0.16099000000000002
320,-0.16099000000000002
321,-0.16099000000000002
322,-0.16099000000000002
323,-0.16099000000000002
324,-0.16099000000000002
325,-0.16099000000000002
326,-0.16099000000000002
327,-0.16099000000000002
328,-0.16099000000000002
329,-0.16099000000000002
330,-0.16099000000000002
331,-0.15647
332,-0.1352
333,0.23984
334,0.43476000000000004
335,0.71041
336,0.9409
337,0.95249
338,0.95249
339,0.95249
340,0.9563299999999999
341,0.96504
342,1.0395
343,1.1440000000000001
344,1.2346
345,1.3206
346,1.3903
347,1.4486
348,1.4914
349,1.5289
350,1.5637
351,1.5985
352,1.6282
353,1.6315
354,1.6192
355,1.5843
356,1.5314
357,1.4689
358,1.3956
359,1.3168
360,1.2123
361,1.1144
362,1.0267
363,0.9505600000000001
364,0.8809299999999999
365,0.78597
366,0.68835
367,0.5955
368,0.5243800000000001
369,0.48956000000000005
370,0.44375
371,0.3912
372,0.32386
373,0.26086
374,0.25054
375,0.24149
376,0.23471999999999998
377,0.21103000000000002
378,0.17620999999999998
379,0.15727
380,0.14269
381,0.14269
382,0.13225
383,0.48908
384,0.34635
385,0.21095
386,0.18825999999999998
387,0.18057
388,0.08224400000000001
389,-0.29784
390,-0.21470999999999998
391,-0.38879
392,-0.10877
393,-0.13648
394,-0.16099000000000002
395,-0.16099000000000002
396,-0.16733
397,-0.18796
398,-0.21644000000000002
399,-0.25126
400,-0.28607
401,-0.32045999999999997
402,-0.3456
403,-0.36344
404,-0.36344
405,-0.36344
406,-0.36344
407,-0.36344
408,-0.36438000000000004
409,-0.39791
410,-0.42887
411,-0.45305
412,-0.46466999999999997
413,-0.46466999999999997
414,-0.46466999999999997
415,-0.46466999999999997
416,-0.46466999999999997
417,-0.46466999999999997
418,-0.46466999999999997
419,-0.4705
420,-0.48211000000000004
421,-0.5110899999999999
422,-0.54591
423,-0.60412
424,-0.66519
425,-0.73482
426,-0.80445
427,-0.87408
428,-0.9437200000000001
429,-1.0134
430,-1.083
431,-1.1471
432,-1.1923
433,-1.2326
434,-1.2674
435,-1.3022
436,-1.337
437,-1.3588
438,-1.3757
439,-1.3757
440,-1.4103
441,-1.4867
442,-1.5773
443,-1.6740000000000002
444,-1.6794
445,-1.6821
446,-1.6966
447,-1.72
448,-1.7548
449,-1.7716
450,-1.78
451,-1.7806
452,-1.7806
453,-1.7806
454,-1.7741
455,-1.7586
456,-1.7303
457,-1.6955
458,-1.6607
459,-1.6259
460,-1.591
461,-1.5562
462,-1.5214
463,-1.4866
464,-1.4518
465,-1.4169999999999998
466,-1.3782
467,-1.315
468,-1.2514
469,-1.1873
470,-1.1417
471,-1.1068
472,-1.0568
473,-1.0024
474,-0.93276
475,-0.8631200000000001
476,-0.7934899999999999
477,-0.7198899999999999
478,-0.64381
479,-0.54333
480,-0.43693000000000004
481,-0.3141
482,-0.18549000000000002
483,-0.25017
484,0.44616000000000006
485,0.23231
486,0.36532
487,0.49472
488,0.59917
489,0.69714
490,0.7822399999999999
491,0.85836
492,0.92799
493,1.0235
494,1.1246
495,1.2291
496,1.3335
497,1.4380000000000002
498,1.5424
499,1.6469
500,1.7513
501,1.854
502,1.9262
503,1.9976
504,2.0673
505,2.1369
506,2.2065
507,2.2593
508,2.3071
509,2.3419
510,2.3673
511,2.3689
512,2.3642
513,2.3539
514,2.3245
515,2.2892
516,2.2321
517,2.1717
518,2.1021
519,2.0149
520,1.9111
521,1.8068
522,1.7023
523,1.5979
524,1.4934
525,1.389
526,1.2845
527,1.1801
528,1.0756
529,0.97119
530,0.86674
531,0.7622899999999999
532,0.65784
533,0.56501
534,0.48473999999999995
535,0.41313
536,0.34479
537,0.30903
538,0.27134
539,0.2233
540,0.16525
541,0.45905
542,0.11089
543,-0.23728000000000002
544,-0.10680999999999999
545,-0.15003
546,-0.11520999999999999
547,-0.10575
548,-0.12768
549,-0.20676999999999998
550,-0.31122
551,-0.36665
552,-0.41626
553,-0.4543
554,-0.50593
555,-0.57557
556,-0.60423
557,-0.61326
558,-0.54977
559,-0.48922
560,-0.47375
561,-0.46466999999999997
562,-0.46466999999999997
563,-0.46466999999999997
564,-0.46466999999999997
565,-0.45008000000000004
566,-0.43113999999999997
567,-0.39632
568,-0.37263
569,-0.36586
570,-0.36344
571,-0.36344
572,-0.36344
573,-0.36344
574,-0.36344
575,-0.36344
576,-0.36344
577,-0.36344
578,-0.36344
579,-0.36344
580,-0.36344
581,-0.36344
582,-0.36344
583,-0.36344
584,-0.36344
585,-0.36344
586,-0.36344
587,-0.36344
588,-0.36344
589,-0.36344
590,-0.36344
591,-0.36344
592,-0.36344
593,-0.36344
594,-0.36344
595,-0.36344
596,-0.36344
597,-0.36344
598,-0.36344
599,-0.36344
600,-0.34703
601,-0.32605
602,-0.29123000000000004
603,-0.2664
604,-0.2635
605,-0.26222
606,-0.26222
607,-0.26222
608,-0.26222
609,-0.26222
610,-0.26222
611,-0.26222
612,-0.26222
613,-0.26222
614,-0.26222
615,-0.26222
616,-0.26222
617,-0.26834
618,-0.29026
619,-0.31895
620,-0.35377
621,-0.36249000000000003
622,-0.36344
623,-0.36344
624,-0.36344
625,-0.36344
626,-0.37508
627,-0.39797
628,-0.42985
629,-0.46466999999999997
630,1.7702
631,1.7702
632,1.7702
633,1.7702
634,1.7702
635,1.7702
636,1.7702
637,1.7702
638,1.7702
639,1.7702
640,1.7702
641,1.7702
642,1.7702
643,1.7702
644,1.7702
645,1.7702
646,1.7694
647,1.7653
648,1.7292
649,1.6553
650,1.6021
651,1.5576
652,1.5554
653,1.5554
654,1.5554
655,1.5527
656,1.5465
657,1.4938
658,1.4199
659,1.3656
660,1.3177
661,1.2931
662,1.2604
663,1.2169
664,1.1695
665,1.1202
666,1.0709
667,1.018
668,0.94642
669,0.86382
670,0.7652899999999999
671,0.66676
672,0.56822
673,0.46661
674,0.36157
675,0.23840999999999998
676,0.11988
677,0.13174
678,-0.49205
679,-0.19313
680,-0.27375
681,-0.35143
682,-0.42533000000000004
683,-0.49923
684,-0.57313
685,-0.63925
686,-0.7006100000000001
687,-0.75149
688,-0.79842
689,-0.8267
690,-0.85539
691,-0.88481
692,-0.9262100000000001
693,-0.9754799999999999
694,-1.0247
695,-1.074
696,-1.1233
697,-1.1652
698,-1.1928
699,-1.2154
700,-1.2346
701,-1.2378
702,-1.2378
703,-1.2378
704,-1.2378
705,-1.2378
706,-1.2378
707,-1.2378
708,-1.2378
709,-1.2378
710,-1.2378
711,-1.2378
712,-1.2378
713,-1.2378
714,-1.2378
715,-1.2746
716,-1.3205
717,-1.3629
718,-1.4002
719,-1.4248
720,-1.4576
721,-1.4976
722,-1.5448
723,-1.5934
724,-1.6189
725,-1.6422
726,-1.6593
727,-1.6675
728,-1.6675
729,-1.6675
730,-1.6675
731,-1.6675
732,-1.6612
733,-1.6368
734,-1.6123
735,-1.5877
736,-1.5630000000000002
737,-1.5384
738,-1.4972
739,-1.4541
740,-1.4053
741,-1.3682
742,-1.3436
743,-1.319
744,-1.2943
745,-1.2697
746,-1.2451
747,-1.2204
748,-1.1947
749,-1.1678
750,-1.1073
751,-1.0334
752,-0.95031
753,-0.8637100000000001
754,-0.76518
755,-0.6177199999999999
756,-0.41108
757,-0.18691
758,0.20511
759,0.50241
760,0.15356
761,0.20282999999999998
762,0.25209000000000004
763,0.30136
764,0.35063
765,0.39989
766,0.45381000000000005
767,0.51576
768,0.6143
769,0.71742
770,0.8269
771,0.9454799999999999
772,1.0686
773,1.1742
774,1.2766
775,1.3719999999999999
776,1.4587
777,1.5326
778,1.5914
779,1.642
780,1.6694
781,1.6913
782,1.6958
783,1.6971
784,1.6933
785,1.6763
786,1.6516
787,1.6269999999999998
788,1.6024
789,1.5777
790,1.5531
791,1.5285
792,1.501
793,1.4718
794,1.4254
795,1.3775
796,1.3412
797,1.3091
798,1.2844
799,1.2342
800,1.1666
801,1.0937
802,1.0198
803,0.94594
804,0.8720399999999999
805,0.79814
806,0.72424
807,0.65033
808,0.57643
809,0.5034
810,0.44135
811,0.39123
812,0.36659
813,0.35818
814,0.36228
815,0.38301999999999997
816,0.40637
817,0.4082
818,0.40748
819,0.40086
820,0.38438
821,0.35975
822,0.32318
823,0.28311
824,0.23385
825,0.18458
826,0.13530999999999999
827,0.39181
828,0.10898
829,-0.24115999999999999
830,-0.11832000000000001
831,-0.19222
832,-0.26611999999999997
833,-0.34002
834,-0.38906999999999997
835,-0.41462
836,-0.44553999999999994
837,-0.47823999999999994
838,-0.52751
839,-0.57265
840,-0.6055
841,-0.63426
842,-0.65889
843,-0.68352
844,-0.70816
845,-0.72422
846,-0.73644
847,-0.73644
848,-0.73644
849,-0.73644
850,-0.73578
851,-0.73487
852,-0.7109
853,-0.6883
854,-0.67302
855,-0.66482
856,-0.66482
857,-0.6522
858,-0.63441
859,-0.6100800000000001
860,-0.58545
861,-0.56081
862,-0.53618
863,-0.51155
864,-0.48691
865,-0.46228
866,-0.43765
867,-0.41343
868,-0.39108000000000004
869,-0.37834
870,-0.37834
871,-0.3711
872,-0.36038000000000003
873,-0.33683
874,-0.3122
875,-0.28756
876,-0.26416
877,-0.24249
878,-0.2351
879,-0.2351
880,-0.2351
881,-0.2351
882,-0.2351
883,-0.2351
884,-0.2351
885,-0.2351
886,-0.2351
887,-0.2351
888,-0.23348000000000002
889,-0.22139
890,-0.20454
891,-0.17991
892,-0.18095999999999998
893,-0.19738
894,-0.21718
895,-0.2351
896,-0.2351
897,-0.23046
898,-0.21769000000000002
899,-0.1977
900,-0.17306
901,-0.16655999999999999
902,-0.16348
903,-0.16348
904,-0.16348
905,-0.16348
906,-0.15550999999999998
907,-0.14206
908,-0.11922999999999999
909,-0.09643600000000001
910,-0.48754
911,-0.46897
912,-0.44046
913,-0.35748
914,-0.23431
915,-0.16921
916,-0.12027
917,-0.12027
918,-0.12027
919,-0.12027
920,-0.10243
921,-0.070497
922,0.20523000000000002
923,0.15054
924,0.12545
925,0.071326
926,-0.051842
927,-0.11197
928,-0.11882000000000001
929,-0.12027
930,-0.12027
931,-0.12027
932,-0.12027
933,-0.12027
934,-0.12027
935,-0.12027
936,-0.21259
937,-0.33174000000000003
938,-0.41613
939,-0.47836999999999996
940,-0.47836999999999996
941,-0.1001
942,-0.11629
943,-0.13885
944,-0.16348
