time,value
0,1.6844
1,1.6844
2,1.3966
3,1.6844
4,1.3966
5,1.6844
6,1.3966
7,1.1088
8,-0.4742
9,-0.6181
10,-0.6181
11,-0.6181
12,-0.6181
13,-0.6181
14,-0.6181
15,-0.6181
16,-0.6181
17,-0.6181
18,-0.6181
19,-0.6181
20,-0.6181
21,-0.6181
22,-0.6181
23,-0.6181
24,-0.6181
25,-0.6181
26,-0.6181
27,-0.6181
28,-0.6181
29,-0.6181
30,-0.6181
31,-0.6181
32,-0.6181
33,-0.6181
34,-0.6181
35,-0.6181
36,-0.6181
37,-0.6181
38,-0.6181
39,-0.6181
40,-0.6181
41,-0.6181
42,-0.6181
43,-0.6181
44,-0.6181
45,1.1088
46,1.6844
47,1.9722
48,1.9722
49,1.6844
50,1.6844
51,1.6844
52,1.6844
53,1.6844
54,1.6844
55,1.3966
56,1.6844
57,1.3966
58,1.6844
59,-0.042473000000000004
60,-0.54615
61,-0.6181
62,-0.6181
63,-0.6181
64,-0.6181
65,-0.6181
66,-0.6181
67,-0.6181
68,-0.6181
69,-0.6181
70,-0.6181
71,-0.6181
72,-0.6181
73,-0.6181
74,-0.6181
75,-0.6181
76,-0.6181
77,-0.6181
78,-0.6181
79,-0.6181
80,-0.6181
81,-0.6181
82,-0.6181
83,-0.6181
84,-0.6181
85,-0.6181
86,-0.6181
87,-0.6181
88,-0.6181
89,-0.6181
90,-0.6181
91,-0.6181
92,-0.6181
93,-0.6181
94,-0.6181
95,-0.6181
96,-0.6181
97,-0.6181
98,-0.6181
99,0.8929299999999999
100,1.9722
101,1.6844
102,1.9722
103,1.6844
104,1.6844
105,1.6844
106,1.6844
107,1.6844
108,1.6844
109,1.3966
110,1.6844
111,1.3966
112,1.3966
113,-0.4742
114,-0.6181
115,-0.6181
116,-0.6181
117,-0.6181
118,-0.6181
119,-0.6181
120,-0.6181
121,-0.6181
122,-0.6181
123,-0.6181
124,-0.6181
125,-0.6181
126,-0.6181
127,-0.6181
128,-0.6181
129,-0.6181
130,-0.6181
131,-0.6181
132,-0.6181
133,-0.6181
134,-0.6181
135,-0.6181
136,-0.6181
137,-0.6181
138,-0.6181
139,-0.6181
140,-0.6181
141,-0.6181
142,-0.6181
143,-0.6181
144,-0.6181
145,-0.6181
146,-0.6181
147,-0.6181
148,-0.6181
149,-0.6181
150,-0.6181
151,-0.6181
152,-0.6181
153,-0.6181
154,-0.6181
155,0.8929299999999999
156,1.9722
157,1.6844
158,1.9722
159,1.6844
160,1.6844
161,1.6844
162,1.6844
163,1.6844
164,1.3966
165,1.6844
166,1.3966
167,1.6844
168,1.3966
169,-0.4742
170,-0.6181
171,-0.6181
172,-0.6181
173,-0.6181
174,-0.6181
175,-0.6181
176,-0.6181
177,-0.6181
178,-0.6181
179,-0.6181
180,-0.6181
181,-0.6181
182,-0.6181
183,-0.6181
184,-0.6181
185,-0.6181
186,-0.6181
187,-0.6181
188,-0.6181
189,-0.6181
190,-0.6181
191,-0.6181
192,-0.6181
193,-0.6181
194,-0.6181
195,-0.6181
196,-0.6181
197,-0.6181
198,-0.6181
199,-0.6181
200,-0.6181
201,-0.6181
202,-0.6181
203,-0.6181
204,-0.6181
205,-0.6181
206,-0.6181
207,-0.6181
208,-0.6181
209,-0.6181
210,-0.6181
211,-0.6181
212,-0.6181
213,-0.33029000000000003
214,1.9722
215,1.6844
216,1.6844
217,1.9722
218,1.6844
219,1.6844
220,1.6844
221,1.6844
222,1.6844
223,1.6844
224,1.6844
225,1.3966
226,1.6844
227,1.3966
228,1.6844
229,-0.042473000000000004
230,-0.6181
231,-0.6181
232,-0.54615
233,-0.6181
234,-0.6181
235,-0.6181
236,-0.6181
237,-0.6181
238,-0.6181
239,-0.6181
240,-0.6181
241,-0.6181
242,-0.6181
243,-0.6181
244,-0.6181
245,-0.6181
246,-0.6181
247,-0.6181
248,-0.6181
249,-0.6181
250,-0.6181
251,-0.6181
252,-0.6181
253,-0.6181
254,-0.6181
255,-0.6181
256,-0.6181
257,-0.6181
258,-0.6181
259,-0.6181
260,-0.6181
261,-0.6181
262,-0.6181
263,1.3966
264,1.9722
265,1.9722
266,1.6844
267,1.6844
268,1.6844
269,1.6844
270,1.6844
271,1.6844
272,1.3966
273,1.6844
274,1.3966
275,1.3966
276,0.67707
277,-0.6181
278,-0.6181
279,-0.6181
280,-0.6181
281,-0.6181
282,-0.6181
283,-0.6181
284,-0.6181
285,-0.6181
286,-0.6181
287,-0.6181
288,-0.6181
289,-0.6181
290,-0.6181
291,-0.6181
292,-0.6181
293,-0.6181
294,-0.6181
295,-0.6181
296,-0.6181
297,-0.6181
298,-0.6181
299,-0.6181
300,-0.6181
301,-0.6181
302,-0.6181
303,-0.6181
304,-0.6181
305,-0.6181
306,-0.6181
307,-0.6181
308,-0.6181
309,-0.6181
310,-0.6181
311,-0.6181
312,-0.6181
313,-0.6181
314,-0.6181
315,0.24534
316,1.6844
317,1.6844
318,1.9722
319,1.6844
320,1.3966
321,1.6844
322,1.6844
323,1.3966
324,1.6844
325,1.3966
326,1.6844
327,1.3966
328,1.6844
329,0.67707
330,-0.54615
331,-0.6181
332,-0.6181
333,-0.6181
334,-0.6181
335,-0.6181
336,-0.6181
337,-0.6181
338,-0.6181
339,-0.6181
340,-0.6181
341,-0.6181
342,-0.6181
343,-0.6181
344,-0.6181
345,-0.6181
346,-0.6181
347,-0.6181
348,-0.6181
349,-0.6181
350,-0.6181
351,-0.6181
352,-0.6181
353,-0.6181
354,-0.6181
355,-0.6181
356,-0.6181
357,-0.6181
358,-0.6181
359,-0.6181
360,-0.6181
361,-0.6181
362,-0.6181
363,-0.6181
364,-0.6181
365,-0.6181
366,-0.6181
367,-0.6181
368,-0.6181
369,-0.6181
370,0.10142999999999999
371,1.6844
372,1.9722
373,1.6844
374,1.9722
375,1.6844
376,1.6844
377,1.6844
378,1.3966
379,1.6844
380,1.6844
381,1.3966
382,1.3966
383,1.6844
384,-0.54615
385,-0.6181
386,-0.6181
387,-0.6181
388,-0.6181
389,-0.6181
390,-0.6181
391,-0.6181
392,-0.6181
393,-0.6181
394,-0.6181
395,-0.6181
396,-0.6181
397,-0.6181
398,-0.6181
399,-0.6181
400,-0.6181
401,-0.6181
402,-0.6181
403,-0.6181
404,-0.6181
405,-0.6181
406,-0.6181
407,-0.6181
408,-0.6181
409,-0.6181
410,-0.6181
411,-0.6181
412,-0.6181
413,-0.6181
414,-0.6181
415,-0.6181
416,-0.6181
417,-0.6181
418,-0.6181
419,-0.6181
420,-0.6181
421,-0.6181
422,-0.6181
423,-0.6181
424,-0.6181
425,-0.6181
426,-0.6181
427,-0.6181
428,1.1088
429,1.9722
430,1.6844
431,1.6844
432,1.6844
433,1.6844
434,1.6844
435,1.6844
436,1.6844
437,1.3966
438,1.6844
439,1.3966
440,1.6844
441,1.3966
442,0.24534
443,-0.54615
444,-0.6181
445,-0.6181
446,-0.6181
447,-0.6181
448,-0.6181
449,-0.6181
450,-0.6181
451,-0.6181
452,-0.6181
453,-0.6181
454,-0.6181
455,-0.6181
456,-0.6181
457,-0.6181
458,-0.6181
459,-0.6181
460,-0.6181
461,-0.6181
462,-0.6181
463,-0.6181
464,-0.6181
465,-0.6181
466,-0.6181
467,-0.6181
468,-0.6181
469,-0.6181
470,-0.6181
471,-0.6181
472,-0.6181
473,-0.6181
474,-0.6181
475,-0.6181
476,-0.6181
477,-0.6181
478,-0.6181
479,-0.6181
480,-0.6181
481,-0.6181
482,-0.6181
483,-0.6181
484,-0.6181
485,-0.6181
486,-0.6181
487,-0.6181
488,1.6844
489,1.9722
490,1.9722
491,1.6844
492,1.6844
493,1.6844
494,1.6844
495,1.6844
496,1.6844
497,1.3966
498,1.6844
499,1.3966
500,1.6844
501,0.8929299999999999
502,-0.6181
503,-0.6181
504,-0.6181
505,-0.6181
506,-0.6181
507,-0.6181
508,-0.6181
509,-0.6181
510,-0.6181
511,-0.6181
512,-0.6181
513,-0.6181
514,-0.6181
515,-0.6181
516,-0.6181
517,-0.6181
518,-0.6181
519,-0.6181
520,-0.6181
521,-0.6181
522,-0.6181
523,-0.6181
524,-0.6181
525,-0.6181
526,-0.54615
527,-0.6181
528,-0.6181
529,-0.6181
530,-0.6181
531,-0.6181
532,-0.6181
533,-0.54615
534,-0.6181
535,-0.6181
536,1.1088
537,1.6844
538,1.9722
539,1.6844
540,1.6844
541,1.6844
542,1.6844
543,1.6844
544,1.6844
545,1.3966
546,1.6844
547,1.3966
548,1.6844
549,1.3966
550,1.3966
551,0.10142999999999999
552,-0.6181
553,-0.6181
554,-0.6181
555,-0.6181
556,-0.6181
557,-0.6181
558,-0.6181
559,-0.6181
560,-0.6181
561,-0.6181
562,-0.6181
563,-0.6181
564,-0.6181
565,-0.6181
566,-0.6181
567,-0.6181
568,-0.6181
569,-0.6181
570,-0.6181
571,-0.6181
572,-0.6181
573,-0.6181
574,-0.6181
575,-0.6181
576,-0.6181
577,-0.6181
578,-0.6181
579,-0.6181
580,-0.6181
581,-0.6181
582,-0.6181
583,-0.6181
584,-0.6181
585,-0.6181
586,0.8929299999999999
587,1.6844
588,1.9722
589,1.9722
590,1.6844
591,1.6844
592,1.6844
593,1.6844
594,1.6844
595,1.3966
596,1.6844
597,1.6844
598,1.3966
599,1.6844
600,1.3966
601,1.3966
602,-0.042473000000000004
603,-0.6181
604,-0.6181
605,-0.6181
606,-0.6181
607,-0.6181
608,-0.6181
609,-0.6181
610,-0.6181
611,-0.6181
612,-0.6181
613,-0.6181
614,-0.6181
615,-0.6181
616,-0.6181
617,-0.6181
618,-0.6181
619,-0.6181
620,-0.6181
621,-0.6181
622,-0.6181
623,-0.6181
624,-0.6181
625,-0.6181
626,-0.6181
627,-0.6181
628,-0.6181
629,-0.6181
630,-0.6181
631,-0.6181
632,-0.6181
633,-0.6181
634,-0.6181
635,-0.6181
636,-0.6181
637,-0.6181
638,1.9722
639,1.9722
640,1.9722
641,1.6844
642,1.9722
643,1.6844
644,1.6844
645,1.6844
646,1.6844
647,1.6844
648,1.3966
649,1.6844
650,1.3966
651,1.6844
652,1.3966
653,1.3966
654,-0.33029000000000003
655,-0.54615
656,-0.6181
657,-0.6181
658,-0.6181
659,-0.6181
660,-0.54615
661,-0.6181
662,-0.6181
663,-0.6181
664,-0.6181
665,-0.6181
666,-0.6181
667,-0.6181
668,-0.6181
669,-0.6181
670,-0.6181
671,-0.6181
672,-0.6181
673,-0.6181
674,-0.6181
675,-0.6181
676,-0.6181
677,-0.6181
678,-0.6181
679,-0.6181
680,-0.6181
681,-0.6181
682,-0.6181
683,-0.6181
684,-0.6181
685,-0.6181
686,-0.6181
687,-0.6181
688,-0.6181
689,-0.6181
690,-0.18638
691,1.9722
692,1.6844
693,1.9722
694,1.9722
695,1.6844
696,1.6844
697,1.6844
698,1.6844
699,1.6844
700,1.6844
701,1.3966
702,1.6844
703,1.3966
704,1.6844
705,0.67707
706,-0.4742
707,-0.6181
708,-0.6181
709,-0.6181
710,-0.6181
711,-0.6181
712,-0.6181
713,-0.6181
714,-0.6181
715,-0.6181
716,-0.6181
717,-0.6181
718,-0.6181
719,-0.6181
