time,value
0,0.34076
1,0.34076
2,0.34076
3,0.34076
4,0.34076
5,0.34076
6,0.34076
7,0.34076
8,0.34076
9,0.34076
10,0.34076
11,0.34076
12,0.34076
13,0.34076
14,0.34076
15,0.34076
16,0.34076
17,0.34076
18,0.34076
19,0.34076
20,0.34076
21,0.34076
22,0.34076
23,0.34076
24,0.34076
25,0.34076
26,0.34076
27,0.34076
28,0.34076
29,0.34076
30,0.34076
31,0.34076
32,0.34076
33,0.34076
34,0.34076
35,0.34076
36,0.34076
37,0.34076
38,0.34076
39,0.34076
40,0.34076
41,0.34076
42,0.34076
43,0.34076
44,0.34076
45,0.34076
46,0.34076
47,0.34076
48,0.348
49,0.36065
50,0.37564000000000003
51,0.39078
52,0.40593
53,0.42107
54,0.43621000000000004
55,0.45136000000000004
56,0.46066
57,0.46103999999999995
58,0.46113000000000004
59,0.46113000000000004
60,0.46113000000000004
61,0.46113000000000004
62,0.46113000000000004
63,0.46113000000000004
64,0.46113000000000004
65,0.46113000000000004
66,0.46113000000000004
67,0.46113000000000004
68,0.46113000000000004
69,0.46113000000000004
70,0.46113000000000004
71,0.46373000000000003
72,0.46803
73,0.48317
74,0.49832
75,0.51346
76,0.519
77,0.52132
78,0.52132
79,0.52132
80,0.52132
81,0.52132
82,0.52132
83,0.52132
84,0.5299699999999999
85,0.5445399999999999
86,0.55966
87,0.5748
88,0.5899399999999999
89,0.6050800000000001
90,0.6202300000000001
91,0.63537
92,0.65051
93,0.66565
94,0.6808
95,0.6974199999999999
96,0.72272
97,0.75057
98,0.78085
99,0.80477
100,0.82226
101,0.82226
102,0.82226
103,0.82226
104,0.84603
105,0.8724799999999999
106,0.90276
107,0.9250200000000001
108,0.94263
109,0.94263
110,0.94263
111,0.94263
112,0.95401
113,0.96851
114,0.98365
115,0.9947
116,1.002
117,1.0028
118,1.0028
119,1.0028
120,1.0028
121,1.0028
122,1.0028
123,1.0028
124,1.0028
125,1.0028
126,1.0031
127,1.0065
128,1.0151
129,1.0302
130,1.0454
131,1.0605
132,1.0757
133,1.0908
134,1.1059
135,1.1211
136,1.1362
137,1.1514
138,1.1665
139,1.1817
140,1.1828
141,1.1834
142,1.1834
143,1.1834
144,1.1834
145,1.1834
146,1.1829
147,1.1817
148,1.1692
149,1.1541
150,1.1389
151,1.1238
152,1.1086
153,1.0935
154,1.0783
155,1.0632
156,1.0481
157,1.0329
158,1.0178
159,1.0026
160,0.98749
161,0.97234
162,0.9577
163,0.9479299999999999
164,0.94263
165,0.94263
166,0.94263
167,0.94001
168,0.9260200000000001
169,0.9113899999999999
170,0.89625
171,0.8811
172,0.8659600000000001
173,0.85082
174,0.83629
175,0.82226
176,0.82226
177,0.82226
178,0.82226
179,0.82226
180,0.82226
181,0.82226
182,0.8208200000000001
183,0.81775
184,0.80462
185,0.7894800000000001
186,0.7743399999999999
187,0.75262
188,0.72578
189,0.69575
190,0.66546
191,0.63518
192,0.6048899999999999
193,0.5746100000000001
194,0.54432
195,0.5034
196,0.44551
197,0.38561
198,0.32671
199,0.2807
200,0.24223000000000003
201,0.21195
202,0.18231
203,0.15578
204,0.14064000000000002
205,0.1255
206,0.11035999999999999
207,0.43621000000000004
208,0.30484
209,0.15342
210,-0.044731
211,-0.17532
212,-0.40246
213,-0.12675
214,-0.17218
215,-0.22635999999999998
216,-0.28374
217,-0.34431
218,-0.40488
219,-0.46545
220,-0.52603
221,-0.5866
222,-0.64717
223,-0.73155
224,-0.83295
225,-0.93871
226,-1.0358
227,-1.1135
228,-1.1693
229,-1.2147
230,-1.2602
231,-1.3056
232,-1.351
233,-1.3964
234,-1.4394
235,-1.4664
236,-1.4875
237,-1.5026
238,-1.5178
239,-1.5329
240,-1.5481
241,-1.5632
242,-1.5784
243,-1.5827
244,-1.5853
245,-1.5853
246,-1.5885
247,-1.5939
248,-1.609
249,-1.6242
250,-1.6393
251,-1.6544
252,-1.6696
253,-1.6847
254,-1.6964
255,-1.7046
256,-1.7056
257,-1.7056
258,-1.7056
259,-1.7056
260,-1.7056
261,-1.7056
262,-1.7056
263,-1.7056
264,-1.7056
265,-1.7056
266,-1.7056
267,-1.7056
268,-1.7056
269,-1.7056
270,-1.7039
271,-1.6928
272,-1.6796
273,-1.6644
274,-1.6533
275,-1.6454
276,-1.6454
277,-1.6454
278,-1.6454
279,-1.6454
280,-1.6454
281,-1.6454
282,-1.6454
283,-1.6454
284,-1.6454
285,-1.6453
286,-1.6449
287,-1.6205
288,-1.5902
289,-1.56
290,-1.5297
291,-1.4994
292,-1.4691
293,-1.4388
294,-1.4085
295,-1.3782
296,-1.348
297,-1.3177
298,-1.2874
299,-1.2571
300,-1.2268
301,-1.1969
302,-1.171
303,-1.1499
304,-1.1348
305,-1.1197
306,-1.1045
307,-1.0894
308,-1.0742
309,-1.0591
310,-1.038
311,-1.014
312,-0.9837600000000001
313,-0.95347
314,-0.92319
315,-0.32018
316,-0.32018
317,-0.32018
318,-0.32018
319,-0.32018
320,-0.32018
321,-0.32018
322,-0.32018
323,-0.32018
324,-0.32018
325,-0.32018
326,-0.32018
327,-0.32018
328,-0.32018
329,-0.32018
330,-0.32018
331,-0.32018
332,-0.32018
333,-0.32018
334,-0.32018
335,-0.32018
336,-0.32018
337,-0.32018
338,-0.32018
339,-0.32018
340,-0.32018
341,-0.32018
342,-0.32018
343,-0.32018
344,-0.32018
345,-0.32018
346,-0.32018
347,-0.32018
348,-0.32018
349,-0.32018
350,-0.32018
351,-0.32018
352,-0.32018
353,-0.32018
354,-0.32018
355,-0.32018
356,-0.32018
357,-0.32018
358,-0.32592
359,-0.33791
360,-0.37783
361,-0.42291999999999996
362,-0.46801000000000004
363,-0.5131
364,-0.5582
365,-0.60329
366,-0.64286
367,-0.66969
368,-0.6786300000000001
369,-0.6786300000000001
370,-0.6786300000000001
371,-0.6786300000000001
372,-0.6786300000000001
373,-0.6786300000000001
374,-0.6786300000000001
375,-0.6786300000000001
376,-0.6786300000000001
377,-0.6786300000000001
378,-0.6786300000000001
379,-0.6786300000000001
380,-0.6786300000000001
381,-0.6786300000000001
382,-0.6786300000000001
383,-0.6786300000000001
384,-0.6786300000000001
385,-0.6786300000000001
386,-0.6786300000000001
387,-0.6786300000000001
388,-0.6786300000000001
389,-0.6786300000000001
390,-0.6786300000000001
391,-0.6786300000000001
392,-0.6786300000000001
393,-0.6786300000000001
394,-0.6786300000000001
395,-0.6786300000000001
396,-0.6786300000000001
397,-0.6786300000000001
398,-0.6786300000000001
399,-0.6786300000000001
400,-0.6786300000000001
401,-0.6786300000000001
402,-0.67089
403,-0.6469199999999999
404,-0.60842
405,-0.56357
406,-0.52304
407,-0.49941
408,-0.49941
409,-0.49941
410,-0.49941
411,-0.49941
412,-0.49941
413,-0.49941
414,-0.48991999999999997
415,-0.47086999999999996
416,-0.42578
417,-0.38068
418,-0.33559
419,-0.32589
420,-0.32018
421,-0.32018
422,-0.32018
423,-0.32018
424,-0.32018
425,-0.32018
426,-0.32018
427,-0.28629
428,-0.24313
429,-0.19802999999999998
430,-0.16513
431,-0.14344
432,-0.14096
433,-0.13996
434,-0.13596
435,-0.10670999999999999
436,-0.30391999999999997
437,-0.078461
438,0.147
439,0.37245
440,0.11875
441,0.16384
442,0.20893
443,0.25401999999999997
444,0.29911
445,0.34421
446,0.3893
447,0.43438999999999994
448,0.47948
449,0.52457
450,0.56966
451,0.6147600000000001
452,0.65985
453,0.70494
454,0.75003
455,0.7951199999999999
456,0.84021
457,0.8853
458,0.91399
459,0.9343899999999999
460,0.9343899999999999
461,0.9359299999999999
462,0.93935
463,0.9766299999999999
464,1.0217
465,1.0668
466,1.0961
467,1.1121
468,1.1136
469,1.1136
470,1.1136
471,1.1136
472,1.1136
473,1.1136
474,1.1265
475,1.1619
476,1.2044
477,1.248
478,1.2771
479,1.2928
480,1.2928
481,1.2928
482,1.2928
483,1.2928
484,1.2928
485,1.2928
486,1.3132
487,1.3419
488,1.3869999999999998
489,1.4321
490,1.4772
491,1.5223
492,1.5674
493,1.6125
494,1.6365
495,1.6513
496,1.6513
497,1.6556
498,1.6647
499,1.7038
500,1.7489
501,1.794
502,1.7999
503,1.7754
504,1.7318
505,1.6912
506,1.6615
507,1.6513
508,1.6513
509,1.6513
510,1.6513
511,1.6513
512,1.6513
513,1.6538
514,1.6755
515,1.7084
516,1.7535
517,1.7966
518,1.8305
519,1.8305
520,1.8305
521,1.8305
522,1.8305
523,1.8305
524,1.8305
525,1.8248
526,1.8151
527,1.77
528,1.7249
529,1.6798
530,1.6608
531,1.6513
532,1.6513
533,1.6368
534,1.6071
535,1.5257
536,1.4355
537,1.3454
538,1.2315
539,1.1008
540,0.96578
541,0.83711
542,0.72295
543,0.62503
544,0.53485
545,0.44466000000000006
546,0.35448
547,0.2643
548,0.17411
549,0.44237
550,0.12845
551,-0.14125
552,-0.3667
553,-0.11927
554,-0.16435999999999998
555,-0.20945
556,-0.25454
557,-0.29963
558,-0.34471999999999997
559,-0.38982
560,-0.43491
561,-0.48
562,-0.52509
563,-0.57018
564,-0.61527
565,-0.6603600000000001
566,-0.7054600000000001
567,-0.75055
568,-0.79564
569,-0.84073
570,-0.88582
571,-0.93091
572,-0.9757299999999999
573,-1.0197
574,-1.0371
575,-1.0371
576,-1.0371
577,-1.046
578,-1.0728
579,-1.1124
580,-1.1571
581,-1.1947
582,-1.2163
583,-1.2163
584,-1.2163
585,-1.2163
586,-1.2163
587,-1.2163
588,-1.2163
589,-1.2163
590,-1.2163
591,-1.2163
592,-1.2163
593,-1.2163
594,-1.2549
595,-1.2962
596,-1.3413
597,-1.3864
598,-1.4315
599,-1.4766
600,-1.5212
601,-1.5651
602,-1.5377
603,-1.4926
604,-1.4475
605,-1.4163
606,-1.3975
607,-1.3955
608,-1.3937
609,-1.3869
610,-1.3561
611,-1.3111
612,-1.266
613,-1.2324
614,-1.2198
615,-1.2163
616,-1.2152
617,-1.2021
618,-1.1746
619,-1.1295
620,-1.0845
621,-1.0462
622,-1.04
623,-1.0371
624,-1.0371
625,-1.0195
626,-0.99313
627,-0.94804
628,-0.90295
629,-0.85785
630,-1.4991
631,-1.4991
632,-1.4991
633,-1.4991
634,-1.4991
635,-1.4991
636,-1.4991
637,-1.4991
638,-1.4991
639,-1.4991
640,-1.4991
641,-1.4991
642,-1.4991
643,-1.4991
644,-1.4991
645,-1.4991
646,-1.4991
647,-1.4991
648,-1.4991
649,-1.4991
650,-1.4991
651,-1.4991
652,-1.4991
653,-1.4991
654,-1.4991
655,-1.4991
656,-1.4991
657,-1.4991
658,-1.4991
659,-1.4991
660,-1.4991
661,-1.4991
662,-1.4991
663,-1.4991
664,-1.4991
665,-1.4991
666,-1.4991
667,-1.4991
668,-1.4991
669,-1.4991
670,-1.4763
671,-1.4444
672,-1.4007
673,-1.3571
674,-1.3134
675,-1.2698
676,-1.2261
677,-1.1824
678,-1.1597
679,-1.1525
680,-1.1521
681,-1.1521
682,-1.1521
683,-1.1521
684,-1.1521
685,-1.1521
686,-1.1521
687,-1.1521
688,-1.1521
689,-1.1521
690,-1.1521
691,-1.1521
692,-1.1521
693,-1.1478
694,-1.1344
695,-1.0907
696,-1.0471
697,-1.0034
698,-0.9880399999999999
699,-0.97854
700,-0.97854
701,-0.97106
702,-0.95865
703,-0.91499
704,-0.8713299999999999
705,-0.82768
706,-0.8394
707,-0.8696799999999999
708,-0.91333
709,-0.94842
710,-0.97495
711,-0.97854
712,-0.97854
713,-0.97854
714,-0.97854
715,-0.97854
716,-0.97854
717,-0.97104
718,-0.94784
719,-0.9105700000000001
720,-0.8671399999999999
721,-0.82791
722,-0.80502
723,-0.80502
724,-0.80502
725,-0.80502
726,-0.80502
727,-0.80502
728,-0.80502
729,-0.79584
730,-0.7773899999999999
731,-0.73374
732,-0.69008
733,-0.6464300000000001
734,-0.63703
735,-0.6315
736,-0.6315
737,-0.6199399999999999
738,-0.6016699999999999
739,-0.55801
740,-0.51435
741,-0.4707
742,-0.45985
743,-0.45798999999999995
744,-0.45798999999999995
745,-0.44619
746,-0.42353
747,-0.38228
748,-0.33959
749,-0.29980999999999997
750,-0.28447
751,-0.28447
752,-0.28447
753,-0.27459
754,-0.24586
755,-0.20655
756,-0.16362000000000002
757,-0.12992
758,-0.11095999999999999
759,-0.11095999999999999
760,-0.11095999999999999
761,-0.11095999999999999
762,-0.11095999999999999
763,-0.11095999999999999
764,-0.11095999999999999
765,-0.11095999999999999
766,-0.11095999999999999
767,-0.11095999999999999
768,-0.11095999999999999
769,-0.11095999999999999
770,-0.11095999999999999
771,-0.11095999999999999
772,-0.11095999999999999
773,-0.47117
774,-0.35167
775,-0.13339
776,0.07746
777,0.27915999999999996
778,0.31698000000000004
779,0.31698000000000004
780,0.31698000000000004
781,0.39331
782,0.10601
783,0.14820999999999998
784,0.19187
785,0.23553000000000002
786,0.27918000000000004
787,0.32284
788,0.36649
789,0.39766
790,0.40705
791,0.4096
792,0.41105
793,0.42651999999999995
794,0.45491000000000004
795,0.49856000000000006
796,0.54222
797,0.57831
798,0.58163
799,0.58311
800,0.58311
801,0.58311
802,0.58311
803,0.58311
804,0.58311
805,0.58311
806,0.58311
807,0.58311
808,0.58311
809,0.58311
810,0.58311
811,0.58311
812,0.58726
813,0.5961
814,0.63395
815,0.67761
816,0.72126
817,0.7459600000000001
818,0.7559
819,0.75663
820,0.7653300000000001
821,0.7951699999999999
822,0.8627299999999999
823,0.95004
824,1.0373
825,1.094
826,1.1017
827,1.1037
828,1.1037
829,1.1037
830,1.1037
831,1.1037
832,1.1037
833,1.1037
834,1.1037
835,1.1037
836,1.1037
837,1.1037
838,1.1037
839,1.1037
840,1.1037
841,1.1037
842,1.1037
843,1.1037
844,1.1037
845,1.1289
846,1.1633
847,1.207
848,1.2507
849,1.2943
850,1.338
851,1.3816
852,1.4253
853,1.5147
854,1.6368
855,1.7673
856,1.8791
857,1.9488
858,1.9712
859,1.9712
860,1.9712
861,1.9712
862,1.9712
863,1.9712
864,1.9677
865,1.9411
866,1.906
867,1.8624
868,1.8119999999999998
869,1.7524
870,1.6651
871,1.5778
872,1.4905
873,1.4032
874,1.3159
875,1.2285
876,1.1507
877,1.0788
878,1.0351
879,0.9914799999999999
880,0.94783
881,0.9343899999999999
882,0.93015
883,0.93015
884,0.91999
885,0.9001
886,0.85941
887,0.81602
888,0.77347
889,0.75663
890,0.75663
891,0.75663
892,0.74797
893,0.722
894,0.6836899999999999
895,0.64003
896,0.59637
897,0.55272
898,0.5090600000000001
899,0.46541000000000005
900,0.42676000000000003
901,0.41516000000000003
902,0.4096
903,0.4096
904,0.39785
905,0.37699
906,0.33334
907,0.28968
908,0.24603000000000003
909,0.2397
910,0.23608
911,0.23608
912,0.24978000000000003
913,0.27089
914,0.31455
915,0.35796
916,0.40105999999999997
917,0.4096
918,0.4096
919,0.4096
920,0.4096
921,0.4096
922,0.4096
923,0.4096
924,0.4096
925,0.4096
926,0.4096
927,0.4096
928,0.42075
929,0.45225
930,0.49249
931,0.53508
932,0.56603
933,0.58311
934,0.58311
935,0.58311
936,0.58311
937,0.58311
938,0.58311
939,0.58311
940,0.60014
941,0.62566
942,0.66932
943,0.71297
944,0.75663
