time,value
0,-0.4323
1,0.031992
2,0.30519
3,-0.25340999999999997
4,0.38682
5,0.5120100000000001
6,-0.23076999999999998
7,-0.51815
8,0.11953
9,-0.37122
10,0.05965499999999999
11,-0.5102899999999999
12,-0.071105
13,0.25299
14,-0.35717
15,-0.16477
16,-0.04427
17,-0.13583
18,0.64685
19,0.28036
20,-0.14824
21,0.074418
22,-0.38404
23,0.69629
24,-0.03916
25,-0.22157
26,-0.36748000000000003
27,-0.41131
28,0.14731
29,0.10013
30,0.1569
31,-0.35974
32,0.12302
33,-0.059428999999999996
34,0.052862
35,-0.066192
36,-0.38494
37,0.45423
38,-0.26004
39,0.24389
40,-0.13055999999999998
41,0.01736
42,0.18314
43,0.39088
44,0.10865999999999999
45,-0.6020300000000001
46,-0.19868
47,0.30829
48,-0.46434
49,0.16518
50,0.093502
51,0.1597
52,0.2699
53,0.040317
54,-0.26626
55,0.31213
56,-1.0365
57,0.47413
58,0.16984000000000002
59,-0.19355999999999998
60,0.15294000000000002
61,0.43798000000000004
62,-0.058551
63,0.12097000000000001
64,0.8025100000000001
65,-0.4934
66,-0.21281
67,1.6457
68,1.6457
69,1.6457
70,1.6457
71,1.6457
72,1.6457
73,1.6457
74,1.6457
75,1.6457
76,1.6457
77,-1.673
78,-1.673
79,-1.673
80,-1.673
81,-1.673
82,-1.673
83,-1.673
84,-1.673
85,-1.673
86,0.23126999999999998
87,-0.036196
88,0.067848
89,0.25825
90,-0.10485
91,-0.17124
92,-0.015508000000000001
93,-0.055879
94,-0.20811999999999997
95,-1.673
96,-1.673
97,-1.673
98,-1.673
99,-1.673
100,-1.673
101,-1.673
102,-1.673
103,-1.673
104,-1.673
105,-1.673
106,-1.673
107,1.6457
108,1.6457
109,1.6457
110,1.6457
111,1.6457
112,1.6457
113,1.6457
114,1.6457
115,1.6457
116,1.6457
117,1.6457
118,1.6457
119,0.14701
120,-0.44276000000000004
121,-0.062199000000000004
122,-0.080194
123,0.34825
124,0.22173
125,-0.52964
126,0.11260999999999999
127,-0.15713
