time,value
0,-0.50148
1,-0.39125
2,-0.28102
3,-0.17079
4,-0.060562
5,0.03052
6,0.24048000000000003
7,0.047916
8,0.047916
9,0.047916
10,0.047916
11,0.047916
12,0.047916
13,0.047916
14,0.047916
15,0.047916
16,0.047916
17,0.047916
18,0.047916
19,0.047916
20,0.047916
21,0.047916
22,0.047916
23,0.047916
24,0.047916
25,0.047916
26,0.047916
27,0.047916
28,0.047916
29,0.047916
30,0.047916
31,0.047916
32,0.047916
33,0.047916
34,0.047916
35,0.047916
36,0.047916
37,0.047916
38,0.047916
39,0.047916
40,0.047916
41,0.047916
42,0.047916
43,0.047916
44,0.047916
45,0.047916
46,0.047916
47,0.047916
48,0.048354
49,0.0641
50,0.079847
51,0.17564000000000002
52,0.28586999999999996
53,0.3961
54,0.096357
55,0.1184
56,0.14045
57,0.16249
58,0.18454
59,0.20659
60,0.22863000000000003
61,0.25068
62,0.27271999999999996
63,0.29477
64,0.31681
65,0.33886
66,0.3609
67,0.38295
68,0.405
69,0.42704
70,0.44419
71,0.44419
72,0.44419
73,0.44419
74,0.44419
75,0.43063
76,0.41488
77,0.39485
78,0.3728
79,0.34131
80,0.30036999999999997
81,0.25138
82,0.18524000000000002
83,0.11954000000000001
84,0.3073
85,-0.081147
86,-0.23203000000000001
87,-0.45248999999999995
88,-0.1395
89,-0.18359
90,-0.21639
91,-0.24159
92,-0.26547
93,-0.28752
94,-0.30956
95,-0.33161
96,-0.35365
97,-0.3757
98,-0.39775
99,-0.40876999999999997
100,-0.41822
101,-0.40579
102,-0.38375
103,-0.3617
104,-0.33966
105,-0.31761
106,-0.29557
107,-0.27352
108,-0.25146999999999997
109,-0.22943000000000002
110,-0.17676
111,-0.12322000000000001
112,-0.27402
113,0.056664
114,0.38735
115,0.1387
116,0.20484000000000002
117,0.27097
118,0.3379
119,0.40718000000000004
120,0.47778000000000004
121,0.56596
122,0.65415
123,0.74233
124,0.8305100000000001
125,0.9053100000000001
126,0.9746
127,1.0422
128,1.1084
129,1.1701
130,1.2237
131,1.2756
132,1.3197
133,1.3638
134,1.4017
135,1.4395
136,1.4646
137,1.4866
138,1.5087
139,1.5307
140,1.5528
141,1.5748
142,1.5969
143,1.6189
144,1.641
145,1.663
146,1.685
147,1.7071
148,1.7291
149,1.7375
150,1.7407
151,1.7302
152,1.7081
153,1.6872
154,1.6683
155,1.6529
156,1.6529
157,1.6529
158,1.6529
159,1.6529
160,1.6529
161,1.6529
162,1.6529
163,1.6529
164,1.6471
165,1.6345
166,1.6193
167,1.5972
168,1.5758
169,1.56
170,1.5443
171,1.5430000000000001
172,1.5430000000000001
173,1.5430000000000001
174,1.5430000000000001
175,1.5307
176,1.5087
177,1.4866
178,1.4646
179,1.4425
180,1.4205
181,1.3985
182,1.3764
183,1.3544
184,1.3323
185,1.3103
186,1.2882
187,1.2662
188,1.2426
189,1.2174
190,1.1867
191,1.1427
192,1.0986
193,1.0545
194,1.0104
195,0.9311200000000001
196,0.8492299999999999
197,0.76263
198,0.6744399999999999
199,0.59343
200,0.51785
201,0.44593999999999995
202,0.3798
203,0.31235
204,0.23992
205,0.16704000000000002
206,0.41884
207,-0.11237
208,-0.46298
209,-0.18569000000000002
210,-0.25916999999999996
211,-0.32531
212,-0.39145
213,-0.45758000000000004
214,-0.52372
215,-0.58986
216,-0.6559999999999999
217,-0.72213
218,-0.78827
219,-0.8365600000000001
220,-0.8838
221,-0.91179
222,-0.93384
223,-0.95405
224,-0.97295
225,-0.9842299999999999
226,-0.9842299999999999
227,-0.9842299999999999
228,-0.9842299999999999
229,-0.98344
230,-0.96455
231,-0.94565
232,-0.92404
233,-0.902
234,-0.8885200000000001
235,-0.87908
236,-0.87435
237,-0.87435
238,-0.87636
239,-0.88266
240,-0.89115
241,-0.91319
242,-0.93524
243,-0.95729
244,-0.9793299999999999
245,-1.0185
246,-1.0626
247,-1.1067
248,-1.1508
249,-1.1949
250,-1.239
251,-1.2831
252,-1.3272
253,-1.3707
254,-1.4054
255,-1.44
256,-1.4636
257,-1.4857
258,-1.5077
259,-1.5298
260,-1.5518
261,-1.5739
262,-1.5959
263,-1.618
264,-1.64
265,-1.662
266,-1.6841
267,-1.7061
268,-1.7282
269,-1.7403
270,-1.7497
271,-1.7534
272,-1.7534
273,-1.7507
274,-1.7444
275,-1.7341
276,-1.7121
277,-1.69
278,-1.6680000000000001
279,-1.6459
280,-1.6239
281,-1.6019
282,-1.5798
283,-1.5578
284,-1.5274
285,-1.4896
286,-1.4496
287,-1.4055
288,-1.3599
289,-1.3063
290,-1.2528
291,-1.1868
292,-1.1207
293,-1.0571
294,-0.9941200000000001
295,-0.94294
296,-0.89885
297,-0.8547600000000001
298,-0.81066
299,-0.77156
300,-0.74636
301,-0.72143
302,-0.69939
303,-0.6773399999999999
304,-0.66667
305,-0.65722
306,-0.6546
307,-0.6546
308,-0.6546
309,-0.6546
310,-0.6546
311,-0.6546
312,-0.6546
313,-0.6546
314,-0.6546
315,-1.8566
316,-1.8037
317,-1.7508
318,-1.6979
319,-1.6449
320,-1.6162
321,-1.6011
322,-1.5929
323,-1.5929
324,-1.5929
325,-1.5929
326,-1.5929
327,-1.5929
328,-1.5929
329,-1.5929
330,-1.5929
331,-1.5929
332,-1.5929
333,-1.5929
334,-1.5929
335,-1.5929
336,-1.5929
337,-1.5929
338,-1.5929
339,-1.5929
340,-1.5929
341,-1.5929
342,-1.5929
343,-1.5929
344,-1.5929
345,-1.5929
346,-1.5929
347,-1.5929
348,-1.5929
349,-1.5929
350,-1.5929
351,-1.5929
352,-1.5929
353,-1.5929
354,-1.5929
355,-1.5929
356,-1.5929
357,-1.5929
358,-1.5929
359,-1.5929
360,-1.5929
361,-1.5929
362,-1.5929
363,-1.5927
364,-1.5851
365,-1.5775
366,-1.5315
367,-1.4786
368,-1.4257
369,-1.3728
370,-1.3199
371,-1.2669
372,-1.214
373,-1.1611
374,-1.1006
375,-0.9872299999999999
376,-0.8738299999999999
377,-0.71759
378,-0.55884
379,-0.41163
380,-0.26799
381,-0.1464
382,-0.17826
383,0.35094000000000003
384,0.17112
385,0.2652
386,0.31811999999999996
387,0.37104000000000004
388,0.42396000000000006
389,0.47686999999999996
390,0.4647
391,0.44201999999999997
392,0.39876
393,0.34584000000000004
394,0.29291999999999996
395,0.24
396,0.18708
397,0.13416
398,0.42548
399,0.12309
400,-0.17931
401,-0.14472000000000002
402,-0.25056
403,-0.3564
404,-0.46224
405,-0.54098
406,-0.60147
407,-0.65879
408,-0.7117100000000001
409,-0.76463
410,-0.81755
411,-0.8704700000000001
412,-0.9233899999999999
413,-0.97631
414,-1.016
415,-1.0538
416,-1.0654
417,-1.0654
418,-1.0654
419,-1.0654
420,-1.0477
421,-0.99479
422,-0.9418700000000001
423,-0.88895
424,-0.8360299999999999
425,-0.7831100000000001
426,-0.73019
427,-0.6772699999999999
428,-0.62435
429,-0.57143
430,-0.51852
431,-0.4656
432,-0.41268
433,-0.35975999999999997
434,-0.30684
435,-0.25392
436,-0.201
437,-0.14808
438,-0.45126000000000005
439,-0.18666
440,-0.082711
441,-0.26465
442,-0.14565
443,-0.14565
444,0.20435
445,0.17664000000000002
446,0.34674
447,0.11735999999999999
448,0.17028
449,0.20829
450,0.24609
451,0.25344
452,0.25344
453,0.25344
454,0.25344
455,0.27696
456,0.32988
457,0.3828
458,0.43572
459,0.48549
460,0.5006
461,0.51572
462,0.5171899999999999
463,0.5171899999999999
464,0.5171899999999999
465,0.5171899999999999
466,0.5171899999999999
467,0.5171899999999999
468,0.5199199999999999
469,0.5274800000000001
470,0.54323
471,0.59615
472,0.64907
473,0.70199
474,0.7549100000000001
475,0.80783
476,0.86075
477,0.9136700000000001
478,0.96659
479,1.0195
480,1.0724
481,1.1253
482,1.1783
483,1.2312
484,1.2841
485,1.337
486,1.3899
487,1.4429
488,1.4958
489,1.5487
490,1.5722
491,1.5722
492,1.5722
493,1.5722
494,1.5722
495,1.5722
496,1.5722
497,1.5722
498,1.5722
499,1.5722
500,1.5722
501,1.5722
502,1.5722
503,1.5758
504,1.5834
505,1.6041
506,1.6571
507,1.71
508,1.7629
509,1.8158
510,1.7843
511,1.7465
512,1.6974
513,1.6445
514,1.5743
515,1.4912
516,1.3992
517,1.2933
518,1.1907
519,1.0999
520,1.0103
521,0.95735
522,0.90443
523,0.85151
524,0.7985899999999999
525,0.67511
526,0.51635
527,0.3576
528,0.19884000000000002
529,0.28268000000000004
530,-0.32211
531,-0.1884
532,-0.29424
533,-0.40008
534,-0.4845
535,-0.56766
536,-0.62771
537,-0.6806300000000001
538,-0.72032
539,-0.75056
540,-0.7259899999999999
541,-0.62015
542,-0.51432
543,-0.40848
544,-0.30453
545,-0.24405
546,-0.18357
547,-0.1296
548,-0.35886
549,0.092349
550,0.42443000000000003
551,0.17448
552,0.28031999999999996
553,0.38133
554,0.47205
555,0.5575100000000001
556,0.61043
557,0.66335
558,0.71627
559,0.7691899999999999
560,0.78095
561,0.78095
562,0.78095
563,0.78095
564,0.78095
565,0.78095
566,0.78095
567,0.78095
568,0.78095
569,0.78095
570,0.78095
571,0.78095
572,0.78095
573,0.7757
574,0.7681399999999999
575,0.73727
576,0.68435
577,0.63143
578,0.5785100000000001
579,0.52559
580,0.47267
581,0.41976
582,0.36684
583,0.31392
584,0.28494
585,0.26226
586,0.25344
587,0.25344
588,0.24693
589,0.23181
590,0.20724
591,0.15432
592,0.1014
593,0.26694
594,0.050348000000000004
595,-0.14565
596,-0.14565
597,-0.14565
598,-0.14565
599,0.072687
600,0.26169000000000003
601,0.47693
602,0.1434
603,0.19632
604,0.24924000000000002
605,0.30216
606,0.35508
607,0.408
608,0.46092
609,0.51384
610,0.56675
611,0.6196699999999999
612,0.6725899999999999
613,0.72551
614,0.7784300000000001
615,0.83135
616,0.8842700000000001
617,0.93719
618,0.99011
619,0.9884299999999999
620,0.98087
621,0.94055
622,0.8876299999999999
623,0.8347100000000001
624,0.78179
625,0.72887
626,0.67595
627,0.62303
628,0.57011
629,0.5171899999999999
630,-1.5363
631,-1.5363
632,-1.5363
633,-1.5363
634,-1.5363
635,-1.5363
636,-1.5363
637,-1.5363
638,-1.5363
639,-1.5363
640,-1.5363
641,-1.5363
642,-1.5363
643,-1.5363
644,-1.5363
645,-1.5363
646,-1.5363
647,-1.5363
648,-1.5363
649,-1.5363
650,-1.5363
651,-1.5363
652,-1.5363
653,-1.5363
654,-1.5363
655,-1.5363
656,-1.5363
657,-1.5363
658,-1.5363
659,-1.5325
660,-1.5268
661,-1.5144
662,-1.4944
663,-1.4744
664,-1.4545
665,-1.4367
666,-1.4367
667,-1.4367
668,-1.4367
669,-1.4367
670,-1.4367
671,-1.4367
672,-1.4367
673,-1.4367
674,-1.4367
675,-1.4367
676,-1.4367
677,-1.4367
678,-1.4365
679,-1.4308
680,-1.4251
681,-1.3904
682,-1.3505
683,-1.3105
684,-1.2705
685,-1.2306
686,-1.1906
687,-1.1507
688,-1.1107
689,-1.0665
690,-0.9923
691,-0.9181
692,-0.8196399999999999
693,-0.7197600000000001
694,-0.61987
695,-0.51999
696,-0.4201
697,-0.32022
698,-0.22034
699,-0.12045
700,-0.1005
701,0.29904000000000003
702,0.13480999999999999
703,0.21470999999999998
704,0.29462
705,0.37453000000000003
706,0.45443999999999996
707,0.5343399999999999
708,0.61425
709,0.6856
710,0.74838
711,0.80387
712,0.84383
713,0.8833799999999999
714,0.92048
715,0.9575799999999999
716,0.9782700000000001
717,0.99825
718,1.0182
719,1.0382
720,1.0582
721,1.0782
722,1.0981
723,1.1181
724,1.1354
725,1.1440000000000001
726,1.1520000000000001
727,1.1520000000000001
728,1.1520000000000001
729,1.157
730,1.1627
731,1.1784
732,1.1983
733,1.2183
734,1.2383
735,1.2649
736,1.3049
737,1.3448
738,1.3848
739,1.4247
740,1.4508
741,1.4765
742,1.4977
743,1.5176
744,1.5376
745,1.5576
746,1.5776
747,1.5976
748,1.6168
749,1.6339
750,1.6499
751,1.6499
752,1.6499
753,1.6499
754,1.6499
755,1.6377
756,1.6206
757,1.6019999999999999
758,1.5819999999999999
759,1.5619999999999998
760,1.5421
761,1.5221
762,1.5021
763,1.4821
764,1.4678
765,1.4535
766,1.4507
767,1.4507
768,1.4507
769,1.4507
770,1.4419
771,1.4219
772,1.4019
773,1.3819
774,1.3608
775,1.3265
776,1.2923
777,1.2529
778,1.2129
779,1.173
780,1.133
781,1.0931
782,1.0531
783,1.0142
784,0.97708
785,0.9430799999999999
786,0.9231
787,0.90312
788,0.8831399999999999
789,0.8631700000000001
790,0.84319
791,0.82321
792,0.80324
793,0.7832600000000001
794,0.7632800000000001
795,0.74331
796,0.72333
797,0.70335
798,0.68282
799,0.65714
800,0.63145
801,0.5926899999999999
802,0.55273
803,0.51278
804,0.47283000000000003
805,0.43287
806,0.39292
807,0.35297
808,0.31301
809,0.27583
810,0.25015
811,0.22454000000000002
812,0.20457
813,0.18459
814,0.16460999999999998
815,0.14464000000000002
816,0.12465999999999999
817,0.10468
818,0.44133
819,0.32718
820,0.18805999999999998
821,-0.043314
822,-0.21148000000000003
823,-0.41125
824,-0.12711
825,-0.19893
826,-0.27313000000000004
827,-0.35161
828,-0.43151999999999996
829,-0.49843000000000004
830,-0.5555
831,-0.60592
832,-0.6458699999999999
833,-0.68583
834,-0.72578
835,-0.76573
836,-0.80569
837,-0.84564
838,-0.8856
839,-0.92555
840,-0.9388700000000001
841,-0.9388700000000001
842,-0.9388700000000001
843,-0.9388700000000001
844,-0.9345100000000001
845,-0.92024
846,-0.9052600000000001
847,-0.88528
848,-0.8653
849,-0.85341
850,-0.8420000000000001
851,-0.8393
852,-0.8393
853,-0.8376399999999999
854,-0.83478
855,-0.8250299999999999
856,-0.80505
857,-0.78508
858,-0.7651
859,-0.74584
860,-0.74298
861,-0.7401300000000001
862,-0.73973
863,-0.73973
864,-0.73973
865,-0.73973
866,-0.73973
867,-0.73973
868,-0.7360899999999999
869,-0.72467
870,-0.70929
871,-0.6693399999999999
872,-0.62939
873,-0.58943
874,-0.54948
875,-0.49399
876,-0.43406000000000006
877,-0.37413
878,-0.3142
879,-0.2721
880,-0.25498000000000004
881,-0.2419
882,-0.2419
883,-0.24
884,-0.20575
885,-0.1715
886,-0.46198
887,-0.062446
888,0.30735999999999997
889,0.12791
890,0.17285999999999999
891,0.19283
892,0.21281
893,0.23279
894,0.25277
895,0.27274
896,0.29272
897,0.3127
898,0.33266999999999997
899,0.34360999999999997
900,0.35217
901,0.3555
902,0.3555
903,0.3555
904,0.3555
905,0.3555
906,0.3555
907,0.3555
908,0.3555
909,0.3555
910,0.3555
911,0.3555
912,0.3555
913,0.3555
914,0.34797
915,0.3337
916,0.31745
917,0.29748
918,0.2775
919,0.25751999999999997
920,0.23755
921,0.21756999999999999
922,0.19759000000000002
923,0.17761
924,0.15764
925,0.13766
926,0.11767999999999999
927,0.097708
928,0.41318999999999995
929,0.3359
930,0.32163
931,0.30855
932,0.30855
933,0.30855
934,0.30855
935,0.30855
936,0.30855
937,0.30855
938,0.32400999999999996
939,0.35255
940,0.40685
941,0.096439
942,0.11642000000000001
943,0.13639
944,0.15637
