time,value
0,-0.086035
1,-0.086035
2,-0.086035
3,-0.086035
4,-0.086035
5,-0.086035
6,-0.086035
7,-0.086035
8,-0.086035
9,-0.086035
10,-0.086035
11,-0.086035
12,-0.086035
13,-0.086035
14,-0.086035
15,-0.086035
16,-0.086035
17,-0.086035
18,-0.086035
19,-0.086035
20,-0.086035
21,-0.086035
22,-0.086035
23,-0.086035
24,-0.086035
25,-0.086035
26,-0.086035
27,-0.086035
28,-0.086035
29,-0.086035
30,-0.086035
31,-0.086035
32,-0.086035
33,-0.086035
34,-0.086035
35,-0.086035
36,-0.086035
37,-0.086035
38,-0.086035
39,-0.086035
40,-0.086035
41,-0.086035
42,-0.086035
43,-0.086035
44,-0.086035
45,-0.086035
46,-0.086035
47,-0.086035
48,-0.086035
49,-0.086035
50,-0.086035
51,-0.086035
52,-0.086035
53,-0.086035
54,-0.086035
55,-0.086035
56,-0.086035
57,-0.086035
58,-0.086035
59,-0.086035
60,-0.086035
61,-0.086035
62,-0.086035
63,-0.086035
64,-0.086035
65,-0.086035
66,-0.086035
67,-0.086035
68,-0.086035
69,-0.086035
70,-0.086035
71,-0.086035
72,-0.086035
73,-0.086035
74,-0.086035
75,-0.086035
76,-0.086035
77,-0.086035
78,-0.086035
79,-0.086035
80,-0.086035
81,-0.086035
82,-0.086035
83,-0.086035
84,-0.086035
85,-0.086035
86,-0.086035
87,-0.086035
88,-0.086035
89,-0.086035
90,-0.086035
91,-0.086035
92,-0.086035
93,-0.086035
94,-0.086035
95,-0.086035
96,-0.086035
97,-0.086035
98,-0.086035
99,-0.086035
100,-0.086035
101,-0.086035
102,-0.086035
103,-0.086035
104,-0.086035
105,-0.086035
106,-0.086035
107,-0.086035
108,-0.086035
109,-0.086035
110,-0.086035
111,-0.086035
112,-0.086035
113,-0.086035
114,-0.086035
115,-0.086035
116,-0.086035
117,-0.086035
118,-0.086035
119,-0.086035
120,-0.086035
121,-0.086035
122,-0.086035
123,-0.086035
124,-0.086035
125,-0.086035
126,-0.086035
127,-0.086035
128,-0.086035
129,-0.086035
130,-0.086035
131,-0.086035
132,-0.086035
133,-0.086035
134,-0.086035
135,-0.086035
136,-0.086035
137,-0.086035
138,-0.086035
139,-0.086035
140,-0.086035
141,-0.086035
142,-0.086035
143,-0.086035
144,-0.086035
145,-0.086035
146,-0.086035
147,-0.086035
148,-0.086035
149,-0.086035
150,-0.086035
151,-0.086035
152,-0.086035
153,-0.086035
154,-0.086035
155,-0.086035
156,-0.086035
157,-0.086035
158,-0.086035
159,-0.086035
160,-0.086035
161,-0.086035
162,-0.086035
163,-0.086035
164,-0.086035
165,-0.086035
166,-0.086035
167,-0.086035
168,-0.086035
169,-0.086035
170,-0.086035
171,-0.086035
172,-0.086035
173,-0.086035
174,-0.086035
175,-0.086035
176,-0.086035
177,-0.086035
178,-0.086035
179,-0.086035
180,-0.086035
181,-0.086035
182,-0.086035
183,-0.086035
184,-0.086035
185,-0.086035
186,-0.086035
187,-0.086035
188,-0.086035
189,-0.086035
190,-0.086035
191,-0.086035
192,-0.086035
193,-0.086035
194,-0.086035
195,-0.086035
196,-0.086035
197,-0.086035
198,-0.086035
199,-0.086035
200,-0.086035
201,-0.086035
202,-0.086035
203,-0.086035
204,-0.086035
205,-0.086035
206,-0.086035
207,-0.086035
208,-0.086035
209,-0.086035
210,-0.086035
211,-0.086035
212,-0.086035
213,-0.086035
214,-0.086035
215,-0.086035
216,-0.086035
217,-0.086035
218,-0.086035
219,-0.086035
220,-0.086035
221,-0.086035
222,-0.086035
223,-0.086035
224,-0.086035
225,-0.086035
226,-0.086035
227,-0.086035
228,-0.086035
229,-0.086035
230,-0.086035
231,-0.086035
232,-0.086035
233,-0.086035
234,-0.086035
235,-0.086035
236,-0.086035
237,-0.086035
238,-0.086035
239,-0.086035
240,-0.086035
241,-0.086035
242,-0.086035
243,-0.086035
244,-0.086035
245,-0.086035
246,-0.086035
247,-0.086035
248,-0.086035
249,-0.086035
250,-0.086035
251,-0.086035
252,-0.086035
253,-0.086035
254,-0.086035
255,-0.086035
256,-0.086035
257,-0.086035
258,-0.086035
259,-0.086035
260,-0.086035
261,-0.086035
262,-0.086035
263,-0.086035
264,-0.086035
265,-0.086035
266,-0.086035
267,-0.086035
268,-0.086035
269,-0.086035
270,-0.086035
271,-0.086035
272,-0.086035
273,-0.086035
274,-0.086035
275,-0.086035
276,-0.086035
277,-0.086035
278,-0.086035
279,-0.086035
280,-0.086035
281,-0.086035
282,-0.086035
283,-0.086035
284,-0.086035
285,-0.086035
286,-0.086035
287,-0.086035
288,-0.086035
289,-0.086035
290,-0.086035
291,-0.086035
292,-0.086035
293,-0.086035
294,-0.086035
295,-0.086035
296,-0.086035
297,-0.086035
298,-0.086035
299,-0.086035
300,-0.086035
301,-0.086035
302,-0.086035
303,-0.086035
304,-0.086035
305,-0.086035
306,-0.086035
307,-0.086035
308,-0.086035
309,-0.086035
310,-0.086035
311,-0.086035
312,-0.086035
313,-0.086035
314,-0.086035
315,-0.086035
316,-0.086035
317,-0.086035
318,-0.086035
319,-0.086035
320,-0.086035
321,-0.086035
322,-0.086035
323,-0.086035
324,-0.086035
325,-0.086035
326,-0.086035
327,-0.086035
328,-0.086035
329,-0.086035
330,-0.086035
331,-0.086035
332,-0.086035
333,-0.086035
334,-0.086035
335,-0.086035
336,-0.086035
337,-0.086035
338,-0.086035
339,-0.086035
340,-0.086035
341,-0.086035
342,-0.086035
343,-0.086035
344,-0.086035
345,-0.086035
346,-0.086035
347,-0.086035
348,-0.086035
349,-0.086035
350,-0.086035
351,-0.086035
352,-0.086035
353,-0.086035
354,-0.086035
355,-0.086035
356,-0.086035
357,-0.086035
358,-0.086035
359,-0.086035
360,-0.086035
361,-0.086035
362,-0.086035
363,-0.086035
364,-0.086035
365,-0.086035
366,-0.086035
367,-0.086035
368,-0.086035
369,-0.086035
370,-0.086035
371,-0.086035
372,-0.086035
373,-0.086035
374,-0.086035
375,-0.086035
376,-0.086035
377,-0.086035
378,-0.086035
379,-0.086035
380,-0.086035
381,-0.086035
382,-0.086035
383,-0.086035
384,-0.086035
385,-0.086035
386,-0.086035
387,-0.086035
388,-0.086035
389,-0.086035
390,-0.086035
391,-0.086035
392,-0.086035
393,-0.086035
394,-0.086035
395,-0.086035
396,-0.086035
397,-0.086035
398,-0.086035
399,-0.086035
400,-0.086035
401,-0.086035
402,-0.086035
403,-0.086035
404,-0.086035
405,-0.086035
406,-0.086035
407,-0.086035
408,-0.086035
409,-0.086035
410,-0.086035
411,-0.086035
412,-0.086035
413,-0.086035
414,-0.086035
415,-0.086035
416,-0.086035
417,-0.086035
418,-0.086035
419,-0.086035
420,-0.086035
421,-0.086035
422,-0.086035
423,-0.086035
424,-0.086035
425,-0.086035
426,-0.086035
427,-0.086035
428,-0.086035
429,-0.086035
430,-0.086035
431,-0.086035
432,-0.086035
433,-0.086035
434,-0.086035
435,-0.086035
436,-0.086035
437,-0.086035
438,-0.086035
439,-0.086035
440,-0.086035
441,-0.086035
442,-0.086035
443,-0.086035
444,-0.086035
445,-0.086035
446,-0.086035
447,-0.086035
448,-0.086035
449,-0.086035
450,-0.086035
451,-0.086035
452,-0.086035
453,-0.086035
454,-0.086035
455,-0.086035
456,-0.086035
457,-0.086035
458,-0.086035
459,-0.086035
460,-0.086035
461,-0.086035
462,-0.086035
463,-0.086035
464,-0.086035
465,-0.086035
466,-0.086035
467,-0.086035
468,-0.086035
469,-0.086035
470,-0.086035
471,-0.086035
472,-0.086035
473,-0.086035
474,-0.086035
475,-0.086035
476,-0.086035
477,-0.086035
478,-0.086035
479,-0.086035
480,-0.086035
481,-0.086035
482,-0.086035
483,-0.086035
484,-0.086035
485,-0.086035
486,-0.086035
487,-0.086035
488,-0.086035
489,-0.086035
490,-0.086035
491,-0.086035
492,-0.086035
493,-0.086035
494,-0.086035
495,-0.086035
496,-0.086035
497,-0.086035
498,-0.086035
499,-0.086035
500,-0.086035
501,-0.086035
502,-0.086035
503,-0.086035
504,-0.086035
505,-0.086035
506,-0.086035
507,-0.086035
508,-0.086035
509,-0.086035
510,-0.086035
511,-0.086035
512,-0.086035
513,-0.086035
514,-0.086035
515,-0.086035
516,-0.086035
517,-0.086035
518,-0.086035
519,-0.086035
520,-0.086035
521,-0.086035
522,-0.086035
523,-0.086035
524,-0.086035
525,-0.086035
526,-0.086035
527,-0.086035
528,-0.086035
529,-0.086035
530,-0.086035
531,-0.086035
532,-0.086035
533,-0.086035
534,-0.086035
535,-0.086035
536,-0.086035
537,-0.086035
538,-0.086035
539,-0.086035
540,-0.086035
541,-0.086035
542,-0.086035
543,-0.086035
544,3.3939999999999997
545,13.37
546,12.905999999999999
547,12.442
548,12.442
549,6.8741
550,-0.086035
551,-0.086035
552,-0.086035
553,-0.086035
554,-0.086035
555,-0.086035
556,-0.086035
557,-0.086035
558,-0.086035
559,-0.086035
560,-0.086035
561,-0.086035
562,-0.086035
563,-0.086035
564,-0.086035
565,-0.086035
566,-0.086035
567,-0.086035
568,-0.086035
569,-0.086035
570,-0.086035
571,-0.086035
572,-0.086035
573,-0.086035
574,-0.086035
575,-0.086035
576,-0.086035
577,-0.086035
578,-0.086035
579,-0.086035
580,-0.086035
581,-0.086035
582,-0.086035
583,-0.086035
584,-0.086035
585,-0.086035
586,-0.086035
587,-0.086035
588,-0.086035
589,-0.086035
590,-0.086035
591,-0.086035
592,-0.086035
593,-0.086035
594,-0.086035
595,-0.086035
596,-0.086035
597,-0.086035
598,-0.086035
599,-0.086035
600,-0.086035
601,-0.086035
602,-0.086035
603,-0.086035
604,-0.086035
605,-0.086035
606,-0.086035
607,-0.086035
608,-0.086035
609,-0.086035
610,-0.086035
611,-0.086035
612,-0.086035
613,-0.086035
614,-0.086035
615,-0.086035
616,-0.086035
617,-0.086035
618,-0.086035
619,-0.086035
620,-0.086035
621,-0.086035
622,-0.086035
623,-0.086035
624,-0.086035
625,-0.086035
626,-0.086035
627,-0.086035
628,-0.086035
629,-0.086035
630,-0.086035
631,-0.086035
632,-0.086035
633,-0.086035
634,-0.086035
635,-0.086035
636,-0.086035
637,-0.086035
638,-0.086035
639,-0.086035
640,-0.086035
641,-0.086035
642,-0.086035
643,-0.086035
644,-0.086035
645,-0.086035
646,-0.086035
647,-0.086035
648,-0.086035
649,-0.086035
650,-0.086035
651,-0.086035
652,-0.086035
653,-0.086035
654,-0.086035
655,-0.086035
656,-0.086035
657,-0.086035
658,-0.086035
659,-0.086035
660,-0.086035
661,-0.086035
662,-0.086035
663,-0.086035
664,-0.086035
665,-0.086035
666,-0.086035
667,-0.086035
668,-0.086035
669,-0.086035
670,-0.086035
671,-0.086035
672,-0.086035
673,-0.086035
674,-0.086035
675,-0.086035
676,-0.086035
677,-0.086035
678,-0.086035
679,-0.086035
680,-0.086035
681,-0.086035
682,-0.086035
683,-0.086035
684,-0.086035
685,-0.086035
686,-0.086035
687,-0.086035
688,-0.086035
689,-0.086035
690,-0.086035
691,-0.086035
692,-0.086035
693,-0.086035
694,-0.086035
695,-0.086035
696,-0.086035
697,-0.086035
698,-0.086035
699,-0.086035
700,-0.086035
701,-0.086035
702,-0.086035
703,-0.086035
704,-0.086035
705,-0.086035
706,-0.086035
707,-0.086035
708,-0.086035
709,-0.086035
710,-0.086035
711,-0.086035
712,-0.086035
713,-0.086035
714,-0.086035
715,-0.086035
716,-0.086035
717,-0.086035
718,-0.086035
719,-0.086035
