time,value
0,-0.82094
1,-0.70711
2,-0.5699
3,-0.405
4,-0.23539000000000002
5,-0.055234000000000005
6,0.13527999999999998
7,0.30805
8,0.46593
9,0.59264
10,0.71949
11,0.8348899999999999
12,0.9401200000000001
13,1.0384
14,1.0852
15,1.0488
16,0.8698
17,0.5231100000000001
18,0.027316000000000003
19,-0.5443899999999999
20,-1.0776
21,-1.4545
22,-1.5964
23,-1.493
24,-1.1785
25,-0.7671899999999999
26,-0.36825
27,-0.052690999999999995
28,0.12984
29,0.19465
30,0.19063
31,0.2121
32,0.26405
33,0.3877
34,0.53814
35,0.65157
36,0.70678
37,0.6656
38,0.57686
39,0.45607
40,0.33239
41,0.25556
42,0.17657
43,0.1057
44,-0.025802999999999996
45,-0.22616
46,-0.46585
47,-0.6957399999999999
48,-0.85225
49,-0.8896799999999999
50,-0.79257
51,-0.60393
52,-0.39359
53,-0.22551999999999997
54,-0.14525
55,-0.15943
56,-0.22455
57,-0.2533
58,-0.18747
59,0.018522
60,0.33502
61,0.69829
62,1.0347
63,1.2503
64,1.3144
65,1.2265
66,1.0469
67,0.7742100000000001
68,0.5039399999999999
69,0.26847
70,0.070011
71,-0.082528
72,-0.20928000000000002
73,-0.31672
74,-0.45028
75,-0.57129
76,-0.6947399999999999
77,-0.84001
78,-0.9893
79,-1.1279
80,-1.2474
81,-1.3351
82,-1.3261
83,-1.2022
84,-0.93939
85,-0.5533
86,-0.04929
87,0.5082399999999999
88,1.0463
89,1.4951
90,1.7968
91,1.9106
92,1.8176
93,1.5562
94,1.1474
95,0.68763
96,0.22991999999999999
97,-0.13812
98,-0.38532
99,-0.5130399999999999
100,-0.54219
101,-0.5185
102,-0.49704
103,-0.50968
104,-0.57452
105,-0.66005
106,-0.7229300000000001
107,-0.75912
108,-0.72253
109,-0.60831
110,-0.42553
111,-0.22296999999999997
112,-0.011949
113,0.17623
114,0.32091
115,0.42256000000000005
116,0.48093
117,0.50669
118,0.50379
119,0.47844
120,0.43638999999999994
121,0.39531
122,0.36262
123,0.35338
124,0.39879000000000003
125,0.47706000000000004
126,0.5706600000000001
127,0.61611
128,0.56628
129,0.3974
130,0.09765
131,-0.26711
132,-0.6359
133,-0.9067799999999999
134,-1.0466
135,-1.043
136,-0.9152100000000001
137,-0.76081
138,-0.62465
139,-0.55302
140,-0.53723
141,-0.5122399999999999
142,-0.44553000000000004
143,-0.261
144,0.00091984
145,0.32215
146,0.61437
147,0.82584
148,0.9270200000000001
149,0.91219
150,0.85216
151,0.7823
152,0.77294
153,0.83706
154,0.94457
155,1.012
156,0.94891
157,0.7319100000000001
158,0.35681
159,-0.12225
160,-0.62657
161,-1.0755
162,-1.4023
163,-1.5628
164,-1.5509
165,-1.4246
166,-1.2172
167,-0.97562
168,-0.68296
169,-0.38168
170,-0.094786
171,0.17999
172,0.37934
173,0.48228000000000004
174,0.48751000000000005
175,0.44269
176,0.37037
177,0.33105
178,0.38437
179,0.53959
180,0.75847
181,1.0023
182,1.2058
183,1.2876
184,1.2109999999999999
185,0.96001
186,0.59312
187,0.13577
188,-0.3451
189,-0.80523
190,-1.1988
191,-1.4818
192,-1.6117
193,-1.5634
194,-1.3503
195,-0.96183
196,-0.47495
197,0.046526
198,0.48048
199,0.7502
200,0.8225299999999999
201,0.6783899999999999
202,0.41873999999999995
203,0.11575
204,-0.1381
205,-0.26884
206,-0.25366
207,-0.13404000000000002
208,0.058815
209,0.21213
210,0.29712
211,0.26463000000000003
212,0.14037
213,-0.029923
214,-0.19035
215,-0.2864
216,-0.32691
217,-0.28681
218,-0.18379
219,-0.04364
220,0.15016
221,0.39179
222,0.6593100000000001
223,0.92771
224,1.1483
225,1.2409
226,1.1633
227,0.9008200000000001
228,0.49556000000000006
229,-0.014184
230,-0.52984
231,-0.94599
232,-1.2159
233,-1.3171
234,-1.2429
235,-1.0482
236,-0.80299
237,-0.53061
238,-0.24627
239,0.030713
240,0.26766999999999996
241,0.43485
242,0.49581000000000003
243,0.42768999999999996
244,0.22441999999999998
245,-0.050598000000000004
246,-0.33085
247,-0.48522
248,-0.46228
249,-0.22707
250,0.187
251,0.67323
252,1.099
253,1.3596
254,1.3641
255,1.1292
256,0.7328100000000001
257,0.30375
258,-0.052397000000000006
259,-0.27601
260,-0.33966999999999997
261,-0.2996
262,-0.23463
263,-0.21138
264,-0.30504000000000003
265,-0.50639
266,-0.73968
267,-0.9521700000000001
268,-1.0837
269,-1.1068
270,-1.0190000000000001
271,-0.8227399999999999
272,-0.57333
273,-0.27307
274,0.060882000000000006
275,0.37616
276,0.66389
277,0.88623
278,1.0144
279,1.006
280,0.88884
281,0.65535
282,0.36978
283,0.11325999999999999
284,-0.081112
285,-0.16526
286,-0.14652
287,-0.079098
288,-0.046477
289,-0.06273200000000001
290,-0.13367
291,-0.21643
292,-0.27619
293,-0.24355
294,-0.082231
295,0.15279
296,0.38978
297,0.55902
298,0.597
299,0.43808
300,0.11035999999999999
301,-0.29328000000000004
302,-0.66284
303,-0.93329
304,-1.0211
305,-0.90264
306,-0.64486
307,-0.33651
308,-0.031421
309,0.1834
310,0.30831
311,0.30351999999999996
312,0.20578000000000002
313,0.049166
314,-0.15372
315,-0.35328000000000004
316,-0.51812
317,-0.5906399999999999
318,-0.5456300000000001
319,-0.36224
320,-0.041214999999999995
321,0.34271
322,0.72539
323,1.0299
324,1.1828
325,1.1666
326,1.0295
327,0.85001
328,0.70806
329,0.67555
330,0.77909
331,0.9643200000000001
332,1.1066
333,1.1092
334,0.8736700000000001
335,0.35252
336,-0.40195
337,-1.2735
338,-2.0871
339,-2.6683
340,-2.8856
341,-2.6952
342,-2.1336
343,-1.3030000000000002
344,-0.37053
345,0.47631999999999997
346,1.0785
347,1.3755
348,1.341
349,1.0666
350,0.6823100000000001
351,0.34381999999999996
352,0.16049000000000002
353,0.19097
354,0.41318999999999995
355,0.77787
356,1.1517
357,1.4134
358,1.4684
359,1.2942
360,0.91341
361,0.3962
362,-0.13323
363,-0.58005
364,-0.89828
365,-1.0328
366,-1.013
367,-0.89981
368,-0.72773
369,-0.5571699999999999
370,-0.4116
371,-0.34309
372,-0.35014
373,-0.43738
374,-0.58686
375,-0.75973
376,-0.85052
377,-0.81006
378,-0.575
379,-0.13205999999999998
380,0.46888
381,1.117
382,1.7154
383,2.1248
384,2.2283
385,2.0094
386,1.5123
387,0.81376
388,0.061371
389,-0.6058399999999999
390,-1.1035
391,-1.4002
392,-1.5021
393,-1.433
394,-1.2595
395,-1.0231
396,-0.7286
397,-0.37828
398,0.0027764
399,0.37984
400,0.74268
401,1.0424
402,1.1968
403,1.1737
404,0.9956799999999999
405,0.70211
406,0.35518
407,0.043169
408,-0.16725
409,-0.26949
410,-0.27603
411,-0.2511
412,-0.25997
413,-0.35315
414,-0.56501
415,-0.86769
416,-1.2117
417,-1.5066
418,-1.6374
419,-1.5164
420,-1.1144
421,-0.44997
422,0.39702
423,1.2954
424,2.1041
425,2.6842
426,2.9145
427,2.7593
428,2.2313
429,1.4456
430,0.54237
431,-0.29915
432,-0.9399200000000001
433,-1.3018
434,-1.385
435,-1.2654
436,-1.0735
437,-0.90151
438,-0.8250799999999999
439,-0.9096
440,-1.1016
441,-1.3197
442,-1.4593
443,-1.4172
444,-1.1711
445,-0.72267
446,-0.10177
447,0.59913
448,1.3013
449,1.929
450,2.4034
451,2.6710000000000003
452,2.6878
453,2.4494
454,1.9755
455,1.2934
456,0.45819
457,-0.43328999999999995
458,-1.2549
459,-1.9062
460,-2.3205
461,-2.4524
462,-2.3243
463,-2.0308
464,-1.6502
465,-1.2564
466,-0.91546
467,-0.616
468,-0.3172
469,0.017399
470,0.43643999999999994
471,0.9155399999999999
472,1.4552
473,1.9843
474,2.4237
475,2.6839
476,2.7396
477,2.5660000000000003
478,2.1898
479,1.649
480,0.9827600000000001
481,0.26297
482,-0.45811
483,-1.1175
484,-1.683
485,-2.0912
486,-2.3159
487,-2.3702
488,-2.2704
489,-2.0718
490,-1.8266
491,-1.5773
492,-1.3317
493,-1.0728
494,-0.77478
495,-0.41168999999999994
496,0.048412000000000004
497,0.5930300000000001
498,1.1531
499,1.6702
