time,value
0,0.60173
1,0.52971
2,0.50657
3,0.5351
4,0.59026
5,0.6219399999999999
6,0.5911
7,0.47036999999999995
8,0.26166999999999996
9,-0.002125
10,-0.28002
11,-0.53003
12,-0.7378100000000001
13,-0.90084
14,-1.021
15,-1.1245
16,-1.2174
17,-1.2923
18,-1.3292
19,-1.2962
20,-1.1645
21,-0.9113100000000001
22,-0.5604899999999999
23,-0.13596
24,0.30732
25,0.7226899999999999
26,1.061
27,1.3046
28,1.4451
29,1.4772
30,1.4232
31,1.3076
32,1.1391
33,0.9400200000000001
34,0.71646
35,0.4742
36,0.20865999999999998
37,-0.06288300000000001
38,-0.33671
39,-0.60635
40,-0.84373
41,-1.0066
42,-1.0589
43,-0.9799899999999999
44,-0.76577
45,-0.44256
46,-0.077013
47,0.26356
48,0.51607
49,0.62564
50,0.56524
51,0.36404000000000003
52,0.070175
53,-0.26193
54,-0.58178
55,-0.83885
56,-1.0188
57,-1.1321
58,-1.1686
59,-1.1086
60,-0.94596
61,-0.67629
62,-0.27629000000000004
63,0.22466999999999998
64,0.77127
65,1.286
66,1.6986
67,1.9291
68,1.9346
69,1.7314
70,1.3702
71,0.9101799999999999
72,0.40537
73,-0.078577
74,-0.49401000000000006
75,-0.8246
76,-1.0423
77,-1.1326
78,-1.0834
79,-0.90043
80,-0.59588
81,-0.21836999999999998
82,0.14481
83,0.42100000000000004
84,0.53928
85,0.46613999999999994
86,0.22061999999999998
87,-0.13844
88,-0.52268
89,-0.8449
90,-1.0451
91,-1.0871
92,-0.98636
93,-0.7865300000000001
94,-0.52776
95,-0.24552
96,0.057964999999999996
97,0.37384
98,0.69631
99,1.0172
100,1.2999
101,1.4809999999999999
102,1.5075
103,1.3459
104,1.0011
105,0.52428
106,-0.0048356
107,-0.48908
108,-0.8345799999999999
109,-1.0108
110,-1.0165
111,-0.8885
112,-0.71458
113,-0.55603
114,-0.44525
115,-0.39893
116,-0.38966
117,-0.3839
118,-0.34357
119,-0.23926
120,-0.079458
121,0.12385
122,0.33123
123,0.52176
124,0.67733
125,0.78186
126,0.82849
127,0.8246399999999999
128,0.77137
129,0.66928
130,0.52635
131,0.35034
132,0.14902
133,-0.060962
134,-0.26946
135,-0.46316999999999997
136,-0.6372800000000001
137,-0.79047
138,-0.92253
139,-1.0059
140,-1.0290000000000001
141,-0.96367
142,-0.8104100000000001
143,-0.5724
144,-0.27205999999999997
145,0.047493
146,0.31851
147,0.50149
148,0.56822
149,0.5216
150,0.40168000000000004
151,0.2702
152,0.18145999999999998
153,0.18028
154,0.28745
155,0.47628000000000004
156,0.6946
157,0.8940100000000001
158,1.0298
159,1.0558
160,0.95314
161,0.72941
162,0.39896
163,-0.030441000000000003
164,-0.5264300000000001
165,-1.0517
166,-1.5423
167,-1.9446
168,-2.1809
169,-2.19
170,-1.9459
171,-1.4657
172,-0.81179
173,-0.056278999999999996
174,0.69004
175,1.3337
176,1.8103
177,2.0886
178,2.1699
179,2.0759
180,1.8331
181,1.4463
182,0.93134
183,0.32393
184,-0.33324000000000004
185,-0.9844700000000001
186,-1.5449
187,-1.921
188,-2.0466
189,-1.8942
190,-1.4780000000000002
191,-0.87234
192,-0.20149
193,0.42606000000000005
194,0.92132
195,1.2152
196,1.3096
197,1.2223
198,1.0029
199,0.7016
200,0.34952
201,-0.022113999999999998
202,-0.37853000000000003
203,-0.70245
204,-0.94942
205,-1.0871
206,-1.0933
207,-0.9592799999999999
208,-0.70567
209,-0.38971
210,-0.053848
211,0.25347
212,0.4843
213,0.63169
214,0.70799
215,0.71806
216,0.68165
217,0.60735
218,0.50217
219,0.37087
220,0.20844000000000001
221,0.048969
222,-0.089219
223,-0.17506
224,-0.19002
225,-0.13795
226,-0.025491
227,0.10325
228,0.21153000000000002
229,0.26634
230,0.25497
231,0.18452000000000002
232,0.075915
233,-0.046361
234,-0.16022999999999998
235,-0.25903000000000004
236,-0.34057
237,-0.41358
238,-0.48627
239,-0.55991
240,-0.64022
241,-0.69382
242,-0.70901
243,-0.66897
244,-0.5797399999999999
245,-0.47073000000000004
246,-0.37142
247,-0.29006
248,-0.23683
249,-0.21234
250,-0.18800999999999998
251,-0.12393
252,0.009148200000000002
253,0.24431
254,0.57717
255,0.97331
256,1.3812
257,1.7245
258,1.9425
259,1.9794
260,1.8265
261,1.4977
262,1.0206
263,0.46436000000000005
264,-0.1013
265,-0.61943
266,-1.0385
267,-1.3263
268,-1.4643
269,-1.4586
270,-1.3442
271,-1.1713
272,-0.9859100000000001
273,-0.82057
274,-0.7207600000000001
275,-0.69082
276,-0.7155600000000001
277,-0.76545
278,-0.79389
279,-0.76627
280,-0.6587
281,-0.46458999999999995
282,-0.19184
283,0.13097999999999999
284,0.49078999999999995
285,0.86367
286,1.2497
287,1.6303
288,1.9732
289,2.2406
290,2.3735
291,2.3216
292,2.0437
293,1.5361
294,0.83237
295,-0.0088935
296,-0.87808
297,-1.6753
298,-2.3039
299,-2.7016
300,-2.8272
301,-2.6744
302,-2.2785
303,-1.6937
304,-0.97436
305,-0.20888
306,0.53142
307,1.1756
308,1.6612
309,1.9504
310,2.0354
311,1.9165
312,1.6265
313,1.2272
314,0.78637
315,0.34407
316,-0.056718
317,-0.39236
318,-0.6700699999999999
319,-0.8987799999999999
320,-1.0705
321,-1.1804
322,-1.2365
323,-1.2266
324,-1.1349
325,-0.9718200000000001
326,-0.76772
327,-0.54383
328,-0.31648000000000004
329,-0.10948
330,0.081238
331,0.27636
332,0.48566000000000004
333,0.71565
334,0.9553
335,1.1803
336,1.344
337,1.4051
338,1.3482
339,1.166
340,0.88721
341,0.54945
342,0.18859
343,-0.15428
344,-0.45801000000000003
345,-0.70786
346,-0.88046
347,-0.9767399999999999
348,-1.0031
349,-0.9625299999999999
350,-0.85264
351,-0.69481
352,-0.5080600000000001
353,-0.32036
354,-0.15491
355,-0.027358999999999998
356,0.054091999999999994
357,0.09616
358,0.12019
359,0.13935
360,0.16442
361,0.19762000000000002
362,0.2217
363,0.24076999999999998
364,0.23526
365,0.19407
366,0.12836
367,0.052322
368,-0.025639999999999996
369,-0.093291
370,-0.14702
371,-0.15623
372,-0.10582000000000001
373,0.0090294
374,0.17272
375,0.35836
376,0.53372
377,0.65551
378,0.69303
379,0.62055
380,0.44438
381,0.18817
382,-0.10109
383,-0.37028
384,-0.55447
385,-0.62273
386,-0.5762
387,-0.43096999999999996
388,-0.21895
389,0.0031135
390,0.18507
391,0.30319
392,0.32831
393,0.24073000000000003
394,0.045894
395,-0.23848000000000003
396,-0.58341
397,-0.93604
398,-1.238
399,-1.4316
400,-1.4506
401,-1.2618
402,-0.85741
403,-0.26439
404,0.46097
405,1.2195
406,1.9197
407,2.4618
408,2.7594
409,2.7696
410,2.4795
411,1.9118
412,1.1238
413,0.21673
414,-0.7194699999999999
415,-1.5909
416,-2.2969
417,-2.7633
418,-2.9589999999999996
419,-2.8775
420,-2.5218
421,-1.9513
422,-1.2306
423,-0.43312
424,0.3635
425,1.0707
426,1.6278
427,1.9987
428,2.1477
429,2.0748
430,1.8088
431,1.4004
432,0.8975799999999999
433,0.37274
434,-0.099387
435,-0.47702
436,-0.72946
437,-0.8421200000000001
438,-0.83101
439,-0.7408399999999999
440,-0.6105
441,-0.49098
442,-0.40209
443,-0.35562
444,-0.3465
445,-0.35531
446,-0.36505
447,-0.36365
448,-0.33166999999999996
449,-0.26216999999999996
450,-0.15716
451,-0.019275999999999998
452,0.13283
453,0.29022
454,0.44373
455,0.57572
456,0.67925
457,0.74931
458,0.7783100000000001
459,0.7701899999999999
460,0.70757
461,0.6049100000000001
462,0.45386000000000004
463,0.27555
464,0.070372
465,-0.14715999999999999
466,-0.35643
467,-0.54842
468,-0.7116899999999999
469,-0.8357899999999999
470,-0.91043
471,-0.9149700000000001
472,-0.85682
473,-0.74103
474,-0.5854199999999999
475,-0.41258999999999996
476,-0.25595999999999997
477,-0.1462
478,-0.092032
479,-0.075424
480,-0.068475
481,-0.031023000000000002
482,0.083179
483,0.28186
484,0.55752
485,0.85874
486,1.1126
487,1.2696
488,1.3101
489,1.2247
490,1.0576
491,0.8633700000000001
492,0.67019
493,0.48496999999999996
494,0.30082
495,0.083351
496,-0.21656
497,-0.60949
498,-1.0792
499,-1.5377
