time,value
0,-0.15042
1,-0.15042
2,-0.15042
3,-0.15042
4,-0.15042
5,-0.15042
6,-0.15042
7,-0.15042
8,-0.15042
9,-0.15042
10,-0.15042
11,-0.15042
12,-0.15042
13,-0.15042
14,-0.15042
15,-0.15042
16,-0.15042
17,-0.15042
18,-0.15042
19,-0.15042
20,-0.15042
21,-0.15042
22,-0.15042
23,-0.15042
24,-0.15042
25,-0.15042
26,-0.15042
27,-0.15042
28,-0.15042
29,-0.15042
30,-0.15042
31,-0.15042
32,-0.15042
33,-0.15042
34,-0.15042
35,-0.15042
36,-0.15042
37,-0.15042
38,-0.15042
39,-0.15042
40,-0.15042
41,-0.15042
42,-0.15042
43,-0.15042
44,-0.15042
45,-0.15042
46,-0.15042
47,-0.15042
48,-0.15042
49,-0.15042
50,-0.15042
51,-0.15042
52,-0.15042
53,-0.15042
54,-0.15042
55,-0.15042
56,-0.15042
57,-0.15042
58,-0.15042
59,-0.15042
60,-0.15042
61,-0.15042
62,-0.15042
63,-0.15042
64,-0.15042
65,-0.15042
66,-0.15042
67,-0.15042
68,-0.15042
69,-0.15042
70,-0.15042
71,-0.15042
72,-0.15042
73,-0.15042
74,-0.15042
75,-0.15042
76,-0.15042
77,-0.15042
78,-0.15042
79,-0.15042
80,-0.15042
81,-0.15042
82,-0.15042
83,-0.15042
84,-0.15042
85,-0.15042
86,-0.15042
87,-0.15042
88,-0.15042
89,-0.15042
90,-0.15042
91,-0.15042
92,-0.15042
93,-0.15042
94,-0.15042
95,-0.15042
96,-0.15042
97,-0.15042
98,-0.15042
99,-0.15042
100,-0.15042
101,-0.15042
102,-0.15042
103,-0.15042
104,-0.15042
105,-0.15042
106,-0.15042
107,-0.15042
108,-0.15042
109,-0.15042
110,-0.15042
111,-0.15042
112,-0.15042
113,-0.15042
114,-0.15042
115,-0.15042
116,-0.15042
117,-0.15042
118,-0.15042
119,-0.15042
120,-0.15042
121,-0.15042
122,-0.15042
123,-0.15042
124,-0.15042
125,-0.15042
126,-0.15042
127,-0.15042
128,-0.15042
129,-0.15042
130,-0.15042
131,-0.15042
132,-0.15042
133,-0.15042
134,-0.15042
135,-0.15042
136,-0.15042
137,-0.15042
138,-0.15042
139,-0.15042
140,-0.15042
141,-0.15042
142,-0.15042
143,-0.15042
144,-0.15042
145,-0.15042
146,-0.15042
147,-0.15042
148,-0.15042
149,-0.15042
150,-0.15042
151,-0.15042
152,-0.15042
153,-0.15042
154,-0.15042
155,-0.15042
156,-0.15042
157,-0.15042
158,-0.15042
159,-0.15042
160,-0.15042
161,-0.15042
162,-0.15042
163,-0.15042
164,-0.15042
165,-0.15042
166,-0.15042
167,-0.15042
168,-0.15042
169,-0.15042
170,-0.15042
171,-0.15042
172,-0.15042
173,-0.15042
174,-0.15042
175,-0.15042
176,-0.15042
177,-0.15042
178,-0.15042
179,-0.15042
180,-0.15042
181,-0.15042
182,-0.15042
183,-0.15042
184,-0.15042
185,8.156
186,4.9613
187,-0.02263
188,-0.15042
189,-0.15042
190,-0.15042
191,-0.15042
192,-0.15042
193,-0.15042
194,-0.15042
195,-0.15042
196,-0.15042
197,-0.15042
198,-0.15042
199,-0.15042
200,-0.15042
201,-0.15042
202,-0.15042
203,-0.15042
204,-0.15042
205,-0.15042
206,-0.15042
207,-0.15042
208,6.7503
209,7.9431
210,-0.02263
211,-0.15042
212,-0.15042
213,-0.15042
214,-0.15042
215,-0.15042
216,-0.15042
217,-0.15042
218,-0.15042
219,-0.15042
220,-0.15042
221,-0.15042
222,-0.15042
223,-0.15042
224,-0.15042
225,-0.15042
226,-0.15042
227,-0.15042
228,-0.15042
229,-0.15042
230,-0.15042
231,-0.15042
232,-0.15042
233,-0.15042
234,-0.15042
235,-0.15042
236,-0.15042
237,-0.15042
238,-0.15042
239,-0.15042
240,-0.15042
241,-0.15042
242,-0.15042
243,-0.15042
244,-0.15042
245,-0.15042
246,-0.15042
247,-0.15042
248,-0.15042
249,-0.15042
250,-0.15042
251,-0.15042
252,-0.15042
253,-0.15042
254,-0.15042
255,-0.15042
256,-0.15042
257,-0.15042
258,-0.15042
259,-0.15042
260,-0.15042
261,-0.15042
262,6.942
263,6.7503
264,0.041266000000000004
265,-0.15042
266,-0.15042
267,-0.15042
268,-0.15042
269,-0.15042
270,-0.15042
271,-0.15042
272,-0.15042
273,-0.15042
274,-0.15042
275,-0.15042
276,-0.15042
277,-0.15042
278,-0.15042
279,-0.15042
280,-0.15042
281,-0.15042
282,-0.15042
283,-0.15042
284,-0.15042
285,-0.15042
286,-0.15042
287,-0.15042
288,-0.15042
289,-0.15042
290,-0.15042
291,-0.15042
292,-0.15042
293,-0.15042
294,-0.15042
295,-0.15042
296,-0.15042
297,-0.15042
298,-0.15042
299,-0.15042
300,-0.15042
301,-0.15042
302,-0.15042
303,-0.15042
304,-0.15042
305,-0.15042
306,-0.15042
307,-0.15042
308,-0.15042
309,-0.15042
310,-0.15042
311,-0.15042
312,-0.15042
313,-0.15042
314,-0.15042
315,-0.15042
316,-0.15042
317,-0.15042
318,-0.15042
319,-0.15042
320,-0.15042
321,-0.15042
322,-0.15042
323,-0.15042
324,-0.15042
325,-0.15042
326,-0.15042
327,-0.15042
328,-0.15042
329,-0.15042
330,-0.15042
331,7.9431
332,0.19036
333,-0.15042
334,-0.15042
335,-0.15042
336,-0.15042
337,-0.15042
338,-0.15042
339,-0.15042
340,-0.15042
341,-0.15042
342,-0.15042
343,-0.15042
344,-0.15042
345,-0.15042
346,-0.15042
347,-0.15042
348,-0.15042
349,-0.15042
350,-0.15042
351,-0.15042
352,-0.15042
353,-0.15042
354,-0.15042
355,-0.15042
356,-0.15042
357,-0.15042
358,-0.15042
359,-0.15042
360,-0.15042
361,-0.15042
362,-0.15042
363,-0.15042
364,-0.15042
365,-0.15042
366,-0.15042
367,-0.15042
368,-0.15042
369,-0.15042
370,-0.15042
371,-0.15042
372,-0.15042
373,-0.15042
374,-0.15042
375,-0.15042
376,-0.15042
377,-0.15042
378,-0.15042
379,-0.15042
380,-0.15042
381,-0.15042
382,4.482
383,7.3361
384,0.14776
385,-0.15042
386,-0.15042
387,-0.15042
388,-0.15042
389,-0.15042
390,-0.15042
391,-0.15042
392,-0.15042
393,-0.15042
394,-0.15042
395,-0.15042
396,-0.15042
397,-0.15042
398,-0.15042
399,-0.15042
400,-0.15042
401,-0.15042
402,-0.15042
403,-0.15042
404,-0.15042
405,-0.15042
406,-0.15042
407,-0.15042
408,-0.15042
409,-0.15042
410,-0.15042
411,-0.15042
412,-0.15042
413,-0.15042
414,-0.15042
415,-0.15042
416,-0.15042
417,-0.15042
418,-0.15042
419,-0.15042
420,-0.15042
421,-0.15042
422,-0.15042
423,-0.15042
424,-0.15042
425,-0.15042
426,-0.15042
427,-0.15042
428,-0.15042
429,-0.15042
430,-0.15042
431,-0.15042
432,-0.15042
433,-0.15042
434,-0.15042
435,-0.15042
436,-0.15042
437,-0.15042
438,-0.15042
439,-0.15042
440,-0.15042
441,-0.15042
442,-0.15042
443,-0.15042
444,-0.15042
445,-0.15042
446,-0.15042
447,-0.15042
448,-0.15042
449,-0.15042
450,-0.15042
451,-0.15042
452,-0.15042
453,-0.15042
454,-0.15042
455,-0.15042
456,-0.15042
457,-0.15042
458,-0.15042
459,-0.15042
460,-0.15042
461,-0.15042
462,-0.15042
463,-0.15042
464,-0.15042
465,-0.15042
466,-0.15042
467,-0.15042
468,-0.15042
469,-0.15042
470,-0.15042
471,-0.15042
472,-0.15042
473,-0.15042
474,-0.15042
475,-0.15042
476,-0.15042
477,-0.15042
478,-0.15042
479,-0.15042
480,-0.15042
481,-0.15042
482,-0.15042
483,-0.15042
484,-0.15042
485,-0.15042
486,-0.15042
487,-0.15042
488,-0.15042
489,-0.15042
490,-0.15042
491,-0.15042
492,-0.15042
493,-0.15042
494,-0.15042
495,-0.15042
496,-0.15042
497,-0.15042
498,-0.15042
499,-0.15042
500,-0.15042
501,-0.15042
502,-0.15042
503,-0.15042
504,-0.15042
505,-0.15042
506,-0.15042
507,-0.15042
508,-0.15042
509,-0.15042
510,-0.15042
511,-0.15042
512,4.482
513,8.582
514,-0.065227
515,-0.15042
516,-0.15042
517,-0.15042
518,-0.15042
519,-0.15042
520,-0.15042
521,-0.15042
522,-0.15042
523,-0.15042
524,-0.15042
525,-0.15042
526,-0.15042
527,-0.15042
528,-0.15042
529,-0.15042
530,-0.15042
531,-0.15042
532,-0.15042
533,-0.15042
534,-0.15042
535,-0.15042
536,-0.15042
537,-0.15042
538,-0.15042
539,-0.15042
540,-0.15042
541,-0.15042
542,-0.15042
543,-0.15042
544,-0.15042
545,-0.15042
546,-0.15042
547,-0.15042
548,-0.15042
549,-0.15042
550,-0.15042
551,-0.15042
552,-0.15042
553,-0.15042
554,-0.15042
555,-0.15042
556,-0.15042
557,-0.15042
558,-0.15042
559,-0.15042
560,-0.15042
561,-0.15042
562,-0.15042
563,-0.15042
564,-0.15042
565,-0.15042
566,-0.15042
567,-0.15042
568,-0.15042
569,-0.15042
570,-0.15042
571,-0.15042
572,-0.15042
573,-0.15042
574,2.7888
575,4.8015
576,-0.10782
577,-0.15042
578,-0.15042
579,-0.15042
580,-0.15042
581,-0.15042
582,-0.15042
583,-0.15042
584,1.8729
585,6.942
586,-0.10782
587,-0.15042
588,-0.15042
589,-0.15042
590,-0.15042
591,-0.15042
592,-0.15042
593,-0.15042
594,-0.15042
595,-0.15042
596,-0.15042
597,-0.15042
598,-0.15042
599,-0.15042
600,-0.15042
601,-0.15042
602,-0.15042
603,-0.15042
604,-0.15042
605,-0.15042
606,-0.15042
607,-0.15042
608,-0.15042
609,-0.15042
610,-0.15042
611,-0.15042
612,-0.15042
613,-0.15042
614,-0.15042
615,-0.15042
616,-0.15042
617,-0.15042
618,-0.15042
619,-0.15042
620,-0.15042
621,-0.15042
622,-0.15042
623,-0.15042
624,-0.15042
625,-0.15042
626,-0.15042
627,-0.15042
628,-0.15042
629,-0.15042
630,-0.15042
631,-0.15042
632,-0.15042
633,-0.15042
634,-0.15042
635,-0.15042
636,-0.15042
637,-0.15042
638,-0.15042
639,-0.15042
640,-0.15042
641,-0.15042
642,-0.15042
643,-0.15042
644,-0.15042
645,-0.15042
646,-0.15042
647,-0.15042
648,-0.15042
649,-0.15042
650,-0.15042
651,-0.15042
652,-0.15042
653,-0.15042
654,-0.15042
655,-0.15042
656,-0.15042
657,-0.15042
658,-0.15042
659,-0.15042
660,-0.15042
661,-0.15042
662,-0.15042
663,-0.15042
664,-0.15042
665,-0.15042
666,-0.15042
667,-0.15042
668,-0.15042
669,-0.15042
670,-0.15042
671,-0.15042
672,-0.15042
673,-0.15042
674,-0.15042
675,-0.15042
676,-0.15042
677,-0.15042
678,-0.15042
679,-0.15042
680,-0.15042
681,-0.15042
682,-0.15042
683,-0.15042
684,-0.15042
685,-0.15042
686,-0.15042
687,-0.15042
688,-0.15042
689,-0.15042
690,-0.15042
691,-0.15042
692,-0.15042
693,-0.15042
694,-0.15042
695,-0.15042
696,-0.15042
697,-0.15042
698,-0.15042
699,8.369
700,5.1316
701,0.10515999999999999
702,-0.15042
703,-0.15042
704,-0.15042
705,-0.15042
706,-0.15042
707,-0.15042
708,-0.15042
709,-0.15042
710,-0.15042
711,-0.15042
712,-0.15042
713,-0.15042
714,-0.15042
715,-0.15042
716,-0.15042
717,-0.15042
718,-0.15042
719,-0.15042
