time,value
0,-0.55367
1,0.15078
2,0.17424
3,0.59718
4,-0.88355
5,-0.092172
6,-0.29335
7,-0.12355999999999999
8,-0.4525
9,-0.032549
10,0.4247
11,-0.28386999999999996
12,-0.050131999999999996
13,-0.11622
14,0.28462
15,-0.22576
16,0.23396
17,-0.1612
18,0.012586
19,0.21474000000000001
20,0.039882
21,0.048053
22,-0.080623
23,0.17665
24,0.31094
25,-0.14307
26,-0.15852
27,-0.18120999999999998
28,0.2581
29,-0.24745999999999999
30,-0.065182
31,0.31559
32,-0.13372
33,-0.098785
34,-0.47607
35,-0.022371000000000002
36,-0.19832
37,-0.13888
38,0.51632
39,0.11619000000000002
40,-0.20704
41,0.55028
42,0.11694
43,0.59249
44,0.16825
45,0.051773
46,0.09157
47,-0.18565
48,-0.26026
49,-1.5342
50,-1.5342
51,-1.5342
52,-1.5342
53,-1.5342
54,-1.5342
55,-1.5342
56,-1.5342
57,-1.5342
58,-1.5342
59,-1.5342
60,-1.5342
61,-1.5342
62,-1.5342
63,1.4917
64,1.4917
65,1.4917
66,1.4917
67,1.4917
68,1.4917
69,1.4917
70,1.4917
71,1.4917
72,1.4917
73,1.4917
74,1.4917
75,1.4917
76,1.4917
77,0.23942
78,0.24191999999999997
79,0.23651
80,-0.023332
81,-0.33239
82,0.0010018
83,0.10111
84,-0.078341
85,-0.21153000000000002
86,0.042575
87,-0.10550999999999999
88,-0.30834
89,-0.008025
90,0.24636
91,-0.049267
92,0.43195
93,-0.5576399999999999
94,0.14272
95,-0.091134
96,-0.35569
97,-0.12487000000000001
98,1.4917
99,1.4917
100,1.4917
101,1.4917
102,1.4917
103,1.4917
104,1.4917
105,1.4917
106,1.4917
107,1.4917
108,1.4917
109,1.4917
110,1.4917
111,-1.5342
112,-1.5342
113,-1.5342
114,-1.5342
115,-1.5342
116,-1.5342
117,-1.5342
118,-1.5342
119,-1.5342
120,-1.5342
121,-1.5342
122,-1.5342
123,0.053438
124,0.40039
125,-0.10192999999999999
126,0.33601
127,-0.091815
