time,value
0,-0.018635
1,-0.41303999999999996
2,0.5733199999999999
3,0.10517
4,-0.11400999999999999
5,0.071031
6,0.17084000000000002
7,0.43573
8,-0.10907
9,-0.024429
10,-0.10985
11,-0.18692
12,-0.21381999999999998
13,0.27183
14,0.33881
15,-0.31827
16,0.21176999999999999
17,-0.24885
18,-0.7448600000000001
19,-0.32027
20,0.15484
21,0.0026646
22,-0.1006
23,0.12643
24,0.44872
25,-0.05619400000000001
26,0.13893
27,-0.20023
28,-0.15702
29,-0.19697
30,-0.12192
31,0.38343
32,0.30271
33,0.18884
34,-0.18325999999999998
35,0.4393
36,0.017784
37,0.53809
38,-0.48676
39,0.069964
40,-1.5017
41,-1.5017
42,-1.5017
43,-1.5017
44,-1.5017
45,-1.5017
46,-1.5017
47,-1.5017
48,-1.5017
49,-1.5017
50,-1.5017
51,-1.5017
52,-1.5017
53,-1.5017
54,-1.5017
55,1.5022
56,1.5022
57,1.5022
58,1.5022
59,1.5022
60,1.5022
61,1.5022
62,1.5022
63,1.5022
64,1.5022
65,1.5022
66,1.5022
67,1.5022
68,1.5022
69,-0.25226
70,-0.11325999999999999
71,0.24523000000000003
72,-0.054635
73,-0.040121
74,0.0024956999999999996
75,-1.5017
76,-1.5017
77,-1.5017
78,-1.5017
79,-1.5017
80,-1.5017
81,-1.5017
82,-1.5017
83,-1.5017
84,-1.5017
85,-1.5017
86,-1.5017
87,-1.5017
88,1.5022
89,1.5022
90,1.5022
91,1.5022
92,1.5022
93,1.5022
94,1.5022
95,1.5022
96,1.5022
97,1.5022
98,1.5022
99,1.5022
100,-0.047461
101,-0.18175999999999998
102,0.3104
103,-0.079579
104,0.041791
105,-0.05268200000000001
106,0.019049
107,-0.1325
108,-0.076422
109,-0.020347999999999998
110,-0.19327
111,0.34345
112,0.5179600000000001
113,0.2013
114,0.10592
115,0.13369
116,0.41453
117,-0.030775999999999998
118,0.32961
119,-0.08656799999999999
120,-0.29932
121,0.4372
122,-0.20384000000000002
123,0.058661000000000005
124,0.3462
125,0.25264000000000003
126,0.49437
127,-0.06536
