time,value
0,-1.165
1,-1.2513
2,-1.1979
3,-1.0417
4,-1.0129
5,-0.77442
6,-0.63875
7,-0.57297
8,-0.45785
9,-0.32628
10,-0.16594
11,-0.059048
12,0.14240999999999998
13,0.22052
14,0.30685999999999997
15,0.47131000000000006
16,0.61932
17,0.8002199999999999
18,0.88245
19,0.9729
20,1.1661
21,1.2072
22,1.2977
23,1.4621
24,1.4991
25,1.5896
26,1.7376
27,1.8815
28,2.0213
29,2.1282
30,2.2022
31,2.2967
32,2.3708
33,2.4324
34,2.4406
35,2.416
36,2.416
37,2.416
38,2.3995
39,2.3954
40,2.3132
41,2.2967
42,2.2967
43,2.2721
44,2.2762
45,2.2063
46,2.1899
47,2.1693
48,2.1158
49,2.1076
50,2.0994
51,2.0377
52,2.0048
53,2.0007
54,1.935
55,1.8651
56,1.9514
57,1.9103
58,1.8034
59,1.7993
60,1.7623
61,1.7417
62,1.6924
63,1.7253
64,1.7335
65,1.7499
66,1.7417
67,1.7129
68,1.6307
69,1.6102
70,1.5238
71,1.5197
72,1.4416
73,1.3224
74,1.2648
75,1.162
76,1.1785
77,1.1538
78,1.162
79,1.0921
80,1.1168
81,1.1867
82,1.1949
83,1.1538
84,1.1538
85,1.1332
86,1.1332
87,1.1332
88,1.0962
89,1.1661
90,1.1661
91,1.1908
92,1.162
93,1.1908
94,1.1785
95,1.1867
96,1.1826
97,1.1826
98,1.1908
99,1.2114
100,1.2196
101,1.2401
102,1.236
103,1.2812
104,1.2648
105,1.2771
106,1.2196
107,1.1497
108,1.1497
109,1.1867
110,1.2442
111,1.2401
112,1.2812
113,1.3511
114,1.3881
115,1.4334
116,1.5238
117,1.569
118,1.5567
119,1.6143
120,1.6348
121,1.5978
122,1.6636
123,1.6472
124,1.6554
125,1.6636
126,1.7294
127,2.0048
128,2.1693
129,2.1734
130,2.1652
131,2.1857
132,2.1857
133,2.1652
134,2.2063
135,2.1857
136,2.1857
137,2.1611
138,2.157
139,2.1487
140,2.1405
141,2.1323
142,2.1241
143,2.12
144,2.1117
145,2.0583
146,2.0336
147,2.0007
148,1.9267
149,1.8609
150,1.7417
151,1.68
152,1.5608
153,1.5732
154,1.4621
155,1.421
156,1.3224
157,1.2401
158,1.2155
159,1.1702
160,1.0716
161,0.9975700000000001
162,0.9276700000000001
163,0.83311
164,0.75089
165,0.72622
166,0.61521
167,0.58643
168,0.54532
169,0.57821
170,0.5741
171,0.56999
172,0.56176
173,0.57821
174,0.49187
175,0.21641
176,0.16296
177,0.051958000000000004
178,0.097183
179,0.02729
180,-0.059048
181,-0.2235
182,-0.2605
183,-0.29751
184,-0.40029000000000003
185,-0.57297
186,-0.7086399999999999
187,-0.77442
188,-0.8402
189,-0.9018700000000001
190,-0.96765
191,-1.0334
192,-1.0992
193,-1.0828
194,-1.0951
195,-1.0417
196,-1.0047
197,-0.97588
198,-0.97177
199,-0.95121
200,-1.0252
201,-0.9142100000000001
202,-0.84431
203,-0.79498
204,-0.7620899999999999
205,-0.73742
206,-0.75798
207,-0.81965
208,-0.78675
209,-0.74153
210,-0.70453
211,-0.63875
212,-0.6675300000000001
213,-0.6469699999999999
214,-0.63875
215,-0.5400699999999999
216,-0.4414
217,-0.37151
218,-0.39618000000000003
219,-0.30573
220,-0.33862
221,-0.35095
222,-0.27695
223,-0.31806
224,-0.24816999999999997
225,-0.28106
226,-0.24816999999999997
227,-0.25228
228,-0.31395
229,-0.35506
230,-0.39618000000000003
231,-0.52363
232,-0.57708
233,-0.6058600000000001
234,-0.67575
235,-0.7086399999999999
236,-0.74975
237,-0.78675
238,-0.86898
239,-0.8854299999999999
240,-0.9059799999999999
241,-0.8854299999999999
242,-0.9142100000000001
243,-0.98821
244,-0.9964299999999999
245,-1.0458
246,-1.0375
247,-1.0951
248,-1.0622
249,-1.0129
250,-1.0458
251,-1.0334
252,-0.9841
253,-0.98821
254,-0.9388700000000001
255,-0.9799899999999999
256,-0.9265399999999999
257,-0.91832
258,-0.9059799999999999
259,-0.89776
260,-0.93065
261,-0.91009
262,-0.9388700000000001
263,-0.9265399999999999
264,-0.95121
265,-0.96354
266,-0.9964299999999999
267,-1.0334
268,-1.0293
269,-1.0499
270,-1.0088
271,-0.96354
272,-0.93476
273,-0.93065
274,-0.94299
275,-0.91832
276,-0.92243
277,-0.9265399999999999
278,-0.9059799999999999
279,-0.91832
280,-0.9142100000000001
281,-0.86487
282,-0.8484200000000001
283,-0.8730899999999999
284,-0.79909
285,-0.81553
286,-0.74975
287,-0.48252
288,-0.36329
289,-0.34273000000000003
290,-0.22760999999999998
291,-0.10427
292,-0.079605
293,-0.0014892000000000002
294,0.014956
295,0.12185
296,0.25753000000000004
297,0.33564
298,0.45487
299,0.45898
300,0.5412100000000001
301,0.54532
302,0.71799
303,0.7138800000000001
304,0.7673300000000001
305,0.792
306,0.7673300000000001
307,0.84545
308,0.82489
309,0.85367
310,0.87834
311,0.78378
312,0.8372200000000001
313,0.81667
314,0.83311
315,0.8125600000000001
316,0.83311
317,0.8084399999999999
318,0.75089
319,0.70977
320,0.63577
321,0.6604399999999999
322,0.63577
323,0.59465
324,0.59465
325,0.63166
326,0.63166
327,0.5741
328,0.52887
329,0.55765
330,0.48365
331,0.55765
332,0.52476
333,0.53298
334,0.58643
335,0.6522100000000001
336,0.72622
337,0.70155
338,0.8002199999999999
339,0.866
340,0.84545
341,0.88656
342,0.9482299999999999
343,1.051
344,1.1702
345,1.3183
346,1.421
347,1.495
348,1.5156
349,1.5362
350,1.5485
351,1.6554
352,1.6965
353,1.8239
354,1.8979
355,1.9103
356,1.9226
357,1.935
358,1.9473
359,1.9637
360,1.9761
361,1.9432
362,1.8733
363,1.9062
364,1.8692
365,1.8651
366,1.8157
367,1.7993
368,1.7541
369,1.7129
370,1.7088
371,1.643
372,1.5855
373,1.5279
374,1.4868
375,1.4251
376,1.3676
377,1.3059
378,1.2607
379,1.2196
380,1.1661
381,1.125
382,1.0428
383,0.97701
384,0.95234
385,0.87423
386,0.9359
387,0.88656
388,0.88656
389,0.87423
390,0.9811200000000001
391,0.9687899999999999
392,1.0017
393,1.0058
394,0.9729
395,0.98934
396,0.91945
397,0.8290000000000001
398,0.71799
399,0.61932
400,0.5412100000000001
401,0.4672
402,0.3562
403,0.33975
404,0.33975
405,0.26164
406,0.31508
407,0.27397
408,0.24108000000000002
409,0.21641
410,0.18763
411,0.072515
412,0.043736000000000004
413,-0.017935
414,-0.23171999999999998
415,-0.30162
416,-0.38795999999999997
417,-0.47429
418,-0.67164
419,-0.6593
420,-0.74153
421,-0.74564
422,-0.74564
423,-0.74975
424,-0.7538600000000001
425,-0.7538600000000001
426,-0.75798
427,-0.7662
428,-0.79498
429,-0.79909
430,-0.8402
431,-0.83609
432,-0.85665
433,-0.8813200000000001
434,-0.8073100000000001
435,-0.8073100000000001
436,-0.75798
437,-0.74564
438,-0.7004199999999999
439,-0.63875
440,-0.5935199999999999
441,-0.54419
442,-0.5113
443,-0.49073999999999995
444,-0.48252
445,-0.42907
446,-0.47018000000000004
447,-0.45374
448,-0.38795999999999997
449,-0.43318
450,-0.4044
451,-0.43318
452,-0.43318
453,-0.42496000000000006
454,-0.45785
455,-0.46196000000000004
456,-0.4784
457,-0.4784
458,-0.5400699999999999
459,-0.54419
460,-0.45374
461,-0.46607
462,-0.42907
463,-0.39207
464,-0.35506
465,-0.34273000000000003
466,-0.31806
467,-0.31395
468,-0.23584000000000002
469,-0.1495
470,-0.13716
471,-0.1125
472,-0.1125
473,-0.09193899999999999
474,-0.050825
475,0.019066999999999997
476,0.006733499999999999
477,-0.017935
478,-0.03438
479,0.010845
480,-0.083716
481,-0.12483
482,-0.25228
483,-0.28517
484,-0.34684
485,-0.3674
486,-0.39207
487,-0.41262
488,-0.38795999999999997
489,-0.39618000000000003
490,-0.37562
491,-0.37973
492,-0.39618000000000003
493,-0.37151
494,-0.33862
495,-0.35918
496,-0.40029000000000003
497,-0.37151
498,-0.37151
499,-0.41673000000000004
500,-0.39207
501,-0.39207
502,-0.38384
503,-0.38795999999999997
504,-0.37151
505,-0.35918
506,-0.33451
507,-0.3304
508,-0.31806
509,-0.33862
510,-0.31806
511,-0.38795999999999997
512,-0.37151
513,-0.40029000000000003
514,-0.41673000000000004
515,-0.45374
516,-0.41673000000000004
517,-0.41262
518,-0.40851
519,-0.41262
520,-0.44551
521,-0.44551
522,-0.4044
523,-0.40029000000000003
524,-0.38384
525,-0.38795999999999997
526,-0.37151
527,-0.39207
528,-0.38384
529,-0.37562
530,-0.39207
531,-0.37973
532,-0.33451
533,-0.35506
534,-0.35918
535,-0.33862
536,-0.33451
537,-0.33451
538,-0.33451
539,-0.35918
540,-0.35506
541,-0.37562
542,-0.4044
543,-0.42085
544,-0.4784
545,-0.44551
546,-0.44963000000000003
547,-0.45374
548,-0.47429
549,-0.46607
550,-0.50718
551,-0.49896
552,-0.49073999999999995
553,-0.49073999999999995
554,-0.51952
555,-0.48663
556,-0.49073999999999995
557,-0.44551
558,-0.42085
559,-0.39618000000000003
560,-0.36329
561,-0.33451
562,-0.28517
563,-0.2605
564,-0.24406
565,-0.28928000000000004
566,-0.27695
567,-0.31395
568,-0.30162
569,-0.27284
570,-0.28928000000000004
571,-0.31395
572,-0.34684
573,-0.34273000000000003
574,-0.37562
575,-0.37973
576,-0.39207
577,-0.42085
578,-0.41262
579,-0.42496000000000006
580,-0.42496000000000006
581,-0.40029000000000003
582,-0.39207
583,-0.43318
584,-0.41262
585,-0.43318
586,-0.4784
587,-0.48252
588,-0.45374
589,-0.46196000000000004
590,-0.45374
591,-0.49896
592,-0.47429
593,-0.47429
594,-0.47018000000000004
595,-0.49896
596,-0.49485
597,-0.48252
598,-0.47018000000000004
599,-0.47429
600,-0.44551
601,-0.43728999999999996
602,-0.43728999999999996
603,-0.41673000000000004
604,-0.37973
605,-0.38795999999999997
606,-0.45785
607,-0.42496000000000006
608,-0.46607
609,-0.48252
610,-0.5113
611,-0.49896
612,-0.5524100000000001
613,-0.52363
614,-0.53185
615,-0.53185
616,-0.51952
617,-0.53185
618,-0.5113
619,-0.52363
620,-0.49073999999999995
621,-0.49485
622,-0.46196000000000004
623,-0.45785
624,-0.45374
625,-0.4414
626,-0.44963000000000003
627,-0.46196000000000004
628,-0.49485
629,-0.49896
630,-0.50307
631,-0.47018000000000004
632,-0.49073999999999995
633,-0.48663
634,-0.44963000000000003
635,-0.46196000000000004
636,-0.46196000000000004
637,-0.41673000000000004
638,-0.41673000000000004
639,-0.38384
640,-0.39618000000000003
641,-0.39618000000000003
642,-0.41262
643,-0.44963000000000003
644,-0.49073999999999995
645,-0.5113
646,-0.5400699999999999
647,-0.58941
648,-0.58119
649,-0.5400699999999999
650,-0.63052
651,-0.64286
652,-0.65108
653,-0.6551899999999999
654,-0.67575
655,-0.70453
656,-0.67986
657,-0.7250800000000001
658,-0.68808
659,-0.67164
660,-0.6593
661,-0.6469699999999999
662,-0.63875
663,-0.5853
664,-0.53596
665,-0.47018000000000004
666,-0.42907
667,-0.34273000000000003
668,-0.3304
669,-0.31395
670,-0.23995
671,-0.20706
672,-0.17005
673,-0.14127
674,-0.12483
675,-0.042602999999999995
676,-0.026157
677,0.006733499999999999
678,0.031401
679,0.02729
680,0.035513
681,0.014956
682,0.0026221
683,-0.059048
684,-0.14127
685,-0.19883
686,-0.28106
687,-0.33451
688,-0.30984
689,-0.31806
690,-0.3304
691,-0.32628
692,-0.3304
693,-0.35918
694,-0.45374
695,-0.4784
696,-0.5400699999999999
697,-0.56885
698,-0.52363
699,-0.51541
700,-0.51541
701,-0.44963000000000003
702,-0.44551
703,-0.42085
704,-0.3674
705,-0.39207
706,-0.3304
707,-0.26873
708,-0.28928000000000004
709,-0.20706
710,-0.21939
711,-0.21116999999999997
712,-0.10427
713,-0.12483
714,-0.042602999999999995
715,-0.042602999999999995
716,0.0026221
717,0.023178999999999998
718,0.16296
719,0.18763
720,0.2863
721,0.26575
722,0.2863
723,0.2493
724,0.23697
725,0.19585999999999998
726,0.097183
727,0.12596
728,0.11363
729,0.13418
730,0.0026221
731,0.031401
732,0.019066999999999997
733,-0.059048
734,-0.083716
735,-0.16594
736,-0.15361
737,-0.22760999999999998
738,-0.27695
739,-0.28517
740,-0.38795999999999997
741,-0.33451
742,-0.37973
743,-0.45374
744,-0.4784
745,-0.54419
746,-0.5524100000000001
747,-0.5400699999999999
748,-0.52363
749,-0.49896
750,-0.53596
751,-0.5113
752,-0.48252
753,-0.46607
754,-0.45374
755,-0.46196000000000004
756,-0.39618000000000003
757,-0.44551
758,-0.39618000000000003
759,-0.40851
760,-0.33862
761,-0.41673000000000004
762,-0.35506
763,-0.36329
764,-0.41262
765,-0.37973
766,-0.35506
767,-0.44551
768,-0.36329
769,-0.41262
770,-0.43728999999999996
771,-0.41673000000000004
772,-0.3674
773,-0.38795999999999997
774,-0.4044
775,-0.43318
776,-0.40851
777,-0.37562
778,-0.37151
779,-0.30573
780,-0.32216999999999996
781,-0.29751
782,-0.28106
783,-0.23584000000000002
784,-0.2605
785,-0.24816999999999997
786,-0.18239
787,-0.16183
788,-0.16594
789,-0.16594
790,-0.24816999999999997
791,-0.30573
792,-0.36329
793,-0.37562
794,-0.46607
795,-0.49073999999999995
796,-0.5400699999999999
797,-0.60997
798,-0.62641
799,-0.67986
800,-0.73331
801,-0.74975
802,-0.77853
803,-0.83609
804,-0.8278700000000001
805,-0.8854299999999999
806,-0.91832
807,-0.9799899999999999
808,-1.0334
809,-1.0499
810,-1.0005
811,-1.0170000000000001
812,-1.1198
813,-1.1732
814,-1.1444
815,-1.1321
816,-1.0869
817,-1.128
818,-1.1321
819,-1.0869
820,-1.0951
821,-1.128
822,-1.1527
823,-1.202
824,-1.2184
825,-1.1938
826,-1.2349
827,-1.2472
828,-1.2678
829,-1.2431
830,-1.5268
831,-1.5802
832,-1.7118
833,-1.6214
834,-1.646
835,-1.6542
836,-1.6296
837,-1.6542
838,-1.6296
839,-1.5926
840,-1.6008
841,-1.5679
842,-1.5638
843,-1.5802
844,-1.5391
845,-1.5227
846,-1.5515
847,-1.5597
848,-1.5926
849,-1.5802
850,-1.5926
851,-1.609
852,-1.5967
853,-1.6214
854,-1.6255
855,-1.5967
856,-1.5597
857,-1.5432
858,-1.5638
859,-1.4939
860,-1.5104
861,-1.4487
862,-1.4158
863,-1.3788
864,-1.3869999999999998
865,-1.276
866,-1.2349
867,-1.2143
868,-1.2349
869,-1.2102
870,-1.2637
871,-1.239
872,-1.3377
873,-1.3253
874,-1.3418
875,-1.3623
876,-1.35
877,-1.4035
878,-1.4692
879,-1.4980000000000002
880,-1.5309
881,-1.4733
882,-1.4609999999999999
883,-1.4240000000000002
884,-1.3829
885,-1.3459
886,-1.3089
887,-1.2678
888,-1.2308
889,-1.1609
890,-1.0869
891,-0.8813200000000001
892,-0.73331
893,-0.62641
894,-0.5113
895,-0.40029000000000003
896,-0.34273000000000003
897,-0.28106
898,-0.17005
899,-0.059048
