time,value
0,-0.92894
1,-0.92115
2,-0.9099200000000001
3,-0.90866
4,-0.9082100000000001
5,-0.9003200000000001
6,-0.8911
7,-0.8796200000000001
8,-0.8632799999999999
9,-0.8489399999999999
10,-0.83765
11,-0.82335
12,-0.8092199999999999
13,-0.7982
14,-0.7818
15,-0.7596
16,-0.73833
17,-0.71277
18,-0.68002
19,-0.64291
20,-0.5966199999999999
21,-0.53893
22,-0.47497
23,-0.40069
24,-0.29578000000000004
25,-0.13592
26,0.088094
27,0.36763
28,0.69298
29,1.0656
30,1.4975
31,1.9609
32,2.3711
33,2.6844
34,2.9333
35,3.1316
36,3.2353
37,3.2165
38,3.1001
39,2.9112
40,2.6210000000000004
41,2.1524
42,1.4735
43,0.7149399999999999
44,0.097331
45,-0.2808
46,-0.47288
47,-0.56008
48,-0.59738
49,-0.6164
50,-0.62649
51,-0.6287699999999999
52,-0.6249100000000001
53,-0.61602
54,-0.60415
55,-0.59309
56,-0.5816399999999999
57,-0.56635
58,-0.55294
59,-0.54318
60,-0.53328
61,-0.52786
62,-0.52676
63,-0.52167
64,-0.50857
65,-0.48695
66,-0.45068
67,-0.38914
68,-0.29952
69,-0.19409
70,-0.089669
71,0.0086673
72,0.10445
73,0.19102
74,0.25368
75,0.28761
76,0.29585
77,0.2732
78,0.20967
79,0.11310999999999999
80,0.019142
81,-0.033496
82,-0.035374
83,-0.011040000000000001
84,0.00054291
85,-0.023763999999999997
86,-0.07216
87,-0.11503
88,-0.1383
89,-0.15117
90,-0.16132
91,-0.16496
92,-0.16477999999999998
93,-0.15717
94,-0.12832000000000002
95,-0.08425099999999999
96,-0.036536
97,0.021841
98,0.093637
99,0.16844
100,0.23671
101,0.2891
102,0.32149
103,0.34101
104,0.34613
105,0.3218
106,0.25421
107,0.13793
108,-0.019325
109,-0.20581
110,-0.415
111,-0.622
112,-0.77935
113,-0.8610700000000001
114,-0.8840399999999999
115,-0.88123
116,-0.8709
117,-0.8529700000000001
118,-0.8238200000000001
119,-0.78352
120,-0.7358
121,-0.68765
122,-0.64672
123,-0.62247
124,-0.62378
125,-0.65115
126,-0.69312
127,-0.73105
128,-0.75229
129,-0.75745
130,-0.7513
131,-0.73674
132,-0.7170000000000001
133,-0.69589
134,-0.67716
135,-0.66384
136,-0.65213
137,-0.63221
138,-0.60228
139,-0.5703
140,-0.54171
141,-0.51598
142,-0.49454
143,-0.48275
144,-0.48003
145,-0.47758999999999996
146,-0.47323999999999994
147,-0.47211000000000003
148,-0.46723000000000003
149,-0.4472
150,-0.42571000000000003
151,-0.42378000000000005
152,-0.42446000000000006
153,-0.39644
154,-0.34189
155,-0.26938
156,-0.1642
157,-0.034874
158,0.07104500000000001
159,0.13267
160,0.17240999999999998
161,0.19854000000000002
162,0.19083
163,0.14182
164,0.068848
165,-0.007486399999999999
166,-0.07289
167,-0.11215
168,-0.10599000000000001
169,-0.049264999999999996
170,0.042869
171,0.15508
172,0.27633
173,0.39624000000000004
174,0.5242399999999999
175,0.68909
176,0.9093200000000001
177,1.195
178,1.5505
179,1.9468
180,2.3226
181,2.6254
182,2.8346
183,2.9578
184,3.0038
185,2.9553
186,2.7955
187,2.5476
188,2.2671
189,1.9942
190,1.6825
191,1.2335
192,0.68482
193,0.21661999999999998
194,-0.086016
195,-0.28407
196,-0.42928
197,-0.52415
198,-0.5755899999999999
199,-0.59901
200,-0.6059899999999999
201,-0.60493
202,-0.59892
203,-0.5895600000000001
204,-0.58211
205,-0.57757
206,-0.57417
207,-0.5773199999999999
208,-0.5879
209,-0.59495
210,-0.59326
211,-0.58639
212,-0.5755899999999999
213,-0.55761
214,-0.53688
215,-0.52405
216,-0.51773
217,-0.50737
218,-0.49146000000000006
219,-0.47802
220,-0.4699
221,-0.46008000000000004
222,-0.44651
223,-0.43076000000000003
224,-0.40789000000000003
225,-0.3763
226,-0.33257
227,-0.26336
228,-0.16228
229,-0.030455
230,0.13427999999999998
231,0.33659
232,0.58604
233,0.87702
234,1.1649
235,1.409
236,1.609
237,1.7653
238,1.8442
239,1.8137
240,1.6914
241,1.5264
242,1.3347
243,1.1004
244,0.82255
245,0.49953000000000003
246,0.1272
247,-0.2371
248,-0.50138
249,-0.6392899999999999
250,-0.6934100000000001
251,-0.71586
252,-0.73574
253,-0.75671
254,-0.77656
255,-0.79274
256,-0.80128
257,-0.81226
258,-0.83425
259,-0.85519
260,-0.86854
261,-0.88225
262,-0.8952700000000001
263,-0.90009
264,-0.9007799999999999
265,-0.9053100000000001
266,-0.9064700000000001
267,-0.9034700000000001
268,-0.91164
269,-0.92605
