time,value
0,-0.070785
1,-0.070785
2,-0.070785
3,-0.070785
4,-0.070785
5,-0.070785
6,-0.070785
7,-0.070785
8,-0.070785
9,-0.070785
10,-0.070785
11,-0.070785
12,-0.070785
13,-0.070785
14,-0.070785
15,-0.070785
16,-0.070785
17,-0.070785
18,-0.070785
19,-0.070785
20,-0.070785
21,-0.070785
22,-0.070785
23,-0.070785
24,-0.070785
25,-0.070785
26,-0.070785
27,-0.070785
28,-0.070785
29,-0.070785
30,-0.070785
31,-0.070785
32,-0.070785
33,-0.070785
34,-0.070785
35,-0.070785
36,-0.070785
37,-0.070785
38,-0.070785
39,-0.070785
40,-0.070785
41,-0.070785
42,-0.070785
43,-0.070785
44,-0.070785
45,-0.070785
46,-0.070785
47,-0.070785
48,-0.070785
49,-0.070785
50,-0.070785
51,-0.070785
52,-0.070785
53,-0.070785
54,-0.070785
55,-0.070785
56,-0.070785
57,-0.070785
58,-0.070785
59,-0.070785
60,-0.070785
61,-0.070785
62,-0.070785
63,-0.070785
64,-0.070785
65,-0.070785
66,-0.070785
67,-0.070785
68,-0.070785
69,-0.070785
70,-0.070785
71,-0.070785
72,-0.070785
73,-0.070785
74,-0.070785
75,-0.070785
76,-0.070785
77,-0.070785
78,-0.070785
79,-0.070785
80,-0.070785
81,-0.070785
82,-0.070785
83,-0.070785
84,-0.070785
85,-0.070785
86,-0.070785
87,-0.070785
88,-0.070785
89,-0.070785
90,-0.070785
91,-0.070785
92,-0.070785
93,-0.070785
94,-0.070785
95,-0.070785
96,-0.070785
97,-0.070785
98,-0.070785
99,-0.070785
100,-0.070785
101,-0.070785
102,-0.070785
103,-0.070785
104,-0.070785
105,-0.070785
106,-0.070785
107,-0.070785
108,-0.070785
109,-0.070785
110,-0.070785
111,-0.070785
112,-0.070785
113,-0.070785
114,-0.070785
115,-0.070785
116,-0.070785
117,-0.070785
118,-0.070785
119,-0.070785
120,-0.070785
121,-0.070785
122,-0.070785
123,-0.070785
124,-0.070785
125,-0.070785
126,-0.070785
127,-0.070785
128,-0.070785
129,-0.070785
130,-0.070785
131,-0.070785
132,-0.070785
133,-0.070785
134,-0.070785
135,-0.070785
136,-0.070785
137,-0.070785
138,-0.070785
139,-0.070785
140,-0.070785
141,-0.070785
142,-0.070785
143,-0.070785
144,-0.070785
145,-0.070785
146,-0.070785
147,-0.070785
148,-0.070785
149,-0.070785
150,-0.070785
151,-0.070785
152,-0.070785
153,-0.070785
154,-0.070785
155,-0.070785
156,-0.070785
157,-0.070785
158,-0.070785
159,-0.070785
160,-0.070785
161,-0.070785
162,-0.070785
163,-0.070785
164,-0.070785
165,-0.070785
166,-0.070785
167,-0.070785
168,-0.070785
169,-0.070785
170,-0.070785
171,-0.070785
172,-0.070785
173,-0.070785
174,-0.070785
175,-0.070785
176,-0.070785
177,-0.070785
178,-0.070785
179,-0.070785
180,-0.070785
181,-0.070785
182,-0.070785
183,-0.070785
184,-0.070785
185,-0.070785
186,-0.070785
187,-0.070785
188,-0.070785
189,-0.070785
190,-0.070785
191,-0.070785
192,-0.070785
193,-0.070785
194,-0.070785
195,-0.070785
196,-0.070785
197,-0.070785
198,-0.070785
199,-0.070785
200,-0.070785
201,-0.070785
202,-0.070785
203,-0.070785
204,-0.070785
205,-0.070785
206,-0.070785
207,-0.070785
208,-0.070785
209,-0.070785
210,-0.070785
211,-0.070785
212,-0.070785
213,-0.070785
214,-0.070785
215,-0.070785
216,-0.070785
217,-0.070785
218,-0.070785
219,-0.070785
220,-0.070785
221,-0.070785
222,-0.070785
223,-0.070785
224,-0.070785
225,-0.070785
226,-0.070785
227,19.233
228,8.7037
229,0.2217
230,-0.070785
231,-0.070785
232,-0.070785
233,-0.070785
234,-0.070785
235,-0.070785
236,-0.070785
237,-0.070785
238,-0.070785
239,7.6069
240,14.552999999999999
241,0.2217
242,-0.070785
243,-0.070785
244,-0.070785
245,-0.070785
246,-0.070785
247,-0.070785
248,-0.070785
249,-0.070785
250,-0.070785
251,-0.070785
252,-0.070785
253,-0.070785
254,-0.070785
255,-0.070785
256,-0.070785
257,-0.070785
258,-0.070785
259,-0.070785
260,-0.070785
261,-0.070785
262,-0.070785
263,-0.070785
264,-0.070785
265,-0.070785
266,-0.070785
267,-0.070785
268,-0.070785
269,-0.070785
270,-0.070785
271,-0.070785
272,-0.070785
273,-0.070785
274,-0.070785
275,-0.070785
276,-0.070785
277,-0.070785
278,-0.070785
279,-0.070785
280,-0.070785
281,-0.070785
282,-0.070785
283,-0.070785
284,-0.070785
285,-0.070785
286,-0.070785
287,-0.070785
288,-0.070785
289,-0.070785
290,-0.070785
291,-0.070785
292,-0.070785
293,-0.070785
294,-0.070785
295,-0.070785
296,-0.070785
297,-0.070785
298,-0.070785
299,-0.070785
300,-0.070785
301,-0.070785
302,-0.070785
303,-0.070785
304,-0.070785
305,-0.070785
306,-0.070785
307,-0.070785
308,-0.070785
309,-0.070785
310,-0.070785
311,-0.070785
312,-0.070785
313,-0.070785
314,-0.070785
315,-0.070785
316,-0.070785
317,-0.070785
318,-0.070785
319,-0.070785
320,-0.070785
321,-0.070785
322,-0.070785
323,-0.070785
324,-0.070785
325,-0.070785
326,-0.070785
327,-0.070785
328,-0.070785
329,-0.070785
330,-0.070785
331,-0.070785
332,-0.070785
333,-0.070785
334,-0.070785
335,-0.070785
336,-0.070785
337,-0.070785
338,-0.070785
339,-0.070785
340,-0.070785
341,-0.070785
342,-0.070785
343,-0.070785
344,-0.070785
345,-0.070785
346,-0.070785
347,-0.070785
348,-0.070785
349,-0.070785
350,-0.070785
351,-0.070785
352,-0.070785
353,-0.070785
354,-0.070785
355,-0.070785
356,-0.070785
357,-0.070785
358,-0.070785
359,-0.070785
360,-0.070785
361,-0.070785
362,-0.070785
363,-0.070785
364,-0.070785
365,-0.070785
366,-0.070785
367,-0.070785
368,-0.070785
369,-0.070785
370,-0.070785
371,-0.070785
372,-0.070785
373,-0.070785
374,-0.070785
375,-0.070785
376,-0.070785
377,-0.070785
378,-0.070785
379,-0.070785
380,-0.070785
381,-0.070785
382,-0.070785
383,-0.070785
384,-0.070785
385,-0.070785
386,-0.070785
387,-0.070785
388,-0.070785
389,-0.070785
390,-0.070785
391,-0.070785
392,-0.070785
393,-0.070785
394,-0.070785
395,-0.070785
396,-0.070785
397,-0.070785
398,-0.070785
399,-0.070785
400,-0.070785
401,-0.070785
402,-0.070785
403,-0.070785
404,-0.070785
405,-0.070785
406,-0.070785
407,-0.070785
408,-0.070785
409,-0.070785
410,-0.070785
411,-0.070785
412,-0.070785
413,-0.070785
414,-0.070785
415,-0.070785
416,-0.070785
417,-0.070785
418,-0.070785
419,-0.070785
420,-0.070785
421,-0.070785
422,-0.070785
423,-0.070785
424,-0.070785
425,-0.070785
426,-0.070785
427,-0.070785
428,-0.070785
429,-0.070785
430,-0.070785
431,-0.070785
432,-0.070785
433,-0.070785
434,-0.070785
435,-0.070785
436,-0.070785
437,-0.070785
438,-0.070785
439,-0.070785
440,-0.070785
441,-0.070785
442,-0.070785
443,-0.070785
444,-0.070785
445,-0.070785
446,-0.070785
447,-0.070785
448,-0.070785
449,-0.070785
450,-0.070785
451,-0.070785
452,-0.070785
453,-0.070785
454,-0.070785
455,-0.070785
456,-0.070785
457,-0.070785
458,-0.070785
459,-0.070785
460,-0.070785
461,-0.070785
462,-0.070785
463,-0.070785
464,-0.070785
465,-0.070785
466,-0.070785
467,-0.070785
468,-0.070785
469,-0.070785
470,-0.070785
471,-0.070785
472,-0.070785
473,-0.070785
474,-0.070785
475,-0.070785
476,-0.070785
477,-0.070785
478,-0.070785
479,-0.070785
480,-0.070785
481,-0.070785
482,-0.070785
483,-0.070785
484,-0.070785
485,-0.070785
486,-0.070785
487,-0.070785
488,-0.070785
489,-0.070785
490,-0.070785
491,-0.070785
492,-0.070785
493,-0.070785
494,-0.070785
495,-0.070785
496,-0.070785
497,-0.070785
498,-0.070785
499,-0.070785
500,-0.070785
501,-0.070785
502,-0.070785
503,-0.070785
504,-0.070785
505,-0.070785
506,-0.070785
507,-0.070785
508,-0.070785
509,-0.070785
510,-0.070785
511,-0.070785
512,-0.070785
513,-0.070785
514,-0.070785
515,-0.070785
516,-0.070785
517,-0.070785
518,-0.070785
519,-0.070785
520,-0.070785
521,-0.070785
522,-0.070785
523,-0.070785
524,-0.070785
525,-0.070785
526,-0.070785
527,-0.070785
528,-0.070785
529,-0.070785
530,-0.070785
531,-0.070785
532,-0.070785
533,-0.070785
534,-0.070785
535,-0.070785
536,-0.070785
537,-0.070785
538,-0.070785
539,-0.070785
540,-0.070785
541,-0.070785
542,-0.070785
543,-0.070785
544,-0.070785
545,-0.070785
546,-0.070785
547,-0.070785
548,-0.070785
549,-0.070785
550,-0.070785
551,-0.070785
552,-0.070785
553,-0.070785
554,-0.070785
555,-0.070785
556,-0.070785
557,-0.070785
558,-0.070785
559,-0.070785
560,-0.070785
561,-0.070785
562,-0.070785
563,-0.070785
564,-0.070785
565,-0.070785
566,-0.070785
567,-0.070785
568,-0.070785
569,-0.070785
570,-0.070785
571,-0.070785
572,-0.070785
573,-0.070785
574,-0.070785
575,-0.070785
576,-0.070785
577,-0.070785
578,-0.070785
579,-0.070785
580,-0.070785
581,-0.070785
582,-0.070785
583,-0.070785
584,-0.070785
585,-0.070785
586,-0.070785
587,-0.070785
588,-0.070785
589,-0.070785
590,-0.070785
591,-0.070785
592,-0.070785
593,-0.070785
594,-0.070785
595,-0.070785
596,-0.070785
597,-0.070785
598,-0.070785
599,-0.070785
600,-0.070785
601,-0.070785
602,-0.070785
603,-0.070785
604,-0.070785
605,-0.070785
606,-0.070785
607,-0.070785
608,-0.070785
609,-0.070785
610,-0.070785
611,-0.070785
612,-0.070785
613,-0.070785
614,-0.070785
615,-0.070785
616,-0.070785
617,-0.070785
618,-0.070785
619,-0.070785
620,-0.070785
621,-0.070785
622,-0.070785
623,-0.070785
624,-0.070785
625,-0.070785
626,-0.070785
627,-0.070785
628,-0.070785
629,-0.070785
630,-0.070785
631,-0.070785
632,-0.070785
633,-0.070785
634,-0.070785
635,-0.070785
636,-0.070785
637,-0.070785
638,-0.070785
639,-0.070785
640,-0.070785
641,-0.070785
642,-0.070785
643,-0.070785
644,-0.070785
645,-0.070785
646,-0.070785
647,-0.070785
648,-0.070785
649,-0.070785
650,-0.070785
651,-0.070785
652,-0.070785
653,-0.070785
654,-0.070785
655,-0.070785
656,-0.070785
657,-0.070785
658,-0.070785
659,-0.070785
660,-0.070785
661,-0.070785
662,-0.070785
663,-0.070785
664,-0.070785
665,-0.070785
666,-0.070785
667,-0.070785
668,-0.070785
669,-0.070785
670,-0.070785
671,-0.070785
672,-0.070785
673,-0.070785
674,-0.070785
675,-0.070785
676,-0.070785
677,-0.070785
678,-0.070785
679,-0.070785
680,-0.070785
681,-0.070785
682,-0.070785
683,-0.070785
684,-0.070785
685,-0.070785
686,-0.070785
687,-0.070785
688,-0.070785
689,-0.070785
690,-0.070785
691,-0.070785
692,-0.070785
693,-0.070785
694,-0.070785
695,-0.070785
696,-0.070785
697,-0.070785
698,-0.070785
699,-0.070785
700,-0.070785
701,-0.070785
702,-0.070785
703,-0.070785
704,-0.070785
705,-0.070785
706,-0.070785
707,-0.070785
708,-0.070785
709,-0.070785
710,-0.070785
711,-0.070785
712,-0.070785
713,-0.070785
714,-0.070785
715,-0.070785
716,-0.070785
717,-0.070785
718,-0.070785
719,-0.070785
