time,value
0,-1.1278
1,-1.1332
2,-1.1364
3,-1.1352
4,-1.1275
5,-1.1138
6,-1.0941
7,-1.0674
8,-1.0343
9,-0.99536
10,-0.9519200000000001
11,-0.90665
12,-0.8584200000000001
13,-0.80678
14,-0.7510399999999999
15,-0.69066
16,-0.62716
17,-0.56035
18,-0.49036
19,-0.41781999999999997
20,-0.34347
21,-0.26861999999999997
22,-0.19446
23,-0.1203
24,-0.045618
25,0.030367
26,0.10834
27,0.18753
28,0.26866
29,0.35147
30,0.43533
31,0.5193399999999999
32,0.60195
33,0.68212
34,0.75951
35,0.83391
36,0.90535
37,0.9738600000000001
38,1.0390000000000001
39,1.1015
40,1.1615
41,1.2191
42,1.2744
43,1.3267
44,1.3762
45,1.423
46,1.4675
47,1.5098
48,1.5502
49,1.5889
50,1.6265
51,1.6634
52,1.6999
53,1.736
54,1.7714
55,1.8056
56,1.8378
57,1.8666
58,1.8903
59,1.9066
60,1.9133
61,1.9081
62,1.8889
63,1.8543
64,1.8032
65,1.7353
66,1.6515
67,1.5535
68,1.4436
69,1.3248
70,1.2001
71,1.0731
72,0.94714
73,0.8249299999999999
74,0.7086
75,0.59941
76,0.49833999999999995
77,0.40615
78,0.32265
79,0.24733000000000002
80,0.17953
81,0.11790999999999999
82,0.063086
83,0.0145
84,-0.028470999999999996
85,-0.066473
86,-0.1008
87,-0.13144
88,-0.15865
89,-0.18352000000000002
90,-0.20720999999999998
91,-0.2311
92,-0.25647
93,-0.28246
94,-0.30967
95,-0.3386
96,-0.36955
97,-0.40365
98,-0.43904
99,-0.47517
100,-0.51199
101,-0.54951
102,-0.58827
103,-0.62758
104,-0.66565
105,-0.70217
106,-0.73695
107,-0.7697
108,-0.8015800000000001
109,-0.82952
110,-0.8533700000000001
111,-0.8733799999999999
112,-0.89005
113,-0.90505
114,-0.91765
115,-0.9274700000000001
116,-0.9354
117,-0.94235
118,-0.94942
119,-0.95755
120,-0.9646100000000001
121,-0.97067
122,-0.9758600000000001
123,-0.98031
124,-0.98529
125,-0.9890700000000001
126,-0.9913200000000001
127,-0.99241
128,-0.99285
129,-0.9936
130,-0.9948100000000001
131,-0.9955700000000001
132,-0.996
133,-0.9962
134,-0.9962200000000001
135,-0.99703
136,-0.99716
137,-0.99656
138,-0.99535
139,-0.99371
140,-0.9924299999999999
141,-0.99129
142,-0.9899399999999999
143,-0.98855
144,-0.9873
145,-0.98655
146,-0.98687
147,-0.98736
148,-0.9879100000000001
149,-0.9884
150,-0.98866
151,-0.98924
152,-0.9892200000000001
153,-0.98808
154,-0.98564
155,-0.9818399999999999
156,-0.9772
157,-0.97221
158,-0.96652
159,-0.9603700000000001
160,-0.95401
161,-0.94768
162,-0.9427
163,-0.93805
164,-0.9333899999999999
165,-0.9282799999999999
166,-0.9223100000000001
167,-0.9161299999999999
168,-0.90964
169,-0.9021100000000001
170,-0.89331
171,-0.8832200000000001
172,-0.87235
173,-0.86245
174,-0.85256
175,-0.8425799999999999
176,-0.8322799999999999
177,-0.82152
178,-0.812
179,-0.80301
180,-0.79382
181,-0.784
182,-0.7732899999999999
183,-0.76264
184,-0.75332
185,-0.7442
186,-0.7349600000000001
187,-0.72523
188,-0.7146899999999999
189,-0.70568
190,-0.6962
191,-0.68557
192,-0.67315
193,-0.65856
194,-0.6432
195,-0.62759
196,-0.61116
197,-0.59399
198,-0.57616
199,-0.55818
200,-0.5417
201,-0.5252399999999999
202,-0.5080600000000001
203,-0.48926000000000003
204,-0.46797
205,-0.44481000000000004
206,-0.41872
207,-0.38876
208,-0.35431999999999997
209,-0.31487
210,-0.27031
211,-0.22066
212,-0.1651
213,-0.10324000000000001
214,-0.034786000000000004
215,0.04038
216,0.12180999999999999
217,0.20920999999999998
218,0.30165
219,0.39779000000000003
220,0.49601000000000006
221,0.5944699999999999
222,0.69148
223,0.7855300000000001
224,0.87536
225,0.96015
226,1.0395
227,1.1137
228,1.1833
229,1.2491
230,1.3119999999999998
231,1.3725
232,1.431
233,1.4876
234,1.5418
235,1.5927
236,1.6389
237,1.6788
238,1.7109999999999999
239,1.7343
240,1.7479
241,1.7513
242,1.7447
243,1.7286
244,1.7047
245,1.6742
246,1.6388
247,1.5995
248,1.557
249,1.5117
250,1.4634
251,1.4109
252,1.3525
253,1.2862
254,1.2096
255,1.1209
256,1.0184
257,0.9008799999999999
258,0.7678
259,0.61949
260,0.45808999999999994
261,0.28646
262,0.10834
263,-0.071724
264,-0.24884
265,-0.41765
266,-0.5728300000000001
267,-0.71038
268,-0.8275100000000001
269,-0.9228700000000001
