time,value
0,0.19730999999999999
1,0.19411
2,0.19739
3,0.22958
4,0.28972
5,0.36206
6,0.42428999999999994
7,0.4267
8,0.34855
9,0.19230999999999998
10,-0.015625999999999998
11,-0.24479
12,-0.43431000000000003
13,-0.53499
14,-0.53782
15,-0.46438999999999997
16,-0.35868
17,-0.26592
18,-0.2472
19,-0.31683
20,-0.43157
21,-0.52013
22,-0.52161
23,-0.39024000000000003
24,-0.1118
25,0.26768000000000003
26,0.64946
27,0.94255
28,1.0705
29,1.0138
30,0.80662
31,0.53387
32,0.27614
33,0.10955999999999999
34,0.040425
35,0.034029000000000004
36,0.016374
37,-0.088447
38,-0.32333
39,-0.66851
40,-1.0369
41,-1.3198
42,-1.4179
43,-1.2724
44,-0.90902
45,-0.39397
46,0.15137
47,0.59663
48,0.87369
49,0.93765
50,0.83706
51,0.6531600000000001
52,0.48857
53,0.38127
54,0.35486
55,0.38231
56,0.40738
57,0.38614
58,0.27726999999999996
59,0.085406
60,-0.15656
61,-0.40649
62,-0.59916
63,-0.70739
64,-0.72556
65,-0.67798
66,-0.58775
67,-0.48798
68,-0.39686
69,-0.29422
70,-0.16894
71,-0.015013999999999998
72,0.16382
73,0.35031999999999996
74,0.5090100000000001
75,0.6037
76,0.61555
77,0.5258
78,0.35104
79,0.12353
80,-0.11655
81,-0.31128
82,-0.42289
83,-0.44101999999999997
84,-0.35326
85,-0.18303
86,0.019262
87,0.20337
88,0.35078000000000004
89,0.42008999999999996
90,0.39393
91,0.29033000000000003
92,0.1272
93,-0.072146
94,-0.25815
95,-0.40164
96,-0.4795
97,-0.48946999999999996
98,-0.43495
99,-0.33803
100,-0.22304000000000002
101,-0.098014
102,0.028931000000000002
103,0.15381
104,0.26269000000000003
105,0.37048000000000003
106,0.4714
107,0.5521199999999999
108,0.6039
109,0.61485
110,0.55033
111,0.39049
112,0.15075999999999998
113,-0.1631
114,-0.52212
115,-0.8744
116,-1.1802
117,-1.4108
118,-1.5435
119,-1.5506
120,-1.4282
121,-1.1741
122,-0.80038
123,-0.33025
124,0.20076
125,0.7630399999999999
126,1.3168
127,1.8189
128,2.2093
129,2.4448
130,2.4779
131,2.2909
132,1.879
133,1.2869
134,0.5707899999999999
135,-0.18532
136,-0.9182899999999999
137,-1.5509
138,-2.031
139,-2.3393
140,-2.4775
141,-2.4532
142,-2.2649
143,-1.9408
144,-1.4883
145,-0.93173
146,-0.3217
147,0.27987
148,0.81671
149,1.2387
150,1.5115
151,1.6266
152,1.6144
153,1.4980000000000002
154,1.3323
155,1.1494
156,0.9555899999999999
157,0.73234
158,0.46223000000000003
159,0.13551
160,-0.23765
161,-0.6231399999999999
162,-0.9501799999999999
163,-1.1653
164,-1.2352
165,-1.1587
166,-0.96525
167,-0.7103
168,-0.43992
169,-0.18287
170,0.034193
171,0.21422
172,0.37219
173,0.5350600000000001
174,0.7018399999999999
175,0.8579100000000001
176,0.94742
177,0.94434
178,0.82732
179,0.59434
180,0.28167
181,-0.061664
182,-0.38044
183,-0.64453
184,-0.82265
185,-0.91881
186,-0.9562
187,-0.95349
188,-0.89917
189,-0.7963
190,-0.65081
191,-0.43558
192,-0.14427
193,0.20496999999999999
194,0.58835
195,0.95134
196,1.2522
197,1.4398
198,1.4808
199,1.3726
200,1.1327
201,0.8064100000000001
202,0.43277
203,0.059345
204,-0.27794
205,-0.54555
206,-0.7557699999999999
207,-0.92679
208,-1.0795
209,-1.2348
210,-1.3865
211,-1.5006
212,-1.5248
213,-1.4168
214,-1.137
215,-0.6815100000000001
216,-0.085534
217,0.56118
218,1.153
219,1.5965
220,1.8306
221,1.8424
222,1.6538
223,1.3343
224,0.96201
225,0.61487
226,0.31597
227,0.060155999999999994
228,-0.1775
229,-0.40615
230,-0.64322
231,-0.8805200000000001
232,-1.0922
233,-1.2283
234,-1.2632
235,-1.1979
236,-1.0463
237,-0.83235
238,-0.5915199999999999
239,-0.35796
240,-0.12908
241,0.09908
242,0.33121
243,0.5525
244,0.75522
245,0.9025
246,0.9786100000000001
247,0.97329
248,0.88792
249,0.73915
250,0.56394
251,0.40946
252,0.29912
253,0.23188000000000003
254,0.20845
255,0.1991
256,0.17708
257,0.11775999999999999
258,0.0042832999999999994
259,-0.15413
260,-0.33314
261,-0.51588
262,-0.68887
263,-0.83919
264,-0.9608200000000001
265,-1.0459
266,-1.0755
267,-1.0216
268,-0.86669
269,-0.62108
270,-0.30507
271,0.055294
272,0.42191999999999996
273,0.7572399999999999
274,1.0068
275,1.1411
276,1.1429
277,1.03
278,0.82245
279,0.57533
280,0.33405999999999997
281,0.14196
282,0.020674
283,-0.025113
284,-0.0042597
285,0.0374
286,0.054264
287,0.021164
288,-0.08093600000000001
289,-0.25785
290,-0.46388
291,-0.64557
292,-0.76445
293,-0.7934399999999999
294,-0.72713
295,-0.5724100000000001
296,-0.36085
297,-0.12419000000000001
298,0.096442
299,0.27879
300,0.4181
301,0.50512
302,0.53878
303,0.51936
304,0.45264
305,0.34722
306,0.21079
307,0.06882200000000001
308,-0.047967
309,-0.11300999999999999
310,-0.1093
311,-0.055603
312,0.0089859
313,0.042289999999999994
314,0.0039819
315,-0.10618
316,-0.27229000000000003
317,-0.44826000000000005
318,-0.55708
319,-0.5503
320,-0.42198
321,-0.20733000000000001
322,0.041956
323,0.26283
324,0.38945
325,0.41016
326,0.34309
327,0.23740999999999998
328,0.156
329,0.1376
330,0.17792
331,0.25501
332,0.31767
333,0.33355999999999997
334,0.26905999999999997
335,0.13277
336,-0.032458999999999995
337,-0.18681
338,-0.30029
339,-0.37168
340,-0.40601
341,-0.42286
342,-0.44367
343,-0.46738
344,-0.47897
345,-0.44673999999999997
346,-0.33915
347,-0.14529
348,0.12176
349,0.41431999999999997
350,0.6742
351,0.8453
352,0.88725
353,0.81098
354,0.65242
355,0.4608
356,0.2869
357,0.1624
358,0.097315
359,0.068449
360,0.040222
361,-0.031688
362,-0.16457
363,-0.34811
364,-0.55124
365,-0.73328
366,-0.85655
367,-0.9016
368,-0.87441
369,-0.7751
370,-0.63144
371,-0.47594
372,-0.31898000000000004
373,-0.16477999999999998
374,-0.016232
375,0.14866
376,0.3298
377,0.52813
378,0.74064
379,0.9323299999999999
380,1.0665
381,1.1227
382,1.079
383,0.9567200000000001
384,0.76471
385,0.5367
386,0.29822
387,0.07292
388,-0.14455
389,-0.36144
390,-0.57704
391,-0.79403
392,-1.0173
393,-1.2171
394,-1.3641
395,-1.4149
396,-1.3594
397,-1.1795
398,-0.8829899999999999
399,-0.49554
400,-0.047537
401,0.41255
402,0.8415100000000001
403,1.1908
404,1.4299
405,1.537
406,1.5007
407,1.3271
408,1.0459
409,0.68996
410,0.3165
411,-0.022369999999999998
412,-0.29527
413,-0.48632
414,-0.60506
415,-0.6542399999999999
416,-0.6816399999999999
417,-0.70636
418,-0.73714
419,-0.77318
420,-0.79703
421,-0.76812
422,-0.66023
423,-0.47995
424,-0.24631
425,0.014258000000000002
426,0.26783
427,0.47567
428,0.6316
429,0.74375
430,0.8218799999999999
431,0.87787
432,0.91927
433,0.94096
434,0.9033399999999999
435,0.7790699999999999
436,0.52325
437,0.12236
438,-0.40495
439,-0.9867100000000001
440,-1.5389
441,-1.9688
442,-2.2113
443,-2.2042
444,-1.9462
445,-1.4791
446,-0.8568100000000001
447,-0.1542
448,0.54694
449,1.1816
450,1.7225
451,2.1545
452,2.4533
453,2.6246
454,2.6430000000000002
455,2.4846
456,2.1272
457,1.5721
458,0.83862
459,-0.028849
460,-0.92771
461,-1.7652
462,-2.455
463,-2.9292
464,-3.1484
465,-3.1239
466,-2.8856
467,-2.4661
468,-1.9178
469,-1.2771
470,-0.58026
471,0.13962
472,0.8548600000000001
473,1.5176
474,2.0695
475,2.4729
476,2.6823
477,2.6931
478,2.5151
479,2.1662
480,1.6957
481,1.1249
482,0.48098
483,-0.2076
484,-0.9021899999999999
485,-1.554
486,-2.1094
487,-2.4893
488,-2.6407
489,-2.51
490,-2.0874
491,-1.4234
492,-0.6126199999999999
493,0.23819
494,1.0083
495,1.6021
496,1.9636
497,2.0844
498,1.9759
499,1.6721
