time,value
0,0.46048999999999995
1,-0.21114000000000002
2,0.38885
3,-0.026052
4,0.046501999999999995
5,0.1
6,-0.38903000000000004
7,-0.75169
8,-0.14023
9,0.30924
10,-0.33466999999999997
11,-0.049401
12,-0.21939
13,-0.051313
14,-0.089401
15,0.065737
16,0.29757
17,0.49476000000000003
18,-0.13076
19,-0.0012865
20,0.25025
21,-0.049899
22,0.3445
23,-0.23558
24,-0.33915
25,-0.40415
26,0.52077
27,-0.20576999999999998
28,-0.49407
29,-0.19058
30,0.18152000000000001
31,0.093832
32,-0.29746
33,-0.53666
34,0.25179
35,-0.37649
36,0.04557
37,0.2067
38,-1.5554
39,-1.5554
40,-1.5554
41,-1.5554
42,-1.5554
43,-1.5554
44,-1.5554
45,-1.5554
46,-1.5554
47,-1.5554
48,1.6238
49,1.6238
50,1.6238
51,1.6238
52,1.6238
53,1.6238
54,1.6238
55,1.6238
56,1.6238
57,-0.1779
58,0.035422
59,0.31239
60,0.49415
61,-0.012371
62,-0.011375
63,-0.30903
64,0.18942
65,-0.047715
66,0.0018838000000000001
67,-0.42186
68,-0.28749
69,-0.54305
70,-0.5589
71,0.038265
72,1.0476
73,-0.38824000000000003
74,0.40912
75,0.049362
76,0.11139
77,-0.08316699999999999
78,0.3564
79,-0.25495
80,0.48612
81,-0.0074804
82,-0.25527
83,0.42215
84,0.45219
85,-0.13087000000000001
86,0.15945
87,-0.25051
88,0.17603
89,-0.07537
90,-0.080698
91,0.046032
92,-0.1207
93,0.58704
94,0.42606000000000005
95,1.6238
96,1.6238
97,1.6238
98,1.6238
99,1.6238
100,1.6238
101,1.6238
102,1.6238
103,1.6238
104,1.6238
105,1.6238
106,1.6238
107,1.6238
108,1.6238
109,-1.5554
110,-1.5554
111,-1.5554
112,-1.5554
113,-1.5554
114,-1.5554
115,-1.5554
116,-1.5554
117,-1.5554
118,-1.5554
119,-1.5554
120,-1.5554
121,-1.5554
122,-1.5554
123,0.27573000000000003
124,-0.44618
125,0.082294
126,-0.2593
127,0.011943
