time,value
0,0.66586
1,0.32485
2,-0.057348
3,-0.44623999999999997
4,-0.79438
5,-1.0666
6,-1.2272
7,-1.2559
8,-1.1501
9,-0.9164399999999999
10,-0.5905600000000001
11,-0.21018
12,0.17893
13,0.53203
14,0.80917
15,0.9908399999999999
16,1.0594
17,1.0217
18,0.89041
19,0.6906100000000001
20,0.44267
21,0.17547000000000001
22,-0.08970800000000001
23,-0.33008000000000004
24,-0.5319699999999999
25,-0.6814899999999999
26,-0.76947
27,-0.78141
28,-0.71875
29,-0.58815
30,-0.40213000000000004
31,-0.18075
32,0.046439
33,0.26011999999999996
34,0.43788
35,0.5643600000000001
36,0.63522
37,0.6487
38,0.60541
39,0.5121100000000001
40,0.37019
41,0.19405
42,-0.001291
43,-0.19847
44,-0.3836
45,-0.53162
46,-0.6312
47,-0.67769
48,-0.67106
49,-0.6114
50,-0.50452
51,-0.35495
52,-0.17502
53,0.044056
54,0.28265
55,0.5269699999999999
56,0.7591899999999999
57,0.95294
58,1.0716
59,1.0987
60,1.0288
61,0.8558100000000001
62,0.5948
63,0.28167
64,-0.055518
65,-0.38824000000000003
66,-0.69368
67,-0.9548200000000001
68,-1.1518
69,-1.2838
70,-1.3394
71,-1.3061
72,-1.178
73,-0.9562700000000001
74,-0.64456
75,-0.2556
76,0.17726
77,0.6269399999999999
78,1.0557
79,1.4178
80,1.6829
81,1.8194
82,1.8091
83,1.6437
84,1.3316
85,0.90054
86,0.39326
87,-0.15475999999999998
88,-0.69062
89,-1.1703
90,-1.5667
91,-1.8558
92,-2.0104
93,-2.0116
94,-1.8545
95,-1.5337
96,-1.0622
97,-0.46868999999999994
98,0.19912
99,0.8774799999999999
100,1.4991
101,1.9863
102,2.2849
103,2.3691
104,2.2385
105,1.9108
106,1.4333
107,0.8567
108,0.23401999999999998
109,-0.38811
110,-0.9798
111,-1.5048
112,-1.9289
113,-2.2211
114,-2.3565
115,-2.3035
116,-2.0604
117,-1.636
118,-1.0619
119,-0.38679
120,0.31581
121,0.9903
122,1.5793
123,2.0372
124,2.339
125,2.4765
126,2.4438
127,2.2432
128,1.8769
129,1.3509
130,0.6978300000000001
131,-0.049397
132,-0.8277
133,-1.558
134,-2.1641
135,-2.5851
136,-2.7718
137,-2.7131
138,-2.4238
139,-1.9395
140,-1.3199
141,-0.61525
142,0.11924000000000001
143,0.82655
144,1.4735
145,2.0195
146,2.417
147,2.6367
148,2.6523
149,2.451
150,2.0395
151,1.4512
152,0.7407600000000001
153,-0.026833
154,-0.7804800000000001
155,-1.4526
156,-1.9885
157,-2.3497
158,-2.5179
159,-2.4797
160,-2.2406
161,-1.8298
162,-1.2659
163,-0.59504
164,0.12699000000000002
165,0.8387600000000001
166,1.4753
167,1.9763
168,2.2956
169,2.4012
170,2.2901
171,1.9813
172,1.5055
173,0.91043
174,0.26206999999999997
175,-0.38621
176,-0.9770700000000001
177,-1.4581
178,-1.7889
179,-1.9575
180,-1.956
181,-1.7935
182,-1.4987
183,-1.1031
184,-0.64179
185,-0.14645999999999998
186,0.35134
187,0.8145899999999999
188,1.2153
189,1.5171
190,1.685
191,1.7009
192,1.5655
193,1.2830000000000001
194,0.8859100000000001
195,0.42708999999999997
196,-0.045736
197,-0.48511000000000004
198,-0.84895
199,-1.1175
200,-1.2787
201,-1.3375
202,-1.2974
203,-1.1592
204,-0.9313100000000001
205,-0.6208100000000001
206,-0.24284
207,0.17232
208,0.58085
209,0.9324600000000001
210,1.1851
211,1.3091
212,1.2984
213,1.1604
214,0.91804
215,0.6148899999999999
216,0.27825
217,-0.05461
218,-0.36077
219,-0.62393
220,-0.83972
221,-0.98214
222,-1.0444
223,-1.0224
224,-0.9145399999999999
225,-0.72595
226,-0.48352
227,-0.20867
228,0.072894
229,0.33303
230,0.55342
231,0.71985
232,0.83014
233,0.8793
234,0.8639
235,0.77923
236,0.63442
237,0.43675
238,0.20331
239,-0.043653
240,-0.27998
241,-0.47446000000000005
242,-0.6078
243,-0.6745
244,-0.66782
245,-0.5987399999999999
246,-0.48108
247,-0.32339
248,-0.13981
249,0.054905999999999996
250,0.24273000000000003
251,0.4111
252,0.5313
253,0.5825899999999999
254,0.54728
255,0.41986
256,0.20886999999999997
257,-0.047131
258,-0.31355
259,-0.5382899999999999
260,-0.6726
261,-0.68779
262,-0.58221
263,-0.37954
264,-0.11855999999999998
265,0.15319000000000002
266,0.39103000000000004
267,0.56401
268,0.6725
269,0.72419
270,0.73127
271,0.71058
272,0.65485
273,0.5556300000000001
274,0.39654
275,0.16619
276,-0.12855999999999998
277,-0.4637
278,-0.78856
279,-1.0485
280,-1.189
281,-1.1866
282,-1.0415
283,-0.78266
284,-0.46533
285,-0.13871
286,0.15616
287,0.39642
288,0.58624
289,0.74097
290,0.87395
291,0.9884
292,1.0611
293,1.0665
294,0.9781
295,0.77971
296,0.47695
297,0.1091
298,-0.27298
299,-0.6202
300,-0.8876
301,-1.0499
302,-1.1062
303,-1.0637
304,-0.93966
305,-0.75239
306,-0.5174300000000001
307,-0.2437
308,0.052504999999999996
309,0.34769
310,0.61795
311,0.83183
312,0.96336
313,0.9860200000000001
314,0.9050799999999999
315,0.73775
316,0.50673
317,0.24681
318,-0.0091307
319,-0.24336999999999998
320,-0.44215
321,-0.59283
322,-0.69242
323,-0.7340000000000001
324,-0.71414
325,-0.61985
326,-0.45341000000000004
327,-0.2239
328,0.034133
329,0.28776999999999997
330,0.49613999999999997
331,0.62912
332,0.66861
333,0.62141
334,0.50416
335,0.34701
336,0.18070999999999998
337,0.029081
338,-0.10182999999999999
339,-0.19939
340,-0.26732
341,-0.30713
342,-0.32532
343,-0.31863
344,-0.27794
345,-0.20264000000000001
346,-0.10273
347,0.010499
348,0.12427
349,0.21711999999999998
350,0.27365
351,0.28531
352,0.25445999999999996
353,0.1943
354,0.11615
355,0.036058
356,-0.042349
357,-0.11324000000000001
358,-0.18865
359,-0.26003000000000004
360,-0.3197
361,-0.35863
362,-0.35600000000000004
363,-0.29485
364,-0.16375
365,0.025352
366,0.24434
367,0.45558000000000004
368,0.6161399999999999
369,0.68313
370,0.64367
371,0.50927
372,0.30359
373,0.069265
374,-0.15124
375,-0.3315
376,-0.45316000000000006
377,-0.5168
378,-0.53169
379,-0.51156
380,-0.46517
381,-0.38622
382,-0.26696
383,-0.10957
384,0.084881
385,0.29828000000000005
386,0.50173
387,0.6653
388,0.75725
389,0.7589100000000001
390,0.66502
391,0.49237
392,0.26271
393,0.021439
394,-0.20798000000000003
395,-0.39325
396,-0.51907
397,-0.5838
398,-0.58692
399,-0.5371100000000001
400,-0.44733
401,-0.32277
402,-0.18329
403,-0.037977
404,0.10372
405,0.22516
406,0.32263000000000003
407,0.38189
408,0.39097
409,0.34639000000000003
410,0.25489
411,0.11859000000000001
412,-0.046165
413,-0.21683000000000002
414,-0.36065
415,-0.45245
416,-0.46995
417,-0.39807
418,-0.23939000000000002
419,-0.017529
420,0.24022
421,0.49813999999999997
422,0.7165600000000001
423,0.86485
424,0.92179
425,0.88451
426,0.74692
427,0.5291899999999999
428,0.24545999999999998
429,-0.078162
430,-0.41335
431,-0.72485
432,-0.98498
433,-1.1621
434,-1.2377
435,-1.1961
436,-1.0395
437,-0.7811600000000001
438,-0.43988999999999995
439,-0.052453999999999994
440,0.34319
441,0.70962
442,1.0104
443,1.2255
444,1.3348
445,1.3303
446,1.2111
447,0.98939
448,0.68466
449,0.32022
450,-0.083159
451,-0.48428999999999994
452,-0.84134
453,-1.1299
454,-1.3219999999999998
455,-1.3932
456,-1.3368
457,-1.1561
458,-0.8673
459,-0.49411000000000005
460,-0.075188
461,0.34809
462,0.74153
463,1.0598
464,1.2787
465,1.3747
466,1.3482
467,1.1995
468,0.9476399999999999
469,0.62685
470,0.26696
471,-0.10392
472,-0.45519
473,-0.75978
474,-0.99177
475,-1.1436
476,-1.1975
477,-1.151
478,-1.0045
479,-0.7630100000000001
480,-0.43996999999999997
481,-0.067557
482,0.30578
483,0.6440100000000001
484,0.9113100000000001
485,1.0717
486,1.1192
487,1.0659999999999998
488,0.9264700000000001
489,0.72705
490,0.49055
491,0.23839000000000002
492,-0.027118
493,-0.29602
494,-0.5597
495,-0.79504
496,-0.9807299999999999
497,-1.0844
498,-1.0702
499,-0.9393299999999999
