time,value
0,-1.1438
1,-1.2334
2,-1.2348
3,-1.1676
4,-1.0490000000000002
5,-0.8958200000000001
6,-0.73312
7,-0.57287
8,-0.41081000000000006
9,-0.23861
10,-0.0568
11,0.15413
12,0.38523
13,0.6332399999999999
14,0.8750600000000001
15,1.0914
16,1.2436
17,1.2986
18,1.2442
19,1.0956
20,0.87485
21,0.61092
22,0.34728000000000003
23,0.10443
24,-0.10544
25,-0.29631
26,-0.4729
27,-0.6544399999999999
28,-0.8426
29,-1.031
30,-1.1945
31,-1.2962
32,-1.3119
33,-1.2141
34,-0.99393
35,-0.68262
36,-0.31877
37,0.057549
38,0.39048
39,0.65646
40,0.85701
41,1.0032
42,1.1005
43,1.1702
44,1.2273
45,1.255
46,1.2457
47,1.1792
48,1.0275
49,0.77787
50,0.45342
51,0.062681
52,-0.3479
53,-0.73012
54,-1.0457
55,-1.2771
56,-1.4063
57,-1.4511
58,-1.4162
59,-1.3219999999999998
60,-1.1853
61,-1.0063
62,-0.80966
63,-0.59646
64,-0.3741
65,-0.14517
66,0.082169
67,0.31112
68,0.55504
69,0.82339
70,1.1026
71,1.3599
72,1.5804
73,1.722
74,1.7486
75,1.6345
76,1.3882
77,1.0311
78,0.61225
79,0.1846
80,-0.20847
81,-0.52746
82,-0.7713899999999999
83,-0.95909
84,-1.1025
85,-1.2219
86,-1.3047
87,-1.3484
88,-1.3302
89,-1.2285
90,-1.0504
91,-0.81077
92,-0.54269
93,-0.27478
94,-0.039098
95,0.15993
96,0.33119
97,0.4728
98,0.60687
99,0.73154
100,0.83219
101,0.9003700000000001
102,0.9221
103,0.89774
104,0.83119
105,0.73763
106,0.62993
107,0.51607
108,0.39584
109,0.26082
110,0.091856
111,-0.092301
112,-0.29093
113,-0.46941000000000005
114,-0.58668
115,-0.61188
116,-0.55571
117,-0.43406999999999996
118,-0.28614
119,-0.16545
120,-0.11262
121,-0.13529000000000002
122,-0.20269
123,-0.28678000000000003
124,-0.35015
125,-0.36015
126,-0.31951
127,-0.25927
128,-0.19462000000000002
129,-0.15938
130,-0.14983
131,-0.13372
132,-0.095874
133,-0.022746000000000002
134,0.093002
135,0.22139
136,0.33171
137,0.39909
138,0.41068000000000005
139,0.3844
140,0.35056
141,0.35995
142,0.43023999999999996
143,0.5524899999999999
144,0.67987
145,0.75938
146,0.73065
147,0.5687399999999999
148,0.28149
149,-0.074301
150,-0.41591999999999996
151,-0.67614
152,-0.80986
153,-0.82089
154,-0.75873
155,-0.6951
156,-0.6611
157,-0.66609
158,-0.68034
159,-0.65941
160,-0.56425
161,-0.36823
162,-0.1011
163,0.20478
164,0.48732
165,0.68399
166,0.7870699999999999
167,0.80907
168,0.77727
169,0.72736
170,0.69724
171,0.68386
172,0.67082
173,0.61706
174,0.49818999999999997
175,0.29114
176,0.028312
177,-0.25361
178,-0.51175
179,-0.7099
180,-0.8217200000000001
181,-0.8675700000000001
182,-0.87702
183,-0.8740600000000001
184,-0.8604799999999999
185,-0.8271
186,-0.7426699999999999
187,-0.58558
188,-0.33153
189,0.0047818999999999995
190,0.3807
191,0.74055
192,1.0243
193,1.1904
194,1.2317
195,1.1588
196,1.0217
197,0.84995
198,0.67248
199,0.49508
200,0.3087
201,0.10005
202,-0.14132
203,-0.39826999999999996
204,-0.64637
205,-0.82949
206,-0.91133
207,-0.87416
208,-0.7327100000000001
209,-0.5250600000000001
210,-0.31961
211,-0.1555
212,-0.071232
213,-0.061687
214,-0.097129
215,-0.13724
216,-0.15308
217,-0.11765999999999999
218,-0.033557
219,0.074317
220,0.17645
221,0.25387
222,0.30018
223,0.31373
224,0.3127
225,0.32843
226,0.3694
227,0.43573999999999996
228,0.51383
229,0.57738
230,0.59655
231,0.5632
232,0.46093999999999996
233,0.30905
234,0.12847
235,-0.059079999999999994
236,-0.23485
237,-0.39115
238,-0.53462
239,-0.6704
240,-0.78262
241,-0.84814
242,-0.8582200000000001
243,-0.8075
244,-0.68483
245,-0.5120100000000001
246,-0.31340999999999997
247,-0.10254
248,0.091455
249,0.24563000000000001
250,0.36243000000000003
251,0.44647
252,0.5032300000000001
253,0.55171
254,0.59383
255,0.63402
256,0.66933
257,0.6775
258,0.64579
259,0.55898
260,0.42818999999999996
261,0.27469
262,0.11759000000000001
263,-0.026391
264,-0.14502
265,-0.2284
266,-0.26994
267,-0.28861
268,-0.30025999999999997
269,-0.31801999999999997
270,-0.34685
271,-0.38508000000000003
272,-0.43053
273,-0.45998
274,-0.46553
275,-0.45071000000000006
276,-0.39974
277,-0.32311
278,-0.23584000000000002
279,-0.14339000000000002
280,-0.049254
281,0.037696
282,0.1334
283,0.23656
284,0.35124
285,0.47205
286,0.58191
287,0.66164
288,0.69424
289,0.6838
290,0.63567
291,0.56584
292,0.49773999999999996
293,0.44109
294,0.39305999999999996
295,0.32905999999999996
296,0.23763
297,0.08313
298,-0.12587
299,-0.36091999999999996
300,-0.58228
301,-0.7481
302,-0.8250799999999999
303,-0.8145
304,-0.74446
305,-0.6555300000000001
306,-0.57648
307,-0.53492
308,-0.52645
309,-0.52675
310,-0.49083999999999994
311,-0.38487
312,-0.20772
313,0.041783999999999995
314,0.32454
315,0.6038600000000001
316,0.8360200000000001
317,1.0038
318,1.107
319,1.1547
320,1.1415
321,1.0802
322,0.96859
323,0.80024
324,0.57863
325,0.33016
326,0.067587
327,-0.18364
328,-0.40386
329,-0.57092
330,-0.69386
331,-0.7863399999999999
332,-0.8690200000000001
333,-0.9366200000000001
334,-0.9826299999999999
335,-0.99215
336,-0.94331
337,-0.81704
338,-0.6258699999999999
339,-0.38439
340,-0.12357
341,0.1029
342,0.27218000000000003
343,0.3711
344,0.41908
345,0.43618999999999997
346,0.46226000000000006
347,0.5091100000000001
348,0.57894
349,0.65766
350,0.74203
351,0.81523
352,0.8661
353,0.8961899999999999
354,0.8963399999999999
355,0.8496299999999999
356,0.72934
357,0.5352600000000001
358,0.25704
359,-0.077436
360,-0.40656
361,-0.68157
362,-0.8478100000000001
363,-0.88621
364,-0.8082
365,-0.6614
366,-0.52545
367,-0.45588
368,-0.48128999999999994
369,-0.59685
370,-0.75289
371,-0.87635
372,-0.914
373,-0.81053
374,-0.58233
375,-0.2681
376,0.086859
377,0.41878999999999994
378,0.67655
379,0.85934
380,0.9785200000000001
381,1.0474
382,1.082
383,1.0875
384,1.0686
385,1.0227
386,0.94204
387,0.83341
388,0.71559
389,0.6141399999999999
390,0.51637
391,0.41102
392,0.2763
393,0.08293500000000001
394,-0.17532999999999999
395,-0.49249
396,-0.8350200000000001
397,-1.1678
398,-1.4423
399,-1.6319
400,-1.7196
401,-1.7153
402,-1.6417
403,-1.5214
404,-1.3502
405,-1.1305
406,-0.85525
407,-0.53708
408,-0.17495
409,0.23106999999999997
410,0.6758
411,1.1366
412,1.5956
413,2.0312
414,2.4048
415,2.6725
416,2.7836
417,2.7028
418,2.4253
419,1.9711
420,1.3793
421,0.73824
422,0.12415
423,-0.40296
424,-0.82609
425,-1.1675
426,-1.4735
427,-1.7823
428,-2.1221
429,-2.4672
430,-2.7673
431,-2.95
432,-2.9243
433,-2.6518
434,-2.1469
435,-1.4847
436,-0.73831
437,-0.007003499999999999
438,0.6427
439,1.1899
440,1.6399
441,2.0084
442,2.3293
443,2.6103
444,2.8314
445,2.9485
446,2.9149
447,2.7019
448,2.3033
449,1.7511
450,1.1096
451,0.44327
452,-0.18168
453,-0.71985
454,-1.1578
455,-1.5067
456,-1.7847
457,-2.0084
458,-2.2018
459,-2.3569999999999998
460,-2.4549
461,-2.4754
462,-2.3886
463,-2.1635
464,-1.791
465,-1.2712
466,-0.6429199999999999
467,0.041301
468,0.72231
469,1.3337
470,1.8251
471,2.1646
472,2.3448
473,2.3861
474,2.2916
475,2.1042
476,1.8528
477,1.5530000000000002
478,1.2101
479,0.84183
480,0.46406000000000003
481,0.082275
482,-0.29481999999999997
483,-0.6544300000000001
484,-0.97141
485,-1.2354
486,-1.4478
487,-1.6031
488,-1.6902
489,-1.7178
490,-1.6785
491,-1.5523
492,-1.3321
493,-1.0170000000000001
494,-0.61949
495,-0.16904
496,0.29557
497,0.72063
498,1.0654
499,1.314
