time,value
0,2.4805
1,2.4805
2,2.4805
3,2.4805
4,2.4805
5,2.4805
6,2.5126
7,2.5579
8,2.5698
9,2.5780000000000003
10,2.5780000000000003
11,2.5780000000000003
12,2.5780000000000003
13,2.5780000000000003
14,2.5780000000000003
15,2.5780000000000003
16,2.5780000000000003
17,2.5780000000000003
18,2.568
19,2.54
20,2.4669
21,2.3632
22,2.2235
23,2.0776
24,1.9456
25,1.8136
26,1.6816
27,1.5538
28,1.4296
29,1.3198
30,1.2142
31,1.1086
32,1.004
33,0.9024200000000001
34,0.8103100000000001
35,0.72831
36,0.6282300000000001
37,0.52107
38,0.38959
39,0.247
40,0.0622
41,-0.14435
42,-0.38009
43,-0.55283
44,-0.69353
45,-0.78509
46,-0.8760600000000001
47,-0.99875
48,-1.1249
49,-1.2569
50,-1.3772
51,-1.49
52,-1.5815
53,-1.6645
54,-1.6934
55,-1.7083
56,-1.6927
57,-1.6712
58,-1.6448
59,-1.6287
60,-1.6154
61,-1.6036
62,-1.588
63,-1.5616
64,-1.526
65,-1.4809
66,-1.4227
67,-1.3597
68,-1.3321
69,-1.3045
70,-1.2725
71,-1.2352
72,-1.1911
73,-1.1726
74,-1.1664
75,-1.1159999999999999
76,-1.0578
77,-0.9786
78,-0.8994
79,-0.82019
80,-0.75692
81,-0.7035
82,-0.62966
83,-0.55843
84,-0.5491199999999999
85,-0.54284
86,-0.54284
87,-0.55453
88,-0.57534
89,-0.585
90,-0.5909800000000001
91,-0.5726600000000001
92,-0.54294
93,-0.48236999999999997
94,-0.4204
95,-0.35703
96,-0.3015
97,-0.2487
98,-0.22200999999999999
99,-0.20407999999999998
100,-0.21619000000000002
101,-0.22984000000000002
102,-0.24536999999999998
103,-0.25686
104,-0.26648
105,-0.29929
106,-0.33466
107,-0.37318
108,-0.39887
109,-0.40476999999999996
110,-0.42063999999999996
111,-0.44238
112,-0.44235
113,-0.43661000000000005
114,-0.41021
115,-0.3835
116,-0.35617
117,-0.31424
118,-0.26144
119,-0.20864000000000002
120,-0.15695
121,-0.129
122,-0.11474000000000001
123,-0.13555
124,-0.14769000000000002
125,-0.15173
126,-0.16863
127,-0.18975
128,-0.21609
129,-0.24249
130,-0.26889
131,-0.29529
132,-0.32169000000000003
133,-0.34809
134,-0.37449
135,-0.40089
136,-0.4319
137,-0.48563
138,-0.54967
139,-0.6288699999999999
140,-0.71523
141,-0.80561
142,-0.8919100000000001
143,-0.9749200000000001
144,-1.0364
145,-1.0989
146,-1.1632
147,-1.2017
148,-1.2219
149,-1.2214
150,-1.2155
151,-1.1928
152,-1.1775
153,-1.18
154,-1.1944
155,-1.2196
156,-1.2255
157,-1.2255
158,-1.2255
159,-1.2136
160,-1.1633
161,-1.1118
162,-1.0590000000000002
163,-0.97414
164,-0.8759899999999999
165,-0.79104
166,-0.7077600000000001
167,-0.62856
168,-0.56511
169,-0.5238
170,-0.48067
171,-0.43656999999999996
172,-0.34091
173,-0.23315999999999998
174,-0.085936
175,0.065305
176,0.22371
177,0.37453000000000003
178,0.5201899999999999
179,0.6545
180,0.7844300000000001
181,0.8856799999999999
182,0.9695
183,1.0133
184,1.0435
185,1.0622
186,1.0765
187,1.09
188,1.1428
189,1.1936
190,1.2383
191,1.26
192,1.2573
193,1.2352
194,1.2057
195,1.1276
196,1.0272
197,0.84241
198,0.7119800000000001
199,0.65452
200,0.63227
201,0.62792
202,0.6481399999999999
203,0.67451
204,0.7226600000000001
205,0.7649199999999999
206,0.79723
207,0.8025800000000001
208,0.79047
209,0.73595
210,0.66561
211,0.50255
212,0.36343000000000003
213,0.27646
214,0.21378000000000003
215,0.17090999999999998
216,0.10973
217,0.04414
218,0.0031416
219,-0.031355
220,-0.047195
221,-0.055205
222,-0.055205
223,-0.055205
224,-0.055205
225,-0.06180700000000001
226,-0.072598
227,-0.098998
228,-0.1254
229,-0.1518
230,-0.1782
231,-0.2046
232,-0.2293
233,-0.25017
234,-0.24954
235,-0.23908000000000001
236,-0.21268
237,-0.17034000000000002
238,-0.11815999999999999
239,-0.08640700000000001
240,-0.05831
241,-0.03191
242,-0.012695
243,-0.008346899999999999
244,-0.018132
245,-0.038942000000000004
246,-0.079822
247,-0.1254
248,-0.15988
249,-0.18295999999999998
250,-0.1752
251,-0.15
252,-0.10776
253,-0.06851499999999999
254,-0.030312000000000002
255,0.009409299999999999
256,0.049364
257,0.090052
258,0.12432
259,0.15072
260,0.17712
261,0.20352
262,0.22219
263,0.23625
264,0.22910999999999998
265,0.21206999999999998
266,0.17977
267,0.13164
268,0.07417699999999999
269,0.0038186
270,-0.063901
271,-0.090302
272,-0.11639000000000001
273,-0.14185999999999999
274,-0.15273
275,-0.15273
276,-0.17384000000000002
277,-0.19882
278,-0.20038
279,-0.19485999999999998
280,-0.17126
281,-0.13465
282,-0.085887
283,-0.049984
284,-0.018303
285,0.0081564
286,0.034557
287,0.060957000000000004
288,0.071332
289,0.062946
290,0.042011
291,0.015611000000000002
292,-0.024693
293,-0.065636
294,-0.10477
295,-0.13875
296,-0.16515
297,-0.18439
298,-0.19960999999999998
299,-0.20149
300,-0.19954000000000002
301,-0.18215
302,-0.15761
303,-0.11972000000000001
304,-0.10034
305,-0.094126
306,-0.075431
307,-0.055205
308,-0.055205
309,-0.055205
310,-0.055205
311,-0.055861
312,-0.057102999999999994
313,-0.077567
314,-0.10397
