time,value
0,-1.0322
1,-1.0290000000000001
2,-1.0079
3,-0.96988
4,-0.92414
5,-0.87771
6,-0.83249
7,-0.7913899999999999
8,-0.7591399999999999
9,-0.7388
10,-0.72673
11,-0.7186899999999999
12,-0.71281
13,-0.71104
14,-0.71268
15,-0.7156399999999999
16,-0.71724
17,-0.7170000000000001
18,-0.71515
19,-0.7116399999999999
20,-0.70672
21,-0.70057
22,-0.69489
23,-0.69101
24,-0.6913600000000001
25,-0.6956399999999999
26,-0.70289
27,-0.70967
28,-0.71537
29,-0.71937
30,-0.7229399999999999
31,-0.725
32,-0.72542
33,-0.72459
34,-0.7236199999999999
35,-0.72331
36,-0.72211
37,-0.7208899999999999
38,-0.71855
39,-0.71728
40,-0.7138899999999999
41,-0.70995
42,-0.70377
43,-0.69794
44,-0.6912
45,-0.68298
46,-0.6723600000000001
47,-0.65898
48,-0.64384
49,-0.62493
50,-0.60332
51,-0.57676
52,-0.54832
53,-0.51537
54,-0.4804
55,-0.43923
56,-0.39304
57,-0.33998
58,-0.28187
59,-0.22084
60,-0.16008
61,-0.10482000000000001
62,-0.057795000000000006
63,-0.022879
64,0.0024652
65,0.021039
66,0.03888
67,0.056661
68,0.07460800000000001
69,0.091277
70,0.10910999999999998
71,0.1287
72,0.15025
73,0.17282
74,0.1987
75,0.22859000000000002
76,0.25801999999999997
77,0.27844
78,0.2834
79,0.27360999999999996
80,0.24841999999999997
81,0.20471
82,0.13194
83,0.026378
84,-0.11185999999999999
85,-0.27058000000000004
86,-0.43467
87,-0.58317
88,-0.70071
89,-0.7799
90,-0.82405
91,-0.84295
92,-0.84577
93,-0.8434200000000001
94,-0.8393799999999999
95,-0.83762
96,-0.83229
97,-0.82452
98,-0.81376
99,-0.80586
100,-0.79975
101,-0.79457
102,-0.78808
103,-0.7802600000000001
104,-0.77242
105,-0.76132
106,-0.74876
107,-0.73223
108,-0.71787
109,-0.70325
110,-0.69081
111,-0.6782199999999999
112,-0.66563
113,-0.65165
114,-0.63375
115,-0.61165
116,-0.5836899999999999
117,-0.55272
118,-0.51773
119,-0.48178999999999994
120,-0.4417
121,-0.39842
122,-0.34735
123,-0.29041
124,-0.22737
125,-0.16101
126,-0.091879
127,-0.021275
128,0.047133999999999995
129,0.11055
130,0.16435999999999998
131,0.21070999999999998
132,0.24691
133,0.27604
134,0.29065
135,0.29375999999999997
136,0.28103
137,0.2612
138,0.23674
139,0.21495999999999998
140,0.1997
141,0.19192
142,0.19385
143,0.19789
144,0.20628000000000002
145,0.21195999999999998
146,0.2285
147,0.25433
148,0.30454000000000003
149,0.37005
150,0.45671999999999996
151,0.55902
152,0.6841
153,0.83401
154,1.0091
155,1.2074
156,1.423
157,1.6534
158,1.8849
159,2.1072
160,2.3058
161,2.4814
162,2.6349
163,2.7774
164,2.9126
165,3.0453
166,3.1666
167,3.2606
168,3.302
169,3.2718
170,3.1607
171,2.9754
172,2.7361
173,2.4703
174,2.2094
175,1.9666
176,1.7376
177,1.4869999999999999
178,1.1868
179,0.82744
180,0.44777
181,0.097567
182,-0.1784
183,-0.37388000000000005
184,-0.50148
185,-0.5816600000000001
186,-0.63035
187,-0.65418
188,-0.66665
189,-0.6674
190,-0.66959
191,-0.6661100000000001
192,-0.66578
193,-0.6602
194,-0.6560199999999999
195,-0.64895
196,-0.64361
197,-0.63925
198,-0.63762
199,-0.6416
200,-0.64979
201,-0.66457
202,-0.67888
203,-0.69434
204,-0.7065100000000001
205,-0.71882
206,-0.73051
207,-0.7419399999999999
208,-0.75064
209,-0.75475
210,-0.75461
211,-0.7503
212,-0.7450899999999999
213,-0.73675
214,-0.72724
215,-0.71155
216,-0.69447
217,-0.67377
218,-0.65559
219,-0.63841
220,-0.62259
221,-0.60546
222,-0.58394
223,-0.55906
224,-0.52685
225,-0.49013999999999996
226,-0.44203000000000003
227,-0.38611999999999996
228,-0.31476
229,-0.23146
230,-0.12947999999999998
231,-0.014399
232,0.11169000000000001
233,0.24284
234,0.37914000000000003
235,0.52461
236,0.68048
237,0.8467100000000001
238,1.0142
239,1.1764
240,1.3221
241,1.4484
242,1.5527
243,1.6392
244,1.7067
245,1.7529
246,1.7719
247,1.7618
248,1.7219
249,1.6551
250,1.5659
251,1.4642
252,1.3601
253,1.2598
254,1.1636
255,1.0653
256,0.96004
257,0.8391299999999999
258,0.70007
259,0.5367
260,0.35541999999999996
261,0.16308
262,-0.024324000000000002
263,-0.20410999999999999
264,-0.3755
265,-0.53819
266,-0.67797
267,-0.7811899999999999
268,-0.85519
269,-0.9162799999999999
