{
  "about": {
    "datasetID": "LL0_59_ionosphere_dataset",
    "datasetName": "LL0_59_ionosphere",
    "description": "**Author**:   \n**Source**: Unknown -   \n**Please cite**:   \n\n1. Title: Johns Hopkins University Ionosphere database\n\n2. Source Information:\n   -- Donor: Vince Sigillito (vgs@aplcen.apl.jhu.edu)\n   -- Date: 1989\n   -- Source: Space Physics Group\n              Applied Physics Laboratory\n              Johns Hopkins University\n              Johns Hopkins Road\n              Laurel, MD 20723 \n\n3. Past Usage:\n   -- Sigillito, V. G., Wing, S. P., Hutton, L. V., & Baker, K. B. (1989).\n      Classification of radar returns from the ionosphere using neural \n      networks. Johns Hopkins APL Technical Digest, 10, 262-266.\n\n      They investigated using backprop and the perceptron training algorithm\n      on this database.  Using the first 200 instances for training, which\n      were carefully split almost 50% positive and 50% negative, they found\n      that a \"linear\" perceptron attained 90.7%, a \"non-linear\" perceptron\n      attained 92%, and backprop an average of over 96% accuracy on the \n      remaining 150 test instances, consisting of 123 \"good\" and only 24 \"bad\"\n      instances.  (There was a counting error or some mistake somewhere; there\n      are a total of 351 rather than 350 instances in this domain.) Accuracy\n      on \"good\" instances was much higher than for \"bad\" instances.  Backprop\n      was tested with several different numbers of hidden units (in [0,15])\n      and incremental results were also reported (corresponding to how well\n      the different variants of backprop did after a periodic number of \n      epochs).\n\n      David Aha (aha@ics.uci.edu) briefly investigated this database.\n      He found that nearest neighbor attains an accuracy of 92.1%, that\n      Ross Quinlan's C4 algorithm attains 94.0% (no windowing), and that\n      IB3 (Aha & Kibler, IJCAI-1989) attained 96.7% (parameter settings:\n      70% and 80% for acceptance and dropping respectively).\n\n4. Relevant Information:\n   This radar data was collected by a system in Goose Bay, Labrador.  This\n   system consists of a phased array of 16 high-frequency antennas with a\n   total transmitted power on the order of 6.4 kilowatts.  See the paper\n   for more details.  The targets were free electrons in the ionosphere.\n   \"Good\" radar returns are those showing evidence of some type of structure \n   in the ionosphere.  \"Bad\" returns are those that do not; their signals pass\n   through the ionosphere.  \n\n   Received signals were processed using an autocorrelation function whose\n   arguments are the time of a pulse and the pulse number.  There were 17\n   pulse numbers for the Goose Bay system.  Instances in this databse are\n   described by 2 attributes per pulse number, corresponding to the complex\n   values returned by the function resulting from the complex electromagnetic\n   signal.\n\n5. Number of Instances: 351\n\n6. Number of Attributes: 34 plus the class attribute\n   -- All 34 predictor attributes are continuous\n\n7. Attribute Information:     \n   -- All 34 are continuous, as described above\n   -- The 35th attribute is either \"good\" or \"bad\" according to the definition\n      summarized above.  This is a binary classification task.\n\n8. Missing Values: None",
    "citation": "\n\t\t\t\t@article{OpenML2013,\n\t\t\t\tauthor = {Vanschoren, Joaquin and van Rijn, Jan N. and Bischl, Bernd and Torgo, Luis},\n\t\t\t\ttitle = {OpenML: Networked Science in Machine Learning},\n\t\t\t\tjournal = {SIGKDD Explorations},\n\t\t\t\tvolume = {15},\n\t\t\t\tnumber = {2},\n\t\t\t\tyear = {2013},\n\t\t\t\tpages = {49--60},\n\t\t\t\turl = {http://doi.acm.org/10.1145/2641190.2641198},\n\t\t\t\tdoi = {10.1145/2641190.2641198},\n\t\t\t\tpublisher = {ACM},\n\t\t\t\taddress = {New York, NY, USA},\n\t\t\t\t}",
    "license": "CC-BY license",
    "source": "OpenML",
    "sourceURI": "http://www.openml.org/d/59",
    "approximateSize": "",
    "datasetSchemaVersion": "4.0.0",
    "redacted": false,
    "datasetVersion": "4.0.0",
    "digest": "a9532e7f9847bd36d71d5ce098952ade42c80ea7bd8aa8bb3ae2364a631052b8"
  },
  "dataResources": [
    {
      "resID": "learningData",
      "resPath": "tables/learningData.csv",
      "resType": "table",
      "resFormat": {
        "text/csv": [
          "csv"
        ]
      },
      "isCollection": false,
      "columns": [
        {
          "colIndex": 0,
          "colName": "d3mIndex",
          "colType": "integer",
          "role": [
            "index"
          ]
        },
        {
          "colIndex": 1,
          "colName": "a01",
          "colType": "real",
          "role": [
            "attribute"
          ]
        },
        {
          "colIndex": 2,
          "colName": "a02",
          "colType": "real",
          "role": [
            "attribute"
          ]
        },
        {
          "colIndex": 3,
          "colName": "a03",
          "colType": "real",
          "role": [
            "attribute"
          ]
        },
        {
          "colIndex": 4,
          "colName": "a04",
          "colType": "real",
          "role": [
            "attribute"
          ]
        },
        {
          "colIndex": 5,
          "colName": "a05",
          "colType": "real",
          "role": [
            "attribute"
          ]
        },
        {
          "colIndex": 6,
          "colName": "a06",
          "colType": "real",
          "role": [
            "attribute"
          ]
        },
        {
          "colIndex": 7,
          "colName": "a07",
          "colType": "real",
          "role": [
            "attribute"
          ]
        },
        {
          "colIndex": 8,
          "colName": "a08",
          "colType": "real",
          "role": [
            "attribute"
          ]
        },
        {
          "colIndex": 9,
          "colName": "a09",
          "colType": "real",
          "role": [
            "attribute"
          ]
        },
        {
          "colIndex": 10,
          "colName": "a10",
          "colType": "real",
          "role": [
            "attribute"
          ]
        },
        {
          "colIndex": 11,
          "colName": "a11",
          "colType": "real",
          "role": [
            "attribute"
          ]
        },
        {
          "colIndex": 12,
          "colName": "a12",
          "colType": "real",
          "role": [
            "attribute"
          ]
        },
        {
          "colIndex": 13,
          "colName": "a13",
          "colType": "real",
          "role": [
            "attribute"
          ]
        },
        {
          "colIndex": 14,
          "colName": "a14",
          "colType": "real",
          "role": [
            "attribute"
          ]
        },
        {
          "colIndex": 15,
          "colName": "a15",
          "colType": "real",
          "role": [
            "attribute"
          ]
        },
        {
          "colIndex": 16,
          "colName": "a16",
          "colType": "real",
          "role": [
            "attribute"
          ]
        },
        {
          "colIndex": 17,
          "colName": "a17",
          "colType": "real",
          "role": [
            "attribute"
          ]
        },
        {
          "colIndex": 18,
          "colName": "a18",
          "colType": "real",
          "role": [
            "attribute"
          ]
        },
        {
          "colIndex": 19,
          "colName": "a19",
          "colType": "real",
          "role": [
            "attribute"
          ]
        },
        {
          "colIndex": 20,
          "colName": "a20",
          "colType": "real",
          "role": [
            "attribute"
          ]
        },
        {
          "colIndex": 21,
          "colName": "a21",
          "colType": "real",
          "role": [
            "attribute"
          ]
        },
        {
          "colIndex": 22,
          "colName": "a22",
          "colType": "real",
          "role": [
            "attribute"
          ]
        },
        {
          "colIndex": 23,
          "colName": "a23",
          "colType": "real",
          "role": [
            "attribute"
          ]
        },
        {
          "colIndex": 24,
          "colName": "a24",
          "colType": "real",
          "role": [
            "attribute"
          ]
        },
        {
          "colIndex": 25,
          "colName": "a25",
          "colType": "real",
          "role": [
            "attribute"
          ]
        },
        {
          "colIndex": 26,
          "colName": "a26",
          "colType": "real",
          "role": [
            "attribute"
          ]
        },
        {
          "colIndex": 27,
          "colName": "a27",
          "colType": "real",
          "role": [
            "attribute"
          ]
        },
        {
          "colIndex": 28,
          "colName": "a28",
          "colType": "real",
          "role": [
            "attribute"
          ]
        },
        {
          "colIndex": 29,
          "colName": "a29",
          "colType": "real",
          "role": [
            "attribute"
          ]
        },
        {
          "colIndex": 30,
          "colName": "a30",
          "colType": "real",
          "role": [
            "attribute"
          ]
        },
        {
          "colIndex": 31,
          "colName": "a31",
          "colType": "real",
          "role": [
            "attribute"
          ]
        },
        {
          "colIndex": 32,
          "colName": "a32",
          "colType": "real",
          "role": [
            "attribute"
          ]
        },
        {
          "colIndex": 33,
          "colName": "a33",
          "colType": "real",
          "role": [
            "attribute"
          ]
        },
        {
          "colIndex": 34,
          "colName": "a34",
          "colType": "real",
          "role": [
            "attribute"
          ]
        },
        {
          "colIndex": 35,
          "colName": "class",
          "colType": "categorical",
          "role": [
            "suggestedTarget"
          ]
        }
      ],
      "columnsCount": 36
    }
  ]
}