{
  "about": {
    "datasetID": "LL0_522_pm10_dataset",
    "datasetName": "LL0_522_pm10",
    "description": "**Author**:   \n**Source**: Unknown - Date unknown  \n**Please cite**:   \n\nThe data are a subsample of 500 observations from a data set\nthat originate in a study where air pollution at a road is\nrelated to traffic volume and meteorological variables,\ncollected by the Norwegian Public Roads Administration. The\nresponse variable (column 1) consist of hourly values of the\nlogarithm of the concentration of PM10 (particles), measured at\nAlnabru in Oslo, Norway, between October 2001 and August 2003.\nThe predictor variables (columns 2 to 8) are the logarithm of\nthe number of cars per hour, temperature $2$ meter above ground\n(degree C), wind speed (meters/second), the temperature\ndifference between $25$ and $2$ meters above ground (degree C),\nwind direction (degrees between 0 and 360), hour of day and day\nnumber from October 1. 2001. Submitted by Magne Aldrin\n(magne.aldrin@nr.no). [28/Jul/04] (19kbytes)\n\nNote: description of data is from this website\nhttp://lib.stat.cmu.edu/datasets/\n\n\nInformation about the dataset\nCLASSTYPE: numeric\nCLASSINDEX: none specific",
    "citation": "\n\t\t\t\t@article{OpenML2013,\n\t\t\t\tauthor = {Vanschoren, Joaquin and van Rijn, Jan N. and Bischl, Bernd and Torgo, Luis},\n\t\t\t\ttitle = {OpenML: Networked Science in Machine Learning},\n\t\t\t\tjournal = {SIGKDD Explorations},\n\t\t\t\tvolume = {15},\n\t\t\t\tnumber = {2},\n\t\t\t\tyear = {2013},\n\t\t\t\tpages = {49--60},\n\t\t\t\turl = {http://doi.acm.org/10.1145/2641190.2641198},\n\t\t\t\tdoi = {10.1145/2641190.2641198},\n\t\t\t\tpublisher = {ACM},\n\t\t\t\taddress = {New York, NY, USA},\n\t\t\t\t}",
    "license": "CC-BY license",
    "source": "OpenML",
    "sourceURI": "http://www.openml.org/d/522",
    "approximateSize": "",
    "datasetSchemaVersion": "4.0.0",
    "redacted": false,
    "datasetVersion": "4.0.0",
    "digest": "f54e19a758ba12ab2ec6ce572d82353ca360e8cb8169b2a2d57e70ce110a8d8d"
  },
  "dataResources": [
    {
      "resID": "learningData",
      "resPath": "tables/learningData.csv",
      "resType": "table",
      "resFormat": {
        "text/csv": [
          "csv"
        ]
      },
      "isCollection": false,
      "columns": [
        {
          "colIndex": 0,
          "colName": "d3mIndex",
          "colType": "integer",
          "role": [
            "index"
          ]
        },
        {
          "colIndex": 1,
          "colName": "pm10_concentration",
          "colType": "real",
          "role": [
            "suggestedTarget"
          ]
        },
        {
          "colIndex": 2,
          "colName": "cars_per_hour",
          "colType": "real",
          "role": [
            "attribute"
          ]
        },
        {
          "colIndex": 3,
          "colName": "temperature_at_2m",
          "colType": "real",
          "role": [
            "attribute"
          ]
        },
        {
          "colIndex": 4,
          "colName": "wind_speed",
          "colType": "real",
          "role": [
            "attribute"
          ]
        },
        {
          "colIndex": 5,
          "colName": "temperature_diff_2m_25m",
          "colType": "real",
          "role": [
            "attribute"
          ]
        },
        {
          "colIndex": 6,
          "colName": "wind_direction",
          "colType": "real",
          "role": [
            "attribute"
          ]
        },
        {
          "colIndex": 7,
          "colName": "hour_of_day",
          "colType": "integer",
          "role": [
            "attribute"
          ]
        },
        {
          "colIndex": 8,
          "colName": "day",
          "colType": "integer",
          "role": [
            "attribute"
          ]
        }
      ],
      "columnsCount": 9
    }
  ]
}