{
  "about": {
    "datasetID": "LL0_12_mfeat_factors_dataset",
    "datasetName": "LL0_12_mfeat_factors",
    "description": "**Author**: Robert P.W. Duin, Department of Applied Physics, Delft University of Technology  \n**Source**: [UCI](https://archive.ics.uci.edu/ml/datasets/Multiple+Features) - 1998  \n**Please cite**: [UCI](https://archive.ics.uci.edu/ml/citation_policy.html)   \n\n**Multiple Features Dataset: Factors**  \nOne of a set of 6 datasets describing features of handwritten numerals (0 - 9) extracted from a collection of Dutch utility maps. Corresponding patterns in different datasets correspond to the same original character. 200 instances per class (for a total of 2,000 instances) have been digitized in binary images. \n\n### Attribute Information  \nThe attributes represent 216 profile correlations. No more information is known.\n\n### Relevant Papers  \nA slightly different version of the database is used in  \nM. van Breukelen, R.P.W. Duin, D.M.J. Tax, and J.E. den Hartog, Handwritten digit recognition by combined classifiers, Kybernetika, vol. 34, no. 4, 1998, 381-386.\n \nThe database as is is used in:  \nA.K. Jain, R.P.W. Duin, J. Mao, Statistical Pattern Recognition: A Review, IEEE Transactions on Pattern Analysis and Machine Intelligence archive, Volume 22 Issue 1, January 2000",
    "citation": "\n\t\t\t\t@article{OpenML2013,\n\t\t\t\tauthor = {Vanschoren, Joaquin and van Rijn, Jan N. and Bischl, Bernd and Torgo, Luis},\n\t\t\t\ttitle = {OpenML: Networked Science in Machine Learning},\n\t\t\t\tjournal = {SIGKDD Explorations},\n\t\t\t\tvolume = {15},\n\t\t\t\tnumber = {2},\n\t\t\t\tyear = {2013},\n\t\t\t\tpages = {49--60},\n\t\t\t\turl = {http://doi.acm.org/10.1145/2641190.2641198},\n\t\t\t\tdoi = {10.1145/2641190.2641198},\n\t\t\t\tpublisher = {ACM},\n\t\t\t\taddress = {New York, NY, USA},\n\t\t\t\t}",
    "license": "CC-BY license",
    "source": "OpenML",
    "sourceURI": "http://www.openml.org/d/12",
    "approximateSize": "",
    "datasetSchemaVersion": "4.0.0",
    "redacted": false,
    "datasetVersion": "4.0.0",
    "digest": "0e91b316de50cb46259c9417ea522de334b7a8d9785e357337e1510b8298f258"
  },
  "dataResources": [
    {
      "resID": "learningData",
      "resPath": "tables/learningData.csv",
      "resType": "table",
      "resFormat": {
        "text/csv": [
          "csv"
        ]
      },
      "isCollection": false,
      "columns": [
        {
          "colIndex": 0,
          "colName": "d3mIndex",
          "colType": "integer",
          "role": [
            "index"
          ]
        },
        {
          "colIndex": 1,
          "colName": "att1",
          "colType": "integer",
          "role": [
            "attribute"
          ]
        },
        {
          "colIndex": 2,
          "colName": "att2",
          "colType": "integer",
          "role": [
            "attribute"
          ]
        },
        {
          "colIndex": 3,
          "colName": "att3",
          "colType": "integer",
          "role": [
            "attribute"
          ]
        },
        {
          "colIndex": 4,
          "colName": "att4",
          "colType": "integer",
          "role": [
            "attribute"
          ]
        },
        {
          "colIndex": 5,
          "colName": "att5",
          "colType": "integer",
          "role": [
            "attribute"
          ]
        },
        {
          "colIndex": 6,
          "colName": "att6",
          "colType": "integer",
          "role": [
            "attribute"
          ]
        },
        {
          "colIndex": 7,
          "colName": "att7",
          "colType": "integer",
          "role": [
            "attribute"
          ]
        },
        {
          "colIndex": 8,
          "colName": "att8",
          "colType": "integer",
          "role": [
            "attribute"
          ]
        },
        {
          "colIndex": 9,
          "colName": "att9",
          "colType": "integer",
          "role": [
            "attribute"
          ]
        },
        {
          "colIndex": 10,
          "colName": "att10",
          "colType": "integer",
          "role": [
            "attribute"
          ]
        },
        {
          "colIndex": 11,
          "colName": "att11",
          "colType": "integer",
          "role": [
            "attribute"
          ]
        },
        {
          "colIndex": 12,
          "colName": "att12",
          "colType": "integer",
          "role": [
            "attribute"
          ]
        },
        {
          "colIndex": 13,
          "colName": "att13",
          "colType": "integer",
          "role": [
            "attribute"
          ]
        },
        {
          "colIndex": 14,
          "colName": "att14",
          "colType": "integer",
          "role": [
            "attribute"
          ]
        },
        {
          "colIndex": 15,
          "colName": "att15",
          "colType": "integer",
          "role": [
            "attribute"
          ]
        },
        {
          "colIndex": 16,
          "colName": "att16",
          "colType": "integer",
          "role": [
            "attribute"
          ]
        },
        {
          "colIndex": 17,
          "colName": "att17",
          "colType": "integer",
          "role": [
            "attribute"
          ]
        },
        {
          "colIndex": 18,
          "colName": "att18",
          "colType": "integer",
          "role": [
            "attribute"
          ]
        },
        {
          "colIndex": 19,
          "colName": "att19",
          "colType": "integer",
          "role": [
            "attribute"
          ]
        },
        {
          "colIndex": 20,
          "colName": "att20",
          "colType": "integer",
          "role": [
            "attribute"
          ]
        },
        {
          "colIndex": 21,
          "colName": "att21",
          "colType": "integer",
          "role": [
            "attribute"
          ]
        },
        {
          "colIndex": 22,
          "colName": "att22",
          "colType": "integer",
          "role": [
            "attribute"
          ]
        },
        {
          "colIndex": 23,
          "colName": "att23",
          "colType": "integer",
          "role": [
            "attribute"
          ]
        },
        {
          "colIndex": 24,
          "colName": "att24",
          "colType": "integer",
          "role": [
            "attribute"
          ]
        },
        {
          "colIndex": 25,
          "colName": "att25",
          "colType": "integer",
          "role": [
            "attribute"
          ]
        },
        {
          "colIndex": 26,
          "colName": "att26",
          "colType": "integer",
          "role": [
            "attribute"
          ]
        },
        {
          "colIndex": 27,
          "colName": "att27",
          "colType": "integer",
          "role": [
            "attribute"
          ]
        },
        {
          "colIndex": 28,
          "colName": "att28",
          "colType": "integer",
          "role": [
            "attribute"
          ]
        },
        {
          "colIndex": 29,
          "colName": "att29",
          "colType": "integer",
          "role": [
            "attribute"
          ]
        },
        {
          "colIndex": 30,
          "colName": "att30",
          "colType": "integer",
          "role": [
            "attribute"
          ]
        },
        {
          "colIndex": 31,
          "colName": "att31",
          "colType": "integer",
          "role": [
            "attribute"
          ]
        },
        {
          "colIndex": 32,
          "colName": "att32",
          "colType": "integer",
          "role": [
            "attribute"
          ]
        },
        {
          "colIndex": 33,
          "colName": "att33",
          "colType": "integer",
          "role": [
            "attribute"
          ]
        },
        {
          "colIndex": 34,
          "colName": "att34",
          "colType": "integer",
          "role": [
            "attribute"
          ]
        },
        {
          "colIndex": 35,
          "colName": "att35",
          "colType": "integer",
          "role": [
            "attribute"
          ]
        },
        {
          "colIndex": 36,
          "colName": "att36",
          "colType": "integer",
          "role": [
            "attribute"
          ]
        },
        {
          "colIndex": 37,
          "colName": "att37",
          "colType": "integer",
          "role": [
            "attribute"
          ]
        },
        {
          "colIndex": 38,
          "colName": "att38",
          "colType": "integer",
          "role": [
            "attribute"
          ]
        },
        {
          "colIndex": 39,
          "colName": "att39",
          "colType": "integer",
          "role": [
            "attribute"
          ]
        },
        {
          "colIndex": 40,
          "colName": "att40",
          "colType": "integer",
          "role": [
            "attribute"
          ]
        },
        {
          "colIndex": 41,
          "colName": "att41",
          "colType": "integer",
          "role": [
            "attribute"
          ]
        },
        {
          "colIndex": 42,
          "colName": "att42",
          "colType": "integer",
          "role": [
            "attribute"
          ]
        },
        {
          "colIndex": 43,
          "colName": "att43",
          "colType": "integer",
          "role": [
            "attribute"
          ]
        },
        {
          "colIndex": 44,
          "colName": "att44",
          "colType": "integer",
          "role": [
            "attribute"
          ]
        },
        {
          "colIndex": 45,
          "colName": "att45",
          "colType": "integer",
          "role": [
            "attribute"
          ]
        },
        {
          "colIndex": 46,
          "colName": "att46",
          "colType": "integer",
          "role": [
            "attribute"
          ]
        },
        {
          "colIndex": 47,
          "colName": "att47",
          "colType": "integer",
          "role": [
            "attribute"
          ]
        },
        {
          "colIndex": 48,
          "colName": "att48",
          "colType": "integer",
          "role": [
            "attribute"
          ]
        },
        {
          "colIndex": 49,
          "colName": "att49",
          "colType": "integer",
          "role": [
            "attribute"
          ]
        },
        {
          "colIndex": 50,
          "colName": "att50",
          "colType": "integer",
          "role": [
            "attribute"
          ]
        },
        {
          "colIndex": 51,
          "colName": "att51",
          "colType": "integer",
          "role": [
            "attribute"
          ]
        },
        {
          "colIndex": 52,
          "colName": "att52",
          "colType": "integer",
          "role": [
            "attribute"
          ]
        },
        {
          "colIndex": 53,
          "colName": "att53",
          "colType": "integer",
          "role": [
            "attribute"
          ]
        },
        {
          "colIndex": 54,
          "colName": "att54",
          "colType": "integer",
          "role": [
            "attribute"
          ]
        },
        {
          "colIndex": 55,
          "colName": "att55",
          "colType": "integer",
          "role": [
            "attribute"
          ]
        },
        {
          "colIndex": 56,
          "colName": "att56",
          "colType": "integer",
          "role": [
            "attribute"
          ]
        },
        {
          "colIndex": 57,
          "colName": "att57",
          "colType": "integer",
          "role": [
            "attribute"
          ]
        },
        {
          "colIndex": 58,
          "colName": "att58",
          "colType": "integer",
          "role": [
            "attribute"
          ]
        },
        {
          "colIndex": 59,
          "colName": "att59",
          "colType": "integer",
          "role": [
            "attribute"
          ]
        },
        {
          "colIndex": 60,
          "colName": "att60",
          "colType": "integer",
          "role": [
            "attribute"
          ]
        },
        {
          "colIndex": 61,
          "colName": "att61",
          "colType": "integer",
          "role": [
            "attribute"
          ]
        },
        {
          "colIndex": 62,
          "colName": "att62",
          "colType": "integer",
          "role": [
            "attribute"
          ]
        },
        {
          "colIndex": 63,
          "colName": "att63",
          "colType": "integer",
          "role": [
            "attribute"
          ]
        },
        {
          "colIndex": 64,
          "colName": "att64",
          "colType": "integer",
          "role": [
            "attribute"
          ]
        },
        {
          "colIndex": 65,
          "colName": "att65",
          "colType": "integer",
          "role": [
            "attribute"
          ]
        },
        {
          "colIndex": 66,
          "colName": "att66",
          "colType": "integer",
          "role": [
            "attribute"
          ]
        },
        {
          "colIndex": 67,
          "colName": "att67",
          "colType": "integer",
          "role": [
            "attribute"
          ]
        },
        {
          "colIndex": 68,
          "colName": "att68",
          "colType": "integer",
          "role": [
            "attribute"
          ]
        },
        {
          "colIndex": 69,
          "colName": "att69",
          "colType": "integer",
          "role": [
            "attribute"
          ]
        },
        {
          "colIndex": 70,
          "colName": "att70",
          "colType": "integer",
          "role": [
            "attribute"
          ]
        },
        {
          "colIndex": 71,
          "colName": "att71",
          "colType": "integer",
          "role": [
            "attribute"
          ]
        },
        {
          "colIndex": 72,
          "colName": "att72",
          "colType": "integer",
          "role": [
            "attribute"
          ]
        },
        {
          "colIndex": 73,
          "colName": "att73",
          "colType": "integer",
          "role": [
            "attribute"
          ]
        },
        {
          "colIndex": 74,
          "colName": "att74",
          "colType": "integer",
          "role": [
            "attribute"
          ]
        },
        {
          "colIndex": 75,
          "colName": "att75",
          "colType": "integer",
          "role": [
            "attribute"
          ]
        },
        {
          "colIndex": 76,
          "colName": "att76",
          "colType": "integer",
          "role": [
            "attribute"
          ]
        },
        {
          "colIndex": 77,
          "colName": "att77",
          "colType": "integer",
          "role": [
            "attribute"
          ]
        },
        {
          "colIndex": 78,
          "colName": "att78",
          "colType": "integer",
          "role": [
            "attribute"
          ]
        },
        {
          "colIndex": 79,
          "colName": "att79",
          "colType": "integer",
          "role": [
            "attribute"
          ]
        },
        {
          "colIndex": 80,
          "colName": "att80",
          "colType": "integer",
          "role": [
            "attribute"
          ]
        },
        {
          "colIndex": 81,
          "colName": "att81",
          "colType": "integer",
          "role": [
            "attribute"
          ]
        },
        {
          "colIndex": 82,
          "colName": "att82",
          "colType": "integer",
          "role": [
            "attribute"
          ]
        },
        {
          "colIndex": 83,
          "colName": "att83",
          "colType": "integer",
          "role": [
            "attribute"
          ]
        },
        {
          "colIndex": 84,
          "colName": "att84",
          "colType": "integer",
          "role": [
            "attribute"
          ]
        },
        {
          "colIndex": 85,
          "colName": "att85",
          "colType": "integer",
          "role": [
            "attribute"
          ]
        },
        {
          "colIndex": 86,
          "colName": "att86",
          "colType": "integer",
          "role": [
            "attribute"
          ]
        },
        {
          "colIndex": 87,
          "colName": "att87",
          "colType": "integer",
          "role": [
            "attribute"
          ]
        },
        {
          "colIndex": 88,
          "colName": "att88",
          "colType": "integer",
          "role": [
            "attribute"
          ]
        },
        {
          "colIndex": 89,
          "colName": "att89",
          "colType": "integer",
          "role": [
            "attribute"
          ]
        },
        {
          "colIndex": 90,
          "colName": "att90",
          "colType": "integer",
          "role": [
            "attribute"
          ]
        },
        {
          "colIndex": 91,
          "colName": "att91",
          "colType": "integer",
          "role": [
            "attribute"
          ]
        },
        {
          "colIndex": 92,
          "colName": "att92",
          "colType": "integer",
          "role": [
            "attribute"
          ]
        },
        {
          "colIndex": 93,
          "colName": "att93",
          "colType": "integer",
          "role": [
            "attribute"
          ]
        },
        {
          "colIndex": 94,
          "colName": "att94",
          "colType": "integer",
          "role": [
            "attribute"
          ]
        },
        {
          "colIndex": 95,
          "colName": "att95",
          "colType": "integer",
          "role": [
            "attribute"
          ]
        },
        {
          "colIndex": 96,
          "colName": "att96",
          "colType": "integer",
          "role": [
            "attribute"
          ]
        },
        {
          "colIndex": 97,
          "colName": "att97",
          "colType": "integer",
          "role": [
            "attribute"
          ]
        },
        {
          "colIndex": 98,
          "colName": "att98",
          "colType": "integer",
          "role": [
            "attribute"
          ]
        },
        {
          "colIndex": 99,
          "colName": "att99",
          "colType": "integer",
          "role": [
            "attribute"
          ]
        },
        {
          "colIndex": 100,
          "colName": "att100",
          "colType": "integer",
          "role": [
            "attribute"
          ]
        },
        {
          "colIndex": 101,
          "colName": "att101",
          "colType": "integer",
          "role": [
            "attribute"
          ]
        },
        {
          "colIndex": 102,
          "colName": "att102",
          "colType": "integer",
          "role": [
            "attribute"
          ]
        },
        {
          "colIndex": 103,
          "colName": "att103",
          "colType": "integer",
          "role": [
            "attribute"
          ]
        },
        {
          "colIndex": 104,
          "colName": "att104",
          "colType": "integer",
          "role": [
            "attribute"
          ]
        },
        {
          "colIndex": 105,
          "colName": "att105",
          "colType": "integer",
          "role": [
            "attribute"
          ]
        },
        {
          "colIndex": 106,
          "colName": "att106",
          "colType": "integer",
          "role": [
            "attribute"
          ]
        },
        {
          "colIndex": 107,
          "colName": "att107",
          "colType": "integer",
          "role": [
            "attribute"
          ]
        },
        {
          "colIndex": 108,
          "colName": "att108",
          "colType": "integer",
          "role": [
            "attribute"
          ]
        },
        {
          "colIndex": 109,
          "colName": "att109",
          "colType": "integer",
          "role": [
            "attribute"
          ]
        },
        {
          "colIndex": 110,
          "colName": "att110",
          "colType": "integer",
          "role": [
            "attribute"
          ]
        },
        {
          "colIndex": 111,
          "colName": "att111",
          "colType": "integer",
          "role": [
            "attribute"
          ]
        },
        {
          "colIndex": 112,
          "colName": "att112",
          "colType": "integer",
          "role": [
            "attribute"
          ]
        },
        {
          "colIndex": 113,
          "colName": "att113",
          "colType": "integer",
          "role": [
            "attribute"
          ]
        },
        {
          "colIndex": 114,
          "colName": "att114",
          "colType": "integer",
          "role": [
            "attribute"
          ]
        },
        {
          "colIndex": 115,
          "colName": "att115",
          "colType": "integer",
          "role": [
            "attribute"
          ]
        },
        {
          "colIndex": 116,
          "colName": "att116",
          "colType": "integer",
          "role": [
            "attribute"
          ]
        },
        {
          "colIndex": 117,
          "colName": "att117",
          "colType": "integer",
          "role": [
            "attribute"
          ]
        },
        {
          "colIndex": 118,
          "colName": "att118",
          "colType": "integer",
          "role": [
            "attribute"
          ]
        },
        {
          "colIndex": 119,
          "colName": "att119",
          "colType": "integer",
          "role": [
            "attribute"
          ]
        },
        {
          "colIndex": 120,
          "colName": "att120",
          "colType": "integer",
          "role": [
            "attribute"
          ]
        },
        {
          "colIndex": 121,
          "colName": "att121",
          "colType": "integer",
          "role": [
            "attribute"
          ]
        },
        {
          "colIndex": 122,
          "colName": "att122",
          "colType": "integer",
          "role": [
            "attribute"
          ]
        },
        {
          "colIndex": 123,
          "colName": "att123",
          "colType": "integer",
          "role": [
            "attribute"
          ]
        },
        {
          "colIndex": 124,
          "colName": "att124",
          "colType": "integer",
          "role": [
            "attribute"
          ]
        },
        {
          "colIndex": 125,
          "colName": "att125",
          "colType": "integer",
          "role": [
            "attribute"
          ]
        },
        {
          "colIndex": 126,
          "colName": "att126",
          "colType": "integer",
          "role": [
            "attribute"
          ]
        },
        {
          "colIndex": 127,
          "colName": "att127",
          "colType": "integer",
          "role": [
            "attribute"
          ]
        },
        {
          "colIndex": 128,
          "colName": "att128",
          "colType": "integer",
          "role": [
            "attribute"
          ]
        },
        {
          "colIndex": 129,
          "colName": "att129",
          "colType": "integer",
          "role": [
            "attribute"
          ]
        },
        {
          "colIndex": 130,
          "colName": "att130",
          "colType": "integer",
          "role": [
            "attribute"
          ]
        },
        {
          "colIndex": 131,
          "colName": "att131",
          "colType": "integer",
          "role": [
            "attribute"
          ]
        },
        {
          "colIndex": 132,
          "colName": "att132",
          "colType": "integer",
          "role": [
            "attribute"
          ]
        },
        {
          "colIndex": 133,
          "colName": "att133",
          "colType": "integer",
          "role": [
            "attribute"
          ]
        },
        {
          "colIndex": 134,
          "colName": "att134",
          "colType": "integer",
          "role": [
            "attribute"
          ]
        },
        {
          "colIndex": 135,
          "colName": "att135",
          "colType": "integer",
          "role": [
            "attribute"
          ]
        },
        {
          "colIndex": 136,
          "colName": "att136",
          "colType": "integer",
          "role": [
            "attribute"
          ]
        },
        {
          "colIndex": 137,
          "colName": "att137",
          "colType": "integer",
          "role": [
            "attribute"
          ]
        },
        {
          "colIndex": 138,
          "colName": "att138",
          "colType": "integer",
          "role": [
            "attribute"
          ]
        },
        {
          "colIndex": 139,
          "colName": "att139",
          "colType": "integer",
          "role": [
            "attribute"
          ]
        },
        {
          "colIndex": 140,
          "colName": "att140",
          "colType": "integer",
          "role": [
            "attribute"
          ]
        },
        {
          "colIndex": 141,
          "colName": "att141",
          "colType": "integer",
          "role": [
            "attribute"
          ]
        },
        {
          "colIndex": 142,
          "colName": "att142",
          "colType": "integer",
          "role": [
            "attribute"
          ]
        },
        {
          "colIndex": 143,
          "colName": "att143",
          "colType": "integer",
          "role": [
            "attribute"
          ]
        },
        {
          "colIndex": 144,
          "colName": "att144",
          "colType": "integer",
          "role": [
            "attribute"
          ]
        },
        {
          "colIndex": 145,
          "colName": "att145",
          "colType": "integer",
          "role": [
            "attribute"
          ]
        },
        {
          "colIndex": 146,
          "colName": "att146",
          "colType": "integer",
          "role": [
            "attribute"
          ]
        },
        {
          "colIndex": 147,
          "colName": "att147",
          "colType": "integer",
          "role": [
            "attribute"
          ]
        },
        {
          "colIndex": 148,
          "colName": "att148",
          "colType": "integer",
          "role": [
            "attribute"
          ]
        },
        {
          "colIndex": 149,
          "colName": "att149",
          "colType": "integer",
          "role": [
            "attribute"
          ]
        },
        {
          "colIndex": 150,
          "colName": "att150",
          "colType": "integer",
          "role": [
            "attribute"
          ]
        },
        {
          "colIndex": 151,
          "colName": "att151",
          "colType": "integer",
          "role": [
            "attribute"
          ]
        },
        {
          "colIndex": 152,
          "colName": "att152",
          "colType": "integer",
          "role": [
            "attribute"
          ]
        },
        {
          "colIndex": 153,
          "colName": "att153",
          "colType": "integer",
          "role": [
            "attribute"
          ]
        },
        {
          "colIndex": 154,
          "colName": "att154",
          "colType": "integer",
          "role": [
            "attribute"
          ]
        },
        {
          "colIndex": 155,
          "colName": "att155",
          "colType": "integer",
          "role": [
            "attribute"
          ]
        },
        {
          "colIndex": 156,
          "colName": "att156",
          "colType": "integer",
          "role": [
            "attribute"
          ]
        },
        {
          "colIndex": 157,
          "colName": "att157",
          "colType": "integer",
          "role": [
            "attribute"
          ]
        },
        {
          "colIndex": 158,
          "colName": "att158",
          "colType": "integer",
          "role": [
            "attribute"
          ]
        },
        {
          "colIndex": 159,
          "colName": "att159",
          "colType": "integer",
          "role": [
            "attribute"
          ]
        },
        {
          "colIndex": 160,
          "colName": "att160",
          "colType": "integer",
          "role": [
            "attribute"
          ]
        },
        {
          "colIndex": 161,
          "colName": "att161",
          "colType": "integer",
          "role": [
            "attribute"
          ]
        },
        {
          "colIndex": 162,
          "colName": "att162",
          "colType": "integer",
          "role": [
            "attribute"
          ]
        },
        {
          "colIndex": 163,
          "colName": "att163",
          "colType": "integer",
          "role": [
            "attribute"
          ]
        },
        {
          "colIndex": 164,
          "colName": "att164",
          "colType": "integer",
          "role": [
            "attribute"
          ]
        },
        {
          "colIndex": 165,
          "colName": "att165",
          "colType": "integer",
          "role": [
            "attribute"
          ]
        },
        {
          "colIndex": 166,
          "colName": "att166",
          "colType": "integer",
          "role": [
            "attribute"
          ]
        },
        {
          "colIndex": 167,
          "colName": "att167",
          "colType": "integer",
          "role": [
            "attribute"
          ]
        },
        {
          "colIndex": 168,
          "colName": "att168",
          "colType": "integer",
          "role": [
            "attribute"
          ]
        },
        {
          "colIndex": 169,
          "colName": "att169",
          "colType": "integer",
          "role": [
            "attribute"
          ]
        },
        {
          "colIndex": 170,
          "colName": "att170",
          "colType": "integer",
          "role": [
            "attribute"
          ]
        },
        {
          "colIndex": 171,
          "colName": "att171",
          "colType": "integer",
          "role": [
            "attribute"
          ]
        },
        {
          "colIndex": 172,
          "colName": "att172",
          "colType": "integer",
          "role": [
            "attribute"
          ]
        },
        {
          "colIndex": 173,
          "colName": "att173",
          "colType": "integer",
          "role": [
            "attribute"
          ]
        },
        {
          "colIndex": 174,
          "colName": "att174",
          "colType": "integer",
          "role": [
            "attribute"
          ]
        },
        {
          "colIndex": 175,
          "colName": "att175",
          "colType": "integer",
          "role": [
            "attribute"
          ]
        },
        {
          "colIndex": 176,
          "colName": "att176",
          "colType": "integer",
          "role": [
            "attribute"
          ]
        },
        {
          "colIndex": 177,
          "colName": "att177",
          "colType": "integer",
          "role": [
            "attribute"
          ]
        },
        {
          "colIndex": 178,
          "colName": "att178",
          "colType": "integer",
          "role": [
            "attribute"
          ]
        },
        {
          "colIndex": 179,
          "colName": "att179",
          "colType": "integer",
          "role": [
            "attribute"
          ]
        },
        {
          "colIndex": 180,
          "colName": "att180",
          "colType": "integer",
          "role": [
            "attribute"
          ]
        },
        {
          "colIndex": 181,
          "colName": "att181",
          "colType": "integer",
          "role": [
            "attribute"
          ]
        },
        {
          "colIndex": 182,
          "colName": "att182",
          "colType": "integer",
          "role": [
            "attribute"
          ]
        },
        {
          "colIndex": 183,
          "colName": "att183",
          "colType": "integer",
          "role": [
            "attribute"
          ]
        },
        {
          "colIndex": 184,
          "colName": "att184",
          "colType": "integer",
          "role": [
            "attribute"
          ]
        },
        {
          "colIndex": 185,
          "colName": "att185",
          "colType": "integer",
          "role": [
            "attribute"
          ]
        },
        {
          "colIndex": 186,
          "colName": "att186",
          "colType": "integer",
          "role": [
            "attribute"
          ]
        },
        {
          "colIndex": 187,
          "colName": "att187",
          "colType": "integer",
          "role": [
            "attribute"
          ]
        },
        {
          "colIndex": 188,
          "colName": "att188",
          "colType": "integer",
          "role": [
            "attribute"
          ]
        },
        {
          "colIndex": 189,
          "colName": "att189",
          "colType": "integer",
          "role": [
            "attribute"
          ]
        },
        {
          "colIndex": 190,
          "colName": "att190",
          "colType": "integer",
          "role": [
            "attribute"
          ]
        },
        {
          "colIndex": 191,
          "colName": "att191",
          "colType": "integer",
          "role": [
            "attribute"
          ]
        },
        {
          "colIndex": 192,
          "colName": "att192",
          "colType": "integer",
          "role": [
            "attribute"
          ]
        },
        {
          "colIndex": 193,
          "colName": "att193",
          "colType": "integer",
          "role": [
            "attribute"
          ]
        },
        {
          "colIndex": 194,
          "colName": "att194",
          "colType": "integer",
          "role": [
            "attribute"
          ]
        },
        {
          "colIndex": 195,
          "colName": "att195",
          "colType": "integer",
          "role": [
            "attribute"
          ]
        },
        {
          "colIndex": 196,
          "colName": "att196",
          "colType": "integer",
          "role": [
            "attribute"
          ]
        },
        {
          "colIndex": 197,
          "colName": "att197",
          "colType": "integer",
          "role": [
            "attribute"
          ]
        },
        {
          "colIndex": 198,
          "colName": "att198",
          "colType": "integer",
          "role": [
            "attribute"
          ]
        },
        {
          "colIndex": 199,
          "colName": "att199",
          "colType": "integer",
          "role": [
            "attribute"
          ]
        },
        {
          "colIndex": 200,
          "colName": "att200",
          "colType": "integer",
          "role": [
            "attribute"
          ]
        },
        {
          "colIndex": 201,
          "colName": "att201",
          "colType": "integer",
          "role": [
            "attribute"
          ]
        },
        {
          "colIndex": 202,
          "colName": "att202",
          "colType": "integer",
          "role": [
            "attribute"
          ]
        },
        {
          "colIndex": 203,
          "colName": "att203",
          "colType": "integer",
          "role": [
            "attribute"
          ]
        },
        {
          "colIndex": 204,
          "colName": "att204",
          "colType": "integer",
          "role": [
            "attribute"
          ]
        },
        {
          "colIndex": 205,
          "colName": "att205",
          "colType": "integer",
          "role": [
            "attribute"
          ]
        },
        {
          "colIndex": 206,
          "colName": "att206",
          "colType": "integer",
          "role": [
            "attribute"
          ]
        },
        {
          "colIndex": 207,
          "colName": "att207",
          "colType": "integer",
          "role": [
            "attribute"
          ]
        },
        {
          "colIndex": 208,
          "colName": "att208",
          "colType": "integer",
          "role": [
            "attribute"
          ]
        },
        {
          "colIndex": 209,
          "colName": "att209",
          "colType": "integer",
          "role": [
            "attribute"
          ]
        },
        {
          "colIndex": 210,
          "colName": "att210",
          "colType": "integer",
          "role": [
            "attribute"
          ]
        },
        {
          "colIndex": 211,
          "colName": "att211",
          "colType": "integer",
          "role": [
            "attribute"
          ]
        },
        {
          "colIndex": 212,
          "colName": "att212",
          "colType": "integer",
          "role": [
            "attribute"
          ]
        },
        {
          "colIndex": 213,
          "colName": "att213",
          "colType": "integer",
          "role": [
            "attribute"
          ]
        },
        {
          "colIndex": 214,
          "colName": "att214",
          "colType": "integer",
          "role": [
            "attribute"
          ]
        },
        {
          "colIndex": 215,
          "colName": "att215",
          "colType": "integer",
          "role": [
            "attribute"
          ]
        },
        {
          "colIndex": 216,
          "colName": "att216",
          "colType": "integer",
          "role": [
            "attribute"
          ]
        },
        {
          "colIndex": 217,
          "colName": "class",
          "colType": "categorical",
          "role": [
            "suggestedTarget"
          ]
        }
      ],
      "columnsCount": 218
    }
  ]
}