{
  "about": {
    "datasetID": "LL0_21_car_dataset",
    "datasetName": "LL0_21_car",
    "description": "**Author**: Marko Bohanec, Blaz Zupan  \n**Source**: [UCI](https://archive.ics.uci.edu/ml/datasets/car+evaluation) - 1997   \n**Please cite**: [UCI](http://archive.ics.uci.edu/ml/citation_policy.html)  \n\n**Car Evaluation Database**\nThis database was derived from a simple hierarchical decision model originally developed for the demonstration of DEX (M. Bohanec, V. Rajkovic: Expert system for decision making. Sistemica 1(1), pp. 145-157, 1990.).\n\nThe model evaluates cars according to the following concept structure:\n \n    CAR                      car acceptability\n    . PRICE                  overall price\n    . . buying               buying price\n    . . maint                price of the maintenance\n    . TECH                   technical characteristics\n    . . COMFORT              comfort\n    . . . doors              number of doors\n    . . . persons            capacity in terms of persons to carry\n    . . . lug_boot           the size of luggage boot\n    . . safety               estimated safety of the car\n \nInput attributes are printed in lowercase. Besides the target concept (CAR), the model includes three intermediate concepts: PRICE, TECH, COMFORT. Every concept is in the original model related to its lower level descendants by a set of examples (for\nthese examples sets see http://www-ai.ijs.si/BlazZupan/car.html).\n \nThe Car Evaluation Database contains examples with the structural information removed, i.e., directly relates CAR to the six input attributes: buying, maint, doors, persons, lug_boot, safety. Because of known underlying concept structure, this database may be particularly useful for testing constructive induction and structure discovery methods.\n\n### Relevant papers:  \nM. Bohanec and V. Rajkovic: Knowledge acquisition and explanation for multi-attribute decision making. In 8th Intl Workshop on Expert Systems and their Applications, Avignon, France. pages 59-78, 1988.  \n\nM. Bohanec, V. Rajkovic: Expert system for decision making. Sistemica 1(1), pp. 145-157, 1990.",
    "citation": "\n\t\t\t\t@article{OpenML2013,\n\t\t\t\tauthor = {Vanschoren, Joaquin and van Rijn, Jan N. and Bischl, Bernd and Torgo, Luis},\n\t\t\t\ttitle = {OpenML: Networked Science in Machine Learning},\n\t\t\t\tjournal = {SIGKDD Explorations},\n\t\t\t\tvolume = {15},\n\t\t\t\tnumber = {2},\n\t\t\t\tyear = {2013},\n\t\t\t\tpages = {49--60},\n\t\t\t\turl = {http://doi.acm.org/10.1145/2641190.2641198},\n\t\t\t\tdoi = {10.1145/2641190.2641198},\n\t\t\t\tpublisher = {ACM},\n\t\t\t\taddress = {New York, NY, USA},\n\t\t\t\t}",
    "license": "CC-BY license",
    "source": "OpenML",
    "sourceURI": "http://www.openml.org/d/21",
    "approximateSize": "",
    "datasetSchemaVersion": "4.0.0",
    "redacted": false,
    "datasetVersion": "4.0.0",
    "digest": "6b7e1ff8e08240d023320384edff0d7ad2d983229cf23fc9456c79b5c2e65252"
  },
  "dataResources": [
    {
      "resID": "learningData",
      "resPath": "tables/learningData.csv",
      "resType": "table",
      "resFormat": {
        "text/csv": [
          "csv"
        ]
      },
      "isCollection": false,
      "columns": [
        {
          "colIndex": 0,
          "colName": "d3mIndex",
          "colType": "integer",
          "role": [
            "index"
          ]
        },
        {
          "colIndex": 1,
          "colName": "buying",
          "colType": "categorical",
          "role": [
            "attribute"
          ]
        },
        {
          "colIndex": 2,
          "colName": "maint",
          "colType": "categorical",
          "role": [
            "attribute"
          ]
        },
        {
          "colIndex": 3,
          "colName": "doors",
          "colType": "categorical",
          "role": [
            "attribute"
          ]
        },
        {
          "colIndex": 4,
          "colName": "persons",
          "colType": "categorical",
          "role": [
            "attribute"
          ]
        },
        {
          "colIndex": 5,
          "colName": "lug_boot",
          "colType": "categorical",
          "role": [
            "attribute"
          ]
        },
        {
          "colIndex": 6,
          "colName": "safety",
          "colType": "categorical",
          "role": [
            "attribute"
          ]
        },
        {
          "colIndex": 7,
          "colName": "class",
          "colType": "categorical",
          "role": [
            "suggestedTarget"
          ]
        }
      ],
      "columnsCount": 8
    }
  ]
}