{
  "about": {
    "problemID": "LL0_1552_autouniv_au7_1100_problem",
    "problemName": "LL0_1552_autouniv_au7_1100_problem",
    "problemDescription": "**Author**: Ray. J. Hickey   \n**Source**: UCI  \n**Please cite**:   \n\n* Dataset Title:  \n\nAutoUniv Dataset  \ndata problem: autoUniv-au7-300-drift-au7-cpd1-800 \n\n* Abstract:   \n\nAutoUniv is an advanced data generator for classifications tasks. The aim is to reflect the nuances and heterogeneity of real data. Data can be generated in .csv, ARFF or C4.5 formats.\n\n* Source:  \n\nAutoUniv was developed by Ray. J. Hickey. Email: ray.j.hickey '@' gmail.com \nAutoUniv web-site: http://sites.google.com/site/autouniv/.\n\n\n* Data Set Information:\n\nThe user first creates a classification model and then generates classified examples from it. To create a model, the following are specified: the number of attributes (up to 1000) and their type (discrete or continuous), the number of classes (up to 10), the complexity of the underlying rules and the noise level. AutoUniv then produces a model through a process of constrained randomised search to satisfy the user's requirements. A model can have up to 3000 rules. Rare class models can be designed. A sequence of models can be designed to reflect concept and/or population drift. \n\nAutoUniv creates three text files for a model: a Prolog specification of the model used to generate examples (.aupl); a user-friendly statement of the classification rules in an 'if ... then' format (.aurules); a statistical summary of the main properties of the model, including its Bayes rate (.auprops).\n\n\n* Attribute Information: \n\nAttributes may be discrete with up to 10 values or continuous. A discrete attribute can be nominal with values v1, v2, v3 ... or integer with values 0, 1, 2 , ... .\n\n\n* Relevant Papers:\n\nMarrs, G, Hickey, RJ and Black, MM (2010) Modeling the example life-cycle in an online classification learner. In Proceedings of HaCDAIS 2010: International Workshop on Handling Concept Drift in Adaptive Information Systems. \n[Web Link]#proc . \n\nMarrs, G, Hickey, RJ and Black, MM (2010) The Impact of Latency on Online Classification Learning with Concept Drift. In Y. Bi and M.A. Williams (Eds.): KSEM 2010, LNAI 6291, Springer-Verlag, Berlin, pp. 459â€“469. \n\nHickey, RJ (2007) Structure and Majority Classes in Decision Tree Learning. Journal of Machine Learning Research, 8, pp. 1747-1768.",
    "problemSchemaVersion": "4.0.0",
    "problemVersion": "4.0.0",
    "taskKeywords": [
      "classification",
      "multiClass"
    ]
  },
  "inputs": {
    "data": [
      {
        "datasetID": "LL0_1552_autouniv_au7_1100_dataset",
        "targets": [
          {
            "targetIndex": 0,
            "resID": "learningData",
            "colIndex": 13,
            "colName": "Class"
          }
        ]
      }
    ],
    "dataSplits": {
      "method": "holdOut",
      "testSize": 0.2,
      "stratified": true,
      "numRepeats": 0,
      "randomSeed": 42,
      "splitsFile": "dataSplits.csv"
    },
    "performanceMetrics": [
      {
        "metric": "f1Macro"
      }
    ]
  },
  "expectedOutputs": {
    "predictionsFile": "predictions.csv"
  }
}