{
  "about": {
    "problemID": "LL0_16_mfeat_karhunen_problem",
    "problemName": "mfeat_karhunen_problem",
    "problemDescription": "**Author**: Robert P.W. Duin, Department of Applied Physics, Delft University of Technology  \n**Source**: [UCI](https://archive.ics.uci.edu/ml/datasets/Multiple+Features) - 1998  \n**Please cite**: [UCI](https://archive.ics.uci.edu/ml/citation_policy.html)   \n\n**Multiple Features Dataset: Karhunen**  \nOne of a set of 6 datasets describing features of handwritten numerals (0 - 9) extracted from a collection of Dutch utility maps. Corresponding patterns in different datasets correspond to the same original character. 200 instances per class (for a total of 2,000 instances) have been digitized in binary images. \n\n### Attribute Information  \nThe attributes represent 64 descriptors from the Karhunen-Loeve Transform, a linear transform that corresponds to the projection of the images on the eigenvectors of a covariant matrix. Also see:  \nM.D. Garris et al: NIST Form-Based Handprint Recognition System. Internal Report. National Institute of Standards and Technology, NISTIR 5469, 1994.\n\n### Relevant Papers  \nA slightly different version of the database is used in  \nM. van Breukelen, R.P.W. Duin, D.M.J. Tax, and J.E. den Hartog, Handwritten digit recognition by combined classifiers, Kybernetika, vol. 34, no. 4, 1998, 381-386.\n \nThe database as is is used in:  \nA.K. Jain, R.P.W. Duin, J. Mao, Statistical Pattern Recognition: A Review, IEEE Transactions on Pattern Analysis and Machine Intelligence archive, Volume 22 Issue 1, January 2000",
    "problemVersion": "4.0.0",
    "problemSchemaVersion": "4.0.0",
    "taskKeywords": [
      "classification",
      "multiClass"
    ]
  },
  "inputs": {
    "data": [
      {
        "datasetID": "LL0_16_mfeat_karhunen_dataset",
        "targets": [
          {
            "targetIndex": 0,
            "resID": "learningData",
            "colIndex": 65,
            "colName": "class"
          }
        ]
      }
    ],
    "dataSplits": {
      "method": "holdOut",
      "testSize": 0.2,
      "stratified": true,
      "numRepeats": 0,
      "randomSeed": 42,
      "splitsFile": "dataSplits.csv"
    },
    "performanceMetrics": [
      {
        "metric": "f1Macro"
      }
    ]
  },
  "expectedOutputs": {
    "predictionsFile": "predictions.csv"
  }
}