{
  "about": {
    "datasetID": "LL0_1097_ICU_dataset",
    "datasetName": "ICU",
    "description": "**Author**:   \n**Source**: Unknown - Date unknown  \n**Please cite**:   \n\nDatasets of Data And Story Library, project illustrating use of basic statistic methods, converted to arff format by Hakan Kjellerstrand.\nSource: TunedIT: http://tunedit.org/repo/DASL\n\nDASL file http://lib.stat.cmu.edu/DASL/Datafiles/ICU.html\n\nReference:\nAuthorization:   Contact authors\nDescription:   The data consist of 200 subjects from a larger study on the survival of patients following admission to an adult intensive care unit (ICU).  The study used logistic regression to predict the probability of survival for these patients until their discharge from the hospital.  The dependent variable is the binary variable Vital Status (STA).  Nineteen possible predictor variables, both discrete and continuous, were also observed.\n\nNumber of cases:   200\nVariable Names:\n\nID:   ID number of the patient\nSTA:   Vital status (0 = Lived, 1 = Died)\nAGE:   Patient's age in years\nSEX:   Patient's sex (0 = Male, 1 = Female)\nRACE:   Patient's race (1 = White, 2 = Black, 3 = Other)\nSER:   Service at ICU admission (0 = Medical, 1 = Surgical)\nCAN:   Is cancer part of the present problem? (0 = No, 1 = Yes)\nCRN:   History of chronic renal failure (0 = No, 1 = Yes)\nINF:",
    "citation": "\n\t\t\t\t@article{OpenML2013,\n\t\t\t\tauthor = {Vanschoren, Joaquin and van Rijn, Jan N. and Bischl, Bernd and Torgo, Luis},\n\t\t\t\ttitle = {OpenML: Networked Science in Machine Learning},\n\t\t\t\tjournal = {SIGKDD Explorations},\n\t\t\t\tvolume = {15},\n\t\t\t\tnumber = {2},\n\t\t\t\tyear = {2013},\n\t\t\t\tpages = {49--60},\n\t\t\t\turl = {http://doi.acm.org/10.1145/2641190.2641198},\n\t\t\t\tdoi = {10.1145/2641190.2641198},\n\t\t\t\tpublisher = {ACM},\n\t\t\t\taddress = {New York, NY, USA},\n\t\t\t\t}",
    "license": "CC-BY license",
    "source": "OpenML",
    "sourceURI": "http://www.openml.org/d/1097",
    "approximateSize": "",
    "datasetVersion": "4.0.0",
    "datasetSchemaVersion": "4.0.0",
    "redacted": false,
    "digest": "c1948f714049f48a136a40c2a0c9a4bea923a3001104238a1d51eb374f8c47ad"
  },
  "dataResources": [
    {
      "resID": "learningData",
      "resPath": "tables/learningData.csv",
      "resType": "table",
      "resFormat": {
        "text/csv": [
          "csv"
        ]
      },
      "isCollection": false,
      "columns": [
        {
          "colIndex": 0,
          "colName": "d3mIndex",
          "colType": "integer",
          "role": [
            "index"
          ]
        },
        {
          "colIndex": 1,
          "colName": "ID",
          "colType": "real",
          "role": [
            "attribute"
          ]
        },
        {
          "colIndex": 2,
          "colName": "STA",
          "colType": "real",
          "role": [
            "attribute"
          ]
        },
        {
          "colIndex": 3,
          "colName": "AGE",
          "colType": "real",
          "role": [
            "attribute"
          ]
        },
        {
          "colIndex": 4,
          "colName": "SEX",
          "colType": "real",
          "role": [
            "attribute"
          ]
        },
        {
          "colIndex": 5,
          "colName": "RAC",
          "colType": "real",
          "role": [
            "attribute"
          ]
        },
        {
          "colIndex": 6,
          "colName": "SER",
          "colType": "real",
          "role": [
            "attribute"
          ]
        },
        {
          "colIndex": 7,
          "colName": "CAN",
          "colType": "real",
          "role": [
            "attribute"
          ]
        },
        {
          "colIndex": 8,
          "colName": "CRN",
          "colType": "real",
          "role": [
            "attribute"
          ]
        },
        {
          "colIndex": 9,
          "colName": "INF",
          "colType": "real",
          "role": [
            "attribute"
          ]
        },
        {
          "colIndex": 10,
          "colName": "CPR",
          "colType": "real",
          "role": [
            "attribute"
          ]
        },
        {
          "colIndex": 11,
          "colName": "SYS",
          "colType": "real",
          "role": [
            "attribute"
          ]
        },
        {
          "colIndex": 12,
          "colName": "HRA",
          "colType": "real",
          "role": [
            "attribute"
          ]
        },
        {
          "colIndex": 13,
          "colName": "PRE",
          "colType": "real",
          "role": [
            "attribute"
          ]
        },
        {
          "colIndex": 14,
          "colName": "TYP",
          "colType": "real",
          "role": [
            "attribute"
          ]
        },
        {
          "colIndex": 15,
          "colName": "FRA",
          "colType": "real",
          "role": [
            "attribute"
          ]
        },
        {
          "colIndex": 16,
          "colName": "PO2",
          "colType": "real",
          "role": [
            "attribute"
          ]
        },
        {
          "colIndex": 17,
          "colName": "PH",
          "colType": "real",
          "role": [
            "attribute"
          ]
        },
        {
          "colIndex": 18,
          "colName": "PCO",
          "colType": "real",
          "role": [
            "attribute"
          ]
        },
        {
          "colIndex": 19,
          "colName": "BIC",
          "colType": "real",
          "role": [
            "attribute"
          ]
        },
        {
          "colIndex": 20,
          "colName": "CRE",
          "colType": "real",
          "role": [
            "attribute"
          ]
        },
        {
          "colIndex": 21,
          "colName": "LOC",
          "colType": "real",
          "role": [
            "suggestedTarget"
          ]
        }
      ],
      "columnsCount": 22
    }
  ]
}