{
  "about": {
    "problemID": "LL0_1451_piechart1_problem",
    "problemName": "LL0_1451_piechart1_problem",
    "problemDescription": "**Author**: Hans Bauer Jesus\",\"Deter Bergman  \n**Source**: Unknown - Date unknown  \n**Please cite**:   \n\npie chart 1",
    "problemSchemaVersion": "4.0.0",
    "problemVersion": "4.0.0",
    "taskKeywords": [
      "classification",
      "binary"
    ]
  },
  "inputs": {
    "data": [
      {
        "datasetID": "LL0_1451_piechart1_dataset",
        "targets": [
          {
            "targetIndex": 0,
            "resID": "learningData",
            "colIndex": 38,
            "colName": "def"
          }
        ]
      }
    ],
    "dataSplits": {
      "method": "holdOut",
      "testSize": 0.2,
      "stratified": true,
      "numRepeats": 0,
      "randomSeed": 42,
      "splitsFile": "dataSplits.csv"
    },
    "performanceMetrics": [
      {
        "metric": "f1Macro"
      }
    ]
  },
  "expectedOutputs": {
    "predictionsFile": "predictions.csv"
  }
}