{
  "about": {
    "problemID": "uu8_posts_1_MIN_METADATA_problem",
    "problemName": "Database problem of type COUNTS_PER_USER",
    "problemSchemaVersion": "4.0.0",
    "problemVersion": "4.0.0",
    "taskKeywords": [
      "regression",
      "multivariate",
      "relational"
    ]
  },
  "inputs": {
    "data": [
      {
        "datasetID": "uu8_posts_1_MIN_METADATA_dataset",
        "targets": [
          {
            "targetIndex": 0,
            "resID": "learningData",
            "colIndex": 2,
            "colName": "posts_count"
          },
          {
            "targetIndex": 1,
            "resID": "learningData",
            "colIndex": 3,
            "colName": "comments_count"
          }
        ]
      }
    ],
    "performanceMetrics": [
      {
        "metric": "rootMeanSquaredError"
      }
    ],
    "dataSplits": {
      "datasetViewMaps": {
        "train": [
          {
            "from": "uu8_posts_1_MIN_METADATA_dataset",
            "to": "uu8_posts_1_MIN_METADATA_dataset_TRAIN"
          }
        ],
        "test": [
          {
            "from": "uu8_posts_1_MIN_METADATA_dataset",
            "to": "uu8_posts_1_MIN_METADATA_dataset_TEST"
          }
        ],
        "score": [
          {
            "from": "uu8_posts_1_MIN_METADATA_dataset",
            "to": "uu8_posts_1_MIN_METADATA_dataset_SCORE"
          }
        ]
      }
    }
  },
  "expectedOutputs": {
    "predictionsFile": "predictions.csv",
    "scoresFile": "scores.csv"
  }
}