{
  "about": {
    "datasetID": "LL0_519_vinnie_dataset",
    "datasetName": "LL0_519_vinnie",
    "description": "**Author**:   \n**Source**: Unknown - Date unknown  \n**Please cite**:   \n\nFollowing are data on the shooting of Vinnie Johnson of the Detroit\nPistons during the 1985-1986 through 1988-1989 seasons. Source was the\nNew York Times.\nThe data are analyzed in the Carnegie Mellon Ph.D. Thesis of\nKate Hsiao and some results are cited in Example 2 of Kass, R.E. and\nRaftery, A.E. (1995), Bayes Factors, J. Amer. Statist. Assoc.,\nThe first column is the year, with 85 indicating 1985-1986, etc..\nThe second column is Field Goals, the third column is Field Goal\nAttempts.\nA more complete version of the data, including free throws, is\nappended together with additional information.\n\n\nInformation about the dataset\nCLASSTYPE: numeric\nCLASSINDEX: none specific",
    "citation": "\n\t\t\t\t@article{OpenML2013,\n\t\t\t\tauthor = {Vanschoren, Joaquin and van Rijn, Jan N. and Bischl, Bernd and Torgo, Luis},\n\t\t\t\ttitle = {OpenML: Networked Science in Machine Learning},\n\t\t\t\tjournal = {SIGKDD Explorations},\n\t\t\t\tvolume = {15},\n\t\t\t\tnumber = {2},\n\t\t\t\tyear = {2013},\n\t\t\t\tpages = {49--60},\n\t\t\t\turl = {http://doi.acm.org/10.1145/2641190.2641198},\n\t\t\t\tdoi = {10.1145/2641190.2641198},\n\t\t\t\tpublisher = {ACM},\n\t\t\t\taddress = {New York, NY, USA},\n\t\t\t\t}",
    "license": "CC-BY license",
    "source": "OpenML",
    "sourceURI": "http://www.openml.org/d/519",
    "approximateSize": "",
    "datasetSchemaVersion": "4.0.0",
    "redacted": false,
    "datasetVersion": "4.0.0",
    "digest": "5cb0a17dadc101ecdf0adf360aec165e09ea2b28f609269f00cc20a21003a5cb"
  },
  "dataResources": [
    {
      "resID": "learningData",
      "resPath": "tables/learningData.csv",
      "resType": "table",
      "resFormat": {
        "text/csv": [
          "csv"
        ]
      },
      "isCollection": false,
      "columns": [
        {
          "colIndex": 0,
          "colName": "d3mIndex",
          "colType": "integer",
          "role": [
            "index"
          ]
        },
        {
          "colIndex": 1,
          "colName": "year",
          "colType": "integer",
          "role": [
            "attribute"
          ]
        },
        {
          "colIndex": 2,
          "colName": "field_goals",
          "colType": "integer",
          "role": [
            "suggestedTarget"
          ]
        },
        {
          "colIndex": 3,
          "colName": "field_goal_attempts",
          "colType": "integer",
          "role": [
            "attribute"
          ]
        }
      ],
      "columnsCount": 4
    }
  ]
}