{
  "about": {
    "problemID": "LL0_721_pwLinear_problem",
    "problemName": "pwLinear_problem",
    "problemDescription": "**Author**:   \n**Source**: Unknown - Date unknown  \n**Please cite**:   \n\nBinarized version of the original data set (see version 1). It converts the numeric target feature to a two-class nominal target feature by computing the mean and classifying all instances with a lower target value as positive ('P') and all others as negative ('N').",
    "problemVersion": "4.0.0",
    "problemSchemaVersion": "4.0.0",
    "taskKeywords": [
      "classification",
      "binary"
    ]
  },
  "inputs": {
    "data": [
      {
        "datasetID": "LL0_721_pwLinear_dataset",
        "targets": [
          {
            "targetIndex": 0,
            "resID": "learningData",
            "colIndex": 11,
            "colName": "binaryClass"
          }
        ]
      }
    ],
    "dataSplits": {
      "method": "holdOut",
      "testSize": 0.2,
      "stratified": true,
      "numRepeats": 0,
      "randomSeed": 42,
      "splitsFile": "dataSplits.csv"
    },
    "performanceMetrics": [
      {
        "metric": "f1Macro"
      }
    ]
  },
  "expectedOutputs": {
    "predictionsFile": "predictions.csv"
  }
}