{
  "about": {
    "problemID": "LL0_1067_kc1_problem",
    "problemName": "LL0_1067_kc1_problem",
    "problemDescription": "**Author**: Mike Chapman, NASA  \n**Source**: [tera-PROMISE](http://openscience.us/repo/defect/mccabehalsted/kc1.html) - 2004  \n**Please cite**: Sayyad Shirabad, J. and Menzies, T.J. (2005) The PROMISE Repository of Software Engineering Databases. School of Information Technology and Engineering, University of Ottawa, Canada.  \n  \n**KC1 Software defect prediction**  \nOne of the NASA Metrics Data Program defect data sets. Data from software for storage management for receiving and processing ground data. Data comes from McCabe and Halstead features extractors of source code.  These features were defined in the 70s in an attempt to objectively characterize code features that are associated with software quality.\n\n### Attribute Information  \n\n1. loc             : numeric % McCabe's line count of code\n2. v(g)            : numeric % McCabe \"cyclomatic complexity\"\n3. ev(g)           : numeric % McCabe \"essential complexity\"\n4. iv(g)           : numeric % McCabe \"design complexity\"\n5. n               : numeric % Halstead total operators + operands\n6. v               : numeric % Halstead \"volume\"\n7. l               : numeric % Halstead \"program length\"\n8. d               : numeric % Halstead \"difficulty\"\n9. i               : numeric % Halstead \"intelligence\"\n10. e               : numeric % Halstead \"effort\"\n11. b               : numeric % Halstead \n12. t               : numeric % Halstead's time estimator\n13. lOCode          : numeric % Halstead's line count\n14. lOComment       : numeric % Halstead's count of lines of comments\n15. lOBlank         : numeric % Halstead's count of blank lines\n16. lOCodeAndComment: numeric\n17. uniq_Op         : numeric % unique operators\n18. uniq_Opnd       : numeric % unique operands\n19. total_Op        : numeric % total operators\n20. total_Opnd      : numeric % total operands\n21. branchCount     : numeric % of the flow graph\n22. problems        : {false,true} % module has/has not one or more reported defects\n\n### Relevant papers  \n\n- Shepperd, M. and Qinbao Song and Zhongbin Sun and Mair, C. (2013)\nData Quality: Some Comments on the NASA Software Defect Datasets, IEEE Transactions on Software Engineering, 39.\n\n- Tim Menzies and Justin S. Di Stefano (2004) How Good is Your Blind Spot Sampling Policy? 2004 IEEE Conference on High Assurance\nSoftware Engineering.\n\n- T. Menzies and J. DiStefano and A. Orrego and R. Chapman (2004) Assessing Predictors of Software Defects\", Workshop on Predictive Software Models, Chicago",
    "problemSchemaVersion": "4.0.0",
    "problemVersion": "4.0.0",
    "taskKeywords": [
      "classification",
      "binary"
    ]
  },
  "inputs": {
    "data": [
      {
        "datasetID": "LL0_1067_kc1_dataset",
        "targets": [
          {
            "targetIndex": 0,
            "resID": "learningData",
            "colIndex": 22,
            "colName": "defects"
          }
        ]
      }
    ],
    "dataSplits": {
      "method": "holdOut",
      "testSize": 0.2,
      "stratified": true,
      "numRepeats": 0,
      "randomSeed": 42,
      "splitsFile": "dataSplits.csv"
    },
    "performanceMetrics": [
      {
        "metric": "f1Macro"
      }
    ]
  },
  "expectedOutputs": {
    "predictionsFile": "predictions.csv"
  }
}