d3mIndex,user_id,post_id,made_comment
0,904,19011,yes
1,1145,7795,no
2,1145,5193,no
3,585,11659,yes
4,634,5115,yes
5,1145,16067,no
6,754,19520,yes
7,1145,2787,no
8,1145,19994,no
9,1145,7648,no
10,1145,5303,no
11,1145,9152,no
12,1145,2308,no
13,1576,9719,yes
14,562,1463,yes
15,292,8983,yes
16,1145,18343,no
17,1145,3444,no
18,459,4947,yes
19,1145,7898,no
20,1333,8983,yes
21,754,18177,yes
22,1145,14450,no
23,1145,3721,no
24,1846,9321,yes
25,462,16658,yes
26,187,14619,yes
27,409,5517,yes
28,1145,7262,no
29,1333,11509,yes
30,1333,17358,yes
31,701,6169,yes
32,1906,14617,yes
33,1145,13634,no
34,1864,11737,yes
35,1145,18936,no
36,1145,3817,no
37,1145,3754,no
38,409,740,yes
39,904,10050,yes
40,1061,14706,yes
41,168,7557,yes
42,1145,1958,no
43,480,1026,yes
44,1145,7423,no
45,1145,16432,no
46,1360,19972,yes
47,90,9929,yes
48,409,9929,yes
49,428,18735,yes
50,1307,17679,yes
51,1737,5818,yes
52,1145,16576,no
53,1680,5796,yes
54,701,17996,yes
55,409,4283,yes
56,1145,14310,no
57,1145,9280,no
58,1145,10499,no
59,1145,1810,no
60,168,15649,yes
61,862,14706,yes
62,606,19962,yes
63,1145,377,no
64,1320,19520,yes
65,1145,2141,no
66,585,1327,yes
67,1206,3541,yes
68,1145,18637,no
69,1145,15511,no
70,409,8592,yes
71,409,15954,yes
72,1145,8201,no
73,1145,3255,no
74,807,1386,yes
75,409,18647,yes
76,1950,14537,yes
77,734,6343,yes
78,1145,17842,no
79,409,5001,yes
80,1528,12748,yes
81,1806,9762,yes
82,237,11737,yes
83,1145,15762,no
84,994,5306,yes
85,1374,11742,yes
86,1758,5517,yes
87,1145,17118,no
88,915,13199,yes
89,1697,4196,yes
90,488,9839,yes
91,1145,2190,no
92,1930,10898,yes
93,1145,1425,no
94,409,9518,yes
95,1145,6330,no
96,614,10539,yes
97,1145,14874,no
98,409,17130,yes
99,1145,9913,no
100,1627,18815,yes
101,292,7713,yes
102,1145,14369,no
103,1706,9125,yes
104,90,2725,yes
105,1145,18709,no
106,1145,15640,no
107,904,12193,yes
108,1145,18563,no
109,1145,15546,no
110,1145,2617,no
111,1145,15057,no
112,1145,8098,no
113,1413,12447,yes
114,1427,10636,yes
115,1145,18805,no
116,1145,11492,no
117,1123,9855,yes
118,1120,14055,yes
119,409,9410,yes
120,1145,9914,no
121,1145,29,no
122,904,6716,yes
123,603,8289,yes
124,409,5278,yes
125,1427,11454,yes
126,1145,11673,no
127,1436,16428,yes
128,1145,7000,no
129,1050,5517,yes
130,1145,515,no
131,904,5079,yes
132,1145,11706,no
133,1065,3654,yes
134,1145,13026,no
135,1145,3544,no
136,479,9929,yes
137,1145,13825,no
138,1145,9044,no
139,629,1777,yes
140,629,16960,yes
141,1145,6197,no
142,409,9758,yes
143,1145,6090,no
144,1145,5235,no
145,585,2114,yes
146,292,11732,yes
147,1145,19545,no
148,904,9285,yes
149,409,2231,yes
150,394,14725,yes
151,1145,8605,no
152,585,3378,yes
153,1333,9261,yes
154,1033,7570,yes
155,1145,6698,no
156,1145,12143,no
157,409,7901,yes
158,1145,19234,no
159,1145,9868,no
160,1145,9369,no
161,1530,18647,yes
162,1145,1191,no
163,1145,1392,no
164,1145,15203,no
165,861,10121,yes
166,352,8785,yes
167,409,10325,yes
168,1445,9929,yes
169,1145,5288,no
170,629,10389,yes
171,1680,2820,yes
172,1145,9466,no
173,603,9779,yes
174,409,9857,yes
175,1145,13585,no
176,1145,978,no
177,1145,3496,no
178,1145,6091,no
179,1145,17580,no
180,292,4560,yes
181,358,1415,yes
182,738,12584,yes
183,1557,5079,yes
184,409,15880,yes
185,1145,9768,no
186,1145,11051,no
187,1145,2168,no
188,409,14663,yes
189,1427,14747,yes
190,90,10222,yes
191,1756,18620,yes
192,1145,14003,no
193,292,9505,yes
194,1145,13213,no
195,1145,10371,no
196,1145,4573,no
197,1145,5604,no
198,1145,3779,no
199,1145,1648,no
200,1145,5476,no
201,1145,14602,no
202,409,4663,yes
203,1145,15326,no
204,1145,10556,no
205,1467,17262,yes
206,955,9024,yes
207,1145,19144,no
208,1145,11372,no
209,1145,2404,no
210,1145,1454,no
211,409,5079,yes
212,1145,5914,no
213,1145,5708,no
214,1145,11577,no
215,1145,5997,no
216,1145,18147,no
217,260,16742,yes
218,1702,16468,yes
219,1145,6232,no
220,1145,15626,no
221,1145,10727,no
222,585,19388,yes
223,457,13518,yes
224,1145,8931,no
225,1333,16035,yes
226,1145,1907,no
227,904,151,yes
228,510,4504,yes
229,1145,662,no
230,1145,9861,no
231,409,11131,yes
232,1145,11445,no
233,1145,11438,no
234,1145,13444,no
235,1145,3858,no
236,1145,9069,no
237,1145,9698,no
238,1145,19760,no
239,1413,7915,yes
240,1145,17974,no
241,1145,5532,no
242,864,569,yes
243,629,11725,yes
244,1145,4071,no
245,1145,269,no
246,1333,16464,yes
247,409,7199,yes
248,1145,2863,no
249,1413,18803,yes
250,834,5990,yes
251,66,18219,yes
252,1145,14212,no
253,585,13625,yes
254,1405,17178,yes
255,1145,716,no
256,1460,7713,yes
257,574,15537,yes
258,1145,17531,no
259,776,4742,yes
260,409,7713,yes
261,1436,15705,yes
262,1145,17030,no
263,409,8159,yes
264,1145,2572,no
265,1145,2620,no
266,1145,4671,no
267,1145,18198,no
268,1145,1572,no
269,1145,1735,no
270,1145,2702,no
271,1145,3873,no
272,1455,14050,yes
273,988,11080,yes
274,754,7713,yes
275,439,12694,yes
276,776,765,yes
277,409,11574,yes
278,1127,2470,yes
279,1458,13303,yes
280,1953,19698,yes
281,114,13506,yes
282,212,5444,yes
283,974,2725,yes
284,1145,12815,no
285,1145,14984,no
286,1145,5308,no
287,1145,4025,no
288,1145,15724,no
289,409,18305,yes
290,1145,10502,no
291,1131,8083,yes
292,904,384,yes
293,1145,4974,no
294,701,17079,yes
295,1145,4675,no
296,1145,3593,no
297,36,12195,yes
298,1145,7374,no
299,1145,17786,no
300,1145,5766,no
301,1145,18868,no
302,1145,15354,no
303,409,5486,yes
304,1501,13834,yes
305,31,14706,yes
306,1145,8376,no
307,754,14893,yes
308,1145,2758,no
309,629,11491,yes
310,1145,16585,no
311,1145,7965,no
312,1145,3326,no
313,1145,7553,no
314,1395,8159,yes
315,1145,8914,no
316,1033,9759,yes
317,1145,1046,no
318,1145,3290,no
319,1145,18207,no
320,168,961,yes
321,1145,16532,no
322,1145,15211,no
323,1145,9359,no
324,1145,4933,no
325,1485,14706,yes
326,409,14994,yes
327,409,5796,yes
328,292,9076,yes
329,1145,4876,no
330,1145,11452,no
331,1145,13793,no
332,1033,18032,yes
333,755,12087,yes
334,1145,10760,no
335,1145,6430,no
336,1145,925,no
337,1145,17766,no
338,1145,343,no
339,1145,692,no
340,1017,7355,yes
341,1208,14055,yes
342,1960,1808,yes
343,488,3505,yes
344,1027,19520,yes
345,1370,5517,yes
346,409,7713,yes
347,1145,11834,no
348,1644,6198,yes
349,1145,19991,no
350,1853,7661,yes
351,1078,6169,yes
352,755,2492,yes
353,1145,3708,no
354,1145,1899,no
355,1145,16802,no
356,1145,3818,no
357,864,2883,yes
358,1145,1322,no
359,1145,2899,no
360,409,3789,yes
361,1145,12052,no
362,582,14363,yes
363,1145,715,no
364,1344,192,yes
365,1370,404,yes
366,1145,18620,no
367,1145,19876,no
368,555,16141,yes
369,1145,14612,no
370,292,1690,yes
371,1037,12486,yes
372,1145,12389,no
373,1486,17077,yes
374,409,1062,yes
375,1145,1504,no
376,1145,10120,no
377,90,11826,yes
378,1145,14980,no
379,1145,12385,no
380,1145,8171,no
381,1145,3598,no
382,1145,8918,no
383,1145,11393,no
384,1033,19520,yes
385,1145,6789,no
386,1145,18000,no
387,1145,18051,no
388,292,13035,yes
389,416,3297,yes
390,1145,8924,no
391,1208,6169,yes
392,1145,15430,no
393,1875,11778,yes
394,409,6422,yes
395,1174,2510,yes
396,873,8159,yes
397,1145,8826,no
398,1510,10298,yes
399,1145,6454,no
400,1145,13583,no
401,1333,13678,yes
402,579,16609,yes
403,1145,11116,no
404,1145,6207,no
405,90,17849,yes
406,1145,7216,no
407,1145,3221,no
408,1145,4406,no
409,1145,17403,no
410,1145,18323,no
411,409,5517,yes
412,1145,4086,no
413,1145,19244,no
414,416,5517,yes
415,1145,2468,no
416,1145,7278,no
417,1145,4312,no
418,1145,237,no
419,1145,1187,no
420,1145,16789,no
421,1732,2629,yes
422,606,13772,yes
423,488,7713,yes
424,19,9819,yes
425,603,11792,yes
426,1145,15814,no
427,1994,4134,yes
428,1939,4591,yes
429,899,15502,yes
430,168,720,yes
431,409,7355,yes
432,1831,4420,yes
433,1145,10007,no
434,1145,4908,no
435,1145,18492,no
436,813,9612,yes
437,1145,6280,no
438,1145,16621,no
439,1145,7943,no
440,1145,6001,no
441,461,4228,yes
442,1145,18823,no
443,1145,5612,no
444,1305,11431,yes
445,409,19520,yes
446,1333,5252,yes
447,409,18724,yes
448,1145,11015,no
449,1333,15649,yes
450,1295,15829,yes
451,1145,1331,no
452,216,15867,yes
453,1048,16609,yes
454,321,14941,yes
455,245,14156,yes
456,1145,19992,no
457,1145,16171,no
458,1145,11394,no
459,1103,10851,yes
460,1145,13622,no
461,1145,16857,no
462,1145,12254,no
463,1145,9358,no
464,1145,19232,no
465,1145,482,no
466,1370,11778,yes
467,1680,16863,yes
468,579,15905,yes
469,1145,10116,no
470,1145,15644,no
471,1145,19892,no
472,409,2066,yes
473,1333,5075,yes
474,736,1877,yes
475,1145,704,no
476,1512,19014,yes
477,1145,7661,no
478,1145,14340,no
479,1145,2295,no
480,1705,10912,yes
481,1145,13085,no
482,1950,8830,yes
483,615,18038,yes
484,1145,4135,no
485,123,13505,yes
486,556,7972,yes
487,1145,6472,no
488,1145,9349,no
489,1896,653,yes
490,409,14163,yes
491,462,9478,yes
492,409,16170,yes
493,1009,16556,yes
494,1145,15333,no
495,1693,6929,yes
496,1246,12053,yes
497,1160,4659,yes
498,1145,2765,no
499,994,9199,yes
500,1145,12568,no
501,462,6120,yes
502,7,15065,yes
503,510,16257,yes
504,720,15880,yes
505,1145,14811,no
506,1145,11245,no
507,1145,2275,no
508,409,8165,yes
509,409,9709,yes
510,1145,10333,no
511,904,12210,yes
512,1145,6962,no
513,207,15053,yes
514,1900,10,yes
515,1145,2181,no
516,1145,17668,no
517,1145,11760,no
518,1264,14032,yes
519,409,9929,yes
520,1021,3327,yes
521,1145,8467,no
522,585,8827,yes
523,1048,16666,yes
524,1145,1698,no
525,292,410,yes
526,409,2712,yes
527,1145,5043,no
528,1145,7306,no
529,782,15214,yes
530,1145,19223,no
531,1145,7938,no
532,1145,6021,no
533,1145,12173,no
534,1888,5975,yes
535,292,17872,yes
536,161,9929,yes
537,1145,3769,no
538,102,14156,yes
539,1145,581,no
540,1145,1709,no
541,1145,2482,no
542,1145,19685,no
543,1145,6706,no
544,1145,1464,no
545,1333,8966,yes
546,1145,10561,no
547,1145,11339,no
548,915,18409,yes
549,441,11528,yes
550,585,13212,yes
551,1145,7243,no
552,611,8159,yes
553,276,6283,yes
554,1531,10784,yes
555,1113,7041,yes
556,1960,18222,yes
557,1145,13773,no
558,1145,10026,no
559,409,9271,yes
560,1145,9437,no
561,1145,184,no
562,409,7570,yes
563,1236,14466,yes
564,409,14091,yes
565,824,3349,yes
566,462,8823,yes
567,409,14196,yes
568,1145,8936,no
569,1145,3327,no
570,1145,16375,no
571,1145,11649,no
572,603,9076,yes
573,1145,18682,no
574,1145,16746,no
575,629,5283,yes
576,1269,6035,yes
577,409,5517,yes
578,1145,18177,no
579,1246,2155,yes
580,409,292,yes
581,536,3378,yes
582,1886,7713,yes
583,409,7363,yes
584,1145,993,no
585,629,10325,yes
586,606,14706,yes
587,292,6169,yes
588,1145,11342,no
589,1145,2811,no
590,629,9929,yes
591,1145,15071,no
592,1145,18694,no
593,1702,10024,yes
594,1145,9922,no
595,904,14147,yes
596,82,11491,yes
597,738,11322,yes
598,1145,6909,no
599,526,8771,yes
600,1145,2773,no
601,904,8758,yes
602,1145,16135,no
603,1145,1097,no
604,26,9929,yes
605,1145,1570,no
606,134,9271,yes
607,1145,8444,no
608,1733,14203,yes
609,754,12755,yes
610,1145,16436,no
611,1145,18847,no
612,1664,12521,yes
613,409,19520,yes
614,1145,2823,no
615,1145,2800,no
616,1145,5140,no
617,487,10263,yes
618,462,2542,yes
619,1024,11778,yes
620,1145,17605,no
621,425,1431,yes
622,409,12060,yes
623,1145,1240,no
624,90,19520,yes
625,1145,12870,no
626,1145,456,no
627,1145,288,no
628,1145,8869,no
629,1145,7248,no
630,1145,6539,no
631,1145,12717,no
632,1145,2779,no
633,292,9929,yes
634,1145,16454,no
635,1145,7121,no
636,1145,7408,no
637,1145,18029,no
638,1145,19521,no
639,409,16504,yes
640,603,13126,yes
641,1145,851,no
642,1145,5499,no
643,1145,13734,no
644,416,9818,yes
645,1145,3590,no
646,1145,5761,no
647,1145,12600,no
648,1333,15558,yes
649,1505,3169,yes
650,409,8044,yes
651,292,16738,yes
652,1145,16928,no
653,1145,19967,no
654,409,5517,yes
655,1145,18877,no
656,1145,16335,no
657,1145,19719,no
658,519,9411,yes
659,1145,17427,no
660,46,9926,yes
661,1891,5396,yes
662,629,4290,yes
663,574,3954,yes
664,1145,16704,no
665,1145,10811,no
666,1967,12271,yes
667,1145,15973,no
668,32,6169,yes
669,1370,18896,yes
670,1145,8443,no
671,1145,1891,no
672,833,6372,yes
673,1145,8834,no
674,409,11778,yes
675,629,3125,yes
676,1413,12864,yes
677,1145,18196,no
678,1145,15375,no
679,1145,489,no
680,1684,7355,yes
681,711,2659,yes
682,1145,2232,no
683,1145,16651,no
684,1953,12357,yes
685,1145,12931,no
686,1422,9929,yes
687,1120,9929,yes
688,1145,14168,no
689,90,11778,yes
690,502,6874,yes
691,1145,19173,no
692,292,11737,yes
693,131,3601,yes
694,1145,6987,no
695,1514,3420,yes
696,1145,19319,no
697,1145,14339,no
698,1145,11935,no
699,1145,1274,no
700,409,4094,yes
701,102,3017,yes
702,754,13039,yes
703,1145,9513,no
704,1145,16852,no
705,1145,15085,no
706,1145,19399,no
707,1145,15568,no
708,1145,13694,no
709,169,13249,yes
710,1413,4809,yes
711,986,4404,yes
712,1781,13253,yes
713,1145,17046,no
714,1145,9961,no
715,1145,13124,no
716,1145,3532,no
717,560,19985,yes
718,1145,4271,no
719,292,12816,yes
720,1145,13382,no
721,233,1386,yes
722,1145,11515,no
723,1728,1965,yes
724,1145,11329,no
725,873,19445,yes
726,1145,11371,no
727,223,18110,yes
728,1033,15824,yes
729,603,6633,yes
730,1145,3045,no
731,1126,17667,yes
732,1145,5822,no
733,1145,7409,no
734,1145,1139,no
735,606,19439,yes
736,1145,4241,no
737,1017,9929,yes
738,1145,1160,no
739,90,2368,yes
740,1145,12284,no
741,1145,17772,no
742,1853,8827,yes
743,1145,18655,no
744,1145,14531,no
745,1145,5418,no
746,1145,15249,no
747,1849,8215,yes
748,1145,4213,no
749,1145,2669,no
750,1145,13597,no
751,1145,7462,no
752,409,12193,yes
753,1145,1834,no
754,1333,3313,yes
755,1145,7977,no
756,1145,11880,no
757,1145,6733,no
758,1145,1070,no
759,1145,5589,no
760,1145,8411,no
761,629,1494,yes
762,1145,7610,no
763,1174,13480,yes
764,1145,7745,no
765,236,6000,yes
766,1145,7047,no
767,579,11778,yes
768,1370,14156,yes
769,585,10389,yes
770,1145,16264,no
771,1145,17122,no
772,1255,11778,yes
773,1201,4551,yes
774,1766,8299,yes
775,740,18852,yes
776,1145,15345,no
777,1145,9587,no
778,1076,8155,yes
779,314,13518,yes
780,1145,15485,no
781,1145,12938,no
782,1145,13107,no
783,1702,6011,yes
784,409,11492,yes
785,1452,17881,yes
786,266,15778,yes
787,614,2195,yes
788,1145,17481,no
789,1145,812,no
790,1145,14660,no
791,1145,10057,no
792,1145,18326,no
793,1145,16490,no
794,1145,1968,no
795,1145,3247,no
796,409,9271,yes
797,1145,11141,no
798,1145,13049,no
799,1145,14344,no
800,1145,12979,no
801,1145,6245,no
802,1145,15943,no
803,1145,1863,no
804,1558,17023,yes
805,1145,11145,no
806,90,9984,yes
807,1145,14804,no
808,754,18375,yes
809,1145,11321,no
810,1145,6084,no
811,1702,450,yes
812,1145,8077,no
813,1145,7885,no
814,1145,9809,no
815,603,11737,yes
816,414,10434,yes
817,18,19530,yes
818,1145,1406,no
819,1145,10709,no
820,409,9929,yes
821,1145,9161,no
822,1145,4124,no
823,1145,18918,no
824,1145,3026,no
825,1145,5228,no
826,1145,3250,no
827,1145,16211,no
828,1145,12973,no
829,1145,13937,no
830,1145,70,no
831,1145,13701,no
832,1324,13037,yes
833,1284,18272,yes
834,1145,9324,no
835,1145,13200,no
836,1145,3085,no
837,49,3505,yes
838,925,4740,yes
839,1145,7443,no
840,409,7661,yes
841,1145,3684,no
842,904,8159,yes
843,994,7820,yes
844,1145,12753,no
845,1145,15722,no
846,1145,6023,no
847,624,13272,yes
848,1145,19915,no
849,409,12495,yes
850,187,16120,yes
851,1873,192,yes
852,1145,15619,no
853,1145,19761,no
854,409,7661,yes
855,1145,12330,no
856,574,8827,yes
857,67,1576,yes
858,1145,11884,no
859,409,9410,yes
860,377,2013,yes
861,1575,3094,yes
862,1145,18945,no
863,409,11942,yes
864,45,17214,yes
865,1145,14147,no
866,90,9169,yes
867,1141,18865,yes
868,1145,2096,no
869,1145,9561,no
870,1145,15205,no
871,1145,9834,no
872,1145,19598,no
873,1145,3358,no
874,409,17157,yes
875,1145,17732,no
876,1145,2491,no
877,1702,1124,yes
878,409,16666,yes
879,1145,4650,no
880,1145,6875,no
881,1145,1463,no
882,1145,18948,no
883,1145,11619,no
884,90,8407,yes
885,1591,7713,yes
886,695,1494,yes
887,1947,797,yes
888,1145,4131,no
889,292,6779,yes
890,416,8159,yes
891,1145,11105,no
892,1208,17553,yes
893,292,16877,yes
894,1145,4724,no
895,756,19985,yes
896,1145,12467,no
897,292,13781,yes
898,603,813,yes
899,1145,3631,no
900,1145,18949,no
901,822,3505,yes
902,1963,550,yes
903,49,19520,yes
904,1891,10485,yes
905,1333,4947,yes
906,880,17745,yes
907,1145,18459,no
908,1720,9929,yes
909,1145,14202,no
910,409,11778,yes
911,409,10391,yes
912,1145,4665,no
913,1145,13252,no
914,409,13853,yes
915,1145,13400,no
916,1145,13264,no
917,1145,19942,no
918,1284,13625,yes
919,1145,8825,no
920,1145,13318,no
921,1145,13712,no
922,1145,2457,no
923,754,15101,yes
924,606,3200,yes
925,409,17217,yes
926,1333,8005,yes
927,1145,4476,no
928,1145,12650,no
929,1145,11466,no
930,1436,16428,yes
931,1145,14491,no
932,1145,5454,no
933,1145,17819,no
934,1174,2342,yes
935,1145,7107,no
936,603,15284,yes
937,1145,19989,no
938,1145,15390,no
939,507,5156,yes
940,1071,1767,yes
941,1757,19520,yes
942,1145,19629,no
943,462,13837,yes
944,241,2725,yes
945,409,3378,yes
946,1015,16985,yes
947,1145,1841,no
948,1702,7444,yes
949,439,17697,yes
950,1145,17712,no
951,701,2510,yes
952,1254,11897,yes
953,1145,17967,no
954,1145,14007,no
955,1145,8725,no
956,667,11320,yes
957,226,19669,yes
958,1145,15563,no
959,1145,18971,no
960,392,4947,yes
961,1944,7288,yes
962,1145,12922,no
963,1145,10395,no
964,1145,6945,no
965,1145,535,no
966,775,6169,yes
967,1847,17950,yes
968,1145,17251,no
969,1145,2160,no
970,928,14079,yes
971,1436,9929,yes
972,1145,14081,no
973,904,11850,yes
974,452,7168,yes
975,1145,12943,no
976,1145,19801,no
977,409,10986,yes
978,1873,7402,yes
979,1145,17335,no
980,1145,14839,no
981,639,5517,yes
982,1145,17347,no
983,1333,4471,yes
984,143,6275,yes
985,1145,13856,no
986,1145,12152,no
987,574,9929,yes
988,1145,3397,no
989,1691,16201,yes
990,409,5459,yes
991,1145,9942,no
992,1145,6814,no
993,884,18298,yes
994,1145,10628,no
995,312,7570,yes
996,1333,13519,yes
997,1145,5009,no
998,1145,8895,no
999,1047,15649,yes
1000,409,8159,yes
1001,563,5328,yes
1002,409,6283,yes
1003,1145,573,no
1004,603,12720,yes
1005,1145,11250,no
1006,1013,6105,yes
1007,1145,13636,no
1008,1360,14156,yes
1009,1145,4399,no
1010,838,14404,yes
1011,1145,11711,no
1012,409,18568,yes
1013,1436,6196,yes
1014,979,3770,yes
1015,959,8159,yes
1016,1628,2071,yes
1017,395,4240,yes
1018,1145,5575,no
1019,1145,5746,no
1020,1247,3942,yes
1021,1145,14583,no
1022,1393,13737,yes
1023,390,7363,yes
1024,409,18222,yes
1025,409,19311,yes
1026,409,14706,yes
1027,409,17093,yes
1028,1401,18148,yes
1029,488,12695,yes
1030,1145,18537,no
1031,1145,8124,no
1032,1145,17378,no
1033,1627,5465,yes
1034,1145,12551,no
1035,1145,18217,no
1036,1145,2246,no
1037,904,14229,yes
1038,409,13226,yes
1039,1145,19689,no
1040,1849,5517,yes
1041,1609,2058,yes
1042,1444,15410,yes
1043,1145,17130,no
1044,1145,289,no
1045,409,4744,yes
1046,693,9929,yes
1047,1768,11955,yes
1048,1145,7927,no
1049,1145,7879,no
1050,1522,7302,yes
1051,1145,10858,no
1052,1145,3729,no
1053,1145,6995,no
1054,1145,2281,no
1055,292,5079,yes
1056,1680,5488,yes
1057,858,16079,yes
1058,1145,5434,no
1059,1145,9289,no
1060,1092,5228,yes
1061,1342,8302,yes
1062,191,2162,yes
1063,1549,11778,yes
1064,1832,9592,yes
1065,1201,18813,yes
1066,409,16629,yes
1067,1145,13300,no
1068,1145,3386,no
1069,1145,12686,no
1070,1145,6538,no
1071,1186,12162,yes
1072,1145,17492,no
1073,1145,13515,no
1074,409,5539,yes
1075,269,15678,yes
1076,1145,7970,no
1077,1145,2038,no
1078,512,7019,yes
1079,1768,14156,yes
1080,1595,544,yes
1081,1145,3539,no
1082,633,9555,yes
1083,1145,9114,no
1084,1145,7318,no
1085,1145,16329,no
1086,1145,87,no
1087,409,6169,yes
1088,1145,16938,no
1089,894,8083,yes
1090,1145,11650,no
1091,904,1212,yes
1092,1346,5934,yes
1093,1145,2971,no
1094,490,9261,yes
1095,1145,2517,no
1096,1145,17505,no
1097,409,4668,yes
1098,409,450,yes
1099,0,7997,yes
1100,1419,1454,yes
1101,409,17298,yes
1102,1145,13620,no
1103,487,14477,yes
1104,1145,19108,no
1105,1145,4183,no
1106,1145,8875,no
1107,934,4181,yes
1108,1033,1494,yes
1109,1145,10382,no
1110,121,1877,yes
1111,1231,10225,yes
1112,1184,7707,yes
1113,66,13272,yes
1114,1145,2680,no
1115,340,5517,yes
1116,1145,1483,no
1117,1145,5799,no
1118,1333,3378,yes
1119,603,5164,yes
1120,168,4010,yes
1121,1145,14547,no
1122,1145,4618,no
1123,1145,10844,no
1124,1145,18594,no
1125,1733,5517,yes
1126,1145,11603,no
1127,409,17358,yes
1128,1145,10249,no
1129,1145,7001,no
1130,1122,18840,yes
1131,1145,14463,no
1132,770,12277,yes
1133,904,16468,yes
1134,1145,16774,no
1135,288,8159,yes
1136,1145,6162,no
1137,1145,12378,no
1138,1145,1168,no
1139,292,19520,yes
1140,1834,7713,yes
1141,1145,15536,no
1142,1145,18737,no
1143,1145,14118,no
1144,1145,17996,no
1145,1618,11211,yes
1146,1145,18922,no
1147,409,4994,yes
1148,1145,15523,no
1149,1145,3073,no
1150,1145,3768,no
1151,1145,11474,no
1152,1145,16736,no
1153,1145,10310,no
1154,1145,14525,no
1155,1145,10364,no
1156,1145,3257,no
1157,1174,6929,yes
1158,1145,17228,no
1159,1145,12696,no
1160,1145,15643,no
1161,1145,6349,no
1162,1145,11682,no
1163,1145,3154,no
1164,292,12028,yes
1165,1145,3926,no
1166,1145,11425,no
1167,1145,15169,no
1168,1145,9166,no
1169,1145,15371,no
1170,585,18620,yes
1171,1333,6169,yes
1172,904,11737,yes
1173,1145,1216,no
1174,1145,5694,no
1175,1033,1685,yes
1176,603,11801,yes
1177,1596,15954,yes
1178,1145,17945,no
1179,1145,10555,no
1180,67,13460,yes
1181,948,14613,yes
1182,1145,9070,no
1183,1145,18036,no
1184,1741,12970,yes
1185,1145,569,no
1186,1145,16149,no
1187,1145,13566,no
1188,1145,2251,no
1189,601,4077,yes
1190,1370,18557,yes
1191,1145,8244,no
1192,409,19520,yes
1193,409,13480,yes
1194,1145,1110,no
1195,1145,16340,no
1196,1702,18231,yes
1197,340,10222,yes
1198,1145,7333,no
1199,1145,991,no
1200,1145,16677,no
1201,1436,8732,yes
1202,1145,12969,no
1203,1145,6044,no
1204,1145,10652,no
1205,1145,13223,no
1206,90,7355,yes
1207,698,281,yes
1208,365,13421,yes
1209,1274,654,yes
1210,292,9929,yes
1211,1145,5281,no
1212,1145,259,no
1213,1145,17709,no
1214,1145,9235,no
1215,1145,3843,no
1216,1145,8151,no
1217,409,5079,yes
1218,1145,1136,no
1219,1145,3639,no
1220,1145,14918,no
1221,32,12775,yes
1222,948,7550,yes
1223,409,9398,yes
1224,343,16738,yes
1225,466,1877,yes
1226,236,18231,yes
1227,1145,19440,no
1228,904,4090,yes
1229,1145,8143,no
1230,1145,17005,no
1231,1436,10108,yes
1232,1284,9988,yes
1233,1145,1692,no
1234,1145,2694,no
1235,1145,4350,no
1236,1145,5172,no
1237,1432,16333,yes
1238,409,4382,yes
1239,1145,17752,no
1240,1145,19365,no
1241,1145,107,no
1242,1145,3062,no
1243,409,6535,yes
1244,1436,13778,yes
1245,603,4955,yes
1246,780,5553,yes
1247,1145,12242,no
1248,292,4903,yes
1249,1145,17149,no
1250,904,8452,yes
1251,409,7653,yes
1252,1702,10043,yes
1253,1145,11853,no
1254,1145,2114,no
1255,754,167,yes
1256,1333,15811,yes
1257,168,12229,yes
1258,1145,4198,no
1259,1145,16127,no
1260,629,18614,yes
1261,292,9929,yes
1262,1145,6801,no
1263,377,5947,yes
1264,1145,15850,no
1265,1160,11737,yes
1266,512,3798,yes
1267,409,17403,yes
1268,629,5517,yes
1269,1145,1573,no
1270,629,6169,yes
1271,409,16089,yes
1272,1680,1998,yes
1273,1145,13188,no
1274,904,585,yes
1275,904,9506,yes
1276,1145,12651,no
1277,1145,13580,no
1278,1960,2827,yes
1279,409,9261,yes
1280,1145,9580,no
1281,658,14448,yes
1282,1048,1363,yes
1283,90,8827,yes
1284,1145,18919,no
1285,1145,18761,no
1286,90,12033,yes
1287,1145,11583,no
1288,1680,8827,yes
1289,1145,6898,no
1290,1145,8193,no
1291,603,11431,yes
1292,1145,11426,no
1293,1033,10785,yes
1294,1145,3001,no
1295,1145,9440,no
1296,1145,16866,no
1297,1145,5629,no
1298,409,13216,yes
1299,1145,2261,no
1300,1145,13775,no
1301,1684,16132,yes
1302,1145,18089,no
1303,1096,12268,yes
1304,292,16331,yes
1305,183,1202,yes
1306,1333,14618,yes
1307,1145,14335,no
1308,343,931,yes
1309,260,12210,yes
1310,1997,1363,yes
1311,1145,8424,no
1312,1145,19821,no
1313,409,18032,yes
1314,1145,15747,no
1315,1145,7836,no
1316,1333,13590,yes
1317,1145,12546,no
1318,1145,8737,no
1319,847,6169,yes
1320,1145,17523,no
1321,1594,14373,yes
1322,1682,19520,yes
1323,738,3378,yes
1324,603,5191,yes
1325,1145,19475,no
1326,1145,14481,no
1327,1452,5559,yes
1328,90,15133,yes
1329,1145,2125,no
1330,1912,9990,yes
1331,1145,16722,no
1332,1145,83,no
1333,1145,10662,no
1334,1145,11776,no
1335,1145,2845,no
1336,1952,2827,yes
1337,1145,210,no
1338,1145,436,no
1339,409,1365,yes
1340,1145,18588,no
1341,1145,4639,no
1342,1145,16225,no
1343,1145,17562,no
1344,1733,6567,yes
1345,70,8159,yes
1346,1145,7659,no
1347,1145,6939,no
1348,1145,17594,no
1349,292,1877,yes
1350,1145,9771,no
1351,94,15501,yes
1352,504,3939,yes
1353,1145,12684,no
1354,873,10874,yes
1355,1145,3505,no
1356,1145,13016,no
1357,662,18779,yes
1358,1145,1154,no
1359,409,9344,yes
1360,1145,19480,no
1361,1145,267,no
1362,1145,10298,no
1363,1145,16880,no
1364,603,11778,yes
1365,1145,7467,no
1366,1145,9932,no
1367,1422,8905,yes
1368,1201,3163,yes
1369,1145,17922,no
1370,1145,10383,no
1371,1145,12875,no
1372,1145,17763,no
1373,1145,4210,no
1374,806,18231,yes
1375,563,6981,yes
1376,409,2725,yes
1377,1145,5613,no
1378,1437,8417,yes
1379,409,6036,yes
1380,1766,10597,yes
1381,428,19063,yes
1382,292,188,yes
1383,914,1386,yes
1384,1145,12375,no
1385,1017,689,yes
1386,615,11737,yes
1387,1145,9000,no
1388,90,11778,yes
1389,1145,8358,no
1390,1145,18301,no
1391,1145,2885,no
1392,1145,12493,no
1393,1418,5328,yes
1394,1145,14315,no
1395,616,1386,yes
1396,979,2881,yes
1397,1145,9608,no
1398,1145,11108,no
1399,1145,10337,no
1400,1145,10790,no
1401,1145,8069,no
1402,1145,17865,no
1403,209,19520,yes
1404,1227,6087,yes
1405,1865,17228,yes
1406,1145,11610,no
1407,409,4233,yes
1408,1145,308,no
1409,1181,13161,yes
1410,1145,14333,no
1411,1145,12978,no
1412,629,9805,yes
1413,1145,8499,no
1414,1887,9022,yes
1415,409,18177,yes
1416,1145,12075,no
1417,1452,8947,yes
1418,168,8827,yes
1419,629,19787,yes
1420,1694,14040,yes
1421,1145,14709,no
1422,585,5825,yes
1423,1145,5507,no
1424,1145,19617,no
1425,1145,6074,no
1426,409,5586,yes
1427,409,15433,yes
1428,1145,10551,no
1429,1145,18513,no
1430,372,890,yes
1431,1145,8051,no
1432,1145,16768,no
1433,1702,10874,yes
1434,1733,7452,yes
1435,1460,6139,yes
1436,1333,19900,yes
1437,754,18851,yes
1438,1145,17077,no
1439,1145,6106,no
1440,1145,9194,no
1441,873,10325,yes
1442,1145,615,no
1443,1615,18517,yes
1444,1413,17098,yes
1445,746,11993,yes
1446,1145,10090,no
1447,1333,1054,yes
1448,1145,13141,no
1449,177,9929,yes
1450,409,9168,yes
1451,1145,8108,no
1452,291,10645,yes
1453,409,19104,yes
1454,1145,8645,no
1455,1145,16686,no
1456,409,17368,yes
1457,90,19660,yes
1458,1695,7661,yes
1459,1145,5388,no
1460,236,5934,yes
1461,1333,9929,yes
1462,292,9929,yes
1463,1145,7153,no
1464,409,5164,yes
1465,1333,10067,yes
1466,84,13452,yes
1467,32,19530,yes
1468,90,11491,yes
1469,1333,12032,yes
1470,743,13915,yes
1471,409,10520,yes
1472,1145,11278,no
1473,1145,15256,no
1474,1145,11824,no
1475,1145,7944,no
1476,1145,5903,no
1477,1145,6895,no
1478,1145,8355,no
1479,1174,1494,yes
1480,967,14554,yes
1481,409,15649,yes
1482,1145,6494,no
1483,1071,16120,yes
1484,1145,10264,no
1485,292,8159,yes
1486,1145,16909,no
1487,1145,9129,no
1488,1145,15242,no
1489,1860,16942,yes
1490,1140,9929,yes
1491,1145,8000,no
1492,1145,7267,no
1493,1145,12615,no
1494,754,3601,yes
1495,409,8305,yes
1496,576,8827,yes
1497,1145,6315,no
1498,1145,6212,no
1499,1145,7632,no
1500,1145,15641,no
1501,1145,10125,no
1502,790,9929,yes
1503,1145,17961,no
1504,1997,7244,yes
1505,1145,4771,no
1506,1145,9900,no
1507,1145,10219,no
1508,754,6361,yes
1509,1145,6409,no
1510,1145,5688,no
1511,1145,2364,no
1512,603,9825,yes
1513,1145,1348,no
1514,394,653,yes
1515,292,1216,yes
1516,1145,10598,no
1517,690,5079,yes
1518,614,6929,yes
1519,1145,4871,no
1520,271,14685,yes
1521,1413,2549,yes
1522,1145,3759,no
1523,1145,13046,no
1524,409,14433,yes
1525,1145,6524,no
1526,1145,14960,no
1527,1625,8159,yes
1528,1145,9880,no
1529,1145,17554,no
1530,597,7570,yes
1531,409,9929,yes
1532,409,6937,yes
1533,409,367,yes
1534,1145,6151,no
1535,1197,9391,yes
1536,409,14963,yes
1537,1333,7234,yes
1538,1145,7779,no
1539,1145,8230,no
1540,1702,5517,yes
1541,1145,1264,no
1542,1145,17522,no
1543,1145,2946,no
1544,1145,12104,no
1545,1145,2427,no
1546,1145,4174,no
1547,1013,9271,yes
1548,754,306,yes
1549,1145,18647,no
1550,1145,5858,no
1551,1145,14722,no
1552,1145,13180,no
1553,1145,10235,no
1554,409,17849,yes
1555,1145,15858,no
1556,1145,11560,no
1557,505,2033,yes
1558,1145,3586,no
1559,409,16331,yes
1560,1490,7939,yes
1561,1145,14088,no
1562,1145,6206,no
1563,1145,16831,no
1564,1145,18307,no
1565,1145,5168,no
1566,808,14055,yes
1567,1145,9139,no
1568,236,16428,yes
1569,1779,6122,yes
1570,1145,11338,no
1571,90,14485,yes
1572,1333,13067,yes
1573,1145,7372,no
1574,1145,3741,no
1575,1145,16744,no
1576,1145,10236,no
1577,409,19520,yes
1578,1680,17387,yes
1579,1145,18130,no
1580,1256,11778,yes
1581,1831,13178,yes
1582,416,12499,yes
1583,1628,3285,yes
1584,1960,18904,yes
1585,585,8794,yes
1586,1145,14489,no
1587,1145,13939,no
1588,1145,15808,no
1589,1675,11560,yes
1590,1617,18231,yes
1591,830,19388,yes
1592,1145,4556,no
1593,1145,13123,no
1594,390,13376,yes
1595,1589,17898,yes
1596,640,10520,yes
1597,1145,7674,no
1598,236,11509,yes
1599,1272,14259,yes
1600,1145,11809,no
1601,1145,5201,no
1602,176,18148,yes
1603,606,10757,yes
1604,1680,7713,yes
1605,1452,14710,yes
1606,1145,16,no
1607,904,7777,yes
1608,1145,9758,no
1609,488,16201,yes
1610,409,12642,yes
1611,1145,12149,no
1612,1231,13837,yes
1613,1145,1066,no
1614,1145,11848,no
1615,1145,18619,no
1616,1145,3190,no
1617,1145,12880,no
1618,242,19641,yes
1619,1145,6498,no
1620,589,18772,yes
1621,1145,540,no
1622,1953,18231,yes
1623,1145,11896,no
1624,409,2820,yes
1625,1145,14500,no
1626,1145,8137,no
1627,1034,5825,yes
1628,1145,7069,no
1629,1136,19390,yes
1630,904,11885,yes
1631,1009,18424,yes
1632,1145,3152,no
1633,1145,12100,no
1634,1145,17111,no
1635,187,15,yes
1636,1145,8231,no
1637,1635,5687,yes
1638,1145,4707,no
1639,1797,6811,yes
1640,1145,14534,no
1641,1145,968,no
1642,409,11629,yes
1643,1333,11994,yes
1644,1145,10270,no
1645,134,11778,yes
1646,1238,11858,yes
1647,377,1442,yes
1648,603,8646,yes
1649,292,14386,yes
1650,1145,10308,no
1651,1145,17249,no
1652,1145,6208,no
1653,1145,3960,no
1654,1145,9068,no
1655,1145,16809,no
1656,1316,16666,yes
1657,409,14849,yes
1658,571,2802,yes
1659,1145,7542,no
1660,904,7288,yes
1661,1145,15972,no
1662,1145,6754,no
1663,1935,3378,yes
1664,994,7851,yes
1665,60,16673,yes
1666,1145,15625,no
1667,1145,9217,no
1668,1145,13615,no
1669,1145,15167,no
1670,1370,16120,yes
1671,409,2691,yes
1672,1145,12662,no
1673,904,16742,yes
1674,462,6169,yes
1675,1145,17460,no
1676,1208,9762,yes
1677,1145,3829,no
1678,168,2834,yes
1679,1145,15975,no
1680,1145,15445,no
1681,292,8980,yes
1682,1145,7572,no
1683,1119,19520,yes
1684,1145,11700,no
1685,672,7713,yes
1686,1108,18465,yes
1687,1145,5555,no
1688,904,11737,yes
1689,409,1494,yes
1690,409,4371,yes
1691,1919,5517,yes
1692,1145,19482,no
1693,1141,8159,yes
1694,1145,12552,no
1695,1145,14484,no
1696,1145,9320,no
1697,701,19783,yes
1698,1145,2518,no
1699,904,17246,yes
1700,629,14156,yes
1701,409,7713,yes
1702,1145,12433,no
1703,1145,15805,no
1704,1145,10846,no
1705,1145,10519,no
1706,1145,7391,no
1707,1145,15245,no
1708,1680,1274,yes
1709,1145,6440,no
1710,168,13529,yes
1711,1333,1875,yes
1712,904,11389,yes
1713,1844,13739,yes
1714,1145,18347,no
1715,608,6932,yes
1716,1182,7661,yes
1717,1145,12107,no
1718,1145,830,no
1719,1145,2788,no
1720,1145,5148,no
1721,409,11335,yes
1722,1145,14436,no
1723,1145,10653,no
1724,409,15501,yes
1725,1374,16942,yes
1726,409,4740,yes
1727,381,383,yes
1728,416,18297,yes
1729,1145,8432,no
1730,1445,5417,yes
1731,1035,19520,yes
1732,1728,7355,yes
1733,292,1301,yes
1734,1145,2505,no
1735,1145,15235,no
1736,1145,19648,no
1737,257,13272,yes
1738,409,13133,yes
1739,715,4418,yes
1740,606,13612,yes
1741,1145,11607,no
1742,1145,7911,no
1743,1145,4498,no
1744,1316,4049,yes
1745,1145,11379,no
1746,1145,16477,no
1747,1145,18277,no
1748,1145,6305,no
1749,1145,12221,no
1750,1115,13126,yes
1751,607,1503,yes
1752,259,14023,yes
1753,1145,3943,no
1754,236,1362,yes
1755,1145,1929,no
1756,1145,14681,no
1757,260,1501,yes
1758,1145,5511,no
1759,409,9076,yes
1760,390,14156,yes
1761,1145,9269,no
1762,1512,9929,yes
1763,1145,16004,no
1764,1680,14430,yes
1765,691,5254,yes
1766,1174,8006,yes
1767,1953,2881,yes
1768,1145,11630,no
1769,970,7713,yes
1770,1893,9929,yes
1771,1698,6224,yes
1772,1145,19935,no
1773,1145,7484,no
1774,1145,8347,no
1775,1145,9505,no
1776,1766,1534,yes
1777,1145,10429,no
1778,829,7713,yes
1779,1333,6179,yes
1780,1145,5932,no
1781,918,11704,yes
1782,1145,652,no
1783,603,7570,yes
1784,428,9929,yes
1785,1589,7713,yes
1786,1627,12039,yes
1787,1478,13968,yes
1788,904,8827,yes
1789,1072,17745,yes
1790,711,4181,yes
1791,1728,6999,yes
1792,491,7661,yes
1793,1145,11128,no
1794,497,10781,yes
1795,409,7195,yes
1796,1145,19512,no
1797,1145,10874,no
1798,1145,8418,no
1799,1918,4947,yes
1800,1145,3099,no
1801,1551,5476,yes
1802,409,11737,yes
1803,1145,10774,no
1804,1378,1701,yes
1805,1333,13253,yes
1806,1145,19160,no
1807,560,4947,yes
1808,693,6914,yes
1809,1017,5079,yes
1810,1970,19879,yes
1811,1145,4337,no
1812,693,10905,yes
1813,1145,1381,no
1814,1140,5517,yes
1815,1145,1856,no
1816,1145,6823,no
1817,1145,6976,no
1818,1145,4474,no
1819,1145,15504,no
1820,861,14055,yes
1821,1680,2952,yes
1822,1145,17448,no
1823,1093,11737,yes
1824,1145,1278,no
1825,1145,408,no
1826,732,10370,yes
1827,1145,12327,no
1828,1184,9973,yes
1829,629,8592,yes
1830,393,5517,yes
1831,1423,19984,yes
1832,1145,11461,no
1833,1145,18462,no
1834,1145,18750,no
1835,1145,401,no
1836,798,1386,yes
1837,1145,17441,no
1838,938,1115,yes
1839,1264,990,yes
1840,1399,19520,yes
1841,848,15280,yes
1842,85,1079,yes
1843,1145,13432,no
1844,1145,1684,no
1845,1333,7825,yes
1846,488,17615,yes
1847,236,525,yes
1848,134,11080,yes
1849,1145,18413,no
1850,409,7355,yes
1851,1401,5517,yes
1852,1565,19698,yes
1853,1225,14601,yes
1854,1075,2957,yes
1855,1145,13295,no
1856,1145,7283,no
1857,647,17224,yes
1858,409,10472,yes
1859,409,5369,yes
1860,1145,7825,no
1861,1645,15183,yes
1862,1145,8564,no
1863,1145,15196,no
1864,1145,4458,no
1865,1145,14985,no
1866,409,15398,yes
1867,1145,15809,no
1868,1145,6725,no
1869,1145,11208,no
1870,1145,7963,no
1871,1145,18168,no
1872,629,2837,yes
1873,1145,4171,no
1874,575,5079,yes
1875,1312,6169,yes
1876,1145,11779,no
1877,1145,13815,no
1878,1436,18072,yes
1879,1006,9427,yes
1880,897,11092,yes
1881,1145,14045,no
1882,1145,19868,no
1883,585,16297,yes
1884,1413,5676,yes
1885,1145,850,no
1886,614,7033,yes
1887,1145,14816,no
1888,546,18592,yes
1889,409,10222,yes
1890,1145,8091,no
1891,488,14433,yes
1892,292,667,yes
1893,1145,2071,no
1894,1145,5158,no
1895,1548,9929,yes
1896,16,9929,yes
1897,1030,1877,yes
1898,1145,17246,no
1899,1145,3654,no
1900,904,7570,yes
1901,1145,2441,no
1902,907,16063,yes
1903,1174,131,yes
1904,82,11595,yes
1905,1145,15532,no
1906,1145,14325,no
1907,1145,14987,no
1908,1145,15183,no
1909,1145,6477,no
1910,1145,200,no
1911,1145,8847,no
1912,236,6376,yes
1913,1221,1047,yes
1914,409,7742,yes
1915,409,5417,yes
1916,603,2332,yes
1917,1514,133,yes
1918,409,1877,yes
1919,629,17729,yes
1920,1333,9813,yes
1921,1145,12154,no
1922,443,11231,yes
1923,428,9269,yes
1924,1409,11172,yes
1925,1145,10595,no
1926,1145,2380,no
1927,1145,12699,no
1928,1145,226,no
1929,1145,15064,no
1930,1145,15151,no
1931,1145,15419,no
1932,1145,17514,no
1933,237,5994,yes
1934,1145,105,no
1935,1928,1312,yes
1936,1145,11508,no
1937,1768,7713,yes
1938,409,1576,yes
1939,1680,19520,yes
1940,585,6994,yes
1941,1557,5052,yes
1942,409,17190,yes
1943,1282,6107,yes
1944,409,4740,yes
1945,1131,11491,yes
1946,574,4240,yes
1947,787,11737,yes
1948,1145,1308,no
1949,409,18647,yes
1950,1145,4750,no
1951,409,7713,yes
1952,409,9929,yes
1953,1316,17331,yes
1954,1145,7253,no
1955,1145,16193,no
1956,1145,13272,no
1957,1145,19268,no
1958,1499,5517,yes
1959,1145,11861,no
1960,1145,14690,no
1961,516,7288,yes
1962,1145,3515,no
1963,90,9929,yes
1964,1145,10418,no
1965,1145,2411,no
1966,409,1116,yes
1967,1145,13798,no
1968,447,2147,yes
1969,1145,71,no
1970,864,4186,yes
1971,1436,3007,yes
1972,511,4193,yes
1973,409,18231,yes
1974,1145,6367,no
1975,1684,9162,yes
1976,574,16201,yes
1977,1145,8977,no
1978,1145,5,no
1979,409,931,yes
1980,1145,4348,no
1981,1145,1036,no
1982,1145,16186,no
1983,1246,6929,yes
1984,1033,17395,yes
1985,1145,14545,no
1986,1145,15325,no
1987,409,17647,yes
1988,409,4186,yes
1989,1145,18878,no
1990,1145,10388,no
1991,1145,12818,no
1992,1145,4663,no
1993,1145,10605,no
1994,1145,3908,no
1995,1145,9186,no
1996,292,4775,yes
1997,1145,7759,no
1998,1427,14480,yes
1999,1145,8860,no
2000,1048,7770,yes
2001,1145,3283,no
2002,1025,11939,yes
2003,652,14115,yes
2004,1145,2092,no
2005,409,2080,yes
2006,90,645,yes
2007,1764,18973,yes
2008,1599,9083,yes
2009,1145,11621,no
2010,296,12356,yes
2011,991,10451,yes
2012,848,18148,yes
2013,557,19176,yes
2014,1145,17039,no
2015,182,16154,yes
2016,1618,19044,yes
2017,1145,9886,no
2018,1395,11835,yes
2019,409,17228,yes
2020,1272,569,yes
2021,1145,3118,no
2022,679,17962,yes
2023,1145,4642,no
2024,1504,17277,yes
2025,1145,7226,no
2026,603,9929,yes
2027,1145,16999,no
2028,1145,16517,no
2029,62,16269,yes
2030,1145,8458,no
2031,1227,18754,yes
2032,1145,2376,no
2033,1145,17126,no
2034,1918,16447,yes
2035,502,19394,yes
2036,1145,10801,no
2037,1145,7586,no
2038,1145,5063,no
2039,1145,16206,no
2040,623,9929,yes
2041,1145,2548,no
2042,1145,2156,no
2043,1145,2959,no
2044,1145,10908,no
2045,1145,19650,no
2046,1333,9929,yes
2047,133,5079,yes
2048,1145,8068,no
2049,1953,18526,yes
2050,1145,1424,no
2051,1333,1117,yes
2052,832,16211,yes
2053,1145,12868,no
2054,1145,6710,no
2055,1145,5622,no
2056,1145,9787,no
2057,1145,10183,no
2058,1145,1532,no
2059,1145,14175,no
2060,1145,19113,no
2061,629,19998,yes
2062,746,2610,yes
2063,1904,1576,yes
2064,1145,16311,no
2065,292,10636,yes
2066,1145,6882,no
2067,1702,14167,yes
2068,90,5517,yes
2069,1145,16486,no
2070,409,3505,yes
2071,90,11823,yes
2072,1145,10937,no
2073,1145,1971,no
2074,1014,7575,yes
2075,1145,1819,no
2076,1145,17442,no
2077,1436,16120,yes
2078,1013,4861,yes
2079,1627,19990,yes
2080,207,11491,yes
2081,409,18647,yes
2082,1620,14398,yes
2083,440,11737,yes
2084,228,2827,yes
2085,409,4181,yes
2086,1145,1391,no
2087,603,7889,yes
2088,1201,18224,yes
2089,409,12126,yes
2090,1145,4783,no
2091,1145,11014,no
2092,1145,16081,no
2093,965,8832,yes
2094,1145,16982,no
2095,1145,12664,no
2096,1333,18805,yes
2097,1145,13799,no
2098,260,19520,yes
2099,1145,1615,no
2100,1370,18939,yes
2101,1145,12283,no
2102,462,6935,yes
2103,720,19342,yes
2104,329,3168,yes
2105,779,9169,yes
2106,1145,10258,no
2107,1333,7661,yes
2108,754,12524,yes
2109,1145,14718,no
2110,1145,9925,no
2111,1145,12737,no
2112,1145,15340,no
2113,1680,11269,yes
2114,603,10552,yes
2115,1145,9720,no
2116,1145,166,no
2117,1145,2996,no
2118,409,9152,yes
2119,904,11247,yes
2120,873,10980,yes
2121,1145,11376,no
2122,409,8394,yes
2123,1145,1126,no
2124,409,5079,yes
2125,1013,6169,yes
2126,1113,10432,yes
2127,292,7661,yes
2128,629,3375,yes
2129,1145,8619,no
2130,292,1877,yes
2131,1145,13633,no
2132,1145,15510,no
2133,1145,18840,no
2134,539,93,yes
2135,1145,2681,no
2136,1145,8179,no
2137,1145,2889,no
2138,1145,2194,no
2139,398,10461,yes
2140,1145,18871,no
2141,1145,17200,no
2142,260,19288,yes
2143,269,9929,yes
2144,1246,7642,yes
2145,885,1768,yes
2146,1684,2060,yes
2147,1145,12713,no
2148,1145,2665,no
2149,1145,14347,no
2150,579,7570,yes
2151,1145,1857,no
2152,603,9331,yes
2153,1145,19954,no
2154,1145,18786,no
2155,1145,4521,no
2156,90,16092,yes
2157,1145,19532,no
2158,1609,16561,yes
2159,1145,5101,no
2160,1145,9510,no
2161,606,6554,yes
2162,629,9321,yes
2163,1145,9928,no
2164,684,12614,yes
2165,1145,8229,no
2166,1145,18624,no
2167,575,5560,yes
2168,1145,16372,no
2169,1145,16248,no
2170,1992,9138,yes
2171,1145,9600,no
2172,1145,8724,no
2173,419,1810,yes
2174,1945,9929,yes
2175,1145,15919,no
2176,904,300,yes
2177,1145,14048,no
2178,91,3939,yes
2179,32,3022,yes
2180,1145,6572,no
2181,1887,1877,yes
2182,1145,19059,no
2183,1145,11722,no
2184,1145,1093,no
2185,292,9238,yes
2186,1145,9795,no
2187,236,16023,yes
2188,1145,3179,no
2189,1145,10584,no
2190,1145,7807,no
2191,800,281,yes
2192,1145,2130,no
2193,1145,11587,no
2194,416,9929,yes
2195,1313,19868,yes
2196,516,9929,yes
2197,409,5228,yes
2198,1145,18336,no
2199,904,1877,yes
2200,1512,16270,yes
2201,677,3750,yes
2202,754,18546,yes
2203,652,2873,yes
2204,1145,5999,no
2205,1274,6169,yes
2206,1073,13739,yes
2207,1056,17308,yes
2208,1733,3160,yes
2209,1145,848,no
2210,1013,9929,yes
2211,1145,3372,no
2212,1145,10372,no
2213,726,4085,yes
2214,1145,7184,no
2215,1364,14706,yes
2216,1145,1592,no
2217,904,15948,yes
2218,1120,9929,yes
2219,409,6718,yes
2220,590,13891,yes
2221,1145,1209,no
2222,1310,11778,yes
2223,1845,11491,yes
2224,1145,13591,no
2225,904,13765,yes
2226,731,8894,yes
2227,904,1553,yes
2228,1767,1870,yes
2229,452,11737,yes
2230,1145,4207,no
2231,292,9705,yes
2232,1145,1564,no
2233,1467,3459,yes
2234,1199,14292,yes
2235,1145,957,no
2236,884,814,yes
2237,409,17578,yes
2238,1145,13903,no
2239,409,12068,yes
2240,1856,11951,yes
2241,603,1929,yes
2242,1145,6238,no
2243,1145,4785,no
2244,1145,16083,no
2245,1145,635,no
2246,1145,11743,no
2247,1145,1836,no
2248,226,9436,yes
2249,409,6707,yes
2250,409,8218,yes
2251,1145,1634,no
2252,716,1494,yes
2253,1145,3228,no
2254,1145,4387,no
2255,1033,3939,yes
2256,1145,8308,no
2257,1145,7442,no
2258,1145,18485,no
2259,292,8159,yes
2260,1145,1928,no
2261,1316,19789,yes
2262,603,7713,yes
2263,1145,10406,no
2264,1199,12694,yes
2265,1145,4550,no
2266,900,1877,yes
2267,270,7355,yes
2268,1043,14156,yes
2269,1145,12011,no
2270,504,6442,yes
2271,1145,17029,no
2272,1560,6007,yes
2273,923,16428,yes
2274,838,18939,yes
2275,1145,2140,no
2276,1145,14512,no
2277,1284,8181,yes
2278,1145,9244,no
2279,200,2881,yes
2280,1145,14793,no
2281,1145,17558,no
2282,904,9896,yes
2283,1145,11608,no
2284,945,8866,yes
2285,1145,5518,no
2286,1145,15247,no
2287,1145,14556,no
2288,904,7355,yes
2289,412,9048,yes
2290,1145,632,no
2291,1145,12977,no
2292,1160,19520,yes
2293,567,294,yes
2294,603,2242,yes
2295,1145,11025,no
2296,1145,17793,no
2297,1371,414,yes
2298,487,18331,yes
2299,1145,13341,no
2300,1145,17560,no
2301,1684,1877,yes
2302,1145,3788,no
2303,995,12170,yes
2304,1145,3503,no
2305,1145,18725,no
2306,1145,14633,no
2307,1145,11979,no
2308,1333,1386,yes
2309,406,13421,yes
2310,1145,14649,no
2311,1145,12845,no
2312,847,16819,yes
2313,1145,5051,no
2314,1145,15161,no
2315,409,18148,yes
2316,1680,11778,yes
2317,117,1386,yes
2318,1145,9133,no
2319,1145,16872,no
2320,1145,5417,no
2321,1145,17633,no
2322,508,9080,yes
2323,1145,3223,no
2324,1145,7224,no
2325,1145,2060,no
2326,1145,6038,no
2327,409,14156,yes
2328,1145,7284,no
2329,1145,6152,no
2330,1145,12023,no
2331,409,14050,yes
2332,409,1624,yes
2333,1145,17920,no
2334,1456,7799,yes
2335,1452,16361,yes
2336,1977,15744,yes
2337,1460,9929,yes
2338,1145,4700,no
2339,1145,14015,no
2340,134,18286,yes
2341,1145,4538,no
2342,1145,2643,no
2343,1394,15811,yes
2344,587,16676,yes
2345,1145,19977,no
2346,1145,4912,no
2347,1145,5285,no
2348,1145,8442,no
2349,603,3954,yes
2350,1145,14705,no
2351,904,5834,yes
2352,1145,4469,no
2353,417,17942,yes
2354,1145,17033,no
2355,1145,6578,no
2356,978,18378,yes
2357,1145,7640,no
2358,1145,1124,no
2359,1145,912,no
2360,904,10070,yes
2361,1960,14156,yes
2362,1145,448,no
2363,1145,8899,no
2364,1145,18648,no
2365,57,39,yes
2366,236,1547,yes
2367,1868,8008,yes
2368,409,931,yes
2369,1145,10485,no
2370,1767,4774,yes
2371,59,19698,yes
2372,1145,16612,no
2373,271,8417,yes
2374,721,12995,yes
2375,603,13452,yes
2376,723,13398,yes
2377,409,8453,yes
2378,1333,18652,yes
2379,606,19520,yes
2380,1955,1494,yes
2381,574,13148,yes
2382,1680,12325,yes
2383,1145,14851,no
2384,1145,8086,no
2385,1145,1895,no
2386,1145,7231,no
2387,1145,5439,no
2388,1145,1752,no
2389,409,10175,yes
2390,1145,4034,no
2391,1145,11269,no
2392,1145,17209,no
2393,1145,10876,no
2394,1145,381,no
2395,1234,14091,yes
2396,409,7355,yes
2397,1145,19462,no
2398,1145,8495,no
2399,1145,9553,no
2400,409,10939,yes
2401,1145,2973,no
2402,1145,3865,no
2403,409,6729,yes
2404,1247,3160,yes
2405,1436,8588,yes
2406,1145,10989,no
2407,1768,5517,yes
2408,1145,16846,no
2409,1145,8837,no
2410,620,8159,yes
2411,1145,7189,no
2412,1145,8685,no
2413,409,19520,yes
2414,1145,2726,no
2415,1145,14869,no
2416,1225,16365,yes
2417,606,3965,yes
2418,1145,15422,no
2419,1145,15108,no
2420,1145,12354,no
2421,409,16331,yes
2422,1208,12961,yes
2423,1145,3297,no
2424,1497,2952,yes
2425,1145,17925,no
2426,1145,16546,no
2427,629,111,yes
2428,1145,7371,no
2429,1145,13867,no
2430,1145,17238,no
2431,292,11163,yes
2432,1145,11954,no
2433,1145,49,no
2434,1145,16919,no
2435,1145,5457,no
2436,1413,8708,yes
2437,1145,2624,no
2438,409,18491,yes
2439,585,1494,yes
2440,1145,5915,no
2441,1089,11778,yes
2442,1145,8020,no
2443,1145,3803,no
2444,1145,7815,no
2445,1145,1007,no
2446,1145,3209,no
2447,1145,18937,no
2448,236,9271,yes
2449,629,16138,yes
2450,1222,3767,yes
2451,1145,8884,no
2452,1333,4058,yes
2453,1145,345,no
2454,66,6704,yes
2455,1793,15652,yes
2456,1145,11537,no
2457,1145,15671,no
2458,1013,9929,yes
2459,409,14313,yes
2460,1733,4947,yes
2461,1145,8242,no
2462,1269,14346,yes
2463,1145,13308,no
2464,1145,13248,no
2465,409,14174,yes
2466,168,10755,yes
2467,1702,9929,yes
2468,1993,9536,yes
2469,1725,19498,yes
2470,1145,2691,no
2471,1145,9691,no
2472,1501,19520,yes
2473,1145,8262,no
2474,904,8945,yes
2475,409,7915,yes
2476,409,14628,yes
2477,5,5517,yes
2478,1145,2225,no
2479,904,5517,yes
2480,1145,15424,no
2481,1145,14063,no
2482,1145,2533,no
2483,1145,13193,no
2484,1145,14947,no
2485,1145,12005,no
2486,701,13834,yes
2487,1145,5828,no
2488,409,1027,yes
2489,1370,3581,yes
2490,1145,135,no
2491,477,6819,yes
2492,1174,442,yes
2493,1145,19062,no
2494,1145,17135,no
2495,1145,9208,no
2496,1145,15944,no
2497,121,5517,yes
2498,1145,10588,no
2499,1145,5349,no
2500,603,10645,yes
2501,1145,12063,no
2502,904,9947,yes
2503,1145,13819,no
2504,1460,16636,yes
2505,1145,3196,no
2506,1996,11523,yes
2507,1145,3453,no
2508,1145,18528,no
2509,1145,15902,no
2510,738,7661,yes
2511,292,12970,yes
2512,1145,5715,no
2513,1145,14802,no
2514,1145,19154,no
2515,1145,8441,no
2516,1145,5078,no
2517,1928,1814,yes
2518,1145,11097,no
2519,1319,9732,yes
2520,1145,6189,no
2521,187,16231,yes
2522,1680,3505,yes
2523,325,83,yes
2524,1333,6343,yes
2525,1145,1317,no
2526,1145,16602,no
2527,1145,1473,no
2528,904,10485,yes
2529,409,14193,yes
2530,911,10546,yes
2531,90,6943,yes
2532,86,695,yes
2533,1145,6102,no
2534,1145,8853,no
2535,603,11029,yes
2536,1145,3171,no
2537,409,8159,yes
2538,1145,8510,no
2539,1440,17912,yes
2540,1145,4413,no
2541,1145,15020,no
2542,1145,7724,no
2543,1145,14132,no
2544,1145,17109,no
2545,1145,15736,no
2546,1145,1335,no
2547,409,6873,yes
2548,1145,11974,no
2549,1145,10500,no
2550,1145,11262,no
2551,1145,13169,no
2552,1145,4493,no
2553,5,1494,yes
2554,409,9846,yes
2555,1145,18958,no
2556,1145,16450,no
2557,1145,63,no
2558,585,6179,yes
2559,1145,12114,no
2560,1145,8682,no
2561,603,3662,yes
2562,629,5247,yes
2563,409,213,yes
2564,1145,17818,no
2565,1145,5306,no
2566,1145,17083,no
2567,1145,7203,no
2568,1145,1057,no
2569,837,9958,yes
2570,1145,17053,no
2571,260,15110,yes
2572,574,18484,yes
2573,1145,11076,no
2574,1290,4358,yes
2575,1145,6364,no
2576,1145,1279,no
2577,168,2578,yes
2578,1145,2494,no
2579,252,14156,yes
2580,1145,8448,no
2581,1145,9987,no
2582,1333,6554,yes
2583,1460,18466,yes
2584,1145,18122,no
2585,1333,19325,yes
2586,409,16742,yes
2587,756,4247,yes
2588,1179,5488,yes
2589,1145,15172,no
2590,1333,6563,yes
2591,1145,5052,no
2592,404,8827,yes
2593,409,60,yes
2594,339,10840,yes
2595,938,9821,yes
2596,1131,18265,yes
2597,1145,7575,no
2598,838,9929,yes
2599,362,12970,yes
2600,903,5517,yes
2601,5,8786,yes
2602,236,9486,yes
2603,1758,16738,yes
2604,1145,13994,no
2605,904,18407,yes
2606,57,0,yes
2607,1145,14677,no
2608,1145,19603,no
2609,409,10100,yes
2610,1145,19647,no
2611,409,8159,yes
2612,1145,4379,no
2613,1145,17530,no
2614,715,9929,yes
2615,1145,14130,no
2616,292,9929,yes
2617,1145,7502,no
2618,1629,17769,yes
2619,563,13522,yes
2620,1145,16387,no
2621,1145,6327,no
2622,629,1421,yes
2623,664,8827,yes
2624,1333,4509,yes
2625,1702,6706,yes
2626,1680,1363,yes
2627,915,1984,yes
2628,1589,10391,yes
2629,1145,5795,no
2630,1145,13092,no
2631,1145,18061,no
2632,1145,12828,no
2633,1145,18362,no
2634,1145,13882,no
2635,1145,7130,no
2636,1242,1933,yes
2637,316,8164,yes
2638,1145,15024,no
2639,430,15919,yes
2640,1145,2933,no
2641,597,11539,yes
2642,1145,13790,no
2643,1265,10716,yes
2644,409,14910,yes
2645,655,19825,yes
2646,1145,11588,no
2647,1145,18659,no
2648,1145,14746,no
2649,1145,2895,no
2650,1145,11185,no
2651,1145,13674,no
2652,629,778,yes
2653,1145,8150,no
2654,1825,14356,yes
2655,1333,13311,yes
2656,1145,12016,no
2657,1333,16613,yes
2658,1145,9487,no
2659,409,19123,yes
2660,1243,9297,yes
2661,1145,15721,no
2662,1147,7288,yes
2663,1680,6169,yes
2664,1217,6278,yes
2665,1710,7713,yes
2666,1145,3740,no
2667,408,19520,yes
2668,409,11778,yes
2669,614,7570,yes
2670,1318,1014,yes
2671,1762,722,yes
2672,1145,10926,no
2673,614,19531,yes
2674,1423,5079,yes
2675,1197,12748,yes
2676,409,19051,yes
2677,1145,18327,no
2678,1145,3237,no
2679,1662,9820,yes
2680,1145,5095,no
2681,873,500,yes
2682,1145,16409,no
2683,1145,18209,no
2684,1145,10702,no
2685,1145,18867,no
2686,1145,15936,no
2687,1044,7713,yes
2688,1411,10645,yes
2689,1145,2514,no
2690,610,3505,yes
2691,1145,12292,no
2692,409,2683,yes
2693,1145,13391,no
2694,1145,3864,no
2695,1250,3347,yes
2696,1145,9885,no
2697,1702,5517,yes
2698,409,1386,yes
2699,1145,10121,no
2700,1174,19906,yes
2701,1145,10738,no
2702,1145,6155,no
2703,1145,17697,no
2704,514,14513,yes
2705,1145,807,no
2706,1663,6198,yes
2707,409,11807,yes
2708,1145,19109,no
2709,1145,14454,no
2710,343,12003,yes
2711,409,8827,yes
2712,236,3888,yes
2713,1199,7713,yes
2714,1145,17476,no
2715,1684,8037,yes
2716,1145,2545,no
2717,148,1877,yes
2718,409,19266,yes
2719,1145,18824,no
2720,1145,15197,no
2721,1145,5780,no
2722,1733,613,yes
2723,462,6320,yes
2724,1145,18559,no
2725,1766,8667,yes
2726,697,8208,yes
2727,409,3068,yes
2728,1145,10334,no
2729,585,16770,yes
2730,409,7794,yes
2731,66,9929,yes
2732,1702,9102,yes
2733,701,2852,yes
2734,1150,4740,yes
2735,1145,6579,no
2736,1145,19332,no
2737,1758,7288,yes
2738,1145,7254,no
2739,516,18198,yes
2740,946,11041,yes
2741,1145,11352,no
2742,409,9929,yes
2743,1145,299,no
2744,1145,17542,no
2745,1145,14953,no
2746,1145,1602,no
2747,1145,2262,no
2748,1145,3657,no
2749,783,788,yes
2750,1145,8922,no
2751,1467,11737,yes
2752,1145,13288,no
2753,1145,10242,no
2754,409,19879,yes
2755,1145,16444,no
2756,1145,14435,no
2757,1145,15688,no
2758,1145,6501,no
2759,737,11080,yes
2760,292,8255,yes
2761,1145,667,no
2762,966,6169,yes
2763,1145,19080,no
2764,1680,9103,yes
2765,1145,17947,no
2766,1145,11731,no
2767,603,1877,yes
2768,1046,19063,yes
2769,1145,6376,no
2770,1712,12158,yes
2771,603,1877,yes
2772,1209,10222,yes
2773,1145,17477,no
2774,1145,4769,no
2775,826,12401,yes
2776,882,12533,yes
2777,738,9929,yes
2778,1145,3573,no
2779,574,2752,yes
2780,1374,18231,yes
2781,1145,14334,no
2782,409,9929,yes
2783,1145,5266,no
2784,1145,11299,no
2785,1145,4546,no
2786,409,2047,yes
2787,579,18700,yes
2788,1145,2436,no
2789,1145,1829,no
2790,1145,15606,no
2791,1145,18210,no
2792,1946,12317,yes
2793,1493,19209,yes
2794,1145,1791,no
2795,933,4358,yes
2796,1172,19520,yes
2797,760,5900,yes
2798,1039,9285,yes
2799,615,1047,yes
2800,141,18280,yes
2801,1145,4435,no
2802,1160,17585,yes
2803,409,2058,yes
2804,1145,2036,no
2805,1084,2829,yes
2806,485,11897,yes
2807,1145,15410,no
2808,1090,3160,yes
2809,1145,2837,no
2810,1145,8354,no
2811,1145,4394,no
2812,1145,18098,no
2813,258,13533,yes
2814,1145,1745,no
2815,1145,17691,no
2816,1231,10579,yes
2817,1145,2950,no
2818,1145,12573,no
2819,34,6843,yes
2820,1145,3268,no
2821,1145,19987,no
2822,1145,5627,no
2823,710,10325,yes
2824,1145,2524,no
2825,1145,10626,no
2826,746,1877,yes
2827,1365,12671,yes
2828,754,11778,yes
2829,236,4208,yes
2830,1145,6848,no
2831,791,12743,yes
2832,409,4740,yes
2833,1145,18167,no
2834,1145,17859,no
2835,1902,18742,yes
2836,1482,17573,yes
2837,1970,402,yes
2838,1145,19130,no
2839,1145,16650,no
2840,1887,1380,yes
2841,1145,1621,no
2842,1532,7713,yes
2843,1806,12782,yes
2844,1145,13017,no
2845,1145,2155,no
2846,292,7248,yes
2847,5,11970,yes
2848,1145,6266,no
2849,585,2719,yes
2850,134,9076,yes
2851,1145,13833,no
2852,1145,6016,no
2853,1238,11534,yes
2854,1333,19528,yes
2855,1145,4936,no
2856,1145,6490,no
2857,965,19617,yes
2858,1145,254,no
2859,1145,6673,no
2860,904,7713,yes
2861,409,6169,yes
2862,652,4927,yes
2863,1145,10480,no
2864,1145,15283,no
2865,1145,6549,no
2866,1145,10107,no
2867,1145,10618,no
2868,1145,16935,no
2869,1145,3229,no
2870,409,6343,yes
2871,904,5517,yes
2872,1820,12166,yes
2873,1227,9793,yes
2874,1145,12074,no
2875,1145,5732,no
2876,1145,15377,no
2877,409,2058,yes
2878,775,15767,yes
2879,1145,16062,no
2880,1145,10410,no
2881,1145,13483,no
2882,1145,16218,no
2883,1333,6169,yes
2884,1145,5391,no
2885,603,16668,yes
2886,1274,3378,yes
2887,1145,1505,no
2888,1145,19990,no
2889,1145,4142,no
2890,1145,757,no
2891,929,18614,yes
2892,530,4007,yes
2893,1013,6237,yes
2894,1145,4007,no
2895,1793,17957,yes
2896,1145,10961,no
2897,1145,14739,no
2898,614,6769,yes
2899,512,7713,yes
2900,1330,19176,yes
2901,904,9504,yes
2902,1145,1831,no
2903,1408,16387,yes
2904,1145,3653,no
2905,90,9471,yes
2906,972,891,yes
2907,1145,12289,no
2908,938,7570,yes
2909,409,9485,yes
2910,1145,14135,no
2911,1145,2042,no
2912,585,17480,yes
2913,1145,10457,no
2914,1887,3774,yes
2915,1145,19489,no
2916,1768,4928,yes
2917,441,2725,yes
2918,409,19573,yes
2919,1145,6684,no
2920,90,16960,yes
2921,1145,12142,no
2922,1145,199,no
2923,1408,6704,yes
2924,90,2301,yes
2925,1145,14016,no
2926,1145,6000,no
2927,1017,8827,yes
2928,1145,4136,no
2929,1145,2678,no
2930,5,10118,yes
2931,1551,9471,yes
2932,1919,3378,yes
2933,765,5517,yes
2934,1145,18258,no
2935,292,8402,yes
2936,1145,18889,no
2937,1434,3814,yes
2938,1468,9929,yes
2939,409,1194,yes
2940,1145,11747,no
2941,699,4740,yes
2942,1648,8880,yes
2943,409,9929,yes
2944,1145,19680,no
2945,1145,15909,no
2946,1145,3415,no
2947,1145,15140,no
2948,1145,18660,no
2949,409,6704,yes
2950,1145,5777,no
2951,1145,13175,no
2952,1145,5309,no
2953,1333,1363,yes
2954,1145,15187,no
2955,237,17102,yes
2956,1333,4947,yes
2957,1145,4926,no
2958,1145,1575,no
2959,1145,12740,no
2960,242,1202,yes
2961,1145,6099,no
2962,629,1386,yes
2963,42,14706,yes
2964,1845,10391,yes
2965,1131,12748,yes
2966,1781,11491,yes
2967,1081,3978,yes
2968,1145,5994,no
2969,1145,2525,no
2970,1145,17236,no
2971,1145,4967,no
2972,942,9231,yes
2973,1444,7221,yes
2974,90,11534,yes
2975,440,5488,yes
2976,603,18582,yes
2977,1145,9429,no
2978,449,4985,yes
2979,409,9929,yes
2980,938,19108,yes
2981,1145,4119,no
2982,1145,8268,no
2983,1145,15259,no
2984,1145,6847,no
2985,1427,15811,yes
2986,1145,17410,no
2987,409,18390,yes
2988,1145,15761,no
2989,199,4947,yes
2990,1766,810,yes
2991,1145,19469,no
2992,1145,16333,no
2993,1392,11737,yes
2994,1145,4095,no
2995,1251,261,yes
2996,324,8803,yes
2997,1145,9823,no
2998,603,6533,yes
2999,427,9708,yes
3000,90,5417,yes
3001,585,9413,yes
3002,904,12193,yes
3003,1333,4054,yes
3004,1333,19063,yes
3005,1436,4747,yes
3006,1145,14569,no
3007,1145,7450,no
3008,1145,9207,no
3009,1718,18097,yes
3010,603,5287,yes
3011,1145,19172,no
3012,1145,15272,no
3013,1680,2827,yes
3014,1145,11822,no
3015,639,12694,yes
3016,1914,17679,yes
3017,1370,9930,yes
3018,409,2852,yes
3019,1307,10632,yes
3020,574,17370,yes
3021,1145,14042,no
3022,614,19856,yes
3023,585,2018,yes
3024,1145,13345,no
3025,1145,7873,no
3026,1145,6643,no
3027,1280,8026,yes
3028,666,7713,yes
3029,90,10284,yes
3030,1145,2542,no
3031,1033,16451,yes
3032,462,14156,yes
3033,409,5826,yes
3034,1174,1683,yes
3035,1401,9076,yes
3036,1814,500,yes
3037,1145,813,no
3038,1145,2415,no
3039,1145,17431,no
3040,1145,18809,no
3041,1145,2474,no
3042,1145,13948,no
3043,1333,18375,yes
3044,1145,7451,no
3045,1912,9974,yes
3046,1145,9585,no
3047,1333,7713,yes
3048,1145,5001,no
3049,1145,3262,no
3050,1145,16469,no
3051,75,8827,yes
3052,1145,13969,no
3053,1145,15447,no
3054,1145,13066,no
3055,1145,1518,no
3056,1887,10571,yes
3057,1145,5800,no
3058,1332,18897,yes
3059,462,9929,yes
3060,1145,16013,no
3061,1441,16738,yes
3062,1145,19607,no
3063,409,8269,yes
3064,1145,11199,no
3065,1145,5820,no
3066,719,14692,yes
3067,1145,9498,no
3068,1011,10704,yes
3069,1145,9683,no
3070,1145,7268,no
3071,409,12796,yes
3072,1663,15812,yes
3073,1016,14417,yes
3074,409,2624,yes
3075,409,16120,yes
3076,1145,8893,no
3077,480,16043,yes
3078,1093,7570,yes
3079,928,7368,yes
3080,1145,664,no
3081,409,19520,yes
3082,606,11910,yes
3083,585,6982,yes
3084,1145,2562,no
3085,1370,14791,yes
3086,1145,18865,no
3087,1145,13383,no
3088,409,4947,yes
3089,645,15022,yes
3090,914,11491,yes
3091,409,12816,yes
3092,409,98,yes
3093,1145,8856,no
3094,1145,2838,no
3095,409,7872,yes
3096,570,13167,yes
3097,647,18168,yes
3098,57,7713,yes
3099,1518,18148,yes
3100,911,16889,yes
3101,1145,16589,no
3102,1145,3044,no
3103,1680,18168,yes
3104,1145,16763,no
3105,1145,8250,no
3106,1145,2564,no
3107,1038,1567,yes
3108,1145,3333,no
3109,1145,12398,no
3110,1488,4444,yes
3111,1640,14485,yes
3112,1680,8159,yes
3113,90,14433,yes
3114,1145,7508,no
3115,1048,4835,yes
3116,1145,1201,no
3117,1145,4440,no
3118,904,8884,yes
3119,1145,17915,no
3120,1145,321,no
3121,236,19090,yes
3122,754,5666,yes
3123,1145,17204,no
3124,1145,17297,no
3125,1145,2687,no
3126,1145,7884,no
3127,409,4413,yes
3128,1145,4083,no
3129,779,11737,yes
3130,1145,3895,no
3131,1505,7050,yes
3132,492,1014,yes
3133,1145,1890,no
3134,1145,13209,no
3135,1145,13336,no
3136,1383,13359,yes
3137,1145,1246,no
3138,647,14910,yes
3139,1145,15233,no
3140,1333,12468,yes
3141,1365,7872,yes
3142,1145,2887,no
3143,1145,15065,no
3144,603,11583,yes
3145,1145,13245,no
3146,1145,3007,no
3147,1807,12109,yes
3148,1145,16834,no
3149,90,5488,yes
3150,1145,12590,no
3151,574,16257,yes
3152,1145,9048,no
3153,1145,7483,no
3154,1702,3958,yes
3155,292,9321,yes
3156,1217,8827,yes
3157,1145,10915,no
3158,1145,19184,no
3159,1145,3761,no
3160,1676,9929,yes
3161,1145,17855,no
3162,754,14433,yes
3163,1436,1079,yes
3164,1768,5205,yes
3165,409,9929,yes
3166,394,13765,yes
3167,1145,11892,no
3168,1145,18064,no
3169,90,2917,yes
3170,1614,2896,yes
3171,1145,14071,no
3172,754,13511,yes
3173,1145,7131,no
3174,444,16650,yes
3175,579,18410,yes
3176,1247,4269,yes
3177,1145,12340,no
3178,1145,17740,no
3179,381,1647,yes
3180,1145,11595,no
3181,1145,18148,no
3182,603,373,yes
3183,363,15442,yes
3184,1760,9579,yes
3185,721,18222,yes
3186,1145,2764,no
3187,409,7570,yes
3188,1145,9542,no
3189,1145,4052,no
3190,1145,1267,no
3191,1394,1387,yes
3192,1145,10180,no
3193,1145,6712,no
3194,665,3219,yes
3195,409,14871,yes
3196,1145,8600,no
3197,1145,19972,no
3198,1145,17826,no
3199,1160,15103,yes
3200,615,11000,yes
3201,1135,4873,yes
3202,1145,7550,no
3203,603,18102,yes
3204,629,1877,yes
3205,409,5703,yes
3206,826,8143,yes
3207,409,1014,yes
3208,1145,8891,no
3209,873,6248,yes
3210,1145,8289,no
3211,1145,1977,no
3212,1145,9737,no
3213,1145,8388,no
3214,624,12680,yes
3215,1551,15878,yes
3216,114,7081,yes
3217,84,6169,yes
3218,1145,11865,no
3219,1145,4011,no
3220,1874,13563,yes
3221,187,9929,yes
3222,1145,18532,no
3223,1145,16289,no
3224,1145,15905,no
3225,1333,500,yes
3226,585,10353,yes
3227,754,15780,yes
3228,1145,8933,no
3229,1145,16126,no
3230,1145,15425,no
3231,1145,7744,no
3232,1145,6653,no
3233,1145,4532,no
3234,1145,16320,no
3235,1145,19210,no
3236,1145,9867,no
3237,1145,18249,no
3238,1333,1791,yes
3239,1145,15791,no
3240,487,9311,yes
3241,236,16120,yes
3242,1145,6691,no
3243,1145,3312,no
3244,1145,18767,no
3245,307,1850,yes
3246,409,4074,yes
3247,233,10092,yes
3248,1145,10332,no
3249,1145,11847,no
3250,409,18681,yes
3251,1145,2655,no
3252,1145,12675,no
3253,1145,14373,no
3254,1145,8073,no
3255,1145,11494,no
3256,1145,8539,no
3257,1145,9778,no
3258,1944,12249,yes
3259,409,18032,yes
3260,409,4208,yes
3261,409,9929,yes
3262,409,19072,yes
3263,409,19439,yes
3264,1145,5213,no
3265,603,4504,yes
3266,574,4090,yes
3267,1182,15694,yes
3268,1710,14156,yes
3269,100,2802,yes
3270,1145,6510,no
3271,1145,12702,no
3272,1145,12695,no
3273,462,6518,yes
3274,409,1854,yes
3275,1145,1694,no
3276,754,7355,yes
3277,1661,14160,yes
3278,1145,1506,no
3279,1460,19096,yes
3280,1145,11070,no
3281,90,11491,yes
3282,724,8462,yes
3283,1013,19530,yes
3284,1145,4499,no
3285,1775,2827,yes
3286,1145,17018,no
3287,1145,8942,no
3288,133,4300,yes
3289,1145,10246,no
3290,1211,907,yes
3291,603,6169,yes
3292,1145,7353,no
3293,1145,182,no
3294,1749,5615,yes
3295,90,10742,yes
3296,682,17312,yes
3297,1145,4918,no
3298,1145,218,no
3299,1145,9776,no
3300,292,15386,yes
3301,1145,6081,no
3302,746,17698,yes
3303,409,807,yes
3304,603,8364,yes
3305,1145,18489,no
3306,1333,16011,yes
3307,1145,8350,no
3308,315,7864,yes
3309,1307,14091,yes
3310,1145,14322,no
3311,603,11737,yes
3312,308,4707,yes
3313,1145,10533,no
3314,1145,14707,no
3315,690,12039,yes
3316,1145,14763,no
3317,904,6424,yes
3318,1145,15097,no
3319,1680,15099,yes
3320,1145,2781,no
3321,1145,16521,no
3322,1145,12219,no
3323,1145,15309,no
3324,1145,19186,no
3325,1220,8239,yes
3326,1145,12228,no
3327,1262,5517,yes
3328,904,14767,yes
3329,904,7738,yes
3330,1160,6179,yes
3331,462,2796,yes
3332,1145,4969,no
3333,1009,1158,yes
3334,409,3603,yes
3335,1145,10004,no
3336,1145,241,no
3337,1145,17300,no
3338,1145,5568,no
3339,409,7661,yes
3340,290,18231,yes
3341,1145,1980,no
3342,1145,13570,no
3343,1145,6924,no
3344,1145,3856,no
3345,1044,12356,yes
3346,1228,14156,yes
3347,1145,17167,no
3348,873,16942,yes
3349,1145,18851,no
3350,1145,2419,no
3351,904,6935,yes
3352,904,12326,yes
3353,1145,1682,no
3354,1145,2174,no
3355,1145,3836,no
3356,1145,18673,no
3357,1145,9530,no
3358,1479,1047,yes
3359,1145,15615,no
3360,1145,11713,no
3361,1145,11894,no
3362,1436,1494,yes
3363,409,182,yes
3364,1134,9929,yes
3365,1145,6175,no
3366,1145,4015,no
3367,1145,3071,no
3368,303,13762,yes
3369,1733,3068,yes
3370,1145,16065,no
3371,1145,3052,no
3372,1145,1305,no
3373,1145,9124,no
3374,293,11737,yes
3375,1145,12438,no
3376,394,10325,yes
3377,1145,17151,no
3378,1145,12948,no
3379,1370,18939,yes
3380,1333,11080,yes
3381,1145,14674,no
3382,1145,5407,no
3383,1145,11679,no
3384,754,962,yes
3385,1684,11737,yes
3386,938,1214,yes
3387,603,406,yes
3388,1145,6670,no
3389,652,16428,yes
3390,1033,1293,yes
3391,1145,14314,no
3392,1680,10406,yes
3393,1145,19543,no
3394,292,8328,yes
3395,585,4740,yes
3396,1044,5325,yes
3397,1145,9204,no
3398,1145,1795,no
3399,409,16108,yes
3400,409,2023,yes
3401,711,5712,yes
3402,1284,9271,yes
3403,381,10859,yes
3404,1145,8649,no
3405,1145,16643,no
3406,1145,2544,no
3407,1145,9484,no
3408,1145,11562,no
3409,409,11778,yes
3410,292,11778,yes
3411,1333,5517,yes
3412,1145,8400,no
3413,1518,52,yes
3414,690,402,yes
3415,754,11016,yes
3416,1145,11231,no
3417,1145,18634,no
3418,1145,11465,no
3419,1145,9755,no
3420,574,18186,yes
3421,1145,11735,no
3422,1145,19970,no
3423,1452,1467,yes
3424,694,16204,yes
3425,1145,4192,no
3426,1145,11665,no
3427,1145,19693,no
3428,603,12474,yes
3429,1145,7082,no
3430,1145,11333,no
3431,1702,16428,yes
3432,1145,8638,no
3433,409,9818,yes
3434,1145,13613,no
3435,1145,9394,no
3436,437,10540,yes
3437,1740,2149,yes
3438,1145,1438,no
3439,1145,4191,no
3440,1145,15,no
3441,409,3660,yes
3442,708,2827,yes
3443,1145,15146,no
3444,1145,18075,no
3445,1145,11422,no
3446,548,876,yes
3447,1145,8060,no
3448,409,1048,yes
3449,615,10858,yes
3450,837,19520,yes
3451,1963,17052,yes
3452,1017,8466,yes
3453,754,16074,yes
3454,1145,12464,no
3455,1145,16363,no
3456,1859,16853,yes
3457,488,6169,yes
3458,1652,6169,yes
3459,1145,14053,no
3460,1145,1380,no
3461,1702,18247,yes
3462,1145,10965,no
3463,743,7307,yes
3464,1333,11835,yes
3465,787,14980,yes
3466,409,3792,yes
3467,1767,5369,yes
3468,1145,8519,no
3469,409,8979,yes
3470,1145,16922,no
3471,1145,9224,no
3472,1145,12894,no
3473,409,7713,yes
3474,1145,13924,no
3475,409,11394,yes
3476,1145,4517,no
3477,1910,12028,yes
3478,634,5560,yes
3479,1048,11778,yes
3480,1944,17344,yes
3481,1145,11403,no
3482,1145,8929,no
3483,340,15964,yes
3484,1702,6396,yes
3485,1145,1578,no
3486,1246,5864,yes
3487,1145,1934,no
3488,1276,15721,yes
3489,1145,17827,no
3490,1154,14262,yes
3491,1333,1494,yes
3492,1145,18370,no
3493,381,5705,yes
3494,1224,10999,yes
3495,1342,10522,yes
3496,1145,5325,no
3497,409,19530,yes
3498,1145,19900,no
3499,390,5517,yes
3500,1145,4420,no
3501,1145,12752,no
3502,1145,18126,no
3503,1145,1782,no
3504,114,14939,yes
3505,1145,14823,no
3506,1333,7713,yes
3507,1145,14604,no
3508,1418,7605,yes
3509,1145,5327,no
3510,409,2845,yes
3511,1333,3177,yes
3512,1145,12380,no
3513,1145,4968,no
3514,603,18159,yes
3515,1145,2292,no
3516,1145,12297,no
3517,1271,4071,yes
3518,409,7713,yes
3519,546,8305,yes
3520,1145,18259,no
3521,1307,877,yes
3522,606,17812,yes
3523,292,18620,yes
3524,1145,8743,no
3525,904,6000,yes
3526,85,8159,yes
3527,1145,9379,no
3528,1145,4772,no
3529,1145,7915,no
3530,1861,14745,yes
3531,1460,1827,yes
3532,1013,8758,yes
3533,1145,17671,no
3534,1145,8189,no
3535,409,7067,yes
3536,403,3593,yes
3537,614,1386,yes
3538,1145,11421,no
3539,1316,14513,yes
3540,409,15558,yes
3541,1145,13443,no
3542,1145,15280,no
3543,1749,9929,yes
3544,1145,7754,no
3545,1145,11256,no
3546,90,3173,yes
3547,1145,16561,no
3548,409,1079,yes
3549,1145,13704,no
3550,428,9331,yes
3551,409,8966,yes
3552,409,10614,yes
3553,1145,17584,no
3554,292,10551,yes
3555,1145,8479,no
3556,1145,9410,no
3557,1145,255,no
3558,409,4911,yes
3559,1145,13495,no
3560,1145,15570,no
3561,603,4659,yes
3562,904,19388,yes
3563,1145,14794,no
3564,1145,15899,no
3565,1145,350,no
3566,1145,8382,no
3567,1145,1190,no
3568,606,2236,yes
3569,409,3840,yes
3570,1333,6327,yes
3571,1145,5921,no
3572,1333,7910,yes
3573,1145,980,no
3574,1145,8867,no
3575,1145,7430,no
3576,904,5634,yes
3577,1773,19520,yes
3578,1145,16142,no
3579,44,16862,yes
3580,409,18508,yes
3581,409,9615,yes
3582,1629,5673,yes
3583,1145,608,no
3584,1145,12989,no
3585,292,12170,yes
3586,1912,8107,yes
3587,1847,4615,yes
3588,738,9286,yes
3589,1145,13762,no
3590,1145,13217,no
3591,1628,17358,yes
3592,409,6211,yes
3593,1044,6944,yes
3594,1145,169,no
3595,1145,589,no
3596,1333,7493,yes
3597,1145,5351,no
3598,1145,9201,no
3599,1145,1030,no
3600,236,9929,yes
3601,1099,9513,yes
3602,1145,1790,no
3603,423,1047,yes
3604,1145,9142,no
3605,1145,5121,no
3606,790,10175,yes
3607,1476,9076,yes
3608,1145,2742,no
3609,409,16808,yes
3610,615,17228,yes
3611,1145,12030,no
3612,738,2605,yes
3613,409,12748,yes
3614,1145,12093,no
3615,56,13376,yes
3616,1145,1803,no
3617,1145,5576,no
3618,32,7355,yes
3619,1145,7581,no
3620,1145,1843,no
3621,1685,1268,yes
3622,67,9818,yes
3623,621,2639,yes
3624,1017,19199,yes
3625,1145,1088,no
3626,1481,722,yes
3627,1212,18031,yes
3628,1898,19879,yes
3629,936,3114,yes
3630,1145,15438,no
3631,1145,13482,no
3632,292,16074,yes
3633,1145,6631,no
3634,1145,13519,no
3635,1145,3502,no
3636,1680,349,yes
3637,1105,8827,yes
3638,1145,17450,no
3639,381,5226,yes
3640,1145,18120,no
3641,168,5517,yes
3642,521,7557,yes
3643,409,16942,yes
3644,1950,11974,yes
3645,409,16666,yes
3646,1145,8407,no
3647,1145,1352,no
3648,1145,43,no
3649,1145,3148,no
3650,448,18347,yes
3651,1333,9929,yes
3652,1145,16000,no
3653,1145,5830,no
3654,701,13272,yes
3655,1145,4301,no
3656,1145,14157,no
3657,1145,13275,no
3658,1698,8157,yes
3659,820,12809,yes
3660,1145,643,no
3661,488,19188,yes
3662,1145,10814,no
3663,236,319,yes
3664,904,13665,yes
3665,1145,7159,no
3666,1145,7776,no
3667,1145,19306,no
3668,1145,10819,no
3669,292,19520,yes
3670,1145,10412,no
3671,409,2422,yes
3672,1160,19091,yes
3673,1145,274,no
3674,120,19388,yes
3675,409,890,yes
3676,838,15176,yes
3677,1145,11681,no
3678,1145,5816,no
3679,1145,19418,no
3680,187,11080,yes
3681,1145,9649,no
3682,1145,18951,no
3683,488,11080,yes
3684,1145,8823,no
3685,1145,9897,no
3686,1422,18818,yes
3687,801,11080,yes
3688,1344,18636,yes
3689,1145,9524,no
3690,1145,11477,no
3691,90,6376,yes
3692,487,1390,yes
3693,1145,4310,no
3694,1447,19978,yes
3695,994,9066,yes
3696,904,325,yes
3697,409,1877,yes
3698,409,12762,yes
3699,629,9929,yes
3700,1145,19477,no
3701,1145,13673,no
3702,1145,4245,no
3703,629,5517,yes
3704,1145,7129,no
3705,1145,5429,no
3706,904,7713,yes
3707,1145,11484,no
3708,1145,10496,no
3709,292,1402,yes
3710,1145,7707,no
3711,1145,10320,no
3712,208,8643,yes
3713,1545,6470,yes
3714,629,19448,yes
3715,1388,9709,yes
3716,1145,5911,no
3717,1145,17527,no
3718,409,11524,yes
3719,1145,3360,no
3720,1145,13,no
3721,904,878,yes
3722,1145,8705,no
3723,1145,18611,no
3724,1341,4947,yes
3725,1013,6958,yes
3726,1145,18764,no
3727,1145,13609,no
3728,585,10485,yes
3729,661,4701,yes
3730,1145,7500,no
3731,292,7119,yes
3732,1145,19790,no
3733,1145,14774,no
3734,1145,19797,no
3735,1427,19520,yes
3736,1333,11240,yes
3737,409,1302,yes
3738,1145,4678,no
3739,1145,591,no
3740,90,2267,yes
3741,1726,19520,yes
3742,1145,6117,no
3743,154,5835,yes
3744,1145,2007,no
3745,1831,4102,yes
3746,1145,1708,no
3747,1145,18406,no
3748,1145,10735,no
3749,1145,10050,no
3750,1145,959,no
3751,701,14156,yes
3752,1145,16864,no
3753,409,17358,yes
3754,1145,1051,no
3755,1145,14312,no
3756,643,8758,yes
3757,1333,8159,yes
3758,409,7355,yes
3759,1145,3003,no
3760,1145,152,no
3761,647,15133,yes
3762,409,12231,yes
3763,1145,9727,no
3764,1952,12210,yes
3765,1145,14402,no
3766,1813,1580,yes
3767,1145,19820,no
3768,1145,339,no
3769,409,4604,yes
3770,1048,6169,yes
3771,1145,8580,no
3772,1145,1395,no
3773,646,6169,yes
3774,830,6388,yes
3775,1145,13858,no
3776,1145,9716,no
3777,1145,4708,no
3778,1547,12273,yes
3779,1145,3233,no
3780,1145,1760,no
3781,701,6248,yes
3782,1408,2231,yes
3783,1608,5517,yes
3784,1145,17647,no
3785,1145,16545,no
3786,840,8827,yes
3787,409,12144,yes
3788,292,9016,yes
3789,409,17233,yes
3790,579,6969,yes
3791,829,8530,yes
3792,899,17282,yes
3793,490,10389,yes
3794,1145,1144,no
3795,1145,10176,no
3796,550,13765,yes
3797,1145,11080,no
3798,1507,6372,yes
3799,1145,12078,no
3800,1145,6546,no
3801,409,3505,yes
3802,30,11877,yes
3803,1145,2636,no
3804,1145,2215,no
3805,1915,15904,yes
3806,1374,7452,yes
3807,1145,18202,no
3808,904,7604,yes
3809,1145,9220,no
3810,1145,3481,no
3811,1145,7269,no
3812,1033,1990,yes
3813,1145,2713,no
3814,409,2275,yes
3815,1145,12310,no
3816,1145,17572,no
3817,1145,19315,no
3818,1145,4692,no
3819,585,10655,yes
3820,1145,842,no
3821,1145,12136,no
3822,1145,16541,no
3823,133,11737,yes
3824,1294,1015,yes
3825,1145,14311,no
3826,1145,18692,no
3827,260,16226,yes
3828,1145,18838,no
3829,1145,17500,no
3830,1145,367,no
3831,1145,19409,no
3832,1145,15971,no
3833,260,19852,yes
3834,1145,14043,no
3835,1145,18250,no
3836,1766,5517,yes
3837,1767,13057,yes
3838,1145,4710,no
3839,1145,10707,no
3840,1145,4859,no
3841,787,6248,yes
3842,490,3378,yes
3843,409,944,yes
3844,1145,9676,no
3845,90,1386,yes
3846,1424,10714,yes
3847,1145,14086,no
3848,1145,5220,no
3849,1145,16063,no
3850,1370,13717,yes
3851,1145,18278,no
3852,1145,14305,no
3853,614,11737,yes
3854,1145,14522,no
3855,1145,999,no
3856,1680,9818,yes
3857,1145,14928,no
3858,1145,1228,no
3859,1145,17388,no
3860,1561,17701,yes
3861,1247,18520,yes
3862,1145,15782,no
3863,1145,13817,no
3864,1145,1700,no
3865,428,9929,yes
3866,409,7713,yes
3867,603,7345,yes
3868,1145,9784,no
3869,1145,4655,no
3870,1145,7454,no
3871,1145,15702,no
3872,1333,6000,yes
3873,1145,17402,no
3874,409,14156,yes
3875,1145,6282,no
3876,904,11108,yes
3877,1645,16967,yes
3878,1145,1332,no
3879,1849,18068,yes
3880,1896,9147,yes
3881,1815,16400,yes
3882,1145,8979,no
3883,409,7265,yes
3884,1518,14706,yes
3885,1145,9894,no
3886,673,15041,yes
3887,1145,11343,no
3888,553,13999,yes
3889,1853,13522,yes
3890,1758,12374,yes
3891,416,13327,yes
3892,1145,5248,no
3893,409,14091,yes
3894,1960,2854,yes
3895,1917,10024,yes
3896,1011,9818,yes
3897,225,9929,yes
3898,1145,11781,no
3899,1033,7742,yes
3900,1145,5641,no
3901,1145,4803,no
3902,409,1121,yes
3903,1145,15913,no
3904,1145,7830,no
3905,1145,4589,no
3906,269,17026,yes
3907,1145,12848,no
3908,1145,5519,no
3909,904,4854,yes
3910,44,8581,yes
3911,1145,17312,no
3912,1247,3820,yes
3913,1145,9512,no
3914,409,1494,yes
3915,1145,5355,no
3916,1145,5342,no
3917,236,5580,yes
3918,1145,7964,no
3919,1145,14112,no
3920,1284,7598,yes
3921,272,9152,yes
3922,1963,16560,yes
3923,1201,4947,yes
3924,1145,13291,no
3925,904,4201,yes
3926,31,4475,yes
3927,1955,4283,yes
3928,1145,12148,no
3929,1145,13404,no
3930,1145,12801,no
3931,488,7355,yes
3932,1145,2991,no
3933,1145,9845,no
3934,122,15254,yes
3935,1145,8661,no
3936,603,19520,yes
3937,1352,16563,yes
3938,1145,5258,no
3939,863,9929,yes
3940,168,6523,yes
3941,1145,13523,no
3942,1145,14958,no
3943,904,6952,yes
3944,1145,2836,no
3945,409,3954,yes
3946,1017,13452,yes
3947,904,4889,yes
3948,541,5049,yes
3949,1145,15774,no
3950,936,12128,yes
3951,1145,14731,no
3952,1145,11854,no
3953,1145,13351,no
3954,928,428,yes
3955,1145,16944,no
3956,292,14316,yes
3957,1145,5700,no
3958,603,14080,yes
3959,1145,13710,no
3960,409,18222,yes
3961,409,11491,yes
3962,904,9818,yes
3963,1145,5010,no
3964,1145,190,no
3965,1145,870,no
3966,1145,11106,no
3967,415,1116,yes
3968,1227,15878,yes
3969,1145,2164,no
3970,1145,7812,no
3971,1749,14091,yes
3972,1145,1087,no
3973,468,4283,yes
3974,1145,8224,no
3975,1812,7799,yes
3976,409,189,yes
3977,711,5517,yes
3978,292,9173,yes
3979,1548,10276,yes
3980,1145,16145,no
3981,1370,1828,yes
3982,1145,15015,no
3983,409,5488,yes
3984,1145,5885,no
3985,1145,14033,no
3986,1145,12479,no
3987,1655,6169,yes
3988,394,5079,yes
3989,1694,16343,yes
3990,1145,3594,no
3991,1145,13836,no
3992,245,18758,yes
3993,1145,425,no
3994,821,19449,yes
3995,1145,175,no
3996,1145,8644,no
3997,1145,5337,no
3998,1145,16635,no
3999,1145,14232,no
