{
  "about": {
    "datasetID": "LL0_188_eucalyptus_dataset",
    "datasetName": "LL0_188_eucalyptus",
    "description": "**Author**: Bruce Bulloch  \n**Source**: [WEKA Dataset Collection](http://www.cs.waikato.ac.nz/ml/weka/datasets.html) - part of the agridatasets archive.  \n**Please cite**:   \n\n**Eucalyptus Soil Conservation**  \nThe objective was to determine which seedlots in a species are best for soil conservation in seasonally dry hill country. Determination is found by measurement of height, diameter by height, survival, and other contributing factors. \n \nIt is important to note that eucalypt trial methods changed over time; earlier trials included mostly 15 - 30cm tall seedling grown in peat plots and the later trials have included mostly three replications of eight trees grown. This change may contribute to less significant results.\n\nExperimental data recording procedures which require noting include:\n - instances with no data recorded due to experimental recording procedures\n   require that the absence of a species from one replicate at a site was\n   treated as a missing value, but if absent from two or more replicates at a\n   site the species was excluded from the site's analyses.\n - missing data for survival, vigour, insect resistance, stem form, crown form\n   and utility especially for the data recorded at the Morea Station; this \n   could indicate the death of species in these areas or a lack in collection\n   of data.  \n\n### Attribute Information  \n \n  1.  Abbrev - site abbreviation - enumerated\n  2.  Rep - site rep - integer\n  3.  Locality - site locality in the North Island - enumerated\n  4.  Map_Ref - map location in the North Island - enumerated\n  5.  Latitude - latitude approximation - enumerated\n  6.  Altitude - altitude approximation - integer\n  7.  Rainfall - rainfall (mm pa) - integer\n  8.  Frosts - frosts (deg. c) - integer\n  9.  Year - year of planting - integer\n  10. Sp - species code - enumerated\n  11. PMCno - seedlot number - integer\n  12. DBH - best diameter base height (cm) - real\n  13. Ht - height (m) - real\n  14. Surv - survival - integer\n  15. Vig - vigour - real\n  16. Ins_res - insect resistance - real\n  17. Stem_Fm - stem form - real\n  18. Crown_Fm - crown form - real\n  19. Brnch_Fm - branch form - real\n  Class:\n  20. Utility - utility rating - enumerated\n\n### Relevant papers\n\nBulluch B. T., (1992) Eucalyptus Species Selection for Soil Conservation in Seasonally Dry Hill Country - Twelfth Year Assessment  New Zealand Journal of Forestry Science 21(1): 10 - 31 (1991)  \n\nKirsten Thomson and Robert J. McQueen (1996) Machine Learning Applied to Fourteen Agricultural Datasets. University of Waikato Research Report  \nhttps://www.cs.waikato.ac.nz/ml/publications/1996/Thomson-McQueen-96.pdf + the original publication:",
    "citation": "\n\t\t\t\t@article{OpenML2013,\n\t\t\t\tauthor = {Vanschoren, Joaquin and van Rijn, Jan N. and Bischl, Bernd and Torgo, Luis},\n\t\t\t\ttitle = {OpenML: Networked Science in Machine Learning},\n\t\t\t\tjournal = {SIGKDD Explorations},\n\t\t\t\tvolume = {15},\n\t\t\t\tnumber = {2},\n\t\t\t\tyear = {2013},\n\t\t\t\tpages = {49--60},\n\t\t\t\turl = {http://doi.acm.org/10.1145/2641190.2641198},\n\t\t\t\tdoi = {10.1145/2641190.2641198},\n\t\t\t\tpublisher = {ACM},\n\t\t\t\taddress = {New York, NY, USA},\n\t\t\t\t}",
    "license": "CC-BY license",
    "source": "OpenML",
    "sourceURI": "http://www.openml.org/d/188",
    "approximateSize": "",
    "datasetSchemaVersion": "4.0.0",
    "redacted": false,
    "datasetVersion": "4.0.0",
    "digest": "4129b725c4ef166a6390562886933bb5c166678f344f7ac937899edebe0a1e31"
  },
  "dataResources": [
    {
      "resID": "learningData",
      "resPath": "tables/learningData.csv",
      "resType": "table",
      "resFormat": {
        "text/csv": [
          "csv"
        ]
      },
      "isCollection": false,
      "columns": [
        {
          "colIndex": 0,
          "colName": "d3mIndex",
          "colType": "integer",
          "role": [
            "index"
          ]
        },
        {
          "colIndex": 1,
          "colName": "Abbrev",
          "colType": "categorical",
          "role": [
            "attribute"
          ]
        },
        {
          "colIndex": 2,
          "colName": "Rep",
          "colType": "real",
          "role": [
            "attribute"
          ]
        },
        {
          "colIndex": 3,
          "colName": "Locality",
          "colType": "categorical",
          "role": [
            "attribute"
          ]
        },
        {
          "colIndex": 4,
          "colName": "Map_Ref",
          "colType": "categorical",
          "role": [
            "attribute"
          ]
        },
        {
          "colIndex": 5,
          "colName": "Latitude",
          "colType": "categorical",
          "role": [
            "attribute"
          ]
        },
        {
          "colIndex": 6,
          "colName": "Altitude",
          "colType": "real",
          "role": [
            "attribute"
          ]
        },
        {
          "colIndex": 7,
          "colName": "Rainfall",
          "colType": "real",
          "role": [
            "attribute"
          ]
        },
        {
          "colIndex": 8,
          "colName": "Frosts",
          "colType": "real",
          "role": [
            "attribute"
          ]
        },
        {
          "colIndex": 9,
          "colName": "Year",
          "colType": "real",
          "role": [
            "attribute"
          ]
        },
        {
          "colIndex": 10,
          "colName": "Sp",
          "colType": "categorical",
          "role": [
            "attribute"
          ]
        },
        {
          "colIndex": 11,
          "colName": "PMCno",
          "colType": "real",
          "role": [
            "attribute"
          ]
        },
        {
          "colIndex": 12,
          "colName": "DBH",
          "colType": "real",
          "role": [
            "attribute"
          ]
        },
        {
          "colIndex": 13,
          "colName": "Ht",
          "colType": "real",
          "role": [
            "attribute"
          ]
        },
        {
          "colIndex": 14,
          "colName": "Surv",
          "colType": "real",
          "role": [
            "attribute"
          ]
        },
        {
          "colIndex": 15,
          "colName": "Vig",
          "colType": "real",
          "role": [
            "attribute"
          ]
        },
        {
          "colIndex": 16,
          "colName": "Ins_res",
          "colType": "real",
          "role": [
            "attribute"
          ]
        },
        {
          "colIndex": 17,
          "colName": "Stem_Fm",
          "colType": "real",
          "role": [
            "attribute"
          ]
        },
        {
          "colIndex": 18,
          "colName": "Crown_Fm",
          "colType": "real",
          "role": [
            "attribute"
          ]
        },
        {
          "colIndex": 19,
          "colName": "Brnch_Fm",
          "colType": "real",
          "role": [
            "attribute"
          ]
        },
        {
          "colIndex": 20,
          "colName": "Utility",
          "colType": "categorical",
          "role": [
            "suggestedTarget"
          ]
        }
      ],
      "columnsCount": 21
    }
  ]
}