{
  "about": {
    "datasetID": "LL0_1524_vertebra_column_dataset",
    "datasetName": "LL0_1524_vertebra_column",
    "description": "**Author**: Guilherme de Alencar Barreto, Ajalmar R. da Rocha Neto, Henrique Antonio Fonseca da Mota Filho       \n**Source**: [original](http://www.openml.org/d/1523) - UCI   \n**Please cite**:   \n\n* Dataset Title: Vertebra Column - 2 classes\n\n* Abstract:   \nData set containing values for six biomechanical features used to classify orthopaedic patients into 3 classes (normal, disk hernia or spondilolysthesis) or 2 classes (normal or abnormal).\n\n* Source:\n\nGuilherme de Alencar Barreto (guilherme '@' deti.ufc.br) & Ajalmar R. da Rocha Neto (ajalmar '@' ifce.edu.br), Department of Teleinformatics Engineering, Federal University of Ceará, Fortaleza, Ceará, Brazil. \n\nHenrique Antonio Fonseca da Mota Filho (hdamota '@' gmail.com), Hospital Monte Klinikum, Fortaleza, Ceará, Brazil.\n\n\n* Data Set Information:\n\nBiomedical data set built by Dr. Henrique da Mota during a medical residence period in the Group of Applied Research in Orthopaedics (GARO) of the Centre Médico-Chirurgical de Réadaptation des Massues, Lyon, France. The data have been organized in two different but related classification tasks. The first task consists in classifying patients as belonging to one out of three categories: Normal (100 patients), Disk Hernia (60 patients) or Spondylolisthesis (150 patients). For the second task, the categories Disk Hernia and Spondylolisthesis were merged into a single category labelled as 'abnormal'. Thus, the second task consists in classifying patients as belonging to one out of two categories: Normal (100 patients) or Abnormal (210 patients). We provide files also for use within the WEKA environment.\n\n\n* Attribute Information:\n\nEach patient is represented in the data set by six biomechanical attributes derived from the shape and orientation of the pelvis and lumbar spine (in this order): pelvic incidence, pelvic tilt, lumbar lordosis angle, sacral slope, pelvic radius and grade of spondylolisthesis. The following convention is used for the class labels: DH (Disk Hernia), Spondylolisthesis (SL), Normal (NO) and Abnormal (AB).\n\n\n* Relevant Papers:\n\n(1) Berthonnaud, E., Dimnet, J., Roussouly, P. & Labelle, H. (2005). 'Analysis of the sagittal balance of the spine and pelvis using shape and orientation parameters', Journal of Spinal Disorders & Techniques, 18(1):40â€“47. \n\n(2) Rocha Neto, A. R. & Barreto, G. A. (2009). 'On the Application of Ensembles of Classifiers to the Diagnosis of Pathologies of the Vertebral Column: A Comparative Analysis', IEEE Latin America Transactions, 7(4):487-496. \n\n(3) Rocha Neto, A. R., Sousa, R., Barreto, G. A. & Cardoso, J. S. (2011). 'Diagnostic of Pathology on the Vertebral Column with Embedded Reject Optionâ€, Proceedings of the 5th Iberian Conference on Pattern Recognition and Image Analysis (IbPRIA'2011), Gran Canaria, Spain, Lecture Notes on Computer Science, vol. 6669, p. 588-595.",
    "citation": "\n\t\t\t\t@article{OpenML2013,\n\t\t\t\tauthor = {Vanschoren, Joaquin and van Rijn, Jan N. and Bischl, Bernd and Torgo, Luis},\n\t\t\t\ttitle = {OpenML: Networked Science in Machine Learning},\n\t\t\t\tjournal = {SIGKDD Explorations},\n\t\t\t\tvolume = {15},\n\t\t\t\tnumber = {2},\n\t\t\t\tyear = {2013},\n\t\t\t\tpages = {49--60},\n\t\t\t\turl = {http://doi.acm.org/10.1145/2641190.2641198},\n\t\t\t\tdoi = {10.1145/2641190.2641198},\n\t\t\t\tpublisher = {ACM},\n\t\t\t\taddress = {New York, NY, USA},\n\t\t\t\t}",
    "license": "CC-BY license",
    "source": "OpenML",
    "sourceURI": "http://www.openml.org/d/1524",
    "approximateSize": "",
    "datasetSchemaVersion": "4.0.0",
    "redacted": false,
    "datasetVersion": "4.0.0",
    "digest": "5126754794b53a244bec110e36d49bc2ef207b2e4f121a04f455b7896c6df703"
  },
  "dataResources": [
    {
      "resID": "learningData",
      "resPath": "tables/learningData.csv",
      "resType": "table",
      "resFormat": {
        "text/csv": [
          "csv"
        ]
      },
      "isCollection": false,
      "columns": [
        {
          "colIndex": 0,
          "colName": "d3mIndex",
          "colType": "integer",
          "role": [
            "index"
          ]
        },
        {
          "colIndex": 1,
          "colName": "V1",
          "colType": "real",
          "role": [
            "attribute"
          ]
        },
        {
          "colIndex": 2,
          "colName": "V2",
          "colType": "real",
          "role": [
            "attribute"
          ]
        },
        {
          "colIndex": 3,
          "colName": "V3",
          "colType": "real",
          "role": [
            "attribute"
          ]
        },
        {
          "colIndex": 4,
          "colName": "V4",
          "colType": "real",
          "role": [
            "attribute"
          ]
        },
        {
          "colIndex": 5,
          "colName": "V5",
          "colType": "real",
          "role": [
            "attribute"
          ]
        },
        {
          "colIndex": 6,
          "colName": "V6",
          "colType": "real",
          "role": [
            "attribute"
          ]
        },
        {
          "colIndex": 7,
          "colName": "Class",
          "colType": "categorical",
          "role": [
            "suggestedTarget"
          ]
        }
      ],
      "columnsCount": 8
    }
  ]
}