{
  "about": {
    "datasetID": "LL0_450_analcatdata_lawsuit_dataset",
    "datasetName": "analcatdata_lawsuit",
    "description": "**Author**:   \n**Source**: Unknown - Date unknown  \n**Please cite**:   \n\nanalcatdata    A collection of data sets used in the book \"Analyzing Categorical Data,\"\nby Jeffrey S. Simonoff, Springer-Verlag, New York, 2003. The submission\nconsists of a zip file containing two versions of each of 84 data sets,\nplus this README file. Each data set is given in comma-delimited ASCII\n(.csv) form, and Microsoft Excel (.xls) form.\n\nNOTICE: These data sets may be used freely for scientific, educational and/or\nnoncommercial purposes, provided suitable acknowledgment is given (by citing\nthe above-named reference).\n\nFurther details concerning the book, including information on statistical software\n(including sample S-PLUS/R and SAS code), are available at the web site\n\nhttp://www.stern.nyu.edu/~jsimonof/AnalCatData\n\n\nInformation about the dataset\nCLASSTYPE: nominal\nCLASSINDEX: last\n\n\nNote: Quotes, Single-Quotes and Backslashes were removed, Blanks replaced\nwith Underscores",
    "citation": "\n\t\t\t\t@article{OpenML2013,\n\t\t\t\tauthor = {Vanschoren, Joaquin and van Rijn, Jan N. and Bischl, Bernd and Torgo, Luis},\n\t\t\t\ttitle = {OpenML: Networked Science in Machine Learning},\n\t\t\t\tjournal = {SIGKDD Explorations},\n\t\t\t\tvolume = {15},\n\t\t\t\tnumber = {2},\n\t\t\t\tyear = {2013},\n\t\t\t\tpages = {49--60},\n\t\t\t\turl = {http://doi.acm.org/10.1145/2641190.2641198},\n\t\t\t\tdoi = {10.1145/2641190.2641198},\n\t\t\t\tpublisher = {ACM},\n\t\t\t\taddress = {New York, NY, USA},\n\t\t\t\t}",
    "license": "CC-BY license",
    "source": "OpenML",
    "sourceURI": "http://www.openml.org/d/450",
    "approximateSize": "",
    "datasetVersion": "4.0.0",
    "datasetSchemaVersion": "4.0.0",
    "redacted": false,
    "digest": "1b080cde65578888cd2905638653fe060d436139d3ffc76a655ad36ee05b95c5"
  },
  "dataResources": [
    {
      "resID": "learningData",
      "resPath": "tables/learningData.csv",
      "resType": "table",
      "resFormat": {
        "text/csv": [
          "csv"
        ]
      },
      "isCollection": false,
      "columns": [
        {
          "colIndex": 0,
          "colName": "d3mIndex",
          "colType": "integer",
          "role": [
            "index"
          ]
        },
        {
          "colIndex": 1,
          "colName": "Length.of.service",
          "colType": "real",
          "role": [
            "attribute"
          ]
        },
        {
          "colIndex": 2,
          "colName": "CAP",
          "colType": "integer",
          "role": [
            "attribute"
          ]
        },
        {
          "colIndex": 3,
          "colName": "PA.normalized",
          "colType": "real",
          "role": [
            "attribute"
          ]
        },
        {
          "colIndex": 4,
          "colName": "Minority",
          "colType": "categorical",
          "role": [
            "attribute"
          ]
        },
        {
          "colIndex": 5,
          "colName": "Laid.off",
          "colType": "categorical",
          "role": [
            "suggestedTarget"
          ]
        }
      ],
      "columnsCount": 6
    }
  ]
}