{
  "about": {
    "problemID": "LL0_1435_fourclass_problem",
    "problemName": "fourclass_problem",
    "problemDescription": "**Author**: Tin Kam Ho and Eugene M. Kleinberg.  \n**Source**: [original](http://www.csie.ntu.edu.tw/~cjlin/libsvmtools/datasets/binary.html) - Date unknown  \n**Please cite**: Tin Kam Ho and Eugene M. Kleinberg.\nBuilding projectable classifiers of arbitrary complexity.\nIn Proceedings of the 13th International Conference on Pattern Recognition, pages 880-885, Vienna, Austria, August 1996.  \n\n#Dataset from the LIBSVM data repository.\n\nPreprocessing: transform to two-class",
    "problemVersion": "4.0.0",
    "problemSchemaVersion": "4.0.0",
    "taskKeywords": [
      "regression",
      "univariate"
    ]
  },
  "inputs": {
    "data": [
      {
        "datasetID": "LL0_1435_fourclass_dataset",
        "targets": [
          {
            "targetIndex": 0,
            "resID": "learningData",
            "colIndex": 3,
            "colName": "class"
          }
        ]
      }
    ],
    "dataSplits": {
      "method": "holdOut",
      "testSize": 0.2,
      "stratified": true,
      "numRepeats": 0,
      "randomSeed": 42,
      "splitsFile": "dataSplits.csv"
    },
    "performanceMetrics": [
      {
        "metric": "meanSquaredError"
      }
    ]
  },
  "expectedOutputs": {
    "predictionsFile": "predictions.csv"
  }
}