{
  "about": {
    "problemID": "LL0_694_diggle_table_a2_problem",
    "problemName": "LL0_694_diggle_table_a2_problem",
    "problemDescription": "**Author**:   \n**Source**: Unknown - Date unknown  \n**Please cite**:   \n\nDATA-SETS FROM DIGGLE, P.J. (1990). TIME SERIES : A BIOSTATISTICAL\nINTRODUCTION. Oxford University Press.\n\nTable: Table A2 Wool prices\n\n\nInformation about the dataset\nCLASSTYPE: numeric\nCLASSINDEX: none specific",
    "problemSchemaVersion": "4.0.0",
    "problemVersion": "4.0.0",
    "taskKeywords": [
      "classification",
      "multiClass"
    ]
  },
  "inputs": {
    "data": [
      {
        "datasetID": "LL0_694_diggle_table_a2_dataset",
        "targets": [
          {
            "targetIndex": 0,
            "resID": "learningData",
            "colIndex": 1,
            "colName": "col_1"
          }
        ]
      }
    ],
    "dataSplits": {
      "method": "holdOut",
      "testSize": 0.2,
      "stratified": true,
      "numRepeats": 0,
      "randomSeed": 42,
      "splitsFile": "dataSplits.csv"
    },
    "performanceMetrics": [
      {
        "metric": "f1Macro"
      }
    ]
  },
  "expectedOutputs": {
    "predictionsFile": "predictions.csv"
  }
}