{
  "about": {
    "datasetID": "LL0_478_collins_dataset",
    "datasetName": "LL0_478_collins",
    "description": "**Author**: Jeff Collins  \n**Source**: StatLib  \n**Please cite**:   \n\n**Deactivated because this version only has half the data and has clear label leakage cause by 'Genre'. Use version 4 instead.**\n\nThe following are data used in an analysis of the Brown and Frown corpora for my doctoral dissertation titled ``Variations in Written English: Characterizing Authors' Rhetorical Language Choices Across Corpora of Published Texts\" (Completed at Carnegie Mellon Univ, 2003).  The source of the corpora was the ICAME CD-ROM  (get info at <http>).\n\nThe data were generated from the texts using tagging and visualization software, Docuscope.\n\nThe first row is the variable names. The genre of each text (assigned by the Brown corpus compilers) is in 'Genre' column and the corpus is listed in the 'corpus' column with 1=Brown and 2=Frown corpus.\n\nThe dataset may be freely used and distributed for non-commercial purposes.\n\nJeff Collins <jeff> 11 July 2003\n\n\n\nInformation about the dataset\nCLASSTYPE: nominal\nCLASSINDEX: last",
    "citation": "\n\t\t\t\t@article{OpenML2013,\n\t\t\t\tauthor = {Vanschoren, Joaquin and van Rijn, Jan N. and Bischl, Bernd and Torgo, Luis},\n\t\t\t\ttitle = {OpenML: Networked Science in Machine Learning},\n\t\t\t\tjournal = {SIGKDD Explorations},\n\t\t\t\tvolume = {15},\n\t\t\t\tnumber = {2},\n\t\t\t\tyear = {2013},\n\t\t\t\tpages = {49--60},\n\t\t\t\turl = {http://doi.acm.org/10.1145/2641190.2641198},\n\t\t\t\tdoi = {10.1145/2641190.2641198},\n\t\t\t\tpublisher = {ACM},\n\t\t\t\taddress = {New York, NY, USA},\n\t\t\t\t}",
    "license": "CC-BY license",
    "source": "OpenML",
    "sourceURI": "http://www.openml.org/d/478",
    "approximateSize": "",
    "datasetSchemaVersion": "4.0.0",
    "redacted": false,
    "datasetVersion": "4.0.0",
    "digest": "c21fb0d6e1c6782a75b1e719db2209553a24ea0036321f329d38858c9fee356d"
  },
  "dataResources": [
    {
      "resID": "learningData",
      "resPath": "tables/learningData.csv",
      "resType": "table",
      "resFormat": {
        "text/csv": [
          "csv"
        ]
      },
      "isCollection": false,
      "columns": [
        {
          "colIndex": 0,
          "colName": "d3mIndex",
          "colType": "integer",
          "role": [
            "index"
          ]
        },
        {
          "colIndex": 1,
          "colName": "Text",
          "colType": "categorical",
          "role": [
            "attribute"
          ]
        },
        {
          "colIndex": 2,
          "colName": "FirstPerson",
          "colType": "real",
          "role": [
            "attribute"
          ]
        },
        {
          "colIndex": 3,
          "colName": "InnerThinking",
          "colType": "real",
          "role": [
            "attribute"
          ]
        },
        {
          "colIndex": 4,
          "colName": "ThinkPositive",
          "colType": "real",
          "role": [
            "attribute"
          ]
        },
        {
          "colIndex": 5,
          "colName": "ThinkNegative",
          "colType": "real",
          "role": [
            "attribute"
          ]
        },
        {
          "colIndex": 6,
          "colName": "ThinkAhead",
          "colType": "real",
          "role": [
            "attribute"
          ]
        },
        {
          "colIndex": 7,
          "colName": "ThinkBack",
          "colType": "real",
          "role": [
            "attribute"
          ]
        },
        {
          "colIndex": 8,
          "colName": "Reasoning",
          "colType": "real",
          "role": [
            "attribute"
          ]
        },
        {
          "colIndex": 9,
          "colName": "Share_SocTies",
          "colType": "real",
          "role": [
            "attribute"
          ]
        },
        {
          "colIndex": 10,
          "colName": "Direct_Activity",
          "colType": "real",
          "role": [
            "attribute"
          ]
        },
        {
          "colIndex": 11,
          "colName": "Interacting",
          "colType": "real",
          "role": [
            "attribute"
          ]
        },
        {
          "colIndex": 12,
          "colName": "Notifying",
          "colType": "real",
          "role": [
            "attribute"
          ]
        },
        {
          "colIndex": 13,
          "colName": "LinearGuidance",
          "colType": "real",
          "role": [
            "attribute"
          ]
        },
        {
          "colIndex": 14,
          "colName": "WordPicture",
          "colType": "real",
          "role": [
            "attribute"
          ]
        },
        {
          "colIndex": 15,
          "colName": "SpaceInterval",
          "colType": "real",
          "role": [
            "attribute"
          ]
        },
        {
          "colIndex": 16,
          "colName": "Motion",
          "colType": "real",
          "role": [
            "attribute"
          ]
        },
        {
          "colIndex": 17,
          "colName": "PastEvents",
          "colType": "real",
          "role": [
            "attribute"
          ]
        },
        {
          "colIndex": 18,
          "colName": "TimeInterval",
          "colType": "real",
          "role": [
            "attribute"
          ]
        },
        {
          "colIndex": 19,
          "colName": "ShiftingEvents",
          "colType": "real",
          "role": [
            "attribute"
          ]
        },
        {
          "colIndex": 20,
          "colName": "Text_Coverage",
          "colType": "real",
          "role": [
            "attribute"
          ]
        },
        {
          "colIndex": 21,
          "colName": "Genre",
          "colType": "categorical",
          "role": [
            "attribute"
          ]
        },
        {
          "colIndex": 22,
          "colName": "Counter",
          "colType": "integer",
          "role": [
            "attribute"
          ]
        },
        {
          "colIndex": 23,
          "colName": "Corpus",
          "colType": "categorical",
          "role": [
            "attribute"
          ]
        },
        {
          "colIndex": 24,
          "colName": "Corp.Genre",
          "colType": "categorical",
          "role": [
            "suggestedTarget"
          ]
        }
      ],
      "columnsCount": 25
    }
  ]
}