{
  "about": {
    "datasetID": "LL0_811_rmftsa_ctoarrivals_dataset",
    "datasetName": "rmftsa_ctoarrivals",
    "description": "**Author**:   \n**Source**: Unknown - Date unknown  \n**Please cite**:   \n\nBinarized version of the original data set (see version 1). It converts the numeric target feature to a two-class nominal target feature by computing the mean and classifying all instances with a lower target value as positive ('P') and all others as negative ('N').",
    "citation": "\n\t\t\t\t@article{OpenML2013,\n\t\t\t\tauthor = {Vanschoren, Joaquin and van Rijn, Jan N. and Bischl, Bernd and Torgo, Luis},\n\t\t\t\ttitle = {OpenML: Networked Science in Machine Learning},\n\t\t\t\tjournal = {SIGKDD Explorations},\n\t\t\t\tvolume = {15},\n\t\t\t\tnumber = {2},\n\t\t\t\tyear = {2013},\n\t\t\t\tpages = {49--60},\n\t\t\t\turl = {http://doi.acm.org/10.1145/2641190.2641198},\n\t\t\t\tdoi = {10.1145/2641190.2641198},\n\t\t\t\tpublisher = {ACM},\n\t\t\t\taddress = {New York, NY, USA},\n\t\t\t\t}",
    "license": "CC-BY license",
    "source": "OpenML",
    "sourceURI": "http://www.openml.org/d/811",
    "approximateSize": "",
    "datasetVersion": "4.0.0",
    "datasetSchemaVersion": "4.0.0",
    "redacted": false,
    "digest": "1ce9bd21233d7c4f80d7f3ffe2c81fbef498a3e31d4ca6bb10c5380d008dd394"
  },
  "dataResources": [
    {
      "resID": "learningData",
      "resPath": "tables/learningData.csv",
      "resType": "table",
      "resFormat": {
        "text/csv": [
          "csv"
        ]
      },
      "isCollection": false,
      "columns": [
        {
          "colIndex": 0,
          "colName": "d3mIndex",
          "colType": "integer",
          "role": [
            "index"
          ]
        },
        {
          "colIndex": 1,
          "colName": "year",
          "colType": "real",
          "role": [
            "attribute"
          ]
        },
        {
          "colIndex": 2,
          "colName": "month",
          "colType": "categorical",
          "role": [
            "attribute"
          ]
        },
        {
          "colIndex": 3,
          "colName": "binaryClass",
          "colType": "categorical",
          "role": [
            "suggestedTarget"
          ]
        }
      ],
      "columnsCount": 4
    }
  ]
}