{
  "about": {
    "problemID": "LL0_1220_click_prediction_small_problem",
    "problemName": "LL0_1220_click_prediction_small_problem",
    "problemDescription": "**Author**: Tencent Inc.  \n**Source**: [KDD Cup](https://www.kddcup2012.org/) - 2012  \n**Please cite**:   \n\n**0.1% balanced subsample of the original KDD dataset**  \n\nThis data is derived from the 2012 KDD Cup. The data is subsampled to 0.1% of the original number of instances, downsampling the majority class (click=0) so that the target feature is reasonably balanced (5 to 1).\n\nThe data is about advertisements shown alongside search results in a search engine, and whether or not people clicked on these ads. \nThe task is to build the best possible model to predict whether a user will click on a given ad.\n\nA search session contains information on user id, the query issued by the user, ads displayed to the user, and target feature indicating whether a user clicked at least one of the ads in this session. The number of ads displayed to a user in a session is called ‘depth’. The order of an ad in the displayed list is called ‘position’.  An ad is displayed as a short text called ‘title’, followed by a slightly longer text called ’description’, and a URL  called ‘display URL’.   \nTo construct this dataset each session was split into multiple instances. Each instance describes an ad displayed under a certain setting  (‘depth’, ‘position’).  Instances with the same user id, ad id, query, and setting are merged. Each ad and each user have some additional properties located in separate data files that can be looked up using ids in the instances.\n\nThe dataset has the following features:  \n* Click – binary variable indicating whether a user clicked on at least one ad. \n* Impression - the number of search sessions in which AdID was impressed by UserID who issued Query.\n* Url_hash - URL is hashed for anonymity\n* AdID \n* AdvertiserID - some advertisers consistently optimize their ads, so the title and description of their ads are more attractive than those of others’ ads.\n* Depth - number of ads displayed to a user in a session\n* Position - order of an ad in the displayed list\n* QueryID - is the key of the data file 'queryid_tokensid.txt'. (follow the link to the original KDD Cup page, track 2)\n* KeywordID - is the key of  'purchasedkeyword_tokensid.txt' (follow the link to the original KDD Cup page, track 2)\n* TitleID - is the key of 'titleid_tokensid.txt'\n* DescriptionID - is the key of 'descriptionid_tokensid.txt' (follow the link to the original KDD Cup page, track 2)\n* UserID – is also the key of 'userid_profile.txt' (follow the link to the original KDD Cup page, track 2). 0 is a special value denoting that the user could be identified.",
    "problemSchemaVersion": "4.0.0",
    "problemVersion": "4.0.0",
    "taskKeywords": [
      "classification",
      "binary"
    ]
  },
  "inputs": {
    "data": [
      {
        "datasetID": "LL0_1220_click_prediction_small_dataset",
        "targets": [
          {
            "targetIndex": 0,
            "resID": "learningData",
            "colIndex": 1,
            "colName": "click"
          }
        ]
      }
    ],
    "dataSplits": {
      "method": "holdOut",
      "testSize": 0.2,
      "stratified": true,
      "numRepeats": 0,
      "randomSeed": 42,
      "splitsFile": "dataSplits.csv"
    },
    "performanceMetrics": [
      {
        "metric": "f1Macro"
      }
    ]
  },
  "expectedOutputs": {
    "predictionsFile": "predictions.csv"
  }
}