{
  "about": {
    "problemID": "LL0_29_credit_approval_problem",
    "problemName": "LL0_29_credit_approval_problem",
    "problemDescription": "**Author**: Confidential - Donated by Ross Quinlan   \n**Source**: [UCI](http://archive.ics.uci.edu/ml/datasets/credit+approval) - 1987  \n**Please cite**: [UCI](http://archive.ics.uci.edu/ml/citation_policy.html)  \n\n**Credit Approval**\nThis file concerns credit card applications. All attribute names and values have been changed to meaningless symbols to protect the confidentiality of the data.  \n   \nThis dataset is interesting because there is a good mix of attributes -- continuous, nominal with small numbers of values, and nominal with larger numbers of values.  There are also a few missing values.",
    "problemSchemaVersion": "4.0.0",
    "problemVersion": "4.0.0",
    "taskKeywords": [
      "classification",
      "binary"
    ]
  },
  "inputs": {
    "data": [
      {
        "datasetID": "LL0_29_credit_approval_dataset",
        "targets": [
          {
            "targetIndex": 0,
            "resID": "learningData",
            "colIndex": 16,
            "colName": "class"
          }
        ]
      }
    ],
    "dataSplits": {
      "method": "holdOut",
      "testSize": 0.2,
      "stratified": true,
      "numRepeats": 0,
      "randomSeed": 42,
      "splitsFile": "dataSplits.csv"
    },
    "performanceMetrics": [
      {
        "metric": "f1Macro"
      }
    ]
  },
  "expectedOutputs": {
    "predictionsFile": "predictions.csv"
  }
}