{
  "about": {
    "problemID": "LL0_475_analcatdata_germangss_problem",
    "problemName": "analcatdata_germangss_problem",
    "problemDescription": "**Author**:   \n**Source**: Unknown - Date unknown  \n**Please cite**:   \n\nanalcatdata    A collection of data sets used in the book \"Analyzing Categorical Data,\"\nby Jeffrey S. Simonoff, Springer-Verlag, New York, 2003. The submission\nconsists of a zip file containing two versions of each of 84 data sets,\nplus this README file. Each data set is given in comma-delimited ASCII\n(.csv) form, and Microsoft Excel (.xls) form.\n\nNOTICE: These data sets may be used freely for scientific, educational and/or\nnoncommercial purposes, provided suitable acknowledgment is given (by citing\nthe above-named reference).\n\nFurther details concerning the book, including information on statistical software\n(including sample S-PLUS/R and SAS code), are available at the web site\n\nhttp://www.stern.nyu.edu/~jsimonof/AnalCatData\n\n\nInformation about the dataset\nCLASSTYPE: nominal\nCLASSINDEX: 1\n\n\nNote: Quotes, Single-Quotes and Backslashes were removed, Blanks replaced\nwith Underscores",
    "problemVersion": "4.0.0",
    "problemSchemaVersion": "4.0.0",
    "taskKeywords": [
      "classification",
      "multiClass"
    ]
  },
  "inputs": {
    "data": [
      {
        "datasetID": "LL0_475_analcatdata_germangss_dataset",
        "targets": [
          {
            "targetIndex": 0,
            "resID": "learningData",
            "colIndex": 1,
            "colName": "Political_system"
          }
        ]
      }
    ],
    "dataSplits": {
      "method": "holdOut",
      "testSize": 0.2,
      "stratified": true,
      "numRepeats": 0,
      "randomSeed": 42,
      "splitsFile": "dataSplits.csv"
    },
    "performanceMetrics": [
      {
        "metric": "f1Macro"
      }
    ]
  },
  "expectedOutputs": {
    "predictionsFile": "predictions.csv"
  }
}