d3mIndex,type,repeat,fold
6,TEST,0,0
7,TEST,0,0
24,TEST,0,0
29,TEST,0,0
37,TEST,0,0
40,TEST,0,0
41,TEST,0,0
42,TEST,0,0
43,TEST,0,0
44,TEST,0,0
45,TEST,0,0
56,TEST,0,0
57,TEST,0,0
59,TEST,0,0
65,TEST,0,0
66,TEST,0,0
67,TEST,0,0
68,TEST,0,0
71,TEST,0,0
77,TEST,0,0
78,TEST,0,0
118,TEST,0,0
123,TEST,0,0
127,TEST,0,0
128,TEST,0,0
129,TEST,0,0
130,TEST,0,0
145,TEST,0,0
183,TEST,0,0
213,TEST,0,0
260,TEST,0,0
271,TEST,0,0
273,TEST,0,0
277,TEST,0,0
279,TEST,0,0
282,TEST,0,0
284,TEST,0,0
286,TEST,0,0
288,TEST,0,0
292,TEST,0,0
295,TEST,0,0
307,TEST,0,0
308,TEST,0,0
309,TEST,0,0
327,TEST,0,0
330,TEST,0,0
331,TEST,0,0
332,TEST,0,0
340,TEST,0,0
341,TEST,0,0
342,TEST,0,0
343,TEST,0,0
344,TEST,0,0
345,TEST,0,0
346,TEST,0,0
347,TEST,0,0
348,TEST,0,0
349,TEST,0,0
350,TEST,0,0
351,TEST,0,0
352,TEST,0,0
353,TEST,0,0
354,TEST,0,0
388,TEST,0,0
397,TEST,0,0
398,TEST,0,0
399,TEST,0,0
400,TEST,0,0
401,TEST,0,0
402,TEST,0,0
412,TEST,0,0
417,TEST,0,0
418,TEST,0,0
419,TEST,0,0
420,TEST,0,0
421,TEST,0,0
422,TEST,0,0
423,TEST,0,0
424,TEST,0,0
425,TEST,0,0
427,TEST,0,0
428,TEST,0,0
429,TEST,0,0
430,TEST,0,0
431,TEST,0,0
432,TEST,0,0
433,TEST,0,0
434,TEST,0,0
436,TEST,0,0
437,TEST,0,0
438,TEST,0,0
455,TEST,0,0
456,TEST,0,0
457,TEST,0,0
458,TEST,0,0
473,TEST,0,0
474,TEST,0,0
475,TEST,0,0
476,TEST,0,0
477,TEST,0,0
480,TEST,0,0
481,TEST,0,0
496,TEST,0,0
497,TEST,0,0
498,TEST,0,0
499,TEST,0,0
545,TEST,0,0
565,TEST,0,0
566,TEST,0,0
567,TEST,0,0
568,TEST,0,0
569,TEST,0,0
570,TEST,0,0
571,TEST,0,0
572,TEST,0,0
573,TEST,0,0
574,TEST,0,0
575,TEST,0,0
576,TEST,0,0
577,TEST,0,0
578,TEST,0,0
579,TEST,0,0
580,TEST,0,0
581,TEST,0,0
582,TEST,0,0
588,TEST,0,0
589,TEST,0,0
600,TEST,0,0
601,TEST,0,0
603,TEST,0,0
604,TEST,0,0
605,TEST,0,0
606,TEST,0,0
607,TEST,0,0
608,TEST,0,0
609,TEST,0,0
610,TEST,0,0
611,TEST,0,0
612,TEST,0,0
613,TEST,0,0
614,TEST,0,0
615,TEST,0,0
616,TEST,0,0
617,TEST,0,0
618,TEST,0,0
626,TEST,0,0
627,TEST,0,0
628,TEST,0,0
635,TEST,0,0
639,TEST,0,0
642,TEST,0,0
647,TEST,0,0
652,TEST,0,0
653,TEST,0,0
655,TEST,0,0
658,TEST,0,0
659,TEST,0,0
660,TEST,0,0
661,TEST,0,0
662,TEST,0,0
663,TEST,0,0
677,TEST,0,0
678,TEST,0,0
679,TEST,0,0
680,TEST,0,0
681,TEST,0,0
682,TEST,0,0
685,TEST,0,0
686,TEST,0,0
688,TEST,0,0
711,TEST,0,0
712,TEST,0,0
713,TEST,0,0
714,TEST,0,0
715,TEST,0,0
717,TEST,0,0
719,TEST,0,0
721,TEST,0,0
722,TEST,0,0
723,TEST,0,0
724,TEST,0,0
725,TEST,0,0
726,TEST,0,0
727,TEST,0,0
728,TEST,0,0
729,TEST,0,0
730,TEST,0,0
731,TEST,0,0
732,TEST,0,0
733,TEST,0,0
735,TEST,0,0
736,TEST,0,0
750,TEST,0,0
751,TEST,0,0
752,TEST,0,0
753,TEST,0,0
754,TEST,0,0
762,TEST,0,0
763,TEST,0,0
764,TEST,0,0
765,TEST,0,0
778,TEST,0,0
779,TEST,0,0
780,TEST,0,0
781,TEST,0,0
783,TEST,0,0
784,TEST,0,0
815,TEST,0,0
816,TEST,0,0
817,TEST,0,0
820,TEST,0,0
827,TEST,0,0
850,TEST,0,0
854,TEST,0,0
855,TEST,0,0
856,TEST,0,0
857,TEST,0,0
868,TEST,0,0
883,TEST,0,0
885,TEST,0,0
900,TEST,0,0
901,TEST,0,0
913,TEST,0,0
914,TEST,0,0
915,TEST,0,0
916,TEST,0,0
917,TEST,0,0
918,TEST,0,0
919,TEST,0,0
926,TEST,0,0
928,TEST,0,0
929,TEST,0,0
941,TEST,0,0
943,TEST,0,0
948,TEST,0,0
949,TEST,0,0
953,TEST,0,0
955,TEST,0,0
959,TEST,0,0
1016,TEST,0,0
1017,TEST,0,0
1018,TEST,0,0
1019,TEST,0,0
1020,TEST,0,0
1021,TEST,0,0
1022,TEST,0,0
1042,TEST,0,0
1043,TEST,0,0
1044,TEST,0,0
1100,TEST,0,0
1101,TEST,0,0
1102,TEST,0,0
1103,TEST,0,0
1104,TEST,0,0
1105,TEST,0,0
1131,TEST,0,0
1146,TEST,0,0
1147,TEST,0,0
1148,TEST,0,0
1151,TEST,0,0
1152,TEST,0,0
1153,TEST,0,0
1154,TEST,0,0
1169,TEST,0,0
1170,TEST,0,0
1171,TEST,0,0
1172,TEST,0,0
1173,TEST,0,0
1174,TEST,0,0
1175,TEST,0,0
1176,TEST,0,0
1177,TEST,0,0
1186,TEST,0,0
1187,TEST,0,0
1191,TEST,0,0
1192,TEST,0,0
1193,TEST,0,0
1229,TEST,0,0
1238,TEST,0,0
1240,TEST,0,0
1242,TEST,0,0
1254,TEST,0,0
1282,TEST,0,0
1294,TEST,0,0
1325,TEST,0,0
1327,TEST,0,0
1340,TEST,0,0
1341,TEST,0,0
1342,TEST,0,0
1343,TEST,0,0
1344,TEST,0,0
1345,TEST,0,0
1350,TEST,0,0
1358,TEST,0,0
1359,TEST,0,0
1360,TEST,0,0
1361,TEST,0,0
1362,TEST,0,0
1364,TEST,0,0
1366,TEST,0,0
1367,TEST,0,0
1368,TEST,0,0
1374,TEST,0,0
1375,TEST,0,0
1376,TEST,0,0
1377,TEST,0,0
1382,TEST,0,0
1393,TEST,0,0
1401,TEST,0,0
1402,TEST,0,0
1403,TEST,0,0
1404,TEST,0,0
1405,TEST,0,0
1416,TEST,0,0
1464,TEST,0,0
1465,TEST,0,0
1466,TEST,0,0
1467,TEST,0,0
1468,TEST,0,0
1469,TEST,0,0
1470,TEST,0,0
1471,TEST,0,0
1472,TEST,0,0
1473,TEST,0,0
1474,TEST,0,0
1475,TEST,0,0
1476,TEST,0,0
1477,TEST,0,0
1478,TEST,0,0
1479,TEST,0,0
1480,TEST,0,0
1481,TEST,0,0
1482,TEST,0,0
1483,TEST,0,0
1484,TEST,0,0
1485,TEST,0,0
1486,TEST,0,0
1487,TEST,0,0
1488,TEST,0,0
1489,TEST,0,0
1490,TEST,0,0
1492,TEST,0,0
1494,TEST,0,0
1495,TEST,0,0
1496,TEST,0,0
1497,TEST,0,0
1498,TEST,0,0
1499,TEST,0,0
1500,TEST,0,0
1501,TEST,0,0
1502,TEST,0,0
1503,TEST,0,0
1504,TEST,0,0
1505,TEST,0,0
1506,TEST,0,0
1507,TEST,0,0
1508,TEST,0,0
1509,TEST,0,0
1510,TEST,0,0
1511,TEST,0,0
1512,TEST,0,0
1513,TEST,0,0
1514,TEST,0,0
1515,TEST,0,0
1516,TEST,0,0
1517,TEST,0,0
1518,TEST,0,0
1519,TEST,0,0
1520,TEST,0,0
1521,TEST,0,0
1522,TEST,0,0
1534,TEST,0,0
1535,TEST,0,0
1536,TEST,0,0
1543,TEST,0,0
1544,TEST,0,0
1569,TEST,0,0
1570,TEST,0,0
1571,TEST,0,0
1572,TEST,0,0
1573,TEST,0,0
1574,TEST,0,0
1575,TEST,0,0
1576,TEST,0,0
1577,TEST,0,0
1578,TEST,0,0
1579,TEST,0,0
1580,TEST,0,0
1581,TEST,0,0
1582,TEST,0,0
1583,TEST,0,0
1584,TEST,0,0
1585,TEST,0,0
1592,TEST,0,0
1593,TEST,0,0
1594,TEST,0,0
1595,TEST,0,0
1596,TEST,0,0
1597,TEST,0,0
1598,TEST,0,0
1603,TEST,0,0
1604,TEST,0,0
1611,TEST,0,0
1615,TEST,0,0
1616,TEST,0,0
1622,TEST,0,0
1623,TEST,0,0
1631,TEST,0,0
1632,TEST,0,0
1633,TEST,0,0
1637,TEST,0,0
1642,TEST,0,0
1650,TEST,0,0
1657,TEST,0,0
1658,TEST,0,0
1659,TEST,0,0
1660,TEST,0,0
1661,TEST,0,0
1662,TEST,0,0
1673,TEST,0,0
1674,TEST,0,0
1675,TEST,0,0
1676,TEST,0,0
1677,TEST,0,0
1678,TEST,0,0
1680,TEST,0,0
1687,TEST,0,0
1688,TEST,0,0
1689,TEST,0,0
1690,TEST,0,0
1691,TEST,0,0
1711,TEST,0,0
1712,TEST,0,0
1713,TEST,0,0
1714,TEST,0,0
1715,TEST,0,0
1716,TEST,0,0
1738,TEST,0,0
1745,TEST,0,0
1746,TEST,0,0
1747,TEST,0,0
1748,TEST,0,0
1757,TEST,0,0
1779,TEST,0,0
1780,TEST,0,0
1795,TEST,0,0
1797,TEST,0,0
1822,TEST,0,0
1828,TEST,0,0
1829,TEST,0,0
1830,TEST,0,0
1831,TEST,0,0
1832,TEST,0,0
1833,TEST,0,0
1834,TEST,0,0
1837,TEST,0,0
1862,TEST,0,0
1881,TEST,0,0
1882,TEST,0,0
1883,TEST,0,0
1898,TEST,0,0
1909,TEST,0,0
1922,TEST,0,0
1925,TEST,0,0
1926,TEST,0,0
1955,TEST,0,0
1957,TEST,0,0
1994,TEST,0,0
1995,TEST,0,0
2013,TEST,0,0
2016,TEST,0,0
2018,TEST,0,0
2036,TEST,0,0
2037,TEST,0,0
2038,TEST,0,0
2039,TEST,0,0
2040,TEST,0,0
2041,TEST,0,0
2044,TEST,0,0
2045,TEST,0,0
2046,TEST,0,0
2062,TEST,0,0
2063,TEST,0,0
2065,TEST,0,0
2066,TEST,0,0
2074,TEST,0,0
2079,TEST,0,0
2080,TEST,0,0
2081,TEST,0,0
2082,TEST,0,0
2083,TEST,0,0
2086,TEST,0,0
2087,TEST,0,0
2088,TEST,0,0
2092,TEST,0,0
2093,TEST,0,0
2125,TEST,0,0
2126,TEST,0,0
2127,TEST,0,0
2128,TEST,0,0
2135,TEST,0,0
2167,TEST,0,0
2168,TEST,0,0
2169,TEST,0,0
2170,TEST,0,0
2171,TEST,0,0
2172,TEST,0,0
2173,TEST,0,0
2174,TEST,0,0
2175,TEST,0,0
2183,TEST,0,0
2184,TEST,0,0
2195,TEST,0,0
2196,TEST,0,0
2197,TEST,0,0
2198,TEST,0,0
2250,TEST,0,0
2251,TEST,0,0
2252,TEST,0,0
2253,TEST,0,0
2254,TEST,0,0
2255,TEST,0,0
2256,TEST,0,0
2257,TEST,0,0
2265,TEST,0,0
2281,TEST,0,0
2300,TEST,0,0
2301,TEST,0,0
2343,TEST,0,0
2375,TEST,0,0
2397,TEST,0,0
2398,TEST,0,0
2399,TEST,0,0
2431,TEST,0,0
2433,TEST,0,0
2434,TEST,0,0
2435,TEST,0,0
2443,TEST,0,0
2444,TEST,0,0
2445,TEST,0,0
2446,TEST,0,0
2452,TEST,0,0
2453,TEST,0,0
2454,TEST,0,0
2458,TEST,0,0
2480,TEST,0,0
2481,TEST,0,0
2509,TEST,0,0
2515,TEST,0,0
2516,TEST,0,0
2519,TEST,0,0
2520,TEST,0,0
2521,TEST,0,0
2522,TEST,0,0
2523,TEST,0,0
2527,TEST,0,0
2528,TEST,0,0
2529,TEST,0,0
2530,TEST,0,0
2531,TEST,0,0
2532,TEST,0,0
2533,TEST,0,0
2535,TEST,0,0
2536,TEST,0,0
2565,TEST,0,0
2572,TEST,0,0
2573,TEST,0,0
2598,TEST,0,0
2601,TEST,0,0
2605,TEST,0,0
2606,TEST,0,0
2607,TEST,0,0
2608,TEST,0,0
2609,TEST,0,0
2627,TEST,0,0
2628,TEST,0,0
2629,TEST,0,0
2630,TEST,0,0
2631,TEST,0,0
2658,TEST,0,0
2659,TEST,0,0
2660,TEST,0,0
2662,TEST,0,0
2663,TEST,0,0
2674,TEST,0,0
2724,TEST,0,0
2725,TEST,0,0
2727,TEST,0,0
2728,TEST,0,0
2729,TEST,0,0
2734,TEST,0,0
2735,TEST,0,0
2736,TEST,0,0
2737,TEST,0,0
2738,TEST,0,0
2739,TEST,0,0
2740,TEST,0,0
2746,TEST,0,0
2747,TEST,0,0
2775,TEST,0,0
2792,TEST,0,0
2795,TEST,0,0
2796,TEST,0,0
2797,TEST,0,0
2798,TEST,0,0
2799,TEST,0,0
2800,TEST,0,0
2801,TEST,0,0
2802,TEST,0,0
2811,TEST,0,0
2812,TEST,0,0
2813,TEST,0,0
2814,TEST,0,0
2818,TEST,0,0
2819,TEST,0,0
2820,TEST,0,0
2821,TEST,0,0
2822,TEST,0,0
2823,TEST,0,0
2824,TEST,0,0
2825,TEST,0,0
2861,TEST,0,0
2862,TEST,0,0
2863,TEST,0,0
2864,TEST,0,0
2872,TEST,0,0
2875,TEST,0,0
2877,TEST,0,0
2881,TEST,0,0
2882,TEST,0,0
2883,TEST,0,0
2893,TEST,0,0
2899,TEST,0,0
2900,TEST,0,0
2901,TEST,0,0
2902,TEST,0,0
2903,TEST,0,0
2904,TEST,0,0
2915,TEST,0,0
2916,TEST,0,0
2917,TEST,0,0
2919,TEST,0,0
2920,TEST,0,0
2931,TEST,0,0
2933,TEST,0,0
2934,TEST,0,0
2935,TEST,0,0
2936,TEST,0,0
2937,TEST,0,0
2938,TEST,0,0
2946,TEST,0,0
2947,TEST,0,0
2952,TEST,0,0
2963,TEST,0,0
2982,TEST,0,0
2987,TEST,0,0
2988,TEST,0,0
2989,TEST,0,0
2995,TEST,0,0
2998,TEST,0,0
2999,TEST,0,0
3026,TEST,0,0
3027,TEST,0,0
3028,TEST,0,0
3029,TEST,0,0
3030,TEST,0,0
3031,TEST,0,0
3032,TEST,0,0
3033,TEST,0,0
3034,TEST,0,0
3035,TEST,0,0
3043,TEST,0,0
3061,TEST,0,0
3062,TEST,0,0
3063,TEST,0,0
3064,TEST,0,0
3108,TEST,0,0
3109,TEST,0,0
3110,TEST,0,0
3117,TEST,0,0
3118,TEST,0,0
3119,TEST,0,0
3120,TEST,0,0
3121,TEST,0,0
3123,TEST,0,0
3125,TEST,0,0
3126,TEST,0,0
3127,TEST,0,0
3128,TEST,0,0
3133,TEST,0,0
3134,TEST,0,0
3135,TEST,0,0
3136,TEST,0,0
3137,TEST,0,0
3138,TEST,0,0
3174,TEST,0,0
3175,TEST,0,0
3176,TEST,0,0
3177,TEST,0,0
3178,TEST,0,0
3179,TEST,0,0
3180,TEST,0,0
3201,TEST,0,0
3206,TEST,0,0
3252,TEST,0,0
3253,TEST,0,0
3276,TEST,0,0
3314,TEST,0,0
3316,TEST,0,0
3317,TEST,0,0
3318,TEST,0,0
3319,TEST,0,0
3322,TEST,0,0
3323,TEST,0,0
3324,TEST,0,0
3325,TEST,0,0
3339,TEST,0,0
3349,TEST,0,0
3351,TEST,0,0
3352,TEST,0,0
3353,TEST,0,0
3355,TEST,0,0
3363,TEST,0,0
3373,TEST,0,0
3375,TEST,0,0
3387,TEST,0,0
3389,TEST,0,0
3391,TEST,0,0
3399,TEST,0,0
3401,TEST,0,0
3407,TEST,0,0
3414,TEST,0,0
3415,TEST,0,0
3416,TEST,0,0
3417,TEST,0,0
3418,TEST,0,0
3419,TEST,0,0
3420,TEST,0,0
3421,TEST,0,0
3422,TEST,0,0
3423,TEST,0,0
3424,TEST,0,0
3425,TEST,0,0
3426,TEST,0,0
3427,TEST,0,0
3428,TEST,0,0
3429,TEST,0,0
3430,TEST,0,0
3431,TEST,0,0
3432,TEST,0,0
3433,TEST,0,0
3434,TEST,0,0
3435,TEST,0,0
3436,TEST,0,0
3437,TEST,0,0
3438,TEST,0,0
3439,TEST,0,0
3440,TEST,0,0
3441,TEST,0,0
3442,TEST,0,0
3443,TEST,0,0
3444,TEST,0,0
3445,TEST,0,0
3464,TEST,0,0
3465,TEST,0,0
3466,TEST,0,0
3467,TEST,0,0
3468,TEST,0,0
3469,TEST,0,0
3470,TEST,0,0
3471,TEST,0,0
3472,TEST,0,0
3473,TEST,0,0
3516,TEST,0,0
3517,TEST,0,0
3518,TEST,0,0
3519,TEST,0,0
3520,TEST,0,0
3571,TEST,0,0
3572,TEST,0,0
3573,TEST,0,0
3574,TEST,0,0
3575,TEST,0,0
3576,TEST,0,0
3589,TEST,0,0
3590,TEST,0,0
3591,TEST,0,0
3592,TEST,0,0
3618,TEST,0,0
3655,TEST,0,0
3667,TEST,0,0
3668,TEST,0,0
3675,TEST,0,0
3676,TEST,0,0
3695,TEST,0,0
3696,TEST,0,0
3697,TEST,0,0
3698,TEST,0,0
3699,TEST,0,0
3700,TEST,0,0
3701,TEST,0,0
3702,TEST,0,0
3703,TEST,0,0
3714,TEST,0,0
3716,TEST,0,0
3717,TEST,0,0
3724,TEST,0,0
3727,TEST,0,0
3729,TEST,0,0
3740,TEST,0,0
3763,TEST,0,0
3767,TEST,0,0
3777,TEST,0,0
3778,TEST,0,0
3779,TEST,0,0
3780,TEST,0,0
3781,TEST,0,0
3798,TEST,0,0
3799,TEST,0,0
3811,TEST,0,0
3812,TEST,0,0
3813,TEST,0,0
3814,TEST,0,0
3815,TEST,0,0
3816,TEST,0,0
3817,TEST,0,0
3818,TEST,0,0
3852,TEST,0,0
3853,TEST,0,0
3854,TEST,0,0
3855,TEST,0,0
3856,TEST,0,0
3857,TEST,0,0
3858,TEST,0,0
3859,TEST,0,0
3860,TEST,0,0
3861,TEST,0,0
3862,TEST,0,0
3863,TEST,0,0
3864,TEST,0,0
3866,TEST,0,0
3868,TEST,0,0
3869,TEST,0,0
3870,TEST,0,0
3871,TEST,0,0
3886,TEST,0,0
3887,TEST,0,0
3888,TEST,0,0
3889,TEST,0,0
3898,TEST,0,0
3902,TEST,0,0
3904,TEST,0,0
3951,TEST,0,0
3958,TEST,0,0
3959,TEST,0,0
3963,TEST,0,0
3966,TEST,0,0
3995,TEST,0,0
3996,TEST,0,0
3997,TEST,0,0
3998,TEST,0,0
3999,TEST,0,0
4004,TEST,0,0
4009,TEST,0,0
4033,TEST,0,0
4034,TEST,0,0
4035,TEST,0,0
4036,TEST,0,0
4046,TEST,0,0
4047,TEST,0,0
4048,TEST,0,0
4082,TEST,0,0
4109,TEST,0,0
4110,TEST,0,0
4150,TEST,0,0
4160,TEST,0,0
4190,TEST,0,0
4191,TEST,0,0
4192,TEST,0,0
4195,TEST,0,0
4196,TEST,0,0
4197,TEST,0,0
4198,TEST,0,0
4199,TEST,0,0
4200,TEST,0,0
4219,TEST,0,0
4220,TEST,0,0
4222,TEST,0,0
4223,TEST,0,0
4224,TEST,0,0
4233,TEST,0,0
4234,TEST,0,0
4235,TEST,0,0
4236,TEST,0,0
4257,TEST,0,0
4268,TEST,0,0
4270,TEST,0,0
4293,TEST,0,0
4312,TEST,0,0
4313,TEST,0,0
4314,TEST,0,0
4315,TEST,0,0
4334,TEST,0,0
4385,TEST,0,0
4386,TEST,0,0
4387,TEST,0,0
4388,TEST,0,0
4389,TEST,0,0
4397,TEST,0,0
4404,TEST,0,0
4405,TEST,0,0
4406,TEST,0,0
4407,TEST,0,0
4408,TEST,0,0
4410,TEST,0,0
4411,TEST,0,0
4412,TEST,0,0
4413,TEST,0,0
4414,TEST,0,0
4415,TEST,0,0
4416,TEST,0,0
4417,TEST,0,0
4418,TEST,0,0
4419,TEST,0,0
4420,TEST,0,0
4421,TEST,0,0
4422,TEST,0,0
4423,TEST,0,0
4453,TEST,0,0
4454,TEST,0,0
4455,TEST,0,0
4456,TEST,0,0
4457,TEST,0,0
4458,TEST,0,0
4459,TEST,0,0
4460,TEST,0,0
4461,TEST,0,0
4468,TEST,0,0
4469,TEST,0,0
4470,TEST,0,0
4516,TEST,0,0
4543,TEST,0,0
4545,TEST,0,0
4546,TEST,0,0
4548,TEST,0,0
4549,TEST,0,0
4550,TEST,0,0
4551,TEST,0,0
4552,TEST,0,0
4553,TEST,0,0
4568,TEST,0,0
4578,TEST,0,0
4580,TEST,0,0
4583,TEST,0,0
4584,TEST,0,0
4587,TEST,0,0
4589,TEST,0,0
4655,TEST,0,0
4656,TEST,0,0
4657,TEST,0,0
4658,TEST,0,0
4660,TEST,0,0
4661,TEST,0,0
4662,TEST,0,0
4675,TEST,0,0
4676,TEST,0,0
4677,TEST,0,0
4678,TEST,0,0
4679,TEST,0,0
4756,TEST,0,0
4757,TEST,0,0
4758,TEST,0,0
4759,TEST,0,0
4760,TEST,0,0
4793,TEST,0,0
4813,TEST,0,0
4814,TEST,0,0
4815,TEST,0,0
4829,TEST,0,0
4830,TEST,0,0
4831,TEST,0,0
4832,TEST,0,0
4833,TEST,0,0
4849,TEST,0,0
4851,TEST,0,0
4862,TEST,0,0
4863,TEST,0,0
4864,TEST,0,0
4865,TEST,0,0
4866,TEST,0,0
4867,TEST,0,0
4868,TEST,0,0
4869,TEST,0,0
4870,TEST,0,0
4871,TEST,0,0
4884,TEST,0,0
4885,TEST,0,0
4886,TEST,0,0
4887,TEST,0,0
4888,TEST,0,0
4889,TEST,0,0
4890,TEST,0,0
4891,TEST,0,0
4892,TEST,0,0
4893,TEST,0,0
4894,TEST,0,0
4912,TEST,0,0
4917,TEST,0,0
4960,TEST,0,0
4961,TEST,0,0
4962,TEST,0,0
4963,TEST,0,0
4964,TEST,0,0
4965,TEST,0,0
4966,TEST,0,0
4967,TEST,0,0
4968,TEST,0,0
4969,TEST,0,0
4970,TEST,0,0
4971,TEST,0,0
4972,TEST,0,0
4973,TEST,0,0
4974,TEST,0,0
4975,TEST,0,0
4976,TEST,0,0
4977,TEST,0,0
4978,TEST,0,0
4979,TEST,0,0
4980,TEST,0,0
4981,TEST,0,0
4982,TEST,0,0
4983,TEST,0,0
4984,TEST,0,0
4985,TEST,0,0
4993,TEST,0,0
4994,TEST,0,0
4995,TEST,0,0
4996,TEST,0,0
4997,TEST,0,0
4998,TEST,0,0
5052,TEST,0,0
5053,TEST,0,0
5054,TEST,0,0
5055,TEST,0,0
5056,TEST,0,0
5057,TEST,0,0
5058,TEST,0,0
5059,TEST,0,0
5060,TEST,0,0
5061,TEST,0,0
5062,TEST,0,0
5063,TEST,0,0
5064,TEST,0,0
5065,TEST,0,0
5074,TEST,0,0
5075,TEST,0,0
5076,TEST,0,0
5077,TEST,0,0
5078,TEST,0,0
5079,TEST,0,0
5080,TEST,0,0
5081,TEST,0,0
5082,TEST,0,0
5083,TEST,0,0
5084,TEST,0,0
5085,TEST,0,0
5086,TEST,0,0
5129,TEST,0,0
5130,TEST,0,0
5137,TEST,0,0
5138,TEST,0,0
5142,TEST,0,0
5143,TEST,0,0
5144,TEST,0,0
5145,TEST,0,0
5146,TEST,0,0
5148,TEST,0,0
5149,TEST,0,0
5150,TEST,0,0
5151,TEST,0,0
5171,TEST,0,0
5172,TEST,0,0
5173,TEST,0,0
5174,TEST,0,0
5175,TEST,0,0
5176,TEST,0,0
5177,TEST,0,0
5178,TEST,0,0
5203,TEST,0,0
5222,TEST,0,0
5223,TEST,0,0
5224,TEST,0,0
5225,TEST,0,0
5240,TEST,0,0
5242,TEST,0,0
5245,TEST,0,0
5251,TEST,0,0
5252,TEST,0,0
5253,TEST,0,0
5256,TEST,0,0
5257,TEST,0,0
5261,TEST,0,0
5276,TEST,0,0
5311,TEST,0,0
5312,TEST,0,0
5327,TEST,0,0
5343,TEST,0,0
5344,TEST,0,0
5345,TEST,0,0
5363,TEST,0,0
5364,TEST,0,0
5365,TEST,0,0
5437,TEST,0,0
5438,TEST,0,0
5439,TEST,0,0
5440,TEST,0,0
5442,TEST,0,0
5451,TEST,0,0
5452,TEST,0,0
5453,TEST,0,0
5454,TEST,0,0
5455,TEST,0,0
5456,TEST,0,0
5508,TEST,0,0
5522,TEST,0,0
5523,TEST,0,0
5524,TEST,0,0
5528,TEST,0,0
5530,TEST,0,0
5539,TEST,0,0
5540,TEST,0,0
5541,TEST,0,0
5542,TEST,0,0
5565,TEST,0,0
5566,TEST,0,0
5567,TEST,0,0
5568,TEST,0,0
5569,TEST,0,0
5570,TEST,0,0
5614,TEST,0,0
5615,TEST,0,0
5616,TEST,0,0
5628,TEST,0,0
5641,TEST,0,0
5642,TEST,0,0
5643,TEST,0,0
5644,TEST,0,0
5645,TEST,0,0
5646,TEST,0,0
5647,TEST,0,0
5651,TEST,0,0
5653,TEST,0,0
5665,TEST,0,0
5689,TEST,0,0
5702,TEST,0,0
5703,TEST,0,0
5745,TEST,0,0
5746,TEST,0,0
5752,TEST,0,0
5753,TEST,0,0
5754,TEST,0,0
5755,TEST,0,0
5778,TEST,0,0
5799,TEST,0,0
5801,TEST,0,0
5848,TEST,0,0
5849,TEST,0,0
5850,TEST,0,0
5851,TEST,0,0
5862,TEST,0,0
5863,TEST,0,0
5883,TEST,0,0
5901,TEST,0,0
5902,TEST,0,0
5903,TEST,0,0
5904,TEST,0,0
5905,TEST,0,0
5906,TEST,0,0
5907,TEST,0,0
5908,TEST,0,0
5909,TEST,0,0
5910,TEST,0,0
5911,TEST,0,0
5912,TEST,0,0
5913,TEST,0,0
5914,TEST,0,0
5915,TEST,0,0
5916,TEST,0,0
5917,TEST,0,0
5929,TEST,0,0
5930,TEST,0,0
5931,TEST,0,0
5932,TEST,0,0
5933,TEST,0,0
5934,TEST,0,0
5938,TEST,0,0
5954,TEST,0,0
5955,TEST,0,0
5957,TEST,0,0
5959,TEST,0,0
5961,TEST,0,0
5968,TEST,0,0
5969,TEST,0,0
5970,TEST,0,0
5971,TEST,0,0
5972,TEST,0,0
5973,TEST,0,0
5974,TEST,0,0
5975,TEST,0,0
5976,TEST,0,0
5977,TEST,0,0
5978,TEST,0,0
5979,TEST,0,0
5980,TEST,0,0
5986,TEST,0,0
5987,TEST,0,0
5997,TEST,0,0
5998,TEST,0,0
6044,TEST,0,0
6084,TEST,0,0
6085,TEST,0,0
6086,TEST,0,0
6087,TEST,0,0
6088,TEST,0,0
6146,TEST,0,0
6147,TEST,0,0
6148,TEST,0,0
6149,TEST,0,0
6151,TEST,0,0
6152,TEST,0,0
6153,TEST,0,0
6154,TEST,0,0
6173,TEST,0,0
6174,TEST,0,0
6175,TEST,0,0
6191,TEST,0,0
6192,TEST,0,0
6206,TEST,0,0
6207,TEST,0,0
6208,TEST,0,0
6209,TEST,0,0
6210,TEST,0,0
6211,TEST,0,0
6212,TEST,0,0
6227,TEST,0,0
6228,TEST,0,0
6229,TEST,0,0
6230,TEST,0,0
6286,TEST,0,0
6326,TEST,0,0
6327,TEST,0,0
6328,TEST,0,0
6329,TEST,0,0
6335,TEST,0,0
6380,TEST,0,0
6381,TEST,0,0
6385,TEST,0,0
6390,TEST,0,0
6391,TEST,0,0
6392,TEST,0,0
6393,TEST,0,0
6394,TEST,0,0
6395,TEST,0,0
6396,TEST,0,0
6397,TEST,0,0
6398,TEST,0,0
6430,TEST,0,0
6453,TEST,0,0
6454,TEST,0,0
6455,TEST,0,0
6456,TEST,0,0
6457,TEST,0,0
6458,TEST,0,0
6459,TEST,0,0
6460,TEST,0,0
6461,TEST,0,0
6462,TEST,0,0
6510,TEST,0,0
6511,TEST,0,0
6524,TEST,0,0
6531,TEST,0,0
6532,TEST,0,0
6533,TEST,0,0
6534,TEST,0,0
6535,TEST,0,0
6536,TEST,0,0
6550,TEST,0,0
6551,TEST,0,0
6552,TEST,0,0
6553,TEST,0,0
6554,TEST,0,0
6555,TEST,0,0
6556,TEST,0,0
6567,TEST,0,0
6569,TEST,0,0
6580,TEST,0,0
6591,TEST,0,0
6592,TEST,0,0
6593,TEST,0,0
6606,TEST,0,0
6607,TEST,0,0
6608,TEST,0,0
6609,TEST,0,0
6610,TEST,0,0
6611,TEST,0,0
6612,TEST,0,0
6613,TEST,0,0
6614,TEST,0,0
6623,TEST,0,0
6624,TEST,0,0
6625,TEST,0,0
6626,TEST,0,0
6627,TEST,0,0
6628,TEST,0,0
6629,TEST,0,0
6630,TEST,0,0
6631,TEST,0,0
6632,TEST,0,0
6633,TEST,0,0
6634,TEST,0,0
6635,TEST,0,0
6636,TEST,0,0
6637,TEST,0,0
6638,TEST,0,0
6639,TEST,0,0
6640,TEST,0,0
6641,TEST,0,0
6674,TEST,0,0
6682,TEST,0,0
6753,TEST,0,0
6757,TEST,0,0
6763,TEST,0,0
6804,TEST,0,0
6818,TEST,0,0
6820,TEST,0,0
6863,TEST,0,0
6864,TEST,0,0
6865,TEST,0,0
6866,TEST,0,0
6867,TEST,0,0
6877,TEST,0,0
6878,TEST,0,0
6890,TEST,0,0
6899,TEST,0,0
6901,TEST,0,0
6906,TEST,0,0
6907,TEST,0,0
6908,TEST,0,0
6909,TEST,0,0
6910,TEST,0,0
6911,TEST,0,0
6916,TEST,0,0
6957,TEST,0,0
6958,TEST,0,0
6969,TEST,0,0
6970,TEST,0,0
6971,TEST,0,0
6972,TEST,0,0
6973,TEST,0,0
6974,TEST,0,0
6975,TEST,0,0
6976,TEST,0,0
6977,TEST,0,0
6978,TEST,0,0
6979,TEST,0,0
6980,TEST,0,0
6981,TEST,0,0
6982,TEST,0,0
6983,TEST,0,0
6984,TEST,0,0
6985,TEST,0,0
6986,TEST,0,0
6987,TEST,0,0
6988,TEST,0,0
6989,TEST,0,0
6990,TEST,0,0
6991,TEST,0,0
6992,TEST,0,0
6993,TEST,0,0
6994,TEST,0,0
6995,TEST,0,0
6996,TEST,0,0
7022,TEST,0,0
7026,TEST,0,0
7027,TEST,0,0
7028,TEST,0,0
7067,TEST,0,0
7068,TEST,0,0
7069,TEST,0,0
7073,TEST,0,0
7074,TEST,0,0
7075,TEST,0,0
7076,TEST,0,0
7077,TEST,0,0
7078,TEST,0,0
7087,TEST,0,0
7088,TEST,0,0
7089,TEST,0,0
7090,TEST,0,0
7091,TEST,0,0
7092,TEST,0,0
7093,TEST,0,0
7094,TEST,0,0
7141,TEST,0,0
7142,TEST,0,0
7143,TEST,0,0
7144,TEST,0,0
7145,TEST,0,0
7146,TEST,0,0
7147,TEST,0,0
7148,TEST,0,0
7149,TEST,0,0
7150,TEST,0,0
7151,TEST,0,0
7152,TEST,0,0
7153,TEST,0,0
7154,TEST,0,0
7155,TEST,0,0
7156,TEST,0,0
7157,TEST,0,0
7158,TEST,0,0
7173,TEST,0,0
7180,TEST,0,0
7238,TEST,0,0
7239,TEST,0,0
7240,TEST,0,0
7241,TEST,0,0
7242,TEST,0,0
7243,TEST,0,0
7244,TEST,0,0
7245,TEST,0,0
7246,TEST,0,0
7247,TEST,0,0
7248,TEST,0,0
7249,TEST,0,0
7250,TEST,0,0
7251,TEST,0,0
7252,TEST,0,0
7253,TEST,0,0
7269,TEST,0,0
7270,TEST,0,0
7271,TEST,0,0
7272,TEST,0,0
7273,TEST,0,0
7274,TEST,0,0
7275,TEST,0,0
7276,TEST,0,0
7277,TEST,0,0
7283,TEST,0,0
7284,TEST,0,0
7312,TEST,0,0
7363,TEST,0,0
7364,TEST,0,0
7365,TEST,0,0
7366,TEST,0,0
7367,TEST,0,0
7375,TEST,0,0
7392,TEST,0,0
7394,TEST,0,0
7395,TEST,0,0
7396,TEST,0,0
7397,TEST,0,0
7398,TEST,0,0
7399,TEST,0,0
7410,TEST,0,0
7411,TEST,0,0
7412,TEST,0,0
7413,TEST,0,0
7414,TEST,0,0
7415,TEST,0,0
7416,TEST,0,0
7417,TEST,0,0
7418,TEST,0,0
7468,TEST,0,0
7469,TEST,0,0
7470,TEST,0,0
7471,TEST,0,0
7472,TEST,0,0
7477,TEST,0,0
7478,TEST,0,0
7499,TEST,0,0
7500,TEST,0,0
7501,TEST,0,0
7502,TEST,0,0
7507,TEST,0,0
7508,TEST,0,0
7509,TEST,0,0
7510,TEST,0,0
7511,TEST,0,0
7515,TEST,0,0
7525,TEST,0,0
7526,TEST,0,0
7527,TEST,0,0
7528,TEST,0,0
7529,TEST,0,0
7530,TEST,0,0
7531,TEST,0,0
7537,TEST,0,0
7553,TEST,0,0
7560,TEST,0,0
7561,TEST,0,0
7562,TEST,0,0
7563,TEST,0,0
7578,TEST,0,0
7588,TEST,0,0
7590,TEST,0,0
7591,TEST,0,0
7592,TEST,0,0
7593,TEST,0,0
7594,TEST,0,0
7595,TEST,0,0
7596,TEST,0,0
7597,TEST,0,0
7598,TEST,0,0
7599,TEST,0,0
7600,TEST,0,0
7604,TEST,0,0
7615,TEST,0,0
7616,TEST,0,0
7617,TEST,0,0
7618,TEST,0,0
7619,TEST,0,0
7622,TEST,0,0
7650,TEST,0,0
7651,TEST,0,0
7655,TEST,0,0
7683,TEST,0,0
7684,TEST,0,0
7696,TEST,0,0
7697,TEST,0,0
7700,TEST,0,0
7701,TEST,0,0
7702,TEST,0,0
7703,TEST,0,0
7740,TEST,0,0
7741,TEST,0,0
7742,TEST,0,0
7743,TEST,0,0
7744,TEST,0,0
7754,TEST,0,0
7755,TEST,0,0
7758,TEST,0,0
7773,TEST,0,0
7791,TEST,0,0
7796,TEST,0,0
7797,TEST,0,0
7798,TEST,0,0
7799,TEST,0,0
7800,TEST,0,0
7801,TEST,0,0
7802,TEST,0,0
7809,TEST,0,0
7823,TEST,0,0
7824,TEST,0,0
7825,TEST,0,0
7826,TEST,0,0
7835,TEST,0,0
7848,TEST,0,0
7849,TEST,0,0
7850,TEST,0,0
7851,TEST,0,0
7852,TEST,0,0
7853,TEST,0,0
7854,TEST,0,0
7855,TEST,0,0
7856,TEST,0,0
7857,TEST,0,0
7858,TEST,0,0
7859,TEST,0,0
7860,TEST,0,0
7861,TEST,0,0
7862,TEST,0,0
7863,TEST,0,0
7864,TEST,0,0
7873,TEST,0,0
7875,TEST,0,0
7876,TEST,0,0
7900,TEST,0,0
7901,TEST,0,0
7902,TEST,0,0
7903,TEST,0,0
7904,TEST,0,0
7905,TEST,0,0
7906,TEST,0,0
7907,TEST,0,0
7932,TEST,0,0
7935,TEST,0,0
7936,TEST,0,0
7937,TEST,0,0
7954,TEST,0,0
7955,TEST,0,0
7956,TEST,0,0
7968,TEST,0,0
7969,TEST,0,0
7992,TEST,0,0
7993,TEST,0,0
7994,TEST,0,0
7995,TEST,0,0
7996,TEST,0,0
7997,TEST,0,0
