{
  "about": {
    "datasetID": "31_urbansound_MIN_METADATA_dataset_SCORE",
    "datasetName": "UrbanSound dataset",
    "description": "The data consists of raw audio files. The audio files are in multiple formats.",
    "citation": "\n@inproceedings{Salamon:UrbanSound:ACMMM:14,\nAddress = {Orlando, FL, USA},\nAuthor = {Salamon, J. and Jacoby, C. and Bello, J. P.},\nBooktitle = {22st {ACM} International Conference on Multimedia ({ACM-MM'14})},\nMonth = {Nov.},\nTitle = {A Dataset and Taxonomy for Urban Sound Research},\nYear = {2014}}\n",
    "license": "Creative Commons Attribution Noncommercial License (by-nc), version 3.0",
    "source": "NYU and www.freesound.org",
    "sourceURI": "https://serv.cusp.nyu.edu/projects/urbansounddataset/",
    "approximateSize": "12 GB",
    "datasetSchemaVersion": "4.0.0",
    "redacted": false,
    "datasetVersion": "4.0.0",
    "digest": "9a0582a2e7d78f2d88a3240845a7452a211abaae5ef8b79ff9d59ec9bb06cd2a"
  },
  "dataResources": [
    {
      "resID": "0",
      "resPath": "media/",
      "resType": "audio",
      "resFormat": {
        "audio/wav": [
          "wav"
        ],
        "audio/aiff": [
          "aif",
          "aiff"
        ],
        "audio/flac": [
          "flac"
        ],
        "audio/ogg": [
          "ogg"
        ],
        "audio/mpeg": [
          "mp3"
        ]
      },
      "isCollection": true
    },
    {
      "resID": "learningData",
      "resPath": "tables/learningData.csv",
      "resType": "table",
      "resFormat": {
        "text/csv": [
          "csv"
        ]
      },
      "columns": [
        {
          "colIndex": 0,
          "colName": "d3mIndex",
          "colType": "integer",
          "role": [
            "index"
          ]
        },
        {
          "colIndex": 1,
          "colName": "filename",
          "colType": "string",
          "role": [
            "attribute"
          ],
          "refersTo": {
            "resID": "0",
            "resObject": "item"
          }
        },
        {
          "colIndex": 2,
          "colName": "start-end-time-slice-of-recording",
          "colType": "realVector",
          "role": [
            "boundaryIndicator",
            "interval"
          ],
          "refersTo": {
            "resID": "learningData",
            "resObject": {
              "columnName": "filename"
            }
          }
        },
        {
          "colIndex": 3,
          "colName": "salience",
          "colType": "real",
          "role": [
            "instanceWeight"
          ]
        }
      ],
      "columnsCount": 5
    }
  ]
}