{
  "about": {
    "datasetID": "124_138_cifar100_1858_dataset_SCORE",
    "datasetName": "cifar100",
    "description": "Image recognition dataset consisting of 60000 32x32 colour images in 100 classes, with 600 images per class.",
    "citation": "@article{krizhevsky2009learning,  title={Learning multiple layers of features from tiny images},  author={Krizhevsky, Alex and Hinton, Geoffrey},  year={2009},  publisher={Technical report, University of Toronto}}",
    "license": "open",
    "source": "University of Toronto",
    "sourceURI": "https://www.cs.toronto.edu/~kriz/cifar.html",
    "datasetSchemaVersion": "4.0.0",
    "redacted": false,
    "datasetVersion": "4.0.0",
    "digest": "db7c8f2491baefe53718027d25dec77148c97a545dd4c5c1f863aad39c3e07e1"
  },
  "dataResources": [
    {
      "resID": "0",
      "resPath": "media/",
      "resType": "image",
      "resFormat": {
        "image/png": [
          "png"
        ]
      },
      "isCollection": true
    },
    {
      "resID": "learningData",
      "resPath": "tables/learningData.csv",
      "resType": "table",
      "resFormat": {
        "text/csv": [
          "csv"
        ]
      },
      "columns": [
        {
          "colIndex": 0,
          "colName": "d3mIndex",
          "colType": "integer",
          "role": [
            "index"
          ]
        },
        {
          "colIndex": 1,
          "colName": "image",
          "colType": "string",
          "role": [
            "attribute"
          ],
          "refersTo": {
            "resID": "0",
            "resObject": "item"
          }
        }
      ],
      "columnsCount": 3
    }
  ]
}