{
  "description": "Metal3Remediation is the Schema for the metal3remediations API.",
  "properties": {
    "apiVersion": {
      "description": "APIVersion defines the versioned schema of this representation of an object. Servers should convert recognized schemas to the latest internal value, and may reject unrecognized values. More info: https://git.k8s.io/community/contributors/devel/sig-architecture/api-conventions.md#resources",
      "type": "string"
    },
    "kind": {
      "description": "Kind is a string value representing the REST resource this object represents. Servers may infer this from the endpoint the client submits requests to. Cannot be updated. In CamelCase. More info: https://git.k8s.io/community/contributors/devel/sig-architecture/api-conventions.md#types-kinds",
      "type": "string"
    },
    "metadata": {
      "type": "object"
    },
    "spec": {
      "description": "Metal3RemediationSpec defines the desired state of Metal3Remediation.",
      "properties": {
        "strategy": {
          "description": "Strategy field defines remediation strategy.",
          "properties": {
            "retryLimit": {
              "description": "Sets maximum number of remediation retries.",
              "type": "integer"
            },
            "timeout": {
              "description": "Sets the timeout between remediation retries.",
              "type": "string"
            },
            "type": {
              "description": "Type of remediation.",
              "type": "string"
            }
          },
          "type": "object",
          "additionalProperties": false
        }
      },
      "type": "object",
      "additionalProperties": false
    },
    "status": {
      "description": "Metal3RemediationStatus defines the observed state of Metal3Remediation.",
      "properties": {
        "lastRemediated": {
          "description": "LastRemediated identifies when the host was last remediated",
          "format": "date-time",
          "type": "string"
        },
        "phase": {
          "description": "Phase represents the current phase of machine remediation. E.g. Pending, Running, Done etc.",
          "type": "string"
        },
        "retryCount": {
          "description": "RetryCount can be used as a counter during the remediation. Field can hold number of reboots etc.",
          "type": "integer"
        }
      },
      "type": "object",
      "additionalProperties": false
    }
  },
  "type": "object"
}
