module gitlab.com/datach17d/infra/midnight-tofu

go 1.20

require (
	github.com/google/go-cmp v0.5.9
	github.com/jinzhu/copier v0.3.5
	github.com/stretchr/testify v1.8.2
	gopkg.in/yaml.v3 v3.0.1
	sigs.k8s.io/kustomize/api v0.13.4
	sigs.k8s.io/kustomize/kyaml v0.14.2
)

require (
	github.com/davecgh/go-spew v1.1.1 // indirect
	github.com/evanphx/json-patch v4.11.0+incompatible // indirect
	github.com/go-errors/errors v1.4.2 // indirect
	github.com/go-openapi/jsonpointer v0.19.6 // indirect
	github.com/go-openapi/jsonreference v0.20.1 // indirect
	github.com/go-openapi/swag v0.22.3 // indirect
	github.com/golang/protobuf v1.5.2 // indirect
	github.com/google/gnostic v0.5.7-v3refs // indirect
	github.com/google/gofuzz v1.1.0 // indirect
	github.com/google/shlex v0.0.0-20191202100458-e7afc7fbc510 // indirect
	github.com/imdario/mergo v0.3.6 // indirect
	github.com/josharian/intern v1.0.0 // indirect
	github.com/kr/text v0.2.0 // indirect
	github.com/mailru/easyjson v0.7.7 // indirect
	github.com/monochromegane/go-gitignore v0.0.0-20200626010858-205db1a8cc00 // indirect
	github.com/pkg/errors v0.9.1 // indirect
	github.com/pmezard/go-difflib v1.0.0 // indirect
	github.com/xlab/treeprint v1.1.0 // indirect
	go.starlark.net v0.0.0-20200306205701-8dd3e2ee1dd5 // indirect
	golang.org/x/sys v0.3.0 // indirect
	google.golang.org/protobuf v1.28.0 // indirect
	gopkg.in/check.v1 v1.0.0-20201130134442-10cb98267c6c // indirect
	gopkg.in/yaml.v2 v2.4.0 // indirect
	k8s.io/kube-openapi v0.0.0-20230109183929-3758b55a6596 // indirect
	sigs.k8s.io/yaml v1.3.0 // indirect
)