{
  "data_qualities": {
    "quality": [
      {
        "name": "AutoCorrelation",
        "value": "0.6465997770345596"
      },
      {
        "name": "CfsSubsetEval_DecisionStumpAUC",
        "value": "0.9138212548505218"
      },
      {
        "name": "CfsSubsetEval_DecisionStumpErrRate",
        "value": "0.1291759465478842"
      },
      {
        "name": "CfsSubsetEval_DecisionStumpKappa",
        "value": "0.653087867000586"
      },
      {
        "name": "CfsSubsetEval_NaiveBayesAUC",
        "value": "0.9138212548505218"
      },
      {
        "name": "CfsSubsetEval_NaiveBayesErrRate",
        "value": "0.1291759465478842"
      },
      {
        "name": "CfsSubsetEval_NaiveBayesKappa",
        "value": "0.653087867000586"
      },
      {
        "name": "CfsSubsetEval_kNN1NAUC",
        "value": "0.9138212548505218"
      },
      {
        "name": "CfsSubsetEval_kNN1NErrRate",
        "value": "0.1291759465478842"
      },
      {
        "name": "CfsSubsetEval_kNN1NKappa",
        "value": "0.653087867000586"
      },
      {
        "name": "ClassEntropy",
        "value": "0.7922141121667599"
      },
      {
        "name": "DecisionStumpAUC",
        "value": "0.8654219270918729"
      },
      {
        "name": "DecisionStumpErrRate",
        "value": "0.1447661469933185"
      },
      {
        "name": "DecisionStumpKappa",
        "value": "0.6195560074563633"
      },
      {
        "name": "Dimensionality",
        "value": "0.043429844097995544"
      },
      {
        "name": "EquivalentNumberOfAtts",
        "value": "44.5903509935042"
      },
      {
        "name": "J48.00001.AUC",
        "value": "0.8783817019183473"
      },
      {
        "name": "J48.00001.ErrRate",
        "value": "0.13808463251670378"
      },
      {
        "name": "J48.00001.Kappa",
        "value": "0.5553958443134813"
      },
      {
        "name": "J48.0001.AUC",
        "value": "0.8783817019183473"
      },
      {
        "name": "J48.0001.ErrRate",
        "value": "0.13808463251670378"
      },
      {
        "name": "J48.0001.Kappa",
        "value": "0.5553958443134813"
      },
      {
        "name": "J48.001.AUC",
        "value": "0.8783817019183473"
      },
      {
        "name": "J48.001.ErrRate",
        "value": "0.13808463251670378"
      },
      {
        "name": "J48.001.Kappa",
        "value": "0.5553958443134813"
      },
      {
        "name": "MajorityClassPercentage",
        "value": "76.16926503340757"
      },
      {
        "name": "MajorityClassSize",
        "value": "684.0"
      },
      {
        "name": "MaxAttributeEntropy",
        "value": "1.8215224482924186"
      },
      {
        "name": "MaxKurtosisOfNumericAtts",
        "value": "13.215477213878724"
      },
      {
        "name": "MaxMeansOfNumericAtts",
        "value": "1263.0946547884187"
      },
      {
        "name": "MaxMutualInformation",
        "value": "0.21212165174936"
      },
      {
        "name": "MaxNominalAttDistinctValues",
        "value": "7.0"
      },
      {
        "name": "MaxSkewnessOfNumericAtts",
        "value": "3.7616019689156888"
      },
      {
        "name": "MaxStdDevOfNumericAtts",
        "value": "1871.3991072665933"
      },
      {
        "name": "MeanAttributeEntropy",
        "value": "0.2515351603742048"
      },
      {
        "name": "MeanKurtosisOfNumericAtts",
        "value": "4.6480244352098286"
      },
      {
        "name": "MeanMeansOfNumericAtts",
        "value": "348.50426818856715"
      },
      {
        "name": "MeanMutualInformation",
        "value": "0.017766491954328133"
      },
      {
        "name": "MeanNoiseToSignalRatio",
        "value": "13.1578405585537"
      },
      {
        "name": "MeanNominalAttDistinctValues",
        "value": "1.5454545454545456"
      },
      {
        "name": "MeanSkewnessOfNumericAtts",
        "value": "2.0269825910719437"
      },
      {
        "name": "MeanStdDevOfNumericAtts",
        "value": "405.17326983791025"
      },
      {
        "name": "MinAttributeEntropy",
        "value": "-0.0"
      },
      {
        "name": "MinKurtosisOfNumericAtts",
        "value": "-0.9723842038435437"
      },
      {
        "name": "MinMeansOfNumericAtts",
        "value": "1.1985489977728285"
      },
      {
        "name": "MinMutualInformation",
        "value": "0.0"
      },
      {
        "name": "MinNominalAttDistinctValues",
        "value": "0.0"
      },
      {
        "name": "MinSkewnessOfNumericAtts",
        "value": "0.07299048442083138"
      },
      {
        "name": "MinStdDevOfNumericAtts",
        "value": "0.871208280971892"
      },
      {
        "name": "MinorityClassPercentage",
        "value": "23.83073496659243"
      },
      {
        "name": "MinorityClassSize",
        "value": "214.0"
      },
      {
        "name": "NaiveBayesAUC",
        "value": "0.8485270809422311"
      },
      {
        "name": "NaiveBayesErrRate",
        "value": "0.22494432071269488"
      },
      {
        "name": "NaiveBayesKappa",
        "value": "0.4586034406599573"
      },
      {
        "name": "NumberOfBinaryFeatures",
        "value": "5.0"
      },
      {
        "name": "NumberOfClasses",
        "value": "2.0"
      },
      {
        "name": "NumberOfFeatures",
        "value": "39.0"
      },
      {
        "name": "NumberOfInstances",
        "value": "898.0"
      },
      {
        "name": "NumberOfInstancesWithMissingValues",
        "value": "898.0"
      },
      {
        "name": "NumberOfMissingValues",
        "value": "22175.0"
      },
      {
        "name": "NumberOfNumericFeatures",
        "value": "6.0"
      },
      {
        "name": "NumberOfSymbolicFeatures",
        "value": "33.0"
      },
      {
        "name": "PercentageOfBinaryFeatures",
        "value": "12.82051282051282"
      },
      {
        "name": "PercentageOfInstancesWithMissingValues",
        "value": "100.0"
      },
      {
        "name": "PercentageOfMissingValues",
        "value": "63.317343384158534"
      },
      {
        "name": "PercentageOfNumericFeatures",
        "value": "15.384615384615385"
      },
      {
        "name": "PercentageOfSymbolicFeatures",
        "value": "84.61538461538461"
      },
      {
        "name": "Quartile1AttributeEntropy",
        "value": "0.0"
      },
      {
        "name": "Quartile1KurtosisOfNumericAtts",
        "value": "-0.40305022089010156"
      },
      {
        "name": "Quartile1MeansOfNumericAtts",
        "value": "3.025695155902005"
      },
      {
        "name": "Quartile1MutualInformation",
        "value": "0.0"
      },
      {
        "name": "Quartile1SkewnessOfNumericAtts",
        "value": "0.967384603629726"
      },
      {
        "name": "Quartile1StdDevOfNumericAtts",
        "value": "10.505435772171138"
      },
      {
        "name": "Quartile2AttributeEntropy",
        "value": "0.0"
      },
      {
        "name": "Quartile2KurtosisOfNumericAtts",
        "value": "1.6372437439142264"
      },
      {
        "name": "Quartile2MeansOfNumericAtts",
        "value": "21.222160356347437"
      },
      {
        "name": "Quartile2MutualInformation",
        "value": "0.0"
      },
      {
        "name": "Quartile2SkewnessOfNumericAtts",
        "value": "1.6547313364025702"
      },
      {
        "name": "Quartile2StdDevOfNumericAtts",
        "value": "69.85338529046133"
      },
      {
        "name": "Quartile3AttributeEntropy",
        "value": "0.2385631077559124"
      },
      {
        "name": "Quartile3KurtosisOfNumericAtts",
        "value": "12.741748058445403"
      },
      {
        "name": "Quartile3MeansOfNumericAtts",
        "value": "901.2636692650334"
      },
      {
        "name": "Quartile3MutualInformation",
        "value": "0.0077942301383525"
      },
      {
        "name": "Quartile3SkewnessOfNumericAtts",
        "value": "3.7546438249219056"
      },
      {
        "name": "Quartile3StdDevOfNumericAtts",
        "value": "771.8590427889504"
      },
      {
        "name": "REPTreeDepth1AUC",
        "value": "0.9579411484205244"
      },
      {
        "name": "REPTreeDepth1ErrRate",
        "value": "0.10579064587973273"
      },
      {
        "name": "REPTreeDepth1Kappa",
        "value": "0.695388878176975"
      },
      {
        "name": "REPTreeDepth2AUC",
        "value": "0.9579411484205244"
      },
      {
        "name": "REPTreeDepth2ErrRate",
        "value": "0.10579064587973273"
      },
      {
        "name": "REPTreeDepth2Kappa",
        "value": "0.695388878176975"
      },
      {
        "name": "REPTreeDepth3AUC",
        "value": "0.9579411484205244"
      },
      {
        "name": "REPTreeDepth3ErrRate",
        "value": "0.10579064587973273"
      },
      {
        "name": "REPTreeDepth3Kappa",
        "value": "0.695388878176975"
      },
      {
        "name": "RandomTreeDepth1AUC",
        "value": "0.8996861120879408"
      },
      {
        "name": "RandomTreeDepth1ErrRate",
        "value": "0.10133630289532294"
      },
      {
        "name": "RandomTreeDepth1Kappa",
        "value": "0.710160245724298"
      },
      {
        "name": "RandomTreeDepth2AUC",
        "value": "0.8996861120879408"
      },
      {
        "name": "RandomTreeDepth2ErrRate",
        "value": "0.10133630289532294"
      },
      {
        "name": "RandomTreeDepth2Kappa",
        "value": "0.710160245724298"
      },
      {
        "name": "RandomTreeDepth3AUC",
        "value": "0.8996861120879408"
      },
      {
        "name": "RandomTreeDepth3ErrRate",
        "value": "0.10133630289532294"
      },
      {
        "name": "RandomTreeDepth3Kappa",
        "value": "0.710160245724298"
      },
      {
        "name": "StdvNominalAttDistinctValues",
        "value": "1.4381174563233066"
      },
      {
        "name": "kNN1NAUC",
        "value": "0.880038394272285"
      },
      {
        "name": "kNN1NErrRate",
        "value": "0.05790645879732739"
      },
      {
        "name": "kNN1NKappa",
        "value": "0.8289598991985702"
      }
    ]
  }
}