{
  "data_qualities": {
    "quality": [
      {
        "name": "AutoCorrelation",
        "value": "0.9932885906040269"
      },
      {
        "name": "CfsSubsetEval_DecisionStumpAUC",
        "value": "0.99"
      },
      {
        "name": "CfsSubsetEval_DecisionStumpErrRate",
        "value": "0.006666666666666667"
      },
      {
        "name": "CfsSubsetEval_DecisionStumpKappa",
        "value": "0.9849246231155778"
      },
      {
        "name": "CfsSubsetEval_NaiveBayesAUC",
        "value": "0.99"
      },
      {
        "name": "CfsSubsetEval_NaiveBayesErrRate",
        "value": "0.006666666666666667"
      },
      {
        "name": "CfsSubsetEval_NaiveBayesKappa",
        "value": "0.9849246231155778"
      },
      {
        "name": "CfsSubsetEval_kNN1NAUC",
        "value": "0.99"
      },
      {
        "name": "CfsSubsetEval_kNN1NErrRate",
        "value": "0.006666666666666667"
      },
      {
        "name": "CfsSubsetEval_kNN1NKappa",
        "value": "0.9849246231155778"
      },
      {
        "name": "ClassEntropy",
        "value": "0.9182958340544896"
      },
      {
        "name": "DecisionStumpAUC",
        "value": "1.0"
      },
      {
        "name": "DecisionStumpErrRate",
        "value": "0.0"
      },
      {
        "name": "DecisionStumpKappa",
        "value": "1.0"
      },
      {
        "name": "Dimensionality",
        "value": "0.03333333333333333"
      },
      {
        "name": "EquivalentNumberOfAtts",
        "value": []
      },
      {
        "name": "J48.00001.AUC",
        "value": "0.99"
      },
      {
        "name": "J48.00001.ErrRate",
        "value": "0.006666666666666667"
      },
      {
        "name": "J48.00001.Kappa",
        "value": "0.9849246231155778"
      },
      {
        "name": "J48.0001.AUC",
        "value": "0.99"
      },
      {
        "name": "J48.0001.ErrRate",
        "value": "0.006666666666666667"
      },
      {
        "name": "J48.0001.Kappa",
        "value": "0.9849246231155778"
      },
      {
        "name": "J48.001.AUC",
        "value": "0.99"
      },
      {
        "name": "J48.001.ErrRate",
        "value": "0.006666666666666667"
      },
      {
        "name": "J48.001.Kappa",
        "value": "0.9849246231155778"
      },
      {
        "name": "MajorityClassPercentage",
        "value": "66.66666666666666"
      },
      {
        "name": "MajorityClassSize",
        "value": "100.0"
      },
      {
        "name": "MaxAttributeEntropy",
        "value": []
      },
      {
        "name": "MaxKurtosisOfNumericAtts",
        "value": "0.2907810623654319"
      },
      {
        "name": "MaxMeansOfNumericAtts",
        "value": "5.843333333333334"
      },
      {
        "name": "MaxMutualInformation",
        "value": []
      },
      {
        "name": "MaxNominalAttDistinctValues",
        "value": "2.0"
      },
      {
        "name": "MaxSkewnessOfNumericAtts",
        "value": "0.33405266217208907"
      },
      {
        "name": "MaxStdDevOfNumericAtts",
        "value": "1.7644204199522626"
      },
      {
        "name": "MeanAttributeEntropy",
        "value": []
      },
      {
        "name": "MeanKurtosisOfNumericAtts",
        "value": "-0.7507394876837399"
      },
      {
        "name": "MeanMeansOfNumericAtts",
        "value": "3.4636666666666667"
      },
      {
        "name": "MeanMutualInformation",
        "value": []
      },
      {
        "name": "MeanNoiseToSignalRatio",
        "value": []
      },
      {
        "name": "MeanNominalAttDistinctValues",
        "value": "2.0"
      },
      {
        "name": "MeanSkewnessOfNumericAtts",
        "value": "0.067375701047788"
      },
      {
        "name": "MeanStdDevOfNumericAtts",
        "value": "0.9473104002482851"
      },
      {
        "name": "MinAttributeEntropy",
        "value": []
      },
      {
        "name": "MinKurtosisOfNumericAtts",
        "value": "-1.401920800645399"
      },
      {
        "name": "MinMeansOfNumericAtts",
        "value": "1.1986666666666665"
      },
      {
        "name": "MinMutualInformation",
        "value": []
      },
      {
        "name": "MinNominalAttDistinctValues",
        "value": "2.0"
      },
      {
        "name": "MinSkewnessOfNumericAtts",
        "value": "-0.2744642524737837"
      },
      {
        "name": "MinStdDevOfNumericAtts",
        "value": "0.43359431136217386"
      },
      {
        "name": "MinorityClassPercentage",
        "value": "33.33333333333333"
      },
      {
        "name": "MinorityClassSize",
        "value": "50.0"
      },
      {
        "name": "NaiveBayesAUC",
        "value": "1.0"
      },
      {
        "name": "NaiveBayesErrRate",
        "value": "0.0"
      },
      {
        "name": "NaiveBayesKappa",
        "value": "1.0"
      },
      {
        "name": "NumberOfBinaryFeatures",
        "value": "1.0"
      },
      {
        "name": "NumberOfClasses",
        "value": "2.0"
      },
      {
        "name": "NumberOfFeatures",
        "value": "5.0"
      },
      {
        "name": "NumberOfInstances",
        "value": "150.0"
      },
      {
        "name": "NumberOfInstancesWithMissingValues",
        "value": "0.0"
      },
      {
        "name": "NumberOfMissingValues",
        "value": "0.0"
      },
      {
        "name": "NumberOfNumericFeatures",
        "value": "4.0"
      },
      {
        "name": "NumberOfSymbolicFeatures",
        "value": "1.0"
      },
      {
        "name": "PercentageOfBinaryFeatures",
        "value": "20.0"
      },
      {
        "name": "PercentageOfInstancesWithMissingValues",
        "value": "0.0"
      },
      {
        "name": "PercentageOfMissingValues",
        "value": "0.0"
      },
      {
        "name": "PercentageOfNumericFeatures",
        "value": "80.0"
      },
      {
        "name": "PercentageOfSymbolicFeatures",
        "value": "20.0"
      },
      {
        "name": "Quartile1AttributeEntropy",
        "value": []
      },
      {
        "name": "Quartile1KurtosisOfNumericAtts",
        "value": "-1.3863791432688857"
      },
      {
        "name": "Quartile1MeansOfNumericAtts",
        "value": "1.6624999999999999"
      },
      {
        "name": "Quartile1MutualInformation",
        "value": []
      },
      {
        "name": "Quartile1SkewnessOfNumericAtts",
        "value": "-0.2320973298913695"
      },
      {
        "name": "Quartile1StdDevOfNumericAtts",
        "value": "0.5159859189468406"
      },
      {
        "name": "Quartile2AttributeEntropy",
        "value": []
      },
      {
        "name": "Quartile2KurtosisOfNumericAtts",
        "value": "-0.9459091062274964"
      },
      {
        "name": "Quartile2MeansOfNumericAtts",
        "value": "3.406333333333333"
      },
      {
        "name": "Quartile2MutualInformation",
        "value": []
      },
      {
        "name": "Quartile2SkewnessOfNumericAtts",
        "value": "0.10495719724642329"
      },
      {
        "name": "Quartile2StdDevOfNumericAtts",
        "value": "0.795613434839352"
      },
      {
        "name": "Quartile3AttributeEntropy",
        "value": []
      },
      {
        "name": "Quartile3KurtosisOfNumericAtts",
        "value": "0.08006978644516216"
      },
      {
        "name": "Quartile3MeansOfNumericAtts",
        "value": "5.322166666666667"
      },
      {
        "name": "Quartile3MutualInformation",
        "value": []
      },
      {
        "name": "Quartile3SkewnessOfNumericAtts",
        "value": "0.32926723578831013"
      },
      {
        "name": "Quartile3StdDevOfNumericAtts",
        "value": "1.5303318469586626"
      },
      {
        "name": "REPTreeDepth1AUC",
        "value": "1.0"
      },
      {
        "name": "REPTreeDepth1ErrRate",
        "value": "0.0"
      },
      {
        "name": "REPTreeDepth1Kappa",
        "value": "1.0"
      },
      {
        "name": "REPTreeDepth2AUC",
        "value": "1.0"
      },
      {
        "name": "REPTreeDepth2ErrRate",
        "value": "0.0"
      },
      {
        "name": "REPTreeDepth2Kappa",
        "value": "1.0"
      },
      {
        "name": "REPTreeDepth3AUC",
        "value": "1.0"
      },
      {
        "name": "REPTreeDepth3ErrRate",
        "value": "0.0"
      },
      {
        "name": "REPTreeDepth3Kappa",
        "value": "1.0"
      },
      {
        "name": "RandomTreeDepth1AUC",
        "value": "1.0"
      },
      {
        "name": "RandomTreeDepth1ErrRate",
        "value": "0.0"
      },
      {
        "name": "RandomTreeDepth1Kappa",
        "value": "1.0"
      },
      {
        "name": "RandomTreeDepth2AUC",
        "value": "1.0"
      },
      {
        "name": "RandomTreeDepth2ErrRate",
        "value": "0.0"
      },
      {
        "name": "RandomTreeDepth2Kappa",
        "value": "1.0"
      },
      {
        "name": "RandomTreeDepth3AUC",
        "value": "1.0"
      },
      {
        "name": "RandomTreeDepth3ErrRate",
        "value": "0.0"
      },
      {
        "name": "RandomTreeDepth3Kappa",
        "value": "1.0"
      },
      {
        "name": "StdvNominalAttDistinctValues",
        "value": "0.0"
      },
      {
        "name": "kNN1NAUC",
        "value": "1.0"
      },
      {
        "name": "kNN1NErrRate",
        "value": "0.0"
      },
      {
        "name": "kNN1NKappa",
        "value": "1.0"
      }
    ]
  }
}