{
  "data_set_description": {
    "default_target_attribute": "binaryClass",
    "description": "**Author**:   \n**Source**: Unknown - Date unknown  \n**Please cite**:   \n\nBinarized version of the original data set (see version 1). It converts the numeric target feature to a two-class nominal target feature by computing the mean and classifying all instances with a lower target value as positive ('P') and all others as negative ('N'). Originally converted by Quan Sun.",
    "description_version": "1",
    "file_id": "53482",
    "format": "ARFF",
    "id": "948",
    "licence": "Public",
    "md5_checksum": "5ed0e432b58373e1978bde938fb3db21",
    "minio_url": "https://data.openml.org/datasets/0000/0948/dataset_948.pq",
    "name": "quake",
    "parquet_url": "https://data.openml.org/datasets/0000/0948/dataset_948.pq",
    "processing_date": "2020-11-20 20:26:00",
    "status": "deactivated",
    "tag": [
      "mythbusting_1",
      "study_1",
      "study_41",
      "study_7"
    ],
    "upload_date": "2014-10-04T22:16:47",
    "url": "https://api.openml.org/data/v1/download/53482/quake.arff",
    "version": "4",
    "visibility": "public"
  }
}