{
  "data_qualities": {
    "quality": [
      {
        "name": "AutoCorrelation",
        "value": "0.5117133670188333"
      },
      {
        "name": "CfsSubsetEval_DecisionStumpAUC",
        "value": "0.4995352195991365"
      },
      {
        "name": "CfsSubsetEval_DecisionStumpErrRate",
        "value": "0.44490358126721763"
      },
      {
        "name": "CfsSubsetEval_DecisionStumpKappa",
        "value": "0.0"
      },
      {
        "name": "CfsSubsetEval_NaiveBayesAUC",
        "value": "0.4995352195991365"
      },
      {
        "name": "CfsSubsetEval_NaiveBayesErrRate",
        "value": "0.44490358126721763"
      },
      {
        "name": "CfsSubsetEval_NaiveBayesKappa",
        "value": "0.0"
      },
      {
        "name": "CfsSubsetEval_kNN1NAUC",
        "value": "0.4995352195991365"
      },
      {
        "name": "CfsSubsetEval_kNN1NErrRate",
        "value": "0.44490358126721763"
      },
      {
        "name": "CfsSubsetEval_kNN1NKappa",
        "value": "0.0"
      },
      {
        "name": "ClassEntropy",
        "value": "0.9912232530606148"
      },
      {
        "name": "DecisionStumpAUC",
        "value": "0.5010123591467844"
      },
      {
        "name": "DecisionStumpErrRate",
        "value": "0.4825528007346189"
      },
      {
        "name": "DecisionStumpKappa",
        "value": "4.034930973859754E-4"
      },
      {
        "name": "Dimensionality",
        "value": "0.0018365472910927456"
      },
      {
        "name": "EquivalentNumberOfAtts",
        "value": []
      },
      {
        "name": "J48.00001.AUC",
        "value": "0.5035509393344209"
      },
      {
        "name": "J48.00001.ErrRate",
        "value": "0.47107438016528924"
      },
      {
        "name": "J48.00001.Kappa",
        "value": "0.004461290486411652"
      },
      {
        "name": "J48.0001.AUC",
        "value": "0.5035509393344209"
      },
      {
        "name": "J48.0001.ErrRate",
        "value": "0.47107438016528924"
      },
      {
        "name": "J48.0001.Kappa",
        "value": "0.004461290486411652"
      },
      {
        "name": "J48.001.AUC",
        "value": "0.5035509393344209"
      },
      {
        "name": "J48.001.ErrRate",
        "value": "0.47107438016528924"
      },
      {
        "name": "J48.001.Kappa",
        "value": "0.004461290486411652"
      },
      {
        "name": "MajorityClassPercentage",
        "value": "55.509641873278234"
      },
      {
        "name": "MajorityClassSize",
        "value": "1209.0"
      },
      {
        "name": "MaxAttributeEntropy",
        "value": []
      },
      {
        "name": "MaxKurtosisOfNumericAtts",
        "value": "10.796760983139114"
      },
      {
        "name": "MaxMeansOfNumericAtts",
        "value": "74.35996326905416"
      },
      {
        "name": "MaxMutualInformation",
        "value": []
      },
      {
        "name": "MaxNominalAttDistinctValues",
        "value": "2.0"
      },
      {
        "name": "MaxSkewnessOfNumericAtts",
        "value": "3.275952385239734"
      },
      {
        "name": "MaxStdDevOfNumericAtts",
        "value": "118.87558082656727"
      },
      {
        "name": "MeanAttributeEntropy",
        "value": []
      },
      {
        "name": "MeanKurtosisOfNumericAtts",
        "value": "3.057796984167828"
      },
      {
        "name": "MeanMeansOfNumericAtts",
        "value": "45.74559840832568"
      },
      {
        "name": "MeanMutualInformation",
        "value": []
      },
      {
        "name": "MeanNoiseToSignalRatio",
        "value": []
      },
      {
        "name": "MeanNominalAttDistinctValues",
        "value": "2.0"
      },
      {
        "name": "MeanSkewnessOfNumericAtts",
        "value": "0.8213343906829855"
      },
      {
        "name": "MeanStdDevOfNumericAtts",
        "value": "88.62965349379155"
      },
      {
        "name": "MinAttributeEntropy",
        "value": []
      },
      {
        "name": "MinKurtosisOfNumericAtts",
        "value": "-0.8153019350336588"
      },
      {
        "name": "MinMeansOfNumericAtts",
        "value": "7.961997245179062"
      },
      {
        "name": "MinMutualInformation",
        "value": []
      },
      {
        "name": "MinNominalAttDistinctValues",
        "value": "2.0"
      },
      {
        "name": "MinSkewnessOfNumericAtts",
        "value": "-0.8578739656544061"
      },
      {
        "name": "MinStdDevOfNumericAtts",
        "value": "30.54558272757609"
      },
      {
        "name": "MinorityClassPercentage",
        "value": "44.490358126721766"
      },
      {
        "name": "MinorityClassSize",
        "value": "969.0"
      },
      {
        "name": "NaiveBayesAUC",
        "value": "0.5050741728061213"
      },
      {
        "name": "NaiveBayesErrRate",
        "value": "0.4641873278236915"
      },
      {
        "name": "NaiveBayesKappa",
        "value": "3.105361652053346E-4"
      },
      {
        "name": "NumberOfBinaryFeatures",
        "value": "1.0"
      },
      {
        "name": "NumberOfClasses",
        "value": "2.0"
      },
      {
        "name": "NumberOfFeatures",
        "value": "4.0"
      },
      {
        "name": "NumberOfInstances",
        "value": "2178.0"
      },
      {
        "name": "NumberOfInstancesWithMissingValues",
        "value": "0.0"
      },
      {
        "name": "NumberOfMissingValues",
        "value": "0.0"
      },
      {
        "name": "NumberOfNumericFeatures",
        "value": "3.0"
      },
      {
        "name": "NumberOfSymbolicFeatures",
        "value": "1.0"
      },
      {
        "name": "PercentageOfBinaryFeatures",
        "value": "25.0"
      },
      {
        "name": "PercentageOfInstancesWithMissingValues",
        "value": "0.0"
      },
      {
        "name": "PercentageOfMissingValues",
        "value": "0.0"
      },
      {
        "name": "PercentageOfNumericFeatures",
        "value": "75.0"
      },
      {
        "name": "PercentageOfSymbolicFeatures",
        "value": "25.0"
      },
      {
        "name": "Quartile1AttributeEntropy",
        "value": []
      },
      {
        "name": "Quartile1KurtosisOfNumericAtts",
        "value": "-0.8153019350336588"
      },
      {
        "name": "Quartile1MeansOfNumericAtts",
        "value": "7.961997245179062"
      },
      {
        "name": "Quartile1MutualInformation",
        "value": []
      },
      {
        "name": "Quartile1SkewnessOfNumericAtts",
        "value": "-0.8578739656544061"
      },
      {
        "name": "Quartile1StdDevOfNumericAtts",
        "value": "30.54558272757609"
      },
      {
        "name": "Quartile2AttributeEntropy",
        "value": []
      },
      {
        "name": "Quartile2KurtosisOfNumericAtts",
        "value": "-0.8080680956019717"
      },
      {
        "name": "Quartile2MeansOfNumericAtts",
        "value": "54.914834710743804"
      },
      {
        "name": "Quartile2MutualInformation",
        "value": []
      },
      {
        "name": "Quartile2SkewnessOfNumericAtts",
        "value": "0.045924752463628475"
      },
      {
        "name": "Quartile2StdDevOfNumericAtts",
        "value": "116.46779692723128"
      },
      {
        "name": "Quartile3AttributeEntropy",
        "value": []
      },
      {
        "name": "Quartile3KurtosisOfNumericAtts",
        "value": "10.796760983139114"
      },
      {
        "name": "Quartile3MeansOfNumericAtts",
        "value": "74.35996326905416"
      },
      {
        "name": "Quartile3MutualInformation",
        "value": []
      },
      {
        "name": "Quartile3SkewnessOfNumericAtts",
        "value": "3.275952385239734"
      },
      {
        "name": "Quartile3StdDevOfNumericAtts",
        "value": "118.87558082656727"
      },
      {
        "name": "REPTreeDepth1AUC",
        "value": "0.5068547640204486"
      },
      {
        "name": "REPTreeDepth1ErrRate",
        "value": "0.47520661157024796"
      },
      {
        "name": "REPTreeDepth1Kappa",
        "value": "0.026032606864084557"
      },
      {
        "name": "REPTreeDepth2AUC",
        "value": "0.5068547640204486"
      },
      {
        "name": "REPTreeDepth2ErrRate",
        "value": "0.47520661157024796"
      },
      {
        "name": "REPTreeDepth2Kappa",
        "value": "0.026032606864084557"
      },
      {
        "name": "REPTreeDepth3AUC",
        "value": "0.5068547640204486"
      },
      {
        "name": "REPTreeDepth3ErrRate",
        "value": "0.47520661157024796"
      },
      {
        "name": "REPTreeDepth3Kappa",
        "value": "0.026032606864084557"
      },
      {
        "name": "RandomTreeDepth1AUC",
        "value": "0.4917875991979657"
      },
      {
        "name": "RandomTreeDepth1ErrRate",
        "value": "0.5009182736455464"
      },
      {
        "name": "RandomTreeDepth1Kappa",
        "value": "-0.015503080871926516"
      },
      {
        "name": "RandomTreeDepth2AUC",
        "value": "0.4917875991979657"
      },
      {
        "name": "RandomTreeDepth2ErrRate",
        "value": "0.5009182736455464"
      },
      {
        "name": "RandomTreeDepth2Kappa",
        "value": "-0.015503080871926516"
      },
      {
        "name": "RandomTreeDepth3AUC",
        "value": "0.4917875991979657"
      },
      {
        "name": "RandomTreeDepth3ErrRate",
        "value": "0.5009182736455464"
      },
      {
        "name": "RandomTreeDepth3Kappa",
        "value": "-0.015503080871926516"
      },
      {
        "name": "StdvNominalAttDistinctValues",
        "value": "0.0"
      },
      {
        "name": "kNN1NAUC",
        "value": "0.5141226661749981"
      },
      {
        "name": "kNN1NErrRate",
        "value": "0.4793388429752066"
      },
      {
        "name": "kNN1NKappa",
        "value": "0.02814485045403617"
      }
    ]
  }
}