{
  "data_qualities": {
    "quality": [
      {
        "name": "AutoCorrelation",
        "value": "0.5070140280561122"
      },
      {
        "name": "CfsSubsetEval_DecisionStumpAUC",
        "value": "0.8481231676252423"
      },
      {
        "name": "CfsSubsetEval_DecisionStumpErrRate",
        "value": "0.182"
      },
      {
        "name": "CfsSubsetEval_DecisionStumpKappa",
        "value": "0.6330408413446027"
      },
      {
        "name": "CfsSubsetEval_NaiveBayesAUC",
        "value": "0.8481231676252423"
      },
      {
        "name": "CfsSubsetEval_NaiveBayesErrRate",
        "value": "0.182"
      },
      {
        "name": "CfsSubsetEval_NaiveBayesKappa",
        "value": "0.6330408413446027"
      },
      {
        "name": "CfsSubsetEval_kNN1NAUC",
        "value": "0.8481231676252423"
      },
      {
        "name": "CfsSubsetEval_kNN1NErrRate",
        "value": "0.182"
      },
      {
        "name": "CfsSubsetEval_kNN1NKappa",
        "value": "0.6330408413446027"
      },
      {
        "name": "ClassEntropy",
        "value": "0.9990649315776107"
      },
      {
        "name": "DecisionStumpAUC",
        "value": "0.702750764991429"
      },
      {
        "name": "DecisionStumpErrRate",
        "value": "0.326"
      },
      {
        "name": "DecisionStumpKappa",
        "value": "0.34987236758136575"
      },
      {
        "name": "Dimensionality",
        "value": "0.022"
      },
      {
        "name": "EquivalentNumberOfAtts",
        "value": []
      },
      {
        "name": "J48.00001.AUC",
        "value": "0.8067495474134478"
      },
      {
        "name": "J48.00001.ErrRate",
        "value": "0.218"
      },
      {
        "name": "J48.00001.Kappa",
        "value": "0.5629931361857721"
      },
      {
        "name": "J48.0001.AUC",
        "value": "0.8067495474134478"
      },
      {
        "name": "J48.0001.ErrRate",
        "value": "0.218"
      },
      {
        "name": "J48.0001.Kappa",
        "value": "0.5629931361857721"
      },
      {
        "name": "J48.001.AUC",
        "value": "0.8067495474134478"
      },
      {
        "name": "J48.001.ErrRate",
        "value": "0.218"
      },
      {
        "name": "J48.001.Kappa",
        "value": "0.5629931361857721"
      },
      {
        "name": "MajorityClassPercentage",
        "value": "51.800000000000004"
      },
      {
        "name": "MajorityClassSize",
        "value": "259.0"
      },
      {
        "name": "MaxAttributeEntropy",
        "value": []
      },
      {
        "name": "MaxKurtosisOfNumericAtts",
        "value": "-1.0860752733939856"
      },
      {
        "name": "MaxMeansOfNumericAtts",
        "value": "1.8000000019391392E-8"
      },
      {
        "name": "MaxMutualInformation",
        "value": []
      },
      {
        "name": "MaxNominalAttDistinctValues",
        "value": "2.0"
      },
      {
        "name": "MaxSkewnessOfNumericAtts",
        "value": "0.055102990743927556"
      },
      {
        "name": "MaxStdDevOfNumericAtts",
        "value": "1.0000000554924162"
      },
      {
        "name": "MeanAttributeEntropy",
        "value": []
      },
      {
        "name": "MeanKurtosisOfNumericAtts",
        "value": "-1.1805504366437123"
      },
      {
        "name": "MeanMeansOfNumericAtts",
        "value": "-2.3999999912455158E-9"
      },
      {
        "name": "MeanMutualInformation",
        "value": []
      },
      {
        "name": "MeanNoiseToSignalRatio",
        "value": []
      },
      {
        "name": "MeanNominalAttDistinctValues",
        "value": "2.0"
      },
      {
        "name": "MeanSkewnessOfNumericAtts",
        "value": "-0.031020455911016202"
      },
      {
        "name": "MeanStdDevOfNumericAtts",
        "value": "1.0000000295201934"
      },
      {
        "name": "MinAttributeEntropy",
        "value": []
      },
      {
        "name": "MinKurtosisOfNumericAtts",
        "value": "-1.2754259092232612"
      },
      {
        "name": "MinMeansOfNumericAtts",
        "value": "-1.9999999958164593E-8"
      },
      {
        "name": "MinMutualInformation",
        "value": []
      },
      {
        "name": "MinNominalAttDistinctValues",
        "value": "2.0"
      },
      {
        "name": "MinSkewnessOfNumericAtts",
        "value": "-0.09782787598055995"
      },
      {
        "name": "MinStdDevOfNumericAtts",
        "value": "1.00000001493252"
      },
      {
        "name": "MinorityClassPercentage",
        "value": "48.199999999999996"
      },
      {
        "name": "MinorityClassSize",
        "value": "241.0"
      },
      {
        "name": "NaiveBayesAUC",
        "value": "0.8946795046380108"
      },
      {
        "name": "NaiveBayesErrRate",
        "value": "0.198"
      },
      {
        "name": "NaiveBayesKappa",
        "value": "0.6034289376702452"
      },
      {
        "name": "NumberOfBinaryFeatures",
        "value": "1.0"
      },
      {
        "name": "NumberOfClasses",
        "value": "2.0"
      },
      {
        "name": "NumberOfFeatures",
        "value": "11.0"
      },
      {
        "name": "NumberOfInstances",
        "value": "500.0"
      },
      {
        "name": "NumberOfInstancesWithMissingValues",
        "value": "0.0"
      },
      {
        "name": "NumberOfMissingValues",
        "value": "0.0"
      },
      {
        "name": "NumberOfNumericFeatures",
        "value": "10.0"
      },
      {
        "name": "NumberOfSymbolicFeatures",
        "value": "1.0"
      },
      {
        "name": "PercentageOfBinaryFeatures",
        "value": "9.090909090909092"
      },
      {
        "name": "PercentageOfInstancesWithMissingValues",
        "value": "0.0"
      },
      {
        "name": "PercentageOfMissingValues",
        "value": "0.0"
      },
      {
        "name": "PercentageOfNumericFeatures",
        "value": "90.9090909090909"
      },
      {
        "name": "PercentageOfSymbolicFeatures",
        "value": "9.090909090909092"
      },
      {
        "name": "Quartile1AttributeEntropy",
        "value": []
      },
      {
        "name": "Quartile1KurtosisOfNumericAtts",
        "value": "-1.2072067649601719"
      },
      {
        "name": "Quartile1MeansOfNumericAtts",
        "value": "-1.3999999962543974E-8"
      },
      {
        "name": "Quartile1MutualInformation",
        "value": []
      },
      {
        "name": "Quartile1SkewnessOfNumericAtts",
        "value": "-0.07426282945799373"
      },
      {
        "name": "Quartile1StdDevOfNumericAtts",
        "value": "1.000000017950335"
      },
      {
        "name": "Quartile2AttributeEntropy",
        "value": []
      },
      {
        "name": "Quartile2KurtosisOfNumericAtts",
        "value": "-1.1804940817140808"
      },
      {
        "name": "Quartile2MeansOfNumericAtts",
        "value": "-5.000000013535843E-9"
      },
      {
        "name": "Quartile2MutualInformation",
        "value": []
      },
      {
        "name": "Quartile2SkewnessOfNumericAtts",
        "value": "-0.03700745223526898"
      },
      {
        "name": "Quartile2StdDevOfNumericAtts",
        "value": "1.0000000266549784"
      },
      {
        "name": "Quartile3AttributeEntropy",
        "value": []
      },
      {
        "name": "Quartile3KurtosisOfNumericAtts",
        "value": "-1.1455993174243713"
      },
      {
        "name": "Quartile3MeansOfNumericAtts",
        "value": "8.500000010569497E-9"
      },
      {
        "name": "Quartile3MutualInformation",
        "value": []
      },
      {
        "name": "Quartile3SkewnessOfNumericAtts",
        "value": "0.025844011026281043"
      },
      {
        "name": "Quartile3StdDevOfNumericAtts",
        "value": "1.0000000414498085"
      },
      {
        "name": "REPTreeDepth1AUC",
        "value": "0.850245918710649"
      },
      {
        "name": "REPTreeDepth1ErrRate",
        "value": "0.206"
      },
      {
        "name": "REPTreeDepth1Kappa",
        "value": "0.5852527139773863"
      },
      {
        "name": "REPTreeDepth2AUC",
        "value": "0.850245918710649"
      },
      {
        "name": "REPTreeDepth2ErrRate",
        "value": "0.206"
      },
      {
        "name": "REPTreeDepth2Kappa",
        "value": "0.5852527139773863"
      },
      {
        "name": "REPTreeDepth3AUC",
        "value": "0.850245918710649"
      },
      {
        "name": "REPTreeDepth3ErrRate",
        "value": "0.206"
      },
      {
        "name": "REPTreeDepth3Kappa",
        "value": "0.5852527139773863"
      },
      {
        "name": "RandomTreeDepth1AUC",
        "value": "0.789078645925119"
      },
      {
        "name": "RandomTreeDepth1ErrRate",
        "value": "0.21"
      },
      {
        "name": "RandomTreeDepth1Kappa",
        "value": "0.5789085309121244"
      },
      {
        "name": "RandomTreeDepth2AUC",
        "value": "0.789078645925119"
      },
      {
        "name": "RandomTreeDepth2ErrRate",
        "value": "0.21"
      },
      {
        "name": "RandomTreeDepth2Kappa",
        "value": "0.5789085309121244"
      },
      {
        "name": "RandomTreeDepth3AUC",
        "value": "0.789078645925119"
      },
      {
        "name": "RandomTreeDepth3ErrRate",
        "value": "0.21"
      },
      {
        "name": "RandomTreeDepth3Kappa",
        "value": "0.5789085309121244"
      },
      {
        "name": "StdvNominalAttDistinctValues",
        "value": "0.0"
      },
      {
        "name": "kNN1NAUC",
        "value": "0.726926096220702"
      },
      {
        "name": "kNN1NErrRate",
        "value": "0.272"
      },
      {
        "name": "kNN1NKappa",
        "value": "0.4545075326092187"
      }
    ]
  }
}