{
  "data_qualities": {
    "quality": [
      {
        "name": "AutoCorrelation",
        "value": "0.494949494949495"
      },
      {
        "name": "CfsSubsetEval_DecisionStumpAUC",
        "value": "0.6779626623376623"
      },
      {
        "name": "CfsSubsetEval_DecisionStumpErrRate",
        "value": "0.43"
      },
      {
        "name": "CfsSubsetEval_DecisionStumpKappa",
        "value": "0.13793103448275856"
      },
      {
        "name": "CfsSubsetEval_NaiveBayesAUC",
        "value": "0.6779626623376623"
      },
      {
        "name": "CfsSubsetEval_NaiveBayesErrRate",
        "value": "0.43"
      },
      {
        "name": "CfsSubsetEval_NaiveBayesKappa",
        "value": "0.13793103448275856"
      },
      {
        "name": "CfsSubsetEval_kNN1NAUC",
        "value": "0.6779626623376623"
      },
      {
        "name": "CfsSubsetEval_kNN1NErrRate",
        "value": "0.43"
      },
      {
        "name": "CfsSubsetEval_kNN1NKappa",
        "value": "0.13793103448275856"
      },
      {
        "name": "ClassEntropy",
        "value": "0.9895875212220557"
      },
      {
        "name": "DecisionStumpAUC",
        "value": "0.5"
      },
      {
        "name": "DecisionStumpErrRate",
        "value": "0.5"
      },
      {
        "name": "DecisionStumpKappa",
        "value": "0.0"
      },
      {
        "name": "Dimensionality",
        "value": "0.51"
      },
      {
        "name": "EquivalentNumberOfAtts",
        "value": []
      },
      {
        "name": "J48.00001.AUC",
        "value": "0.49756493506493504"
      },
      {
        "name": "J48.00001.ErrRate",
        "value": "0.5"
      },
      {
        "name": "J48.00001.Kappa",
        "value": "-0.009693053311793268"
      },
      {
        "name": "J48.0001.AUC",
        "value": "0.49756493506493504"
      },
      {
        "name": "J48.0001.ErrRate",
        "value": "0.5"
      },
      {
        "name": "J48.0001.Kappa",
        "value": "-0.009693053311793268"
      },
      {
        "name": "J48.001.AUC",
        "value": "0.49756493506493504"
      },
      {
        "name": "J48.001.ErrRate",
        "value": "0.5"
      },
      {
        "name": "J48.001.Kappa",
        "value": "-0.009693053311793268"
      },
      {
        "name": "MajorityClassPercentage",
        "value": "56.00000000000001"
      },
      {
        "name": "MajorityClassSize",
        "value": "56.0"
      },
      {
        "name": "MaxAttributeEntropy",
        "value": []
      },
      {
        "name": "MaxKurtosisOfNumericAtts",
        "value": "2.0843170500521873"
      },
      {
        "name": "MaxMeansOfNumericAtts",
        "value": "5.0000000040295585E-8"
      },
      {
        "name": "MaxMutualInformation",
        "value": []
      },
      {
        "name": "MaxNominalAttDistinctValues",
        "value": "2.0"
      },
      {
        "name": "MaxSkewnessOfNumericAtts",
        "value": "1.5091334744198395"
      },
      {
        "name": "MaxStdDevOfNumericAtts",
        "value": "1.0000000883607831"
      },
      {
        "name": "MeanAttributeEntropy",
        "value": []
      },
      {
        "name": "MeanKurtosisOfNumericAtts",
        "value": "-0.9966348986512485"
      },
      {
        "name": "MeanMeansOfNumericAtts",
        "value": "-1.3999999973778037E-9"
      },
      {
        "name": "MeanMutualInformation",
        "value": []
      },
      {
        "name": "MeanNoiseToSignalRatio",
        "value": []
      },
      {
        "name": "MeanNominalAttDistinctValues",
        "value": "2.0"
      },
      {
        "name": "MeanSkewnessOfNumericAtts",
        "value": "0.10562938848076898"
      },
      {
        "name": "MeanStdDevOfNumericAtts",
        "value": "1.0000000247823984"
      },
      {
        "name": "MinAttributeEntropy",
        "value": []
      },
      {
        "name": "MinKurtosisOfNumericAtts",
        "value": "-1.3653158046412646"
      },
      {
        "name": "MinMeansOfNumericAtts",
        "value": "-9.000000003034359E-8"
      },
      {
        "name": "MinMutualInformation",
        "value": []
      },
      {
        "name": "MinNominalAttDistinctValues",
        "value": "2.0"
      },
      {
        "name": "MinSkewnessOfNumericAtts",
        "value": "-0.36653401494530874"
      },
      {
        "name": "MinStdDevOfNumericAtts",
        "value": "0.9999999582045457"
      },
      {
        "name": "MinorityClassPercentage",
        "value": "44.0"
      },
      {
        "name": "MinorityClassSize",
        "value": "44.0"
      },
      {
        "name": "NaiveBayesAUC",
        "value": "0.4180194805194805"
      },
      {
        "name": "NaiveBayesErrRate",
        "value": "0.52"
      },
      {
        "name": "NaiveBayesKappa",
        "value": "-0.06035889070146834"
      },
      {
        "name": "NumberOfBinaryFeatures",
        "value": "1.0"
      },
      {
        "name": "NumberOfClasses",
        "value": "2.0"
      },
      {
        "name": "NumberOfFeatures",
        "value": "51.0"
      },
      {
        "name": "NumberOfInstances",
        "value": "100.0"
      },
      {
        "name": "NumberOfInstancesWithMissingValues",
        "value": "0.0"
      },
      {
        "name": "NumberOfMissingValues",
        "value": "0.0"
      },
      {
        "name": "NumberOfNumericFeatures",
        "value": "50.0"
      },
      {
        "name": "NumberOfSymbolicFeatures",
        "value": "1.0"
      },
      {
        "name": "PercentageOfBinaryFeatures",
        "value": "1.9607843137254901"
      },
      {
        "name": "PercentageOfInstancesWithMissingValues",
        "value": "0.0"
      },
      {
        "name": "PercentageOfMissingValues",
        "value": "0.0"
      },
      {
        "name": "PercentageOfNumericFeatures",
        "value": "98.0392156862745"
      },
      {
        "name": "PercentageOfSymbolicFeatures",
        "value": "1.9607843137254901"
      },
      {
        "name": "Quartile1AttributeEntropy",
        "value": []
      },
      {
        "name": "Quartile1KurtosisOfNumericAtts",
        "value": "-1.2002829695003152"
      },
      {
        "name": "Quartile1MeansOfNumericAtts",
        "value": "-1.9999999966713313E-8"
      },
      {
        "name": "Quartile1MutualInformation",
        "value": []
      },
      {
        "name": "Quartile1SkewnessOfNumericAtts",
        "value": "-0.036234804717253696"
      },
      {
        "name": "Quartile1StdDevOfNumericAtts",
        "value": "0.999999994833151"
      },
      {
        "name": "Quartile2AttributeEntropy",
        "value": []
      },
      {
        "name": "Quartile2KurtosisOfNumericAtts",
        "value": "-1.111431750905861"
      },
      {
        "name": "Quartile2MeansOfNumericAtts",
        "value": "2.0209528495129803E-17"
      },
      {
        "name": "Quartile2MutualInformation",
        "value": []
      },
      {
        "name": "Quartile2SkewnessOfNumericAtts",
        "value": "0.08990746334646628"
      },
      {
        "name": "Quartile2StdDevOfNumericAtts",
        "value": "1.0000000245238505"
      },
      {
        "name": "Quartile3AttributeEntropy",
        "value": []
      },
      {
        "name": "Quartile3KurtosisOfNumericAtts",
        "value": "-1.0147133196401525"
      },
      {
        "name": "Quartile3MeansOfNumericAtts",
        "value": "1.9999999951308967E-8"
      },
      {
        "name": "Quartile3MutualInformation",
        "value": []
      },
      {
        "name": "Quartile3SkewnessOfNumericAtts",
        "value": "0.1685774553018432"
      },
      {
        "name": "Quartile3StdDevOfNumericAtts",
        "value": "1.0000000481942763"
      },
      {
        "name": "REPTreeDepth1AUC",
        "value": "0.6789772727272728"
      },
      {
        "name": "REPTreeDepth1ErrRate",
        "value": "0.35"
      },
      {
        "name": "REPTreeDepth1Kappa",
        "value": "0.23979148566463954"
      },
      {
        "name": "REPTreeDepth2AUC",
        "value": "0.6789772727272728"
      },
      {
        "name": "REPTreeDepth2ErrRate",
        "value": "0.35"
      },
      {
        "name": "REPTreeDepth2Kappa",
        "value": "0.23979148566463954"
      },
      {
        "name": "REPTreeDepth3AUC",
        "value": "0.6789772727272728"
      },
      {
        "name": "REPTreeDepth3ErrRate",
        "value": "0.35"
      },
      {
        "name": "REPTreeDepth3Kappa",
        "value": "0.23979148566463954"
      },
      {
        "name": "RandomTreeDepth1AUC",
        "value": "0.575487012987013"
      },
      {
        "name": "RandomTreeDepth1ErrRate",
        "value": "0.41"
      },
      {
        "name": "RandomTreeDepth1Kappa",
        "value": "0.1535920726672172"
      },
      {
        "name": "RandomTreeDepth2AUC",
        "value": "0.575487012987013"
      },
      {
        "name": "RandomTreeDepth2ErrRate",
        "value": "0.41"
      },
      {
        "name": "RandomTreeDepth2Kappa",
        "value": "0.1535920726672172"
      },
      {
        "name": "RandomTreeDepth3AUC",
        "value": "0.575487012987013"
      },
      {
        "name": "RandomTreeDepth3ErrRate",
        "value": "0.41"
      },
      {
        "name": "RandomTreeDepth3Kappa",
        "value": "0.1535920726672172"
      },
      {
        "name": "StdvNominalAttDistinctValues",
        "value": "0.0"
      },
      {
        "name": "kNN1NAUC",
        "value": "0.4724025974025974"
      },
      {
        "name": "kNN1NErrRate",
        "value": "0.52"
      },
      {
        "name": "kNN1NKappa",
        "value": "-0.0551948051948052"
      }
    ]
  }
}