{
  "data_set_description": {
    "default_target_attribute": "binaryClass",
    "description": "**Author**:   \n**Source**: Unknown - Date unknown  \n**Please cite**:   \n\nBinarized version of the original data set (see version 1). It converts the numeric target feature to a two-class nominal target feature by computing the mean and classifying all instances with a lower target value as positive ('P') and all others as negative ('N').",
    "description_version": "1",
    "file_id": "53460",
    "format": "ARFF",
    "id": "926",
    "licence": "Public",
    "md5_checksum": "a7e373876fcd8f7dff113427d2d9f7ce",
    "minio_url": "https://data.openml.org/datasets/0000/0926/dataset_926.pq",
    "name": "fri_c0_500_25",
    "parquet_url": "https://data.openml.org/datasets/0000/0926/dataset_926.pq",
    "processing_date": "2020-11-20 20:21:15",
    "status": "active",
    "tag": [
      "binarized_regression_problem",
      "Data Processing",
      "Machine Learning",
      "mythbusting_1",
      "Statistics",
      "study_1",
      "study_127",
      "study_15",
      "study_20",
      "study_41",
      "study_7",
      "study_88"
    ],
    "upload_date": "2014-10-04T14:37:20",
    "url": "https://api.openml.org/data/v1/download/53460/fri_c0_500_25.arff",
    "version": "2",
    "visibility": "public"
  }
}