{
  "data_qualities": {
    "quality": [
      {
        "name": "AutoCorrelation",
        "value": "0.5085085085085085"
      },
      {
        "name": "CfsSubsetEval_DecisionStumpAUC",
        "value": "0.9075595843216988"
      },
      {
        "name": "CfsSubsetEval_DecisionStumpErrRate",
        "value": "0.137"
      },
      {
        "name": "CfsSubsetEval_DecisionStumpKappa",
        "value": "0.7247337753666867"
      },
      {
        "name": "CfsSubsetEval_NaiveBayesAUC",
        "value": "0.9075595843216988"
      },
      {
        "name": "CfsSubsetEval_NaiveBayesErrRate",
        "value": "0.137"
      },
      {
        "name": "CfsSubsetEval_NaiveBayesKappa",
        "value": "0.7247337753666867"
      },
      {
        "name": "CfsSubsetEval_kNN1NAUC",
        "value": "0.9075595843216988"
      },
      {
        "name": "CfsSubsetEval_kNN1NErrRate",
        "value": "0.137"
      },
      {
        "name": "CfsSubsetEval_kNN1NKappa",
        "value": "0.7247337753666867"
      },
      {
        "name": "ClassEntropy",
        "value": "0.9938858724897721"
      },
      {
        "name": "DecisionStumpAUC",
        "value": "0.6826822223297995"
      },
      {
        "name": "DecisionStumpErrRate",
        "value": "0.308"
      },
      {
        "name": "DecisionStumpKappa",
        "value": "0.378972158595993"
      },
      {
        "name": "Dimensionality",
        "value": "0.026"
      },
      {
        "name": "EquivalentNumberOfAtts",
        "value": []
      },
      {
        "name": "J48.00001.AUC",
        "value": "0.8712704329444417"
      },
      {
        "name": "J48.00001.ErrRate",
        "value": "0.139"
      },
      {
        "name": "J48.00001.Kappa",
        "value": "0.7187396297885084"
      },
      {
        "name": "J48.0001.AUC",
        "value": "0.8712704329444417"
      },
      {
        "name": "J48.0001.ErrRate",
        "value": "0.139"
      },
      {
        "name": "J48.0001.Kappa",
        "value": "0.7187396297885084"
      },
      {
        "name": "J48.001.AUC",
        "value": "0.8712704329444417"
      },
      {
        "name": "J48.001.ErrRate",
        "value": "0.139"
      },
      {
        "name": "J48.001.Kappa",
        "value": "0.7187396297885084"
      },
      {
        "name": "MajorityClassPercentage",
        "value": "54.6"
      },
      {
        "name": "MajorityClassSize",
        "value": "546.0"
      },
      {
        "name": "MaxAttributeEntropy",
        "value": []
      },
      {
        "name": "MaxKurtosisOfNumericAtts",
        "value": "-0.7997867396054295"
      },
      {
        "name": "MaxMeansOfNumericAtts",
        "value": "2.1999999992472486E-8"
      },
      {
        "name": "MaxMutualInformation",
        "value": []
      },
      {
        "name": "MaxNominalAttDistinctValues",
        "value": "2.0"
      },
      {
        "name": "MaxSkewnessOfNumericAtts",
        "value": "0.12577027701605425"
      },
      {
        "name": "MaxStdDevOfNumericAtts",
        "value": "1.0000000439368304"
      },
      {
        "name": "MeanAttributeEntropy",
        "value": []
      },
      {
        "name": "MeanKurtosisOfNumericAtts",
        "value": "-1.1782588915118444"
      },
      {
        "name": "MeanMeansOfNumericAtts",
        "value": "-1.5600000114346369E-9"
      },
      {
        "name": "MeanMutualInformation",
        "value": []
      },
      {
        "name": "MeanNoiseToSignalRatio",
        "value": []
      },
      {
        "name": "MeanNominalAttDistinctValues",
        "value": "2.0"
      },
      {
        "name": "MeanSkewnessOfNumericAtts",
        "value": "0.006211504326671189"
      },
      {
        "name": "MeanStdDevOfNumericAtts",
        "value": "1.0000000289220983"
      },
      {
        "name": "MinAttributeEntropy",
        "value": []
      },
      {
        "name": "MinKurtosisOfNumericAtts",
        "value": "-1.2563751242391203"
      },
      {
        "name": "MinMeansOfNumericAtts",
        "value": "-2.3000000040074298E-8"
      },
      {
        "name": "MinMutualInformation",
        "value": []
      },
      {
        "name": "MinNominalAttDistinctValues",
        "value": "2.0"
      },
      {
        "name": "MinSkewnessOfNumericAtts",
        "value": "-0.07323765865124877"
      },
      {
        "name": "MinStdDevOfNumericAtts",
        "value": "1.0000000025524876"
      },
      {
        "name": "MinorityClassPercentage",
        "value": "45.4"
      },
      {
        "name": "MinorityClassSize",
        "value": "454.0"
      },
      {
        "name": "NaiveBayesAUC",
        "value": "0.7069112972196673"
      },
      {
        "name": "NaiveBayesErrRate",
        "value": "0.343"
      },
      {
        "name": "NaiveBayesKappa",
        "value": "0.30750159496717194"
      },
      {
        "name": "NumberOfBinaryFeatures",
        "value": "1.0"
      },
      {
        "name": "NumberOfClasses",
        "value": "2.0"
      },
      {
        "name": "NumberOfFeatures",
        "value": "26.0"
      },
      {
        "name": "NumberOfInstances",
        "value": "1000.0"
      },
      {
        "name": "NumberOfInstancesWithMissingValues",
        "value": "0.0"
      },
      {
        "name": "NumberOfMissingValues",
        "value": "0.0"
      },
      {
        "name": "NumberOfNumericFeatures",
        "value": "25.0"
      },
      {
        "name": "NumberOfSymbolicFeatures",
        "value": "1.0"
      },
      {
        "name": "PercentageOfBinaryFeatures",
        "value": "3.8461538461538463"
      },
      {
        "name": "PercentageOfInstancesWithMissingValues",
        "value": "0.0"
      },
      {
        "name": "PercentageOfMissingValues",
        "value": "0.0"
      },
      {
        "name": "PercentageOfNumericFeatures",
        "value": "96.15384615384616"
      },
      {
        "name": "PercentageOfSymbolicFeatures",
        "value": "3.8461538461538463"
      },
      {
        "name": "Quartile1AttributeEntropy",
        "value": []
      },
      {
        "name": "Quartile1KurtosisOfNumericAtts",
        "value": "-1.2102111086798049"
      },
      {
        "name": "Quartile1MeansOfNumericAtts",
        "value": "-1.0000000008059118E-8"
      },
      {
        "name": "Quartile1MutualInformation",
        "value": []
      },
      {
        "name": "Quartile1SkewnessOfNumericAtts",
        "value": "-0.028541564015037053"
      },
      {
        "name": "Quartile1StdDevOfNumericAtts",
        "value": "1.000000022611291"
      },
      {
        "name": "Quartile2AttributeEntropy",
        "value": []
      },
      {
        "name": "Quartile2KurtosisOfNumericAtts",
        "value": "-1.1911892017278753"
      },
      {
        "name": "Quartile2MeansOfNumericAtts",
        "value": "-4.000000023429706E-9"
      },
      {
        "name": "Quartile2MutualInformation",
        "value": []
      },
      {
        "name": "Quartile2SkewnessOfNumericAtts",
        "value": "0.0032276685319839534"
      },
      {
        "name": "Quartile2StdDevOfNumericAtts",
        "value": "1.0000000315659126"
      },
      {
        "name": "Quartile3AttributeEntropy",
        "value": []
      },
      {
        "name": "Quartile3KurtosisOfNumericAtts",
        "value": "-1.1791426771763125"
      },
      {
        "name": "Quartile3MeansOfNumericAtts",
        "value": "5.999999952654988E-9"
      },
      {
        "name": "Quartile3MutualInformation",
        "value": []
      },
      {
        "name": "Quartile3SkewnessOfNumericAtts",
        "value": "0.029107709187356435"
      },
      {
        "name": "Quartile3StdDevOfNumericAtts",
        "value": "1.0000000362718473"
      },
      {
        "name": "REPTreeDepth1AUC",
        "value": "0.875"
      },
      {
        "name": "REPTreeDepth1ErrRate",
        "value": "0.172"
      },
      {
        "name": "REPTreeDepth1Kappa",
        "value": "0.6495517522412387"
      },
      {
        "name": "REPTreeDepth2AUC",
        "value": "0.875"
      },
      {
        "name": "REPTreeDepth2ErrRate",
        "value": "0.172"
      },
      {
        "name": "REPTreeDepth2Kappa",
        "value": "0.6495517522412387"
      },
      {
        "name": "REPTreeDepth3AUC",
        "value": "0.875"
      },
      {
        "name": "REPTreeDepth3ErrRate",
        "value": "0.172"
      },
      {
        "name": "REPTreeDepth3Kappa",
        "value": "0.6495517522412387"
      },
      {
        "name": "RandomTreeDepth1AUC",
        "value": "0.7619491374997983"
      },
      {
        "name": "RandomTreeDepth1ErrRate",
        "value": "0.233"
      },
      {
        "name": "RandomTreeDepth1Kappa",
        "value": "0.5271263080132811"
      },
      {
        "name": "RandomTreeDepth2AUC",
        "value": "0.7619491374997983"
      },
      {
        "name": "RandomTreeDepth2ErrRate",
        "value": "0.233"
      },
      {
        "name": "RandomTreeDepth2Kappa",
        "value": "0.5271263080132811"
      },
      {
        "name": "RandomTreeDepth3AUC",
        "value": "0.7619491374997983"
      },
      {
        "name": "RandomTreeDepth3ErrRate",
        "value": "0.233"
      },
      {
        "name": "RandomTreeDepth3Kappa",
        "value": "0.5271263080132811"
      },
      {
        "name": "StdvNominalAttDistinctValues",
        "value": "0.0"
      },
      {
        "name": "kNN1NAUC",
        "value": "0.5696212744670895"
      },
      {
        "name": "kNN1NErrRate",
        "value": "0.426"
      },
      {
        "name": "kNN1NKappa",
        "value": "0.13944957093682828"
      }
    ]
  }
}