{
  "data_qualities": {
    "quality": [
      {
        "name": "AutoCorrelation",
        "value": "0.834"
      },
      {
        "name": "CfsSubsetEval_DecisionStumpAUC",
        "value": "0.6892077939461155"
      },
      {
        "name": "CfsSubsetEval_DecisionStumpErrRate",
        "value": "0.16241879060469766"
      },
      {
        "name": "CfsSubsetEval_DecisionStumpKappa",
        "value": "0.4626527885537794"
      },
      {
        "name": "CfsSubsetEval_NaiveBayesAUC",
        "value": "0.6892077939461155"
      },
      {
        "name": "CfsSubsetEval_NaiveBayesErrRate",
        "value": "0.16241879060469766"
      },
      {
        "name": "CfsSubsetEval_NaiveBayesKappa",
        "value": "0.4626527885537794"
      },
      {
        "name": "CfsSubsetEval_kNN1NAUC",
        "value": "0.6892077939461155"
      },
      {
        "name": "CfsSubsetEval_kNN1NErrRate",
        "value": "0.16241879060469766"
      },
      {
        "name": "CfsSubsetEval_kNN1NKappa",
        "value": "0.4626527885537794"
      },
      {
        "name": "ClassEntropy",
        "value": "0.7964999003057881"
      },
      {
        "name": "DecisionStumpAUC",
        "value": "0.7679162148060937"
      },
      {
        "name": "DecisionStumpErrRate",
        "value": "0.24087956021989004"
      },
      {
        "name": "DecisionStumpKappa",
        "value": "0.0"
      },
      {
        "name": "Dimensionality",
        "value": "9.995002498750624E-4"
      },
      {
        "name": "EquivalentNumberOfAtts",
        "value": []
      },
      {
        "name": "J48.00001.AUC",
        "value": "0.6892077939461155"
      },
      {
        "name": "J48.00001.ErrRate",
        "value": "0.16241879060469766"
      },
      {
        "name": "J48.00001.Kappa",
        "value": "0.4626527885537794"
      },
      {
        "name": "J48.0001.AUC",
        "value": "0.6892077939461155"
      },
      {
        "name": "J48.0001.ErrRate",
        "value": "0.16241879060469766"
      },
      {
        "name": "J48.0001.Kappa",
        "value": "0.4626527885537794"
      },
      {
        "name": "J48.001.AUC",
        "value": "0.6892077939461155"
      },
      {
        "name": "J48.001.ErrRate",
        "value": "0.16241879060469766"
      },
      {
        "name": "J48.001.Kappa",
        "value": "0.4626527885537794"
      },
      {
        "name": "MajorityClassPercentage",
        "value": "75.91204397801098"
      },
      {
        "name": "MajorityClassSize",
        "value": "1519.0"
      },
      {
        "name": "MaxAttributeEntropy",
        "value": []
      },
      {
        "name": "MaxKurtosisOfNumericAtts",
        "value": "16.966793966664962"
      },
      {
        "name": "MaxMeansOfNumericAtts",
        "value": "2.0958020989505246"
      },
      {
        "name": "MaxMutualInformation",
        "value": []
      },
      {
        "name": "MaxNominalAttDistinctValues",
        "value": "2.0"
      },
      {
        "name": "MaxSkewnessOfNumericAtts",
        "value": "-2.9163403514068733"
      },
      {
        "name": "MaxStdDevOfNumericAtts",
        "value": "0.1738389162862918"
      },
      {
        "name": "MeanAttributeEntropy",
        "value": []
      },
      {
        "name": "MeanKurtosisOfNumericAtts",
        "value": "16.966793966664962"
      },
      {
        "name": "MeanMeansOfNumericAtts",
        "value": "2.0958020989505246"
      },
      {
        "name": "MeanMutualInformation",
        "value": []
      },
      {
        "name": "MeanNoiseToSignalRatio",
        "value": []
      },
      {
        "name": "MeanNominalAttDistinctValues",
        "value": "2.0"
      },
      {
        "name": "MeanSkewnessOfNumericAtts",
        "value": "-2.9163403514068733"
      },
      {
        "name": "MeanStdDevOfNumericAtts",
        "value": "0.1738389162862918"
      },
      {
        "name": "MinAttributeEntropy",
        "value": []
      },
      {
        "name": "MinKurtosisOfNumericAtts",
        "value": "16.966793966664962"
      },
      {
        "name": "MinMeansOfNumericAtts",
        "value": "2.0958020989505246"
      },
      {
        "name": "MinMutualInformation",
        "value": []
      },
      {
        "name": "MinNominalAttDistinctValues",
        "value": "2.0"
      },
      {
        "name": "MinSkewnessOfNumericAtts",
        "value": "-2.9163403514068733"
      },
      {
        "name": "MinStdDevOfNumericAtts",
        "value": "0.1738389162862918"
      },
      {
        "name": "MinorityClassPercentage",
        "value": "24.087956021989005"
      },
      {
        "name": "MinorityClassSize",
        "value": "482.0"
      },
      {
        "name": "NaiveBayesAUC",
        "value": "0.8563131182067258"
      },
      {
        "name": "NaiveBayesErrRate",
        "value": "0.1619190404797601"
      },
      {
        "name": "NaiveBayesKappa",
        "value": "0.48673541608280324"
      },
      {
        "name": "NumberOfBinaryFeatures",
        "value": "1.0"
      },
      {
        "name": "NumberOfClasses",
        "value": "2.0"
      },
      {
        "name": "NumberOfFeatures",
        "value": "2.0"
      },
      {
        "name": "NumberOfInstances",
        "value": "2001.0"
      },
      {
        "name": "NumberOfInstancesWithMissingValues",
        "value": "0.0"
      },
      {
        "name": "NumberOfMissingValues",
        "value": "0.0"
      },
      {
        "name": "NumberOfNumericFeatures",
        "value": "1.0"
      },
      {
        "name": "NumberOfSymbolicFeatures",
        "value": "1.0"
      },
      {
        "name": "PercentageOfBinaryFeatures",
        "value": "50.0"
      },
      {
        "name": "PercentageOfInstancesWithMissingValues",
        "value": "0.0"
      },
      {
        "name": "PercentageOfMissingValues",
        "value": "0.0"
      },
      {
        "name": "PercentageOfNumericFeatures",
        "value": "50.0"
      },
      {
        "name": "PercentageOfSymbolicFeatures",
        "value": "50.0"
      },
      {
        "name": "Quartile1AttributeEntropy",
        "value": []
      },
      {
        "name": "Quartile1KurtosisOfNumericAtts",
        "value": "16.966793966664962"
      },
      {
        "name": "Quartile1MeansOfNumericAtts",
        "value": "2.0958020989505246"
      },
      {
        "name": "Quartile1MutualInformation",
        "value": []
      },
      {
        "name": "Quartile1SkewnessOfNumericAtts",
        "value": "-2.9163403514068733"
      },
      {
        "name": "Quartile1StdDevOfNumericAtts",
        "value": "0.1738389162862918"
      },
      {
        "name": "Quartile2AttributeEntropy",
        "value": []
      },
      {
        "name": "Quartile2KurtosisOfNumericAtts",
        "value": "16.966793966664962"
      },
      {
        "name": "Quartile2MeansOfNumericAtts",
        "value": "2.0958020989505246"
      },
      {
        "name": "Quartile2MutualInformation",
        "value": []
      },
      {
        "name": "Quartile2SkewnessOfNumericAtts",
        "value": "-2.9163403514068733"
      },
      {
        "name": "Quartile2StdDevOfNumericAtts",
        "value": "0.1738389162862918"
      },
      {
        "name": "Quartile3AttributeEntropy",
        "value": []
      },
      {
        "name": "Quartile3KurtosisOfNumericAtts",
        "value": "16.966793966664962"
      },
      {
        "name": "Quartile3MeansOfNumericAtts",
        "value": "2.0958020989505246"
      },
      {
        "name": "Quartile3MutualInformation",
        "value": []
      },
      {
        "name": "Quartile3SkewnessOfNumericAtts",
        "value": "-2.9163403514068733"
      },
      {
        "name": "Quartile3StdDevOfNumericAtts",
        "value": "0.1738389162862918"
      },
      {
        "name": "REPTreeDepth1AUC",
        "value": "0.8135142960945587"
      },
      {
        "name": "REPTreeDepth1ErrRate",
        "value": "0.16991504247876063"
      },
      {
        "name": "REPTreeDepth1Kappa",
        "value": "0.4760150216112803"
      },
      {
        "name": "REPTreeDepth2AUC",
        "value": "0.8135142960945587"
      },
      {
        "name": "REPTreeDepth2ErrRate",
        "value": "0.16991504247876063"
      },
      {
        "name": "REPTreeDepth2Kappa",
        "value": "0.4760150216112803"
      },
      {
        "name": "REPTreeDepth3AUC",
        "value": "0.8135142960945587"
      },
      {
        "name": "REPTreeDepth3ErrRate",
        "value": "0.16991504247876063"
      },
      {
        "name": "REPTreeDepth3Kappa",
        "value": "0.4760150216112803"
      },
      {
        "name": "RandomTreeDepth1AUC",
        "value": "0.8687271053515772"
      },
      {
        "name": "RandomTreeDepth1ErrRate",
        "value": "0.17641179410294852"
      },
      {
        "name": "RandomTreeDepth1Kappa",
        "value": "0.44759766417740615"
      },
      {
        "name": "RandomTreeDepth2AUC",
        "value": "0.8687271053515772"
      },
      {
        "name": "RandomTreeDepth2ErrRate",
        "value": "0.17641179410294852"
      },
      {
        "name": "RandomTreeDepth2Kappa",
        "value": "0.44759766417740615"
      },
      {
        "name": "RandomTreeDepth3AUC",
        "value": "0.8687271053515772"
      },
      {
        "name": "RandomTreeDepth3ErrRate",
        "value": "0.17641179410294852"
      },
      {
        "name": "RandomTreeDepth3Kappa",
        "value": "0.44759766417740615"
      },
      {
        "name": "StdvNominalAttDistinctValues",
        "value": "0.0"
      },
      {
        "name": "kNN1NAUC",
        "value": "0.8686062298028567"
      },
      {
        "name": "kNN1NErrRate",
        "value": "0.17641179410294852"
      },
      {
        "name": "kNN1NKappa",
        "value": "0.44759766417740615"
      }
    ]
  }
}