{
  "data_set_description": {
    "default_target_attribute": "binaryClass",
    "description": "**Author**:   \n**Source**: Unknown - Date unknown  \n**Please cite**:   \n\nBinarized version of the original data set (see version 1). It converts the numeric target feature to a two-class nominal target feature by computing the mean and classifying all instances with a lower target value as positive ('P') and all others as negative ('N').",
    "description_version": "2",
    "file_id": "53419",
    "format": "ARFF",
    "id": "885",
    "licence": "Public",
    "md5_checksum": "850d3f0900da312332a95e97d02f897e",
    "minio_url": "https://data.openml.org/datasets/0000/0885/dataset_885.pq",
    "name": "transplant",
    "parquet_url": "https://data.openml.org/datasets/0000/0885/dataset_885.pq",
    "processing_date": "2020-11-20 20:19:00",
    "status": "active",
    "tag": [
      "binarized",
      "Healthcare",
      "mythbusting_1",
      "study_1",
      "study_123",
      "study_127",
      "study_15",
      "study_20",
      "study_41",
      "study_7",
      "study_88",
      "trivial"
    ],
    "upload_date": "2014-10-04T14:36:13",
    "url": "https://api.openml.org/data/v1/download/53419/transplant.arff",
    "version": "2",
    "visibility": "public"
  }
}