{
  "data_qualities": {
    "quality": [
      {
        "name": "AutoCorrelation",
        "value": "0.6847826086956522"
      },
      {
        "name": "CfsSubsetEval_DecisionStumpAUC",
        "value": "0.7320197044334975"
      },
      {
        "name": "CfsSubsetEval_DecisionStumpErrRate",
        "value": "0.23655913978494625"
      },
      {
        "name": "CfsSubsetEval_DecisionStumpKappa",
        "value": "0.5126250595521676"
      },
      {
        "name": "CfsSubsetEval_NaiveBayesAUC",
        "value": "0.7320197044334975"
      },
      {
        "name": "CfsSubsetEval_NaiveBayesErrRate",
        "value": "0.23655913978494625"
      },
      {
        "name": "CfsSubsetEval_NaiveBayesKappa",
        "value": "0.5126250595521676"
      },
      {
        "name": "CfsSubsetEval_kNN1NAUC",
        "value": "0.7320197044334975"
      },
      {
        "name": "CfsSubsetEval_kNN1NErrRate",
        "value": "0.23655913978494625"
      },
      {
        "name": "CfsSubsetEval_kNN1NKappa",
        "value": "0.5126250595521676"
      },
      {
        "name": "ClassEntropy",
        "value": "0.9554189905653109"
      },
      {
        "name": "DecisionStumpAUC",
        "value": "0.7317733990147783"
      },
      {
        "name": "DecisionStumpErrRate",
        "value": "0.26881720430107525"
      },
      {
        "name": "DecisionStumpKappa",
        "value": "0.4829886591060708"
      },
      {
        "name": "Dimensionality",
        "value": "0.24731182795698925"
      },
      {
        "name": "EquivalentNumberOfAtts",
        "value": "6.053189843748563"
      },
      {
        "name": "J48.00001.AUC",
        "value": "0.7320197044334975"
      },
      {
        "name": "J48.00001.ErrRate",
        "value": "0.23655913978494625"
      },
      {
        "name": "J48.00001.Kappa",
        "value": "0.5126250595521676"
      },
      {
        "name": "J48.0001.AUC",
        "value": "0.7320197044334975"
      },
      {
        "name": "J48.0001.ErrRate",
        "value": "0.23655913978494625"
      },
      {
        "name": "J48.0001.Kappa",
        "value": "0.5126250595521676"
      },
      {
        "name": "J48.001.AUC",
        "value": "0.7320197044334975"
      },
      {
        "name": "J48.001.ErrRate",
        "value": "0.23655913978494625"
      },
      {
        "name": "J48.001.Kappa",
        "value": "0.5126250595521676"
      },
      {
        "name": "MajorityClassPercentage",
        "value": "62.365591397849464"
      },
      {
        "name": "MajorityClassSize",
        "value": "58.0"
      },
      {
        "name": "MaxAttributeEntropy",
        "value": "4.7005166771328595"
      },
      {
        "name": "MaxKurtosisOfNumericAtts",
        "value": "4.004305890260348"
      },
      {
        "name": "MaxMeansOfNumericAtts",
        "value": "5280.645161290323"
      },
      {
        "name": "MaxMutualInformation",
        "value": "0.43027124280972"
      },
      {
        "name": "MaxNominalAttDistinctValues",
        "value": "31.0"
      },
      {
        "name": "MaxSkewnessOfNumericAtts",
        "value": "1.7044301461483196"
      },
      {
        "name": "MaxStdDevOfNumericAtts",
        "value": "596.7316898551804"
      },
      {
        "name": "MeanAttributeEntropy",
        "value": "1.9582217745490778"
      },
      {
        "name": "MeanKurtosisOfNumericAtts",
        "value": "0.5026835249632928"
      },
      {
        "name": "MeanMeansOfNumericAtts",
        "value": "709.226357133663"
      },
      {
        "name": "MeanMutualInformation",
        "value": "0.15783727509422502"
      },
      {
        "name": "MeanNoiseToSignalRatio",
        "value": "11.40658629832571"
      },
      {
        "name": "MeanNominalAttDistinctValues",
        "value": "7.0"
      },
      {
        "name": "MeanSkewnessOfNumericAtts",
        "value": "0.3798492079887452"
      },
      {
        "name": "MeanStdDevOfNumericAtts",
        "value": "111.72077636745624"
      },
      {
        "name": "MinAttributeEntropy",
        "value": "0.9286751810936651"
      },
      {
        "name": "MinKurtosisOfNumericAtts",
        "value": "-0.8551156740480699"
      },
      {
        "name": "MinMeansOfNumericAtts",
        "value": "2.667741935483871"
      },
      {
        "name": "MinMutualInformation",
        "value": "0.01339471256124"
      },
      {
        "name": "MinNominalAttDistinctValues",
        "value": "2.0"
      },
      {
        "name": "MinSkewnessOfNumericAtts",
        "value": "-0.25853268574387145"
      },
      {
        "name": "MinStdDevOfNumericAtts",
        "value": "1.037363012467354"
      },
      {
        "name": "MinorityClassPercentage",
        "value": "37.634408602150536"
      },
      {
        "name": "MinorityClassSize",
        "value": "35.0"
      },
      {
        "name": "NaiveBayesAUC",
        "value": "0.8487684729064038"
      },
      {
        "name": "NaiveBayesErrRate",
        "value": "0.21505376344086022"
      },
      {
        "name": "NaiveBayesKappa",
        "value": "0.5617342130065974"
      },
      {
        "name": "NumberOfBinaryFeatures",
        "value": "3.0"
      },
      {
        "name": "NumberOfClasses",
        "value": "2.0"
      },
      {
        "name": "NumberOfFeatures",
        "value": "23.0"
      },
      {
        "name": "NumberOfInstances",
        "value": "93.0"
      },
      {
        "name": "NumberOfInstancesWithMissingValues",
        "value": "11.0"
      },
      {
        "name": "NumberOfMissingValues",
        "value": "14.0"
      },
      {
        "name": "NumberOfNumericFeatures",
        "value": "16.0"
      },
      {
        "name": "NumberOfSymbolicFeatures",
        "value": "7.0"
      },
      {
        "name": "PercentageOfBinaryFeatures",
        "value": "13.043478260869565"
      },
      {
        "name": "PercentageOfInstancesWithMissingValues",
        "value": "11.827956989247312"
      },
      {
        "name": "PercentageOfMissingValues",
        "value": "0.6545114539504442"
      },
      {
        "name": "PercentageOfNumericFeatures",
        "value": "69.56521739130434"
      },
      {
        "name": "PercentageOfSymbolicFeatures",
        "value": "30.434782608695656"
      },
      {
        "name": "Quartile1AttributeEntropy",
        "value": "0.9816057312701587"
      },
      {
        "name": "Quartile1KurtosisOfNumericAtts",
        "value": "-0.36871616021128795"
      },
      {
        "name": "Quartile1MeansOfNumericAtts",
        "value": "14.583811959087333"
      },
      {
        "name": "Quartile1MutualInformation",
        "value": "0.021630476877195"
      },
      {
        "name": "Quartile1SkewnessOfNumericAtts",
        "value": "-0.05194175307679348"
      },
      {
        "name": "Quartile1StdDevOfNumericAtts",
        "value": "2.991296063173862"
      },
      {
        "name": "Quartile2AttributeEntropy",
        "value": "1.3028664575368156"
      },
      {
        "name": "Quartile2KurtosisOfNumericAtts",
        "value": "0.3007843832927173"
      },
      {
        "name": "Quartile2MeansOfNumericAtts",
        "value": "34.02150537634408"
      },
      {
        "name": "Quartile2MutualInformation",
        "value": "0.115914092148515"
      },
      {
        "name": "Quartile2SkewnessOfNumericAtts",
        "value": "0.1716463052529187"
      },
      {
        "name": "Quartile2StdDevOfNumericAtts",
        "value": "4.555356245754039"
      },
      {
        "name": "Quartile3AttributeEntropy",
        "value": "3.061496638782206"
      },
      {
        "name": "Quartile3KurtosisOfNumericAtts",
        "value": "0.9258150035583812"
      },
      {
        "name": "Quartile3MeansOfNumericAtts",
        "value": "173.36021505376345"
      },
      {
        "name": "Quartile3MutualInformation",
        "value": "0.292933145138565"
      },
      {
        "name": "Quartile3SkewnessOfNumericAtts",
        "value": "0.8496113469740726"
      },
      {
        "name": "Quartile3StdDevOfNumericAtts",
        "value": "42.931402542278754"
      },
      {
        "name": "REPTreeDepth1AUC",
        "value": "0.496551724137931"
      },
      {
        "name": "REPTreeDepth1ErrRate",
        "value": "0.3548387096774194"
      },
      {
        "name": "REPTreeDepth1Kappa",
        "value": "0.08305945622945908"
      },
      {
        "name": "REPTreeDepth2AUC",
        "value": "0.496551724137931"
      },
      {
        "name": "REPTreeDepth2ErrRate",
        "value": "0.3548387096774194"
      },
      {
        "name": "REPTreeDepth2Kappa",
        "value": "0.08305945622945908"
      },
      {
        "name": "REPTreeDepth3AUC",
        "value": "0.496551724137931"
      },
      {
        "name": "REPTreeDepth3ErrRate",
        "value": "0.3548387096774194"
      },
      {
        "name": "REPTreeDepth3Kappa",
        "value": "0.08305945622945908"
      },
      {
        "name": "RandomTreeDepth1AUC",
        "value": "0.7071428571428572"
      },
      {
        "name": "RandomTreeDepth1ErrRate",
        "value": "0.24731182795698925"
      },
      {
        "name": "RandomTreeDepth1Kappa",
        "value": "0.4448481702569427"
      },
      {
        "name": "RandomTreeDepth2AUC",
        "value": "0.7071428571428572"
      },
      {
        "name": "RandomTreeDepth2ErrRate",
        "value": "0.24731182795698925"
      },
      {
        "name": "RandomTreeDepth2Kappa",
        "value": "0.4448481702569427"
      },
      {
        "name": "RandomTreeDepth3AUC",
        "value": "0.7071428571428572"
      },
      {
        "name": "RandomTreeDepth3ErrRate",
        "value": "0.24731182795698925"
      },
      {
        "name": "RandomTreeDepth3Kappa",
        "value": "0.4448481702569427"
      },
      {
        "name": "StdvNominalAttDistinctValues",
        "value": "10.677078252031311"
      },
      {
        "name": "kNN1NAUC",
        "value": "0.7"
      },
      {
        "name": "kNN1NErrRate",
        "value": "0.24731182795698925"
      },
      {
        "name": "kNN1NKappa",
        "value": "0.4513977943062323"
      }
    ]
  }
}