{
  "data_qualities": {
    "quality": [
      {
        "name": "AutoCorrelation",
        "value": "0.579598823684326"
      },
      {
        "name": "CfsSubsetEval_DecisionStumpAUC",
        "value": "0.8982833591066817"
      },
      {
        "name": "CfsSubsetEval_DecisionStumpErrRate",
        "value": "0.12978405898876405"
      },
      {
        "name": "CfsSubsetEval_DecisionStumpKappa",
        "value": "0.6727745637563293"
      },
      {
        "name": "CfsSubsetEval_NaiveBayesAUC",
        "value": "0.8982833591066817"
      },
      {
        "name": "CfsSubsetEval_NaiveBayesErrRate",
        "value": "0.12978405898876405"
      },
      {
        "name": "CfsSubsetEval_NaiveBayesKappa",
        "value": "0.6727745637563293"
      },
      {
        "name": "CfsSubsetEval_kNN1NAUC",
        "value": "0.8982833591066817"
      },
      {
        "name": "CfsSubsetEval_kNN1NErrRate",
        "value": "0.12978405898876405"
      },
      {
        "name": "CfsSubsetEval_kNN1NKappa",
        "value": "0.6727745637563293"
      },
      {
        "name": "ClassEntropy",
        "value": "0.876342717713079"
      },
      {
        "name": "DecisionStumpAUC",
        "value": "0.7564658194371722"
      },
      {
        "name": "DecisionStumpErrRate",
        "value": "0.21238588483146068"
      },
      {
        "name": "DecisionStumpKappa",
        "value": "0.49578956079766195"
      },
      {
        "name": "Dimensionality",
        "value": "3.950140449438202E-4"
      },
      {
        "name": "EquivalentNumberOfAtts",
        "value": []
      },
      {
        "name": "J48.00001.AUC",
        "value": "0.8890509861171508"
      },
      {
        "name": "J48.00001.ErrRate",
        "value": "0.1329002808988764"
      },
      {
        "name": "J48.00001.Kappa",
        "value": "0.6706135646155132"
      },
      {
        "name": "J48.0001.AUC",
        "value": "0.8890509861171508"
      },
      {
        "name": "J48.0001.ErrRate",
        "value": "0.1329002808988764"
      },
      {
        "name": "J48.0001.Kappa",
        "value": "0.6706135646155132"
      },
      {
        "name": "J48.001.AUC",
        "value": "0.8890509861171508"
      },
      {
        "name": "J48.001.ErrRate",
        "value": "0.1329002808988764"
      },
      {
        "name": "J48.001.Kappa",
        "value": "0.6706135646155132"
      },
      {
        "name": "MajorityClassPercentage",
        "value": "70.4002808988764"
      },
      {
        "name": "MajorityClassSize",
        "value": "16040.0"
      },
      {
        "name": "MaxAttributeEntropy",
        "value": []
      },
      {
        "name": "MaxKurtosisOfNumericAtts",
        "value": "7546.166943835947"
      },
      {
        "name": "MaxMeansOfNumericAtts",
        "value": "2935.8657391151633"
      },
      {
        "name": "MaxMutualInformation",
        "value": []
      },
      {
        "name": "MaxNominalAttDistinctValues",
        "value": "2.0"
      },
      {
        "name": "MaxSkewnessOfNumericAtts",
        "value": "74.16685526289018"
      },
      {
        "name": "MaxStdDevOfNumericAtts",
        "value": "24949.880168695538"
      },
      {
        "name": "MeanAttributeEntropy",
        "value": []
      },
      {
        "name": "MeanKurtosisOfNumericAtts",
        "value": "973.7403833239183"
      },
      {
        "name": "MeanMeansOfNumericAtts",
        "value": "367.97185023862073"
      },
      {
        "name": "MeanMutualInformation",
        "value": []
      },
      {
        "name": "MeanNoiseToSignalRatio",
        "value": []
      },
      {
        "name": "MeanNominalAttDistinctValues",
        "value": "2.0"
      },
      {
        "name": "MeanSkewnessOfNumericAtts",
        "value": "11.48849715163141"
      },
      {
        "name": "MeanStdDevOfNumericAtts",
        "value": "3118.929871851435"
      },
      {
        "name": "MinAttributeEntropy",
        "value": []
      },
      {
        "name": "MinKurtosisOfNumericAtts",
        "value": "-1.0959006786643917"
      },
      {
        "name": "MinMeansOfNumericAtts",
        "value": "0.010329880661867966"
      },
      {
        "name": "MinMutualInformation",
        "value": []
      },
      {
        "name": "MinNominalAttDistinctValues",
        "value": "2.0"
      },
      {
        "name": "MinSkewnessOfNumericAtts",
        "value": "-0.27090883172615177"
      },
      {
        "name": "MinStdDevOfNumericAtts",
        "value": "0.04210519740558719"
      },
      {
        "name": "MinorityClassPercentage",
        "value": "29.599719101123593"
      },
      {
        "name": "MinorityClassSize",
        "value": "6744.0"
      },
      {
        "name": "NaiveBayesAUC",
        "value": "0.8607942946035453"
      },
      {
        "name": "NaiveBayesErrRate",
        "value": "0.2069434691011236"
      },
      {
        "name": "NaiveBayesKappa",
        "value": "0.40603906053789773"
      },
      {
        "name": "NumberOfBinaryFeatures",
        "value": "1.0"
      },
      {
        "name": "NumberOfClasses",
        "value": "2.0"
      },
      {
        "name": "NumberOfFeatures",
        "value": "9.0"
      },
      {
        "name": "NumberOfInstances",
        "value": "22784.0"
      },
      {
        "name": "NumberOfInstancesWithMissingValues",
        "value": "0.0"
      },
      {
        "name": "NumberOfMissingValues",
        "value": "0.0"
      },
      {
        "name": "NumberOfNumericFeatures",
        "value": "8.0"
      },
      {
        "name": "NumberOfSymbolicFeatures",
        "value": "1.0"
      },
      {
        "name": "PercentageOfBinaryFeatures",
        "value": "11.11111111111111"
      },
      {
        "name": "PercentageOfInstancesWithMissingValues",
        "value": "0.0"
      },
      {
        "name": "PercentageOfMissingValues",
        "value": "0.0"
      },
      {
        "name": "PercentageOfNumericFeatures",
        "value": "88.88888888888889"
      },
      {
        "name": "PercentageOfSymbolicFeatures",
        "value": "11.11111111111111"
      },
      {
        "name": "Quartile1AttributeEntropy",
        "value": []
      },
      {
        "name": "Quartile1KurtosisOfNumericAtts",
        "value": "1.7335908281935477"
      },
      {
        "name": "Quartile1MeansOfNumericAtts",
        "value": "0.08595717691142911"
      },
      {
        "name": "Quartile1MutualInformation",
        "value": []
      },
      {
        "name": "Quartile1SkewnessOfNumericAtts",
        "value": "-0.2350504381160664"
      },
      {
        "name": "Quartile1StdDevOfNumericAtts",
        "value": "0.0670667926930558"
      },
      {
        "name": "Quartile2AttributeEntropy",
        "value": []
      },
      {
        "name": "Quartile2KurtosisOfNumericAtts",
        "value": "5.084667774416129"
      },
      {
        "name": "Quartile2MeansOfNumericAtts",
        "value": "0.487823388759656"
      },
      {
        "name": "Quartile2MutualInformation",
        "value": []
      },
      {
        "name": "Quartile2SkewnessOfNumericAtts",
        "value": "0.7620479962271721"
      },
      {
        "name": "Quartile2StdDevOfNumericAtts",
        "value": "0.139399218080331"
      },
      {
        "name": "Quartile3AttributeEntropy",
        "value": []
      },
      {
        "name": "Quartile3KurtosisOfNumericAtts",
        "value": "165.0198161476975"
      },
      {
        "name": "Quartile3MeansOfNumericAtts",
        "value": "4.662533016206549"
      },
      {
        "name": "Quartile3MutualInformation",
        "value": []
      },
      {
        "name": "Quartile3SkewnessOfNumericAtts",
        "value": "10.865560668770454"
      },
      {
        "name": "Quartile3StdDevOfNumericAtts",
        "value": "0.6519002690074744"
      },
      {
        "name": "REPTreeDepth1AUC",
        "value": "0.9022338920270498"
      },
      {
        "name": "REPTreeDepth1ErrRate",
        "value": "0.12987183988764045"
      },
      {
        "name": "REPTreeDepth1Kappa",
        "value": "0.6769580567631974"
      },
      {
        "name": "REPTreeDepth2AUC",
        "value": "0.9022338920270498"
      },
      {
        "name": "REPTreeDepth2ErrRate",
        "value": "0.12987183988764045"
      },
      {
        "name": "REPTreeDepth2Kappa",
        "value": "0.6769580567631974"
      },
      {
        "name": "REPTreeDepth3AUC",
        "value": "0.9022338920270498"
      },
      {
        "name": "REPTreeDepth3ErrRate",
        "value": "0.12987183988764045"
      },
      {
        "name": "REPTreeDepth3Kappa",
        "value": "0.6769580567631974"
      },
      {
        "name": "RandomTreeDepth1AUC",
        "value": "0.8060194265226612"
      },
      {
        "name": "RandomTreeDepth1ErrRate",
        "value": "0.1618679775280899"
      },
      {
        "name": "RandomTreeDepth1Kappa",
        "value": "0.6117759857120996"
      },
      {
        "name": "RandomTreeDepth2AUC",
        "value": "0.8060194265226612"
      },
      {
        "name": "RandomTreeDepth2ErrRate",
        "value": "0.1618679775280899"
      },
      {
        "name": "RandomTreeDepth2Kappa",
        "value": "0.6117759857120996"
      },
      {
        "name": "RandomTreeDepth3AUC",
        "value": "0.8060194265226612"
      },
      {
        "name": "RandomTreeDepth3ErrRate",
        "value": "0.1618679775280899"
      },
      {
        "name": "RandomTreeDepth3Kappa",
        "value": "0.6117759857120996"
      },
      {
        "name": "StdvNominalAttDistinctValues",
        "value": "0.0"
      },
      {
        "name": "kNN1NAUC",
        "value": "0.7662222566729676"
      },
      {
        "name": "kNN1NErrRate",
        "value": "0.18605161516853932"
      },
      {
        "name": "kNN1NKappa",
        "value": "0.5439610729433552"
      }
    ]
  }
}