{
  "data_qualities": {
    "quality": [
      {
        "name": "AutoCorrelation",
        "value": "0.36363636363636365"
      },
      {
        "name": "CfsSubsetEval_DecisionStumpAUC",
        "value": "0.456140350877193"
      },
      {
        "name": "CfsSubsetEval_DecisionStumpErrRate",
        "value": "0.47058823529411764"
      },
      {
        "name": "CfsSubsetEval_DecisionStumpKappa",
        "value": "-0.02641509433962256"
      },
      {
        "name": "CfsSubsetEval_NaiveBayesAUC",
        "value": "0.456140350877193"
      },
      {
        "name": "CfsSubsetEval_NaiveBayesErrRate",
        "value": "0.47058823529411764"
      },
      {
        "name": "CfsSubsetEval_NaiveBayesKappa",
        "value": "-0.02641509433962256"
      },
      {
        "name": "CfsSubsetEval_kNN1NAUC",
        "value": "0.456140350877193"
      },
      {
        "name": "CfsSubsetEval_kNN1NErrRate",
        "value": "0.47058823529411764"
      },
      {
        "name": "CfsSubsetEval_kNN1NKappa",
        "value": "-0.02641509433962256"
      },
      {
        "name": "ClassEntropy",
        "value": "0.9899927915575188"
      },
      {
        "name": "DecisionStumpAUC",
        "value": "0.4070175438596491"
      },
      {
        "name": "DecisionStumpErrRate",
        "value": "0.5882352941176471"
      },
      {
        "name": "DecisionStumpKappa",
        "value": "-0.17647058823529416"
      },
      {
        "name": "Dimensionality",
        "value": "0.2647058823529412"
      },
      {
        "name": "EquivalentNumberOfAtts",
        "value": "51.60399233897519"
      },
      {
        "name": "J48.00001.AUC",
        "value": "0.5"
      },
      {
        "name": "J48.00001.ErrRate",
        "value": "0.5"
      },
      {
        "name": "J48.00001.Kappa",
        "value": "-0.006968641114982686"
      },
      {
        "name": "J48.0001.AUC",
        "value": "0.5"
      },
      {
        "name": "J48.0001.ErrRate",
        "value": "0.5"
      },
      {
        "name": "J48.0001.Kappa",
        "value": "-0.006968641114982686"
      },
      {
        "name": "J48.001.AUC",
        "value": "0.5"
      },
      {
        "name": "J48.001.ErrRate",
        "value": "0.5"
      },
      {
        "name": "J48.001.Kappa",
        "value": "-0.006968641114982686"
      },
      {
        "name": "MajorityClassPercentage",
        "value": "55.88235294117647"
      },
      {
        "name": "MajorityClassSize",
        "value": "19.0"
      },
      {
        "name": "MaxAttributeEntropy",
        "value": "1.0"
      },
      {
        "name": "MaxKurtosisOfNumericAtts",
        "value": "0.5745591608721035"
      },
      {
        "name": "MaxMeansOfNumericAtts",
        "value": "668776.4117647061"
      },
      {
        "name": "MaxMutualInformation",
        "value": "0.03035679902239"
      },
      {
        "name": "MaxNominalAttDistinctValues",
        "value": "3.0"
      },
      {
        "name": "MaxSkewnessOfNumericAtts",
        "value": "1.0168687635195495"
      },
      {
        "name": "MaxStdDevOfNumericAtts",
        "value": "686992.7660994083"
      },
      {
        "name": "MeanAttributeEntropy",
        "value": "0.9078352007135057"
      },
      {
        "name": "MeanKurtosisOfNumericAtts",
        "value": "-0.36584304226914016"
      },
      {
        "name": "MeanMeansOfNumericAtts",
        "value": "141802.10117647066"
      },
      {
        "name": "MeanMutualInformation",
        "value": "0.019184422496896666"
      },
      {
        "name": "MeanNoiseToSignalRatio",
        "value": "46.32147662304455"
      },
      {
        "name": "MeanNominalAttDistinctValues",
        "value": "2.25"
      },
      {
        "name": "MeanSkewnessOfNumericAtts",
        "value": "0.44265708877876236"
      },
      {
        "name": "MeanStdDevOfNumericAtts",
        "value": "143475.88127503413"
      },
      {
        "name": "MinAttributeEntropy",
        "value": "0.7871265862012691"
      },
      {
        "name": "MinKurtosisOfNumericAtts",
        "value": "-1.5639196376919007"
      },
      {
        "name": "MinMeansOfNumericAtts",
        "value": "3.638235294117647"
      },
      {
        "name": "MinMutualInformation",
        "value": "0.00428864103412"
      },
      {
        "name": "MinNominalAttDistinctValues",
        "value": "2.0"
      },
      {
        "name": "MinSkewnessOfNumericAtts",
        "value": "-0.13124493971029433"
      },
      {
        "name": "MinStdDevOfNumericAtts",
        "value": "4.242641737485734"
      },
      {
        "name": "MinorityClassPercentage",
        "value": "44.11764705882353"
      },
      {
        "name": "MinorityClassSize",
        "value": "15.0"
      },
      {
        "name": "NaiveBayesAUC",
        "value": "0.30526315789473685"
      },
      {
        "name": "NaiveBayesErrRate",
        "value": "0.6176470588235294"
      },
      {
        "name": "NaiveBayesKappa",
        "value": "-0.24390243902439043"
      },
      {
        "name": "NumberOfBinaryFeatures",
        "value": "3.0"
      },
      {
        "name": "NumberOfClasses",
        "value": "2.0"
      },
      {
        "name": "NumberOfFeatures",
        "value": "9.0"
      },
      {
        "name": "NumberOfInstances",
        "value": "34.0"
      },
      {
        "name": "NumberOfInstancesWithMissingValues",
        "value": "0.0"
      },
      {
        "name": "NumberOfMissingValues",
        "value": "0.0"
      },
      {
        "name": "NumberOfNumericFeatures",
        "value": "5.0"
      },
      {
        "name": "NumberOfSymbolicFeatures",
        "value": "4.0"
      },
      {
        "name": "PercentageOfBinaryFeatures",
        "value": "33.33333333333333"
      },
      {
        "name": "PercentageOfInstancesWithMissingValues",
        "value": "0.0"
      },
      {
        "name": "PercentageOfMissingValues",
        "value": "0.0"
      },
      {
        "name": "PercentageOfNumericFeatures",
        "value": "55.55555555555556"
      },
      {
        "name": "PercentageOfSymbolicFeatures",
        "value": "44.44444444444444"
      },
      {
        "name": "Quartile1AttributeEntropy",
        "value": "0.7871265862012691"
      },
      {
        "name": "Quartile1KurtosisOfNumericAtts",
        "value": "-1.1510141828703198"
      },
      {
        "name": "Quartile1MeansOfNumericAtts",
        "value": "13.5764705882353"
      },
      {
        "name": "Quartile1MutualInformation",
        "value": "0.00428864103412"
      },
      {
        "name": "Quartile1SkewnessOfNumericAtts",
        "value": "-0.06980308956178204"
      },
      {
        "name": "Quartile1StdDevOfNumericAtts",
        "value": "15.868432054503103"
      },
      {
        "name": "Quartile2AttributeEntropy",
        "value": "0.9363790159392478"
      },
      {
        "name": "Quartile2KurtosisOfNumericAtts",
        "value": "-0.19192046993001988"
      },
      {
        "name": "Quartile2MeansOfNumericAtts",
        "value": "241.64705882352942"
      },
      {
        "name": "Quartile2MutualInformation",
        "value": "0.02290782743418"
      },
      {
        "name": "Quartile2SkewnessOfNumericAtts",
        "value": "0.35916899676470354"
      },
      {
        "name": "Quartile2StdDevOfNumericAtts",
        "value": "28.79564500272558"
      },
      {
        "name": "Quartile3AttributeEntropy",
        "value": "1.0"
      },
      {
        "name": "Quartile3KurtosisOfNumericAtts",
        "value": "0.3323668121624792"
      },
      {
        "name": "Quartile3MeansOfNumericAtts",
        "value": "354370.85294117656"
      },
      {
        "name": "Quartile3MutualInformation",
        "value": "0.03035679902239"
      },
      {
        "name": "Quartile3SkewnessOfNumericAtts",
        "value": "0.9968613131263362"
      },
      {
        "name": "Quartile3StdDevOfNumericAtts",
        "value": "358659.4369330295"
      },
      {
        "name": "REPTreeDepth1AUC",
        "value": "0.4701754385964913"
      },
      {
        "name": "REPTreeDepth1ErrRate",
        "value": "0.4411764705882353"
      },
      {
        "name": "REPTreeDepth1Kappa",
        "value": "0.0"
      },
      {
        "name": "REPTreeDepth2AUC",
        "value": "0.4701754385964913"
      },
      {
        "name": "REPTreeDepth2ErrRate",
        "value": "0.4411764705882353"
      },
      {
        "name": "REPTreeDepth2Kappa",
        "value": "0.0"
      },
      {
        "name": "REPTreeDepth3AUC",
        "value": "0.4701754385964913"
      },
      {
        "name": "REPTreeDepth3ErrRate",
        "value": "0.4411764705882353"
      },
      {
        "name": "REPTreeDepth3Kappa",
        "value": "0.0"
      },
      {
        "name": "RandomTreeDepth1AUC",
        "value": "0.343859649122807"
      },
      {
        "name": "RandomTreeDepth1ErrRate",
        "value": "0.6470588235294118"
      },
      {
        "name": "RandomTreeDepth1Kappa",
        "value": "-0.3122807017543859"
      },
      {
        "name": "RandomTreeDepth2AUC",
        "value": "0.343859649122807"
      },
      {
        "name": "RandomTreeDepth2ErrRate",
        "value": "0.6470588235294118"
      },
      {
        "name": "RandomTreeDepth2Kappa",
        "value": "-0.3122807017543859"
      },
      {
        "name": "RandomTreeDepth3AUC",
        "value": "0.343859649122807"
      },
      {
        "name": "RandomTreeDepth3ErrRate",
        "value": "0.6470588235294118"
      },
      {
        "name": "RandomTreeDepth3Kappa",
        "value": "-0.3122807017543859"
      },
      {
        "name": "StdvNominalAttDistinctValues",
        "value": "0.5"
      },
      {
        "name": "kNN1NAUC",
        "value": "0.456140350877193"
      },
      {
        "name": "kNN1NErrRate",
        "value": "0.5294117647058824"
      },
      {
        "name": "kNN1NKappa",
        "value": "-0.0889679715302491"
      }
    ]
  }
}