{
  "data_qualities": {
    "quality": [
      {
        "name": "AutoCorrelation",
        "value": "0.7735042735042735"
      },
      {
        "name": "CfsSubsetEval_DecisionStumpAUC",
        "value": "0.9015220354384371"
      },
      {
        "name": "CfsSubsetEval_DecisionStumpErrRate",
        "value": "0.09787234042553192"
      },
      {
        "name": "CfsSubsetEval_DecisionStumpKappa",
        "value": "0.7972389991371872"
      },
      {
        "name": "CfsSubsetEval_NaiveBayesAUC",
        "value": "0.9015220354384371"
      },
      {
        "name": "CfsSubsetEval_NaiveBayesErrRate",
        "value": "0.09787234042553192"
      },
      {
        "name": "CfsSubsetEval_NaiveBayesKappa",
        "value": "0.7972389991371872"
      },
      {
        "name": "CfsSubsetEval_kNN1NAUC",
        "value": "0.9015220354384371"
      },
      {
        "name": "CfsSubsetEval_kNN1NErrRate",
        "value": "0.09787234042553192"
      },
      {
        "name": "CfsSubsetEval_kNN1NKappa",
        "value": "0.7972389991371872"
      },
      {
        "name": "ClassEntropy",
        "value": "0.9684069022981412"
      },
      {
        "name": "DecisionStumpAUC",
        "value": "0.8953505982129335"
      },
      {
        "name": "DecisionStumpErrRate",
        "value": "0.10638297872340426"
      },
      {
        "name": "DecisionStumpKappa",
        "value": "0.7820117991911245"
      },
      {
        "name": "Dimensionality",
        "value": "0.05531914893617021"
      },
      {
        "name": "EquivalentNumberOfAtts",
        "value": []
      },
      {
        "name": "J48.00001.AUC",
        "value": "0.8656292594275331"
      },
      {
        "name": "J48.00001.ErrRate",
        "value": "0.1148936170212766"
      },
      {
        "name": "J48.00001.Kappa",
        "value": "0.7628480657820967"
      },
      {
        "name": "J48.0001.AUC",
        "value": "0.8656292594275331"
      },
      {
        "name": "J48.0001.ErrRate",
        "value": "0.1148936170212766"
      },
      {
        "name": "J48.0001.Kappa",
        "value": "0.7628480657820967"
      },
      {
        "name": "J48.001.AUC",
        "value": "0.8656292594275331"
      },
      {
        "name": "J48.001.ErrRate",
        "value": "0.1148936170212766"
      },
      {
        "name": "J48.001.Kappa",
        "value": "0.7628480657820967"
      },
      {
        "name": "MajorityClassPercentage",
        "value": "60.42553191489362"
      },
      {
        "name": "MajorityClassSize",
        "value": "142.0"
      },
      {
        "name": "MaxAttributeEntropy",
        "value": []
      },
      {
        "name": "MaxKurtosisOfNumericAtts",
        "value": "2.033520473054053"
      },
      {
        "name": "MaxMeansOfNumericAtts",
        "value": "1866.0"
      },
      {
        "name": "MaxMutualInformation",
        "value": []
      },
      {
        "name": "MaxNominalAttDistinctValues",
        "value": "2.0"
      },
      {
        "name": "MaxSkewnessOfNumericAtts",
        "value": "1.3073869469687087"
      },
      {
        "name": "MaxStdDevOfNumericAtts",
        "value": "67.98284097231203"
      },
      {
        "name": "MeanAttributeEntropy",
        "value": []
      },
      {
        "name": "MeanKurtosisOfNumericAtts",
        "value": "0.7219777292935543"
      },
      {
        "name": "MeanMeansOfNumericAtts",
        "value": "202.473085106383"
      },
      {
        "name": "MeanMutualInformation",
        "value": []
      },
      {
        "name": "MeanNoiseToSignalRatio",
        "value": []
      },
      {
        "name": "MeanNominalAttDistinctValues",
        "value": "2.0"
      },
      {
        "name": "MeanSkewnessOfNumericAtts",
        "value": "0.9872729349034098"
      },
      {
        "name": "MeanStdDevOfNumericAtts",
        "value": "45.410321076753256"
      },
      {
        "name": "MinAttributeEntropy",
        "value": []
      },
      {
        "name": "MinKurtosisOfNumericAtts",
        "value": "-1.200000000000001"
      },
      {
        "name": "MinMeansOfNumericAtts",
        "value": "49.11191489361702"
      },
      {
        "name": "MinMutualInformation",
        "value": []
      },
      {
        "name": "MinNominalAttDistinctValues",
        "value": "2.0"
      },
      {
        "name": "MinSkewnessOfNumericAtts",
        "value": "0.0"
      },
      {
        "name": "MinStdDevOfNumericAtts",
        "value": "40.68973220561795"
      },
      {
        "name": "MinorityClassPercentage",
        "value": "39.57446808510638"
      },
      {
        "name": "MinorityClassSize",
        "value": "93.0"
      },
      {
        "name": "NaiveBayesAUC",
        "value": "0.9406411012402487"
      },
      {
        "name": "NaiveBayesErrRate",
        "value": "0.13191489361702127"
      },
      {
        "name": "NaiveBayesKappa",
        "value": "0.7236657436558814"
      },
      {
        "name": "NumberOfBinaryFeatures",
        "value": "1.0"
      },
      {
        "name": "NumberOfClasses",
        "value": "2.0"
      },
      {
        "name": "NumberOfFeatures",
        "value": "13.0"
      },
      {
        "name": "NumberOfInstances",
        "value": "235.0"
      },
      {
        "name": "NumberOfInstancesWithMissingValues",
        "value": "0.0"
      },
      {
        "name": "NumberOfMissingValues",
        "value": "0.0"
      },
      {
        "name": "NumberOfNumericFeatures",
        "value": "12.0"
      },
      {
        "name": "NumberOfSymbolicFeatures",
        "value": "1.0"
      },
      {
        "name": "PercentageOfBinaryFeatures",
        "value": "7.6923076923076925"
      },
      {
        "name": "PercentageOfInstancesWithMissingValues",
        "value": "0.0"
      },
      {
        "name": "PercentageOfMissingValues",
        "value": "0.0"
      },
      {
        "name": "PercentageOfNumericFeatures",
        "value": "92.3076923076923"
      },
      {
        "name": "PercentageOfSymbolicFeatures",
        "value": "7.6923076923076925"
      },
      {
        "name": "Quartile1AttributeEntropy",
        "value": []
      },
      {
        "name": "Quartile1KurtosisOfNumericAtts",
        "value": "0.2995127946922531"
      },
      {
        "name": "Quartile1MeansOfNumericAtts",
        "value": "50.732021276595745"
      },
      {
        "name": "Quartile1MutualInformation",
        "value": []
      },
      {
        "name": "Quartile1SkewnessOfNumericAtts",
        "value": "0.943489868776042"
      },
      {
        "name": "Quartile1StdDevOfNumericAtts",
        "value": "42.56775165652132"
      },
      {
        "name": "Quartile2AttributeEntropy",
        "value": []
      },
      {
        "name": "Quartile2KurtosisOfNumericAtts",
        "value": "0.6494899932734246"
      },
      {
        "name": "Quartile2MeansOfNumericAtts",
        "value": "51.507446808510636"
      },
      {
        "name": "Quartile2MutualInformation",
        "value": []
      },
      {
        "name": "Quartile2SkewnessOfNumericAtts",
        "value": "1.0382484713200821"
      },
      {
        "name": "Quartile2StdDevOfNumericAtts",
        "value": "43.32996113332571"
      },
      {
        "name": "Quartile3AttributeEntropy",
        "value": []
      },
      {
        "name": "Quartile3KurtosisOfNumericAtts",
        "value": "1.2974024264104842"
      },
      {
        "name": "Quartile3MeansOfNumericAtts",
        "value": "52.22755319148936"
      },
      {
        "name": "Quartile3MutualInformation",
        "value": []
      },
      {
        "name": "Quartile3SkewnessOfNumericAtts",
        "value": "1.182409757240932"
      },
      {
        "name": "Quartile3StdDevOfNumericAtts",
        "value": "45.00449222595071"
      },
      {
        "name": "REPTreeDepth1AUC",
        "value": "0.9044373769498714"
      },
      {
        "name": "REPTreeDepth1ErrRate",
        "value": "0.10638297872340426"
      },
      {
        "name": "REPTreeDepth1Kappa",
        "value": "0.777149793270872"
      },
      {
        "name": "REPTreeDepth2AUC",
        "value": "0.9044373769498714"
      },
      {
        "name": "REPTreeDepth2ErrRate",
        "value": "0.10638297872340426"
      },
      {
        "name": "REPTreeDepth2Kappa",
        "value": "0.777149793270872"
      },
      {
        "name": "REPTreeDepth3AUC",
        "value": "0.9044373769498714"
      },
      {
        "name": "REPTreeDepth3ErrRate",
        "value": "0.10638297872340426"
      },
      {
        "name": "REPTreeDepth3Kappa",
        "value": "0.777149793270872"
      },
      {
        "name": "RandomTreeDepth1AUC",
        "value": "0.8760033318188702"
      },
      {
        "name": "RandomTreeDepth1ErrRate",
        "value": "0.13191489361702127"
      },
      {
        "name": "RandomTreeDepth1Kappa",
        "value": "0.7316462224186835"
      },
      {
        "name": "RandomTreeDepth2AUC",
        "value": "0.8760033318188702"
      },
      {
        "name": "RandomTreeDepth2ErrRate",
        "value": "0.13191489361702127"
      },
      {
        "name": "RandomTreeDepth2Kappa",
        "value": "0.7316462224186835"
      },
      {
        "name": "RandomTreeDepth3AUC",
        "value": "0.8760033318188702"
      },
      {
        "name": "RandomTreeDepth3ErrRate",
        "value": "0.13191489361702127"
      },
      {
        "name": "RandomTreeDepth3Kappa",
        "value": "0.7316462224186835"
      },
      {
        "name": "StdvNominalAttDistinctValues",
        "value": "0.0"
      },
      {
        "name": "kNN1NAUC",
        "value": "0.875662577616235"
      },
      {
        "name": "kNN1NErrRate",
        "value": "0.10212765957446808"
      },
      {
        "name": "kNN1NKappa",
        "value": "0.7824241956639147"
      }
    ]
  }
}