{
  "data_set_description": {
    "default_target_attribute": "binaryClass",
    "description": "**Author**:   \n**Source**: Unknown - Date unknown  \n**Please cite**:   \n\nBinarized version of the original data set (see version 1). It converts the numeric target feature to a two-class nominal target feature by computing the mean and classifying all instances with a lower target value as positive ('P') and all others as negative ('N').",
    "description_version": "1",
    "file_id": "53352",
    "format": "ARFF",
    "id": "818",
    "licence": "Public",
    "md5_checksum": "f11fc2695d036d17092ccfff23e7743c",
    "minio_url": "https://data.openml.org/datasets/0000/0818/dataset_818.pq",
    "name": "diggle_table_a2",
    "parquet_url": "https://data.openml.org/datasets/0000/0818/dataset_818.pq",
    "processing_date": "2020-11-20 20:13:29",
    "status": "active",
    "tag": [
      "Data Science",
      "Machine Learning",
      "mythbusting_1",
      "Statistics",
      "study_1",
      "study_15",
      "study_20",
      "study_41",
      "study_7",
      "study_88",
      "trivial"
    ],
    "upload_date": "2014-10-04T14:34:18",
    "url": "https://api.openml.org/data/v1/download/53352/diggle_table_a2.arff",
    "version": "2",
    "visibility": "public"
  }
}