{
  "data_qualities": {
    "quality": [
      {
        "name": "AutoCorrelation",
        "value": "0.8629550321199143"
      },
      {
        "name": "CfsSubsetEval_DecisionStumpAUC",
        "value": "0.8302715949292452"
      },
      {
        "name": "CfsSubsetEval_DecisionStumpErrRate",
        "value": "0.19444444444444445"
      },
      {
        "name": "CfsSubsetEval_DecisionStumpKappa",
        "value": "0.6090692124105013"
      },
      {
        "name": "CfsSubsetEval_NaiveBayesAUC",
        "value": "0.8302715949292452"
      },
      {
        "name": "CfsSubsetEval_NaiveBayesErrRate",
        "value": "0.19444444444444445"
      },
      {
        "name": "CfsSubsetEval_NaiveBayesKappa",
        "value": "0.6090692124105013"
      },
      {
        "name": "CfsSubsetEval_kNN1NAUC",
        "value": "0.8302715949292452"
      },
      {
        "name": "CfsSubsetEval_kNN1NErrRate",
        "value": "0.19444444444444445"
      },
      {
        "name": "CfsSubsetEval_kNN1NKappa",
        "value": "0.6090692124105013"
      },
      {
        "name": "ClassEntropy",
        "value": "0.993614428200075"
      },
      {
        "name": "DecisionStumpAUC",
        "value": "0.5859375"
      },
      {
        "name": "DecisionStumpErrRate",
        "value": "0.38675213675213677"
      },
      {
        "name": "DecisionStumpKappa",
        "value": "0.1737094697413087"
      },
      {
        "name": "Dimensionality",
        "value": "0.00641025641025641"
      },
      {
        "name": "EquivalentNumberOfAtts",
        "value": []
      },
      {
        "name": "J48.00001.AUC",
        "value": "0.8478220813679245"
      },
      {
        "name": "J48.00001.ErrRate",
        "value": "0.17307692307692307"
      },
      {
        "name": "J48.00001.Kappa",
        "value": "0.6531493613439225"
      },
      {
        "name": "J48.0001.AUC",
        "value": "0.8478220813679245"
      },
      {
        "name": "J48.0001.ErrRate",
        "value": "0.17307692307692307"
      },
      {
        "name": "J48.0001.Kappa",
        "value": "0.6531493613439225"
      },
      {
        "name": "J48.001.AUC",
        "value": "0.8478220813679245"
      },
      {
        "name": "J48.001.ErrRate",
        "value": "0.17307692307692307"
      },
      {
        "name": "J48.001.Kappa",
        "value": "0.6531493613439225"
      },
      {
        "name": "MajorityClassPercentage",
        "value": "54.700854700854705"
      },
      {
        "name": "MajorityClassSize",
        "value": "256.0"
      },
      {
        "name": "MaxAttributeEntropy",
        "value": []
      },
      {
        "name": "MaxKurtosisOfNumericAtts",
        "value": "-1.2008863862300343"
      },
      {
        "name": "MaxMeansOfNumericAtts",
        "value": "1987.0"
      },
      {
        "name": "MaxMutualInformation",
        "value": []
      },
      {
        "name": "MaxNominalAttDistinctValues",
        "value": "2.0"
      },
      {
        "name": "MaxSkewnessOfNumericAtts",
        "value": "0.0"
      },
      {
        "name": "MaxStdDevOfNumericAtts",
        "value": "15.024391303713745"
      },
      {
        "name": "MeanAttributeEntropy",
        "value": []
      },
      {
        "name": "MeanKurtosisOfNumericAtts",
        "value": "-1.215599153242636"
      },
      {
        "name": "MeanMeansOfNumericAtts",
        "value": "1006.75"
      },
      {
        "name": "MeanMutualInformation",
        "value": []
      },
      {
        "name": "MeanNoiseToSignalRatio",
        "value": []
      },
      {
        "name": "MeanNominalAttDistinctValues",
        "value": "2.0"
      },
      {
        "name": "MeanSkewnessOfNumericAtts",
        "value": "0.0"
      },
      {
        "name": "MeanStdDevOfNumericAtts",
        "value": "8.804571582474022"
      },
      {
        "name": "MinAttributeEntropy",
        "value": []
      },
      {
        "name": "MinKurtosisOfNumericAtts",
        "value": "-1.2303119202552377"
      },
      {
        "name": "MinMeansOfNumericAtts",
        "value": "26.5"
      },
      {
        "name": "MinMutualInformation",
        "value": []
      },
      {
        "name": "MinNominalAttDistinctValues",
        "value": "2.0"
      },
      {
        "name": "MinSkewnessOfNumericAtts",
        "value": "0.0"
      },
      {
        "name": "MinStdDevOfNumericAtts",
        "value": "2.5847518612342997"
      },
      {
        "name": "MinorityClassPercentage",
        "value": "45.2991452991453"
      },
      {
        "name": "MinorityClassSize",
        "value": "212.0"
      },
      {
        "name": "NaiveBayesAUC",
        "value": "0.7863354952830188"
      },
      {
        "name": "NaiveBayesErrRate",
        "value": "0.27136752136752135"
      },
      {
        "name": "NaiveBayesKappa",
        "value": "0.4417896990871182"
      },
      {
        "name": "NumberOfBinaryFeatures",
        "value": "1.0"
      },
      {
        "name": "NumberOfClasses",
        "value": "2.0"
      },
      {
        "name": "NumberOfFeatures",
        "value": "3.0"
      },
      {
        "name": "NumberOfInstances",
        "value": "468.0"
      },
      {
        "name": "NumberOfInstancesWithMissingValues",
        "value": "0.0"
      },
      {
        "name": "NumberOfMissingValues",
        "value": "0.0"
      },
      {
        "name": "NumberOfNumericFeatures",
        "value": "2.0"
      },
      {
        "name": "NumberOfSymbolicFeatures",
        "value": "1.0"
      },
      {
        "name": "PercentageOfBinaryFeatures",
        "value": "33.33333333333333"
      },
      {
        "name": "PercentageOfInstancesWithMissingValues",
        "value": "0.0"
      },
      {
        "name": "PercentageOfMissingValues",
        "value": "0.0"
      },
      {
        "name": "PercentageOfNumericFeatures",
        "value": "66.66666666666666"
      },
      {
        "name": "PercentageOfSymbolicFeatures",
        "value": "33.33333333333333"
      },
      {
        "name": "Quartile1AttributeEntropy",
        "value": []
      },
      {
        "name": "Quartile1KurtosisOfNumericAtts",
        "value": "-1.2303119202552377"
      },
      {
        "name": "Quartile1MeansOfNumericAtts",
        "value": "26.5"
      },
      {
        "name": "Quartile1MutualInformation",
        "value": []
      },
      {
        "name": "Quartile1SkewnessOfNumericAtts",
        "value": "0.0"
      },
      {
        "name": "Quartile1StdDevOfNumericAtts",
        "value": "2.5847518612342997"
      },
      {
        "name": "Quartile2AttributeEntropy",
        "value": []
      },
      {
        "name": "Quartile2KurtosisOfNumericAtts",
        "value": "-1.215599153242636"
      },
      {
        "name": "Quartile2MeansOfNumericAtts",
        "value": "1006.75"
      },
      {
        "name": "Quartile2MutualInformation",
        "value": []
      },
      {
        "name": "Quartile2SkewnessOfNumericAtts",
        "value": "0.0"
      },
      {
        "name": "Quartile2StdDevOfNumericAtts",
        "value": "8.804571582474022"
      },
      {
        "name": "Quartile3AttributeEntropy",
        "value": []
      },
      {
        "name": "Quartile3KurtosisOfNumericAtts",
        "value": "-1.2008863862300343"
      },
      {
        "name": "Quartile3MeansOfNumericAtts",
        "value": "1987.0"
      },
      {
        "name": "Quartile3MutualInformation",
        "value": []
      },
      {
        "name": "Quartile3SkewnessOfNumericAtts",
        "value": "0.0"
      },
      {
        "name": "Quartile3StdDevOfNumericAtts",
        "value": "15.024391303713745"
      },
      {
        "name": "REPTreeDepth1AUC",
        "value": "0.8294792895047169"
      },
      {
        "name": "REPTreeDepth1ErrRate",
        "value": "0.1752136752136752"
      },
      {
        "name": "REPTreeDepth1Kappa",
        "value": "0.6467339273878783"
      },
      {
        "name": "REPTreeDepth2AUC",
        "value": "0.8294792895047169"
      },
      {
        "name": "REPTreeDepth2ErrRate",
        "value": "0.1752136752136752"
      },
      {
        "name": "REPTreeDepth2Kappa",
        "value": "0.6467339273878783"
      },
      {
        "name": "REPTreeDepth3AUC",
        "value": "0.8294792895047169"
      },
      {
        "name": "REPTreeDepth3ErrRate",
        "value": "0.1752136752136752"
      },
      {
        "name": "REPTreeDepth3Kappa",
        "value": "0.6467339273878783"
      },
      {
        "name": "RandomTreeDepth1AUC",
        "value": "0.8227446933962264"
      },
      {
        "name": "RandomTreeDepth1ErrRate",
        "value": "0.17307692307692307"
      },
      {
        "name": "RandomTreeDepth1Kappa",
        "value": "0.6489089764012891"
      },
      {
        "name": "RandomTreeDepth2AUC",
        "value": "0.8227446933962264"
      },
      {
        "name": "RandomTreeDepth2ErrRate",
        "value": "0.17307692307692307"
      },
      {
        "name": "RandomTreeDepth2Kappa",
        "value": "0.6489089764012891"
      },
      {
        "name": "RandomTreeDepth3AUC",
        "value": "0.8227446933962264"
      },
      {
        "name": "RandomTreeDepth3ErrRate",
        "value": "0.17307692307692307"
      },
      {
        "name": "RandomTreeDepth3Kappa",
        "value": "0.6489089764012891"
      },
      {
        "name": "StdvNominalAttDistinctValues",
        "value": "0.0"
      },
      {
        "name": "kNN1NAUC",
        "value": "0.8629219487028301"
      },
      {
        "name": "kNN1NErrRate",
        "value": "0.15384615384615385"
      },
      {
        "name": "kNN1NKappa",
        "value": "0.6883001554059054"
      }
    ]
  }
}