{
  "data_qualities": {
    "quality": [
      {
        "name": "AutoCorrelation",
        "value": "0.5085085085085085"
      },
      {
        "name": "CfsSubsetEval_DecisionStumpAUC",
        "value": "0.8395669651385395"
      },
      {
        "name": "CfsSubsetEval_DecisionStumpErrRate",
        "value": "0.166"
      },
      {
        "name": "CfsSubsetEval_DecisionStumpKappa",
        "value": "0.6636775843135982"
      },
      {
        "name": "CfsSubsetEval_NaiveBayesAUC",
        "value": "0.8395669651385395"
      },
      {
        "name": "CfsSubsetEval_NaiveBayesErrRate",
        "value": "0.166"
      },
      {
        "name": "CfsSubsetEval_NaiveBayesKappa",
        "value": "0.6636775843135982"
      },
      {
        "name": "CfsSubsetEval_kNN1NAUC",
        "value": "0.8395669651385395"
      },
      {
        "name": "CfsSubsetEval_kNN1NErrRate",
        "value": "0.166"
      },
      {
        "name": "CfsSubsetEval_kNN1NKappa",
        "value": "0.6636775843135982"
      },
      {
        "name": "ClassEntropy",
        "value": "0.9885173903891564"
      },
      {
        "name": "DecisionStumpAUC",
        "value": "0.6816478411257116"
      },
      {
        "name": "DecisionStumpErrRate",
        "value": "0.307"
      },
      {
        "name": "DecisionStumpKappa",
        "value": "0.38413763219977204"
      },
      {
        "name": "Dimensionality",
        "value": "0.006"
      },
      {
        "name": "EquivalentNumberOfAtts",
        "value": []
      },
      {
        "name": "J48.00001.AUC",
        "value": "0.8689982156720089"
      },
      {
        "name": "J48.00001.ErrRate",
        "value": "0.141"
      },
      {
        "name": "J48.00001.Kappa",
        "value": "0.7123458704291555"
      },
      {
        "name": "J48.0001.AUC",
        "value": "0.8689982156720089"
      },
      {
        "name": "J48.0001.ErrRate",
        "value": "0.141"
      },
      {
        "name": "J48.0001.Kappa",
        "value": "0.7123458704291555"
      },
      {
        "name": "J48.001.AUC",
        "value": "0.8689982156720089"
      },
      {
        "name": "J48.001.ErrRate",
        "value": "0.141"
      },
      {
        "name": "J48.001.Kappa",
        "value": "0.7123458704291555"
      },
      {
        "name": "MajorityClassPercentage",
        "value": "56.3"
      },
      {
        "name": "MajorityClassSize",
        "value": "563.0"
      },
      {
        "name": "MaxAttributeEntropy",
        "value": []
      },
      {
        "name": "MaxKurtosisOfNumericAtts",
        "value": "1.153622378636951"
      },
      {
        "name": "MaxMeansOfNumericAtts",
        "value": "9.000000004810715E-9"
      },
      {
        "name": "MaxMutualInformation",
        "value": []
      },
      {
        "name": "MaxNominalAttDistinctValues",
        "value": "2.0"
      },
      {
        "name": "MaxSkewnessOfNumericAtts",
        "value": "1.246941780251248"
      },
      {
        "name": "MaxStdDevOfNumericAtts",
        "value": "1.0000000357900796"
      },
      {
        "name": "MeanAttributeEntropy",
        "value": []
      },
      {
        "name": "MeanKurtosisOfNumericAtts",
        "value": "-0.39534744957352824"
      },
      {
        "name": "MeanMeansOfNumericAtts",
        "value": "2.0000000069686498E-9"
      },
      {
        "name": "MeanMutualInformation",
        "value": []
      },
      {
        "name": "MeanNoiseToSignalRatio",
        "value": []
      },
      {
        "name": "MeanNominalAttDistinctValues",
        "value": "2.0"
      },
      {
        "name": "MeanSkewnessOfNumericAtts",
        "value": "0.3799051670286494"
      },
      {
        "name": "MeanStdDevOfNumericAtts",
        "value": "1.0000000300225595"
      },
      {
        "name": "MinAttributeEntropy",
        "value": []
      },
      {
        "name": "MinKurtosisOfNumericAtts",
        "value": "-1.199653149643545"
      },
      {
        "name": "MinMeansOfNumericAtts",
        "value": "-4.0000000260942415E-9"
      },
      {
        "name": "MinMutualInformation",
        "value": []
      },
      {
        "name": "MinNominalAttDistinctValues",
        "value": "2.0"
      },
      {
        "name": "MinSkewnessOfNumericAtts",
        "value": "-0.047776570555339945"
      },
      {
        "name": "MinStdDevOfNumericAtts",
        "value": "1.0000000249286416"
      },
      {
        "name": "MinorityClassPercentage",
        "value": "43.7"
      },
      {
        "name": "MinorityClassSize",
        "value": "437.0"
      },
      {
        "name": "NaiveBayesAUC",
        "value": "0.7034560685442078"
      },
      {
        "name": "NaiveBayesErrRate",
        "value": "0.331"
      },
      {
        "name": "NaiveBayesKappa",
        "value": "0.3247268305819183"
      },
      {
        "name": "NumberOfBinaryFeatures",
        "value": "1.0"
      },
      {
        "name": "NumberOfClasses",
        "value": "2.0"
      },
      {
        "name": "NumberOfFeatures",
        "value": "6.0"
      },
      {
        "name": "NumberOfInstances",
        "value": "1000.0"
      },
      {
        "name": "NumberOfInstancesWithMissingValues",
        "value": "0.0"
      },
      {
        "name": "NumberOfMissingValues",
        "value": "0.0"
      },
      {
        "name": "NumberOfNumericFeatures",
        "value": "5.0"
      },
      {
        "name": "NumberOfSymbolicFeatures",
        "value": "1.0"
      },
      {
        "name": "PercentageOfBinaryFeatures",
        "value": "16.666666666666664"
      },
      {
        "name": "PercentageOfInstancesWithMissingValues",
        "value": "0.0"
      },
      {
        "name": "PercentageOfMissingValues",
        "value": "0.0"
      },
      {
        "name": "PercentageOfNumericFeatures",
        "value": "83.33333333333334"
      },
      {
        "name": "PercentageOfSymbolicFeatures",
        "value": "16.666666666666664"
      },
      {
        "name": "Quartile1AttributeEntropy",
        "value": []
      },
      {
        "name": "Quartile1KurtosisOfNumericAtts",
        "value": "-1.1837277136220274"
      },
      {
        "name": "Quartile1MeansOfNumericAtts",
        "value": "-2.4999999939656625E-9"
      },
      {
        "name": "Quartile1MutualInformation",
        "value": []
      },
      {
        "name": "Quartile1SkewnessOfNumericAtts",
        "value": "-0.040956945030882735"
      },
      {
        "name": "Quartile1StdDevOfNumericAtts",
        "value": "1.0000000252149224"
      },
      {
        "name": "Quartile2AttributeEntropy",
        "value": []
      },
      {
        "name": "Quartile2KurtosisOfNumericAtts",
        "value": "-0.7857435131844928"
      },
      {
        "name": "Quartile2MeansOfNumericAtts",
        "value": "3.9968028886505634E-17"
      },
      {
        "name": "Quartile2MutualInformation",
        "value": []
      },
      {
        "name": "Quartile2SkewnessOfNumericAtts",
        "value": "0.041091208226431544"
      },
      {
        "name": "Quartile2StdDevOfNumericAtts",
        "value": "1.0000000316528863"
      },
      {
        "name": "Quartile3AttributeEntropy",
        "value": []
      },
      {
        "name": "Quartile3KurtosisOfNumericAtts",
        "value": "0.5882308462804533"
      },
      {
        "name": "Quartile3MeansOfNumericAtts",
        "value": "7.499999991403272E-9"
      },
      {
        "name": "Quartile3MutualInformation",
        "value": []
      },
      {
        "name": "Quartile3SkewnessOfNumericAtts",
        "value": "0.9701742584892905"
      },
      {
        "name": "Quartile3StdDevOfNumericAtts",
        "value": "1.0000000340150332"
      },
      {
        "name": "REPTreeDepth1AUC",
        "value": "0.8576500522291906"
      },
      {
        "name": "REPTreeDepth1ErrRate",
        "value": "0.155"
      },
      {
        "name": "REPTreeDepth1Kappa",
        "value": "0.6850796849984152"
      },
      {
        "name": "REPTreeDepth2AUC",
        "value": "0.8576500522291906"
      },
      {
        "name": "REPTreeDepth2ErrRate",
        "value": "0.155"
      },
      {
        "name": "REPTreeDepth2Kappa",
        "value": "0.6850796849984152"
      },
      {
        "name": "REPTreeDepth3AUC",
        "value": "0.8576500522291906"
      },
      {
        "name": "REPTreeDepth3ErrRate",
        "value": "0.155"
      },
      {
        "name": "REPTreeDepth3Kappa",
        "value": "0.6850796849984152"
      },
      {
        "name": "RandomTreeDepth1AUC",
        "value": "0.8483483788628262"
      },
      {
        "name": "RandomTreeDepth1ErrRate",
        "value": "0.15"
      },
      {
        "name": "RandomTreeDepth1Kappa",
        "value": "0.6956280006006273"
      },
      {
        "name": "RandomTreeDepth2AUC",
        "value": "0.8483483788628262"
      },
      {
        "name": "RandomTreeDepth2ErrRate",
        "value": "0.15"
      },
      {
        "name": "RandomTreeDepth2Kappa",
        "value": "0.6956280006006273"
      },
      {
        "name": "RandomTreeDepth3AUC",
        "value": "0.8483483788628262"
      },
      {
        "name": "RandomTreeDepth3ErrRate",
        "value": "0.15"
      },
      {
        "name": "RandomTreeDepth3Kappa",
        "value": "0.6956280006006273"
      },
      {
        "name": "StdvNominalAttDistinctValues",
        "value": "0.0"
      },
      {
        "name": "kNN1NAUC",
        "value": "0.8667749186078177"
      },
      {
        "name": "kNN1NErrRate",
        "value": "0.133"
      },
      {
        "name": "kNN1NKappa",
        "value": "0.730743068152371"
      }
    ]
  }
}