{
  "data_set_description": {
    "default_target_attribute": "binaryClass",
    "description": "**Author**:   \n**Source**: Unknown - Date unknown  \n**Please cite**:   \n\nBinarized version of the original data set (see version 1). It converts the numeric target feature to a two-class nominal target feature by computing the mean and classifying all instances with a lower target value as positive ('P') and all others as negative ('N').",
    "description_version": "1",
    "file_id": "53333",
    "format": "ARFF",
    "id": "799",
    "licence": "Public",
    "md5_checksum": "8107c379879c9cf3be25c96ceecf3e36",
    "minio_url": "https://data.openml.org/datasets/0000/0799/dataset_799.pq",
    "name": "fri_c0_1000_5",
    "parquet_url": "https://data.openml.org/datasets/0000/0799/dataset_799.pq",
    "processing_date": "2020-11-20 20:17:46",
    "status": "active",
    "tag": [
      "binarized_regression_problem",
      "Data Analysis",
      "Machine Learning",
      "mythbusting_1",
      "Statistics",
      "study_1",
      "study_15",
      "study_20",
      "study_41",
      "study_7"
    ],
    "upload_date": "2014-10-04T14:33:47",
    "url": "https://api.openml.org/data/v1/download/53333/fri_c0_1000_5.arff",
    "version": "2",
    "visibility": "public"
  }
}