{
  "data_set_description": {
    "default_target_attribute": "binaryClass",
    "description": "**Author**:   \n**Source**: Unknown - Date unknown  \n**Please cite**:   \n\nBinarized version of the original data set (see version 1). It converts the numeric target feature to a two-class nominal target feature by computing the mean and classifying all instances with a lower target value as positive ('P') and all others as negative ('N').",
    "description_version": "1",
    "file_id": "53326",
    "format": "ARFF",
    "id": "792",
    "licence": "Public",
    "md5_checksum": "ac4e0547201c4f7c97153e56a081607b",
    "minio_url": "https://data.openml.org/datasets/0000/0792/dataset_792.pq",
    "name": "fri_c2_500_5",
    "parquet_url": "https://data.openml.org/datasets/0000/0792/dataset_792.pq",
    "processing_date": "2020-11-20 20:03:08",
    "status": "active",
    "tag": [
      "binarized_regression_problem",
      "Data Science",
      "Machine Learning",
      "mythbusting_1",
      "Research",
      "Statistics",
      "study_1",
      "study_15",
      "study_20",
      "study_41",
      "study_7",
      "study_88"
    ],
    "upload_date": "2014-10-04T14:33:36",
    "url": "https://api.openml.org/data/v1/download/53326/fri_c2_500_5.arff",
    "version": "2",
    "visibility": "public"
  }
}