{
  "data_qualities": {
    "quality": [
      {
        "name": "AutoCorrelation",
        "value": "0.8333333333333334"
      },
      {
        "name": "CfsSubsetEval_DecisionStumpAUC",
        "value": "0.9153225806451613"
      },
      {
        "name": "CfsSubsetEval_DecisionStumpErrRate",
        "value": "0.09090909090909091"
      },
      {
        "name": "CfsSubsetEval_DecisionStumpKappa",
        "value": "0.8160535117056855"
      },
      {
        "name": "CfsSubsetEval_NaiveBayesAUC",
        "value": "0.9153225806451613"
      },
      {
        "name": "CfsSubsetEval_NaiveBayesErrRate",
        "value": "0.09090909090909091"
      },
      {
        "name": "CfsSubsetEval_NaiveBayesKappa",
        "value": "0.8160535117056855"
      },
      {
        "name": "CfsSubsetEval_kNN1NAUC",
        "value": "0.9153225806451613"
      },
      {
        "name": "CfsSubsetEval_kNN1NErrRate",
        "value": "0.09090909090909091"
      },
      {
        "name": "CfsSubsetEval_kNN1NKappa",
        "value": "0.8160535117056855"
      },
      {
        "name": "ClassEntropy",
        "value": "0.9882836109919162"
      },
      {
        "name": "DecisionStumpAUC",
        "value": "0.9099462365591398"
      },
      {
        "name": "DecisionStumpErrRate",
        "value": "0.09090909090909091"
      },
      {
        "name": "DecisionStumpKappa",
        "value": "0.8160535117056855"
      },
      {
        "name": "Dimensionality",
        "value": "0.05454545454545454"
      },
      {
        "name": "EquivalentNumberOfAtts",
        "value": "1.40649661746536"
      },
      {
        "name": "J48.00001.AUC",
        "value": "0.9099462365591398"
      },
      {
        "name": "J48.00001.ErrRate",
        "value": "0.09090909090909091"
      },
      {
        "name": "J48.00001.Kappa",
        "value": "0.8160535117056855"
      },
      {
        "name": "J48.0001.AUC",
        "value": "0.9099462365591398"
      },
      {
        "name": "J48.0001.ErrRate",
        "value": "0.09090909090909091"
      },
      {
        "name": "J48.0001.Kappa",
        "value": "0.8160535117056855"
      },
      {
        "name": "J48.001.AUC",
        "value": "0.9099462365591398"
      },
      {
        "name": "J48.001.ErrRate",
        "value": "0.09090909090909091"
      },
      {
        "name": "J48.001.Kappa",
        "value": "0.8160535117056855"
      },
      {
        "name": "MajorityClassPercentage",
        "value": "56.36363636363636"
      },
      {
        "name": "MajorityClassSize",
        "value": "31.0"
      },
      {
        "name": "MaxAttributeEntropy",
        "value": "3.576496380414521"
      },
      {
        "name": "MaxKurtosisOfNumericAtts",
        "value": "-1.2958937271384918"
      },
      {
        "name": "MaxMeansOfNumericAtts",
        "value": "53.81818181818182"
      },
      {
        "name": "MaxMutualInformation",
        "value": "0.70265623018198"
      },
      {
        "name": "MaxNominalAttDistinctValues",
        "value": "12.0"
      },
      {
        "name": "MaxSkewnessOfNumericAtts",
        "value": "-0.06953450415002152"
      },
      {
        "name": "MaxStdDevOfNumericAtts",
        "value": "15.543357410674169"
      },
      {
        "name": "MeanAttributeEntropy",
        "value": "3.576496380414521"
      },
      {
        "name": "MeanKurtosisOfNumericAtts",
        "value": "-1.2958937271384918"
      },
      {
        "name": "MeanMeansOfNumericAtts",
        "value": "53.81818181818182"
      },
      {
        "name": "MeanMutualInformation",
        "value": "0.70265623018198"
      },
      {
        "name": "MeanNoiseToSignalRatio",
        "value": "4.089966084109507"
      },
      {
        "name": "MeanNominalAttDistinctValues",
        "value": "7.0"
      },
      {
        "name": "MeanSkewnessOfNumericAtts",
        "value": "-0.06953450415002152"
      },
      {
        "name": "MeanStdDevOfNumericAtts",
        "value": "15.543357410674169"
      },
      {
        "name": "MinAttributeEntropy",
        "value": "3.576496380414521"
      },
      {
        "name": "MinKurtosisOfNumericAtts",
        "value": "-1.2958937271384918"
      },
      {
        "name": "MinMeansOfNumericAtts",
        "value": "53.81818181818182"
      },
      {
        "name": "MinMutualInformation",
        "value": "0.70265623018198"
      },
      {
        "name": "MinNominalAttDistinctValues",
        "value": "2.0"
      },
      {
        "name": "MinSkewnessOfNumericAtts",
        "value": "-0.06953450415002152"
      },
      {
        "name": "MinStdDevOfNumericAtts",
        "value": "15.543357410674169"
      },
      {
        "name": "MinorityClassPercentage",
        "value": "43.63636363636363"
      },
      {
        "name": "MinorityClassSize",
        "value": "24.0"
      },
      {
        "name": "NaiveBayesAUC",
        "value": "0.9764784946236559"
      },
      {
        "name": "NaiveBayesErrRate",
        "value": "0.09090909090909091"
      },
      {
        "name": "NaiveBayesKappa",
        "value": "0.8160535117056855"
      },
      {
        "name": "NumberOfBinaryFeatures",
        "value": "1.0"
      },
      {
        "name": "NumberOfClasses",
        "value": "2.0"
      },
      {
        "name": "NumberOfFeatures",
        "value": "3.0"
      },
      {
        "name": "NumberOfInstances",
        "value": "55.0"
      },
      {
        "name": "NumberOfInstancesWithMissingValues",
        "value": "0.0"
      },
      {
        "name": "NumberOfMissingValues",
        "value": "0.0"
      },
      {
        "name": "NumberOfNumericFeatures",
        "value": "1.0"
      },
      {
        "name": "NumberOfSymbolicFeatures",
        "value": "2.0"
      },
      {
        "name": "PercentageOfBinaryFeatures",
        "value": "33.33333333333333"
      },
      {
        "name": "PercentageOfInstancesWithMissingValues",
        "value": "0.0"
      },
      {
        "name": "PercentageOfMissingValues",
        "value": "0.0"
      },
      {
        "name": "PercentageOfNumericFeatures",
        "value": "33.33333333333333"
      },
      {
        "name": "PercentageOfSymbolicFeatures",
        "value": "66.66666666666666"
      },
      {
        "name": "Quartile1AttributeEntropy",
        "value": "3.576496380414521"
      },
      {
        "name": "Quartile1KurtosisOfNumericAtts",
        "value": "-1.2958937271384918"
      },
      {
        "name": "Quartile1MeansOfNumericAtts",
        "value": "53.81818181818182"
      },
      {
        "name": "Quartile1MutualInformation",
        "value": "0.70265623018198"
      },
      {
        "name": "Quartile1SkewnessOfNumericAtts",
        "value": "-0.06953450415002152"
      },
      {
        "name": "Quartile1StdDevOfNumericAtts",
        "value": "15.543357410674169"
      },
      {
        "name": "Quartile2AttributeEntropy",
        "value": "3.576496380414521"
      },
      {
        "name": "Quartile2KurtosisOfNumericAtts",
        "value": "-1.2958937271384918"
      },
      {
        "name": "Quartile2MeansOfNumericAtts",
        "value": "53.81818181818182"
      },
      {
        "name": "Quartile2MutualInformation",
        "value": "0.70265623018198"
      },
      {
        "name": "Quartile2SkewnessOfNumericAtts",
        "value": "-0.06953450415002152"
      },
      {
        "name": "Quartile2StdDevOfNumericAtts",
        "value": "15.543357410674169"
      },
      {
        "name": "Quartile3AttributeEntropy",
        "value": "3.576496380414521"
      },
      {
        "name": "Quartile3KurtosisOfNumericAtts",
        "value": "-1.2958937271384918"
      },
      {
        "name": "Quartile3MeansOfNumericAtts",
        "value": "53.81818181818182"
      },
      {
        "name": "Quartile3MutualInformation",
        "value": "0.70265623018198"
      },
      {
        "name": "Quartile3SkewnessOfNumericAtts",
        "value": "-0.06953450415002152"
      },
      {
        "name": "Quartile3StdDevOfNumericAtts",
        "value": "15.543357410674169"
      },
      {
        "name": "REPTreeDepth1AUC",
        "value": "0.8891129032258065"
      },
      {
        "name": "REPTreeDepth1ErrRate",
        "value": "0.10909090909090909"
      },
      {
        "name": "REPTreeDepth1Kappa",
        "value": "0.7782258064516128"
      },
      {
        "name": "REPTreeDepth2AUC",
        "value": "0.8891129032258065"
      },
      {
        "name": "REPTreeDepth2ErrRate",
        "value": "0.10909090909090909"
      },
      {
        "name": "REPTreeDepth2Kappa",
        "value": "0.7782258064516128"
      },
      {
        "name": "REPTreeDepth3AUC",
        "value": "0.8891129032258065"
      },
      {
        "name": "REPTreeDepth3ErrRate",
        "value": "0.10909090909090909"
      },
      {
        "name": "REPTreeDepth3Kappa",
        "value": "0.7782258064516128"
      },
      {
        "name": "RandomTreeDepth1AUC",
        "value": "0.8575268817204301"
      },
      {
        "name": "RandomTreeDepth1ErrRate",
        "value": "0.12727272727272726"
      },
      {
        "name": "RandomTreeDepth1Kappa",
        "value": "0.7400405131667791"
      },
      {
        "name": "RandomTreeDepth2AUC",
        "value": "0.8575268817204301"
      },
      {
        "name": "RandomTreeDepth2ErrRate",
        "value": "0.12727272727272726"
      },
      {
        "name": "RandomTreeDepth2Kappa",
        "value": "0.7400405131667791"
      },
      {
        "name": "RandomTreeDepth3AUC",
        "value": "0.8575268817204301"
      },
      {
        "name": "RandomTreeDepth3ErrRate",
        "value": "0.12727272727272726"
      },
      {
        "name": "RandomTreeDepth3Kappa",
        "value": "0.7400405131667791"
      },
      {
        "name": "StdvNominalAttDistinctValues",
        "value": "7.0710678118654755"
      },
      {
        "name": "kNN1NAUC",
        "value": "0.8904569892473119"
      },
      {
        "name": "kNN1NErrRate",
        "value": "0.12727272727272726"
      },
      {
        "name": "kNN1NKappa",
        "value": "0.7400405131667791"
      }
    ]
  }
}