{
  "data_qualities": {
    "quality": [
      {
        "name": "AutoCorrelation",
        "value": "0.54"
      },
      {
        "name": "CfsSubsetEval_DecisionStumpAUC",
        "value": "0.4880952380952381"
      },
      {
        "name": "CfsSubsetEval_DecisionStumpErrRate",
        "value": "0.4117647058823529"
      },
      {
        "name": "CfsSubsetEval_DecisionStumpKappa",
        "value": "0.0"
      },
      {
        "name": "CfsSubsetEval_NaiveBayesAUC",
        "value": "0.4880952380952381"
      },
      {
        "name": "CfsSubsetEval_NaiveBayesErrRate",
        "value": "0.4117647058823529"
      },
      {
        "name": "CfsSubsetEval_NaiveBayesKappa",
        "value": "0.0"
      },
      {
        "name": "CfsSubsetEval_kNN1NAUC",
        "value": "0.4880952380952381"
      },
      {
        "name": "CfsSubsetEval_kNN1NErrRate",
        "value": "0.4117647058823529"
      },
      {
        "name": "CfsSubsetEval_kNN1NKappa",
        "value": "0.0"
      },
      {
        "name": "ClassEntropy",
        "value": "0.9774178175281716"
      },
      {
        "name": "DecisionStumpAUC",
        "value": "0.6698412698412699"
      },
      {
        "name": "DecisionStumpErrRate",
        "value": "0.29411764705882354"
      },
      {
        "name": "DecisionStumpKappa",
        "value": "0.33070866141732286"
      },
      {
        "name": "Dimensionality",
        "value": "0.13725490196078433"
      },
      {
        "name": "EquivalentNumberOfAtts",
        "value": []
      },
      {
        "name": "J48.00001.AUC",
        "value": "0.6436507936507937"
      },
      {
        "name": "J48.00001.ErrRate",
        "value": "0.35294117647058826"
      },
      {
        "name": "J48.00001.Kappa",
        "value": "0.25000000000000006"
      },
      {
        "name": "J48.0001.AUC",
        "value": "0.6436507936507937"
      },
      {
        "name": "J48.0001.ErrRate",
        "value": "0.35294117647058826"
      },
      {
        "name": "J48.0001.Kappa",
        "value": "0.25000000000000006"
      },
      {
        "name": "J48.001.AUC",
        "value": "0.6436507936507937"
      },
      {
        "name": "J48.001.ErrRate",
        "value": "0.35294117647058826"
      },
      {
        "name": "J48.001.Kappa",
        "value": "0.25000000000000006"
      },
      {
        "name": "MajorityClassPercentage",
        "value": "58.82352941176471"
      },
      {
        "name": "MajorityClassSize",
        "value": "30.0"
      },
      {
        "name": "MaxAttributeEntropy",
        "value": []
      },
      {
        "name": "MaxKurtosisOfNumericAtts",
        "value": "10.131582193119982"
      },
      {
        "name": "MaxMeansOfNumericAtts",
        "value": "3763.705882352941"
      },
      {
        "name": "MaxMutualInformation",
        "value": []
      },
      {
        "name": "MaxNominalAttDistinctValues",
        "value": "2.0"
      },
      {
        "name": "MaxSkewnessOfNumericAtts",
        "value": "2.6866364914862864"
      },
      {
        "name": "MaxStdDevOfNumericAtts",
        "value": "594.7156394149272"
      },
      {
        "name": "MeanAttributeEntropy",
        "value": []
      },
      {
        "name": "MeanKurtosisOfNumericAtts",
        "value": "3.151097128531468"
      },
      {
        "name": "MeanMeansOfNumericAtts",
        "value": "657.2251633986928"
      },
      {
        "name": "MeanMutualInformation",
        "value": []
      },
      {
        "name": "MeanNoiseToSignalRatio",
        "value": []
      },
      {
        "name": "MeanNominalAttDistinctValues",
        "value": "2.0"
      },
      {
        "name": "MeanSkewnessOfNumericAtts",
        "value": "-0.07564814013230929"
      },
      {
        "name": "MeanStdDevOfNumericAtts",
        "value": "103.747907585191"
      },
      {
        "name": "MinAttributeEntropy",
        "value": []
      },
      {
        "name": "MinKurtosisOfNumericAtts",
        "value": "-0.6961755175355631"
      },
      {
        "name": "MinMeansOfNumericAtts",
        "value": "9.992156862745098"
      },
      {
        "name": "MinMutualInformation",
        "value": []
      },
      {
        "name": "MinNominalAttDistinctValues",
        "value": "2.0"
      },
      {
        "name": "MinSkewnessOfNumericAtts",
        "value": "-2.3585449530470584"
      },
      {
        "name": "MinStdDevOfNumericAtts",
        "value": "1.1114625587971205"
      },
      {
        "name": "MinorityClassPercentage",
        "value": "41.17647058823529"
      },
      {
        "name": "MinorityClassSize",
        "value": "21.0"
      },
      {
        "name": "NaiveBayesAUC",
        "value": "0.7285714285714286"
      },
      {
        "name": "NaiveBayesErrRate",
        "value": "0.2549019607843137"
      },
      {
        "name": "NaiveBayesKappa",
        "value": "0.46228710462287115"
      },
      {
        "name": "NumberOfBinaryFeatures",
        "value": "1.0"
      },
      {
        "name": "NumberOfClasses",
        "value": "2.0"
      },
      {
        "name": "NumberOfFeatures",
        "value": "7.0"
      },
      {
        "name": "NumberOfInstances",
        "value": "51.0"
      },
      {
        "name": "NumberOfInstancesWithMissingValues",
        "value": "0.0"
      },
      {
        "name": "NumberOfMissingValues",
        "value": "0.0"
      },
      {
        "name": "NumberOfNumericFeatures",
        "value": "6.0"
      },
      {
        "name": "NumberOfSymbolicFeatures",
        "value": "1.0"
      },
      {
        "name": "PercentageOfBinaryFeatures",
        "value": "14.285714285714285"
      },
      {
        "name": "PercentageOfInstancesWithMissingValues",
        "value": "0.0"
      },
      {
        "name": "PercentageOfMissingValues",
        "value": "0.0"
      },
      {
        "name": "PercentageOfNumericFeatures",
        "value": "85.71428571428571"
      },
      {
        "name": "PercentageOfSymbolicFeatures",
        "value": "14.285714285714285"
      },
      {
        "name": "Quartile1AttributeEntropy",
        "value": []
      },
      {
        "name": "Quartile1KurtosisOfNumericAtts",
        "value": "-0.690644093291616"
      },
      {
        "name": "Quartile1MeansOfNumericAtts",
        "value": "23.106862745098038"
      },
      {
        "name": "Quartile1MutualInformation",
        "value": []
      },
      {
        "name": "Quartile1SkewnessOfNumericAtts",
        "value": "-0.994001181970769"
      },
      {
        "name": "Quartile1StdDevOfNumericAtts",
        "value": "1.6895651786364059"
      },
      {
        "name": "Quartile2AttributeEntropy",
        "value": []
      },
      {
        "name": "Quartile2KurtosisOfNumericAtts",
        "value": "0.024879139772091996"
      },
      {
        "name": "Quartile2MeansOfNumericAtts",
        "value": "44.51274509803922"
      },
      {
        "name": "Quartile2MutualInformation",
        "value": []
      },
      {
        "name": "Quartile2SkewnessOfNumericAtts",
        "value": "-0.2749456956936138"
      },
      {
        "name": "Quartile2StdDevOfNumericAtts",
        "value": "6.064879959663452"
      },
      {
        "name": "Quartile3AttributeEntropy",
        "value": []
      },
      {
        "name": "Quartile3KurtosisOfNumericAtts",
        "value": "10.115559124232876"
      },
      {
        "name": "Quartile3MeansOfNumericAtts",
        "value": "980.7882352941176"
      },
      {
        "name": "Quartile3MutualInformation",
        "value": []
      },
      {
        "name": "Quartile3SkewnessOfNumericAtts",
        "value": "0.9019573256961844"
      },
      {
        "name": "Quartile3StdDevOfNumericAtts",
        "value": "158.16514802836576"
      },
      {
        "name": "REPTreeDepth1AUC",
        "value": "0.5706349206349205"
      },
      {
        "name": "REPTreeDepth1ErrRate",
        "value": "0.37254901960784315"
      },
      {
        "name": "REPTreeDepth1Kappa",
        "value": "0.12466124661246604"
      },
      {
        "name": "REPTreeDepth2AUC",
        "value": "0.5706349206349205"
      },
      {
        "name": "REPTreeDepth2ErrRate",
        "value": "0.37254901960784315"
      },
      {
        "name": "REPTreeDepth2Kappa",
        "value": "0.12466124661246604"
      },
      {
        "name": "REPTreeDepth3AUC",
        "value": "0.5706349206349205"
      },
      {
        "name": "REPTreeDepth3ErrRate",
        "value": "0.37254901960784315"
      },
      {
        "name": "REPTreeDepth3Kappa",
        "value": "0.12466124661246604"
      },
      {
        "name": "RandomTreeDepth1AUC",
        "value": "0.6452380952380953"
      },
      {
        "name": "RandomTreeDepth1ErrRate",
        "value": "0.3333333333333333"
      },
      {
        "name": "RandomTreeDepth1Kappa",
        "value": "0.2968369829683698"
      },
      {
        "name": "RandomTreeDepth2AUC",
        "value": "0.6452380952380953"
      },
      {
        "name": "RandomTreeDepth2ErrRate",
        "value": "0.3333333333333333"
      },
      {
        "name": "RandomTreeDepth2Kappa",
        "value": "0.2968369829683698"
      },
      {
        "name": "RandomTreeDepth3AUC",
        "value": "0.6452380952380953"
      },
      {
        "name": "RandomTreeDepth3ErrRate",
        "value": "0.3333333333333333"
      },
      {
        "name": "RandomTreeDepth3Kappa",
        "value": "0.2968369829683698"
      },
      {
        "name": "StdvNominalAttDistinctValues",
        "value": "0.0"
      },
      {
        "name": "kNN1NAUC",
        "value": "0.5857142857142857"
      },
      {
        "name": "kNN1NErrRate",
        "value": "0.4117647058823529"
      },
      {
        "name": "kNN1NKappa",
        "value": "0.16783216783216792"
      }
    ]
  }
}