{
  "data_set_description": {
    "default_target_attribute": "binaryClass",
    "description": "**Author**:   \n**Source**: Unknown - Date unknown  \n**Please cite**:   \n\nBinarized version of the original data set (see version 1). It converts the numeric target feature to a two-class nominal target feature by computing the mean and classifying all instances with a lower target value as positive ('P') and all others as negative ('N').",
    "description_version": "1",
    "file_id": "53306",
    "format": "ARFF",
    "id": "772",
    "licence": "Public",
    "md5_checksum": "e729512f04875d5822a8e2a3ca1f8f2e",
    "minio_url": "https://data.openml.org/datasets/0000/0772/dataset_772.pq",
    "name": "quake",
    "parquet_url": "https://data.openml.org/datasets/0000/0772/dataset_772.pq",
    "processing_date": "2020-11-20 20:14:21",
    "status": "active",
    "tag": [
      "binarized_regression_problem",
      "Data Processing",
      "Machine Learning",
      "mythbusting_1",
      "Research",
      "Statistics",
      "study_1",
      "study_15",
      "study_20",
      "study_41",
      "study_7"
    ],
    "upload_date": "2014-10-04T14:33:05",
    "url": "https://api.openml.org/data/v1/download/53306/quake.arff",
    "version": "3",
    "visibility": "public"
  }
}