{
  "data_features": {
    "feature": [
      {
        "data_type": "nominal",
        "index": "0",
        "is_ignore": "false",
        "is_row_identifier": "false",
        "is_target": "false",
        "name": "Automatic",
        "nominal_value": [
          "CA",
          "H",
          "MA",
          "N",
          "OA"
        ],
        "number_of_missing_values": "0"
      },
      {
        "data_type": "nominal",
        "index": "1",
        "is_ignore": "false",
        "is_row_identifier": "false",
        "is_target": "false",
        "name": "Scorer_1",
        "nominal_value": [
          "CA",
          "H",
          "MA",
          "N",
          "OA"
        ],
        "number_of_missing_values": "0"
      },
      {
        "data_type": "numeric",
        "index": "2",
        "is_ignore": "false",
        "is_row_identifier": "false",
        "is_target": "false",
        "name": "Subject",
        "number_of_missing_values": "0"
      },
      {
        "data_type": "nominal",
        "index": "3",
        "is_ignore": "false",
        "is_row_identifier": "false",
        "is_target": "true",
        "name": "binaryClass",
        "nominal_value": [
          "N",
          "P"
        ],
        "number_of_missing_values": "0"
      }
    ]
  }
}