{
  "data_set_description": {
    "default_target_attribute": "binaryClass",
    "description": "**Author**:   \n**Source**: Unknown - Date unknown  \n**Please cite**:   \n\nBinarized version of the original data set (see version 1). It converts the numeric target feature to a two-class nominal target feature by computing the mean and classifying all instances with a lower target value as positive ('P') and all others as negative ('N').",
    "description_version": "1",
    "file_id": "53298",
    "format": "ARFF",
    "id": "764",
    "licence": "Public",
    "md5_checksum": "99a3de059e0a7eac815e36d486fec8b3",
    "minio_url": "https://data.openml.org/datasets/0000/0764/dataset_764.pq",
    "name": "analcatdata_apnea3",
    "parquet_url": "https://data.openml.org/datasets/0000/0764/dataset_764.pq",
    "processing_date": "2020-11-20 20:11:35",
    "status": "active",
    "tag": [
      "Data Science",
      "Machine Learning",
      "mythbusting_1",
      "Research",
      "Statistics",
      "study_1",
      "study_127",
      "study_15",
      "study_20",
      "study_41",
      "study_7",
      "study_88"
    ],
    "upload_date": "2014-10-04T14:32:50",
    "url": "https://api.openml.org/data/v1/download/53298/analcatdata_apnea3.arff",
    "version": "2",
    "visibility": "public"
  }
}