{
  "data_qualities": {
    "quality": [
      {
        "name": "AutoCorrelation",
        "value": "0.8240534521158129"
      },
      {
        "name": "CfsSubsetEval_DecisionStumpAUC",
        "value": "0.7691369390103567"
      },
      {
        "name": "CfsSubsetEval_DecisionStumpErrRate",
        "value": "0.10666666666666667"
      },
      {
        "name": "CfsSubsetEval_DecisionStumpKappa",
        "value": "0.20383339476594137"
      },
      {
        "name": "CfsSubsetEval_NaiveBayesAUC",
        "value": "0.7691369390103567"
      },
      {
        "name": "CfsSubsetEval_NaiveBayesErrRate",
        "value": "0.10666666666666667"
      },
      {
        "name": "CfsSubsetEval_NaiveBayesKappa",
        "value": "0.20383339476594137"
      },
      {
        "name": "CfsSubsetEval_kNN1NAUC",
        "value": "0.7691369390103567"
      },
      {
        "name": "CfsSubsetEval_kNN1NErrRate",
        "value": "0.10666666666666667"
      },
      {
        "name": "CfsSubsetEval_kNN1NKappa",
        "value": "0.20383339476594137"
      },
      {
        "name": "ClassEntropy",
        "value": "0.5357150195407703"
      },
      {
        "name": "DecisionStumpAUC",
        "value": "0.6005523590333717"
      },
      {
        "name": "DecisionStumpErrRate",
        "value": "0.12222222222222222"
      },
      {
        "name": "DecisionStumpKappa",
        "value": "0.0"
      },
      {
        "name": "Dimensionality",
        "value": "0.008888888888888889"
      },
      {
        "name": "EquivalentNumberOfAtts",
        "value": "4.556064772581695"
      },
      {
        "name": "J48.00001.AUC",
        "value": "0.8907940161104718"
      },
      {
        "name": "J48.00001.ErrRate",
        "value": "0.09111111111111111"
      },
      {
        "name": "J48.00001.Kappa",
        "value": "0.47210300429184543"
      },
      {
        "name": "J48.0001.AUC",
        "value": "0.8907940161104718"
      },
      {
        "name": "J48.0001.ErrRate",
        "value": "0.09111111111111111"
      },
      {
        "name": "J48.0001.Kappa",
        "value": "0.47210300429184543"
      },
      {
        "name": "J48.001.AUC",
        "value": "0.8907940161104718"
      },
      {
        "name": "J48.001.ErrRate",
        "value": "0.09111111111111111"
      },
      {
        "name": "J48.001.Kappa",
        "value": "0.47210300429184543"
      },
      {
        "name": "MajorityClassPercentage",
        "value": "87.77777777777777"
      },
      {
        "name": "MajorityClassSize",
        "value": "395.0"
      },
      {
        "name": "MaxAttributeEntropy",
        "value": "2.321928094887362"
      },
      {
        "name": "MaxKurtosisOfNumericAtts",
        "value": "-1.2075015806393137"
      },
      {
        "name": "MaxMeansOfNumericAtts",
        "value": "9.5"
      },
      {
        "name": "MaxMutualInformation",
        "value": "0.11830709998457"
      },
      {
        "name": "MaxNominalAttDistinctValues",
        "value": "5.0"
      },
      {
        "name": "MaxSkewnessOfNumericAtts",
        "value": "0.0"
      },
      {
        "name": "MaxStdDevOfNumericAtts",
        "value": "5.193901683641292"
      },
      {
        "name": "MeanAttributeEntropy",
        "value": "2.321928094887362"
      },
      {
        "name": "MeanKurtosisOfNumericAtts",
        "value": "-1.2075015806393137"
      },
      {
        "name": "MeanMeansOfNumericAtts",
        "value": "9.5"
      },
      {
        "name": "MeanMutualInformation",
        "value": "0.11758283656648"
      },
      {
        "name": "MeanNoiseToSignalRatio",
        "value": "18.74716857229899"
      },
      {
        "name": "MeanNominalAttDistinctValues",
        "value": "4.0"
      },
      {
        "name": "MeanSkewnessOfNumericAtts",
        "value": "0.0"
      },
      {
        "name": "MeanStdDevOfNumericAtts",
        "value": "5.193901683641292"
      },
      {
        "name": "MinAttributeEntropy",
        "value": "2.321928094887362"
      },
      {
        "name": "MinKurtosisOfNumericAtts",
        "value": "-1.2075015806393137"
      },
      {
        "name": "MinMeansOfNumericAtts",
        "value": "9.5"
      },
      {
        "name": "MinMutualInformation",
        "value": "0.11685857314839"
      },
      {
        "name": "MinNominalAttDistinctValues",
        "value": "2.0"
      },
      {
        "name": "MinSkewnessOfNumericAtts",
        "value": "0.0"
      },
      {
        "name": "MinStdDevOfNumericAtts",
        "value": "5.193901683641292"
      },
      {
        "name": "MinorityClassPercentage",
        "value": "12.222222222222221"
      },
      {
        "name": "MinorityClassSize",
        "value": "55.0"
      },
      {
        "name": "NaiveBayesAUC",
        "value": "0.9048101265822784"
      },
      {
        "name": "NaiveBayesErrRate",
        "value": "0.10444444444444445"
      },
      {
        "name": "NaiveBayesKappa",
        "value": "0.32963549920760676"
      },
      {
        "name": "NumberOfBinaryFeatures",
        "value": "1.0"
      },
      {
        "name": "NumberOfClasses",
        "value": "2.0"
      },
      {
        "name": "NumberOfFeatures",
        "value": "4.0"
      },
      {
        "name": "NumberOfInstances",
        "value": "450.0"
      },
      {
        "name": "NumberOfInstancesWithMissingValues",
        "value": "0.0"
      },
      {
        "name": "NumberOfMissingValues",
        "value": "0.0"
      },
      {
        "name": "NumberOfNumericFeatures",
        "value": "1.0"
      },
      {
        "name": "NumberOfSymbolicFeatures",
        "value": "3.0"
      },
      {
        "name": "PercentageOfBinaryFeatures",
        "value": "25.0"
      },
      {
        "name": "PercentageOfInstancesWithMissingValues",
        "value": "0.0"
      },
      {
        "name": "PercentageOfMissingValues",
        "value": "0.0"
      },
      {
        "name": "PercentageOfNumericFeatures",
        "value": "25.0"
      },
      {
        "name": "PercentageOfSymbolicFeatures",
        "value": "75.0"
      },
      {
        "name": "Quartile1AttributeEntropy",
        "value": "2.321928094887362"
      },
      {
        "name": "Quartile1KurtosisOfNumericAtts",
        "value": "-1.2075015806393137"
      },
      {
        "name": "Quartile1MeansOfNumericAtts",
        "value": "9.5"
      },
      {
        "name": "Quartile1MutualInformation",
        "value": "0.11685857314839"
      },
      {
        "name": "Quartile1SkewnessOfNumericAtts",
        "value": "0.0"
      },
      {
        "name": "Quartile1StdDevOfNumericAtts",
        "value": "5.193901683641292"
      },
      {
        "name": "Quartile2AttributeEntropy",
        "value": "2.321928094887362"
      },
      {
        "name": "Quartile2KurtosisOfNumericAtts",
        "value": "-1.2075015806393137"
      },
      {
        "name": "Quartile2MeansOfNumericAtts",
        "value": "9.5"
      },
      {
        "name": "Quartile2MutualInformation",
        "value": "0.11758283656648"
      },
      {
        "name": "Quartile2SkewnessOfNumericAtts",
        "value": "0.0"
      },
      {
        "name": "Quartile2StdDevOfNumericAtts",
        "value": "5.193901683641292"
      },
      {
        "name": "Quartile3AttributeEntropy",
        "value": "2.321928094887362"
      },
      {
        "name": "Quartile3KurtosisOfNumericAtts",
        "value": "-1.2075015806393137"
      },
      {
        "name": "Quartile3MeansOfNumericAtts",
        "value": "9.5"
      },
      {
        "name": "Quartile3MutualInformation",
        "value": "0.11830709998457"
      },
      {
        "name": "Quartile3SkewnessOfNumericAtts",
        "value": "0.0"
      },
      {
        "name": "Quartile3StdDevOfNumericAtts",
        "value": "5.193901683641292"
      },
      {
        "name": "REPTreeDepth1AUC",
        "value": "0.8956271576524741"
      },
      {
        "name": "REPTreeDepth1ErrRate",
        "value": "0.08444444444444445"
      },
      {
        "name": "REPTreeDepth1Kappa",
        "value": "0.5154434684046474"
      },
      {
        "name": "REPTreeDepth2AUC",
        "value": "0.8956271576524741"
      },
      {
        "name": "REPTreeDepth2ErrRate",
        "value": "0.08444444444444445"
      },
      {
        "name": "REPTreeDepth2Kappa",
        "value": "0.5154434684046474"
      },
      {
        "name": "REPTreeDepth3AUC",
        "value": "0.8956271576524741"
      },
      {
        "name": "REPTreeDepth3ErrRate",
        "value": "0.08444444444444445"
      },
      {
        "name": "REPTreeDepth3Kappa",
        "value": "0.5154434684046474"
      },
      {
        "name": "RandomTreeDepth1AUC",
        "value": "0.757813578826237"
      },
      {
        "name": "RandomTreeDepth1ErrRate",
        "value": "0.09555555555555556"
      },
      {
        "name": "RandomTreeDepth1Kappa",
        "value": "0.520921020054469"
      },
      {
        "name": "RandomTreeDepth2AUC",
        "value": "0.757813578826237"
      },
      {
        "name": "RandomTreeDepth2ErrRate",
        "value": "0.09555555555555556"
      },
      {
        "name": "RandomTreeDepth2Kappa",
        "value": "0.520921020054469"
      },
      {
        "name": "RandomTreeDepth3AUC",
        "value": "0.757813578826237"
      },
      {
        "name": "RandomTreeDepth3ErrRate",
        "value": "0.09555555555555556"
      },
      {
        "name": "RandomTreeDepth3Kappa",
        "value": "0.520921020054469"
      },
      {
        "name": "StdvNominalAttDistinctValues",
        "value": "1.7320508075688772"
      },
      {
        "name": "kNN1NAUC",
        "value": "0.7406674338319909"
      },
      {
        "name": "kNN1NErrRate",
        "value": "0.10666666666666667"
      },
      {
        "name": "kNN1NKappa",
        "value": "0.4696783697520253"
      }
    ]
  }
}