{
  "data_qualities": {
    "quality": [
      {
        "name": "AutoCorrelation",
        "value": "0.46184738955823296"
      },
      {
        "name": "CfsSubsetEval_DecisionStumpAUC",
        "value": "0.830528"
      },
      {
        "name": "CfsSubsetEval_DecisionStumpErrRate",
        "value": "0.2"
      },
      {
        "name": "CfsSubsetEval_DecisionStumpKappa",
        "value": "0.6000000000000001"
      },
      {
        "name": "CfsSubsetEval_NaiveBayesAUC",
        "value": "0.830528"
      },
      {
        "name": "CfsSubsetEval_NaiveBayesErrRate",
        "value": "0.2"
      },
      {
        "name": "CfsSubsetEval_NaiveBayesKappa",
        "value": "0.6000000000000001"
      },
      {
        "name": "CfsSubsetEval_kNN1NAUC",
        "value": "0.830528"
      },
      {
        "name": "CfsSubsetEval_kNN1NErrRate",
        "value": "0.2"
      },
      {
        "name": "CfsSubsetEval_kNN1NKappa",
        "value": "0.6000000000000001"
      },
      {
        "name": "ClassEntropy",
        "value": "1.0"
      },
      {
        "name": "DecisionStumpAUC",
        "value": "0.71952"
      },
      {
        "name": "DecisionStumpErrRate",
        "value": "0.272"
      },
      {
        "name": "DecisionStumpKappa",
        "value": "0.45599999999999996"
      },
      {
        "name": "Dimensionality",
        "value": "0.044"
      },
      {
        "name": "EquivalentNumberOfAtts",
        "value": []
      },
      {
        "name": "J48.00001.AUC",
        "value": "0.768"
      },
      {
        "name": "J48.00001.ErrRate",
        "value": "0.2"
      },
      {
        "name": "J48.00001.Kappa",
        "value": "0.6000000000000001"
      },
      {
        "name": "J48.0001.AUC",
        "value": "0.768"
      },
      {
        "name": "J48.0001.ErrRate",
        "value": "0.2"
      },
      {
        "name": "J48.0001.Kappa",
        "value": "0.6000000000000001"
      },
      {
        "name": "J48.001.AUC",
        "value": "0.768"
      },
      {
        "name": "J48.001.ErrRate",
        "value": "0.2"
      },
      {
        "name": "J48.001.Kappa",
        "value": "0.6000000000000001"
      },
      {
        "name": "MajorityClassPercentage",
        "value": "50.0"
      },
      {
        "name": "MajorityClassSize",
        "value": "125.0"
      },
      {
        "name": "MaxAttributeEntropy",
        "value": []
      },
      {
        "name": "MaxKurtosisOfNumericAtts",
        "value": "-1.0614096279864451"
      },
      {
        "name": "MaxMeansOfNumericAtts",
        "value": "4.000000005355275E-8"
      },
      {
        "name": "MaxMutualInformation",
        "value": []
      },
      {
        "name": "MaxNominalAttDistinctValues",
        "value": "2.0"
      },
      {
        "name": "MaxSkewnessOfNumericAtts",
        "value": "0.12543682949236076"
      },
      {
        "name": "MaxStdDevOfNumericAtts",
        "value": "1.0000000526063508"
      },
      {
        "name": "MeanAttributeEntropy",
        "value": []
      },
      {
        "name": "MeanKurtosisOfNumericAtts",
        "value": "-1.1516556466263703"
      },
      {
        "name": "MeanMeansOfNumericAtts",
        "value": "5.599999996783179E-9"
      },
      {
        "name": "MeanMutualInformation",
        "value": []
      },
      {
        "name": "MeanNoiseToSignalRatio",
        "value": []
      },
      {
        "name": "MeanNominalAttDistinctValues",
        "value": "2.0"
      },
      {
        "name": "MeanSkewnessOfNumericAtts",
        "value": "-0.015527943348436005"
      },
      {
        "name": "MeanStdDevOfNumericAtts",
        "value": "1.0000000284482324"
      },
      {
        "name": "MinAttributeEntropy",
        "value": []
      },
      {
        "name": "MinKurtosisOfNumericAtts",
        "value": "-1.2642171931894317"
      },
      {
        "name": "MinMeansOfNumericAtts",
        "value": "-4.800000000426685E-8"
      },
      {
        "name": "MinMutualInformation",
        "value": []
      },
      {
        "name": "MinNominalAttDistinctValues",
        "value": "2.0"
      },
      {
        "name": "MinSkewnessOfNumericAtts",
        "value": "-0.15693574929953702"
      },
      {
        "name": "MinStdDevOfNumericAtts",
        "value": "0.9999999827742189"
      },
      {
        "name": "MinorityClassPercentage",
        "value": "50.0"
      },
      {
        "name": "MinorityClassSize",
        "value": "125.0"
      },
      {
        "name": "NaiveBayesAUC",
        "value": "0.914688"
      },
      {
        "name": "NaiveBayesErrRate",
        "value": "0.176"
      },
      {
        "name": "NaiveBayesKappa",
        "value": "0.6479999999999999"
      },
      {
        "name": "NumberOfBinaryFeatures",
        "value": "1.0"
      },
      {
        "name": "NumberOfClasses",
        "value": "2.0"
      },
      {
        "name": "NumberOfFeatures",
        "value": "11.0"
      },
      {
        "name": "NumberOfInstances",
        "value": "250.0"
      },
      {
        "name": "NumberOfInstancesWithMissingValues",
        "value": "0.0"
      },
      {
        "name": "NumberOfMissingValues",
        "value": "0.0"
      },
      {
        "name": "NumberOfNumericFeatures",
        "value": "10.0"
      },
      {
        "name": "NumberOfSymbolicFeatures",
        "value": "1.0"
      },
      {
        "name": "PercentageOfBinaryFeatures",
        "value": "9.090909090909092"
      },
      {
        "name": "PercentageOfInstancesWithMissingValues",
        "value": "0.0"
      },
      {
        "name": "PercentageOfMissingValues",
        "value": "0.0"
      },
      {
        "name": "PercentageOfNumericFeatures",
        "value": "90.9090909090909"
      },
      {
        "name": "PercentageOfSymbolicFeatures",
        "value": "9.090909090909092"
      },
      {
        "name": "Quartile1AttributeEntropy",
        "value": []
      },
      {
        "name": "Quartile1KurtosisOfNumericAtts",
        "value": "-1.1960587310872892"
      },
      {
        "name": "Quartile1MeansOfNumericAtts",
        "value": "-6.0000000313212294E-9"
      },
      {
        "name": "Quartile1MutualInformation",
        "value": []
      },
      {
        "name": "Quartile1SkewnessOfNumericAtts",
        "value": "-0.08162262136640586"
      },
      {
        "name": "Quartile1StdDevOfNumericAtts",
        "value": "1.000000014740943"
      },
      {
        "name": "Quartile2AttributeEntropy",
        "value": []
      },
      {
        "name": "Quartile2KurtosisOfNumericAtts",
        "value": "-1.1524794589704002"
      },
      {
        "name": "Quartile2MeansOfNumericAtts",
        "value": "3.999999949710897E-9"
      },
      {
        "name": "Quartile2MutualInformation",
        "value": []
      },
      {
        "name": "Quartile2SkewnessOfNumericAtts",
        "value": "-0.022003350346107533"
      },
      {
        "name": "Quartile2StdDevOfNumericAtts",
        "value": "1.000000032931719"
      },
      {
        "name": "Quartile3AttributeEntropy",
        "value": []
      },
      {
        "name": "Quartile3KurtosisOfNumericAtts",
        "value": "-1.0856779442939979"
      },
      {
        "name": "Quartile3MeansOfNumericAtts",
        "value": "2.5000000026587086E-8"
      },
      {
        "name": "Quartile3MutualInformation",
        "value": []
      },
      {
        "name": "Quartile3SkewnessOfNumericAtts",
        "value": "0.06394257890311236"
      },
      {
        "name": "Quartile3StdDevOfNumericAtts",
        "value": "1.0000000449655047"
      },
      {
        "name": "REPTreeDepth1AUC",
        "value": "0.799552"
      },
      {
        "name": "REPTreeDepth1ErrRate",
        "value": "0.22"
      },
      {
        "name": "REPTreeDepth1Kappa",
        "value": "0.56"
      },
      {
        "name": "REPTreeDepth2AUC",
        "value": "0.799552"
      },
      {
        "name": "REPTreeDepth2ErrRate",
        "value": "0.22"
      },
      {
        "name": "REPTreeDepth2Kappa",
        "value": "0.56"
      },
      {
        "name": "REPTreeDepth3AUC",
        "value": "0.799552"
      },
      {
        "name": "REPTreeDepth3ErrRate",
        "value": "0.22"
      },
      {
        "name": "REPTreeDepth3Kappa",
        "value": "0.56"
      },
      {
        "name": "RandomTreeDepth1AUC",
        "value": "0.732"
      },
      {
        "name": "RandomTreeDepth1ErrRate",
        "value": "0.268"
      },
      {
        "name": "RandomTreeDepth1Kappa",
        "value": "0.46399999999999997"
      },
      {
        "name": "RandomTreeDepth2AUC",
        "value": "0.732"
      },
      {
        "name": "RandomTreeDepth2ErrRate",
        "value": "0.268"
      },
      {
        "name": "RandomTreeDepth2Kappa",
        "value": "0.46399999999999997"
      },
      {
        "name": "RandomTreeDepth3AUC",
        "value": "0.732"
      },
      {
        "name": "RandomTreeDepth3ErrRate",
        "value": "0.268"
      },
      {
        "name": "RandomTreeDepth3Kappa",
        "value": "0.46399999999999997"
      },
      {
        "name": "StdvNominalAttDistinctValues",
        "value": "0.0"
      },
      {
        "name": "kNN1NAUC",
        "value": "0.728"
      },
      {
        "name": "kNN1NErrRate",
        "value": "0.272"
      },
      {
        "name": "kNN1NKappa",
        "value": "0.45599999999999996"
      }
    ]
  }
}