{
  "data_features": {
    "feature": [
      {
        "data_type": "numeric",
        "index": "0",
        "is_ignore": "false",
        "is_row_identifier": "false",
        "is_target": "false",
        "name": "heart_rate",
        "number_of_missing_values": "0"
      },
      {
        "data_type": "nominal",
        "index": "1",
        "is_ignore": "false",
        "is_row_identifier": "false",
        "is_target": "false",
        "name": "sleep_state",
        "nominal_value": [
          "1",
          "2",
          "3",
          "4"
        ],
        "number_of_missing_values": "0"
      },
      {
        "data_type": "nominal",
        "index": "2",
        "is_ignore": "false",
        "is_row_identifier": "false",
        "is_target": "true",
        "name": "binaryClass",
        "nominal_value": [
          "N",
          "P"
        ],
        "number_of_missing_values": "0"
      }
    ]
  }
}