{
  "data_qualities": {
    "quality": [
      {
        "name": "AutoCorrelation",
        "value": "0.5005245005245005"
      },
      {
        "name": "CfsSubsetEval_DecisionStumpAUC",
        "value": "0.6694234991343117"
      },
      {
        "name": "CfsSubsetEval_DecisionStumpErrRate",
        "value": "0.344194"
      },
      {
        "name": "CfsSubsetEval_DecisionStumpKappa",
        "value": "0.32978609822015265"
      },
      {
        "name": "CfsSubsetEval_NaiveBayesAUC",
        "value": "0.949120042028445"
      },
      {
        "name": "CfsSubsetEval_NaiveBayesErrRate",
        "value": "0.094968"
      },
      {
        "name": "CfsSubsetEval_NaiveBayesKappa",
        "value": "0.8092800480213912"
      },
      {
        "name": "CfsSubsetEval_kNN1NAUC",
        "value": "0.9603077760886697"
      },
      {
        "name": "CfsSubsetEval_kNN1NErrRate",
        "value": "0.081289"
      },
      {
        "name": "CfsSubsetEval_kNN1NKappa",
        "value": "0.8369123551871511"
      },
      {
        "name": "ClassEntropy",
        "value": "0.9986188549650422"
      },
      {
        "name": "DecisionStumpAUC",
        "value": "0.6694234991343117"
      },
      {
        "name": "DecisionStumpErrRate",
        "value": "0.344194"
      },
      {
        "name": "DecisionStumpKappa",
        "value": "0.32978609822015265"
      },
      {
        "name": "Dimensionality",
        "value": "3.7E-5"
      },
      {
        "name": "EquivalentNumberOfAtts",
        "value": "60.463334817695646"
      },
      {
        "name": "J48.00001.AUC",
        "value": "0.9785864901798598"
      },
      {
        "name": "J48.00001.ErrRate",
        "value": "0.044941"
      },
      {
        "name": "J48.00001.Kappa",
        "value": "0.9101099773154754"
      },
      {
        "name": "J48.0001.AUC",
        "value": "0.9790691344251106"
      },
      {
        "name": "J48.0001.ErrRate",
        "value": "0.044388"
      },
      {
        "name": "J48.0001.Kappa",
        "value": "0.9112091064374911"
      },
      {
        "name": "J48.001.AUC",
        "value": "0.9800517589338342"
      },
      {
        "name": "J48.001.ErrRate",
        "value": "0.043282"
      },
      {
        "name": "J48.001.Kappa",
        "value": "0.9134217503023278"
      },
      {
        "name": "MajorityClassPercentage",
        "value": "52.1875"
      },
      {
        "name": "MajorityClassSize",
        "value": "521875.0"
      },
      {
        "name": "MaxAttributeEntropy",
        "value": "0.9946794412534943"
      },
      {
        "name": "MaxKurtosisOfNumericAtts",
        "value": []
      },
      {
        "name": "MaxMeansOfNumericAtts",
        "value": []
      },
      {
        "name": "MaxMutualInformation",
        "value": "0.16531762210862"
      },
      {
        "name": "MaxNominalAttDistinctValues",
        "value": "3.0"
      },
      {
        "name": "MaxSkewnessOfNumericAtts",
        "value": []
      },
      {
        "name": "MaxStdDevOfNumericAtts",
        "value": []
      },
      {
        "name": "MeanAttributeEntropy",
        "value": "0.6053051390048056"
      },
      {
        "name": "MeanKurtosisOfNumericAtts",
        "value": []
      },
      {
        "name": "MeanMeansOfNumericAtts",
        "value": []
      },
      {
        "name": "MeanMutualInformation",
        "value": "0.016516106132352777"
      },
      {
        "name": "MeanNoiseToSignalRatio",
        "value": "35.649385403203254"
      },
      {
        "name": "MeanNominalAttDistinctValues",
        "value": "2.054054054054054"
      },
      {
        "name": "MeanSkewnessOfNumericAtts",
        "value": []
      },
      {
        "name": "MeanStdDevOfNumericAtts",
        "value": []
      },
      {
        "name": "MinAttributeEntropy",
        "value": "0.00758573116941784"
      },
      {
        "name": "MinKurtosisOfNumericAtts",
        "value": []
      },
      {
        "name": "MinMeansOfNumericAtts",
        "value": []
      },
      {
        "name": "MinMutualInformation",
        "value": "4.41964521E-6"
      },
      {
        "name": "MinNominalAttDistinctValues",
        "value": "2.0"
      },
      {
        "name": "MinSkewnessOfNumericAtts",
        "value": []
      },
      {
        "name": "MinStdDevOfNumericAtts",
        "value": []
      },
      {
        "name": "MinorityClassPercentage",
        "value": "47.8125"
      },
      {
        "name": "MinorityClassSize",
        "value": "478125.0"
      },
      {
        "name": "NaiveBayesAUC",
        "value": "0.9243306379577159"
      },
      {
        "name": "NaiveBayesErrRate",
        "value": "0.148651"
      },
      {
        "name": "NaiveBayesKappa",
        "value": "0.7019236348629195"
      },
      {
        "name": "NumberOfBinaryFeatures",
        "value": "35.0"
      },
      {
        "name": "NumberOfClasses",
        "value": "2.0"
      },
      {
        "name": "NumberOfFeatures",
        "value": "37.0"
      },
      {
        "name": "NumberOfInstances",
        "value": "1000000.0"
      },
      {
        "name": "NumberOfInstancesWithMissingValues",
        "value": "0.0"
      },
      {
        "name": "NumberOfMissingValues",
        "value": "0.0"
      },
      {
        "name": "NumberOfNumericFeatures",
        "value": "0.0"
      },
      {
        "name": "NumberOfSymbolicFeatures",
        "value": "37.0"
      },
      {
        "name": "PercentageOfBinaryFeatures",
        "value": "94.5945945945946"
      },
      {
        "name": "PercentageOfInstancesWithMissingValues",
        "value": "0.0"
      },
      {
        "name": "PercentageOfMissingValues",
        "value": "0.0"
      },
      {
        "name": "PercentageOfNumericFeatures",
        "value": "0.0"
      },
      {
        "name": "PercentageOfSymbolicFeatures",
        "value": "100.0"
      },
      {
        "name": "Quartile1AttributeEntropy",
        "value": "0.3102589555784368"
      },
      {
        "name": "Quartile1KurtosisOfNumericAtts",
        "value": []
      },
      {
        "name": "Quartile1MeansOfNumericAtts",
        "value": []
      },
      {
        "name": "Quartile1MutualInformation",
        "value": "7.20603935305E-4"
      },
      {
        "name": "Quartile1SkewnessOfNumericAtts",
        "value": []
      },
      {
        "name": "Quartile1StdDevOfNumericAtts",
        "value": []
      },
      {
        "name": "Quartile2AttributeEntropy",
        "value": "0.6994821667333457"
      },
      {
        "name": "Quartile2KurtosisOfNumericAtts",
        "value": []
      },
      {
        "name": "Quartile2MeansOfNumericAtts",
        "value": []
      },
      {
        "name": "Quartile2MutualInformation",
        "value": "0.00580649021398"
      },
      {
        "name": "Quartile2SkewnessOfNumericAtts",
        "value": []
      },
      {
        "name": "Quartile2StdDevOfNumericAtts",
        "value": []
      },
      {
        "name": "Quartile3AttributeEntropy",
        "value": "0.9149467577761026"
      },
      {
        "name": "Quartile3KurtosisOfNumericAtts",
        "value": []
      },
      {
        "name": "Quartile3MeansOfNumericAtts",
        "value": []
      },
      {
        "name": "Quartile3MutualInformation",
        "value": "0.0162342577941475"
      },
      {
        "name": "Quartile3SkewnessOfNumericAtts",
        "value": []
      },
      {
        "name": "Quartile3StdDevOfNumericAtts",
        "value": []
      },
      {
        "name": "REPTreeDepth1AUC",
        "value": "0.6694234991343117"
      },
      {
        "name": "REPTreeDepth1ErrRate",
        "value": "0.344194"
      },
      {
        "name": "REPTreeDepth1Kappa",
        "value": "0.32978609822015265"
      },
      {
        "name": "REPTreeDepth2AUC",
        "value": "0.8195768294972096"
      },
      {
        "name": "REPTreeDepth2ErrRate",
        "value": "0.25543"
      },
      {
        "name": "REPTreeDepth2Kappa",
        "value": "0.4767307414838115"
      },
      {
        "name": "REPTreeDepth3AUC",
        "value": "0.9222011791845329"
      },
      {
        "name": "REPTreeDepth3ErrRate",
        "value": "0.111899"
      },
      {
        "name": "REPTreeDepth3Kappa",
        "value": "0.774652765934202"
      },
      {
        "name": "RandomTreeDepth1AUC",
        "value": "0.6408461624257681"
      },
      {
        "name": "RandomTreeDepth1ErrRate",
        "value": "0.381473"
      },
      {
        "name": "RandomTreeDepth1Kappa",
        "value": "0.2319510443361215"
      },
      {
        "name": "RandomTreeDepth2AUC",
        "value": "0.6693252851385856"
      },
      {
        "name": "RandomTreeDepth2ErrRate",
        "value": "0.347749"
      },
      {
        "name": "RandomTreeDepth2Kappa",
        "value": "0.29145963173877765"
      },
      {
        "name": "RandomTreeDepth3AUC",
        "value": "0.6893876118317718"
      },
      {
        "name": "RandomTreeDepth3ErrRate",
        "value": "0.362413"
      },
      {
        "name": "RandomTreeDepth3Kappa",
        "value": "0.270056732724767"
      },
      {
        "name": "StdvNominalAttDistinctValues",
        "value": "0.22924343513512566"
      },
      {
        "name": "kNN1NAUC",
        "value": "0.984091090845484"
      },
      {
        "name": "kNN1NErrRate",
        "value": "0.046816"
      },
      {
        "name": "kNN1NKappa",
        "value": "0.9062890614195"
      }
    ]
  }
}