{
  "data_set_description": {
    "citation": "Ramsey, Fred, and Daniel Schafer. The statistical sleuth: a course in methods of data analysis. Cengage Learning, 2012.",
    "collection_date": "1997-10-14",
    "creator": [
      "Ramsey",
      "Fred",
      "Daniel Schafer"
    ],
    "default_target_attribute": "Age13IQ",
    "description": "**Author**:   \n**Source**: Unknown - Date unknown  \n**Please cite**:   \n\nContains 110 data sets from the book 'The Statistical Sleuth'\nby Fred Ramsey and Dan Schafer; Duxbury Press, 1997.\n(schafer@stat.orst.edu) [14/Oct/97] (172k)\n\nNote: description taken from this web site:\nhttp://lib.stat.cmu.edu/datasets/\n\nFile: ../data/sleuth/ex1605.asc\n\n\nInformation about the dataset\nCLASSTYPE: numeric\nCLASSINDEX: none specific",
    "description_version": "1",
    "file_id": "52987",
    "format": "ARFF",
    "id": "687",
    "language": "English",
    "licence": "Public",
    "md5_checksum": "d9d0e11f56015fbbf07de3e06755014d",
    "minio_url": "https://data.openml.org/datasets/0000/0687/dataset_687.pq",
    "name": "sleuth_ex1605",
    "original_data_url": "http://lib.stat.cmu.edu/datasets/",
    "paper_url": "https://www.jstor.org/stable/pdf/2685617.pdf",
    "parquet_url": "https://data.openml.org/datasets/0000/0687/dataset_687.pq",
    "processing_date": "2020-11-20 20:33:36",
    "status": "active",
    "tag": [
      "Statistics",
      "StatLib"
    ],
    "upload_date": "2014-10-04T13:54:29",
    "url": "https://api.openml.org/data/v1/download/52987/sleuth_ex1605.arff",
    "version": "1",
    "visibility": "public"
  }
}