"molecule_id","AMW","C.","H.","Me","Mi","Mp","Mv","MW","N.","nAB","nAT","nB","nBM","nBO","nBR","nBT","nC","nCL","nCsp","nCsp2","nCsp3","nDB","nF","nH","nHet","nHM","nI","nN","nO","nP","nS","nSK","nTB","nX","O.","RBF","RBN","SCBO","Se","Si","Sp","Sv","X.","pXC50"
{1 10.757,2 33.3,3 25,4 1.108,5 1.146,6 0.632,7 0.701,8 129.08,9 8.3,10 5,11 12,13 6,14 9,16 12,17 4,20 4,22 1,24 3,25 5,28 1,29 4,32 9,35 33.3,36 0.083,37 1,38 12.5,39 13.295,40 13.751,41 7.585,42 8.407,44 4.268}
{0 CHEMBL1232973,1 13.285,2 27.3,3 18.2,4 1.115,5 1.14,6 0.729,7 0.761,8 146.14,9 18.2,10 5,11 11,13 6,14 9,16 11,17 3,20 3,22 1,24 2,25 6,26 1,28 2,29 3,31 1,32 9,35 27.3,36 0.091,37 1,38 12.5,39 12.262,40 12.545,41 8.023,42 8.374,44 5}
{0 CHEMBL126519,1 7.301,2 45.8,3 45.8,4 1.001,5 1.113,6 0.671,7 0.639,8 350.44,10 17,11 48,13 18,14 28,16 50,17 22,20 17,21 5,22 1,24 22,25 4,29 4,32 26,35 8.3,36 0.1,37 5,38 37.5,39 48.029,40 53.405,41 32.193,42 30.654,44 4.398}
{0 CHEMBL127326,1 7.219,2 42.1,3 47.4,4 1.007,5 1.12,6 0.649,7 0.621,8 274.34,10 11,11 38,13 12,14 21,16 39,17 16,20 11,21 5,22 1,24 18,25 4,29 4,32 20,35 10.5,36 0.051,37 2,38 27.5,39 38.262,40 42.574,41 24.671,42 23.6,44 6}
{0 CHEMBL127327,1 7.437,2 42.9,3 45.7,4 1.011,5 1.119,6 0.655,7 0.631,8 260.31,10 11,11 35,13 12,14 20,16 36,17 15,20 11,21 4,22 1,24 16,25 4,29 4,32 19,35 11.4,36 0.083,37 3,38 26.5,39 35.378,40 39.159,41 22.909,42 22.074,44 5.222}
{0 CHEMBL127334,1 7.696,2 43.8,3 43.8,4 1.015,5 1.117,6 0.661,7 0.642,8 246.28,10 11,11 32,13 12,14 19,16 33,17 14,20 11,21 3,22 1,24 14,25 4,29 4,32 18,35 12.5,36 0.03,37 1,38 25.5,39 32.494,40 35.744,41 21.148,42 20.547,44 4.886}
{0 CHEMBL127645,1 8.009,2 44.8,3 41.4,4 1.021,5 1.115,6 0.668,7 0.656,8 232.25,10 11,11 29,13 12,14 18,16 30,17 13,20 11,21 2,22 1,24 12,25 4,29 4,32 17,35 13.8,36 0.033,37 1,38 24.5,39 29.611,40 32.329,41 19.386,42 19.02,44 4.658}
{0 CHEMBL15976,1 9.896,2 22.2,3 33.3,4 1.107,5 1.171,6 0.57,7 0.633,8 89.06,9 11.1,11 9,13 2,14 5,16 8,17 2,20 2,22 2,24 3,25 4,28 1,29 3,32 6,35 33.3,36 0.125,37 1,38 7,39 9.967,40 10.542,41 5.131,42 5.693,44 4.585}
{0 CHEMBL1688788,1 8.442,2 50,3 36.7,4 1.017,5 1.107,6 0.706,7 0.693,8 253.27,9 3.3,10 16,11 30,13 17,14 21,16 32,17 15,20 15,22 1,24 11,25 4,28 1,29 3,32 19,35 10,36 0.063,37 2,38 30,39 30.502,40 33.203,41 21.176,42 20.8,44 4.894}
{0 CHEMBL1688789,1 8.442,2 50,3 36.7,4 1.017,5 1.107,6 0.706,7 0.693,8 253.27,9 3.3,10 16,11 30,13 17,14 21,16 32,17 15,20 15,22 1,24 11,25 4,28 1,29 3,32 19,35 10,36 0.063,37 2,38 30,39 30.502,40 33.203,41 21.176,42 20.8,44 4.577}
{0 CHEMBL1688790,1 9.735,2 48.5,3 30.3,4 1.058,5 1.141,6 0.689,7 0.711,8 321.27,9 3,10 16,11 33,13 17,14 25,16 35,17 16,20 15,21 1,22 1,23 3,24 10,25 7,28 1,29 3,32 23,34 3,35 9.1,36 0.057,37 2,38 34,39 34.923,40 37.637,41 22.75,42 23.477,43 9.1,44 5.051}
{0 CHEMBL2058994,1 8.9,2 28,3 41.3,4 1.05,5 1.15,6 0.636,7 0.625,8 667.53,9 9.3,10 10,11 75,13 14,14 48,16 79,17 21,20 8,21 13,22 4,24 31,25 23,26 2,28 7,29 14,30 2,32 44,35 18.7,36 0.139,37 11,38 57,39 78.731,40 86.265,41 47.665,42 46.853,44 4.893}
{0 CHEMBL2059000,1 8.769,2 37.8,3 43.2,4 1.014,5 1.118,6 0.703,7 0.655,8 324.46,9 5.4,10 10,11 37,13 12,14 22,16 38,17 14,20 9,21 5,22 2,24 16,25 7,26 2,28 2,29 3,31 2,32 21,35 8.1,36 0.184,37 7,38 29,39 37.524,40 41.371,41 26,42 24.249,44 4.217}
{0 CHEMBL2059005,1 8.462,2 35,3 45,4 1.01,5 1.129,6 0.689,7 0.639,8 338.5,9 10,10 10,11 40,13 12,14 23,16 41,17 14,20 9,21 5,22 2,24 18,25 8,26 2,28 4,29 2,31 2,32 22,35 5,36 0.171,37 7,38 30,39 40.4,40 45.158,41 27.557,42 25.577,44 4.456}
{0 CHEMBL2059008,1 8.3,2 38.7,3 41.9,4 1.024,5 1.128,6 0.665,7 0.646,8 514.61,9 6.5,10 16,11 62,13 20,14 38,16 64,17 24,20 17,21 7,22 4,24 26,25 12,26 1,28 4,29 7,31 1,32 36,35 11.3,36 0.188,37 12,38 50,39 63.494,40 69.946,41 41.227,42 40.071,44 5.377}
{0 CHEMBL2059009,1 8.33,2 37.7,3 43.5,4 1.019,5 1.126,6 0.672,7 0.642,8 574.74,9 5.8,10 16,11 69,13 20,14 41,16 71,17 26,20 17,21 9,22 4,24 30,25 13,26 2,28 4,29 7,31 2,32 39,35 10.1,36 0.211,37 15,38 53,39 70.338,40 77.697,41 46.398,42 44.312,44 5.509}
{0 CHEMBL2059010,1 7.976,2 39,3 44.1,4 1.014,5 1.128,6 0.666,7 0.638,8 470.6,9 6.8,10 16,11 59,13 19,14 35,16 61,17 23,20 16,21 7,22 3,24 26,25 10,26 1,28 4,29 5,31 1,32 33,35 8.5,36 0.18,37 11,38 46,39 59.84,40 66.527,41 39.318,42 37.641,44 4.064}
{0 CHEMBL2059807,1 8.174,2 39.3,3 42.6,4 1.019,5 1.127,6 0.668,7 0.645,8 498.61,9 6.6,10 16,11 61,13 20,14 37,16 63,17 24,20 17,21 7,22 4,24 26,25 11,26 1,28 4,29 6,31 1,32 35,35 9.8,36 0.175,37 11,38 49,39 62.167,40 68.737,41 40.773,42 39.356,44 5.721}
{0 CHEMBL2059808,1 8.484,2 39,3 40.7,4 1.027,5 1.128,6 0.669,7 0.653,8 500.58,9 6.8,10 16,11 59,13 20,14 37,16 61,17 23,20 17,21 6,22 4,24 24,25 12,26 1,28 4,29 7,31 1,32 35,35 11.9,36 0.18,37 11,38 49,39 60.611,40 66.531,41 39.466,42 38.544,44 4.53}
{0 CHEMBL2059809,1 8.217,2 38.2,3 44.1,4 1.015,5 1.125,6 0.676,7 0.641,8 558.74,9 5.9,10 16,11 68,13 20,14 40,16 70,17 26,20 17,21 9,22 4,24 30,25 12,26 2,28 4,29 6,31 2,32 38,35 8.8,36 0.2,37 14,38 52,39 69.011,40 76.487,41 45.943,42 43.597,44 6.538}
{0 CHEMBL2059810,1 8.496,2 37.9,3 42.4,4 1.022,5 1.125,6 0.676,7 0.648,8 560.71,9 6.1,10 16,11 66,13 20,14 40,16 68,17 25,20 17,21 8,22 4,24 28,25 13,26 2,28 4,29 7,31 2,32 38,35 10.6,36 0.206,37 14,38 52,39 67.454,40 74.281,41 44.636,42 42.785,44 5.131}
{0 CHEMBL2059811,1 8.026,2 40.3,3 43.5,4 1.015,5 1.123,6 0.67,7 0.643,8 497.62,9 4.8,10 16,11 62,13 20,14 37,16 64,17 25,20 17,21 8,22 4,24 27,25 10,26 1,28 3,29 6,31 1,32 35,35 9.7,36 0.188,37 12,38 49,39 62.949,40 69.654,41 41.529,42 39.862,44 6.301}
{0 CHEMBL2059812,1 8.083,2 39.1,3 44.9,4 1.011,5 1.122,6 0.677,7 0.639,8 557.75,9 4.3,10 16,11 69,13 20,14 40,16 71,17 27,20 17,21 10,22 4,24 31,25 11,26 2,28 3,29 6,31 2,32 38,35 8.7,36 0.211,37 15,38 52,39 69.792,40 77.404,41 46.699,42 44.102,44 6.569}
{0 CHEMBL2316881,1 8.79,2 40,3 40,4 1.031,5 1.129,6 0.675,7 0.66,8 703.2,9 5,10 24,11 80,13 26,14 51,16 83,17 32,18 1,20 24,21 8,22 2,23 1,24 32,25 16,26 2,28 4,29 9,31 1,32 48,34 2,35 11.3,36 0.193,37 16,38 65,39 82.52,40 90.31,41 53.977,42 52.819,43 2.5,44 4.886}
{0 CHEMBL2316882,1 9.124,2 40.2,3 37.8,4 1.041,5 1.127,6 0.675,7 0.67,8 748.19,9 3.7,10 24,11 82,13 27,14 54,16 85,17 33,18 1,20 25,21 8,22 3,23 1,24 31,25 18,26 2,28 3,29 12,31 1,32 51,34 2,35 14.6,36 0.2,37 17,38 69,39 85.4,40 92.439,41 55.335,42 54.942,43 2.4,44 4.87}
{0 CHEMBL2316883,1 8.79,2 40,3 40,4 1.031,5 1.129,6 0.675,7 0.66,8 703.2,9 5,10 24,11 80,13 26,14 51,16 83,17 32,18 1,20 24,21 8,22 2,23 1,24 32,25 16,26 2,28 4,29 9,31 1,32 48,34 2,35 11.3,36 0.193,37 16,38 65,39 82.52,40 90.31,41 53.977,42 52.819,43 2.5,44 5.62}
{0 CHEMBL2316884,1 9.199,2 42.1,3 36.8,4 1.036,5 1.125,6 0.69,7 0.681,8 699.16,9 5.3,10 24,11 76,13 28,14 51,16 79,17 32,18 1,20 26,21 6,22 4,23 1,24 28,25 16,26 2,28 4,29 9,31 1,32 48,34 2,35 11.8,36 0.203,37 16,38 67,39 78.753,40 85.479,41 52.455,42 51.765,43 2.6,44 5.62}
{0 CHEMBL2316885,1 9.003,2 39.8,3 38.6,4 1.038,5 1.129,6 0.673,7 0.666,8 747.21,9 4.8,10 24,11 83,13 27,14 54,16 86,17 33,18 1,20 25,21 8,22 3,23 1,24 32,25 18,26 2,28 4,29 11,31 1,32 51,34 2,35 13.3,36 0.198,37 17,38 69,39 86.174,40 93.728,41 55.886,42 55.248,43 2.4,44 6.921}
{0 CHEMBL2316886,1 9.124,2 40.2,3 37.8,4 1.041,5 1.127,6 0.675,7 0.67,8 748.19,9 3.7,10 24,11 82,13 27,14 54,16 85,17 33,18 1,20 25,21 8,22 3,23 1,24 31,25 18,26 2,28 3,29 12,31 1,32 51,34 2,35 14.6,36 0.2,37 17,38 69,39 85.4,40 92.439,41 55.335,42 54.942,43 2.4,44 6.488}
{0 CHEMBL2316888,1 8.863,2 41.8,3 39.2,4 1.031,5 1.124,6 0.683,7 0.668,8 700.19,9 3.8,10 24,11 79,13 27,14 51,16 82,17 33,18 1,20 25,21 8,22 3,23 1,24 31,25 15,26 2,28 3,29 9,31 1,32 48,34 2,35 11.4,36 0.22,37 18,38 66,39 81.418,40 88.811,41 53.972,42 52.797,43 2.5,44 4.229}
{0 CHEMBL310405,1 7.437,2 42.9,3 45.7,4 1.011,5 1.119,6 0.655,7 0.631,8 260.31,10 11,11 35,13 12,14 20,16 36,17 15,20 11,21 4,22 1,24 16,25 4,29 4,32 19,35 11.4,36 0.056,37 2,38 26.5,39 35.378,40 39.159,41 22.909,42 22.074,44 5.699}
{0 CHEMBL338262,1 8.205,2 45.1,3 41.2,4 1.028,5 1.134,6 0.662,7 0.654,8 418.44,10 17,11 51,13 18,14 32,16 53,17 23,20 17,21 6,22 1,23 3,24 21,25 7,29 4,32 30,34 3,35 7.8,36 0.075,37 4,38 41.5,39 52.451,40 57.839,41 33.767,42 33.331,43 5.9,44 6.699}
{0 CHEMBL338325,1 7.219,2 42.1,3 47.4,4 1.007,5 1.12,6 0.649,7 0.621,8 274.34,10 11,11 38,13 12,14 21,16 39,17 16,20 11,21 5,22 1,24 18,25 4,29 4,32 20,35 10.5,36 0.077,37 3,38 27.5,39 38.262,40 42.574,41 24.671,42 23.6,44 7}
{0 CHEMBL341463,1 7.301,2 45.8,3 45.8,4 1.001,5 1.113,6 0.671,7 0.639,8 350.44,10 17,11 48,13 18,14 28,16 50,17 22,20 17,21 5,22 1,24 22,25 4,29 4,32 26,35 8.3,36 0.08,37 4,38 37.5,39 48.029,40 53.405,41 32.193,42 30.654,44 6.155}
{0 CHEMBL435995,1 7.676,2 47.6,3 42.9,4 1.006,5 1.109,6 0.683,7 0.657,8 322.38,10 17,11 42,13 18,14 26,16 44,17 20,20 17,21 3,22 1,24 18,25 4,29 4,32 24,35 9.5,36 0.068,37 3,38 35.5,39 42.262,40 46.574,41 28.671,42 27.6,44 5.097}
