"molecule_id","AMW","C.","H.","Me","Mi","Mp","Mv","MW","N.","nAB","nAT","nB","nBM","nBO","nBR","nBT","nC","nCL","nCsp","nCsp2","nCsp3","nDB","nF","nH","nHet","nHM","nI","nN","nO","nP","nS","nSK","nTB","nX","O.","RBF","RBN","SCBO","Se","Si","Sp","Sv","X.","pXC50"
{1 8.211,2 52.4,3 40.5,4 0.99,5 1.101,6 0.737,7 0.692,8 344.86,9 4.8,10 23,11 42,13 23,14 28,16 45,17 22,18 1,20 21,21 1,24 17,25 3,26 1,28 2,32 25,34 1,36 0.089,37 4,38 39.5,39 41.596,40 46.262,41 30.961,42 29.085,43 2.4,44 6.886}
{0 CHEMBL106,1 9.009,2 38.2,3 35.3,4 1.044,5 1.163,6 0.659,7 0.668,8 306.31,9 17.6,10 16,11 34,13 16,14 24,16 36,17 13,20 10,21 3,23 2,24 12,25 9,28 6,29 1,32 22,34 2,35 2.9,36 0.139,37 5,38 32,39 35.498,40 39.539,41 22.409,42 22.717,43 5.9,44 4.277}
{0 CHEMBL127685,1 8.82,2 42.9,3 33.3,4 1.019,5 1.138,6 0.704,7 0.697,8 185.21,9 23.8,10 11,11 21,13 13,14 15,16 22,17 9,20 9,22 2,24 7,25 5,28 5,32 14,36 0.091,37 2,38 22.5,39 21.393,40 23.907,41 14.79,42 14.634,44 4.602}
{0 CHEMBL127866,1 8.188,2 39.3,3 39.3,4 1.017,5 1.141,6 0.67,7 0.657,8 229.27,9 17.9,10 11,11 28,13 13,14 18,16 29,17 11,20 9,21 2,22 2,24 11,25 6,28 5,29 1,32 17,35 3.6,36 0.138,37 4,38 25.5,39 28.487,40 31.947,41 18.767,42 18.402,44 5.854}
{0 CHEMBL1306,1 7.948,2 38.8,3 46.3,4 1.008,5 1.132,6 0.668,7 0.631,8 532.52,9 7.5,10 17,11 67,13 17,14 40,16 71,17 26,18 2,20 14,21 12,24 31,25 10,26 2,28 5,29 3,32 36,34 2,35 4.5,36 0.113,37 8,38 48.5,39 67.509,40 75.821,41 44.767,42 42.282,43 3,44 5.523}
{0 CHEMBL225111,1 5.269,2 37,3 61.7,4 0.968,5 1.131,6 0.611,7 0.542,8 426.8,11 81,13 2,14 34,16 84,17 30,20 4,21 26,22 2,24 50,25 1,29 1,32 31,35 1.2,36 0.048,37 4,38 36,39 78.417,40 91.589,41 49.489,42 43.885,44 4.523}
{0 CHEMBL22587,1 8.112,2 40.2,3 43.7,4 1.01,5 1.131,6 0.675,7 0.645,8 705.71,9 9.2,10 23,11 87,13 25,14 55,16 93,17 35,18 2,20 22,21 13,22 2,24 38,25 14,26 2,28 8,29 4,32 49,34 2,35 4.6,36 0.118,37 11,38 68.5,39 87.909,40 98.355,41 58.762,42 56.114,43 2.3,44 5.444}
{0 CHEMBL258892,1 8.155,2 39.2,3 43.1,4 1.015,5 1.133,6 0.669,7 0.644,8 415.92,9 9.8,10 15,11 51,13 17,14 32,16 54,17 20,18 1,20 13,21 7,22 2,24 22,25 9,26 1,28 5,29 3,32 29,34 1,35 5.9,36 0.093,37 5,38 41.5,39 51.767,40 57.801,41 34.103,42 32.82,43 2,44 5.886}
{0 CHEMBL259288,1 8.035,2 41.8,3 43.6,4 1.012,5 1.124,6 0.674,7 0.646,8 441.95,9 5.5,10 16,11 55,13 18,14 34,16 58,17 23,18 1,20 16,21 7,22 2,24 24,25 8,26 1,28 3,29 4,32 31,34 1,35 7.3,36 0.086,37 5,38 44,39 55.658,40 61.844,41 37.068,42 35.546,43 1.8,44 5.602}
{0 CHEMBL259552,1 8.221,2 42.6,3 42.6,4 1.016,5 1.129,6 0.677,7 0.652,8 443.94,9 5.6,10 16,11 54,13 18,14 34,16 57,17 23,18 1,20 16,21 7,22 2,23 1,24 23,25 8,26 1,28 3,29 3,32 31,34 2,35 5.6,36 0.088,37 5,38 44,39 54.843,40 60.974,41 36.551,42 35.214,43 3.7,44 6.097}
{0 CHEMBL261013,1 8.055,2 41.5,3 43.4,4 1.01,5 1.127,6 0.677,7 0.648,8 426.94,9 7.5,10 16,11 53,13 18,14 33,16 56,17 22,18 1,20 15,21 7,22 2,24 23,25 8,26 1,28 4,29 3,32 30,34 1,35 5.7,36 0.089,37 5,38 43,39 53.549,40 59.717,41 35.858,42 34.326,43 1.9,44 4.585}
{0 CHEMBL261627,1 10.005,2 40,3 36.7,4 1.034,5 1.129,6 0.715,7 0.693,8 300.16,9 10,10 11,11 30,13 11,14 21,16 32,17 12,18 2,20 8,21 4,24 11,25 7,26 2,28 3,29 2,32 19,34 2,35 6.7,36 0.094,37 3,38 26.5,39 31.025,40 33.878,41 21.449,42 20.783,43 6.7,44 5}
{0 CHEMBL265700,1 7.862,2 41.4,3 44.8,4 1.009,5 1.125,6 0.669,7 0.639,8 455.98,9 5.2,10 16,11 58,13 18,14 35,16 61,17 24,18 1,20 16,21 8,22 2,24 26,25 8,26 1,28 3,29 4,32 32,34 1,35 6.9,36 0.098,37 6,38 45,39 58.542,40 65.259,41 38.83,42 37.072,43 1.7,44 5.347}
{0 CHEMBL277535,1 7.391,2 52.4,3 42.9,4 0.983,5 1.103,6 0.717,7 0.673,8 310.42,9 4.8,10 23,11 42,13 23,14 27,16 45,17 22,20 21,21 1,24 18,25 2,28 2,32 24,36 0.089,37 4,38 38.5,39 41.272,40 46.318,41 30.103,42 28.257,44 6.466}
{0 CHEMBL295698,1 8.304,2 40.6,3 43.8,4 1.013,5 1.127,6 0.679,7 0.648,8 531.48,9 6.3,10 17,11 64,13 18,14 40,16 68,17 26,18 2,20 16,21 10,22 1,24 28,25 10,26 2,28 4,29 4,32 36,34 2,35 6.3,36 0.103,37 7,38 49.5,39 64.851,40 72.116,41 43.455,42 41.448,43 3.1,44 6.84}
{0 CHEMBL305220,1 8.113,2 41.5,3 45.3,4 1.002,5 1.12,6 0.694,7 0.647,8 430.01,9 5.7,10 17,11 53,13 17,14 32,16 56,17 22,18 1,20 15,21 7,24 24,25 7,26 2,28 3,29 2,31 1,32 29,34 1,35 3.8,36 0.143,37 8,38 40.5,39 53.08,40 59.345,41 36.807,42 34.303,43 1.9,44 7.573}
{0 CHEMBL317410,1 7.888,2 42.6,3 44.4,4 1.006,5 1.123,6 0.678,7 0.645,8 425.95,9 5.6,10 16,11 54,13 18,14 33,16 57,17 23,18 1,20 16,21 7,22 2,24 24,25 7,26 1,28 3,29 3,32 30,34 1,35 5.6,36 0.088,37 5,38 43,39 54.331,40 60.634,41 36.614,42 34.831,43 1.9,44 5.509}
{0 CHEMBL339057,1 8.74,2 42.3,3 34.6,4 1.023,5 1.136,6 0.693,7 0.688,8 227.25,9 19.2,10 11,11 26,13 14,14 18,16 27,17 11,20 10,21 1,22 3,24 9,25 6,28 5,29 1,32 17,35 3.8,36 0.148,37 4,38 26.5,39 26.604,40 29.531,41 18.006,42 17.875,44 4.745}
{0 CHEMBL374478,1 7.035,2 36.8,3 49.6,4 1.01,5 1.134,6 0.624,7 0.597,8 823.05,9 3.4,10 11,11 117,13 18,14 63,16 121,17 43,20 20,21 23,22 7,24 58,25 16,28 4,29 12,32 59,35 10.3,36 0.041,37 5,38 75.5,39 118.192,40 132.716,41 73.035,42 69.887,44 4.523}
{0 CHEMBL386630,1 5.887,2 38.8,3 57.1,4 0.98,5 1.127,6 0.624,7 0.567,8 288.47,11 49,13 2,14 24,16 52,17 19,20 3,21 16,22 2,24 28,25 2,29 2,32 21,35 4.1,38 26,39 48.025,40 55.232,41 30.569,42 27.805,44 4.301}
{0 CHEMBL407132,1 9.741,2 50,3 35.3,4 1.014,5 1.105,6 0.757,7 0.723,8 331.21,9 5.9,10 18,11 34,13 18,14 24,16 36,17 17,18 2,20 16,21 1,24 12,25 5,26 2,28 2,29 1,32 22,34 2,35 2.9,36 0.083,37 3,38 33,39 34.48,40 37.585,41 25.75,42 24.573,43 5.9,44 5}
{0 CHEMBL409630,1 7.25,2 42.6,3 46.3,4 1,5 1.124,6 0.662,7 0.63,8 391.51,9 5.6,10 16,11 54,13 18,14 32,16 57,17 23,20 16,21 7,22 2,24 25,25 6,28 3,29 3,32 29,35 5.6,36 0.088,37 5,38 42,39 54.007,40 60.69,41 35.756,42 34.003,44 6.041}
{0 CHEMBL410134,1 7.888,2 42.6,3 44.4,4 1.006,5 1.123,6 0.678,7 0.645,8 425.95,9 5.6,10 16,11 54,13 18,14 33,16 57,17 23,18 1,20 16,21 7,22 2,24 24,25 7,26 1,28 3,29 3,32 30,34 1,35 5.6,36 0.088,37 5,38 43,39 54.331,40 60.634,41 36.614,42 34.831,43 1.9,44 4}
{0 CHEMBL410331,1 8.526,2 42.6,3 42.6,4 1.012,5 1.122,6 0.694,7 0.66,8 460.39,9 5.6,10 16,11 54,13 18,14 34,16 57,17 23,18 2,20 16,21 7,22 2,24 23,25 8,26 2,28 3,29 3,32 31,34 2,35 5.6,36 0.088,37 5,38 44,39 54.654,40 60.578,41 37.472,42 35.658,43 3.7,44 5.013}
{0 CHEMBL410851,1 7.583,2 42.6,3 44.4,4 1.01,5 1.13,6 0.661,7 0.637,8 409.5,9 5.6,10 16,11 54,13 18,14 33,16 57,17 23,20 16,21 7,22 2,23 1,24 24,25 7,28 3,29 3,32 30,34 1,35 5.6,36 0.088,37 5,38 43,39 54.52,40 61.03,41 35.694,42 34.387,43 1.9,44 4.125}
{0 CHEMBL410852,1 8.526,2 42.6,3 42.6,4 1.012,5 1.122,6 0.694,7 0.66,8 460.39,9 5.6,10 16,11 54,13 18,14 34,16 57,17 23,18 2,20 16,21 7,22 2,24 23,25 8,26 2,28 3,29 3,32 31,34 2,35 5.6,36 0.088,37 5,38 44,39 54.654,40 60.578,41 37.472,42 35.658,43 3.7,44 6.523}
{0 CHEMBL428079,1 7.645,2 39.2,3 47.1,4 1.006,5 1.13,6 0.659,7 0.624,8 389.92,9 5.9,10 10,11 51,13 12,14 30,16 54,17 20,18 1,20 10,21 10,22 2,24 24,25 7,26 1,28 3,29 3,32 27,34 1,35 5.9,36 0.056,37 3,38 37,39 51.331,40 57.634,41 33.614,42 31.831,43 2,44 4}
{0 CHEMBL447478,1 8.302,2 41.7,3 37.5,4 1.012,5 1.138,6 0.69,7 0.673,8 199.24,9 20.8,10 11,11 24,13 13,14 16,16 25,17 10,20 9,21 1,22 2,24 9,25 5,28 5,32 15,36 0.12,37 3,38 23.5,39 24.276,40 27.322,41 16.551,42 16.161,44 4.824}
{0 CHEMBL535872,1 6.559,2 43.1,3 51,4 0.983,5 1.121,6 0.659,7 0.609,8 334.5,9 3.9,10 17,11 51,13 17,14 27,16 53,17 22,20 15,21 7,24 26,25 3,28 2,29 1,32 25,35 2,36 0.151,37 8,38 35.5,39 50.134,40 57.188,41 33.603,42 31.079,44 6.469}
{0 CHEMBL537002,1 7.852,2 40,3 48.9,4 0.998,5 1.126,6 0.679,7 0.627,8 353.32,9 4.4,10 12,11 45,13 12,14 24,16 46,17 18,18 2,20 11,21 7,24 22,25 5,26 2,28 2,29 1,32 23,34 2,35 2.2,36 0.174,37 8,38 30,39 44.898,40 50.661,41 30.557,42 28.207,43 4.4,44 6.398}
{0 CHEMBL537003,1 6.5,2 37.7,3 52.8,4 0.994,5 1.132,6 0.628,7 0.586,8 344.5,9 3.8,10 12,11 53,13 12,14 26,16 54,17 20,20 11,21 9,24 28,25 5,28 2,29 3,32 25,35 5.7,36 0.185,37 10,38 32,39 52.672,40 60.022,41 33.273,42 31.036,44 4.535}
{0 CHEMBL537231,1 7.086,2 40,3 51.1,4 0.991,5 1.127,6 0.66,7 0.608,8 318.88,9 4.4,10 12,11 45,13 12,14 23,16 46,17 18,18 1,20 11,21 7,24 23,25 4,26 1,28 2,29 1,32 22,34 1,35 2.2,36 0.174,37 8,38 29,39 44.574,40 50.717,41 29.699,42 27.38,43 2.2,44 4.456}
{0 CHEMBL557376,1 7.12,2 40,3 48.9,4 1.006,5 1.143,6 0.638,7 0.607,8 320.42,9 4.4,10 12,11 45,13 12,14 24,16 46,17 18,20 11,21 7,23 2,24 22,25 5,28 2,29 1,32 23,34 2,35 2.2,36 0.174,37 8,38 30,39 45.276,40 51.453,41 28.716,42 27.319,43 4.4,44 4.569}
{0 CHEMBL558189,1 7.086,2 40,3 51.1,4 0.991,5 1.127,6 0.66,7 0.608,8 318.88,9 4.4,10 12,11 45,13 12,14 23,16 46,17 18,18 1,20 11,21 7,24 23,25 4,26 1,28 2,29 1,32 22,34 1,35 2.2,36 0.174,37 8,38 29,39 44.574,40 50.717,41 29.699,42 27.38,43 2.2,44 5.481}
{0 CHEMBL562,1 8.605,2 41.5,3 41.5,4 1.03,5 1.12,6 0.669,7 0.655,8 352.79,10 6,11 41,13 9,14 26,16 43,17 17,18 1,20 10,21 7,22 3,24 17,25 7,26 1,29 6,32 24,34 1,35 14.6,36 0.07,37 3,38 32,39 42.24,40 45.937,41 27.438,42 26.858,43 2.4,44 4.301}
{0 CHEMBL808,1 9.787,2 46.2,3 38.5,4 1.015,5 1.112,6 0.747,7 0.704,8 381.7,9 5.1,10 17,11 39,13 17,14 26,16 41,17 18,18 3,20 15,21 3,24 15,25 6,26 3,28 2,29 1,32 24,34 3,35 2.6,36 0.146,37 6,38 34.5,39 39.571,40 43.36,41 29.131,42 27.455,43 7.7,44 7.301}
{0 CHEMBL83668,1 7.883,2 48.7,3 43.6,4 0.989,5 1.101,6 0.723,7 0.67,8 307.44,9 2.6,10 17,11 39,13 18,14 24,16 41,17 19,20 17,21 2,22 1,24 17,25 3,26 1,28 1,29 1,31 1,32 22,35 2.6,36 0.073,37 3,38 33.5,39 38.574,40 42.949,41 28.199,42 26.138,44 4.301}
{0 CHEMBL91,1 10.67,2 46.2,3 35.9,4 1.023,5 1.11,6 0.769,7 0.725,8 416.14,9 5.1,10 17,11 39,13 17,14 27,16 41,17 18,18 4,20 15,21 3,24 14,25 7,26 4,28 2,29 1,32 25,34 4,35 2.6,36 0.146,37 6,38 35.5,39 39.895,40 43.304,41 29.989,42 28.282,43 10.3,44 6.699}
{0 CHEMBL99889,1 8.221,2 42.6,3 42.6,4 1.016,5 1.129,6 0.677,7 0.652,8 443.94,9 5.6,10 16,11 54,13 18,14 34,16 57,17 23,18 1,20 16,21 7,22 2,23 1,24 23,25 8,26 1,28 3,29 3,32 31,34 2,35 5.6,36 0.088,37 5,38 44,39 54.843,40 60.974,41 36.551,42 35.214,43 3.7,44 5.398}
