{
  "data_set_description": {
    "collection_date": "November 2013",
    "creator": "Dr Jeremy Besnard, Dr Ivan Olier, Dr Noureddin Sadawi, Dr Larisa Soldatova, Dr Crina Grosan, Prof Ross King, Dr Richard Bickerton, Prof Andrew Hopkins and Dr Willem van Hoorn",
    "default_target_attribute": "pXC50",
    "description": "This dataset contains QSAR data (from ChEMBL version 17) showing activity values (unit is pseudo-pCI50) of several compounds on drug target ChEMBL_ID: CHEMBL2714 (TID: CHEMBL2714), and it has 226 rows and 43 features (including IDs and class feature: molecule_id and pXC50). The features represent Molecular Descriptors which were generated from SMILES strings (with imputation of missing values if they exist).",
    "description_version": "1",
    "file_id": "1859486",
    "format": "ARFF",
    "id": "6361",
    "licence": "Public",
    "md5_checksum": "00513f3babec9bc46d2c768997fe3434",
    "minio_url": "https://data.openml.org/datasets/0000/6361/dataset_6361.pq",
    "name": "QSAR-DATASET-FOR-DRUG-TARGET-CHEMBL2714",
    "original_data_url": "https://www.ebi.ac.uk/chembl/target/inspect/CHEMBL2714",
    "parquet_url": "https://data.openml.org/datasets/0000/6361/dataset_6361.pq",
    "processing_date": "2018-10-03 22:32:41",
    "row_id_attribute": "molecule_id",
    "status": "deactivated",
    "tag": "MetaQSAR",
    "upload_date": "2016-04-04T17:37:36",
    "url": "https://api.openml.org/data/v1/download/1859486/QSAR-DATASET-FOR-DRUG-TARGET-CHEMBL2714.arff",
    "version": "1",
    "visibility": "public"
  }
}